EESchema Schematic File Version 4
LIBS:ui-hw-cache
EELAYER 26 0
EELAYER END
$Descr A4 11693 8268
encoding utf-8
Sheet 1 1
Title ""
Date ""
Rev ""
Comp ""
Comment1 ""
Comment2 ""
Comment3 ""
Comment4 ""
$EndDescr
$Comp
L ui-hw-rescue:CONN_01X04 P2
U 1 1 5B267A64
P 1900 3650
F 0 "P2" H 1900 3900 50  0000 C CNN
F 1 "ext" V 2000 3650 50  0000 C CNN
F 2 "Connectors_Molex.pretty:Molex_KK-6410-04_04x2.54mm_Straight" H 1900 3650 50  0001 C CNN
F 3 "" H 1900 3650 50  0000 C CNN
	1    1900 3650
	1    0    0    1   
$EndComp
$Comp
L power:+24V #PWR01
U 1 1 5B26875E
P 1600 3400
F 0 "#PWR01" H 1600 3250 50  0001 C CNN
F 1 "+24V" H 1600 3540 50  0000 C CNN
F 2 "" H 1600 3400 50  0000 C CNN
F 3 "" H 1600 3400 50  0000 C CNN
	1    1600 3400
	1    0    0    -1  
$EndComp
$Comp
L power:GND #PWR02
U 1 1 5B2687C6
P 1450 3500
F 0 "#PWR02" H 1450 3250 50  0001 C CNN
F 1 "GND" H 1450 3350 50  0000 C CNN
F 2 "" H 1450 3500 50  0000 C CNN
F 3 "" H 1450 3500 50  0000 C CNN
	1    1450 3500
	-1   0    0    1   
$EndComp
Wire Wire Line
	1600 3400 1600 3500
Wire Wire Line
	1600 3500 1700 3500
Wire Wire Line
	1450 3500 1450 3600
Wire Wire Line
	1450 3600 1700 3600
$Comp
L ui-hw-rescue:R R1
U 1 1 5B375576
P 3100 3250
F 0 "R1" V 3180 3250 50  0000 C CNN
F 1 "10k" V 3100 3250 50  0000 C CNN
F 2 "Resistors_THT.pretty:R_Axial_DIN0204_L3.6mm_D1.6mm_P2.54mm_Vertical" V 3030 3250 50  0001 C CNN
F 3 "" H 3100 3250 50  0000 C CNN
	1    3100 3250
	1    0    0    -1  
$EndComp
$Comp
L ui-hw-rescue:R R2
U 1 1 5B375629
P 3100 3750
F 0 "R2" V 3180 3750 50  0000 C CNN
F 1 "1k" V 3100 3750 50  0000 C CNN
F 2 "Resistors_THT.pretty:R_Axial_DIN0204_L3.6mm_D1.6mm_P2.54mm_Vertical" V 3030 3750 50  0001 C CNN
F 3 "" H 3100 3750 50  0000 C CNN
	1    3100 3750
	-1   0    0    1   
$EndComp
$Comp
L power:+24V #PWR03
U 1 1 5B37569D
P 3100 3000
F 0 "#PWR03" H 3100 2850 50  0001 C CNN
F 1 "+24V" H 3100 3140 50  0000 C CNN
F 2 "" H 3100 3000 50  0000 C CNN
F 3 "" H 3100 3000 50  0000 C CNN
	1    3100 3000
	1    0    0    -1  
$EndComp
$Comp
L power:GND #PWR04
U 1 1 5B3756C3
P 3100 4000
F 0 "#PWR04" H 3100 3750 50  0001 C CNN
F 1 "GND" H 3100 3850 50  0000 C CNN
F 2 "" H 3100 4000 50  0000 C CNN
F 3 "" H 3100 4000 50  0000 C CNN
	1    3100 4000
	1    0    0    -1  
$EndComp
Wire Wire Line
	3100 3900 3100 4000
Wire Wire Line
	3100 3400 3100 3500
Wire Wire Line
	3100 3000 3100 3100
Text GLabel 2900 3500 0    60   Input ~ 0
24V-Sense
Wire Wire Line
	2900 3500 3100 3500
Connection ~ 3100 3500
$Comp
L ui-hw-rescue:TRIAC U2
U 1 1 5B5741CB
P 4000 1550
F 0 "U2" H 3750 1900 50  0000 C CNN
F 1 "BTA24BW" H 3700 1300 50  0000 C CNN
F 2 "TO_SOT_Packages_THT.pretty:TO-220-3_Horizontal" H 4000 1550 50  0001 C CNN
F 3 "" H 4000 1550 50  0000 C CNN
	1    4000 1550
	1    0    0    -1  
$EndComp
$Comp
L ui-hw-rescue:MOC3063M U1
U 1 1 5B574234
P 2900 1250
F 0 "U1" H 2700 1450 50  0000 L CNN
F 1 "MOC3063M" H 2900 1450 50  0000 L CNN
F 2 "Housings_DIP.pretty:DIP-6_W7.62mm" H 2600 1550 50  0000 L CIN
F 3 "" H 2890 1250 50  0000 L CNN
	1    2900 1250
	1    0    0    -1  
$EndComp
$Comp
L ui-hw-rescue:R R6
U 1 1 5B5745A1
P 3500 1150
F 0 "R6" V 3580 1150 50  0000 C CNN
F 1 "330/1W" V 3400 1150 50  0000 C CNN
F 2 "Resistors_THT.pretty:R_Axial_DIN0204_L3.6mm_D1.6mm_P2.54mm_Vertical" V 3430 1150 50  0001 C CNN
F 3 "" H 3500 1150 50  0000 C CNN
	1    3500 1150
	0    1    1    0   
$EndComp
Wire Wire Line
	3350 1150 3200 1150
Wire Wire Line
	3200 1350 3200 1750
Wire Wire Line
	3200 1750 3500 1750
Wire Wire Line
	3650 1150 4000 1150
Connection ~ 4000 1150
$Comp
L ui-hw-rescue:Q_NPN_CBE Q1
U 1 1 5B574F30
P 2350 2100
F 0 "Q1" H 2650 2150 50  0000 R CNN
F 1 "BC547" H 2750 2000 50  0000 R CNN
F 2 "TO_SOT_Packages_THT.pretty:TO-92_Inline_Narrow_Oval" H 2550 2200 50  0001 C CNN
F 3 "" H 2350 2100 50  0000 C CNN
	1    2350 2100
	1    0    0    -1  
$EndComp
$Comp
L power:GND #PWR05
U 1 1 5B574FE1
P 2450 2500
F 0 "#PWR05" H 2450 2250 50  0001 C CNN
F 1 "GND" H 2450 2350 50  0000 C CNN
F 2 "" H 2450 2500 50  0000 C CNN
F 3 "" H 2450 2500 50  0000 C CNN
	1    2450 2500
	1    0    0    -1  
$EndComp
Wire Wire Line
	2450 2500 2450 2300
Wire Wire Line
	2450 1350 2600 1350
Wire Wire Line
	2450 950  2450 1150
Wire Wire Line
	2450 1150 2600 1150
$Comp
L ui-hw-rescue:R R5
U 1 1 5B5751F1
P 2450 1600
F 0 "R5" V 2530 1600 50  0000 C CNN
F 1 "200" V 2450 1600 50  0000 C CNN
F 2 "Resistors_THT.pretty:R_Axial_DIN0204_L3.6mm_D1.6mm_P2.54mm_Vertical" V 2380 1600 50  0001 C CNN
F 3 "" H 2450 1600 50  0000 C CNN
	1    2450 1600
	1    0    0    -1  
$EndComp
Wire Wire Line
	2450 1350 2450 1450
Wire Wire Line
	2450 1750 2450 1900
$Comp
L ui-hw-rescue:R R4
U 1 1 5B5754B2
P 1900 2100
F 0 "R4" V 1980 2100 50  0000 C CNN
F 1 "3k3" V 1900 2100 50  0000 C CNN
F 2 "Resistors_THT.pretty:R_Axial_DIN0204_L3.6mm_D1.6mm_P2.54mm_Vertical" V 1830 2100 50  0001 C CNN
F 3 "" H 1900 2100 50  0000 C CNN
	1    1900 2100
	0    1    1    0   
$EndComp
Wire Wire Line
	2050 2100 2150 2100
Text GLabel 1350 2100 0    60   Input ~ 0
24V-Enable
Wire Wire Line
	1350 2100 1700 2100
$Comp
L ui-hw-rescue:CONN_01X02 P1
U 1 1 5B5776BC
P 3800 3400
F 0 "P1" H 3800 3550 50  0000 C CNN
F 1 "24V" V 3900 3400 50  0000 C CNN
F 2 "Connectors_Molex.pretty:Molex_KK-6410-02_02x2.54mm_Straight" H 3800 3400 50  0001 C CNN
F 3 "" H 3800 3400 50  0000 C CNN
	1    3800 3400
	1    0    0    -1  
$EndComp
$Comp
L power:GND #PWR06
U 1 1 5B577739
P 3600 3550
F 0 "#PWR06" H 3600 3300 50  0001 C CNN
F 1 "GND" H 3600 3400 50  0000 C CNN
F 2 "" H 3600 3550 50  0000 C CNN
F 3 "" H 3600 3550 50  0000 C CNN
	1    3600 3550
	1    0    0    -1  
$EndComp
$Comp
L power:+24V #PWR07
U 1 1 5B57777B
P 3600 3250
F 0 "#PWR07" H 3600 3100 50  0001 C CNN
F 1 "+24V" H 3600 3390 50  0000 C CNN
F 2 "" H 3600 3250 50  0000 C CNN
F 3 "" H 3600 3250 50  0000 C CNN
	1    3600 3250
	1    0    0    -1  
$EndComp
Wire Wire Line
	3600 3250 3600 3350
Wire Wire Line
	3600 3450 3600 3550
$Comp
L power:+5V #PWR08
U 1 1 5B86F077
P 2450 950
F 0 "#PWR08" H 2450 800 50  0001 C CNN
F 1 "+5V" H 2450 1090 50  0000 C CNN
F 2 "" H 2450 950 50  0000 C CNN
F 3 "" H 2450 950 50  0000 C CNN
	1    2450 950 
	1    0    0    -1  
$EndComp
$Comp
L ui-hw-rescue:R R3
U 1 1 5B86E382
P 1700 2350
F 0 "R3" V 1780 2350 50  0000 C CNN
F 1 "10k" V 1700 2350 50  0000 C CNN
F 2 "Resistors_THT.pretty:R_Axial_DIN0204_L3.6mm_D1.6mm_P2.54mm_Vertical" V 1630 2350 50  0001 C CNN
F 3 "" H 1700 2350 50  0000 C CNN
	1    1700 2350
	1    0    0    -1  
$EndComp
Wire Wire Line
	1700 2200 1700 2100
Connection ~ 1700 2100
$Comp
L power:GND #PWR09
U 1 1 5B86E3E6
P 1700 2600
F 0 "#PWR09" H 1700 2350 50  0001 C CNN
F 1 "GND" H 1700 2450 50  0000 C CNN
F 2 "" H 1700 2600 50  0000 C CNN
F 3 "" H 1700 2600 50  0000 C CNN
	1    1700 2600
	1    0    0    -1  
$EndComp
Wire Wire Line
	1700 2600 1700 2500
Text GLabel 1500 3700 0    60   Input ~ 0
TX
Text GLabel 1250 3800 0    60   Input ~ 0
RX
Wire Wire Line
	1250 3800 1700 3800
Wire Wire Line
	1700 3700 1500 3700
$Comp
L ui-hw-rescue:CONN_01X02 P4
U 1 1 5B86E97B
P 4600 3400
F 0 "P4" H 4600 3550 50  0000 C CNN
F 1 "5V" V 4700 3400 50  0000 C CNN
F 2 "Connectors_Molex.pretty:Molex_KK-6410-02_02x2.54mm_Straight" H 4600 3400 50  0001 C CNN
F 3 "" H 4600 3400 50  0000 C CNN
	1    4600 3400
	1    0    0    -1  
$EndComp
$Comp
L power:+5V #PWR010
U 1 1 5B86EA30
P 4400 3250
F 0 "#PWR010" H 4400 3100 50  0001 C CNN
F 1 "+5V" H 4400 3390 50  0000 C CNN
F 2 "" H 4400 3250 50  0000 C CNN
F 3 "" H 4400 3250 50  0000 C CNN
	1    4400 3250
	1    0    0    -1  
$EndComp
Wire Wire Line
	4400 3250 4400 3350
$Comp
L power:GND #PWR011
U 1 1 5B86EA9A
P 4400 3550
F 0 "#PWR011" H 4400 3300 50  0001 C CNN
F 1 "GND" H 4400 3400 50  0000 C CNN
F 2 "" H 4400 3550 50  0000 C CNN
F 3 "" H 4400 3550 50  0000 C CNN
	1    4400 3550
	1    0    0    -1  
$EndComp
Wire Wire Line
	4400 3550 4400 3450
$Comp
L power:GND #PWR012
U 1 1 5B86ED22
P 5250 6000
F 0 "#PWR012" H 5250 5750 50  0001 C CNN
F 1 "GND" H 5250 5850 50  0000 C CNN
F 2 "" H 5250 6000 50  0000 C CNN
F 3 "" H 5250 6000 50  0000 C CNN
	1    5250 6000
	1    0    0    -1  
$EndComp
$Comp
L power:GND #PWR013
U 1 1 5B86EE38
P 4100 6300
F 0 "#PWR013" H 4100 6050 50  0001 C CNN
F 1 "GND" H 4100 6150 50  0000 C CNN
F 2 "" H 4100 6300 50  0000 C CNN
F 3 "" H 4100 6300 50  0000 C CNN
	1    4100 6300
	1    0    0    -1  
$EndComp
$Comp
L ui-hw-rescue:R R8
U 1 1 5B86EEC0
P 5500 5000
F 0 "R8" V 5580 5000 50  0000 C CNN
F 1 "330" V 5500 5000 50  0000 C CNN
F 2 "Resistors_THT.pretty:R_Axial_DIN0204_L3.6mm_D1.6mm_P2.54mm_Vertical" V 5430 5000 50  0001 C CNN
F 3 "" H 5500 5000 50  0000 C CNN
	1    5500 5000
	0    -1   -1   0   
$EndComp
$Comp
L power:+5V #PWR014
U 1 1 5B86EEFB
P 5750 5000
F 0 "#PWR014" H 5750 4850 50  0001 C CNN
F 1 "+5V" H 5750 5140 50  0000 C CNN
F 2 "" H 5750 5000 50  0000 C CNN
F 3 "" H 5750 5000 50  0000 C CNN
	1    5750 5000
	0    1    1    0   
$EndComp
Wire Wire Line
	5750 5000 5650 5000
$Comp
L power:+24V #PWR015
U 1 1 5B86F0A7
P 5800 5700
F 0 "#PWR015" H 5800 5550 50  0001 C CNN
F 1 "+24V" H 5800 5840 50  0000 C CNN
F 2 "" H 5800 5700 50  0000 C CNN
F 3 "" H 5800 5700 50  0000 C CNN
	1    5800 5700
	0    1    1    0   
$EndComp
$Comp
L ui-hw-rescue:R R7
U 1 1 5B86F0F3
P 5500 5700
F 0 "R7" V 5580 5700 50  0000 C CNN
F 1 "2k2" V 5500 5700 50  0000 C CNN
F 2 "Resistors_THT.pretty:R_Axial_DIN0204_L3.6mm_D1.6mm_P2.54mm_Vertical" V 5430 5700 50  0001 C CNN
F 3 "" H 5500 5700 50  0000 C CNN
	1    5500 5700
	0    -1   -1   0   
$EndComp
Wire Wire Line
	5650 5700 5800 5700
Wire Wire Line
	4150 5000 4200 5000
$Comp
L power:+5V #PWR016
U 1 1 5B86F4FD
P 1750 5100
F 0 "#PWR016" H 1750 4950 50  0001 C CNN
F 1 "+5V" H 1750 5240 50  0000 C CNN
F 2 "" H 1750 5100 50  0000 C CNN
F 3 "" H 1750 5100 50  0000 C CNN
	1    1750 5100
	0    -1   -1   0   
$EndComp
Wire Wire Line
	1750 5100 3150 5100
$Comp
L ui-hw-rescue:ZENER D5
U 1 1 5B86F59B
P 3150 6000
F 0 "D5" H 3150 6100 50  0000 C CNN
F 1 "10V" H 3700 6000 50  0000 C CNN
F 2 "Discret.pretty:D4" H 3150 6000 50  0001 C CNN
F 3 "" H 3150 6000 50  0000 C CNN
	1    3150 6000
	0    1    1    0   
$EndComp
$Comp
L ui-hw-rescue:ZENER D4
U 1 1 5B86F677
P 2950 6000
F 0 "D4" H 2950 6100 50  0000 C CNN
F 1 "10V" H 3500 6000 50  0000 C CNN
F 2 "Discret.pretty:D4" H 2950 6000 50  0001 C CNN
F 3 "" H 2950 6000 50  0000 C CNN
	1    2950 6000
	0    1    1    0   
$EndComp
$Comp
L ui-hw-rescue:ZENER D3
U 1 1 5B86F798
P 2750 6000
F 0 "D3" H 2750 6100 50  0000 C CNN
F 1 "10V" H 3300 6000 50  0000 C CNN
F 2 "Discret.pretty:D4" H 2750 6000 50  0001 C CNN
F 3 "" H 2750 6000 50  0000 C CNN
	1    2750 6000
	0    1    1    0   
$EndComp
$Comp
L ui-hw-rescue:ZENER D2
U 1 1 5B86F79E
P 2550 6000
F 0 "D2" H 2550 6100 50  0000 C CNN
F 1 "10V" H 3100 6000 50  0000 C CNN
F 2 "Discret.pretty:D4" H 2550 6000 50  0001 C CNN
F 3 "" H 2550 6000 50  0000 C CNN
	1    2550 6000
	0    1    1    0   
$EndComp
$Comp
L ui-hw-rescue:ZENER D1
U 1 1 5B86F924
P 2350 6000
F 0 "D1" H 2350 6100 50  0000 C CNN
F 1 "10V" H 2900 6000 50  0000 C CNN
F 2 "Discret.pretty:D4" H 2350 6000 50  0001 C CNN
F 3 "" H 2350 6000 50  0000 C CNN
	1    2350 6000
	0    1    1    0   
$EndComp
Wire Wire Line
	3150 5800 3150 5100
Connection ~ 3150 5100
Wire Wire Line
	3150 6300 3150 6200
Wire Wire Line
	2950 6300 2950 6200
Connection ~ 3150 6300
Wire Wire Line
	2750 6300 2750 6200
Connection ~ 2950 6300
Wire Wire Line
	2550 6300 2550 6200
Connection ~ 2750 6300
Wire Wire Line
	2350 6300 2350 6200
Connection ~ 2550 6300
Text GLabel 2150 5200 0    60   Input ~ 0
24V-Sense
Text GLabel 2150 5300 0    60   Input ~ 0
24V-Enable
Text GLabel 2150 5500 0    60   Input ~ 0
TX
Text GLabel 2150 5600 0    60   Input ~ 0
RX
Wire Wire Line
	4200 5200 2950 5200
Wire Wire Line
	4200 5300 2750 5300
Wire Wire Line
	4200 5500 2550 5500
Wire Wire Line
	4200 5600 2350 5600
Wire Wire Line
	2950 5200 2950 5800
Connection ~ 2950 5200
Wire Wire Line
	2750 5800 2750 5300
Connection ~ 2750 5300
Connection ~ 2550 5500
Connection ~ 2350 5600
Wire Wire Line
	4150 5000 4150 5100
Connection ~ 4150 5100
$Comp
L ui-hw-rescue:RJ45_LEDS J1
U 1 1 5B8712E5
P 4700 5400
F 0 "J1" H 4700 4900 50  0000 C CNN
F 1 "RJ45_LEDS" H 4700 5800 50  0000 C CNN
F 2 "Connectors.pretty:RJHSE538X" H 4700 5350 50  0001 C CNN
F 3 "" H 4700 5350 50  0000 C CNN
	1    4700 5400
	0    1    1    0   
$EndComp
Wire Wire Line
	5350 5000 5200 5000
Wire Wire Line
	5350 5700 5200 5700
Wire Wire Line
	5250 5100 5250 5800
Wire Wire Line
	5250 5800 5200 5800
Wire Wire Line
	5250 5100 5200 5100
Connection ~ 5250 5800
Wire Wire Line
	4100 6300 4100 5800
Wire Wire Line
	4100 5800 4200 5800
Wire Wire Line
	4100 5700 4200 5700
Connection ~ 4100 5800
Wire Wire Line
	2350 6300 2550 6300
Wire Wire Line
	2550 5500 2550 5800
Wire Wire Line
	2350 5600 2350 5800
$Comp
L ui-hw-rescue:CONN_01X03 P3
U 1 1 5B8727A8
P 5400 1250
F 0 "P3" H 5400 1450 50  0000 C CNN
F 1 "Live" V 5500 1250 50  0000 C CNN
F 2 "TerminalBlock_Philmore.pretty:TerminalBlock_Philmore_TB133_03x5mm_Straight" H 5400 1250 50  0001 C CNN
F 3 "" H 5400 1250 50  0000 C CNN
	1    5400 1250
	1    0    0    -1  
$EndComp
$Comp
L ui-hw-rescue:CONN_01X03 P5
U 1 1 5B87280F
P 5400 1700
F 0 "P5" H 5400 1900 50  0000 C CNN
F 1 "Neutral" V 5500 1700 50  0000 C CNN
F 2 "TerminalBlock_Philmore.pretty:TerminalBlock_Philmore_TB133_03x5mm_Straight" H 5400 1700 50  0001 C CNN
F 3 "" H 5400 1700 50  0000 C CNN
	1    5400 1700
	1    0    0    -1  
$EndComp
$Comp
L ui-hw-rescue:CONN_01X03 P6
U 1 1 5B872858
P 5400 2150
F 0 "P6" H 5400 2350 50  0000 C CNN
F 1 "Earth" V 5500 2150 50  0000 C CNN
F 2 "TerminalBlock_Philmore.pretty:TerminalBlock_Philmore_TB133_03x5mm_Straight" H 5400 2150 50  0001 C CNN
F 3 "" H 5400 2150 50  0000 C CNN
	1    5400 2150
	1    0    0    -1  
$EndComp
$Comp
L power:GND #PWR017
U 1 1 5B872A83
P 5200 2350
F 0 "#PWR017" H 5200 2100 50  0001 C CNN
F 1 "GND" H 5200 2200 50  0000 C CNN
F 2 "" H 5200 2350 50  0000 C CNN
F 3 "" H 5200 2350 50  0000 C CNN
	1    5200 2350
	1    0    0    -1  
$EndComp
Text Label 4900 1150 0    60   ~ 0
L
Text Label 3200 1750 0    60   ~ 0
Triac-gate
Text Label 3250 1150 0    60   ~ 0
LR
Wire Wire Line
	5200 2050 5200 2150
Connection ~ 5200 2150
Connection ~ 5200 2250
Wire Wire Line
	5200 1600 5200 1700
Connection ~ 5200 1700
Wire Wire Line
	4650 1350 4650 1800
Wire Wire Line
	4650 1800 4000 1800
Wire Wire Line
	5200 1250 5200 1350
Wire Wire Line
	5200 1350 4650 1350
Text Notes 5600 1400 0    60   ~ 0
Live 24V PSU\nLive 5V PSU\nLive in
Text Notes 5600 1800 0    60   ~ 0
Neutral 24V PSU\nNeutral 5V PSU\nNeutral in
Text Notes 5600 2300 0    60   ~ 0
PE 24V PSU\nPE Case\nPE In
Connection ~ 5200 1350
Wire Wire Line
	3100 3500 3100 3600
Wire Wire Line
	4000 1150 5200 1150
Wire Wire Line
	1700 2100 1750 2100
Wire Wire Line
	3150 5100 4150 5100
Wire Wire Line
	3150 6300 4100 6300
Wire Wire Line
	2950 6300 3150 6300
Wire Wire Line
	2750 6300 2950 6300
Wire Wire Line
	2550 6300 2750 6300
Wire Wire Line
	2950 5200 2150 5200
Wire Wire Line
	2750 5300 2150 5300
Wire Wire Line
	2550 5500 2150 5500
Wire Wire Line
	2350 5600 2150 5600
Wire Wire Line
	4150 5100 4200 5100
Wire Wire Line
	5250 5800 5250 6000
Wire Wire Line
	4100 5800 4100 5700
Wire Wire Line
	5200 2150 5200 2250
Wire Wire Line
	5200 2250 5200 2350
Wire Wire Line
	5200 1700 5200 1800
$EndSCHEMATC
