EESchema Schematic File Version 4
LIBS:shutterizer-cache
EELAYER 26 0
EELAYER END
$Descr A4 11693 8268
encoding utf-8
Sheet 1 1
Title ""
Date ""
Rev ""
Comp ""
Comment1 ""
Comment2 ""
Comment3 ""
Comment4 ""
$EndDescr
$Comp
L promicro:promicro M1
U 1 1 5B266749
P 2700 1300
F 0 "M1" H 3050 -1050 60  0000 C CNN
F 1 "promicro" H 3050 1450 60  0000 C CNN
F 2 "Housings_DIP.pretty:DIP-24_W15.24mm" H 2700 1600 60  0001 C CNN
F 3 "" H 2700 1600 60  0000 C CNN
	1    2700 1300
	1    0    0    -1  
$EndComp
$Comp
L shutterizer-rescue:CONN_01X04 P5
U 1 1 5B26793A
P 5800 4450
F 0 "P5" H 5800 4700 50  0000 C CNN
F 1 "H-Bridge" V 5900 4450 50  0000 C CNN
F 2 "Connectors_Molex.pretty:Molex_KK-6410-04_04x2.54mm_Straight" H 5800 4450 50  0001 C CNN
F 3 "" H 5800 4450 50  0000 C CNN
	1    5800 4450
	1    0    0    1   
$EndComp
$Comp
L shutterizer-rescue:CONN_01X04 P2
U 1 1 5B267A64
P 4600 4450
F 0 "P2" H 4600 4700 50  0000 C CNN
F 1 "ext" V 4700 4450 50  0000 C CNN
F 2 "Connectors_Molex.pretty:Molex_KK-6410-04_04x2.54mm_Straight" H 4600 4450 50  0001 C CNN
F 3 "" H 4600 4450 50  0000 C CNN
	1    4600 4450
	1    0    0    1   
$EndComp
$Comp
L shutterizer-rescue:CONN_01X04 P3
U 1 1 5B267AE3
P 4600 1500
F 0 "P3" H 4600 1750 50  0000 C CNN
F 1 "DC/DC" V 4700 1500 50  0000 C CNN
F 2 "buck-module:buck-module" H 4600 1500 50  0001 C CNN
F 3 "" H 4600 1500 50  0000 C CNN
	1    4600 1500
	0    1    1    0   
$EndComp
$Comp
L shutterizer-rescue:CONN_01X08 P1
U 1 1 5B267B46
P 2500 4400
F 0 "P1" H 2500 4850 50  0000 C CNN
F 1 "MPU6050" V 2600 4400 50  0000 C CNN
F 2 "buck-module:mpu6050-module" H 2500 4400 50  0001 C CNN
F 3 "" H 2500 4400 50  0000 C CNN
	1    2500 4400
	1    0    0    -1  
$EndComp
$Comp
L power:+24V #PWR01
U 1 1 5B26803E
P 4550 1150
F 0 "#PWR01" H 4550 1000 50  0001 C CNN
F 1 "+24V" H 4550 1290 50  0000 C CNN
F 2 "" H 4550 1150 50  0000 C CNN
F 3 "" H 4550 1150 50  0000 C CNN
	1    4550 1150
	1    0    0    -1  
$EndComp
$Comp
L power:+24V #PWR02
U 1 1 5B26806B
P 5450 4200
F 0 "#PWR02" H 5450 4050 50  0001 C CNN
F 1 "+24V" H 5450 4340 50  0000 C CNN
F 2 "" H 5450 4200 50  0000 C CNN
F 3 "" H 5450 4200 50  0000 C CNN
	1    5450 4200
	1    0    0    -1  
$EndComp
$Comp
L power:GND #PWR03
U 1 1 5B268099
P 5300 4300
F 0 "#PWR03" H 5300 4050 50  0001 C CNN
F 1 "GND" H 5300 4150 50  0000 C CNN
F 2 "" H 5300 4300 50  0000 C CNN
F 3 "" H 5300 4300 50  0000 C CNN
	1    5300 4300
	-1   0    0    1   
$EndComp
$Comp
L power:GND #PWR04
U 1 1 5B26815B
P 2400 1900
F 0 "#PWR04" H 2400 1650 50  0001 C CNN
F 1 "GND" H 2400 1750 50  0000 C CNN
F 2 "" H 2400 1900 50  0000 C CNN
F 3 "" H 2400 1900 50  0000 C CNN
	1    2400 1900
	1    0    0    -1  
$EndComp
Wire Wire Line
	2400 1900 2500 1900
Wire Wire Line
	2500 1700 2400 1700
Wire Wire Line
	2400 1700 2400 1900
Connection ~ 2400 1900
$Comp
L power:GND #PWR05
U 1 1 5B2681B4
P 4650 900
F 0 "#PWR05" H 4650 650 50  0001 C CNN
F 1 "GND" H 4650 750 50  0000 C CNN
F 2 "" H 4650 900 50  0000 C CNN
F 3 "" H 4650 900 50  0000 C CNN
	1    4650 900 
	-1   0    0    1   
$EndComp
Text GLabel 2200 2100 0    60   Input ~ 0
SDA
Text GLabel 2200 2300 0    60   Input ~ 0
SCL
Wire Wire Line
	2200 2300 2500 2300
Wire Wire Line
	2500 2100 2200 2100
Wire Wire Line
	2200 4050 2300 4050
$Comp
L power:GND #PWR06
U 1 1 5B2683A7
P 2000 4050
F 0 "#PWR06" H 2000 3800 50  0001 C CNN
F 1 "GND" H 2000 3900 50  0000 C CNN
F 2 "" H 2000 4050 50  0000 C CNN
F 3 "" H 2000 4050 50  0000 C CNN
	1    2000 4050
	-1   0    0    1   
$EndComp
Text GLabel 1900 4250 0    60   Input ~ 0
SCL
Text GLabel 2200 4350 0    60   Input ~ 0
SDA
Wire Wire Line
	2000 4050 2000 4150
Wire Wire Line
	2000 4150 2300 4150
Wire Wire Line
	1900 4250 2300 4250
Wire Wire Line
	2300 4350 2200 4350
Text GLabel 2300 1300 0    60   Input ~ 0
TX
Text GLabel 2300 1500 0    60   Input ~ 0
RX
Wire Wire Line
	2300 1500 2500 1500
Wire Wire Line
	2500 1300 2300 1300
$Comp
L power:+24V #PWR07
U 1 1 5B26875E
P 4300 4200
F 0 "#PWR07" H 4300 4050 50  0001 C CNN
F 1 "+24V" H 4300 4340 50  0000 C CNN
F 2 "" H 4300 4200 50  0000 C CNN
F 3 "" H 4300 4200 50  0000 C CNN
	1    4300 4200
	1    0    0    -1  
$EndComp
$Comp
L power:GND #PWR08
U 1 1 5B2687C6
P 4150 4300
F 0 "#PWR08" H 4150 4050 50  0001 C CNN
F 1 "GND" H 4150 4150 50  0000 C CNN
F 2 "" H 4150 4300 50  0000 C CNN
F 3 "" H 4150 4300 50  0000 C CNN
	1    4150 4300
	-1   0    0    1   
$EndComp
Wire Wire Line
	4300 4200 4300 4300
Wire Wire Line
	4300 4300 4400 4300
Wire Wire Line
	4150 4300 4150 4400
Wire Wire Line
	4150 4400 4400 4400
Text GLabel 3050 4500 0    60   Input ~ 0
RX
$Comp
L shutterizer-rescue:D D1
U 1 1 5B268A49
P 3600 4750
F 0 "D1" H 3600 4550 50  0000 C CNN
F 1 "1N4148" H 3600 4650 50  0000 C CNN
F 2 "Diodes_ThroughHole.pretty:Diode_DO-41_SOD81_Horizontal_RM10" H 3600 4750 50  0001 C CNN
F 3 "" H 3600 4750 50  0000 C CNN
	1    3600 4750
	1    0    0    -1  
$EndComp
Text GLabel 3050 4750 0    60   Input ~ 0
TX
Wire Wire Line
	3050 4750 3450 4750
Text GLabel 3800 2100 2    60   Input ~ 0
PF4
Text GLabel 3800 2300 2    60   Input ~ 0
PF5
Wire Wire Line
	3800 2300 3600 2300
Wire Wire Line
	3600 2100 3800 2100
Text GLabel 5250 4500 0    60   Input ~ 0
PF4
Text GLabel 5500 4600 0    60   Input ~ 0
PF5
Wire Wire Line
	3900 1900 3600 1900
$Comp
L power:GND #PWR09
U 1 1 5B268DFA
P 3800 1500
F 0 "#PWR09" H 3800 1250 50  0001 C CNN
F 1 "GND" H 3800 1350 50  0000 C CNN
F 2 "" H 3800 1500 50  0000 C CNN
F 3 "" H 3800 1500 50  0000 C CNN
	1    3800 1500
	0    -1   -1   0   
$EndComp
Wire Wire Line
	3600 1500 3800 1500
Text GLabel 3700 1700 2    60   Input ~ 0
~Reset
Text GLabel 3700 3300 2    60   Input ~ 0
MOSI
Text GLabel 3700 3100 2    60   Input ~ 0
MISO
Text GLabel 3700 2900 2    60   Input ~ 0
SCK
Wire Wire Line
	3700 2900 3600 2900
Wire Wire Line
	3700 3100 3600 3100
Wire Wire Line
	3700 3300 3600 3300
$Comp
L shutterizer-rescue:CONN_02X03 P4
U 1 1 5B268F17
P 5000 3100
F 0 "P4" H 5000 3300 50  0000 C CNN
F 1 "isp" H 5000 2900 50  0000 C CNN
F 2 "Connectors_IDC.pretty:IDC-Header_2x03_Pitch2.54mm_Straight" H 5000 1900 50  0001 C CNN
F 3 "" H 5000 1900 50  0000 C CNN
	1    5000 3100
	1    0    0    -1  
$EndComp
Wire Wire Line
	3700 1700 3600 1700
Text GLabel 5350 3100 2    60   Input ~ 0
MOSI
Text GLabel 4300 3100 0    60   Input ~ 0
SCK
Text GLabel 4650 3000 0    60   Input ~ 0
MISO
Text GLabel 4650 3200 0    60   Input ~ 0
~Reset
Wire Wire Line
	4300 3100 4750 3100
Wire Wire Line
	4750 3000 4650 3000
Wire Wire Line
	4650 3200 4750 3200
Wire Wire Line
	5250 3100 5350 3100
$Comp
L power:GND #PWR010
U 1 1 5B2695D5
P 5350 3250
F 0 "#PWR010" H 5350 3000 50  0001 C CNN
F 1 "GND" H 5350 3100 50  0000 C CNN
F 2 "" H 5350 3250 50  0000 C CNN
F 3 "" H 5350 3250 50  0000 C CNN
	1    5350 3250
	1    0    0    -1  
$EndComp
Wire Wire Line
	5350 3250 5350 3200
Wire Wire Line
	5350 3200 5250 3200
Wire Wire Line
	5350 2900 5350 3000
Wire Wire Line
	5350 3000 5250 3000
$Comp
L power:+3.3V #PWR011
U 1 1 5B2699AB
P 4750 1150
F 0 "#PWR011" H 4750 1000 50  0001 C CNN
F 1 "+3.3V" H 4750 1290 50  0000 C CNN
F 2 "" H 4750 1150 50  0000 C CNN
F 3 "" H 4750 1150 50  0000 C CNN
	1    4750 1150
	1    0    0    -1  
$EndComp
$Comp
L power:+3.3V #PWR012
U 1 1 5B2699CD
P 3900 1900
F 0 "#PWR012" H 3900 1750 50  0001 C CNN
F 1 "+3.3V" H 3900 2040 50  0000 C CNN
F 2 "" H 3900 1900 50  0000 C CNN
F 3 "" H 3900 1900 50  0000 C CNN
	1    3900 1900
	0    1    1    0   
$EndComp
$Comp
L power:+3.3V #PWR013
U 1 1 5B2699F6
P 2200 4050
F 0 "#PWR013" H 2200 3900 50  0001 C CNN
F 1 "+3.3V" H 2200 4190 50  0000 C CNN
F 2 "" H 2200 4050 50  0000 C CNN
F 3 "" H 2200 4050 50  0000 C CNN
	1    2200 4050
	1    0    0    -1  
$EndComp
$Comp
L power:+3.3V #PWR014
U 1 1 5B269A18
P 5350 2900
F 0 "#PWR014" H 5350 2750 50  0001 C CNN
F 1 "+3.3V" H 5350 3040 50  0000 C CNN
F 2 "" H 5350 2900 50  0000 C CNN
F 3 "" H 5350 2900 50  0000 C CNN
	1    5350 2900
	1    0    0    -1  
$EndComp
Wire Wire Line
	5450 4200 5450 4300
Wire Wire Line
	5450 4300 5600 4300
Wire Wire Line
	5300 4300 5300 4400
Wire Wire Line
	5300 4400 5600 4400
Wire Wire Line
	5500 4600 5600 4600
Wire Wire Line
	5250 4500 5600 4500
Text GLabel 3800 2500 2    60   Input ~ 0
PF6
Wire Wire Line
	3800 2500 3600 2500
$Comp
L shutterizer-rescue:R R1
U 1 1 5B375576
P 5350 1700
F 0 "R1" V 5430 1700 50  0000 C CNN
F 1 "10k" V 5350 1700 50  0000 C CNN
F 2 "Resistors_THT.pretty:R_Axial_DIN0204_L3.6mm_D1.6mm_P2.54mm_Vertical" V 5280 1700 50  0001 C CNN
F 3 "" H 5350 1700 50  0000 C CNN
	1    5350 1700
	1    0    0    -1  
$EndComp
$Comp
L shutterizer-rescue:R R2
U 1 1 5B375629
P 5350 2200
F 0 "R2" V 5430 2200 50  0000 C CNN
F 1 "1k" V 5350 2200 50  0000 C CNN
F 2 "Resistors_THT.pretty:R_Axial_DIN0204_L3.6mm_D1.6mm_P2.54mm_Vertical" V 5280 2200 50  0001 C CNN
F 3 "" H 5350 2200 50  0000 C CNN
	1    5350 2200
	-1   0    0    1   
$EndComp
$Comp
L power:+24V #PWR015
U 1 1 5B37569D
P 5350 1450
F 0 "#PWR015" H 5350 1300 50  0001 C CNN
F 1 "+24V" H 5350 1590 50  0000 C CNN
F 2 "" H 5350 1450 50  0000 C CNN
F 3 "" H 5350 1450 50  0000 C CNN
	1    5350 1450
	1    0    0    -1  
$EndComp
$Comp
L power:GND #PWR016
U 1 1 5B3756C3
P 5350 2450
F 0 "#PWR016" H 5350 2200 50  0001 C CNN
F 1 "GND" H 5350 2300 50  0000 C CNN
F 2 "" H 5350 2450 50  0000 C CNN
F 3 "" H 5350 2450 50  0000 C CNN
	1    5350 2450
	1    0    0    -1  
$EndComp
Wire Wire Line
	5350 2450 5350 2400
Wire Wire Line
	5350 1850 5350 1950
Wire Wire Line
	5350 1450 5350 1500
Text GLabel 5150 1950 0    60   Input ~ 0
PF6
Wire Wire Line
	5150 1950 5350 1950
Connection ~ 5350 1950
Wire Wire Line
	4650 900  4650 1300
Wire Wire Line
	4550 1150 4550 1300
Wire Wire Line
	4750 1150 4750 1300
Wire Wire Line
	5700 2400 5350 2400
Connection ~ 5350 2400
Wire Wire Line
	5700 1500 5350 1500
Connection ~ 5350 1500
Wire Wire Line
	5350 1950 5350 2050
Wire Wire Line
	5350 2400 5350 2350
Wire Wire Line
	5350 1500 5350 1550
$Comp
L Device:CP_Small C?
U 1 1 5BA95BA6
P 5700 1950
F 0 "C?" H 5788 1996 50  0000 L CNN
F 1 "CP_Small" H 5788 1905 50  0000 L CNN
F 2 "" H 5700 1950 50  0001 C CNN
F 3 "~" H 5700 1950 50  0001 C CNN
	1    5700 1950
	1    0    0    -1  
$EndComp
Wire Wire Line
	5700 1500 5700 1850
Wire Wire Line
	5700 2050 5700 2400
$Comp
L shutterizer-rescue:D D?
U 1 1 5BB59AF8
P 3600 4500
F 0 "D?" H 3600 4300 50  0000 C CNN
F 1 "1N4148" H 3600 4400 50  0000 C CNN
F 2 "Diodes_ThroughHole.pretty:Diode_DO-41_SOD81_Horizontal_RM10" H 3600 4500 50  0001 C CNN
F 3 "" H 3600 4500 50  0000 C CNN
	1    3600 4500
	-1   0    0    1   
$EndComp
Wire Wire Line
	3750 4500 4400 4500
Wire Wire Line
	3450 4500 3350 4500
$Comp
L Device:R R?
U 1 1 5BB5C1DF
P 3350 4200
F 0 "R?" H 3420 4246 50  0000 L CNN
F 1 "3k3" V 3350 4150 50  0000 L CNN
F 2 "" V 3280 4200 50  0001 C CNN
F 3 "~" H 3350 4200 50  0001 C CNN
	1    3350 4200
	1    0    0    -1  
$EndComp
$Comp
L power:+3.3V #PWR?
U 1 1 5BB5C279
P 3350 4000
F 0 "#PWR?" H 3350 3850 50  0001 C CNN
F 1 "+3.3V" H 3350 4140 50  0000 C CNN
F 2 "" H 3350 4000 50  0000 C CNN
F 3 "" H 3350 4000 50  0000 C CNN
	1    3350 4000
	1    0    0    -1  
$EndComp
Wire Wire Line
	3350 4000 3350 4050
Wire Wire Line
	3350 4350 3350 4500
Connection ~ 3350 4500
Wire Wire Line
	3350 4500 3050 4500
Text Notes 3550 3800 0    60   ~ 0
bluewire\nfix
Wire Wire Line
	4300 4600 4400 4600
Wire Notes Line
	3150 4600 3150 3800
Wire Wire Line
	4300 4750 4300 4600
Wire Notes Line
	4000 3800 4000 4600
Wire Notes Line
	3150 4600 4000 4600
Wire Notes Line
	3150 3800 4000 3800
Wire Wire Line
	3750 4750 4300 4750
$EndSCHEMATC
