(module buck-module (layer F.Cu) (tedit 5B378D86)
  (fp_text reference M** (at 5.334 12.192) (layer F.SilkS)
    (effects (font (size 1 1) (thickness 0.15)))
  )
  (fp_text value buck-module (at 5.334 13.716) (layer F.Fab)
    (effects (font (size 1 1) (thickness 0.15)))
  )
  (fp_text user +OUT (at 1.524 4.572 90) (layer F.SilkS)
    (effects (font (size 1 1) (thickness 0.15)))
  )
  (fp_text user GND (at 4.064 4.064 90) (layer F.SilkS)
    (effects (font (size 1 1) (thickness 0.15)))
  )
  (fp_text user +IN (at 6.858 4.064 90) (layer F.SilkS)
    (effects (font (size 1 1) (thickness 0.15)))
  )
  (fp_text user EN (at 9.144 3.81 90) (layer F.SilkS)
    (effects (font (size 1 1) (thickness 0.15)))
  )
  (fp_line (start 0 0) (end 10.668 0) (layer F.SilkS) (width 0.15))
  (fp_line (start 10.668 0) (end 10.668 20.32) (layer F.SilkS) (width 0.15))
  (fp_line (start 10.668 20.32) (end 0 20.32) (layer F.SilkS) (width 0.15))
  (fp_line (start 0 20.32) (end 0 0) (layer F.SilkS) (width 0.15))
  (pad 1 thru_hole circle (at 1.524 1.524) (size 1.524 1.524) (drill 0.762) (layers *.Cu *.Mask F.SilkS))
  (pad 2 thru_hole circle (at 4.064 1.524) (size 1.524 1.524) (drill 0.762) (layers *.Cu *.Mask F.SilkS))
  (pad 3 thru_hole circle (at 6.604 1.524) (size 1.524 1.524) (drill 0.762) (layers *.Cu *.Mask F.SilkS))
  (pad 4 thru_hole circle (at 9.144 1.524) (size 1.524 1.524) (drill 0.762) (layers *.Cu *.Mask F.SilkS))
)
