EESchema Schematic File Version 4
LIBS:ui-hw-cache
EELAYER 26 0
EELAYER END
$Descr A4 11693 8268
encoding utf-8
Sheet 1 1
Title ""
Date ""
Rev ""
Comp ""
Comment1 ""
Comment2 ""
Comment3 ""
Comment4 ""
$EndDescr
$Comp
L promicro:promicro M1
U 1 1 5B266749
P 2700 1300
F 0 "M1" H 3050 -1050 60  0000 C CNN
F 1 "promicro" H 3050 1450 60  0000 C CNN
F 2 "Housings_DIP.pretty:DIP-24_W15.24mm" H 2700 1600 60  0001 C CNN
F 3 "" H 2700 1600 60  0000 C CNN
	1    2700 1300
	1    0    0    -1  
$EndComp
$Comp
L ui-hw-rescue:CONN_01X04 P3
U 1 1 5B267AE3
P 5250 7050
F 0 "P3" H 5250 7300 50  0000 C CNN
F 1 "3.3V" V 5350 7050 50  0000 C CNN
F 2 "local:buck-module" H 5250 7050 50  0001 C CNN
F 3 "" H 5250 7050 50  0000 C CNN
	1    5250 7050
	0    1    1    0   
$EndComp
$Comp
L power:GND #PWR01
U 1 1 5B26815B
P 2400 1900
F 0 "#PWR01" H 2400 1650 50  0001 C CNN
F 1 "GND" H 2400 1750 50  0000 C CNN
F 2 "" H 2400 1900 50  0000 C CNN
F 3 "" H 2400 1900 50  0000 C CNN
	1    2400 1900
	1    0    0    -1  
$EndComp
Wire Wire Line
	2400 1900 2500 1900
Wire Wire Line
	2500 1700 2400 1700
Wire Wire Line
	2400 1700 2400 1900
Connection ~ 2400 1900
$Comp
L power:GND #PWR02
U 1 1 5B2681B4
P 5300 6450
F 0 "#PWR02" H 5300 6200 50  0001 C CNN
F 1 "GND" H 5300 6300 50  0000 C CNN
F 2 "" H 5300 6450 50  0000 C CNN
F 3 "" H 5300 6450 50  0000 C CNN
	1    5300 6450
	-1   0    0    1   
$EndComp
Text GLabel 2200 2100 0    60   Input ~ 0
SDA
Text GLabel 2200 2300 0    60   Input ~ 0
SCL
Wire Wire Line
	2200 2300 2500 2300
Wire Wire Line
	2500 2100 2200 2100
Text GLabel 2300 1300 0    60   Input ~ 0
TX
Text GLabel 2300 1500 0    60   Input ~ 0
RX
Wire Wire Line
	2300 1500 2500 1500
Wire Wire Line
	2500 1300 2300 1300
Text GLabel 5250 4200 0    60   Input ~ 0
TX
Text GLabel 4850 4300 0    60   Input ~ 0
RX
Text GLabel 3800 2100 2    60   Input ~ 0
PF4
Text GLabel 3800 2300 2    60   Input ~ 0
PF5
Wire Wire Line
	3800 2300 3600 2300
Wire Wire Line
	3600 2100 3800 2100
Wire Wire Line
	3900 1900 3600 1900
$Comp
L power:GND #PWR03
U 1 1 5B268DFA
P 3900 1500
F 0 "#PWR03" H 3900 1250 50  0001 C CNN
F 1 "GND" H 3900 1350 50  0000 C CNN
F 2 "" H 3900 1500 50  0000 C CNN
F 3 "" H 3900 1500 50  0000 C CNN
	1    3900 1500
	0    -1   -1   0   
$EndComp
Wire Wire Line
	3600 1500 3900 1500
Text GLabel 3700 1700 2    60   Input ~ 0
~Reset
Text GLabel 3800 3300 2    60   Input ~ 0
MOSI
Text GLabel 3800 3100 2    60   Input ~ 0
MISO
Text GLabel 3800 2900 2    60   Input ~ 0
SCK
Wire Wire Line
	3800 2900 3600 2900
Wire Wire Line
	3800 3100 3600 3100
Wire Wire Line
	3800 3300 3600 3300
$Comp
L ui-hw-rescue:CONN_02X03 P4
U 1 1 5B268F17
P 5300 3100
F 0 "P4" H 5300 3300 50  0000 C CNN
F 1 "isp" H 5300 2900 50  0000 C CNN
F 2 "Connectors_IDC.pretty:IDC-Header_2x03_Pitch2.54mm_Straight" H 5300 1900 50  0001 C CNN
F 3 "" H 5300 1900 50  0000 C CNN
	1    5300 3100
	1    0    0    -1  
$EndComp
Wire Wire Line
	3700 1700 3600 1700
Text GLabel 5650 3100 2    60   Input ~ 0
MOSI
Text GLabel 4600 3100 0    60   Input ~ 0
SCK
Text GLabel 4950 3000 0    60   Input ~ 0
MISO
Text GLabel 4950 3200 0    60   Input ~ 0
~Reset
Wire Wire Line
	4600 3100 5050 3100
Wire Wire Line
	5050 3000 4950 3000
Wire Wire Line
	4950 3200 5050 3200
Wire Wire Line
	5550 3100 5650 3100
$Comp
L power:GND #PWR04
U 1 1 5B2695D5
P 5650 3250
F 0 "#PWR04" H 5650 3000 50  0001 C CNN
F 1 "GND" H 5650 3100 50  0000 C CNN
F 2 "" H 5650 3250 50  0000 C CNN
F 3 "" H 5650 3250 50  0000 C CNN
	1    5650 3250
	1    0    0    -1  
$EndComp
Wire Wire Line
	5650 3250 5650 3200
Wire Wire Line
	5650 3200 5550 3200
Wire Wire Line
	5650 2900 5650 3000
Wire Wire Line
	5650 3000 5550 3000
$Comp
L power:+3.3V #PWR05
U 1 1 5B2699AB
P 5550 6700
F 0 "#PWR05" H 5550 6550 50  0001 C CNN
F 1 "+3.3V" H 5550 6840 50  0000 C CNN
F 2 "" H 5550 6700 50  0000 C CNN
F 3 "" H 5550 6700 50  0000 C CNN
	1    5550 6700
	1    0    0    -1  
$EndComp
$Comp
L power:+3.3V #PWR06
U 1 1 5B2699CD
P 3900 1900
F 0 "#PWR06" H 3900 1750 50  0001 C CNN
F 1 "+3.3V" H 3900 2040 50  0000 C CNN
F 2 "" H 3900 1900 50  0000 C CNN
F 3 "" H 3900 1900 50  0000 C CNN
	1    3900 1900
	0    1    1    0   
$EndComp
$Comp
L power:+3.3V #PWR07
U 1 1 5B269A18
P 5650 2900
F 0 "#PWR07" H 5650 2750 50  0001 C CNN
F 1 "+3.3V" H 5650 3040 50  0000 C CNN
F 2 "" H 5650 2900 50  0000 C CNN
F 3 "" H 5650 2900 50  0000 C CNN
	1    5650 2900
	1    0    0    -1  
$EndComp
Text GLabel 3800 2500 2    60   Input ~ 0
PF6
Wire Wire Line
	3800 2500 3600 2500
Wire Wire Line
	5300 6450 5300 6550
Wire Wire Line
	5200 6700 5200 6850
$Comp
L ui-hw-rescue:R R1
U 1 1 5B4E0A2C
P 4950 4100
F 0 "R1" V 5030 4100 50  0000 C CNN
F 1 "1k" V 4950 4100 50  0000 C CNN
F 2 "Resistors_THT.pretty:R_Axial_DIN0204_L3.6mm_D1.6mm_P1.90mm_Vertical" V 4880 4100 50  0001 C CNN
F 3 "" H 4950 4100 50  0000 C CNN
	1    4950 4100
	1    0    0    -1  
$EndComp
Wire Wire Line
	4950 4250 4950 4300
Connection ~ 4950 4300
$Comp
L power:+3.3V #PWR08
U 1 1 5B4E0AA1
P 4950 3850
F 0 "#PWR08" H 4950 3700 50  0001 C CNN
F 1 "+3.3V" H 4950 3990 50  0000 C CNN
F 2 "" H 4950 3850 50  0000 C CNN
F 3 "" H 4950 3850 50  0000 C CNN
	1    4950 3850
	1    0    0    -1  
$EndComp
Wire Wire Line
	4950 3850 4950 3950
$Comp
L power:+5V #PWR09
U 1 1 5B4E0F4F
P 1250 5300
F 0 "#PWR09" H 1250 5150 50  0001 C CNN
F 1 "+5V" H 1250 5440 50  0000 C CNN
F 2 "" H 1250 5300 50  0000 C CNN
F 3 "" H 1250 5300 50  0000 C CNN
	1    1250 5300
	0    -1   -1   0   
$EndComp
$Comp
L power:GND #PWR010
U 1 1 5B4E0FB9
P 1050 5200
F 0 "#PWR010" H 1050 4950 50  0001 C CNN
F 1 "GND" H 1050 5050 50  0000 C CNN
F 2 "" H 1050 5200 50  0000 C CNN
F 3 "" H 1050 5200 50  0000 C CNN
	1    1050 5200
	0    1    1    0   
$EndComp
Text GLabel 1250 4800 0    60   Input ~ 0
SCK
Text GLabel 1250 4600 0    60   Input ~ 0
MOSI
Text Notes 4100 2550 0    60   ~ 0
supply sense
Text GLabel 3800 3500 2    60   Input ~ 0
PB6
Wire Wire Line
	3800 3500 3600 3500
Text GLabel 1250 4700 0    60   Input ~ 0
PB6
Text Notes 4100 3550 0    60   ~ 0
Display CS
Text Notes 1100 3550 0    60   ~ 0
Display Backlight
Text GLabel 1250 4400 0    60   Input ~ 0
PB5
Text GLabel 2200 3500 0    60   Input ~ 0
PB5
Text GLabel 2200 2500 0    60   Input ~ 0
PD4
Text GLabel 2200 2700 0    60   Input ~ 0
PC6
Text GLabel 2200 2900 0    60   Input ~ 0
PD7
Wire Wire Line
	2200 2900 2500 2900
Wire Wire Line
	2500 2700 2200 2700
Wire Wire Line
	2200 2500 2500 2500
Text Notes 1900 2550 2    60   ~ 0
Encoder Button
Text Notes 1900 2750 2    60   ~ 0
Encoder A
Text Notes 1900 2950 2    60   ~ 0
Encoder B
Text GLabel 2200 3100 0    60   Input ~ 0
PE6
Wire Wire Line
	2200 3100 2500 3100
Text Notes 1900 3150 2    60   ~ 0
Stop button
Text GLabel 1250 4500 0    60   Input ~ 0
PD4
Text GLabel 3000 4800 2    60   Input ~ 0
PC6
Text GLabel 3000 4600 2    60   Input ~ 0
PD7
Text GLabel 3000 5100 2    60   Input ~ 0
PE6
$Comp
L ui-hw-rescue:CONN_01X04 P6
U 1 1 5B532564
P 4400 5600
F 0 "P6" H 4400 5850 50  0000 C CNN
F 1 "BME280" V 4500 5600 50  0000 C CNN
F 2 "local:BME280" H 4400 5600 50  0001 C CNN
F 3 "" H 4400 5600 50  0000 C CNN
	1    4400 5600
	1    0    0    -1  
$EndComp
Text GLabel 3800 5650 0    60   Input ~ 0
SCL
Text GLabel 4050 5750 0    60   Input ~ 0
SDA
Wire Wire Line
	3800 5650 4200 5650
Wire Wire Line
	4200 5750 4050 5750
$Comp
L power:+3.3V #PWR011
U 1 1 5B532EC0
P 4100 5450
F 0 "#PWR011" H 4100 5300 50  0001 C CNN
F 1 "+3.3V" H 4100 5590 50  0000 C CNN
F 2 "" H 4100 5450 50  0000 C CNN
F 3 "" H 4100 5450 50  0000 C CNN
	1    4100 5450
	1    0    0    -1  
$EndComp
Wire Wire Line
	4200 5450 4100 5450
$Comp
L power:GND #PWR012
U 1 1 5B532F3F
P 4050 5550
F 0 "#PWR012" H 4050 5300 50  0001 C CNN
F 1 "GND" H 4050 5400 50  0000 C CNN
F 2 "" H 4050 5550 50  0000 C CNN
F 3 "" H 4050 5550 50  0000 C CNN
	1    4050 5550
	0    1    1    0   
$EndComp
Wire Wire Line
	4050 5550 4200 5550
$Comp
L ui-hw-rescue:CONN_01X08 P5
U 1 1 5B532FCE
P 4400 4650
F 0 "P5" H 4400 5100 50  0000 C CNN
F 1 "CJMCU-811" V 4500 4650 50  0000 C CNN
F 2 "local:CJMCU-811" H 4400 4650 50  0001 C CNN
F 3 "" H 4400 4650 50  0000 C CNN
	1    4400 4650
	1    0    0    -1  
$EndComp
$Comp
L power:+3.3V #PWR013
U 1 1 5B533052
P 4100 4300
F 0 "#PWR013" H 4100 4150 50  0001 C CNN
F 1 "+3.3V" H 4100 4440 50  0000 C CNN
F 2 "" H 4100 4300 50  0000 C CNN
F 3 "" H 4100 4300 50  0000 C CNN
	1    4100 4300
	1    0    0    -1  
$EndComp
Wire Wire Line
	4100 4300 4200 4300
$Comp
L power:GND #PWR014
U 1 1 5B5330D6
P 4050 4400
F 0 "#PWR014" H 4050 4150 50  0001 C CNN
F 1 "GND" H 4050 4250 50  0000 C CNN
F 2 "" H 4050 4400 50  0000 C CNN
F 3 "" H 4050 4400 50  0000 C CNN
	1    4050 4400
	0    1    1    0   
$EndComp
Wire Wire Line
	4050 4400 4200 4400
Text GLabel 3800 4500 0    60   Input ~ 0
SCL
Wire Wire Line
	3800 4500 4200 4500
Text GLabel 4050 4600 0    60   Input ~ 0
SDA
Wire Wire Line
	4050 4600 4200 4600
$Comp
L ui-hw-rescue:D D1
U 1 1 5B5334CD
P 5150 5200
F 0 "D1" H 5250 5100 50  0000 C CNN
F 1 "D" H 5150 5100 50  0000 C CNN
F 2 "Diodes_THT.pretty:D_A-405_P2.54mm_Vertical_AnodeUp" H 5150 5200 50  0001 C CNN
F 3 "" H 5150 5200 50  0000 C CNN
	1    5150 5200
	-1   0    0    1   
$EndComp
Wire Wire Line
	5300 5200 5550 5200
Wire Wire Line
	4950 5200 5000 5200
$Comp
L ui-hw-rescue:R R2
U 1 1 5B5336D0
P 5350 4850
F 0 "R2" V 5430 4850 50  0000 C CNN
F 1 "4k7" V 5350 4850 50  0000 C CNN
F 2 "Resistors_THT.pretty:R_Axial_DIN0204_L3.6mm_D1.6mm_P1.90mm_Vertical" V 5280 4850 50  0001 C CNN
F 3 "" H 5350 4850 50  0000 C CNN
	1    5350 4850
	-1   0    0    1   
$EndComp
Wire Wire Line
	5350 4700 5350 4200
Text GLabel 4900 5350 0    60   Input ~ 0
PF5
Text Notes 4100 2350 0    60   ~ 0
MH-Z19 disable
Wire Wire Line
	2500 3500 2200 3500
Text Notes 4100 2150 0    60   ~ 0
AC switch
$Comp
L power:+5V #PWR015
U 1 1 5B5757FF
P 5200 6700
F 0 "#PWR015" H 5200 6550 50  0001 C CNN
F 1 "+5V" H 5200 6840 50  0000 C CNN
F 2 "" H 5200 6700 50  0000 C CNN
F 3 "" H 5200 6700 50  0000 C CNN
	1    5200 6700
	1    0    0    -1  
$EndComp
$Comp
L ui-hw-rescue:MH-Z19 U1
U 1 1 5B86D9FF
P 7100 4900
F 0 "U1" H 7900 4250 60  0000 C CNN
F 1 "MH-Z19" H 7850 4950 60  0000 C CNN
F 2 "local:MH-Z19" H 8650 4900 60  0001 C CNN
F 3 "" H 8650 4900 60  0000 C CNN
	1    7100 4900
	-1   0    0    -1  
$EndComp
Wire Wire Line
	5350 5000 5350 5350
Wire Wire Line
	4900 5350 5350 5350
Connection ~ 5350 5350
$Comp
L power:+5V #PWR016
U 1 1 5B86E13F
P 7300 5500
F 0 "#PWR016" H 7300 5350 50  0001 C CNN
F 1 "+5V" H 7300 5640 50  0000 C CNN
F 2 "" H 7300 5500 50  0000 C CNN
F 3 "" H 7300 5500 50  0000 C CNN
	1    7300 5500
	0    1    1    0   
$EndComp
Wire Wire Line
	7300 5500 7100 5500
$Comp
L power:GND #PWR017
U 1 1 5B86E2E7
P 7200 5350
F 0 "#PWR017" H 7200 5100 50  0001 C CNN
F 1 "GND" H 7200 5200 50  0000 C CNN
F 2 "" H 7200 5350 50  0000 C CNN
F 3 "" H 7200 5350 50  0000 C CNN
	1    7200 5350
	0    -1   -1   0   
$EndComp
Wire Wire Line
	7200 5350 7100 5350
Wire Wire Line
	4850 4300 4950 4300
Wire Wire Line
	5350 4200 5250 4200
$Comp
L power:+5V #PWR018
U 1 1 5B86F781
P 6850 1650
F 0 "#PWR018" H 6850 1500 50  0001 C CNN
F 1 "+5V" H 6850 1790 50  0000 C CNN
F 2 "" H 6850 1650 50  0000 C CNN
F 3 "" H 6850 1650 50  0000 C CNN
	1    6850 1650
	1    0    0    -1  
$EndComp
$Comp
L power:GND #PWR019
U 1 1 5B86F7FD
P 6850 2800
F 0 "#PWR019" H 6850 2550 50  0001 C CNN
F 1 "GND" H 6850 2650 50  0000 C CNN
F 2 "" H 6850 2800 50  0000 C CNN
F 3 "" H 6850 2800 50  0000 C CNN
	1    6850 2800
	1    0    0    -1  
$EndComp
Text GLabel 6600 2300 0    60   Input ~ 0
TX
Text GLabel 6600 2400 0    60   Input ~ 0
RX
Text GLabel 6600 2100 0    60   Input ~ 0
PF4
Text GLabel 6600 2000 0    60   Input ~ 0
PF6
Wire Wire Line
	6600 2000 6850 2000
Wire Wire Line
	6600 2100 6850 2100
Wire Wire Line
	6600 2300 6850 2300
Wire Wire Line
	6600 2400 6850 2400
Wire Wire Line
	6850 1650 6850 1800
Text GLabel 3800 2700 2    60   Input ~ 0
PF7
Wire Wire Line
	3800 2700 3600 2700
Text GLabel 2200 3300 0    60   Input ~ 0
PB4
Wire Wire Line
	2200 3300 2500 3300
Text GLabel 8400 1800 2    60   Input ~ 0
PB4
$Comp
L ui-hw-rescue:R R3
U 1 1 5B8700ED
P 8150 1800
F 0 "R3" V 8230 1800 50  0000 C CNN
F 1 "180" V 8150 1800 50  0000 C CNN
F 2 "Resistors_THT.pretty:R_Axial_DIN0204_L3.6mm_D1.6mm_P1.90mm_Vertical" V 8080 1800 50  0001 C CNN
F 3 "" H 8150 1800 50  0000 C CNN
	1    8150 1800
	0    1    1    0   
$EndComp
Wire Wire Line
	8300 1800 8400 1800
Wire Wire Line
	8000 1800 7850 1800
$Comp
L ui-hw-rescue:R R4
U 1 1 5B8702D4
P 8150 2500
F 0 "R4" V 8230 2500 50  0000 C CNN
F 1 "180" V 8150 2500 50  0000 C CNN
F 2 "Resistors_THT.pretty:R_Axial_DIN0204_L3.6mm_D1.6mm_P1.90mm_Vertical" V 8080 2500 50  0001 C CNN
F 3 "" H 8150 2500 50  0000 C CNN
	1    8150 2500
	0    1    1    0   
$EndComp
Wire Wire Line
	8000 2500 7850 2500
Text GLabel 8400 2500 2    60   Input ~ 0
PF7
Wire Wire Line
	8400 2500 8300 2500
Text Notes 4100 2750 0    60   ~ 0
RJ45 LED 1
Text Notes 1300 3400 0    60   ~ 0
RJ45 LED 2 /\nEthernet CS
$Comp
L ui-hw-rescue:RJ45_LEDS J1
U 1 1 5B870814
P 7350 2200
F 0 "J1" H 7350 1700 50  0000 C CNN
F 1 "RJ45_LEDS" H 7350 2600 50  0000 C CNN
F 2 "Connectors.pretty:RJHSE538X" H 7350 2150 50  0001 C CNN
F 3 "" H 7350 2150 50  0000 C CNN
	1    7350 2200
	0    1    1    0   
$EndComp
Wire Wire Line
	6850 2500 6850 2600
Connection ~ 6850 2600
$Comp
L power:GND #PWR020
U 1 1 5B870BCB
P 7850 2800
F 0 "#PWR020" H 7850 2550 50  0001 C CNN
F 1 "GND" H 7850 2650 50  0000 C CNN
F 2 "" H 7850 2800 50  0000 C CNN
F 3 "" H 7850 2800 50  0000 C CNN
	1    7850 2800
	1    0    0    -1  
$EndComp
Wire Wire Line
	7850 1900 7850 2600
Connection ~ 7850 2600
Connection ~ 6850 1800
Wire Wire Line
	4950 4300 4950 5200
Wire Wire Line
	5350 5350 5550 5350
Wire Wire Line
	6850 2600 6850 2800
Wire Wire Line
	7850 2600 7850 2800
Wire Wire Line
	6850 1800 6850 1900
$Comp
L olimex-enc28j66-h:narrow-enc28j66 M3
U 1 1 5BA2806C
P 9750 4200
F 0 "M3" H 10025 4487 60  0000 C CNN
F 1 "narrow-enc28j66" H 10025 4381 60  0000 C CNN
F 2 "local:narrow-enc28j66" H 9750 4200 60  0001 C CNN
F 3 "" H 9750 4200 60  0001 C CNN
	1    9750 4200
	1    0    0    -1  
$EndComp
$Comp
L olimex-enc28j66-h:olimex-enc28j66-h M2
U 1 1 5BA28279
P 9600 2500
F 0 "M2" H 10075 2837 60  0000 C CNN
F 1 "olimex-enc28j66-h" H 10075 2731 60  0000 C CNN
F 2 "local:olimex-enc28j66h" H 9600 2500 60  0001 C CNN
F 3 "" H 9600 2500 60  0001 C CNN
	1    9600 2500
	1    0    0    -1  
$EndComp
Text GLabel 10900 3100 2    60   Input ~ 0
PB4
Wire Wire Line
	10900 3100 10700 3100
Text GLabel 9350 4800 0    60   Input ~ 0
PB4
Wire Wire Line
	9350 4800 9550 4800
$Comp
L power:GND #PWR0101
U 1 1 5BA2C8C1
P 10650 5000
F 0 "#PWR0101" H 10650 4750 50  0001 C CNN
F 1 "GND" H 10655 4827 50  0000 C CNN
F 2 "" H 10650 5000 50  0001 C CNN
F 3 "" H 10650 5000 50  0001 C CNN
	1    10650 5000
	1    0    0    -1  
$EndComp
Wire Wire Line
	10500 5000 10650 5000
$Comp
L power:+3.3V #PWR0102
U 1 1 5BA2EC88
P 9350 5000
F 0 "#PWR0102" H 9350 4850 50  0001 C CNN
F 1 "+3.3V" V 9365 5128 50  0000 L CNN
F 2 "" H 9350 5000 50  0001 C CNN
F 3 "" H 9350 5000 50  0001 C CNN
	1    9350 5000
	0    -1   -1   0   
$EndComp
Wire Wire Line
	9350 5000 9550 5000
$Comp
L power:GND #PWR0103
U 1 1 5BA31044
P 10900 2700
F 0 "#PWR0103" H 10900 2450 50  0001 C CNN
F 1 "GND" H 10905 2527 50  0000 C CNN
F 2 "" H 10900 2700 50  0001 C CNN
F 3 "" H 10900 2700 50  0001 C CNN
	1    10900 2700
	1    0    0    -1  
$EndComp
Wire Wire Line
	10900 2700 10700 2700
$Comp
L power:+3.3V #PWR0104
U 1 1 5BA3349C
P 10900 2500
F 0 "#PWR0104" H 10900 2350 50  0001 C CNN
F 1 "+3.3V" H 10915 2673 50  0000 C CNN
F 2 "" H 10900 2500 50  0001 C CNN
F 3 "" H 10900 2500 50  0001 C CNN
	1    10900 2500
	1    0    0    -1  
$EndComp
Wire Wire Line
	10900 2500 10700 2500
Text GLabel 9250 2700 0    60   Input ~ 0
MOSI
Text GLabel 9350 4600 0    60   Input ~ 0
MOSI
Text GLabel 10650 4600 2    60   Input ~ 0
SCK
Text GLabel 9250 2500 0    60   Input ~ 0
SCK
Text GLabel 9250 2900 0    60   Input ~ 0
MISO
Text GLabel 10650 4400 2    60   Input ~ 0
MISO
Wire Wire Line
	10500 4400 10650 4400
Wire Wire Line
	10650 4600 10500 4600
Wire Wire Line
	9550 4600 9350 4600
Wire Wire Line
	9250 2500 9400 2500
Wire Wire Line
	9250 2700 9400 2700
Wire Wire Line
	9400 2900 9250 2900
$Comp
L ui-hw-rescue:CONN_01X04 P7
U 1 1 5BA44FC8
P 10150 6150
F 0 "P7" H 10150 6400 50  0000 C CNN
F 1 "5V" V 10250 6150 50  0000 C CNN
F 2 "local:buck-module" H 10150 6150 50  0001 C CNN
F 3 "" H 10150 6150 50  0000 C CNN
	1    10150 6150
	0    1    1    0   
$EndComp
$Comp
L power:GND #PWR0105
U 1 1 5BA44FCF
P 10200 5550
F 0 "#PWR0105" H 10200 5300 50  0001 C CNN
F 1 "GND" H 10200 5400 50  0000 C CNN
F 2 "" H 10200 5550 50  0000 C CNN
F 3 "" H 10200 5550 50  0000 C CNN
	1    10200 5550
	-1   0    0    1   
$EndComp
$Comp
L power:+5V #PWR0106
U 1 1 5BA44FDE
P 10550 5650
F 0 "#PWR0106" H 10550 5500 50  0001 C CNN
F 1 "+5V" H 10550 5790 50  0000 C CNN
F 2 "" H 10550 5650 50  0000 C CNN
F 3 "" H 10550 5650 50  0000 C CNN
	1    10550 5650
	1    0    0    -1  
$EndComp
$Comp
L Connector_Generic:Conn_01x02 J2
U 1 1 5BA47F26
P 9700 5650
F 0 "J2" H 9620 5867 50  0000 C CNN
F 1 "power" H 9620 5776 50  0000 C CNN
F 2 "Connectors_Molex.pretty:Molex_KK-6410-02_02x2.54mm_Straight" H 9700 5650 50  0001 C CNN
F 3 "~" H 9700 5650 50  0001 C CNN
	1    9700 5650
	-1   0    0    -1  
$EndComp
$Comp
L rrd-graphic-display:rrd-display M4
U 1 1 5BA6543D
P 1550 4400
F 0 "M4" H 2100 4687 60  0000 C CNN
F 1 "rrd-display" H 2100 4581 60  0000 C CNN
F 2 "local:rrd-display-128x64" H 1550 4400 60  0001 C CNN
F 3 "" H 1550 4400 60  0001 C CNN
	1    1550 4400
	1    0    0    -1  
$EndComp
Wire Wire Line
	3000 5100 2850 5100
Wire Wire Line
	3000 4600 2850 4600
Wire Wire Line
	3000 4800 2850 4800
$Comp
L power:GND #PWR0107
U 1 1 5BA6E7C4
P 3050 5300
F 0 "#PWR0107" H 3050 5050 50  0001 C CNN
F 1 "GND" H 3055 5127 50  0000 C CNN
F 2 "" H 3050 5300 50  0001 C CNN
F 3 "" H 3050 5300 50  0001 C CNN
	1    3050 5300
	1    0    0    -1  
$EndComp
Wire Wire Line
	3050 5300 3050 5200
Wire Wire Line
	3050 5200 2850 5200
Wire Wire Line
	1250 5300 1350 5300
Wire Wire Line
	1050 5200 1350 5200
Wire Wire Line
	1250 4800 1350 4800
Wire Wire Line
	1250 4400 1350 4400
Wire Wire Line
	1350 4500 1250 4500
Wire Wire Line
	1250 4600 1350 4600
Wire Wire Line
	1250 4700 1350 4700
$Comp
L Connector_Generic:Conn_01x03 J3
U 1 1 5BA9410C
P 7100 3800
F 0 "J3" H 7179 3842 50  0000 L CNN
F 1 "serial" H 7179 3751 50  0000 L CNN
F 2 "Connectors_Molex.pretty:Molex_KK-6410-03_03x2.54mm_Straight" H 7100 3800 50  0001 C CNN
F 3 "~" H 7100 3800 50  0001 C CNN
	1    7100 3800
	1    0    0    -1  
$EndComp
Text GLabel 6750 3800 0    60   Input ~ 0
RX
Text GLabel 6750 3900 0    60   Input ~ 0
TX
$Comp
L power:GND #PWR0108
U 1 1 5BA9422F
P 6550 3700
F 0 "#PWR0108" H 6550 3450 50  0001 C CNN
F 1 "GND" V 6555 3572 50  0000 R CNN
F 2 "" H 6550 3700 50  0001 C CNN
F 3 "" H 6550 3700 50  0001 C CNN
	1    6550 3700
	0    1    1    0   
$EndComp
Wire Wire Line
	6550 3700 6900 3700
Wire Wire Line
	6900 3800 6750 3800
Wire Wire Line
	6750 3900 6900 3900
Wire Wire Line
	10200 5550 10200 5650
Connection ~ 10200 5650
Wire Wire Line
	10200 5650 10200 5950
$Comp
L Device:CP_Small C2
U 1 1 5BAAFD26
P 10100 5750
F 0 "C2" H 10350 5950 50  0000 L CNN
F 1 "220 uF / 35V" H 10400 6050 50  0000 L CNN
F 2 "Capacitors_THT.pretty:CP_Radial_D8.0mm_P5.00mm" H 10100 5750 50  0001 C CNN
F 3 "~" H 10100 5750 50  0001 C CNN
	1    10100 5750
	-1   0    0    1   
$EndComp
Wire Wire Line
	10100 5650 10200 5650
Wire Wire Line
	10100 5950 10100 5850
Wire Wire Line
	9900 5850 9900 5750
$Comp
L Device:CP_Small C3
U 1 1 5BABA95F
P 10300 5750
F 0 "C3" H 9950 5850 50  0000 R CNN
F 1 "220 uF / 35 V" H 10200 6000 50  0000 R CNN
F 2 "Capacitors_THT.pretty:CP_Radial_D8.0mm_P5.00mm" H 10300 5750 50  0001 C CNN
F 3 "~" H 10300 5750 50  0001 C CNN
	1    10300 5750
	-1   0    0    1   
$EndComp
Connection ~ 10100 5650
Connection ~ 10100 5850
Wire Wire Line
	9900 5650 10100 5650
Wire Wire Line
	9900 5850 10100 5850
Wire Wire Line
	10300 5950 10300 5900
Wire Wire Line
	10200 5650 10300 5650
Wire Wire Line
	10550 5650 10550 5900
Wire Wire Line
	10550 5900 10300 5900
Connection ~ 10300 5900
Wire Wire Line
	10300 5900 10300 5850
$Comp
L Device:CP_Small C1
U 1 1 5BADF208
P 5400 6650
F 0 "C1" H 5200 6800 50  0000 R CNN
F 1 "220 uF / 35 V" H 5300 6900 50  0000 R CNN
F 2 "Capacitors_THT.pretty:CP_Radial_D8.0mm_P5.00mm" H 5400 6650 50  0001 C CNN
F 3 "~" H 5400 6650 50  0001 C CNN
	1    5400 6650
	-1   0    0    1   
$EndComp
Wire Wire Line
	5400 6550 5300 6550
Connection ~ 5300 6550
Wire Wire Line
	5300 6550 5300 6850
Wire Wire Line
	5400 6850 5400 6800
Wire Wire Line
	5550 6700 5550 6800
Wire Wire Line
	5550 6800 5400 6800
Connection ~ 5400 6800
Wire Wire Line
	5400 6800 5400 6750
Text Notes 2850 7150 0    60   ~ 0
TX\n5\nTX\n2\n2\nRX\n  
Text Notes 2400 7050 0    60   ~ 0
Master\nRJ45\nPower\nKK4\nKK4\nShutter
Wire Notes Line
	11050 5350 11050 6400
Wire Notes Line
	11050 6400 9150 6400
Wire Notes Line
	9150 6400 9150 5350
Wire Notes Line
	9150 5350 11050 5350
Text Notes 9200 6350 0    60   ~ 0
POE / 12V option
Wire Notes Line
	11150 5250 11150 1750
Wire Notes Line
	11150 1750 8900 1750
Wire Notes Line
	8900 1750 8900 5250
Wire Notes Line
	8900 5250 11150 5250
Text Notes 9000 2000 0    60   ~ 0
Ethernet option\nMount only one module
Text Notes 2300 6350 0    60   ~ 0
Shutter bus connections
Wire Notes Line
	3450 6200 3450 7100
Wire Notes Line
	3450 7100 2250 7100
Wire Notes Line
	2250 7100 2250 6200
Wire Notes Line
	2250 6200 3450 6200
$EndSCHEMATC
