EESchema Schematic File Version 2
LIBS:power
LIBS:device
LIBS:transistors
LIBS:conn
LIBS:linear
LIBS:regul
LIBS:74xx
LIBS:cmos4000
LIBS:adc-dac
LIBS:memory
LIBS:xilinx
LIBS:microcontrollers
LIBS:dsp
LIBS:microchip
LIBS:analog_switches
LIBS:motorola
LIBS:texas
LIBS:intel
LIBS:audio
LIBS:interface
LIBS:digital-audio
LIBS:philips
LIBS:display
LIBS:cypress
LIBS:siliconi
LIBS:opto
LIBS:atmel
LIBS:contrib
LIBS:valves
LIBS:promicro
LIBS:micro-finger-cache
EELAYER 25 0
EELAYER END
$Descr A4 11693 8268
encoding utf-8
Sheet 1 1
Title ""
Date ""
Rev ""
Comp ""
Comment1 ""
Comment2 ""
Comment3 ""
Comment4 ""
$EndDescr
$Comp
L promicro M?
U 1 1 5A907767
P 3700 1400
F 0 "M?" H 4050 -950 60  0000 C CNN
F 1 "promicro" H 4050 1550 60  0000 C CNN
F 2 "" H 3700 1700 60  0000 C CNN
F 3 "" H 3700 1700 60  0000 C CNN
	1    3700 1400
	1    0    0    -1  
$EndComp
$Comp
L stepstick M?
U 1 1 5A9077BE
P 7150 1300
F 0 "M?" H 7500 -150 60  0000 C CNN
F 1 "stepstick" H 7500 1400 60  0000 C CNN
F 2 "" H 7150 1300 60  0000 C CNN
F 3 "" H 7150 1300 60  0000 C CNN
	1    7150 1300
	1    0    0    -1  
$EndComp
Text GLabel 3300 1400 0    60   Input ~ 0
PD3
Text GLabel 3300 1600 0    60   Input ~ 0
PD2
Text GLabel 3300 2200 0    60   Input ~ 0
PD1
Text GLabel 3300 2400 0    60   Input ~ 0
PD0
Text GLabel 3300 2600 0    60   Input ~ 0
PD4
Text GLabel 3300 2800 0    60   Input ~ 0
PD6
Text GLabel 3300 3000 0    60   Input ~ 0
PD7
Text GLabel 3300 3200 0    60   Input ~ 0
PE6
Text GLabel 3300 3400 0    60   Input ~ 0
PB4
Text GLabel 3300 3600 0    60   Input ~ 0
PB5
Text GLabel 4800 1800 2    60   Input ~ 0
~RESET
Text GLabel 4800 2200 2    60   Input ~ 0
PF4
Text GLabel 4800 2400 2    60   Input ~ 0
PF5
Text GLabel 4800 2600 2    60   Input ~ 0
PF6
Text GLabel 4800 2800 2    60   Input ~ 0
PF7
Text GLabel 4800 3000 2    60   Input ~ 0
SCK
Text GLabel 4800 3200 2    60   Input ~ 0
MISO
Text GLabel 4800 3400 2    60   Input ~ 0
MOSI
Text GLabel 4800 3600 2    60   Input ~ 0
PB6
Wire Wire Line
	4800 3600 4600 3600
Wire Wire Line
	4600 3400 4800 3400
Wire Wire Line
	4800 3200 4600 3200
Wire Wire Line
	4600 3000 4800 3000
Wire Wire Line
	4800 2800 4600 2800
Wire Wire Line
	4600 2600 4800 2600
Wire Wire Line
	4800 2400 4600 2400
Wire Wire Line
	4600 2200 4800 2200
Wire Wire Line
	4800 1800 4600 1800
Wire Wire Line
	3500 1400 3300 1400
Wire Wire Line
	3300 1600 3500 1600
Wire Wire Line
	3500 2200 3300 2200
Wire Wire Line
	3300 2400 3500 2400
Wire Wire Line
	3500 2600 3300 2600
Wire Wire Line
	3300 2800 3500 2800
Wire Wire Line
	3500 3000 3300 3000
Wire Wire Line
	3300 3200 3500 3200
Wire Wire Line
	3500 3400 3300 3400
Wire Wire Line
	3300 3600 3500 3600
$Comp
L GND #PWR?
U 1 1 5A9079DD
P 3300 1800
F 0 "#PWR?" H 3300 1550 50  0001 C CNN
F 1 "GND" H 3300 1650 50  0000 C CNN
F 2 "" H 3300 1800 50  0000 C CNN
F 3 "" H 3300 1800 50  0000 C CNN
	1    3300 1800
	0    1    1    0   
$EndComp
$Comp
L GND #PWR?
U 1 1 5A907A26
P 4750 1600
F 0 "#PWR?" H 4750 1350 50  0001 C CNN
F 1 "GND" H 4750 1450 50  0000 C CNN
F 2 "" H 4750 1600 50  0000 C CNN
F 3 "" H 4750 1600 50  0000 C CNN
	1    4750 1600
	0    -1   -1   0   
$EndComp
Wire Wire Line
	4750 1600 4600 1600
Wire Wire Line
	3300 1800 3500 1800
$Comp
L GND #PWR?
U 1 1 5A907AC4
P 3300 2000
F 0 "#PWR?" H 3300 1750 50  0001 C CNN
F 1 "GND" H 3300 1850 50  0000 C CNN
F 2 "" H 3300 2000 50  0000 C CNN
F 3 "" H 3300 2000 50  0000 C CNN
	1    3300 2000
	0    1    1    0   
$EndComp
Wire Wire Line
	3300 2000 3500 2000
$Comp
L +5V #PWR?
U 1 1 5A907AF5
P 4750 2000
F 0 "#PWR?" H 4750 1850 50  0001 C CNN
F 1 "+5V" H 4750 2140 50  0000 C CNN
F 2 "" H 4750 2000 50  0000 C CNN
F 3 "" H 4750 2000 50  0000 C CNN
	1    4750 2000
	0    1    1    0   
$EndComp
Wire Wire Line
	4750 2000 4600 2000
$Comp
L +12V #PWR?
U 1 1 5A907B27
P 4750 1400
F 0 "#PWR?" H 4750 1250 50  0001 C CNN
F 1 "+12V" H 4750 1540 50  0000 C CNN
F 2 "" H 4750 1400 50  0000 C CNN
F 3 "" H 4750 1400 50  0000 C CNN
	1    4750 1400
	0    1    1    0   
$EndComp
Wire Wire Line
	4750 1400 4600 1400
$Comp
L +12V #PWR?
U 1 1 5A907B5E
P 8350 1050
F 0 "#PWR?" H 8350 900 50  0001 C CNN
F 1 "+12V" H 8350 1190 50  0000 C CNN
F 2 "" H 8350 1050 50  0000 C CNN
F 3 "" H 8350 1050 50  0000 C CNN
	1    8350 1050
	1    0    0    -1  
$EndComp
$Comp
L GND #PWR?
U 1 1 5A907B76
P 8350 1550
F 0 "#PWR?" H 8350 1300 50  0001 C CNN
F 1 "GND" H 8350 1400 50  0000 C CNN
F 2 "" H 8350 1550 50  0000 C CNN
F 3 "" H 8350 1550 50  0000 C CNN
	1    8350 1550
	1    0    0    -1  
$EndComp
$Comp
L +5V #PWR?
U 1 1 5A907B8E
P 8300 2500
F 0 "#PWR?" H 8300 2350 50  0001 C CNN
F 1 "+5V" H 8300 2640 50  0000 C CNN
F 2 "" H 8300 2500 50  0000 C CNN
F 3 "" H 8300 2500 50  0000 C CNN
	1    8300 2500
	0    1    1    0   
$EndComp
$Comp
L GND #PWR?
U 1 1 5A907BA6
P 8300 2700
F 0 "#PWR?" H 8300 2450 50  0001 C CNN
F 1 "GND" H 8300 2550 50  0000 C CNN
F 2 "" H 8300 2700 50  0000 C CNN
F 3 "" H 8300 2700 50  0000 C CNN
	1    8300 2700
	0    -1   -1   0   
$EndComp
Wire Wire Line
	8300 2700 8000 2700
Wire Wire Line
	8000 2500 8300 2500
$Comp
L CONN_01X04 P?
U 1 1 5A907C3C
P 8350 2050
F 0 "P?" H 8350 2300 50  0000 C CNN
F 1 "X-MOTOR" V 8450 2050 50  0000 C CNN
F 2 "" H 8350 2050 50  0000 C CNN
F 3 "" H 8350 2050 50  0000 C CNN
	1    8350 2050
	1    0    0    -1  
$EndComp
Wire Wire Line
	8000 1700 8150 1700
Wire Wire Line
	8150 1700 8150 1900
Wire Wire Line
	8150 2200 8150 2300
Wire Wire Line
	8150 2300 8000 2300
$Comp
L Jumper_NO_Small JP?
U 1 1 5A907F01
P 6600 1700
F 0 "JP?" H 6600 1780 50  0000 C CNN
F 1 "Jumper_NO_Small" H 6610 1640 50  0001 C CNN
F 2 "" H 6600 1700 50  0000 C CNN
F 3 "" H 6600 1700 50  0000 C CNN
	1    6600 1700
	1    0    0    -1  
$EndComp
$Comp
L Jumper_NO_Small JP?
U 1 1 5A907F24
P 6600 1900
F 0 "JP?" H 6600 1980 50  0000 C CNN
F 1 "Jumper_NO_Small" H 6610 1840 50  0001 C CNN
F 2 "" H 6600 1900 50  0000 C CNN
F 3 "" H 6600 1900 50  0000 C CNN
	1    6600 1900
	1    0    0    -1  
$EndComp
$Comp
L Jumper_NC_Small JP?
U 1 1 5A907F6D
P 6600 1500
F 0 "JP?" H 6600 1580 50  0000 C CNN
F 1 "Jumper_NC_Small" H 6610 1440 50  0001 C CNN
F 2 "" H 6600 1500 50  0000 C CNN
F 3 "" H 6600 1500 50  0000 C CNN
	1    6600 1500
	1    0    0    -1  
$EndComp
Wire Wire Line
	6950 2100 6800 2100
Wire Wire Line
	6800 2100 6800 2300
Wire Wire Line
	6800 2300 6950 2300
Wire Wire Line
	6700 1500 6950 1500
Wire Wire Line
	6700 1700 6950 1700
Wire Wire Line
	6950 1900 6700 1900
$Comp
L +5V #PWR?
U 1 1 5A908076
P 6300 850
F 0 "#PWR?" H 6300 700 50  0001 C CNN
F 1 "+5V" H 6300 990 50  0000 C CNN
F 2 "" H 6300 850 50  0000 C CNN
F 3 "" H 6300 850 50  0000 C CNN
	1    6300 850 
	1    0    0    -1  
$EndComp
Wire Wire Line
	6300 850  6300 1900
Wire Wire Line
	6300 1700 6500 1700
Wire Wire Line
	6300 1900 6500 1900
Connection ~ 6300 1700
Text GLabel 6650 1300 0    60   Input ~ 0
PF4
Text GLabel 6650 2500 0    60   Input ~ 0
PF5
Text GLabel 6650 2700 0    60   Input ~ 0
PF6
Wire Wire Line
	6650 2700 6950 2700
Wire Wire Line
	6950 2500 6650 2500
Wire Wire Line
	6650 1300 6950 1300
Text Notes 5100 2250 0    60   ~ 0
Motor Enable\n
Text Notes 5100 2450 0    60   ~ 0
Motor Step
Text Notes 5100 2650 0    60   ~ 0
Motor Dir
$Comp
L R R?
U 1 1 5A9082BE
P 6900 1050
F 0 "R?" V 6980 1050 50  0000 C CNN
F 1 "100k" V 6900 1050 50  0000 C CNN
F 2 "" V 6830 1050 50  0000 C CNN
F 3 "" H 6900 1050 50  0000 C CNN
	1    6900 1050
	1    0    0    -1  
$EndComp
$Comp
L R R?
U 1 1 5A908327
P 6750 1050
F 0 "R?" V 6830 1050 50  0000 C CNN
F 1 "10k" V 6750 1050 50  0000 C CNN
F 2 "" V 6680 1050 50  0000 C CNN
F 3 "" H 6750 1050 50  0000 C CNN
	1    6750 1050
	1    0    0    -1  
$EndComp
Wire Wire Line
	6900 1200 6900 1500
Connection ~ 6900 1500
Wire Wire Line
	6750 1200 6750 1300
Connection ~ 6750 1300
Wire Wire Line
	6750 900  6300 900 
Connection ~ 6300 900 
Wire Wire Line
	6500 1500 6300 1500
Connection ~ 6300 1500
$Comp
L GND #PWR?
U 1 1 5A90849E
P 6900 850
F 0 "#PWR?" H 6900 600 50  0001 C CNN
F 1 "GND" H 6900 700 50  0000 C CNN
F 2 "" H 6900 850 50  0000 C CNN
F 3 "" H 6900 850 50  0000 C CNN
	1    6900 850 
	-1   0    0    1   
$EndComp
Wire Wire Line
	6900 850  6900 900 
$Comp
L CP C?
U 1 1 5A9085B2
P 8350 1300
F 0 "C?" H 8375 1400 50  0000 L CNN
F 1 "100uF" H 8375 1200 50  0000 L CNN
F 2 "" H 8388 1150 50  0000 C CNN
F 3 "" H 8350 1300 50  0000 C CNN
	1    8350 1300
	1    0    0    -1  
$EndComp
Wire Wire Line
	8000 2100 8150 2100
Wire Wire Line
	8150 2000 8000 2000
Wire Wire Line
	8000 2000 8000 1900
Wire Wire Line
	8350 1050 8350 1150
Wire Wire Line
	8350 1450 8350 1550
Wire Wire Line
	8350 1500 8000 1500
Connection ~ 8350 1500
Wire Wire Line
	8000 1300 8000 1100
Wire Wire Line
	8000 1100 8350 1100
Connection ~ 8350 1100
Text Notes 7700 3300 0    60   ~ 0
GND
Text Notes 7700 3400 0    60   ~ 0
+5V
Text Notes 7700 3500 0    60   ~ 0
LCD CS
Text Notes 7700 3600 0    60   ~ 0
LCD MOSI
Text Notes 7700 3700 0    60   ~ 0
LCD SCK
$Comp
L GND #PWR?
U 1 1 5A908C9F
P 7150 3300
F 0 "#PWR?" H 7150 3050 50  0001 C CNN
F 1 "GND" H 7150 3150 50  0000 C CNN
F 2 "" H 7150 3300 50  0000 C CNN
F 3 "" H 7150 3300 50  0000 C CNN
	1    7150 3300
	0    1    1    0   
$EndComp
Wire Wire Line
	7150 3300 7300 3300
$Comp
L +5V #PWR?
U 1 1 5A908D11
P 7000 3400
F 0 "#PWR?" H 7000 3250 50  0001 C CNN
F 1 "+5V" H 7000 3540 50  0000 C CNN
F 2 "" H 7000 3400 50  0000 C CNN
F 3 "" H 7000 3400 50  0000 C CNN
	1    7000 3400
	0    -1   -1   0   
$EndComp
Wire Wire Line
	7000 3400 7300 3400
Text GLabel 7150 3700 0    60   Input ~ 0
SCK
Text GLabel 6900 3600 0    60   Input ~ 0
MOSI
Text GLabel 7150 3500 0    60   Input ~ 0
PF7
Wire Wire Line
	7150 3500 7300 3500
Wire Wire Line
	6900 3600 7300 3600
Wire Wire Line
	7300 3700 7150 3700
Text Notes 5100 2850 0    60   ~ 0
LCD CS
$Comp
L CONN_02X03 P?
U 1 1 5A91571E
P 1800 1650
F 0 "P?" H 1800 1850 50  0000 C CNN
F 1 "ISP" H 1800 1450 50  0000 C CNN
F 2 "" H 1800 450 50  0000 C CNN
F 3 "" H 1800 450 50  0000 C CNN
	1    1800 1650
	1    0    0    -1  
$EndComp
Text GLabel 1400 1550 0    60   Input ~ 0
MISO
Text GLabel 1050 1650 0    60   Input ~ 0
SCK
Text GLabel 1400 1750 0    60   Input ~ 0
~RESET
Text GLabel 2200 1650 2    60   Input ~ 0
MOSI
Wire Wire Line
	2050 1650 2200 1650
Wire Wire Line
	1550 1550 1400 1550
Wire Wire Line
	1050 1650 1550 1650
Wire Wire Line
	1550 1750 1400 1750
$Comp
L +5V #PWR?
U 1 1 5A91597F
P 2150 1400
F 0 "#PWR?" H 2150 1250 50  0001 C CNN
F 1 "+5V" H 2150 1540 50  0000 C CNN
F 2 "" H 2150 1400 50  0000 C CNN
F 3 "" H 2150 1400 50  0000 C CNN
	1    2150 1400
	1    0    0    -1  
$EndComp
Wire Wire Line
	2150 1400 2150 1550
Wire Wire Line
	2150 1550 2050 1550
$Comp
L GND #PWR?
U 1 1 5A9159FE
P 2150 1900
F 0 "#PWR?" H 2150 1650 50  0001 C CNN
F 1 "GND" H 2150 1750 50  0000 C CNN
F 2 "" H 2150 1900 50  0000 C CNN
F 3 "" H 2150 1900 50  0000 C CNN
	1    2150 1900
	1    0    0    -1  
$EndComp
Wire Wire Line
	2150 1900 2150 1750
Wire Wire Line
	2150 1750 2050 1750
Text Notes 7700 3800 0    60   ~ 0
LCD Contrast
Text Notes 7700 4500 0    60   ~ 0
Encoder Button
Text Notes 7700 4600 0    60   ~ 0
Encoder A
Text Notes 7700 4700 0    60   ~ 0
Encoder B
Text Notes 7700 4800 0    60   ~ 0
Stop
$Comp
L POT RV?
U 1 1 5A915DB4
P 6450 3800
F 0 "RV?" H 6450 3720 50  0000 C CNN
F 1 "POT" H 6450 3800 50  0000 C CNN
F 2 "" H 6450 3800 50  0000 C CNN
F 3 "" H 6450 3800 50  0000 C CNN
	1    6450 3800
	0    1    1    0   
$EndComp
Wire Wire Line
	6600 3800 7300 3800
$Comp
L +5V #PWR?
U 1 1 5ABBBC34
P 6450 3550
F 0 "#PWR?" H 6450 3400 50  0001 C CNN
F 1 "+5V" H 6450 3690 50  0000 C CNN
F 2 "" H 6450 3550 50  0000 C CNN
F 3 "" H 6450 3550 50  0000 C CNN
	1    6450 3550
	1    0    0    -1  
$EndComp
Wire Wire Line
	6450 3550 6450 3650
$Comp
L GND #PWR?
U 1 1 5ABBBCBA
P 6450 4050
F 0 "#PWR?" H 6450 3800 50  0001 C CNN
F 1 "GND" H 6450 3900 50  0000 C CNN
F 2 "" H 6450 4050 50  0000 C CNN
F 3 "" H 6450 4050 50  0000 C CNN
	1    6450 4050
	1    0    0    -1  
$EndComp
Wire Wire Line
	6450 4050 6450 3950
$Comp
L CONN_01X06 P?
U 1 1 5ABBBE34
P 7500 3550
F 0 "P?" H 7500 3900 50  0000 C CNN
F 1 "LCD" V 7600 3550 50  0000 C CNN
F 2 "" H 7500 3550 50  0000 C CNN
F 3 "" H 7500 3550 50  0000 C CNN
	1    7500 3550
	1    0    0    -1  
$EndComp
$Comp
L CONN_01X05 P?
U 1 1 5ABBBE7D
P 7500 4550
F 0 "P?" H 7500 4850 50  0000 C CNN
F 1 "Inputs" V 7600 4550 50  0000 C CNN
F 2 "" H 7500 4550 50  0000 C CNN
F 3 "" H 7500 4550 50  0000 C CNN
	1    7500 4550
	1    0    0    -1  
$EndComp
$Comp
L GND #PWR?
U 1 1 5ABBBEC6
P 7150 4350
F 0 "#PWR?" H 7150 4100 50  0001 C CNN
F 1 "GND" H 7150 4200 50  0000 C CNN
F 2 "" H 7150 4350 50  0000 C CNN
F 3 "" H 7150 4350 50  0000 C CNN
	1    7150 4350
	0    1    1    0   
$EndComp
Wire Wire Line
	7150 4350 7300 4350
Text GLabel 7000 4450 0    60   Input ~ 0
PD0
Text GLabel 6700 4550 0    60   Input ~ 0
PD1
Text GLabel 7000 4650 0    60   Input ~ 0
PD2
Text GLabel 6700 4750 0    60   Input ~ 0
PD3
Wire Wire Line
	6700 4750 7300 4750
Wire Wire Line
	7300 4650 7000 4650
Wire Wire Line
	6700 4550 7300 4550
Wire Wire Line
	7300 4450 7000 4450
Text Notes 3050 2450 2    60   ~ 0
Encoder Button
Text Notes 3050 2250 2    60   ~ 0
Encoder A
Text Notes 3050 1650 2    60   ~ 0
Encoder B
Text Notes 3050 1450 2    60   ~ 0
Stop
$Comp
L CONN_01X03 P?
U 1 1 5ABBC449
P 7500 5200
F 0 "P?" H 7500 5400 50  0000 C CNN
F 1 "CONN_01X03" V 7600 5200 50  0000 C CNN
F 2 "" H 7500 5200 50  0000 C CNN
F 3 "" H 7500 5200 50  0000 C CNN
	1    7500 5200
	1    0    0    -1  
$EndComp
$EndSCHEMATC
