EESchema Schematic File Version 4
LIBS:micro-finger-cache
EELAYER 26 0
EELAYER END
$Descr A4 11693 8268
encoding utf-8
Sheet 1 1
Title ""
Date ""
Rev ""
Comp ""
Comment1 ""
Comment2 ""
Comment3 ""
Comment4 ""
$EndDescr
$Comp
L promicro:promicro M2
U 1 1 5A907767
P 3700 1400
F 0 "M2" H 4050 -950 60  0000 C CNN
F 1 "promicro" H 4050 1550 60  0000 C CNN
F 2 "micro:promicro-DIP-24" H 3700 1700 60  0001 C CNN
F 3 "" H 3700 1700 60  0000 C CNN
	1    3700 1400
	1    0    0    -1  
$EndComp
$Comp
L promicro:stepstick M3
U 1 1 5A9077BE
P 7150 1300
F 0 "M3" H 7500 -150 60  0000 C CNN
F 1 "stepstick" H 7500 1400 60  0000 C CNN
F 2 "micro:stepstick" H 7150 1300 60  0001 C CNN
F 3 "" H 7150 1300 60  0000 C CNN
	1    7150 1300
	1    0    0    -1  
$EndComp
Text GLabel 3300 1400 0    60   Input ~ 0
TX
Text GLabel 3300 1600 0    60   Input ~ 0
RX
Text GLabel 3300 2200 0    60   Input ~ 0
PD1
Text GLabel 3300 2400 0    60   Input ~ 0
PD0
Text GLabel 3300 2600 0    60   Input ~ 0
PD4
Text GLabel 3300 2800 0    60   Input ~ 0
PC6
Text GLabel 3300 3000 0    60   Input ~ 0
PD7
Text GLabel 3300 3200 0    60   Input ~ 0
PE6
Text GLabel 3300 3400 0    60   Input ~ 0
PB4
Text GLabel 3300 3600 0    60   Input ~ 0
PB5
Text GLabel 4800 1800 2    60   Input ~ 0
~RESET
Text GLabel 4800 2200 2    60   Input ~ 0
PF4
Text GLabel 4800 2400 2    60   Input ~ 0
PF5
Text GLabel 4800 2600 2    60   Input ~ 0
PF6
Text GLabel 4800 2800 2    60   Input ~ 0
PF7
Text GLabel 4800 3000 2    60   Input ~ 0
SCK
Text GLabel 4800 3200 2    60   Input ~ 0
MISO
Text GLabel 4800 3400 2    60   Input ~ 0
MOSI
Text GLabel 4800 3600 2    60   Input ~ 0
PB6
Wire Wire Line
	4800 3600 4600 3600
Wire Wire Line
	4600 3400 4800 3400
Wire Wire Line
	4800 3200 4600 3200
Wire Wire Line
	4600 3000 4800 3000
Wire Wire Line
	4800 2800 4600 2800
Wire Wire Line
	4600 2600 4800 2600
Wire Wire Line
	4800 2400 4600 2400
Wire Wire Line
	4600 2200 4800 2200
Wire Wire Line
	4800 1800 4600 1800
Wire Wire Line
	3500 1400 3300 1400
Wire Wire Line
	3300 1600 3500 1600
Wire Wire Line
	3500 2200 3300 2200
Wire Wire Line
	3300 2400 3500 2400
Wire Wire Line
	3500 2600 3300 2600
Wire Wire Line
	3300 2800 3500 2800
Wire Wire Line
	3500 3000 3300 3000
Wire Wire Line
	3300 3200 3500 3200
Wire Wire Line
	3500 3400 3300 3400
Wire Wire Line
	3300 3600 3500 3600
$Comp
L power:GND #PWR0101
U 1 1 5A9079DD
P 3300 1800
F 0 "#PWR0101" H 3300 1550 50  0001 C CNN
F 1 "GND" H 3300 1650 50  0000 C CNN
F 2 "" H 3300 1800 50  0000 C CNN
F 3 "" H 3300 1800 50  0000 C CNN
	1    3300 1800
	0    1    1    0   
$EndComp
$Comp
L power:GND #PWR0102
U 1 1 5A907A26
P 4750 1600
F 0 "#PWR0102" H 4750 1350 50  0001 C CNN
F 1 "GND" H 4750 1450 50  0000 C CNN
F 2 "" H 4750 1600 50  0000 C CNN
F 3 "" H 4750 1600 50  0000 C CNN
	1    4750 1600
	0    -1   -1   0   
$EndComp
Wire Wire Line
	4750 1600 4600 1600
Wire Wire Line
	3300 1800 3500 1800
$Comp
L power:GND #PWR0103
U 1 1 5A907AC4
P 3300 2000
F 0 "#PWR0103" H 3300 1750 50  0001 C CNN
F 1 "GND" H 3300 1850 50  0000 C CNN
F 2 "" H 3300 2000 50  0000 C CNN
F 3 "" H 3300 2000 50  0000 C CNN
	1    3300 2000
	0    1    1    0   
$EndComp
Wire Wire Line
	3300 2000 3500 2000
$Comp
L power:+5V #PWR0104
U 1 1 5A907AF5
P 4800 1400
F 0 "#PWR0104" H 4800 1250 50  0001 C CNN
F 1 "+5V" H 4800 1540 50  0000 C CNN
F 2 "" H 4800 1400 50  0000 C CNN
F 3 "" H 4800 1400 50  0000 C CNN
	1    4800 1400
	0    1    1    0   
$EndComp
$Comp
L power:+12V #PWR0105
U 1 1 5A907B5E
P 8150 1300
F 0 "#PWR0105" H 8150 1150 50  0001 C CNN
F 1 "+12V" H 8150 1440 50  0000 C CNN
F 2 "" H 8150 1300 50  0000 C CNN
F 3 "" H 8150 1300 50  0000 C CNN
	1    8150 1300
	1    0    0    -1  
$EndComp
$Comp
L power:GND #PWR0106
U 1 1 5A907B76
P 8150 1500
F 0 "#PWR0106" H 8150 1250 50  0001 C CNN
F 1 "GND" H 8150 1350 50  0000 C CNN
F 2 "" H 8150 1500 50  0000 C CNN
F 3 "" H 8150 1500 50  0000 C CNN
	1    8150 1500
	1    0    0    -1  
$EndComp
$Comp
L power:+5V #PWR0107
U 1 1 5A907B8E
P 8300 2500
F 0 "#PWR0107" H 8300 2350 50  0001 C CNN
F 1 "+5V" H 8300 2640 50  0000 C CNN
F 2 "" H 8300 2500 50  0000 C CNN
F 3 "" H 8300 2500 50  0000 C CNN
	1    8300 2500
	0    1    1    0   
$EndComp
$Comp
L power:GND #PWR0108
U 1 1 5A907BA6
P 8300 2700
F 0 "#PWR0108" H 8300 2450 50  0001 C CNN
F 1 "GND" H 8300 2550 50  0000 C CNN
F 2 "" H 8300 2700 50  0000 C CNN
F 3 "" H 8300 2700 50  0000 C CNN
	1    8300 2700
	0    -1   -1   0   
$EndComp
Wire Wire Line
	8300 2700 8000 2700
Wire Wire Line
	8000 2500 8300 2500
$Comp
L micro-finger-rescue:CONN_01X04 P2
U 1 1 5A907C3C
P 8350 2050
F 0 "P2" H 8350 2300 50  0000 C CNN
F 1 "X-MOTOR" V 8450 2050 50  0000 C CNN
F 2 "Connectors_Molex.pretty:Molex_KK-6410-04_04x2.54mm_Straight" H 8350 2050 50  0001 C CNN
F 3 "" H 8350 2050 50  0000 C CNN
	1    8350 2050
	1    0    0    -1  
$EndComp
Wire Wire Line
	8000 1700 8150 1700
Wire Wire Line
	8150 1700 8150 1900
Wire Wire Line
	8150 2200 8150 2300
Wire Wire Line
	8150 2300 8000 2300
$Comp
L micro-finger-rescue:Jumper_NO_Small MS2
U 1 1 5A907F01
P 6600 1700
F 0 "MS2" H 6600 1780 50  0000 C CNN
F 1 "Jumper_NO_Small" H 6610 1640 50  0001 C CNN
F 2 "Jumper:SolderJumper-2_P1.3mm_Open_RoundedPad1.0x1.5mm" H 6600 1700 50  0001 C CNN
F 3 "" H 6600 1700 50  0000 C CNN
	1    6600 1700
	1    0    0    -1  
$EndComp
$Comp
L micro-finger-rescue:Jumper_NO_Small MS3
U 1 1 5A907F24
P 6600 1900
F 0 "MS3" H 6600 1980 50  0000 C CNN
F 1 "Jumper_NO_Small" H 6610 1840 50  0001 C CNN
F 2 "Jumper:SolderJumper-2_P1.3mm_Open_RoundedPad1.0x1.5mm" H 6600 1900 50  0001 C CNN
F 3 "" H 6600 1900 50  0000 C CNN
	1    6600 1900
	1    0    0    -1  
$EndComp
$Comp
L micro-finger-rescue:Jumper_NC_Small MS1
U 1 1 5A907F6D
P 6600 1500
F 0 "MS1" H 6600 1580 50  0000 C CNN
F 1 "Jumper_NC_Small" H 6610 1440 50  0001 C CNN
F 2 "Jumper:SolderJumper-2_P1.3mm_Bridged_RoundedPad1.0x1.5mm" H 6600 1500 50  0001 C CNN
F 3 "" H 6600 1500 50  0000 C CNN
	1    6600 1500
	1    0    0    -1  
$EndComp
Wire Wire Line
	6950 2100 6800 2100
Wire Wire Line
	6800 2100 6800 2300
Wire Wire Line
	6800 2300 6950 2300
Wire Wire Line
	6700 1500 6900 1500
Wire Wire Line
	6700 1700 6950 1700
Wire Wire Line
	6950 1900 6700 1900
$Comp
L power:+5V #PWR0109
U 1 1 5A908076
P 6300 850
F 0 "#PWR0109" H 6300 700 50  0001 C CNN
F 1 "+5V" H 6300 990 50  0000 C CNN
F 2 "" H 6300 850 50  0000 C CNN
F 3 "" H 6300 850 50  0000 C CNN
	1    6300 850 
	1    0    0    -1  
$EndComp
Wire Wire Line
	6300 850  6300 900 
Wire Wire Line
	6300 1700 6500 1700
Wire Wire Line
	6300 1900 6500 1900
Connection ~ 6300 1700
Text GLabel 6650 1300 0    60   Input ~ 0
PF4
Text GLabel 6650 2500 0    60   Input ~ 0
PF5
Text GLabel 6650 2700 0    60   Input ~ 0
PF6
Wire Wire Line
	6650 2700 6950 2700
Wire Wire Line
	6950 2500 6650 2500
Wire Wire Line
	6650 1300 6750 1300
Text Notes 5100 2250 0    60   ~ 0
Motor Enable\n
Text Notes 5100 2450 0    60   ~ 0
Motor Step
Text Notes 5100 2650 0    60   ~ 0
Motor Dir
$Comp
L micro-finger-rescue:R R2
U 1 1 5A9082BE
P 6900 1050
F 0 "R2" V 6980 1050 50  0000 C CNN
F 1 "100k" V 6900 1050 50  0000 C CNN
F 2 "Discret.pretty:R1" V 6830 1050 50  0001 C CNN
F 3 "" H 6900 1050 50  0000 C CNN
	1    6900 1050
	1    0    0    -1  
$EndComp
$Comp
L micro-finger-rescue:R R1
U 1 1 5A908327
P 6750 1050
F 0 "R1" V 6830 1050 50  0000 C CNN
F 1 "10k" V 6750 1050 50  0000 C CNN
F 2 "Discret.pretty:R1" V 6680 1050 50  0001 C CNN
F 3 "" H 6750 1050 50  0000 C CNN
	1    6750 1050
	1    0    0    -1  
$EndComp
Wire Wire Line
	6900 1200 6900 1500
Connection ~ 6900 1500
Wire Wire Line
	6750 1200 6750 1300
Connection ~ 6750 1300
Wire Wire Line
	6750 900  6300 900 
Connection ~ 6300 900 
Wire Wire Line
	6500 1500 6300 1500
Connection ~ 6300 1500
$Comp
L power:GND #PWR0110
U 1 1 5A90849E
P 6900 850
F 0 "#PWR0110" H 6900 600 50  0001 C CNN
F 1 "GND" H 6900 700 50  0000 C CNN
F 2 "" H 6900 850 50  0000 C CNN
F 3 "" H 6900 850 50  0000 C CNN
	1    6900 850 
	-1   0    0    1   
$EndComp
Wire Wire Line
	6900 850  6900 900 
Wire Wire Line
	8000 2100 8150 2100
Wire Wire Line
	8150 2000 8000 2000
Wire Wire Line
	8000 2000 8000 1900
Wire Wire Line
	8000 1300 8150 1300
$Comp
L power:GND #PWR0111
U 1 1 5A908C9F
P 1650 5200
F 0 "#PWR0111" H 1650 4950 50  0001 C CNN
F 1 "GND" H 1650 5050 50  0000 C CNN
F 2 "" H 1650 5200 50  0000 C CNN
F 3 "" H 1650 5200 50  0000 C CNN
	1    1650 5200
	0    1    1    0   
$EndComp
$Comp
L power:+5V #PWR0112
U 1 1 5A908D11
P 1450 5300
F 0 "#PWR0112" H 1450 5150 50  0001 C CNN
F 1 "+5V" H 1450 5440 50  0000 C CNN
F 2 "" H 1450 5300 50  0000 C CNN
F 3 "" H 1450 5300 50  0000 C CNN
	1    1450 5300
	0    -1   -1   0   
$EndComp
Text GLabel 1700 4800 0    60   Input ~ 0
SCK
Text GLabel 1700 4600 0    60   Input ~ 0
MOSI
Text GLabel 1700 4700 0    60   Input ~ 0
PF7
Text Notes 5100 2850 0    60   ~ 0
LCD CS
$Comp
L micro-finger-rescue:CONN_02X03 P1
U 1 1 5A91571E
P 1800 1650
F 0 "P1" H 1800 1850 50  0000 C CNN
F 1 "ISP" H 1800 1450 50  0000 C CNN
F 2 "Connectors_IDC.pretty:IDC-Header_2x03_Pitch2.54mm_Straight" H 1800 450 50  0001 C CNN
F 3 "" H 1800 450 50  0000 C CNN
	1    1800 1650
	1    0    0    -1  
$EndComp
Text GLabel 1400 1550 0    60   Input ~ 0
MISO
Text GLabel 1050 1650 0    60   Input ~ 0
SCK
Text GLabel 1400 1750 0    60   Input ~ 0
~RESET
Text GLabel 2200 1650 2    60   Input ~ 0
MOSI
Wire Wire Line
	2050 1650 2200 1650
Wire Wire Line
	1550 1550 1400 1550
Wire Wire Line
	1050 1650 1550 1650
Wire Wire Line
	1550 1750 1400 1750
$Comp
L power:+5V #PWR0113
U 1 1 5A91597F
P 2150 1400
F 0 "#PWR0113" H 2150 1250 50  0001 C CNN
F 1 "+5V" H 2150 1540 50  0000 C CNN
F 2 "" H 2150 1400 50  0000 C CNN
F 3 "" H 2150 1400 50  0000 C CNN
	1    2150 1400
	1    0    0    -1  
$EndComp
Wire Wire Line
	2150 1400 2150 1550
Wire Wire Line
	2150 1550 2050 1550
$Comp
L power:GND #PWR0114
U 1 1 5A9159FE
P 2150 1900
F 0 "#PWR0114" H 2150 1650 50  0001 C CNN
F 1 "GND" H 2150 1750 50  0000 C CNN
F 2 "" H 2150 1900 50  0000 C CNN
F 3 "" H 2150 1900 50  0000 C CNN
	1    2150 1900
	1    0    0    -1  
$EndComp
Wire Wire Line
	2150 1900 2150 1750
Wire Wire Line
	2150 1750 2050 1750
$Comp
L power:GND #PWR0115
U 1 1 5ABBBEC6
P 3450 5300
F 0 "#PWR0115" H 3450 5050 50  0001 C CNN
F 1 "GND" H 3450 5150 50  0000 C CNN
F 2 "" H 3450 5300 50  0000 C CNN
F 3 "" H 3450 5300 50  0000 C CNN
	1    3450 5300
	1    0    0    -1  
$EndComp
Text GLabel 1700 4500 0    60   Input ~ 0
PD4
Text GLabel 3450 4800 2    60   Input ~ 0
PD1
Text GLabel 3450 4600 2    60   Input ~ 0
PD0
Text GLabel 3450 5100 2    60   Input ~ 0
PC6
Text Notes 3050 2650 2    60   ~ 0
Encoder Button
Text Notes 3050 2250 2    60   ~ 0
Encoder A
Text Notes 3050 2450 2    60   ~ 0
Encoder B
Text Notes 3050 2850 2    60   ~ 0
Stop
Wire Wire Line
	6300 1700 6300 1900
Wire Wire Line
	6900 1500 6950 1500
Wire Wire Line
	6750 1300 6950 1300
Wire Wire Line
	6300 900  6300 1500
Wire Wire Line
	6300 1500 6300 1700
$Comp
L rrd-display:rrd-display M1
U 1 1 5BA957DA
P 2000 4400
F 0 "M1" H 2550 4687 60  0000 C CNN
F 1 "rrd-display" H 2550 4581 60  0000 C CNN
F 2 "micro:rrd-display-128x64" H 2000 4400 60  0001 C CNN
F 3 "" H 2000 4400 60  0001 C CNN
	1    2000 4400
	1    0    0    -1  
$EndComp
Wire Wire Line
	3450 5300 3450 5200
Wire Wire Line
	3450 5200 3300 5200
Wire Wire Line
	3300 5100 3450 5100
Wire Wire Line
	3450 4800 3300 4800
Wire Wire Line
	3300 4600 3450 4600
Wire Wire Line
	1800 4500 1700 4500
Wire Wire Line
	1700 4600 1800 4600
Wire Wire Line
	1800 4700 1700 4700
Wire Wire Line
	1700 4800 1800 4800
Wire Wire Line
	1800 5200 1650 5200
Wire Wire Line
	1450 5300 1800 5300
$Comp
L Connector:Conn_01x02_Male J5
U 1 1 5BAB5C35
P 6700 3800
F 0 "J5" H 6800 3600 50  0000 R CNN
F 1 "Power" H 6900 3900 50  0000 R CNN
F 2 "Connectors_Molex.pretty:Molex_KK-6410-02_02x2.54mm_Straight" H 6700 3800 50  0001 C CNN
F 3 "~" H 6700 3800 50  0001 C CNN
	1    6700 3800
	1    0    0    1   
$EndComp
$Comp
L Connector:Conn_01x03_Male J3
U 1 1 5BAB5D40
P 5200 5300
F 0 "J3" H 5300 5100 50  0000 R CNN
F 1 "Y-limit" H 5400 5500 50  0000 R CNN
F 2 "Connectors_Molex.pretty:Molex_KK-6410-03_03x2.54mm_Straight" H 5200 5300 50  0001 C CNN
F 3 "~" H 5200 5300 50  0001 C CNN
	1    5200 5300
	-1   0    0    -1  
$EndComp
$Comp
L Connector:Conn_01x04_Male J2
U 1 1 5BAB85C8
P 5750 4350
F 0 "J2" H 5856 4628 50  0000 C CNN
F 1 "X-limits" H 5850 4550 50  0000 C CNN
F 2 "Connectors_Molex.pretty:Molex_KK-6410-04_04x2.54mm_Straight" H 5750 4350 50  0001 C CNN
F 3 "~" H 5750 4350 50  0001 C CNN
	1    5750 4350
	-1   0    0    1   
$EndComp
Text Notes 3050 3650 2    50   ~ 0
X-max
Text Notes 3050 3450 2    50   ~ 0
X-min\n
Text Notes 3050 3250 2    50   ~ 0
Y-Min
Text Notes 3050 3050 2    50   ~ 0
ws2812 LED
$Comp
L buck-module:buck-converter U1
U 1 1 5BAC4FAA
P 8400 3700
F 0 "U1" H 8950 4065 50  0000 C CNN
F 1 "5V" H 8950 3974 50  0000 C CNN
F 2 "micro:buck-module" H 8400 3700 50  0001 C CNN
F 3 "" H 8400 3700 50  0001 C CNN
	1    8400 3700
	-1   0    0    -1  
$EndComp
$Comp
L power:GND #PWR0116
U 1 1 5BAC9DB6
P 7900 4250
F 0 "#PWR0116" H 7900 4000 50  0001 C CNN
F 1 "GND" H 7905 4077 50  0000 C CNN
F 2 "" H 7900 4250 50  0001 C CNN
F 3 "" H 7900 4250 50  0001 C CNN
	1    7900 4250
	1    0    0    -1  
$EndComp
Wire Wire Line
	7900 4250 7900 4150
Wire Wire Line
	7900 4150 7250 4150
Wire Wire Line
	6900 4150 6900 3800
Connection ~ 7900 4150
Wire Wire Line
	6900 3700 7100 3700
$Comp
L Device:CP_Small C1
U 1 1 5BAD1536
P 7100 3900
F 0 "C1" H 7000 4050 50  0000 L CNN
F 1 "220 uF / 35V" H 6900 3550 50  0000 L CNN
F 2 "Capacitors_THT.pretty:CP_Radial_D8.0mm_P5.00mm" H 7100 3900 50  0001 C CNN
F 3 "~" H 7100 3900 50  0001 C CNN
	1    7100 3900
	1    0    0    -1  
$EndComp
Wire Wire Line
	7100 3800 7100 3700
Connection ~ 7100 3700
Wire Wire Line
	7100 3700 7250 3700
Wire Wire Line
	7100 4000 7100 4150
Connection ~ 7100 4150
Wire Wire Line
	7100 4150 6900 4150
$Comp
L power:+5V #PWR0117
U 1 1 5BAD95A9
P 8550 3550
F 0 "#PWR0117" H 8550 3400 50  0001 C CNN
F 1 "+5V" H 8565 3723 50  0000 C CNN
F 2 "" H 8550 3550 50  0001 C CNN
F 3 "" H 8550 3550 50  0001 C CNN
	1    8550 3550
	1    0    0    -1  
$EndComp
Wire Wire Line
	8550 3550 8550 3700
Wire Wire Line
	8550 3700 8400 3700
Wire Wire Line
	8550 3800 8550 3700
Connection ~ 8550 3700
$Comp
L Device:CP_Small C3
U 1 1 5BADEF49
P 8550 3900
F 0 "C3" H 8638 3946 50  0000 L CNN
F 1 "220 uF / 35V" H 8638 3855 50  0000 L CNN
F 2 "Capacitors_THT.pretty:CP_Radial_D8.0mm_P5.00mm" H 8550 3900 50  0001 C CNN
F 3 "~" H 8550 3900 50  0001 C CNN
	1    8550 3900
	1    0    0    -1  
$EndComp
Wire Wire Line
	8550 4000 8550 4150
Wire Wire Line
	8550 4150 7900 4150
$Comp
L power:+12V #PWR0118
U 1 1 5BAE204D
P 4750 5100
F 0 "#PWR0118" H 4750 4950 50  0001 C CNN
F 1 "+12V" H 4765 5273 50  0000 C CNN
F 2 "" H 4750 5100 50  0001 C CNN
F 3 "" H 4750 5100 50  0001 C CNN
	1    4750 5100
	-1   0    0    -1  
$EndComp
Wire Wire Line
	5000 5200 4750 5200
Wire Wire Line
	4750 5200 4750 5100
$Comp
L power:GND #PWR0119
U 1 1 5BAF662D
P 4650 5300
F 0 "#PWR0119" H 4650 5050 50  0001 C CNN
F 1 "GND" H 4655 5127 50  0000 C CNN
F 2 "" H 4650 5300 50  0001 C CNN
F 3 "" H 4650 5300 50  0001 C CNN
	1    4650 5300
	0    1    -1   0   
$EndComp
Text GLabel 4850 5400 0    60   Input ~ 0
PE6
Wire Wire Line
	5000 5300 4650 5300
Wire Wire Line
	4850 5400 5000 5400
$Comp
L Connector:Conn_01x03_Male J1
U 1 1 5BB0302D
P 1000 2650
F 0 "J1" H 972 2580 50  0000 R CNN
F 1 "serial" H 972 2671 50  0000 R CNN
F 2 "Connectors_Molex.pretty:Molex_KK-6410-03_03x2.54mm_Straight" H 1000 2650 50  0001 C CNN
F 3 "~" H 1000 2650 50  0001 C CNN
	1    1000 2650
	1    0    0    1   
$EndComp
$Comp
L power:GND #PWR0120
U 1 1 5BB06287
P 1350 2900
F 0 "#PWR0120" H 1350 2650 50  0001 C CNN
F 1 "GND" H 1355 2727 50  0000 C CNN
F 2 "" H 1350 2900 50  0001 C CNN
F 3 "" H 1350 2900 50  0001 C CNN
	1    1350 2900
	1    0    0    -1  
$EndComp
Wire Wire Line
	1350 2900 1350 2750
Wire Wire Line
	1350 2750 1200 2750
Text GLabel 1400 2550 2    60   Input ~ 0
TX
Text GLabel 1400 2650 2    60   Input ~ 0
RX
Wire Wire Line
	1400 2650 1200 2650
Wire Wire Line
	1200 2550 1400 2550
$Comp
L Connector:Conn_01x03_Male J4
U 1 1 5BB102DD
P 6250 5300
F 0 "J4" H 6222 5230 50  0000 R CNN
F 1 "ws2812B" H 6222 5321 50  0000 R CNN
F 2 "Connectors_Molex.pretty:Molex_KK-6410-03_03x2.54mm_Straight" H 6250 5300 50  0001 C CNN
F 3 "~" H 6250 5300 50  0001 C CNN
	1    6250 5300
	-1   0    0    1   
$EndComp
$Comp
L power:GND #PWR0121
U 1 1 5BB103A7
P 5900 5500
F 0 "#PWR0121" H 5900 5250 50  0001 C CNN
F 1 "GND" H 5905 5327 50  0000 C CNN
F 2 "" H 5900 5500 50  0001 C CNN
F 3 "" H 5900 5500 50  0001 C CNN
	1    5900 5500
	-1   0    0    -1  
$EndComp
Wire Wire Line
	5900 5500 5900 5400
Wire Wire Line
	5900 5400 6050 5400
$Comp
L power:+5V #PWR0122
U 1 1 5BB1741E
P 5900 5100
F 0 "#PWR0122" H 5900 4950 50  0001 C CNN
F 1 "+5V" H 5915 5273 50  0000 C CNN
F 2 "" H 5900 5100 50  0001 C CNN
F 3 "" H 5900 5100 50  0001 C CNN
	1    5900 5100
	-1   0    0    -1  
$EndComp
Wire Wire Line
	6050 5200 5900 5200
Wire Wire Line
	5900 5200 5900 5100
Text GLabel 5900 5300 0    60   Input ~ 0
PD7
Wire Wire Line
	5900 5300 6050 5300
$Comp
L power:GND #PWR0123
U 1 1 5BB2D9D9
P 4950 4400
F 0 "#PWR0123" H 4950 4150 50  0001 C CNN
F 1 "GND" H 4955 4227 50  0000 C CNN
F 2 "" H 4950 4400 50  0001 C CNN
F 3 "" H 4950 4400 50  0001 C CNN
	1    4950 4400
	1    0    0    -1  
$EndComp
$Comp
L power:+5V #PWR0124
U 1 1 5BB319CD
P 5050 4250
F 0 "#PWR0124" H 5050 4100 50  0001 C CNN
F 1 "+5V" V 5065 4378 50  0000 L CNN
F 2 "" H 5050 4250 50  0001 C CNN
F 3 "" H 5050 4250 50  0001 C CNN
	1    5050 4250
	0    -1   -1   0   
$EndComp
Text GLabel 5400 4150 0    60   Input ~ 0
PB4
Text GLabel 5400 4450 0    60   Input ~ 0
PB5
Wire Wire Line
	4800 1400 4600 1400
$Comp
L power:+12V #PWR0125
U 1 1 5BB88AAA
P 7100 3550
F 0 "#PWR0125" H 7100 3400 50  0001 C CNN
F 1 "+12V" H 7115 3723 50  0000 C CNN
F 2 "" H 7100 3550 50  0001 C CNN
F 3 "" H 7100 3550 50  0001 C CNN
	1    7100 3550
	1    0    0    -1  
$EndComp
Wire Wire Line
	7100 3550 7100 3700
Wire Wire Line
	8150 1500 8000 1500
Wire Wire Line
	4950 4400 4950 4350
Wire Wire Line
	4950 4350 5550 4350
Wire Wire Line
	5550 4450 5400 4450
Wire Wire Line
	5050 4250 5550 4250
Wire Wire Line
	5550 4150 5400 4150
Wire Wire Line
	7900 4100 7900 4150
$Comp
L Device:CP_Small C2
U 1 1 5BBB8213
P 7250 3900
F 0 "C2" H 7150 4050 50  0000 L CNN
F 1 "220 uF / 35V" H 7050 3450 50  0000 L CNN
F 2 "Capacitors_THT.pretty:CP_Radial_D8.0mm_P5.00mm" H 7250 3900 50  0001 C CNN
F 3 "~" H 7250 3900 50  0001 C CNN
	1    7250 3900
	1    0    0    -1  
$EndComp
Wire Wire Line
	7250 3800 7250 3700
Connection ~ 7250 3700
Wire Wire Line
	7250 3700 7300 3700
Wire Wire Line
	7250 4000 7250 4150
Connection ~ 7250 4150
Wire Wire Line
	7250 4150 7100 4150
$Comp
L LED:WS2812B D1
U 1 1 5BBC07F1
P 8150 5350
F 0 "D1" H 8491 5396 50  0000 L CNN
F 1 "WS2812B" H 8491 5305 50  0000 L CNN
F 2 "micro:inboard-5050" H 8200 5050 50  0001 L TNN
F 3 "https://cdn-shop.adafruit.com/datasheets/WS2812B.pdf" H 8250 4975 50  0001 L TNN
	1    8150 5350
	1    0    0    -1  
$EndComp
$Comp
L power:+5V #PWR0126
U 1 1 5BBC08F0
P 8150 4900
F 0 "#PWR0126" H 8150 4750 50  0001 C CNN
F 1 "+5V" H 8165 5073 50  0000 C CNN
F 2 "" H 8150 4900 50  0001 C CNN
F 3 "" H 8150 4900 50  0001 C CNN
	1    8150 4900
	1    0    0    -1  
$EndComp
$Comp
L power:GND #PWR0127
U 1 1 5BBC0955
P 8150 5800
F 0 "#PWR0127" H 8150 5550 50  0001 C CNN
F 1 "GND" H 8155 5627 50  0000 C CNN
F 2 "" H 8150 5800 50  0001 C CNN
F 3 "" H 8150 5800 50  0001 C CNN
	1    8150 5800
	1    0    0    -1  
$EndComp
Text GLabel 7750 5350 0    60   Input ~ 0
PD7
Wire Wire Line
	8150 5800 8150 5650
Wire Wire Line
	7750 5350 7850 5350
Wire Wire Line
	8150 4900 8150 5050
$EndSCHEMATC
