{
  "TIMESTAMP": "08/24/2021 02:57:46 GMT",
  "VERSION": 2.3,
  "TRAFFIC_ITEMS": {
    "TRAFFIC_ITEM": [
      {
        "TRAFFIC_ITEM_ID": 1062218474456130949,
        "ORIGINAL_TRAFFIC_ITEM_ID": 746088602850559498,
        "TRAFFIC_ITEM_STATUS_SHORT_DESC": "ACTIVE",
        "TRAFFIC_ITEM_TYPE_DESC": "CONGESTION",
        "START_TIME": "08/24/2021 02:57:25",
        "END_TIME": "08/24/2021 03:09:16",
        "ENTRY_TIME": "08/24/2021 02:59:17",
        "CRITICALITY": {
          "ID": "2",
          "DESCRIPTION": "minor"
        },
        "VERIFIED": true,
        "ABBREVIATION": {
          "SHORT_DESC": "SLOW",
          "DESCRIPTION": "slow"
        },
        "RDS-TMC_LOCATIONS": {
          "RDS-TMC": [
            {
              "ORIGIN": {
                "EBU_COUNTRY_CODE": "A",
                "TABLE_ID": 1,
                "LOCATION_ID": "31280",
                "LOCATION_DESC": "St. Michael im Lungau",
                "RDS_DIRECTION": "-"
              },
              "DIRECTION": "+",
              "ALERTC": {
                "TRAFFIC_CODE": 138,
                "QUANTIFIERS": 4,
                "DESCRIPTION": "Stockender Verkehr;; vorsichtig an das Stauende heranfahren.",
                "ALERTC_DURATION": "D",
                "ALERTC_DIRECTION": 1,
                "URGENCY": "U",
                "UPDATE_CLASS": 1,
                "PHRASE_CODE": "A2.Z112",
                "EXTENT": "1",
                "DURATION": 0
              },
              "LENGTH": 0.02587,
              "PRIMARY_OFFSET": 0.16339
            }
          ]
        },
        "LOCATION": {
          "DEFINED": {
            "ORIGIN": {
              "ROADWAY": {
                "DESCRIPTION": [
                  {
                    "value": "Tauern Autobahn",
                    "TYPE": "NTCSA"
                  },
                  {
                    "value": "Tauern Autobahn",
                    "TYPE": "RDSGN"
                  },
                  {
                    "value": "Tauern Autobahn",
                    "TYPE": "LOCAL"
                  }
                ],
                "ID": 30566
              },
              "POINT": {
                "DESCRIPTION": [
                  {
                    "value": "Parkplatz Lansch\u00fctz",
                    "TYPE": "NTCSA"
                  },
                  {
                    "value": "Parkplatz Lansch\u00fctz",
                    "TYPE": "RDSGN"
                  },
                  {
                    "value": "Parkplatz Lansch\u00fctz",
                    "TYPE": "LOCAL"
                  },
                  {
                    "value": "Tauern Autobahn",
                    "TYPE": "BNAME"
                  }
                ],
                "ID": 31280
              },
              "DIRECTION": {
                "DESCRIPTION": [
                  {
                    "value": "VILLACH",
                    "TYPE": "LOCAL"
                  },
                  {
                    "value": "VILLACH",
                    "TYPE": "NTCSA"
                  },
                  {
                    "value": "VILLACH",
                    "TYPE": "RDSGN"
                  }
                ],
                "ID": 0
              },
              "PROXIMITY": {
                "ID": "AT",
                "DESCRIPTION": "at"
              }
            },
            "TO": {
              "ROADWAY": {
                "DESCRIPTION": [
                  {
                    "value": "Tauern Autobahn",
                    "TYPE": "NTCSA"
                  },
                  {
                    "value": "Tauern Autobahn",
                    "TYPE": "RDSGN"
                  },
                  {
                    "value": "Tauern Autobahn",
                    "TYPE": "LOCAL"
                  }
                ],
                "ID": 30566
              },
              "POINT": {
                "DESCRIPTION": [
                  {
                    "value": "St. Michael im Lungau",
                    "TYPE": "NTCSA"
                  },
                  {
                    "value": "St. Michael im Lungau",
                    "TYPE": "RDSGN"
                  },
                  {
                    "value": "St. Michael im Lungau",
                    "TYPE": "LOCAL"
                  },
                  {
                    "value": "Tauern Autobahn",
                    "TYPE": "BNAME"
                  }
                ],
                "ID": 31280
              },
              "DIRECTION": {
                "DESCRIPTION": [
                  {
                    "value": "VILLACH",
                    "TYPE": "LOCAL"
                  },
                  {
                    "value": "VILLACH",
                    "TYPE": "NTCSA"
                  },
                  {
                    "value": "VILLACH",
                    "TYPE": "RDSGN"
                  }
                ],
                "ID": 0
              },
              "PROXIMITY": {
                "ID": "AT",
                "DESCRIPTION": "at"
              }
            }
          },
          "GEOLOC": {
            "ORIGIN": {
              "LATITUDE": 47.09472,
              "LONGITUDE": 13.60881
            },
            "TO": [
              {
                "LATITUDE": 47.09438,
                "LONGITUDE": 13.60904
              }
            ]
          },
          "NAVTECH": {
            "EDGE": {
              "EDGE_ID": [
                "1210473695"
              ]
            },
            "VERSION_ID": "202102"
          },
          "LENGTH": 0.02587
        },
        "TRAFFIC_ITEM_DETAIL": {
          "ROAD_CLOSED": false,
          "INCIDENT": {
            "RESPONSE_VEHICLES": false,
            "CONGESTION_INCIDENT": {
              "CONGESTION_TYPE_DESC": "CONGESTION",
              "CONGESTION_FACTOR": 50
            }
          },
          "ALERTC": [
            {
              "EVENT_CODE": 138
            }
          ]
        },
        "TRAFFIC_ITEM_DESCRIPTION": [
          {
            "value": "Bei St. Michael im Lungau - Stockender Verkehr;; vorsichtig an das Stauende heranfahren.",
            "TYPE": "short_desc"
          },
          {
            "value": "Bei St. Michael im Lungau - Stockender Verkehr;; vorsichtig an das Stauende heranfahren.",
            "TYPE": "desc"
          },
          {
            "value": "Stockender Verkehr;; vorsichtig an das Stauende heranfahren.",
            "TYPE": "no_exit_description"
          }
        ],
        "mid": "cebc2907-1417-4347-95bd-ca969d18d313|1629773957379",
        "PRODUCT": "basic"
      },
      {
        "TRAFFIC_ITEM_ID": 1849350300188010804,
        "ORIGINAL_TRAFFIC_ITEM_ID": 2689693710593673663,
        "TRAFFIC_ITEM_STATUS_SHORT_DESC": "ACTIVE",
        "TRAFFIC_ITEM_TYPE_DESC": "CONGESTION",
        "START_TIME": "08/24/2021 02:45:34",
        "END_TIME": "08/24/2021 03:08:19",
        "ENTRY_TIME": "08/24/2021 02:49:22",
        "CRITICALITY": {
          "ID": "2",
          "DESCRIPTION": "minor"
        },
        "VERIFIED": true,
        "ABBREVIATION": {
          "SHORT_DESC": "SLOW",
          "DESCRIPTION": "slow"
        },
        "RDS-TMC_LOCATIONS": {
          "RDS-TMC": [
            {
              "ORIGIN": {
                "EBU_COUNTRY_CODE": "D",
                "TABLE_ID": 1,
                "LOCATION_ID": "32614",
                "LOCATION_DESC": "Rudower H\u00f6he",
                "RDS_DIRECTION": "-"
              },
              "DIRECTION": "+",
              "ALERTC": {
                "TRAFFIC_CODE": 138,
                "QUANTIFIERS": 4,
                "DESCRIPTION": "Stockender Verkehr;; vorsichtig an das Stauende heranfahren.",
                "ALERTC_DURATION": "D",
                "ALERTC_DIRECTION": 1,
                "URGENCY": "U",
                "UPDATE_CLASS": 1,
                "PHRASE_CODE": "A2.Z112",
                "EXTENT": "1",
                "DURATION": 0
              },
              "LENGTH": 0.23541,
              "PRIMARY_OFFSET": 0.30737
            }
          ]
        },
        "LOCATION": {
          "DEFINED": {
            "ORIGIN": {
              "ROADWAY": {
                "DESCRIPTION": [
                  {
                    "value": "Autobahnzubringer Dresden",
                    "TYPE": "NTCSA"
                  },
                  {
                    "value": "Autobahnzubringer Dresden",
                    "TYPE": "RDSGN"
                  },
                  {
                    "value": "Autobahnzubringer Dresden",
                    "TYPE": "LOCAL"
                  }
                ],
                "ID": 32603
              },
              "POINT": {
                "DESCRIPTION": [
                  {
                    "value": "Adlershof",
                    "TYPE": "NTCSA"
                  },
                  {
                    "value": "Adlershof",
                    "TYPE": "RDSGN"
                  },
                  {
                    "value": "Adlershof",
                    "TYPE": "LOCAL"
                  },
                  {
                    "value": "Autobahnzubringer Dresden",
                    "TYPE": "BNAME"
                  }
                ],
                "ID": 32614
              },
              "DIRECTION": {
                "DESCRIPTION": [
                  {
                    "value": "SCH\u00d6NEFELD",
                    "TYPE": "LOCAL"
                  },
                  {
                    "value": "SCH\u00d6NEFELD",
                    "TYPE": "NTCSA"
                  },
                  {
                    "value": "SCH\u00d6NEFELD",
                    "TYPE": "RDSGN"
                  }
                ],
                "ID": 0
              },
              "PROXIMITY": {
                "ID": "AT",
                "DESCRIPTION": "at"
              }
            },
            "TO": {
              "ROADWAY": {
                "DESCRIPTION": [
                  {
                    "value": "Autobahnzubringer Dresden",
                    "TYPE": "NTCSA"
                  },
                  {
                    "value": "Autobahnzubringer Dresden",
                    "TYPE": "RDSGN"
                  },
                  {
                    "value": "Autobahnzubringer Dresden",
                    "TYPE": "LOCAL"
                  }
                ],
                "ID": 32603
              },
              "POINT": {
                "DESCRIPTION": [
                  {
                    "value": "Rudower H\u00f6he",
                    "TYPE": "NTCSA"
                  },
                  {
                    "value": "Rudower H\u00f6he",
                    "TYPE": "RDSGN"
                  },
                  {
                    "value": "Rudower H\u00f6he",
                    "TYPE": "LOCAL"
                  },
                  {
                    "value": "Autobahnzubringer Dresden",
                    "TYPE": "BNAME"
                  }
                ],
                "ID": 32614
              },
              "DIRECTION": {
                "DESCRIPTION": [
                  {
                    "value": "SCH\u00d6NEFELD",
                    "TYPE": "LOCAL"
                  },
                  {
                    "value": "SCH\u00d6NEFELD",
                    "TYPE": "NTCSA"
                  },
                  {
                    "value": "SCH\u00d6NEFELD",
                    "TYPE": "RDSGN"
                  }
                ],
                "ID": 0
              },
              "PROXIMITY": {
                "ID": "AT",
                "DESCRIPTION": "at"
              }
            }
          },
          "GEOLOC": {
            "ORIGIN": {
              "LATITUDE": 52.42057,
              "LONGITUDE": 13.52187
            },
            "TO": [
              {
                "LATITUDE": 52.41722,
                "LONGITUDE": 13.52281
              }
            ]
          },
          "NAVTECH": {
            "EDGE": {
              "EDGE_ID": [
                "1242593211"
              ]
            },
            "VERSION_ID": "202102"
          },
          "LENGTH": 0.23541
        },
        "TRAFFIC_ITEM_DETAIL": {
          "ROAD_CLOSED": false,
          "INCIDENT": {
            "RESPONSE_VEHICLES": false,
            "CONGESTION_INCIDENT": {
              "CONGESTION_TYPE_DESC": "CONGESTION",
              "CONGESTION_FACTOR": 50
            }
          },
          "ALERTC": [
            {
              "EVENT_CODE": 138
            }
          ]
        },
        "TRAFFIC_ITEM_DESCRIPTION": [
          {
            "value": "Bei Rudower H\u00f6he - Stockender Verkehr;; vorsichtig an das Stauende heranfahren.",
            "TYPE": "short_desc"
          },
          {
            "value": "Bei Rudower H\u00f6he - Stockender Verkehr;; vorsichtig an das Stauende heranfahren.",
            "TYPE": "desc"
          },
          {
            "value": "Stockender Verkehr;; vorsichtig an das Stauende heranfahren.",
            "TYPE": "no_exit_description"
          }
        ],
        "mid": "710214ec-b99b-4fb1-b2ec-bf4652b5f38d|1629773362379",
        "PRODUCT": "basic"
      },
      {
        "TRAFFIC_ITEM_ID": 4188259400971918019,
        "ORIGINAL_TRAFFIC_ITEM_ID": 2269094481954991088,
        "TRAFFIC_ITEM_STATUS_SHORT_DESC": "ACTIVE",
        "TRAFFIC_ITEM_TYPE_DESC": "CONGESTION",
        "START_TIME": "08/24/2021 02:51:33",
        "END_TIME": "08/24/2021 03:08:19",
        "ENTRY_TIME": "08/24/2021 02:58:22",
        "CRITICALITY": {
          "ID": "2",
          "DESCRIPTION": "minor"
        },
        "VERIFIED": true,
        "ABBREVIATION": {
          "SHORT_DESC": "SLOW",
          "DESCRIPTION": "slow"
        },
        "RDS-TMC_LOCATIONS": {
          "RDS-TMC": [
            {
              "ORIGIN": {
                "EBU_COUNTRY_CODE": "D",
                "TABLE_ID": 1,
                "LOCATION_ID": "39891",
                "LOCATION_DESC": "Kleine Herrenthey",
                "RDS_DIRECTION": "+"
              },
              "DIRECTION": "-",
              "ALERTC": {
                "TRAFFIC_CODE": 138,
                "ALERTC_Q_BINARY": "2",
                "QUANTIFIERS": 4,
                "DESCRIPTION": "Stockender Verkehr; Durchschnittsgeschwindigkeit von bis zu 10 km/h; vorsichtig an das Stauende heranfahren.",
                "ALERTC_DURATION": "D",
                "ALERTC_DIRECTION": 1,
                "URGENCY": "U",
                "UPDATE_CLASS": 1,
                "PHRASE_CODE": "A2.Z112",
                "EXTENT": "1",
                "DURATION": 0
              },
              "LENGTH": 0.21769,
              "PRIMARY_OFFSET": 2.46813
            }
          ]
        },
        "LOCATION": {
          "DEFINED": {
            "ORIGIN": {
              "ROADWAY": {
                "DESCRIPTION": [
                  {
                    "value": "A2",
                    "TYPE": "NTCSA"
                  },
                  {
                    "value": "A2",
                    "TYPE": "RDSGN"
                  },
                  {
                    "value": "A2",
                    "TYPE": "LOCAL"
                  }
                ],
                "ID": 50080
              },
              "POINT": {
                "DESCRIPTION": [
                  {
                    "value": "Dortmund-Nordost",
                    "TYPE": "NTCSA"
                  },
                  {
                    "value": "Dortmund-Nordost",
                    "TYPE": "RDSGN"
                  },
                  {
                    "value": "Dortmund-Nordost",
                    "TYPE": "LOCAL"
                  },
                  {
                    "value": "A2",
                    "TYPE": "BNAME"
                  }
                ],
                "ID": 39891
              },
              "DIRECTION": {
                "DESCRIPTION": [
                  {
                    "value": "OBERHAUSEN",
                    "TYPE": "LOCAL"
                  },
                  {
                    "value": "OBERHAUSEN",
                    "TYPE": "NTCSA"
                  },
                  {
                    "value": "OBERHAUSEN",
                    "TYPE": "RDSGN"
                  }
                ],
                "ID": 0
              },
              "PROXIMITY": {
                "ID": "AT",
                "DESCRIPTION": "at"
              }
            },
            "TO": {
              "ROADWAY": {
                "DESCRIPTION": [
                  {
                    "value": "A2",
                    "TYPE": "NTCSA"
                  },
                  {
                    "value": "A2",
                    "TYPE": "RDSGN"
                  },
                  {
                    "value": "A2",
                    "TYPE": "LOCAL"
                  }
                ],
                "ID": 50080
              },
              "POINT": {
                "DESCRIPTION": [
                  {
                    "value": "Kleine Herrenthey",
                    "TYPE": "NTCSA"
                  },
                  {
                    "value": "Kleine Herrenthey",
                    "TYPE": "RDSGN"
                  },
                  {
                    "value": "Kleine Herrenthey",
                    "TYPE": "LOCAL"
                  },
                  {
                    "value": "A2",
                    "TYPE": "BNAME"
                  }
                ],
                "ID": 39891
              },
              "DIRECTION": {
                "DESCRIPTION": [
                  {
                    "value": "OBERHAUSEN",
                    "TYPE": "LOCAL"
                  },
                  {
                    "value": "OBERHAUSEN",
                    "TYPE": "NTCSA"
                  },
                  {
                    "value": "OBERHAUSEN",
                    "TYPE": "RDSGN"
                  }
                ],
                "ID": 0
              },
              "PROXIMITY": {
                "ID": "AT",
                "DESCRIPTION": "at"
              }
            }
          },
          "GEOLOC": {
            "ORIGIN": {
              "LATITUDE": 51.57685,
              "LONGITUDE": 7.4868
            },
            "TO": [
              {
                "LATITUDE": 51.57588,
                "LONGITUDE": 7.48214
              }
            ]
          },
          "NAVTECH": {
            "EDGE": {
              "EDGE_ID": [
                "1268132884"
              ]
            },
            "VERSION_ID": "202102"
          },
          "LENGTH": 0.21769
        },
        "TRAFFIC_ITEM_DETAIL": {
          "ROAD_CLOSED": false,
          "INCIDENT": {
            "RESPONSE_VEHICLES": false,
            "CONGESTION_INCIDENT": {
              "CONGESTION_TYPE_DESC": "CONGESTION",
              "CONGESTION_FACTOR": 50
            }
          },
          "ALERTC": [
            {
              "EVENT_CODE": 138,
              "ALERTC_Q": 2
            }
          ]
        },
        "TRAFFIC_ITEM_DESCRIPTION": [
          {
            "value": "Bei Kleine Herrenthey - Stockender Verkehr; Durchschnittsgeschwindigkeit von bis zu 10 km/h; vorsichtig an das Stauende heranfahren.",
            "TYPE": "short_desc"
          },
          {
            "value": "Bei Kleine Herrenthey - Stockender Verkehr; Durchschnittsgeschwindigkeit von bis zu 10 km/h; vorsichtig an das Stauende heranfahren.",
            "TYPE": "desc"
          },
          {
            "value": "Stockender Verkehr; Durchschnittsgeschwindigkeit von bis zu 10 km/h; vorsichtig an das Stauende heranfahren.",
            "TYPE": "no_exit_description"
          }
        ],
        "mid": "6db64d37-d808-4afe-b715-2573c1178275|1629773902379",
        "PRODUCT": "basic"
      },
      {
        "TRAFFIC_ITEM_ID": 2557314519641374359,
        "ORIGINAL_TRAFFIC_ITEM_ID": 2522190719765527315,
        "TRAFFIC_ITEM_STATUS_SHORT_DESC": "ACTIVE",
        "TRAFFIC_ITEM_TYPE_DESC": "CONGESTION",
        "START_TIME": "08/24/2021 02:53:46",
        "END_TIME": "08/24/2021 03:09:16",
        "ENTRY_TIME": "08/24/2021 02:59:17",
        "CRITICALITY": {
          "ID": "2",
          "DESCRIPTION": "minor"
        },
        "VERIFIED": true,
        "ABBREVIATION": {
          "SHORT_DESC": "SLOW",
          "DESCRIPTION": "slow"
        },
        "RDS-TMC_LOCATIONS": {
          "RDS-TMC": [
            {
              "ORIGIN": {
                "EBU_COUNTRY_CODE": "A",
                "TABLE_ID": 1,
                "LOCATION_ID": "35946",
                "LOCATION_DESC": "Mautstelle Gleinalm",
                "RDS_DIRECTION": "+"
              },
              "DIRECTION": "-",
              "ALERTC": {
                "TRAFFIC_CODE": 138,
                "QUANTIFIERS": 4,
                "DESCRIPTION": "Stockender Verkehr;; vorsichtig an das Stauende heranfahren.",
                "ALERTC_DURATION": "D",
                "ALERTC_DIRECTION": 1,
                "URGENCY": "U",
                "UPDATE_CLASS": 1,
                "PHRASE_CODE": "A2.Z112",
                "EXTENT": "1",
                "DURATION": 0
              },
              "LENGTH": 0.02733,
              "PRIMARY_OFFSET": 0.03815
            }
          ]
        },
        "LOCATION": {
          "DEFINED": {
            "ORIGIN": {
              "ROADWAY": {
                "DESCRIPTION": [
                  {
                    "value": "Pyhrn Autobahn",
                    "TYPE": "NTCSA"
                  },
                  {
                    "value": "Pyhrn Autobahn",
                    "TYPE": "RDSGN"
                  },
                  {
                    "value": "Pyhrn Autobahn",
                    "TYPE": "LOCAL"
                  }
                ],
                "ID": 30562
              },
              "POINT": {
                "DESCRIPTION": [
                  {
                    "value": "Parkplatz St. Michael",
                    "TYPE": "NTCSA"
                  },
                  {
                    "value": "Parkplatz St. Michael",
                    "TYPE": "RDSGN"
                  },
                  {
                    "value": "Parkplatz St. Michael",
                    "TYPE": "LOCAL"
                  },
                  {
                    "value": "Pyhrn Autobahn",
                    "TYPE": "BNAME"
                  }
                ],
                "ID": 35946
              },
              "DIRECTION": {
                "DESCRIPTION": [
                  {
                    "value": "ST. MICHAEL",
                    "TYPE": "LOCAL"
                  },
                  {
                    "value": "ST. MICHAEL",
                    "TYPE": "NTCSA"
                  },
                  {
                    "value": "ST. MICHAEL",
                    "TYPE": "RDSGN"
                  }
                ],
                "ID": 0
              },
              "PROXIMITY": {
                "ID": "AT",
                "DESCRIPTION": "at"
              }
            },
            "TO": {
              "ROADWAY": {
                "DESCRIPTION": [
                  {
                    "value": "Pyhrn Autobahn",
                    "TYPE": "NTCSA"
                  },
                  {
                    "value": "Pyhrn Autobahn",
                    "TYPE": "RDSGN"
                  },
                  {
                    "value": "Pyhrn Autobahn",
                    "TYPE": "LOCAL"
                  }
                ],
                "ID": 30562
              },
              "POINT": {
                "DESCRIPTION": [
                  {
                    "value": "Mautstelle Gleinalm",
                    "TYPE": "NTCSA"
                  },
                  {
                    "value": "Mautstelle Gleinalm",
                    "TYPE": "RDSGN"
                  },
                  {
                    "value": "Mautstelle Gleinalm",
                    "TYPE": "LOCAL"
                  },
                  {
                    "value": "Pyhrn Autobahn",
                    "TYPE": "BNAME"
                  }
                ],
                "ID": 35946
              },
              "DIRECTION": {
                "DESCRIPTION": [
                  {
                    "value": "ST. MICHAEL",
                    "TYPE": "LOCAL"
                  },
                  {
                    "value": "ST. MICHAEL",
                    "TYPE": "NTCSA"
                  },
                  {
                    "value": "ST. MICHAEL",
                    "TYPE": "RDSGN"
                  }
                ],
                "ID": 0
              },
              "PROXIMITY": {
                "ID": "AT",
                "DESCRIPTION": "at"
              }
            }
          },
          "GEOLOC": {
            "ORIGIN": {
              "LATITUDE": 47.32294,
              "LONGITUDE": 15.03096
            },
            "TO": [
              {
                "LATITUDE": 47.32322,
                "LONGITUDE": 15.03055
              }
            ]
          },
          "NAVTECH": {
            "EDGE": {
              "EDGE_ID": [
                "1210574975"
              ]
            },
            "VERSION_ID": "202102"
          },
          "LENGTH": 0.02733
        },
        "TRAFFIC_ITEM_DETAIL": {
          "ROAD_CLOSED": false,
          "INCIDENT": {
            "RESPONSE_VEHICLES": false,
            "CONGESTION_INCIDENT": {
              "CONGESTION_TYPE_DESC": "CONGESTION",
              "CONGESTION_FACTOR": 50
            }
          },
          "ALERTC": [
            {
              "EVENT_CODE": 138
            }
          ]
        },
        "TRAFFIC_ITEM_DESCRIPTION": [
          {
            "value": "Bei Mautstelle Gleinalm - Stockender Verkehr;; vorsichtig an das Stauende heranfahren.",
            "TYPE": "short_desc"
          },
          {
            "value": "Bei Mautstelle Gleinalm - Stockender Verkehr;; vorsichtig an das Stauende heranfahren.",
            "TYPE": "desc"
          },
          {
            "value": "Stockender Verkehr;; vorsichtig an das Stauende heranfahren.",
            "TYPE": "no_exit_description"
          }
        ],
        "mid": "af91c8e5-666b-4d55-8a8f-98f776387d6a|1629773957379",
        "PRODUCT": "basic"
      },
      {
        "TRAFFIC_ITEM_ID": 4611602140215123491,
        "ORIGINAL_TRAFFIC_ITEM_ID": 765256467381663455,
        "TRAFFIC_ITEM_STATUS_SHORT_DESC": "ACTIVE",
        "TRAFFIC_ITEM_TYPE_DESC": "CONGESTION",
        "START_TIME": "08/24/2021 02:57:54",
        "END_TIME": "08/24/2021 03:08:19",
        "ENTRY_TIME": "08/24/2021 02:58:22",
        "CRITICALITY": {
          "ID": "2",
          "DESCRIPTION": "minor"
        },
        "VERIFIED": true,
        "ABBREVIATION": {
          "SHORT_DESC": "SLOW",
          "DESCRIPTION": "slow"
        },
        "RDS-TMC_LOCATIONS": {
          "RDS-TMC": [
            {
              "ORIGIN": {
                "EBU_COUNTRY_CODE": "D",
                "TABLE_ID": 1,
                "LOCATION_ID": "42385",
                "LOCATION_DESC": "Aubing",
                "RDS_DIRECTION": "-"
              },
              "DIRECTION": "+",
              "ALERTC": {
                "TRAFFIC_CODE": 138,
                "QUANTIFIERS": 4,
                "DESCRIPTION": "Stockender Verkehr;; vorsichtig an das Stauende heranfahren.",
                "ALERTC_DURATION": "D",
                "ALERTC_DIRECTION": 1,
                "URGENCY": "U",
                "UPDATE_CLASS": 1,
                "PHRASE_CODE": "A2.Z112",
                "EXTENT": "1",
                "DURATION": 0
              },
              "LENGTH": 0.19102,
              "PRIMARY_OFFSET": 0.22535
            }
          ]
        },
        "LOCATION": {
          "DEFINED": {
            "ORIGIN": {
              "ROADWAY": {
                "DESCRIPTION": [
                  {
                    "value": "Autobahnring M\u00fcnchen",
                    "TYPE": "NTCSA"
                  },
                  {
                    "value": "Autobahnring M\u00fcnchen",
                    "TYPE": "RDSGN"
                  },
                  {
                    "value": "Autobahnring M\u00fcnchen",
                    "TYPE": "LOCAL"
                  }
                ],
                "ID": 50183
              },
              "POINT": {
                "DESCRIPTION": [
                  {
                    "value": "Germering-Nord",
                    "TYPE": "NTCSA"
                  },
                  {
                    "value": "Germering-Nord",
                    "TYPE": "RDSGN"
                  },
                  {
                    "value": "Germering-Nord",
                    "TYPE": "LOCAL"
                  },
                  {
                    "value": "Autobahnring M\u00fcnchen",
                    "TYPE": "BNAME"
                  }
                ],
                "ID": 42385
              },
              "DIRECTION": {
                "DESCRIPTION": [
                  {
                    "value": "M\u00dcNCHEN-NORD",
                    "TYPE": "LOCAL"
                  },
                  {
                    "value": "M\u00dcNCHEN-NORD",
                    "TYPE": "NTCSA"
                  },
                  {
                    "value": "M\u00dcNCHEN-NORD",
                    "TYPE": "RDSGN"
                  }
                ],
                "ID": 0
              },
              "PROXIMITY": {
                "ID": "AT",
                "DESCRIPTION": "at"
              }
            },
            "TO": {
              "ROADWAY": {
                "DESCRIPTION": [
                  {
                    "value": "Autobahnring M\u00fcnchen",
                    "TYPE": "NTCSA"
                  },
                  {
                    "value": "Autobahnring M\u00fcnchen",
                    "TYPE": "RDSGN"
                  },
                  {
                    "value": "Autobahnring M\u00fcnchen",
                    "TYPE": "LOCAL"
                  }
                ],
                "ID": 50183
              },
              "POINT": {
                "DESCRIPTION": [
                  {
                    "value": "Aubing",
                    "TYPE": "NTCSA"
                  },
                  {
                    "value": "Aubing",
                    "TYPE": "RDSGN"
                  },
                  {
                    "value": "Aubing",
                    "TYPE": "LOCAL"
                  },
                  {
                    "value": "Autobahnring M\u00fcnchen",
                    "TYPE": "BNAME"
                  }
                ],
                "ID": 42385
              },
              "DIRECTION": {
                "DESCRIPTION": [
                  {
                    "value": "M\u00dcNCHEN-NORD",
                    "TYPE": "LOCAL"
                  },
                  {
                    "value": "M\u00dcNCHEN-NORD",
                    "TYPE": "NTCSA"
                  },
                  {
                    "value": "M\u00dcNCHEN-NORD",
                    "TYPE": "RDSGN"
                  }
                ],
                "ID": 0
              },
              "PROXIMITY": {
                "ID": "AT",
                "DESCRIPTION": "at"
              }
            }
          },
          "GEOLOC": {
            "ORIGIN": {
              "LATITUDE": 48.16569,
              "LONGITUDE": 11.41235
            },
            "TO": [
              {
                "LATITUDE": 48.16757,
                "LONGITUDE": 11.41535
              }
            ]
          },
          "NAVTECH": {
            "EDGE": {
              "EDGE_ID": [
                "1187629179"
              ]
            },
            "VERSION_ID": "202102"
          },
          "LENGTH": 0.19102
        },
        "TRAFFIC_ITEM_DETAIL": {
          "ROAD_CLOSED": false,
          "INCIDENT": {
            "RESPONSE_VEHICLES": false,
            "CONGESTION_INCIDENT": {
              "CONGESTION_TYPE_DESC": "CONGESTION",
              "CONGESTION_FACTOR": 50
            }
          },
          "ALERTC": [
            {
              "EVENT_CODE": 138
            }
          ]
        },
        "TRAFFIC_ITEM_DESCRIPTION": [
          {
            "value": "Bei Aubing - Stockender Verkehr;; vorsichtig an das Stauende heranfahren.",
            "TYPE": "short_desc"
          },
          {
            "value": "Bei Aubing - Stockender Verkehr;; vorsichtig an das Stauende heranfahren.",
            "TYPE": "desc"
          },
          {
            "value": "Stockender Verkehr;; vorsichtig an das Stauende heranfahren.",
            "TYPE": "no_exit_description"
          }
        ],
        "mid": "19789ff0-d129-49b7-b495-f97ab14496e7|1629773902379",
        "PRODUCT": "basic"
      },
      {
        "TRAFFIC_ITEM_ID": 3747860335929683264,
        "ORIGINAL_TRAFFIC_ITEM_ID": 3316996380214135521,
        "TRAFFIC_ITEM_STATUS_SHORT_DESC": "ACTIVE",
        "TRAFFIC_ITEM_TYPE_DESC": "CONGESTION",
        "START_TIME": "08/24/2021 02:58:04",
        "END_TIME": "08/24/2021 03:08:19",
        "ENTRY_TIME": "08/24/2021 02:58:22",
        "CRITICALITY": {
          "ID": "2",
          "DESCRIPTION": "minor"
        },
        "VERIFIED": true,
        "ABBREVIATION": {
          "SHORT_DESC": "SLOW",
          "DESCRIPTION": "slow"
        },
        "RDS-TMC_LOCATIONS": {
          "RDS-TMC": [
            {
              "ORIGIN": {
                "EBU_COUNTRY_CODE": "D",
                "TABLE_ID": 1,
                "LOCATION_ID": "32604",
                "LOCATION_DESC": "Ortsteil Britz",
                "RDS_DIRECTION": "+"
              },
              "DIRECTION": "-",
              "ALERTC": {
                "TRAFFIC_CODE": 138,
                "QUANTIFIERS": 4,
                "DESCRIPTION": "Stockender Verkehr;; vorsichtig an das Stauende heranfahren.",
                "ALERTC_DURATION": "D",
                "ALERTC_DIRECTION": 1,
                "URGENCY": "U",
                "UPDATE_CLASS": 1,
                "PHRASE_CODE": "A2.Z112",
                "EXTENT": "1",
                "DURATION": 0
              },
              "LENGTH": 0.01687,
              "PRIMARY_OFFSET": 0.5097
            }
          ]
        },
        "LOCATION": {
          "DEFINED": {
            "ORIGIN": {
              "ROADWAY": {
                "DESCRIPTION": [
                  {
                    "value": "Stadtring Berlin",
                    "TYPE": "NTCSA"
                  },
                  {
                    "value": "Stadtring Berlin",
                    "TYPE": "RDSGN"
                  },
                  {
                    "value": "Stadtring Berlin",
                    "TYPE": "LOCAL"
                  }
                ],
                "ID": 50062
              },
              "POINT": {
                "DESCRIPTION": [
                  {
                    "value": "Britzer Damm",
                    "TYPE": "NTCSA"
                  },
                  {
                    "value": "Britzer Damm",
                    "TYPE": "RDSGN"
                  },
                  {
                    "value": "Britzer Damm",
                    "TYPE": "LOCAL"
                  },
                  {
                    "value": "Stadtring Berlin",
                    "TYPE": "BNAME"
                  }
                ],
                "ID": 32604
              },
              "DIRECTION": {
                "DESCRIPTION": [
                  {
                    "value": "WILMERSDORF",
                    "TYPE": "LOCAL"
                  },
                  {
                    "value": "WILMERSDORF",
                    "TYPE": "NTCSA"
                  },
                  {
                    "value": "WILMERSDORF",
                    "TYPE": "RDSGN"
                  }
                ],
                "ID": 0
              },
              "PROXIMITY": {
                "ID": "AT",
                "DESCRIPTION": "at"
              }
            },
            "TO": {
              "ROADWAY": {
                "DESCRIPTION": [
                  {
                    "value": "Stadtring Berlin",
                    "TYPE": "NTCSA"
                  },
                  {
                    "value": "Stadtring Berlin",
                    "TYPE": "RDSGN"
                  },
                  {
                    "value": "Stadtring Berlin",
                    "TYPE": "LOCAL"
                  }
                ],
                "ID": 50062
              },
              "POINT": {
                "DESCRIPTION": [
                  {
                    "value": "Ortsteil Britz",
                    "TYPE": "NTCSA"
                  },
                  {
                    "value": "Ortsteil Britz",
                    "TYPE": "RDSGN"
                  },
                  {
                    "value": "Ortsteil Britz",
                    "TYPE": "LOCAL"
                  },
                  {
                    "value": "Stadtring Berlin",
                    "TYPE": "BNAME"
                  }
                ],
                "ID": 32604
              },
              "DIRECTION": {
                "DESCRIPTION": [
                  {
                    "value": "WILMERSDORF",
                    "TYPE": "LOCAL"
                  },
                  {
                    "value": "WILMERSDORF",
                    "TYPE": "NTCSA"
                  },
                  {
                    "value": "WILMERSDORF",
                    "TYPE": "RDSGN"
                  }
                ],
                "ID": 0
              },
              "PROXIMITY": {
                "ID": "AT",
                "DESCRIPTION": "at"
              }
            }
          },
          "GEOLOC": {
            "ORIGIN": {
              "LATITUDE": 52.46181,
              "LONGITUDE": 13.42871
            },
            "TO": [
              {
                "LATITUDE": 52.46176,
                "LONGITUDE": 13.42836
              }
            ]
          },
          "NAVTECH": {
            "EDGE": {
              "EDGE_ID": [
                "1127234864"
              ]
            },
            "VERSION_ID": "202102"
          },
          "LENGTH": 0.01687
        },
        "TRAFFIC_ITEM_DETAIL": {
          "ROAD_CLOSED": false,
          "INCIDENT": {
            "RESPONSE_VEHICLES": false,
            "CONGESTION_INCIDENT": {
              "CONGESTION_TYPE_DESC": "CONGESTION",
              "CONGESTION_FACTOR": 50
            }
          },
          "ALERTC": [
            {
              "EVENT_CODE": 138
            }
          ]
        },
        "TRAFFIC_ITEM_DESCRIPTION": [
          {
            "value": "Bei Ortsteil Britz - Stockender Verkehr;; vorsichtig an das Stauende heranfahren.",
            "TYPE": "short_desc"
          },
          {
            "value": "Bei Ortsteil Britz - Stockender Verkehr;; vorsichtig an das Stauende heranfahren.",
            "TYPE": "desc"
          },
          {
            "value": "Stockender Verkehr;; vorsichtig an das Stauende heranfahren.",
            "TYPE": "no_exit_description"
          }
        ],
        "mid": "6a582e98-9332-4447-96d4-2a44eb802c4a|1629773902379",
        "PRODUCT": "basic"
      },
      {
        "TRAFFIC_ITEM_ID": 3479325870165102981,
        "ORIGINAL_TRAFFIC_ITEM_ID": 2480883778113744034,
        "TRAFFIC_ITEM_STATUS_SHORT_DESC": "ACTIVE",
        "TRAFFIC_ITEM_TYPE_DESC": "CONGESTION",
        "START_TIME": "08/24/2021 02:21:36",
        "END_TIME": "08/24/2021 03:08:19",
        "ENTRY_TIME": "08/24/2021 02:58:22",
        "CRITICALITY": {
          "ID": "2",
          "DESCRIPTION": "minor"
        },
        "VERIFIED": true,
        "ABBREVIATION": {
          "SHORT_DESC": "SLOW",
          "DESCRIPTION": "slow"
        },
        "RDS-TMC_LOCATIONS": {
          "RDS-TMC": [
            {
              "ORIGIN": {
                "EBU_COUNTRY_CODE": "D",
                "TABLE_ID": 1,
                "LOCATION_ID": "12552",
                "LOCATION_DESC": "Adelsried",
                "RDS_DIRECTION": "-"
              },
              "DIRECTION": "+",
              "ALERTC": {
                "TRAFFIC_CODE": 138,
                "QUANTIFIERS": 4,
                "DESCRIPTION": "Stockender Verkehr;; vorsichtig an das Stauende heranfahren.",
                "ALERTC_DURATION": "D",
                "ALERTC_DIRECTION": 1,
                "URGENCY": "U",
                "UPDATE_CLASS": 1,
                "PHRASE_CODE": "A2.Z112",
                "EXTENT": "1",
                "DURATION": 0
              },
              "LENGTH": 0.32697,
              "PRIMARY_OFFSET": 0.61003
            }
          ]
        },
        "LOCATION": {
          "DEFINED": {
            "ORIGIN": {
              "ROADWAY": {
                "DESCRIPTION": [
                  {
                    "value": "A8",
                    "TYPE": "NTCSA"
                  },
                  {
                    "value": "A8",
                    "TYPE": "RDSGN"
                  },
                  {
                    "value": "A8",
                    "TYPE": "LOCAL"
                  }
                ],
                "ID": 50167
              },
              "POINT": {
                "DESCRIPTION": [
                  {
                    "value": "Streitheimer Forst-Nord",
                    "TYPE": "NTCSA"
                  },
                  {
                    "value": "Streitheimer Forst-Nord",
                    "TYPE": "RDSGN"
                  },
                  {
                    "value": "Streitheimer Forst-Nord",
                    "TYPE": "LOCAL"
                  },
                  {
                    "value": "A8",
                    "TYPE": "BNAME"
                  }
                ],
                "ID": 12552
              },
              "DIRECTION": {
                "DESCRIPTION": [
                  {
                    "value": "M\u00dcNCHEN",
                    "TYPE": "LOCAL"
                  },
                  {
                    "value": "M\u00dcNCHEN",
                    "TYPE": "NTCSA"
                  },
                  {
                    "value": "M\u00dcNCHEN",
                    "TYPE": "RDSGN"
                  }
                ],
                "ID": 0
              },
              "PROXIMITY": {
                "ID": "AT",
                "DESCRIPTION": "at"
              }
            },
            "TO": {
              "ROADWAY": {
                "DESCRIPTION": [
                  {
                    "value": "A8",
                    "TYPE": "NTCSA"
                  },
                  {
                    "value": "A8",
                    "TYPE": "RDSGN"
                  },
                  {
                    "value": "A8",
                    "TYPE": "LOCAL"
                  }
                ],
                "ID": 50167
              },
              "POINT": {
                "DESCRIPTION": [
                  {
                    "value": "Adelsried",
                    "TYPE": "NTCSA"
                  },
                  {
                    "value": "Adelsried",
                    "TYPE": "RDSGN"
                  },
                  {
                    "value": "Adelsried",
                    "TYPE": "LOCAL"
                  },
                  {
                    "value": "A8",
                    "TYPE": "BNAME"
                  }
                ],
                "ID": 12552
              },
              "DIRECTION": {
                "DESCRIPTION": [
                  {
                    "value": "M\u00dcNCHEN",
                    "TYPE": "LOCAL"
                  },
                  {
                    "value": "M\u00dcNCHEN",
                    "TYPE": "NTCSA"
                  },
                  {
                    "value": "M\u00dcNCHEN",
                    "TYPE": "RDSGN"
                  }
                ],
                "ID": 0
              },
              "PROXIMITY": {
                "ID": "AT",
                "DESCRIPTION": "at"
              }
            }
          },
          "GEOLOC": {
            "ORIGIN": {
              "LATITUDE": 48.41818,
              "LONGITUDE": 10.70404
            },
            "TO": [
              {
                "LATITUDE": 48.41768,
                "LONGITUDE": 10.71093
              }
            ]
          },
          "NAVTECH": {
            "EDGE": {
              "EDGE_ID": [
                "1272477340"
              ]
            },
            "VERSION_ID": "202102"
          },
          "LENGTH": 0.32697
        },
        "TRAFFIC_ITEM_DETAIL": {
          "ROAD_CLOSED": false,
          "INCIDENT": {
            "RESPONSE_VEHICLES": false,
            "CONGESTION_INCIDENT": {
              "CONGESTION_TYPE_DESC": "CONGESTION",
              "CONGESTION_FACTOR": 50
            }
          },
          "ALERTC": [
            {
              "EVENT_CODE": 138
            }
          ]
        },
        "TRAFFIC_ITEM_DESCRIPTION": [
          {
            "value": "Bei Adelsried - Stockender Verkehr;; vorsichtig an das Stauende heranfahren.",
            "TYPE": "short_desc"
          },
          {
            "value": "Bei Adelsried - Stockender Verkehr;; vorsichtig an das Stauende heranfahren.",
            "TYPE": "desc"
          },
          {
            "value": "Stockender Verkehr;; vorsichtig an das Stauende heranfahren.",
            "TYPE": "no_exit_description"
          }
        ],
        "mid": "76c687a7-46d3-4d3c-9df8-07563f8bfaec|1629773902379",
        "PRODUCT": "basic"
      }
    ]
  },
  "diagnostic": {
    "info": "",
    "sfile": "Incident-E1409-1629773865915.xml.gz|pr1",
    "pdd": "trafficml-incident-24-v13"
  },
  "TIMESTAMP2": "2021-08-24T02:57:46.000+0000",
  "EXTENDED_COUNTRY_CODE": "E1"
}