{
  "TIMESTAMP": "08/24/2021 03:27:46 GMT",
  "VERSION": 2.3,
  "TRAFFIC_ITEMS": {
    "TRAFFIC_ITEM": [
      {
        "TRAFFIC_ITEM_ID": 1319404131533827681,
        "ORIGINAL_TRAFFIC_ITEM_ID": 999880033990893797,
        "TRAFFIC_ITEM_STATUS_SHORT_DESC": "ACTIVE",
        "TRAFFIC_ITEM_TYPE_DESC": "CONGESTION",
        "START_TIME": "08/24/2021 03:19:12",
        "END_TIME": "08/24/2021 03:38:19",
        "ENTRY_TIME": "08/24/2021 03:28:22",
        "CRITICALITY": {
          "ID": "2",
          "DESCRIPTION": "minor"
        },
        "VERIFIED": true,
        "ABBREVIATION": {
          "SHORT_DESC": "SLOW",
          "DESCRIPTION": "slow"
        },
        "RDS-TMC_LOCATIONS": {
          "RDS-TMC": [
            {
              "ORIGIN": {
                "EBU_COUNTRY_CODE": "D",
                "TABLE_ID": 1,
                "LOCATION_ID": "11278",
                "LOCATION_DESC": "Herne-Horsthausen",
                "RDS_DIRECTION": "+"
              },
              "DIRECTION": "-",
              "ALERTC": {
                "TRAFFIC_CODE": 138,
                "ALERTC_Q_BINARY": "2",
                "QUANTIFIERS": 4,
                "DESCRIPTION": "Stockender Verkehr; Durchschnittsgeschwindigkeit von bis zu 10 km/h; vorsichtig an das Stauende heranfahren.",
                "ALERTC_DURATION": "D",
                "ALERTC_DIRECTION": 1,
                "URGENCY": "U",
                "UPDATE_CLASS": 1,
                "PHRASE_CODE": "A2.Z112",
                "EXTENT": "1",
                "DURATION": 0
              },
              "LENGTH": 0.15366,
              "PRIMARY_OFFSET": 0.0
            }
          ]
        },
        "LOCATION": {
          "DEFINED": {
            "ORIGIN": {
              "ROADWAY": {
                "DESCRIPTION": [
                  {
                    "value": "A42",
                    "TYPE": "NTCSA"
                  },
                  {
                    "value": "A42",
                    "TYPE": "RDSGN"
                  },
                  {
                    "value": "A42",
                    "TYPE": "LOCAL"
                  }
                ],
                "ID": 7105
              },
              "POINT": {
                "DESCRIPTION": [
                  {
                    "value": "Herne-B\u00f6rnig",
                    "TYPE": "NTCSA"
                  },
                  {
                    "value": "Herne-B\u00f6rnig",
                    "TYPE": "RDSGN"
                  },
                  {
                    "value": "Herne-B\u00f6rnig",
                    "TYPE": "LOCAL"
                  },
                  {
                    "value": "A42",
                    "TYPE": "BNAME"
                  }
                ],
                "ID": 11278
              },
              "DIRECTION": {
                "DESCRIPTION": [
                  {
                    "value": "KAMP-LINTFORT",
                    "TYPE": "LOCAL"
                  },
                  {
                    "value": "KAMP-LINTFORT",
                    "TYPE": "NTCSA"
                  },
                  {
                    "value": "KAMP-LINTFORT",
                    "TYPE": "RDSGN"
                  }
                ],
                "ID": 0
              },
              "PROXIMITY": {
                "ID": "AT",
                "DESCRIPTION": "at"
              }
            },
            "TO": {
              "ROADWAY": {
                "DESCRIPTION": [
                  {
                    "value": "A42",
                    "TYPE": "NTCSA"
                  },
                  {
                    "value": "A42",
                    "TYPE": "RDSGN"
                  },
                  {
                    "value": "A42",
                    "TYPE": "LOCAL"
                  }
                ],
                "ID": 7105
              },
              "POINT": {
                "DESCRIPTION": [
                  {
                    "value": "Herne-Horsthausen",
                    "TYPE": "NTCSA"
                  },
                  {
                    "value": "Herne-Horsthausen",
                    "TYPE": "RDSGN"
                  },
                  {
                    "value": "Herne-Horsthausen",
                    "TYPE": "LOCAL"
                  },
                  {
                    "value": "A42",
                    "TYPE": "BNAME"
                  }
                ],
                "ID": 11278
              },
              "DIRECTION": {
                "DESCRIPTION": [
                  {
                    "value": "KAMP-LINTFORT",
                    "TYPE": "LOCAL"
                  },
                  {
                    "value": "KAMP-LINTFORT",
                    "TYPE": "NTCSA"
                  },
                  {
                    "value": "KAMP-LINTFORT",
                    "TYPE": "RDSGN"
                  }
                ],
                "ID": 0
              },
              "PROXIMITY": {
                "ID": "AT",
                "DESCRIPTION": "at"
              }
            }
          },
          "GEOLOC": {
            "ORIGIN": {
              "LATITUDE": 51.55731,
              "LONGITUDE": 7.23409
            },
            "TO": [
              {
                "LATITUDE": 51.55608,
                "LONGITUDE": 7.23112
              }
            ]
          },
          "NAVTECH": {
            "EDGE": {
              "EDGE_ID": [
                "587006446"
              ]
            },
            "VERSION_ID": "202102"
          },
          "LENGTH": 0.15366
        },
        "TRAFFIC_ITEM_DETAIL": {
          "ROAD_CLOSED": false,
          "INCIDENT": {
            "RESPONSE_VEHICLES": false,
            "CONGESTION_INCIDENT": {
              "CONGESTION_TYPE_DESC": "CONGESTION",
              "CONGESTION_FACTOR": 50
            }
          },
          "ALERTC": [
            {
              "EVENT_CODE": 138,
              "ALERTC_Q": 2
            }
          ]
        },
        "TRAFFIC_ITEM_DESCRIPTION": [
          {
            "value": "Bei Herne-Horsthausen - Stockender Verkehr; Durchschnittsgeschwindigkeit von bis zu 10 km/h; vorsichtig an das Stauende heranfahren.",
            "TYPE": "short_desc"
          },
          {
            "value": "Bei Herne-Horsthausen - Stockender Verkehr; Durchschnittsgeschwindigkeit von bis zu 10 km/h; vorsichtig an das Stauende heranfahren.",
            "TYPE": "desc"
          },
          {
            "value": "Stockender Verkehr; Durchschnittsgeschwindigkeit von bis zu 10 km/h; vorsichtig an das Stauende heranfahren.",
            "TYPE": "no_exit_description"
          }
        ],
        "mid": "551245d1-0ef4-4d72-b066-afd58e1cdad4|1629775702379",
        "PRODUCT": "basic"
      },
      {
        "TRAFFIC_ITEM_ID": 643678097108090998,
        "ORIGINAL_TRAFFIC_ITEM_ID": 2920229058118654442,
        "TRAFFIC_ITEM_STATUS_SHORT_DESC": "ACTIVE",
        "TRAFFIC_ITEM_TYPE_DESC": "CONGESTION",
        "START_TIME": "08/24/2021 03:23:34",
        "END_TIME": "08/24/2021 03:38:19",
        "ENTRY_TIME": "08/24/2021 03:23:52",
        "CRITICALITY": {
          "ID": "2",
          "DESCRIPTION": "minor"
        },
        "VERIFIED": true,
        "ABBREVIATION": {
          "SHORT_DESC": "SLOW",
          "DESCRIPTION": "slow"
        },
        "RDS-TMC_LOCATIONS": {
          "RDS-TMC": [
            {
              "ORIGIN": {
                "EBU_COUNTRY_CODE": "D",
                "TABLE_ID": 1,
                "LOCATION_ID": "32604",
                "LOCATION_DESC": "Ortsteil Britz",
                "RDS_DIRECTION": "+"
              },
              "DIRECTION": "-",
              "ALERTC": {
                "TRAFFIC_CODE": 138,
                "QUANTIFIERS": 4,
                "DESCRIPTION": "Stockender Verkehr;; vorsichtig an das Stauende heranfahren.",
                "ALERTC_DURATION": "D",
                "ALERTC_DIRECTION": 1,
                "URGENCY": "U",
                "UPDATE_CLASS": 1,
                "PHRASE_CODE": "A2.Z112",
                "EXTENT": "1",
                "DURATION": 0
              },
              "LENGTH": 0.01687,
              "PRIMARY_OFFSET": 0.5097
            }
          ]
        },
        "LOCATION": {
          "DEFINED": {
            "ORIGIN": {
              "ROADWAY": {
                "DESCRIPTION": [
                  {
                    "value": "Stadtring Berlin",
                    "TYPE": "NTCSA"
                  },
                  {
                    "value": "Stadtring Berlin",
                    "TYPE": "RDSGN"
                  },
                  {
                    "value": "Stadtring Berlin",
                    "TYPE": "LOCAL"
                  }
                ],
                "ID": 50062
              },
              "POINT": {
                "DESCRIPTION": [
                  {
                    "value": "Britzer Damm",
                    "TYPE": "NTCSA"
                  },
                  {
                    "value": "Britzer Damm",
                    "TYPE": "RDSGN"
                  },
                  {
                    "value": "Britzer Damm",
                    "TYPE": "LOCAL"
                  },
                  {
                    "value": "Stadtring Berlin",
                    "TYPE": "BNAME"
                  }
                ],
                "ID": 32604
              },
              "DIRECTION": {
                "DESCRIPTION": [
                  {
                    "value": "WILMERSDORF",
                    "TYPE": "LOCAL"
                  },
                  {
                    "value": "WILMERSDORF",
                    "TYPE": "NTCSA"
                  },
                  {
                    "value": "WILMERSDORF",
                    "TYPE": "RDSGN"
                  }
                ],
                "ID": 0
              },
              "PROXIMITY": {
                "ID": "AT",
                "DESCRIPTION": "at"
              }
            },
            "TO": {
              "ROADWAY": {
                "DESCRIPTION": [
                  {
                    "value": "Stadtring Berlin",
                    "TYPE": "NTCSA"
                  },
                  {
                    "value": "Stadtring Berlin",
                    "TYPE": "RDSGN"
                  },
                  {
                    "value": "Stadtring Berlin",
                    "TYPE": "LOCAL"
                  }
                ],
                "ID": 50062
              },
              "POINT": {
                "DESCRIPTION": [
                  {
                    "value": "Ortsteil Britz",
                    "TYPE": "NTCSA"
                  },
                  {
                    "value": "Ortsteil Britz",
                    "TYPE": "RDSGN"
                  },
                  {
                    "value": "Ortsteil Britz",
                    "TYPE": "LOCAL"
                  },
                  {
                    "value": "Stadtring Berlin",
                    "TYPE": "BNAME"
                  }
                ],
                "ID": 32604
              },
              "DIRECTION": {
                "DESCRIPTION": [
                  {
                    "value": "WILMERSDORF",
                    "TYPE": "LOCAL"
                  },
                  {
                    "value": "WILMERSDORF",
                    "TYPE": "NTCSA"
                  },
                  {
                    "value": "WILMERSDORF",
                    "TYPE": "RDSGN"
                  }
                ],
                "ID": 0
              },
              "PROXIMITY": {
                "ID": "AT",
                "DESCRIPTION": "at"
              }
            }
          },
          "GEOLOC": {
            "ORIGIN": {
              "LATITUDE": 52.46181,
              "LONGITUDE": 13.42871
            },
            "TO": [
              {
                "LATITUDE": 52.46176,
                "LONGITUDE": 13.42836
              }
            ]
          },
          "NAVTECH": {
            "EDGE": {
              "EDGE_ID": [
                "1127234864"
              ]
            },
            "VERSION_ID": "202102"
          },
          "LENGTH": 0.01687
        },
        "TRAFFIC_ITEM_DETAIL": {
          "ROAD_CLOSED": false,
          "INCIDENT": {
            "RESPONSE_VEHICLES": false,
            "CONGESTION_INCIDENT": {
              "CONGESTION_TYPE_DESC": "CONGESTION",
              "CONGESTION_FACTOR": 50
            }
          },
          "ALERTC": [
            {
              "EVENT_CODE": 138
            }
          ]
        },
        "TRAFFIC_ITEM_DESCRIPTION": [
          {
            "value": "Bei Ortsteil Britz - Stockender Verkehr;; vorsichtig an das Stauende heranfahren.",
            "TYPE": "short_desc"
          },
          {
            "value": "Bei Ortsteil Britz - Stockender Verkehr;; vorsichtig an das Stauende heranfahren.",
            "TYPE": "desc"
          },
          {
            "value": "Stockender Verkehr;; vorsichtig an das Stauende heranfahren.",
            "TYPE": "no_exit_description"
          }
        ],
        "mid": "148db64e-f9b1-4360-af76-ee7c2dc71245|1629775432379",
        "PRODUCT": "basic"
      },
      {
        "TRAFFIC_ITEM_ID": 3863390621700350411,
        "ORIGINAL_TRAFFIC_ITEM_ID": 2323759756040873624,
        "TRAFFIC_ITEM_STATUS_SHORT_DESC": "ACTIVE",
        "TRAFFIC_ITEM_TYPE_DESC": "CONGESTION",
        "START_TIME": "08/24/2021 03:23:25",
        "END_TIME": "08/24/2021 03:38:19",
        "ENTRY_TIME": "08/24/2021 03:28:22",
        "CRITICALITY": {
          "ID": "2",
          "DESCRIPTION": "minor"
        },
        "VERIFIED": true,
        "ABBREVIATION": {
          "SHORT_DESC": "SLOW",
          "DESCRIPTION": "slow"
        },
        "RDS-TMC_LOCATIONS": {
          "RDS-TMC": [
            {
              "ORIGIN": {
                "EBU_COUNTRY_CODE": "D",
                "TABLE_ID": 1,
                "LOCATION_ID": "43506",
                "LOCATION_DESC": "Magdeburg-Stadtfeld",
                "RDS_DIRECTION": "+"
              },
              "DIRECTION": "-",
              "ALERTC": {
                "TRAFFIC_CODE": 138,
                "ALERTC_Q_BINARY": "1",
                "QUANTIFIERS": 4,
                "DESCRIPTION": "Stockender Verkehr; Durchschnittsgeschwindigkeit von bis zu 5 km/h; vorsichtig an das Stauende heranfahren.",
                "ALERTC_DURATION": "D",
                "ALERTC_DIRECTION": 1,
                "URGENCY": "U",
                "UPDATE_CLASS": 1,
                "PHRASE_CODE": "A2.Z112",
                "EXTENT": "1",
                "DURATION": 0
              },
              "LENGTH": 0.19264,
              "PRIMARY_OFFSET": 4.09567
            }
          ]
        },
        "LOCATION": {
          "DEFINED": {
            "ORIGIN": {
              "ROADWAY": {
                "DESCRIPTION": [
                  {
                    "value": "A14",
                    "TYPE": "NTCSA"
                  },
                  {
                    "value": "A14",
                    "TYPE": "RDSGN"
                  },
                  {
                    "value": "A14",
                    "TYPE": "LOCAL"
                  }
                ],
                "ID": 51281
              },
              "POINT": {
                "DESCRIPTION": [
                  {
                    "value": "Wanzleben",
                    "TYPE": "NTCSA"
                  },
                  {
                    "value": "Wanzleben",
                    "TYPE": "RDSGN"
                  },
                  {
                    "value": "Wanzleben",
                    "TYPE": "LOCAL"
                  },
                  {
                    "value": "A14",
                    "TYPE": "BNAME"
                  }
                ],
                "ID": 43506
              },
              "DIRECTION": {
                "DESCRIPTION": [
                  {
                    "value": "MAGDEBURG",
                    "TYPE": "LOCAL"
                  },
                  {
                    "value": "MAGDEBURG",
                    "TYPE": "NTCSA"
                  },
                  {
                    "value": "MAGDEBURG",
                    "TYPE": "RDSGN"
                  }
                ],
                "ID": 0
              },
              "PROXIMITY": {
                "ID": "AT",
                "DESCRIPTION": "at"
              }
            },
            "TO": {
              "ROADWAY": {
                "DESCRIPTION": [
                  {
                    "value": "A14",
                    "TYPE": "NTCSA"
                  },
                  {
                    "value": "A14",
                    "TYPE": "RDSGN"
                  },
                  {
                    "value": "A14",
                    "TYPE": "LOCAL"
                  }
                ],
                "ID": 51281
              },
              "POINT": {
                "DESCRIPTION": [
                  {
                    "value": "Magdeburg-Stadtfeld",
                    "TYPE": "NTCSA"
                  },
                  {
                    "value": "Magdeburg-Stadtfeld",
                    "TYPE": "RDSGN"
                  },
                  {
                    "value": "Magdeburg-Stadtfeld",
                    "TYPE": "LOCAL"
                  },
                  {
                    "value": "A14",
                    "TYPE": "BNAME"
                  }
                ],
                "ID": 43506
              },
              "DIRECTION": {
                "DESCRIPTION": [
                  {
                    "value": "MAGDEBURG",
                    "TYPE": "LOCAL"
                  },
                  {
                    "value": "MAGDEBURG",
                    "TYPE": "NTCSA"
                  },
                  {
                    "value": "MAGDEBURG",
                    "TYPE": "RDSGN"
                  }
                ],
                "ID": 0
              },
              "PROXIMITY": {
                "ID": "AT",
                "DESCRIPTION": "at"
              }
            }
          },
          "GEOLOC": {
            "ORIGIN": {
              "LATITUDE": 52.08649,
              "LONGITUDE": 11.5373
            },
            "TO": [
              {
                "LATITUDE": 52.08924,
                "LONGITUDE": 11.53518
              }
            ]
          },
          "NAVTECH": {
            "EDGE": {
              "EDGE_ID": [
                "1223364422"
              ]
            },
            "VERSION_ID": "202102"
          },
          "LENGTH": 0.19264
        },
        "TRAFFIC_ITEM_DETAIL": {
          "ROAD_CLOSED": false,
          "INCIDENT": {
            "RESPONSE_VEHICLES": false,
            "CONGESTION_INCIDENT": {
              "CONGESTION_TYPE_DESC": "CONGESTION",
              "CONGESTION_FACTOR": 50
            }
          },
          "ALERTC": [
            {
              "EVENT_CODE": 138,
              "ALERTC_Q": 1
            }
          ]
        },
        "TRAFFIC_ITEM_DESCRIPTION": [
          {
            "value": "Bei Magdeburg-Stadtfeld - Stockender Verkehr; Durchschnittsgeschwindigkeit von bis zu 5 km/h; vorsichtig an das Stauende heranfahren.",
            "TYPE": "short_desc"
          },
          {
            "value": "Bei Magdeburg-Stadtfeld - Stockender Verkehr; Durchschnittsgeschwindigkeit von bis zu 5 km/h; vorsichtig an das Stauende heranfahren.",
            "TYPE": "desc"
          },
          {
            "value": "Stockender Verkehr; Durchschnittsgeschwindigkeit von bis zu 5 km/h; vorsichtig an das Stauende heranfahren.",
            "TYPE": "no_exit_description"
          }
        ],
        "mid": "37b18543-9c22-49c5-8c8a-d8ba31c5b9ed|1629775702379",
        "PRODUCT": "basic"
      },
      {
        "TRAFFIC_ITEM_ID": 2459251490332755586,
        "ORIGINAL_TRAFFIC_ITEM_ID": 325019441547497112,
        "TRAFFIC_ITEM_STATUS_SHORT_DESC": "ACTIVE",
        "TRAFFIC_ITEM_TYPE_DESC": "CONGESTION",
        "START_TIME": "08/24/2021 03:29:01",
        "END_TIME": "08/24/2021 03:39:16",
        "ENTRY_TIME": "08/24/2021 03:29:17",
        "CRITICALITY": {
          "ID": "2",
          "DESCRIPTION": "minor"
        },
        "VERIFIED": true,
        "ABBREVIATION": {
          "SHORT_DESC": "SLOW",
          "DESCRIPTION": "slow"
        },
        "RDS-TMC_LOCATIONS": {
          "RDS-TMC": [
            {
              "ORIGIN": {
                "EBU_COUNTRY_CODE": "A",
                "TABLE_ID": 1,
                "LOCATION_ID": "31280",
                "LOCATION_DESC": "St. Michael im Lungau",
                "RDS_DIRECTION": "-"
              },
              "DIRECTION": "+",
              "ALERTC": {
                "TRAFFIC_CODE": 138,
                "QUANTIFIERS": 4,
                "DESCRIPTION": "Stockender Verkehr;; vorsichtig an das Stauende heranfahren.",
                "ALERTC_DURATION": "D",
                "ALERTC_DIRECTION": 1,
                "URGENCY": "U",
                "UPDATE_CLASS": 1,
                "PHRASE_CODE": "A2.Z112",
                "EXTENT": "1",
                "DURATION": 0
              },
              "LENGTH": 0.0254,
              "PRIMARY_OFFSET": 0.18927
            }
          ]
        },
        "LOCATION": {
          "DEFINED": {
            "ORIGIN": {
              "ROADWAY": {
                "DESCRIPTION": [
                  {
                    "value": "Tauern Autobahn",
                    "TYPE": "NTCSA"
                  },
                  {
                    "value": "Tauern Autobahn",
                    "TYPE": "RDSGN"
                  },
                  {
                    "value": "Tauern Autobahn",
                    "TYPE": "LOCAL"
                  }
                ],
                "ID": 30566
              },
              "POINT": {
                "DESCRIPTION": [
                  {
                    "value": "Parkplatz Lansch\u00fctz",
                    "TYPE": "NTCSA"
                  },
                  {
                    "value": "Parkplatz Lansch\u00fctz",
                    "TYPE": "RDSGN"
                  },
                  {
                    "value": "Parkplatz Lansch\u00fctz",
                    "TYPE": "LOCAL"
                  },
                  {
                    "value": "Tauern Autobahn",
                    "TYPE": "BNAME"
                  }
                ],
                "ID": 31280
              },
              "DIRECTION": {
                "DESCRIPTION": [
                  {
                    "value": "VILLACH",
                    "TYPE": "LOCAL"
                  },
                  {
                    "value": "VILLACH",
                    "TYPE": "NTCSA"
                  },
                  {
                    "value": "VILLACH",
                    "TYPE": "RDSGN"
                  }
                ],
                "ID": 0
              },
              "PROXIMITY": {
                "ID": "AT",
                "DESCRIPTION": "at"
              }
            },
            "TO": {
              "ROADWAY": {
                "DESCRIPTION": [
                  {
                    "value": "Tauern Autobahn",
                    "TYPE": "NTCSA"
                  },
                  {
                    "value": "Tauern Autobahn",
                    "TYPE": "RDSGN"
                  },
                  {
                    "value": "Tauern Autobahn",
                    "TYPE": "LOCAL"
                  }
                ],
                "ID": 30566
              },
              "POINT": {
                "DESCRIPTION": [
                  {
                    "value": "St. Michael im Lungau",
                    "TYPE": "NTCSA"
                  },
                  {
                    "value": "St. Michael im Lungau",
                    "TYPE": "RDSGN"
                  },
                  {
                    "value": "St. Michael im Lungau",
                    "TYPE": "LOCAL"
                  },
                  {
                    "value": "Tauern Autobahn",
                    "TYPE": "BNAME"
                  }
                ],
                "ID": 31280
              },
              "DIRECTION": {
                "DESCRIPTION": [
                  {
                    "value": "VILLACH",
                    "TYPE": "LOCAL"
                  },
                  {
                    "value": "VILLACH",
                    "TYPE": "NTCSA"
                  },
                  {
                    "value": "VILLACH",
                    "TYPE": "RDSGN"
                  }
                ],
                "ID": 0
              },
              "PROXIMITY": {
                "ID": "AT",
                "DESCRIPTION": "at"
              }
            }
          },
          "GEOLOC": {
            "ORIGIN": {
              "LATITUDE": 47.09502,
              "LONGITUDE": 13.60859
            },
            "TO": [
              {
                "LATITUDE": 47.09472,
                "LONGITUDE": 13.60881
              }
            ]
          },
          "NAVTECH": {
            "EDGE": {
              "EDGE_ID": [
                "1210473320"
              ]
            },
            "VERSION_ID": "202102"
          },
          "LENGTH": 0.0254
        },
        "TRAFFIC_ITEM_DETAIL": {
          "ROAD_CLOSED": false,
          "INCIDENT": {
            "RESPONSE_VEHICLES": false,
            "CONGESTION_INCIDENT": {
              "CONGESTION_TYPE_DESC": "CONGESTION",
              "CONGESTION_FACTOR": 50
            }
          },
          "ALERTC": [
            {
              "EVENT_CODE": 138
            }
          ]
        },
        "TRAFFIC_ITEM_DESCRIPTION": [
          {
            "value": "Bei St. Michael im Lungau - Stockender Verkehr;; vorsichtig an das Stauende heranfahren.",
            "TYPE": "short_desc"
          },
          {
            "value": "Bei St. Michael im Lungau - Stockender Verkehr;; vorsichtig an das Stauende heranfahren.",
            "TYPE": "desc"
          },
          {
            "value": "Stockender Verkehr;; vorsichtig an das Stauende heranfahren.",
            "TYPE": "no_exit_description"
          }
        ],
        "mid": "fac4edf4-e778-465b-bc09-257f800714b0|1629775757379",
        "PRODUCT": "basic"
      },
      {
        "TRAFFIC_ITEM_ID": 1952122794614768682,
        "ORIGINAL_TRAFFIC_ITEM_ID": 2960237432489860143,
        "TRAFFIC_ITEM_STATUS_SHORT_DESC": "ACTIVE",
        "TRAFFIC_ITEM_TYPE_DESC": "CONGESTION",
        "START_TIME": "08/24/2021 03:26:34",
        "END_TIME": "08/24/2021 03:38:19",
        "ENTRY_TIME": "08/24/2021 03:28:22",
        "CRITICALITY": {
          "ID": "2",
          "DESCRIPTION": "minor"
        },
        "VERIFIED": true,
        "ABBREVIATION": {
          "SHORT_DESC": "SLOW",
          "DESCRIPTION": "slow"
        },
        "RDS-TMC_LOCATIONS": {
          "RDS-TMC": [
            {
              "ORIGIN": {
                "EBU_COUNTRY_CODE": "D",
                "TABLE_ID": 1,
                "LOCATION_ID": "11413",
                "LOCATION_DESC": "Siegerland",
                "RDS_DIRECTION": "-"
              },
              "DIRECTION": "+",
              "ALERTC": {
                "TRAFFIC_CODE": 138,
                "ALERTC_Q_BINARY": "1",
                "QUANTIFIERS": 4,
                "DESCRIPTION": "Stockender Verkehr; Durchschnittsgeschwindigkeit von bis zu 5 km/h; vorsichtig an das Stauende heranfahren.",
                "ALERTC_DURATION": "D",
                "ALERTC_DIRECTION": 1,
                "URGENCY": "U",
                "UPDATE_CLASS": 1,
                "PHRASE_CODE": "A2.Z112",
                "EXTENT": "1",
                "DURATION": 0
              },
              "LENGTH": 0.09664,
              "PRIMARY_OFFSET": 1.70214
            }
          ]
        },
        "LOCATION": {
          "DEFINED": {
            "ORIGIN": {
              "ROADWAY": {
                "DESCRIPTION": [
                  {
                    "value": "A45",
                    "TYPE": "NTCSA"
                  },
                  {
                    "value": "A45",
                    "TYPE": "RDSGN"
                  },
                  {
                    "value": "A45",
                    "TYPE": "LOCAL"
                  }
                ],
                "ID": 50119
              },
              "POINT": {
                "DESCRIPTION": [
                  {
                    "value": "Siegen",
                    "TYPE": "NTCSA"
                  },
                  {
                    "value": "Siegen",
                    "TYPE": "RDSGN"
                  },
                  {
                    "value": "Siegen",
                    "TYPE": "LOCAL"
                  },
                  {
                    "value": "A45",
                    "TYPE": "BNAME"
                  }
                ],
                "ID": 11413
              },
              "DIRECTION": {
                "DESCRIPTION": [
                  {
                    "value": "HAGEN",
                    "TYPE": "LOCAL"
                  },
                  {
                    "value": "HAGEN",
                    "TYPE": "NTCSA"
                  },
                  {
                    "value": "HAGEN",
                    "TYPE": "RDSGN"
                  }
                ],
                "ID": 0
              },
              "PROXIMITY": {
                "ID": "AT",
                "DESCRIPTION": "at"
              }
            },
            "TO": {
              "ROADWAY": {
                "DESCRIPTION": [
                  {
                    "value": "A45",
                    "TYPE": "NTCSA"
                  },
                  {
                    "value": "A45",
                    "TYPE": "RDSGN"
                  },
                  {
                    "value": "A45",
                    "TYPE": "LOCAL"
                  }
                ],
                "ID": 50119
              },
              "POINT": {
                "DESCRIPTION": [
                  {
                    "value": "Siegerland",
                    "TYPE": "NTCSA"
                  },
                  {
                    "value": "Siegerland",
                    "TYPE": "RDSGN"
                  },
                  {
                    "value": "Siegerland",
                    "TYPE": "LOCAL"
                  },
                  {
                    "value": "A45",
                    "TYPE": "BNAME"
                  }
                ],
                "ID": 11413
              },
              "DIRECTION": {
                "DESCRIPTION": [
                  {
                    "value": "HAGEN",
                    "TYPE": "LOCAL"
                  },
                  {
                    "value": "HAGEN",
                    "TYPE": "NTCSA"
                  },
                  {
                    "value": "HAGEN",
                    "TYPE": "RDSGN"
                  }
                ],
                "ID": 0
              },
              "PROXIMITY": {
                "ID": "AT",
                "DESCRIPTION": "at"
              }
            }
          },
          "GEOLOC": {
            "ORIGIN": {
              "LATITUDE": 50.86534,
              "LONGITUDE": 7.97678
            },
            "TO": [
              {
                "LATITUDE": 50.866,
                "LONGITUDE": 7.97492
              }
            ]
          },
          "NAVTECH": {
            "EDGE": {
              "EDGE_ID": [
                "1129399326"
              ]
            },
            "VERSION_ID": "202102"
          },
          "LENGTH": 0.09664
        },
        "TRAFFIC_ITEM_DETAIL": {
          "ROAD_CLOSED": false,
          "INCIDENT": {
            "RESPONSE_VEHICLES": false,
            "CONGESTION_INCIDENT": {
              "CONGESTION_TYPE_DESC": "CONGESTION",
              "CONGESTION_FACTOR": 50
            }
          },
          "ALERTC": [
            {
              "EVENT_CODE": 138,
              "ALERTC_Q": 1
            }
          ]
        },
        "TRAFFIC_ITEM_DESCRIPTION": [
          {
            "value": "Bei Siegerland - Stockender Verkehr; Durchschnittsgeschwindigkeit von bis zu 5 km/h; vorsichtig an das Stauende heranfahren.",
            "TYPE": "short_desc"
          },
          {
            "value": "Bei Siegerland - Stockender Verkehr; Durchschnittsgeschwindigkeit von bis zu 5 km/h; vorsichtig an das Stauende heranfahren.",
            "TYPE": "desc"
          },
          {
            "value": "Stockender Verkehr; Durchschnittsgeschwindigkeit von bis zu 5 km/h; vorsichtig an das Stauende heranfahren.",
            "TYPE": "no_exit_description"
          }
        ],
        "mid": "88a61f4e-80a7-44ab-a269-d11e04c4508c|1629775702379",
        "PRODUCT": "basic"
      },
      {
        "TRAFFIC_ITEM_ID": 2756805537630024797,
        "ORIGINAL_TRAFFIC_ITEM_ID": 1023608632344440636,
        "TRAFFIC_ITEM_STATUS_SHORT_DESC": "ACTIVE",
        "TRAFFIC_ITEM_TYPE_DESC": "CONGESTION",
        "START_TIME": "08/24/2021 03:26:57",
        "END_TIME": "08/24/2021 03:41:57",
        "ENTRY_TIME": "08/24/2021 03:27:57",
        "CRITICALITY": {
          "ID": "2",
          "DESCRIPTION": "minor"
        },
        "VERIFIED": true,
        "ABBREVIATION": {
          "SHORT_DESC": "SLOW",
          "DESCRIPTION": "slow"
        },
        "RDS-TMC_LOCATIONS": {
          "RDS-TMC": [
            {
              "ORIGIN": {
                "EBU_COUNTRY_CODE": "D",
                "TABLE_ID": 1,
                "LOCATION_ID": "11277",
                "LOCATION_DESC": "Herne-Baukau",
                "RDS_DIRECTION": "+"
              },
              "DIRECTION": "-",
              "ALERTC": {
                "TRAFFIC_CODE": 136,
                "QUANTIFIERS": 4,
                "DESCRIPTION": "Verkehrsst\u00f6rung.",
                "ALERTC_DURATION": "D",
                "ALERTC_DIRECTION": 1,
                "UPDATE_CLASS": 1,
                "PHRASE_CODE": "A9",
                "EXTENT": "1",
                "DURATION": 0,
                "SUPP_TRAFFIC_CODE": [
                  {
                    "CODE": 141
                  }
                ]
              },
              "LENGTH": 0.63044,
              "PRIMARY_OFFSET": 0.20197
            }
          ]
        },
        "LOCATION": {
          "DEFINED": {
            "ORIGIN": {
              "ROADWAY": {
                "DESCRIPTION": [
                  {
                    "value": "A42",
                    "TYPE": "NTCSA"
                  },
                  {
                    "value": "A42",
                    "TYPE": "RDSGN"
                  },
                  {
                    "value": "A42",
                    "TYPE": "LOCAL"
                  }
                ],
                "ID": 7105
              },
              "POINT": {
                "DESCRIPTION": [
                  {
                    "value": "Herne-Horsthausen",
                    "TYPE": "NTCSA"
                  },
                  {
                    "value": "Herne-Horsthausen",
                    "TYPE": "RDSGN"
                  },
                  {
                    "value": "Herne-Horsthausen",
                    "TYPE": "LOCAL"
                  },
                  {
                    "value": "A42",
                    "TYPE": "BNAME"
                  }
                ],
                "ID": 11277
              },
              "DIRECTION": {
                "DESCRIPTION": [
                  {
                    "value": "KAMP-LINTFORT",
                    "TYPE": "LOCAL"
                  },
                  {
                    "value": "KAMP-LINTFORT",
                    "TYPE": "NTCSA"
                  },
                  {
                    "value": "KAMP-LINTFORT",
                    "TYPE": "RDSGN"
                  }
                ],
                "ID": 0
              },
              "PROXIMITY": {
                "ID": "AT",
                "DESCRIPTION": "at"
              }
            },
            "TO": {
              "ROADWAY": {
                "DESCRIPTION": [
                  {
                    "value": "A42",
                    "TYPE": "NTCSA"
                  },
                  {
                    "value": "A42",
                    "TYPE": "RDSGN"
                  },
                  {
                    "value": "A42",
                    "TYPE": "LOCAL"
                  }
                ],
                "ID": 7105
              },
              "POINT": {
                "DESCRIPTION": [
                  {
                    "value": "Herne-Baukau",
                    "TYPE": "NTCSA"
                  },
                  {
                    "value": "Herne-Baukau",
                    "TYPE": "RDSGN"
                  },
                  {
                    "value": "Herne-Baukau",
                    "TYPE": "LOCAL"
                  },
                  {
                    "value": "A42",
                    "TYPE": "BNAME"
                  }
                ],
                "ID": 11277
              },
              "DIRECTION": {
                "DESCRIPTION": [
                  {
                    "value": "KAMP-LINTFORT",
                    "TYPE": "LOCAL"
                  },
                  {
                    "value": "KAMP-LINTFORT",
                    "TYPE": "NTCSA"
                  },
                  {
                    "value": "KAMP-LINTFORT",
                    "TYPE": "RDSGN"
                  }
                ],
                "ID": 0
              },
              "PROXIMITY": {
                "ID": "AT",
                "DESCRIPTION": "at"
              }
            }
          },
          "GEOLOC": {
            "ORIGIN": {
              "LATITUDE": 51.55488,
              "LONGITUDE": 7.22826
            },
            "TO": [
              {
                "LATITUDE": 51.54987,
                "LONGITUDE": 7.21605
              }
            ]
          },
          "NAVTECH": {
            "EDGE": {
              "EDGE_ID": [
                "813297799",
                "813297801",
                "1129114640",
                "1129114639",
                "1048203583"
              ]
            },
            "VERSION_ID": "202102"
          },
          "LENGTH": 0.63044
        },
        "TRAFFIC_ITEM_DETAIL": {
          "ROAD_CLOSED": false,
          "INCIDENT": {
            "RESPONSE_VEHICLES": false,
            "CONGESTION_INCIDENT": {
              "CONGESTION_TYPE_DESC": "CONGESTION",
              "CONGESTION_FACTOR": 50
            }
          },
          "ALERTC": [
            {
              "EVENT_CODE": 136,
              "SUPP_TRAFFIC_CODE": [
                141
              ]
            }
          ]
        },
        "TRAFFIC_ITEM_DESCRIPTION": [
          {
            "value": "Bei Herne-Baukau - Verkehrsst\u00f6rung. auf der rechten Seite.",
            "TYPE": "short_desc"
          },
          {
            "value": "Bei Herne-Baukau - Verkehrsst\u00f6rung. auf der rechten Seite.",
            "TYPE": "desc"
          },
          {
            "value": "Verkehrsst\u00f6rung. auf der rechten Seite.",
            "TYPE": "no_exit_description"
          }
        ],
        "mid": "534969071629775617454|1629775677465",
        "PRODUCT": "basic"
      },
      {
        "TRAFFIC_ITEM_ID": 3055801059796054910,
        "ORIGINAL_TRAFFIC_ITEM_ID": 3504366210242175014,
        "TRAFFIC_ITEM_STATUS_SHORT_DESC": "ACTIVE",
        "TRAFFIC_ITEM_TYPE_DESC": "CONGESTION",
        "START_TIME": "08/24/2021 03:01:56",
        "END_TIME": "08/24/2021 03:38:19",
        "ENTRY_TIME": "08/24/2021 03:28:22",
        "CRITICALITY": {
          "ID": "2",
          "DESCRIPTION": "minor"
        },
        "VERIFIED": true,
        "ABBREVIATION": {
          "SHORT_DESC": "SLOW",
          "DESCRIPTION": "slow"
        },
        "RDS-TMC_LOCATIONS": {
          "RDS-TMC": [
            {
              "ORIGIN": {
                "EBU_COUNTRY_CODE": "D",
                "TABLE_ID": 1,
                "LOCATION_ID": "31678",
                "LOCATION_DESC": "M\u00fcnchen-Eschenried",
                "RDS_DIRECTION": "-"
              },
              "DIRECTION": "+",
              "ALERTC": {
                "TRAFFIC_CODE": 138,
                "ALERTC_Q_BINARY": "2",
                "QUANTIFIERS": 4,
                "DESCRIPTION": "Stockender Verkehr; Durchschnittsgeschwindigkeit von bis zu 10 km/h; vorsichtig an das Stauende heranfahren.",
                "ALERTC_DURATION": "D",
                "ALERTC_DIRECTION": 1,
                "URGENCY": "U",
                "UPDATE_CLASS": 1,
                "PHRASE_CODE": "A2.Z112",
                "EXTENT": "1",
                "DURATION": 0
              },
              "LENGTH": 0.15137,
              "PRIMARY_OFFSET": 0.0203
            }
          ]
        },
        "LOCATION": {
          "DEFINED": {
            "ORIGIN": {
              "ROADWAY": {
                "DESCRIPTION": [
                  {
                    "value": "Eschenrieder Spange",
                    "TYPE": "NTCSA"
                  },
                  {
                    "value": "Eschenrieder Spange",
                    "TYPE": "RDSGN"
                  },
                  {
                    "value": "Eschenrieder Spange",
                    "TYPE": "LOCAL"
                  }
                ],
                "ID": 31677
              },
              "POINT": {
                "DESCRIPTION": [
                  {
                    "value": "M\u00fcnchen-Eschenried",
                    "TYPE": "NTCSA"
                  },
                  {
                    "value": "M\u00fcnchen-Eschenried",
                    "TYPE": "RDSGN"
                  },
                  {
                    "value": "M\u00fcnchen-Eschenried",
                    "TYPE": "LOCAL"
                  },
                  {
                    "value": "Eschenrieder Spange",
                    "TYPE": "BNAME"
                  }
                ],
                "ID": 31678
              },
              "DIRECTION": {
                "DESCRIPTION": [
                  {
                    "value": "M\u00dcNCHEN-ALLACH",
                    "TYPE": "LOCAL"
                  },
                  {
                    "value": "M\u00dcNCHEN-ALLACH",
                    "TYPE": "NTCSA"
                  },
                  {
                    "value": "M\u00dcNCHEN-ALLACH",
                    "TYPE": "RDSGN"
                  }
                ],
                "ID": 0
              },
              "PROXIMITY": {
                "ID": "AT",
                "DESCRIPTION": "at"
              }
            },
            "TO": {
              "ROADWAY": {
                "DESCRIPTION": [
                  {
                    "value": "Eschenrieder Spange",
                    "TYPE": "NTCSA"
                  },
                  {
                    "value": "Eschenrieder Spange",
                    "TYPE": "RDSGN"
                  },
                  {
                    "value": "Eschenrieder Spange",
                    "TYPE": "LOCAL"
                  }
                ],
                "ID": 31677
              },
              "POINT": {
                "DESCRIPTION": [
                  {
                    "value": "M\u00fcnchen-Eschenried",
                    "TYPE": "NTCSA"
                  },
                  {
                    "value": "M\u00fcnchen-Eschenried",
                    "TYPE": "RDSGN"
                  },
                  {
                    "value": "M\u00fcnchen-Eschenried",
                    "TYPE": "LOCAL"
                  },
                  {
                    "value": "Eschenrieder Spange",
                    "TYPE": "BNAME"
                  }
                ],
                "ID": 31678
              },
              "DIRECTION": {
                "DESCRIPTION": [
                  {
                    "value": "M\u00dcNCHEN-ALLACH",
                    "TYPE": "LOCAL"
                  },
                  {
                    "value": "M\u00dcNCHEN-ALLACH",
                    "TYPE": "NTCSA"
                  },
                  {
                    "value": "M\u00dcNCHEN-ALLACH",
                    "TYPE": "RDSGN"
                  }
                ],
                "ID": 0
              },
              "PROXIMITY": {
                "ID": "AT",
                "DESCRIPTION": "at"
              }
            }
          },
          "GEOLOC": {
            "ORIGIN": {
              "LATITUDE": 48.20634,
              "LONGITUDE": 11.39626
            },
            "TO": [
              {
                "LATITUDE": 48.20615,
                "LONGITUDE": 11.3995
              }
            ]
          },
          "NAVTECH": {
            "EDGE": {
              "EDGE_ID": [
                "1236207830"
              ]
            },
            "VERSION_ID": "202102"
          },
          "LENGTH": 0.15137
        },
        "TRAFFIC_ITEM_DETAIL": {
          "ROAD_CLOSED": false,
          "INCIDENT": {
            "RESPONSE_VEHICLES": false,
            "CONGESTION_INCIDENT": {
              "CONGESTION_TYPE_DESC": "CONGESTION",
              "CONGESTION_FACTOR": 50
            }
          },
          "ALERTC": [
            {
              "EVENT_CODE": 138,
              "ALERTC_Q": 2
            }
          ]
        },
        "TRAFFIC_ITEM_DESCRIPTION": [
          {
            "value": "Bei M\u00fcnchen-Eschenried - Stockender Verkehr; Durchschnittsgeschwindigkeit von bis zu 10 km/h; vorsichtig an das Stauende heranfahren.",
            "TYPE": "short_desc"
          },
          {
            "value": "Bei M\u00fcnchen-Eschenried - Stockender Verkehr; Durchschnittsgeschwindigkeit von bis zu 10 km/h; vorsichtig an das Stauende heranfahren.",
            "TYPE": "desc"
          },
          {
            "value": "Stockender Verkehr; Durchschnittsgeschwindigkeit von bis zu 10 km/h; vorsichtig an das Stauende heranfahren.",
            "TYPE": "no_exit_description"
          }
        ],
        "mid": "ad847e24-dde6-41a4-b7be-48ab0a714b4d|1629775702379",
        "PRODUCT": "basic"
      },
      {
        "TRAFFIC_ITEM_ID": 141890062262759790,
        "ORIGINAL_TRAFFIC_ITEM_ID": 3259153767017522335,
        "TRAFFIC_ITEM_STATUS_SHORT_DESC": "ACTIVE",
        "TRAFFIC_ITEM_TYPE_DESC": "CONGESTION",
        "START_TIME": "08/24/2021 03:25:49",
        "END_TIME": "08/24/2021 03:38:19",
        "ENTRY_TIME": "08/24/2021 03:27:22",
        "CRITICALITY": {
          "ID": "2",
          "DESCRIPTION": "minor"
        },
        "VERIFIED": true,
        "ABBREVIATION": {
          "SHORT_DESC": "SLOW",
          "DESCRIPTION": "slow"
        },
        "RDS-TMC_LOCATIONS": {
          "RDS-TMC": [
            {
              "ORIGIN": {
                "EBU_COUNTRY_CODE": "D",
                "TABLE_ID": 1,
                "LOCATION_ID": "32614",
                "LOCATION_DESC": "Rudower H\u00f6he",
                "RDS_DIRECTION": "-"
              },
              "DIRECTION": "+",
              "ALERTC": {
                "TRAFFIC_CODE": 138,
                "QUANTIFIERS": 4,
                "DESCRIPTION": "Stockender Verkehr;; vorsichtig an das Stauende heranfahren.",
                "ALERTC_DURATION": "D",
                "ALERTC_DIRECTION": 1,
                "URGENCY": "U",
                "UPDATE_CLASS": 1,
                "PHRASE_CODE": "A2.Z112",
                "EXTENT": "1",
                "DURATION": 0
              },
              "LENGTH": 0.23541,
              "PRIMARY_OFFSET": 0.30737
            }
          ]
        },
        "LOCATION": {
          "DEFINED": {
            "ORIGIN": {
              "ROADWAY": {
                "DESCRIPTION": [
                  {
                    "value": "Autobahnzubringer Dresden",
                    "TYPE": "NTCSA"
                  },
                  {
                    "value": "Autobahnzubringer Dresden",
                    "TYPE": "RDSGN"
                  },
                  {
                    "value": "Autobahnzubringer Dresden",
                    "TYPE": "LOCAL"
                  }
                ],
                "ID": 32603
              },
              "POINT": {
                "DESCRIPTION": [
                  {
                    "value": "Adlershof",
                    "TYPE": "NTCSA"
                  },
                  {
                    "value": "Adlershof",
                    "TYPE": "RDSGN"
                  },
                  {
                    "value": "Adlershof",
                    "TYPE": "LOCAL"
                  },
                  {
                    "value": "Autobahnzubringer Dresden",
                    "TYPE": "BNAME"
                  }
                ],
                "ID": 32614
              },
              "DIRECTION": {
                "DESCRIPTION": [
                  {
                    "value": "SCH\u00d6NEFELD",
                    "TYPE": "LOCAL"
                  },
                  {
                    "value": "SCH\u00d6NEFELD",
                    "TYPE": "NTCSA"
                  },
                  {
                    "value": "SCH\u00d6NEFELD",
                    "TYPE": "RDSGN"
                  }
                ],
                "ID": 0
              },
              "PROXIMITY": {
                "ID": "AT",
                "DESCRIPTION": "at"
              }
            },
            "TO": {
              "ROADWAY": {
                "DESCRIPTION": [
                  {
                    "value": "Autobahnzubringer Dresden",
                    "TYPE": "NTCSA"
                  },
                  {
                    "value": "Autobahnzubringer Dresden",
                    "TYPE": "RDSGN"
                  },
                  {
                    "value": "Autobahnzubringer Dresden",
                    "TYPE": "LOCAL"
                  }
                ],
                "ID": 32603
              },
              "POINT": {
                "DESCRIPTION": [
                  {
                    "value": "Rudower H\u00f6he",
                    "TYPE": "NTCSA"
                  },
                  {
                    "value": "Rudower H\u00f6he",
                    "TYPE": "RDSGN"
                  },
                  {
                    "value": "Rudower H\u00f6he",
                    "TYPE": "LOCAL"
                  },
                  {
                    "value": "Autobahnzubringer Dresden",
                    "TYPE": "BNAME"
                  }
                ],
                "ID": 32614
              },
              "DIRECTION": {
                "DESCRIPTION": [
                  {
                    "value": "SCH\u00d6NEFELD",
                    "TYPE": "LOCAL"
                  },
                  {
                    "value": "SCH\u00d6NEFELD",
                    "TYPE": "NTCSA"
                  },
                  {
                    "value": "SCH\u00d6NEFELD",
                    "TYPE": "RDSGN"
                  }
                ],
                "ID": 0
              },
              "PROXIMITY": {
                "ID": "AT",
                "DESCRIPTION": "at"
              }
            }
          },
          "GEOLOC": {
            "ORIGIN": {
              "LATITUDE": 52.42057,
              "LONGITUDE": 13.52187
            },
            "TO": [
              {
                "LATITUDE": 52.41722,
                "LONGITUDE": 13.52281
              }
            ]
          },
          "NAVTECH": {
            "EDGE": {
              "EDGE_ID": [
                "1242593211"
              ]
            },
            "VERSION_ID": "202102"
          },
          "LENGTH": 0.23541
        },
        "TRAFFIC_ITEM_DETAIL": {
          "ROAD_CLOSED": false,
          "INCIDENT": {
            "RESPONSE_VEHICLES": false,
            "CONGESTION_INCIDENT": {
              "CONGESTION_TYPE_DESC": "CONGESTION",
              "CONGESTION_FACTOR": 50
            }
          },
          "ALERTC": [
            {
              "EVENT_CODE": 138
            }
          ]
        },
        "TRAFFIC_ITEM_DESCRIPTION": [
          {
            "value": "Bei Rudower H\u00f6he - Stockender Verkehr;; vorsichtig an das Stauende heranfahren.",
            "TYPE": "short_desc"
          },
          {
            "value": "Bei Rudower H\u00f6he - Stockender Verkehr;; vorsichtig an das Stauende heranfahren.",
            "TYPE": "desc"
          },
          {
            "value": "Stockender Verkehr;; vorsichtig an das Stauende heranfahren.",
            "TYPE": "no_exit_description"
          }
        ],
        "mid": "1941e90c-2ad1-40c9-ab8a-065535e8bb35|1629775642379",
        "PRODUCT": "basic"
      },
      {
        "TRAFFIC_ITEM_ID": 4371708622284891478,
        "ORIGINAL_TRAFFIC_ITEM_ID": 2535627741825368378,
        "TRAFFIC_ITEM_STATUS_SHORT_DESC": "ACTIVE",
        "TRAFFIC_ITEM_TYPE_DESC": "CONGESTION",
        "START_TIME": "08/24/2021 03:24:14",
        "END_TIME": "08/24/2021 03:39:16",
        "ENTRY_TIME": "08/24/2021 03:29:17",
        "CRITICALITY": {
          "ID": "2",
          "DESCRIPTION": "minor"
        },
        "VERIFIED": true,
        "ABBREVIATION": {
          "SHORT_DESC": "SLOW",
          "DESCRIPTION": "slow"
        },
        "RDS-TMC_LOCATIONS": {
          "RDS-TMC": [
            {
              "ORIGIN": {
                "EBU_COUNTRY_CODE": "A",
                "TABLE_ID": 1,
                "LOCATION_ID": "35958",
                "LOCATION_DESC": "Mautstelle Sch\u00f6nberg",
                "RDS_DIRECTION": "+"
              },
              "DIRECTION": "-",
              "ALERTC": {
                "TRAFFIC_CODE": 138,
                "QUANTIFIERS": 4,
                "DESCRIPTION": "Stockender Verkehr;; vorsichtig an das Stauende heranfahren.",
                "ALERTC_DURATION": "D",
                "ALERTC_DIRECTION": 1,
                "URGENCY": "U",
                "UPDATE_CLASS": 1,
                "PHRASE_CODE": "A2.Z112",
                "EXTENT": "1",
                "DURATION": 0
              },
              "LENGTH": 0.02271,
              "PRIMARY_OFFSET": 0.02349
            }
          ]
        },
        "LOCATION": {
          "DEFINED": {
            "ORIGIN": {
              "ROADWAY": {
                "DESCRIPTION": [
                  {
                    "value": "Brenner Autobahn",
                    "TYPE": "NTCSA"
                  },
                  {
                    "value": "Brenner Autobahn",
                    "TYPE": "RDSGN"
                  },
                  {
                    "value": "Brenner Autobahn",
                    "TYPE": "LOCAL"
                  }
                ],
                "ID": 30575
              },
              "POINT": {
                "DESCRIPTION": [
                  {
                    "value": "Parkplatz Gschleirs",
                    "TYPE": "NTCSA"
                  },
                  {
                    "value": "Parkplatz Gschleirs",
                    "TYPE": "RDSGN"
                  },
                  {
                    "value": "Parkplatz Gschleirs",
                    "TYPE": "LOCAL"
                  },
                  {
                    "value": "Brenner Autobahn",
                    "TYPE": "BNAME"
                  }
                ],
                "ID": 35958
              },
              "DIRECTION": {
                "DESCRIPTION": [
                  {
                    "value": "INNSBRUCK",
                    "TYPE": "LOCAL"
                  },
                  {
                    "value": "INNSBRUCK",
                    "TYPE": "NTCSA"
                  },
                  {
                    "value": "INNSBRUCK",
                    "TYPE": "RDSGN"
                  }
                ],
                "ID": 0
              },
              "PROXIMITY": {
                "ID": "AT",
                "DESCRIPTION": "at"
              }
            },
            "TO": {
              "ROADWAY": {
                "DESCRIPTION": [
                  {
                    "value": "Brenner Autobahn",
                    "TYPE": "NTCSA"
                  },
                  {
                    "value": "Brenner Autobahn",
                    "TYPE": "RDSGN"
                  },
                  {
                    "value": "Brenner Autobahn",
                    "TYPE": "LOCAL"
                  }
                ],
                "ID": 30575
              },
              "POINT": {
                "DESCRIPTION": [
                  {
                    "value": "Mautstelle Sch\u00f6nberg",
                    "TYPE": "NTCSA"
                  },
                  {
                    "value": "Mautstelle Sch\u00f6nberg",
                    "TYPE": "RDSGN"
                  },
                  {
                    "value": "Mautstelle Sch\u00f6nberg",
                    "TYPE": "LOCAL"
                  },
                  {
                    "value": "Brenner Autobahn",
                    "TYPE": "BNAME"
                  }
                ],
                "ID": 35958
              },
              "DIRECTION": {
                "DESCRIPTION": [
                  {
                    "value": "INNSBRUCK",
                    "TYPE": "LOCAL"
                  },
                  {
                    "value": "INNSBRUCK",
                    "TYPE": "NTCSA"
                  },
                  {
                    "value": "INNSBRUCK",
                    "TYPE": "RDSGN"
                  }
                ],
                "ID": 0
              },
              "PROXIMITY": {
                "ID": "AT",
                "DESCRIPTION": "at"
              }
            }
          },
          "GEOLOC": {
            "ORIGIN": {
              "LATITUDE": 47.18414,
              "LONGITUDE": 11.40569
            },
            "TO": [
              {
                "LATITUDE": 47.18416,
                "LONGITUDE": 11.40521
              }
            ]
          },
          "NAVTECH": {
            "EDGE": {
              "EDGE_ID": [
                "1210479439"
              ]
            },
            "VERSION_ID": "202102"
          },
          "LENGTH": 0.02271
        },
        "TRAFFIC_ITEM_DETAIL": {
          "ROAD_CLOSED": false,
          "INCIDENT": {
            "RESPONSE_VEHICLES": false,
            "CONGESTION_INCIDENT": {
              "CONGESTION_TYPE_DESC": "CONGESTION",
              "CONGESTION_FACTOR": 50
            }
          },
          "ALERTC": [
            {
              "EVENT_CODE": 138
            }
          ]
        },
        "TRAFFIC_ITEM_DESCRIPTION": [
          {
            "value": "Bei Mautstelle Sch\u00f6nberg - Stockender Verkehr;; vorsichtig an das Stauende heranfahren.",
            "TYPE": "short_desc"
          },
          {
            "value": "Bei Mautstelle Sch\u00f6nberg - Stockender Verkehr;; vorsichtig an das Stauende heranfahren.",
            "TYPE": "desc"
          },
          {
            "value": "Stockender Verkehr;; vorsichtig an das Stauende heranfahren.",
            "TYPE": "no_exit_description"
          }
        ],
        "mid": "f5d42a17-6a2e-45ca-b7bb-35d6637e7122|1629775757379",
        "PRODUCT": "basic"
      },
      {
        "TRAFFIC_ITEM_ID": 3527801788478784494,
        "ORIGINAL_TRAFFIC_ITEM_ID": 4126183497718182484,
        "TRAFFIC_ITEM_STATUS_SHORT_DESC": "ACTIVE",
        "TRAFFIC_ITEM_TYPE_DESC": "CONGESTION",
        "START_TIME": "08/24/2021 03:24:49",
        "END_TIME": "08/24/2021 03:38:19",
        "ENTRY_TIME": "08/24/2021 03:28:22",
        "CRITICALITY": {
          "ID": "2",
          "DESCRIPTION": "minor"
        },
        "VERIFIED": true,
        "ABBREVIATION": {
          "SHORT_DESC": "SLOW",
          "DESCRIPTION": "slow"
        },
        "RDS-TMC_LOCATIONS": {
          "RDS-TMC": [
            {
              "ORIGIN": {
                "EBU_COUNTRY_CODE": "D",
                "TABLE_ID": 1,
                "LOCATION_ID": "14614",
                "LOCATION_DESC": "Schnelsen",
                "RDS_DIRECTION": "+"
              },
              "DIRECTION": "-",
              "ALERTC": {
                "TRAFFIC_CODE": 138,
                "QUANTIFIERS": 4,
                "DESCRIPTION": "Stockender Verkehr;; vorsichtig an das Stauende heranfahren.",
                "ALERTC_DURATION": "D",
                "ALERTC_DIRECTION": 1,
                "URGENCY": "U",
                "UPDATE_CLASS": 1,
                "PHRASE_CODE": "A2.Z112",
                "EXTENT": "1",
                "DURATION": 0
              },
              "LENGTH": 0.10688,
              "PRIMARY_OFFSET": 0.0
            }
          ]
        },
        "LOCATION": {
          "DEFINED": {
            "ORIGIN": {
              "ROADWAY": {
                "DESCRIPTION": [
                  {
                    "value": "A7",
                    "TYPE": "NTCSA"
                  },
                  {
                    "value": "A7",
                    "TYPE": "RDSGN"
                  },
                  {
                    "value": "A7",
                    "TYPE": "LOCAL"
                  }
                ],
                "ID": 50163
              },
              "POINT": {
                "DESCRIPTION": [
                  {
                    "value": "Hamburg-Schnelsen",
                    "TYPE": "NTCSA"
                  },
                  {
                    "value": "Hamburg-Schnelsen",
                    "TYPE": "RDSGN"
                  },
                  {
                    "value": "Hamburg-Schnelsen",
                    "TYPE": "LOCAL"
                  },
                  {
                    "value": "A7",
                    "TYPE": "BNAME"
                  }
                ],
                "ID": 14614
              },
              "DIRECTION": {
                "DESCRIPTION": [
                  {
                    "value": "HAMBURG",
                    "TYPE": "LOCAL"
                  },
                  {
                    "value": "HAMBURG",
                    "TYPE": "NTCSA"
                  },
                  {
                    "value": "HAMBURG",
                    "TYPE": "RDSGN"
                  }
                ],
                "ID": 0
              },
              "PROXIMITY": {
                "ID": "AT",
                "DESCRIPTION": "at"
              }
            },
            "TO": {
              "ROADWAY": {
                "DESCRIPTION": [
                  {
                    "value": "A7",
                    "TYPE": "NTCSA"
                  },
                  {
                    "value": "A7",
                    "TYPE": "RDSGN"
                  },
                  {
                    "value": "A7",
                    "TYPE": "LOCAL"
                  }
                ],
                "ID": 50163
              },
              "POINT": {
                "DESCRIPTION": [
                  {
                    "value": "Schnelsen",
                    "TYPE": "NTCSA"
                  },
                  {
                    "value": "Schnelsen",
                    "TYPE": "RDSGN"
                  },
                  {
                    "value": "Schnelsen",
                    "TYPE": "LOCAL"
                  },
                  {
                    "value": "A7",
                    "TYPE": "BNAME"
                  }
                ],
                "ID": 14614
              },
              "DIRECTION": {
                "DESCRIPTION": [
                  {
                    "value": "HAMBURG",
                    "TYPE": "LOCAL"
                  },
                  {
                    "value": "HAMBURG",
                    "TYPE": "NTCSA"
                  },
                  {
                    "value": "HAMBURG",
                    "TYPE": "RDSGN"
                  }
                ],
                "ID": 0
              },
              "PROXIMITY": {
                "ID": "AT",
                "DESCRIPTION": "at"
              }
            }
          },
          "GEOLOC": {
            "ORIGIN": {
              "LATITUDE": 53.63265,
              "LONGITUDE": 9.92299
            },
            "TO": [
              {
                "LATITUDE": 53.63113,
                "LONGITUDE": 9.92252
              }
            ]
          },
          "NAVTECH": {
            "EDGE": {
              "EDGE_ID": [
                "1286110773"
              ]
            },
            "VERSION_ID": "202102"
          },
          "LENGTH": 0.10688
        },
        "TRAFFIC_ITEM_DETAIL": {
          "ROAD_CLOSED": false,
          "INCIDENT": {
            "RESPONSE_VEHICLES": false,
            "CONGESTION_INCIDENT": {
              "CONGESTION_TYPE_DESC": "CONGESTION",
              "CONGESTION_FACTOR": 50
            }
          },
          "ALERTC": [
            {
              "EVENT_CODE": 138
            }
          ]
        },
        "TRAFFIC_ITEM_DESCRIPTION": [
          {
            "value": "Bei Schnelsen - Stockender Verkehr;; vorsichtig an das Stauende heranfahren.",
            "TYPE": "short_desc"
          },
          {
            "value": "Bei Schnelsen - Stockender Verkehr;; vorsichtig an das Stauende heranfahren.",
            "TYPE": "desc"
          },
          {
            "value": "Stockender Verkehr;; vorsichtig an das Stauende heranfahren.",
            "TYPE": "no_exit_description"
          }
        ],
        "mid": "b0b7653c-c766-409a-9ec1-3bc738bf44c9|1629775702379",
        "PRODUCT": "basic"
      },
      {
        "TRAFFIC_ITEM_ID": 3628246168078827487,
        "ORIGINAL_TRAFFIC_ITEM_ID": 3727971896151096542,
        "TRAFFIC_ITEM_STATUS_SHORT_DESC": "ACTIVE",
        "TRAFFIC_ITEM_TYPE_DESC": "CONGESTION",
        "START_TIME": "08/24/2021 03:25:49",
        "END_TIME": "08/24/2021 03:38:19",
        "ENTRY_TIME": "08/24/2021 03:28:22",
        "CRITICALITY": {
          "ID": "2",
          "DESCRIPTION": "minor"
        },
        "VERIFIED": true,
        "ABBREVIATION": {
          "SHORT_DESC": "SLOW",
          "DESCRIPTION": "slow"
        },
        "RDS-TMC_LOCATIONS": {
          "RDS-TMC": [
            {
              "ORIGIN": {
                "EBU_COUNTRY_CODE": "D",
                "TABLE_ID": 1,
                "LOCATION_ID": "12536",
                "LOCATION_DESC": "M\u00fchlhausen",
                "RDS_DIRECTION": "-"
              },
              "DIRECTION": "+",
              "ALERTC": {
                "TRAFFIC_CODE": 138,
                "ALERTC_Q_BINARY": "1",
                "QUANTIFIERS": 4,
                "DESCRIPTION": "Stockender Verkehr; Durchschnittsgeschwindigkeit von bis zu 5 km/h; vorsichtig an das Stauende heranfahren.",
                "ALERTC_DURATION": "D",
                "ALERTC_DIRECTION": 1,
                "URGENCY": "U",
                "UPDATE_CLASS": 1,
                "PHRASE_CODE": "A2.Z112",
                "EXTENT": "1",
                "DURATION": 0
              },
              "LENGTH": 0.02825,
              "PRIMARY_OFFSET": 0.16543
            }
          ]
        },
        "LOCATION": {
          "DEFINED": {
            "ORIGIN": {
              "ROADWAY": {
                "DESCRIPTION": [
                  {
                    "value": "A8",
                    "TYPE": "NTCSA"
                  },
                  {
                    "value": "A8",
                    "TYPE": "RDSGN"
                  },
                  {
                    "value": "A8",
                    "TYPE": "LOCAL"
                  }
                ],
                "ID": 50167
              },
              "POINT": {
                "DESCRIPTION": [
                  {
                    "value": "Gruibingen",
                    "TYPE": "NTCSA"
                  },
                  {
                    "value": "Gruibingen",
                    "TYPE": "RDSGN"
                  },
                  {
                    "value": "Gruibingen",
                    "TYPE": "LOCAL"
                  },
                  {
                    "value": "A8",
                    "TYPE": "BNAME"
                  }
                ],
                "ID": 12536
              },
              "DIRECTION": {
                "DESCRIPTION": [
                  {
                    "value": "M\u00dcNCHEN",
                    "TYPE": "LOCAL"
                  },
                  {
                    "value": "M\u00dcNCHEN",
                    "TYPE": "NTCSA"
                  },
                  {
                    "value": "M\u00dcNCHEN",
                    "TYPE": "RDSGN"
                  }
                ],
                "ID": 0
              },
              "PROXIMITY": {
                "ID": "AT",
                "DESCRIPTION": "at"
              }
            },
            "TO": {
              "ROADWAY": {
                "DESCRIPTION": [
                  {
                    "value": "A8",
                    "TYPE": "NTCSA"
                  },
                  {
                    "value": "A8",
                    "TYPE": "RDSGN"
                  },
                  {
                    "value": "A8",
                    "TYPE": "LOCAL"
                  }
                ],
                "ID": 50167
              },
              "POINT": {
                "DESCRIPTION": [
                  {
                    "value": "M\u00fchlhausen",
                    "TYPE": "NTCSA"
                  },
                  {
                    "value": "M\u00fchlhausen",
                    "TYPE": "RDSGN"
                  },
                  {
                    "value": "M\u00fchlhausen",
                    "TYPE": "LOCAL"
                  },
                  {
                    "value": "A8",
                    "TYPE": "BNAME"
                  }
                ],
                "ID": 12536
              },
              "DIRECTION": {
                "DESCRIPTION": [
                  {
                    "value": "M\u00dcNCHEN",
                    "TYPE": "LOCAL"
                  },
                  {
                    "value": "M\u00dcNCHEN",
                    "TYPE": "NTCSA"
                  },
                  {
                    "value": "M\u00dcNCHEN",
                    "TYPE": "RDSGN"
                  }
                ],
                "ID": 0
              },
              "PROXIMITY": {
                "ID": "AT",
                "DESCRIPTION": "at"
              }
            }
          },
          "GEOLOC": {
            "ORIGIN": {
              "LATITUDE": 48.58478,
              "LONGITUDE": 9.65971
            },
            "TO": [
              {
                "LATITUDE": 48.58462,
                "LONGITUDE": 9.66025
              }
            ]
          },
          "NAVTECH": {
            "EDGE": {
              "EDGE_ID": [
                "724206626"
              ]
            },
            "VERSION_ID": "202102"
          },
          "LENGTH": 0.02825
        },
        "TRAFFIC_ITEM_DETAIL": {
          "ROAD_CLOSED": false,
          "INCIDENT": {
            "RESPONSE_VEHICLES": false,
            "CONGESTION_INCIDENT": {
              "CONGESTION_TYPE_DESC": "CONGESTION",
              "CONGESTION_FACTOR": 50
            }
          },
          "ALERTC": [
            {
              "EVENT_CODE": 138,
              "ALERTC_Q": 1
            }
          ]
        },
        "TRAFFIC_ITEM_DESCRIPTION": [
          {
            "value": "Bei M\u00fchlhausen - Stockender Verkehr; Durchschnittsgeschwindigkeit von bis zu 5 km/h; vorsichtig an das Stauende heranfahren.",
            "TYPE": "short_desc"
          },
          {
            "value": "Bei M\u00fchlhausen - Stockender Verkehr; Durchschnittsgeschwindigkeit von bis zu 5 km/h; vorsichtig an das Stauende heranfahren.",
            "TYPE": "desc"
          },
          {
            "value": "Stockender Verkehr; Durchschnittsgeschwindigkeit von bis zu 5 km/h; vorsichtig an das Stauende heranfahren.",
            "TYPE": "no_exit_description"
          }
        ],
        "mid": "65114a81-8601-4cc8-9bec-edefa9e0ec0f|1629775702379",
        "PRODUCT": "basic"
      },
      {
        "TRAFFIC_ITEM_ID": 4553923179852425179,
        "ORIGINAL_TRAFFIC_ITEM_ID": 2075985265342707297,
        "TRAFFIC_ITEM_STATUS_SHORT_DESC": "ACTIVE",
        "TRAFFIC_ITEM_TYPE_DESC": "CONGESTION",
        "START_TIME": "08/24/2021 03:25:49",
        "END_TIME": "08/24/2021 03:38:19",
        "ENTRY_TIME": "08/24/2021 03:28:22",
        "CRITICALITY": {
          "ID": "2",
          "DESCRIPTION": "minor"
        },
        "VERIFIED": true,
        "ABBREVIATION": {
          "SHORT_DESC": "SLOW",
          "DESCRIPTION": "slow"
        },
        "RDS-TMC_LOCATIONS": {
          "RDS-TMC": [
            {
              "ORIGIN": {
                "EBU_COUNTRY_CODE": "D",
                "TABLE_ID": 1,
                "LOCATION_ID": "10759",
                "LOCATION_DESC": "Bremen-Burg-Grambke",
                "RDS_DIRECTION": "+"
              },
              "DIRECTION": "-",
              "ALERTC": {
                "TRAFFIC_CODE": 138,
                "QUANTIFIERS": 4,
                "DESCRIPTION": "Stockender Verkehr;; vorsichtig an das Stauende heranfahren.",
                "ALERTC_DURATION": "D",
                "ALERTC_DIRECTION": 1,
                "URGENCY": "U",
                "UPDATE_CLASS": 1,
                "PHRASE_CODE": "A2.Z112",
                "EXTENT": "1",
                "DURATION": 0
              },
              "LENGTH": 0.0337,
              "PRIMARY_OFFSET": 0.02399
            }
          ]
        },
        "LOCATION": {
          "DEFINED": {
            "ORIGIN": {
              "ROADWAY": {
                "DESCRIPTION": [
                  {
                    "value": "A281",
                    "TYPE": "NTCSA"
                  },
                  {
                    "value": "A281",
                    "TYPE": "RDSGN"
                  },
                  {
                    "value": "A281",
                    "TYPE": "LOCAL"
                  }
                ],
                "ID": 50098
              },
              "POINT": {
                "DESCRIPTION": [
                  {
                    "value": "Bremen-Industrieh\u00e4fen",
                    "TYPE": "NTCSA"
                  },
                  {
                    "value": "Bremen-Industrieh\u00e4fen",
                    "TYPE": "RDSGN"
                  },
                  {
                    "value": "Bremen-Industrieh\u00e4fen",
                    "TYPE": "LOCAL"
                  },
                  {
                    "value": "A281",
                    "TYPE": "BNAME"
                  }
                ],
                "ID": 10759
              },
              "DIRECTION": {
                "DESCRIPTION": [
                  {
                    "value": "BREMEN-BURG GRAMBKE",
                    "TYPE": "LOCAL"
                  },
                  {
                    "value": "BREMEN-BURG GRAMBKE",
                    "TYPE": "NTCSA"
                  },
                  {
                    "value": "BREMEN-BURG GRAMBKE",
                    "TYPE": "RDSGN"
                  }
                ],
                "ID": 0
              },
              "PROXIMITY": {
                "ID": "AT",
                "DESCRIPTION": "at"
              }
            },
            "TO": {
              "ROADWAY": {
                "DESCRIPTION": [
                  {
                    "value": "A281",
                    "TYPE": "NTCSA"
                  },
                  {
                    "value": "A281",
                    "TYPE": "RDSGN"
                  },
                  {
                    "value": "A281",
                    "TYPE": "LOCAL"
                  }
                ],
                "ID": 50098
              },
              "POINT": {
                "DESCRIPTION": [
                  {
                    "value": "Bremen-Burg-Grambke",
                    "TYPE": "NTCSA"
                  },
                  {
                    "value": "Bremen-Burg-Grambke",
                    "TYPE": "RDSGN"
                  },
                  {
                    "value": "Bremen-Burg-Grambke",
                    "TYPE": "LOCAL"
                  },
                  {
                    "value": "A281",
                    "TYPE": "BNAME"
                  }
                ],
                "ID": 10759
              },
              "DIRECTION": {
                "DESCRIPTION": [
                  {
                    "value": "BREMEN-BURG GRAMBKE",
                    "TYPE": "LOCAL"
                  },
                  {
                    "value": "BREMEN-BURG GRAMBKE",
                    "TYPE": "NTCSA"
                  },
                  {
                    "value": "BREMEN-BURG GRAMBKE",
                    "TYPE": "RDSGN"
                  }
                ],
                "ID": 0
              },
              "PROXIMITY": {
                "ID": "AT",
                "DESCRIPTION": "at"
              }
            }
          },
          "GEOLOC": {
            "ORIGIN": {
              "LATITUDE": 53.13594,
              "LONGITUDE": 8.71433
            },
            "TO": [
              {
                "LATITUDE": 53.13565,
                "LONGITUDE": 8.71492
              }
            ]
          },
          "NAVTECH": {
            "EDGE": {
              "EDGE_ID": [
                "920991254"
              ]
            },
            "VERSION_ID": "202102"
          },
          "LENGTH": 0.0337
        },
        "TRAFFIC_ITEM_DETAIL": {
          "ROAD_CLOSED": false,
          "INCIDENT": {
            "RESPONSE_VEHICLES": false,
            "CONGESTION_INCIDENT": {
              "CONGESTION_TYPE_DESC": "CONGESTION",
              "CONGESTION_FACTOR": 50
            }
          },
          "ALERTC": [
            {
              "EVENT_CODE": 138
            }
          ]
        },
        "TRAFFIC_ITEM_DESCRIPTION": [
          {
            "value": "Bei Bremen-Burg-Grambke - Stockender Verkehr;; vorsichtig an das Stauende heranfahren.",
            "TYPE": "short_desc"
          },
          {
            "value": "Bei Bremen-Burg-Grambke - Stockender Verkehr;; vorsichtig an das Stauende heranfahren.",
            "TYPE": "desc"
          },
          {
            "value": "Stockender Verkehr;; vorsichtig an das Stauende heranfahren.",
            "TYPE": "no_exit_description"
          }
        ],
        "mid": "4fd1de28-3de2-4374-9923-5aeecb231ad3|1629775702379",
        "PRODUCT": "basic"
      }
    ]
  },
  "diagnostic": {
    "info": "",
    "sfile": "Incident-E1409-1629775665926.xml.gz|pr1",
    "pdd": "trafficml-incident-24-v13"
  },
  "TIMESTAMP2": "2021-08-24T03:27:46.000+0000",
  "EXTENDED_COUNTRY_CODE": "E1"
}