{
  "TIMESTAMP": "08/22/2021 01:27:46 GMT",
  "VERSION": 2.3,
  "TRAFFIC_ITEMS": {
    "TRAFFIC_ITEM": [
      {
        "TRAFFIC_ITEM_ID": 2301290897943264271,
        "ORIGINAL_TRAFFIC_ITEM_ID": 1538564800929165132,
        "TRAFFIC_ITEM_STATUS_SHORT_DESC": "ACTIVE",
        "TRAFFIC_ITEM_TYPE_DESC": "CONGESTION",
        "START_TIME": "08/22/2021 01:05:17",
        "END_TIME": "08/22/2021 01:39:16",
        "ENTRY_TIME": "08/22/2021 01:29:19",
        "CRITICALITY": {
          "ID": "2",
          "DESCRIPTION": "minor"
        },
        "VERIFIED": true,
        "ABBREVIATION": {
          "SHORT_DESC": "SLOW",
          "DESCRIPTION": "slow"
        },
        "RDS-TMC_LOCATIONS": {
          "RDS-TMC": [
            {
              "ORIGIN": {
                "EBU_COUNTRY_CODE": "A",
                "TABLE_ID": 1,
                "LOCATION_ID": "31280",
                "LOCATION_DESC": "St. Michael im Lungau",
                "RDS_DIRECTION": "-"
              },
              "DIRECTION": "+",
              "ALERTC": {
                "TRAFFIC_CODE": 138,
                "QUANTIFIERS": 4,
                "DESCRIPTION": "Stockender Verkehr;; vorsichtig an das Stauende heranfahren.",
                "ALERTC_DURATION": "D",
                "ALERTC_DIRECTION": 1,
                "URGENCY": "U",
                "UPDATE_CLASS": 1,
                "PHRASE_CODE": "A2.Z112",
                "EXTENT": "1",
                "DURATION": 0
              },
              "LENGTH": 0.03811,
              "PRIMARY_OFFSET": 0.21471
            }
          ]
        },
        "LOCATION": {
          "DEFINED": {
            "ORIGIN": {
              "ROADWAY": {
                "DESCRIPTION": [
                  {
                    "value": "Tauern Autobahn",
                    "TYPE": "NTCSA"
                  },
                  {
                    "value": "Tauern Autobahn",
                    "TYPE": "RDSGN"
                  },
                  {
                    "value": "Tauern Autobahn",
                    "TYPE": "LOCAL"
                  }
                ],
                "ID": 30566
              },
              "POINT": {
                "DESCRIPTION": [
                  {
                    "value": "Parkplatz Lansch\u00fctz",
                    "TYPE": "NTCSA"
                  },
                  {
                    "value": "Parkplatz Lansch\u00fctz",
                    "TYPE": "RDSGN"
                  },
                  {
                    "value": "Parkplatz Lansch\u00fctz",
                    "TYPE": "LOCAL"
                  },
                  {
                    "value": "Tauern Autobahn",
                    "TYPE": "BNAME"
                  }
                ],
                "ID": 31280
              },
              "DIRECTION": {
                "DESCRIPTION": [
                  {
                    "value": "VILLACH",
                    "TYPE": "LOCAL"
                  },
                  {
                    "value": "VILLACH",
                    "TYPE": "NTCSA"
                  },
                  {
                    "value": "VILLACH",
                    "TYPE": "RDSGN"
                  }
                ],
                "ID": 0
              },
              "PROXIMITY": {
                "ID": "AT",
                "DESCRIPTION": "at"
              }
            },
            "TO": {
              "ROADWAY": {
                "DESCRIPTION": [
                  {
                    "value": "Tauern Autobahn",
                    "TYPE": "NTCSA"
                  },
                  {
                    "value": "Tauern Autobahn",
                    "TYPE": "RDSGN"
                  },
                  {
                    "value": "Tauern Autobahn",
                    "TYPE": "LOCAL"
                  }
                ],
                "ID": 30566
              },
              "POINT": {
                "DESCRIPTION": [
                  {
                    "value": "St. Michael im Lungau",
                    "TYPE": "NTCSA"
                  },
                  {
                    "value": "St. Michael im Lungau",
                    "TYPE": "RDSGN"
                  },
                  {
                    "value": "St. Michael im Lungau",
                    "TYPE": "LOCAL"
                  },
                  {
                    "value": "Tauern Autobahn",
                    "TYPE": "BNAME"
                  }
                ],
                "ID": 31280
              },
              "DIRECTION": {
                "DESCRIPTION": [
                  {
                    "value": "VILLACH",
                    "TYPE": "LOCAL"
                  },
                  {
                    "value": "VILLACH",
                    "TYPE": "NTCSA"
                  },
                  {
                    "value": "VILLACH",
                    "TYPE": "RDSGN"
                  }
                ],
                "ID": 0
              },
              "PROXIMITY": {
                "ID": "AT",
                "DESCRIPTION": "at"
              }
            }
          },
          "GEOLOC": {
            "ORIGIN": {
              "LATITUDE": 47.09552,
              "LONGITUDE": 13.60825
            },
            "TO": [
              {
                "LATITUDE": 47.09505,
                "LONGITUDE": 13.60857
              }
            ]
          },
          "NAVTECH": {
            "EDGE": {
              "EDGE_ID": [
                "1210473321"
              ]
            },
            "VERSION_ID": "202102"
          },
          "LENGTH": 0.03811
        },
        "TRAFFIC_ITEM_DETAIL": {
          "ROAD_CLOSED": false,
          "INCIDENT": {
            "RESPONSE_VEHICLES": false,
            "CONGESTION_INCIDENT": {
              "CONGESTION_TYPE_DESC": "CONGESTION",
              "CONGESTION_FACTOR": 50
            }
          },
          "ALERTC": [
            {
              "EVENT_CODE": 138
            }
          ]
        },
        "TRAFFIC_ITEM_DESCRIPTION": [
          {
            "value": "Bei St. Michael im Lungau - Stockender Verkehr;; vorsichtig an das Stauende heranfahren.",
            "TYPE": "short_desc"
          },
          {
            "value": "Bei St. Michael im Lungau - Stockender Verkehr;; vorsichtig an das Stauende heranfahren.",
            "TYPE": "desc"
          },
          {
            "value": "Stockender Verkehr;; vorsichtig an das Stauende heranfahren.",
            "TYPE": "no_exit_description"
          }
        ],
        "mid": "fec67a6d-8ef9-4913-afc7-de964f1c5960|1629595759604",
        "PRODUCT": "basic"
      },
      {
        "TRAFFIC_ITEM_ID": 2018751858639866935,
        "ORIGINAL_TRAFFIC_ITEM_ID": 3710585164598330287,
        "TRAFFIC_ITEM_STATUS_SHORT_DESC": "ACTIVE",
        "TRAFFIC_ITEM_TYPE_DESC": "CONGESTION",
        "START_TIME": "08/22/2021 01:27:16",
        "END_TIME": "08/22/2021 01:39:16",
        "ENTRY_TIME": "08/22/2021 01:29:19",
        "CRITICALITY": {
          "ID": "2",
          "DESCRIPTION": "minor"
        },
        "VERIFIED": true,
        "ABBREVIATION": {
          "SHORT_DESC": "SLOW",
          "DESCRIPTION": "slow"
        },
        "RDS-TMC_LOCATIONS": {
          "RDS-TMC": [
            {
              "ORIGIN": {
                "EBU_COUNTRY_CODE": "A",
                "TABLE_ID": 1,
                "LOCATION_ID": "35946",
                "LOCATION_DESC": "Mautstelle Gleinalm",
                "RDS_DIRECTION": "+"
              },
              "DIRECTION": "-",
              "ALERTC": {
                "TRAFFIC_CODE": 138,
                "QUANTIFIERS": 4,
                "DESCRIPTION": "Stockender Verkehr;; vorsichtig an das Stauende heranfahren.",
                "ALERTC_DURATION": "D",
                "ALERTC_DIRECTION": 1,
                "URGENCY": "U",
                "UPDATE_CLASS": 1,
                "PHRASE_CODE": "A2.Z112",
                "EXTENT": "1",
                "DURATION": 0
              },
              "LENGTH": 0.02733,
              "PRIMARY_OFFSET": 0.03815
            }
          ]
        },
        "LOCATION": {
          "DEFINED": {
            "ORIGIN": {
              "ROADWAY": {
                "DESCRIPTION": [
                  {
                    "value": "Pyhrn Autobahn",
                    "TYPE": "NTCSA"
                  },
                  {
                    "value": "Pyhrn Autobahn",
                    "TYPE": "RDSGN"
                  },
                  {
                    "value": "Pyhrn Autobahn",
                    "TYPE": "LOCAL"
                  }
                ],
                "ID": 30562
              },
              "POINT": {
                "DESCRIPTION": [
                  {
                    "value": "Parkplatz St. Michael",
                    "TYPE": "NTCSA"
                  },
                  {
                    "value": "Parkplatz St. Michael",
                    "TYPE": "RDSGN"
                  },
                  {
                    "value": "Parkplatz St. Michael",
                    "TYPE": "LOCAL"
                  },
                  {
                    "value": "Pyhrn Autobahn",
                    "TYPE": "BNAME"
                  }
                ],
                "ID": 35946
              },
              "DIRECTION": {
                "DESCRIPTION": [
                  {
                    "value": "ST. MICHAEL",
                    "TYPE": "LOCAL"
                  },
                  {
                    "value": "ST. MICHAEL",
                    "TYPE": "NTCSA"
                  },
                  {
                    "value": "ST. MICHAEL",
                    "TYPE": "RDSGN"
                  }
                ],
                "ID": 0
              },
              "PROXIMITY": {
                "ID": "AT",
                "DESCRIPTION": "at"
              }
            },
            "TO": {
              "ROADWAY": {
                "DESCRIPTION": [
                  {
                    "value": "Pyhrn Autobahn",
                    "TYPE": "NTCSA"
                  },
                  {
                    "value": "Pyhrn Autobahn",
                    "TYPE": "RDSGN"
                  },
                  {
                    "value": "Pyhrn Autobahn",
                    "TYPE": "LOCAL"
                  }
                ],
                "ID": 30562
              },
              "POINT": {
                "DESCRIPTION": [
                  {
                    "value": "Mautstelle Gleinalm",
                    "TYPE": "NTCSA"
                  },
                  {
                    "value": "Mautstelle Gleinalm",
                    "TYPE": "RDSGN"
                  },
                  {
                    "value": "Mautstelle Gleinalm",
                    "TYPE": "LOCAL"
                  },
                  {
                    "value": "Pyhrn Autobahn",
                    "TYPE": "BNAME"
                  }
                ],
                "ID": 35946
              },
              "DIRECTION": {
                "DESCRIPTION": [
                  {
                    "value": "ST. MICHAEL",
                    "TYPE": "LOCAL"
                  },
                  {
                    "value": "ST. MICHAEL",
                    "TYPE": "NTCSA"
                  },
                  {
                    "value": "ST. MICHAEL",
                    "TYPE": "RDSGN"
                  }
                ],
                "ID": 0
              },
              "PROXIMITY": {
                "ID": "AT",
                "DESCRIPTION": "at"
              }
            }
          },
          "GEOLOC": {
            "ORIGIN": {
              "LATITUDE": 47.32294,
              "LONGITUDE": 15.03096
            },
            "TO": [
              {
                "LATITUDE": 47.32322,
                "LONGITUDE": 15.03055
              }
            ]
          },
          "NAVTECH": {
            "EDGE": {
              "EDGE_ID": [
                "1210574975"
              ]
            },
            "VERSION_ID": "202102"
          },
          "LENGTH": 0.02733
        },
        "TRAFFIC_ITEM_DETAIL": {
          "ROAD_CLOSED": false,
          "INCIDENT": {
            "RESPONSE_VEHICLES": false,
            "CONGESTION_INCIDENT": {
              "CONGESTION_TYPE_DESC": "CONGESTION",
              "CONGESTION_FACTOR": 50
            }
          },
          "ALERTC": [
            {
              "EVENT_CODE": 138
            }
          ]
        },
        "TRAFFIC_ITEM_DESCRIPTION": [
          {
            "value": "Bei Mautstelle Gleinalm - Stockender Verkehr;; vorsichtig an das Stauende heranfahren.",
            "TYPE": "short_desc"
          },
          {
            "value": "Bei Mautstelle Gleinalm - Stockender Verkehr;; vorsichtig an das Stauende heranfahren.",
            "TYPE": "desc"
          },
          {
            "value": "Stockender Verkehr;; vorsichtig an das Stauende heranfahren.",
            "TYPE": "no_exit_description"
          }
        ],
        "mid": "6d4c8880-5f1b-45d5-9b74-486abc09372a|1629595759604",
        "PRODUCT": "basic"
      },
      {
        "TRAFFIC_ITEM_ID": 492442061472969257,
        "ORIGINAL_TRAFFIC_ITEM_ID": 1042896307088065879,
        "TRAFFIC_ITEM_STATUS_SHORT_DESC": "ACTIVE",
        "TRAFFIC_ITEM_TYPE_DESC": "CONGESTION",
        "START_TIME": "08/22/2021 01:27:29",
        "END_TIME": "08/22/2021 01:39:16",
        "ENTRY_TIME": "08/22/2021 01:29:19",
        "CRITICALITY": {
          "ID": "2",
          "DESCRIPTION": "minor"
        },
        "VERIFIED": true,
        "ABBREVIATION": {
          "SHORT_DESC": "SLOW",
          "DESCRIPTION": "slow"
        },
        "RDS-TMC_LOCATIONS": {
          "RDS-TMC": [
            {
              "ORIGIN": {
                "EBU_COUNTRY_CODE": "A",
                "TABLE_ID": 1,
                "LOCATION_ID": "35947",
                "LOCATION_DESC": "Mautstelle Bosruck",
                "RDS_DIRECTION": "+"
              },
              "DIRECTION": "-",
              "ALERTC": {
                "TRAFFIC_CODE": 138,
                "QUANTIFIERS": 4,
                "DESCRIPTION": "Stockender Verkehr;; vorsichtig an das Stauende heranfahren.",
                "ALERTC_DURATION": "D",
                "ALERTC_DIRECTION": 1,
                "URGENCY": "U",
                "UPDATE_CLASS": 1,
                "PHRASE_CODE": "A2.Z112",
                "EXTENT": "1",
                "DURATION": 0
              },
              "LENGTH": 0.01365,
              "PRIMARY_OFFSET": 0.08749
            }
          ]
        },
        "LOCATION": {
          "DEFINED": {
            "ORIGIN": {
              "ROADWAY": {
                "DESCRIPTION": [
                  {
                    "value": "Pyhrn Autobahn",
                    "TYPE": "NTCSA"
                  },
                  {
                    "value": "Pyhrn Autobahn",
                    "TYPE": "RDSGN"
                  },
                  {
                    "value": "Pyhrn Autobahn",
                    "TYPE": "LOCAL"
                  }
                ],
                "ID": 30562
              },
              "POINT": {
                "DESCRIPTION": [
                  {
                    "value": "Ardning-Admont",
                    "TYPE": "NTCSA"
                  },
                  {
                    "value": "Ardning-Admont",
                    "TYPE": "RDSGN"
                  },
                  {
                    "value": "Ardning-Admont",
                    "TYPE": "LOCAL"
                  },
                  {
                    "value": "Pyhrn Autobahn",
                    "TYPE": "BNAME"
                  }
                ],
                "ID": 35947
              },
              "DIRECTION": {
                "DESCRIPTION": [
                  {
                    "value": "VORALPENKREUZ",
                    "TYPE": "LOCAL"
                  },
                  {
                    "value": "VORALPENKREUZ",
                    "TYPE": "NTCSA"
                  },
                  {
                    "value": "VORALPENKREUZ",
                    "TYPE": "RDSGN"
                  }
                ],
                "ID": 0
              },
              "PROXIMITY": {
                "ID": "AT",
                "DESCRIPTION": "at"
              }
            },
            "TO": {
              "ROADWAY": {
                "DESCRIPTION": [
                  {
                    "value": "Pyhrn Autobahn",
                    "TYPE": "NTCSA"
                  },
                  {
                    "value": "Pyhrn Autobahn",
                    "TYPE": "RDSGN"
                  },
                  {
                    "value": "Pyhrn Autobahn",
                    "TYPE": "LOCAL"
                  }
                ],
                "ID": 30562
              },
              "POINT": {
                "DESCRIPTION": [
                  {
                    "value": "Mautstelle Bosruck",
                    "TYPE": "NTCSA"
                  },
                  {
                    "value": "Mautstelle Bosruck",
                    "TYPE": "RDSGN"
                  },
                  {
                    "value": "Mautstelle Bosruck",
                    "TYPE": "LOCAL"
                  },
                  {
                    "value": "Pyhrn Autobahn",
                    "TYPE": "BNAME"
                  }
                ],
                "ID": 35947
              },
              "DIRECTION": {
                "DESCRIPTION": [
                  {
                    "value": "VORALPENKREUZ",
                    "TYPE": "LOCAL"
                  },
                  {
                    "value": "VORALPENKREUZ",
                    "TYPE": "NTCSA"
                  },
                  {
                    "value": "VORALPENKREUZ",
                    "TYPE": "RDSGN"
                  }
                ],
                "ID": 0
              },
              "PROXIMITY": {
                "ID": "AT",
                "DESCRIPTION": "at"
              }
            }
          },
          "GEOLOC": {
            "ORIGIN": {
              "LATITUDE": 47.57644,
              "LONGITUDE": 14.31724
            },
            "TO": [
              {
                "LATITUDE": 47.5766,
                "LONGITUDE": 14.31741
              }
            ]
          },
          "NAVTECH": {
            "EDGE": {
              "EDGE_ID": [
                "1210436166"
              ]
            },
            "VERSION_ID": "202102"
          },
          "LENGTH": 0.01365
        },
        "TRAFFIC_ITEM_DETAIL": {
          "ROAD_CLOSED": false,
          "INCIDENT": {
            "RESPONSE_VEHICLES": false,
            "CONGESTION_INCIDENT": {
              "CONGESTION_TYPE_DESC": "CONGESTION",
              "CONGESTION_FACTOR": 50
            }
          },
          "ALERTC": [
            {
              "EVENT_CODE": 138
            }
          ]
        },
        "TRAFFIC_ITEM_DESCRIPTION": [
          {
            "value": "Bei Mautstelle Bosruck - Stockender Verkehr;; vorsichtig an das Stauende heranfahren.",
            "TYPE": "short_desc"
          },
          {
            "value": "Bei Mautstelle Bosruck - Stockender Verkehr;; vorsichtig an das Stauende heranfahren.",
            "TYPE": "desc"
          },
          {
            "value": "Stockender Verkehr;; vorsichtig an das Stauende heranfahren.",
            "TYPE": "no_exit_description"
          }
        ],
        "mid": "37c68fa0-94fa-4bec-8b1f-08b7e294c513|1629595759604",
        "PRODUCT": "basic"
      },
      {
        "TRAFFIC_ITEM_ID": 1851105461695777100,
        "ORIGINAL_TRAFFIC_ITEM_ID": 1841454741993576421,
        "TRAFFIC_ITEM_STATUS_SHORT_DESC": "ACTIVE",
        "TRAFFIC_ITEM_TYPE_DESC": "CONGESTION",
        "START_TIME": "08/22/2021 01:26:49",
        "END_TIME": "08/22/2021 01:38:19",
        "ENTRY_TIME": "08/22/2021 01:28:19",
        "CRITICALITY": {
          "ID": "2",
          "DESCRIPTION": "minor"
        },
        "VERIFIED": true,
        "ABBREVIATION": {
          "SHORT_DESC": "SLOW",
          "DESCRIPTION": "slow"
        },
        "RDS-TMC_LOCATIONS": {
          "RDS-TMC": [
            {
              "ORIGIN": {
                "EBU_COUNTRY_CODE": "D",
                "TABLE_ID": 1,
                "LOCATION_ID": "10876",
                "LOCATION_DESC": "Wiesbadener Kreuz",
                "RDS_DIRECTION": "-"
              },
              "DIRECTION": "+",
              "ALERTC": {
                "TRAFFIC_CODE": 138,
                "ALERTC_Q_BINARY": "1",
                "QUANTIFIERS": 4,
                "DESCRIPTION": "Stockender Verkehr; Durchschnittsgeschwindigkeit von bis zu 5 km/h; vorsichtig an das Stauende heranfahren.",
                "ALERTC_DURATION": "D",
                "ALERTC_DIRECTION": 1,
                "URGENCY": "U",
                "UPDATE_CLASS": 1,
                "PHRASE_CODE": "A2.Z112",
                "EXTENT": "1",
                "DURATION": 0
              },
              "LENGTH": 0.0789,
              "PRIMARY_OFFSET": 0.62463
            }
          ]
        },
        "LOCATION": {
          "DEFINED": {
            "ORIGIN": {
              "ROADWAY": {
                "DESCRIPTION": [
                  {
                    "value": "A3",
                    "TYPE": "NTCSA"
                  },
                  {
                    "value": "A3",
                    "TYPE": "RDSGN"
                  },
                  {
                    "value": "A3",
                    "TYPE": "LOCAL"
                  }
                ],
                "ID": 50101
              },
              "POINT": {
                "DESCRIPTION": [
                  {
                    "value": "Oberbach",
                    "TYPE": "NTCSA"
                  },
                  {
                    "value": "Oberbach",
                    "TYPE": "RDSGN"
                  },
                  {
                    "value": "Oberbach",
                    "TYPE": "LOCAL"
                  },
                  {
                    "value": "A3",
                    "TYPE": "BNAME"
                  }
                ],
                "ID": 10876
              },
              "DIRECTION": {
                "DESCRIPTION": [
                  {
                    "value": "K\u00d6LN",
                    "TYPE": "LOCAL"
                  },
                  {
                    "value": "K\u00d6LN",
                    "TYPE": "NTCSA"
                  },
                  {
                    "value": "K\u00d6LN",
                    "TYPE": "RDSGN"
                  }
                ],
                "ID": 0
              },
              "PROXIMITY": {
                "ID": "AT",
                "DESCRIPTION": "at"
              }
            },
            "TO": {
              "ROADWAY": {
                "DESCRIPTION": [
                  {
                    "value": "A3",
                    "TYPE": "NTCSA"
                  },
                  {
                    "value": "A3",
                    "TYPE": "RDSGN"
                  },
                  {
                    "value": "A3",
                    "TYPE": "LOCAL"
                  }
                ],
                "ID": 50101
              },
              "POINT": {
                "DESCRIPTION": [
                  {
                    "value": "Wiesbadener Kreuz",
                    "TYPE": "NTCSA"
                  },
                  {
                    "value": "Wiesbadener Kreuz",
                    "TYPE": "RDSGN"
                  },
                  {
                    "value": "Wiesbadener Kreuz",
                    "TYPE": "LOCAL"
                  },
                  {
                    "value": "A3",
                    "TYPE": "BNAME"
                  }
                ],
                "ID": 10876
              },
              "DIRECTION": {
                "DESCRIPTION": [
                  {
                    "value": "K\u00d6LN",
                    "TYPE": "LOCAL"
                  },
                  {
                    "value": "K\u00d6LN",
                    "TYPE": "NTCSA"
                  },
                  {
                    "value": "K\u00d6LN",
                    "TYPE": "RDSGN"
                  }
                ],
                "ID": 0
              },
              "PROXIMITY": {
                "ID": "AT",
                "DESCRIPTION": "at"
              }
            }
          },
          "GEOLOC": {
            "ORIGIN": {
              "LATITUDE": 50.05123,
              "LONGITUDE": 8.39187
            },
            "TO": [
              {
                "LATITUDE": 50.0522,
                "LONGITUDE": 8.39097
              }
            ]
          },
          "NAVTECH": {
            "EDGE": {
              "EDGE_ID": [
                "1225638726"
              ]
            },
            "VERSION_ID": "202102"
          },
          "LENGTH": 0.0789
        },
        "TRAFFIC_ITEM_DETAIL": {
          "ROAD_CLOSED": false,
          "INCIDENT": {
            "RESPONSE_VEHICLES": false,
            "CONGESTION_INCIDENT": {
              "CONGESTION_TYPE_DESC": "CONGESTION",
              "CONGESTION_FACTOR": 50
            }
          },
          "ALERTC": [
            {
              "EVENT_CODE": 138,
              "ALERTC_Q": 1
            }
          ]
        },
        "TRAFFIC_ITEM_DESCRIPTION": [
          {
            "value": "Bei Wiesbadener Kreuz - Stockender Verkehr; Durchschnittsgeschwindigkeit von bis zu 5 km/h; vorsichtig an das Stauende heranfahren.",
            "TYPE": "short_desc"
          },
          {
            "value": "Bei Wiesbadener Kreuz - Stockender Verkehr; Durchschnittsgeschwindigkeit von bis zu 5 km/h; vorsichtig an das Stauende heranfahren.",
            "TYPE": "desc"
          },
          {
            "value": "Stockender Verkehr; Durchschnittsgeschwindigkeit von bis zu 5 km/h; vorsichtig an das Stauende heranfahren.",
            "TYPE": "no_exit_description"
          }
        ],
        "mid": "94d25e2d-0961-4a82-8d99-16005e9df704|1629595699604",
        "PRODUCT": "basic"
      },
      {
        "TRAFFIC_ITEM_ID": 2174165488099010450,
        "ORIGINAL_TRAFFIC_ITEM_ID": 1956390446986208765,
        "TRAFFIC_ITEM_STATUS_SHORT_DESC": "ACTIVE",
        "TRAFFIC_ITEM_TYPE_DESC": "CONGESTION",
        "START_TIME": "08/22/2021 01:27:16",
        "END_TIME": "08/22/2021 01:39:16",
        "ENTRY_TIME": "08/22/2021 01:29:19",
        "CRITICALITY": {
          "ID": "2",
          "DESCRIPTION": "minor"
        },
        "VERIFIED": true,
        "ABBREVIATION": {
          "SHORT_DESC": "SLOW",
          "DESCRIPTION": "slow"
        },
        "RDS-TMC_LOCATIONS": {
          "RDS-TMC": [
            {
              "ORIGIN": {
                "EBU_COUNTRY_CODE": "A",
                "TABLE_ID": 1,
                "LOCATION_ID": "32463",
                "LOCATION_DESC": "Raststation Walserberg-S\u00fcd",
                "RDS_DIRECTION": "-"
              },
              "DIRECTION": "+",
              "ALERTC": {
                "TRAFFIC_CODE": 138,
                "QUANTIFIERS": 4,
                "DESCRIPTION": "Stockender Verkehr;; vorsichtig an das Stauende heranfahren.",
                "ALERTC_DURATION": "D",
                "ALERTC_DIRECTION": 1,
                "URGENCY": "U",
                "UPDATE_CLASS": 1,
                "PHRASE_CODE": "A2.Z112",
                "EXTENT": "1",
                "DURATION": 0
              },
              "LENGTH": 0.1401,
              "PRIMARY_OFFSET": 0.12052
            }
          ]
        },
        "LOCATION": {
          "DEFINED": {
            "ORIGIN": {
              "ROADWAY": {
                "DESCRIPTION": [
                  {
                    "value": "West Autobahn",
                    "TYPE": "NTCSA"
                  },
                  {
                    "value": "West Autobahn",
                    "TYPE": "RDSGN"
                  },
                  {
                    "value": "West Autobahn",
                    "TYPE": "LOCAL"
                  }
                ],
                "ID": 30603
              },
              "POINT": {
                "DESCRIPTION": [
                  {
                    "value": "Raststation Walserberg-Nord",
                    "TYPE": "NTCSA"
                  },
                  {
                    "value": "Raststation Walserberg-Nord",
                    "TYPE": "RDSGN"
                  },
                  {
                    "value": "Raststation Walserberg-Nord",
                    "TYPE": "LOCAL"
                  },
                  {
                    "value": "West Autobahn",
                    "TYPE": "BNAME"
                  }
                ],
                "ID": 32463
              },
              "DIRECTION": {
                "DESCRIPTION": [
                  {
                    "value": "ROSENHEIM",
                    "TYPE": "LOCAL"
                  },
                  {
                    "value": "ROSENHEIM",
                    "TYPE": "NTCSA"
                  },
                  {
                    "value": "ROSENHEIM",
                    "TYPE": "RDSGN"
                  }
                ],
                "ID": 0
              },
              "PROXIMITY": {
                "ID": "AT",
                "DESCRIPTION": "at"
              }
            },
            "TO": {
              "ROADWAY": {
                "DESCRIPTION": [
                  {
                    "value": "West Autobahn",
                    "TYPE": "NTCSA"
                  },
                  {
                    "value": "West Autobahn",
                    "TYPE": "RDSGN"
                  },
                  {
                    "value": "West Autobahn",
                    "TYPE": "LOCAL"
                  }
                ],
                "ID": 30603
              },
              "POINT": {
                "DESCRIPTION": [
                  {
                    "value": "Raststation Walserberg-S\u00fcd",
                    "TYPE": "NTCSA"
                  },
                  {
                    "value": "Raststation Walserberg-S\u00fcd",
                    "TYPE": "RDSGN"
                  },
                  {
                    "value": "Raststation Walserberg-S\u00fcd",
                    "TYPE": "LOCAL"
                  },
                  {
                    "value": "West Autobahn",
                    "TYPE": "BNAME"
                  }
                ],
                "ID": 32463
              },
              "DIRECTION": {
                "DESCRIPTION": [
                  {
                    "value": "ROSENHEIM",
                    "TYPE": "LOCAL"
                  },
                  {
                    "value": "ROSENHEIM",
                    "TYPE": "NTCSA"
                  },
                  {
                    "value": "ROSENHEIM",
                    "TYPE": "RDSGN"
                  }
                ],
                "ID": 0
              },
              "PROXIMITY": {
                "ID": "AT",
                "DESCRIPTION": "at"
              }
            }
          },
          "GEOLOC": {
            "ORIGIN": {
              "LATITUDE": 47.7686,
              "LONGITUDE": 12.94898
            },
            "TO": [
              {
                "LATITUDE": 47.76853,
                "LONGITUDE": 12.94598
              }
            ]
          },
          "NAVTECH": {
            "EDGE": {
              "EDGE_ID": [
                "1259042865"
              ]
            },
            "VERSION_ID": "202102"
          },
          "LENGTH": 0.1401
        },
        "TRAFFIC_ITEM_DETAIL": {
          "ROAD_CLOSED": false,
          "INCIDENT": {
            "RESPONSE_VEHICLES": false,
            "CONGESTION_INCIDENT": {
              "CONGESTION_TYPE_DESC": "CONGESTION",
              "CONGESTION_FACTOR": 50
            }
          },
          "ALERTC": [
            {
              "EVENT_CODE": 138
            }
          ]
        },
        "TRAFFIC_ITEM_DESCRIPTION": [
          {
            "value": "Bei Raststation Walserberg-S\u00fcd - Stockender Verkehr;; vorsichtig an das Stauende heranfahren.",
            "TYPE": "short_desc"
          },
          {
            "value": "Bei Raststation Walserberg-S\u00fcd - Stockender Verkehr;; vorsichtig an das Stauende heranfahren.",
            "TYPE": "desc"
          },
          {
            "value": "Stockender Verkehr;; vorsichtig an das Stauende heranfahren.",
            "TYPE": "no_exit_description"
          }
        ],
        "mid": "b7144022-f67d-499c-923f-7b0021a3bc67|1629595759604",
        "PRODUCT": "basic"
      },
      {
        "TRAFFIC_ITEM_ID": 1696609008459078958,
        "ORIGINAL_TRAFFIC_ITEM_ID": 3215654237437975652,
        "TRAFFIC_ITEM_STATUS_SHORT_DESC": "ACTIVE",
        "TRAFFIC_ITEM_TYPE_DESC": "CONGESTION",
        "START_TIME": "08/22/2021 01:20:39",
        "END_TIME": "08/22/2021 01:39:16",
        "ENTRY_TIME": "08/22/2021 01:29:19",
        "CRITICALITY": {
          "ID": "2",
          "DESCRIPTION": "minor"
        },
        "VERIFIED": true,
        "ABBREVIATION": {
          "SHORT_DESC": "SLOW",
          "DESCRIPTION": "slow"
        },
        "RDS-TMC_LOCATIONS": {
          "RDS-TMC": [
            {
              "ORIGIN": {
                "EBU_COUNTRY_CODE": "A",
                "TABLE_ID": 1,
                "LOCATION_ID": "35946",
                "LOCATION_DESC": "Mautstelle Gleinalm",
                "RDS_DIRECTION": "-"
              },
              "DIRECTION": "+",
              "ALERTC": {
                "TRAFFIC_CODE": 138,
                "QUANTIFIERS": 4,
                "DESCRIPTION": "Stockender Verkehr;; vorsichtig an das Stauende heranfahren.",
                "ALERTC_DURATION": "D",
                "ALERTC_DIRECTION": 1,
                "URGENCY": "U",
                "UPDATE_CLASS": 1,
                "PHRASE_CODE": "A2.Z112",
                "EXTENT": "1",
                "DURATION": 0
              },
              "LENGTH": 0.02172,
              "PRIMARY_OFFSET": 0.01379
            }
          ]
        },
        "LOCATION": {
          "DEFINED": {
            "ORIGIN": {
              "ROADWAY": {
                "DESCRIPTION": [
                  {
                    "value": "Pyhrn Autobahn",
                    "TYPE": "NTCSA"
                  },
                  {
                    "value": "Pyhrn Autobahn",
                    "TYPE": "RDSGN"
                  },
                  {
                    "value": "Pyhrn Autobahn",
                    "TYPE": "LOCAL"
                  }
                ],
                "ID": 30562
              },
              "POINT": {
                "DESCRIPTION": [
                  {
                    "value": "St. Michael",
                    "TYPE": "NTCSA"
                  },
                  {
                    "value": "St. Michael",
                    "TYPE": "RDSGN"
                  },
                  {
                    "value": "St. Michael",
                    "TYPE": "LOCAL"
                  },
                  {
                    "value": "Pyhrn Autobahn",
                    "TYPE": "BNAME"
                  }
                ],
                "ID": 35946
              },
              "DIRECTION": {
                "DESCRIPTION": [
                  {
                    "value": "GRAZ",
                    "TYPE": "LOCAL"
                  },
                  {
                    "value": "GRAZ",
                    "TYPE": "NTCSA"
                  },
                  {
                    "value": "GRAZ",
                    "TYPE": "RDSGN"
                  }
                ],
                "ID": 0
              },
              "PROXIMITY": {
                "ID": "AT",
                "DESCRIPTION": "at"
              }
            },
            "TO": {
              "ROADWAY": {
                "DESCRIPTION": [
                  {
                    "value": "Pyhrn Autobahn",
                    "TYPE": "NTCSA"
                  },
                  {
                    "value": "Pyhrn Autobahn",
                    "TYPE": "RDSGN"
                  },
                  {
                    "value": "Pyhrn Autobahn",
                    "TYPE": "LOCAL"
                  }
                ],
                "ID": 30562
              },
              "POINT": {
                "DESCRIPTION": [
                  {
                    "value": "Mautstelle Gleinalm",
                    "TYPE": "NTCSA"
                  },
                  {
                    "value": "Mautstelle Gleinalm",
                    "TYPE": "RDSGN"
                  },
                  {
                    "value": "Mautstelle Gleinalm",
                    "TYPE": "LOCAL"
                  },
                  {
                    "value": "Pyhrn Autobahn",
                    "TYPE": "BNAME"
                  }
                ],
                "ID": 35946
              },
              "DIRECTION": {
                "DESCRIPTION": [
                  {
                    "value": "GRAZ",
                    "TYPE": "LOCAL"
                  },
                  {
                    "value": "GRAZ",
                    "TYPE": "NTCSA"
                  },
                  {
                    "value": "GRAZ",
                    "TYPE": "RDSGN"
                  }
                ],
                "ID": 0
              },
              "PROXIMITY": {
                "ID": "AT",
                "DESCRIPTION": "at"
              }
            }
          },
          "GEOLOC": {
            "ORIGIN": {
              "LATITUDE": 47.32343,
              "LONGITUDE": 15.0296
            },
            "TO": [
              {
                "LATITUDE": 47.32321,
                "LONGITUDE": 15.02993
              }
            ]
          },
          "NAVTECH": {
            "EDGE": {
              "EDGE_ID": [
                "572480691"
              ]
            },
            "VERSION_ID": "202102"
          },
          "LENGTH": 0.02172
        },
        "TRAFFIC_ITEM_DETAIL": {
          "ROAD_CLOSED": false,
          "INCIDENT": {
            "RESPONSE_VEHICLES": false,
            "CONGESTION_INCIDENT": {
              "CONGESTION_TYPE_DESC": "CONGESTION",
              "CONGESTION_FACTOR": 50
            }
          },
          "ALERTC": [
            {
              "EVENT_CODE": 138
            }
          ]
        },
        "TRAFFIC_ITEM_DESCRIPTION": [
          {
            "value": "Bei Mautstelle Gleinalm - Stockender Verkehr;; vorsichtig an das Stauende heranfahren.",
            "TYPE": "short_desc"
          },
          {
            "value": "Bei Mautstelle Gleinalm - Stockender Verkehr;; vorsichtig an das Stauende heranfahren.",
            "TYPE": "desc"
          },
          {
            "value": "Stockender Verkehr;; vorsichtig an das Stauende heranfahren.",
            "TYPE": "no_exit_description"
          }
        ],
        "mid": "7fced755-3e85-40c5-abbd-c0c14dcea627|1629595759604",
        "PRODUCT": "basic"
      }
    ]
  },
  "diagnostic": {
    "info": "",
    "sfile": "Incident-E1409-1629595665926.xml.gz|pr1",
    "pdd": "trafficml-incident-24-v13"
  },
  "TIMESTAMP2": "2021-08-22T01:27:46.000+0000",
  "EXTENDED_COUNTRY_CODE": "E1"
}