{
  "TIMESTAMP": "08/22/2021 06:07:46 GMT",
  "VERSION": 2.3,
  "TRAFFIC_ITEMS": {
    "TRAFFIC_ITEM": [
      {
        "TRAFFIC_ITEM_ID": 1853126876649029803,
        "ORIGINAL_TRAFFIC_ITEM_ID": 3738969361582180764,
        "TRAFFIC_ITEM_STATUS_SHORT_DESC": "ACTIVE",
        "TRAFFIC_ITEM_TYPE_DESC": "CONGESTION",
        "START_TIME": "08/22/2021 06:05:46",
        "END_TIME": "08/22/2021 06:19:16",
        "ENTRY_TIME": "08/22/2021 06:05:49",
        "CRITICALITY": {
          "ID": "2",
          "DESCRIPTION": "minor"
        },
        "VERIFIED": true,
        "ABBREVIATION": {
          "SHORT_DESC": "SLOW",
          "DESCRIPTION": "slow"
        },
        "RDS-TMC_LOCATIONS": {
          "RDS-TMC": [
            {
              "ORIGIN": {
                "EBU_COUNTRY_CODE": "A",
                "TABLE_ID": 1,
                "LOCATION_ID": "35917",
                "LOCATION_DESC": "Zetzenbergtunnel",
                "RDS_DIRECTION": "+"
              },
              "DIRECTION": "-",
              "ALERTC": {
                "TRAFFIC_CODE": 138,
                "QUANTIFIERS": 4,
                "DESCRIPTION": "Stockender Verkehr;; vorsichtig an das Stauende heranfahren.",
                "ALERTC_DURATION": "D",
                "ALERTC_DIRECTION": 1,
                "URGENCY": "U",
                "UPDATE_CLASS": 1,
                "PHRASE_CODE": "A2.Z112",
                "EXTENT": "1",
                "DURATION": 0
              },
              "LENGTH": 0.02096,
              "PRIMARY_OFFSET": 0.34552
            }
          ]
        },
        "LOCATION": {
          "DEFINED": {
            "ORIGIN": {
              "ROADWAY": {
                "DESCRIPTION": [
                  {
                    "value": "Tauern Autobahn",
                    "TYPE": "NTCSA"
                  },
                  {
                    "value": "Tauern Autobahn",
                    "TYPE": "RDSGN"
                  },
                  {
                    "value": "Tauern Autobahn",
                    "TYPE": "LOCAL"
                  }
                ],
                "ID": 30566
              },
              "POINT": {
                "DESCRIPTION": [
                  {
                    "value": "Parkplatz Hohenwerfen",
                    "TYPE": "NTCSA"
                  },
                  {
                    "value": "Parkplatz Hohenwerfen",
                    "TYPE": "RDSGN"
                  },
                  {
                    "value": "Parkplatz Hohenwerfen",
                    "TYPE": "LOCAL"
                  },
                  {
                    "value": "Tauern Autobahn",
                    "TYPE": "BNAME"
                  }
                ],
                "ID": 35917
              },
              "DIRECTION": {
                "DESCRIPTION": [
                  {
                    "value": "SALZBURG",
                    "TYPE": "LOCAL"
                  },
                  {
                    "value": "SALZBURG",
                    "TYPE": "NTCSA"
                  },
                  {
                    "value": "SALZBURG",
                    "TYPE": "RDSGN"
                  }
                ],
                "ID": 0
              },
              "PROXIMITY": {
                "ID": "AT",
                "DESCRIPTION": "at"
              }
            },
            "TO": {
              "ROADWAY": {
                "DESCRIPTION": [
                  {
                    "value": "Tauern Autobahn",
                    "TYPE": "NTCSA"
                  },
                  {
                    "value": "Tauern Autobahn",
                    "TYPE": "RDSGN"
                  },
                  {
                    "value": "Tauern Autobahn",
                    "TYPE": "LOCAL"
                  }
                ],
                "ID": 30566
              },
              "POINT": {
                "DESCRIPTION": [
                  {
                    "value": "Zetzenbergtunnel",
                    "TYPE": "NTCSA"
                  },
                  {
                    "value": "Zetzenbergtunnel",
                    "TYPE": "RDSGN"
                  },
                  {
                    "value": "Zetzenbergtunnel",
                    "TYPE": "LOCAL"
                  },
                  {
                    "value": "Tauern Autobahn",
                    "TYPE": "BNAME"
                  }
                ],
                "ID": 35917
              },
              "DIRECTION": {
                "DESCRIPTION": [
                  {
                    "value": "SALZBURG",
                    "TYPE": "LOCAL"
                  },
                  {
                    "value": "SALZBURG",
                    "TYPE": "NTCSA"
                  },
                  {
                    "value": "SALZBURG",
                    "TYPE": "RDSGN"
                  }
                ],
                "ID": 0
              },
              "PROXIMITY": {
                "ID": "AT",
                "DESCRIPTION": "at"
              }
            }
          },
          "GEOLOC": {
            "ORIGIN": {
              "LATITUDE": 47.48867,
              "LONGITUDE": 13.18757
            },
            "TO": [
              {
                "LATITUDE": 47.48886,
                "LONGITUDE": 13.18722
              }
            ]
          },
          "NAVTECH": {
            "EDGE": {
              "EDGE_ID": [
                "1032801615"
              ]
            },
            "VERSION_ID": "202102"
          },
          "LENGTH": 0.02096
        },
        "TRAFFIC_ITEM_DETAIL": {
          "ROAD_CLOSED": false,
          "INCIDENT": {
            "RESPONSE_VEHICLES": false,
            "CONGESTION_INCIDENT": {
              "CONGESTION_TYPE_DESC": "CONGESTION",
              "CONGESTION_FACTOR": 50
            }
          },
          "ALERTC": [
            {
              "EVENT_CODE": 138
            }
          ]
        },
        "TRAFFIC_ITEM_DESCRIPTION": [
          {
            "value": "Bei Zetzenbergtunnel - Stockender Verkehr;; vorsichtig an das Stauende heranfahren.",
            "TYPE": "short_desc"
          },
          {
            "value": "Bei Zetzenbergtunnel - Stockender Verkehr;; vorsichtig an das Stauende heranfahren.",
            "TYPE": "desc"
          },
          {
            "value": "Stockender Verkehr;; vorsichtig an das Stauende heranfahren.",
            "TYPE": "no_exit_description"
          }
        ],
        "mid": "c9c36730-c122-4ea2-a9e8-0b61a07e67d3|1629612349604",
        "PRODUCT": "basic"
      },
      {
        "TRAFFIC_ITEM_ID": 3646338042971345454,
        "ORIGINAL_TRAFFIC_ITEM_ID": 1558513154090844615,
        "TRAFFIC_ITEM_STATUS_SHORT_DESC": "ACTIVE",
        "TRAFFIC_ITEM_TYPE_DESC": "CONGESTION",
        "START_TIME": "08/22/2021 05:59:34",
        "END_TIME": "08/22/2021 06:18:04",
        "ENTRY_TIME": "08/22/2021 05:59:34",
        "CRITICALITY": {
          "ID": "2",
          "DESCRIPTION": "minor"
        },
        "VERIFIED": true,
        "ABBREVIATION": {
          "SHORT_DESC": "SLOW",
          "DESCRIPTION": "slow"
        },
        "RDS-TMC_LOCATIONS": {
          "RDS-TMC": [
            {
              "ORIGIN": {
                "EBU_COUNTRY_CODE": "D",
                "TABLE_ID": 1,
                "LOCATION_ID": "31620",
                "LOCATION_DESC": "Allach",
                "RDS_DIRECTION": "+"
              },
              "DIRECTION": "-",
              "ALERTC": {
                "TRAFFIC_CODE": 138,
                "QUANTIFIERS": 4,
                "DESCRIPTION": "Stockender Verkehr;; vorsichtig an das Stauende heranfahren.",
                "ALERTC_DURATION": "D",
                "ALERTC_DIRECTION": 1,
                "URGENCY": "U",
                "UPDATE_CLASS": 1,
                "PHRASE_CODE": "A2.Z112",
                "EXTENT": "1",
                "DURATION": 0
              },
              "LENGTH": 0.13583,
              "PRIMARY_OFFSET": 0.28035
            }
          ]
        },
        "LOCATION": {
          "DEFINED": {
            "ORIGIN": {
              "ROADWAY": {
                "DESCRIPTION": [
                  {
                    "value": "Autobahnring M\u00fcnchen",
                    "TYPE": "NTCSA"
                  },
                  {
                    "value": "Autobahnring M\u00fcnchen",
                    "TYPE": "RDSGN"
                  },
                  {
                    "value": "Autobahnring M\u00fcnchen",
                    "TYPE": "LOCAL"
                  }
                ],
                "ID": 50183
              },
              "POINT": {
                "DESCRIPTION": [
                  {
                    "value": "M\u00fcnchen-Ludwigsfeld",
                    "TYPE": "NTCSA"
                  },
                  {
                    "value": "M\u00fcnchen-Ludwigsfeld",
                    "TYPE": "RDSGN"
                  },
                  {
                    "value": "M\u00fcnchen-Ludwigsfeld",
                    "TYPE": "LOCAL"
                  },
                  {
                    "value": "Autobahnring M\u00fcnchen",
                    "TYPE": "BNAME"
                  }
                ],
                "ID": 31620
              },
              "DIRECTION": {
                "DESCRIPTION": [
                  {
                    "value": "M\u00dcNCHEN-S\u00dcD-WEST",
                    "TYPE": "LOCAL"
                  },
                  {
                    "value": "M\u00dcNCHEN-S\u00dcD-WEST",
                    "TYPE": "NTCSA"
                  },
                  {
                    "value": "M\u00dcNCHEN-S\u00dcD-WEST",
                    "TYPE": "RDSGN"
                  }
                ],
                "ID": 0
              },
              "PROXIMITY": {
                "ID": "AT",
                "DESCRIPTION": "at"
              }
            },
            "TO": {
              "ROADWAY": {
                "DESCRIPTION": [
                  {
                    "value": "Autobahnring M\u00fcnchen",
                    "TYPE": "NTCSA"
                  },
                  {
                    "value": "Autobahnring M\u00fcnchen",
                    "TYPE": "RDSGN"
                  },
                  {
                    "value": "Autobahnring M\u00fcnchen",
                    "TYPE": "LOCAL"
                  }
                ],
                "ID": 50183
              },
              "POINT": {
                "DESCRIPTION": [
                  {
                    "value": "Allach",
                    "TYPE": "NTCSA"
                  },
                  {
                    "value": "Allach",
                    "TYPE": "RDSGN"
                  },
                  {
                    "value": "Allach",
                    "TYPE": "LOCAL"
                  },
                  {
                    "value": "Autobahnring M\u00fcnchen",
                    "TYPE": "BNAME"
                  }
                ],
                "ID": 31620
              },
              "DIRECTION": {
                "DESCRIPTION": [
                  {
                    "value": "M\u00dcNCHEN-S\u00dcD-WEST",
                    "TYPE": "LOCAL"
                  },
                  {
                    "value": "M\u00dcNCHEN-S\u00dcD-WEST",
                    "TYPE": "NTCSA"
                  },
                  {
                    "value": "M\u00dcNCHEN-S\u00dcD-WEST",
                    "TYPE": "RDSGN"
                  }
                ],
                "ID": 0
              },
              "PROXIMITY": {
                "ID": "AT",
                "DESCRIPTION": "at"
              }
            }
          },
          "GEOLOC": {
            "ORIGIN": {
              "LATITUDE": 48.20765,
              "LONGITUDE": 11.46171
            },
            "TO": [
              {
                "LATITUDE": 48.20634,
                "LONGITUDE": 11.45956
              }
            ]
          },
          "NAVTECH": {
            "EDGE": {
              "EDGE_ID": [
                "1225525831"
              ]
            },
            "VERSION_ID": "202102"
          },
          "LENGTH": 0.13583
        },
        "TRAFFIC_ITEM_DETAIL": {
          "ROAD_CLOSED": false,
          "INCIDENT": {
            "RESPONSE_VEHICLES": false,
            "CONGESTION_INCIDENT": {
              "CONGESTION_TYPE_DESC": "CONGESTION",
              "CONGESTION_FACTOR": 50
            }
          },
          "ALERTC": [
            {
              "EVENT_CODE": 138
            }
          ]
        },
        "TRAFFIC_ITEM_DESCRIPTION": [
          {
            "value": "Bei Allach - Stockender Verkehr;; vorsichtig an das Stauende heranfahren.",
            "TYPE": "short_desc"
          },
          {
            "value": "Bei Allach - Stockender Verkehr;; vorsichtig an das Stauende heranfahren.",
            "TYPE": "desc"
          },
          {
            "value": "Stockender Verkehr;; vorsichtig an das Stauende heranfahren.",
            "TYPE": "no_exit_description"
          }
        ],
        "mid": "8eb8269e-d775-4bba-b381-d25679152606|1629611974604",
        "PRODUCT": "basic"
      },
      {
        "TRAFFIC_ITEM_ID": 3764988272829634145,
        "ORIGINAL_TRAFFIC_ITEM_ID": 2926396536458309187,
        "TRAFFIC_ITEM_STATUS_SHORT_DESC": "ACTIVE",
        "TRAFFIC_ITEM_TYPE_DESC": "CONGESTION",
        "START_TIME": "08/22/2021 06:05:04",
        "END_TIME": "08/22/2021 06:18:04",
        "ENTRY_TIME": "08/22/2021 06:08:04",
        "CRITICALITY": {
          "ID": "2",
          "DESCRIPTION": "minor"
        },
        "VERIFIED": true,
        "ABBREVIATION": {
          "SHORT_DESC": "SLOW",
          "DESCRIPTION": "slow"
        },
        "RDS-TMC_LOCATIONS": {
          "RDS-TMC": [
            {
              "ORIGIN": {
                "EBU_COUNTRY_CODE": "D",
                "TABLE_ID": 1,
                "LOCATION_ID": "12333",
                "LOCATION_DESC": "Salzgitter",
                "RDS_DIRECTION": "-"
              },
              "DIRECTION": "+",
              "ALERTC": {
                "TRAFFIC_CODE": 138,
                "ALERTC_Q_BINARY": "1",
                "QUANTIFIERS": 4,
                "DESCRIPTION": "Stockender Verkehr; Durchschnittsgeschwindigkeit von bis zu 5 km/h; vorsichtig an das Stauende heranfahren.",
                "ALERTC_DURATION": "D",
                "ALERTC_DIRECTION": 1,
                "URGENCY": "U",
                "UPDATE_CLASS": 1,
                "PHRASE_CODE": "A2.Z112",
                "EXTENT": "1",
                "DURATION": 0
              },
              "LENGTH": 0.17287,
              "PRIMARY_OFFSET": 1.76576
            }
          ]
        },
        "LOCATION": {
          "DEFINED": {
            "ORIGIN": {
              "ROADWAY": {
                "DESCRIPTION": [
                  {
                    "value": "A7",
                    "TYPE": "NTCSA"
                  },
                  {
                    "value": "A7",
                    "TYPE": "RDSGN"
                  },
                  {
                    "value": "A7",
                    "TYPE": "LOCAL"
                  }
                ],
                "ID": 50163
              },
              "POINT": {
                "DESCRIPTION": [
                  {
                    "value": "J\u00e4gerturm West",
                    "TYPE": "NTCSA"
                  },
                  {
                    "value": "J\u00e4gerturm West",
                    "TYPE": "RDSGN"
                  },
                  {
                    "value": "J\u00e4gerturm West",
                    "TYPE": "LOCAL"
                  },
                  {
                    "value": "A7",
                    "TYPE": "BNAME"
                  }
                ],
                "ID": 12333
              },
              "DIRECTION": {
                "DESCRIPTION": [
                  {
                    "value": "HANNOVER",
                    "TYPE": "LOCAL"
                  },
                  {
                    "value": "HANNOVER",
                    "TYPE": "NTCSA"
                  },
                  {
                    "value": "HANNOVER",
                    "TYPE": "RDSGN"
                  }
                ],
                "ID": 0
              },
              "PROXIMITY": {
                "ID": "AT",
                "DESCRIPTION": "at"
              }
            },
            "TO": {
              "ROADWAY": {
                "DESCRIPTION": [
                  {
                    "value": "A7",
                    "TYPE": "NTCSA"
                  },
                  {
                    "value": "A7",
                    "TYPE": "RDSGN"
                  },
                  {
                    "value": "A7",
                    "TYPE": "LOCAL"
                  }
                ],
                "ID": 50163
              },
              "POINT": {
                "DESCRIPTION": [
                  {
                    "value": "Salzgitter",
                    "TYPE": "NTCSA"
                  },
                  {
                    "value": "Salzgitter",
                    "TYPE": "RDSGN"
                  },
                  {
                    "value": "Salzgitter",
                    "TYPE": "LOCAL"
                  },
                  {
                    "value": "A7",
                    "TYPE": "BNAME"
                  }
                ],
                "ID": 12333
              },
              "DIRECTION": {
                "DESCRIPTION": [
                  {
                    "value": "HANNOVER",
                    "TYPE": "LOCAL"
                  },
                  {
                    "value": "HANNOVER",
                    "TYPE": "NTCSA"
                  },
                  {
                    "value": "HANNOVER",
                    "TYPE": "RDSGN"
                  }
                ],
                "ID": 0
              },
              "PROXIMITY": {
                "ID": "AT",
                "DESCRIPTION": "at"
              }
            }
          },
          "GEOLOC": {
            "ORIGIN": {
              "LATITUDE": 52.06368,
              "LONGITUDE": 10.19363
            },
            "TO": [
              {
                "LATITUDE": 52.06615,
                "LONGITUDE": 10.19396
              }
            ]
          },
          "NAVTECH": {
            "EDGE": {
              "EDGE_ID": [
                "1164531608"
              ]
            },
            "VERSION_ID": "202102"
          },
          "LENGTH": 0.17287
        },
        "TRAFFIC_ITEM_DETAIL": {
          "ROAD_CLOSED": false,
          "INCIDENT": {
            "RESPONSE_VEHICLES": false,
            "CONGESTION_INCIDENT": {
              "CONGESTION_TYPE_DESC": "CONGESTION",
              "CONGESTION_FACTOR": 50
            }
          },
          "ALERTC": [
            {
              "EVENT_CODE": 138,
              "ALERTC_Q": 1
            }
          ]
        },
        "TRAFFIC_ITEM_DESCRIPTION": [
          {
            "value": "Bei Salzgitter - Stockender Verkehr; Durchschnittsgeschwindigkeit von bis zu 5 km/h; vorsichtig an das Stauende heranfahren.",
            "TYPE": "short_desc"
          },
          {
            "value": "Bei Salzgitter - Stockender Verkehr; Durchschnittsgeschwindigkeit von bis zu 5 km/h; vorsichtig an das Stauende heranfahren.",
            "TYPE": "desc"
          },
          {
            "value": "Stockender Verkehr; Durchschnittsgeschwindigkeit von bis zu 5 km/h; vorsichtig an das Stauende heranfahren.",
            "TYPE": "no_exit_description"
          }
        ],
        "mid": "653dc283-0d9b-4486-a4a9-5829e3a8c29e|1629612484604",
        "PRODUCT": "basic"
      },
      {
        "TRAFFIC_ITEM_ID": 880586681796955073,
        "ORIGINAL_TRAFFIC_ITEM_ID": 3609976844070312487,
        "TRAFFIC_ITEM_STATUS_SHORT_DESC": "ACTIVE",
        "TRAFFIC_ITEM_TYPE_DESC": "CONGESTION",
        "START_TIME": "08/22/2021 05:56:50",
        "END_TIME": "08/22/2021 06:18:47",
        "ENTRY_TIME": "08/22/2021 06:08:49",
        "CRITICALITY": {
          "ID": "2",
          "DESCRIPTION": "minor"
        },
        "VERIFIED": true,
        "ABBREVIATION": {
          "SHORT_DESC": "SLOW",
          "DESCRIPTION": "slow"
        },
        "RDS-TMC_LOCATIONS": {
          "RDS-TMC": [
            {
              "ORIGIN": {
                "EBU_COUNTRY_CODE": "3",
                "TABLE_ID": 5,
                "LOCATION_ID": "13415",
                "LOCATION_DESC": "PPO Tarnawa",
                "RDS_DIRECTION": "+"
              },
              "DIRECTION": "-",
              "ALERTC": {
                "TRAFFIC_CODE": 138,
                "QUANTIFIERS": 4,
                "DESCRIPTION": "Zag\u0119szczaj\u0105cy si\u0119 ruch. Doje\u017cd\u017ca\u0107 ostro\u017cnie.",
                "ALERTC_DURATION": "D",
                "ALERTC_DIRECTION": 1,
                "URGENCY": "U",
                "UPDATE_CLASS": 1,
                "PHRASE_CODE": "A2.Z112",
                "EXTENT": "1",
                "DURATION": 0
              },
              "LENGTH": 0.03088,
              "PRIMARY_OFFSET": 0.05955
            }
          ]
        },
        "LOCATION": {
          "DEFINED": {
            "ORIGIN": {
              "ROADWAY": {
                "DESCRIPTION": [
                  {
                    "value": "A2",
                    "TYPE": "NTCSA"
                  },
                  {
                    "value": "A2",
                    "TYPE": "RDSGN"
                  },
                  {
                    "value": "A2",
                    "TYPE": "LOCAL"
                  }
                ],
                "ID": 25044
              },
              "POINT": {
                "DESCRIPTION": [
                  {
                    "value": "W\u0119ze\u0142 Torzym",
                    "TYPE": "NTCSA"
                  },
                  {
                    "value": "W\u0119ze\u0142 Torzym",
                    "TYPE": "RDSGN"
                  },
                  {
                    "value": "W\u0119ze\u0142 Torzym",
                    "TYPE": "LOCAL"
                  },
                  {
                    "value": "A2",
                    "TYPE": "BNAME"
                  }
                ],
                "ID": 13415
              },
              "DIRECTION": {
                "DESCRIPTION": [
                  {
                    "value": "\u015aWIECKO",
                    "TYPE": "LOCAL"
                  },
                  {
                    "value": "\u015aWIECKO",
                    "TYPE": "NTCSA"
                  },
                  {
                    "value": "\u015aWIECKO",
                    "TYPE": "RDSGN"
                  }
                ],
                "ID": 0
              },
              "PROXIMITY": {
                "ID": "AT",
                "DESCRIPTION": "at"
              }
            },
            "TO": {
              "ROADWAY": {
                "DESCRIPTION": [
                  {
                    "value": "A2",
                    "TYPE": "NTCSA"
                  },
                  {
                    "value": "A2",
                    "TYPE": "RDSGN"
                  },
                  {
                    "value": "A2",
                    "TYPE": "LOCAL"
                  }
                ],
                "ID": 25044
              },
              "POINT": {
                "DESCRIPTION": [
                  {
                    "value": "PPO Tarnawa",
                    "TYPE": "NTCSA"
                  },
                  {
                    "value": "PPO Tarnawa",
                    "TYPE": "RDSGN"
                  },
                  {
                    "value": "PPO Tarnawa",
                    "TYPE": "LOCAL"
                  },
                  {
                    "value": "A2",
                    "TYPE": "BNAME"
                  }
                ],
                "ID": 13415
              },
              "DIRECTION": {
                "DESCRIPTION": [
                  {
                    "value": "\u015aWIECKO",
                    "TYPE": "LOCAL"
                  },
                  {
                    "value": "\u015aWIECKO",
                    "TYPE": "NTCSA"
                  },
                  {
                    "value": "\u015aWIECKO",
                    "TYPE": "RDSGN"
                  }
                ],
                "ID": 0
              },
              "PROXIMITY": {
                "ID": "AT",
                "DESCRIPTION": "at"
              }
            }
          },
          "GEOLOC": {
            "ORIGIN": {
              "LATITUDE": 52.33502,
              "LONGITUDE": 14.90418
            },
            "TO": [
              {
                "LATITUDE": 52.33504,
                "LONGITUDE": 14.90402
              }
            ]
          },
          "NAVTECH": {
            "EDGE": {
              "EDGE_ID": [
                "1175304657"
              ]
            },
            "VERSION_ID": "202102"
          },
          "LENGTH": 0.03088
        },
        "TRAFFIC_ITEM_DETAIL": {
          "ROAD_CLOSED": false,
          "INCIDENT": {
            "RESPONSE_VEHICLES": false,
            "CONGESTION_INCIDENT": {
              "CONGESTION_TYPE_DESC": "CONGESTION",
              "CONGESTION_FACTOR": 50
            }
          },
          "ALERTC": [
            {
              "EVENT_CODE": 138
            }
          ]
        },
        "TRAFFIC_ITEM_DESCRIPTION": [
          {
            "value": "Przy PPO Tarnawa - Zag\u0119szczaj\u0105cy si\u0119 ruch. Doje\u017cd\u017ca\u0107 ostro\u017cnie.",
            "TYPE": "short_desc"
          },
          {
            "value": "Przy PPO Tarnawa - Zag\u0119szczaj\u0105cy si\u0119 ruch. Doje\u017cd\u017ca\u0107 ostro\u017cnie.",
            "TYPE": "desc"
          },
          {
            "value": "Zag\u0119szczaj\u0105cy si\u0119 ruch. Doje\u017cd\u017ca\u0107 ostro\u017cnie.",
            "TYPE": "no_exit_description"
          }
        ],
        "mid": "55483281-ec3e-476e-83e5-b151a3f7013c|1629612529604",
        "PRODUCT": "basic"
      },
      {
        "TRAFFIC_ITEM_ID": 2943864023203272725,
        "ORIGINAL_TRAFFIC_ITEM_ID": 2946992007676410026,
        "TRAFFIC_ITEM_STATUS_SHORT_DESC": "ACTIVE",
        "TRAFFIC_ITEM_TYPE_DESC": "CONGESTION",
        "START_TIME": "08/22/2021 06:07:04",
        "END_TIME": "08/22/2021 06:18:04",
        "ENTRY_TIME": "08/22/2021 06:07:34",
        "CRITICALITY": {
          "ID": "2",
          "DESCRIPTION": "minor"
        },
        "VERIFIED": true,
        "ABBREVIATION": {
          "SHORT_DESC": "SLOW",
          "DESCRIPTION": "slow"
        },
        "RDS-TMC_LOCATIONS": {
          "RDS-TMC": [
            {
              "ORIGIN": {
                "EBU_COUNTRY_CODE": "D",
                "TABLE_ID": 1,
                "LOCATION_ID": "32604",
                "LOCATION_DESC": "Ortsteil Britz",
                "RDS_DIRECTION": "+"
              },
              "DIRECTION": "-",
              "ALERTC": {
                "TRAFFIC_CODE": 138,
                "QUANTIFIERS": 4,
                "DESCRIPTION": "Stockender Verkehr;; vorsichtig an das Stauende heranfahren.",
                "ALERTC_DURATION": "D",
                "ALERTC_DIRECTION": 1,
                "URGENCY": "U",
                "UPDATE_CLASS": 1,
                "PHRASE_CODE": "A2.Z112",
                "EXTENT": "1",
                "DURATION": 0
              },
              "LENGTH": 0.02484,
              "PRIMARY_OFFSET": 0.56095
            }
          ]
        },
        "LOCATION": {
          "DEFINED": {
            "ORIGIN": {
              "ROADWAY": {
                "DESCRIPTION": [
                  {
                    "value": "Stadtring Berlin",
                    "TYPE": "NTCSA"
                  },
                  {
                    "value": "Stadtring Berlin",
                    "TYPE": "RDSGN"
                  },
                  {
                    "value": "Stadtring Berlin",
                    "TYPE": "LOCAL"
                  }
                ],
                "ID": 50062
              },
              "POINT": {
                "DESCRIPTION": [
                  {
                    "value": "Britzer Damm",
                    "TYPE": "NTCSA"
                  },
                  {
                    "value": "Britzer Damm",
                    "TYPE": "RDSGN"
                  },
                  {
                    "value": "Britzer Damm",
                    "TYPE": "LOCAL"
                  },
                  {
                    "value": "Stadtring Berlin",
                    "TYPE": "BNAME"
                  }
                ],
                "ID": 32604
              },
              "DIRECTION": {
                "DESCRIPTION": [
                  {
                    "value": "WILMERSDORF",
                    "TYPE": "LOCAL"
                  },
                  {
                    "value": "WILMERSDORF",
                    "TYPE": "NTCSA"
                  },
                  {
                    "value": "WILMERSDORF",
                    "TYPE": "RDSGN"
                  }
                ],
                "ID": 0
              },
              "PROXIMITY": {
                "ID": "AT",
                "DESCRIPTION": "at"
              }
            },
            "TO": {
              "ROADWAY": {
                "DESCRIPTION": [
                  {
                    "value": "Stadtring Berlin",
                    "TYPE": "NTCSA"
                  },
                  {
                    "value": "Stadtring Berlin",
                    "TYPE": "RDSGN"
                  },
                  {
                    "value": "Stadtring Berlin",
                    "TYPE": "LOCAL"
                  }
                ],
                "ID": 50062
              },
              "POINT": {
                "DESCRIPTION": [
                  {
                    "value": "Ortsteil Britz",
                    "TYPE": "NTCSA"
                  },
                  {
                    "value": "Ortsteil Britz",
                    "TYPE": "RDSGN"
                  },
                  {
                    "value": "Ortsteil Britz",
                    "TYPE": "LOCAL"
                  },
                  {
                    "value": "Stadtring Berlin",
                    "TYPE": "BNAME"
                  }
                ],
                "ID": 32604
              },
              "DIRECTION": {
                "DESCRIPTION": [
                  {
                    "value": "WILMERSDORF",
                    "TYPE": "LOCAL"
                  },
                  {
                    "value": "WILMERSDORF",
                    "TYPE": "NTCSA"
                  },
                  {
                    "value": "WILMERSDORF",
                    "TYPE": "RDSGN"
                  }
                ],
                "ID": 0
              },
              "PROXIMITY": {
                "ID": "AT",
                "DESCRIPTION": "at"
              }
            }
          },
          "GEOLOC": {
            "ORIGIN": {
              "LATITUDE": 52.46196,
              "LONGITUDE": 13.43009
            },
            "TO": [
              {
                "LATITUDE": 52.46189,
                "LONGITUDE": 13.42935
              }
            ]
          },
          "NAVTECH": {
            "EDGE": {
              "EDGE_ID": [
                "1243609437"
              ]
            },
            "VERSION_ID": "202102"
          },
          "LENGTH": 0.02484
        },
        "TRAFFIC_ITEM_DETAIL": {
          "ROAD_CLOSED": false,
          "INCIDENT": {
            "RESPONSE_VEHICLES": false,
            "CONGESTION_INCIDENT": {
              "CONGESTION_TYPE_DESC": "CONGESTION",
              "CONGESTION_FACTOR": 50
            }
          },
          "ALERTC": [
            {
              "EVENT_CODE": 138
            }
          ]
        },
        "TRAFFIC_ITEM_DESCRIPTION": [
          {
            "value": "Bei Ortsteil Britz - Stockender Verkehr;; vorsichtig an das Stauende heranfahren.",
            "TYPE": "short_desc"
          },
          {
            "value": "Bei Ortsteil Britz - Stockender Verkehr;; vorsichtig an das Stauende heranfahren.",
            "TYPE": "desc"
          },
          {
            "value": "Stockender Verkehr;; vorsichtig an das Stauende heranfahren.",
            "TYPE": "no_exit_description"
          }
        ],
        "mid": "38ce304b-daa6-4a11-a3f8-6cc0f96dc168|1629612454605",
        "PRODUCT": "basic"
      },
      {
        "TRAFFIC_ITEM_ID": 3781906108119572424,
        "ORIGINAL_TRAFFIC_ITEM_ID": 3913100930410759931,
        "TRAFFIC_ITEM_STATUS_SHORT_DESC": "ACTIVE",
        "TRAFFIC_ITEM_TYPE_DESC": "CONGESTION",
        "START_TIME": "08/22/2021 05:55:24",
        "END_TIME": "08/22/2021 06:18:04",
        "ENTRY_TIME": "08/22/2021 06:08:04",
        "CRITICALITY": {
          "ID": "2",
          "DESCRIPTION": "minor"
        },
        "VERIFIED": true,
        "ABBREVIATION": {
          "SHORT_DESC": "SLOW",
          "DESCRIPTION": "slow"
        },
        "RDS-TMC_LOCATIONS": {
          "RDS-TMC": [
            {
              "ORIGIN": {
                "EBU_COUNTRY_CODE": "D",
                "TABLE_ID": 1,
                "LOCATION_ID": "60422",
                "LOCATION_DESC": "Rottal-West",
                "RDS_DIRECTION": "-"
              },
              "DIRECTION": "+",
              "ALERTC": {
                "TRAFFIC_CODE": 138,
                "ALERTC_Q_BINARY": "1",
                "QUANTIFIERS": 4,
                "DESCRIPTION": "Stockender Verkehr; Durchschnittsgeschwindigkeit von bis zu 5 km/h; vorsichtig an das Stauende heranfahren.",
                "ALERTC_DURATION": "D",
                "ALERTC_DIRECTION": 1,
                "URGENCY": "U",
                "UPDATE_CLASS": 1,
                "PHRASE_CODE": "A2.Z112",
                "EXTENT": "1",
                "DURATION": 0
              },
              "LENGTH": 0.10191,
              "PRIMARY_OFFSET": 0.50981
            }
          ]
        },
        "LOCATION": {
          "DEFINED": {
            "ORIGIN": {
              "ROADWAY": {
                "DESCRIPTION": [
                  {
                    "value": "A3",
                    "TYPE": "NTCSA"
                  },
                  {
                    "value": "A3",
                    "TYPE": "RDSGN"
                  },
                  {
                    "value": "A3",
                    "TYPE": "LOCAL"
                  }
                ],
                "ID": 50101
              },
              "POINT": {
                "DESCRIPTION": [
                  {
                    "value": "Pocking",
                    "TYPE": "NTCSA"
                  },
                  {
                    "value": "Pocking",
                    "TYPE": "RDSGN"
                  },
                  {
                    "value": "Pocking",
                    "TYPE": "LOCAL"
                  },
                  {
                    "value": "A3",
                    "TYPE": "BNAME"
                  }
                ],
                "ID": 60422
              },
              "DIRECTION": {
                "DESCRIPTION": [
                  {
                    "value": "PASSAU",
                    "TYPE": "LOCAL"
                  },
                  {
                    "value": "PASSAU",
                    "TYPE": "NTCSA"
                  },
                  {
                    "value": "PASSAU",
                    "TYPE": "RDSGN"
                  }
                ],
                "ID": 0
              },
              "PROXIMITY": {
                "ID": "AT",
                "DESCRIPTION": "at"
              }
            },
            "TO": {
              "ROADWAY": {
                "DESCRIPTION": [
                  {
                    "value": "A3",
                    "TYPE": "NTCSA"
                  },
                  {
                    "value": "A3",
                    "TYPE": "RDSGN"
                  },
                  {
                    "value": "A3",
                    "TYPE": "LOCAL"
                  }
                ],
                "ID": 50101
              },
              "POINT": {
                "DESCRIPTION": [
                  {
                    "value": "Rottal-West",
                    "TYPE": "NTCSA"
                  },
                  {
                    "value": "Rottal-West",
                    "TYPE": "RDSGN"
                  },
                  {
                    "value": "Rottal-West",
                    "TYPE": "LOCAL"
                  },
                  {
                    "value": "A3",
                    "TYPE": "BNAME"
                  }
                ],
                "ID": 60422
              },
              "DIRECTION": {
                "DESCRIPTION": [
                  {
                    "value": "PASSAU",
                    "TYPE": "LOCAL"
                  },
                  {
                    "value": "PASSAU",
                    "TYPE": "NTCSA"
                  },
                  {
                    "value": "PASSAU",
                    "TYPE": "RDSGN"
                  }
                ],
                "ID": 0
              },
              "PROXIMITY": {
                "ID": "AT",
                "DESCRIPTION": "at"
              }
            }
          },
          "GEOLOC": {
            "ORIGIN": {
              "LATITUDE": 48.4474,
              "LONGITUDE": 13.37573
            },
            "TO": [
              {
                "LATITUDE": 48.44887,
                "LONGITUDE": 13.37591
              }
            ]
          },
          "NAVTECH": {
            "EDGE": {
              "EDGE_ID": [
                "1225012672"
              ]
            },
            "VERSION_ID": "202102"
          },
          "LENGTH": 0.10191
        },
        "TRAFFIC_ITEM_DETAIL": {
          "ROAD_CLOSED": false,
          "INCIDENT": {
            "RESPONSE_VEHICLES": false,
            "CONGESTION_INCIDENT": {
              "CONGESTION_TYPE_DESC": "CONGESTION",
              "CONGESTION_FACTOR": 50
            }
          },
          "ALERTC": [
            {
              "EVENT_CODE": 138,
              "ALERTC_Q": 1
            }
          ]
        },
        "TRAFFIC_ITEM_DESCRIPTION": [
          {
            "value": "Bei Rottal-West - Stockender Verkehr; Durchschnittsgeschwindigkeit von bis zu 5 km/h; vorsichtig an das Stauende heranfahren.",
            "TYPE": "short_desc"
          },
          {
            "value": "Bei Rottal-West - Stockender Verkehr; Durchschnittsgeschwindigkeit von bis zu 5 km/h; vorsichtig an das Stauende heranfahren.",
            "TYPE": "desc"
          },
          {
            "value": "Stockender Verkehr; Durchschnittsgeschwindigkeit von bis zu 5 km/h; vorsichtig an das Stauende heranfahren.",
            "TYPE": "no_exit_description"
          }
        ],
        "mid": "4eefada6-d641-429f-bd36-75f1fd35659a|1629612484604",
        "PRODUCT": "basic"
      },
      {
        "TRAFFIC_ITEM_ID": 534445990441623812,
        "ORIGINAL_TRAFFIC_ITEM_ID": 1612764111648984958,
        "TRAFFIC_ITEM_STATUS_SHORT_DESC": "ACTIVE",
        "TRAFFIC_ITEM_TYPE_DESC": "CONGESTION",
        "START_TIME": "08/22/2021 06:00:16",
        "END_TIME": "08/22/2021 06:19:16",
        "ENTRY_TIME": "08/22/2021 06:09:19",
        "CRITICALITY": {
          "ID": "2",
          "DESCRIPTION": "minor"
        },
        "VERIFIED": true,
        "ABBREVIATION": {
          "SHORT_DESC": "SLOW",
          "DESCRIPTION": "slow"
        },
        "RDS-TMC_LOCATIONS": {
          "RDS-TMC": [
            {
              "ORIGIN": {
                "EBU_COUNTRY_CODE": "A",
                "TABLE_ID": 1,
                "LOCATION_ID": "35946",
                "LOCATION_DESC": "Mautstelle Gleinalm",
                "RDS_DIRECTION": "-"
              },
              "DIRECTION": "+",
              "ALERTC": {
                "TRAFFIC_CODE": 138,
                "QUANTIFIERS": 4,
                "DESCRIPTION": "Stockender Verkehr;; vorsichtig an das Stauende heranfahren.",
                "ALERTC_DURATION": "D",
                "ALERTC_DIRECTION": 1,
                "URGENCY": "U",
                "UPDATE_CLASS": 1,
                "PHRASE_CODE": "A2.Z112",
                "EXTENT": "1",
                "DURATION": 0
              },
              "LENGTH": 0.03142,
              "PRIMARY_OFFSET": 0.03552
            }
          ]
        },
        "LOCATION": {
          "DEFINED": {
            "ORIGIN": {
              "ROADWAY": {
                "DESCRIPTION": [
                  {
                    "value": "Pyhrn Autobahn",
                    "TYPE": "NTCSA"
                  },
                  {
                    "value": "Pyhrn Autobahn",
                    "TYPE": "RDSGN"
                  },
                  {
                    "value": "Pyhrn Autobahn",
                    "TYPE": "LOCAL"
                  }
                ],
                "ID": 30562
              },
              "POINT": {
                "DESCRIPTION": [
                  {
                    "value": "St. Michael",
                    "TYPE": "NTCSA"
                  },
                  {
                    "value": "St. Michael",
                    "TYPE": "RDSGN"
                  },
                  {
                    "value": "St. Michael",
                    "TYPE": "LOCAL"
                  },
                  {
                    "value": "Pyhrn Autobahn",
                    "TYPE": "BNAME"
                  }
                ],
                "ID": 35946
              },
              "DIRECTION": {
                "DESCRIPTION": [
                  {
                    "value": "GRAZ",
                    "TYPE": "LOCAL"
                  },
                  {
                    "value": "GRAZ",
                    "TYPE": "NTCSA"
                  },
                  {
                    "value": "GRAZ",
                    "TYPE": "RDSGN"
                  }
                ],
                "ID": 0
              },
              "PROXIMITY": {
                "ID": "AT",
                "DESCRIPTION": "at"
              }
            },
            "TO": {
              "ROADWAY": {
                "DESCRIPTION": [
                  {
                    "value": "Pyhrn Autobahn",
                    "TYPE": "NTCSA"
                  },
                  {
                    "value": "Pyhrn Autobahn",
                    "TYPE": "RDSGN"
                  },
                  {
                    "value": "Pyhrn Autobahn",
                    "TYPE": "LOCAL"
                  }
                ],
                "ID": 30562
              },
              "POINT": {
                "DESCRIPTION": [
                  {
                    "value": "Mautstelle Gleinalm",
                    "TYPE": "NTCSA"
                  },
                  {
                    "value": "Mautstelle Gleinalm",
                    "TYPE": "RDSGN"
                  },
                  {
                    "value": "Mautstelle Gleinalm",
                    "TYPE": "LOCAL"
                  },
                  {
                    "value": "Pyhrn Autobahn",
                    "TYPE": "BNAME"
                  }
                ],
                "ID": 35946
              },
              "DIRECTION": {
                "DESCRIPTION": [
                  {
                    "value": "GRAZ",
                    "TYPE": "LOCAL"
                  },
                  {
                    "value": "GRAZ",
                    "TYPE": "NTCSA"
                  },
                  {
                    "value": "GRAZ",
                    "TYPE": "RDSGN"
                  }
                ],
                "ID": 0
              },
              "PROXIMITY": {
                "ID": "AT",
                "DESCRIPTION": "at"
              }
            }
          },
          "GEOLOC": {
            "ORIGIN": {
              "LATITUDE": 47.32375,
              "LONGITUDE": 15.02916
            },
            "TO": [
              {
                "LATITUDE": 47.32343,
                "LONGITUDE": 15.0296
              }
            ]
          },
          "NAVTECH": {
            "EDGE": {
              "EDGE_ID": [
                "1210604901"
              ]
            },
            "VERSION_ID": "202102"
          },
          "LENGTH": 0.03142
        },
        "TRAFFIC_ITEM_DETAIL": {
          "ROAD_CLOSED": false,
          "INCIDENT": {
            "RESPONSE_VEHICLES": false,
            "CONGESTION_INCIDENT": {
              "CONGESTION_TYPE_DESC": "CONGESTION",
              "CONGESTION_FACTOR": 50
            }
          },
          "ALERTC": [
            {
              "EVENT_CODE": 138
            }
          ]
        },
        "TRAFFIC_ITEM_DESCRIPTION": [
          {
            "value": "Bei Mautstelle Gleinalm - Stockender Verkehr;; vorsichtig an das Stauende heranfahren.",
            "TYPE": "short_desc"
          },
          {
            "value": "Bei Mautstelle Gleinalm - Stockender Verkehr;; vorsichtig an das Stauende heranfahren.",
            "TYPE": "desc"
          },
          {
            "value": "Stockender Verkehr;; vorsichtig an das Stauende heranfahren.",
            "TYPE": "no_exit_description"
          }
        ],
        "mid": "bca3bc5c-9908-40b2-9a71-7a802425ec92|1629612559604",
        "PRODUCT": "basic"
      },
      {
        "TRAFFIC_ITEM_ID": 3449986747441339051,
        "ORIGINAL_TRAFFIC_ITEM_ID": 3449986747441339051,
        "TRAFFIC_ITEM_STATUS_SHORT_DESC": "ACTIVE",
        "TRAFFIC_ITEM_TYPE_DESC": "CONGESTION",
        "START_TIME": "08/22/2021 06:08:04",
        "END_TIME": "08/22/2021 06:18:04",
        "ENTRY_TIME": "08/22/2021 06:08:04",
        "CRITICALITY": {
          "ID": "2",
          "DESCRIPTION": "minor"
        },
        "VERIFIED": true,
        "ABBREVIATION": {
          "SHORT_DESC": "SLOW",
          "DESCRIPTION": "slow"
        },
        "RDS-TMC_LOCATIONS": {
          "RDS-TMC": [
            {
              "ORIGIN": {
                "EBU_COUNTRY_CODE": "D",
                "TABLE_ID": 1,
                "LOCATION_ID": "12593",
                "LOCATION_DESC": "Hochfelln",
                "RDS_DIRECTION": "-"
              },
              "DIRECTION": "+",
              "ALERTC": {
                "TRAFFIC_CODE": 138,
                "QUANTIFIERS": 4,
                "DESCRIPTION": "Stockender Verkehr;; vorsichtig an das Stauende heranfahren.",
                "ALERTC_DURATION": "D",
                "ALERTC_DIRECTION": 1,
                "URGENCY": "U",
                "UPDATE_CLASS": 1,
                "PHRASE_CODE": "A2.Z112",
                "EXTENT": "1",
                "DURATION": 0
              },
              "LENGTH": 0.05519,
              "PRIMARY_OFFSET": 0.21235
            }
          ]
        },
        "LOCATION": {
          "DEFINED": {
            "ORIGIN": {
              "ROADWAY": {
                "DESCRIPTION": [
                  {
                    "value": "A8",
                    "TYPE": "NTCSA"
                  },
                  {
                    "value": "A8",
                    "TYPE": "RDSGN"
                  },
                  {
                    "value": "A8",
                    "TYPE": "LOCAL"
                  }
                ],
                "ID": 50167
              },
              "POINT": {
                "DESCRIPTION": [
                  {
                    "value": "Grabenst\u00e4tt",
                    "TYPE": "NTCSA"
                  },
                  {
                    "value": "Grabenst\u00e4tt",
                    "TYPE": "RDSGN"
                  },
                  {
                    "value": "Grabenst\u00e4tt",
                    "TYPE": "LOCAL"
                  },
                  {
                    "value": "A8",
                    "TYPE": "BNAME"
                  }
                ],
                "ID": 12593
              },
              "DIRECTION": {
                "DESCRIPTION": [
                  {
                    "value": "SALZBURG",
                    "TYPE": "LOCAL"
                  },
                  {
                    "value": "SALZBURG",
                    "TYPE": "NTCSA"
                  },
                  {
                    "value": "SALZBURG",
                    "TYPE": "RDSGN"
                  }
                ],
                "ID": 0
              },
              "PROXIMITY": {
                "ID": "AT",
                "DESCRIPTION": "at"
              }
            },
            "TO": {
              "ROADWAY": {
                "DESCRIPTION": [
                  {
                    "value": "A8",
                    "TYPE": "NTCSA"
                  },
                  {
                    "value": "A8",
                    "TYPE": "RDSGN"
                  },
                  {
                    "value": "A8",
                    "TYPE": "LOCAL"
                  }
                ],
                "ID": 50167
              },
              "POINT": {
                "DESCRIPTION": [
                  {
                    "value": "Hochfelln",
                    "TYPE": "NTCSA"
                  },
                  {
                    "value": "Hochfelln",
                    "TYPE": "RDSGN"
                  },
                  {
                    "value": "Hochfelln",
                    "TYPE": "LOCAL"
                  },
                  {
                    "value": "A8",
                    "TYPE": "BNAME"
                  }
                ],
                "ID": 12593
              },
              "DIRECTION": {
                "DESCRIPTION": [
                  {
                    "value": "SALZBURG",
                    "TYPE": "LOCAL"
                  },
                  {
                    "value": "SALZBURG",
                    "TYPE": "NTCSA"
                  },
                  {
                    "value": "SALZBURG",
                    "TYPE": "RDSGN"
                  }
                ],
                "ID": 0
              },
              "PROXIMITY": {
                "ID": "AT",
                "DESCRIPTION": "at"
              }
            }
          },
          "GEOLOC": {
            "ORIGIN": {
              "LATITUDE": 47.8283,
              "LONGITUDE": 12.58657
            },
            "TO": [
              {
                "LATITUDE": 47.82824,
                "LONGITUDE": 12.58757
              }
            ]
          },
          "NAVTECH": {
            "EDGE": {
              "EDGE_ID": [
                "1169341257"
              ]
            },
            "VERSION_ID": "202102"
          },
          "LENGTH": 0.05519
        },
        "TRAFFIC_ITEM_DETAIL": {
          "ROAD_CLOSED": false,
          "INCIDENT": {
            "RESPONSE_VEHICLES": false,
            "CONGESTION_INCIDENT": {
              "CONGESTION_TYPE_DESC": "CONGESTION",
              "CONGESTION_FACTOR": 50
            }
          },
          "ALERTC": [
            {
              "EVENT_CODE": 138
            }
          ]
        },
        "TRAFFIC_ITEM_DESCRIPTION": [
          {
            "value": "Bei Hochfelln - Stockender Verkehr;; vorsichtig an das Stauende heranfahren.",
            "TYPE": "short_desc"
          },
          {
            "value": "Bei Hochfelln - Stockender Verkehr;; vorsichtig an das Stauende heranfahren.",
            "TYPE": "desc"
          },
          {
            "value": "Stockender Verkehr;; vorsichtig an das Stauende heranfahren.",
            "TYPE": "no_exit_description"
          }
        ],
        "mid": "52b2ce4c-f267-4e5d-bd98-feff640e0b00|1629612484604",
        "PRODUCT": "basic"
      },
      {
        "TRAFFIC_ITEM_ID": 890489729386327037,
        "ORIGINAL_TRAFFIC_ITEM_ID": 1465695595826985524,
        "TRAFFIC_ITEM_STATUS_SHORT_DESC": "ACTIVE",
        "TRAFFIC_ITEM_TYPE_DESC": "CONGESTION",
        "START_TIME": "08/22/2021 06:06:49",
        "END_TIME": "08/22/2021 06:18:04",
        "ENTRY_TIME": "08/22/2021 06:08:04",
        "CRITICALITY": {
          "ID": "2",
          "DESCRIPTION": "minor"
        },
        "VERIFIED": true,
        "ABBREVIATION": {
          "SHORT_DESC": "SLOW",
          "DESCRIPTION": "slow"
        },
        "RDS-TMC_LOCATIONS": {
          "RDS-TMC": [
            {
              "ORIGIN": {
                "EBU_COUNTRY_CODE": "D",
                "TABLE_ID": 1,
                "LOCATION_ID": "32605",
                "LOCATION_DESC": "Britzer Damm",
                "RDS_DIRECTION": "-"
              },
              "DIRECTION": "+",
              "ALERTC": {
                "TRAFFIC_CODE": 138,
                "QUANTIFIERS": 4,
                "DESCRIPTION": "Stockender Verkehr;; vorsichtig an das Stauende heranfahren.",
                "ALERTC_DURATION": "D",
                "ALERTC_DIRECTION": 1,
                "URGENCY": "U",
                "UPDATE_CLASS": 1,
                "PHRASE_CODE": "A2.Z112",
                "EXTENT": "1",
                "DURATION": 0
              },
              "LENGTH": 0.03155,
              "PRIMARY_OFFSET": 0.22226
            }
          ]
        },
        "LOCATION": {
          "DEFINED": {
            "ORIGIN": {
              "ROADWAY": {
                "DESCRIPTION": [
                  {
                    "value": "Stadtring Berlin",
                    "TYPE": "NTCSA"
                  },
                  {
                    "value": "Stadtring Berlin",
                    "TYPE": "RDSGN"
                  },
                  {
                    "value": "Stadtring Berlin",
                    "TYPE": "LOCAL"
                  }
                ],
                "ID": 50062
              },
              "POINT": {
                "DESCRIPTION": [
                  {
                    "value": "Ortsteil Britz",
                    "TYPE": "NTCSA"
                  },
                  {
                    "value": "Ortsteil Britz",
                    "TYPE": "RDSGN"
                  },
                  {
                    "value": "Ortsteil Britz",
                    "TYPE": "LOCAL"
                  },
                  {
                    "value": "Stadtring Berlin",
                    "TYPE": "BNAME"
                  }
                ],
                "ID": 32605
              },
              "DIRECTION": {
                "DESCRIPTION": [
                  {
                    "value": "NEUK\u00d6LLN",
                    "TYPE": "LOCAL"
                  },
                  {
                    "value": "NEUK\u00d6LLN",
                    "TYPE": "NTCSA"
                  },
                  {
                    "value": "NEUK\u00d6LLN",
                    "TYPE": "RDSGN"
                  }
                ],
                "ID": 0
              },
              "PROXIMITY": {
                "ID": "AT",
                "DESCRIPTION": "at"
              }
            },
            "TO": {
              "ROADWAY": {
                "DESCRIPTION": [
                  {
                    "value": "Stadtring Berlin",
                    "TYPE": "NTCSA"
                  },
                  {
                    "value": "Stadtring Berlin",
                    "TYPE": "RDSGN"
                  },
                  {
                    "value": "Stadtring Berlin",
                    "TYPE": "LOCAL"
                  }
                ],
                "ID": 50062
              },
              "POINT": {
                "DESCRIPTION": [
                  {
                    "value": "Britzer Damm",
                    "TYPE": "NTCSA"
                  },
                  {
                    "value": "Britzer Damm",
                    "TYPE": "RDSGN"
                  },
                  {
                    "value": "Britzer Damm",
                    "TYPE": "LOCAL"
                  },
                  {
                    "value": "Stadtring Berlin",
                    "TYPE": "BNAME"
                  }
                ],
                "ID": 32605
              },
              "DIRECTION": {
                "DESCRIPTION": [
                  {
                    "value": "NEUK\u00d6LLN",
                    "TYPE": "LOCAL"
                  },
                  {
                    "value": "NEUK\u00d6LLN",
                    "TYPE": "NTCSA"
                  },
                  {
                    "value": "NEUK\u00d6LLN",
                    "TYPE": "RDSGN"
                  }
                ],
                "ID": 0
              },
              "PROXIMITY": {
                "ID": "AT",
                "DESCRIPTION": "at"
              }
            }
          },
          "GEOLOC": {
            "ORIGIN": {
              "LATITUDE": 52.46169,
              "LONGITUDE": 13.42866
            },
            "TO": [
              {
                "LATITUDE": 52.46178,
                "LONGITUDE": 13.42939
              }
            ]
          },
          "NAVTECH": {
            "EDGE": {
              "EDGE_ID": [
                "1209405870"
              ]
            },
            "VERSION_ID": "202102"
          },
          "LENGTH": 0.03155
        },
        "TRAFFIC_ITEM_DETAIL": {
          "ROAD_CLOSED": false,
          "INCIDENT": {
            "RESPONSE_VEHICLES": false,
            "CONGESTION_INCIDENT": {
              "CONGESTION_TYPE_DESC": "CONGESTION",
              "CONGESTION_FACTOR": 50
            }
          },
          "ALERTC": [
            {
              "EVENT_CODE": 138
            }
          ]
        },
        "TRAFFIC_ITEM_DESCRIPTION": [
          {
            "value": "Bei Britzer Damm - Stockender Verkehr;; vorsichtig an das Stauende heranfahren.",
            "TYPE": "short_desc"
          },
          {
            "value": "Bei Britzer Damm - Stockender Verkehr;; vorsichtig an das Stauende heranfahren.",
            "TYPE": "desc"
          },
          {
            "value": "Stockender Verkehr;; vorsichtig an das Stauende heranfahren.",
            "TYPE": "no_exit_description"
          }
        ],
        "mid": "931bd913-58c2-46fd-84de-a9977ddbe0f1|1629612484604",
        "PRODUCT": "basic"
      },
      {
        "TRAFFIC_ITEM_ID": 2861078500740185616,
        "ORIGINAL_TRAFFIC_ITEM_ID": 2861078500740185616,
        "TRAFFIC_ITEM_STATUS_SHORT_DESC": "ACTIVE",
        "TRAFFIC_ITEM_TYPE_DESC": "CONGESTION",
        "START_TIME": "08/22/2021 06:07:57",
        "END_TIME": "08/22/2021 06:22:57",
        "ENTRY_TIME": "08/22/2021 06:07:57",
        "CRITICALITY": {
          "ID": "2",
          "DESCRIPTION": "minor"
        },
        "VERIFIED": true,
        "ABBREVIATION": {
          "SHORT_DESC": "SLOW",
          "DESCRIPTION": "slow"
        },
        "RDS-TMC_LOCATIONS": {
          "RDS-TMC": [
            {
              "ORIGIN": {
                "EBU_COUNTRY_CODE": "D",
                "TABLE_ID": 1,
                "LOCATION_ID": "12350",
                "LOCATION_DESC": "Allertal",
                "RDS_DIRECTION": "+"
              },
              "DIRECTION": "-",
              "ALERTC": {
                "TRAFFIC_CODE": 136,
                "QUANTIFIERS": 4,
                "DESCRIPTION": "Verkehrsst\u00f6rung.",
                "ALERTC_DURATION": "D",
                "ALERTC_DIRECTION": 1,
                "UPDATE_CLASS": 1,
                "PHRASE_CODE": "A9",
                "EXTENT": "1",
                "DURATION": 0,
                "SUPP_TRAFFIC_CODE": [
                  {
                    "CODE": 141
                  }
                ]
              },
              "LENGTH": 0.84585,
              "PRIMARY_OFFSET": 0.37556
            }
          ]
        },
        "LOCATION": {
          "DEFINED": {
            "ORIGIN": {
              "ROADWAY": {
                "DESCRIPTION": [
                  {
                    "value": "A7",
                    "TYPE": "NTCSA"
                  },
                  {
                    "value": "A7",
                    "TYPE": "RDSGN"
                  },
                  {
                    "value": "A7",
                    "TYPE": "LOCAL"
                  }
                ],
                "ID": 50163
              },
              "POINT": {
                "DESCRIPTION": [
                  {
                    "value": "Westenholzer Bruch",
                    "TYPE": "NTCSA"
                  },
                  {
                    "value": "Westenholzer Bruch",
                    "TYPE": "RDSGN"
                  },
                  {
                    "value": "Westenholzer Bruch",
                    "TYPE": "LOCAL"
                  },
                  {
                    "value": "A7",
                    "TYPE": "BNAME"
                  }
                ],
                "ID": 12350
              },
              "DIRECTION": {
                "DESCRIPTION": [
                  {
                    "value": "HANNOVER",
                    "TYPE": "LOCAL"
                  },
                  {
                    "value": "HANNOVER",
                    "TYPE": "NTCSA"
                  },
                  {
                    "value": "HANNOVER",
                    "TYPE": "RDSGN"
                  }
                ],
                "ID": 0
              },
              "PROXIMITY": {
                "ID": "AT",
                "DESCRIPTION": "at"
              }
            },
            "TO": {
              "ROADWAY": {
                "DESCRIPTION": [
                  {
                    "value": "A7",
                    "TYPE": "NTCSA"
                  },
                  {
                    "value": "A7",
                    "TYPE": "RDSGN"
                  },
                  {
                    "value": "A7",
                    "TYPE": "LOCAL"
                  }
                ],
                "ID": 50163
              },
              "POINT": {
                "DESCRIPTION": [
                  {
                    "value": "Allertal",
                    "TYPE": "NTCSA"
                  },
                  {
                    "value": "Allertal",
                    "TYPE": "RDSGN"
                  },
                  {
                    "value": "Allertal",
                    "TYPE": "LOCAL"
                  },
                  {
                    "value": "A7",
                    "TYPE": "BNAME"
                  }
                ],
                "ID": 12350
              },
              "DIRECTION": {
                "DESCRIPTION": [
                  {
                    "value": "HANNOVER",
                    "TYPE": "LOCAL"
                  },
                  {
                    "value": "HANNOVER",
                    "TYPE": "NTCSA"
                  },
                  {
                    "value": "HANNOVER",
                    "TYPE": "RDSGN"
                  }
                ],
                "ID": 0
              },
              "PROXIMITY": {
                "ID": "AT",
                "DESCRIPTION": "at"
              }
            }
          },
          "GEOLOC": {
            "ORIGIN": {
              "LATITUDE": 52.70945,
              "LONGITUDE": 9.68402
            },
            "TO": [
              {
                "LATITUDE": 52.69733,
                "LONGITUDE": 9.68649
              }
            ]
          },
          "NAVTECH": {
            "EDGE": {
              "EDGE_ID": [
                "1225462545",
                "1225462544",
                "1225449188",
                "1225449187",
                "1225433392",
                "1225449190",
                "1284339864",
                "924186168"
              ]
            },
            "VERSION_ID": "202102"
          },
          "LENGTH": 0.84585
        },
        "TRAFFIC_ITEM_DETAIL": {
          "ROAD_CLOSED": false,
          "INCIDENT": {
            "RESPONSE_VEHICLES": false,
            "CONGESTION_INCIDENT": {
              "CONGESTION_TYPE_DESC": "CONGESTION",
              "CONGESTION_FACTOR": 50
            }
          },
          "ALERTC": [
            {
              "EVENT_CODE": 136,
              "SUPP_TRAFFIC_CODE": [
                141
              ]
            }
          ]
        },
        "TRAFFIC_ITEM_DESCRIPTION": [
          {
            "value": "Bei Allertal - Verkehrsst\u00f6rung. auf der rechten Seite.",
            "TYPE": "short_desc"
          },
          {
            "value": "Bei Allertal - Verkehrsst\u00f6rung. auf der rechten Seite.",
            "TYPE": "desc"
          },
          {
            "value": "Verkehrsst\u00f6rung. auf der rechten Seite.",
            "TYPE": "no_exit_description"
          }
        ],
        "mid": "544507881629612477480|1629612477480",
        "PRODUCT": "basic"
      },
      {
        "TRAFFIC_ITEM_ID": 3816286280423892728,
        "ORIGINAL_TRAFFIC_ITEM_ID": 1259169690240015186,
        "TRAFFIC_ITEM_STATUS_SHORT_DESC": "ACTIVE",
        "TRAFFIC_ITEM_TYPE_DESC": "CONGESTION",
        "START_TIME": "08/22/2021 06:03:31",
        "END_TIME": "08/22/2021 06:19:16",
        "ENTRY_TIME": "08/22/2021 06:09:19",
        "CRITICALITY": {
          "ID": "2",
          "DESCRIPTION": "minor"
        },
        "VERIFIED": true,
        "ABBREVIATION": {
          "SHORT_DESC": "SLOW",
          "DESCRIPTION": "slow"
        },
        "RDS-TMC_LOCATIONS": {
          "RDS-TMC": [
            {
              "ORIGIN": {
                "EBU_COUNTRY_CODE": "A",
                "TABLE_ID": 1,
                "LOCATION_ID": "35946",
                "LOCATION_DESC": "Mautstelle Gleinalm",
                "RDS_DIRECTION": "+"
              },
              "DIRECTION": "-",
              "ALERTC": {
                "TRAFFIC_CODE": 138,
                "QUANTIFIERS": 4,
                "DESCRIPTION": "Stockender Verkehr;; vorsichtig an das Stauende heranfahren.",
                "ALERTC_DURATION": "D",
                "ALERTC_DIRECTION": 1,
                "URGENCY": "U",
                "UPDATE_CLASS": 1,
                "PHRASE_CODE": "A2.Z112",
                "EXTENT": "1",
                "DURATION": 0
              },
              "LENGTH": 0.02733,
              "PRIMARY_OFFSET": 0.03815
            }
          ]
        },
        "LOCATION": {
          "DEFINED": {
            "ORIGIN": {
              "ROADWAY": {
                "DESCRIPTION": [
                  {
                    "value": "Pyhrn Autobahn",
                    "TYPE": "NTCSA"
                  },
                  {
                    "value": "Pyhrn Autobahn",
                    "TYPE": "RDSGN"
                  },
                  {
                    "value": "Pyhrn Autobahn",
                    "TYPE": "LOCAL"
                  }
                ],
                "ID": 30562
              },
              "POINT": {
                "DESCRIPTION": [
                  {
                    "value": "Parkplatz St. Michael",
                    "TYPE": "NTCSA"
                  },
                  {
                    "value": "Parkplatz St. Michael",
                    "TYPE": "RDSGN"
                  },
                  {
                    "value": "Parkplatz St. Michael",
                    "TYPE": "LOCAL"
                  },
                  {
                    "value": "Pyhrn Autobahn",
                    "TYPE": "BNAME"
                  }
                ],
                "ID": 35946
              },
              "DIRECTION": {
                "DESCRIPTION": [
                  {
                    "value": "ST. MICHAEL",
                    "TYPE": "LOCAL"
                  },
                  {
                    "value": "ST. MICHAEL",
                    "TYPE": "NTCSA"
                  },
                  {
                    "value": "ST. MICHAEL",
                    "TYPE": "RDSGN"
                  }
                ],
                "ID": 0
              },
              "PROXIMITY": {
                "ID": "AT",
                "DESCRIPTION": "at"
              }
            },
            "TO": {
              "ROADWAY": {
                "DESCRIPTION": [
                  {
                    "value": "Pyhrn Autobahn",
                    "TYPE": "NTCSA"
                  },
                  {
                    "value": "Pyhrn Autobahn",
                    "TYPE": "RDSGN"
                  },
                  {
                    "value": "Pyhrn Autobahn",
                    "TYPE": "LOCAL"
                  }
                ],
                "ID": 30562
              },
              "POINT": {
                "DESCRIPTION": [
                  {
                    "value": "Mautstelle Gleinalm",
                    "TYPE": "NTCSA"
                  },
                  {
                    "value": "Mautstelle Gleinalm",
                    "TYPE": "RDSGN"
                  },
                  {
                    "value": "Mautstelle Gleinalm",
                    "TYPE": "LOCAL"
                  },
                  {
                    "value": "Pyhrn Autobahn",
                    "TYPE": "BNAME"
                  }
                ],
                "ID": 35946
              },
              "DIRECTION": {
                "DESCRIPTION": [
                  {
                    "value": "ST. MICHAEL",
                    "TYPE": "LOCAL"
                  },
                  {
                    "value": "ST. MICHAEL",
                    "TYPE": "NTCSA"
                  },
                  {
                    "value": "ST. MICHAEL",
                    "TYPE": "RDSGN"
                  }
                ],
                "ID": 0
              },
              "PROXIMITY": {
                "ID": "AT",
                "DESCRIPTION": "at"
              }
            }
          },
          "GEOLOC": {
            "ORIGIN": {
              "LATITUDE": 47.32294,
              "LONGITUDE": 15.03096
            },
            "TO": [
              {
                "LATITUDE": 47.32322,
                "LONGITUDE": 15.03055
              }
            ]
          },
          "NAVTECH": {
            "EDGE": {
              "EDGE_ID": [
                "1210574975"
              ]
            },
            "VERSION_ID": "202102"
          },
          "LENGTH": 0.02733
        },
        "TRAFFIC_ITEM_DETAIL": {
          "ROAD_CLOSED": false,
          "INCIDENT": {
            "RESPONSE_VEHICLES": false,
            "CONGESTION_INCIDENT": {
              "CONGESTION_TYPE_DESC": "CONGESTION",
              "CONGESTION_FACTOR": 50
            }
          },
          "ALERTC": [
            {
              "EVENT_CODE": 138
            }
          ]
        },
        "TRAFFIC_ITEM_DESCRIPTION": [
          {
            "value": "Bei Mautstelle Gleinalm - Stockender Verkehr;; vorsichtig an das Stauende heranfahren.",
            "TYPE": "short_desc"
          },
          {
            "value": "Bei Mautstelle Gleinalm - Stockender Verkehr;; vorsichtig an das Stauende heranfahren.",
            "TYPE": "desc"
          },
          {
            "value": "Stockender Verkehr;; vorsichtig an das Stauende heranfahren.",
            "TYPE": "no_exit_description"
          }
        ],
        "mid": "f2c7545d-4bd6-4f9d-a618-318972f8de5f|1629612559604",
        "PRODUCT": "basic"
      },
      {
        "TRAFFIC_ITEM_ID": 2647204693279797151,
        "ORIGINAL_TRAFFIC_ITEM_ID": 2212740069934378395,
        "TRAFFIC_ITEM_STATUS_SHORT_DESC": "ACTIVE",
        "TRAFFIC_ITEM_TYPE_DESC": "CONGESTION",
        "START_TIME": "08/22/2021 06:05:19",
        "END_TIME": "08/22/2021 06:18:04",
        "ENTRY_TIME": "08/22/2021 06:08:04",
        "CRITICALITY": {
          "ID": "2",
          "DESCRIPTION": "minor"
        },
        "VERIFIED": true,
        "ABBREVIATION": {
          "SHORT_DESC": "SLOW",
          "DESCRIPTION": "slow"
        },
        "RDS-TMC_LOCATIONS": {
          "RDS-TMC": [
            {
              "ORIGIN": {
                "EBU_COUNTRY_CODE": "D",
                "TABLE_ID": 1,
                "LOCATION_ID": "12333",
                "LOCATION_DESC": "Salzgitter",
                "RDS_DIRECTION": "+"
              },
              "DIRECTION": "-",
              "ALERTC": {
                "TRAFFIC_CODE": 138,
                "ALERTC_Q_BINARY": "1",
                "QUANTIFIERS": 4,
                "DESCRIPTION": "Stockender Verkehr; Durchschnittsgeschwindigkeit von bis zu 5 km/h; vorsichtig an das Stauende heranfahren.",
                "ALERTC_DURATION": "D",
                "ALERTC_DIRECTION": 1,
                "URGENCY": "U",
                "UPDATE_CLASS": 1,
                "PHRASE_CODE": "A2.Z112",
                "EXTENT": "1",
                "DURATION": 0
              },
              "LENGTH": 0.37028,
              "PRIMARY_OFFSET": 0.50216
            }
          ]
        },
        "LOCATION": {
          "DEFINED": {
            "ORIGIN": {
              "ROADWAY": {
                "DESCRIPTION": [
                  {
                    "value": "A7",
                    "TYPE": "NTCSA"
                  },
                  {
                    "value": "A7",
                    "TYPE": "RDSGN"
                  },
                  {
                    "value": "A7",
                    "TYPE": "LOCAL"
                  }
                ],
                "ID": 50163
              },
              "POINT": {
                "DESCRIPTION": [
                  {
                    "value": "Derneburg/Salzgitter",
                    "TYPE": "NTCSA"
                  },
                  {
                    "value": "Derneburg/Salzgitter",
                    "TYPE": "RDSGN"
                  },
                  {
                    "value": "Derneburg/Salzgitter",
                    "TYPE": "LOCAL"
                  },
                  {
                    "value": "A7",
                    "TYPE": "BNAME"
                  }
                ],
                "ID": 12333
              },
              "DIRECTION": {
                "DESCRIPTION": [
                  {
                    "value": "KASSEL",
                    "TYPE": "LOCAL"
                  },
                  {
                    "value": "KASSEL",
                    "TYPE": "NTCSA"
                  },
                  {
                    "value": "KASSEL",
                    "TYPE": "RDSGN"
                  }
                ],
                "ID": 0
              },
              "PROXIMITY": {
                "ID": "AT",
                "DESCRIPTION": "at"
              }
            },
            "TO": {
              "ROADWAY": {
                "DESCRIPTION": [
                  {
                    "value": "A7",
                    "TYPE": "NTCSA"
                  },
                  {
                    "value": "A7",
                    "TYPE": "RDSGN"
                  },
                  {
                    "value": "A7",
                    "TYPE": "LOCAL"
                  }
                ],
                "ID": 50163
              },
              "POINT": {
                "DESCRIPTION": [
                  {
                    "value": "Salzgitter",
                    "TYPE": "NTCSA"
                  },
                  {
                    "value": "Salzgitter",
                    "TYPE": "RDSGN"
                  },
                  {
                    "value": "Salzgitter",
                    "TYPE": "LOCAL"
                  },
                  {
                    "value": "A7",
                    "TYPE": "BNAME"
                  }
                ],
                "ID": 12333
              },
              "DIRECTION": {
                "DESCRIPTION": [
                  {
                    "value": "KASSEL",
                    "TYPE": "LOCAL"
                  },
                  {
                    "value": "KASSEL",
                    "TYPE": "NTCSA"
                  },
                  {
                    "value": "KASSEL",
                    "TYPE": "RDSGN"
                  }
                ],
                "ID": 0
              },
              "PROXIMITY": {
                "ID": "AT",
                "DESCRIPTION": "at"
              }
            }
          },
          "GEOLOC": {
            "ORIGIN": {
              "LATITUDE": 52.09195,
              "LONGITUDE": 10.17225
            },
            "TO": [
              {
                "LATITUDE": 52.08837,
                "LONGITUDE": 10.17862
              }
            ]
          },
          "NAVTECH": {
            "EDGE": {
              "EDGE_ID": [
                "1288939797"
              ]
            },
            "VERSION_ID": "202102"
          },
          "LENGTH": 0.37028
        },
        "TRAFFIC_ITEM_DETAIL": {
          "ROAD_CLOSED": false,
          "INCIDENT": {
            "RESPONSE_VEHICLES": false,
            "CONGESTION_INCIDENT": {
              "CONGESTION_TYPE_DESC": "CONGESTION",
              "CONGESTION_FACTOR": 50
            }
          },
          "ALERTC": [
            {
              "EVENT_CODE": 138,
              "ALERTC_Q": 1
            }
          ]
        },
        "TRAFFIC_ITEM_DESCRIPTION": [
          {
            "value": "Bei Salzgitter - Stockender Verkehr; Durchschnittsgeschwindigkeit von bis zu 5 km/h; vorsichtig an das Stauende heranfahren.",
            "TYPE": "short_desc"
          },
          {
            "value": "Bei Salzgitter - Stockender Verkehr; Durchschnittsgeschwindigkeit von bis zu 5 km/h; vorsichtig an das Stauende heranfahren.",
            "TYPE": "desc"
          },
          {
            "value": "Stockender Verkehr; Durchschnittsgeschwindigkeit von bis zu 5 km/h; vorsichtig an das Stauende heranfahren.",
            "TYPE": "no_exit_description"
          }
        ],
        "mid": "6e8216db-ef95-47d8-99cf-7f86625aed5a|1629612484604",
        "PRODUCT": "basic"
      },
      {
        "TRAFFIC_ITEM_ID": 984439611624696788,
        "ORIGINAL_TRAFFIC_ITEM_ID": 157652947107870773,
        "TRAFFIC_ITEM_STATUS_SHORT_DESC": "ACTIVE",
        "TRAFFIC_ITEM_TYPE_DESC": "CONGESTION",
        "START_TIME": "08/22/2021 05:50:48",
        "END_TIME": "08/22/2021 06:19:16",
        "ENTRY_TIME": "08/22/2021 06:09:19",
        "CRITICALITY": {
          "ID": "2",
          "DESCRIPTION": "minor"
        },
        "VERIFIED": true,
        "ABBREVIATION": {
          "SHORT_DESC": "SLOW",
          "DESCRIPTION": "slow"
        },
        "RDS-TMC_LOCATIONS": {
          "RDS-TMC": [
            {
              "ORIGIN": {
                "EBU_COUNTRY_CODE": "A",
                "TABLE_ID": 1,
                "LOCATION_ID": "31278",
                "LOCATION_DESC": "Flachauwinkel",
                "RDS_DIRECTION": "-"
              },
              "DIRECTION": "+",
              "ALERTC": {
                "TRAFFIC_CODE": 138,
                "ALERTC_Q_BINARY": "2",
                "QUANTIFIERS": 4,
                "DESCRIPTION": "Stockender Verkehr; Durchschnittsgeschwindigkeit von bis zu 10 km/h; vorsichtig an das Stauende heranfahren.",
                "ALERTC_DURATION": "D",
                "ALERTC_DIRECTION": 1,
                "URGENCY": "U",
                "UPDATE_CLASS": 1,
                "PHRASE_CODE": "A2.Z112",
                "EXTENT": "1",
                "DURATION": 0
              },
              "LENGTH": 0.12498,
              "PRIMARY_OFFSET": 1.49597
            }
          ]
        },
        "LOCATION": {
          "DEFINED": {
            "ORIGIN": {
              "ROADWAY": {
                "DESCRIPTION": [
                  {
                    "value": "Tauern Autobahn",
                    "TYPE": "NTCSA"
                  },
                  {
                    "value": "Tauern Autobahn",
                    "TYPE": "RDSGN"
                  },
                  {
                    "value": "Tauern Autobahn",
                    "TYPE": "LOCAL"
                  }
                ],
                "ID": 30566
              },
              "POINT": {
                "DESCRIPTION": [
                  {
                    "value": "Parkplatz Rohr-Gindl",
                    "TYPE": "NTCSA"
                  },
                  {
                    "value": "Parkplatz Rohr-Gindl",
                    "TYPE": "RDSGN"
                  },
                  {
                    "value": "Parkplatz Rohr-Gindl",
                    "TYPE": "LOCAL"
                  },
                  {
                    "value": "Tauern Autobahn",
                    "TYPE": "BNAME"
                  }
                ],
                "ID": 31278
              },
              "DIRECTION": {
                "DESCRIPTION": [
                  {
                    "value": "VILLACH",
                    "TYPE": "LOCAL"
                  },
                  {
                    "value": "VILLACH",
                    "TYPE": "NTCSA"
                  },
                  {
                    "value": "VILLACH",
                    "TYPE": "RDSGN"
                  }
                ],
                "ID": 0
              },
              "PROXIMITY": {
                "ID": "AT",
                "DESCRIPTION": "at"
              }
            },
            "TO": {
              "ROADWAY": {
                "DESCRIPTION": [
                  {
                    "value": "Tauern Autobahn",
                    "TYPE": "NTCSA"
                  },
                  {
                    "value": "Tauern Autobahn",
                    "TYPE": "RDSGN"
                  },
                  {
                    "value": "Tauern Autobahn",
                    "TYPE": "LOCAL"
                  }
                ],
                "ID": 30566
              },
              "POINT": {
                "DESCRIPTION": [
                  {
                    "value": "Flachauwinkel",
                    "TYPE": "NTCSA"
                  },
                  {
                    "value": "Flachauwinkel",
                    "TYPE": "RDSGN"
                  },
                  {
                    "value": "Flachauwinkel",
                    "TYPE": "LOCAL"
                  },
                  {
                    "value": "Tauern Autobahn",
                    "TYPE": "BNAME"
                  }
                ],
                "ID": 31278
              },
              "DIRECTION": {
                "DESCRIPTION": [
                  {
                    "value": "VILLACH",
                    "TYPE": "LOCAL"
                  },
                  {
                    "value": "VILLACH",
                    "TYPE": "NTCSA"
                  },
                  {
                    "value": "VILLACH",
                    "TYPE": "RDSGN"
                  }
                ],
                "ID": 0
              },
              "PROXIMITY": {
                "ID": "AT",
                "DESCRIPTION": "at"
              }
            }
          },
          "GEOLOC": {
            "ORIGIN": {
              "LATITUDE": 47.3158,
              "LONGITUDE": 13.39648
            },
            "TO": [
              {
                "LATITUDE": 47.314,
                "LONGITUDE": 13.39659
              }
            ]
          },
          "NAVTECH": {
            "EDGE": {
              "EDGE_ID": [
                "907014768"
              ]
            },
            "VERSION_ID": "202102"
          },
          "LENGTH": 0.12498
        },
        "TRAFFIC_ITEM_DETAIL": {
          "ROAD_CLOSED": false,
          "INCIDENT": {
            "RESPONSE_VEHICLES": false,
            "CONGESTION_INCIDENT": {
              "CONGESTION_TYPE_DESC": "CONGESTION",
              "CONGESTION_FACTOR": 50
            }
          },
          "ALERTC": [
            {
              "EVENT_CODE": 138,
              "ALERTC_Q": 2
            }
          ]
        },
        "TRAFFIC_ITEM_DESCRIPTION": [
          {
            "value": "Bei Flachauwinkel - Stockender Verkehr; Durchschnittsgeschwindigkeit von bis zu 10 km/h; vorsichtig an das Stauende heranfahren.",
            "TYPE": "short_desc"
          },
          {
            "value": "Bei Flachauwinkel - Stockender Verkehr; Durchschnittsgeschwindigkeit von bis zu 10 km/h; vorsichtig an das Stauende heranfahren.",
            "TYPE": "desc"
          },
          {
            "value": "Stockender Verkehr; Durchschnittsgeschwindigkeit von bis zu 10 km/h; vorsichtig an das Stauende heranfahren.",
            "TYPE": "no_exit_description"
          }
        ],
        "mid": "5a149a7e-c100-45cd-8755-bc001820115e|1629612559604",
        "PRODUCT": "basic"
      },
      {
        "TRAFFIC_ITEM_ID": 2474767309120543231,
        "ORIGINAL_TRAFFIC_ITEM_ID": 2474767309120543231,
        "TRAFFIC_ITEM_STATUS_SHORT_DESC": "ACTIVE",
        "TRAFFIC_ITEM_TYPE_DESC": "CONGESTION",
        "START_TIME": "08/22/2021 06:07:54",
        "END_TIME": "08/22/2021 06:18:04",
        "ENTRY_TIME": "08/22/2021 06:08:04",
        "CRITICALITY": {
          "ID": "2",
          "DESCRIPTION": "minor"
        },
        "VERIFIED": true,
        "ABBREVIATION": {
          "SHORT_DESC": "SLOW",
          "DESCRIPTION": "slow"
        },
        "RDS-TMC_LOCATIONS": {
          "RDS-TMC": [
            {
              "ORIGIN": {
                "EBU_COUNTRY_CODE": "D",
                "TABLE_ID": 1,
                "LOCATION_ID": "10541",
                "LOCATION_DESC": "Theessen",
                "RDS_DIRECTION": "+"
              },
              "DIRECTION": "-",
              "ALERTC": {
                "TRAFFIC_CODE": 138,
                "ALERTC_Q_BINARY": "1",
                "QUANTIFIERS": 4,
                "DESCRIPTION": "Stockender Verkehr; Durchschnittsgeschwindigkeit von bis zu 5 km/h; vorsichtig an das Stauende heranfahren.",
                "ALERTC_DURATION": "D",
                "ALERTC_DIRECTION": 1,
                "URGENCY": "U",
                "UPDATE_CLASS": 1,
                "PHRASE_CODE": "A2.Z112",
                "EXTENT": "1",
                "DURATION": 0
              },
              "LENGTH": 0.54023,
              "PRIMARY_OFFSET": 0.38873
            }
          ]
        },
        "LOCATION": {
          "DEFINED": {
            "ORIGIN": {
              "ROADWAY": {
                "DESCRIPTION": [
                  {
                    "value": "A2",
                    "TYPE": "NTCSA"
                  },
                  {
                    "value": "A2",
                    "TYPE": "RDSGN"
                  },
                  {
                    "value": "A2",
                    "TYPE": "LOCAL"
                  }
                ],
                "ID": 50080
              },
              "POINT": {
                "DESCRIPTION": [
                  {
                    "value": "W\u00fcstenforst",
                    "TYPE": "NTCSA"
                  },
                  {
                    "value": "W\u00fcstenforst",
                    "TYPE": "RDSGN"
                  },
                  {
                    "value": "W\u00fcstenforst",
                    "TYPE": "LOCAL"
                  },
                  {
                    "value": "A2",
                    "TYPE": "BNAME"
                  }
                ],
                "ID": 10541
              },
              "DIRECTION": {
                "DESCRIPTION": [
                  {
                    "value": "MAGDEBURG",
                    "TYPE": "LOCAL"
                  },
                  {
                    "value": "MAGDEBURG",
                    "TYPE": "NTCSA"
                  },
                  {
                    "value": "MAGDEBURG",
                    "TYPE": "RDSGN"
                  }
                ],
                "ID": 0
              },
              "PROXIMITY": {
                "ID": "AT",
                "DESCRIPTION": "at"
              }
            },
            "TO": {
              "ROADWAY": {
                "DESCRIPTION": [
                  {
                    "value": "A2",
                    "TYPE": "NTCSA"
                  },
                  {
                    "value": "A2",
                    "TYPE": "RDSGN"
                  },
                  {
                    "value": "A2",
                    "TYPE": "LOCAL"
                  }
                ],
                "ID": 50080
              },
              "POINT": {
                "DESCRIPTION": [
                  {
                    "value": "Theessen",
                    "TYPE": "NTCSA"
                  },
                  {
                    "value": "Theessen",
                    "TYPE": "RDSGN"
                  },
                  {
                    "value": "Theessen",
                    "TYPE": "LOCAL"
                  },
                  {
                    "value": "A2",
                    "TYPE": "BNAME"
                  }
                ],
                "ID": 10541
              },
              "DIRECTION": {
                "DESCRIPTION": [
                  {
                    "value": "MAGDEBURG",
                    "TYPE": "LOCAL"
                  },
                  {
                    "value": "MAGDEBURG",
                    "TYPE": "NTCSA"
                  },
                  {
                    "value": "MAGDEBURG",
                    "TYPE": "RDSGN"
                  }
                ],
                "ID": 0
              },
              "PROXIMITY": {
                "ID": "AT",
                "DESCRIPTION": "at"
              }
            }
          },
          "GEOLOC": {
            "ORIGIN": {
              "LATITUDE": 52.23583,
              "LONGITUDE": 12.08094
            },
            "TO": [
              {
                "LATITUDE": 52.23425,
                "LONGITUDE": 12.0687
              }
            ]
          },
          "NAVTECH": {
            "EDGE": {
              "EDGE_ID": [
                "64987262"
              ]
            },
            "VERSION_ID": "202102"
          },
          "LENGTH": 0.54023
        },
        "TRAFFIC_ITEM_DETAIL": {
          "ROAD_CLOSED": false,
          "INCIDENT": {
            "RESPONSE_VEHICLES": false,
            "CONGESTION_INCIDENT": {
              "CONGESTION_TYPE_DESC": "CONGESTION",
              "CONGESTION_FACTOR": 50
            }
          },
          "ALERTC": [
            {
              "EVENT_CODE": 138,
              "ALERTC_Q": 1
            }
          ]
        },
        "TRAFFIC_ITEM_DESCRIPTION": [
          {
            "value": "Bei Theessen - Stockender Verkehr; Durchschnittsgeschwindigkeit von bis zu 5 km/h; vorsichtig an das Stauende heranfahren.",
            "TYPE": "short_desc"
          },
          {
            "value": "Bei Theessen - Stockender Verkehr; Durchschnittsgeschwindigkeit von bis zu 5 km/h; vorsichtig an das Stauende heranfahren.",
            "TYPE": "desc"
          },
          {
            "value": "Stockender Verkehr; Durchschnittsgeschwindigkeit von bis zu 5 km/h; vorsichtig an das Stauende heranfahren.",
            "TYPE": "no_exit_description"
          }
        ],
        "mid": "c0df9999-a621-47b9-bc54-a0135495f732|1629612484604",
        "PRODUCT": "basic"
      },
      {
        "TRAFFIC_ITEM_ID": 195266405958708312,
        "ORIGINAL_TRAFFIC_ITEM_ID": 657467329270692815,
        "TRAFFIC_ITEM_STATUS_SHORT_DESC": "ACTIVE",
        "TRAFFIC_ITEM_TYPE_DESC": "CONGESTION",
        "START_TIME": "08/22/2021 05:56:49",
        "END_TIME": "08/22/2021 06:19:16",
        "ENTRY_TIME": "08/22/2021 06:09:19",
        "CRITICALITY": {
          "ID": "2",
          "DESCRIPTION": "minor"
        },
        "VERIFIED": true,
        "ABBREVIATION": {
          "SHORT_DESC": "SLOW",
          "DESCRIPTION": "slow"
        },
        "RDS-TMC_LOCATIONS": {
          "RDS-TMC": [
            {
              "ORIGIN": {
                "EBU_COUNTRY_CODE": "A",
                "TABLE_ID": 1,
                "LOCATION_ID": "31280",
                "LOCATION_DESC": "St. Michael im Lungau",
                "RDS_DIRECTION": "+"
              },
              "DIRECTION": "-",
              "ALERTC": {
                "TRAFFIC_CODE": 138,
                "QUANTIFIERS": 4,
                "DESCRIPTION": "Stockender Verkehr;; vorsichtig an das Stauende heranfahren.",
                "ALERTC_DURATION": "D",
                "ALERTC_DIRECTION": 1,
                "URGENCY": "U",
                "UPDATE_CLASS": 1,
                "PHRASE_CODE": "A2.Z112",
                "EXTENT": "1",
                "DURATION": 0
              },
              "LENGTH": 0.01587,
              "PRIMARY_OFFSET": 0.37325
            }
          ]
        },
        "LOCATION": {
          "DEFINED": {
            "ORIGIN": {
              "ROADWAY": {
                "DESCRIPTION": [
                  {
                    "value": "Tauern Autobahn",
                    "TYPE": "NTCSA"
                  },
                  {
                    "value": "Tauern Autobahn",
                    "TYPE": "RDSGN"
                  },
                  {
                    "value": "Tauern Autobahn",
                    "TYPE": "LOCAL"
                  }
                ],
                "ID": 30566
              },
              "POINT": {
                "DESCRIPTION": [
                  {
                    "value": "Mautstelle St. Michael im Lungau",
                    "TYPE": "NTCSA"
                  },
                  {
                    "value": "Mautstelle St. Michael im Lungau",
                    "TYPE": "RDSGN"
                  },
                  {
                    "value": "Mautstelle St. Michael im Lungau",
                    "TYPE": "LOCAL"
                  },
                  {
                    "value": "Tauern Autobahn",
                    "TYPE": "BNAME"
                  }
                ],
                "ID": 31280
              },
              "DIRECTION": {
                "DESCRIPTION": [
                  {
                    "value": "SALZBURG",
                    "TYPE": "LOCAL"
                  },
                  {
                    "value": "SALZBURG",
                    "TYPE": "NTCSA"
                  },
                  {
                    "value": "SALZBURG",
                    "TYPE": "RDSGN"
                  }
                ],
                "ID": 0
              },
              "PROXIMITY": {
                "ID": "AT",
                "DESCRIPTION": "at"
              }
            },
            "TO": {
              "ROADWAY": {
                "DESCRIPTION": [
                  {
                    "value": "Tauern Autobahn",
                    "TYPE": "NTCSA"
                  },
                  {
                    "value": "Tauern Autobahn",
                    "TYPE": "RDSGN"
                  },
                  {
                    "value": "Tauern Autobahn",
                    "TYPE": "LOCAL"
                  }
                ],
                "ID": 30566
              },
              "POINT": {
                "DESCRIPTION": [
                  {
                    "value": "St. Michael im Lungau",
                    "TYPE": "NTCSA"
                  },
                  {
                    "value": "St. Michael im Lungau",
                    "TYPE": "RDSGN"
                  },
                  {
                    "value": "St. Michael im Lungau",
                    "TYPE": "LOCAL"
                  },
                  {
                    "value": "Tauern Autobahn",
                    "TYPE": "BNAME"
                  }
                ],
                "ID": 31280
              },
              "DIRECTION": {
                "DESCRIPTION": [
                  {
                    "value": "SALZBURG",
                    "TYPE": "LOCAL"
                  },
                  {
                    "value": "SALZBURG",
                    "TYPE": "NTCSA"
                  },
                  {
                    "value": "SALZBURG",
                    "TYPE": "RDSGN"
                  }
                ],
                "ID": 0
              },
              "PROXIMITY": {
                "ID": "AT",
                "DESCRIPTION": "at"
              }
            }
          },
          "GEOLOC": {
            "ORIGIN": {
              "LATITUDE": 47.093,
              "LONGITUDE": 13.6099
            },
            "TO": [
              {
                "LATITUDE": 47.09323,
                "LONGITUDE": 13.6099
              }
            ]
          },
          "NAVTECH": {
            "EDGE": {
              "EDGE_ID": [
                "1210466111"
              ]
            },
            "VERSION_ID": "202102"
          },
          "LENGTH": 0.01587
        },
        "TRAFFIC_ITEM_DETAIL": {
          "ROAD_CLOSED": false,
          "INCIDENT": {
            "RESPONSE_VEHICLES": false,
            "CONGESTION_INCIDENT": {
              "CONGESTION_TYPE_DESC": "CONGESTION",
              "CONGESTION_FACTOR": 50
            }
          },
          "ALERTC": [
            {
              "EVENT_CODE": 138
            }
          ]
        },
        "TRAFFIC_ITEM_DESCRIPTION": [
          {
            "value": "Bei St. Michael im Lungau - Stockender Verkehr;; vorsichtig an das Stauende heranfahren.",
            "TYPE": "short_desc"
          },
          {
            "value": "Bei St. Michael im Lungau - Stockender Verkehr;; vorsichtig an das Stauende heranfahren.",
            "TYPE": "desc"
          },
          {
            "value": "Stockender Verkehr;; vorsichtig an das Stauende heranfahren.",
            "TYPE": "no_exit_description"
          }
        ],
        "mid": "e642b152-1560-4833-b398-2647cb04e835|1629612559604",
        "PRODUCT": "basic"
      }
    ]
  },
  "diagnostic": {
    "info": "",
    "sfile": "Incident-E1409-1629612465916.xml.gz|pr1",
    "pdd": "trafficml-incident-24-v13"
  },
  "TIMESTAMP2": "2021-08-22T06:07:46.000+0000",
  "EXTENDED_COUNTRY_CODE": "E1"
}