{
  "TIMESTAMP": "08/22/2021 01:17:46 GMT",
  "VERSION": 2.3,
  "TRAFFIC_ITEMS": {
    "TRAFFIC_ITEM": [
      {
        "TRAFFIC_ITEM_ID": 3544836858512844431,
        "ORIGINAL_TRAFFIC_ITEM_ID": 1591395762287363666,
        "TRAFFIC_ITEM_STATUS_SHORT_DESC": "ACTIVE",
        "TRAFFIC_ITEM_TYPE_DESC": "CONGESTION",
        "START_TIME": "08/22/2021 01:12:04",
        "END_TIME": "08/22/2021 01:28:19",
        "ENTRY_TIME": "08/22/2021 01:12:04",
        "CRITICALITY": {
          "ID": "2",
          "DESCRIPTION": "minor"
        },
        "VERIFIED": true,
        "ABBREVIATION": {
          "SHORT_DESC": "SLOW",
          "DESCRIPTION": "slow"
        },
        "RDS-TMC_LOCATIONS": {
          "RDS-TMC": [
            {
              "ORIGIN": {
                "EBU_COUNTRY_CODE": "D",
                "TABLE_ID": 1,
                "LOCATION_ID": "08105",
                "LOCATION_DESC": "Einhausung Wimpasing",
                "RDS_DIRECTION": "+"
              },
              "DIRECTION": "-",
              "ALERTC": {
                "TRAFFIC_CODE": 138,
                "QUANTIFIERS": 4,
                "DESCRIPTION": "Stockender Verkehr;; vorsichtig an das Stauende heranfahren.",
                "ALERTC_DURATION": "D",
                "ALERTC_DIRECTION": 1,
                "URGENCY": "U",
                "UPDATE_CLASS": 1,
                "PHRASE_CODE": "A2.Z112",
                "EXTENT": "1",
                "DURATION": 0
              },
              "LENGTH": 0.16289,
              "PRIMARY_OFFSET": 0.02271
            }
          ]
        },
        "LOCATION": {
          "DEFINED": {
            "ORIGIN": {
              "ROADWAY": {
                "DESCRIPTION": [
                  {
                    "value": "A94",
                    "TYPE": "NTCSA"
                  },
                  {
                    "value": "A94",
                    "TYPE": "RDSGN"
                  },
                  {
                    "value": "A94",
                    "TYPE": "LOCAL"
                  }
                ],
                "ID": 7229
              },
              "POINT": {
                "DESCRIPTION": [
                  {
                    "value": "Waldkraiburg/Ampfing",
                    "TYPE": "NTCSA"
                  },
                  {
                    "value": "Waldkraiburg/Ampfing",
                    "TYPE": "RDSGN"
                  },
                  {
                    "value": "Waldkraiburg/Ampfing",
                    "TYPE": "LOCAL"
                  },
                  {
                    "value": "A94",
                    "TYPE": "BNAME"
                  }
                ],
                "ID": 8105
              },
              "DIRECTION": {
                "DESCRIPTION": [
                  {
                    "value": "M\u00dcNCHEN",
                    "TYPE": "LOCAL"
                  },
                  {
                    "value": "M\u00dcNCHEN",
                    "TYPE": "NTCSA"
                  },
                  {
                    "value": "M\u00dcNCHEN",
                    "TYPE": "RDSGN"
                  }
                ],
                "ID": 0
              },
              "PROXIMITY": {
                "ID": "AT",
                "DESCRIPTION": "at"
              }
            },
            "TO": {
              "ROADWAY": {
                "DESCRIPTION": [
                  {
                    "value": "A94",
                    "TYPE": "NTCSA"
                  },
                  {
                    "value": "A94",
                    "TYPE": "RDSGN"
                  },
                  {
                    "value": "A94",
                    "TYPE": "LOCAL"
                  }
                ],
                "ID": 7229
              },
              "POINT": {
                "DESCRIPTION": [
                  {
                    "value": "Einhausung Wimpasing",
                    "TYPE": "NTCSA"
                  },
                  {
                    "value": "Einhausung Wimpasing",
                    "TYPE": "RDSGN"
                  },
                  {
                    "value": "Einhausung Wimpasing",
                    "TYPE": "LOCAL"
                  },
                  {
                    "value": "A94",
                    "TYPE": "BNAME"
                  }
                ],
                "ID": 8105
              },
              "DIRECTION": {
                "DESCRIPTION": [
                  {
                    "value": "M\u00dcNCHEN",
                    "TYPE": "LOCAL"
                  },
                  {
                    "value": "M\u00dcNCHEN",
                    "TYPE": "NTCSA"
                  },
                  {
                    "value": "M\u00dcNCHEN",
                    "TYPE": "RDSGN"
                  }
                ],
                "ID": 0
              },
              "PROXIMITY": {
                "ID": "AT",
                "DESCRIPTION": "at"
              }
            }
          },
          "GEOLOC": {
            "ORIGIN": {
              "LATITUDE": 48.25017,
              "LONGITUDE": 12.39665
            },
            "TO": [
              {
                "LATITUDE": 48.25058,
                "LONGITUDE": 12.39319
              }
            ]
          },
          "NAVTECH": {
            "EDGE": {
              "EDGE_ID": [
                "1055918016"
              ]
            },
            "VERSION_ID": "202102"
          },
          "LENGTH": 0.16289
        },
        "TRAFFIC_ITEM_DETAIL": {
          "ROAD_CLOSED": false,
          "INCIDENT": {
            "RESPONSE_VEHICLES": false,
            "CONGESTION_INCIDENT": {
              "CONGESTION_TYPE_DESC": "CONGESTION",
              "CONGESTION_FACTOR": 50
            }
          },
          "ALERTC": [
            {
              "EVENT_CODE": 138
            }
          ]
        },
        "TRAFFIC_ITEM_DESCRIPTION": [
          {
            "value": "Bei Einhausung Wimpasing - Stockender Verkehr;; vorsichtig an das Stauende heranfahren.",
            "TYPE": "short_desc"
          },
          {
            "value": "Bei Einhausung Wimpasing - Stockender Verkehr;; vorsichtig an das Stauende heranfahren.",
            "TYPE": "desc"
          },
          {
            "value": "Stockender Verkehr;; vorsichtig an das Stauende heranfahren.",
            "TYPE": "no_exit_description"
          }
        ],
        "mid": "bf6b0bac-2422-4062-bc0c-cc1dbb0a42c3|1629594724604",
        "PRODUCT": "basic"
      },
      {
        "TRAFFIC_ITEM_ID": 1752099270566633951,
        "ORIGINAL_TRAFFIC_ITEM_ID": 2946413501310234157,
        "TRAFFIC_ITEM_STATUS_SHORT_DESC": "ACTIVE",
        "TRAFFIC_ITEM_TYPE_DESC": "CONGESTION",
        "START_TIME": "08/22/2021 01:16:34",
        "END_TIME": "08/22/2021 01:28:19",
        "ENTRY_TIME": "08/22/2021 01:16:34",
        "CRITICALITY": {
          "ID": "2",
          "DESCRIPTION": "minor"
        },
        "VERIFIED": true,
        "ABBREVIATION": {
          "SHORT_DESC": "SLOW",
          "DESCRIPTION": "slow"
        },
        "RDS-TMC_LOCATIONS": {
          "RDS-TMC": [
            {
              "ORIGIN": {
                "EBU_COUNTRY_CODE": "D",
                "TABLE_ID": 1,
                "LOCATION_ID": "45510",
                "LOCATION_DESC": "Breitenworbis",
                "RDS_DIRECTION": "+"
              },
              "DIRECTION": "-",
              "ALERTC": {
                "TRAFFIC_CODE": 138,
                "QUANTIFIERS": 4,
                "DESCRIPTION": "Stockender Verkehr;; vorsichtig an das Stauende heranfahren.",
                "ALERTC_DURATION": "D",
                "ALERTC_DIRECTION": 1,
                "URGENCY": "U",
                "UPDATE_CLASS": 1,
                "PHRASE_CODE": "A2.Z112",
                "EXTENT": "1",
                "DURATION": 0
              },
              "LENGTH": 0.26182,
              "PRIMARY_OFFSET": 1.67936
            }
          ]
        },
        "LOCATION": {
          "DEFINED": {
            "ORIGIN": {
              "ROADWAY": {
                "DESCRIPTION": [
                  {
                    "value": "A38",
                    "TYPE": "NTCSA"
                  },
                  {
                    "value": "A38",
                    "TYPE": "RDSGN"
                  },
                  {
                    "value": "A38",
                    "TYPE": "LOCAL"
                  }
                ],
                "ID": 50169
              },
              "POINT": {
                "DESCRIPTION": [
                  {
                    "value": "H\u00f6llberg",
                    "TYPE": "NTCSA"
                  },
                  {
                    "value": "H\u00f6llberg",
                    "TYPE": "RDSGN"
                  },
                  {
                    "value": "H\u00f6llberg",
                    "TYPE": "LOCAL"
                  },
                  {
                    "value": "A38",
                    "TYPE": "BNAME"
                  }
                ],
                "ID": 45510
              },
              "DIRECTION": {
                "DESCRIPTION": [
                  {
                    "value": "G\u00d6TTINGEN",
                    "TYPE": "LOCAL"
                  },
                  {
                    "value": "G\u00d6TTINGEN",
                    "TYPE": "NTCSA"
                  },
                  {
                    "value": "G\u00d6TTINGEN",
                    "TYPE": "RDSGN"
                  }
                ],
                "ID": 0
              },
              "PROXIMITY": {
                "ID": "AT",
                "DESCRIPTION": "at"
              }
            },
            "TO": {
              "ROADWAY": {
                "DESCRIPTION": [
                  {
                    "value": "A38",
                    "TYPE": "NTCSA"
                  },
                  {
                    "value": "A38",
                    "TYPE": "RDSGN"
                  },
                  {
                    "value": "A38",
                    "TYPE": "LOCAL"
                  }
                ],
                "ID": 50169
              },
              "POINT": {
                "DESCRIPTION": [
                  {
                    "value": "Breitenworbis",
                    "TYPE": "NTCSA"
                  },
                  {
                    "value": "Breitenworbis",
                    "TYPE": "RDSGN"
                  },
                  {
                    "value": "Breitenworbis",
                    "TYPE": "LOCAL"
                  },
                  {
                    "value": "A38",
                    "TYPE": "BNAME"
                  }
                ],
                "ID": 45510
              },
              "DIRECTION": {
                "DESCRIPTION": [
                  {
                    "value": "G\u00d6TTINGEN",
                    "TYPE": "LOCAL"
                  },
                  {
                    "value": "G\u00d6TTINGEN",
                    "TYPE": "NTCSA"
                  },
                  {
                    "value": "G\u00d6TTINGEN",
                    "TYPE": "RDSGN"
                  }
                ],
                "ID": 0
              },
              "PROXIMITY": {
                "ID": "AT",
                "DESCRIPTION": "at"
              }
            }
          },
          "GEOLOC": {
            "ORIGIN": {
              "LATITUDE": 51.41479,
              "LONGITUDE": 10.47333
            },
            "TO": [
              {
                "LATITUDE": 51.41202,
                "LONGITUDE": 10.46935
              }
            ]
          },
          "NAVTECH": {
            "EDGE": {
              "EDGE_ID": [
                "818214088"
              ]
            },
            "VERSION_ID": "202102"
          },
          "LENGTH": 0.26182
        },
        "TRAFFIC_ITEM_DETAIL": {
          "ROAD_CLOSED": false,
          "INCIDENT": {
            "RESPONSE_VEHICLES": false,
            "CONGESTION_INCIDENT": {
              "CONGESTION_TYPE_DESC": "CONGESTION",
              "CONGESTION_FACTOR": 50
            }
          },
          "ALERTC": [
            {
              "EVENT_CODE": 138
            }
          ]
        },
        "TRAFFIC_ITEM_DESCRIPTION": [
          {
            "value": "Bei Breitenworbis - Stockender Verkehr;; vorsichtig an das Stauende heranfahren.",
            "TYPE": "short_desc"
          },
          {
            "value": "Bei Breitenworbis - Stockender Verkehr;; vorsichtig an das Stauende heranfahren.",
            "TYPE": "desc"
          },
          {
            "value": "Stockender Verkehr;; vorsichtig an das Stauende heranfahren.",
            "TYPE": "no_exit_description"
          }
        ],
        "mid": "5672e29d-ca9e-409a-8d16-531836b0ba5b|1629594994604",
        "PRODUCT": "basic"
      },
      {
        "TRAFFIC_ITEM_ID": 4293580239021286020,
        "ORIGINAL_TRAFFIC_ITEM_ID": 411166255843189234,
        "TRAFFIC_ITEM_STATUS_SHORT_DESC": "ACTIVE",
        "TRAFFIC_ITEM_TYPE_DESC": "CONGESTION",
        "START_TIME": "08/22/2021 01:13:54",
        "END_TIME": "08/22/2021 01:29:16",
        "ENTRY_TIME": "08/22/2021 01:19:19",
        "CRITICALITY": {
          "ID": "2",
          "DESCRIPTION": "minor"
        },
        "VERIFIED": true,
        "ABBREVIATION": {
          "SHORT_DESC": "SLOW",
          "DESCRIPTION": "slow"
        },
        "RDS-TMC_LOCATIONS": {
          "RDS-TMC": [
            {
              "ORIGIN": {
                "EBU_COUNTRY_CODE": "A",
                "TABLE_ID": 1,
                "LOCATION_ID": "35958",
                "LOCATION_DESC": "Mautstelle Sch\u00f6nberg",
                "RDS_DIRECTION": "+"
              },
              "DIRECTION": "-",
              "ALERTC": {
                "TRAFFIC_CODE": 138,
                "QUANTIFIERS": 4,
                "DESCRIPTION": "Stockender Verkehr;; vorsichtig an das Stauende heranfahren.",
                "ALERTC_DURATION": "D",
                "ALERTC_DIRECTION": 1,
                "URGENCY": "U",
                "UPDATE_CLASS": 1,
                "PHRASE_CODE": "A2.Z112",
                "EXTENT": "1",
                "DURATION": 0
              },
              "LENGTH": 0.02194,
              "PRIMARY_OFFSET": 0.04621
            }
          ]
        },
        "LOCATION": {
          "DEFINED": {
            "ORIGIN": {
              "ROADWAY": {
                "DESCRIPTION": [
                  {
                    "value": "Brenner Autobahn",
                    "TYPE": "NTCSA"
                  },
                  {
                    "value": "Brenner Autobahn",
                    "TYPE": "RDSGN"
                  },
                  {
                    "value": "Brenner Autobahn",
                    "TYPE": "LOCAL"
                  }
                ],
                "ID": 30575
              },
              "POINT": {
                "DESCRIPTION": [
                  {
                    "value": "Parkplatz Gschleirs",
                    "TYPE": "NTCSA"
                  },
                  {
                    "value": "Parkplatz Gschleirs",
                    "TYPE": "RDSGN"
                  },
                  {
                    "value": "Parkplatz Gschleirs",
                    "TYPE": "LOCAL"
                  },
                  {
                    "value": "Brenner Autobahn",
                    "TYPE": "BNAME"
                  }
                ],
                "ID": 35958
              },
              "DIRECTION": {
                "DESCRIPTION": [
                  {
                    "value": "INNSBRUCK",
                    "TYPE": "LOCAL"
                  },
                  {
                    "value": "INNSBRUCK",
                    "TYPE": "NTCSA"
                  },
                  {
                    "value": "INNSBRUCK",
                    "TYPE": "RDSGN"
                  }
                ],
                "ID": 0
              },
              "PROXIMITY": {
                "ID": "AT",
                "DESCRIPTION": "at"
              }
            },
            "TO": {
              "ROADWAY": {
                "DESCRIPTION": [
                  {
                    "value": "Brenner Autobahn",
                    "TYPE": "NTCSA"
                  },
                  {
                    "value": "Brenner Autobahn",
                    "TYPE": "RDSGN"
                  },
                  {
                    "value": "Brenner Autobahn",
                    "TYPE": "LOCAL"
                  }
                ],
                "ID": 30575
              },
              "POINT": {
                "DESCRIPTION": [
                  {
                    "value": "Mautstelle Sch\u00f6nberg",
                    "TYPE": "NTCSA"
                  },
                  {
                    "value": "Mautstelle Sch\u00f6nberg",
                    "TYPE": "RDSGN"
                  },
                  {
                    "value": "Mautstelle Sch\u00f6nberg",
                    "TYPE": "LOCAL"
                  },
                  {
                    "value": "Brenner Autobahn",
                    "TYPE": "BNAME"
                  }
                ],
                "ID": 35958
              },
              "DIRECTION": {
                "DESCRIPTION": [
                  {
                    "value": "INNSBRUCK",
                    "TYPE": "LOCAL"
                  },
                  {
                    "value": "INNSBRUCK",
                    "TYPE": "NTCSA"
                  },
                  {
                    "value": "INNSBRUCK",
                    "TYPE": "RDSGN"
                  }
                ],
                "ID": 0
              },
              "PROXIMITY": {
                "ID": "AT",
                "DESCRIPTION": "at"
              }
            }
          },
          "GEOLOC": {
            "ORIGIN": {
              "LATITUDE": 47.18411,
              "LONGITUDE": 11.4061
            },
            "TO": [
              {
                "LATITUDE": 47.18414,
                "LONGITUDE": 11.40569
              }
            ]
          },
          "NAVTECH": {
            "EDGE": {
              "EDGE_ID": [
                "1210479438"
              ]
            },
            "VERSION_ID": "202102"
          },
          "LENGTH": 0.02194
        },
        "TRAFFIC_ITEM_DETAIL": {
          "ROAD_CLOSED": false,
          "INCIDENT": {
            "RESPONSE_VEHICLES": false,
            "CONGESTION_INCIDENT": {
              "CONGESTION_TYPE_DESC": "CONGESTION",
              "CONGESTION_FACTOR": 50
            }
          },
          "ALERTC": [
            {
              "EVENT_CODE": 138
            }
          ]
        },
        "TRAFFIC_ITEM_DESCRIPTION": [
          {
            "value": "Bei Mautstelle Sch\u00f6nberg - Stockender Verkehr;; vorsichtig an das Stauende heranfahren.",
            "TYPE": "short_desc"
          },
          {
            "value": "Bei Mautstelle Sch\u00f6nberg - Stockender Verkehr;; vorsichtig an das Stauende heranfahren.",
            "TYPE": "desc"
          },
          {
            "value": "Stockender Verkehr;; vorsichtig an das Stauende heranfahren.",
            "TYPE": "no_exit_description"
          }
        ],
        "mid": "2bbb6cbe-5cd8-47a7-a6a2-7c287ff30e40|1629595159604",
        "PRODUCT": "basic"
      },
      {
        "TRAFFIC_ITEM_ID": 2301290897945485830,
        "ORIGINAL_TRAFFIC_ITEM_ID": 1538564800929165132,
        "TRAFFIC_ITEM_STATUS_SHORT_DESC": "ACTIVE",
        "TRAFFIC_ITEM_TYPE_DESC": "CONGESTION",
        "START_TIME": "08/22/2021 01:05:17",
        "END_TIME": "08/22/2021 01:29:16",
        "ENTRY_TIME": "08/22/2021 01:17:34",
        "CRITICALITY": {
          "ID": "2",
          "DESCRIPTION": "minor"
        },
        "VERIFIED": true,
        "ABBREVIATION": {
          "SHORT_DESC": "SLOW",
          "DESCRIPTION": "slow"
        },
        "RDS-TMC_LOCATIONS": {
          "RDS-TMC": [
            {
              "ORIGIN": {
                "EBU_COUNTRY_CODE": "A",
                "TABLE_ID": 1,
                "LOCATION_ID": "31280",
                "LOCATION_DESC": "St. Michael im Lungau",
                "RDS_DIRECTION": "-"
              },
              "DIRECTION": "+",
              "ALERTC": {
                "TRAFFIC_CODE": 138,
                "QUANTIFIERS": 4,
                "DESCRIPTION": "Stockender Verkehr;; vorsichtig an das Stauende heranfahren.",
                "ALERTC_DURATION": "D",
                "ALERTC_DIRECTION": 1,
                "URGENCY": "U",
                "UPDATE_CLASS": 1,
                "PHRASE_CODE": "A2.Z112",
                "EXTENT": "1",
                "DURATION": 0
              },
              "LENGTH": 0.02587,
              "PRIMARY_OFFSET": 0.16339
            }
          ]
        },
        "LOCATION": {
          "DEFINED": {
            "ORIGIN": {
              "ROADWAY": {
                "DESCRIPTION": [
                  {
                    "value": "Tauern Autobahn",
                    "TYPE": "NTCSA"
                  },
                  {
                    "value": "Tauern Autobahn",
                    "TYPE": "RDSGN"
                  },
                  {
                    "value": "Tauern Autobahn",
                    "TYPE": "LOCAL"
                  }
                ],
                "ID": 30566
              },
              "POINT": {
                "DESCRIPTION": [
                  {
                    "value": "Parkplatz Lansch\u00fctz",
                    "TYPE": "NTCSA"
                  },
                  {
                    "value": "Parkplatz Lansch\u00fctz",
                    "TYPE": "RDSGN"
                  },
                  {
                    "value": "Parkplatz Lansch\u00fctz",
                    "TYPE": "LOCAL"
                  },
                  {
                    "value": "Tauern Autobahn",
                    "TYPE": "BNAME"
                  }
                ],
                "ID": 31280
              },
              "DIRECTION": {
                "DESCRIPTION": [
                  {
                    "value": "VILLACH",
                    "TYPE": "LOCAL"
                  },
                  {
                    "value": "VILLACH",
                    "TYPE": "NTCSA"
                  },
                  {
                    "value": "VILLACH",
                    "TYPE": "RDSGN"
                  }
                ],
                "ID": 0
              },
              "PROXIMITY": {
                "ID": "AT",
                "DESCRIPTION": "at"
              }
            },
            "TO": {
              "ROADWAY": {
                "DESCRIPTION": [
                  {
                    "value": "Tauern Autobahn",
                    "TYPE": "NTCSA"
                  },
                  {
                    "value": "Tauern Autobahn",
                    "TYPE": "RDSGN"
                  },
                  {
                    "value": "Tauern Autobahn",
                    "TYPE": "LOCAL"
                  }
                ],
                "ID": 30566
              },
              "POINT": {
                "DESCRIPTION": [
                  {
                    "value": "St. Michael im Lungau",
                    "TYPE": "NTCSA"
                  },
                  {
                    "value": "St. Michael im Lungau",
                    "TYPE": "RDSGN"
                  },
                  {
                    "value": "St. Michael im Lungau",
                    "TYPE": "LOCAL"
                  },
                  {
                    "value": "Tauern Autobahn",
                    "TYPE": "BNAME"
                  }
                ],
                "ID": 31280
              },
              "DIRECTION": {
                "DESCRIPTION": [
                  {
                    "value": "VILLACH",
                    "TYPE": "LOCAL"
                  },
                  {
                    "value": "VILLACH",
                    "TYPE": "NTCSA"
                  },
                  {
                    "value": "VILLACH",
                    "TYPE": "RDSGN"
                  }
                ],
                "ID": 0
              },
              "PROXIMITY": {
                "ID": "AT",
                "DESCRIPTION": "at"
              }
            }
          },
          "GEOLOC": {
            "ORIGIN": {
              "LATITUDE": 47.09472,
              "LONGITUDE": 13.60881
            },
            "TO": [
              {
                "LATITUDE": 47.09438,
                "LONGITUDE": 13.60904
              }
            ]
          },
          "NAVTECH": {
            "EDGE": {
              "EDGE_ID": [
                "1210473695"
              ]
            },
            "VERSION_ID": "202102"
          },
          "LENGTH": 0.02587
        },
        "TRAFFIC_ITEM_DETAIL": {
          "ROAD_CLOSED": false,
          "INCIDENT": {
            "RESPONSE_VEHICLES": false,
            "CONGESTION_INCIDENT": {
              "CONGESTION_TYPE_DESC": "CONGESTION",
              "CONGESTION_FACTOR": 50
            }
          },
          "ALERTC": [
            {
              "EVENT_CODE": 138
            }
          ]
        },
        "TRAFFIC_ITEM_DESCRIPTION": [
          {
            "value": "Bei St. Michael im Lungau - Stockender Verkehr;; vorsichtig an das Stauende heranfahren.",
            "TYPE": "short_desc"
          },
          {
            "value": "Bei St. Michael im Lungau - Stockender Verkehr;; vorsichtig an das Stauende heranfahren.",
            "TYPE": "desc"
          },
          {
            "value": "Stockender Verkehr;; vorsichtig an das Stauende heranfahren.",
            "TYPE": "no_exit_description"
          }
        ],
        "mid": "fec67a6d-8ef9-4913-afc7-de964f1c5960|1629595054604",
        "PRODUCT": "basic"
      }
    ]
  },
  "diagnostic": {
    "info": "",
    "sfile": "Incident-E1409-1629595065916.xml.gz|pr1",
    "pdd": "trafficml-incident-24-v13"
  },
  "TIMESTAMP2": "2021-08-22T01:17:46.000+0000",
  "EXTENDED_COUNTRY_CODE": "E1"
}