{
  "TIMESTAMP": "08/21/2021 23:27:46 GMT",
  "VERSION": 2.3,
  "TRAFFIC_ITEMS": {
    "TRAFFIC_ITEM": [
      {
        "TRAFFIC_ITEM_ID": 3160765003442857440,
        "ORIGINAL_TRAFFIC_ITEM_ID": 3024859723424429085,
        "TRAFFIC_ITEM_STATUS_SHORT_DESC": "ACTIVE",
        "TRAFFIC_ITEM_TYPE_DESC": "CONGESTION",
        "START_TIME": "08/21/2021 23:16:31",
        "END_TIME": "08/21/2021 23:39:17",
        "ENTRY_TIME": "08/21/2021 23:29:19",
        "CRITICALITY": {
          "ID": "2",
          "DESCRIPTION": "minor"
        },
        "VERIFIED": true,
        "ABBREVIATION": {
          "SHORT_DESC": "SLOW",
          "DESCRIPTION": "slow"
        },
        "RDS-TMC_LOCATIONS": {
          "RDS-TMC": [
            {
              "ORIGIN": {
                "EBU_COUNTRY_CODE": "A",
                "TABLE_ID": 1,
                "LOCATION_ID": "35946",
                "LOCATION_DESC": "Mautstelle Gleinalm",
                "RDS_DIRECTION": "+"
              },
              "DIRECTION": "-",
              "ALERTC": {
                "TRAFFIC_CODE": 138,
                "QUANTIFIERS": 4,
                "DESCRIPTION": "Stockender Verkehr;; vorsichtig an das Stauende heranfahren.",
                "ALERTC_DURATION": "D",
                "ALERTC_DIRECTION": 1,
                "URGENCY": "U",
                "UPDATE_CLASS": 1,
                "PHRASE_CODE": "A2.Z112",
                "EXTENT": "1",
                "DURATION": 0
              },
              "LENGTH": 0.02735,
              "PRIMARY_OFFSET": 0.06541
            }
          ]
        },
        "LOCATION": {
          "DEFINED": {
            "ORIGIN": {
              "ROADWAY": {
                "DESCRIPTION": [
                  {
                    "value": "Pyhrn Autobahn",
                    "TYPE": "NTCSA"
                  },
                  {
                    "value": "Pyhrn Autobahn",
                    "TYPE": "RDSGN"
                  },
                  {
                    "value": "Pyhrn Autobahn",
                    "TYPE": "LOCAL"
                  }
                ],
                "ID": 30562
              },
              "POINT": {
                "DESCRIPTION": [
                  {
                    "value": "Parkplatz St. Michael",
                    "TYPE": "NTCSA"
                  },
                  {
                    "value": "Parkplatz St. Michael",
                    "TYPE": "RDSGN"
                  },
                  {
                    "value": "Parkplatz St. Michael",
                    "TYPE": "LOCAL"
                  },
                  {
                    "value": "Pyhrn Autobahn",
                    "TYPE": "BNAME"
                  }
                ],
                "ID": 35946
              },
              "DIRECTION": {
                "DESCRIPTION": [
                  {
                    "value": "ST. MICHAEL",
                    "TYPE": "LOCAL"
                  },
                  {
                    "value": "ST. MICHAEL",
                    "TYPE": "NTCSA"
                  },
                  {
                    "value": "ST. MICHAEL",
                    "TYPE": "RDSGN"
                  }
                ],
                "ID": 0
              },
              "PROXIMITY": {
                "ID": "AT",
                "DESCRIPTION": "at"
              }
            },
            "TO": {
              "ROADWAY": {
                "DESCRIPTION": [
                  {
                    "value": "Pyhrn Autobahn",
                    "TYPE": "NTCSA"
                  },
                  {
                    "value": "Pyhrn Autobahn",
                    "TYPE": "RDSGN"
                  },
                  {
                    "value": "Pyhrn Autobahn",
                    "TYPE": "LOCAL"
                  }
                ],
                "ID": 30562
              },
              "POINT": {
                "DESCRIPTION": [
                  {
                    "value": "Mautstelle Gleinalm",
                    "TYPE": "NTCSA"
                  },
                  {
                    "value": "Mautstelle Gleinalm",
                    "TYPE": "RDSGN"
                  },
                  {
                    "value": "Mautstelle Gleinalm",
                    "TYPE": "LOCAL"
                  },
                  {
                    "value": "Pyhrn Autobahn",
                    "TYPE": "BNAME"
                  }
                ],
                "ID": 35946
              },
              "DIRECTION": {
                "DESCRIPTION": [
                  {
                    "value": "ST. MICHAEL",
                    "TYPE": "LOCAL"
                  },
                  {
                    "value": "ST. MICHAEL",
                    "TYPE": "NTCSA"
                  },
                  {
                    "value": "ST. MICHAEL",
                    "TYPE": "RDSGN"
                  }
                ],
                "ID": 0
              },
              "PROXIMITY": {
                "ID": "AT",
                "DESCRIPTION": "at"
              }
            }
          },
          "GEOLOC": {
            "ORIGIN": {
              "LATITUDE": 47.32266,
              "LONGITUDE": 15.03137
            },
            "TO": [
              {
                "LATITUDE": 47.32294,
                "LONGITUDE": 15.03096
              }
            ]
          },
          "NAVTECH": {
            "EDGE": {
              "EDGE_ID": [
                "1210574974"
              ]
            },
            "VERSION_ID": "202102"
          },
          "LENGTH": 0.02735
        },
        "TRAFFIC_ITEM_DETAIL": {
          "ROAD_CLOSED": false,
          "INCIDENT": {
            "RESPONSE_VEHICLES": false,
            "CONGESTION_INCIDENT": {
              "CONGESTION_TYPE_DESC": "CONGESTION",
              "CONGESTION_FACTOR": 50
            }
          },
          "ALERTC": [
            {
              "EVENT_CODE": 138
            }
          ]
        },
        "TRAFFIC_ITEM_DESCRIPTION": [
          {
            "value": "Bei Mautstelle Gleinalm - Stockender Verkehr;; vorsichtig an das Stauende heranfahren.",
            "TYPE": "short_desc"
          },
          {
            "value": "Bei Mautstelle Gleinalm - Stockender Verkehr;; vorsichtig an das Stauende heranfahren.",
            "TYPE": "desc"
          },
          {
            "value": "Stockender Verkehr;; vorsichtig an das Stauende heranfahren.",
            "TYPE": "no_exit_description"
          }
        ],
        "mid": "c3ca9e19-a851-4f4b-8f9d-051b84b61cd3|1629588559604",
        "PRODUCT": "basic"
      },
      {
        "TRAFFIC_ITEM_ID": 1991596708727367073,
        "ORIGINAL_TRAFFIC_ITEM_ID": 1240481016494423343,
        "TRAFFIC_ITEM_STATUS_SHORT_DESC": "ACTIVE",
        "TRAFFIC_ITEM_TYPE_DESC": "CONGESTION",
        "START_TIME": "08/21/2021 23:22:34",
        "END_TIME": "08/21/2021 23:38:19",
        "ENTRY_TIME": "08/21/2021 23:22:34",
        "CRITICALITY": {
          "ID": "2",
          "DESCRIPTION": "minor"
        },
        "VERIFIED": true,
        "ABBREVIATION": {
          "SHORT_DESC": "SLOW",
          "DESCRIPTION": "slow"
        },
        "RDS-TMC_LOCATIONS": {
          "RDS-TMC": [
            {
              "ORIGIN": {
                "EBU_COUNTRY_CODE": "D",
                "TABLE_ID": 1,
                "LOCATION_ID": "31620",
                "LOCATION_DESC": "Allach",
                "RDS_DIRECTION": "+"
              },
              "DIRECTION": "-",
              "ALERTC": {
                "TRAFFIC_CODE": 138,
                "QUANTIFIERS": 4,
                "DESCRIPTION": "Stockender Verkehr;; vorsichtig an das Stauende heranfahren.",
                "ALERTC_DURATION": "D",
                "ALERTC_DIRECTION": 1,
                "URGENCY": "U",
                "UPDATE_CLASS": 1,
                "PHRASE_CODE": "A2.Z112",
                "EXTENT": "1",
                "DURATION": 0
              },
              "LENGTH": 0.13583,
              "PRIMARY_OFFSET": 0.28035
            }
          ]
        },
        "LOCATION": {
          "DEFINED": {
            "ORIGIN": {
              "ROADWAY": {
                "DESCRIPTION": [
                  {
                    "value": "Autobahnring M\u00fcnchen",
                    "TYPE": "NTCSA"
                  },
                  {
                    "value": "Autobahnring M\u00fcnchen",
                    "TYPE": "RDSGN"
                  },
                  {
                    "value": "Autobahnring M\u00fcnchen",
                    "TYPE": "LOCAL"
                  }
                ],
                "ID": 50183
              },
              "POINT": {
                "DESCRIPTION": [
                  {
                    "value": "M\u00fcnchen-Ludwigsfeld",
                    "TYPE": "NTCSA"
                  },
                  {
                    "value": "M\u00fcnchen-Ludwigsfeld",
                    "TYPE": "RDSGN"
                  },
                  {
                    "value": "M\u00fcnchen-Ludwigsfeld",
                    "TYPE": "LOCAL"
                  },
                  {
                    "value": "Autobahnring M\u00fcnchen",
                    "TYPE": "BNAME"
                  }
                ],
                "ID": 31620
              },
              "DIRECTION": {
                "DESCRIPTION": [
                  {
                    "value": "M\u00dcNCHEN-S\u00dcD-WEST",
                    "TYPE": "LOCAL"
                  },
                  {
                    "value": "M\u00dcNCHEN-S\u00dcD-WEST",
                    "TYPE": "NTCSA"
                  },
                  {
                    "value": "M\u00dcNCHEN-S\u00dcD-WEST",
                    "TYPE": "RDSGN"
                  }
                ],
                "ID": 0
              },
              "PROXIMITY": {
                "ID": "AT",
                "DESCRIPTION": "at"
              }
            },
            "TO": {
              "ROADWAY": {
                "DESCRIPTION": [
                  {
                    "value": "Autobahnring M\u00fcnchen",
                    "TYPE": "NTCSA"
                  },
                  {
                    "value": "Autobahnring M\u00fcnchen",
                    "TYPE": "RDSGN"
                  },
                  {
                    "value": "Autobahnring M\u00fcnchen",
                    "TYPE": "LOCAL"
                  }
                ],
                "ID": 50183
              },
              "POINT": {
                "DESCRIPTION": [
                  {
                    "value": "Allach",
                    "TYPE": "NTCSA"
                  },
                  {
                    "value": "Allach",
                    "TYPE": "RDSGN"
                  },
                  {
                    "value": "Allach",
                    "TYPE": "LOCAL"
                  },
                  {
                    "value": "Autobahnring M\u00fcnchen",
                    "TYPE": "BNAME"
                  }
                ],
                "ID": 31620
              },
              "DIRECTION": {
                "DESCRIPTION": [
                  {
                    "value": "M\u00dcNCHEN-S\u00dcD-WEST",
                    "TYPE": "LOCAL"
                  },
                  {
                    "value": "M\u00dcNCHEN-S\u00dcD-WEST",
                    "TYPE": "NTCSA"
                  },
                  {
                    "value": "M\u00dcNCHEN-S\u00dcD-WEST",
                    "TYPE": "RDSGN"
                  }
                ],
                "ID": 0
              },
              "PROXIMITY": {
                "ID": "AT",
                "DESCRIPTION": "at"
              }
            }
          },
          "GEOLOC": {
            "ORIGIN": {
              "LATITUDE": 48.20765,
              "LONGITUDE": 11.46171
            },
            "TO": [
              {
                "LATITUDE": 48.20634,
                "LONGITUDE": 11.45956
              }
            ]
          },
          "NAVTECH": {
            "EDGE": {
              "EDGE_ID": [
                "1225525831"
              ]
            },
            "VERSION_ID": "202102"
          },
          "LENGTH": 0.13583
        },
        "TRAFFIC_ITEM_DETAIL": {
          "ROAD_CLOSED": false,
          "INCIDENT": {
            "RESPONSE_VEHICLES": false,
            "CONGESTION_INCIDENT": {
              "CONGESTION_TYPE_DESC": "CONGESTION",
              "CONGESTION_FACTOR": 50
            }
          },
          "ALERTC": [
            {
              "EVENT_CODE": 138
            }
          ]
        },
        "TRAFFIC_ITEM_DESCRIPTION": [
          {
            "value": "Bei Allach - Stockender Verkehr;; vorsichtig an das Stauende heranfahren.",
            "TYPE": "short_desc"
          },
          {
            "value": "Bei Allach - Stockender Verkehr;; vorsichtig an das Stauende heranfahren.",
            "TYPE": "desc"
          },
          {
            "value": "Stockender Verkehr;; vorsichtig an das Stauende heranfahren.",
            "TYPE": "no_exit_description"
          }
        ],
        "mid": "19c5576c-52fe-46eb-9d6f-7ac4617b3113|1629588154604",
        "PRODUCT": "basic"
      },
      {
        "TRAFFIC_ITEM_ID": 1687442066237399097,
        "ORIGINAL_TRAFFIC_ITEM_ID": 934604853723428041,
        "TRAFFIC_ITEM_STATUS_SHORT_DESC": "ACTIVE",
        "TRAFFIC_ITEM_TYPE_DESC": "CONGESTION",
        "START_TIME": "08/21/2021 23:20:01",
        "END_TIME": "08/21/2021 23:39:17",
        "ENTRY_TIME": "08/21/2021 23:29:19",
        "CRITICALITY": {
          "ID": "2",
          "DESCRIPTION": "minor"
        },
        "VERIFIED": true,
        "ABBREVIATION": {
          "SHORT_DESC": "SLOW",
          "DESCRIPTION": "slow"
        },
        "RDS-TMC_LOCATIONS": {
          "RDS-TMC": [
            {
              "ORIGIN": {
                "EBU_COUNTRY_CODE": "A",
                "TABLE_ID": 1,
                "LOCATION_ID": "35947",
                "LOCATION_DESC": "Mautstelle Bosruck",
                "RDS_DIRECTION": "-"
              },
              "DIRECTION": "+",
              "ALERTC": {
                "TRAFFIC_CODE": 138,
                "QUANTIFIERS": 4,
                "DESCRIPTION": "Stockender Verkehr;; vorsichtig an das Stauende heranfahren.",
                "ALERTC_DURATION": "D",
                "ALERTC_DIRECTION": 1,
                "URGENCY": "U",
                "UPDATE_CLASS": 1,
                "PHRASE_CODE": "A2.Z112",
                "EXTENT": "1",
                "DURATION": 0
              },
              "LENGTH": 0.01844,
              "PRIMARY_OFFSET": 0.08091
            }
          ]
        },
        "LOCATION": {
          "DEFINED": {
            "ORIGIN": {
              "ROADWAY": {
                "DESCRIPTION": [
                  {
                    "value": "Pyhrn Autobahn",
                    "TYPE": "NTCSA"
                  },
                  {
                    "value": "Pyhrn Autobahn",
                    "TYPE": "RDSGN"
                  },
                  {
                    "value": "Pyhrn Autobahn",
                    "TYPE": "LOCAL"
                  }
                ],
                "ID": 30562
              },
              "POINT": {
                "DESCRIPTION": [
                  {
                    "value": "Parkplatz Ardning",
                    "TYPE": "NTCSA"
                  },
                  {
                    "value": "Parkplatz Ardning",
                    "TYPE": "RDSGN"
                  },
                  {
                    "value": "Parkplatz Ardning",
                    "TYPE": "LOCAL"
                  },
                  {
                    "value": "Pyhrn Autobahn",
                    "TYPE": "BNAME"
                  }
                ],
                "ID": 35947
              },
              "DIRECTION": {
                "DESCRIPTION": [
                  {
                    "value": "ST. MICHAEL",
                    "TYPE": "LOCAL"
                  },
                  {
                    "value": "ST. MICHAEL",
                    "TYPE": "NTCSA"
                  },
                  {
                    "value": "ST. MICHAEL",
                    "TYPE": "RDSGN"
                  }
                ],
                "ID": 0
              },
              "PROXIMITY": {
                "ID": "AT",
                "DESCRIPTION": "at"
              }
            },
            "TO": {
              "ROADWAY": {
                "DESCRIPTION": [
                  {
                    "value": "Pyhrn Autobahn",
                    "TYPE": "NTCSA"
                  },
                  {
                    "value": "Pyhrn Autobahn",
                    "TYPE": "RDSGN"
                  },
                  {
                    "value": "Pyhrn Autobahn",
                    "TYPE": "LOCAL"
                  }
                ],
                "ID": 30562
              },
              "POINT": {
                "DESCRIPTION": [
                  {
                    "value": "Mautstelle Bosruck",
                    "TYPE": "NTCSA"
                  },
                  {
                    "value": "Mautstelle Bosruck",
                    "TYPE": "RDSGN"
                  },
                  {
                    "value": "Mautstelle Bosruck",
                    "TYPE": "LOCAL"
                  },
                  {
                    "value": "Pyhrn Autobahn",
                    "TYPE": "BNAME"
                  }
                ],
                "ID": 35947
              },
              "DIRECTION": {
                "DESCRIPTION": [
                  {
                    "value": "ST. MICHAEL",
                    "TYPE": "LOCAL"
                  },
                  {
                    "value": "ST. MICHAEL",
                    "TYPE": "NTCSA"
                  },
                  {
                    "value": "ST. MICHAEL",
                    "TYPE": "RDSGN"
                  }
                ],
                "ID": 0
              },
              "PROXIMITY": {
                "ID": "AT",
                "DESCRIPTION": "at"
              }
            }
          },
          "GEOLOC": {
            "ORIGIN": {
              "LATITUDE": 47.57835,
              "LONGITUDE": 14.31905
            },
            "TO": [
              {
                "LATITUDE": 47.57815,
                "LONGITUDE": 14.31879
              }
            ]
          },
          "NAVTECH": {
            "EDGE": {
              "EDGE_ID": [
                "1210438378"
              ]
            },
            "VERSION_ID": "202102"
          },
          "LENGTH": 0.01844
        },
        "TRAFFIC_ITEM_DETAIL": {
          "ROAD_CLOSED": false,
          "INCIDENT": {
            "RESPONSE_VEHICLES": false,
            "CONGESTION_INCIDENT": {
              "CONGESTION_TYPE_DESC": "CONGESTION",
              "CONGESTION_FACTOR": 50
            }
          },
          "ALERTC": [
            {
              "EVENT_CODE": 138
            }
          ]
        },
        "TRAFFIC_ITEM_DESCRIPTION": [
          {
            "value": "Bei Mautstelle Bosruck - Stockender Verkehr;; vorsichtig an das Stauende heranfahren.",
            "TYPE": "short_desc"
          },
          {
            "value": "Bei Mautstelle Bosruck - Stockender Verkehr;; vorsichtig an das Stauende heranfahren.",
            "TYPE": "desc"
          },
          {
            "value": "Stockender Verkehr;; vorsichtig an das Stauende heranfahren.",
            "TYPE": "no_exit_description"
          }
        ],
        "mid": "71804124-7ef2-4a83-8a65-3b393dc18bce|1629588559604",
        "PRODUCT": "basic"
      },
      {
        "TRAFFIC_ITEM_ID": 3807940529216825082,
        "ORIGINAL_TRAFFIC_ITEM_ID": 102272967937992850,
        "TRAFFIC_ITEM_STATUS_SHORT_DESC": "ACTIVE",
        "TRAFFIC_ITEM_TYPE_DESC": "CONGESTION",
        "START_TIME": "08/21/2021 23:22:51",
        "END_TIME": "08/21/2021 23:38:21",
        "ENTRY_TIME": "08/21/2021 23:28:24",
        "CRITICALITY": {
          "ID": "2",
          "DESCRIPTION": "minor"
        },
        "VERIFIED": true,
        "ABBREVIATION": {
          "SHORT_DESC": "SLOW",
          "DESCRIPTION": "slow"
        },
        "RDS-TMC_LOCATIONS": {
          "RDS-TMC": [
            {
              "ORIGIN": {
                "EBU_COUNTRY_CODE": "F",
                "TABLE_ID": 32,
                "LOCATION_ID": "51186",
                "LOCATION_DESC": "P\u00e9age de Fontaine",
                "RDS_DIRECTION": "+"
              },
              "DIRECTION": "-",
              "ALERTC": {
                "TRAFFIC_CODE": 138,
                "QUANTIFIERS": 4,
                "DESCRIPTION": "Trafic en accord\u00e9on. Avancez prudemment.",
                "ALERTC_DURATION": "D",
                "ALERTC_DIRECTION": 1,
                "URGENCY": "U",
                "UPDATE_CLASS": 1,
                "PHRASE_CODE": "A2.Z112",
                "EXTENT": "1",
                "DURATION": 0
              },
              "LENGTH": 0.08181,
              "PRIMARY_OFFSET": 0.03407
            }
          ]
        },
        "LOCATION": {
          "DEFINED": {
            "ORIGIN": {
              "ROADWAY": {
                "DESCRIPTION": [
                  {
                    "value": "La Comtoise",
                    "TYPE": "NTCSA"
                  },
                  {
                    "value": "La Comtoise",
                    "TYPE": "RDSGN"
                  },
                  {
                    "value": "La Comtoise",
                    "TYPE": "LOCAL"
                  }
                ],
                "ID": 5027
              },
              "POINT": {
                "DESCRIPTION": [
                  {
                    "value": "Aire d'Angeot",
                    "TYPE": "NTCSA"
                  },
                  {
                    "value": "Aire d'Angeot",
                    "TYPE": "RDSGN"
                  },
                  {
                    "value": "Aire d'Angeot",
                    "TYPE": "LOCAL"
                  },
                  {
                    "value": "La Comtoise",
                    "TYPE": "BNAME"
                  }
                ],
                "ID": 51186
              },
              "DIRECTION": {
                "DESCRIPTION": [
                  {
                    "value": "MONB\u00c9LIARD",
                    "TYPE": "LOCAL"
                  },
                  {
                    "value": "MONB\u00c9LIARD",
                    "TYPE": "NTCSA"
                  },
                  {
                    "value": "MONB\u00c9LIARD",
                    "TYPE": "RDSGN"
                  }
                ],
                "ID": 0
              },
              "PROXIMITY": {
                "ID": "AT",
                "DESCRIPTION": "at"
              }
            },
            "TO": {
              "ROADWAY": {
                "DESCRIPTION": [
                  {
                    "value": "La Comtoise",
                    "TYPE": "NTCSA"
                  },
                  {
                    "value": "La Comtoise",
                    "TYPE": "RDSGN"
                  },
                  {
                    "value": "La Comtoise",
                    "TYPE": "LOCAL"
                  }
                ],
                "ID": 5027
              },
              "POINT": {
                "DESCRIPTION": [
                  {
                    "value": "P\u00e9age de Fontaine",
                    "TYPE": "NTCSA"
                  },
                  {
                    "value": "P\u00e9age de Fontaine",
                    "TYPE": "RDSGN"
                  },
                  {
                    "value": "P\u00e9age de Fontaine",
                    "TYPE": "LOCAL"
                  },
                  {
                    "value": "La Comtoise",
                    "TYPE": "BNAME"
                  }
                ],
                "ID": 51186
              },
              "DIRECTION": {
                "DESCRIPTION": [
                  {
                    "value": "MONB\u00c9LIARD",
                    "TYPE": "LOCAL"
                  },
                  {
                    "value": "MONB\u00c9LIARD",
                    "TYPE": "NTCSA"
                  },
                  {
                    "value": "MONB\u00c9LIARD",
                    "TYPE": "RDSGN"
                  }
                ],
                "ID": 0
              },
              "PROXIMITY": {
                "ID": "AT",
                "DESCRIPTION": "at"
              }
            }
          },
          "GEOLOC": {
            "ORIGIN": {
              "LATITUDE": 47.67659,
              "LONGITUDE": 6.9836
            },
            "TO": [
              {
                "LATITUDE": 47.67616,
                "LONGITUDE": 6.98206
              }
            ]
          },
          "NAVTECH": {
            "EDGE": {
              "EDGE_ID": [
                "1088234151"
              ]
            },
            "VERSION_ID": "202102"
          },
          "LENGTH": 0.08181
        },
        "TRAFFIC_ITEM_DETAIL": {
          "ROAD_CLOSED": false,
          "INCIDENT": {
            "RESPONSE_VEHICLES": false,
            "CONGESTION_INCIDENT": {
              "CONGESTION_TYPE_DESC": "CONGESTION",
              "CONGESTION_FACTOR": 50
            }
          },
          "ALERTC": [
            {
              "EVENT_CODE": 138
            }
          ]
        },
        "TRAFFIC_ITEM_DESCRIPTION": [
          {
            "value": "\u00c0 P\u00e9age de Fontaine - Trafic en accord\u00e9on. Avancez prudemment.",
            "TYPE": "short_desc"
          },
          {
            "value": "\u00c0 P\u00e9age de Fontaine - Trafic en accord\u00e9on. Avancez prudemment.",
            "TYPE": "desc"
          },
          {
            "value": "Trafic en accord\u00e9on. Avancez prudemment.",
            "TYPE": "no_exit_description"
          }
        ],
        "mid": "076058ee-272f-4eb9-8020-86af61d8eb01|1629588504604",
        "PRODUCT": "basic"
      },
      {
        "TRAFFIC_ITEM_ID": 3069606992266578657,
        "ORIGINAL_TRAFFIC_ITEM_ID": 3651427063589161408,
        "TRAFFIC_ITEM_STATUS_SHORT_DESC": "ACTIVE",
        "TRAFFIC_ITEM_TYPE_DESC": "CONGESTION",
        "START_TIME": "08/21/2021 23:26:48",
        "END_TIME": "08/21/2021 23:39:17",
        "ENTRY_TIME": "08/21/2021 23:29:19",
        "CRITICALITY": {
          "ID": "2",
          "DESCRIPTION": "minor"
        },
        "VERIFIED": true,
        "ABBREVIATION": {
          "SHORT_DESC": "SLOW",
          "DESCRIPTION": "slow"
        },
        "RDS-TMC_LOCATIONS": {
          "RDS-TMC": [
            {
              "ORIGIN": {
                "EBU_COUNTRY_CODE": "A",
                "TABLE_ID": 1,
                "LOCATION_ID": "35958",
                "LOCATION_DESC": "Mautstelle Sch\u00f6nberg",
                "RDS_DIRECTION": "+"
              },
              "DIRECTION": "-",
              "ALERTC": {
                "TRAFFIC_CODE": 138,
                "QUANTIFIERS": 4,
                "DESCRIPTION": "Stockender Verkehr;; vorsichtig an das Stauende heranfahren.",
                "ALERTC_DURATION": "D",
                "ALERTC_DIRECTION": 1,
                "URGENCY": "U",
                "UPDATE_CLASS": 1,
                "PHRASE_CODE": "A2.Z112",
                "EXTENT": "1",
                "DURATION": 0
              },
              "LENGTH": 0.02271,
              "PRIMARY_OFFSET": 0.02349
            }
          ]
        },
        "LOCATION": {
          "DEFINED": {
            "ORIGIN": {
              "ROADWAY": {
                "DESCRIPTION": [
                  {
                    "value": "Brenner Autobahn",
                    "TYPE": "NTCSA"
                  },
                  {
                    "value": "Brenner Autobahn",
                    "TYPE": "RDSGN"
                  },
                  {
                    "value": "Brenner Autobahn",
                    "TYPE": "LOCAL"
                  }
                ],
                "ID": 30575
              },
              "POINT": {
                "DESCRIPTION": [
                  {
                    "value": "Parkplatz Gschleirs",
                    "TYPE": "NTCSA"
                  },
                  {
                    "value": "Parkplatz Gschleirs",
                    "TYPE": "RDSGN"
                  },
                  {
                    "value": "Parkplatz Gschleirs",
                    "TYPE": "LOCAL"
                  },
                  {
                    "value": "Brenner Autobahn",
                    "TYPE": "BNAME"
                  }
                ],
                "ID": 35958
              },
              "DIRECTION": {
                "DESCRIPTION": [
                  {
                    "value": "INNSBRUCK",
                    "TYPE": "LOCAL"
                  },
                  {
                    "value": "INNSBRUCK",
                    "TYPE": "NTCSA"
                  },
                  {
                    "value": "INNSBRUCK",
                    "TYPE": "RDSGN"
                  }
                ],
                "ID": 0
              },
              "PROXIMITY": {
                "ID": "AT",
                "DESCRIPTION": "at"
              }
            },
            "TO": {
              "ROADWAY": {
                "DESCRIPTION": [
                  {
                    "value": "Brenner Autobahn",
                    "TYPE": "NTCSA"
                  },
                  {
                    "value": "Brenner Autobahn",
                    "TYPE": "RDSGN"
                  },
                  {
                    "value": "Brenner Autobahn",
                    "TYPE": "LOCAL"
                  }
                ],
                "ID": 30575
              },
              "POINT": {
                "DESCRIPTION": [
                  {
                    "value": "Mautstelle Sch\u00f6nberg",
                    "TYPE": "NTCSA"
                  },
                  {
                    "value": "Mautstelle Sch\u00f6nberg",
                    "TYPE": "RDSGN"
                  },
                  {
                    "value": "Mautstelle Sch\u00f6nberg",
                    "TYPE": "LOCAL"
                  },
                  {
                    "value": "Brenner Autobahn",
                    "TYPE": "BNAME"
                  }
                ],
                "ID": 35958
              },
              "DIRECTION": {
                "DESCRIPTION": [
                  {
                    "value": "INNSBRUCK",
                    "TYPE": "LOCAL"
                  },
                  {
                    "value": "INNSBRUCK",
                    "TYPE": "NTCSA"
                  },
                  {
                    "value": "INNSBRUCK",
                    "TYPE": "RDSGN"
                  }
                ],
                "ID": 0
              },
              "PROXIMITY": {
                "ID": "AT",
                "DESCRIPTION": "at"
              }
            }
          },
          "GEOLOC": {
            "ORIGIN": {
              "LATITUDE": 47.18414,
              "LONGITUDE": 11.40569
            },
            "TO": [
              {
                "LATITUDE": 47.18416,
                "LONGITUDE": 11.40521
              }
            ]
          },
          "NAVTECH": {
            "EDGE": {
              "EDGE_ID": [
                "1210479439"
              ]
            },
            "VERSION_ID": "202102"
          },
          "LENGTH": 0.02271
        },
        "TRAFFIC_ITEM_DETAIL": {
          "ROAD_CLOSED": false,
          "INCIDENT": {
            "RESPONSE_VEHICLES": false,
            "CONGESTION_INCIDENT": {
              "CONGESTION_TYPE_DESC": "CONGESTION",
              "CONGESTION_FACTOR": 50
            }
          },
          "ALERTC": [
            {
              "EVENT_CODE": 138
            }
          ]
        },
        "TRAFFIC_ITEM_DESCRIPTION": [
          {
            "value": "Bei Mautstelle Sch\u00f6nberg - Stockender Verkehr;; vorsichtig an das Stauende heranfahren.",
            "TYPE": "short_desc"
          },
          {
            "value": "Bei Mautstelle Sch\u00f6nberg - Stockender Verkehr;; vorsichtig an das Stauende heranfahren.",
            "TYPE": "desc"
          },
          {
            "value": "Stockender Verkehr;; vorsichtig an das Stauende heranfahren.",
            "TYPE": "no_exit_description"
          }
        ],
        "mid": "4b24e8d8-bd72-421b-b516-9b3fea8f75c4|1629588559604",
        "PRODUCT": "basic"
      },
      {
        "TRAFFIC_ITEM_ID": 1774811533947886939,
        "ORIGINAL_TRAFFIC_ITEM_ID": 3620152884930353178,
        "TRAFFIC_ITEM_STATUS_SHORT_DESC": "ACTIVE",
        "TRAFFIC_ITEM_TYPE_DESC": "CONGESTION",
        "START_TIME": "08/21/2021 23:22:58",
        "END_TIME": "08/21/2021 23:39:17",
        "ENTRY_TIME": "08/21/2021 23:29:19",
        "CRITICALITY": {
          "ID": "2",
          "DESCRIPTION": "minor"
        },
        "VERIFIED": true,
        "ABBREVIATION": {
          "SHORT_DESC": "SLOW",
          "DESCRIPTION": "slow"
        },
        "RDS-TMC_LOCATIONS": {
          "RDS-TMC": [
            {
              "ORIGIN": {
                "EBU_COUNTRY_CODE": "A",
                "TABLE_ID": 1,
                "LOCATION_ID": "31280",
                "LOCATION_DESC": "St. Michael im Lungau",
                "RDS_DIRECTION": "-"
              },
              "DIRECTION": "+",
              "ALERTC": {
                "TRAFFIC_CODE": 138,
                "QUANTIFIERS": 4,
                "DESCRIPTION": "Stockender Verkehr;; vorsichtig an das Stauende heranfahren.",
                "ALERTC_DURATION": "D",
                "ALERTC_DIRECTION": 1,
                "URGENCY": "U",
                "UPDATE_CLASS": 1,
                "PHRASE_CODE": "A2.Z112",
                "EXTENT": "1",
                "DURATION": 0
              },
              "LENGTH": 0.03811,
              "PRIMARY_OFFSET": 0.21471
            }
          ]
        },
        "LOCATION": {
          "DEFINED": {
            "ORIGIN": {
              "ROADWAY": {
                "DESCRIPTION": [
                  {
                    "value": "Tauern Autobahn",
                    "TYPE": "NTCSA"
                  },
                  {
                    "value": "Tauern Autobahn",
                    "TYPE": "RDSGN"
                  },
                  {
                    "value": "Tauern Autobahn",
                    "TYPE": "LOCAL"
                  }
                ],
                "ID": 30566
              },
              "POINT": {
                "DESCRIPTION": [
                  {
                    "value": "Parkplatz Lansch\u00fctz",
                    "TYPE": "NTCSA"
                  },
                  {
                    "value": "Parkplatz Lansch\u00fctz",
                    "TYPE": "RDSGN"
                  },
                  {
                    "value": "Parkplatz Lansch\u00fctz",
                    "TYPE": "LOCAL"
                  },
                  {
                    "value": "Tauern Autobahn",
                    "TYPE": "BNAME"
                  }
                ],
                "ID": 31280
              },
              "DIRECTION": {
                "DESCRIPTION": [
                  {
                    "value": "VILLACH",
                    "TYPE": "LOCAL"
                  },
                  {
                    "value": "VILLACH",
                    "TYPE": "NTCSA"
                  },
                  {
                    "value": "VILLACH",
                    "TYPE": "RDSGN"
                  }
                ],
                "ID": 0
              },
              "PROXIMITY": {
                "ID": "AT",
                "DESCRIPTION": "at"
              }
            },
            "TO": {
              "ROADWAY": {
                "DESCRIPTION": [
                  {
                    "value": "Tauern Autobahn",
                    "TYPE": "NTCSA"
                  },
                  {
                    "value": "Tauern Autobahn",
                    "TYPE": "RDSGN"
                  },
                  {
                    "value": "Tauern Autobahn",
                    "TYPE": "LOCAL"
                  }
                ],
                "ID": 30566
              },
              "POINT": {
                "DESCRIPTION": [
                  {
                    "value": "St. Michael im Lungau",
                    "TYPE": "NTCSA"
                  },
                  {
                    "value": "St. Michael im Lungau",
                    "TYPE": "RDSGN"
                  },
                  {
                    "value": "St. Michael im Lungau",
                    "TYPE": "LOCAL"
                  },
                  {
                    "value": "Tauern Autobahn",
                    "TYPE": "BNAME"
                  }
                ],
                "ID": 31280
              },
              "DIRECTION": {
                "DESCRIPTION": [
                  {
                    "value": "VILLACH",
                    "TYPE": "LOCAL"
                  },
                  {
                    "value": "VILLACH",
                    "TYPE": "NTCSA"
                  },
                  {
                    "value": "VILLACH",
                    "TYPE": "RDSGN"
                  }
                ],
                "ID": 0
              },
              "PROXIMITY": {
                "ID": "AT",
                "DESCRIPTION": "at"
              }
            }
          },
          "GEOLOC": {
            "ORIGIN": {
              "LATITUDE": 47.09552,
              "LONGITUDE": 13.60825
            },
            "TO": [
              {
                "LATITUDE": 47.09505,
                "LONGITUDE": 13.60857
              }
            ]
          },
          "NAVTECH": {
            "EDGE": {
              "EDGE_ID": [
                "1210473321"
              ]
            },
            "VERSION_ID": "202102"
          },
          "LENGTH": 0.03811
        },
        "TRAFFIC_ITEM_DETAIL": {
          "ROAD_CLOSED": false,
          "INCIDENT": {
            "RESPONSE_VEHICLES": false,
            "CONGESTION_INCIDENT": {
              "CONGESTION_TYPE_DESC": "CONGESTION",
              "CONGESTION_FACTOR": 50
            }
          },
          "ALERTC": [
            {
              "EVENT_CODE": 138
            }
          ]
        },
        "TRAFFIC_ITEM_DESCRIPTION": [
          {
            "value": "Bei St. Michael im Lungau - Stockender Verkehr;; vorsichtig an das Stauende heranfahren.",
            "TYPE": "short_desc"
          },
          {
            "value": "Bei St. Michael im Lungau - Stockender Verkehr;; vorsichtig an das Stauende heranfahren.",
            "TYPE": "desc"
          },
          {
            "value": "Stockender Verkehr;; vorsichtig an das Stauende heranfahren.",
            "TYPE": "no_exit_description"
          }
        ],
        "mid": "d74fd599-252d-41c4-a17f-67a05beb8193|1629588559604",
        "PRODUCT": "basic"
      },
      {
        "TRAFFIC_ITEM_ID": 2002851094800433786,
        "ORIGINAL_TRAFFIC_ITEM_ID": 3464398067539916173,
        "TRAFFIC_ITEM_STATUS_SHORT_DESC": "ACTIVE",
        "TRAFFIC_ITEM_TYPE_DESC": "CONGESTION",
        "START_TIME": "08/21/2021 23:23:48",
        "END_TIME": "08/21/2021 23:37:33",
        "ENTRY_TIME": "08/21/2021 23:27:34",
        "CRITICALITY": {
          "ID": "2",
          "DESCRIPTION": "minor"
        },
        "VERIFIED": true,
        "ABBREVIATION": {
          "SHORT_DESC": "SLOW",
          "DESCRIPTION": "slow"
        },
        "RDS-TMC_LOCATIONS": {
          "RDS-TMC": [
            {
              "ORIGIN": {
                "EBU_COUNTRY_CODE": "4",
                "TABLE_ID": 9,
                "LOCATION_ID": "10003",
                "LOCATION_DESC": "Verzweigung Limmattal",
                "RDS_DIRECTION": "+"
              },
              "DIRECTION": "-",
              "ALERTC": {
                "TRAFFIC_CODE": 138,
                "ALERTC_Q_BINARY": "1",
                "QUANTIFIERS": 4,
                "DESCRIPTION": "Stockender Verkehr; Durchschnittsgeschwindigkeit von bis zu 5 km/h; vorsichtig an das Stauende heranfahren.",
                "ALERTC_DURATION": "D",
                "ALERTC_DIRECTION": 1,
                "URGENCY": "U",
                "UPDATE_CLASS": 1,
                "PHRASE_CODE": "A2.Z112",
                "EXTENT": "1",
                "DURATION": 0
              },
              "LENGTH": 0.06149,
              "PRIMARY_OFFSET": 0.08303
            }
          ]
        },
        "LOCATION": {
          "DEFINED": {
            "ORIGIN": {
              "ROADWAY": {
                "DESCRIPTION": [
                  {
                    "value": "A1 H",
                    "TYPE": "NTCSA"
                  },
                  {
                    "value": "A1 H",
                    "TYPE": "RDSGN"
                  },
                  {
                    "value": "A1 H",
                    "TYPE": "LOCAL"
                  }
                ],
                "ID": 1042
              },
              "POINT": {
                "DESCRIPTION": [
                  {
                    "value": "Oberengstringen",
                    "TYPE": "NTCSA"
                  },
                  {
                    "value": "Oberengstringen",
                    "TYPE": "RDSGN"
                  },
                  {
                    "value": "Oberengstringen",
                    "TYPE": "LOCAL"
                  },
                  {
                    "value": "A1 H",
                    "TYPE": "BNAME"
                  }
                ],
                "ID": 10003
              },
              "DIRECTION": {
                "DESCRIPTION": [
                  {
                    "value": "VERZWEIGUNG LIMMATTAL",
                    "TYPE": "LOCAL"
                  },
                  {
                    "value": "VERZWEIGUNG LIMMATTAL",
                    "TYPE": "NTCSA"
                  },
                  {
                    "value": "VERZWEIGUNG LIMMATTAL",
                    "TYPE": "RDSGN"
                  }
                ],
                "ID": 0
              },
              "PROXIMITY": {
                "ID": "AT",
                "DESCRIPTION": "at"
              }
            },
            "TO": {
              "ROADWAY": {
                "DESCRIPTION": [
                  {
                    "value": "A1 H",
                    "TYPE": "NTCSA"
                  },
                  {
                    "value": "A1 H",
                    "TYPE": "RDSGN"
                  },
                  {
                    "value": "A1 H",
                    "TYPE": "LOCAL"
                  }
                ],
                "ID": 1042
              },
              "POINT": {
                "DESCRIPTION": [
                  {
                    "value": "Verzweigung Limmattal",
                    "TYPE": "NTCSA"
                  },
                  {
                    "value": "Verzweigung Limmattal",
                    "TYPE": "RDSGN"
                  },
                  {
                    "value": "Verzweigung Limmattal",
                    "TYPE": "LOCAL"
                  },
                  {
                    "value": "A1 H",
                    "TYPE": "BNAME"
                  }
                ],
                "ID": 10003
              },
              "DIRECTION": {
                "DESCRIPTION": [
                  {
                    "value": "VERZWEIGUNG LIMMATTAL",
                    "TYPE": "LOCAL"
                  },
                  {
                    "value": "VERZWEIGUNG LIMMATTAL",
                    "TYPE": "NTCSA"
                  },
                  {
                    "value": "VERZWEIGUNG LIMMATTAL",
                    "TYPE": "RDSGN"
                  }
                ],
                "ID": 0
              },
              "PROXIMITY": {
                "ID": "AT",
                "DESCRIPTION": "at"
              }
            }
          },
          "GEOLOC": {
            "ORIGIN": {
              "LATITUDE": 47.4121,
              "LONGITUDE": 8.42746
            },
            "TO": [
              {
                "LATITUDE": 47.41253,
                "LONGITUDE": 8.42635
              }
            ]
          },
          "NAVTECH": {
            "EDGE": {
              "EDGE_ID": [
                "1246008213"
              ]
            },
            "VERSION_ID": "202102"
          },
          "LENGTH": 0.06149
        },
        "TRAFFIC_ITEM_DETAIL": {
          "ROAD_CLOSED": false,
          "INCIDENT": {
            "RESPONSE_VEHICLES": false,
            "CONGESTION_INCIDENT": {
              "CONGESTION_TYPE_DESC": "CONGESTION",
              "CONGESTION_FACTOR": 50
            }
          },
          "ALERTC": [
            {
              "EVENT_CODE": 138,
              "ALERTC_Q": 1
            }
          ]
        },
        "TRAFFIC_ITEM_DESCRIPTION": [
          {
            "value": "Bei Verzweigung Limmattal - Stockender Verkehr; Durchschnittsgeschwindigkeit von bis zu 5 km/h; vorsichtig an das Stauende heranfahren.",
            "TYPE": "short_desc"
          },
          {
            "value": "Bei Verzweigung Limmattal - Stockender Verkehr; Durchschnittsgeschwindigkeit von bis zu 5 km/h; vorsichtig an das Stauende heranfahren.",
            "TYPE": "desc"
          },
          {
            "value": "Stockender Verkehr; Durchschnittsgeschwindigkeit von bis zu 5 km/h; vorsichtig an das Stauende heranfahren.",
            "TYPE": "no_exit_description"
          }
        ],
        "mid": "c255fbfc-d491-4097-a2e0-f6269959b865|1629588454604",
        "PRODUCT": "basic"
      },
      {
        "TRAFFIC_ITEM_ID": 3584796948856306290,
        "ORIGINAL_TRAFFIC_ITEM_ID": 4134763743948478865,
        "TRAFFIC_ITEM_STATUS_SHORT_DESC": "ACTIVE",
        "TRAFFIC_ITEM_TYPE_DESC": "CONGESTION",
        "START_TIME": "08/21/2021 23:22:02",
        "END_TIME": "08/21/2021 23:38:47",
        "ENTRY_TIME": "08/21/2021 23:28:49",
        "CRITICALITY": {
          "ID": "2",
          "DESCRIPTION": "minor"
        },
        "VERIFIED": true,
        "ABBREVIATION": {
          "SHORT_DESC": "SLOW",
          "DESCRIPTION": "slow"
        },
        "RDS-TMC_LOCATIONS": {
          "RDS-TMC": [
            {
              "ORIGIN": {
                "EBU_COUNTRY_CODE": "3",
                "TABLE_ID": 5,
                "LOCATION_ID": "13415",
                "LOCATION_DESC": "PPO Tarnawa",
                "RDS_DIRECTION": "+"
              },
              "DIRECTION": "-",
              "ALERTC": {
                "TRAFFIC_CODE": 138,
                "QUANTIFIERS": 4,
                "DESCRIPTION": "Zag\u0119szczaj\u0105cy si\u0119 ruch. Doje\u017cd\u017ca\u0107 ostro\u017cnie.",
                "ALERTC_DURATION": "D",
                "ALERTC_DIRECTION": 1,
                "URGENCY": "U",
                "UPDATE_CLASS": 1,
                "PHRASE_CODE": "A2.Z112",
                "EXTENT": "1",
                "DURATION": 0
              },
              "LENGTH": 0.04985,
              "PRIMARY_OFFSET": 0.09016
            }
          ]
        },
        "LOCATION": {
          "DEFINED": {
            "ORIGIN": {
              "ROADWAY": {
                "DESCRIPTION": [
                  {
                    "value": "A2",
                    "TYPE": "NTCSA"
                  },
                  {
                    "value": "A2",
                    "TYPE": "RDSGN"
                  },
                  {
                    "value": "A2",
                    "TYPE": "LOCAL"
                  }
                ],
                "ID": 25044
              },
              "POINT": {
                "DESCRIPTION": [
                  {
                    "value": "W\u0119ze\u0142 Torzym",
                    "TYPE": "NTCSA"
                  },
                  {
                    "value": "W\u0119ze\u0142 Torzym",
                    "TYPE": "RDSGN"
                  },
                  {
                    "value": "W\u0119ze\u0142 Torzym",
                    "TYPE": "LOCAL"
                  },
                  {
                    "value": "A2",
                    "TYPE": "BNAME"
                  }
                ],
                "ID": 13415
              },
              "DIRECTION": {
                "DESCRIPTION": [
                  {
                    "value": "\u015aWIECKO",
                    "TYPE": "LOCAL"
                  },
                  {
                    "value": "\u015aWIECKO",
                    "TYPE": "NTCSA"
                  },
                  {
                    "value": "\u015aWIECKO",
                    "TYPE": "RDSGN"
                  }
                ],
                "ID": 0
              },
              "PROXIMITY": {
                "ID": "AT",
                "DESCRIPTION": "at"
              }
            },
            "TO": {
              "ROADWAY": {
                "DESCRIPTION": [
                  {
                    "value": "A2",
                    "TYPE": "NTCSA"
                  },
                  {
                    "value": "A2",
                    "TYPE": "RDSGN"
                  },
                  {
                    "value": "A2",
                    "TYPE": "LOCAL"
                  }
                ],
                "ID": 25044
              },
              "POINT": {
                "DESCRIPTION": [
                  {
                    "value": "PPO Tarnawa",
                    "TYPE": "NTCSA"
                  },
                  {
                    "value": "PPO Tarnawa",
                    "TYPE": "RDSGN"
                  },
                  {
                    "value": "PPO Tarnawa",
                    "TYPE": "LOCAL"
                  },
                  {
                    "value": "A2",
                    "TYPE": "BNAME"
                  }
                ],
                "ID": 13415
              },
              "DIRECTION": {
                "DESCRIPTION": [
                  {
                    "value": "\u015aWIECKO",
                    "TYPE": "LOCAL"
                  },
                  {
                    "value": "\u015aWIECKO",
                    "TYPE": "NTCSA"
                  },
                  {
                    "value": "\u015aWIECKO",
                    "TYPE": "RDSGN"
                  }
                ],
                "ID": 0
              },
              "PROXIMITY": {
                "ID": "AT",
                "DESCRIPTION": "at"
              }
            }
          },
          "GEOLOC": {
            "ORIGIN": {
              "LATITUDE": 52.33488,
              "LONGITUDE": 14.90533
            },
            "TO": [
              {
                "LATITUDE": 52.33498,
                "LONGITUDE": 14.90447
              }
            ]
          },
          "NAVTECH": {
            "EDGE": {
              "EDGE_ID": [
                "914062654"
              ]
            },
            "VERSION_ID": "202102"
          },
          "LENGTH": 0.04985
        },
        "TRAFFIC_ITEM_DETAIL": {
          "ROAD_CLOSED": false,
          "INCIDENT": {
            "RESPONSE_VEHICLES": false,
            "CONGESTION_INCIDENT": {
              "CONGESTION_TYPE_DESC": "CONGESTION",
              "CONGESTION_FACTOR": 50
            }
          },
          "ALERTC": [
            {
              "EVENT_CODE": 138
            }
          ]
        },
        "TRAFFIC_ITEM_DESCRIPTION": [
          {
            "value": "Przy PPO Tarnawa - Zag\u0119szczaj\u0105cy si\u0119 ruch. Doje\u017cd\u017ca\u0107 ostro\u017cnie.",
            "TYPE": "short_desc"
          },
          {
            "value": "Przy PPO Tarnawa - Zag\u0119szczaj\u0105cy si\u0119 ruch. Doje\u017cd\u017ca\u0107 ostro\u017cnie.",
            "TYPE": "desc"
          },
          {
            "value": "Zag\u0119szczaj\u0105cy si\u0119 ruch. Doje\u017cd\u017ca\u0107 ostro\u017cnie.",
            "TYPE": "no_exit_description"
          }
        ],
        "mid": "a2356a8a-ebd3-439f-b717-0e8128a19d83|1629588529604",
        "PRODUCT": "basic"
      }
    ]
  },
  "diagnostic": {
    "info": "",
    "sfile": "Incident-E1409-1629588465916.xml.gz|pr1",
    "pdd": "trafficml-incident-24-v13"
  },
  "TIMESTAMP2": "2021-08-21T23:27:46.000+0000",
  "EXTENDED_COUNTRY_CODE": "E1"
}