{
  "TIMESTAMP": "08/24/2021 23:27:44 GMT",
  "VERSION": 2.3,
  "TRAFFIC_ITEMS": {
    "TRAFFIC_ITEM": [
      {
        "TRAFFIC_ITEM_ID": 697821736446541827,
        "ORIGINAL_TRAFFIC_ITEM_ID": 285893739773067151,
        "TRAFFIC_ITEM_STATUS_SHORT_DESC": "ACTIVE",
        "TRAFFIC_ITEM_TYPE_DESC": "CONGESTION",
        "START_TIME": "08/24/2021 23:21:49",
        "END_TIME": "08/24/2021 23:37:34",
        "ENTRY_TIME": "08/24/2021 23:27:37",
        "CRITICALITY": {
          "ID": "2",
          "DESCRIPTION": "minor"
        },
        "VERIFIED": true,
        "ABBREVIATION": {
          "SHORT_DESC": "SLOW",
          "DESCRIPTION": "slow"
        },
        "RDS-TMC_LOCATIONS": {
          "RDS-TMC": [
            {
              "ORIGIN": {
                "EBU_COUNTRY_CODE": "D",
                "TABLE_ID": 1,
                "LOCATION_ID": "10831",
                "LOCATION_DESC": "F\u00fcrth/Erlangen",
                "RDS_DIRECTION": "+"
              },
              "DIRECTION": "-",
              "ALERTC": {
                "TRAFFIC_CODE": 138,
                "ALERTC_Q_BINARY": "2",
                "QUANTIFIERS": 4,
                "DESCRIPTION": "Stockender Verkehr; Durchschnittsgeschwindigkeit von bis zu 10 km/h; vorsichtig an das Stauende heranfahren.",
                "ALERTC_DURATION": "D",
                "ALERTC_DIRECTION": 1,
                "URGENCY": "U",
                "UPDATE_CLASS": 1,
                "PHRASE_CODE": "A2.Z112",
                "EXTENT": "1",
                "DURATION": 0
              },
              "LENGTH": 0.07441,
              "PRIMARY_OFFSET": 1.08051
            }
          ]
        },
        "LOCATION": {
          "DEFINED": {
            "ORIGIN": {
              "ROADWAY": {
                "DESCRIPTION": [
                  {
                    "value": "A3",
                    "TYPE": "NTCSA"
                  },
                  {
                    "value": "A3",
                    "TYPE": "RDSGN"
                  },
                  {
                    "value": "A3",
                    "TYPE": "LOCAL"
                  }
                ],
                "ID": 50101
              },
              "POINT": {
                "DESCRIPTION": [
                  {
                    "value": "Erlangen-Frauenaurach",
                    "TYPE": "NTCSA"
                  },
                  {
                    "value": "Erlangen-Frauenaurach",
                    "TYPE": "RDSGN"
                  },
                  {
                    "value": "Erlangen-Frauenaurach",
                    "TYPE": "LOCAL"
                  },
                  {
                    "value": "A3",
                    "TYPE": "BNAME"
                  }
                ],
                "ID": 10831
              },
              "DIRECTION": {
                "DESCRIPTION": [
                  {
                    "value": "N\u00dcRNBERG",
                    "TYPE": "LOCAL"
                  },
                  {
                    "value": "N\u00dcRNBERG",
                    "TYPE": "NTCSA"
                  },
                  {
                    "value": "N\u00dcRNBERG",
                    "TYPE": "RDSGN"
                  }
                ],
                "ID": 0
              },
              "PROXIMITY": {
                "ID": "AT",
                "DESCRIPTION": "at"
              }
            },
            "TO": {
              "ROADWAY": {
                "DESCRIPTION": [
                  {
                    "value": "A3",
                    "TYPE": "NTCSA"
                  },
                  {
                    "value": "A3",
                    "TYPE": "RDSGN"
                  },
                  {
                    "value": "A3",
                    "TYPE": "LOCAL"
                  }
                ],
                "ID": 50101
              },
              "POINT": {
                "DESCRIPTION": [
                  {
                    "value": "F\u00fcrth/Erlangen",
                    "TYPE": "NTCSA"
                  },
                  {
                    "value": "F\u00fcrth/Erlangen",
                    "TYPE": "RDSGN"
                  },
                  {
                    "value": "F\u00fcrth/Erlangen",
                    "TYPE": "LOCAL"
                  },
                  {
                    "value": "A3",
                    "TYPE": "BNAME"
                  }
                ],
                "ID": 10831
              },
              "DIRECTION": {
                "DESCRIPTION": [
                  {
                    "value": "N\u00dcRNBERG",
                    "TYPE": "LOCAL"
                  },
                  {
                    "value": "N\u00dcRNBERG",
                    "TYPE": "NTCSA"
                  },
                  {
                    "value": "N\u00dcRNBERG",
                    "TYPE": "RDSGN"
                  }
                ],
                "ID": 0
              },
              "PROXIMITY": {
                "ID": "AT",
                "DESCRIPTION": "at"
              }
            }
          },
          "GEOLOC": {
            "ORIGIN": {
              "LATITUDE": 49.5602,
              "LONGITUDE": 10.97089
            },
            "TO": [
              {
                "LATITUDE": 49.56014,
                "LONGITUDE": 10.97243
              }
            ]
          },
          "NAVTECH": {
            "EDGE": {
              "EDGE_ID": [
                "1232239187"
              ]
            },
            "VERSION_ID": "202102"
          },
          "LENGTH": 0.07441
        },
        "TRAFFIC_ITEM_DETAIL": {
          "ROAD_CLOSED": false,
          "INCIDENT": {
            "RESPONSE_VEHICLES": false,
            "CONGESTION_INCIDENT": {
              "CONGESTION_TYPE_DESC": "CONGESTION",
              "CONGESTION_FACTOR": 50
            }
          },
          "ALERTC": [
            {
              "EVENT_CODE": 138,
              "ALERTC_Q": 2
            }
          ]
        },
        "TRAFFIC_ITEM_DESCRIPTION": [
          {
            "value": "Bei F\u00fcrth/Erlangen - Stockender Verkehr; Durchschnittsgeschwindigkeit von bis zu 10 km/h; vorsichtig an das Stauende heranfahren.",
            "TYPE": "short_desc"
          },
          {
            "value": "Bei F\u00fcrth/Erlangen - Stockender Verkehr; Durchschnittsgeschwindigkeit von bis zu 10 km/h; vorsichtig an das Stauende heranfahren.",
            "TYPE": "desc"
          },
          {
            "value": "Stockender Verkehr; Durchschnittsgeschwindigkeit von bis zu 10 km/h; vorsichtig an das Stauende heranfahren.",
            "TYPE": "no_exit_description"
          }
        ],
        "mid": "bc804541-4952-4ed9-9d68-8f79a9007718|1629847657379",
        "PRODUCT": "basic"
      }
    ]
  },
  "diagnostic": {
    "info": "",
    "sfile": "Incident-E2305-1629847664610.xml.gz|pr1",
    "pdd": "trafficml-incident-24-v13"
  },
  "TIMESTAMP2": "2021-08-24T23:27:44.000+0000",
  "EXTENDED_COUNTRY_CODE": "E2"
}