{
  "TIMESTAMP": "08/24/2021 03:17:46 GMT",
  "VERSION": 2.3,
  "TRAFFIC_ITEMS": {
    "TRAFFIC_ITEM": [
      {
        "TRAFFIC_ITEM_ID": 579813770041812518,
        "ORIGINAL_TRAFFIC_ITEM_ID": 4601718647742240894,
        "TRAFFIC_ITEM_STATUS_SHORT_DESC": "ACTIVE",
        "TRAFFIC_ITEM_TYPE_DESC": "CONGESTION",
        "START_TIME": "08/24/2021 03:16:57",
        "END_TIME": "08/24/2021 03:31:57",
        "ENTRY_TIME": "08/24/2021 03:17:57",
        "CRITICALITY": {
          "ID": "2",
          "DESCRIPTION": "minor"
        },
        "VERIFIED": true,
        "ABBREVIATION": {
          "SHORT_DESC": "SLOW",
          "DESCRIPTION": "slow"
        },
        "RDS-TMC_LOCATIONS": {
          "RDS-TMC": [
            {
              "ORIGIN": {
                "EBU_COUNTRY_CODE": "D",
                "TABLE_ID": 1,
                "LOCATION_ID": "12779",
                "LOCATION_DESC": "Bad Lobenstein",
                "RDS_DIRECTION": "-"
              },
              "DIRECTION": "+",
              "ALERTC": {
                "TRAFFIC_CODE": 136,
                "QUANTIFIERS": 4,
                "DESCRIPTION": "Verkehrsst\u00f6rung.",
                "ALERTC_DURATION": "D",
                "ALERTC_DIRECTION": 1,
                "UPDATE_CLASS": 1,
                "PHRASE_CODE": "A9",
                "EXTENT": "1",
                "DURATION": 0,
                "SUPP_TRAFFIC_CODE": [
                  {
                    "CODE": 141
                  }
                ]
              },
              "LENGTH": 0.37583,
              "PRIMARY_OFFSET": 0.43902
            }
          ]
        },
        "LOCATION": {
          "DEFINED": {
            "ORIGIN": {
              "ROADWAY": {
                "DESCRIPTION": [
                  {
                    "value": "A9",
                    "TYPE": "NTCSA"
                  },
                  {
                    "value": "A9",
                    "TYPE": "RDSGN"
                  },
                  {
                    "value": "A9",
                    "TYPE": "LOCAL"
                  }
                ],
                "ID": 50173
              },
              "POINT": {
                "DESCRIPTION": [
                  {
                    "value": "Hirschberg",
                    "TYPE": "NTCSA"
                  },
                  {
                    "value": "Hirschberg",
                    "TYPE": "RDSGN"
                  },
                  {
                    "value": "Hirschberg",
                    "TYPE": "LOCAL"
                  },
                  {
                    "value": "A9",
                    "TYPE": "BNAME"
                  }
                ],
                "ID": 12779
              },
              "DIRECTION": {
                "DESCRIPTION": [
                  {
                    "value": "HALLE/LEIPZIG",
                    "TYPE": "LOCAL"
                  },
                  {
                    "value": "HALLE/LEIPZIG",
                    "TYPE": "NTCSA"
                  },
                  {
                    "value": "HALLE/LEIPZIG",
                    "TYPE": "RDSGN"
                  }
                ],
                "ID": 0
              },
              "PROXIMITY": {
                "ID": "AT",
                "DESCRIPTION": "at"
              }
            },
            "TO": {
              "ROADWAY": {
                "DESCRIPTION": [
                  {
                    "value": "A9",
                    "TYPE": "NTCSA"
                  },
                  {
                    "value": "A9",
                    "TYPE": "RDSGN"
                  },
                  {
                    "value": "A9",
                    "TYPE": "LOCAL"
                  }
                ],
                "ID": 50173
              },
              "POINT": {
                "DESCRIPTION": [
                  {
                    "value": "Bad Lobenstein",
                    "TYPE": "NTCSA"
                  },
                  {
                    "value": "Bad Lobenstein",
                    "TYPE": "RDSGN"
                  },
                  {
                    "value": "Bad Lobenstein",
                    "TYPE": "LOCAL"
                  },
                  {
                    "value": "A9",
                    "TYPE": "BNAME"
                  }
                ],
                "ID": 12779
              },
              "DIRECTION": {
                "DESCRIPTION": [
                  {
                    "value": "HALLE/LEIPZIG",
                    "TYPE": "LOCAL"
                  },
                  {
                    "value": "HALLE/LEIPZIG",
                    "TYPE": "NTCSA"
                  },
                  {
                    "value": "HALLE/LEIPZIG",
                    "TYPE": "RDSGN"
                  }
                ],
                "ID": 0
              },
              "PROXIMITY": {
                "ID": "AT",
                "DESCRIPTION": "at"
              }
            }
          },
          "GEOLOC": {
            "ORIGIN": {
              "LATITUDE": 50.43435,
              "LONGITUDE": 11.80011
            },
            "TO": [
              {
                "LATITUDE": 50.43937,
                "LONGITUDE": 11.80331
              }
            ]
          },
          "NAVTECH": {
            "EDGE": {
              "EDGE_ID": [
                "1162465153",
                "918117624"
              ]
            },
            "VERSION_ID": "202102"
          },
          "LENGTH": 0.37583
        },
        "TRAFFIC_ITEM_DETAIL": {
          "ROAD_CLOSED": false,
          "INCIDENT": {
            "RESPONSE_VEHICLES": false,
            "CONGESTION_INCIDENT": {
              "CONGESTION_TYPE_DESC": "CONGESTION",
              "CONGESTION_FACTOR": 50
            }
          },
          "ALERTC": [
            {
              "EVENT_CODE": 136,
              "SUPP_TRAFFIC_CODE": [
                141
              ]
            }
          ]
        },
        "TRAFFIC_ITEM_DESCRIPTION": [
          {
            "value": "Bei Bad Lobenstein - Verkehrsst\u00f6rung. auf der rechten Seite.",
            "TYPE": "short_desc"
          },
          {
            "value": "Bei Bad Lobenstein - Verkehrsst\u00f6rung. auf der rechten Seite.",
            "TYPE": "desc"
          },
          {
            "value": "Verkehrsst\u00f6rung. auf der rechten Seite.",
            "TYPE": "no_exit_description"
          }
        ],
        "mid": "600986461629775017444|1629775077482",
        "PRODUCT": "basic"
      },
      {
        "TRAFFIC_ITEM_ID": 4049237010230070571,
        "ORIGINAL_TRAFFIC_ITEM_ID": 2740454704214836907,
        "TRAFFIC_ITEM_STATUS_SHORT_DESC": "ACTIVE",
        "TRAFFIC_ITEM_TYPE_DESC": "CONGESTION",
        "START_TIME": "08/24/2021 03:01:34",
        "END_TIME": "08/24/2021 03:28:19",
        "ENTRY_TIME": "08/24/2021 03:18:22",
        "CRITICALITY": {
          "ID": "2",
          "DESCRIPTION": "minor"
        },
        "VERIFIED": true,
        "ABBREVIATION": {
          "SHORT_DESC": "SLOW",
          "DESCRIPTION": "slow"
        },
        "RDS-TMC_LOCATIONS": {
          "RDS-TMC": [
            {
              "ORIGIN": {
                "EBU_COUNTRY_CODE": "D",
                "TABLE_ID": 1,
                "LOCATION_ID": "10915",
                "LOCATION_DESC": "Langenfeld",
                "RDS_DIRECTION": "-"
              },
              "DIRECTION": "+",
              "ALERTC": {
                "TRAFFIC_CODE": 138,
                "ALERTC_Q_BINARY": "1",
                "QUANTIFIERS": 4,
                "DESCRIPTION": "Stockender Verkehr; Durchschnittsgeschwindigkeit von bis zu 5 km/h; vorsichtig an das Stauende heranfahren.",
                "ALERTC_DURATION": "D",
                "ALERTC_DIRECTION": 1,
                "URGENCY": "U",
                "UPDATE_CLASS": 1,
                "PHRASE_CODE": "A2.Z112",
                "EXTENT": "1",
                "DURATION": 0
              },
              "LENGTH": 0.13622,
              "PRIMARY_OFFSET": 0.40038
            }
          ]
        },
        "LOCATION": {
          "DEFINED": {
            "ORIGIN": {
              "ROADWAY": {
                "DESCRIPTION": [
                  {
                    "value": "A3",
                    "TYPE": "NTCSA"
                  },
                  {
                    "value": "A3",
                    "TYPE": "RDSGN"
                  },
                  {
                    "value": "A3",
                    "TYPE": "LOCAL"
                  }
                ],
                "ID": 50101
              },
              "POINT": {
                "DESCRIPTION": [
                  {
                    "value": "Bergische Landstra\u00dfe",
                    "TYPE": "NTCSA"
                  },
                  {
                    "value": "Bergische Landstra\u00dfe",
                    "TYPE": "RDSGN"
                  },
                  {
                    "value": "Bergische Landstra\u00dfe",
                    "TYPE": "LOCAL"
                  },
                  {
                    "value": "A3",
                    "TYPE": "BNAME"
                  }
                ],
                "ID": 10915
              },
              "DIRECTION": {
                "DESCRIPTION": [
                  {
                    "value": "OBERHAUSEN",
                    "TYPE": "LOCAL"
                  },
                  {
                    "value": "OBERHAUSEN",
                    "TYPE": "NTCSA"
                  },
                  {
                    "value": "OBERHAUSEN",
                    "TYPE": "RDSGN"
                  }
                ],
                "ID": 0
              },
              "PROXIMITY": {
                "ID": "AT",
                "DESCRIPTION": "at"
              }
            },
            "TO": {
              "ROADWAY": {
                "DESCRIPTION": [
                  {
                    "value": "A3",
                    "TYPE": "NTCSA"
                  },
                  {
                    "value": "A3",
                    "TYPE": "RDSGN"
                  },
                  {
                    "value": "A3",
                    "TYPE": "LOCAL"
                  }
                ],
                "ID": 50101
              },
              "POINT": {
                "DESCRIPTION": [
                  {
                    "value": "Langenfeld",
                    "TYPE": "NTCSA"
                  },
                  {
                    "value": "Langenfeld",
                    "TYPE": "RDSGN"
                  },
                  {
                    "value": "Langenfeld",
                    "TYPE": "LOCAL"
                  },
                  {
                    "value": "A3",
                    "TYPE": "BNAME"
                  }
                ],
                "ID": 10915
              },
              "DIRECTION": {
                "DESCRIPTION": [
                  {
                    "value": "OBERHAUSEN",
                    "TYPE": "LOCAL"
                  },
                  {
                    "value": "OBERHAUSEN",
                    "TYPE": "NTCSA"
                  },
                  {
                    "value": "OBERHAUSEN",
                    "TYPE": "RDSGN"
                  }
                ],
                "ID": 0
              },
              "PROXIMITY": {
                "ID": "AT",
                "DESCRIPTION": "at"
              }
            }
          },
          "GEOLOC": {
            "ORIGIN": {
              "LATITUDE": 51.10578,
              "LONGITUDE": 6.98807
            },
            "TO": [
              {
                "LATITUDE": 51.10775,
                "LONGITUDE": 6.98801
              }
            ]
          },
          "NAVTECH": {
            "EDGE": {
              "EDGE_ID": [
                "572278939"
              ]
            },
            "VERSION_ID": "202102"
          },
          "LENGTH": 0.13622
        },
        "TRAFFIC_ITEM_DETAIL": {
          "ROAD_CLOSED": false,
          "INCIDENT": {
            "RESPONSE_VEHICLES": false,
            "CONGESTION_INCIDENT": {
              "CONGESTION_TYPE_DESC": "CONGESTION",
              "CONGESTION_FACTOR": 50
            }
          },
          "ALERTC": [
            {
              "EVENT_CODE": 138,
              "ALERTC_Q": 1
            }
          ]
        },
        "TRAFFIC_ITEM_DESCRIPTION": [
          {
            "value": "Bei Langenfeld - Stockender Verkehr; Durchschnittsgeschwindigkeit von bis zu 5 km/h; vorsichtig an das Stauende heranfahren.",
            "TYPE": "short_desc"
          },
          {
            "value": "Bei Langenfeld - Stockender Verkehr; Durchschnittsgeschwindigkeit von bis zu 5 km/h; vorsichtig an das Stauende heranfahren.",
            "TYPE": "desc"
          },
          {
            "value": "Stockender Verkehr; Durchschnittsgeschwindigkeit von bis zu 5 km/h; vorsichtig an das Stauende heranfahren.",
            "TYPE": "no_exit_description"
          }
        ],
        "mid": "3975105d-6ee4-4e7d-ac46-774c030d5282|1629775102379",
        "PRODUCT": "basic"
      },
      {
        "TRAFFIC_ITEM_ID": 2652493290305472455,
        "ORIGINAL_TRAFFIC_ITEM_ID": 3568992241341082884,
        "TRAFFIC_ITEM_STATUS_SHORT_DESC": "ACTIVE",
        "TRAFFIC_ITEM_TYPE_DESC": "CONGESTION",
        "START_TIME": "08/24/2021 03:16:51",
        "END_TIME": "08/24/2021 03:28:21",
        "ENTRY_TIME": "08/24/2021 03:18:22",
        "CRITICALITY": {
          "ID": "2",
          "DESCRIPTION": "minor"
        },
        "VERIFIED": true,
        "ABBREVIATION": {
          "SHORT_DESC": "SLOW",
          "DESCRIPTION": "slow"
        },
        "RDS-TMC_LOCATIONS": {
          "RDS-TMC": [
            {
              "ORIGIN": {
                "EBU_COUNTRY_CODE": "F",
                "TABLE_ID": 32,
                "LOCATION_ID": "50822",
                "LOCATION_DESC": "P\u00e9age de Schwindratzheim",
                "RDS_DIRECTION": "+"
              },
              "DIRECTION": "-",
              "ALERTC": {
                "TRAFFIC_CODE": 138,
                "QUANTIFIERS": 4,
                "DESCRIPTION": "Trafic en accord\u00e9on. Avancez prudemment.",
                "ALERTC_DURATION": "D",
                "ALERTC_DIRECTION": 1,
                "URGENCY": "U",
                "UPDATE_CLASS": 1,
                "PHRASE_CODE": "A2.Z112",
                "EXTENT": "1",
                "DURATION": 0
              },
              "LENGTH": 0.0294,
              "PRIMARY_OFFSET": 0.01687
            }
          ]
        },
        "LOCATION": {
          "DEFINED": {
            "ORIGIN": {
              "ROADWAY": {
                "DESCRIPTION": [
                  {
                    "value": "Autoroute de l'est",
                    "TYPE": "NTCSA"
                  },
                  {
                    "value": "Autoroute de l'est",
                    "TYPE": "RDSGN"
                  },
                  {
                    "value": "Autoroute de l'est",
                    "TYPE": "LOCAL"
                  }
                ],
                "ID": 5004
              },
              "POINT": {
                "DESCRIPTION": [
                  {
                    "value": "Brumath",
                    "TYPE": "NTCSA"
                  },
                  {
                    "value": "Brumath",
                    "TYPE": "RDSGN"
                  },
                  {
                    "value": "Brumath",
                    "TYPE": "LOCAL"
                  },
                  {
                    "value": "Autoroute de l'est",
                    "TYPE": "BNAME"
                  }
                ],
                "ID": 50822
              },
              "DIRECTION": {
                "DESCRIPTION": [
                  {
                    "value": "FREYMING-MERLEBACH (A320)",
                    "TYPE": "LOCAL"
                  },
                  {
                    "value": "FREYMING-MERLEBACH (A320)",
                    "TYPE": "NTCSA"
                  },
                  {
                    "value": "FREYMING-MERLEBACH (A320)",
                    "TYPE": "RDSGN"
                  }
                ],
                "ID": 0
              },
              "PROXIMITY": {
                "ID": "AT",
                "DESCRIPTION": "at"
              }
            },
            "TO": {
              "ROADWAY": {
                "DESCRIPTION": [
                  {
                    "value": "Autoroute de l'est",
                    "TYPE": "NTCSA"
                  },
                  {
                    "value": "Autoroute de l'est",
                    "TYPE": "RDSGN"
                  },
                  {
                    "value": "Autoroute de l'est",
                    "TYPE": "LOCAL"
                  }
                ],
                "ID": 5004
              },
              "POINT": {
                "DESCRIPTION": [
                  {
                    "value": "P\u00e9age de Schwindratzheim",
                    "TYPE": "NTCSA"
                  },
                  {
                    "value": "P\u00e9age de Schwindratzheim",
                    "TYPE": "RDSGN"
                  },
                  {
                    "value": "P\u00e9age de Schwindratzheim",
                    "TYPE": "LOCAL"
                  },
                  {
                    "value": "Autoroute de l'est",
                    "TYPE": "BNAME"
                  }
                ],
                "ID": 50822
              },
              "DIRECTION": {
                "DESCRIPTION": [
                  {
                    "value": "FREYMING-MERLEBACH (A320)",
                    "TYPE": "LOCAL"
                  },
                  {
                    "value": "FREYMING-MERLEBACH (A320)",
                    "TYPE": "NTCSA"
                  },
                  {
                    "value": "FREYMING-MERLEBACH (A320)",
                    "TYPE": "RDSGN"
                  }
                ],
                "ID": 0
              },
              "PROXIMITY": {
                "ID": "AT",
                "DESCRIPTION": "at"
              }
            }
          },
          "GEOLOC": {
            "ORIGIN": {
              "LATITUDE": 48.76989,
              "LONGITUDE": 7.60291
            },
            "TO": [
              {
                "LATITUDE": 48.76981,
                "LONGITUDE": 7.60228
              }
            ]
          },
          "NAVTECH": {
            "EDGE": {
              "EDGE_ID": [
                "70136111"
              ]
            },
            "VERSION_ID": "202102"
          },
          "LENGTH": 0.0294
        },
        "TRAFFIC_ITEM_DETAIL": {
          "ROAD_CLOSED": false,
          "INCIDENT": {
            "RESPONSE_VEHICLES": false,
            "CONGESTION_INCIDENT": {
              "CONGESTION_TYPE_DESC": "CONGESTION",
              "CONGESTION_FACTOR": 50
            }
          },
          "ALERTC": [
            {
              "EVENT_CODE": 138
            }
          ]
        },
        "TRAFFIC_ITEM_DESCRIPTION": [
          {
            "value": "\u00c0 P\u00e9age de Schwindratzheim - Trafic en accord\u00e9on. Avancez prudemment.",
            "TYPE": "short_desc"
          },
          {
            "value": "\u00c0 P\u00e9age de Schwindratzheim - Trafic en accord\u00e9on. Avancez prudemment.",
            "TYPE": "desc"
          },
          {
            "value": "Trafic en accord\u00e9on. Avancez prudemment.",
            "TYPE": "no_exit_description"
          }
        ],
        "mid": "dcd1ef18-4f6b-4fe5-93fc-43d763d246f4|1629775102379",
        "PRODUCT": "basic"
      },
      {
        "TRAFFIC_ITEM_ID": 4188259400974712659,
        "ORIGINAL_TRAFFIC_ITEM_ID": 2269094481954991088,
        "TRAFFIC_ITEM_STATUS_SHORT_DESC": "ACTIVE",
        "TRAFFIC_ITEM_TYPE_DESC": "CONGESTION",
        "START_TIME": "08/24/2021 02:51:33",
        "END_TIME": "08/24/2021 03:28:19",
        "ENTRY_TIME": "08/24/2021 03:18:22",
        "CRITICALITY": {
          "ID": "2",
          "DESCRIPTION": "minor"
        },
        "VERIFIED": true,
        "ABBREVIATION": {
          "SHORT_DESC": "SLOW",
          "DESCRIPTION": "slow"
        },
        "RDS-TMC_LOCATIONS": {
          "RDS-TMC": [
            {
              "ORIGIN": {
                "EBU_COUNTRY_CODE": "D",
                "TABLE_ID": 1,
                "LOCATION_ID": "39891",
                "LOCATION_DESC": "Kleine Herrenthey",
                "RDS_DIRECTION": "+"
              },
              "DIRECTION": "-",
              "ALERTC": {
                "TRAFFIC_CODE": 138,
                "QUANTIFIERS": 4,
                "DESCRIPTION": "Stockender Verkehr;; vorsichtig an das Stauende heranfahren.",
                "ALERTC_DURATION": "D",
                "ALERTC_DIRECTION": 1,
                "URGENCY": "U",
                "UPDATE_CLASS": 1,
                "PHRASE_CODE": "A2.Z112",
                "EXTENT": "1",
                "DURATION": 0
              },
              "LENGTH": 0.21769,
              "PRIMARY_OFFSET": 2.46813
            }
          ]
        },
        "LOCATION": {
          "DEFINED": {
            "ORIGIN": {
              "ROADWAY": {
                "DESCRIPTION": [
                  {
                    "value": "A2",
                    "TYPE": "NTCSA"
                  },
                  {
                    "value": "A2",
                    "TYPE": "RDSGN"
                  },
                  {
                    "value": "A2",
                    "TYPE": "LOCAL"
                  }
                ],
                "ID": 50080
              },
              "POINT": {
                "DESCRIPTION": [
                  {
                    "value": "Dortmund-Nordost",
                    "TYPE": "NTCSA"
                  },
                  {
                    "value": "Dortmund-Nordost",
                    "TYPE": "RDSGN"
                  },
                  {
                    "value": "Dortmund-Nordost",
                    "TYPE": "LOCAL"
                  },
                  {
                    "value": "A2",
                    "TYPE": "BNAME"
                  }
                ],
                "ID": 39891
              },
              "DIRECTION": {
                "DESCRIPTION": [
                  {
                    "value": "OBERHAUSEN",
                    "TYPE": "LOCAL"
                  },
                  {
                    "value": "OBERHAUSEN",
                    "TYPE": "NTCSA"
                  },
                  {
                    "value": "OBERHAUSEN",
                    "TYPE": "RDSGN"
                  }
                ],
                "ID": 0
              },
              "PROXIMITY": {
                "ID": "AT",
                "DESCRIPTION": "at"
              }
            },
            "TO": {
              "ROADWAY": {
                "DESCRIPTION": [
                  {
                    "value": "A2",
                    "TYPE": "NTCSA"
                  },
                  {
                    "value": "A2",
                    "TYPE": "RDSGN"
                  },
                  {
                    "value": "A2",
                    "TYPE": "LOCAL"
                  }
                ],
                "ID": 50080
              },
              "POINT": {
                "DESCRIPTION": [
                  {
                    "value": "Kleine Herrenthey",
                    "TYPE": "NTCSA"
                  },
                  {
                    "value": "Kleine Herrenthey",
                    "TYPE": "RDSGN"
                  },
                  {
                    "value": "Kleine Herrenthey",
                    "TYPE": "LOCAL"
                  },
                  {
                    "value": "A2",
                    "TYPE": "BNAME"
                  }
                ],
                "ID": 39891
              },
              "DIRECTION": {
                "DESCRIPTION": [
                  {
                    "value": "OBERHAUSEN",
                    "TYPE": "LOCAL"
                  },
                  {
                    "value": "OBERHAUSEN",
                    "TYPE": "NTCSA"
                  },
                  {
                    "value": "OBERHAUSEN",
                    "TYPE": "RDSGN"
                  }
                ],
                "ID": 0
              },
              "PROXIMITY": {
                "ID": "AT",
                "DESCRIPTION": "at"
              }
            }
          },
          "GEOLOC": {
            "ORIGIN": {
              "LATITUDE": 51.57685,
              "LONGITUDE": 7.4868
            },
            "TO": [
              {
                "LATITUDE": 51.57588,
                "LONGITUDE": 7.48214
              }
            ]
          },
          "NAVTECH": {
            "EDGE": {
              "EDGE_ID": [
                "1268132884"
              ]
            },
            "VERSION_ID": "202102"
          },
          "LENGTH": 0.21769
        },
        "TRAFFIC_ITEM_DETAIL": {
          "ROAD_CLOSED": false,
          "INCIDENT": {
            "RESPONSE_VEHICLES": false,
            "CONGESTION_INCIDENT": {
              "CONGESTION_TYPE_DESC": "CONGESTION",
              "CONGESTION_FACTOR": 50
            }
          },
          "ALERTC": [
            {
              "EVENT_CODE": 138
            }
          ]
        },
        "TRAFFIC_ITEM_DESCRIPTION": [
          {
            "value": "Bei Kleine Herrenthey - Stockender Verkehr;; vorsichtig an das Stauende heranfahren.",
            "TYPE": "short_desc"
          },
          {
            "value": "Bei Kleine Herrenthey - Stockender Verkehr;; vorsichtig an das Stauende heranfahren.",
            "TYPE": "desc"
          },
          {
            "value": "Stockender Verkehr;; vorsichtig an das Stauende heranfahren.",
            "TYPE": "no_exit_description"
          }
        ],
        "mid": "6db64d37-d808-4afe-b715-2573c1178275|1629775102379",
        "PRODUCT": "basic"
      },
      {
        "TRAFFIC_ITEM_ID": 3425422173953378581,
        "ORIGINAL_TRAFFIC_ITEM_ID": 233176871434075848,
        "TRAFFIC_ITEM_STATUS_SHORT_DESC": "ACTIVE",
        "TRAFFIC_ITEM_TYPE_DESC": "CONGESTION",
        "START_TIME": "08/24/2021 03:12:19",
        "END_TIME": "08/24/2021 03:28:19",
        "ENTRY_TIME": "08/24/2021 03:18:22",
        "CRITICALITY": {
          "ID": "2",
          "DESCRIPTION": "minor"
        },
        "VERIFIED": true,
        "ABBREVIATION": {
          "SHORT_DESC": "SLOW",
          "DESCRIPTION": "slow"
        },
        "RDS-TMC_LOCATIONS": {
          "RDS-TMC": [
            {
              "ORIGIN": {
                "EBU_COUNTRY_CODE": "D",
                "TABLE_ID": 1,
                "LOCATION_ID": "11470",
                "LOCATION_DESC": "Wuppertal-Nord",
                "RDS_DIRECTION": "-"
              },
              "DIRECTION": "+",
              "ALERTC": {
                "TRAFFIC_CODE": 138,
                "QUANTIFIERS": 4,
                "DESCRIPTION": "Stockender Verkehr;; vorsichtig an das Stauende heranfahren.",
                "ALERTC_DURATION": "D",
                "ALERTC_DIRECTION": 1,
                "URGENCY": "U",
                "UPDATE_CLASS": 1,
                "PHRASE_CODE": "A2.Z112",
                "EXTENT": "1",
                "DURATION": 0
              },
              "LENGTH": 0.081,
              "PRIMARY_OFFSET": 0.02228
            }
          ]
        },
        "LOCATION": {
          "DEFINED": {
            "ORIGIN": {
              "ROADWAY": {
                "DESCRIPTION": [
                  {
                    "value": "A46",
                    "TYPE": "NTCSA"
                  },
                  {
                    "value": "A46",
                    "TYPE": "RDSGN"
                  },
                  {
                    "value": "A46",
                    "TYPE": "LOCAL"
                  }
                ],
                "ID": 50120
              },
              "POINT": {
                "DESCRIPTION": [
                  {
                    "value": "Wuppertal-Oberbarmen",
                    "TYPE": "NTCSA"
                  },
                  {
                    "value": "Wuppertal-Oberbarmen",
                    "TYPE": "RDSGN"
                  },
                  {
                    "value": "Wuppertal-Oberbarmen",
                    "TYPE": "LOCAL"
                  },
                  {
                    "value": "A46",
                    "TYPE": "BNAME"
                  }
                ],
                "ID": 11470
              },
              "DIRECTION": {
                "DESCRIPTION": [
                  {
                    "value": "WUPPERTAL",
                    "TYPE": "LOCAL"
                  },
                  {
                    "value": "WUPPERTAL",
                    "TYPE": "NTCSA"
                  },
                  {
                    "value": "WUPPERTAL",
                    "TYPE": "RDSGN"
                  }
                ],
                "ID": 0
              },
              "PROXIMITY": {
                "ID": "AT",
                "DESCRIPTION": "at"
              }
            },
            "TO": {
              "ROADWAY": {
                "DESCRIPTION": [
                  {
                    "value": "A46",
                    "TYPE": "NTCSA"
                  },
                  {
                    "value": "A46",
                    "TYPE": "RDSGN"
                  },
                  {
                    "value": "A46",
                    "TYPE": "LOCAL"
                  }
                ],
                "ID": 50120
              },
              "POINT": {
                "DESCRIPTION": [
                  {
                    "value": "Wuppertal-Nord",
                    "TYPE": "NTCSA"
                  },
                  {
                    "value": "Wuppertal-Nord",
                    "TYPE": "RDSGN"
                  },
                  {
                    "value": "Wuppertal-Nord",
                    "TYPE": "LOCAL"
                  },
                  {
                    "value": "A46",
                    "TYPE": "BNAME"
                  }
                ],
                "ID": 11470
              },
              "DIRECTION": {
                "DESCRIPTION": [
                  {
                    "value": "WUPPERTAL",
                    "TYPE": "LOCAL"
                  },
                  {
                    "value": "WUPPERTAL",
                    "TYPE": "NTCSA"
                  },
                  {
                    "value": "WUPPERTAL",
                    "TYPE": "RDSGN"
                  }
                ],
                "ID": 0
              },
              "PROXIMITY": {
                "ID": "AT",
                "DESCRIPTION": "at"
              }
            }
          },
          "GEOLOC": {
            "ORIGIN": {
              "LATITUDE": 51.31426,
              "LONGITUDE": 7.26657
            },
            "TO": [
              {
                "LATITUDE": 51.31414,
                "LONGITUDE": 7.2684
              }
            ]
          },
          "NAVTECH": {
            "EDGE": {
              "EDGE_ID": [
                "943512879"
              ]
            },
            "VERSION_ID": "202102"
          },
          "LENGTH": 0.081
        },
        "TRAFFIC_ITEM_DETAIL": {
          "ROAD_CLOSED": false,
          "INCIDENT": {
            "RESPONSE_VEHICLES": false,
            "CONGESTION_INCIDENT": {
              "CONGESTION_TYPE_DESC": "CONGESTION",
              "CONGESTION_FACTOR": 50
            }
          },
          "ALERTC": [
            {
              "EVENT_CODE": 138
            }
          ]
        },
        "TRAFFIC_ITEM_DESCRIPTION": [
          {
            "value": "Bei Wuppertal-Nord - Stockender Verkehr;; vorsichtig an das Stauende heranfahren.",
            "TYPE": "short_desc"
          },
          {
            "value": "Bei Wuppertal-Nord - Stockender Verkehr;; vorsichtig an das Stauende heranfahren.",
            "TYPE": "desc"
          },
          {
            "value": "Stockender Verkehr;; vorsichtig an das Stauende heranfahren.",
            "TYPE": "no_exit_description"
          }
        ],
        "mid": "d0a0da1c-a232-4320-b583-52573471f094|1629775102379",
        "PRODUCT": "basic"
      },
      {
        "TRAFFIC_ITEM_ID": 1103645157767329209,
        "ORIGINAL_TRAFFIC_ITEM_ID": 4272812015043389060,
        "TRAFFIC_ITEM_STATUS_SHORT_DESC": "ACTIVE",
        "TRAFFIC_ITEM_TYPE_DESC": "CONGESTION",
        "START_TIME": "08/24/2021 03:16:57",
        "END_TIME": "08/24/2021 03:28:19",
        "ENTRY_TIME": "08/24/2021 03:18:22",
        "CRITICALITY": {
          "ID": "2",
          "DESCRIPTION": "minor"
        },
        "VERIFIED": true,
        "ABBREVIATION": {
          "SHORT_DESC": "SLOW",
          "DESCRIPTION": "slow"
        },
        "RDS-TMC_LOCATIONS": {
          "RDS-TMC": [
            {
              "ORIGIN": {
                "EBU_COUNTRY_CODE": "D",
                "TABLE_ID": 1,
                "LOCATION_ID": "55856",
                "LOCATION_DESC": "Resser Mark",
                "RDS_DIRECTION": "+"
              },
              "DIRECTION": "-",
              "ALERTC": {
                "TRAFFIC_CODE": 138,
                "ALERTC_Q_BINARY": "1",
                "QUANTIFIERS": 4,
                "DESCRIPTION": "Stockender Verkehr; Durchschnittsgeschwindigkeit von bis zu 5 km/h; vorsichtig an das Stauende heranfahren.",
                "ALERTC_DURATION": "D",
                "ALERTC_DIRECTION": 1,
                "URGENCY": "U",
                "UPDATE_CLASS": 1,
                "PHRASE_CODE": "A2.Z112",
                "EXTENT": "1",
                "DURATION": 0
              },
              "LENGTH": 0.25451,
              "PRIMARY_OFFSET": 0.53262
            }
          ]
        },
        "LOCATION": {
          "DEFINED": {
            "ORIGIN": {
              "ROADWAY": {
                "DESCRIPTION": [
                  {
                    "value": "A2",
                    "TYPE": "NTCSA"
                  },
                  {
                    "value": "A2",
                    "TYPE": "RDSGN"
                  },
                  {
                    "value": "A2",
                    "TYPE": "LOCAL"
                  }
                ],
                "ID": 50080
              },
              "POINT": {
                "DESCRIPTION": [
                  {
                    "value": "Herten",
                    "TYPE": "NTCSA"
                  },
                  {
                    "value": "Herten",
                    "TYPE": "RDSGN"
                  },
                  {
                    "value": "Herten",
                    "TYPE": "LOCAL"
                  },
                  {
                    "value": "A2",
                    "TYPE": "BNAME"
                  }
                ],
                "ID": 55856
              },
              "DIRECTION": {
                "DESCRIPTION": [
                  {
                    "value": "OBERHAUSEN",
                    "TYPE": "LOCAL"
                  },
                  {
                    "value": "OBERHAUSEN",
                    "TYPE": "NTCSA"
                  },
                  {
                    "value": "OBERHAUSEN",
                    "TYPE": "RDSGN"
                  }
                ],
                "ID": 0
              },
              "PROXIMITY": {
                "ID": "AT",
                "DESCRIPTION": "at"
              }
            },
            "TO": {
              "ROADWAY": {
                "DESCRIPTION": [
                  {
                    "value": "A2",
                    "TYPE": "NTCSA"
                  },
                  {
                    "value": "A2",
                    "TYPE": "RDSGN"
                  },
                  {
                    "value": "A2",
                    "TYPE": "LOCAL"
                  }
                ],
                "ID": 50080
              },
              "POINT": {
                "DESCRIPTION": [
                  {
                    "value": "Resser Mark",
                    "TYPE": "NTCSA"
                  },
                  {
                    "value": "Resser Mark",
                    "TYPE": "RDSGN"
                  },
                  {
                    "value": "Resser Mark",
                    "TYPE": "LOCAL"
                  },
                  {
                    "value": "A2",
                    "TYPE": "BNAME"
                  }
                ],
                "ID": 55856
              },
              "DIRECTION": {
                "DESCRIPTION": [
                  {
                    "value": "OBERHAUSEN",
                    "TYPE": "LOCAL"
                  },
                  {
                    "value": "OBERHAUSEN",
                    "TYPE": "NTCSA"
                  },
                  {
                    "value": "OBERHAUSEN",
                    "TYPE": "RDSGN"
                  }
                ],
                "ID": 0
              },
              "PROXIMITY": {
                "ID": "AT",
                "DESCRIPTION": "at"
              }
            }
          },
          "GEOLOC": {
            "ORIGIN": {
              "LATITUDE": 51.57014,
              "LONGITUDE": 7.11371
            },
            "TO": [
              {
                "LATITUDE": 51.5702,
                "LONGITUDE": 7.10786
              }
            ]
          },
          "NAVTECH": {
            "EDGE": {
              "EDGE_ID": [
                "1134741911"
              ]
            },
            "VERSION_ID": "202102"
          },
          "LENGTH": 0.25451
        },
        "TRAFFIC_ITEM_DETAIL": {
          "ROAD_CLOSED": false,
          "INCIDENT": {
            "RESPONSE_VEHICLES": false,
            "CONGESTION_INCIDENT": {
              "CONGESTION_TYPE_DESC": "CONGESTION",
              "CONGESTION_FACTOR": 50
            }
          },
          "ALERTC": [
            {
              "EVENT_CODE": 138,
              "ALERTC_Q": 1
            }
          ]
        },
        "TRAFFIC_ITEM_DESCRIPTION": [
          {
            "value": "Bei Resser Mark - Stockender Verkehr; Durchschnittsgeschwindigkeit von bis zu 5 km/h; vorsichtig an das Stauende heranfahren.",
            "TYPE": "short_desc"
          },
          {
            "value": "Bei Resser Mark - Stockender Verkehr; Durchschnittsgeschwindigkeit von bis zu 5 km/h; vorsichtig an das Stauende heranfahren.",
            "TYPE": "desc"
          },
          {
            "value": "Stockender Verkehr; Durchschnittsgeschwindigkeit von bis zu 5 km/h; vorsichtig an das Stauende heranfahren.",
            "TYPE": "no_exit_description"
          }
        ],
        "mid": "cc81d5c1-2b82-43ce-9e1b-24c19787d23f|1629775102379",
        "PRODUCT": "basic"
      },
      {
        "TRAFFIC_ITEM_ID": 794109464206529041,
        "ORIGINAL_TRAFFIC_ITEM_ID": 4039148686767151260,
        "TRAFFIC_ITEM_STATUS_SHORT_DESC": "ACTIVE",
        "TRAFFIC_ITEM_TYPE_DESC": "CONGESTION",
        "START_TIME": "08/24/2021 03:16:42",
        "END_TIME": "08/24/2021 03:28:19",
        "ENTRY_TIME": "08/24/2021 03:18:22",
        "CRITICALITY": {
          "ID": "2",
          "DESCRIPTION": "minor"
        },
        "VERIFIED": true,
        "ABBREVIATION": {
          "SHORT_DESC": "SLOW",
          "DESCRIPTION": "slow"
        },
        "RDS-TMC_LOCATIONS": {
          "RDS-TMC": [
            {
              "ORIGIN": {
                "EBU_COUNTRY_CODE": "D",
                "TABLE_ID": 1,
                "LOCATION_ID": "12779",
                "LOCATION_DESC": "Bad Lobenstein",
                "RDS_DIRECTION": "-"
              },
              "DIRECTION": "+",
              "ALERTC": {
                "TRAFFIC_CODE": 138,
                "ALERTC_Q_BINARY": "1",
                "QUANTIFIERS": 4,
                "DESCRIPTION": "Stockender Verkehr; Durchschnittsgeschwindigkeit von bis zu 5 km/h; vorsichtig an das Stauende heranfahren.",
                "ALERTC_DURATION": "D",
                "ALERTC_DIRECTION": 1,
                "URGENCY": "U",
                "UPDATE_CLASS": 1,
                "PHRASE_CODE": "A2.Z112",
                "EXTENT": "1",
                "DURATION": 0
              },
              "LENGTH": 0.26287,
              "PRIMARY_OFFSET": 0.55195
            }
          ]
        },
        "LOCATION": {
          "DEFINED": {
            "ORIGIN": {
              "ROADWAY": {
                "DESCRIPTION": [
                  {
                    "value": "A9",
                    "TYPE": "NTCSA"
                  },
                  {
                    "value": "A9",
                    "TYPE": "RDSGN"
                  },
                  {
                    "value": "A9",
                    "TYPE": "LOCAL"
                  }
                ],
                "ID": 50173
              },
              "POINT": {
                "DESCRIPTION": [
                  {
                    "value": "Hirschberg",
                    "TYPE": "NTCSA"
                  },
                  {
                    "value": "Hirschberg",
                    "TYPE": "RDSGN"
                  },
                  {
                    "value": "Hirschberg",
                    "TYPE": "LOCAL"
                  },
                  {
                    "value": "A9",
                    "TYPE": "BNAME"
                  }
                ],
                "ID": 12779
              },
              "DIRECTION": {
                "DESCRIPTION": [
                  {
                    "value": "HALLE/LEIPZIG",
                    "TYPE": "LOCAL"
                  },
                  {
                    "value": "HALLE/LEIPZIG",
                    "TYPE": "NTCSA"
                  },
                  {
                    "value": "HALLE/LEIPZIG",
                    "TYPE": "RDSGN"
                  }
                ],
                "ID": 0
              },
              "PROXIMITY": {
                "ID": "AT",
                "DESCRIPTION": "at"
              }
            },
            "TO": {
              "ROADWAY": {
                "DESCRIPTION": [
                  {
                    "value": "A9",
                    "TYPE": "NTCSA"
                  },
                  {
                    "value": "A9",
                    "TYPE": "RDSGN"
                  },
                  {
                    "value": "A9",
                    "TYPE": "LOCAL"
                  }
                ],
                "ID": 50173
              },
              "POINT": {
                "DESCRIPTION": [
                  {
                    "value": "Bad Lobenstein",
                    "TYPE": "NTCSA"
                  },
                  {
                    "value": "Bad Lobenstein",
                    "TYPE": "RDSGN"
                  },
                  {
                    "value": "Bad Lobenstein",
                    "TYPE": "LOCAL"
                  },
                  {
                    "value": "A9",
                    "TYPE": "BNAME"
                  }
                ],
                "ID": 12779
              },
              "DIRECTION": {
                "DESCRIPTION": [
                  {
                    "value": "HALLE/LEIPZIG",
                    "TYPE": "LOCAL"
                  },
                  {
                    "value": "HALLE/LEIPZIG",
                    "TYPE": "NTCSA"
                  },
                  {
                    "value": "HALLE/LEIPZIG",
                    "TYPE": "RDSGN"
                  }
                ],
                "ID": 0
              },
              "PROXIMITY": {
                "ID": "AT",
                "DESCRIPTION": "at"
              }
            }
          },
          "GEOLOC": {
            "ORIGIN": {
              "LATITUDE": 50.43435,
              "LONGITUDE": 11.80011
            },
            "TO": [
              {
                "LATITUDE": 50.4378,
                "LONGITUDE": 11.80261
              }
            ]
          },
          "NAVTECH": {
            "EDGE": {
              "EDGE_ID": [
                "1162465153"
              ]
            },
            "VERSION_ID": "202102"
          },
          "LENGTH": 0.26287
        },
        "TRAFFIC_ITEM_DETAIL": {
          "ROAD_CLOSED": false,
          "INCIDENT": {
            "RESPONSE_VEHICLES": false,
            "CONGESTION_INCIDENT": {
              "CONGESTION_TYPE_DESC": "CONGESTION",
              "CONGESTION_FACTOR": 50
            }
          },
          "ALERTC": [
            {
              "EVENT_CODE": 138,
              "ALERTC_Q": 1
            }
          ]
        },
        "TRAFFIC_ITEM_DESCRIPTION": [
          {
            "value": "Bei Bad Lobenstein - Stockender Verkehr; Durchschnittsgeschwindigkeit von bis zu 5 km/h; vorsichtig an das Stauende heranfahren.",
            "TYPE": "short_desc"
          },
          {
            "value": "Bei Bad Lobenstein - Stockender Verkehr; Durchschnittsgeschwindigkeit von bis zu 5 km/h; vorsichtig an das Stauende heranfahren.",
            "TYPE": "desc"
          },
          {
            "value": "Stockender Verkehr; Durchschnittsgeschwindigkeit von bis zu 5 km/h; vorsichtig an das Stauende heranfahren.",
            "TYPE": "no_exit_description"
          }
        ],
        "mid": "7ad1bbf8-be89-423f-9558-7970ef0f0045|1629775102379",
        "PRODUCT": "basic"
      },
      {
        "TRAFFIC_ITEM_ID": 1762304618349973765,
        "ORIGINAL_TRAFFIC_ITEM_ID": 2362849122272680014,
        "TRAFFIC_ITEM_STATUS_SHORT_DESC": "ACTIVE",
        "TRAFFIC_ITEM_TYPE_DESC": "CONGESTION",
        "START_TIME": "08/24/2021 03:15:34",
        "END_TIME": "08/24/2021 03:28:19",
        "ENTRY_TIME": "08/24/2021 03:18:22",
        "CRITICALITY": {
          "ID": "2",
          "DESCRIPTION": "minor"
        },
        "VERIFIED": true,
        "ABBREVIATION": {
          "SHORT_DESC": "SLOW",
          "DESCRIPTION": "slow"
        },
        "RDS-TMC_LOCATIONS": {
          "RDS-TMC": [
            {
              "ORIGIN": {
                "EBU_COUNTRY_CODE": "D",
                "TABLE_ID": 1,
                "LOCATION_ID": "42385",
                "LOCATION_DESC": "Aubing",
                "RDS_DIRECTION": "-"
              },
              "DIRECTION": "+",
              "ALERTC": {
                "TRAFFIC_CODE": 138,
                "ALERTC_Q_BINARY": "1",
                "QUANTIFIERS": 4,
                "DESCRIPTION": "Stockender Verkehr; Durchschnittsgeschwindigkeit von bis zu 5 km/h; vorsichtig an das Stauende heranfahren.",
                "ALERTC_DURATION": "D",
                "ALERTC_DIRECTION": 1,
                "URGENCY": "U",
                "UPDATE_CLASS": 1,
                "PHRASE_CODE": "A2.Z112",
                "EXTENT": "1",
                "DURATION": 0
              },
              "LENGTH": 0.12236,
              "PRIMARY_OFFSET": 0.41595
            }
          ]
        },
        "LOCATION": {
          "DEFINED": {
            "ORIGIN": {
              "ROADWAY": {
                "DESCRIPTION": [
                  {
                    "value": "Autobahnring M\u00fcnchen",
                    "TYPE": "NTCSA"
                  },
                  {
                    "value": "Autobahnring M\u00fcnchen",
                    "TYPE": "RDSGN"
                  },
                  {
                    "value": "Autobahnring M\u00fcnchen",
                    "TYPE": "LOCAL"
                  }
                ],
                "ID": 50183
              },
              "POINT": {
                "DESCRIPTION": [
                  {
                    "value": "Germering-Nord",
                    "TYPE": "NTCSA"
                  },
                  {
                    "value": "Germering-Nord",
                    "TYPE": "RDSGN"
                  },
                  {
                    "value": "Germering-Nord",
                    "TYPE": "LOCAL"
                  },
                  {
                    "value": "Autobahnring M\u00fcnchen",
                    "TYPE": "BNAME"
                  }
                ],
                "ID": 42385
              },
              "DIRECTION": {
                "DESCRIPTION": [
                  {
                    "value": "M\u00dcNCHEN-NORD",
                    "TYPE": "LOCAL"
                  },
                  {
                    "value": "M\u00dcNCHEN-NORD",
                    "TYPE": "NTCSA"
                  },
                  {
                    "value": "M\u00dcNCHEN-NORD",
                    "TYPE": "RDSGN"
                  }
                ],
                "ID": 0
              },
              "PROXIMITY": {
                "ID": "AT",
                "DESCRIPTION": "at"
              }
            },
            "TO": {
              "ROADWAY": {
                "DESCRIPTION": [
                  {
                    "value": "Autobahnring M\u00fcnchen",
                    "TYPE": "NTCSA"
                  },
                  {
                    "value": "Autobahnring M\u00fcnchen",
                    "TYPE": "RDSGN"
                  },
                  {
                    "value": "Autobahnring M\u00fcnchen",
                    "TYPE": "LOCAL"
                  }
                ],
                "ID": 50183
              },
              "POINT": {
                "DESCRIPTION": [
                  {
                    "value": "Aubing",
                    "TYPE": "NTCSA"
                  },
                  {
                    "value": "Aubing",
                    "TYPE": "RDSGN"
                  },
                  {
                    "value": "Aubing",
                    "TYPE": "LOCAL"
                  },
                  {
                    "value": "Autobahnring M\u00fcnchen",
                    "TYPE": "BNAME"
                  }
                ],
                "ID": 42385
              },
              "DIRECTION": {
                "DESCRIPTION": [
                  {
                    "value": "M\u00dcNCHEN-NORD",
                    "TYPE": "LOCAL"
                  },
                  {
                    "value": "M\u00dcNCHEN-NORD",
                    "TYPE": "NTCSA"
                  },
                  {
                    "value": "M\u00dcNCHEN-NORD",
                    "TYPE": "RDSGN"
                  }
                ],
                "ID": 0
              },
              "PROXIMITY": {
                "ID": "AT",
                "DESCRIPTION": "at"
              }
            }
          },
          "GEOLOC": {
            "ORIGIN": {
              "LATITUDE": 48.16444,
              "LONGITUDE": 11.41048
            },
            "TO": [
              {
                "LATITUDE": 48.16568,
                "LONGITUDE": 11.41233
              }
            ]
          },
          "NAVTECH": {
            "EDGE": {
              "EDGE_ID": [
                "853226513"
              ]
            },
            "VERSION_ID": "202102"
          },
          "LENGTH": 0.12236
        },
        "TRAFFIC_ITEM_DETAIL": {
          "ROAD_CLOSED": false,
          "INCIDENT": {
            "RESPONSE_VEHICLES": false,
            "CONGESTION_INCIDENT": {
              "CONGESTION_TYPE_DESC": "CONGESTION",
              "CONGESTION_FACTOR": 50
            }
          },
          "ALERTC": [
            {
              "EVENT_CODE": 138,
              "ALERTC_Q": 1
            }
          ]
        },
        "TRAFFIC_ITEM_DESCRIPTION": [
          {
            "value": "Bei Aubing - Stockender Verkehr; Durchschnittsgeschwindigkeit von bis zu 5 km/h; vorsichtig an das Stauende heranfahren.",
            "TYPE": "short_desc"
          },
          {
            "value": "Bei Aubing - Stockender Verkehr; Durchschnittsgeschwindigkeit von bis zu 5 km/h; vorsichtig an das Stauende heranfahren.",
            "TYPE": "desc"
          },
          {
            "value": "Stockender Verkehr; Durchschnittsgeschwindigkeit von bis zu 5 km/h; vorsichtig an das Stauende heranfahren.",
            "TYPE": "no_exit_description"
          }
        ],
        "mid": "f2d3c655-cccc-4ea4-ade1-2e2e55856a6a|1629775102379",
        "PRODUCT": "basic"
      },
      {
        "TRAFFIC_ITEM_ID": 247125725908217762,
        "ORIGINAL_TRAFFIC_ITEM_ID": 2158824494288452433,
        "TRAFFIC_ITEM_STATUS_SHORT_DESC": "ACTIVE",
        "TRAFFIC_ITEM_TYPE_DESC": "CONGESTION",
        "START_TIME": "08/24/2021 03:17:04",
        "END_TIME": "08/24/2021 03:28:19",
        "ENTRY_TIME": "08/24/2021 03:17:22",
        "CRITICALITY": {
          "ID": "2",
          "DESCRIPTION": "minor"
        },
        "VERIFIED": true,
        "ABBREVIATION": {
          "SHORT_DESC": "SLOW",
          "DESCRIPTION": "slow"
        },
        "RDS-TMC_LOCATIONS": {
          "RDS-TMC": [
            {
              "ORIGIN": {
                "EBU_COUNTRY_CODE": "D",
                "TABLE_ID": 1,
                "LOCATION_ID": "32604",
                "LOCATION_DESC": "Ortsteil Britz",
                "RDS_DIRECTION": "+"
              },
              "DIRECTION": "-",
              "ALERTC": {
                "TRAFFIC_CODE": 138,
                "QUANTIFIERS": 4,
                "DESCRIPTION": "Stockender Verkehr;; vorsichtig an das Stauende heranfahren.",
                "ALERTC_DURATION": "D",
                "ALERTC_DIRECTION": 1,
                "URGENCY": "U",
                "UPDATE_CLASS": 1,
                "PHRASE_CODE": "A2.Z112",
                "EXTENT": "1",
                "DURATION": 0
              },
              "LENGTH": 0.01687,
              "PRIMARY_OFFSET": 0.5097
            }
          ]
        },
        "LOCATION": {
          "DEFINED": {
            "ORIGIN": {
              "ROADWAY": {
                "DESCRIPTION": [
                  {
                    "value": "Stadtring Berlin",
                    "TYPE": "NTCSA"
                  },
                  {
                    "value": "Stadtring Berlin",
                    "TYPE": "RDSGN"
                  },
                  {
                    "value": "Stadtring Berlin",
                    "TYPE": "LOCAL"
                  }
                ],
                "ID": 50062
              },
              "POINT": {
                "DESCRIPTION": [
                  {
                    "value": "Britzer Damm",
                    "TYPE": "NTCSA"
                  },
                  {
                    "value": "Britzer Damm",
                    "TYPE": "RDSGN"
                  },
                  {
                    "value": "Britzer Damm",
                    "TYPE": "LOCAL"
                  },
                  {
                    "value": "Stadtring Berlin",
                    "TYPE": "BNAME"
                  }
                ],
                "ID": 32604
              },
              "DIRECTION": {
                "DESCRIPTION": [
                  {
                    "value": "WILMERSDORF",
                    "TYPE": "LOCAL"
                  },
                  {
                    "value": "WILMERSDORF",
                    "TYPE": "NTCSA"
                  },
                  {
                    "value": "WILMERSDORF",
                    "TYPE": "RDSGN"
                  }
                ],
                "ID": 0
              },
              "PROXIMITY": {
                "ID": "AT",
                "DESCRIPTION": "at"
              }
            },
            "TO": {
              "ROADWAY": {
                "DESCRIPTION": [
                  {
                    "value": "Stadtring Berlin",
                    "TYPE": "NTCSA"
                  },
                  {
                    "value": "Stadtring Berlin",
                    "TYPE": "RDSGN"
                  },
                  {
                    "value": "Stadtring Berlin",
                    "TYPE": "LOCAL"
                  }
                ],
                "ID": 50062
              },
              "POINT": {
                "DESCRIPTION": [
                  {
                    "value": "Ortsteil Britz",
                    "TYPE": "NTCSA"
                  },
                  {
                    "value": "Ortsteil Britz",
                    "TYPE": "RDSGN"
                  },
                  {
                    "value": "Ortsteil Britz",
                    "TYPE": "LOCAL"
                  },
                  {
                    "value": "Stadtring Berlin",
                    "TYPE": "BNAME"
                  }
                ],
                "ID": 32604
              },
              "DIRECTION": {
                "DESCRIPTION": [
                  {
                    "value": "WILMERSDORF",
                    "TYPE": "LOCAL"
                  },
                  {
                    "value": "WILMERSDORF",
                    "TYPE": "NTCSA"
                  },
                  {
                    "value": "WILMERSDORF",
                    "TYPE": "RDSGN"
                  }
                ],
                "ID": 0
              },
              "PROXIMITY": {
                "ID": "AT",
                "DESCRIPTION": "at"
              }
            }
          },
          "GEOLOC": {
            "ORIGIN": {
              "LATITUDE": 52.46181,
              "LONGITUDE": 13.42871
            },
            "TO": [
              {
                "LATITUDE": 52.46176,
                "LONGITUDE": 13.42836
              }
            ]
          },
          "NAVTECH": {
            "EDGE": {
              "EDGE_ID": [
                "1127234864"
              ]
            },
            "VERSION_ID": "202102"
          },
          "LENGTH": 0.01687
        },
        "TRAFFIC_ITEM_DETAIL": {
          "ROAD_CLOSED": false,
          "INCIDENT": {
            "RESPONSE_VEHICLES": false,
            "CONGESTION_INCIDENT": {
              "CONGESTION_TYPE_DESC": "CONGESTION",
              "CONGESTION_FACTOR": 50
            }
          },
          "ALERTC": [
            {
              "EVENT_CODE": 138
            }
          ]
        },
        "TRAFFIC_ITEM_DESCRIPTION": [
          {
            "value": "Bei Ortsteil Britz - Stockender Verkehr;; vorsichtig an das Stauende heranfahren.",
            "TYPE": "short_desc"
          },
          {
            "value": "Bei Ortsteil Britz - Stockender Verkehr;; vorsichtig an das Stauende heranfahren.",
            "TYPE": "desc"
          },
          {
            "value": "Stockender Verkehr;; vorsichtig an das Stauende heranfahren.",
            "TYPE": "no_exit_description"
          }
        ],
        "mid": "c341d540-a16e-4561-a51f-cf37de65da53|1629775042379",
        "PRODUCT": "basic"
      },
      {
        "TRAFFIC_ITEM_ID": 3055801059798790127,
        "ORIGINAL_TRAFFIC_ITEM_ID": 3504366210242175014,
        "TRAFFIC_ITEM_STATUS_SHORT_DESC": "ACTIVE",
        "TRAFFIC_ITEM_TYPE_DESC": "CONGESTION",
        "START_TIME": "08/24/2021 03:01:56",
        "END_TIME": "08/24/2021 03:28:19",
        "ENTRY_TIME": "08/24/2021 03:18:22",
        "CRITICALITY": {
          "ID": "2",
          "DESCRIPTION": "minor"
        },
        "VERIFIED": true,
        "ABBREVIATION": {
          "SHORT_DESC": "SLOW",
          "DESCRIPTION": "slow"
        },
        "RDS-TMC_LOCATIONS": {
          "RDS-TMC": [
            {
              "ORIGIN": {
                "EBU_COUNTRY_CODE": "D",
                "TABLE_ID": 1,
                "LOCATION_ID": "31679",
                "LOCATION_DESC": "M\u00fcnchen-Allach",
                "RDS_DIRECTION": "-"
              },
              "DIRECTION": "+",
              "ALERTC": {
                "TRAFFIC_CODE": 138,
                "ALERTC_Q_BINARY": "2",
                "QUANTIFIERS": 4,
                "DESCRIPTION": "Stockender Verkehr; Durchschnittsgeschwindigkeit von bis zu 10 km/h; vorsichtig an das Stauende heranfahren.",
                "ALERTC_DURATION": "D",
                "ALERTC_DIRECTION": 1,
                "URGENCY": "U",
                "UPDATE_CLASS": 1,
                "PHRASE_CODE": "A2.Z112",
                "EXTENT": "1",
                "DURATION": 0
              },
              "LENGTH": 0.7737,
              "PRIMARY_OFFSET": 1.02719
            }
          ]
        },
        "LOCATION": {
          "DEFINED": {
            "ORIGIN": {
              "ROADWAY": {
                "DESCRIPTION": [
                  {
                    "value": "Eschenrieder Spange",
                    "TYPE": "NTCSA"
                  },
                  {
                    "value": "Eschenrieder Spange",
                    "TYPE": "RDSGN"
                  },
                  {
                    "value": "Eschenrieder Spange",
                    "TYPE": "LOCAL"
                  }
                ],
                "ID": 31677
              },
              "POINT": {
                "DESCRIPTION": [
                  {
                    "value": "M\u00fcnchen-Eschenried",
                    "TYPE": "NTCSA"
                  },
                  {
                    "value": "M\u00fcnchen-Eschenried",
                    "TYPE": "RDSGN"
                  },
                  {
                    "value": "M\u00fcnchen-Eschenried",
                    "TYPE": "LOCAL"
                  },
                  {
                    "value": "Eschenrieder Spange",
                    "TYPE": "BNAME"
                  }
                ],
                "ID": 31679
              },
              "DIRECTION": {
                "DESCRIPTION": [
                  {
                    "value": "M\u00dcNCHEN-ALLACH",
                    "TYPE": "LOCAL"
                  },
                  {
                    "value": "M\u00dcNCHEN-ALLACH",
                    "TYPE": "NTCSA"
                  },
                  {
                    "value": "M\u00dcNCHEN-ALLACH",
                    "TYPE": "RDSGN"
                  }
                ],
                "ID": 0
              },
              "PROXIMITY": {
                "ID": "AT",
                "DESCRIPTION": "at"
              }
            },
            "TO": {
              "ROADWAY": {
                "DESCRIPTION": [
                  {
                    "value": "Eschenrieder Spange",
                    "TYPE": "NTCSA"
                  },
                  {
                    "value": "Eschenrieder Spange",
                    "TYPE": "RDSGN"
                  },
                  {
                    "value": "Eschenrieder Spange",
                    "TYPE": "LOCAL"
                  }
                ],
                "ID": 31677
              },
              "POINT": {
                "DESCRIPTION": [
                  {
                    "value": "M\u00fcnchen-Allach",
                    "TYPE": "NTCSA"
                  },
                  {
                    "value": "M\u00fcnchen-Allach",
                    "TYPE": "RDSGN"
                  },
                  {
                    "value": "M\u00fcnchen-Allach",
                    "TYPE": "LOCAL"
                  },
                  {
                    "value": "Eschenrieder Spange",
                    "TYPE": "BNAME"
                  }
                ],
                "ID": 31679
              },
              "DIRECTION": {
                "DESCRIPTION": [
                  {
                    "value": "M\u00dcNCHEN-ALLACH",
                    "TYPE": "LOCAL"
                  },
                  {
                    "value": "M\u00dcNCHEN-ALLACH",
                    "TYPE": "NTCSA"
                  },
                  {
                    "value": "M\u00dcNCHEN-ALLACH",
                    "TYPE": "RDSGN"
                  }
                ],
                "ID": 0
              },
              "PROXIMITY": {
                "ID": "AT",
                "DESCRIPTION": "at"
              }
            }
          },
          "GEOLOC": {
            "ORIGIN": {
              "LATITUDE": 48.20559,
              "LONGITUDE": 11.40984
            },
            "TO": [
              {
                "LATITUDE": 48.20463,
                "LONGITUDE": 11.42646
              }
            ]
          },
          "NAVTECH": {
            "EDGE": {
              "EDGE_ID": [
                "819422608"
              ]
            },
            "VERSION_ID": "202102"
          },
          "LENGTH": 0.7737
        },
        "TRAFFIC_ITEM_DETAIL": {
          "ROAD_CLOSED": false,
          "INCIDENT": {
            "RESPONSE_VEHICLES": false,
            "CONGESTION_INCIDENT": {
              "CONGESTION_TYPE_DESC": "CONGESTION",
              "CONGESTION_FACTOR": 50
            }
          },
          "ALERTC": [
            {
              "EVENT_CODE": 138,
              "ALERTC_Q": 2
            }
          ]
        },
        "TRAFFIC_ITEM_DESCRIPTION": [
          {
            "value": "Bei M\u00fcnchen-Allach - Stockender Verkehr; Durchschnittsgeschwindigkeit von bis zu 10 km/h; vorsichtig an das Stauende heranfahren.",
            "TYPE": "short_desc"
          },
          {
            "value": "Bei M\u00fcnchen-Allach - Stockender Verkehr; Durchschnittsgeschwindigkeit von bis zu 10 km/h; vorsichtig an das Stauende heranfahren.",
            "TYPE": "desc"
          },
          {
            "value": "Stockender Verkehr; Durchschnittsgeschwindigkeit von bis zu 10 km/h; vorsichtig an das Stauende heranfahren.",
            "TYPE": "no_exit_description"
          }
        ],
        "mid": "ad847e24-dde6-41a4-b7be-48ab0a714b4d|1629775102379",
        "PRODUCT": "basic"
      },
      {
        "TRAFFIC_ITEM_ID": 1231914505515978720,
        "ORIGINAL_TRAFFIC_ITEM_ID": 2848857192176751747,
        "TRAFFIC_ITEM_STATUS_SHORT_DESC": "ACTIVE",
        "TRAFFIC_ITEM_TYPE_DESC": "CONGESTION",
        "START_TIME": "08/24/2021 03:17:34",
        "END_TIME": "08/24/2021 03:28:19",
        "ENTRY_TIME": "08/24/2021 03:17:37",
        "CRITICALITY": {
          "ID": "2",
          "DESCRIPTION": "minor"
        },
        "VERIFIED": true,
        "ABBREVIATION": {
          "SHORT_DESC": "SLOW",
          "DESCRIPTION": "slow"
        },
        "RDS-TMC_LOCATIONS": {
          "RDS-TMC": [
            {
              "ORIGIN": {
                "EBU_COUNTRY_CODE": "D",
                "TABLE_ID": 1,
                "LOCATION_ID": "12381",
                "LOCATION_DESC": "Hamburg-Nordwest",
                "RDS_DIRECTION": "+"
              },
              "DIRECTION": "-",
              "ALERTC": {
                "TRAFFIC_CODE": 138,
                "QUANTIFIERS": 4,
                "DESCRIPTION": "Stockender Verkehr;; vorsichtig an das Stauende heranfahren.",
                "ALERTC_DURATION": "D",
                "ALERTC_DIRECTION": 1,
                "URGENCY": "U",
                "UPDATE_CLASS": 1,
                "PHRASE_CODE": "A2.Z112",
                "EXTENT": "1",
                "DURATION": 0
              },
              "LENGTH": 0.01342,
              "PRIMARY_OFFSET": 1.4099
            }
          ]
        },
        "LOCATION": {
          "DEFINED": {
            "ORIGIN": {
              "ROADWAY": {
                "DESCRIPTION": [
                  {
                    "value": "A7",
                    "TYPE": "NTCSA"
                  },
                  {
                    "value": "A7",
                    "TYPE": "RDSGN"
                  },
                  {
                    "value": "A7",
                    "TYPE": "LOCAL"
                  }
                ],
                "ID": 50163
              },
              "POINT": {
                "DESCRIPTION": [
                  {
                    "value": "Schnelsen",
                    "TYPE": "NTCSA"
                  },
                  {
                    "value": "Schnelsen",
                    "TYPE": "RDSGN"
                  },
                  {
                    "value": "Schnelsen",
                    "TYPE": "LOCAL"
                  },
                  {
                    "value": "A7",
                    "TYPE": "BNAME"
                  }
                ],
                "ID": 12381
              },
              "DIRECTION": {
                "DESCRIPTION": [
                  {
                    "value": "HAMBURG",
                    "TYPE": "LOCAL"
                  },
                  {
                    "value": "HAMBURG",
                    "TYPE": "NTCSA"
                  },
                  {
                    "value": "HAMBURG",
                    "TYPE": "RDSGN"
                  }
                ],
                "ID": 0
              },
              "PROXIMITY": {
                "ID": "AT",
                "DESCRIPTION": "at"
              }
            },
            "TO": {
              "ROADWAY": {
                "DESCRIPTION": [
                  {
                    "value": "A7",
                    "TYPE": "NTCSA"
                  },
                  {
                    "value": "A7",
                    "TYPE": "RDSGN"
                  },
                  {
                    "value": "A7",
                    "TYPE": "LOCAL"
                  }
                ],
                "ID": 50163
              },
              "POINT": {
                "DESCRIPTION": [
                  {
                    "value": "Hamburg-Nordwest",
                    "TYPE": "NTCSA"
                  },
                  {
                    "value": "Hamburg-Nordwest",
                    "TYPE": "RDSGN"
                  },
                  {
                    "value": "Hamburg-Nordwest",
                    "TYPE": "LOCAL"
                  },
                  {
                    "value": "A7",
                    "TYPE": "BNAME"
                  }
                ],
                "ID": 12381
              },
              "DIRECTION": {
                "DESCRIPTION": [
                  {
                    "value": "HAMBURG",
                    "TYPE": "LOCAL"
                  },
                  {
                    "value": "HAMBURG",
                    "TYPE": "NTCSA"
                  },
                  {
                    "value": "HAMBURG",
                    "TYPE": "RDSGN"
                  }
                ],
                "ID": 0
              },
              "PROXIMITY": {
                "ID": "AT",
                "DESCRIPTION": "at"
              }
            }
          },
          "GEOLOC": {
            "ORIGIN": {
              "LATITUDE": 53.63113,
              "LONGITUDE": 9.92252
            },
            "TO": [
              {
                "LATITUDE": 53.63096,
                "LONGITUDE": 9.92247
              }
            ]
          },
          "NAVTECH": {
            "EDGE": {
              "EDGE_ID": [
                "1286110776"
              ]
            },
            "VERSION_ID": "202102"
          },
          "LENGTH": 0.01342
        },
        "TRAFFIC_ITEM_DETAIL": {
          "ROAD_CLOSED": false,
          "INCIDENT": {
            "RESPONSE_VEHICLES": false,
            "CONGESTION_INCIDENT": {
              "CONGESTION_TYPE_DESC": "CONGESTION",
              "CONGESTION_FACTOR": 50
            }
          },
          "ALERTC": [
            {
              "EVENT_CODE": 138
            }
          ]
        },
        "TRAFFIC_ITEM_DESCRIPTION": [
          {
            "value": "Bei Hamburg-Nordwest - Stockender Verkehr;; vorsichtig an das Stauende heranfahren.",
            "TYPE": "short_desc"
          },
          {
            "value": "Bei Hamburg-Nordwest - Stockender Verkehr;; vorsichtig an das Stauende heranfahren.",
            "TYPE": "desc"
          },
          {
            "value": "Stockender Verkehr;; vorsichtig an das Stauende heranfahren.",
            "TYPE": "no_exit_description"
          }
        ],
        "mid": "44466890-5bde-4ef0-ae23-481555d47ef8|1629775057379",
        "PRODUCT": "basic"
      }
    ]
  },
  "diagnostic": {
    "info": "",
    "sfile": "Incident-E1409-1629775065926.xml.gz|pr1",
    "pdd": "trafficml-incident-24-v13"
  },
  "TIMESTAMP2": "2021-08-24T03:17:46.000+0000",
  "EXTENDED_COUNTRY_CODE": "E1"
}