{
  "TIMESTAMP": "08/22/2021 02:57:46 GMT",
  "VERSION": 2.3,
  "TRAFFIC_ITEMS": {
    "TRAFFIC_ITEM": [
      {
        "TRAFFIC_ITEM_ID": 1493746728853725542,
        "ORIGINAL_TRAFFIC_ITEM_ID": 4539338499009355440,
        "TRAFFIC_ITEM_STATUS_SHORT_DESC": "ACTIVE",
        "TRAFFIC_ITEM_TYPE_DESC": "CONGESTION",
        "START_TIME": "08/22/2021 02:56:16",
        "END_TIME": "08/22/2021 03:09:16",
        "ENTRY_TIME": "08/22/2021 02:59:19",
        "CRITICALITY": {
          "ID": "2",
          "DESCRIPTION": "minor"
        },
        "VERIFIED": true,
        "ABBREVIATION": {
          "SHORT_DESC": "SLOW",
          "DESCRIPTION": "slow"
        },
        "RDS-TMC_LOCATIONS": {
          "RDS-TMC": [
            {
              "ORIGIN": {
                "EBU_COUNTRY_CODE": "A",
                "TABLE_ID": 1,
                "LOCATION_ID": "35856",
                "LOCATION_DESC": "Europabr\u00fccke",
                "RDS_DIRECTION": "-"
              },
              "DIRECTION": "+",
              "ALERTC": {
                "TRAFFIC_CODE": 138,
                "ALERTC_Q_BINARY": "3",
                "QUANTIFIERS": 4,
                "DESCRIPTION": "Stockender Verkehr; Durchschnittsgeschwindigkeit von bis zu 15 km/h; vorsichtig an das Stauende heranfahren.",
                "ALERTC_DURATION": "D",
                "ALERTC_DIRECTION": 1,
                "URGENCY": "U",
                "UPDATE_CLASS": 1,
                "PHRASE_CODE": "A2.Z112",
                "EXTENT": "1",
                "DURATION": 0
              },
              "LENGTH": 0.01398,
              "PRIMARY_OFFSET": 0.0
            }
          ]
        },
        "LOCATION": {
          "DEFINED": {
            "ORIGIN": {
              "ROADWAY": {
                "DESCRIPTION": [
                  {
                    "value": "Brenner Autobahn",
                    "TYPE": "NTCSA"
                  },
                  {
                    "value": "Brenner Autobahn",
                    "TYPE": "RDSGN"
                  },
                  {
                    "value": "Brenner Autobahn",
                    "TYPE": "LOCAL"
                  }
                ],
                "ID": 30575
              },
              "POINT": {
                "DESCRIPTION": [
                  {
                    "value": "Patsch-Igls",
                    "TYPE": "NTCSA"
                  },
                  {
                    "value": "Patsch-Igls",
                    "TYPE": "RDSGN"
                  },
                  {
                    "value": "Patsch-Igls",
                    "TYPE": "LOCAL"
                  },
                  {
                    "value": "Brenner Autobahn",
                    "TYPE": "BNAME"
                  }
                ],
                "ID": 35856
              },
              "DIRECTION": {
                "DESCRIPTION": [
                  {
                    "value": "BRENNER",
                    "TYPE": "LOCAL"
                  },
                  {
                    "value": "BRENNER",
                    "TYPE": "NTCSA"
                  },
                  {
                    "value": "BRENNER",
                    "TYPE": "RDSGN"
                  }
                ],
                "ID": 0
              },
              "PROXIMITY": {
                "ID": "AT",
                "DESCRIPTION": "at"
              }
            },
            "TO": {
              "ROADWAY": {
                "DESCRIPTION": [
                  {
                    "value": "Brenner Autobahn",
                    "TYPE": "NTCSA"
                  },
                  {
                    "value": "Brenner Autobahn",
                    "TYPE": "RDSGN"
                  },
                  {
                    "value": "Brenner Autobahn",
                    "TYPE": "LOCAL"
                  }
                ],
                "ID": 30575
              },
              "POINT": {
                "DESCRIPTION": [
                  {
                    "value": "Europabr\u00fccke",
                    "TYPE": "NTCSA"
                  },
                  {
                    "value": "Europabr\u00fccke",
                    "TYPE": "RDSGN"
                  },
                  {
                    "value": "Europabr\u00fccke",
                    "TYPE": "LOCAL"
                  },
                  {
                    "value": "Brenner Autobahn",
                    "TYPE": "BNAME"
                  }
                ],
                "ID": 35856
              },
              "DIRECTION": {
                "DESCRIPTION": [
                  {
                    "value": "BRENNER",
                    "TYPE": "LOCAL"
                  },
                  {
                    "value": "BRENNER",
                    "TYPE": "NTCSA"
                  },
                  {
                    "value": "BRENNER",
                    "TYPE": "RDSGN"
                  }
                ],
                "ID": 0
              },
              "PROXIMITY": {
                "ID": "AT",
                "DESCRIPTION": "at"
              }
            }
          },
          "GEOLOC": {
            "ORIGIN": {
              "LATITUDE": 47.19921,
              "LONGITUDE": 11.3995
            },
            "TO": [
              {
                "LATITUDE": 47.19903,
                "LONGITUDE": 11.39937
              }
            ]
          },
          "NAVTECH": {
            "EDGE": {
              "EDGE_ID": [
                "1241807713"
              ]
            },
            "VERSION_ID": "202102"
          },
          "LENGTH": 0.01398
        },
        "TRAFFIC_ITEM_DETAIL": {
          "ROAD_CLOSED": false,
          "INCIDENT": {
            "RESPONSE_VEHICLES": false,
            "CONGESTION_INCIDENT": {
              "CONGESTION_TYPE_DESC": "CONGESTION",
              "CONGESTION_FACTOR": 50
            }
          },
          "ALERTC": [
            {
              "EVENT_CODE": 138,
              "ALERTC_Q": 3
            }
          ]
        },
        "TRAFFIC_ITEM_DESCRIPTION": [
          {
            "value": "Bei Europabr\u00fccke - Stockender Verkehr; Durchschnittsgeschwindigkeit von bis zu 15 km/h; vorsichtig an das Stauende heranfahren.",
            "TYPE": "short_desc"
          },
          {
            "value": "Bei Europabr\u00fccke - Stockender Verkehr; Durchschnittsgeschwindigkeit von bis zu 15 km/h; vorsichtig an das Stauende heranfahren.",
            "TYPE": "desc"
          },
          {
            "value": "Stockender Verkehr; Durchschnittsgeschwindigkeit von bis zu 15 km/h; vorsichtig an das Stauende heranfahren.",
            "TYPE": "no_exit_description"
          }
        ],
        "mid": "98738909-fb6e-4c0a-9383-2f9de172c0bb|1629601159604",
        "PRODUCT": "basic"
      },
      {
        "TRAFFIC_ITEM_ID": 2676735319161517495,
        "ORIGINAL_TRAFFIC_ITEM_ID": 3768342923902839645,
        "TRAFFIC_ITEM_STATUS_SHORT_DESC": "ACTIVE",
        "TRAFFIC_ITEM_TYPE_DESC": "CONGESTION",
        "START_TIME": "08/22/2021 02:52:06",
        "END_TIME": "08/22/2021 03:08:21",
        "ENTRY_TIME": "08/22/2021 02:58:24",
        "CRITICALITY": {
          "ID": "2",
          "DESCRIPTION": "minor"
        },
        "VERIFIED": true,
        "ABBREVIATION": {
          "SHORT_DESC": "SLOW",
          "DESCRIPTION": "slow"
        },
        "RDS-TMC_LOCATIONS": {
          "RDS-TMC": [
            {
              "ORIGIN": {
                "EBU_COUNTRY_CODE": "F",
                "TABLE_ID": 32,
                "LOCATION_ID": "12420",
                "LOCATION_DESC": "P\u00e9age de Saint-Maurice",
                "RDS_DIRECTION": "-"
              },
              "DIRECTION": "+",
              "ALERTC": {
                "TRAFFIC_CODE": 138,
                "QUANTIFIERS": 4,
                "DESCRIPTION": "Trafic en accord\u00e9on. Avancez prudemment.",
                "ALERTC_DURATION": "D",
                "ALERTC_DIRECTION": 1,
                "URGENCY": "U",
                "UPDATE_CLASS": 1,
                "PHRASE_CODE": "A2.Z112",
                "EXTENT": "1",
                "DURATION": 0
              },
              "LENGTH": 0.02231,
              "PRIMARY_OFFSET": 0.06398
            }
          ]
        },
        "LOCATION": {
          "DEFINED": {
            "ORIGIN": {
              "ROADWAY": {
                "DESCRIPTION": [
                  {
                    "value": "La Comtoise",
                    "TYPE": "NTCSA"
                  },
                  {
                    "value": "La Comtoise",
                    "TYPE": "RDSGN"
                  },
                  {
                    "value": "La Comtoise",
                    "TYPE": "LOCAL"
                  }
                ],
                "ID": 5027
              },
              "POINT": {
                "DESCRIPTION": [
                  {
                    "value": "L'Isle-sur-le-Doubs",
                    "TYPE": "NTCSA"
                  },
                  {
                    "value": "L'Isle-sur-le-Doubs",
                    "TYPE": "RDSGN"
                  },
                  {
                    "value": "L'Isle-sur-le-Doubs",
                    "TYPE": "LOCAL"
                  },
                  {
                    "value": "La Comtoise",
                    "TYPE": "BNAME"
                  }
                ],
                "ID": 12420
              },
              "DIRECTION": {
                "DESCRIPTION": [
                  {
                    "value": "MONB\u00c9LIARD",
                    "TYPE": "LOCAL"
                  },
                  {
                    "value": "MONB\u00c9LIARD",
                    "TYPE": "NTCSA"
                  },
                  {
                    "value": "MONB\u00c9LIARD",
                    "TYPE": "RDSGN"
                  }
                ],
                "ID": 0
              },
              "PROXIMITY": {
                "ID": "AT",
                "DESCRIPTION": "at"
              }
            },
            "TO": {
              "ROADWAY": {
                "DESCRIPTION": [
                  {
                    "value": "La Comtoise",
                    "TYPE": "NTCSA"
                  },
                  {
                    "value": "La Comtoise",
                    "TYPE": "RDSGN"
                  },
                  {
                    "value": "La Comtoise",
                    "TYPE": "LOCAL"
                  }
                ],
                "ID": 5027
              },
              "POINT": {
                "DESCRIPTION": [
                  {
                    "value": "P\u00e9age de Saint-Maurice",
                    "TYPE": "NTCSA"
                  },
                  {
                    "value": "P\u00e9age de Saint-Maurice",
                    "TYPE": "RDSGN"
                  },
                  {
                    "value": "P\u00e9age de Saint-Maurice",
                    "TYPE": "LOCAL"
                  },
                  {
                    "value": "La Comtoise",
                    "TYPE": "BNAME"
                  }
                ],
                "ID": 12420
              },
              "DIRECTION": {
                "DESCRIPTION": [
                  {
                    "value": "MONB\u00c9LIARD",
                    "TYPE": "LOCAL"
                  },
                  {
                    "value": "MONB\u00c9LIARD",
                    "TYPE": "NTCSA"
                  },
                  {
                    "value": "MONB\u00c9LIARD",
                    "TYPE": "RDSGN"
                  }
                ],
                "ID": 0
              },
              "PROXIMITY": {
                "ID": "AT",
                "DESCRIPTION": "at"
              }
            }
          },
          "GEOLOC": {
            "ORIGIN": {
              "LATITUDE": 47.42551,
              "LONGITUDE": 6.67045
            },
            "TO": [
              {
                "LATITUDE": 47.42541,
                "LONGITUDE": 6.67065
              }
            ]
          },
          "NAVTECH": {
            "EDGE": {
              "EDGE_ID": [
                "1215707868"
              ]
            },
            "VERSION_ID": "202102"
          },
          "LENGTH": 0.02231
        },
        "TRAFFIC_ITEM_DETAIL": {
          "ROAD_CLOSED": false,
          "INCIDENT": {
            "RESPONSE_VEHICLES": false,
            "CONGESTION_INCIDENT": {
              "CONGESTION_TYPE_DESC": "CONGESTION",
              "CONGESTION_FACTOR": 50
            }
          },
          "ALERTC": [
            {
              "EVENT_CODE": 138
            }
          ]
        },
        "TRAFFIC_ITEM_DESCRIPTION": [
          {
            "value": "\u00c0 P\u00e9age de Saint-Maurice - Trafic en accord\u00e9on. Avancez prudemment.",
            "TYPE": "short_desc"
          },
          {
            "value": "\u00c0 P\u00e9age de Saint-Maurice - Trafic en accord\u00e9on. Avancez prudemment.",
            "TYPE": "desc"
          },
          {
            "value": "Trafic en accord\u00e9on. Avancez prudemment.",
            "TYPE": "no_exit_description"
          }
        ],
        "mid": "ad4f2207-b476-4676-b38a-90ecbc37a8c4|1629601104604",
        "PRODUCT": "basic"
      },
      {
        "TRAFFIC_ITEM_ID": 861936340427139902,
        "ORIGINAL_TRAFFIC_ITEM_ID": 1221944197334576025,
        "TRAFFIC_ITEM_STATUS_SHORT_DESC": "ACTIVE",
        "TRAFFIC_ITEM_TYPE_DESC": "CONGESTION",
        "START_TIME": "08/22/2021 02:50:37",
        "END_TIME": "08/22/2021 03:09:16",
        "ENTRY_TIME": "08/22/2021 02:59:19",
        "CRITICALITY": {
          "ID": "2",
          "DESCRIPTION": "minor"
        },
        "VERIFIED": true,
        "ABBREVIATION": {
          "SHORT_DESC": "SLOW",
          "DESCRIPTION": "slow"
        },
        "RDS-TMC_LOCATIONS": {
          "RDS-TMC": [
            {
              "ORIGIN": {
                "EBU_COUNTRY_CODE": "A",
                "TABLE_ID": 1,
                "LOCATION_ID": "32465",
                "LOCATION_DESC": "Raststation Walserberg-Nord",
                "RDS_DIRECTION": "-"
              },
              "DIRECTION": "+",
              "ALERTC": {
                "TRAFFIC_CODE": 138,
                "QUANTIFIERS": 4,
                "DESCRIPTION": "Stockender Verkehr;; vorsichtig an das Stauende heranfahren.",
                "ALERTC_DURATION": "D",
                "ALERTC_DIRECTION": 1,
                "URGENCY": "U",
                "UPDATE_CLASS": 1,
                "PHRASE_CODE": "A2.Z112",
                "EXTENT": "1",
                "DURATION": 0
              },
              "LENGTH": 0.06118,
              "PRIMARY_OFFSET": 0.39431
            }
          ]
        },
        "LOCATION": {
          "DEFINED": {
            "ORIGIN": {
              "ROADWAY": {
                "DESCRIPTION": [
                  {
                    "value": "West Autobahn",
                    "TYPE": "NTCSA"
                  },
                  {
                    "value": "West Autobahn",
                    "TYPE": "RDSGN"
                  },
                  {
                    "value": "West Autobahn",
                    "TYPE": "LOCAL"
                  }
                ],
                "ID": 30603
              },
              "POINT": {
                "DESCRIPTION": [
                  {
                    "value": "Salzburg",
                    "TYPE": "NTCSA"
                  },
                  {
                    "value": "Salzburg",
                    "TYPE": "RDSGN"
                  },
                  {
                    "value": "Salzburg",
                    "TYPE": "LOCAL"
                  },
                  {
                    "value": "West Autobahn",
                    "TYPE": "BNAME"
                  }
                ],
                "ID": 32465
              },
              "DIRECTION": {
                "DESCRIPTION": [
                  {
                    "value": "ROSENHEIM",
                    "TYPE": "LOCAL"
                  },
                  {
                    "value": "ROSENHEIM",
                    "TYPE": "NTCSA"
                  },
                  {
                    "value": "ROSENHEIM",
                    "TYPE": "RDSGN"
                  }
                ],
                "ID": 0
              },
              "PROXIMITY": {
                "ID": "AT",
                "DESCRIPTION": "at"
              }
            },
            "TO": {
              "ROADWAY": {
                "DESCRIPTION": [
                  {
                    "value": "West Autobahn",
                    "TYPE": "NTCSA"
                  },
                  {
                    "value": "West Autobahn",
                    "TYPE": "RDSGN"
                  },
                  {
                    "value": "West Autobahn",
                    "TYPE": "LOCAL"
                  }
                ],
                "ID": 30603
              },
              "POINT": {
                "DESCRIPTION": [
                  {
                    "value": "Raststation Walserberg-Nord",
                    "TYPE": "NTCSA"
                  },
                  {
                    "value": "Raststation Walserberg-Nord",
                    "TYPE": "RDSGN"
                  },
                  {
                    "value": "Raststation Walserberg-Nord",
                    "TYPE": "LOCAL"
                  },
                  {
                    "value": "West Autobahn",
                    "TYPE": "BNAME"
                  }
                ],
                "ID": 32465
              },
              "DIRECTION": {
                "DESCRIPTION": [
                  {
                    "value": "ROSENHEIM",
                    "TYPE": "LOCAL"
                  },
                  {
                    "value": "ROSENHEIM",
                    "TYPE": "NTCSA"
                  },
                  {
                    "value": "ROSENHEIM",
                    "TYPE": "RDSGN"
                  }
                ],
                "ID": 0
              },
              "PROXIMITY": {
                "ID": "AT",
                "DESCRIPTION": "at"
              }
            }
          },
          "GEOLOC": {
            "ORIGIN": {
              "LATITUDE": 47.76893,
              "LONGITUDE": 12.96172
            },
            "TO": [
              {
                "LATITUDE": 47.7689,
                "LONGITUDE": 12.96044
              }
            ]
          },
          "NAVTECH": {
            "EDGE": {
              "EDGE_ID": [
                "1259042860"
              ]
            },
            "VERSION_ID": "202102"
          },
          "LENGTH": 0.06118
        },
        "TRAFFIC_ITEM_DETAIL": {
          "ROAD_CLOSED": false,
          "INCIDENT": {
            "RESPONSE_VEHICLES": false,
            "CONGESTION_INCIDENT": {
              "CONGESTION_TYPE_DESC": "CONGESTION",
              "CONGESTION_FACTOR": 50
            }
          },
          "ALERTC": [
            {
              "EVENT_CODE": 138
            }
          ]
        },
        "TRAFFIC_ITEM_DESCRIPTION": [
          {
            "value": "Bei Raststation Walserberg-Nord - Stockender Verkehr;; vorsichtig an das Stauende heranfahren.",
            "TYPE": "short_desc"
          },
          {
            "value": "Bei Raststation Walserberg-Nord - Stockender Verkehr;; vorsichtig an das Stauende heranfahren.",
            "TYPE": "desc"
          },
          {
            "value": "Stockender Verkehr;; vorsichtig an das Stauende heranfahren.",
            "TYPE": "no_exit_description"
          }
        ],
        "mid": "aacedcdd-3660-4bc1-b36f-792f5f6f0e92|1629601159604",
        "PRODUCT": "basic"
      },
      {
        "TRAFFIC_ITEM_ID": 372988050315281312,
        "ORIGINAL_TRAFFIC_ITEM_ID": 372988050315281312,
        "TRAFFIC_ITEM_STATUS_SHORT_DESC": "ACTIVE",
        "TRAFFIC_ITEM_TYPE_DESC": "CONGESTION",
        "START_TIME": "08/22/2021 02:59:16",
        "END_TIME": "08/22/2021 03:09:16",
        "ENTRY_TIME": "08/22/2021 02:59:19",
        "CRITICALITY": {
          "ID": "2",
          "DESCRIPTION": "minor"
        },
        "VERIFIED": true,
        "ABBREVIATION": {
          "SHORT_DESC": "SLOW",
          "DESCRIPTION": "slow"
        },
        "RDS-TMC_LOCATIONS": {
          "RDS-TMC": [
            {
              "ORIGIN": {
                "EBU_COUNTRY_CODE": "A",
                "TABLE_ID": 1,
                "LOCATION_ID": "35947",
                "LOCATION_DESC": "Mautstelle Bosruck",
                "RDS_DIRECTION": "+"
              },
              "DIRECTION": "-",
              "ALERTC": {
                "TRAFFIC_CODE": 138,
                "QUANTIFIERS": 4,
                "DESCRIPTION": "Stockender Verkehr;; vorsichtig an das Stauende heranfahren.",
                "ALERTC_DURATION": "D",
                "ALERTC_DIRECTION": 1,
                "URGENCY": "U",
                "UPDATE_CLASS": 1,
                "PHRASE_CODE": "A2.Z112",
                "EXTENT": "1",
                "DURATION": 0
              },
              "LENGTH": 0.01365,
              "PRIMARY_OFFSET": 0.08749
            }
          ]
        },
        "LOCATION": {
          "DEFINED": {
            "ORIGIN": {
              "ROADWAY": {
                "DESCRIPTION": [
                  {
                    "value": "Pyhrn Autobahn",
                    "TYPE": "NTCSA"
                  },
                  {
                    "value": "Pyhrn Autobahn",
                    "TYPE": "RDSGN"
                  },
                  {
                    "value": "Pyhrn Autobahn",
                    "TYPE": "LOCAL"
                  }
                ],
                "ID": 30562
              },
              "POINT": {
                "DESCRIPTION": [
                  {
                    "value": "Ardning-Admont",
                    "TYPE": "NTCSA"
                  },
                  {
                    "value": "Ardning-Admont",
                    "TYPE": "RDSGN"
                  },
                  {
                    "value": "Ardning-Admont",
                    "TYPE": "LOCAL"
                  },
                  {
                    "value": "Pyhrn Autobahn",
                    "TYPE": "BNAME"
                  }
                ],
                "ID": 35947
              },
              "DIRECTION": {
                "DESCRIPTION": [
                  {
                    "value": "VORALPENKREUZ",
                    "TYPE": "LOCAL"
                  },
                  {
                    "value": "VORALPENKREUZ",
                    "TYPE": "NTCSA"
                  },
                  {
                    "value": "VORALPENKREUZ",
                    "TYPE": "RDSGN"
                  }
                ],
                "ID": 0
              },
              "PROXIMITY": {
                "ID": "AT",
                "DESCRIPTION": "at"
              }
            },
            "TO": {
              "ROADWAY": {
                "DESCRIPTION": [
                  {
                    "value": "Pyhrn Autobahn",
                    "TYPE": "NTCSA"
                  },
                  {
                    "value": "Pyhrn Autobahn",
                    "TYPE": "RDSGN"
                  },
                  {
                    "value": "Pyhrn Autobahn",
                    "TYPE": "LOCAL"
                  }
                ],
                "ID": 30562
              },
              "POINT": {
                "DESCRIPTION": [
                  {
                    "value": "Mautstelle Bosruck",
                    "TYPE": "NTCSA"
                  },
                  {
                    "value": "Mautstelle Bosruck",
                    "TYPE": "RDSGN"
                  },
                  {
                    "value": "Mautstelle Bosruck",
                    "TYPE": "LOCAL"
                  },
                  {
                    "value": "Pyhrn Autobahn",
                    "TYPE": "BNAME"
                  }
                ],
                "ID": 35947
              },
              "DIRECTION": {
                "DESCRIPTION": [
                  {
                    "value": "VORALPENKREUZ",
                    "TYPE": "LOCAL"
                  },
                  {
                    "value": "VORALPENKREUZ",
                    "TYPE": "NTCSA"
                  },
                  {
                    "value": "VORALPENKREUZ",
                    "TYPE": "RDSGN"
                  }
                ],
                "ID": 0
              },
              "PROXIMITY": {
                "ID": "AT",
                "DESCRIPTION": "at"
              }
            }
          },
          "GEOLOC": {
            "ORIGIN": {
              "LATITUDE": 47.57644,
              "LONGITUDE": 14.31724
            },
            "TO": [
              {
                "LATITUDE": 47.5766,
                "LONGITUDE": 14.31741
              }
            ]
          },
          "NAVTECH": {
            "EDGE": {
              "EDGE_ID": [
                "1210436166"
              ]
            },
            "VERSION_ID": "202102"
          },
          "LENGTH": 0.01365
        },
        "TRAFFIC_ITEM_DETAIL": {
          "ROAD_CLOSED": false,
          "INCIDENT": {
            "RESPONSE_VEHICLES": false,
            "CONGESTION_INCIDENT": {
              "CONGESTION_TYPE_DESC": "CONGESTION",
              "CONGESTION_FACTOR": 50
            }
          },
          "ALERTC": [
            {
              "EVENT_CODE": 138
            }
          ]
        },
        "TRAFFIC_ITEM_DESCRIPTION": [
          {
            "value": "Bei Mautstelle Bosruck - Stockender Verkehr;; vorsichtig an das Stauende heranfahren.",
            "TYPE": "short_desc"
          },
          {
            "value": "Bei Mautstelle Bosruck - Stockender Verkehr;; vorsichtig an das Stauende heranfahren.",
            "TYPE": "desc"
          },
          {
            "value": "Stockender Verkehr;; vorsichtig an das Stauende heranfahren.",
            "TYPE": "no_exit_description"
          }
        ],
        "mid": "a8db9a65-4636-4f89-bd68-821b5dcd89f5|1629601159604",
        "PRODUCT": "basic"
      },
      {
        "TRAFFIC_ITEM_ID": 799307282913902439,
        "ORIGINAL_TRAFFIC_ITEM_ID": 3574925355846122328,
        "TRAFFIC_ITEM_STATUS_SHORT_DESC": "ACTIVE",
        "TRAFFIC_ITEM_TYPE_DESC": "CONGESTION",
        "START_TIME": "08/22/2021 02:25:22",
        "END_TIME": "08/22/2021 03:08:19",
        "ENTRY_TIME": "08/22/2021 02:58:19",
        "CRITICALITY": {
          "ID": "2",
          "DESCRIPTION": "minor"
        },
        "VERIFIED": true,
        "ABBREVIATION": {
          "SHORT_DESC": "SLOW",
          "DESCRIPTION": "slow"
        },
        "RDS-TMC_LOCATIONS": {
          "RDS-TMC": [
            {
              "ORIGIN": {
                "EBU_COUNTRY_CODE": "D",
                "TABLE_ID": 1,
                "LOCATION_ID": "32605",
                "LOCATION_DESC": "Britzer Damm",
                "RDS_DIRECTION": "-"
              },
              "DIRECTION": "+",
              "ALERTC": {
                "TRAFFIC_CODE": 138,
                "QUANTIFIERS": 4,
                "DESCRIPTION": "Stockender Verkehr;; vorsichtig an das Stauende heranfahren.",
                "ALERTC_DURATION": "D",
                "ALERTC_DIRECTION": 1,
                "URGENCY": "U",
                "UPDATE_CLASS": 1,
                "PHRASE_CODE": "A2.Z112",
                "EXTENT": "1",
                "DURATION": 0
              },
              "LENGTH": 0.03155,
              "PRIMARY_OFFSET": 0.22226
            }
          ]
        },
        "LOCATION": {
          "DEFINED": {
            "ORIGIN": {
              "ROADWAY": {
                "DESCRIPTION": [
                  {
                    "value": "Stadtring Berlin",
                    "TYPE": "NTCSA"
                  },
                  {
                    "value": "Stadtring Berlin",
                    "TYPE": "RDSGN"
                  },
                  {
                    "value": "Stadtring Berlin",
                    "TYPE": "LOCAL"
                  }
                ],
                "ID": 50062
              },
              "POINT": {
                "DESCRIPTION": [
                  {
                    "value": "Ortsteil Britz",
                    "TYPE": "NTCSA"
                  },
                  {
                    "value": "Ortsteil Britz",
                    "TYPE": "RDSGN"
                  },
                  {
                    "value": "Ortsteil Britz",
                    "TYPE": "LOCAL"
                  },
                  {
                    "value": "Stadtring Berlin",
                    "TYPE": "BNAME"
                  }
                ],
                "ID": 32605
              },
              "DIRECTION": {
                "DESCRIPTION": [
                  {
                    "value": "NEUK\u00d6LLN",
                    "TYPE": "LOCAL"
                  },
                  {
                    "value": "NEUK\u00d6LLN",
                    "TYPE": "NTCSA"
                  },
                  {
                    "value": "NEUK\u00d6LLN",
                    "TYPE": "RDSGN"
                  }
                ],
                "ID": 0
              },
              "PROXIMITY": {
                "ID": "AT",
                "DESCRIPTION": "at"
              }
            },
            "TO": {
              "ROADWAY": {
                "DESCRIPTION": [
                  {
                    "value": "Stadtring Berlin",
                    "TYPE": "NTCSA"
                  },
                  {
                    "value": "Stadtring Berlin",
                    "TYPE": "RDSGN"
                  },
                  {
                    "value": "Stadtring Berlin",
                    "TYPE": "LOCAL"
                  }
                ],
                "ID": 50062
              },
              "POINT": {
                "DESCRIPTION": [
                  {
                    "value": "Britzer Damm",
                    "TYPE": "NTCSA"
                  },
                  {
                    "value": "Britzer Damm",
                    "TYPE": "RDSGN"
                  },
                  {
                    "value": "Britzer Damm",
                    "TYPE": "LOCAL"
                  },
                  {
                    "value": "Stadtring Berlin",
                    "TYPE": "BNAME"
                  }
                ],
                "ID": 32605
              },
              "DIRECTION": {
                "DESCRIPTION": [
                  {
                    "value": "NEUK\u00d6LLN",
                    "TYPE": "LOCAL"
                  },
                  {
                    "value": "NEUK\u00d6LLN",
                    "TYPE": "NTCSA"
                  },
                  {
                    "value": "NEUK\u00d6LLN",
                    "TYPE": "RDSGN"
                  }
                ],
                "ID": 0
              },
              "PROXIMITY": {
                "ID": "AT",
                "DESCRIPTION": "at"
              }
            }
          },
          "GEOLOC": {
            "ORIGIN": {
              "LATITUDE": 52.46169,
              "LONGITUDE": 13.42866
            },
            "TO": [
              {
                "LATITUDE": 52.46178,
                "LONGITUDE": 13.42939
              }
            ]
          },
          "NAVTECH": {
            "EDGE": {
              "EDGE_ID": [
                "1209405870"
              ]
            },
            "VERSION_ID": "202102"
          },
          "LENGTH": 0.03155
        },
        "TRAFFIC_ITEM_DETAIL": {
          "ROAD_CLOSED": false,
          "INCIDENT": {
            "RESPONSE_VEHICLES": false,
            "CONGESTION_INCIDENT": {
              "CONGESTION_TYPE_DESC": "CONGESTION",
              "CONGESTION_FACTOR": 50
            }
          },
          "ALERTC": [
            {
              "EVENT_CODE": 138
            }
          ]
        },
        "TRAFFIC_ITEM_DESCRIPTION": [
          {
            "value": "Bei Britzer Damm - Stockender Verkehr;; vorsichtig an das Stauende heranfahren.",
            "TYPE": "short_desc"
          },
          {
            "value": "Bei Britzer Damm - Stockender Verkehr;; vorsichtig an das Stauende heranfahren.",
            "TYPE": "desc"
          },
          {
            "value": "Stockender Verkehr;; vorsichtig an das Stauende heranfahren.",
            "TYPE": "no_exit_description"
          }
        ],
        "mid": "be345dd0-1e3b-4498-9044-4d75ded44943|1629601099604",
        "PRODUCT": "basic"
      }
    ]
  },
  "diagnostic": {
    "info": "",
    "sfile": "Incident-E1409-1629601065926.xml.gz|pr1",
    "pdd": "trafficml-incident-24-v13"
  },
  "TIMESTAMP2": "2021-08-22T02:57:46.000+0000",
  "EXTENDED_COUNTRY_CODE": "E1"
}