^C:\Users\root\source\repos\WinAPI1\WinAPI1\WinAPI1.vcxproj
C:\Users\root\source\repos\WinAPI1\Release\AlexPlotkin.ipdb
C:\Users\root\source\repos\WinAPI1\Release\AlexPlotkin.iobj
^C:\Users\root\source\repos\WinAPI1\WinAPI1\WinAPI1.vcxproj
C:\Users\root\source\repos\WinAPI1\Release\AlexPlotkin.ipdb
C:\Users\root\source\repos\WinAPI1\Release\AlexPlotkin.iobj
^C:\Users\root\source\repos\WinAPI1\WinAPI1\WinAPI1.vcxproj
C:\Users\root\source\repos\WinAPI1\Release\AlexPlotkin.ipdb
C:\Users\root\source\repos\WinAPI1\Release\AlexPlotkin.iobj
^C:\Users\root\source\repos\WinAPI1\WinAPI1\WinAPI1.vcxproj
C:\Users\root\source\repos\WinAPI1\Release\AlexPlotkin.ipdb
C:\Users\root\source\repos\WinAPI1\Release\AlexPlotkin.iobj
^C:\Users\root\source\repos\WinAPI1\WinAPI1\WinAPI1.vcxproj
C:\Users\root\source\repos\WinAPI1\Release\AlexPlotkin.ipdb
C:\Users\root\source\repos\WinAPI1\Release\AlexPlotkin.iobj
^C:\Users\root\source\repos\WinAPI1\WinAPI1\WinAPI1.vcxproj
C:\Users\root\source\repos\WinAPI1\Release\AlexPlotkin.ipdb
C:\Users\root\source\repos\WinAPI1\Release\AlexPlotkin.iobj
^C:\Users\root\source\repos\WinAPI1\WinAPI1\WinAPI1.vcxproj
C:\Users\root\source\repos\WinAPI1\Release\AlexPlotkin.ipdb
C:\Users\root\source\repos\WinAPI1\Release\AlexPlotkin.iobj
^C:\Users\root\source\repos\WinAPI1\WinAPI1\WinAPI1.vcxproj
C:\Users\root\source\repos\WinAPI1\Release\AlexPlotkin.ipdb
C:\Users\root\source\repos\WinAPI1\Release\AlexPlotkin.iobj
^C:\Users\root\source\repos\WinAPI1\WinAPI1\WinAPI1.vcxproj
C:\Users\root\source\repos\WinAPI1\Release\AlexPlotkin.ipdb
C:\Users\root\source\repos\WinAPI1\Release\AlexPlotkin.iobj
^C:\Users\root\source\repos\WinAPI1\WinAPI1\WinAPI1.vcxproj
C:\Users\root\source\repos\WinAPI1\Release\AlexPlotkin.ipdb
C:\Users\root\source\repos\WinAPI1\Release\AlexPlotkin.iobj
^C:\Users\root\source\repos\WinAPI1\WinAPI1\WinAPI1.vcxproj
C:\Users\root\source\repos\WinAPI1\Release\AlexPlotkin.ipdb
C:\Users\root\source\repos\WinAPI1\Release\AlexPlotkin.iobj
^C:\Users\root\source\repos\WinAPI1\WinAPI1\WinAPI1.vcxproj
C:\Users\root\source\repos\WinAPI1\Release\AlexPlotkin.ipdb
C:\Users\root\source\repos\WinAPI1\Release\AlexPlotkin.iobj
^C:\Users\root\source\repos\WinAPI1\WinAPI1\WinAPI1.vcxproj
C:\Users\root\source\repos\WinAPI1\Release\AlexPlotkin.ipdb
C:\Users\root\source\repos\WinAPI1\Release\AlexPlotkin.iobj
^C:\Users\root\source\repos\WinAPI1\WinAPI1\WinAPI1.vcxproj
C:\Users\root\source\repos\WinAPI1\Release\AlexPlotkin.ipdb
C:\Users\root\source\repos\WinAPI1\Release\AlexPlotkin.iobj
^C:\Users\root\source\repos\WinAPI1\WinAPI1\WinAPI1.vcxproj
C:\Users\root\source\repos\WinAPI1\Release\AlexPlotkin.ipdb
C:\Users\root\source\repos\WinAPI1\Release\AlexPlotkin.iobj
