{
  "formpost": {},
  "bulk_delete": {
    "max_failed_deletes": 1000,
    "max_deletes_per_request": 10000
  },
  "crossdomain": {},
  "container_quotas": {},
  "cname_lookup": {"lookup_depth": 1},
  "swift": {
    "max_file_size": 5368709122, "account_listing_limit": 10000}}
