{
  "minerAddress": "03fe803718c227abc3bb366d548a37bce44e4618e076fc0553507db1307d389c29",
  "node": {
    "port": 3002,
    "peers": [
      "ws://127.0.0.1:3000",
      "ws://127.0.0.1:3001",
      "ws://127.0.0.1:3002"
    ]
  },
  "restApi": {
    "port": 7002
  }
}
