{
  "movements": [
    {
      "id": 1,
      "date": "2020-10-05",
      "amount": 10
    },
    {
      "id": 2,
      "date": "2021-01-07",
      "amount": 20
    },
    {
      "id": 3,
      "date": "2021-02-01",
      "amount": 20
    },
    {
      "id": 4,
      "date": "2021-03-31",
      "amount": -30
    },
    {
      "id": 5,
      "date": "2021-04-08",
      "amount": 40
    }
  ],
  "balances": [
    {
      "date": "2020-01-31",
      "balance": 70
    },
    {
      "date": "2021-03-31",
      "balance": 90
    },
    {
      "date": "2021-01-31",
      "balance": 100
    },
    {
      "date": "2021-02-28",
      "balance": 120
    },
    {
      "date": "2021-05-31",
      "balance": 130
    }
  ]
}
