(export (version D)
  (design
    (source /home/scott/Documents/ee/kicad-projects/FE-5680/FE-5680.sch)
    (date "Sat 18 Jan 2020 11:00:17 PM CST")
    (tool "Eeschema 5.1.5")
    (sheet (number 1) (name /) (tstamps /)
      (title_block
        (title "FE-5680 Support")
        (company Drakelabs)
        (rev 1.5)
        (date 2020-01-14)
        (source FE-5680.sch)
        (comment (number 1) (value "Top level components."))
        (comment (number 2) (value "The physics package, a microcontroller, power supply, and distribution amplifier."))
        (comment (number 3) (value ""))
        (comment (number 4) (value ""))))
    (sheet (number 2) (name "/FE-5680 Package/") (tstamps /5DFD8BA8/)
      (title_block
        (title "FE-5680A PHY")
        (company Drakelabs)
        (rev 1.5)
        (date 2020-01-14)
        (source 5680-phy.sch)
        (comment (number 1) (value "Contains trim, physics box, and DB9 I/0."))
        (comment (number 2) (value ""))
        (comment (number 3) (value ""))
        (comment (number 4) (value ""))))
    (sheet (number 3) (name "/FE-5680 Package/Teensy Microcontroller/") (tstamps /5DFD8BA8/5E0BFA9A/)
      (title_block
        (title "Teensy Microcontroller IO")
        (company Drakelabs)
        (rev 1.5)
        (date 2020-01-14)
        (source Teensy_Microcontroller.sch)
        (comment (number 1) (value "Teensy 4.0 Microcontroller with code logging, commands via RS232, etc."))
        (comment (number 2) (value ""))
        (comment (number 3) (value ""))
        (comment (number 4) (value ""))))
    (sheet (number 4) (name "/FE-5680 Package/10MHz and 1PPS Distribution/") (tstamps /5DFD8BA8/5E0C40A9/)
      (title_block
        (title "RF Out 10Mhz and 1pps Distribution")
        (company Drakelabs)
        (rev 1.5)
        (date 2020-01-14)
        (source DistroAmp.sch)
        (comment (number 1) (value "This module will divide the 10MHz and 1pps signal among several BNC and SMA connections."))
        (comment (number 2) (value "Sets of outlets on the rear and front of chassis."))
        (comment (number 3) (value ""))
        (comment (number 4) (value ""))))
    (sheet (number 5) (name "/FE-5680 Power supply/") (tstamps /5DFB25B0/)
      (title_block
        (title "FE-5680 Power Supply")
        (company Drakelabs)
        (rev 1.6)
        (date 2020-01-18)
        (source power-supply.sch)
        (comment (number 1) (value "Dual-Secondary DC power for heater and logic"))
        (comment (number 2) (value "Secondary 1 for logic via RS-232"))
        (comment (number 3) (value "Secondary 2 for 3A heater"))
        (comment (number 4) (value "")))))
  (components
    (comp (ref G1)
      (value FE-5680A-Rb-Osc)
      (libsource (lib DrakeLabs) (part FE-5680A-Rb-Osc) (description "Rubidium clock source with 1 PPS and 10Mhz RF outputs"))
      (sheetpath (names "/FE-5680 Package/") (tstamps /5DFD8BA8/))
      (tstamp 5DFF431D))
    (comp (ref U1)
      (value Teensy4.0)
      (libsource (lib teensy) (part Teensy4.0) (description ""))
      (sheetpath (names "/FE-5680 Package/Teensy Microcontroller/") (tstamps /5DFD8BA8/5E0BFA9A/))
      (tstamp 5E0C2335))
    (comp (ref J1)
      (value Conn_Coaxial)
      (datasheet " ~")
      (libsource (lib Connector) (part Conn_Coaxial) (description "coaxial connector (BNC, SMA, SMB, SMC, Cinch/RCA, ...)"))
      (sheetpath (names "/FE-5680 Package/10MHz and 1PPS Distribution/") (tstamps /5DFD8BA8/5E0C40A9/))
      (tstamp 5E0DE065))
    (comp (ref D1)
      (value D_Bridge_-A+A)
      (datasheet ~)
      (libsource (lib Device) (part D_Bridge_-A+A) (description "Diode bridge, -ve/AC/+ve/AC"))
      (sheetpath (names "/FE-5680 Power supply/") (tstamps /5DFB25B0/))
      (tstamp 5DFB82D2))
    (comp (ref D3)
      (value 1N4002)
      (footprint Diode_THT:D_DO-41_SOD81_P10.16mm_Horizontal)
      (datasheet http://www.vishay.com/docs/88503/1n4001.pdf)
      (libsource (lib Diode) (part 1N4002) (description "100V 1A General Purpose Rectifier Diode, DO-41"))
      (sheetpath (names "/FE-5680 Power supply/") (tstamps /5DFB25B0/))
      (tstamp 5DFB82E3))
    (comp (ref U2)
      (value LM317_TO3)
      (footprint Package_TO_SOT_THT:TO-3)
      (datasheet http://www.ti.com/lit/ds/symlink/lm317.pdf)
      (libsource (lib Regulator_Linear) (part LM317_TO3) (description "1.5A 35V Adjustable Linear Regulator, TO-3"))
      (sheetpath (names "/FE-5680 Power supply/") (tstamps /5DFB25B0/))
      (tstamp 5DFB82E9))
    (comp (ref D4)
      (value 1N4002)
      (footprint Diode_THT:D_DO-41_SOD81_P10.16mm_Horizontal)
      (datasheet http://www.vishay.com/docs/88503/1n4001.pdf)
      (libsource (lib Diode) (part 1N4002) (description "100V 1A General Purpose Rectifier Diode, DO-41"))
      (sheetpath (names "/FE-5680 Power supply/") (tstamps /5DFB25B0/))
      (tstamp 5DFB82F5))
    (comp (ref C4)
      (value CP1_Small)
      (datasheet ~)
      (libsource (lib Device) (part CP1_Small) (description "Polarized capacitor, small US symbol"))
      (sheetpath (names "/FE-5680 Power supply/") (tstamps /5DFB25B0/))
      (tstamp 5DFB8303))
    (comp (ref R1)
      (value R_Small_US)
      (datasheet ~)
      (libsource (lib Device) (part R_Small_US) (description "Resistor, small US symbol"))
      (sheetpath (names "/FE-5680 Power supply/") (tstamps /5DFB25B0/))
      (tstamp 5DFB830B))
    (comp (ref R2)
      (value R_Small_US)
      (datasheet ~)
      (libsource (lib Device) (part R_Small_US) (description "Resistor, small US symbol"))
      (sheetpath (names "/FE-5680 Power supply/") (tstamps /5DFB25B0/))
      (tstamp 5DFB8316))
    (comp (ref D2)
      (value D_Bridge_-A+A)
      (datasheet ~)
      (libsource (lib Device) (part D_Bridge_-A+A) (description "Diode bridge, -ve/AC/+ve/AC"))
      (sheetpath (names "/FE-5680 Power supply/") (tstamps /5DFB25B0/))
      (tstamp 5DFBC2A1))
    (comp (ref C2)
      (value CP1_Small)
      (datasheet ~)
      (libsource (lib Device) (part CP1_Small) (description "Polarized capacitor, small US symbol"))
      (sheetpath (names "/FE-5680 Power supply/") (tstamps /5DFB25B0/))
      (tstamp 5DFC890B))
    (comp (ref C3)
      (value CP1_Small)
      (datasheet ~)
      (libsource (lib Device) (part CP1_Small) (description "Polarized capacitor, small US symbol"))
      (sheetpath (names "/FE-5680 Power supply/") (tstamps /5DFB25B0/))
      (tstamp 5DFC9E6D))
    (comp (ref C1)
      (value C)
      (datasheet ~)
      (libsource (lib Device) (part C) (description "Unpolarized capacitor"))
      (sheetpath (names "/FE-5680 Power supply/") (tstamps /5DFB25B0/))
      (tstamp 5E2202C5))
    (comp (ref T1)
      (value Triad_F198U)
      (datasheet https://catalog.triadmagnetics.com/Asset/F-198U.pdf)
      (fields
        (field (name Certification) "UL Class B (130C)")
        (field (name Insulation) "1500V hipot tested between pri/sec, pri/sec and core")
        (field (name Primary) "115V 50/60 Hz")
        (field (name RoHS) "Compliant as of 2005-02 to 2011/65/EU")
        (field (name "Secondary 1") "32.0VCT 1A")
        (field (name "Secondary 2") "15.5VCT 6A")
        (field (name "Temp RIse") "35C Typ (45C MAX allowed)")
        (field (name "V Reg") "5% Typ @ full load to no load"))
      (libsource (lib DrakeLabs) (part Triad_F198U) (description "Triad Dual Secondary CT 115V Power Transformer"))
      (sheetpath (names "/FE-5680 Power supply/") (tstamps /5DFB25B0/))
      (tstamp 5DFF1B3A)))
  (libparts
    (libpart (lib Connector) (part Conn_Coaxial)
      (description "coaxial connector (BNC, SMA, SMB, SMC, Cinch/RCA, ...)")
      (docs " ~")
      (footprints
        (fp *BNC*)
        (fp *SMA*)
        (fp *SMB*)
        (fp *SMC*)
        (fp *Cinch*))
      (fields
        (field (name Reference) J)
        (field (name Value) Conn_Coaxial))
      (pins
        (pin (num 1) (name In) (type passive))
        (pin (num 2) (name Ext) (type passive))))
    (libpart (lib Device) (part C)
      (description "Unpolarized capacitor")
      (docs ~)
      (footprints
        (fp C_*))
      (fields
        (field (name Reference) C)
        (field (name Value) C))
      (pins
        (pin (num 1) (name ~) (type passive))
        (pin (num 2) (name ~) (type passive))))
    (libpart (lib Device) (part CP1_Small)
      (description "Polarized capacitor, small US symbol")
      (docs ~)
      (footprints
        (fp CP_*))
      (fields
        (field (name Reference) C)
        (field (name Value) CP1_Small))
      (pins
        (pin (num 1) (name ~) (type passive))
        (pin (num 2) (name ~) (type passive))))
    (libpart (lib Device) (part D_Bridge_-A+A)
      (description "Diode bridge, -ve/AC/+ve/AC")
      (docs ~)
      (footprints
        (fp D*Bridge*)
        (fp D*Rectifier*))
      (fields
        (field (name Reference) D)
        (field (name Value) D_Bridge_-A+A))
      (pins
        (pin (num 1) (name -) (type passive))
        (pin (num 2) (name ~~) (type passive))
        (pin (num 3) (name +) (type passive))
        (pin (num 4) (name ~~) (type passive))))
    (libpart (lib Device) (part R_Small_US)
      (description "Resistor, small US symbol")
      (docs ~)
      (footprints
        (fp R_*))
      (fields
        (field (name Reference) R)
        (field (name Value) R_Small_US))
      (pins
        (pin (num 1) (name ~) (type passive))
        (pin (num 2) (name ~) (type passive))))
    (libpart (lib Diode) (part 1N4001)
      (aliases
        (alias 1N4002)
        (alias 1N4003)
        (alias 1N4004)
        (alias 1N4005)
        (alias 1N4006)
        (alias 1N4007)
        (alias BA157)
        (alias BA158)
        (alias BA159))
      (description "50V 1A General Purpose Rectifier Diode, DO-41")
      (docs http://www.vishay.com/docs/88503/1n4001.pdf)
      (footprints
        (fp D*DO?41*))
      (fields
        (field (name Reference) D)
        (field (name Value) 1N4001)
        (field (name Footprint) Diode_THT:D_DO-41_SOD81_P10.16mm_Horizontal))
      (pins
        (pin (num 1) (name K) (type passive))
        (pin (num 2) (name A) (type passive))))
    (libpart (lib DrakeLabs) (part FE-5680A-Rb-Osc)
      (description "Rubidium clock source with 1 PPS and 10Mhz RF outputs")
      (fields
        (field (name Reference) G)
        (field (name Value) FE-5680A-Rb-Osc))
      (pins
        (pin (num 1) (name +15VDC_IN) (type power_in))
        (pin (num 2) (name GND) (type power_out))
        (pin (num 3) (name Pull-Down) (type output))
        (pin (num 4) (name +5VDC_IN) (type power_in))
        (pin (num 5) (name RS232_GND) (type power_out))
        (pin (num 6) (name 1_PPS_OUT) (type output))
        (pin (num 7) (name RF_OUT_10MHz) (type output))
        (pin (num 8) (name RS232_RX_12V) (type input))
        (pin (num 9) (name RS232_TX_12V) (type input))))
    (libpart (lib DrakeLabs) (part Triad_F198U)
      (description "Triad Dual Secondary CT 115V Power Transformer")
      (docs https://catalog.triadmagnetics.com/Asset/F-198U.pdf)
      (fields
        (field (name Reference) T)
        (field (name Value) Triad_F198U)
        (field (name Primary) "115VAC 50/60 Hz")
        (field (name "Secondary 1") "32.0VAC CT 1A")
        (field (name "Secondary 2") "15.5VAC CT 6A")
        (field (name "V Reg") "5% Typ V Reg")
        (field (name "Temp Rise TYP") "35C Typ")
        (field (name "UL Certification") "UL Class B (130C)")
        (field (name Insulation) "1500V hipot tested")
        (field (name RoHS) "RoHS Compliant")
        (field (name "Temp Rise MAX") "45C Max")
        (field (name "RoHS Era") "as of 2005-02 to 2011/65/EU")
        (field (name "Insulation Detail") "between pri/sec, pri/sec and core")
        (field (name "VReg Detail") " @ full load to no load"))
      (pins
        (pin (num 1) (name IN+) (type power_in))
        (pin (num 2) (name IN-) (type power_in))
        (pin (num 3) (name OUTA1) (type passive))
        (pin (num 4) (name OUTA2) (type passive))
        (pin (num 5) (name OUTA3) (type passive))
        (pin (num 6) (name OUTB1) (type passive))
        (pin (num 7) (name OUTB2) (type passive))
        (pin (num 8) (name OUTB3) (type passive))))
    (libpart (lib Regulator_Linear) (part LM317_TO3)
      (aliases
        (alias LM117_TO3)
        (alias LM350_TO3)
        (alias LM150_TO3))
      (description "1.5A 35V Adjustable Linear Regulator, TO-3")
      (docs http://www.ti.com/lit/ds/symlink/lm317.pdf)
      (footprints
        (fp TO?3*))
      (fields
        (field (name Reference) U)
        (field (name Value) LM317_TO3)
        (field (name Footprint) Package_TO_SOT_THT:TO-3))
      (pins
        (pin (num 1) (name ADJ) (type input))
        (pin (num 2) (name VI) (type power_in))
        (pin (num 3) (name VO) (type power_out))))
    (libpart (lib teensy) (part Teensy4.0)
      (fields
        (field (name Reference) U)
        (field (name Value) Teensy4.0))
      (pins
        (pin (num 1) (name GND) (type power_in))
        (pin (num 2) (name 0_RX1_CRX2) (type BiDi))
        (pin (num 3) (name 1_TX1_CTX2) (type BiDi))
        (pin (num 4) (name 2_OUT2) (type BiDi))
        (pin (num 5) (name 3_LRCLK2) (type BiDi))
        (pin (num 6) (name 4_BCLK2) (type BiDi))
        (pin (num 7) (name 5_IN2) (type BiDi))
        (pin (num 8) (name 6_OUT1D) (type BiDi))
        (pin (num 9) (name 7_RX2_OUT1A) (type BiDi))
        (pin (num 10) (name 8_TX2_IN1) (type BiDi))
        (pin (num 11) (name 9_OUT1C) (type BiDi))
        (pin (num 12) (name 10_CS_MQSR) (type BiDi))
        (pin (num 13) (name 11_MOSI_CTX1) (type BiDi))
        (pin (num 14) (name 12_MISO_MQSL) (type BiDi))
        (pin (num 15) (name VBAT) (type power_in))
        (pin (num 16) (name 3V3) (type power_out))
        (pin (num 17) (name GND) (type power_in))
        (pin (num 18) (name PROGRAM) (type input))
        (pin (num 19) (name ON_OFF) (type input))
        (pin (num 20) (name 13_SCK_CRX1_LED) (type BiDi))
        (pin (num 21) (name 14_A0_TX3_SPDIF_OUT) (type BiDi))
        (pin (num 22) (name 15_A1_RX3_SPDIF_IN) (type BiDi))
        (pin (num 23) (name 16_A2_RX4_SCL1) (type BiDi))
        (pin (num 24) (name 17_A3_TX4_SDA1) (type BiDi))
        (pin (num 25) (name 18_A4_SDA0) (type BiDi))
        (pin (num 26) (name 19_A5_SCL0) (type BiDi))
        (pin (num 27) (name 20_A6_TX5_LRCLK1) (type BiDi))
        (pin (num 28) (name 21_A7_RX5_BCLK1) (type BiDi))
        (pin (num 29) (name 22_A8_CTX1) (type BiDi))
        (pin (num 30) (name 23_A9_CRX1_MCLK1) (type BiDi))
        (pin (num 31) (name 3V3) (type power_out))
        (pin (num 32) (name GND) (type power_in))
        (pin (num 33) (name VIN) (type power_in))
        (pin (num 34) (name VUSB) (type power_out))
        (pin (num ~) (name 35_DAT1_MOSI2) (type BiDi)))))
  (libraries
    (library (logical Connector)
      (uri /home/scott/Documents/ee/kicad-symbol-libraries/kicad/Connector.lib))
    (library (logical Device)
      (uri /home/scott/Documents/ee/kicad-symbol-libraries/kicad/Device.lib))
    (library (logical Diode)
      (uri /home/scott/Documents/ee/kicad-symbol-libraries/kicad/Diode.lib))
    (library (logical DrakeLabs)
      (uri /home/scott/Documents/ee/kicad-symbol-libraries/DrakeLabs/DrakeLabs.lib))
    (library (logical Regulator_Linear)
      (uri /home/scott/Documents/ee/kicad-symbol-libraries/kicad/Regulator_Linear.lib))
    (library (logical teensy)
      (uri /home/scott/Documents/ee/kicad-symbol-libraries/teensy_library/teensy.lib)))
  (nets
    (net (code 1) (name 0)
      (node (ref C2) (pin 2))
      (node (ref C4) (pin 2))
      (node (ref D2) (pin 1))
      (node (ref G1) (pin 2))
      (node (ref D1) (pin 1))
      (node (ref C3) (pin 2))
      (node (ref R2) (pin 2)))
    (net (code 2) (name "/FE-5680 Package/Logic_5VDC")
      (node (ref R1) (pin 1))
      (node (ref D3) (pin 2))
      (node (ref U2) (pin 3))
      (node (ref D4) (pin 1))
      (node (ref G1) (pin 4)))
    (net (code 3) (name "/FE-5680 Package/Heater_15.5VDC")
      (node (ref C3) (pin 1))
      (node (ref G1) (pin 1))
      (node (ref D2) (pin 3)))
    (net (code 4) (name "Net-(T1-Pad5)")
      (node (ref T1) (pin 5)))
    (net (code 5) (name "Net-(T1-Pad7)")
      (node (ref T1) (pin 7)))
    (net (code 6) (name "/FE-5680 Power supply/+16VAC")
      (node (ref T1) (pin 3))
      (node (ref D1) (pin 4)))
    (net (code 7) (name "Net-(C4-Pad1)")
      (node (ref R2) (pin 1))
      (node (ref U2) (pin 1))
      (node (ref D4) (pin 2))
      (node (ref R1) (pin 2))
      (node (ref C4) (pin 1)))
    (net (code 8) (name "Net-(C2-Pad1)")
      (node (ref D1) (pin 3))
      (node (ref C2) (pin 1))
      (node (ref U2) (pin 2))
      (node (ref D3) (pin 1)))
    (net (code 9) (name NEUT)
      (node (ref C1) (pin 1))
      (node (ref T1) (pin 1)))
    (net (code 10) (name LINE)
      (node (ref T1) (pin 2))
      (node (ref C1) (pin 2)))
    (net (code 11) (name "/FE-5680 Power supply/+0VAC")
      (node (ref D1) (pin 2))
      (node (ref T1) (pin 4)))
    (net (code 12) (name "/FE-5680 Power supply/+15.5VAC")
      (node (ref D2) (pin 4))
      (node (ref T1) (pin 6)))
    (net (code 13) (name "/FE-5680 Power supply/-15.5VAC")
      (node (ref D2) (pin 2))
      (node (ref T1) (pin 8)))
    (net (code 14) (name "/FE-5680 Package/RS232-TX")
      (node (ref G1) (pin 9)))
    (net (code 15) (name "/FE-5680 Package/RS232-GND")
      (node (ref G1) (pin 5)))
    (net (code 16) (name "/FE-5680 Package/10MHz and 1PPS Distribution/RF_OUT_10MHz")
      (node (ref G1) (pin 7))
      (node (ref J1) (pin 1)))
    (net (code 18) (name "Net-(G1-Pad6)")
      (node (ref G1) (pin 6)))
    (net (code 19) (name "/FE-5680 Package/RS232-RX")
      (node (ref G1) (pin 8)))
    (net (code 20) (name "Net-(G1-Pad3)")
      (node (ref G1) (pin 3)))
    (net (code 21) (name "Net-(U1-Pad28)")
      (node (ref U1) (pin 28)))
    (net (code 22) (name "Net-(U1-Pad29)")
      (node (ref U1) (pin 29)))
    (net (code 23) (name "Net-(U1-Pad30)")
      (node (ref U1) (pin 30)))
    (net (code 24) (name "Net-(U1-Pad31)")
      (node (ref U1) (pin 31)))
    (net (code 25) (name "Net-(U1-Pad32)")
      (node (ref U1) (pin 32)))
    (net (code 26) (name "Net-(U1-Pad33)")
      (node (ref U1) (pin 33)))
    (net (code 27) (name "Net-(U1-Pad34)")
      (node (ref U1) (pin 34)))
    (net (code 28) (name "Net-(U1-Pad5)")
      (node (ref U1) (pin 5)))
    (net (code 29) (name "Net-(U1-Pad6)")
      (node (ref U1) (pin 6)))
    (net (code 30) (name "Net-(U1-Pad7)")
      (node (ref U1) (pin 7)))
    (net (code 31) (name "Net-(U1-Pad8)")
      (node (ref U1) (pin 8)))
    (net (code 32) (name "Net-(U1-Pad9)")
      (node (ref U1) (pin 9)))
    (net (code 33) (name "Net-(U1-Pad~)")
      (node (ref U1) (pin ~)))
    (net (code 34) (name "Net-(U1-Pad~)")
      (node (ref U1) (pin ~)))
    (net (code 35) (name "Net-(U1-Pad~)")
      (node (ref U1) (pin ~)))
    (net (code 36) (name "Net-(U1-Pad~)")
      (node (ref U1) (pin ~)))
    (net (code 37) (name "Net-(U1-Pad~)")
      (node (ref U1) (pin ~)))
    (net (code 38) (name "Net-(U1-Pad~)")
      (node (ref U1) (pin ~)))
    (net (code 39) (name "Net-(U1-Pad18)")
      (node (ref U1) (pin 18)))
    (net (code 40) (name "Net-(U1-Pad~)")
      (node (ref U1) (pin ~)))
    (net (code 41) (name "Net-(U1-Pad10)")
      (node (ref U1) (pin 10)))
    (net (code 42) (name "Net-(U1-Pad11)")
      (node (ref U1) (pin 11)))
    (net (code 43) (name "Net-(U1-Pad12)")
      (node (ref U1) (pin 12)))
    (net (code 44) (name "Net-(U1-Pad13)")
      (node (ref U1) (pin 13)))
    (net (code 45) (name "Net-(U1-Pad14)")
      (node (ref U1) (pin 14)))
    (net (code 46) (name "Net-(U1-Pad15)")
      (node (ref U1) (pin 15)))
    (net (code 47) (name "Net-(U1-Pad16)")
      (node (ref U1) (pin 16)))
    (net (code 48) (name "Net-(U1-Pad17)")
      (node (ref U1) (pin 17)))
    (net (code 49) (name "Net-(U1-Pad27)")
      (node (ref U1) (pin 27)))
    (net (code 50) (name "Net-(U1-Pad19)")
      (node (ref U1) (pin 19)))
    (net (code 51) (name "Net-(U1-Pad20)")
      (node (ref U1) (pin 20)))
    (net (code 52) (name "Net-(U1-Pad21)")
      (node (ref U1) (pin 21)))
    (net (code 53) (name "Net-(U1-Pad22)")
      (node (ref U1) (pin 22)))
    (net (code 54) (name "Net-(U1-Pad23)")
      (node (ref U1) (pin 23)))
    (net (code 55) (name "Net-(U1-Pad24)")
      (node (ref U1) (pin 24)))
    (net (code 56) (name "Net-(U1-Pad25)")
      (node (ref U1) (pin 25)))
    (net (code 57) (name "Net-(U1-Pad26)")
      (node (ref U1) (pin 26)))
    (net (code 58) (name "Net-(U1-Pad1)")
      (node (ref U1) (pin 1)))
    (net (code 59) (name "Net-(U1-Pad~)")
      (node (ref U1) (pin ~)))
    (net (code 60) (name "Net-(U1-Pad~)")
      (node (ref U1) (pin ~)))
    (net (code 61) (name "Net-(U1-Pad~)")
      (node (ref U1) (pin ~)))
    (net (code 62) (name "Net-(U1-Pad~)")
      (node (ref U1) (pin ~)))
    (net (code 63) (name "Net-(U1-Pad~)")
      (node (ref U1) (pin ~)))
    (net (code 64) (name "Net-(U1-Pad2)")
      (node (ref U1) (pin 2)))
    (net (code 65) (name "Net-(U1-Pad3)")
      (node (ref U1) (pin 3)))
    (net (code 66) (name "Net-(U1-Pad4)")
      (node (ref U1) (pin 4)))
    (net (code 67) (name "Net-(U1-Pad~)")
      (node (ref U1) (pin ~)))
    (net (code 68) (name "Net-(U1-Pad~)")
      (node (ref U1) (pin ~)))
    (net (code 69) (name "Net-(U1-Pad~)")
      (node (ref U1) (pin ~)))
    (net (code 70) (name "Net-(U1-Pad~)")
      (node (ref U1) (pin ~)))
    (net (code 71) (name "Net-(U1-Pad~)")
      (node (ref U1) (pin ~)))
    (net (code 72) (name "Net-(U1-Pad~)")
      (node (ref U1) (pin ~)))
    (net (code 73) (name "Net-(U1-Pad~)")
      (node (ref U1) (pin ~)))
    (net (code 74) (name "Net-(U1-Pad~)")
      (node (ref U1) (pin ~)))
    (net (code 78) (name GND)
      (node (ref J1) (pin 2)))))