{
  "__type__": "cc.SpriteFrame",
  "content": {
    "name": "toggle_on_bar",
    "texture": "6dbad1b0-0929-47fe-8dff-2bffdd1799f1",
    "atlas": "",
    "rect": [
      0,
      0,
      122,
      46
    ],
    "offset": [
      0,
      0
    ],
    "originalSize": [
      122,
      46
    ],
    "capInsets": [
      0,
      0,
      0,
      0
    ]
  }
}