info face="font_sicbo_jackpot" size=32 bold=0 italic=0 charset="" unicode=0 stretchH=100 smooth=1 aa=1 padding=0,0,0,0 spacing=1,1
common lineHeight=55 base=26 scaleW=256 scaleH=256 pages=1 packed=0 alphaChnl=1 redChnl=0 greenChnl=0 blueChnl=0
page id=0 file="font_sicbo_jackpot.png"
chars count=30
char id=77 x=0 y=0 width=45 height=51 xoffset=0 yoffset=4 xadvance=45 page=0 chnl=0 letter="M"
char id=75 x=44 y=52 width=39 height=51 xoffset=0 yoffset=4 xadvance=39 page=0 chnl=0 letter="K"
char id=71 x=161 y=105 width=37 height=52 xoffset=0 yoffset=4 xadvance=37 page=0 chnl=0 letter="G"
char id=66 x=123 y=0 width=38 height=52 xoffset=0 yoffset=4 xadvance=38 page=0 chnl=0 letter="B"
char id=84 x=123 y=53 width=38 height=51 xoffset=0 yoffset=4 xadvance=38 page=0 chnl=0 letter="T"
char id=80 x=46 y=0 width=38 height=51 xoffset=0 yoffset=4 xadvance=38 page=0 chnl=0 letter="P"
char id=69 x=199 y=53 width=33 height=52 xoffset=0 yoffset=4 xadvance=33 page=0 chnl=0 letter="E"
char id=88 x=0 y=52 width=43 height=51 xoffset=0 yoffset=4 xadvance=43 page=0 chnl=0 letter="X"
char id=120 x=85 y=0 width=37 height=40 xoffset=0 yoffset=15 xadvance=37 page=0 chnl=0 letter="x"
char id=86 x=0 y=104 width=43 height=52 xoffset=0 yoffset=4 xadvance=43 page=0 chnl=0 letter="V"
char id=78 x=0 y=157 width=41 height=51 xoffset=0 yoffset=4 xadvance=41 page=0 chnl=0 letter="N"
char id=68 x=44 y=104 width=39 height=52 xoffset=0 yoffset=4 xadvance=39 page=0 chnl=0 letter="D"
char id=36 x=162 y=0 width=35 height=64 xoffset=0 yoffset=-2 xadvance=35 page=0 chnl=0 letter="$"
char id=43 x=0 y=211 width=34 height=35 xoffset=0 yoffset=11 xadvance=34 page=0 chnl=0 letter="+"
char id=44 x=35 y=223 width=19 height=21 xoffset=0 yoffset=40 xadvance=19 page=0 chnl=0 letter=","
char id=45 x=35 y=209 width=21 height=13 xoffset=0 yoffset=27 xadvance=21 page=0 chnl=0 letter="-"
char id=46 x=55 y=223 width=15 height=15 xoffset=0 yoffset=40 xadvance=15 page=0 chnl=0 letter="."
char id=47 x=199 y=106 width=29 height=51 xoffset=0 yoffset=4 xadvance=29 page=0 chnl=0 letter="/"
char id=48 x=84 y=52 width=38 height=52 xoffset=0 yoffset=4 xadvance=38 page=0 chnl=0 letter="0"
char id=49 x=229 y=106 width=23 height=51 xoffset=0 yoffset=4 xadvance=23 page=0 chnl=0 letter="1"
char id=50 x=197 y=158 width=35 height=51 xoffset=0 yoffset=4 xadvance=35 page=0 chnl=0 letter="2"
char id=51 x=198 y=0 width=34 height=52 xoffset=0 yoffset=4 xadvance=34 page=0 chnl=0 letter="3"
char id=52 x=42 y=157 width=40 height=51 xoffset=0 yoffset=4 xadvance=40 page=0 chnl=0 letter="4"
char id=53 x=161 y=158 width=35 height=52 xoffset=0 yoffset=4 xadvance=35 page=0 chnl=0 letter="5"
char id=54 x=122 y=105 width=38 height=52 xoffset=0 yoffset=4 xadvance=38 page=0 chnl=0 letter="6"
char id=55 x=84 y=105 width=35 height=51 xoffset=0 yoffset=4 xadvance=35 page=0 chnl=0 letter="7"
char id=56 x=122 y=158 width=38 height=52 xoffset=0 yoffset=4 xadvance=38 page=0 chnl=0 letter="8"
char id=57 x=83 y=157 width=38 height=52 xoffset=0 yoffset=4 xadvance=38 page=0 chnl=0 letter="9"
char id=32 x=0 y=0 width=0 height=0 xoffset=0 yoffset=0 xadvance=10 page=0 chnl=0 letter=" "
char id=9 x=0 y=0 width=0 height=0 xoffset=0 yoffset=0 xadvance=300 page=0 chnl=0 letter="	"

kernings count=56
kerning first=75  second=69  amount=-3
kerning first=66  second=69  amount=-1
kerning first=66  second=80  amount=-1
kerning first=66  second=86  amount=-2
kerning first=68  second=68  amount=-1
kerning first=68  second=69  amount=-1
kerning first=68  second=77  amount=-1
kerning first=68  second=78  amount=-1
kerning first=68  second=80  amount=-1
kerning first=68  second=86  amount=-3
kerning first=71  second=69  amount=-1
kerning first=77  second=71  amount=-1
kerning first=78  second=71  amount=-1
kerning first=80  second=69  amount=-1
kerning first=80  second=80  amount=-1
kerning first=80  second=46  amount=-16
kerning first=80  second=44  amount=-20
kerning first=86  second=71  amount=-4
kerning first=66  second=46  amount=-1
kerning first=66  second=44  amount=-5
kerning first=68  second=46  amount=-2
kerning first=68  second=44  amount=-6
kerning first=78  second=46  amount=-1
kerning first=78  second=44  amount=-3
kerning first=84  second=46  amount=-12
kerning first=84  second=44  amount=-14
kerning first=86  second=46  amount=-10
kerning first=86  second=44  amount=-13
kerning first=71  second=44  amount=-2
kerning first=66  second=69  amount=-1
kerning first=66  second=80  amount=-1
kerning first=66  second=86  amount=-2
kerning first=68  second=68  amount=-1
kerning first=68  second=69  amount=-1
kerning first=68  second=77  amount=-1
kerning first=68  second=78  amount=-1
kerning first=68  second=80  amount=-1
kerning first=68  second=86  amount=-3
kerning first=71  second=69  amount=-1
kerning first=77  second=71  amount=-1
kerning first=78  second=71  amount=-1
kerning first=80  second=69  amount=-1
kerning first=80  second=80  amount=-1
kerning first=80  second=46  amount=-16
kerning first=80  second=44  amount=-20
kerning first=86  second=71  amount=-4
kerning first=66  second=46  amount=-1
kerning first=66  second=44  amount=-5
kerning first=68  second=46  amount=-2
kerning first=68  second=44  amount=-6
kerning first=78  second=46  amount=-1
kerning first=78  second=44  amount=-3
kerning first=84  second=46  amount=-12
kerning first=84  second=44  amount=-14
kerning first=86  second=46  amount=-10
kerning first=86  second=44  amount=-13
