
Anim_main_lightbackground.png
size: 456,172
format: RGBA8888
filter: Linear,Linear
repeat: none
Bic
  rotate: true
  xy: 2, 2
  size: 167, 194
  orig: 167, 195
  offset: 0, 0
  index: -1
Ellipse 1
  rotate: false
  xy: 383, 26
  size: 69, 143
  orig: 77, 154
  offset: 6, 2
  index: -1
Ro
  rotate: true
  xy: 198, 7
  size: 162, 183
  orig: 163, 184
  offset: 0, 1
  index: -1
