{
  "__type__": "cc.SpriteFrame",
  "content": {
    "name": "SB_Main_Chip_1K_Disable",
    "texture": "0786ddd1-2c5e-4bc6-8f16-2759066eb723",
    "atlas": "",
    "rect": [
      0,
      0,
      95,
      98
    ],
    "offset": [
      0,
      0.5
    ],
    "originalSize": [
      95,
      99
    ],
    "capInsets": [
      0,
      0,
      0,
      0
    ]
  }
}