{
  "__type__": "cc.AnimationClip",
  "_name": "chenZoomIn",
  "_objFlags": 0,
  "_native": "",
  "_duration": 0.16666666666666666,
  "sample": 60,
  "speed": 1,
  "wrapMode": 1,
  "curveData": {
    "props": {
      "position": [
        {
          "frame": 0,
          "value": [
            0,
            157.5,
            0
          ]
        },
        {
          "frame": 0.16666666666666666,
          "value": [
            0,
            15,
            0
          ]
        }
      ],
      "scale": [
        {
          "frame": 0,
          "value": {
            "__type__": "cc.Vec2",
            "x": 0.22,
            "y": 0.22
          }
        },
        {
          "frame": 0.16666666666666666,
          "value": {
            "__type__": "cc.Vec2",
            "x": 0.81,
            "y": 0.81
          }
        }
      ]
    },
    "paths": {
      "Root/SB_maintable_dice_top": {
        "props": {
          "active": [
            {
              "frame": 0,
              "value": false
            }
          ]
        }
      },
      "Root/Mask": {
        "props": {
          "opacity": [
            {
              "frame": 0,
              "value": 0
            },
            {
              "frame": 0.16666666666666666,
              "value": 153
            }
          ]
        }
      }
    }
  },
  "events": []
}