{
"skeleton": { "hash": "50YEFt6k4KqAJNR930FdhHDId3U", "spine": "3.8.99", "x": -167.51, "y": -21.04, "width": 324.75, "height": 47 },
"bones": [
	{ "name": "root" },
	{ "name": "title", "parent": "root" },
	{ "name": "title_fx_right", "parent": "title", "x": 11.24, "y": 1.96 },
	{ "name": "fx_title", "parent": "title_fx_right" },
	{ "name": "fx_title2", "parent": "title_fx_right" },
	{ "name": "fx_title3", "parent": "title_fx_right" },
	{ "name": "title_fx_right2", "parent": "title", "x": -21.51, "y": 1.96, "scaleX": -1 },
	{ "name": "fx_title4", "parent": "title_fx_right2" },
	{ "name": "fx_title5", "parent": "title_fx_right2" },
	{ "name": "fx_title6", "parent": "title_fx_right2" }
],
"slots": [
	{ "name": "fx_title", "bone": "fx_title", "color": "ffffff00", "attachment": "fx_title", "blend": "additive" },
	{ "name": "fx_title4", "bone": "fx_title4", "color": "ffffff00", "attachment": "fx_title", "blend": "additive" },
	{ "name": "fx_title2", "bone": "fx_title2", "color": "ffffff00", "attachment": "fx_title", "blend": "additive" },
	{ "name": "fx_title5", "bone": "fx_title5", "color": "ffffff00", "attachment": "fx_title", "blend": "additive" },
	{ "name": "fx_title3", "bone": "fx_title3", "color": "ffffff00", "attachment": "fx_title", "blend": "additive" },
	{ "name": "fx_title6", "bone": "fx_title6", "color": "ffffff00", "attachment": "fx_title", "blend": "additive" }
],
"skins": [
	{
		"name": "default",
		"attachments": {
			"fx_title": {
				"fx_title": { "x": 0.5, "y": 0.5, "width": 291, "height": 47 }
			},
			"fx_title2": {
				"fx_title": { "x": 0.5, "y": 0.5, "width": 291, "height": 47 }
			},
			"fx_title3": {
				"fx_title": { "x": 0.5, "y": 0.5, "width": 291, "height": 47 }
			},
			"fx_title4": {
				"fx_title": { "x": 0.5, "y": 0.5, "width": 291, "height": 47 }
			},
			"fx_title5": {
				"fx_title": { "x": 0.5, "y": 0.5, "width": 291, "height": 47 }
			},
			"fx_title6": {
				"fx_title": { "x": 0.5, "y": 0.5, "width": 291, "height": 47 }
			}
		}
	}
],
"animations": {
	"Animation": {
		"slots": {
			"fx_title": {
				"color": [
					{ "color": "ffffff00" },
					{ "time": 0.6667, "color": "ffffff38" },
					{ "time": 1.3333, "color": "ffffff00" }
				]
			},
			"fx_title2": {
				"color": [
					{ "time": 0.3333, "color": "ffffff00" },
					{ "time": 1, "color": "ffffff38" },
					{ "time": 1.6667, "color": "ffffff00" }
				]
			},
			"fx_title3": {
				"color": [
					{ "time": 0.8333, "color": "ffffff00" },
					{ "time": 1.5, "color": "ffffff38" },
					{ "time": 2.1667, "color": "ffffff00" }
				]
			},
			"fx_title4": {
				"color": [
					{ "color": "ffffff00" },
					{ "time": 0.6667, "color": "ffffff38" },
					{ "time": 1.3333, "color": "ffffff00" }
				]
			},
			"fx_title5": {
				"color": [
					{ "time": 0.3333, "color": "ffffff00" },
					{ "time": 1, "color": "ffffff38" },
					{ "time": 1.6667, "color": "ffffff00" }
				]
			},
			"fx_title6": {
				"color": [
					{ "time": 0.8333, "color": "ffffff00" },
					{ "time": 1.5, "color": "ffffff38" },
					{ "time": 2.1667, "color": "ffffff00" }
				]
			}
		},
		"bones": {
			"fx_title": {
				"translate": [
					{},
					{ "time": 1.3333, "x": 128.48 }
				]
			},
			"fx_title4": {
				"translate": [
					{},
					{ "time": 1.3333, "x": 128.48 }
				]
			},
			"title_fx_right2": {
				"translate": [
					{ "x": 9.17 }
				]
			},
			"fx_title2": {
				"translate": [
					{ "time": 0.3333 },
					{ "time": 1.6667, "x": 128.48 }
				]
			},
			"fx_title5": {
				"translate": [
					{ "time": 0.3333 },
					{ "time": 1.6667, "x": 128.48 }
				]
			},
			"fx_title3": {
				"translate": [
					{ "time": 0.8333 },
					{ "time": 2.1667, "x": 128.48 }
				]
			},
			"fx_title6": {
				"translate": [
					{ "time": 0.8333 },
					{ "time": 2.1667, "x": 128.48 }
				]
			}
		}
	}
}
}