{
  "__type__": "cc.SpriteFrame",
  "content": {
    "name": "UI_Popup_Lichsucuoc_Table_linedoc",
    "texture": "292025d4-97f2-49a2-96dd-2bb01557c416",
    "atlas": "",
    "rect": [
      0,
      0,
      2,
      472
    ],
    "offset": [
      0,
      0
    ],
    "originalSize": [
      2,
      472
    ],
    "capInsets": [
      0,
      0,
      0,
      0
    ]
  }
}