{
  "__type__": "cc.SpriteFrame",
  "content": {
    "name": "UI_popup_dsnguoichoi_title",
    "texture": "299e1ce2-bc8a-4ab3-9b52-aca7fa1617c5",
    "atlas": "",
    "rect": [
      0,
      0,
      151,
      23
    ],
    "offset": [
      0,
      0
    ],
    "originalSize": [
      151,
      23
    ],
    "capInsets": [
      0,
      0,
      0,
      0
    ]
  }
}