{
  "__type__": "cc.AnimationClip",
  "_name": "Hide",
  "_objFlags": 0,
  "_native": "",
  "_duration": 0.25,
  "sample": 60,
  "speed": 0.4,
  "wrapMode": 1,
  "curveData": {
    "props": {
      "opacity": [
        {
          "frame": 0,
          "value": 255
        },
        {
          "frame": 0.25,
          "value": 0
        }
      ]
    },
    "paths": {
      "Root": {
        "props": {
          "x": [
            {
              "frame": 0,
              "value": 428
            },
            {
              "frame": 0.03333333333333333,
              "value": 388
            },
            {
              "frame": 0.25,
              "value": 1438
            }
          ]
        }
      }
    }
  },
  "events": [
    {
      "frame": 0.23333333333333334,
      "func": "closeDone",
      "params": []
    }
  ]
}