{
  "__type__": "cc.SpriteFrame",
  "content": {
    "name": "sicbolit",
    "texture": "185830e9-7cde-4085-a36e-7a98e7d77244",
    "atlas": "",
    "rect": [
      0,
      0,
      799,
      504
    ],
    "offset": [
      0,
      0
    ],
    "originalSize": [
      799,
      504
    ],
    "capInsets": [
      0,
      0,
      0,
      0
    ]
  }
}