{
  "__type__": "cc.SpriteFrame",
  "content": {
    "name": "SB_Main_Chip_1M_Disable",
    "texture": "9f6057e4-b588-4754-98b7-e658d57aa5f5",
    "atlas": "",
    "rect": [
      0,
      0,
      95,
      98
    ],
    "offset": [
      0,
      0.5
    ],
    "originalSize": [
      95,
      99
    ],
    "capInsets": [
      0,
      0,
      0,
      0
    ]
  }
}