{
  "__type__": "sp.SkeletonData",
  "_name": "FX_chip",
  "_objFlags": 0,
  "_native": "",
  "_skeletonJson": {
    "skeleton": {
      "hash": "nNOK07R6jahgwyw53YlSL+im0So",
      "spine": "3.8.97",
      "x": -60.65,
      "y": -57.88,
      "width": 122,
      "height": 120,
      "images": "./images/",
      "audio": "E:/work/inspire lad/portal/Anim_fx_chip"
    },
    "bones": [
      {
        "name": "root"
      },
      {
        "name": "bone2",
        "parent": "root",
        "scaleX": 0.8095,
        "scaleY": 0.8095
      },
      {
        "name": "bone3",
        "parent": "root"
      },
      {
        "name": "bone4",
        "parent": "root"
      }
    ],
    "slots": [
      {
        "name": "vang2",
        "bone": "root",
        "attachment": "vang"
      }
    ],
    "skins": [
      {
        "name": "default",
        "attachments": {
          "vang2": {
            "vang": {
              "x": 0.35,
              "y": 2.12,
              "width": 122,
              "height": 120
            }
          }
        }
      }
    ],
    "animations": {
      "animation": {
        "slots": {
          "vang2": {
            "color": [
              {
                "color": "ffffffff",
                "curve": 0.25,
                "c3": 0.75
              },
              {
                "time": 0.5,
                "color": "ffffff7a",
                "curve": 0.25,
                "c3": 0.75
              },
              {
                "time": 1,
                "color": "ffffffff"
              }
            ]
          }
        }
      }
    }
  },
  "_atlasText": "\nFX_chip.png\nsize: 124,124\nformat: RGBA8888\nfilter: Linear,Linear\nrepeat: none\nvang\n  rotate: false\n  xy: 2, 2\n  size: 118, 117\n  orig: 122, 120\n  offset: 2, 1\n  index: -1\n",
  "textures": [
    {
      "__uuid__": "260e39ef-8076-4023-ac8d-5a495d31dd8a"
    }
  ],
  "textureNames": [
    "FX_chip.png"
  ],
  "scale": 1
}