{
  "__type__": "cc.SpriteFrame",
  "content": {
    "name": "UI_vinhdanh_dropdown_panel",
    "texture": "6344092a-8b50-49ec-850f-36c50d295394",
    "atlas": "",
    "rect": [
      0,
      0,
      194,
      277
    ],
    "offset": [
      0,
      0
    ],
    "originalSize": [
      194,
      277
    ],
    "capInsets": [
      0,
      0,
      0,
      0
    ]
  }
}