{
  "__type__": "cc.BitmapFont",
  "_name": "font_sicbo_jackpot",
  "_objFlags": 0,
  "_native": "",
  "fntDataStr": "",
  "spriteFrame": {
    "__uuid__": "f409240e-c4a5-47c8-9f69-bf0a60f37583"
  },
  "fontSize": 32,
  "_fntConfig": {
    "commonHeight": 55,
    "fontSize": 32,
    "atlasName": "font_sicbo_jackpot.png",
    "fontDefDictionary": {
      "9": {
        "rect": {
          "x": 0,
          "y": 0,
          "width": 0,
          "height": 0
        },
        "xOffset": 0,
        "yOffset": 0,
        "xAdvance": 300
      },
      "32": {
        "rect": {
          "x": 0,
          "y": 0,
          "width": 0,
          "height": 0
        },
        "xOffset": 0,
        "yOffset": 0,
        "xAdvance": 10
      },
      "36": {
        "rect": {
          "x": 162,
          "y": 0,
          "width": 35,
          "height": 64
        },
        "xOffset": 0,
        "yOffset": -2,
        "xAdvance": 35
      },
      "43": {
        "rect": {
          "x": 0,
          "y": 211,
          "width": 34,
          "height": 35
        },
        "xOffset": 0,
        "yOffset": 11,
        "xAdvance": 34
      },
      "44": {
        "rect": {
          "x": 35,
          "y": 223,
          "width": 19,
          "height": 21
        },
        "xOffset": 0,
        "yOffset": 40,
        "xAdvance": 19
      },
      "45": {
        "rect": {
          "x": 35,
          "y": 209,
          "width": 21,
          "height": 13
        },
        "xOffset": 0,
        "yOffset": 27,
        "xAdvance": 21
      },
      "46": {
        "rect": {
          "x": 55,
          "y": 223,
          "width": 15,
          "height": 15
        },
        "xOffset": 0,
        "yOffset": 40,
        "xAdvance": 15
      },
      "47": {
        "rect": {
          "x": 199,
          "y": 106,
          "width": 29,
          "height": 51
        },
        "xOffset": 0,
        "yOffset": 4,
        "xAdvance": 29
      },
      "48": {
        "rect": {
          "x": 84,
          "y": 52,
          "width": 38,
          "height": 52
        },
        "xOffset": 0,
        "yOffset": 4,
        "xAdvance": 38
      },
      "49": {
        "rect": {
          "x": 229,
          "y": 106,
          "width": 23,
          "height": 51
        },
        "xOffset": 0,
        "yOffset": 4,
        "xAdvance": 23
      },
      "50": {
        "rect": {
          "x": 197,
          "y": 158,
          "width": 35,
          "height": 51
        },
        "xOffset": 0,
        "yOffset": 4,
        "xAdvance": 35
      },
      "51": {
        "rect": {
          "x": 198,
          "y": 0,
          "width": 34,
          "height": 52
        },
        "xOffset": 0,
        "yOffset": 4,
        "xAdvance": 34
      },
      "52": {
        "rect": {
          "x": 42,
          "y": 157,
          "width": 40,
          "height": 51
        },
        "xOffset": 0,
        "yOffset": 4,
        "xAdvance": 40
      },
      "53": {
        "rect": {
          "x": 161,
          "y": 158,
          "width": 35,
          "height": 52
        },
        "xOffset": 0,
        "yOffset": 4,
        "xAdvance": 35
      },
      "54": {
        "rect": {
          "x": 122,
          "y": 105,
          "width": 38,
          "height": 52
        },
        "xOffset": 0,
        "yOffset": 4,
        "xAdvance": 38
      },
      "55": {
        "rect": {
          "x": 84,
          "y": 105,
          "width": 35,
          "height": 51
        },
        "xOffset": 0,
        "yOffset": 4,
        "xAdvance": 35
      },
      "56": {
        "rect": {
          "x": 122,
          "y": 158,
          "width": 38,
          "height": 52
        },
        "xOffset": 0,
        "yOffset": 4,
        "xAdvance": 38
      },
      "57": {
        "rect": {
          "x": 83,
          "y": 157,
          "width": 38,
          "height": 52
        },
        "xOffset": 0,
        "yOffset": 4,
        "xAdvance": 38
      },
      "66": {
        "rect": {
          "x": 123,
          "y": 0,
          "width": 38,
          "height": 52
        },
        "xOffset": 0,
        "yOffset": 4,
        "xAdvance": 38
      },
      "68": {
        "rect": {
          "x": 44,
          "y": 104,
          "width": 39,
          "height": 52
        },
        "xOffset": 0,
        "yOffset": 4,
        "xAdvance": 39
      },
      "69": {
        "rect": {
          "x": 199,
          "y": 53,
          "width": 33,
          "height": 52
        },
        "xOffset": 0,
        "yOffset": 4,
        "xAdvance": 33
      },
      "71": {
        "rect": {
          "x": 161,
          "y": 105,
          "width": 37,
          "height": 52
        },
        "xOffset": 0,
        "yOffset": 4,
        "xAdvance": 37
      },
      "75": {
        "rect": {
          "x": 44,
          "y": 52,
          "width": 39,
          "height": 51
        },
        "xOffset": 0,
        "yOffset": 4,
        "xAdvance": 39
      },
      "77": {
        "rect": {
          "x": 0,
          "y": 0,
          "width": 45,
          "height": 51
        },
        "xOffset": 0,
        "yOffset": 4,
        "xAdvance": 45
      },
      "78": {
        "rect": {
          "x": 0,
          "y": 157,
          "width": 41,
          "height": 51
        },
        "xOffset": 0,
        "yOffset": 4,
        "xAdvance": 41
      },
      "80": {
        "rect": {
          "x": 46,
          "y": 0,
          "width": 38,
          "height": 51
        },
        "xOffset": 0,
        "yOffset": 4,
        "xAdvance": 38
      },
      "84": {
        "rect": {
          "x": 123,
          "y": 53,
          "width": 38,
          "height": 51
        },
        "xOffset": 0,
        "yOffset": 4,
        "xAdvance": 38
      },
      "86": {
        "rect": {
          "x": 0,
          "y": 104,
          "width": 43,
          "height": 52
        },
        "xOffset": 0,
        "yOffset": 4,
        "xAdvance": 43
      },
      "88": {
        "rect": {
          "x": 0,
          "y": 52,
          "width": 43,
          "height": 51
        },
        "xOffset": 0,
        "yOffset": 4,
        "xAdvance": 43
      },
      "120": {
        "rect": {
          "x": 85,
          "y": 0,
          "width": 37,
          "height": 40
        },
        "xOffset": 0,
        "yOffset": 15,
        "xAdvance": 37
      }
    },
    "kerningDict": {
      "4325420": -5,
      "4325422": -1,
      "4325445": -1,
      "4325456": -1,
      "4325462": -2,
      "4456492": -6,
      "4456494": -2,
      "4456516": -1,
      "4456517": -1,
      "4456525": -1,
      "4456526": -1,
      "4456528": -1,
      "4456534": -3,
      "4653100": -2,
      "4653125": -1,
      "4915269": -3,
      "5046343": -1,
      "5111852": -3,
      "5111854": -1,
      "5111879": -1,
      "5242924": -20,
      "5242926": -16,
      "5242949": -1,
      "5242960": -1,
      "5505068": -14,
      "5505070": -12,
      "5636140": -13,
      "5636142": -10,
      "5636167": -4
    }
  },
  "_fontDefDictionary": null
}