{
  "__type__": "cc.SpriteFrame",
  "content": {
    "name": "UI_Lobby_banrieng_BG",
    "texture": "47ff173b-279b-4aa2-a1f2-d5eaed641241",
    "atlas": "",
    "rect": [
      0,
      0,
      630,
      358
    ],
    "offset": [
      0,
      0
    ],
    "originalSize": [
      630,
      358
    ],
    "capInsets": [
      0,
      0,
      0,
      0
    ]
  }
}