{
  "__type__": "cc.SpriteFrame",
  "content": {
    "name": "Btn_Menu_close",
    "texture": "69373f5e-4015-4502-9f98-fb59beb1a809",
    "atlas": "",
    "rect": [
      0,
      0,
      56,
      130
    ],
    "offset": [
      -1,
      1
    ],
    "originalSize": [
      58,
      132
    ],
    "capInsets": [
      0,
      0,
      0,
      0
    ]
  }
}