{
  "__type__": "cc.SpriteFrame",
  "content": {
    "name": "UI_Text_CaiDat",
    "texture": "cfd35a45-5964-46d2-819d-895eb1c9822b",
    "atlas": "",
    "rect": [
      0,
      0,
      133,
      41
    ],
    "offset": [
      0,
      0
    ],
    "originalSize": [
      133,
      41
    ],
    "capInsets": [
      0,
      0,
      0,
      0
    ]
  }
}