{
  "__type__": "cc.SpriteFrame",
  "content": {
    "name": "Btn_Popup_XacNhan_normal",
    "texture": "25b5df82-9f52-430d-9baf-6ab0a957d3f7",
    "atlas": "",
    "rect": [
      0,
      0,
      209,
      67
    ],
    "offset": [
      0,
      0
    ],
    "originalSize": [
      209,
      67
    ],
    "capInsets": [
      0,
      0,
      0,
      0
    ]
  }
}