{
  "__type__": "cc.SpriteFrame",
  "content": {
    "name": "UI_MainUI_TienDatCuoc",
    "texture": "0f30f6e9-9307-487d-a5e0-d770584b5c45",
    "atlas": "",
    "rect": [
      0,
      0,
      70,
      24
    ],
    "offset": [
      0,
      0
    ],
    "originalSize": [
      70,
      24
    ],
    "capInsets": [
      14,
      0,
      14,
      0
    ]
  }
}