{
  "__type__": "cc.SpriteFrame",
  "content": {
    "name": "anim_dice_20",
    "texture": "36dd1a2e-337b-45df-9aab-354e02d728aa",
    "atlas": "",
    "rect": [
      38,
      54,
      193,
      181
    ],
    "offset": [
      10,
      3.5
    ],
    "originalSize": [
      249,
      296
    ],
    "capInsets": [
      0,
      0,
      0,
      0
    ]
  }
}