{
  "__type__": "cc.Material",
  "_name": "Sicbo_nohuCoin",
  "_objFlags": 0,
  "_native": "",
  "_effectAsset": {
    "__uuid__": "829a282c-b049-4019-bd38-5ace8d8a6417"
  },
  "_techniqueIndex": 1,
  "_techniqueData": {
    "0": {
      "props": {
        "mainTexture": {
          "__uuid__": "d021e67f-4950-42d5-8122-f16996b9f8e7"
        }
      },
      "defines": {}
    }
  }
}