{
  "__type__": "cc.SpriteFrame",
  "content": {
    "name": "progress-bar-bg-3",
    "texture": "fe329a4b-f57a-4659-9db9-cee4adcf8c09",
    "atlas": "",
    "rect": [
      0,
      0,
      611,
      29
    ],
    "offset": [
      0,
      0
    ],
    "originalSize": [
      611,
      29
    ],
    "capInsets": [
      0,
      0,
      0,
      0
    ]
  }
}