{
  "__type__": "cc.AnimationClip",
  "_name": "ChenOpen",
  "_objFlags": 0,
  "_native": "",
  "_duration": 1.7666666666666666,
  "sample": 60,
  "speed": 1,
  "wrapMode": 1,
  "curveData": {
    "props": {
      "y": [
        {
          "frame": 0,
          "value": 157.5
        },
        {
          "frame": 0.5833333333333334,
          "value": 15
        },
        {
          "frame": 1.1666666666666667,
          "value": 15
        }
      ],
      "scale": [
        {
          "frame": 0,
          "value": {
            "__type__": "cc.Vec2",
            "x": 0.22,
            "y": 0.22
          }
        },
        {
          "frame": 0.5833333333333334,
          "value": {
            "__type__": "cc.Vec2",
            "x": 0.81,
            "y": 0.81
          }
        }
      ],
      "opacity": [
        {
          "frame": 0,
          "value": 255
        }
      ]
    },
    "paths": {
      "Anim_main_khui": {
        "props": {
          "active": [
            {
              "frame": 0,
              "value": false
            },
            {
              "frame": 1.1666666666666667,
              "value": true
            }
          ]
        }
      },
      "Anim_main_khui 2": {
        "props": {
          "active": [
            {
              "frame": 0,
              "value": false
            },
            {
              "frame": 1.1666666666666667,
              "value": true
            }
          ]
        }
      },
      "Root/SB_maintable_dice_top": {
        "comps": {},
        "props": {
          "y": [
            {
              "frame": 0,
              "value": 93
            },
            {
              "frame": 1,
              "value": 93
            },
            {
              "frame": 1.7666666666666666,
              "value": 648.914
            }
          ],
          "opacity": [
            {
              "frame": 1.5,
              "value": 255,
              "curve": "cubicIn"
            },
            {
              "frame": 1.7666666666666666,
              "value": 0
            }
          ],
          "scale": [
            {
              "frame": 1,
              "value": {
                "__type__": "cc.Vec2",
                "x": 1,
                "y": 1
              }
            },
            {
              "frame": 1.3333333333333333,
              "value": {
                "__type__": "cc.Vec2",
                "x": 1.05,
                "y": 1.05
              }
            },
            {
              "frame": 1.5,
              "value": {
                "__type__": "cc.Vec2",
                "x": 1.2,
                "y": 1.2
              }
            },
            {
              "frame": 1.7666666666666666,
              "value": {
                "__type__": "cc.Vec2",
                "x": 1.5,
                "y": 1.5
              }
            }
          ],
          "active": [
            {
              "frame": 0,
              "value": true
            }
          ]
        }
      },
      "Root/Dices/Sprite": {
        "props": {
          "active": [
            {
              "frame": 0,
              "value": false
            }
          ]
        }
      },
      "Root/Dices/DiceResults": {
        "props": {
          "active": [
            {
              "frame": 0,
              "value": true
            }
          ]
        }
      },
      "Root/Mask": {
        "props": {
          "opacity": [
            {
              "frame": 0,
              "value": 0
            },
            {
              "frame": 0.5833333333333334,
              "value": 153
            }
          ]
        }
      }
    }
  },
  "events": []
}