{
  "__type__": "cc.SpriteFrame",
  "content": {
    "name": "anim_dice_15",
    "texture": "984e905c-39ce-461a-9ee9-6b4ba4df482f",
    "atlas": "",
    "rect": [
      28,
      5,
      209,
      247
    ],
    "offset": [
      8,
      19.5
    ],
    "originalSize": [
      249,
      296
    ],
    "capInsets": [
      0,
      0,
      0,
      0
    ]
  }
}