{
  "__type__": "cc.SpriteFrame",
  "content": {
    "name": "UI_Popup_Vinhdanh_NoHu_Table_line",
    "texture": "ab403ee1-977a-4801-a74d-bcef8ec66146",
    "atlas": "",
    "rect": [
      0,
      0,
      2,
      373
    ],
    "offset": [
      0,
      0
    ],
    "originalSize": [
      2,
      373
    ],
    "capInsets": [
      0,
      0,
      0,
      0
    ]
  }
}