{
  "__type__": "cc.SpriteFrame",
  "content": {
    "name": "SB_Main_Chip_1K_Mini",
    "texture": "5ff94da7-0cbe-4659-8dbf-2b68da8e4316",
    "atlas": "",
    "rect": [
      0,
      0,
      28,
      26
    ],
    "offset": [
      0,
      0
    ],
    "originalSize": [
      28,
      26
    ],
    "capInsets": [
      0,
      0,
      0,
      0
    ]
  }
}