{
  "__type__": "cc.SpriteFrame",
  "content": {
    "name": "UI_popup_TongQuan_Title_thongtinnguoichoi",
    "texture": "85281e48-74ec-4926-8424-fe607df2cf18",
    "atlas": "",
    "rect": [
      0,
      0,
      396,
      34
    ],
    "offset": [
      0,
      0
    ],
    "originalSize": [
      396,
      34
    ],
    "capInsets": [
      0,
      0,
      0,
      0
    ]
  }
}