{
  "__type__": "cc.SpriteFrame",
  "content": {
    "name": "text_quen_mat_khau",
    "texture": "85f70696-7967-4594-a6bb-abd2847b343c",
    "atlas": "",
    "rect": [
      0,
      0,
      216,
      38
    ],
    "offset": [
      0,
      0
    ],
    "originalSize": [
      216,
      38
    ],
    "capInsets": [
      0,
      0,
      0,
      0
    ]
  }
}