{
  "__type__": "cc.SpriteFrame",
  "content": {
    "name": "UI_popup_LuatChoi_title",
    "texture": "8f192115-fdaa-40b4-9662-c614689bdc23",
    "atlas": "",
    "rect": [
      0,
      0,
      195,
      50
    ],
    "offset": [
      0,
      0
    ],
    "originalSize": [
      195,
      50
    ],
    "capInsets": [
      0,
      0,
      0,
      0
    ]
  }
}