{
  "__type__": "cc.SpriteFrame",
  "content": {
    "name": "UI_popup_LSC_Dice_4",
    "texture": "6818a83e-c716-4291-ae1e-bb49604ee6b5",
    "atlas": "",
    "rect": [
      0,
      0,
      53,
      53
    ],
    "offset": [
      0,
      0
    ],
    "originalSize": [
      53,
      53
    ],
    "capInsets": [
      0,
      0,
      0,
      0
    ]
  }
}