{
  "__type__": "cc.BitmapFont",
  "_name": "font_hu-export",
  "_objFlags": 0,
  "_native": "",
  "fntDataStr": "",
  "spriteFrame": {
    "__uuid__": "85496390-c0aa-47df-88c3-95538cd4d4f0"
  },
  "fontSize": 32,
  "_fntConfig": {
    "commonHeight": 35,
    "fontSize": 32,
    "atlasName": "font_hu-export.png",
    "fontDefDictionary": {
      "9": {
        "rect": {
          "x": 0,
          "y": 0,
          "width": 0,
          "height": 0
        },
        "xOffset": 0,
        "yOffset": 0,
        "xAdvance": 210
      },
      "32": {
        "rect": {
          "x": 0,
          "y": 0,
          "width": 0,
          "height": 0
        },
        "xOffset": 0,
        "yOffset": 0,
        "xAdvance": 7
      },
      "36": {
        "rect": {
          "x": 59,
          "y": 22,
          "width": 17,
          "height": 27
        },
        "xOffset": 0,
        "yOffset": 11,
        "xAdvance": 17
      },
      "43": {
        "rect": {
          "x": 22,
          "y": 23,
          "width": 18,
          "height": 19
        },
        "xOffset": 0,
        "yOffset": 17,
        "xAdvance": 18
      },
      "44": {
        "rect": {
          "x": 12,
          "y": 115,
          "width": 10,
          "height": 12
        },
        "xOffset": 0,
        "yOffset": 26,
        "xAdvance": 10
      },
      "45": {
        "rect": {
          "x": 0,
          "y": 117,
          "width": 11,
          "height": 7
        },
        "xOffset": 0,
        "yOffset": 23,
        "xAdvance": 11
      },
      "46": {
        "rect": {
          "x": 23,
          "y": 117,
          "width": 9,
          "height": 9
        },
        "xOffset": 0,
        "yOffset": 26,
        "xAdvance": 9
      },
      "47": {
        "rect": {
          "x": 77,
          "y": 89,
          "width": 13,
          "height": 23
        },
        "xOffset": 0,
        "yOffset": 13,
        "xAdvance": 13
      },
      "48": {
        "rect": {
          "x": 41,
          "y": 23,
          "width": 17,
          "height": 21
        },
        "xOffset": 0,
        "yOffset": 14,
        "xAdvance": 17
      },
      "49": {
        "rect": {
          "x": 79,
          "y": 0,
          "width": 12,
          "height": 21
        },
        "xOffset": 0,
        "yOffset": 14,
        "xAdvance": 12
      },
      "50": {
        "rect": {
          "x": 44,
          "y": 0,
          "width": 17,
          "height": 21
        },
        "xOffset": 0,
        "yOffset": 14,
        "xAdvance": 17
      },
      "51": {
        "rect": {
          "x": 62,
          "y": 0,
          "width": 16,
          "height": 21
        },
        "xOffset": 0,
        "yOffset": 14,
        "xAdvance": 16
      },
      "52": {
        "rect": {
          "x": 21,
          "y": 69,
          "width": 18,
          "height": 21
        },
        "xOffset": 0,
        "yOffset": 14,
        "xAdvance": 18
      },
      "53": {
        "rect": {
          "x": 77,
          "y": 67,
          "width": 16,
          "height": 21
        },
        "xOffset": 0,
        "yOffset": 14,
        "xAdvance": 16
      },
      "54": {
        "rect": {
          "x": 41,
          "y": 45,
          "width": 17,
          "height": 21
        },
        "xOffset": 0,
        "yOffset": 14,
        "xAdvance": 17
      },
      "55": {
        "rect": {
          "x": 77,
          "y": 22,
          "width": 16,
          "height": 21
        },
        "xOffset": 0,
        "yOffset": 14,
        "xAdvance": 16
      },
      "56": {
        "rect": {
          "x": 59,
          "y": 50,
          "width": 17,
          "height": 21
        },
        "xOffset": 0,
        "yOffset": 14,
        "xAdvance": 17
      },
      "57": {
        "rect": {
          "x": 59,
          "y": 95,
          "width": 17,
          "height": 21
        },
        "xOffset": 0,
        "yOffset": 14,
        "xAdvance": 17
      },
      "66": {
        "rect": {
          "x": 40,
          "y": 87,
          "width": 18,
          "height": 22
        },
        "xOffset": 0,
        "yOffset": 13,
        "xAdvance": 18
      },
      "68": {
        "rect": {
          "x": 0,
          "y": 69,
          "width": 20,
          "height": 22
        },
        "xOffset": 0,
        "yOffset": 13,
        "xAdvance": 20
      },
      "69": {
        "rect": {
          "x": 77,
          "y": 44,
          "width": 16,
          "height": 22
        },
        "xOffset": 0,
        "yOffset": 13,
        "xAdvance": 16
      },
      "71": {
        "rect": {
          "x": 0,
          "y": 46,
          "width": 20,
          "height": 22
        },
        "xOffset": 0,
        "yOffset": 13,
        "xAdvance": 20
      },
      "75": {
        "rect": {
          "x": 20,
          "y": 92,
          "width": 19,
          "height": 22
        },
        "xOffset": 0,
        "yOffset": 13,
        "xAdvance": 19
      },
      "77": {
        "rect": {
          "x": 0,
          "y": 0,
          "width": 24,
          "height": 22
        },
        "xOffset": 0,
        "yOffset": 13,
        "xAdvance": 24
      },
      "78": {
        "rect": {
          "x": 21,
          "y": 46,
          "width": 19,
          "height": 22
        },
        "xOffset": 0,
        "yOffset": 13,
        "xAdvance": 19
      },
      "80": {
        "rect": {
          "x": 59,
          "y": 72,
          "width": 17,
          "height": 22
        },
        "xOffset": 0,
        "yOffset": 13,
        "xAdvance": 17
      },
      "84": {
        "rect": {
          "x": 25,
          "y": 0,
          "width": 18,
          "height": 22
        },
        "xOffset": 0,
        "yOffset": 13,
        "xAdvance": 18
      },
      "86": {
        "rect": {
          "x": 0,
          "y": 23,
          "width": 21,
          "height": 22
        },
        "xOffset": 0,
        "yOffset": 13,
        "xAdvance": 21
      },
      "88": {
        "rect": {
          "x": 0,
          "y": 92,
          "width": 19,
          "height": 22
        },
        "xOffset": 0,
        "yOffset": 13,
        "xAdvance": 19
      },
      "120": {
        "rect": {
          "x": 40,
          "y": 69,
          "width": 18,
          "height": 17
        },
        "xOffset": 0,
        "yOffset": 18,
        "xAdvance": 18
      }
    },
    "kerningDict": {
      "4325420": -2,
      "4325422": -1,
      "4325445": -1,
      "4325456": -1,
      "4325462": -2,
      "4456492": -2,
      "4456494": -1,
      "4456516": -1,
      "4456517": -1,
      "4456525": -1,
      "4456526": -1,
      "4456528": -1,
      "4456534": -2,
      "4653100": -1,
      "4653125": -1,
      "4915269": -1,
      "5046343": -2,
      "5111852": -1,
      "5111854": -1,
      "5111879": -1,
      "5242924": -6,
      "5242926": -5,
      "5242949": -1,
      "5242960": -1,
      "5505068": -6,
      "5505070": -6,
      "5636140": -7,
      "5636142": -6,
      "5636167": -4
    }
  },
  "_fontDefDictionary": null
}