{
  "__type__": "cc.SpriteFrame",
  "content": {
    "name": "anim_dice_19",
    "texture": "1d60c258-6838-4bc7-aaa3-e32405552396",
    "atlas": "",
    "rect": [
      33,
      42,
      197,
      189
    ],
    "offset": [
      7,
      11.5
    ],
    "originalSize": [
      249,
      296
    ],
    "capInsets": [
      0,
      0,
      0,
      0
    ]
  }
}