{
  "__type__": "cc.AnimationClip",
  "_name": "hide",
  "_objFlags": 0,
  "_native": "",
  "_duration": 0.25,
  "sample": 60,
  "speed": 1,
  "wrapMode": 1,
  "curveData": {
    "props": {
      "opacity": [
        {
          "frame": 0,
          "value": 255
        },
        {
          "frame": 0.25,
          "value": 0
        }
      ]
    }
  },
  "events": [
    {
      "frame": 0.21666666666666667,
      "func": "closeDone",
      "params": []
    }
  ]
}