{
  "__type__": "cc.SpriteFrame",
  "content": {
    "name": "dice",
    "texture": "fc507ede-29f4-4d68-bf6e-e71bd099310f",
    "atlas": "",
    "rect": [
      0,
      0,
      37,
      36
    ],
    "offset": [
      0,
      0.5
    ],
    "originalSize": [
      37,
      37
    ],
    "capInsets": [
      0,
      0,
      0,
      0
    ]
  }
}