{
  "__type__": "cc.SpriteFrame",
  "content": {
    "name": "number_top_silver-export",
    "texture": "824e1014-c83f-4d00-b8c7-497cb0219ef7",
    "atlas": "",
    "rect": [
      0,
      0,
      115,
      104
    ],
    "offset": [
      -6.5,
      12
    ],
    "originalSize": [
      128,
      128
    ],
    "capInsets": [
      0,
      0,
      0,
      0
    ]
  }
}