{
  "__type__": "cc.SpriteFrame",
  "content": {
    "name": "Btn_Menu_VinhDanh",
    "texture": "2d4fcfa6-75f1-44a5-a3f0-adf838a2f481",
    "atlas": "",
    "rect": [
      20,
      19,
      164,
      26
    ],
    "offset": [
      0,
      3
    ],
    "originalSize": [
      204,
      70
    ],
    "capInsets": [
      0,
      0,
      0,
      0
    ]
  }
}