{
  "__type__": "cc.SpriteFrame",
  "content": {
    "name": "Number_win_baucua-export",
    "texture": "4b45662a-b64b-4357-8a14-00aff176ad87",
    "atlas": "",
    "rect": [
      0,
      0,
      87,
      254
    ],
    "offset": [
      -20.5,
      1
    ],
    "originalSize": [
      128,
      256
    ],
    "capInsets": [
      0,
      0,
      0,
      0
    ]
  }
}