{
  "__type__": "cc.SpriteFrame",
  "content": {
    "name": "UI_Popup_Title_QuenMatKhau",
    "texture": "0b641ac9-7dbd-4905-bc9a-d96a4430ffd7",
    "atlas": "",
    "rect": [
      0,
      0,
      281,
      47
    ],
    "offset": [
      0,
      0
    ],
    "originalSize": [
      281,
      47
    ],
    "capInsets": [
      0,
      0,
      0,
      0
    ]
  }
}