{
  "__type__": "cc.SpriteFrame",
  "content": {
    "name": "UI_popup_soicau_Xucxac1",
    "texture": "e76f500c-75d8-4a4b-89cf-77cfe8a27305",
    "atlas": "",
    "rect": [
      0,
      0,
      13,
      13
    ],
    "offset": [
      0,
      0
    ],
    "originalSize": [
      13,
      13
    ],
    "capInsets": [
      0,
      0,
      0,
      0
    ]
  }
}