{
  "__type__": "cc.SpriteFrame",
  "content": {
    "name": "UI_popup_LSC_Number_15",
    "texture": "8def83aa-1117-4699-81dc-e1b40b773ed4",
    "atlas": "",
    "rect": [
      0,
      0,
      56,
      48
    ],
    "offset": [
      0,
      0
    ],
    "originalSize": [
      56,
      48
    ],
    "capInsets": [
      0,
      0,
      0,
      0
    ]
  }
}