{
  "__type__": "cc.SpriteFrame",
  "content": {
    "name": "UI_popup_dsnguoichoi_BG",
    "texture": "f2b93876-8ff8-4a13-b993-2d5f8a3019e0",
    "atlas": "",
    "rect": [
      1,
      0,
      209,
      723
    ],
    "offset": [
      0.5,
      0.5
    ],
    "originalSize": [
      210,
      724
    ],
    "capInsets": [
      0,
      0,
      0,
      0
    ]
  }
}