{
  "__type__": "cc.SpriteFrame",
  "content": {
    "name": "UI_Main_blurchip_left",
    "texture": "7ad50b06-ceae-4696-ae41-02988fe2a824",
    "atlas": "",
    "rect": [
      0,
      0,
      73,
      138
    ],
    "offset": [
      0,
      0
    ],
    "originalSize": [
      73,
      138
    ],
    "capInsets": [
      0,
      0,
      0,
      0
    ]
  }
}