{
  "__type__": "cc.SpriteFrame",
  "content": {
    "name": "UI_popup_thongbao_title",
    "texture": "eda140e7-4327-4ab0-86b3-1493a7f8ad86",
    "atlas": "",
    "rect": [
      1,
      1,
      235,
      41
    ],
    "offset": [
      0.5,
      -0.5
    ],
    "originalSize": [
      236,
      42
    ],
    "capInsets": [
      0,
      0,
      0,
      0
    ]
  }
}