{
  "__type__": "cc.SpriteFrame",
  "content": {
    "name": "UI_Main_Noti_Bar",
    "texture": "d04c2523-f624-4c48-a83c-9231d808c658",
    "atlas": "",
    "rect": [
      0,
      0,
      1108,
      64
    ],
    "offset": [
      -1.5,
      0
    ],
    "originalSize": [
      1111,
      64
    ],
    "capInsets": [
      0,
      0,
      0,
      0
    ]
  }
}