{
  "__type__": "cc.SpriteFrame",
  "content": {
    "name": "UI_loading_sicbo",
    "texture": "3f9ddef5-ef9b-4f31-8bf5-58f9dd961c53",
    "atlas": "",
    "rect": [
      0,
      0,
      1560,
      960
    ],
    "offset": [
      0,
      0
    ],
    "originalSize": [
      1560,
      960
    ],
    "capInsets": [
      0,
      0,
      0,
      0
    ]
  }
}