{
  "__type__": "cc.SpriteFrame",
  "content": {
    "name": "UI_popup_chitiet_decoBG",
    "texture": "77d9aeac-ac0c-4875-9960-fd4324262c95",
    "atlas": "",
    "rect": [
      0,
      0,
      771,
      261
    ],
    "offset": [
      0,
      0
    ],
    "originalSize": [
      771,
      261
    ],
    "capInsets": [
      0,
      0,
      0,
      0
    ]
  }
}