{
  "__type__": "cc.SpriteFrame",
  "content": {
    "name": "Btn_Popup_Taoban_Arrow_Disable",
    "texture": "124ef2b1-dca5-4201-abcd-86037e08beed",
    "atlas": "",
    "rect": [
      0,
      0,
      31,
      51
    ],
    "offset": [
      0,
      0
    ],
    "originalSize": [
      31,
      51
    ],
    "capInsets": [
      0,
      0,
      0,
      0
    ]
  }
}