{
  "__type__": "cc.SpriteFrame",
  "content": {
    "name": "UI_popup_soicau_Tai",
    "texture": "1d9ddc8e-d454-4d9f-9fbc-7685a10c4825",
    "atlas": "",
    "rect": [
      0,
      0,
      56,
      56
    ],
    "offset": [
      0,
      0
    ],
    "originalSize": [
      56,
      56
    ],
    "capInsets": [
      0,
      0,
      0,
      0
    ]
  }
}