{
  "__type__": "cc.SpriteFrame",
  "content": {
    "name": "Btn_Main_DangNhap_normal",
    "texture": "9e03675d-828f-4e91-970c-b9946a25318e",
    "atlas": "",
    "rect": [
      0,
      0,
      209,
      67
    ],
    "offset": [
      0,
      0
    ],
    "originalSize": [
      209,
      67
    ],
    "capInsets": [
      0,
      0,
      0,
      0
    ]
  }
}