{
  "__type__": "cc.BitmapFont",
  "_name": "number_top_silver-export",
  "_objFlags": 0,
  "_native": "",
  "fntDataStr": "",
  "spriteFrame": {
    "__uuid__": "03aabf42-056a-4e6e-8759-5686fc07b22d"
  },
  "fontSize": 32,
  "_fntConfig": {
    "commonHeight": 36,
    "fontSize": 32,
    "atlasName": "number_top_silver-export.png",
    "fontDefDictionary": {
      "9": {
        "rect": {
          "x": 0,
          "y": 0,
          "width": 0,
          "height": 0
        },
        "xOffset": 0,
        "yOffset": 0,
        "xAdvance": 240
      },
      "32": {
        "rect": {
          "x": 0,
          "y": 0,
          "width": 0,
          "height": 0
        },
        "xOffset": 0,
        "yOffset": 0,
        "xAdvance": 8
      },
      "48": {
        "rect": {
          "x": 58,
          "y": 70,
          "width": 28,
          "height": 34
        },
        "xOffset": 0,
        "yOffset": 2,
        "xAdvance": 18
      },
      "49": {
        "rect": {
          "x": 94,
          "y": 0,
          "width": 21,
          "height": 33
        },
        "xOffset": 0,
        "yOffset": 2,
        "xAdvance": 11
      },
      "50": {
        "rect": {
          "x": 65,
          "y": 0,
          "width": 28,
          "height": 33
        },
        "xOffset": 0,
        "yOffset": 2,
        "xAdvance": 18
      },
      "51": {
        "rect": {
          "x": 87,
          "y": 69,
          "width": 27,
          "height": 34
        },
        "xOffset": 0,
        "yOffset": 2,
        "xAdvance": 17
      },
      "52": {
        "rect": {
          "x": 0,
          "y": 35,
          "width": 29,
          "height": 33
        },
        "xOffset": 0,
        "yOffset": 2,
        "xAdvance": 19
      },
      "53": {
        "rect": {
          "x": 29,
          "y": 69,
          "width": 28,
          "height": 34
        },
        "xOffset": 0,
        "yOffset": 2,
        "xAdvance": 18
      },
      "54": {
        "rect": {
          "x": 58,
          "y": 35,
          "width": 28,
          "height": 34
        },
        "xOffset": 0,
        "yOffset": 2,
        "xAdvance": 18
      },
      "55": {
        "rect": {
          "x": 30,
          "y": 35,
          "width": 27,
          "height": 33
        },
        "xOffset": 0,
        "yOffset": 2,
        "xAdvance": 17
      },
      "56": {
        "rect": {
          "x": 87,
          "y": 34,
          "width": 27,
          "height": 34
        },
        "xOffset": 0,
        "yOffset": 2,
        "xAdvance": 17
      },
      "57": {
        "rect": {
          "x": 0,
          "y": 69,
          "width": 28,
          "height": 33
        },
        "xOffset": 0,
        "yOffset": 2,
        "xAdvance": 18
      },
      "116": {
        "rect": {
          "x": 0,
          "y": 0,
          "width": 64,
          "height": 34
        },
        "xOffset": 0,
        "yOffset": 2,
        "xAdvance": 54
      }
    },
    "kerningDict": {}
  },
  "_fontDefDictionary": null
}