{
  "__type__": "cc.SpriteFrame",
  "content": {
    "name": "btn_popup_thongbao_dong_pressed",
    "texture": "84d96145-4622-4265-9027-c6c545ed1137",
    "atlas": "",
    "rect": [
      0,
      0,
      171,
      67
    ],
    "offset": [
      0,
      0
    ],
    "originalSize": [
      171,
      67
    ],
    "capInsets": [
      0,
      0,
      0,
      0
    ]
  }
}