{
  "__type__": "cc.SpriteFrame",
  "content": {
    "name": "Btn_Lobby_TaoBan",
    "texture": "db05a793-5b5b-4fb8-b198-c24538cf01fb",
    "atlas": "",
    "rect": [
      0,
      0,
      169,
      55
    ],
    "offset": [
      0,
      0.5
    ],
    "originalSize": [
      169,
      56
    ],
    "capInsets": [
      0,
      0,
      0,
      0
    ]
  }
}