{
  "__type__": "cc.SpriteFrame",
  "content": {
    "name": "UI_popup_giftcode_title",
    "texture": "2219063e-28ea-4e42-9cb8-1bc6e3d480fc",
    "atlas": "",
    "rect": [
      0,
      0,
      250,
      39
    ],
    "offset": [
      0,
      0
    ],
    "originalSize": [
      250,
      39
    ],
    "capInsets": [
      0,
      0,
      0,
      0
    ]
  }
}