{
  "__type__": "cc.SpriteFrame",
  "content": {
    "name": "anim_dice_12",
    "texture": "15129edb-900c-4cec-9427-d074666a99f8",
    "atlas": "",
    "rect": [
      14,
      46,
      209,
      194
    ],
    "offset": [
      -6,
      5
    ],
    "originalSize": [
      249,
      296
    ],
    "capInsets": [
      0,
      0,
      0,
      0
    ]
  }
}