{
  "__type__": "cc.SpriteFrame",
  "content": {
    "name": "UI_popup_LSC_Dice_5",
    "texture": "12c9bed6-8235-46c7-8e3b-305ba2794c68",
    "atlas": "",
    "rect": [
      0,
      0,
      53,
      53
    ],
    "offset": [
      0,
      0
    ],
    "originalSize": [
      53,
      53
    ],
    "capInsets": [
      0,
      0,
      0,
      0
    ]
  }
}