{
  "__type__": "cc.SpriteFrame",
  "content": {
    "name": "UI_popup_LSC_Dice_2",
    "texture": "955a49ec-4dea-4055-a4e1-ac4ff136a9bd",
    "atlas": "",
    "rect": [
      0,
      0,
      53,
      53
    ],
    "offset": [
      0,
      0
    ],
    "originalSize": [
      53,
      53
    ],
    "capInsets": [
      0,
      0,
      0,
      0
    ]
  }
}