{
  "__type__": "cc.SpriteFrame",
  "content": {
    "name": "singleColor",
    "texture": "7fd6d3b5-7701-48b5-ab78-2b12837020ee",
    "atlas": "",
    "rect": [
      0,
      0,
      2,
      2
    ],
    "offset": [
      0,
      0
    ],
    "originalSize": [
      2,
      2
    ],
    "capInsets": [
      0,
      0,
      0,
      0
    ]
  }
}