{
  "__type__": "cc.AnimationClip",
  "_name": "Show",
  "_objFlags": 0,
  "_native": "",
  "_duration": 0.25,
  "sample": 60,
  "speed": 0.7,
  "wrapMode": 1,
  "curveData": {
    "props": {
      "opacity": [
        {
          "frame": 0,
          "value": 0
        },
        {
          "frame": 0.25,
          "value": 255
        }
      ]
    },
    "paths": {
      "Root": {
        "props": {
          "x": [
            {
              "frame": 0,
              "value": 1438
            },
            {
              "frame": 0.21666666666666667,
              "value": 388
            },
            {
              "frame": 0.25,
              "value": 428
            }
          ]
        }
      }
    }
  },
  "events": [
    {
      "frame": 0.23333333333333334,
      "func": "showDone",
      "params": []
    }
  ]
}