{
  "__type__": "cc.SpriteFrame",
  "content": {
    "name": "Btn_main_tab",
    "texture": "f5e3de3b-863c-45bc-91b0-1a17a67db1c7",
    "atlas": "",
    "rect": [
      0,
      0,
      128,
      44
    ],
    "offset": [
      -0.5,
      0.5
    ],
    "originalSize": [
      129,
      45
    ],
    "capInsets": [
      0,
      0,
      0,
      0
    ]
  }
}