{
  "__type__": "cc.SpriteFrame",
  "content": {
    "name": "IC_Lobby_Poker_Table_1",
    "texture": "0e95a996-807a-4c74-92dd-dd82258cf259",
    "atlas": "",
    "rect": [
      0,
      0,
      263,
      129
    ],
    "offset": [
      0,
      0
    ],
    "originalSize": [
      263,
      129
    ],
    "capInsets": [
      0,
      0,
      0,
      0
    ]
  }
}