{
  "__type__": "cc.SpriteFrame",
  "content": {
    "name": "UI_MainUI_Avatar_Frame",
    "texture": "c26b737f-e477-49ff-b8cd-2cc934003e0b",
    "atlas": "",
    "rect": [
      0,
      0,
      95,
      99
    ],
    "offset": [
      -0.5,
      0.5
    ],
    "originalSize": [
      96,
      100
    ],
    "capInsets": [
      0,
      0,
      0,
      0
    ]
  }
}