{
  "__type__": "cc.SpriteFrame",
  "content": {
    "name": "SB_Main_Chip_500K",
    "texture": "95eb5ced-bb33-44cd-a6d9-5573cb18d877",
    "atlas": "",
    "rect": [
      0,
      0,
      95,
      98
    ],
    "offset": [
      0,
      0.5
    ],
    "originalSize": [
      95,
      99
    ],
    "capInsets": [
      0,
      0,
      0,
      0
    ]
  }
}