{
  "__type__": "cc.TextAsset",
  "_name": "Anim_main_soicau.atlas",
  "_objFlags": 0,
  "_native": "",
  "text": "\nAnim_main_soicau.png\nsize: 88,88\nformat: RGBA8888\nfilter: Linear,Linear\nrepeat: none\nGolden Star\n  rotate: false\n  xy: 2, 2\n  size: 81, 81\n  orig: 81, 81\n  offset: 0, 0\n  index: -1\n"
}