{
  "__type__": "cc.SpriteFrame",
  "content": {
    "name": "btn_main_setting",
    "texture": "48be58be-1350-4f40-9c7b-ac2a045a2699",
    "atlas": "",
    "rect": [
      0,
      0,
      67,
      70
    ],
    "offset": [
      0,
      0
    ],
    "originalSize": [
      67,
      70
    ],
    "capInsets": [
      0,
      0,
      0,
      0
    ]
  }
}