^C:\USERS\DRAGO\SOURCE\REPOS\FIRSTPROGRAMM\FIRSTPROGRAMM\FIRSTPROGRAMM.CPP
C:\USERS\DRAGO\SOURCE\REPOS\FIRSTPROGRAMM\FIRSTPROGRAMM\DEBUG\VC142.PDB
C:\USERS\DRAGO\SOURCE\REPOS\FIRSTPROGRAMM\FIRSTPROGRAMM\DEBUG\VC142.IDB
C:\USERS\DRAGO\SOURCE\REPOS\FIRSTPROGRAMM\FIRSTPROGRAMM\DEBUG\FIRSTPROGRAMM.OBJ
