^D:\UNREAL ENGINE PROJECT\VISUAL STUDIO C++\PROGRAMC++\PROGRAMC++\DEBUG\HELPERS.OBJ|D:\UNREAL ENGINE PROJECT\VISUAL STUDIO C++\PROGRAMC++\PROGRAMC++\DEBUG\PROGRAMC++.OBJ
D:\UNREAL ENGINE PROJECT\VISUAL STUDIO C++\PROGRAMC++\DEBUG\PROGRAMC++.EXE
D:\UNREAL ENGINE PROJECT\VISUAL STUDIO C++\PROGRAMC++\DEBUG\PROGRAMC++.ILK
D:\UNREAL ENGINE PROJECT\VISUAL STUDIO C++\PROGRAMC++\DEBUG\PROGRAMC++.PDB
