^D:\UNREAL ENGINE PROJECT\VISUAL STUDIO C++\PROGRAMC++\PROGRAMC++\HELPERS.CPP|D:\UNREAL ENGINE PROJECT\VISUAL STUDIO C++\PROGRAMC++\PROGRAMC++\PROGRAMC++.CPP
D:\UNREAL ENGINE PROJECT\VISUAL STUDIO C++\PROGRAMC++\PROGRAMC++\DEBUG\VC142.PDB
D:\UNREAL ENGINE PROJECT\VISUAL STUDIO C++\PROGRAMC++\PROGRAMC++\DEBUG\VC142.IDB
D:\UNREAL ENGINE PROJECT\VISUAL STUDIO C++\PROGRAMC++\PROGRAMC++\DEBUG\PROGRAMC++.OBJ
D:\UNREAL ENGINE PROJECT\VISUAL STUDIO C++\PROGRAMC++\PROGRAMC++\DEBUG\HELPERS.OBJ
^D:\UNREAL ENGINE PROJECT\VISUAL STUDIO C++\PROGRAMC++\PROGRAMC++\HELPERS.CPP
D:\UNREAL ENGINE PROJECT\VISUAL STUDIO C++\PROGRAMC++\PROGRAMC++\DEBUG\VC142.PDB
^D:\UNREAL ENGINE PROJECT\VISUAL STUDIO C++\PROGRAMC++\PROGRAMC++\PROGRAMC++.CPP
D:\UNREAL ENGINE PROJECT\VISUAL STUDIO C++\PROGRAMC++\PROGRAMC++\DEBUG\VC142.PDB
D:\UNREAL ENGINE PROJECT\VISUAL STUDIO C++\PROGRAMC++\PROGRAMC++\DEBUG\VC142.IDB
D:\UNREAL ENGINE PROJECT\VISUAL STUDIO C++\PROGRAMC++\PROGRAMC++\DEBUG\PROGRAMC++.OBJ
