[Event "Mestska soutez Ostrava"]
[Site ""]
[Date "2023.01.10"]
[Round "7"]
[White "Dračka Alexander"]
[Black "Lišták Břetislav"]
[Result "1-0"]


	   1.	Nf3 	d5 
	   2.	c4 	Nf6 
	   3.	cxd5 	Nxd5 
	   4.	Nc3 	Nxc3 
	   5.	bxc3 	Nc6 
	   6.	g3 	e6 
	   7.	Bg2 	Be7 
	   8.	O-O 	O-O 
	   9.	Rb1 	Rb8 
	  10.	d4 	Na5 
	  11.	Nd2 	b6 
	  12.	Qc2 	Bb7 
	  13.	e4 	c5 
	  14.	Bb2 	Rc8 
	  15.	Qd3 	Qd7 
	  16.	Bh3 	Qa4 
	  17.	d5 	Rcd8 
	  18.	c4 	Ba6 
	  19.	Qc3 	e5 
	  20.	Rfc1 	Bf6 
	  21.	Bf1 	Rc8 
	  22.	Be2 
1-0

