[Event "Prebor okresu Ostrava"]
[Site "Ostrava-CVC Vietnamska"]
[Date "2022.09.24"]
[Round "4"]
[White "Dracka Alexander"]
[Black "Kubanyi Robert"]
[Result "1-0"]

1.Nf3 Nf6 2.g3 g6 3.Bg2 Bg7 4.O-O Nc6 5.c4 e5 6.d3 d6 7.Bd2 e4 8.Ne1 exd3 
9.Nxd3 Ng4 10.Bc3 Nce5 11.h3 Ne3?! 12.fxe3 Qg5 13.Kf2 Bh6 14.Nf4 O-O 15.
Nd2 Bf5 16.Nf3 Qe7 17.Nd5 Qe8?? 18.Nf6+! 1-0

