[Event "Ostravsky Konik C"]
[Site "Cerna Louka"]
[Date "2023.05.10"]
[Round "5"]
[White "Pustejovsky Patrik"]
[Black "Dračka Alexander"]
[Result "0-1"]


	   1.	e4 	c5 
	   2.	c3 	Nf6 
	   3.	e5 	Nd5 
	   4.	d4 	cxd4 
	   5.	cxd4 	d6 
	   6.	Nf3 	Nc6 
	   7.	Bb5 	Qa5+ 
	   8.	Nc3 	Nxc3 
	   9.	Bxc6+ 	bxc6 
	  10.	bxc3 	Qxc3+ 
	  11.	Bd2 	Qd3 
	  12.	Qa4 	Bd7 
	  13.	exd6 	exd6 
	  14.	O-O-O 	Rb8 
	  15.	Rde1+ 	Be7 
	  16.	Qc2 	Qxc2+ 
	  17.	Kxc2 	Bf5+ 
	  18.	Kc3 	Rb7 
	  19.	Bf4 	Be6 
	  20.	Rb1 	Rd7 
	  21.	Rhe1 	O-O 
	  22.	Ng5 	Bxg5 
	  23.	Bxg5 	Bxa2 
	  24.	Ra1 	Be6 
	  25.	Ra6 	Rc8 
	  26.	Rea1 	h6 
	  27.	Bf4 	g5 
	  28.	Bg3 	Rcc7 
	  29.	f4 	f5 
	  30.	R6a5 	Rb7 
	  31.	Ra6 	Bd5 
	  32.	fxg5 	hxg5 
	  33.	R1a5 	f4 
	  34.	Be1 	Kf7 
	  35.	Kc2 	Kg6 
	  36.	Ra3 	Bxg2 
	  37.	h3 	Re7 
	  38.	Bd2 	Be4+ 
	  39.	Kd1 	Rb1+ 
	  40.	Bc1 	f3 
	  41.	Ra2 	Bd5 
	  42.	Rd2 	Bb3+ 

0-1

