\babel@toc {slovak}{}
\beamer@sectionintoc {1}{Theory}{3}{0}{1}
\beamer@sectionintoc {2}{g3 variation}{5}{0}{2}
\beamer@sectionintoc {3}{b4 variation}{9}{0}{3}
\beamer@sectionintoc {4}{e3 variation}{11}{0}{4}
