[Event "Ostravsky Konik C"]
[Site ""]
[Date "2022.05.06"]
[Round "7"]
[White "Barteckova Valerie"]
[Black "Dracka Alexander"]
[Result "1/2-1/2"]
[Annotator "Stockfish 080721 (10 sec)"]
[FlipB "1"]


	   1.	d4 	Nf6 
	   2.	Nf3 	g6 
	   3.	c4 	Bg7 
	   4.	Nc3 	O-O 
	   5.	e3 	d6 
	   6.	Be2 	c6 
	   7.	O-O 	Nbd7 
	   8.	b3 	e5 
	   9.	Bb2 	e4 
	  10.	Nd2 	d5 
	  11.	Re1 	Re8 
	  12.	Nf1 	Nf8 
	  13.	Ng3 	Qd6 
	  14.	Rc1 	a6 
	  15.	h3 	Bd7 
	  16.	Na4 	b5 
	  17.	Nc5 	Ne6 
	  18.	cxd5 	cxd5 
	  19.	Qd2 	Qb6 
	  20.	Ba3 	Bf8 
	  21.	Rc2 	a5 
	  22.	Nxd7 	Nxd7 
	  23.	Bxf8 	Rxf8 
	  24.	Rec1 	Qb7 
	  25.	Rc6 	b4 
	  26.	Qd1 	Nb8 
	  27.	R6c2 	f5 
	  28.	Qd2 	Qf7 
	  29.	Bb5 	Nd7 
	  30.	Bc6 	Rad8 
	  31.	Bxd5 	Nb6 
	  32.	Bxe6 	Qxe6 
	  33.	Rc6 	Rd6 
	  34.	Qc2 	Nd5 
	  35.	Rxd6 	Qxd6 
	  36.	Qc5 	Qd8 
	  37.	Ne2 	g5 
	  38.	Qc6 	Qa8 
	  39.	Qxa8 	Rxa8 
	  40.	Rc5 	Ne7 
	  41.	Rb5 	h6 
	  42.	Ng3 	a4 
	  43.	Rxb4 	axb3 
	  44.	axb3 	Ra1+ 
	  45.	Nf1 	Nd5 
	  46.	Rc4 	f4 
	  47.	exf4 	e3 
	  48.	Rc2 	gxf4 
	  49.	fxe3 	Rxf1+ 
	  50.	Kxf1 	Nxe3+ 
	  51.	Ke2 	Nxc2 
	  52.	Kf3 
1/2-1/2

