[Event "Mestsky Prebor"]
[Site ""]
[Date "2022.11.15"]
[Round "3"]
[White "Lycka Jaromir"]
[Black "Dračka Alexander"]
[Result "1-0"]


	   1.	e4 	c5 
	   2.	Nf3 	d6 
	   3.	b4 	b6 
	   4.	bxc5 	bxc5 
	   5.	Bc4 	e6 
	   6.	O-O 	Nc6 
	   7.	Nc3 	Nf6 
	   8.	d3 	Be7 
	   9.	Bf4 	e5 
	  10.	Bg5 	Be6 
	  11.	Bb5 	Qc7 
	  12.	Bxf6 	gxf6 
	  13.	Nd5 	Qc8 
	  14.	Nh4 	Kf8 
	  15.	Qh5 	h6 
	  16.	Nf5 	Bxf5 
	  17.	exf5 	Nd4 
	  18.	Nxe7 	Kxe7 
	  19.	Bc4 	Qg8 
	  20.	Bd5 	Rb8 
	  21.	Rab1 	Qh7 
	  22.	c3 	Nb5 
	  23.	Rb3 	Nc7 
	  24.	Be4 	d5 
	  25.	Bf3 	Qg7 
	  26.	Rfb1 	Rxb3 
	  27.	Rxb3 	Kd6 
	  28.	c4 	Qg5 
	  29.	g3 	Qxh5 
	  30.	Bxh5 	Rf8 
	  31.	Ra3 	a6 
	  32.	Rb3 	Kc6 
	  33.	a4 	a5 
	  34.	Bf3 	Rd8 
	  35.	Kf1 	Rd6 
	  36.	Ke2 	Kd7 
	  37.	Bxd5 	Nxd5 
	  38.	cxd5 	Rxd5 
	  39.	Rb5 	Kc6 
	  40.	Rxa5 	c4 
	  41.	Rxd5 	Kxd5 
	  42.	dxc4+ 	Kxc4 
	  43.	Ke3 	Kb4 
	  44.	Ke4 	Kc4 
	  45.	f4 	exf4 
	  46.	Kxf4 	h5 
	  47.	g4 	h4 
	  48.	g5 
1-0

