[Event "Ostravsky Konik C"]
[Site "Ostrava"]
[Date "2019.04.28"]
[Round "2"]
[White "Vyvial"]
[Black "Dračka Alexander"]
[Result "0-1"]
[FlipB "1"]


	   1.	e4    	e6    
	   2.	d4    	d5    
	   3.	exd5  	exd5  
	   4.	Nf3   	Nf6   
	   5.	Bg5   	Be7   
	   6.	Be2   	O-O   
	   7.	O-O   	h6    
	   8.	Bh4   	Nc6   
	   9.	Nbd2  	Bd6   
	  10.	c4    	g5    
	  11.	Bg3   	Bxg3  
	  12.	hxg3  	Bg4   
	  13.	Qb3   	b6    
	  14.	cxd5  	Qxd5  
	  15.	Qxd5  	Nxd5  
	  16.	Bc4   	Nde7  
	  17.	Ne5   	Be6   
	  18.	Ba6   	Nb4   
	  19.	Bc4   	Bxc4  
	  20.	Ndxc4 	Nc2   
	  21.	Rad1  	Rad8  
	  22.	Rd2   	Nxd4  
	  23.	Rfd1  	c5    
	  24.	Ne3   	f6    
	  25.	N5c4  	Nec6  
	  26.	a3 -/+ 	b5    
	  27.	Na5   	Nxa5 -+ 
	  28.	Nf5   	Nab3  
	  29.	Rd3   	Kh7   
	  30.	Kf1   	Rfe8  
	  31.	Nxd4  	Nxd4  
	  32.	b4    	Nc6   
	  33.	Rd7+  	Rxd7  
	  34.	Rxd7+ 	Re7   
	  35.	Rd6   	Ne5   
	  36.	bxc5  	Kg6 -+ 
	  37.	f4    	Nc4   
	  38.	Rc6   	Nxa3  
	  39.	Rc8   	Nc4   
	  40.	c6    	Nb6   
	  41.	Rb8   	b4    
	  42.	Rb7   	Rxb7  
	  43.	cxb7  	Nd7   
	  44.	Ke2   	a5    
	  45.	Kd3   	gxf4  
	  46.	gxf4  
0-1

