[Event "Mistrovstvi Ostravy"]
[Site "Ostrava"]
[Date "2020.10.11"]
[Round "3"]
[White "Dračka Alexander"]
[Black "Huvar Jan"]
[Result "1/2-1/2"]


	   1.	Nf3   	c5    
	   2.	c4    	Nf6   
	   3.	Nc3   	Nc6   
	   4.	g3    	g6    
	   5.	Bg2   	Bg7   
	   6.	d4    	cxd4  
	   7.	Nxd4  	Nxd4  
	   8.	Qxd4  	O-O   
	   9.	Bg5   	h6    
	  10.	Bxf6  	Bxf6  
	  11.	Qd2   	d6    
	  12.	Qxh6  	Qc7   
	  13.	Nd5 += 	Qxc4  
	  14.	Nxf6+ 	exf6  
	  15.	Qd2   	Re8   
	  16.	b3    	Qa6   
	  17.	Bf3   	Bh3   
	  18.	b4    	Re5   
	  19.	g4    	Rae8 =+ 
	  20.	Rg1   	f5    
	  21.	e3 -/+ 
1/2-1/2

