\babel@toc {slovak}{}
\beamer@sectionintoc {1}{Základy}{4}{0}{1}
\beamer@sectionintoc {2}{Otvorené hry}{10}{0}{2}
\beamer@sectionintoc {3}{Polootvorené hry}{16}{0}{3}
\beamer@sectionintoc {4}{Zatvorené hry}{20}{0}{4}
