This is BibTeX, Version 0.99dThe top-level auxiliary file: Dra0021_ELP_Prezentace.aux
I found no \citation commands---while reading file Dra0021_ELP_Prezentace.aux
I found no \bibdata command---while reading file Dra0021_ELP_Prezentace.aux
I found no \bibstyle command---while reading file Dra0021_ELP_Prezentace.aux
(There were 3 error messages)
