[Event "Mestska soutez Ostrava"]
[Site ""]
[Date "2022.12.06"]
[Round "5"]
[White "Holan Pavel"]
[Black "Dračka Alexander"]
[Result "1/2-1/2"]
[FlipB "1"]


	   1.	e4 	c5 
	   2.	Bc4 	e6 
	   3.	Nf3 	d5 
	   4.	exd5 	exd5 
	   5.	Be2 	Nf6 
	   6.	h3 	Be7 
	   7.	d3 	Nc6 
	   8.	Bf4 	O-O 
	   9.	O-O 	b5 
	  10.	a3 	Bb7 
	  11.	Nbd2 	d4 
	  12.	Nh2 	Re8 
	  13.	Bf3 	Bd6 
	  14.	Bxd6 	Qxd6 
	  15.	Ne4 	Nxe4 
	  16.	Bxe4 	Re7 
	  17.	Qd2 	Rae8 
	  18.	Rae1 	g6 
	  19.	Qh6 	f5 
	  20.	f3 	fxe4 
	  21.	fxe4 	Ne5 
	  22.	Rf2 	Nf7 
	  23.	Qh4 	g5 
	  24.	Qg4 	Bc8 
	  25.	Qe2 	Qg6 
	  26.	Ref1 	Rf8 
	  27.	Rf6 	Qg7 
	  28.	R1f2 	Re6 
	  29.	R6f3 
1/2-1/2

