\headcommand {\slideentry {0}{0}{1}{1/1}{}{0}}
\headcommand {\beamer@framepages {1}{1}}
\headcommand {\slideentry {0}{0}{2}{3/3}{}{0}}
\headcommand {\beamer@framepages {3}{3}}
\headcommand {\beamer@sectionpages {1}{3}}
\headcommand {\beamer@subsectionpages {1}{3}}
\headcommand {\sectionentry {1}{Základy}{4}{Základy}{0}}
\headcommand {\slideentry {1}{0}{0}{4/4}{}{0}}
\headcommand {\beamer@framepages {4}{4}}
\headcommand {\slideentry {1}{0}{1}{5/5}{}{0}}
\headcommand {\beamer@framepages {5}{5}}
\headcommand {\slideentry {1}{0}{2}{6/6}{}{0}}
\headcommand {\beamer@framepages {6}{6}}
\headcommand {\slideentry {1}{0}{3}{7/7}{}{0}}
\headcommand {\beamer@framepages {7}{7}}
\headcommand {\slideentry {1}{0}{4}{8/8}{}{0}}
\headcommand {\beamer@framepages {8}{8}}
\headcommand {\slideentry {1}{0}{5}{9/9}{}{0}}
\headcommand {\beamer@framepages {9}{9}}
\headcommand {\beamer@sectionpages {1}{9}}
\headcommand {\beamer@subsectionpages {1}{9}}
\headcommand {\sectionentry {2}{Otvorené hry}{10}{Otvorené hry}{0}}
\headcommand {\slideentry {2}{0}{1}{10/10}{}{0}}
\headcommand {\beamer@framepages {10}{10}}
\headcommand {\slideentry {2}{0}{2}{11/11}{}{0}}
\headcommand {\beamer@framepages {11}{11}}
\headcommand {\slideentry {2}{0}{3}{12/12}{}{0}}
\headcommand {\beamer@framepages {12}{12}}
\headcommand {\slideentry {2}{0}{4}{13/13}{}{0}}
\headcommand {\beamer@framepages {13}{13}}
\headcommand {\slideentry {2}{0}{5}{14/14}{}{0}}
\headcommand {\beamer@framepages {14}{14}}
\headcommand {\slideentry {2}{0}{6}{15/15}{}{0}}
\headcommand {\beamer@framepages {15}{15}}
\headcommand {\beamer@sectionpages {10}{15}}
\headcommand {\beamer@subsectionpages {10}{15}}
\headcommand {\sectionentry {3}{Polootvorené hry}{16}{Polootvorené hry}{0}}
\headcommand {\slideentry {3}{0}{1}{16/16}{}{0}}
\headcommand {\beamer@framepages {16}{16}}
\headcommand {\slideentry {3}{0}{2}{17/17}{}{0}}
\headcommand {\beamer@framepages {17}{17}}
\headcommand {\slideentry {3}{0}{3}{18/18}{}{0}}
\headcommand {\beamer@framepages {18}{18}}
\headcommand {\slideentry {3}{0}{4}{19/19}{}{0}}
\headcommand {\beamer@framepages {19}{19}}
\headcommand {\beamer@sectionpages {16}{19}}
\headcommand {\beamer@subsectionpages {16}{19}}
\headcommand {\sectionentry {4}{Zatvorené hry}{20}{Zatvorené hry}{0}}
\headcommand {\slideentry {4}{0}{1}{20/20}{}{0}}
\headcommand {\beamer@framepages {20}{20}}
\headcommand {\beamer@partpages {1}{20}}
\headcommand {\beamer@subsectionpages {20}{20}}
\headcommand {\beamer@sectionpages {20}{20}}
\headcommand {\beamer@documentpages {20}}
\headcommand {\gdef \inserttotalframenumber {19}}
