[Event "Ostravsky Konik C"]
[Site "Ostrava"]
[Date "2022.05.08"]
[Round "9"]
[White "Bok Ondrej"]
[Black "Dracka Alexander"]
[Result "1/2-1/2"]
[FlipB "1"]


	   1.	e4 	c5 
	   2.	Nf3 	d6 
	   3.	d4 	cxd4 
	   4.	Nxd4 	Nf6 
	   5.	Nc3 	a6 
	   6.	Bc4 	e6 
	   7.	Bg5 	Be7 
	   8.	Bb3 	O-O 
	   9.	Qf3 	Nc6 
	  10.	Rd1 	e5 
	  11.	Nde2 	Nd4 
	  12.	Qd3 	Nxb3 
	  13.	axb3 	Ne8 
	  14.	Bxe7 	Qxe7 
	  15.	Nd5 	Qd8 
	  16.	O-O 	f5 
	  17.	f4 	fxe4 
	  18.	Qxe4 	Bf5 
	  19.	Qc4 	Be6 
	  20.	Nec3 	Rc8 
	  21.	Qe4 	Bf5 
	  22.	Qe2 	Nf6 
	  23.	fxe5 	Nxd5 
	  24.	Rxd5 	Qb6+ 
	  25.	Kh1 	Bg4 
	  26.	Rxf8+ 	Rxf8 
	  27.	Qc4 	Be6 
	  28.	h3 	Qf2 
	  29.	Ne4 	Qf1+ 
	  30.	Kh2 	Qxc4 
	  31.	bxc4 	Bxd5 
	  32.	cxd5 	dxe5 
	  33.	c4 	b6 
	  34.	b3 	h6 
	  35.	Kg3 	Rf4 
	  36.	Nd2 	g5 
	  37.	b4 	e4 
	  38.	c5 	bxc5 
	  39.	bxc5 	e3 
	  40.	Nf3 	e2 
	  41.	Kf2 
1/2-1/2

