[Event "Ostravsky Konik C"]
[Site ""]
[Date "2022.05.04"]
[Round "Gnojek Jan"]
[White "Dracka Alexander"]
[Black ""]
[Result "1/2-1/2"]
[Annotator "Stockfish 080721 (10 sec)"]
[FlipB "1"]

1.e4 c5 2.Nf3 d6 3.d4 cxd4 4.Nxd4 Nf6 5.Nc3 a6 6.f3 e6 7.Bg5 Be7 8.Bc4 O-O
9.Bb3 Nc6 10.Nxc6 bxc6 11.Qd2 Bb7 12.O-O-O d5 13.e5 Nd7 14.Bxe7 Qxe7 15.f4
Nc5 16.h4 Nxb3+ 17.axb3 f6 18.Rde1 Rad8 19.exf6 Rxf6 20.g4 Rdf8 21.Ne2 c5 
22.g5 Rf5 23.Rhf1 Qd7 24.Ng3 R5f7 25.h5 Bc8 26.g6 hxg6 27.hxg6 Rf6 28.Nh5 
Rxg6 29.Qc3 d4 30.Qxc5 Rf5 31.Re5 Rxe5 32.Qxe5 Qb5 1/2-1/2

