%YAML 1.1
%TAG !u! tag:unity3d.com,2011:
--- !u!114 &11400000
MonoBehaviour:
  m_ObjectHideFlags: 0
  m_CorrespondingSourceObject: {fileID: 0}
  m_PrefabInstance: {fileID: 0}
  m_PrefabAsset: {fileID: 0}
  m_GameObject: {fileID: 0}
  m_Enabled: 1
  m_EditorHideFlags: 0
  m_Script: {fileID: 11500000, guid: c471a521c52b30b42b6a46efb9ca57d6, type: 3}
  m_Name: SummonData
  m_EditorClassIdentifier: 
  skill:
    skill: Ama skil
  skillOwned: 0
  skillName: "\u041F\u0440\u0438\u0437\u044B\u0432"
  skillDescription: "\u041F\u0440\u0438\u0437\u044B\u0432\u0430\u0439\u0442\u0435
    \u0430\u043D\u0438\u043C\u0435\u0448\u043D\u044B\u0445 \u043A\u043E\u0448\u043A\u043E-\u0434\u0435\u0432\u043E\u0447\u0435\u043A.
    \u0414\u0430, \u044D\u0442\u043E \u043D\u0435 \u0441\u043B\u0438\u0448\u043A\u043E\u043C
    \u0431\u043E\u0435\u0432\u043E\u0439 \u043D\u0430\u0432\u044B\u043A. \u041D\u043E
    \u0440\u0430\u0437\u0432\u0435 \u0432\u044B \u043F\u0440\u043E\u0442\u0438\u0432?"
  skillCost: 6942
