%YAML 1.1
%TAG !u! tag:unity3d.com,2011:
--- !u!114 &11400000
MonoBehaviour:
  m_ObjectHideFlags: 0
  m_CorrespondingSourceObject: {fileID: 0}
  m_PrefabInstance: {fileID: 0}
  m_PrefabAsset: {fileID: 0}
  m_GameObject: {fileID: 0}
  m_Enabled: 1
  m_EditorHideFlags: 0
  m_Script: {fileID: 11500000, guid: c471a521c52b30b42b6a46efb9ca57d6, type: 3}
  m_Name: EdictData
  m_EditorClassIdentifier: 
  skill:
    skill: Ama skil
  skillOwned: 0
  skillName: "\u042D\u0434\u0438\u043A\u0442"
  skillDescription: "\u0422\u0435\u043F\u0435\u0440\u044C \u0432\u044B \u043C\u043E\u0436\u0435\u0442\u0435
    \u0432\u044B\u043F\u0443\u0441\u043A\u0430\u0442\u044C \u042D\u0434\u0438\u043A\u0442\u044B
    (\u0441 \u0431\u043E\u043B\u044C\u0448\u043E\u0439 \u0431\u0443\u043A\u0432\u044B).
    \u0420\u0435\u0448\u0430\u0439\u0442\u0435 \u0441\u0443\u0434\u044C\u0431\u0443
    \u0440\u0435\u0433\u0438\u043E\u043D\u043E\u0432 \u0441\u0432\u043E\u0435\u0439
    \u043C\u0430\u0433\u0438\u0435\u0439."
  skillCost: 100
