%YAML 1.1
%TAG !u! tag:unity3d.com,2011:
--- !u!114 &11400000
MonoBehaviour:
  m_ObjectHideFlags: 0
  m_CorrespondingSourceObject: {fileID: 0}
  m_PrefabInstance: {fileID: 0}
  m_PrefabAsset: {fileID: 0}
  m_GameObject: {fileID: 0}
  m_Enabled: 1
  m_EditorHideFlags: 0
  m_Script: {fileID: 11500000, guid: c471a521c52b30b42b6a46efb9ca57d6, type: 3}
  m_Name: HbSwordData
  m_EditorClassIdentifier: 
  skill:
    skill: Ama skil
  skillOwned: 0
  skillName: "\u041C\u0435\u0447 \u043F\u0430\u043B\u0430\u0447\u0430"
  skillDescription: "\u0423 \u0432\u0430\u0441 \u0442\u0435\u043F\u0435\u0440\u044C
    \u0435\u0441\u0442\u044C \u043A\u0440\u0443\u0442\u043E\u0439 \u043C\u0435\u0447
    \u0441 \u0440\u0442\u0443\u0442\u044C\u044E \u0432\u043D\u0443\u0442\u0440\u0438.
    \u041F\u0440\u0430\u043A\u0442\u0438\u0447\u043D\u043E \u043B\u0438 \u044D\u0442\u043E?
    \u0412\u0440\u044F\u0434 \u043B\u0438, \u043D\u043E \u0437\u0432\u0443\u0447\u0438\u0442
    \u043A\u0440\u0443\u0442\u043E."
  skillCost: 0
