%YAML 1.1
%TAG !u! tag:unity3d.com,2011:
--- !u!114 &11400000
MonoBehaviour:
  m_ObjectHideFlags: 0
  m_CorrespondingSourceObject: {fileID: 0}
  m_PrefabInstance: {fileID: 0}
  m_PrefabAsset: {fileID: 0}
  m_GameObject: {fileID: 0}
  m_Enabled: 1
  m_EditorHideFlags: 0
  m_Script: {fileID: 11500000, guid: c471a521c52b30b42b6a46efb9ca57d6, type: 3}
  m_Name: BreathData
  m_EditorClassIdentifier: 
  skillOwned: 1
  skillType: 0
  skillName: "\u0414\u044B\u0445\u0430\u043D\u0438\u0435"
  skillDescription: "\u041F\u043E\u0437\u0434\u0440\u0430\u0432\u043B\u044F\u0435\u043C,
    \u0442\u0435\u043F\u0435\u0440\u044C \u0432\u044B \u0443\u043C\u0435\u0435\u043C
    \u0434\u044B\u0448\u0430\u0442\u044C! \u041B\u0430\u0434\u043D\u043E, \u0432\u044B
    \u0443\u043C\u0435\u043B\u0438 \u0434\u0435\u043B\u0430\u0442\u044C \u044D\u0442\u043E
    \u0438\u0437\u043D\u0430\u0447\u0430\u043B\u044C\u043D\u043E. \u041D\u0438\u0447\u0435\u0433\u043E
    \u0438\u043D\u0442\u0435\u0440\u0435\u0441\u043D\u043E\u0433\u043E."
  skillCost: 10
