{
  "configVersion": 2,
  "packages": [
    {
      "name": "after_layout",
      "rootUri": "file:///E:/Khoa/library/flutter/.pub-cache/hosted/pub.dartlang.org/after_layout-1.0.7+2",
      "packageUri": "lib/",
      "languageVersion": "2.0"
    },
    {
      "name": "animated_splash",
      "rootUri": "file:///E:/Khoa/library/flutter/.pub-cache/hosted/pub.dartlang.org/animated_splash-1.0.0",
      "packageUri": "lib/",
      "languageVersion": "2.1"
    },
    {
      "name": "animated_text_kit",
      "rootUri": "file:///E:/Khoa/library/flutter/.pub-cache/hosted/pub.dartlang.org/animated_text_kit-2.2.0",
      "packageUri": "lib/",
      "languageVersion": "2.0"
    },
    {
      "name": "app_settings",
      "rootUri": "file:///E:/Khoa/library/flutter/.pub-cache/hosted/pub.dartlang.org/app_settings-4.0.2",
      "packageUri": "lib/",
      "languageVersion": "2.0"
    },
    {
      "name": "apple_sign_in",
      "rootUri": "file:///E:/Khoa/library/flutter/.pub-cache/hosted/pub.dartlang.org/apple_sign_in-0.1.0",
      "packageUri": "lib/",
      "languageVersion": "2.2"
    },
    {
      "name": "archive",
      "rootUri": "file:///E:/Khoa/library/flutter/.pub-cache/hosted/pub.dartlang.org/archive-2.0.13",
      "packageUri": "lib/",
      "languageVersion": "2.0"
    },
    {
      "name": "args",
      "rootUri": "file:///E:/Khoa/library/flutter/.pub-cache/hosted/pub.dartlang.org/args-1.6.0",
      "packageUri": "lib/",
      "languageVersion": "2.3"
    },
    {
      "name": "async",
      "rootUri": "file:///E:/Khoa/library/flutter/.pub-cache/hosted/pub.dartlang.org/async-2.4.2",
      "packageUri": "lib/",
      "languageVersion": "2.2"
    },
    {
      "name": "auto_size_text",
      "rootUri": "file:///E:/Khoa/library/flutter/.pub-cache/hosted/pub.dartlang.org/auto_size_text-2.1.0",
      "packageUri": "lib/",
      "languageVersion": "2.0"
    },
    {
      "name": "awesome_card",
      "rootUri": "file:///E:/Khoa/library/flutter/.pub-cache/hosted/pub.dartlang.org/awesome_card-1.1.0",
      "packageUri": "lib/",
      "languageVersion": "2.1"
    },
    {
      "name": "boolean_selector",
      "rootUri": "file:///E:/Khoa/library/flutter/.pub-cache/hosted/pub.dartlang.org/boolean_selector-2.0.0",
      "packageUri": "lib/",
      "languageVersion": "2.4"
    },
    {
      "name": "cached_network_image",
      "rootUri": "file:///E:/Khoa/library/flutter/.pub-cache/hosted/pub.dartlang.org/cached_network_image-2.2.0+1",
      "packageUri": "lib/",
      "languageVersion": "2.1"
    },
    {
      "name": "carousel_pro",
      "rootUri": "file:///E:/Khoa/library/flutter/.pub-cache/hosted/pub.dartlang.org/carousel_pro-1.0.0",
      "packageUri": "lib/",
      "languageVersion": "2.0"
    },
    {
      "name": "characters",
      "rootUri": "file:///E:/Khoa/library/flutter/.pub-cache/hosted/pub.dartlang.org/characters-1.0.0",
      "packageUri": "lib/",
      "languageVersion": "2.6"
    },
    {
      "name": "charcode",
      "rootUri": "file:///E:/Khoa/library/flutter/.pub-cache/hosted/pub.dartlang.org/charcode-1.1.3",
      "packageUri": "lib/",
      "languageVersion": "2.0"
    },
    {
      "name": "chewie",
      "rootUri": "file:///E:/Khoa/library/flutter/.pub-cache/hosted/pub.dartlang.org/chewie-0.9.10",
      "packageUri": "lib/",
      "languageVersion": "2.0"
    },
    {
      "name": "chewie_audio",
      "rootUri": "file:///E:/Khoa/library/flutter/.pub-cache/hosted/pub.dartlang.org/chewie_audio-1.0.0+1",
      "packageUri": "lib/",
      "languageVersion": "2.0"
    },
    {
      "name": "clock",
      "rootUri": "file:///E:/Khoa/library/flutter/.pub-cache/hosted/pub.dartlang.org/clock-1.0.1",
      "packageUri": "lib/",
      "languageVersion": "2.0"
    },
    {
      "name": "collection",
      "rootUri": "file:///E:/Khoa/library/flutter/.pub-cache/hosted/pub.dartlang.org/collection-1.14.13",
      "packageUri": "lib/",
      "languageVersion": "2.3"
    },
    {
      "name": "configurable_expansion_tile",
      "rootUri": "file:///E:/Khoa/library/flutter/.pub-cache/hosted/pub.dartlang.org/configurable_expansion_tile-1.0.0",
      "packageUri": "lib/",
      "languageVersion": "2.0"
    },
    {
      "name": "connectivity",
      "rootUri": "file:///E:/Khoa/library/flutter/.pub-cache/hosted/pub.dartlang.org/connectivity-0.4.9",
      "packageUri": "lib/",
      "languageVersion": "2.1"
    },
    {
      "name": "connectivity_for_web",
      "rootUri": "file:///E:/Khoa/library/flutter/.pub-cache/hosted/pub.dartlang.org/connectivity_for_web-0.3.0",
      "packageUri": "lib/",
      "languageVersion": "2.6"
    },
    {
      "name": "connectivity_macos",
      "rootUri": "file:///E:/Khoa/library/flutter/.pub-cache/hosted/pub.dartlang.org/connectivity_macos-0.1.0+2",
      "packageUri": "lib/",
      "languageVersion": "2.1"
    },
    {
      "name": "connectivity_platform_interface",
      "rootUri": "file:///E:/Khoa/library/flutter/.pub-cache/hosted/pub.dartlang.org/connectivity_platform_interface-1.0.3",
      "packageUri": "lib/",
      "languageVersion": "2.0"
    },
    {
      "name": "convert",
      "rootUri": "file:///E:/Khoa/library/flutter/.pub-cache/hosted/pub.dartlang.org/convert-2.1.1",
      "packageUri": "lib/",
      "languageVersion": "1.17"
    },
    {
      "name": "country_code_picker",
      "rootUri": "file:///E:/Khoa/library/flutter/.pub-cache/hosted/pub.dartlang.org/country_code_picker-1.4.0",
      "packageUri": "lib/",
      "languageVersion": "2.2"
    },
    {
      "name": "country_pickers",
      "rootUri": "file:///E:/Khoa/library/flutter/.pub-cache/hosted/pub.dartlang.org/country_pickers-1.3.0",
      "packageUri": "lib/",
      "languageVersion": "2.1"
    },
    {
      "name": "crypto",
      "rootUri": "file:///E:/Khoa/library/flutter/.pub-cache/hosted/pub.dartlang.org/crypto-2.1.4",
      "packageUri": "lib/",
      "languageVersion": "2.1"
    },
    {
      "name": "css_colors",
      "rootUri": "file:///E:/Khoa/library/flutter/.pub-cache/hosted/pub.dartlang.org/css_colors-1.0.2",
      "packageUri": "lib/",
      "languageVersion": "1.19"
    },
    {
      "name": "csslib",
      "rootUri": "file:///E:/Khoa/library/flutter/.pub-cache/hosted/pub.dartlang.org/csslib-0.16.2",
      "packageUri": "lib/",
      "languageVersion": "2.2"
    },
    {
      "name": "custom_splash",
      "rootUri": "file:///E:/Khoa/library/flutter/.pub-cache/hosted/pub.dartlang.org/custom_splash-0.0.2",
      "packageUri": "lib/",
      "languageVersion": "2.1"
    },
    {
      "name": "event_bus",
      "rootUri": "file:///E:/Khoa/library/flutter/.pub-cache/hosted/pub.dartlang.org/event_bus-1.1.1",
      "packageUri": "lib/",
      "languageVersion": "2.0"
    },
    {
      "name": "extended_image",
      "rootUri": "file:///E:/Khoa/library/flutter/.pub-cache/hosted/pub.dartlang.org/extended_image-1.1.0",
      "packageUri": "lib/",
      "languageVersion": "2.6"
    },
    {
      "name": "extended_image_library",
      "rootUri": "file:///E:/Khoa/library/flutter/.pub-cache/hosted/pub.dartlang.org/extended_image_library-0.2.3",
      "packageUri": "lib/",
      "languageVersion": "2.1"
    },
    {
      "name": "facebook_audience_network",
      "rootUri": "file:///E:/Khoa/library/flutter/.pub-cache/hosted/pub.dartlang.org/facebook_audience_network-0.7.0",
      "packageUri": "lib/",
      "languageVersion": "2.1"
    },
    {
      "name": "fake_async",
      "rootUri": "file:///E:/Khoa/library/flutter/.pub-cache/hosted/pub.dartlang.org/fake_async-1.1.0",
      "packageUri": "lib/",
      "languageVersion": "2.2"
    },
    {
      "name": "file",
      "rootUri": "file:///E:/Khoa/library/flutter/.pub-cache/hosted/pub.dartlang.org/file-5.1.0",
      "packageUri": "lib/",
      "languageVersion": "2.2"
    },
    {
      "name": "firebase",
      "rootUri": "file:///E:/Khoa/library/flutter/.pub-cache/hosted/pub.dartlang.org/firebase-7.3.0",
      "packageUri": "lib/",
      "languageVersion": "2.7"
    },
    {
      "name": "firebase_admob",
      "rootUri": "file:///E:/Khoa/library/flutter/.pub-cache/hosted/pub.dartlang.org/firebase_admob-0.9.3+4",
      "packageUri": "lib/",
      "languageVersion": "2.7"
    },
    {
      "name": "firebase_analytics",
      "rootUri": "file:///E:/Khoa/library/flutter/.pub-cache/hosted/pub.dartlang.org/firebase_analytics-5.0.16",
      "packageUri": "lib/",
      "languageVersion": "2.0"
    },
    {
      "name": "firebase_analytics_platform_interface",
      "rootUri": "file:///E:/Khoa/library/flutter/.pub-cache/hosted/pub.dartlang.org/firebase_analytics_platform_interface-1.0.1",
      "packageUri": "lib/",
      "languageVersion": "2.0"
    },
    {
      "name": "firebase_analytics_web",
      "rootUri": "file:///E:/Khoa/library/flutter/.pub-cache/hosted/pub.dartlang.org/firebase_analytics_web-0.1.1",
      "packageUri": "lib/",
      "languageVersion": "2.7"
    },
    {
      "name": "firebase_auth",
      "rootUri": "file:///E:/Khoa/library/flutter/.pub-cache/hosted/pub.dartlang.org/firebase_auth-0.16.1",
      "packageUri": "lib/",
      "languageVersion": "2.0"
    },
    {
      "name": "firebase_auth_platform_interface",
      "rootUri": "file:///E:/Khoa/library/flutter/.pub-cache/hosted/pub.dartlang.org/firebase_auth_platform_interface-1.1.7",
      "packageUri": "lib/",
      "languageVersion": "2.0"
    },
    {
      "name": "firebase_auth_web",
      "rootUri": "file:///E:/Khoa/library/flutter/.pub-cache/hosted/pub.dartlang.org/firebase_auth_web-0.1.2",
      "packageUri": "lib/",
      "languageVersion": "2.0"
    },
    {
      "name": "firebase_core",
      "rootUri": "file:///E:/Khoa/library/flutter/.pub-cache/hosted/pub.dartlang.org/firebase_core-0.4.5",
      "packageUri": "lib/",
      "languageVersion": "2.0"
    },
    {
      "name": "firebase_core_platform_interface",
      "rootUri": "file:///E:/Khoa/library/flutter/.pub-cache/hosted/pub.dartlang.org/firebase_core_platform_interface-1.0.4",
      "packageUri": "lib/",
      "languageVersion": "2.0"
    },
    {
      "name": "firebase_core_web",
      "rootUri": "file:///E:/Khoa/library/flutter/.pub-cache/hosted/pub.dartlang.org/firebase_core_web-0.1.1+2",
      "packageUri": "lib/",
      "languageVersion": "2.0"
    },
    {
      "name": "firebase_database",
      "rootUri": "file:///E:/Khoa/library/flutter/.pub-cache/hosted/pub.dartlang.org/firebase_database-3.1.6",
      "packageUri": "lib/",
      "languageVersion": "2.0"
    },
    {
      "name": "firebase_messaging",
      "rootUri": "file:///E:/Khoa/library/flutter/.pub-cache/hosted/pub.dartlang.org/firebase_messaging-6.0.16",
      "packageUri": "lib/",
      "languageVersion": "2.0"
    },
    {
      "name": "flare_dart",
      "rootUri": "file:///E:/Khoa/library/flutter/.pub-cache/hosted/pub.dartlang.org/flare_dart-2.3.4",
      "packageUri": "lib/",
      "languageVersion": "2.1"
    },
    {
      "name": "flare_flutter",
      "rootUri": "file:///E:/Khoa/library/flutter/.pub-cache/hosted/pub.dartlang.org/flare_flutter-2.0.3",
      "packageUri": "lib/",
      "languageVersion": "2.2"
    },
    {
      "name": "flare_loading",
      "rootUri": "file:///E:/Khoa/library/flutter/.pub-cache/hosted/pub.dartlang.org/flare_loading-2.1.1",
      "packageUri": "lib/",
      "languageVersion": "2.1"
    },
    {
      "name": "flare_splash_screen",
      "rootUri": "file:///E:/Khoa/library/flutter/.pub-cache/hosted/pub.dartlang.org/flare_splash_screen-3.0.1",
      "packageUri": "lib/",
      "languageVersion": "2.1"
    },
    {
      "name": "flash",
      "rootUri": "file:///E:/Khoa/library/flutter/.pub-cache/hosted/pub.dartlang.org/flash-1.3.1",
      "packageUri": "lib/",
      "languageVersion": "2.4"
    },
    {
      "name": "flutter",
      "rootUri": "file:///E:/Khoa/library/flutter/packages/flutter",
      "packageUri": "lib/",
      "languageVersion": "2.9"
    },
    {
      "name": "flutter_cache_manager",
      "rootUri": "file:///E:/Khoa/library/flutter/.pub-cache/hosted/pub.dartlang.org/flutter_cache_manager-1.2.2",
      "packageUri": "lib/",
      "languageVersion": "2.6"
    },
    {
      "name": "flutter_facebook_login",
      "rootUri": "file:///E:/Khoa/library/flutter/.pub-cache/hosted/pub.dartlang.org/flutter_facebook_login-3.0.0",
      "packageUri": "lib/",
      "languageVersion": "2.0"
    },
    {
      "name": "flutter_html",
      "rootUri": "file:///E:/Khoa/library/flutter/.pub-cache/hosted/pub.dartlang.org/flutter_html-1.0.2",
      "packageUri": "lib/",
      "languageVersion": "2.2"
    },
    {
      "name": "flutter_launcher_icons",
      "rootUri": "file:///E:/Khoa/library/flutter/.pub-cache/hosted/pub.dartlang.org/flutter_launcher_icons-0.7.5",
      "packageUri": "lib/",
      "languageVersion": "2.2"
    },
    {
      "name": "flutter_localizations",
      "rootUri": "file:///E:/Khoa/library/flutter/packages/flutter_localizations",
      "packageUri": "lib/",
      "languageVersion": "2.2"
    },
    {
      "name": "flutter_page_indicator",
      "rootUri": "file:///E:/Khoa/library/flutter/.pub-cache/hosted/pub.dartlang.org/flutter_page_indicator-0.0.3",
      "packageUri": "lib/",
      "languageVersion": "2.0"
    },
    {
      "name": "flutter_plugin_android_lifecycle",
      "rootUri": "file:///E:/Khoa/library/flutter/.pub-cache/hosted/pub.dartlang.org/flutter_plugin_android_lifecycle-1.0.7",
      "packageUri": "lib/",
      "languageVersion": "2.1"
    },
    {
      "name": "flutter_spinkit",
      "rootUri": "file:///E:/Khoa/library/flutter/.pub-cache/hosted/pub.dartlang.org/flutter_spinkit-4.1.2+1",
      "packageUri": "lib/",
      "languageVersion": "2.5"
    },
    {
      "name": "flutter_staggered_grid_view",
      "rootUri": "file:///E:/Khoa/library/flutter/.pub-cache/hosted/pub.dartlang.org/flutter_staggered_grid_view-0.3.2",
      "packageUri": "lib/",
      "languageVersion": "1.19"
    },
    {
      "name": "flutter_statusbarcolor",
      "rootUri": "file:///E:/Khoa/library/flutter/.pub-cache/hosted/pub.dartlang.org/flutter_statusbarcolor-0.2.3",
      "packageUri": "lib/",
      "languageVersion": "2.0"
    },
    {
      "name": "flutter_svg",
      "rootUri": "file:///E:/Khoa/library/flutter/.pub-cache/hosted/pub.dartlang.org/flutter_svg-0.18.0",
      "packageUri": "lib/",
      "languageVersion": "2.2"
    },
    {
      "name": "flutter_swiper",
      "rootUri": "file:///E:/Khoa/library/flutter/.pub-cache/hosted/pub.dartlang.org/flutter_swiper-1.1.6",
      "packageUri": "lib/",
      "languageVersion": "2.0"
    },
    {
      "name": "flutter_test",
      "rootUri": "file:///E:/Khoa/library/flutter/packages/flutter_test",
      "packageUri": "lib/",
      "languageVersion": "2.2"
    },
    {
      "name": "flutter_web_plugins",
      "rootUri": "file:///E:/Khoa/library/flutter/packages/flutter_web_plugins",
      "packageUri": "lib/",
      "languageVersion": "2.0"
    },
    {
      "name": "flutter_webview_plugin",
      "rootUri": "file:///E:/Khoa/library/flutter/.pub-cache/hosted/pub.dartlang.org/flutter_webview_plugin-0.3.11",
      "packageUri": "lib/",
      "languageVersion": "2.0"
    },
    {
      "name": "flutter_widget_from_html",
      "rootUri": "file:///E:/Khoa/library/flutter/.pub-cache/hosted/pub.dartlang.org/flutter_widget_from_html-0.4.3",
      "packageUri": "lib/",
      "languageVersion": "2.3"
    },
    {
      "name": "flutter_widget_from_html_core",
      "rootUri": "file:///E:/Khoa/library/flutter/.pub-cache/hosted/pub.dartlang.org/flutter_widget_from_html_core-0.4.3",
      "packageUri": "lib/",
      "languageVersion": "2.3"
    },
    {
      "name": "flutter_widgets",
      "rootUri": "file:///E:/Khoa/library/flutter/.pub-cache/hosted/pub.dartlang.org/flutter_widgets-0.1.12",
      "packageUri": "lib/",
      "languageVersion": "2.3"
    },
    {
      "name": "font_awesome_flutter",
      "rootUri": "file:///E:/Khoa/library/flutter/.pub-cache/hosted/pub.dartlang.org/font_awesome_flutter-8.8.1",
      "packageUri": "lib/",
      "languageVersion": "2.0"
    },
    {
      "name": "google_fonts",
      "rootUri": "file:///E:/Khoa/library/flutter/.pub-cache/hosted/pub.dartlang.org/google_fonts-1.1.0",
      "packageUri": "lib/",
      "languageVersion": "2.3"
    },
    {
      "name": "google_maps_flutter",
      "rootUri": "file:///E:/Khoa/library/flutter/.pub-cache/hosted/pub.dartlang.org/google_maps_flutter-0.5.30",
      "packageUri": "lib/",
      "languageVersion": "2.1"
    },
    {
      "name": "google_maps_flutter_platform_interface",
      "rootUri": "file:///E:/Khoa/library/flutter/.pub-cache/hosted/pub.dartlang.org/google_maps_flutter_platform_interface-1.0.4",
      "packageUri": "lib/",
      "languageVersion": "2.3"
    },
    {
      "name": "google_sign_in",
      "rootUri": "file:///E:/Khoa/library/flutter/.pub-cache/hosted/pub.dartlang.org/google_sign_in-4.5.1",
      "packageUri": "lib/",
      "languageVersion": "2.1"
    },
    {
      "name": "google_sign_in_platform_interface",
      "rootUri": "file:///E:/Khoa/library/flutter/.pub-cache/hosted/pub.dartlang.org/google_sign_in_platform_interface-1.1.2",
      "packageUri": "lib/",
      "languageVersion": "2.1"
    },
    {
      "name": "google_sign_in_web",
      "rootUri": "file:///E:/Khoa/library/flutter/.pub-cache/hosted/pub.dartlang.org/google_sign_in_web-0.9.1",
      "packageUri": "lib/",
      "languageVersion": "2.6"
    },
    {
      "name": "gql",
      "rootUri": "file:///E:/Khoa/library/flutter/.pub-cache/hosted/pub.dartlang.org/gql-0.12.3",
      "packageUri": "lib/",
      "languageVersion": "2.7"
    },
    {
      "name": "graphql",
      "rootUri": "file:///E:/Khoa/library/flutter/.pub-cache/hosted/pub.dartlang.org/graphql-3.1.0",
      "packageUri": "lib/",
      "languageVersion": "2.6"
    },
    {
      "name": "html",
      "rootUri": "file:///E:/Khoa/library/flutter/.pub-cache/hosted/pub.dartlang.org/html-0.14.0+3",
      "packageUri": "lib/",
      "languageVersion": "2.3"
    },
    {
      "name": "html_unescape",
      "rootUri": "file:///E:/Khoa/library/flutter/.pub-cache/hosted/pub.dartlang.org/html_unescape-1.0.1+3",
      "packageUri": "lib/",
      "languageVersion": "1.23"
    },
    {
      "name": "http",
      "rootUri": "file:///E:/Khoa/library/flutter/.pub-cache/hosted/pub.dartlang.org/http-0.12.2",
      "packageUri": "lib/",
      "languageVersion": "2.4"
    },
    {
      "name": "http_auth",
      "rootUri": "file:///E:/Khoa/library/flutter/.pub-cache/hosted/pub.dartlang.org/http_auth-0.3.0",
      "packageUri": "lib/",
      "languageVersion": "2.1"
    },
    {
      "name": "http_client_helper",
      "rootUri": "file:///E:/Khoa/library/flutter/.pub-cache/hosted/pub.dartlang.org/http_client_helper-0.2.1",
      "packageUri": "lib/",
      "languageVersion": "2.1"
    },
    {
      "name": "http_parser",
      "rootUri": "file:///E:/Khoa/library/flutter/.pub-cache/hosted/pub.dartlang.org/http_parser-3.1.4",
      "packageUri": "lib/",
      "languageVersion": "2.3"
    },
    {
      "name": "image",
      "rootUri": "file:///E:/Khoa/library/flutter/.pub-cache/hosted/pub.dartlang.org/image-2.1.14",
      "packageUri": "lib/",
      "languageVersion": "2.0"
    },
    {
      "name": "inspireui",
      "rootUri": "../modules/common_library",
      "packageUri": "lib/",
      "languageVersion": "2.7"
    },
    {
      "name": "intl",
      "rootUri": "file:///E:/Khoa/library/flutter/.pub-cache/hosted/pub.dartlang.org/intl-0.16.1",
      "packageUri": "lib/",
      "languageVersion": "2.5"
    },
    {
      "name": "intro_slider",
      "rootUri": "file:///E:/Khoa/library/flutter/.pub-cache/hosted/pub.dartlang.org/intro_slider-2.3.1",
      "packageUri": "lib/",
      "languageVersion": "2.1"
    },
    {
      "name": "js",
      "rootUri": "file:///E:/Khoa/library/flutter/.pub-cache/hosted/pub.dartlang.org/js-0.6.1+1",
      "packageUri": "lib/",
      "languageVersion": "1.19"
    },
    {
      "name": "liquid_swipe",
      "rootUri": "file:///E:/Khoa/library/flutter/.pub-cache/hosted/pub.dartlang.org/liquid_swipe-1.5.0",
      "packageUri": "lib/",
      "languageVersion": "2.1"
    },
    {
      "name": "localstorage",
      "rootUri": "file:///E:/Khoa/library/flutter/.pub-cache/hosted/pub.dartlang.org/localstorage-3.0.2+5",
      "packageUri": "lib/",
      "languageVersion": "2.2"
    },
    {
      "name": "location",
      "rootUri": "file:///E:/Khoa/library/flutter/.pub-cache/hosted/pub.dartlang.org/location-3.0.2",
      "packageUri": "lib/",
      "languageVersion": "2.0"
    },
    {
      "name": "location_platform_interface",
      "rootUri": "file:///E:/Khoa/library/flutter/.pub-cache/hosted/pub.dartlang.org/location_platform_interface-1.0.0",
      "packageUri": "lib/",
      "languageVersion": "2.4"
    },
    {
      "name": "location_web",
      "rootUri": "file:///E:/Khoa/library/flutter/.pub-cache/hosted/pub.dartlang.org/location_web-1.0.0",
      "packageUri": "lib/",
      "languageVersion": "2.1"
    },
    {
      "name": "matcher",
      "rootUri": "file:///E:/Khoa/library/flutter/.pub-cache/hosted/pub.dartlang.org/matcher-0.12.8",
      "packageUri": "lib/",
      "languageVersion": "2.4"
    },
    {
      "name": "meta",
      "rootUri": "file:///E:/Khoa/library/flutter/.pub-cache/hosted/pub.dartlang.org/meta-1.1.8",
      "packageUri": "lib/",
      "languageVersion": "1.12"
    },
    {
      "name": "mime",
      "rootUri": "file:///E:/Khoa/library/flutter/.pub-cache/hosted/pub.dartlang.org/mime-0.9.6+3",
      "packageUri": "lib/",
      "languageVersion": "2.0"
    },
    {
      "name": "mockito",
      "rootUri": "file:///E:/Khoa/library/flutter/.pub-cache/hosted/pub.dartlang.org/mockito-4.1.1",
      "packageUri": "lib/",
      "languageVersion": "2.0"
    },
    {
      "name": "nested",
      "rootUri": "file:///E:/Khoa/library/flutter/.pub-cache/hosted/pub.dartlang.org/nested-0.0.4",
      "packageUri": "lib/",
      "languageVersion": "2.2"
    },
    {
      "name": "notification_permissions",
      "rootUri": "file:///E:/Khoa/library/flutter/.pub-cache/hosted/pub.dartlang.org/notification_permissions-0.4.7",
      "packageUri": "lib/",
      "languageVersion": "2.1"
    },
    {
      "name": "onesignal_flutter",
      "rootUri": "file:///E:/Khoa/library/flutter/.pub-cache/hosted/pub.dartlang.org/onesignal_flutter-2.6.0",
      "packageUri": "lib/",
      "languageVersion": "2.0"
    },
    {
      "name": "open_iconic_flutter",
      "rootUri": "file:///E:/Khoa/library/flutter/.pub-cache/hosted/pub.dartlang.org/open_iconic_flutter-0.3.0",
      "packageUri": "lib/",
      "languageVersion": "2.0"
    },
    {
      "name": "page_indicator",
      "rootUri": "file:///E:/Khoa/library/flutter/.pub-cache/hosted/pub.dartlang.org/page_indicator-0.3.0",
      "packageUri": "lib/",
      "languageVersion": "2.0"
    },
    {
      "name": "path",
      "rootUri": "file:///E:/Khoa/library/flutter/.pub-cache/hosted/pub.dartlang.org/path-1.7.0",
      "packageUri": "lib/",
      "languageVersion": "2.0"
    },
    {
      "name": "path_drawing",
      "rootUri": "file:///E:/Khoa/library/flutter/.pub-cache/hosted/pub.dartlang.org/path_drawing-0.4.1",
      "packageUri": "lib/",
      "languageVersion": "1.19"
    },
    {
      "name": "path_parsing",
      "rootUri": "file:///E:/Khoa/library/flutter/.pub-cache/hosted/pub.dartlang.org/path_parsing-0.1.4",
      "packageUri": "lib/",
      "languageVersion": "1.19"
    },
    {
      "name": "path_provider",
      "rootUri": "file:///E:/Khoa/library/flutter/.pub-cache/hosted/pub.dartlang.org/path_provider-1.6.7",
      "packageUri": "lib/",
      "languageVersion": "2.0"
    },
    {
      "name": "path_provider_linux",
      "rootUri": "file:///E:/Khoa/library/flutter/.pub-cache/hosted/pub.dartlang.org/path_provider_linux-0.0.1+2",
      "packageUri": "lib/",
      "languageVersion": "2.1"
    },
    {
      "name": "path_provider_macos",
      "rootUri": "file:///E:/Khoa/library/flutter/.pub-cache/hosted/pub.dartlang.org/path_provider_macos-0.0.4+1",
      "packageUri": "lib/",
      "languageVersion": "2.1"
    },
    {
      "name": "path_provider_platform_interface",
      "rootUri": "file:///E:/Khoa/library/flutter/.pub-cache/hosted/pub.dartlang.org/path_provider_platform_interface-1.0.1",
      "packageUri": "lib/",
      "languageVersion": "2.0"
    },
    {
      "name": "pedantic",
      "rootUri": "file:///E:/Khoa/library/flutter/.pub-cache/hosted/pub.dartlang.org/pedantic-1.8.0+1",
      "packageUri": "lib/",
      "languageVersion": "2.1"
    },
    {
      "name": "percent_indicator",
      "rootUri": "file:///E:/Khoa/library/flutter/.pub-cache/hosted/pub.dartlang.org/percent_indicator-2.1.5",
      "packageUri": "lib/",
      "languageVersion": "1.19"
    },
    {
      "name": "petitparser",
      "rootUri": "file:///E:/Khoa/library/flutter/.pub-cache/hosted/pub.dartlang.org/petitparser-3.0.4",
      "packageUri": "lib/",
      "languageVersion": "2.7"
    },
    {
      "name": "pin_code_fields",
      "rootUri": "file:///E:/Khoa/library/flutter/.pub-cache/hosted/pub.dartlang.org/pin_code_fields-4.0.0",
      "packageUri": "lib/",
      "languageVersion": "2.7"
    },
    {
      "name": "platform",
      "rootUri": "file:///E:/Khoa/library/flutter/.pub-cache/hosted/pub.dartlang.org/platform-2.2.1",
      "packageUri": "lib/",
      "languageVersion": "1.24"
    },
    {
      "name": "plugin_platform_interface",
      "rootUri": "file:///E:/Khoa/library/flutter/.pub-cache/hosted/pub.dartlang.org/plugin_platform_interface-1.0.2",
      "packageUri": "lib/",
      "languageVersion": "2.1"
    },
    {
      "name": "process",
      "rootUri": "file:///E:/Khoa/library/flutter/.pub-cache/hosted/pub.dartlang.org/process-3.0.13",
      "packageUri": "lib/",
      "languageVersion": "2.0"
    },
    {
      "name": "provider",
      "rootUri": "file:///E:/Khoa/library/flutter/.pub-cache/hosted/pub.dartlang.org/provider-4.3.2",
      "packageUri": "lib/",
      "languageVersion": "2.7"
    },
    {
      "name": "pull_to_refresh",
      "rootUri": "file:///E:/Khoa/library/flutter/.pub-cache/hosted/pub.dartlang.org/pull_to_refresh-1.6.1",
      "packageUri": "lib/",
      "languageVersion": "2.1"
    },
    {
      "name": "quiver",
      "rootUri": "file:///E:/Khoa/library/flutter/.pub-cache/hosted/pub.dartlang.org/quiver-2.1.3",
      "packageUri": "lib/",
      "languageVersion": "2.0"
    },
    {
      "name": "random_string",
      "rootUri": "file:///E:/Khoa/library/flutter/.pub-cache/hosted/pub.dartlang.org/random_string-2.1.0",
      "packageUri": "lib/",
      "languageVersion": "2.1"
    },
    {
      "name": "rate_my_app",
      "rootUri": "file:///E:/Khoa/library/flutter/.pub-cache/hosted/pub.dartlang.org/rate_my_app-0.7.0",
      "packageUri": "lib/",
      "languageVersion": "2.6"
    },
    {
      "name": "rubber",
      "rootUri": "file:///E:/Khoa/library/flutter/.pub-cache/hosted/pub.dartlang.org/rubber-0.4.0",
      "packageUri": "lib/",
      "languageVersion": "2.0"
    },
    {
      "name": "rxdart",
      "rootUri": "file:///E:/Khoa/library/flutter/.pub-cache/hosted/pub.dartlang.org/rxdart-0.24.1",
      "packageUri": "lib/",
      "languageVersion": "2.6"
    },
    {
      "name": "screen",
      "rootUri": "file:///E:/Khoa/library/flutter/.pub-cache/hosted/pub.dartlang.org/screen-0.0.5",
      "packageUri": "lib/",
      "languageVersion": "2.0"
    },
    {
      "name": "share",
      "rootUri": "file:///E:/Khoa/library/flutter/.pub-cache/hosted/pub.dartlang.org/share-0.6.4+3",
      "packageUri": "lib/",
      "languageVersion": "2.1"
    },
    {
      "name": "shared_preferences",
      "rootUri": "file:///E:/Khoa/library/flutter/.pub-cache/hosted/pub.dartlang.org/shared_preferences-0.5.8",
      "packageUri": "lib/",
      "languageVersion": "2.1"
    },
    {
      "name": "shared_preferences_linux",
      "rootUri": "file:///E:/Khoa/library/flutter/.pub-cache/hosted/pub.dartlang.org/shared_preferences_linux-0.0.2+1",
      "packageUri": "lib/",
      "languageVersion": "2.1"
    },
    {
      "name": "shared_preferences_macos",
      "rootUri": "file:///E:/Khoa/library/flutter/.pub-cache/hosted/pub.dartlang.org/shared_preferences_macos-0.0.1+7",
      "packageUri": "lib/",
      "languageVersion": "2.1"
    },
    {
      "name": "shared_preferences_platform_interface",
      "rootUri": "file:///E:/Khoa/library/flutter/.pub-cache/hosted/pub.dartlang.org/shared_preferences_platform_interface-1.0.3",
      "packageUri": "lib/",
      "languageVersion": "2.0"
    },
    {
      "name": "shared_preferences_web",
      "rootUri": "file:///E:/Khoa/library/flutter/.pub-cache/hosted/pub.dartlang.org/shared_preferences_web-0.1.2+4",
      "packageUri": "lib/",
      "languageVersion": "2.0"
    },
    {
      "name": "sky_engine",
      "rootUri": "file:///E:/Khoa/library/flutter/bin/cache/pkg/sky_engine",
      "packageUri": "lib/",
      "languageVersion": "1.11"
    },
    {
      "name": "smooth_star_rating",
      "rootUri": "file:///E:/Khoa/library/flutter/.pub-cache/hosted/pub.dartlang.org/smooth_star_rating-1.1.1",
      "packageUri": "lib/",
      "languageVersion": "2.7"
    },
    {
      "name": "source_span",
      "rootUri": "file:///E:/Khoa/library/flutter/.pub-cache/hosted/pub.dartlang.org/source_span-1.7.0",
      "packageUri": "lib/",
      "languageVersion": "2.6"
    },
    {
      "name": "sqflite",
      "rootUri": "file:///E:/Khoa/library/flutter/.pub-cache/hosted/pub.dartlang.org/sqflite-1.3.0",
      "packageUri": "lib/",
      "languageVersion": "2.7"
    },
    {
      "name": "sqflite_common",
      "rootUri": "file:///E:/Khoa/library/flutter/.pub-cache/hosted/pub.dartlang.org/sqflite_common-1.0.0+1",
      "packageUri": "lib/",
      "languageVersion": "2.7"
    },
    {
      "name": "stack_trace",
      "rootUri": "file:///E:/Khoa/library/flutter/.pub-cache/hosted/pub.dartlang.org/stack_trace-1.9.5",
      "packageUri": "lib/",
      "languageVersion": "2.0"
    },
    {
      "name": "sticky_headers",
      "rootUri": "file:///E:/Khoa/library/flutter/.pub-cache/hosted/pub.dartlang.org/sticky_headers-0.1.8+1",
      "packageUri": "lib/",
      "languageVersion": "2.0"
    },
    {
      "name": "stream_channel",
      "rootUri": "file:///E:/Khoa/library/flutter/.pub-cache/hosted/pub.dartlang.org/stream_channel-2.0.0",
      "packageUri": "lib/",
      "languageVersion": "2.0"
    },
    {
      "name": "stream_transform",
      "rootUri": "file:///E:/Khoa/library/flutter/.pub-cache/hosted/pub.dartlang.org/stream_transform-1.2.0",
      "packageUri": "lib/",
      "languageVersion": "2.6"
    },
    {
      "name": "string_scanner",
      "rootUri": "file:///E:/Khoa/library/flutter/.pub-cache/hosted/pub.dartlang.org/string_scanner-1.0.5",
      "packageUri": "lib/",
      "languageVersion": "2.0"
    },
    {
      "name": "synchronized",
      "rootUri": "file:///E:/Khoa/library/flutter/.pub-cache/hosted/pub.dartlang.org/synchronized-2.2.0",
      "packageUri": "lib/",
      "languageVersion": "2.6"
    },
    {
      "name": "term_glyph",
      "rootUri": "file:///E:/Khoa/library/flutter/.pub-cache/hosted/pub.dartlang.org/term_glyph-1.1.0",
      "packageUri": "lib/",
      "languageVersion": "1.8"
    },
    {
      "name": "test_api",
      "rootUri": "file:///E:/Khoa/library/flutter/.pub-cache/hosted/pub.dartlang.org/test_api-0.2.17",
      "packageUri": "lib/",
      "languageVersion": "2.7"
    },
    {
      "name": "timeago",
      "rootUri": "file:///E:/Khoa/library/flutter/.pub-cache/hosted/pub.dartlang.org/timeago-2.0.26",
      "packageUri": "lib/",
      "languageVersion": "2.6"
    },
    {
      "name": "transformer_page_view",
      "rootUri": "file:///E:/Khoa/library/flutter/.pub-cache/hosted/pub.dartlang.org/transformer_page_view-0.1.6",
      "packageUri": "lib/",
      "languageVersion": "2.0"
    },
    {
      "name": "transparent_image",
      "rootUri": "file:///E:/Khoa/library/flutter/.pub-cache/hosted/pub.dartlang.org/transparent_image-1.0.0",
      "packageUri": "lib/",
      "languageVersion": "1.24"
    },
    {
      "name": "typed_data",
      "rootUri": "file:///E:/Khoa/library/flutter/.pub-cache/hosted/pub.dartlang.org/typed_data-1.2.0",
      "packageUri": "lib/",
      "languageVersion": "2.4"
    },
    {
      "name": "uni_links",
      "rootUri": "file:///E:/Khoa/library/flutter/.pub-cache/hosted/pub.dartlang.org/uni_links-0.4.0",
      "packageUri": "lib/",
      "languageVersion": "2.1"
    },
    {
      "name": "universal_platform",
      "rootUri": "file:///E:/Khoa/library/flutter/.pub-cache/hosted/pub.dartlang.org/universal_platform-0.1.3",
      "packageUri": "lib/",
      "languageVersion": "2.6"
    },
    {
      "name": "url_launcher",
      "rootUri": "file:///E:/Khoa/library/flutter/.pub-cache/hosted/pub.dartlang.org/url_launcher-5.5.0",
      "packageUri": "lib/",
      "languageVersion": "2.1"
    },
    {
      "name": "url_launcher_linux",
      "rootUri": "file:///E:/Khoa/library/flutter/.pub-cache/hosted/pub.dartlang.org/url_launcher_linux-0.0.1+1",
      "packageUri": "lib/",
      "languageVersion": "2.1"
    },
    {
      "name": "url_launcher_macos",
      "rootUri": "file:///E:/Khoa/library/flutter/.pub-cache/hosted/pub.dartlang.org/url_launcher_macos-0.0.1+5",
      "packageUri": "lib/",
      "languageVersion": "2.1"
    },
    {
      "name": "url_launcher_platform_interface",
      "rootUri": "file:///E:/Khoa/library/flutter/.pub-cache/hosted/pub.dartlang.org/url_launcher_platform_interface-1.0.6",
      "packageUri": "lib/",
      "languageVersion": "2.0"
    },
    {
      "name": "url_launcher_web",
      "rootUri": "file:///E:/Khoa/library/flutter/.pub-cache/hosted/pub.dartlang.org/url_launcher_web-0.1.1+1",
      "packageUri": "lib/",
      "languageVersion": "2.0"
    },
    {
      "name": "uuid",
      "rootUri": "file:///E:/Khoa/library/flutter/.pub-cache/hosted/pub.dartlang.org/uuid-2.2.0",
      "packageUri": "lib/",
      "languageVersion": "2.0"
    },
    {
      "name": "uuid_enhanced",
      "rootUri": "file:///E:/Khoa/library/flutter/.pub-cache/hosted/pub.dartlang.org/uuid_enhanced-3.0.2",
      "packageUri": "lib/",
      "languageVersion": "2.0"
    },
    {
      "name": "validate",
      "rootUri": "file:///E:/Khoa/library/flutter/.pub-cache/hosted/pub.dartlang.org/validate-1.7.0",
      "packageUri": "lib/",
      "languageVersion": "2.0"
    },
    {
      "name": "vector_math",
      "rootUri": "file:///E:/Khoa/library/flutter/.pub-cache/hosted/pub.dartlang.org/vector_math-2.0.8",
      "packageUri": "lib/",
      "languageVersion": "2.0"
    },
    {
      "name": "video_player",
      "rootUri": "file:///E:/Khoa/library/flutter/.pub-cache/hosted/pub.dartlang.org/video_player-0.10.11+2",
      "packageUri": "lib/",
      "languageVersion": "2.1"
    },
    {
      "name": "video_player_platform_interface",
      "rootUri": "file:///E:/Khoa/library/flutter/.pub-cache/hosted/pub.dartlang.org/video_player_platform_interface-2.0.2",
      "packageUri": "lib/",
      "languageVersion": "2.1"
    },
    {
      "name": "video_player_web",
      "rootUri": "file:///E:/Khoa/library/flutter/.pub-cache/hosted/pub.dartlang.org/video_player_web-0.1.3",
      "packageUri": "lib/",
      "languageVersion": "2.1"
    },
    {
      "name": "wakelock",
      "rootUri": "file:///E:/Khoa/library/flutter/.pub-cache/hosted/pub.dartlang.org/wakelock-0.1.4+1",
      "packageUri": "lib/",
      "languageVersion": "2.7"
    },
    {
      "name": "wave",
      "rootUri": "file:///E:/Khoa/library/flutter/.pub-cache/hosted/pub.dartlang.org/wave-0.0.8",
      "packageUri": "lib/",
      "languageVersion": "2.0"
    },
    {
      "name": "websocket",
      "rootUri": "file:///E:/Khoa/library/flutter/.pub-cache/hosted/pub.dartlang.org/websocket-0.0.5",
      "packageUri": "lib/",
      "languageVersion": "2.0"
    },
    {
      "name": "webview_flutter",
      "rootUri": "file:///E:/Khoa/library/flutter/.pub-cache/hosted/pub.dartlang.org/webview_flutter-0.3.22+1",
      "packageUri": "lib/",
      "languageVersion": "2.7"
    },
    {
      "name": "xdg_directories",
      "rootUri": "file:///E:/Khoa/library/flutter/.pub-cache/hosted/pub.dartlang.org/xdg_directories-0.1.0",
      "packageUri": "lib/",
      "languageVersion": "2.3"
    },
    {
      "name": "xml",
      "rootUri": "file:///E:/Khoa/library/flutter/.pub-cache/hosted/pub.dartlang.org/xml-4.2.0",
      "packageUri": "lib/",
      "languageVersion": "2.7"
    },
    {
      "name": "yaml",
      "rootUri": "file:///E:/Khoa/library/flutter/.pub-cache/hosted/pub.dartlang.org/yaml-2.2.0",
      "packageUri": "lib/",
      "languageVersion": "2.0"
    },
    {
      "name": "zoom_widget",
      "rootUri": "file:///E:/Khoa/library/flutter/.pub-cache/hosted/pub.dartlang.org/zoom_widget-0.1.3",
      "packageUri": "lib/",
      "languageVersion": "2.1"
    },
    {
      "name": "fstore",
      "rootUri": "../",
      "packageUri": "lib/",
      "languageVersion": "2.7"
    }
  ],
  "generated": "2020-09-21T02:41:21.605873Z",
  "generator": "pub",
  "generatorVersion": "2.9.0"
}
