module gitlab.com/dr.sybren/slowtouch

go 1.20

require (
	github.com/mattn/go-colorable v0.1.13
	github.com/rs/zerolog v1.30.0
)

require (
	github.com/mattn/go-isatty v0.0.16 // indirect
	golang.org/x/sys v0.0.0-20220811171246-fbc7d0a398ab // indirect
)
