( pcb2gcode 1.3.2 )
( Software-independent Gcode )

G94 ( Millimeters per minute feed rate. )
G21 ( Units == Millimeters. )

G90 ( Absolute coordinates. )
S20000 ( RPM spindle speed. )
F600.00000 ( Feedrate. )

F600.00000 ( Feedrate. )
; Spin up spindle
S8000
M3
G4 P.5
S12000
G4 P.5
S16000
G4 P.5
S20000
; End of spin-up
G04 P0 ( dwell for no time -- G64 should not smooth over this point )
G00 Z2.00000 ( retract )

G00 X4.97651 Y8.14671 ( rapid move to begin. )
F300.00000
G01 Z-0.05000
G04 P0 ( dwell for no time -- G64 should not smooth over this point )
F600.00000
X4.97651 Y8.14671
X4.98248 Y9.19311
X5.04643 Y9.31274
X5.24712 Y9.51371
X5.18006 Y9.63207
X5.11412 Y9.83596
X5.09142 Y10.04904
X5.11329 Y10.26738
X5.18006 Y10.47645
X5.28885 Y10.66705
X5.43856 Y10.83453
X5.61176 Y10.96072
X5.82174 Y11.05419
X6.03137 Y11.09849
X6.25088 Y11.09849
X6.47046 Y11.05097
X6.67048 Y10.96072
X6.84369 Y10.83453
X6.98727 Y10.67548
X7.10033 Y10.48132
X7.16817 Y10.27253
X7.19085 Y10.05948
X7.16815 Y9.83596
X7.10033 Y9.62717
X6.98727 Y9.43304
X6.84369 Y9.27396
X6.66147 Y9.14259
X6.46053 Y9.05433
X6.24567 Y9.00977
X6.03663 Y9.00977
X5.81181 Y9.05755
X5.59815 Y9.15773
X5.47648 Y9.03609
X5.47648 Y8.14671
X5.64120 Y8.14574
X5.67303 Y8.12448
X5.68146 Y8.09672
X5.68146 Y6.82672
X5.65060 Y6.78054
X4.82152 Y6.77673
X4.77531 Y6.80759
X4.77247 Y8.10645
X4.81176 Y8.14574
X4.97651 Y8.14671
G04 P0 ( dwell for no time -- G64 should not smooth over this point )
G00 Z2.00000 ( retract )

G00 X3.09422 Y9.09222 ( rapid move to begin. )
F300.00000
G01 Z-0.05000
G04 P0 ( dwell for no time -- G64 should not smooth over this point )
F600.00000
X3.09422 Y9.09222
X2.99841 Y9.12484
X2.92261 Y9.18437
X2.86869 Y9.26741
X2.84624 Y9.35046
X2.84377 Y10.81952
X2.86871 Y10.93878
X2.92833 Y11.02803
X2.97316 Y11.06606
X3.03356 Y11.09834
X3.13882 Y11.11929
X3.66584 Y11.11604
X3.96030 Y11.01835
X4.03450 Y10.96507
X4.20638 Y10.78945
X4.31469 Y10.57411
X4.39403 Y10.32544
X4.39523 Y9.88851
X4.29843 Y9.59573
X4.17641 Y9.38356
X4.00287 Y9.21450
X3.92388 Y9.17271
X3.66579 Y9.09049
X3.09422 Y9.09222
G04 P0 ( dwell for no time -- G64 should not smooth over this point )
G00 Z2.00000 ( retract )

G00 X3.57201 Y10.51960 ( rapid move to begin. )
F300.00000
G01 Z-0.05000
G04 P0 ( dwell for no time -- G64 should not smooth over this point )
F600.00000
X3.57201 Y10.51960
X3.44369 Y10.51960
X3.44369 Y9.68699
X3.57214 Y9.68699
X3.66188 Y9.71727
X3.71497 Y9.77038
X3.79879 Y9.98236
X3.79879 Y10.22466
X3.75230 Y10.36415
X3.71568 Y10.43738
X3.66335 Y10.48874
X3.57201 Y10.51960
G04 P0 ( dwell for no time -- G64 should not smooth over this point )
G00 Z2.00000 ( retract )

G00 X3.83176 Y5.07427 ( rapid move to begin. )
F300.00000
G01 Z-0.05000
G04 P0 ( dwell for no time -- G64 should not smooth over this point )
F600.00000
X3.83176 Y5.07427
X3.83176 Y5.81072
X3.84639 Y5.84608
X3.88174 Y5.86071
X4.69170 Y5.86071
X4.72703 Y5.84608
X4.74168 Y5.81072
X4.73325 Y4.51296
X4.69170 Y4.49073
X3.95520 Y4.49073
X3.85119 Y4.38672
X3.85119 Y3.44905
X3.93051 Y3.43104
X4.13054 Y3.34080
X4.30374 Y3.21464
X4.45347 Y3.04712
X4.56038 Y2.86142
X4.62820 Y2.65264
X4.65091 Y2.42912
X4.62685 Y2.21098
X4.56038 Y2.00727
X4.45347 Y1.82155
X4.30374 Y1.65406
X4.13056 Y1.52787
X3.92058 Y1.43440
X3.71093 Y1.39010
X3.49147 Y1.39010
X3.28182 Y1.43440
X3.08091 Y1.52267
X2.89866 Y1.65406
X2.75507 Y1.81312
X2.64014 Y2.01215
X2.57418 Y2.21606
X2.55149 Y2.43956
X2.57420 Y2.65264
X2.64014 Y2.85652
X2.75507 Y3.05556
X2.89866 Y3.21464
X3.07184 Y3.34080
X3.27189 Y3.43104
X3.35121 Y3.44903
X3.35723 Y4.54377
X3.42119 Y4.66338
X3.83176 Y5.07427
G04 P0 ( dwell for no time -- G64 should not smooth over this point )
G00 Z2.00000 ( retract )

G00 X2.25751 Y4.56145 ( rapid move to begin. )
F300.00000
G01 Z-0.05000
G04 P0 ( dwell for no time -- G64 should not smooth over this point )
F600.00000
X2.25751 Y4.56145
X2.34829 Y4.49777
X2.41167 Y4.39947
X2.43260 Y4.29416
X2.42881 Y4.03518
X2.31304 Y3.77532
X2.10069 Y3.56546
X1.92668 Y3.47488
X1.84248 Y3.44753
X1.47075 Y3.44753
X1.21261 Y3.56544
X1.00019 Y3.77529
X0.90786 Y3.95891
X0.81652 Y4.23729
X0.81530 Y4.67425
X0.90791 Y4.95764
X0.97812 Y5.10384
X1.03430 Y5.18212
X1.21154 Y5.35276
X1.38657 Y5.44405
X1.47080 Y5.47140
X1.79249 Y5.47569
X1.88744 Y5.46017
X2.10824 Y5.34806
X2.31377 Y5.14006
X2.42528 Y4.89878
X2.42868 Y4.78446
X2.40821 Y4.71435
X2.34019 Y4.61601
X2.25751 Y4.56145
G04 P0 ( dwell for no time -- G64 should not smooth over this point )
G00 Z2.00000 ( retract )

G00 X1.62162 Y4.04313 ( rapid move to begin. )
F300.00000
G01 Z-0.05000
G04 P0 ( dwell for no time -- G64 should not smooth over this point )
F600.00000
X1.62162 Y4.04313
X1.56628 Y4.09264
X1.50588 Y4.20163
X1.49417 Y4.32065
X1.53557 Y4.44364
X1.61215 Y4.52868
X1.67540 Y4.56521
X1.78728 Y4.58898
X1.96008 Y4.58923
X1.89554 Y4.64936
X1.81870 Y4.79391
X1.72175 Y4.87575
X1.59150 Y4.87575
X1.56127 Y4.86063
X1.49460 Y4.79396
X1.41174 Y4.58032
X1.41174 Y4.33805
X1.45891 Y4.19650
X1.49389 Y4.12380
X1.56000 Y4.05896
X1.62162 Y4.04313
G04 P0 ( dwell for no time -- G64 should not smooth over this point )
G00 Z2.00000 ( retract )

G00 X5.94173 Y3.45977 ( rapid move to begin. )
F300.00000
G01 Z-0.05000
G04 P0 ( dwell for no time -- G64 should not smooth over this point )
F600.00000
X5.94173 Y3.45977
X5.94173 Y4.49073
X5.77699 Y4.49170
X5.74516 Y4.51296
X5.73676 Y4.54072
X5.73769 Y5.82047
X5.75895 Y5.85230
X5.78674 Y5.86071
X6.60643 Y5.85977
X6.63825 Y5.83851
X6.64668 Y5.81072
X6.64668 Y4.54072
X6.63825 Y4.51296
X6.60643 Y4.49170
X6.44171 Y4.49073
X6.44171 Y3.43828
X6.67048 Y3.34080
X6.84369 Y3.21464
X6.98727 Y3.05556
X7.10221 Y2.85652
X7.16815 Y2.65264
X7.19085 Y2.42912
X7.16817 Y2.21606
X7.10033 Y2.00727
X6.99342 Y1.82155
X6.84740 Y1.65777
X6.66147 Y1.52267
X6.46053 Y1.43440
X6.25088 Y1.39010
X6.03137 Y1.39010
X5.82174 Y1.43440
X5.62083 Y1.52267
X5.44265 Y1.65076
X5.29500 Y1.81312
X5.18431 Y2.00260
X5.11329 Y2.22122
X5.09142 Y2.43956
X5.11412 Y2.65264
X5.18006 Y2.85652
X5.28885 Y3.04712
X5.43858 Y3.21461
X5.61176 Y3.34080
X5.81181 Y3.43104
X5.94173 Y3.45977
G04 P0 ( dwell for no time -- G64 should not smooth over this point )
G00 Z2.00000 ( retract )

G00 X8.10185 Y4.84168 ( rapid move to begin. )
F300.00000
G01 Z-0.05000
G04 P0 ( dwell for no time -- G64 should not smooth over this point )
F600.00000
X8.10185 Y4.84168
X8.49177 Y4.71087
X8.71211 Y4.59878
X8.84767 Y4.46140
X8.93903 Y4.28631
X8.96639 Y4.20209
X8.96565 Y3.89525
X8.91722 Y3.77831
X8.74564 Y3.59968
X8.67510 Y3.54745
X8.38293 Y3.44804
X8.01145 Y3.44672
X7.72113 Y3.54273
X7.64071 Y3.59970
X7.46149 Y3.79012
X7.41884 Y3.90727
X7.42486 Y4.02152
X7.44630 Y4.08040
X7.52695 Y4.18210
X7.63810 Y4.23871
X7.75748 Y4.24577
X7.82801 Y4.22685
X7.92395 Y4.16452
X8.01524 Y4.07359
X8.10533 Y4.04316
X8.28102 Y4.04316
X8.37079 Y4.08123
X8.35570 Y4.11143
X8.28105 Y4.14875
X7.89210 Y4.27923
X7.72131 Y4.36002
X7.57213 Y4.48611
X7.51592 Y4.56411
X7.42004 Y4.78542
X7.41597 Y4.97747
X7.43739 Y5.08392
X7.50553 Y5.18659
X7.71887 Y5.37547
X8.01155 Y5.47226
X8.33441 Y5.47554
X8.42628 Y5.45997
X8.71049 Y5.34940
X8.91767 Y5.14247
X8.96654 Y5.02228
X8.96121 Y4.89767
X8.90866 Y4.79022
X8.85748 Y4.73808
X8.74599 Y4.68240
X8.63177 Y4.67534
X8.56586 Y4.69149
X8.50548 Y4.72246
X8.37249 Y4.84494
X8.28125 Y4.87575
X8.10518 Y4.87575
X8.06205 Y4.86122
X8.10185 Y4.84168

G04 P0 ( dwell for no time -- G64 should not smooth over this point )
G00 Z10.000 ( retract )

M5 ( Spindle off. )
M9 ( Coolant off. )
M2 ( Program end. )
