; -------------------------------------------------
; first.ngc
G94 ( Millimeters per minute feed rate. )
G21 ( Units == Millimeters. )
G90 ( Absolute coordinates. )

S20000
F600
M3
G0 Z3 ( retract )
S500 ( Slow down the spindle )

M5 ( Spindle off. )
M9 ( Coolant off. )
; Removed program end
; -------------------------------------------------
; second.ngc
( Start comment of the second file. )
G94 ( Millimeters per minute feed rate. )
G21 ( Units == Millimeters. )
G90 ( Absolute coordinates. )

S1000
F300
M3
G0 X1 Y1 Z1

M5 ( Spindle off. )
M9 ( Coolant off. )
M2 ( Program end. )
