<?xml version="1.0" encoding="UTF-8" standalone="no"?>
<svg
   width="512"
   height="512"
   viewBox="0 -186 135.46667 135.46667"
   version="1.1"
   id="svg1893"
   sodipodi:docname="avatar.svg"
   inkscape:version="1.1.1 (3bf5ae0d25, 2021-09-20)"
   inkscape:export-filename="avatar.png"
   inkscape:export-xdpi="18.75"
   inkscape:export-ydpi="18.75"
   xmlns:inkscape="http://www.inkscape.org/namespaces/inkscape"
   xmlns:sodipodi="http://sodipodi.sourceforge.net/DTD/sodipodi-0.dtd"
   xmlns="http://www.w3.org/2000/svg"
   xmlns:svg="http://www.w3.org/2000/svg">
  <defs
     id="defs1897">
    <marker
       style="overflow:visible"
       id="Arrow2Lend"
       refX="0"
       refY="0"
       orient="auto"
       inkscape:stockid="Arrow2Lend"
       inkscape:isstock="true">
      <path
         transform="matrix(-1.1,0,0,-1.1,-1.1,0)"
         d="M 8.7185878,4.0337352 -2.2072895,0.01601326 8.7185884,-4.0017078 c -1.7454984,2.3720609 -1.7354408,5.6174519 -6e-7,8.035443 z"
         style="fill:context-stroke;fill-rule:evenodd;stroke:context-stroke;stroke-width:0.625;stroke-linejoin:round"
         id="path2301" />
    </marker>
    <marker
       style="overflow:visible"
       id="TriangleOutL"
       refX="0"
       refY="0"
       orient="auto"
       inkscape:stockid="TriangleOutL"
       inkscape:isstock="true">
      <path
         transform="scale(0.8)"
         style="fill:context-stroke;fill-rule:evenodd;stroke:context-stroke;stroke-width:1pt"
         d="M 5.77,0 -2.88,5 V -5 Z"
         id="path2424" />
    </marker>
    <marker
       style="overflow:visible"
       id="Arrow1Lend"
       refX="0"
       refY="0"
       orient="auto"
       inkscape:stockid="Arrow1Lend"
       inkscape:isstock="true">
      <path
         transform="matrix(-0.8,0,0,-0.8,-10,0)"
         style="fill:context-stroke;fill-rule:evenodd;stroke:context-stroke;stroke-width:1pt"
         d="M 0,0 5,-5 -12.5,0 5,5 Z"
         id="path2283" />
    </marker>
  </defs>
  <sodipodi:namedview
     id="namedview1895"
     pagecolor="#ffffff"
     bordercolor="#666666"
     borderopacity="1.0"
     inkscape:pageshadow="2"
     inkscape:pageopacity="1"
     inkscape:pagecheckerboard="false"
     inkscape:document-units="mm"
     showgrid="false"
     fit-margin-top="2"
     lock-margins="true"
     fit-margin-left="2"
     fit-margin-right="2"
     fit-margin-bottom="2"
     inkscape:zoom="1.62071"
     inkscape:cx="332.26179"
     inkscape:cy="243.41184"
     inkscape:window-width="2560"
     inkscape:window-height="1361"
     inkscape:window-x="2391"
     inkscape:window-y="-9"
     inkscape:window-maximized="1"
     inkscape:current-layer="svg1893"
     units="px" />
  <path
     style="fill:#000000;stroke:none;stroke-width:0.360592;stroke-miterlimit:4;stroke-dasharray:none"
     d="m 41.964482,-61.721659 c -17.299007,-7.239643 -26.859625,-11.32701 -26.916541,-11.507386 -0.04857,-0.153857 -1.863781,-13.826809 -4.03384,-30.384335 -3.1790426,-24.256 -3.9023576,-30.14568 -3.7231407,-30.31605 0.1223363,-0.1163 10.7116837,-5.37344 23.5318797,-11.68253 l 23.309449,-11.47105 1.256546,0.36654 c 1.112273,0.32446 1.267707,0.4223 1.353653,0.85207 l 0.09711,0.48551 3.46016,-1.73174 c 3.818976,-1.91131 3.572394,-1.66741 3.78352,-3.74217 l 0.122385,-1.20274 4.201212,-2.07399 c 2.310664,-1.1407 4.288214,-2.10461 4.394552,-2.14204 0.381398,-0.13424 -0.467652,-0.80877 -1.360216,-1.08065 -0.866863,-0.26405 -0.996631,-0.39625 -3.786504,-3.85723 -1.588894,-1.97108 -2.876099,-3.72203 -2.860468,-3.89097 0.0156,-0.16895 0.07897,-0.46571 0.140839,-0.65947 0.08798,-0.27567 -0.517018,-1.12943 -2.781742,-3.92554 l -2.894165,-3.57325 0.739853,-1.37057 c 0.488936,-0.90573 0.843704,-1.37064 1.046006,-1.37075 0.549433,-3.2e-4 49.05534,11.19492 49.4964,11.42383 0.24946,0.12947 1.64107,2.0515 3.32659,4.59455 l 2.89772,4.37194 0.85952,0.21122 c 0.47274,0.11616 0.99614,0.35406 1.16312,0.52864 0.69866,0.73046 4.91347,7.45304 4.82208,7.69118 -0.0538,0.14027 0.2356,0.76023 0.64318,1.37769 0.68103,1.03177 0.81192,1.13939 1.61645,1.32908 0.48149,0.11353 1.13148,0.31056 1.44444,0.43784 l 0.56902,0.23142 v 1.8123 c 0,1.13926 0.0753,1.88757 0.20268,2.01498 0.15251,0.1525 0.15298,0.26256 0.002,0.44458 -0.11042,0.13305 -0.18813,0.55002 -0.17269,0.92661 0.0154,0.37659 -0.0246,3.75744 -0.089,7.51298 -0.21948,12.80833 -0.28986,18.20701 -0.38341,29.41409 -0.0514,6.16295 -0.13774,12.001449 -0.1918,12.974434 l -0.0983,1.769064 -29.06444,23.180389 c -15.985507,12.749214 -29.116571,23.198115 -29.180198,23.21978 -0.06364,0.02166 -12.188405,-5.01305 -26.943949,-11.188256 z m 26.738066,10.492299 c -0.01641,-1.350331 -0.539706,-7.570099 -0.645324,-7.669928 -0.19371,-0.183083 -2.227106,-1.02361 -2.300577,-0.950968 -0.06265,0.06197 0.256778,5.240355 0.428258,6.941978 l 0.09988,0.991113 0.991348,0.441807 c 1.132096,0.504528 1.43017,0.555935 1.426411,0.245998 z m 11.435119,-8.641993 10.890734,-8.685763 -0.06418,-1.950583 c -0.03525,-1.07282 -0.08555,-1.974591 -0.111712,-2.003935 -0.02614,-0.02934 -2.203325,1.637957 -4.838179,3.705113 -2.634855,2.067157 -4.83003,3.719754 -4.878179,3.672437 -0.04814,-0.04731 -0.126928,-0.664545 -0.175076,-1.371621 l -0.08753,-1.285591 -5.055895,3.925756 c -2.780723,2.159166 -5.091829,3.925757 -5.135776,3.925757 -0.306585,0 0.608156,-0.76504 4.954416,-4.143613 2.704683,-2.102487 7.076878,-5.508246 9.715988,-7.568357 2.639109,-2.060109 4.936793,-3.832087 5.105954,-3.937731 0.169163,-0.105644 0.307568,-0.370098 0.307568,-0.587674 0,-0.217577 0.0759,-0.395594 0.168748,-0.395594 0.09296,0 0.191249,0.749391 0.218852,1.668629 l 0.05012,1.668628 3.501681,-2.743511 c 1.925923,-1.508929 3.994094,-3.13326 4.59595,-3.609626 0.601846,-0.476364 1.094269,-0.787203 1.094269,-0.690752 0,0.09645 -2.074864,1.798827 -4.610821,3.783064 l -4.610828,3.6077 0.07176,1.878467 c 0.03939,1.033156 0.08726,1.942678 0.10622,2.02116 0.01893,0.07848 5.882762,-4.519185 13.030649,-10.21704 l 12.99619,-10.359731 v -1.934657 c 0,-1.826737 -0.017,-1.919875 -0.3064,-1.669715 -1.08009,0.933957 -7.78453,6.092351 -7.9183,6.092351 -0.0902,0 -0.18714,-0.550275 -0.21543,-1.222838 l -0.0514,-1.222836 -4.18037,3.24334 c -2.29922,1.78384 -4.22185,3.201884 -4.27252,3.151213 -0.0507,-0.05067 0.13327,-0.270505 0.40875,-0.488521 1.03748,-0.82105 8.07223,-6.298322 12.20232,-9.500752 3.04253,-2.359145 4.32098,-3.453889 4.39598,-3.764302 0.075,-0.310343 1.25304,-1.319485 4.04852,-3.468019 l 3.94275,-3.03031 v -3.58944 c 0,-2.82432 -0.0466,-3.56167 -0.21884,-3.45915 -0.12039,0.0717 -0.96735,0.69269 -1.88217,1.38006 -3.97036,2.98329 -5.77776,4.27567 -5.77776,4.13141 0,-0.085 1.76726,-1.4776 3.92725,-3.09461 2.28148,-1.70796 3.96803,-3.09184 4.02455,-3.30228 0.11494,-0.42801 0.13777,-7.10298 0.0242,-7.10298 -0.0427,0 -1.82291,1.26633 -3.95585,2.81405 -2.13296,1.54774 -3.91725,2.77489 -3.96513,2.72702 -0.0869,-0.0869 1.0496,-0.94792 5.59123,-4.23596 l 2.40727,-1.74282 1.3e-4,-3.72053 c 7e-5,-2.04628 -0.0412,-3.72052 -0.0918,-3.72052 -0.0506,0 -1.78864,1.19016 -3.86247,2.64481 -2.07382,1.45463 -3.81252,2.60286 -3.86379,2.55159 -0.10635,-0.10636 0.0947,-0.25516 4.53314,-3.35443 l 3.2544,-2.27249 0.1154,-2.10461 c 0.0635,-1.15754 0.0901,-2.91674 0.0591,-3.90936 l -0.0563,-1.80474 -3.85185,2.60074 c -4.54165,3.06649 -4.28956,2.90672 -4.28956,2.7185 0,-0.0821 1.8401,-1.38949 4.08912,-2.90526 l 4.08912,-2.75595 0.093,-7.21618 c 0.0511,-3.96888 0.0667,-7.24482 0.0346,-7.27985 -0.0321,-0.035 -3.88018,2.32861 -8.55126,5.25252 l -8.49289,5.3162 -0.0369,3.41414 -0.0369,3.41413 -0.16398,-4.72726 c -0.0902,-2.59999 -0.19217,-4.75689 -0.22662,-4.79311 -0.0344,-0.0362 -4.31989,2.5638 -9.523206,5.77777 l -9.460579,5.84361 -9.01e-4,1.44444 c -5.32e-4,0.79445 0.04174,1.44444 0.09392,1.44444 0.05229,0 2.229207,-1.34221 4.837711,-2.9827 2.608507,-1.64048 4.784945,-2.94047 4.836546,-2.88888 0.121267,0.12126 0.61188,-0.20311 -4.779356,3.15985 -2.599994,1.62182 -5.357567,3.35664 -6.127935,3.85515 -0.77037,0.49851 -3.201444,2.03178 -5.402389,3.40728 l -4.001715,2.50091 0.126415,3.70849 0.126414,3.70846 -5.491689,3.5554 c -3.020426,1.95547 -5.512251,3.57262 -5.537394,3.59368 -0.02515,0.0211 0.07428,1.96114 0.220916,4.31131 0.234097,3.751506 0.497293,8.072585 1.75328,28.784764 0.151827,2.5037 0.376115,6.08854 0.498419,7.966316 0.122295,1.877774 0.193377,3.492923 0.157957,3.58922 -0.03543,0.09629 -0.533026,0.525406 -1.105782,0.953578 -0.794916,0.594254 -1.041696,0.884307 -1.04276,1.225587 -0.0045,1.562601 0.441203,7.362907 0.56622,7.362907 0.08357,0 5.052812,-3.908594 11.042714,-8.685765 z m -14.378018,5.649315 c -0.08113,-1.122523 -0.192953,-2.086343 -0.24843,-2.141821 -0.175328,-0.175327 -8.069362,-3.401221 -8.142968,-3.327621 -0.08014,0.0801 0.242823,4.132947 0.334385,4.196693 0.185047,0.128835 8.12137,3.395494 8.159133,3.358372 0.02497,-0.02457 -0.021,-0.963098 -0.10212,-2.085623 z m -8.53916,-3.310342 c -0.06617,-0.987035 -0.180945,-1.952185 -0.255056,-2.144778 -0.08591,-0.223151 -0.600854,-0.533851 -1.419704,-0.856559 -2.718222,-1.071242 -6.718692,-2.757993 -6.84955,-2.888026 -0.07535,-0.07488 -0.193531,-0.755147 -0.262622,-1.511705 l -0.125624,-1.375563 -4.070698,-1.654321 c -2.238885,-0.909877 -4.070705,-1.723307 -4.070705,-1.807627 0,-0.08431 0.295457,-0.02808 0.656565,0.124988 0.361109,0.153061 3.453533,1.408989 6.872046,2.790952 3.418513,1.381963 6.833304,2.767412 7.588428,3.078776 1.107802,0.456778 1.401351,0.520177 1.519958,0.328265 0.188734,-0.305382 0.293126,0.176824 0.414735,1.915772 0.04994,0.713052 0.153315,1.355985 0.229887,1.428735 0.149105,0.141657 7.824665,3.315197 8.018167,3.315197 0.06347,0 0.06698,-0.76818 0.0072,-1.707068 -0.123754,-1.960766 -0.504747,-7.670548 -0.884956,-13.262603 -0.144047,-2.118515 -0.301814,-4.482147 -0.350612,-5.252517 -0.09836,-1.553083 -0.475756,-7.019712 -0.864221,-12.518496 -0.139459,-1.974071 -0.297886,-4.337703 -0.352046,-5.252517 -0.322848,-5.452255 -0.663859,-9.906195 -0.765429,-9.996845 -0.06446,-0.0575 -2.047486,-0.75989 -4.40675,-1.56078 -4.505767,-1.52958 -4.486791,-1.52233 -4.347539,-1.66157 0.04841,-0.0483 2.010706,0.57615 4.360809,1.38777 2.350105,0.81162 4.307263,1.44133 4.349235,1.39935 0.115471,-0.11547 -0.351532,-6.9723 -0.483464,-7.09863 -0.176564,-0.16907 -17.58931,-5.93516 -17.672398,-5.85207 -0.04023,0.0402 0.05287,1.41204 0.20693,3.04851 0.294234,3.12593 0.34254,4.1723 0.185372,4.01513 -0.08725,-0.0873 -0.638011,-5.62606 -0.897927,-9.03027 -0.06095,-0.79773 -0.197336,-1.50501 -0.303173,-1.57171 -0.105831,-0.0667 -3.92603,-1.35868 -8.489325,-2.87104 l -8.296897,-2.74978 0.119383,1.43151 c 0.06565,0.78734 0.175029,1.48125 0.243042,1.54206 0.06802,0.0608 1.955471,0.71785 4.194357,1.46009 2.238885,0.74226 4.070698,1.40489 4.070698,1.47252 0,0.0676 -3.722719,-1.11888 -8.272711,-2.63669 -4.549993,-1.51782 -8.290877,-2.70242 -8.313078,-2.63247 -0.02223,0.07 0.144781,1.62417 0.371074,3.45378 0.376621,3.04509 0.411903,3.60902 0.212715,3.39955 -0.03819,-0.0401 -0.351355,-2.3519 -0.695992,-5.13727 -0.344638,-2.78539 -0.687662,-5.11933 -0.762279,-5.18654 -0.07461,-0.0673 -1.82086,-0.68126 -3.880561,-1.36454 l -3.744901,-1.24234 0.110787,1.00128 c 0.345095,3.11893 2.20482,17.50131 2.291951,17.72503 0.06127,0.15733 1.608683,0.80057 3.790732,1.57574 3.747534,1.33132 4.151509,1.49554 4.005068,1.62814 -0.0454,0.0411 -1.776414,-0.53793 -3.846775,-1.28668 -3.156493,-1.14154 -3.771653,-1.31462 -3.80981,-1.07188 -0.104652,0.66576 0.963526,7.94471 1.186067,8.08225 0.12649,0.0782 1.87161,0.74822 3.87804,1.48899 2.006425,0.74077 3.648049,1.414 3.648049,1.49606 0,0.0821 -0.492423,-0.0359 -1.094276,-0.2622 -4.420756,-1.66206 -6.47597,-2.39096 -6.545506,-2.32142 -0.08406,0.0841 0.911181,7.996954 1.015127,8.07091 0.03243,0.0231 1.77264,0.697555 3.867082,1.498804 2.094442,0.801251 3.808076,1.523929 3.808076,1.605952 0,0.08203 -0.295457,0.03132 -0.656565,-0.11269 -1.815648,-0.724044 -6.962485,-2.679269 -6.985269,-2.653622 -0.01436,0.01618 0.199613,1.762728 0.475497,3.881244 0.275883,2.118514 0.504201,3.904252 0.507378,3.968307 0.0033,0.06406 1.640618,0.762879 3.638763,1.552943 3.300507,1.305015 4.259638,1.744731 3.805715,1.744731 -0.08796,0 -1.764238,-0.63746 -3.725049,-1.416578 -1.960818,-0.779119 -3.590497,-1.389723 -3.621519,-1.3569 -0.0673,0.07122 0.90101,7.680783 0.986638,7.753577 0.03262,0.02771 1.67442,0.700846 3.648486,1.495855 3.308448,1.332392 4.208042,1.752987 3.74942,1.752987 -0.09485,0 -1.804549,-0.665609 -3.799322,-1.479131 -1.994765,-0.813521 -3.626852,-1.400096 -3.626852,-1.303495 0,0.225134 0.510045,0.445642 8.464964,3.659644 5.252054,2.121975 6.657359,2.627515 6.774982,2.437206 0.233468,-0.37776 0.29516,-0.185439 0.509437,1.588125 0.110523,0.914813 0.256066,1.714005 0.323416,1.775981 0.06735,0.06197 1.816395,0.803623 3.886762,1.648107 4.035356,1.64598 3.954453,1.6091 3.821477,1.742075 -0.04883,0.04881 -1.807858,-0.62143 -3.909018,-1.489402 -2.101158,-0.867971 -3.839733,-1.557899 -3.863502,-1.533173 -0.08102,0.08429 0.373675,3.967018 0.476621,4.069959 0.127609,0.127613 23.819217,10.058415 24.011025,10.064693 0.07663,0.0025 0.08519,-0.803014 0.01902,-1.790049 z m 10.958877,-1.925923 c -0.01361,-1.020457 -0.551571,-7.920267 -0.62305,-7.99175 -0.102552,-0.102555 -2.427414,-1.056504 -2.454639,-1.007203 -0.0081,0.01425 0.106132,1.855589 0.253334,4.091869 l 0.26764,4.065962 1.059798,0.433916 c 0.94201,0.385689 1.498657,0.537113 1.496917,0.407206 z m 1.265073,-0.656564 c 0.45029,-0.337036 0.850618,-0.691581 0.889616,-0.787877 0.07627,-0.188298 -0.398453,-7.840045 -0.492415,-7.936962 -0.03101,-0.032 -0.456987,0.240873 -0.94659,0.606393 -0.812368,0.606495 -0.890346,0.726357 -0.892023,1.371317 -0.0036,1.409399 0.421108,7.453272 0.520595,7.407202 0.05616,-0.026 0.470528,-0.323036 0.920817,-0.660073 z m -12.586498,-1.498538 -0.102373,-1.221014 -3.844022,-1.57288 c -2.114214,-0.865082 -3.916454,-1.599141 -4.004967,-1.631239 -0.20807,-0.07545 -0.20942,1.571339 -0.002,2.117593 0.107432,0.282566 0.463273,0.537964 1.094276,0.785392 0.514287,0.201664 2.27446,0.917557 3.911501,1.590874 1.637034,0.673319 2.992904,1.208031 3.013052,1.188251 0.0201,-0.01978 -0.0095,-0.585418 -0.06572,-1.256977 z m 29.353943,-7.782788 4.695421,-3.678642 -0.09446,-1.092393 c -0.05192,-0.600817 -0.111666,-1.113686 -0.13268,-1.13971 -0.021,-0.02603 -2.137616,1.583427 -4.70357,3.576561 l -4.665348,3.62388 v 1.194473 c 0,0.656959 0.04616,1.194473 0.102598,1.194473 0.05643,0 2.215557,-1.655389 4.798036,-3.678642 z m -53.599098,1.359206 -0.210306,-2.017544 -3.903273,-1.614298 c -2.495103,-1.031913 -3.933137,-1.718168 -3.986044,-1.902211 -0.04552,-0.158351 -0.134239,-0.800031 -0.197163,-1.425957 l -0.114395,-1.138044 -3.581305,-1.46539 c -1.969719,-0.805966 -3.620931,-1.425763 -3.669364,-1.377334 -0.09982,0.09982 0.592365,5.773062 0.781728,6.407116 0.105023,0.351663 1.225703,0.874278 7.558051,3.524608 4.089115,1.711448 7.45672,3.092571 7.483567,3.069162 0.02686,-0.02341 -0.04586,-0.950459 -0.161496,-2.060108 z m 34.756203,-3.990934 c -0.149167,-2.258916 -0.323189,-4.15397 -0.386699,-4.211231 -0.181981,-0.164089 -2.308176,-0.91343 -2.37933,-0.838559 -0.05192,0.05463 0.296209,5.814435 0.468301,7.748142 0.03976,0.446903 0.180224,0.556233 1.270311,0.988866 0.674073,0.267527 1.242023,0.471448 1.262117,0.453157 0.0201,-0.01829 -0.08555,-1.88146 -0.2347,-4.140375 z m 1.606347,3.312908 c 0.525509,-0.396755 0.953288,-0.810389 0.950647,-0.919191 -0.02858,-1.174715 -0.522552,-7.874438 -0.585205,-7.937086 -0.04571,-0.04571 -0.518883,0.238809 -1.051496,0.632271 l -0.968378,0.715385 0.08212,0.832173 c 0.12023,1.217819 0.426716,6.101146 0.426716,6.798954 0,0.329376 0.04273,0.598865 0.09505,0.598865 0.05229,0 0.525012,-0.324617 1.050503,-0.721371 z m -36.821933,-3.101248 -0.128271,-1.108816 -3.651138,-1.484704 c -2.008126,-0.816586 -3.693617,-1.442222 -3.745536,-1.390303 -0.05194,0.05192 -0.02409,0.583918 0.06194,1.182211 l 0.156315,1.087812 2.276095,0.937036 c 1.251849,0.515368 2.90639,1.195134 3.676761,1.510585 0.770365,0.315454 1.418996,0.528878 1.441396,0.474274 0.02244,-0.0546 -0.017,-0.598245 -0.08754,-1.208095 z m -15.251037,-4.361074 c -0.264,-2.042224 -0.514831,-3.747928 -0.557392,-3.790456 -0.04255,-0.04252 -0.491027,-0.240343 -0.996579,-0.439592 L 14.4292,-80.769656 v 0.37572 c 0,0.715594 0.900712,7.060755 1.019124,7.179299 0.123526,0.123666 1.845318,0.828702 1.901903,0.778787 0.01767,-0.0156 -0.183863,-1.699263 -0.447861,-3.741485 z m 49.892615,-4.74994 -0.278332,-4.266981 -1.188601,-0.438902 c -0.653736,-0.241393 -1.238147,-0.389361 -1.298699,-0.328816 -0.103463,0.103475 0.19453,5.629558 0.407585,7.558302 l 0.09753,0.88288 1.253724,0.452366 c 0.689542,0.2488 1.260783,0.442414 1.26941,0.430249 0.009,-0.01217 -0.109548,-1.942258 -0.262619,-4.289098 z m 1.766666,3.349244 c 0.731325,-0.522766 0.811728,-0.646075 0.748048,-1.147126 -0.03921,-0.308766 -0.159787,-2.176544 -0.267865,-4.150614 -0.10807,-1.974071 -0.222495,-3.616512 -0.254254,-3.649868 -0.03173,-0.03336 -0.433757,0.203006 -0.893303,0.525252 -0.459548,0.322245 -0.900985,0.631527 -0.980973,0.687297 -0.07996,0.05577 -0.02497,1.867888 0.122331,4.026929 0.147266,2.159043 0.268018,4.068061 0.268325,4.242262 6.58e-4,0.35492 0.03345,0.340997 1.257691,-0.534132 z m -52.259852,-3.50313 c -0.05395,-0.361112 -0.274673,-2.074745 -0.490497,-3.808075 -0.215825,-1.73333 -0.406153,-3.172371 -0.422947,-3.19787 -0.0168,-0.02549 -0.501516,-0.230931 -1.077145,-0.456517 l -1.046593,-0.410159 0.215449,1.594564 c 0.118503,0.877009 0.350434,2.63148 0.515411,3.898824 l 0.299951,2.304262 0.898535,0.354411 c 1.206838,0.476015 1.220192,0.472646 1.107836,-0.27944 z m 50.123335,-5.252516 c -0.0063,-1.014635 -0.481218,-7.94162 -0.548838,-8.002507 -0.03299,-0.0297 -0.640375,-0.261842 -1.34975,-0.515873 l -1.289774,-0.461872 0.100353,0.747707 c 0.05517,0.411238 0.195575,2.339877 0.311974,4.28586 0.11639,1.945984 0.257688,3.608646 0.314004,3.694804 0.11191,0.171221 1.894496,0.884621 2.247155,0.899321 0.138467,0.0058 0.2174,-0.232042 0.214876,-0.64744 z m 1.623224,-0.182226 0.831362,-0.594319 -0.09103,-1.165598 c -0.156714,-2.006503 -0.433649,-6.509621 -0.433649,-7.051357 v -0.517849 l -1.050503,0.713382 c -1.216312,0.825984 -1.144383,0.449968 -0.8765,4.582025 0.276511,4.265114 0.353516,4.891431 0.584214,4.751885 0.112604,-0.06812 0.578858,-0.391291 1.036106,-0.718169 z m 45.628666,-4.413727 3.70057,-2.888884 5.2e-4,-1.102975 c 3.5e-4,-0.86711 -0.0489,-1.073033 -0.23038,-0.96296 -0.12697,0.077 -1.9391,1.464971 -4.02693,3.084363 l -3.79614,2.94435 v 1.136279 c 0,1.073282 0.018,1.123593 0.3259,0.907494 0.17924,-0.12583 1.99115,-1.528781 4.02646,-3.117667 z m -98.80774,-1.249271 c -0.249442,-1.961044 -0.488519,-3.731347 -0.531287,-3.934007 -0.05459,-0.258574 -0.373456,-0.481626 -1.069197,-0.747871 -0.545289,-0.20867 -1.010899,-0.358007 -1.034688,-0.331863 -0.08936,0.09821 0.987685,7.751743 1.10722,7.867934 0.160246,0.15576 1.85862,0.825396 1.928618,0.760417 0.02906,-0.02699 -0.151226,-1.653567 -0.400666,-3.61461 z m 108.24324,-1.977096 3.89561,-3.113024 v -3.395949 c 0,-1.86777 -0.0469,-3.39595 -0.10428,-3.39595 -0.30685,0 -1.1213,0.77169 -1.1213,1.06242 0,0.3434 -0.2726,0.47121 -0.37935,0.17787 -0.0321,-0.0882 -1.63411,1.06246 -3.56004,2.55705 -1.92592,1.494591 -3.64277,2.817339 -3.81522,2.939441 -0.26717,0.18917 -0.30601,0.443353 -0.26262,1.718653 l 0.0508,1.496646 3.67676,-2.887903 c 4.19867,-3.297837 3.93939,-3.106927 3.93939,-2.900558 0,0.08654 -1.73333,1.513116 -3.85185,3.170154 l -3.85184,3.012798 v 1.938702 1.938702 l 0.74411,-0.603014 c 0.40925,-0.331658 2.49713,-2.003875 4.63972,-3.716038 z m -57.273469,-1.894836 c -0.05832,-0.698147 -0.193016,-2.687538 -0.299453,-4.420867 -0.106429,-1.73333 -0.245292,-3.20085 -0.308567,-3.26116 -0.154514,-0.14725 -2.488879,-0.90588 -2.546411,-0.82754 -0.09414,0.12821 0.563975,8.75778 0.676489,8.870287 0.150303,0.150306 2.027319,0.86156 2.344469,0.888385 0.191195,0.01618 0.218077,-0.235448 0.133473,-1.249105 z m 1.769714,0.320268 c 0.515944,-0.33135 0.566562,-0.442651 0.563659,-1.239459 -0.0027,-0.654829 -0.450515,-7.801976 -0.508137,-8.104156 -0.0054,-0.0277 -0.489603,0.27568 -1.076286,0.67409 -0.995901,0.6763 -1.060447,0.76099 -0.972463,1.27588 0.05184,0.30333 0.191547,2.30426 0.310452,4.44653 l 0.216211,3.895029 0.449856,-0.291938 c 0.247412,-0.160565 0.70493,-0.455754 1.016708,-0.655976 z m -53.403211,-1.73351 c -0.05188,-0.319876 -0.264231,-1.994116 -0.471823,-3.720535 -0.2076,-1.72641 -0.441397,-3.29651 -0.519555,-3.48911 -0.131685,-0.32449 -1.861254,-1.09654 -2.044964,-0.91283 -0.07901,0.079 0.917938,7.833831 1.015894,7.902266 0.165037,0.1153 1.829749,0.791246 1.960607,0.796093 0.08482,0.0032 0.111753,-0.256008 0.05982,-0.575884 z m 112.306926,-6.821995 0.46731,-0.38765 0.058,-3.54557 c 0.0319,-1.95005 0.026,-3.54551 -0.0131,-3.54545 -0.039,7e-5 -0.33452,0.2011 -0.65657,0.44675 l -0.58554,0.44661 v 3.49278 c 0,1.92102 0.0591,3.48993 0.13131,3.48647 0.0722,-0.003 0.34161,-0.18074 0.59862,-0.39394 z m -61.239341,-0.43142 c -0.08753,-0.79651 -0.59486,-8.94793 -0.59486,-9.55792 0,-0.38498 -0.151737,-0.485 -1.343971,-0.88586 -0.739187,-0.24852 -1.359234,-0.43291 -1.377876,-0.40975 -0.0275,0.0341 0.438065,7.03362 0.654654,9.84339 0.0531,0.68957 0.06662,0.70185 1.279309,1.16338 0.674072,0.25655 1.277189,0.47475 1.340239,0.48489 0.0631,0.0101 0.08222,-0.27701 0.04246,-0.63813 z m 1.377524,-0.10738 c 0.504072,-0.32388 3.462972,-2.23124 6.57534,-4.23858 l 5.658841,-3.64972 -0.105932,-1.93312 c -0.252009,-4.5986 -0.482634,-8.23971 -0.524725,-8.28459 -0.04724,-0.0504 -13.048371,7.95192 -13.256441,8.15945 -0.06509,0.0649 0.03146,2.32398 0.214354,5.02028 0.182927,2.6963 0.33461,5.04023 0.337089,5.20875 0.0063,0.40798 0.04075,0.39907 1.101474,-0.28247 z m -53.876381,-3.6183 c -0.225751,-1.68235 -0.463526,-3.53336 -0.528389,-4.11337 l -0.11794,-1.05454 -1.068026,-0.38896 c -0.587415,-0.21394 -1.0795537,-0.3697 -1.0936421,-0.34613 -0.01409,0.0235 0.2165721,1.8867 0.5125721,4.1403 l 0.538183,4.09747 1.049517,0.39334 c 0.577238,0.21634 1.064969,0.37925 1.083848,0.36202 0.01886,-0.0172 -0.150366,-1.40778 -0.376123,-3.09013 z m 113.927458,-3.56199 0.48149,-0.35056 v -3.64216 -3.64218 l -0.6937,0.47982 -0.69369,0.47981 -0.006,3.64333 c -0.005,2.86887 0.0399,3.6156 0.21222,3.5129 0.12036,-0.0718 0.43551,-0.28816 0.70033,-0.48096 z m -64.960934,-1.81632 c -0.08456,-2.05873 0.282434,-1.78082 -4.320612,-3.27143 -2.258901,-0.73151 -4.228707,-1.37668 -4.377353,-1.43373 -0.221528,-0.085 -0.268452,0.0497 -0.26018,0.74667 0.0053,0.46772 0.06491,1.15905 0.131942,1.53631 l 0.121852,0.68593 4.288921,1.44504 c 2.358911,0.79476 4.32832,1.45141 4.376468,1.45921 0.04814,0.008 0.06572,-0.5178 0.03894,-1.168 z m -49.758614,-0.52561 c 0.01052,-0.77418 -0.955869,-7.85854 -1.097327,-8.04428 -0.181852,-0.23877 -1.8619751,-0.83334 -1.9908084,-0.70451 -0.078925,0.0789 0.9243964,8.17956 1.0256425,8.28079 0.076049,0.0761 1.7855439,0.75456 1.9270159,0.76485 0.07223,0.005 0.133188,-0.12834 0.135477,-0.29685 z m 61.330686,-5.90909 4.823125,-2.97643 -1.292406,-0.41037 -1.292416,-0.41038 -6.666191,4.06839 c -3.6664,2.23763 -6.622974,4.11163 -6.570157,4.16444 0.05283,0.0528 0.625907,0.2626 1.273511,0.46616 l 1.177469,0.37012 1.86197,-1.14776 c 1.024081,-0.63126 4.032374,-2.48714 6.685095,-4.12417 z m -20.779136,3.65233 c -0.06121,-0.44677 -0.111336,-1.10992 -0.111336,-1.47365 v -0.66134 l -4.30052,-1.43346 c -2.365282,-0.7884 -4.322144,-1.40556 -4.34858,-1.37146 -0.07994,0.1031 0.181011,2.77009 0.280801,2.86988 0.09939,0.0994 8.175985,2.84596 8.435862,2.86874 0.08532,0.007 0.105011,-0.35195 0.04374,-0.79871 z m 10.234346,-0.0129 1.09135,-0.6501 -4.424202,-1.43438 -4.424202,-1.43438 -1.070147,0.62721 -1.07015,0.62719 4.284242,1.44348 c 2.356333,0.79391 4.337687,1.44969 4.403007,1.45728 0.06536,0.007 0.60987,-0.27874 1.210102,-0.6363 z m 7.0291,-4.29324 c 2.914214,-1.77457 7.681907,-4.67472 10.594868,-6.44479 2.912961,-1.77008 5.296284,-3.26235 5.296284,-3.31616 0,-0.0538 -1.831816,-0.64039 -4.070695,-1.30351 -3.604496,-1.06758 -4.82289,-1.50056 -4.222478,-1.50056 0.09949,0 2.013113,0.54965 4.252516,1.22146 2.239383,0.6718 4.176456,1.24302 4.304593,1.26935 0.228318,0.0469 9.711888,-5.63882 9.714511,-5.82421 6.58e-4,-0.0519 -11.077675,-3.25941 -24.618705,-7.12781 l -24.62003,-7.0335 -10.863487,5.37838 -10.863488,5.37836 3.604281,1.11769 c 1.982358,0.61474 3.709055,1.19149 3.837114,1.28169 0.421438,0.29683 -0.537488,0.0453 -4.197938,-1.10118 l -3.555346,-1.11354 -5.778919,2.88791 -5.778926,2.8879 7.958262,2.62288 7.958255,2.62287 3.564558,-1.89228 c 1.960507,-1.04075 4.608496,-2.44527 5.88442,-3.12117 1.275922,-0.67589 2.319861,-1.15979 2.319861,-1.07534 0,0.0845 -2.51854,1.4869 -5.596757,3.11653 -3.078216,1.62964 -5.54033,3.01551 -5.471372,3.0797 0.112919,0.1051 8.517773,2.8877 20.983855,6.94708 l 4.57567,1.49001 5.316568,-3.12292 c 2.924113,-1.71759 5.506104,-3.24439 5.737766,-3.39287 0.283732,-0.18186 0.397733,-0.1996 0.349314,-0.0544 -0.03949,0.1186 -2.541046,1.66643 -5.558921,3.43963 l -5.487047,3.22398 4.262305,1.40895 c 2.344281,0.77492 4.399168,1.37911 4.56642,1.34262 0.167261,-0.0365 2.688465,-1.51824 5.602688,-3.29282 z m -18.641726,-18.3302 c -1.471551,-0.20532 -2.330541,-1.23969 -1.592615,-1.91778 0.973331,-0.89441 3.512763,-1.32748 5.287498,-0.90174 1.063539,0.25514 1.659174,0.85954 1.440006,1.46121 -0.196622,0.53978 -1.298979,1.11417 -2.559634,1.3337 -1.151824,0.20058 -1.303633,0.20203 -2.575255,0.0246 z m 0.50497,-1.10688 c -0.06075,-0.50555 -0.111092,-1.05459 -0.111926,-1.22009 -0.0014,-0.19526 -0.09373,-0.26551 -0.264145,-0.20012 -0.469268,0.18008 -0.264951,2.33941 0.221358,2.33941 0.217128,0 0.245139,-0.16639 0.154713,-0.9192 z m 0.935533,0.6128 c -6.62e-4,-0.16852 -0.05122,-0.72003 -0.111925,-1.22559 -0.08198,-0.68246 -0.183043,-0.91928 -0.392423,-0.91958 -0.237998,-3.5e-4 -0.272931,0.1909 -0.22387,1.22559 0.05082,1.07156 0.100437,1.22598 0.393943,1.22598 0.203662,0 0.335202,-0.12057 0.334275,-0.3064 z m 0.876946,-0.19442 c 0,-1.08768 -0.225334,-2.12544 -0.461509,-2.12544 -0.178416,0 -0.238832,0.30263 -0.238832,1.19641 0,0.65802 0.05254,1.24893 0.116722,1.31313 0.284039,0.28403 0.583619,0.0869 0.583619,-0.3841 z m -2.660882,-0.57969 c -0.03084,-0.52785 -0.144192,-0.93551 -0.271774,-0.97756 -0.242367,-0.0799 -0.286016,0.45292 -0.109431,1.33584 0.175564,0.87782 0.438981,0.63025 0.381205,-0.35828 z m 3.446017,-0.18885 c -0.134537,-1.18112 -0.192232,-1.3569 -0.445304,-1.3569 -0.181333,0 -0.22793,1.73264 -0.05851,2.17423 0.05842,0.15232 0.223756,0.27694 0.367353,0.27694 0.216842,0 0.239965,-0.18545 0.13643,-1.09427 z m -4.187657,-0.44069 c -0.223989,-0.22398 -0.307163,0.15934 -0.169826,0.78269 l 0.146441,0.66473 0.06127,-0.67413 c 0.03368,-0.37077 0.01668,-0.71875 -0.03792,-0.77329 z m 4.978273,0.85651 c 0,-0.74865 -0.197713,-1.59764 -0.37205,-1.59764 -0.08429,0 -0.153197,0.47273 -0.153197,1.05051 0,0.81706 0.05833,1.0505 0.262619,1.0505 0.172552,0 0.262628,-0.17265 0.262628,-0.50337 z m 0.525256,-0.5368 c 0,-0.37951 -0.07879,-0.7387 -0.175094,-0.79821 -0.106943,-0.0661 -0.175077,0.20245 -0.175077,0.69 0,0.43902 0.07879,0.79821 0.175077,0.79821 0.0963,0 0.175094,-0.31049 0.175094,-0.69 z m -6.008339,0.13192 c -0.05592,-0.13966 -0.09738,-0.0982 -0.105778,0.10578 -0.0076,0.18457 0.03375,0.28798 0.09195,0.2298 0.05816,-0.0582 0.06438,-0.20919 0.01383,-0.33558 z m 6.407415,-0.32429 c -0.05138,-0.1964 -0.132509,-0.31799 -0.180323,-0.27017 -0.09472,0.0947 0.07257,0.62729 0.197063,0.62729 0.04219,0 0.03462,-0.16069 -0.01677,-0.35712 z m -2.40989,21.35047 c 0.528168,-0.29808 0.960311,-0.5712 0.960311,-0.60694 0,-0.0967 -8.067616,-2.70294 -8.366952,-2.70294 -0.294081,0 -2.194661,1.05229 -2.089862,1.15708 0.12506,0.12506 7.911185,2.65831 8.227144,2.67674 0.169973,0.01 0.741188,-0.22586 1.269359,-0.52394 z m 73.116156,-0.0334 0.45898,-0.38765 0.096,-3.72052 c 0.0528,-2.04629 0.0576,-3.72053 0.0108,-3.72053 -0.0469,0 -0.35568,0.20632 -0.68629,0.45849 l -0.60111,0.45849 v 3.65597 c 0,2.01079 0.059,3.65315 0.13132,3.64969 0.0722,-0.004 0.33785,-0.18074 0.5903,-0.39394 z m -41.979969,-4.3244 4.315646,-2.71118 v -1.4672 -1.46721 l -0.393938,0.25207 c -0.216671,0.13865 -2.540911,1.57451 -5.164975,3.19083 l -4.771037,2.93874 v 1.19209 c 0,1.74952 0.05544,1.82263 0.952089,1.25536 0.410605,-0.25978 2.6886,-1.69236 5.062215,-3.1835 z m -39.246695,0.89028 c 0.0666,-0.0578 -3.636422,-1.3325 -8.228945,-2.83273 l -8.350029,-2.72772 -1.088651,0.5302 c -0.598758,0.2916 -1.05102,0.56782 -1.005029,0.61382 0.04599,0.046 3.805574,1.31899 8.354634,2.8289 l 8.27101,2.74527 0.962957,-0.52635 c 0.529632,-0.28948 1.017456,-0.57361 1.084053,-0.63139 z m -34.605867,-0.41143 c -0.05313,-0.31296 -0.335042,-2.45992 -0.626384,-4.77103 -0.2913426,-2.31112 -0.5613629,-4.29341 -0.6000481,-4.40509 -0.066178,-0.191 -1.9897085,-0.8479 -2.1152396,-0.72237 -0.03203,0.032 0.232498,2.25212 0.5878442,4.93353 l 0.6460781,4.87529 0.7878735,0.31119 c 1.2320769,0.48663 1.4344089,0.45268 1.3198759,-0.22152 z m 72.895587,-3.16748 c 5.46359,-3.3887 5.221993,-3.12089 3.259147,-3.61266 l -0.875409,-0.21933 -5.121046,3.12769 -5.121036,3.12768 1.18165,0.37968 c 0.649914,0.20883 1.299835,0.3571 1.444279,0.32951 0.144445,-0.0276 2.499028,-1.43724 5.232415,-3.13257 z m -57.534517,0.49931 -0.135516,-1.22374 -3.85185,-1.26915 c -2.118516,-0.69804 -3.909726,-1.27008 -3.98047,-1.27121 -0.143332,-0.002 0.02528,1.99749 0.212535,2.52092 0.09103,0.25447 1.037196,0.63615 3.957257,1.59636 2.383475,0.78376 3.855787,1.18777 3.885592,1.06624 0.0264,-0.10762 -0.01304,-0.74637 -0.08754,-1.41942 z m 100.585651,-1.45101 0.57316,-0.47677 -0.0479,-3.72281 -0.048,-3.72282 -0.65657,0.44631 -0.65656,0.4463 v 3.75799 c 0,2.06689 0.0591,3.75588 0.13131,3.75328 0.0722,-0.003 0.38925,-0.21924 0.7045,-0.48148 z m -99.560413,-0.57577 c 0.584775,-0.2952 1.022314,-0.57763 0.972313,-0.62763 -0.05002,-0.05 -1.818585,-0.65545 -3.930179,-1.34544 l -3.839263,-1.25452 -0.595952,0.33203 c -1.664731,0.92752 -1.881575,0.72587 2.296543,2.13569 2.068382,0.69793 3.822032,1.27518 3.897005,1.28277 0.07497,0.007 0.614759,-0.2277 1.199533,-0.5229 z m 72.730335,-8.50643 c 4.336468,-2.68182 7.921308,-4.94764 7.966318,-5.03517 0.045,-0.0875 -0.40693,-0.29697 -1.00431,-0.46543 l -1.08616,-0.30629 -9.542587,5.80549 c -5.248426,3.19303 -9.546016,5.85326 -9.55019,5.91163 -0.0036,0.0584 0.52422,0.26049 1.174223,0.44914 l 1.181804,0.343 1.488217,-0.91318 c 0.818517,-0.50224 5.036228,-3.10737 9.372685,-5.78919 z m -80.246366,5.15984 c -0.06756,-0.0657 -1.731706,-0.64513 -3.698115,-1.28755 l -3.575292,-1.16803 -1.020658,0.48784 c -0.561369,0.26831 -1.020666,0.53254 -1.020666,0.5872 0,0.0546 1.674241,0.65077 3.720529,1.32471 l 3.720534,1.22533 0.998246,-0.52498 c 0.549034,-0.28874 0.942979,-0.57877 0.875422,-0.64452 z m -2.940906,-5.04005 c 3.8129,-1.87452 6.932547,-3.45973 6.932547,-3.5227 0,-0.12229 -1.460891,-0.56852 -1.86126,-0.56852 -0.286035,0 -14.0544439,6.75444 -14.0644449,6.89968 -0.00874,0.12743 1.5877549,0.66753 1.8584909,0.62872 0.1111642,-0.016 3.321767,-1.56266 7.134667,-3.43718 z m 110.64196,-2.36956 c 0.13702,-3.56953 0.1499,-7.26598 0.0253,-7.26598 -0.0495,0 -0.36367,0.17728 -0.69816,0.39394 l -0.60817,0.39394 -0.002,5.11313 -0.002,5.11316 0.58555,-0.38588 0.58554,-0.38588 0.11425,-2.97643 z m -26.35089,-1.03307 4.70307,-2.87145 1.29574,0.35046 c 0.71264,0.19276 1.37057,0.42128 1.46204,0.50782 0.35213,0.33311 0.41026,0.11201 0.31932,-1.21461 -0.15162,-2.21202 0.4935,-3.63174 2.06166,-4.53711 0.49879,-0.28797 0.8388,-0.5645 0.75556,-0.61449 -0.0832,-0.0499 -1.0968,-0.33881 -2.25236,-0.64183 -2.49498,-0.65425 -2.61648,-0.69398 -2.49487,-0.81559 0.0516,-0.0516 1.15114,0.18655 2.44323,0.52938 1.2921,0.34283 2.44291,0.62333 2.55735,0.62333 0.12088,0 0.20809,-0.25543 0.20809,-0.60945 0,-0.51912 -0.0714,-0.62721 -0.48148,-0.72919 -0.26481,-0.0658 -6.7057,-1.75183 -14.313096,-3.74664 l -13.831633,-3.62693 -0.05607,0.52109 c -0.03083,0.28661 -0.02759,0.54965 0.0072,0.58454 0.03489,0.0349 0.528654,0.18462 1.097254,0.33271 0.56859,0.14811 1.099021,0.3345 1.17873,0.41421 0.07969,0.0797 0.194142,1.17363 0.25428,2.43095 l 0.10935,2.286 2.512667,0.67044 c 1.381969,0.36874 2.512669,0.73267 2.512669,0.80874 0,0.17429 0.295153,0.2373 -2.538712,-0.54196 -2.130936,-0.58595 -2.457615,-0.63701 -2.500435,-0.39082 -0.02704,0.15575 0.02218,1.74075 0.109503,3.52224 0.08735,1.78148 0.10331,3.30039 0.03552,3.37535 -0.06779,0.0749 -0.612348,0.0222 -1.210155,-0.11729 l -1.086933,-0.25356 0.05012,1.59956 0.05012,1.59958 5.865307,1.695 c 3.225928,0.93225 6.002209,1.7031 6.169533,1.71299 0.167323,0.01 2.420603,-1.27417 5.007281,-2.85347 z m 12.97608,-2.35436 3.23038,-2.02224 -1.21448,-0.30649 -1.21447,-0.30651 -3.02264,1.86858 -3.02263,1.86857 v 1.10436 1.10437 l 1.00673,-0.6442 c 0.55371,-0.3543 2.46041,-1.5542 4.23711,-2.66644 z m -84.261403,-0.64442 c 2.906926,-1.44173 5.290255,-2.66747 5.296283,-2.72384 0.0059,-0.0563 -0.435687,-0.22682 -0.981603,-0.37876 l -0.992569,-0.27627 -5.310451,2.65353 c -2.920743,1.45942 -5.310445,2.69452 -5.310445,2.74466 0,0.096 1.775294,0.67598 1.925918,0.6292 0.04817,-0.015 2.46594,-1.20679 5.372867,-2.64852 z m 53.978642,1.36182 c -9.01e-4,-0.55371 -0.04832,-1.28705 -0.104986,-1.62966 -0.09621,-0.58148 -0.168937,-0.64244 -1.09235,-0.9157 -0.544106,-0.16101 -1.24534,-0.34357 -1.558298,-0.40568 -0.312975,-0.0621 -0.569032,-0.19041 -0.569032,-0.2851 0,-0.15725 0.397552,-0.11058 1.271951,0.14934 0.24148,0.0718 0.19244,-0.0809 -0.22444,-0.69855 -0.293387,-0.43471 -0.622608,-1.051 -0.731606,-1.36952 -0.108997,-0.31852 -0.269677,-0.62664 -0.357076,-0.68473 -0.08735,-0.0581 -0.182495,-0.37323 -0.211325,-0.70033 -0.02885,-0.3271 -0.108421,-0.95207 -0.176843,-1.38882 l -0.124405,-0.79408 -1.395751,-0.33255 c -0.850411,-0.2026 -1.56314,-0.48764 -1.824145,-0.72954 l -0.428374,-0.397 0.0018,0.64821 c 6.67e-4,0.35652 0.05138,1.06313 0.11227,1.57027 0.09343,0.77787 0.175329,0.93826 0.523733,1.02571 0.227136,0.0571 0.412986,0.1754 0.412986,0.26309 0,0.0877 -0.198389,0.10965 -0.440851,0.0488 l -0.440842,-0.11065 0.114921,2.77734 c 0.06319,1.52753 0.147852,2.81673 0.188112,2.86487 0.06382,0.0763 6.577801,2.03562 6.925447,2.08309 0.07221,0.01 0.130445,-0.43511 0.129381,-0.98881 z m 26.627821,-0.96076 0.91182,-0.56682 -0.74963,-0.21704 c -0.4123,-0.11937 -0.89617,-0.26355 -1.07528,-0.3204 -0.28379,-0.09 -0.32564,-0.005 -0.32564,0.66715 0,0.66116 0.0956,1.00393 0.28018,1.00393 0.0257,0 0.45704,-0.25507 0.95855,-0.56682 z m -34.097672,-1.49041 c -0.03615,-0.74629 -0.110161,-2.00716 -0.164547,-2.80192 l -0.09889,-1.44501 -1.428683,0.77945 c -0.785765,0.42871 -2.274452,1.24141 -3.308179,1.806 l -1.879495,1.02653 3.367713,0.97705 c 1.852243,0.53737 3.414976,0.98553 3.472734,0.99591 0.05779,0.0104 0.07545,-0.59171 0.03939,-1.33801 z m 35.249702,0.38639 c 0.14094,-0.36732 0.0997,-0.39289 -1.22768,-0.76096 l -1.16308,-0.32251 v 0.37964 c 0,0.31296 0.17684,0.42888 1.00673,0.65991 1.29721,0.36114 1.26271,0.36005 1.38403,0.0439 z m -25.588984,-1.34936 c -0.158841,-2.57235 -0.252622,-4.40691 -0.257877,-5.04501 -0.0045,-0.53531 -0.08988,-0.66455 -0.600764,-0.90817 -0.563948,-0.26892 -0.61197,-0.26599 -0.902562,0.0551 -0.391856,0.43301 -0.574667,0.42664 -1.068443,-0.0372 -0.378613,-0.35568 -0.407406,-0.35879 -0.523372,-0.0566 -0.171218,0.44618 0.215453,2.94958 0.657999,4.26003 0.443807,1.31418 1.306794,2.64994 1.906756,2.9513 0.832941,0.4184 0.884478,0.33868 0.788263,-1.21941 z m 26.248484,0.87542 c 0.16913,-0.8531 0.7073,-1.41852 1.2262,-1.28828 0.23384,0.0587 0.45064,0.22699 0.48177,0.374 0.0503,0.23763 0.1003,0.23651 0.45052,-0.0101 0.33311,-0.23452 0.39393,-0.43775 0.39393,-1.3163 v -1.03896 l -0.88021,0.54161 c -1.20014,0.73845 -2.09621,2.05101 -2.09621,3.07051 0,0.46951 0.31379,0.22342 0.424,-0.33252 z m -27.821818,0.0483 c -0.121565,-0.1967 -1.860601,-0.74384 -1.981138,-0.6233 -0.08357,0.0836 0.377864,0.29795 1.277992,0.59364 0.695077,0.22834 0.829443,0.23401 0.703146,0.0297 z m 28.360768,-0.005 c 0.0595,-0.0963 0.0248,-0.17509 -0.0772,-0.17509 -0.10198,0 -0.18542,0.0788 -0.18542,0.17509 0,0.0963 0.0347,0.17508 0.0772,0.17508 0.0425,0 0.12591,-0.0788 0.18541,-0.17508 z m -1.00055,-0.71881 c 0.0398,-0.2091 -0.21791,-0.35725 -1.00636,-0.57848 -0.58293,-0.16355 -1.13804,-0.24909 -1.23355,-0.19006 -0.40169,0.24826 -0.12372,0.60705 0.65798,0.8493 1.01722,0.31524 1.51133,0.29001 1.58193,-0.0808 z m 1.61335,0.30152 c 0,-0.037 -0.15758,-0.10833 -0.35017,-0.1587 -0.19258,-0.0504 -0.35016,-0.0202 -0.35016,0.0672 0,0.0873 0.15758,0.15869 0.35016,0.15869 0.19259,0 0.35017,-0.0302 0.35017,-0.0671 z m 4.54142,-2.73732 c 0.01,-0.39852 -0.10098,-0.4701 -1.15422,-0.74634 -0.64074,-0.16806 -1.18961,-0.28092 -1.21971,-0.25082 -0.0301,0.0301 -0.157,0.7205 -0.28196,1.53423 l -0.22723,1.47949 1.22809,0.35734 1.22809,0.35733 0.20809,-1.14521 c 0.11445,-0.62987 0.21294,-1.34358 0.21885,-1.58602 z m -34.231377,2.12883 c -0.223602,-0.37853 -0.509786,-0.54995 -1.17415,-0.7033 -0.483175,-0.11153 -0.90806,-0.17322 -0.944201,-0.13707 -0.03615,0.0361 0.0741,0.22994 0.245067,0.43068 0.240533,0.28251 1.201087,0.69029 2.115277,0.89802 0.02948,0.006 -0.07933,-0.21304 -0.241993,-0.48833 z m 38.864077,-2.51721 c 1.81985,-1.14278 3.37294,-2.01364 3.45133,-1.93526 0.0783,0.0784 0.16517,0.9503 0.19286,1.93758 l 0.0504,1.79507 0.65657,-0.44665 0.65656,-0.44664 v -3.34042 -3.34041 l -0.39393,0.24878 c -0.21667,0.13684 -2.30072,1.426 -4.63122,2.86482 l -4.23728,2.61603 -0.19659,1.22602 c -0.10814,0.67431 -0.23718,1.36933 -0.28677,1.54448 -0.0761,0.26857 0.0288,0.24295 0.66957,-0.16359 0.41786,-0.26512 2.2487,-1.41704 4.06855,-2.55981 z m -50.03893,0.97491 c 1.886708,-1.02725 3.470427,-1.9721 3.519378,-2.09964 0.134591,-0.35076 -0.222467,-4.10447 -0.402862,-4.23513 -0.08654,-0.0626 -0.183686,-0.23216 -0.215851,-0.3766 -0.03218,-0.14444 -0.186327,-0.73536 -0.34258,-1.31312 -0.461576,-1.7068 -0.311867,-6.06386 0.259509,-7.55284 0.08438,-0.21985 -17.754889,8.64228 -18.215348,9.04896 -0.167693,0.14811 0.03723,4.57315 0.225848,4.87845 0.09173,0.14842 10.877464,3.39971 11.6097,3.49967 0.07248,0.01 1.675499,-0.82249 3.562206,-1.84975 z m 41.21498,1.80062 c 0,-0.037 -0.15768,-0.10836 -0.35041,-0.15876 -0.19272,-0.0504 -0.30626,-0.0202 -0.25229,0.0672 0.0942,0.15248 0.6027,0.22979 0.6027,0.0916 z m -1.5959,-0.76453 c 0.15112,-0.26869 0.0288,-0.34295 -0.99351,-0.6034 -1.1113,-0.28311 -1.42209,-0.23605 -1.43484,0.21728 -0.002,0.0749 1.52475,0.55397 2.1334,0.66928 0.0674,0.0128 0.20016,-0.11465 0.29495,-0.28316 z m -66.187694,-5.3892 10.216274,-5.06673 -0.992376,-0.29461 -0.992376,-0.29459 -10.143087,5.00584 c -5.578698,2.75322 -10.143091,5.05706 -10.143091,5.11964 0,0.11148 1.578481,0.67285 1.750842,0.62268 0.04818,-0.0141 4.684862,-2.30552 10.303814,-5.09223 z m 37.086325,4.42713 c -0.210649,-0.50414 -0.387213,-0.63972 -1.050757,-0.8068 -1.162224,-0.29265 -1.200221,-0.27794 -0.938548,0.36333 0.191411,0.46909 0.390647,0.61183 1.182318,0.8471 0.523669,0.15561 0.976429,0.2648 1.006151,0.24264 0.02975,-0.0222 -0.05986,-0.31298 -0.199164,-0.64627 z m 29.711879,0.26956 c 0.0679,-0.0679 -0.40426,-0.26805 -1.04928,-0.44475 -0.75553,-0.20697 -1.23305,-0.26101 -1.34217,-0.15188 -0.10912,0.10911 0.10328,0.23956 0.59699,0.36664 0.42151,0.10849 0.84518,0.22619 0.94147,0.26154 0.30486,0.11194 0.72505,0.0964 0.85299,-0.0316 z m 1.07293,-0.82779 0.70034,-0.42422 -0.49176,-0.18725 c -1.14393,-0.43557 -1.8007,-0.42416 -2.48852,0.0432 l -0.65491,0.44504 0.85464,0.26243 c 1.15881,0.35584 1.27591,0.348 2.08021,-0.13921 z m -31.161105,-0.93087 c -0.153846,-0.82326 -0.321459,-1.02649 -0.950277,-1.15226 -0.275501,-0.0551 -0.697547,-0.14953 -0.937882,-0.20985 -0.434702,-0.10911 -0.436046,-0.10565 -0.260095,0.66329 0.187112,0.81768 0.130282,0.78322 2.207688,1.33846 0.0348,0.009 0.0081,-0.27853 -0.05941,-0.63964 z m 32.474235,-0.0737 c 0,-0.11279 0.12101,-0.33877 0.26889,-0.50219 0.24919,-0.27536 0.15992,-0.32444 -1.21926,-0.67035 -0.81847,-0.20529 -1.53038,-0.37324 -1.58201,-0.37324 -0.0516,0 -0.0939,0.26727 -0.0939,0.59392 0,0.5757 0.0309,0.60204 1.00673,0.85805 1.26561,0.33204 1.61953,0.35254 1.61953,0.0938 z m 7.60577,-2.58986 c 2.4863,-1.53721 4.55244,-2.82682 4.59142,-2.8658 0.0389,-0.0389 -0.40139,-0.18984 -0.9786,-0.33525 -0.57722,-0.14539 -1.03709,-0.21487 -1.02192,-0.15438 0.0555,0.22148 -0.24512,0.89784 -0.39911,0.89784 -0.0873,0 -0.99484,0.51689 -2.01688,1.14861 -1.55604,0.96181 -1.94207,1.13021 -2.37361,1.03542 -0.43303,-0.0951 -0.85463,0.0918 -2.63894,1.16982 l -2.12356,1.28302 0.94708,0.29713 c 0.52089,0.16342 1.07003,0.30194 1.22031,0.30782 0.15029,0.006 2.30751,-1.24702 4.79381,-2.78423 z m -65.734879,2.2259 c -0.0045,-0.77529 -0.545683,-7.21472 -0.611906,-7.28094 -0.04489,-0.0449 -2.225412,0.97827 -4.845625,2.27367 l -4.764031,2.35526 4.892553,1.41743 c 2.69091,0.77959 4.991045,1.42553 5.11141,1.43543 0.120383,0.01 0.218293,-0.0805 0.217599,-0.20085 z m 59.813829,-1.04258 0.65424,-0.38599 -0.60046,-0.153 c -0.33024,-0.0841 -7.84188,-2.03771 -16.69251,-4.34125 -8.85063,-2.30355 -16.217289,-4.18498 -16.370343,-4.18094 -0.259797,0.007 -1.607915,0.66399 -1.416323,0.69038 0.04814,0.006 7.532973,1.97369 16.632959,4.37123 9.099987,2.39753 16.678807,4.36511 16.841817,4.37237 0.16302,0.007 0.5908,-0.16049 0.95062,-0.3728 z m -34.425396,-0.11735 c 0,-1.12199 -0.176528,-1.36533 -1.196264,-1.64916 -0.542871,-0.15111 -1.013823,-0.24794 -1.046574,-0.21519 -0.03272,0.0327 -0.0054,0.42154 0.06112,0.86397 0.11593,0.77309 0.152287,0.8142 0.932319,1.05436 1.092973,0.33651 1.249407,0.32976 1.249407,-0.054 z m 35.620936,-1.78674 0.32151,-1.23958 -1.15585,-1.68579 c -0.63572,-0.92719 -1.11437,-1.72728 -1.06367,-1.77799 0.0507,-0.0507 0.2247,0.0778 0.38662,0.2855 0.16194,0.20774 0.64898,0.46731 1.0823,0.57682 0.43334,0.10953 0.91922,0.23709 1.07976,0.28346 0.22117,0.0638 0.26969,-5.3e-4 0.20024,-0.26617 -0.0833,-0.31851 -0.0409,-0.33595 0.46384,-0.19116 0.30553,0.0876 0.53058,0.0935 0.50011,0.0132 -0.0305,-0.0804 -1.07964,-1.69132 -2.33148,-3.57985 -2.08899,-3.15146 -2.33007,-3.4487 -2.93266,-3.61602 -0.78277,-0.21736 -0.88135,-0.43263 -0.12923,-0.2822 0.49832,0.0997 0.37227,-0.12606 -2.29173,-4.10347 -1.56494,-2.33652 -2.98734,-4.28105 -3.19736,-4.37107 -0.40503,-0.1736 -33.253063,-7.88983 -33.300499,-7.82252 -0.0156,0.022 1.42167,1.92019 3.193808,4.21808 1.772139,2.29789 3.17842,4.22162 3.125079,4.27496 -0.05337,0.0534 -0.125008,0.0641 -0.159264,0.024 -0.03426,-0.0401 -1.538745,-2.00324 -3.343327,-4.36249 l -3.281045,-4.28956 -7.552652,-1.78301 c -4.153966,-0.98065 -7.577047,-1.75861 -7.606868,-1.7288 -0.02984,0.0298 1.190062,1.59108 2.710813,3.46948 1.520761,1.87841 4.327437,5.34658 6.237051,7.70706 2.720351,3.3626 3.611121,4.3489 4.114471,4.55574 0.519055,0.21329 0.565706,0.26726 0.242931,0.28101 -0.354858,0.0151 -0.249052,0.20408 0.946392,1.69038 0.902471,1.12203 1.390163,1.6018 1.480194,1.45612 0.08294,-0.13419 -0.16178,-0.59408 -0.640006,-1.20278 -0.425859,-0.54205 -0.774281,-1.06976 -0.774281,-1.1727 0,-0.11248 0.960608,0.055 2.407402,0.4197 l 2.407402,0.60687 0.915254,1.16695 c 0.503396,0.64182 1.159232,1.44271 1.457433,1.77974 0.29819,0.33703 0.662163,0.78793 0.808843,1.00199 0.146671,0.21406 0.534767,0.43949 0.862437,0.50097 0.327661,0.0615 0.595761,0.18328 0.595761,0.27069 0,0.0874 -0.21091,0.106 -0.468679,0.0413 l -0.468689,-0.11764 0.372969,0.52379 c 0.205132,0.28808 0.487701,0.619 0.627935,0.73539 0.183523,0.15232 33.006395,8.84717 33.737685,8.93718 0.0536,0.006 0.24222,-0.5458 0.41905,-1.22758 z m -29.471717,-13.39176 c -0.818652,-0.22717 -1.650546,-0.57955 -1.882416,-0.79739 -0.809367,-0.76035 -0.990348,-2.55041 -0.437452,-4.32686 0.320566,-1.02998 1.456503,-3.24719 1.759598,-3.43451 0.290926,-0.17981 2.663828,0.46945 2.988181,0.81761 0.24322,0.26106 1.78896,0.6775 6.401996,1.72475 5.68981,1.29171 6.37919,1.47228 6.19143,1.62166 -0.0401,0.0319 -2.74976,-0.55439 -6.021407,-1.30294 -3.271648,-0.74853 -5.962466,-1.34585 -5.979576,-1.32738 -0.01713,0.0185 0.506055,0.76762 1.162603,1.66479 l 1.19374,1.63124 -0.641764,1.2401 c -0.352956,0.68206 -1.001508,1.62224 -1.441214,2.08931 -0.933689,0.99177 -1.090935,1.01085 -3.293719,0.39962 z m 3.03833,-0.52071 c 0.721174,-0.72118 1.911191,-2.97587 1.767829,-3.34946 -0.05391,-0.14055 -0.666131,-1.03847 -1.360432,-1.99536 l -1.262379,-1.73982 -0.746398,1.35743 c -0.410507,0.74659 -0.827766,1.73555 -0.927235,2.1977 -0.683853,3.17749 0.80394,5.25419 2.528615,3.52951 z m -0.958616,-2.86013 c 0,-0.61832 0.388079,-1.01049 0.667159,-0.6742 0.326551,0.39346 0.05021,1.17801 -0.414862,1.17801 -0.16122,0 -0.252297,-0.18186 -0.252297,-0.50381 z m -1.973339,2.67413 c -0.05815,-0.0581 -0.209189,-0.0644 -0.335576,-0.0138 -0.139675,0.0559 -0.09818,0.0974 0.10578,0.10578 0.184568,0.007 0.287977,-0.0337 0.229796,-0.092 z m -0.700333,-0.17509 c -0.05814,-0.0581 -0.209188,-0.0644 -0.335576,-0.0138 -0.139676,0.0559 -0.09819,0.0974 0.10578,0.10577 0.18456,0.007 0.287969,-0.0338 0.229796,-0.092 z m -0.700341,-0.17508 c -0.05815,-0.0582 -0.209189,-0.0644 -0.335577,-0.0138 -0.139666,0.0559 -0.09818,0.0974 0.105789,0.10578 0.18456,0.007 0.287969,-0.0338 0.229788,-0.092 z m 1.526881,-0.045 c -0.240804,-0.21829 -2.354881,-0.71104 -2.354881,-0.54887 0,0.0752 0.453029,0.25551 1.006736,0.40077 1.200158,0.31487 1.577887,0.35636 1.348145,0.1481 z m -0.07879,-0.5428 c 0,-0.16674 -0.771071,-0.42181 -1.935459,-0.64024 -0.95244,-0.17866 -0.410957,0.21625 0.709871,0.51773 1.206585,0.32455 1.225588,0.32645 1.225588,0.12251 z m -0.217247,-0.74605 c -0.07951,-0.23861 -2.013338,-0.76524 -2.183853,-0.59474 -0.173643,0.17366 0.0393,0.29684 0.941839,0.54486 1.097101,0.30148 1.328979,0.31079 1.242014,0.0499 z m 0.167468,-0.77467 c 0.03281,-0.0984 -0.395596,-0.28081 -0.952017,-0.40532 -0.55642,-0.12451 -1.110155,-0.26415 -1.23052,-0.31032 -0.120365,-0.0462 -0.218852,0.0342 -0.218852,0.17853 0,0.17232 0.345843,0.3529 1.006728,0.52567 1.088996,0.28469 1.302998,0.28644 1.394661,0.0114 z m 0.04976,-0.66784 c 0,-0.42331 -2.251968,-0.91244 -2.392401,-0.51963 -0.03723,0.10428 0.420396,0.30924 1.031375,0.46188 1.426176,0.3563 1.361026,0.35353 1.361026,0.0578 z m 0.123368,-0.99066 c -0.497148,-0.2676 -2.115404,-0.50822 -2.284008,-0.33962 -0.199659,0.19966 -0.112954,0.2393 1.285222,0.58759 0.673784,0.16785 1.000003,0.18368 1.086329,0.0527 0.06788,-0.10294 0.02849,-0.23826 -0.08753,-0.30069 z m 0.401889,-0.50097 c 0,-0.0945 -0.216671,-0.22029 -0.48149,-0.27961 -0.26481,-0.0593 -0.757234,-0.17858 -1.09427,-0.26498 -0.807429,-0.20703 -0.918166,-0.19978 -0.8334,0.0545 0.1292,0.38758 2.40916,0.85136 2.40916,0.49006 z m 0.697033,-1.39746 0.526987,-1.04396 -0.665319,-0.17916 c -1.707024,-0.45965 -1.647049,-0.47595 -2.202343,0.59856 -0.278079,0.53807 -0.475052,1.00446 -0.437713,1.03641 0.03732,0.032 0.540608,0.17944 1.118394,0.32774 0.577767,0.14828 1.069065,0.27744 1.091747,0.28699 0.02272,0.01 0.278394,-0.45241 0.568247,-1.02658 z m 28.618174,20.8101 c -0.15279,-0.24721 -0.42638,-0.18279 -0.42638,0.10039 0,0.15619 0.10271,0.21771 0.26162,0.15674 0.1439,-0.0552 0.21803,-0.17093 0.16476,-0.25713 z m -38.73222,-0.44724 c -0.08276,-0.43291 -0.105238,-0.44339 -0.320277,-0.14929 -0.253568,0.34678 -0.174536,0.61486 0.18127,0.61486 0.152439,0 0.198514,-0.15429 0.139007,-0.46557 z m 39.70537,0.0285 c 0.36446,-0.18846 0.62849,-0.21573 0.94048,-0.0971 0.38822,0.1476 0.45359,0.10802 0.62263,-0.3769 0.10388,-0.29798 0.18888,-0.59629 0.18888,-0.66289 0,-0.0666 -0.45303,-0.22246 -1.00674,-0.34636 -0.5537,-0.1239 -1.09612,-0.25955 -1.20539,-0.30146 -0.11123,-0.0426 -0.3231,0.28905 -0.48147,0.75383 -0.35235,1.03406 -0.35154,1.07421 0.0235,1.17224 0.16851,0.044 0.33,0.0892 0.35885,0.10038 0.0289,0.0112 0.28049,-0.0976 0.55919,-0.24173 z m -41.00076,-0.35169 c -0.136899,-0.30046 -0.425291,-0.49679 -0.915434,-0.62321 -0.393569,-0.10152 -0.8701,-0.22986 -1.05896,-0.28522 -0.324136,-0.095 -0.328022,-0.0773 -0.06941,0.3168 0.153351,0.23369 0.6514,0.54619 1.131258,0.70984 1.138191,0.38816 1.142978,0.38755 0.912541,-0.11821 z m 7.208332,-1.18087 c -9.01e-4,-0.89074 -0.05039,-1.79863 -0.109025,-2.01752 l -0.106626,-0.39799 -0.81017,0.46606 c -0.445601,0.25633 -0.959174,0.593 -1.141291,0.74816 -0.41231,0.35126 -0.973039,1.54764 -0.978168,2.08703 -0.0054,0.52799 0.288418,0.33992 0.429022,-0.27497 0.147762,-0.64614 0.685756,-1.26734 1.097597,-1.26734 0.463217,0 0.8097,0.71039 0.665878,1.36522 -0.08997,0.4094 -0.0439,0.57366 0.200381,0.71577 0.683863,0.3978 0.75489,0.26333 0.752402,-1.42442 z m -6.457327,1.31312 c 0.0101,-0.0722 0.03308,-0.62452 0.05111,-1.22733 0.03336,-1.11872 0.03975,-1.13004 1.02162,-1.80733 0.08131,-0.0562 0.576694,-1.4654 1.100806,-3.13177 l 0.952919,-3.02975 -1.588237,-1.98943 c -0.873534,-1.0942 -1.613063,-1.98945 -1.643389,-1.98945 -0.173499,0 -1.18257,3.23407 -1.410698,4.52129 -0.528953,2.98453 -0.192259,6.28686 0.825629,8.09793 0.358013,0.63702 0.646397,0.86923 0.690263,0.55584 z m 2.958035,-0.22319 c 0,-0.37698 -0.395741,-0.59015 -1.46952,-0.79158 -0.54581,-0.1024 -0.631487,-0.0732 -0.631487,0.21521 0,0.25759 0.229607,0.3965 1.006737,0.60905 0.553698,0.15145 1.026434,0.28581 1.050503,0.29858 0.02407,0.0128 0.04372,-0.13628 0.04372,-0.33126 z m 2.086412,0.29159 c -0.206268,-0.17789 -1.054569,-0.28402 -0.952702,-0.11919 0.06184,0.10015 0.317997,0.1821 0.569104,0.1821 0.251108,0 0.423732,-0.0283 0.383598,-0.0629 z m 38.853378,-1.17017 c 0.96193,-0.58189 1.78932,-1.16315 1.83864,-1.29168 0.0795,-0.20716 -1.34228,-2.55267 -1.54734,-2.55267 -0.11187,0 -1.06221,1.90148 -1.50962,3.02052 -0.42041,1.05145 -0.68162,1.88183 -0.59199,1.88183 0.0337,0 0.84838,-0.4761 1.81031,-1.058 z m -38.759993,0.73044 c -0.257058,-0.23565 -1.129293,-0.40032 -1.129293,-0.21321 0,0.0914 0.177276,0.20039 0.393937,0.24212 0.713134,0.13735 0.908359,0.12968 0.735356,-0.0289 z m 0.0963,-0.44319 c 0,-0.0387 -0.236359,-0.15281 -0.525248,-0.25351 -0.288897,-0.10071 -0.525256,-0.11419 -0.525256,-0.03 0,0.0842 0.137882,0.18916 0.306404,0.2332 0.428717,0.11204 0.7441,0.13335 0.7441,0.0503 z m -6.478107,-0.16608 c 0,-0.0337 -0.08258,-0.29819 -0.183415,-0.58758 -0.14274,-0.40945 -0.346628,-0.57307 -0.919195,-0.73762 -0.404673,-0.11631 -0.867277,-0.24913 -1.028019,-0.29516 -0.256832,-0.0736 -0.269768,-0.0104 -0.106718,0.52084 0.161573,0.52644 0.301085,0.63863 1.080127,0.86861 0.974409,0.28763 1.15722,0.32411 1.15722,0.23091 z m 4.450029,-0.22627 c 0.140658,-0.36656 0.189987,-0.33482 -1.002914,-0.64539 -0.891257,-0.23203 -1.029724,-0.2331 -1.115906,-0.008 -0.133275,0.34732 0.01794,0.46907 0.876256,0.70557 1.014859,0.2796 1.117078,0.27536 1.242564,-0.0517 z m -2.524099,-0.13969 c 0,-0.0425 -0.07879,-0.12591 -0.175084,-0.18542 -0.0963,-0.0595 -0.175086,-0.0247 -0.175086,0.0772 0,0.10198 0.07879,0.18542 0.175086,0.18542 0.0963,0 0.175084,-0.0347 0.175084,-0.0773 z m 4.504759,-0.0286 c -0.05815,-0.0581 -0.209189,-0.0644 -0.335576,-0.0138 -0.139676,0.0559 -0.09818,0.0974 0.10578,0.10578 0.184569,0.007 0.287978,-0.0338 0.229796,-0.092 z m 37.137091,-0.34017 c 0.34891,-0.76577 0.25616,-0.89573 -0.78898,-1.10564 -1.37113,-0.27535 -1.40047,-0.26893 -1.61775,0.35439 -0.10616,0.30451 -0.17271,0.57394 -0.1479,0.59875 0.061,0.061 1.92127,0.56257 2.16069,0.58255 0.10491,0.009 0.28218,-0.18477 0.39394,-0.43005 z m -2.70766,-0.8311 c 0.20669,-0.50266 0.22129,-0.68157 0.06,-0.73546 -0.59043,-0.19726 -1.74413,-0.45425 -1.79789,-0.40049 -0.0337,0.0337 0.23036,0.50739 0.58669,1.05274 0.35634,0.54536 0.69968,0.93663 0.76296,0.86951 0.0633,-0.0672 0.23799,-0.42096 0.38823,-0.7863 z m -36.045316,0.38859 c 0,-0.34609 -1.77944,-0.81626 -2.053202,-0.5425 -0.26938,0.26938 -0.136024,0.36917 0.856569,0.64094 0.97065,0.26575 1.196633,0.24716 1.196633,-0.0984 z m -21.256527,-2.21519 c 2.386966,-1.22552 4.31195,-2.25621 4.277721,-2.29044 -0.03417,-0.0343 -0.443132,-0.16173 -0.908691,-0.28333 l -0.846472,-0.2211 -3.632991,1.81201 -3.632991,1.81202 v 0.69954 c 0,0.41124 0.08312,0.69954 0.201733,0.69954 0.110954,0 2.154717,-1.00271 4.541691,-2.22824 z m 15.8328,1.2215 c -0.06743,-0.36111 -0.146851,-0.68125 -0.176456,-0.71141 -0.09312,-0.0949 -1.909424,-0.54776 -1.966803,-0.49038 -0.03002,0.03 0.009,0.35894 0.08582,0.73084 0.127965,0.6159 0.210162,0.69477 0.921943,0.88466 1.253048,0.33429 1.273809,0.32672 1.135504,-0.41371 z m 5.92047,0.31043 c -0.250684,-0.22493 -1.81714,-0.54546 -2.028213,-0.41501 -0.110206,0.0682 0.268073,0.25309 0.84063,0.41106 1.003374,0.27681 1.493481,0.27846 1.187583,0.004 z m 38.734963,-0.15821 c -0.13078,-0.21162 -0.96431,-0.35635 -1.06974,-0.18576 -0.0878,0.14211 0.28795,0.28369 0.84831,0.31963 0.17419,0.0112 0.27384,-0.0491 0.22143,-0.13387 z m -36.868071,-0.90325 c 0,-0.0617 -0.423921,-0.21393 -0.942064,-0.33824 -0.888174,-0.21307 -0.984515,-0.20215 -1.684478,0.1909 l -0.742433,0.41689 0.938883,0.28358 c 0.901524,0.2723 0.968568,0.26916 1.684497,-0.0787 0.410082,-0.19923 0.745595,-0.41274 0.745595,-0.47447 z m 35.032861,0.46402 c -0.22587,-0.27217 -1.11322,-0.4991 -0.95584,-0.24445 0.10046,0.16255 0.71883,0.4558 1.00496,0.47659 0.084,0.006 0.0619,-0.0984 -0.0491,-0.23214 z m -38.344781,-0.85104 c -0.0081,-0.0722 -0.01469,-0.57777 -0.01469,-1.12345 0,-0.54568 -0.03119,-0.95932 -0.06941,-0.9192 -0.03822,0.0401 -0.270245,0.72974 -0.5157,1.53248 l -0.446278,1.4595 0.530368,-0.40901 c 0.291701,-0.22495 0.523768,-0.4681 0.5157,-0.54032 z m 39.794901,0.52525 c -0.0716,-0.12036 -1.13433,-1.7257 -2.36158,-3.56741 -2.09826,-3.14881 -2.26972,-3.35574 -2.87443,-3.46919 -0.35369,-0.0663 -0.67399,-0.0897 -0.7118,-0.0519 -0.0378,0.0378 0.9748,1.61825 2.25021,3.51214 1.87773,2.78827 2.41887,3.47389 2.84419,3.60354 0.76486,0.23316 1.00377,0.22556 0.85341,-0.0271 z m -0.61637,-5.76063 c -1.4844,-2.2916 -2.40468,-3.55616 -2.52053,-3.46346 -0.10037,0.0803 -0.40951,0.621 -0.68699,1.20155 l -0.50449,1.05555 2.42007,3.63128 2.42009,3.63129 0.60494,-1.22336 0.60495,-1.22337 z m -43.838632,4.62259 c -0.166377,-1.00115 -0.189744,-1.03707 -0.746696,-1.14847 -0.285931,-0.0571 -0.726033,-0.15571 -0.978015,-0.21896 -0.444151,-0.11147 -0.458133,-0.0905 -0.458133,0.68658 v 0.80156 l 0.831652,0.25573 c 1.361108,0.41854 1.477904,0.386 1.351192,-0.37644 z m 5.421969,0.28805 c -0.152774,-0.24721 -0.426373,-0.18279 -0.426373,0.10039 0,0.15619 0.102706,0.21772 0.261628,0.15674 0.143885,-0.0552 0.218022,-0.17093 0.164745,-0.25713 z m 0.555321,-0.43369 c -0.05842,-0.15231 -0.106267,-0.45828 -0.106267,-0.67992 0,-0.30047 -0.122484,-0.42651 -0.48148,-0.49547 -0.612394,-0.11764 -0.634399,-0.0891 -0.496716,0.64488 0.10944,0.58333 0.197488,0.64962 1.040696,0.78362 0.08248,0.0131 0.102219,-0.10078 0.04372,-0.25311 z m -5.990316,-1.40067 c 0.05842,-0.15232 0.106275,-0.53528 0.106275,-0.85102 0,-0.54823 -0.04489,-0.58684 -0.995865,-0.85737 -0.547729,-0.15582 -1.026812,-0.25235 -1.064639,-0.21453 -0.03786,0.0379 -0.08212,0.44431 -0.09841,0.90331 l -0.02966,0.83455 0.787885,0.21381 c 1.074068,0.29149 1.172347,0.2893 1.294399,-0.0288 z m 5.584622,-0.61999 c 0.405423,-0.20443 0.764519,-0.39597 0.798009,-0.42563 0.03345,-0.0297 -0.161753,-0.33295 -0.433838,-0.67394 -0.272093,-0.341 -0.548387,-0.5631 -0.613997,-0.49356 -0.158093,0.16755 -0.681664,1.96482 -0.572386,1.96482 0.04679,0 0.41679,-0.16726 0.822212,-0.37169 z m -16.443597,-0.10979 c 0.04877,-0.16852 0.140775,-0.82652 0.204492,-1.46224 l 0.115867,-1.15583 -1.044445,-0.26309 -1.044455,-0.2631 -0.198613,1.40447 c -0.109242,0.77245 -0.165954,1.43713 -0.126027,1.47706 0.06581,0.0658 1.599044,0.516 1.88503,0.55346 0.06572,0.009 0.1594,-0.12222 0.208151,-0.29073 z m 4.838657,-2.05792 c 2.406664,-1.20407 4.375757,-2.26025 4.375757,-2.34706 0,-0.11961 -0.791589,-1.16456 -1.312294,-1.7323 -0.02677,-0.0292 -1.667007,0.75487 -3.644917,1.74243 -3.355578,1.67541 -3.602331,1.83126 -3.687756,2.32921 -0.232293,1.35397 -0.314905,2.19695 -0.215309,2.19695 0.05986,0 2.077866,-0.98516 4.484519,-2.18923 z m 6.382478,0.15972 c 0.06635,-0.44216 0.09495,-0.82886 0.06364,-0.85934 -0.03128,-0.0305 -0.50528,-0.17213 -1.05328,-0.31479 l -0.99637,-0.25939 -0.189076,0.88165 c -0.103995,0.4849 -0.167748,0.8991 -0.141677,0.92043 0.106555,0.0872 1.474425,0.40044 1.822134,0.41726 0.314175,0.0152 0.393361,-0.1106 0.494615,-0.78582 z m -7.119239,-2.69318 c 3.19105,-1.5676 3.536344,-1.77922 3.379928,-2.07148 -0.446485,-0.83426 -0.477866,-0.82613 -4.719806,1.22422 -2.228954,1.07737 -4.052639,2.01168 -4.052639,2.07623 0,0.0997 1.106233,0.42968 1.663293,0.49611 0.0963,0.0115 1.774455,-0.76479 3.729224,-1.72508 z m 7.609851,0.73953 c 0.239857,-0.82564 0.238307,-0.83311 -0.214172,-1.03539 -0.250684,-0.11206 -0.737727,-0.25663 -1.082317,-0.32127 l -0.626529,-0.11754 -0.207502,0.82405 c -0.114119,0.45323 -0.184254,0.8463 -0.155848,0.87347 0.05923,0.0566 1.740613,0.5777 1.923632,0.59614 0.06662,0.006 0.229858,-0.36205 0.362736,-0.81946 z m 39.696356,-1.09114 c 0.32526,-0.67235 0.55715,-1.25146 0.51531,-1.28691 -0.0418,-0.0355 -0.41062,-0.14658 -0.81948,-0.24696 l -0.74341,-0.18251 -0.66876,1.27627 -0.66877,1.27626 0.71184,0.17213 c 0.3915,0.0947 0.7951,0.18159 0.89686,0.19316 0.10177,0.0115 0.45116,-0.52909 0.77641,-1.20144 z m -1.85458,-0.66827 0.59946,-1.19039 -2.85805,-4.3417 -2.85807,-4.34169 -0.68948,1.24861 -0.68949,1.24861 2.86707,4.28347 c 1.57689,2.35591 2.90352,4.28349 2.94807,4.28349 0.0445,0 0.35078,-0.53568 0.68049,-1.1904 z m -37.207322,0.0257 c 0.255614,-0.56101 0.173389,-0.64467 -0.923945,-0.94012 -0.785325,-0.21144 -0.875806,-0.20357 -1.094271,0.0952 -0.432909,0.59205 -0.29134,0.89656 0.505955,1.08829 1.149351,0.27638 1.28543,0.25448 1.512261,-0.24337 z m -2.453,-0.69632 c 0.231032,-0.50706 0.175149,-0.63737 -0.288014,-0.67149 -0.170163,-0.0125 -0.386788,-0.066 -0.481399,-0.11883 -0.0946,-0.0528 -0.314842,-0.14699 -0.489422,-0.2093 -0.271616,-0.0969 -0.258995,-0.0351 0.08753,0.42875 0.222729,0.29811 0.483347,0.65209 0.579156,0.78661 0.246862,0.34664 0.353623,0.30774 0.592137,-0.21574 z m -4.55305,-3.0369 c -0.132112,-0.19015 -1.382636,-1.75676 -2.778929,-3.48135 -2.078398,-2.56708 -2.633953,-3.15142 -3.063968,-3.22274 -0.288888,-0.048 -0.541942,-0.0732 -0.562352,-0.0562 -0.02037,0.017 1.176512,1.52434 2.659826,3.34961 2.534699,3.11904 3.161787,3.74753 3.745423,3.7538 0.203554,0.002 0.203554,-0.0501 0,-0.34314 z m 38.189182,-5.07874 c 0.32526,-0.67235 0.55715,-1.25284 0.5153,-1.28996 -0.0418,-0.0371 -7.52152,-1.77577 -16.621497,-3.86365 -9.099989,-2.08788 -16.641869,-3.82839 -16.759756,-3.86778 -0.243976,-0.0816 -1.552979,2.14148 -1.372196,2.33034 0.131391,0.13727 32.723429,7.86844 33.286639,7.89593 0.27901,0.0136 0.49332,-0.25775 0.95151,-1.20488 z m -44.048179,-2.19168 c -0.291864,-0.44545 -0.59669,-0.57962 -0.59669,-0.26263 0,0.0963 -0.0045,0.23418 -0.01037,0.30639 -0.0063,0.0722 0.171587,0.18255 0.393938,0.24518 0.22235,0.0626 0.425787,0.12172 0.452074,0.13131 0.02623,0.01 -0.08122,-0.17951 -0.238982,-0.42025 z m 9.984539,-5.69176 c 0.469923,-0.89424 0.582662,-1.24865 0.415636,-1.30655 -0.438696,-0.15206 -14.8399,-3.41917 -15.062395,-3.4171 -0.265937,0.003 -1.443855,2.07511 -1.275648,2.2446 0.08402,0.0846 14.339444,3.55075 15.167958,3.68801 0.06031,0.01 0.399797,-0.53404 0.754449,-1.20896 z"
     id="path3409" />
</svg>
