{
    "num_of_ball": 35,
    "items": [
        {
            "type": "brick",
            "data": {
                "row": 2,
                "col": 2,
                "x": 100,
                "y": 180,
                "weight": 10,
                "size": 38
            }
        },
        {
            "type": "brick",
            "data": {
                "row": 2,
                "col": 6,
                "x": 260,
                "y": 180,
                "weight": 10,
                "size": 38
            }
        },
        {
            "type": "brick",
            "data": {
                "row": 3,
                "col": 3,
                "x": 140,
                "y": 220,
                "weight": 10,
                "size": 38
            }
        },
        {
            "type": "brick",
            "data": {
                "row": 3,
                "col": 4,
                "x": 180,
                "y": 220,
                "weight": 10,
                "size": 38
            }
        },
        {
            "type": "brick",
            "data": {
                "row": 3,
                "col": 5,
                "x": 220,
                "y": 220,
                "weight": 10,
                "size": 38
            }
        },
        {
            "type": "brick",
            "data": {
                "row": 5,
                "col": 4,
                "x": 180,
                "y": 300,
                "weight": 30,
                "size": 38
            }
        },
        {
            "type": "brick",
            "data": {
                "row": 1,
                "col": 3,
                "x": 140,
                "y": 140,
                "weight": 32,
                "size": 38
            }
        },
        {
            "type": "brick",
            "data": {
                "row": 1,
                "col": 5,
                "x": 220,
                "y": 140,
                "weight": 32,
                "size": 38
            }
        },
        {
            "type": "brick",
            "data": {
                "row": 1,
                "col": 4,
                "x": 180,
                "y": 140,
                "weight": 36,
                "size": 38
            }
        },
        {
            "type": "brick",
            "data": {
                "row": 2,
                "col": 5,
                "x": 220,
                "y": 180,
                "weight": 37,
                "size": 38
            }
        },
        {
            "type": "brick",
            "data": {
                "row": 2,
                "col": 3,
                "x": 140,
                "y": 180,
                "weight": 37,
                "size": 38
            }
        },
        {
            "type": "brick",
            "data": {
                "row": 0,
                "col": 4,
                "x": 180,
                "y": 100,
                "weight": 39,
                "size": 38
            }
        },
        {
            "type": "item",
            "data": {
                "row": 2,
                "col": 4,
                "x": 180,
                "y": 180,
                "work": "row",
                "size": 38,
                "child": "item_row",
                "hasBoundingCircle": true
            }
        },
        {
            "type": "item",
            "data": {
                "row": 4,
                "col": 4,
                "x": 180,
                "y": 260,
                "work": "col",
                "size": 38,
                "child": "item_col",
                "hasBoundingCircle": true
            }
        },
        {
            "type": "item",
            "data": {
                "row": 2,
                "col": 1,
                "x": 60,
                "y": 180,
                "work": "ball",
                "size": 38,
                "child": "ball",
                "hasBoundingCircle": true
            }
        },
        {
            "type": "item",
            "data": {
                "row": 3,
                "col": 2,
                "x": 100,
                "y": 220,
                "work": "ball",
                "size": 38,
                "child": "ball",
                "hasBoundingCircle": true
            }
        },
        {
            "type": "item",
            "data": {
                "row": 2,
                "col": 7,
                "x": 300,
                "y": 180,
                "work": "ball",
                "size": 38,
                "child": "ball",
                "hasBoundingCircle": true
            }
        },
        {
            "type": "item",
            "data": {
                "row": 3,
                "col": 6,
                "x": 260,
                "y": 220,
                "work": "ball",
                "size": 38,
                "child": "ball",
                "hasBoundingCircle": true
            }
        }
    ]
}