{
  "name": "manga",
  "$schema": "../../node_modules/nx/schemas/project-schema.json",
  "projectType": "application",
  "prefix": "moe",
  "generators": {
    "@schematics/angular:component": {
      "style": "scss",
      "skipTests": true
    },
    "@schematics/angular:class": {
      "skipTests": true
    },
    "@schematics/angular:directive": {
      "skipTests": true
    },
    "@schematics/angular:guard": {
      "skipTests": true
    },
    "@schematics/angular:interceptor": {
      "skipTests": true
    },
    "@schematics/angular:pipe": {
      "skipTests": true
    },
    "@schematics/angular:resolver": {
      "skipTests": true
    },
    "@schematics/angular:service": {
      "skipTests": true
    }
  },
  "sourceRoot": "apps/manga/src",
  "tags": [],
  "targets": {
    "build": {
      "executor": "@angular-devkit/build-angular:application",
      "outputs": [
        "{options.outputPath}"
      ],
      "options": {
        "outputPath": "dist/apps/manga",
        "index": "apps/manga/src/index.html",
        "browser": "apps/manga/src/main.ts",
        "polyfills": [
          "zone.js"
        ],
        "tsConfig": "apps/manga/tsconfig.app.json",
        "inlineStyleLanguage": "scss",
        "assets": [
          {
            "glob": "**/*",
            "input": "apps/manga/public"
          }
        ],
        "styles": [
          "apps/manga/src/styles.scss"
        ],
        "scripts": [],
        "server": "apps/manga/src/main.server.ts",
        "ssr": {
          "entry": "apps/manga/src/server.ts"
        },
        "outputMode": "server"
      },
      "configurations": {
        "production": {
          "budgets": [
            {
              "type": "initial",
              "maximumWarning": "1.5mb",
              "maximumError": "2mb"
            },
            {
              "type": "anyComponentStyle",
              "maximumWarning": "4kb",
              "maximumError": "8kb"
            }
          ],
          "outputHashing": "all",
          "fileReplacements": [
            {
              "replace": "apps/manga/src/environments/environment.ts",
              "with": "apps/manga/src/environments/environment.production.ts"
            }
          ]
        },
        "development": {
          "optimization": false,
          "extractLicenses": false,
          "sourceMap": true,
          "fileReplacements": [
            {
              "replace": "apps/manga/src/environments/environment.ts",
              "with": "apps/manga/src/environments/environment.development.ts"
            }
          ]
        }
      },
      "defaultConfiguration": "production"
    },
    "serve": {
      "executor": "@angular-devkit/build-angular:dev-server",
      "configurations": {
        "production": {
          "buildTarget": "manga:build:production"
        },
        "development": {
          "buildTarget": "manga:build:development"
        }
      },
      "defaultConfiguration": "development"
    },
    "lint": {
      "executor": "@nx/eslint:lint"
    },
    "test": {
      "executor": "@nx/jest:jest",
      "outputs": [
        "{workspaceRoot}/coverage/{projectRoot}"
      ],
      "options": {
        "jestConfig": "apps/manga/jest.config.ts"
      }
    }
  }
}
