# compile vhdl design source files
vhdl xil_defaultlib  \
"../../../../vhdl-m806-final-project.srcs/sources_1/imports/new/ADDER_n.vhd" \
"../../../../vhdl-m806-final-project.srcs/sources_1/new/ADD_SUB_n.vhd" \
"../../../../vhdl-m806-final-project.srcs/sources_1/new/ALU_32_SC.vhd" \
"../../../../vhdl-m806-final-project.srcs/sources_1/new/AND_A_B_n.vhd" \
"../../../../vhdl-m806-final-project.srcs/sources_1/new/AND_OR_n.vhd" \
"../../../../vhdl-m806-final-project.srcs/sources_1/new/AND_n.vhd" \
"../../../../vhdl-m806-final-project.srcs/sources_1/new/ASR_A_B_n.vhd" \
"../../../../vhdl-m806-final-project.srcs/sources_1/new/ASR_ROR_n.vhd" \
"../../../../vhdl-m806-final-project.srcs/sources_1/new/CONTROL_UNIT_n.vhd" \
"../../../../vhdl-m806-final-project.srcs/sources_1/new/DATAPATH_SC_n.vhd" \
"../../../../vhdl-m806-final-project.srcs/sources_1/new/EXTEND_IMMEDIATE_SC.vhd" \
"../../../../vhdl-m806-final-project.srcs/sources_1/new/EXTEND_n_m.vhd" \
"../../../../vhdl-m806-final-project.srcs/sources_1/new/INSTR_DEC.vhd" \
"../../../../vhdl-m806-final-project.srcs/sources_1/new/LSL_A_B_n.vhd" \
"../../../../vhdl-m806-final-project.srcs/sources_1/new/LSL_LSR_n.vhd" \
"../../../../vhdl-m806-final-project.srcs/sources_1/new/LSR_A_B_n.vhd" \
"../../../../vhdl-m806-final-project.srcs/sources_1/new/MOV_MVN_n.vhd" \
"../../../../vhdl-m806-final-project.srcs/sources_1/new/MUX_2_to_1_n.vhd" \
"../../../../vhdl-m806-final-project.srcs/sources_1/new/MVN_n.vhd" \
"../../../../vhdl-m806-final-project.srcs/sources_1/new/NOR_n.vhd" \
"../../../../vhdl-m806-final-project.srcs/sources_1/new/OR_A_B_n.vhd" \
"../../../../vhdl-m806-final-project.srcs/sources_1/imports/new/PATTERN_FSM.vhd" \
"../../../../vhdl-m806-final-project.srcs/sources_1/new/RAM_ARRAY.vhd" \
"../../../../vhdl-m806-final-project.srcs/sources_1/new/REGISTER_FILE_n.vhd" \
"../../../../vhdl-m806-final-project.srcs/sources_1/new/REGISTER_FILE_wR15.vhd" \
"../../../../vhdl-m806-final-project.srcs/sources_1/new/REG_n.vhd" \
"../../../../vhdl-m806-final-project.srcs/sources_1/imports/new/REGrwe_n.vhd" \
"../../../../vhdl-m806-final-project.srcs/sources_1/new/ROM_ARRAY.vhd" \
"../../../../vhdl-m806-final-project.srcs/sources_1/new/ROR_A_B_n.vhd" \
"../../../../vhdl-m806-final-project.srcs/sources_1/new/SUBTRACTOR_n.vhd" \
"../../../../vhdl-m806-final-project.srcs/sources_1/new/WEN_LOGIC.vhd" \
"../../../../vhdl-m806-final-project.srcs/sources_1/new/XOR_A_B_n.vhd" \
"../../../../vhdl-m806-final-project.srcs/sources_1/new/XOR_n.vhd" \
"../../../../vhdl-m806-final-project.srcs/sources_1/new/PC_LOGIC.vhd" \
"../../../../vhdl-m806-final-project.srcs/sources_1/new/COND_LOGIC.vhd" \
"../../../../vhdl-m806-final-project.srcs/sources_1/new/ARM_PROCESSOR_n.vhd" \
"../../../../vhdl-m806-final-project.srcs/sources_1/new/ALU_REGWE_n.vhd" \
"../../../../vhdl-m806-final-project.srcs/sources_1/imports/new/ADDER_REG_8.vhd" \
"../../../../vhdl-m806-final-project.srcs/sim_1/new/INSTR_DEC_n_TB.vhd" \
"../../../../vhdl-m806-final-project.srcs/sim_1/new/ASR_A_B_n_TB.vhd" \
"../../../../vhdl-m806-final-project.srcs/sim_1/new/XOR_A_B_n_TB.vhd" \
"../../../../vhdl-m806-final-project.srcs/sim_1/new/OR_A_B_n_TB.vhd" \
"../../../../vhdl-m806-final-project.srcs/sim_1/new/AND_A_B_n_TB.vhd" \
"../../../../vhdl-m806-final-project.srcs/sim_1/new/EXTEND_IMMEDIATE_SC_TB.vhd" \
"../../../../vhdl-m806-final-project.srcs/sim_1/new/EXTEND_n_m_TB.vhd" \
"../../../../vhdl-m806-final-project.srcs/sim_1/new/WEN_LOGIC_TB.vhd" \
"../../../../vhdl-m806-final-project.srcs/sim_1/new/PC_LOGIC_TB.vhd" \
"../../../../vhdl-m806-final-project.srcs/sim_1/new/COND_LOGIC_TB.vhd" \
"../../../../vhdl-m806-final-project.srcs/sim_1/new/ALU_TB.vhd" \
"../../../../vhdl-m806-final-project.srcs/sim_1/new/NOR_n_TB.vhd" \
"../../../../vhdl-m806-final-project.srcs/sim_1/new/ROM_ARRAY_TB.vhd" \
"../../../../vhdl-m806-final-project.srcs/sim_1/new/CONTROL_UNIT_TB.vhd" \

# Do not sort compile order
nosort
