# compile vhdl design source files
vhdl xil_defaultlib  \
"CONTROL_UNIT_TB_func_synth.vhd" \
"../../../../../vhdl-m806-final-project.srcs/sim_1/new/INSTR_DEC_n_TB.vhd" \
"../../../../../vhdl-m806-final-project.srcs/sim_1/new/ASR_A_B_n_TB.vhd" \
"../../../../../vhdl-m806-final-project.srcs/sim_1/new/XOR_A_B_n_TB.vhd" \
"../../../../../vhdl-m806-final-project.srcs/sim_1/new/OR_A_B_n_TB.vhd" \
"../../../../../vhdl-m806-final-project.srcs/sim_1/new/AND_A_B_n_TB.vhd" \
"../../../../../vhdl-m806-final-project.srcs/sim_1/new/EXTEND_IMMEDIATE_SC_TB.vhd" \
"../../../../../vhdl-m806-final-project.srcs/sim_1/new/EXTEND_n_m_TB.vhd" \
"../../../../../vhdl-m806-final-project.srcs/sim_1/new/WEN_LOGIC_TB.vhd" \
"../../../../../vhdl-m806-final-project.srcs/sim_1/new/PC_LOGIC_TB.vhd" \
"../../../../../vhdl-m806-final-project.srcs/sim_1/new/COND_LOGIC_TB.vhd" \
"../../../../../vhdl-m806-final-project.srcs/sim_1/new/ALU_TB.vhd" \
"../../../../../vhdl-m806-final-project.srcs/sim_1/new/NOR_n_TB.vhd" \
"../../../../../vhdl-m806-final-project.srcs/sim_1/new/ROM_ARRAY_TB.vhd" \
"../../../../../vhdl-m806-final-project.srcs/sim_1/new/CONTROL_UNIT_TB.vhd" \
"../../../../../vhdl-m806-final-project.srcs/sim_1/new/ASR_ROR_TB.vhd" \
"../../../../../vhdl-m806-final-project.srcs/sim_1/imports/new/ADDER_REG_TB.vhd" \
"../../../../../vhdl-m806-final-project.srcs/sim_1/new/RF_TB.vhd" \
"../../../../../vhdl-m806-final-project.srcs/sim_1/new/PROCESSOR_TB.vhd" \
"../../../../../vhdl-m806-final-project.srcs/sim_1/new/FSM_TB.vhd" \

# Do not sort compile order
nosort
