\contentsline {section}{\numberline {1}Εισαγωγή}{2}{section.1}%
\contentsline {subsection}{\numberline {1.1}Σκοπός}{2}{subsection.1.1}%
\contentsline {subsection}{\numberline {1.2}Αναμενόμενη συμπεριφορά}{2}{subsection.1.2}%
\contentsline {subsection}{\numberline {1.3}Δομή}{2}{subsection.1.3}%
\contentsline {section}{\numberline {2}Υλοποίηση}{3}{section.2}%
\contentsline {section}{\numberline {3}Επαλήθευση}{3}{section.3}%
\contentsline {subsection}{\numberline {3.1}Assertions}{3}{subsection.3.1}%
\contentsline {subsection}{\numberline {3.2}Testbench}{3}{subsection.3.2}%
\contentsline {subsubsection}{\numberline {3.2.1}Πρώτη και δεύτερη φάση --- 19 κύκλοι}{3}{subsubsection.3.2.1}%
\contentsline {subsubsection}{\numberline {3.2.2}Τρίτη φάση --- 24 κύκλοι}{3}{subsubsection.3.2.2}%
