\relax 
\providecommand\hyper@newdestlabel[2]{}
\providecommand\HyperFirstAtBeginDocument{\AtBeginDocument}
\HyperFirstAtBeginDocument{\ifx\hyper@anchor\@undefined
\global\let\oldcontentsline\contentsline
\gdef\contentsline#1#2#3#4{\oldcontentsline{#1}{#2}{#3}}
\global\let\oldnewlabel\newlabel
\gdef\newlabel#1#2{\newlabelxx{#1}#2}
\gdef\newlabelxx#1#2#3#4#5#6{\oldnewlabel{#1}{{#2}{#3}}}
\AtEndDocument{\ifx\hyper@anchor\@undefined
\let\contentsline\oldcontentsline
\let\newlabel\oldnewlabel
\fi}
\fi}
\global\let\hyper@last\relax 
\gdef\HyperFirstAtBeginDocument#1{#1}
\providecommand*\HyPL@Entry[1]{}
\providecommand*\new@tpo@label[2]{}
\HyPL@Entry{0<</S/D>>}
\providecommand \oddpage@label [2]{}
\@writefile{toc}{\contentsline {section}{\numberline {1}Εισαγωγή}{2}{section.1}\protected@file@percent }
\@writefile{toc}{\contentsline {subsection}{\numberline {1.1}Σκοπός}{2}{subsection.1.1}\protected@file@percent }
\@writefile{toc}{\contentsline {subsection}{\numberline {1.2}Αναμενόμενη συμπεριφορά}{2}{subsection.1.2}\protected@file@percent }
\@writefile{toc}{\contentsline {subsection}{\numberline {1.3}Δομή}{2}{subsection.1.3}\protected@file@percent }
\@writefile{lof}{\contentsline {figure}{\numberline {1}{\ignorespaces Σχηματική απεικόνιση του κυκλώματος του φίλτρου\relax }}{3}{figure.1}\protected@file@percent }
\providecommand*\caption@xref[2]{\@setref\relax\@undefined{#1}}
\newlabel{fig:overview}{{1}{3}{Σχηματική απεικόνιση του κυκλώματος του φίλτρου\relax }{figure.1}{}}
\@writefile{toc}{\contentsline {section}{\numberline {2}Υλοποίηση}{3}{section.2}\protected@file@percent }
\@writefile{toc}{\contentsline {subsection}{\numberline {2.1}Synchronizer}{3}{subsection.2.1}\protected@file@percent }
\@writefile{lof}{\contentsline {figure}{\numberline {2}{\ignorespaces Σχηματικό \texttt  {sync\_stage} σε επίπεδο RTL\relax }}{4}{figure.2}\protected@file@percent }
\newlabel{fig:sync_stage_rtl}{{2}{4}{Σχηματικό \texttt {sync\_stage} σε επίπεδο RTL\relax }{figure.2}{}}
\@writefile{toc}{\contentsline {subsection}{\numberline {2.2}Median filter}{4}{subsection.2.2}\protected@file@percent }
\@writefile{toc}{\contentsline {subsection}{\numberline {2.3}RAM}{5}{subsection.2.3}\protected@file@percent }
\@writefile{toc}{\contentsline {subsection}{\numberline {2.4}FSM Write}{5}{subsection.2.4}\protected@file@percent }
\@writefile{lof}{\contentsline {figure}{\numberline {4}{\ignorespaces Καταστάσεις του FSM Write\relax }}{6}{figure.4}\protected@file@percent }
\newlabel{fig:fsm_wr_draw}{{4}{6}{Καταστάσεις του FSM Write\relax }{figure.4}{}}
\@writefile{toc}{\contentsline {subsection}{\numberline {2.5}FSM Read}{6}{subsection.2.5}\protected@file@percent }
\@writefile{lof}{\contentsline {figure}{\numberline {5}{\ignorespaces Καταστάσεις του FSM Read\relax }}{7}{figure.5}\protected@file@percent }
\newlabel{fig:fsm_rd_draw}{{5}{7}{Καταστάσεις του FSM Read\relax }{figure.5}{}}
\@writefile{lof}{\contentsline {figure}{\numberline {6}{\ignorespaces Αλλαγή των δεδομένων της μνήμης 2 κύκλους και 100 ps αφότου αλλάξει η διεύθυνση ανάγνωσης, απαιτώντας έτσι 3 κύκλους για να αναγνωστούν σωστά\relax }}{8}{figure.6}\protected@file@percent }
\newlabel{fig:tb_bram_read}{{6}{8}{Αλλαγή των δεδομένων της μνήμης 2 κύκλους και 100 ps αφότου αλλάξει η διεύθυνση ανάγνωσης, απαιτώντας έτσι 3 κύκλους για να αναγνωστούν σωστά\relax }{figure.6}{}}
\@writefile{toc}{\contentsline {section}{\numberline {3}Επαλήθευση}{8}{section.3}\protected@file@percent }
\@writefile{toc}{\contentsline {subsection}{\numberline {3.1}Assertions}{8}{subsection.3.1}\protected@file@percent }
\@writefile{toc}{\contentsline {subsubsection}{\numberline {3.1.1}Synchronizer}{8}{subsubsection.3.1.1}\protected@file@percent }
\@writefile{toc}{\contentsline {subsubsection}{\numberline {3.1.2}FSM Write}{8}{subsubsection.3.1.2}\protected@file@percent }
\@writefile{toc}{\contentsline {subsection}{\numberline {3.2}Testbench}{9}{subsection.3.2}\protected@file@percent }
\@writefile{toc}{\contentsline {subsubsection}{\numberline {3.2.1}Πρώτη και δεύτερη φάση --- 19 κύκλοι}{9}{subsubsection.3.2.1}\protected@file@percent }
\@writefile{lof}{\contentsline {figure}{\numberline {7}{\ignorespaces Πρώτη φάση εκτέλεσης του testbench --- Είσοδος, συγχρονισμός δεδομένων και υπολογισμός median τιμής\relax }}{10}{figure.7}\protected@file@percent }
\newlabel{fig:tb_phase_01_marked}{{7}{10}{Πρώτη φάση εκτέλεσης του testbench --- Είσοδος, συγχρονισμός δεδομένων και υπολογισμός median τιμής\relax }{figure.7}{}}
\@writefile{lof}{\contentsline {figure}{\numberline {8}{\ignorespaces Δεύτερη φάση εκτέλεσης του testbench --- Εγγραφή στη RAM από το FSM Write\relax }}{10}{figure.8}\protected@file@percent }
\newlabel{fig:tb_phase_02_marked}{{8}{10}{Δεύτερη φάση εκτέλεσης του testbench --- Εγγραφή στη RAM από το FSM Write\relax }{figure.8}{}}
\@writefile{toc}{\contentsline {subsubsection}{\numberline {3.2.2}Τρίτη φάση --- 24 κύκλοι}{10}{subsubsection.3.2.2}\protected@file@percent }
\@writefile{lof}{\contentsline {figure}{\numberline {9}{\ignorespaces Τρίτη φάση εκτέλεσης του testbench --- Ανάγνωση από τη RAM και υπολογισμός του μέσου όρου\relax }}{11}{figure.9}\protected@file@percent }
\newlabel{fig:tb_phase_03_marked}{{9}{11}{Τρίτη φάση εκτέλεσης του testbench --- Ανάγνωση από τη RAM και υπολογισμός του μέσου όρου\relax }{figure.9}{}}
\@writefile{toc}{\contentsline {subsubsection}{\numberline {3.2.3}Παράλληλες διεργασίες}{11}{subsubsection.3.2.3}\protected@file@percent }
\newlabel{code:tb-median}{{1}{11}{Always block που ελέγχει συνεχόμενα την διάμεση τιμή που υπολογίζεται από το median filter, κατά την εκτέλεση του testbench}{lstlisting.1}{}}
\@writefile{lol}{\contentsline {lstlisting}{\numberline {1}Always block που ελέγχει συνεχόμενα την διάμεση τιμή που υπολογίζεται από το median filter, κατά την εκτέλεση του testbench}{11}{lstlisting.1}\protected@file@percent }
\newlabel{code:tb-avg}{{2}{12}{Always block για τον υπολογισμό του μέσου όρου κατά την εκτέλεση του testbench, με τη χρήση των τιμών που γράφονται στη μνήμη από το FSM Write}{lstlisting.2}{}}
\@writefile{lol}{\contentsline {lstlisting}{\numberline {2}Always block για τον υπολογισμό του μέσου όρου κατά την εκτέλεση του testbench, με τη χρήση των τιμών που γράφονται στη μνήμη από το FSM Write}{12}{lstlisting.2}\protected@file@percent }
\@writefile{toc}{\contentsline {section}{\numberline {4}Ελλείψεις}{12}{section.4}\protected@file@percent }
\@writefile{lof}{\contentsline {figure}{\numberline {10}{\ignorespaces Ενδεχόμενο λάθος στο sync stage\relax }}{13}{figure.10}\protected@file@percent }
\newlabel{fig:tb_sync_error}{{10}{13}{Ενδεχόμενο λάθος στο sync stage\relax }{figure.10}{}}
\@writefile{lof}{\contentsline {figure}{\numberline {3}{\ignorespaces Σχηματικό φίλτρου σε επίπεδο RTL\relax }}{14}{figure.3}\protected@file@percent }
\newlabel{fig:filter_schematic}{{3}{14}{Σχηματικό φίλτρου σε επίπεδο RTL\relax }{figure.3}{}}
\newlabel{LastPage}{{}{14}{}{page.14}{}}
\xdef\lastpage@lastpage{14}
\xdef\lastpage@lastpageHy{14}
