#-----------------------------------------------------------
# Webtalk v2019.2.1 (64-bit)
# SW Build 2729669 on Thu Dec  5 04:48:12 MST 2019
# IP Build 2729494 on Thu Dec  5 07:38:25 MST 2019
# Start of session at: Tue Nov 10 23:16:06 2020
# Process ID: 817758
# Current directory: /home/mpliax/Sync/Documents/CTN_ENG/Classes/M119_MultiProcessing_on_IC/Lab/Lab_exercise2/project_1.sim/sim_1/behav/xsim
# Command line: wbtcv -mode batch -source /home/mpliax/Sync/Documents/CTN_ENG/Classes/M119_MultiProcessing_on_IC/Lab/Lab_exercise2/project_1.sim/sim_1/behav/xsim/xsim.dir/filter_daq_tb_behav/webtalk/xsim_webtalk.tcl -notrace
# Log file: /home/mpliax/Sync/Documents/CTN_ENG/Classes/M119_MultiProcessing_on_IC/Lab/Lab_exercise2/project_1.sim/sim_1/behav/xsim/webtalk.log
# Journal file: /home/mpliax/Sync/Documents/CTN_ENG/Classes/M119_MultiProcessing_on_IC/Lab/Lab_exercise2/project_1.sim/sim_1/behav/xsim/webtalk.jou
#-----------------------------------------------------------
source /home/mpliax/Sync/Documents/CTN_ENG/Classes/M119_MultiProcessing_on_IC/Lab/Lab_exercise2/project_1.sim/sim_1/behav/xsim/xsim.dir/filter_daq_tb_behav/webtalk/xsim_webtalk.tcl -notrace
INFO: [Common 17-186] '/home/mpliax/Sync/Documents/CTN_ENG/Classes/M119_MultiProcessing_on_IC/Lab/Lab_exercise2/project_1.sim/sim_1/behav/xsim/xsim.dir/filter_daq_tb_behav/webtalk/usage_statistics_ext_xsim.xml' has been successfully sent to Xilinx on Tue Nov 10 23:16:10 2020. For additional details about this file, please refer to the WebTalk help file at /opt/Xilinx/Vivado/2019.2/doc/webtalk_introduction.html.
INFO: [Common 17-206] Exiting Webtalk at Tue Nov 10 23:16:10 2020...
