\relax 
\providecommand\hyper@newdestlabel[2]{}
\providecommand\HyperFirstAtBeginDocument{\AtBeginDocument}
\HyperFirstAtBeginDocument{\ifx\hyper@anchor\@undefined
\global\let\oldcontentsline\contentsline
\gdef\contentsline#1#2#3#4{\oldcontentsline{#1}{#2}{#3}}
\global\let\oldnewlabel\newlabel
\gdef\newlabel#1#2{\newlabelxx{#1}#2}
\gdef\newlabelxx#1#2#3#4#5#6{\oldnewlabel{#1}{{#2}{#3}}}
\AtEndDocument{\ifx\hyper@anchor\@undefined
\let\contentsline\oldcontentsline
\let\newlabel\oldnewlabel
\fi}
\fi}
\global\let\hyper@last\relax 
\gdef\HyperFirstAtBeginDocument#1{#1}
\providecommand*\HyPL@Entry[1]{}
\providecommand*\new@tpo@label[2]{}
\HyPL@Entry{0<</S/D>>}
\providecommand \oddpage@label [2]{}
\@writefile{toc}{\contentsline {section}{\numberline {1}Εισαγωγή}{1}{section.1}\protected@file@percent }
\@writefile{lof}{\contentsline {figure}{\numberline {1}{\ignorespaces Σχηματική απεικόνιση του απαριθμητή\relax }}{2}{figure.1}\protected@file@percent }
\providecommand*\caption@xref[2]{\@setref\relax\@undefined{#1}}
\newlabel{fig:counter_sketch}{{1}{2}{Σχηματική απεικόνιση του απαριθμητή\relax }{figure.1}{}}
\@writefile{toc}{\contentsline {section}{\numberline {2}Υλοποίηση}{2}{section.2}\protected@file@percent }
\@writefile{toc}{\contentsline {subsection}{\numberline {2.1}Συμπεριφορά}{2}{subsection.2.1}\protected@file@percent }
\newlabel{code:counter-extra}{{1}{3}{Τμήμα κώδικα για την περιγραφή συμπεριφοράς του απαριθμητή με επιπλέον ελέγχους}{lstlisting.1}{}}
\@writefile{lol}{\contentsline {lstlisting}{\numberline {1}Τμήμα κώδικα για την περιγραφή συμπεριφοράς του απαριθμητή με επιπλέον ελέγχους}{3}{lstlisting.1}\protected@file@percent }
\@writefile{toc}{\contentsline {subsection}{\numberline {2.2}Testbench}{3}{subsection.2.2}\protected@file@percent }
\newlabel{fig:tb_reset}{{4a}{3}{Reset\relax }{subfigure.4.1}{}}
\newlabel{sub@fig:tb_reset}{{a}{3}{Reset\relax }{subfigure.4.1}{}}
\newlabel{fig:tb_count}{{4b}{3}{Counting\relax }{subfigure.4.2}{}}
\newlabel{sub@fig:tb_count}{{b}{3}{Counting\relax }{subfigure.4.2}{}}
\newlabel{fig:tb_over}{{4c}{3}{Overflow\relax }{subfigure.4.3}{}}
\newlabel{sub@fig:tb_over}{{c}{3}{Overflow\relax }{subfigure.4.3}{}}
\newlabel{fig:tb_load}{{4d}{3}{Load value\relax }{subfigure.4.4}{}}
\newlabel{sub@fig:tb_load}{{d}{3}{Load value\relax }{subfigure.4.4}{}}
\@writefile{lof}{\contentsline {figure}{\numberline {4}{\ignorespaces Αποτελέσματα εκτέλεσης testbench\relax }}{3}{figure.4}\protected@file@percent }
\newlabel{fig:tb_cu}{{4}{3}{Αποτελέσματα εκτέλεσης testbench\relax }{figure.4}{}}
\@writefile{lof}{\contentsline {figure}{\numberline {2}{\ignorespaces Σχηματικό απαριθμητή σε επίπεδο RTL\relax }}{4}{figure.2}\protected@file@percent }
\newlabel{fig:counter_schem_01}{{2}{4}{Σχηματικό απαριθμητή σε επίπεδο RTL\relax }{figure.2}{}}
\@writefile{lof}{\contentsline {figure}{\numberline {3}{\ignorespaces Σχηματικό απαριθμητή με επιπλέον ελέγχους σε επίπεδο RTL\relax }}{5}{figure.3}\protected@file@percent }
\newlabel{fig:counter_schem_02}{{3}{5}{Σχηματικό απαριθμητή με επιπλέον ελέγχους σε επίπεδο RTL\relax }{figure.3}{}}
\newlabel{LastPage}{{}{5}{}{page.5}{}}
\xdef\lastpage@lastpage{5}
\xdef\lastpage@lastpageHy{5}
