\contentsline {section}{\numberline {1}Εισαγωγή}{1}{section.1}%
\contentsline {section}{\numberline {2}Υλοποίηση}{2}{section.2}%
\contentsline {subsection}{\numberline {2.1}Συμπεριφορά}{2}{subsection.2.1}%
\contentsline {subsection}{\numberline {2.2}Testbench}{3}{subsection.2.2}%
