%!PS-Adobe-3.0 EPSF-3.0
%%Creator: cairo 1.16.0 (https://cairographics.org)
%%CreationDate: Sun Oct 18 22:18:51 2020
%%Pages: 1
%%DocumentData: Clean7Bit
%%LanguageLevel: 2
%%BoundingBox: 0 0 327 156
%%EndComments
%%BeginProlog
50 dict begin
/q { gsave } bind def
/Q { grestore } bind def
/cm { 6 array astore concat } bind def
/w { setlinewidth } bind def
/J { setlinecap } bind def
/j { setlinejoin } bind def
/M { setmiterlimit } bind def
/d { setdash } bind def
/m { moveto } bind def
/l { lineto } bind def
/c { curveto } bind def
/h { closepath } bind def
/re { exch dup neg 3 1 roll 5 3 roll moveto 0 rlineto
      0 exch rlineto 0 rlineto closepath } bind def
/S { stroke } bind def
/f { fill } bind def
/f* { eofill } bind def
/n { newpath } bind def
/W { clip } bind def
/W* { eoclip } bind def
/BT { } bind def
/ET { } bind def
/BDC { mark 3 1 roll /BDC pdfmark } bind def
/EMC { mark /EMC pdfmark } bind def
/cairo_store_point { /cairo_point_y exch def /cairo_point_x exch def } def
/Tj { show currentpoint cairo_store_point } bind def
/TJ {
  {
    dup
    type /stringtype eq
    { show } { -0.001 mul 0 cairo_font_matrix dtransform rmoveto } ifelse
  } forall
  currentpoint cairo_store_point
} bind def
/cairo_selectfont { cairo_font_matrix aload pop pop pop 0 0 6 array astore
    cairo_font exch selectfont cairo_point_x cairo_point_y moveto } bind def
/Tf { pop /cairo_font exch def /cairo_font_matrix where
      { pop cairo_selectfont } if } bind def
/Td { matrix translate cairo_font_matrix matrix concatmatrix dup
      /cairo_font_matrix exch def dup 4 get exch 5 get cairo_store_point
      /cairo_font where { pop cairo_selectfont } if } bind def
/Tm { 2 copy 8 2 roll 6 array astore /cairo_font_matrix exch def
      cairo_store_point /cairo_font where { pop cairo_selectfont } if } bind def
/g { setgray } bind def
/rg { setrgbcolor } bind def
/d1 { setcachedevice } bind def
/cairo_data_source {
  CairoDataIndex CairoData length lt
    { CairoData CairoDataIndex get /CairoDataIndex CairoDataIndex 1 add def }
    { () } ifelse
} def
/cairo_flush_ascii85_file { cairo_ascii85_file status { cairo_ascii85_file flushfile } if } def
/cairo_image { image cairo_flush_ascii85_file } def
/cairo_imagemask { imagemask cairo_flush_ascii85_file } def
%%EndProlog
%%BeginSetup
%%EndSetup
%%Page: 1 1
%%BeginPageSetup
%%PageBoundingBox: 0 0 327 156
%%EndPageSetup
q 0 0 327 156 rectclip
1 0 0 -1 0 156 cm q
0 g
108.812 41.469 m 108.742 43.449 l 108.715 44.547 l 108.691 45.926 l 108.672
 47.43 l 108.66 49.004 l 108.652 50.621 l 108.566 52.266 l 108.559 53.914
 l 108.473 55.57 l 108.309 57.34 l 108.133 59.246 l 108.047 61.098 l 108.043
 62.77 l 108.043 64.34 l 108.039 65.832 l 108.039 67.324 l 108.035 68.98
 l 108.035 75.25 l 108.031 76.75 l 108.031 80.57 l 107.953 81.762 l 107.949
 82.789 l 107.867 83.836 l 107.863 85.016 l 107.863 91.168 l 107.859 92.441
 l 107.859 117.641 l 107.781 118.688 l 107.773 119.734 l 107.699 120.73 
l 107.617 121.82 l 107.453 123.027 l 107.363 124.27 l 107.281 125.469 l 
107.195 126.711 l 107.191 127.73 l 107.117 128.543 l 107.031 129.496 l 107.023
 130.371 l 107.02 131.199 l 107.02 136.605 l 107.016 137.664 l 107.016 138.746
 l 106.938 139.867 l 106.93 140.984 l 106.852 142.023 l 106.848 143.066 
l 106.766 144.113 l 106.762 144.871 l 106.762 146.297 l 109.414 145.527 
l 109.238 145.68 l 108.203 145.125 l 107.957 143.676 l 107.957 143.637 l
 107.945 143.637 l 107.945 143.676 l 107.715 145.156 l 106.906 146.512 l
 106.988 147.066 l 109.637 146.297 l 109.641 146.082 l 109.641 144.883 l
 109.645 144.23 l 109.723 143.184 l 109.727 142.137 l 109.805 141.098 l 
109.805 139.973 l 109.883 138.848 l 109.883 134.773 l 109.879 134.027 l 
109.879 130.387 l 109.883 129.641 l 109.961 128.801 l 110.043 127.859 l 
110.047 126.816 l 110.125 125.668 l 110.207 124.473 l 110.289 123.324 l 
110.453 122.117 l 110.539 120.945 l 110.621 119.848 l 110.625 118.801 l 
110.703 117.75 l 110.703 103.512 l 110.699 102.234 l 110.699 85.023 l 110.703
 83.949 l 110.781 82.898 l 110.785 81.863 l 110.863 80.664 l 110.863 76.75
 l 110.859 75.25 l 110.859 67.328 l 110.855 65.832 l 110.855 64.34 l 110.852
 62.773 l 110.852 61.164 l 110.93 59.434 l 111.09 57.594 l 111.254 55.77
 l 111.336 53.98 l 111.328 52.336 l 111.406 50.691 l 111.398 49.008 l 111.387
 47.434 l 111.367 45.926 l 111.344 44.547 l 111.316 43.453 l 111.246 41.469
 l f
111.617 42.969 m 112.266 42.09 l 112.438 42.082 l 112.676 42.012 l 113.129
 41.875 l 113.84 41.648 l 114.426 41.453 l 115.16 41.312 l 116.129 41.164
 l 117.359 41.02 l 119.074 40.875 l 121.039 40.805 l 123.344 40.73 l 127.699
 40.73 l 129.836 40.805 l 131.91 40.883 l 136.176 41.035 l 140.711 41.035
 l 143.207 40.961 l 148.023 40.961 l 150.543 40.883 l 152.871 40.809 l 155.09
 40.734 l 157.086 40.734 l 158.992 40.66 l 163.652 40.66 l 165.016 40.73
 l 166.336 40.805 l 167.66 40.879 l 168.809 40.953 l 170.023 41.027 l 171.27
 41.172 l 172.555 41.254 l 173.703 41.328 l 174.816 41.402 l 175.852 41.406
 l 184.219 41.406 l 185.125 41.34 l 185.961 41.332 l 186.668 41.262 l 187.273
 41.195 l 187.859 41.188 l 188.668 41.184 l 189.426 41.117 l 190.199 41.109
 l 190.727 41.043 l 191.348 40.973 l 191.711 40.961 l 192.312 40.898 l 192.73
 40.891 l 193.012 40.887 l 193.848 40.887 l 194.203 40.836 l 194.641 40.816
 l 195.117 40.812 l 195.609 40.812 l 196.211 40.809 l 198.059 40.809 l 198.629
 40.812 l 201.195 40.812 l 201.941 40.816 l 202.719 40.75 l 203.574 40.742
 l 204.309 40.672 l 204.82 40.602 l 205.156 40.543 l 205.457 40.527 l 205.902
 40.453 l 206.074 40.414 l 206.566 40.383 l 206.824 40.375 l 207.125 40.371
 l 207.777 40.371 l 209.203 38.762 l 209.109 38.691 l 208.941 37.273 l 206.246
 37.598 l 206.418 39.012 l 206.348 39.105 l 207.77 37.496 l 207.109 37.496
 l 206.777 37.5 l 206.438 37.508 l 205.645 37.562 l 205.344 37.633 l 205.141
 37.664 l 204.828 37.684 l 204.383 37.758 l 203.965 37.816 l 203.418 37.871
 l 202.582 37.883 l 201.82 37.949 l 200.59 37.949 l 200.082 37.953 l 195.098
 37.953 l 194.562 37.961 l 193.945 37.984 l 193.648 38.027 l 192.992 38.027
 l 192.68 38.031 l 192.129 38.047 l 191.52 38.109 l 191.145 38.121 l 190.391
 38.207 l 190.008 38.254 l 189.285 38.262 l 188.539 38.328 l 187.828 38.328
 l 187.086 38.344 l 186.371 38.422 l 185.809 38.477 l 185.008 38.484 l 184.109
 38.551 l 175.859 38.551 l 174.922 38.547 l 173.891 38.477 l 172.73 38.402
 l 171.523 38.328 l 170.277 38.18 l 168.984 38.102 l 167.832 38.027 l 166.496
 37.953 l 165.172 37.879 l 163.727 37.805 l 158.938 37.805 l 157.027 37.879
 l 155.043 37.879 l 152.777 37.953 l 150.453 38.027 l 147.984 38.102 l 143.164
 38.102 l 140.668 38.176 l 136.227 38.176 l 134.09 38.102 l 132.012 38.031
 l 129.934 37.957 l 127.746 37.883 l 123.297 37.883 l 120.938 37.961 l 118.898
 38.039 l 117.066 38.203 l 115.746 38.371 l 114.668 38.539 l 113.699 38.738
 l 112.945 38.996 l 112.246 39.242 l 111.695 39.441 l 111.164 39.703 l 110.418
 40.289 l 109.633 41.754 l f
207.109 38.09 m 207.352 39.508 l 207.469 40.172 l 207.605 40.785 l 207.695
 41.5 l 207.852 42.398 l 207.934 43.266 l 207.938 44.219 l 208.012 45.359
 l 208.016 46.387 l 207.938 47.586 l 207.93 48.91 l 207.93 52.809 l 207.926
 54.156 l 207.926 55.461 l 207.844 56.887 l 207.84 58.305 l 207.762 59.602
 l 207.68 60.863 l 207.602 62.078 l 207.441 63.184 l 207.348 64.438 l 207.27
 65.59 l 207.105 66.789 l 207.012 68.16 l 207.008 69.48 l 207.008 88.352
 l 206.926 89.629 l 206.922 90.945 l 206.922 96.973 l 207.008 98.137 l 207.09
 99.262 l 207.172 100.383 l 207.254 101.512 l 207.332 102.422 l 207.336 
103.414 l 207.336 108.395 l 207.418 109.43 l 207.508 110.375 l 207.668 111.359
 l 207.75 112.277 l 207.84 113.309 l 208 114.207 l 208.082 115.043 l 208.168
 115.941 l 208.246 116.758 l 208.332 117.586 l 208.414 118.324 l 208.488
 119.09 l 208.496 119.84 l 208.5 120.652 l 208.5 124.105 l 208.496 124.828
 l 208.496 128.223 l 208.57 128.918 l 208.664 129.723 l 208.812 130.25 l
 208.891 130.773 l 208.902 131.242 l 208.973 131.844 l 208.988 132.625 l
 209.062 133.262 l 209.152 134.121 l 209.223 134.715 l 209.238 135.367 l
 209.316 136.199 l 209.398 136.879 l 209.48 137.543 l 209.559 138.234 l 
209.57 138.727 l 209.648 139.348 l 209.711 139.727 l 209.73 140.148 l 209.809
 140.672 l 209.879 141.137 l 209.898 141.746 l 209.961 142.168 l 209.98 
142.777 l 209.98 144.367 l 209.977 144.801 l 209.977 144.98 l 209.922 145.426
 l 209.898 146.047 l 209.891 146.789 l 209.891 148.59 l 209.945 148.945 
l 209.965 149.262 l 210.027 149.578 l 210.039 149.645 l 210.184 149.223 
l 210.535 149.301 l 209.594 150.125 l 210.984 151.715 l 211.926 150.887 
l 212.715 150.582 l 212.922 149.723 l 212.887 149.199 l 212.832 148.902 
l 212.816 148.629 l 212.777 148.371 l 212.777 146.113 l 212.793 145.652 
l 212.855 145.156 l 212.852 144.801 l 212.852 143.848 l 212.848 143.336 
l 212.844 142.727 l 212.816 141.914 l 212.754 141.484 l 212.73 140.863 l
 212.637 140.246 l 212.582 139.871 l 212.559 139.414 l 212.477 138.926 l
 212.426 138.516 l 212.414 138.043 l 212.32 137.207 l 212.238 136.531 l 
212.16 135.891 l 212.094 135.199 l 212.082 134.512 l 211.996 133.801 l 211.906
 132.941 l 211.844 132.426 l 211.828 131.648 l 211.754 131.031 l 211.738
 130.512 l 211.605 129.652 l 211.473 129.168 l 211.402 128.594 l 211.344
 128.066 l 211.344 126.398 l 211.34 125.66 l 211.34 119.82 l 211.328 118.926
 l 211.234 118.023 l 211.156 117.289 l 211.074 116.473 l 210.992 115.668
 l 210.906 114.77 l 210.812 113.816 l 210.656 112.938 l 210.578 112.023 
l 210.484 111 l 210.32 110.016 l 210.246 109.188 l 210.176 108.277 l 210.176
 104.371 l 210.172 103.402 l 210.168 102.289 l 210.082 101.285 l 210 100.172
 l 209.914 99.051 l 209.832 97.93 l 209.758 96.867 l 209.758 90.945 l 209.762
 89.715 l 209.84 88.438 l 209.84 68.254 l 209.922 67.07 l 210.086 65.875
 l 210.172 64.633 l 210.254 63.484 l 210.414 62.371 l 210.5 61.043 l 210.582
 59.773 l 210.668 58.387 l 210.668 56.965 l 210.75 55.535 l 210.746 54.148
 l 210.746 51.453 l 210.742 50.18 l 210.742 48.91 l 210.746 47.68 l 210.824
 46.469 l 210.82 45.254 l 210.738 44.109 l 210.727 43.121 l 210.625 42.02
 l 210.449 41.066 l 210.34 40.262 l 210.129 39.484 l 209.906 38.875 l 209.52
 37.535 l f
107.16 145.469 m 108.555 145.766 l 108.617 145.82 l 108.785 145.918 l 109.078
 146.148 l 109.359 146.32 l 109.668 146.668 l 110.34 147.219 l 111.07 147.637
 l 111.848 148.004 l 112.84 148.375 l 113.973 148.645 l 115.191 148.883 
l 116.504 149.121 l 117.875 149.281 l 119.008 149.426 l 120.117 149.582 
l 121.086 149.656 l 121.996 149.801 l 123.109 149.887 l 124.152 150.027 
l 125.375 150.184 l 126.59 150.266 l 127.98 150.344 l 129.352 150.348 l 
135.781 150.348 l 136.895 150.418 l 138.145 150.492 l 139.207 150.566 l 
140.379 150.641 l 142.707 150.789 l 143.824 150.863 l 144.984 151.008 l 
146.105 151.09 l 147.469 151.168 l 148.805 151.242 l 150.262 151.32 l 151.762
 151.32 l 153.172 151.395 l 158.625 151.395 l 159.449 151.461 l 160.547 
151.535 l 161.488 151.613 l 162.508 151.617 l 163.695 151.691 l 164.715 
151.695 l 165.746 151.828 l 166.867 151.91 l 167.848 151.984 l 168.801 152.059
 l 169.805 152.066 l 170.496 152.125 l 171.316 152.262 l 172.117 152.344
 l 172.746 152.473 l 173.516 152.562 l 174.195 152.691 l 174.91 152.848 
l 175.945 152.949 l 176.68 153.023 l 177.684 153.105 l 178.508 153.113 l
 179.336 153.18 l 180.172 153.188 l 181.102 153.254 l 181.973 153.262 l 
183.676 153.262 l 184.438 153.324 l 185.309 153.395 l 186.273 153.547 l 
187.246 153.559 l 188.109 153.625 l 189.93 153.773 l 190.734 153.844 l 191.523
 153.922 l 192.336 153.934 l 193.035 153.934 l 193.875 154 l 194.5 154.008
 l 195.09 154.062 l 195.742 154.137 l 196.34 154.203 l 196.914 154.32 l 
197.465 154.457 l 198.117 154.605 l 198.57 154.734 l 199.23 154.91 l 199.797
 155.008 l 200.41 155.094 l 200.973 155.176 l 201.668 155.199 l 202.273 
155.203 l 204.199 155.203 l 204.789 155.145 l 205.27 155.133 l 205.949 155.059
 l 206.477 154.984 l 206.887 154.918 l 207.398 154.836 l 207.727 154.777
 l 208.023 154.762 l 208.504 154.754 l 208.844 154.703 l 209.273 154.688
 l 209.652 154.68 l 210.008 154.629 l 210.328 154.609 l 210.859 154.539 
l 211.137 154.484 l 211.445 154.461 l 211.777 154.406 l 211.918 154.395 
l 212.223 154.383 l 212.59 154.32 l 212.891 154.258 l 214.062 154.137 l 
214.406 152.176 l 213.484 151.664 l 212.609 150.848 l 211.188 152.371 l 
212.062 153.188 l 211.512 153.02 l 211.754 151.445 l 212.461 151.371 l 212.062
 151.449 l 211.922 151.473 l 211.75 151.477 l 211.43 151.504 l 211.098 151.559
 l 210.754 151.582 l 210.387 151.652 l 210.047 151.699 l 209.719 151.719
 l 209.422 151.758 l 209.184 151.762 l 208.566 151.789 l 208.266 151.836
 l 207.918 151.84 l 207.398 151.871 l 206.926 151.953 l 206.418 152.031 
l 206.035 152.094 l 205.594 152.156 l 205.082 152.207 l 204.605 152.219 
l 204.051 152.277 l 202.285 152.277 l 201.727 152.273 l 201.234 152.254 
l 200.828 152.195 l 200.254 152.117 l 199.859 152.047 l 199.344 151.91 l
 198.848 151.77 l 198.148 151.609 l 197.562 151.465 l 196.801 151.309 l 
196.066 151.227 l 195.391 151.152 l 194.656 151.078 l 194.008 151.074 l 
193.156 151.004 l 192.359 151.004 l 191.688 150.996 l 191.008 150.93 l 190.176
 150.855 l 189.258 150.777 l 188.34 150.703 l 187.375 150.629 l 186.52 150.617
 l 185.652 150.48 l 184.676 150.402 l 183.793 150.332 l 182.809 150.332 
l 181.984 150.328 l 181.219 150.324 l 180.293 150.254 l 179.469 150.246 
l 178.637 150.18 l 177.82 150.172 l 176.949 150.102 l 176.234 150.027 l 
175.367 149.945 l 174.781 149.816 l 173.953 149.66 l 173.215 149.574 l 172.562
 149.438 l 171.703 149.352 l 170.863 149.211 l 169.938 149.133 l 168.93 
149.125 l 168.074 149.059 l 167.082 148.984 l 166.043 148.906 l 164.91 148.758
 l 163.789 148.754 l 162.605 148.684 l 161.613 148.676 l 160.766 148.605
 l 159.664 148.531 l 158.738 148.457 l 153.246 148.457 l 151.84 148.383 
l 150.34 148.379 l 148.961 148.305 l 147.633 148.23 l 146.293 148.156 l 
145.27 148.082 l 144.102 147.934 l 142.895 147.855 l 140.566 147.707 l 139.398
 147.633 l 138.332 147.559 l 137.07 147.48 l 135.871 147.406 l 128.062 147.406
 l 126.77 147.332 l 125.656 147.258 l 124.535 147.113 l 123.414 146.961 
l 122.332 146.883 l 121.43 146.742 l 120.43 146.664 l 119.391 146.52 l 118.227
 146.371 l 116.93 146.227 l 115.73 146.008 l 114.586 145.785 l 113.688 145.574
 l 112.973 145.312 l 112.402 145.047 l 111.98 144.812 l 111.664 144.559 
l 111.199 144.062 l 110.652 143.746 l 110.203 143.438 l 109.711 143.242 
l 109.305 143.105 l 107.574 142.895 l f
0 1 0 rg
134.477 67.227 m 133.641 66.672 l 133.027 66.57 l 132.469 66.738 l 132.02
 66.969 l 131.516 67.285 l 131.023 67.793 l 130.621 68.332 l 130.266 68.926
 l 129.949 69.598 l 129.746 70.25 l 129.625 70.895 l 129.582 71.492 l 129.578
 72.16 l 129.762 72.797 l 130.035 73.387 l 130.484 73.938 l 131.004 74.285
 l 131.5 74.535 l 132.023 74.672 l 132.496 74.715 l 132.793 74.719 l 133.117
 74.719 l 133.449 74.68 l 133.648 74.609 l 133.961 74.508 l 134.16 74.363
 l 134.238 74.27 l 134.406 74.094 l 134.504 73.828 l 134.598 73.461 l 134.887
 73.305 l 134.629 72.824 l 134.336 72.984 l 133.934 72.883 l 133.684 72.852
 l 133.43 72.887 l 133.238 72.977 l 133.23 72.969 l 133.121 72.996 l 133.07
 73.012 l 133.02 73.016 l 132.59 73.016 l 132.32 72.988 l 132.105 72.934
 l 131.863 72.812 l 131.648 72.664 l 131.492 72.473 l 131.367 72.199 l 131.289
 71.926 l 131.289 71.555 l 131.316 71.113 l 131.402 70.66 l 131.539 70.219
 l 131.77 69.723 l 132.035 69.273 l 132.316 68.891 l 132.594 68.598 l 132.859
 68.422 l 133.109 68.289 l 133.195 68.254 l 133.148 68.211 l 133.781 68.477
 l f
140.254 68.125 m 139.508 67.719 l 139.266 67.613 l 139.059 67.543 l 138.742
 67.484 l 138.238 67.461 l 137.688 67.68 l 137.164 67.996 l 136.625 68.504
 l 136.16 69.141 l 135.832 69.797 l 135.59 70.484 l 135.461 71.168 l 135.457
 71.789 l 135.531 72.316 l 135.629 72.898 l 135.973 73.395 l 136.352 73.746
 l 136.738 74.012 l 137.094 74.16 l 137.551 74.277 l 138.012 74.254 l 138.449
 74.117 l 138.883 73.855 l 139.246 73.547 l 139.574 73.102 l 139.809 72.723
 l 140.051 72.293 l 140.258 71.793 l 140.418 71.324 l 140.504 70.902 l 140.578
 70.508 l 140.625 70.137 l 140.594 69.762 l 140.539 69.301 l 140.262 68.848
 l 139.984 68.543 l 139.625 68.234 l 139.152 68.148 l 138.793 68.23 l 138.465
 68.383 l 138.266 68.324 l 138.18 68.605 l 138.379 68.664 l 138.508 68.953
 l 138.609 69.266 l 138.734 69.461 l 138.777 69.582 l 138.898 69.785 l 138.926
 69.844 l 138.934 69.93 l 138.945 70.102 l 138.93 70.25 l 138.867 70.59 
l 138.809 70.891 l 138.699 71.207 l 138.555 71.574 l 138.383 71.883 l 138.203
 72.172 l 138.027 72.41 l 137.906 72.516 l 137.758 72.609 l 137.711 72.629
 l 137.711 72.633 l 137.621 72.609 l 137.539 72.57 l 137.395 72.465 l 137.238
 72.312 l 137.207 72.262 l 137.176 72.062 l 137.121 71.676 l 137.125 71.328
 l 137.199 70.918 l 137.367 70.445 l 137.586 70.004 l 137.879 69.594 l 138.18
 69.293 l 138.438 69.121 l 138.535 69.066 l 138.598 69.059 l 138.785 69.074
 l 138.914 69.078 l 138.996 69.059 l 139.641 69.348 l f
140.746 68.328 m 140.824 69.176 l 140.805 69.512 l 140.82 69.949 l 140.82
 71.059 l 140.855 71.711 l 140.969 72.375 l 141.133 72.996 l 141.398 73.566
 l 141.723 73.992 l 142.039 74.285 l 142.402 74.477 l 142.719 74.559 l 143.152
 74.594 l 143.617 74.445 l 144.035 74.18 l 144.367 73.773 l 144.66 73.336
 l 144.926 72.855 l 145.176 72.34 l 145.418 71.84 l 145.684 71.258 l 145.832
 70.758 l 145.977 70.301 l 146.047 69.988 l 146.086 69.879 l 146.113 69.816
 l 144.617 69.891 l 144.605 69.883 l 144.625 70.027 l 144.66 70.445 l 144.691
 70.875 l 144.691 72.375 l 144.734 72.934 l 144.816 73.367 l 144.922 73.805
 l 145.062 74.035 l 145.168 74.141 l 145.309 74.23 l 145.527 74.734 l 146.41
 74.504 l 146.359 73.957 l 146.441 73.828 l 146.473 73.605 l 146.434 73.379
 l 146.406 73.09 l 146.359 72.746 l 146.336 72.32 l 146.336 70.812 l 146.297
 70.312 l 146.254 69.84 l 146.188 69.402 l 146.082 69.191 l 144.586 69.266
 l 144.488 69.559 l 144.422 69.891 l 144.297 70.285 l 144.172 70.688 l 143.961
 71.152 l 143.727 71.633 l 143.492 72.102 l 143.273 72.488 l 143.062 72.805
 l 142.941 72.953 l 142.922 72.965 l 142.961 72.953 l 142.988 72.957 l 142.996
 72.957 l 142.988 72.953 l 142.934 72.898 l 142.805 72.723 l 142.672 72.441
 l 142.566 72.031 l 142.477 71.527 l 142.449 71.016 l 142.449 70.449 l 142.441
 69.887 l 142.395 69.434 l 142.352 69.047 l 142.18 68.125 l f
146.883 69.617 m 146.816 70.594 l 146.828 70.953 l 146.824 71.359 l 146.852
 71.758 l 146.852 72.348 l 146.848 72.621 l 146.848 73.039 l 148.414 73.324
 l 148.473 73.172 l 148.57 72.852 l 148.738 72.488 l 148.996 72.047 l 149.246
 71.598 l 149.582 71.141 l 149.922 70.68 l 150.129 70.395 l 150.336 70.223
 l 150.457 70.133 l 150.496 70.109 l 150.293 70.207 l 149.926 70.062 l 149.875
 69.984 l 149.957 70.32 l 150.062 70.844 l 150.191 71.391 l 150.297 71.996
 l 150.48 72.598 l 150.633 73.09 l 150.695 73.488 l 150.766 73.867 l 150.805
 74.066 l 150.828 74.277 l 150.906 74.477 l 151.008 74.582 l 151.129 74.648
 l 151.266 75.18 l 152.156 75.105 l 152.207 74.559 l 152.309 74.398 l 152.352
 74.211 l 152.379 74.129 l 152.395 73.941 l 152.367 73.629 l 152.305 73.227
 l 152.23 72.723 l 152.043 72.117 l 151.887 71.613 l 151.789 71.055 l 151.645
 70.492 l 151.539 69.953 l 151.387 69.398 l 151.07 68.812 l 150.246 68.48
 l 149.789 68.695 l 149.605 68.793 l 149.355 68.98 l 148.969 69.297 l 148.645
 69.734 l 148.305 70.184 l 147.895 70.715 l 147.594 71.246 l 147.305 71.738
 l 147.059 72.27 l 146.941 72.648 l 146.898 72.758 l 148.469 73.039 l 148.469
 72.621 l 148.465 72.348 l 148.465 72.086 l 148.457 71.691 l 148.422 71.289
 l 148.41 70.879 l 148.363 70.531 l 148.297 69.621 l f
154.391 63.953 m 155.035 64.062 l 155.039 64.102 l 155.262 64.531 l 155.551
 65.328 l 155.73 66.418 l 155.859 67.703 l 155.891 69.051 l 155.922 70.418
 l 155.922 73.855 l 155.953 74.68 l 155.957 75.332 l 155.992 75.777 l 156
 76.199 l 156.16 76.562 l 156.691 77.129 l 157.582 76.809 l 157.594 76.223
 l 157.797 75.641 l 156.742 75.27 l 156.539 75.852 l 156.43 75.613 l 157.238
 75.316 l 157.617 75.695 l 157.695 75.859 l 157.699 75.711 l 157.672 75.266
 l 157.672 74.645 l 157.637 73.816 l 157.637 70.395 l 157.602 69.008 l 157.562
 67.598 l 157.418 66.188 l 157.191 64.883 l 156.793 63.832 l 156.363 63.07
 l 155.738 62.523 l 154.562 62.43 l f
153.891 71.262 m 155.016 71.16 l 156.523 71.16 l 157.031 71.156 l 157.543
 71.137 l 158.055 71.078 l 158.527 70.953 l 158.965 70.594 l 159.293 70.348
 l 159.367 70.348 l 159.367 70.281 l 159.293 70.281 l 158.965 70.039 l 158.527
 69.68 l 158.055 69.551 l 157.543 69.496 l 157.031 69.477 l 156.523 69.469
 l 155.977 69.469 l 155.461 69.473 l 154.922 69.48 l 153.719 69.621 l f
161.68 71.887 m 162.512 71.5 l 162.887 71.406 l 163.301 71.188 l 163.641
 70.941 l 163.879 70.738 l 164.121 70.434 l 164.316 70.176 l 164.449 69.855
 l 164.559 69.539 l 164.598 69.168 l 164.484 68.73 l 164.223 68.359 l 163.734
 68.086 l 163.16 67.953 l 162.508 67.977 l 161.859 68.145 l 161.199 68.531
 l 160.648 69.141 l 160.305 69.867 l 160.168 70.641 l 160.125 71.402 l 160.207
 72.129 l 160.422 72.848 l 160.805 73.508 l 161.242 74.066 l 161.754 74.457
 l 162.238 74.773 l 162.77 74.961 l 163.281 75.043 l 163.746 75.078 l 164.32
 75.035 l 164.875 74.891 l 165.371 74.598 l 165.691 74.156 l 165.758 73.48
 l 165.863 73.391 l 165.707 73.215 l 165.605 73.309 l 164.977 73.25 l 164.613
 73.289 l 164.355 73.352 l 164.098 73.379 l 163.77 73.391 l 163.492 73.359
 l 163.188 73.309 l 162.992 73.242 l 162.738 73.074 l 162.441 72.852 l 162.207
 72.555 l 161.98 72.168 l 161.863 71.785 l 161.812 71.352 l 161.836 70.828
 l 161.914 70.371 l 162.055 70.062 l 162.266 69.812 l 162.504 69.656 l 162.75
 69.586 l 163.012 69.574 l 163.145 69.605 l 163.125 69.59 l 163.004 69.422
 l 162.973 69.293 l 162.984 69.199 l 162.949 69.305 l 162.922 69.395 l 162.859
 69.484 l 162.73 69.664 l 162.656 69.742 l 162.449 69.91 l 162.246 70.051
 l 161.93 70.215 l 161.066 70.742 l f
166.828 68.648 m 166.988 69.754 l 167.047 70.352 l 167.141 70.973 l 167.164
 71.652 l 167.227 72.359 l 167.258 73.012 l 167.324 73.57 l 167.355 73.98
 l 167.391 74.305 l 167.414 74.453 l 167.414 74.484 l 169.074 74.504 l 169.082
 74.43 l 169.082 74.242 l 169.086 73.949 l 169.117 73.527 l 169.148 73.07
 l 169.246 72.516 l 169.34 71.887 l 169.508 71.34 l 169.789 70.781 l 170.105
 70.328 l 170.453 70.016 l 170.859 69.766 l 171.238 69.629 l 171.652 69.527
 l 172.066 69.477 l 172.484 69.473 l 172.859 69.473 l 173.062 69.492 l 173.18
 69.508 l 173.355 69.539 l 173.746 69.598 l 174.332 69.566 l 174.426 69.641
 l 174.535 69.508 l 174.441 69.434 l 174.414 68.895 l 174.305 68.41 l 173.926
 68.082 l 173.516 67.883 l 172.988 67.789 l 171.957 67.789 l 171.348 67.863
 l 170.75 68.012 l 170.117 68.242 l 169.438 68.668 l 168.84 69.211 l 168.344
 69.918 l 167.945 70.715 l 167.703 71.52 l 167.594 72.246 l 167.488 72.871
 l 167.449 73.41 l 167.418 73.891 l 167.418 74.344 l 169.074 74.367 l 169.066
 74.254 l 169.035 74.078 l 169.008 73.828 l 168.973 73.402 l 168.906 72.871
 l 168.867 72.238 l 168.793 71.539 l 168.746 70.809 l 168.637 70.133 l 168.547
 69.52 l 168.309 68.387 l f
130.828 87.934 m 131.223 89.102 l 131.414 89.641 l 131.566 90.199 l 131.699
 90.84 l 131.852 91.422 l 131.883 91.98 l 131.914 92.535 l 131.945 92.965
 l 131.949 93.289 l 131.949 93.578 l 133.617 93.578 l 133.598 93.555 l 133.582
 93.344 l 133.578 93.012 l 133.621 92.609 l 133.738 92.152 l 133.863 91.602
 l 134.059 91.066 l 134.32 90.5 l 134.633 89.953 l 134.941 89.473 l 135.258
 89.07 l 135.422 88.859 l 135.512 88.797 l 135.418 88.836 l 135.25 88.82
 l 135.148 88.766 l 135.152 88.801 l 135.234 89.211 l 135.262 89.801 l 135.297
 90.504 l 135.328 91.191 l 135.328 91.867 l 135.359 92.477 l 135.363 92.934
 l 135.363 93.574 l 135.367 93.656 l 136.938 93.656 l 136.93 93.676 l 136.938
 93.57 l 136.992 93.27 l 137.117 92.832 l 137.277 92.336 l 137.504 91.742
 l 137.766 91.078 l 138.055 90.391 l 138.359 89.734 l 138.699 89.207 l 138.945
 88.867 l 139.133 88.695 l 139.176 88.672 l 139.102 88.707 l 138.863 88.652
 l 138.844 88.648 l 138.957 88.883 l 139.043 89.375 l 139.203 90.039 l 139.293
 90.734 l 139.387 91.449 l 139.449 92.129 l 139.453 92.754 l 139.488 93.332
 l 139.492 93.859 l 139.539 94.246 l 139.559 94.469 l 139.586 94.598 l 139.633
 94.984 l 140.16 95.367 l 140.57 95.184 l 141.121 95.152 l 141.059 94.191
 l 140.512 94.223 l 140.613 94.062 l 141.039 94.355 l 141.086 94.594 l 141.117
 94.461 l 141.133 94.172 l 141.113 93.789 l 141.117 93.285 l 141.086 92.707
 l 141.086 92.051 l 141.012 91.262 l 140.902 90.508 l 140.789 89.727 l 140.605
 89.031 l 140.465 88.34 l 140.129 87.746 l 139.715 87.297 l 139.074 87.129
 l 138.543 87.312 l 138.23 87.512 l 137.828 87.883 l 137.473 88.379 l 137.066
 89.012 l 136.695 89.766 l 136.367 90.492 l 136.082 91.18 l 135.832 91.824
 l 135.648 92.383 l 135.496 92.906 l 135.414 93.309 l 135.371 93.562 l 135.363
 93.652 l 136.934 93.652 l 136.938 93.574 l 136.938 92.43 l 136.902 91.82
 l 136.902 91.148 l 136.867 90.426 l 136.832 89.715 l 136.785 89 l 136.637
 88.32 l 136.379 87.766 l 135.828 87.383 l 135.266 87.309 l 134.812 87.477
 l 134.387 87.785 l 134.094 88.16 l 133.738 88.605 l 133.367 89.168 l 133
 89.785 l 132.652 90.445 l 132.371 91.141 l 132.219 91.77 l 132.066 92.297
 l 131.984 92.91 l 131.977 93.344 l 131.961 93.551 l 131.945 93.574 l 133.609
 93.574 l 133.613 93.473 l 133.613 93.281 l 133.609 92.898 l 133.574 92.422
 l 133.539 91.883 l 133.5 91.16 l 133.312 90.453 l 133.172 89.805 l 132.98
 89.133 l 132.75 88.539 l 132.312 87.395 l f
145.141 88.391 m 144.129 88.828 l 143.664 89.223 l 143.246 89.777 l 142.871
 90.516 l 142.605 91.344 l 142.602 92.117 l 142.602 92.883 l 142.879 93.598
 l 143.184 94.152 l 143.625 94.656 l 144.203 94.914 l 144.703 95.066 l 145.441
 94.996 l 146.012 94.773 l 146.539 94.41 l 146.996 93.836 l 147.289 93.203
 l 147.426 92.535 l 147.477 91.879 l 147.391 91.191 l 147.16 90.508 l 146.734
 89.902 l 146.199 89.422 l 145.641 89.098 l 145.156 88.926 l 144.738 88.891
 l 144.414 89.062 l 143.945 88.984 l 143.809 89.805 l 144.277 89.883 l 144.391
 90.125 l 144.555 90.328 l 144.871 90.523 l 145.191 90.75 l 145.469 91.016
 l 145.648 91.273 l 145.75 91.566 l 145.793 91.922 l 145.77 92.309 l 145.695
 92.684 l 145.57 92.961 l 145.395 93.188 l 145.23 93.305 l 145.055 93.371
 l 144.879 93.391 l 144.793 93.363 l 144.637 93.293 l 144.555 93.195 l 144.391
 92.898 l 144.27 92.574 l 144.27 92.121 l 144.273 91.609 l 144.418 91.152
 l 144.672 90.648 l 144.898 90.328 l 145.035 90.168 l 145.793 89.758 l f
151.691 82.926 m 152.344 83.992 l 152.602 84.578 l 152.844 85.426 l 153.039
 86.555 l 153.27 87.742 l 153.367 88.953 l 153.473 90.152 l 153.57 91.188
 l 153.57 92.867 l 153.539 93.504 l 153.539 93.922 l 153.516 94.164 l 153.512
 94.332 l 153.527 93.57 l 155.008 93.594 l 155.121 94.109 l 155.078 93.832
 l 154.996 93.352 l 154.828 92.824 l 154.621 92.34 l 154.316 91.824 l 153.934
 91.395 l 153.531 91.027 l 152.965 90.719 l 152.426 90.551 l 151.836 90.461
 l 151.211 90.496 l 150.574 90.758 l 149.965 91.195 l 149.52 91.832 l 149.207
 92.531 l 149.031 93.344 l 149.023 94.184 l 149.234 95.012 l 149.59 95.777
 l 150.16 96.422 l 150.785 96.914 l 151.453 97.277 l 152.117 97.441 l 152.816
 97.523 l 153.457 97.445 l 154.117 97.254 l 154.715 96.945 l 155.227 96.574
 l 155.73 96.117 l 156.102 95.578 l 156.293 94.992 l 156.207 94.27 l 156.23
 94.238 l 156.195 94.211 l 156.172 94.242 l 155.477 94.375 l 154.988 94.645
 l 154.605 94.957 l 154.219 95.234 l 153.844 95.477 l 153.484 95.652 l 153.113
 95.758 l 152.812 95.797 l 152.422 95.75 l 152.078 95.664 l 151.73 95.477
 l 151.336 95.172 l 151.027 94.828 l 150.84 94.434 l 150.719 93.969 l 150.715
 93.527 l 150.812 93.047 l 150.984 92.641 l 151.168 92.363 l 151.391 92.191
 l 151.586 92.098 l 151.766 92.082 l 152.062 92.125 l 152.332 92.211 l 152.586
 92.348 l 152.781 92.527 l 153.004 92.777 l 153.172 93.066 l 153.301 93.375
 l 153.402 93.723 l 153.453 94.07 l 153.496 94.414 l 153.688 95.254 l 155.199
 95.277 l 155.219 94.363 l 155.223 94.281 l 155.254 94.02 l 155.258 93.547
 l 155.293 92.91 l 155.293 91.102 l 155.188 89.992 l 155.086 88.805 l 154.98
 87.504 l 154.734 86.238 l 154.52 85.035 l 154.211 83.977 l 153.836 83.184
 l 153.094 82.039 l f
157.934 89.223 m 157.672 90.148 l 157.516 90.645 l 157.422 91.379 l 157.379
 92.164 l 157.375 92.992 l 157.523 93.812 l 157.672 94.555 l 157.922 95.234
 l 158.215 95.723 l 158.457 96.055 l 158.762 96.395 l 159.352 96.648 l 160.082
 96.504 l 160.594 96.098 l 161.086 95.539 l 161.379 94.867 l 161.664 94.223
 l 161.934 93.457 l 162.07 92.746 l 162.305 92.047 l 162.445 91.398 l 162.547
 91.078 l 162.707 90.75 l 162.734 90.523 l 161.117 90.664 l 161.109 90.664
 l 161.109 91.504 l 161.105 92.215 l 161.105 93.613 l 161.145 94.273 l 161.223
 94.891 l 161.297 95.336 l 161.352 95.652 l 161.406 95.824 l 161.453 95.855
 l 161.566 96.605 l 162.898 96.523 l 162.922 95.766 l 162.957 95.66 l 162.957
 95.449 l 162.945 95.125 l 162.891 94.672 l 162.832 94.129 l 162.801 93.566
 l 162.801 91.5 l 162.797 90.883 l 162.777 90.395 l 162.707 90.184 l 161.086
 90.324 l 161.094 90.277 l 161.008 90.469 l 160.848 90.977 l 160.711 91.609
 l 160.473 92.32 l 160.332 93.02 l 160.125 93.605 l 159.859 94.191 l 159.664
 94.629 l 159.441 94.883 l 159.367 94.941 l 159.535 94.91 l 159.758 95.004
 l 159.758 95 l 159.613 94.805 l 159.441 94.512 l 159.289 94.098 l 159.164
 93.496 l 159.043 92.844 l 159.043 92.203 l 159.066 91.508 l 159.121 90.922
 l 159.184 90.5 l 159.352 89.551 l f
162.477 84.566 m 162.898 85.117 l 162.938 85.312 l 163.145 85.875 l 163.336
 86.719 l 163.598 87.801 l 163.793 88.926 l 163.957 90.043 l 164.09 91.062
 l 164.191 92.039 l 164.293 92.91 l 164.395 93.637 l 164.465 94.254 l 164.539
 94.68 l 164.582 94.926 l 164.652 95.156 l 164.848 95.426 l 165.09 95.512
 l 165.637 96.051 l 166.582 95.094 l 166.039 94.555 l 166.125 94.492 l 166.23
 94.582 l 166.254 94.613 l 166.238 94.426 l 166.18 94.023 l 166.113 93.422
 l 166.012 92.688 l 165.91 91.848 l 165.809 90.859 l 165.668 89.801 l 165.492
 88.648 l 165.277 87.445 l 164.996 86.32 l 164.77 85.371 l 164.477 84.652
 l 164.242 84.27 l 163.66 83.598 l f
167.895 94.41 m 168.934 94.012 l 169.387 93.832 l 169.84 93.621 l 170.352
 93.391 l 170.906 93.062 l 171.422 92.77 l 171.949 92.375 l 172.438 91.902
 l 172.727 91.438 l 172.902 91.02 l 173.07 90.535 l 173.027 89.914 l 172.672
 89.379 l 172.117 89.117 l 171.395 88.949 l 170.551 89.102 l 169.691 89.355
 l 168.836 89.852 l 168.043 90.598 l 167.488 91.438 l 167.148 92.383 l 167.016
 93.43 l 167.188 94.434 l 167.605 95.34 l 168.18 96.16 l 168.938 96.84 l
 169.637 97.328 l 170.336 97.703 l 171.051 97.906 l 171.758 97.945 l 172.438
 97.863 l 173.129 97.656 l 173.691 97.352 l 174.168 96.914 l 174.289 96.203
 l 174.383 96.125 l 174.258 95.965 l 174.16 96.043 l 173.535 95.934 l 173.062
 95.984 l 172.605 96.102 l 172.133 96.199 l 171.723 96.234 l 171.344 96.203
 l 170.984 96.102 l 170.535 95.863 l 170.012 95.496 l 169.473 95.012 l 169.098
 94.48 l 168.836 93.918 l 168.738 93.387 l 168.812 92.781 l 169.02 92.199
 l 169.348 91.691 l 169.852 91.211 l 170.363 90.91 l 170.941 90.738 l 171.355
 90.664 l 171.559 90.711 l 171.531 90.695 l 171.383 90.473 l 171.371 90.312
 l 171.332 90.422 l 171.23 90.664 l 171.121 90.844 l 170.859 91.102 l 170.5
 91.379 l 170.066 91.633 l 169.59 91.922 l 169.145 92.125 l 168.699 92.344
 l 168.305 92.543 l 167.309 92.988 l f
0 g
51.344 62.461 m 52.152 62.289 l 52.293 62.281 l 52.59 62.258 l 52.957 62.258
 l 53.406 62.23 l 53.953 62.23 l 54.641 62.203 l 55.457 62.203 l 56.438 
62.172 l 57.395 62.109 l 58.312 62.082 l 59.234 62.02 l 60.02 61.992 l 63.453
 61.992 l 64.129 62.023 l 64.785 62.082 l 65.43 62.141 l 66.07 62.203 l 
66.664 62.266 l 67.285 62.297 l 67.938 62.359 l 68.641 62.395 l 69.418 62.426
 l 70.27 62.484 l 71.223 62.516 l 72.211 62.516 l 73.234 62.547 l 77.125
 62.547 l 77.957 62.551 l 78.703 62.578 l 79.414 62.641 l 80.125 62.672 
l 80.766 62.73 l 81.469 62.762 l 82.133 62.793 l 82.812 62.855 l 83.551 
62.887 l 84.262 62.918 l 84.906 62.949 l 85.609 62.98 l 90.207 62.98 l 90.992
 63.012 l 91.703 63.012 l 92.383 63.039 l 93.672 63.039 l 94.285 63.07 l
 94.895 63.07 l 95.531 63.102 l 96.129 63.07 l 97.184 63.07 l 97.621 63.043
 l 98.031 63.043 l 98.434 63.012 l 98.812 62.98 l 99.184 62.949 l 99.625
 62.918 l 100.031 62.859 l 100.445 62.828 l 100.883 62.797 l 101.906 62.734
 l 102.391 62.707 l 102.836 62.703 l 103.277 62.703 l 103.574 62.676 l 103.84
 62.676 l 104.059 62.672 l 104.445 62.672 l 104.602 62.652 l 104.641 62.648
 l 104.812 62.645 l 104.961 62.625 l 105.121 62.617 l 105.406 62.586 l 105.703
 62.551 l 105.91 62.523 l 106.066 62.5 l 106.211 62.492 l 106.445 62.492
 l 106.629 62.488 l 106.828 62.469 l 106.914 62.465 l 107.031 62.461 l 107.203
 62.461 l 107.434 62.438 l 107.648 62.43 l 107.855 62.406 l 108.074 62.398
 l 108.215 62.379 l 108.285 62.371 l 108.398 62.371 l 108.484 62.367 l 108.66
 62.305 l 108.828 62.172 l 109.059 61.926 l 109.594 61.871 l 109.5 60.957
 l 108.965 61.012 l 108.758 60.812 l 108.656 60.68 l 108.473 60.617 l 108.367
 60.617 l 108.215 60.621 l 108.027 60.633 l 107.914 60.648 l 107.727 60.656
 l 107.52 60.68 l 107.32 60.684 l 107.109 60.707 l 107.012 60.707 l 106.859
 60.711 l 106.688 60.719 l 106.527 60.738 l 106.348 60.738 l 106.172 60.742
 l 105.91 60.75 l 105.664 60.785 l 105.484 60.812 l 105.215 60.844 l 104.984
 60.867 l 104.793 60.875 l 104.664 60.895 l 104.562 60.898 l 104.422 60.91
 l 104.324 60.922 l 103.828 60.922 l 103.488 60.926 l 103.199 60.953 l 102.34
 60.953 l 101.805 60.988 l 101.293 61.02 l 100.773 61.051 l 100.324 61.078
 l 99.844 61.117 l 99.434 61.176 l 99.047 61.203 l 98.672 61.234 l 98.301
 61.266 l 97.965 61.289 l 97.562 61.293 l 97.125 61.32 l 96.086 61.32 l 
95.531 61.352 l 94.941 61.32 l 94.328 61.32 l 93.715 61.289 l 92.426 61.289
 l 91.746 61.258 l 91.027 61.258 l 90.242 61.227 l 85.652 61.227 l 84.988
 61.199 l 84.344 61.168 l 83.629 61.137 l 82.934 61.109 l 82.25 61.047 l
 81.551 61.016 l 80.891 60.984 l 80.246 60.926 l 79.527 60.895 l 78.812 
60.832 l 77.992 60.801 l 75.223 60.801 l 74.234 60.805 l 73.262 60.805 l
 72.238 60.773 l 71.254 60.773 l 70.363 60.742 l 69.516 60.684 l 68.719 
60.652 l 68.059 60.621 l 67.414 60.562 l 66.805 60.531 l 66.246 60.473 l
 65.594 60.414 l 64.949 60.352 l 64.246 60.289 l 63.492 60.258 l 60.75 60.258
 l 59.988 60.262 l 59.145 60.293 l 58.227 60.355 l 57.309 60.387 l 56.355
 60.449 l 55.43 60.477 l 54.602 60.48 l 53.914 60.512 l 53.348 60.516 l 
52.895 60.547 l 52.5 60.555 l 52.082 60.602 l 51.785 60.664 l 50.902 60.996
 l f
0 0 1 rg
6.527 49.965 m 6.48 51.191 l 6.469 51.848 l 6.426 52.762 l 6.391 53.805
 l 6.355 54.984 l 6.352 56.211 l 6.316 57.363 l 6.285 58.512 l 6.215 59.531
 l 6.148 60.406 l 6.082 61.156 l 6.016 61.77 l 5.977 62.297 l 5.977 62.91
 l 5.98 63.039 l 5.984 63.336 l 6.441 64.117 l 7.414 63.918 l 7.598 63.336
 l 7.465 62.941 l 7.594 62.578 l 6.977 62.363 l 6.848 62.727 l 6.547 62.816
 l 6.551 62.512 l 7.355 62.336 l 7.688 62.895 l 7.691 63.039 l 7.695 62.91
 l 7.699 62.648 l 7.699 62.363 l 7.73 61.926 l 7.797 61.328 l 7.867 60.551
 l 7.934 59.652 l 8.004 58.594 l 8.039 57.414 l 8.07 56.234 l 8.07 55.012
 l 8.102 53.859 l 8.133 52.82 l 8.16 51.879 l 8.148 51.203 l 8.141 49.988
 l f
6.484 58.52 m 5.664 58.305 l 5.418 58.219 l 5.016 58.176 l 4.57 58.273 
l 4.121 58.43 l 3.637 58.746 l 3.242 59.086 l 2.809 59.586 l 2.535 60.172
 l 2.332 60.703 l 2.16 61.379 l 2.113 62.031 l 2.113 62.715 l 2.281 63.383
 l 2.504 63.996 l 2.898 64.523 l 3.262 64.938 l 3.77 65.27 l 4.258 65.457
 l 4.781 65.551 l 5.371 65.559 l 5.883 65.477 l 6.348 65.309 l 6.828 65.039
 l 7.176 64.68 l 7.426 64.367 l 7.684 63.867 l 7.789 63.176 l 7.82 63.148
 l 7.793 63.121 l 7.766 63.145 l 7.047 63.129 l 6.539 63.316 l 6.18 63.492
 l 5.902 63.68 l 5.688 63.766 l 5.48 63.828 l 5.254 63.859 l 4.945 63.855
 l 4.719 63.816 l 4.547 63.75 l 4.383 63.645 l 4.215 63.453 l 4.008 63.18
 l 3.898 62.883 l 3.805 62.508 l 3.805 62.09 l 3.832 61.641 l 3.938 61.203
 l 4.078 60.816 l 4.227 60.488 l 4.422 60.246 l 4.641 60.039 l 4.871 59.867
 l 5.055 59.781 l 5.188 59.727 l 5.27 59.703 l 5.422 59.68 l 6.242 59.781
 l f
13.047 60.309 m 12.246 59.918 l 12.012 59.824 l 11.879 59.758 l 11.629 
59.664 l 11.367 59.609 l 10.996 59.551 l 10.414 59.617 l 9.945 59.812 l 
9.363 60.086 l 8.836 60.547 l 8.469 61.027 l 8.176 61.59 l 8.066 62.176 
l 8.059 62.75 l 8.207 63.312 l 8.445 63.766 l 8.934 64.188 l 9.461 64.398
 l 9.898 64.488 l 10.441 64.496 l 10.953 64.406 l 11.395 64.148 l 11.773
 63.785 l 12.078 63.348 l 12.266 62.918 l 12.426 62.465 l 12.645 61.691 
l 12.703 61.434 l 12.797 61.211 l 12.828 61.098 l 12.547 61.738 l 11.363
 61.297 l 11.336 60.992 l 11.367 61.359 l 11.445 61.973 l 11.594 62.512 
l 11.738 63.059 l 11.938 63.617 l 12.184 64.082 l 12.402 64.441 l 12.703
 64.75 l 12.988 64.902 l 13.246 64.926 l 13.598 65.215 l 14.082 64.625 l
 13.727 64.336 l 13.758 64.172 l 13.805 63.992 l 13.707 63.691 l 13.594 
63.395 l 13.438 63.008 l 13.305 62.586 l 13.176 62.09 l 13.055 61.648 l 
12.992 61.172 l 12.957 60.848 l 12.898 60.141 l 11.684 59.688 l 11.297 60.562
 l 11.262 60.711 l 11.168 60.965 l 11.094 61.297 l 11 61.645 l 10.906 61.984
 l 10.781 62.34 l 10.684 62.574 l 10.562 62.746 l 10.438 62.867 l 10.402
 62.883 l 10.316 62.895 l 10.094 62.887 l 9.938 62.848 l 9.797 62.785 l 
9.754 62.742 l 9.746 62.727 l 9.707 62.555 l 9.715 62.34 l 9.754 62.141 
l 9.871 61.914 l 10.051 61.676 l 10.281 61.473 l 10.613 61.305 l 10.84 61.207
 l 10.984 61.184 l 11.105 61.195 l 11.246 61.215 l 11.414 61.254 l 11.613
 61.293 l 11.789 61.289 l 12.48 61.57 l f
15.395 53.977 m 15.375 54.773 l 15.375 55.117 l 15.414 55.648 l 15.473 
56.523 l 15.531 57.52 l 15.559 58.52 l 15.523 59.547 l 15.52 60.496 l 15.555
 61.383 l 15.668 62.176 l 15.859 62.902 l 16.094 63.539 l 16.367 64.066 
l 16.621 64.488 l 16.93 64.828 l 17.324 65.102 l 17.633 65.211 l 17.949 
65.309 l 18.461 65.332 l 19.012 65.105 l 19.48 64.68 l 19.605 64.117 l 19.414
 63.496 l 19.477 63.375 l 19.285 63.273 l 19.223 63.395 l 18.613 63.582 
l 18.367 63.68 l 18.262 63.668 l 18.234 63.648 l 18.266 63.637 l 18.184 
63.605 l 18.121 63.582 l 18.059 63.539 l 17.992 63.465 l 17.855 63.234 l
 17.656 62.852 l 17.488 62.391 l 17.34 61.836 l 17.254 61.223 l 17.219 60.461
 l 17.219 59.574 l 17.25 58.516 l 17.207 57.434 l 17.133 56.402 l 17.051
 55.477 l 16.941 54.852 l 16.816 54.625 l 16.801 53.977 l f
16.023 60.781 m 16.629 60.504 l 16.723 60.512 l 17.102 60.457 l 17.566 
60.395 l 18.039 60.297 l 18.555 60.207 l 18.988 60.07 l 19.395 59.926 l 
19.797 59.691 l 20.191 59.23 l 20.25 59.223 l 20.246 59.16 l 20.188 59.164
 l 19.699 58.77 l 19.215 58.656 l 18.742 58.637 l 18.301 58.676 l 17.789
 58.715 l 17.301 58.801 l 16.859 58.863 l 16.449 58.941 l 16.113 59.027 
l 15.332 59.496 l f
23.293 58.395 m 23.223 59.273 l 23.137 59.57 l 23.055 59.98 l 22.98 60.348
 l 22.898 60.648 l 22.754 60.961 l 22.66 61.188 l 22.492 61.379 l 22.277
 61.602 l 22.082 61.754 l 21.844 61.867 l 21.656 61.953 l 21.492 61.996 
l 21.43 62.012 l 21.438 62.016 l 21.504 62.055 l 21.48 62.043 l 21.387 61.883
 l 21.266 61.625 l 21.18 61.395 l 21.098 61.168 l 21.082 61.078 l 21.07 
61.121 l 21.051 61.152 l 21.113 61.113 l 21.34 61.023 l 21.66 60.941 l 22.008
 60.863 l 22.359 60.832 l 22.613 60.812 l 22.742 60.848 l 22.836 60.918 
l 23 61.074 l 23.129 61.312 l 23.363 61.785 l 23.648 62.281 l 23.887 62.863
 l 24.242 63.484 l 24.551 64.066 l 24.867 64.605 l 25.137 65.062 l 25.465
 65.434 l 25.723 65.695 l 25.988 65.871 l 26.398 65.98 l 26.828 65.906 l
 27.062 65.652 l 27.59 65.445 l 27.234 64.535 l 26.707 64.742 l 26.656 64.598
 l 26.773 64.488 l 26.789 64.441 l 26.832 64.453 l 26.711 64.305 l 26.504
 64.07 l 26.312 63.75 l 26.02 63.25 l 25.715 62.672 l 25.391 62.121 l 25.148
 61.539 l 24.816 60.984 l 24.562 60.52 l 24.262 60.031 l 23.789 59.633 l
 23.348 59.367 l 22.719 59.238 l 22.234 59.281 l 21.773 59.32 l 21.297 59.43
 l 20.863 59.539 l 20.398 59.719 l 19.938 60.023 l 19.613 60.504 l 19.504
 61.023 l 19.57 61.535 l 19.699 61.93 l 19.816 62.234 l 19.98 62.594 l 20.188
 62.984 l 20.543 63.375 l 21.031 63.609 l 21.52 63.645 l 21.836 63.594 l
 22.203 63.5 l 22.535 63.352 l 22.965 63.145 l 23.379 62.805 l 23.703 62.473
 l 24.066 62.035 l 24.246 61.598 l 24.43 61.176 l 24.547 60.676 l 24.609
 60.246 l 24.664 59.836 l 24.707 59.422 l 24.688 58.434 l f
27.93 64.699 m 29.059 64.695 l 29.438 64.699 l 29.852 64.703 l 31.52 64.703
 l 31.855 64.672 l 32.25 64.664 l 32.566 64.578 l 32.879 64.461 l 33.207
 64.227 l 33.316 63.965 l 33.422 63.52 l 33.66 63.383 l 33.438 62.992 l 
33.199 63.129 l 32.73 63.02 l 32.512 62.973 l 32.352 62.965 l 32.188 62.965
 l 32.059 62.98 l 31.777 62.977 l 31.449 63 l 29.438 63 l 29.043 63.008 
l 27.906 63.039 l f
36.508 58.773 m 36.32 59.922 l 36.27 60.43 l 36.227 61.02 l 36.223 61.633
 l 36.215 62.262 l 36.289 62.898 l 36.367 63.516 l 36.566 64.074 l 36.742
 64.516 l 37.051 64.93 l 37.422 65.176 l 37.785 65.285 l 38.23 65.32 l 38.695
 65.184 l 39.176 64.938 l 39.441 64.504 l 39.523 63.934 l 39.285 63.453 
l 39.348 63.191 l 38.902 63.09 l 38.844 63.348 l 38.453 63.531 l 38.156 
63.66 l 38.121 63.609 l 38.109 63.594 l 38.07 63.598 l 38.105 63.598 l 38.16
 63.613 l 38.246 63.672 l 38.164 63.465 l 38.035 63.109 l 37.977 62.691 
l 37.914 62.164 l 37.91 61.633 l 37.906 61.074 l 37.934 60.547 l 37.961 
60.098 l 38.078 58.988 l f
37.863 56.402 m 37.031 55.922 l 37.195 57.273 l 36.855 57.488 l 36.562 
57.168 l 36.816 57.09 l 37.16 57.363 l 37.625 56.777 l 37.285 56.504 l 37.191
 56.148 l 36.594 55.691 l 36.109 56.035 l 36.273 57.383 l 37.145 57.789 
l f
0 g
53.043 82.359 m 52.422 82.242 l 52.598 83.418 l 52.594 83.617 l 52.793 
83.652 l 53.254 83.629 l 53.941 83.598 l 54.723 83.566 l 55.57 83.477 l 
56.402 83.383 l 57.285 83.254 l 58.102 83.102 l 58.949 82.98 l 59.797 82.828
 l 60.664 82.711 l 61.598 82.586 l 62.5 82.438 l 63.461 82.348 l 64.359 
82.254 l 65.266 82.133 l 66.09 82.07 l 66.926 82.012 l 67.797 81.98 l 68.645
 81.949 l 69.578 81.922 l 70.531 81.859 l 71.551 81.832 l 72.617 81.77 l
 73.707 81.707 l 74.781 81.645 l 75.871 81.617 l 76.93 81.555 l 77.938 81.523
 l 78.926 81.496 l 79.867 81.465 l 80.75 81.465 l 81.637 81.434 l 83.305
 81.434 l 84.086 81.402 l 84.871 81.402 l 85.637 81.371 l 86.383 81.34 l
 87.219 81.309 l 88.016 81.25 l 88.816 81.188 l 89.617 81.156 l 90.383 81.129
 l 93.082 81.129 l 93.766 81.125 l 95.738 81.125 l 96.398 81.184 l 97.035
 81.215 l 97.605 81.277 l 98.191 81.309 l 98.699 81.309 l 99.211 81.34 l
 99.762 81.34 l 100.344 81.371 l 102.281 81.371 l 102.57 81.398 l 102.852
 81.402 l 102.984 81.418 l 103.086 81.426 l 103.164 81.438 l 103.324 81.453
 l 103.539 81.461 l 103.809 81.461 l 104.105 81.465 l 104.449 81.492 l 104.789
 81.492 l 105.133 81.52 l 105.465 81.523 l 105.637 81.523 l 105.773 81.543
 l 105.891 81.547 l 106.02 81.566 l 106.254 81.578 l 106.445 81.582 l 106.668
 81.586 l 106.918 81.605 l 107.273 81.641 l 107.66 81.672 l 108.066 81.703
 l 108.355 81.707 l 108.594 81.707 l 108.766 80.012 l 108.559 80.094 l 108.234
 80.336 l 107.699 80.328 l 107.68 81.297 l 108.215 81.309 l 108.395 81.562
 l 108.422 81.691 l 108.594 79.996 l 108.367 79.996 l 108.145 79.992 l 107.801
 79.965 l 107.422 79.934 l 107.07 79.902 l 106.754 79.875 l 106.465 79.871
 l 106.316 79.867 l 106.199 79.863 l 106.062 79.84 l 105.93 79.836 l 105.754
 79.812 l 105.477 79.812 l 105.211 79.809 l 104.871 79.781 l 104.527 79.777
 l 104.176 79.75 l 103.578 79.75 l 103.43 79.742 l 103.398 79.738 l 103.289
 79.719 l 103.148 79.715 l 102.984 79.691 l 102.66 79.688 l 102.359 79.66
 l 100.391 79.66 l 99.809 79.629 l 99.266 79.625 l 98.754 79.598 l 98.246
 79.598 l 97.746 79.566 l 97.168 79.508 l 96.516 79.477 l 95.816 79.414 
l 90.352 79.414 l 89.555 79.445 l 88.723 79.477 l 87.887 79.539 l 87.121
 79.598 l 86.316 79.629 l 85.566 79.66 l 84.836 79.691 l 84.055 79.691 l
 83.273 79.723 l 81.609 79.723 l 80.723 79.754 l 79.84 79.754 l 78.875 79.781
 l 77.887 79.812 l 76.855 79.844 l 75.801 79.906 l 74.711 79.938 l 73.609
 80 l 72.52 80.062 l 71.477 80.121 l 70.453 80.152 l 69.496 80.215 l 68.59
 80.246 l 67.738 80.277 l 66.836 80.309 l 65.969 80.371 l 65.094 80.434 
l 64.16 80.559 l 63.293 80.648 l 62.281 80.742 l 61.344 80.898 l 60.438 
81.02 l 59.531 81.145 l 58.68 81.301 l 57.824 81.426 l 57.008 81.578 l 56.188
 81.695 l 55.383 81.785 l 54.594 81.875 l 53.871 81.906 l 53.16 81.941 l
 52.711 81.977 l 52.25 82.039 l 52.121 82.285 l 52.297 83.461 l 52.934 83.469
 l f
52.129 102.473 m 53.293 102.473 l 53.77 102.453 l 54.309 102.422 l 54.871
 102.363 l 55.477 102.309 l 56.238 102.246 l 57.062 102.152 l 58.039 102.062
 l 59.047 101.973 l 60.195 101.914 l 61.445 101.828 l 62.793 101.797 l 64.191
 101.738 l 65.543 101.707 l 66.902 101.676 l 68.188 101.648 l 69.426 101.648
 l 70.664 101.68 l 71.891 101.742 l 73.125 101.77 l 74.305 101.801 l 75.461
 101.863 l 76.547 101.895 l 77.637 101.957 l 78.738 101.988 l 79.793 102.02
 l 80.859 102.051 l 81.949 102.051 l 82.992 102.078 l 85.102 102.141 l 86.137
 102.172 l 87.086 102.172 l 88.004 102.203 l 88.852 102.203 l 89.617 102.234
 l 90.398 102.266 l 91.129 102.297 l 91.844 102.297 l 92.504 102.328 l 93.145
 102.355 l 93.793 102.387 l 94.398 102.418 l 94.949 102.449 l 95.488 102.508
 l 96.016 102.539 l 96.961 102.602 l 97.387 102.633 l 98.25 102.633 l 98.77
 102.664 l 99.355 102.664 l 99.969 102.695 l 101.156 102.695 l 101.699 102.727
 l 102.164 102.727 l 102.562 102.754 l 102.883 102.758 l 104.172 102.758
 l 104.418 102.73 l 104.652 102.727 l 106.219 102.727 l 106.367 102.703 
l 106.449 102.699 l 106.523 102.699 l 106.695 102.695 l 107.102 102.695 
l 107.371 102.672 l 107.652 102.668 l 108.074 102.664 l 109.223 102.664 
l 109.496 102.641 l 109.688 102.637 l 109.797 102.633 l 109.887 102.629 
l 110.418 101.121 l 110.148 100.984 l 109.473 101.316 l 109.066 101.27 l
 108.98 102.02 l 109.387 102.066 l 109.516 102.488 l 109.348 102.438 l 109.879
 100.93 l 109.789 100.926 l 109.668 100.926 l 109.398 100.93 l 109.141 100.953
 l 107.637 100.953 l 107.273 100.961 l 107.02 100.98 l 106.777 100.98 l 
106.684 100.984 l 106.492 100.984 l 106.379 100.988 l 106.199 100.996 l 
106.094 101.012 l 104.633 101.012 l 104.312 101.02 l 104.086 101.043 l 102.891
 101.043 l 102.629 101.039 l 102.227 101.012 l 101.746 101.012 l 101.203
 100.98 l 100.012 100.98 l 99.398 100.949 l 98.82 100.949 l 98.301 100.922
 l 97.832 100.922 l 97.457 100.918 l 97.078 100.891 l 96.598 100.859 l 96.125
 100.828 l 95.637 100.801 l 95.09 100.738 l 94.488 100.707 l 93.875 100.676
 l 93.227 100.645 l 92.582 100.617 l 91.883 100.586 l 91.164 100.586 l 90.469
 100.555 l 89.684 100.523 l 88.887 100.492 l 88.035 100.492 l 87.117 100.465
 l 86.164 100.465 l 85.152 100.434 l 83.043 100.371 l 81.977 100.34 l 80.887
 100.34 l 79.844 100.312 l 78.789 100.281 l 77.711 100.25 l 76.621 100.191
 l 75.531 100.16 l 74.371 100.098 l 73.168 100.066 l 71.953 100.039 l 70.73
 99.977 l 69.449 99.945 l 68.168 99.945 l 66.867 99.98 l 65.504 100.008 
l 64.133 100.039 l 62.738 100.102 l 61.363 100.137 l 60.09 100.23 l 58.926
 100.297 l 57.891 100.391 l 56.891 100.484 l 56.074 100.578 l 55.328 100.641
 l 54.699 100.707 l 54.168 100.77 l 53.668 100.805 l 53.227 100.84 l 52.098
 100.887 l f
51.27 121.562 m 52.387 121.566 l 52.961 121.516 l 53.582 121.461 l 54.406
 121.371 l 55.281 121.223 l 56.172 121.07 l 57.125 120.891 l 58.023 120.746
 l 58.891 120.629 l 59.844 120.516 l 60.836 120.457 l 61.961 120.398 l 63.117
 120.336 l 64.262 120.277 l 65.43 120.246 l 68.676 120.246 l 69.668 120.277
 l 70.641 120.34 l 71.59 120.402 l 72.449 120.465 l 73.262 120.496 l 74.008
 120.559 l 74.758 120.59 l 75.492 120.648 l 76.262 120.766 l 77.055 120.859
 l 77.82 120.953 l 78.656 121.02 l 79.492 121.023 l 80.309 121.051 l 81.16
 121.051 l 82.012 121.082 l 84.32 121.082 l 84.961 121.113 l 85.57 121.113
 l 86.184 121.145 l 86.812 121.145 l 87.441 121.203 l 88.105 121.234 l 88.766
 121.32 l 89.391 121.387 l 90.082 121.449 l 90.762 121.508 l 91.445 121.57
 l 92.215 121.633 l 92.91 121.664 l 93.57 121.695 l 94.211 121.754 l 94.766
 121.785 l 95.281 121.816 l 95.785 121.875 l 96.285 121.906 l 96.801 121.938
 l 97.312 121.969 l 97.82 122 l 98.293 122.031 l 98.734 122.059 l 99.16 
122.121 l 99.594 122.125 l 99.965 122.152 l 100.371 122.156 l 100.82 122.156
 l 101.23 122.129 l 101.645 122.125 l 102.121 122.125 l 102.488 122.098 
l 102.828 122.094 l 103.84 122.094 l 104.066 122.07 l 104.312 122.066 l 
104.73 122.062 l 105.102 122.035 l 105.488 122 l 105.758 121.977 l 106.039
 121.973 l 106.207 121.949 l 106.348 121.941 l 106.508 121.91 l 106.66 121.879
 l 106.746 121.859 l 106.844 121.852 l 107.094 121.816 l 107.273 121.789
 l 107.477 121.758 l 107.691 121.723 l 107.875 121.691 l 108.039 121.652
 l 108.309 121.566 l 108.574 121.223 l 108.609 120.961 l 109.031 120.43 
l 108.105 119.703 l 107.688 120.234 l 107.559 120.18 l 107.57 120.027 l 
107.652 119.988 l 107.418 120.027 l 107.219 120.059 l 107.004 120.09 l 106.848
 120.117 l 106.656 120.141 l 106.484 120.156 l 106.301 120.195 l 106.176
 120.223 l 106.148 120.227 l 106.043 120.23 l 105.91 120.25 l 105.66 120.254
 l 105.336 120.285 l 104.965 120.316 l 104.66 120.34 l 104.289 120.34 l 
103.957 120.348 l 103.75 120.371 l 102.418 120.371 l 102.055 120.402 l 101.168
 120.402 l 100.762 120.43 l 100.039 120.43 l 99.672 120.402 l 99.293 120.398
 l 98.914 120.344 l 98.406 120.309 l 97.93 120.277 l 96.906 120.215 l 96.395
 120.188 l 95.945 120.156 l 95.434 120.098 l 94.863 120.062 l 94.34 120.035
 l 93.691 119.973 l 92.988 119.941 l 92.328 119.91 l 91.594 119.852 l 90.918
 119.789 l 90.238 119.727 l 89.559 119.668 l 88.965 119.605 l 88.262 119.512
 l 87.562 119.48 l 86.898 119.418 l 86.23 119.418 l 85.617 119.387 l 85.004
 119.387 l 84.359 119.359 l 82.043 119.359 l 81.191 119.328 l 80.34 119.328
 l 79.523 119.297 l 78.723 119.297 l 77.992 119.242 l 77.262 119.152 l 76.492
 119.062 l 75.695 118.938 l 74.859 118.871 l 74.113 118.844 l 73.367 118.781
 l 72.547 118.754 l 71.707 118.695 l 70.75 118.633 l 69.75 118.57 l 68.699
 118.543 l 65.41 118.543 l 64.195 118.574 l 63.027 118.637 l 61.867 118.699
 l 60.742 118.762 l 59.691 118.828 l 58.672 118.957 l 57.77 119.086 l 56.828
 119.246 l 55.875 119.434 l 54.992 119.59 l 54.164 119.742 l 53.406 119.84
 l 52.789 119.91 l 52.285 119.98 l 51.246 120.023 l f
136.793 30.438 m 136.094 30.309 l 136.012 30.238 l 135.762 30.18 l 135.484
 30.191 l 135.188 30.262 l 134.926 30.359 l 134.68 30.449 l 134.344 30.578
 l 134.059 30.773 l 133.758 30.918 l 133.504 31.238 l 133.27 31.492 l 133.051
 31.82 l 132.832 32.145 l 132.57 32.574 l 132.398 33.051 l 132.238 33.473
 l 132.152 33.918 l 132.078 34.367 l 132 34.824 l 131.992 35.324 l 132.031
 35.844 l 132.102 36.219 l 132.18 36.637 l 132.32 37.078 l 132.535 37.453
 l 132.711 37.73 l 132.984 38.039 l 133.215 38.254 l 133.477 38.492 l 133.871
 38.742 l 134.148 38.898 l 134.535 39.129 l 134.844 39.234 l 135.027 39.332
 l 135.484 39.504 l 135.906 39.527 l 136.262 39.559 l 136.727 39.531 l 137.074
 39.5 l 137.578 39.457 l 137.965 39.262 l 138.391 39.086 l 138.688 38.805
 l 138.934 38.609 l 139.23 38.309 l 139.406 38.051 l 139.605 37.781 l 139.734
 37.418 l 139.848 37.09 l 139.957 36.762 l 140.066 36.367 l 140.18 35.969
 l 140.254 35.602 l 140.332 35.191 l 140.371 34.867 l 140.402 34.594 l 140.445
 34.199 l 140.449 33.855 l 140.449 33.5 l 140.41 33.105 l 140.312 32.625
 l 140.082 32.211 l 139.863 31.848 l 139.512 31.469 l 139.113 31.176 l 138.758
 30.957 l 138.305 30.719 l 137.887 30.512 l 137.43 30.336 l 137.055 30.199
 l 136.617 30.09 l 136.254 30.02 l 135.852 29.984 l 135.441 29.922 l 134.965
 29.922 l 134.496 29.945 l 134.062 30.129 l 133.781 30.527 l 133.578 30.883
 l 133.414 30.934 l 133.488 31.164 l 133.648 31.113 l 133.973 31.301 l 134.359
 31.574 l 134.68 31.59 l 134.953 31.613 l 135.297 31.625 l 135.641 31.684
 l 136 31.719 l 136.23 31.766 l 136.547 31.848 l 136.828 31.953 l 137.195
 32.09 l 137.516 32.25 l 137.902 32.457 l 138.152 32.609 l 138.359 32.762
 l 138.48 32.891 l 138.594 33.078 l 138.68 33.23 l 138.707 33.363 l 138.73
 33.582 l 138.73 33.84 l 138.727 34.098 l 138.695 34.398 l 138.664 34.66
 l 138.629 34.93 l 138.566 35.266 l 138.508 35.559 l 138.41 35.898 l 138.312
 36.254 l 138.215 36.543 l 138.109 36.852 l 138.07 36.969 l 138.004 37.059
 l 137.902 37.207 l 137.785 37.324 l 137.562 37.504 l 137.441 37.617 l 137.25
 37.691 l 137.098 37.77 l 136.922 37.785 l 136.594 37.812 l 136.285 37.832
 l 136.027 37.809 l 135.836 37.801 l 135.746 37.766 l 135.535 37.648 l 135.254
 37.555 l 135.012 37.414 l 134.758 37.27 l 134.523 37.121 l 134.379 36.988
 l 134.215 36.836 l 134.09 36.695 l 134.008 36.566 l 133.898 36.379 l 133.848
 36.219 l 133.789 35.898 l 133.734 35.617 l 133.707 35.273 l 133.711 34.98
 l 133.77 34.648 l 133.836 34.223 l 133.891 33.941 l 134.004 33.637 l 134.117
 33.316 l 134.27 33.062 l 134.469 32.762 l 134.613 32.539 l 134.789 32.348
 l 134.844 32.273 l 134.922 32.234 l 135.141 32.078 l 135.285 32.02 l 135.535
 31.918 l 135.711 31.84 l 135.777 31.812 l 135.773 31.797 l 135.789 31.762
 l 135.887 31.727 l 136.684 31.719 l f
52.656 10.031 m 53.508 9.945 l 53.812 9.977 l 54.273 9.984 l 54.957 10.016
 l 55.695 9.988 l 56.547 9.988 l 57.414 9.957 l 58.266 9.93 l 59.102 9.898
 l 59.918 9.902 l 60.699 9.871 l 62.25 9.871 l 63.102 9.875 l 63.957 9.875
 l 64.812 9.934 l 65.66 9.992 l 66.473 10.055 l 67.254 10.117 l 68.035 10.176
 l 68.836 10.242 l 69.672 10.273 l 70.453 10.305 l 71.258 10.332 l 72.074
 10.395 l 72.945 10.43 l 73.902 10.461 l 74.938 10.492 l 77.152 10.492 l
 78.309 10.523 l 79.465 10.523 l 80.578 10.555 l 81.629 10.586 l 82.684 
10.617 l 83.668 10.648 l 84.57 10.676 l 85.477 10.738 l 86.359 10.797 l 
87.23 10.859 l 88.152 10.953 l 89.145 11.012 l 90.129 11.105 l 91.109 11.168
 l 92.074 11.199 l 92.992 11.23 l 93.82 11.262 l 97.461 11.262 l 98.211 
11.23 l 104.27 11.23 l 105.086 11.199 l 106.547 11.199 l 107.262 11.168 
l 107.91 11.168 l 108.52 11.141 l 109.133 11.141 l 109.801 11.109 l 110.516
 11.078 l 111.246 11.047 l 113.457 11.047 l 114.207 11.016 l 115.809 11.016
 l 116.605 10.984 l 117.355 10.957 l 118.074 10.926 l 118.754 10.895 l 119.453
 10.863 l 120.102 10.801 l 120.746 10.77 l 121.395 10.711 l 122.043 10.68
 l 122.68 10.613 l 123.23 10.551 l 123.719 10.492 l 124.203 10.465 l 124.711
 10.434 l 125.254 10.402 l 125.832 10.371 l 126.414 10.34 l 126.992 10.309
 l 127.535 10.281 l 128.09 10.25 l 133.684 10.25 l 133.949 10.227 l 134.266
 10.219 l 134.648 10.188 l 135.008 10.156 l 135.199 10.133 l 135.422 10.129
 l 135.566 10.125 l 135.457 10.125 l 135.191 10 l 135.078 9.84 l 135.109
 9.902 l 135.16 10.07 l 135.234 10.398 l 135.332 10.781 l 135.395 11.227
 l 135.465 11.773 l 135.527 12.297 l 135.562 12.832 l 135.562 13.473 l 135.594
 14.086 l 135.598 14.668 l 135.629 15.246 l 135.664 15.766 l 135.699 16.289
 l 135.73 16.75 l 135.73 21.035 l 135.77 21.512 l 135.844 21.898 l 135.906
 22.172 l 135.945 22.488 l 136.004 22.73 l 136.043 23.023 l 136.117 23.363
 l 136.184 23.703 l 136.246 24.008 l 136.277 24.27 l 136.316 24.598 l 136.383
 24.973 l 136.414 25.277 l 136.449 25.586 l 136.484 25.871 l 136.508 26.035
 l 136.512 26.188 l 136.516 26.387 l 136.516 27.508 l 136.492 27.727 l 136.484
 27.949 l 136.484 28.09 l 136.461 28.262 l 136.453 28.492 l 136.449 28.656
 l 136.449 28.98 l 136.457 28.996 l 136.508 29.031 l 136.48 29.832 l 137.836
 30.062 l 138.074 29.297 l 138.16 29.145 l 138.168 28.984 l 138.168 28.672
 l 138.172 28.539 l 138.176 28.41 l 138.203 28.211 l 138.203 27.984 l 138.207
 27.848 l 138.234 27.605 l 138.234 26.148 l 138.223 25.879 l 138.188 25.641
 l 138.156 25.387 l 138.125 25.094 l 138.086 24.73 l 138.02 24.352 l 137.988
 24.07 l 137.945 23.73 l 137.871 23.359 l 137.801 23.016 l 137.742 22.734
 l 137.695 22.402 l 137.637 22.172 l 137.602 21.879 l 137.531 21.551 l 137.477
 21.281 l 137.453 20.965 l 137.453 16.688 l 137.414 16.172 l 137.383 15.652
 l 137.348 15.137 l 137.316 14.617 l 137.316 14.039 l 137.281 13.426 l 137.281
 12.777 l 137.242 12.141 l 137.172 11.562 l 137.102 10.996 l 137.02 10.445
 l 136.91 10.004 l 136.828 9.621 l 136.715 9.277 l 136.578 8.977 l 136.34
 8.637 l 135.844 8.402 l 135.402 8.402 l 135.078 8.41 l 134.828 8.441 l 
134.504 8.469 l 134.188 8.496 l 133.855 8.5 l 133.605 8.523 l 128.047 8.523
 l 127.441 8.559 l 126.902 8.586 l 125.746 8.648 l 125.16 8.68 l 124.609
 8.711 l 124.098 8.742 l 123.562 8.773 l 123.035 8.836 l 122.504 8.898 l
 121.918 8.953 l 121.273 8.984 l 120.629 9.047 l 119.98 9.078 l 119.336 
9.137 l 118.68 9.168 l 118 9.195 l 117.289 9.227 l 116.539 9.258 l 115.777
 9.289 l 114.176 9.289 l 113.426 9.32 l 111.211 9.32 l 110.445 9.352 l 109.723
 9.383 l 109.094 9.41 l 108.48 9.41 l 107.867 9.441 l 107.227 9.441 l 106.512
 9.473 l 105.055 9.473 l 104.238 9.504 l 98.176 9.504 l 97.426 9.535 l 93.852
 9.535 l 93.051 9.504 l 92.133 9.473 l 91.191 9.441 l 90.266 9.383 l 89.277
 9.293 l 88.293 9.23 l 87.375 9.141 l 86.477 9.078 l 85.594 9.016 l 84.656
 8.953 l 83.723 8.922 l 82.734 8.891 l 81.68 8.859 l 80.625 8.832 l 79.488
 8.801 l 78.328 8.801 l 77.172 8.77 l 74.961 8.77 l 73.953 8.738 l 73 8.711
 l 72.168 8.68 l 71.352 8.621 l 70.52 8.59 l 69.734 8.559 l 68.934 8.531
 l 68.168 8.469 l 67.387 8.41 l 66.602 8.348 l 65.785 8.285 l 64.93 8.223
 l 64.016 8.16 l 62.246 8.16 l 61.43 8.164 l 60.664 8.164 l 59.883 8.195
 l 59.066 8.195 l 58.199 8.227 l 57.352 8.262 l 56.516 8.293 l 55.656 8.293
 l 54.961 8.324 l 54.316 8.297 l 53.855 8.301 l 53.426 8.297 l 52.43 8.477
 l f
0 0 1 rg
0 4.277 m 0.262 5.289 l 0.344 5.707 l 0.406 6.238 l 0.5 6.836 l 0.5 7.445
 l 0.496 8.086 l 0.496 8.688 l 0.531 9.273 l 0.566 9.703 l 0.594 10.031 
l 0.598 10.285 l 0.625 10.449 l 0.629 10.484 l 2.07 9.82 l 2.215 9.961 l
 2.215 9.957 l 2.117 9.648 l 2.051 9.297 l 1.992 8.938 l 1.988 8.516 l 2.074
 8.008 l 2.156 7.535 l 2.355 7.094 l 2.621 6.668 l 2.832 6.352 l 3.098 6.082
 l 3.297 5.902 l 3.422 5.82 l 3.512 5.773 l 3.598 5.746 l 3.59 5.746 l 3.555
 5.734 l 3.641 5.785 l 3.828 5.945 l 4.133 6.281 l 4.488 6.539 l 4.727 6.723
 l 4.945 6.898 l 5.234 7.02 l 5.535 7.121 l 5.867 7.059 l 6.027 6.941 l 
6.625 6.973 l 6.68 5.961 l 6.086 5.93 l 5.996 5.797 l 6.012 5.688 l 5.984
 5.613 l 5.891 5.535 l 5.797 5.434 l 5.5 5.195 l 5.258 5.023 l 5 4.738 l
 4.609 4.406 l 4.195 4.172 l 3.668 4.031 l 3.184 4.117 l 2.875 4.219 l 2.586
 4.359 l 2.266 4.574 l 1.941 4.867 l 1.535 5.277 l 1.211 5.746 l 0.871 6.293
 l 0.531 7.023 l 0.406 7.715 l 0.293 8.379 l 0.297 9.078 l 0.379 9.586 l
 0.465 10.059 l 0.566 10.383 l 0.652 10.801 l 0.875 11.02 l 2.32 10.359 
l 2.312 10.246 l 2.293 10.137 l 2.293 9.945 l 2.258 9.555 l 2.223 9.152 
l 2.191 8.637 l 2.191 7.441 l 2.188 6.699 l 2.074 6 l 1.996 5.41 l 1.855
 4.859 l 1.484 3.82 l f
10.625 4.652 m 9.762 4.516 l 9.438 4.434 l 9.094 4.371 l 8.578 4.348 l 
8.066 4.406 l 7.574 4.477 l 6.992 4.68 l 6.578 4.945 l 6.211 5.305 l 5.926
 5.883 l 6.012 6.516 l 6.258 7.094 l 6.633 7.613 l 7.168 8.102 l 7.695 8.516
 l 8.188 8.922 l 8.617 9.227 l 8.871 9.504 l 9.125 9.758 l 9.23 9.926 l 
9.363 10.156 l 9.406 10.23 l 9.398 10.18 l 9.398 10.207 l 9.402 10.152 l
 9.469 9.961 l 9.625 9.844 l 9.547 9.871 l 9.273 9.93 l 8.902 10.012 l 8.559
 10.043 l 8.148 10.07 l 7.77 10.078 l 7.488 10.066 l 7.32 10.078 l 7.254
 10.129 l 7.211 10.277 l 7.055 10.32 l 6.781 9.898 l 6.066 10.359 l 6.34
 10.781 l 6.352 11.086 l 6.578 11.43 l 6.98 11.641 l 7.332 11.707 l 7.703
 11.75 l 8.211 11.754 l 8.691 11.719 l 9.164 11.68 l 9.648 11.57 l 10.016
 11.488 l 10.414 11.344 l 10.852 11.023 l 11.016 10.578 l 11.055 10.293 
l 11.043 10.039 l 10.992 9.664 l 10.773 9.316 l 10.637 9.074 l 10.414 8.723
 l 10.059 8.367 l 9.711 7.988 l 9.191 7.621 l 8.73 7.234 l 8.234 6.848 l
 7.875 6.516 l 7.707 6.281 l 7.625 6.078 l 7.637 6.164 l 7.578 6.285 l 7.621
 6.238 l 7.73 6.164 l 7.977 6.07 l 8.293 6.016 l 8.676 5.961 l 9.012 5.949
 l 9.285 5.945 l 9.605 5.934 l 10.469 6 l f
12.664 0.477 m 12.711 1.398 l 12.699 1.809 l 12.707 2.367 l 12.73 2.98 
l 12.758 3.715 l 12.785 4.48 l 12.816 5.289 l 12.816 6.07 l 12.812 6.801
 l 12.812 7.555 l 12.887 8.184 l 12.953 8.746 l 13.035 9.293 l 13.195 9.746
 l 13.363 10.16 l 13.527 10.434 l 13.637 10.598 l 13.785 10.809 l 14.211
 11.102 l 14.699 11.137 l 15.035 11.023 l 15.457 10.738 l 15.66 10.227 l
 15.59 9.672 l 15.684 9.535 l 15.477 9.395 l 15.383 9.527 l 14.879 9.59 
l 14.625 9.551 l 14.52 9.5 l 14.578 9.453 l 14.824 9.465 l 15.012 9.59 l
 15.051 9.641 l 14.977 9.527 l 14.898 9.398 l 14.797 9.145 l 14.703 8.879
 l 14.652 8.52 l 14.586 7.984 l 14.523 7.461 l 14.523 6.07 l 14.52 5.258
 l 14.48 4.41 l 14.441 3.645 l 14.398 2.898 l 14.352 2.273 l 14.289 1.695
 l 14.203 1.254 l 14.039 0.324 l f
12.402 6.754 m 13.477 6.562 l 13.938 6.477 l 14.41 6.387 l 14.906 6.289
 l 15.43 6.129 l 15.918 5.934 l 16.273 5.68 l 16.469 5.371 l 16.785 5.301
 l 16.664 4.766 l 16.348 4.836 l 16.039 4.641 l 15.598 4.566 l 15.066 4.617
 l 14.562 4.703 l 14.102 4.789 l 13.617 4.883 l 13.152 4.988 l 12.09 5.23
 l f
17.371 4.871 m 18.023 5.57 l 18.168 5.781 l 18.281 6.078 l 18.406 6.504
 l 18.52 6.879 l 18.582 7.281 l 18.641 7.652 l 18.672 7.949 l 18.676 8.172
 l 18.676 8.262 l 18.684 8.227 l 18.984 7.648 l 19.918 7.957 l 20.035 8.285
 l 20.02 8.148 l 20.008 7.816 l 20.055 7.504 l 20.129 7.152 l 20.27 6.77
 l 20.523 6.363 l 20.789 5.949 l 21.109 5.602 l 21.375 5.34 l 21.66 5.18
 l 21.859 5.07 l 22.055 5.004 l 22.164 4.98 l 21.953 5.02 l 21.609 4.867
 l 21.555 4.777 l 21.598 5.133 l 21.621 5.605 l 21.582 6.227 l 21.578 6.871
 l 21.543 7.512 l 21.543 8.145 l 21.539 8.66 l 21.539 9.57 l 21.59 10.109
 l 21.781 10.535 l 21.926 10.742 l 22.164 11.047 l 22.559 11.164 l 22.723
 11.137 l 23.336 11.391 l 23.777 10.328 l 23.16 10.074 l 23.156 9.973 l 
23.258 9.922 l 23.316 9.93 l 23.277 9.801 l 23.227 9.688 l 23.215 9.5 l 
23.215 7.555 l 23.246 6.914 l 23.242 6.27 l 23.27 5.59 l 23.215 4.938 l 
23.102 4.391 l 22.875 3.781 l 22.223 3.473 l 21.852 3.527 l 21.582 3.625
 l 21.25 3.754 l 20.938 3.934 l 20.492 4.203 l 20.082 4.609 l 19.66 5.059
 l 19.312 5.562 l 18.957 6.086 l 18.691 6.699 l 18.566 7.219 l 18.484 7.707
 l 18.48 8.211 l 18.504 8.637 l 18.73 9.242 l 19.805 9.59 l 20.203 8.816
 l 20.258 8.617 l 20.297 8.398 l 20.293 8.16 l 20.293 7.863 l 20.25 7.438
 l 20.176 7.023 l 20.094 6.508 l 19.938 6.031 l 19.785 5.535 l 19.535 4.965
 l 19.168 4.539 l 18.402 3.828 l f
25.285 11.363 m 26.258 11.414 l 26.633 11.422 l 27.781 11.422 l 28.414 
11.426 l 28.992 11.395 l 29.473 11.395 l 29.875 11.359 l 30.195 11.32 l 
30.418 11.273 l 30.562 11.219 l 30.926 11.074 l 31.113 10.695 l 31.113 10.527
 l 31.426 9.973 l 30.48 9.438 l 30.168 9.992 l 30.082 9.969 l 30.137 9.746
 l 30.238 9.66 l 30.141 9.652 l 29.996 9.656 l 29.727 9.676 l 29.406 9.699
 l 28.945 9.699 l 28.371 9.727 l 27.16 9.727 l 26.633 9.73 l 26.258 9.738
 l 25.285 9.785 l f
33.273 4.039 m 33.344 5.176 l 33.402 5.668 l 33.469 6.281 l 33.535 6.891
 l 33.605 7.562 l 33.711 8.18 l 33.824 8.77 l 34.02 9.305 l 34.168 9.668
 l 34.371 10.09 l 34.629 10.359 l 34.789 10.504 l 35.156 10.742 l 35.488
 10.809 l 35.797 10.828 l 36.07 10.789 l 36.484 10.668 l 36.828 10.367 l
 37.094 9.973 l 37.172 9.395 l 36.898 8.883 l 36.953 8.621 l 36.496 8.527
 l 36.441 8.789 l 36.012 9.012 l 35.777 9.125 l 35.664 9.164 l 35.688 9.121
 l 35.746 9.098 l 35.758 9.094 l 35.727 9.086 l 35.824 9.105 l 35.859 9.129
 l 35.812 9.082 l 35.758 8.969 l 35.645 8.688 l 35.504 8.305 l 35.418 7.867
 l 35.32 7.324 l 35.254 6.707 l 35.184 6.09 l 35.109 5.449 l 35.031 4.977
 l 34.887 3.887 l f
33.441 1.594 m 34.082 1.598 l 34.086 1.457 l 34.707 1.809 l 35.348 0.684
 l 34.727 0.332 l 34.52 0.07 l 33.512 0 l f
4.664 74.613 m 4.477 73.969 l 3.23 74.215 l 3.074 74.41 l 3.082 74.789 
l 3.109 75.324 l 3.105 75.898 l 3.074 76.633 l 3.004 77.363 l 2.902 78.145
 l 2.797 78.988 l 2.727 79.766 l 2.656 80.516 l 2.621 81.195 l 2.617 81.855
 l 2.656 82.402 l 2.727 82.879 l 2.801 83.25 l 2.875 83.523 l 2.953 83.777
 l 3.023 83.949 l 3.074 84.078 l 3.246 84.375 l 3.648 84.672 l 4.18 84.699
 l 4.562 84.57 l 4.926 84.266 l 5.152 83.875 l 5.148 83.465 l 5.297 83.273
 l 5 83.051 l 4.855 83.246 l 4.562 83.23 l 4.305 83.133 l 4.066 83.121 l
 4.102 83.066 l 4.301 83.055 l 4.551 83.238 l 4.617 83.348 l 4.609 83.32
 l 4.562 83.207 l 4.516 83.051 l 4.465 82.863 l 4.41 82.582 l 4.352 82.215
 l 4.32 81.797 l 4.324 81.238 l 4.355 80.637 l 4.418 79.918 l 4.484 79.168
 l 4.688 77.543 l 4.754 76.742 l 4.789 75.934 l 4.785 75.27 l 4.738 74.664
 l 4.684 74.312 l 4.516 74.172 l 3.27 74.418 l 3.543 75.027 l f
9.102 79.145 m 8.18 78.957 l 7.871 78.922 l 7.473 79.043 l 6.992 79.305
 l 6.695 79.703 l 6.352 80.152 l 6.062 80.812 l 5.934 81.422 l 5.816 82.09
 l 5.812 82.77 l 5.898 83.344 l 6.086 83.961 l 6.426 84.441 l 6.879 84.777
 l 7.238 84.973 l 7.617 85.074 l 8.109 85.176 l 8.57 85.094 l 9.129 84.883
 l 9.629 84.547 l 9.973 84.094 l 10.277 83.668 l 10.496 83.113 l 10.555 
82.633 l 10.598 82.188 l 10.605 81.719 l 10.574 81.281 l 10.535 80.809 l
 10.406 80.324 l 10.227 79.863 l 10.016 79.543 l 9.848 79.305 l 9.633 78.98
 l 9.34 78.781 l 9.074 78.586 l 8.566 78.508 l 8.133 78.555 l 7.855 78.812
 l 7.695 79.074 l 7.395 79.16 l 7.523 79.629 l 7.824 79.543 l 8.066 79.695
 l 8.18 79.875 l 8.289 79.992 l 8.332 80.047 l 8.324 80.07 l 8.402 80.141
 l 8.453 80.23 l 8.621 80.48 l 8.727 80.641 l 8.809 80.848 l 8.875 81.098
 l 8.902 81.422 l 8.934 81.781 l 8.934 82.109 l 8.91 82.469 l 8.883 82.711
 l 8.82 82.883 l 8.648 83.129 l 8.488 83.34 l 8.375 83.418 l 8.133 83.508
 l 8.137 83.508 l 8.004 83.48 l 7.852 83.438 l 7.77 83.391 l 7.621 83.281
 l 7.586 83.227 l 7.512 82.984 l 7.465 82.656 l 7.465 82.238 l 7.555 81.73
 l 7.641 81.305 l 7.773 80.973 l 8 80.656 l 8.086 80.52 l 8.129 80.484 l
 8.094 80.477 l 8.023 80.453 l 8.883 80.547 l f
15.707 79.5 m 14.93 79.113 l 14.727 79.027 l 14.375 78.945 l 13.996 78.922
 l 13.469 78.953 l 12.863 79.195 l 12.316 79.512 l 11.758 80.039 l 11.34
 80.672 l 11.02 81.281 l 10.773 81.977 l 10.648 82.594 l 10.605 83.16 l 
10.699 83.766 l 10.922 84.234 l 11.199 84.559 l 11.535 84.828 l 12.051 84.992
 l 12.484 85.012 l 12.93 84.922 l 13.426 84.672 l 13.789 84.316 l 14.051
 83.906 l 14.348 83.484 l 14.516 82.98 l 14.73 82.496 l 14.887 81.953 l 
15.023 81.469 l 15.172 80.98 l 15.262 80.566 l 15.301 80.309 l 15.336 80.164
 l 15.348 80.047 l 13.703 80.016 l 13.711 80.199 l 13.777 80.535 l 13.859
 81.051 l 14.062 81.723 l 14.305 82.262 l 14.488 82.785 l 14.785 83.281 
l 14.961 83.621 l 15.191 83.992 l 15.422 84.227 l 15.562 84.348 l 15.723
 84.422 l 15.891 84.441 l 16.215 84.797 l 16.875 84.387 l 16.695 83.934 
l 16.723 83.73 l 16.711 83.574 l 16.656 83.371 l 16.5 83.117 l 16.398 82.887
 l 16.242 82.516 l 16 82.09 l 15.844 81.641 l 15.617 81.137 l 15.48 80.684
 l 15.41 80.242 l 15.355 79.988 l 15.352 79.93 l 13.707 79.898 l 13.707 
79.93 l 13.691 80.043 l 13.664 80.309 l 13.617 80.602 l 13.492 81.027 l 
13.359 81.523 l 13.238 81.957 l 13.043 82.406 l 12.922 82.762 l 12.738 83.02
 l 12.555 83.293 l 12.5 83.344 l 12.414 83.379 l 12.379 83.383 l 12.355 
83.375 l 12.328 83.363 l 12.355 83.383 l 12.328 83.348 l 12.305 83.285 l
 12.277 83.102 l 12.305 82.828 l 12.387 82.418 l 12.551 81.949 l 12.777 
81.52 l 13.047 81.109 l 13.324 80.84 l 13.602 80.668 l 13.852 80.555 l 14.035
 80.535 l 14.219 80.531 l 14.375 80.539 l 14.418 80.523 l 15.141 80.797 
l f
19.828 74.473 m 19.965 75.434 l 20 75.871 l 20.09 76.527 l 20.184 77.27
 l 20.246 78.031 l 20.348 78.84 l 20.379 79.652 l 20.449 80.418 l 20.48 
81.117 l 20.48 81.762 l 20.512 82.309 l 20.516 82.773 l 20.551 83.102 l 
20.559 83.367 l 20.605 83.574 l 20.648 83.688 l 22 84.02 l 22.195 83.766
 l 22.223 83.328 l 22.215 82.938 l 22.168 82.551 l 22.125 82.188 l 22.031
 81.668 l 21.832 81.238 l 21.672 80.824 l 21.402 80.406 l 21.137 80.113 
l 20.848 79.879 l 20.543 79.715 l 20.133 79.574 l 19.559 79.578 l 19.059
 79.848 l 18.602 80.184 l 18.199 80.719 l 17.922 81.262 l 17.727 81.895 
l 17.668 82.648 l 17.805 83.34 l 18.141 83.926 l 18.566 84.406 l 19.074 
84.758 l 19.555 84.984 l 20.055 85.082 l 20.379 85.121 l 20.703 85.133 l
 21.055 85.094 l 21.422 84.961 l 21.73 84.785 l 22.09 84.5 l 22.289 84.207
 l 22.484 83.93 l 22.523 83.527 l 22.531 83.156 l 22.688 83.012 l 22.473
 82.781 l 22.32 82.926 l 21.93 82.918 l 21.566 82.926 l 21.219 83.094 l 
20.988 83.281 l 20.836 83.367 l 20.727 83.422 l 20.672 83.441 l 20.629 83.445
 l 20.5 83.445 l 20.312 83.426 l 20.066 83.383 l 19.891 83.305 l 19.66 83.152
 l 19.48 82.957 l 19.352 82.746 l 19.301 82.531 l 19.32 82.176 l 19.402 
81.828 l 19.539 81.516 l 19.711 81.25 l 19.891 81.094 l 19.969 81.031 l 
19.945 81.016 l 20.012 81.02 l 20.09 81.051 l 20.184 81.125 l 20.297 81.25
 l 20.422 81.445 l 20.535 81.762 l 20.664 82.074 l 20.703 82.371 l 20.727
 82.684 l 20.738 82.988 l 20.719 83.234 l 20.715 83.082 l 20.836 82.91 l
 22.188 83.242 l 22.184 83.195 l 22.191 83.199 l 22.191 83.012 l 22.168 
82.695 l 22.168 82.258 l 22.133 81.711 l 22.133 81.078 l 22.098 80.309 l
 22.031 79.547 l 21.996 78.703 l 21.891 77.855 l 21.816 77.086 l 21.703 
76.289 l 21.582 75.617 l 21.469 75.152 l 21.203 74.188 l f
25.332 84.215 m 26.129 83.918 l 26.359 83.898 l 26.719 83.84 l 27.098 83.812
 l 27.5 83.785 l 27.918 83.754 l 28.227 83.723 l 28.543 83.688 l 28.934 
83.59 l 29.191 83.516 l 29.336 83.418 l 29.465 83.277 l 29.609 83.039 l 
30.125 82.875 l 29.844 81.996 l 29.328 82.16 l 29.125 82.035 l 28.918 81.973
 l 28.801 81.965 l 28.645 81.957 l 28.461 81.984 l 28.262 82.027 l 28.051
 82.051 l 27.773 82.078 l 27.375 82.105 l 26.965 82.141 l 26.516 82.176 
l 26.098 82.25 l 25.688 82.324 l 24.734 82.734 l f
31.711 77.621 m 31.457 78.594 l 31.414 79.074 l 31.367 79.664 l 31.332 
80.281 l 31.293 80.926 l 31.254 81.559 l 31.25 82.223 l 31.328 82.75 l 31.422
 83.262 l 31.719 83.789 l 32.121 84.133 l 32.488 84.336 l 33.055 84.527 
l 33.617 84.453 l 34.059 84.355 l 34.586 84.051 l 34.91 83.68 l 35.164 83.211
 l 35.023 82.582 l 35.109 82.41 l 34.816 82.266 l 34.73 82.438 l 34.23 82.539
 l 33.93 82.621 l 33.703 82.723 l 33.523 82.773 l 33.359 82.789 l 33.234
 82.801 l 33.18 82.781 l 33.094 82.734 l 33.047 82.695 l 33.039 82.676 l
 33.004 82.477 l 32.949 82.102 l 32.945 81.609 l 32.977 81.02 l 33.008 80.371
 l 33.035 79.758 l 33.059 79.145 l 33.039 78.77 l 33.148 77.906 l f
34.082 75.508 m 33.887 75.352 l 33.277 76.297 l 32.809 76.105 l 32.918 
75.98 l 33.348 76.266 l 33.836 75.527 l 33.406 75.242 l 33.242 74.938 l 
32.508 74.711 l 31.852 75.73 l 33.137 76.727 l f
2.488 102.965 m 3.16 102.992 l 3.277 103.059 l 3.496 103.105 l 3.898 103.188
 l 4.371 103.207 l 4.816 103.145 l 5.285 103.039 l 5.785 102.84 l 6.23 102.57
 l 6.59 102.293 l 6.93 101.914 l 7.188 101.504 l 7.328 101.07 l 7.465 100.656
 l 7.484 100.227 l 7.484 99.859 l 7.387 99.375 l 7.172 98.992 l 6.957 98.719
 l 6.629 98.445 l 6.156 98.27 l 5.691 98.238 l 5.086 98.367 l 4.551 98.68
 l 4.039 99.125 l 3.609 99.688 l 3.23 100.316 l 2.973 101.039 l 2.848 101.707
 l 2.754 102.434 l 2.93 103.145 l 3.148 103.785 l 3.504 104.277 l 3.836 
104.68 l 4.188 105.074 l 4.652 105.383 l 5.062 105.59 l 5.543 105.734 l 
5.957 105.781 l 6.312 105.777 l 6.699 105.762 l 7.098 105.695 l 7.566 105.504
 l 7.922 105.16 l 8.07 104.711 l 8.316 104.586 l 8.105 104.164 l 7.859 104.285
 l 7.406 104.137 l 7.062 104.148 l 6.836 104.133 l 6.629 104.117 l 6.328
 104.102 l 6.07 104.09 l 5.887 104.062 l 5.695 104.008 l 5.508 103.914 l
 5.309 103.781 l 5.125 103.574 l 4.844 103.238 l 4.672 102.996 l 4.555 102.66
 l 4.469 102.328 l 4.512 101.961 l 4.598 101.469 l 4.75 101.027 l 4.988 
100.613 l 5.254 100.25 l 5.516 100.016 l 5.688 99.914 l 5.809 99.891 l 5.805
 99.887 l 5.793 99.871 l 5.82 99.902 l 5.844 99.945 l 5.859 100.02 l 5.859
 100.191 l 5.852 100.363 l 5.785 100.555 l 5.703 100.789 l 5.617 100.914
 l 5.465 101.078 l 5.293 101.211 l 5.051 101.363 l 4.793 101.465 l 4.5 101.539
 l 4.262 101.582 l 4.051 101.59 l 3.734 101.547 l 3.48 101.535 l 3.258 101.559
 l 2.492 101.582 l f
8.836 99.852 m 9.188 100.871 l 9.289 101.238 l 9.32 101.695 l 9.383 102.215
 l 9.418 102.711 l 9.449 103.172 l 9.449 103.633 l 9.48 104.023 l 9.484 
104.23 l 9.465 104.406 l 9.469 104.402 l 9.719 103.809 l 10.828 103.91 l
 10.934 104.379 l 10.895 104.195 l 10.875 103.883 l 10.918 103.453 l 10.996
 102.965 l 11.145 102.469 l 11.402 101.883 l 11.699 101.281 l 12.02 100.695
 l 12.316 100.219 l 12.516 99.887 l 12.656 99.75 l 12.723 99.715 l 12.598
 99.801 l 12.266 99.785 l 12.117 99.688 l 12.172 99.879 l 12.285 100.312
 l 12.395 100.84 l 12.453 101.406 l 12.516 102.016 l 12.582 102.633 l 12.648
 103.164 l 12.684 103.664 l 12.719 104.141 l 12.781 104.41 l 12.805 104.652
 l 12.867 104.91 l 12.938 105.023 l 13.059 105.117 l 13.324 105.723 l 14.41
 105.422 l 14.324 104.766 l 14.383 104.621 l 14.41 104.582 l 14.426 104.508
 l 14.43 104.215 l 14.371 103.902 l 14.344 103.543 l 14.309 103.004 l 14.238
 102.441 l 14.168 101.832 l 14.094 101.219 l 14.012 100.559 l 13.848 99.906
 l 13.668 99.332 l 13.383 98.766 l 12.902 98.371 l 12.316 98.328 l 11.961
 98.535 l 11.73 98.727 l 11.426 99.059 l 11.156 99.508 l 10.848 100.004 
l 10.488 100.645 l 10.172 101.266 l 9.816 101.914 l 9.559 102.59 l 9.434
 103.219 l 9.348 103.797 l 9.344 104.32 l 9.383 104.691 l 9.555 105.422 
l 10.773 105.531 l 11.098 104.758 l 11.113 104.547 l 11.145 104.328 l 11.141
 103.949 l 11.109 103.562 l 11.109 103.109 l 11.074 102.594 l 11.035 102.051
 l 10.965 101.527 l 10.918 100.934 l 10.727 100.344 l 10.289 99.297 l f
16.602 105.359 m 17.375 104.945 l 17.516 104.914 l 17.777 104.852 l 18.137
 104.801 l 18.551 104.746 l 18.93 104.715 l 19.27 104.691 l 19.527 104.688
 l 19.738 104.688 l 19.91 104.703 l 19.977 104.703 l 20.109 104.688 l 20.352
 104.566 l 20.5 104.449 l 21.172 104.363 l 21.023 103.219 l 20.355 103.305
 l 20.309 103.211 l 20.285 103.078 l 20.148 103.02 l 20.051 103.012 l 19.84
 102.984 l 19.191 102.984 l 18.793 103.02 l 18.363 103.055 l 17.883 103.125
 l 17.406 103.207 l 16.957 103.355 l 16.629 103.527 l 15.816 104.113 l f
22.973 98.68 m 22.574 99.703 l 22.391 100.188 l 22.176 100.82 l 22.051 
101.5 l 21.973 102.102 l 21.895 102.766 l 21.895 103.477 l 22.012 104.066
 l 22.145 104.59 l 22.402 105.035 l 22.648 105.305 l 22.777 105.461 l 23.023
 105.656 l 23.555 105.93 l 24 105.84 l 24.375 105.648 l 24.703 105.277 l
 24.668 104.785 l 24.891 104.379 l 24.176 103.988 l 23.953 104.398 l 23.66
 104.375 l 23.625 104.281 l 23.57 104.25 l 23.84 104.188 l 23.961 104.246
 l 23.965 104.246 l 23.922 104.195 l 23.777 104.035 l 23.727 103.945 l 23.66
 103.691 l 23.582 103.312 l 23.582 102.863 l 23.645 102.297 l 23.703 101.738
 l 23.785 101.191 l 23.918 100.641 l 24.02 100.172 l 24.328 99.152 l f
21.836 97.984 m 22.77 98.055 l 23.316 98.215 l 23.605 97.246 l 23.062 97.082
 l 22.246 96.625 l f
6.273 118.121 m 5.445 118.086 l 5.051 118.039 l 4.691 118.051 l 4.223 118.105
 l 3.688 118.254 l 3.305 118.477 l 2.875 118.762 l 2.496 119.113 l 2.086
 119.539 l 1.68 120.133 l 1.414 120.824 l 1.246 121.508 l 1.16 122.234 l
 1.242 122.953 l 1.43 123.605 l 1.809 124.16 l 2.34 124.57 l 2.816 124.832
 l 3.324 124.969 l 3.832 125.059 l 4.312 125.027 l 4.816 124.988 l 5.348
 124.781 l 5.77 124.566 l 6.082 124.27 l 6.367 123.93 l 6.523 123.613 l 
6.531 123.113 l 6.754 122.891 l 6.363 122.504 l 6.141 122.73 l 5.668 122.719
 l 5.367 122.816 l 5.016 123.043 l 4.848 123.152 l 4.672 123.23 l 4.441 
123.312 l 4.195 123.332 l 3.93 123.348 l 3.691 123.309 l 3.457 123.246 l
 3.273 123.145 l 3.059 122.984 l 2.98 122.875 l 2.906 122.617 l 2.859 122.238
 l 2.91 121.805 l 3.023 121.32 l 3.176 120.906 l 3.387 120.578 l 3.672 120.258
 l 3.914 120 l 4.188 119.785 l 4.344 119.664 l 4.566 119.578 l 4.867 119.512
 l 5.113 119.469 l 5.449 119.426 l 6.273 119.391 l f
7.695 113.426 m 7.66 114.656 l 7.625 115.395 l 7.645 116.227 l 7.707 117.176
 l 7.805 118.07 l 7.867 118.883 l 7.934 119.664 l 7.965 120.352 l 8.035 
120.902 l 8.066 121.402 l 8.098 121.797 l 8.098 122.797 l 8.141 123.18 l
 8.219 123.465 l 8.332 123.82 l 8.57 124.145 l 8.832 124.391 l 9.285 124.621
 l 9.824 124.637 l 10.301 124.41 l 10.562 123.848 l 10.648 123.367 l 10.695
 123.316 l 10.652 123.277 l 10.605 123.328 l 10.199 123.383 l 9.816 123.176
 l 9.723 123.094 l 9.793 123.055 l 9.852 123.062 l 9.863 123.055 l 9.875
 123.059 l 9.855 122.988 l 9.82 122.863 l 9.805 122.707 l 9.805 121.727 
l 9.77 121.281 l 9.73 120.742 l 9.664 120.207 l 9.629 119.551 l 9.559 118.742
 l 9.488 117.906 l 9.379 117.02 l 9.309 116.129 l 9.258 115.359 l 9.227 
114.656 l 9.188 113.426 l f
12.398 113.074 m 12.359 114.422 l 12.324 115.258 l 12.309 116.211 l 12.301
 117.254 l 12.297 118.262 l 12.293 119.242 l 12.289 120.129 l 12.289 122.176
 l 12.328 122.676 l 12.398 123.012 l 12.438 123.188 l 12.484 123.336 l 12.617
 123.688 l 13.285 124.031 l 13.668 123.832 l 14.316 123.629 l 13.949 122.457
 l 13.297 122.66 l 13.543 122.508 l 14.012 122.703 l 14.094 122.887 l 14.09
 122.824 l 14.066 122.68 l 14.016 122.434 l 13.988 122.109 l 13.988 120.129
 l 13.984 119.242 l 13.98 118.262 l 13.977 117.25 l 13.969 116.207 l 13.953
 115.258 l 13.918 114.422 l 13.879 113.074 l f
14.258 120.18 m 15.008 119.473 l 15.434 119.156 l 15.844 118.809 l 16.25
 118.508 l 16.637 118.25 l 17.07 117.965 l 17.305 117.789 l 17.57 117.652
 l 17.707 117.523 l 17.754 117.508 l 17.238 116.098 l 16.973 116.098 l 16.543
 116.312 l 16.09 116.566 l 15.516 117 l 15.043 117.445 l 14.609 117.938 
l 14.25 118.461 l 13.957 118.977 l 13.766 119.523 l 13.699 120.098 l 13.801
 120.652 l 14.086 121.16 l 14.57 121.629 l 15.113 121.906 l 15.543 122.145
 l 16.023 122.414 l 16.449 122.594 l 16.809 122.809 l 17.125 123 l 17.391
 123.133 l 17.633 123.309 l 17.898 123.434 l 18.207 123.551 l 18.566 123.566
 l 18.879 123.473 l 19.203 123.203 l 19.602 123.211 l 19.621 122.523 l 19.219
 122.516 l 18.984 122.23 l 18.82 122.066 l 18.711 121.992 l 18.617 121.922
 l 18.512 121.863 l 18.281 121.691 l 17.945 121.52 l 17.672 121.355 l 17.211
 121.086 l 16.758 120.898 l 16.355 120.676 l 15.898 120.422 l 15.547 120.25
 l 15.422 120.129 l 15.391 120.078 l 15.383 120.035 l 15.395 119.895 l 15.477
 119.66 l 15.656 119.324 l 15.914 118.938 l 16.227 118.57 l 16.574 118.227
 l 16.98 117.91 l 17.305 117.727 l 17.406 117.668 l 17.344 117.656 l 16.828
 116.246 l 16.707 116.352 l 16.648 116.414 l 16.473 116.52 l 16.188 116.75
 l 15.805 117.016 l 15.383 117.301 l 14.906 117.68 l 14.496 118.07 l 14.078
 118.453 l 13.328 119.246 l f
20.277 123.926 m 21.371 123.926 l 21.645 123.949 l 22.02 124.012 l 22.371
 124.047 l 22.625 124.074 l 22.93 124.109 l 23.125 124.113 l 23.258 124.113
 l 23.418 124.105 l 23.566 123.984 l 24.406 123.855 l 24.184 122.375 l 23.344
 122.504 l 23.293 122.41 l 23.27 122.402 l 23.156 122.398 l 23.051 122.395
 l 22.816 122.371 l 22.547 122.34 l 22.23 122.312 l 21.84 122.254 l 21.418
 122.227 l 20.242 122.277 l f
25.367 118.691 m 25.234 119.902 l 25.191 120.457 l 25.156 120.953 l 25.086
 121.473 l 25.047 122.051 l 25.016 122.531 l 24.977 123.051 l 25.012 123.523
 l 25.043 123.801 l 25.098 124.23 l 25.316 124.648 l 25.594 124.898 l 25.934
 125.113 l 26.336 125.211 l 26.699 125.223 l 27.281 125.012 l 27.57 124.52
 l 27.566 123.973 l 27.691 123.816 l 27.445 123.617 l 27.32 123.773 l 26.879
 123.766 l 26.676 123.609 l 26.582 123.551 l 26.629 123.527 l 26.641 123.531
 l 26.695 123.582 l 26.766 123.711 l 26.75 123.594 l 26.723 123.359 l 26.699
 123.051 l 26.727 122.656 l 26.758 122.164 l 26.793 121.637 l 26.855 121.117
 l 26.891 120.57 l 26.918 120.043 l 27.02 118.852 l f
25.52 115.055 m 24.953 115.949 l 24.965 116.168 l 24.766 116.934 l 26.137
 117.289 l 26.336 116.523 l 26.383 116.613 l 26.875 116.012 l f
0 g
111.234 113.258 m 110.426 112.969 l 109.375 113.684 l 109.316 113.984 l
 109.48 114.34 l 109.641 114.68 l 109.926 115.102 l 110.203 115.484 l 110.539
 115.953 l 110.961 116.434 l 111.375 116.961 l 111.902 117.539 l 112.516
 118.094 l 113.121 118.637 l 113.898 119.234 l 114.727 119.758 l 115.543
 120.234 l 116.367 120.656 l 117.035 120.957 l 117.488 121.199 l 117.754
 121.367 l 117.961 121.527 l 118.203 121.742 l 118.355 121.859 l 118.543
 122.02 l 118.66 122.129 l 118.781 122.234 l 118.965 122.375 l 119.008 122.402
 l 119.066 122.457 l 118.883 122.316 l 118.836 121.652 l 119.051 121.387
 l 118.852 121.523 l 118.367 121.836 l 117.695 122.258 l 116.906 122.723
 l 116.051 123.277 l 115.117 123.836 l 114.16 124.508 l 113.297 125.16 l
 112.469 125.785 l 111.727 126.391 l 111.086 126.965 l 110.59 127.441 l 
110.129 127.828 l 109.723 128.191 l 109.309 128.539 l 108.898 128.852 l 
108.441 129.168 l 107.992 129.535 l 107.691 129.805 l 107.449 130.062 l 
107.27 130.352 l 107.207 130.488 l 106.934 131.152 l 107.832 131.945 l 108.555
 131.633 l 108.863 131.203 l 108.961 130.695 l 109.172 130.531 l 108.898
 130.172 l 108.688 130.336 l 108.234 130.246 l 107.898 130.18 l 108.23 130
 l 109.016 130.688 l 108.809 131.191 l 108.812 131.188 l 108.84 131.141 
l 108.914 131.062 l 109.133 130.867 l 109.5 130.566 l 109.93 130.27 l 110.402
 129.91 l 110.871 129.52 l 111.277 129.152 l 111.762 128.75 l 112.281 128.25
 l 112.867 127.723 l 113.551 127.168 l 114.355 126.566 l 115.195 125.934
 l 116.078 125.316 l 116.984 124.773 l 117.832 124.223 l 118.613 123.766
 l 119.316 123.32 l 119.828 122.992 l 120.266 122.695 l 120.648 122.215 
l 120.59 121.387 l 120.227 121.109 l 120.129 121.012 l 119.988 120.918 l
 119.906 120.859 l 119.844 120.805 l 119.715 120.688 l 119.473 120.477 l
 119.324 120.367 l 119.094 120.16 l 118.77 119.91 l 118.379 119.668 l 117.82
 119.371 l 117.133 119.059 l 116.395 118.684 l 115.645 118.246 l 114.91 
117.785 l 114.254 117.277 l 113.699 116.781 l 113.152 116.285 l 112.723 
115.82 l 112.316 115.305 l 111.918 114.852 l 111.629 114.453 l 111.359 114.086
 l 111.156 113.793 l 111.031 113.559 l 111.059 113.645 l 111.008 113.824
 l 109.957 114.539 l 110.785 114.742 l f
81.785 56.578 m 81.523 57.562 l 81.383 57.965 l 81.148 58.613 l 80.816 
59.379 l 80.418 60.266 l 79.93 61.168 l 79.395 62.07 l 78.891 62.914 l 78.371
 63.723 l 77.941 64.496 l 77.645 65.094 l 77.395 65.516 l 77.285 65.82 l
 77.062 66.414 l 77.535 66.809 l 78.035 67.402 l 79.121 66.484 l 78.621 
65.891 l 78.961 66.133 l 78.848 66.461 l 78.934 66.266 l 79.145 65.914 l
 79.453 65.297 l 79.84 64.602 l 80.344 63.816 l 80.859 62.945 l 81.414 62.012
 l 81.945 61.016 l 82.371 60.059 l 82.719 59.227 l 82.969 58.488 l 83.109
 57.98 l 83.301 56.914 l f
1 0 0 rg
85.109 45.609 m 84.25 45.496 l 84.105 45.469 l 83.887 45.449 l 83.551 45.469
 l 83.223 45.527 l 82.891 45.586 l 82.492 45.676 l 82.078 45.766 l 81.68
 45.859 l 81.395 45.945 l 81.07 46.012 l 80.836 46.098 l 80.715 46.121 l
 80.461 46.191 l 80.098 46.461 l 79.93 46.777 l 79.836 46.98 l 79.75 47.211
 l 79.656 47.422 l 79.566 47.656 l 79.52 47.82 l 79.48 47.945 l 79.41 48.367
 l 79.727 48.961 l 80.277 49.199 l 80.828 49.277 l 81.406 49.246 l 81.984
 49.211 l 82.551 49.145 l 83.074 49.086 l 83.539 49.059 l 83.844 49.059 
l 84.047 49.09 l 84.145 49.121 l 84.078 49.078 l 84.086 49.098 l 84.129 
49.203 l 84.16 49.453 l 84.191 49.77 l 84.191 50.062 l 84.164 50.348 l 84.133
 50.52 l 84.047 50.676 l 83.98 50.773 l 83.934 50.809 l 83.941 50.801 l 
83.906 50.805 l 83.719 50.832 l 83.492 50.852 l 83.309 50.84 l 83.117 50.785
 l 82.812 50.68 l 82.562 50.582 l 82.309 50.453 l 81.883 50.316 l 81.691
 50.289 l 81.539 50.25 l 81.336 50.227 l 81.184 50.324 l 80.48 50.258 l 
80.215 51.453 l 80.879 51.691 l 80.98 51.848 l 81.105 51.895 l 81.281 51.957
 l 81.457 51.992 l 81.652 52.059 l 81.855 52.164 l 82.211 52.301 l 82.602
 52.438 l 83.023 52.551 l 83.531 52.582 l 83.945 52.531 l 84.25 52.48 l 
84.605 52.387 l 84.918 52.195 l 85.246 51.914 l 85.5 51.535 l 85.734 51.07
 l 85.828 50.574 l 85.867 50.125 l 85.859 49.68 l 85.816 49.262 l 85.746
 48.75 l 85.578 48.371 l 85.34 47.934 l 84.867 47.617 l 84.434 47.48 l 83.977
 47.406 l 83.484 47.406 l 82.934 47.441 l 82.367 47.504 l 81.848 47.559 
l 81.32 47.586 l 80.906 47.605 l 80.734 47.578 l 80.926 47.66 l 81.148 48.078
 l 81.105 48.34 l 81.121 48.301 l 81.152 48.18 l 81.195 48.066 l 81.301 
47.832 l 81.379 47.617 l 81.422 47.516 l 81.395 47.566 l 81.195 47.715 l
 81.113 47.734 l 81.297 47.695 l 81.523 47.613 l 81.801 47.555 l 82.113 
47.461 l 82.457 47.375 l 82.867 47.277 l 83.242 47.184 l 83.539 47.117 l
 83.785 47.062 l 83.957 47.035 l 84.082 47.02 l 84.184 46.996 l 85.016 47
 l f
0 g
210.082 62.441 m 210.797 62.352 l 210.898 62.375 l 211.199 62.379 l 212.434
 62.379 l 212.953 62.352 l 213.477 62.348 l 214.043 62.352 l 214.59 62.32
 l 215.203 62.32 l 215.871 62.289 l 216.551 62.258 l 217.266 62.227 l 218.016
 62.199 l 218.715 62.164 l 219.414 62.105 l 220.094 62.043 l 220.84 61.984
 l 221.648 61.922 l 222.516 61.797 l 223.332 61.707 l 224.234 61.648 l 225.172
 61.586 l 226.133 61.559 l 227.121 61.559 l 228.039 61.527 l 232.566 61.527
 l 233.551 61.496 l 234.504 61.496 l 235.453 61.465 l 236.352 61.402 l 237.27
 61.34 l 238.223 61.281 l 239.16 61.223 l 240.137 61.191 l 241.973 61.129
 l 242.859 61.098 l 243.695 61.07 l 244.582 61.07 l 245.445 61.039 l 246.262
 61.008 l 247.133 60.977 l 247.961 60.914 l 248.828 60.852 l 249.68 60.758
 l 250.547 60.699 l 251.418 60.641 l 252.289 60.609 l 253.172 60.578 l 254.059
 60.547 l 254.926 60.516 l 255.777 60.516 l 256.609 60.484 l 257.43 60.457
 l 258.242 60.426 l 259.109 60.395 l 260.008 60.332 l 260.895 60.27 l 261.766
 60.207 l 262.586 60.113 l 263.34 60.055 l 264.055 59.961 l 264.75 59.902
 l 265.484 59.84 l 266.148 59.75 l 266.809 59.719 l 267.473 59.66 l 271.777
 59.66 l 271.961 59.637 l 272.141 59.633 l 272.316 59.602 l 272.328 57.906
 l 272.262 57.953 l 271.445 57.816 l 271.18 59.402 l 272 59.539 l 272.047
 59.602 l 272.055 57.906 l 271.973 57.918 l 271.82 57.926 l 271.672 57.945
 l 267.395 57.945 l 266.695 58.008 l 265.996 58.039 l 265.297 58.133 l 264.605
 58.191 l 263.871 58.258 l 263.16 58.348 l 262.418 58.41 l 261.605 58.5 
l 260.773 58.559 l 259.891 58.621 l 259.02 58.68 l 258.18 58.711 l 256.547
 58.773 l 255.746 58.805 l 254.898 58.801 l 253.996 58.832 l 253.113 58.863
 l 252.227 58.895 l 251.328 58.926 l 250.426 58.988 l 249.527 59.051 l 248.672
 59.145 l 247.836 59.203 l 247.035 59.262 l 246.199 59.293 l 245.383 59.324
 l 244.547 59.355 l 243.664 59.355 l 242.797 59.387 l 241.914 59.418 l 240.996
 59.445 l 240.078 59.477 l 239.078 59.508 l 238.109 59.57 l 237.156 59.633
 l 236.234 59.695 l 235.363 59.754 l 234.473 59.785 l 233.523 59.785 l 232.535
 59.816 l 229.758 59.816 l 228.871 59.812 l 228.008 59.812 l 227.09 59.848
 l 226.102 59.848 l 225.086 59.879 l 224.117 59.941 l 223.18 60.004 l 222.297
 60.098 l 221.457 60.219 l 220.699 60.277 l 219.941 60.34 l 219.258 60.402
 l 218.598 60.461 l 217.941 60.492 l 217.191 60.523 l 216.473 60.555 l 215.789
 60.586 l 215.16 60.613 l 214.539 60.617 l 213.992 60.645 l 213.473 60.648
 l 212.898 60.648 l 212.383 60.68 l 211.191 60.68 l 210.859 60.688 l 210.523
 60.73 l 209.68 61.109 l f
243.629 54.512 m 242.895 55.508 l 242.582 55.984 l 242.207 56.648 l 241.797
 57.469 l 241.27 58.355 l 240.684 59.32 l 240.016 60.18 l 239.324 60.98 
l 238.684 61.68 l 238.133 62.312 l 237.684 62.883 l 237.484 63.41 l 237.582
 63.848 l 237.656 64.098 l 237.492 64.391 l 237.965 64.656 l 238.129 64.363
 l 238.379 64.289 l 238.805 64.148 l 239.07 63.836 l 239.434 63.434 l 239.969
 62.844 l 240.621 62.137 l 241.359 61.285 l 242.121 60.309 l 242.762 59.25
 l 243.324 58.297 l 243.738 57.453 l 244.059 56.867 l 244.309 56.461 l 244.984
 55.477 l f
1 0 0 rg
246.18 41.953 m 245.398 41.898 l 245.246 41.855 l 245.133 41.855 l 244.82
 41.852 l 244.363 41.879 l 243.094 41.879 l 242.41 41.91 l 241.738 41.973
 l 241.117 42.039 l 240.602 42.102 l 240.105 42.211 l 239.793 42.328 l 239.484
 42.484 l 239.191 42.766 l 239.035 43.07 l 238.957 43.352 l 238.902 43.574
 l 238.891 43.754 l 238.867 43.867 l 238.844 44.004 l 238.789 44.18 l 238.75
 44.355 l 238.695 44.531 l 238.652 44.695 l 238.645 44.723 l 238.523 44.957
 l 238.594 45.652 l 239.062 46.113 l 239.711 46.262 l 240.328 46.238 l 240.973
 46.203 l 241.668 46.141 l 242.402 46.082 l 243.047 46.055 l 243.629 46.105
 l 244.145 46.207 l 244.516 46.332 l 244.703 46.469 l 244.812 46.641 l 244.895
 46.848 l 244.895 47.152 l 244.867 47.586 l 244.793 47.949 l 244.684 48.215
 l 244.59 48.348 l 244.523 48.387 l 244.32 48.469 l 244.035 48.516 l 243.625
 48.562 l 243.137 48.516 l 242.594 48.41 l 242.027 48.207 l 241.426 47.898
 l 240.805 47.586 l 240.281 47.336 l 239.875 47.156 l 239.664 47.066 l 239.543
 47.051 l 239.707 48.535 l 239.73 48.434 l 240.402 48.016 l 239.602 46.734
 l 238.934 47.152 l 238.828 47.129 l 238.992 48.613 l 239.031 48.648 l 239.168
 48.719 l 239.555 48.898 l 240.043 49.133 l 240.645 49.434 l 241.336 49.793
 l 242.141 50.078 l 242.895 50.219 l 243.648 50.285 l 244.277 50.207 l 244.809
 50.113 l 245.363 49.867 l 245.809 49.539 l 246.176 49.004 l 246.395 48.418
 l 246.52 47.805 l 246.559 47.188 l 246.539 46.508 l 246.27 45.863 l 245.902
 45.32 l 245.277 44.859 l 244.562 44.617 l 243.859 44.48 l 243.082 44.41
 l 242.297 44.441 l 241.527 44.504 l 240.855 44.566 l 240.254 44.594 l 239.867
 44.605 l 239.891 44.609 l 240.18 44.891 l 240.215 45.273 l 240.195 45.316
 l 240.277 44.988 l 240.344 44.789 l 240.387 44.602 l 240.449 44.398 l 240.496
 44.152 l 240.527 43.961 l 240.539 43.84 l 240.555 43.773 l 240.582 43.684
 l 240.535 43.789 l 240.449 43.871 l 240.578 43.828 l 240.887 43.758 l 241.305
 43.703 l 241.902 43.645 l 242.527 43.586 l 243.133 43.559 l 243.766 43.559
 l 244.422 43.555 l 244.906 43.523 l 245.293 43.492 l 245.371 43.461 l 245.398
 43.418 l 246.18 43.363 l f
0 0 1 rg
283.629 55.344 m 282.996 55.012 l 282.793 54.859 l 282.488 54.777 l 282.086
 54.742 l 281.629 54.84 l 281.246 54.988 l 280.809 55.223 l 280.375 55.586
 l 280.043 55.977 l 279.637 56.48 l 279.301 57.109 l 279.023 57.809 l 278.824
 58.527 l 278.742 59.262 l 278.703 59.945 l 278.746 60.594 l 278.863 61.207
 l 279.023 61.758 l 279.246 62.25 l 279.535 62.652 l 279.914 63.008 l 280.301
 63.195 l 280.664 63.352 l 281.133 63.445 l 281.629 63.43 l 282.102 63.312
 l 282.523 63.117 l 282.926 62.754 l 283.098 62.301 l 283.227 62.238 l 283.137
 62.055 l 283.008 62.117 l 282.586 61.957 l 282.156 61.895 l 281.828 61.879
 l 281.539 61.867 l 281.344 61.832 l 281.199 61.785 l 281.02 61.695 l 280.887
 61.621 l 280.809 61.543 l 280.711 61.402 l 280.605 61.172 l 280.5 60.812
 l 280.418 60.383 l 280.395 59.941 l 280.422 59.398 l 280.484 58.848 l 280.621
 58.344 l 280.828 57.812 l 281.043 57.398 l 281.336 57.023 l 281.559 56.742
 l 281.758 56.555 l 281.961 56.426 l 282.137 56.336 l 282.254 56.289 l 282.355
 56.266 l 282.383 56.234 l 282.438 56.203 l 283.09 56.477 l f
288.836 57 m 288.148 56.648 l 287.93 56.512 l 287.676 56.422 l 287.398 
56.348 l 286.875 56.434 l 286.316 56.633 l 285.805 56.98 l 285.285 57.438
 l 284.758 58.016 l 284.363 58.652 l 284.004 59.332 l 283.801 60.023 l 283.688
 60.652 l 283.695 61.387 l 283.945 62.055 l 284.297 62.586 l 284.797 62.988
 l 285.332 63.246 l 285.895 63.352 l 286.422 63.422 l 287.012 63.34 l 287.48
 63.164 l 287.914 62.836 l 288.289 62.48 l 288.551 62.086 l 288.824 61.68
 l 289.062 61.215 l 289.199 60.746 l 289.344 60.32 l 289.434 59.801 l 289.48
 59.34 l 289.523 58.918 l 289.527 58.371 l 289.398 57.938 l 289.242 57.52
 l 288.875 57.113 l 288.402 56.852 l 287.957 56.758 l 287.5 56.973 l 287.199
 57.227 l 287.082 57.223 l 287.078 57.348 l 287.195 57.352 l 287.418 57.625
 l 287.566 57.973 l 287.719 58.133 l 287.855 58.27 l 287.867 58.312 l 287.906
 58.434 l 287.953 58.598 l 287.957 58.848 l 287.934 59.211 l 287.902 59.605
 l 287.852 59.945 l 287.73 60.312 l 287.645 60.707 l 287.543 60.965 l 287.332
 61.305 l 287.172 61.578 l 286.996 61.766 l 286.797 61.918 l 286.668 61.965
 l 286.441 61.988 l 286.164 61.934 l 285.836 61.844 l 285.633 61.723 l 285.465
 61.562 l 285.355 61.367 l 285.277 61.117 l 285.289 60.812 l 285.383 60.41
 l 285.523 59.945 l 285.777 59.461 l 286.066 58.996 l 286.434 58.59 l 286.816
 58.242 l 287.078 58.043 l 287.316 57.934 l 287.391 57.898 l 287.363 57.879
 l 287.523 57.879 l 287.641 57.871 l 288.328 58.137 l f
289.457 57.758 m 289.516 58.68 l 289.508 59.113 l 289.559 59.637 l 289.629
 60.203 l 289.82 60.781 l 290.043 61.348 l 290.305 61.883 l 290.582 62.379
 l 290.945 62.824 l 291.352 63.141 l 291.809 63.328 l 292.277 63.434 l 292.785
 63.398 l 293.297 63.215 l 293.762 62.867 l 294.125 62.473 l 294.453 61.977
 l 294.762 61.469 l 295.031 60.863 l 295.293 60.242 l 295.484 59.605 l 295.648
 58.969 l 295.723 58.445 l 295.824 57.977 l 295.902 57.648 l 295.957 57.457
 l 295.98 57.379 l 296.004 57.32 l 294.648 57.594 l 294.48 57.406 l 294.469
 57.355 l 294.469 57.773 l 294.5 58.332 l 294.535 58.91 l 294.605 59.512
 l 294.676 60.152 l 294.781 60.758 l 294.887 61.316 l 294.957 61.879 l 295.039
 62.406 l 295.117 62.84 l 295.18 63.277 l 295.324 63.762 l 295.648 64.074
 l 295.957 64.137 l 296.211 64.492 l 296.82 64.055 l 296.562 63.699 l 296.625
 63.418 l 296.645 63.242 l 296.66 63.074 l 296.656 62.664 l 296.598 62.188
 l 296.547 61.684 l 296.48 61.082 l 296.379 60.477 l 296.281 59.922 l 296.215
 59.332 l 296.152 58.766 l 296.117 58.234 l 296.086 57.719 l 296.078 57.312
 l 296.047 56.777 l 295.848 56.551 l 294.492 56.828 l 294.461 56.926 l 294.43
 57.047 l 294.367 57.305 l 294.309 57.684 l 294.211 58.191 l 294.148 58.699
 l 294.039 59.227 l 293.891 59.75 l 293.676 60.293 l 293.457 60.801 l 293.219
 61.215 l 292.98 61.59 l 292.789 61.801 l 292.609 61.934 l 292.496 61.973
 l 292.398 61.973 l 292.266 61.941 l 292.129 61.867 l 292.016 61.766 l 291.848
 61.539 l 291.656 61.184 l 291.441 60.742 l 291.254 60.262 l 291.113 59.852
 l 291.047 59.438 l 290.961 58.953 l 290.879 58.551 l 290.746 57.629 l f
297.926 57.516 m 297.965 58.344 l 297.93 58.684 l 297.938 59.191 l 297.922
 59.66 l 297.914 60.184 l 297.91 60.738 l 297.906 61.254 l 297.906 61.707
 l 297.902 62.031 l 297.902 62.434 l 299.457 62.434 l 299.461 62.418 l 299.457
 62.289 l 299.477 62.074 l 299.531 61.734 l 299.641 61.395 l 299.793 60.941
 l 300 60.504 l 300.285 59.973 l 300.547 59.527 l 300.91 59.098 l 301.309
 58.707 l 301.617 58.449 l 301.891 58.324 l 302.188 58.223 l 302.34 58.191
 l 302.227 58.199 l 301.992 58.035 l 301.965 58.016 l 302.008 58.316 l 302.031
 58.773 l 302.023 59.309 l 301.988 59.957 l 301.984 60.664 l 302.055 61.352
 l 302.133 62.047 l 302.352 62.688 l 302.602 63.172 l 302.836 63.551 l 303.137
 63.816 l 303.344 63.934 l 303.609 63.973 l 303.789 63.922 l 304.348 64.051
 l 304.559 63.121 l 304.004 62.992 l 304.008 62.902 l 304.117 62.859 l 304.164
 62.82 l 304.086 62.664 l 303.996 62.457 l 303.848 62.094 l 303.73 61.703
 l 303.672 61.176 l 303.609 60.578 l 303.609 59.996 l 303.641 59.348 l 303.633
 58.711 l 303.574 58.098 l 303.449 57.559 l 303.23 57.078 l 302.703 56.691
 l 302.137 56.719 l 301.781 56.805 l 301.344 56.949 l 300.824 57.191 l 300.32
 57.605 l 299.84 58.066 l 299.316 58.625 l 298.969 59.219 l 298.637 59.801
 l 298.367 60.352 l 298.176 60.898 l 298.02 61.367 l 297.938 61.867 l 297.902
 62.207 l 297.898 62.418 l 297.902 62.434 l 299.457 62.434 l 299.457 62.258
 l 299.453 62.027 l 299.453 61.254 l 299.449 60.734 l 299.441 60.18 l 299.434
 59.656 l 299.418 59.141 l 299.359 58.625 l 299.312 58.258 l 299.156 57.375
 l f
305.551 49.891 m 305.855 51 l 305.961 51.645 l 306.047 52.676 l 306.141
 53.914 l 306.105 55.301 l 306.035 56.758 l 305.965 58.039 l 305.895 59.242
 l 305.859 60.355 l 305.824 61.316 l 305.824 62.855 l 305.828 63.406 l 305.875
 63.84 l 305.977 64.172 l 306.273 64.762 l 307.312 64.777 l 307.484 64.152
 l 307.801 63.57 l 306.742 62.996 l 306.426 63.578 l 306.465 63.207 l 307.355
 63.211 l 307.547 63.586 l 307.543 63.527 l 307.527 63.328 l 307.527 61.344
 l 307.562 60.41 l 307.594 59.316 l 307.66 58.133 l 307.727 56.84 l 307.797
 55.359 l 307.828 53.863 l 307.715 52.527 l 307.598 51.402 l 307.414 50.594
 l 306.988 49.43 l f
303.719 59.055 m 304.656 59 l 305.109 59.031 l 305.75 59.016 l 306.488 
58.992 l 307.223 58.934 l 307.906 58.875 l 308.535 58.812 l 309.09 58.781
 l 309.535 58.715 l 309.879 58.66 l 310.223 58.566 l 310.406 58.379 l 310.605
 58.141 l 311.023 58.129 l 311.008 57.418 l 310.59 57.426 l 310.32 57.199
 l 310.062 57.066 l 309.738 57.027 l 309.352 57.039 l 308.93 57.09 l 308.406
 57.117 l 307.746 57.18 l 307.07 57.242 l 306.375 57.305 l 305.672 57.344
 l 305.059 57.387 l 304.562 57.434 l 303.559 57.578 l f
310.703 63.309 m 311.828 63.211 l 312.367 63.156 l 312.977 63.098 l 313.676
 63.035 l 314.359 62.941 l 314.992 62.879 l 315.484 62.785 l 315.824 62.727
 l 316.051 62.695 l 316.141 62.668 l 316.238 62.598 l 316.387 62.398 l 316.52
 62.219 l 317.027 62.195 l 316.988 61.348 l 316.48 61.371 l 316.273 61.211
 l 316.074 61.062 l 315.918 61.008 l 315.777 61.027 l 315.574 61.051 l 315.188
 61.113 l 314.746 61.199 l 314.16 61.258 l 313.484 61.348 l 312.816 61.41
 l 312.184 61.477 l 311.641 61.547 l 310.527 61.691 l f
323.668 56.52 m 322.707 56.062 l 322.426 55.973 l 321.988 55.934 l 321.426
 56.059 l 320.82 56.395 l 320.215 56.895 l 319.727 57.473 l 319.258 58.156
 l 319.004 58.922 l 318.832 59.688 l 318.875 60.543 l 319.16 61.332 l 319.691
 62.035 l 320.453 62.562 l 321.27 62.91 l 322.172 63.062 l 323.051 63.027
 l 323.859 62.844 l 324.633 62.555 l 325.227 62.199 l 325.805 61.805 l 326.227
 61.254 l 326.477 60.664 l 326.629 60.02 l 326.594 59.324 l 326.469 58.605
 l 326.168 57.816 l 325.68 57.098 l 324.977 56.465 l 324.125 56.02 l 323.137
 55.836 l 322.137 55.887 l 321.18 56.32 l 320.668 57.223 l 320.66 57.227
 l 320.664 57.234 l 320.672 57.23 l 321.586 57.461 l 322.332 57.469 l 322.969
 57.52 l 323.551 57.645 l 323.988 57.879 l 324.375 58.227 l 324.637 58.613
 l 324.809 59.062 l 324.887 59.516 l 324.906 59.871 l 324.848 60.145 l 324.746
 60.406 l 324.625 60.57 l 324.32 60.785 l 323.902 61.039 l 323.379 61.234
 l 322.828 61.355 l 322.281 61.379 l 321.75 61.281 l 321.273 61.074 l 320.879
 60.797 l 320.664 60.512 l 320.551 60.199 l 320.531 59.832 l 320.633 59.375
 l 320.789 58.918 l 321.074 58.496 l 321.406 58.098 l 321.777 57.793 l 322.039
 57.637 l 322.133 57.609 l 322.184 57.598 l 322.207 57.582 l 323.086 57.895
 l f
Q Q
showpage
%%Trailer
end
%%EOF
