mpiP: 
mpiP: mpiP V3.5.0 (Build Nov 11 2020/13:45:15)
mpiP: 
Iterations=  0 Elapsed MPI Wall time is 112.425807
Time taken 224 seconds 244 milliseconds
Residual 2.11278e-11
mpiP: 
mpiP: Storing mpiP output in [./jacobi_hybrid_mpip.x.2.406673.1.mpiP].
mpiP: 
