mpiP: 
mpiP: mpiP V3.5.0 (Build Nov 11 2020/13:45:15)
mpiP: 
Iterations= 50 Elapsed MPI Wall time is 51.466076
Time taken 51 seconds 332 milliseconds
Residual 5.28232e-12
mpiP: 
mpiP: Storing mpiP output in [./jacobi_mpi_mpip.x.4.403708.1.mpiP].
mpiP: 
