mpiP: 
mpiP: mpiP V3.5.0 (Build Nov 11 2020/13:45:15)
mpiP: 
Iterations= 50 Elapsed MPI Wall time is 3.594513
Time taken 3 seconds 587 milliseconds
Residual 1.69022e-10
mpiP: 
mpiP: Storing mpiP output in [./jacobi_mpi_mpip.x.16.403333.1.mpiP].
mpiP: 
