%!PS-Adobe-3.0 EPSF-3.0 
%%BoundingBox: 0 0 570 352
%%Pages: 0
%%Creator: LibreOffice 6.4
%%Title: none
%%CreationDate: none
%%LanguageLevel: 2
%%EndComments
%%BeginProlog
%%BeginResource: procset SDRes-Prolog 1.0 0
/b4_inc_state save def
/dict_count countdictstack def
/op_count count 1 sub def
userdict begin
0 setgray 0 setlinecap 1 setlinewidth 0 setlinejoin 10 setmiterlimit[] 0 setdash newpath
/languagelevel where {pop languagelevel 1 ne {false setstrokeadjust false setoverprint} if} if
/bdef {bind def} bind def
/c {setrgbcolor} bdef
/l {neg lineto} bdef
/rl {neg rlineto} bdef
/lc {setlinecap} bdef
/lj {setlinejoin} bdef
/lw {setlinewidth} bdef
/ml {setmiterlimit} bdef
/ld {setdash} bdef
/m {neg moveto} bdef
/ct {6 2 roll neg 6 2 roll neg 6 2 roll neg curveto} bdef
/r {rotate} bdef
/t {neg translate} bdef
/s {scale} bdef
/sw {show} bdef
/gs {gsave} bdef
/gr {grestore} bdef
/f {findfont dup length dict begin
{1 index /FID ne {def} {pop pop} ifelse} forall /Encoding ISOLatin1Encoding def
currentdict end /NFont exch definefont pop /NFont findfont} bdef
/p {closepath} bdef
/sf {scalefont setfont} bdef
/ef {eofill}bdef
/pc {closepath stroke}bdef
/ps {stroke}bdef
/pum {matrix currentmatrix}bdef
/pom {setmatrix}bdef
/bs {/aString exch def /nXOfs exch def /nWidth exch def currentpoint nXOfs 0 rmoveto pum nWidth aString stringwidth pop div 1 scale aString show pom moveto} bdef
%%EndResource
%%EndProlog
%%BeginSetup
%%EndSetup
%%Page: 1 1
%%BeginPageSetup
%%EndPageSetup
pum
0.02834 0.02831 s 
0 -12433 t
/tm matrix currentmatrix def
tm setmatrix
-41846 -2017 t 
1 1 s 
gs
1.000 1.000 1.000 c 51899 14449 m  41846 14449 l  41846 2017 l  61951 2017 l 
61951 14449 l  51899 14449 l  p ef
gr
gs
1.000 1.000 1.000 c 51404 12674 m  43965 12674 l  43965 4558 l  58842 4558 l 
58842 12674 l  51404 12674 l  p ef
gr
gs
17.9991 lw 1 lj 0.718 0.718 0.718 c 58842 12673 m  43965 12673 l  ps
gr
gs
17.9991 lw 1 lj 0.718 0.718 0.718 c 58842 11771 m  43965 11771 l  ps
gr
gs
17.9991 lw 1 lj 0.718 0.718 0.718 c 58842 10869 m  43965 10869 l  ps
gr
gs
17.9991 lw 1 lj 0.718 0.718 0.718 c 58842 9967 m  43965 9967 l  ps
gr
gs
17.9991 lw 1 lj 0.718 0.718 0.718 c 58842 9065 m  43965 9065 l  ps
gr
gs
17.9991 lw 1 lj 0.718 0.718 0.718 c 58842 8164 m  43965 8164 l  ps
gr
gs
17.9991 lw 1 lj 0.718 0.718 0.718 c 58842 7262 m  43965 7262 l  ps
gr
gs
17.9991 lw 1 lj 0.718 0.718 0.718 c 58842 6360 m  43965 6360 l  ps
gr
gs
17.9991 lw 1 lj 0.718 0.718 0.718 c 58842 5458 m  43965 5458 l  ps
gr
gs
17.9991 lw 1 lj 0.718 0.718 0.718 c 58842 4557 m  43965 4557 l  ps
gr
gs
17.9991 lw 1 lj 0.546 0.546 0.546 c 43965 12673 m  58842 12673 l  ps
gr
gs
17.9991 lw 1 lj 0.546 0.546 0.546 c 43965 12673 m  43965 4557 l  ps
gr
gs
52.99736 lw 1 lj 0.261 0.523 0.957 c 43965 12665 m  46940 12644 l  49916 12558 l 
52890 12213 l  55866 10836 l  58842 5350 l  ps
gr
gs
52.99736 lw 1 lj 0.917 0.265 0.210 c 43965 12669 m  46940 12658 l  49916 12615 l 
52890 12442 l  55866 11752 l  58842 12673 l  ps
gr
gs
52.99736 lw 1 lj 0.984 0.738 0.019 c 43965 12671 m  46940 12665 l  49916 12643 l 
52890 12563 l  55866 12210 l  58842 12673 l  ps
gr
gs
52.99736 lw 1 lj 0.207 0.660 0.328 c 43965 12671 m  46940 12669 l  49916 12656 l 
52890 12609 l  55866 12418 l  58842 12673 l  ps
gr
gs
52.99736 lw 1 lj 1.000 0.429 0.007 c 43965 12672 m  46940 12670 l  49916 12664 l 
52890 12640 l  55866 12545 l  58842 12673 l  ps
gr
gs
52.99736 lw 1 lj 0.277 0.742 0.777 c 43965 12672 m  46940 12671 l  49916 12668 l 
52890 12656 l  55866 12608 l  58842 12673 l  ps
gr
gs
52.99736 lw 1 lj 0.484 0.667 0.968 c 43965 12672 m  46940 12672 l  49916 12670 l 
52890 12664 l  55866 12640 l  58842 12673 l  ps
gr
gs
52.99736 lw 1 lj 0.941 0.484 0.449 c 43965 12672 m  46940 12672 l  49916 12670 l 
52890 12665 l  55866 12646 l  58842 12569 l  ps
gr
pum
43343 13091 t
0.003 0.003 0.003 c 181 -68 m  181 -46 174 -28 160 -16 ct 145 -3 125 3 98 3 ct 72 3 52 -3 37 -15 ct 
23 -28 15 -45 15 -68 ct 15 -84 20 -97 29 -108 ct 38 -119 50 -125 64 -128 ct 64 -128 l 
51 -131 40 -138 32 -148 ct 25 -159 21 -171 21 -185 ct 21 -203 28 -218 42 -230 ct 
56 -241 74 -247 98 -247 ct 121 -247 140 -241 154 -230 ct 168 -219 175 -204 175 -184 ct 
175 -171 171 -158 163 -148 ct 156 -138 145 -131 132 -129 ct 132 -128 l  147 -125 159 -119 168 -108 ct 
177 -98 181 -84 181 -68 ct p
143 -183 m  143 -210 128 -224 98 -224 ct 83 -224 72 -220 64 -214 ct 57 -207 53 -196 53 -183 ct 
53 -169 57 -158 65 -151 ct 72 -144 84 -140 98 -140 ct 113 -140 124 -143 131 -150 ct 
139 -157 143 -168 143 -183 ct p
149 -71 m  149 -86 144 -98 135 -105 ct 126 -113 114 -117 98 -117 ct 82 -117 70 -113 61 -104 ct 
52 -96 47 -85 47 -70 ct 47 -37 64 -20 99 -20 ct 115 -20 128 -24 136 -32 ct 145 -41 149 -53 149 -71 ct 
p ef
337 -55 m  337 0 l  308 0 l  308 -55 l  193 -55 l  193 -79 l  304 -243 l 
337 -243 l  337 -79 l  371 -79 l  371 -55 l  337 -55 l  p
308 -208 m  307 -207 306 -204 303 -199 ct 300 -193 298 -190 296 -187 ct 234 -96 l 
224 -83 l  222 -79 l  308 -79 l  308 -208 l  p ef
553 -122 m  553 -81 545 -50 531 -29 ct 517 -8 496 3 468 3 ct 440 3 419 -8 405 -29 ct 
391 -50 384 -81 384 -122 ct 384 -164 391 -195 404 -216 ct 418 -237 439 -247 469 -247 ct 
497 -247 519 -236 532 -215 ct 546 -194 553 -163 553 -122 ct p
521 -122 m  521 -157 517 -182 509 -198 ct 501 -214 487 -222 469 -222 ct 450 -222 436 -214 428 -199 ct 
419 -183 415 -158 415 -122 ct 415 -88 419 -62 428 -46 ct 436 -30 450 -22 468 -22 ct 
486 -22 500 -31 508 -47 ct 517 -63 521 -88 521 -122 ct p ef
635 -192 m  680 -210 l  688 -187 l  639 -175 l  671 -131 l  651 -119 l 
625 -164 l  598 -119 l  577 -132 l  610 -175 l  562 -187 l  569 -210 l 
615 -192 l  613 -243 l  637 -243 l  635 -192 l  p ef
869 -68 m  869 -46 862 -28 848 -16 ct 833 -3 813 3 786 3 ct 760 3 740 -3 725 -15 ct 
711 -28 703 -45 703 -68 ct 703 -84 708 -97 717 -108 ct 726 -119 738 -125 752 -128 ct 
752 -128 l  739 -131 728 -138 720 -148 ct 713 -159 709 -171 709 -185 ct 709 -203 716 -218 730 -230 ct 
744 -241 762 -247 786 -247 ct 809 -247 828 -241 842 -230 ct 856 -219 863 -204 863 -184 ct 
863 -171 859 -158 851 -148 ct 844 -138 833 -131 820 -129 ct 820 -128 l  835 -125 847 -119 856 -108 ct 
865 -98 869 -84 869 -68 ct p
831 -183 m  831 -210 816 -224 786 -224 ct 771 -224 760 -220 752 -214 ct 745 -207 741 -196 741 -183 ct 
741 -169 745 -158 753 -151 ct 760 -144 772 -140 786 -140 ct 801 -140 812 -143 819 -150 ct 
827 -157 831 -168 831 -183 ct p
837 -71 m  837 -86 832 -98 823 -105 ct 814 -113 802 -117 786 -117 ct 770 -117 758 -113 749 -104 ct 
740 -96 735 -85 735 -70 ct 735 -37 752 -20 787 -20 ct 803 -20 816 -24 824 -32 ct 
833 -41 837 -53 837 -71 ct p ef
1025 -55 m  1025 0 l  996 0 l  996 -55 l  881 -55 l  881 -79 l  992 -243 l 
1025 -243 l  1025 -79 l  1059 -79 l  1059 -55 l  1025 -55 l  p
996 -208 m  995 -207 994 -204 991 -199 ct 988 -193 986 -190 984 -187 ct 922 -96 l 
912 -83 l  910 -79 l  996 -79 l  996 -208 l  p ef
1241 -122 m  1241 -81 1233 -50 1219 -29 ct 1205 -8 1184 3 1156 3 ct 1128 3 1107 -8 1093 -29 ct 
1079 -50 1072 -81 1072 -122 ct 1072 -164 1079 -195 1092 -216 ct 1106 -237 1127 -247 1157 -247 ct 
1185 -247 1207 -236 1220 -215 ct 1234 -194 1241 -163 1241 -122 ct p
1209 -122 m  1209 -157 1205 -182 1197 -198 ct 1189 -214 1175 -222 1157 -222 ct 
1138 -222 1124 -214 1116 -199 ct 1107 -183 1103 -158 1103 -122 ct 1103 -88 1107 -62 1116 -46 ct 
1124 -30 1138 -22 1156 -22 ct 1174 -22 1188 -31 1196 -47 ct 1205 -63 1209 -88 1209 -122 ct 
p ef
pom
pum
46133 13091 t
27 0 m  27 -26 l  89 -26 l  89 -213 l  34 -174 l  34 -204 l  91 -243 l 
120 -243 l  120 -26 l  179 -26 l  179 0 l  27 0 l  p ef
366 -80 m  366 -54 359 -34 345 -19 ct 331 -4 312 3 287 3 ct 260 3 239 -7 225 -28 ct 
210 -48 203 -77 203 -116 ct 203 -158 210 -191 226 -213 ct 241 -236 262 -247 290 -247 ct 
326 -247 350 -231 359 -198 ct 329 -192 l  323 -212 310 -222 289 -222 ct 272 -222 258 -214 248 -197 ct 
239 -181 234 -157 234 -126 ct 239 -136 247 -144 258 -150 ct 268 -155 280 -158 293 -158 ct 
315 -158 333 -151 346 -137 ct 359 -123 366 -104 366 -80 ct p
334 -79 m  334 -96 330 -110 321 -120 ct 313 -129 301 -134 285 -134 ct 271 -134 259 -130 250 -121 ct 
241 -113 237 -101 237 -86 ct 237 -67 242 -52 251 -40 ct 260 -28 272 -22 286 -22 ct 
301 -22 313 -27 322 -37 ct 330 -47 334 -61 334 -79 ct p ef
551 -68 m  551 -46 544 -28 530 -16 ct 515 -3 495 3 468 3 ct 442 3 422 -3 407 -15 ct 
393 -28 385 -45 385 -68 ct 385 -84 390 -97 399 -108 ct 408 -119 420 -125 434 -128 ct 
434 -128 l  421 -131 410 -138 402 -148 ct 395 -159 391 -171 391 -185 ct 391 -203 398 -218 412 -230 ct 
426 -241 444 -247 468 -247 ct 491 -247 510 -241 524 -230 ct 538 -219 545 -204 545 -184 ct 
545 -171 541 -158 533 -148 ct 526 -138 515 -131 502 -129 ct 502 -128 l  517 -125 529 -119 538 -108 ct 
547 -98 551 -84 551 -68 ct p
513 -183 m  513 -210 498 -224 468 -224 ct 453 -224 442 -220 434 -214 ct 427 -207 423 -196 423 -183 ct 
423 -169 427 -158 435 -151 ct 442 -144 454 -140 468 -140 ct 483 -140 494 -143 501 -150 ct 
509 -157 513 -168 513 -183 ct p
519 -71 m  519 -86 514 -98 505 -105 ct 496 -113 484 -117 468 -117 ct 452 -117 440 -113 431 -104 ct 
422 -96 417 -85 417 -70 ct 417 -37 434 -20 469 -20 ct 485 -20 498 -24 506 -32 ct 
515 -41 519 -53 519 -71 ct p ef
739 -122 m  739 -81 731 -50 717 -29 ct 703 -8 682 3 654 3 ct 626 3 605 -8 591 -29 ct 
577 -50 570 -81 570 -122 ct 570 -164 577 -195 590 -216 ct 604 -237 625 -247 655 -247 ct 
683 -247 705 -236 718 -215 ct 732 -194 739 -163 739 -122 ct p
707 -122 m  707 -157 703 -182 695 -198 ct 687 -214 673 -222 655 -222 ct 636 -222 622 -214 614 -199 ct 
605 -183 601 -158 601 -122 ct 601 -88 605 -62 614 -46 ct 622 -30 636 -22 654 -22 ct 
672 -22 686 -31 694 -47 ct 703 -63 707 -88 707 -122 ct p ef
820 -192 m  865 -210 l  873 -187 l  824 -175 l  856 -131 l  836 -119 l 
810 -164 l  783 -119 l  762 -132 l  795 -175 l  747 -187 l  754 -210 l 
800 -192 l  798 -243 l  822 -243 l  820 -192 l  p ef
900 0 m  900 -26 l  962 -26 l  962 -213 l  907 -174 l  907 -204 l  964 -243 l 
993 -243 l  993 -26 l  1052 -26 l  1052 0 l  900 0 l  p ef
1239 -80 m  1239 -54 1232 -34 1218 -19 ct 1204 -4 1185 3 1160 3 ct 1133 3 1112 -7 1098 -28 ct 
1083 -48 1076 -77 1076 -116 ct 1076 -158 1083 -191 1099 -213 ct 1114 -236 1135 -247 1163 -247 ct 
1199 -247 1223 -231 1232 -198 ct 1202 -192 l  1196 -212 1183 -222 1162 -222 ct 
1145 -222 1131 -214 1121 -197 ct 1112 -181 1107 -157 1107 -126 ct 1112 -136 1120 -144 1131 -150 ct 
1141 -155 1153 -158 1166 -158 ct 1188 -158 1206 -151 1219 -137 ct 1232 -123 1239 -104 1239 -80 ct 
p
1207 -79 m  1207 -96 1203 -110 1194 -120 ct 1186 -129 1174 -134 1158 -134 ct 
1144 -134 1132 -130 1123 -121 ct 1114 -113 1110 -101 1110 -86 ct 1110 -67 1115 -52 1124 -40 ct 
1133 -28 1145 -22 1159 -22 ct 1174 -22 1186 -27 1195 -37 ct 1203 -47 1207 -61 1207 -79 ct 
p ef
1425 -68 m  1425 -46 1418 -28 1404 -16 ct 1389 -3 1369 3 1342 3 ct 1316 3 1296 -3 1281 -15 ct 
1267 -28 1259 -45 1259 -68 ct 1259 -84 1264 -97 1273 -108 ct 1282 -119 1294 -125 1308 -128 ct 
1308 -128 l  1295 -131 1284 -138 1276 -148 ct 1269 -159 1265 -171 1265 -185 ct 
1265 -203 1272 -218 1286 -230 ct 1300 -241 1318 -247 1342 -247 ct 1365 -247 1384 -241 1398 -230 ct 
1412 -219 1419 -204 1419 -184 ct 1419 -171 1415 -158 1407 -148 ct 1400 -138 1389 -131 1376 -129 ct 
1376 -128 l  1391 -125 1403 -119 1412 -108 ct 1421 -98 1425 -84 1425 -68 ct 
p
1387 -183 m  1387 -210 1372 -224 1342 -224 ct 1327 -224 1316 -220 1308 -214 ct 
1301 -207 1297 -196 1297 -183 ct 1297 -169 1301 -158 1309 -151 ct 1316 -144 1328 -140 1342 -140 ct 
1357 -140 1368 -143 1375 -150 ct 1383 -157 1387 -168 1387 -183 ct p
1393 -71 m  1393 -86 1388 -98 1379 -105 ct 1370 -113 1358 -117 1342 -117 ct 
1326 -117 1314 -113 1305 -104 ct 1296 -96 1291 -85 1291 -70 ct 1291 -37 1308 -20 1343 -20 ct 
1359 -20 1372 -24 1380 -32 ct 1389 -41 1393 -53 1393 -71 ct p ef
1612 -122 m  1612 -81 1604 -50 1590 -29 ct 1576 -8 1555 3 1527 3 ct 1499 3 1478 -8 1464 -29 ct 
1450 -50 1443 -81 1443 -122 ct 1443 -164 1450 -195 1463 -216 ct 1477 -237 1498 -247 1528 -247 ct 
1556 -247 1578 -236 1591 -215 ct 1605 -194 1612 -163 1612 -122 ct p
1580 -122 m  1580 -157 1576 -182 1568 -198 ct 1560 -214 1546 -222 1528 -222 ct 
1509 -222 1495 -214 1487 -199 ct 1478 -183 1474 -158 1474 -122 ct 1474 -88 1478 -62 1487 -46 ct 
1495 -30 1509 -22 1527 -22 ct 1545 -22 1559 -31 1567 -47 ct 1576 -63 1580 -88 1580 -122 ct 
p ef
pom
pum
49109 13091 t
181 -68 m  181 -45 174 -28 159 -16 ct 145 -3 125 3 98 3 ct 74 3 54 -3 40 -14 ct 
25 -25 16 -41 13 -63 ct 46 -66 l  50 -37 67 -23 98 -23 ct 114 -23 126 -27 135 -34 ct 
144 -42 149 -54 149 -69 ct 149 -82 143 -92 133 -100 ct 123 -107 108 -111 89 -111 ct 
72 -111 l  72 -138 l  89 -138 l  106 -138 119 -142 128 -149 ct 138 -156 142 -167 142 -180 ct 
142 -193 138 -203 131 -210 ct 123 -218 112 -221 97 -221 ct 83 -221 72 -218 64 -211 ct 
55 -204 50 -194 49 -182 ct 18 -184 l  20 -204 28 -219 42 -230 ct 57 -241 75 -247 97 -247 ct 
121 -247 140 -241 154 -230 ct 167 -219 174 -203 174 -183 ct 174 -167 170 -155 161 -145 ct 
152 -135 140 -129 123 -125 ct 123 -125 l  141 -123 156 -117 166 -106 ct 176 -96 181 -83 181 -68 ct 
p ef
366 -68 m  366 -45 359 -28 344 -16 ct 330 -3 310 3 283 3 ct 259 3 239 -3 225 -14 ct 
210 -25 201 -41 198 -63 ct 231 -66 l  235 -37 252 -23 283 -23 ct 299 -23 311 -27 320 -34 ct 
329 -42 334 -54 334 -69 ct 334 -82 328 -92 318 -100 ct 308 -107 293 -111 274 -111 ct 
257 -111 l  257 -138 l  274 -138 l  291 -138 304 -142 313 -149 ct 323 -156 327 -167 327 -180 ct 
327 -193 323 -203 316 -210 ct 308 -218 297 -221 282 -221 ct 268 -221 257 -218 249 -211 ct 
240 -204 235 -194 234 -182 ct 203 -184 l  205 -204 213 -219 227 -230 ct 242 -241 260 -247 282 -247 ct 
306 -247 325 -241 339 -230 ct 352 -219 359 -203 359 -183 ct 359 -167 355 -155 346 -145 ct 
337 -135 325 -129 308 -125 ct 308 -125 l  326 -123 341 -117 351 -106 ct 361 -96 366 -83 366 -68 ct 
p ef
551 -80 m  551 -54 544 -34 530 -19 ct 516 -4 497 3 472 3 ct 445 3 424 -7 410 -28 ct 
395 -48 388 -77 388 -116 ct 388 -158 395 -191 411 -213 ct 426 -236 447 -247 475 -247 ct 
511 -247 535 -231 544 -198 ct 514 -192 l  508 -212 495 -222 474 -222 ct 457 -222 443 -214 433 -197 ct 
424 -181 419 -157 419 -126 ct 424 -136 432 -144 443 -150 ct 453 -155 465 -158 478 -158 ct 
500 -158 518 -151 531 -137 ct 544 -123 551 -104 551 -80 ct p
519 -79 m  519 -96 515 -110 506 -120 ct 498 -129 486 -134 470 -134 ct 456 -134 444 -130 435 -121 ct 
426 -113 422 -101 422 -86 ct 422 -67 427 -52 436 -40 ct 445 -28 457 -22 471 -22 ct 
486 -22 498 -27 507 -37 ct 515 -47 519 -61 519 -79 ct p ef
739 -122 m  739 -81 731 -50 717 -29 ct 703 -8 682 3 654 3 ct 626 3 605 -8 591 -29 ct 
577 -50 570 -81 570 -122 ct 570 -164 577 -195 590 -216 ct 604 -237 625 -247 655 -247 ct 
683 -247 705 -236 718 -215 ct 732 -194 739 -163 739 -122 ct p
707 -122 m  707 -157 703 -182 695 -198 ct 687 -214 673 -222 655 -222 ct 636 -222 622 -214 614 -199 ct 
605 -183 601 -158 601 -122 ct 601 -88 605 -62 614 -46 ct 622 -30 636 -22 654 -22 ct 
672 -22 686 -31 694 -47 ct 703 -63 707 -88 707 -122 ct p ef
820 -192 m  865 -210 l  873 -187 l  824 -175 l  856 -131 l  836 -119 l 
810 -164 l  783 -119 l  762 -132 l  795 -175 l  747 -187 l  754 -210 l 
800 -192 l  798 -243 l  822 -243 l  820 -192 l  p ef
1054 -68 m  1054 -45 1047 -28 1032 -16 ct 1018 -3 998 3 971 3 ct 947 3 927 -3 913 -14 ct 
898 -25 889 -41 886 -63 ct 919 -66 l  923 -37 940 -23 971 -23 ct 987 -23 999 -27 1008 -34 ct 
1017 -42 1022 -54 1022 -69 ct 1022 -82 1016 -92 1006 -100 ct 996 -107 981 -111 962 -111 ct 
945 -111 l  945 -138 l  962 -138 l  979 -138 992 -142 1001 -149 ct 1011 -156 1015 -167 1015 -180 ct 
1015 -193 1011 -203 1004 -210 ct 996 -218 985 -221 970 -221 ct 956 -221 945 -218 937 -211 ct 
928 -204 923 -194 922 -182 ct 891 -184 l  893 -204 901 -219 915 -230 ct 930 -241 948 -247 970 -247 ct 
994 -247 1013 -241 1027 -230 ct 1040 -219 1047 -203 1047 -183 ct 1047 -167 1043 -155 1034 -145 ct 
1025 -135 1013 -129 996 -125 ct 996 -125 l  1014 -123 1029 -117 1039 -106 ct 
1049 -96 1054 -83 1054 -68 ct p ef
1239 -68 m  1239 -45 1232 -28 1217 -16 ct 1203 -3 1183 3 1156 3 ct 1132 3 1112 -3 1098 -14 ct 
1083 -25 1074 -41 1071 -63 ct 1104 -66 l  1108 -37 1125 -23 1156 -23 ct 1172 -23 1184 -27 1193 -34 ct 
1202 -42 1207 -54 1207 -69 ct 1207 -82 1201 -92 1191 -100 ct 1181 -107 1166 -111 1147 -111 ct 
1130 -111 l  1130 -138 l  1147 -138 l  1164 -138 1177 -142 1186 -149 ct 1196 -156 1200 -167 1200 -180 ct 
1200 -193 1196 -203 1189 -210 ct 1181 -218 1170 -221 1155 -221 ct 1141 -221 1130 -218 1122 -211 ct 
1113 -204 1108 -194 1107 -182 ct 1076 -184 l  1078 -204 1086 -219 1100 -230 ct 
1115 -241 1133 -247 1155 -247 ct 1179 -247 1198 -241 1212 -230 ct 1225 -219 1232 -203 1232 -183 ct 
1232 -167 1228 -155 1219 -145 ct 1210 -135 1198 -129 1181 -125 ct 1181 -125 l 
1199 -123 1214 -117 1224 -106 ct 1234 -96 1239 -83 1239 -68 ct p ef
1425 -80 m  1425 -54 1418 -34 1404 -19 ct 1390 -4 1371 3 1346 3 ct 1319 3 1298 -7 1284 -28 ct 
1269 -48 1262 -77 1262 -116 ct 1262 -158 1269 -191 1285 -213 ct 1300 -236 1321 -247 1349 -247 ct 
1385 -247 1409 -231 1418 -198 ct 1388 -192 l  1382 -212 1369 -222 1348 -222 ct 
1331 -222 1317 -214 1307 -197 ct 1298 -181 1293 -157 1293 -126 ct 1298 -136 1306 -144 1317 -150 ct 
1327 -155 1339 -158 1352 -158 ct 1374 -158 1392 -151 1405 -137 ct 1418 -123 1425 -104 1425 -80 ct 
p
1393 -79 m  1393 -96 1389 -110 1380 -120 ct 1372 -129 1360 -134 1344 -134 ct 
1330 -134 1318 -130 1309 -121 ct 1300 -113 1296 -101 1296 -86 ct 1296 -67 1301 -52 1310 -40 ct 
1319 -28 1331 -22 1345 -22 ct 1360 -22 1372 -27 1381 -37 ct 1389 -47 1393 -61 1393 -79 ct 
p ef
1612 -122 m  1612 -81 1604 -50 1590 -29 ct 1576 -8 1555 3 1527 3 ct 1499 3 1478 -8 1464 -29 ct 
1450 -50 1443 -81 1443 -122 ct 1443 -164 1450 -195 1463 -216 ct 1477 -237 1498 -247 1528 -247 ct 
1556 -247 1578 -236 1591 -215 ct 1605 -194 1612 -163 1612 -122 ct p
1580 -122 m  1580 -157 1576 -182 1568 -198 ct 1560 -214 1546 -222 1528 -222 ct 
1509 -222 1495 -214 1487 -199 ct 1478 -183 1474 -158 1474 -122 ct 1474 -88 1478 -62 1487 -46 ct 
1495 -30 1509 -22 1527 -22 ct 1545 -22 1559 -31 1567 -47 ct 1576 -63 1580 -88 1580 -122 ct 
p ef
pom
pum
52084 13091 t
181 -80 m  181 -54 174 -34 160 -19 ct 146 -4 127 3 102 3 ct 75 3 54 -7 40 -28 ct 
25 -48 18 -77 18 -116 ct 18 -158 25 -191 41 -213 ct 56 -236 77 -247 105 -247 ct 
141 -247 165 -231 174 -198 ct 144 -192 l  138 -212 125 -222 104 -222 ct 87 -222 73 -214 63 -197 ct 
54 -181 49 -157 49 -126 ct 54 -136 62 -144 73 -150 ct 83 -155 95 -158 108 -158 ct 
130 -158 148 -151 161 -137 ct 174 -123 181 -104 181 -80 ct p
149 -79 m  149 -96 145 -110 136 -120 ct 128 -129 116 -134 100 -134 ct 86 -134 74 -130 65 -121 ct 
56 -113 52 -101 52 -86 ct 52 -67 57 -52 66 -40 ct 75 -28 87 -22 101 -22 ct 116 -22 128 -27 137 -37 ct 
145 -47 149 -61 149 -79 ct p ef
364 -218 m  339 -180 321 -151 311 -129 ct 301 -108 293 -86 288 -65 ct 283 -45 280 -23 280 -1 ct 
248 -1 l  248 -32 254 -64 268 -98 ct 281 -133 303 -172 334 -217 ct 203 -217 l 
203 -243 l  364 -243 l  364 -218 l  p ef
388 0 m  388 -22 l  394 -35 401 -47 409 -58 ct 418 -68 427 -77 436 -85 ct 445 -94 454 -101 464 -109 ct 
473 -116 481 -123 488 -130 ct 496 -137 502 -145 506 -152 ct 511 -160 513 -169 513 -179 ct 
513 -192 509 -203 501 -210 ct 493 -217 483 -221 469 -221 ct 455 -221 444 -217 436 -210 ct 
427 -203 422 -193 421 -180 ct 389 -183 l  391 -202 400 -218 414 -229 ct 428 -241 446 -247 469 -247 ct 
493 -247 512 -241 525 -229 ct 538 -218 545 -201 545 -180 ct 545 -171 543 -161 538 -152 ct 
534 -143 528 -133 519 -124 ct 511 -115 494 -100 470 -81 ct 457 -70 447 -60 439 -51 ct 
431 -43 425 -34 422 -26 ct 549 -26 l  549 0 l  388 0 l  p ef
739 -122 m  739 -81 731 -50 717 -29 ct 703 -8 682 3 654 3 ct 626 3 605 -8 591 -29 ct 
577 -50 570 -81 570 -122 ct 570 -164 577 -195 590 -216 ct 604 -237 625 -247 655 -247 ct 
683 -247 705 -236 718 -215 ct 732 -194 739 -163 739 -122 ct p
707 -122 m  707 -157 703 -182 695 -198 ct 687 -214 673 -222 655 -222 ct 636 -222 622 -214 614 -199 ct 
605 -183 601 -158 601 -122 ct 601 -88 605 -62 614 -46 ct 622 -30 636 -22 654 -22 ct 
672 -22 686 -31 694 -47 ct 703 -63 707 -88 707 -122 ct p ef
820 -192 m  865 -210 l  873 -187 l  824 -175 l  856 -131 l  836 -119 l 
810 -164 l  783 -119 l  762 -132 l  795 -175 l  747 -187 l  754 -210 l 
800 -192 l  798 -243 l  822 -243 l  820 -192 l  p ef
1054 -80 m  1054 -54 1047 -34 1033 -19 ct 1019 -4 1000 3 975 3 ct 948 3 927 -7 913 -28 ct 
898 -48 891 -77 891 -116 ct 891 -158 898 -191 914 -213 ct 929 -236 950 -247 978 -247 ct 
1014 -247 1038 -231 1047 -198 ct 1017 -192 l  1011 -212 998 -222 977 -222 ct 
960 -222 946 -214 936 -197 ct 927 -181 922 -157 922 -126 ct 927 -136 935 -144 946 -150 ct 
956 -155 968 -158 981 -158 ct 1003 -158 1021 -151 1034 -137 ct 1047 -123 1054 -104 1054 -80 ct 
p
1022 -79 m  1022 -96 1018 -110 1009 -120 ct 1001 -129 989 -134 973 -134 ct 959 -134 947 -130 938 -121 ct 
929 -113 925 -101 925 -86 ct 925 -67 930 -52 939 -40 ct 948 -28 960 -22 974 -22 ct 
989 -22 1001 -27 1010 -37 ct 1018 -47 1022 -61 1022 -79 ct p ef
1237 -218 m  1212 -180 1194 -151 1184 -129 ct 1174 -108 1166 -86 1161 -65 ct 
1156 -45 1153 -23 1153 -1 ct 1121 -1 l  1121 -32 1127 -64 1141 -98 ct 1154 -133 1176 -172 1207 -217 ct 
1076 -217 l  1076 -243 l  1237 -243 l  1237 -218 l  p ef
1262 0 m  1262 -22 l  1268 -35 1275 -47 1283 -58 ct 1292 -68 1301 -77 1310 -85 ct 
1319 -94 1328 -101 1338 -109 ct 1347 -116 1355 -123 1362 -130 ct 1370 -137 1376 -145 1380 -152 ct 
1385 -160 1387 -169 1387 -179 ct 1387 -192 1383 -203 1375 -210 ct 1367 -217 1357 -221 1343 -221 ct 
1329 -221 1318 -217 1310 -210 ct 1301 -203 1296 -193 1295 -180 ct 1263 -183 l 
1265 -202 1274 -218 1288 -229 ct 1302 -241 1320 -247 1343 -247 ct 1367 -247 1386 -241 1399 -229 ct 
1412 -218 1419 -201 1419 -180 ct 1419 -171 1417 -161 1412 -152 ct 1408 -143 1402 -133 1393 -124 ct 
1385 -115 1368 -100 1344 -81 ct 1331 -70 1321 -60 1313 -51 ct 1305 -43 1299 -34 1296 -26 ct 
1423 -26 l  1423 0 l  1262 0 l  p ef
1612 -122 m  1612 -81 1604 -50 1590 -29 ct 1576 -8 1555 3 1527 3 ct 1499 3 1478 -8 1464 -29 ct 
1450 -50 1443 -81 1443 -122 ct 1443 -164 1450 -195 1463 -216 ct 1477 -237 1498 -247 1528 -247 ct 
1556 -247 1578 -236 1591 -215 ct 1605 -194 1612 -163 1612 -122 ct p
1580 -122 m  1580 -157 1576 -182 1568 -198 ct 1560 -214 1546 -222 1528 -222 ct 
1509 -222 1495 -214 1487 -199 ct 1478 -183 1474 -158 1474 -122 ct 1474 -88 1478 -62 1487 -46 ct 
1495 -30 1509 -22 1527 -22 ct 1545 -22 1559 -31 1567 -47 ct 1576 -63 1580 -88 1580 -122 ct 
p ef
pom
pum
54875 13091 t
27 0 m  27 -26 l  89 -26 l  89 -213 l  34 -174 l  34 -204 l  91 -243 l 
120 -243 l  120 -26 l  179 -26 l  179 0 l  27 0 l  p ef
366 -68 m  366 -45 359 -28 344 -16 ct 330 -3 310 3 283 3 ct 259 3 239 -3 225 -14 ct 
210 -25 201 -41 198 -63 ct 231 -66 l  235 -37 252 -23 283 -23 ct 299 -23 311 -27 320 -34 ct 
329 -42 334 -54 334 -69 ct 334 -82 328 -92 318 -100 ct 308 -107 293 -111 274 -111 ct 
257 -111 l  257 -138 l  274 -138 l  291 -138 304 -142 313 -149 ct 323 -156 327 -167 327 -180 ct 
327 -193 323 -203 316 -210 ct 308 -218 297 -221 282 -221 ct 268 -221 257 -218 249 -211 ct 
240 -204 235 -194 234 -182 ct 203 -184 l  205 -204 213 -219 227 -230 ct 242 -241 260 -247 282 -247 ct 
306 -247 325 -241 339 -230 ct 352 -219 359 -203 359 -183 ct 359 -167 355 -155 346 -145 ct 
337 -135 325 -129 308 -125 ct 308 -125 l  326 -123 341 -117 351 -106 ct 361 -96 366 -83 366 -68 ct 
p ef
522 -55 m  522 0 l  493 0 l  493 -55 l  378 -55 l  378 -79 l  489 -243 l 
522 -243 l  522 -79 l  556 -79 l  556 -55 l  522 -55 l  p
493 -208 m  492 -207 491 -204 488 -199 ct 485 -193 483 -190 481 -187 ct 419 -96 l 
409 -83 l  407 -79 l  493 -79 l  493 -208 l  p ef
708 -55 m  708 0 l  679 0 l  679 -55 l  564 -55 l  564 -79 l  675 -243 l 
708 -243 l  708 -79 l  742 -79 l  742 -55 l  708 -55 l  p
679 -208 m  678 -207 677 -204 674 -199 ct 671 -193 669 -190 667 -187 ct 605 -96 l 
595 -83 l  593 -79 l  679 -79 l  679 -208 l  p ef
924 -122 m  924 -81 916 -50 902 -29 ct 888 -8 867 3 839 3 ct 811 3 790 -8 776 -29 ct 
762 -50 755 -81 755 -122 ct 755 -164 762 -195 775 -216 ct 789 -237 810 -247 840 -247 ct 
868 -247 890 -236 903 -215 ct 917 -194 924 -163 924 -122 ct p
892 -122 m  892 -157 888 -182 880 -198 ct 872 -214 858 -222 840 -222 ct 821 -222 807 -214 799 -199 ct 
790 -183 786 -158 786 -122 ct 786 -88 790 -62 799 -46 ct 807 -30 821 -22 839 -22 ct 
857 -22 871 -31 879 -47 ct 888 -63 892 -88 892 -122 ct p ef
1005 -192 m  1050 -210 l  1058 -187 l  1009 -175 l  1041 -131 l  1021 -119 l 
995 -164 l  968 -119 l  947 -132 l  980 -175 l  932 -187 l  939 -210 l 
985 -192 l  983 -243 l  1007 -243 l  1005 -192 l  p ef
1085 0 m  1085 -26 l  1147 -26 l  1147 -213 l  1092 -174 l  1092 -204 l 
1149 -243 l  1178 -243 l  1178 -26 l  1237 -26 l  1237 0 l  1085 0 l  p ef
1425 -68 m  1425 -45 1418 -28 1403 -16 ct 1389 -3 1369 3 1342 3 ct 1318 3 1298 -3 1284 -14 ct 
1269 -25 1260 -41 1257 -63 ct 1290 -66 l  1294 -37 1311 -23 1342 -23 ct 1358 -23 1370 -27 1379 -34 ct 
1388 -42 1393 -54 1393 -69 ct 1393 -82 1387 -92 1377 -100 ct 1367 -107 1352 -111 1333 -111 ct 
1316 -111 l  1316 -138 l  1333 -138 l  1350 -138 1363 -142 1372 -149 ct 1382 -156 1386 -167 1386 -180 ct 
1386 -193 1382 -203 1375 -210 ct 1367 -218 1356 -221 1341 -221 ct 1327 -221 1316 -218 1308 -211 ct 
1299 -204 1294 -194 1293 -182 ct 1262 -184 l  1264 -204 1272 -219 1286 -230 ct 
1301 -241 1319 -247 1341 -247 ct 1365 -247 1384 -241 1398 -230 ct 1411 -219 1418 -203 1418 -183 ct 
1418 -167 1414 -155 1405 -145 ct 1396 -135 1384 -129 1367 -125 ct 1367 -125 l 
1385 -123 1400 -117 1410 -106 ct 1420 -96 1425 -83 1425 -68 ct p ef
1581 -55 m  1581 0 l  1552 0 l  1552 -55 l  1437 -55 l  1437 -79 l  1548 -243 l 
1581 -243 l  1581 -79 l  1615 -79 l  1615 -55 l  1581 -55 l  p
1552 -208 m  1551 -207 1550 -204 1547 -199 ct 1544 -193 1542 -190 1540 -187 ct 
1478 -96 l  1468 -83 l  1466 -79 l  1552 -79 l  1552 -208 l  p ef
1766 -55 m  1766 0 l  1737 0 l  1737 -55 l  1622 -55 l  1622 -79 l  1733 -243 l 
1766 -243 l  1766 -79 l  1800 -79 l  1800 -55 l  1766 -55 l  p
1737 -208 m  1736 -207 1735 -204 1732 -199 ct 1729 -193 1727 -190 1725 -187 ct 
1663 -96 l  1653 -83 l  1651 -79 l  1737 -79 l  1737 -208 l  p ef
1982 -122 m  1982 -81 1974 -50 1960 -29 ct 1946 -8 1925 3 1897 3 ct 1869 3 1848 -8 1834 -29 ct 
1820 -50 1813 -81 1813 -122 ct 1813 -164 1820 -195 1833 -216 ct 1847 -237 1868 -247 1898 -247 ct 
1926 -247 1948 -236 1961 -215 ct 1975 -194 1982 -163 1982 -122 ct p
1950 -122 m  1950 -157 1946 -182 1938 -198 ct 1930 -214 1916 -222 1898 -222 ct 
1879 -222 1865 -214 1857 -199 ct 1848 -183 1844 -158 1844 -122 ct 1844 -88 1848 -62 1857 -46 ct 
1865 -30 1879 -22 1897 -22 ct 1915 -22 1929 -31 1937 -47 ct 1946 -63 1950 -88 1950 -122 ct 
p ef
pom
pum
57851 13091 t
18 0 m  18 -22 l  24 -35 31 -47 39 -58 ct 48 -68 57 -77 66 -85 ct 75 -94 84 -101 94 -109 ct 
103 -116 111 -123 118 -130 ct 126 -137 132 -145 136 -152 ct 141 -160 143 -169 143 -179 ct 
143 -192 139 -203 131 -210 ct 123 -217 113 -221 99 -221 ct 85 -221 74 -217 66 -210 ct 
57 -203 52 -193 51 -180 ct 19 -183 l  21 -202 30 -218 44 -229 ct 58 -241 76 -247 99 -247 ct 
123 -247 142 -241 155 -229 ct 168 -218 175 -201 175 -180 ct 175 -171 173 -161 168 -152 ct 
164 -143 158 -133 149 -124 ct 141 -115 124 -100 100 -81 ct 87 -70 77 -60 69 -51 ct 
61 -43 55 -34 52 -26 ct 179 -26 l  179 0 l  18 0 l  p ef
366 -80 m  366 -54 359 -34 345 -19 ct 331 -4 312 3 287 3 ct 260 3 239 -7 225 -28 ct 
210 -48 203 -77 203 -116 ct 203 -158 210 -191 226 -213 ct 241 -236 262 -247 290 -247 ct 
326 -247 350 -231 359 -198 ct 329 -192 l  323 -212 310 -222 289 -222 ct 272 -222 258 -214 248 -197 ct 
239 -181 234 -157 234 -126 ct 239 -136 247 -144 258 -150 ct 268 -155 280 -158 293 -158 ct 
315 -158 333 -151 346 -137 ct 359 -123 366 -104 366 -80 ct p
334 -79 m  334 -96 330 -110 321 -120 ct 313 -129 301 -134 285 -134 ct 271 -134 259 -130 250 -121 ct 
241 -113 237 -101 237 -86 ct 237 -67 242 -52 251 -40 ct 260 -28 272 -22 286 -22 ct 
301 -22 313 -27 322 -37 ct 330 -47 334 -61 334 -79 ct p ef
551 -68 m  551 -46 544 -28 530 -16 ct 515 -3 495 3 468 3 ct 442 3 422 -3 407 -15 ct 
393 -28 385 -45 385 -68 ct 385 -84 390 -97 399 -108 ct 408 -119 420 -125 434 -128 ct 
434 -128 l  421 -131 410 -138 402 -148 ct 395 -159 391 -171 391 -185 ct 391 -203 398 -218 412 -230 ct 
426 -241 444 -247 468 -247 ct 491 -247 510 -241 524 -230 ct 538 -219 545 -204 545 -184 ct 
545 -171 541 -158 533 -148 ct 526 -138 515 -131 502 -129 ct 502 -128 l  517 -125 529 -119 538 -108 ct 
547 -98 551 -84 551 -68 ct p
513 -183 m  513 -210 498 -224 468 -224 ct 453 -224 442 -220 434 -214 ct 427 -207 423 -196 423 -183 ct 
423 -169 427 -158 435 -151 ct 442 -144 454 -140 468 -140 ct 483 -140 494 -143 501 -150 ct 
509 -157 513 -168 513 -183 ct p
519 -71 m  519 -86 514 -98 505 -105 ct 496 -113 484 -117 468 -117 ct 452 -117 440 -113 431 -104 ct 
422 -96 417 -85 417 -70 ct 417 -37 434 -20 469 -20 ct 485 -20 498 -24 506 -32 ct 
515 -41 519 -53 519 -71 ct p ef
737 -68 m  737 -46 730 -28 716 -16 ct 701 -3 681 3 654 3 ct 628 3 608 -3 593 -15 ct 
579 -28 571 -45 571 -68 ct 571 -84 576 -97 585 -108 ct 594 -119 606 -125 620 -128 ct 
620 -128 l  607 -131 596 -138 588 -148 ct 581 -159 577 -171 577 -185 ct 577 -203 584 -218 598 -230 ct 
612 -241 630 -247 654 -247 ct 677 -247 696 -241 710 -230 ct 724 -219 731 -204 731 -184 ct 
731 -171 727 -158 719 -148 ct 712 -138 701 -131 688 -129 ct 688 -128 l  703 -125 715 -119 724 -108 ct 
733 -98 737 -84 737 -68 ct p
699 -183 m  699 -210 684 -224 654 -224 ct 639 -224 628 -220 620 -214 ct 613 -207 609 -196 609 -183 ct 
609 -169 613 -158 621 -151 ct 628 -144 640 -140 654 -140 ct 669 -140 680 -143 687 -150 ct 
695 -157 699 -168 699 -183 ct p
705 -71 m  705 -86 700 -98 691 -105 ct 682 -113 670 -117 654 -117 ct 638 -117 626 -113 617 -104 ct 
608 -96 603 -85 603 -70 ct 603 -37 620 -20 655 -20 ct 671 -20 684 -24 692 -32 ct 
701 -41 705 -53 705 -71 ct p ef
924 -122 m  924 -81 916 -50 902 -29 ct 888 -8 867 3 839 3 ct 811 3 790 -8 776 -29 ct 
762 -50 755 -81 755 -122 ct 755 -164 762 -195 775 -216 ct 789 -237 810 -247 840 -247 ct 
868 -247 890 -236 903 -215 ct 917 -194 924 -163 924 -122 ct p
892 -122 m  892 -157 888 -182 880 -198 ct 872 -214 858 -222 840 -222 ct 821 -222 807 -214 799 -199 ct 
790 -183 786 -158 786 -122 ct 786 -88 790 -62 799 -46 ct 807 -30 821 -22 839 -22 ct 
857 -22 871 -31 879 -47 ct 888 -63 892 -88 892 -122 ct p ef
1005 -192 m  1050 -210 l  1058 -187 l  1009 -175 l  1041 -131 l  1021 -119 l 
995 -164 l  968 -119 l  947 -132 l  980 -175 l  932 -187 l  939 -210 l 
985 -192 l  983 -243 l  1007 -243 l  1005 -192 l  p ef
1076 0 m  1076 -22 l  1082 -35 1089 -47 1097 -58 ct 1106 -68 1115 -77 1124 -85 ct 
1133 -94 1142 -101 1152 -109 ct 1161 -116 1169 -123 1176 -130 ct 1184 -137 1190 -145 1194 -152 ct 
1199 -160 1201 -169 1201 -179 ct 1201 -192 1197 -203 1189 -210 ct 1181 -217 1171 -221 1157 -221 ct 
1143 -221 1132 -217 1124 -210 ct 1115 -203 1110 -193 1109 -180 ct 1077 -183 l 
1079 -202 1088 -218 1102 -229 ct 1116 -241 1134 -247 1157 -247 ct 1181 -247 1200 -241 1213 -229 ct 
1226 -218 1233 -201 1233 -180 ct 1233 -171 1231 -161 1226 -152 ct 1222 -143 1216 -133 1207 -124 ct 
1199 -115 1182 -100 1158 -81 ct 1145 -70 1135 -60 1127 -51 ct 1119 -43 1113 -34 1110 -26 ct 
1237 -26 l  1237 0 l  1076 0 l  p ef
1425 -80 m  1425 -54 1418 -34 1404 -19 ct 1390 -4 1371 3 1346 3 ct 1319 3 1298 -7 1284 -28 ct 
1269 -48 1262 -77 1262 -116 ct 1262 -158 1269 -191 1285 -213 ct 1300 -236 1321 -247 1349 -247 ct 
1385 -247 1409 -231 1418 -198 ct 1388 -192 l  1382 -212 1369 -222 1348 -222 ct 
1331 -222 1317 -214 1307 -197 ct 1298 -181 1293 -157 1293 -126 ct 1298 -136 1306 -144 1317 -150 ct 
1327 -155 1339 -158 1352 -158 ct 1374 -158 1392 -151 1405 -137 ct 1418 -123 1425 -104 1425 -80 ct 
p
1393 -79 m  1393 -96 1389 -110 1380 -120 ct 1372 -129 1360 -134 1344 -134 ct 
1330 -134 1318 -130 1309 -121 ct 1300 -113 1296 -101 1296 -86 ct 1296 -67 1301 -52 1310 -40 ct 
1319 -28 1331 -22 1345 -22 ct 1360 -22 1372 -27 1381 -37 ct 1389 -47 1393 -61 1393 -79 ct 
p ef
1610 -68 m  1610 -46 1603 -28 1589 -16 ct 1574 -3 1554 3 1527 3 ct 1501 3 1481 -3 1466 -15 ct 
1452 -28 1444 -45 1444 -68 ct 1444 -84 1449 -97 1458 -108 ct 1467 -119 1479 -125 1493 -128 ct 
1493 -128 l  1480 -131 1469 -138 1461 -148 ct 1454 -159 1450 -171 1450 -185 ct 
1450 -203 1457 -218 1471 -230 ct 1485 -241 1503 -247 1527 -247 ct 1550 -247 1569 -241 1583 -230 ct 
1597 -219 1604 -204 1604 -184 ct 1604 -171 1600 -158 1592 -148 ct 1585 -138 1574 -131 1561 -129 ct 
1561 -128 l  1576 -125 1588 -119 1597 -108 ct 1606 -98 1610 -84 1610 -68 ct 
p
1572 -183 m  1572 -210 1557 -224 1527 -224 ct 1512 -224 1501 -220 1493 -214 ct 
1486 -207 1482 -196 1482 -183 ct 1482 -169 1486 -158 1494 -151 ct 1501 -144 1513 -140 1527 -140 ct 
1542 -140 1553 -143 1560 -150 ct 1568 -157 1572 -168 1572 -183 ct p
1578 -71 m  1578 -86 1573 -98 1564 -105 ct 1555 -113 1543 -117 1527 -117 ct 
1511 -117 1499 -113 1490 -104 ct 1481 -96 1476 -85 1476 -70 ct 1476 -37 1493 -20 1528 -20 ct 
1544 -20 1557 -24 1565 -32 ct 1574 -41 1578 -53 1578 -71 ct p ef
1795 -68 m  1795 -46 1788 -28 1774 -16 ct 1759 -3 1739 3 1712 3 ct 1686 3 1666 -3 1651 -15 ct 
1637 -28 1629 -45 1629 -68 ct 1629 -84 1634 -97 1643 -108 ct 1652 -119 1664 -125 1678 -128 ct 
1678 -128 l  1665 -131 1654 -138 1646 -148 ct 1639 -159 1635 -171 1635 -185 ct 
1635 -203 1642 -218 1656 -230 ct 1670 -241 1688 -247 1712 -247 ct 1735 -247 1754 -241 1768 -230 ct 
1782 -219 1789 -204 1789 -184 ct 1789 -171 1785 -158 1777 -148 ct 1770 -138 1759 -131 1746 -129 ct 
1746 -128 l  1761 -125 1773 -119 1782 -108 ct 1791 -98 1795 -84 1795 -68 ct 
p
1757 -183 m  1757 -210 1742 -224 1712 -224 ct 1697 -224 1686 -220 1678 -214 ct 
1671 -207 1667 -196 1667 -183 ct 1667 -169 1671 -158 1679 -151 ct 1686 -144 1698 -140 1712 -140 ct 
1727 -140 1738 -143 1745 -150 ct 1753 -157 1757 -168 1757 -183 ct p
1763 -71 m  1763 -86 1758 -98 1749 -105 ct 1740 -113 1728 -117 1712 -117 ct 
1696 -117 1684 -113 1675 -104 ct 1666 -96 1661 -85 1661 -70 ct 1661 -37 1678 -20 1713 -20 ct 
1729 -20 1742 -24 1750 -32 ct 1759 -41 1763 -53 1763 -71 ct p ef
1982 -122 m  1982 -81 1974 -50 1960 -29 ct 1946 -8 1925 3 1897 3 ct 1869 3 1848 -8 1834 -29 ct 
1820 -50 1813 -81 1813 -122 ct 1813 -164 1820 -195 1833 -216 ct 1847 -237 1868 -247 1898 -247 ct 
1926 -247 1948 -236 1961 -215 ct 1975 -194 1982 -163 1982 -122 ct p
1950 -122 m  1950 -157 1946 -182 1938 -198 ct 1930 -214 1916 -222 1898 -222 ct 
1879 -222 1865 -214 1857 -199 ct 1848 -183 1844 -158 1844 -122 ct 1844 -88 1848 -62 1857 -46 ct 
1865 -30 1879 -22 1897 -22 ct 1915 -22 1929 -31 1937 -47 ct 1946 -63 1950 -88 1950 -122 ct 
p ef
pom
pum
43680 12794 t
183 -122 m  183 -81 175 -50 161 -29 ct 147 -8 126 3 98 3 ct 70 3 49 -8 35 -29 ct 
21 -50 14 -81 14 -122 ct 14 -164 21 -195 34 -216 ct 48 -237 69 -247 99 -247 ct 
127 -247 149 -236 162 -215 ct 176 -194 183 -163 183 -122 ct p
151 -122 m  151 -157 147 -182 139 -198 ct 131 -214 117 -222 99 -222 ct 80 -222 66 -214 58 -199 ct 
49 -183 45 -158 45 -122 ct 45 -88 49 -62 58 -46 ct 66 -30 80 -22 98 -22 ct 116 -22 130 -31 138 -47 ct 
147 -63 151 -88 151 -122 ct p ef
pom
pum
43309 11892 t
27 0 m  27 -26 l  89 -26 l  89 -213 l  34 -174 l  34 -204 l  91 -243 l 
120 -243 l  120 -26 l  179 -26 l  179 0 l  27 0 l  p ef
368 -122 m  368 -81 360 -50 346 -29 ct 332 -8 311 3 283 3 ct 255 3 234 -8 220 -29 ct 
206 -50 199 -81 199 -122 ct 199 -164 206 -195 219 -216 ct 233 -237 254 -247 284 -247 ct 
312 -247 334 -236 347 -215 ct 361 -194 368 -163 368 -122 ct p
336 -122 m  336 -157 332 -182 324 -198 ct 316 -214 302 -222 284 -222 ct 265 -222 251 -214 243 -199 ct 
234 -183 230 -158 230 -122 ct 230 -88 234 -62 243 -46 ct 251 -30 265 -22 283 -22 ct 
301 -22 315 -31 323 -47 ct 332 -63 336 -88 336 -122 ct p ef
553 -122 m  553 -81 545 -50 531 -29 ct 517 -8 496 3 468 3 ct 440 3 419 -8 405 -29 ct 
391 -50 384 -81 384 -122 ct 384 -164 391 -195 404 -216 ct 418 -237 439 -247 469 -247 ct 
497 -247 519 -236 532 -215 ct 546 -194 553 -163 553 -122 ct p
521 -122 m  521 -157 517 -182 509 -198 ct 501 -214 487 -222 469 -222 ct 450 -222 436 -214 428 -199 ct 
419 -183 415 -158 415 -122 ct 415 -88 419 -62 428 -46 ct 436 -30 450 -22 468 -22 ct 
486 -22 500 -31 508 -47 ct 517 -63 521 -88 521 -122 ct p ef
pom
pum
43309 10990 t
18 0 m  18 -22 l  24 -35 31 -47 39 -58 ct 48 -68 57 -77 66 -85 ct 75 -94 84 -101 94 -109 ct 
103 -116 111 -123 118 -130 ct 126 -137 132 -145 136 -152 ct 141 -160 143 -169 143 -179 ct 
143 -192 139 -203 131 -210 ct 123 -217 113 -221 99 -221 ct 85 -221 74 -217 66 -210 ct 
57 -203 52 -193 51 -180 ct 19 -183 l  21 -202 30 -218 44 -229 ct 58 -241 76 -247 99 -247 ct 
123 -247 142 -241 155 -229 ct 168 -218 175 -201 175 -180 ct 175 -171 173 -161 168 -152 ct 
164 -143 158 -133 149 -124 ct 141 -115 124 -100 100 -81 ct 87 -70 77 -60 69 -51 ct 
61 -43 55 -34 52 -26 ct 179 -26 l  179 0 l  18 0 l  p ef
368 -122 m  368 -81 360 -50 346 -29 ct 332 -8 311 3 283 3 ct 255 3 234 -8 220 -29 ct 
206 -50 199 -81 199 -122 ct 199 -164 206 -195 219 -216 ct 233 -237 254 -247 284 -247 ct 
312 -247 334 -236 347 -215 ct 361 -194 368 -163 368 -122 ct p
336 -122 m  336 -157 332 -182 324 -198 ct 316 -214 302 -222 284 -222 ct 265 -222 251 -214 243 -199 ct 
234 -183 230 -158 230 -122 ct 230 -88 234 -62 243 -46 ct 251 -30 265 -22 283 -22 ct 
301 -22 315 -31 323 -47 ct 332 -63 336 -88 336 -122 ct p ef
553 -122 m  553 -81 545 -50 531 -29 ct 517 -8 496 3 468 3 ct 440 3 419 -8 405 -29 ct 
391 -50 384 -81 384 -122 ct 384 -164 391 -195 404 -216 ct 418 -237 439 -247 469 -247 ct 
497 -247 519 -236 532 -215 ct 546 -194 553 -163 553 -122 ct p
521 -122 m  521 -157 517 -182 509 -198 ct 501 -214 487 -222 469 -222 ct 450 -222 436 -214 428 -199 ct 
419 -183 415 -158 415 -122 ct 415 -88 419 -62 428 -46 ct 436 -30 450 -22 468 -22 ct 
486 -22 500 -31 508 -47 ct 517 -63 521 -88 521 -122 ct p ef
pom
pum
43309 10088 t
181 -68 m  181 -45 174 -28 159 -16 ct 145 -3 125 3 98 3 ct 74 3 54 -3 40 -14 ct 
25 -25 16 -41 13 -63 ct 46 -66 l  50 -37 67 -23 98 -23 ct 114 -23 126 -27 135 -34 ct 
144 -42 149 -54 149 -69 ct 149 -82 143 -92 133 -100 ct 123 -107 108 -111 89 -111 ct 
72 -111 l  72 -138 l  89 -138 l  106 -138 119 -142 128 -149 ct 138 -156 142 -167 142 -180 ct 
142 -193 138 -203 131 -210 ct 123 -218 112 -221 97 -221 ct 83 -221 72 -218 64 -211 ct 
55 -204 50 -194 49 -182 ct 18 -184 l  20 -204 28 -219 42 -230 ct 57 -241 75 -247 97 -247 ct 
121 -247 140 -241 154 -230 ct 167 -219 174 -203 174 -183 ct 174 -167 170 -155 161 -145 ct 
152 -135 140 -129 123 -125 ct 123 -125 l  141 -123 156 -117 166 -106 ct 176 -96 181 -83 181 -68 ct 
p ef
368 -122 m  368 -81 360 -50 346 -29 ct 332 -8 311 3 283 3 ct 255 3 234 -8 220 -29 ct 
206 -50 199 -81 199 -122 ct 199 -164 206 -195 219 -216 ct 233 -237 254 -247 284 -247 ct 
312 -247 334 -236 347 -215 ct 361 -194 368 -163 368 -122 ct p
336 -122 m  336 -157 332 -182 324 -198 ct 316 -214 302 -222 284 -222 ct 265 -222 251 -214 243 -199 ct 
234 -183 230 -158 230 -122 ct 230 -88 234 -62 243 -46 ct 251 -30 265 -22 283 -22 ct 
301 -22 315 -31 323 -47 ct 332 -63 336 -88 336 -122 ct p ef
553 -122 m  553 -81 545 -50 531 -29 ct 517 -8 496 3 468 3 ct 440 3 419 -8 405 -29 ct 
391 -50 384 -81 384 -122 ct 384 -164 391 -195 404 -216 ct 418 -237 439 -247 469 -247 ct 
497 -247 519 -236 532 -215 ct 546 -194 553 -163 553 -122 ct p
521 -122 m  521 -157 517 -182 509 -198 ct 501 -214 487 -222 469 -222 ct 450 -222 436 -214 428 -199 ct 
419 -183 415 -158 415 -122 ct 415 -88 419 -62 428 -46 ct 436 -30 450 -22 468 -22 ct 
486 -22 500 -31 508 -47 ct 517 -63 521 -88 521 -122 ct p ef
pom
pum
43309 9186 t
152 -55 m  152 0 l  123 0 l  123 -55 l  8 -55 l  8 -79 l  119 -243 l  152 -243 l 
152 -79 l  186 -79 l  186 -55 l  152 -55 l  p
123 -208 m  122 -207 121 -204 118 -199 ct 115 -193 113 -190 111 -187 ct 49 -96 l 
39 -83 l  37 -79 l  123 -79 l  123 -208 l  p ef
368 -122 m  368 -81 360 -50 346 -29 ct 332 -8 311 3 283 3 ct 255 3 234 -8 220 -29 ct 
206 -50 199 -81 199 -122 ct 199 -164 206 -195 219 -216 ct 233 -237 254 -247 284 -247 ct 
312 -247 334 -236 347 -215 ct 361 -194 368 -163 368 -122 ct p
336 -122 m  336 -157 332 -182 324 -198 ct 316 -214 302 -222 284 -222 ct 265 -222 251 -214 243 -199 ct 
234 -183 230 -158 230 -122 ct 230 -88 234 -62 243 -46 ct 251 -30 265 -22 283 -22 ct 
301 -22 315 -31 323 -47 ct 332 -63 336 -88 336 -122 ct p ef
553 -122 m  553 -81 545 -50 531 -29 ct 517 -8 496 3 468 3 ct 440 3 419 -8 405 -29 ct 
391 -50 384 -81 384 -122 ct 384 -164 391 -195 404 -216 ct 418 -237 439 -247 469 -247 ct 
497 -247 519 -236 532 -215 ct 546 -194 553 -163 553 -122 ct p
521 -122 m  521 -157 517 -182 509 -198 ct 501 -214 487 -222 469 -222 ct 450 -222 436 -214 428 -199 ct 
419 -183 415 -158 415 -122 ct 415 -88 419 -62 428 -46 ct 436 -30 450 -22 468 -22 ct 
486 -22 500 -31 508 -47 ct 517 -63 521 -88 521 -122 ct p ef
pom
pum
43309 8284 t
182 -80 m  182 -54 174 -34 159 -19 ct 143 -4 122 3 95 3 ct 73 3 54 -2 41 -12 ct 
27 -22 18 -36 14 -55 ct 46 -58 l  52 -34 69 -22 96 -22 ct 113 -22 126 -27 135 -37 ct 
145 -47 149 -61 149 -79 ct 149 -94 145 -106 135 -116 ct 126 -125 113 -130 97 -130 ct 
88 -130 80 -129 73 -126 ct 66 -123 59 -119 52 -113 ct 21 -113 l  29 -243 l  167 -243 l 
167 -217 l  58 -217 l  53 -140 l  66 -150 83 -155 103 -155 ct 127 -155 146 -148 160 -134 ct 
174 -120 182 -102 182 -80 ct p ef
368 -122 m  368 -81 360 -50 346 -29 ct 332 -8 311 3 283 3 ct 255 3 234 -8 220 -29 ct 
206 -50 199 -81 199 -122 ct 199 -164 206 -195 219 -216 ct 233 -237 254 -247 284 -247 ct 
312 -247 334 -236 347 -215 ct 361 -194 368 -163 368 -122 ct p
336 -122 m  336 -157 332 -182 324 -198 ct 316 -214 302 -222 284 -222 ct 265 -222 251 -214 243 -199 ct 
234 -183 230 -158 230 -122 ct 230 -88 234 -62 243 -46 ct 251 -30 265 -22 283 -22 ct 
301 -22 315 -31 323 -47 ct 332 -63 336 -88 336 -122 ct p ef
553 -122 m  553 -81 545 -50 531 -29 ct 517 -8 496 3 468 3 ct 440 3 419 -8 405 -29 ct 
391 -50 384 -81 384 -122 ct 384 -164 391 -195 404 -216 ct 418 -237 439 -247 469 -247 ct 
497 -247 519 -236 532 -215 ct 546 -194 553 -163 553 -122 ct p
521 -122 m  521 -157 517 -182 509 -198 ct 501 -214 487 -222 469 -222 ct 450 -222 436 -214 428 -199 ct 
419 -183 415 -158 415 -122 ct 415 -88 419 -62 428 -46 ct 436 -30 450 -22 468 -22 ct 
486 -22 500 -31 508 -47 ct 517 -63 521 -88 521 -122 ct p ef
pom
pum
43309 7382 t
181 -80 m  181 -54 174 -34 160 -19 ct 146 -4 127 3 102 3 ct 75 3 54 -7 40 -28 ct 
25 -48 18 -77 18 -116 ct 18 -158 25 -191 41 -213 ct 56 -236 77 -247 105 -247 ct 
141 -247 165 -231 174 -198 ct 144 -192 l  138 -212 125 -222 104 -222 ct 87 -222 73 -214 63 -197 ct 
54 -181 49 -157 49 -126 ct 54 -136 62 -144 73 -150 ct 83 -155 95 -158 108 -158 ct 
130 -158 148 -151 161 -137 ct 174 -123 181 -104 181 -80 ct p
149 -79 m  149 -96 145 -110 136 -120 ct 128 -129 116 -134 100 -134 ct 86 -134 74 -130 65 -121 ct 
56 -113 52 -101 52 -86 ct 52 -67 57 -52 66 -40 ct 75 -28 87 -22 101 -22 ct 116 -22 128 -27 137 -37 ct 
145 -47 149 -61 149 -79 ct p ef
368 -122 m  368 -81 360 -50 346 -29 ct 332 -8 311 3 283 3 ct 255 3 234 -8 220 -29 ct 
206 -50 199 -81 199 -122 ct 199 -164 206 -195 219 -216 ct 233 -237 254 -247 284 -247 ct 
312 -247 334 -236 347 -215 ct 361 -194 368 -163 368 -122 ct p
336 -122 m  336 -157 332 -182 324 -198 ct 316 -214 302 -222 284 -222 ct 265 -222 251 -214 243 -199 ct 
234 -183 230 -158 230 -122 ct 230 -88 234 -62 243 -46 ct 251 -30 265 -22 283 -22 ct 
301 -22 315 -31 323 -47 ct 332 -63 336 -88 336 -122 ct p ef
553 -122 m  553 -81 545 -50 531 -29 ct 517 -8 496 3 468 3 ct 440 3 419 -8 405 -29 ct 
391 -50 384 -81 384 -122 ct 384 -164 391 -195 404 -216 ct 418 -237 439 -247 469 -247 ct 
497 -247 519 -236 532 -215 ct 546 -194 553 -163 553 -122 ct p
521 -122 m  521 -157 517 -182 509 -198 ct 501 -214 487 -222 469 -222 ct 450 -222 436 -214 428 -199 ct 
419 -183 415 -158 415 -122 ct 415 -88 419 -62 428 -46 ct 436 -30 450 -22 468 -22 ct 
486 -22 500 -31 508 -47 ct 517 -63 521 -88 521 -122 ct p ef
pom
pum
43309 6480 t
179 -218 m  154 -180 136 -151 126 -129 ct 116 -108 108 -86 103 -65 ct 98 -45 95 -23 95 -1 ct 
63 -1 l  63 -32 69 -64 83 -98 ct 96 -133 118 -172 149 -217 ct 18 -217 l  18 -243 l 
179 -243 l  179 -218 l  p ef
368 -122 m  368 -81 360 -50 346 -29 ct 332 -8 311 3 283 3 ct 255 3 234 -8 220 -29 ct 
206 -50 199 -81 199 -122 ct 199 -164 206 -195 219 -216 ct 233 -237 254 -247 284 -247 ct 
312 -247 334 -236 347 -215 ct 361 -194 368 -163 368 -122 ct p
336 -122 m  336 -157 332 -182 324 -198 ct 316 -214 302 -222 284 -222 ct 265 -222 251 -214 243 -199 ct 
234 -183 230 -158 230 -122 ct 230 -88 234 -62 243 -46 ct 251 -30 265 -22 283 -22 ct 
301 -22 315 -31 323 -47 ct 332 -63 336 -88 336 -122 ct p ef
553 -122 m  553 -81 545 -50 531 -29 ct 517 -8 496 3 468 3 ct 440 3 419 -8 405 -29 ct 
391 -50 384 -81 384 -122 ct 384 -164 391 -195 404 -216 ct 418 -237 439 -247 469 -247 ct 
497 -247 519 -236 532 -215 ct 546 -194 553 -163 553 -122 ct p
521 -122 m  521 -157 517 -182 509 -198 ct 501 -214 487 -222 469 -222 ct 450 -222 436 -214 428 -199 ct 
419 -183 415 -158 415 -122 ct 415 -88 419 -62 428 -46 ct 436 -30 450 -22 468 -22 ct 
486 -22 500 -31 508 -47 ct 517 -63 521 -88 521 -122 ct p ef
pom
pum
43309 5578 t
181 -68 m  181 -46 174 -28 160 -16 ct 145 -3 125 3 98 3 ct 72 3 52 -3 37 -15 ct 
23 -28 15 -45 15 -68 ct 15 -84 20 -97 29 -108 ct 38 -119 50 -125 64 -128 ct 64 -128 l 
51 -131 40 -138 32 -148 ct 25 -159 21 -171 21 -185 ct 21 -203 28 -218 42 -230 ct 
56 -241 74 -247 98 -247 ct 121 -247 140 -241 154 -230 ct 168 -219 175 -204 175 -184 ct 
175 -171 171 -158 163 -148 ct 156 -138 145 -131 132 -129 ct 132 -128 l  147 -125 159 -119 168 -108 ct 
177 -98 181 -84 181 -68 ct p
143 -183 m  143 -210 128 -224 98 -224 ct 83 -224 72 -220 64 -214 ct 57 -207 53 -196 53 -183 ct 
53 -169 57 -158 65 -151 ct 72 -144 84 -140 98 -140 ct 113 -140 124 -143 131 -150 ct 
139 -157 143 -168 143 -183 ct p
149 -71 m  149 -86 144 -98 135 -105 ct 126 -113 114 -117 98 -117 ct 82 -117 70 -113 61 -104 ct 
52 -96 47 -85 47 -70 ct 47 -37 64 -20 99 -20 ct 115 -20 128 -24 136 -32 ct 145 -41 149 -53 149 -71 ct 
p ef
368 -122 m  368 -81 360 -50 346 -29 ct 332 -8 311 3 283 3 ct 255 3 234 -8 220 -29 ct 
206 -50 199 -81 199 -122 ct 199 -164 206 -195 219 -216 ct 233 -237 254 -247 284 -247 ct 
312 -247 334 -236 347 -215 ct 361 -194 368 -163 368 -122 ct p
336 -122 m  336 -157 332 -182 324 -198 ct 316 -214 302 -222 284 -222 ct 265 -222 251 -214 243 -199 ct 
234 -183 230 -158 230 -122 ct 230 -88 234 -62 243 -46 ct 251 -30 265 -22 283 -22 ct 
301 -22 315 -31 323 -47 ct 332 -63 336 -88 336 -122 ct p ef
553 -122 m  553 -81 545 -50 531 -29 ct 517 -8 496 3 468 3 ct 440 3 419 -8 405 -29 ct 
391 -50 384 -81 384 -122 ct 384 -164 391 -195 404 -216 ct 418 -237 439 -247 469 -247 ct 
497 -247 519 -236 532 -215 ct 546 -194 553 -163 553 -122 ct p
521 -122 m  521 -157 517 -182 509 -198 ct 501 -214 487 -222 469 -222 ct 450 -222 436 -214 428 -199 ct 
419 -183 415 -158 415 -122 ct 415 -88 419 -62 428 -46 ct 436 -30 450 -22 468 -22 ct 
486 -22 500 -31 508 -47 ct 517 -63 521 -88 521 -122 ct p ef
pom
pum
43309 4677 t
180 -127 m  180 -85 172 -53 157 -31 ct 142 -8 120 3 92 3 ct 73 3 58 -1 46 -9 ct 
35 -17 26 -30 22 -48 ct 51 -52 l  57 -32 71 -22 92 -22 ct 110 -22 124 -30 134 -47 ct 
143 -63 148 -87 149 -118 ct 144 -107 136 -99 125 -93 ct 114 -87 102 -84 89 -84 ct 
67 -84 49 -91 36 -106 ct 23 -121 17 -141 17 -165 ct 17 -191 24 -211 38 -225 ct 
52 -240 72 -247 97 -247 ct 124 -247 145 -237 159 -217 ct 173 -197 180 -167 180 -127 ct 
p
146 -157 m  146 -176 141 -192 132 -204 ct 123 -216 111 -222 96 -222 ct 81 -222 70 -217 61 -207 ct 
52 -196 48 -183 48 -165 ct 48 -148 52 -134 61 -123 ct 70 -113 81 -108 96 -108 ct 
105 -108 113 -110 121 -114 ct 129 -118 135 -124 139 -131 ct 144 -139 146 -147 146 -157 ct 
p ef
368 -122 m  368 -81 360 -50 346 -29 ct 332 -8 311 3 283 3 ct 255 3 234 -8 220 -29 ct 
206 -50 199 -81 199 -122 ct 199 -164 206 -195 219 -216 ct 233 -237 254 -247 284 -247 ct 
312 -247 334 -236 347 -215 ct 361 -194 368 -163 368 -122 ct p
336 -122 m  336 -157 332 -182 324 -198 ct 316 -214 302 -222 284 -222 ct 265 -222 251 -214 243 -199 ct 
234 -183 230 -158 230 -122 ct 230 -88 234 -62 243 -46 ct 251 -30 265 -22 283 -22 ct 
301 -22 315 -31 323 -47 ct 332 -63 336 -88 336 -122 ct p ef
553 -122 m  553 -81 545 -50 531 -29 ct 517 -8 496 3 468 3 ct 440 3 419 -8 405 -29 ct 
391 -50 384 -81 384 -122 ct 384 -164 391 -195 404 -216 ct 418 -237 439 -247 469 -247 ct 
497 -247 519 -236 532 -215 ct 546 -194 553 -163 553 -122 ct p
521 -122 m  521 -157 517 -182 509 -198 ct 501 -214 487 -222 469 -222 ct 450 -222 436 -214 428 -199 ct 
419 -183 415 -158 415 -122 ct 415 -88 419 -62 428 -46 ct 436 -30 450 -22 468 -22 ct 
486 -22 500 -31 508 -47 ct 517 -63 521 -88 521 -122 ct p ef
pom
pum
49742 2936 t
249 0 m  154 -138 l  58 0 l  10 0 l  130 -164 l  20 -316 l  67 -316 l 
155 -192 l  240 -316 l  287 -316 l  179 -166 l  297 0 l  249 0 l  p ef
534 -116 m  534 -81 525 -52 506 -29 ct 488 -7 465 4 436 4 ct 419 4 405 1 393 -4 ct 
381 -9 370 -17 361 -28 ct 360 -28 l  361 -19 361 -10 361 0 ct 361 95 l  321 95 l 
321 -131 l  321 -167 330 -196 348 -217 ct 366 -237 391 -248 423 -248 ct 444 -248 463 -242 480 -232 ct 
497 -221 510 -205 520 -185 ct 529 -165 534 -142 534 -116 ct p
490 -118 m  490 -149 484 -174 471 -191 ct 459 -209 441 -218 420 -218 ct 381 -218 361 -189 361 -130 ct 
361 -59 l  369 -48 380 -40 392 -35 ct 405 -29 417 -26 431 -26 ct 450 -26 464 -34 475 -50 ct 
485 -65 490 -88 490 -118 ct p ef
792 -122 m  792 -80 783 -48 764 -27 ct 745 -6 718 4 683 4 ct 647 4 620 -7 602 -28 ct 
584 -50 575 -81 575 -122 ct 575 -206 612 -248 684 -248 ct 721 -248 748 -238 766 -217 ct 
783 -197 792 -165 792 -122 ct p
750 -122 m  750 -156 745 -180 735 -195 ct 725 -210 708 -218 685 -218 ct 661 -218 644 -210 633 -195 ct 
623 -179 618 -155 618 -122 ct 618 -90 623 -66 633 -50 ct 644 -34 660 -26 682 -26 ct 
706 -26 724 -34 734 -49 ct 744 -65 750 -89 750 -122 ct p
669 -274 m  669 -281 l  684 -347 l  730 -347 l  730 -338 l  685 -274 l 
669 -274 l  p ef
1006 -190 m  1006 -164 998 -134 983 -100 ct 967 -66 946 -33 920 0 ct 881 0 l 
794 -243 l  836 -243 l  906 -35 l  946 -86 966 -137 966 -188 ct 966 -208 962 -226 955 -243 ct 
994 -243 l  1002 -228 1006 -210 1006 -190 ct p ef
1268 -122 m  1268 -80 1259 -48 1240 -27 ct 1221 -6 1194 4 1159 4 ct 1123 4 1096 -7 1078 -28 ct 
1060 -50 1051 -81 1051 -122 ct 1051 -206 1088 -248 1160 -248 ct 1197 -248 1224 -238 1242 -217 ct 
1259 -197 1268 -165 1268 -122 ct p
1226 -122 m  1226 -156 1221 -180 1211 -195 ct 1201 -210 1184 -218 1161 -218 ct 
1137 -218 1120 -210 1109 -195 ct 1099 -179 1094 -155 1094 -122 ct 1094 -90 1099 -66 1109 -50 ct 
1120 -34 1136 -26 1158 -26 ct 1182 -26 1200 -34 1210 -49 ct 1220 -65 1226 -89 1226 -122 ct 
p ef
1400 -215 m  1388 -215 1377 -210 1367 -201 ct 1357 -192 1349 -178 1342 -160 ct 
1335 -142 1332 -123 1332 -105 ct 1332 -86 1337 -72 1347 -62 ct 1356 -52 1376 -42 1405 -33 ct 
1429 -25 l  1461 -15 1477 3 1477 28 ct 1477 34 1476 41 1473 50 ct 1470 58 1466 68 1458 80 ct 
1430 67 l  1434 62 1437 57 1439 51 ct 1441 45 1443 40 1443 35 ct 1443 28 1439 22 1431 17 ct 
1424 12 1408 7 1384 0 ct 1357 -7 1338 -15 1325 -23 ct 1313 -32 1304 -43 1298 -56 ct 
1292 -69 1289 -86 1289 -106 ct 1289 -123 1292 -140 1298 -159 ct 1304 -177 1312 -193 1321 -206 ct 
1331 -219 1343 -229 1356 -236 ct 1369 -243 1384 -247 1400 -247 ct 1416 -247 1429 -245 1440 -241 ct 
1451 -237 1462 -229 1471 -219 ct 1445 -193 l  1431 -208 1416 -215 1400 -215 ct 
p ef
1716 -26 m  1729 -26 1742 -29 1754 -36 ct 1767 -43 1778 -51 1786 -62 ct 1810 -40 l 
1798 -25 1784 -14 1768 -7 ct 1751 0 1733 4 1714 4 ct 1686 4 1666 -2 1651 -15 ct 
1637 -27 1630 -44 1630 -67 ct 1630 -83 1635 -97 1646 -108 ct 1658 -119 1672 -125 1689 -127 ct 
1689 -127 l  1673 -129 1660 -135 1651 -145 ct 1642 -155 1637 -168 1637 -182 ct 
1637 -202 1645 -217 1660 -229 ct 1675 -241 1695 -247 1720 -247 ct 1757 -247 1785 -233 1804 -206 ct 
1775 -186 l  1761 -207 1743 -217 1720 -217 ct 1706 -217 1696 -214 1689 -208 ct 
1681 -201 1678 -193 1678 -182 ct 1678 -168 1684 -158 1695 -152 ct 1707 -145 1728 -142 1758 -142 ct 
1758 -112 l  1735 -112 1718 -111 1707 -108 ct 1695 -105 1687 -100 1681 -94 ct 
1675 -87 1672 -78 1672 -67 ct 1672 -54 1676 -44 1684 -37 ct 1692 -30 1702 -26 1716 -26 ct 
p ef
2009 0 m  1927 -111 l  1897 -86 l  1897 0 l  1857 0 l  1857 -243 l  1897 -243 l 
1897 -125 l  2004 -243 l  2051 -243 l  1953 -138 l  2056 0 l  2009 0 l 
p ef
2127 -214 m  2117 -214 2106 -213 2094 -211 ct 2082 -210 2074 -208 2071 -205 ct 
2071 -237 l  2074 -238 2080 -240 2088 -241 ct 2096 -242 2104 -243 2112 -243 ct 
2242 -243 l  2242 -214 l  2173 -214 l  2173 -60 l  2173 -49 2175 -40 2178 -35 ct 
2181 -30 2187 -28 2194 -28 ct 2214 -29 l  2214 0 l  2202 2 2192 4 2182 4 ct 
2164 4 2152 0 2144 -9 ct 2137 -17 2133 -31 2133 -51 ct 2133 -214 l  2127 -214 l 
p ef
2351 -26 m  2364 -26 2377 -29 2389 -36 ct 2402 -43 2413 -51 2421 -62 ct 2445 -40 l 
2433 -25 2419 -14 2403 -7 ct 2386 0 2368 4 2349 4 ct 2321 4 2301 -2 2286 -15 ct 
2272 -27 2265 -44 2265 -67 ct 2265 -83 2270 -97 2281 -108 ct 2293 -119 2307 -125 2324 -127 ct 
2324 -127 l  2308 -129 2295 -135 2286 -145 ct 2277 -155 2272 -168 2272 -182 ct 
2272 -202 2280 -217 2295 -229 ct 2310 -241 2330 -247 2355 -247 ct 2392 -247 2420 -233 2439 -206 ct 
2410 -186 l  2396 -207 2378 -217 2355 -217 ct 2341 -217 2331 -214 2324 -208 ct 
2316 -201 2313 -193 2313 -182 ct 2313 -168 2319 -158 2330 -152 ct 2342 -145 2363 -142 2393 -142 ct 
2393 -112 l  2370 -112 2353 -111 2342 -108 ct 2330 -105 2322 -100 2316 -94 ct 
2310 -87 2307 -78 2307 -67 ct 2307 -54 2311 -44 2319 -37 ct 2327 -30 2337 -26 2351 -26 ct 
p
2340 -274 m  2340 -281 l  2356 -347 l  2402 -347 l  2402 -338 l  2357 -274 l 
2340 -274 l  p ef
2565 -217 m  2555 -245 2548 -263 2545 -270 ct 2542 -277 2538 -283 2535 -288 ct 
2532 -292 2528 -296 2524 -298 ct 2520 -300 2515 -301 2509 -301 ct 2505 -301 2501 -300 2498 -298 ct 
2491 -328 l  2501 -331 2510 -333 2520 -333 ct 2535 -333 2549 -328 2559 -317 ct 
2569 -306 2580 -286 2591 -256 ct 2686 0 l  2644 0 l  2597 -130 l  2591 -146 2587 -162 2583 -178 ct 
2581 -171 2578 -163 2575 -155 ct 2572 -147 2549 -96 2506 0 ct 2464 0 l  2565 -217 l 
p ef
2801 -26 m  2814 -26 2827 -29 2839 -36 ct 2852 -43 2863 -51 2871 -62 ct 2895 -40 l 
2883 -25 2869 -14 2853 -7 ct 2836 0 2818 4 2799 4 ct 2771 4 2751 -2 2736 -15 ct 
2722 -27 2715 -44 2715 -67 ct 2715 -83 2720 -97 2731 -108 ct 2743 -119 2757 -125 2774 -127 ct 
2774 -127 l  2758 -129 2745 -135 2736 -145 ct 2727 -155 2722 -168 2722 -182 ct 
2722 -202 2730 -217 2745 -229 ct 2760 -241 2780 -247 2805 -247 ct 2842 -247 2870 -233 2889 -206 ct 
2860 -186 l  2846 -207 2828 -217 2805 -217 ct 2791 -217 2781 -214 2774 -208 ct 
2766 -201 2763 -193 2763 -182 ct 2763 -168 2769 -158 2780 -152 ct 2792 -145 2813 -142 2843 -142 ct 
2843 -112 l  2820 -112 2803 -111 2792 -108 ct 2780 -105 2772 -100 2766 -94 ct 
2760 -87 2757 -78 2757 -67 ct 2757 -54 2761 -44 2769 -37 ct 2777 -30 2787 -26 2801 -26 ct 
p ef
3150 -110 m  3150 -74 3141 -46 3121 -26 ct 3102 -6 3075 4 3040 4 ct 3005 4 2977 -7 2958 -27 ct 
2939 -48 2929 -79 2929 -118 ct 2929 -158 2940 -188 2963 -210 ct 2985 -232 3017 -243 3059 -243 ct 
3186 -243 l  3186 -214 l  3149 -214 l  3116 -215 l  3116 -214 l  3128 -196 3137 -179 3142 -162 ct 
3148 -145 3150 -128 3150 -110 ct p
3108 -110 m  3108 -148 3099 -182 3080 -214 ct 3060 -214 l  3033 -214 3011 -205 2995 -188 ct 
2980 -172 2972 -148 2972 -118 ct 2972 -57 2994 -26 3039 -26 ct 3061 -26 3078 -33 3090 -47 ct 
3102 -62 3108 -83 3108 -110 ct p ef
3360 95 m  3360 -154 l  3360 -170 3358 -182 3355 -191 ct 3352 -200 3347 -206 3340 -210 ct 
3333 -214 3323 -216 3310 -216 ct 3291 -216 3275 -209 3264 -196 ct 3253 -183 3247 -164 3247 -141 ct 
3247 0 l  3207 0 l  3207 -191 l  3207 -209 3204 -226 3199 -243 ct 3237 -243 l 
3239 -237 3241 -230 3243 -222 ct 3245 -214 3245 -207 3245 -201 ct 3246 -201 l 
3255 -218 3266 -230 3278 -237 ct 3290 -244 3306 -247 3324 -247 ct 3350 -247 3370 -240 3382 -227 ct 
3394 -214 3400 -192 3400 -162 ct 3400 95 l  3360 95 l  p ef
3543 -215 m  3531 -215 3520 -210 3510 -201 ct 3500 -192 3492 -178 3485 -160 ct 
3478 -142 3475 -123 3475 -105 ct 3475 -86 3480 -72 3490 -62 ct 3499 -52 3519 -42 3548 -33 ct 
3572 -25 l  3604 -15 3620 3 3620 28 ct 3620 34 3619 41 3616 50 ct 3613 58 3609 68 3601 80 ct 
3573 67 l  3577 62 3580 57 3582 51 ct 3584 45 3586 40 3586 35 ct 3586 28 3582 22 3574 17 ct 
3567 12 3551 7 3527 0 ct 3500 -7 3481 -15 3468 -23 ct 3456 -32 3447 -43 3441 -56 ct 
3435 -69 3432 -86 3432 -106 ct 3432 -123 3435 -140 3441 -159 ct 3447 -177 3455 -193 3464 -206 ct 
3474 -219 3486 -229 3499 -236 ct 3512 -243 3527 -247 3543 -247 ct 3559 -247 3572 -245 3583 -241 ct 
3594 -237 3605 -229 3614 -219 ct 3588 -193 l  3574 -208 3559 -215 3543 -215 ct 
p ef
3785 -119 m  3785 -162 3792 -201 3806 -235 ct 3819 -269 3840 -302 3868 -332 ct 
3907 -332 l  3879 -301 3859 -268 3846 -233 ct 3833 -198 3826 -160 3826 -119 ct 
3826 -77 3832 -39 3845 -4 ct 3858 30 3879 64 3907 95 ct 3868 95 l  3840 65 3819 32 3806 -2 ct 
3792 -37 3785 -75 3785 -118 ct 3785 -119 l  p ef
4129 -68 m  4129 -45 4120 -27 4103 -15 ct 4086 -2 4062 4 4031 4 ct 4000 4 3977 -1 3961 -11 ct 
3944 -21 3934 -36 3929 -57 ct 3964 -64 l  3968 -51 3975 -42 3986 -36 ct 3996 -30 4011 -27 4031 -27 ct 
4051 -27 4066 -30 4075 -36 ct 4085 -42 4090 -52 4090 -64 ct 4090 -74 4086 -82 4080 -88 ct 
4073 -94 4063 -99 4048 -103 ct 4019 -110 l  3996 -116 3979 -122 3970 -128 ct 
3960 -134 3952 -141 3947 -149 ct 3941 -157 3938 -167 3938 -179 ct 3938 -201 3946 -218 3962 -230 ct 
3978 -241 4001 -247 4031 -247 ct 4058 -247 4079 -242 4095 -233 ct 4111 -223 4120 -208 4125 -188 ct 
4088 -183 l  4086 -194 4080 -202 4070 -208 ct 4061 -214 4047 -217 4031 -217 ct 
4013 -217 3999 -214 3991 -208 ct 3982 -203 3978 -194 3978 -183 ct 3978 -176 3979 -171 3983 -166 ct 
3987 -162 3992 -158 3999 -155 ct 4006 -151 4021 -147 4043 -142 ct 4065 -136 4080 -131 4089 -127 ct 
4099 -122 4106 -117 4112 -112 ct 4117 -106 4121 -100 4124 -92 ct 4127 -85 4129 -77 4129 -68 ct 
p ef
4278 -118 m  4278 -75 4272 -36 4258 -2 ct 4245 32 4224 65 4196 95 ct 4157 95 l 
4185 64 4205 31 4218 -4 ct 4231 -39 4238 -77 4238 -119 ct 4238 -160 4231 -198 4218 -233 ct 
4205 -268 4185 -301 4157 -332 ct 4196 -332 l  4224 -302 4245 -269 4258 -235 ct 
4272 -200 4278 -162 4278 -119 ct 4278 -118 l  p ef
pom
pum
50510 3914 t
259 0 m  259 -178 l  259 -198 259 -217 261 -235 ct 254 -212 249 -195 244 -182 ct 
175 0 l  149 0 l  80 -182 l  69 -214 l  63 -235 l  63 -214 l  64 -178 l 
64 0 l  32 0 l  32 -267 l  79 -267 l  150 -82 l  153 -74 155 -66 158 -58 ct 
160 -49 162 -43 162 -39 ct 163 -44 165 -52 169 -62 ct 172 -73 174 -79 175 -82 ct 
245 -267 l  291 -267 l  291 0 l  259 0 l  p ef
556 -187 m  556 -161 548 -141 532 -126 ct 515 -111 493 -104 464 -104 ct 386 -104 l 
386 0 l  350 0 l  350 -267 l  462 -267 l  492 -267 515 -260 532 -246 ct 548 -232 556 -212 556 -187 ct 
p
520 -186 m  520 -221 499 -238 458 -238 ct 386 -238 l  386 -133 l  459 -133 l 
500 -133 520 -151 520 -186 ct p ef
618 0 m  618 -267 l  654 -267 l  654 0 l  618 0 l  p ef
761 -42 m  761 -10 l  761 4 760 15 757 24 ct 755 33 751 41 746 50 ct 723 50 l 
735 32 741 16 741 0 ct 724 0 l  724 -42 l  761 -42 l  p ef
1063 0 m  1063 -1 1063 -6 1062 -15 ct 1062 -24 1062 -31 1061 -36 ct 1061 -36 l 
1053 -21 1045 -11 1037 -5 ct 1028 1 1018 4 1005 4 ct 995 4 986 2 978 -2 ct 970 -6 965 -12 961 -19 ct 
960 -19 l  960 -14 961 -6 961 4 ct 961 75 l  926 75 l  926 -205 l  961 -205 l 
961 -83 l  961 -63 965 -47 973 -38 ct 981 -28 993 -23 1009 -23 ct 1025 -23 1037 -29 1046 -40 ct 
1055 -52 1060 -68 1060 -88 ct 1060 -205 l  1094 -205 l  1094 -44 l  1094 -20 1094 -5 1095 0 ct 
1063 0 l  p ef
1224 -21 m  1235 -21 1246 -24 1257 -30 ct 1267 -36 1276 -43 1284 -52 ct 1304 -33 l 
1293 -21 1282 -12 1268 -5 ct 1254 1 1239 4 1222 4 ct 1199 4 1182 -1 1170 -12 ct 
1157 -22 1151 -37 1151 -56 ct 1151 -70 1156 -81 1165 -91 ct 1175 -100 1187 -106 1201 -107 ct 
1201 -107 l  1188 -109 1177 -114 1169 -122 ct 1161 -131 1158 -142 1158 -154 ct 
1158 -171 1164 -184 1177 -194 ct 1190 -204 1206 -209 1227 -209 ct 1259 -209 1283 -197 1298 -174 ct 
1274 -157 l  1263 -175 1247 -184 1227 -184 ct 1216 -184 1207 -181 1201 -176 ct 
1195 -170 1192 -163 1192 -153 ct 1192 -142 1197 -133 1207 -128 ct 1217 -123 1234 -120 1260 -120 ct 
1260 -94 l  1240 -94 1226 -93 1216 -91 ct 1207 -88 1199 -84 1194 -79 ct 1189 -73 1187 -66 1187 -56 ct 
1187 -45 1190 -37 1197 -31 ct 1204 -25 1213 -21 1224 -21 ct p ef
1650 0 m  1580 -111 l  1497 -111 l  1497 0 l  1461 0 l  1461 -267 l  1586 -267 l 
1617 -267 1640 -260 1656 -247 ct 1672 -233 1681 -215 1681 -191 ct 1681 -171 1675 -154 1663 -141 ct 
1652 -127 1636 -119 1615 -115 ct 1691 0 l  1650 0 l  p
1644 -190 m  1644 -206 1639 -218 1628 -226 ct 1618 -234 1603 -238 1583 -238 ct 
1497 -238 l  1497 -140 l  1584 -140 l  1603 -140 1618 -144 1629 -153 ct 1639 -162 1644 -174 1644 -190 ct 
p ef
1772 -95 m  1772 -72 1777 -53 1787 -41 ct 1797 -28 1811 -22 1830 -22 ct 1844 -22 1856 -25 1865 -31 ct 
1874 -36 1880 -44 1883 -53 ct 1913 -45 l  1901 -12 1873 4 1830 4 ct 1799 4 1776 -5 1760 -23 ct 
1744 -41 1736 -68 1736 -104 ct 1736 -138 1744 -164 1760 -182 ct 1776 -200 1799 -209 1828 -209 ct 
1888 -209 1919 -173 1919 -100 ct 1919 -95 l  1772 -95 l  p
1883 -121 m  1881 -143 1876 -159 1867 -169 ct 1858 -179 1845 -184 1828 -184 ct 
1811 -184 1798 -178 1788 -167 ct 1779 -156 1773 -141 1773 -121 ct 1883 -121 l 
p ef
2087 -32 m  2080 -19 2072 -10 2061 -4 ct 2051 2 2038 4 2023 4 ct 1997 4 1978 -4 1966 -22 ct 
1953 -39 1947 -66 1947 -101 ct 1947 -172 1972 -208 2023 -208 ct 2038 -208 2051 -205 2062 -200 ct 
2072 -194 2080 -185 2087 -173 ct 2087 -173 l  2087 -196 l  2087 -281 l  2121 -281 l 
2121 -42 l  2121 -20 2121 -6 2122 1 ct 2089 1 l  2089 -1 2088 -6 2088 -13 ct 
2088 -21 2087 -27 2087 -32 ct 2087 -32 l  p
1983 -102 m  1983 -73 1987 -53 1994 -41 ct 2002 -28 2014 -22 2031 -22 ct 2051 -22 2065 -29 2073 -42 ct 
2082 -55 2087 -76 2087 -104 ct 2087 -132 2082 -151 2073 -164 ct 2065 -177 2051 -183 2032 -183 ct 
2015 -183 2002 -177 1995 -164 ct 1987 -151 1983 -131 1983 -102 ct p ef
2202 -205 m  2202 -75 l  2202 -61 2204 -51 2206 -43 ct 2209 -36 2213 -31 2219 -27 ct 
2225 -24 2234 -22 2245 -22 ct 2261 -22 2274 -28 2284 -39 ct 2293 -51 2298 -66 2298 -86 ct 
2298 -205 l  2332 -205 l  2332 -44 l  2332 -20 2332 -5 2333 0 ct 2301 0 l 
2301 0 2301 -2 2300 -5 ct 2300 -8 2300 -11 2300 -15 ct 2300 -18 2300 -25 2299 -35 ct 
2299 -35 l  2291 -21 2282 -11 2272 -5 ct 2261 1 2248 4 2233 4 ct 2211 4 2194 -2 2184 -13 ct 
2173 -24 2168 -42 2168 -68 ct 2168 -205 l  2202 -205 l  p ef
2407 -103 m  2407 -76 2411 -56 2420 -43 ct 2429 -30 2442 -23 2459 -23 ct 2471 -23 2481 -26 2489 -33 ct 
2497 -39 2502 -49 2504 -63 ct 2539 -61 l  2536 -41 2528 -25 2514 -14 ct 2499 -2 2482 4 2460 4 ct 
2431 4 2409 -5 2394 -23 ct 2379 -41 2371 -68 2371 -103 ct 2371 -137 2379 -163 2394 -182 ct 
2409 -200 2431 -209 2459 -209 ct 2480 -209 2498 -203 2512 -192 ct 2525 -182 2534 -167 2538 -148 ct 
2503 -145 l  2501 -156 2496 -165 2489 -172 ct 2482 -179 2472 -182 2458 -182 ct 
2440 -182 2427 -176 2419 -164 ct 2411 -152 2407 -132 2407 -103 ct p ef
2618 -95 m  2618 -72 2623 -53 2633 -41 ct 2643 -28 2657 -22 2676 -22 ct 2690 -22 2702 -25 2711 -31 ct 
2720 -36 2726 -44 2729 -53 ct 2759 -45 l  2747 -12 2719 4 2676 4 ct 2645 4 2622 -5 2606 -23 ct 
2590 -41 2582 -68 2582 -104 ct 2582 -138 2590 -164 2606 -182 ct 2622 -200 2645 -209 2674 -209 ct 
2734 -209 2765 -173 2765 -100 ct 2765 -95 l  2618 -95 l  p
2729 -121 m  2727 -143 2722 -159 2713 -169 ct 2704 -179 2691 -184 2674 -184 ct 
2657 -184 2644 -178 2634 -167 ct 2625 -156 2619 -141 2619 -121 ct 2729 -121 l 
p ef
pom
gs
52.99736 lw 1 lj 0.261 0.523 0.957 c 60353 6489 m  61153 6489 l  ps
gr
gs
52.99736 lw 1 lj 0.917 0.265 0.210 c 60353 6987 m  61153 6987 l  ps
gr
gs
52.99736 lw 1 lj 0.984 0.738 0.019 c 60353 7485 m  61153 7485 l  ps
gr
gs
52.99736 lw 1 lj 0.207 0.660 0.328 c 60353 7983 m  61153 7983 l  ps
gr
gs
52.99736 lw 1 lj 1.000 0.429 0.007 c 60353 8480 m  61153 8480 l  ps
gr
gs
52.99736 lw 1 lj 0.277 0.742 0.777 c 60353 8978 m  61153 8978 l  ps
gr
gs
52.99736 lw 1 lj 0.484 0.667 0.968 c 60353 9476 m  61153 9476 l  ps
gr
gs
52.99736 lw 1 lj 0.941 0.484 0.449 c 60353 9974 m  61153 9974 l  ps
gr
pum
61253 6609 t
0.105 0.105 0.105 c 27 0 m  27 -26 l  89 -26 l  89 -213 l  34 -174 l  34 -204 l 
91 -243 l  120 -243 l  120 -26 l  179 -26 l  179 0 l  27 0 l  p ef
pom
pum
61253 7107 t
18 0 m  18 -22 l  24 -35 31 -47 39 -58 ct 48 -68 57 -77 66 -85 ct 75 -94 84 -101 94 -109 ct 
103 -116 111 -123 118 -130 ct 126 -137 132 -145 136 -152 ct 141 -160 143 -169 143 -179 ct 
143 -192 139 -203 131 -210 ct 123 -217 113 -221 99 -221 ct 85 -221 74 -217 66 -210 ct 
57 -203 52 -193 51 -180 ct 19 -183 l  21 -202 30 -218 44 -229 ct 58 -241 76 -247 99 -247 ct 
123 -247 142 -241 155 -229 ct 168 -218 175 -201 175 -180 ct 175 -171 173 -161 168 -152 ct 
164 -143 158 -133 149 -124 ct 141 -115 124 -100 100 -81 ct 87 -70 77 -60 69 -51 ct 
61 -43 55 -34 52 -26 ct 179 -26 l  179 0 l  18 0 l  p ef
pom
pum
61253 7605 t
152 -55 m  152 0 l  123 0 l  123 -55 l  8 -55 l  8 -79 l  119 -243 l  152 -243 l 
152 -79 l  186 -79 l  186 -55 l  152 -55 l  p
123 -208 m  122 -207 121 -204 118 -199 ct 115 -193 113 -190 111 -187 ct 49 -96 l 
39 -83 l  37 -79 l  123 -79 l  123 -208 l  p ef
pom
pum
61253 8103 t
181 -68 m  181 -46 174 -28 160 -16 ct 145 -3 125 3 98 3 ct 72 3 52 -3 37 -15 ct 
23 -28 15 -45 15 -68 ct 15 -84 20 -97 29 -108 ct 38 -119 50 -125 64 -128 ct 64 -128 l 
51 -131 40 -138 32 -148 ct 25 -159 21 -171 21 -185 ct 21 -203 28 -218 42 -230 ct 
56 -241 74 -247 98 -247 ct 121 -247 140 -241 154 -230 ct 168 -219 175 -204 175 -184 ct 
175 -171 171 -158 163 -148 ct 156 -138 145 -131 132 -129 ct 132 -128 l  147 -125 159 -119 168 -108 ct 
177 -98 181 -84 181 -68 ct p
143 -183 m  143 -210 128 -224 98 -224 ct 83 -224 72 -220 64 -214 ct 57 -207 53 -196 53 -183 ct 
53 -169 57 -158 65 -151 ct 72 -144 84 -140 98 -140 ct 113 -140 124 -143 131 -150 ct 
139 -157 143 -168 143 -183 ct p
149 -71 m  149 -86 144 -98 135 -105 ct 126 -113 114 -117 98 -117 ct 82 -117 70 -113 61 -104 ct 
52 -96 47 -85 47 -70 ct 47 -37 64 -20 99 -20 ct 115 -20 128 -24 136 -32 ct 145 -41 149 -53 149 -71 ct 
p ef
pom
pum
61253 8600 t
27 0 m  27 -26 l  89 -26 l  89 -213 l  34 -174 l  34 -204 l  91 -243 l 
120 -243 l  120 -26 l  179 -26 l  179 0 l  27 0 l  p ef
366 -80 m  366 -54 359 -34 345 -19 ct 331 -4 312 3 287 3 ct 260 3 239 -7 225 -28 ct 
210 -48 203 -77 203 -116 ct 203 -158 210 -191 226 -213 ct 241 -236 262 -247 290 -247 ct 
326 -247 350 -231 359 -198 ct 329 -192 l  323 -212 310 -222 289 -222 ct 272 -222 258 -214 248 -197 ct 
239 -181 234 -157 234 -126 ct 239 -136 247 -144 258 -150 ct 268 -155 280 -158 293 -158 ct 
315 -158 333 -151 346 -137 ct 359 -123 366 -104 366 -80 ct p
334 -79 m  334 -96 330 -110 321 -120 ct 313 -129 301 -134 285 -134 ct 271 -134 259 -130 250 -121 ct 
241 -113 237 -101 237 -86 ct 237 -67 242 -52 251 -40 ct 260 -28 272 -22 286 -22 ct 
301 -22 313 -27 322 -37 ct 330 -47 334 -61 334 -79 ct p ef
pom
pum
61253 9098 t
181 -68 m  181 -45 174 -28 159 -16 ct 145 -3 125 3 98 3 ct 74 3 54 -3 40 -14 ct 
25 -25 16 -41 13 -63 ct 46 -66 l  50 -37 67 -23 98 -23 ct 114 -23 126 -27 135 -34 ct 
144 -42 149 -54 149 -69 ct 149 -82 143 -92 133 -100 ct 123 -107 108 -111 89 -111 ct 
72 -111 l  72 -138 l  89 -138 l  106 -138 119 -142 128 -149 ct 138 -156 142 -167 142 -180 ct 
142 -193 138 -203 131 -210 ct 123 -218 112 -221 97 -221 ct 83 -221 72 -218 64 -211 ct 
55 -204 50 -194 49 -182 ct 18 -184 l  20 -204 28 -219 42 -230 ct 57 -241 75 -247 97 -247 ct 
121 -247 140 -241 154 -230 ct 167 -219 174 -203 174 -183 ct 174 -167 170 -155 161 -145 ct 
152 -135 140 -129 123 -125 ct 123 -125 l  141 -123 156 -117 166 -106 ct 176 -96 181 -83 181 -68 ct 
p ef
203 0 m  203 -22 l  209 -35 216 -47 224 -58 ct 233 -68 242 -77 251 -85 ct 260 -94 269 -101 279 -109 ct 
288 -116 296 -123 303 -130 ct 311 -137 317 -145 321 -152 ct 326 -160 328 -169 328 -179 ct 
328 -192 324 -203 316 -210 ct 308 -217 298 -221 284 -221 ct 270 -221 259 -217 251 -210 ct 
242 -203 237 -193 236 -180 ct 204 -183 l  206 -202 215 -218 229 -229 ct 243 -241 261 -247 284 -247 ct 
308 -247 327 -241 340 -229 ct 353 -218 360 -201 360 -180 ct 360 -171 358 -161 353 -152 ct 
349 -143 343 -133 334 -124 ct 326 -115 309 -100 285 -81 ct 272 -70 262 -60 254 -51 ct 
246 -43 240 -34 237 -26 ct 364 -26 l  364 0 l  203 0 l  p ef
pom
pum
61253 9596 t
181 -80 m  181 -54 174 -34 160 -19 ct 146 -4 127 3 102 3 ct 75 3 54 -7 40 -28 ct 
25 -48 18 -77 18 -116 ct 18 -158 25 -191 41 -213 ct 56 -236 77 -247 105 -247 ct 
141 -247 165 -231 174 -198 ct 144 -192 l  138 -212 125 -222 104 -222 ct 87 -222 73 -214 63 -197 ct 
54 -181 49 -157 49 -126 ct 54 -136 62 -144 73 -150 ct 83 -155 95 -158 108 -158 ct 
130 -158 148 -151 161 -137 ct 174 -123 181 -104 181 -80 ct p
149 -79 m  149 -96 145 -110 136 -120 ct 128 -129 116 -134 100 -134 ct 86 -134 74 -130 65 -121 ct 
56 -113 52 -101 52 -86 ct 52 -67 57 -52 66 -40 ct 75 -28 87 -22 101 -22 ct 116 -22 128 -27 137 -37 ct 
145 -47 149 -61 149 -79 ct p ef
337 -55 m  337 0 l  308 0 l  308 -55 l  193 -55 l  193 -79 l  304 -243 l 
337 -243 l  337 -79 l  371 -79 l  371 -55 l  337 -55 l  p
308 -208 m  307 -207 306 -204 303 -199 ct 300 -193 298 -190 296 -187 ct 234 -96 l 
224 -83 l  222 -79 l  308 -79 l  308 -208 l  p ef
pom
pum
61253 10094 t
181 -68 m  181 -46 174 -28 160 -16 ct 145 -3 125 3 98 3 ct 72 3 52 -3 37 -15 ct 
23 -28 15 -45 15 -68 ct 15 -84 20 -97 29 -108 ct 38 -119 50 -125 64 -128 ct 64 -128 l 
51 -131 40 -138 32 -148 ct 25 -159 21 -171 21 -185 ct 21 -203 28 -218 42 -230 ct 
56 -241 74 -247 98 -247 ct 121 -247 140 -241 154 -230 ct 168 -219 175 -204 175 -184 ct 
175 -171 171 -158 163 -148 ct 156 -138 145 -131 132 -129 ct 132 -128 l  147 -125 159 -119 168 -108 ct 
177 -98 181 -84 181 -68 ct p
143 -183 m  143 -210 128 -224 98 -224 ct 83 -224 72 -220 64 -214 ct 57 -207 53 -196 53 -183 ct 
53 -169 57 -158 65 -151 ct 72 -144 84 -140 98 -140 ct 113 -140 124 -143 131 -150 ct 
139 -157 143 -168 143 -183 ct p
149 -71 m  149 -86 144 -98 135 -105 ct 126 -113 114 -117 98 -117 ct 82 -117 70 -113 61 -104 ct 
52 -96 47 -85 47 -70 ct 47 -37 64 -20 99 -20 ct 115 -20 128 -24 136 -32 ct 145 -41 149 -53 149 -71 ct 
p ef
368 -122 m  368 -81 360 -50 346 -29 ct 332 -8 311 3 283 3 ct 255 3 234 -8 220 -29 ct 
206 -50 199 -81 199 -122 ct 199 -164 206 -195 219 -216 ct 233 -237 254 -247 284 -247 ct 
312 -247 334 -236 347 -215 ct 361 -194 368 -163 368 -122 ct p
336 -122 m  336 -157 332 -182 324 -198 ct 316 -214 302 -222 284 -222 ct 265 -222 251 -214 243 -199 ct 
234 -183 230 -158 230 -122 ct 230 -88 234 -62 243 -46 ct 251 -30 265 -22 283 -22 ct 
301 -22 315 -31 323 -47 ct 332 -63 336 -88 336 -122 ct p ef
pom
pum
48000 13845 t
0.003 0.003 0.003 c 225 0 m  225 -147 l  225 -151 225 -154 225 -157 ct 225 -161 226 -175 227 -200 ct 
219 -169 213 -148 209 -136 ct 165 0 l  129 0 l  85 -136 l  67 -200 l  68 -174 69 -156 69 -147 ct 
69 0 l  24 0 l  24 -243 l  92 -243 l  135 -107 l  139 -94 l  147 -61 l 
158 -100 l  203 -243 l  270 -243 l  270 0 l  225 0 l  p ef
382 -29 m  398 -29 413 -37 428 -53 ct 453 -29 l  444 -20 437 -14 430 -10 ct 
423 -6 415 -3 407 0 ct 398 2 388 3 377 3 ct 354 3 336 -2 323 -11 ct 311 -21 304 -34 304 -52 ct 
304 -65 309 -75 318 -83 ct 327 -91 339 -96 354 -97 ct 354 -97 l  340 -99 330 -103 322 -111 ct 
314 -119 310 -129 310 -141 ct 310 -156 317 -168 330 -177 ct 343 -186 361 -191 383 -191 ct 
399 -191 412 -189 422 -184 ct 433 -180 442 -172 450 -162 ct 422 -140 l  417 -147 412 -152 406 -155 ct 
400 -158 394 -160 386 -160 ct 376 -160 369 -158 364 -154 ct 359 -151 356 -145 356 -139 ct 
356 -130 360 -124 368 -119 ct 376 -115 391 -113 413 -113 ct 413 -82 l  396 -82 383 -82 376 -80 ct 
369 -78 364 -75 360 -71 ct 356 -67 354 -62 354 -55 ct 354 -46 357 -40 361 -36 ct 
366 -32 373 -29 382 -29 ct p
364 -204 m  364 -210 l  376 -260 l  420 -260 l  420 -254 l  382 -204 l 
364 -204 l  p ef
451 -187 m  503 -187 l  539 -76 l  541 -71 543 -64 545 -54 ct 547 -44 548 -37 549 -32 ct 
549 -38 551 -45 553 -54 ct 555 -63 557 -71 559 -77 ct 594 -187 l  645 -187 l 
577 -9 l  566 19 559 46 556 73 ct 506 73 l  509 48 515 23 523 -2 ct 451 -187 l 
p ef
726 -29 m  742 -29 757 -37 772 -53 ct 797 -29 l  788 -20 781 -14 774 -10 ct 
767 -6 759 -3 751 0 ct 742 2 732 3 721 3 ct 698 3 680 -2 667 -11 ct 655 -21 648 -34 648 -52 ct 
648 -65 653 -75 662 -83 ct 671 -91 683 -96 698 -97 ct 698 -97 l  684 -99 674 -103 666 -111 ct 
658 -119 654 -129 654 -141 ct 654 -156 661 -168 674 -177 ct 687 -186 705 -191 727 -191 ct 
743 -191 756 -189 766 -184 ct 777 -180 786 -172 794 -162 ct 766 -140 l  761 -147 756 -152 750 -155 ct 
744 -158 738 -160 730 -160 ct 720 -160 713 -158 708 -154 ct 703 -151 700 -145 700 -139 ct 
700 -130 704 -124 712 -119 ct 720 -115 735 -113 757 -113 ct 757 -82 l  740 -82 727 -82 720 -80 ct 
713 -78 708 -75 704 -71 ct 700 -67 698 -62 698 -55 ct 698 -46 701 -40 705 -36 ct 
710 -32 717 -29 726 -29 ct p ef
969 -127 m  969 -83 962 -50 949 -29 ct 935 -8 915 3 889 3 ct 863 3 843 -8 830 -30 ct 
816 -52 810 -84 810 -127 ct 810 -213 836 -256 890 -256 ct 917 -256 937 -245 950 -224 ct 
963 -203 969 -171 969 -127 ct p
889 -28 m  910 -28 921 -56 922 -111 ct 857 -111 l  857 -85 860 -64 866 -50 ct 
871 -36 879 -28 889 -28 ct p
890 -224 m  869 -224 858 -198 857 -144 ct 922 -144 l  921 -198 911 -224 890 -224 ct 
p ef
1181 -94 m  1181 -64 1172 -40 1156 -23 ct 1139 -6 1116 3 1086 3 ct 1057 3 1034 -6 1018 -23 ct 
1001 -40 993 -64 993 -94 ct 993 -124 1001 -147 1018 -165 ct 1034 -182 1057 -190 1087 -190 ct 
1118 -190 1141 -182 1157 -165 ct 1173 -149 1181 -125 1181 -94 ct p
1130 -94 m  1130 -116 1127 -132 1119 -142 ct 1112 -152 1102 -157 1088 -157 ct 
1058 -157 1044 -136 1044 -94 ct 1044 -73 1047 -57 1054 -46 ct 1062 -36 1072 -30 1086 -30 ct 
1115 -30 1130 -51 1130 -94 ct p ef
1250 -76 m  1250 -70 1251 -64 1253 -60 ct 1256 -56 1259 -52 1264 -49 ct 1268 -46 1274 -44 1280 -42 ct 
1286 -39 1292 -37 1299 -35 ct 1314 -31 l  1331 -26 1343 -19 1350 -11 ct 1357 -2 1361 8 1361 21 ct 
1361 28 1359 36 1355 45 ct 1352 54 1348 62 1342 70 ct 1312 57 l  1318 46 1321 37 1321 30 ct 
1321 26 1320 22 1317 19 ct 1314 16 1310 13 1305 11 ct 1300 9 1289 6 1272 2 ct 1259 -2 1250 -5 1244 -7 ct 
1238 -10 1233 -13 1228 -17 ct 1223 -21 1219 -25 1216 -30 ct 1212 -35 1210 -42 1208 -49 ct 
1206 -56 1205 -64 1205 -73 ct 1205 -94 1209 -114 1217 -133 ct 1225 -152 1237 -166 1250 -176 ct 
1264 -185 1280 -190 1298 -190 ct 1324 -190 1344 -182 1359 -165 ct 1335 -140 l 
1324 -151 1312 -157 1300 -157 ct 1290 -157 1282 -154 1275 -147 ct 1267 -140 1261 -130 1257 -117 ct 
1252 -103 1250 -90 1250 -76 ct p ef
1696 -154 m  1696 -53 l  1696 -44 1697 -39 1701 -36 ct 1704 -32 1708 -31 1714 -31 ct 
1718 -31 1724 -31 1731 -33 ct 1734 -1 l  1722 2 1709 3 1696 3 ct 1679 3 1667 -1 1659 -10 ct 
1652 -18 1648 -31 1648 -46 ct 1648 -154 l  1585 -154 l  1585 -133 l  1585 -107 1584 -83 1581 -63 ct 
1579 -42 1575 -21 1570 0 ct 1520 0 l  1527 -27 1532 -51 1534 -70 ct 1537 -89 1538 -110 1538 -131 ct 
1538 -154 l  1513 -154 1497 -152 1489 -148 ct 1489 -182 l  1493 -184 1497 -185 1503 -186 ct 
1509 -187 1515 -187 1521 -187 ct 1743 -187 l  1743 -154 l  1696 -154 l  p ef
1951 -89 m  1951 -62 1943 -39 1929 -22 ct 1915 -5 1895 3 1871 3 ct 1850 3 1832 -5 1818 -21 ct 
1817 -21 l  1817 -14 1818 -7 1818 0 ct 1818 73 l  1767 73 l  1767 -100 l 
1767 -128 1775 -151 1791 -166 ct 1807 -182 1828 -190 1855 -190 ct 1873 -190 1890 -186 1904 -178 ct 
1919 -169 1930 -158 1938 -142 ct 1947 -127 1951 -109 1951 -89 ct p
1900 -91 m  1900 -111 1896 -127 1888 -139 ct 1880 -151 1869 -157 1856 -157 ct 
1830 -157 1818 -138 1818 -99 ct 1818 -52 l  1831 -38 1846 -30 1863 -30 ct 1875 -30 1884 -36 1890 -46 ct 
1897 -57 1900 -72 1900 -91 ct p ef
2160 -94 m  2160 -64 2151 -40 2135 -23 ct 2118 -6 2095 3 2065 3 ct 2036 3 2013 -6 1997 -23 ct 
1980 -40 1972 -64 1972 -94 ct 1972 -124 1980 -147 1997 -165 ct 2013 -182 2036 -190 2066 -190 ct 
2097 -190 2120 -182 2136 -165 ct 2152 -149 2160 -125 2160 -94 ct p
2109 -94 m  2109 -116 2106 -132 2098 -142 ct 2091 -152 2081 -157 2067 -157 ct 
2037 -157 2023 -136 2023 -94 ct 2023 -73 2026 -57 2033 -46 ct 2041 -36 2051 -30 2065 -30 ct 
2094 -30 2109 -51 2109 -94 ct p ef
2374 -70 m  2374 -47 2367 -29 2353 -16 ct 2340 -3 2320 3 2295 3 ct 2276 3 2259 -2 2243 -13 ct 
2242 -13 l  2243 -3 2243 9 2243 22 ct 2243 73 l  2194 73 l  2194 -177 l  2194 -204 2202 -224 2216 -237 ct 
2230 -250 2252 -256 2280 -256 ct 2304 -256 2323 -251 2337 -240 ct 2350 -230 2357 -215 2357 -196 ct 
2357 -167 2344 -147 2318 -137 ct 2335 -134 2349 -126 2359 -114 ct 2369 -103 2374 -88 2374 -70 ct 
p
2243 -44 m  2248 -40 2255 -37 2263 -34 ct 2271 -31 2278 -30 2286 -30 ct 2299 -30 2309 -34 2316 -41 ct 
2323 -49 2326 -59 2326 -73 ct 2326 -87 2321 -98 2311 -106 ct 2301 -113 2287 -117 2269 -117 ct 
2269 -151 l  2284 -153 2294 -158 2301 -165 ct 2307 -171 2311 -180 2311 -191 ct 
2311 -201 2308 -208 2303 -213 ct 2297 -218 2290 -221 2280 -221 ct 2267 -221 2257 -217 2252 -209 ct 
2246 -201 2243 -189 2243 -171 ct 2243 -44 l  p ef
2572 -1 m  2521 -1 l  2504 -61 2493 -96 2490 -107 ct 2487 -118 2485 -126 2484 -131 ct 
2483 -125 2480 -115 2476 -103 ct 2471 -90 2468 -81 2465 -74 ct 2434 -1 l  2383 -1 l 
2464 -174 l  2459 -188 2455 -200 2451 -208 ct 2447 -216 2443 -222 2440 -225 ct 
2436 -228 2432 -230 2426 -230 ct 2421 -230 2415 -229 2410 -227 ct 2402 -260 l 
2412 -264 2423 -265 2434 -265 ct 2451 -265 2465 -261 2474 -252 ct 2484 -243 2493 -226 2502 -201 ct 
2572 -1 l  p ef
2712 73 m  2712 -109 l  2712 -126 2709 -138 2705 -144 ct 2700 -151 2692 -154 2680 -154 ct 
2667 -154 2657 -149 2650 -140 ct 2643 -130 2639 -117 2639 -100 ct 2639 0 l  2591 0 l 
2591 -147 l  2591 -161 2589 -174 2584 -187 ct 2631 -187 l  2633 -182 2634 -177 2636 -171 ct 
2637 -165 2637 -160 2637 -155 ct 2638 -155 l  2645 -168 2654 -177 2663 -182 ct 
2673 -188 2685 -190 2699 -190 ct 2720 -190 2736 -185 2745 -175 ct 2755 -164 2760 -147 2760 -124 ct 
2760 73 l  2712 73 l  p
2664 -204 m  2664 -210 l  2676 -260 l  2720 -260 l  2720 -254 l  2682 -204 l 
2664 -204 l  p ef
2924 0 m  2924 -1 2924 -3 2924 -6 ct 2923 -8 2923 -11 2923 -14 ct 2923 -17 2923 -20 2922 -23 ct 
2922 -26 2922 -29 2922 -31 ct 2922 -31 l  2913 -8 2898 4 2879 4 ct 2873 4 2868 2 2863 0 ct 
2858 -3 2854 -7 2851 -12 ct 2851 -12 l  2851 -7 2851 0 2851 8 ct 2851 72 l  2803 72 l 
2803 -187 l  2851 -187 l  2851 -82 l  2851 -49 2862 -33 2883 -33 ct 2894 -33 2903 -38 2910 -47 ct 
2917 -57 2921 -70 2921 -87 ct 2921 -187 l  2969 -187 l  2969 -42 l  2969 -27 2970 -13 2971 0 ct 
2924 0 l  p ef
3138 -41 m  3131 -26 3123 -15 3113 -8 ct 3103 -1 3091 3 3076 3 ct 3052 3 3034 -5 3022 -21 ct 
3010 -37 3004 -61 3004 -93 ct 3004 -126 3010 -150 3023 -166 ct 3036 -182 3056 -190 3081 -190 ct 
3096 -190 3109 -187 3120 -179 ct 3131 -171 3139 -161 3144 -146 ct 3145 -146 l 
3148 -161 3152 -174 3158 -187 ct 3203 -187 l  3198 -177 3192 -162 3186 -144 ct 
3179 -125 3176 -110 3174 -96 ct 3178 -61 3186 -29 3198 0 ct 3151 0 l  3146 -14 3141 -28 3139 -41 ct 
3138 -41 l  p
3055 -93 m  3055 -71 3057 -55 3062 -45 ct 3067 -35 3075 -30 3086 -30 ct 3096 -30 3105 -36 3112 -48 ct 
3120 -59 3124 -75 3126 -94 ct 3124 -114 3119 -130 3112 -141 ct 3106 -152 3097 -157 3087 -157 ct 
3075 -157 3067 -152 3062 -142 ct 3057 -131 3055 -115 3055 -93 ct p ef
3248 -153 m  3238 -153 3229 -153 3221 -151 ct 3212 -150 3207 -148 3204 -147 ct 
3204 -181 l  3207 -182 3211 -184 3217 -185 ct 3224 -186 3230 -186 3236 -186 ct 
3353 -186 l  3353 -153 l  3300 -153 l  3300 -53 l  3300 -45 3302 -40 3305 -36 ct 
3307 -32 3313 -30 3320 -30 ct 3324 -30 3329 -31 3334 -32 ct 3338 -1 l  3334 0 3328 1 3322 2 ct 
3315 3 3309 4 3304 4 ct 3269 4 3252 -12 3252 -43 ct 3252 -153 l  3248 -153 l 
p ef
3562 -94 m  3562 -64 3553 -40 3537 -23 ct 3520 -6 3497 3 3467 3 ct 3438 3 3415 -6 3399 -23 ct 
3382 -40 3374 -64 3374 -94 ct 3374 -124 3382 -147 3399 -165 ct 3415 -182 3438 -190 3468 -190 ct 
3499 -190 3522 -182 3538 -165 ct 3554 -149 3562 -125 3562 -94 ct p
3511 -94 m  3511 -116 3508 -132 3500 -142 ct 3493 -152 3483 -157 3469 -157 ct 
3439 -157 3425 -136 3425 -94 ct 3425 -73 3428 -57 3435 -46 ct 3443 -36 3453 -30 3467 -30 ct 
3496 -30 3511 -51 3511 -94 ct p ef
3631 -76 m  3631 -70 3632 -64 3634 -60 ct 3637 -56 3640 -52 3645 -49 ct 3649 -46 3655 -44 3661 -42 ct 
3667 -39 3673 -37 3680 -35 ct 3695 -31 l  3712 -26 3724 -19 3731 -11 ct 3738 -2 3742 8 3742 21 ct 
3742 28 3740 36 3736 45 ct 3733 54 3729 62 3723 70 ct 3693 57 l  3699 46 3702 37 3702 30 ct 
3702 26 3701 22 3698 19 ct 3695 16 3691 13 3686 11 ct 3681 9 3670 6 3653 2 ct 3640 -2 3631 -5 3625 -7 ct 
3619 -10 3614 -13 3609 -17 ct 3604 -21 3600 -25 3597 -30 ct 3593 -35 3591 -42 3589 -49 ct 
3587 -56 3586 -64 3586 -73 ct 3586 -94 3590 -114 3598 -133 ct 3606 -152 3618 -166 3631 -176 ct 
3645 -185 3661 -190 3679 -190 ct 3705 -190 3725 -182 3740 -165 ct 3716 -140 l 
3705 -151 3693 -157 3681 -157 ct 3671 -157 3663 -154 3656 -147 ct 3648 -140 3642 -130 3638 -117 ct 
3633 -103 3631 -90 3631 -76 ct p ef
3932 73 m  3914 47 3901 21 3893 -5 ct 3885 -31 3881 -60 3881 -92 ct 3881 -124 3885 -153 3893 -179 ct 
3901 -204 3914 -230 3932 -256 ct 3980 -256 l  3962 -230 3949 -204 3941 -178 ct 
3932 -152 3928 -123 3928 -92 ct 3928 -60 3932 -32 3941 -6 ct 3949 20 3962 46 3980 73 ct 
3932 73 l  p ef
4117 -41 m  4110 -26 4102 -15 4092 -8 ct 4082 -1 4070 3 4055 3 ct 4031 3 4013 -5 4001 -21 ct 
3989 -37 3983 -61 3983 -93 ct 3983 -126 3989 -150 4002 -166 ct 4015 -182 4035 -190 4060 -190 ct 
4075 -190 4088 -187 4099 -179 ct 4110 -171 4118 -161 4123 -146 ct 4124 -146 l 
4127 -161 4131 -174 4137 -187 ct 4182 -187 l  4177 -177 4171 -162 4165 -144 ct 
4158 -125 4155 -110 4153 -96 ct 4157 -61 4165 -29 4177 0 ct 4130 0 l  4125 -14 4120 -28 4118 -41 ct 
4117 -41 l  p
4034 -93 m  4034 -71 4036 -55 4041 -45 ct 4046 -35 4054 -30 4065 -30 ct 4075 -30 4084 -36 4091 -48 ct 
4099 -59 4103 -75 4105 -94 ct 4103 -114 4098 -130 4091 -141 ct 4085 -152 4076 -157 4066 -157 ct 
4054 -157 4046 -152 4041 -142 ct 4036 -131 4034 -115 4034 -93 ct p ef
4385 -89 m  4385 -62 4377 -39 4363 -22 ct 4349 -5 4329 3 4305 3 ct 4284 3 4266 -5 4252 -21 ct 
4251 -21 l  4251 -14 4252 -7 4252 0 ct 4252 73 l  4201 73 l  4201 -100 l 
4201 -128 4209 -151 4225 -166 ct 4241 -182 4262 -190 4289 -190 ct 4307 -190 4324 -186 4338 -178 ct 
4353 -169 4364 -158 4372 -142 ct 4381 -127 4385 -109 4385 -89 ct p
4334 -91 m  4334 -111 4330 -127 4322 -139 ct 4314 -151 4303 -157 4290 -157 ct 
4264 -157 4252 -138 4252 -99 ct 4252 -52 l  4265 -38 4280 -30 4297 -30 ct 4309 -30 4318 -36 4324 -46 ct 
4331 -57 4334 -72 4334 -91 ct p ef
4426 0 m  4423 -4 4420 -9 4418 -17 ct 4417 -25 4416 -33 4416 -41 ct 4416 -187 l 
4464 -187 l  4464 -39 l  4464 -32 4465 -25 4468 -18 ct 4470 -11 4474 -5 4478 0 ct 
4426 0 l  p ef
4673 -127 m  4673 -83 4666 -50 4653 -29 ct 4639 -8 4619 3 4593 3 ct 4567 3 4547 -8 4534 -30 ct 
4520 -52 4514 -84 4514 -127 ct 4514 -213 4540 -256 4594 -256 ct 4621 -256 4641 -245 4654 -224 ct 
4667 -203 4673 -171 4673 -127 ct p
4593 -28 m  4614 -28 4625 -56 4626 -111 ct 4561 -111 l  4561 -85 4564 -64 4570 -50 ct 
4575 -36 4583 -28 4593 -28 ct p
4594 -224 m  4573 -224 4562 -198 4561 -144 ct 4626 -144 l  4625 -198 4615 -224 4594 -224 ct 
p ef
4829 0 m  4829 -1 4829 -3 4829 -6 ct 4828 -8 4828 -11 4828 -14 ct 4828 -17 4828 -20 4827 -23 ct 
4827 -26 4827 -29 4827 -31 ct 4827 -31 l  4818 -8 4803 4 4784 4 ct 4778 4 4773 2 4768 0 ct 
4763 -3 4759 -7 4756 -12 ct 4756 -12 l  4756 -7 4756 0 4756 8 ct 4756 72 l  4708 72 l 
4708 -187 l  4756 -187 l  4756 -82 l  4756 -49 4767 -33 4788 -33 ct 4799 -33 4808 -38 4815 -47 ct 
4822 -57 4826 -70 4826 -87 ct 4826 -187 l  4874 -187 l  4874 -42 l  4874 -27 4875 -13 4876 0 ct 
4829 0 l  p ef
5097 -94 m  5097 -64 5088 -40 5072 -23 ct 5055 -6 5032 3 5002 3 ct 4973 3 4950 -6 4934 -23 ct 
4917 -40 4909 -64 4909 -94 ct 4909 -124 4917 -147 4934 -165 ct 4950 -182 4973 -190 5003 -190 ct 
5034 -190 5057 -182 5073 -165 ct 5089 -149 5097 -125 5097 -94 ct p
5046 -94 m  5046 -116 5043 -132 5035 -142 ct 5028 -152 5018 -157 5004 -157 ct 
4974 -157 4960 -136 4960 -94 ct 4960 -73 4963 -57 4970 -46 ct 4978 -36 4988 -30 5002 -30 ct 
5031 -30 5046 -51 5046 -94 ct p
4986 -204 m  4986 -210 l  4998 -260 l  5042 -260 l  5042 -254 l  5004 -204 l 
4986 -204 l  p ef
5165 -76 m  5165 -70 5166 -64 5168 -60 ct 5171 -56 5174 -52 5179 -49 ct 5183 -46 5189 -44 5195 -42 ct 
5201 -39 5207 -37 5214 -35 ct 5229 -31 l  5246 -26 5258 -19 5265 -11 ct 5272 -2 5276 8 5276 21 ct 
5276 28 5274 36 5270 45 ct 5267 54 5263 62 5257 70 ct 5227 57 l  5233 46 5236 37 5236 30 ct 
5236 26 5235 22 5232 19 ct 5229 16 5225 13 5220 11 ct 5215 9 5204 6 5187 2 ct 5174 -2 5165 -5 5159 -7 ct 
5153 -10 5148 -13 5143 -17 ct 5138 -21 5134 -25 5131 -30 ct 5127 -35 5125 -42 5123 -49 ct 
5121 -56 5120 -64 5120 -73 ct 5120 -94 5124 -114 5132 -133 ct 5140 -152 5152 -166 5165 -176 ct 
5179 -185 5195 -190 5213 -190 ct 5239 -190 5259 -182 5274 -165 ct 5250 -140 l 
5239 -151 5227 -157 5215 -157 ct 5205 -157 5197 -154 5190 -147 ct 5182 -140 5176 -130 5172 -117 ct 
5167 -103 5165 -90 5165 -76 ct p ef
5600 -79 m  5600 -53 5591 -33 5575 -19 ct 5559 -4 5536 3 5506 3 ct 5476 3 5453 -5 5436 -21 ct 
5420 -37 5412 -60 5412 -91 ct 5412 -121 5421 -145 5440 -162 ct 5459 -179 5487 -187 5522 -187 ct 
5633 -187 l  5633 -155 l  5599 -155 l  5571 -155 l  5571 -154 l  5581 -141 5588 -129 5593 -116 ct 
5597 -104 5600 -92 5600 -79 ct p
5549 -85 m  5549 -110 5543 -133 5531 -154 ct 5519 -154 l  5502 -154 5488 -149 5478 -137 ct 
5468 -126 5463 -111 5463 -91 ct 5463 -50 5477 -30 5505 -30 ct 5519 -30 5530 -35 5538 -44 ct 
5545 -54 5549 -67 5549 -85 ct p ef
5683 -153 m  5673 -153 5664 -153 5656 -151 ct 5647 -150 5642 -148 5639 -147 ct 
5639 -181 l  5642 -182 5646 -184 5652 -185 ct 5659 -186 5665 -186 5671 -186 ct 
5788 -186 l  5788 -153 l  5735 -153 l  5735 -53 l  5735 -45 5737 -40 5740 -36 ct 
5742 -32 5748 -30 5755 -30 ct 5759 -30 5764 -31 5769 -32 ct 5773 -1 l  5769 0 5763 1 5757 2 ct 
5750 3 5744 4 5739 4 ct 5704 4 5687 -12 5687 -43 ct 5687 -153 l  5683 -153 l 
p ef
5996 -94 m  5996 -64 5987 -40 5971 -23 ct 5954 -6 5931 3 5901 3 ct 5872 3 5849 -6 5833 -23 ct 
5816 -40 5808 -64 5808 -94 ct 5808 -124 5816 -147 5833 -165 ct 5849 -182 5872 -190 5902 -190 ct 
5933 -190 5956 -182 5972 -165 ct 5988 -149 5996 -125 5996 -94 ct p
5945 -94 m  5945 -116 5942 -132 5934 -142 ct 5927 -152 5917 -157 5903 -157 ct 
5873 -157 5859 -136 5859 -94 ct 5859 -73 5862 -57 5869 -46 ct 5877 -36 5887 -30 5901 -30 ct 
5930 -30 5945 -51 5945 -94 ct p ef
6040 0 m  6037 -4 6034 -9 6032 -17 ct 6031 -25 6030 -33 6030 -41 ct 6030 -187 l 
6078 -187 l  6078 -39 l  6078 -32 6079 -25 6082 -18 ct 6084 -11 6088 -5 6092 0 ct 
6040 0 l  p ef
6152 -190 m  6161 -190 6168 -188 6174 -185 ct 6180 -181 6186 -175 6191 -166 ct 
6197 -158 6205 -140 6216 -115 ct 6219 -107 l  6222 -115 6225 -123 6229 -131 ct 
6256 -187 l  6307 -187 l  6242 -68 l  6314 73 l  6262 73 l  6228 -1 l 
6223 -13 6219 -24 6216 -34 ct 6215 -31 6213 -26 6210 -18 ct 6207 -11 6204 -6 6203 -2 ct 
6166 73 l  6114 73 l  6192 -70 l  6172 -112 l  6166 -124 6161 -133 6157 -139 ct 
6153 -145 6150 -149 6147 -151 ct 6144 -154 6140 -155 6136 -155 ct 6131 -155 6126 -154 6122 -152 ct 
6115 -185 l  6125 -189 6137 -190 6152 -190 ct p ef
6388 -29 m  6404 -29 6419 -37 6434 -53 ct 6459 -29 l  6450 -20 6443 -14 6436 -10 ct 
6429 -6 6421 -3 6413 0 ct 6404 2 6394 3 6383 3 ct 6360 3 6342 -2 6329 -11 ct 6317 -21 6310 -34 6310 -52 ct 
6310 -65 6315 -75 6324 -83 ct 6333 -91 6345 -96 6360 -97 ct 6360 -97 l  6346 -99 6336 -103 6328 -111 ct 
6320 -119 6316 -129 6316 -141 ct 6316 -156 6323 -168 6336 -177 ct 6349 -186 6367 -191 6389 -191 ct 
6405 -191 6418 -189 6428 -184 ct 6439 -180 6448 -172 6456 -162 ct 6428 -140 l 
6423 -147 6418 -152 6412 -155 ct 6406 -158 6400 -160 6392 -160 ct 6382 -160 6375 -158 6370 -154 ct 
6365 -151 6362 -145 6362 -139 ct 6362 -130 6366 -124 6374 -119 ct 6382 -115 6397 -113 6419 -113 ct 
6419 -82 l  6402 -82 6389 -82 6382 -80 ct 6375 -78 6370 -75 6366 -71 ct 6362 -67 6360 -62 6360 -55 ct 
6360 -46 6363 -40 6367 -36 ct 6372 -32 6379 -29 6388 -29 ct p ef
6490 0 m  6487 -4 6484 -9 6482 -17 ct 6481 -25 6480 -33 6480 -41 ct 6480 -187 l 
6528 -187 l  6528 -39 l  6528 -32 6529 -25 6532 -18 ct 6534 -11 6538 -5 6542 0 ct 
6490 0 l  p
6486 -204 m  6486 -210 l  6498 -260 l  6543 -260 l  6543 -254 l  6504 -204 l 
6486 -204 l  p ef
6734 -82 m  6734 -66 6736 -53 6742 -44 ct 6747 -35 6755 -31 6764 -31 ct 6776 -31 6784 -35 6789 -45 ct 
6794 -54 6797 -69 6797 -90 ct 6797 -109 6793 -124 6785 -136 ct 6778 -148 6767 -155 6753 -158 ct 
6757 -191 l  6786 -186 6808 -176 6823 -158 ct 6839 -141 6846 -118 6846 -90 ct 
6846 -60 6840 -37 6827 -21 ct 6813 -5 6795 3 6771 3 ct 6740 3 6720 -11 6711 -38 ct 
6711 -38 l  6703 -11 6683 3 6651 3 ct 6627 3 6609 -5 6596 -21 ct 6583 -37 6576 -60 6576 -90 ct 
6576 -118 6584 -141 6599 -158 ct 6614 -176 6636 -186 6665 -191 ct 6669 -158 l 
6655 -156 6645 -149 6637 -137 ct 6629 -125 6625 -110 6625 -90 ct 6625 -70 6628 -54 6633 -45 ct 
6638 -36 6647 -31 6657 -31 ct 6667 -31 6675 -35 6681 -44 ct 6686 -53 6689 -66 6689 -82 ct 
6689 -115 l  6734 -115 l  6734 -82 l  p ef
7033 -146 m  7033 -125 7027 -102 7015 -76 ct 7003 -49 6986 -24 6966 0 ct 6920 0 l 
6853 -187 l  6904 -187 l  6949 -41 l  6962 -59 6971 -77 6977 -93 ct 6982 -109 6985 -126 6985 -144 ct 
6985 -160 6982 -174 6977 -187 ct 7025 -187 l  7031 -175 7033 -162 7033 -146 ct 
p ef
7038 73 m  7057 46 7070 20 7078 -6 ct 7086 -32 7090 -60 7090 -92 ct 7090 -123 7086 -152 7078 -178 ct 
7070 -204 7056 -230 7038 -256 ct 7087 -256 l  7105 -230 7118 -204 7126 -178 ct 
7134 -152 7138 -123 7138 -92 ct 7138 -60 7134 -31 7126 -5 ct 7118 21 7105 47 7087 73 ct 
7038 73 l  p ef
pom
pum
42721 10511 t
90.0 r 179 0 m  118 -97 l  57 0 l  3 0 l  87 -128 l  10 -243 l  64 -243 l 
118 -157 l  172 -243 l  225 -243 l  152 -128 l  232 0 l  179 0 l  p ef
443 -89 m  443 -62 435 -39 421 -22 ct 407 -5 387 3 363 3 ct 342 3 324 -5 310 -21 ct 
309 -21 l  309 -14 310 -7 310 0 ct 310 73 l  259 73 l  259 -100 l  259 -128 267 -151 283 -166 ct 
299 -182 320 -190 347 -190 ct 365 -190 382 -186 396 -178 ct 411 -169 422 -158 430 -142 ct 
439 -127 443 -109 443 -89 ct p
392 -91 m  392 -111 388 -127 380 -139 ct 372 -151 361 -157 348 -157 ct 322 -157 310 -138 310 -99 ct 
310 -52 l  323 -38 338 -30 355 -30 ct 367 -30 376 -36 382 -46 ct 389 -57 392 -72 392 -91 ct 
p ef
652 -94 m  652 -64 643 -40 627 -23 ct 610 -6 587 3 557 3 ct 528 3 505 -6 489 -23 ct 
472 -40 464 -64 464 -94 ct 464 -124 472 -147 489 -165 ct 505 -182 528 -190 558 -190 ct 
589 -190 612 -182 628 -165 ct 644 -149 652 -125 652 -94 ct p
601 -94 m  601 -116 598 -132 590 -142 ct 583 -152 573 -157 559 -157 ct 529 -157 515 -136 515 -94 ct 
515 -73 518 -57 525 -46 ct 533 -36 543 -30 557 -30 ct 586 -30 601 -51 601 -94 ct 
p
541 -204 m  541 -210 l  553 -260 l  597 -260 l  597 -254 l  559 -204 l 
541 -204 l  p ef
841 -146 m  841 -125 835 -102 823 -76 ct 811 -49 794 -24 774 0 ct 728 0 l  661 -187 l 
712 -187 l  757 -41 l  770 -59 779 -77 785 -93 ct 790 -109 793 -126 793 -144 ct 
793 -160 790 -174 785 -187 ct 833 -187 l  839 -175 841 -162 841 -146 ct p ef
1049 -94 m  1049 -64 1040 -40 1024 -23 ct 1007 -6 984 3 954 3 ct 925 3 902 -6 886 -23 ct 
869 -40 861 -64 861 -94 ct 861 -124 869 -147 886 -165 ct 902 -182 925 -190 955 -190 ct 
986 -190 1009 -182 1025 -165 ct 1041 -149 1049 -125 1049 -94 ct p
998 -94 m  998 -116 995 -132 987 -142 ct 980 -152 970 -157 956 -157 ct 926 -157 912 -136 912 -94 ct 
912 -73 915 -57 922 -46 ct 930 -36 940 -30 954 -30 ct 983 -30 998 -51 998 -94 ct 
p ef
1117 -76 m  1117 -70 1118 -64 1120 -60 ct 1123 -56 1126 -52 1131 -49 ct 1135 -46 1141 -44 1147 -42 ct 
1153 -39 1159 -37 1166 -35 ct 1181 -31 l  1198 -26 1210 -19 1217 -11 ct 1224 -2 1228 8 1228 21 ct 
1228 28 1226 36 1222 45 ct 1219 54 1215 62 1209 70 ct 1179 57 l  1185 46 1188 37 1188 30 ct 
1188 26 1187 22 1184 19 ct 1181 16 1177 13 1172 11 ct 1167 9 1156 6 1139 2 ct 1126 -2 1117 -5 1111 -7 ct 
1105 -10 1100 -13 1095 -17 ct 1090 -21 1086 -25 1083 -30 ct 1079 -35 1077 -42 1075 -49 ct 
1073 -56 1072 -64 1072 -73 ct 1072 -94 1076 -114 1084 -133 ct 1092 -152 1104 -166 1117 -176 ct 
1131 -185 1147 -190 1165 -190 ct 1191 -190 1211 -182 1226 -165 ct 1202 -140 l 
1191 -151 1179 -157 1167 -157 ct 1157 -157 1149 -154 1142 -147 ct 1134 -140 1128 -130 1124 -117 ct 
1119 -103 1117 -90 1117 -76 ct p ef
1440 -29 m  1456 -29 1471 -37 1486 -53 ct 1511 -29 l  1502 -20 1495 -14 1488 -10 ct 
1481 -6 1473 -3 1465 0 ct 1456 2 1446 3 1435 3 ct 1412 3 1394 -2 1381 -11 ct 1369 -21 1362 -34 1362 -52 ct 
1362 -65 1367 -75 1376 -83 ct 1385 -91 1397 -96 1412 -97 ct 1412 -97 l  1398 -99 1388 -103 1380 -111 ct 
1372 -119 1368 -129 1368 -141 ct 1368 -156 1375 -168 1388 -177 ct 1401 -186 1419 -191 1441 -191 ct 
1457 -191 1470 -189 1480 -184 ct 1491 -180 1500 -172 1508 -162 ct 1480 -140 l 
1475 -147 1470 -152 1464 -155 ct 1458 -158 1452 -160 1444 -160 ct 1434 -160 1427 -158 1422 -154 ct 
1417 -151 1414 -145 1414 -139 ct 1414 -130 1418 -124 1426 -119 ct 1434 -115 1449 -113 1471 -113 ct 
1471 -82 l  1454 -82 1441 -82 1434 -80 ct 1427 -78 1422 -75 1418 -71 ct 1414 -67 1412 -62 1412 -55 ct 
1412 -46 1415 -40 1419 -36 ct 1424 -32 1431 -29 1440 -29 ct p ef
1653 0 m  1603 -78 l  1581 -60 l  1581 0 l  1533 0 l  1533 -187 l  1581 -187 l 
1581 -101 l  1650 -187 l  1700 -187 l  1634 -107 l  1705 0 l  1653 0 l 
p ef
1740 -153 m  1730 -153 1721 -153 1713 -151 ct 1704 -150 1699 -148 1696 -147 ct 
1696 -181 l  1699 -182 1703 -184 1709 -185 ct 1716 -186 1722 -186 1728 -186 ct 
1845 -186 l  1845 -153 l  1792 -153 l  1792 -53 l  1792 -45 1794 -40 1797 -36 ct 
1799 -32 1805 -30 1812 -30 ct 1816 -30 1821 -31 1826 -32 ct 1830 -1 l  1826 0 1820 1 1814 2 ct 
1807 3 1801 4 1796 4 ct 1761 4 1744 -12 1744 -43 ct 1744 -153 l  1740 -153 l 
p ef
1943 -29 m  1959 -29 1974 -37 1989 -53 ct 2014 -29 l  2005 -20 1998 -14 1991 -10 ct 
1984 -6 1976 -3 1968 0 ct 1959 2 1949 3 1938 3 ct 1915 3 1897 -2 1884 -11 ct 1872 -21 1865 -34 1865 -52 ct 
1865 -65 1870 -75 1879 -83 ct 1888 -91 1900 -96 1915 -97 ct 1915 -97 l  1901 -99 1891 -103 1883 -111 ct 
1875 -119 1871 -129 1871 -141 ct 1871 -156 1878 -168 1891 -177 ct 1904 -186 1922 -191 1944 -191 ct 
1960 -191 1973 -189 1983 -184 ct 1994 -180 2003 -172 2011 -162 ct 1983 -140 l 
1978 -147 1973 -152 1967 -155 ct 1961 -158 1955 -160 1947 -160 ct 1937 -160 1930 -158 1925 -154 ct 
1920 -151 1917 -145 1917 -139 ct 1917 -130 1921 -124 1929 -119 ct 1937 -115 1952 -113 1974 -113 ct 
1974 -82 l  1957 -82 1944 -82 1937 -80 ct 1930 -78 1925 -75 1921 -71 ct 1917 -67 1915 -62 1915 -55 ct 
1915 -46 1918 -40 1922 -36 ct 1927 -32 1934 -29 1943 -29 ct p
1925 -204 m  1925 -210 l  1937 -260 l  1981 -260 l  1981 -254 l  1943 -204 l 
1925 -204 l  p ef
2202 -1 m  2151 -1 l  2134 -61 2123 -96 2120 -107 ct 2117 -118 2115 -126 2114 -131 ct 
2113 -125 2110 -115 2106 -103 ct 2101 -90 2098 -81 2095 -74 ct 2064 -1 l  2013 -1 l 
2094 -174 l  2089 -188 2085 -200 2081 -208 ct 2077 -216 2073 -222 2070 -225 ct 
2066 -228 2062 -230 2056 -230 ct 2051 -230 2045 -229 2040 -227 ct 2032 -260 l 
2042 -264 2053 -265 2064 -265 ct 2081 -265 2095 -261 2104 -252 ct 2114 -243 2123 -226 2132 -201 ct 
2202 -1 l  p ef
2287 -29 m  2303 -29 2318 -37 2333 -53 ct 2358 -29 l  2349 -20 2342 -14 2335 -10 ct 
2328 -6 2320 -3 2312 0 ct 2303 2 2293 3 2282 3 ct 2259 3 2241 -2 2228 -11 ct 2216 -21 2209 -34 2209 -52 ct 
2209 -65 2214 -75 2223 -83 ct 2232 -91 2244 -96 2259 -97 ct 2259 -97 l  2245 -99 2235 -103 2227 -111 ct 
2219 -119 2215 -129 2215 -141 ct 2215 -156 2222 -168 2235 -177 ct 2248 -186 2266 -191 2288 -191 ct 
2304 -191 2317 -189 2327 -184 ct 2338 -180 2347 -172 2355 -162 ct 2327 -140 l 
2322 -147 2317 -152 2311 -155 ct 2305 -158 2299 -160 2291 -160 ct 2281 -160 2274 -158 2269 -154 ct 
2264 -151 2261 -145 2261 -139 ct 2261 -130 2265 -124 2273 -119 ct 2281 -115 2296 -113 2318 -113 ct 
2318 -82 l  2301 -82 2288 -82 2281 -80 ct 2274 -78 2269 -75 2265 -71 ct 2261 -67 2259 -62 2259 -55 ct 
2259 -46 2262 -40 2266 -36 ct 2271 -32 2278 -29 2287 -29 ct p ef
2557 -79 m  2557 -53 2548 -33 2532 -19 ct 2516 -4 2493 3 2463 3 ct 2433 3 2410 -5 2393 -21 ct 
2377 -37 2369 -60 2369 -91 ct 2369 -121 2378 -145 2397 -162 ct 2416 -179 2444 -187 2479 -187 ct 
2590 -187 l  2590 -155 l  2556 -155 l  2528 -155 l  2528 -154 l  2538 -141 2545 -129 2550 -116 ct 
2554 -104 2557 -92 2557 -79 ct p
2506 -85 m  2506 -110 2500 -133 2488 -154 ct 2476 -154 l  2459 -154 2445 -149 2435 -137 ct 
2425 -126 2420 -111 2420 -91 ct 2420 -50 2434 -30 2462 -30 ct 2476 -30 2487 -35 2495 -44 ct 
2502 -54 2506 -67 2506 -85 ct p ef
2739 73 m  2739 -109 l  2739 -126 2736 -138 2732 -144 ct 2727 -151 2719 -154 2707 -154 ct 
2694 -154 2684 -149 2677 -140 ct 2670 -130 2666 -117 2666 -100 ct 2666 0 l  2618 0 l 
2618 -147 l  2618 -161 2616 -174 2611 -187 ct 2658 -187 l  2660 -182 2661 -177 2663 -171 ct 
2664 -165 2664 -160 2664 -155 ct 2665 -155 l  2672 -168 2681 -177 2690 -182 ct 
2700 -188 2712 -190 2726 -190 ct 2747 -190 2763 -185 2772 -175 ct 2782 -164 2787 -147 2787 -124 ct 
2787 73 l  2739 73 l  p ef
2864 -76 m  2864 -70 2865 -64 2867 -60 ct 2870 -56 2873 -52 2878 -49 ct 2882 -46 2888 -44 2894 -42 ct 
2900 -39 2906 -37 2913 -35 ct 2928 -31 l  2945 -26 2957 -19 2964 -11 ct 2971 -2 2975 8 2975 21 ct 
2975 28 2973 36 2969 45 ct 2966 54 2962 62 2956 70 ct 2926 57 l  2932 46 2935 37 2935 30 ct 
2935 26 2934 22 2931 19 ct 2928 16 2924 13 2919 11 ct 2914 9 2903 6 2886 2 ct 2873 -2 2864 -5 2858 -7 ct 
2852 -10 2847 -13 2842 -17 ct 2837 -21 2833 -25 2830 -30 ct 2826 -35 2824 -42 2822 -49 ct 
2820 -56 2819 -64 2819 -73 ct 2819 -94 2823 -114 2831 -133 ct 2839 -152 2851 -166 2864 -176 ct 
2878 -185 2894 -190 2912 -190 ct 2938 -190 2958 -182 2973 -165 ct 2949 -140 l 
2938 -151 2926 -157 2914 -157 ct 2904 -157 2896 -154 2889 -147 ct 2881 -140 2875 -130 2871 -117 ct 
2866 -103 2864 -90 2864 -76 ct p ef
3165 73 m  3147 47 3134 21 3126 -5 ct 3118 -31 3114 -60 3114 -92 ct 3114 -124 3118 -153 3126 -179 ct 
3134 -204 3147 -230 3165 -256 ct 3213 -256 l  3195 -230 3182 -204 3174 -178 ct 
3165 -152 3161 -123 3161 -92 ct 3161 -60 3165 -32 3174 -6 ct 3182 20 3195 46 3213 73 ct 
3165 73 l  p ef
3383 -55 m  3383 -37 3375 -23 3361 -12 ct 3346 -2 3326 3 3299 3 ct 3274 3 3254 -1 3241 -9 ct 
3227 -17 3218 -30 3213 -47 ct 3256 -53 l  3258 -45 3263 -38 3268 -35 ct 3274 -31 3285 -29 3299 -29 ct 
3313 -29 3323 -31 3329 -34 ct 3335 -38 3338 -43 3338 -51 ct 3338 -57 3336 -61 3331 -65 ct 
3326 -68 3317 -71 3305 -74 ct 3278 -79 3260 -84 3250 -89 ct 3241 -93 3233 -100 3228 -107 ct 
3223 -114 3221 -124 3221 -134 ct 3221 -152 3228 -166 3241 -176 ct 3255 -186 3275 -191 3300 -191 ct 
3322 -191 3340 -187 3353 -178 ct 3367 -169 3375 -157 3379 -141 ct 3336 -136 l 
3334 -144 3331 -149 3325 -153 ct 3320 -157 3311 -159 3300 -159 ct 3288 -159 3280 -157 3274 -154 ct 
3268 -151 3265 -147 3265 -140 ct 3265 -134 3268 -130 3272 -127 ct 3276 -124 3284 -121 3294 -119 ct 
3309 -116 3322 -113 3333 -110 ct 3344 -106 3354 -103 3360 -98 ct 3367 -94 3373 -88 3377 -81 ct 
3381 -75 3383 -66 3383 -55 ct p ef
3387 73 m  3406 46 3419 20 3427 -6 ct 3435 -32 3439 -60 3439 -92 ct 3439 -123 3435 -152 3427 -178 ct 
3419 -204 3405 -230 3387 -256 ct 3436 -256 l  3454 -230 3467 -204 3475 -178 ct 
3483 -152 3487 -123 3487 -92 ct 3487 -60 3483 -31 3475 -5 ct 3467 21 3454 47 3436 73 ct 
3387 73 l  p ef
pom
0 12433 t 
pom
count op_count sub {pop} repeat countdictstack dict_count sub {end} repeat b4_inc_state restore
%%PageTrailer
%%Trailer
%%EOF
