%!PS-Adobe-3.0 EPSF-3.0 
%%BoundingBox: 0 0 588 365
%%Pages: 0
%%Creator: LibreOffice 6.4
%%Title: none
%%CreationDate: none
%%LanguageLevel: 2
%%EndComments
%%BeginProlog
%%BeginResource: procset SDRes-Prolog 1.0 0
/b4_inc_state save def
/dict_count countdictstack def
/op_count count 1 sub def
userdict begin
0 setgray 0 setlinecap 1 setlinewidth 0 setlinejoin 10 setmiterlimit[] 0 setdash newpath
/languagelevel where {pop languagelevel 1 ne {false setstrokeadjust false setoverprint} if} if
/bdef {bind def} bind def
/c {setrgbcolor} bdef
/l {neg lineto} bdef
/rl {neg rlineto} bdef
/lc {setlinecap} bdef
/lj {setlinejoin} bdef
/lw {setlinewidth} bdef
/ml {setmiterlimit} bdef
/ld {setdash} bdef
/m {neg moveto} bdef
/ct {6 2 roll neg 6 2 roll neg 6 2 roll neg curveto} bdef
/r {rotate} bdef
/t {neg translate} bdef
/s {scale} bdef
/sw {show} bdef
/gs {gsave} bdef
/gr {grestore} bdef
/f {findfont dup length dict begin
{1 index /FID ne {def} {pop pop} ifelse} forall /Encoding ISOLatin1Encoding def
currentdict end /NFont exch definefont pop /NFont findfont} bdef
/p {closepath} bdef
/sf {scalefont setfont} bdef
/ef {eofill}bdef
/pc {closepath stroke}bdef
/ps {stroke}bdef
/pum {matrix currentmatrix}bdef
/pom {setmatrix}bdef
/bs {/aString exch def /nXOfs exch def /nWidth exch def currentpoint nXOfs 0 rmoveto pum nWidth aString stringwidth pop div 1 scale aString show pom moveto} bdef
%%EndResource
%%EndProlog
%%BeginSetup
%%EndSetup
%%Page: 1 1
%%BeginPageSetup
%%EndPageSetup
pum
0.02833 0.02835 s 
0 -12871 t
/tm matrix currentmatrix def
tm setmatrix
-17514 -3952 t 
1 1 s 
gs
1.000 1.000 1.000 c 27891 16822 m  17514 16822 l  17514 3952 l  38268 3952 l 
38268 16822 l  27891 16822 l  p ef
gr
gs
1.000 1.000 1.000 c 25089 15038 m  19611 15038 l  19611 4408 l  30567 4408 l 
30567 15038 l  25089 15038 l  p ef
gr
gs
17.99913 lw 1 lj 0.718 0.718 0.718 c 30566 15037 m  19611 15037 l  ps
gr
gs
17.99913 lw 1 lj 0.718 0.718 0.718 c 30566 12910 m  19611 12910 l  ps
gr
gs
17.99913 lw 1 lj 0.718 0.718 0.718 c 30566 10784 m  19611 10784 l  ps
gr
gs
17.99913 lw 1 lj 0.718 0.718 0.718 c 30566 8659 m  19611 8659 l  ps
gr
gs
17.99913 lw 1 lj 0.718 0.718 0.718 c 30566 6533 m  19611 6533 l  ps
gr
gs
17.99913 lw 1 lj 0.718 0.718 0.718 c 30566 4407 m  19611 4407 l  ps
gr
gs
17.99913 lw 1 lj 0.546 0.546 0.546 c 19611 15037 m  30566 15037 l  ps
gr
gs
17.99913 lw 1 lj 0.546 0.546 0.546 c 19611 15037 m  19611 4407 l  ps
gr
gs
52.99744 lw 1 lj 0.261 0.523 0.957 c 19611 15026 m  22350 14998 l  25089 14894 l 
27828 14566 l  30566 13313 l  ps
gr
gs
52.99744 lw 1 lj 0.917 0.265 0.210 c 19611 14898 m  22350 14777 l  25089 14306 l 
27828 12403 l  30566 4943 l  ps
gr
gs
79.99614 lw 1 lj 1.000 0.828 0.128 c 19611 15017 m  22350 14965 l  25089 14786 l 
27828 14180 l  30566 11739 l  ps
gr
pum
18989 15455 t
0.003 0.003 0.003 c 181 -68 m  181 -46 174 -28 160 -16 ct 145 -3 125 3 98 3 ct 72 3 52 -3 37 -15 ct 
23 -28 15 -45 15 -68 ct 15 -84 20 -97 29 -108 ct 38 -119 50 -125 64 -128 ct 64 -128 l 
51 -131 40 -138 32 -148 ct 25 -159 21 -171 21 -185 ct 21 -203 28 -218 42 -230 ct 
56 -241 74 -247 98 -247 ct 121 -247 140 -241 154 -230 ct 168 -219 175 -204 175 -184 ct 
175 -171 171 -158 163 -148 ct 156 -138 145 -131 132 -129 ct 132 -128 l  147 -125 159 -119 168 -108 ct 
177 -98 181 -84 181 -68 ct p
143 -183 m  143 -210 128 -224 98 -224 ct 83 -224 72 -220 64 -214 ct 57 -207 53 -196 53 -183 ct 
53 -169 57 -158 65 -151 ct 72 -144 84 -140 98 -140 ct 113 -140 124 -143 131 -150 ct 
139 -157 143 -168 143 -183 ct p
149 -71 m  149 -86 144 -98 135 -105 ct 126 -113 114 -117 98 -117 ct 82 -117 70 -113 61 -104 ct 
52 -96 47 -85 47 -70 ct 47 -37 64 -20 99 -20 ct 115 -20 128 -24 136 -32 ct 145 -41 149 -53 149 -71 ct 
p ef
337 -55 m  337 0 l  308 0 l  308 -55 l  193 -55 l  193 -79 l  304 -243 l 
337 -243 l  337 -79 l  371 -79 l  371 -55 l  337 -55 l  p
308 -208 m  307 -207 306 -204 303 -199 ct 300 -193 298 -190 296 -187 ct 234 -96 l 
224 -83 l  222 -79 l  308 -79 l  308 -208 l  p ef
553 -122 m  553 -81 545 -50 531 -29 ct 517 -8 496 3 468 3 ct 440 3 419 -8 405 -29 ct 
391 -50 384 -81 384 -122 ct 384 -164 391 -195 404 -216 ct 418 -237 439 -247 469 -247 ct 
497 -247 519 -236 532 -215 ct 546 -194 553 -163 553 -122 ct p
521 -122 m  521 -157 517 -182 509 -198 ct 501 -214 487 -222 469 -222 ct 450 -222 436 -214 428 -199 ct 
419 -183 415 -158 415 -122 ct 415 -88 419 -62 428 -46 ct 436 -30 450 -22 468 -22 ct 
486 -22 500 -31 508 -47 ct 517 -63 521 -88 521 -122 ct p ef
635 -192 m  680 -210 l  688 -187 l  639 -175 l  671 -131 l  651 -119 l 
625 -164 l  598 -119 l  577 -132 l  610 -175 l  562 -187 l  569 -210 l 
615 -192 l  613 -243 l  637 -243 l  635 -192 l  p ef
869 -68 m  869 -46 862 -28 848 -16 ct 833 -3 813 3 786 3 ct 760 3 740 -3 725 -15 ct 
711 -28 703 -45 703 -68 ct 703 -84 708 -97 717 -108 ct 726 -119 738 -125 752 -128 ct 
752 -128 l  739 -131 728 -138 720 -148 ct 713 -159 709 -171 709 -185 ct 709 -203 716 -218 730 -230 ct 
744 -241 762 -247 786 -247 ct 809 -247 828 -241 842 -230 ct 856 -219 863 -204 863 -184 ct 
863 -171 859 -158 851 -148 ct 844 -138 833 -131 820 -129 ct 820 -128 l  835 -125 847 -119 856 -108 ct 
865 -98 869 -84 869 -68 ct p
831 -183 m  831 -210 816 -224 786 -224 ct 771 -224 760 -220 752 -214 ct 745 -207 741 -196 741 -183 ct 
741 -169 745 -158 753 -151 ct 760 -144 772 -140 786 -140 ct 801 -140 812 -143 819 -150 ct 
827 -157 831 -168 831 -183 ct p
837 -71 m  837 -86 832 -98 823 -105 ct 814 -113 802 -117 786 -117 ct 770 -117 758 -113 749 -104 ct 
740 -96 735 -85 735 -70 ct 735 -37 752 -20 787 -20 ct 803 -20 816 -24 824 -32 ct 
833 -41 837 -53 837 -71 ct p ef
1025 -55 m  1025 0 l  996 0 l  996 -55 l  881 -55 l  881 -79 l  992 -243 l 
1025 -243 l  1025 -79 l  1059 -79 l  1059 -55 l  1025 -55 l  p
996 -208 m  995 -207 994 -204 991 -199 ct 988 -193 986 -190 984 -187 ct 922 -96 l 
912 -83 l  910 -79 l  996 -79 l  996 -208 l  p ef
1241 -122 m  1241 -81 1233 -50 1219 -29 ct 1205 -8 1184 3 1156 3 ct 1128 3 1107 -8 1093 -29 ct 
1079 -50 1072 -81 1072 -122 ct 1072 -164 1079 -195 1092 -216 ct 1106 -237 1127 -247 1157 -247 ct 
1185 -247 1207 -236 1220 -215 ct 1234 -194 1241 -163 1241 -122 ct p
1209 -122 m  1209 -157 1205 -182 1197 -198 ct 1189 -214 1175 -222 1157 -222 ct 
1138 -222 1124 -214 1116 -199 ct 1107 -183 1103 -158 1103 -122 ct 1103 -88 1107 -62 1116 -46 ct 
1124 -30 1138 -22 1156 -22 ct 1174 -22 1188 -31 1196 -47 ct 1205 -63 1209 -88 1209 -122 ct 
p ef
pom
pum
21543 15455 t
27 0 m  27 -26 l  89 -26 l  89 -213 l  34 -174 l  34 -204 l  91 -243 l 
120 -243 l  120 -26 l  179 -26 l  179 0 l  27 0 l  p ef
366 -80 m  366 -54 359 -34 345 -19 ct 331 -4 312 3 287 3 ct 260 3 239 -7 225 -28 ct 
210 -48 203 -77 203 -116 ct 203 -158 210 -191 226 -213 ct 241 -236 262 -247 290 -247 ct 
326 -247 350 -231 359 -198 ct 329 -192 l  323 -212 310 -222 289 -222 ct 272 -222 258 -214 248 -197 ct 
239 -181 234 -157 234 -126 ct 239 -136 247 -144 258 -150 ct 268 -155 280 -158 293 -158 ct 
315 -158 333 -151 346 -137 ct 359 -123 366 -104 366 -80 ct p
334 -79 m  334 -96 330 -110 321 -120 ct 313 -129 301 -134 285 -134 ct 271 -134 259 -130 250 -121 ct 
241 -113 237 -101 237 -86 ct 237 -67 242 -52 251 -40 ct 260 -28 272 -22 286 -22 ct 
301 -22 313 -27 322 -37 ct 330 -47 334 -61 334 -79 ct p ef
551 -68 m  551 -46 544 -28 530 -16 ct 515 -3 495 3 468 3 ct 442 3 422 -3 407 -15 ct 
393 -28 385 -45 385 -68 ct 385 -84 390 -97 399 -108 ct 408 -119 420 -125 434 -128 ct 
434 -128 l  421 -131 410 -138 402 -148 ct 395 -159 391 -171 391 -185 ct 391 -203 398 -218 412 -230 ct 
426 -241 444 -247 468 -247 ct 491 -247 510 -241 524 -230 ct 538 -219 545 -204 545 -184 ct 
545 -171 541 -158 533 -148 ct 526 -138 515 -131 502 -129 ct 502 -128 l  517 -125 529 -119 538 -108 ct 
547 -98 551 -84 551 -68 ct p
513 -183 m  513 -210 498 -224 468 -224 ct 453 -224 442 -220 434 -214 ct 427 -207 423 -196 423 -183 ct 
423 -169 427 -158 435 -151 ct 442 -144 454 -140 468 -140 ct 483 -140 494 -143 501 -150 ct 
509 -157 513 -168 513 -183 ct p
519 -71 m  519 -86 514 -98 505 -105 ct 496 -113 484 -117 468 -117 ct 452 -117 440 -113 431 -104 ct 
422 -96 417 -85 417 -70 ct 417 -37 434 -20 469 -20 ct 485 -20 498 -24 506 -32 ct 
515 -41 519 -53 519 -71 ct p ef
739 -122 m  739 -81 731 -50 717 -29 ct 703 -8 682 3 654 3 ct 626 3 605 -8 591 -29 ct 
577 -50 570 -81 570 -122 ct 570 -164 577 -195 590 -216 ct 604 -237 625 -247 655 -247 ct 
683 -247 705 -236 718 -215 ct 732 -194 739 -163 739 -122 ct p
707 -122 m  707 -157 703 -182 695 -198 ct 687 -214 673 -222 655 -222 ct 636 -222 622 -214 614 -199 ct 
605 -183 601 -158 601 -122 ct 601 -88 605 -62 614 -46 ct 622 -30 636 -22 654 -22 ct 
672 -22 686 -31 694 -47 ct 703 -63 707 -88 707 -122 ct p ef
820 -192 m  865 -210 l  873 -187 l  824 -175 l  856 -131 l  836 -119 l 
810 -164 l  783 -119 l  762 -132 l  795 -175 l  747 -187 l  754 -210 l 
800 -192 l  798 -243 l  822 -243 l  820 -192 l  p ef
900 0 m  900 -26 l  962 -26 l  962 -213 l  907 -174 l  907 -204 l  964 -243 l 
993 -243 l  993 -26 l  1052 -26 l  1052 0 l  900 0 l  p ef
1239 -80 m  1239 -54 1232 -34 1218 -19 ct 1204 -4 1185 3 1160 3 ct 1133 3 1112 -7 1098 -28 ct 
1083 -48 1076 -77 1076 -116 ct 1076 -158 1083 -191 1099 -213 ct 1114 -236 1135 -247 1163 -247 ct 
1199 -247 1223 -231 1232 -198 ct 1202 -192 l  1196 -212 1183 -222 1162 -222 ct 
1145 -222 1131 -214 1121 -197 ct 1112 -181 1107 -157 1107 -126 ct 1112 -136 1120 -144 1131 -150 ct 
1141 -155 1153 -158 1166 -158 ct 1188 -158 1206 -151 1219 -137 ct 1232 -123 1239 -104 1239 -80 ct 
p
1207 -79 m  1207 -96 1203 -110 1194 -120 ct 1186 -129 1174 -134 1158 -134 ct 
1144 -134 1132 -130 1123 -121 ct 1114 -113 1110 -101 1110 -86 ct 1110 -67 1115 -52 1124 -40 ct 
1133 -28 1145 -22 1159 -22 ct 1174 -22 1186 -27 1195 -37 ct 1203 -47 1207 -61 1207 -79 ct 
p ef
1425 -68 m  1425 -46 1418 -28 1404 -16 ct 1389 -3 1369 3 1342 3 ct 1316 3 1296 -3 1281 -15 ct 
1267 -28 1259 -45 1259 -68 ct 1259 -84 1264 -97 1273 -108 ct 1282 -119 1294 -125 1308 -128 ct 
1308 -128 l  1295 -131 1284 -138 1276 -148 ct 1269 -159 1265 -171 1265 -185 ct 
1265 -203 1272 -218 1286 -230 ct 1300 -241 1318 -247 1342 -247 ct 1365 -247 1384 -241 1398 -230 ct 
1412 -219 1419 -204 1419 -184 ct 1419 -171 1415 -158 1407 -148 ct 1400 -138 1389 -131 1376 -129 ct 
1376 -128 l  1391 -125 1403 -119 1412 -108 ct 1421 -98 1425 -84 1425 -68 ct 
p
1387 -183 m  1387 -210 1372 -224 1342 -224 ct 1327 -224 1316 -220 1308 -214 ct 
1301 -207 1297 -196 1297 -183 ct 1297 -169 1301 -158 1309 -151 ct 1316 -144 1328 -140 1342 -140 ct 
1357 -140 1368 -143 1375 -150 ct 1383 -157 1387 -168 1387 -183 ct p
1393 -71 m  1393 -86 1388 -98 1379 -105 ct 1370 -113 1358 -117 1342 -117 ct 
1326 -117 1314 -113 1305 -104 ct 1296 -96 1291 -85 1291 -70 ct 1291 -37 1308 -20 1343 -20 ct 
1359 -20 1372 -24 1380 -32 ct 1389 -41 1393 -53 1393 -71 ct p ef
1612 -122 m  1612 -81 1604 -50 1590 -29 ct 1576 -8 1555 3 1527 3 ct 1499 3 1478 -8 1464 -29 ct 
1450 -50 1443 -81 1443 -122 ct 1443 -164 1450 -195 1463 -216 ct 1477 -237 1498 -247 1528 -247 ct 
1556 -247 1578 -236 1591 -215 ct 1605 -194 1612 -163 1612 -122 ct p
1580 -122 m  1580 -157 1576 -182 1568 -198 ct 1560 -214 1546 -222 1528 -222 ct 
1509 -222 1495 -214 1487 -199 ct 1478 -183 1474 -158 1474 -122 ct 1474 -88 1478 -62 1487 -46 ct 
1495 -30 1509 -22 1527 -22 ct 1545 -22 1559 -31 1567 -47 ct 1576 -63 1580 -88 1580 -122 ct 
p ef
pom
pum
24282 15455 t
181 -68 m  181 -45 174 -28 159 -16 ct 145 -3 125 3 98 3 ct 74 3 54 -3 40 -14 ct 
25 -25 16 -41 13 -63 ct 46 -66 l  50 -37 67 -23 98 -23 ct 114 -23 126 -27 135 -34 ct 
144 -42 149 -54 149 -69 ct 149 -82 143 -92 133 -100 ct 123 -107 108 -111 89 -111 ct 
72 -111 l  72 -138 l  89 -138 l  106 -138 119 -142 128 -149 ct 138 -156 142 -167 142 -180 ct 
142 -193 138 -203 131 -210 ct 123 -218 112 -221 97 -221 ct 83 -221 72 -218 64 -211 ct 
55 -204 50 -194 49 -182 ct 18 -184 l  20 -204 28 -219 42 -230 ct 57 -241 75 -247 97 -247 ct 
121 -247 140 -241 154 -230 ct 167 -219 174 -203 174 -183 ct 174 -167 170 -155 161 -145 ct 
152 -135 140 -129 123 -125 ct 123 -125 l  141 -123 156 -117 166 -106 ct 176 -96 181 -83 181 -68 ct 
p ef
366 -68 m  366 -45 359 -28 344 -16 ct 330 -3 310 3 283 3 ct 259 3 239 -3 225 -14 ct 
210 -25 201 -41 198 -63 ct 231 -66 l  235 -37 252 -23 283 -23 ct 299 -23 311 -27 320 -34 ct 
329 -42 334 -54 334 -69 ct 334 -82 328 -92 318 -100 ct 308 -107 293 -111 274 -111 ct 
257 -111 l  257 -138 l  274 -138 l  291 -138 304 -142 313 -149 ct 323 -156 327 -167 327 -180 ct 
327 -193 323 -203 316 -210 ct 308 -218 297 -221 282 -221 ct 268 -221 257 -218 249 -211 ct 
240 -204 235 -194 234 -182 ct 203 -184 l  205 -204 213 -219 227 -230 ct 242 -241 260 -247 282 -247 ct 
306 -247 325 -241 339 -230 ct 352 -219 359 -203 359 -183 ct 359 -167 355 -155 346 -145 ct 
337 -135 325 -129 308 -125 ct 308 -125 l  326 -123 341 -117 351 -106 ct 361 -96 366 -83 366 -68 ct 
p ef
551 -80 m  551 -54 544 -34 530 -19 ct 516 -4 497 3 472 3 ct 445 3 424 -7 410 -28 ct 
395 -48 388 -77 388 -116 ct 388 -158 395 -191 411 -213 ct 426 -236 447 -247 475 -247 ct 
511 -247 535 -231 544 -198 ct 514 -192 l  508 -212 495 -222 474 -222 ct 457 -222 443 -214 433 -197 ct 
424 -181 419 -157 419 -126 ct 424 -136 432 -144 443 -150 ct 453 -155 465 -158 478 -158 ct 
500 -158 518 -151 531 -137 ct 544 -123 551 -104 551 -80 ct p
519 -79 m  519 -96 515 -110 506 -120 ct 498 -129 486 -134 470 -134 ct 456 -134 444 -130 435 -121 ct 
426 -113 422 -101 422 -86 ct 422 -67 427 -52 436 -40 ct 445 -28 457 -22 471 -22 ct 
486 -22 498 -27 507 -37 ct 515 -47 519 -61 519 -79 ct p ef
739 -122 m  739 -81 731 -50 717 -29 ct 703 -8 682 3 654 3 ct 626 3 605 -8 591 -29 ct 
577 -50 570 -81 570 -122 ct 570 -164 577 -195 590 -216 ct 604 -237 625 -247 655 -247 ct 
683 -247 705 -236 718 -215 ct 732 -194 739 -163 739 -122 ct p
707 -122 m  707 -157 703 -182 695 -198 ct 687 -214 673 -222 655 -222 ct 636 -222 622 -214 614 -199 ct 
605 -183 601 -158 601 -122 ct 601 -88 605 -62 614 -46 ct 622 -30 636 -22 654 -22 ct 
672 -22 686 -31 694 -47 ct 703 -63 707 -88 707 -122 ct p ef
820 -192 m  865 -210 l  873 -187 l  824 -175 l  856 -131 l  836 -119 l 
810 -164 l  783 -119 l  762 -132 l  795 -175 l  747 -187 l  754 -210 l 
800 -192 l  798 -243 l  822 -243 l  820 -192 l  p ef
1054 -68 m  1054 -45 1047 -28 1032 -16 ct 1018 -3 998 3 971 3 ct 947 3 927 -3 913 -14 ct 
898 -25 889 -41 886 -63 ct 919 -66 l  923 -37 940 -23 971 -23 ct 987 -23 999 -27 1008 -34 ct 
1017 -42 1022 -54 1022 -69 ct 1022 -82 1016 -92 1006 -100 ct 996 -107 981 -111 962 -111 ct 
945 -111 l  945 -138 l  962 -138 l  979 -138 992 -142 1001 -149 ct 1011 -156 1015 -167 1015 -180 ct 
1015 -193 1011 -203 1004 -210 ct 996 -218 985 -221 970 -221 ct 956 -221 945 -218 937 -211 ct 
928 -204 923 -194 922 -182 ct 891 -184 l  893 -204 901 -219 915 -230 ct 930 -241 948 -247 970 -247 ct 
994 -247 1013 -241 1027 -230 ct 1040 -219 1047 -203 1047 -183 ct 1047 -167 1043 -155 1034 -145 ct 
1025 -135 1013 -129 996 -125 ct 996 -125 l  1014 -123 1029 -117 1039 -106 ct 
1049 -96 1054 -83 1054 -68 ct p ef
1239 -68 m  1239 -45 1232 -28 1217 -16 ct 1203 -3 1183 3 1156 3 ct 1132 3 1112 -3 1098 -14 ct 
1083 -25 1074 -41 1071 -63 ct 1104 -66 l  1108 -37 1125 -23 1156 -23 ct 1172 -23 1184 -27 1193 -34 ct 
1202 -42 1207 -54 1207 -69 ct 1207 -82 1201 -92 1191 -100 ct 1181 -107 1166 -111 1147 -111 ct 
1130 -111 l  1130 -138 l  1147 -138 l  1164 -138 1177 -142 1186 -149 ct 1196 -156 1200 -167 1200 -180 ct 
1200 -193 1196 -203 1189 -210 ct 1181 -218 1170 -221 1155 -221 ct 1141 -221 1130 -218 1122 -211 ct 
1113 -204 1108 -194 1107 -182 ct 1076 -184 l  1078 -204 1086 -219 1100 -230 ct 
1115 -241 1133 -247 1155 -247 ct 1179 -247 1198 -241 1212 -230 ct 1225 -219 1232 -203 1232 -183 ct 
1232 -167 1228 -155 1219 -145 ct 1210 -135 1198 -129 1181 -125 ct 1181 -125 l 
1199 -123 1214 -117 1224 -106 ct 1234 -96 1239 -83 1239 -68 ct p ef
1425 -80 m  1425 -54 1418 -34 1404 -19 ct 1390 -4 1371 3 1346 3 ct 1319 3 1298 -7 1284 -28 ct 
1269 -48 1262 -77 1262 -116 ct 1262 -158 1269 -191 1285 -213 ct 1300 -236 1321 -247 1349 -247 ct 
1385 -247 1409 -231 1418 -198 ct 1388 -192 l  1382 -212 1369 -222 1348 -222 ct 
1331 -222 1317 -214 1307 -197 ct 1298 -181 1293 -157 1293 -126 ct 1298 -136 1306 -144 1317 -150 ct 
1327 -155 1339 -158 1352 -158 ct 1374 -158 1392 -151 1405 -137 ct 1418 -123 1425 -104 1425 -80 ct 
p
1393 -79 m  1393 -96 1389 -110 1380 -120 ct 1372 -129 1360 -134 1344 -134 ct 
1330 -134 1318 -130 1309 -121 ct 1300 -113 1296 -101 1296 -86 ct 1296 -67 1301 -52 1310 -40 ct 
1319 -28 1331 -22 1345 -22 ct 1360 -22 1372 -27 1381 -37 ct 1389 -47 1393 -61 1393 -79 ct 
p ef
1612 -122 m  1612 -81 1604 -50 1590 -29 ct 1576 -8 1555 3 1527 3 ct 1499 3 1478 -8 1464 -29 ct 
1450 -50 1443 -81 1443 -122 ct 1443 -164 1450 -195 1463 -216 ct 1477 -237 1498 -247 1528 -247 ct 
1556 -247 1578 -236 1591 -215 ct 1605 -194 1612 -163 1612 -122 ct p
1580 -122 m  1580 -157 1576 -182 1568 -198 ct 1560 -214 1546 -222 1528 -222 ct 
1509 -222 1495 -214 1487 -199 ct 1478 -183 1474 -158 1474 -122 ct 1474 -88 1478 -62 1487 -46 ct 
1495 -30 1509 -22 1527 -22 ct 1545 -22 1559 -31 1567 -47 ct 1576 -63 1580 -88 1580 -122 ct 
p ef
pom
pum
27021 15455 t
181 -80 m  181 -54 174 -34 160 -19 ct 146 -4 127 3 102 3 ct 75 3 54 -7 40 -28 ct 
25 -48 18 -77 18 -116 ct 18 -158 25 -191 41 -213 ct 56 -236 77 -247 105 -247 ct 
141 -247 165 -231 174 -198 ct 144 -192 l  138 -212 125 -222 104 -222 ct 87 -222 73 -214 63 -197 ct 
54 -181 49 -157 49 -126 ct 54 -136 62 -144 73 -150 ct 83 -155 95 -158 108 -158 ct 
130 -158 148 -151 161 -137 ct 174 -123 181 -104 181 -80 ct p
149 -79 m  149 -96 145 -110 136 -120 ct 128 -129 116 -134 100 -134 ct 86 -134 74 -130 65 -121 ct 
56 -113 52 -101 52 -86 ct 52 -67 57 -52 66 -40 ct 75 -28 87 -22 101 -22 ct 116 -22 128 -27 137 -37 ct 
145 -47 149 -61 149 -79 ct p ef
364 -218 m  339 -180 321 -151 311 -129 ct 301 -108 293 -86 288 -65 ct 283 -45 280 -23 280 -1 ct 
248 -1 l  248 -32 254 -64 268 -98 ct 281 -133 303 -172 334 -217 ct 203 -217 l 
203 -243 l  364 -243 l  364 -218 l  p ef
388 0 m  388 -22 l  394 -35 401 -47 409 -58 ct 418 -68 427 -77 436 -85 ct 445 -94 454 -101 464 -109 ct 
473 -116 481 -123 488 -130 ct 496 -137 502 -145 506 -152 ct 511 -160 513 -169 513 -179 ct 
513 -192 509 -203 501 -210 ct 493 -217 483 -221 469 -221 ct 455 -221 444 -217 436 -210 ct 
427 -203 422 -193 421 -180 ct 389 -183 l  391 -202 400 -218 414 -229 ct 428 -241 446 -247 469 -247 ct 
493 -247 512 -241 525 -229 ct 538 -218 545 -201 545 -180 ct 545 -171 543 -161 538 -152 ct 
534 -143 528 -133 519 -124 ct 511 -115 494 -100 470 -81 ct 457 -70 447 -60 439 -51 ct 
431 -43 425 -34 422 -26 ct 549 -26 l  549 0 l  388 0 l  p ef
739 -122 m  739 -81 731 -50 717 -29 ct 703 -8 682 3 654 3 ct 626 3 605 -8 591 -29 ct 
577 -50 570 -81 570 -122 ct 570 -164 577 -195 590 -216 ct 604 -237 625 -247 655 -247 ct 
683 -247 705 -236 718 -215 ct 732 -194 739 -163 739 -122 ct p
707 -122 m  707 -157 703 -182 695 -198 ct 687 -214 673 -222 655 -222 ct 636 -222 622 -214 614 -199 ct 
605 -183 601 -158 601 -122 ct 601 -88 605 -62 614 -46 ct 622 -30 636 -22 654 -22 ct 
672 -22 686 -31 694 -47 ct 703 -63 707 -88 707 -122 ct p ef
820 -192 m  865 -210 l  873 -187 l  824 -175 l  856 -131 l  836 -119 l 
810 -164 l  783 -119 l  762 -132 l  795 -175 l  747 -187 l  754 -210 l 
800 -192 l  798 -243 l  822 -243 l  820 -192 l  p ef
1054 -80 m  1054 -54 1047 -34 1033 -19 ct 1019 -4 1000 3 975 3 ct 948 3 927 -7 913 -28 ct 
898 -48 891 -77 891 -116 ct 891 -158 898 -191 914 -213 ct 929 -236 950 -247 978 -247 ct 
1014 -247 1038 -231 1047 -198 ct 1017 -192 l  1011 -212 998 -222 977 -222 ct 
960 -222 946 -214 936 -197 ct 927 -181 922 -157 922 -126 ct 927 -136 935 -144 946 -150 ct 
956 -155 968 -158 981 -158 ct 1003 -158 1021 -151 1034 -137 ct 1047 -123 1054 -104 1054 -80 ct 
p
1022 -79 m  1022 -96 1018 -110 1009 -120 ct 1001 -129 989 -134 973 -134 ct 959 -134 947 -130 938 -121 ct 
929 -113 925 -101 925 -86 ct 925 -67 930 -52 939 -40 ct 948 -28 960 -22 974 -22 ct 
989 -22 1001 -27 1010 -37 ct 1018 -47 1022 -61 1022 -79 ct p ef
1237 -218 m  1212 -180 1194 -151 1184 -129 ct 1174 -108 1166 -86 1161 -65 ct 
1156 -45 1153 -23 1153 -1 ct 1121 -1 l  1121 -32 1127 -64 1141 -98 ct 1154 -133 1176 -172 1207 -217 ct 
1076 -217 l  1076 -243 l  1237 -243 l  1237 -218 l  p ef
1262 0 m  1262 -22 l  1268 -35 1275 -47 1283 -58 ct 1292 -68 1301 -77 1310 -85 ct 
1319 -94 1328 -101 1338 -109 ct 1347 -116 1355 -123 1362 -130 ct 1370 -137 1376 -145 1380 -152 ct 
1385 -160 1387 -169 1387 -179 ct 1387 -192 1383 -203 1375 -210 ct 1367 -217 1357 -221 1343 -221 ct 
1329 -221 1318 -217 1310 -210 ct 1301 -203 1296 -193 1295 -180 ct 1263 -183 l 
1265 -202 1274 -218 1288 -229 ct 1302 -241 1320 -247 1343 -247 ct 1367 -247 1386 -241 1399 -229 ct 
1412 -218 1419 -201 1419 -180 ct 1419 -171 1417 -161 1412 -152 ct 1408 -143 1402 -133 1393 -124 ct 
1385 -115 1368 -100 1344 -81 ct 1331 -70 1321 -60 1313 -51 ct 1305 -43 1299 -34 1296 -26 ct 
1423 -26 l  1423 0 l  1262 0 l  p ef
1612 -122 m  1612 -81 1604 -50 1590 -29 ct 1576 -8 1555 3 1527 3 ct 1499 3 1478 -8 1464 -29 ct 
1450 -50 1443 -81 1443 -122 ct 1443 -164 1450 -195 1463 -216 ct 1477 -237 1498 -247 1528 -247 ct 
1556 -247 1578 -236 1591 -215 ct 1605 -194 1612 -163 1612 -122 ct p
1580 -122 m  1580 -157 1576 -182 1568 -198 ct 1560 -214 1546 -222 1528 -222 ct 
1509 -222 1495 -214 1487 -199 ct 1478 -183 1474 -158 1474 -122 ct 1474 -88 1478 -62 1487 -46 ct 
1495 -30 1509 -22 1527 -22 ct 1545 -22 1559 -31 1567 -47 ct 1576 -63 1580 -88 1580 -122 ct 
p ef
pom
pum
29575 15455 t
27 0 m  27 -26 l  89 -26 l  89 -213 l  34 -174 l  34 -204 l  91 -243 l 
120 -243 l  120 -26 l  179 -26 l  179 0 l  27 0 l  p ef
366 -68 m  366 -45 359 -28 344 -16 ct 330 -3 310 3 283 3 ct 259 3 239 -3 225 -14 ct 
210 -25 201 -41 198 -63 ct 231 -66 l  235 -37 252 -23 283 -23 ct 299 -23 311 -27 320 -34 ct 
329 -42 334 -54 334 -69 ct 334 -82 328 -92 318 -100 ct 308 -107 293 -111 274 -111 ct 
257 -111 l  257 -138 l  274 -138 l  291 -138 304 -142 313 -149 ct 323 -156 327 -167 327 -180 ct 
327 -193 323 -203 316 -210 ct 308 -218 297 -221 282 -221 ct 268 -221 257 -218 249 -211 ct 
240 -204 235 -194 234 -182 ct 203 -184 l  205 -204 213 -219 227 -230 ct 242 -241 260 -247 282 -247 ct 
306 -247 325 -241 339 -230 ct 352 -219 359 -203 359 -183 ct 359 -167 355 -155 346 -145 ct 
337 -135 325 -129 308 -125 ct 308 -125 l  326 -123 341 -117 351 -106 ct 361 -96 366 -83 366 -68 ct 
p ef
522 -55 m  522 0 l  493 0 l  493 -55 l  378 -55 l  378 -79 l  489 -243 l 
522 -243 l  522 -79 l  556 -79 l  556 -55 l  522 -55 l  p
493 -208 m  492 -207 491 -204 488 -199 ct 485 -193 483 -190 481 -187 ct 419 -96 l 
409 -83 l  407 -79 l  493 -79 l  493 -208 l  p ef
708 -55 m  708 0 l  679 0 l  679 -55 l  564 -55 l  564 -79 l  675 -243 l 
708 -243 l  708 -79 l  742 -79 l  742 -55 l  708 -55 l  p
679 -208 m  678 -207 677 -204 674 -199 ct 671 -193 669 -190 667 -187 ct 605 -96 l 
595 -83 l  593 -79 l  679 -79 l  679 -208 l  p ef
924 -122 m  924 -81 916 -50 902 -29 ct 888 -8 867 3 839 3 ct 811 3 790 -8 776 -29 ct 
762 -50 755 -81 755 -122 ct 755 -164 762 -195 775 -216 ct 789 -237 810 -247 840 -247 ct 
868 -247 890 -236 903 -215 ct 917 -194 924 -163 924 -122 ct p
892 -122 m  892 -157 888 -182 880 -198 ct 872 -214 858 -222 840 -222 ct 821 -222 807 -214 799 -199 ct 
790 -183 786 -158 786 -122 ct 786 -88 790 -62 799 -46 ct 807 -30 821 -22 839 -22 ct 
857 -22 871 -31 879 -47 ct 888 -63 892 -88 892 -122 ct p ef
1005 -192 m  1050 -210 l  1058 -187 l  1009 -175 l  1041 -131 l  1021 -119 l 
995 -164 l  968 -119 l  947 -132 l  980 -175 l  932 -187 l  939 -210 l 
985 -192 l  983 -243 l  1007 -243 l  1005 -192 l  p ef
1085 0 m  1085 -26 l  1147 -26 l  1147 -213 l  1092 -174 l  1092 -204 l 
1149 -243 l  1178 -243 l  1178 -26 l  1237 -26 l  1237 0 l  1085 0 l  p ef
1425 -68 m  1425 -45 1418 -28 1403 -16 ct 1389 -3 1369 3 1342 3 ct 1318 3 1298 -3 1284 -14 ct 
1269 -25 1260 -41 1257 -63 ct 1290 -66 l  1294 -37 1311 -23 1342 -23 ct 1358 -23 1370 -27 1379 -34 ct 
1388 -42 1393 -54 1393 -69 ct 1393 -82 1387 -92 1377 -100 ct 1367 -107 1352 -111 1333 -111 ct 
1316 -111 l  1316 -138 l  1333 -138 l  1350 -138 1363 -142 1372 -149 ct 1382 -156 1386 -167 1386 -180 ct 
1386 -193 1382 -203 1375 -210 ct 1367 -218 1356 -221 1341 -221 ct 1327 -221 1316 -218 1308 -211 ct 
1299 -204 1294 -194 1293 -182 ct 1262 -184 l  1264 -204 1272 -219 1286 -230 ct 
1301 -241 1319 -247 1341 -247 ct 1365 -247 1384 -241 1398 -230 ct 1411 -219 1418 -203 1418 -183 ct 
1418 -167 1414 -155 1405 -145 ct 1396 -135 1384 -129 1367 -125 ct 1367 -125 l 
1385 -123 1400 -117 1410 -106 ct 1420 -96 1425 -83 1425 -68 ct p ef
1581 -55 m  1581 0 l  1552 0 l  1552 -55 l  1437 -55 l  1437 -79 l  1548 -243 l 
1581 -243 l  1581 -79 l  1615 -79 l  1615 -55 l  1581 -55 l  p
1552 -208 m  1551 -207 1550 -204 1547 -199 ct 1544 -193 1542 -190 1540 -187 ct 
1478 -96 l  1468 -83 l  1466 -79 l  1552 -79 l  1552 -208 l  p ef
1766 -55 m  1766 0 l  1737 0 l  1737 -55 l  1622 -55 l  1622 -79 l  1733 -243 l 
1766 -243 l  1766 -79 l  1800 -79 l  1800 -55 l  1766 -55 l  p
1737 -208 m  1736 -207 1735 -204 1732 -199 ct 1729 -193 1727 -190 1725 -187 ct 
1663 -96 l  1653 -83 l  1651 -79 l  1737 -79 l  1737 -208 l  p ef
1982 -122 m  1982 -81 1974 -50 1960 -29 ct 1946 -8 1925 3 1897 3 ct 1869 3 1848 -8 1834 -29 ct 
1820 -50 1813 -81 1813 -122 ct 1813 -164 1820 -195 1833 -216 ct 1847 -237 1868 -247 1898 -247 ct 
1926 -247 1948 -236 1961 -215 ct 1975 -194 1982 -163 1982 -122 ct p
1950 -122 m  1950 -157 1946 -182 1938 -198 ct 1930 -214 1916 -222 1898 -222 ct 
1879 -222 1865 -214 1857 -199 ct 1848 -183 1844 -158 1844 -122 ct 1844 -88 1848 -62 1857 -46 ct 
1865 -30 1879 -22 1897 -22 ct 1915 -22 1929 -31 1937 -47 ct 1946 -63 1950 -88 1950 -122 ct 
p ef
pom
pum
19326 15158 t
183 -122 m  183 -81 175 -50 161 -29 ct 147 -8 126 3 98 3 ct 70 3 49 -8 35 -29 ct 
21 -50 14 -81 14 -122 ct 14 -164 21 -195 34 -216 ct 48 -237 69 -247 99 -247 ct 
127 -247 149 -236 162 -215 ct 176 -194 183 -163 183 -122 ct p
151 -122 m  151 -157 147 -182 139 -198 ct 131 -214 117 -222 99 -222 ct 80 -222 66 -214 58 -199 ct 
49 -183 45 -158 45 -122 ct 45 -88 49 -62 58 -46 ct 66 -30 80 -22 98 -22 ct 116 -22 130 -31 138 -47 ct 
147 -63 151 -88 151 -122 ct p ef
pom
pum
19326 13031 t
182 -80 m  182 -54 174 -34 159 -19 ct 143 -4 122 3 95 3 ct 73 3 54 -2 41 -12 ct 
27 -22 18 -36 14 -55 ct 46 -58 l  52 -34 69 -22 96 -22 ct 113 -22 126 -27 135 -37 ct 
145 -47 149 -61 149 -79 ct 149 -94 145 -106 135 -116 ct 126 -125 113 -130 97 -130 ct 
88 -130 80 -129 73 -126 ct 66 -123 59 -119 52 -113 ct 21 -113 l  29 -243 l  167 -243 l 
167 -217 l  58 -217 l  53 -140 l  66 -150 83 -155 103 -155 ct 127 -155 146 -148 160 -134 ct 
174 -120 182 -102 182 -80 ct p ef
pom
pum
19141 10905 t
27 0 m  27 -26 l  89 -26 l  89 -213 l  34 -174 l  34 -204 l  91 -243 l 
120 -243 l  120 -26 l  179 -26 l  179 0 l  27 0 l  p ef
368 -122 m  368 -81 360 -50 346 -29 ct 332 -8 311 3 283 3 ct 255 3 234 -8 220 -29 ct 
206 -50 199 -81 199 -122 ct 199 -164 206 -195 219 -216 ct 233 -237 254 -247 284 -247 ct 
312 -247 334 -236 347 -215 ct 361 -194 368 -163 368 -122 ct p
336 -122 m  336 -157 332 -182 324 -198 ct 316 -214 302 -222 284 -222 ct 265 -222 251 -214 243 -199 ct 
234 -183 230 -158 230 -122 ct 230 -88 234 -62 243 -46 ct 251 -30 265 -22 283 -22 ct 
301 -22 315 -31 323 -47 ct 332 -63 336 -88 336 -122 ct p ef
pom
pum
19141 8779 t
27 0 m  27 -26 l  89 -26 l  89 -213 l  34 -174 l  34 -204 l  91 -243 l 
120 -243 l  120 -26 l  179 -26 l  179 0 l  27 0 l  p ef
367 -80 m  367 -54 359 -34 344 -19 ct 328 -4 307 3 280 3 ct 258 3 239 -2 226 -12 ct 
212 -22 203 -36 199 -55 ct 231 -58 l  237 -34 254 -22 281 -22 ct 298 -22 311 -27 320 -37 ct 
330 -47 334 -61 334 -79 ct 334 -94 330 -106 320 -116 ct 311 -125 298 -130 282 -130 ct 
273 -130 265 -129 258 -126 ct 251 -123 244 -119 237 -113 ct 206 -113 l  214 -243 l 
352 -243 l  352 -217 l  243 -217 l  238 -140 l  251 -150 268 -155 288 -155 ct 
312 -155 331 -148 345 -134 ct 359 -120 367 -102 367 -80 ct p ef
pom
pum
19141 6653 t
18 0 m  18 -22 l  24 -35 31 -47 39 -58 ct 48 -68 57 -77 66 -85 ct 75 -94 84 -101 94 -109 ct 
103 -116 111 -123 118 -130 ct 126 -137 132 -145 136 -152 ct 141 -160 143 -169 143 -179 ct 
143 -192 139 -203 131 -210 ct 123 -217 113 -221 99 -221 ct 85 -221 74 -217 66 -210 ct 
57 -203 52 -193 51 -180 ct 19 -183 l  21 -202 30 -218 44 -229 ct 58 -241 76 -247 99 -247 ct 
123 -247 142 -241 155 -229 ct 168 -218 175 -201 175 -180 ct 175 -171 173 -161 168 -152 ct 
164 -143 158 -133 149 -124 ct 141 -115 124 -100 100 -81 ct 87 -70 77 -60 69 -51 ct 
61 -43 55 -34 52 -26 ct 179 -26 l  179 0 l  18 0 l  p ef
368 -122 m  368 -81 360 -50 346 -29 ct 332 -8 311 3 283 3 ct 255 3 234 -8 220 -29 ct 
206 -50 199 -81 199 -122 ct 199 -164 206 -195 219 -216 ct 233 -237 254 -247 284 -247 ct 
312 -247 334 -236 347 -215 ct 361 -194 368 -163 368 -122 ct p
336 -122 m  336 -157 332 -182 324 -198 ct 316 -214 302 -222 284 -222 ct 265 -222 251 -214 243 -199 ct 
234 -183 230 -158 230 -122 ct 230 -88 234 -62 243 -46 ct 251 -30 265 -22 283 -22 ct 
301 -22 315 -31 323 -47 ct 332 -63 336 -88 336 -122 ct p ef
pom
pum
19141 4527 t
18 0 m  18 -22 l  24 -35 31 -47 39 -58 ct 48 -68 57 -77 66 -85 ct 75 -94 84 -101 94 -109 ct 
103 -116 111 -123 118 -130 ct 126 -137 132 -145 136 -152 ct 141 -160 143 -169 143 -179 ct 
143 -192 139 -203 131 -210 ct 123 -217 113 -221 99 -221 ct 85 -221 74 -217 66 -210 ct 
57 -203 52 -193 51 -180 ct 19 -183 l  21 -202 30 -218 44 -229 ct 58 -241 76 -247 99 -247 ct 
123 -247 142 -241 155 -229 ct 168 -218 175 -201 175 -180 ct 175 -171 173 -161 168 -152 ct 
164 -143 158 -133 149 -124 ct 141 -115 124 -100 100 -81 ct 87 -70 77 -60 69 -51 ct 
61 -43 55 -34 52 -26 ct 179 -26 l  179 0 l  18 0 l  p ef
367 -80 m  367 -54 359 -34 344 -19 ct 328 -4 307 3 280 3 ct 258 3 239 -2 226 -12 ct 
212 -22 203 -36 199 -55 ct 231 -58 l  237 -34 254 -22 281 -22 ct 298 -22 311 -27 320 -37 ct 
330 -47 334 -61 334 -79 ct 334 -94 330 -106 320 -116 ct 311 -125 298 -130 282 -130 ct 
273 -130 265 -129 258 -126 ct 251 -123 244 -119 237 -113 ct 206 -113 l  214 -243 l 
352 -243 l  352 -217 l  243 -217 l  238 -140 l  251 -150 268 -155 288 -155 ct 
312 -155 331 -148 345 -134 ct 359 -120 367 -102 367 -80 ct p ef
pom
gs
52.99744 lw 1 lj 0.261 0.523 0.957 c 32092 9888 m  32892 9888 l  ps
gr
gs
52.99744 lw 1 lj 0.917 0.265 0.210 c 32092 10386 m  32892 10386 l  ps
gr
gs
79.99614 lw 1 lj 1.000 0.828 0.128 c 32092 10883 m  32892 10883 l  ps
gr
pum
32992 10008 t
0.105 0.105 0.105 c 18 0 m  18 -22 l  24 -35 31 -47 39 -58 ct 48 -68 57 -77 66 -85 ct 
75 -94 84 -101 94 -109 ct 103 -116 111 -123 118 -130 ct 126 -137 132 -145 136 -152 ct 
141 -160 143 -169 143 -179 ct 143 -192 139 -203 131 -210 ct 123 -217 113 -221 99 -221 ct 
85 -221 74 -217 66 -210 ct 57 -203 52 -193 51 -180 ct 19 -183 l  21 -202 30 -218 44 -229 ct 
58 -241 76 -247 99 -247 ct 123 -247 142 -241 155 -229 ct 168 -218 175 -201 175 -180 ct 
175 -171 173 -161 168 -152 ct 164 -143 158 -133 149 -124 ct 141 -115 124 -100 100 -81 ct 
87 -70 77 -60 69 -51 ct 61 -43 55 -34 52 -26 ct 179 -26 l  179 0 l  18 0 l  p ef
429 0 m  379 -77 l  328 0 l  295 0 l  361 -96 l  298 -187 l  332 -187 l 
379 -114 l  425 -187 l  460 -187 l  396 -96 l  464 0 l  429 0 l  p ef
600 -123 m  600 -162 610 -193 631 -215 ct 653 -236 682 -247 721 -247 ct 747 -247 769 -242 786 -233 ct 
803 -224 816 -210 825 -190 ct 793 -180 l  787 -194 777 -204 765 -211 ct 753 -217 738 -220 720 -220 ct 
692 -220 670 -212 655 -195 ct 641 -178 633 -154 633 -123 ct 633 -92 641 -68 657 -50 ct 
673 -33 694 -24 722 -24 ct 738 -24 753 -26 767 -31 ct 780 -36 791 -42 800 -51 ct 
800 -94 l  727 -94 l  727 -122 l  830 -122 l  830 -38 l  817 -25 802 -15 783 -8 ct 
764 -1 744 3 722 3 ct 697 3 675 -2 656 -12 ct 638 -22 624 -37 614 -56 ct 605 -75 600 -97 600 -123 ct 
p ef
1064 -170 m  1064 -147 1056 -129 1041 -115 ct 1026 -102 1006 -95 980 -95 ct 
909 -95 l  909 -1 l  876 -1 l  876 -243 l  978 -243 l  1005 -243 1026 -237 1041 -224 ct 
1056 -211 1064 -193 1064 -170 ct p
1031 -170 m  1031 -201 1012 -217 974 -217 ct 909 -217 l  909 -121 l  976 -121 l 
1012 -121 1031 -137 1031 -170 ct p ef
1211 3 m  1191 3 1174 -1 1159 -8 ct 1144 -15 1133 -26 1124 -39 ct 1116 -53 1112 -70 1112 -89 ct 
1112 -244 l  1145 -244 l  1145 -92 l  1145 -69 1151 -52 1162 -41 ct 1173 -29 1190 -24 1211 -24 ct 
1233 -24 1250 -30 1262 -42 ct 1274 -53 1280 -71 1280 -94 ct 1280 -244 l  1313 -244 l 
1313 -92 l  1313 -72 1309 -55 1300 -41 ct 1292 -27 1280 -16 1265 -8 ct 1250 -1 1232 3 1211 3 ct 
p ef
1487 -52 m  1487 -34 1480 -21 1467 -11 ct 1454 -2 1435 3 1411 3 ct 1388 3 1370 -1 1357 -8 ct 
1345 -16 1337 -28 1333 -44 ct 1360 -50 l  1363 -40 1368 -32 1377 -28 ct 1385 -23 1396 -21 1411 -21 ct 
1427 -21 1438 -23 1446 -28 ct 1453 -33 1457 -40 1457 -50 ct 1457 -57 1454 -63 1449 -68 ct 
1444 -72 1436 -76 1425 -79 ct 1402 -85 l  1384 -89 1372 -94 1364 -98 ct 1357 -103 1351 -108 1347 -114 ct 
1342 -121 1340 -129 1340 -138 ct 1340 -155 1346 -168 1358 -177 ct 1371 -186 1388 -190 1411 -190 ct 
1432 -190 1448 -186 1460 -179 ct 1473 -172 1480 -160 1483 -144 ct 1456 -141 l 
1454 -149 1449 -156 1442 -160 ct 1434 -164 1424 -167 1411 -167 ct 1397 -167 1387 -164 1380 -160 ct 
1374 -156 1370 -149 1370 -141 ct 1370 -136 1372 -131 1375 -128 ct 1377 -124 1381 -121 1387 -119 ct 
1392 -117 1404 -113 1421 -109 ct 1437 -105 1449 -101 1456 -97 ct 1464 -94 1469 -90 1474 -86 ct 
1478 -82 1481 -77 1483 -71 ct 1486 -66 1487 -59 1487 -52 ct p ef
1636 -92 m  1636 -125 1641 -155 1651 -181 ct 1662 -208 1678 -233 1700 -256 ct 
1729 -256 l  1708 -232 1692 -207 1682 -180 ct 1672 -153 1667 -123 1667 -91 ct 
1667 -60 1672 -30 1682 -4 ct 1692 23 1708 49 1729 73 ct 1700 73 l  1678 50 1662 25 1651 -2 ct 
1641 -28 1636 -58 1636 -91 ct 1636 -92 l  p ef
1862 0 m  1862 -118 l  1862 -131 1861 -140 1859 -147 ct 1856 -154 1852 -159 1847 -162 ct 
1842 -165 1834 -166 1824 -166 ct 1809 -166 1797 -161 1788 -151 ct 1780 -140 1776 -126 1776 -108 ct 
1776 0 l  1744 0 l  1744 -147 l  1744 -168 1744 -182 1743 -187 ct 1773 -187 l 
1773 -186 1773 -184 1773 -182 ct 1773 -179 1773 -176 1774 -173 ct 1774 -170 1774 -164 1774 -155 ct 
1775 -155 l  1782 -168 1790 -177 1799 -182 ct 1809 -187 1820 -190 1834 -190 ct 
1855 -190 1870 -185 1879 -175 ct 1889 -165 1893 -148 1893 -124 ct 1893 0 l  1862 0 l 
p ef
2087 -94 m  2087 -61 2079 -37 2065 -21 ct 2051 -5 2030 3 2002 3 ct 1975 3 1955 -5 1941 -22 ct 
1927 -38 1920 -62 1920 -94 ct 1920 -158 1948 -190 2003 -190 ct 2032 -190 2053 -182 2066 -167 ct 
2080 -151 2087 -127 2087 -94 ct p
2054 -94 m  2054 -119 2050 -138 2042 -150 ct 2035 -161 2022 -167 2004 -167 ct 
1986 -167 1973 -161 1965 -149 ct 1956 -137 1952 -119 1952 -94 ct 1952 -69 1956 -51 1964 -38 ct 
1972 -26 1985 -20 2002 -20 ct 2021 -20 2034 -26 2042 -38 ct 2050 -50 2054 -68 2054 -94 ct 
p ef
2250 -187 m  2250 -69 l  2250 -56 2251 -47 2254 -40 ct 2256 -33 2260 -28 2265 -25 ct 
2271 -22 2278 -21 2289 -21 ct 2304 -21 2315 -26 2324 -36 ct 2333 -47 2337 -61 2337 -79 ct 
2337 -187 l  2368 -187 l  2368 -40 l  2368 -19 2368 -5 2369 0 ct 2340 0 l 
2339 -1 2339 -3 2339 -5 ct 2339 -8 2339 -11 2339 -14 ct 2339 -17 2338 -23 2338 -32 ct 
2338 -32 l  2331 -19 2322 -10 2313 -5 ct 2304 0 2292 3 2278 3 ct 2258 3 2243 -2 2233 -12 ct 
2224 -22 2219 -39 2219 -63 ct 2219 -187 l  2250 -187 l  p ef
2523 0 m  2523 -118 l  2523 -131 2522 -140 2520 -147 ct 2517 -154 2513 -159 2508 -162 ct 
2503 -165 2495 -166 2485 -166 ct 2470 -166 2458 -161 2449 -151 ct 2441 -140 2437 -126 2437 -108 ct 
2437 0 l  2405 0 l  2405 -147 l  2405 -168 2405 -182 2404 -187 ct 2434 -187 l 
2434 -186 2434 -184 2434 -182 ct 2434 -179 2434 -176 2435 -173 ct 2435 -170 2435 -164 2435 -155 ct 
2436 -155 l  2443 -168 2451 -177 2460 -182 ct 2470 -187 2481 -190 2495 -190 ct 
2516 -190 2531 -185 2540 -175 ct 2550 -165 2554 -148 2554 -124 ct 2554 0 l  2523 0 l 
p ef
2590 -226 m  2590 -256 l  2621 -256 l  2621 -226 l  2590 -226 l  p
2590 0 m  2590 -187 l  2621 -187 l  2621 0 l  2590 0 l  p ef
2708 -164 m  2708 -1 l  2677 -1 l  2677 -164 l  2651 -164 l  2651 -187 l 
2677 -187 l  2677 -208 l  2677 -225 2681 -237 2688 -245 ct 2696 -252 2707 -256 2723 -256 ct 
2731 -256 2739 -255 2745 -254 ct 2745 -230 l  2739 -231 2735 -232 2731 -232 ct 
2723 -232 2717 -230 2714 -226 ct 2710 -222 2708 -214 2708 -204 ct 2708 -187 l 
2745 -187 l  2745 -164 l  2708 -164 l  p ef
2776 -226 m  2776 -256 l  2807 -256 l  2807 -226 l  2776 -226 l  p
2776 0 m  2776 -187 l  2807 -187 l  2807 0 l  2776 0 l  p ef
2879 -87 m  2879 -66 2883 -49 2892 -38 ct 2901 -26 2914 -20 2931 -20 ct 2944 -20 2955 -23 2963 -28 ct 
2971 -34 2977 -41 2979 -49 ct 3007 -41 l  2996 -12 2970 3 2931 3 ct 2903 3 2882 -5 2868 -22 ct 
2853 -38 2846 -62 2846 -95 ct 2846 -125 2853 -149 2868 -165 ct 2882 -182 2903 -190 2929 -190 ct 
2984 -190 3012 -157 3012 -91 ct 3012 -87 l  2879 -87 l  p
2980 -111 m  2978 -130 2973 -145 2965 -154 ct 2956 -163 2944 -167 2929 -167 ct 
2914 -167 2902 -162 2893 -152 ct 2884 -142 2880 -128 2879 -111 ct 2980 -111 l 
p ef
3158 -30 m  3152 -18 3144 -10 3135 -5 ct 3125 0 3113 3 3099 3 ct 3076 3 3059 -5 3047 -21 ct 
3036 -37 3031 -61 3031 -93 ct 3031 -158 3054 -190 3099 -190 ct 3114 -190 3125 -187 3135 -182 ct 
3144 -177 3152 -169 3158 -158 ct 3158 -158 l  3158 -179 l  3158 -256 l  3189 -256 l 
3189 -39 l  3189 -19 3189 -7 3190 0 ct 3160 0 l  3160 -2 3159 -7 3159 -13 ct 
3158 -20 3158 -26 3158 -30 ct 3158 -30 l  p
3063 -94 m  3063 -68 3067 -49 3074 -38 ct 3081 -27 3092 -21 3107 -21 ct 3125 -21 3138 -27 3146 -39 ct 
3154 -51 3158 -70 3158 -96 ct 3158 -120 3154 -138 3146 -150 ct 3138 -161 3125 -167 3108 -167 ct 
3092 -167 3081 -161 3074 -150 ct 3067 -138 3063 -120 3063 -94 ct p ef
3439 0 m  3439 -118 l  3439 -136 3437 -149 3432 -156 ct 3427 -163 3418 -166 3405 -166 ct 
3392 -166 3382 -161 3374 -151 ct 3366 -141 3362 -127 3362 -108 ct 3362 0 l  3331 0 l 
3331 -147 l  3331 -168 3331 -182 3330 -187 ct 3360 -187 l  3360 -186 3360 -184 3360 -182 ct 
3360 -179 3360 -176 3361 -173 ct 3361 -170 3361 -164 3361 -155 ct 3362 -155 l 
3368 -168 3376 -177 3385 -182 ct 3393 -187 3404 -190 3416 -190 ct 3430 -190 3441 -187 3450 -182 ct 
3458 -176 3464 -167 3467 -155 ct 3467 -155 l  3474 -167 3482 -176 3491 -182 ct 
3500 -187 3511 -190 3524 -190 ct 3543 -190 3556 -185 3565 -175 ct 3574 -164 3578 -148 3578 -124 ct 
3578 0 l  3547 0 l  3547 -118 l  3547 -136 3545 -149 3540 -156 ct 3535 -163 3526 -166 3513 -166 ct 
3499 -166 3489 -161 3481 -151 ct 3474 -141 3470 -127 3470 -108 ct 3470 0 l  3439 0 l 
p ef
3646 -87 m  3646 -66 3650 -49 3659 -38 ct 3668 -26 3681 -20 3698 -20 ct 3711 -20 3722 -23 3730 -28 ct 
3738 -34 3744 -41 3746 -49 ct 3774 -41 l  3763 -12 3737 3 3698 3 ct 3670 3 3649 -5 3635 -22 ct 
3620 -38 3613 -62 3613 -95 ct 3613 -125 3620 -149 3635 -165 ct 3649 -182 3670 -190 3696 -190 ct 
3751 -190 3779 -157 3779 -91 ct 3779 -87 l  3646 -87 l  p
3747 -111 m  3745 -130 3740 -145 3732 -154 ct 3723 -163 3711 -167 3696 -167 ct 
3681 -167 3669 -162 3660 -152 ct 3651 -142 3647 -128 3646 -111 ct 3747 -111 l 
p ef
3916 0 m  3916 -118 l  3916 -136 3914 -149 3909 -156 ct 3904 -163 3895 -166 3882 -166 ct 
3869 -166 3859 -161 3851 -151 ct 3843 -141 3839 -127 3839 -108 ct 3839 0 l  3808 0 l 
3808 -147 l  3808 -168 3808 -182 3807 -187 ct 3837 -187 l  3837 -186 3837 -184 3837 -182 ct 
3837 -179 3837 -176 3838 -173 ct 3838 -170 3838 -164 3838 -155 ct 3839 -155 l 
3845 -168 3853 -177 3862 -182 ct 3870 -187 3881 -190 3893 -190 ct 3907 -190 3918 -187 3927 -182 ct 
3935 -176 3941 -167 3944 -155 ct 3944 -155 l  3951 -167 3959 -176 3968 -182 ct 
3977 -187 3988 -190 4001 -190 ct 4020 -190 4033 -185 4042 -175 ct 4051 -164 4055 -148 4055 -124 ct 
4055 0 l  4024 0 l  4024 -118 l  4024 -136 4022 -149 4017 -156 ct 4012 -163 4003 -166 3990 -166 ct 
3976 -166 3966 -161 3958 -151 ct 3951 -141 3947 -127 3947 -108 ct 3947 0 l  3916 0 l 
p ef
4257 -94 m  4257 -61 4249 -37 4235 -21 ct 4221 -5 4200 3 4172 3 ct 4145 3 4125 -5 4111 -22 ct 
4097 -38 4090 -62 4090 -94 ct 4090 -158 4118 -190 4173 -190 ct 4202 -190 4223 -182 4236 -167 ct 
4250 -151 4257 -127 4257 -94 ct p
4224 -94 m  4224 -119 4220 -138 4212 -150 ct 4205 -161 4192 -167 4174 -167 ct 
4156 -167 4143 -161 4135 -149 ct 4126 -137 4122 -119 4122 -94 ct 4122 -69 4126 -51 4134 -38 ct 
4142 -26 4155 -20 4172 -20 ct 4191 -20 4204 -26 4212 -38 ct 4220 -50 4224 -68 4224 -94 ct 
p ef
4284 0 m  4284 -143 l  4284 -156 4284 -171 4283 -187 ct 4313 -187 l  4314 -165 4314 -153 4314 -148 ct 
4315 -148 l  4320 -164 4325 -175 4332 -181 ct 4338 -187 4347 -190 4359 -190 ct 
4363 -190 4367 -189 4372 -188 ct 4372 -160 l  4368 -161 4362 -162 4355 -162 ct 
4342 -162 4332 -156 4326 -145 ct 4319 -134 4316 -118 4316 -97 ct 4316 0 l  4284 0 l 
p ef
4399 73 m  4390 73 4383 72 4378 71 ct 4378 48 l  4382 49 4387 49 4392 49 ct 
4411 49 4427 35 4438 6 ct 4441 -1 l  4367 -187 l  4400 -187 l  4439 -84 l 
4440 -82 4441 -80 4441 -78 ct 4442 -76 4445 -68 4449 -56 ct 4453 -43 4456 -36 4456 -34 ct 
4468 -68 l  4509 -187 l  4542 -187 l  4470 0 l  4462 20 4455 34 4449 44 ct 
4442 54 4435 61 4426 66 ct 4418 71 4409 73 4399 73 ct p ef
4647 -91 m  4647 -58 4641 -28 4631 -2 ct 4621 25 4605 50 4583 73 ct 4553 73 l 
4575 49 4590 23 4600 -3 ct 4610 -30 4615 -59 4615 -91 ct 4615 -124 4610 -153 4600 -180 ct 
4590 -207 4575 -232 4553 -256 ct 4583 -256 l  4605 -233 4621 -208 4631 -181 ct 
4641 -155 4647 -125 4647 -92 ct 4647 -91 l  p ef
pom
pum
32992 10505 t
18 0 m  18 -22 l  24 -35 31 -47 39 -58 ct 48 -68 57 -77 66 -85 ct 75 -94 84 -101 94 -109 ct 
103 -116 111 -123 118 -130 ct 126 -137 132 -145 136 -152 ct 141 -160 143 -169 143 -179 ct 
143 -192 139 -203 131 -210 ct 123 -217 113 -221 99 -221 ct 85 -221 74 -217 66 -210 ct 
57 -203 52 -193 51 -180 ct 19 -183 l  21 -202 30 -218 44 -229 ct 58 -241 76 -247 99 -247 ct 
123 -247 142 -241 155 -229 ct 168 -218 175 -201 175 -180 ct 175 -171 173 -161 168 -152 ct 
164 -143 158 -133 149 -124 ct 141 -115 124 -100 100 -81 ct 87 -70 77 -60 69 -51 ct 
61 -43 55 -34 52 -26 ct 179 -26 l  179 0 l  18 0 l  p ef
429 0 m  379 -77 l  328 0 l  295 0 l  361 -96 l  298 -187 l  332 -187 l 
379 -114 l  425 -187 l  460 -187 l  396 -96 l  464 0 l  429 0 l  p ef
600 -123 m  600 -162 610 -193 631 -215 ct 653 -236 682 -247 721 -247 ct 747 -247 769 -242 786 -233 ct 
803 -224 816 -210 825 -190 ct 793 -180 l  787 -194 777 -204 765 -211 ct 753 -217 738 -220 720 -220 ct 
692 -220 670 -212 655 -195 ct 641 -178 633 -154 633 -123 ct 633 -92 641 -68 657 -50 ct 
673 -33 694 -24 722 -24 ct 738 -24 753 -26 767 -31 ct 780 -36 791 -42 800 -51 ct 
800 -94 l  727 -94 l  727 -122 l  830 -122 l  830 -38 l  817 -25 802 -15 783 -8 ct 
764 -1 744 3 722 3 ct 697 3 675 -2 656 -12 ct 638 -22 624 -37 614 -56 ct 605 -75 600 -97 600 -123 ct 
p ef
1064 -170 m  1064 -147 1056 -129 1041 -115 ct 1026 -102 1006 -95 980 -95 ct 
909 -95 l  909 -1 l  876 -1 l  876 -243 l  978 -243 l  1005 -243 1026 -237 1041 -224 ct 
1056 -211 1064 -193 1064 -170 ct p
1031 -170 m  1031 -201 1012 -217 974 -217 ct 909 -217 l  909 -121 l  976 -121 l 
1012 -121 1031 -137 1031 -170 ct p ef
1211 3 m  1191 3 1174 -1 1159 -8 ct 1144 -15 1133 -26 1124 -39 ct 1116 -53 1112 -70 1112 -89 ct 
1112 -244 l  1145 -244 l  1145 -92 l  1145 -69 1151 -52 1162 -41 ct 1173 -29 1190 -24 1211 -24 ct 
1233 -24 1250 -30 1262 -42 ct 1274 -53 1280 -71 1280 -94 ct 1280 -244 l  1313 -244 l 
1313 -92 l  1313 -72 1309 -55 1300 -41 ct 1292 -27 1280 -16 1265 -8 ct 1250 -1 1232 3 1211 3 ct 
p ef
1542 -68 m  1542 -45 1533 -28 1516 -15 ct 1498 -3 1474 3 1442 3 ct 1383 3 1348 -18 1339 -59 ct 
1371 -65 l  1375 -51 1382 -40 1394 -33 ct 1406 -26 1423 -23 1443 -23 ct 1464 -23 1481 -26 1492 -34 ct 
1504 -41 1510 -52 1510 -66 ct 1510 -74 1508 -80 1504 -85 ct 1501 -90 1496 -94 1489 -97 ct 
1482 -101 1475 -103 1466 -105 ct 1456 -108 1446 -110 1435 -113 ct 1416 -117 1402 -121 1392 -125 ct 
1382 -130 1374 -134 1368 -140 ct 1362 -145 1358 -151 1355 -158 ct 1352 -165 1350 -173 1350 -182 ct 
1350 -203 1358 -219 1374 -230 ct 1390 -241 1413 -247 1443 -247 ct 1470 -247 1491 -243 1506 -234 ct 
1520 -226 1531 -211 1537 -191 ct 1504 -185 l  1501 -198 1494 -208 1484 -213 ct 
1474 -219 1460 -222 1442 -222 ct 1423 -222 1408 -219 1398 -213 ct 1388 -206 1382 -196 1382 -184 ct 
1382 -176 1384 -170 1388 -165 ct 1392 -160 1398 -156 1406 -153 ct 1413 -149 1428 -145 1450 -140 ct 
1458 -139 1465 -137 1473 -135 ct 1480 -133 1487 -131 1494 -129 ct 1501 -126 1507 -123 1513 -120 ct 
1519 -117 1524 -113 1528 -108 ct 1533 -103 1536 -97 1539 -91 ct 1541 -84 1542 -76 1542 -68 ct 
p ef
1689 -92 m  1689 -125 1694 -155 1704 -181 ct 1715 -208 1731 -233 1753 -256 ct 
1782 -256 l  1761 -232 1745 -207 1735 -180 ct 1725 -153 1720 -123 1720 -91 ct 
1720 -60 1725 -30 1735 -4 ct 1745 23 1761 49 1782 73 ct 1753 73 l  1731 50 1715 25 1704 -2 ct 
1694 -28 1689 -58 1689 -91 ct 1689 -92 l  p ef
1975 0 m  1939 0 l  1907 -132 l  1901 -161 l  1900 -156 1898 -148 1896 -139 ct 
1894 -129 1882 -83 1861 0 ct 1825 0 l  1772 -187 l  1803 -187 l  1835 -60 l 
1836 -57 1838 -46 1842 -26 ct 1845 -38 l  1884 -187 l  1917 -187 l  1950 -58 l 
1958 -26 l  1963 -50 l  1998 -187 l  2029 -187 l  1975 0 l  p ef
2035 -226 m  2035 -256 l  2066 -256 l  2066 -226 l  2035 -226 l  p
2035 0 m  2035 -187 l  2066 -187 l  2066 0 l  2035 0 l  p ef
2185 -1 m  2175 2 2165 3 2154 3 ct 2129 3 2117 -11 2117 -39 ct 2117 -164 l  2095 -164 l 
2095 -187 l  2118 -187 l  2127 -228 l  2148 -228 l  2148 -187 l  2182 -187 l 
2182 -164 l  2148 -164 l  2148 -46 l  2148 -37 2149 -31 2152 -27 ct 2155 -23 2160 -22 2168 -22 ct 
2172 -22 2178 -22 2185 -24 ct 2185 -1 l  p ef
2251 -155 m  2257 -167 2265 -176 2275 -181 ct 2284 -187 2296 -190 2310 -190 ct 
2331 -190 2345 -185 2355 -175 ct 2365 -165 2369 -148 2369 -124 ct 2369 0 l  2338 0 l 
2338 -118 l  2338 -131 2337 -141 2335 -148 ct 2332 -154 2328 -159 2323 -162 ct 
2317 -165 2310 -166 2300 -166 ct 2285 -166 2273 -161 2265 -151 ct 2256 -141 2252 -127 2252 -110 ct 
2252 0 l  2220 0 l  2220 -256 l  2252 -256 l  2252 -189 l  2252 -182 2251 -175 2251 -168 ct 
2251 -160 2250 -156 2250 -155 ct 2251 -155 l  p ef
2541 -187 m  2541 -69 l  2541 -56 2542 -47 2545 -40 ct 2547 -33 2551 -28 2556 -25 ct 
2562 -22 2569 -21 2580 -21 ct 2595 -21 2606 -26 2615 -36 ct 2624 -47 2628 -61 2628 -79 ct 
2628 -187 l  2659 -187 l  2659 -40 l  2659 -19 2659 -5 2660 0 ct 2631 0 l 
2630 -1 2630 -3 2630 -5 ct 2630 -8 2630 -11 2630 -14 ct 2630 -17 2629 -23 2629 -32 ct 
2629 -32 l  2622 -19 2613 -10 2604 -5 ct 2595 0 2583 3 2569 3 ct 2549 3 2534 -2 2524 -12 ct 
2515 -22 2510 -39 2510 -63 ct 2510 -187 l  2541 -187 l  p ef
2814 0 m  2814 -118 l  2814 -131 2813 -140 2811 -147 ct 2808 -154 2804 -159 2799 -162 ct 
2794 -165 2786 -166 2776 -166 ct 2761 -166 2749 -161 2740 -151 ct 2732 -140 2728 -126 2728 -108 ct 
2728 0 l  2696 0 l  2696 -147 l  2696 -168 2696 -182 2695 -187 ct 2725 -187 l 
2725 -186 2725 -184 2725 -182 ct 2725 -179 2725 -176 2726 -173 ct 2726 -170 2726 -164 2726 -155 ct 
2727 -155 l  2734 -168 2742 -177 2751 -182 ct 2761 -187 2772 -190 2786 -190 ct 
2807 -190 2822 -185 2831 -175 ct 2841 -165 2845 -148 2845 -124 ct 2845 0 l  2814 0 l 
p ef
2882 -226 m  2882 -256 l  2913 -256 l  2913 -226 l  2882 -226 l  p
2882 0 m  2882 -187 l  2913 -187 l  2913 0 l  2882 0 l  p ef
2999 -164 m  2999 -1 l  2968 -1 l  2968 -164 l  2942 -164 l  2942 -187 l 
2968 -187 l  2968 -208 l  2968 -225 2972 -237 2979 -245 ct 2987 -252 2998 -256 3014 -256 ct 
3022 -256 3030 -255 3036 -254 ct 3036 -230 l  3030 -231 3026 -232 3022 -232 ct 
3014 -232 3008 -230 3005 -226 ct 3001 -222 2999 -214 2999 -204 ct 2999 -187 l 
3036 -187 l  3036 -164 l  2999 -164 l  p ef
3067 -226 m  3067 -256 l  3098 -256 l  3098 -226 l  3067 -226 l  p
3067 0 m  3067 -187 l  3098 -187 l  3098 0 l  3067 0 l  p ef
3170 -87 m  3170 -66 3174 -49 3183 -38 ct 3192 -26 3205 -20 3222 -20 ct 3235 -20 3246 -23 3254 -28 ct 
3262 -34 3268 -41 3270 -49 ct 3298 -41 l  3287 -12 3261 3 3222 3 ct 3194 3 3173 -5 3159 -22 ct 
3144 -38 3137 -62 3137 -95 ct 3137 -125 3144 -149 3159 -165 ct 3173 -182 3194 -190 3220 -190 ct 
3275 -190 3303 -157 3303 -91 ct 3303 -87 l  3170 -87 l  p
3271 -111 m  3269 -130 3264 -145 3256 -154 ct 3247 -163 3235 -167 3220 -167 ct 
3205 -167 3193 -162 3184 -152 ct 3175 -142 3171 -128 3170 -111 ct 3271 -111 l 
p ef
3449 -30 m  3443 -18 3435 -10 3426 -5 ct 3416 0 3404 3 3390 3 ct 3367 3 3350 -5 3338 -21 ct 
3327 -37 3322 -61 3322 -93 ct 3322 -158 3345 -190 3390 -190 ct 3405 -190 3416 -187 3426 -182 ct 
3435 -177 3443 -169 3449 -158 ct 3449 -158 l  3449 -179 l  3449 -256 l  3480 -256 l 
3480 -39 l  3480 -19 3480 -7 3481 0 ct 3451 0 l  3451 -2 3450 -7 3450 -13 ct 
3449 -20 3449 -26 3449 -30 ct 3449 -30 l  p
3354 -94 m  3354 -68 3358 -49 3365 -38 ct 3372 -27 3383 -21 3398 -21 ct 3416 -21 3429 -27 3437 -39 ct 
3445 -51 3449 -70 3449 -96 ct 3449 -120 3445 -138 3437 -150 ct 3429 -161 3416 -167 3399 -167 ct 
3383 -167 3372 -161 3365 -150 ct 3358 -138 3354 -120 3354 -94 ct p ef
3730 0 m  3730 -118 l  3730 -136 3728 -149 3723 -156 ct 3718 -163 3709 -166 3696 -166 ct 
3683 -166 3673 -161 3665 -151 ct 3657 -141 3653 -127 3653 -108 ct 3653 0 l  3622 0 l 
3622 -147 l  3622 -168 3622 -182 3621 -187 ct 3651 -187 l  3651 -186 3651 -184 3651 -182 ct 
3651 -179 3651 -176 3652 -173 ct 3652 -170 3652 -164 3652 -155 ct 3653 -155 l 
3659 -168 3667 -177 3676 -182 ct 3684 -187 3695 -190 3707 -190 ct 3721 -190 3732 -187 3741 -182 ct 
3749 -176 3755 -167 3758 -155 ct 3758 -155 l  3765 -167 3773 -176 3782 -182 ct 
3791 -187 3802 -190 3815 -190 ct 3834 -190 3847 -185 3856 -175 ct 3865 -164 3869 -148 3869 -124 ct 
3869 0 l  3838 0 l  3838 -118 l  3838 -136 3836 -149 3831 -156 ct 3826 -163 3817 -166 3804 -166 ct 
3790 -166 3780 -161 3772 -151 ct 3765 -141 3761 -127 3761 -108 ct 3761 0 l  3730 0 l 
p ef
3937 -87 m  3937 -66 3941 -49 3950 -38 ct 3959 -26 3972 -20 3989 -20 ct 4002 -20 4013 -23 4021 -28 ct 
4029 -34 4035 -41 4037 -49 ct 4065 -41 l  4054 -12 4028 3 3989 3 ct 3961 3 3940 -5 3926 -22 ct 
3911 -38 3904 -62 3904 -95 ct 3904 -125 3911 -149 3926 -165 ct 3940 -182 3961 -190 3987 -190 ct 
4042 -190 4070 -157 4070 -91 ct 4070 -87 l  3937 -87 l  p
4038 -111 m  4036 -130 4031 -145 4023 -154 ct 4014 -163 4002 -167 3987 -167 ct 
3972 -167 3960 -162 3951 -152 ct 3942 -142 3938 -128 3937 -111 ct 4038 -111 l 
p ef
4207 0 m  4207 -118 l  4207 -136 4205 -149 4200 -156 ct 4195 -163 4186 -166 4173 -166 ct 
4160 -166 4150 -161 4142 -151 ct 4134 -141 4130 -127 4130 -108 ct 4130 0 l  4099 0 l 
4099 -147 l  4099 -168 4099 -182 4098 -187 ct 4128 -187 l  4128 -186 4128 -184 4128 -182 ct 
4128 -179 4128 -176 4129 -173 ct 4129 -170 4129 -164 4129 -155 ct 4130 -155 l 
4136 -168 4144 -177 4153 -182 ct 4161 -187 4172 -190 4184 -190 ct 4198 -190 4209 -187 4218 -182 ct 
4226 -176 4232 -167 4235 -155 ct 4235 -155 l  4242 -167 4250 -176 4259 -182 ct 
4268 -187 4279 -190 4292 -190 ct 4311 -190 4324 -185 4333 -175 ct 4342 -164 4346 -148 4346 -124 ct 
4346 0 l  4315 0 l  4315 -118 l  4315 -136 4313 -149 4308 -156 ct 4303 -163 4294 -166 4281 -166 ct 
4267 -166 4257 -161 4249 -151 ct 4242 -141 4238 -127 4238 -108 ct 4238 0 l  4207 0 l 
p ef
4548 -94 m  4548 -61 4540 -37 4526 -21 ct 4512 -5 4491 3 4463 3 ct 4436 3 4416 -5 4402 -22 ct 
4388 -38 4381 -62 4381 -94 ct 4381 -158 4409 -190 4464 -190 ct 4493 -190 4514 -182 4527 -167 ct 
4541 -151 4548 -127 4548 -94 ct p
4515 -94 m  4515 -119 4511 -138 4503 -150 ct 4496 -161 4483 -167 4465 -167 ct 
4447 -167 4434 -161 4426 -149 ct 4417 -137 4413 -119 4413 -94 ct 4413 -69 4417 -51 4425 -38 ct 
4433 -26 4446 -20 4463 -20 ct 4482 -20 4495 -26 4503 -38 ct 4511 -50 4515 -68 4515 -94 ct 
p ef
4575 0 m  4575 -143 l  4575 -156 4575 -171 4574 -187 ct 4604 -187 l  4605 -165 4605 -153 4605 -148 ct 
4606 -148 l  4611 -164 4616 -175 4623 -181 ct 4629 -187 4638 -190 4650 -190 ct 
4654 -190 4658 -189 4663 -188 ct 4663 -160 l  4659 -161 4653 -162 4646 -162 ct 
4633 -162 4623 -156 4617 -145 ct 4610 -134 4607 -118 4607 -97 ct 4607 0 l  4575 0 l 
p ef
4690 73 m  4681 73 4674 72 4669 71 ct 4669 48 l  4673 49 4678 49 4683 49 ct 
4702 49 4718 35 4729 6 ct 4732 -1 l  4658 -187 l  4691 -187 l  4730 -84 l 
4731 -82 4732 -80 4732 -78 ct 4733 -76 4736 -68 4740 -56 ct 4744 -43 4747 -36 4747 -34 ct 
4759 -68 l  4800 -187 l  4833 -187 l  4761 0 l  4753 20 4746 34 4740 44 ct 
4733 54 4726 61 4717 66 ct 4709 71 4700 73 4690 73 ct p ef
4938 -91 m  4938 -58 4932 -28 4922 -2 ct 4912 25 4896 50 4874 73 ct 4844 73 l 
4866 49 4881 23 4891 -3 ct 4901 -30 4906 -59 4906 -91 ct 4906 -124 4901 -153 4891 -180 ct 
4881 -207 4866 -232 4844 -256 ct 4874 -256 l  4896 -233 4912 -208 4922 -181 ct 
4932 -155 4938 -125 4938 -92 ct 4938 -91 l  p ef
pom
pum
32992 11003 t
27 0 m  27 -26 l  89 -26 l  89 -213 l  34 -174 l  34 -204 l  91 -243 l 
120 -243 l  120 -26 l  179 -26 l  179 0 l  27 0 l  p ef
429 0 m  379 -77 l  328 0 l  295 0 l  361 -96 l  298 -187 l  332 -187 l 
379 -114 l  425 -187 l  460 -187 l  396 -96 l  464 0 l  429 0 l  p ef
600 -123 m  600 -162 610 -193 631 -215 ct 653 -236 682 -247 721 -247 ct 747 -247 769 -242 786 -233 ct 
803 -224 816 -210 825 -190 ct 793 -180 l  787 -194 777 -204 765 -211 ct 753 -217 738 -220 720 -220 ct 
692 -220 670 -212 655 -195 ct 641 -178 633 -154 633 -123 ct 633 -92 641 -68 657 -50 ct 
673 -33 694 -24 722 -24 ct 738 -24 753 -26 767 -31 ct 780 -36 791 -42 800 -51 ct 
800 -94 l  727 -94 l  727 -122 l  830 -122 l  830 -38 l  817 -25 802 -15 783 -8 ct 
764 -1 744 3 722 3 ct 697 3 675 -2 656 -12 ct 638 -22 624 -37 614 -56 ct 605 -75 600 -97 600 -123 ct 
p ef
1064 -170 m  1064 -147 1056 -129 1041 -115 ct 1026 -102 1006 -95 980 -95 ct 
909 -95 l  909 -1 l  876 -1 l  876 -243 l  978 -243 l  1005 -243 1026 -237 1041 -224 ct 
1056 -211 1064 -193 1064 -170 ct p
1031 -170 m  1031 -201 1012 -217 974 -217 ct 909 -217 l  909 -121 l  976 -121 l 
1012 -121 1031 -137 1031 -170 ct p ef
1211 3 m  1191 3 1174 -1 1159 -8 ct 1144 -15 1133 -26 1124 -39 ct 1116 -53 1112 -70 1112 -89 ct 
1112 -244 l  1145 -244 l  1145 -92 l  1145 -69 1151 -52 1162 -41 ct 1173 -29 1190 -24 1211 -24 ct 
1233 -24 1250 -30 1262 -42 ct 1274 -53 1280 -71 1280 -94 ct 1280 -244 l  1313 -244 l 
1313 -92 l  1313 -72 1309 -55 1300 -41 ct 1292 -27 1280 -16 1265 -8 ct 1250 -1 1232 3 1211 3 ct 
p ef
pom
pum
21901 16218 t
pom
pum
22007 16218 t
0.003 0.003 0.003 c 235 0 m  235 -162 l  235 -180 236 -197 237 -214 ct 231 -193 226 -177 222 -166 ct 
159 0 l  136 0 l  72 -166 l  63 -195 l  57 -214 l  58 -195 l  58 -162 l 
58 0 l  29 0 l  29 -243 l  72 -243 l  137 -75 l  139 -68 141 -60 143 -53 ct 
146 -45 147 -39 148 -36 ct 149 -40 151 -47 153 -57 ct 156 -66 158 -72 159 -75 ct 
223 -243 l  265 -243 l  265 0 l  235 0 l  p ef
370 -20 m  380 -20 389 -23 399 -28 ct 409 -33 417 -40 424 -48 ct 442 -31 l  432 -19 422 -11 409 -5 ct 
397 0 383 3 368 3 ct 347 3 331 -2 320 -11 ct 309 -21 303 -34 303 -51 ct 303 -64 307 -74 316 -83 ct 
324 -91 335 -96 349 -97 ct 349 -98 l  336 -99 327 -104 320 -112 ct 312 -119 309 -129 309 -140 ct 
309 -155 315 -167 326 -176 ct 338 -186 353 -190 372 -190 ct 401 -190 423 -179 437 -158 ct 
415 -143 l  404 -159 390 -167 372 -167 ct 362 -167 354 -165 348 -160 ct 343 -155 340 -148 340 -140 ct 
340 -129 345 -121 354 -117 ct 363 -112 379 -109 402 -109 ct 402 -86 l  384 -86 371 -85 362 -83 ct 
354 -80 347 -77 342 -72 ct 338 -67 335 -60 335 -52 ct 335 -42 338 -34 345 -28 ct 
351 -23 359 -20 370 -20 ct p
361 -211 m  361 -216 l  373 -267 l  409 -267 l  409 -260 l  374 -211 l 
361 -211 l  p ef
451 -187 m  484 -187 l  527 -70 l  527 -68 528 -65 530 -61 ct 531 -57 532 -54 533 -50 ct 
534 -46 535 -42 536 -39 ct 537 -35 538 -32 538 -29 ct 541 -40 545 -53 551 -70 ct 
592 -187 l  625 -187 l  558 -9 l  554 1 551 14 547 30 ct 544 45 541 60 540 73 ct 
507 73 l  510 51 515 26 522 -2 ct 451 -187 l  p ef
714 -20 m  724 -20 733 -23 743 -28 ct 753 -33 761 -40 768 -48 ct 786 -31 l  776 -19 766 -11 753 -5 ct 
741 0 727 3 712 3 ct 691 3 675 -2 664 -11 ct 653 -21 647 -34 647 -51 ct 647 -64 651 -74 660 -83 ct 
668 -91 679 -96 693 -97 ct 693 -98 l  680 -99 671 -104 664 -112 ct 656 -119 653 -129 653 -140 ct 
653 -155 659 -167 670 -176 ct 682 -186 697 -190 716 -190 ct 745 -190 767 -179 781 -158 ct 
759 -143 l  748 -159 734 -167 716 -167 ct 706 -167 698 -165 692 -160 ct 687 -155 684 -148 684 -140 ct 
684 -129 689 -121 698 -117 ct 707 -112 723 -109 746 -109 ct 746 -86 l  728 -86 715 -85 706 -83 ct 
698 -80 691 -77 686 -72 ct 682 -67 679 -60 679 -52 ct 679 -42 682 -34 689 -28 ct 
695 -23 703 -20 714 -20 ct p ef
972 -127 m  972 -83 965 -50 951 -29 ct 938 -8 918 3 891 3 ct 866 3 846 -8 833 -30 ct 
819 -52 812 -84 812 -127 ct 812 -213 839 -256 892 -256 ct 920 -256 940 -245 953 -224 ct 
966 -203 972 -171 972 -127 ct p
891 -20 m  907 -20 919 -28 927 -43 ct 935 -59 939 -83 939 -116 ct 845 -116 l 
846 -85 850 -61 857 -44 ct 864 -28 876 -20 891 -20 ct p
893 -234 m  877 -234 865 -226 857 -211 ct 850 -195 846 -172 845 -139 ct 939 -139 l 
939 -172 935 -195 928 -211 ct 920 -226 909 -234 893 -234 ct p ef
1161 -94 m  1161 -61 1153 -37 1139 -21 ct 1125 -5 1104 3 1076 3 ct 1049 3 1029 -5 1015 -22 ct 
1001 -38 994 -62 994 -94 ct 994 -158 1022 -190 1077 -190 ct 1106 -190 1127 -182 1140 -167 ct 
1154 -151 1161 -127 1161 -94 ct p
1128 -94 m  1128 -119 1124 -138 1116 -150 ct 1109 -161 1096 -167 1078 -167 ct 
1060 -167 1047 -161 1039 -149 ct 1030 -137 1026 -119 1026 -94 ct 1026 -69 1030 -51 1038 -38 ct 
1046 -26 1059 -20 1076 -20 ct 1095 -20 1108 -26 1116 -38 ct 1124 -50 1128 -68 1128 -94 ct 
p ef
1264 -166 m  1255 -166 1246 -162 1239 -155 ct 1231 -148 1225 -138 1220 -124 ct 
1214 -110 1212 -96 1212 -82 ct 1212 -67 1215 -56 1223 -48 ct 1230 -41 1245 -33 1268 -26 ct 
1287 -20 l  1311 -12 1323 2 1323 21 ct 1323 26 1322 31 1320 38 ct 1318 44 1314 51 1309 61 ct 
1287 51 l  1290 47 1292 43 1294 38 ct 1296 34 1297 30 1297 27 ct 1297 21 1294 16 1288 13 ct 
1282 9 1270 4 1251 -1 ct 1231 -6 1216 -12 1206 -19 ct 1197 -25 1190 -33 1185 -44 ct 
1181 -54 1179 -67 1179 -82 ct 1179 -95 1181 -108 1186 -123 ct 1190 -137 1196 -149 1204 -159 ct 
1211 -169 1220 -177 1230 -182 ct 1240 -188 1252 -190 1264 -190 ct 1276 -190 1286 -189 1295 -186 ct 
1303 -183 1311 -177 1319 -169 ct 1299 -149 l  1288 -160 1276 -166 1264 -166 ct 
p ef
1623 3 m  1610 3 1600 0 1594 -7 ct 1589 -13 1586 -24 1586 -40 ct 1586 -164 l 
1516 -164 l  1516 -152 l  1516 -126 1515 -99 1512 -72 ct 1509 -45 1505 -21 1500 0 ct 
1467 0 l  1473 -24 1478 -49 1481 -76 ct 1484 -102 1486 -127 1486 -151 ct 1486 -164 l 
1478 -164 1470 -164 1461 -163 ct 1452 -161 1446 -160 1443 -158 ct 1443 -182 l 
1445 -183 1450 -185 1456 -186 ct 1462 -187 1468 -187 1474 -187 ct 1657 -187 l 
1657 -164 l  1617 -164 l  1617 -46 l  1617 -38 1618 -31 1620 -27 ct 1623 -23 1627 -21 1633 -21 ct 
1648 -23 l  1648 0 l  1639 2 1631 3 1623 3 ct p ef
1854 -89 m  1854 -62 1847 -40 1833 -23 ct 1819 -6 1801 3 1778 3 ct 1766 3 1755 1 1746 -3 ct 
1736 -7 1728 -13 1721 -22 ct 1720 -22 l  1721 -15 1721 -8 1721 0 ct 1721 73 l 
1690 73 l  1690 -100 l  1690 -128 1697 -150 1711 -166 ct 1725 -182 1744 -190 1768 -190 ct 
1785 -190 1799 -186 1812 -178 ct 1825 -169 1836 -157 1843 -142 ct 1850 -127 1854 -109 1854 -89 ct 
p
1820 -91 m  1820 -114 1815 -133 1806 -147 ct 1796 -160 1783 -167 1766 -167 ct 
1736 -167 1721 -145 1721 -100 ct 1721 -45 l  1727 -37 1735 -31 1745 -27 ct 1754 -22 1764 -20 1774 -20 ct 
1789 -20 1800 -26 1808 -38 ct 1816 -50 1820 -68 1820 -91 ct p ef
2034 -94 m  2034 -61 2026 -37 2012 -21 ct 1998 -5 1977 3 1949 3 ct 1922 3 1902 -5 1888 -22 ct 
1874 -38 1867 -62 1867 -94 ct 1867 -158 1895 -190 1950 -190 ct 1979 -190 2000 -182 2013 -167 ct 
2027 -151 2034 -127 2034 -94 ct p
2001 -94 m  2001 -119 1997 -138 1989 -150 ct 1982 -161 1969 -167 1951 -167 ct 
1933 -167 1920 -161 1912 -149 ct 1903 -137 1899 -119 1899 -94 ct 1899 -69 1903 -51 1911 -38 ct 
1919 -26 1932 -20 1949 -20 ct 1968 -20 1981 -26 1989 -38 ct 1997 -50 2001 -68 2001 -94 ct 
p ef
2226 -70 m  2226 -47 2219 -30 2206 -17 ct 2192 -4 2173 3 2147 3 ct 2126 3 2108 -2 2093 -13 ct 
2091 -13 l  2092 0 2093 12 2093 22 ct 2093 73 l  2061 73 l  2061 -177 l  2061 -204 2068 -224 2081 -237 ct 
2094 -250 2114 -256 2140 -256 ct 2162 -256 2180 -251 2192 -240 ct 2204 -230 2210 -215 2210 -196 ct 
2210 -167 2197 -147 2171 -137 ct 2188 -134 2202 -127 2211 -115 ct 2221 -103 2226 -88 2226 -70 ct 
p
2093 -36 m  2100 -31 2108 -27 2118 -24 ct 2127 -21 2137 -20 2146 -20 ct 2162 -20 2175 -24 2183 -33 ct 
2192 -42 2196 -54 2196 -70 ct 2196 -86 2191 -99 2182 -108 ct 2172 -117 2157 -122 2139 -122 ct 
2139 -146 l  2153 -149 2164 -155 2170 -163 ct 2177 -171 2180 -182 2180 -196 ct 
2180 -207 2176 -216 2169 -222 ct 2163 -228 2153 -232 2140 -232 ct 2123 -232 2111 -227 2104 -218 ct 
2096 -209 2093 -195 2093 -176 ct 2093 -36 l  p ef
2303 -167 m  2295 -188 2290 -202 2287 -208 ct 2285 -213 2282 -218 2280 -221 ct 
2278 -225 2275 -227 2272 -229 ct 2269 -230 2265 -231 2260 -231 ct 2257 -231 2254 -231 2252 -229 ct 
2246 -252 l  2253 -255 2261 -256 2268 -256 ct 2280 -256 2290 -252 2298 -243 ct 
2306 -235 2314 -220 2323 -197 ct 2396 0 l  2364 0 l  2328 -100 l  2323 -113 2320 -125 2317 -137 ct 
2315 -131 2313 -126 2310 -119 ct 2308 -113 2290 -73 2258 0 ct 2225 0 l  2303 -167 l 
p ef
2550 73 m  2550 -118 l  2550 -131 2549 -140 2547 -147 ct 2544 -154 2540 -159 2535 -162 ct 
2530 -165 2522 -166 2512 -166 ct 2497 -166 2485 -161 2476 -151 ct 2468 -140 2464 -126 2464 -108 ct 
2464 0 l  2432 0 l  2432 -147 l  2432 -161 2430 -174 2426 -187 ct 2456 -187 l 
2458 -182 2459 -177 2460 -171 ct 2462 -165 2462 -159 2462 -155 ct 2463 -155 l 
2470 -168 2478 -177 2487 -182 ct 2497 -187 2508 -190 2522 -190 ct 2543 -190 2558 -185 2567 -175 ct 
2577 -165 2581 -148 2581 -124 ct 2581 73 l  2550 73 l  p
2497 -210 m  2497 -216 l  2509 -266 l  2545 -266 l  2545 -260 l  2510 -210 l 
2497 -210 l  p ef
2742 0 m  2741 -2 2741 -7 2741 -14 ct 2740 -22 2740 -29 2740 -33 ct 2739 -33 l 
2732 -20 2725 -10 2717 -5 ct 2710 0 2700 3 2688 3 ct 2679 3 2671 1 2664 -3 ct 2657 -6 2652 -11 2648 -18 ct 
2647 -18 l  2648 -13 2648 -6 2648 3 ct 2648 68 l  2617 68 l  2617 -187 l 
2648 -187 l  2648 -76 l  2648 -57 2652 -44 2659 -35 ct 2666 -26 2677 -21 2692 -21 ct 
2707 -21 2718 -27 2726 -37 ct 2734 -47 2738 -62 2738 -81 ct 2738 -187 l  2770 -187 l 
2770 -41 l  2770 -19 2770 -5 2771 0 ct 2742 0 l  p ef
2923 -41 m  2916 -26 2907 -14 2897 -7 ct 2887 0 2875 3 2861 3 ct 2838 3 2821 -5 2809 -21 ct 
2798 -37 2793 -61 2793 -93 ct 2793 -125 2799 -150 2812 -166 ct 2824 -182 2842 -190 2866 -190 ct 
2881 -190 2893 -186 2903 -178 ct 2914 -171 2921 -160 2927 -146 ct 2927 -146 l 
2930 -160 2934 -174 2940 -187 ct 2972 -187 l  2966 -175 2961 -160 2956 -142 ct 
2951 -124 2948 -110 2947 -99 ct 2948 -80 2950 -62 2953 -45 ct 2957 -27 2961 -12 2967 0 ct 
2935 0 l  2932 -7 2930 -15 2928 -23 ct 2926 -31 2925 -37 2924 -41 ct 2923 -41 l 
p
2825 -94 m  2825 -68 2829 -50 2835 -38 ct 2842 -27 2853 -21 2868 -21 ct 2882 -21 2893 -28 2903 -41 ct 
2912 -54 2918 -72 2921 -94 ct 2918 -119 2912 -137 2903 -149 ct 2895 -161 2883 -167 2870 -167 ct 
2854 -167 2843 -161 2836 -150 ct 2829 -138 2825 -120 2825 -94 ct p ef
3038 -164 m  3031 -164 3022 -164 3013 -163 ct 3004 -161 2998 -160 2995 -158 ct 
2995 -182 l  2998 -183 3002 -185 3008 -186 ct 3015 -187 3021 -187 3027 -187 ct 
3127 -187 l  3127 -164 l  3074 -164 l  3074 -46 l  3074 -38 3075 -31 3078 -27 ct 
3080 -23 3084 -21 3090 -21 ct 3105 -23 l  3105 0 l  3096 2 3088 3 3080 3 ct 
3067 3 3058 0 3052 -7 ct 3046 -13 3043 -24 3043 -40 ct 3043 -164 l  3038 -164 l 
p ef
3304 -94 m  3304 -61 3296 -37 3282 -21 ct 3268 -5 3247 3 3219 3 ct 3192 3 3172 -5 3158 -22 ct 
3144 -38 3137 -62 3137 -94 ct 3137 -158 3165 -190 3220 -190 ct 3249 -190 3270 -182 3283 -167 ct 
3297 -151 3304 -127 3304 -94 ct p
3271 -94 m  3271 -119 3267 -138 3259 -150 ct 3252 -161 3239 -167 3221 -167 ct 
3203 -167 3190 -161 3182 -149 ct 3173 -137 3169 -119 3169 -94 ct 3169 -69 3173 -51 3181 -38 ct 
3189 -26 3202 -20 3219 -20 ct 3238 -20 3251 -26 3259 -38 ct 3267 -50 3271 -68 3271 -94 ct 
p ef
3407 -166 m  3398 -166 3389 -162 3382 -155 ct 3374 -148 3368 -138 3363 -124 ct 
3357 -110 3355 -96 3355 -82 ct 3355 -67 3358 -56 3366 -48 ct 3373 -41 3388 -33 3411 -26 ct 
3430 -20 l  3454 -12 3466 2 3466 21 ct 3466 26 3465 31 3463 38 ct 3461 44 3457 51 3452 61 ct 
3430 51 l  3433 47 3435 43 3437 38 ct 3439 34 3440 30 3440 27 ct 3440 21 3437 16 3431 13 ct 
3425 9 3413 4 3394 -1 ct 3374 -6 3359 -12 3349 -19 ct 3340 -25 3333 -33 3328 -44 ct 
3324 -54 3322 -67 3322 -82 ct 3322 -95 3324 -108 3329 -123 ct 3333 -137 3339 -149 3347 -159 ct 
3354 -169 3363 -177 3373 -182 ct 3383 -188 3395 -190 3407 -190 ct 3419 -190 3429 -189 3438 -186 ct 
3446 -183 3454 -177 3462 -169 ct 3442 -149 l  3431 -160 3419 -166 3407 -166 ct 
p ef
3594 -92 m  3594 -125 3599 -155 3609 -181 ct 3620 -208 3636 -233 3658 -256 ct 
3687 -256 l  3666 -232 3650 -207 3640 -180 ct 3630 -153 3625 -123 3625 -91 ct 
3625 -60 3630 -30 3640 -4 ct 3650 23 3666 49 3687 73 ct 3658 73 l  3636 50 3620 25 3609 -2 ct 
3599 -28 3594 -58 3594 -91 ct 3594 -92 l  p ef
3827 -82 m  3827 -92 3825 -101 3822 -110 ct 3819 -119 3815 -127 3811 -134 ct 
3806 -142 3799 -150 3789 -160 ct 3768 -153 3753 -143 3742 -129 ct 3731 -115 3725 -99 3725 -82 ct 
3725 -62 3730 -47 3739 -36 ct 3748 -25 3760 -20 3776 -20 ct 3793 -20 3806 -25 3814 -35 ct 
3823 -46 3827 -61 3827 -82 ct p
3783 -233 m  3756 -235 l  3811 -179 l  3824 -165 3834 -153 3840 -144 ct 3846 -135 3851 -125 3855 -115 ct 
3858 -105 3860 -94 3860 -82 ct 3860 -56 3852 -35 3837 -20 ct 3822 -5 3802 3 3776 3 ct 
3750 3 3730 -5 3715 -20 ct 3700 -35 3693 -55 3693 -82 ct 3693 -104 3700 -123 3713 -139 ct 
3726 -155 3746 -168 3773 -177 ct 3718 -236 l  3718 -256 l  3844 -256 l  3844 -233 l 
3783 -233 l  p ef
3897 0 m  3894 -4 3891 -9 3889 -17 ct 3888 -25 3887 -33 3887 -41 ct 3887 -187 l 
3918 -187 l  3918 -39 l  3918 -32 3919 -24 3921 -17 ct 3924 -10 3927 -5 3931 0 ct 
3897 0 l  p ef
4087 -41 m  4080 -26 4071 -14 4061 -7 ct 4051 0 4039 3 4025 3 ct 4002 3 3985 -5 3973 -21 ct 
3962 -37 3957 -61 3957 -93 ct 3957 -125 3963 -150 3976 -166 ct 3988 -182 4006 -190 4030 -190 ct 
4045 -190 4057 -186 4067 -178 ct 4078 -171 4085 -160 4091 -146 ct 4091 -146 l 
4094 -160 4098 -174 4104 -187 ct 4136 -187 l  4130 -175 4125 -160 4120 -142 ct 
4115 -124 4112 -110 4111 -99 ct 4112 -80 4114 -62 4117 -45 ct 4121 -27 4125 -12 4131 0 ct 
4099 0 l  4096 -7 4094 -15 4092 -23 ct 4090 -31 4089 -37 4088 -41 ct 4087 -41 l 
p
3989 -94 m  3989 -68 3993 -50 3999 -38 ct 4006 -27 4017 -21 4032 -21 ct 4046 -21 4057 -28 4067 -41 ct 
4076 -54 4082 -72 4085 -94 ct 4082 -119 4076 -137 4067 -149 ct 4059 -161 4047 -167 4034 -167 ct 
4018 -167 4007 -161 4000 -150 ct 3993 -138 3989 -120 3989 -94 ct p ef
4339 -85 m  4339 -57 4331 -36 4316 -20 ct 4301 -5 4281 3 4254 3 ct 4227 3 4206 -5 4191 -21 ct 
4176 -37 4169 -61 4169 -91 ct 4169 -121 4177 -145 4195 -162 ct 4212 -179 4237 -187 4268 -187 ct 
4367 -187 l  4367 -165 l  4338 -165 l  4313 -165 l  4313 -164 l  4322 -150 4329 -137 4333 -124 ct 
4337 -112 4339 -98 4339 -85 ct p
4306 -85 m  4306 -114 4299 -141 4285 -164 ct 4269 -164 l  4248 -164 4232 -158 4220 -145 ct 
4208 -132 4202 -114 4202 -91 ct 4202 -44 4219 -20 4253 -20 ct 4270 -20 4284 -25 4293 -37 ct 
4302 -48 4306 -64 4306 -85 ct p ef
4414 -164 m  4407 -164 4398 -164 4389 -163 ct 4380 -161 4374 -160 4371 -158 ct 
4371 -182 l  4374 -183 4378 -185 4384 -186 ct 4391 -187 4397 -187 4403 -187 ct 
4503 -187 l  4503 -164 l  4450 -164 l  4450 -46 l  4450 -38 4451 -31 4454 -27 ct 
4456 -23 4460 -21 4466 -21 ct 4481 -23 l  4481 0 l  4472 2 4464 3 4456 3 ct 
4443 3 4434 0 4428 -7 ct 4422 -13 4419 -24 4419 -40 ct 4419 -164 l  4414 -164 l 
p ef
4643 -41 m  4636 -26 4627 -14 4617 -7 ct 4607 0 4595 3 4581 3 ct 4558 3 4541 -5 4529 -21 ct 
4518 -37 4513 -61 4513 -93 ct 4513 -125 4519 -150 4532 -166 ct 4544 -182 4562 -190 4586 -190 ct 
4601 -190 4613 -186 4623 -178 ct 4634 -171 4641 -160 4647 -146 ct 4647 -146 l 
4650 -160 4654 -174 4660 -187 ct 4692 -187 l  4686 -175 4681 -160 4676 -142 ct 
4671 -124 4668 -110 4667 -99 ct 4668 -80 4670 -62 4673 -45 ct 4677 -27 4681 -12 4687 0 ct 
4655 0 l  4652 -7 4650 -15 4648 -23 ct 4646 -31 4645 -37 4644 -41 ct 4643 -41 l 
p
4545 -94 m  4545 -68 4549 -50 4555 -38 ct 4562 -27 4573 -21 4588 -21 ct 4602 -21 4613 -28 4623 -41 ct 
4632 -54 4638 -72 4641 -94 ct 4638 -119 4632 -137 4623 -149 ct 4615 -161 4603 -167 4590 -167 ct 
4574 -167 4563 -161 4556 -150 ct 4549 -138 4545 -120 4545 -94 ct p
4583 -211 m  4583 -216 l  4595 -267 l  4631 -267 l  4631 -260 l  4596 -211 l 
4583 -211 l  p ef
4895 -85 m  4895 -57 4887 -36 4872 -20 ct 4857 -5 4837 3 4810 3 ct 4783 3 4762 -5 4747 -21 ct 
4732 -37 4725 -61 4725 -91 ct 4725 -121 4733 -145 4751 -162 ct 4768 -179 4793 -187 4824 -187 ct 
4923 -187 l  4923 -165 l  4894 -165 l  4869 -165 l  4869 -164 l  4878 -150 4885 -137 4889 -124 ct 
4893 -112 4895 -98 4895 -85 ct p
4862 -85 m  4862 -114 4855 -141 4841 -164 ct 4825 -164 l  4804 -164 4788 -158 4776 -145 ct 
4764 -132 4758 -114 4758 -91 ct 4758 -44 4775 -20 4809 -20 ct 4826 -20 4840 -25 4849 -37 ct 
4858 -48 4862 -64 4862 -85 ct p ef
5000 -20 m  5010 -20 5019 -23 5029 -28 ct 5039 -33 5047 -40 5054 -48 ct 5072 -31 l 
5062 -19 5052 -11 5039 -5 ct 5027 0 5013 3 4998 3 ct 4977 3 4961 -2 4950 -11 ct 
4939 -21 4933 -34 4933 -51 ct 4933 -64 4937 -74 4946 -83 ct 4954 -91 4965 -96 4979 -97 ct 
4979 -98 l  4966 -99 4957 -104 4950 -112 ct 4942 -119 4939 -129 4939 -140 ct 
4939 -155 4945 -167 4956 -176 ct 4968 -186 4983 -190 5002 -190 ct 5031 -190 5053 -179 5067 -158 ct 
5045 -143 l  5034 -159 5020 -167 5002 -167 ct 4992 -167 4984 -165 4978 -160 ct 
4973 -155 4970 -148 4970 -140 ct 4970 -129 4975 -121 4984 -117 ct 4993 -112 5009 -109 5032 -109 ct 
5032 -86 l  5014 -86 5001 -85 4992 -83 ct 4984 -80 4977 -77 4972 -72 ct 4968 -67 4965 -60 4965 -52 ct 
4965 -42 4968 -34 4975 -28 ct 4981 -23 4989 -20 5000 -20 ct p ef
5114 0 m  5111 -4 5108 -9 5106 -17 ct 5105 -25 5104 -33 5104 -41 ct 5104 -187 l 
5135 -187 l  5135 -39 l  5135 -32 5136 -24 5138 -17 ct 5141 -10 5144 -5 5148 0 ct 
5114 0 l  p ef
5259 -166 m  5250 -166 5241 -162 5234 -155 ct 5226 -148 5220 -138 5215 -124 ct 
5209 -110 5207 -96 5207 -82 ct 5207 -67 5210 -56 5218 -48 ct 5225 -41 5240 -33 5263 -26 ct 
5282 -20 l  5306 -12 5318 2 5318 21 ct 5318 26 5317 31 5315 38 ct 5313 44 5309 51 5304 61 ct 
5282 51 l  5285 47 5287 43 5289 38 ct 5291 34 5292 30 5292 27 ct 5292 21 5289 16 5283 13 ct 
5277 9 5265 4 5246 -1 ct 5226 -6 5211 -12 5201 -19 ct 5192 -25 5185 -33 5180 -44 ct 
5176 -54 5174 -67 5174 -82 ct 5174 -95 5176 -108 5181 -123 ct 5185 -137 5191 -149 5199 -159 ct 
5206 -169 5215 -177 5225 -182 ct 5235 -188 5247 -190 5259 -190 ct 5271 -190 5281 -189 5290 -186 ct 
5298 -183 5306 -177 5314 -169 ct 5294 -149 l  5283 -160 5271 -166 5259 -166 ct 
p ef
5618 3 m  5605 3 5595 0 5589 -7 ct 5584 -13 5581 -24 5581 -40 ct 5581 -164 l 
5511 -164 l  5511 -152 l  5511 -126 5510 -99 5507 -72 ct 5504 -45 5500 -21 5495 0 ct 
5462 0 l  5468 -24 5473 -49 5476 -76 ct 5479 -102 5481 -127 5481 -151 ct 5481 -164 l 
5473 -164 5465 -164 5456 -163 ct 5447 -161 5441 -160 5438 -158 ct 5438 -182 l 
5440 -183 5445 -185 5451 -186 ct 5457 -187 5463 -187 5469 -187 ct 5652 -187 l 
5652 -164 l  5612 -164 l  5612 -46 l  5612 -38 5613 -31 5615 -27 ct 5618 -23 5622 -21 5628 -21 ct 
5643 -23 l  5643 0 l  5634 2 5626 3 5618 3 ct p ef
5696 0 m  5693 -4 5690 -9 5688 -17 ct 5687 -25 5686 -33 5686 -41 ct 5686 -187 l 
5717 -187 l  5717 -39 l  5717 -32 5718 -24 5720 -17 ct 5723 -10 5726 -5 5730 0 ct 
5696 0 l  p
5689 -210 m  5689 -216 l  5701 -266 l  5737 -266 l  5737 -260 l  5702 -210 l 
5689 -210 l  p ef
5904 -146 m  5904 -126 5898 -103 5886 -77 ct 5874 -51 5858 -25 5838 0 ct 5808 0 l 
5741 -187 l  5774 -187 l  5827 -27 l  5858 -66 5873 -106 5873 -144 ct 5873 -160 5870 -174 5865 -187 ct 
5895 -187 l  5901 -175 5904 -162 5904 -146 ct p ef
6072 -41 m  6065 -26 6056 -14 6046 -7 ct 6036 0 6024 3 6010 3 ct 5987 3 5970 -5 5958 -21 ct 
5947 -37 5942 -61 5942 -93 ct 5942 -125 5948 -150 5961 -166 ct 5973 -182 5991 -190 6015 -190 ct 
6030 -190 6042 -186 6052 -178 ct 6063 -171 6070 -160 6076 -146 ct 6076 -146 l 
6079 -160 6083 -174 6089 -187 ct 6121 -187 l  6115 -175 6110 -160 6105 -142 ct 
6100 -124 6097 -110 6096 -99 ct 6097 -80 6099 -62 6102 -45 ct 6106 -27 6110 -12 6116 0 ct 
6084 0 l  6081 -7 6079 -15 6077 -23 ct 6075 -31 6074 -37 6073 -41 ct 6072 -41 l 
p
5974 -94 m  5974 -68 5978 -50 5984 -38 ct 5991 -27 6002 -21 6017 -21 ct 6031 -21 6042 -28 6052 -41 ct 
6061 -54 6067 -72 6070 -94 ct 6067 -119 6061 -137 6052 -149 ct 6044 -161 6032 -167 6019 -167 ct 
6003 -167 5992 -161 5985 -150 ct 5978 -138 5974 -120 5974 -94 ct p ef
6279 0 m  6216 -85 l  6193 -66 l  6193 0 l  6162 0 l  6162 -187 l  6193 -187 l 
6193 -96 l  6275 -187 l  6311 -187 l  6235 -106 l  6315 0 l  6279 0 l 
p ef
6469 -41 m  6462 -26 6453 -14 6443 -7 ct 6433 0 6421 3 6407 3 ct 6384 3 6367 -5 6355 -21 ct 
6344 -37 6339 -61 6339 -93 ct 6339 -125 6345 -150 6358 -166 ct 6370 -182 6388 -190 6412 -190 ct 
6427 -190 6439 -186 6449 -178 ct 6460 -171 6467 -160 6473 -146 ct 6473 -146 l 
6476 -160 6480 -174 6486 -187 ct 6518 -187 l  6512 -175 6507 -160 6502 -142 ct 
6497 -124 6494 -110 6493 -99 ct 6494 -80 6496 -62 6499 -45 ct 6503 -27 6507 -12 6513 0 ct 
6481 0 l  6478 -7 6476 -15 6474 -23 ct 6472 -31 6471 -37 6470 -41 ct 6469 -41 l 
p
6371 -94 m  6371 -68 6375 -50 6381 -38 ct 6388 -27 6399 -21 6414 -21 ct 6428 -21 6439 -28 6449 -41 ct 
6458 -54 6464 -72 6467 -94 ct 6464 -119 6458 -137 6449 -149 ct 6441 -161 6429 -167 6416 -167 ct 
6400 -167 6389 -161 6382 -150 ct 6375 -138 6371 -120 6371 -94 ct p ef
6631 -91 m  6631 -58 6625 -28 6615 -2 ct 6605 25 6589 50 6567 73 ct 6537 73 l 
6559 49 6574 23 6584 -3 ct 6594 -30 6599 -59 6599 -91 ct 6599 -124 6594 -153 6584 -180 ct 
6574 -207 6559 -232 6537 -256 ct 6567 -256 l  6589 -233 6605 -208 6615 -181 ct 
6625 -155 6631 -125 6631 -92 ct 6631 -91 l  p ef
pom
pum
18389 10691 t
90.0 r 192 0 m  119 -106 l  44 0 l  8 0 l  100 -126 l  15 -243 l  51 -243 l 
119 -148 l  185 -243 l  221 -243 l  138 -127 l  228 0 l  192 0 l  p ef
425 -89 m  425 -62 418 -40 404 -23 ct 390 -6 372 3 349 3 ct 337 3 326 1 317 -3 ct 
307 -7 299 -13 292 -22 ct 291 -22 l  292 -15 292 -8 292 0 ct 292 73 l  261 73 l 
261 -100 l  261 -128 268 -150 282 -166 ct 296 -182 315 -190 339 -190 ct 356 -190 370 -186 383 -178 ct 
396 -169 407 -157 414 -142 ct 421 -127 425 -109 425 -89 ct p
391 -91 m  391 -114 386 -133 377 -147 ct 367 -160 354 -167 337 -167 ct 307 -167 292 -145 292 -100 ct 
292 -45 l  298 -37 306 -31 316 -27 ct 325 -22 335 -20 345 -20 ct 360 -20 371 -26 379 -38 ct 
387 -50 391 -68 391 -91 ct p ef
605 -94 m  605 -61 597 -37 583 -21 ct 569 -5 548 3 520 3 ct 493 3 473 -5 459 -22 ct 
445 -38 438 -62 438 -94 ct 438 -158 466 -190 521 -190 ct 550 -190 571 -182 584 -167 ct 
598 -151 605 -127 605 -94 ct p
572 -94 m  572 -119 568 -138 560 -150 ct 553 -161 540 -167 522 -167 ct 504 -167 491 -161 483 -149 ct 
474 -137 470 -119 470 -94 ct 470 -69 474 -51 482 -38 ct 490 -26 503 -20 520 -20 ct 
539 -20 552 -26 560 -38 ct 568 -50 572 -68 572 -94 ct p
510 -211 m  510 -216 l  521 -267 l  557 -267 l  557 -260 l  522 -211 l 
510 -211 l  p ef
772 -146 m  772 -126 766 -103 754 -77 ct 742 -51 726 -25 706 0 ct 676 0 l  609 -187 l 
642 -187 l  695 -27 l  726 -66 741 -106 741 -144 ct 741 -160 738 -174 733 -187 ct 
763 -187 l  769 -175 772 -162 772 -146 ct p ef
976 -94 m  976 -61 968 -37 954 -21 ct 940 -5 919 3 891 3 ct 864 3 844 -5 830 -22 ct 
816 -38 809 -62 809 -94 ct 809 -158 837 -190 892 -190 ct 921 -190 942 -182 955 -167 ct 
969 -151 976 -127 976 -94 ct p
943 -94 m  943 -119 939 -138 931 -150 ct 924 -161 911 -167 893 -167 ct 875 -167 862 -161 854 -149 ct 
845 -137 841 -119 841 -94 ct 841 -69 845 -51 853 -38 ct 861 -26 874 -20 891 -20 ct 
910 -20 923 -26 931 -38 ct 939 -50 943 -68 943 -94 ct p ef
1079 -166 m  1070 -166 1061 -162 1054 -155 ct 1046 -148 1040 -138 1035 -124 ct 
1029 -110 1027 -96 1027 -82 ct 1027 -67 1030 -56 1038 -48 ct 1045 -41 1060 -33 1083 -26 ct 
1102 -20 l  1126 -12 1138 2 1138 21 ct 1138 26 1137 31 1135 38 ct 1133 44 1129 51 1124 61 ct 
1102 51 l  1105 47 1107 43 1109 38 ct 1111 34 1112 30 1112 27 ct 1112 21 1109 16 1103 13 ct 
1097 9 1085 4 1066 -1 ct 1046 -6 1031 -12 1021 -19 ct 1012 -25 1005 -33 1000 -44 ct 
996 -54 994 -67 994 -82 ct 994 -95 996 -108 1001 -123 ct 1005 -137 1011 -149 1019 -159 ct 
1026 -169 1035 -177 1045 -182 ct 1055 -188 1067 -190 1079 -190 ct 1091 -190 1101 -189 1110 -186 ct 
1118 -183 1126 -177 1134 -169 ct 1114 -149 l  1103 -160 1091 -166 1079 -166 ct 
p ef
1266 -92 m  1266 -125 1271 -155 1281 -181 ct 1292 -208 1308 -233 1330 -256 ct 
1359 -256 l  1338 -232 1322 -207 1312 -180 ct 1302 -153 1297 -123 1297 -91 ct 
1297 -60 1302 -30 1312 -4 ct 1322 23 1338 49 1359 73 ct 1330 73 l  1308 50 1292 25 1281 -2 ct 
1271 -28 1266 -58 1266 -91 ct 1266 -92 l  p ef
1513 -52 m  1513 -34 1506 -21 1493 -11 ct 1480 -2 1461 3 1437 3 ct 1414 3 1396 -1 1383 -8 ct 
1371 -16 1363 -28 1359 -44 ct 1386 -50 l  1389 -40 1394 -32 1403 -28 ct 1411 -23 1422 -21 1437 -21 ct 
1453 -21 1464 -23 1472 -28 ct 1479 -33 1483 -40 1483 -50 ct 1483 -57 1480 -63 1475 -68 ct 
1470 -72 1462 -76 1451 -79 ct 1428 -85 l  1410 -89 1398 -94 1390 -98 ct 1383 -103 1377 -108 1373 -114 ct 
1368 -121 1366 -129 1366 -138 ct 1366 -155 1372 -168 1384 -177 ct 1397 -186 1414 -190 1437 -190 ct 
1458 -190 1474 -186 1486 -179 ct 1499 -172 1506 -160 1509 -144 ct 1482 -141 l 
1480 -149 1475 -156 1468 -160 ct 1460 -164 1450 -167 1437 -167 ct 1423 -167 1413 -164 1406 -160 ct 
1400 -156 1396 -149 1396 -141 ct 1396 -136 1398 -131 1401 -128 ct 1403 -124 1407 -121 1413 -119 ct 
1418 -117 1430 -113 1447 -109 ct 1463 -105 1475 -101 1482 -97 ct 1490 -94 1495 -90 1500 -86 ct 
1504 -82 1507 -77 1509 -71 ct 1512 -66 1513 -59 1513 -52 ct p ef
1631 -91 m  1631 -58 1625 -28 1615 -2 ct 1605 25 1589 50 1567 73 ct 1537 73 l 
1559 49 1574 23 1584 -3 ct 1594 -30 1599 -59 1599 -91 ct 1599 -124 1594 -153 1584 -180 ct 
1574 -207 1559 -232 1537 -256 ct 1567 -256 l  1589 -233 1605 -208 1615 -181 ct 
1625 -155 1631 -125 1631 -92 ct 1631 -91 l  p ef
pom
0 12871 t 
pom
count op_count sub {pop} repeat countdictstack dict_count sub {end} repeat b4_inc_state restore
%%PageTrailer
%%Trailer
%%EOF
