mpiP: 
mpiP: mpiP V3.5.0 (Build Nov 11 2020/13:45:15)
mpiP: 
Iterations= 50 Elapsed MPI Wall time is 102.312613
Time taken 102 seconds 75 milliseconds
Residual 2.64116e-12
mpiP: 
mpiP: Storing mpiP output in [./jacobi_mpi_mpip.x.2.403657.1.mpiP].
mpiP: 
