mpiP: 
mpiP: mpiP V3.5.0 (Build Nov 11 2020/13:45:15)
mpiP: 
Iterations= 50 Elapsed MPI Wall time is 25.601645
Time taken 25 seconds 516 milliseconds
Residual 2.11278e-11
mpiP: 
mpiP: Storing mpiP output in [./jacobi_mpi_mpip.x.2.403506.1.mpiP].
mpiP: 
