%!PS-Adobe-3.0 EPSF-3.0 
%%BoundingBox: 0 0 475 278
%%Pages: 0
%%Creator: LibreOffice 6.4
%%Title: none
%%CreationDate: none
%%LanguageLevel: 2
%%EndComments
%%BeginProlog
%%BeginResource: procset SDRes-Prolog 1.0 0
/b4_inc_state save def
/dict_count countdictstack def
/op_count count 1 sub def
userdict begin
0 setgray 0 setlinecap 1 setlinewidth 0 setlinejoin 10 setmiterlimit[] 0 setdash newpath
/languagelevel where {pop languagelevel 1 ne {false setstrokeadjust false setoverprint} if} if
/bdef {bind def} bind def
/c {setrgbcolor} bdef
/l {neg lineto} bdef
/rl {neg rlineto} bdef
/lc {setlinecap} bdef
/lj {setlinejoin} bdef
/lw {setlinewidth} bdef
/ml {setmiterlimit} bdef
/ld {setdash} bdef
/m {neg moveto} bdef
/ct {6 2 roll neg 6 2 roll neg 6 2 roll neg curveto} bdef
/r {rotate} bdef
/t {neg translate} bdef
/s {scale} bdef
/sw {show} bdef
/gs {gsave} bdef
/gr {grestore} bdef
/f {findfont dup length dict begin
{1 index /FID ne {def} {pop pop} ifelse} forall /Encoding ISOLatin1Encoding def
currentdict end /NFont exch definefont pop /NFont findfont} bdef
/p {closepath} bdef
/sf {scalefont setfont} bdef
/ef {eofill}bdef
/pc {closepath stroke}bdef
/ps {stroke}bdef
/pum {matrix currentmatrix}bdef
/pom {setmatrix}bdef
/bs {/aString exch def /nXOfs exch def /nWidth exch def currentpoint nXOfs 0 rmoveto pum nWidth aString stringwidth pop div 1 scale aString show pom moveto} bdef
%%EndResource
%%EndProlog
%%BeginSetup
%%EndSetup
%%Page: 1 1
%%BeginPageSetup
%%EndPageSetup
pum
0.02836 0.02832 s 
0 -9816 t
/tm matrix currentmatrix def
tm setmatrix
-4602 -11405 t 
1 1 s 
gs
1.000 1.000 1.000 c 12976 21220 m  4602 21220 l  4602 11405 l  21349 11405 l 
21349 21220 l  12976 21220 l  p ef
gr
gs
1.000 1.000 1.000 c 12438 19497 m  6569 19497 l  6569 13791 l  18307 13791 l 
18307 19497 l  12438 19497 l  p ef
gr
gs
17.99892 lw 1 lj 0.718 0.718 0.718 c 18307 19496 m  6569 19496 l  ps
gr
gs
17.99892 lw 1 lj 0.718 0.718 0.718 c 18307 18544 m  6569 18544 l  ps
gr
gs
17.99892 lw 1 lj 0.718 0.718 0.718 c 18307 17593 m  6569 17593 l  ps
gr
gs
17.99892 lw 1 lj 0.718 0.718 0.718 c 18307 16642 m  6569 16642 l  ps
gr
gs
17.99892 lw 1 lj 0.718 0.718 0.718 c 18307 15692 m  6569 15692 l  ps
gr
gs
17.99892 lw 1 lj 0.718 0.718 0.718 c 18307 14741 m  6569 14741 l  ps
gr
gs
17.99892 lw 1 lj 0.718 0.718 0.718 c 18307 13789 m  6569 13789 l  ps
gr
gs
17.99892 lw 1 lj 0.546 0.546 0.546 c 6569 19496 m  18307 19496 l  ps
gr
gs
17.99892 lw 1 lj 0.546 0.546 0.546 c 6569 19496 m  6569 13789 l  ps
gr
gs
52.99683 lw 1 lj 0.261 0.523 0.957 c 6569 14741 m  8916 14741 l  11264 14741 l 
13611 14741 l  15959 14741 l  18307 14741 l  ps
gr
gs
52.99683 lw 1 lj 0.917 0.265 0.210 c 6569 14764 m  8916 14779 l  11264 14763 l 
13611 14750 l  15959 14752 l  18307 19496 l  ps
gr
gs
52.99683 lw 1 lj 0.984 0.738 0.019 c 6569 14890 m  8916 14857 l  11264 14830 l 
13611 14487 l  15959 14779 l  18307 19496 l  ps
gr
gs
52.99683 lw 1 lj 0.207 0.660 0.328 c 6569 15201 m  8916 15144 l  11264 15267 l 
13611 15209 l  15959 15200 l  18307 19496 l  ps
gr
gs
52.99683 lw 1 lj 1.000 0.429 0.007 c 6569 16186 m  8916 15442 l  11264 15455 l 
13611 15276 l  15959 15218 l  18307 19496 l  ps
gr
gs
52.99683 lw 1 lj 0.277 0.742 0.777 c 6569 17817 m  8916 16008 l  11264 15640 l 
13611 15412 l  15959 15238 l  18307 19496 l  ps
gr
gs
52.99683 lw 1 lj 0.484 0.667 0.968 c 6569 18502 m  8916 17339 l  11264 16066 l 
13611 15563 l  15959 15295 l  18307 19496 l  ps
gr
gs
52.99683 lw 1 lj 0.941 0.484 0.449 c 6569 18561 m  8916 17498 l  11264 16232 l 
13611 15736 l  15959 15432 l  18307 15276 l  ps
gr
pum
5947 19914 t
0.003 0.003 0.003 c 181 -68 m  181 -46 174 -28 160 -16 ct 145 -3 125 3 98 3 ct 72 3 52 -3 37 -15 ct 
23 -28 15 -45 15 -68 ct 15 -84 20 -97 29 -108 ct 38 -119 50 -125 64 -128 ct 64 -128 l 
51 -131 40 -138 32 -148 ct 25 -159 21 -171 21 -185 ct 21 -203 28 -218 42 -230 ct 
56 -241 74 -247 98 -247 ct 121 -247 140 -241 154 -230 ct 168 -219 175 -204 175 -184 ct 
175 -171 171 -158 163 -148 ct 156 -138 145 -131 132 -129 ct 132 -128 l  147 -125 159 -119 168 -108 ct 
177 -98 181 -84 181 -68 ct p
143 -183 m  143 -210 128 -224 98 -224 ct 83 -224 72 -220 64 -214 ct 57 -207 53 -196 53 -183 ct 
53 -169 57 -158 65 -151 ct 72 -144 84 -140 98 -140 ct 113 -140 124 -143 131 -150 ct 
139 -157 143 -168 143 -183 ct p
149 -71 m  149 -86 144 -98 135 -105 ct 126 -113 114 -117 98 -117 ct 82 -117 70 -113 61 -104 ct 
52 -96 47 -85 47 -70 ct 47 -37 64 -20 99 -20 ct 115 -20 128 -24 136 -32 ct 145 -41 149 -53 149 -71 ct 
p ef
337 -55 m  337 0 l  308 0 l  308 -55 l  193 -55 l  193 -79 l  304 -243 l 
337 -243 l  337 -79 l  371 -79 l  371 -55 l  337 -55 l  p
308 -208 m  307 -207 306 -204 303 -199 ct 300 -193 298 -190 296 -187 ct 234 -96 l 
224 -83 l  222 -79 l  308 -79 l  308 -208 l  p ef
553 -122 m  553 -81 545 -50 531 -29 ct 517 -8 496 3 468 3 ct 440 3 419 -8 405 -29 ct 
391 -50 384 -81 384 -122 ct 384 -164 391 -195 404 -216 ct 418 -237 439 -247 469 -247 ct 
497 -247 519 -236 532 -215 ct 546 -194 553 -163 553 -122 ct p
521 -122 m  521 -157 517 -182 509 -198 ct 501 -214 487 -222 469 -222 ct 450 -222 436 -214 428 -199 ct 
419 -183 415 -158 415 -122 ct 415 -88 419 -62 428 -46 ct 436 -30 450 -22 468 -22 ct 
486 -22 500 -31 508 -47 ct 517 -63 521 -88 521 -122 ct p ef
635 -192 m  680 -210 l  688 -187 l  639 -175 l  671 -131 l  651 -119 l 
625 -164 l  598 -119 l  577 -132 l  610 -175 l  562 -187 l  569 -210 l 
615 -192 l  613 -243 l  637 -243 l  635 -192 l  p ef
869 -68 m  869 -46 862 -28 848 -16 ct 833 -3 813 3 786 3 ct 760 3 740 -3 725 -15 ct 
711 -28 703 -45 703 -68 ct 703 -84 708 -97 717 -108 ct 726 -119 738 -125 752 -128 ct 
752 -128 l  739 -131 728 -138 720 -148 ct 713 -159 709 -171 709 -185 ct 709 -203 716 -218 730 -230 ct 
744 -241 762 -247 786 -247 ct 809 -247 828 -241 842 -230 ct 856 -219 863 -204 863 -184 ct 
863 -171 859 -158 851 -148 ct 844 -138 833 -131 820 -129 ct 820 -128 l  835 -125 847 -119 856 -108 ct 
865 -98 869 -84 869 -68 ct p
831 -183 m  831 -210 816 -224 786 -224 ct 771 -224 760 -220 752 -214 ct 745 -207 741 -196 741 -183 ct 
741 -169 745 -158 753 -151 ct 760 -144 772 -140 786 -140 ct 801 -140 812 -143 819 -150 ct 
827 -157 831 -168 831 -183 ct p
837 -71 m  837 -86 832 -98 823 -105 ct 814 -113 802 -117 786 -117 ct 770 -117 758 -113 749 -104 ct 
740 -96 735 -85 735 -70 ct 735 -37 752 -20 787 -20 ct 803 -20 816 -24 824 -32 ct 
833 -41 837 -53 837 -71 ct p ef
1025 -55 m  1025 0 l  996 0 l  996 -55 l  881 -55 l  881 -79 l  992 -243 l 
1025 -243 l  1025 -79 l  1059 -79 l  1059 -55 l  1025 -55 l  p
996 -208 m  995 -207 994 -204 991 -199 ct 988 -193 986 -190 984 -187 ct 922 -96 l 
912 -83 l  910 -79 l  996 -79 l  996 -208 l  p ef
1241 -122 m  1241 -81 1233 -50 1219 -29 ct 1205 -8 1184 3 1156 3 ct 1128 3 1107 -8 1093 -29 ct 
1079 -50 1072 -81 1072 -122 ct 1072 -164 1079 -195 1092 -216 ct 1106 -237 1127 -247 1157 -247 ct 
1185 -247 1207 -236 1220 -215 ct 1234 -194 1241 -163 1241 -122 ct p
1209 -122 m  1209 -157 1205 -182 1197 -198 ct 1189 -214 1175 -222 1157 -222 ct 
1138 -222 1124 -214 1116 -199 ct 1107 -183 1103 -158 1103 -122 ct 1103 -88 1107 -62 1116 -46 ct 
1124 -30 1138 -22 1156 -22 ct 1174 -22 1188 -31 1196 -47 ct 1205 -63 1209 -88 1209 -122 ct 
p ef
pom
pum
8109 19914 t
27 0 m  27 -26 l  89 -26 l  89 -213 l  34 -174 l  34 -204 l  91 -243 l 
120 -243 l  120 -26 l  179 -26 l  179 0 l  27 0 l  p ef
366 -80 m  366 -54 359 -34 345 -19 ct 331 -4 312 3 287 3 ct 260 3 239 -7 225 -28 ct 
210 -48 203 -77 203 -116 ct 203 -158 210 -191 226 -213 ct 241 -236 262 -247 290 -247 ct 
326 -247 350 -231 359 -198 ct 329 -192 l  323 -212 310 -222 289 -222 ct 272 -222 258 -214 248 -197 ct 
239 -181 234 -157 234 -126 ct 239 -136 247 -144 258 -150 ct 268 -155 280 -158 293 -158 ct 
315 -158 333 -151 346 -137 ct 359 -123 366 -104 366 -80 ct p
334 -79 m  334 -96 330 -110 321 -120 ct 313 -129 301 -134 285 -134 ct 271 -134 259 -130 250 -121 ct 
241 -113 237 -101 237 -86 ct 237 -67 242 -52 251 -40 ct 260 -28 272 -22 286 -22 ct 
301 -22 313 -27 322 -37 ct 330 -47 334 -61 334 -79 ct p ef
551 -68 m  551 -46 544 -28 530 -16 ct 515 -3 495 3 468 3 ct 442 3 422 -3 407 -15 ct 
393 -28 385 -45 385 -68 ct 385 -84 390 -97 399 -108 ct 408 -119 420 -125 434 -128 ct 
434 -128 l  421 -131 410 -138 402 -148 ct 395 -159 391 -171 391 -185 ct 391 -203 398 -218 412 -230 ct 
426 -241 444 -247 468 -247 ct 491 -247 510 -241 524 -230 ct 538 -219 545 -204 545 -184 ct 
545 -171 541 -158 533 -148 ct 526 -138 515 -131 502 -129 ct 502 -128 l  517 -125 529 -119 538 -108 ct 
547 -98 551 -84 551 -68 ct p
513 -183 m  513 -210 498 -224 468 -224 ct 453 -224 442 -220 434 -214 ct 427 -207 423 -196 423 -183 ct 
423 -169 427 -158 435 -151 ct 442 -144 454 -140 468 -140 ct 483 -140 494 -143 501 -150 ct 
509 -157 513 -168 513 -183 ct p
519 -71 m  519 -86 514 -98 505 -105 ct 496 -113 484 -117 468 -117 ct 452 -117 440 -113 431 -104 ct 
422 -96 417 -85 417 -70 ct 417 -37 434 -20 469 -20 ct 485 -20 498 -24 506 -32 ct 
515 -41 519 -53 519 -71 ct p ef
739 -122 m  739 -81 731 -50 717 -29 ct 703 -8 682 3 654 3 ct 626 3 605 -8 591 -29 ct 
577 -50 570 -81 570 -122 ct 570 -164 577 -195 590 -216 ct 604 -237 625 -247 655 -247 ct 
683 -247 705 -236 718 -215 ct 732 -194 739 -163 739 -122 ct p
707 -122 m  707 -157 703 -182 695 -198 ct 687 -214 673 -222 655 -222 ct 636 -222 622 -214 614 -199 ct 
605 -183 601 -158 601 -122 ct 601 -88 605 -62 614 -46 ct 622 -30 636 -22 654 -22 ct 
672 -22 686 -31 694 -47 ct 703 -63 707 -88 707 -122 ct p ef
820 -192 m  865 -210 l  873 -187 l  824 -175 l  856 -131 l  836 -119 l 
810 -164 l  783 -119 l  762 -132 l  795 -175 l  747 -187 l  754 -210 l 
800 -192 l  798 -243 l  822 -243 l  820 -192 l  p ef
900 0 m  900 -26 l  962 -26 l  962 -213 l  907 -174 l  907 -204 l  964 -243 l 
993 -243 l  993 -26 l  1052 -26 l  1052 0 l  900 0 l  p ef
1239 -80 m  1239 -54 1232 -34 1218 -19 ct 1204 -4 1185 3 1160 3 ct 1133 3 1112 -7 1098 -28 ct 
1083 -48 1076 -77 1076 -116 ct 1076 -158 1083 -191 1099 -213 ct 1114 -236 1135 -247 1163 -247 ct 
1199 -247 1223 -231 1232 -198 ct 1202 -192 l  1196 -212 1183 -222 1162 -222 ct 
1145 -222 1131 -214 1121 -197 ct 1112 -181 1107 -157 1107 -126 ct 1112 -136 1120 -144 1131 -150 ct 
1141 -155 1153 -158 1166 -158 ct 1188 -158 1206 -151 1219 -137 ct 1232 -123 1239 -104 1239 -80 ct 
p
1207 -79 m  1207 -96 1203 -110 1194 -120 ct 1186 -129 1174 -134 1158 -134 ct 
1144 -134 1132 -130 1123 -121 ct 1114 -113 1110 -101 1110 -86 ct 1110 -67 1115 -52 1124 -40 ct 
1133 -28 1145 -22 1159 -22 ct 1174 -22 1186 -27 1195 -37 ct 1203 -47 1207 -61 1207 -79 ct 
p ef
1425 -68 m  1425 -46 1418 -28 1404 -16 ct 1389 -3 1369 3 1342 3 ct 1316 3 1296 -3 1281 -15 ct 
1267 -28 1259 -45 1259 -68 ct 1259 -84 1264 -97 1273 -108 ct 1282 -119 1294 -125 1308 -128 ct 
1308 -128 l  1295 -131 1284 -138 1276 -148 ct 1269 -159 1265 -171 1265 -185 ct 
1265 -203 1272 -218 1286 -230 ct 1300 -241 1318 -247 1342 -247 ct 1365 -247 1384 -241 1398 -230 ct 
1412 -219 1419 -204 1419 -184 ct 1419 -171 1415 -158 1407 -148 ct 1400 -138 1389 -131 1376 -129 ct 
1376 -128 l  1391 -125 1403 -119 1412 -108 ct 1421 -98 1425 -84 1425 -68 ct 
p
1387 -183 m  1387 -210 1372 -224 1342 -224 ct 1327 -224 1316 -220 1308 -214 ct 
1301 -207 1297 -196 1297 -183 ct 1297 -169 1301 -158 1309 -151 ct 1316 -144 1328 -140 1342 -140 ct 
1357 -140 1368 -143 1375 -150 ct 1383 -157 1387 -168 1387 -183 ct p
1393 -71 m  1393 -86 1388 -98 1379 -105 ct 1370 -113 1358 -117 1342 -117 ct 
1326 -117 1314 -113 1305 -104 ct 1296 -96 1291 -85 1291 -70 ct 1291 -37 1308 -20 1343 -20 ct 
1359 -20 1372 -24 1380 -32 ct 1389 -41 1393 -53 1393 -71 ct p ef
1612 -122 m  1612 -81 1604 -50 1590 -29 ct 1576 -8 1555 3 1527 3 ct 1499 3 1478 -8 1464 -29 ct 
1450 -50 1443 -81 1443 -122 ct 1443 -164 1450 -195 1463 -216 ct 1477 -237 1498 -247 1528 -247 ct 
1556 -247 1578 -236 1591 -215 ct 1605 -194 1612 -163 1612 -122 ct p
1580 -122 m  1580 -157 1576 -182 1568 -198 ct 1560 -214 1546 -222 1528 -222 ct 
1509 -222 1495 -214 1487 -199 ct 1478 -183 1474 -158 1474 -122 ct 1474 -88 1478 -62 1487 -46 ct 
1495 -30 1509 -22 1527 -22 ct 1545 -22 1559 -31 1567 -47 ct 1576 -63 1580 -88 1580 -122 ct 
p ef
pom
pum
10457 19914 t
181 -68 m  181 -45 174 -28 159 -16 ct 145 -3 125 3 98 3 ct 74 3 54 -3 40 -14 ct 
25 -25 16 -41 13 -63 ct 46 -66 l  50 -37 67 -23 98 -23 ct 114 -23 126 -27 135 -34 ct 
144 -42 149 -54 149 -69 ct 149 -82 143 -92 133 -100 ct 123 -107 108 -111 89 -111 ct 
72 -111 l  72 -138 l  89 -138 l  106 -138 119 -142 128 -149 ct 138 -156 142 -167 142 -180 ct 
142 -193 138 -203 131 -210 ct 123 -218 112 -221 97 -221 ct 83 -221 72 -218 64 -211 ct 
55 -204 50 -194 49 -182 ct 18 -184 l  20 -204 28 -219 42 -230 ct 57 -241 75 -247 97 -247 ct 
121 -247 140 -241 154 -230 ct 167 -219 174 -203 174 -183 ct 174 -167 170 -155 161 -145 ct 
152 -135 140 -129 123 -125 ct 123 -125 l  141 -123 156 -117 166 -106 ct 176 -96 181 -83 181 -68 ct 
p ef
366 -68 m  366 -45 359 -28 344 -16 ct 330 -3 310 3 283 3 ct 259 3 239 -3 225 -14 ct 
210 -25 201 -41 198 -63 ct 231 -66 l  235 -37 252 -23 283 -23 ct 299 -23 311 -27 320 -34 ct 
329 -42 334 -54 334 -69 ct 334 -82 328 -92 318 -100 ct 308 -107 293 -111 274 -111 ct 
257 -111 l  257 -138 l  274 -138 l  291 -138 304 -142 313 -149 ct 323 -156 327 -167 327 -180 ct 
327 -193 323 -203 316 -210 ct 308 -218 297 -221 282 -221 ct 268 -221 257 -218 249 -211 ct 
240 -204 235 -194 234 -182 ct 203 -184 l  205 -204 213 -219 227 -230 ct 242 -241 260 -247 282 -247 ct 
306 -247 325 -241 339 -230 ct 352 -219 359 -203 359 -183 ct 359 -167 355 -155 346 -145 ct 
337 -135 325 -129 308 -125 ct 308 -125 l  326 -123 341 -117 351 -106 ct 361 -96 366 -83 366 -68 ct 
p ef
551 -80 m  551 -54 544 -34 530 -19 ct 516 -4 497 3 472 3 ct 445 3 424 -7 410 -28 ct 
395 -48 388 -77 388 -116 ct 388 -158 395 -191 411 -213 ct 426 -236 447 -247 475 -247 ct 
511 -247 535 -231 544 -198 ct 514 -192 l  508 -212 495 -222 474 -222 ct 457 -222 443 -214 433 -197 ct 
424 -181 419 -157 419 -126 ct 424 -136 432 -144 443 -150 ct 453 -155 465 -158 478 -158 ct 
500 -158 518 -151 531 -137 ct 544 -123 551 -104 551 -80 ct p
519 -79 m  519 -96 515 -110 506 -120 ct 498 -129 486 -134 470 -134 ct 456 -134 444 -130 435 -121 ct 
426 -113 422 -101 422 -86 ct 422 -67 427 -52 436 -40 ct 445 -28 457 -22 471 -22 ct 
486 -22 498 -27 507 -37 ct 515 -47 519 -61 519 -79 ct p ef
739 -122 m  739 -81 731 -50 717 -29 ct 703 -8 682 3 654 3 ct 626 3 605 -8 591 -29 ct 
577 -50 570 -81 570 -122 ct 570 -164 577 -195 590 -216 ct 604 -237 625 -247 655 -247 ct 
683 -247 705 -236 718 -215 ct 732 -194 739 -163 739 -122 ct p
707 -122 m  707 -157 703 -182 695 -198 ct 687 -214 673 -222 655 -222 ct 636 -222 622 -214 614 -199 ct 
605 -183 601 -158 601 -122 ct 601 -88 605 -62 614 -46 ct 622 -30 636 -22 654 -22 ct 
672 -22 686 -31 694 -47 ct 703 -63 707 -88 707 -122 ct p ef
820 -192 m  865 -210 l  873 -187 l  824 -175 l  856 -131 l  836 -119 l 
810 -164 l  783 -119 l  762 -132 l  795 -175 l  747 -187 l  754 -210 l 
800 -192 l  798 -243 l  822 -243 l  820 -192 l  p ef
1054 -68 m  1054 -45 1047 -28 1032 -16 ct 1018 -3 998 3 971 3 ct 947 3 927 -3 913 -14 ct 
898 -25 889 -41 886 -63 ct 919 -66 l  923 -37 940 -23 971 -23 ct 987 -23 999 -27 1008 -34 ct 
1017 -42 1022 -54 1022 -69 ct 1022 -82 1016 -92 1006 -100 ct 996 -107 981 -111 962 -111 ct 
945 -111 l  945 -138 l  962 -138 l  979 -138 992 -142 1001 -149 ct 1011 -156 1015 -167 1015 -180 ct 
1015 -193 1011 -203 1004 -210 ct 996 -218 985 -221 970 -221 ct 956 -221 945 -218 937 -211 ct 
928 -204 923 -194 922 -182 ct 891 -184 l  893 -204 901 -219 915 -230 ct 930 -241 948 -247 970 -247 ct 
994 -247 1013 -241 1027 -230 ct 1040 -219 1047 -203 1047 -183 ct 1047 -167 1043 -155 1034 -145 ct 
1025 -135 1013 -129 996 -125 ct 996 -125 l  1014 -123 1029 -117 1039 -106 ct 
1049 -96 1054 -83 1054 -68 ct p ef
1239 -68 m  1239 -45 1232 -28 1217 -16 ct 1203 -3 1183 3 1156 3 ct 1132 3 1112 -3 1098 -14 ct 
1083 -25 1074 -41 1071 -63 ct 1104 -66 l  1108 -37 1125 -23 1156 -23 ct 1172 -23 1184 -27 1193 -34 ct 
1202 -42 1207 -54 1207 -69 ct 1207 -82 1201 -92 1191 -100 ct 1181 -107 1166 -111 1147 -111 ct 
1130 -111 l  1130 -138 l  1147 -138 l  1164 -138 1177 -142 1186 -149 ct 1196 -156 1200 -167 1200 -180 ct 
1200 -193 1196 -203 1189 -210 ct 1181 -218 1170 -221 1155 -221 ct 1141 -221 1130 -218 1122 -211 ct 
1113 -204 1108 -194 1107 -182 ct 1076 -184 l  1078 -204 1086 -219 1100 -230 ct 
1115 -241 1133 -247 1155 -247 ct 1179 -247 1198 -241 1212 -230 ct 1225 -219 1232 -203 1232 -183 ct 
1232 -167 1228 -155 1219 -145 ct 1210 -135 1198 -129 1181 -125 ct 1181 -125 l 
1199 -123 1214 -117 1224 -106 ct 1234 -96 1239 -83 1239 -68 ct p ef
1425 -80 m  1425 -54 1418 -34 1404 -19 ct 1390 -4 1371 3 1346 3 ct 1319 3 1298 -7 1284 -28 ct 
1269 -48 1262 -77 1262 -116 ct 1262 -158 1269 -191 1285 -213 ct 1300 -236 1321 -247 1349 -247 ct 
1385 -247 1409 -231 1418 -198 ct 1388 -192 l  1382 -212 1369 -222 1348 -222 ct 
1331 -222 1317 -214 1307 -197 ct 1298 -181 1293 -157 1293 -126 ct 1298 -136 1306 -144 1317 -150 ct 
1327 -155 1339 -158 1352 -158 ct 1374 -158 1392 -151 1405 -137 ct 1418 -123 1425 -104 1425 -80 ct 
p
1393 -79 m  1393 -96 1389 -110 1380 -120 ct 1372 -129 1360 -134 1344 -134 ct 
1330 -134 1318 -130 1309 -121 ct 1300 -113 1296 -101 1296 -86 ct 1296 -67 1301 -52 1310 -40 ct 
1319 -28 1331 -22 1345 -22 ct 1360 -22 1372 -27 1381 -37 ct 1389 -47 1393 -61 1393 -79 ct 
p ef
1612 -122 m  1612 -81 1604 -50 1590 -29 ct 1576 -8 1555 3 1527 3 ct 1499 3 1478 -8 1464 -29 ct 
1450 -50 1443 -81 1443 -122 ct 1443 -164 1450 -195 1463 -216 ct 1477 -237 1498 -247 1528 -247 ct 
1556 -247 1578 -236 1591 -215 ct 1605 -194 1612 -163 1612 -122 ct p
1580 -122 m  1580 -157 1576 -182 1568 -198 ct 1560 -214 1546 -222 1528 -222 ct 
1509 -222 1495 -214 1487 -199 ct 1478 -183 1474 -158 1474 -122 ct 1474 -88 1478 -62 1487 -46 ct 
1495 -30 1509 -22 1527 -22 ct 1545 -22 1559 -31 1567 -47 ct 1576 -63 1580 -88 1580 -122 ct 
p ef
pom
pum
12805 19914 t
181 -80 m  181 -54 174 -34 160 -19 ct 146 -4 127 3 102 3 ct 75 3 54 -7 40 -28 ct 
25 -48 18 -77 18 -116 ct 18 -158 25 -191 41 -213 ct 56 -236 77 -247 105 -247 ct 
141 -247 165 -231 174 -198 ct 144 -192 l  138 -212 125 -222 104 -222 ct 87 -222 73 -214 63 -197 ct 
54 -181 49 -157 49 -126 ct 54 -136 62 -144 73 -150 ct 83 -155 95 -158 108 -158 ct 
130 -158 148 -151 161 -137 ct 174 -123 181 -104 181 -80 ct p
149 -79 m  149 -96 145 -110 136 -120 ct 128 -129 116 -134 100 -134 ct 86 -134 74 -130 65 -121 ct 
56 -113 52 -101 52 -86 ct 52 -67 57 -52 66 -40 ct 75 -28 87 -22 101 -22 ct 116 -22 128 -27 137 -37 ct 
145 -47 149 -61 149 -79 ct p ef
364 -218 m  339 -180 321 -151 311 -129 ct 301 -108 293 -86 288 -65 ct 283 -45 280 -23 280 -1 ct 
248 -1 l  248 -32 254 -64 268 -98 ct 281 -133 303 -172 334 -217 ct 203 -217 l 
203 -243 l  364 -243 l  364 -218 l  p ef
388 0 m  388 -22 l  394 -35 401 -47 409 -58 ct 418 -68 427 -77 436 -85 ct 445 -94 454 -101 464 -109 ct 
473 -116 481 -123 488 -130 ct 496 -137 502 -145 506 -152 ct 511 -160 513 -169 513 -179 ct 
513 -192 509 -203 501 -210 ct 493 -217 483 -221 469 -221 ct 455 -221 444 -217 436 -210 ct 
427 -203 422 -193 421 -180 ct 389 -183 l  391 -202 400 -218 414 -229 ct 428 -241 446 -247 469 -247 ct 
493 -247 512 -241 525 -229 ct 538 -218 545 -201 545 -180 ct 545 -171 543 -161 538 -152 ct 
534 -143 528 -133 519 -124 ct 511 -115 494 -100 470 -81 ct 457 -70 447 -60 439 -51 ct 
431 -43 425 -34 422 -26 ct 549 -26 l  549 0 l  388 0 l  p ef
739 -122 m  739 -81 731 -50 717 -29 ct 703 -8 682 3 654 3 ct 626 3 605 -8 591 -29 ct 
577 -50 570 -81 570 -122 ct 570 -164 577 -195 590 -216 ct 604 -237 625 -247 655 -247 ct 
683 -247 705 -236 718 -215 ct 732 -194 739 -163 739 -122 ct p
707 -122 m  707 -157 703 -182 695 -198 ct 687 -214 673 -222 655 -222 ct 636 -222 622 -214 614 -199 ct 
605 -183 601 -158 601 -122 ct 601 -88 605 -62 614 -46 ct 622 -30 636 -22 654 -22 ct 
672 -22 686 -31 694 -47 ct 703 -63 707 -88 707 -122 ct p ef
820 -192 m  865 -210 l  873 -187 l  824 -175 l  856 -131 l  836 -119 l 
810 -164 l  783 -119 l  762 -132 l  795 -175 l  747 -187 l  754 -210 l 
800 -192 l  798 -243 l  822 -243 l  820 -192 l  p ef
1054 -80 m  1054 -54 1047 -34 1033 -19 ct 1019 -4 1000 3 975 3 ct 948 3 927 -7 913 -28 ct 
898 -48 891 -77 891 -116 ct 891 -158 898 -191 914 -213 ct 929 -236 950 -247 978 -247 ct 
1014 -247 1038 -231 1047 -198 ct 1017 -192 l  1011 -212 998 -222 977 -222 ct 
960 -222 946 -214 936 -197 ct 927 -181 922 -157 922 -126 ct 927 -136 935 -144 946 -150 ct 
956 -155 968 -158 981 -158 ct 1003 -158 1021 -151 1034 -137 ct 1047 -123 1054 -104 1054 -80 ct 
p
1022 -79 m  1022 -96 1018 -110 1009 -120 ct 1001 -129 989 -134 973 -134 ct 959 -134 947 -130 938 -121 ct 
929 -113 925 -101 925 -86 ct 925 -67 930 -52 939 -40 ct 948 -28 960 -22 974 -22 ct 
989 -22 1001 -27 1010 -37 ct 1018 -47 1022 -61 1022 -79 ct p ef
1237 -218 m  1212 -180 1194 -151 1184 -129 ct 1174 -108 1166 -86 1161 -65 ct 
1156 -45 1153 -23 1153 -1 ct 1121 -1 l  1121 -32 1127 -64 1141 -98 ct 1154 -133 1176 -172 1207 -217 ct 
1076 -217 l  1076 -243 l  1237 -243 l  1237 -218 l  p ef
1262 0 m  1262 -22 l  1268 -35 1275 -47 1283 -58 ct 1292 -68 1301 -77 1310 -85 ct 
1319 -94 1328 -101 1338 -109 ct 1347 -116 1355 -123 1362 -130 ct 1370 -137 1376 -145 1380 -152 ct 
1385 -160 1387 -169 1387 -179 ct 1387 -192 1383 -203 1375 -210 ct 1367 -217 1357 -221 1343 -221 ct 
1329 -221 1318 -217 1310 -210 ct 1301 -203 1296 -193 1295 -180 ct 1263 -183 l 
1265 -202 1274 -218 1288 -229 ct 1302 -241 1320 -247 1343 -247 ct 1367 -247 1386 -241 1399 -229 ct 
1412 -218 1419 -201 1419 -180 ct 1419 -171 1417 -161 1412 -152 ct 1408 -143 1402 -133 1393 -124 ct 
1385 -115 1368 -100 1344 -81 ct 1331 -70 1321 -60 1313 -51 ct 1305 -43 1299 -34 1296 -26 ct 
1423 -26 l  1423 0 l  1262 0 l  p ef
1612 -122 m  1612 -81 1604 -50 1590 -29 ct 1576 -8 1555 3 1527 3 ct 1499 3 1478 -8 1464 -29 ct 
1450 -50 1443 -81 1443 -122 ct 1443 -164 1450 -195 1463 -216 ct 1477 -237 1498 -247 1528 -247 ct 
1556 -247 1578 -236 1591 -215 ct 1605 -194 1612 -163 1612 -122 ct p
1580 -122 m  1580 -157 1576 -182 1568 -198 ct 1560 -214 1546 -222 1528 -222 ct 
1509 -222 1495 -214 1487 -199 ct 1478 -183 1474 -158 1474 -122 ct 1474 -88 1478 -62 1487 -46 ct 
1495 -30 1509 -22 1527 -22 ct 1545 -22 1559 -31 1567 -47 ct 1576 -63 1580 -88 1580 -122 ct 
p ef
pom
pum
14968 19914 t
27 0 m  27 -26 l  89 -26 l  89 -213 l  34 -174 l  34 -204 l  91 -243 l 
120 -243 l  120 -26 l  179 -26 l  179 0 l  27 0 l  p ef
366 -68 m  366 -45 359 -28 344 -16 ct 330 -3 310 3 283 3 ct 259 3 239 -3 225 -14 ct 
210 -25 201 -41 198 -63 ct 231 -66 l  235 -37 252 -23 283 -23 ct 299 -23 311 -27 320 -34 ct 
329 -42 334 -54 334 -69 ct 334 -82 328 -92 318 -100 ct 308 -107 293 -111 274 -111 ct 
257 -111 l  257 -138 l  274 -138 l  291 -138 304 -142 313 -149 ct 323 -156 327 -167 327 -180 ct 
327 -193 323 -203 316 -210 ct 308 -218 297 -221 282 -221 ct 268 -221 257 -218 249 -211 ct 
240 -204 235 -194 234 -182 ct 203 -184 l  205 -204 213 -219 227 -230 ct 242 -241 260 -247 282 -247 ct 
306 -247 325 -241 339 -230 ct 352 -219 359 -203 359 -183 ct 359 -167 355 -155 346 -145 ct 
337 -135 325 -129 308 -125 ct 308 -125 l  326 -123 341 -117 351 -106 ct 361 -96 366 -83 366 -68 ct 
p ef
522 -55 m  522 0 l  493 0 l  493 -55 l  378 -55 l  378 -79 l  489 -243 l 
522 -243 l  522 -79 l  556 -79 l  556 -55 l  522 -55 l  p
493 -208 m  492 -207 491 -204 488 -199 ct 485 -193 483 -190 481 -187 ct 419 -96 l 
409 -83 l  407 -79 l  493 -79 l  493 -208 l  p ef
708 -55 m  708 0 l  679 0 l  679 -55 l  564 -55 l  564 -79 l  675 -243 l 
708 -243 l  708 -79 l  742 -79 l  742 -55 l  708 -55 l  p
679 -208 m  678 -207 677 -204 674 -199 ct 671 -193 669 -190 667 -187 ct 605 -96 l 
595 -83 l  593 -79 l  679 -79 l  679 -208 l  p ef
924 -122 m  924 -81 916 -50 902 -29 ct 888 -8 867 3 839 3 ct 811 3 790 -8 776 -29 ct 
762 -50 755 -81 755 -122 ct 755 -164 762 -195 775 -216 ct 789 -237 810 -247 840 -247 ct 
868 -247 890 -236 903 -215 ct 917 -194 924 -163 924 -122 ct p
892 -122 m  892 -157 888 -182 880 -198 ct 872 -214 858 -222 840 -222 ct 821 -222 807 -214 799 -199 ct 
790 -183 786 -158 786 -122 ct 786 -88 790 -62 799 -46 ct 807 -30 821 -22 839 -22 ct 
857 -22 871 -31 879 -47 ct 888 -63 892 -88 892 -122 ct p ef
1005 -192 m  1050 -210 l  1058 -187 l  1009 -175 l  1041 -131 l  1021 -119 l 
995 -164 l  968 -119 l  947 -132 l  980 -175 l  932 -187 l  939 -210 l 
985 -192 l  983 -243 l  1007 -243 l  1005 -192 l  p ef
1085 0 m  1085 -26 l  1147 -26 l  1147 -213 l  1092 -174 l  1092 -204 l 
1149 -243 l  1178 -243 l  1178 -26 l  1237 -26 l  1237 0 l  1085 0 l  p ef
1425 -68 m  1425 -45 1418 -28 1403 -16 ct 1389 -3 1369 3 1342 3 ct 1318 3 1298 -3 1284 -14 ct 
1269 -25 1260 -41 1257 -63 ct 1290 -66 l  1294 -37 1311 -23 1342 -23 ct 1358 -23 1370 -27 1379 -34 ct 
1388 -42 1393 -54 1393 -69 ct 1393 -82 1387 -92 1377 -100 ct 1367 -107 1352 -111 1333 -111 ct 
1316 -111 l  1316 -138 l  1333 -138 l  1350 -138 1363 -142 1372 -149 ct 1382 -156 1386 -167 1386 -180 ct 
1386 -193 1382 -203 1375 -210 ct 1367 -218 1356 -221 1341 -221 ct 1327 -221 1316 -218 1308 -211 ct 
1299 -204 1294 -194 1293 -182 ct 1262 -184 l  1264 -204 1272 -219 1286 -230 ct 
1301 -241 1319 -247 1341 -247 ct 1365 -247 1384 -241 1398 -230 ct 1411 -219 1418 -203 1418 -183 ct 
1418 -167 1414 -155 1405 -145 ct 1396 -135 1384 -129 1367 -125 ct 1367 -125 l 
1385 -123 1400 -117 1410 -106 ct 1420 -96 1425 -83 1425 -68 ct p ef
1581 -55 m  1581 0 l  1552 0 l  1552 -55 l  1437 -55 l  1437 -79 l  1548 -243 l 
1581 -243 l  1581 -79 l  1615 -79 l  1615 -55 l  1581 -55 l  p
1552 -208 m  1551 -207 1550 -204 1547 -199 ct 1544 -193 1542 -190 1540 -187 ct 
1478 -96 l  1468 -83 l  1466 -79 l  1552 -79 l  1552 -208 l  p ef
1766 -55 m  1766 0 l  1737 0 l  1737 -55 l  1622 -55 l  1622 -79 l  1733 -243 l 
1766 -243 l  1766 -79 l  1800 -79 l  1800 -55 l  1766 -55 l  p
1737 -208 m  1736 -207 1735 -204 1732 -199 ct 1729 -193 1727 -190 1725 -187 ct 
1663 -96 l  1653 -83 l  1651 -79 l  1737 -79 l  1737 -208 l  p ef
1982 -122 m  1982 -81 1974 -50 1960 -29 ct 1946 -8 1925 3 1897 3 ct 1869 3 1848 -8 1834 -29 ct 
1820 -50 1813 -81 1813 -122 ct 1813 -164 1820 -195 1833 -216 ct 1847 -237 1868 -247 1898 -247 ct 
1926 -247 1948 -236 1961 -215 ct 1975 -194 1982 -163 1982 -122 ct p
1950 -122 m  1950 -157 1946 -182 1938 -198 ct 1930 -214 1916 -222 1898 -222 ct 
1879 -222 1865 -214 1857 -199 ct 1848 -183 1844 -158 1844 -122 ct 1844 -88 1848 -62 1857 -46 ct 
1865 -30 1879 -22 1897 -22 ct 1915 -22 1929 -31 1937 -47 ct 1946 -63 1950 -88 1950 -122 ct 
p ef
pom
pum
17316 19914 t
18 0 m  18 -22 l  24 -35 31 -47 39 -58 ct 48 -68 57 -77 66 -85 ct 75 -94 84 -101 94 -109 ct 
103 -116 111 -123 118 -130 ct 126 -137 132 -145 136 -152 ct 141 -160 143 -169 143 -179 ct 
143 -192 139 -203 131 -210 ct 123 -217 113 -221 99 -221 ct 85 -221 74 -217 66 -210 ct 
57 -203 52 -193 51 -180 ct 19 -183 l  21 -202 30 -218 44 -229 ct 58 -241 76 -247 99 -247 ct 
123 -247 142 -241 155 -229 ct 168 -218 175 -201 175 -180 ct 175 -171 173 -161 168 -152 ct 
164 -143 158 -133 149 -124 ct 141 -115 124 -100 100 -81 ct 87 -70 77 -60 69 -51 ct 
61 -43 55 -34 52 -26 ct 179 -26 l  179 0 l  18 0 l  p ef
366 -80 m  366 -54 359 -34 345 -19 ct 331 -4 312 3 287 3 ct 260 3 239 -7 225 -28 ct 
210 -48 203 -77 203 -116 ct 203 -158 210 -191 226 -213 ct 241 -236 262 -247 290 -247 ct 
326 -247 350 -231 359 -198 ct 329 -192 l  323 -212 310 -222 289 -222 ct 272 -222 258 -214 248 -197 ct 
239 -181 234 -157 234 -126 ct 239 -136 247 -144 258 -150 ct 268 -155 280 -158 293 -158 ct 
315 -158 333 -151 346 -137 ct 359 -123 366 -104 366 -80 ct p
334 -79 m  334 -96 330 -110 321 -120 ct 313 -129 301 -134 285 -134 ct 271 -134 259 -130 250 -121 ct 
241 -113 237 -101 237 -86 ct 237 -67 242 -52 251 -40 ct 260 -28 272 -22 286 -22 ct 
301 -22 313 -27 322 -37 ct 330 -47 334 -61 334 -79 ct p ef
551 -68 m  551 -46 544 -28 530 -16 ct 515 -3 495 3 468 3 ct 442 3 422 -3 407 -15 ct 
393 -28 385 -45 385 -68 ct 385 -84 390 -97 399 -108 ct 408 -119 420 -125 434 -128 ct 
434 -128 l  421 -131 410 -138 402 -148 ct 395 -159 391 -171 391 -185 ct 391 -203 398 -218 412 -230 ct 
426 -241 444 -247 468 -247 ct 491 -247 510 -241 524 -230 ct 538 -219 545 -204 545 -184 ct 
545 -171 541 -158 533 -148 ct 526 -138 515 -131 502 -129 ct 502 -128 l  517 -125 529 -119 538 -108 ct 
547 -98 551 -84 551 -68 ct p
513 -183 m  513 -210 498 -224 468 -224 ct 453 -224 442 -220 434 -214 ct 427 -207 423 -196 423 -183 ct 
423 -169 427 -158 435 -151 ct 442 -144 454 -140 468 -140 ct 483 -140 494 -143 501 -150 ct 
509 -157 513 -168 513 -183 ct p
519 -71 m  519 -86 514 -98 505 -105 ct 496 -113 484 -117 468 -117 ct 452 -117 440 -113 431 -104 ct 
422 -96 417 -85 417 -70 ct 417 -37 434 -20 469 -20 ct 485 -20 498 -24 506 -32 ct 
515 -41 519 -53 519 -71 ct p ef
737 -68 m  737 -46 730 -28 716 -16 ct 701 -3 681 3 654 3 ct 628 3 608 -3 593 -15 ct 
579 -28 571 -45 571 -68 ct 571 -84 576 -97 585 -108 ct 594 -119 606 -125 620 -128 ct 
620 -128 l  607 -131 596 -138 588 -148 ct 581 -159 577 -171 577 -185 ct 577 -203 584 -218 598 -230 ct 
612 -241 630 -247 654 -247 ct 677 -247 696 -241 710 -230 ct 724 -219 731 -204 731 -184 ct 
731 -171 727 -158 719 -148 ct 712 -138 701 -131 688 -129 ct 688 -128 l  703 -125 715 -119 724 -108 ct 
733 -98 737 -84 737 -68 ct p
699 -183 m  699 -210 684 -224 654 -224 ct 639 -224 628 -220 620 -214 ct 613 -207 609 -196 609 -183 ct 
609 -169 613 -158 621 -151 ct 628 -144 640 -140 654 -140 ct 669 -140 680 -143 687 -150 ct 
695 -157 699 -168 699 -183 ct p
705 -71 m  705 -86 700 -98 691 -105 ct 682 -113 670 -117 654 -117 ct 638 -117 626 -113 617 -104 ct 
608 -96 603 -85 603 -70 ct 603 -37 620 -20 655 -20 ct 671 -20 684 -24 692 -32 ct 
701 -41 705 -53 705 -71 ct p ef
924 -122 m  924 -81 916 -50 902 -29 ct 888 -8 867 3 839 3 ct 811 3 790 -8 776 -29 ct 
762 -50 755 -81 755 -122 ct 755 -164 762 -195 775 -216 ct 789 -237 810 -247 840 -247 ct 
868 -247 890 -236 903 -215 ct 917 -194 924 -163 924 -122 ct p
892 -122 m  892 -157 888 -182 880 -198 ct 872 -214 858 -222 840 -222 ct 821 -222 807 -214 799 -199 ct 
790 -183 786 -158 786 -122 ct 786 -88 790 -62 799 -46 ct 807 -30 821 -22 839 -22 ct 
857 -22 871 -31 879 -47 ct 888 -63 892 -88 892 -122 ct p ef
1005 -192 m  1050 -210 l  1058 -187 l  1009 -175 l  1041 -131 l  1021 -119 l 
995 -164 l  968 -119 l  947 -132 l  980 -175 l  932 -187 l  939 -210 l 
985 -192 l  983 -243 l  1007 -243 l  1005 -192 l  p ef
1076 0 m  1076 -22 l  1082 -35 1089 -47 1097 -58 ct 1106 -68 1115 -77 1124 -85 ct 
1133 -94 1142 -101 1152 -109 ct 1161 -116 1169 -123 1176 -130 ct 1184 -137 1190 -145 1194 -152 ct 
1199 -160 1201 -169 1201 -179 ct 1201 -192 1197 -203 1189 -210 ct 1181 -217 1171 -221 1157 -221 ct 
1143 -221 1132 -217 1124 -210 ct 1115 -203 1110 -193 1109 -180 ct 1077 -183 l 
1079 -202 1088 -218 1102 -229 ct 1116 -241 1134 -247 1157 -247 ct 1181 -247 1200 -241 1213 -229 ct 
1226 -218 1233 -201 1233 -180 ct 1233 -171 1231 -161 1226 -152 ct 1222 -143 1216 -133 1207 -124 ct 
1199 -115 1182 -100 1158 -81 ct 1145 -70 1135 -60 1127 -51 ct 1119 -43 1113 -34 1110 -26 ct 
1237 -26 l  1237 0 l  1076 0 l  p ef
1425 -80 m  1425 -54 1418 -34 1404 -19 ct 1390 -4 1371 3 1346 3 ct 1319 3 1298 -7 1284 -28 ct 
1269 -48 1262 -77 1262 -116 ct 1262 -158 1269 -191 1285 -213 ct 1300 -236 1321 -247 1349 -247 ct 
1385 -247 1409 -231 1418 -198 ct 1388 -192 l  1382 -212 1369 -222 1348 -222 ct 
1331 -222 1317 -214 1307 -197 ct 1298 -181 1293 -157 1293 -126 ct 1298 -136 1306 -144 1317 -150 ct 
1327 -155 1339 -158 1352 -158 ct 1374 -158 1392 -151 1405 -137 ct 1418 -123 1425 -104 1425 -80 ct 
p
1393 -79 m  1393 -96 1389 -110 1380 -120 ct 1372 -129 1360 -134 1344 -134 ct 
1330 -134 1318 -130 1309 -121 ct 1300 -113 1296 -101 1296 -86 ct 1296 -67 1301 -52 1310 -40 ct 
1319 -28 1331 -22 1345 -22 ct 1360 -22 1372 -27 1381 -37 ct 1389 -47 1393 -61 1393 -79 ct 
p ef
1610 -68 m  1610 -46 1603 -28 1589 -16 ct 1574 -3 1554 3 1527 3 ct 1501 3 1481 -3 1466 -15 ct 
1452 -28 1444 -45 1444 -68 ct 1444 -84 1449 -97 1458 -108 ct 1467 -119 1479 -125 1493 -128 ct 
1493 -128 l  1480 -131 1469 -138 1461 -148 ct 1454 -159 1450 -171 1450 -185 ct 
1450 -203 1457 -218 1471 -230 ct 1485 -241 1503 -247 1527 -247 ct 1550 -247 1569 -241 1583 -230 ct 
1597 -219 1604 -204 1604 -184 ct 1604 -171 1600 -158 1592 -148 ct 1585 -138 1574 -131 1561 -129 ct 
1561 -128 l  1576 -125 1588 -119 1597 -108 ct 1606 -98 1610 -84 1610 -68 ct 
p
1572 -183 m  1572 -210 1557 -224 1527 -224 ct 1512 -224 1501 -220 1493 -214 ct 
1486 -207 1482 -196 1482 -183 ct 1482 -169 1486 -158 1494 -151 ct 1501 -144 1513 -140 1527 -140 ct 
1542 -140 1553 -143 1560 -150 ct 1568 -157 1572 -168 1572 -183 ct p
1578 -71 m  1578 -86 1573 -98 1564 -105 ct 1555 -113 1543 -117 1527 -117 ct 
1511 -117 1499 -113 1490 -104 ct 1481 -96 1476 -85 1476 -70 ct 1476 -37 1493 -20 1528 -20 ct 
1544 -20 1557 -24 1565 -32 ct 1574 -41 1578 -53 1578 -71 ct p ef
1795 -68 m  1795 -46 1788 -28 1774 -16 ct 1759 -3 1739 3 1712 3 ct 1686 3 1666 -3 1651 -15 ct 
1637 -28 1629 -45 1629 -68 ct 1629 -84 1634 -97 1643 -108 ct 1652 -119 1664 -125 1678 -128 ct 
1678 -128 l  1665 -131 1654 -138 1646 -148 ct 1639 -159 1635 -171 1635 -185 ct 
1635 -203 1642 -218 1656 -230 ct 1670 -241 1688 -247 1712 -247 ct 1735 -247 1754 -241 1768 -230 ct 
1782 -219 1789 -204 1789 -184 ct 1789 -171 1785 -158 1777 -148 ct 1770 -138 1759 -131 1746 -129 ct 
1746 -128 l  1761 -125 1773 -119 1782 -108 ct 1791 -98 1795 -84 1795 -68 ct 
p
1757 -183 m  1757 -210 1742 -224 1712 -224 ct 1697 -224 1686 -220 1678 -214 ct 
1671 -207 1667 -196 1667 -183 ct 1667 -169 1671 -158 1679 -151 ct 1686 -144 1698 -140 1712 -140 ct 
1727 -140 1738 -143 1745 -150 ct 1753 -157 1757 -168 1757 -183 ct p
1763 -71 m  1763 -86 1758 -98 1749 -105 ct 1740 -113 1728 -117 1712 -117 ct 
1696 -117 1684 -113 1675 -104 ct 1666 -96 1661 -85 1661 -70 ct 1661 -37 1678 -20 1713 -20 ct 
1729 -20 1742 -24 1750 -32 ct 1759 -41 1763 -53 1763 -71 ct p ef
1982 -122 m  1982 -81 1974 -50 1960 -29 ct 1946 -8 1925 3 1897 3 ct 1869 3 1848 -8 1834 -29 ct 
1820 -50 1813 -81 1813 -122 ct 1813 -164 1820 -195 1833 -216 ct 1847 -237 1868 -247 1898 -247 ct 
1926 -247 1948 -236 1961 -215 ct 1975 -194 1982 -163 1982 -122 ct p
1950 -122 m  1950 -157 1946 -182 1938 -198 ct 1930 -214 1916 -222 1898 -222 ct 
1879 -222 1865 -214 1857 -199 ct 1848 -183 1844 -158 1844 -122 ct 1844 -88 1848 -62 1857 -46 ct 
1865 -30 1879 -22 1897 -22 ct 1915 -22 1929 -31 1937 -47 ct 1946 -63 1950 -88 1950 -122 ct 
p ef
pom
pum
6284 19617 t
183 -122 m  183 -81 175 -50 161 -29 ct 147 -8 126 3 98 3 ct 70 3 49 -8 35 -29 ct 
21 -50 14 -81 14 -122 ct 14 -164 21 -195 34 -216 ct 48 -237 69 -247 99 -247 ct 
127 -247 149 -236 162 -215 ct 176 -194 183 -163 183 -122 ct p
151 -122 m  151 -157 147 -182 139 -198 ct 131 -214 117 -222 99 -222 ct 80 -222 66 -214 58 -199 ct 
49 -183 45 -158 45 -122 ct 45 -88 49 -62 58 -46 ct 66 -30 80 -22 98 -22 ct 116 -22 130 -31 138 -47 ct 
147 -63 151 -88 151 -122 ct p ef
pom
pum
5993 18665 t
183 -122 m  183 -81 175 -50 161 -29 ct 147 -8 126 3 98 3 ct 70 3 49 -8 35 -29 ct 
21 -50 14 -81 14 -122 ct 14 -164 21 -195 34 -216 ct 48 -237 69 -247 99 -247 ct 
127 -247 149 -236 162 -215 ct 176 -194 183 -163 183 -122 ct p
151 -122 m  151 -157 147 -182 139 -198 ct 131 -214 117 -222 99 -222 ct 80 -222 66 -214 58 -199 ct 
49 -183 45 -158 45 -122 ct 45 -88 49 -62 58 -46 ct 66 -30 80 -22 98 -22 ct 116 -22 130 -31 138 -47 ct 
147 -63 151 -88 151 -122 ct p ef
217 0 m  217 -38 l  251 -38 l  251 0 l  217 0 l  p ef
309 0 m  309 -22 l  315 -35 322 -47 330 -58 ct 339 -68 348 -77 357 -85 ct 366 -94 375 -101 385 -109 ct 
394 -116 402 -123 409 -130 ct 417 -137 423 -145 427 -152 ct 432 -160 434 -169 434 -179 ct 
434 -192 430 -203 422 -210 ct 414 -217 404 -221 390 -221 ct 376 -221 365 -217 357 -210 ct 
348 -203 343 -193 342 -180 ct 310 -183 l  312 -202 321 -218 335 -229 ct 349 -241 367 -247 390 -247 ct 
414 -247 433 -241 446 -229 ct 459 -218 466 -201 466 -180 ct 466 -171 464 -161 459 -152 ct 
455 -143 449 -133 440 -124 ct 432 -115 415 -100 391 -81 ct 378 -70 368 -60 360 -51 ct 
352 -43 346 -34 343 -26 ct 470 -26 l  470 0 l  309 0 l  p ef
pom
pum
5993 17714 t
183 -122 m  183 -81 175 -50 161 -29 ct 147 -8 126 3 98 3 ct 70 3 49 -8 35 -29 ct 
21 -50 14 -81 14 -122 ct 14 -164 21 -195 34 -216 ct 48 -237 69 -247 99 -247 ct 
127 -247 149 -236 162 -215 ct 176 -194 183 -163 183 -122 ct p
151 -122 m  151 -157 147 -182 139 -198 ct 131 -214 117 -222 99 -222 ct 80 -222 66 -214 58 -199 ct 
49 -183 45 -158 45 -122 ct 45 -88 49 -62 58 -46 ct 66 -30 80 -22 98 -22 ct 116 -22 130 -31 138 -47 ct 
147 -63 151 -88 151 -122 ct p ef
217 0 m  217 -38 l  251 -38 l  251 0 l  217 0 l  p ef
443 -55 m  443 0 l  414 0 l  414 -55 l  299 -55 l  299 -79 l  410 -243 l 
443 -243 l  443 -79 l  477 -79 l  477 -55 l  443 -55 l  p
414 -208 m  413 -207 412 -204 409 -199 ct 406 -193 404 -190 402 -187 ct 340 -96 l 
330 -83 l  328 -79 l  414 -79 l  414 -208 l  p ef
pom
pum
5993 16763 t
183 -122 m  183 -81 175 -50 161 -29 ct 147 -8 126 3 98 3 ct 70 3 49 -8 35 -29 ct 
21 -50 14 -81 14 -122 ct 14 -164 21 -195 34 -216 ct 48 -237 69 -247 99 -247 ct 
127 -247 149 -236 162 -215 ct 176 -194 183 -163 183 -122 ct p
151 -122 m  151 -157 147 -182 139 -198 ct 131 -214 117 -222 99 -222 ct 80 -222 66 -214 58 -199 ct 
49 -183 45 -158 45 -122 ct 45 -88 49 -62 58 -46 ct 66 -30 80 -22 98 -22 ct 116 -22 130 -31 138 -47 ct 
147 -63 151 -88 151 -122 ct p ef
217 0 m  217 -38 l  251 -38 l  251 0 l  217 0 l  p ef
472 -80 m  472 -54 465 -34 451 -19 ct 437 -4 418 3 393 3 ct 366 3 345 -7 331 -28 ct 
316 -48 309 -77 309 -116 ct 309 -158 316 -191 332 -213 ct 347 -236 368 -247 396 -247 ct 
432 -247 456 -231 465 -198 ct 435 -192 l  429 -212 416 -222 395 -222 ct 378 -222 364 -214 354 -197 ct 
345 -181 340 -157 340 -126 ct 345 -136 353 -144 364 -150 ct 374 -155 386 -158 399 -158 ct 
421 -158 439 -151 452 -137 ct 465 -123 472 -104 472 -80 ct p
440 -79 m  440 -96 436 -110 427 -120 ct 419 -129 407 -134 391 -134 ct 377 -134 365 -130 356 -121 ct 
347 -113 343 -101 343 -86 ct 343 -67 348 -52 357 -40 ct 366 -28 378 -22 392 -22 ct 
407 -22 419 -27 428 -37 ct 436 -47 440 -61 440 -79 ct p ef
pom
pum
5993 15812 t
183 -122 m  183 -81 175 -50 161 -29 ct 147 -8 126 3 98 3 ct 70 3 49 -8 35 -29 ct 
21 -50 14 -81 14 -122 ct 14 -164 21 -195 34 -216 ct 48 -237 69 -247 99 -247 ct 
127 -247 149 -236 162 -215 ct 176 -194 183 -163 183 -122 ct p
151 -122 m  151 -157 147 -182 139 -198 ct 131 -214 117 -222 99 -222 ct 80 -222 66 -214 58 -199 ct 
49 -183 45 -158 45 -122 ct 45 -88 49 -62 58 -46 ct 66 -30 80 -22 98 -22 ct 116 -22 130 -31 138 -47 ct 
147 -63 151 -88 151 -122 ct p ef
217 0 m  217 -38 l  251 -38 l  251 0 l  217 0 l  p ef
472 -68 m  472 -46 465 -28 451 -16 ct 436 -3 416 3 389 3 ct 363 3 343 -3 328 -15 ct 
314 -28 306 -45 306 -68 ct 306 -84 311 -97 320 -108 ct 329 -119 341 -125 355 -128 ct 
355 -128 l  342 -131 331 -138 323 -148 ct 316 -159 312 -171 312 -185 ct 312 -203 319 -218 333 -230 ct 
347 -241 365 -247 389 -247 ct 412 -247 431 -241 445 -230 ct 459 -219 466 -204 466 -184 ct 
466 -171 462 -158 454 -148 ct 447 -138 436 -131 423 -129 ct 423 -128 l  438 -125 450 -119 459 -108 ct 
468 -98 472 -84 472 -68 ct p
434 -183 m  434 -210 419 -224 389 -224 ct 374 -224 363 -220 355 -214 ct 348 -207 344 -196 344 -183 ct 
344 -169 348 -158 356 -151 ct 363 -144 375 -140 389 -140 ct 404 -140 415 -143 422 -150 ct 
430 -157 434 -168 434 -183 ct p
440 -71 m  440 -86 435 -98 426 -105 ct 417 -113 405 -117 389 -117 ct 373 -117 361 -113 352 -104 ct 
343 -96 338 -85 338 -70 ct 338 -37 355 -20 390 -20 ct 406 -20 419 -24 427 -32 ct 
436 -41 440 -53 440 -71 ct p ef
pom
pum
6284 14861 t
27 0 m  27 -26 l  89 -26 l  89 -213 l  34 -174 l  34 -204 l  91 -243 l 
120 -243 l  120 -26 l  179 -26 l  179 0 l  27 0 l  p ef
pom
pum
5993 13909 t
27 0 m  27 -26 l  89 -26 l  89 -213 l  34 -174 l  34 -204 l  91 -243 l 
120 -243 l  120 -26 l  179 -26 l  179 0 l  27 0 l  p ef
217 0 m  217 -38 l  251 -38 l  251 0 l  217 0 l  p ef
309 0 m  309 -22 l  315 -35 322 -47 330 -58 ct 339 -68 348 -77 357 -85 ct 366 -94 375 -101 385 -109 ct 
394 -116 402 -123 409 -130 ct 417 -137 423 -145 427 -152 ct 432 -160 434 -169 434 -179 ct 
434 -192 430 -203 422 -210 ct 414 -217 404 -221 390 -221 ct 376 -221 365 -217 357 -210 ct 
348 -203 343 -193 342 -180 ct 310 -183 l  312 -202 321 -218 335 -229 ct 349 -241 367 -247 390 -247 ct 
414 -247 433 -241 446 -229 ct 459 -218 466 -201 466 -180 ct 466 -171 464 -161 459 -152 ct 
455 -143 449 -133 440 -124 ct 432 -115 415 -100 391 -81 ct 378 -70 368 -60 360 -51 ct 
352 -43 346 -34 343 -26 ct 470 -26 l  470 0 l  309 0 l  p ef
pom
pum
11997 12272 t
38 0 m  38 -316 l  277 -316 l  277 -281 l  80 -281 l  80 -180 l  264 -180 l 
264 -145 l  80 -145 l  80 -35 l  286 -35 l  286 0 l  38 0 l  p ef
372 -213 m  372 0 l  332 0 l  332 -213 l  298 -213 l  298 -242 l  332 -242 l 
332 -270 l  332 -292 336 -308 346 -317 ct 356 -327 371 -332 391 -332 ct 402 -332 411 -331 419 -329 ct 
419 -299 l  412 -300 407 -300 401 -300 ct 391 -300 383 -298 379 -293 ct 374 -287 372 -278 372 -264 ct 
372 -242 l  419 -242 l  419 -213 l  372 -213 l  p ef
504 -213 m  504 0 l  464 0 l  464 -213 l  430 -213 l  430 -242 l  464 -242 l 
464 -270 l  464 -292 468 -308 478 -317 ct 488 -327 503 -332 523 -332 ct 534 -332 543 -331 551 -329 ct 
551 -299 l  544 -300 539 -300 533 -300 ct 523 -300 515 -298 511 -293 ct 506 -287 504 -278 504 -264 ct 
504 -242 l  551 -242 l  551 -213 l  504 -213 l  p ef
587 -293 m  587 -332 l  627 -332 l  627 -293 l  587 -293 l  p
587 1 m  587 -242 l  627 -242 l  627 1 l  587 1 l  p ef
723 -123 m  723 -91 728 -67 738 -51 ct 748 -36 763 -28 784 -28 ct 798 -28 810 -32 820 -39 ct 
829 -47 835 -59 838 -75 ct 878 -73 l  875 -49 865 -31 849 -17 ct 832 -3 811 4 785 4 ct 
751 4 725 -7 707 -28 ct 689 -50 681 -81 681 -122 ct 681 -163 689 -194 707 -215 ct 
725 -237 751 -248 784 -248 ct 809 -248 830 -241 846 -228 ct 863 -215 873 -198 877 -175 ct 
836 -172 l  834 -186 828 -196 820 -204 ct 811 -212 799 -216 783 -216 ct 762 -216 747 -209 737 -195 ct 
727 -180 723 -157 723 -123 ct p ef
931 -293 m  931 -332 l  971 -332 l  971 -293 l  931 -293 l  p
931 1 m  931 -242 l  971 -242 l  971 1 l  931 1 l  p ef
1067 -113 m  1067 -85 1073 -64 1084 -49 ct 1096 -34 1112 -26 1135 -26 ct 1152 -26 1166 -30 1177 -37 ct 
1187 -44 1194 -53 1198 -63 ct 1233 -53 l  1219 -15 1186 4 1135 4 ct 1099 4 1071 -7 1053 -28 ct 
1034 -49 1025 -81 1025 -123 ct 1025 -164 1034 -194 1053 -216 ct 1071 -237 1098 -248 1133 -248 ct 
1204 -248 1240 -205 1240 -118 ct 1240 -113 l  1067 -113 l  p
1198 -144 m  1196 -170 1189 -188 1179 -200 ct 1168 -212 1152 -218 1132 -218 ct 
1113 -218 1097 -211 1086 -198 ct 1074 -185 1068 -167 1067 -144 ct 1198 -144 l 
p ef
1429 0 m  1429 -154 l  1429 -170 1427 -182 1424 -191 ct 1421 -200 1416 -206 1409 -210 ct 
1402 -214 1392 -216 1379 -216 ct 1360 -216 1344 -209 1333 -196 ct 1322 -183 1316 -164 1316 -141 ct 
1316 0 l  1276 0 l  1276 -191 l  1276 -219 1275 -236 1274 -243 ct 1313 -243 l 
1313 -242 1313 -240 1313 -236 ct 1313 -233 1313 -229 1314 -225 ct 1314 -221 1314 -213 1314 -201 ct 
1315 -201 l  1324 -218 1335 -230 1347 -237 ct 1359 -244 1375 -247 1393 -247 ct 
1419 -247 1439 -240 1451 -227 ct 1463 -214 1469 -192 1469 -162 ct 1469 0 l  1429 0 l 
p ef
1544 -123 m  1544 -91 1549 -67 1559 -51 ct 1569 -36 1584 -28 1605 -28 ct 1619 -28 1631 -32 1641 -39 ct 
1650 -47 1656 -59 1659 -75 ct 1699 -73 l  1696 -49 1686 -31 1670 -17 ct 1653 -3 1632 4 1606 4 ct 
1572 4 1546 -7 1528 -28 ct 1510 -50 1502 -81 1502 -122 ct 1502 -163 1510 -194 1528 -215 ct 
1546 -237 1572 -248 1605 -248 ct 1630 -248 1651 -241 1667 -228 ct 1684 -215 1694 -198 1698 -175 ct 
1657 -172 l  1655 -186 1649 -196 1641 -204 ct 1632 -212 1620 -216 1604 -216 ct 
1583 -216 1568 -209 1558 -195 ct 1548 -180 1544 -157 1544 -123 ct p ef
1763 95 m  1752 95 1742 94 1735 93 ct 1735 62 l  1741 63 1747 64 1754 64 ct 
1779 64 1799 45 1813 8 ct 1817 -1 l  1721 -243 l  1764 -243 l  1815 -109 l 
1816 -107 1817 -104 1818 -101 ct 1819 -99 1822 -89 1828 -72 ct 1834 -56 1837 -46 1837 -44 ct 
1853 -89 l  1906 -243 l  1949 -243 l  1855 0 l  1845 26 1836 45 1827 57 ct 
1819 70 1809 79 1799 86 ct 1788 92 1776 95 1763 95 ct p ef
pom
pum
11587 13198 t
259 0 m  259 -178 l  259 -198 259 -217 261 -235 ct 254 -212 249 -195 244 -182 ct 
175 0 l  149 0 l  80 -182 l  69 -214 l  63 -235 l  63 -214 l  64 -178 l 
64 0 l  32 0 l  32 -267 l  79 -267 l  150 -82 l  153 -74 155 -66 158 -58 ct 
160 -49 162 -43 162 -39 ct 163 -44 165 -52 169 -62 ct 172 -73 174 -79 175 -82 ct 
245 -267 l  291 -267 l  291 0 l  259 0 l  p ef
556 -187 m  556 -161 548 -141 532 -126 ct 515 -111 493 -104 464 -104 ct 386 -104 l 
386 0 l  350 0 l  350 -267 l  462 -267 l  492 -267 515 -260 532 -246 ct 548 -232 556 -212 556 -187 ct 
p
520 -186 m  520 -221 499 -238 458 -238 ct 386 -238 l  386 -133 l  459 -133 l 
500 -133 520 -151 520 -186 ct p ef
618 0 m  618 -267 l  654 -267 l  654 0 l  618 0 l  p ef
761 -42 m  761 -10 l  761 4 760 15 757 24 ct 755 33 751 41 746 50 ct 723 50 l 
735 32 741 16 741 0 ct 724 0 l  724 -42 l  761 -42 l  p ef
1063 0 m  1063 -1 1063 -6 1062 -15 ct 1062 -24 1062 -31 1061 -36 ct 1061 -36 l 
1053 -21 1045 -11 1037 -5 ct 1028 1 1018 4 1005 4 ct 995 4 986 2 978 -2 ct 970 -6 965 -12 961 -19 ct 
960 -19 l  960 -14 961 -6 961 4 ct 961 75 l  926 75 l  926 -205 l  961 -205 l 
961 -83 l  961 -63 965 -47 973 -38 ct 981 -28 993 -23 1009 -23 ct 1025 -23 1037 -29 1046 -40 ct 
1055 -52 1060 -68 1060 -88 ct 1060 -205 l  1094 -205 l  1094 -44 l  1094 -20 1094 -5 1095 0 ct 
1063 0 l  p ef
1224 -21 m  1235 -21 1246 -24 1257 -30 ct 1267 -36 1276 -43 1284 -52 ct 1304 -33 l 
1293 -21 1282 -12 1268 -5 ct 1254 1 1239 4 1222 4 ct 1199 4 1182 -1 1170 -12 ct 
1157 -22 1151 -37 1151 -56 ct 1151 -70 1156 -81 1165 -91 ct 1175 -100 1187 -106 1201 -107 ct 
1201 -107 l  1188 -109 1177 -114 1169 -122 ct 1161 -131 1158 -142 1158 -154 ct 
1158 -171 1164 -184 1177 -194 ct 1190 -204 1206 -209 1227 -209 ct 1259 -209 1283 -197 1298 -174 ct 
1274 -157 l  1263 -175 1247 -184 1227 -184 ct 1216 -184 1207 -181 1201 -176 ct 
1195 -170 1192 -163 1192 -153 ct 1192 -142 1197 -133 1207 -128 ct 1217 -123 1234 -120 1260 -120 ct 
1260 -94 l  1240 -94 1226 -93 1216 -91 ct 1207 -88 1199 -84 1194 -79 ct 1189 -73 1187 -66 1187 -56 ct 
1187 -45 1190 -37 1197 -31 ct 1204 -25 1213 -21 1224 -21 ct p ef
1650 0 m  1580 -111 l  1497 -111 l  1497 0 l  1461 0 l  1461 -267 l  1586 -267 l 
1617 -267 1640 -260 1656 -247 ct 1672 -233 1681 -215 1681 -191 ct 1681 -171 1675 -154 1663 -141 ct 
1652 -127 1636 -119 1615 -115 ct 1691 0 l  1650 0 l  p
1644 -190 m  1644 -206 1639 -218 1628 -226 ct 1618 -234 1603 -238 1583 -238 ct 
1497 -238 l  1497 -140 l  1584 -140 l  1603 -140 1618 -144 1629 -153 ct 1639 -162 1644 -174 1644 -190 ct 
p ef
1772 -95 m  1772 -72 1777 -53 1787 -41 ct 1797 -28 1811 -22 1830 -22 ct 1844 -22 1856 -25 1865 -31 ct 
1874 -36 1880 -44 1883 -53 ct 1913 -45 l  1901 -12 1873 4 1830 4 ct 1799 4 1776 -5 1760 -23 ct 
1744 -41 1736 -68 1736 -104 ct 1736 -138 1744 -164 1760 -182 ct 1776 -200 1799 -209 1828 -209 ct 
1888 -209 1919 -173 1919 -100 ct 1919 -95 l  1772 -95 l  p
1883 -121 m  1881 -143 1876 -159 1867 -169 ct 1858 -179 1845 -184 1828 -184 ct 
1811 -184 1798 -178 1788 -167 ct 1779 -156 1773 -141 1773 -121 ct 1883 -121 l 
p ef
2087 -32 m  2080 -19 2072 -10 2061 -4 ct 2051 2 2038 4 2023 4 ct 1997 4 1978 -4 1966 -22 ct 
1953 -39 1947 -66 1947 -101 ct 1947 -172 1972 -208 2023 -208 ct 2038 -208 2051 -205 2062 -200 ct 
2072 -194 2080 -185 2087 -173 ct 2087 -173 l  2087 -196 l  2087 -281 l  2121 -281 l 
2121 -42 l  2121 -20 2121 -6 2122 1 ct 2089 1 l  2089 -1 2088 -6 2088 -13 ct 
2088 -21 2087 -27 2087 -32 ct 2087 -32 l  p
1983 -102 m  1983 -73 1987 -53 1994 -41 ct 2002 -28 2014 -22 2031 -22 ct 2051 -22 2065 -29 2073 -42 ct 
2082 -55 2087 -76 2087 -104 ct 2087 -132 2082 -151 2073 -164 ct 2065 -177 2051 -183 2032 -183 ct 
2015 -183 2002 -177 1995 -164 ct 1987 -151 1983 -131 1983 -102 ct p ef
2202 -205 m  2202 -75 l  2202 -61 2204 -51 2206 -43 ct 2209 -36 2213 -31 2219 -27 ct 
2225 -24 2234 -22 2245 -22 ct 2261 -22 2274 -28 2284 -39 ct 2293 -51 2298 -66 2298 -86 ct 
2298 -205 l  2332 -205 l  2332 -44 l  2332 -20 2332 -5 2333 0 ct 2301 0 l 
2301 0 2301 -2 2300 -5 ct 2300 -8 2300 -11 2300 -15 ct 2300 -18 2300 -25 2299 -35 ct 
2299 -35 l  2291 -21 2282 -11 2272 -5 ct 2261 1 2248 4 2233 4 ct 2211 4 2194 -2 2184 -13 ct 
2173 -24 2168 -42 2168 -68 ct 2168 -205 l  2202 -205 l  p ef
2407 -103 m  2407 -76 2411 -56 2420 -43 ct 2429 -30 2442 -23 2459 -23 ct 2471 -23 2481 -26 2489 -33 ct 
2497 -39 2502 -49 2504 -63 ct 2539 -61 l  2536 -41 2528 -25 2514 -14 ct 2499 -2 2482 4 2460 4 ct 
2431 4 2409 -5 2394 -23 ct 2379 -41 2371 -68 2371 -103 ct 2371 -137 2379 -163 2394 -182 ct 
2409 -200 2431 -209 2459 -209 ct 2480 -209 2498 -203 2512 -192 ct 2525 -182 2534 -167 2538 -148 ct 
2503 -145 l  2501 -156 2496 -165 2489 -172 ct 2482 -179 2472 -182 2458 -182 ct 
2440 -182 2427 -176 2419 -164 ct 2411 -152 2407 -132 2407 -103 ct p ef
2618 -95 m  2618 -72 2623 -53 2633 -41 ct 2643 -28 2657 -22 2676 -22 ct 2690 -22 2702 -25 2711 -31 ct 
2720 -36 2726 -44 2729 -53 ct 2759 -45 l  2747 -12 2719 4 2676 4 ct 2645 4 2622 -5 2606 -23 ct 
2590 -41 2582 -68 2582 -104 ct 2582 -138 2590 -164 2606 -182 ct 2622 -200 2645 -209 2674 -209 ct 
2734 -209 2765 -173 2765 -100 ct 2765 -95 l  2618 -95 l  p
2729 -121 m  2727 -143 2722 -159 2713 -169 ct 2704 -179 2691 -184 2674 -184 ct 
2657 -184 2644 -178 2634 -167 ct 2625 -156 2619 -141 2619 -121 ct 2729 -121 l 
p ef
pom
gs
52.99683 lw 1 lj 0.261 0.523 0.957 c 19751 14569 m  20551 14569 l  ps
gr
gs
52.99683 lw 1 lj 0.917 0.265 0.210 c 19751 15067 m  20551 15067 l  ps
gr
gs
52.99683 lw 1 lj 0.984 0.738 0.019 c 19751 15565 m  20551 15565 l  ps
gr
gs
52.99683 lw 1 lj 0.207 0.660 0.328 c 19751 16063 m  20551 16063 l  ps
gr
gs
52.99683 lw 1 lj 1.000 0.429 0.007 c 19751 16560 m  20551 16560 l  ps
gr
gs
52.99683 lw 1 lj 0.277 0.742 0.777 c 19751 17058 m  20551 17058 l  ps
gr
gs
52.99683 lw 1 lj 0.484 0.667 0.968 c 19751 17556 m  20551 17556 l  ps
gr
gs
52.99683 lw 1 lj 0.941 0.484 0.449 c 19751 18054 m  20551 18054 l  ps
gr
pum
20651 14689 t
0.105 0.105 0.105 c 27 0 m  27 -26 l  89 -26 l  89 -213 l  34 -174 l  34 -204 l 
91 -243 l  120 -243 l  120 -26 l  179 -26 l  179 0 l  27 0 l  p ef
pom
pum
20651 15187 t
18 0 m  18 -22 l  24 -35 31 -47 39 -58 ct 48 -68 57 -77 66 -85 ct 75 -94 84 -101 94 -109 ct 
103 -116 111 -123 118 -130 ct 126 -137 132 -145 136 -152 ct 141 -160 143 -169 143 -179 ct 
143 -192 139 -203 131 -210 ct 123 -217 113 -221 99 -221 ct 85 -221 74 -217 66 -210 ct 
57 -203 52 -193 51 -180 ct 19 -183 l  21 -202 30 -218 44 -229 ct 58 -241 76 -247 99 -247 ct 
123 -247 142 -241 155 -229 ct 168 -218 175 -201 175 -180 ct 175 -171 173 -161 168 -152 ct 
164 -143 158 -133 149 -124 ct 141 -115 124 -100 100 -81 ct 87 -70 77 -60 69 -51 ct 
61 -43 55 -34 52 -26 ct 179 -26 l  179 0 l  18 0 l  p ef
pom
pum
20651 15685 t
152 -55 m  152 0 l  123 0 l  123 -55 l  8 -55 l  8 -79 l  119 -243 l  152 -243 l 
152 -79 l  186 -79 l  186 -55 l  152 -55 l  p
123 -208 m  122 -207 121 -204 118 -199 ct 115 -193 113 -190 111 -187 ct 49 -96 l 
39 -83 l  37 -79 l  123 -79 l  123 -208 l  p ef
pom
pum
20651 16183 t
181 -68 m  181 -46 174 -28 160 -16 ct 145 -3 125 3 98 3 ct 72 3 52 -3 37 -15 ct 
23 -28 15 -45 15 -68 ct 15 -84 20 -97 29 -108 ct 38 -119 50 -125 64 -128 ct 64 -128 l 
51 -131 40 -138 32 -148 ct 25 -159 21 -171 21 -185 ct 21 -203 28 -218 42 -230 ct 
56 -241 74 -247 98 -247 ct 121 -247 140 -241 154 -230 ct 168 -219 175 -204 175 -184 ct 
175 -171 171 -158 163 -148 ct 156 -138 145 -131 132 -129 ct 132 -128 l  147 -125 159 -119 168 -108 ct 
177 -98 181 -84 181 -68 ct p
143 -183 m  143 -210 128 -224 98 -224 ct 83 -224 72 -220 64 -214 ct 57 -207 53 -196 53 -183 ct 
53 -169 57 -158 65 -151 ct 72 -144 84 -140 98 -140 ct 113 -140 124 -143 131 -150 ct 
139 -157 143 -168 143 -183 ct p
149 -71 m  149 -86 144 -98 135 -105 ct 126 -113 114 -117 98 -117 ct 82 -117 70 -113 61 -104 ct 
52 -96 47 -85 47 -70 ct 47 -37 64 -20 99 -20 ct 115 -20 128 -24 136 -32 ct 145 -41 149 -53 149 -71 ct 
p ef
pom
pum
20651 16680 t
27 0 m  27 -26 l  89 -26 l  89 -213 l  34 -174 l  34 -204 l  91 -243 l 
120 -243 l  120 -26 l  179 -26 l  179 0 l  27 0 l  p ef
366 -80 m  366 -54 359 -34 345 -19 ct 331 -4 312 3 287 3 ct 260 3 239 -7 225 -28 ct 
210 -48 203 -77 203 -116 ct 203 -158 210 -191 226 -213 ct 241 -236 262 -247 290 -247 ct 
326 -247 350 -231 359 -198 ct 329 -192 l  323 -212 310 -222 289 -222 ct 272 -222 258 -214 248 -197 ct 
239 -181 234 -157 234 -126 ct 239 -136 247 -144 258 -150 ct 268 -155 280 -158 293 -158 ct 
315 -158 333 -151 346 -137 ct 359 -123 366 -104 366 -80 ct p
334 -79 m  334 -96 330 -110 321 -120 ct 313 -129 301 -134 285 -134 ct 271 -134 259 -130 250 -121 ct 
241 -113 237 -101 237 -86 ct 237 -67 242 -52 251 -40 ct 260 -28 272 -22 286 -22 ct 
301 -22 313 -27 322 -37 ct 330 -47 334 -61 334 -79 ct p ef
pom
pum
20651 17178 t
181 -68 m  181 -45 174 -28 159 -16 ct 145 -3 125 3 98 3 ct 74 3 54 -3 40 -14 ct 
25 -25 16 -41 13 -63 ct 46 -66 l  50 -37 67 -23 98 -23 ct 114 -23 126 -27 135 -34 ct 
144 -42 149 -54 149 -69 ct 149 -82 143 -92 133 -100 ct 123 -107 108 -111 89 -111 ct 
72 -111 l  72 -138 l  89 -138 l  106 -138 119 -142 128 -149 ct 138 -156 142 -167 142 -180 ct 
142 -193 138 -203 131 -210 ct 123 -218 112 -221 97 -221 ct 83 -221 72 -218 64 -211 ct 
55 -204 50 -194 49 -182 ct 18 -184 l  20 -204 28 -219 42 -230 ct 57 -241 75 -247 97 -247 ct 
121 -247 140 -241 154 -230 ct 167 -219 174 -203 174 -183 ct 174 -167 170 -155 161 -145 ct 
152 -135 140 -129 123 -125 ct 123 -125 l  141 -123 156 -117 166 -106 ct 176 -96 181 -83 181 -68 ct 
p ef
203 0 m  203 -22 l  209 -35 216 -47 224 -58 ct 233 -68 242 -77 251 -85 ct 260 -94 269 -101 279 -109 ct 
288 -116 296 -123 303 -130 ct 311 -137 317 -145 321 -152 ct 326 -160 328 -169 328 -179 ct 
328 -192 324 -203 316 -210 ct 308 -217 298 -221 284 -221 ct 270 -221 259 -217 251 -210 ct 
242 -203 237 -193 236 -180 ct 204 -183 l  206 -202 215 -218 229 -229 ct 243 -241 261 -247 284 -247 ct 
308 -247 327 -241 340 -229 ct 353 -218 360 -201 360 -180 ct 360 -171 358 -161 353 -152 ct 
349 -143 343 -133 334 -124 ct 326 -115 309 -100 285 -81 ct 272 -70 262 -60 254 -51 ct 
246 -43 240 -34 237 -26 ct 364 -26 l  364 0 l  203 0 l  p ef
pom
pum
20651 17676 t
181 -80 m  181 -54 174 -34 160 -19 ct 146 -4 127 3 102 3 ct 75 3 54 -7 40 -28 ct 
25 -48 18 -77 18 -116 ct 18 -158 25 -191 41 -213 ct 56 -236 77 -247 105 -247 ct 
141 -247 165 -231 174 -198 ct 144 -192 l  138 -212 125 -222 104 -222 ct 87 -222 73 -214 63 -197 ct 
54 -181 49 -157 49 -126 ct 54 -136 62 -144 73 -150 ct 83 -155 95 -158 108 -158 ct 
130 -158 148 -151 161 -137 ct 174 -123 181 -104 181 -80 ct p
149 -79 m  149 -96 145 -110 136 -120 ct 128 -129 116 -134 100 -134 ct 86 -134 74 -130 65 -121 ct 
56 -113 52 -101 52 -86 ct 52 -67 57 -52 66 -40 ct 75 -28 87 -22 101 -22 ct 116 -22 128 -27 137 -37 ct 
145 -47 149 -61 149 -79 ct p ef
337 -55 m  337 0 l  308 0 l  308 -55 l  193 -55 l  193 -79 l  304 -243 l 
337 -243 l  337 -79 l  371 -79 l  371 -55 l  337 -55 l  p
308 -208 m  307 -207 306 -204 303 -199 ct 300 -193 298 -190 296 -187 ct 234 -96 l 
224 -83 l  222 -79 l  308 -79 l  308 -208 l  p ef
pom
pum
20651 18174 t
181 -68 m  181 -46 174 -28 160 -16 ct 145 -3 125 3 98 3 ct 72 3 52 -3 37 -15 ct 
23 -28 15 -45 15 -68 ct 15 -84 20 -97 29 -108 ct 38 -119 50 -125 64 -128 ct 64 -128 l 
51 -131 40 -138 32 -148 ct 25 -159 21 -171 21 -185 ct 21 -203 28 -218 42 -230 ct 
56 -241 74 -247 98 -247 ct 121 -247 140 -241 154 -230 ct 168 -219 175 -204 175 -184 ct 
175 -171 171 -158 163 -148 ct 156 -138 145 -131 132 -129 ct 132 -128 l  147 -125 159 -119 168 -108 ct 
177 -98 181 -84 181 -68 ct p
143 -183 m  143 -210 128 -224 98 -224 ct 83 -224 72 -220 64 -214 ct 57 -207 53 -196 53 -183 ct 
53 -169 57 -158 65 -151 ct 72 -144 84 -140 98 -140 ct 113 -140 124 -143 131 -150 ct 
139 -157 143 -168 143 -183 ct p
149 -71 m  149 -86 144 -98 135 -105 ct 126 -113 114 -117 98 -117 ct 82 -117 70 -113 61 -104 ct 
52 -96 47 -85 47 -70 ct 47 -37 64 -20 99 -20 ct 115 -20 128 -24 136 -32 ct 145 -41 149 -53 149 -71 ct 
p ef
368 -122 m  368 -81 360 -50 346 -29 ct 332 -8 311 3 283 3 ct 255 3 234 -8 220 -29 ct 
206 -50 199 -81 199 -122 ct 199 -164 206 -195 219 -216 ct 233 -237 254 -247 284 -247 ct 
312 -247 334 -236 347 -215 ct 361 -194 368 -163 368 -122 ct p
336 -122 m  336 -157 332 -182 324 -198 ct 316 -214 302 -222 284 -222 ct 265 -222 251 -214 243 -199 ct 
234 -183 230 -158 230 -122 ct 230 -88 234 -62 243 -46 ct 251 -30 265 -22 283 -22 ct 
301 -22 315 -31 323 -47 ct 332 -63 336 -88 336 -122 ct p ef
pom
pum
9078 20616 t
0.003 0.003 0.003 c 208 0 m  238 -153 l  241 -168 245 -186 250 -208 ct 238 -182 l 
229 -162 223 -148 219 -141 ct 148 0 l  112 0 l  95 -141 l  92 -175 89 -197 88 -208 ct 
85 -180 83 -162 81 -153 ct 51 0 l  6 0 l  53 -243 l  122 -243 l  137 -107 l 
141 -60 l  145 -69 149 -77 153 -85 ct 156 -92 183 -145 233 -243 ct 300 -243 l 
253 0 l  208 0 l  p ef
371 -30 m  381 -30 390 -32 399 -37 ct 407 -41 416 -47 424 -54 ct 446 -28 l  434 -17 422 -9 409 -4 ct 
396 1 381 3 363 3 ct 343 3 327 -2 314 -12 ct 302 -22 295 -35 295 -51 ct 295 -65 300 -76 310 -85 ct 
319 -93 333 -99 351 -100 ct 351 -101 l  341 -104 333 -109 327 -115 ct 322 -122 319 -130 319 -140 ct 
319 -156 325 -168 339 -177 ct 352 -186 371 -191 395 -191 ct 412 -191 426 -188 437 -182 ct 
448 -176 457 -166 463 -154 ct 430 -139 l  423 -153 411 -160 395 -160 ct 385 -160 378 -158 372 -154 ct 
367 -150 364 -145 364 -138 ct 364 -130 369 -124 377 -119 ct 386 -115 399 -113 416 -113 ct 
411 -83 l  393 -83 379 -82 371 -80 ct 363 -78 357 -75 352 -71 ct 348 -66 346 -61 346 -53 ct 
346 -46 348 -41 352 -36 ct 357 -32 363 -30 371 -30 ct p
385 -205 m  386 -210 l  408 -261 l  452 -261 l  451 -254 l  403 -205 l 
385 -205 l  p ef
469 -187 m  518 -187 l  532 -88 l  533 -81 533 -72 534 -59 ct 535 -47 535 -38 535 -33 ct 
539 -44 545 -59 554 -78 ct 610 -187 l  662 -187 l  560 -10 l  544 17 532 44 522 73 ct 
472 73 l  481 48 492 23 504 -2 ct 469 -187 l  p ef
715 -30 m  725 -30 734 -32 743 -37 ct 751 -41 760 -47 768 -54 ct 790 -28 l  778 -17 766 -9 753 -4 ct 
740 1 725 3 707 3 ct 687 3 671 -2 658 -12 ct 646 -22 639 -35 639 -51 ct 639 -65 644 -76 654 -85 ct 
663 -93 677 -99 695 -100 ct 695 -101 l  685 -104 677 -109 671 -115 ct 666 -122 663 -130 663 -140 ct 
663 -156 669 -168 683 -177 ct 696 -186 715 -191 739 -191 ct 756 -191 770 -188 781 -182 ct 
792 -176 801 -166 807 -154 ct 774 -139 l  767 -153 755 -160 739 -160 ct 729 -160 722 -158 716 -154 ct 
711 -150 708 -145 708 -138 ct 708 -130 713 -124 721 -119 ct 730 -115 743 -113 760 -113 ct 
755 -83 l  737 -83 723 -82 715 -80 ct 707 -78 701 -75 696 -71 ct 692 -66 690 -61 690 -53 ct 
690 -46 692 -41 696 -36 ct 701 -32 707 -30 715 -30 ct p ef
921 -256 m  963 -256 984 -230 984 -177 ct 984 -158 981 -135 975 -109 ct 969 -84 962 -63 952 -46 ct 
943 -29 932 -17 919 -9 ct 906 0 891 4 875 4 ct 855 4 839 -4 829 -18 ct 818 -33 813 -53 813 -79 ct 
813 -98 816 -121 822 -145 ct 828 -170 835 -191 844 -207 ct 854 -224 864 -236 877 -244 ct 
890 -252 904 -256 921 -256 ct p
881 -28 m  892 -28 901 -35 909 -48 ct 916 -62 922 -82 927 -111 ct 862 -111 l 
859 -94 857 -80 857 -69 ct 857 -42 865 -28 881 -28 ct p
914 -224 m  903 -224 894 -218 887 -205 ct 879 -192 873 -172 868 -144 ct 933 -144 l 
937 -160 939 -173 939 -183 ct 939 -210 931 -224 914 -224 ct p ef
1183 -118 m  1183 -94 1179 -73 1169 -55 ct 1160 -36 1147 -22 1129 -12 ct 1112 -2 1093 3 1071 3 ct 
1046 3 1026 -4 1012 -17 ct 997 -31 990 -49 990 -73 ct 990 -96 994 -116 1004 -134 ct 
1013 -152 1026 -166 1043 -175 ct 1059 -185 1079 -190 1100 -190 ct 1127 -190 1148 -184 1162 -171 ct 
1176 -159 1183 -141 1183 -118 ct p
1133 -114 m  1133 -143 1121 -157 1097 -157 ct 1084 -157 1073 -154 1065 -147 ct 
1058 -140 1052 -129 1047 -115 ct 1043 -101 1041 -88 1041 -75 ct 1041 -45 1053 -30 1077 -30 ct 
1089 -30 1100 -33 1107 -40 ct 1115 -46 1121 -56 1125 -69 ct 1129 -83 1132 -98 1133 -114 ct 
p ef
1319 -191 m  1346 -191 1365 -182 1378 -164 ct 1350 -139 l  1341 -152 1330 -158 1317 -158 ct 
1309 -158 1301 -156 1294 -151 ct 1286 -146 1280 -140 1273 -131 ct 1267 -122 1262 -113 1258 -102 ct 
1254 -91 1252 -81 1252 -74 ct 1252 -64 1254 -57 1260 -52 ct 1266 -47 1277 -42 1294 -37 ct 
1300 -35 1307 -33 1313 -30 ct 1320 -28 1326 -25 1332 -22 ct 1337 -18 1342 -14 1345 -9 ct 
1349 -3 1350 3 1350 11 ct 1350 31 1341 51 1322 69 ct 1295 52 l  1301 46 1305 40 1307 36 ct 
1308 32 1309 28 1309 24 ct 1309 21 1308 17 1306 15 ct 1303 12 1299 10 1293 8 ct 
1288 5 1277 2 1262 -2 ct 1241 -7 1226 -15 1217 -23 ct 1208 -32 1204 -44 1204 -58 ct 
1204 -73 1207 -89 1214 -106 ct 1220 -122 1229 -137 1240 -150 ct 1250 -163 1262 -173 1276 -180 ct 
1289 -187 1304 -191 1319 -191 ct p ef
1590 -154 m  1586 -133 l  1582 -111 1576 -89 1570 -68 ct 1563 -47 1554 -25 1543 0 ct 
1494 0 l  1504 -24 1511 -41 1516 -53 ct 1520 -65 1525 -78 1528 -91 ct 1532 -103 1535 -117 1538 -131 ct 
1543 -154 l  1533 -154 1525 -154 1517 -152 ct 1510 -151 1504 -149 1501 -148 ct 
1508 -182 l  1511 -183 1516 -185 1523 -186 ct 1529 -187 1535 -187 1540 -187 ct 
1737 -187 l  1730 -154 l  1690 -154 l  1671 -57 l  1670 -53 1670 -50 1670 -47 ct 
1670 -36 1675 -31 1686 -31 ct 1689 -31 1694 -32 1700 -33 ct 1704 -33 l  1698 -2 l 
1694 -1 1689 1 1682 2 ct 1675 3 1669 3 1663 3 ct 1650 3 1639 -1 1632 -8 ct 1625 -15 1621 -25 1621 -38 ct 
1621 -45 1622 -52 1624 -59 ct 1642 -154 l  1590 -154 l  p ef
1844 -190 m  1868 -190 1887 -183 1902 -169 ct 1916 -155 1923 -135 1923 -109 ct 
1923 -88 1919 -69 1911 -52 ct 1903 -34 1893 -21 1878 -11 ct 1864 -2 1848 3 1830 3 ct 
1818 3 1808 1 1800 -3 ct 1793 -7 1786 -13 1781 -21 ct 1780 -21 l  1777 0 l  1763 73 l 
1712 73 l  1746 -100 l  1751 -131 1763 -154 1779 -168 ct 1795 -183 1817 -190 1844 -190 ct 
p
1841 -157 m  1817 -157 1802 -138 1795 -99 ct 1787 -50 l  1791 -44 1797 -39 1803 -36 ct 
1810 -32 1817 -30 1824 -30 ct 1839 -30 1850 -38 1859 -53 ct 1868 -68 1873 -87 1873 -110 ct 
1873 -125 1870 -137 1864 -145 ct 1859 -153 1851 -157 1841 -157 ct p ef
2135 -118 m  2135 -94 2131 -73 2121 -55 ct 2112 -36 2099 -22 2081 -12 ct 2064 -2 2045 3 2023 3 ct 
1998 3 1978 -4 1964 -17 ct 1949 -31 1942 -49 1942 -73 ct 1942 -96 1946 -116 1956 -134 ct 
1965 -152 1978 -166 1995 -175 ct 2011 -185 2031 -190 2052 -190 ct 2079 -190 2100 -184 2114 -171 ct 
2128 -159 2135 -141 2135 -118 ct p
2085 -114 m  2085 -143 2073 -157 2049 -157 ct 2036 -157 2025 -154 2017 -147 ct 
2010 -140 2004 -129 1999 -115 ct 1995 -101 1993 -88 1993 -75 ct 1993 -45 2005 -30 2029 -30 ct 
2041 -30 2052 -33 2059 -40 ct 2067 -46 2073 -56 2077 -69 ct 2081 -83 2084 -98 2085 -114 ct 
p ef
2280 -256 m  2301 -256 2318 -251 2331 -240 ct 2344 -230 2350 -217 2350 -200 ct 
2350 -190 2349 -182 2346 -174 ct 2343 -167 2340 -161 2335 -155 ct 2330 -150 2325 -145 2319 -142 ct 
2313 -139 2306 -136 2300 -135 ct 2313 -132 2323 -125 2331 -115 ct 2340 -106 2344 -94 2344 -80 ct 
2344 -54 2336 -34 2320 -19 ct 2304 -4 2282 3 2255 3 ct 2244 3 2233 2 2224 -2 ct 
2215 -5 2207 -9 2201 -13 ct 2200 -13 l  2197 5 l  2197 9 2192 32 2184 73 ct 
2135 73 l  2184 -174 l  2194 -229 2226 -256 2280 -256 ct p
2276 -221 m  2253 -221 2238 -205 2232 -174 ct 2207 -44 l  2213 -40 2219 -36 2227 -34 ct 
2234 -31 2241 -30 2247 -30 ct 2262 -30 2274 -34 2283 -43 ct 2291 -52 2296 -64 2296 -79 ct 
2296 -91 2291 -100 2282 -107 ct 2274 -113 2262 -117 2247 -117 ct 2254 -151 l 
2287 -155 2304 -169 2304 -194 ct 2304 -202 2301 -208 2297 -213 ct 2292 -218 2285 -221 2276 -221 ct 
p ef
2528 0 m  2479 0 l  2473 -66 2469 -103 2468 -111 ct 2468 -120 2467 -125 2467 -128 ct 
2465 -123 2461 -114 2454 -102 ct 2447 -90 2442 -81 2438 -74 ct 2392 0 l  2339 0 l 
2456 -176 l  2454 -190 2451 -201 2449 -208 ct 2447 -216 2444 -222 2441 -225 ct 
2438 -228 2433 -230 2427 -230 ct 2422 -230 2417 -229 2412 -227 ct 2407 -260 l 
2418 -264 2429 -265 2441 -265 ct 2458 -265 2471 -261 2479 -251 ct 2487 -242 2493 -225 2497 -201 ct 
2528 0 l  p ef
2741 -142 m  2741 -139 2740 -134 2740 -128 ct 2739 -122 2738 -117 2737 -113 ct 
2701 73 l  2653 73 l  2688 -103 l  2691 -117 2692 -127 2692 -132 ct 2692 -147 2683 -154 2666 -154 ct 
2654 -154 2643 -149 2634 -140 ct 2624 -130 2618 -119 2615 -105 ct 2595 0 l  2546 0 l 
2575 -147 l  2576 -155 2577 -162 2577 -169 ct 2577 -176 2577 -182 2576 -187 ct 
2623 -187 l  2624 -183 2624 -177 2624 -171 ct 2624 -165 2624 -159 2623 -155 ct 
2624 -155 l  2632 -167 2642 -176 2652 -182 ct 2663 -188 2675 -191 2688 -191 ct 
2706 -191 2719 -186 2728 -178 ct 2736 -170 2741 -157 2741 -142 ct p
2657 -205 m  2658 -210 l  2680 -261 l  2724 -261 l  2723 -254 l  2675 -205 l 
2657 -205 l  p ef
2879 0 m  2880 -13 2882 -24 2883 -32 ct 2883 -32 l  2869 -9 2853 3 2835 3 ct 
2828 3 2822 2 2818 -1 ct 2813 -4 2810 -8 2809 -12 ct 2808 -12 l  2805 7 l  2792 73 l 
2744 73 l  2794 -187 l  2842 -187 l  2822 -83 l  2821 -75 2820 -68 2820 -62 ct 
2820 -43 2828 -34 2844 -34 ct 2856 -34 2866 -39 2874 -48 ct 2883 -58 2889 -71 2893 -87 ct 
2912 -187 l  2960 -187 l  2932 -42 l  2931 -34 2929 -25 2928 -17 ct 2927 -8 2926 -2 2926 0 ct 
2879 0 l  p ef
3068 -189 m  3085 -189 3098 -186 3108 -178 ct 3118 -170 3124 -159 3127 -146 ct 
3127 -146 l  3129 -151 3132 -157 3136 -166 ct 3141 -175 3145 -182 3147 -186 ct 
3194 -186 l  3186 -175 3178 -159 3168 -140 ct 3159 -120 3151 -103 3147 -88 ct 
3147 -76 3147 -65 3147 -56 ct 3148 -47 3149 -38 3149 -31 ct 3150 -24 3152 -13 3155 1 ct 
3107 1 l  3104 -14 3102 -27 3102 -38 ct 3102 -41 l  3101 -41 l  3091 -24 3080 -13 3069 -6 ct 
3058 1 3046 4 3033 4 ct 3014 4 2999 -2 2988 -14 ct 2978 -26 2973 -43 2973 -64 ct 
2973 -79 2975 -95 2979 -112 ct 2983 -129 2990 -143 2998 -155 ct 3006 -167 3016 -175 3027 -181 ct 
3039 -187 3053 -189 3068 -189 ct p
3069 -156 m  3059 -156 3051 -152 3044 -145 ct 3038 -137 3032 -126 3029 -110 ct 
3025 -94 3023 -80 3023 -66 ct 3023 -42 3032 -30 3048 -30 ct 3058 -30 3067 -35 3077 -47 ct 
3086 -58 3093 -74 3099 -95 ct 3100 -106 l  3100 -122 3097 -134 3092 -143 ct 
3087 -152 3079 -156 3069 -156 ct p ef
3229 -154 m  3219 -154 3210 -154 3202 -152 ct 3194 -151 3188 -149 3185 -148 ct 
3192 -182 l  3195 -183 3199 -185 3205 -186 ct 3211 -187 3217 -187 3223 -187 ct 
3334 -187 l  3328 -154 l  3280 -154 l  3262 -57 l  3261 -53 3261 -50 3261 -47 ct 
3261 -36 3266 -31 3276 -31 ct 3280 -31 3284 -32 3290 -33 ct 3294 -33 l  3289 -2 l 
3285 -1 3279 1 3272 2 ct 3266 3 3259 3 3253 3 ct 3240 3 3230 -1 3223 -8 ct 3216 -15 3212 -25 3212 -38 ct 
3212 -45 3213 -52 3214 -59 ct 3233 -154 l  3229 -154 l  p ef
3511 -118 m  3511 -94 3507 -73 3497 -55 ct 3488 -36 3475 -22 3457 -12 ct 3440 -2 3421 3 3399 3 ct 
3374 3 3354 -4 3340 -17 ct 3325 -31 3318 -49 3318 -73 ct 3318 -96 3322 -116 3332 -134 ct 
3341 -152 3354 -166 3371 -175 ct 3387 -185 3407 -190 3428 -190 ct 3455 -190 3476 -184 3490 -171 ct 
3504 -159 3511 -141 3511 -118 ct p
3461 -114 m  3461 -143 3449 -157 3425 -157 ct 3412 -157 3401 -154 3393 -147 ct 
3386 -140 3380 -129 3375 -115 ct 3371 -101 3369 -88 3369 -75 ct 3369 -45 3381 -30 3405 -30 ct 
3417 -30 3428 -33 3435 -40 ct 3443 -46 3449 -56 3453 -69 ct 3457 -83 3460 -98 3461 -114 ct 
p ef
3647 -191 m  3674 -191 3693 -182 3706 -164 ct 3678 -139 l  3669 -152 3658 -158 3645 -158 ct 
3637 -158 3629 -156 3622 -151 ct 3614 -146 3608 -140 3601 -131 ct 3595 -122 3590 -113 3586 -102 ct 
3582 -91 3580 -81 3580 -74 ct 3580 -64 3582 -57 3588 -52 ct 3594 -47 3605 -42 3622 -37 ct 
3628 -35 3635 -33 3641 -30 ct 3648 -28 3654 -25 3660 -22 ct 3665 -18 3670 -14 3673 -9 ct 
3677 -3 3678 3 3678 11 ct 3678 31 3669 51 3650 69 ct 3623 52 l  3629 46 3633 40 3635 36 ct 
3636 32 3637 28 3637 24 ct 3637 21 3636 17 3634 15 ct 3631 12 3627 10 3621 8 ct 
3616 5 3605 2 3590 -2 ct 3569 -7 3554 -15 3545 -23 ct 3536 -32 3532 -44 3532 -58 ct 
3532 -73 3535 -89 3542 -106 ct 3548 -122 3557 -137 3568 -150 ct 3578 -163 3590 -173 3604 -180 ct 
3617 -187 3632 -191 3647 -191 ct p ef
3961 -256 m  3900 -199 3870 -129 3870 -49 ct 3870 -3 3879 38 3896 73 ct 3848 73 l 
3831 37 3823 -5 3823 -51 ct 3823 -93 3830 -131 3846 -166 ct 3861 -201 3883 -231 3912 -256 ct 
3961 -256 l  p ef
4021 -189 m  4038 -189 4051 -186 4061 -178 ct 4071 -170 4077 -159 4080 -146 ct 
4080 -146 l  4082 -151 4085 -157 4089 -166 ct 4094 -175 4098 -182 4100 -186 ct 
4147 -186 l  4139 -175 4131 -159 4121 -140 ct 4112 -120 4104 -103 4100 -88 ct 
4100 -76 4100 -65 4100 -56 ct 4101 -47 4102 -38 4102 -31 ct 4103 -24 4105 -13 4108 1 ct 
4060 1 l  4057 -14 4055 -27 4055 -38 ct 4055 -41 l  4054 -41 l  4044 -24 4033 -13 4022 -6 ct 
4011 1 3999 4 3986 4 ct 3967 4 3952 -2 3941 -14 ct 3931 -26 3926 -43 3926 -64 ct 
3926 -79 3928 -95 3932 -112 ct 3936 -129 3943 -143 3951 -155 ct 3959 -167 3969 -175 3980 -181 ct 
3992 -187 4006 -189 4021 -189 ct p
4022 -156 m  4012 -156 4004 -152 3997 -145 ct 3991 -137 3985 -126 3982 -110 ct 
3978 -94 3976 -80 3976 -66 ct 3976 -42 3985 -30 4001 -30 ct 4011 -30 4020 -35 4030 -47 ct 
4039 -58 4046 -74 4052 -95 ct 4053 -106 l  4053 -122 4050 -134 4045 -143 ct 
4040 -152 4032 -156 4022 -156 ct p ef
4252 -190 m  4276 -190 4295 -183 4310 -169 ct 4324 -155 4331 -135 4331 -109 ct 
4331 -88 4327 -69 4319 -52 ct 4311 -34 4301 -21 4286 -11 ct 4272 -2 4256 3 4238 3 ct 
4226 3 4216 1 4208 -3 ct 4201 -7 4194 -13 4189 -21 ct 4188 -21 l  4185 0 l  4171 73 l 
4120 73 l  4154 -100 l  4159 -131 4171 -154 4187 -168 ct 4203 -183 4225 -190 4252 -190 ct 
p
4249 -157 m  4225 -157 4210 -138 4203 -99 ct 4195 -50 l  4199 -44 4205 -39 4211 -36 ct 
4218 -32 4225 -30 4232 -30 ct 4247 -30 4258 -38 4267 -53 ct 4276 -68 4281 -87 4281 -110 ct 
4281 -125 4278 -137 4272 -145 ct 4267 -153 4259 -157 4249 -157 ct p ef
4400 -25 m  4400 -15 4402 -7 4407 0 ct 4355 0 l  4354 -2 4353 -5 4352 -9 ct 
4351 -13 4351 -17 4351 -21 ct 4351 -29 4351 -35 4352 -41 ct 4381 -187 l  4429 -187 l 
4401 -39 l  4400 -35 4400 -31 4400 -25 ct p ef
4572 -256 m  4614 -256 4635 -230 4635 -177 ct 4635 -158 4632 -135 4626 -109 ct 
4620 -84 4613 -63 4603 -46 ct 4594 -29 4583 -17 4570 -9 ct 4557 0 4542 4 4526 4 ct 
4506 4 4490 -4 4480 -18 ct 4469 -33 4464 -53 4464 -79 ct 4464 -98 4467 -121 4473 -145 ct 
4479 -170 4486 -191 4495 -207 ct 4505 -224 4515 -236 4528 -244 ct 4541 -252 4555 -256 4572 -256 ct 
p
4532 -28 m  4543 -28 4552 -35 4560 -48 ct 4567 -62 4573 -82 4578 -111 ct 4513 -111 l 
4510 -94 4508 -80 4508 -69 ct 4508 -42 4516 -28 4532 -28 ct p
4565 -224 m  4554 -224 4545 -218 4538 -205 ct 4530 -192 4524 -172 4519 -144 ct 
4584 -144 l  4588 -160 4590 -173 4590 -183 ct 4590 -210 4582 -224 4565 -224 ct 
p ef
4757 0 m  4758 -13 4760 -24 4761 -32 ct 4761 -32 l  4747 -9 4731 3 4713 3 ct 
4706 3 4700 2 4696 -1 ct 4691 -4 4688 -8 4687 -12 ct 4686 -12 l  4683 7 l  4670 73 l 
4622 73 l  4672 -187 l  4720 -187 l  4700 -83 l  4699 -75 4698 -68 4698 -62 ct 
4698 -43 4706 -34 4722 -34 ct 4734 -34 4744 -39 4752 -48 ct 4761 -58 4767 -71 4771 -87 ct 
4790 -187 l  4838 -187 l  4810 -42 l  4809 -34 4807 -25 4806 -17 ct 4805 -8 4804 -2 4804 0 ct 
4757 0 l  p ef
5046 -118 m  5046 -94 5042 -73 5032 -55 ct 5023 -36 5010 -22 4992 -12 ct 4975 -2 4956 3 4934 3 ct 
4909 3 4889 -4 4875 -17 ct 4860 -31 4853 -49 4853 -73 ct 4853 -96 4857 -116 4867 -134 ct 
4876 -152 4889 -166 4906 -175 ct 4922 -185 4942 -190 4963 -190 ct 4990 -190 5011 -184 5025 -171 ct 
5039 -159 5046 -141 5046 -118 ct p
4996 -114 m  4996 -143 4984 -157 4960 -157 ct 4947 -157 4936 -154 4928 -147 ct 
4921 -140 4915 -129 4910 -115 ct 4906 -101 4904 -88 4904 -75 ct 4904 -45 4916 -30 4940 -30 ct 
4952 -30 4963 -33 4970 -40 ct 4978 -46 4984 -56 4988 -69 ct 4992 -83 4995 -98 4996 -114 ct 
p
4954 -205 m  4955 -210 l  4977 -261 l  5021 -261 l  5020 -254 l  4972 -205 l 
4954 -205 l  p ef
5182 -191 m  5209 -191 5228 -182 5241 -164 ct 5213 -139 l  5204 -152 5193 -158 5180 -158 ct 
5172 -158 5164 -156 5157 -151 ct 5149 -146 5143 -140 5136 -131 ct 5130 -122 5125 -113 5121 -102 ct 
5117 -91 5115 -81 5115 -74 ct 5115 -64 5117 -57 5123 -52 ct 5129 -47 5140 -42 5157 -37 ct 
5163 -35 5170 -33 5176 -30 ct 5183 -28 5189 -25 5195 -22 ct 5200 -18 5205 -14 5208 -9 ct 
5212 -3 5213 3 5213 11 ct 5213 31 5204 51 5185 69 ct 5158 52 l  5164 46 5168 40 5170 36 ct 
5171 32 5172 28 5172 24 ct 5172 21 5171 17 5169 15 ct 5166 12 5162 10 5156 8 ct 
5151 5 5140 2 5125 -2 ct 5104 -7 5089 -15 5080 -23 ct 5071 -32 5067 -44 5067 -58 ct 
5067 -73 5070 -89 5077 -106 ct 5083 -122 5092 -137 5103 -150 ct 5113 -163 5125 -173 5139 -180 ct 
5152 -187 5167 -191 5182 -191 ct p ef
5437 3 m  5412 3 5392 -4 5377 -17 ct 5363 -30 5356 -48 5356 -71 ct 5356 -87 5359 -103 5364 -117 ct 
5370 -132 5378 -145 5390 -155 ct 5401 -166 5415 -174 5432 -179 ct 5449 -185 5468 -187 5489 -187 ct 
5590 -187 l  5584 -155 l  5561 -155 l  5529 -155 l  5529 -154 l  5539 -137 5545 -120 5545 -102 ct 
5545 -81 5541 -63 5532 -47 ct 5524 -31 5511 -19 5495 -10 ct 5478 -1 5459 3 5437 3 ct 
p
5442 -30 m  5460 -30 5474 -37 5483 -51 ct 5492 -65 5497 -86 5497 -114 ct 5497 -128 5495 -142 5491 -154 ct 
5479 -154 l  5467 -154 5457 -153 5447 -149 ct 5438 -145 5431 -139 5424 -132 ct 
5418 -124 5414 -115 5411 -105 ct 5408 -94 5406 -84 5406 -74 ct 5406 -60 5409 -49 5416 -42 ct 
5422 -34 5431 -30 5442 -30 ct p ef
5637 -154 m  5627 -154 5618 -154 5610 -152 ct 5602 -151 5596 -149 5593 -148 ct 
5600 -182 l  5603 -183 5607 -185 5613 -186 ct 5619 -187 5625 -187 5631 -187 ct 
5742 -187 l  5736 -154 l  5688 -154 l  5670 -57 l  5669 -53 5669 -50 5669 -47 ct 
5669 -36 5674 -31 5684 -31 ct 5688 -31 5692 -32 5698 -33 ct 5702 -33 l  5697 -2 l 
5693 -1 5687 1 5680 2 ct 5674 3 5667 3 5661 3 ct 5648 3 5638 -1 5631 -8 ct 5624 -15 5620 -25 5620 -38 ct 
5620 -45 5621 -52 5622 -59 ct 5641 -154 l  5637 -154 l  p ef
5919 -118 m  5919 -94 5915 -73 5905 -55 ct 5896 -36 5883 -22 5865 -12 ct 5848 -2 5829 3 5807 3 ct 
5782 3 5762 -4 5748 -17 ct 5733 -31 5726 -49 5726 -73 ct 5726 -96 5730 -116 5740 -134 ct 
5749 -152 5762 -166 5779 -175 ct 5795 -185 5815 -190 5836 -190 ct 5863 -190 5884 -184 5898 -171 ct 
5912 -159 5919 -141 5919 -118 ct p
5869 -114 m  5869 -143 5857 -157 5833 -157 ct 5820 -157 5809 -154 5801 -147 ct 
5794 -140 5788 -129 5783 -115 ct 5779 -101 5777 -88 5777 -75 ct 5777 -45 5789 -30 5813 -30 ct 
5825 -30 5836 -33 5843 -40 ct 5851 -46 5857 -56 5861 -69 ct 5865 -83 5868 -98 5869 -114 ct 
p ef
5988 -25 m  5988 -15 5990 -7 5995 0 ct 5943 0 l  5942 -2 5941 -5 5940 -9 ct 
5939 -13 5939 -17 5939 -21 ct 5939 -29 5939 -35 5940 -41 ct 5969 -187 l  6017 -187 l 
5989 -39 l  5988 -35 5988 -31 5988 -25 ct p ef
6086 -191 m  6096 -191 6104 -189 6109 -185 ct 6114 -181 6119 -174 6123 -165 ct 
6128 -155 6132 -141 6137 -123 ct 6141 -107 l  6148 -121 6153 -129 6156 -133 ct 
6192 -187 l  6245 -187 l  6157 -68 l  6201 73 l  6153 73 l  6125 -35 l 
6118 -23 l  6107 -4 l  6055 73 l  6002 73 l  6107 -70 l  6095 -112 l  6091 -124 6088 -134 6086 -140 ct 
6083 -146 6081 -150 6078 -152 ct 6075 -154 6072 -156 6068 -156 ct 6063 -156 6058 -155 6053 -153 ct 
6055 -186 l  6065 -189 6075 -191 6086 -191 ct p ef
6324 -30 m  6334 -30 6343 -32 6352 -37 ct 6360 -41 6369 -47 6377 -54 ct 6399 -28 l 
6387 -17 6375 -9 6362 -4 ct 6349 1 6334 3 6316 3 ct 6296 3 6280 -2 6267 -12 ct 
6255 -22 6248 -35 6248 -51 ct 6248 -65 6253 -76 6263 -85 ct 6272 -93 6286 -99 6304 -100 ct 
6304 -101 l  6294 -104 6286 -109 6280 -115 ct 6275 -122 6272 -130 6272 -140 ct 
6272 -156 6278 -168 6292 -177 ct 6305 -186 6324 -191 6348 -191 ct 6365 -191 6379 -188 6390 -182 ct 
6401 -176 6410 -166 6416 -154 ct 6383 -139 l  6376 -153 6364 -160 6348 -160 ct 
6338 -160 6331 -158 6325 -154 ct 6320 -150 6317 -145 6317 -138 ct 6317 -130 6322 -124 6330 -119 ct 
6339 -115 6352 -113 6369 -113 ct 6364 -83 l  6346 -83 6332 -82 6324 -80 ct 6316 -78 6310 -75 6305 -71 ct 
6301 -66 6299 -61 6299 -53 ct 6299 -46 6301 -41 6305 -36 ct 6310 -32 6316 -30 6324 -30 ct 
p ef
6464 -25 m  6464 -15 6466 -7 6471 0 ct 6419 0 l  6418 -2 6417 -5 6416 -9 ct 
6415 -13 6415 -17 6415 -21 ct 6415 -29 6415 -35 6416 -41 ct 6445 -187 l  6493 -187 l 
6465 -39 l  6464 -35 6464 -31 6464 -25 ct p
6454 -204 m  6455 -210 l  6477 -261 l  6521 -261 l  6520 -254 l  6472 -204 l 
6454 -204 l  p ef
6673 -62 m  6673 -53 6675 -46 6679 -40 ct 6684 -34 6689 -31 6696 -31 ct 6706 -31 6714 -34 6720 -41 ct 
6726 -48 6732 -58 6735 -73 ct 6739 -88 6741 -101 6741 -112 ct 6741 -136 6731 -152 6710 -158 ct 
6719 -191 l  6741 -188 6759 -179 6772 -164 ct 6785 -149 6792 -132 6792 -111 ct 
6792 -92 6788 -74 6780 -55 ct 6772 -36 6762 -22 6748 -12 ct 6734 -2 6718 3 6700 3 ct 
6685 3 6673 -1 6665 -8 ct 6656 -15 6650 -27 6647 -43 ct 6646 -43 l  6633 -12 6611 3 6581 3 ct 
6561 3 6546 -3 6535 -16 ct 6524 -29 6518 -47 6518 -71 ct 6518 -92 6523 -112 6532 -130 ct 
6541 -147 6553 -161 6570 -172 ct 6586 -182 6606 -189 6628 -191 ct 6629 -159 l 
6598 -153 6579 -132 6571 -95 ct 6568 -85 6567 -76 6567 -69 ct 6567 -56 6569 -47 6574 -41 ct 
6578 -34 6584 -31 6592 -31 ct 6610 -31 6623 -48 6630 -82 ct 6639 -122 l  6683 -122 l 
6676 -86 l  6674 -78 6673 -70 6673 -62 ct p ef
6884 -41 m  6901 -61 6913 -78 6920 -90 ct 6928 -103 6933 -115 6937 -127 ct 6941 -139 6942 -152 6942 -166 ct 
6942 -171 6942 -178 6940 -187 ct 6990 -187 l  6992 -181 6993 -174 6993 -167 ct 
6993 -145 6986 -121 6971 -95 ct 6956 -69 6931 -38 6895 0 ct 6849 0 l  6818 -187 l 
6868 -187 l  6884 -41 l  p ef
6954 73 m  7014 14 7044 -57 7044 -140 ct 7044 -159 7042 -179 7038 -200 ct 7033 -221 7027 -240 7019 -256 ct 
7064 -256 l  7083 -219 7092 -180 7092 -137 ct 7092 -94 7085 -54 7069 -19 ct 
7054 17 7031 48 7002 73 ct 6954 73 l  p ef
pom
pum
5439 17480 t
90.0 r 26 0 m  26 -219 l  192 -219 l  192 -195 l  56 -195 l  56 -124 l  183 -124 l 
183 -100 l  56 -100 l  56 -24 l  198 -24 l  198 0 l  26 0 l  p ef
268 -148 m  268 0 l  240 0 l  240 -148 l  217 -148 l  217 -168 l  240 -168 l 
240 -187 l  240 -202 243 -213 250 -220 ct 257 -227 267 -230 281 -230 ct 289 -230 295 -229 301 -228 ct 
301 -207 l  296 -208 292 -208 288 -208 ct 281 -208 276 -206 273 -203 ct 270 -199 268 -193 268 -183 ct 
268 -168 l  301 -168 l  301 -148 l  268 -148 l  p ef
347 -148 m  347 0 l  319 0 l  319 -148 l  296 -148 l  296 -168 l  319 -168 l 
319 -187 l  319 -202 322 -213 329 -220 ct 336 -227 346 -230 360 -230 ct 368 -230 374 -229 380 -228 ct 
380 -207 l  375 -208 371 -208 367 -208 ct 360 -208 355 -206 352 -203 ct 349 -199 347 -193 347 -183 ct 
347 -168 l  380 -168 l  380 -148 l  347 -148 l  p ef
391 -203 m  391 -230 l  419 -230 l  419 -203 l  391 -203 l  p
391 0 m  391 -168 l  419 -168 l  419 0 l  391 0 l  p ef
493 -85 m  493 -62 496 -46 503 -35 ct 510 -24 521 -19 535 -19 ct 545 -19 553 -22 560 -27 ct 
567 -32 571 -41 572 -52 ct 601 -50 l  598 -34 592 -21 580 -11 ct 568 -2 554 3 536 3 ct 
512 3 494 -4 482 -19 ct 470 -34 464 -56 464 -84 ct 464 -112 470 -134 482 -149 ct 
495 -164 512 -171 536 -171 ct 553 -171 567 -167 578 -158 ct 590 -149 597 -137 600 -121 ct 
571 -119 l  570 -128 566 -135 560 -141 ct 554 -146 546 -149 535 -149 ct 520 -149 509 -144 503 -134 ct 
496 -125 493 -108 493 -85 ct p ef
630 -203 m  630 -230 l  658 -230 l  658 -203 l  630 -203 l  p
630 0 m  630 -168 l  658 -168 l  658 0 l  630 0 l  p ef
731 -78 m  731 -59 735 -44 743 -34 ct 751 -23 762 -18 778 -18 ct 790 -18 800 -20 807 -25 ct 
814 -30 819 -36 822 -44 ct 846 -37 l  836 -10 813 3 778 3 ct 753 3 734 -4 721 -19 ct 
708 -34 702 -56 702 -85 ct 702 -113 708 -134 721 -149 ct 734 -164 753 -171 777 -171 ct 
826 -171 851 -141 851 -82 ct 851 -78 l  731 -78 l  p
822 -99 m  820 -117 816 -130 808 -138 ct 801 -146 790 -150 776 -150 ct 763 -150 752 -146 744 -137 ct 
736 -128 732 -115 731 -99 ct 822 -99 l  p ef
1001 0 m  1001 -106 l  1001 -118 1000 -126 998 -132 ct 996 -138 992 -143 987 -145 ct 
983 -148 976 -149 966 -149 ct 953 -149 942 -145 935 -136 ct 927 -126 923 -114 923 -97 ct 
923 0 l  895 0 l  895 -132 l  895 -152 895 -164 894 -168 ct 921 -168 l  921 -167 921 -166 921 -164 ct 
921 -161 921 -159 921 -156 ct 921 -153 922 -147 922 -139 ct 922 -139 l  929 -151 936 -159 945 -164 ct 
953 -169 963 -171 976 -171 ct 994 -171 1008 -166 1016 -157 ct 1025 -148 1029 -133 1029 -112 ct 
1029 0 l  1001 0 l  p ef
1101 -85 m  1101 -62 1104 -46 1111 -35 ct 1118 -24 1129 -19 1143 -19 ct 1153 -19 1161 -22 1168 -27 ct 
1175 -32 1179 -41 1180 -52 ct 1209 -50 l  1206 -34 1200 -21 1188 -11 ct 1176 -2 1162 3 1144 3 ct 
1120 3 1102 -4 1090 -19 ct 1078 -34 1072 -56 1072 -84 ct 1072 -112 1078 -134 1090 -149 ct 
1103 -164 1120 -171 1144 -171 ct 1161 -171 1175 -167 1186 -158 ct 1198 -149 1205 -137 1208 -121 ct 
1179 -119 l  1178 -128 1174 -135 1168 -141 ct 1162 -146 1154 -149 1143 -149 ct 
1128 -149 1117 -144 1111 -134 ct 1104 -125 1101 -108 1101 -85 ct p ef
1247 66 m  1239 66 1233 65 1227 64 ct 1227 43 l  1231 44 1236 44 1240 44 ct 
1258 44 1272 31 1282 6 ct 1284 -1 l  1218 -168 l  1248 -168 l  1283 -75 l 
1284 -74 1284 -72 1285 -70 ct 1286 -68 1288 -61 1292 -50 ct 1296 -38 1298 -32 1298 -31 ct 
1309 -61 l  1346 -168 l  1375 -168 l  1311 0 l  1304 18 1297 31 1291 40 ct 
1285 49 1279 55 1271 60 ct 1264 64 1256 66 1247 66 ct p ef
pom
0 9816 t 
pom
count op_count sub {pop} repeat countdictstack dict_count sub {end} repeat b4_inc_state restore
%%PageTrailer
%%Trailer
%%EOF
