media/gr_redirects_goarch/me.m01.d01/meLI.Kontakion1/c1011/score/w/1:link.info	NewByz
media/gr_redirects_goarch/me.m01.d01/meLI.Kontakion1/c1011/score/w/1:link.path	/media/m/newbyz/gr/me/m01/d01/li/w/seasonalkontakion.pdf
media/gr_redirects_goarch/me.m01.d01/meLI.MM.Antiphon2/c1011/score/w/1:link.info	SDedes
media/gr_redirects_goarch/me.m01.d01/meLI.MM.Antiphon2/c1011/score/w/1:link.path	/media/m/dedes/gr/me/m01/d01/li/w/antiphon2.pdf
media/gr_redirects_goarch/me.m01.d01/meLI.MM.Antiphon2/c1011/score/w/2:link.info	NewByz
media/gr_redirects_goarch/me.m01.d01/meLI.MM.Antiphon2/c1011/score/w/2:link.path	/media/m/newbyz/gr/me/m01/d01/li/w/antiphon2.pdf
media/gr_redirects_goarch/me.m01.d01/meLI.Megalynarion2/c1011/score/w/1:link.info	NewByz
media/gr_redirects_goarch/me.m01.d01/meLI.Megalynarion2/c1011/score/w/1:link.path	/media/m/newbyz/gr/me/m01/d01/li/w/megalynarion.pdf
media/gr_redirects_goarch/me.m01.d01/meVE.Apolytikion1/c1011/score/w/1:link.info	NewByz
media/gr_redirects_goarch/me.m01.d01/meVE.Apolytikion1/c1011/score/w/1:link.path	/media/m/newbyz/gr/me/m01/d01/ve/w/apolytikion1.pdf
media/gr_redirects_goarch/me.m01.d01/meVE.Apolytikion2/c1011/score/w/1:link.info	NewByz
media/gr_redirects_goarch/me.m01.d01/meVE.Apolytikion2/c1011/score/w/1:link.path	/media/m/newbyz/gr/me/m01/d01/ve/w/apolytikion2.pdf
