media/gr_redirects_goarch/me.m12.d25/meLI.Kontakion1/c1011/score/w/1:link.info	KMarinakos
media/gr_redirects_goarch/me.m12.d25/meLI.Kontakion1/c1011/score/w/1:link.path	/media/m/marinakos/gr/me/m12/d25/li/w/seasonalkontakion.pdf
media/gr_redirects_goarch/me.m12.d25/meLI.Kontakion1/c1012/score/b/1:link.info	GTheodoridis
media/gr_redirects_goarch/me.m12.d25/meLI.Kontakion1/c1012/score/b/1:link.path	/media/m/theodoridis/gr/me/m12/d25/li/b/seasonalkontakion.pdf
media/gr_redirects_goarch/me.m12.d25/meLI.Kontakion1/c1013/score/w/1:link.info	NewByz
media/gr_redirects_goarch/me.m12.d25/meLI.Kontakion1/c1013/score/w/1:link.path	/media/m/newbyz/gr/me/m12/d25/li/w/seasonalkontakion.pdf
media/gr_redirects_goarch/me.m12.d25/meLI.MM.Antiphon2/c1011/score/b/1:link.info	GTheodoridis
media/gr_redirects_goarch/me.m12.d25/meLI.MM.Antiphon2/c1011/score/b/1:link.path	/media/m/theodoridis/gr/me/m12/d25/li/b/antiphon2.pdf
media/gr_redirects_goarch/me.m12.d25/meLI.MM.Antiphon2/c1012/score/w/1:link.info	NewByz
media/gr_redirects_goarch/me.m12.d25/meLI.MM.Antiphon2/c1012/score/w/1:link.path	/media/m/newbyz/gr/me/m12/d25/li/w/antiphon2.pdf
media/gr_redirects_goarch/me.m12.d25/meLI.MM.CommunionHymn/c1011/score/w/1:link.info	NewByz
media/gr_redirects_goarch/me.m12.d25/meLI.MM.CommunionHymn/c1011/score/w/1:link.path	/media/m/newbyz/gr/me/m12/d25/li/w/communionhymn.pdf
media/gr_redirects_goarch/me.m12.d25/meLI.TheotokosHymn/c1011/audio/1:link.info	KMarinakos
media/gr_redirects_goarch/me.m12.d25/meLI.TheotokosHymn/c1011/audio/1:link.path	/media/a/gr/me/m12/d25/li/theotokoshymn.mp3
media/gr_redirects_goarch/me.m12.d25/meLI.TheotokosHymn/c1011/score/w/1:link.info	KMarinakos
media/gr_redirects_goarch/me.m12.d25/meLI.TheotokosHymn/c1011/score/w/1:link.path	/media/m/marinakos/gr/me/m12/d25/li/w/theotokoshymn.pdf
media/gr_redirects_goarch/me.m12.d25/meLI.TheotokosHymn/c1012/score/b/1:link.info	GTheodoridis
media/gr_redirects_goarch/me.m12.d25/meLI.TheotokosHymn/c1012/score/b/1:link.path	/media/m/theodoridis/gr/me/m12/d25/li/b/theotokoshymn.pdf
media/gr_redirects_goarch/me.m12.d25/meLI.TheotokosHymn/c1013/score/w/1:link.info	NewByz
media/gr_redirects_goarch/me.m12.d25/meLI.TheotokosHymn/c1013/score/w/1:link.path	/media/m/newbyz/gr/me/m12/d25/li/w/theotokoshymn.pdf
media/gr_redirects_goarch/me.m12.d25/meMA.Exaposteilarion1/c1011/score/w/1:link.info	KMarinakos
media/gr_redirects_goarch/me.m12.d25/meMA.Exaposteilarion1/c1011/score/w/1:link.path	/media/m/marinakos/gr/me/m12/d25/ma/w/exaposteilarion1.pdf
media/gr_redirects_goarch/me.m12.d25/meMA.Kathisma11/c1011/score/w/1:link.info	KMarinakos
media/gr_redirects_goarch/me.m12.d25/meMA.Kathisma11/c1011/score/w/1:link.path	/media/m/marinakos/gr/me/m12/d25/ma/w/kathisma11.pdf
media/gr_redirects_goarch/me.m12.d25/meMA.Kathisma21/c1011/score/w/1:link.info	KMarinakos
media/gr_redirects_goarch/me.m12.d25/meMA.Kathisma21/c1011/score/w/1:link.path	/media/m/marinakos/gr/me/m12/d25/ma/w/kathisma21.pdf
media/gr_redirects_goarch/me.m12.d25/meMA.Ode9C1H/c1011/score/w/1:link.info	JVelon
media/gr_redirects_goarch/me.m12.d25/meMA.Ode9C1H/c1011/score/w/1:link.path	/media/m/velon/gr/me/m12/d25/ma/w/ode9c1.pdf
media/gr_redirects_goarch/me.m12.d25/meMA.Ode9C1H/c1012/score/b/1:link.info	GTheodoridis
media/gr_redirects_goarch/me.m12.d25/meMA.Ode9C1H/c1012/score/b/1:link.path	/media/m/theodoridis/gr/me/m12/d25/ma/b/ode9c1.pdf
media/gr_redirects_goarch/me.m12.d25/meMA.Ode9C2H/c1011/score/w/1:link.info	JVelon
media/gr_redirects_goarch/me.m12.d25/meMA.Ode9C2H/c1011/score/w/1:link.path	/media/m/velon/gr/me/m12/d25/ma/w/ode9c2.pdf
media/gr_redirects_goarch/me.m12.d25/meMA.Ode9C2H/c1012/score/b/1:link.info	GTheodoridis
media/gr_redirects_goarch/me.m12.d25/meMA.Ode9C2H/c1012/score/b/1:link.path	/media/m/theodoridis/gr/me/m12/d25/ma/b/ode9c2.pdf
media/gr_redirects_goarch/me.m12.d25/meVE.Apolytikion1/c1011/score/w/1:link.info	SDedes
media/gr_redirects_goarch/me.m12.d25/meVE.Apolytikion1/c1011/score/w/1:link.path	/media/m/dedes/gr/me/m12/d25/ve/w/apolytikion1.pdf
media/gr_redirects_goarch/me.m12.d25/meVE.Apolytikion1/c1012/score/b/1:link.info	RBarrett
media/gr_redirects_goarch/me.m12.d25/meVE.Apolytikion1/c1012/score/b/1:link.path	/media/m/barrett/gr/me/m12/d25/ve/b/apolytikion1.pdf
media/gr_redirects_goarch/me.m12.d25/meVE.Apolytikion1/c1013/score/b/1:link.info	GTheodoridis
media/gr_redirects_goarch/me.m12.d25/meVE.Apolytikion1/c1013/score/b/1:link.path	/media/m/theodoridis/gr/me/m12/d25/ve/b/apolytikion1.pdf
media/gr_redirects_goarch/me.m12.d25/meVE.Apolytikion1/c1014/score/w/1:link.info	NewByz
media/gr_redirects_goarch/me.m12.d25/meVE.Apolytikion1/c1014/score/w/1:link.path	/media/m/newbyz/gr/me/m12/d25/ve/w/apolytikion1.pdf
media/gr_redirects_goarch/me.m12.d25/meVE.ProphecyTroparion1/c1011/score/b/1:link.info	RBarrett
media/gr_redirects_goarch/me.m12.d25/meVE.ProphecyTroparion1/c1011/score/b/1:link.path	/media/m/barrett/gr/me/m12/d25/ve/b/prophecytroparion1.pdf
media/gr_redirects_goarch/me.m12.d25/meVE.ProphecyTroparion2/c1011/score/b/1:link.info	RBarrett
media/gr_redirects_goarch/me.m12.d25/meVE.ProphecyTroparion2/c1011/score/b/1:link.path	/media/m/barrett/gr/me/m12/d25/ve/b/prophecytroparion2.pdf
media/gr_redirects_goarch/me.m12.d25/meVE.SticGlory/c1011/score/b/1:link.info	RBarrett
media/gr_redirects_goarch/me.m12.d25/meVE.SticGlory/c1011/score/b/1:link.path	/media/m/barrett/gr/me/m12/d25/ve/b/sticglory.pdf
media/gr_redirects_goarch/me.m12.d25/meVE.Stichera01/c1011/score/b/1:link.info	RBarrett
media/gr_redirects_goarch/me.m12.d25/meVE.Stichera01/c1011/score/b/1:link.path	/media/m/barrett/gr/me/m12/d25/ve/b/stichera1234.pdf
