media/gr_redirects_goarch/tr.d040/trVE.AposIdiomelon1/c1011/score/w/1:link.info	JVelon
media/gr_redirects_goarch/tr.d040/trVE.AposIdiomelon1/c1011/score/w/1:link.path	/media/m/velon/gr/tr/d040/ve/w/aposidiomelon1.pdf
media/gr_redirects_goarch/tr.d040/trVE.AposMartyric/c1011/score/w/1:link.info	JVelon
media/gr_redirects_goarch/tr.d040/trVE.AposMartyric/c1011/score/w/1:link.path	/media/m/velon/gr/tr/d040/ve/w/aposmartyric.pdf
media/gr_redirects_goarch/tr.d040/trVE.Stichera01/c1011/score/w/1:link.info	JVelon
media/gr_redirects_goarch/tr.d040/trVE.Stichera01/c1011/score/w/1:link.path	/media/m/velon/gr/tr/d040/ve/w/stichera01.pdf
media/gr_redirects_goarch/tr.d040/trVE.Stichera02/c1011/score/w/1:link.info	JVelon
media/gr_redirects_goarch/tr.d040/trVE.Stichera02/c1011/score/w/1:link.path	/media/m/velon/gr/tr/d040/ve/w/stichera02.pdf
media/gr_redirects_goarch/tr.d040/trVE.Stichera03/c1011/score/w/1:link.info	JVelon
media/gr_redirects_goarch/tr.d040/trVE.Stichera03/c1011/score/w/1:link.path	/media/m/velon/gr/tr/d040/ve/w/stichera03.pdf
