media/gr_redirects_goarch/pe.d127/peLI.Kontakion1/c1011/score/w/1:link.info	NewByz
media/gr_redirects_goarch/pe.d127/peLI.Kontakion1/c1011/score/w/1:link.path	/media/m/newbyz/gr/pe/d127/li/w/seasonalkontakion.pdf
media/gr_redirects_goarch/pe.d127/peLI.Kontakion1/c1012/score/w/1:link.info	JVelon
media/gr_redirects_goarch/pe.d127/peLI.Kontakion1/c1012/score/w/1:link.path	/media/m/velon/gr/pe/d127/li/w/kontakion.pdf
media/gr_redirects_goarch/pe.d127/peMA.ExapTheotokion/c1011/score/w/1:link.info	JVelon
media/gr_redirects_goarch/pe.d127/peMA.ExapTheotokion/c1011/score/w/1:link.path	/media/m/velon/gr/pe/d127/ma/w/exaptheotokion.pdf
media/gr_redirects_goarch/pe.d127/peMA.Exaposteilarion1/c1011/score/w/1:link.info	JVelon
media/gr_redirects_goarch/pe.d127/peMA.Exaposteilarion1/c1011/score/w/1:link.path	/media/m/velon/gr/pe/d127/ma/w/exaposteilarion1.pdf
media/gr_redirects_goarch/pe.d127/peMA.Kathisma11/c1011/score/w/1:link.info	JVelon
media/gr_redirects_goarch/pe.d127/peMA.Kathisma11/c1011/score/w/1:link.path	/media/m/velon/gr/oc/m8/d1/ma/w/kathisma11.pdf
media/gr_redirects_goarch/pe.d127/peMA.Kathisma12/c1011/score/w/1:link.info	JVelon
media/gr_redirects_goarch/pe.d127/peMA.Kathisma12/c1011/score/w/1:link.path	/media/m/velon/gr/oc/m8/d1/ma/w/kathisma21.pdf
media/gr_redirects_goarch/pe.d127/peMA.Kathisma13/c1011/score/w/1:link.info	JVelon
media/gr_redirects_goarch/pe.d127/peMA.Kathisma13/c1011/score/w/1:link.path	/media/m/velon/gr/oc/m8/d1/ve/w/apoltheotokionvm.pdf
media/gr_redirects_goarch/pe.d127/peMA.Kathisma21/c1011/score/w/1:link.info	JVelon
media/gr_redirects_goarch/pe.d127/peMA.Kathisma21/c1011/score/w/1:link.path	/media/m/velon/gr/pe/d127/ma/w/kathisma21.pdf
media/gr_redirects_goarch/pe.d127/peMA.Kathisma22/c1011/score/w/1:link.info	JVelon
media/gr_redirects_goarch/pe.d127/peMA.Kathisma22/c1011/score/w/1:link.path	/media/m/velon/gr/pe/d127/ma/w/kathisma22.pdf
media/gr_redirects_goarch/pe.d127/peMA.Kathisma23/c1011/score/w/1:link.info	Α Ἰωάννου | JVelon
media/gr_redirects_goarch/pe.d127/peMA.Kathisma23/c1011/score/w/1:link.path	/media/m/velon/gr/pe/d127/ma/w/kathisma23.pdf
media/gr_redirects_goarch/pe.d127/peMA.Lauds6/c1011/score/w/1:link.info	JVelon
media/gr_redirects_goarch/pe.d127/peMA.Lauds6/c1011/score/w/1:link.path	/media/m/velon/gr/pe/d127/ma/w/lauds6.pdf
media/gr_redirects_goarch/pe.d127/peMA.Lauds7/c1011/score/w/1:link.info	JVelon
media/gr_redirects_goarch/pe.d127/peMA.Lauds7/c1011/score/w/1:link.path	/media/m/velon/gr/pe/d127/ma/w/lauds7.pdf
media/gr_redirects_goarch/pe.d127/peMA.Lauds8/c1011/score/w/1:link.info	JVelon
media/gr_redirects_goarch/pe.d127/peMA.Lauds8/c1011/score/w/1:link.path	/media/m/velon/gr/pe/d127/ma/w/lauds8.pdf
media/gr_redirects_goarch/pe.d127/peMA.MM.Lauds678as345/c1011/score/w/1:link.info	JVelon
media/gr_redirects_goarch/pe.d127/peMA.MM.Lauds678as345/c1011/score/w/1:link.path	/media/m/velon/gr/pe/d127/ma/w/lauds345.pdf
media/gr_redirects_goarch/pe.d127/peVE.Apolytikion2/c1011/score/w/1:link.info	JVelon
media/gr_redirects_goarch/pe.d127/peVE.Apolytikion2/c1011/score/w/1:link.path	/media/m/velon/gr/pe/d127/ve/w/apolytikion2.pdf
media/gr_redirects_goarch/pe.d127/peVE.Apolytikion2/c1012/score/w/1:link.info	NewByz
media/gr_redirects_goarch/pe.d127/peVE.Apolytikion2/c1012/score/w/1:link.path	/media/m/newbyz/gr/pe/d127/ve/w/apolytikion2.pdf
