media/gr_redirects_goarch/oc.m2.d7/octrVE.SticGlory/c1011/score/w/1:link.info	Ε Φαρλέκας | JVelon
media/gr_redirects_goarch/oc.m2.d7/octrVE.SticGlory/c1011/score/w/1:link.path	/media/m/velon/gr/oc/tr/m2/d7/ve/w/sticglory.pdf
media/gr_redirects_goarch/oc.m2.d7/octrVE.Stichera1/c1011/score/w/1:link.info	Ε Φαρλέκας | JVelon
media/gr_redirects_goarch/oc.m2.d7/octrVE.Stichera1/c1011/score/w/1:link.path	/media/m/velon/gr/oc/tr/m2/d7/ve/w/stichera1.pdf
media/gr_redirects_goarch/oc.m2.d7/octrVE.Stichera1/c1012/score/w/1:link.info	Α Ἰωάννου | JVelon
media/gr_redirects_goarch/oc.m2.d7/octrVE.Stichera1/c1012/score/w/1:link.path	/media/m/velon/gr/oc/tr/m2/d7/ve/w/stichera1_ioannou.pdf
media/gr_redirects_goarch/oc.m2.d7/octrVE.Stichera2/c1011/score/w/1:link.info	Ε Φαρλέκας | JVelon
media/gr_redirects_goarch/oc.m2.d7/octrVE.Stichera2/c1011/score/w/1:link.path	/media/m/velon/gr/oc/tr/m2/d7/ve/w/stichera2.pdf
media/gr_redirects_goarch/oc.m2.d7/octrVE.Stichera2/c1012/score/w/1:link.info	Α Ἰωάννου | JVelon
media/gr_redirects_goarch/oc.m2.d7/octrVE.Stichera2/c1012/score/w/1:link.path	/media/m/velon/gr/oc/tr/m2/d7/ve/w/stichera2_ioannou.pdf
media/gr_redirects_goarch/oc.m2.d7/octrVE.Stichera3/c1011/score/w/1:link.info	Ε Φαρλέκας | JVelon
media/gr_redirects_goarch/oc.m2.d7/octrVE.Stichera3/c1011/score/w/1:link.path	/media/m/velon/gr/oc/tr/m2/d7/ve/w/stichera3.pdf
media/gr_redirects_goarch/oc.m2.d7/octrVE.Stichera3/c1012/score/w/1:link.info	Α Ἰωάννου | JVelon
media/gr_redirects_goarch/oc.m2.d7/octrVE.Stichera3/c1012/score/w/1:link.path	/media/m/velon/gr/oc/tr/m2/d7/ve/w/stichera3_ioannou.pdf
media/gr_redirects_goarch/oc.m2.d7/octrVE.Stichera4/c1011/score/w/1:link.info	Ε Φαρλέκας | JVelon
media/gr_redirects_goarch/oc.m2.d7/octrVE.Stichera4/c1011/score/w/1:link.path	/media/m/velon/gr/oc/tr/m2/d7/ve/w/stichera4.pdf
media/gr_redirects_goarch/oc.m2.d7/octrVE.Stichera4/c1012/score/w/1:link.info	Α Ἰωάννου | JVelon
media/gr_redirects_goarch/oc.m2.d7/octrVE.Stichera4/c1012/score/w/1:link.path	/media/m/velon/gr/oc/tr/m2/d7/ve/w/stichera4_ioannou.pdf
