media/gr_redirects_goarch/me.m08.d30/meVE.Apolytikion1/c1011/score/w/1:link.info	NewByz
media/gr_redirects_goarch/me.m08.d30/meVE.Apolytikion1/c1011/score/w/1:link.path	/media/m/newbyz/gr/me/m08/d30/ve/w/apolytikion1.pdf
media/gr_redirects_goarch/me.m08.d30/meVE.Stichera01/c1011/score/b/1:link.info	Peter Petropoulos
media/gr_redirects_goarch/me.m08.d30/meVE.Stichera01/c1011/score/b/1:link.path	/media/m/petropoulos/gr/me/m08/d30/ve/b/stichera01.pdf
media/gr_redirects_goarch/me.m08.d30/meVE.Stichera02/c1011/score/b/1:link.info	Peter Petropoulos
media/gr_redirects_goarch/me.m08.d30/meVE.Stichera02/c1011/score/b/1:link.path	/media/m/petropoulos/gr/me/m08/d30/ve/b/stichera02.pdf
media/gr_redirects_goarch/me.m08.d30/meVE.Stichera03/c1011/score/b/1:link.info	Peter Petropoulos
media/gr_redirects_goarch/me.m08.d30/meVE.Stichera03/c1011/score/b/1:link.path	/media/m/petropoulos/gr/me/m08/d30/ve/b/stichera03.pdf
