media/gr_redirects_goarch/he.h.m8/heHE.EisakikoaKyrie/c1011/score/b/1:link.info	Petros-Ioannis | RBarrett
media/gr_redirects_goarch/he.h.m8/heHE.EisakikoaKyrie/c1011/score/b/1:link.path	/media/m/barrett/gr/he/h/m8/b/ode4_EisakikoaKyrie.pdf
media/gr_redirects_goarch/he.h.m8/heHE.FotisonImas/c1011/score/b/1:link.info	Petros-Ioannis | RBarrett
media/gr_redirects_goarch/he.h.m8/heHE.FotisonImas/c1011/score/b/1:link.path	/media/m/barrett/gr/he/h/m8/b/ode5_FotisonImass.pdf
media/gr_redirects_goarch/he.h.m8/heHE.KyriosTheotokon/c1011/score/b/1:link.info	Petros-Ioannis | RBarrett
media/gr_redirects_goarch/he.h.m8/heHE.KyriosTheotokon/c1011/score/b/1:link.path	/media/m/barrett/gr/he/h/m8/b/ode9_KyriosTheotokon.pdf
media/gr_redirects_goarch/he.h.m8/heHE.OiEkTisIoudaias/c1011/score/b/1:link.info	Petros-Ioannis | RBarrett
media/gr_redirects_goarch/he.h.m8/heHE.OiEkTisIoudaias/c1011/score/b/1:link.path	/media/m/barrett/gr/he/h/m8/b/ode7_OiEkTisIoudaias.pdf
media/gr_redirects_goarch/he.h.m8/heHE.OuraniasApsidos/c1011/score/b/1:link.info	Petros-Ioannis | RBarrett
media/gr_redirects_goarch/he.h.m8/heHE.OuraniasApsidos/c1011/score/b/1:link.path	/media/m/barrett/gr/he/h/m8/b/ode3_OuraniasApsidos.pdf
media/gr_redirects_goarch/he.h.m8/heHE.TinDeisinEkcheo/c1011/score/b/1:link.info	Petros-Ioannis | RBarrett
media/gr_redirects_goarch/he.h.m8/heHE.TinDeisinEkcheo/c1011/score/b/1:link.path	/media/m/barrett/gr/he/h/m8/b/ode6_TinDeisinEkcheo.pdf
media/gr_redirects_goarch/he.h.m8/heHE.TonVasileaTonOuranon/c1011/score/b/1:link.info	Petros-Ioannis | RBarrett
media/gr_redirects_goarch/he.h.m8/heHE.TonVasileaTonOuranon/c1011/score/b/1:link.path	/media/m/barrett/gr/he/h/m8/b/ode8_TonVasileaTonOuranon.pdf
media/gr_redirects_goarch/he.h.m8/heHE.YgranDiodefsas/c1011/score/b/1:link.info	Petros-Ioannis | RBarrett
media/gr_redirects_goarch/he.h.m8/heHE.YgranDiodefsas/c1011/score/b/1:link.path	/media/m/barrett/gr/he/h/m8/b/ode1_YgranDiodefsas.pdf
