media/gr_redirects_goarch/pe.d093/peMA.Kathisma11/c1011/score/w/1:link.info	JVelon
media/gr_redirects_goarch/pe.d093/peMA.Kathisma11/c1011/score/w/1:link.path	/media/m/velon/gr/oc/m3/d1/ma/w/kathisma11.pdf
media/gr_redirects_goarch/pe.d093/peMA.Kathisma11/c1012/score/b/1:link.info	GStephanou
media/gr_redirects_goarch/pe.d093/peMA.Kathisma11/c1012/score/b/1:link.path	/media/m/stephanou/gr/oc/m3/d1/ma/b/kathisma11.pdf
media/gr_redirects_goarch/pe.d093/peMA.Kathisma1T/c1011/score/w/1:link.info	JVelon
media/gr_redirects_goarch/pe.d093/peMA.Kathisma1T/c1011/score/w/1:link.path	/media/m/velon/gr/oc/m3/d1/ma/w/kathisma13.pdf
media/gr_redirects_goarch/pe.d093/peMA.Kathisma1T/c1012/score/b/1:link.info	GStephanou
media/gr_redirects_goarch/pe.d093/peMA.Kathisma1T/c1012/score/b/1:link.path	/media/m/stephanou/gr/oc/m3/d1/ma/b/kathisma13.pdf
