media/gr_redirects_goarch/tr.d065/trMA.AposGlory/c1011/score/b/1:link.info	Σακελλαρίδης | SApostolou
media/gr_redirects_goarch/tr.d065/trMA.AposGlory/c1011/score/b/1:link.path	/media/m/apostolou/gr/tr/d065/ma/b/aposglory.pdf
media/gr_redirects_goarch/tr.d065/trMA.AposGlory/c1012/score/w/1:link.info	JVelon
media/gr_redirects_goarch/tr.d065/trMA.AposGlory/c1012/score/w/1:link.path	/media/m/velon/gr/tr/d065/ma/w/aposglory.pdf
media/gr_redirects_goarch/tr.d065/trMA.AposGlory/c1013/score/b/1:link.info	Στέφανος Λαμπαδάριος | GTheodoridis
media/gr_redirects_goarch/tr.d065/trMA.AposGlory/c1013/score/b/1:link.path	/media/m/theodoridis/gr/tr/d065/ma/b/aposglory.pdf
media/gr_redirects_goarch/tr.d065/trMA.Aposticha1/c1011/score/b/1:link.info	Σακελλαρίδης | SApostolou
media/gr_redirects_goarch/tr.d065/trMA.Aposticha1/c1011/score/b/1:link.path	/media/m/apostolou/gr/tr/d065/ma/b/aposticha1.pdf
media/gr_redirects_goarch/tr.d065/trMA.Aposticha1/c1012/score/w/1:link.info	JVelon
media/gr_redirects_goarch/tr.d065/trMA.Aposticha1/c1012/score/w/1:link.path	/media/m/velon/gr/tr/d065/ma/w/aposticha1.pdf
media/gr_redirects_goarch/tr.d065/trMA.Aposticha1/c1013/score/b/1:link.info	Στέφανος Λαμπαδάριος | GTheodoridis
media/gr_redirects_goarch/tr.d065/trMA.Aposticha1/c1013/score/b/1:link.path	/media/m/theodoridis/gr/tr/d065/ma/b/aposticha1.pdf
media/gr_redirects_goarch/tr.d065/trMA.Aposticha2/c1011/score/b/1:link.info	Σακελλαρίδης | SApostolou
media/gr_redirects_goarch/tr.d065/trMA.Aposticha2/c1011/score/b/1:link.path	/media/m/apostolou/gr/tr/d065/ma/b/aposticha2.pdf
media/gr_redirects_goarch/tr.d065/trMA.Aposticha2/c1012/score/w/1:link.info	JVelon
media/gr_redirects_goarch/tr.d065/trMA.Aposticha2/c1012/score/w/1:link.path	/media/m/velon/gr/tr/d065/ma/w/aposticha2.pdf
media/gr_redirects_goarch/tr.d065/trMA.Aposticha2/c1013/score/b/1:link.info	Στέφανος Λαμπαδάριος | GTheodoridis
media/gr_redirects_goarch/tr.d065/trMA.Aposticha2/c1013/score/b/1:link.path	/media/m/theodoridis/gr/tr/d065/ma/b/aposticha2.pdf
media/gr_redirects_goarch/tr.d065/trMA.Aposticha3/c1011/score/b/1:link.info	Σακελλαρίδης | SApostolou
media/gr_redirects_goarch/tr.d065/trMA.Aposticha3/c1011/score/b/1:link.path	/media/m/apostolou/gr/tr/d065/ma/b/aposticha3.pdf
media/gr_redirects_goarch/tr.d065/trMA.Aposticha3/c1012/score/w/1:link.info	JVelon
media/gr_redirects_goarch/tr.d065/trMA.Aposticha3/c1012/score/w/1:link.path	/media/m/velon/gr/tr/d065/ma/w/aposticha3.pdf
media/gr_redirects_goarch/tr.d065/trMA.Aposticha3/c1013/score/b/1:link.info	Στέφανος Λαμπαδάριος | GTheodoridis
media/gr_redirects_goarch/tr.d065/trMA.Aposticha3/c1013/score/b/1:link.path	/media/m/theodoridis/gr/tr/d065/ma/b/aposticha3.pdf
media/gr_redirects_goarch/tr.d065/trMA.Exaposteilarion1/c1011/score/b/1:link.info	Σακελλαρίδης | SApostolou
media/gr_redirects_goarch/tr.d065/trMA.Exaposteilarion1/c1011/score/b/1:link.path	/media/m/apostolou/gr/tr/d065/ma/b/exaposteilarion1.pdf
media/gr_redirects_goarch/tr.d065/trMA.Exaposteilarion1/c1012/score/w/1:link.info	JVelon
media/gr_redirects_goarch/tr.d065/trMA.Exaposteilarion1/c1012/score/w/1:link.path	/media/m/velon/gr/tr/d065/ma/w/exaposteilarion1.pdf
media/gr_redirects_goarch/tr.d065/trMA.Exaposteilarion1/c1013/score/w/1:link.info	SDedes
media/gr_redirects_goarch/tr.d065/trMA.Exaposteilarion1/c1013/score/w/1:link.path	/media/m/dedes/gr/tr/d065/ma/w/exaposteilarion1.pdf
media/gr_redirects_goarch/tr.d065/trMA.Exaposteilarion1/c1014/score/w/1:link.info	NewByz
media/gr_redirects_goarch/tr.d065/trMA.Exaposteilarion1/c1014/score/w/1:link.path	/media/m/newbyz/gr/tr/d065/ma/w/exaposteilarion1.pdf
media/gr_redirects_goarch/tr.d065/trMA.Exaposteilarion1/c1015/score/b/1:link.info	GTheodoridis
media/gr_redirects_goarch/tr.d065/trMA.Exaposteilarion1/c1015/score/b/1:link.path	/media/m/theodoridis/gr/tr/d065/ma/b/exaposteilarion1.pdf
media/gr_redirects_goarch/tr.d065/trMA.Kathisma11/c1011/score/b/1:link.info	Σακελλαρίδης | SApostolou
media/gr_redirects_goarch/tr.d065/trMA.Kathisma11/c1011/score/b/1:link.path	/media/m/apostolou/gr/tr/d065/ma/b/kathisma1.pdf
media/gr_redirects_goarch/tr.d065/trMA.Kathisma11/c1012/score/w/1:link.info	JVelon
media/gr_redirects_goarch/tr.d065/trMA.Kathisma11/c1012/score/w/1:link.path	/media/m/velon/gr/tr/d065/ma/w/kathisma1.pdf
media/gr_redirects_goarch/tr.d065/trMA.Kathisma11/c1013/score/w/1:link.info	SDedes
media/gr_redirects_goarch/tr.d065/trMA.Kathisma11/c1013/score/w/1:link.path	/media/m/dedes/gr/tr/d065/ma/w/kathisma1.pdf
media/gr_redirects_goarch/tr.d065/trMA.Kathisma21/c1011/score/b/1:link.info	Σακελλαρίδης | SApostolou
media/gr_redirects_goarch/tr.d065/trMA.Kathisma21/c1011/score/b/1:link.path	/media/m/apostolou/gr/tr/d065/ma/b/kathisma2.pdf
media/gr_redirects_goarch/tr.d065/trMA.Kathisma21/c1012/score/w/1:link.info	JVelon
media/gr_redirects_goarch/tr.d065/trMA.Kathisma21/c1012/score/w/1:link.path	/media/m/velon/gr/tr/d065/ma/w/kathisma2.pdf
media/gr_redirects_goarch/tr.d065/trMA.Kathisma21/c1013/score/w/1:link.info	SDedes
media/gr_redirects_goarch/tr.d065/trMA.Kathisma21/c1013/score/w/1:link.path	/media/m/dedes/gr/tr/d065/ma/w/kathisma2.pdf
media/gr_redirects_goarch/tr.d065/trMA.Kathisma31/c1011/score/b/1:link.info	Σακελλαρίδης | SApostolou
media/gr_redirects_goarch/tr.d065/trMA.Kathisma31/c1011/score/b/1:link.path	/media/m/apostolou/gr/tr/d065/ma/b/kathisma3.pdf
media/gr_redirects_goarch/tr.d065/trMA.Kathisma31/c1012/score/w/1:link.info	JVelon
media/gr_redirects_goarch/tr.d065/trMA.Kathisma31/c1012/score/w/1:link.path	/media/m/velon/gr/tr/d065/ma/w/kathisma3.pdf
media/gr_redirects_goarch/tr.d065/trMA.Kathisma31/c1013/score/w/1:link.info	SDedes
media/gr_redirects_goarch/tr.d065/trMA.Kathisma31/c1013/score/w/1:link.path	/media/m/dedes/gr/tr/d065/ma/w/kathisma3.pdf
media/gr_redirects_goarch/tr.d065/trMA.Lauds1/c1011/score/b/1:link.info	Σακελλαρίδης | SApostolou
media/gr_redirects_goarch/tr.d065/trMA.Lauds1/c1011/score/b/1:link.path	/media/m/apostolou/gr/tr/d065/ma/b/lauds1.pdf
media/gr_redirects_goarch/tr.d065/trMA.Lauds1/c1012/score/w/1:link.info	JVelon
media/gr_redirects_goarch/tr.d065/trMA.Lauds1/c1012/score/w/1:link.path	/media/m/velon/gr/tr/d065/ma/w/lauds1.pdf
media/gr_redirects_goarch/tr.d065/trMA.Lauds1/c1013/score/b/1:link.info	Στέφανος Λαμπαδάριος | GTheodoridis
media/gr_redirects_goarch/tr.d065/trMA.Lauds1/c1013/score/b/1:link.path	/media/m/theodoridis/gr/tr/d065/ma/b/lauds1.pdf
media/gr_redirects_goarch/tr.d065/trMA.Lauds2/c1011/score/b/1:link.info	Σακελλαρίδης | SApostolou
media/gr_redirects_goarch/tr.d065/trMA.Lauds2/c1011/score/b/1:link.path	/media/m/apostolou/gr/tr/d065/ma/b/lauds2.pdf
media/gr_redirects_goarch/tr.d065/trMA.Lauds2/c1012/score/w/1:link.info	JVelon
media/gr_redirects_goarch/tr.d065/trMA.Lauds2/c1012/score/w/1:link.path	/media/m/velon/gr/tr/d065/ma/w/lauds2.pdf
media/gr_redirects_goarch/tr.d065/trMA.Lauds2/c1013/score/b/1:link.info	Στέφανος Λαμπαδάριος | GTheodoridis
media/gr_redirects_goarch/tr.d065/trMA.Lauds2/c1013/score/b/1:link.path	/media/m/theodoridis/gr/tr/d065/ma/b/lauds2.pdf
media/gr_redirects_goarch/tr.d065/trMA.LaudsGlory/c1011/score/b/1:link.info	Σακελλαρίδης | SApostolou
media/gr_redirects_goarch/tr.d065/trMA.LaudsGlory/c1011/score/b/1:link.path	/media/m/apostolou/gr/tr/d065/ma/b/laudsglory.pdf
media/gr_redirects_goarch/tr.d065/trMA.LaudsGlory/c1012/score/w/1:link.info	JVelon
media/gr_redirects_goarch/tr.d065/trMA.LaudsGlory/c1012/score/w/1:link.path	/media/m/velon/gr/tr/d065/ma/w/laudsglory.pdf
media/gr_redirects_goarch/tr.d065/trMA.LaudsGlory/c1013/score/b/1:link.info	Στέφανος Λαμπαδάριος | GTheodoridis
media/gr_redirects_goarch/tr.d065/trMA.LaudsGlory/c1013/score/b/1:link.path	/media/m/theodoridis/gr/tr/d065/ma/b/laudsglory.pdf
media/gr_redirects_goarch/tr.d065/trMA.MM.Alleluia/c1011/score/b/1:link.info	SApostolou
media/gr_redirects_goarch/tr.d065/trMA.MM.Alleluia/c1011/score/b/1:link.path	/media/m/apostolou/gr/tr/d065/ma/b/alleluia.pdf
media/gr_redirects_goarch/tr.d065/trMA.MM.Alleluia/c1012/score/w/1:link.info	JVelon
media/gr_redirects_goarch/tr.d065/trMA.MM.Alleluia/c1012/score/w/1:link.path	/media/m/velon/gr/tr/d065/ma/w/alleluia.pdf
media/gr_redirects_goarch/tr.d065/trMA.MM.Alleluia/c1014/score/b/1:link.info	GTheodoridis
media/gr_redirects_goarch/tr.d065/trMA.MM.Alleluia/c1014/score/b/1:link.path	/media/m/theodoridis/gr/tr/d065/ma/b/alleluia.pdf
media/gr_redirects_goarch/tr.d065/trMA.Ode1C1H/c1011/score/b/1:link.info	Σακελλαρίδης | SApostolou
media/gr_redirects_goarch/tr.d065/trMA.Ode1C1H/c1011/score/b/1:link.path	/media/m/apostolou/gr/tr/d065/ma/b/ode1.pdf
media/gr_redirects_goarch/tr.d065/trMA.Ode1C1H/c1012/score/w/1:link.info	JVelon
media/gr_redirects_goarch/tr.d065/trMA.Ode1C1H/c1012/score/w/1:link.path	/media/m/velon/gr/tr/d065/ma/w/ode1.pdf
media/gr_redirects_goarch/tr.d065/trMA.Ode1C1H/c1013/score/w/1:link.info	SDedes
media/gr_redirects_goarch/tr.d065/trMA.Ode1C1H/c1013/score/w/1:link.path	/media/m/dedes/gr/tr/d065/ma/w/ode1.pdf
media/gr_redirects_goarch/tr.d065/trMA.Ode1K/c1011/score/b/1:link.info	Σακελλαρίδης | SApostolou
media/gr_redirects_goarch/tr.d065/trMA.Ode1K/c1011/score/b/1:link.path	/media/m/apostolou/gr/tr/d065/ma/b/ode1k.pdf
media/gr_redirects_goarch/tr.d065/trMA.Ode8C1H/c1011/score/b/1:link.info	Σακελλαρίδης | SApostolou
media/gr_redirects_goarch/tr.d065/trMA.Ode8C1H/c1011/score/b/1:link.path	/media/m/apostolou/gr/tr/d065/ma/b/ode8.pdf
media/gr_redirects_goarch/tr.d065/trMA.Ode8C1H/c1012/score/w/1:link.info	JVelon
media/gr_redirects_goarch/tr.d065/trMA.Ode8C1H/c1012/score/w/1:link.path	/media/m/velon/gr/tr/d065/ma/w/ode8.pdf
media/gr_redirects_goarch/tr.d065/trMA.Ode8C1H/c1013/score/w/1:link.info	SDedes
media/gr_redirects_goarch/tr.d065/trMA.Ode8C1H/c1013/score/w/1:link.path	/media/m/dedes/gr/tr/d065/ma/w/ode8.pdf
media/gr_redirects_goarch/tr.d065/trMA.Ode8K/c1011/score/b/1:link.info	Σακελλαρίδης | SApostolou
media/gr_redirects_goarch/tr.d065/trMA.Ode8K/c1011/score/b/1:link.path	/media/m/apostolou/gr/tr/d065/ma/b/ode8k.pdf
media/gr_redirects_goarch/tr.d065/trMA.Ode9C1H/c1011/score/b/1:link.info	Σακελλαρίδης | SApostolou
media/gr_redirects_goarch/tr.d065/trMA.Ode9C1H/c1011/score/b/1:link.path	/media/m/apostolou/gr/tr/d065/ma/b/ode9.pdf
media/gr_redirects_goarch/tr.d065/trMA.Ode9C1H/c1012/score/w/1:link.info	JVelon
media/gr_redirects_goarch/tr.d065/trMA.Ode9C1H/c1012/score/w/1:link.path	/media/m/velon/gr/tr/d065/ma/w/ode9.pdf
media/gr_redirects_goarch/tr.d065/trMA.Ode9C1H/c1013/score/w/1:link.info	SDedes
media/gr_redirects_goarch/tr.d065/trMA.Ode9C1H/c1013/score/w/1:link.path	/media/m/dedes/gr/tr/d065/ma/w/ode9.pdf
media/gr_redirects_goarch/tr.d065/trMA.Ode9K/c1011/score/b/1:link.info	Σακελλαρίδης | SApostolou
media/gr_redirects_goarch/tr.d065/trMA.Ode9K/c1011/score/b/1:link.path	/media/m/apostolou/gr/tr/d065/ma/b/ode9k.pdf
media/gr_redirects_goarch/tr.d065/trMA.Troparion/c1011/score/b/1:link.info	Σακελλαρίδης | SApostolou
media/gr_redirects_goarch/tr.d065/trMA.Troparion/c1011/score/b/1:link.path	/media/m/apostolou/gr/tr/d065/ma/b/troparion.pdf
media/gr_redirects_goarch/tr.d065/trMA.Troparion/c1012/score/w/1:link.info	JVelon
media/gr_redirects_goarch/tr.d065/trMA.Troparion/c1012/score/w/1:link.path	/media/m/velon/gr/tr/d065/ma/w/troparion.pdf
media/gr_redirects_goarch/tr.d065/trMA.Troparion/c1013/score/w/1:link.info	SDedes
media/gr_redirects_goarch/tr.d065/trMA.Troparion/c1013/score/w/1:link.path	/media/m/dedes/gr/tr/d065/ma/w/troparion.pdf
media/gr_redirects_goarch/tr.d065/trMA.Troparion/c1015/score/w/1:link.info	NewByz
media/gr_redirects_goarch/tr.d065/trMA.Troparion/c1015/score/w/1:link.path	/media/m/newbyz/gr/tr/d065/ma/w/troparion.pdf
media/gr_redirects_goarch/tr.d065/trMA.Troparion/c1016/score/b/1:link.info	GTheodoridis
media/gr_redirects_goarch/tr.d065/trMA.Troparion/c1016/score/b/1:link.path	/media/m/theodoridis/gr/tr/d065/ma/b/troparion.pdf
