media/gr_redirects_goarch/tr.d063/trLI.Kontakion1/c1011/score/w/1:link.info	NewByz
media/gr_redirects_goarch/tr.d063/trLI.Kontakion1/c1011/score/w/1:link.path	/media/m/newbyz/gr/tr/d063/li/w/kontakion.pdf
media/gr_redirects_goarch/tr.d063/trLI.MM.CommunionHymn/c1011/score/w/1:link.info	NewByz
media/gr_redirects_goarch/tr.d063/trLI.MM.CommunionHymn/c1011/score/w/1:link.path	/media/m/newbyz/gr/tr/d063/li/w/communionhymn.pdf
media/gr_redirects_goarch/tr.d063/trLI.TheotokosHymn/c1011/score/w/1:link.info	NewByz
media/gr_redirects_goarch/tr.d063/trLI.TheotokosHymn/c1011/score/w/1:link.path	/media/m/newbyz/gr/tr/d063/li/w/theotokoshymn.pdf
media/gr_redirects_goarch/tr.d063/trVE.Apolytikion1/c1011/score/b/1:link.info	GStephanou
media/gr_redirects_goarch/tr.d063/trVE.Apolytikion1/c1011/score/b/1:link.path	/media/m/stephanou/gr/tr/d064/ve/b/apolytikion1.pdf
media/gr_redirects_goarch/tr.d063/trVE.Apolytikion1/c1012/score/w/1:link.info	NewByz
media/gr_redirects_goarch/tr.d063/trVE.Apolytikion1/c1012/score/w/1:link.path	/media/m/newbyz/gr/tr/d063/ve/w/apolytikion1.pdf
