media/gr_redirects_goarch/me.m12.d09/meLI.Kontakion2/c1011/score/w/1:link.info	NewByz
media/gr_redirects_goarch/me.m12.d09/meLI.Kontakion2/c1011/score/w/1:link.path	/media/m/newbyz/gr/me/m12/d09/li/w/seasonalkontakion.pdf
media/gr_redirects_goarch/me.m12.d09/meVE.Apolytikion1/c1011/score/w/1:link.info	NewByz
media/gr_redirects_goarch/me.m12.d09/meVE.Apolytikion1/c1011/score/w/1:link.path	/media/m/newbyz/gr/me/m12/d09/ve/w/apolytikion1.pdf
