media/gr_redirects_goarch/me.m11.d09/alt1.meVE.Apolytikion1/c1011/score/w/1:link.info	SDedes
media/gr_redirects_goarch/me.m11.d09/alt1.meVE.Apolytikion1/c1011/score/w/1:link.path	/media/m/dedes/gr/me/m11/d09/ve/w/apolytikion1.pdf
media/gr_redirects_goarch/me.m11.d09/alt1.meVE.Apolytikion1/c1011/score/w/2:link.info	NewByz
media/gr_redirects_goarch/me.m11.d09/alt1.meVE.Apolytikion1/c1011/score/w/2:link.path	/media/m/newbyz/gr/me/m11/d09/ve/w/apolytikion1.pdf
