media/gr_redirects_goarch/eu.lichrysbasil/euLI.Key1102/c1011/score/b/1:link.info	P Peloponnesios | RBarrett
media/gr_redirects_goarch/eu.lichrysbasil/euLI.Key1102/c1011/score/b/1:link.path	/media/m/barrett/gr/eu/lichrysbasil/b/cherubicmode1.pdf
media/gr_redirects_goarch/eu.lichrysbasil/euLI.Key1102/c1018/audio/1:link.info	SDedes
media/gr_redirects_goarch/eu.lichrysbasil/euLI.Key1102/c1018/audio/1:link.path	/media/a/gr/eu/lichrysbasil/cherubicmode8.mp3
media/gr_redirects_goarch/eu.lichrysbasil/euLI.Key1102/c1018/score/w/1:link.info	P Peloponnesios | SDedes
media/gr_redirects_goarch/eu.lichrysbasil/euLI.Key1102/c1018/score/w/1:link.path	/media/m/dedes/gr/eu/lichrysbasil/w/cherubicmode8.pdf
media/gr_redirects_goarch/eu.lichrysbasil/euLI.Key1200/c1014/score/b/1:link.info	Mode 4 Kliton | RBarrett
media/gr_redirects_goarch/eu.lichrysbasil/euLI.Key1200/c1014/score/b/1:link.path	/media/m/barrett/gr/eu/lichrysbasil/b/liturgicmode4kliton.pdf
media/gr_redirects_goarch/eu.lichrysbasil/euLI.Key1200/c1014/score/w/1:link.info	Mode 4 Kliton | RBarrett
media/gr_redirects_goarch/eu.lichrysbasil/euLI.Key1200/c1014/score/w/1:link.path	/media/m/barrett/gr/eu/lichrysbasil/w/liturgicmode4kliton.pdf
media/gr_redirects_goarch/eu.lichrysbasil/euLI.Key1318/c1018/score/w/1:link.info	SDedes | * 
media/gr_redirects_goarch/eu.lichrysbasil/euLI.Key1318/c1018/score/w/1:link.path	/media/m/dedes/gr/eu/lichrysbasil/w/wepraiseyoumode8.pdf
media/gr_redirects_goarch/eu.lichrysbasil/euLI.Key1328.basil/c1011/score/b/1:link.info	Σακελλαρίδης | SApostolou
media/gr_redirects_goarch/eu.lichrysbasil/euLI.Key1328.basil/c1011/score/b/1:link.path	/media/m/apostolou/gr/eu/lichrysbasil/b/inyouolady.pdf
media/gr_redirects_goarch/eu.lichrysbasil/euLI.Key1328.basil/c1011/score/w/1:link.info	NewByz
media/gr_redirects_goarch/eu.lichrysbasil/euLI.Key1328.basil/c1011/score/w/1:link.path	/media/m/newbyz/gr/eu/lichrysbasil/w/inyouolady_sakellaridis.pdf
media/gr_redirects_goarch/eu.lichrysbasil/euLI.Key1328.basil/c1012/score/w/1:link.info	JVelon
media/gr_redirects_goarch/eu.lichrysbasil/euLI.Key1328.basil/c1012/score/w/1:link.path	/media/m/velon/gr/eu/lichrysbasil/w/inyouolady.pdf
media/gr_redirects_goarch/eu.lichrysbasil/euLI.Key1328.basil/c1013/score/w/1:link.info	Anthimos | NewByz
media/gr_redirects_goarch/eu.lichrysbasil/euLI.Key1328.basil/c1013/score/w/1:link.path	/media/m/newbyz/gr/eu/lichrysbasil/w/inyouolady_anthimos.pdf
media/gr_redirects_goarch/eu.lichrysbasil/euLI.Key1328.basil/c1014/score/w/1:link.info	SDedes / pl. 4 - simple
media/gr_redirects_goarch/eu.lichrysbasil/euLI.Key1328.basil/c1014/score/w/1:link.path	/media/m/dedes/gr/eu/lichrysbasil/w/inyouolady8_simple.pdf
media/gr_redirects_goarch/eu.lichrysbasil/euLI.Key1411/c1011/score/b/1:link.info	GTheodoridis
media/gr_redirects_goarch/eu.lichrysbasil/euLI.Key1411/c1011/score/b/1:link.path	/media/m/theodoridis/gr/eu/lichrysbasil/b/oneisholy.pdf
media/gr_redirects_goarch/eu.lichrysbasil/euLI.Key1530/c1011/score/b/1:link.info	RBarrett
media/gr_redirects_goarch/eu.lichrysbasil/euLI.Key1530/c1011/score/b/1:link.path	/media/m/barrett/gr/eu/lichrysbasil/b/wehaveseenthetruelight.pdf
media/gr_redirects_goarch/eu.lichrysbasil/euLI.Key1530/c1012/score/b/1:link.info	GTheodoridis
media/gr_redirects_goarch/eu.lichrysbasil/euLI.Key1530/c1012/score/b/1:link.path	/media/m/theodoridis/gr/eu/lichrysbasil/b/wehaveseenthetruelight.pdf
media/gr_redirects_goarch/eu.lichrysbasil/euLI.Key1603/c1011/score/b/1:link.info	GTheodoridis
media/gr_redirects_goarch/eu.lichrysbasil/euLI.Key1603/c1011/score/b/1:link.path	/media/m/theodoridis/gr/eu/lichrysbasil/b/letourmouthsbefilled.pdf
media/gr_redirects_goarch/eu.lichrysbasil/euLI.Key1703/c1011/score/b/1:link.info	GTheodoridis
media/gr_redirects_goarch/eu.lichrysbasil/euLI.Key1703/c1011/score/b/1:link.path	/media/m/theodoridis/gr/eu/lichrysbasil/b/blessedbethename.pdf
media/gr_redirects_goarch/eu.lichrysbasil/euLI.Key1703/c1012/score/b/1:link.info	RBarrett
media/gr_redirects_goarch/eu.lichrysbasil/euLI.Key1703/c1012/score/b/1:link.path	/media/m/barrett/gr/eu/lichrysbasil/b/blessedbethename.pdf
media/gr_redirects_goarch/eu.lichrysbasil/euLI.Key1706/c1011/score/b/1:link.info	RBarrett
media/gr_redirects_goarch/eu.lichrysbasil/euLI.Key1706/c1011/score/b/1:link.path	/media/m/barrett/gr/eu/lichrysbasil/b/duringdismissal.pdf
media/gr_redirects_goarch/eu.lichrysbasil/euLI.Key1706/c1012/score/b/1:link.info	GTheodoridis
media/gr_redirects_goarch/eu.lichrysbasil/euLI.Key1706/c1012/score/b/1:link.path	/media/m/theodoridis/gr/eu/lichrysbasil/b/duringdismissal.pdf
media/gr_redirects_goarch/eu.lichrysbasil/euLI.MM.Key0200/c1011/audio/1:link.info	GTheodoridis
media/gr_redirects_goarch/eu.lichrysbasil/euLI.MM.Key0200/c1011/audio/1:link.path	/media/a/theodoridis/gr/eu/lichrysbasil/kyrieeleison8.mp3
media/gr_redirects_goarch/eu.lichrysbasil/euLI.MM.Key0200/c1011/score/b/1:link.info	GTheodoridis
media/gr_redirects_goarch/eu.lichrysbasil/euLI.MM.Key0200/c1011/score/b/1:link.path	/media/m/theodoridis/gr/eu/lichrysbasil/b/kyrieeleison8.pdf
media/gr_redirects_goarch/eu.lichrysbasil/euLI.MM.Key0200/c1012/score/w/1:link.info	SDedes
media/gr_redirects_goarch/eu.lichrysbasil/euLI.MM.Key0200/c1012/score/w/1:link.path	/media/m/dedes/gr/eu/lichrysbasil/w/kyrieeleison8.pdf
media/gr_redirects_goarch/eu.lichrysbasil/euLI.MM.Key0600/c1011/score/w/1:link.info	SDedes
media/gr_redirects_goarch/eu.lichrysbasil/euLI.MM.Key0600/c1011/score/w/1:link.path	/media/m/dedes/gr/eu/lichrysbasil/w/hierarchical_greek.pdf
media/gr_redirects_goarch/eu.lichrysbasil/euLI.MM.Key0613/c1011/score/b/1:link.info	Open List
media/gr_redirects_goarch/eu.lichrysbasil/euLI.MM.Key0613/c1011/score/b/1:link.path	/media/m/mi/en/b/eu.lichrysbasil_fimis.html
media/gr_redirects_goarch/eu.lichrysbasil/euLI.MM.Key0613/c1011/score/w/1:link.info	Open List
media/gr_redirects_goarch/eu.lichrysbasil/euLI.MM.Key0613/c1011/score/w/1:link.path	/media/m/mi/en/w/eu.lichrysbasil_fimis.html
