media/gr_redirects_goarch/tr.d029/trMA.ExapTheotokion/c1011/score/w/1:link.info	JVelon
media/gr_redirects_goarch/tr.d029/trMA.ExapTheotokion/c1011/score/w/1:link.path	/media/m/velon/gr/tr/d029/ma/w/exaptheotokion.pdf
media/gr_redirects_goarch/tr.d029/trMA.Exaposteilarion1/c1011/score/w/1:link.info	JVelon
media/gr_redirects_goarch/tr.d029/trMA.Exaposteilarion1/c1011/score/w/1:link.path	/media/m/velon/gr/tr/d029/ma/w/exaposteilarion1.pdf
media/gr_redirects_goarch/tr.d029/trMA.Lauds1/c1011/score/w/1:link.info	JVelon
media/gr_redirects_goarch/tr.d029/trMA.Lauds1/c1011/score/w/1:link.path	/media/m/velon/gr/tr/d029/ma/w/lauds1.pdf
media/gr_redirects_goarch/tr.d029/trMA.Lauds2/c1011/score/w/1:link.info	JVelon
media/gr_redirects_goarch/tr.d029/trMA.Lauds2/c1011/score/w/1:link.path	/media/m/velon/gr/tr/d029/ma/w/lauds2.pdf
media/gr_redirects_goarch/tr.d029/trMA.Lauds3/c1011/score/w/1:link.info	JVelon
media/gr_redirects_goarch/tr.d029/trMA.Lauds3/c1011/score/w/1:link.path	/media/m/velon/gr/tr/d029/ma/w/lauds3.pdf
media/gr_redirects_goarch/tr.d029/trMA.LaudsGlory/c1011/score/w/1:link.info	JVelon
media/gr_redirects_goarch/tr.d029/trMA.LaudsGlory/c1011/score/w/1:link.path	/media/m/velon/gr/tr/d029/ma/w/laudsglory.pdf
media/gr_redirects_goarch/tr.d029/trVE.Apolytikion1/c1011/score/w/1:link.info	JVelon
media/gr_redirects_goarch/tr.d029/trVE.Apolytikion1/c1011/score/w/1:link.path	/media/m/velon/gr/tr/d029/ve/w/apolytikion1.pdf
media/gr_redirects_goarch/tr.d029/trVE.Apolytikion1/c1012/score/w/1:link.info	NewByz
media/gr_redirects_goarch/tr.d029/trVE.Apolytikion1/c1012/score/w/1:link.path	/media/m/newbyz/gr/tr/d029/ve/w/apolytikion1.pdf
media/gr_redirects_goarch/tr.d029/trVE.AposGlory/c1011/score/w/1:link.info	JVelon
media/gr_redirects_goarch/tr.d029/trVE.AposGlory/c1011/score/w/1:link.path	/media/m/velon/gr/tr/d029/ve/w/aposglory.pdf
media/gr_redirects_goarch/tr.d029/trVE.LityBoth/c1011/score/w/1:link.info	JVelon
media/gr_redirects_goarch/tr.d029/trVE.LityBoth/c1011/score/w/1:link.path	/media/m/velon/gr/tr/d029/ve/w/lityboth.pdf
media/gr_redirects_goarch/tr.d029/trVE.LityGlory/c1011/score/w/1:link.info	JVelon
media/gr_redirects_goarch/tr.d029/trVE.LityGlory/c1011/score/w/1:link.path	/media/m/velon/gr/tr/d029/ve/w/lityglory.pdf
media/gr_redirects_goarch/tr.d029/trVE.SticGlory/c1011/score/w/1:link.info	JVelon
media/gr_redirects_goarch/tr.d029/trVE.SticGlory/c1011/score/w/1:link.path	/media/m/velon/gr/tr/d029/ve/w/sticglory.pdf
media/gr_redirects_goarch/tr.d029/trVE.Stichera01/c1011/score/w/1:link.info	JVelon
media/gr_redirects_goarch/tr.d029/trVE.Stichera01/c1011/score/w/1:link.path	/media/m/velon/gr/tr/d029/ve/w/stichera01.pdf
media/gr_redirects_goarch/tr.d029/trVE.Stichera02/c1011/score/w/1:link.info	JVelon
media/gr_redirects_goarch/tr.d029/trVE.Stichera02/c1011/score/w/1:link.path	/media/m/velon/gr/tr/d029/ve/w/stichera02.pdf
media/gr_redirects_goarch/tr.d029/trVE.Stichera03/c1011/score/w/1:link.info	JVelon
media/gr_redirects_goarch/tr.d029/trVE.Stichera03/c1011/score/w/1:link.path	/media/m/velon/gr/tr/d029/ve/w/stichera03.pdf
media/gr_redirects_goarch/tr.d029/trVE.Stichera04/c1011/score/w/1:link.info	JVelon
media/gr_redirects_goarch/tr.d029/trVE.Stichera04/c1011/score/w/1:link.path	/media/m/velon/gr/tr/d029/ve/w/stichera04.pdf
