media/gr_redirects_goarch/tr.d028/trVE.Apolytikion1/c1011/score/w/1:link.info	JVelon
media/gr_redirects_goarch/tr.d028/trVE.Apolytikion1/c1011/score/w/1:link.path	/media/m/velon/gr/tr/d028/ve/w/apolytikion1.pdf
media/gr_redirects_goarch/tr.d028/trVE.AposIdiomelon1/c1011/score/w/1:link.info	JVelon
media/gr_redirects_goarch/tr.d028/trVE.AposIdiomelon1/c1011/score/w/1:link.path	/media/m/velon/gr/tr/d028/ve/w/aposidiomelon1.pdf
media/gr_redirects_goarch/tr.d028/trVE.SticGlory/c1011/score/w/1:link.info	JVelon
media/gr_redirects_goarch/tr.d028/trVE.SticGlory/c1011/score/w/1:link.path	/media/m/velon/gr/tr/d028/ve/w/sticglory.pdf
media/gr_redirects_goarch/tr.d028/trVE.Stichera01/c1011/score/w/1:link.info	JVelon
media/gr_redirects_goarch/tr.d028/trVE.Stichera01/c1011/score/w/1:link.path	/media/m/velon/gr/tr/d028/ve/w/stichera01.pdf
media/gr_redirects_goarch/tr.d028/trVE.Stichera02/c1011/score/w/1:link.info	JVelon
media/gr_redirects_goarch/tr.d028/trVE.Stichera02/c1011/score/w/1:link.path	/media/m/velon/gr/tr/d028/ve/w/stichera02.pdf
media/gr_redirects_goarch/tr.d028/trVE.Stichera03/c1011/score/w/1:link.info	JVelon
media/gr_redirects_goarch/tr.d028/trVE.Stichera03/c1011/score/w/1:link.path	/media/m/velon/gr/tr/d028/ve/w/stichera03.pdf
media/gr_redirects_goarch/tr.d028/trVE.Stichera04/c1011/score/w/1:link.info	JVelon
media/gr_redirects_goarch/tr.d028/trVE.Stichera04/c1011/score/w/1:link.path	/media/m/velon/gr/tr/d028/ve/w/stichera04.pdf
