media/gr_redirects_goarch/me.m08.d05/meLI.Kontakion1/c1011/score/w/1:link.info	NewByz
media/gr_redirects_goarch/me.m08.d05/meLI.Kontakion1/c1011/score/w/1:link.path	/media/m/newbyz/gr/me/m08/d05/li/w/seasonalkontakion.pdf
media/gr_redirects_goarch/me.m08.d05/meVE.Apolytikion1/c1011/score/w/1:link.info	NewByz
media/gr_redirects_goarch/me.m08.d05/meVE.Apolytikion1/c1011/score/w/1:link.path	/media/m/newbyz/gr/me/m08/d05/ve/w/apolytikion1.pdf
