media/gr_redirects_goarch/me.m07.d26/meVE.Apolytikion2/c1011/score/w/1:link.info	NewByz
media/gr_redirects_goarch/me.m07.d26/meVE.Apolytikion2/c1011/score/w/1:link.path	/media/m/newbyz/gr/me/m07/d26/ve/w/apolytikion2.pdf
media/gr_redirects_goarch/me.m07.d26/meVE.Apolytikion2/c1012/score/w/1:link.info	KMarinakos
media/gr_redirects_goarch/me.m07.d26/meVE.Apolytikion2/c1012/score/w/1:link.path	/media/m/marinakos/gr/me/m07/d26/ve/w/apolytikion2.pdf
