media/gr_redirects_goarch/me.m05.d21/meMA.Exaposteilarion1/c1011/score/b/1:link.info	SApostolou
media/gr_redirects_goarch/me.m05.d21/meMA.Exaposteilarion1/c1011/score/b/1:link.path	/media/m/apostolou/gr/me/m05/d21/ma/b/exaposteilarion1.pdf
media/gr_redirects_goarch/me.m05.d21/meMA.Kathisma11/c1011/score/b/1:link.info	SApostolou
media/gr_redirects_goarch/me.m05.d21/meMA.Kathisma11/c1011/score/b/1:link.path	/media/m/apostolou/gr/me/m05/d21/ma/b/kathisma11.pdf
media/gr_redirects_goarch/me.m05.d21/meMA.Kathisma21/c1011/score/b/1:link.info	SApostolou
media/gr_redirects_goarch/me.m05.d21/meMA.Kathisma21/c1011/score/b/1:link.path	/media/m/apostolou/gr/me/m05/d21/ma/b/kathisma21.pdf
media/gr_redirects_goarch/me.m05.d21/meMA.Kathisma31/c1011/score/b/1:link.info	SApostolou
media/gr_redirects_goarch/me.m05.d21/meMA.Kathisma31/c1011/score/b/1:link.path	/media/m/apostolou/gr/me/m05/d21/ma/b/kathisma31.pdf
media/gr_redirects_goarch/me.m05.d21/meMA.Lauds1/c1011/score/b/1:link.info	SApostolou
media/gr_redirects_goarch/me.m05.d21/meMA.Lauds1/c1011/score/b/1:link.path	/media/m/apostolou/gr/me/m05/d21/ma/b/lauds1.pdf
media/gr_redirects_goarch/me.m05.d21/meMA.Lauds2/c1011/score/b/1:link.info	SApostolou
media/gr_redirects_goarch/me.m05.d21/meMA.Lauds2/c1011/score/b/1:link.path	/media/m/apostolou/gr/me/m05/d21/ma/b/lauds2.pdf
media/gr_redirects_goarch/me.m05.d21/meMA.Lauds3/c1011/score/b/1:link.info	SApostolou
media/gr_redirects_goarch/me.m05.d21/meMA.Lauds3/c1011/score/b/1:link.path	/media/m/apostolou/gr/me/m05/d21/ma/b/lauds3.pdf
media/gr_redirects_goarch/me.m05.d21/meMA.LaudsGlory/c1011/score/b/1:link.info	SApostolou
media/gr_redirects_goarch/me.m05.d21/meMA.LaudsGlory/c1011/score/b/1:link.path	/media/m/apostolou/gr/me/m05/d21/ma/b/laudsglory.pdf
media/gr_redirects_goarch/me.m05.d21/meMA.MM.Lauds123as456/c1011/score/b/1:link.info	SApostolou
media/gr_redirects_goarch/me.m05.d21/meMA.MM.Lauds123as456/c1011/score/b/1:link.path	/media/m/apostolou/gr/me/m05/d21/ma/b/lauds123as456.pdf
media/gr_redirects_goarch/me.m05.d21/meMA.Ode9C11/c1011/score/b/1:link.info	SApostolou
media/gr_redirects_goarch/me.m05.d21/meMA.Ode9C11/c1011/score/b/1:link.path	/media/m/apostolou/gr/me/m05/d21/ma/b/ode9c1.pdf
media/gr_redirects_goarch/me.m05.d21/meMA.PostGospelGlory/c1011/score/b/1:link.info	SApostolou
media/gr_redirects_goarch/me.m05.d21/meMA.PostGospelGlory/c1011/score/b/1:link.path	/media/m/apostolou/gr/me/m05/d21/ma/b/postgospel.pdf
media/gr_redirects_goarch/me.m05.d21/meVE.Apolytikion1/c1011/score/b/1:link.info	Σακελλαρίδης | SApostolou
media/gr_redirects_goarch/me.m05.d21/meVE.Apolytikion1/c1011/score/b/1:link.path	/media/m/apostolou/gr/me/m05/d21/ve/b/apolytikion1.pdf
media/gr_redirects_goarch/me.m05.d21/meVE.Apolytikion1/c1012/score/b/1:link.info	SApostolou
media/gr_redirects_goarch/me.m05.d21/meVE.Apolytikion1/c1012/score/b/1:link.path	/media/m/apostolou/gr/me/m05/d21/ve/b/apolytikion1.pdf
media/gr_redirects_goarch/me.m05.d21/meVE.Apolytikion1/c1013/score/w/1:link.info	NewByz
media/gr_redirects_goarch/me.m05.d21/meVE.Apolytikion1/c1013/score/w/1:link.path	/media/m/newbyz/gr/me/m05/d21/ve/w/apolytikion1.pdf
media/gr_redirects_goarch/me.m05.d21/meVE.AposGlory/c1011/score/b/1:link.info	Σακελλαρίδης | SApostolou
media/gr_redirects_goarch/me.m05.d21/meVE.AposGlory/c1011/score/b/1:link.path	/media/m/apostolou/gr/me/m05/d21/ve/b/aposglory.pdf
media/gr_redirects_goarch/me.m05.d21/meVE.SticGlory/c1011/score/b/1:link.info	Σακελλαρίδης | SApostolou
media/gr_redirects_goarch/me.m05.d21/meVE.SticGlory/c1011/score/b/1:link.path	/media/m/apostolou/gr/me/m05/d21/ve/b/sticglory.pdf
media/gr_redirects_goarch/me.m05.d21/meVE.Stichera01/c1011/score/b/1:link.info	SApostolou
media/gr_redirects_goarch/me.m05.d21/meVE.Stichera01/c1011/score/b/1:link.path	/media/m/apostolou/gr/me/m05/d21/ve/b/stichera01.pdf
media/gr_redirects_goarch/me.m05.d21/meVE.Stichera02/c1011/score/b/1:link.info	SApostolou
media/gr_redirects_goarch/me.m05.d21/meVE.Stichera02/c1011/score/b/1:link.path	/media/m/apostolou/gr/me/m05/d21/ve/b/stichera02.pdf
media/gr_redirects_goarch/me.m05.d21/meVE.Stichera03/c1011/score/b/1:link.info	SApostolou
media/gr_redirects_goarch/me.m05.d21/meVE.Stichera03/c1011/score/b/1:link.path	/media/m/apostolou/gr/me/m05/d21/ve/b/stichera03.pdf
