media/gr_redirects_goarch/eo.e03/eo.Doxasticon/c1011/score/w/1:link.info	Roubanis
media/gr_redirects_goarch/eo.e03/eo.Doxasticon/c1011/score/w/1:link.path	/media/m/roubanis/gr/eo/e03/w/eodoxasticon.pdf
media/gr_redirects_goarch/eo.e03/eo.Exaposteilarion/c1011/score/w/1:link.info	Roubanis
media/gr_redirects_goarch/eo.e03/eo.Exaposteilarion/c1011/score/w/1:link.path	/media/m/roubanis/gr/eo/e03/w/eoexaposteilarion.pdf
media/gr_redirects_goarch/eo.e03/eo.Exaposteilarion/c1012/score/b/1:link.info	GStephanou
media/gr_redirects_goarch/eo.e03/eo.Exaposteilarion/c1012/score/b/1:link.path	/media/m/stephanou/gr/eo/e03/b/eoexaposteilarion.pdf
media/gr_redirects_goarch/eo.e03/eo.Theotokion/c1011/score/w/1:link.info	Roubanis
media/gr_redirects_goarch/eo.e03/eo.Theotokion/c1011/score/w/1:link.path	/media/m/roubanis/gr/eo/e03/w/eotheotokion.pdf
media/gr_redirects_goarch/eo.e03/eo.Theotokion/c1012/score/b/1:link.info	GStephanou
media/gr_redirects_goarch/eo.e03/eo.Theotokion/c1012/score/b/1:link.path	/media/m/stephanou/gr/eo/e03/b/eotheotokion.pdf
