media/gr_redirects_goarch/ho.ho12/hoCO.Key0301/c1011/score/b/1:link.info	GTheodoridis
media/gr_redirects_goarch/ho.ho12/hoCO.Key0301/c1011/score/b/1:link.path	/media/m/theodoridis/gr/ho/ho12/b/gcompline1.pdf
media/gr_redirects_goarch/ho.ho12/hoCO.Key0301/c1012/score/w/1:link.info	Φωκαέως | JVelon
media/gr_redirects_goarch/ho.ho12/hoCO.Key0301/c1012/score/w/1:link.path	/media/m/velon/gr/ho/ho12/w/gcompline1.pdf
media/gr_redirects_goarch/ho.ho12/hoCO.Key0501/c1011/score/b/1:link.info	GTheodoridis
media/gr_redirects_goarch/ho.ho12/hoCO.Key0501/c1011/score/b/1:link.path	/media/m/theodoridis/gr/ho/ho12/b/gcompline2.pdf
media/gr_redirects_goarch/ho.ho12/hoCO.Key0501/c1012/score/w/1:link.info	JVelon
media/gr_redirects_goarch/ho.ho12/hoCO.Key0501/c1012/score/w/1:link.path	/media/m/velon/gr/ho/ho12/w/gcompline2.pdf
media/gr_redirects_goarch/ho.ho12/hoCO.Key0601/c1011/score/b/1:link.info	GTheodoridis
media/gr_redirects_goarch/ho.ho12/hoCO.Key0601/c1011/score/b/1:link.path	/media/m/theodoridis/gr/ho/ho12/b/gcompline3.pdf
media/gr_redirects_goarch/ho.ho12/hoCO.Key0601/c1012/score/w/1:link.info	JVelon
media/gr_redirects_goarch/ho.ho12/hoCO.Key0601/c1012/score/w/1:link.path	/media/m/velon/gr/ho/ho12/w/gcompline3.pdf
media/gr_redirects_goarch/ho.ho12/hoCO.Key0804/c1011/score/b/1:link.info	GTheodoridis
media/gr_redirects_goarch/ho.ho12/hoCO.Key0804/c1011/score/b/1:link.path	/media/m/theodoridis/gr/ho/ho12/b/gcompline3_havemercy.pdf
media/gr_redirects_goarch/ho.ho12/hoCO.Key1001/c1011/score/w/1:link.info	SDedes
media/gr_redirects_goarch/ho.ho12/hoCO.Key1001/c1011/score/w/1:link.path	/media/m/dedes/gr/ho/ho12/w/gcompline4.pdf
media/gr_redirects_goarch/ho.ho12/hoCO.Key1001/c1012/score/w/1:link.info	JVelon
media/gr_redirects_goarch/ho.ho12/hoCO.Key1001/c1012/score/w/1:link.path	/media/m/velon/gr/ho/ho12/w/gcompline4.pdf
media/gr_redirects_goarch/ho.ho12/hoCO.Key1001/c1016/score/b/1:link.info	Mode pl. 2 | GTheodoridis
media/gr_redirects_goarch/ho.ho12/hoCO.Key1001/c1016/score/b/1:link.path	/media/m/theodoridis/gr/ho/ho12/b/gcompline4_pl2.pdf
media/gr_redirects_goarch/ho.ho12/hoCO.Key1001/c1018/score/b/1:link.info	Mode pl. 4 | GTheodoridis
media/gr_redirects_goarch/ho.ho12/hoCO.Key1001/c1018/score/b/1:link.path	/media/m/theodoridis/gr/ho/ho12/b/gcompline4_pl4.pdf
media/gr_redirects_goarch/ho.ho12/hoCO.Key1013/c1011/score/b/1:link.info	GTheodoridis
media/gr_redirects_goarch/ho.ho12/hoCO.Key1013/c1011/score/b/1:link.path	/media/m/theodoridis/gr/ho/ho12/b/gcompline5.pdf
media/gr_redirects_goarch/ho.ho12/hoCO.Key1013/c1012/score/b/1:link.info	Long | GTheodoridis
media/gr_redirects_goarch/ho.ho12/hoCO.Key1013/c1012/score/b/1:link.path	/media/m/theodoridis/gr/ho/ho12/b/gcompline5_long.pdf
media/gr_redirects_goarch/ho.ho12/hoCO.Key1013/c1013/score/w/1:link.info	JVelon
media/gr_redirects_goarch/ho.ho12/hoCO.Key1013/c1013/score/w/1:link.path	/media/m/velon/gr/ho/ho12/w/gcompline5.pdf
media/gr_redirects_goarch/ho.ho12/hoCO.Key1301/c1011/score/b/1:link.info	GTheodoridis
media/gr_redirects_goarch/ho.ho12/hoCO.Key1301/c1011/score/b/1:link.path	/media/m/theodoridis/gr/ho/ho12/b/gcompline6.pdf
media/gr_redirects_goarch/ho.ho12/hoCO.Key1301/c1012/score/w/1:link.info	JVelon
media/gr_redirects_goarch/ho.ho12/hoCO.Key1301/c1012/score/w/1:link.path	/media/m/velon/gr/ho/ho12/w/gcompline6.pdf
media/gr_redirects_goarch/ho.ho12/hoCO.Key1303/c1212/score/b/1:link.info	GTheodoridis
media/gr_redirects_goarch/ho.ho12/hoCO.Key1303/c1212/score/b/1:link.path	/media/m/theodoridis/gr/ho/ho12/b/stavrotheotokion.pdf
media/gr_redirects_goarch/ho.ho12/hoCO.Key1303/c1213/score/b/1:link.info	GTheodoridis - long
media/gr_redirects_goarch/ho.ho12/hoCO.Key1303/c1213/score/b/1:link.path	/media/m/theodoridis/gr/ho/ho12/b/stavrotheotokion_long.pdf
