media/gr_redirects_goarch/me.m09.d28/meMA.Lauds1/c1011/score/b/1:link.info	GStephanou
media/gr_redirects_goarch/me.m09.d28/meMA.Lauds1/c1011/score/b/1:link.path	/media/m/stephanou/gr/me/m09/d28/ma/b/lauds1.pdf
media/gr_redirects_goarch/me.m09.d28/meVE.MM.GeneralApolytikion1/c1011/score/w/1:link.info	NewByz
media/gr_redirects_goarch/me.m09.d28/meVE.MM.GeneralApolytikion1/c1011/score/w/1:link.path	/media/m/newbyz/gr/me/m09/d28/ve/w/generalapolytikion1.pdf
