media/gr_redirects_goarch/oc.m8.d1/ocMA.Kathisma11/c1011/score/w/1:link.info	Roubanis
media/gr_redirects_goarch/oc.m8.d1/ocMA.Kathisma11/c1011/score/w/1:link.path	/media/m/roubanis/gr/oc/m8/d1/ma/w/kathisma1.pdf
media/gr_redirects_goarch/oc.m8.d1/ocMA.Kathisma11/c1012/score/b/1:link.info	Petros-Ioannis | JM Boyer
media/gr_redirects_goarch/oc.m8.d1/ocMA.Kathisma11/c1012/score/b/1:link.path	/media/m/jmboyer/gr/oc/m8/d1/ma/b/kathisma11.pdf
media/gr_redirects_goarch/oc.m8.d1/ocMA.Kathisma12/c1012/score/b/1:link.info	Petros-Ioannis | JM Boyer
media/gr_redirects_goarch/oc.m8.d1/ocMA.Kathisma12/c1012/score/b/1:link.path	/media/m/jmboyer/gr/oc/m8/d1/ma/b/kathisma12.pdf
media/gr_redirects_goarch/oc.m8.d1/ocMA.Kathisma13/c1012/score/b/1:link.info	Petros-Ioannis | JM Boyer
media/gr_redirects_goarch/oc.m8.d1/ocMA.Kathisma13/c1012/score/b/1:link.path	/media/m/jmboyer/gr/oc/m8/d1/ma/b/kathisma13.pdf
media/gr_redirects_goarch/oc.m8.d1/ocMA.Kathisma21/c1011/score/w/1:link.info	Roubanis
media/gr_redirects_goarch/oc.m8.d1/ocMA.Kathisma21/c1011/score/w/1:link.path	/media/m/roubanis/gr/oc/m8/d1/ma/w/kathisma2.pdf
media/gr_redirects_goarch/oc.m8.d1/ocMA.Kathisma21/c1012/score/b/1:link.info	Petros-Ioannis | JM Boyer
media/gr_redirects_goarch/oc.m8.d1/ocMA.Kathisma21/c1012/score/b/1:link.path	/media/m/jmboyer/gr/oc/m8/d1/ma/b/kathisma21.pdf
media/gr_redirects_goarch/oc.m8.d1/ocMA.Kathisma22/c1012/score/b/1:link.info	Petros-Ioannis | JM Boyer
media/gr_redirects_goarch/oc.m8.d1/ocMA.Kathisma22/c1012/score/b/1:link.path	/media/m/jmboyer/gr/oc/m8/d1/ma/b/kathisma22.pdf
media/gr_redirects_goarch/oc.m8.d1/ocMA.Kathisma23/c1012/score/b/1:link.info	Petros-Ioannis | JM Boyer
media/gr_redirects_goarch/oc.m8.d1/ocMA.Kathisma23/c1012/score/b/1:link.path	/media/m/jmboyer/gr/oc/m8/d1/ma/b/kathisma23.pdf
media/gr_redirects_goarch/oc.m8.d1/ocMA.Lauds1/c1011/score/b/1:link.info	GTheodoridis
media/gr_redirects_goarch/oc.m8.d1/ocMA.Lauds1/c1011/score/b/1:link.path	/media/m/theodoridis/gr/oc/m8/d1/ma/b/lauds1.pdf
media/gr_redirects_goarch/oc.m8.d1/ocMA.Lauds1/c1012/score/b/1:link.info	Petros-Ioannis | JM Boyer
media/gr_redirects_goarch/oc.m8.d1/ocMA.Lauds1/c1012/score/b/1:link.path	/media/m/jmboyer/gr/oc/m8/d1/ma/b/lauds1.pdf
media/gr_redirects_goarch/oc.m8.d1/ocMA.Lauds1/c1013/score/b/1:link.info	Petros-Ioannis - concise | JM Boyer
media/gr_redirects_goarch/oc.m8.d1/ocMA.Lauds1/c1013/score/b/1:link.path	/media/m/jmboyer/gr/oc/m8/d1/ma/b/lauds1_concise.pdf
media/gr_redirects_goarch/oc.m8.d1/ocMA.Lauds1/c1015/score/w/1:link.info	Roubanis
media/gr_redirects_goarch/oc.m8.d1/ocMA.Lauds1/c1015/score/w/1:link.path	/media/m/roubanis/gr/oc/m8/d1/ma/w/lauds1.pdf
media/gr_redirects_goarch/oc.m8.d1/ocMA.Lauds2/c1011/score/b/1:link.info	GTheodoridis
media/gr_redirects_goarch/oc.m8.d1/ocMA.Lauds2/c1011/score/b/1:link.path	/media/m/theodoridis/gr/oc/m8/d1/ma/b/lauds2.pdf
media/gr_redirects_goarch/oc.m8.d1/ocMA.Lauds2/c1012/score/b/1:link.info	Petros-Ioannis | JM Boyer
media/gr_redirects_goarch/oc.m8.d1/ocMA.Lauds2/c1012/score/b/1:link.path	/media/m/jmboyer/gr/oc/m8/d1/ma/b/lauds2.pdf
media/gr_redirects_goarch/oc.m8.d1/ocMA.Lauds2/c1013/score/b/1:link.info	Petros-Ioannis - concise | JM Boyer
media/gr_redirects_goarch/oc.m8.d1/ocMA.Lauds2/c1013/score/b/1:link.path	/media/m/jmboyer/gr/oc/m8/d1/ma/b/lauds2_concise.pdf
media/gr_redirects_goarch/oc.m8.d1/ocMA.Lauds2/c1015/score/w/1:link.info	Roubanis
media/gr_redirects_goarch/oc.m8.d1/ocMA.Lauds2/c1015/score/w/1:link.path	/media/m/roubanis/gr/oc/m8/d1/ma/w/lauds2.pdf
media/gr_redirects_goarch/oc.m8.d1/ocMA.Lauds3/c1011/score/b/1:link.info	GTheodoridis
media/gr_redirects_goarch/oc.m8.d1/ocMA.Lauds3/c1011/score/b/1:link.path	/media/m/theodoridis/gr/oc/m8/d1/ma/b/lauds3.pdf
media/gr_redirects_goarch/oc.m8.d1/ocMA.Lauds3/c1012/score/b/1:link.info	Petros-Ioannis | JM Boyer
media/gr_redirects_goarch/oc.m8.d1/ocMA.Lauds3/c1012/score/b/1:link.path	/media/m/jmboyer/gr/oc/m8/d1/ma/b/lauds3.pdf
media/gr_redirects_goarch/oc.m8.d1/ocMA.Lauds3/c1013/score/b/1:link.info	Petros-Ioannis - concise | JM Boyer
media/gr_redirects_goarch/oc.m8.d1/ocMA.Lauds3/c1013/score/b/1:link.path	/media/m/jmboyer/gr/oc/m8/d1/ma/b/lauds3_concise.pdf
media/gr_redirects_goarch/oc.m8.d1/ocMA.Lauds3/c1015/score/w/1:link.info	Roubanis
media/gr_redirects_goarch/oc.m8.d1/ocMA.Lauds3/c1015/score/w/1:link.path	/media/m/roubanis/gr/oc/m8/d1/ma/w/lauds3.pdf
media/gr_redirects_goarch/oc.m8.d1/ocMA.Lauds4/c1011/score/b/1:link.info	GTheodoridis
media/gr_redirects_goarch/oc.m8.d1/ocMA.Lauds4/c1011/score/b/1:link.path	/media/m/theodoridis/gr/oc/m8/d1/ma/b/lauds4.pdf
media/gr_redirects_goarch/oc.m8.d1/ocMA.Lauds4/c1012/score/b/1:link.info	Petros-Ioannis | JM Boyer
media/gr_redirects_goarch/oc.m8.d1/ocMA.Lauds4/c1012/score/b/1:link.path	/media/m/jmboyer/gr/oc/m8/d1/ma/b/lauds4.pdf
media/gr_redirects_goarch/oc.m8.d1/ocMA.Lauds4/c1013/score/b/1:link.info	Petros-Ioannis - concise | JM Boyer
media/gr_redirects_goarch/oc.m8.d1/ocMA.Lauds4/c1013/score/b/1:link.path	/media/m/jmboyer/gr/oc/m8/d1/ma/b/lauds4_concise.pdf
media/gr_redirects_goarch/oc.m8.d1/ocMA.Lauds4/c1015/score/w/1:link.info	Roubanis
media/gr_redirects_goarch/oc.m8.d1/ocMA.Lauds4/c1015/score/w/1:link.path	/media/m/roubanis/gr/oc/m8/d1/ma/w/lauds4.pdf
media/gr_redirects_goarch/oc.m8.d1/ocMA.Lauds5/c1011/score/b/1:link.info	GTheodoridis
media/gr_redirects_goarch/oc.m8.d1/ocMA.Lauds5/c1011/score/b/1:link.path	/media/m/theodoridis/gr/oc/m8/d1/ma/b/lauds5.pdf
media/gr_redirects_goarch/oc.m8.d1/ocMA.Lauds5/c1012/score/b/1:link.info	Petros-Ioannis | JM Boyer
media/gr_redirects_goarch/oc.m8.d1/ocMA.Lauds5/c1012/score/b/1:link.path	/media/m/jmboyer/gr/oc/m8/d1/ma/b/lauds5.pdf
media/gr_redirects_goarch/oc.m8.d1/ocMA.Lauds5/c1013/score/b/1:link.info	Petros-Ioannis - concise | JM Boyer
media/gr_redirects_goarch/oc.m8.d1/ocMA.Lauds5/c1013/score/b/1:link.path	/media/m/jmboyer/gr/oc/m8/d1/ma/b/lauds5_concise.pdf
media/gr_redirects_goarch/oc.m8.d1/ocMA.Lauds5/c1015/score/w/1:link.info	Roubanis
media/gr_redirects_goarch/oc.m8.d1/ocMA.Lauds5/c1015/score/w/1:link.path	/media/m/roubanis/gr/oc/m8/d1/ma/w/lauds5.pdf
media/gr_redirects_goarch/oc.m8.d1/ocMA.Lauds6/c1011/score/b/1:link.info	GTheodoridis
media/gr_redirects_goarch/oc.m8.d1/ocMA.Lauds6/c1011/score/b/1:link.path	/media/m/theodoridis/gr/oc/m8/d1/ma/b/lauds6.pdf
media/gr_redirects_goarch/oc.m8.d1/ocMA.Lauds6/c1012/score/b/1:link.info	Petros-Ioannis | JM Boyer
media/gr_redirects_goarch/oc.m8.d1/ocMA.Lauds6/c1012/score/b/1:link.path	/media/m/jmboyer/gr/oc/m8/d1/ma/b/lauds6.pdf
media/gr_redirects_goarch/oc.m8.d1/ocMA.Lauds6/c1013/score/b/1:link.info	Petros-Ioannis - concise | JM Boyer
media/gr_redirects_goarch/oc.m8.d1/ocMA.Lauds6/c1013/score/b/1:link.path	/media/m/jmboyer/gr/oc/m8/d1/ma/b/lauds6_concise.pdf
media/gr_redirects_goarch/oc.m8.d1/ocMA.Lauds6/c1015/score/w/1:link.info	Roubanis
media/gr_redirects_goarch/oc.m8.d1/ocMA.Lauds6/c1015/score/w/1:link.path	/media/m/roubanis/gr/oc/m8/d1/ma/w/lauds6.pdf
media/gr_redirects_goarch/oc.m8.d1/ocMA.Lauds7/c1011/score/b/1:link.info	GTheodoridis
media/gr_redirects_goarch/oc.m8.d1/ocMA.Lauds7/c1011/score/b/1:link.path	/media/m/theodoridis/gr/oc/m8/d1/ma/b/lauds7.pdf
media/gr_redirects_goarch/oc.m8.d1/ocMA.Lauds7/c1012/score/b/1:link.info	Petros-Ioannis | JM Boyer
media/gr_redirects_goarch/oc.m8.d1/ocMA.Lauds7/c1012/score/b/1:link.path	/media/m/jmboyer/gr/oc/m8/d1/ma/b/lauds7.pdf
media/gr_redirects_goarch/oc.m8.d1/ocMA.Lauds7/c1013/score/b/1:link.info	Petros-Ioannis - concise | JM Boyer
media/gr_redirects_goarch/oc.m8.d1/ocMA.Lauds7/c1013/score/b/1:link.path	/media/m/jmboyer/gr/oc/m8/d1/ma/b/lauds7_concise.pdf
media/gr_redirects_goarch/oc.m8.d1/ocMA.Lauds7/c1015/score/w/1:link.info	Roubanis
media/gr_redirects_goarch/oc.m8.d1/ocMA.Lauds7/c1015/score/w/1:link.path	/media/m/roubanis/gr/oc/m8/d1/ma/w/lauds7.pdf
media/gr_redirects_goarch/oc.m8.d1/ocMA.Lauds8/c1011/score/b/1:link.info	GTheodoridis
media/gr_redirects_goarch/oc.m8.d1/ocMA.Lauds8/c1011/score/b/1:link.path	/media/m/theodoridis/gr/oc/m8/d1/ma/b/lauds8.pdf
media/gr_redirects_goarch/oc.m8.d1/ocMA.Lauds8/c1012/score/b/1:link.info	Petros-Ioannis | JM Boyer
media/gr_redirects_goarch/oc.m8.d1/ocMA.Lauds8/c1012/score/b/1:link.path	/media/m/jmboyer/gr/oc/m8/d1/ma/b/lauds8.pdf
media/gr_redirects_goarch/oc.m8.d1/ocMA.Lauds8/c1013/score/b/1:link.info	Petros-Ioannis - concise | JM Boyer
media/gr_redirects_goarch/oc.m8.d1/ocMA.Lauds8/c1013/score/b/1:link.path	/media/m/jmboyer/gr/oc/m8/d1/ma/b/lauds8_concise.pdf
media/gr_redirects_goarch/oc.m8.d1/ocMA.Lauds8/c1015/score/w/1:link.info	Roubanis
media/gr_redirects_goarch/oc.m8.d1/ocMA.Lauds8/c1015/score/w/1:link.path	/media/m/roubanis/gr/oc/m8/d1/ma/w/lauds8.pdf
media/gr_redirects_goarch/oc.m8.d1/ocMA.MM.AntiphonsProkeimenon/c1011/score/w/1:link.info	Roubanis
media/gr_redirects_goarch/oc.m8.d1/ocMA.MM.AntiphonsProkeimenon/c1011/score/w/1:link.path	/media/m/roubanis/gr/oc/m8/d1/ma/w/antiphonsprokeimenon.pdf
media/gr_redirects_goarch/oc.m8.d1/ocMA.MM.AntiphonsProkeimenon/c1012/score/b/1:link.info	Petros-Ioannis | JM Boyer
media/gr_redirects_goarch/oc.m8.d1/ocMA.MM.AntiphonsProkeimenon/c1012/score/b/1:link.path	/media/m/jmboyer/gr/oc/m8/d1/ma/b/antiphonsprokeimenon.pdf
media/gr_redirects_goarch/oc.m8.d1/ocMA.MM.GodIsTheLord/c1011/score/w/1:link.info	Roubanis
media/gr_redirects_goarch/oc.m8.d1/ocMA.MM.GodIsTheLord/c1011/score/w/1:link.path	/media/m/roubanis/gr/oc/m8/d1/ma/w/godisthelord.pdf
media/gr_redirects_goarch/oc.m8.d1/ocMA.MM.GodIsTheLord/c1012/score/b/1:link.info	GTheodoridis
media/gr_redirects_goarch/oc.m8.d1/ocMA.MM.GodIsTheLord/c1012/score/b/1:link.path	/media/m/theodoridis/gr/oc/m8/d1/ma/b/godisthelord.pdf
media/gr_redirects_goarch/oc.m8.d1/ocMA.MM.GodIsTheLord/c1013/score/b/1:link.info	Petros-Ioannis | JM Boyer
media/gr_redirects_goarch/oc.m8.d1/ocMA.MM.GodIsTheLord/c1013/score/b/1:link.path	/media/m/jmboyer/gr/oc/m8/d1/ma/b/godisthelord.pdf
media/gr_redirects_goarch/oc.m8.d1/ocMA.MM.GodIsTheLord/c1014/score/b/1:link.info	SApostolou
media/gr_redirects_goarch/oc.m8.d1/ocMA.MM.GodIsTheLord/c1014/score/b/1:link.path	/media/m/apostolou/gr/oc/m8/d1/ma/b/godisthelord.pdf
media/gr_redirects_goarch/oc.m8.d1/ocMA.MM.Lauds01/c1011/score/w/1:link.info	Roubanis
media/gr_redirects_goarch/oc.m8.d1/ocMA.MM.Lauds01/c1011/score/w/1:link.path	/media/m/roubanis/gr/oc/m8/d1/ma/w/lauds01.pdf
media/gr_redirects_goarch/oc.m8.d1/ocMA.MM.Lauds01/c1012/score/b/1:link.info	Petros-Ioannis | JM Boyer
media/gr_redirects_goarch/oc.m8.d1/ocMA.MM.Lauds01/c1012/score/b/1:link.path	/media/m/jmboyer/gr/oc/m8/d1/ma/b/lauds01.pdf
media/gr_redirects_goarch/oc.m8.d1/ocMA.MM.Lauds01/c1014/score/b/1:link.info	Petros-Ioannis - concise | JM Boyer
media/gr_redirects_goarch/oc.m8.d1/ocMA.MM.Lauds01/c1014/score/b/1:link.path	/media/m/jmboyer/gr/oc/m8/d1/ma/b/lauds01_concise.pdf
media/gr_redirects_goarch/oc.m8.d1/ocMA.MM.LaudsStichologia/c1011/score/b/1:link.info	Petros Byzantios | JM Boyer
media/gr_redirects_goarch/oc.m8.d1/ocMA.MM.LaudsStichologia/c1011/score/b/1:link.path	/media/m/jmboyer/gr/oc/m8/d1/ma/b/lauds_stichologia.pdf
media/gr_redirects_goarch/oc.m8.d1/ocMA.Magnificat/c1011/score/w/1:link.info	Ni= C - Roubanis
media/gr_redirects_goarch/oc.m8.d1/ocMA.Magnificat/c1011/score/w/1:link.path	/media/m/roubanis/gr/oc/m8/d1/ma/w/magnificatC.pdf
media/gr_redirects_goarch/oc.m8.d1/ocMA.Magnificat/c1013/score/b/1:link.info	From Ni - Petros-Ioannis | JM Boyer
media/gr_redirects_goarch/oc.m8.d1/ocMA.Magnificat/c1013/score/b/1:link.path	/media/m/jmboyer/gr/oc/m8/d1/ma/b/magnificatC.pdf
media/gr_redirects_goarch/oc.m8.d1/ocMA.Magnificat/c1015/score/b/1:link.info	From Ga - Petros-Ioannis | JM Boyer
media/gr_redirects_goarch/oc.m8.d1/ocMA.Magnificat/c1015/score/b/1:link.path	/media/m/jmboyer/gr/oc/m8/d1/ma/b/magnificatF.pdf
media/gr_redirects_goarch/oc.m8.d1/ocMA.Magnificat/c1017/score/b/1:link.info	GTheodoridis
media/gr_redirects_goarch/oc.m8.d1/ocMA.Magnificat/c1017/score/b/1:link.path	/media/m/theodoridis/gr/oc/m8/d1/ma/b/magnificat.pdf
media/gr_redirects_goarch/oc.m8.d1/ocVE.ApolTheotokionVM/c1011/score/w/1:link.info	Roubanis
media/gr_redirects_goarch/oc.m8.d1/ocVE.ApolTheotokionVM/c1011/score/w/1:link.path	/media/m/velon/gr/oc/m8/d1/ve/w/apoltheotokionvm.pdf
media/gr_redirects_goarch/oc.m8.d1/ocVE.ApolTheotokionVM/c1015/score/b/1:link.info	Petros-Ioannis | JM Boyer
media/gr_redirects_goarch/oc.m8.d1/ocVE.ApolTheotokionVM/c1015/score/b/1:link.path	/media/m/jmboyer/gr/oc/m8/d1/ve/b/apoltheotokionvm.pdf
media/gr_redirects_goarch/oc.m8.d1/ocVE.Apolytikion/c1011/score/w/1:link.info	Roubanis
media/gr_redirects_goarch/oc.m8.d1/ocVE.Apolytikion/c1011/score/w/1:link.path	/media/m/roubanis/gr/oc/m8/d1/ve/w/apolytikion.pdf
media/gr_redirects_goarch/oc.m8.d1/ocVE.Apolytikion/c1012/score/w/1:link.info	SDedes
media/gr_redirects_goarch/oc.m8.d1/ocVE.Apolytikion/c1012/score/w/1:link.path	/media/m/dedes/gr/oc/m8/d1/ve/w/apolytikion.pdf
media/gr_redirects_goarch/oc.m8.d1/ocVE.Apolytikion/c1014/score/b/1:link.info	GTheodoridis
media/gr_redirects_goarch/oc.m8.d1/ocVE.Apolytikion/c1014/score/b/1:link.path	/media/m/theodoridis/gr/oc/m8/d1/ve/b/apolytikion.pdf
media/gr_redirects_goarch/oc.m8.d1/ocVE.Apolytikion/c1015/score/b/1:link.info	Petros-Ioannis | JM Boyer
media/gr_redirects_goarch/oc.m8.d1/ocVE.Apolytikion/c1015/score/b/1:link.path	/media/m/jmboyer/gr/oc/m8/d1/ve/b/apolytikion.pdf
media/gr_redirects_goarch/oc.m8.d1/ocVE.AposTheotokion/c1011/score/w/1:link.info	Α Ἰωάννου | JVelon
media/gr_redirects_goarch/oc.m8.d1/ocVE.AposTheotokion/c1011/score/w/1:link.path	/media/m/velon/gr/oc/m8/d1/ve/w/apostheotokion.pdf
media/gr_redirects_goarch/oc.m8.d1/ocVE.AposTheotokion/c1014/score/b/1:link.info	Petros-Ioannis|GTheodoridis - Concise
media/gr_redirects_goarch/oc.m8.d1/ocVE.AposTheotokion/c1014/score/b/1:link.path	/media/m/theodoridis/gr/oc/m8/d1/ve/b/apostheotokion_heirmologic.pdf
media/gr_redirects_goarch/oc.m8.d1/ocVE.AposTheotokion/c1015/score/b/1:link.info	Petros-Ioannis|GTheodoridis - Sticheraric
media/gr_redirects_goarch/oc.m8.d1/ocVE.AposTheotokion/c1015/score/b/1:link.path	/media/m/theodoridis/gr/oc/m8/d1/ve/b/apostheotokion_sticheraric.pdf
media/gr_redirects_goarch/oc.m8.d1/ocVE.Aposticha1/c1011/score/w/1:link.info	JVelon
media/gr_redirects_goarch/oc.m8.d1/ocVE.Aposticha1/c1011/score/w/1:link.path	/media/m/velon/gr/oc/m8/d1/ve/w/aposticha1.pdf
media/gr_redirects_goarch/oc.m8.d1/ocVE.Aposticha1/c1014/score/b/1:link.info	Petros-Ioannis|GTheodoridis - Concise
media/gr_redirects_goarch/oc.m8.d1/ocVE.Aposticha1/c1014/score/b/1:link.path	/media/m/theodoridis/gr/oc/m8/d1/ve/b/aposticha1_heirmologic.pdf
media/gr_redirects_goarch/oc.m8.d1/ocVE.Aposticha1/c1015/score/b/1:link.info	Petros-Ioannis|GTheodoridis - Sticheraric
media/gr_redirects_goarch/oc.m8.d1/ocVE.Aposticha1/c1015/score/b/1:link.path	/media/m/theodoridis/gr/oc/m8/d1/ve/b/aposticha1_sticheraric.pdf
media/gr_redirects_goarch/oc.m8.d1/ocVE.Aposticha2/c1014/score/b/1:link.info	Petros-Ioannis|GTheodoridis - Concise
media/gr_redirects_goarch/oc.m8.d1/ocVE.Aposticha2/c1014/score/b/1:link.path	/media/m/theodoridis/gr/oc/m8/d1/ve/b/aposticha2_heirmologic.pdf
media/gr_redirects_goarch/oc.m8.d1/ocVE.Aposticha2/c1015/score/b/1:link.info	Petros-Ioannis|GTheodoridis - Sticheraric
media/gr_redirects_goarch/oc.m8.d1/ocVE.Aposticha2/c1015/score/b/1:link.path	/media/m/theodoridis/gr/oc/m8/d1/ve/b/aposticha2_sticheraric.pdf
media/gr_redirects_goarch/oc.m8.d1/ocVE.Aposticha3/c1014/score/b/1:link.info	Petros-Ioannis|GTheodoridis - Concise
media/gr_redirects_goarch/oc.m8.d1/ocVE.Aposticha3/c1014/score/b/1:link.path	/media/m/theodoridis/gr/oc/m8/d1/ve/b/aposticha3_heirmologic.pdf
media/gr_redirects_goarch/oc.m8.d1/ocVE.Aposticha3/c1015/score/b/1:link.info	Petros-Ioannis|GTheodoridis - Sticheraric
media/gr_redirects_goarch/oc.m8.d1/ocVE.Aposticha3/c1015/score/b/1:link.path	/media/m/theodoridis/gr/oc/m8/d1/ve/b/aposticha3_sticheraric.pdf
media/gr_redirects_goarch/oc.m8.d1/ocVE.Aposticha4/c1014/score/b/1:link.info	Petros-Ioannis|GTheodoridis - Concise
media/gr_redirects_goarch/oc.m8.d1/ocVE.Aposticha4/c1014/score/b/1:link.path	/media/m/theodoridis/gr/oc/m8/d1/ve/b/aposticha4_heirmologic.pdf
media/gr_redirects_goarch/oc.m8.d1/ocVE.Aposticha4/c1015/score/b/1:link.info	Petros-Ioannis|GTheodoridis - Sticheraric
media/gr_redirects_goarch/oc.m8.d1/ocVE.Aposticha4/c1015/score/b/1:link.path	/media/m/theodoridis/gr/oc/m8/d1/ve/b/aposticha4_sticheraric.pdf
media/gr_redirects_goarch/oc.m8.d1/ocVE.MM.LIHC1/c1011/score/w/1:link.info	JVelon
media/gr_redirects_goarch/oc.m8.d1/ocVE.MM.LIHC1/c1011/score/w/1:link.path	/media/m/velon/gr/oc/m8/d1/ve/w/lihc.pdf
media/gr_redirects_goarch/oc.m8.d1/ocVE.MM.LIHC1/c1012/score/w/1:link.info	JVelon
media/gr_redirects_goarch/oc.m8.d1/ocVE.MM.LIHC1/c1012/score/w/1:link.path	/media/m/velon/gr/oc/m8/d1/ve/w/lihc_brief.pdf
media/gr_redirects_goarch/oc.m8.d1/ocVE.MM.LIHC1/c1014/score/b/1:link.info	Petros-Ioannis | GTheodoridis
media/gr_redirects_goarch/oc.m8.d1/ocVE.MM.LIHC1/c1014/score/b/1:link.path	/media/m/theodoridis/gr/oc/m8/d1/ve/b/lihc1.pdf
media/gr_redirects_goarch/oc.m8.d1/ocVE.MM.LIHC1/c1015/score/b/1:link.info	Concise | GTheodoridis
media/gr_redirects_goarch/oc.m8.d1/ocVE.MM.LIHC1/c1015/score/b/1:link.path	/media/m/theodoridis/gr/oc/m8/d1/ve/b/lihc_concise.pdf
media/gr_redirects_goarch/oc.m8.d1/ocVE.MM.LIHC2/c1014/score/b/1:link.info	Petros-Ioannis | GTheodoridis
media/gr_redirects_goarch/oc.m8.d1/ocVE.MM.LIHC2/c1014/score/b/1:link.path	/media/m/theodoridis/gr/oc/m8/d1/ve/b/lihc2.pdf
media/gr_redirects_goarch/oc.m8.d1/ocVE.MM.Stichologia/c1014/score/b/1:link.info	Petros-Ioannis | GTheodoridis
media/gr_redirects_goarch/oc.m8.d1/ocVE.MM.Stichologia/c1014/score/b/1:link.path	/media/m/theodoridis/gr/oc/m8/d1/ve/b/lihc_stichologia.pdf
media/gr_redirects_goarch/oc.m8.d1/ocVE.SticTheotokion/c1011/score/w/1:link.info	Α Ἰωάννου | JVelon
media/gr_redirects_goarch/oc.m8.d1/ocVE.SticTheotokion/c1011/score/w/1:link.path	/media/m/velon/gr/oc/m8/d1/ve/w/stictheotokion.pdf
media/gr_redirects_goarch/oc.m8.d1/ocVE.SticTheotokion/c1012/score/w/1:link.info	JVelon
media/gr_redirects_goarch/oc.m8.d1/ocVE.SticTheotokion/c1012/score/w/1:link.path	/media/m/velon/gr/oc/m8/d1/ve/w/stictheotokion_alt.pdf
media/gr_redirects_goarch/oc.m8.d1/ocVE.SticTheotokion/c1014/score/b/1:link.info	Petros-Ioannis | GTheodoridis
media/gr_redirects_goarch/oc.m8.d1/ocVE.SticTheotokion/c1014/score/b/1:link.path	/media/m/theodoridis/gr/oc/m8/d1/ve/b/stictheotokion.pdf
media/gr_redirects_goarch/oc.m8.d1/ocVE.Stichera1/c1011/score/w/1:link.info	JVelon
media/gr_redirects_goarch/oc.m8.d1/ocVE.Stichera1/c1011/score/w/1:link.path	/media/m/velon/gr/oc/m8/d1/ve/w/stichera1.pdf
media/gr_redirects_goarch/oc.m8.d1/ocVE.Stichera1/c1014/score/b/1:link.info	Petros-Ioannis | GTheodoridis
media/gr_redirects_goarch/oc.m8.d1/ocVE.Stichera1/c1014/score/b/1:link.path	/media/m/theodoridis/gr/oc/m8/d1/ve/b/stichera1.pdf
media/gr_redirects_goarch/oc.m8.d1/ocVE.Stichera2/c1014/score/b/1:link.info	Petros-Ioannis | GTheodoridis
media/gr_redirects_goarch/oc.m8.d1/ocVE.Stichera2/c1014/score/b/1:link.path	/media/m/theodoridis/gr/oc/m8/d1/ve/b/stichera2.pdf
media/gr_redirects_goarch/oc.m8.d1/ocVE.Stichera3/c1014/score/b/1:link.info	Petros-Ioannis | GTheodoridis
media/gr_redirects_goarch/oc.m8.d1/ocVE.Stichera3/c1014/score/b/1:link.path	/media/m/theodoridis/gr/oc/m8/d1/ve/b/stichera3.pdf
media/gr_redirects_goarch/oc.m8.d1/ocVE.Stichera4/c1014/score/b/1:link.info	Petros-Ioannis | GTheodoridis
media/gr_redirects_goarch/oc.m8.d1/ocVE.Stichera4/c1014/score/b/1:link.path	/media/m/theodoridis/gr/oc/m8/d1/ve/b/stichera4.pdf
media/gr_redirects_goarch/oc.m8.d1/ocVE.Stichera5/c1014/score/b/1:link.info	Petros-Ioannis | GTheodoridis
media/gr_redirects_goarch/oc.m8.d1/ocVE.Stichera5/c1014/score/b/1:link.path	/media/m/theodoridis/gr/oc/m8/d1/ve/b/stichera5.pdf
media/gr_redirects_goarch/oc.m8.d1/ocVE.Stichera6/c1014/score/b/1:link.info	Petros-Ioannis | GTheodoridis
media/gr_redirects_goarch/oc.m8.d1/ocVE.Stichera6/c1014/score/b/1:link.path	/media/m/theodoridis/gr/oc/m8/d1/ve/b/stichera6.pdf
media/gr_redirects_goarch/oc.m8.d1/ocVE.Stichera7/c1014/score/b/1:link.info	Petros-Ioannis | GTheodoridis
media/gr_redirects_goarch/oc.m8.d1/ocVE.Stichera7/c1014/score/b/1:link.path	/media/m/theodoridis/gr/oc/m8/d1/ve/b/stichera7.pdf
