media/gr_redirects_goarch/oc.m8.d7/octrVE.Stichera1/c1011/score/w/1:link.info	Ε Φαρλέκας | JVelon
media/gr_redirects_goarch/oc.m8.d7/octrVE.Stichera1/c1011/score/w/1:link.path	/media/m/velon/gr/oc/tr/m8/d7/ve/w/stichera1.pdf
media/gr_redirects_goarch/oc.m8.d7/octrVE.Stichera1/c1012/score/w/1:link.info	Α Ἰωάννου | JVelon
media/gr_redirects_goarch/oc.m8.d7/octrVE.Stichera1/c1012/score/w/1:link.path	/media/m/velon/gr/oc/tr/m8/d7/ve/w/stichera1_ioannou.pdf
media/gr_redirects_goarch/oc.m8.d7/octrVE.Stichera2/c1011/score/w/1:link.info	JVelon
media/gr_redirects_goarch/oc.m8.d7/octrVE.Stichera2/c1011/score/w/1:link.path	/media/m/velon/gr/oc/tr/m8/d7/ve/w/stichera2.pdf
media/gr_redirects_goarch/oc.m8.d7/octrVE.Stichera2/c1012/score/w/1:link.info	Α Ἰωάννου | JVelon
media/gr_redirects_goarch/oc.m8.d7/octrVE.Stichera2/c1012/score/w/1:link.path	/media/m/velon/gr/oc/tr/m8/d7/ve/w/stichera2_ioannou.pdf
media/gr_redirects_goarch/oc.m8.d7/octrVE.Stichera3/c1011/score/w/1:link.info	JVelon
media/gr_redirects_goarch/oc.m8.d7/octrVE.Stichera3/c1011/score/w/1:link.path	/media/m/velon/gr/oc/tr/m8/d7/ve/w/stichera3.pdf
media/gr_redirects_goarch/oc.m8.d7/octrVE.Stichera3/c1011/score/w/2:link.info	JVelon
media/gr_redirects_goarch/oc.m8.d7/octrVE.Stichera3/c1011/score/w/2:link.path	/media/m/velon/gr/oc/tr/m8/d7/ve/w/stichera3_mp.pdf
media/gr_redirects_goarch/oc.m8.d7/octrVE.Stichera3/c1012/score/w/1:link.info	Α Ἰωάννου | JVelon
media/gr_redirects_goarch/oc.m8.d7/octrVE.Stichera3/c1012/score/w/1:link.path	/media/m/velon/gr/oc/tr/m8/d7/ve/w/stichera3_ioannou.pdf
media/gr_redirects_goarch/oc.m8.d7/octrVE.Stichera4/c1011/score/w/1:link.info	Ε Φαρλέκας | JVelon
media/gr_redirects_goarch/oc.m8.d7/octrVE.Stichera4/c1011/score/w/1:link.path	/media/m/velon/gr/tr/d026/ve/w/aposmartyric.pdf
media/gr_redirects_goarch/oc.m8.d7/octrVE.Stichera4/c1012/score/w/1:link.info	Α Ἰωάννου | JVelon
media/gr_redirects_goarch/oc.m8.d7/octrVE.Stichera4/c1012/score/w/1:link.path	/media/m/velon/gr/tr/d026/ve/w/aposmartyric_ioannou.pdf
