media/gr_redirects_goarch/me.m09.d07/meLI.Kontakion1/c1011/score/w/1:link.info	NewByz
media/gr_redirects_goarch/me.m09.d07/meLI.Kontakion1/c1011/score/w/1:link.path	/media/m/newbyz/gr/me/m09/d07/li/w/seasonalkontakion.pdf
media/gr_redirects_goarch/me.m09.d07/meVE.Apolytikion1/c1011/score/w/1:link.info	NewByz
media/gr_redirects_goarch/me.m09.d07/meVE.Apolytikion1/c1011/score/w/1:link.path	/media/m/newbyz/gr/me/m09/d07/ve/w/apolytikion1.pdf
