media/en_redirects_goarch/tr.d064/trLI.Kontakion1/c1221/score/w/1:link.info	SDedes
media/en_redirects_goarch/tr.d064/trLI.Kontakion1/c1221/score/w/1:link.path	/media/m/dedes/en/tr/d064/li/w/kontakion.pdf
media/en_redirects_goarch/tr.d064/trLI.Kontakion1/c2001/score/w/1:link.info	NewByz
media/en_redirects_goarch/tr.d064/trLI.Kontakion1/c2001/score/w/1:link.path	/media/m/newbyz/en/tr/d064/li/w/kontakion.pdf
media/en_redirects_goarch/tr.d064/trLI.MM.Antiphon2/c1211/score/w/1:link.info	SDedes
media/en_redirects_goarch/tr.d064/trLI.MM.Antiphon2/c1211/score/w/1:link.path	/media/m/dedes/en/tr/d064/li/w/antiphon2.pdf
media/en_redirects_goarch/tr.d064/trLI.MM.Antiphon2/c2001/score/w/1:link.info	NewByz
media/en_redirects_goarch/tr.d064/trLI.MM.Antiphon2/c2001/score/w/1:link.path	/media/m/newbyz/en/tr/d064/li/w/antiphon2.pdf
media/en_redirects_goarch/tr.d064/trLI.MM.CommunionHymn/c1111/score/w/1:link.info	SDedes
media/en_redirects_goarch/tr.d064/trLI.MM.CommunionHymn/c1111/score/w/1:link.path	/media/m/dedes/en/tr/d064/li/w/communionhymn.pdf
media/en_redirects_goarch/tr.d064/trLI.MM.CommunionHymn/c2001/score/w/1:link.info	NewByz
media/en_redirects_goarch/tr.d064/trLI.MM.CommunionHymn/c2001/score/w/1:link.path	/media/m/newbyz/en/tr/d064/li/w/communionhymn.pdf
media/en_redirects_goarch/tr.d064/trLI.MM.EntranceHymn/c1211/score/w/1:link.info	SDedes
media/en_redirects_goarch/tr.d064/trLI.MM.EntranceHymn/c1211/score/w/1:link.path	/media/m/dedes/en/tr/d064/li/w/entrancehymn.pdf
media/en_redirects_goarch/tr.d064/trLI.MM.EntranceHymn/c2001/score/w/1:link.info	NewByz
media/en_redirects_goarch/tr.d064/trLI.MM.EntranceHymn/c2001/score/w/1:link.path	/media/m/newbyz/en/tr/d064/li/w/entrancehymn.pdf
media/en_redirects_goarch/tr.d064/trLI.MM.EntranceHymn/c2261/score/b/1:link.info	Thyateira
media/en_redirects_goarch/tr.d064/trLI.MM.EntranceHymn/c2261/score/b/1:link.path	/media/m/thyateira/en/tr/d064/li/b/entrancehymn.pdf
media/en_redirects_goarch/tr.d064/trLI.MM.EntranceHymn/c2261/score/w/1:link.info	Thyateira
media/en_redirects_goarch/tr.d064/trLI.MM.EntranceHymn/c2261/score/w/1:link.path	/media/m/thyateira/en/tr/d064/li/w/entrancehymn.pdf
media/en_redirects_goarch/tr.d064/trLI.TheotokosHymn/c1211/score/w/1:link.info	SDedes
media/en_redirects_goarch/tr.d064/trLI.TheotokosHymn/c1211/score/w/1:link.path	/media/m/dedes/en/tr/d064/li/w/theotokoshymn.pdf
media/en_redirects_goarch/tr.d064/trLI.TheotokosHymn/c2001/score/w/1:link.info	NewByz
media/en_redirects_goarch/tr.d064/trLI.TheotokosHymn/c2001/score/w/1:link.path	/media/m/newbyz/en/tr/d064/li/w/theotokoshymn.pdf
media/en_redirects_goarch/tr.d064/trMA.Exaposteilarion1/c1211/score/w/1:link.info	SDedes
media/en_redirects_goarch/tr.d064/trMA.Exaposteilarion1/c1211/score/w/1:link.path	/media/m/dedes/en/tr/d064/ma/w/exaposteilarion1.pdf
media/en_redirects_goarch/tr.d064/trMA.Kathisma11/c1211/score/w/1:link.info	SDedes
media/en_redirects_goarch/tr.d064/trMA.Kathisma11/c1211/score/w/1:link.path	/media/m/dedes/en/tr/d064/ma/w/kathisma11.pdf
media/en_redirects_goarch/tr.d064/trMA.Kathisma12/c1211/score/w/1:link.info	SDedes
media/en_redirects_goarch/tr.d064/trMA.Kathisma12/c1211/score/w/1:link.path	/media/m/dedes/en/tr/d064/ma/w/kathisma12.pdf
media/en_redirects_goarch/tr.d064/trMA.Kathisma21/c1211/score/w/1:link.info	SDedes
media/en_redirects_goarch/tr.d064/trMA.Kathisma21/c1211/score/w/1:link.path	/media/m/dedes/en/tr/d064/ma/w/kathisma21.pdf
media/en_redirects_goarch/tr.d064/trMA.Kathisma22/c1211/score/w/1:link.info	SDedes
media/en_redirects_goarch/tr.d064/trMA.Kathisma22/c1211/score/w/1:link.path	/media/m/dedes/en/tr/d064/ma/w/kathisma22.pdf
media/en_redirects_goarch/tr.d064/trMA.Kathisma31/c1211/score/w/1:link.info	SDedes
media/en_redirects_goarch/tr.d064/trMA.Kathisma31/c1211/score/w/1:link.path	/media/m/dedes/en/tr/d064/ma/w/kathisma31.pdf
media/en_redirects_goarch/tr.d064/trMA.Lauds1/c1211/score/b/1:link.info	SDedes
media/en_redirects_goarch/tr.d064/trMA.Lauds1/c1211/score/b/1:link.path	/media/m/dedes/en/tr/d064/ma/b/lauds1.pdf
media/en_redirects_goarch/tr.d064/trMA.Lauds1/c1211/score/w/1:link.info	SDedes
media/en_redirects_goarch/tr.d064/trMA.Lauds1/c1211/score/w/1:link.path	/media/m/dedes/en/tr/d064/ma/w/lauds1.pdf
media/en_redirects_goarch/tr.d064/trMA.Lauds2/c1211/score/b/1:link.info	SDedes
media/en_redirects_goarch/tr.d064/trMA.Lauds2/c1211/score/b/1:link.path	/media/m/dedes/en/tr/d064/ma/b/lauds2.pdf
media/en_redirects_goarch/tr.d064/trMA.Lauds2/c1211/score/w/1:link.info	SDedes
media/en_redirects_goarch/tr.d064/trMA.Lauds2/c1211/score/w/1:link.path	/media/m/dedes/en/tr/d064/ma/w/lauds2.pdf
media/en_redirects_goarch/tr.d064/trMA.Lauds3/c1211/score/b/1:link.info	SDedes
media/en_redirects_goarch/tr.d064/trMA.Lauds3/c1211/score/b/1:link.path	/media/m/dedes/en/tr/d064/ma/b/lauds3.pdf
media/en_redirects_goarch/tr.d064/trMA.Lauds3/c1211/score/w/1:link.info	SDedes
media/en_redirects_goarch/tr.d064/trMA.Lauds3/c1211/score/w/1:link.path	/media/m/dedes/en/tr/d064/ma/w/lauds3.pdf
media/en_redirects_goarch/tr.d064/trMA.Lauds4/c1211/score/b/1:link.info	SDedes
media/en_redirects_goarch/tr.d064/trMA.Lauds4/c1211/score/b/1:link.path	/media/m/dedes/en/tr/d064/ma/b/lauds4.pdf
media/en_redirects_goarch/tr.d064/trMA.Lauds4/c1211/score/w/1:link.info	SDedes
media/en_redirects_goarch/tr.d064/trMA.Lauds4/c1211/score/w/1:link.path	/media/m/dedes/en/tr/d064/ma/w/lauds4.pdf
media/en_redirects_goarch/tr.d064/trMA.LaudsGlory/c1211/score/b/1:link.info	SDedes
media/en_redirects_goarch/tr.d064/trMA.LaudsGlory/c1211/score/b/1:link.path	/media/m/dedes/en/tr/d064/ma/b/laudsglory.pdf
media/en_redirects_goarch/tr.d064/trMA.LaudsGlory/c1211/score/w/1:link.info	SDedes
media/en_redirects_goarch/tr.d064/trMA.LaudsGlory/c1211/score/w/1:link.path	/media/m/dedes/en/tr/d064/ma/w/laudsglory.pdf
media/en_redirects_goarch/tr.d064/trMA.Ode9C1H/c1211/score/b/1:link.info	SDedes
media/en_redirects_goarch/tr.d064/trMA.Ode9C1H/c1211/score/b/1:link.path	/media/m/dedes/en/tr/d064/ma/b/ode9.pdf
media/en_redirects_goarch/tr.d064/trMA.Ode9C1H/c1211/score/w/1:link.info	SDedes
media/en_redirects_goarch/tr.d064/trMA.Ode9C1H/c1211/score/w/1:link.path	/media/m/dedes/en/tr/d064/ma/w/ode9.pdf
media/en_redirects_goarch/tr.d064/trMA.PostGospelGlory/c1211/score/b/1:link.info	SDedes
media/en_redirects_goarch/tr.d064/trMA.PostGospelGlory/c1211/score/b/1:link.path	/media/m/dedes/en/tr/d064/ma/b/postgospelglory.pdf
media/en_redirects_goarch/tr.d064/trMA.PostGospelGlory/c1211/score/w/1:link.info	SDedes
media/en_redirects_goarch/tr.d064/trMA.PostGospelGlory/c1211/score/w/1:link.path	/media/m/dedes/en/tr/d064/ma/w/postgospelglory.pdf
media/en_redirects_goarch/tr.d064/trMA.PostGospelIdiomelon/c1211/score/b/1:link.info	SDedes
media/en_redirects_goarch/tr.d064/trMA.PostGospelIdiomelon/c1211/score/b/1:link.path	/media/m/dedes/en/tr/d064/ma/b/postgospelidiomelon.pdf
media/en_redirects_goarch/tr.d064/trMA.PostGospelIdiomelon/c1211/score/w/1:link.info	SDedes
media/en_redirects_goarch/tr.d064/trMA.PostGospelIdiomelon/c1211/score/w/1:link.path	/media/m/dedes/en/tr/d064/ma/w/postgospelidiomelon.pdf
media/en_redirects_goarch/tr.d064/trVE.Apolytikion1/c1211/score/w/1:link.info	SDedes
media/en_redirects_goarch/tr.d064/trVE.Apolytikion1/c1211/score/w/1:link.path	/media/m/dedes/en/tr/d064/ve/w/apolytikion1.pdf
media/en_redirects_goarch/tr.d064/trVE.Apolytikion1/c2001/score/w/1:link.info	NewByz
media/en_redirects_goarch/tr.d064/trVE.Apolytikion1/c2001/score/w/1:link.path	/media/m/newbyz/en/tr/d064/ve/w/apolytikion1.pdf
media/en_redirects_goarch/tr.d064/trVE.Apolytikion2/c1211/score/w/1:link.info	SDedes
media/en_redirects_goarch/tr.d064/trVE.Apolytikion2/c1211/score/w/1:link.path	/media/m/dedes/en/tr/d064/ve/w/apolytikion2.pdf
media/en_redirects_goarch/tr.d064/trVE.Apolytikion2/c2001/score/w/1:link.info	NewByz
media/en_redirects_goarch/tr.d064/trVE.Apolytikion2/c2001/score/w/1:link.path	/media/m/newbyz/en/tr/d064/ve/w/apolytikion2.pdf
media/en_redirects_goarch/tr.d064/trVE.AposGlory/c1211/score/b/1:link.info	SDedes
media/en_redirects_goarch/tr.d064/trVE.AposGlory/c1211/score/b/1:link.path	/media/m/dedes/en/tr/d064/ve/b/sticglory.pdf
media/en_redirects_goarch/tr.d064/trVE.AposGlory/c1211/score/w/1:link.info	SDedes
media/en_redirects_goarch/tr.d064/trVE.AposGlory/c1211/score/w/1:link.path	/media/m/dedes/en/tr/d064/ve/w/sticglory.pdf
media/en_redirects_goarch/tr.d064/trVE.Aposticha1/c1211/score/b/1:link.info	SDedes
media/en_redirects_goarch/tr.d064/trVE.Aposticha1/c1211/score/b/1:link.path	/media/m/dedes/en/tr/d064/ve/b/aposticha1.pdf
media/en_redirects_goarch/tr.d064/trVE.Aposticha1/c1211/score/w/1:link.info	SDedes
media/en_redirects_goarch/tr.d064/trVE.Aposticha1/c1211/score/w/1:link.path	/media/m/dedes/en/tr/d064/ve/w/aposticha1.pdf
media/en_redirects_goarch/tr.d064/trVE.Aposticha2/c1211/score/b/1:link.info	SDedes
media/en_redirects_goarch/tr.d064/trVE.Aposticha2/c1211/score/b/1:link.path	/media/m/dedes/en/tr/d064/ve/b/aposticha2.pdf
media/en_redirects_goarch/tr.d064/trVE.Aposticha2/c1211/score/w/1:link.info	SDedes
media/en_redirects_goarch/tr.d064/trVE.Aposticha2/c1211/score/w/1:link.path	/media/m/dedes/en/tr/d064/ve/w/aposticha2.pdf
media/en_redirects_goarch/tr.d064/trVE.Aposticha3/c1211/score/b/1:link.info	SDedes
media/en_redirects_goarch/tr.d064/trVE.Aposticha3/c1211/score/b/1:link.path	/media/m/dedes/en/tr/d064/ve/b/aposticha3.pdf
media/en_redirects_goarch/tr.d064/trVE.Aposticha3/c1211/score/w/1:link.info	SDedes
media/en_redirects_goarch/tr.d064/trVE.Aposticha3/c1211/score/w/1:link.path	/media/m/dedes/en/tr/d064/ve/w/aposticha3.pdf
media/en_redirects_goarch/tr.d064/trVE.SticGlory/c1211/score/b/1:link.info	SDedes
media/en_redirects_goarch/tr.d064/trVE.SticGlory/c1211/score/b/1:link.path	/media/m/dedes/en/tr/d064/ve/b/sticglory.pdf
media/en_redirects_goarch/tr.d064/trVE.SticGlory/c1211/score/w/1:link.info	SDedes
media/en_redirects_goarch/tr.d064/trVE.SticGlory/c1211/score/w/1:link.path	/media/m/dedes/en/tr/d064/ve/w/sticglory.pdf
media/en_redirects_goarch/tr.d064/trVE.Stichera01/c1211/score/b/1:link.info	SDedes
media/en_redirects_goarch/tr.d064/trVE.Stichera01/c1211/score/b/1:link.path	/media/m/dedes/en/tr/d064/ve/b/stichera01.pdf
media/en_redirects_goarch/tr.d064/trVE.Stichera01/c1211/score/w/1:link.info	SDedes
media/en_redirects_goarch/tr.d064/trVE.Stichera01/c1211/score/w/1:link.path	/media/m/dedes/en/tr/d064/ve/w/stichera01.pdf
media/en_redirects_goarch/tr.d064/trVE.Stichera02/c1211/score/b/1:link.info	SDedes
media/en_redirects_goarch/tr.d064/trVE.Stichera02/c1211/score/b/1:link.path	/media/m/dedes/en/tr/d064/ve/b/stichera02.pdf
media/en_redirects_goarch/tr.d064/trVE.Stichera02/c1211/score/w/1:link.info	SDedes
media/en_redirects_goarch/tr.d064/trVE.Stichera02/c1211/score/w/1:link.path	/media/m/dedes/en/tr/d064/ve/w/stichera02.pdf
media/en_redirects_goarch/tr.d064/trVE.Stichera03/c1211/score/b/1:link.info	SDedes
media/en_redirects_goarch/tr.d064/trVE.Stichera03/c1211/score/b/1:link.path	/media/m/dedes/en/tr/d064/ve/b/stichera03.pdf
media/en_redirects_goarch/tr.d064/trVE.Stichera03/c1211/score/w/1:link.info	SDedes
media/en_redirects_goarch/tr.d064/trVE.Stichera03/c1211/score/w/1:link.path	/media/m/dedes/en/tr/d064/ve/w/stichera03.pdf
media/en_redirects_goarch/tr.d064/trVE.Stichera04/c1211/score/b/1:link.info	SDedes
media/en_redirects_goarch/tr.d064/trVE.Stichera04/c1211/score/b/1:link.path	/media/m/dedes/en/tr/d064/ve/b/stichera04.pdf
media/en_redirects_goarch/tr.d064/trVE.Stichera04/c1211/score/w/1:link.info	SDedes
media/en_redirects_goarch/tr.d064/trVE.Stichera04/c1211/score/w/1:link.path	/media/m/dedes/en/tr/d064/ve/w/stichera04.pdf
media/en_redirects_goarch/tr.d064/trVE.Stichera05/c1211/score/b/1:link.info	SDedes
media/en_redirects_goarch/tr.d064/trVE.Stichera05/c1211/score/b/1:link.path	/media/m/dedes/en/tr/d064/ve/b/stichera05.pdf
media/en_redirects_goarch/tr.d064/trVE.Stichera05/c1211/score/w/1:link.info	SDedes
media/en_redirects_goarch/tr.d064/trVE.Stichera05/c1211/score/w/1:link.path	/media/m/dedes/en/tr/d064/ve/w/stichera05.pdf
