media/en_redirects_goarch/me.m03.d09/alt1.meVE.LityBoth/c1211/score/b/1:link.info	SDedes
media/en_redirects_goarch/me.m03.d09/alt1.meVE.LityBoth/c1211/score/b/1:link.path	/media/m/dedes/en/oc/m5/d3/ve/b/apostheotokion.pdf
media/en_redirects_goarch/me.m03.d09/alt1.meVE.LityBoth/c1211/score/w/1:link.info	SDedes
media/en_redirects_goarch/me.m03.d09/alt1.meVE.LityBoth/c1211/score/w/1:link.path	/media/m/dedes/en/oc/m5/d3/ve/w/apostheotokion.pdf
media/en_redirects_goarch/me.m03.d09/meMA.AposGlory/c1211/score/b/1:link.info	SDedes
media/en_redirects_goarch/me.m03.d09/meMA.AposGlory/c1211/score/b/1:link.path	/media/m/dedes/en/me/m03/d09/ma/b/maposglory.pdf
media/en_redirects_goarch/me.m03.d09/meMA.AposGlory/c1211/score/w/1:link.info	SDedes
media/en_redirects_goarch/me.m03.d09/meMA.AposGlory/c1211/score/w/1:link.path	/media/m/dedes/en/me/m03/d09/ma/w/maposglory.pdf
media/en_redirects_goarch/me.m03.d09/meMA.ExapTheotokion/c1211/score/w/1:link.info	SDedes
media/en_redirects_goarch/me.m03.d09/meMA.ExapTheotokion/c1211/score/w/1:link.path	/media/m/dedes/en/me/m03/d09/ma/w/exaptheotokion.pdf
media/en_redirects_goarch/me.m03.d09/meMA.Exaposteilarion1/c1211/score/w/1:link.info	SDedes
media/en_redirects_goarch/me.m03.d09/meMA.Exaposteilarion1/c1211/score/w/1:link.path	/media/m/dedes/en/me/m03/d09/ma/w/exaposteilarion1.pdf
media/en_redirects_goarch/me.m03.d09/meMA.Kathisma31/c1211/score/w/1:link.info	SDedes
media/en_redirects_goarch/me.m03.d09/meMA.Kathisma31/c1211/score/w/1:link.path	/media/m/dedes/en/me/m03/d09/ma/w/kathisma31.pdf
media/en_redirects_goarch/me.m03.d09/meMA.Kathisma3T/c1211/score/w/1:link.info	SDedes
media/en_redirects_goarch/me.m03.d09/meMA.Kathisma3T/c1211/score/w/1:link.path	/media/m/dedes/en/me/m03/d09/ma/w/kathisma3t.pdf
media/en_redirects_goarch/me.m03.d09/meMA.Lauds1/c1211/score/w/1:link.info	SDedes
media/en_redirects_goarch/me.m03.d09/meMA.Lauds1/c1211/score/w/1:link.path	/media/m/dedes/en/me/m03/d09/ma/w/lauds1.pdf
media/en_redirects_goarch/me.m03.d09/meMA.Lauds2/c1211/score/w/1:link.info	SDedes
media/en_redirects_goarch/me.m03.d09/meMA.Lauds2/c1211/score/w/1:link.path	/media/m/dedes/en/me/m03/d09/ma/w/lauds2.pdf
media/en_redirects_goarch/me.m03.d09/meMA.Lauds3/c1211/score/w/1:link.info	SDedes
media/en_redirects_goarch/me.m03.d09/meMA.Lauds3/c1211/score/w/1:link.path	/media/m/dedes/en/me/m03/d09/ma/w/lauds3.pdf
media/en_redirects_goarch/me.m03.d09/meMA.LaudsGlory/c1211/score/b/1:link.info	SDedes
media/en_redirects_goarch/me.m03.d09/meMA.LaudsGlory/c1211/score/b/1:link.path	/media/m/dedes/en/me/m03/d09/ma/b/laudsglory.pdf
media/en_redirects_goarch/me.m03.d09/meMA.LaudsGlory/c1211/score/w/1:link.info	SDedes
media/en_redirects_goarch/me.m03.d09/meMA.LaudsGlory/c1211/score/w/1:link.path	/media/m/dedes/en/me/m03/d09/ma/w/laudsglory.pdf
media/en_redirects_goarch/me.m03.d09/meMA.LaudsTheotokion/c1211/score/b/1:link.info	SDedes
media/en_redirects_goarch/me.m03.d09/meMA.LaudsTheotokion/c1211/score/b/1:link.path	/media/m/dedes/en/oc/m5/d3/ve/b/apostheotokion.pdf
media/en_redirects_goarch/me.m03.d09/meMA.LaudsTheotokion/c1211/score/w/1:link.info	SDedes
media/en_redirects_goarch/me.m03.d09/meMA.LaudsTheotokion/c1211/score/w/1:link.path	/media/m/dedes/en/oc/m5/d3/ve/w/apostheotokion.pdf
media/en_redirects_goarch/me.m03.d09/meMA.MM.Lauds123as456/c1211/score/w/1:link.info	SDedes
media/en_redirects_goarch/me.m03.d09/meMA.MM.Lauds123as456/c1211/score/w/1:link.path	/media/m/dedes/en/me/m03/d09/ma/w/lauds123as456.pdf
media/en_redirects_goarch/me.m03.d09/meMA.MM.Lauds123as678/c1211/score/w/1:link.info	SDedes
media/en_redirects_goarch/me.m03.d09/meMA.MM.Lauds123as678/c1211/score/w/1:link.path	/media/m/dedes/en/me/m03/d09/ma/w/lauds123as678.pdf
media/en_redirects_goarch/me.m03.d09/meMA.PostGospelGlory/c1211/score/b/1:link.info	SDedes
media/en_redirects_goarch/me.m03.d09/meMA.PostGospelGlory/c1211/score/b/1:link.path	/media/m/dedes/en/ho/ho03/b/postgospelglory_martyrs.pdf
media/en_redirects_goarch/me.m03.d09/meMA.PostGospelGlory/c1211/score/w/1:link.info	SDedes
media/en_redirects_goarch/me.m03.d09/meMA.PostGospelGlory/c1211/score/w/1:link.path	/media/m/dedes/en/ho/ho03/w/postgospelglory_martyrs.pdf
media/en_redirects_goarch/me.m03.d09/meMA.PostGospelIdiomelon/c1211/score/b/1:link.info	SDedes
media/en_redirects_goarch/me.m03.d09/meMA.PostGospelIdiomelon/c1211/score/b/1:link.path	/media/m/dedes/en/me/m03/d09/ma/b/postgospelidiomelon.pdf
media/en_redirects_goarch/me.m03.d09/meMA.PostGospelIdiomelon/c1211/score/w/1:link.info	SDedes
media/en_redirects_goarch/me.m03.d09/meMA.PostGospelIdiomelon/c1211/score/w/1:link.path	/media/m/dedes/en/me/m03/d09/ma/w/postgospelidiomelon.pdf
media/en_redirects_goarch/me.m03.d09/mePL.Glory/c1211/score/b/1:link.info	SDedes
media/en_redirects_goarch/me.m03.d09/mePL.Glory/c1211/score/b/1:link.path	/media/m/dedes/en/me/m03/d09/pl/b/plglory.pdf
media/en_redirects_goarch/me.m03.d09/mePL.Glory/c1211/score/w/1:link.info	SDedes
media/en_redirects_goarch/me.m03.d09/mePL.Glory/c1211/score/w/1:link.path	/media/m/dedes/en/me/m03/d09/pl/w/plglory.pdf
media/en_redirects_goarch/me.m03.d09/meVE.Apolytikion1/c1211/score/w/1:link.info	SDedes
media/en_redirects_goarch/me.m03.d09/meVE.Apolytikion1/c1211/score/w/1:link.path	/media/m/dedes/en/he/ga/w/tasalgidonas.pdf
media/en_redirects_goarch/me.m03.d09/meVE.Apolytikion1/c2001/score/w/1:link.info	NewByz
media/en_redirects_goarch/me.m03.d09/meVE.Apolytikion1/c2001/score/w/1:link.path	/media/m/newbyz/en/he/ga/w/tasalgidonas.pdf
media/en_redirects_goarch/me.m03.d09/meVE.Aposticha1/c1211/score/w/1:link.info	SDedes
media/en_redirects_goarch/me.m03.d09/meVE.Aposticha1/c1211/score/w/1:link.path	/media/m/dedes/en/me/m03/d09/ve/w/aposticha1.pdf
media/en_redirects_goarch/me.m03.d09/meVE.Aposticha2/c1211/score/w/1:link.info	SDedes
media/en_redirects_goarch/me.m03.d09/meVE.Aposticha2/c1211/score/w/1:link.path	/media/m/dedes/en/me/m03/d09/ve/w/aposticha2.pdf
media/en_redirects_goarch/me.m03.d09/meVE.Aposticha3/c1211/score/w/1:link.info	SDedes
media/en_redirects_goarch/me.m03.d09/meVE.Aposticha3/c1211/score/w/1:link.path	/media/m/dedes/en/me/m03/d09/ve/w/aposticha3.pdf
media/en_redirects_goarch/me.m03.d09/meVE.MM.Stichera123as8910/c1211/score/b/1:link.info	SDedes
media/en_redirects_goarch/me.m03.d09/meVE.MM.Stichera123as8910/c1211/score/b/1:link.path	/media/m/dedes/en/me/m03/d09/ve/b/stichera123as8910.pdf
media/en_redirects_goarch/me.m03.d09/meVE.MM.Stichera123as8910/c1211/score/w/1:link.info	SDedes
media/en_redirects_goarch/me.m03.d09/meVE.MM.Stichera123as8910/c1211/score/w/1:link.path	/media/m/dedes/en/me/m03/d09/ve/w/stichera123as8910.pdf
media/en_redirects_goarch/me.m03.d09/meVE.Stichera01/c1211/score/b/1:link.info	SDedes
media/en_redirects_goarch/me.m03.d09/meVE.Stichera01/c1211/score/b/1:link.path	/media/m/dedes/en/me/m03/d09/ve/b/stichera01.pdf
media/en_redirects_goarch/me.m03.d09/meVE.Stichera01/c1211/score/w/1:link.info	SDedes
media/en_redirects_goarch/me.m03.d09/meVE.Stichera01/c1211/score/w/1:link.path	/media/m/dedes/en/me/m03/d09/ve/w/stichera01.pdf
media/en_redirects_goarch/me.m03.d09/meVE.Stichera02/c1211/score/b/1:link.info	SDedes
media/en_redirects_goarch/me.m03.d09/meVE.Stichera02/c1211/score/b/1:link.path	/media/m/dedes/en/me/m03/d09/ve/b/stichera02.pdf
media/en_redirects_goarch/me.m03.d09/meVE.Stichera02/c1211/score/w/1:link.info	SDedes
media/en_redirects_goarch/me.m03.d09/meVE.Stichera02/c1211/score/w/1:link.path	/media/m/dedes/en/me/m03/d09/ve/w/stichera02.pdf
media/en_redirects_goarch/me.m03.d09/meVE.Stichera03/c1211/score/b/1:link.info	SDedes
media/en_redirects_goarch/me.m03.d09/meVE.Stichera03/c1211/score/b/1:link.path	/media/m/dedes/en/me/m03/d09/ve/b/stichera03.pdf
media/en_redirects_goarch/me.m03.d09/meVE.Stichera03/c1211/score/w/1:link.info	SDedes
media/en_redirects_goarch/me.m03.d09/meVE.Stichera03/c1211/score/w/1:link.path	/media/m/dedes/en/me/m03/d09/ve/w/stichera03.pdf
