media/en_redirects_goarch/me.m12.d05/meMA.ExapTheotokion/c1211/score/w/1:link.info	SDedes
media/en_redirects_goarch/me.m12.d05/meMA.ExapTheotokion/c1211/score/w/1:link.path	/media/m/dedes/en/me/m12/d05/ma/w/exaptheotokion.pdf
media/en_redirects_goarch/me.m12.d05/meMA.Exaposteilarion2/c1211/score/w/1:link.info	SDedes
media/en_redirects_goarch/me.m12.d05/meMA.Exaposteilarion2/c1211/score/w/1:link.path	/media/m/dedes/en/me/m12/d05/ma/w/exaposteilarion2.pdf
media/en_redirects_goarch/me.m12.d05/meMA.Kathisma1T/c1211/score/w/1:link.info	SDedes
media/en_redirects_goarch/me.m12.d05/meMA.Kathisma1T/c1211/score/w/1:link.path	/media/m/dedes/en/oc/m1/d1/ma/w/kathisma13.pdf
media/en_redirects_goarch/me.m12.d05/meMA.Kathisma2T/c1211/score/w/1:link.info	SDedes
media/en_redirects_goarch/me.m12.d05/meMA.Kathisma2T/c1211/score/w/1:link.path	/media/m/dedes/en/me/m12/d05/ma/w/kathisma2t.pdf
media/en_redirects_goarch/me.m12.d05/meMA.Kathisma31/c1211/score/w/1:link.info	SDedes
media/en_redirects_goarch/me.m12.d05/meMA.Kathisma31/c1211/score/w/1:link.path	/media/m/dedes/en/me/m12/d05/ma/w/kathisma31.pdf
media/en_redirects_goarch/me.m12.d05/meMA.Kathisma3T/c1211/score/w/1:link.info	SDedes
media/en_redirects_goarch/me.m12.d05/meMA.Kathisma3T/c1211/score/w/1:link.path	/media/m/dedes/en/me/m12/d05/ma/w/kathisma3t.pdf
media/en_redirects_goarch/me.m12.d05/meMA.Lauds1/c1211/score/w/1:link.info	SDedes
media/en_redirects_goarch/me.m12.d05/meMA.Lauds1/c1211/score/w/1:link.path	/media/m/dedes/en/me/m12/d05/ma/w/lauds1.pdf
media/en_redirects_goarch/me.m12.d05/meMA.Lauds2/c1211/score/w/1:link.info	SDedes
media/en_redirects_goarch/me.m12.d05/meMA.Lauds2/c1211/score/w/1:link.path	/media/m/dedes/en/me/m12/d05/ma/w/lauds2.pdf
media/en_redirects_goarch/me.m12.d05/meMA.Lauds3/c1211/score/w/1:link.info	SDedes
media/en_redirects_goarch/me.m12.d05/meMA.Lauds3/c1211/score/w/1:link.path	/media/m/dedes/en/me/m12/d05/ma/w/lauds3.pdf
media/en_redirects_goarch/me.m12.d05/meMA.LaudsGlory/c1211/score/b/1:link.info	SDedes
media/en_redirects_goarch/me.m12.d05/meMA.LaudsGlory/c1211/score/b/1:link.path	/media/m/dedes/en/me/m01/d15/ve/b/aposglory.pdf
media/en_redirects_goarch/me.m12.d05/meMA.LaudsGlory/c1211/score/w/1:link.info	SDedes
media/en_redirects_goarch/me.m12.d05/meMA.LaudsGlory/c1211/score/w/1:link.path	/media/m/dedes/en/me/m01/d15/ve/w/aposglory.pdf
media/en_redirects_goarch/me.m12.d05/meMA.MM.Lauds1123as5678/c1211/score/w/1:link.info	SDedes
media/en_redirects_goarch/me.m12.d05/meMA.MM.Lauds1123as5678/c1211/score/w/1:link.path	/media/m/dedes/en/me/m12/d05/ma/w/lauds1123as5678.pdf
media/en_redirects_goarch/me.m12.d05/meMA.PostGospelGlory/c1211/score/b/1:link.info	SDedes
media/en_redirects_goarch/me.m12.d05/meMA.PostGospelGlory/c1211/score/b/1:link.path	/media/m/dedes/en/ho/ho03/b/postgospelglory_monastic.pdf
media/en_redirects_goarch/me.m12.d05/meMA.PostGospelGlory/c1211/score/w/1:link.info	SDedes
media/en_redirects_goarch/me.m12.d05/meMA.PostGospelGlory/c1211/score/w/1:link.path	/media/m/dedes/en/ho/ho03/w/postgospelglory_monastic.pdf
media/en_redirects_goarch/me.m12.d05/meMA.PostGospelIdiomelon/c1211/score/b/1:link.info	SDedes
media/en_redirects_goarch/me.m12.d05/meMA.PostGospelIdiomelon/c1211/score/b/1:link.path	/media/m/dedes/en/me/m01/d11/ma/b/postgospelidiomelon.pdf
media/en_redirects_goarch/me.m12.d05/meMA.PostGospelIdiomelon/c1211/score/w/1:link.info	SDedes
media/en_redirects_goarch/me.m12.d05/meMA.PostGospelIdiomelon/c1211/score/w/1:link.path	/media/m/dedes/en/me/m01/d11/ma/w/postgospelidiomelon.pdf
media/en_redirects_goarch/me.m12.d05/meVE.AposGlory/c1211/score/b/1:link.info	SDedes
media/en_redirects_goarch/me.m12.d05/meVE.AposGlory/c1211/score/b/1:link.path	/media/m/dedes/en/me/m12/d05/ve/b/aposglory.pdf
media/en_redirects_goarch/me.m12.d05/meVE.AposGlory/c1211/score/w/1:link.info	SDedes
media/en_redirects_goarch/me.m12.d05/meVE.AposGlory/c1211/score/w/1:link.path	/media/m/dedes/en/me/m12/d05/ve/w/aposglory.pdf
media/en_redirects_goarch/me.m12.d05/meVE.LityBoth/c1211/score/w/1:link.info	SDedes
media/en_redirects_goarch/me.m12.d05/meVE.LityBoth/c1211/score/w/1:link.path	/media/m/dedes/en/ho/ho23/w/troparion7.pdf
media/en_redirects_goarch/me.m12.d05/meVE.MM.GeneralApolytikion1/c1211/score/w/1:link.info	SDedes
media/en_redirects_goarch/me.m12.d05/meVE.MM.GeneralApolytikion1/c1211/score/w/1:link.path	/media/m/dedes/en/me/m12/d05/ve/w/generalapolytikion1.pdf
media/en_redirects_goarch/me.m12.d05/meVE.MM.GeneralApolytikion1/c2001/score/w/1:link.info	NewByz
media/en_redirects_goarch/me.m12.d05/meVE.MM.GeneralApolytikion1/c2001/score/w/1:link.path	/media/m/newbyz/en/me/m12/d05/ve/w/generalapolytikion1.pdf
media/en_redirects_goarch/me.m12.d05/meVE.SticGlory/c1211/score/b/1:link.info	SDedes
media/en_redirects_goarch/me.m12.d05/meVE.SticGlory/c1211/score/b/1:link.path	/media/m/dedes/en/me/m12/d05/ve/b/sticglory.pdf
media/en_redirects_goarch/me.m12.d05/meVE.SticGlory/c1211/score/w/1:link.info	SDedes
media/en_redirects_goarch/me.m12.d05/meVE.SticGlory/c1211/score/w/1:link.path	/media/m/dedes/en/me/m12/d05/ve/w/sticglory.pdf
