media/en_redirects_goarch/he.h.m7/heHE.AflektosPyri/c1211/audio/1:link.info	SDedes
media/en_redirects_goarch/he.h.m7/heHE.AflektosPyri/c1211/audio/1:link.path	/media/a/en_public/he/k/pentecost18.mp3
media/en_redirects_goarch/he.h.m7/heHE.KatanoonOProfitis/c1211/audio/1:link.info	SDedes
media/en_redirects_goarch/he.h.m7/heHE.KatanoonOProfitis/c1211/audio/1:link.path	/media/a/en_public/he/k/pentecost14.mp3
media/en_redirects_goarch/he.h.m7/heHE.MiTisFthoras/c1211/audio/1:link.info	SDedes
media/en_redirects_goarch/he.h.m7/heHE.MiTisFthoras/c1211/audio/1:link.path	/media/a/en_public/he/k/pentecost19.mp3
media/en_redirects_goarch/he.h.m7/heHE.NaftionToSalo/c1211/audio/1:link.info	SDedes
media/en_redirects_goarch/he.h.m7/heHE.NaftionToSalo/c1211/audio/1:link.path	/media/a/en_public/he/k/pentecost16.mp3
media/en_redirects_goarch/he.h.m7/heHE.OiEnKaminoTouPyros/c1211/audio/1:link.info	SDedes
media/en_redirects_goarch/he.h.m7/heHE.OiEnKaminoTouPyros/c1211/audio/1:link.path	/media/a/en_public/he/k/pentecost17.mp3
media/en_redirects_goarch/he.h.m7/heHE.PontoEkalypse/c1211/audio/1:link.info	SDedes
media/en_redirects_goarch/he.h.m7/heHE.PontoEkalypse/c1211/audio/1:link.path	/media/a/en_public/he/k/pentecost11.mp3
media/en_redirects_goarch/he.h.m7/heHE.TinExYpsousDynamin/c1211/audio/1:link.info	SDedes
media/en_redirects_goarch/he.h.m7/heHE.TinExYpsousDynamin/c1211/audio/1:link.path	/media/a/en_public/he/k/pentecost13.mp3
media/en_redirects_goarch/he.h.m7/heHE.ToDiaTonFovonSou/c1211/audio/1:link.info	SDedes
media/en_redirects_goarch/he.h.m7/heHE.ToDiaTonFovonSou/c1211/audio/1:link.path	/media/a/en_public/he/k/pentecost15.mp3
