media/en_redirects_goarch/tr.d069/trH1.Idiomelon1/c1211/audio/1:link.info	SDedes
media/en_redirects_goarch/tr.d069/trH1.Idiomelon1/c1211/audio/1:link.path	/media/a/en_public/tr/d069/h1/idiomelon1.mp3
media/en_redirects_goarch/tr.d069/trH1.Idiomelon1/c1211/score/b/1:link.info	SDedes
media/en_redirects_goarch/tr.d069/trH1.Idiomelon1/c1211/score/b/1:link.path	/media/m/dedes/en/tr/d069/h1/b/idiomelon1.pdf
media/en_redirects_goarch/tr.d069/trH1.Idiomelon1/c1211/score/w/1:link.info	SDedes
media/en_redirects_goarch/tr.d069/trH1.Idiomelon1/c1211/score/w/1:link.path	/media/m/dedes/en/tr/d069/h1/w/idiomelon1.pdf
media/en_redirects_goarch/tr.d069/trH1.Idiomelon2/c1211/audio/1:link.info	SDedes
media/en_redirects_goarch/tr.d069/trH1.Idiomelon2/c1211/audio/1:link.path	/media/a/en_public/tr/d069/h1/idiomelon2.mp3
media/en_redirects_goarch/tr.d069/trH1.Idiomelon2/c1211/score/b/1:link.info	SDedes
media/en_redirects_goarch/tr.d069/trH1.Idiomelon2/c1211/score/b/1:link.path	/media/m/dedes/en/tr/d069/h1/b/idiomelon2.pdf
media/en_redirects_goarch/tr.d069/trH1.Idiomelon2/c1211/score/w/1:link.info	SDedes
media/en_redirects_goarch/tr.d069/trH1.Idiomelon2/c1211/score/w/1:link.path	/media/m/dedes/en/tr/d069/h1/w/idiomelon2.pdf
media/en_redirects_goarch/tr.d069/trH1.Idiomelon3/c1211/audio/1:link.info	SDedes
media/en_redirects_goarch/tr.d069/trH1.Idiomelon3/c1211/audio/1:link.path	/media/a/en_public/tr/d069/h1/idiomelon3.mp3
media/en_redirects_goarch/tr.d069/trH1.Idiomelon3/c1211/score/b/1:link.info	SDedes
media/en_redirects_goarch/tr.d069/trH1.Idiomelon3/c1211/score/b/1:link.path	/media/m/dedes/en/tr/d069/h1/b/idiomelon3.pdf
media/en_redirects_goarch/tr.d069/trH1.Idiomelon3/c1211/score/w/1:link.info	SDedes
media/en_redirects_goarch/tr.d069/trH1.Idiomelon3/c1211/score/w/1:link.path	/media/m/dedes/en/tr/d069/h1/w/idiomelon3.pdf
media/en_redirects_goarch/tr.d069/trH3.Idiomelon1/c1211/audio/1:link.info	SDedes
media/en_redirects_goarch/tr.d069/trH3.Idiomelon1/c1211/audio/1:link.path	/media/a/en_public/tr/d069/h3/idiomelon1.mp3
media/en_redirects_goarch/tr.d069/trH3.Idiomelon1/c1211/score/b/1:link.info	SDedes
media/en_redirects_goarch/tr.d069/trH3.Idiomelon1/c1211/score/b/1:link.path	/media/m/dedes/en/tr/d069/h3/b/idiomelon1.pdf
media/en_redirects_goarch/tr.d069/trH3.Idiomelon1/c1211/score/w/1:link.info	SDedes
media/en_redirects_goarch/tr.d069/trH3.Idiomelon1/c1211/score/w/1:link.path	/media/m/dedes/en/tr/d069/h3/w/idiomelon1.pdf
media/en_redirects_goarch/tr.d069/trH3.Idiomelon2/c1211/audio/1:link.info	SDedes
media/en_redirects_goarch/tr.d069/trH3.Idiomelon2/c1211/audio/1:link.path	/media/a/en_public/tr/d069/h3/idiomelon2.mp3
media/en_redirects_goarch/tr.d069/trH3.Idiomelon2/c1211/score/b/1:link.info	SDedes
media/en_redirects_goarch/tr.d069/trH3.Idiomelon2/c1211/score/b/1:link.path	/media/m/dedes/en/tr/d069/h3/b/idiomelon2.pdf
media/en_redirects_goarch/tr.d069/trH3.Idiomelon2/c1211/score/w/1:link.info	SDedes
media/en_redirects_goarch/tr.d069/trH3.Idiomelon2/c1211/score/w/1:link.path	/media/m/dedes/en/tr/d069/h3/w/idiomelon2.pdf
media/en_redirects_goarch/tr.d069/trH3.Idiomelon3/c1211/audio/1:link.info	SDedes
media/en_redirects_goarch/tr.d069/trH3.Idiomelon3/c1211/audio/1:link.path	/media/a/en_public/tr/d069/h3/idiomelon3.mp3
media/en_redirects_goarch/tr.d069/trH3.Idiomelon3/c1211/score/b/1:link.info	SDedes
media/en_redirects_goarch/tr.d069/trH3.Idiomelon3/c1211/score/b/1:link.path	/media/m/dedes/en/tr/d069/h3/b/idiomelon3.pdf
media/en_redirects_goarch/tr.d069/trH3.Idiomelon3/c1211/score/w/1:link.info	SDedes
media/en_redirects_goarch/tr.d069/trH3.Idiomelon3/c1211/score/w/1:link.path	/media/m/dedes/en/tr/d069/h3/w/idiomelon3.pdf
media/en_redirects_goarch/tr.d069/trH6.Idiomelon1/c1211/audio/1:link.info	SDedes
media/en_redirects_goarch/tr.d069/trH6.Idiomelon1/c1211/audio/1:link.path	/media/a/en_public/tr/d069/h6/idiomelon1.mp3
media/en_redirects_goarch/tr.d069/trH6.Idiomelon1/c1211/score/b/1:link.info	SDedes
media/en_redirects_goarch/tr.d069/trH6.Idiomelon1/c1211/score/b/1:link.path	/media/m/dedes/en/tr/d069/h6/b/idiomelon1.pdf
media/en_redirects_goarch/tr.d069/trH6.Idiomelon1/c1211/score/w/1:link.info	SDedes
media/en_redirects_goarch/tr.d069/trH6.Idiomelon1/c1211/score/w/1:link.path	/media/m/dedes/en/tr/d069/h6/w/idiomelon1.pdf
media/en_redirects_goarch/tr.d069/trH6.Idiomelon2/c1211/audio/1:link.info	SDedes
media/en_redirects_goarch/tr.d069/trH6.Idiomelon2/c1211/audio/1:link.path	/media/a/en_public/tr/d069/h6/idiomelon2.mp3
media/en_redirects_goarch/tr.d069/trH6.Idiomelon2/c1211/score/b/1:link.info	SDedes
media/en_redirects_goarch/tr.d069/trH6.Idiomelon2/c1211/score/b/1:link.path	/media/m/dedes/en/tr/d069/h6/b/idiomelon2.pdf
media/en_redirects_goarch/tr.d069/trH6.Idiomelon2/c1211/score/w/1:link.info	SDedes
media/en_redirects_goarch/tr.d069/trH6.Idiomelon2/c1211/score/w/1:link.path	/media/m/dedes/en/tr/d069/h6/w/idiomelon2.pdf
media/en_redirects_goarch/tr.d069/trH6.Idiomelon3/c1211/audio/1:link.info	SDedes
media/en_redirects_goarch/tr.d069/trH6.Idiomelon3/c1211/audio/1:link.path	/media/a/en_public/tr/d069/h6/idiomelon3.mp3
media/en_redirects_goarch/tr.d069/trH6.Idiomelon3/c1211/score/b/1:link.info	SDedes
media/en_redirects_goarch/tr.d069/trH6.Idiomelon3/c1211/score/b/1:link.path	/media/m/dedes/en/tr/d069/h6/b/idiomelon3.pdf
media/en_redirects_goarch/tr.d069/trH6.Idiomelon3/c1211/score/w/1:link.info	SDedes
media/en_redirects_goarch/tr.d069/trH6.Idiomelon3/c1211/score/w/1:link.path	/media/m/dedes/en/tr/d069/h6/w/idiomelon3.pdf
media/en_redirects_goarch/tr.d069/trH9.Idiomelon1/c1211/audio/1:link.info	SDedes
media/en_redirects_goarch/tr.d069/trH9.Idiomelon1/c1211/audio/1:link.path	/media/a/en_public/tr/d069/h9/idiomelon1.mp3
media/en_redirects_goarch/tr.d069/trH9.Idiomelon1/c1211/score/b/1:link.info	SDedes
media/en_redirects_goarch/tr.d069/trH9.Idiomelon1/c1211/score/b/1:link.path	/media/m/dedes/en/tr/d069/h9/b/idiomelon1.pdf
media/en_redirects_goarch/tr.d069/trH9.Idiomelon1/c1211/score/w/1:link.info	SDedes
media/en_redirects_goarch/tr.d069/trH9.Idiomelon1/c1211/score/w/1:link.path	/media/m/dedes/en/tr/d069/h9/w/idiomelon1.pdf
media/en_redirects_goarch/tr.d069/trH9.Idiomelon2/c1211/audio/1:link.info	SDedes
media/en_redirects_goarch/tr.d069/trH9.Idiomelon2/c1211/audio/1:link.path	/media/a/en_public/tr/d069/h9/idiomelon2.mp3
media/en_redirects_goarch/tr.d069/trH9.Idiomelon2/c1211/score/b/1:link.info	SDedes
media/en_redirects_goarch/tr.d069/trH9.Idiomelon2/c1211/score/b/1:link.path	/media/m/dedes/en/tr/d069/h9/b/idiomelon2.pdf
media/en_redirects_goarch/tr.d069/trH9.Idiomelon2/c1211/score/w/1:link.info	SDedes
media/en_redirects_goarch/tr.d069/trH9.Idiomelon2/c1211/score/w/1:link.path	/media/m/dedes/en/tr/d069/h9/w/idiomelon2.pdf
media/en_redirects_goarch/tr.d069/trH9.Idiomelon3/c1211/audio/1:link.info	SDedes
media/en_redirects_goarch/tr.d069/trH9.Idiomelon3/c1211/audio/1:link.path	/media/a/en_public/tr/d069/h9/idiomelon3.mp3
media/en_redirects_goarch/tr.d069/trH9.Idiomelon3/c1211/score/b/1:link.info	SDedes
media/en_redirects_goarch/tr.d069/trH9.Idiomelon3/c1211/score/b/1:link.path	/media/m/dedes/en/tr/d069/h9/b/idiomelon3.pdf
media/en_redirects_goarch/tr.d069/trH9.Idiomelon3/c1211/score/w/1:link.info	SDedes
media/en_redirects_goarch/tr.d069/trH9.Idiomelon3/c1211/score/w/1:link.path	/media/m/dedes/en/tr/d069/h9/w/idiomelon3.pdf
media/en_redirects_goarch/tr.d069/trLI.AfterCommunion/c1211/audio/1:link.info	SDedes
media/en_redirects_goarch/tr.d069/trLI.AfterCommunion/c1211/audio/1:link.path	/media/a/en_public/tr/d069/li/aftercommunion.mp3
media/en_redirects_goarch/tr.d069/trLI.CherubicHymnPart1/c1211/audio/1:link.info	SDedes
media/en_redirects_goarch/tr.d069/trLI.CherubicHymnPart1/c1211/audio/1:link.path	/media/a/en_public/tr/d069/li/cherubichymn.mp3
media/en_redirects_goarch/tr.d069/trLI.CherubicHymnPart1/c1211/score/b/1:link.info	SDedes
media/en_redirects_goarch/tr.d069/trLI.CherubicHymnPart1/c1211/score/b/1:link.path	/media/m/dedes/en/tr/d069/li/b/cherubichymn.pdf
media/en_redirects_goarch/tr.d069/trLI.CherubicHymnPart1/c1211/score/w/1:link.info	SDedes
media/en_redirects_goarch/tr.d069/trLI.CherubicHymnPart1/c1211/score/w/1:link.path	/media/m/dedes/en/tr/d069/li/w/cherubichymn.pdf
media/en_redirects_goarch/tr.d069/trLI.CherubicHymnPart1/c2301/score/w/1:link.info	NewByz
media/en_redirects_goarch/tr.d069/trLI.CherubicHymnPart1/c2301/score/w/1:link.path	/media/m/newbyz/en/tr/d069/li/w/cherubichymn.pdf
media/en_redirects_goarch/tr.d069/trLI.CommunionHymn/c1211/score/w/1:link.info	SDedes
media/en_redirects_goarch/tr.d069/trLI.CommunionHymn/c1211/score/w/1:link.path	/media/m/dedes/en/tr/d069/li/w/communionhymn.pdf
media/en_redirects_goarch/tr.d069/trMA.Antiphon011/c1211/audio/1:link.info	SDedes
media/en_redirects_goarch/tr.d069/trMA.Antiphon011/c1211/audio/1:link.path	/media/a/en_public/tr/d069/ma/antiphon01.mp3
media/en_redirects_goarch/tr.d069/trMA.Antiphon011/c1211/score/b/1:link.info	SDedes
media/en_redirects_goarch/tr.d069/trMA.Antiphon011/c1211/score/b/1:link.path	/media/m/dedes/en/tr/d069/ma/b/antiphon01.pdf
media/en_redirects_goarch/tr.d069/trMA.Antiphon011/c1211/score/w/1:link.info	SDedes
media/en_redirects_goarch/tr.d069/trMA.Antiphon011/c1211/score/w/1:link.path	/media/m/dedes/en/tr/d069/ma/w/antiphon01.pdf
media/en_redirects_goarch/tr.d069/trMA.Antiphon021/c1211/audio/1:link.info	SDedes
media/en_redirects_goarch/tr.d069/trMA.Antiphon021/c1211/audio/1:link.path	/media/a/en_public/tr/d069/ma/antiphon02.mp3
media/en_redirects_goarch/tr.d069/trMA.Antiphon021/c1211/score/b/1:link.info	SDedes
media/en_redirects_goarch/tr.d069/trMA.Antiphon021/c1211/score/b/1:link.path	/media/m/dedes/en/tr/d069/ma/b/antiphon02.pdf
media/en_redirects_goarch/tr.d069/trMA.Antiphon021/c1211/score/w/1:link.info	SDedes
media/en_redirects_goarch/tr.d069/trMA.Antiphon021/c1211/score/w/1:link.path	/media/m/dedes/en/tr/d069/ma/w/antiphon02.pdf
media/en_redirects_goarch/tr.d069/trMA.Antiphon031/c1211/audio/1:link.info	SDedes
media/en_redirects_goarch/tr.d069/trMA.Antiphon031/c1211/audio/1:link.path	/media/a/en_public/tr/d069/ma/antiphon03.mp3
media/en_redirects_goarch/tr.d069/trMA.Antiphon031/c1211/score/b/1:link.info	SDedes
media/en_redirects_goarch/tr.d069/trMA.Antiphon031/c1211/score/b/1:link.path	/media/m/dedes/en/tr/d069/ma/b/antiphon03.pdf
media/en_redirects_goarch/tr.d069/trMA.Antiphon031/c1211/score/w/1:link.info	SDedes
media/en_redirects_goarch/tr.d069/trMA.Antiphon031/c1211/score/w/1:link.path	/media/m/dedes/en/tr/d069/ma/w/antiphon03.pdf
media/en_redirects_goarch/tr.d069/trMA.Antiphon03Kathisma/c1211/audio/1:link.info	SDedes
media/en_redirects_goarch/tr.d069/trMA.Antiphon03Kathisma/c1211/audio/1:link.path	/media/a/en_public/tr/d069/ma/antiphon03kathisma.mp3
media/en_redirects_goarch/tr.d069/trMA.Antiphon03Kathisma/c1211/score/b/1:link.info	SDedes
media/en_redirects_goarch/tr.d069/trMA.Antiphon03Kathisma/c1211/score/b/1:link.path	/media/m/dedes/en/tr/d069/ma/b/antiphon03kathisma.pdf
media/en_redirects_goarch/tr.d069/trMA.Antiphon03Kathisma/c1211/score/w/1:link.info	SDedes
media/en_redirects_goarch/tr.d069/trMA.Antiphon03Kathisma/c1211/score/w/1:link.path	/media/m/dedes/en/tr/d069/ma/w/antiphon03kathisma.pdf
media/en_redirects_goarch/tr.d069/trMA.Antiphon041/c1211/audio/1:link.info	SDedes
media/en_redirects_goarch/tr.d069/trMA.Antiphon041/c1211/audio/1:link.path	/media/a/en_public/tr/d069/ma/antiphon04.mp3
media/en_redirects_goarch/tr.d069/trMA.Antiphon041/c1211/score/b/1:link.info	SDedes
media/en_redirects_goarch/tr.d069/trMA.Antiphon041/c1211/score/b/1:link.path	/media/m/dedes/en/tr/d069/ma/b/antiphon04.pdf
media/en_redirects_goarch/tr.d069/trMA.Antiphon041/c1211/score/w/1:link.info	SDedes
media/en_redirects_goarch/tr.d069/trMA.Antiphon041/c1211/score/w/1:link.path	/media/m/dedes/en/tr/d069/ma/w/antiphon04.pdf
media/en_redirects_goarch/tr.d069/trMA.Antiphon051/c1211/audio/1:link.info	SDedes
media/en_redirects_goarch/tr.d069/trMA.Antiphon051/c1211/audio/1:link.path	/media/a/en_public/tr/d069/ma/antiphon05.mp3
media/en_redirects_goarch/tr.d069/trMA.Antiphon051/c1211/score/b/1:link.info	SDedes
media/en_redirects_goarch/tr.d069/trMA.Antiphon051/c1211/score/b/1:link.path	/media/m/dedes/en/tr/d069/ma/b/antiphon05.pdf
media/en_redirects_goarch/tr.d069/trMA.Antiphon051/c1211/score/w/1:link.info	SDedes
media/en_redirects_goarch/tr.d069/trMA.Antiphon051/c1211/score/w/1:link.path	/media/m/dedes/en/tr/d069/ma/w/antiphon05.pdf
media/en_redirects_goarch/tr.d069/trMA.Antiphon061/c1211/audio/1:link.info	SDedes
media/en_redirects_goarch/tr.d069/trMA.Antiphon061/c1211/audio/1:link.path	/media/a/en_public/tr/d069/ma/antiphon06.mp3
media/en_redirects_goarch/tr.d069/trMA.Antiphon061/c1211/score/b/1:link.info	SDedes
media/en_redirects_goarch/tr.d069/trMA.Antiphon061/c1211/score/b/1:link.path	/media/m/dedes/en/tr/d069/ma/b/antiphon06.pdf
media/en_redirects_goarch/tr.d069/trMA.Antiphon061/c1211/score/w/1:link.info	SDedes
media/en_redirects_goarch/tr.d069/trMA.Antiphon061/c1211/score/w/1:link.path	/media/m/dedes/en/tr/d069/ma/w/antiphon06.pdf
media/en_redirects_goarch/tr.d069/trMA.Antiphon06Kathisma/c1211/audio/1:link.info	SDedes
media/en_redirects_goarch/tr.d069/trMA.Antiphon06Kathisma/c1211/audio/1:link.path	/media/a/en_public/tr/d069/ma/antiphon06kathisma.mp3
media/en_redirects_goarch/tr.d069/trMA.Antiphon06Kathisma/c1211/score/b/1:link.info	SDedes
media/en_redirects_goarch/tr.d069/trMA.Antiphon06Kathisma/c1211/score/b/1:link.path	/media/m/dedes/en/tr/d069/ma/b/antiphon06kathisma.pdf
media/en_redirects_goarch/tr.d069/trMA.Antiphon06Kathisma/c1211/score/w/1:link.info	SDedes
media/en_redirects_goarch/tr.d069/trMA.Antiphon06Kathisma/c1211/score/w/1:link.path	/media/m/dedes/en/tr/d069/ma/w/antiphon06kathisma.pdf
media/en_redirects_goarch/tr.d069/trMA.Antiphon071/c1211/audio/1:link.info	SDedes
media/en_redirects_goarch/tr.d069/trMA.Antiphon071/c1211/audio/1:link.path	/media/a/en_public/tr/d069/ma/antiphon07.mp3
media/en_redirects_goarch/tr.d069/trMA.Antiphon071/c1211/score/b/1:link.info	SDedes
media/en_redirects_goarch/tr.d069/trMA.Antiphon071/c1211/score/b/1:link.path	/media/m/dedes/en/tr/d069/ma/b/antiphon07.pdf
media/en_redirects_goarch/tr.d069/trMA.Antiphon071/c1211/score/w/1:link.info	SDedes
media/en_redirects_goarch/tr.d069/trMA.Antiphon071/c1211/score/w/1:link.path	/media/m/dedes/en/tr/d069/ma/w/antiphon07.pdf
media/en_redirects_goarch/tr.d069/trMA.Antiphon081/c1211/audio/1:link.info	SDedes
media/en_redirects_goarch/tr.d069/trMA.Antiphon081/c1211/audio/1:link.path	/media/a/en_public/tr/d069/ma/antiphon08.mp3
media/en_redirects_goarch/tr.d069/trMA.Antiphon081/c1211/score/b/1:link.info	SDedes
media/en_redirects_goarch/tr.d069/trMA.Antiphon081/c1211/score/b/1:link.path	/media/m/dedes/en/tr/d069/ma/b/antiphon08.pdf
media/en_redirects_goarch/tr.d069/trMA.Antiphon081/c1211/score/w/1:link.info	SDedes
media/en_redirects_goarch/tr.d069/trMA.Antiphon081/c1211/score/w/1:link.path	/media/m/dedes/en/tr/d069/ma/w/antiphon08.pdf
media/en_redirects_goarch/tr.d069/trMA.Antiphon091/c1211/audio/1:link.info	SDedes
media/en_redirects_goarch/tr.d069/trMA.Antiphon091/c1211/audio/1:link.path	/media/a/en_public/tr/d069/ma/antiphon09.mp3
media/en_redirects_goarch/tr.d069/trMA.Antiphon091/c1211/score/b/1:link.info	SDedes
media/en_redirects_goarch/tr.d069/trMA.Antiphon091/c1211/score/b/1:link.path	/media/m/dedes/en/tr/d069/ma/b/antiphon09.pdf
media/en_redirects_goarch/tr.d069/trMA.Antiphon091/c1211/score/w/1:link.info	SDedes
media/en_redirects_goarch/tr.d069/trMA.Antiphon091/c1211/score/w/1:link.path	/media/m/dedes/en/tr/d069/ma/w/antiphon09.pdf
media/en_redirects_goarch/tr.d069/trMA.Antiphon09Kathisma/c1211/audio/1:link.info	SDedes
media/en_redirects_goarch/tr.d069/trMA.Antiphon09Kathisma/c1211/audio/1:link.path	/media/a/en_public/tr/d069/ma/antiphon09kathisma.mp3
media/en_redirects_goarch/tr.d069/trMA.Antiphon09Kathisma/c1211/score/b/1:link.info	SDedes
media/en_redirects_goarch/tr.d069/trMA.Antiphon09Kathisma/c1211/score/b/1:link.path	/media/m/dedes/en/tr/d069/ma/b/antiphon09kathisma.pdf
media/en_redirects_goarch/tr.d069/trMA.Antiphon09Kathisma/c1211/score/w/1:link.info	SDedes
media/en_redirects_goarch/tr.d069/trMA.Antiphon09Kathisma/c1211/score/w/1:link.path	/media/m/dedes/en/tr/d069/ma/w/antiphon09kathisma.pdf
media/en_redirects_goarch/tr.d069/trMA.Antiphon101/c1211/audio/1:link.info	SDedes
media/en_redirects_goarch/tr.d069/trMA.Antiphon101/c1211/audio/1:link.path	/media/a/en_public/tr/d069/ma/antiphon10.mp3
media/en_redirects_goarch/tr.d069/trMA.Antiphon101/c1211/score/b/1:link.info	SDedes
media/en_redirects_goarch/tr.d069/trMA.Antiphon101/c1211/score/b/1:link.path	/media/m/dedes/en/tr/d069/ma/b/antiphon10.pdf
media/en_redirects_goarch/tr.d069/trMA.Antiphon101/c1211/score/w/1:link.info	SDedes
media/en_redirects_goarch/tr.d069/trMA.Antiphon101/c1211/score/w/1:link.path	/media/m/dedes/en/tr/d069/ma/w/antiphon10.pdf
media/en_redirects_goarch/tr.d069/trMA.Antiphon111/c1211/audio/1:link.info	SDedes
media/en_redirects_goarch/tr.d069/trMA.Antiphon111/c1211/audio/1:link.path	/media/a/en_public/tr/d069/ma/antiphon11.mp3
media/en_redirects_goarch/tr.d069/trMA.Antiphon111/c1211/score/b/1:link.info	SDedes
media/en_redirects_goarch/tr.d069/trMA.Antiphon111/c1211/score/b/1:link.path	/media/m/dedes/en/tr/d069/ma/b/antiphon11.pdf
media/en_redirects_goarch/tr.d069/trMA.Antiphon111/c1211/score/w/1:link.info	SDedes
media/en_redirects_goarch/tr.d069/trMA.Antiphon111/c1211/score/w/1:link.path	/media/m/dedes/en/tr/d069/ma/w/antiphon11.pdf
media/en_redirects_goarch/tr.d069/trMA.Antiphon121/c1211/audio/1:link.info	SDedes
media/en_redirects_goarch/tr.d069/trMA.Antiphon121/c1211/audio/1:link.path	/media/a/en_public/tr/d069/ma/antiphon12.mp3
media/en_redirects_goarch/tr.d069/trMA.Antiphon121/c1211/score/b/1:link.info	SDedes
media/en_redirects_goarch/tr.d069/trMA.Antiphon121/c1211/score/b/1:link.path	/media/m/dedes/en/tr/d069/ma/b/antiphon12.pdf
media/en_redirects_goarch/tr.d069/trMA.Antiphon121/c1211/score/w/1:link.info	SDedes
media/en_redirects_goarch/tr.d069/trMA.Antiphon121/c1211/score/w/1:link.path	/media/m/dedes/en/tr/d069/ma/w/antiphon12.pdf
media/en_redirects_goarch/tr.d069/trMA.Antiphon12Kathisma/c1211/audio/1:link.info	SDedes
media/en_redirects_goarch/tr.d069/trMA.Antiphon12Kathisma/c1211/audio/1:link.path	/media/a/en_public/tr/d069/ma/antiphon12kathisma.mp3
media/en_redirects_goarch/tr.d069/trMA.Antiphon12Kathisma/c1211/score/b/1:link.info	SDedes
media/en_redirects_goarch/tr.d069/trMA.Antiphon12Kathisma/c1211/score/b/1:link.path	/media/m/dedes/en/tr/d069/ma/b/antiphon12kathisma.pdf
media/en_redirects_goarch/tr.d069/trMA.Antiphon12Kathisma/c1211/score/w/1:link.info	SDedes
media/en_redirects_goarch/tr.d069/trMA.Antiphon12Kathisma/c1211/score/w/1:link.path	/media/m/dedes/en/tr/d069/ma/w/antiphon12kathisma.pdf
media/en_redirects_goarch/tr.d069/trMA.Antiphon131/c1211/audio/1:link.info	SDedes
media/en_redirects_goarch/tr.d069/trMA.Antiphon131/c1211/audio/1:link.path	/media/a/en_public/tr/d069/ma/antiphon13.mp3
media/en_redirects_goarch/tr.d069/trMA.Antiphon131/c1211/score/b/1:link.info	SDedes
media/en_redirects_goarch/tr.d069/trMA.Antiphon131/c1211/score/b/1:link.path	/media/m/dedes/en/tr/d069/ma/b/antiphon13.pdf
media/en_redirects_goarch/tr.d069/trMA.Antiphon131/c1211/score/w/1:link.info	SDedes
media/en_redirects_goarch/tr.d069/trMA.Antiphon131/c1211/score/w/1:link.path	/media/m/dedes/en/tr/d069/ma/w/antiphon13.pdf
media/en_redirects_goarch/tr.d069/trMA.Antiphon141/c1211/audio/1:link.info	SDedes
media/en_redirects_goarch/tr.d069/trMA.Antiphon141/c1211/audio/1:link.path	/media/a/en_public/tr/d069/ma/antiphon14.mp3
media/en_redirects_goarch/tr.d069/trMA.Antiphon141/c1211/score/b/1:link.info	SDedes
media/en_redirects_goarch/tr.d069/trMA.Antiphon141/c1211/score/b/1:link.path	/media/m/dedes/en/tr/d069/ma/b/antiphon14.pdf
media/en_redirects_goarch/tr.d069/trMA.Antiphon141/c1211/score/w/1:link.info	SDedes
media/en_redirects_goarch/tr.d069/trMA.Antiphon141/c1211/score/w/1:link.path	/media/m/dedes/en/tr/d069/ma/w/antiphon14.pdf
media/en_redirects_goarch/tr.d069/trMA.Antiphon151/c1211/audio/1:link.info	SDedes
media/en_redirects_goarch/tr.d069/trMA.Antiphon151/c1211/audio/1:link.path	/media/a/en_public/tr/d069/ma/antiphon15.mp3
media/en_redirects_goarch/tr.d069/trMA.Antiphon151/c1211/score/b/1:link.info	SDedes
media/en_redirects_goarch/tr.d069/trMA.Antiphon151/c1211/score/b/1:link.path	/media/m/dedes/en/tr/d069/ma/b/antiphon15.pdf
media/en_redirects_goarch/tr.d069/trMA.Antiphon151/c1211/score/w/1:link.info	SDedes
media/en_redirects_goarch/tr.d069/trMA.Antiphon151/c1211/score/w/1:link.path	/media/m/dedes/en/tr/d069/ma/w/antiphon15.pdf
media/en_redirects_goarch/tr.d069/trMA.Antiphon151/c2301/score/w/1:link.info	NewByz
media/en_redirects_goarch/tr.d069/trMA.Antiphon151/c2301/score/w/1:link.path	/media/m/newbyz/en/tr/d069/ma/w/antiphon15.pdf
media/en_redirects_goarch/tr.d069/trMA.Antiphon15Kathisma/c1211/audio/1:link.info	SDedes
media/en_redirects_goarch/tr.d069/trMA.Antiphon15Kathisma/c1211/audio/1:link.path	/media/a/en_public/tr/d069/ma/antiphon15kathisma.mp3
media/en_redirects_goarch/tr.d069/trMA.Antiphon15Kathisma/c1211/score/b/1:link.info	SDedes
media/en_redirects_goarch/tr.d069/trMA.Antiphon15Kathisma/c1211/score/b/1:link.path	/media/m/dedes/en/tr/d069/ma/b/antiphon15kathisma.pdf
media/en_redirects_goarch/tr.d069/trMA.Antiphon15Kathisma/c1211/score/w/1:link.info	SDedes
media/en_redirects_goarch/tr.d069/trMA.Antiphon15Kathisma/c1211/score/w/1:link.path	/media/m/dedes/en/tr/d069/ma/w/antiphon15kathisma.pdf
media/en_redirects_goarch/tr.d069/trMA.Apolytikion1/c1211/audio/1:link.info	SDedes
media/en_redirects_goarch/tr.d069/trMA.Apolytikion1/c1211/audio/1:link.path	/media/a/en_public/tr/d069/ma/apolytikion1.mp3
media/en_redirects_goarch/tr.d069/trMA.Apolytikion1/c1211/score/b/1:link.info	SDedes
media/en_redirects_goarch/tr.d069/trMA.Apolytikion1/c1211/score/b/1:link.path	/media/m/dedes/en/tr/d069/ma/b/apolytikion1.pdf
media/en_redirects_goarch/tr.d069/trMA.Apolytikion1/c1211/score/w/1:link.info	SDedes
media/en_redirects_goarch/tr.d069/trMA.Apolytikion1/c1211/score/w/1:link.path	/media/m/dedes/en/tr/d069/ma/w/apolytikion1.pdf
media/en_redirects_goarch/tr.d069/trMA.AposBoth/c1211/audio/1:link.info	SDedes
media/en_redirects_goarch/tr.d069/trMA.AposBoth/c1211/audio/1:link.path	/media/a/en_public/tr/d069/ma/aposboth.mp3
media/en_redirects_goarch/tr.d069/trMA.AposBoth/c1211/score/b/1:link.info	SDedes
media/en_redirects_goarch/tr.d069/trMA.AposBoth/c1211/score/b/1:link.path	/media/m/dedes/en/tr/d069/ma/b/aposboth.pdf
media/en_redirects_goarch/tr.d069/trMA.AposBoth/c1211/score/w/1:link.info	SDedes
media/en_redirects_goarch/tr.d069/trMA.AposBoth/c1211/score/w/1:link.path	/media/m/dedes/en/tr/d069/ma/w/aposboth.pdf
media/en_redirects_goarch/tr.d069/trMA.AposGlory/c1211/audio/1:link.info	SDedes
media/en_redirects_goarch/tr.d069/trMA.AposGlory/c1211/audio/1:link.path	/media/a/en_public/tr/d069/ma/aposglory.mp3
media/en_redirects_goarch/tr.d069/trMA.AposGlory/c1211/score/b/1:link.info	SDedes
media/en_redirects_goarch/tr.d069/trMA.AposGlory/c1211/score/b/1:link.path	/media/m/dedes/en/tr/d069/ma/b/aposglory.pdf
media/en_redirects_goarch/tr.d069/trMA.AposGlory/c1211/score/w/1:link.info	SDedes
media/en_redirects_goarch/tr.d069/trMA.AposGlory/c1211/score/w/1:link.path	/media/m/dedes/en/tr/d069/ma/w/aposglory.pdf
media/en_redirects_goarch/tr.d069/trMA.Aposticha1/c1211/audio/1:link.info	SDedes
media/en_redirects_goarch/tr.d069/trMA.Aposticha1/c1211/audio/1:link.path	/media/a/en_public/tr/d069/ma/aposticha1.mp3
media/en_redirects_goarch/tr.d069/trMA.Aposticha1/c1211/score/b/1:link.info	SDedes
media/en_redirects_goarch/tr.d069/trMA.Aposticha1/c1211/score/b/1:link.path	/media/m/dedes/en/tr/d069/ma/b/aposticha1.pdf
media/en_redirects_goarch/tr.d069/trMA.Aposticha1/c1211/score/w/1:link.info	SDedes
media/en_redirects_goarch/tr.d069/trMA.Aposticha1/c1211/score/w/1:link.path	/media/m/dedes/en/tr/d069/ma/w/aposticha1.pdf
media/en_redirects_goarch/tr.d069/trMA.Aposticha2/c1211/audio/1:link.info	SDedes
media/en_redirects_goarch/tr.d069/trMA.Aposticha2/c1211/audio/1:link.path	/media/a/en_public/tr/d069/ma/aposticha2.mp3
media/en_redirects_goarch/tr.d069/trMA.Aposticha2/c1211/score/b/1:link.info	SDedes
media/en_redirects_goarch/tr.d069/trMA.Aposticha2/c1211/score/b/1:link.path	/media/m/dedes/en/tr/d069/ma/b/aposticha2.pdf
media/en_redirects_goarch/tr.d069/trMA.Aposticha2/c1211/score/w/1:link.info	SDedes
media/en_redirects_goarch/tr.d069/trMA.Aposticha2/c1211/score/w/1:link.path	/media/m/dedes/en/tr/d069/ma/w/aposticha2.pdf
media/en_redirects_goarch/tr.d069/trMA.Aposticha3/c1211/audio/1:link.info	SDedes
media/en_redirects_goarch/tr.d069/trMA.Aposticha3/c1211/audio/1:link.path	/media/a/en_public/tr/d069/ma/aposticha3.mp3
media/en_redirects_goarch/tr.d069/trMA.Aposticha3/c1211/score/b/1:link.info	SDedes
media/en_redirects_goarch/tr.d069/trMA.Aposticha3/c1211/score/b/1:link.path	/media/m/dedes/en/tr/d069/ma/b/aposticha3.pdf
media/en_redirects_goarch/tr.d069/trMA.Aposticha3/c1211/score/w/1:link.info	SDedes
media/en_redirects_goarch/tr.d069/trMA.Aposticha3/c1211/score/w/1:link.path	/media/m/dedes/en/tr/d069/ma/w/aposticha3.pdf
media/en_redirects_goarch/tr.d069/trMA.Aposticha4/c1211/audio/1:link.info	SDedes
media/en_redirects_goarch/tr.d069/trMA.Aposticha4/c1211/audio/1:link.path	/media/a/en_public/tr/d069/ma/aposticha4.mp3
media/en_redirects_goarch/tr.d069/trMA.Aposticha4/c1211/score/b/1:link.info	SDedes
media/en_redirects_goarch/tr.d069/trMA.Aposticha4/c1211/score/b/1:link.path	/media/m/dedes/en/tr/d069/ma/b/aposticha4.pdf
media/en_redirects_goarch/tr.d069/trMA.Aposticha4/c1211/score/w/1:link.info	SDedes
media/en_redirects_goarch/tr.d069/trMA.Aposticha4/c1211/score/w/1:link.path	/media/m/dedes/en/tr/d069/ma/w/aposticha4.pdf
media/en_redirects_goarch/tr.d069/trMA.Beatitudes01/c1211/audio/1:link.info	SDedes
media/en_redirects_goarch/tr.d069/trMA.Beatitudes01/c1211/audio/1:link.path	/media/a/en_public/tr/d069/ma/beatitudes.mp3
media/en_redirects_goarch/tr.d069/trMA.Beatitudes01/c1211/score/b/1:link.info	SDedes
media/en_redirects_goarch/tr.d069/trMA.Beatitudes01/c1211/score/b/1:link.path	/media/m/dedes/en/tr/d069/ma/b/beatitudes.pdf
media/en_redirects_goarch/tr.d069/trMA.Beatitudes01/c1211/score/w/1:link.info	SDedes
media/en_redirects_goarch/tr.d069/trMA.Beatitudes01/c1211/score/w/1:link.path	/media/m/dedes/en/tr/d069/ma/w/beatitudes.pdf
media/en_redirects_goarch/tr.d069/trMA.Exaposteilarion1/c1211/audio/1:link.info	SDedes
media/en_redirects_goarch/tr.d069/trMA.Exaposteilarion1/c1211/audio/1:link.path	/media/a/en_public/tr/d069/ma/exaposteilarion1.mp3
media/en_redirects_goarch/tr.d069/trMA.Exaposteilarion1/c1211/score/b/1:link.info	SDedes
media/en_redirects_goarch/tr.d069/trMA.Exaposteilarion1/c1211/score/b/1:link.path	/media/m/dedes/en/tr/d069/ma/b/exaposteilarion1.pdf
media/en_redirects_goarch/tr.d069/trMA.Exaposteilarion1/c1211/score/w/1:link.info	SDedes
media/en_redirects_goarch/tr.d069/trMA.Exaposteilarion1/c1211/score/w/1:link.path	/media/m/dedes/en/tr/d069/ma/w/exaposteilarion1.pdf
media/en_redirects_goarch/tr.d069/trMA.Lauds1/c1211/audio/1:link.info	SDedes
media/en_redirects_goarch/tr.d069/trMA.Lauds1/c1211/audio/1:link.path	/media/a/en_public/tr/d069/ma/lauds1.mp3
media/en_redirects_goarch/tr.d069/trMA.Lauds1/c1211/score/b/1:link.info	SDedes
media/en_redirects_goarch/tr.d069/trMA.Lauds1/c1211/score/b/1:link.path	/media/m/dedes/en/tr/d069/ma/b/lauds1.pdf
media/en_redirects_goarch/tr.d069/trMA.Lauds1/c1211/score/w/1:link.info	SDedes
media/en_redirects_goarch/tr.d069/trMA.Lauds1/c1211/score/w/1:link.path	/media/m/dedes/en/tr/d069/ma/w/lauds1.pdf
media/en_redirects_goarch/tr.d069/trMA.Lauds2/c1211/audio/1:link.info	SDedes
media/en_redirects_goarch/tr.d069/trMA.Lauds2/c1211/audio/1:link.path	/media/a/en_public/tr/d069/ma/lauds2.mp3
media/en_redirects_goarch/tr.d069/trMA.Lauds2/c1211/score/b/1:link.info	SDedes
media/en_redirects_goarch/tr.d069/trMA.Lauds2/c1211/score/b/1:link.path	/media/m/dedes/en/tr/d069/ma/b/lauds2.pdf
media/en_redirects_goarch/tr.d069/trMA.Lauds2/c1211/score/w/1:link.info	SDedes
media/en_redirects_goarch/tr.d069/trMA.Lauds2/c1211/score/w/1:link.path	/media/m/dedes/en/tr/d069/ma/w/lauds2.pdf
media/en_redirects_goarch/tr.d069/trMA.Lauds3/c1211/audio/1:link.info	SDedes
media/en_redirects_goarch/tr.d069/trMA.Lauds3/c1211/audio/1:link.path	/media/a/en_public/tr/d069/ma/lauds3.mp3
media/en_redirects_goarch/tr.d069/trMA.Lauds3/c1211/score/b/1:link.info	SDedes
media/en_redirects_goarch/tr.d069/trMA.Lauds3/c1211/score/b/1:link.path	/media/m/dedes/en/tr/d069/ma/b/lauds3.pdf
media/en_redirects_goarch/tr.d069/trMA.Lauds3/c1211/score/w/1:link.info	SDedes
media/en_redirects_goarch/tr.d069/trMA.Lauds3/c1211/score/w/1:link.path	/media/m/dedes/en/tr/d069/ma/w/lauds3.pdf
media/en_redirects_goarch/tr.d069/trMA.LaudsBoth/c1211/audio/1:link.info	SDedes
media/en_redirects_goarch/tr.d069/trMA.LaudsBoth/c1211/audio/1:link.path	/media/a/en_public/tr/d069/ma/laudsboth.mp3
media/en_redirects_goarch/tr.d069/trMA.LaudsBoth/c1211/score/b/1:link.info	SDedes
media/en_redirects_goarch/tr.d069/trMA.LaudsBoth/c1211/score/b/1:link.path	/media/m/dedes/en/tr/d069/ma/b/laudsboth.pdf
media/en_redirects_goarch/tr.d069/trMA.LaudsBoth/c1211/score/w/1:link.info	SDedes
media/en_redirects_goarch/tr.d069/trMA.LaudsBoth/c1211/score/w/1:link.path	/media/m/dedes/en/tr/d069/ma/w/laudsboth.pdf
media/en_redirects_goarch/tr.d069/trMA.LaudsGlory/c1211/audio/1:link.info	SDedes
media/en_redirects_goarch/tr.d069/trMA.LaudsGlory/c1211/audio/1:link.path	/media/a/en_public/tr/d069/ma/laudsglory.mp3
media/en_redirects_goarch/tr.d069/trMA.LaudsGlory/c1211/score/b/1:link.info	SDedes
media/en_redirects_goarch/tr.d069/trMA.LaudsGlory/c1211/score/b/1:link.path	/media/m/dedes/en/tr/d069/ma/b/laudsglory.pdf
media/en_redirects_goarch/tr.d069/trMA.LaudsGlory/c1211/score/w/1:link.info	SDedes
media/en_redirects_goarch/tr.d069/trMA.LaudsGlory/c1211/score/w/1:link.path	/media/m/dedes/en/tr/d069/ma/w/laudsglory.pdf
media/en_redirects_goarch/tr.d069/trMA.MM.Alleluia/c1211/audio/1:link.info	SDedes
media/en_redirects_goarch/tr.d069/trMA.MM.Alleluia/c1211/audio/1:link.path	/media/a/en_public/tr/d065/ma/alleluia.mp3
media/en_redirects_goarch/tr.d069/trMA.MM.Alleluia/c1211/score/b/1:link.info	SDedes
media/en_redirects_goarch/tr.d069/trMA.MM.Alleluia/c1211/score/b/1:link.path	/media/m/dedes/en/tr/d065/ma/b/alleluia.pdf
media/en_redirects_goarch/tr.d069/trMA.MM.Alleluia/c1211/score/w/1:link.info	SDedes
media/en_redirects_goarch/tr.d069/trMA.MM.Alleluia/c1211/score/w/1:link.path	/media/m/dedes/en/tr/d065/ma/w/alleluia.pdf
media/en_redirects_goarch/tr.d069/trMA.Ode5C1H/c1211/audio/1:link.info	SDedes
media/en_redirects_goarch/tr.d069/trMA.Ode5C1H/c1211/audio/1:link.path	/media/a/en_public/tr/d069/ma/ode5.mp3
media/en_redirects_goarch/tr.d069/trMA.Ode5C1H/c1211/score/b/1:link.info	SDedes
media/en_redirects_goarch/tr.d069/trMA.Ode5C1H/c1211/score/b/1:link.path	/media/m/dedes/en/tr/d069/ma/b/ode5.pdf
media/en_redirects_goarch/tr.d069/trMA.Ode5C1H/c1211/score/w/1:link.info	SDedes
media/en_redirects_goarch/tr.d069/trMA.Ode5C1H/c1211/score/w/1:link.path	/media/m/dedes/en/tr/d069/ma/w/ode5.pdf
media/en_redirects_goarch/tr.d069/trMA.Ode8C1H/c1211/audio/1:link.info	SDedes
media/en_redirects_goarch/tr.d069/trMA.Ode8C1H/c1211/audio/1:link.path	/media/a/en_public/tr/d069/ma/ode8.mp3
media/en_redirects_goarch/tr.d069/trMA.Ode8C1H/c1211/score/b/1:link.info	SDedes
media/en_redirects_goarch/tr.d069/trMA.Ode8C1H/c1211/score/b/1:link.path	/media/m/dedes/en/tr/d069/ma/b/ode8.pdf
media/en_redirects_goarch/tr.d069/trMA.Ode8C1H/c1211/score/w/1:link.info	SDedes
media/en_redirects_goarch/tr.d069/trMA.Ode8C1H/c1211/score/w/1:link.path	/media/m/dedes/en/tr/d069/ma/w/ode8.pdf
media/en_redirects_goarch/tr.d069/trMA.Ode9C1H/c1211/audio/1:link.info	SDedes
media/en_redirects_goarch/tr.d069/trMA.Ode9C1H/c1211/audio/1:link.path	/media/a/en_public/tr/d069/ma/ode9.mp3
media/en_redirects_goarch/tr.d069/trMA.Ode9C1H/c1211/score/b/1:link.info	SDedes
media/en_redirects_goarch/tr.d069/trMA.Ode9C1H/c1211/score/b/1:link.path	/media/m/dedes/en/tr/d069/ma/b/ode9.pdf
media/en_redirects_goarch/tr.d069/trMA.Ode9C1H/c1211/score/w/1:link.info	SDedes
media/en_redirects_goarch/tr.d069/trMA.Ode9C1H/c1211/score/w/1:link.path	/media/m/dedes/en/tr/d069/ma/w/ode9.pdf
media/en_redirects_goarch/tr.d069/trMA.Troparion/c1211/audio/1:link.info	SDedes
media/en_redirects_goarch/tr.d069/trMA.Troparion/c1211/audio/1:link.path	/media/a/en_public/tr/d068/ma/troparion.mp3
media/en_redirects_goarch/tr.d069/trMA.Troparion/c1211/score/b/1:link.info	SDedes
media/en_redirects_goarch/tr.d069/trMA.Troparion/c1211/score/b/1:link.path	/media/m/dedes/en/tr/d068/ma/b/troparion.pdf
media/en_redirects_goarch/tr.d069/trMA.Troparion/c1211/score/w/1:link.info	SDedes
media/en_redirects_goarch/tr.d069/trMA.Troparion/c1211/score/w/1:link.path	/media/m/dedes/en/tr/d068/ma/w/troparion.pdf
media/en_redirects_goarch/tr.d069/trVE.SticGlory/c1211/audio/1:link.info	SDedes
media/en_redirects_goarch/tr.d069/trVE.SticGlory/c1211/audio/1:link.path	/media/a/en_public/tr/d069/ve/sticglory.mp3
media/en_redirects_goarch/tr.d069/trVE.SticGlory/c1211/score/b/1:link.info	SDedes
media/en_redirects_goarch/tr.d069/trVE.SticGlory/c1211/score/b/1:link.path	/media/m/dedes/en/tr/d069/ve/b/sticglory.pdf
media/en_redirects_goarch/tr.d069/trVE.SticGlory/c1211/score/w/1:link.info	SDedes
media/en_redirects_goarch/tr.d069/trVE.SticGlory/c1211/score/w/1:link.path	/media/m/dedes/en/tr/d069/ve/w/sticglory.pdf
media/en_redirects_goarch/tr.d069/trVE.Stichera01/c1211/audio/1:link.info	SDedes
media/en_redirects_goarch/tr.d069/trVE.Stichera01/c1211/audio/1:link.path	/media/a/en_public/tr/d069/ve/stichera01.mp3
media/en_redirects_goarch/tr.d069/trVE.Stichera01/c1211/score/b/1:link.info	SDedes
media/en_redirects_goarch/tr.d069/trVE.Stichera01/c1211/score/b/1:link.path	/media/m/dedes/en/tr/d069/ve/b/stichera01.pdf
media/en_redirects_goarch/tr.d069/trVE.Stichera01/c1211/score/w/1:link.info	SDedes
media/en_redirects_goarch/tr.d069/trVE.Stichera01/c1211/score/w/1:link.path	/media/m/dedes/en/tr/d069/ve/w/stichera01.pdf
media/en_redirects_goarch/tr.d069/trVE.Stichera02/c1211/audio/1:link.info	SDedes
media/en_redirects_goarch/tr.d069/trVE.Stichera02/c1211/audio/1:link.path	/media/a/en_public/tr/d069/ve/stichera02.mp3
media/en_redirects_goarch/tr.d069/trVE.Stichera02/c1211/score/b/1:link.info	SDedes
media/en_redirects_goarch/tr.d069/trVE.Stichera02/c1211/score/b/1:link.path	/media/m/dedes/en/tr/d069/ve/b/stichera02.pdf
media/en_redirects_goarch/tr.d069/trVE.Stichera02/c1211/score/w/1:link.info	SDedes
media/en_redirects_goarch/tr.d069/trVE.Stichera02/c1211/score/w/1:link.path	/media/m/dedes/en/tr/d069/ve/w/stichera02.pdf
media/en_redirects_goarch/tr.d069/trVE.Stichera03/c1211/audio/1:link.info	SDedes
media/en_redirects_goarch/tr.d069/trVE.Stichera03/c1211/audio/1:link.path	/media/a/en_public/tr/d069/ve/stichera03.mp3
media/en_redirects_goarch/tr.d069/trVE.Stichera03/c1211/score/b/1:link.info	SDedes
media/en_redirects_goarch/tr.d069/trVE.Stichera03/c1211/score/b/1:link.path	/media/m/dedes/en/tr/d069/ve/b/stichera03.pdf
media/en_redirects_goarch/tr.d069/trVE.Stichera03/c1211/score/w/1:link.info	SDedes
media/en_redirects_goarch/tr.d069/trVE.Stichera03/c1211/score/w/1:link.path	/media/m/dedes/en/tr/d069/ve/w/stichera03.pdf
media/en_redirects_goarch/tr.d069/trVE.Stichera04/c1211/audio/1:link.info	SDedes
media/en_redirects_goarch/tr.d069/trVE.Stichera04/c1211/audio/1:link.path	/media/a/en_public/tr/d069/ve/stichera04.mp3
media/en_redirects_goarch/tr.d069/trVE.Stichera04/c1211/score/b/1:link.info	SDedes
media/en_redirects_goarch/tr.d069/trVE.Stichera04/c1211/score/b/1:link.path	/media/m/dedes/en/tr/d069/ve/b/stichera04.pdf
media/en_redirects_goarch/tr.d069/trVE.Stichera04/c1211/score/w/1:link.info	SDedes
media/en_redirects_goarch/tr.d069/trVE.Stichera04/c1211/score/w/1:link.path	/media/m/dedes/en/tr/d069/ve/w/stichera04.pdf
media/en_redirects_goarch/tr.d069/trVE.Stichera05/c1211/audio/1:link.info	SDedes
media/en_redirects_goarch/tr.d069/trVE.Stichera05/c1211/audio/1:link.path	/media/a/en_public/tr/d069/ve/stichera05.mp3
media/en_redirects_goarch/tr.d069/trVE.Stichera05/c1211/score/b/1:link.info	SDedes
media/en_redirects_goarch/tr.d069/trVE.Stichera05/c1211/score/b/1:link.path	/media/m/dedes/en/tr/d069/ve/b/stichera05.pdf
media/en_redirects_goarch/tr.d069/trVE.Stichera05/c1211/score/w/1:link.info	SDedes
media/en_redirects_goarch/tr.d069/trVE.Stichera05/c1211/score/w/1:link.path	/media/m/dedes/en/tr/d069/ve/w/stichera05.pdf
