media/en_redirects_goarch/me.m07.d13/meMA.LaudsGlory/c1211/score/b/1:link.info	SDedes
media/en_redirects_goarch/me.m07.d13/meMA.LaudsGlory/c1211/score/b/1:link.path	/media/m/dedes/en/me/m07/d13/ma/b/laudsglory.pdf
media/en_redirects_goarch/me.m07.d13/meMA.LaudsGlory/c1211/score/w/1:link.info	SDedes
media/en_redirects_goarch/me.m07.d13/meMA.LaudsGlory/c1211/score/w/1:link.path	/media/m/dedes/en/me/m07/d13/ma/w/laudsglory.pdf
media/en_redirects_goarch/me.m07.d13/meVE.Apolytikion1/c1211/score/w/1:link.info	SDedes
media/en_redirects_goarch/me.m07.d13/meVE.Apolytikion1/c1211/score/w/1:link.path	/media/m/dedes/en/me/m07/d13/ve/w/apolytikion1.pdf
media/en_redirects_goarch/me.m07.d13/meVE.AposGlory/c1211/score/b/1:link.info	SDedes
media/en_redirects_goarch/me.m07.d13/meVE.AposGlory/c1211/score/b/1:link.path	/media/m/dedes/en/me/m11/d08/ve/b/aposglory.pdf
media/en_redirects_goarch/me.m07.d13/meVE.AposGlory/c1211/score/w/1:link.info	SDedes
media/en_redirects_goarch/me.m07.d13/meVE.AposGlory/c1211/score/w/1:link.path	/media/m/dedes/en/me/m11/d08/ve/w/aposglory.pdf
media/en_redirects_goarch/me.m07.d13/meVE.SticGlory/c1211/score/b/1:link.info	SDedes
media/en_redirects_goarch/me.m07.d13/meVE.SticGlory/c1211/score/b/1:link.path	/media/m/dedes/en/me/m07/d13/ve/b/sticglory.pdf
media/en_redirects_goarch/me.m07.d13/meVE.SticGlory/c1211/score/w/1:link.info	SDedes
media/en_redirects_goarch/me.m07.d13/meVE.SticGlory/c1211/score/w/1:link.path	/media/m/dedes/en/me/m07/d13/ve/w/sticglory.pdf
