media/en_redirects_goarch/pe.d103/peMA.Kathisma21/c1211/score/w/1:link.info	SDedes
media/en_redirects_goarch/pe.d103/peMA.Kathisma21/c1211/score/w/1:link.path	/media/m/dedes/en/pe/d103/ma/w/kathisma21.pdf
media/en_redirects_goarch/pe.d103/peMA.LaudsGlory/c1211/score/b/1:link.info	SDedes
media/en_redirects_goarch/pe.d103/peMA.LaudsGlory/c1211/score/b/1:link.path	/media/m/dedes/en/pe/d103/ma/b/laudsglory.pdf
media/en_redirects_goarch/pe.d103/peMA.LaudsGlory/c1211/score/w/1:link.info	SDedes
media/en_redirects_goarch/pe.d103/peMA.LaudsGlory/c1211/score/w/1:link.path	/media/m/dedes/en/pe/d103/ma/w/laudsglory.pdf
media/en_redirects_goarch/pe.d103/peVE.AposGlory/c1211/score/b/1:link.info	SDedes
media/en_redirects_goarch/pe.d103/peVE.AposGlory/c1211/score/b/1:link.path	/media/m/dedes/en/pe/d103/ve/b/aposglory.pdf
media/en_redirects_goarch/pe.d103/peVE.AposGlory/c1211/score/w/1:link.info	SDedes
media/en_redirects_goarch/pe.d103/peVE.AposGlory/c1211/score/w/1:link.path	/media/m/dedes/en/pe/d103/ve/w/aposglory.pdf
media/en_redirects_goarch/pe.d103/peVE.SticGlory/c1211/score/b/1:link.info	SDedes
media/en_redirects_goarch/pe.d103/peVE.SticGlory/c1211/score/b/1:link.path	/media/m/dedes/en/pe/d103/ve/b/sticglory.pdf
media/en_redirects_goarch/pe.d103/peVE.SticGlory/c1211/score/w/1:link.info	SDedes
media/en_redirects_goarch/pe.d103/peVE.SticGlory/c1211/score/w/1:link.path	/media/m/dedes/en/pe/d103/ve/w/sticglory.pdf
