media/en_redirects_goarch/me.m12.d16/alt1.meVE.AposBoth/c1211/score/b/1:link.info	SDedes
media/en_redirects_goarch/me.m12.d16/alt1.meVE.AposBoth/c1211/score/b/1:link.path	/media/m/dedes/en/me/m11/d30/ma/b/laudsboth.pdf
media/en_redirects_goarch/me.m12.d16/alt1.meVE.AposBoth/c1211/score/w/1:link.info	SDedes
media/en_redirects_goarch/me.m12.d16/alt1.meVE.AposBoth/c1211/score/w/1:link.path	/media/m/dedes/en/me/m11/d30/ma/w/laudsboth.pdf
