media/en_redirects_goarch/me.m08.d12/meVE.AposBoth/c1211/score/b/1:link.info	SDedes
media/en_redirects_goarch/me.m08.d12/meVE.AposBoth/c1211/score/b/1:link.path	/media/m/dedes/en/me/m08/d07/ve/b/aposglory.pdf
media/en_redirects_goarch/me.m08.d12/meVE.AposBoth/c1211/score/w/1:link.info	SDedes
media/en_redirects_goarch/me.m08.d12/meVE.AposBoth/c1211/score/w/1:link.path	/media/m/dedes/en/me/m08/d07/ve/w/aposglory.pdf
media/en_redirects_goarch/me.m08.d12/meVE.AposGlory/c1211/score/b/1:link.info	SDedes
media/en_redirects_goarch/me.m08.d12/meVE.AposGlory/c1211/score/b/1:link.path	/media/m/dedes/en/me/m01/d15/ve/b/aposglory.pdf
media/en_redirects_goarch/me.m08.d12/meVE.AposGlory/c1211/score/w/1:link.info	SDedes
media/en_redirects_goarch/me.m08.d12/meVE.AposGlory/c1211/score/w/1:link.path	/media/m/dedes/en/me/m01/d15/ve/w/aposglory.pdf
media/en_redirects_goarch/me.m08.d12/meVE.SticBoth/c1211/score/b/1:link.info	SDedes
media/en_redirects_goarch/me.m08.d12/meVE.SticBoth/c1211/score/b/1:link.path	/media/m/dedes/en/me/m08/d06/sv/b/svsticglory.pdf
media/en_redirects_goarch/me.m08.d12/meVE.SticBoth/c1211/score/w/1:link.info	SDedes
media/en_redirects_goarch/me.m08.d12/meVE.SticBoth/c1211/score/w/1:link.path	/media/m/dedes/en/me/m08/d06/sv/w/svsticglory.pdf
media/en_redirects_goarch/me.m08.d12/meVE.SticGlory/c1211/score/b/1:link.info	SDedes
media/en_redirects_goarch/me.m08.d12/meVE.SticGlory/c1211/score/b/1:link.path	/media/m/dedes/en/me/m01/d21/ve/b/aposglory.pdf
media/en_redirects_goarch/me.m08.d12/meVE.SticGlory/c1211/score/w/1:link.info	SDedes
media/en_redirects_goarch/me.m08.d12/meVE.SticGlory/c1211/score/w/1:link.path	/media/m/dedes/en/me/m01/d21/ve/w/aposglory.pdf
