media/en_redirects_goarch/pe.d099/peLI.TheotokosHymn/c1211/score/b/1:link.info	SDedes
media/en_redirects_goarch/pe.d099/peLI.TheotokosHymn/c1211/score/b/1:link.path	/media/m/dedes/en/pe/d099/li/b/theotokoshymn.pdf
media/en_redirects_goarch/pe.d099/peLI.TheotokosHymn/c1211/score/w/1:link.info	SDedes
media/en_redirects_goarch/pe.d099/peLI.TheotokosHymn/c1211/score/w/1:link.path	/media/m/dedes/en/pe/d099/li/w/theotokoshymn.pdf
media/en_redirects_goarch/pe.d099/peLI.TheotokosHymn/c1212/score/b/1:link.info	Short melody | SDedes
media/en_redirects_goarch/pe.d099/peLI.TheotokosHymn/c1212/score/b/1:link.path	/media/m/dedes/en/pe/d099/li/b/theotokoshymn_short.pdf
media/en_redirects_goarch/pe.d099/peLI.TheotokosHymn/c1212/score/w/1:link.info	Short melody | SDedes
media/en_redirects_goarch/pe.d099/peLI.TheotokosHymn/c1212/score/w/1:link.path	/media/m/dedes/en/pe/d099/li/w/theotokoshymn_short.pdf
media/en_redirects_goarch/pe.d099/peLI.TheotokosHymn/c2001/score/w/1:link.info	NewByz
media/en_redirects_goarch/pe.d099/peLI.TheotokosHymn/c2001/score/w/1:link.path	/media/m/newbyz/en/pe/d099/li/w/theotokoshymn.pdf
media/en_redirects_goarch/pe.d099/peMA.Exaposteilarion1/c1211/score/w/1:link.info	SDedes
media/en_redirects_goarch/pe.d099/peMA.Exaposteilarion1/c1211/score/w/1:link.path	/media/m/dedes/en/pe/d099/ma/w/exaposteilarion1.pdf
media/en_redirects_goarch/pe.d099/peMA.Exaposteilarion2/c1211/score/w/1:link.info	SDedes
media/en_redirects_goarch/pe.d099/peMA.Exaposteilarion2/c1211/score/w/1:link.path	/media/m/dedes/en/pe/d099/ma/w/exaposteilarion2.pdf
media/en_redirects_goarch/pe.d099/peMA.Kathisma11/c1211/score/b/1:link.info	SDedes
media/en_redirects_goarch/pe.d099/peMA.Kathisma11/c1211/score/b/1:link.path	/media/m/dedes/en/pe/d099/ma/b/kathisma11.pdf
media/en_redirects_goarch/pe.d099/peMA.Kathisma11/c1211/score/w/1:link.info	SDedes
media/en_redirects_goarch/pe.d099/peMA.Kathisma11/c1211/score/w/1:link.path	/media/m/dedes/en/pe/d099/ma/w/kathisma11.pdf
media/en_redirects_goarch/pe.d099/peMA.Kathisma12/c1211/score/b/1:link.info	SDedes
media/en_redirects_goarch/pe.d099/peMA.Kathisma12/c1211/score/b/1:link.path	/media/m/dedes/en/pe/d099/ma/b/kathisma12.pdf
media/en_redirects_goarch/pe.d099/peMA.Kathisma12/c1211/score/w/1:link.info	SDedes
media/en_redirects_goarch/pe.d099/peMA.Kathisma12/c1211/score/w/1:link.path	/media/m/dedes/en/pe/d099/ma/w/kathisma12.pdf
media/en_redirects_goarch/pe.d099/peMA.Kathisma13/c1211/score/b/1:link.info	SDedes
media/en_redirects_goarch/pe.d099/peMA.Kathisma13/c1211/score/b/1:link.path	/media/m/dedes/en/pe/d099/ma/b/kathisma13.pdf
media/en_redirects_goarch/pe.d099/peMA.Kathisma13/c1211/score/w/1:link.info	SDedes
media/en_redirects_goarch/pe.d099/peMA.Kathisma13/c1211/score/w/1:link.path	/media/m/dedes/en/pe/d099/ma/w/kathisma13.pdf
media/en_redirects_goarch/pe.d099/peMA.Kathisma21/c1211/score/b/1:link.info	SDedes
media/en_redirects_goarch/pe.d099/peMA.Kathisma21/c1211/score/b/1:link.path	/media/m/dedes/en/pe/d099/ma/b/kathisma21.pdf
media/en_redirects_goarch/pe.d099/peMA.Kathisma21/c1211/score/w/1:link.info	SDedes
media/en_redirects_goarch/pe.d099/peMA.Kathisma21/c1211/score/w/1:link.path	/media/m/dedes/en/pe/d099/ma/w/kathisma21.pdf
media/en_redirects_goarch/pe.d099/peMA.Kathisma22/c1211/score/b/1:link.info	SDedes
media/en_redirects_goarch/pe.d099/peMA.Kathisma22/c1211/score/b/1:link.path	/media/m/dedes/en/pe/d099/ma/b/kathisma22.pdf
media/en_redirects_goarch/pe.d099/peMA.Kathisma22/c1211/score/w/1:link.info	SDedes
media/en_redirects_goarch/pe.d099/peMA.Kathisma22/c1211/score/w/1:link.path	/media/m/dedes/en/pe/d099/ma/w/kathisma22.pdf
media/en_redirects_goarch/pe.d099/peMA.Kathisma23/c1211/score/b/1:link.info	SDedes
media/en_redirects_goarch/pe.d099/peMA.Kathisma23/c1211/score/b/1:link.path	/media/m/dedes/en/pe/d099/ma/b/kathisma23.pdf
media/en_redirects_goarch/pe.d099/peMA.Kathisma23/c1211/score/w/1:link.info	SDedes
media/en_redirects_goarch/pe.d099/peMA.Kathisma23/c1211/score/w/1:link.path	/media/m/dedes/en/pe/d099/ma/w/kathisma23.pdf
media/en_redirects_goarch/pe.d099/peMA.Lauds1/c1211/audio/1:link.info	SDedes
media/en_redirects_goarch/pe.d099/peMA.Lauds1/c1211/audio/1:link.path	/media/a/dedes/oc/m4/d1/ma/lauds1.mp3
media/en_redirects_goarch/pe.d099/peMA.Lauds1/c1211/score/b/1:link.info	SDedes
media/en_redirects_goarch/pe.d099/peMA.Lauds1/c1211/score/b/1:link.path	/media/m/dedes/en/pe/d099/ma/b/lauds1.pdf
media/en_redirects_goarch/pe.d099/peMA.Lauds1/c1211/score/w/1:link.info	SDedes
media/en_redirects_goarch/pe.d099/peMA.Lauds1/c1211/score/w/1:link.path	/media/m/dedes/en/pe/d099/ma/w/lauds1.pdf
media/en_redirects_goarch/pe.d099/peMA.Lauds2/c1211/audio/1:link.info	SDedes
media/en_redirects_goarch/pe.d099/peMA.Lauds2/c1211/audio/1:link.path	/media/a/dedes/oc/m4/d1/ma/lauds2.mp3
media/en_redirects_goarch/pe.d099/peMA.Lauds2/c1211/score/b/1:link.info	SDedes
media/en_redirects_goarch/pe.d099/peMA.Lauds2/c1211/score/b/1:link.path	/media/m/dedes/en/pe/d099/ma/b/lauds2.pdf
media/en_redirects_goarch/pe.d099/peMA.Lauds2/c1211/score/w/1:link.info	SDedes
media/en_redirects_goarch/pe.d099/peMA.Lauds2/c1211/score/w/1:link.path	/media/m/dedes/en/pe/d099/ma/w/lauds2.pdf
media/en_redirects_goarch/pe.d099/peMA.Lauds3/c1211/audio/1:link.info	SDedes
media/en_redirects_goarch/pe.d099/peMA.Lauds3/c1211/audio/1:link.path	/media/a/dedes/oc/m4/d1/ma/lauds3.mp3
media/en_redirects_goarch/pe.d099/peMA.Lauds3/c1211/score/b/1:link.info	SDedes
media/en_redirects_goarch/pe.d099/peMA.Lauds3/c1211/score/b/1:link.path	/media/m/dedes/en/pe/d099/ma/b/lauds3.pdf
media/en_redirects_goarch/pe.d099/peMA.Lauds3/c1211/score/w/1:link.info	SDedes
media/en_redirects_goarch/pe.d099/peMA.Lauds3/c1211/score/w/1:link.path	/media/m/dedes/en/pe/d099/ma/w/lauds3.pdf
media/en_redirects_goarch/pe.d099/peMA.Lauds4/c1211/audio/1:link.info	SDedes
media/en_redirects_goarch/pe.d099/peMA.Lauds4/c1211/audio/1:link.path	/media/a/dedes/oc/m4/d1/ma/lauds4.mp3
media/en_redirects_goarch/pe.d099/peMA.Lauds4/c1211/score/b/1:link.info	SDedes
media/en_redirects_goarch/pe.d099/peMA.Lauds4/c1211/score/b/1:link.path	/media/m/dedes/en/pe/d099/ma/b/lauds4.pdf
media/en_redirects_goarch/pe.d099/peMA.Lauds4/c1211/score/w/1:link.info	SDedes
media/en_redirects_goarch/pe.d099/peMA.Lauds4/c1211/score/w/1:link.path	/media/m/dedes/en/pe/d099/ma/w/lauds4.pdf
media/en_redirects_goarch/pe.d099/peMA.Lauds8/c1211/score/b/1:link.info	SDedes
media/en_redirects_goarch/pe.d099/peMA.Lauds8/c1211/score/b/1:link.path	/media/m/dedes/en/pe/d099/ma/b/lauds8.pdf
media/en_redirects_goarch/pe.d099/peMA.Lauds8/c1211/score/w/1:link.info	SDedes
media/en_redirects_goarch/pe.d099/peMA.Lauds8/c1211/score/w/1:link.path	/media/m/dedes/en/pe/d099/ma/w/lauds8.pdf
media/en_redirects_goarch/pe.d099/peMA.LaudsGlory/c1211/score/b/1:link.info	SDedes
media/en_redirects_goarch/pe.d099/peMA.LaudsGlory/c1211/score/b/1:link.path	/media/m/dedes/en/pe/d099/ma/b/laudsglory.pdf
media/en_redirects_goarch/pe.d099/peMA.LaudsGlory/c1211/score/w/1:link.info	SDedes
media/en_redirects_goarch/pe.d099/peMA.LaudsGlory/c1211/score/w/1:link.path	/media/m/dedes/en/pe/d099/ma/w/laudsglory.pdf
media/en_redirects_goarch/pe.d099/peMA.Ode3Kathisma1/c1211/score/w/1:link.info	SDedes
media/en_redirects_goarch/pe.d099/peMA.Ode3Kathisma1/c1211/score/w/1:link.path	/media/m/dedes/en/pe/d099/ma/w/ode3kathisma1.pdf
media/en_redirects_goarch/pe.d099/peVE.AposGlory/c1211/score/b/1:link.info	SDedes
media/en_redirects_goarch/pe.d099/peVE.AposGlory/c1211/score/b/1:link.path	/media/m/dedes/en/pe/d099/ve/b/aposglory.pdf
media/en_redirects_goarch/pe.d099/peVE.AposGlory/c1211/score/w/1:link.info	SDedes
media/en_redirects_goarch/pe.d099/peVE.AposGlory/c1211/score/w/1:link.path	/media/m/dedes/en/pe/d099/ve/w/aposglory.pdf
media/en_redirects_goarch/pe.d099/peVE.SticGlory/c1211/score/b/1:link.info	SDedes
media/en_redirects_goarch/pe.d099/peVE.SticGlory/c1211/score/b/1:link.path	/media/m/dedes/en/pe/d099/ve/b/sticglory.pdf
media/en_redirects_goarch/pe.d099/peVE.SticGlory/c1211/score/w/1:link.info	SDedes
media/en_redirects_goarch/pe.d099/peVE.SticGlory/c1211/score/w/1:link.path	/media/m/dedes/en/pe/d099/ve/w/sticglory.pdf
media/en_redirects_goarch/pe.d099/peVE.Stichera05/c1211/score/b/1:link.info	SDedes
media/en_redirects_goarch/pe.d099/peVE.Stichera05/c1211/score/b/1:link.path	/media/m/dedes/en/pe/d099/ve/b/stichera05.pdf
media/en_redirects_goarch/pe.d099/peVE.Stichera05/c1211/score/w/1:link.info	SDedes
media/en_redirects_goarch/pe.d099/peVE.Stichera05/c1211/score/w/1:link.path	/media/m/dedes/en/pe/d099/ve/w/stichera05.pdf
media/en_redirects_goarch/pe.d099/peVE.Stichera06/c1211/score/b/1:link.info	SDedes
media/en_redirects_goarch/pe.d099/peVE.Stichera06/c1211/score/b/1:link.path	/media/m/dedes/en/pe/d099/ve/b/stichera06.pdf
media/en_redirects_goarch/pe.d099/peVE.Stichera06/c1211/score/w/1:link.info	SDedes
media/en_redirects_goarch/pe.d099/peVE.Stichera06/c1211/score/w/1:link.path	/media/m/dedes/en/pe/d099/ve/w/stichera06.pdf
media/en_redirects_goarch/pe.d099/peVE.Stichera07/c1211/score/b/1:link.info	SDedes
media/en_redirects_goarch/pe.d099/peVE.Stichera07/c1211/score/b/1:link.path	/media/m/dedes/en/pe/d099/ve/b/stichera07.pdf
media/en_redirects_goarch/pe.d099/peVE.Stichera07/c1211/score/w/1:link.info	SDedes
media/en_redirects_goarch/pe.d099/peVE.Stichera07/c1211/score/w/1:link.path	/media/m/dedes/en/pe/d099/ve/w/stichera07.pdf
media/en_redirects_goarch/pe.d099/peVE.Stichera08/c1211/score/b/1:link.info	SDedes
media/en_redirects_goarch/pe.d099/peVE.Stichera08/c1211/score/b/1:link.path	/media/m/dedes/en/pe/d099/ve/b/stichera08.pdf
media/en_redirects_goarch/pe.d099/peVE.Stichera08/c1211/score/w/1:link.info	SDedes
media/en_redirects_goarch/pe.d099/peVE.Stichera08/c1211/score/w/1:link.path	/media/m/dedes/en/pe/d099/ve/w/stichera08.pdf
media/en_redirects_goarch/pe.d099/peVE.Stichera09/c1211/score/b/1:link.info	SDedes
media/en_redirects_goarch/pe.d099/peVE.Stichera09/c1211/score/b/1:link.path	/media/m/dedes/en/pe/d099/ve/b/stichera09.pdf
media/en_redirects_goarch/pe.d099/peVE.Stichera09/c1211/score/w/1:link.info	SDedes
media/en_redirects_goarch/pe.d099/peVE.Stichera09/c1211/score/w/1:link.path	/media/m/dedes/en/pe/d099/ve/w/stichera09.pdf
media/en_redirects_goarch/pe.d099/peVE.Stichera10/c1211/score/b/1:link.info	SDedes
media/en_redirects_goarch/pe.d099/peVE.Stichera10/c1211/score/b/1:link.path	/media/m/dedes/en/pe/d099/ve/b/stichera10.pdf
media/en_redirects_goarch/pe.d099/peVE.Stichera10/c1211/score/w/1:link.info	SDedes
media/en_redirects_goarch/pe.d099/peVE.Stichera10/c1211/score/w/1:link.path	/media/m/dedes/en/pe/d099/ve/w/stichera10.pdf
