media/en_redirects_goarch/pe.d073/peMA.Lauds1/c1211/audio/1:link.info	SDedes
media/en_redirects_goarch/pe.d073/peMA.Lauds1/c1211/audio/1:link.path	/media/a/dedes/oc/m3/d1/ma/lauds1.mp3
media/en_redirects_goarch/pe.d073/peMA.Lauds1/c1211/score/b/1:link.info	SDedes
media/en_redirects_goarch/pe.d073/peMA.Lauds1/c1211/score/b/1:link.path	/media/m/dedes/en/pe/d073/ma/b/lauds1.pdf
media/en_redirects_goarch/pe.d073/peMA.Lauds1/c1211/score/w/1:link.info	SDedes
media/en_redirects_goarch/pe.d073/peMA.Lauds1/c1211/score/w/1:link.path	/media/m/dedes/en/pe/d073/ma/w/lauds1.pdf
media/en_redirects_goarch/pe.d073/peMA.Lauds2/c1211/audio/1:link.info	SDedes
media/en_redirects_goarch/pe.d073/peMA.Lauds2/c1211/audio/1:link.path	/media/a/dedes/oc/m3/d1/ma/lauds2.mp3
media/en_redirects_goarch/pe.d073/peMA.Lauds2/c1211/score/b/1:link.info	SDedes
media/en_redirects_goarch/pe.d073/peMA.Lauds2/c1211/score/b/1:link.path	/media/m/dedes/en/pe/d073/ma/b/lauds2.pdf
media/en_redirects_goarch/pe.d073/peMA.Lauds2/c1211/score/w/1:link.info	SDedes
media/en_redirects_goarch/pe.d073/peMA.Lauds2/c1211/score/w/1:link.path	/media/m/dedes/en/pe/d073/ma/w/lauds2.pdf
media/en_redirects_goarch/pe.d073/peMA.Lauds3/c1211/audio/1:link.info	SDedes
media/en_redirects_goarch/pe.d073/peMA.Lauds3/c1211/audio/1:link.path	/media/a/dedes/oc/m3/d1/ma/lauds3.mp3
media/en_redirects_goarch/pe.d073/peMA.Lauds3/c1211/score/b/1:link.info	SDedes
media/en_redirects_goarch/pe.d073/peMA.Lauds3/c1211/score/b/1:link.path	/media/m/dedes/en/pe/d073/ma/b/lauds3.pdf
media/en_redirects_goarch/pe.d073/peMA.Lauds3/c1211/score/w/1:link.info	SDedes
media/en_redirects_goarch/pe.d073/peMA.Lauds3/c1211/score/w/1:link.path	/media/m/dedes/en/pe/d073/ma/w/lauds3.pdf
media/en_redirects_goarch/pe.d073/peMA.Lauds4/c1211/audio/1:link.info	SDedes
media/en_redirects_goarch/pe.d073/peMA.Lauds4/c1211/audio/1:link.path	/media/a/dedes/oc/m3/d1/ma/lauds4.mp3
media/en_redirects_goarch/pe.d073/peMA.Lauds4/c1211/score/b/1:link.info	SDedes
media/en_redirects_goarch/pe.d073/peMA.Lauds4/c1211/score/b/1:link.path	/media/m/dedes/en/pe/d073/ma/b/lauds4.pdf
media/en_redirects_goarch/pe.d073/peMA.Lauds4/c1211/score/w/1:link.info	SDedes
media/en_redirects_goarch/pe.d073/peMA.Lauds4/c1211/score/w/1:link.path	/media/m/dedes/en/pe/d073/ma/w/lauds4.pdf
media/en_redirects_goarch/pe.d073/peMA.MM.Lauds1234as1234/c1211/score/b/1:link.info	SDedes
media/en_redirects_goarch/pe.d073/peMA.MM.Lauds1234as1234/c1211/score/b/1:link.path	/media/m/dedes/en/pe/d073/ma/b/lauds1234as1234.pdf
media/en_redirects_goarch/pe.d073/peMA.MM.Lauds1234as1234/c1211/score/w/1:link.info	SDedes
media/en_redirects_goarch/pe.d073/peMA.MM.Lauds1234as1234/c1211/score/w/1:link.path	/media/m/dedes/en/pe/d073/ma/w/lauds1234as1234.pdf
media/en_redirects_goarch/pe.d073/peMA.MM.Lauds123as123/c1211/score/b/1:link.info	SDedes
media/en_redirects_goarch/pe.d073/peMA.MM.Lauds123as123/c1211/score/b/1:link.path	/media/m/dedes/en/pe/d073/ma/b/lauds123as123.pdf
media/en_redirects_goarch/pe.d073/peMA.MM.Lauds123as123/c1211/score/w/1:link.info	SDedes
media/en_redirects_goarch/pe.d073/peMA.MM.Lauds123as123/c1211/score/w/1:link.path	/media/m/dedes/en/pe/d073/ma/w/lauds123as123.pdf
media/en_redirects_goarch/pe.d073/peVE.Aposticha1/c1211/score/b/1:link.info	SDedes
media/en_redirects_goarch/pe.d073/peVE.Aposticha1/c1211/score/b/1:link.path	/media/m/dedes/en/oc/m3/d1/ve/b/aposticha1.pdf
media/en_redirects_goarch/pe.d073/peVE.Aposticha1/c1211/score/w/1:link.info	SDedes
media/en_redirects_goarch/pe.d073/peVE.Aposticha1/c1211/score/w/1:link.path	/media/m/dedes/en/oc/m3/d1/ve/w/aposticha1.pdf
media/en_redirects_goarch/pe.d073/peVE.MM.Stichera1234as3456/c1211/score/b/1:link.info	SDedes
media/en_redirects_goarch/pe.d073/peVE.MM.Stichera1234as3456/c1211/score/b/1:link.path	/media/m/dedes/en/pe/d073/ve/b/stichera1234as3456.pdf
media/en_redirects_goarch/pe.d073/peVE.MM.Stichera1234as3456/c1211/score/w/1:link.info	SDedes
media/en_redirects_goarch/pe.d073/peVE.MM.Stichera1234as3456/c1211/score/w/1:link.path	/media/m/dedes/en/pe/d073/ve/w/stichera1234as3456.pdf
media/en_redirects_goarch/pe.d073/peVE.SticBoth/c1211/score/b/1:link.info	SDedes
media/en_redirects_goarch/pe.d073/peVE.SticBoth/c1211/score/b/1:link.path	/media/m/dedes/en/oc/m3/d1/ve/w/stictheotokion.pdf
media/en_redirects_goarch/pe.d073/peVE.SticBoth/c1211/score/w/1:link.info	SDedes
media/en_redirects_goarch/pe.d073/peVE.SticBoth/c1211/score/w/1:link.path	/media/m/dedes/en/oc/m3/d1/ve/w/stictheotokion.pdf
media/en_redirects_goarch/pe.d073/peVE.SticGlory/c1211/score/b/1:link.info	SDedes
media/en_redirects_goarch/pe.d073/peVE.SticGlory/c1211/score/b/1:link.path	/media/m/dedes/en/pe/d073/ve/b/sticglory.pdf
media/en_redirects_goarch/pe.d073/peVE.SticGlory/c1211/score/w/1:link.info	SDedes
media/en_redirects_goarch/pe.d073/peVE.SticGlory/c1211/score/w/1:link.path	/media/m/dedes/en/pe/d073/ve/w/sticglory.pdf
media/en_redirects_goarch/pe.d073/peVE.Stichera01/c1211/score/b/1:link.info	SDedes
media/en_redirects_goarch/pe.d073/peVE.Stichera01/c1211/score/b/1:link.path	/media/m/dedes/en/pe/d073/ve/b/stichera01.pdf
media/en_redirects_goarch/pe.d073/peVE.Stichera01/c1211/score/w/1:link.info	SDedes
media/en_redirects_goarch/pe.d073/peVE.Stichera01/c1211/score/w/1:link.path	/media/m/dedes/en/pe/d073/ve/w/stichera01.pdf
media/en_redirects_goarch/pe.d073/peVE.Stichera02/c1211/score/b/1:link.info	SDedes
media/en_redirects_goarch/pe.d073/peVE.Stichera02/c1211/score/b/1:link.path	/media/m/dedes/en/pe/d073/ve/b/stichera02.pdf
media/en_redirects_goarch/pe.d073/peVE.Stichera02/c1211/score/w/1:link.info	SDedes
media/en_redirects_goarch/pe.d073/peVE.Stichera02/c1211/score/w/1:link.path	/media/m/dedes/en/pe/d073/ve/w/stichera02.pdf
media/en_redirects_goarch/pe.d073/peVE.Stichera03/c1211/score/b/1:link.info	SDedes
media/en_redirects_goarch/pe.d073/peVE.Stichera03/c1211/score/b/1:link.path	/media/m/dedes/en/pe/d073/ve/b/stichera03.pdf
media/en_redirects_goarch/pe.d073/peVE.Stichera03/c1211/score/w/1:link.info	SDedes
media/en_redirects_goarch/pe.d073/peVE.Stichera03/c1211/score/w/1:link.path	/media/m/dedes/en/pe/d073/ve/w/stichera03.pdf
media/en_redirects_goarch/pe.d073/peVE.Stichera04/c1211/score/b/1:link.info	SDedes
media/en_redirects_goarch/pe.d073/peVE.Stichera04/c1211/score/b/1:link.path	/media/m/dedes/en/pe/d073/ve/b/stichera04.pdf
media/en_redirects_goarch/pe.d073/peVE.Stichera04/c1211/score/w/1:link.info	SDedes
media/en_redirects_goarch/pe.d073/peVE.Stichera04/c1211/score/w/1:link.path	/media/m/dedes/en/pe/d073/ve/w/stichera04.pdf
media/en_redirects_goarch/pe.d073/peVE.Stichera05/c1211/score/b/1:link.info	SDedes
media/en_redirects_goarch/pe.d073/peVE.Stichera05/c1211/score/b/1:link.path	/media/m/dedes/en/pe/d073/ve/b/stichera05.pdf
media/en_redirects_goarch/pe.d073/peVE.Stichera05/c1211/score/w/1:link.info	SDedes
media/en_redirects_goarch/pe.d073/peVE.Stichera05/c1211/score/w/1:link.path	/media/m/dedes/en/pe/d073/ve/w/stichera05.pdf
media/en_redirects_goarch/pe.d073/peVE.Stichera06/c1211/score/b/1:link.info	SDedes
media/en_redirects_goarch/pe.d073/peVE.Stichera06/c1211/score/b/1:link.path	/media/m/dedes/en/pe/d073/ve/b/stichera06.pdf
media/en_redirects_goarch/pe.d073/peVE.Stichera06/c1211/score/w/1:link.info	SDedes
media/en_redirects_goarch/pe.d073/peVE.Stichera06/c1211/score/w/1:link.path	/media/m/dedes/en/pe/d073/ve/w/stichera06.pdf
