media/en_redirects_goarch/me.m07.dHF/meMA.ExapTheotokion/c1211/score/w/1:link.info	SDedes
media/en_redirects_goarch/me.m07.dHF/meMA.ExapTheotokion/c1211/score/w/1:link.path	/media/m/dedes/en/me/m07/dHF/ma/w/exaptheotokion.pdf
media/en_redirects_goarch/me.m07.dHF/meMA.Exaposteilarion1/c1211/score/w/1:link.info	SDedes
media/en_redirects_goarch/me.m07.dHF/meMA.Exaposteilarion1/c1211/score/w/1:link.path	/media/m/dedes/en/me/m07/dHF/ma/w/exaposteilarion1.pdf
media/en_redirects_goarch/me.m07.dHF/meMA.Lauds1/c1211/score/w/1:link.info	SDedes
media/en_redirects_goarch/me.m07.dHF/meMA.Lauds1/c1211/score/w/1:link.path	/media/m/dedes/en/me/m07/dHF/ma/w/lauds11as56.pdf
media/en_redirects_goarch/me.m07.dHF/meMA.Lauds2/c1211/score/w/1:link.info	SDedes
media/en_redirects_goarch/me.m07.dHF/meMA.Lauds2/c1211/score/w/1:link.path	/media/m/dedes/en/me/m07/dHF/ma/w/lauds2as7.pdf
media/en_redirects_goarch/me.m07.dHF/meMA.Lauds3/c1211/score/w/1:link.info	SDedes
media/en_redirects_goarch/me.m07.dHF/meMA.Lauds3/c1211/score/w/1:link.path	/media/m/dedes/en/me/m07/dHF/ma/w/lauds3as8.pdf
media/en_redirects_goarch/me.m07.dHF/meMA.LaudsGlory/c1211/score/w/1:link.info	SDedes
media/en_redirects_goarch/me.m07.dHF/meMA.LaudsGlory/c1211/score/w/1:link.path	/media/m/dedes/en/me/m07/dHF/ma/w/laudsglory.pdf
media/en_redirects_goarch/me.m07.dHF/meMA.LaudsGlory/c1212/score/b/1:link.info	SDedes
media/en_redirects_goarch/me.m07.dHF/meMA.LaudsGlory/c1212/score/b/1:link.path	/media/m/dedes/en/me/m07/dHF/ma/b/laudsglory.pdf
media/en_redirects_goarch/me.m07.dHF/meMA.MM.Lauds123as345/c1211/score/w/1:link.info	SDedes
media/en_redirects_goarch/me.m07.dHF/meMA.MM.Lauds123as345/c1211/score/w/1:link.path	/media/m/dedes/en/me/m07/dHF/ma/w/lauds123as345.pdf
media/en_redirects_goarch/me.m07.dHF/meVE.Apolytikion1/c1211/audio/1:link.info	MBDanckaert
media/en_redirects_goarch/me.m07.dHF/meVE.Apolytikion1/c1211/audio/1:link.path	/media/a/en_public/me/m07/dHF/ve/apolytikion1.mp3
media/en_redirects_goarch/me.m07.dHF/meVE.Apolytikion1/c1211/audio/2:link.info	SDedes
media/en_redirects_goarch/me.m07.dHF/meVE.Apolytikion1/c1211/audio/2:link.path	/media/a/en_public/me/m07/dHF/ve/apolytikion1_a2.mp3
media/en_redirects_goarch/me.m07.dHF/meVE.Apolytikion1/c1211/score/w/1:link.info	SDedes
media/en_redirects_goarch/me.m07.dHF/meVE.Apolytikion1/c1211/score/w/1:link.path	/media/m/dedes/en/me/m07/dHF/ve/w/apolytikion1.pdf
media/en_redirects_goarch/me.m07.dHF/meVE.Apolytikion1/c2001/score/w/1:link.info	NewByz
media/en_redirects_goarch/me.m07.dHF/meVE.Apolytikion1/c2001/score/w/1:link.path	/media/m/newbyz/en/me/m07/dHF/ve/w/apolytikion1.pdf
media/en_redirects_goarch/me.m07.dHF/meVE.AposBoth/c1211/score/b/1:link.info	SDedes
media/en_redirects_goarch/me.m07.dHF/meVE.AposBoth/c1211/score/b/1:link.path	/media/m/dedes/en/oc/m3/d1/ve/b/apostheotokion.pdf
media/en_redirects_goarch/me.m07.dHF/meVE.AposBoth/c1211/score/w/1:link.info	SDedes
media/en_redirects_goarch/me.m07.dHF/meVE.AposBoth/c1211/score/w/1:link.path	/media/m/dedes/en/oc/m3/d1/ve/w/apostheotokion.pdf
media/en_redirects_goarch/me.m07.dHF/meVE.AposGlory/c1211/score/b/1:link.info	SDedes
media/en_redirects_goarch/me.m07.dHF/meVE.AposGlory/c1211/score/b/1:link.path	/media/m/dedes/en/me/m07/dHF/ve/b/aposglory.pdf
media/en_redirects_goarch/me.m07.dHF/meVE.AposGlory/c1211/score/w/1:link.info	SDedes
media/en_redirects_goarch/me.m07.dHF/meVE.AposGlory/c1211/score/w/1:link.path	/media/m/dedes/en/me/m07/dHF/ve/w/aposglory.pdf
media/en_redirects_goarch/me.m07.dHF/meVE.SticGlory/c1211/score/b/1:link.info	SDedes
media/en_redirects_goarch/me.m07.dHF/meVE.SticGlory/c1211/score/b/1:link.path	/media/m/dedes/en/me/m07/dHF/ve/b/sticglory.pdf
media/en_redirects_goarch/me.m07.dHF/meVE.SticGlory/c1211/score/w/1:link.info	SDedes
media/en_redirects_goarch/me.m07.dHF/meVE.SticGlory/c1211/score/w/1:link.path	/media/m/dedes/en/me/m07/dHF/ve/w/sticglory.pdf
