media/en_redirects_goarch/me.m09.d17/meVE.SticGlory/c1211/score/b/1:link.info	SDedes
media/en_redirects_goarch/me.m09.d17/meVE.SticGlory/c1211/score/b/1:link.path	/media/m/dedes/en/me/m09/d15/ve/b/sticboth.pdf
media/en_redirects_goarch/me.m09.d17/meVE.SticGlory/c1211/score/w/1:link.info	SDedes
media/en_redirects_goarch/me.m09.d17/meVE.SticGlory/c1211/score/w/1:link.path	/media/m/dedes/en/me/m09/d15/ve/w/sticboth.pdf
