media/en_redirects_goarch/me.m01.d13/meMA.AposBoth/c1211/score/b/1:link.info	SDedes
media/en_redirects_goarch/me.m01.d13/meMA.AposBoth/c1211/score/b/1:link.path	/media/m/dedes/en/me/m01/d06/ve/b/lityboth.pdf
media/en_redirects_goarch/me.m01.d13/meMA.AposBoth/c1211/score/w/1:link.info	SDedes
media/en_redirects_goarch/me.m01.d13/meMA.AposBoth/c1211/score/w/1:link.path	/media/m/dedes/en/me/m01/d06/ve/w/lityboth.pdf
media/en_redirects_goarch/me.m01.d13/meVE.AposBoth/c1211/score/b/1:link.info	SDedes
media/en_redirects_goarch/me.m01.d13/meVE.AposBoth/c1211/score/b/1:link.path	/media/m/dedes/en/me/m01/d11/ve/b/aposboth.pdf
media/en_redirects_goarch/me.m01.d13/meVE.AposBoth/c1211/score/w/1:link.info	SDedes
media/en_redirects_goarch/me.m01.d13/meVE.AposBoth/c1211/score/w/1:link.path	/media/m/dedes/en/me/m01/d11/ve/w/aposboth.pdf
media/en_redirects_goarch/me.m01.d13/meVE.SticBoth/c1211/score/b/1:link.info	SDedes
media/en_redirects_goarch/me.m01.d13/meVE.SticBoth/c1211/score/b/1:link.path	/media/m/dedes/en/me/m01/d06/ve/b/lityboth.pdf
media/en_redirects_goarch/me.m01.d13/meVE.SticBoth/c1211/score/w/1:link.info	SDedes
media/en_redirects_goarch/me.m01.d13/meVE.SticBoth/c1211/score/w/1:link.path	/media/m/dedes/en/me/m01/d06/ve/w/lityboth.pdf
