media/en_redirects_goarch/pe.d123/peMA.AposGlory/c1211/score/b/1:link.info	SDedes
media/en_redirects_goarch/pe.d123/peMA.AposGlory/c1211/score/b/1:link.path	/media/m/dedes/en/pe/d123/ma/b/maposglory.pdf
media/en_redirects_goarch/pe.d123/peMA.AposGlory/c1211/score/w/1:link.info	SDedes
media/en_redirects_goarch/pe.d123/peMA.AposGlory/c1211/score/w/1:link.path	/media/m/dedes/en/pe/d123/ma/w/maposglory.pdf
media/en_redirects_goarch/pe.d123/peVE.AposGlory/c1211/score/b/1:link.info	SDedes
media/en_redirects_goarch/pe.d123/peVE.AposGlory/c1211/score/b/1:link.path	/media/m/dedes/en/pe/d123/ve/b/aposglory.pdf
media/en_redirects_goarch/pe.d123/peVE.AposGlory/c1211/score/w/1:link.info	SDedes
media/en_redirects_goarch/pe.d123/peVE.AposGlory/c1211/score/w/1:link.path	/media/m/dedes/en/pe/d123/ve/w/aposglory.pdf
media/en_redirects_goarch/pe.d123/peVE.SticGlory/c1211/score/b/1:link.info	SDedes
media/en_redirects_goarch/pe.d123/peVE.SticGlory/c1211/score/b/1:link.path	/media/m/dedes/en/pe/d123/ve/b/sticglory.pdf
media/en_redirects_goarch/pe.d123/peVE.SticGlory/c1211/score/w/1:link.info	SDedes
media/en_redirects_goarch/pe.d123/peVE.SticGlory/c1211/score/w/1:link.path	/media/m/dedes/en/pe/d123/ve/w/sticglory.pdf
