media/en_redirects_goarch/oc.m3.d1/ocGE.MM.BothHeirmologic/c1211/score/w/1:link.info	SDedes
media/en_redirects_goarch/oc.m3.d1/ocGE.MM.BothHeirmologic/c1211/score/w/1:link.path	/media/m/dedes/en/oc/m3/d1/ve/w/glorybothheirmologic.pdf
media/en_redirects_goarch/oc.m3.d1/ocGE.MM.BothSticheraric/c1211/score/w/1:link.info	SDedes
media/en_redirects_goarch/oc.m3.d1/ocGE.MM.BothSticheraric/c1211/score/w/1:link.path	/media/m/dedes/en/oc/m3/d1/ve/w/glorybothsticheraric.pdf
media/en_redirects_goarch/oc.m3.d1/ocGE.MM.GloryHeirmologic/c1211/score/w/1:link.info	SDedes
media/en_redirects_goarch/oc.m3.d1/ocGE.MM.GloryHeirmologic/c1211/score/w/1:link.path	/media/m/dedes/en/oc/m3/d1/ve/w/glorybothheirmologic.pdf
media/en_redirects_goarch/oc.m3.d1/ocGE.MM.GlorySticheraric/c1211/score/w/1:link.info	SDedes
media/en_redirects_goarch/oc.m3.d1/ocGE.MM.GlorySticheraric/c1211/score/w/1:link.path	/media/m/dedes/en/oc/m3/d1/ve/w/glorybothsticheraric.pdf
media/en_redirects_goarch/oc.m3.d1/ocLI.MM.Beatitudes123456TrTas5678910GB/c1211/audio/1:link.info	SDedes | KMarinakos
media/en_redirects_goarch/oc.m3.d1/ocLI.MM.Beatitudes123456TrTas5678910GB/c1211/audio/1:link.path	/media/a/en_public/oc/m3/d1/li/beatitudes.mp3
media/en_redirects_goarch/oc.m3.d1/ocLI.MM.Beatitudes123456TrTas5678910GB/c1211/score/w/1:link.info	SDedes
media/en_redirects_goarch/oc.m3.d1/ocLI.MM.Beatitudes123456TrTas5678910GB/c1211/score/w/1:link.path	/media/m/dedes/en/oc/m3/d1/li/w/beatitudes123456TrTas5678910GB.pdf
media/en_redirects_goarch/oc.m3.d1/ocLI.MM.Beatitudes123Tas1234/c1211/audio/1:link.info	SDedes | KMarinakos
media/en_redirects_goarch/oc.m3.d1/ocLI.MM.Beatitudes123Tas1234/c1211/audio/1:link.path	/media/a/en_public/oc/m3/d1/li/beatitudes.mp3
media/en_redirects_goarch/oc.m3.d1/ocLI.MM.Beatitudes123Tas1234/c1211/score/w/1:link.info	SDedes
media/en_redirects_goarch/oc.m3.d1/ocLI.MM.Beatitudes123Tas1234/c1211/score/w/1:link.path	/media/m/dedes/en/oc/m3/d1/li/w/beatitudes123Tas1234.pdf
media/en_redirects_goarch/oc.m3.d1/ocLI.MM.Beatitudes123Tas5678/c1211/audio/1:link.info	SDedes | KMarinakos
media/en_redirects_goarch/oc.m3.d1/ocLI.MM.Beatitudes123Tas5678/c1211/audio/1:link.path	/media/a/en_public/oc/m3/d1/li/beatitudes.mp3
media/en_redirects_goarch/oc.m3.d1/ocLI.MM.Beatitudes123Tas5678/c1211/score/w/1:link.info	SDedes
media/en_redirects_goarch/oc.m3.d1/ocLI.MM.Beatitudes123Tas5678/c1211/score/w/1:link.path	/media/m/dedes/en/oc/m3/d1/li/w/beatitudes123Tas5678.pdf
media/en_redirects_goarch/oc.m3.d1/ocMA.Antiphon11/c1211/audio/1:link.info	SDedes
media/en_redirects_goarch/oc.m3.d1/ocMA.Antiphon11/c1211/audio/1:link.path	/media/a/dedes/oc/m3/d1/ma/antiphon1.mp3
media/en_redirects_goarch/oc.m3.d1/ocMA.Antiphon11/c1211/score/b/1:link.info	SDedes
media/en_redirects_goarch/oc.m3.d1/ocMA.Antiphon11/c1211/score/b/1:link.path	/media/m/dedes/en/oc/m3/d1/ma/b/antiphon11.pdf
media/en_redirects_goarch/oc.m3.d1/ocMA.Antiphon11/c1211/score/w/1:link.info	SDedes
media/en_redirects_goarch/oc.m3.d1/ocMA.Antiphon11/c1211/score/w/1:link.path	/media/m/dedes/en/oc/m3/d1/ma/w/antiphon11.pdf
media/en_redirects_goarch/oc.m3.d1/ocMA.Antiphon21/c1211/audio/1:link.info	SDedes
media/en_redirects_goarch/oc.m3.d1/ocMA.Antiphon21/c1211/audio/1:link.path	/media/a/dedes/oc/m3/d1/ma/antiphon2.mp3
media/en_redirects_goarch/oc.m3.d1/ocMA.Antiphon21/c1211/score/b/1:link.info	SDedes
media/en_redirects_goarch/oc.m3.d1/ocMA.Antiphon21/c1211/score/b/1:link.path	/media/m/dedes/en/oc/m3/d1/ma/b/antiphon21.pdf
media/en_redirects_goarch/oc.m3.d1/ocMA.Antiphon21/c1211/score/w/1:link.info	SDedes
media/en_redirects_goarch/oc.m3.d1/ocMA.Antiphon21/c1211/score/w/1:link.path	/media/m/dedes/en/oc/m3/d1/ma/w/antiphon21.pdf
media/en_redirects_goarch/oc.m3.d1/ocMA.Antiphon31/c1211/audio/1:link.info	SDedes
media/en_redirects_goarch/oc.m3.d1/ocMA.Antiphon31/c1211/audio/1:link.path	/media/a/dedes/oc/m3/d1/ma/antiphon3.mp3
media/en_redirects_goarch/oc.m3.d1/ocMA.Antiphon31/c1211/score/b/1:link.info	SDedes
media/en_redirects_goarch/oc.m3.d1/ocMA.Antiphon31/c1211/score/b/1:link.path	/media/m/dedes/en/oc/m3/d1/ma/b/antiphon31.pdf
media/en_redirects_goarch/oc.m3.d1/ocMA.Antiphon31/c1211/score/w/1:link.info	SDedes
media/en_redirects_goarch/oc.m3.d1/ocMA.Antiphon31/c1211/score/w/1:link.path	/media/m/dedes/en/oc/m3/d1/ma/w/antiphon31.pdf
media/en_redirects_goarch/oc.m3.d1/ocMA.Kathisma11/c1211/audio/1:link.info	SDedes
media/en_redirects_goarch/oc.m3.d1/ocMA.Kathisma11/c1211/audio/1:link.path	/media/a/dedes/oc/m3/d1/ma/kathisma11.mp3
media/en_redirects_goarch/oc.m3.d1/ocMA.Kathisma11/c1211/score/b/1:link.info	SDedes
media/en_redirects_goarch/oc.m3.d1/ocMA.Kathisma11/c1211/score/b/1:link.path	/media/m/dedes/en/oc/m3/d1/ma/b/kathisma11.pdf
media/en_redirects_goarch/oc.m3.d1/ocMA.Kathisma11/c1211/score/w/1:link.info	SDedes
media/en_redirects_goarch/oc.m3.d1/ocMA.Kathisma11/c1211/score/w/1:link.path	/media/m/dedes/en/oc/m3/d1/ma/w/kathisma11.pdf
media/en_redirects_goarch/oc.m3.d1/ocMA.Kathisma12/c1211/audio/1:link.info	SDedes
media/en_redirects_goarch/oc.m3.d1/ocMA.Kathisma12/c1211/audio/1:link.path	/media/a/dedes/oc/m3/d1/ma/kathisma12.mp3
media/en_redirects_goarch/oc.m3.d1/ocMA.Kathisma12/c1211/score/b/1:link.info	SDedes
media/en_redirects_goarch/oc.m3.d1/ocMA.Kathisma12/c1211/score/b/1:link.path	/media/m/dedes/en/oc/m3/d1/ma/b/kathisma12.pdf
media/en_redirects_goarch/oc.m3.d1/ocMA.Kathisma12/c1211/score/w/1:link.info	SDedes
media/en_redirects_goarch/oc.m3.d1/ocMA.Kathisma12/c1211/score/w/1:link.path	/media/m/dedes/en/oc/m3/d1/ma/w/kathisma12.pdf
media/en_redirects_goarch/oc.m3.d1/ocMA.Kathisma13/c1211/audio/1:link.info	SDedes
media/en_redirects_goarch/oc.m3.d1/ocMA.Kathisma13/c1211/audio/1:link.path	/media/a/dedes/oc/m3/d1/ma/kathisma13.mp3
media/en_redirects_goarch/oc.m3.d1/ocMA.Kathisma13/c1211/score/b/1:link.info	SDedes
media/en_redirects_goarch/oc.m3.d1/ocMA.Kathisma13/c1211/score/b/1:link.path	/media/m/dedes/en/oc/m3/d1/ma/b/kathisma13.pdf
media/en_redirects_goarch/oc.m3.d1/ocMA.Kathisma13/c1211/score/w/1:link.info	SDedes
media/en_redirects_goarch/oc.m3.d1/ocMA.Kathisma13/c1211/score/w/1:link.path	/media/m/dedes/en/oc/m3/d1/ma/w/kathisma13.pdf
media/en_redirects_goarch/oc.m3.d1/ocMA.Kathisma21/c1211/audio/1:link.info	SDedes
media/en_redirects_goarch/oc.m3.d1/ocMA.Kathisma21/c1211/audio/1:link.path	/media/a/dedes/oc/m3/d1/ma/kathisma21.mp3
media/en_redirects_goarch/oc.m3.d1/ocMA.Kathisma21/c1211/score/b/1:link.info	SDedes
media/en_redirects_goarch/oc.m3.d1/ocMA.Kathisma21/c1211/score/b/1:link.path	/media/m/dedes/en/oc/m3/d1/ma/b/kathisma21.pdf
media/en_redirects_goarch/oc.m3.d1/ocMA.Kathisma21/c1211/score/w/1:link.info	SDedes
media/en_redirects_goarch/oc.m3.d1/ocMA.Kathisma21/c1211/score/w/1:link.path	/media/m/dedes/en/oc/m3/d1/ma/w/kathisma21.pdf
media/en_redirects_goarch/oc.m3.d1/ocMA.Kathisma22/c1211/audio/1:link.info	SDedes
media/en_redirects_goarch/oc.m3.d1/ocMA.Kathisma22/c1211/audio/1:link.path	/media/a/dedes/oc/m3/d1/ma/kathisma22.mp3
media/en_redirects_goarch/oc.m3.d1/ocMA.Kathisma22/c1211/score/b/1:link.info	SDedes
media/en_redirects_goarch/oc.m3.d1/ocMA.Kathisma22/c1211/score/b/1:link.path	/media/m/dedes/en/oc/m3/d1/ma/b/kathisma22.pdf
media/en_redirects_goarch/oc.m3.d1/ocMA.Kathisma22/c1211/score/w/1:link.info	SDedes
media/en_redirects_goarch/oc.m3.d1/ocMA.Kathisma22/c1211/score/w/1:link.path	/media/m/dedes/en/oc/m3/d1/ma/w/kathisma22.pdf
media/en_redirects_goarch/oc.m3.d1/ocMA.Kathisma23/c1211/audio/1:link.info	SDedes
media/en_redirects_goarch/oc.m3.d1/ocMA.Kathisma23/c1211/audio/1:link.path	/media/a/dedes/oc/m3/d1/ma/kathisma23.mp3
media/en_redirects_goarch/oc.m3.d1/ocMA.Kathisma23/c1211/score/b/1:link.info	SDedes
media/en_redirects_goarch/oc.m3.d1/ocMA.Kathisma23/c1211/score/b/1:link.path	/media/m/dedes/en/oc/m3/d1/ma/b/kathisma23.pdf
media/en_redirects_goarch/oc.m3.d1/ocMA.Kathisma23/c1211/score/w/1:link.info	SDedes
media/en_redirects_goarch/oc.m3.d1/ocMA.Kathisma23/c1211/score/w/1:link.path	/media/m/dedes/en/oc/m3/d1/ma/w/kathisma23.pdf
media/en_redirects_goarch/oc.m3.d1/ocMA.Lauds1/c1211/audio/1:link.info	SDedes
media/en_redirects_goarch/oc.m3.d1/ocMA.Lauds1/c1211/audio/1:link.path	/media/a/dedes/oc/m3/d1/ma/lauds1.mp3
media/en_redirects_goarch/oc.m3.d1/ocMA.Lauds1/c1211/score/b/1:link.info	SDedes
media/en_redirects_goarch/oc.m3.d1/ocMA.Lauds1/c1211/score/b/1:link.path	/media/m/dedes/en/oc/m3/d1/ma/b/lauds1.pdf
media/en_redirects_goarch/oc.m3.d1/ocMA.Lauds1/c1211/score/w/1:link.info	SDedes
media/en_redirects_goarch/oc.m3.d1/ocMA.Lauds1/c1211/score/w/1:link.path	/media/m/dedes/en/oc/m3/d1/ma/w/lauds1.pdf
media/en_redirects_goarch/oc.m3.d1/ocMA.Lauds2/c1211/audio/1:link.info	SDedes
media/en_redirects_goarch/oc.m3.d1/ocMA.Lauds2/c1211/audio/1:link.path	/media/a/dedes/oc/m3/d1/ma/lauds2.mp3
media/en_redirects_goarch/oc.m3.d1/ocMA.Lauds2/c1211/score/b/1:link.info	SDedes
media/en_redirects_goarch/oc.m3.d1/ocMA.Lauds2/c1211/score/b/1:link.path	/media/m/dedes/en/oc/m3/d1/ma/b/lauds2.pdf
media/en_redirects_goarch/oc.m3.d1/ocMA.Lauds2/c1211/score/w/1:link.info	SDedes
media/en_redirects_goarch/oc.m3.d1/ocMA.Lauds2/c1211/score/w/1:link.path	/media/m/dedes/en/oc/m3/d1/ma/w/lauds2.pdf
media/en_redirects_goarch/oc.m3.d1/ocMA.Lauds3/c1211/audio/1:link.info	SDedes
media/en_redirects_goarch/oc.m3.d1/ocMA.Lauds3/c1211/audio/1:link.path	/media/a/dedes/oc/m3/d1/ma/lauds3.mp3
media/en_redirects_goarch/oc.m3.d1/ocMA.Lauds3/c1211/score/b/1:link.info	SDedes
media/en_redirects_goarch/oc.m3.d1/ocMA.Lauds3/c1211/score/b/1:link.path	/media/m/dedes/en/oc/m3/d1/ma/b/lauds3.pdf
media/en_redirects_goarch/oc.m3.d1/ocMA.Lauds3/c1211/score/w/1:link.info	SDedes
media/en_redirects_goarch/oc.m3.d1/ocMA.Lauds3/c1211/score/w/1:link.path	/media/m/dedes/en/oc/m3/d1/ma/w/lauds3.pdf
media/en_redirects_goarch/oc.m3.d1/ocMA.Lauds4/c1211/audio/1:link.info	SDedes
media/en_redirects_goarch/oc.m3.d1/ocMA.Lauds4/c1211/audio/1:link.path	/media/a/dedes/oc/m3/d1/ma/lauds4.mp3
media/en_redirects_goarch/oc.m3.d1/ocMA.Lauds4/c1211/score/b/1:link.info	SDedes
media/en_redirects_goarch/oc.m3.d1/ocMA.Lauds4/c1211/score/b/1:link.path	/media/m/dedes/en/oc/m3/d1/ma/b/lauds4.pdf
media/en_redirects_goarch/oc.m3.d1/ocMA.Lauds4/c1211/score/w/1:link.info	SDedes
media/en_redirects_goarch/oc.m3.d1/ocMA.Lauds4/c1211/score/w/1:link.path	/media/m/dedes/en/oc/m3/d1/ma/w/lauds4.pdf
media/en_redirects_goarch/oc.m3.d1/ocMA.Lauds5/c1211/audio/1:link.info	SDedes
media/en_redirects_goarch/oc.m3.d1/ocMA.Lauds5/c1211/audio/1:link.path	/media/a/dedes/oc/m3/d1/ma/kathisma23.lauds5
media/en_redirects_goarch/oc.m3.d1/ocMA.Lauds5/c1211/score/b/1:link.info	SDedes
media/en_redirects_goarch/oc.m3.d1/ocMA.Lauds5/c1211/score/b/1:link.path	/media/m/dedes/en/oc/m3/d1/ma/b/lauds5.pdf
media/en_redirects_goarch/oc.m3.d1/ocMA.Lauds5/c1211/score/w/1:link.info	SDedes
media/en_redirects_goarch/oc.m3.d1/ocMA.Lauds5/c1211/score/w/1:link.path	/media/m/dedes/en/oc/m3/d1/ma/w/lauds5.pdf
media/en_redirects_goarch/oc.m3.d1/ocMA.Lauds6/c1211/audio/1:link.info	SDedes
media/en_redirects_goarch/oc.m3.d1/ocMA.Lauds6/c1211/audio/1:link.path	/media/a/dedes/oc/m3/d1/ma/lauds6.mp3
media/en_redirects_goarch/oc.m3.d1/ocMA.Lauds6/c1211/score/b/1:link.info	SDedes
media/en_redirects_goarch/oc.m3.d1/ocMA.Lauds6/c1211/score/b/1:link.path	/media/m/dedes/en/oc/m3/d1/ma/b/lauds6.pdf
media/en_redirects_goarch/oc.m3.d1/ocMA.Lauds6/c1211/score/w/1:link.info	SDedes
media/en_redirects_goarch/oc.m3.d1/ocMA.Lauds6/c1211/score/w/1:link.path	/media/m/dedes/en/oc/m3/d1/ma/w/lauds6.pdf
media/en_redirects_goarch/oc.m3.d1/ocMA.Lauds7/c1211/audio/1:link.info	SDedes
media/en_redirects_goarch/oc.m3.d1/ocMA.Lauds7/c1211/audio/1:link.path	/media/a/dedes/oc/m3/d1/ma/lauds7.mp3
media/en_redirects_goarch/oc.m3.d1/ocMA.Lauds7/c1211/score/b/1:link.info	SDedes
media/en_redirects_goarch/oc.m3.d1/ocMA.Lauds7/c1211/score/b/1:link.path	/media/m/dedes/en/oc/m3/d1/ma/b/lauds7.pdf
media/en_redirects_goarch/oc.m3.d1/ocMA.Lauds7/c1211/score/w/1:link.info	SDedes
media/en_redirects_goarch/oc.m3.d1/ocMA.Lauds7/c1211/score/w/1:link.path	/media/m/dedes/en/oc/m3/d1/ma/w/lauds7.pdf
media/en_redirects_goarch/oc.m3.d1/ocMA.Lauds8/c1211/audio/1:link.info	SDedes
media/en_redirects_goarch/oc.m3.d1/ocMA.Lauds8/c1211/audio/1:link.path	/media/a/dedes/oc/m3/d1/ma/lauds8.mp3
media/en_redirects_goarch/oc.m3.d1/ocMA.Lauds8/c1211/score/b/1:link.info	SDedes
media/en_redirects_goarch/oc.m3.d1/ocMA.Lauds8/c1211/score/b/1:link.path	/media/m/dedes/en/oc/m3/d1/ma/b/lauds8.pdf
media/en_redirects_goarch/oc.m3.d1/ocMA.Lauds8/c1211/score/w/1:link.info	SDedes
media/en_redirects_goarch/oc.m3.d1/ocMA.Lauds8/c1211/score/w/1:link.path	/media/m/dedes/en/oc/m3/d1/ma/w/lauds8.pdf
media/en_redirects_goarch/oc.m3.d1/ocMA.MM.AntiphonsProkeimenon/c1211/score/b/1:link.info	SDedes
media/en_redirects_goarch/oc.m3.d1/ocMA.MM.AntiphonsProkeimenon/c1211/score/b/1:link.path	/media/m/dedes/en/oc/m3/d1/ma/b/antiphonsprokeimenon.pdf
media/en_redirects_goarch/oc.m3.d1/ocMA.MM.AntiphonsProkeimenon/c1211/score/w/1:link.info	SDedes
media/en_redirects_goarch/oc.m3.d1/ocMA.MM.AntiphonsProkeimenon/c1211/score/w/1:link.path	/media/m/dedes/en/oc/m3/d1/ma/w/antiphonsprokeimenon.pdf
media/en_redirects_goarch/oc.m3.d1/ocMA.MM.GodIsTheLord/c1111/audio/1:link.info	SDedes
media/en_redirects_goarch/oc.m3.d1/ocMA.MM.GodIsTheLord/c1111/audio/1:link.path	/media/a/dedes/oc/m3/d1/ma/godisthelord.mp3
media/en_redirects_goarch/oc.m3.d1/ocMA.MM.GodIsTheLord/c1111/score/b/1:link.info	SDedes
media/en_redirects_goarch/oc.m3.d1/ocMA.MM.GodIsTheLord/c1111/score/b/1:link.path	/media/m/dedes/en/oc/m3/d1/ma/b/godisthelord.pdf
media/en_redirects_goarch/oc.m3.d1/ocMA.MM.GodIsTheLord/c1111/score/w/1:link.info	SDedes
media/en_redirects_goarch/oc.m3.d1/ocMA.MM.GodIsTheLord/c1111/score/w/1:link.path	/media/m/dedes/en/oc/m3/d1/ma/w/godisthelord.pdf
media/en_redirects_goarch/oc.m3.d1/ocMA.MM.GodIsTheLord/c1112/score/b/1:link.info	GTheodoridis
media/en_redirects_goarch/oc.m3.d1/ocMA.MM.GodIsTheLord/c1112/score/b/1:link.path	/media/m/theodoridis/en/oc/m3/d1/ma/b/godisthelord.pdf
media/en_redirects_goarch/oc.m3.d1/ocMA.MM.Lauds01/c1111/score/b/1:link.info	SDedes
media/en_redirects_goarch/oc.m3.d1/ocMA.MM.Lauds01/c1111/score/b/1:link.path	/media/m/dedes/en/oc/m3/d1/ma/b/lauds01.pdf
media/en_redirects_goarch/oc.m3.d1/ocMA.MM.Lauds01/c1111/score/w/1:link.info	SDedes
media/en_redirects_goarch/oc.m3.d1/ocMA.MM.Lauds01/c1111/score/w/1:link.path	/media/m/dedes/en/oc/m3/d1/ma/w/lauds01.pdf
media/en_redirects_goarch/oc.m3.d1/ocMA.MM.Lauds01/c1211/audio/1:link.info	SDedes
media/en_redirects_goarch/oc.m3.d1/ocMA.MM.Lauds01/c1211/audio/1:link.path	/media/a/dedes/oc/m3/d1/ma/lauds01.mp3
media/en_redirects_goarch/oc.m3.d1/ocMA.MM.Lauds02/c1111/score/b/1:link.info	SDedes
media/en_redirects_goarch/oc.m3.d1/ocMA.MM.Lauds02/c1111/score/b/1:link.path	/media/m/dedes/en/oc/m3/d1/ma/b/lauds02.pdf
media/en_redirects_goarch/oc.m3.d1/ocMA.MM.Lauds02/c1111/score/w/1:link.info	SDedes
media/en_redirects_goarch/oc.m3.d1/ocMA.MM.Lauds02/c1111/score/w/1:link.path	/media/m/dedes/en/oc/m3/d1/ma/w/lauds02.pdf
media/en_redirects_goarch/oc.m3.d1/ocMA.MM.Lauds02/c1211/audio/1:link.info	SDedes
media/en_redirects_goarch/oc.m3.d1/ocMA.MM.Lauds02/c1211/audio/1:link.path	/media/a/dedes/oc/m3/d1/ma/lauds02.mp3
media/en_redirects_goarch/oc.m3.d1/ocMA.MM.Prokeimenon/c1111/audio/1:link.info	SDedes
media/en_redirects_goarch/oc.m3.d1/ocMA.MM.Prokeimenon/c1111/audio/1:link.path	/media/a/dedes/oc/m3/d1/ma/prokeimenon.mp3
media/en_redirects_goarch/oc.m3.d1/ocMA.MM.Prokeimenon/c1111/score/b/1:link.info	SDedes
media/en_redirects_goarch/oc.m3.d1/ocMA.MM.Prokeimenon/c1111/score/b/1:link.path	/media/m/dedes/en/oc/m3/d1/ma/b/prokeimenon.pdf
media/en_redirects_goarch/oc.m3.d1/ocMA.MM.Prokeimenon/c1111/score/w/1:link.info	SDedes
media/en_redirects_goarch/oc.m3.d1/ocMA.MM.Prokeimenon/c1111/score/w/1:link.path	/media/m/dedes/en/oc/m3/d1/ma/w/prokeimenon.pdf
media/en_redirects_goarch/oc.m3.d1/ocMA.Magnificat/c1211/audio/1:link.info	SDorrance
media/en_redirects_goarch/oc.m3.d1/ocMA.Magnificat/c1211/audio/1:link.path	/media/a/dorrance/oc/m3/d1/ma/magnificat.mp3
media/en_redirects_goarch/oc.m3.d1/ocMA.Magnificat/c1211/audio/2:link.info	J Damianos
media/en_redirects_goarch/oc.m3.d1/ocMA.Magnificat/c1211/audio/2:link.path	/media/a/en_public/oc/m3/d1/ma/magnificat_a2.mp3
media/en_redirects_goarch/oc.m3.d1/ocMA.Magnificat/c1211/score/b/1:link.info	SDedes
media/en_redirects_goarch/oc.m3.d1/ocMA.Magnificat/c1211/score/b/1:link.path	/media/m/dedes/en/oc/m3/d1/ma/b/magnificat.pdf
media/en_redirects_goarch/oc.m3.d1/ocMA.Magnificat/c1211/score/w/1:link.info	SDedes
media/en_redirects_goarch/oc.m3.d1/ocMA.Magnificat/c1211/score/w/1:link.path	/media/m/dedes/en/oc/m3/d1/ma/w/magnificat.pdf
media/en_redirects_goarch/oc.m3.d1/ocMA.Magnificat/c1212/score/b/1:link.info	GTheodoridis
media/en_redirects_goarch/oc.m3.d1/ocMA.Magnificat/c1212/score/b/1:link.path	/media/m/theodoridis/en/oc/m3/d1/ma/b/magnificat.pdf
media/en_redirects_goarch/oc.m3.d1/ocMA.OdeS1C1H/c1211/score/b/1:link.info	SDedes
media/en_redirects_goarch/oc.m3.d1/ocMA.OdeS1C1H/c1211/score/b/1:link.path	/media/m/dedes/en/oc/m3/d1/ma/b/canon1ode1.pdf
media/en_redirects_goarch/oc.m3.d1/ocMA.OdeS1C1H/c1211/score/w/1:link.info	SDedes
media/en_redirects_goarch/oc.m3.d1/ocMA.OdeS1C1H/c1211/score/w/1:link.path	/media/m/dedes/en/oc/m3/d1/ma/w/canon1ode1.pdf
media/en_redirects_goarch/oc.m3.d1/ocMA.OdeS3C1H/c1211/score/b/1:link.info	SDedes
media/en_redirects_goarch/oc.m3.d1/ocMA.OdeS3C1H/c1211/score/b/1:link.path	/media/m/dedes/en/oc/m3/d1/ma/b/canon1ode3.pdf
media/en_redirects_goarch/oc.m3.d1/ocMA.OdeS3C1H/c1211/score/w/1:link.info	SDedes
media/en_redirects_goarch/oc.m3.d1/ocMA.OdeS3C1H/c1211/score/w/1:link.path	/media/m/dedes/en/oc/m3/d1/ma/w/canon1ode3.pdf
media/en_redirects_goarch/oc.m3.d1/ocMA.OdeS4C1H/c1211/score/b/1:link.info	SDedes
media/en_redirects_goarch/oc.m3.d1/ocMA.OdeS4C1H/c1211/score/b/1:link.path	/media/m/dedes/en/oc/m3/d1/ma/b/canon1ode4.pdf
media/en_redirects_goarch/oc.m3.d1/ocMA.OdeS4C1H/c1211/score/w/1:link.info	SDedes
media/en_redirects_goarch/oc.m3.d1/ocMA.OdeS4C1H/c1211/score/w/1:link.path	/media/m/dedes/en/oc/m3/d1/ma/w/canon1ode4.pdf
media/en_redirects_goarch/oc.m3.d1/ocMA.OdeS5C1H/c1211/score/b/1:link.info	SDedes
media/en_redirects_goarch/oc.m3.d1/ocMA.OdeS5C1H/c1211/score/b/1:link.path	/media/m/dedes/en/oc/m3/d1/ma/b/canon1ode5.pdf
media/en_redirects_goarch/oc.m3.d1/ocMA.OdeS5C1H/c1211/score/w/1:link.info	SDedes
media/en_redirects_goarch/oc.m3.d1/ocMA.OdeS5C1H/c1211/score/w/1:link.path	/media/m/dedes/en/oc/m3/d1/ma/w/canon1ode5.pdf
media/en_redirects_goarch/oc.m3.d1/ocMA.OdeS6C1H/c1211/score/b/1:link.info	SDedes
media/en_redirects_goarch/oc.m3.d1/ocMA.OdeS6C1H/c1211/score/b/1:link.path	/media/m/dedes/en/oc/m3/d1/ma/b/canon1ode6.pdf
media/en_redirects_goarch/oc.m3.d1/ocMA.OdeS6C1H/c1211/score/w/1:link.info	SDedes
media/en_redirects_goarch/oc.m3.d1/ocMA.OdeS6C1H/c1211/score/w/1:link.path	/media/m/dedes/en/oc/m3/d1/ma/w/canon1ode6.pdf
media/en_redirects_goarch/oc.m3.d1/ocMA.OdeS7C1H/c1211/score/b/1:link.info	SDedes
media/en_redirects_goarch/oc.m3.d1/ocMA.OdeS7C1H/c1211/score/b/1:link.path	/media/m/dedes/en/oc/m3/d1/ma/b/canon1ode7.pdf
media/en_redirects_goarch/oc.m3.d1/ocMA.OdeS7C1H/c1211/score/w/1:link.info	SDedes
media/en_redirects_goarch/oc.m3.d1/ocMA.OdeS7C1H/c1211/score/w/1:link.path	/media/m/dedes/en/oc/m3/d1/ma/w/canon1ode7.pdf
media/en_redirects_goarch/oc.m3.d1/ocMA.OdeS8C1H/c1211/score/b/1:link.info	SDedes
media/en_redirects_goarch/oc.m3.d1/ocMA.OdeS8C1H/c1211/score/b/1:link.path	/media/m/dedes/en/oc/m3/d1/ma/b/canon1ode8.pdf
media/en_redirects_goarch/oc.m3.d1/ocMA.OdeS8C1H/c1211/score/w/1:link.info	SDedes
media/en_redirects_goarch/oc.m3.d1/ocMA.OdeS8C1H/c1211/score/w/1:link.path	/media/m/dedes/en/oc/m3/d1/ma/w/canon1ode8.pdf
media/en_redirects_goarch/oc.m3.d1/ocMA.OdeS9C1H/c1211/score/b/1:link.info	SDedes
media/en_redirects_goarch/oc.m3.d1/ocMA.OdeS9C1H/c1211/score/b/1:link.path	/media/m/dedes/en/oc/m3/d1/ma/b/canon1ode9.pdf
media/en_redirects_goarch/oc.m3.d1/ocMA.OdeS9C1H/c1211/score/w/1:link.info	SDedes
media/en_redirects_goarch/oc.m3.d1/ocMA.OdeS9C1H/c1211/score/w/1:link.path	/media/m/dedes/en/oc/m3/d1/ma/w/canon1ode9.pdf
media/en_redirects_goarch/oc.m3.d1/ocVE.ApolTheotokionVM/c1211/audio/1:link.info	SDedes
media/en_redirects_goarch/oc.m3.d1/ocVE.ApolTheotokionVM/c1211/audio/1:link.path	/media/a/dedes/oc/m3/d1/ve/apoltheotokionvm.mp3
media/en_redirects_goarch/oc.m3.d1/ocVE.ApolTheotokionVM/c1211/audio/2:link.info	SDedes/Eikona
media/en_redirects_goarch/oc.m3.d1/ocVE.ApolTheotokionVM/c1211/audio/2:link.path	/media/a/eikona/oc/m3/d1/ve/apoltheotokionvm.mp3
media/en_redirects_goarch/oc.m3.d1/ocVE.ApolTheotokionVM/c1211/score/b/1:link.info	SDedes
media/en_redirects_goarch/oc.m3.d1/ocVE.ApolTheotokionVM/c1211/score/b/1:link.path	/media/m/dedes/en/oc/m3/d1/ve/b/apoltheotokionvm.pdf
media/en_redirects_goarch/oc.m3.d1/ocVE.ApolTheotokionVM/c1211/score/w/1:link.info	SDedes
media/en_redirects_goarch/oc.m3.d1/ocVE.ApolTheotokionVM/c1211/score/w/1:link.path	/media/m/dedes/en/oc/m3/d1/ve/w/apoltheotokionvm.pdf
media/en_redirects_goarch/oc.m3.d1/ocVE.Apolytikion/c1211/audio/1:link.info	SDedes
media/en_redirects_goarch/oc.m3.d1/ocVE.Apolytikion/c1211/audio/1:link.path	/media/a/dedes/oc/m3/d1/ve/apolytikion.mp3
media/en_redirects_goarch/oc.m3.d1/ocVE.Apolytikion/c1211/audio/2:link.info	SDedes/Eikona
media/en_redirects_goarch/oc.m3.d1/ocVE.Apolytikion/c1211/audio/2:link.path	/media/a/eikona/oc/m3/d1/ve/apolytikion.mp3
media/en_redirects_goarch/oc.m3.d1/ocVE.Apolytikion/c1211/score/b/1:link.info	SDedes
media/en_redirects_goarch/oc.m3.d1/ocVE.Apolytikion/c1211/score/b/1:link.path	/media/m/dedes/en/oc/m3/d1/ve/b/apolytikion.pdf
media/en_redirects_goarch/oc.m3.d1/ocVE.Apolytikion/c1211/score/w/1:link.info	SDedes
media/en_redirects_goarch/oc.m3.d1/ocVE.Apolytikion/c1211/score/w/1:link.path	/media/m/dedes/en/oc/m3/d1/ve/w/apolytikion.pdf
media/en_redirects_goarch/oc.m3.d1/ocVE.Apolytikion/c2261/score/b/1:link.info	Thyateira
media/en_redirects_goarch/oc.m3.d1/ocVE.Apolytikion/c2261/score/b/1:link.path	/media/m/thyateira/en/oc/m3/d1/ve/b/apolytikion.pdf
media/en_redirects_goarch/oc.m3.d1/ocVE.Apolytikion/c2261/score/w/1:link.info	Thyateira
media/en_redirects_goarch/oc.m3.d1/ocVE.Apolytikion/c2261/score/w/1:link.path	/media/m/thyateira/en/oc/m3/d1/ve/w/apolytikion.pdf
media/en_redirects_goarch/oc.m3.d1/ocVE.AposTheotokion/c1211/audio/1:link.info	SDedes/Eikona
media/en_redirects_goarch/oc.m3.d1/ocVE.AposTheotokion/c1211/audio/1:link.path	/media/a/eikona/oc/m3/d1/ve/apostheotokion.mp3
media/en_redirects_goarch/oc.m3.d1/ocVE.AposTheotokion/c1211/score/b/1:link.info	SDedes
media/en_redirects_goarch/oc.m3.d1/ocVE.AposTheotokion/c1211/score/b/1:link.path	/media/m/dedes/en/oc/m3/d1/ve/b/apostheotokion.pdf
media/en_redirects_goarch/oc.m3.d1/ocVE.AposTheotokion/c1211/score/w/1:link.info	SDedes
media/en_redirects_goarch/oc.m3.d1/ocVE.AposTheotokion/c1211/score/w/1:link.path	/media/m/dedes/en/oc/m3/d1/ve/w/apostheotokion.pdf
media/en_redirects_goarch/oc.m3.d1/ocVE.Aposticha1/c1211/audio/1:link.info	SDedes/Eikona
media/en_redirects_goarch/oc.m3.d1/ocVE.Aposticha1/c1211/audio/1:link.path	/media/a/eikona/oc/m3/d1/ve/aposticha1.mp3
media/en_redirects_goarch/oc.m3.d1/ocVE.Aposticha1/c1211/score/b/1:link.info	SDedes
media/en_redirects_goarch/oc.m3.d1/ocVE.Aposticha1/c1211/score/b/1:link.path	/media/m/dedes/en/oc/m3/d1/ve/b/aposticha1.pdf
media/en_redirects_goarch/oc.m3.d1/ocVE.Aposticha1/c1211/score/w/1:link.info	SDedes
media/en_redirects_goarch/oc.m3.d1/ocVE.Aposticha1/c1211/score/w/1:link.path	/media/m/dedes/en/oc/m3/d1/ve/w/aposticha1.pdf
media/en_redirects_goarch/oc.m3.d1/ocVE.Aposticha2/c1211/audio/1:link.info	SDedes/Eikona
media/en_redirects_goarch/oc.m3.d1/ocVE.Aposticha2/c1211/audio/1:link.path	/media/a/eikona/oc/m3/d1/ve/aposticha2.mp3
media/en_redirects_goarch/oc.m3.d1/ocVE.Aposticha2/c1211/score/b/1:link.info	SDedes
media/en_redirects_goarch/oc.m3.d1/ocVE.Aposticha2/c1211/score/b/1:link.path	/media/m/dedes/en/oc/m3/d1/ve/b/aposticha2.pdf
media/en_redirects_goarch/oc.m3.d1/ocVE.Aposticha2/c1211/score/w/1:link.info	SDedes
media/en_redirects_goarch/oc.m3.d1/ocVE.Aposticha2/c1211/score/w/1:link.path	/media/m/dedes/en/oc/m3/d1/ve/w/aposticha2.pdf
media/en_redirects_goarch/oc.m3.d1/ocVE.Aposticha3/c1211/audio/1:link.info	SDedes/Eikona
media/en_redirects_goarch/oc.m3.d1/ocVE.Aposticha3/c1211/audio/1:link.path	/media/a/eikona/oc/m3/d1/ve/aposticha3.mp3
media/en_redirects_goarch/oc.m3.d1/ocVE.Aposticha3/c1211/score/b/1:link.info	SDedes
media/en_redirects_goarch/oc.m3.d1/ocVE.Aposticha3/c1211/score/b/1:link.path	/media/m/dedes/en/oc/m3/d1/ve/b/aposticha3.pdf
media/en_redirects_goarch/oc.m3.d1/ocVE.Aposticha3/c1211/score/w/1:link.info	SDedes
media/en_redirects_goarch/oc.m3.d1/ocVE.Aposticha3/c1211/score/w/1:link.path	/media/m/dedes/en/oc/m3/d1/ve/w/aposticha3.pdf
media/en_redirects_goarch/oc.m3.d1/ocVE.Aposticha4/c1211/audio/1:link.info	SDedes/Eikona
media/en_redirects_goarch/oc.m3.d1/ocVE.Aposticha4/c1211/audio/1:link.path	/media/a/eikona/oc/m3/d1/ve/aposticha4.mp3
media/en_redirects_goarch/oc.m3.d1/ocVE.Aposticha4/c1211/score/b/1:link.info	SDedes
media/en_redirects_goarch/oc.m3.d1/ocVE.Aposticha4/c1211/score/b/1:link.path	/media/m/dedes/en/oc/m3/d1/ve/b/aposticha4.pdf
media/en_redirects_goarch/oc.m3.d1/ocVE.Aposticha4/c1211/score/w/1:link.info	SDedes
media/en_redirects_goarch/oc.m3.d1/ocVE.Aposticha4/c1211/score/w/1:link.path	/media/m/dedes/en/oc/m3/d1/ve/w/aposticha4.pdf
media/en_redirects_goarch/oc.m3.d1/ocVE.MM.LIHC1/c1111/audio/1:link.info	SDedes/Eikona
media/en_redirects_goarch/oc.m3.d1/ocVE.MM.LIHC1/c1111/audio/1:link.path	/media/a/eikona/oc/m3/d1/ve/lihc1.mp3
media/en_redirects_goarch/oc.m3.d1/ocVE.MM.LIHC1/c1111/score/b/1:link.info	SDedes | GCremeens
media/en_redirects_goarch/oc.m3.d1/ocVE.MM.LIHC1/c1111/score/b/1:link.path	/media/m/cremeens/en/oc/m3/d1/ve/b/lihc1.pdf
media/en_redirects_goarch/oc.m3.d1/ocVE.MM.LIHC1/c1111/score/w/1:link.info	SDedes
media/en_redirects_goarch/oc.m3.d1/ocVE.MM.LIHC1/c1111/score/w/1:link.path	/media/m/dedes/en/oc/m3/d1/ve/w/lihc1.pdf
media/en_redirects_goarch/oc.m3.d1/ocVE.MM.LIHC1/c1112/score/b/1:link.info	Concise | SDedes
media/en_redirects_goarch/oc.m3.d1/ocVE.MM.LIHC1/c1112/score/b/1:link.path	/media/m/dedes/en/oc/m3/d1/ve/b/lihc_concise.pdf
media/en_redirects_goarch/oc.m3.d1/ocVE.MM.LIHC1/c1112/score/w/1:link.info	Concise | SDedes
media/en_redirects_goarch/oc.m3.d1/ocVE.MM.LIHC1/c1112/score/w/1:link.path	/media/m/dedes/en/oc/m3/d1/ve/w/lihc_concise.pdf
media/en_redirects_goarch/oc.m3.d1/ocVE.MM.LIHC2/c1111/audio/1:link.info	SDedes/Eikona
media/en_redirects_goarch/oc.m3.d1/ocVE.MM.LIHC2/c1111/audio/1:link.path	/media/a/eikona/oc/m3/d1/ve/lihc2.mp3
media/en_redirects_goarch/oc.m3.d1/ocVE.MM.LIHC2/c1111/score/b/1:link.info	SDedes | GCremeens
media/en_redirects_goarch/oc.m3.d1/ocVE.MM.LIHC2/c1111/score/b/1:link.path	/media/m/cremeens/en/oc/m3/d1/ve/b/lihc2.pdf
media/en_redirects_goarch/oc.m3.d1/ocVE.MM.LIHC2/c1111/score/w/1:link.info	SDedes
media/en_redirects_goarch/oc.m3.d1/ocVE.MM.LIHC2/c1111/score/w/1:link.path	/media/m/dedes/en/oc/m3/d1/ve/w/lihc2.pdf
media/en_redirects_goarch/oc.m3.d1/ocVE.MM.Stichologia/c1111/score/b/1:link.info	GCremeens
media/en_redirects_goarch/oc.m3.d1/ocVE.MM.Stichologia/c1111/score/b/1:link.path	/media/m/cremeens/en/oc/m3/d1/ve/b/lihc_stichologia.pdf
media/en_redirects_goarch/oc.m3.d1/ocVE.SticTheotokion/c1211/audio/1:link.info	SDedes/Eikona
media/en_redirects_goarch/oc.m3.d1/ocVE.SticTheotokion/c1211/audio/1:link.path	/media/a/eikona/oc/m3/d1/ve/stictheotokion.mp3
media/en_redirects_goarch/oc.m3.d1/ocVE.SticTheotokion/c1211/score/b/1:link.info	SDedes
media/en_redirects_goarch/oc.m3.d1/ocVE.SticTheotokion/c1211/score/b/1:link.path	/media/m/dedes/en/oc/m3/d1/ve/b/stictheotokion.pdf
media/en_redirects_goarch/oc.m3.d1/ocVE.SticTheotokion/c1211/score/w/1:link.info	SDedes
media/en_redirects_goarch/oc.m3.d1/ocVE.SticTheotokion/c1211/score/w/1:link.path	/media/m/dedes/en/oc/m3/d1/ve/w/stictheotokion.pdf
media/en_redirects_goarch/oc.m3.d1/ocVE.Stichera1/c1211/audio/1:link.info	SDedes/Eikona
media/en_redirects_goarch/oc.m3.d1/ocVE.Stichera1/c1211/audio/1:link.path	/media/a/eikona/oc/m3/d1/ve/stichera1.mp3
media/en_redirects_goarch/oc.m3.d1/ocVE.Stichera1/c1211/score/b/1:link.info	SDedes
media/en_redirects_goarch/oc.m3.d1/ocVE.Stichera1/c1211/score/b/1:link.path	/media/m/dedes/en/oc/m3/d1/ve/b/stichera1.pdf
media/en_redirects_goarch/oc.m3.d1/ocVE.Stichera1/c1211/score/w/1:link.info	SDedes
media/en_redirects_goarch/oc.m3.d1/ocVE.Stichera1/c1211/score/w/1:link.path	/media/m/dedes/en/oc/m3/d1/ve/w/stichera1.pdf
media/en_redirects_goarch/oc.m3.d1/ocVE.Stichera2/c1211/audio/1:link.info	SDedes/Eikona
media/en_redirects_goarch/oc.m3.d1/ocVE.Stichera2/c1211/audio/1:link.path	/media/a/eikona/oc/m3/d1/ve/stichera2.mp3
media/en_redirects_goarch/oc.m3.d1/ocVE.Stichera2/c1211/score/b/1:link.info	SDedes
media/en_redirects_goarch/oc.m3.d1/ocVE.Stichera2/c1211/score/b/1:link.path	/media/m/dedes/en/oc/m3/d1/ve/b/stichera2.pdf
media/en_redirects_goarch/oc.m3.d1/ocVE.Stichera2/c1211/score/w/1:link.info	SDedes
media/en_redirects_goarch/oc.m3.d1/ocVE.Stichera2/c1211/score/w/1:link.path	/media/m/dedes/en/oc/m3/d1/ve/w/stichera2.pdf
media/en_redirects_goarch/oc.m3.d1/ocVE.Stichera3/c1211/audio/1:link.info	SDedes/Eikona
media/en_redirects_goarch/oc.m3.d1/ocVE.Stichera3/c1211/audio/1:link.path	/media/a/eikona/oc/m3/d1/ve/stichera3.mp3
media/en_redirects_goarch/oc.m3.d1/ocVE.Stichera3/c1211/score/b/1:link.info	SDedes
media/en_redirects_goarch/oc.m3.d1/ocVE.Stichera3/c1211/score/b/1:link.path	/media/m/dedes/en/oc/m3/d1/ve/b/stichera3.pdf
media/en_redirects_goarch/oc.m3.d1/ocVE.Stichera3/c1211/score/w/1:link.info	SDedes
media/en_redirects_goarch/oc.m3.d1/ocVE.Stichera3/c1211/score/w/1:link.path	/media/m/dedes/en/oc/m3/d1/ve/w/stichera3.pdf
media/en_redirects_goarch/oc.m3.d1/ocVE.Stichera4/c1211/audio/1:link.info	SDedes/Eikona
media/en_redirects_goarch/oc.m3.d1/ocVE.Stichera4/c1211/audio/1:link.path	/media/a/eikona/oc/m3/d1/ve/stichera4.mp3
media/en_redirects_goarch/oc.m3.d1/ocVE.Stichera4/c1211/score/b/1:link.info	SDedes
media/en_redirects_goarch/oc.m3.d1/ocVE.Stichera4/c1211/score/b/1:link.path	/media/m/dedes/en/oc/m3/d1/ve/b/stichera4.pdf
media/en_redirects_goarch/oc.m3.d1/ocVE.Stichera4/c1211/score/w/1:link.info	SDedes
media/en_redirects_goarch/oc.m3.d1/ocVE.Stichera4/c1211/score/w/1:link.path	/media/m/dedes/en/oc/m3/d1/ve/w/stichera4.pdf
media/en_redirects_goarch/oc.m3.d1/ocVE.Stichera5/c1211/audio/1:link.info	SDedes/Eikona
media/en_redirects_goarch/oc.m3.d1/ocVE.Stichera5/c1211/audio/1:link.path	/media/a/eikona/oc/m3/d1/ve/stichera5.mp3
media/en_redirects_goarch/oc.m3.d1/ocVE.Stichera5/c1211/score/b/1:link.info	SDedes
media/en_redirects_goarch/oc.m3.d1/ocVE.Stichera5/c1211/score/b/1:link.path	/media/m/dedes/en/oc/m3/d1/ve/b/stichera5.pdf
media/en_redirects_goarch/oc.m3.d1/ocVE.Stichera5/c1211/score/w/1:link.info	SDedes
media/en_redirects_goarch/oc.m3.d1/ocVE.Stichera5/c1211/score/w/1:link.path	/media/m/dedes/en/oc/m3/d1/ve/w/stichera5.pdf
media/en_redirects_goarch/oc.m3.d1/ocVE.Stichera6/c1211/audio/1:link.info	SDedes/Eikona
media/en_redirects_goarch/oc.m3.d1/ocVE.Stichera6/c1211/audio/1:link.path	/media/a/eikona/oc/m3/d1/ve/stichera6.mp3
media/en_redirects_goarch/oc.m3.d1/ocVE.Stichera6/c1211/score/b/1:link.info	SDedes
media/en_redirects_goarch/oc.m3.d1/ocVE.Stichera6/c1211/score/b/1:link.path	/media/m/dedes/en/oc/m3/d1/ve/b/stichera6.pdf
media/en_redirects_goarch/oc.m3.d1/ocVE.Stichera6/c1211/score/w/1:link.info	SDedes
media/en_redirects_goarch/oc.m3.d1/ocVE.Stichera6/c1211/score/w/1:link.path	/media/m/dedes/en/oc/m3/d1/ve/w/stichera6.pdf
media/en_redirects_goarch/oc.m3.d1/ocVE.Stichera7/c1211/audio/1:link.info	SDedes/Eikona
media/en_redirects_goarch/oc.m3.d1/ocVE.Stichera7/c1211/audio/1:link.path	/media/a/eikona/oc/m3/d1/ve/stichera7.mp3
media/en_redirects_goarch/oc.m3.d1/ocVE.Stichera7/c1211/score/b/1:link.info	SDedes
media/en_redirects_goarch/oc.m3.d1/ocVE.Stichera7/c1211/score/b/1:link.path	/media/m/dedes/en/oc/m3/d1/ve/b/stichera7.pdf
media/en_redirects_goarch/oc.m3.d1/ocVE.Stichera7/c1211/score/w/1:link.info	SDedes
media/en_redirects_goarch/oc.m3.d1/ocVE.Stichera7/c1211/score/w/1:link.path	/media/m/dedes/en/oc/m3/d1/ve/w/stichera7.pdf
