media/en_redirects_goarch/pe.d109/peMA.Lauds1/c1211/audio/1:link.info	SDedes
media/en_redirects_goarch/pe.d109/peMA.Lauds1/c1211/audio/1:link.path	/media/a/en_public/oc/m1/d1/ma/lauds1_a1.mp3
media/en_redirects_goarch/pe.d109/peMA.Lauds1/c1211/audio/2:link.info	MBDanckaert
media/en_redirects_goarch/pe.d109/peMA.Lauds1/c1211/audio/2:link.path	/media/a/en_public/oc/m1/d1/ma/lauds1_a2.mp3
media/en_redirects_goarch/pe.d109/peMA.Lauds1/c1211/score/b/1:link.info	SDedes
media/en_redirects_goarch/pe.d109/peMA.Lauds1/c1211/score/b/1:link.path	/media/m/dedes/en/oc/m1/d1/ma/b/lauds1.pdf
media/en_redirects_goarch/pe.d109/peMA.Lauds1/c1211/score/w/1:link.info	SDedes
media/en_redirects_goarch/pe.d109/peMA.Lauds1/c1211/score/w/1:link.path	/media/m/dedes/en/oc/m1/d1/ma/w/lauds1.pdf
media/en_redirects_goarch/pe.d109/peMA.Lauds2/c1211/audio/1:link.info	SDedes
media/en_redirects_goarch/pe.d109/peMA.Lauds2/c1211/audio/1:link.path	/media/a/en_public/oc/m1/d1/ma/lauds2_a1.mp3
media/en_redirects_goarch/pe.d109/peMA.Lauds2/c1211/audio/2:link.info	MBDanckaert
media/en_redirects_goarch/pe.d109/peMA.Lauds2/c1211/audio/2:link.path	/media/a/en_public/oc/m1/d1/ma/lauds2_a2.mp3
media/en_redirects_goarch/pe.d109/peMA.Lauds2/c1211/score/b/1:link.info	SDedes
media/en_redirects_goarch/pe.d109/peMA.Lauds2/c1211/score/b/1:link.path	/media/m/dedes/en/oc/m1/d1/ma/b/lauds2.pdf
media/en_redirects_goarch/pe.d109/peMA.Lauds2/c1211/score/w/1:link.info	SDedes
media/en_redirects_goarch/pe.d109/peMA.Lauds2/c1211/score/w/1:link.path	/media/m/dedes/en/oc/m1/d1/ma/w/lauds2.pdf
media/en_redirects_goarch/pe.d109/peMA.Lauds3/c1211/audio/1:link.info	SDedes
media/en_redirects_goarch/pe.d109/peMA.Lauds3/c1211/audio/1:link.path	/media/a/en_public/oc/m1/d1/ma/lauds3_a1.mp3
media/en_redirects_goarch/pe.d109/peMA.Lauds3/c1211/audio/2:link.info	MBDanckaert
media/en_redirects_goarch/pe.d109/peMA.Lauds3/c1211/audio/2:link.path	/media/a/en_public/oc/m1/d1/ma/lauds3_a2.mp3
media/en_redirects_goarch/pe.d109/peMA.Lauds3/c1211/score/b/1:link.info	SDedes
media/en_redirects_goarch/pe.d109/peMA.Lauds3/c1211/score/b/1:link.path	/media/m/dedes/en/oc/m1/d1/ma/b/lauds3.pdf
media/en_redirects_goarch/pe.d109/peMA.Lauds3/c1211/score/w/1:link.info	SDedes
media/en_redirects_goarch/pe.d109/peMA.Lauds3/c1211/score/w/1:link.path	/media/m/dedes/en/oc/m1/d1/ma/w/lauds3.pdf
media/en_redirects_goarch/pe.d109/peMA.Lauds4/c1211/audio/1:link.info	SDedes
media/en_redirects_goarch/pe.d109/peMA.Lauds4/c1211/audio/1:link.path	/media/a/en_public/oc/m1/d1/ma/lauds4_a1.mp3
media/en_redirects_goarch/pe.d109/peMA.Lauds4/c1211/audio/2:link.info	MBDanckaert
media/en_redirects_goarch/pe.d109/peMA.Lauds4/c1211/audio/2:link.path	/media/a/en_public/oc/m1/d1/ma/lauds4_a2.mp3
media/en_redirects_goarch/pe.d109/peMA.Lauds4/c1211/score/b/1:link.info	SDedes
media/en_redirects_goarch/pe.d109/peMA.Lauds4/c1211/score/b/1:link.path	/media/m/dedes/en/oc/m1/d1/ma/b/lauds4.pdf
media/en_redirects_goarch/pe.d109/peMA.Lauds4/c1211/score/w/1:link.info	SDedes
media/en_redirects_goarch/pe.d109/peMA.Lauds4/c1211/score/w/1:link.path	/media/m/dedes/en/oc/m1/d1/ma/w/lauds4.pdf
media/en_redirects_goarch/pe.d109/peVE.Aposticha1/c1211/score/b/1:link.info	SDedes
media/en_redirects_goarch/pe.d109/peVE.Aposticha1/c1211/score/b/1:link.path	/media/m/dedes/en/oc/m1/d1/ve/b/aposticha1.pdf
media/en_redirects_goarch/pe.d109/peVE.Aposticha1/c1211/score/w/1:link.info	SDedes
media/en_redirects_goarch/pe.d109/peVE.Aposticha1/c1211/score/w/1:link.path	/media/m/dedes/en/oc/m1/d1/ve/w/aposticha1.pdf
media/en_redirects_goarch/pe.d109/peVE.SticBoth/c1211/score/b/1:link.info	SDedes
media/en_redirects_goarch/pe.d109/peVE.SticBoth/c1211/score/b/1:link.path	/media/m/dedes/en/oc/m1/d1/ve/b/stictheotokion.pdf
media/en_redirects_goarch/pe.d109/peVE.SticBoth/c1211/score/w/1:link.info	SDedes
media/en_redirects_goarch/pe.d109/peVE.SticBoth/c1211/score/w/1:link.path	/media/m/dedes/en/oc/m1/d1/ve/w/stictheotokion.pdf
media/en_redirects_goarch/pe.d109/peVE.SticGlory/c1211/score/b/1:link.info	SDedes | Stich. and Concise
media/en_redirects_goarch/pe.d109/peVE.SticGlory/c1211/score/b/1:link.path	/media/m/dedes/en/pe/d109/ve/b/sticglory.pdf
media/en_redirects_goarch/pe.d109/peVE.SticGlory/c1211/score/w/1:link.info	SDedes | Stich. and Concise
media/en_redirects_goarch/pe.d109/peVE.SticGlory/c1211/score/w/1:link.path	/media/m/dedes/en/pe/d109/ve/w/sticglory.pdf
media/en_redirects_goarch/pe.d109/peVE.Stichera01/c1211/score/b/1:link.info	SDedes | Stich. and Concise
media/en_redirects_goarch/pe.d109/peVE.Stichera01/c1211/score/b/1:link.path	/media/m/dedes/en/pe/d109/ve/b/stichera1.pdf
media/en_redirects_goarch/pe.d109/peVE.Stichera01/c1211/score/w/1:link.info	SDedes | Stich. and Concise
media/en_redirects_goarch/pe.d109/peVE.Stichera01/c1211/score/w/1:link.path	/media/m/dedes/en/pe/d109/ve/w/stichera1.pdf
media/en_redirects_goarch/pe.d109/peVE.Stichera02/c1211/score/b/1:link.info	SDedes | Stich. and Concise
media/en_redirects_goarch/pe.d109/peVE.Stichera02/c1211/score/b/1:link.path	/media/m/dedes/en/pe/d109/ve/b/stichera2.pdf
media/en_redirects_goarch/pe.d109/peVE.Stichera02/c1211/score/w/1:link.info	SDedes | Stich. and Concise
media/en_redirects_goarch/pe.d109/peVE.Stichera02/c1211/score/w/1:link.path	/media/m/dedes/en/pe/d109/ve/w/stichera2.pdf
media/en_redirects_goarch/pe.d109/peVE.Stichera03/c1211/score/b/1:link.info	SDedes | Stich. and Concise
media/en_redirects_goarch/pe.d109/peVE.Stichera03/c1211/score/b/1:link.path	/media/m/dedes/en/pe/d109/ve/b/stichera3.pdf
media/en_redirects_goarch/pe.d109/peVE.Stichera03/c1211/score/w/1:link.info	SDedes | Stich. and Concise
media/en_redirects_goarch/pe.d109/peVE.Stichera03/c1211/score/w/1:link.path	/media/m/dedes/en/pe/d109/ve/w/stichera3.pdf
media/en_redirects_goarch/pe.d109/peVE.Stichera04/c1211/score/b/1:link.info	SDedes | Stich. and Concise
media/en_redirects_goarch/pe.d109/peVE.Stichera04/c1211/score/b/1:link.path	/media/m/dedes/en/pe/d109/ve/b/stichera4.pdf
media/en_redirects_goarch/pe.d109/peVE.Stichera04/c1211/score/w/1:link.info	SDedes | Stich. and Concise
media/en_redirects_goarch/pe.d109/peVE.Stichera04/c1211/score/w/1:link.path	/media/m/dedes/en/pe/d109/ve/w/stichera4.pdf
media/en_redirects_goarch/pe.d109/peVE.Stichera05/c1211/score/b/1:link.info	SDedes | Stich. and Concise
media/en_redirects_goarch/pe.d109/peVE.Stichera05/c1211/score/b/1:link.path	/media/m/dedes/en/pe/d109/ve/b/stichera5.pdf
media/en_redirects_goarch/pe.d109/peVE.Stichera05/c1211/score/w/1:link.info	SDedes | Stich. and Concise
media/en_redirects_goarch/pe.d109/peVE.Stichera05/c1211/score/w/1:link.path	/media/m/dedes/en/pe/d109/ve/w/stichera5.pdf
media/en_redirects_goarch/pe.d109/peVE.Stichera06/c1211/score/b/1:link.info	SDedes | Stich. and Concise
media/en_redirects_goarch/pe.d109/peVE.Stichera06/c1211/score/b/1:link.path	/media/m/dedes/en/pe/d109/ve/b/stichera6.pdf
media/en_redirects_goarch/pe.d109/peVE.Stichera06/c1211/score/w/1:link.info	SDedes | Stich. and Concise
media/en_redirects_goarch/pe.d109/peVE.Stichera06/c1211/score/w/1:link.path	/media/m/dedes/en/pe/d109/ve/w/stichera6.pdf
