media/en_redirects_goarch/me.m08.d21/meVE.AposGlory/c1211/score/b/1:link.info	SDedes
media/en_redirects_goarch/me.m08.d21/meVE.AposGlory/c1211/score/b/1:link.path	/media/m/dedes/en/me/m08/d17/ve/b/aposglory.pdf
media/en_redirects_goarch/me.m08.d21/meVE.AposGlory/c1211/score/w/1:link.info	SDedes
media/en_redirects_goarch/me.m08.d21/meVE.AposGlory/c1211/score/w/1:link.path	/media/m/dedes/en/me/m08/d17/ve/w/aposglory.pdf
media/en_redirects_goarch/me.m08.d21/meVE.SticGlory/c1211/score/b/1:link.info	SDedes
media/en_redirects_goarch/me.m08.d21/meVE.SticGlory/c1211/score/b/1:link.path	/media/m/dedes/en/me/m08/d16/ve/b/sticglory.pdf
media/en_redirects_goarch/me.m08.d21/meVE.SticGlory/c1211/score/w/1:link.info	SDedes
media/en_redirects_goarch/me.m08.d21/meVE.SticGlory/c1211/score/w/1:link.path	/media/m/dedes/en/me/m08/d16/ve/w/sticglory.pdf
