media/en_redirects_goarch/da.d6/daLI.MM.CommunionHymn/c1111/score/w/1:link.info	SDedes
media/en_redirects_goarch/da.d6/daLI.MM.CommunionHymn/c1111/score/w/1:link.path	/media/m/dedes/en/eu/lichrysbasil/w/communionhymnfriday.pdf
media/en_redirects_goarch/da.d6/daLI.MM.CommunionHymnAlt/c1111/score/w/1:link.info	SDedes
media/en_redirects_goarch/da.d6/daLI.MM.CommunionHymnAlt/c1111/score/w/1:link.path	/media/m/dedes/en/eu/lichrysbasil/w/communionhymnfridayalt.pdf
media/en_redirects_goarch/da.d6/daVE.Apolytikion1/c1211/score/w/1:link.info	SDedes
media/en_redirects_goarch/da.d6/daVE.Apolytikion1/c1211/score/w/1:link.path	/media/m/dedes/en/me/m09/d14/ve/w/apolytikion1.pdf
