media/en_redirects_goarch/me.m11.d27/meMA.ExapTheotokion/c1211/score/w/1:link.info	SDedes
media/en_redirects_goarch/me.m11.d27/meMA.ExapTheotokion/c1211/score/w/1:link.path	/media/m/dedes/en/ho/ho03/w/exaptheotokion_thursday.pdf
media/en_redirects_goarch/me.m11.d27/meMA.Exaposteilarion1/c1211/score/w/1:link.info	SDedes
media/en_redirects_goarch/me.m11.d27/meMA.Exaposteilarion1/c1211/score/w/1:link.path	/media/m/dedes/en/me/m11/d27/ma/w/exaposteilarion1.pdf
media/en_redirects_goarch/me.m11.d27/meMA.MM.Ve1123as5678/c1211/score/w/1:link.info	SDedes
media/en_redirects_goarch/me.m11.d27/meMA.MM.Ve1123as5678/c1211/score/w/1:link.path	/media/m/dedes/en/me/m11/d27/ma/w/stichera1123aslauds5678.pdf
media/en_redirects_goarch/me.m11.d27/meVE.MM.Stichera1123as78910/c1211/score/w/1:link.info	SDedes
media/en_redirects_goarch/me.m11.d27/meVE.MM.Stichera1123as78910/c1211/score/w/1:link.path	/media/m/dedes/en/me/m11/d27/ve/w/stichera1123as78910.pdf
media/en_redirects_goarch/me.m11.d27/meVE.Stichera01/c1211/score/w/1:link.info	SDedes
media/en_redirects_goarch/me.m11.d27/meVE.Stichera01/c1211/score/w/1:link.path	/media/m/dedes/en/me/m11/d27/ve/w/stichera01.pdf
media/en_redirects_goarch/me.m11.d27/meVE.Stichera02/c1211/score/w/1:link.info	SDedes
media/en_redirects_goarch/me.m11.d27/meVE.Stichera02/c1211/score/w/1:link.path	/media/m/dedes/en/me/m11/d27/ve/w/stichera02.pdf
media/en_redirects_goarch/me.m11.d27/meVE.Stichera03/c1211/score/w/1:link.info	SDedes
media/en_redirects_goarch/me.m11.d27/meVE.Stichera03/c1211/score/w/1:link.path	/media/m/dedes/en/me/m11/d27/ve/w/stichera03.pdf
