media/en_redirects_goarch/tr.d030/trVE.AposIdiomelon1/c1211/score/b/1:link.info	SDedes
media/en_redirects_goarch/tr.d030/trVE.AposIdiomelon1/c1211/score/b/1:link.path	/media/m/dedes/en/tr/d030/ve/b/aposidiomelon1.pdf
media/en_redirects_goarch/tr.d030/trVE.AposIdiomelon1/c1211/score/w/1:link.info	SDedes
media/en_redirects_goarch/tr.d030/trVE.AposIdiomelon1/c1211/score/w/1:link.path	/media/m/dedes/en/tr/d030/ve/w/aposidiomelon1.pdf
media/en_redirects_goarch/tr.d030/trVE.AposMartyric/c1211/score/b/1:link.info	SDedes
media/en_redirects_goarch/tr.d030/trVE.AposMartyric/c1211/score/b/1:link.path	/media/m/dedes/en/tr/d030/ve/b/aposmartyric.pdf
media/en_redirects_goarch/tr.d030/trVE.AposMartyric/c1211/score/w/1:link.info	SDedes
media/en_redirects_goarch/tr.d030/trVE.AposMartyric/c1211/score/w/1:link.path	/media/m/dedes/en/tr/d030/ve/w/aposmartyric.pdf
media/en_redirects_goarch/tr.d030/trVE.AposTheotokion/c1211/score/w/1:link.info	SDedes
media/en_redirects_goarch/tr.d030/trVE.AposTheotokion/c1211/score/w/1:link.path	/media/m/dedes/en/tr/d030/ve/w/apostheotokion.pdf
media/en_redirects_goarch/tr.d030/trVE.Stichera01/c1211/score/w/1:link.info	SDedes
media/en_redirects_goarch/tr.d030/trVE.Stichera01/c1211/score/w/1:link.path	/media/m/dedes/en/tr/d030/ve/w/stichera01.pdf
media/en_redirects_goarch/tr.d030/trVE.Stichera02/c1211/score/w/1:link.info	SDedes
media/en_redirects_goarch/tr.d030/trVE.Stichera02/c1211/score/w/1:link.path	/media/m/dedes/en/tr/d030/ve/w/stichera02.pdf
media/en_redirects_goarch/tr.d030/trVE.Stichera03/c1211/score/w/1:link.info	SDedes
media/en_redirects_goarch/tr.d030/trVE.Stichera03/c1211/score/w/1:link.path	/media/m/dedes/en/tr/d030/ve/w/stichera03.pdf
