media/en_redirects_goarch/me.m01.d17/meLI.MM.CommunionHymn/c1121/score/w/1:link.info	SDedes
media/en_redirects_goarch/me.m01.d17/meLI.MM.CommunionHymn/c1121/score/w/1:link.path	/media/m/dedes/en/eu/lichrysbasil/w/communionhymntuesday.pdf
media/en_redirects_goarch/me.m01.d17/meMA.ExapTheotokion/c1211/score/w/1:link.info	SDedes
media/en_redirects_goarch/me.m01.d17/meMA.ExapTheotokion/c1211/score/w/1:link.path	/media/m/dedes/en/me/m01/d17/ma/w/exaptheotokion.pdf
media/en_redirects_goarch/me.m01.d17/meMA.Exaposteilarion3/c1211/score/w/1:link.info	SDedes
media/en_redirects_goarch/me.m01.d17/meMA.Exaposteilarion3/c1211/score/w/1:link.path	/media/m/dedes/en/me/m01/d17/ma/w/exaposteilarion3.pdf
media/en_redirects_goarch/me.m01.d17/meMA.Kathisma11/c1211/score/w/1:link.info	SDedes
media/en_redirects_goarch/me.m01.d17/meMA.Kathisma11/c1211/score/w/1:link.path	/media/m/dedes/en/me/m01/d17/ma/w/kathisma11.pdf
media/en_redirects_goarch/me.m01.d17/meMA.Kathisma1T/c1211/score/w/1:link.info	SDedes
media/en_redirects_goarch/me.m01.d17/meMA.Kathisma1T/c1211/score/w/1:link.path	/media/m/dedes/en/me/m01/d17/ma/w/kathisma1t.pdf
media/en_redirects_goarch/me.m01.d17/meMA.Kathisma21/c1211/score/w/1:link.info	SDedes
media/en_redirects_goarch/me.m01.d17/meMA.Kathisma21/c1211/score/w/1:link.path	/media/m/dedes/en/me/m01/d17/ma/w/kathisma21.pdf
media/en_redirects_goarch/me.m01.d17/meMA.Kathisma2T/c1211/score/w/1:link.info	SDedes
media/en_redirects_goarch/me.m01.d17/meMA.Kathisma2T/c1211/score/w/1:link.path	/media/m/dedes/en/me/m01/d17/ma/w/kathisma2t.pdf
media/en_redirects_goarch/me.m01.d17/meMA.Kathisma31/c1211/score/w/1:link.info	SDedes
media/en_redirects_goarch/me.m01.d17/meMA.Kathisma31/c1211/score/w/1:link.path	/media/m/dedes/en/me/m01/d17/ma/w/kathisma31.pdf
media/en_redirects_goarch/me.m01.d17/meMA.Kathisma32/c1211/score/w/1:link.info	SDedes
media/en_redirects_goarch/me.m01.d17/meMA.Kathisma32/c1211/score/w/1:link.path	/media/m/dedes/en/me/m01/d17/ma/w/kathisma32.pdf
media/en_redirects_goarch/me.m01.d17/meMA.Kathisma3T/c1211/score/w/1:link.info	SDedes
media/en_redirects_goarch/me.m01.d17/meMA.Kathisma3T/c1211/score/w/1:link.path	/media/m/dedes/en/me/m01/d17/ma/w/kathisma3t.pdf
media/en_redirects_goarch/me.m01.d17/meMA.Lauds1/c1211/score/w/1:link.info	SDedes
media/en_redirects_goarch/me.m01.d17/meMA.Lauds1/c1211/score/w/1:link.path	/media/m/dedes/en/me/m01/d17/ma/w/lauds1.pdf
media/en_redirects_goarch/me.m01.d17/meMA.Lauds2/c1211/score/w/1:link.info	SDedes
media/en_redirects_goarch/me.m01.d17/meMA.Lauds2/c1211/score/w/1:link.path	/media/m/dedes/en/me/m01/d17/ma/w/lauds2.pdf
media/en_redirects_goarch/me.m01.d17/meMA.Lauds3/c1211/score/w/1:link.info	SDedes
media/en_redirects_goarch/me.m01.d17/meMA.Lauds3/c1211/score/w/1:link.path	/media/m/dedes/en/me/m01/d17/ma/w/lauds3.pdf
media/en_redirects_goarch/me.m01.d17/meMA.Lauds4/c1211/score/w/1:link.info	SDedes
media/en_redirects_goarch/me.m01.d17/meMA.Lauds4/c1211/score/w/1:link.path	/media/m/dedes/en/me/m01/d17/ma/w/lauds4.pdf
media/en_redirects_goarch/me.m01.d17/meMA.LaudsGlory/c1211/score/b/1:link.info	SDedes
media/en_redirects_goarch/me.m01.d17/meMA.LaudsGlory/c1211/score/b/1:link.path	/media/m/dedes/en/me/m01/d17/ma/b/laudsglory.pdf
media/en_redirects_goarch/me.m01.d17/meMA.LaudsGlory/c1211/score/w/1:link.info	SDedes
media/en_redirects_goarch/me.m01.d17/meMA.LaudsGlory/c1211/score/w/1:link.path	/media/m/dedes/en/me/m01/d17/ma/w/laudsglory.pdf
media/en_redirects_goarch/me.m01.d17/meMA.LaudsTheotokion/c1211/score/w/1:link.info	SDedes
media/en_redirects_goarch/me.m01.d17/meMA.LaudsTheotokion/c1211/score/w/1:link.path	/media/m/dedes/en/oc/m8/d5/ma/w/apostheotokion.pdf
media/en_redirects_goarch/me.m01.d17/meMA.MM.Lauds1234as5678/c1211/score/w/1:link.info	SDedes
media/en_redirects_goarch/me.m01.d17/meMA.MM.Lauds1234as5678/c1211/score/w/1:link.path	/media/m/dedes/en/me/m01/d17/ma/w/lauds1234as5678.pdf
media/en_redirects_goarch/me.m01.d17/meMA.PostGospelGlory/c1211/score/b/1:link.info	SDedes
media/en_redirects_goarch/me.m01.d17/meMA.PostGospelGlory/c1211/score/b/1:link.path	/media/m/dedes/en/ho/ho03/b/postgospelglory_monastic.pdf
media/en_redirects_goarch/me.m01.d17/meMA.PostGospelGlory/c1211/score/w/1:link.info	SDedes
media/en_redirects_goarch/me.m01.d17/meMA.PostGospelGlory/c1211/score/w/1:link.path	/media/m/dedes/en/ho/ho03/w/postgospelglory_monastic.pdf
media/en_redirects_goarch/me.m01.d17/meMA.PostGospelIdiomelon/c1211/score/b/1:link.info	SDedes
media/en_redirects_goarch/me.m01.d17/meMA.PostGospelIdiomelon/c1211/score/b/1:link.path	/media/m/dedes/en/me/m01/d11/ma/b/postgospelidiomelon.pdf
media/en_redirects_goarch/me.m01.d17/meMA.PostGospelIdiomelon/c1211/score/w/1:link.info	SDedes
media/en_redirects_goarch/me.m01.d17/meMA.PostGospelIdiomelon/c1211/score/w/1:link.path	/media/m/dedes/en/me/m01/d11/ma/w/postgospelidiomelon.pdf
media/en_redirects_goarch/me.m01.d17/meVE.Apolytikion1/c1211/score/w/1:link.info	SDedes
media/en_redirects_goarch/me.m01.d17/meVE.Apolytikion1/c1211/score/w/1:link.path	/media/m/dedes/en/me/m01/d17/ve/w/apolytikion1.pdf
media/en_redirects_goarch/me.m01.d17/meVE.Apolytikion1/c2001/score/w/1:link.info	NewByz
media/en_redirects_goarch/me.m01.d17/meVE.Apolytikion1/c2001/score/w/1:link.path	/media/m/newbyz/en/me/m01/d17/ve/w/apolytikion1.pdf
media/en_redirects_goarch/me.m01.d17/meVE.AposGlory/c1211/score/b/1:link.info	SDedes
media/en_redirects_goarch/me.m01.d17/meVE.AposGlory/c1211/score/b/1:link.path	/media/m/dedes/en/me/m01/d17/ve/b/aposglory.pdf
media/en_redirects_goarch/me.m01.d17/meVE.AposGlory/c1211/score/w/1:link.info	SDedes
media/en_redirects_goarch/me.m01.d17/meVE.AposGlory/c1211/score/w/1:link.path	/media/m/dedes/en/me/m01/d17/ve/w/aposglory.pdf
media/en_redirects_goarch/me.m01.d17/meVE.LityBoth/c1211/score/b/1:link.info	SDedes
media/en_redirects_goarch/me.m01.d17/meVE.LityBoth/c1211/score/b/1:link.path	/media/m/dedes/en/oc/m5/d3/ve/b/apostheotokion.pdf
media/en_redirects_goarch/me.m01.d17/meVE.LityBoth/c1211/score/w/1:link.info	SDedes
media/en_redirects_goarch/me.m01.d17/meVE.LityBoth/c1211/score/w/1:link.path	/media/m/dedes/en/oc/m5/d3/ve/w/apostheotokion.pdf
media/en_redirects_goarch/me.m01.d17/meVE.LityGlory/c1211/score/b/1:link.info	SDedes
media/en_redirects_goarch/me.m01.d17/meVE.LityGlory/c1211/score/b/1:link.path	/media/m/dedes/en/me/m01/d17/ve/b/lityglory.pdf
media/en_redirects_goarch/me.m01.d17/meVE.LityGlory/c1211/score/w/1:link.info	SDedes
media/en_redirects_goarch/me.m01.d17/meVE.LityGlory/c1211/score/w/1:link.path	/media/m/dedes/en/me/m01/d17/ve/w/lityglory.pdf
media/en_redirects_goarch/me.m01.d17/meVE.SticGlory/c1211/score/b/1:link.info	SDedes
media/en_redirects_goarch/me.m01.d17/meVE.SticGlory/c1211/score/b/1:link.path	/media/m/dedes/en/me/m01/d17/ve/b/sticglory.pdf
media/en_redirects_goarch/me.m01.d17/meVE.SticGlory/c1211/score/w/1:link.info	SDedes
media/en_redirects_goarch/me.m01.d17/meVE.SticGlory/c1211/score/w/1:link.path	/media/m/dedes/en/me/m01/d17/ve/w/sticglory.pdf
