media/en_redirects_goarch/tr.d008/trLI.Kontakion1/c1211/score/w/1:link.info	SDedes
media/en_redirects_goarch/tr.d008/trLI.Kontakion1/c1211/score/w/1:link.path	/media/m/dedes/en/tr/d008/li/w/kontakion.pdf
media/en_redirects_goarch/tr.d008/trLI.Kontakion1/c2001/score/w/1:link.info	NewByz
media/en_redirects_goarch/tr.d008/trLI.Kontakion1/c2001/score/w/1:link.path	/media/m/newbyz/en/tr/d008/li/w/kontakion.pdf
media/en_redirects_goarch/tr.d008/trMA.ExapTheotokion/c1211/score/w/1:link.info	SDedes
media/en_redirects_goarch/tr.d008/trMA.ExapTheotokion/c1211/score/w/1:link.path	/media/m/dedes/en/tr/d008/ma/w/exaptheotokion.pdf
media/en_redirects_goarch/tr.d008/trMA.Exaposteilarion1/c1211/score/w/1:link.info	SDedes
media/en_redirects_goarch/tr.d008/trMA.Exaposteilarion1/c1211/score/w/1:link.path	/media/m/dedes/en/tr/d008/ma/w/exaposteilarion1.pdf
media/en_redirects_goarch/tr.d008/trMA.Exaposteilarion2/c1211/score/w/1:link.info	SDedes
media/en_redirects_goarch/tr.d008/trMA.Exaposteilarion2/c1211/score/w/1:link.path	/media/m/dedes/en/tr/d008/ma/w/exaposteilarion2.pdf
media/en_redirects_goarch/tr.d008/trMA.Lauds1/c1221/score/b/1:link.info	SDedes
media/en_redirects_goarch/tr.d008/trMA.Lauds1/c1221/score/b/1:link.path	/media/m/dedes/en/tr/d008/ma/b/lauds1.pdf
media/en_redirects_goarch/tr.d008/trMA.Lauds1/c1221/score/w/1:link.info	SDedes
media/en_redirects_goarch/tr.d008/trMA.Lauds1/c1221/score/w/1:link.path	/media/m/dedes/en/tr/d008/ma/w/lauds1.pdf
media/en_redirects_goarch/tr.d008/trMA.Lauds2/c1221/score/b/1:link.info	SDedes
media/en_redirects_goarch/tr.d008/trMA.Lauds2/c1221/score/b/1:link.path	/media/m/dedes/en/tr/d008/ma/b/lauds2.pdf
media/en_redirects_goarch/tr.d008/trMA.Lauds2/c1221/score/w/1:link.info	SDedes
media/en_redirects_goarch/tr.d008/trMA.Lauds2/c1221/score/w/1:link.path	/media/m/dedes/en/tr/d008/ma/w/lauds2.pdf
media/en_redirects_goarch/tr.d008/trMA.Lauds3/c1221/score/b/1:link.info	SDedes
media/en_redirects_goarch/tr.d008/trMA.Lauds3/c1221/score/b/1:link.path	/media/m/dedes/en/tr/d008/ma/b/lauds3.pdf
media/en_redirects_goarch/tr.d008/trMA.Lauds3/c1221/score/w/1:link.info	SDedes
media/en_redirects_goarch/tr.d008/trMA.Lauds3/c1221/score/w/1:link.path	/media/m/dedes/en/tr/d008/ma/w/lauds3.pdf
media/en_redirects_goarch/tr.d008/trMA.LaudsGlory/c1221/score/b/1:link.info	SDedes
media/en_redirects_goarch/tr.d008/trMA.LaudsGlory/c1221/score/b/1:link.path	/media/m/dedes/en/tr/d008/ma/b/laudsglory.pdf
media/en_redirects_goarch/tr.d008/trMA.LaudsGlory/c1221/score/w/1:link.info	SDedes
media/en_redirects_goarch/tr.d008/trMA.LaudsGlory/c1221/score/w/1:link.path	/media/m/dedes/en/tr/d008/ma/w/laudsglory.pdf
media/en_redirects_goarch/tr.d008/trMA.MM.Lauds12as45/c1221/score/b/1:link.info	SDedes
media/en_redirects_goarch/tr.d008/trMA.MM.Lauds12as45/c1221/score/b/1:link.path	/media/m/dedes/en/tr/d008/ma/b/lauds12as45.pdf
media/en_redirects_goarch/tr.d008/trMA.MM.Lauds12as45/c1221/score/w/1:link.info	SDedes
media/en_redirects_goarch/tr.d008/trMA.MM.Lauds12as45/c1221/score/w/1:link.path	/media/m/dedes/en/tr/d008/ma/w/lauds12as45.pdf
media/en_redirects_goarch/tr.d008/trVE.AposGlory/c1211/score/b/1:link.info	SDedes
media/en_redirects_goarch/tr.d008/trVE.AposGlory/c1211/score/b/1:link.path	/media/m/dedes/en/tr/d008/ve/b/aposglory.pdf
media/en_redirects_goarch/tr.d008/trVE.AposGlory/c1211/score/w/1:link.info	SDedes
media/en_redirects_goarch/tr.d008/trVE.AposGlory/c1211/score/w/1:link.path	/media/m/dedes/en/tr/d008/ve/w/aposglory.pdf
media/en_redirects_goarch/tr.d008/trVE.MM.Stichera112as567/c1211/score/b/1:link.info	SDedes
media/en_redirects_goarch/tr.d008/trVE.MM.Stichera112as567/c1211/score/b/1:link.path	/media/m/dedes/en/tr/d008/ve/b/stichera112as567.pdf
media/en_redirects_goarch/tr.d008/trVE.MM.Stichera112as567/c1211/score/w/1:link.info	SDedes
media/en_redirects_goarch/tr.d008/trVE.MM.Stichera112as567/c1211/score/w/1:link.path	/media/m/dedes/en/tr/d008/ve/w/stichera112as567.pdf
media/en_redirects_goarch/tr.d008/trVE.MM.Stichera112as8910/c1211/score/b/1:link.info	SDedes
media/en_redirects_goarch/tr.d008/trVE.MM.Stichera112as8910/c1211/score/b/1:link.path	/media/m/dedes/en/tr/d008/ve/b/stichera112as8910.pdf
media/en_redirects_goarch/tr.d008/trVE.MM.Stichera112as8910/c1211/score/w/1:link.info	SDedes
media/en_redirects_goarch/tr.d008/trVE.MM.Stichera112as8910/c1211/score/w/1:link.path	/media/m/dedes/en/tr/d008/ve/w/stichera112as8910.pdf
media/en_redirects_goarch/tr.d008/trVE.SticGlory/c1211/score/b/1:link.info	SDedes
media/en_redirects_goarch/tr.d008/trVE.SticGlory/c1211/score/b/1:link.path	/media/m/dedes/en/tr/d008/ve/b/sticglory.pdf
media/en_redirects_goarch/tr.d008/trVE.SticGlory/c1211/score/w/1:link.info	SDedes
media/en_redirects_goarch/tr.d008/trVE.SticGlory/c1211/score/w/1:link.path	/media/m/dedes/en/tr/d008/ve/w/sticglory.pdf
