media/en_redirects_goarch/me.m03.d21/meVE.SticTheotokion/c1211/audio/1:link.info	SDedes
media/en_redirects_goarch/me.m03.d21/meVE.SticTheotokion/c1211/audio/1:link.path	/media/a/en_public/ho/ho23/troparion5.mp3
media/en_redirects_goarch/me.m03.d21/meVE.SticTheotokion/c1211/score/w/1:link.info	SDedes
media/en_redirects_goarch/me.m03.d21/meVE.SticTheotokion/c1211/score/w/1:link.path	/media/m/dedes/en/ho/ho23/w/troparion5.pdf
media/en_redirects_goarch/me.m03.d21/meVE.Stichera01/c1211/score/w/1:link.info	SDedes
media/en_redirects_goarch/me.m03.d21/meVE.Stichera01/c1211/score/w/1:link.path	/media/m/dedes/en/me/m03/d21/ve/w/stichera01.pdf
media/en_redirects_goarch/me.m03.d21/meVE.Stichera02/c1211/score/w/1:link.info	SDedes
media/en_redirects_goarch/me.m03.d21/meVE.Stichera02/c1211/score/w/1:link.path	/media/m/dedes/en/me/m03/d21/ve/w/stichera02.pdf
media/en_redirects_goarch/me.m03.d21/meVE.Stichera03/c1211/score/w/1:link.info	SDedes
media/en_redirects_goarch/me.m03.d21/meVE.Stichera03/c1211/score/w/1:link.path	/media/m/dedes/en/me/m03/d21/ve/w/stichera03.pdf
