media/en_redirects_goarch/tr.d049/trVE.AposIdiomelon1/c1211/score/b/1:link.info	SDedes | GCremeens
media/en_redirects_goarch/tr.d049/trVE.AposIdiomelon1/c1211/score/b/1:link.path	/media/m/cremeens/en/tr/d049/ve/b/aposidiomelon1.pdf
media/en_redirects_goarch/tr.d049/trVE.AposIdiomelon1/c1211/score/w/1:link.info	SDedes
media/en_redirects_goarch/tr.d049/trVE.AposIdiomelon1/c1211/score/w/1:link.path	/media/m/dedes/en/tr/d049/ve/w/aposidiomelon1.pdf
