media/en_redirects_goarch/me.m11.d17/meMA.ExapTheotokion/c1211/score/w/1:link.info	SDedes
media/en_redirects_goarch/me.m11.d17/meMA.ExapTheotokion/c1211/score/w/1:link.path	/media/m/dedes/en/me/m11/d17/ma/w/exaptheotokion.pdf
media/en_redirects_goarch/me.m11.d17/meMA.Exaposteilarion1/c1211/score/w/1:link.info	SDedes
media/en_redirects_goarch/me.m11.d17/meMA.Exaposteilarion1/c1211/score/w/1:link.path	/media/m/dedes/en/me/m11/d17/ma/w/exaposteilarion1.pdf
media/en_redirects_goarch/me.m11.d17/meMA.MM.Lauds1123as5678/c1211/score/w/1:link.info	SDedes
media/en_redirects_goarch/me.m11.d17/meMA.MM.Lauds1123as5678/c1211/score/w/1:link.path	/media/m/dedes/en/me/m11/d17/ma/w/lauds1123as5678.pdf
media/en_redirects_goarch/me.m11.d17/meVE.Apolytikion1/c1211/score/b/1:link.info	GRallis
media/en_redirects_goarch/me.m11.d17/meVE.Apolytikion1/c1211/score/b/1:link.path	/media/m/rallis/en/me/m11/d17/ve/b/apolytikion1.pdf
media/en_redirects_goarch/me.m11.d17/meVE.Apolytikion1/c1211/score/w/1:link.info	SDedes
media/en_redirects_goarch/me.m11.d17/meVE.Apolytikion1/c1211/score/w/1:link.path	/media/m/dedes/en/me/m11/d17/ve/w/apolytikion1.pdf
media/en_redirects_goarch/me.m11.d17/meVE.Apolytikion1/c2001/score/w/1:link.info	NewByz
media/en_redirects_goarch/me.m11.d17/meVE.Apolytikion1/c2001/score/w/1:link.path	/media/m/newbyz/en/me/m11/d17/ve/w/apolytikion1.pdf
