media/en_redirects_goarch/me.m10.d23/alt1.meMA.Kathisma11/c1211/score/w/1:link.info	SDedes
media/en_redirects_goarch/me.m10.d23/alt1.meMA.Kathisma11/c1211/score/w/1:link.path	/media/m/dedes/en/me/m10/d23/ma/w/kathisma11.pdf
media/en_redirects_goarch/me.m10.d23/alt1.meMA.Kathisma1T/c1211/score/w/1:link.info	SDedes
media/en_redirects_goarch/me.m10.d23/alt1.meMA.Kathisma1T/c1211/score/w/1:link.path	/media/m/dedes/en/me/m10/d23/ma/w/kathisma1t.pdf
media/en_redirects_goarch/me.m10.d23/alt1.meMA.Kathisma21/c1211/score/w/1:link.info	SDedes
media/en_redirects_goarch/me.m10.d23/alt1.meMA.Kathisma21/c1211/score/w/1:link.path	/media/m/dedes/en/me/m10/d23/ma/w/kathisma21.pdf
media/en_redirects_goarch/me.m10.d23/alt1.meMA.Kathisma2T/c1211/score/w/1:link.info	SDedes
media/en_redirects_goarch/me.m10.d23/alt1.meMA.Kathisma2T/c1211/score/w/1:link.path	/media/m/dedes/en/me/m10/d23/ma/w/kathisma2t.pdf
media/en_redirects_goarch/me.m10.d23/alt1.meMA.Kathisma31/c1211/score/w/1:link.info	SDedes
media/en_redirects_goarch/me.m10.d23/alt1.meMA.Kathisma31/c1211/score/w/1:link.path	/media/m/dedes/en/me/m10/d23/ma/w/kathisma31.pdf
media/en_redirects_goarch/me.m10.d23/alt1.meMA.Kathisma3T/c1211/score/w/1:link.info	SDedes
media/en_redirects_goarch/me.m10.d23/alt1.meMA.Kathisma3T/c1211/score/w/1:link.path	/media/m/dedes/en/me/m10/d23/ma/w/kathisma3t.pdf
media/en_redirects_goarch/me.m10.d23/alt1.meMA.PostGospelGlory/c1211/score/b/1:link.info	SDedes
media/en_redirects_goarch/me.m10.d23/alt1.meMA.PostGospelGlory/c1211/score/b/1:link.path	/media/m/dedes/en/ho/ho03/b/postgospelglory_apostle.pdf
media/en_redirects_goarch/me.m10.d23/alt1.meMA.PostGospelGlory/c1211/score/w/1:link.info	SDedes
media/en_redirects_goarch/me.m10.d23/alt1.meMA.PostGospelGlory/c1211/score/w/1:link.path	/media/m/dedes/en/ho/ho03/w/postgospelglory_apostle.pdf
media/en_redirects_goarch/me.m10.d23/alt1.meMA.PostGospelIdiomelon/c1211/score/w/1:link.info	SDedes
media/en_redirects_goarch/me.m10.d23/alt1.meMA.PostGospelIdiomelon/c1211/score/w/1:link.path	/media/m/dedes/en/me/m10/d23/ma/w/postgospelidiomelon.pdf
media/en_redirects_goarch/me.m10.d23/meLI.Kontakion1/c1211/audio/1:link.info	SDedes
media/en_redirects_goarch/me.m10.d23/meLI.Kontakion1/c1211/audio/1:link.path	/media/a/en_public/me/m10/d23/li/kontakion1.mp3
media/en_redirects_goarch/me.m10.d23/meLI.Kontakion1/c1211/score/w/1:link.info	SDedes
media/en_redirects_goarch/me.m10.d23/meLI.Kontakion1/c1211/score/w/1:link.path	/media/m/dedes/en/me/m10/d23/li/w/kontakion1.pdf
media/en_redirects_goarch/me.m10.d23/meMA.ExapTheotokion/c1211/score/w/1:link.info	SDedes
media/en_redirects_goarch/me.m10.d23/meMA.ExapTheotokion/c1211/score/w/1:link.path	/media/m/dedes/en/me/m10/d23/ma/w/exaptheotokion.pdf
media/en_redirects_goarch/me.m10.d23/meMA.Exaposteilarion1/c1211/score/w/1:link.info	SDedes
media/en_redirects_goarch/me.m10.d23/meMA.Exaposteilarion1/c1211/score/w/1:link.path	/media/m/dedes/en/me/m10/d23/ma/w/exaposteilarion1.pdf
media/en_redirects_goarch/me.m10.d23/meMA.Lauds1/c1211/score/w/1:link.info	SDedes
media/en_redirects_goarch/me.m10.d23/meMA.Lauds1/c1211/score/w/1:link.path	/media/m/dedes/en/me/m10/d23/ma/w/lauds1.pdf
media/en_redirects_goarch/me.m10.d23/meMA.Lauds2/c1211/score/w/1:link.info	SDedes
media/en_redirects_goarch/me.m10.d23/meMA.Lauds2/c1211/score/w/1:link.path	/media/m/dedes/en/me/m10/d23/ma/w/lauds2.pdf
media/en_redirects_goarch/me.m10.d23/meMA.Lauds3/c1211/score/w/1:link.info	SDedes
media/en_redirects_goarch/me.m10.d23/meMA.Lauds3/c1211/score/w/1:link.path	/media/m/dedes/en/me/m10/d23/ma/w/lauds3.pdf
media/en_redirects_goarch/me.m10.d23/meMA.LaudsGlory/c1211/score/w/1:link.info	SDedes
media/en_redirects_goarch/me.m10.d23/meMA.LaudsGlory/c1211/score/w/1:link.path	/media/m/dedes/en/me/m10/d23/ma/w/laudsglory.pdf
media/en_redirects_goarch/me.m10.d23/meMA.MM.Lauds1123as5678/c1211/score/w/1:link.info	SDedes
media/en_redirects_goarch/me.m10.d23/meMA.MM.Lauds1123as5678/c1211/score/w/1:link.path	/media/m/dedes/en/me/m10/d23/ma/w/lauds1123as5678.pdf
media/en_redirects_goarch/me.m10.d23/meVE.Apolytikion1/c1211/audio/1:link.info	SDedes
media/en_redirects_goarch/me.m10.d23/meVE.Apolytikion1/c1211/audio/1:link.path	/media/a/en_public/me/m10/d23/ve/apolytikion1.mp3
media/en_redirects_goarch/me.m10.d23/meVE.Apolytikion1/c1211/score/w/1:link.info	SDedes
media/en_redirects_goarch/me.m10.d23/meVE.Apolytikion1/c1211/score/w/1:link.path	/media/m/dedes/en/me/m10/d23/ve/w/apolytikion1.pdf
media/en_redirects_goarch/me.m10.d23/meVE.Apolytikion1/c2001/score/w/1:link.info	NewByz
media/en_redirects_goarch/me.m10.d23/meVE.Apolytikion1/c2001/score/w/1:link.path	/media/m/newbyz/en/me/m10/d23/ve/w/apolytikion1.pdf
