media/en_redirects_goarch/me.m07.d05/meVE.Apolytikion1/c1211/score/w/1:link.info	SDedes
media/en_redirects_goarch/me.m07.d05/meVE.Apolytikion1/c1211/score/w/1:link.path	/media/m/dedes/en/me/m07/d05/ve/w/apolytikion1.pdf
media/en_redirects_goarch/me.m07.d05/meVE.Apolytikion1/c2001/score/w/1:link.info	NewByz
media/en_redirects_goarch/me.m07.d05/meVE.Apolytikion1/c2001/score/w/1:link.path	/media/m/newbyz/en/me/m07/d05/ve/w/apolytikion1.pdf
media/en_redirects_goarch/me.m07.d05/meVE.LityBoth/c1211/score/b/1:link.info	SDedes
media/en_redirects_goarch/me.m07.d05/meVE.LityBoth/c1211/score/b/1:link.path	/media/m/dedes/en/me/m12/d06/ma/b/laudstheotokion.pdf
media/en_redirects_goarch/me.m07.d05/meVE.LityBoth/c1211/score/w/1:link.info	SDedes
media/en_redirects_goarch/me.m07.d05/meVE.LityBoth/c1211/score/w/1:link.path	/media/m/dedes/en/me/m12/d06/ma/w/laudstheotokion.pdf
media/en_redirects_goarch/me.m07.d05/meVE.Stichera04/c1211/score/w/1:link.info	SDedes
media/en_redirects_goarch/me.m07.d05/meVE.Stichera04/c1211/score/w/1:link.path	/media/m/dedes/en/me/m07/d05/ve/w/stichera04.pdf
media/en_redirects_goarch/me.m07.d05/meVE.Stichera05/c1211/score/w/1:link.info	SDedes
media/en_redirects_goarch/me.m07.d05/meVE.Stichera05/c1211/score/w/1:link.path	/media/m/dedes/en/me/m07/d05/ve/w/stichera05.pdf
media/en_redirects_goarch/me.m07.d05/meVE.Stichera06/c1211/score/w/1:link.info	SDedes
media/en_redirects_goarch/me.m07.d05/meVE.Stichera06/c1211/score/w/1:link.path	/media/m/dedes/en/me/m07/d05/ve/w/stichera06.pdf
