media/en_redirects_goarch/eo.e05/eo.Doxasticon/c1211/score/b/1:link.info	SDedes
media/en_redirects_goarch/eo.e05/eo.Doxasticon/c1211/score/b/1:link.path	/media/m/dedes/en/eo/e05/b/eodoxasticon.pdf
media/en_redirects_goarch/eo.e05/eo.Doxasticon/c1211/score/w/1:link.info	SDedes
media/en_redirects_goarch/eo.e05/eo.Doxasticon/c1211/score/w/1:link.path	/media/m/dedes/en/eo/e05/w/eodoxasticon.pdf
media/en_redirects_goarch/eo.e05/eo.Exaposteilarion/c1211/score/b/1:link.info	SDedes
media/en_redirects_goarch/eo.e05/eo.Exaposteilarion/c1211/score/b/1:link.path	/media/m/dedes/en/eo/e05/b/eoexaposteilarion.pdf
media/en_redirects_goarch/eo.e05/eo.Exaposteilarion/c1211/score/w/1:link.info	SDedes
media/en_redirects_goarch/eo.e05/eo.Exaposteilarion/c1211/score/w/1:link.path	/media/m/dedes/en/eo/e05/w/eoexaposteilarion.pdf
media/en_redirects_goarch/eo.e05/eo.Theotokion/c1211/score/b/1:link.info	SDedes
media/en_redirects_goarch/eo.e05/eo.Theotokion/c1211/score/b/1:link.path	/media/m/dedes/en/eo/e05/b/eotheotokion.pdf
media/en_redirects_goarch/eo.e05/eo.Theotokion/c1211/score/w/1:link.info	SDedes
media/en_redirects_goarch/eo.e05/eo.Theotokion/c1211/score/w/1:link.path	/media/m/dedes/en/eo/e05/w/eotheotokion.pdf
