media/en_redirects_goarch/tr.d029/trMA.ExapTheotokion/c1211/score/w/1:link.info	SDedes
media/en_redirects_goarch/tr.d029/trMA.ExapTheotokion/c1211/score/w/1:link.path	/media/m/dedes/en/tr/d029/ma/w/exaptheotokion.pdf
media/en_redirects_goarch/tr.d029/trMA.Exaposteilarion1/c1211/score/w/1:link.info	SDedes
media/en_redirects_goarch/tr.d029/trMA.Exaposteilarion1/c1211/score/w/1:link.path	/media/m/dedes/en/tr/d029/ma/w/exaposteilarion1.pdf
media/en_redirects_goarch/tr.d029/trMA.LaudsGlory/c1221/score/b/1:link.info	SDedes
media/en_redirects_goarch/tr.d029/trMA.LaudsGlory/c1221/score/b/1:link.path	/media/m/dedes/en/tr/d029/ma/b/laudsglory.pdf
media/en_redirects_goarch/tr.d029/trMA.LaudsGlory/c1221/score/w/1:link.info	SDedes
media/en_redirects_goarch/tr.d029/trMA.LaudsGlory/c1221/score/w/1:link.path	/media/m/dedes/en/tr/d029/ma/w/laudsglory.pdf
media/en_redirects_goarch/tr.d029/trMA.MM.Lauds1123as5678/c1211/score/w/1:link.info	SDedes
media/en_redirects_goarch/tr.d029/trMA.MM.Lauds1123as5678/c1211/score/w/1:link.path	/media/m/dedes/en/tr/d029/ma/w/lauds1123as5678.pdf
media/en_redirects_goarch/tr.d029/trVE.ApolTheotokion/c1211/score/w/1:link.info	SDedes
media/en_redirects_goarch/tr.d029/trVE.ApolTheotokion/c1211/score/w/1:link.path	/media/m/dedes/en/oc/m2/d1/ve/w/apoltheotokionvm.pdf
media/en_redirects_goarch/tr.d029/trVE.Apolytikion1/c1211/score/w/1:link.info	SDedes
media/en_redirects_goarch/tr.d029/trVE.Apolytikion1/c1211/score/w/1:link.path	/media/m/dedes/en/tr/d029/ve/w/apolytikion1.pdf
media/en_redirects_goarch/tr.d029/trVE.Apolytikion1/c2001/score/w/1:link.info	NewByz
media/en_redirects_goarch/tr.d029/trVE.Apolytikion1/c2001/score/w/1:link.path	/media/m/newbyz/en/tr/d029/ve/w/apolytikion1.pdf
media/en_redirects_goarch/tr.d029/trVE.AposGlory/c1211/score/b/1:link.info	SDedes
media/en_redirects_goarch/tr.d029/trVE.AposGlory/c1211/score/b/1:link.path	/media/m/dedes/en/tr/d029/ve/b/aposglory.pdf
media/en_redirects_goarch/tr.d029/trVE.AposGlory/c1211/score/w/1:link.info	SDedes
media/en_redirects_goarch/tr.d029/trVE.AposGlory/c1211/score/w/1:link.path	/media/m/dedes/en/tr/d029/ve/w/aposglory.pdf
media/en_redirects_goarch/tr.d029/trVE.SticGlory/c1211/score/b/1:link.info	SDedes
media/en_redirects_goarch/tr.d029/trVE.SticGlory/c1211/score/b/1:link.path	/media/m/dedes/en/tr/d029/ve/b/sticglory.pdf
media/en_redirects_goarch/tr.d029/trVE.SticGlory/c1211/score/w/1:link.info	SDedes
media/en_redirects_goarch/tr.d029/trVE.SticGlory/c1211/score/w/1:link.path	/media/m/dedes/en/tr/d029/ve/w/sticglory.pdf
media/en_redirects_goarch/tr.d029/trVE.Stichera01/c1211/score/w/1:link.info	SDedes
media/en_redirects_goarch/tr.d029/trVE.Stichera01/c1211/score/w/1:link.path	/media/m/dedes/en/tr/d029/ve/w/stichera01.pdf
media/en_redirects_goarch/tr.d029/trVE.Stichera02/c1211/score/w/1:link.info	SDedes
media/en_redirects_goarch/tr.d029/trVE.Stichera02/c1211/score/w/1:link.path	/media/m/dedes/en/tr/d029/ve/w/stichera02.pdf
media/en_redirects_goarch/tr.d029/trVE.Stichera03/c1211/score/w/1:link.info	SDedes
media/en_redirects_goarch/tr.d029/trVE.Stichera03/c1211/score/w/1:link.path	/media/m/dedes/en/tr/d029/ve/w/stichera03.pdf
media/en_redirects_goarch/tr.d029/trVE.Stichera04/c1211/score/w/1:link.info	SDedes
media/en_redirects_goarch/tr.d029/trVE.Stichera04/c1211/score/w/1:link.path	/media/m/dedes/en/tr/d029/ve/w/stichera04.pdf
