media/en_redirects_goarch/me.m12.d17/alt1.meMA.LaudsBoth/c1211/score/b/1:link.info	SDedes
media/en_redirects_goarch/me.m12.d17/alt1.meMA.LaudsBoth/c1211/score/b/1:link.path	/media/m/barrett/en/me/m12/d06/ve/b/lityboth.pdf
media/en_redirects_goarch/me.m12.d17/alt1.meMA.LaudsBoth/c1211/score/w/1:link.info	SDedes
media/en_redirects_goarch/me.m12.d17/alt1.meMA.LaudsBoth/c1211/score/w/1:link.path	/media/m/dedes/en/me/m12/d06/ve/w/lityboth.pdf
media/en_redirects_goarch/me.m12.d17/alt1.meVE.Apolytikion1/c1211/score/w/1:link.info	SDedes
media/en_redirects_goarch/me.m12.d17/alt1.meVE.Apolytikion1/c1211/score/w/1:link.path	/media/m/dedes/en/me/m12/d17/ve/w/alt1apolytikion1.pdf
media/en_redirects_goarch/me.m12.d17/alt1.meVE.AposBoth/c1211/score/b/1:link.info	SDedes
media/en_redirects_goarch/me.m12.d17/alt1.meVE.AposBoth/c1211/score/b/1:link.path	/media/m/dedes/en/me/m11/d30/ma/b/laudsboth.pdf
media/en_redirects_goarch/me.m12.d17/alt1.meVE.AposBoth/c1211/score/w/1:link.info	SDedes
media/en_redirects_goarch/me.m12.d17/alt1.meVE.AposBoth/c1211/score/w/1:link.path	/media/m/dedes/en/me/m11/d30/ma/w/laudsboth.pdf
media/en_redirects_goarch/me.m12.d17/alt1.meVE.SticBoth/c1211/score/b/1:link.info	SDedes
media/en_redirects_goarch/me.m12.d17/alt1.meVE.SticBoth/c1211/score/b/1:link.path	/media/m/dedes/en/me/m12/d06/ve/b/aposboth.pdf
media/en_redirects_goarch/me.m12.d17/alt1.meVE.SticBoth/c1211/score/w/1:link.info	SDedes
media/en_redirects_goarch/me.m12.d17/alt1.meVE.SticBoth/c1211/score/w/1:link.path	/media/m/dedes/en/me/m12/d06/ve/w/aposboth.pdf
media/en_redirects_goarch/me.m12.d17/meMA.ExapTheotokion/c1211/score/w/1:link.info	SDedes
media/en_redirects_goarch/me.m12.d17/meMA.ExapTheotokion/c1211/score/w/1:link.path	/media/m/dedes/en/me/m12/d17/ma/w/exaptheotokion.pdf
media/en_redirects_goarch/me.m12.d17/meVE.Apolytikion1/c1211/score/w/1:link.info	SDedes
media/en_redirects_goarch/me.m12.d17/meVE.Apolytikion1/c1211/score/w/1:link.path	/media/m/dedes/en/me/m12/d17/ve/w/apolytikion1.pdf
media/en_redirects_goarch/me.m12.d17/meVE.AposBoth/c1211/score/b/1:link.info	SDedes
media/en_redirects_goarch/me.m12.d17/meVE.AposBoth/c1211/score/b/1:link.path	/media/m/dedes/en/me/m12/d17/ve/b/aposboth.pdf
media/en_redirects_goarch/me.m12.d17/meVE.AposBoth/c1211/score/w/1:link.info	SDedes
media/en_redirects_goarch/me.m12.d17/meVE.AposBoth/c1211/score/w/1:link.path	/media/m/dedes/en/me/m12/d17/ve/w/aposboth.pdf
