media/en_redirects_goarch/me.m07.d17/meMA.ExapTheotokion/c1211/score/w/1:link.info	SDedes
media/en_redirects_goarch/me.m07.d17/meMA.ExapTheotokion/c1211/score/w/1:link.path	/media/m/dedes/en/me/m07/d17/ma/w/exaptheotokion.pdf
media/en_redirects_goarch/me.m07.d17/meMA.Exaposteilarion1/c1211/score/w/1:link.info	SDedes
media/en_redirects_goarch/me.m07.d17/meMA.Exaposteilarion1/c1211/score/w/1:link.path	/media/m/dedes/en/me/m07/d17/ma/w/exaposteilarion1.pdf
media/en_redirects_goarch/me.m07.d17/meMA.Kathisma11/c1211/score/w/1:link.info	SDedes
media/en_redirects_goarch/me.m07.d17/meMA.Kathisma11/c1211/score/w/1:link.path	/media/m/dedes/en/me/m07/d17/ma/w/kathisma11.pdf
media/en_redirects_goarch/me.m07.d17/meMA.Kathisma1T/c1211/score/w/1:link.info	SDedes
media/en_redirects_goarch/me.m07.d17/meMA.Kathisma1T/c1211/score/w/1:link.path	/media/m/dedes/en/me/m07/d17/ma/w/kathisma1t.pdf
media/en_redirects_goarch/me.m07.d17/meMA.Kathisma21/c1211/score/w/1:link.info	SDedes
media/en_redirects_goarch/me.m07.d17/meMA.Kathisma21/c1211/score/w/1:link.path	/media/m/dedes/en/me/m07/d17/ma/w/kathisma21.pdf
media/en_redirects_goarch/me.m07.d17/meMA.Kathisma2T/c1211/score/w/1:link.info	SDedes
media/en_redirects_goarch/me.m07.d17/meMA.Kathisma2T/c1211/score/w/1:link.path	/media/m/dedes/en/oc/m1/d1/ma/w/kathisma13.pdf
media/en_redirects_goarch/me.m07.d17/meMA.Lauds1/c1211/score/w/1:link.info	SDedes
media/en_redirects_goarch/me.m07.d17/meMA.Lauds1/c1211/score/w/1:link.path	/media/m/dedes/en/me/m07/d17/ma/w/lauds1.pdf
media/en_redirects_goarch/me.m07.d17/meMA.Lauds2/c1211/score/w/1:link.info	SDedes
media/en_redirects_goarch/me.m07.d17/meMA.Lauds2/c1211/score/w/1:link.path	/media/m/dedes/en/me/m07/d17/ma/w/lauds2.pdf
media/en_redirects_goarch/me.m07.d17/meMA.Lauds3/c1211/score/w/1:link.info	SDedes
media/en_redirects_goarch/me.m07.d17/meMA.Lauds3/c1211/score/w/1:link.path	/media/m/dedes/en/me/m07/d17/ma/w/lauds3.pdf
media/en_redirects_goarch/me.m07.d17/meMA.LaudsGlory/c1211/score/b/1:link.info	SDedes
media/en_redirects_goarch/me.m07.d17/meMA.LaudsGlory/c1211/score/b/1:link.path	/media/m/dedes/en/me/m07/d17/ma/b/laudsglory.pdf
media/en_redirects_goarch/me.m07.d17/meMA.LaudsGlory/c1211/score/w/1:link.info	SDedes
media/en_redirects_goarch/me.m07.d17/meMA.LaudsGlory/c1211/score/w/1:link.path	/media/m/dedes/en/me/m07/d17/ma/w/laudsglory.pdf
media/en_redirects_goarch/me.m07.d17/meMA.MM.Lauds123as678/c1211/score/w/1:link.info	SDedes
media/en_redirects_goarch/me.m07.d17/meMA.MM.Lauds123as678/c1211/score/w/1:link.path	/media/m/dedes/en/me/m07/d17/ma/w/lauds123as678.pdf
media/en_redirects_goarch/me.m07.d17/meVE.Apolytikion1ger/c1211/score/w/1:link.info	SDedes
media/en_redirects_goarch/me.m07.d17/meVE.Apolytikion1ger/c1211/score/w/1:link.path	/media/m/dedes/en/me/m07/d17/ve/w/apolytikion1.pdf
media/en_redirects_goarch/me.m07.d17/meVE.AposGlory/c1211/score/b/1:link.info	SDedes
media/en_redirects_goarch/me.m07.d17/meVE.AposGlory/c1211/score/b/1:link.path	/media/m/dedes/en/me/m07/d07/ve/b/sticglory.pdf
media/en_redirects_goarch/me.m07.d17/meVE.AposGlory/c1211/score/w/1:link.info	SDedes
media/en_redirects_goarch/me.m07.d17/meVE.AposGlory/c1211/score/w/1:link.path	/media/m/dedes/en/me/m07/d07/ve/w/sticglory.pdf
media/en_redirects_goarch/me.m07.d17/meVE.LityBoth/c1211/score/b/1:link.info	SDedes
media/en_redirects_goarch/me.m07.d17/meVE.LityBoth/c1211/score/b/1:link.path	/media/m/dedes/en/oc/m5/d3/ve/b/apostheotokion.pdf
media/en_redirects_goarch/me.m07.d17/meVE.LityBoth/c1211/score/w/1:link.info	SDedes
media/en_redirects_goarch/me.m07.d17/meVE.LityBoth/c1211/score/w/1:link.path	/media/m/dedes/en/oc/m5/d3/ve/w/apostheotokion.pdf
