media/en_redirects_goarch/me.m10.d09/meMA.ExapTheotokion/c1211/score/w/1:link.info	SDedes
media/en_redirects_goarch/me.m10.d09/meMA.ExapTheotokion/c1211/score/w/1:link.path	/media/m/dedes/en/me/m10/d09/ma/w/exaptheotokion.pdf
media/en_redirects_goarch/me.m10.d09/meMA.Exaposteilarion1/c1211/score/w/1:link.info	SDedes
media/en_redirects_goarch/me.m10.d09/meMA.Exaposteilarion1/c1211/score/w/1:link.path	/media/m/dedes/en/me/m10/d09/ma/w/exaposteilarion1.pdf
media/en_redirects_goarch/me.m10.d09/meMA.MM.Lauds1123as5678/c1211/score/w/1:link.info	SDedes
media/en_redirects_goarch/me.m10.d09/meMA.MM.Lauds1123as5678/c1211/score/w/1:link.path	/media/m/dedes/en/me/m10/d09/ma/w/lauds1123as5678.pdf
media/en_redirects_goarch/me.m10.d09/meVE.MM.GeneralApolytikion1/c1211/score/w/1:link.info	SDedes
media/en_redirects_goarch/me.m10.d09/meVE.MM.GeneralApolytikion1/c1211/score/w/1:link.path	/media/m/dedes/en/me/m10/d09/ve/w/generalapolytikion1.pdf
media/en_redirects_goarch/me.m10.d09/meVE.MM.GeneralApolytikion1/c2001/score/w/1:link.info	NewByz
media/en_redirects_goarch/me.m10.d09/meVE.MM.GeneralApolytikion1/c2001/score/w/1:link.path	/media/m/newbyz/en/me/m10/d09/ve/w/generalapolytikion1.pdf
media/en_redirects_goarch/me.m10.d09/meVE.MM.GeneralApolytikion3/c1211/score/w/1:link.info	SDedes
media/en_redirects_goarch/me.m10.d09/meVE.MM.GeneralApolytikion3/c1211/score/w/1:link.path	/media/m/dedes/en/me/m10/d09/ve/w/generalapolytikion3.pdf
