media/en_redirects_goarch/me.m07.d20/alt1.meMA.Kathisma32/c1211/score/w/1:link.info	SDedes
media/en_redirects_goarch/me.m07.d20/alt1.meMA.Kathisma32/c1211/score/w/1:link.path	/media/m/dedes/en/me/m07/d20/ma/w/kathisma32.pdf
media/en_redirects_goarch/me.m07.d20/alt1.meMA.Kathisma3T/c1211/score/w/1:link.info	SDedes
media/en_redirects_goarch/me.m07.d20/alt1.meMA.Kathisma3T/c1211/score/w/1:link.path	/media/m/dedes/en/me/m07/d20/ma/w/kathisma3t.pdf
media/en_redirects_goarch/me.m07.d20/alt1.meMA.PostGospelGlory/c1211/score/b/1:link.info	SDedes
media/en_redirects_goarch/me.m07.d20/alt1.meMA.PostGospelGlory/c1211/score/b/1:link.path	/media/m/dedes/en/ho/ho03/b/postgospelglory_prophet.pdf
media/en_redirects_goarch/me.m07.d20/alt1.meMA.PostGospelGlory/c1211/score/w/1:link.info	SDedes
media/en_redirects_goarch/me.m07.d20/alt1.meMA.PostGospelGlory/c1211/score/w/1:link.path	/media/m/dedes/en/ho/ho03/w/postgospelglory_prophet.pdf
media/en_redirects_goarch/me.m07.d20/alt1.meMA.PostGospelIdiomelon/c1211/score/b/1:link.info	SDedes
media/en_redirects_goarch/me.m07.d20/alt1.meMA.PostGospelIdiomelon/c1211/score/b/1:link.path	/media/m/dedes/en/me/m07/d20/ma/b/postgospelidiomelon.pdf
media/en_redirects_goarch/me.m07.d20/alt1.meMA.PostGospelIdiomelon/c1211/score/w/1:link.info	SDedes
media/en_redirects_goarch/me.m07.d20/alt1.meMA.PostGospelIdiomelon/c1211/score/w/1:link.path	/media/m/dedes/en/me/m07/d20/ma/w/postgospelidiomelon.pdf
media/en_redirects_goarch/me.m07.d20/meLI.MM.Beatitudes.Ode3C1as5678/c1211/score/w/1:link.info	SDedes
media/en_redirects_goarch/me.m07.d20/meLI.MM.Beatitudes.Ode3C1as5678/c1211/score/w/1:link.path	/media/m/dedes/en/me/m07/d20/ma/w/ode3c11.pdf
media/en_redirects_goarch/me.m07.d20/meLI.MM.Beatitudes.Ode6C2as910GB/c1211/score/w/1:link.info	SDedes
media/en_redirects_goarch/me.m07.d20/meLI.MM.Beatitudes.Ode6C2as910GB/c1211/score/w/1:link.path	/media/m/dedes/en/me/m07/d20/ma/w/ode6c21.pdf
media/en_redirects_goarch/me.m07.d20/meMA.ExapTheotokion/c1211/score/w/1:link.info	SDedes
media/en_redirects_goarch/me.m07.d20/meMA.ExapTheotokion/c1211/score/w/1:link.path	/media/m/dedes/en/me/m07/d20/ma/w/exaptheotokion.pdf
media/en_redirects_goarch/me.m07.d20/meMA.Exaposteilarion1/c1211/score/w/1:link.info	SDedes
media/en_redirects_goarch/me.m07.d20/meMA.Exaposteilarion1/c1211/score/w/1:link.path	/media/m/dedes/en/me/m07/d20/ma/w/exaposteilarion1.pdf
media/en_redirects_goarch/me.m07.d20/meMA.Kathisma11/c1211/score/w/1:link.info	SDedes
media/en_redirects_goarch/me.m07.d20/meMA.Kathisma11/c1211/score/w/1:link.path	/media/m/dedes/en/me/m07/d20/ma/w/kathisma11.pdf
media/en_redirects_goarch/me.m07.d20/meMA.Kathisma1T/c1211/score/w/1:link.info	SDedes
media/en_redirects_goarch/me.m07.d20/meMA.Kathisma1T/c1211/score/w/1:link.path	/media/m/dedes/en/oc/m1/d1/ma/w/kathisma13.pdf
media/en_redirects_goarch/me.m07.d20/meMA.Kathisma21/c1211/score/w/1:link.info	SDedes
media/en_redirects_goarch/me.m07.d20/meMA.Kathisma21/c1211/score/w/1:link.path	/media/m/dedes/en/me/m07/d20/ma/w/kathisma21.pdf
media/en_redirects_goarch/me.m07.d20/meMA.Kathisma2T/c1211/score/w/1:link.info	SDedes
media/en_redirects_goarch/me.m07.d20/meMA.Kathisma2T/c1211/score/w/1:link.path	/media/m/dedes/en/oc/m1/d1/ma/w/kathisma23.pdf
media/en_redirects_goarch/me.m07.d20/meMA.Lauds1/c1211/score/w/1:link.info	SDedes
media/en_redirects_goarch/me.m07.d20/meMA.Lauds1/c1211/score/w/1:link.path	/media/m/dedes/en/me/m07/d20/ma/w/lauds1.pdf
media/en_redirects_goarch/me.m07.d20/meMA.Lauds2/c1211/score/w/1:link.info	SDedes
media/en_redirects_goarch/me.m07.d20/meMA.Lauds2/c1211/score/w/1:link.path	/media/m/dedes/en/me/m07/d20/ma/w/lauds2.pdf
media/en_redirects_goarch/me.m07.d20/meMA.Lauds3/c1211/score/w/1:link.info	SDedes
media/en_redirects_goarch/me.m07.d20/meMA.Lauds3/c1211/score/w/1:link.path	/media/m/dedes/en/me/m07/d20/ma/w/lauds3.pdf
media/en_redirects_goarch/me.m07.d20/meMA.LaudsGlory/c1211/score/b/1:link.info	SDedes
media/en_redirects_goarch/me.m07.d20/meMA.LaudsGlory/c1211/score/b/1:link.path	/media/m/dedes/en/me/m07/d20/ma/b/laudsglory.pdf
media/en_redirects_goarch/me.m07.d20/meMA.LaudsGlory/c1211/score/w/1:link.info	SDedes
media/en_redirects_goarch/me.m07.d20/meMA.LaudsGlory/c1211/score/w/1:link.path	/media/m/dedes/en/me/m07/d20/ma/w/laudsglory.pdf
media/en_redirects_goarch/me.m07.d20/meMA.MM.Lauds1123as5678/c1211/score/w/1:link.info	SDedes
media/en_redirects_goarch/me.m07.d20/meMA.MM.Lauds1123as5678/c1211/score/w/1:link.path	/media/m/dedes/en/me/m07/d20/ma/w/lauds1123as5678.pdf
media/en_redirects_goarch/me.m07.d20/meMA.Ode1C21/c1321/score/w/1:link.info	SDedes
media/en_redirects_goarch/me.m07.d20/meMA.Ode1C21/c1321/score/w/1:link.path	/media/m/dedes/en/me/m07/d20/ma/w/ode1c21.pdf
media/en_redirects_goarch/me.m07.d20/meMA.Ode3C11/c1211/score/w/1:link.info	SDedes
media/en_redirects_goarch/me.m07.d20/meMA.Ode3C11/c1211/score/w/1:link.path	/media/m/dedes/en/me/m07/d20/ma/w/ode3c11.pdf
media/en_redirects_goarch/me.m07.d20/meMA.Ode3C21/c1211/score/w/1:link.info	SDedes
media/en_redirects_goarch/me.m07.d20/meMA.Ode3C21/c1211/score/w/1:link.path	/media/m/dedes/en/me/m07/d20/ma/w/ode3c21.pdf
media/en_redirects_goarch/me.m07.d20/meMA.Ode3Kathisma1/c1211/score/w/1:link.info	SDedes
media/en_redirects_goarch/me.m07.d20/meMA.Ode3Kathisma1/c1211/score/w/1:link.path	/media/m/dedes/en/me/m07/d20/ma/w/ode3kathisma1.pdf
media/en_redirects_goarch/me.m07.d20/meMA.Ode3KathismaT/c1211/score/w/1:link.info	SDedes
media/en_redirects_goarch/me.m07.d20/meMA.Ode3KathismaT/c1211/score/w/1:link.path	/media/m/dedes/en/me/m07/d20/ma/w/ode3kathismaT.pdf
media/en_redirects_goarch/me.m07.d20/meMA.Ode4C11/c1211/score/w/1:link.info	SDedes
media/en_redirects_goarch/me.m07.d20/meMA.Ode4C11/c1211/score/w/1:link.path	/media/m/dedes/en/me/m07/d20/ma/w/ode4c11.pdf
media/en_redirects_goarch/me.m07.d20/meMA.Ode5C11/c1321/score/w/1:link.info	SDedes
media/en_redirects_goarch/me.m07.d20/meMA.Ode5C11/c1321/score/w/1:link.path	/media/m/dedes/en/me/m07/d20/ma/w/ode5c11.pdf
media/en_redirects_goarch/me.m07.d20/meMA.Ode5C21/c1211/score/w/1:link.info	SDedes
media/en_redirects_goarch/me.m07.d20/meMA.Ode5C21/c1211/score/w/1:link.path	/media/m/dedes/en/me/m07/d20/ma/w/ode5c21.pdf
media/en_redirects_goarch/me.m07.d20/meMA.Ode6C11/c1211/score/w/1:link.info	SDedes
media/en_redirects_goarch/me.m07.d20/meMA.Ode6C11/c1211/score/w/1:link.path	/media/m/dedes/en/me/m07/d20/ma/w/ode6c11.pdf
media/en_redirects_goarch/me.m07.d20/meMA.Ode6C21/c1211/score/w/1:link.info	SDedes
media/en_redirects_goarch/me.m07.d20/meMA.Ode6C21/c1211/score/w/1:link.path	/media/m/dedes/en/me/m07/d20/ma/w/ode6c21.pdf
media/en_redirects_goarch/me.m07.d20/meMA.Ode7C21/c1321/score/w/1:link.info	SDedes
media/en_redirects_goarch/me.m07.d20/meMA.Ode7C21/c1321/score/w/1:link.path	/media/m/dedes/en/me/m07/d20/ma/w/ode7c21.pdf
media/en_redirects_goarch/me.m07.d20/meMA.Ode8C11/c1211/score/w/1:link.info	SDedes
media/en_redirects_goarch/me.m07.d20/meMA.Ode8C11/c1211/score/w/1:link.path	/media/m/dedes/en/me/m07/d20/ma/w/ode8c11.pdf
media/en_redirects_goarch/me.m07.d20/meMA.Ode8C21/c1211/score/w/1:link.info	SDedes
media/en_redirects_goarch/me.m07.d20/meMA.Ode8C21/c1211/score/w/1:link.path	/media/m/dedes/en/me/m07/d20/ma/w/ode8c21.pdf
media/en_redirects_goarch/me.m07.d20/meMA.Ode9C11/c1211/score/w/1:link.info	SDedes
media/en_redirects_goarch/me.m07.d20/meMA.Ode9C11/c1211/score/w/1:link.path	/media/m/dedes/en/me/m07/d20/ma/w/ode9c11.pdf
media/en_redirects_goarch/me.m07.d20/meVE.Apolytikion1/c1211/score/w/1:link.info	SDedes
media/en_redirects_goarch/me.m07.d20/meVE.Apolytikion1/c1211/score/w/1:link.path	/media/m/dedes/en/me/m07/d20/ve/w/apolytikion1.pdf
media/en_redirects_goarch/me.m07.d20/meVE.Apolytikion1/c2001/score/w/1:link.info	NewByz
media/en_redirects_goarch/me.m07.d20/meVE.Apolytikion1/c2001/score/w/1:link.path	/media/m/newbyz/en/me/m07/d20/ve/w/apolytikion1.pdf
media/en_redirects_goarch/me.m07.d20/meVE.AposGlory/c1211/score/b/1:link.info	SDedes
media/en_redirects_goarch/me.m07.d20/meVE.AposGlory/c1211/score/b/1:link.path	/media/m/dedes/en/me/m07/d20/ve/b/aposglory.pdf
media/en_redirects_goarch/me.m07.d20/meVE.AposGlory/c1211/score/w/1:link.info	SDedes
media/en_redirects_goarch/me.m07.d20/meVE.AposGlory/c1211/score/w/1:link.path	/media/m/dedes/en/me/m07/d20/ve/w/aposglory.pdf
media/en_redirects_goarch/me.m07.d20/meVE.Aposticha1/c1211/score/w/1:link.info	SDedes
media/en_redirects_goarch/me.m07.d20/meVE.Aposticha1/c1211/score/w/1:link.path	/media/m/dedes/en/me/m07/d20/ve/w/aposticha1.pdf
media/en_redirects_goarch/me.m07.d20/meVE.Aposticha2/c1211/score/w/1:link.info	SDedes
media/en_redirects_goarch/me.m07.d20/meVE.Aposticha2/c1211/score/w/1:link.path	/media/m/dedes/en/me/m07/d20/ve/w/aposticha2.pdf
media/en_redirects_goarch/me.m07.d20/meVE.Aposticha3/c1211/score/w/1:link.info	SDedes
media/en_redirects_goarch/me.m07.d20/meVE.Aposticha3/c1211/score/w/1:link.path	/media/m/dedes/en/me/m07/d20/ve/w/aposticha3.pdf
media/en_redirects_goarch/me.m07.d20/meVE.Lity1/c1211/score/b/1:link.info	JM Boyer
media/en_redirects_goarch/me.m07.d20/meVE.Lity1/c1211/score/b/1:link.path	/media/m/jmboyer/en/me/m07/d20/ve/b/lity1.pdf
media/en_redirects_goarch/me.m07.d20/meVE.Lity2/c1211/score/b/1:link.info	R Barrett
media/en_redirects_goarch/me.m07.d20/meVE.Lity2/c1211/score/b/1:link.path	/media/m/barrett/en/me/m07/d20/ve/b/lity2.pdf
media/en_redirects_goarch/me.m07.d20/meVE.Lity3/c1211/score/b/1:link.info	R Barrett
media/en_redirects_goarch/me.m07.d20/meVE.Lity3/c1211/score/b/1:link.path	/media/m/barrett/en/me/m07/d20/ve/b/lity3.pdf
media/en_redirects_goarch/me.m07.d20/meVE.Lity4/c1211/score/w/1:link.info	SDedes
media/en_redirects_goarch/me.m07.d20/meVE.Lity4/c1211/score/w/1:link.path	/media/m/dedes/en/me/m07/d20/ve/w/lity4.pdf
media/en_redirects_goarch/me.m07.d20/meVE.Lity5/c1211/score/b/1:link.info	JM Boyer
media/en_redirects_goarch/me.m07.d20/meVE.Lity5/c1211/score/b/1:link.path	/media/m/jmboyer/en/me/m07/d20/ve/b/lity5.pdf
media/en_redirects_goarch/me.m07.d20/meVE.LityGlory/c1211/score/w/1:link.info	SDedes
media/en_redirects_goarch/me.m07.d20/meVE.LityGlory/c1211/score/w/1:link.path	/media/m/dedes/en/me/m07/d20/ve/w/lityglory.pdf
media/en_redirects_goarch/me.m07.d20/meVE.SticGlory/c1211/score/b/1:link.info	SDedes
media/en_redirects_goarch/me.m07.d20/meVE.SticGlory/c1211/score/b/1:link.path	/media/m/dedes/en/me/m07/d20/ve/b/sticglory.pdf
media/en_redirects_goarch/me.m07.d20/meVE.SticGlory/c1211/score/w/1:link.info	SDedes
media/en_redirects_goarch/me.m07.d20/meVE.SticGlory/c1211/score/w/1:link.path	/media/m/dedes/en/me/m07/d20/ve/w/sticglory.pdf
media/en_redirects_goarch/me.m07.d20/meVE.Stichera01/c1211/score/w/1:link.info	SDedes
media/en_redirects_goarch/me.m07.d20/meVE.Stichera01/c1211/score/w/1:link.path	/media/m/dedes/en/me/m07/d20/ve/w/stichera01.pdf
media/en_redirects_goarch/me.m07.d20/meVE.Stichera02/c1211/score/w/1:link.info	SDedes
media/en_redirects_goarch/me.m07.d20/meVE.Stichera02/c1211/score/w/1:link.path	/media/m/dedes/en/me/m07/d20/ve/w/stichera02.pdf
media/en_redirects_goarch/me.m07.d20/meVE.Stichera03/c1211/score/w/1:link.info	SDedes
media/en_redirects_goarch/me.m07.d20/meVE.Stichera03/c1211/score/w/1:link.path	/media/m/dedes/en/me/m07/d20/ve/w/stichera03.pdf
