media/en_redirects_goarch/tr.d066/trMA.AposGlory/c1211/audio/1:link.info	SDedes
media/en_redirects_goarch/tr.d066/trMA.AposGlory/c1211/audio/1:link.path	/media/a/en_public/tr/d066/ma/aposglory.mp3
media/en_redirects_goarch/tr.d066/trMA.AposGlory/c1211/score/b/1:link.info	SDedes
media/en_redirects_goarch/tr.d066/trMA.AposGlory/c1211/score/b/1:link.path	/media/m/dedes/en/tr/d066/ma/b/aposglory.pdf
media/en_redirects_goarch/tr.d066/trMA.AposGlory/c1211/score/w/1:link.info	SDedes
media/en_redirects_goarch/tr.d066/trMA.AposGlory/c1211/score/w/1:link.path	/media/m/dedes/en/tr/d066/ma/w/aposglory.pdf
media/en_redirects_goarch/tr.d066/trMA.Aposticha1/c1211/audio/1:link.info	SDedes
media/en_redirects_goarch/tr.d066/trMA.Aposticha1/c1211/audio/1:link.path	/media/a/en_public/tr/d066/ma/aposticha1.mp3
media/en_redirects_goarch/tr.d066/trMA.Aposticha1/c1211/score/b/1:link.info	SDedes
media/en_redirects_goarch/tr.d066/trMA.Aposticha1/c1211/score/b/1:link.path	/media/m/dedes/en/tr/d066/ma/b/aposticha1.pdf
media/en_redirects_goarch/tr.d066/trMA.Aposticha1/c1211/score/w/1:link.info	SDedes
media/en_redirects_goarch/tr.d066/trMA.Aposticha1/c1211/score/w/1:link.path	/media/m/dedes/en/tr/d066/ma/w/aposticha1.pdf
media/en_redirects_goarch/tr.d066/trMA.Aposticha2/c1211/audio/1:link.info	SDedes
media/en_redirects_goarch/tr.d066/trMA.Aposticha2/c1211/audio/1:link.path	/media/a/en_public/tr/d066/ma/aposticha2.mp3
media/en_redirects_goarch/tr.d066/trMA.Aposticha2/c1211/score/b/1:link.info	SDedes
media/en_redirects_goarch/tr.d066/trMA.Aposticha2/c1211/score/b/1:link.path	/media/m/dedes/en/tr/d066/ma/b/aposticha2.pdf
media/en_redirects_goarch/tr.d066/trMA.Aposticha2/c1211/score/w/1:link.info	SDedes
media/en_redirects_goarch/tr.d066/trMA.Aposticha2/c1211/score/w/1:link.path	/media/m/dedes/en/tr/d066/ma/w/aposticha2.pdf
media/en_redirects_goarch/tr.d066/trMA.Aposticha3/c1211/audio/1:link.info	SDedes
media/en_redirects_goarch/tr.d066/trMA.Aposticha3/c1211/audio/1:link.path	/media/a/en_public/tr/d066/ma/aposticha3.mp3
media/en_redirects_goarch/tr.d066/trMA.Aposticha3/c1211/score/b/1:link.info	SDedes
media/en_redirects_goarch/tr.d066/trMA.Aposticha3/c1211/score/b/1:link.path	/media/m/dedes/en/tr/d066/ma/b/aposticha3.pdf
media/en_redirects_goarch/tr.d066/trMA.Aposticha3/c1211/score/w/1:link.info	SDedes
media/en_redirects_goarch/tr.d066/trMA.Aposticha3/c1211/score/w/1:link.path	/media/m/dedes/en/tr/d066/ma/w/aposticha3.pdf
media/en_redirects_goarch/tr.d066/trMA.Exaposteilarion1/c1211/audio/1:link.info	SDedes
media/en_redirects_goarch/tr.d066/trMA.Exaposteilarion1/c1211/audio/1:link.path	/media/a/en_public/tr/d065/ma/exaposteilarion1.mp3
media/en_redirects_goarch/tr.d066/trMA.Exaposteilarion1/c1211/score/b/1:link.info	SDedes
media/en_redirects_goarch/tr.d066/trMA.Exaposteilarion1/c1211/score/b/1:link.path	/media/m/dedes/en/tr/d065/ma/b/exaposteilarion1.pdf
media/en_redirects_goarch/tr.d066/trMA.Exaposteilarion1/c1211/score/w/1:link.info	SDedes
media/en_redirects_goarch/tr.d066/trMA.Exaposteilarion1/c1211/score/w/1:link.path	/media/m/dedes/en/tr/d065/ma/w/exaposteilarion1.pdf
media/en_redirects_goarch/tr.d066/trMA.Exaposteilarion1/c2301/score/w/1:link.info	NewByz
media/en_redirects_goarch/tr.d066/trMA.Exaposteilarion1/c2301/score/w/1:link.path	/media/m/newbyz/en/tr/d065/ma/w/exaposteilarion1.pdf
media/en_redirects_goarch/tr.d066/trMA.Kathisma11/c1211/audio/1:link.info	SDedes
media/en_redirects_goarch/tr.d066/trMA.Kathisma11/c1211/audio/1:link.path	/media/a/en_public/tr/d066/ma/kathisma1.mp3
media/en_redirects_goarch/tr.d066/trMA.Kathisma11/c1211/score/b/1:link.info	SDedes
media/en_redirects_goarch/tr.d066/trMA.Kathisma11/c1211/score/b/1:link.path	/media/m/dedes/en/tr/d066/ma/b/kathisma1.pdf
media/en_redirects_goarch/tr.d066/trMA.Kathisma11/c1211/score/w/1:link.info	SDedes
media/en_redirects_goarch/tr.d066/trMA.Kathisma11/c1211/score/w/1:link.path	/media/m/dedes/en/tr/d066/ma/w/kathisma1.pdf
media/en_redirects_goarch/tr.d066/trMA.Kathisma11/c1212/score/b/1:link.info	Long melody | SDedes
media/en_redirects_goarch/tr.d066/trMA.Kathisma11/c1212/score/b/1:link.path	/media/m/dedes/en/tr/d066/ma/b/kathisma1_long.pdf
media/en_redirects_goarch/tr.d066/trMA.Kathisma21/c1211/audio/1:link.info	SDedes
media/en_redirects_goarch/tr.d066/trMA.Kathisma21/c1211/audio/1:link.path	/media/a/en_public/tr/d066/ma/kathisma2.mp3
media/en_redirects_goarch/tr.d066/trMA.Kathisma21/c1211/score/b/1:link.info	SDedes
media/en_redirects_goarch/tr.d066/trMA.Kathisma21/c1211/score/b/1:link.path	/media/m/dedes/en/tr/d066/ma/b/kathisma2.pdf
media/en_redirects_goarch/tr.d066/trMA.Kathisma21/c1211/score/w/1:link.info	SDedes
media/en_redirects_goarch/tr.d066/trMA.Kathisma21/c1211/score/w/1:link.path	/media/m/dedes/en/tr/d066/ma/w/kathisma2.pdf
media/en_redirects_goarch/tr.d066/trMA.Kathisma21/c1212/score/b/1:link.info	Long melody | SDedes
media/en_redirects_goarch/tr.d066/trMA.Kathisma21/c1212/score/b/1:link.path	/media/m/dedes/en/tr/d066/ma/b/kathisma2_long.pdf
media/en_redirects_goarch/tr.d066/trMA.Kathisma31/c1211/audio/1:link.info	SDedes
media/en_redirects_goarch/tr.d066/trMA.Kathisma31/c1211/audio/1:link.path	/media/a/en_public/tr/d066/ma/kathisma3.mp3
media/en_redirects_goarch/tr.d066/trMA.Kathisma31/c1211/score/b/1:link.info	SDedes
media/en_redirects_goarch/tr.d066/trMA.Kathisma31/c1211/score/b/1:link.path	/media/m/dedes/en/tr/d066/ma/b/kathisma3.pdf
media/en_redirects_goarch/tr.d066/trMA.Kathisma31/c1211/score/w/1:link.info	SDedes
media/en_redirects_goarch/tr.d066/trMA.Kathisma31/c1211/score/w/1:link.path	/media/m/dedes/en/tr/d066/ma/w/kathisma3.pdf
media/en_redirects_goarch/tr.d066/trMA.Kathisma31/c1212/score/b/1:link.info	Long melody | SDedes
media/en_redirects_goarch/tr.d066/trMA.Kathisma31/c1212/score/b/1:link.path	/media/m/dedes/en/tr/d066/ma/b/kathisma3_long.pdf
media/en_redirects_goarch/tr.d066/trMA.Lauds1/c1211/audio/1:link.info	SDedes
media/en_redirects_goarch/tr.d066/trMA.Lauds1/c1211/audio/1:link.path	/media/a/en_public/tr/d066/ma/lauds1.mp3
media/en_redirects_goarch/tr.d066/trMA.Lauds1/c1211/score/b/1:link.info	SDedes
media/en_redirects_goarch/tr.d066/trMA.Lauds1/c1211/score/b/1:link.path	/media/m/dedes/en/tr/d066/ma/b/lauds1.pdf
media/en_redirects_goarch/tr.d066/trMA.Lauds1/c1211/score/w/1:link.info	SDedes
media/en_redirects_goarch/tr.d066/trMA.Lauds1/c1211/score/w/1:link.path	/media/m/dedes/en/tr/d066/ma/w/lauds1.pdf
media/en_redirects_goarch/tr.d066/trMA.Lauds2/c1211/audio/1:link.info	SDedes
media/en_redirects_goarch/tr.d066/trMA.Lauds2/c1211/audio/1:link.path	/media/a/en_public/tr/d066/ma/lauds2.mp3
media/en_redirects_goarch/tr.d066/trMA.Lauds2/c1211/score/b/1:link.info	SDedes
media/en_redirects_goarch/tr.d066/trMA.Lauds2/c1211/score/b/1:link.path	/media/m/dedes/en/tr/d066/ma/b/lauds2.pdf
media/en_redirects_goarch/tr.d066/trMA.Lauds2/c1211/score/w/1:link.info	SDedes
media/en_redirects_goarch/tr.d066/trMA.Lauds2/c1211/score/w/1:link.path	/media/m/dedes/en/tr/d066/ma/w/lauds2.pdf
media/en_redirects_goarch/tr.d066/trMA.LaudsGlory/c1211/audio/1:link.info	SDedes
media/en_redirects_goarch/tr.d066/trMA.LaudsGlory/c1211/audio/1:link.path	/media/a/en_public/tr/d066/ma/laudsglory.mp3
media/en_redirects_goarch/tr.d066/trMA.LaudsGlory/c1211/score/b/1:link.info	SDedes
media/en_redirects_goarch/tr.d066/trMA.LaudsGlory/c1211/score/b/1:link.path	/media/m/dedes/en/tr/d066/ma/b/laudsglory.pdf
media/en_redirects_goarch/tr.d066/trMA.LaudsGlory/c1211/score/w/1:link.info	SDedes
media/en_redirects_goarch/tr.d066/trMA.LaudsGlory/c1211/score/w/1:link.path	/media/m/dedes/en/tr/d066/ma/w/laudsglory.pdf
media/en_redirects_goarch/tr.d066/trMA.MM.Alleluia/c1211/audio/1:link.info	SDedes
media/en_redirects_goarch/tr.d066/trMA.MM.Alleluia/c1211/audio/1:link.path	/media/a/en_public/tr/d065/ma/alleluia.mp3
media/en_redirects_goarch/tr.d066/trMA.MM.Alleluia/c1211/score/b/1:link.info	SDedes
media/en_redirects_goarch/tr.d066/trMA.MM.Alleluia/c1211/score/b/1:link.path	/media/m/dedes/en/tr/d065/ma/b/alleluia.pdf
media/en_redirects_goarch/tr.d066/trMA.MM.Alleluia/c1211/score/w/1:link.info	SDedes
media/en_redirects_goarch/tr.d066/trMA.MM.Alleluia/c1211/score/w/1:link.path	/media/m/dedes/en/tr/d065/ma/w/alleluia.pdf
media/en_redirects_goarch/tr.d066/trMA.Ode8C1H/c1211/audio/1:link.info	SDedes
media/en_redirects_goarch/tr.d066/trMA.Ode8C1H/c1211/audio/1:link.path	/media/a/en_public/tr/d066/ma/ode8.mp3
media/en_redirects_goarch/tr.d066/trMA.Ode8C1H/c1211/score/b/1:link.info	SDedes
media/en_redirects_goarch/tr.d066/trMA.Ode8C1H/c1211/score/b/1:link.path	/media/m/dedes/en/tr/d066/ma/b/ode8.pdf
media/en_redirects_goarch/tr.d066/trMA.Ode8C1H/c1211/score/w/1:link.info	SDedes
media/en_redirects_goarch/tr.d066/trMA.Ode8C1H/c1211/score/w/1:link.path	/media/m/dedes/en/tr/d066/ma/w/ode8.pdf
media/en_redirects_goarch/tr.d066/trMA.Ode8K/c1211/audio/1:link.info	SDedes
media/en_redirects_goarch/tr.d066/trMA.Ode8K/c1211/audio/1:link.path	/media/a/en_public/tr/d066/ma/ode8k.mp3
media/en_redirects_goarch/tr.d066/trMA.Ode8K/c1211/score/b/1:link.info	SDedes
media/en_redirects_goarch/tr.d066/trMA.Ode8K/c1211/score/b/1:link.path	/media/m/dedes/en/tr/d066/ma/b/ode8k.pdf
media/en_redirects_goarch/tr.d066/trMA.Ode8K/c1211/score/w/1:link.info	SDedes
media/en_redirects_goarch/tr.d066/trMA.Ode8K/c1211/score/w/1:link.path	/media/m/dedes/en/tr/d066/ma/w/ode8k.pdf
media/en_redirects_goarch/tr.d066/trMA.Ode9C1H/c1211/audio/1:link.info	SDedes
media/en_redirects_goarch/tr.d066/trMA.Ode9C1H/c1211/audio/1:link.path	/media/a/en_public/tr/d066/ma/ode9.mp3
media/en_redirects_goarch/tr.d066/trMA.Ode9C1H/c1211/score/b/1:link.info	SDedes
media/en_redirects_goarch/tr.d066/trMA.Ode9C1H/c1211/score/b/1:link.path	/media/m/dedes/en/tr/d066/ma/b/ode9.pdf
media/en_redirects_goarch/tr.d066/trMA.Ode9C1H/c1211/score/w/1:link.info	SDedes
media/en_redirects_goarch/tr.d066/trMA.Ode9C1H/c1211/score/w/1:link.path	/media/m/dedes/en/tr/d066/ma/w/ode9.pdf
media/en_redirects_goarch/tr.d066/trMA.Ode9K/c1211/audio/1:link.info	SDedes
media/en_redirects_goarch/tr.d066/trMA.Ode9K/c1211/audio/1:link.path	/media/a/en_public/tr/d066/ma/ode9k.mp3
media/en_redirects_goarch/tr.d066/trMA.Ode9K/c1211/score/b/1:link.info	SDedes
media/en_redirects_goarch/tr.d066/trMA.Ode9K/c1211/score/b/1:link.path	/media/m/dedes/en/tr/d066/ma/b/ode9k.pdf
media/en_redirects_goarch/tr.d066/trMA.Ode9K/c1211/score/w/1:link.info	SDedes
media/en_redirects_goarch/tr.d066/trMA.Ode9K/c1211/score/w/1:link.path	/media/m/dedes/en/tr/d066/ma/w/ode9k.pdf
media/en_redirects_goarch/tr.d066/trMA.Troparion/c1211/audio/1:link.info	SDedes
media/en_redirects_goarch/tr.d066/trMA.Troparion/c1211/audio/1:link.path	/media/a/en_public/tr/d066/ma/troparion.mp3
media/en_redirects_goarch/tr.d066/trMA.Troparion/c1211/score/b/1:link.info	SDedes
media/en_redirects_goarch/tr.d066/trMA.Troparion/c1211/score/b/1:link.path	/media/m/dedes/en/tr/d066/ma/b/troparion.pdf
media/en_redirects_goarch/tr.d066/trMA.Troparion/c1211/score/w/1:link.info	SDedes
media/en_redirects_goarch/tr.d066/trMA.Troparion/c1211/score/w/1:link.path	/media/m/dedes/en/tr/d066/ma/w/troparion.pdf
media/en_redirects_goarch/tr.d066/trMA.Troparion/c2301/score/w/1:link.info	NewByz
media/en_redirects_goarch/tr.d066/trMA.Troparion/c2301/score/w/1:link.path	/media/m/newbyz/en/tr/d065/ma/w/troparion.pdf
media/en_redirects_goarch/tr.d066/trVE.SticGlory/c1211/score/w/1:link.info	SDedes
media/en_redirects_goarch/tr.d066/trVE.SticGlory/c1211/score/w/1:link.path	/media/m/dedes/en/tr/d066/ve/w/sticglory.pdf
media/en_redirects_goarch/tr.d066/trVE.Stichera01/c1211/score/w/1:link.info	SDedes
media/en_redirects_goarch/tr.d066/trVE.Stichera01/c1211/score/w/1:link.path	/media/m/dedes/en/tr/d066/ve/w/stichera01.pdf
media/en_redirects_goarch/tr.d066/trVE.Stichera02/c1211/score/w/1:link.info	SDedes
media/en_redirects_goarch/tr.d066/trVE.Stichera02/c1211/score/w/1:link.path	/media/m/dedes/en/tr/d066/ve/w/stichera02.pdf
media/en_redirects_goarch/tr.d066/trVE.Stichera03/c1211/score/w/1:link.info	SDedes
media/en_redirects_goarch/tr.d066/trVE.Stichera03/c1211/score/w/1:link.path	/media/m/dedes/en/tr/d066/ve/w/stichera03.pdf
media/en_redirects_goarch/tr.d066/trVE.Stichera04/c1211/score/w/1:link.info	SDedes
media/en_redirects_goarch/tr.d066/trVE.Stichera04/c1211/score/w/1:link.path	/media/m/dedes/en/tr/d066/ve/w/stichera04.pdf
media/en_redirects_goarch/tr.d066/trVE.Stichera05/c1211/score/w/1:link.info	SDedes
media/en_redirects_goarch/tr.d066/trVE.Stichera05/c1211/score/w/1:link.path	/media/m/dedes/en/tr/d066/ve/w/stichera05.pdf
media/en_redirects_goarch/tr.d066/trVE.Stichera06/c1211/score/w/1:link.info	SDedes
media/en_redirects_goarch/tr.d066/trVE.Stichera06/c1211/score/w/1:link.path	/media/m/dedes/en/tr/d066/ve/w/stichera06.pdf
