media/en_redirects_goarch/me.m05.d02/meMA.Exaposteilarion1/c1211/score/w/1:link.info	SDedes
media/en_redirects_goarch/me.m05.d02/meMA.Exaposteilarion1/c1211/score/w/1:link.path	/media/m/dedes/en/me/m05/d02/ma/w/exaposteilarion1.pdf
media/en_redirects_goarch/me.m05.d02/meMA.Kathisma11/c1211/score/w/1:link.info	SDedes
media/en_redirects_goarch/me.m05.d02/meMA.Kathisma11/c1211/score/w/1:link.path	/media/m/dedes/en/me/m05/d02/ma/w/kathisma11.pdf
media/en_redirects_goarch/me.m05.d02/meMA.Kathisma21/c1211/score/w/1:link.info	SDedes
media/en_redirects_goarch/me.m05.d02/meMA.Kathisma21/c1211/score/w/1:link.path	/media/m/dedes/en/me/m05/d02/ma/w/kathisma21.pdf
media/en_redirects_goarch/me.m05.d02/meMA.Lauds1/c1211/score/w/1:link.info	SDedes
media/en_redirects_goarch/me.m05.d02/meMA.Lauds1/c1211/score/w/1:link.path	/media/m/dedes/en/me/m05/d02/ma/w/lauds1.pdf
media/en_redirects_goarch/me.m05.d02/meMA.Lauds2/c1211/score/w/1:link.info	SDedes
media/en_redirects_goarch/me.m05.d02/meMA.Lauds2/c1211/score/w/1:link.path	/media/m/dedes/en/me/m05/d02/ma/w/lauds2.pdf
media/en_redirects_goarch/me.m05.d02/meMA.Lauds3/c1211/score/w/1:link.info	SDedes
media/en_redirects_goarch/me.m05.d02/meMA.Lauds3/c1211/score/w/1:link.path	/media/m/dedes/en/me/m05/d02/ma/w/lauds3.pdf
media/en_redirects_goarch/me.m05.d02/meMA.LaudsGlory/c1211/score/b/1:link.info	SDedes
media/en_redirects_goarch/me.m05.d02/meMA.LaudsGlory/c1211/score/b/1:link.path	/media/m/dedes/en/me/m05/d02/ma/b/laudsglory.pdf
media/en_redirects_goarch/me.m05.d02/meMA.LaudsGlory/c1211/score/w/1:link.info	SDedes
media/en_redirects_goarch/me.m05.d02/meMA.LaudsGlory/c1211/score/w/1:link.path	/media/m/dedes/en/me/m05/d02/ma/w/laudsglory.pdf
media/en_redirects_goarch/me.m05.d02/meMA.MM.Lauds123as456/c1211/score/w/1:link.info	SDedes
media/en_redirects_goarch/me.m05.d02/meMA.MM.Lauds123as456/c1211/score/w/1:link.path	/media/m/dedes/en/me/m05/d02/ma/w/lauds123as456.pdf
media/en_redirects_goarch/me.m05.d02/meVE.Apolytikion1/c1211/score/w/1:link.info	SDedes
media/en_redirects_goarch/me.m05.d02/meVE.Apolytikion1/c1211/score/w/1:link.path	/media/m/dedes/en/me/m05/d02/ve/w/apolytikion1.pdf
media/en_redirects_goarch/me.m05.d02/meVE.Apolytikion1/c2001/score/w/1:link.info	NewByz
media/en_redirects_goarch/me.m05.d02/meVE.Apolytikion1/c2001/score/w/1:link.path	/media/m/newbyz/en/me/m05/d02/ve/w/apolytikion1.pdf
media/en_redirects_goarch/me.m05.d02/meVE.AposGlory/c1211/score/b/1:link.info	SDedes
media/en_redirects_goarch/me.m05.d02/meVE.AposGlory/c1211/score/b/1:link.path	/media/m/dedes/en/me/m05/d02/ve/b/aposglory.pdf
media/en_redirects_goarch/me.m05.d02/meVE.AposGlory/c1211/score/w/1:link.info	SDedes
media/en_redirects_goarch/me.m05.d02/meVE.AposGlory/c1211/score/w/1:link.path	/media/m/dedes/en/me/m05/d02/ve/w/aposglory.pdf
media/en_redirects_goarch/me.m05.d02/meVE.Aposticha1/c1211/score/w/1:link.info	SDedes
media/en_redirects_goarch/me.m05.d02/meVE.Aposticha1/c1211/score/w/1:link.path	/media/m/dedes/en/me/m05/d02/ve/w/aposticha1.pdf
media/en_redirects_goarch/me.m05.d02/meVE.Aposticha2/c1211/score/w/1:link.info	SDedes
media/en_redirects_goarch/me.m05.d02/meVE.Aposticha2/c1211/score/w/1:link.path	/media/m/dedes/en/me/m05/d02/ve/w/aposticha2.pdf
media/en_redirects_goarch/me.m05.d02/meVE.Aposticha3/c1211/score/w/1:link.info	SDedes
media/en_redirects_goarch/me.m05.d02/meVE.Aposticha3/c1211/score/w/1:link.path	/media/m/dedes/en/me/m05/d02/ve/w/aposticha3.pdf
media/en_redirects_goarch/me.m05.d02/meVE.MM.Stichera1123as78910/c1211/score/w/1:link.info	SDedes
media/en_redirects_goarch/me.m05.d02/meVE.MM.Stichera1123as78910/c1211/score/w/1:link.path	/media/m/dedes/en/me/m05/d02/ve/w/stichera1123as78910.pdf
media/en_redirects_goarch/me.m05.d02/meVE.SticGlory/c1211/score/b/1:link.info	SDedes
media/en_redirects_goarch/me.m05.d02/meVE.SticGlory/c1211/score/b/1:link.path	/media/m/dedes/en/me/m05/d02/ve/b/sticglory.pdf
media/en_redirects_goarch/me.m05.d02/meVE.SticGlory/c1211/score/w/1:link.info	SDedes
media/en_redirects_goarch/me.m05.d02/meVE.SticGlory/c1211/score/w/1:link.path	/media/m/dedes/en/me/m05/d02/ve/w/sticglory.pdf
media/en_redirects_goarch/me.m05.d02/meVE.Stichera01/c1211/score/w/1:link.info	SDedes
media/en_redirects_goarch/me.m05.d02/meVE.Stichera01/c1211/score/w/1:link.path	/media/m/dedes/en/me/m05/d02/ve/w/stichera01.pdf
media/en_redirects_goarch/me.m05.d02/meVE.Stichera02/c1211/score/w/1:link.info	SDedes
media/en_redirects_goarch/me.m05.d02/meVE.Stichera02/c1211/score/w/1:link.path	/media/m/dedes/en/me/m05/d02/ve/w/stichera02.pdf
media/en_redirects_goarch/me.m05.d02/meVE.Stichera03/c1211/score/w/1:link.info	SDedes
media/en_redirects_goarch/me.m05.d02/meVE.Stichera03/c1211/score/w/1:link.path	/media/m/dedes/en/me/m05/d02/ve/w/stichera03.pdf
