media/en_redirects_goarch/pe.d126/peMA.MM.Lauds123as123/c1211/score/w/1:link.info	SDedes
media/en_redirects_goarch/pe.d126/peMA.MM.Lauds123as123/c1211/score/w/1:link.path	/media/m/dedes/en/pe/d126/ma/w/lauds123.pdf
media/en_redirects_goarch/pe.d126/peVE.MM.Stichera123456as123456/c1211/score/b/1:link.info	SDedes
media/en_redirects_goarch/pe.d126/peVE.MM.Stichera123456as123456/c1211/score/b/1:link.path	/media/m/dedes/en/pe/d126/ve/b/stichera123456as123456.pdf
media/en_redirects_goarch/pe.d126/peVE.MM.Stichera123456as123456/c1211/score/w/1:link.info	SDedes
media/en_redirects_goarch/pe.d126/peVE.MM.Stichera123456as123456/c1211/score/w/1:link.path	/media/m/dedes/en/pe/d126/ve/w/stichera123456as123456.pdf
