media/en_redirects_goarch/pe.d094/peMA.AposGlory/c1211/score/b/1:link.info	SDedes
media/en_redirects_goarch/pe.d094/peMA.AposGlory/c1211/score/b/1:link.path	/media/m/dedes/en/pe/d092/ve/b/lityglory.pdf
media/en_redirects_goarch/pe.d094/peMA.AposGlory/c1211/score/w/1:link.info	SDedes
media/en_redirects_goarch/pe.d094/peMA.AposGlory/c1211/score/w/1:link.path	/media/m/dedes/en/pe/d092/ve/w/lityglory.pdf
media/en_redirects_goarch/pe.d094/peMA.Kathisma1T/c1211/score/w/1:link.info	SDedes
media/en_redirects_goarch/pe.d094/peMA.Kathisma1T/c1211/score/w/1:link.path	/media/m/dedes/en/pe/d094/ma/w/kathisma1T.pdf
media/en_redirects_goarch/pe.d094/peMA.Kathisma21/c1211/score/w/1:link.info	SDedes
media/en_redirects_goarch/pe.d094/peMA.Kathisma21/c1211/score/w/1:link.path	/media/m/dedes/en/pe/d093/ma/w/kathisma21.pdf
media/en_redirects_goarch/pe.d094/peMA.LaudsGlory/c1211/score/b/1:link.info	SDedes
media/en_redirects_goarch/pe.d094/peMA.LaudsGlory/c1211/score/b/1:link.path	/media/m/dedes/en/pe/d094/ma/b/laudsglory.pdf
media/en_redirects_goarch/pe.d094/peMA.LaudsGlory/c1211/score/w/1:link.info	SDedes
media/en_redirects_goarch/pe.d094/peMA.LaudsGlory/c1211/score/w/1:link.path	/media/m/dedes/en/pe/d094/ma/w/laudsglory.pdf
media/en_redirects_goarch/pe.d094/peVE.AposGlory/c1211/score/b/1:link.info	SDedes
media/en_redirects_goarch/pe.d094/peVE.AposGlory/c1211/score/b/1:link.path	/media/m/dedes/en/pe/d092/ve/b/aposglory.pdf
media/en_redirects_goarch/pe.d094/peVE.AposGlory/c1211/score/w/1:link.info	SDedes
media/en_redirects_goarch/pe.d094/peVE.AposGlory/c1211/score/w/1:link.path	/media/m/dedes/en/pe/d092/ve/w/aposglory.pdf
media/en_redirects_goarch/pe.d094/peVE.SticGlory/c1211/score/b/1:link.info	SDedes
media/en_redirects_goarch/pe.d094/peVE.SticGlory/c1211/score/b/1:link.path	/media/m/dedes/en/pe/d092/ve/b/sticglory.pdf
media/en_redirects_goarch/pe.d094/peVE.SticGlory/c1211/score/w/1:link.info	SDedes
media/en_redirects_goarch/pe.d094/peVE.SticGlory/c1211/score/w/1:link.path	/media/m/dedes/en/pe/d092/ve/w/sticglory.pdf
media/en_redirects_goarch/pe.d094/peVE.Stichera01/c1211/score/b/1:link.info	SDedes
media/en_redirects_goarch/pe.d094/peVE.Stichera01/c1211/score/b/1:link.path	/media/m/dedes/en/pe/d094/ve/b/stichera01.pdf
media/en_redirects_goarch/pe.d094/peVE.Stichera01/c1211/score/w/1:link.info	SDedes
media/en_redirects_goarch/pe.d094/peVE.Stichera01/c1211/score/w/1:link.path	/media/m/dedes/en/pe/d094/ve/w/stichera01.pdf
media/en_redirects_goarch/pe.d094/peVE.Stichera02/c1211/score/b/1:link.info	SDedes
media/en_redirects_goarch/pe.d094/peVE.Stichera02/c1211/score/b/1:link.path	/media/m/dedes/en/pe/d094/ve/b/stichera02.pdf
media/en_redirects_goarch/pe.d094/peVE.Stichera02/c1211/score/w/1:link.info	SDedes
media/en_redirects_goarch/pe.d094/peVE.Stichera02/c1211/score/w/1:link.path	/media/m/dedes/en/pe/d094/ve/w/stichera02.pdf
