media/en_redirects_goarch/eu.unction/euUNC.Exaposteilarion/c1211/audio/1:link.info	SDedes
media/en_redirects_goarch/eu.unction/euUNC.Exaposteilarion/c1211/audio/1:link.path	/media/a/en_public/eu/unction/exaposteilarion.mp3
media/en_redirects_goarch/eu.unction/euUNC.Exaposteilarion/c1211/score/w/1:link.info	SDedes
media/en_redirects_goarch/eu.unction/euUNC.Exaposteilarion/c1211/score/w/1:link.path	/media/m/dedes/en/eu/unction/w/exaposteilarion.pdf
media/en_redirects_goarch/eu.unction/euUNC.Kathisma11/c1211/audio/1:link.info	SDedes
media/en_redirects_goarch/eu.unction/euUNC.Kathisma11/c1211/audio/1:link.path	/media/a/en_public/eu/unction/kathisma1.mp3
media/en_redirects_goarch/eu.unction/euUNC.Kathisma11/c1211/score/w/1:link.info	SDedes
media/en_redirects_goarch/eu.unction/euUNC.Kathisma11/c1211/score/w/1:link.path	/media/m/dedes/en/eu/unction/w/kathisma1.pdf
media/en_redirects_goarch/eu.unction/euUNC.Kathisma12/c1211/audio/1:link.info	SDedes
media/en_redirects_goarch/eu.unction/euUNC.Kathisma12/c1211/audio/1:link.path	/media/a/en_public/eu/unction/kathisma2.mp3
media/en_redirects_goarch/eu.unction/euUNC.Kathisma12/c1211/score/w/1:link.info	SDedes
media/en_redirects_goarch/eu.unction/euUNC.Kathisma12/c1211/score/w/1:link.path	/media/m/dedes/en/eu/unction/w/kathisma2.pdf
media/en_redirects_goarch/eu.unction/euUNC.Key0100/c1211/audio/1:link.info	SDedes
media/en_redirects_goarch/eu.unction/euUNC.Key0100/c1211/audio/1:link.path	/media/a/en_public/eu/unction/alleluia.mp3
media/en_redirects_goarch/eu.unction/euUNC.Key0100/c1211/score/w/1:link.info	SDedes
media/en_redirects_goarch/eu.unction/euUNC.Key0100/c1211/score/w/1:link.path	/media/m/dedes/en/eu/unction/w/alleluia.pdf
media/en_redirects_goarch/eu.unction/euUNC.Key0202/c1211/score/w/1:link.info	SDedes
media/en_redirects_goarch/eu.unction/euUNC.Key0202/c1211/score/w/1:link.path	/media/m/dedes/en/eu/unction/w/saintshymns.pdf
media/en_redirects_goarch/eu.unction/euUNC.Kontakion/c1211/audio/1:link.info	SDedes
media/en_redirects_goarch/eu.unction/euUNC.Kontakion/c1211/audio/1:link.path	/media/a/en_public/eu/unction/kontakion.mp3
media/en_redirects_goarch/eu.unction/euUNC.Kontakion/c1211/score/w/1:link.info	SDedes
media/en_redirects_goarch/eu.unction/euUNC.Kontakion/c1211/score/w/1:link.path	/media/m/dedes/en/eu/unction/w/kontakion.pdf
media/en_redirects_goarch/eu.unction/euUNC.Lauds1/c1211/audio/1:link.info	SDedes
media/en_redirects_goarch/eu.unction/euUNC.Lauds1/c1211/audio/1:link.path	/media/a/en_public/eu/unction/lauds1234.mp3
media/en_redirects_goarch/eu.unction/euUNC.Lauds1/c1211/score/w/1:link.info	SDedes
media/en_redirects_goarch/eu.unction/euUNC.Lauds1/c1211/score/w/1:link.path	/media/m/dedes/en/eu/unction/w/lauds1234.pdf
media/en_redirects_goarch/eu.unction/euUNC.Ode11/c1211/audio/1:link.info	SDedes
media/en_redirects_goarch/eu.unction/euUNC.Ode11/c1211/audio/1:link.path	/media/a/en_public/eu/unction/ode1.mp3
media/en_redirects_goarch/eu.unction/euUNC.Ode11/c1211/score/w/1:link.info	SDedes
media/en_redirects_goarch/eu.unction/euUNC.Ode11/c1211/score/w/1:link.path	/media/m/dedes/en/eu/unction/w/ode1.pdf
media/en_redirects_goarch/eu.unction/euUNC.Ode11/c1212/score/b/1:link.info	GCremeens
media/en_redirects_goarch/eu.unction/euUNC.Ode11/c1212/score/b/1:link.path	/media/m/cremeens/en/eu/unction/b/ode1.pdf
media/en_redirects_goarch/eu.unction/euUNC.Ode31/c1211/audio/1:link.info	SDedes
media/en_redirects_goarch/eu.unction/euUNC.Ode31/c1211/audio/1:link.path	/media/a/en_public/eu/unction/ode3.mp3
media/en_redirects_goarch/eu.unction/euUNC.Ode31/c1211/score/w/1:link.info	SDedes
media/en_redirects_goarch/eu.unction/euUNC.Ode31/c1211/score/w/1:link.path	/media/m/dedes/en/eu/unction/w/ode3.pdf
media/en_redirects_goarch/eu.unction/euUNC.Ode31/c1212/score/b/1:link.info	GCremeens
media/en_redirects_goarch/eu.unction/euUNC.Ode31/c1212/score/b/1:link.path	/media/m/cremeens/en/eu/unction/b/ode3.pdf
media/en_redirects_goarch/eu.unction/euUNC.Ode41/c1211/audio/1:link.info	SDedes
media/en_redirects_goarch/eu.unction/euUNC.Ode41/c1211/audio/1:link.path	/media/a/en_public/eu/unction/ode4.mp3
media/en_redirects_goarch/eu.unction/euUNC.Ode41/c1211/score/w/1:link.info	SDedes
media/en_redirects_goarch/eu.unction/euUNC.Ode41/c1211/score/w/1:link.path	/media/m/dedes/en/eu/unction/w/ode4.pdf
media/en_redirects_goarch/eu.unction/euUNC.Ode41/c1212/score/b/1:link.info	GCremeens
media/en_redirects_goarch/eu.unction/euUNC.Ode41/c1212/score/b/1:link.path	/media/m/cremeens/en/eu/unction/b/ode4.pdf
media/en_redirects_goarch/eu.unction/euUNC.Ode51/c1211/audio/1:link.info	SDedes
media/en_redirects_goarch/eu.unction/euUNC.Ode51/c1211/audio/1:link.path	/media/a/en_public/eu/unction/ode5.mp3
media/en_redirects_goarch/eu.unction/euUNC.Ode51/c1211/score/w/1:link.info	SDedes
media/en_redirects_goarch/eu.unction/euUNC.Ode51/c1211/score/w/1:link.path	/media/m/dedes/en/eu/unction/w/ode5.pdf
media/en_redirects_goarch/eu.unction/euUNC.Ode51/c1212/score/b/1:link.info	GCremeens
media/en_redirects_goarch/eu.unction/euUNC.Ode51/c1212/score/b/1:link.path	/media/m/cremeens/en/eu/unction/b/ode5.pdf
media/en_redirects_goarch/eu.unction/euUNC.Ode61/c1211/audio/1:link.info	SDedes
media/en_redirects_goarch/eu.unction/euUNC.Ode61/c1211/audio/1:link.path	/media/a/en_public/eu/unction/ode6.mp3
media/en_redirects_goarch/eu.unction/euUNC.Ode61/c1211/score/w/1:link.info	SDedes
media/en_redirects_goarch/eu.unction/euUNC.Ode61/c1211/score/w/1:link.path	/media/m/dedes/en/eu/unction/w/ode6.pdf
media/en_redirects_goarch/eu.unction/euUNC.Ode61/c1212/score/b/1:link.info	GCremeens
media/en_redirects_goarch/eu.unction/euUNC.Ode61/c1212/score/b/1:link.path	/media/m/cremeens/en/eu/unction/b/ode6.pdf
media/en_redirects_goarch/eu.unction/euUNC.Ode71/c1211/audio/1:link.info	SDedes
media/en_redirects_goarch/eu.unction/euUNC.Ode71/c1211/audio/1:link.path	/media/a/en_public/eu/unction/ode7.mp3
media/en_redirects_goarch/eu.unction/euUNC.Ode71/c1211/score/w/1:link.info	SDedes
media/en_redirects_goarch/eu.unction/euUNC.Ode71/c1211/score/w/1:link.path	/media/m/dedes/en/eu/unction/w/ode7.pdf
media/en_redirects_goarch/eu.unction/euUNC.Ode71/c1212/score/b/1:link.info	GCremeens
media/en_redirects_goarch/eu.unction/euUNC.Ode71/c1212/score/b/1:link.path	/media/m/cremeens/en/eu/unction/b/ode7.pdf
media/en_redirects_goarch/eu.unction/euUNC.Ode81/c1211/audio/1:link.info	SDedes
media/en_redirects_goarch/eu.unction/euUNC.Ode81/c1211/audio/1:link.path	/media/a/en_public/eu/unction/ode8.mp3
media/en_redirects_goarch/eu.unction/euUNC.Ode81/c1211/score/w/1:link.info	SDedes
media/en_redirects_goarch/eu.unction/euUNC.Ode81/c1211/score/w/1:link.path	/media/m/dedes/en/eu/unction/w/ode8.pdf
media/en_redirects_goarch/eu.unction/euUNC.Ode81/c1212/score/b/1:link.info	GCremeens
media/en_redirects_goarch/eu.unction/euUNC.Ode81/c1212/score/b/1:link.path	/media/m/cremeens/en/eu/unction/b/ode8.pdf
media/en_redirects_goarch/eu.unction/euUNC.Ode91/c1211/audio/1:link.info	SDedes
media/en_redirects_goarch/eu.unction/euUNC.Ode91/c1211/audio/1:link.path	/media/a/en_public/eu/unction/ode9.mp3
media/en_redirects_goarch/eu.unction/euUNC.Ode91/c1211/score/w/1:link.info	SDedes
media/en_redirects_goarch/eu.unction/euUNC.Ode91/c1211/score/w/1:link.path	/media/m/dedes/en/eu/unction/w/ode9.pdf
media/en_redirects_goarch/eu.unction/euUNC.Ode91/c1212/score/b/1:link.info	GCremeens
media/en_redirects_goarch/eu.unction/euUNC.Ode91/c1212/score/b/1:link.path	/media/m/cremeens/en/eu/unction/b/ode9.pdf
media/en_redirects_goarch/eu.unction/euUNC.Ode9End/c1211/audio/1:link.info	SDedes
media/en_redirects_goarch/eu.unction/euUNC.Ode9End/c1211/audio/1:link.path	/media/a/en_public/eu/unction/ode9.mp3#t= 125
media/en_redirects_goarch/eu.unction/euUNC.Ode9End/c1211/score/w/1:link.info	SDedes
media/en_redirects_goarch/eu.unction/euUNC.Ode9End/c1211/score/w/1:link.path	/media/m/dedes/en/eu/unction/w/itistrulyright.pdf
media/en_redirects_goarch/eu.unction/euUNC.Troparion/c1211/audio/1:link.info	SDedes
media/en_redirects_goarch/eu.unction/euUNC.Troparion/c1211/audio/1:link.path	/media/a/en_public/eu/unction/troparion.mp3
media/en_redirects_goarch/eu.unction/euUNC.Troparion/c1211/score/w/1:link.info	SDedes
media/en_redirects_goarch/eu.unction/euUNC.Troparion/c1211/score/w/1:link.path	/media/m/dedes/en/eu/unction/w/troparion.pdf
