media/en_redirects_goarch/eo.e01/eo.Doxasticon/c1211/score/b/1:link.info	SDedes
media/en_redirects_goarch/eo.e01/eo.Doxasticon/c1211/score/b/1:link.path	/media/m/dedes/en/eo/e01/b/eodoxasticon.pdf
media/en_redirects_goarch/eo.e01/eo.Doxasticon/c1211/score/w/1:link.info	SDedes
media/en_redirects_goarch/eo.e01/eo.Doxasticon/c1211/score/w/1:link.path	/media/m/dedes/en/eo/e01/w/eodoxasticon.pdf
media/en_redirects_goarch/eo.e01/eo.Exaposteilarion/c1211/score/b/1:link.info	SDedes
media/en_redirects_goarch/eo.e01/eo.Exaposteilarion/c1211/score/b/1:link.path	/media/m/dedes/en/eo/e01/b/eoexaposteilarion.pdf
media/en_redirects_goarch/eo.e01/eo.Exaposteilarion/c1211/score/w/1:link.info	SDedes
media/en_redirects_goarch/eo.e01/eo.Exaposteilarion/c1211/score/w/1:link.path	/media/m/dedes/en/eo/e01/w/eoexaposteilarion.pdf
media/en_redirects_goarch/eo.e01/eo.Theotokion/c1211/score/b/1:link.info	SDedes
media/en_redirects_goarch/eo.e01/eo.Theotokion/c1211/score/b/1:link.path	/media/m/dedes/en/eo/e01/b/eotheotokion.pdf
media/en_redirects_goarch/eo.e01/eo.Theotokion/c1211/score/w/1:link.info	SDedes
media/en_redirects_goarch/eo.e01/eo.Theotokion/c1211/score/w/1:link.path	/media/m/dedes/en/eo/e01/w/eotheotokion.pdf
