media/en_redirects_goarch/pe.d100/peMA.AposGlory/c1211/score/b/1:link.info	SDedes
media/en_redirects_goarch/pe.d100/peMA.AposGlory/c1211/score/b/1:link.path	/media/m/dedes/en/pe/d097/ma/b/maposglory.pdf
media/en_redirects_goarch/pe.d100/peMA.AposGlory/c1211/score/w/1:link.info	SDedes
media/en_redirects_goarch/pe.d100/peMA.AposGlory/c1211/score/w/1:link.path	/media/m/dedes/en/pe/d097/ma/w/maposglory.pdf
media/en_redirects_goarch/pe.d100/peMA.Kathisma11/c1211/score/b/1:link.info	SDedes
media/en_redirects_goarch/pe.d100/peMA.Kathisma11/c1211/score/b/1:link.path	/media/m/dedes/en/oc/m4/d1/ma/b/kathisma11.pdf
media/en_redirects_goarch/pe.d100/peMA.Kathisma11/c1211/score/w/1:link.info	SDedes
media/en_redirects_goarch/pe.d100/peMA.Kathisma11/c1211/score/w/1:link.path	/media/m/dedes/en/oc/m4/d1/ma/w/kathisma11.pdf
media/en_redirects_goarch/pe.d100/peMA.LaudsGlory/c1211/score/b/1:link.info	SDedes
media/en_redirects_goarch/pe.d100/peMA.LaudsGlory/c1211/score/b/1:link.path	/media/m/dedes/en/pe/d097/ma/b/laudsglory.pdf
media/en_redirects_goarch/pe.d100/peMA.LaudsGlory/c1211/score/w/1:link.info	SDedes
media/en_redirects_goarch/pe.d100/peMA.LaudsGlory/c1211/score/w/1:link.path	/media/m/dedes/en/pe/d097/ma/w/laudsglory.pdf
media/en_redirects_goarch/pe.d100/peVE.AposGlory/c1211/score/b/1:link.info	SDedes
media/en_redirects_goarch/pe.d100/peVE.AposGlory/c1211/score/b/1:link.path	/media/m/dedes/en/pe/d095/ve/b/sticglory.pdf
media/en_redirects_goarch/pe.d100/peVE.AposGlory/c1211/score/w/1:link.info	SDedes
media/en_redirects_goarch/pe.d100/peVE.AposGlory/c1211/score/w/1:link.path	/media/m/dedes/en/pe/d095/ve/w/sticglory.pdf
media/en_redirects_goarch/pe.d100/peVE.SticGlory/c1211/score/b/1:link.info	SDedes
media/en_redirects_goarch/pe.d100/peVE.SticGlory/c1211/score/b/1:link.path	/media/m/dedes/en/pe/d096/ma/b/maposglory.pdf
media/en_redirects_goarch/pe.d100/peVE.SticGlory/c1211/score/w/1:link.info	SDedes
media/en_redirects_goarch/pe.d100/peVE.SticGlory/c1211/score/w/1:link.path	/media/m/dedes/en/pe/d096/ma/w/maposglory.pdf
