media/en_redirects_goarch/me.m09.d18/meVE.AposGlory/c1211/score/b/1:link.info	SDedes
media/en_redirects_goarch/me.m09.d18/meVE.AposGlory/c1211/score/b/1:link.path	/media/m/dedes/en/me/m09/d13/ve/b/sticboth.pdf
media/en_redirects_goarch/me.m09.d18/meVE.AposGlory/c1211/score/w/1:link.info	SDedes
media/en_redirects_goarch/me.m09.d18/meVE.AposGlory/c1211/score/w/1:link.path	/media/m/dedes/en/me/m09/d13/ve/w/sticboth.pdf
media/en_redirects_goarch/me.m09.d18/meVE.SticGlory/c1211/score/b/1:link.info	SDedes
media/en_redirects_goarch/me.m09.d18/meVE.SticGlory/c1211/score/b/1:link.path	/media/m/dedes/en/me/m09/d14/ve/b/lityglory.pdf
media/en_redirects_goarch/me.m09.d18/meVE.SticGlory/c1211/score/w/1:link.info	SDedes
media/en_redirects_goarch/me.m09.d18/meVE.SticGlory/c1211/score/w/1:link.path	/media/m/dedes/en/me/m09/d14/ve/w/lityglory.pdf
