media/en_redirects_goarch/pe.d076/peMA.Exaposteilarion1/c1211/audio/1:link.info	SDedes
media/en_redirects_goarch/pe.d076/peMA.Exaposteilarion1/c1211/audio/1:link.path	/media/a/en_public/pe/d071/exaposteilarion1.mp3
media/en_redirects_goarch/pe.d076/peMA.Exaposteilarion1/c1211/score/b/1:link.info	SDedes
media/en_redirects_goarch/pe.d076/peMA.Exaposteilarion1/c1211/score/b/1:link.path	/media/m/dedes/en/pe/d071/ma/b/exaposteilarion1.pdf
media/en_redirects_goarch/pe.d076/peMA.Exaposteilarion1/c1211/score/w/1:link.info	SDedes
media/en_redirects_goarch/pe.d076/peMA.Exaposteilarion1/c1211/score/w/1:link.path	/media/m/dedes/en/pe/d071/ma/w/exaposteilarion1.pdf
media/en_redirects_goarch/pe.d076/peMA.Exaposteilarion2/c1211/score/w/1:link.info	SDedes
media/en_redirects_goarch/pe.d076/peMA.Exaposteilarion2/c1211/score/w/1:link.path	/media/m/dedes/en/pe/d076/ma/w/exaposteilarion2.pdf
media/en_redirects_goarch/pe.d076/peMA.MM.Lauds1234as1234/c1211/score/b/1:link.info	SDedes
media/en_redirects_goarch/pe.d076/peMA.MM.Lauds1234as1234/c1211/score/b/1:link.path	/media/m/dedes/en/pe/d076/ma/b/lauds1234as1234.pdf
media/en_redirects_goarch/pe.d076/peMA.MM.Lauds1234as1234/c1211/score/w/1:link.info	SDedes
media/en_redirects_goarch/pe.d076/peMA.MM.Lauds1234as1234/c1211/score/w/1:link.path	/media/m/dedes/en/pe/d076/ma/w/lauds1234as1234.pdf
media/en_redirects_goarch/pe.d076/peMA.MM.Lauds12as12/c1211/score/b/1:link.info	SDedes
media/en_redirects_goarch/pe.d076/peMA.MM.Lauds12as12/c1211/score/b/1:link.path	/media/m/dedes/en/pe/d076/ma/b/lauds12as12.pdf
media/en_redirects_goarch/pe.d076/peMA.MM.Lauds12as12/c1211/score/w/1:link.info	SDedes
media/en_redirects_goarch/pe.d076/peMA.MM.Lauds12as12/c1211/score/w/1:link.path	/media/m/dedes/en/pe/d076/ma/w/lauds12as12.pdf
media/en_redirects_goarch/pe.d076/peMA.MM.Lauds5678as5678/c1211/score/b/1:link.info	SDedes
media/en_redirects_goarch/pe.d076/peMA.MM.Lauds5678as5678/c1211/score/b/1:link.path	/media/m/dedes/en/pe/d076/ma/b/lauds5678as5678.pdf
media/en_redirects_goarch/pe.d076/peMA.MM.Lauds5678as5678/c1211/score/w/1:link.info	SDedes
media/en_redirects_goarch/pe.d076/peMA.MM.Lauds5678as5678/c1211/score/w/1:link.path	/media/m/dedes/en/pe/d076/ma/w/lauds5678as5678.pdf
media/en_redirects_goarch/pe.d076/peMA.Ode9C11/c1211/score/w/1:link.info	SDedes
media/en_redirects_goarch/pe.d076/peMA.Ode9C11/c1211/score/w/1:link.path	/media/m/dedes/en/pe/d076/ma/w/ode9.pdf
media/en_redirects_goarch/pe.d076/peVE.Apolytikion1/c1211/score/w/1:link.info	SDedes
media/en_redirects_goarch/pe.d076/peVE.Apolytikion1/c1211/score/w/1:link.path	/media/m/dedes/en/pe/d076/ve/w/apolytikion1.pdf
media/en_redirects_goarch/pe.d076/peVE.Aposticha1/c1211/score/b/1:link.info	SDedes
media/en_redirects_goarch/pe.d076/peVE.Aposticha1/c1211/score/b/1:link.path	/media/m/dedes/en/oc/m6/d1/ve/b/aposticha1.pdf
media/en_redirects_goarch/pe.d076/peVE.Aposticha1/c1211/score/w/1:link.info	SDedes
media/en_redirects_goarch/pe.d076/peVE.Aposticha1/c1211/score/w/1:link.path	/media/m/dedes/en/oc/m6/d1/ve/w/aposticha1.pdf
media/en_redirects_goarch/pe.d076/peVE.MM.Stichera1234as3456/c1211/score/b/1:link.info	SDedes
media/en_redirects_goarch/pe.d076/peVE.MM.Stichera1234as3456/c1211/score/b/1:link.path	/media/m/dedes/en/pe/d076/ve/b/stichera1234as3456.pdf
media/en_redirects_goarch/pe.d076/peVE.MM.Stichera1234as3456/c1211/score/w/1:link.info	SDedes
media/en_redirects_goarch/pe.d076/peVE.MM.Stichera1234as3456/c1211/score/w/1:link.path	/media/m/dedes/en/pe/d076/ve/w/stichera1234as3456.pdf
media/en_redirects_goarch/pe.d076/peVE.MM.Stichera123as123/c1211/score/b/1:link.info	SDedes
media/en_redirects_goarch/pe.d076/peVE.MM.Stichera123as123/c1211/score/b/1:link.path	/media/m/dedes/en/pe/d076/ve/b/stichera123as123.pdf
media/en_redirects_goarch/pe.d076/peVE.MM.Stichera123as123/c1211/score/w/1:link.info	SDedes
media/en_redirects_goarch/pe.d076/peVE.MM.Stichera123as123/c1211/score/w/1:link.path	/media/m/dedes/en/pe/d076/ve/w/stichera123as123.pdf
media/en_redirects_goarch/pe.d076/peVE.SticBoth/c1211/score/b/1:link.info	SDedes
media/en_redirects_goarch/pe.d076/peVE.SticBoth/c1211/score/b/1:link.path	/media/m/dedes/en/oc/m6/d1/ve/b/stictheotokion.pdf
media/en_redirects_goarch/pe.d076/peVE.SticBoth/c1211/score/w/1:link.info	SDedes
media/en_redirects_goarch/pe.d076/peVE.SticBoth/c1211/score/w/1:link.path	/media/m/dedes/en/oc/m6/d1/ve/w/stictheotokion.pdf
media/en_redirects_goarch/pe.d076/peVE.Stichera01/c1211/score/b/1:link.info	SDedes
media/en_redirects_goarch/pe.d076/peVE.Stichera01/c1211/score/b/1:link.path	/media/m/dedes/en/pe/d076/ve/b/stichera01.pdf
media/en_redirects_goarch/pe.d076/peVE.Stichera01/c1211/score/w/1:link.info	SDedes
media/en_redirects_goarch/pe.d076/peVE.Stichera01/c1211/score/w/1:link.path	/media/m/dedes/en/pe/d076/ve/w/stichera01.pdf
media/en_redirects_goarch/pe.d076/peVE.Stichera02/c1211/score/b/1:link.info	SDedes
media/en_redirects_goarch/pe.d076/peVE.Stichera02/c1211/score/b/1:link.path	/media/m/dedes/en/pe/d076/ve/b/stichera02.pdf
media/en_redirects_goarch/pe.d076/peVE.Stichera02/c1211/score/w/1:link.info	SDedes
media/en_redirects_goarch/pe.d076/peVE.Stichera02/c1211/score/w/1:link.path	/media/m/dedes/en/pe/d076/ve/w/stichera02.pdf
media/en_redirects_goarch/pe.d076/peVE.Stichera03/c1211/score/b/1:link.info	SDedes
media/en_redirects_goarch/pe.d076/peVE.Stichera03/c1211/score/b/1:link.path	/media/m/dedes/en/pe/d076/ve/b/stichera03.pdf
media/en_redirects_goarch/pe.d076/peVE.Stichera03/c1211/score/w/1:link.info	SDedes
media/en_redirects_goarch/pe.d076/peVE.Stichera03/c1211/score/w/1:link.path	/media/m/dedes/en/pe/d076/ve/w/stichera03.pdf
media/en_redirects_goarch/pe.d076/peVE.Stichera04/c1211/score/b/1:link.info	SDedes
media/en_redirects_goarch/pe.d076/peVE.Stichera04/c1211/score/b/1:link.path	/media/m/dedes/en/pe/d076/ve/b/stichera04.pdf
media/en_redirects_goarch/pe.d076/peVE.Stichera04/c1211/score/w/1:link.info	SDedes
media/en_redirects_goarch/pe.d076/peVE.Stichera04/c1211/score/w/1:link.path	/media/m/dedes/en/pe/d076/ve/w/stichera04.pdf
media/en_redirects_goarch/pe.d076/peVE.Stichera05/c1211/score/b/1:link.info	SDedes
media/en_redirects_goarch/pe.d076/peVE.Stichera05/c1211/score/b/1:link.path	/media/m/dedes/en/pe/d076/ve/b/stichera05.pdf
media/en_redirects_goarch/pe.d076/peVE.Stichera05/c1211/score/w/1:link.info	SDedes
media/en_redirects_goarch/pe.d076/peVE.Stichera05/c1211/score/w/1:link.path	/media/m/dedes/en/pe/d076/ve/w/stichera05.pdf
media/en_redirects_goarch/pe.d076/peVE.Stichera06/c1211/score/b/1:link.info	SDedes
media/en_redirects_goarch/pe.d076/peVE.Stichera06/c1211/score/b/1:link.path	/media/m/dedes/en/pe/d076/ve/b/stichera06.pdf
media/en_redirects_goarch/pe.d076/peVE.Stichera06/c1211/score/w/1:link.info	SDedes
media/en_redirects_goarch/pe.d076/peVE.Stichera06/c1211/score/w/1:link.path	/media/m/dedes/en/pe/d076/ve/w/stichera06.pdf
