media/en_redirects_goarch/tr.d047/trVE.AposIdiomelon1/c1211/audio/1:link.info	SDedes
media/en_redirects_goarch/tr.d047/trVE.AposIdiomelon1/c1211/audio/1:link.path	/media/a/en_public/tr/d047/ve/aposidiomelon1.mp3
media/en_redirects_goarch/tr.d047/trVE.AposIdiomelon1/c1211/score/b/1:link.info	SDedes | GCremeens
media/en_redirects_goarch/tr.d047/trVE.AposIdiomelon1/c1211/score/b/1:link.path	/media/m/cremeens/en/tr/d047/ve/b/aposidiomelon1.pdf
media/en_redirects_goarch/tr.d047/trVE.AposIdiomelon1/c1211/score/w/1:link.info	SDedes
media/en_redirects_goarch/tr.d047/trVE.AposIdiomelon1/c1211/score/w/1:link.path	/media/m/dedes/en/tr/d047/ve/w/aposidiomelon1.pdf
media/en_redirects_goarch/tr.d047/trVE.AposIdiomelon2/c1211/audio/1:link.info	SDedes
media/en_redirects_goarch/tr.d047/trVE.AposIdiomelon2/c1211/audio/1:link.path	/media/a/en_public/tr/d047/ve/aposidiomelon2.mp3
media/en_redirects_goarch/tr.d047/trVE.AposIdiomelon2/c1211/score/b/1:link.info	SDedes | GCremeens
media/en_redirects_goarch/tr.d047/trVE.AposIdiomelon2/c1211/score/b/1:link.path	/media/m/cremeens/en/tr/d047/ve/b/aposidiomelon2.pdf
media/en_redirects_goarch/tr.d047/trVE.AposIdiomelon2/c1211/score/w/1:link.info	SDedes
media/en_redirects_goarch/tr.d047/trVE.AposIdiomelon2/c1211/score/w/1:link.path	/media/m/dedes/en/tr/d047/ve/w/aposidiomelon2.pdf
media/en_redirects_goarch/tr.d047/trVE.AposMartyric/c1211/audio/1:link.info	SDedes
media/en_redirects_goarch/tr.d047/trVE.AposMartyric/c1211/audio/1:link.path	/media/a/en_public/tr/d047/ve/aposmartyric.mp3
media/en_redirects_goarch/tr.d047/trVE.AposMartyric/c1211/score/b/1:link.info	SDedes | GCremeens
media/en_redirects_goarch/tr.d047/trVE.AposMartyric/c1211/score/b/1:link.path	/media/m/cremeens/en/tr/d047/ve/b/aposmartyric.pdf
media/en_redirects_goarch/tr.d047/trVE.AposMartyric/c1211/score/w/1:link.info	SDedes
media/en_redirects_goarch/tr.d047/trVE.AposMartyric/c1211/score/w/1:link.path	/media/m/dedes/en/tr/d047/ve/w/aposmartyric.pdf
media/en_redirects_goarch/tr.d047/trVE.SticGlory/c1211/audio/1:link.info	SDedes
media/en_redirects_goarch/tr.d047/trVE.SticGlory/c1211/audio/1:link.path	/media/a/en_public/tr/d047/ve/sticglory.mp3
media/en_redirects_goarch/tr.d047/trVE.SticGlory/c1211/score/b/1:link.info	SDedes | GCremeens
media/en_redirects_goarch/tr.d047/trVE.SticGlory/c1211/score/b/1:link.path	/media/m/cremeens/en/tr/d047/ve/b/sticglory.pdf
media/en_redirects_goarch/tr.d047/trVE.SticGlory/c1211/score/w/1:link.info	SDedes
media/en_redirects_goarch/tr.d047/trVE.SticGlory/c1211/score/w/1:link.path	/media/m/dedes/en/tr/d047/ve/w/sticglory.pdf
media/en_redirects_goarch/tr.d047/trVE.Stichera01/c1211/audio/1:link.info	SDedes
media/en_redirects_goarch/tr.d047/trVE.Stichera01/c1211/audio/1:link.path	/media/a/en_public/tr/d047/ve/stichera01.mp3
media/en_redirects_goarch/tr.d047/trVE.Stichera01/c1211/score/b/1:link.info	SDedes | GCremeens
media/en_redirects_goarch/tr.d047/trVE.Stichera01/c1211/score/b/1:link.path	/media/m/cremeens/en/tr/d047/ve/b/stichera01.pdf
media/en_redirects_goarch/tr.d047/trVE.Stichera01/c1211/score/w/1:link.info	SDedes
media/en_redirects_goarch/tr.d047/trVE.Stichera01/c1211/score/w/1:link.path	/media/m/dedes/en/tr/d047/ve/w/stichera01.pdf
media/en_redirects_goarch/tr.d047/trVE.Stichera02/c1211/audio/1:link.info	SDedes
media/en_redirects_goarch/tr.d047/trVE.Stichera02/c1211/audio/1:link.path	/media/a/en_public/tr/d047/ve/stichera02.mp3
media/en_redirects_goarch/tr.d047/trVE.Stichera02/c1211/score/b/1:link.info	SDedes | GCremeens
media/en_redirects_goarch/tr.d047/trVE.Stichera02/c1211/score/b/1:link.path	/media/m/cremeens/en/tr/d047/ve/b/stichera02.pdf
media/en_redirects_goarch/tr.d047/trVE.Stichera02/c1211/score/w/1:link.info	SDedes
media/en_redirects_goarch/tr.d047/trVE.Stichera02/c1211/score/w/1:link.path	/media/m/dedes/en/tr/d047/ve/w/stichera02.pdf
media/en_redirects_goarch/tr.d047/trVE.Stichera03/c1211/audio/1:link.info	SDedes
media/en_redirects_goarch/tr.d047/trVE.Stichera03/c1211/audio/1:link.path	/media/a/en_public/tr/d047/ve/stichera03.mp3
media/en_redirects_goarch/tr.d047/trVE.Stichera03/c1211/score/b/1:link.info	SDedes | GCremeens
media/en_redirects_goarch/tr.d047/trVE.Stichera03/c1211/score/b/1:link.path	/media/m/cremeens/en/tr/d047/ve/b/stichera03.pdf
media/en_redirects_goarch/tr.d047/trVE.Stichera03/c1211/score/w/1:link.info	SDedes
media/en_redirects_goarch/tr.d047/trVE.Stichera03/c1211/score/w/1:link.path	/media/m/dedes/en/tr/d047/ve/w/stichera03.pdf
