media/en_redirects_goarch/me.m06.d24/meMA.ExapTheotokion/c1211/score/w/1:link.info	SDedes
media/en_redirects_goarch/me.m06.d24/meMA.ExapTheotokion/c1211/score/w/1:link.path	/media/m/dedes/en/me/m06/d24/ma/w/exaptheotokion.pdf
media/en_redirects_goarch/me.m06.d24/meMA.Exaposteilarion1/c1211/score/w/1:link.info	SDedes
media/en_redirects_goarch/me.m06.d24/meMA.Exaposteilarion1/c1211/score/w/1:link.path	/media/m/dedes/en/me/m06/d24/ma/w/exaposteilarion1.pdf
media/en_redirects_goarch/me.m06.d24/meMA.Kathisma11/c1211/score/w/1:link.info	SDedes
media/en_redirects_goarch/me.m06.d24/meMA.Kathisma11/c1211/score/w/1:link.path	/media/m/dedes/en/me/m06/d24/ma/w/kathisma11.pdf
media/en_redirects_goarch/me.m06.d24/meMA.Kathisma1T/c1211/score/w/1:link.info	SDedes
media/en_redirects_goarch/me.m06.d24/meMA.Kathisma1T/c1211/score/w/1:link.path	/media/m/dedes/en/oc/m4/d1/ma/w/kathisma13.pdf
media/en_redirects_goarch/me.m06.d24/meMA.Kathisma21/c1211/score/w/1:link.info	SDedes
media/en_redirects_goarch/me.m06.d24/meMA.Kathisma21/c1211/score/w/1:link.path	/media/m/dedes/en/me/m06/d24/ma/w/kathisma21.pdf
media/en_redirects_goarch/me.m06.d24/meMA.Kathisma2T/c1211/score/w/1:link.info	SDedes
media/en_redirects_goarch/me.m06.d24/meMA.Kathisma2T/c1211/score/w/1:link.path	/media/m/dedes/en/me/m06/d24/ma/w/kathisma2t.pdf
media/en_redirects_goarch/me.m06.d24/meMA.Kathisma31/c1211/score/w/1:link.info	SDedes
media/en_redirects_goarch/me.m06.d24/meMA.Kathisma31/c1211/score/w/1:link.path	/media/m/dedes/en/me/m06/d24/ma/w/kathisma31.pdf
media/en_redirects_goarch/me.m06.d24/meMA.Kathisma3T/c1211/score/w/1:link.info	SDedes
media/en_redirects_goarch/me.m06.d24/meMA.Kathisma3T/c1211/score/w/1:link.path	/media/m/dedes/en/me/m06/d24/ma/w/kathisma3t.pdf
media/en_redirects_goarch/me.m06.d24/meMA.Lauds1/c1211/score/w/1:link.info	SDedes
media/en_redirects_goarch/me.m06.d24/meMA.Lauds1/c1211/score/w/1:link.path	/media/m/dedes/en/me/m06/d24/ma/w/lauds1.pdf
media/en_redirects_goarch/me.m06.d24/meMA.Lauds2/c1211/score/w/1:link.info	SDedes
media/en_redirects_goarch/me.m06.d24/meMA.Lauds2/c1211/score/w/1:link.path	/media/m/dedes/en/me/m06/d24/ma/w/lauds2.pdf
media/en_redirects_goarch/me.m06.d24/meMA.Lauds3/c1211/score/w/1:link.info	SDedes
media/en_redirects_goarch/me.m06.d24/meMA.Lauds3/c1211/score/w/1:link.path	/media/m/dedes/en/me/m06/d24/ma/w/lauds3.pdf
media/en_redirects_goarch/me.m06.d24/meMA.Lauds4/c1211/score/w/1:link.info	SDedes
media/en_redirects_goarch/me.m06.d24/meMA.Lauds4/c1211/score/w/1:link.path	/media/m/dedes/en/me/m06/d24/ma/w/lauds4.pdf
media/en_redirects_goarch/me.m06.d24/meMA.LaudsGlory/c1211/score/b/1:link.info	SDedes
media/en_redirects_goarch/me.m06.d24/meMA.LaudsGlory/c1211/score/b/1:link.path	/media/m/dedes/en/me/m06/d24/ma/b/laudsglory.pdf
media/en_redirects_goarch/me.m06.d24/meMA.LaudsGlory/c1211/score/w/1:link.info	SDedes
media/en_redirects_goarch/me.m06.d24/meMA.LaudsGlory/c1211/score/w/1:link.path	/media/m/dedes/en/me/m06/d24/ma/w/laudsglory.pdf
media/en_redirects_goarch/me.m06.d24/meMA.MM.Lauds1234as5678/c1211/score/w/1:link.info	SDedes
media/en_redirects_goarch/me.m06.d24/meMA.MM.Lauds1234as5678/c1211/score/w/1:link.path	/media/m/dedes/en/me/m06/d24/ma/w/lauds1234as5678.pdf
media/en_redirects_goarch/me.m06.d24/meMA.PostGospelGlory/c1211/score/b/1:link.info	SDedes
media/en_redirects_goarch/me.m06.d24/meMA.PostGospelGlory/c1211/score/b/1:link.path	/media/m/dedes/en/ho/ho03/b/postgospelglory_forerunner.pdf
media/en_redirects_goarch/me.m06.d24/meMA.PostGospelGlory/c1211/score/w/1:link.info	SDedes
media/en_redirects_goarch/me.m06.d24/meMA.PostGospelGlory/c1211/score/w/1:link.path	/media/m/dedes/en/ho/ho03/w/postgospelglory_forerunner.pdf
media/en_redirects_goarch/me.m06.d24/meMA.PostGospelIdiomelon/c1211/score/b/1:link.info	SDedes
media/en_redirects_goarch/me.m06.d24/meMA.PostGospelIdiomelon/c1211/score/b/1:link.path	/media/m/dedes/en/me/m06/d24/ma/b/postgospelidiomelon.pdf
media/en_redirects_goarch/me.m06.d24/meMA.PostGospelIdiomelon/c1211/score/w/1:link.info	SDedes
media/en_redirects_goarch/me.m06.d24/meMA.PostGospelIdiomelon/c1211/score/w/1:link.path	/media/m/dedes/en/me/m06/d24/ma/w/postgospelidiomelon.pdf
media/en_redirects_goarch/me.m06.d24/meSV.MM.Stichera1123as78910/c1271/score/b/1:link.info	GRallis
media/en_redirects_goarch/me.m06.d24/meSV.MM.Stichera1123as78910/c1271/score/b/1:link.path	/media/m/rallis/en/me/m06/d26/sv/b/stichera1123as78910.pdf
media/en_redirects_goarch/me.m06.d24/meSV.SticGlory/c1211/score/b/1:link.info	SDedes
media/en_redirects_goarch/me.m06.d24/meSV.SticGlory/c1211/score/b/1:link.path	/media/m/dedes/en/me/m06/d25/ma/b/maposglory.pdf
media/en_redirects_goarch/me.m06.d24/meSV.SticGlory/c1211/score/w/1:link.info	SDedes
media/en_redirects_goarch/me.m06.d24/meSV.SticGlory/c1211/score/w/1:link.path	/media/m/dedes/en/me/m06/d25/ma/w/maposglory.pdf
media/en_redirects_goarch/me.m06.d24/meVE.Apolytikion1/c1211/score/w/1:link.info	SDedes
media/en_redirects_goarch/me.m06.d24/meVE.Apolytikion1/c1211/score/w/1:link.path	/media/m/dedes/en/me/m06/d24/ve/w/apolytikion1.pdf
media/en_redirects_goarch/me.m06.d24/meVE.Apolytikion1/c1212/score/b/1:link.info	GRallis
media/en_redirects_goarch/me.m06.d24/meVE.Apolytikion1/c1212/score/b/1:link.path	/media/m/rallis/en/me/m06/d24/ve/b/apolytikion1.pdf
media/en_redirects_goarch/me.m06.d24/meVE.Apolytikion1/c2001/score/w/1:link.info	NewByz
media/en_redirects_goarch/me.m06.d24/meVE.Apolytikion1/c2001/score/w/1:link.path	/media/m/newbyz/en/me/m06/d24/ve/w/apolytikion1.pdf
media/en_redirects_goarch/me.m06.d24/meVE.AposBoth/c1211/score/b/1:link.info	SDedes
media/en_redirects_goarch/me.m06.d24/meVE.AposBoth/c1211/score/b/1:link.path	/media/m/dedes/en/me/m06/d24/ve/b/aposboth.pdf
media/en_redirects_goarch/me.m06.d24/meVE.AposBoth/c1211/score/w/1:link.info	SDedes
media/en_redirects_goarch/me.m06.d24/meVE.AposBoth/c1211/score/w/1:link.path	/media/m/dedes/en/me/m06/d24/ve/w/aposboth.pdf
media/en_redirects_goarch/me.m06.d24/meVE.AposGlory/c1211/score/b/1:link.info	SDedes
media/en_redirects_goarch/me.m06.d24/meVE.AposGlory/c1211/score/b/1:link.path	/media/m/dedes/en/me/m06/d24/ve/b/aposglory.pdf
media/en_redirects_goarch/me.m06.d24/meVE.AposGlory/c1211/score/w/1:link.info	SDedes
media/en_redirects_goarch/me.m06.d24/meVE.AposGlory/c1211/score/w/1:link.path	/media/m/dedes/en/me/m06/d24/ve/w/aposglory.pdf
media/en_redirects_goarch/me.m06.d24/meVE.LityBoth/c1211/score/b/1:link.info	SDedes
media/en_redirects_goarch/me.m06.d24/meVE.LityBoth/c1211/score/b/1:link.path	/media/m/dedes/en/oc/m5/d3/ve/b/apostheotokion.pdf
media/en_redirects_goarch/me.m06.d24/meVE.LityBoth/c1211/score/w/1:link.info	SDedes
media/en_redirects_goarch/me.m06.d24/meVE.LityBoth/c1211/score/w/1:link.path	/media/m/dedes/en/oc/m5/d3/ve/w/apostheotokion.pdf
media/en_redirects_goarch/me.m06.d24/meVE.MM.Stichera123as8910/c1211/score/b/1:link.info	SDedes
media/en_redirects_goarch/me.m06.d24/meVE.MM.Stichera123as8910/c1211/score/b/1:link.path	/media/m/dedes/en/me/m06/d24/ma/b/stichera123as8910.pdf
media/en_redirects_goarch/me.m06.d24/meVE.MM.Stichera123as8910/c1211/score/w/1:link.info	SDedes
media/en_redirects_goarch/me.m06.d24/meVE.MM.Stichera123as8910/c1211/score/w/1:link.path	/media/m/dedes/en/me/m06/d24/ma/w/stichera123as8910.pdf
media/en_redirects_goarch/me.m06.d24/meVE.SticBoth/c1211/score/b/1:link.info	SDedes
media/en_redirects_goarch/me.m06.d24/meVE.SticBoth/c1211/score/b/1:link.path	/media/m/dedes/en/me/m06/d24/ve/b/sticboth.pdf
media/en_redirects_goarch/me.m06.d24/meVE.SticBoth/c1211/score/w/1:link.info	SDedes
media/en_redirects_goarch/me.m06.d24/meVE.SticBoth/c1211/score/w/1:link.path	/media/m/dedes/en/me/m06/d24/ve/w/sticboth.pdf
media/en_redirects_goarch/me.m06.d24/meVE.SticGlory/c1211/score/b/1:link.info	SDedes
media/en_redirects_goarch/me.m06.d24/meVE.SticGlory/c1211/score/b/1:link.path	/media/m/dedes/en/me/m06/d24/ve/b/sticglory.pdf
media/en_redirects_goarch/me.m06.d24/meVE.SticGlory/c1211/score/w/1:link.info	SDedes
media/en_redirects_goarch/me.m06.d24/meVE.SticGlory/c1211/score/w/1:link.path	/media/m/dedes/en/me/m06/d24/ve/w/sticglory.pdf
media/en_redirects_goarch/me.m06.d24/meVE.Stichera01/c1211/score/b/1:link.info	SDedes
media/en_redirects_goarch/me.m06.d24/meVE.Stichera01/c1211/score/b/1:link.path	/media/m/dedes/en/me/m06/d24/ve/b/stichera01.pdf
media/en_redirects_goarch/me.m06.d24/meVE.Stichera01/c1211/score/w/1:link.info	SDedes
media/en_redirects_goarch/me.m06.d24/meVE.Stichera01/c1211/score/w/1:link.path	/media/m/dedes/en/me/m06/d24/ve/w/stichera01.pdf
media/en_redirects_goarch/me.m06.d24/meVE.Stichera02/c1211/score/b/1:link.info	SDedes
media/en_redirects_goarch/me.m06.d24/meVE.Stichera02/c1211/score/b/1:link.path	/media/m/dedes/en/me/m06/d24/ve/b/stichera02.pdf
media/en_redirects_goarch/me.m06.d24/meVE.Stichera02/c1211/score/w/1:link.info	SDedes
media/en_redirects_goarch/me.m06.d24/meVE.Stichera02/c1211/score/w/1:link.path	/media/m/dedes/en/me/m06/d24/ve/w/stichera02.pdf
media/en_redirects_goarch/me.m06.d24/meVE.Stichera03/c1211/score/b/1:link.info	SDedes
media/en_redirects_goarch/me.m06.d24/meVE.Stichera03/c1211/score/b/1:link.path	/media/m/dedes/en/me/m06/d24/ve/b/stichera03.pdf
media/en_redirects_goarch/me.m06.d24/meVE.Stichera03/c1211/score/w/1:link.info	SDedes
media/en_redirects_goarch/me.m06.d24/meVE.Stichera03/c1211/score/w/1:link.path	/media/m/dedes/en/me/m06/d24/ve/w/stichera03.pdf
