media/en_redirects_goarch/pe.d085/peLI.Kontakion1/c1211/score/w/1:link.info	SDedes
media/en_redirects_goarch/pe.d085/peLI.Kontakion1/c1211/score/w/1:link.path	/media/m/dedes/en/pe/d085/li/w/seasonalkontakion.pdf
media/en_redirects_goarch/pe.d085/peMA.Exaposteilarion1/c1211/score/w/1:link.info	SDedes
media/en_redirects_goarch/pe.d085/peMA.Exaposteilarion1/c1211/score/w/1:link.path	/media/m/dedes/en/pe/d085/ma/w/exaposteilarion1.pdf
media/en_redirects_goarch/pe.d085/peMA.Kathisma11/c1211/audio/1:link.info	SDedes
media/en_redirects_goarch/pe.d085/peMA.Kathisma11/c1211/audio/1:link.path	/media/a/en_public/oc/m2/d1/ma/kathisma21.mp3
media/en_redirects_goarch/pe.d085/peMA.Kathisma11/c1211/score/b/1:link.info	SDedes
media/en_redirects_goarch/pe.d085/peMA.Kathisma11/c1211/score/b/1:link.path	/media/m/dedes/en/pe/d085/ma/b/kathisma11.pdf
media/en_redirects_goarch/pe.d085/peMA.Kathisma11/c1211/score/w/1:link.info	SDedes
media/en_redirects_goarch/pe.d085/peMA.Kathisma11/c1211/score/w/1:link.path	/media/m/dedes/en/pe/d085/ma/w/kathisma11.pdf
media/en_redirects_goarch/pe.d085/peMA.Kathisma12/c1211/score/b/1:link.info	SDedes
media/en_redirects_goarch/pe.d085/peMA.Kathisma12/c1211/score/b/1:link.path	/media/m/dedes/en/pe/d085/ma/b/kathisma12.pdf
media/en_redirects_goarch/pe.d085/peMA.Kathisma12/c1211/score/w/1:link.info	SDedes
media/en_redirects_goarch/pe.d085/peMA.Kathisma12/c1211/score/w/1:link.path	/media/m/dedes/en/pe/d085/ma/w/kathisma12.pdf
media/en_redirects_goarch/pe.d085/peMA.Kathisma13/c1211/audio/1:link.info	SDedes
media/en_redirects_goarch/pe.d085/peMA.Kathisma13/c1211/audio/1:link.path	/media/a/en_public/oc/m2/d1/ma/apoltheotokionvm.mp3
media/en_redirects_goarch/pe.d085/peMA.Kathisma13/c1211/score/b/1:link.info	SDedes
media/en_redirects_goarch/pe.d085/peMA.Kathisma13/c1211/score/b/1:link.path	/media/m/dedes/en/pe/d085/ma/b/kathisma13.pdf
media/en_redirects_goarch/pe.d085/peMA.Kathisma13/c1211/score/w/1:link.info	SDedes
media/en_redirects_goarch/pe.d085/peMA.Kathisma13/c1211/score/w/1:link.path	/media/m/dedes/en/pe/d085/ma/w/kathisma13.pdf
media/en_redirects_goarch/pe.d085/peMA.Kathisma21/c1211/score/b/1:link.info	SDedes
media/en_redirects_goarch/pe.d085/peMA.Kathisma21/c1211/score/b/1:link.path	/media/m/dedes/en/pe/d085/ma/b/kathisma21.pdf
media/en_redirects_goarch/pe.d085/peMA.Kathisma21/c1211/score/w/1:link.info	SDedes
media/en_redirects_goarch/pe.d085/peMA.Kathisma21/c1211/score/w/1:link.path	/media/m/dedes/en/pe/d085/ma/w/kathisma21.pdf
media/en_redirects_goarch/pe.d085/peMA.Kathisma22/c1211/score/b/1:link.info	SDedes
media/en_redirects_goarch/pe.d085/peMA.Kathisma22/c1211/score/b/1:link.path	/media/m/dedes/en/pe/d085/ma/b/kathisma22.pdf
media/en_redirects_goarch/pe.d085/peMA.Kathisma22/c1211/score/w/1:link.info	SDedes
media/en_redirects_goarch/pe.d085/peMA.Kathisma22/c1211/score/w/1:link.path	/media/m/dedes/en/pe/d085/ma/w/kathisma22.pdf
media/en_redirects_goarch/pe.d085/peMA.Kathisma23/c1211/audio/1:link.info	SDedes
media/en_redirects_goarch/pe.d085/peMA.Kathisma23/c1211/audio/1:link.path	/media/a/en_public/oc/m2/d1/ma/kathisma13.mp3
media/en_redirects_goarch/pe.d085/peMA.Kathisma23/c1211/score/b/1:link.info	SDedes
media/en_redirects_goarch/pe.d085/peMA.Kathisma23/c1211/score/b/1:link.path	/media/m/dedes/en/pe/d085/ma/b/kathisma23.pdf
media/en_redirects_goarch/pe.d085/peMA.Kathisma23/c1211/score/w/1:link.info	SDedes
media/en_redirects_goarch/pe.d085/peMA.Kathisma23/c1211/score/w/1:link.path	/media/m/dedes/en/pe/d085/ma/w/kathisma23.pdf
media/en_redirects_goarch/pe.d085/peMA.Lauds1/c1211/audio/1:link.info	SDedes
media/en_redirects_goarch/pe.d085/peMA.Lauds1/c1211/audio/1:link.path	/media/a/dedes/oc/m2/d1/ma/lauds1.mp3
media/en_redirects_goarch/pe.d085/peMA.Lauds1/c1211/score/b/1:link.info	SDedes
media/en_redirects_goarch/pe.d085/peMA.Lauds1/c1211/score/b/1:link.path	/media/m/dedes/en/pe/d085/ma/b/lauds1.pdf
media/en_redirects_goarch/pe.d085/peMA.Lauds1/c1211/score/w/1:link.info	SDedes
media/en_redirects_goarch/pe.d085/peMA.Lauds1/c1211/score/w/1:link.path	/media/m/dedes/en/pe/d085/ma/w/lauds1.pdf
media/en_redirects_goarch/pe.d085/peMA.Lauds2/c1211/audio/1:link.info	SDedes
media/en_redirects_goarch/pe.d085/peMA.Lauds2/c1211/audio/1:link.path	/media/a/dedes/oc/m2/d1/ma/lauds2.mp3
media/en_redirects_goarch/pe.d085/peMA.Lauds2/c1211/score/b/1:link.info	SDedes
media/en_redirects_goarch/pe.d085/peMA.Lauds2/c1211/score/b/1:link.path	/media/m/dedes/en/pe/d085/ma/b/lauds2.pdf
media/en_redirects_goarch/pe.d085/peMA.Lauds2/c1211/score/w/1:link.info	SDedes
media/en_redirects_goarch/pe.d085/peMA.Lauds2/c1211/score/w/1:link.path	/media/m/dedes/en/pe/d085/ma/w/lauds2.pdf
media/en_redirects_goarch/pe.d085/peMA.Lauds3/c1211/audio/1:link.info	SDedes
media/en_redirects_goarch/pe.d085/peMA.Lauds3/c1211/audio/1:link.path	/media/a/dedes/oc/m2/d1/ma/lauds3.mp3
media/en_redirects_goarch/pe.d085/peMA.Lauds3/c1211/score/b/1:link.info	SDedes
media/en_redirects_goarch/pe.d085/peMA.Lauds3/c1211/score/b/1:link.path	/media/m/dedes/en/pe/d085/ma/b/lauds3.pdf
media/en_redirects_goarch/pe.d085/peMA.Lauds3/c1211/score/w/1:link.info	SDedes
media/en_redirects_goarch/pe.d085/peMA.Lauds3/c1211/score/w/1:link.path	/media/m/dedes/en/pe/d085/ma/w/lauds3.pdf
media/en_redirects_goarch/pe.d085/peMA.Lauds4/c1211/audio/1:link.info	SDedes
media/en_redirects_goarch/pe.d085/peMA.Lauds4/c1211/audio/1:link.path	/media/a/dedes/oc/m2/d1/ma/lauds4.mp3
media/en_redirects_goarch/pe.d085/peMA.Lauds4/c1211/score/b/1:link.info	SDedes
media/en_redirects_goarch/pe.d085/peMA.Lauds4/c1211/score/b/1:link.path	/media/m/dedes/en/pe/d085/ma/b/lauds4.pdf
media/en_redirects_goarch/pe.d085/peMA.Lauds4/c1211/score/w/1:link.info	SDedes
media/en_redirects_goarch/pe.d085/peMA.Lauds4/c1211/score/w/1:link.path	/media/m/dedes/en/pe/d085/ma/w/lauds4.pdf
media/en_redirects_goarch/pe.d085/peMA.LaudsGlory/c1211/audio/1:link.info	SDedes | KMarinakos
media/en_redirects_goarch/pe.d085/peMA.LaudsGlory/c1211/audio/1:link.path	/media/a/en_public/eo/e02/eodoxasticon.mp3
media/en_redirects_goarch/pe.d085/peMA.LaudsGlory/c1211/score/b/1:link.info	SDedes
media/en_redirects_goarch/pe.d085/peMA.LaudsGlory/c1211/score/b/1:link.path	/media/m/dedes/en/eo/e02/b/eodoxasticon.pdf
media/en_redirects_goarch/pe.d085/peMA.LaudsGlory/c1211/score/w/1:link.info	SDedes
media/en_redirects_goarch/pe.d085/peMA.LaudsGlory/c1211/score/w/1:link.path	/media/m/dedes/en/eo/e02/w/eodoxasticon.pdf
media/en_redirects_goarch/pe.d085/peVE.Apolytikion1/c1211/score/b/1:link.info	SDedes
media/en_redirects_goarch/pe.d085/peVE.Apolytikion1/c1211/score/b/1:link.path	/media/m/dedes/en/pe/d085/ve/b/apolytikion1.pdf
media/en_redirects_goarch/pe.d085/peVE.Apolytikion1/c1211/score/w/1:link.info	SDedes
media/en_redirects_goarch/pe.d085/peVE.Apolytikion1/c1211/score/w/1:link.path	/media/m/dedes/en/pe/d085/ve/w/apolytikion1.pdf
media/en_redirects_goarch/pe.d085/peVE.Apolytikion2/c1211/audio/1:link.info	SDedes
media/en_redirects_goarch/pe.d085/peVE.Apolytikion2/c1211/audio/1:link.path	/media/a/en_public/oc/m2/d1/ma/kathisma11.mp3
media/en_redirects_goarch/pe.d085/peVE.Apolytikion2/c1211/score/b/1:link.info	SDedes
media/en_redirects_goarch/pe.d085/peVE.Apolytikion2/c1211/score/b/1:link.path	/media/m/dedes/en/pe/d085/ve/b/apolytikion2.pdf
media/en_redirects_goarch/pe.d085/peVE.Apolytikion2/c1211/score/w/1:link.info	SDedes
media/en_redirects_goarch/pe.d085/peVE.Apolytikion2/c1211/score/w/1:link.path	/media/m/dedes/en/pe/d085/ve/w/apolytikion2.pdf
media/en_redirects_goarch/pe.d085/peVE.Apolytikion2/c2001/score/w/1:link.info	NewByz
media/en_redirects_goarch/pe.d085/peVE.Apolytikion2/c2001/score/w/1:link.path	/media/m/newbyz/en/pe/d085/ve/w/apolytikion2.pdf
media/en_redirects_goarch/pe.d085/peVE.Apolytikion3/c1211/score/b/1:link.info	SDedes
media/en_redirects_goarch/pe.d085/peVE.Apolytikion3/c1211/score/b/1:link.path	/media/m/dedes/en/pe/d085/ve/b/apolytikion3.pdf
media/en_redirects_goarch/pe.d085/peVE.Apolytikion3/c1211/score/w/1:link.info	SDedes
media/en_redirects_goarch/pe.d085/peVE.Apolytikion3/c1211/score/w/1:link.path	/media/m/dedes/en/pe/d085/ve/w/apolytikion3.pdf
media/en_redirects_goarch/pe.d085/peVE.Apolytikion3/c2001/score/w/1:link.info	NewByz
media/en_redirects_goarch/pe.d085/peVE.Apolytikion3/c2001/score/w/1:link.path	/media/m/newbyz/en/pe/d085/ve/w/apolytikion3.pdf
media/en_redirects_goarch/pe.d085/peVE.AposGlory/c1211/score/b/1:link.info	SDedes
media/en_redirects_goarch/pe.d085/peVE.AposGlory/c1211/score/b/1:link.path	/media/m/dedes/en/pe/d085/ve/b/aposglory.pdf
media/en_redirects_goarch/pe.d085/peVE.AposGlory/c1211/score/w/1:link.info	SDedes
media/en_redirects_goarch/pe.d085/peVE.AposGlory/c1211/score/w/1:link.path	/media/m/dedes/en/pe/d085/ve/w/aposglory.pdf
media/en_redirects_goarch/pe.d085/peVE.Lity1/c1211/score/b/1:link.info	SDedes
media/en_redirects_goarch/pe.d085/peVE.Lity1/c1211/score/b/1:link.path	/media/m/dedes/en/pe/d085/ve/b/lity1.pdf
media/en_redirects_goarch/pe.d085/peVE.Lity1/c1211/score/w/1:link.info	SDedes
media/en_redirects_goarch/pe.d085/peVE.Lity1/c1211/score/w/1:link.path	/media/m/dedes/en/pe/d085/ve/w/lity1.pdf
media/en_redirects_goarch/pe.d085/peVE.Lity2/c1211/score/b/1:link.info	SDedes
media/en_redirects_goarch/pe.d085/peVE.Lity2/c1211/score/b/1:link.path	/media/m/dedes/en/pe/d085/ve/b/lity2.pdf
media/en_redirects_goarch/pe.d085/peVE.Lity2/c1211/score/w/1:link.info	SDedes
media/en_redirects_goarch/pe.d085/peVE.Lity2/c1211/score/w/1:link.path	/media/m/dedes/en/pe/d085/ve/w/lity2.pdf
media/en_redirects_goarch/pe.d085/peVE.Lity3/c1211/score/b/1:link.info	SDedes
media/en_redirects_goarch/pe.d085/peVE.Lity3/c1211/score/b/1:link.path	/media/m/dedes/en/pe/d085/ve/b/lity3.pdf
media/en_redirects_goarch/pe.d085/peVE.Lity3/c1211/score/w/1:link.info	SDedes
media/en_redirects_goarch/pe.d085/peVE.Lity3/c1211/score/w/1:link.path	/media/m/dedes/en/pe/d085/ve/w/lity3.pdf
media/en_redirects_goarch/pe.d085/peVE.LityGlory/c1211/score/b/1:link.info	SDedes
media/en_redirects_goarch/pe.d085/peVE.LityGlory/c1211/score/b/1:link.path	/media/m/dedes/en/pe/d085/ve/b/lityglory.pdf
media/en_redirects_goarch/pe.d085/peVE.LityGlory/c1211/score/w/1:link.info	SDedes
media/en_redirects_goarch/pe.d085/peVE.LityGlory/c1211/score/w/1:link.path	/media/m/dedes/en/pe/d085/ve/w/lityglory.pdf
media/en_redirects_goarch/pe.d085/peVE.SticGlory/c1211/score/b/1:link.info	SDedes
media/en_redirects_goarch/pe.d085/peVE.SticGlory/c1211/score/b/1:link.path	/media/m/dedes/en/pe/d085/ve/b/sticglory.pdf
media/en_redirects_goarch/pe.d085/peVE.SticGlory/c1211/score/w/1:link.info	SDedes
media/en_redirects_goarch/pe.d085/peVE.SticGlory/c1211/score/w/1:link.path	/media/m/dedes/en/pe/d085/ve/w/sticglory.pdf
media/en_redirects_goarch/pe.d085/peVE.Stichera08/c1211/score/b/1:link.info	SDedes
media/en_redirects_goarch/pe.d085/peVE.Stichera08/c1211/score/b/1:link.path	/media/m/dedes/en/pe/d085/ve/b/stichera08.pdf
media/en_redirects_goarch/pe.d085/peVE.Stichera08/c1211/score/w/1:link.info	SDedes
media/en_redirects_goarch/pe.d085/peVE.Stichera08/c1211/score/w/1:link.path	/media/m/dedes/en/pe/d085/ve/w/stichera08.pdf
media/en_redirects_goarch/pe.d085/peVE.Stichera09/c1211/score/b/1:link.info	SDedes
media/en_redirects_goarch/pe.d085/peVE.Stichera09/c1211/score/b/1:link.path	/media/m/dedes/en/pe/d085/ve/b/stichera09.pdf
media/en_redirects_goarch/pe.d085/peVE.Stichera09/c1211/score/w/1:link.info	SDedes
media/en_redirects_goarch/pe.d085/peVE.Stichera09/c1211/score/w/1:link.path	/media/m/dedes/en/pe/d085/ve/w/stichera09.pdf
media/en_redirects_goarch/pe.d085/peVE.Stichera10/c1211/score/b/1:link.info	SDedes
media/en_redirects_goarch/pe.d085/peVE.Stichera10/c1211/score/b/1:link.path	/media/m/dedes/en/pe/d085/ve/b/stichera10.pdf
media/en_redirects_goarch/pe.d085/peVE.Stichera10/c1211/score/w/1:link.info	SDedes
media/en_redirects_goarch/pe.d085/peVE.Stichera10/c1211/score/w/1:link.path	/media/m/dedes/en/pe/d085/ve/w/stichera10.pdf
