media/en_redirects_goarch/me.m09.d29/meMA.ExapTheotokion/c1211/score/w/1:link.info	SDedes
media/en_redirects_goarch/me.m09.d29/meMA.ExapTheotokion/c1211/score/w/1:link.path	/media/m/dedes/en/me/m09/d29/ma/w/exaptheotokion.pdf
media/en_redirects_goarch/me.m09.d29/meMA.Exaposteilarion1/c1211/score/w/1:link.info	SDedes
media/en_redirects_goarch/me.m09.d29/meMA.Exaposteilarion1/c1211/score/w/1:link.path	/media/m/dedes/en/me/m09/d29/ma/w/exaposteilarion1.pdf
media/en_redirects_goarch/me.m09.d29/meVE.AposGlory/c1211/score/b/1:link.info	SDedes
media/en_redirects_goarch/me.m09.d29/meVE.AposGlory/c1211/score/b/1:link.path	/media/m/dedes/en/me/m01/d15/ve/b/aposglory.pdf
media/en_redirects_goarch/me.m09.d29/meVE.AposGlory/c1211/score/w/1:link.info	SDedes
media/en_redirects_goarch/me.m09.d29/meVE.AposGlory/c1211/score/w/1:link.path	/media/m/dedes/en/me/m01/d15/ve/w/aposglory.pdf
media/en_redirects_goarch/me.m09.d29/meVE.MM.GeneralApolytikion1/c1211/score/w/1:link.info	SDedes
media/en_redirects_goarch/me.m09.d29/meVE.MM.GeneralApolytikion1/c1211/score/w/1:link.path	/media/m/dedes/en/me/m09/d29/ve/w/generalapolytikion1.pdf
media/en_redirects_goarch/me.m09.d29/meVE.MM.GeneralApolytikion1/c2001/score/w/1:link.info	NewByz
media/en_redirects_goarch/me.m09.d29/meVE.MM.GeneralApolytikion1/c2001/score/w/1:link.path	/media/m/newbyz/en/me/m09/d29/ve/w/generalapolytikion1.pdf
media/en_redirects_goarch/me.m09.d29/meVE.SticGlory/c1211/score/b/1:link.info	SDedes
media/en_redirects_goarch/me.m09.d29/meVE.SticGlory/c1211/score/b/1:link.path	/media/m/dedes/en/me/m09/d29/ve/b/sticglory.pdf
media/en_redirects_goarch/me.m09.d29/meVE.SticGlory/c1211/score/w/1:link.info	SDedes
media/en_redirects_goarch/me.m09.d29/meVE.SticGlory/c1211/score/w/1:link.path	/media/m/dedes/en/me/m09/d29/ve/w/sticglory.pdf
