media/en_redirects_goarch/pe.d089/peMA.AposGlory/c1211/score/b/1:link.info	SDedes
media/en_redirects_goarch/pe.d089/peMA.AposGlory/c1211/score/b/1:link.path	/media/m/dedes/en/pe/d087/ve/b/aposglory.pdf
media/en_redirects_goarch/pe.d089/peMA.AposGlory/c1211/score/w/1:link.info	SDedes
media/en_redirects_goarch/pe.d089/peMA.AposGlory/c1211/score/w/1:link.path	/media/m/dedes/en/pe/d087/ve/w/aposglory.pdf
media/en_redirects_goarch/pe.d089/peMA.Kathisma11/c1211/score/w/1:link.info	SDedes
media/en_redirects_goarch/pe.d089/peMA.Kathisma11/c1211/score/w/1:link.path	/media/m/dedes/en/pe/d089/ma/w/kathisma11.pdf
media/en_redirects_goarch/pe.d089/peMA.Kathisma21/c1211/score/w/1:link.info	SDedes
media/en_redirects_goarch/pe.d089/peMA.Kathisma21/c1211/score/w/1:link.path	/media/m/dedes/en/pe/d089/ma/w/kathisma21.pdf
media/en_redirects_goarch/pe.d089/peMA.LaudsGlory/c1211/score/b/1:link.info	SDedes
media/en_redirects_goarch/pe.d089/peMA.LaudsGlory/c1211/score/b/1:link.path	/media/m/dedes/en/pe/d087/ma/b/laudsglory.pdf
media/en_redirects_goarch/pe.d089/peMA.LaudsGlory/c1211/score/w/1:link.info	SDedes
media/en_redirects_goarch/pe.d089/peMA.LaudsGlory/c1211/score/w/1:link.path	/media/m/dedes/en/pe/d087/ma/w/laudsglory.pdf
media/en_redirects_goarch/pe.d089/peVE.AposGlory/c1211/score/b/1:link.info	SDedes
media/en_redirects_goarch/pe.d089/peVE.AposGlory/c1211/score/b/1:link.path	/media/m/dedes/en/pe/d086/ma/b/maposglory.pdf
media/en_redirects_goarch/pe.d089/peVE.AposGlory/c1211/score/w/1:link.info	SDedes
media/en_redirects_goarch/pe.d089/peVE.AposGlory/c1211/score/w/1:link.path	/media/m/dedes/en/pe/d086/ma/w/maposglory.pdf
media/en_redirects_goarch/pe.d089/peVE.SticGlory/c1211/score/b/1:link.info	SDedes
media/en_redirects_goarch/pe.d089/peVE.SticGlory/c1211/score/b/1:link.path	/media/m/dedes/en/pe/d086/ma/b/laudsglory.pdf
media/en_redirects_goarch/pe.d089/peVE.SticGlory/c1211/score/w/1:link.info	SDedes
media/en_redirects_goarch/pe.d089/peVE.SticGlory/c1211/score/w/1:link.path	/media/m/dedes/en/pe/d086/ma/w/laudsglory.pdf
