media/en_redirects_goarch/me.m09.d30/meMA.ExapTheotokion/c1211/score/w/1:link.info	SDedes
media/en_redirects_goarch/me.m09.d30/meMA.ExapTheotokion/c1211/score/w/1:link.path	/media/m/dedes/en/me/m09/d30/ma/w/exaptheotokion.pdf
media/en_redirects_goarch/me.m09.d30/meMA.Exaposteilarion1/c1211/score/w/1:link.info	SDedes
media/en_redirects_goarch/me.m09.d30/meMA.Exaposteilarion1/c1211/score/w/1:link.path	/media/m/dedes/en/me/m09/d30/ma/w/exaposteilarion1.pdf
media/en_redirects_goarch/me.m09.d30/meVE.MM.GeneralApolytikion1/c1211/score/w/1:link.info	SDedes
media/en_redirects_goarch/me.m09.d30/meVE.MM.GeneralApolytikion1/c1211/score/w/1:link.path	/media/m/dedes/en/me/m09/d30/ve/w/generalapolytikion1.pdf
media/en_redirects_goarch/me.m09.d30/meVE.MM.GeneralApolytikion1/c2001/score/w/1:link.info	NewByz
media/en_redirects_goarch/me.m09.d30/meVE.MM.GeneralApolytikion1/c2001/score/w/1:link.path	/media/m/newbyz/en/me/m09/d30/ve/w/generalapolytikion1.pdf
