media/en_redirects_goarch/me.m09.d15/meMA.AposBoth/c1211/score/b/1:link.info	SDedes
media/en_redirects_goarch/me.m09.d15/meMA.AposBoth/c1211/score/b/1:link.path	/media/m/dedes/en/me/m09/d15/ma/b/maposboth.pdf
media/en_redirects_goarch/me.m09.d15/meMA.AposBoth/c1211/score/w/1:link.info	SDedes
media/en_redirects_goarch/me.m09.d15/meMA.AposBoth/c1211/score/w/1:link.path	/media/m/dedes/en/me/m09/d15/ma/w/maposboth.pdf
media/en_redirects_goarch/me.m09.d15/meMA.AposGlory/c1211/score/b/1:link.info	SDedes
media/en_redirects_goarch/me.m09.d15/meMA.AposGlory/c1211/score/b/1:link.path	/media/m/dedes/en/me/m09/d15/ma/b/maposglory.pdf
media/en_redirects_goarch/me.m09.d15/meMA.AposGlory/c1211/score/w/1:link.info	SDedes
media/en_redirects_goarch/me.m09.d15/meMA.AposGlory/c1211/score/w/1:link.path	/media/m/dedes/en/me/m09/d15/ma/w/maposglory.pdf
media/en_redirects_goarch/me.m09.d15/meVE.AposBoth/c1211/score/b/1:link.info	SDedes
media/en_redirects_goarch/me.m09.d15/meVE.AposBoth/c1211/score/b/1:link.path	/media/m/dedes/en/me/m09/d15/ve/b/aposboth.pdf
media/en_redirects_goarch/me.m09.d15/meVE.AposBoth/c1211/score/w/1:link.info	SDedes
media/en_redirects_goarch/me.m09.d15/meVE.AposBoth/c1211/score/w/1:link.path	/media/m/dedes/en/me/m09/d15/ve/w/aposboth.pdf
media/en_redirects_goarch/me.m09.d15/meVE.AposGlory/c1211/score/b/1:link.info	SDedes
media/en_redirects_goarch/me.m09.d15/meVE.AposGlory/c1211/score/b/1:link.path	/media/m/dedes/en/me/m09/d15/ve/b/aposglory.pdf
media/en_redirects_goarch/me.m09.d15/meVE.AposGlory/c1211/score/w/1:link.info	SDedes
media/en_redirects_goarch/me.m09.d15/meVE.AposGlory/c1211/score/w/1:link.path	/media/m/dedes/en/me/m09/d15/ve/w/aposglory.pdf
media/en_redirects_goarch/me.m09.d15/meVE.Aposticha1/c1211/score/w/1:link.info	SDedes
media/en_redirects_goarch/me.m09.d15/meVE.Aposticha1/c1211/score/w/1:link.path	/media/m/dedes/en/me/m09/d15/ve/w/aposticha1.pdf
media/en_redirects_goarch/me.m09.d15/meVE.Aposticha2/c1211/score/w/1:link.info	SDedes
media/en_redirects_goarch/me.m09.d15/meVE.Aposticha2/c1211/score/w/1:link.path	/media/m/dedes/en/me/m09/d15/ve/w/aposticha2.pdf
media/en_redirects_goarch/me.m09.d15/meVE.Aposticha3/c1211/score/w/1:link.info	SDedes
media/en_redirects_goarch/me.m09.d15/meVE.Aposticha3/c1211/score/w/1:link.path	/media/m/dedes/en/me/m09/d15/ve/w/aposticha3.pdf
media/en_redirects_goarch/me.m09.d15/meVE.SticBoth/c1211/score/b/1:link.info	SDedes
media/en_redirects_goarch/me.m09.d15/meVE.SticBoth/c1211/score/b/1:link.path	/media/m/dedes/en/me/m09/d15/ve/b/sticboth.pdf
media/en_redirects_goarch/me.m09.d15/meVE.SticBoth/c1211/score/w/1:link.info	SDedes
media/en_redirects_goarch/me.m09.d15/meVE.SticBoth/c1211/score/w/1:link.path	/media/m/dedes/en/me/m09/d15/ve/w/sticboth.pdf
media/en_redirects_goarch/me.m09.d15/meVE.SticGlory/c1211/score/b/1:link.info	SDedes
media/en_redirects_goarch/me.m09.d15/meVE.SticGlory/c1211/score/b/1:link.path	/media/m/dedes/en/me/m09/d15/ve/b/sticglory.pdf
media/en_redirects_goarch/me.m09.d15/meVE.SticGlory/c1211/score/w/1:link.info	SDedes
media/en_redirects_goarch/me.m09.d15/meVE.SticGlory/c1211/score/w/1:link.path	/media/m/dedes/en/me/m09/d15/ve/w/sticglory.pdf
media/en_redirects_goarch/me.m09.d15/meVE.Stichera01/c1211/score/w/1:link.info	SDedes
media/en_redirects_goarch/me.m09.d15/meVE.Stichera01/c1211/score/w/1:link.path	/media/m/dedes/en/me/m09/d15/ve/w/stichera01.pdf
media/en_redirects_goarch/me.m09.d15/meVE.Stichera02/c1211/score/w/1:link.info	SDedes
media/en_redirects_goarch/me.m09.d15/meVE.Stichera02/c1211/score/w/1:link.path	/media/m/dedes/en/me/m09/d15/ve/w/stichera02.pdf
media/en_redirects_goarch/me.m09.d15/meVE.Stichera03/c1211/score/w/1:link.info	SDedes
media/en_redirects_goarch/me.m09.d15/meVE.Stichera03/c1211/score/w/1:link.path	/media/m/dedes/en/me/m09/d15/ve/w/stichera03.pdf
