media/en_redirects_goarch/tr.d051/trVE.AposIdiomelon1/c1361/score/b/1:link.info	NRoumas
media/en_redirects_goarch/tr.d051/trVE.AposIdiomelon1/c1361/score/b/1:link.path	/media/m/roumas/en/tr/d051/ve/b/aposidiomelon1.pdf
media/en_redirects_goarch/tr.d051/trVE.AposIdiomelon2/c1361/score/b/1:link.info	NRoumas
media/en_redirects_goarch/tr.d051/trVE.AposIdiomelon2/c1361/score/b/1:link.path	/media/m/roumas/en/tr/d051/ve/b/aposidiomelon2.pdf
media/en_redirects_goarch/tr.d051/trVE.AposMartyric/c1211/score/w/1:link.info	SDedes
media/en_redirects_goarch/tr.d051/trVE.AposMartyric/c1211/score/w/1:link.path	/media/m/dedes/en/tr/d051/ve/w/aposmartyric.pdf
media/en_redirects_goarch/tr.d051/trVE.AposTheotokion/c1211/score/w/1:link.info	SDedes
media/en_redirects_goarch/tr.d051/trVE.AposTheotokion/c1211/score/w/1:link.path	/media/m/dedes/en/tr/d051/ve/w/apostheotokion.pdf
media/en_redirects_goarch/tr.d051/trVE.Stichera01/c1281/score/w/1:link.info	SDedes
media/en_redirects_goarch/tr.d051/trVE.Stichera01/c1281/score/w/1:link.path	/media/m/dedes/en/tr/d051/ve/w/stichera01.pdf
media/en_redirects_goarch/tr.d051/trVE.Stichera02/c1281/score/w/1:link.info	SDedes
media/en_redirects_goarch/tr.d051/trVE.Stichera02/c1281/score/w/1:link.path	/media/m/dedes/en/tr/d051/ve/w/stichera02.pdf
media/en_redirects_goarch/tr.d051/trVE.Stichera03/c1281/score/w/1:link.info	SDedes
media/en_redirects_goarch/tr.d051/trVE.Stichera03/c1281/score/w/1:link.path	/media/m/dedes/en/tr/d051/ve/w/stichera03.pdf
