media/en_redirects_goarch/me.m05.d12/meMA.AposGlory/c1211/score/b/1:link.info	SDedes
media/en_redirects_goarch/me.m05.d12/meMA.AposGlory/c1211/score/b/1:link.path	/media/m/dedes/en/me/m05/d12/ma/b/maposglory.pdf
media/en_redirects_goarch/me.m05.d12/meMA.AposGlory/c1211/score/w/1:link.info	SDedes
media/en_redirects_goarch/me.m05.d12/meMA.AposGlory/c1211/score/w/1:link.path	/media/m/dedes/en/me/m05/d12/ma/w/maposglory.pdf
media/en_redirects_goarch/me.m05.d12/meVE.AposGlory/c1211/score/b/1:link.info	SDedes
media/en_redirects_goarch/me.m05.d12/meVE.AposGlory/c1211/score/b/1:link.path	/media/m/dedes/en/me/m05/d12/ve/b/aposglory.pdf
media/en_redirects_goarch/me.m05.d12/meVE.AposGlory/c1211/score/w/1:link.info	SDedes
media/en_redirects_goarch/me.m05.d12/meVE.AposGlory/c1211/score/w/1:link.path	/media/m/dedes/en/me/m05/d12/ve/w/aposglory.pdf
media/en_redirects_goarch/me.m05.d12/meVE.SticGlory/c1211/score/b/1:link.info	SDedes
media/en_redirects_goarch/me.m05.d12/meVE.SticGlory/c1211/score/b/1:link.path	/media/m/dedes/en/me/m05/d12/ve/b/sticglory.pdf
media/en_redirects_goarch/me.m05.d12/meVE.SticGlory/c1211/score/w/1:link.info	SDedes
media/en_redirects_goarch/me.m05.d12/meVE.SticGlory/c1211/score/w/1:link.path	/media/m/dedes/en/me/m05/d12/ve/w/sticglory.pdf
