media/en_redirects_goarch/me.m06.d25/meMA.AposGlory/c1211/score/b/1:link.info	SDedes
media/en_redirects_goarch/me.m06.d25/meMA.AposGlory/c1211/score/b/1:link.path	/media/m/dedes/en/me/m06/d25/ma/b/maposglory.pdf
media/en_redirects_goarch/me.m06.d25/meMA.AposGlory/c1211/score/w/1:link.info	SDedes
media/en_redirects_goarch/me.m06.d25/meMA.AposGlory/c1211/score/w/1:link.path	/media/m/dedes/en/me/m06/d25/ma/w/maposglory.pdf
media/en_redirects_goarch/me.m06.d25/meVE.Apolytikion1/c1211/score/w/1:link.info	SDedes
media/en_redirects_goarch/me.m06.d25/meVE.Apolytikion1/c1211/score/w/1:link.path	/media/m/dedes/en/me/m06/d24/ve/w/apolytikion1.pdf
media/en_redirects_goarch/me.m06.d25/meVE.Apolytikion1/c2001/score/w/1:link.info	NewByz
media/en_redirects_goarch/me.m06.d25/meVE.Apolytikion1/c2001/score/w/1:link.path	/media/m/newbyz/en/me/m06/d24/ve/w/apolytikion1.pdf
media/en_redirects_goarch/me.m06.d25/meVE.AposGlory/c1211/score/b/1:link.info	SDedes
media/en_redirects_goarch/me.m06.d25/meVE.AposGlory/c1211/score/b/1:link.path	/media/m/dedes/en/me/m06/d25/ve/b/aposglory.pdf
media/en_redirects_goarch/me.m06.d25/meVE.AposGlory/c1211/score/w/1:link.info	SDedes
media/en_redirects_goarch/me.m06.d25/meVE.AposGlory/c1211/score/w/1:link.path	/media/m/dedes/en/me/m06/d25/ve/w/aposglory.pdf
media/en_redirects_goarch/me.m06.d25/meVE.MM.Stichera123as567/c1211/score/b/1:link.info	SDedes
media/en_redirects_goarch/me.m06.d25/meVE.MM.Stichera123as567/c1211/score/b/1:link.path	/media/m/dedes/en/me/m06/d25/ve/b/stichera123as567.pdf
media/en_redirects_goarch/me.m06.d25/meVE.MM.Stichera123as567/c1211/score/w/1:link.info	SDedes
media/en_redirects_goarch/me.m06.d25/meVE.MM.Stichera123as567/c1211/score/w/1:link.path	/media/m/dedes/en/me/m06/d25/ve/w/stichera123as567.pdf
media/en_redirects_goarch/me.m06.d25/meVE.SticGlory/c1211/score/b/1:link.info	SDedes
media/en_redirects_goarch/me.m06.d25/meVE.SticGlory/c1211/score/b/1:link.path	/media/m/dedes/en/me/m06/d25/ve/b/sticglory.pdf
media/en_redirects_goarch/me.m06.d25/meVE.SticGlory/c1211/score/w/1:link.info	SDedes
media/en_redirects_goarch/me.m06.d25/meVE.SticGlory/c1211/score/w/1:link.path	/media/m/dedes/en/me/m06/d25/ve/w/sticglory.pdf
media/en_redirects_goarch/me.m06.d25/meVE.Stichera01/c1211/score/b/1:link.info	SDedes
media/en_redirects_goarch/me.m06.d25/meVE.Stichera01/c1211/score/b/1:link.path	/media/m/dedes/en/me/m06/d25/ve/b/stichera01.pdf
media/en_redirects_goarch/me.m06.d25/meVE.Stichera01/c1211/score/w/1:link.info	SDedes
media/en_redirects_goarch/me.m06.d25/meVE.Stichera01/c1211/score/w/1:link.path	/media/m/dedes/en/me/m06/d25/ve/w/stichera01.pdf
media/en_redirects_goarch/me.m06.d25/meVE.Stichera02/c1211/score/b/1:link.info	SDedes
media/en_redirects_goarch/me.m06.d25/meVE.Stichera02/c1211/score/b/1:link.path	/media/m/dedes/en/me/m06/d25/ve/b/stichera02.pdf
media/en_redirects_goarch/me.m06.d25/meVE.Stichera02/c1211/score/w/1:link.info	SDedes
media/en_redirects_goarch/me.m06.d25/meVE.Stichera02/c1211/score/w/1:link.path	/media/m/dedes/en/me/m06/d25/ve/w/stichera02.pdf
media/en_redirects_goarch/me.m06.d25/meVE.Stichera03/c1211/score/b/1:link.info	SDedes
media/en_redirects_goarch/me.m06.d25/meVE.Stichera03/c1211/score/b/1:link.path	/media/m/dedes/en/me/m06/d25/ve/b/stichera03.pdf
media/en_redirects_goarch/me.m06.d25/meVE.Stichera03/c1211/score/w/1:link.info	SDedes
media/en_redirects_goarch/me.m06.d25/meVE.Stichera03/c1211/score/w/1:link.path	/media/m/dedes/en/me/m06/d25/ve/w/stichera03.pdf
