media/en_redirects_goarch/oc.m6.d7/ocMA.Kathisma11/c1211/score/w/1:link.info	SDedes
media/en_redirects_goarch/oc.m6.d7/ocMA.Kathisma11/c1211/score/w/1:link.path	/media/m/dedes/en/oc/m6/d7/ma/w/kathisma11.pdf
media/en_redirects_goarch/oc.m6.d7/ocMA.Kathisma12/c1211/score/w/1:link.info	SDedes
media/en_redirects_goarch/oc.m6.d7/ocMA.Kathisma12/c1211/score/w/1:link.path	/media/m/dedes/en/oc/m6/d7/ma/w/kathisma11.pdf
media/en_redirects_goarch/oc.m6.d7/ocMA.Kathisma13/c1211/score/w/1:link.info	SDedes
media/en_redirects_goarch/oc.m6.d7/ocMA.Kathisma13/c1211/score/w/1:link.path	/media/m/dedes/en/oc/m6/d7/ma/w/kathisma11.pdf
media/en_redirects_goarch/oc.m6.d7/ocMA.MM.Alleluia/c1211/score/w/1:link.info	SDedes
media/en_redirects_goarch/oc.m6.d7/ocMA.MM.Alleluia/c1211/score/w/1:link.path	/media/m/dedes/en/oc/m6/d7/ma/w/alleluia.pdf
media/en_redirects_goarch/oc.m6.d7/ocMA.OdeW1C21/c1211/score/w/1:link.info	KMarinakos
media/en_redirects_goarch/oc.m6.d7/ocMA.OdeW1C21/c1211/score/w/1:link.path	/media/m/marinakos/en/oc/m6/d7/ma/w/c2ode1.pdf
media/en_redirects_goarch/oc.m6.d7/ocMA.OdeW3C21/c1211/score/w/1:link.info	KMarinakos
media/en_redirects_goarch/oc.m6.d7/ocMA.OdeW3C21/c1211/score/w/1:link.path	/media/m/marinakos/en/oc/m6/d7/ma/w/c2ode3.pdf
media/en_redirects_goarch/oc.m6.d7/ocMA.OdeW4C21/c1211/score/w/1:link.info	KMarinakos
media/en_redirects_goarch/oc.m6.d7/ocMA.OdeW4C21/c1211/score/w/1:link.path	/media/m/marinakos/en/oc/m6/d7/ma/w/c2ode4.pdf
media/en_redirects_goarch/oc.m6.d7/ocMA.OdeW5C21/c1211/score/w/1:link.info	KMarinakos
media/en_redirects_goarch/oc.m6.d7/ocMA.OdeW5C21/c1211/score/w/1:link.path	/media/m/marinakos/en/oc/m6/d7/ma/w/c2ode5.pdf
media/en_redirects_goarch/oc.m6.d7/ocMA.OdeW6C21/c1211/score/w/1:link.info	KMarinakos
media/en_redirects_goarch/oc.m6.d7/ocMA.OdeW6C21/c1211/score/w/1:link.path	/media/m/marinakos/en/oc/m6/d7/ma/w/c2ode6.pdf
media/en_redirects_goarch/oc.m6.d7/ocMA.OdeW7C21/c1211/score/w/1:link.info	KMarinakos
media/en_redirects_goarch/oc.m6.d7/ocMA.OdeW7C21/c1211/score/w/1:link.path	/media/m/marinakos/en/oc/m6/d7/ma/w/c2ode7.pdf
media/en_redirects_goarch/oc.m6.d7/ocMA.OdeW8C21/c1211/score/w/1:link.info	KMarinakos
media/en_redirects_goarch/oc.m6.d7/ocMA.OdeW8C21/c1211/score/w/1:link.path	/media/m/marinakos/en/oc/m6/d7/ma/w/c2ode8.pdf
media/en_redirects_goarch/oc.m6.d7/ocMA.OdeW9C21/c1211/score/w/1:link.info	KMarinakos
media/en_redirects_goarch/oc.m6.d7/ocMA.OdeW9C21/c1211/score/w/1:link.path	/media/m/marinakos/en/oc/m6/d7/ma/w/c2ode9.pdf
media/en_redirects_goarch/oc.m6.d7/ocVE.AposTheotokion/c1211/score/w/1:link.info	SDedes
media/en_redirects_goarch/oc.m6.d7/ocVE.AposTheotokion/c1211/score/w/1:link.path	/media/m/dedes/en/oc/m6/d7/ve/w/apostheotokion.pdf
media/en_redirects_goarch/oc.m6.d7/ocVE.Aposticha2/c1211/score/w/1:link.info	SDedes
media/en_redirects_goarch/oc.m6.d7/ocVE.Aposticha2/c1211/score/w/1:link.path	/media/m/dedes/en/oc/m6/d7/ve/w/aposticha2.pdf
media/en_redirects_goarch/oc.m6.d7/octrMA.AposTheotokion/c1211/score/w/1:link.info	KMarinakos
media/en_redirects_goarch/oc.m6.d7/octrMA.AposTheotokion/c1211/score/w/1:link.path	/media/m/marinakos/en/oc/tr/m6/d7/ma/w/apostheotokion.pdf
media/en_redirects_goarch/oc.m6.d7/octrMA.Aposticha1/c1211/score/w/1:link.info	SDedes
media/en_redirects_goarch/oc.m6.d7/octrMA.Aposticha1/c1211/score/w/1:link.path	/media/m/dedes/en/oc/tr/m6/d7/ma/w/aposticha1.pdf
media/en_redirects_goarch/oc.m6.d7/octrMA.Aposticha2/c1211/score/w/1:link.info	SDedes
media/en_redirects_goarch/oc.m6.d7/octrMA.Aposticha2/c1211/score/w/1:link.path	/media/m/dedes/en/oc/tr/m6/d7/ma/w/aposticha2.pdf
media/en_redirects_goarch/oc.m6.d7/octrMA.Aposticha3/c1211/score/w/1:link.info	SDedes
media/en_redirects_goarch/oc.m6.d7/octrMA.Aposticha3/c1211/score/w/1:link.path	/media/m/dedes/en/oc/tr/m6/d7/ma/w/aposticha3.pdf
media/en_redirects_goarch/oc.m6.d7/octrMA.Kathisma11/c1211/score/w/1:link.info	SDedes
media/en_redirects_goarch/oc.m6.d7/octrMA.Kathisma11/c1211/score/w/1:link.path	/media/m/dedes/en/oc/tr/m6/d7/ma/w/kathisma11.pdf
media/en_redirects_goarch/oc.m6.d7/octrMA.Kathisma14/c1211/score/w/1:link.info	SDedes
media/en_redirects_goarch/oc.m6.d7/octrMA.Kathisma14/c1211/score/w/1:link.path	/media/m/dedes/en/oc/tr/m6/d7/ma/w/kathisma14.pdf
media/en_redirects_goarch/oc.m6.d7/octrMA.Kathisma1T/c1211/score/w/1:link.info	SDedes
media/en_redirects_goarch/oc.m6.d7/octrMA.Kathisma1T/c1211/score/w/1:link.path	/media/m/dedes/en/oc/tr/m6/d7/ma/w/kathisma1t.pdf
media/en_redirects_goarch/oc.m6.d7/octrVE.Stichera1/c1211/score/b/1:link.info	SDedes | GCremeens
media/en_redirects_goarch/oc.m6.d7/octrVE.Stichera1/c1211/score/b/1:link.path	/media/m/cremeens/en/oc/tr/m6/d7/ve/b/stichera1.pdf
media/en_redirects_goarch/oc.m6.d7/octrVE.Stichera1/c1211/score/w/1:link.info	SDedes
media/en_redirects_goarch/oc.m6.d7/octrVE.Stichera1/c1211/score/w/1:link.path	/media/m/dedes/en/oc/tr/m6/d7/ve/w/stichera1.pdf
