media/en_redirects_goarch/me.m03.d31/meVE.MM.Stichera1123as78910/c1211/score/w/1:link.info	SDedes
media/en_redirects_goarch/me.m03.d31/meVE.MM.Stichera1123as78910/c1211/score/w/1:link.path	/media/m/dedes/en/me/m03/d31/ve/w/stichera1123as78910.pdf
media/en_redirects_goarch/me.m03.d31/meVE.SticTheotokion/c1211/score/w/1:link.info	SDedes
media/en_redirects_goarch/me.m03.d31/meVE.SticTheotokion/c1211/score/w/1:link.path	/media/m/dedes/en/me/m03/d31/ve/w/stictheotokion.pdf
media/en_redirects_goarch/me.m03.d31/meVE.Stichera01/c1211/score/w/1:link.info	SDedes
media/en_redirects_goarch/me.m03.d31/meVE.Stichera01/c1211/score/w/1:link.path	/media/m/dedes/en/me/m03/d31/ve/w/stichera01.pdf
media/en_redirects_goarch/me.m03.d31/meVE.Stichera02/c1211/score/w/1:link.info	SDedes
media/en_redirects_goarch/me.m03.d31/meVE.Stichera02/c1211/score/w/1:link.path	/media/m/dedes/en/me/m03/d31/ve/w/stichera02.pdf
media/en_redirects_goarch/me.m03.d31/meVE.Stichera03/c1211/score/w/1:link.info	SDedes
media/en_redirects_goarch/me.m03.d31/meVE.Stichera03/c1211/score/w/1:link.path	/media/m/dedes/en/me/m03/d31/ve/w/stichera03.pdf
