media/en_redirects_goarch/me.m07.d25/meLI.Kontakion1/c1211/score/w/1:link.info	SDedes
media/en_redirects_goarch/me.m07.d25/meLI.Kontakion1/c1211/score/w/1:link.path	/media/m/dedes/en/me/m07/d25/li/w/seasonalkontakion.pdf
media/en_redirects_goarch/me.m07.d25/meLI.Kontakion1/c2001/score/w/1:link.info	NewByz
media/en_redirects_goarch/me.m07.d25/meLI.Kontakion1/c2001/score/w/1:link.path	/media/m/newbyz/en/me/m07/d25/li/w/seasonalkontakion.pdf
media/en_redirects_goarch/me.m07.d25/meMA.Exaposteilarion1/c1211/score/w/1:link.info	SDedes
media/en_redirects_goarch/me.m07.d25/meMA.Exaposteilarion1/c1211/score/w/1:link.path	/media/m/dedes/en/me/m07/d25/ma/w/exaposteilarion1.pdf
media/en_redirects_goarch/me.m07.d25/meMA.Kathisma11/c1211/score/w/1:link.info	SDedes
media/en_redirects_goarch/me.m07.d25/meMA.Kathisma11/c1211/score/w/1:link.path	/media/m/dedes/en/me/m07/d25/ma/w/kathisma11.pdf
media/en_redirects_goarch/me.m07.d25/meMA.Kathisma21/c1211/score/w/1:link.info	SDedes
media/en_redirects_goarch/me.m07.d25/meMA.Kathisma21/c1211/score/w/1:link.path	/media/m/dedes/en/me/m07/d25/ma/w/kathisma21.pdf
media/en_redirects_goarch/me.m07.d25/meMA.Lauds1/c1211/score/w/1:link.info	SDedes
media/en_redirects_goarch/me.m07.d25/meMA.Lauds1/c1211/score/w/1:link.path	/media/m/dedes/en/me/m07/d25/ma/w/lauds1.pdf
media/en_redirects_goarch/me.m07.d25/meMA.Lauds2/c1211/score/w/1:link.info	SDedes
media/en_redirects_goarch/me.m07.d25/meMA.Lauds2/c1211/score/w/1:link.path	/media/m/dedes/en/me/m07/d25/ma/w/lauds2.pdf
media/en_redirects_goarch/me.m07.d25/meMA.Lauds3/c1211/score/w/1:link.info	SDedes
media/en_redirects_goarch/me.m07.d25/meMA.Lauds3/c1211/score/w/1:link.path	/media/m/dedes/en/me/m07/d25/ma/w/lauds3.pdf
media/en_redirects_goarch/me.m07.d25/meMA.LaudsGlory/c1211/score/b/1:link.info	SDedes
media/en_redirects_goarch/me.m07.d25/meMA.LaudsGlory/c1211/score/b/1:link.path	/media/m/dedes/en/me/m07/d25/ma/b/laudsglory.pdf
media/en_redirects_goarch/me.m07.d25/meMA.LaudsGlory/c1211/score/w/1:link.info	SDedes
media/en_redirects_goarch/me.m07.d25/meMA.LaudsGlory/c1211/score/w/1:link.path	/media/m/dedes/en/me/m07/d25/ma/w/laudsglory.pdf
media/en_redirects_goarch/me.m07.d25/meMA.MM.Lauds1123as5678/c1211/score/w/1:link.info	SDedes
media/en_redirects_goarch/me.m07.d25/meMA.MM.Lauds1123as5678/c1211/score/w/1:link.path	/media/m/dedes/en/me/m07/d25/ma/w/lauds1123as5678.pdf
media/en_redirects_goarch/me.m07.d25/meVE.Apolytikion1/c1211/score/w/1:link.info	SDedes
media/en_redirects_goarch/me.m07.d25/meVE.Apolytikion1/c1211/score/w/1:link.path	/media/m/dedes/en/me/m07/d25/ve/w/apolytikion1.pdf
media/en_redirects_goarch/me.m07.d25/meVE.Apolytikion1/c2001/score/w/1:link.info	NewByz
media/en_redirects_goarch/me.m07.d25/meVE.Apolytikion1/c2001/score/w/1:link.path	/media/m/newbyz/en/me/m07/d25/ve/w/apolytikion1.pdf
media/en_redirects_goarch/me.m07.d25/meVE.Lity2/c1211/score/b/1:link.info	SDedes
media/en_redirects_goarch/me.m07.d25/meVE.Lity2/c1211/score/b/1:link.path	/media/m/dedes/en/me/m07/d25/ve/b/lity2.pdf
media/en_redirects_goarch/me.m07.d25/meVE.Lity2/c1211/score/w/1:link.info	SDedes
media/en_redirects_goarch/me.m07.d25/meVE.Lity2/c1211/score/w/1:link.path	/media/m/dedes/en/me/m07/d25/ve/w/lity2.pdf
media/en_redirects_goarch/me.m07.d25/meVE.LityGlory/c1211/score/b/1:link.info	SDedes
media/en_redirects_goarch/me.m07.d25/meVE.LityGlory/c1211/score/b/1:link.path	/media/m/dedes/en/me/m07/d25/ve/b/lityglory.pdf
media/en_redirects_goarch/me.m07.d25/meVE.LityGlory/c1211/score/w/1:link.info	SDedes
media/en_redirects_goarch/me.m07.d25/meVE.LityGlory/c1211/score/w/1:link.path	/media/m/dedes/en/me/m07/d25/ve/w/lityglory.pdf
media/en_redirects_goarch/me.m07.d25/meVE.SticGlory/c1211/score/b/1:link.info	SDedes
media/en_redirects_goarch/me.m07.d25/meVE.SticGlory/c1211/score/b/1:link.path	/media/m/dedes/en/me/m07/d25/ve/b/sticglory.pdf
media/en_redirects_goarch/me.m07.d25/meVE.SticGlory/c1211/score/w/1:link.info	SDedes
media/en_redirects_goarch/me.m07.d25/meVE.SticGlory/c1211/score/w/1:link.path	/media/m/dedes/en/me/m07/d25/ve/w/sticglory.pdf
