media/en_redirects_goarch/ho.ho04/hoH1.LentSungVerses/c1111/score/w/1:link.info	SDedes
media/en_redirects_goarch/ho.ho04/hoH1.LentSungVerses/c1111/score/w/1:link.path	/media/m/dedes/en/ho/ho04/w/lentsungverses.pdf
media/en_redirects_goarch/ho.ho04/hoH1.LentTroparion/c1211/score/w/1:link.info	SDedes
media/en_redirects_goarch/ho.ho04/hoH1.LentTroparion/c1211/score/w/1:link.path	/media/m/dedes/en/ho/ho04/w/lenttroparion.pdf
