media/en_redirects_goarch/me.m10.d25/meMA.ExapTheotokion/c1211/score/w/1:link.info	SDedes
media/en_redirects_goarch/me.m10.d25/meMA.ExapTheotokion/c1211/score/w/1:link.path	/media/m/dedes/en/me/m10/d25/ma/w/exaptheotokion.pdf
media/en_redirects_goarch/me.m10.d25/meMA.Exaposteilarion1/c1211/score/w/1:link.info	SDedes
media/en_redirects_goarch/me.m10.d25/meMA.Exaposteilarion1/c1211/score/w/1:link.path	/media/m/dedes/en/me/m10/d25/ma/w/exaposteilarion1.pdf
