ltx/gr_us_goa/properties:contact.address_1	
ltx/gr_us_goa/properties:contact.address_2	
ltx/gr_us_goa/properties:contact.address_3	
ltx/gr_us_goa/properties:contact.email	
ltx/gr_us_goa/properties:contact.phone	
ltx/gr_us_goa/properties:deprecated.key	This key is no longer used.
ltx/gr_us_goa/properties:media.key	For media only.
ltx/gr_us_goa/properties:pdf.cover.language	English
ltx/gr_us_goa/properties:version.copyright1	© The Greek Orthodox Archdiocese of America
ltx/gr_us_goa/properties:version.copyright2	All rights reserved. No part of this book may be used or reproduced in any manner whatsoever without written permission except in the case of brief quotations in articles and reviews. For permission contact the publisher.
ltx/gr_us_goa/properties:version.copyright3	The Divine Liturgy of St. John Chrysostom (© 2016), produced by the Greek Orthodox Archdiocese of America and approved by the Ecumenical Patriarchate.
ltx/gr_us_goa/properties:version.designation	GOA
ltx/gr_us_goa/properties:version.name	Greek Orthodox Archdiocese of America.
ltx/gr_us_goa/properties:version.notice1	Unless otherwise indicated, the texts of the prayers and hymns of the Divine Liturgy are from:
ltx/gr_us_goa/properties:version.notice2	Unless otherwise indicated, the texts of the prayers and hymns of the Divine Liturgy are produced and approved for use by the Greek Orthodox Archdiocese of America.
ltx/gr_us_goa/properties:version.translator	Translated by 
