ltx/gr_redirects_goarch/sy.m12.d27:cl.syMA.commemoration01.text	@ltx/gr_gr_cog/sy.m12.d27:cl.syMA.commemoration01.text
ltx/gr_redirects_goarch/sy.m12.d27:cl.syMA.commemoration02.text	@ltx/gr_gr_cog/sy.m12.d27:cl.syMA.commemoration02.text
ltx/gr_redirects_goarch/sy.m12.d27:cl.syMA.commemoration03.text	@ltx/gr_gr_cog/sy.m12.d27:cl.syMA.commemoration03.text
ltx/gr_redirects_goarch/sy.m12.d27:cl.syMA.commemoration04.text	@ltx/gr_gr_cog/sy.m12.d27:cl.syMA.commemoration04.text
ltx/gr_redirects_goarch/sy.m12.d27:cl.syMA.commemoration05.text	@ltx/gr_gr_cog/sy.m12.d27:cl.syMA.commemoration05.text
ltx/gr_redirects_goarch/sy.m12.d27:cl.syMA.commemoration06.text	@ltx/gr_gr_cog/sy.m12.d27:cl.syMA.commemoration06.text
ltx/gr_redirects_goarch/sy.m12.d27:syMA.commemoration01.couplet1.title	@ltx/gr_gr_cog/sy.m12.d27:syMA.commemoration01.couplet1.title
ltx/gr_redirects_goarch/sy.m12.d27:syMA.commemoration01.couplet1.verse1	@ltx/gr_gr_cog/sy.m12.d27:syMA.commemoration01.couplet1.verse1
ltx/gr_redirects_goarch/sy.m12.d27:syMA.commemoration01.couplet1.verse2	@ltx/gr_gr_cog/sy.m12.d27:syMA.commemoration01.couplet1.verse2
ltx/gr_redirects_goarch/sy.m12.d27:syMA.commemoration01.narration.p01	@ltx/gr_gr_cog/sy.m12.d27:syMA.commemoration01.narration.p01
ltx/gr_redirects_goarch/sy.m12.d27:syMA.commemoration01.narration.p02	@ltx/gr_gr_cog/sy.m12.d27:syMA.commemoration01.narration.p02
ltx/gr_redirects_goarch/sy.m12.d27:syMA.commemoration01.narration.p03	@ltx/gr_gr_cog/sy.m12.d27:syMA.commemoration01.narration.p03
ltx/gr_redirects_goarch/sy.m12.d27:syMA.commemoration01.single1	@ltx/gr_gr_cog/sy.m12.d27:syMA.commemoration01.single1
ltx/gr_redirects_goarch/sy.m12.d27:syMA.commemoration01.text	@ltx/gr_gr_cog/sy.m12.d27:syMA.commemoration01.text
ltx/gr_redirects_goarch/sy.m12.d27:syMA.commemoration02.couplet1.title	@ltx/gr_gr_cog/sy.m12.d27:syMA.commemoration02.couplet1.title
ltx/gr_redirects_goarch/sy.m12.d27:syMA.commemoration02.couplet1.verse1	@ltx/gr_gr_cog/sy.m12.d27:syMA.commemoration02.couplet1.verse1
ltx/gr_redirects_goarch/sy.m12.d27:syMA.commemoration02.couplet1.verse2	@ltx/gr_gr_cog/sy.m12.d27:syMA.commemoration02.couplet1.verse2
ltx/gr_redirects_goarch/sy.m12.d27:syMA.commemoration02.narration.p01	@ltx/gr_gr_cog/sy.m12.d27:syMA.commemoration02.narration.p01
ltx/gr_redirects_goarch/sy.m12.d27:syMA.commemoration02.poem.title	@ltx/gr_gr_cog/sy.m12.d27:syMA.commemoration02.poem.title
ltx/gr_redirects_goarch/sy.m12.d27:syMA.commemoration02.poem.verse01	@ltx/gr_gr_cog/sy.m12.d27:syMA.commemoration02.poem.verse01
ltx/gr_redirects_goarch/sy.m12.d27:syMA.commemoration02.poem.verse02	@ltx/gr_gr_cog/sy.m12.d27:syMA.commemoration02.poem.verse02
ltx/gr_redirects_goarch/sy.m12.d27:syMA.commemoration02.poem.verse03	@ltx/gr_gr_cog/sy.m12.d27:syMA.commemoration02.poem.verse03
ltx/gr_redirects_goarch/sy.m12.d27:syMA.commemoration02.poem.verse04	@ltx/gr_gr_cog/sy.m12.d27:syMA.commemoration02.poem.verse04
ltx/gr_redirects_goarch/sy.m12.d27:syMA.commemoration02.poem.verse05	@ltx/gr_gr_cog/sy.m12.d27:syMA.commemoration02.poem.verse05
ltx/gr_redirects_goarch/sy.m12.d27:syMA.commemoration02.poem.verse06	@ltx/gr_gr_cog/sy.m12.d27:syMA.commemoration02.poem.verse06
ltx/gr_redirects_goarch/sy.m12.d27:syMA.commemoration02.poem.verse07	@ltx/gr_gr_cog/sy.m12.d27:syMA.commemoration02.poem.verse07
ltx/gr_redirects_goarch/sy.m12.d27:syMA.commemoration02.poem.verse08	@ltx/gr_gr_cog/sy.m12.d27:syMA.commemoration02.poem.verse08
ltx/gr_redirects_goarch/sy.m12.d27:syMA.commemoration02.poem.verse09	@ltx/gr_gr_cog/sy.m12.d27:syMA.commemoration02.poem.verse09
ltx/gr_redirects_goarch/sy.m12.d27:syMA.commemoration02.poem.verse10	@ltx/gr_gr_cog/sy.m12.d27:syMA.commemoration02.poem.verse10
ltx/gr_redirects_goarch/sy.m12.d27:syMA.commemoration02.poem.verse11	@ltx/gr_gr_cog/sy.m12.d27:syMA.commemoration02.poem.verse11
ltx/gr_redirects_goarch/sy.m12.d27:syMA.commemoration02.poem.verse12	@ltx/gr_gr_cog/sy.m12.d27:syMA.commemoration02.poem.verse12
ltx/gr_redirects_goarch/sy.m12.d27:syMA.commemoration02.text	@ltx/gr_gr_cog/sy.m12.d27:syMA.commemoration02.text
ltx/gr_redirects_goarch/sy.m12.d27:syMA.commemoration03.couplet1.title	@ltx/gr_gr_cog/sy.m12.d27:syMA.commemoration03.couplet1.title
ltx/gr_redirects_goarch/sy.m12.d27:syMA.commemoration03.couplet1.verse1	@ltx/gr_gr_cog/sy.m12.d27:syMA.commemoration03.couplet1.verse1
ltx/gr_redirects_goarch/sy.m12.d27:syMA.commemoration03.couplet1.verse2	@ltx/gr_gr_cog/sy.m12.d27:syMA.commemoration03.couplet1.verse2
ltx/gr_redirects_goarch/sy.m12.d27:syMA.commemoration03.narration.p01	@ltx/gr_gr_cog/sy.m12.d27:syMA.commemoration03.narration.p01
ltx/gr_redirects_goarch/sy.m12.d27:syMA.commemoration03.text	@ltx/gr_gr_cog/sy.m12.d27:syMA.commemoration03.text
ltx/gr_redirects_goarch/sy.m12.d27:syMA.commemoration04.couplet1.title	@ltx/gr_gr_cog/sy.m12.d27:syMA.commemoration04.couplet1.title
ltx/gr_redirects_goarch/sy.m12.d27:syMA.commemoration04.couplet1.verse1	@ltx/gr_gr_cog/sy.m12.d27:syMA.commemoration04.couplet1.verse1
ltx/gr_redirects_goarch/sy.m12.d27:syMA.commemoration04.couplet1.verse2	@ltx/gr_gr_cog/sy.m12.d27:syMA.commemoration04.couplet1.verse2
ltx/gr_redirects_goarch/sy.m12.d27:syMA.commemoration04.narration.p01	@ltx/gr_gr_cog/sy.m12.d27:syMA.commemoration04.narration.p01
ltx/gr_redirects_goarch/sy.m12.d27:syMA.commemoration04.text	@ltx/gr_gr_cog/sy.m12.d27:syMA.commemoration04.text
ltx/gr_redirects_goarch/sy.m12.d27:syMA.lastline	@ltx/gr_gr_cog/sy.m12.d27:syMA.lastline
