ltx/gr_redirects_goarch/le.ep.me.m03.d26:lemeLI.Epistle.book_abbr	@ltx/gr_gr_cog/le.ep.me.m03.d26:lemeLI.Epistle.book_abbr
ltx/gr_redirects_goarch/le.ep.me.m03.d26:lemeLI.Epistle.book_string	@ltx/gr_gr_cog/le.ep.me.m03.d26:lemeLI.Epistle.book_string
ltx/gr_redirects_goarch/le.ep.me.m03.d26:lemeLI.Epistle.chapverse	@ltx/gr_gr_cog/le.ep.me.m03.d26:lemeLI.Epistle.chapverse
ltx/gr_redirects_goarch/le.ep.me.m03.d26:lemeLI.Epistle.incipit	@ltx/gr_gr_cog/le.ep.me.m03.d26:lemeLI.Epistle.incipit
ltx/gr_redirects_goarch/le.ep.me.m03.d26:lemeLI.Epistle.text	@ltx/gr_gr_cog/le.ep.me.m03.d26:lemeLI.Epistle.text
ltx/gr_redirects_goarch/le.ep.me.m03.d26:lemeLI.Epistle.title	@ltx/gr_gr_cog/le.ep.me.m03.d26:lemeLI.Epistle.title
ltx/gr_redirects_goarch/le.ep.me.m03.d26:lemeLI.Epistle.title_abbr	@ltx/gr_gr_cog/le.ep.me.m03.d26:lemeLI.Epistle.title_abbr
ltx/gr_redirects_goarch/le.ep.me.m03.d26:lemeLI.Epistle.version	@ltx/gr_gr_cog/le.ep.me.m03.d26:lemeLI.Epistle.version
