ltx/gr_redirects_goarch/ty.m01.d04:tyCommemoration.text	@ltx/gr_gr_cog/ty.m01.d04:tyCommemoration.text
ltx/gr_redirects_goarch/ty.m01.d04:tyDate.text	@ltx/gr_gr_cog/ty.m01.d04:tyDate.text
ltx/gr_redirects_goarch/ty.m01.d04:tyLI.AfterCommunion.text	@ltx/gr_gr_cog/ty.m01.d04:tyLI.AfterCommunion.text
ltx/gr_redirects_goarch/ty.m01.d04:tyLI.AmboPrayer.text	@ltx/gr_gr_cog/ty.m01.d04:tyLI.AmboPrayer.text
ltx/gr_redirects_goarch/ty.m01.d04:tyLI.Antiphons.text	@ltx/gr_gr_cog/ty.m01.d04:tyLI.Antiphons.text
ltx/gr_redirects_goarch/ty.m01.d04:tyLI.Apolytikia.text	@ltx/gr_gr_cog/ty.m01.d04:tyLI.Apolytikia.text
ltx/gr_redirects_goarch/ty.m01.d04:tyLI.CommunionHymn.text	@ltx/gr_gr_cog/ty.m01.d04:tyLI.CommunionHymn.text
ltx/gr_redirects_goarch/ty.m01.d04:tyLI.Dismissal.text	@ltx/gr_gr_cog/ty.m01.d04:tyLI.Dismissal.text
ltx/gr_redirects_goarch/ty.m01.d04:tyLI.EntranceHymn.text	@ltx/gr_gr_cog/ty.m01.d04:tyLI.EntranceHymn.text
ltx/gr_redirects_goarch/ty.m01.d04:tyLI.Epistle.text	@ltx/gr_gr_cog/ty.m01.d04:tyLI.Epistle.text
ltx/gr_redirects_goarch/ty.m01.d04:tyLI.Gospel.text	@ltx/gr_gr_cog/ty.m01.d04:tyLI.Gospel.text
ltx/gr_redirects_goarch/ty.m01.d04:tyLI.Kontakion.text	@ltx/gr_gr_cog/ty.m01.d04:tyLI.Kontakion.text
ltx/gr_redirects_goarch/ty.m01.d04:tyLI.Megalynarion.text	@ltx/gr_gr_cog/ty.m01.d04:tyLI.Megalynarion.text
ltx/gr_redirects_goarch/ty.m01.d04:tyLI.TheotokosHymn.text	@ltx/gr_gr_cog/ty.m01.d04:tyLI.TheotokosHymn.text
ltx/gr_redirects_goarch/ty.m01.d04:tyMA.Anavathmoi.text	@ltx/gr_gr_cog/ty.m01.d04:tyMA.Anavathmoi.text
ltx/gr_redirects_goarch/ty.m01.d04:tyMA.Apolytikia.text	@ltx/gr_gr_cog/ty.m01.d04:tyMA.Apolytikia.text
ltx/gr_redirects_goarch/ty.m01.d04:tyMA.Canons.text	@ltx/gr_gr_cog/ty.m01.d04:tyMA.Canons.text
ltx/gr_redirects_goarch/ty.m01.d04:tyMA.Doxology.text	@ltx/gr_gr_cog/ty.m01.d04:tyMA.Doxology.text
ltx/gr_redirects_goarch/ty.m01.d04:tyMA.EndApolytikion.text	@ltx/gr_gr_cog/ty.m01.d04:tyMA.EndApolytikion.text
ltx/gr_redirects_goarch/ty.m01.d04:tyMA.Exaposteilaria.text	@ltx/gr_gr_cog/ty.m01.d04:tyMA.Exaposteilaria.text
ltx/gr_redirects_goarch/ty.m01.d04:tyMA.Katavasias.text	@ltx/gr_gr_cog/ty.m01.d04:tyMA.Katavasias.text
ltx/gr_redirects_goarch/ty.m01.d04:tyMA.Kathismata.text	@ltx/gr_gr_cog/ty.m01.d04:tyMA.Kathismata.text
ltx/gr_redirects_goarch/ty.m01.d04:tyMA.KontakionOikos.text	@ltx/gr_gr_cog/ty.m01.d04:tyMA.KontakionOikos.text
ltx/gr_redirects_goarch/ty.m01.d04:tyMA.Lauds.text	@ltx/gr_gr_cog/ty.m01.d04:tyMA.Lauds.text
ltx/gr_redirects_goarch/ty.m01.d04:tyMA.LaudsBoth.text	@ltx/gr_gr_cog/ty.m01.d04:tyMA.LaudsBoth.text
ltx/gr_redirects_goarch/ty.m01.d04:tyMA.LaudsGlory.text	@ltx/gr_gr_cog/ty.m01.d04:tyMA.LaudsGlory.text
ltx/gr_redirects_goarch/ty.m01.d04:tyMA.LaudsVerses.text	@ltx/gr_gr_cog/ty.m01.d04:tyMA.LaudsVerses.text
ltx/gr_redirects_goarch/ty.m01.d04:tyMA.Magnificat.text	@ltx/gr_gr_cog/ty.m01.d04:tyMA.Magnificat.text
ltx/gr_redirects_goarch/ty.m01.d04:tyMA.MatinsGospel.text	@ltx/gr_gr_cog/ty.m01.d04:tyMA.MatinsGospel.text
ltx/gr_redirects_goarch/ty.m01.d04:tyMA.MidodeKath.text	@ltx/gr_gr_cog/ty.m01.d04:tyMA.MidodeKath.text
ltx/gr_redirects_goarch/ty.m01.d04:tyMA.MidodeKontakion.text	@ltx/gr_gr_cog/ty.m01.d04:tyMA.MidodeKontakion.text
ltx/gr_redirects_goarch/ty.m01.d04:tyMA.Ode9_1.text	@ltx/gr_gr_cog/ty.m01.d04:tyMA.Ode9_1.text
ltx/gr_redirects_goarch/ty.m01.d04:tyMA.Ode9_2.text	@ltx/gr_gr_cog/ty.m01.d04:tyMA.Ode9_2.text
ltx/gr_redirects_goarch/ty.m01.d04:tyMA.Ode9_3.text	@ltx/gr_gr_cog/ty.m01.d04:tyMA.Ode9_3.text
ltx/gr_redirects_goarch/ty.m01.d04:tyMA.Ode9_4.text	@ltx/gr_gr_cog/ty.m01.d04:tyMA.Ode9_4.text
ltx/gr_redirects_goarch/ty.m01.d04:tyMA.Ode9_5.text	@ltx/gr_gr_cog/ty.m01.d04:tyMA.Ode9_5.text
ltx/gr_redirects_goarch/ty.m01.d04:tyMA.Ode9_6.text	@ltx/gr_gr_cog/ty.m01.d04:tyMA.Ode9_6.text
ltx/gr_redirects_goarch/ty.m01.d04:tyMA.Ode9_7.text	@ltx/gr_gr_cog/ty.m01.d04:tyMA.Ode9_7.text
ltx/gr_redirects_goarch/ty.m01.d04:tyMA.Ode9_8.text	@ltx/gr_gr_cog/ty.m01.d04:tyMA.Ode9_8.text
ltx/gr_redirects_goarch/ty.m01.d04:tyMA.Ode9_Katavasia1.text	@ltx/gr_gr_cog/ty.m01.d04:tyMA.Ode9_Katavasia1.text
ltx/gr_redirects_goarch/ty.m01.d04:tyMA.Ode9_Katavasia2.text	@ltx/gr_gr_cog/ty.m01.d04:tyMA.Ode9_Katavasia2.text
ltx/gr_redirects_goarch/ty.m01.d04:tyMA.ProkVerse.text	@ltx/gr_gr_cog/ty.m01.d04:tyMA.ProkVerse.text
ltx/gr_redirects_goarch/ty.m01.d04:tyMA.Prokeimenon.text	@ltx/gr_gr_cog/ty.m01.d04:tyMA.Prokeimenon.text
ltx/gr_redirects_goarch/ty.m01.d04:tyMA.Psalm50.text	@ltx/gr_gr_cog/ty.m01.d04:tyMA.Psalm50.text
ltx/gr_redirects_goarch/ty.m01.d04:tyMA.Synaxarion.text	@ltx/gr_gr_cog/ty.m01.d04:tyMA.Synaxarion.text
ltx/gr_redirects_goarch/ty.m01.d04:tyMO.Rubric1.text	@ltx/gr_gr_cog/ty.m01.d04:tyMO.Rubric1.text
ltx/gr_redirects_goarch/ty.m01.d04:tyNote1.text	@ltx/gr_gr_cog/ty.m01.d04:tyNote1.text
ltx/gr_redirects_goarch/ty.m01.d04:tyVE.Apolytikia.text	@ltx/gr_gr_cog/ty.m01.d04:tyVE.Apolytikia.text
ltx/gr_redirects_goarch/ty.m01.d04:tyVE.AposBoth.text	@ltx/gr_gr_cog/ty.m01.d04:tyVE.AposBoth.text
ltx/gr_redirects_goarch/ty.m01.d04:tyVE.AposGlory.text	@ltx/gr_gr_cog/ty.m01.d04:tyVE.AposGlory.text
ltx/gr_redirects_goarch/ty.m01.d04:tyVE.AposGloryBoth.text	@ltx/gr_gr_cog/ty.m01.d04:tyVE.AposGloryBoth.text
ltx/gr_redirects_goarch/ty.m01.d04:tyVE.Aposticha.text	@ltx/gr_gr_cog/ty.m01.d04:tyVE.Aposticha.text
ltx/gr_redirects_goarch/ty.m01.d04:tyVE.Dismissal.text	@ltx/gr_gr_cog/ty.m01.d04:tyVE.Dismissal.text
ltx/gr_redirects_goarch/ty.m01.d04:tyVE.Entrance.text	@ltx/gr_gr_cog/ty.m01.d04:tyVE.Entrance.text
ltx/gr_redirects_goarch/ty.m01.d04:tyVE.Intro.text	@ltx/gr_gr_cog/ty.m01.d04:tyVE.Intro.text
ltx/gr_redirects_goarch/ty.m01.d04:tyVE.LIHC.text	@ltx/gr_gr_cog/ty.m01.d04:tyVE.LIHC.text
ltx/gr_redirects_goarch/ty.m01.d04:tyVE.Note1.text	@ltx/gr_gr_cog/ty.m01.d04:tyVE.Note1.text
ltx/gr_redirects_goarch/ty.m01.d04:tyVE.Note2.text	@ltx/gr_gr_cog/ty.m01.d04:tyVE.Note2.text
ltx/gr_redirects_goarch/ty.m01.d04:tyVE.SticBoth.text	@ltx/gr_gr_cog/ty.m01.d04:tyVE.SticBoth.text
ltx/gr_redirects_goarch/ty.m01.d04:tyVE.SticGlory.text	@ltx/gr_gr_cog/ty.m01.d04:tyVE.SticGlory.text
ltx/gr_redirects_goarch/ty.m01.d04:tyVE.SticGloryBoth.text	@ltx/gr_gr_cog/ty.m01.d04:tyVE.SticGloryBoth.text
ltx/gr_redirects_goarch/ty.m01.d04:tyVE.Stichera.text	@ltx/gr_gr_cog/ty.m01.d04:tyVE.Stichera.text
