ltx/gr_redirects_goarch/le.ep.mc.d086:lemcLI.Epistle.book_abbr	@ltx/gr_gr_cog/le.ep.mc.d086:lemcLI.Epistle.book_abbr
ltx/gr_redirects_goarch/le.ep.mc.d086:lemcLI.Epistle.book_string	@ltx/gr_gr_cog/le.ep.mc.d086:lemcLI.Epistle.book_string
ltx/gr_redirects_goarch/le.ep.mc.d086:lemcLI.Epistle.chapverse	@ltx/gr_gr_cog/le.ep.mc.d086:lemcLI.Epistle.chapverse
ltx/gr_redirects_goarch/le.ep.mc.d086:lemcLI.Epistle.incipit	@ltx/gr_gr_cog/le.ep.mc.d086:lemcLI.Epistle.incipit
ltx/gr_redirects_goarch/le.ep.mc.d086:lemcLI.Epistle.text	@ltx/gr_gr_cog/le.ep.mc.d086:lemcLI.Epistle.text
ltx/gr_redirects_goarch/le.ep.mc.d086:lemcLI.Epistle.title	@ltx/gr_gr_cog/le.ep.mc.d086:lemcLI.Epistle.title
ltx/gr_redirects_goarch/le.ep.mc.d086:lemcLI.Epistle.title_abbr	@ltx/gr_gr_cog/le.ep.mc.d086:lemcLI.Epistle.title_abbr
ltx/gr_redirects_goarch/le.ep.mc.d086:lemcLI.Epistle.version	@ltx/gr_gr_cog/le.ep.mc.d086:lemcLI.Epistle.version
