ltx/gr_redirects_goarch/oc.m6.d1:ocBK.ModeNaked	@ltx/gr_gr_cog/oc.m6.d1:ocBK.ModeNaked
ltx/gr_redirects_goarch/oc.m6.d1:ocBK.mode.title	@ltx/gr_gr_cog/oc.m6.d1:ocBK.mode.title
ltx/gr_redirects_goarch/oc.m6.d1:ocGE.MM.BothHeirmologic.text	@ltx/gr_gr_cog/oc.m6.d1:ocGE.MM.BothHeirmologic.text
ltx/gr_redirects_goarch/oc.m6.d1:ocGE.MM.BothSticheraric.text	@ltx/gr_gr_cog/oc.m6.d1:ocGE.MM.BothSticheraric.text
ltx/gr_redirects_goarch/oc.m6.d1:ocGE.MM.GloryHeirmologic.text	@ltx/gr_gr_cog/oc.m6.d1:ocGE.MM.GloryHeirmologic.text
ltx/gr_redirects_goarch/oc.m6.d1:ocGE.MM.GlorySticheraric.text	@ltx/gr_gr_cog/oc.m6.d1:ocGE.MM.GlorySticheraric.text
ltx/gr_redirects_goarch/oc.m6.d1:ocLI.Beatitudes1.incipit	@ltx/gr_gr_cog/oc.m6.d1:ocLI.Beatitudes1.incipit
ltx/gr_redirects_goarch/oc.m6.d1:ocLI.Beatitudes1.melody	@ltx/gr_gr_cog/oc.m6.d1:ocLI.Beatitudes1.melody
ltx/gr_redirects_goarch/oc.m6.d1:ocLI.Beatitudes1.mode	@ltx/gr_gr_cog/oc.m6.d1:ocLI.Beatitudes1.mode
ltx/gr_redirects_goarch/oc.m6.d1:ocLI.Beatitudes1.text	@ltx/gr_gr_cog/oc.m6.d1:ocLI.Beatitudes1.text
ltx/gr_redirects_goarch/oc.m6.d1:ocLI.Beatitudes2.incipit	@ltx/gr_gr_cog/oc.m6.d1:ocLI.Beatitudes2.incipit
ltx/gr_redirects_goarch/oc.m6.d1:ocLI.Beatitudes2.melody	@ltx/gr_gr_cog/oc.m6.d1:ocLI.Beatitudes2.melody
ltx/gr_redirects_goarch/oc.m6.d1:ocLI.Beatitudes2.mode	@ltx/gr_gr_cog/oc.m6.d1:ocLI.Beatitudes2.mode
ltx/gr_redirects_goarch/oc.m6.d1:ocLI.Beatitudes2.text	@ltx/gr_gr_cog/oc.m6.d1:ocLI.Beatitudes2.text
ltx/gr_redirects_goarch/oc.m6.d1:ocLI.Beatitudes3.incipit	@ltx/gr_gr_cog/oc.m6.d1:ocLI.Beatitudes3.incipit
ltx/gr_redirects_goarch/oc.m6.d1:ocLI.Beatitudes3.melody	@ltx/gr_gr_cog/oc.m6.d1:ocLI.Beatitudes3.melody
ltx/gr_redirects_goarch/oc.m6.d1:ocLI.Beatitudes3.mode	@ltx/gr_gr_cog/oc.m6.d1:ocLI.Beatitudes3.mode
ltx/gr_redirects_goarch/oc.m6.d1:ocLI.Beatitudes3.text	@ltx/gr_gr_cog/oc.m6.d1:ocLI.Beatitudes3.text
ltx/gr_redirects_goarch/oc.m6.d1:ocLI.Beatitudes4.incipit	@ltx/gr_gr_cog/oc.m6.d1:ocLI.Beatitudes4.incipit
ltx/gr_redirects_goarch/oc.m6.d1:ocLI.Beatitudes4.melody	@ltx/gr_gr_cog/oc.m6.d1:ocLI.Beatitudes4.melody
ltx/gr_redirects_goarch/oc.m6.d1:ocLI.Beatitudes4.mode	@ltx/gr_gr_cog/oc.m6.d1:ocLI.Beatitudes4.mode
ltx/gr_redirects_goarch/oc.m6.d1:ocLI.Beatitudes4.text	@ltx/gr_gr_cog/oc.m6.d1:ocLI.Beatitudes4.text
ltx/gr_redirects_goarch/oc.m6.d1:ocLI.Beatitudes5.incipit	@ltx/gr_gr_cog/oc.m6.d1:ocLI.Beatitudes5.incipit
ltx/gr_redirects_goarch/oc.m6.d1:ocLI.Beatitudes5.melody	@ltx/gr_gr_cog/oc.m6.d1:ocLI.Beatitudes5.melody
ltx/gr_redirects_goarch/oc.m6.d1:ocLI.Beatitudes5.mode	@ltx/gr_gr_cog/oc.m6.d1:ocLI.Beatitudes5.mode
ltx/gr_redirects_goarch/oc.m6.d1:ocLI.Beatitudes5.text	@ltx/gr_gr_cog/oc.m6.d1:ocLI.Beatitudes5.text
ltx/gr_redirects_goarch/oc.m6.d1:ocLI.Beatitudes6.incipit	@ltx/gr_gr_cog/oc.m6.d1:ocLI.Beatitudes6.incipit
ltx/gr_redirects_goarch/oc.m6.d1:ocLI.Beatitudes6.melody	@ltx/gr_gr_cog/oc.m6.d1:ocLI.Beatitudes6.melody
ltx/gr_redirects_goarch/oc.m6.d1:ocLI.Beatitudes6.mode	@ltx/gr_gr_cog/oc.m6.d1:ocLI.Beatitudes6.mode
ltx/gr_redirects_goarch/oc.m6.d1:ocLI.Beatitudes6.text	@ltx/gr_gr_cog/oc.m6.d1:ocLI.Beatitudes6.text
ltx/gr_redirects_goarch/oc.m6.d1:ocLI.BeatitudesT.incipit	@ltx/gr_gr_cog/oc.m6.d1:ocLI.BeatitudesT.incipit
ltx/gr_redirects_goarch/oc.m6.d1:ocLI.BeatitudesT.melody	@ltx/gr_gr_cog/oc.m6.d1:ocLI.BeatitudesT.melody
ltx/gr_redirects_goarch/oc.m6.d1:ocLI.BeatitudesT.mode	@ltx/gr_gr_cog/oc.m6.d1:ocLI.BeatitudesT.mode
ltx/gr_redirects_goarch/oc.m6.d1:ocLI.BeatitudesT.text	@ltx/gr_gr_cog/oc.m6.d1:ocLI.BeatitudesT.text
ltx/gr_redirects_goarch/oc.m6.d1:ocLI.BeatitudesTr.incipit	@ltx/gr_gr_cog/oc.m6.d1:ocLI.BeatitudesTr.incipit
ltx/gr_redirects_goarch/oc.m6.d1:ocLI.BeatitudesTr.melody	@ltx/gr_gr_cog/oc.m6.d1:ocLI.BeatitudesTr.melody
ltx/gr_redirects_goarch/oc.m6.d1:ocLI.BeatitudesTr.mode	@ltx/gr_gr_cog/oc.m6.d1:ocLI.BeatitudesTr.mode
ltx/gr_redirects_goarch/oc.m6.d1:ocLI.BeatitudesTr.text	@ltx/gr_gr_cog/oc.m6.d1:ocLI.BeatitudesTr.text
ltx/gr_redirects_goarch/oc.m6.d1:ocLI.MM.Beatitudes123456TrTas5678910GB.text	@ltx/gr_gr_cog/oc.m6.d1:ocLI.MM.Beatitudes123456TrTas5678910GB.text
ltx/gr_redirects_goarch/oc.m6.d1:ocLI.MM.Beatitudes123Tas1234.text	@ltx/gr_gr_cog/oc.m6.d1:ocLI.MM.Beatitudes123Tas1234.text
ltx/gr_redirects_goarch/oc.m6.d1:ocLI.MM.Beatitudes123Tas5678.text	@ltx/gr_gr_cog/oc.m6.d1:ocLI.MM.Beatitudes123Tas5678.text
ltx/gr_redirects_goarch/oc.m6.d1:ocLI.MM.Prokeimenon.text	@ltx/gr_gr_cog/oc.m6.d1:ocLI.MM.Prokeimenon.text
ltx/gr_redirects_goarch/oc.m6.d1:ocMA.Antiphon11.incipit	@ltx/gr_gr_cog/oc.m6.d1:ocMA.Antiphon11.incipit
ltx/gr_redirects_goarch/oc.m6.d1:ocMA.Antiphon11.melody	@ltx/gr_gr_cog/oc.m6.d1:ocMA.Antiphon11.melody
ltx/gr_redirects_goarch/oc.m6.d1:ocMA.Antiphon11.mode	@ltx/gr_gr_cog/oc.m6.d1:ocMA.Antiphon11.mode
ltx/gr_redirects_goarch/oc.m6.d1:ocMA.Antiphon11.text	@ltx/gr_gr_cog/oc.m6.d1:ocMA.Antiphon11.text
ltx/gr_redirects_goarch/oc.m6.d1:ocMA.Antiphon12.incipit	@ltx/gr_gr_cog/oc.m6.d1:ocMA.Antiphon12.incipit
ltx/gr_redirects_goarch/oc.m6.d1:ocMA.Antiphon12.melody	@ltx/gr_gr_cog/oc.m6.d1:ocMA.Antiphon12.melody
ltx/gr_redirects_goarch/oc.m6.d1:ocMA.Antiphon12.mode	@ltx/gr_gr_cog/oc.m6.d1:ocMA.Antiphon12.mode
ltx/gr_redirects_goarch/oc.m6.d1:ocMA.Antiphon12.text	@ltx/gr_gr_cog/oc.m6.d1:ocMA.Antiphon12.text
ltx/gr_redirects_goarch/oc.m6.d1:ocMA.Antiphon13.incipit	@ltx/gr_gr_cog/oc.m6.d1:ocMA.Antiphon13.incipit
ltx/gr_redirects_goarch/oc.m6.d1:ocMA.Antiphon13.melody	@ltx/gr_gr_cog/oc.m6.d1:ocMA.Antiphon13.melody
ltx/gr_redirects_goarch/oc.m6.d1:ocMA.Antiphon13.mode	@ltx/gr_gr_cog/oc.m6.d1:ocMA.Antiphon13.mode
ltx/gr_redirects_goarch/oc.m6.d1:ocMA.Antiphon13.text	@ltx/gr_gr_cog/oc.m6.d1:ocMA.Antiphon13.text
ltx/gr_redirects_goarch/oc.m6.d1:ocMA.Antiphon21.incipit	@ltx/gr_gr_cog/oc.m6.d1:ocMA.Antiphon21.incipit
ltx/gr_redirects_goarch/oc.m6.d1:ocMA.Antiphon21.melody	@ltx/gr_gr_cog/oc.m6.d1:ocMA.Antiphon21.melody
ltx/gr_redirects_goarch/oc.m6.d1:ocMA.Antiphon21.mode	@ltx/gr_gr_cog/oc.m6.d1:ocMA.Antiphon21.mode
ltx/gr_redirects_goarch/oc.m6.d1:ocMA.Antiphon21.text	@ltx/gr_gr_cog/oc.m6.d1:ocMA.Antiphon21.text
ltx/gr_redirects_goarch/oc.m6.d1:ocMA.Antiphon22.incipit	@ltx/gr_gr_cog/oc.m6.d1:ocMA.Antiphon22.incipit
ltx/gr_redirects_goarch/oc.m6.d1:ocMA.Antiphon22.melody	@ltx/gr_gr_cog/oc.m6.d1:ocMA.Antiphon22.melody
ltx/gr_redirects_goarch/oc.m6.d1:ocMA.Antiphon22.mode	@ltx/gr_gr_cog/oc.m6.d1:ocMA.Antiphon22.mode
ltx/gr_redirects_goarch/oc.m6.d1:ocMA.Antiphon22.text	@ltx/gr_gr_cog/oc.m6.d1:ocMA.Antiphon22.text
ltx/gr_redirects_goarch/oc.m6.d1:ocMA.Antiphon23.incipit	@ltx/gr_gr_cog/oc.m6.d1:ocMA.Antiphon23.incipit
ltx/gr_redirects_goarch/oc.m6.d1:ocMA.Antiphon23.melody	@ltx/gr_gr_cog/oc.m6.d1:ocMA.Antiphon23.melody
ltx/gr_redirects_goarch/oc.m6.d1:ocMA.Antiphon23.mode	@ltx/gr_gr_cog/oc.m6.d1:ocMA.Antiphon23.mode
ltx/gr_redirects_goarch/oc.m6.d1:ocMA.Antiphon23.text	@ltx/gr_gr_cog/oc.m6.d1:ocMA.Antiphon23.text
ltx/gr_redirects_goarch/oc.m6.d1:ocMA.Antiphon31.incipit	@ltx/gr_gr_cog/oc.m6.d1:ocMA.Antiphon31.incipit
ltx/gr_redirects_goarch/oc.m6.d1:ocMA.Antiphon31.melody	@ltx/gr_gr_cog/oc.m6.d1:ocMA.Antiphon31.melody
ltx/gr_redirects_goarch/oc.m6.d1:ocMA.Antiphon31.mode	@ltx/gr_gr_cog/oc.m6.d1:ocMA.Antiphon31.mode
ltx/gr_redirects_goarch/oc.m6.d1:ocMA.Antiphon31.text	@ltx/gr_gr_cog/oc.m6.d1:ocMA.Antiphon31.text
ltx/gr_redirects_goarch/oc.m6.d1:ocMA.Antiphon32.incipit	@ltx/gr_gr_cog/oc.m6.d1:ocMA.Antiphon32.incipit
ltx/gr_redirects_goarch/oc.m6.d1:ocMA.Antiphon32.melody	@ltx/gr_gr_cog/oc.m6.d1:ocMA.Antiphon32.melody
ltx/gr_redirects_goarch/oc.m6.d1:ocMA.Antiphon32.mode	@ltx/gr_gr_cog/oc.m6.d1:ocMA.Antiphon32.mode
ltx/gr_redirects_goarch/oc.m6.d1:ocMA.Antiphon32.text	@ltx/gr_gr_cog/oc.m6.d1:ocMA.Antiphon32.text
ltx/gr_redirects_goarch/oc.m6.d1:ocMA.Antiphon33.incipit	@ltx/gr_gr_cog/oc.m6.d1:ocMA.Antiphon33.incipit
ltx/gr_redirects_goarch/oc.m6.d1:ocMA.Antiphon33.melody	@ltx/gr_gr_cog/oc.m6.d1:ocMA.Antiphon33.melody
ltx/gr_redirects_goarch/oc.m6.d1:ocMA.Antiphon33.mode	@ltx/gr_gr_cog/oc.m6.d1:ocMA.Antiphon33.mode
ltx/gr_redirects_goarch/oc.m6.d1:ocMA.Antiphon33.text	@ltx/gr_gr_cog/oc.m6.d1:ocMA.Antiphon33.text
ltx/gr_redirects_goarch/oc.m6.d1:ocMA.ApolTheotokion.incipit	@ltx/gr_gr_cog/oc.m6.d1:ocMA.ApolTheotokion.incipit
ltx/gr_redirects_goarch/oc.m6.d1:ocMA.ApolTheotokion.melody	@ltx/gr_gr_cog/oc.m6.d1:ocMA.ApolTheotokion.melody
ltx/gr_redirects_goarch/oc.m6.d1:ocMA.ApolTheotokion.mode	@ltx/gr_gr_cog/oc.m6.d1:ocMA.ApolTheotokion.mode
ltx/gr_redirects_goarch/oc.m6.d1:ocMA.ApolTheotokion.text	@ltx/gr_gr_cog/oc.m6.d1:ocMA.ApolTheotokion.text
ltx/gr_redirects_goarch/oc.m6.d1:ocMA.C3.acrostic.notice1	@ltx/gr_gr_cog/oc.m6.d1:ocMA.C3.acrostic.notice1
ltx/gr_redirects_goarch/oc.m6.d1:ocMA.C3.acrostic.text	@ltx/gr_gr_cog/oc.m6.d1:ocMA.C3.acrostic.text
ltx/gr_redirects_goarch/oc.m6.d1:ocMA.C3.acrostic.title	@ltx/gr_gr_cog/oc.m6.d1:ocMA.C3.acrostic.title
ltx/gr_redirects_goarch/oc.m6.d1:ocMA.Hypakoe.incipit	@ltx/gr_gr_cog/oc.m6.d1:ocMA.Hypakoe.incipit
ltx/gr_redirects_goarch/oc.m6.d1:ocMA.Hypakoe.melody	@ltx/gr_gr_cog/oc.m6.d1:ocMA.Hypakoe.melody
ltx/gr_redirects_goarch/oc.m6.d1:ocMA.Hypakoe.mode	@ltx/gr_gr_cog/oc.m6.d1:ocMA.Hypakoe.mode
ltx/gr_redirects_goarch/oc.m6.d1:ocMA.Hypakoe.text	@ltx/gr_gr_cog/oc.m6.d1:ocMA.Hypakoe.text
ltx/gr_redirects_goarch/oc.m6.d1:ocMA.Kathisma11.incipit	@ltx/gr_gr_cog/oc.m6.d1:ocMA.Kathisma11.incipit
ltx/gr_redirects_goarch/oc.m6.d1:ocMA.Kathisma11.melody	@ltx/gr_gr_cog/oc.m6.d1:ocMA.Kathisma11.melody
ltx/gr_redirects_goarch/oc.m6.d1:ocMA.Kathisma11.mode	@ltx/gr_gr_cog/oc.m6.d1:ocMA.Kathisma11.mode
ltx/gr_redirects_goarch/oc.m6.d1:ocMA.Kathisma11.text	@ltx/gr_gr_cog/oc.m6.d1:ocMA.Kathisma11.text
ltx/gr_redirects_goarch/oc.m6.d1:ocMA.Kathisma12.incipit	@ltx/gr_gr_cog/oc.m6.d1:ocMA.Kathisma12.incipit
ltx/gr_redirects_goarch/oc.m6.d1:ocMA.Kathisma12.melody	@ltx/gr_gr_cog/oc.m6.d1:ocMA.Kathisma12.melody
ltx/gr_redirects_goarch/oc.m6.d1:ocMA.Kathisma12.mode	@ltx/gr_gr_cog/oc.m6.d1:ocMA.Kathisma12.mode
ltx/gr_redirects_goarch/oc.m6.d1:ocMA.Kathisma12.text	@ltx/gr_gr_cog/oc.m6.d1:ocMA.Kathisma12.text
ltx/gr_redirects_goarch/oc.m6.d1:ocMA.Kathisma13.incipit	@ltx/gr_gr_cog/oc.m6.d1:ocMA.Kathisma13.incipit
ltx/gr_redirects_goarch/oc.m6.d1:ocMA.Kathisma13.melody	@ltx/gr_gr_cog/oc.m6.d1:ocMA.Kathisma13.melody
ltx/gr_redirects_goarch/oc.m6.d1:ocMA.Kathisma13.mode	@ltx/gr_gr_cog/oc.m6.d1:ocMA.Kathisma13.mode
ltx/gr_redirects_goarch/oc.m6.d1:ocMA.Kathisma13.text	@ltx/gr_gr_cog/oc.m6.d1:ocMA.Kathisma13.text
ltx/gr_redirects_goarch/oc.m6.d1:ocMA.Kathisma21.incipit	@ltx/gr_gr_cog/oc.m6.d1:ocMA.Kathisma21.incipit
ltx/gr_redirects_goarch/oc.m6.d1:ocMA.Kathisma21.melody	@ltx/gr_gr_cog/oc.m6.d1:ocMA.Kathisma21.melody
ltx/gr_redirects_goarch/oc.m6.d1:ocMA.Kathisma21.mode	@ltx/gr_gr_cog/oc.m6.d1:ocMA.Kathisma21.mode
ltx/gr_redirects_goarch/oc.m6.d1:ocMA.Kathisma21.text	@ltx/gr_gr_cog/oc.m6.d1:ocMA.Kathisma21.text
ltx/gr_redirects_goarch/oc.m6.d1:ocMA.Kathisma22.incipit	@ltx/gr_gr_cog/oc.m6.d1:ocMA.Kathisma22.incipit
ltx/gr_redirects_goarch/oc.m6.d1:ocMA.Kathisma22.melody	@ltx/gr_gr_cog/oc.m6.d1:ocMA.Kathisma22.melody
ltx/gr_redirects_goarch/oc.m6.d1:ocMA.Kathisma22.mode	@ltx/gr_gr_cog/oc.m6.d1:ocMA.Kathisma22.mode
ltx/gr_redirects_goarch/oc.m6.d1:ocMA.Kathisma22.text	@ltx/gr_gr_cog/oc.m6.d1:ocMA.Kathisma22.text
ltx/gr_redirects_goarch/oc.m6.d1:ocMA.Kathisma23.incipit	@ltx/gr_gr_cog/oc.m6.d1:ocMA.Kathisma23.incipit
ltx/gr_redirects_goarch/oc.m6.d1:ocMA.Kathisma23.melody	@ltx/gr_gr_cog/oc.m6.d1:ocMA.Kathisma23.melody
ltx/gr_redirects_goarch/oc.m6.d1:ocMA.Kathisma23.mode	@ltx/gr_gr_cog/oc.m6.d1:ocMA.Kathisma23.mode
ltx/gr_redirects_goarch/oc.m6.d1:ocMA.Kathisma23.text	@ltx/gr_gr_cog/oc.m6.d1:ocMA.Kathisma23.text
ltx/gr_redirects_goarch/oc.m6.d1:ocMA.Kontakion.incipit	@ltx/gr_gr_cog/oc.m6.d1:ocMA.Kontakion.incipit
ltx/gr_redirects_goarch/oc.m6.d1:ocMA.Kontakion.melody	@ltx/gr_gr_cog/oc.m6.d1:ocMA.Kontakion.melody
ltx/gr_redirects_goarch/oc.m6.d1:ocMA.Kontakion.mode	@ltx/gr_gr_cog/oc.m6.d1:ocMA.Kontakion.mode
ltx/gr_redirects_goarch/oc.m6.d1:ocMA.Kontakion.text	@ltx/gr_gr_cog/oc.m6.d1:ocMA.Kontakion.text
ltx/gr_redirects_goarch/oc.m6.d1:ocMA.Lauds1.incipit	@ltx/gr_gr_cog/oc.m6.d1:ocMA.Lauds1.incipit
ltx/gr_redirects_goarch/oc.m6.d1:ocMA.Lauds1.melody	@ltx/gr_gr_cog/oc.m6.d1:ocMA.Lauds1.melody
ltx/gr_redirects_goarch/oc.m6.d1:ocMA.Lauds1.mode	@ltx/gr_gr_cog/oc.m6.d1:ocMA.Lauds1.mode
ltx/gr_redirects_goarch/oc.m6.d1:ocMA.Lauds1.text	@ltx/gr_gr_cog/oc.m6.d1:ocMA.Lauds1.text
ltx/gr_redirects_goarch/oc.m6.d1:ocMA.Lauds2.incipit	@ltx/gr_gr_cog/oc.m6.d1:ocMA.Lauds2.incipit
ltx/gr_redirects_goarch/oc.m6.d1:ocMA.Lauds2.melody	@ltx/gr_gr_cog/oc.m6.d1:ocMA.Lauds2.melody
ltx/gr_redirects_goarch/oc.m6.d1:ocMA.Lauds2.mode	@ltx/gr_gr_cog/oc.m6.d1:ocMA.Lauds2.mode
ltx/gr_redirects_goarch/oc.m6.d1:ocMA.Lauds2.text	@ltx/gr_gr_cog/oc.m6.d1:ocMA.Lauds2.text
ltx/gr_redirects_goarch/oc.m6.d1:ocMA.Lauds3.incipit	@ltx/gr_gr_cog/oc.m6.d1:ocMA.Lauds3.incipit
ltx/gr_redirects_goarch/oc.m6.d1:ocMA.Lauds3.melody	@ltx/gr_gr_cog/oc.m6.d1:ocMA.Lauds3.melody
ltx/gr_redirects_goarch/oc.m6.d1:ocMA.Lauds3.mode	@ltx/gr_gr_cog/oc.m6.d1:ocMA.Lauds3.mode
ltx/gr_redirects_goarch/oc.m6.d1:ocMA.Lauds3.text	@ltx/gr_gr_cog/oc.m6.d1:ocMA.Lauds3.text
ltx/gr_redirects_goarch/oc.m6.d1:ocMA.Lauds4.incipit	@ltx/gr_gr_cog/oc.m6.d1:ocMA.Lauds4.incipit
ltx/gr_redirects_goarch/oc.m6.d1:ocMA.Lauds4.melody	@ltx/gr_gr_cog/oc.m6.d1:ocMA.Lauds4.melody
ltx/gr_redirects_goarch/oc.m6.d1:ocMA.Lauds4.mode	@ltx/gr_gr_cog/oc.m6.d1:ocMA.Lauds4.mode
ltx/gr_redirects_goarch/oc.m6.d1:ocMA.Lauds4.text	@ltx/gr_gr_cog/oc.m6.d1:ocMA.Lauds4.text
ltx/gr_redirects_goarch/oc.m6.d1:ocMA.Lauds5.incipit	@ltx/gr_gr_cog/oc.m6.d1:ocMA.Lauds5.incipit
ltx/gr_redirects_goarch/oc.m6.d1:ocMA.Lauds5.melody	@ltx/gr_gr_cog/oc.m6.d1:ocMA.Lauds5.melody
ltx/gr_redirects_goarch/oc.m6.d1:ocMA.Lauds5.mode	@ltx/gr_gr_cog/oc.m6.d1:ocMA.Lauds5.mode
ltx/gr_redirects_goarch/oc.m6.d1:ocMA.Lauds5.text	@ltx/gr_gr_cog/oc.m6.d1:ocMA.Lauds5.text
ltx/gr_redirects_goarch/oc.m6.d1:ocMA.Lauds6.incipit	@ltx/gr_gr_cog/oc.m6.d1:ocMA.Lauds6.incipit
ltx/gr_redirects_goarch/oc.m6.d1:ocMA.Lauds6.melody	@ltx/gr_gr_cog/oc.m6.d1:ocMA.Lauds6.melody
ltx/gr_redirects_goarch/oc.m6.d1:ocMA.Lauds6.mode	@ltx/gr_gr_cog/oc.m6.d1:ocMA.Lauds6.mode
ltx/gr_redirects_goarch/oc.m6.d1:ocMA.Lauds6.text	@ltx/gr_gr_cog/oc.m6.d1:ocMA.Lauds6.text
ltx/gr_redirects_goarch/oc.m6.d1:ocMA.Lauds7.incipit	@ltx/gr_gr_cog/oc.m6.d1:ocMA.Lauds7.incipit
ltx/gr_redirects_goarch/oc.m6.d1:ocMA.Lauds7.melody	@ltx/gr_gr_cog/oc.m6.d1:ocMA.Lauds7.melody
ltx/gr_redirects_goarch/oc.m6.d1:ocMA.Lauds7.mode	@ltx/gr_gr_cog/oc.m6.d1:ocMA.Lauds7.mode
ltx/gr_redirects_goarch/oc.m6.d1:ocMA.Lauds7.text	@ltx/gr_gr_cog/oc.m6.d1:ocMA.Lauds7.text
ltx/gr_redirects_goarch/oc.m6.d1:ocMA.Lauds8.incipit	@ltx/gr_gr_cog/oc.m6.d1:ocMA.Lauds8.incipit
ltx/gr_redirects_goarch/oc.m6.d1:ocMA.Lauds8.melody	@ltx/gr_gr_cog/oc.m6.d1:ocMA.Lauds8.melody
ltx/gr_redirects_goarch/oc.m6.d1:ocMA.Lauds8.mode	@ltx/gr_gr_cog/oc.m6.d1:ocMA.Lauds8.mode
ltx/gr_redirects_goarch/oc.m6.d1:ocMA.Lauds8.text	@ltx/gr_gr_cog/oc.m6.d1:ocMA.Lauds8.text
ltx/gr_redirects_goarch/oc.m6.d1:ocMA.MM.AntiphonsProkeimenon.text	@ltx/gr_gr_cog/oc.m6.d1:ocMA.MM.AntiphonsProkeimenon.text
ltx/gr_redirects_goarch/oc.m6.d1:ocMA.MM.GodIsTheLord.text	@ltx/gr_gr_cog/oc.m6.d1:ocMA.MM.GodIsTheLord.text
ltx/gr_redirects_goarch/oc.m6.d1:ocMA.MM.Lauds01.text	@ltx/gr_gr_cog/oc.m6.d1:ocMA.MM.Lauds01.text
ltx/gr_redirects_goarch/oc.m6.d1:ocMA.MM.Lauds02.text	@ltx/gr_gr_cog/oc.m6.d1:ocMA.MM.Lauds02.text
ltx/gr_redirects_goarch/oc.m6.d1:ocMA.MM.LaudsStichologia.text	@ltx/gr_gr_cog/oc.m6.d1:ocMA.MM.LaudsStichologia.text
ltx/gr_redirects_goarch/oc.m6.d1:ocMA.MM.Prokeimenon.text	@ltx/gr_gr_cog/oc.m6.d1:ocMA.MM.Prokeimenon.text
ltx/gr_redirects_goarch/oc.m6.d1:ocMA.Magnificat.incipit	@ltx/gr_gr_cog/oc.m6.d1:ocMA.Magnificat.incipit
ltx/gr_redirects_goarch/oc.m6.d1:ocMA.Magnificat.mode	@ltx/gr_gr_cog/oc.m6.d1:ocMA.Magnificat.mode
ltx/gr_redirects_goarch/oc.m6.d1:ocMA.Magnificat.text	@ltx/gr_gr_cog/oc.m6.d1:ocMA.Magnificat.text
ltx/gr_redirects_goarch/oc.m6.d1:ocMA.OdeS1C11.incipit	@ltx/gr_gr_cog/oc.m6.d1:ocMA.OdeS1C11.incipit
ltx/gr_redirects_goarch/oc.m6.d1:ocMA.OdeS1C11.melody	@ltx/gr_gr_cog/oc.m6.d1:ocMA.OdeS1C11.melody
ltx/gr_redirects_goarch/oc.m6.d1:ocMA.OdeS1C11.mode	@ltx/gr_gr_cog/oc.m6.d1:ocMA.OdeS1C11.mode
ltx/gr_redirects_goarch/oc.m6.d1:ocMA.OdeS1C11.ode	@ltx/gr_gr_cog/oc.m6.d1:ocMA.OdeS1C11.ode
ltx/gr_redirects_goarch/oc.m6.d1:ocMA.OdeS1C11.text	@ltx/gr_gr_cog/oc.m6.d1:ocMA.OdeS1C11.text
ltx/gr_redirects_goarch/oc.m6.d1:ocMA.OdeS1C12.incipit	@ltx/gr_gr_cog/oc.m6.d1:ocMA.OdeS1C12.incipit
ltx/gr_redirects_goarch/oc.m6.d1:ocMA.OdeS1C12.melody	@ltx/gr_gr_cog/oc.m6.d1:ocMA.OdeS1C12.melody
ltx/gr_redirects_goarch/oc.m6.d1:ocMA.OdeS1C12.mode	@ltx/gr_gr_cog/oc.m6.d1:ocMA.OdeS1C12.mode
ltx/gr_redirects_goarch/oc.m6.d1:ocMA.OdeS1C12.ode	@ltx/gr_gr_cog/oc.m6.d1:ocMA.OdeS1C12.ode
ltx/gr_redirects_goarch/oc.m6.d1:ocMA.OdeS1C12.text	@ltx/gr_gr_cog/oc.m6.d1:ocMA.OdeS1C12.text
ltx/gr_redirects_goarch/oc.m6.d1:ocMA.OdeS1C1H.greekmelody	@ltx/gr_gr_cog/oc.m6.d1:ocMA.OdeS1C1H.greekmelody
ltx/gr_redirects_goarch/oc.m6.d1:ocMA.OdeS1C1H.incipit	@ltx/gr_gr_cog/oc.m6.d1:ocMA.OdeS1C1H.incipit
ltx/gr_redirects_goarch/oc.m6.d1:ocMA.OdeS1C1H.melody	@ltx/gr_gr_cog/oc.m6.d1:ocMA.OdeS1C1H.melody
ltx/gr_redirects_goarch/oc.m6.d1:ocMA.OdeS1C1H.mode	@ltx/gr_gr_cog/oc.m6.d1:ocMA.OdeS1C1H.mode
ltx/gr_redirects_goarch/oc.m6.d1:ocMA.OdeS1C1H.ode	@ltx/gr_gr_cog/oc.m6.d1:ocMA.OdeS1C1H.ode
ltx/gr_redirects_goarch/oc.m6.d1:ocMA.OdeS1C1H.text	@ltx/gr_gr_cog/oc.m6.d1:ocMA.OdeS1C1H.text
ltx/gr_redirects_goarch/oc.m6.d1:ocMA.OdeS1C1T.incipit	@ltx/gr_gr_cog/oc.m6.d1:ocMA.OdeS1C1T.incipit
ltx/gr_redirects_goarch/oc.m6.d1:ocMA.OdeS1C1T.melody	@ltx/gr_gr_cog/oc.m6.d1:ocMA.OdeS1C1T.melody
ltx/gr_redirects_goarch/oc.m6.d1:ocMA.OdeS1C1T.mode	@ltx/gr_gr_cog/oc.m6.d1:ocMA.OdeS1C1T.mode
ltx/gr_redirects_goarch/oc.m6.d1:ocMA.OdeS1C1T.ode	@ltx/gr_gr_cog/oc.m6.d1:ocMA.OdeS1C1T.ode
ltx/gr_redirects_goarch/oc.m6.d1:ocMA.OdeS1C1T.text	@ltx/gr_gr_cog/oc.m6.d1:ocMA.OdeS1C1T.text
ltx/gr_redirects_goarch/oc.m6.d1:ocMA.OdeS1C21.greekmelody	@ltx/gr_gr_cog/oc.m6.d1:ocMA.OdeS1C21.greekmelody
ltx/gr_redirects_goarch/oc.m6.d1:ocMA.OdeS1C21.incipit	@ltx/gr_gr_cog/oc.m6.d1:ocMA.OdeS1C21.incipit
ltx/gr_redirects_goarch/oc.m6.d1:ocMA.OdeS1C21.melody	@ltx/gr_gr_cog/oc.m6.d1:ocMA.OdeS1C21.melody
ltx/gr_redirects_goarch/oc.m6.d1:ocMA.OdeS1C21.mode	@ltx/gr_gr_cog/oc.m6.d1:ocMA.OdeS1C21.mode
ltx/gr_redirects_goarch/oc.m6.d1:ocMA.OdeS1C21.ode	@ltx/gr_gr_cog/oc.m6.d1:ocMA.OdeS1C21.ode
ltx/gr_redirects_goarch/oc.m6.d1:ocMA.OdeS1C21.text	@ltx/gr_gr_cog/oc.m6.d1:ocMA.OdeS1C21.text
ltx/gr_redirects_goarch/oc.m6.d1:ocMA.OdeS1C22.incipit	@ltx/gr_gr_cog/oc.m6.d1:ocMA.OdeS1C22.incipit
ltx/gr_redirects_goarch/oc.m6.d1:ocMA.OdeS1C22.melody	@ltx/gr_gr_cog/oc.m6.d1:ocMA.OdeS1C22.melody
ltx/gr_redirects_goarch/oc.m6.d1:ocMA.OdeS1C22.mode	@ltx/gr_gr_cog/oc.m6.d1:ocMA.OdeS1C22.mode
ltx/gr_redirects_goarch/oc.m6.d1:ocMA.OdeS1C22.ode	@ltx/gr_gr_cog/oc.m6.d1:ocMA.OdeS1C22.ode
ltx/gr_redirects_goarch/oc.m6.d1:ocMA.OdeS1C22.text	@ltx/gr_gr_cog/oc.m6.d1:ocMA.OdeS1C22.text
ltx/gr_redirects_goarch/oc.m6.d1:ocMA.OdeS1C2T.incipit	@ltx/gr_gr_cog/oc.m6.d1:ocMA.OdeS1C2T.incipit
ltx/gr_redirects_goarch/oc.m6.d1:ocMA.OdeS1C2T.melody	@ltx/gr_gr_cog/oc.m6.d1:ocMA.OdeS1C2T.melody
ltx/gr_redirects_goarch/oc.m6.d1:ocMA.OdeS1C2T.mode	@ltx/gr_gr_cog/oc.m6.d1:ocMA.OdeS1C2T.mode
ltx/gr_redirects_goarch/oc.m6.d1:ocMA.OdeS1C2T.ode	@ltx/gr_gr_cog/oc.m6.d1:ocMA.OdeS1C2T.ode
ltx/gr_redirects_goarch/oc.m6.d1:ocMA.OdeS1C2T.text	@ltx/gr_gr_cog/oc.m6.d1:ocMA.OdeS1C2T.text
ltx/gr_redirects_goarch/oc.m6.d1:ocMA.OdeS1C31.greekmelody	@ltx/gr_gr_cog/oc.m6.d1:ocMA.OdeS1C31.greekmelody
ltx/gr_redirects_goarch/oc.m6.d1:ocMA.OdeS1C31.incipit	@ltx/gr_gr_cog/oc.m6.d1:ocMA.OdeS1C31.incipit
ltx/gr_redirects_goarch/oc.m6.d1:ocMA.OdeS1C31.melody	@ltx/gr_gr_cog/oc.m6.d1:ocMA.OdeS1C31.melody
ltx/gr_redirects_goarch/oc.m6.d1:ocMA.OdeS1C31.mode	@ltx/gr_gr_cog/oc.m6.d1:ocMA.OdeS1C31.mode
ltx/gr_redirects_goarch/oc.m6.d1:ocMA.OdeS1C31.ode	@ltx/gr_gr_cog/oc.m6.d1:ocMA.OdeS1C31.ode
ltx/gr_redirects_goarch/oc.m6.d1:ocMA.OdeS1C31.text	@ltx/gr_gr_cog/oc.m6.d1:ocMA.OdeS1C31.text
ltx/gr_redirects_goarch/oc.m6.d1:ocMA.OdeS1C32.incipit	@ltx/gr_gr_cog/oc.m6.d1:ocMA.OdeS1C32.incipit
ltx/gr_redirects_goarch/oc.m6.d1:ocMA.OdeS1C32.melody	@ltx/gr_gr_cog/oc.m6.d1:ocMA.OdeS1C32.melody
ltx/gr_redirects_goarch/oc.m6.d1:ocMA.OdeS1C32.mode	@ltx/gr_gr_cog/oc.m6.d1:ocMA.OdeS1C32.mode
ltx/gr_redirects_goarch/oc.m6.d1:ocMA.OdeS1C32.ode	@ltx/gr_gr_cog/oc.m6.d1:ocMA.OdeS1C32.ode
ltx/gr_redirects_goarch/oc.m6.d1:ocMA.OdeS1C32.text	@ltx/gr_gr_cog/oc.m6.d1:ocMA.OdeS1C32.text
ltx/gr_redirects_goarch/oc.m6.d1:ocMA.OdeS1C33.incipit	@ltx/gr_gr_cog/oc.m6.d1:ocMA.OdeS1C33.incipit
ltx/gr_redirects_goarch/oc.m6.d1:ocMA.OdeS1C33.melody	@ltx/gr_gr_cog/oc.m6.d1:ocMA.OdeS1C33.melody
ltx/gr_redirects_goarch/oc.m6.d1:ocMA.OdeS1C33.mode	@ltx/gr_gr_cog/oc.m6.d1:ocMA.OdeS1C33.mode
ltx/gr_redirects_goarch/oc.m6.d1:ocMA.OdeS1C33.ode	@ltx/gr_gr_cog/oc.m6.d1:ocMA.OdeS1C33.ode
ltx/gr_redirects_goarch/oc.m6.d1:ocMA.OdeS1C33.text	@ltx/gr_gr_cog/oc.m6.d1:ocMA.OdeS1C33.text
ltx/gr_redirects_goarch/oc.m6.d1:ocMA.OdeS1C34.incipit	@ltx/gr_gr_cog/oc.m6.d1:ocMA.OdeS1C34.incipit
ltx/gr_redirects_goarch/oc.m6.d1:ocMA.OdeS1C34.melody	@ltx/gr_gr_cog/oc.m6.d1:ocMA.OdeS1C34.melody
ltx/gr_redirects_goarch/oc.m6.d1:ocMA.OdeS1C34.mode	@ltx/gr_gr_cog/oc.m6.d1:ocMA.OdeS1C34.mode
ltx/gr_redirects_goarch/oc.m6.d1:ocMA.OdeS1C34.ode	@ltx/gr_gr_cog/oc.m6.d1:ocMA.OdeS1C34.ode
ltx/gr_redirects_goarch/oc.m6.d1:ocMA.OdeS1C34.text	@ltx/gr_gr_cog/oc.m6.d1:ocMA.OdeS1C34.text
ltx/gr_redirects_goarch/oc.m6.d1:ocMA.OdeS3C11.incipit	@ltx/gr_gr_cog/oc.m6.d1:ocMA.OdeS3C11.incipit
ltx/gr_redirects_goarch/oc.m6.d1:ocMA.OdeS3C11.melody	@ltx/gr_gr_cog/oc.m6.d1:ocMA.OdeS3C11.melody
ltx/gr_redirects_goarch/oc.m6.d1:ocMA.OdeS3C11.mode	@ltx/gr_gr_cog/oc.m6.d1:ocMA.OdeS3C11.mode
ltx/gr_redirects_goarch/oc.m6.d1:ocMA.OdeS3C11.ode	@ltx/gr_gr_cog/oc.m6.d1:ocMA.OdeS3C11.ode
ltx/gr_redirects_goarch/oc.m6.d1:ocMA.OdeS3C11.text	@ltx/gr_gr_cog/oc.m6.d1:ocMA.OdeS3C11.text
ltx/gr_redirects_goarch/oc.m6.d1:ocMA.OdeS3C12.incipit	@ltx/gr_gr_cog/oc.m6.d1:ocMA.OdeS3C12.incipit
ltx/gr_redirects_goarch/oc.m6.d1:ocMA.OdeS3C12.melody	@ltx/gr_gr_cog/oc.m6.d1:ocMA.OdeS3C12.melody
ltx/gr_redirects_goarch/oc.m6.d1:ocMA.OdeS3C12.mode	@ltx/gr_gr_cog/oc.m6.d1:ocMA.OdeS3C12.mode
ltx/gr_redirects_goarch/oc.m6.d1:ocMA.OdeS3C12.ode	@ltx/gr_gr_cog/oc.m6.d1:ocMA.OdeS3C12.ode
ltx/gr_redirects_goarch/oc.m6.d1:ocMA.OdeS3C12.text	@ltx/gr_gr_cog/oc.m6.d1:ocMA.OdeS3C12.text
ltx/gr_redirects_goarch/oc.m6.d1:ocMA.OdeS3C1H.greekmelody	@ltx/gr_gr_cog/oc.m6.d1:ocMA.OdeS3C1H.greekmelody
ltx/gr_redirects_goarch/oc.m6.d1:ocMA.OdeS3C1H.incipit	@ltx/gr_gr_cog/oc.m6.d1:ocMA.OdeS3C1H.incipit
ltx/gr_redirects_goarch/oc.m6.d1:ocMA.OdeS3C1H.melody	@ltx/gr_gr_cog/oc.m6.d1:ocMA.OdeS3C1H.melody
ltx/gr_redirects_goarch/oc.m6.d1:ocMA.OdeS3C1H.mode	@ltx/gr_gr_cog/oc.m6.d1:ocMA.OdeS3C1H.mode
ltx/gr_redirects_goarch/oc.m6.d1:ocMA.OdeS3C1H.ode	@ltx/gr_gr_cog/oc.m6.d1:ocMA.OdeS3C1H.ode
ltx/gr_redirects_goarch/oc.m6.d1:ocMA.OdeS3C1H.text	@ltx/gr_gr_cog/oc.m6.d1:ocMA.OdeS3C1H.text
ltx/gr_redirects_goarch/oc.m6.d1:ocMA.OdeS3C1T.incipit	@ltx/gr_gr_cog/oc.m6.d1:ocMA.OdeS3C1T.incipit
ltx/gr_redirects_goarch/oc.m6.d1:ocMA.OdeS3C1T.melody	@ltx/gr_gr_cog/oc.m6.d1:ocMA.OdeS3C1T.melody
ltx/gr_redirects_goarch/oc.m6.d1:ocMA.OdeS3C1T.mode	@ltx/gr_gr_cog/oc.m6.d1:ocMA.OdeS3C1T.mode
ltx/gr_redirects_goarch/oc.m6.d1:ocMA.OdeS3C1T.ode	@ltx/gr_gr_cog/oc.m6.d1:ocMA.OdeS3C1T.ode
ltx/gr_redirects_goarch/oc.m6.d1:ocMA.OdeS3C1T.text	@ltx/gr_gr_cog/oc.m6.d1:ocMA.OdeS3C1T.text
ltx/gr_redirects_goarch/oc.m6.d1:ocMA.OdeS3C21.greekmelody	@ltx/gr_gr_cog/oc.m6.d1:ocMA.OdeS3C21.greekmelody
ltx/gr_redirects_goarch/oc.m6.d1:ocMA.OdeS3C21.incipit	@ltx/gr_gr_cog/oc.m6.d1:ocMA.OdeS3C21.incipit
ltx/gr_redirects_goarch/oc.m6.d1:ocMA.OdeS3C21.melody	@ltx/gr_gr_cog/oc.m6.d1:ocMA.OdeS3C21.melody
ltx/gr_redirects_goarch/oc.m6.d1:ocMA.OdeS3C21.mode	@ltx/gr_gr_cog/oc.m6.d1:ocMA.OdeS3C21.mode
ltx/gr_redirects_goarch/oc.m6.d1:ocMA.OdeS3C21.ode	@ltx/gr_gr_cog/oc.m6.d1:ocMA.OdeS3C21.ode
ltx/gr_redirects_goarch/oc.m6.d1:ocMA.OdeS3C21.text	@ltx/gr_gr_cog/oc.m6.d1:ocMA.OdeS3C21.text
ltx/gr_redirects_goarch/oc.m6.d1:ocMA.OdeS3C22.incipit	@ltx/gr_gr_cog/oc.m6.d1:ocMA.OdeS3C22.incipit
ltx/gr_redirects_goarch/oc.m6.d1:ocMA.OdeS3C22.melody	@ltx/gr_gr_cog/oc.m6.d1:ocMA.OdeS3C22.melody
ltx/gr_redirects_goarch/oc.m6.d1:ocMA.OdeS3C22.mode	@ltx/gr_gr_cog/oc.m6.d1:ocMA.OdeS3C22.mode
ltx/gr_redirects_goarch/oc.m6.d1:ocMA.OdeS3C22.ode	@ltx/gr_gr_cog/oc.m6.d1:ocMA.OdeS3C22.ode
ltx/gr_redirects_goarch/oc.m6.d1:ocMA.OdeS3C22.text	@ltx/gr_gr_cog/oc.m6.d1:ocMA.OdeS3C22.text
ltx/gr_redirects_goarch/oc.m6.d1:ocMA.OdeS3C2T.incipit	@ltx/gr_gr_cog/oc.m6.d1:ocMA.OdeS3C2T.incipit
ltx/gr_redirects_goarch/oc.m6.d1:ocMA.OdeS3C2T.melody	@ltx/gr_gr_cog/oc.m6.d1:ocMA.OdeS3C2T.melody
ltx/gr_redirects_goarch/oc.m6.d1:ocMA.OdeS3C2T.mode	@ltx/gr_gr_cog/oc.m6.d1:ocMA.OdeS3C2T.mode
ltx/gr_redirects_goarch/oc.m6.d1:ocMA.OdeS3C2T.ode	@ltx/gr_gr_cog/oc.m6.d1:ocMA.OdeS3C2T.ode
ltx/gr_redirects_goarch/oc.m6.d1:ocMA.OdeS3C2T.text	@ltx/gr_gr_cog/oc.m6.d1:ocMA.OdeS3C2T.text
ltx/gr_redirects_goarch/oc.m6.d1:ocMA.OdeS3C31.greekmelody	@ltx/gr_gr_cog/oc.m6.d1:ocMA.OdeS3C31.greekmelody
ltx/gr_redirects_goarch/oc.m6.d1:ocMA.OdeS3C31.incipit	@ltx/gr_gr_cog/oc.m6.d1:ocMA.OdeS3C31.incipit
ltx/gr_redirects_goarch/oc.m6.d1:ocMA.OdeS3C31.melody	@ltx/gr_gr_cog/oc.m6.d1:ocMA.OdeS3C31.melody
ltx/gr_redirects_goarch/oc.m6.d1:ocMA.OdeS3C31.mode	@ltx/gr_gr_cog/oc.m6.d1:ocMA.OdeS3C31.mode
ltx/gr_redirects_goarch/oc.m6.d1:ocMA.OdeS3C31.ode	@ltx/gr_gr_cog/oc.m6.d1:ocMA.OdeS3C31.ode
ltx/gr_redirects_goarch/oc.m6.d1:ocMA.OdeS3C31.text	@ltx/gr_gr_cog/oc.m6.d1:ocMA.OdeS3C31.text
ltx/gr_redirects_goarch/oc.m6.d1:ocMA.OdeS3C32.incipit	@ltx/gr_gr_cog/oc.m6.d1:ocMA.OdeS3C32.incipit
ltx/gr_redirects_goarch/oc.m6.d1:ocMA.OdeS3C32.melody	@ltx/gr_gr_cog/oc.m6.d1:ocMA.OdeS3C32.melody
ltx/gr_redirects_goarch/oc.m6.d1:ocMA.OdeS3C32.mode	@ltx/gr_gr_cog/oc.m6.d1:ocMA.OdeS3C32.mode
ltx/gr_redirects_goarch/oc.m6.d1:ocMA.OdeS3C32.ode	@ltx/gr_gr_cog/oc.m6.d1:ocMA.OdeS3C32.ode
ltx/gr_redirects_goarch/oc.m6.d1:ocMA.OdeS3C32.text	@ltx/gr_gr_cog/oc.m6.d1:ocMA.OdeS3C32.text
ltx/gr_redirects_goarch/oc.m6.d1:ocMA.OdeS3C33.incipit	@ltx/gr_gr_cog/oc.m6.d1:ocMA.OdeS3C33.incipit
ltx/gr_redirects_goarch/oc.m6.d1:ocMA.OdeS3C33.melody	@ltx/gr_gr_cog/oc.m6.d1:ocMA.OdeS3C33.melody
ltx/gr_redirects_goarch/oc.m6.d1:ocMA.OdeS3C33.mode	@ltx/gr_gr_cog/oc.m6.d1:ocMA.OdeS3C33.mode
ltx/gr_redirects_goarch/oc.m6.d1:ocMA.OdeS3C33.ode	@ltx/gr_gr_cog/oc.m6.d1:ocMA.OdeS3C33.ode
ltx/gr_redirects_goarch/oc.m6.d1:ocMA.OdeS3C33.text	@ltx/gr_gr_cog/oc.m6.d1:ocMA.OdeS3C33.text
ltx/gr_redirects_goarch/oc.m6.d1:ocMA.OdeS3C34.incipit	@ltx/gr_gr_cog/oc.m6.d1:ocMA.OdeS3C34.incipit
ltx/gr_redirects_goarch/oc.m6.d1:ocMA.OdeS3C34.melody	@ltx/gr_gr_cog/oc.m6.d1:ocMA.OdeS3C34.melody
ltx/gr_redirects_goarch/oc.m6.d1:ocMA.OdeS3C34.mode	@ltx/gr_gr_cog/oc.m6.d1:ocMA.OdeS3C34.mode
ltx/gr_redirects_goarch/oc.m6.d1:ocMA.OdeS3C34.ode	@ltx/gr_gr_cog/oc.m6.d1:ocMA.OdeS3C34.ode
ltx/gr_redirects_goarch/oc.m6.d1:ocMA.OdeS3C34.text	@ltx/gr_gr_cog/oc.m6.d1:ocMA.OdeS3C34.text
ltx/gr_redirects_goarch/oc.m6.d1:ocMA.OdeS4C11.incipit	@ltx/gr_gr_cog/oc.m6.d1:ocMA.OdeS4C11.incipit
ltx/gr_redirects_goarch/oc.m6.d1:ocMA.OdeS4C11.melody	@ltx/gr_gr_cog/oc.m6.d1:ocMA.OdeS4C11.melody
ltx/gr_redirects_goarch/oc.m6.d1:ocMA.OdeS4C11.mode	@ltx/gr_gr_cog/oc.m6.d1:ocMA.OdeS4C11.mode
ltx/gr_redirects_goarch/oc.m6.d1:ocMA.OdeS4C11.ode	@ltx/gr_gr_cog/oc.m6.d1:ocMA.OdeS4C11.ode
ltx/gr_redirects_goarch/oc.m6.d1:ocMA.OdeS4C11.text	@ltx/gr_gr_cog/oc.m6.d1:ocMA.OdeS4C11.text
ltx/gr_redirects_goarch/oc.m6.d1:ocMA.OdeS4C12.incipit	@ltx/gr_gr_cog/oc.m6.d1:ocMA.OdeS4C12.incipit
ltx/gr_redirects_goarch/oc.m6.d1:ocMA.OdeS4C12.melody	@ltx/gr_gr_cog/oc.m6.d1:ocMA.OdeS4C12.melody
ltx/gr_redirects_goarch/oc.m6.d1:ocMA.OdeS4C12.mode	@ltx/gr_gr_cog/oc.m6.d1:ocMA.OdeS4C12.mode
ltx/gr_redirects_goarch/oc.m6.d1:ocMA.OdeS4C12.ode	@ltx/gr_gr_cog/oc.m6.d1:ocMA.OdeS4C12.ode
ltx/gr_redirects_goarch/oc.m6.d1:ocMA.OdeS4C12.text	@ltx/gr_gr_cog/oc.m6.d1:ocMA.OdeS4C12.text
ltx/gr_redirects_goarch/oc.m6.d1:ocMA.OdeS4C1H.greekmelody	@ltx/gr_gr_cog/oc.m6.d1:ocMA.OdeS4C1H.greekmelody
ltx/gr_redirects_goarch/oc.m6.d1:ocMA.OdeS4C1H.incipit	@ltx/gr_gr_cog/oc.m6.d1:ocMA.OdeS4C1H.incipit
ltx/gr_redirects_goarch/oc.m6.d1:ocMA.OdeS4C1H.melody	@ltx/gr_gr_cog/oc.m6.d1:ocMA.OdeS4C1H.melody
ltx/gr_redirects_goarch/oc.m6.d1:ocMA.OdeS4C1H.mode	@ltx/gr_gr_cog/oc.m6.d1:ocMA.OdeS4C1H.mode
ltx/gr_redirects_goarch/oc.m6.d1:ocMA.OdeS4C1H.ode	@ltx/gr_gr_cog/oc.m6.d1:ocMA.OdeS4C1H.ode
ltx/gr_redirects_goarch/oc.m6.d1:ocMA.OdeS4C1H.text	@ltx/gr_gr_cog/oc.m6.d1:ocMA.OdeS4C1H.text
ltx/gr_redirects_goarch/oc.m6.d1:ocMA.OdeS4C1T.incipit	@ltx/gr_gr_cog/oc.m6.d1:ocMA.OdeS4C1T.incipit
ltx/gr_redirects_goarch/oc.m6.d1:ocMA.OdeS4C1T.melody	@ltx/gr_gr_cog/oc.m6.d1:ocMA.OdeS4C1T.melody
ltx/gr_redirects_goarch/oc.m6.d1:ocMA.OdeS4C1T.mode	@ltx/gr_gr_cog/oc.m6.d1:ocMA.OdeS4C1T.mode
ltx/gr_redirects_goarch/oc.m6.d1:ocMA.OdeS4C1T.ode	@ltx/gr_gr_cog/oc.m6.d1:ocMA.OdeS4C1T.ode
ltx/gr_redirects_goarch/oc.m6.d1:ocMA.OdeS4C1T.text	@ltx/gr_gr_cog/oc.m6.d1:ocMA.OdeS4C1T.text
ltx/gr_redirects_goarch/oc.m6.d1:ocMA.OdeS4C21.greekmelody	@ltx/gr_gr_cog/oc.m6.d1:ocMA.OdeS4C21.greekmelody
ltx/gr_redirects_goarch/oc.m6.d1:ocMA.OdeS4C21.incipit	@ltx/gr_gr_cog/oc.m6.d1:ocMA.OdeS4C21.incipit
ltx/gr_redirects_goarch/oc.m6.d1:ocMA.OdeS4C21.melody	@ltx/gr_gr_cog/oc.m6.d1:ocMA.OdeS4C21.melody
ltx/gr_redirects_goarch/oc.m6.d1:ocMA.OdeS4C21.mode	@ltx/gr_gr_cog/oc.m6.d1:ocMA.OdeS4C21.mode
ltx/gr_redirects_goarch/oc.m6.d1:ocMA.OdeS4C21.ode	@ltx/gr_gr_cog/oc.m6.d1:ocMA.OdeS4C21.ode
ltx/gr_redirects_goarch/oc.m6.d1:ocMA.OdeS4C21.text	@ltx/gr_gr_cog/oc.m6.d1:ocMA.OdeS4C21.text
ltx/gr_redirects_goarch/oc.m6.d1:ocMA.OdeS4C22.incipit	@ltx/gr_gr_cog/oc.m6.d1:ocMA.OdeS4C22.incipit
ltx/gr_redirects_goarch/oc.m6.d1:ocMA.OdeS4C22.melody	@ltx/gr_gr_cog/oc.m6.d1:ocMA.OdeS4C22.melody
ltx/gr_redirects_goarch/oc.m6.d1:ocMA.OdeS4C22.mode	@ltx/gr_gr_cog/oc.m6.d1:ocMA.OdeS4C22.mode
ltx/gr_redirects_goarch/oc.m6.d1:ocMA.OdeS4C22.ode	@ltx/gr_gr_cog/oc.m6.d1:ocMA.OdeS4C22.ode
ltx/gr_redirects_goarch/oc.m6.d1:ocMA.OdeS4C22.text	@ltx/gr_gr_cog/oc.m6.d1:ocMA.OdeS4C22.text
ltx/gr_redirects_goarch/oc.m6.d1:ocMA.OdeS4C2T.incipit	@ltx/gr_gr_cog/oc.m6.d1:ocMA.OdeS4C2T.incipit
ltx/gr_redirects_goarch/oc.m6.d1:ocMA.OdeS4C2T.melody	@ltx/gr_gr_cog/oc.m6.d1:ocMA.OdeS4C2T.melody
ltx/gr_redirects_goarch/oc.m6.d1:ocMA.OdeS4C2T.mode	@ltx/gr_gr_cog/oc.m6.d1:ocMA.OdeS4C2T.mode
ltx/gr_redirects_goarch/oc.m6.d1:ocMA.OdeS4C2T.ode	@ltx/gr_gr_cog/oc.m6.d1:ocMA.OdeS4C2T.ode
ltx/gr_redirects_goarch/oc.m6.d1:ocMA.OdeS4C2T.text	@ltx/gr_gr_cog/oc.m6.d1:ocMA.OdeS4C2T.text
ltx/gr_redirects_goarch/oc.m6.d1:ocMA.OdeS4C31.greekmelody	@ltx/gr_gr_cog/oc.m6.d1:ocMA.OdeS4C31.greekmelody
ltx/gr_redirects_goarch/oc.m6.d1:ocMA.OdeS4C31.incipit	@ltx/gr_gr_cog/oc.m6.d1:ocMA.OdeS4C31.incipit
ltx/gr_redirects_goarch/oc.m6.d1:ocMA.OdeS4C31.melody	@ltx/gr_gr_cog/oc.m6.d1:ocMA.OdeS4C31.melody
ltx/gr_redirects_goarch/oc.m6.d1:ocMA.OdeS4C31.mode	@ltx/gr_gr_cog/oc.m6.d1:ocMA.OdeS4C31.mode
ltx/gr_redirects_goarch/oc.m6.d1:ocMA.OdeS4C31.ode	@ltx/gr_gr_cog/oc.m6.d1:ocMA.OdeS4C31.ode
ltx/gr_redirects_goarch/oc.m6.d1:ocMA.OdeS4C31.text	@ltx/gr_gr_cog/oc.m6.d1:ocMA.OdeS4C31.text
ltx/gr_redirects_goarch/oc.m6.d1:ocMA.OdeS4C32.incipit	@ltx/gr_gr_cog/oc.m6.d1:ocMA.OdeS4C32.incipit
ltx/gr_redirects_goarch/oc.m6.d1:ocMA.OdeS4C32.melody	@ltx/gr_gr_cog/oc.m6.d1:ocMA.OdeS4C32.melody
ltx/gr_redirects_goarch/oc.m6.d1:ocMA.OdeS4C32.mode	@ltx/gr_gr_cog/oc.m6.d1:ocMA.OdeS4C32.mode
ltx/gr_redirects_goarch/oc.m6.d1:ocMA.OdeS4C32.ode	@ltx/gr_gr_cog/oc.m6.d1:ocMA.OdeS4C32.ode
ltx/gr_redirects_goarch/oc.m6.d1:ocMA.OdeS4C32.text	@ltx/gr_gr_cog/oc.m6.d1:ocMA.OdeS4C32.text
ltx/gr_redirects_goarch/oc.m6.d1:ocMA.OdeS4C33.incipit	@ltx/gr_gr_cog/oc.m6.d1:ocMA.OdeS4C33.incipit
ltx/gr_redirects_goarch/oc.m6.d1:ocMA.OdeS4C33.melody	@ltx/gr_gr_cog/oc.m6.d1:ocMA.OdeS4C33.melody
ltx/gr_redirects_goarch/oc.m6.d1:ocMA.OdeS4C33.mode	@ltx/gr_gr_cog/oc.m6.d1:ocMA.OdeS4C33.mode
ltx/gr_redirects_goarch/oc.m6.d1:ocMA.OdeS4C33.ode	@ltx/gr_gr_cog/oc.m6.d1:ocMA.OdeS4C33.ode
ltx/gr_redirects_goarch/oc.m6.d1:ocMA.OdeS4C33.text	@ltx/gr_gr_cog/oc.m6.d1:ocMA.OdeS4C33.text
ltx/gr_redirects_goarch/oc.m6.d1:ocMA.OdeS4C34.incipit	@ltx/gr_gr_cog/oc.m6.d1:ocMA.OdeS4C34.incipit
ltx/gr_redirects_goarch/oc.m6.d1:ocMA.OdeS4C34.melody	@ltx/gr_gr_cog/oc.m6.d1:ocMA.OdeS4C34.melody
ltx/gr_redirects_goarch/oc.m6.d1:ocMA.OdeS4C34.mode	@ltx/gr_gr_cog/oc.m6.d1:ocMA.OdeS4C34.mode
ltx/gr_redirects_goarch/oc.m6.d1:ocMA.OdeS4C34.ode	@ltx/gr_gr_cog/oc.m6.d1:ocMA.OdeS4C34.ode
ltx/gr_redirects_goarch/oc.m6.d1:ocMA.OdeS4C34.text	@ltx/gr_gr_cog/oc.m6.d1:ocMA.OdeS4C34.text
ltx/gr_redirects_goarch/oc.m6.d1:ocMA.OdeS5C11.incipit	@ltx/gr_gr_cog/oc.m6.d1:ocMA.OdeS5C11.incipit
ltx/gr_redirects_goarch/oc.m6.d1:ocMA.OdeS5C11.melody	@ltx/gr_gr_cog/oc.m6.d1:ocMA.OdeS5C11.melody
ltx/gr_redirects_goarch/oc.m6.d1:ocMA.OdeS5C11.mode	@ltx/gr_gr_cog/oc.m6.d1:ocMA.OdeS5C11.mode
ltx/gr_redirects_goarch/oc.m6.d1:ocMA.OdeS5C11.ode	@ltx/gr_gr_cog/oc.m6.d1:ocMA.OdeS5C11.ode
ltx/gr_redirects_goarch/oc.m6.d1:ocMA.OdeS5C11.text	@ltx/gr_gr_cog/oc.m6.d1:ocMA.OdeS5C11.text
ltx/gr_redirects_goarch/oc.m6.d1:ocMA.OdeS5C12.incipit	@ltx/gr_gr_cog/oc.m6.d1:ocMA.OdeS5C12.incipit
ltx/gr_redirects_goarch/oc.m6.d1:ocMA.OdeS5C12.melody	@ltx/gr_gr_cog/oc.m6.d1:ocMA.OdeS5C12.melody
ltx/gr_redirects_goarch/oc.m6.d1:ocMA.OdeS5C12.mode	@ltx/gr_gr_cog/oc.m6.d1:ocMA.OdeS5C12.mode
ltx/gr_redirects_goarch/oc.m6.d1:ocMA.OdeS5C12.ode	@ltx/gr_gr_cog/oc.m6.d1:ocMA.OdeS5C12.ode
ltx/gr_redirects_goarch/oc.m6.d1:ocMA.OdeS5C12.text	@ltx/gr_gr_cog/oc.m6.d1:ocMA.OdeS5C12.text
ltx/gr_redirects_goarch/oc.m6.d1:ocMA.OdeS5C1H.greekmelody	@ltx/gr_gr_cog/oc.m6.d1:ocMA.OdeS5C1H.greekmelody
ltx/gr_redirects_goarch/oc.m6.d1:ocMA.OdeS5C1H.incipit	@ltx/gr_gr_cog/oc.m6.d1:ocMA.OdeS5C1H.incipit
ltx/gr_redirects_goarch/oc.m6.d1:ocMA.OdeS5C1H.melody	@ltx/gr_gr_cog/oc.m6.d1:ocMA.OdeS5C1H.melody
ltx/gr_redirects_goarch/oc.m6.d1:ocMA.OdeS5C1H.mode	@ltx/gr_gr_cog/oc.m6.d1:ocMA.OdeS5C1H.mode
ltx/gr_redirects_goarch/oc.m6.d1:ocMA.OdeS5C1H.ode	@ltx/gr_gr_cog/oc.m6.d1:ocMA.OdeS5C1H.ode
ltx/gr_redirects_goarch/oc.m6.d1:ocMA.OdeS5C1H.text	@ltx/gr_gr_cog/oc.m6.d1:ocMA.OdeS5C1H.text
ltx/gr_redirects_goarch/oc.m6.d1:ocMA.OdeS5C1T.incipit	@ltx/gr_gr_cog/oc.m6.d1:ocMA.OdeS5C1T.incipit
ltx/gr_redirects_goarch/oc.m6.d1:ocMA.OdeS5C1T.melody	@ltx/gr_gr_cog/oc.m6.d1:ocMA.OdeS5C1T.melody
ltx/gr_redirects_goarch/oc.m6.d1:ocMA.OdeS5C1T.mode	@ltx/gr_gr_cog/oc.m6.d1:ocMA.OdeS5C1T.mode
ltx/gr_redirects_goarch/oc.m6.d1:ocMA.OdeS5C1T.ode	@ltx/gr_gr_cog/oc.m6.d1:ocMA.OdeS5C1T.ode
ltx/gr_redirects_goarch/oc.m6.d1:ocMA.OdeS5C1T.text	@ltx/gr_gr_cog/oc.m6.d1:ocMA.OdeS5C1T.text
ltx/gr_redirects_goarch/oc.m6.d1:ocMA.OdeS5C21.greekmelody	@ltx/gr_gr_cog/oc.m6.d1:ocMA.OdeS5C21.greekmelody
ltx/gr_redirects_goarch/oc.m6.d1:ocMA.OdeS5C21.incipit	@ltx/gr_gr_cog/oc.m6.d1:ocMA.OdeS5C21.incipit
ltx/gr_redirects_goarch/oc.m6.d1:ocMA.OdeS5C21.melody	@ltx/gr_gr_cog/oc.m6.d1:ocMA.OdeS5C21.melody
ltx/gr_redirects_goarch/oc.m6.d1:ocMA.OdeS5C21.mode	@ltx/gr_gr_cog/oc.m6.d1:ocMA.OdeS5C21.mode
ltx/gr_redirects_goarch/oc.m6.d1:ocMA.OdeS5C21.ode	@ltx/gr_gr_cog/oc.m6.d1:ocMA.OdeS5C21.ode
ltx/gr_redirects_goarch/oc.m6.d1:ocMA.OdeS5C21.text	@ltx/gr_gr_cog/oc.m6.d1:ocMA.OdeS5C21.text
ltx/gr_redirects_goarch/oc.m6.d1:ocMA.OdeS5C22.incipit	@ltx/gr_gr_cog/oc.m6.d1:ocMA.OdeS5C22.incipit
ltx/gr_redirects_goarch/oc.m6.d1:ocMA.OdeS5C22.melody	@ltx/gr_gr_cog/oc.m6.d1:ocMA.OdeS5C22.melody
ltx/gr_redirects_goarch/oc.m6.d1:ocMA.OdeS5C22.mode	@ltx/gr_gr_cog/oc.m6.d1:ocMA.OdeS5C22.mode
ltx/gr_redirects_goarch/oc.m6.d1:ocMA.OdeS5C22.ode	@ltx/gr_gr_cog/oc.m6.d1:ocMA.OdeS5C22.ode
ltx/gr_redirects_goarch/oc.m6.d1:ocMA.OdeS5C22.text	@ltx/gr_gr_cog/oc.m6.d1:ocMA.OdeS5C22.text
ltx/gr_redirects_goarch/oc.m6.d1:ocMA.OdeS5C2T.incipit	@ltx/gr_gr_cog/oc.m6.d1:ocMA.OdeS5C2T.incipit
ltx/gr_redirects_goarch/oc.m6.d1:ocMA.OdeS5C2T.melody	@ltx/gr_gr_cog/oc.m6.d1:ocMA.OdeS5C2T.melody
ltx/gr_redirects_goarch/oc.m6.d1:ocMA.OdeS5C2T.mode	@ltx/gr_gr_cog/oc.m6.d1:ocMA.OdeS5C2T.mode
ltx/gr_redirects_goarch/oc.m6.d1:ocMA.OdeS5C2T.ode	@ltx/gr_gr_cog/oc.m6.d1:ocMA.OdeS5C2T.ode
ltx/gr_redirects_goarch/oc.m6.d1:ocMA.OdeS5C2T.text	@ltx/gr_gr_cog/oc.m6.d1:ocMA.OdeS5C2T.text
ltx/gr_redirects_goarch/oc.m6.d1:ocMA.OdeS5C31.greekmelody	@ltx/gr_gr_cog/oc.m6.d1:ocMA.OdeS5C31.greekmelody
ltx/gr_redirects_goarch/oc.m6.d1:ocMA.OdeS5C31.incipit	@ltx/gr_gr_cog/oc.m6.d1:ocMA.OdeS5C31.incipit
ltx/gr_redirects_goarch/oc.m6.d1:ocMA.OdeS5C31.melody	@ltx/gr_gr_cog/oc.m6.d1:ocMA.OdeS5C31.melody
ltx/gr_redirects_goarch/oc.m6.d1:ocMA.OdeS5C31.mode	@ltx/gr_gr_cog/oc.m6.d1:ocMA.OdeS5C31.mode
ltx/gr_redirects_goarch/oc.m6.d1:ocMA.OdeS5C31.ode	@ltx/gr_gr_cog/oc.m6.d1:ocMA.OdeS5C31.ode
ltx/gr_redirects_goarch/oc.m6.d1:ocMA.OdeS5C31.text	@ltx/gr_gr_cog/oc.m6.d1:ocMA.OdeS5C31.text
ltx/gr_redirects_goarch/oc.m6.d1:ocMA.OdeS5C32.incipit	@ltx/gr_gr_cog/oc.m6.d1:ocMA.OdeS5C32.incipit
ltx/gr_redirects_goarch/oc.m6.d1:ocMA.OdeS5C32.melody	@ltx/gr_gr_cog/oc.m6.d1:ocMA.OdeS5C32.melody
ltx/gr_redirects_goarch/oc.m6.d1:ocMA.OdeS5C32.mode	@ltx/gr_gr_cog/oc.m6.d1:ocMA.OdeS5C32.mode
ltx/gr_redirects_goarch/oc.m6.d1:ocMA.OdeS5C32.ode	@ltx/gr_gr_cog/oc.m6.d1:ocMA.OdeS5C32.ode
ltx/gr_redirects_goarch/oc.m6.d1:ocMA.OdeS5C32.text	@ltx/gr_gr_cog/oc.m6.d1:ocMA.OdeS5C32.text
ltx/gr_redirects_goarch/oc.m6.d1:ocMA.OdeS5C33.incipit	@ltx/gr_gr_cog/oc.m6.d1:ocMA.OdeS5C33.incipit
ltx/gr_redirects_goarch/oc.m6.d1:ocMA.OdeS5C33.melody	@ltx/gr_gr_cog/oc.m6.d1:ocMA.OdeS5C33.melody
ltx/gr_redirects_goarch/oc.m6.d1:ocMA.OdeS5C33.mode	@ltx/gr_gr_cog/oc.m6.d1:ocMA.OdeS5C33.mode
ltx/gr_redirects_goarch/oc.m6.d1:ocMA.OdeS5C33.ode	@ltx/gr_gr_cog/oc.m6.d1:ocMA.OdeS5C33.ode
ltx/gr_redirects_goarch/oc.m6.d1:ocMA.OdeS5C33.text	@ltx/gr_gr_cog/oc.m6.d1:ocMA.OdeS5C33.text
ltx/gr_redirects_goarch/oc.m6.d1:ocMA.OdeS6C11.incipit	@ltx/gr_gr_cog/oc.m6.d1:ocMA.OdeS6C11.incipit
ltx/gr_redirects_goarch/oc.m6.d1:ocMA.OdeS6C11.melody	@ltx/gr_gr_cog/oc.m6.d1:ocMA.OdeS6C11.melody
ltx/gr_redirects_goarch/oc.m6.d1:ocMA.OdeS6C11.mode	@ltx/gr_gr_cog/oc.m6.d1:ocMA.OdeS6C11.mode
ltx/gr_redirects_goarch/oc.m6.d1:ocMA.OdeS6C11.ode	@ltx/gr_gr_cog/oc.m6.d1:ocMA.OdeS6C11.ode
ltx/gr_redirects_goarch/oc.m6.d1:ocMA.OdeS6C11.text	@ltx/gr_gr_cog/oc.m6.d1:ocMA.OdeS6C11.text
ltx/gr_redirects_goarch/oc.m6.d1:ocMA.OdeS6C12.incipit	@ltx/gr_gr_cog/oc.m6.d1:ocMA.OdeS6C12.incipit
ltx/gr_redirects_goarch/oc.m6.d1:ocMA.OdeS6C12.melody	@ltx/gr_gr_cog/oc.m6.d1:ocMA.OdeS6C12.melody
ltx/gr_redirects_goarch/oc.m6.d1:ocMA.OdeS6C12.mode	@ltx/gr_gr_cog/oc.m6.d1:ocMA.OdeS6C12.mode
ltx/gr_redirects_goarch/oc.m6.d1:ocMA.OdeS6C12.ode	@ltx/gr_gr_cog/oc.m6.d1:ocMA.OdeS6C12.ode
ltx/gr_redirects_goarch/oc.m6.d1:ocMA.OdeS6C12.text	@ltx/gr_gr_cog/oc.m6.d1:ocMA.OdeS6C12.text
ltx/gr_redirects_goarch/oc.m6.d1:ocMA.OdeS6C1H.greekmelody	@ltx/gr_gr_cog/oc.m6.d1:ocMA.OdeS6C1H.greekmelody
ltx/gr_redirects_goarch/oc.m6.d1:ocMA.OdeS6C1H.incipit	@ltx/gr_gr_cog/oc.m6.d1:ocMA.OdeS6C1H.incipit
ltx/gr_redirects_goarch/oc.m6.d1:ocMA.OdeS6C1H.melody	@ltx/gr_gr_cog/oc.m6.d1:ocMA.OdeS6C1H.melody
ltx/gr_redirects_goarch/oc.m6.d1:ocMA.OdeS6C1H.mode	@ltx/gr_gr_cog/oc.m6.d1:ocMA.OdeS6C1H.mode
ltx/gr_redirects_goarch/oc.m6.d1:ocMA.OdeS6C1H.ode	@ltx/gr_gr_cog/oc.m6.d1:ocMA.OdeS6C1H.ode
ltx/gr_redirects_goarch/oc.m6.d1:ocMA.OdeS6C1H.text	@ltx/gr_gr_cog/oc.m6.d1:ocMA.OdeS6C1H.text
ltx/gr_redirects_goarch/oc.m6.d1:ocMA.OdeS6C1T.incipit	@ltx/gr_gr_cog/oc.m6.d1:ocMA.OdeS6C1T.incipit
ltx/gr_redirects_goarch/oc.m6.d1:ocMA.OdeS6C1T.melody	@ltx/gr_gr_cog/oc.m6.d1:ocMA.OdeS6C1T.melody
ltx/gr_redirects_goarch/oc.m6.d1:ocMA.OdeS6C1T.mode	@ltx/gr_gr_cog/oc.m6.d1:ocMA.OdeS6C1T.mode
ltx/gr_redirects_goarch/oc.m6.d1:ocMA.OdeS6C1T.ode	@ltx/gr_gr_cog/oc.m6.d1:ocMA.OdeS6C1T.ode
ltx/gr_redirects_goarch/oc.m6.d1:ocMA.OdeS6C1T.text	@ltx/gr_gr_cog/oc.m6.d1:ocMA.OdeS6C1T.text
ltx/gr_redirects_goarch/oc.m6.d1:ocMA.OdeS6C21.greekmelody	@ltx/gr_gr_cog/oc.m6.d1:ocMA.OdeS6C21.greekmelody
ltx/gr_redirects_goarch/oc.m6.d1:ocMA.OdeS6C21.incipit	@ltx/gr_gr_cog/oc.m6.d1:ocMA.OdeS6C21.incipit
ltx/gr_redirects_goarch/oc.m6.d1:ocMA.OdeS6C21.melody	@ltx/gr_gr_cog/oc.m6.d1:ocMA.OdeS6C21.melody
ltx/gr_redirects_goarch/oc.m6.d1:ocMA.OdeS6C21.mode	@ltx/gr_gr_cog/oc.m6.d1:ocMA.OdeS6C21.mode
ltx/gr_redirects_goarch/oc.m6.d1:ocMA.OdeS6C21.ode	@ltx/gr_gr_cog/oc.m6.d1:ocMA.OdeS6C21.ode
ltx/gr_redirects_goarch/oc.m6.d1:ocMA.OdeS6C21.text	@ltx/gr_gr_cog/oc.m6.d1:ocMA.OdeS6C21.text
ltx/gr_redirects_goarch/oc.m6.d1:ocMA.OdeS6C22.incipit	@ltx/gr_gr_cog/oc.m6.d1:ocMA.OdeS6C22.incipit
ltx/gr_redirects_goarch/oc.m6.d1:ocMA.OdeS6C22.melody	@ltx/gr_gr_cog/oc.m6.d1:ocMA.OdeS6C22.melody
ltx/gr_redirects_goarch/oc.m6.d1:ocMA.OdeS6C22.mode	@ltx/gr_gr_cog/oc.m6.d1:ocMA.OdeS6C22.mode
ltx/gr_redirects_goarch/oc.m6.d1:ocMA.OdeS6C22.ode	@ltx/gr_gr_cog/oc.m6.d1:ocMA.OdeS6C22.ode
ltx/gr_redirects_goarch/oc.m6.d1:ocMA.OdeS6C22.text	@ltx/gr_gr_cog/oc.m6.d1:ocMA.OdeS6C22.text
ltx/gr_redirects_goarch/oc.m6.d1:ocMA.OdeS6C2T.incipit	@ltx/gr_gr_cog/oc.m6.d1:ocMA.OdeS6C2T.incipit
ltx/gr_redirects_goarch/oc.m6.d1:ocMA.OdeS6C2T.melody	@ltx/gr_gr_cog/oc.m6.d1:ocMA.OdeS6C2T.melody
ltx/gr_redirects_goarch/oc.m6.d1:ocMA.OdeS6C2T.mode	@ltx/gr_gr_cog/oc.m6.d1:ocMA.OdeS6C2T.mode
ltx/gr_redirects_goarch/oc.m6.d1:ocMA.OdeS6C2T.ode	@ltx/gr_gr_cog/oc.m6.d1:ocMA.OdeS6C2T.ode
ltx/gr_redirects_goarch/oc.m6.d1:ocMA.OdeS6C2T.text	@ltx/gr_gr_cog/oc.m6.d1:ocMA.OdeS6C2T.text
ltx/gr_redirects_goarch/oc.m6.d1:ocMA.OdeS6C31.greekmelody	@ltx/gr_gr_cog/oc.m6.d1:ocMA.OdeS6C31.greekmelody
ltx/gr_redirects_goarch/oc.m6.d1:ocMA.OdeS6C31.incipit	@ltx/gr_gr_cog/oc.m6.d1:ocMA.OdeS6C31.incipit
ltx/gr_redirects_goarch/oc.m6.d1:ocMA.OdeS6C31.melody	@ltx/gr_gr_cog/oc.m6.d1:ocMA.OdeS6C31.melody
ltx/gr_redirects_goarch/oc.m6.d1:ocMA.OdeS6C31.mode	@ltx/gr_gr_cog/oc.m6.d1:ocMA.OdeS6C31.mode
ltx/gr_redirects_goarch/oc.m6.d1:ocMA.OdeS6C31.ode	@ltx/gr_gr_cog/oc.m6.d1:ocMA.OdeS6C31.ode
ltx/gr_redirects_goarch/oc.m6.d1:ocMA.OdeS6C31.text	@ltx/gr_gr_cog/oc.m6.d1:ocMA.OdeS6C31.text
ltx/gr_redirects_goarch/oc.m6.d1:ocMA.OdeS6C32.incipit	@ltx/gr_gr_cog/oc.m6.d1:ocMA.OdeS6C32.incipit
ltx/gr_redirects_goarch/oc.m6.d1:ocMA.OdeS6C32.melody	@ltx/gr_gr_cog/oc.m6.d1:ocMA.OdeS6C32.melody
ltx/gr_redirects_goarch/oc.m6.d1:ocMA.OdeS6C32.mode	@ltx/gr_gr_cog/oc.m6.d1:ocMA.OdeS6C32.mode
ltx/gr_redirects_goarch/oc.m6.d1:ocMA.OdeS6C32.ode	@ltx/gr_gr_cog/oc.m6.d1:ocMA.OdeS6C32.ode
ltx/gr_redirects_goarch/oc.m6.d1:ocMA.OdeS6C32.text	@ltx/gr_gr_cog/oc.m6.d1:ocMA.OdeS6C32.text
ltx/gr_redirects_goarch/oc.m6.d1:ocMA.OdeS6C33.incipit	@ltx/gr_gr_cog/oc.m6.d1:ocMA.OdeS6C33.incipit
ltx/gr_redirects_goarch/oc.m6.d1:ocMA.OdeS6C33.melody	@ltx/gr_gr_cog/oc.m6.d1:ocMA.OdeS6C33.melody
ltx/gr_redirects_goarch/oc.m6.d1:ocMA.OdeS6C33.mode	@ltx/gr_gr_cog/oc.m6.d1:ocMA.OdeS6C33.mode
ltx/gr_redirects_goarch/oc.m6.d1:ocMA.OdeS6C33.ode	@ltx/gr_gr_cog/oc.m6.d1:ocMA.OdeS6C33.ode
ltx/gr_redirects_goarch/oc.m6.d1:ocMA.OdeS6C33.text	@ltx/gr_gr_cog/oc.m6.d1:ocMA.OdeS6C33.text
ltx/gr_redirects_goarch/oc.m6.d1:ocMA.OdeS7C11.incipit	@ltx/gr_gr_cog/oc.m6.d1:ocMA.OdeS7C11.incipit
ltx/gr_redirects_goarch/oc.m6.d1:ocMA.OdeS7C11.melody	@ltx/gr_gr_cog/oc.m6.d1:ocMA.OdeS7C11.melody
ltx/gr_redirects_goarch/oc.m6.d1:ocMA.OdeS7C11.mode	@ltx/gr_gr_cog/oc.m6.d1:ocMA.OdeS7C11.mode
ltx/gr_redirects_goarch/oc.m6.d1:ocMA.OdeS7C11.ode	@ltx/gr_gr_cog/oc.m6.d1:ocMA.OdeS7C11.ode
ltx/gr_redirects_goarch/oc.m6.d1:ocMA.OdeS7C11.text	@ltx/gr_gr_cog/oc.m6.d1:ocMA.OdeS7C11.text
ltx/gr_redirects_goarch/oc.m6.d1:ocMA.OdeS7C12.incipit	@ltx/gr_gr_cog/oc.m6.d1:ocMA.OdeS7C12.incipit
ltx/gr_redirects_goarch/oc.m6.d1:ocMA.OdeS7C12.melody	@ltx/gr_gr_cog/oc.m6.d1:ocMA.OdeS7C12.melody
ltx/gr_redirects_goarch/oc.m6.d1:ocMA.OdeS7C12.mode	@ltx/gr_gr_cog/oc.m6.d1:ocMA.OdeS7C12.mode
ltx/gr_redirects_goarch/oc.m6.d1:ocMA.OdeS7C12.ode	@ltx/gr_gr_cog/oc.m6.d1:ocMA.OdeS7C12.ode
ltx/gr_redirects_goarch/oc.m6.d1:ocMA.OdeS7C12.text	@ltx/gr_gr_cog/oc.m6.d1:ocMA.OdeS7C12.text
ltx/gr_redirects_goarch/oc.m6.d1:ocMA.OdeS7C1H.greekmelody	@ltx/gr_gr_cog/oc.m6.d1:ocMA.OdeS7C1H.greekmelody
ltx/gr_redirects_goarch/oc.m6.d1:ocMA.OdeS7C1H.incipit	@ltx/gr_gr_cog/oc.m6.d1:ocMA.OdeS7C1H.incipit
ltx/gr_redirects_goarch/oc.m6.d1:ocMA.OdeS7C1H.melody	@ltx/gr_gr_cog/oc.m6.d1:ocMA.OdeS7C1H.melody
ltx/gr_redirects_goarch/oc.m6.d1:ocMA.OdeS7C1H.mode	@ltx/gr_gr_cog/oc.m6.d1:ocMA.OdeS7C1H.mode
ltx/gr_redirects_goarch/oc.m6.d1:ocMA.OdeS7C1H.ode	@ltx/gr_gr_cog/oc.m6.d1:ocMA.OdeS7C1H.ode
ltx/gr_redirects_goarch/oc.m6.d1:ocMA.OdeS7C1H.text	@ltx/gr_gr_cog/oc.m6.d1:ocMA.OdeS7C1H.text
ltx/gr_redirects_goarch/oc.m6.d1:ocMA.OdeS7C1T.incipit	@ltx/gr_gr_cog/oc.m6.d1:ocMA.OdeS7C1T.incipit
ltx/gr_redirects_goarch/oc.m6.d1:ocMA.OdeS7C1T.melody	@ltx/gr_gr_cog/oc.m6.d1:ocMA.OdeS7C1T.melody
ltx/gr_redirects_goarch/oc.m6.d1:ocMA.OdeS7C1T.mode	@ltx/gr_gr_cog/oc.m6.d1:ocMA.OdeS7C1T.mode
ltx/gr_redirects_goarch/oc.m6.d1:ocMA.OdeS7C1T.ode	@ltx/gr_gr_cog/oc.m6.d1:ocMA.OdeS7C1T.ode
ltx/gr_redirects_goarch/oc.m6.d1:ocMA.OdeS7C1T.text	@ltx/gr_gr_cog/oc.m6.d1:ocMA.OdeS7C1T.text
ltx/gr_redirects_goarch/oc.m6.d1:ocMA.OdeS7C21.greekmelody	@ltx/gr_gr_cog/oc.m6.d1:ocMA.OdeS7C21.greekmelody
ltx/gr_redirects_goarch/oc.m6.d1:ocMA.OdeS7C21.incipit	@ltx/gr_gr_cog/oc.m6.d1:ocMA.OdeS7C21.incipit
ltx/gr_redirects_goarch/oc.m6.d1:ocMA.OdeS7C21.melody	@ltx/gr_gr_cog/oc.m6.d1:ocMA.OdeS7C21.melody
ltx/gr_redirects_goarch/oc.m6.d1:ocMA.OdeS7C21.mode	@ltx/gr_gr_cog/oc.m6.d1:ocMA.OdeS7C21.mode
ltx/gr_redirects_goarch/oc.m6.d1:ocMA.OdeS7C21.ode	@ltx/gr_gr_cog/oc.m6.d1:ocMA.OdeS7C21.ode
ltx/gr_redirects_goarch/oc.m6.d1:ocMA.OdeS7C21.text	@ltx/gr_gr_cog/oc.m6.d1:ocMA.OdeS7C21.text
ltx/gr_redirects_goarch/oc.m6.d1:ocMA.OdeS7C22.incipit	@ltx/gr_gr_cog/oc.m6.d1:ocMA.OdeS7C22.incipit
ltx/gr_redirects_goarch/oc.m6.d1:ocMA.OdeS7C22.melody	@ltx/gr_gr_cog/oc.m6.d1:ocMA.OdeS7C22.melody
ltx/gr_redirects_goarch/oc.m6.d1:ocMA.OdeS7C22.mode	@ltx/gr_gr_cog/oc.m6.d1:ocMA.OdeS7C22.mode
ltx/gr_redirects_goarch/oc.m6.d1:ocMA.OdeS7C22.ode	@ltx/gr_gr_cog/oc.m6.d1:ocMA.OdeS7C22.ode
ltx/gr_redirects_goarch/oc.m6.d1:ocMA.OdeS7C22.text	@ltx/gr_gr_cog/oc.m6.d1:ocMA.OdeS7C22.text
ltx/gr_redirects_goarch/oc.m6.d1:ocMA.OdeS7C2T.incipit	@ltx/gr_gr_cog/oc.m6.d1:ocMA.OdeS7C2T.incipit
ltx/gr_redirects_goarch/oc.m6.d1:ocMA.OdeS7C2T.melody	@ltx/gr_gr_cog/oc.m6.d1:ocMA.OdeS7C2T.melody
ltx/gr_redirects_goarch/oc.m6.d1:ocMA.OdeS7C2T.mode	@ltx/gr_gr_cog/oc.m6.d1:ocMA.OdeS7C2T.mode
ltx/gr_redirects_goarch/oc.m6.d1:ocMA.OdeS7C2T.ode	@ltx/gr_gr_cog/oc.m6.d1:ocMA.OdeS7C2T.ode
ltx/gr_redirects_goarch/oc.m6.d1:ocMA.OdeS7C2T.text	@ltx/gr_gr_cog/oc.m6.d1:ocMA.OdeS7C2T.text
ltx/gr_redirects_goarch/oc.m6.d1:ocMA.OdeS7C31.greekmelody	@ltx/gr_gr_cog/oc.m6.d1:ocMA.OdeS7C31.greekmelody
ltx/gr_redirects_goarch/oc.m6.d1:ocMA.OdeS7C31.incipit	@ltx/gr_gr_cog/oc.m6.d1:ocMA.OdeS7C31.incipit
ltx/gr_redirects_goarch/oc.m6.d1:ocMA.OdeS7C31.melody	@ltx/gr_gr_cog/oc.m6.d1:ocMA.OdeS7C31.melody
ltx/gr_redirects_goarch/oc.m6.d1:ocMA.OdeS7C31.mode	@ltx/gr_gr_cog/oc.m6.d1:ocMA.OdeS7C31.mode
ltx/gr_redirects_goarch/oc.m6.d1:ocMA.OdeS7C31.ode	@ltx/gr_gr_cog/oc.m6.d1:ocMA.OdeS7C31.ode
ltx/gr_redirects_goarch/oc.m6.d1:ocMA.OdeS7C31.text	@ltx/gr_gr_cog/oc.m6.d1:ocMA.OdeS7C31.text
ltx/gr_redirects_goarch/oc.m6.d1:ocMA.OdeS7C32.incipit	@ltx/gr_gr_cog/oc.m6.d1:ocMA.OdeS7C32.incipit
ltx/gr_redirects_goarch/oc.m6.d1:ocMA.OdeS7C32.melody	@ltx/gr_gr_cog/oc.m6.d1:ocMA.OdeS7C32.melody
ltx/gr_redirects_goarch/oc.m6.d1:ocMA.OdeS7C32.mode	@ltx/gr_gr_cog/oc.m6.d1:ocMA.OdeS7C32.mode
ltx/gr_redirects_goarch/oc.m6.d1:ocMA.OdeS7C32.ode	@ltx/gr_gr_cog/oc.m6.d1:ocMA.OdeS7C32.ode
ltx/gr_redirects_goarch/oc.m6.d1:ocMA.OdeS7C32.text	@ltx/gr_gr_cog/oc.m6.d1:ocMA.OdeS7C32.text
ltx/gr_redirects_goarch/oc.m6.d1:ocMA.OdeS7C33.incipit	@ltx/gr_gr_cog/oc.m6.d1:ocMA.OdeS7C33.incipit
ltx/gr_redirects_goarch/oc.m6.d1:ocMA.OdeS7C33.melody	@ltx/gr_gr_cog/oc.m6.d1:ocMA.OdeS7C33.melody
ltx/gr_redirects_goarch/oc.m6.d1:ocMA.OdeS7C33.mode	@ltx/gr_gr_cog/oc.m6.d1:ocMA.OdeS7C33.mode
ltx/gr_redirects_goarch/oc.m6.d1:ocMA.OdeS7C33.ode	@ltx/gr_gr_cog/oc.m6.d1:ocMA.OdeS7C33.ode
ltx/gr_redirects_goarch/oc.m6.d1:ocMA.OdeS7C33.text	@ltx/gr_gr_cog/oc.m6.d1:ocMA.OdeS7C33.text
ltx/gr_redirects_goarch/oc.m6.d1:ocMA.OdeS7C34.incipit	@ltx/gr_gr_cog/oc.m6.d1:ocMA.OdeS7C34.incipit
ltx/gr_redirects_goarch/oc.m6.d1:ocMA.OdeS7C34.melody	@ltx/gr_gr_cog/oc.m6.d1:ocMA.OdeS7C34.melody
ltx/gr_redirects_goarch/oc.m6.d1:ocMA.OdeS7C34.mode	@ltx/gr_gr_cog/oc.m6.d1:ocMA.OdeS7C34.mode
ltx/gr_redirects_goarch/oc.m6.d1:ocMA.OdeS7C34.ode	@ltx/gr_gr_cog/oc.m6.d1:ocMA.OdeS7C34.ode
ltx/gr_redirects_goarch/oc.m6.d1:ocMA.OdeS7C34.text	@ltx/gr_gr_cog/oc.m6.d1:ocMA.OdeS7C34.text
ltx/gr_redirects_goarch/oc.m6.d1:ocMA.OdeS8C11.incipit	@ltx/gr_gr_cog/oc.m6.d1:ocMA.OdeS8C11.incipit
ltx/gr_redirects_goarch/oc.m6.d1:ocMA.OdeS8C11.melody	@ltx/gr_gr_cog/oc.m6.d1:ocMA.OdeS8C11.melody
ltx/gr_redirects_goarch/oc.m6.d1:ocMA.OdeS8C11.mode	@ltx/gr_gr_cog/oc.m6.d1:ocMA.OdeS8C11.mode
ltx/gr_redirects_goarch/oc.m6.d1:ocMA.OdeS8C11.ode	@ltx/gr_gr_cog/oc.m6.d1:ocMA.OdeS8C11.ode
ltx/gr_redirects_goarch/oc.m6.d1:ocMA.OdeS8C11.text	@ltx/gr_gr_cog/oc.m6.d1:ocMA.OdeS8C11.text
ltx/gr_redirects_goarch/oc.m6.d1:ocMA.OdeS8C12.incipit	@ltx/gr_gr_cog/oc.m6.d1:ocMA.OdeS8C12.incipit
ltx/gr_redirects_goarch/oc.m6.d1:ocMA.OdeS8C12.melody	@ltx/gr_gr_cog/oc.m6.d1:ocMA.OdeS8C12.melody
ltx/gr_redirects_goarch/oc.m6.d1:ocMA.OdeS8C12.mode	@ltx/gr_gr_cog/oc.m6.d1:ocMA.OdeS8C12.mode
ltx/gr_redirects_goarch/oc.m6.d1:ocMA.OdeS8C12.ode	@ltx/gr_gr_cog/oc.m6.d1:ocMA.OdeS8C12.ode
ltx/gr_redirects_goarch/oc.m6.d1:ocMA.OdeS8C12.text	@ltx/gr_gr_cog/oc.m6.d1:ocMA.OdeS8C12.text
ltx/gr_redirects_goarch/oc.m6.d1:ocMA.OdeS8C1H.greekmelody	@ltx/gr_gr_cog/oc.m6.d1:ocMA.OdeS8C1H.greekmelody
ltx/gr_redirects_goarch/oc.m6.d1:ocMA.OdeS8C1H.incipit	@ltx/gr_gr_cog/oc.m6.d1:ocMA.OdeS8C1H.incipit
ltx/gr_redirects_goarch/oc.m6.d1:ocMA.OdeS8C1H.melody	@ltx/gr_gr_cog/oc.m6.d1:ocMA.OdeS8C1H.melody
ltx/gr_redirects_goarch/oc.m6.d1:ocMA.OdeS8C1H.mode	@ltx/gr_gr_cog/oc.m6.d1:ocMA.OdeS8C1H.mode
ltx/gr_redirects_goarch/oc.m6.d1:ocMA.OdeS8C1H.ode	@ltx/gr_gr_cog/oc.m6.d1:ocMA.OdeS8C1H.ode
ltx/gr_redirects_goarch/oc.m6.d1:ocMA.OdeS8C1H.text	@ltx/gr_gr_cog/oc.m6.d1:ocMA.OdeS8C1H.text
ltx/gr_redirects_goarch/oc.m6.d1:ocMA.OdeS8C1T.incipit	@ltx/gr_gr_cog/oc.m6.d1:ocMA.OdeS8C1T.incipit
ltx/gr_redirects_goarch/oc.m6.d1:ocMA.OdeS8C1T.melody	@ltx/gr_gr_cog/oc.m6.d1:ocMA.OdeS8C1T.melody
ltx/gr_redirects_goarch/oc.m6.d1:ocMA.OdeS8C1T.mode	@ltx/gr_gr_cog/oc.m6.d1:ocMA.OdeS8C1T.mode
ltx/gr_redirects_goarch/oc.m6.d1:ocMA.OdeS8C1T.ode	@ltx/gr_gr_cog/oc.m6.d1:ocMA.OdeS8C1T.ode
ltx/gr_redirects_goarch/oc.m6.d1:ocMA.OdeS8C1T.text	@ltx/gr_gr_cog/oc.m6.d1:ocMA.OdeS8C1T.text
ltx/gr_redirects_goarch/oc.m6.d1:ocMA.OdeS8C21.greekmelody	@ltx/gr_gr_cog/oc.m6.d1:ocMA.OdeS8C21.greekmelody
ltx/gr_redirects_goarch/oc.m6.d1:ocMA.OdeS8C21.incipit	@ltx/gr_gr_cog/oc.m6.d1:ocMA.OdeS8C21.incipit
ltx/gr_redirects_goarch/oc.m6.d1:ocMA.OdeS8C21.melody	@ltx/gr_gr_cog/oc.m6.d1:ocMA.OdeS8C21.melody
ltx/gr_redirects_goarch/oc.m6.d1:ocMA.OdeS8C21.mode	@ltx/gr_gr_cog/oc.m6.d1:ocMA.OdeS8C21.mode
ltx/gr_redirects_goarch/oc.m6.d1:ocMA.OdeS8C21.ode	@ltx/gr_gr_cog/oc.m6.d1:ocMA.OdeS8C21.ode
ltx/gr_redirects_goarch/oc.m6.d1:ocMA.OdeS8C21.text	@ltx/gr_gr_cog/oc.m6.d1:ocMA.OdeS8C21.text
ltx/gr_redirects_goarch/oc.m6.d1:ocMA.OdeS8C22.incipit	@ltx/gr_gr_cog/oc.m6.d1:ocMA.OdeS8C22.incipit
ltx/gr_redirects_goarch/oc.m6.d1:ocMA.OdeS8C22.melody	@ltx/gr_gr_cog/oc.m6.d1:ocMA.OdeS8C22.melody
ltx/gr_redirects_goarch/oc.m6.d1:ocMA.OdeS8C22.mode	@ltx/gr_gr_cog/oc.m6.d1:ocMA.OdeS8C22.mode
ltx/gr_redirects_goarch/oc.m6.d1:ocMA.OdeS8C22.ode	@ltx/gr_gr_cog/oc.m6.d1:ocMA.OdeS8C22.ode
ltx/gr_redirects_goarch/oc.m6.d1:ocMA.OdeS8C22.text	@ltx/gr_gr_cog/oc.m6.d1:ocMA.OdeS8C22.text
ltx/gr_redirects_goarch/oc.m6.d1:ocMA.OdeS8C23.incipit	@ltx/gr_gr_cog/oc.m6.d1:ocMA.OdeS8C23.incipit
ltx/gr_redirects_goarch/oc.m6.d1:ocMA.OdeS8C23.melody	@ltx/gr_gr_cog/oc.m6.d1:ocMA.OdeS8C23.melody
ltx/gr_redirects_goarch/oc.m6.d1:ocMA.OdeS8C23.mode	@ltx/gr_gr_cog/oc.m6.d1:ocMA.OdeS8C23.mode
ltx/gr_redirects_goarch/oc.m6.d1:ocMA.OdeS8C23.ode	@ltx/gr_gr_cog/oc.m6.d1:ocMA.OdeS8C23.ode
ltx/gr_redirects_goarch/oc.m6.d1:ocMA.OdeS8C23.text	@ltx/gr_gr_cog/oc.m6.d1:ocMA.OdeS8C23.text
ltx/gr_redirects_goarch/oc.m6.d1:ocMA.OdeS8C31.greekmelody	@ltx/gr_gr_cog/oc.m6.d1:ocMA.OdeS8C31.greekmelody
ltx/gr_redirects_goarch/oc.m6.d1:ocMA.OdeS8C31.incipit	@ltx/gr_gr_cog/oc.m6.d1:ocMA.OdeS8C31.incipit
ltx/gr_redirects_goarch/oc.m6.d1:ocMA.OdeS8C31.melody	@ltx/gr_gr_cog/oc.m6.d1:ocMA.OdeS8C31.melody
ltx/gr_redirects_goarch/oc.m6.d1:ocMA.OdeS8C31.mode	@ltx/gr_gr_cog/oc.m6.d1:ocMA.OdeS8C31.mode
ltx/gr_redirects_goarch/oc.m6.d1:ocMA.OdeS8C31.ode	@ltx/gr_gr_cog/oc.m6.d1:ocMA.OdeS8C31.ode
ltx/gr_redirects_goarch/oc.m6.d1:ocMA.OdeS8C31.text	@ltx/gr_gr_cog/oc.m6.d1:ocMA.OdeS8C31.text
ltx/gr_redirects_goarch/oc.m6.d1:ocMA.OdeS8C32.incipit	@ltx/gr_gr_cog/oc.m6.d1:ocMA.OdeS8C32.incipit
ltx/gr_redirects_goarch/oc.m6.d1:ocMA.OdeS8C32.melody	@ltx/gr_gr_cog/oc.m6.d1:ocMA.OdeS8C32.melody
ltx/gr_redirects_goarch/oc.m6.d1:ocMA.OdeS8C32.mode	@ltx/gr_gr_cog/oc.m6.d1:ocMA.OdeS8C32.mode
ltx/gr_redirects_goarch/oc.m6.d1:ocMA.OdeS8C32.ode	@ltx/gr_gr_cog/oc.m6.d1:ocMA.OdeS8C32.ode
ltx/gr_redirects_goarch/oc.m6.d1:ocMA.OdeS8C32.text	@ltx/gr_gr_cog/oc.m6.d1:ocMA.OdeS8C32.text
ltx/gr_redirects_goarch/oc.m6.d1:ocMA.OdeS8C33.incipit	@ltx/gr_gr_cog/oc.m6.d1:ocMA.OdeS8C33.incipit
ltx/gr_redirects_goarch/oc.m6.d1:ocMA.OdeS8C33.melody	@ltx/gr_gr_cog/oc.m6.d1:ocMA.OdeS8C33.melody
ltx/gr_redirects_goarch/oc.m6.d1:ocMA.OdeS8C33.mode	@ltx/gr_gr_cog/oc.m6.d1:ocMA.OdeS8C33.mode
ltx/gr_redirects_goarch/oc.m6.d1:ocMA.OdeS8C33.ode	@ltx/gr_gr_cog/oc.m6.d1:ocMA.OdeS8C33.ode
ltx/gr_redirects_goarch/oc.m6.d1:ocMA.OdeS8C33.text	@ltx/gr_gr_cog/oc.m6.d1:ocMA.OdeS8C33.text
ltx/gr_redirects_goarch/oc.m6.d1:ocMA.OdeS8C34.incipit	@ltx/gr_gr_cog/oc.m6.d1:ocMA.OdeS8C34.incipit
ltx/gr_redirects_goarch/oc.m6.d1:ocMA.OdeS8C34.melody	@ltx/gr_gr_cog/oc.m6.d1:ocMA.OdeS8C34.melody
ltx/gr_redirects_goarch/oc.m6.d1:ocMA.OdeS8C34.mode	@ltx/gr_gr_cog/oc.m6.d1:ocMA.OdeS8C34.mode
ltx/gr_redirects_goarch/oc.m6.d1:ocMA.OdeS8C34.ode	@ltx/gr_gr_cog/oc.m6.d1:ocMA.OdeS8C34.ode
ltx/gr_redirects_goarch/oc.m6.d1:ocMA.OdeS8C34.text	@ltx/gr_gr_cog/oc.m6.d1:ocMA.OdeS8C34.text
ltx/gr_redirects_goarch/oc.m6.d1:ocMA.OdeS9C11.incipit	@ltx/gr_gr_cog/oc.m6.d1:ocMA.OdeS9C11.incipit
ltx/gr_redirects_goarch/oc.m6.d1:ocMA.OdeS9C11.melody	@ltx/gr_gr_cog/oc.m6.d1:ocMA.OdeS9C11.melody
ltx/gr_redirects_goarch/oc.m6.d1:ocMA.OdeS9C11.mode	@ltx/gr_gr_cog/oc.m6.d1:ocMA.OdeS9C11.mode
ltx/gr_redirects_goarch/oc.m6.d1:ocMA.OdeS9C11.ode	@ltx/gr_gr_cog/oc.m6.d1:ocMA.OdeS9C11.ode
ltx/gr_redirects_goarch/oc.m6.d1:ocMA.OdeS9C11.text	@ltx/gr_gr_cog/oc.m6.d1:ocMA.OdeS9C11.text
ltx/gr_redirects_goarch/oc.m6.d1:ocMA.OdeS9C12.incipit	@ltx/gr_gr_cog/oc.m6.d1:ocMA.OdeS9C12.incipit
ltx/gr_redirects_goarch/oc.m6.d1:ocMA.OdeS9C12.melody	@ltx/gr_gr_cog/oc.m6.d1:ocMA.OdeS9C12.melody
ltx/gr_redirects_goarch/oc.m6.d1:ocMA.OdeS9C12.mode	@ltx/gr_gr_cog/oc.m6.d1:ocMA.OdeS9C12.mode
ltx/gr_redirects_goarch/oc.m6.d1:ocMA.OdeS9C12.ode	@ltx/gr_gr_cog/oc.m6.d1:ocMA.OdeS9C12.ode
ltx/gr_redirects_goarch/oc.m6.d1:ocMA.OdeS9C12.text	@ltx/gr_gr_cog/oc.m6.d1:ocMA.OdeS9C12.text
ltx/gr_redirects_goarch/oc.m6.d1:ocMA.OdeS9C1H.greekmelody	@ltx/gr_gr_cog/oc.m6.d1:ocMA.OdeS9C1H.greekmelody
ltx/gr_redirects_goarch/oc.m6.d1:ocMA.OdeS9C1H.incipit	@ltx/gr_gr_cog/oc.m6.d1:ocMA.OdeS9C1H.incipit
ltx/gr_redirects_goarch/oc.m6.d1:ocMA.OdeS9C1H.melody	@ltx/gr_gr_cog/oc.m6.d1:ocMA.OdeS9C1H.melody
ltx/gr_redirects_goarch/oc.m6.d1:ocMA.OdeS9C1H.mode	@ltx/gr_gr_cog/oc.m6.d1:ocMA.OdeS9C1H.mode
ltx/gr_redirects_goarch/oc.m6.d1:ocMA.OdeS9C1H.ode	@ltx/gr_gr_cog/oc.m6.d1:ocMA.OdeS9C1H.ode
ltx/gr_redirects_goarch/oc.m6.d1:ocMA.OdeS9C1H.text	@ltx/gr_gr_cog/oc.m6.d1:ocMA.OdeS9C1H.text
ltx/gr_redirects_goarch/oc.m6.d1:ocMA.OdeS9C1Tr.incipit	@ltx/gr_gr_cog/oc.m6.d1:ocMA.OdeS9C1Tr.incipit
ltx/gr_redirects_goarch/oc.m6.d1:ocMA.OdeS9C1Tr.melody	@ltx/gr_gr_cog/oc.m6.d1:ocMA.OdeS9C1Tr.melody
ltx/gr_redirects_goarch/oc.m6.d1:ocMA.OdeS9C1Tr.mode	@ltx/gr_gr_cog/oc.m6.d1:ocMA.OdeS9C1Tr.mode
ltx/gr_redirects_goarch/oc.m6.d1:ocMA.OdeS9C1Tr.ode	@ltx/gr_gr_cog/oc.m6.d1:ocMA.OdeS9C1Tr.ode
ltx/gr_redirects_goarch/oc.m6.d1:ocMA.OdeS9C1Tr.text	@ltx/gr_gr_cog/oc.m6.d1:ocMA.OdeS9C1Tr.text
ltx/gr_redirects_goarch/oc.m6.d1:ocMA.OdeS9C21.greekmelody	@ltx/gr_gr_cog/oc.m6.d1:ocMA.OdeS9C21.greekmelody
ltx/gr_redirects_goarch/oc.m6.d1:ocMA.OdeS9C21.incipit	@ltx/gr_gr_cog/oc.m6.d1:ocMA.OdeS9C21.incipit
ltx/gr_redirects_goarch/oc.m6.d1:ocMA.OdeS9C21.melody	@ltx/gr_gr_cog/oc.m6.d1:ocMA.OdeS9C21.melody
ltx/gr_redirects_goarch/oc.m6.d1:ocMA.OdeS9C21.mode	@ltx/gr_gr_cog/oc.m6.d1:ocMA.OdeS9C21.mode
ltx/gr_redirects_goarch/oc.m6.d1:ocMA.OdeS9C21.ode	@ltx/gr_gr_cog/oc.m6.d1:ocMA.OdeS9C21.ode
ltx/gr_redirects_goarch/oc.m6.d1:ocMA.OdeS9C21.text	@ltx/gr_gr_cog/oc.m6.d1:ocMA.OdeS9C21.text
ltx/gr_redirects_goarch/oc.m6.d1:ocMA.OdeS9C22.incipit	@ltx/gr_gr_cog/oc.m6.d1:ocMA.OdeS9C22.incipit
ltx/gr_redirects_goarch/oc.m6.d1:ocMA.OdeS9C22.melody	@ltx/gr_gr_cog/oc.m6.d1:ocMA.OdeS9C22.melody
ltx/gr_redirects_goarch/oc.m6.d1:ocMA.OdeS9C22.mode	@ltx/gr_gr_cog/oc.m6.d1:ocMA.OdeS9C22.mode
ltx/gr_redirects_goarch/oc.m6.d1:ocMA.OdeS9C22.ode	@ltx/gr_gr_cog/oc.m6.d1:ocMA.OdeS9C22.ode
ltx/gr_redirects_goarch/oc.m6.d1:ocMA.OdeS9C22.text	@ltx/gr_gr_cog/oc.m6.d1:ocMA.OdeS9C22.text
ltx/gr_redirects_goarch/oc.m6.d1:ocMA.OdeS9C2T.incipit	@ltx/gr_gr_cog/oc.m6.d1:ocMA.OdeS9C2T.incipit
ltx/gr_redirects_goarch/oc.m6.d1:ocMA.OdeS9C2T.melody	@ltx/gr_gr_cog/oc.m6.d1:ocMA.OdeS9C2T.melody
ltx/gr_redirects_goarch/oc.m6.d1:ocMA.OdeS9C2T.mode	@ltx/gr_gr_cog/oc.m6.d1:ocMA.OdeS9C2T.mode
ltx/gr_redirects_goarch/oc.m6.d1:ocMA.OdeS9C2T.ode	@ltx/gr_gr_cog/oc.m6.d1:ocMA.OdeS9C2T.ode
ltx/gr_redirects_goarch/oc.m6.d1:ocMA.OdeS9C2T.text	@ltx/gr_gr_cog/oc.m6.d1:ocMA.OdeS9C2T.text
ltx/gr_redirects_goarch/oc.m6.d1:ocMA.OdeS9C31.greekmelody	@ltx/gr_gr_cog/oc.m6.d1:ocMA.OdeS9C31.greekmelody
ltx/gr_redirects_goarch/oc.m6.d1:ocMA.OdeS9C31.incipit	@ltx/gr_gr_cog/oc.m6.d1:ocMA.OdeS9C31.incipit
ltx/gr_redirects_goarch/oc.m6.d1:ocMA.OdeS9C31.melody	@ltx/gr_gr_cog/oc.m6.d1:ocMA.OdeS9C31.melody
ltx/gr_redirects_goarch/oc.m6.d1:ocMA.OdeS9C31.mode	@ltx/gr_gr_cog/oc.m6.d1:ocMA.OdeS9C31.mode
ltx/gr_redirects_goarch/oc.m6.d1:ocMA.OdeS9C31.ode	@ltx/gr_gr_cog/oc.m6.d1:ocMA.OdeS9C31.ode
ltx/gr_redirects_goarch/oc.m6.d1:ocMA.OdeS9C31.text	@ltx/gr_gr_cog/oc.m6.d1:ocMA.OdeS9C31.text
ltx/gr_redirects_goarch/oc.m6.d1:ocMA.OdeS9C32.incipit	@ltx/gr_gr_cog/oc.m6.d1:ocMA.OdeS9C32.incipit
ltx/gr_redirects_goarch/oc.m6.d1:ocMA.OdeS9C32.melody	@ltx/gr_gr_cog/oc.m6.d1:ocMA.OdeS9C32.melody
ltx/gr_redirects_goarch/oc.m6.d1:ocMA.OdeS9C32.mode	@ltx/gr_gr_cog/oc.m6.d1:ocMA.OdeS9C32.mode
ltx/gr_redirects_goarch/oc.m6.d1:ocMA.OdeS9C32.ode	@ltx/gr_gr_cog/oc.m6.d1:ocMA.OdeS9C32.ode
ltx/gr_redirects_goarch/oc.m6.d1:ocMA.OdeS9C32.text	@ltx/gr_gr_cog/oc.m6.d1:ocMA.OdeS9C32.text
ltx/gr_redirects_goarch/oc.m6.d1:ocMA.OdeS9C33.incipit	@ltx/gr_gr_cog/oc.m6.d1:ocMA.OdeS9C33.incipit
ltx/gr_redirects_goarch/oc.m6.d1:ocMA.OdeS9C33.melody	@ltx/gr_gr_cog/oc.m6.d1:ocMA.OdeS9C33.melody
ltx/gr_redirects_goarch/oc.m6.d1:ocMA.OdeS9C33.mode	@ltx/gr_gr_cog/oc.m6.d1:ocMA.OdeS9C33.mode
ltx/gr_redirects_goarch/oc.m6.d1:ocMA.OdeS9C33.ode	@ltx/gr_gr_cog/oc.m6.d1:ocMA.OdeS9C33.ode
ltx/gr_redirects_goarch/oc.m6.d1:ocMA.OdeS9C33.text	@ltx/gr_gr_cog/oc.m6.d1:ocMA.OdeS9C33.text
ltx/gr_redirects_goarch/oc.m6.d1:ocMA.OdeS9C34.incipit	@ltx/gr_gr_cog/oc.m6.d1:ocMA.OdeS9C34.incipit
ltx/gr_redirects_goarch/oc.m6.d1:ocMA.OdeS9C34.melody	@ltx/gr_gr_cog/oc.m6.d1:ocMA.OdeS9C34.melody
ltx/gr_redirects_goarch/oc.m6.d1:ocMA.OdeS9C34.mode	@ltx/gr_gr_cog/oc.m6.d1:ocMA.OdeS9C34.mode
ltx/gr_redirects_goarch/oc.m6.d1:ocMA.OdeS9C34.ode	@ltx/gr_gr_cog/oc.m6.d1:ocMA.OdeS9C34.ode
ltx/gr_redirects_goarch/oc.m6.d1:ocMA.OdeS9C34.text	@ltx/gr_gr_cog/oc.m6.d1:ocMA.OdeS9C34.text
ltx/gr_redirects_goarch/oc.m6.d1:ocMA.Oikos.incipit	@ltx/gr_gr_cog/oc.m6.d1:ocMA.Oikos.incipit
ltx/gr_redirects_goarch/oc.m6.d1:ocMA.Oikos.mode	@ltx/gr_gr_cog/oc.m6.d1:ocMA.Oikos.mode
ltx/gr_redirects_goarch/oc.m6.d1:ocMA.Oikos.text	@ltx/gr_gr_cog/oc.m6.d1:ocMA.Oikos.text
ltx/gr_redirects_goarch/oc.m6.d1:ocMO.Kathisma11.greekmelody	@ltx/gr_gr_cog/oc.m6.d1:ocMO.Kathisma11.greekmelody
ltx/gr_redirects_goarch/oc.m6.d1:ocMO.Kathisma11.incipit	@ltx/gr_gr_cog/oc.m6.d1:ocMO.Kathisma11.incipit
ltx/gr_redirects_goarch/oc.m6.d1:ocMO.Kathisma11.melody	@ltx/gr_gr_cog/oc.m6.d1:ocMO.Kathisma11.melody
ltx/gr_redirects_goarch/oc.m6.d1:ocMO.Kathisma11.mode	@ltx/gr_gr_cog/oc.m6.d1:ocMO.Kathisma11.mode
ltx/gr_redirects_goarch/oc.m6.d1:ocMO.Kathisma11.text	@ltx/gr_gr_cog/oc.m6.d1:ocMO.Kathisma11.text
ltx/gr_redirects_goarch/oc.m6.d1:ocMO.Kathisma12.incipit	@ltx/gr_gr_cog/oc.m6.d1:ocMO.Kathisma12.incipit
ltx/gr_redirects_goarch/oc.m6.d1:ocMO.Kathisma12.melody	@ltx/gr_gr_cog/oc.m6.d1:ocMO.Kathisma12.melody
ltx/gr_redirects_goarch/oc.m6.d1:ocMO.Kathisma12.mode	@ltx/gr_gr_cog/oc.m6.d1:ocMO.Kathisma12.mode
ltx/gr_redirects_goarch/oc.m6.d1:ocMO.Kathisma12.text	@ltx/gr_gr_cog/oc.m6.d1:ocMO.Kathisma12.text
ltx/gr_redirects_goarch/oc.m6.d1:ocMO.Kathisma21.greekmelody	@ltx/gr_gr_cog/oc.m6.d1:ocMO.Kathisma21.greekmelody
ltx/gr_redirects_goarch/oc.m6.d1:ocMO.Kathisma21.incipit	@ltx/gr_gr_cog/oc.m6.d1:ocMO.Kathisma21.incipit
ltx/gr_redirects_goarch/oc.m6.d1:ocMO.Kathisma21.melody	@ltx/gr_gr_cog/oc.m6.d1:ocMO.Kathisma21.melody
ltx/gr_redirects_goarch/oc.m6.d1:ocMO.Kathisma21.mode	@ltx/gr_gr_cog/oc.m6.d1:ocMO.Kathisma21.mode
ltx/gr_redirects_goarch/oc.m6.d1:ocMO.Kathisma21.text	@ltx/gr_gr_cog/oc.m6.d1:ocMO.Kathisma21.text
ltx/gr_redirects_goarch/oc.m6.d1:ocMO.Kathisma22.incipit	@ltx/gr_gr_cog/oc.m6.d1:ocMO.Kathisma22.incipit
ltx/gr_redirects_goarch/oc.m6.d1:ocMO.Kathisma22.melody	@ltx/gr_gr_cog/oc.m6.d1:ocMO.Kathisma22.melody
ltx/gr_redirects_goarch/oc.m6.d1:ocMO.Kathisma22.mode	@ltx/gr_gr_cog/oc.m6.d1:ocMO.Kathisma22.mode
ltx/gr_redirects_goarch/oc.m6.d1:ocMO.Kathisma22.text	@ltx/gr_gr_cog/oc.m6.d1:ocMO.Kathisma22.text
ltx/gr_redirects_goarch/oc.m6.d1:ocMO.Ode11.greekmelody	@ltx/gr_gr_cog/oc.m6.d1:ocMO.Ode11.greekmelody
ltx/gr_redirects_goarch/oc.m6.d1:ocMO.Ode11.incipit	@ltx/gr_gr_cog/oc.m6.d1:ocMO.Ode11.incipit
ltx/gr_redirects_goarch/oc.m6.d1:ocMO.Ode11.melody	@ltx/gr_gr_cog/oc.m6.d1:ocMO.Ode11.melody
ltx/gr_redirects_goarch/oc.m6.d1:ocMO.Ode11.mode	@ltx/gr_gr_cog/oc.m6.d1:ocMO.Ode11.mode
ltx/gr_redirects_goarch/oc.m6.d1:ocMO.Ode11.ode	@ltx/gr_gr_cog/oc.m6.d1:ocMO.Ode11.ode
ltx/gr_redirects_goarch/oc.m6.d1:ocMO.Ode11.text	@ltx/gr_gr_cog/oc.m6.d1:ocMO.Ode11.text
ltx/gr_redirects_goarch/oc.m6.d1:ocMO.Ode12.incipit	@ltx/gr_gr_cog/oc.m6.d1:ocMO.Ode12.incipit
ltx/gr_redirects_goarch/oc.m6.d1:ocMO.Ode12.melody	@ltx/gr_gr_cog/oc.m6.d1:ocMO.Ode12.melody
ltx/gr_redirects_goarch/oc.m6.d1:ocMO.Ode12.mode	@ltx/gr_gr_cog/oc.m6.d1:ocMO.Ode12.mode
ltx/gr_redirects_goarch/oc.m6.d1:ocMO.Ode12.ode	@ltx/gr_gr_cog/oc.m6.d1:ocMO.Ode12.ode
ltx/gr_redirects_goarch/oc.m6.d1:ocMO.Ode12.text	@ltx/gr_gr_cog/oc.m6.d1:ocMO.Ode12.text
ltx/gr_redirects_goarch/oc.m6.d1:ocMO.Ode13.incipit	@ltx/gr_gr_cog/oc.m6.d1:ocMO.Ode13.incipit
ltx/gr_redirects_goarch/oc.m6.d1:ocMO.Ode13.melody	@ltx/gr_gr_cog/oc.m6.d1:ocMO.Ode13.melody
ltx/gr_redirects_goarch/oc.m6.d1:ocMO.Ode13.mode	@ltx/gr_gr_cog/oc.m6.d1:ocMO.Ode13.mode
ltx/gr_redirects_goarch/oc.m6.d1:ocMO.Ode13.ode	@ltx/gr_gr_cog/oc.m6.d1:ocMO.Ode13.ode
ltx/gr_redirects_goarch/oc.m6.d1:ocMO.Ode13.text	@ltx/gr_gr_cog/oc.m6.d1:ocMO.Ode13.text
ltx/gr_redirects_goarch/oc.m6.d1:ocMO.Ode1T.incipit	@ltx/gr_gr_cog/oc.m6.d1:ocMO.Ode1T.incipit
ltx/gr_redirects_goarch/oc.m6.d1:ocMO.Ode1T.melody	@ltx/gr_gr_cog/oc.m6.d1:ocMO.Ode1T.melody
ltx/gr_redirects_goarch/oc.m6.d1:ocMO.Ode1T.mode	@ltx/gr_gr_cog/oc.m6.d1:ocMO.Ode1T.mode
ltx/gr_redirects_goarch/oc.m6.d1:ocMO.Ode1T.ode	@ltx/gr_gr_cog/oc.m6.d1:ocMO.Ode1T.ode
ltx/gr_redirects_goarch/oc.m6.d1:ocMO.Ode1T.text	@ltx/gr_gr_cog/oc.m6.d1:ocMO.Ode1T.text
ltx/gr_redirects_goarch/oc.m6.d1:ocMO.Ode31.greekmelody	@ltx/gr_gr_cog/oc.m6.d1:ocMO.Ode31.greekmelody
ltx/gr_redirects_goarch/oc.m6.d1:ocMO.Ode31.incipit	@ltx/gr_gr_cog/oc.m6.d1:ocMO.Ode31.incipit
ltx/gr_redirects_goarch/oc.m6.d1:ocMO.Ode31.melody	@ltx/gr_gr_cog/oc.m6.d1:ocMO.Ode31.melody
ltx/gr_redirects_goarch/oc.m6.d1:ocMO.Ode31.mode	@ltx/gr_gr_cog/oc.m6.d1:ocMO.Ode31.mode
ltx/gr_redirects_goarch/oc.m6.d1:ocMO.Ode31.ode	@ltx/gr_gr_cog/oc.m6.d1:ocMO.Ode31.ode
ltx/gr_redirects_goarch/oc.m6.d1:ocMO.Ode31.text	@ltx/gr_gr_cog/oc.m6.d1:ocMO.Ode31.text
ltx/gr_redirects_goarch/oc.m6.d1:ocMO.Ode32.incipit	@ltx/gr_gr_cog/oc.m6.d1:ocMO.Ode32.incipit
ltx/gr_redirects_goarch/oc.m6.d1:ocMO.Ode32.melody	@ltx/gr_gr_cog/oc.m6.d1:ocMO.Ode32.melody
ltx/gr_redirects_goarch/oc.m6.d1:ocMO.Ode32.mode	@ltx/gr_gr_cog/oc.m6.d1:ocMO.Ode32.mode
ltx/gr_redirects_goarch/oc.m6.d1:ocMO.Ode32.ode	@ltx/gr_gr_cog/oc.m6.d1:ocMO.Ode32.ode
ltx/gr_redirects_goarch/oc.m6.d1:ocMO.Ode32.text	@ltx/gr_gr_cog/oc.m6.d1:ocMO.Ode32.text
ltx/gr_redirects_goarch/oc.m6.d1:ocMO.Ode33.incipit	@ltx/gr_gr_cog/oc.m6.d1:ocMO.Ode33.incipit
ltx/gr_redirects_goarch/oc.m6.d1:ocMO.Ode33.melody	@ltx/gr_gr_cog/oc.m6.d1:ocMO.Ode33.melody
ltx/gr_redirects_goarch/oc.m6.d1:ocMO.Ode33.mode	@ltx/gr_gr_cog/oc.m6.d1:ocMO.Ode33.mode
ltx/gr_redirects_goarch/oc.m6.d1:ocMO.Ode33.ode	@ltx/gr_gr_cog/oc.m6.d1:ocMO.Ode33.ode
ltx/gr_redirects_goarch/oc.m6.d1:ocMO.Ode33.text	@ltx/gr_gr_cog/oc.m6.d1:ocMO.Ode33.text
ltx/gr_redirects_goarch/oc.m6.d1:ocMO.Ode3T.incipit	@ltx/gr_gr_cog/oc.m6.d1:ocMO.Ode3T.incipit
ltx/gr_redirects_goarch/oc.m6.d1:ocMO.Ode3T.melody	@ltx/gr_gr_cog/oc.m6.d1:ocMO.Ode3T.melody
ltx/gr_redirects_goarch/oc.m6.d1:ocMO.Ode3T.mode	@ltx/gr_gr_cog/oc.m6.d1:ocMO.Ode3T.mode
ltx/gr_redirects_goarch/oc.m6.d1:ocMO.Ode3T.ode	@ltx/gr_gr_cog/oc.m6.d1:ocMO.Ode3T.ode
ltx/gr_redirects_goarch/oc.m6.d1:ocMO.Ode3T.text	@ltx/gr_gr_cog/oc.m6.d1:ocMO.Ode3T.text
ltx/gr_redirects_goarch/oc.m6.d1:ocMO.Ode41.greekmelody	@ltx/gr_gr_cog/oc.m6.d1:ocMO.Ode41.greekmelody
ltx/gr_redirects_goarch/oc.m6.d1:ocMO.Ode41.incipit	@ltx/gr_gr_cog/oc.m6.d1:ocMO.Ode41.incipit
ltx/gr_redirects_goarch/oc.m6.d1:ocMO.Ode41.melody	@ltx/gr_gr_cog/oc.m6.d1:ocMO.Ode41.melody
ltx/gr_redirects_goarch/oc.m6.d1:ocMO.Ode41.mode	@ltx/gr_gr_cog/oc.m6.d1:ocMO.Ode41.mode
ltx/gr_redirects_goarch/oc.m6.d1:ocMO.Ode41.ode	@ltx/gr_gr_cog/oc.m6.d1:ocMO.Ode41.ode
ltx/gr_redirects_goarch/oc.m6.d1:ocMO.Ode41.text	@ltx/gr_gr_cog/oc.m6.d1:ocMO.Ode41.text
ltx/gr_redirects_goarch/oc.m6.d1:ocMO.Ode42.incipit	@ltx/gr_gr_cog/oc.m6.d1:ocMO.Ode42.incipit
ltx/gr_redirects_goarch/oc.m6.d1:ocMO.Ode42.melody	@ltx/gr_gr_cog/oc.m6.d1:ocMO.Ode42.melody
ltx/gr_redirects_goarch/oc.m6.d1:ocMO.Ode42.mode	@ltx/gr_gr_cog/oc.m6.d1:ocMO.Ode42.mode
ltx/gr_redirects_goarch/oc.m6.d1:ocMO.Ode42.ode	@ltx/gr_gr_cog/oc.m6.d1:ocMO.Ode42.ode
ltx/gr_redirects_goarch/oc.m6.d1:ocMO.Ode42.text	@ltx/gr_gr_cog/oc.m6.d1:ocMO.Ode42.text
ltx/gr_redirects_goarch/oc.m6.d1:ocMO.Ode43.incipit	@ltx/gr_gr_cog/oc.m6.d1:ocMO.Ode43.incipit
ltx/gr_redirects_goarch/oc.m6.d1:ocMO.Ode43.melody	@ltx/gr_gr_cog/oc.m6.d1:ocMO.Ode43.melody
ltx/gr_redirects_goarch/oc.m6.d1:ocMO.Ode43.mode	@ltx/gr_gr_cog/oc.m6.d1:ocMO.Ode43.mode
ltx/gr_redirects_goarch/oc.m6.d1:ocMO.Ode43.ode	@ltx/gr_gr_cog/oc.m6.d1:ocMO.Ode43.ode
ltx/gr_redirects_goarch/oc.m6.d1:ocMO.Ode43.text	@ltx/gr_gr_cog/oc.m6.d1:ocMO.Ode43.text
ltx/gr_redirects_goarch/oc.m6.d1:ocMO.Ode4T.incipit	@ltx/gr_gr_cog/oc.m6.d1:ocMO.Ode4T.incipit
ltx/gr_redirects_goarch/oc.m6.d1:ocMO.Ode4T.melody	@ltx/gr_gr_cog/oc.m6.d1:ocMO.Ode4T.melody
ltx/gr_redirects_goarch/oc.m6.d1:ocMO.Ode4T.mode	@ltx/gr_gr_cog/oc.m6.d1:ocMO.Ode4T.mode
ltx/gr_redirects_goarch/oc.m6.d1:ocMO.Ode4T.ode	@ltx/gr_gr_cog/oc.m6.d1:ocMO.Ode4T.ode
ltx/gr_redirects_goarch/oc.m6.d1:ocMO.Ode4T.text	@ltx/gr_gr_cog/oc.m6.d1:ocMO.Ode4T.text
ltx/gr_redirects_goarch/oc.m6.d1:ocMO.Ode51.greekmelody	@ltx/gr_gr_cog/oc.m6.d1:ocMO.Ode51.greekmelody
ltx/gr_redirects_goarch/oc.m6.d1:ocMO.Ode51.incipit	@ltx/gr_gr_cog/oc.m6.d1:ocMO.Ode51.incipit
ltx/gr_redirects_goarch/oc.m6.d1:ocMO.Ode51.melody	@ltx/gr_gr_cog/oc.m6.d1:ocMO.Ode51.melody
ltx/gr_redirects_goarch/oc.m6.d1:ocMO.Ode51.mode	@ltx/gr_gr_cog/oc.m6.d1:ocMO.Ode51.mode
ltx/gr_redirects_goarch/oc.m6.d1:ocMO.Ode51.ode	@ltx/gr_gr_cog/oc.m6.d1:ocMO.Ode51.ode
ltx/gr_redirects_goarch/oc.m6.d1:ocMO.Ode51.text	@ltx/gr_gr_cog/oc.m6.d1:ocMO.Ode51.text
ltx/gr_redirects_goarch/oc.m6.d1:ocMO.Ode52.incipit	@ltx/gr_gr_cog/oc.m6.d1:ocMO.Ode52.incipit
ltx/gr_redirects_goarch/oc.m6.d1:ocMO.Ode52.melody	@ltx/gr_gr_cog/oc.m6.d1:ocMO.Ode52.melody
ltx/gr_redirects_goarch/oc.m6.d1:ocMO.Ode52.mode	@ltx/gr_gr_cog/oc.m6.d1:ocMO.Ode52.mode
ltx/gr_redirects_goarch/oc.m6.d1:ocMO.Ode52.ode	@ltx/gr_gr_cog/oc.m6.d1:ocMO.Ode52.ode
ltx/gr_redirects_goarch/oc.m6.d1:ocMO.Ode52.text	@ltx/gr_gr_cog/oc.m6.d1:ocMO.Ode52.text
ltx/gr_redirects_goarch/oc.m6.d1:ocMO.Ode53.incipit	@ltx/gr_gr_cog/oc.m6.d1:ocMO.Ode53.incipit
ltx/gr_redirects_goarch/oc.m6.d1:ocMO.Ode53.melody	@ltx/gr_gr_cog/oc.m6.d1:ocMO.Ode53.melody
ltx/gr_redirects_goarch/oc.m6.d1:ocMO.Ode53.mode	@ltx/gr_gr_cog/oc.m6.d1:ocMO.Ode53.mode
ltx/gr_redirects_goarch/oc.m6.d1:ocMO.Ode53.ode	@ltx/gr_gr_cog/oc.m6.d1:ocMO.Ode53.ode
ltx/gr_redirects_goarch/oc.m6.d1:ocMO.Ode53.text	@ltx/gr_gr_cog/oc.m6.d1:ocMO.Ode53.text
ltx/gr_redirects_goarch/oc.m6.d1:ocMO.Ode5T.incipit	@ltx/gr_gr_cog/oc.m6.d1:ocMO.Ode5T.incipit
ltx/gr_redirects_goarch/oc.m6.d1:ocMO.Ode5T.melody	@ltx/gr_gr_cog/oc.m6.d1:ocMO.Ode5T.melody
ltx/gr_redirects_goarch/oc.m6.d1:ocMO.Ode5T.mode	@ltx/gr_gr_cog/oc.m6.d1:ocMO.Ode5T.mode
ltx/gr_redirects_goarch/oc.m6.d1:ocMO.Ode5T.ode	@ltx/gr_gr_cog/oc.m6.d1:ocMO.Ode5T.ode
ltx/gr_redirects_goarch/oc.m6.d1:ocMO.Ode5T.text	@ltx/gr_gr_cog/oc.m6.d1:ocMO.Ode5T.text
ltx/gr_redirects_goarch/oc.m6.d1:ocMO.Ode61.greekmelody	@ltx/gr_gr_cog/oc.m6.d1:ocMO.Ode61.greekmelody
ltx/gr_redirects_goarch/oc.m6.d1:ocMO.Ode61.incipit	@ltx/gr_gr_cog/oc.m6.d1:ocMO.Ode61.incipit
ltx/gr_redirects_goarch/oc.m6.d1:ocMO.Ode61.melody	@ltx/gr_gr_cog/oc.m6.d1:ocMO.Ode61.melody
ltx/gr_redirects_goarch/oc.m6.d1:ocMO.Ode61.mode	@ltx/gr_gr_cog/oc.m6.d1:ocMO.Ode61.mode
ltx/gr_redirects_goarch/oc.m6.d1:ocMO.Ode61.ode	@ltx/gr_gr_cog/oc.m6.d1:ocMO.Ode61.ode
ltx/gr_redirects_goarch/oc.m6.d1:ocMO.Ode61.text	@ltx/gr_gr_cog/oc.m6.d1:ocMO.Ode61.text
ltx/gr_redirects_goarch/oc.m6.d1:ocMO.Ode62.incipit	@ltx/gr_gr_cog/oc.m6.d1:ocMO.Ode62.incipit
ltx/gr_redirects_goarch/oc.m6.d1:ocMO.Ode62.melody	@ltx/gr_gr_cog/oc.m6.d1:ocMO.Ode62.melody
ltx/gr_redirects_goarch/oc.m6.d1:ocMO.Ode62.mode	@ltx/gr_gr_cog/oc.m6.d1:ocMO.Ode62.mode
ltx/gr_redirects_goarch/oc.m6.d1:ocMO.Ode62.ode	@ltx/gr_gr_cog/oc.m6.d1:ocMO.Ode62.ode
ltx/gr_redirects_goarch/oc.m6.d1:ocMO.Ode62.text	@ltx/gr_gr_cog/oc.m6.d1:ocMO.Ode62.text
ltx/gr_redirects_goarch/oc.m6.d1:ocMO.Ode6T.incipit	@ltx/gr_gr_cog/oc.m6.d1:ocMO.Ode6T.incipit
ltx/gr_redirects_goarch/oc.m6.d1:ocMO.Ode6T.melody	@ltx/gr_gr_cog/oc.m6.d1:ocMO.Ode6T.melody
ltx/gr_redirects_goarch/oc.m6.d1:ocMO.Ode6T.mode	@ltx/gr_gr_cog/oc.m6.d1:ocMO.Ode6T.mode
ltx/gr_redirects_goarch/oc.m6.d1:ocMO.Ode6T.ode	@ltx/gr_gr_cog/oc.m6.d1:ocMO.Ode6T.ode
ltx/gr_redirects_goarch/oc.m6.d1:ocMO.Ode6T.text	@ltx/gr_gr_cog/oc.m6.d1:ocMO.Ode6T.text
ltx/gr_redirects_goarch/oc.m6.d1:ocMO.Ode71.greekmelody	@ltx/gr_gr_cog/oc.m6.d1:ocMO.Ode71.greekmelody
ltx/gr_redirects_goarch/oc.m6.d1:ocMO.Ode71.incipit	@ltx/gr_gr_cog/oc.m6.d1:ocMO.Ode71.incipit
ltx/gr_redirects_goarch/oc.m6.d1:ocMO.Ode71.melody	@ltx/gr_gr_cog/oc.m6.d1:ocMO.Ode71.melody
ltx/gr_redirects_goarch/oc.m6.d1:ocMO.Ode71.mode	@ltx/gr_gr_cog/oc.m6.d1:ocMO.Ode71.mode
ltx/gr_redirects_goarch/oc.m6.d1:ocMO.Ode71.ode	@ltx/gr_gr_cog/oc.m6.d1:ocMO.Ode71.ode
ltx/gr_redirects_goarch/oc.m6.d1:ocMO.Ode71.text	@ltx/gr_gr_cog/oc.m6.d1:ocMO.Ode71.text
ltx/gr_redirects_goarch/oc.m6.d1:ocMO.Ode72.incipit	@ltx/gr_gr_cog/oc.m6.d1:ocMO.Ode72.incipit
ltx/gr_redirects_goarch/oc.m6.d1:ocMO.Ode72.melody	@ltx/gr_gr_cog/oc.m6.d1:ocMO.Ode72.melody
ltx/gr_redirects_goarch/oc.m6.d1:ocMO.Ode72.mode	@ltx/gr_gr_cog/oc.m6.d1:ocMO.Ode72.mode
ltx/gr_redirects_goarch/oc.m6.d1:ocMO.Ode72.ode	@ltx/gr_gr_cog/oc.m6.d1:ocMO.Ode72.ode
ltx/gr_redirects_goarch/oc.m6.d1:ocMO.Ode72.text	@ltx/gr_gr_cog/oc.m6.d1:ocMO.Ode72.text
ltx/gr_redirects_goarch/oc.m6.d1:ocMO.Ode73.incipit	@ltx/gr_gr_cog/oc.m6.d1:ocMO.Ode73.incipit
ltx/gr_redirects_goarch/oc.m6.d1:ocMO.Ode73.melody	@ltx/gr_gr_cog/oc.m6.d1:ocMO.Ode73.melody
ltx/gr_redirects_goarch/oc.m6.d1:ocMO.Ode73.mode	@ltx/gr_gr_cog/oc.m6.d1:ocMO.Ode73.mode
ltx/gr_redirects_goarch/oc.m6.d1:ocMO.Ode73.ode	@ltx/gr_gr_cog/oc.m6.d1:ocMO.Ode73.ode
ltx/gr_redirects_goarch/oc.m6.d1:ocMO.Ode73.text	@ltx/gr_gr_cog/oc.m6.d1:ocMO.Ode73.text
ltx/gr_redirects_goarch/oc.m6.d1:ocMO.Ode7T.incipit	@ltx/gr_gr_cog/oc.m6.d1:ocMO.Ode7T.incipit
ltx/gr_redirects_goarch/oc.m6.d1:ocMO.Ode7T.melody	@ltx/gr_gr_cog/oc.m6.d1:ocMO.Ode7T.melody
ltx/gr_redirects_goarch/oc.m6.d1:ocMO.Ode7T.mode	@ltx/gr_gr_cog/oc.m6.d1:ocMO.Ode7T.mode
ltx/gr_redirects_goarch/oc.m6.d1:ocMO.Ode7T.ode	@ltx/gr_gr_cog/oc.m6.d1:ocMO.Ode7T.ode
ltx/gr_redirects_goarch/oc.m6.d1:ocMO.Ode7T.text	@ltx/gr_gr_cog/oc.m6.d1:ocMO.Ode7T.text
ltx/gr_redirects_goarch/oc.m6.d1:ocMO.Ode81.greekmelody	@ltx/gr_gr_cog/oc.m6.d1:ocMO.Ode81.greekmelody
ltx/gr_redirects_goarch/oc.m6.d1:ocMO.Ode81.incipit	@ltx/gr_gr_cog/oc.m6.d1:ocMO.Ode81.incipit
ltx/gr_redirects_goarch/oc.m6.d1:ocMO.Ode81.melody	@ltx/gr_gr_cog/oc.m6.d1:ocMO.Ode81.melody
ltx/gr_redirects_goarch/oc.m6.d1:ocMO.Ode81.mode	@ltx/gr_gr_cog/oc.m6.d1:ocMO.Ode81.mode
ltx/gr_redirects_goarch/oc.m6.d1:ocMO.Ode81.ode	@ltx/gr_gr_cog/oc.m6.d1:ocMO.Ode81.ode
ltx/gr_redirects_goarch/oc.m6.d1:ocMO.Ode81.text	@ltx/gr_gr_cog/oc.m6.d1:ocMO.Ode81.text
ltx/gr_redirects_goarch/oc.m6.d1:ocMO.Ode82.incipit	@ltx/gr_gr_cog/oc.m6.d1:ocMO.Ode82.incipit
ltx/gr_redirects_goarch/oc.m6.d1:ocMO.Ode82.melody	@ltx/gr_gr_cog/oc.m6.d1:ocMO.Ode82.melody
ltx/gr_redirects_goarch/oc.m6.d1:ocMO.Ode82.mode	@ltx/gr_gr_cog/oc.m6.d1:ocMO.Ode82.mode
ltx/gr_redirects_goarch/oc.m6.d1:ocMO.Ode82.ode	@ltx/gr_gr_cog/oc.m6.d1:ocMO.Ode82.ode
ltx/gr_redirects_goarch/oc.m6.d1:ocMO.Ode82.text	@ltx/gr_gr_cog/oc.m6.d1:ocMO.Ode82.text
ltx/gr_redirects_goarch/oc.m6.d1:ocMO.Ode83.incipit	@ltx/gr_gr_cog/oc.m6.d1:ocMO.Ode83.incipit
ltx/gr_redirects_goarch/oc.m6.d1:ocMO.Ode83.melody	@ltx/gr_gr_cog/oc.m6.d1:ocMO.Ode83.melody
ltx/gr_redirects_goarch/oc.m6.d1:ocMO.Ode83.mode	@ltx/gr_gr_cog/oc.m6.d1:ocMO.Ode83.mode
ltx/gr_redirects_goarch/oc.m6.d1:ocMO.Ode83.ode	@ltx/gr_gr_cog/oc.m6.d1:ocMO.Ode83.ode
ltx/gr_redirects_goarch/oc.m6.d1:ocMO.Ode83.text	@ltx/gr_gr_cog/oc.m6.d1:ocMO.Ode83.text
ltx/gr_redirects_goarch/oc.m6.d1:ocMO.Ode8T.incipit	@ltx/gr_gr_cog/oc.m6.d1:ocMO.Ode8T.incipit
ltx/gr_redirects_goarch/oc.m6.d1:ocMO.Ode8T.melody	@ltx/gr_gr_cog/oc.m6.d1:ocMO.Ode8T.melody
ltx/gr_redirects_goarch/oc.m6.d1:ocMO.Ode8T.mode	@ltx/gr_gr_cog/oc.m6.d1:ocMO.Ode8T.mode
ltx/gr_redirects_goarch/oc.m6.d1:ocMO.Ode8T.ode	@ltx/gr_gr_cog/oc.m6.d1:ocMO.Ode8T.ode
ltx/gr_redirects_goarch/oc.m6.d1:ocMO.Ode8T.text	@ltx/gr_gr_cog/oc.m6.d1:ocMO.Ode8T.text
ltx/gr_redirects_goarch/oc.m6.d1:ocMO.Ode91.greekmelody	@ltx/gr_gr_cog/oc.m6.d1:ocMO.Ode91.greekmelody
ltx/gr_redirects_goarch/oc.m6.d1:ocMO.Ode91.incipit	@ltx/gr_gr_cog/oc.m6.d1:ocMO.Ode91.incipit
ltx/gr_redirects_goarch/oc.m6.d1:ocMO.Ode91.melody	@ltx/gr_gr_cog/oc.m6.d1:ocMO.Ode91.melody
ltx/gr_redirects_goarch/oc.m6.d1:ocMO.Ode91.mode	@ltx/gr_gr_cog/oc.m6.d1:ocMO.Ode91.mode
ltx/gr_redirects_goarch/oc.m6.d1:ocMO.Ode91.ode	@ltx/gr_gr_cog/oc.m6.d1:ocMO.Ode91.ode
ltx/gr_redirects_goarch/oc.m6.d1:ocMO.Ode91.text	@ltx/gr_gr_cog/oc.m6.d1:ocMO.Ode91.text
ltx/gr_redirects_goarch/oc.m6.d1:ocMO.Ode92.incipit	@ltx/gr_gr_cog/oc.m6.d1:ocMO.Ode92.incipit
ltx/gr_redirects_goarch/oc.m6.d1:ocMO.Ode92.melody	@ltx/gr_gr_cog/oc.m6.d1:ocMO.Ode92.melody
ltx/gr_redirects_goarch/oc.m6.d1:ocMO.Ode92.mode	@ltx/gr_gr_cog/oc.m6.d1:ocMO.Ode92.mode
ltx/gr_redirects_goarch/oc.m6.d1:ocMO.Ode92.ode	@ltx/gr_gr_cog/oc.m6.d1:ocMO.Ode92.ode
ltx/gr_redirects_goarch/oc.m6.d1:ocMO.Ode92.text	@ltx/gr_gr_cog/oc.m6.d1:ocMO.Ode92.text
ltx/gr_redirects_goarch/oc.m6.d1:ocMO.Ode93.incipit	@ltx/gr_gr_cog/oc.m6.d1:ocMO.Ode93.incipit
ltx/gr_redirects_goarch/oc.m6.d1:ocMO.Ode93.melody	@ltx/gr_gr_cog/oc.m6.d1:ocMO.Ode93.melody
ltx/gr_redirects_goarch/oc.m6.d1:ocMO.Ode93.mode	@ltx/gr_gr_cog/oc.m6.d1:ocMO.Ode93.mode
ltx/gr_redirects_goarch/oc.m6.d1:ocMO.Ode93.ode	@ltx/gr_gr_cog/oc.m6.d1:ocMO.Ode93.ode
ltx/gr_redirects_goarch/oc.m6.d1:ocMO.Ode93.text	@ltx/gr_gr_cog/oc.m6.d1:ocMO.Ode93.text
ltx/gr_redirects_goarch/oc.m6.d1:ocMO.Ode9T.incipit	@ltx/gr_gr_cog/oc.m6.d1:ocMO.Ode9T.incipit
ltx/gr_redirects_goarch/oc.m6.d1:ocMO.Ode9T.melody	@ltx/gr_gr_cog/oc.m6.d1:ocMO.Ode9T.melody
ltx/gr_redirects_goarch/oc.m6.d1:ocMO.Ode9T.mode	@ltx/gr_gr_cog/oc.m6.d1:ocMO.Ode9T.mode
ltx/gr_redirects_goarch/oc.m6.d1:ocMO.Ode9T.ode	@ltx/gr_gr_cog/oc.m6.d1:ocMO.Ode9T.ode
ltx/gr_redirects_goarch/oc.m6.d1:ocMO.Ode9T.text	@ltx/gr_gr_cog/oc.m6.d1:ocMO.Ode9T.text
ltx/gr_redirects_goarch/oc.m6.d1:ocMO.acrostic.notice	@ltx/gr_gr_cog/oc.m6.d1:ocMO.acrostic.notice
ltx/gr_redirects_goarch/oc.m6.d1:ocMO.acrostic.text	@ltx/gr_gr_cog/oc.m6.d1:ocMO.acrostic.text
ltx/gr_redirects_goarch/oc.m6.d1:ocMO.poet	@ltx/gr_gr_cog/oc.m6.d1:ocMO.poet
ltx/gr_redirects_goarch/oc.m6.d1:ocMO.title	@ltx/gr_gr_cog/oc.m6.d1:ocMO.title
ltx/gr_redirects_goarch/oc.m6.d1:ocSV.AposDogmatic.incipit	@ltx/gr_gr_cog/oc.m6.d1:ocSV.AposDogmatic.incipit
ltx/gr_redirects_goarch/oc.m6.d1:ocSV.AposDogmatic.melody	@ltx/gr_gr_cog/oc.m6.d1:ocSV.AposDogmatic.melody
ltx/gr_redirects_goarch/oc.m6.d1:ocSV.AposDogmatic.mode	@ltx/gr_gr_cog/oc.m6.d1:ocSV.AposDogmatic.mode
ltx/gr_redirects_goarch/oc.m6.d1:ocSV.AposDogmatic.text	@ltx/gr_gr_cog/oc.m6.d1:ocSV.AposDogmatic.text
ltx/gr_redirects_goarch/oc.m6.d1:ocSV.Aposticha1.incipit	@ltx/gr_gr_cog/oc.m6.d1:ocSV.Aposticha1.incipit
ltx/gr_redirects_goarch/oc.m6.d1:ocSV.Aposticha1.melody	@ltx/gr_gr_cog/oc.m6.d1:ocSV.Aposticha1.melody
ltx/gr_redirects_goarch/oc.m6.d1:ocSV.Aposticha1.mode	@ltx/gr_gr_cog/oc.m6.d1:ocSV.Aposticha1.mode
ltx/gr_redirects_goarch/oc.m6.d1:ocSV.Aposticha1.text	@ltx/gr_gr_cog/oc.m6.d1:ocSV.Aposticha1.text
ltx/gr_redirects_goarch/oc.m6.d1:ocSV.Aposticha2.incipit	@ltx/gr_gr_cog/oc.m6.d1:ocSV.Aposticha2.incipit
ltx/gr_redirects_goarch/oc.m6.d1:ocSV.Aposticha2.melody	@ltx/gr_gr_cog/oc.m6.d1:ocSV.Aposticha2.melody
ltx/gr_redirects_goarch/oc.m6.d1:ocSV.Aposticha2.mode	@ltx/gr_gr_cog/oc.m6.d1:ocSV.Aposticha2.mode
ltx/gr_redirects_goarch/oc.m6.d1:ocSV.Aposticha2.text	@ltx/gr_gr_cog/oc.m6.d1:ocSV.Aposticha2.text
ltx/gr_redirects_goarch/oc.m6.d1:ocSV.Aposticha3.incipit	@ltx/gr_gr_cog/oc.m6.d1:ocSV.Aposticha3.incipit
ltx/gr_redirects_goarch/oc.m6.d1:ocSV.Aposticha3.melody	@ltx/gr_gr_cog/oc.m6.d1:ocSV.Aposticha3.melody
ltx/gr_redirects_goarch/oc.m6.d1:ocSV.Aposticha3.mode	@ltx/gr_gr_cog/oc.m6.d1:ocSV.Aposticha3.mode
ltx/gr_redirects_goarch/oc.m6.d1:ocSV.Aposticha3.text	@ltx/gr_gr_cog/oc.m6.d1:ocSV.Aposticha3.text
ltx/gr_redirects_goarch/oc.m6.d1:ocSV.Dogmatic.incipit	@ltx/gr_gr_cog/oc.m6.d1:ocSV.Dogmatic.incipit
ltx/gr_redirects_goarch/oc.m6.d1:ocSV.Dogmatic.melody	@ltx/gr_gr_cog/oc.m6.d1:ocSV.Dogmatic.melody
ltx/gr_redirects_goarch/oc.m6.d1:ocSV.Dogmatic.mode	@ltx/gr_gr_cog/oc.m6.d1:ocSV.Dogmatic.mode
ltx/gr_redirects_goarch/oc.m6.d1:ocSV.Dogmatic.text	@ltx/gr_gr_cog/oc.m6.d1:ocSV.Dogmatic.text
ltx/gr_redirects_goarch/oc.m6.d1:ocVE.ApolTheotokionVM.incipit	@ltx/gr_gr_cog/oc.m6.d1:ocVE.ApolTheotokionVM.incipit
ltx/gr_redirects_goarch/oc.m6.d1:ocVE.ApolTheotokionVM.melody	@ltx/gr_gr_cog/oc.m6.d1:ocVE.ApolTheotokionVM.melody
ltx/gr_redirects_goarch/oc.m6.d1:ocVE.ApolTheotokionVM.mode	@ltx/gr_gr_cog/oc.m6.d1:ocVE.ApolTheotokionVM.mode
ltx/gr_redirects_goarch/oc.m6.d1:ocVE.ApolTheotokionVM.text	@ltx/gr_gr_cog/oc.m6.d1:ocVE.ApolTheotokionVM.text
ltx/gr_redirects_goarch/oc.m6.d1:ocVE.Apolytikion.incipit	@ltx/gr_gr_cog/oc.m6.d1:ocVE.Apolytikion.incipit
ltx/gr_redirects_goarch/oc.m6.d1:ocVE.Apolytikion.melody	@ltx/gr_gr_cog/oc.m6.d1:ocVE.Apolytikion.melody
ltx/gr_redirects_goarch/oc.m6.d1:ocVE.Apolytikion.mode	@ltx/gr_gr_cog/oc.m6.d1:ocVE.Apolytikion.mode
ltx/gr_redirects_goarch/oc.m6.d1:ocVE.Apolytikion.text	@ltx/gr_gr_cog/oc.m6.d1:ocVE.Apolytikion.text
ltx/gr_redirects_goarch/oc.m6.d1:ocVE.AposTheotokion.incipit	@ltx/gr_gr_cog/oc.m6.d1:ocVE.AposTheotokion.incipit
ltx/gr_redirects_goarch/oc.m6.d1:ocVE.AposTheotokion.melody	@ltx/gr_gr_cog/oc.m6.d1:ocVE.AposTheotokion.melody
ltx/gr_redirects_goarch/oc.m6.d1:ocVE.AposTheotokion.mode	@ltx/gr_gr_cog/oc.m6.d1:ocVE.AposTheotokion.mode
ltx/gr_redirects_goarch/oc.m6.d1:ocVE.AposTheotokion.text	@ltx/gr_gr_cog/oc.m6.d1:ocVE.AposTheotokion.text
ltx/gr_redirects_goarch/oc.m6.d1:ocVE.Aposticha1.incipit	@ltx/gr_gr_cog/oc.m6.d1:ocVE.Aposticha1.incipit
ltx/gr_redirects_goarch/oc.m6.d1:ocVE.Aposticha1.melody	@ltx/gr_gr_cog/oc.m6.d1:ocVE.Aposticha1.melody
ltx/gr_redirects_goarch/oc.m6.d1:ocVE.Aposticha1.mode	@ltx/gr_gr_cog/oc.m6.d1:ocVE.Aposticha1.mode
ltx/gr_redirects_goarch/oc.m6.d1:ocVE.Aposticha1.text	@ltx/gr_gr_cog/oc.m6.d1:ocVE.Aposticha1.text
ltx/gr_redirects_goarch/oc.m6.d1:ocVE.Aposticha2.incipit	@ltx/gr_gr_cog/oc.m6.d1:ocVE.Aposticha2.incipit
ltx/gr_redirects_goarch/oc.m6.d1:ocVE.Aposticha2.melody	@ltx/gr_gr_cog/oc.m6.d1:ocVE.Aposticha2.melody
ltx/gr_redirects_goarch/oc.m6.d1:ocVE.Aposticha2.mode	@ltx/gr_gr_cog/oc.m6.d1:ocVE.Aposticha2.mode
ltx/gr_redirects_goarch/oc.m6.d1:ocVE.Aposticha2.text	@ltx/gr_gr_cog/oc.m6.d1:ocVE.Aposticha2.text
ltx/gr_redirects_goarch/oc.m6.d1:ocVE.Aposticha3.incipit	@ltx/gr_gr_cog/oc.m6.d1:ocVE.Aposticha3.incipit
ltx/gr_redirects_goarch/oc.m6.d1:ocVE.Aposticha3.melody	@ltx/gr_gr_cog/oc.m6.d1:ocVE.Aposticha3.melody
ltx/gr_redirects_goarch/oc.m6.d1:ocVE.Aposticha3.mode	@ltx/gr_gr_cog/oc.m6.d1:ocVE.Aposticha3.mode
ltx/gr_redirects_goarch/oc.m6.d1:ocVE.Aposticha3.text	@ltx/gr_gr_cog/oc.m6.d1:ocVE.Aposticha3.text
ltx/gr_redirects_goarch/oc.m6.d1:ocVE.Aposticha4.incipit	@ltx/gr_gr_cog/oc.m6.d1:ocVE.Aposticha4.incipit
ltx/gr_redirects_goarch/oc.m6.d1:ocVE.Aposticha4.melody	@ltx/gr_gr_cog/oc.m6.d1:ocVE.Aposticha4.melody
ltx/gr_redirects_goarch/oc.m6.d1:ocVE.Aposticha4.mode	@ltx/gr_gr_cog/oc.m6.d1:ocVE.Aposticha4.mode
ltx/gr_redirects_goarch/oc.m6.d1:ocVE.Aposticha4.text	@ltx/gr_gr_cog/oc.m6.d1:ocVE.Aposticha4.text
ltx/gr_redirects_goarch/oc.m6.d1:ocVE.MM.LIHC1.text	@ltx/gr_gr_cog/oc.m6.d1:ocVE.MM.LIHC1.text
ltx/gr_redirects_goarch/oc.m6.d1:ocVE.MM.LIHC2.text	@ltx/gr_gr_cog/oc.m6.d1:ocVE.MM.LIHC2.text
ltx/gr_redirects_goarch/oc.m6.d1:ocVE.MM.Stichologia.text	@ltx/gr_gr_cog/oc.m6.d1:ocVE.MM.Stichologia.text
ltx/gr_redirects_goarch/oc.m6.d1:ocVE.SticTheotokion.incipit	@ltx/gr_gr_cog/oc.m6.d1:ocVE.SticTheotokion.incipit
ltx/gr_redirects_goarch/oc.m6.d1:ocVE.SticTheotokion.melody	@ltx/gr_gr_cog/oc.m6.d1:ocVE.SticTheotokion.melody
ltx/gr_redirects_goarch/oc.m6.d1:ocVE.SticTheotokion.mode	@ltx/gr_gr_cog/oc.m6.d1:ocVE.SticTheotokion.mode
ltx/gr_redirects_goarch/oc.m6.d1:ocVE.SticTheotokion.text	@ltx/gr_gr_cog/oc.m6.d1:ocVE.SticTheotokion.text
ltx/gr_redirects_goarch/oc.m6.d1:ocVE.Stichera1.incipit	@ltx/gr_gr_cog/oc.m6.d1:ocVE.Stichera1.incipit
ltx/gr_redirects_goarch/oc.m6.d1:ocVE.Stichera1.melody	@ltx/gr_gr_cog/oc.m6.d1:ocVE.Stichera1.melody
ltx/gr_redirects_goarch/oc.m6.d1:ocVE.Stichera1.mode	@ltx/gr_gr_cog/oc.m6.d1:ocVE.Stichera1.mode
ltx/gr_redirects_goarch/oc.m6.d1:ocVE.Stichera1.text	@ltx/gr_gr_cog/oc.m6.d1:ocVE.Stichera1.text
ltx/gr_redirects_goarch/oc.m6.d1:ocVE.Stichera2.incipit	@ltx/gr_gr_cog/oc.m6.d1:ocVE.Stichera2.incipit
ltx/gr_redirects_goarch/oc.m6.d1:ocVE.Stichera2.melody	@ltx/gr_gr_cog/oc.m6.d1:ocVE.Stichera2.melody
ltx/gr_redirects_goarch/oc.m6.d1:ocVE.Stichera2.mode	@ltx/gr_gr_cog/oc.m6.d1:ocVE.Stichera2.mode
ltx/gr_redirects_goarch/oc.m6.d1:ocVE.Stichera2.text	@ltx/gr_gr_cog/oc.m6.d1:ocVE.Stichera2.text
ltx/gr_redirects_goarch/oc.m6.d1:ocVE.Stichera3.incipit	@ltx/gr_gr_cog/oc.m6.d1:ocVE.Stichera3.incipit
ltx/gr_redirects_goarch/oc.m6.d1:ocVE.Stichera3.melody	@ltx/gr_gr_cog/oc.m6.d1:ocVE.Stichera3.melody
ltx/gr_redirects_goarch/oc.m6.d1:ocVE.Stichera3.mode	@ltx/gr_gr_cog/oc.m6.d1:ocVE.Stichera3.mode
ltx/gr_redirects_goarch/oc.m6.d1:ocVE.Stichera3.text	@ltx/gr_gr_cog/oc.m6.d1:ocVE.Stichera3.text
ltx/gr_redirects_goarch/oc.m6.d1:ocVE.Stichera4.incipit	@ltx/gr_gr_cog/oc.m6.d1:ocVE.Stichera4.incipit
ltx/gr_redirects_goarch/oc.m6.d1:ocVE.Stichera4.melody	@ltx/gr_gr_cog/oc.m6.d1:ocVE.Stichera4.melody
ltx/gr_redirects_goarch/oc.m6.d1:ocVE.Stichera4.mode	@ltx/gr_gr_cog/oc.m6.d1:ocVE.Stichera4.mode
ltx/gr_redirects_goarch/oc.m6.d1:ocVE.Stichera4.text	@ltx/gr_gr_cog/oc.m6.d1:ocVE.Stichera4.text
ltx/gr_redirects_goarch/oc.m6.d1:ocVE.Stichera5.incipit	@ltx/gr_gr_cog/oc.m6.d1:ocVE.Stichera5.incipit
ltx/gr_redirects_goarch/oc.m6.d1:ocVE.Stichera5.melody	@ltx/gr_gr_cog/oc.m6.d1:ocVE.Stichera5.melody
ltx/gr_redirects_goarch/oc.m6.d1:ocVE.Stichera5.mode	@ltx/gr_gr_cog/oc.m6.d1:ocVE.Stichera5.mode
ltx/gr_redirects_goarch/oc.m6.d1:ocVE.Stichera5.text	@ltx/gr_gr_cog/oc.m6.d1:ocVE.Stichera5.text
ltx/gr_redirects_goarch/oc.m6.d1:ocVE.Stichera6.incipit	@ltx/gr_gr_cog/oc.m6.d1:ocVE.Stichera6.incipit
ltx/gr_redirects_goarch/oc.m6.d1:ocVE.Stichera6.melody	@ltx/gr_gr_cog/oc.m6.d1:ocVE.Stichera6.melody
ltx/gr_redirects_goarch/oc.m6.d1:ocVE.Stichera6.mode	@ltx/gr_gr_cog/oc.m6.d1:ocVE.Stichera6.mode
ltx/gr_redirects_goarch/oc.m6.d1:ocVE.Stichera6.text	@ltx/gr_gr_cog/oc.m6.d1:ocVE.Stichera6.text
ltx/gr_redirects_goarch/oc.m6.d1:ocVE.Stichera7.incipit	@ltx/gr_gr_cog/oc.m6.d1:ocVE.Stichera7.incipit
ltx/gr_redirects_goarch/oc.m6.d1:ocVE.Stichera7.melody	@ltx/gr_gr_cog/oc.m6.d1:ocVE.Stichera7.melody
ltx/gr_redirects_goarch/oc.m6.d1:ocVE.Stichera7.mode	@ltx/gr_gr_cog/oc.m6.d1:ocVE.Stichera7.mode
ltx/gr_redirects_goarch/oc.m6.d1:ocVE.Stichera7.text	@ltx/gr_gr_cog/oc.m6.d1:ocVE.Stichera7.text
