ltx/gr_redirects_goarch/me.m12.d13:meDA.commemoration.first	@ltx/gr_gr_cog/me.m12.d13:meDA.commemoration.first
ltx/gr_redirects_goarch/me.m12.d13:meDA.commemoration.first_name	@ltx/gr_gr_cog/me.m12.d13:meDA.commemoration.first_name
ltx/gr_redirects_goarch/me.m12.d13:meDA.commemoration.first_short	@ltx/gr_gr_cog/me.m12.d13:meDA.commemoration.first_short
ltx/gr_redirects_goarch/me.m12.d13:meDA.commemoration.first_title	@ltx/gr_gr_cog/me.m12.d13:meDA.commemoration.first_title
ltx/gr_redirects_goarch/me.m12.d13:meDA.commemoration.full	@ltx/gr_gr_cog/me.m12.d13:meDA.commemoration.full
ltx/gr_redirects_goarch/me.m12.d13:meDA.commemoration.second_name	@ltx/gr_gr_cog/me.m12.d13:meDA.commemoration.second_name
ltx/gr_redirects_goarch/me.m12.d13:meDA.commemoration.second_title	@ltx/gr_gr_cog/me.m12.d13:meDA.commemoration.second_title
ltx/gr_redirects_goarch/me.m12.d13:meDA.date	@ltx/gr_gr_cog/me.m12.d13:meDA.date
ltx/gr_redirects_goarch/me.m12.d13:meDA.fordate	@ltx/gr_gr_cog/me.m12.d13:meDA.fordate
ltx/gr_redirects_goarch/me.m12.d13:meDA.insert1	@ltx/gr_gr_cog/me.m12.d13:meDA.insert1
ltx/gr_redirects_goarch/me.m12.d13:meDA.insert2	@ltx/gr_gr_cog/me.m12.d13:meDA.insert2
ltx/gr_redirects_goarch/me.m12.d13:meDA.note	@ltx/gr_gr_cog/me.m12.d13:meDA.note
ltx/gr_redirects_goarch/me.m12.d13:meDA.pdfcoverdate	@ltx/gr_gr_cog/me.m12.d13:meDA.pdfcoverdate
ltx/gr_redirects_goarch/me.m12.d13:meDA.pdfheaderdate	@ltx/gr_gr_cog/me.m12.d13:meDA.pdfheaderdate
ltx/gr_redirects_goarch/me.m12.d13:meHO.commemorations	@ltx/gr_gr_cog/me.m12.d13:meHO.commemorations
ltx/gr_redirects_goarch/me.m12.d13:meHO.note1	@ltx/gr_gr_cog/me.m12.d13:meHO.note1
ltx/gr_redirects_goarch/me.m12.d13:meHO.note2	@ltx/gr_gr_cog/me.m12.d13:meHO.note2
ltx/gr_redirects_goarch/me.m12.d13:meHO.number	@ltx/gr_gr_cog/me.m12.d13:meHO.number
ltx/gr_redirects_goarch/me.m12.d13:meHO.rank	@ltx/gr_gr_cog/me.m12.d13:meHO.rank
ltx/gr_redirects_goarch/me.m12.d13:meLE.commemoration1	@ltx/gr_gr_cog/me.m12.d13:meLE.commemoration1
ltx/gr_redirects_goarch/me.m12.d13:meLE.commemoration2	@ltx/gr_gr_cog/me.m12.d13:meLE.commemoration2
ltx/gr_redirects_goarch/me.m12.d13:meLI.Kontakion1.greekmelody	@ltx/gr_gr_cog/me.m12.d13:meLI.Kontakion1.greekmelody
ltx/gr_redirects_goarch/me.m12.d13:meLI.Kontakion1.incipit	@ltx/gr_gr_cog/me.m12.d13:meLI.Kontakion1.incipit
ltx/gr_redirects_goarch/me.m12.d13:meLI.Kontakion1.melody	@ltx/gr_gr_cog/me.m12.d13:meLI.Kontakion1.melody
ltx/gr_redirects_goarch/me.m12.d13:meLI.Kontakion1.mode	@ltx/gr_gr_cog/me.m12.d13:meLI.Kontakion1.mode
ltx/gr_redirects_goarch/me.m12.d13:meLI.Kontakion1.text	@ltx/gr_gr_cog/me.m12.d13:meLI.Kontakion1.text
ltx/gr_redirects_goarch/me.m12.d13:meLI.Megalynarion.text	@ltx/gr_gr_cog/me.m12.d13:meLI.Megalynarion.text
ltx/gr_redirects_goarch/me.m12.d13:meMA.AposGlory.incipit	@ltx/gr_gr_cog/me.m12.d13:meMA.AposGlory.incipit
ltx/gr_redirects_goarch/me.m12.d13:meMA.AposGlory.melody	@ltx/gr_gr_cog/me.m12.d13:meMA.AposGlory.melody
ltx/gr_redirects_goarch/me.m12.d13:meMA.AposGlory.mode	@ltx/gr_gr_cog/me.m12.d13:meMA.AposGlory.mode
ltx/gr_redirects_goarch/me.m12.d13:meMA.AposGlory.poet	@ltx/gr_gr_cog/me.m12.d13:meMA.AposGlory.poet
ltx/gr_redirects_goarch/me.m12.d13:meMA.AposGlory.text	@ltx/gr_gr_cog/me.m12.d13:meMA.AposGlory.text
ltx/gr_redirects_goarch/me.m12.d13:meMA.AposStavrotheotokion.greekmelody	@ltx/gr_gr_cog/me.m12.d13:meMA.AposStavrotheotokion.greekmelody
ltx/gr_redirects_goarch/me.m12.d13:meMA.AposStavrotheotokion.incipit	@ltx/gr_gr_cog/me.m12.d13:meMA.AposStavrotheotokion.incipit
ltx/gr_redirects_goarch/me.m12.d13:meMA.AposStavrotheotokion.melody	@ltx/gr_gr_cog/me.m12.d13:meMA.AposStavrotheotokion.melody
ltx/gr_redirects_goarch/me.m12.d13:meMA.AposStavrotheotokion.mode	@ltx/gr_gr_cog/me.m12.d13:meMA.AposStavrotheotokion.mode
ltx/gr_redirects_goarch/me.m12.d13:meMA.AposStavrotheotokion.text	@ltx/gr_gr_cog/me.m12.d13:meMA.AposStavrotheotokion.text
ltx/gr_redirects_goarch/me.m12.d13:meMA.AposTheotokion.greekmelody	@ltx/gr_gr_cog/me.m12.d13:meMA.AposTheotokion.greekmelody
ltx/gr_redirects_goarch/me.m12.d13:meMA.AposTheotokion.incipit	@ltx/gr_gr_cog/me.m12.d13:meMA.AposTheotokion.incipit
ltx/gr_redirects_goarch/me.m12.d13:meMA.AposTheotokion.melody	@ltx/gr_gr_cog/me.m12.d13:meMA.AposTheotokion.melody
ltx/gr_redirects_goarch/me.m12.d13:meMA.AposTheotokion.mode	@ltx/gr_gr_cog/me.m12.d13:meMA.AposTheotokion.mode
ltx/gr_redirects_goarch/me.m12.d13:meMA.AposTheotokion.text	@ltx/gr_gr_cog/me.m12.d13:meMA.AposTheotokion.text
ltx/gr_redirects_goarch/me.m12.d13:meMA.C1.poet	@ltx/gr_gr_cog/me.m12.d13:meMA.C1.poet
ltx/gr_redirects_goarch/me.m12.d13:meMA.C1.title	@ltx/gr_gr_cog/me.m12.d13:meMA.C1.title
ltx/gr_redirects_goarch/me.m12.d13:meMA.C1.verse	@ltx/gr_gr_cog/me.m12.d13:meMA.C1.verse
ltx/gr_redirects_goarch/me.m12.d13:meMA.ExapTheotokion.incipit	@ltx/gr_gr_cog/me.m12.d13:meMA.ExapTheotokion.incipit
ltx/gr_redirects_goarch/me.m12.d13:meMA.ExapTheotokion.melody	@ltx/gr_gr_cog/me.m12.d13:meMA.ExapTheotokion.melody
ltx/gr_redirects_goarch/me.m12.d13:meMA.ExapTheotokion.mode	@ltx/gr_gr_cog/me.m12.d13:meMA.ExapTheotokion.mode
ltx/gr_redirects_goarch/me.m12.d13:meMA.ExapTheotokion.text	@ltx/gr_gr_cog/me.m12.d13:meMA.ExapTheotokion.text
ltx/gr_redirects_goarch/me.m12.d13:meMA.Exaposteilarion1.greekmelody	@ltx/gr_gr_cog/me.m12.d13:meMA.Exaposteilarion1.greekmelody
ltx/gr_redirects_goarch/me.m12.d13:meMA.Exaposteilarion1.incipit	@ltx/gr_gr_cog/me.m12.d13:meMA.Exaposteilarion1.incipit
ltx/gr_redirects_goarch/me.m12.d13:meMA.Exaposteilarion1.melody	@ltx/gr_gr_cog/me.m12.d13:meMA.Exaposteilarion1.melody
ltx/gr_redirects_goarch/me.m12.d13:meMA.Exaposteilarion1.mode	@ltx/gr_gr_cog/me.m12.d13:meMA.Exaposteilarion1.mode
ltx/gr_redirects_goarch/me.m12.d13:meMA.Exaposteilarion1.text	@ltx/gr_gr_cog/me.m12.d13:meMA.Exaposteilarion1.text
ltx/gr_redirects_goarch/me.m12.d13:meMA.Kontakion1.greekmelody	@ltx/gr_gr_cog/me.m12.d13:meMA.Kontakion1.greekmelody
ltx/gr_redirects_goarch/me.m12.d13:meMA.Kontakion1.incipit	@ltx/gr_gr_cog/me.m12.d13:meMA.Kontakion1.incipit
ltx/gr_redirects_goarch/me.m12.d13:meMA.Kontakion1.melody	@ltx/gr_gr_cog/me.m12.d13:meMA.Kontakion1.melody
ltx/gr_redirects_goarch/me.m12.d13:meMA.Kontakion1.mode	@ltx/gr_gr_cog/me.m12.d13:meMA.Kontakion1.mode
ltx/gr_redirects_goarch/me.m12.d13:meMA.Kontakion1.text	@ltx/gr_gr_cog/me.m12.d13:meMA.Kontakion1.text
ltx/gr_redirects_goarch/me.m12.d13:meMA.Lauds1.incipit	@ltx/gr_gr_cog/me.m12.d13:meMA.Lauds1.incipit
ltx/gr_redirects_goarch/me.m12.d13:meMA.Lauds1.melody	@ltx/gr_gr_cog/me.m12.d13:meMA.Lauds1.melody
ltx/gr_redirects_goarch/me.m12.d13:meMA.Lauds1.mode	@ltx/gr_gr_cog/me.m12.d13:meMA.Lauds1.mode
ltx/gr_redirects_goarch/me.m12.d13:meMA.Lauds1.poet	@ltx/gr_gr_cog/me.m12.d13:meMA.Lauds1.poet
ltx/gr_redirects_goarch/me.m12.d13:meMA.Lauds1.text	@ltx/gr_gr_cog/me.m12.d13:meMA.Lauds1.text
ltx/gr_redirects_goarch/me.m12.d13:meMA.Lauds2.incipit	@ltx/gr_gr_cog/me.m12.d13:meMA.Lauds2.incipit
ltx/gr_redirects_goarch/me.m12.d13:meMA.Lauds2.melody	@ltx/gr_gr_cog/me.m12.d13:meMA.Lauds2.melody
ltx/gr_redirects_goarch/me.m12.d13:meMA.Lauds2.mode	@ltx/gr_gr_cog/me.m12.d13:meMA.Lauds2.mode
ltx/gr_redirects_goarch/me.m12.d13:meMA.Lauds2.poet	@ltx/gr_gr_cog/me.m12.d13:meMA.Lauds2.poet
ltx/gr_redirects_goarch/me.m12.d13:meMA.Lauds2.text	@ltx/gr_gr_cog/me.m12.d13:meMA.Lauds2.text
ltx/gr_redirects_goarch/me.m12.d13:meMA.Lauds3.incipit	@ltx/gr_gr_cog/me.m12.d13:meMA.Lauds3.incipit
ltx/gr_redirects_goarch/me.m12.d13:meMA.Lauds3.melody	@ltx/gr_gr_cog/me.m12.d13:meMA.Lauds3.melody
ltx/gr_redirects_goarch/me.m12.d13:meMA.Lauds3.mode	@ltx/gr_gr_cog/me.m12.d13:meMA.Lauds3.mode
ltx/gr_redirects_goarch/me.m12.d13:meMA.Lauds3.poet	@ltx/gr_gr_cog/me.m12.d13:meMA.Lauds3.poet
ltx/gr_redirects_goarch/me.m12.d13:meMA.Lauds3.text	@ltx/gr_gr_cog/me.m12.d13:meMA.Lauds3.text
ltx/gr_redirects_goarch/me.m12.d13:meMA.Lauds4.incipit	@ltx/gr_gr_cog/me.m12.d13:meMA.Lauds4.incipit
ltx/gr_redirects_goarch/me.m12.d13:meMA.Lauds4.melody	@ltx/gr_gr_cog/me.m12.d13:meMA.Lauds4.melody
ltx/gr_redirects_goarch/me.m12.d13:meMA.Lauds4.mode	@ltx/gr_gr_cog/me.m12.d13:meMA.Lauds4.mode
ltx/gr_redirects_goarch/me.m12.d13:meMA.Lauds4.poet	@ltx/gr_gr_cog/me.m12.d13:meMA.Lauds4.poet
ltx/gr_redirects_goarch/me.m12.d13:meMA.Lauds4.text	@ltx/gr_gr_cog/me.m12.d13:meMA.Lauds4.text
ltx/gr_redirects_goarch/me.m12.d13:meMA.LaudsGlory.incipit	@ltx/gr_gr_cog/me.m12.d13:meMA.LaudsGlory.incipit
ltx/gr_redirects_goarch/me.m12.d13:meMA.LaudsGlory.melody	@ltx/gr_gr_cog/me.m12.d13:meMA.LaudsGlory.melody
ltx/gr_redirects_goarch/me.m12.d13:meMA.LaudsGlory.mode	@ltx/gr_gr_cog/me.m12.d13:meMA.LaudsGlory.mode
ltx/gr_redirects_goarch/me.m12.d13:meMA.LaudsGlory.poet	@ltx/gr_gr_cog/me.m12.d13:meMA.LaudsGlory.poet
ltx/gr_redirects_goarch/me.m12.d13:meMA.LaudsGlory.text	@ltx/gr_gr_cog/me.m12.d13:meMA.LaudsGlory.text
ltx/gr_redirects_goarch/me.m12.d13:meMA.LaudsStavrotheotokion.greekmelody	@ltx/gr_gr_cog/me.m12.d13:meMA.LaudsStavrotheotokion.greekmelody
ltx/gr_redirects_goarch/me.m12.d13:meMA.LaudsStavrotheotokion.incipit	@ltx/gr_gr_cog/me.m12.d13:meMA.LaudsStavrotheotokion.incipit
ltx/gr_redirects_goarch/me.m12.d13:meMA.LaudsStavrotheotokion.melody	@ltx/gr_gr_cog/me.m12.d13:meMA.LaudsStavrotheotokion.melody
ltx/gr_redirects_goarch/me.m12.d13:meMA.LaudsStavrotheotokion.mode	@ltx/gr_gr_cog/me.m12.d13:meMA.LaudsStavrotheotokion.mode
ltx/gr_redirects_goarch/me.m12.d13:meMA.LaudsStavrotheotokion.text	@ltx/gr_gr_cog/me.m12.d13:meMA.LaudsStavrotheotokion.text
ltx/gr_redirects_goarch/me.m12.d13:meMA.LaudsTheotokion.greekmelody	@ltx/gr_gr_cog/me.m12.d13:meMA.LaudsTheotokion.greekmelody
ltx/gr_redirects_goarch/me.m12.d13:meMA.LaudsTheotokion.incipit	@ltx/gr_gr_cog/me.m12.d13:meMA.LaudsTheotokion.incipit
ltx/gr_redirects_goarch/me.m12.d13:meMA.LaudsTheotokion.melody	@ltx/gr_gr_cog/me.m12.d13:meMA.LaudsTheotokion.melody
ltx/gr_redirects_goarch/me.m12.d13:meMA.LaudsTheotokion.mode	@ltx/gr_gr_cog/me.m12.d13:meMA.LaudsTheotokion.mode
ltx/gr_redirects_goarch/me.m12.d13:meMA.LaudsTheotokion.text	@ltx/gr_gr_cog/me.m12.d13:meMA.LaudsTheotokion.text
ltx/gr_redirects_goarch/me.m12.d13:meMA.Ode1C11.greekmelody	@ltx/gr_gr_cog/me.m12.d13:meMA.Ode1C11.greekmelody
ltx/gr_redirects_goarch/me.m12.d13:meMA.Ode1C11.incipit	@ltx/gr_gr_cog/me.m12.d13:meMA.Ode1C11.incipit
ltx/gr_redirects_goarch/me.m12.d13:meMA.Ode1C11.melody	@ltx/gr_gr_cog/me.m12.d13:meMA.Ode1C11.melody
ltx/gr_redirects_goarch/me.m12.d13:meMA.Ode1C11.mode	@ltx/gr_gr_cog/me.m12.d13:meMA.Ode1C11.mode
ltx/gr_redirects_goarch/me.m12.d13:meMA.Ode1C11.ode	@ltx/gr_gr_cog/me.m12.d13:meMA.Ode1C11.ode
ltx/gr_redirects_goarch/me.m12.d13:meMA.Ode1C11.text	@ltx/gr_gr_cog/me.m12.d13:meMA.Ode1C11.text
ltx/gr_redirects_goarch/me.m12.d13:meMA.Ode1C12.incipit	@ltx/gr_gr_cog/me.m12.d13:meMA.Ode1C12.incipit
ltx/gr_redirects_goarch/me.m12.d13:meMA.Ode1C12.melody	@ltx/gr_gr_cog/me.m12.d13:meMA.Ode1C12.melody
ltx/gr_redirects_goarch/me.m12.d13:meMA.Ode1C12.mode	@ltx/gr_gr_cog/me.m12.d13:meMA.Ode1C12.mode
ltx/gr_redirects_goarch/me.m12.d13:meMA.Ode1C12.ode	@ltx/gr_gr_cog/me.m12.d13:meMA.Ode1C12.ode
ltx/gr_redirects_goarch/me.m12.d13:meMA.Ode1C12.text	@ltx/gr_gr_cog/me.m12.d13:meMA.Ode1C12.text
ltx/gr_redirects_goarch/me.m12.d13:meMA.Ode1C13.incipit	@ltx/gr_gr_cog/me.m12.d13:meMA.Ode1C13.incipit
ltx/gr_redirects_goarch/me.m12.d13:meMA.Ode1C13.melody	@ltx/gr_gr_cog/me.m12.d13:meMA.Ode1C13.melody
ltx/gr_redirects_goarch/me.m12.d13:meMA.Ode1C13.mode	@ltx/gr_gr_cog/me.m12.d13:meMA.Ode1C13.mode
ltx/gr_redirects_goarch/me.m12.d13:meMA.Ode1C13.ode	@ltx/gr_gr_cog/me.m12.d13:meMA.Ode1C13.ode
ltx/gr_redirects_goarch/me.m12.d13:meMA.Ode1C13.text	@ltx/gr_gr_cog/me.m12.d13:meMA.Ode1C13.text
ltx/gr_redirects_goarch/me.m12.d13:meMA.Ode1C14.incipit	@ltx/gr_gr_cog/me.m12.d13:meMA.Ode1C14.incipit
ltx/gr_redirects_goarch/me.m12.d13:meMA.Ode1C14.melody	@ltx/gr_gr_cog/me.m12.d13:meMA.Ode1C14.melody
ltx/gr_redirects_goarch/me.m12.d13:meMA.Ode1C14.mode	@ltx/gr_gr_cog/me.m12.d13:meMA.Ode1C14.mode
ltx/gr_redirects_goarch/me.m12.d13:meMA.Ode1C14.ode	@ltx/gr_gr_cog/me.m12.d13:meMA.Ode1C14.ode
ltx/gr_redirects_goarch/me.m12.d13:meMA.Ode1C14.text	@ltx/gr_gr_cog/me.m12.d13:meMA.Ode1C14.text
ltx/gr_redirects_goarch/me.m12.d13:meMA.Ode1C15.incipit	@ltx/gr_gr_cog/me.m12.d13:meMA.Ode1C15.incipit
ltx/gr_redirects_goarch/me.m12.d13:meMA.Ode1C15.melody	@ltx/gr_gr_cog/me.m12.d13:meMA.Ode1C15.melody
ltx/gr_redirects_goarch/me.m12.d13:meMA.Ode1C15.mode	@ltx/gr_gr_cog/me.m12.d13:meMA.Ode1C15.mode
ltx/gr_redirects_goarch/me.m12.d13:meMA.Ode1C15.ode	@ltx/gr_gr_cog/me.m12.d13:meMA.Ode1C15.ode
ltx/gr_redirects_goarch/me.m12.d13:meMA.Ode1C15.text	@ltx/gr_gr_cog/me.m12.d13:meMA.Ode1C15.text
ltx/gr_redirects_goarch/me.m12.d13:meMA.Ode1C1T.incipit	@ltx/gr_gr_cog/me.m12.d13:meMA.Ode1C1T.incipit
ltx/gr_redirects_goarch/me.m12.d13:meMA.Ode1C1T.melody	@ltx/gr_gr_cog/me.m12.d13:meMA.Ode1C1T.melody
ltx/gr_redirects_goarch/me.m12.d13:meMA.Ode1C1T.mode	@ltx/gr_gr_cog/me.m12.d13:meMA.Ode1C1T.mode
ltx/gr_redirects_goarch/me.m12.d13:meMA.Ode1C1T.ode	@ltx/gr_gr_cog/me.m12.d13:meMA.Ode1C1T.ode
ltx/gr_redirects_goarch/me.m12.d13:meMA.Ode1C1T.text	@ltx/gr_gr_cog/me.m12.d13:meMA.Ode1C1T.text
ltx/gr_redirects_goarch/me.m12.d13:meMA.Ode3C11.greekmelody	@ltx/gr_gr_cog/me.m12.d13:meMA.Ode3C11.greekmelody
ltx/gr_redirects_goarch/me.m12.d13:meMA.Ode3C11.incipit	@ltx/gr_gr_cog/me.m12.d13:meMA.Ode3C11.incipit
ltx/gr_redirects_goarch/me.m12.d13:meMA.Ode3C11.melody	@ltx/gr_gr_cog/me.m12.d13:meMA.Ode3C11.melody
ltx/gr_redirects_goarch/me.m12.d13:meMA.Ode3C11.mode	@ltx/gr_gr_cog/me.m12.d13:meMA.Ode3C11.mode
ltx/gr_redirects_goarch/me.m12.d13:meMA.Ode3C11.ode	@ltx/gr_gr_cog/me.m12.d13:meMA.Ode3C11.ode
ltx/gr_redirects_goarch/me.m12.d13:meMA.Ode3C11.text	@ltx/gr_gr_cog/me.m12.d13:meMA.Ode3C11.text
ltx/gr_redirects_goarch/me.m12.d13:meMA.Ode3C12.incipit	@ltx/gr_gr_cog/me.m12.d13:meMA.Ode3C12.incipit
ltx/gr_redirects_goarch/me.m12.d13:meMA.Ode3C12.melody	@ltx/gr_gr_cog/me.m12.d13:meMA.Ode3C12.melody
ltx/gr_redirects_goarch/me.m12.d13:meMA.Ode3C12.mode	@ltx/gr_gr_cog/me.m12.d13:meMA.Ode3C12.mode
ltx/gr_redirects_goarch/me.m12.d13:meMA.Ode3C12.ode	@ltx/gr_gr_cog/me.m12.d13:meMA.Ode3C12.ode
ltx/gr_redirects_goarch/me.m12.d13:meMA.Ode3C12.text	@ltx/gr_gr_cog/me.m12.d13:meMA.Ode3C12.text
ltx/gr_redirects_goarch/me.m12.d13:meMA.Ode3C13.incipit	@ltx/gr_gr_cog/me.m12.d13:meMA.Ode3C13.incipit
ltx/gr_redirects_goarch/me.m12.d13:meMA.Ode3C13.melody	@ltx/gr_gr_cog/me.m12.d13:meMA.Ode3C13.melody
ltx/gr_redirects_goarch/me.m12.d13:meMA.Ode3C13.mode	@ltx/gr_gr_cog/me.m12.d13:meMA.Ode3C13.mode
ltx/gr_redirects_goarch/me.m12.d13:meMA.Ode3C13.ode	@ltx/gr_gr_cog/me.m12.d13:meMA.Ode3C13.ode
ltx/gr_redirects_goarch/me.m12.d13:meMA.Ode3C13.text	@ltx/gr_gr_cog/me.m12.d13:meMA.Ode3C13.text
ltx/gr_redirects_goarch/me.m12.d13:meMA.Ode3C14.incipit	@ltx/gr_gr_cog/me.m12.d13:meMA.Ode3C14.incipit
ltx/gr_redirects_goarch/me.m12.d13:meMA.Ode3C14.melody	@ltx/gr_gr_cog/me.m12.d13:meMA.Ode3C14.melody
ltx/gr_redirects_goarch/me.m12.d13:meMA.Ode3C14.mode	@ltx/gr_gr_cog/me.m12.d13:meMA.Ode3C14.mode
ltx/gr_redirects_goarch/me.m12.d13:meMA.Ode3C14.ode	@ltx/gr_gr_cog/me.m12.d13:meMA.Ode3C14.ode
ltx/gr_redirects_goarch/me.m12.d13:meMA.Ode3C14.text	@ltx/gr_gr_cog/me.m12.d13:meMA.Ode3C14.text
ltx/gr_redirects_goarch/me.m12.d13:meMA.Ode3C15.incipit	@ltx/gr_gr_cog/me.m12.d13:meMA.Ode3C15.incipit
ltx/gr_redirects_goarch/me.m12.d13:meMA.Ode3C15.melody	@ltx/gr_gr_cog/me.m12.d13:meMA.Ode3C15.melody
ltx/gr_redirects_goarch/me.m12.d13:meMA.Ode3C15.mode	@ltx/gr_gr_cog/me.m12.d13:meMA.Ode3C15.mode
ltx/gr_redirects_goarch/me.m12.d13:meMA.Ode3C15.ode	@ltx/gr_gr_cog/me.m12.d13:meMA.Ode3C15.ode
ltx/gr_redirects_goarch/me.m12.d13:meMA.Ode3C15.text	@ltx/gr_gr_cog/me.m12.d13:meMA.Ode3C15.text
ltx/gr_redirects_goarch/me.m12.d13:meMA.Ode3C1T.incipit	@ltx/gr_gr_cog/me.m12.d13:meMA.Ode3C1T.incipit
ltx/gr_redirects_goarch/me.m12.d13:meMA.Ode3C1T.melody	@ltx/gr_gr_cog/me.m12.d13:meMA.Ode3C1T.melody
ltx/gr_redirects_goarch/me.m12.d13:meMA.Ode3C1T.mode	@ltx/gr_gr_cog/me.m12.d13:meMA.Ode3C1T.mode
ltx/gr_redirects_goarch/me.m12.d13:meMA.Ode3C1T.ode	@ltx/gr_gr_cog/me.m12.d13:meMA.Ode3C1T.ode
ltx/gr_redirects_goarch/me.m12.d13:meMA.Ode3C1T.text	@ltx/gr_gr_cog/me.m12.d13:meMA.Ode3C1T.text
ltx/gr_redirects_goarch/me.m12.d13:meMA.Ode3H.greekmelody	@ltx/gr_gr_cog/me.m12.d13:meMA.Ode3H.greekmelody
ltx/gr_redirects_goarch/me.m12.d13:meMA.Ode3H.incipit	@ltx/gr_gr_cog/me.m12.d13:meMA.Ode3H.incipit
ltx/gr_redirects_goarch/me.m12.d13:meMA.Ode3H.melody	@ltx/gr_gr_cog/me.m12.d13:meMA.Ode3H.melody
ltx/gr_redirects_goarch/me.m12.d13:meMA.Ode3H.mode	@ltx/gr_gr_cog/me.m12.d13:meMA.Ode3H.mode
ltx/gr_redirects_goarch/me.m12.d13:meMA.Ode3H.ode	@ltx/gr_gr_cog/me.m12.d13:meMA.Ode3H.ode
ltx/gr_redirects_goarch/me.m12.d13:meMA.Ode3H.text	@ltx/gr_gr_cog/me.m12.d13:meMA.Ode3H.text
ltx/gr_redirects_goarch/me.m12.d13:meMA.Ode3Kathisma1.greekmelody	@ltx/gr_gr_cog/me.m12.d13:meMA.Ode3Kathisma1.greekmelody
ltx/gr_redirects_goarch/me.m12.d13:meMA.Ode3Kathisma1.incipit	@ltx/gr_gr_cog/me.m12.d13:meMA.Ode3Kathisma1.incipit
ltx/gr_redirects_goarch/me.m12.d13:meMA.Ode3Kathisma1.melody	@ltx/gr_gr_cog/me.m12.d13:meMA.Ode3Kathisma1.melody
ltx/gr_redirects_goarch/me.m12.d13:meMA.Ode3Kathisma1.mode	@ltx/gr_gr_cog/me.m12.d13:meMA.Ode3Kathisma1.mode
ltx/gr_redirects_goarch/me.m12.d13:meMA.Ode3Kathisma1.text	@ltx/gr_gr_cog/me.m12.d13:meMA.Ode3Kathisma1.text
ltx/gr_redirects_goarch/me.m12.d13:meMA.Ode3Kathisma2.greekmelody	@ltx/gr_gr_cog/me.m12.d13:meMA.Ode3Kathisma2.greekmelody
ltx/gr_redirects_goarch/me.m12.d13:meMA.Ode3Kathisma2.incipit	@ltx/gr_gr_cog/me.m12.d13:meMA.Ode3Kathisma2.incipit
ltx/gr_redirects_goarch/me.m12.d13:meMA.Ode3Kathisma2.melody	@ltx/gr_gr_cog/me.m12.d13:meMA.Ode3Kathisma2.melody
ltx/gr_redirects_goarch/me.m12.d13:meMA.Ode3Kathisma2.mode	@ltx/gr_gr_cog/me.m12.d13:meMA.Ode3Kathisma2.mode
ltx/gr_redirects_goarch/me.m12.d13:meMA.Ode3Kathisma2.text	@ltx/gr_gr_cog/me.m12.d13:meMA.Ode3Kathisma2.text
ltx/gr_redirects_goarch/me.m12.d13:meMA.Ode3KathismaSt.incipit	@ltx/gr_gr_cog/me.m12.d13:meMA.Ode3KathismaSt.incipit
ltx/gr_redirects_goarch/me.m12.d13:meMA.Ode3KathismaSt.melody	@ltx/gr_gr_cog/me.m12.d13:meMA.Ode3KathismaSt.melody
ltx/gr_redirects_goarch/me.m12.d13:meMA.Ode3KathismaSt.mode	@ltx/gr_gr_cog/me.m12.d13:meMA.Ode3KathismaSt.mode
ltx/gr_redirects_goarch/me.m12.d13:meMA.Ode3KathismaSt.text	@ltx/gr_gr_cog/me.m12.d13:meMA.Ode3KathismaSt.text
ltx/gr_redirects_goarch/me.m12.d13:meMA.Ode3KathismaT.incipit	@ltx/gr_gr_cog/me.m12.d13:meMA.Ode3KathismaT.incipit
ltx/gr_redirects_goarch/me.m12.d13:meMA.Ode3KathismaT.melody	@ltx/gr_gr_cog/me.m12.d13:meMA.Ode3KathismaT.melody
ltx/gr_redirects_goarch/me.m12.d13:meMA.Ode3KathismaT.mode	@ltx/gr_gr_cog/me.m12.d13:meMA.Ode3KathismaT.mode
ltx/gr_redirects_goarch/me.m12.d13:meMA.Ode3KathismaT.text	@ltx/gr_gr_cog/me.m12.d13:meMA.Ode3KathismaT.text
ltx/gr_redirects_goarch/me.m12.d13:meMA.Ode4C11.greekmelody	@ltx/gr_gr_cog/me.m12.d13:meMA.Ode4C11.greekmelody
ltx/gr_redirects_goarch/me.m12.d13:meMA.Ode4C11.incipit	@ltx/gr_gr_cog/me.m12.d13:meMA.Ode4C11.incipit
ltx/gr_redirects_goarch/me.m12.d13:meMA.Ode4C11.melody	@ltx/gr_gr_cog/me.m12.d13:meMA.Ode4C11.melody
ltx/gr_redirects_goarch/me.m12.d13:meMA.Ode4C11.mode	@ltx/gr_gr_cog/me.m12.d13:meMA.Ode4C11.mode
ltx/gr_redirects_goarch/me.m12.d13:meMA.Ode4C11.ode	@ltx/gr_gr_cog/me.m12.d13:meMA.Ode4C11.ode
ltx/gr_redirects_goarch/me.m12.d13:meMA.Ode4C11.text	@ltx/gr_gr_cog/me.m12.d13:meMA.Ode4C11.text
ltx/gr_redirects_goarch/me.m12.d13:meMA.Ode4C12.incipit	@ltx/gr_gr_cog/me.m12.d13:meMA.Ode4C12.incipit
ltx/gr_redirects_goarch/me.m12.d13:meMA.Ode4C12.melody	@ltx/gr_gr_cog/me.m12.d13:meMA.Ode4C12.melody
ltx/gr_redirects_goarch/me.m12.d13:meMA.Ode4C12.mode	@ltx/gr_gr_cog/me.m12.d13:meMA.Ode4C12.mode
ltx/gr_redirects_goarch/me.m12.d13:meMA.Ode4C12.ode	@ltx/gr_gr_cog/me.m12.d13:meMA.Ode4C12.ode
ltx/gr_redirects_goarch/me.m12.d13:meMA.Ode4C12.text	@ltx/gr_gr_cog/me.m12.d13:meMA.Ode4C12.text
ltx/gr_redirects_goarch/me.m12.d13:meMA.Ode4C13.incipit	@ltx/gr_gr_cog/me.m12.d13:meMA.Ode4C13.incipit
ltx/gr_redirects_goarch/me.m12.d13:meMA.Ode4C13.melody	@ltx/gr_gr_cog/me.m12.d13:meMA.Ode4C13.melody
ltx/gr_redirects_goarch/me.m12.d13:meMA.Ode4C13.mode	@ltx/gr_gr_cog/me.m12.d13:meMA.Ode4C13.mode
ltx/gr_redirects_goarch/me.m12.d13:meMA.Ode4C13.ode	@ltx/gr_gr_cog/me.m12.d13:meMA.Ode4C13.ode
ltx/gr_redirects_goarch/me.m12.d13:meMA.Ode4C13.text	@ltx/gr_gr_cog/me.m12.d13:meMA.Ode4C13.text
ltx/gr_redirects_goarch/me.m12.d13:meMA.Ode4C14.incipit	@ltx/gr_gr_cog/me.m12.d13:meMA.Ode4C14.incipit
ltx/gr_redirects_goarch/me.m12.d13:meMA.Ode4C14.melody	@ltx/gr_gr_cog/me.m12.d13:meMA.Ode4C14.melody
ltx/gr_redirects_goarch/me.m12.d13:meMA.Ode4C14.mode	@ltx/gr_gr_cog/me.m12.d13:meMA.Ode4C14.mode
ltx/gr_redirects_goarch/me.m12.d13:meMA.Ode4C14.ode	@ltx/gr_gr_cog/me.m12.d13:meMA.Ode4C14.ode
ltx/gr_redirects_goarch/me.m12.d13:meMA.Ode4C14.text	@ltx/gr_gr_cog/me.m12.d13:meMA.Ode4C14.text
ltx/gr_redirects_goarch/me.m12.d13:meMA.Ode4C15.incipit	@ltx/gr_gr_cog/me.m12.d13:meMA.Ode4C15.incipit
ltx/gr_redirects_goarch/me.m12.d13:meMA.Ode4C15.melody	@ltx/gr_gr_cog/me.m12.d13:meMA.Ode4C15.melody
ltx/gr_redirects_goarch/me.m12.d13:meMA.Ode4C15.mode	@ltx/gr_gr_cog/me.m12.d13:meMA.Ode4C15.mode
ltx/gr_redirects_goarch/me.m12.d13:meMA.Ode4C15.ode	@ltx/gr_gr_cog/me.m12.d13:meMA.Ode4C15.ode
ltx/gr_redirects_goarch/me.m12.d13:meMA.Ode4C15.text	@ltx/gr_gr_cog/me.m12.d13:meMA.Ode4C15.text
ltx/gr_redirects_goarch/me.m12.d13:meMA.Ode4C1T.incipit	@ltx/gr_gr_cog/me.m12.d13:meMA.Ode4C1T.incipit
ltx/gr_redirects_goarch/me.m12.d13:meMA.Ode4C1T.melody	@ltx/gr_gr_cog/me.m12.d13:meMA.Ode4C1T.melody
ltx/gr_redirects_goarch/me.m12.d13:meMA.Ode4C1T.mode	@ltx/gr_gr_cog/me.m12.d13:meMA.Ode4C1T.mode
ltx/gr_redirects_goarch/me.m12.d13:meMA.Ode4C1T.ode	@ltx/gr_gr_cog/me.m12.d13:meMA.Ode4C1T.ode
ltx/gr_redirects_goarch/me.m12.d13:meMA.Ode4C1T.text	@ltx/gr_gr_cog/me.m12.d13:meMA.Ode4C1T.text
ltx/gr_redirects_goarch/me.m12.d13:meMA.Ode5C11.greekmelody	@ltx/gr_gr_cog/me.m12.d13:meMA.Ode5C11.greekmelody
ltx/gr_redirects_goarch/me.m12.d13:meMA.Ode5C11.incipit	@ltx/gr_gr_cog/me.m12.d13:meMA.Ode5C11.incipit
ltx/gr_redirects_goarch/me.m12.d13:meMA.Ode5C11.melody	@ltx/gr_gr_cog/me.m12.d13:meMA.Ode5C11.melody
ltx/gr_redirects_goarch/me.m12.d13:meMA.Ode5C11.mode	@ltx/gr_gr_cog/me.m12.d13:meMA.Ode5C11.mode
ltx/gr_redirects_goarch/me.m12.d13:meMA.Ode5C11.ode	@ltx/gr_gr_cog/me.m12.d13:meMA.Ode5C11.ode
ltx/gr_redirects_goarch/me.m12.d13:meMA.Ode5C11.text	@ltx/gr_gr_cog/me.m12.d13:meMA.Ode5C11.text
ltx/gr_redirects_goarch/me.m12.d13:meMA.Ode5C12.incipit	@ltx/gr_gr_cog/me.m12.d13:meMA.Ode5C12.incipit
ltx/gr_redirects_goarch/me.m12.d13:meMA.Ode5C12.melody	@ltx/gr_gr_cog/me.m12.d13:meMA.Ode5C12.melody
ltx/gr_redirects_goarch/me.m12.d13:meMA.Ode5C12.mode	@ltx/gr_gr_cog/me.m12.d13:meMA.Ode5C12.mode
ltx/gr_redirects_goarch/me.m12.d13:meMA.Ode5C12.ode	@ltx/gr_gr_cog/me.m12.d13:meMA.Ode5C12.ode
ltx/gr_redirects_goarch/me.m12.d13:meMA.Ode5C12.text	@ltx/gr_gr_cog/me.m12.d13:meMA.Ode5C12.text
ltx/gr_redirects_goarch/me.m12.d13:meMA.Ode5C13.incipit	@ltx/gr_gr_cog/me.m12.d13:meMA.Ode5C13.incipit
ltx/gr_redirects_goarch/me.m12.d13:meMA.Ode5C13.melody	@ltx/gr_gr_cog/me.m12.d13:meMA.Ode5C13.melody
ltx/gr_redirects_goarch/me.m12.d13:meMA.Ode5C13.mode	@ltx/gr_gr_cog/me.m12.d13:meMA.Ode5C13.mode
ltx/gr_redirects_goarch/me.m12.d13:meMA.Ode5C13.ode	@ltx/gr_gr_cog/me.m12.d13:meMA.Ode5C13.ode
ltx/gr_redirects_goarch/me.m12.d13:meMA.Ode5C13.text	@ltx/gr_gr_cog/me.m12.d13:meMA.Ode5C13.text
ltx/gr_redirects_goarch/me.m12.d13:meMA.Ode5C14.incipit	@ltx/gr_gr_cog/me.m12.d13:meMA.Ode5C14.incipit
ltx/gr_redirects_goarch/me.m12.d13:meMA.Ode5C14.melody	@ltx/gr_gr_cog/me.m12.d13:meMA.Ode5C14.melody
ltx/gr_redirects_goarch/me.m12.d13:meMA.Ode5C14.mode	@ltx/gr_gr_cog/me.m12.d13:meMA.Ode5C14.mode
ltx/gr_redirects_goarch/me.m12.d13:meMA.Ode5C14.ode	@ltx/gr_gr_cog/me.m12.d13:meMA.Ode5C14.ode
ltx/gr_redirects_goarch/me.m12.d13:meMA.Ode5C14.text	@ltx/gr_gr_cog/me.m12.d13:meMA.Ode5C14.text
ltx/gr_redirects_goarch/me.m12.d13:meMA.Ode5C15.incipit	@ltx/gr_gr_cog/me.m12.d13:meMA.Ode5C15.incipit
ltx/gr_redirects_goarch/me.m12.d13:meMA.Ode5C15.melody	@ltx/gr_gr_cog/me.m12.d13:meMA.Ode5C15.melody
ltx/gr_redirects_goarch/me.m12.d13:meMA.Ode5C15.mode	@ltx/gr_gr_cog/me.m12.d13:meMA.Ode5C15.mode
ltx/gr_redirects_goarch/me.m12.d13:meMA.Ode5C15.ode	@ltx/gr_gr_cog/me.m12.d13:meMA.Ode5C15.ode
ltx/gr_redirects_goarch/me.m12.d13:meMA.Ode5C15.text	@ltx/gr_gr_cog/me.m12.d13:meMA.Ode5C15.text
ltx/gr_redirects_goarch/me.m12.d13:meMA.Ode5C1T.incipit	@ltx/gr_gr_cog/me.m12.d13:meMA.Ode5C1T.incipit
ltx/gr_redirects_goarch/me.m12.d13:meMA.Ode5C1T.melody	@ltx/gr_gr_cog/me.m12.d13:meMA.Ode5C1T.melody
ltx/gr_redirects_goarch/me.m12.d13:meMA.Ode5C1T.mode	@ltx/gr_gr_cog/me.m12.d13:meMA.Ode5C1T.mode
ltx/gr_redirects_goarch/me.m12.d13:meMA.Ode5C1T.ode	@ltx/gr_gr_cog/me.m12.d13:meMA.Ode5C1T.ode
ltx/gr_redirects_goarch/me.m12.d13:meMA.Ode5C1T.text	@ltx/gr_gr_cog/me.m12.d13:meMA.Ode5C1T.text
ltx/gr_redirects_goarch/me.m12.d13:meMA.Ode6C11.greekmelody	@ltx/gr_gr_cog/me.m12.d13:meMA.Ode6C11.greekmelody
ltx/gr_redirects_goarch/me.m12.d13:meMA.Ode6C11.incipit	@ltx/gr_gr_cog/me.m12.d13:meMA.Ode6C11.incipit
ltx/gr_redirects_goarch/me.m12.d13:meMA.Ode6C11.melody	@ltx/gr_gr_cog/me.m12.d13:meMA.Ode6C11.melody
ltx/gr_redirects_goarch/me.m12.d13:meMA.Ode6C11.mode	@ltx/gr_gr_cog/me.m12.d13:meMA.Ode6C11.mode
ltx/gr_redirects_goarch/me.m12.d13:meMA.Ode6C11.ode	@ltx/gr_gr_cog/me.m12.d13:meMA.Ode6C11.ode
ltx/gr_redirects_goarch/me.m12.d13:meMA.Ode6C11.text	@ltx/gr_gr_cog/me.m12.d13:meMA.Ode6C11.text
ltx/gr_redirects_goarch/me.m12.d13:meMA.Ode6C12.incipit	@ltx/gr_gr_cog/me.m12.d13:meMA.Ode6C12.incipit
ltx/gr_redirects_goarch/me.m12.d13:meMA.Ode6C12.melody	@ltx/gr_gr_cog/me.m12.d13:meMA.Ode6C12.melody
ltx/gr_redirects_goarch/me.m12.d13:meMA.Ode6C12.mode	@ltx/gr_gr_cog/me.m12.d13:meMA.Ode6C12.mode
ltx/gr_redirects_goarch/me.m12.d13:meMA.Ode6C12.ode	@ltx/gr_gr_cog/me.m12.d13:meMA.Ode6C12.ode
ltx/gr_redirects_goarch/me.m12.d13:meMA.Ode6C12.text	@ltx/gr_gr_cog/me.m12.d13:meMA.Ode6C12.text
ltx/gr_redirects_goarch/me.m12.d13:meMA.Ode6C13.incipit	@ltx/gr_gr_cog/me.m12.d13:meMA.Ode6C13.incipit
ltx/gr_redirects_goarch/me.m12.d13:meMA.Ode6C13.melody	@ltx/gr_gr_cog/me.m12.d13:meMA.Ode6C13.melody
ltx/gr_redirects_goarch/me.m12.d13:meMA.Ode6C13.mode	@ltx/gr_gr_cog/me.m12.d13:meMA.Ode6C13.mode
ltx/gr_redirects_goarch/me.m12.d13:meMA.Ode6C13.ode	@ltx/gr_gr_cog/me.m12.d13:meMA.Ode6C13.ode
ltx/gr_redirects_goarch/me.m12.d13:meMA.Ode6C13.text	@ltx/gr_gr_cog/me.m12.d13:meMA.Ode6C13.text
ltx/gr_redirects_goarch/me.m12.d13:meMA.Ode6C14.incipit	@ltx/gr_gr_cog/me.m12.d13:meMA.Ode6C14.incipit
ltx/gr_redirects_goarch/me.m12.d13:meMA.Ode6C14.melody	@ltx/gr_gr_cog/me.m12.d13:meMA.Ode6C14.melody
ltx/gr_redirects_goarch/me.m12.d13:meMA.Ode6C14.mode	@ltx/gr_gr_cog/me.m12.d13:meMA.Ode6C14.mode
ltx/gr_redirects_goarch/me.m12.d13:meMA.Ode6C14.ode	@ltx/gr_gr_cog/me.m12.d13:meMA.Ode6C14.ode
ltx/gr_redirects_goarch/me.m12.d13:meMA.Ode6C14.text	@ltx/gr_gr_cog/me.m12.d13:meMA.Ode6C14.text
ltx/gr_redirects_goarch/me.m12.d13:meMA.Ode6C1T.incipit	@ltx/gr_gr_cog/me.m12.d13:meMA.Ode6C1T.incipit
ltx/gr_redirects_goarch/me.m12.d13:meMA.Ode6C1T.melody	@ltx/gr_gr_cog/me.m12.d13:meMA.Ode6C1T.melody
ltx/gr_redirects_goarch/me.m12.d13:meMA.Ode6C1T.mode	@ltx/gr_gr_cog/me.m12.d13:meMA.Ode6C1T.mode
ltx/gr_redirects_goarch/me.m12.d13:meMA.Ode6C1T.ode	@ltx/gr_gr_cog/me.m12.d13:meMA.Ode6C1T.ode
ltx/gr_redirects_goarch/me.m12.d13:meMA.Ode6C1T.text	@ltx/gr_gr_cog/me.m12.d13:meMA.Ode6C1T.text
ltx/gr_redirects_goarch/me.m12.d13:meMA.Ode6H.greekmelody	@ltx/gr_gr_cog/me.m12.d13:meMA.Ode6H.greekmelody
ltx/gr_redirects_goarch/me.m12.d13:meMA.Ode6H.incipit	@ltx/gr_gr_cog/me.m12.d13:meMA.Ode6H.incipit
ltx/gr_redirects_goarch/me.m12.d13:meMA.Ode6H.melody	@ltx/gr_gr_cog/me.m12.d13:meMA.Ode6H.melody
ltx/gr_redirects_goarch/me.m12.d13:meMA.Ode6H.mode	@ltx/gr_gr_cog/me.m12.d13:meMA.Ode6H.mode
ltx/gr_redirects_goarch/me.m12.d13:meMA.Ode6H.ode	@ltx/gr_gr_cog/me.m12.d13:meMA.Ode6H.ode
ltx/gr_redirects_goarch/me.m12.d13:meMA.Ode6H.text	@ltx/gr_gr_cog/me.m12.d13:meMA.Ode6H.text
ltx/gr_redirects_goarch/me.m12.d13:meMA.Ode7C11.greekmelody	@ltx/gr_gr_cog/me.m12.d13:meMA.Ode7C11.greekmelody
ltx/gr_redirects_goarch/me.m12.d13:meMA.Ode7C11.incipit	@ltx/gr_gr_cog/me.m12.d13:meMA.Ode7C11.incipit
ltx/gr_redirects_goarch/me.m12.d13:meMA.Ode7C11.melody	@ltx/gr_gr_cog/me.m12.d13:meMA.Ode7C11.melody
ltx/gr_redirects_goarch/me.m12.d13:meMA.Ode7C11.mode	@ltx/gr_gr_cog/me.m12.d13:meMA.Ode7C11.mode
ltx/gr_redirects_goarch/me.m12.d13:meMA.Ode7C11.ode	@ltx/gr_gr_cog/me.m12.d13:meMA.Ode7C11.ode
ltx/gr_redirects_goarch/me.m12.d13:meMA.Ode7C11.text	@ltx/gr_gr_cog/me.m12.d13:meMA.Ode7C11.text
ltx/gr_redirects_goarch/me.m12.d13:meMA.Ode7C12.incipit	@ltx/gr_gr_cog/me.m12.d13:meMA.Ode7C12.incipit
ltx/gr_redirects_goarch/me.m12.d13:meMA.Ode7C12.melody	@ltx/gr_gr_cog/me.m12.d13:meMA.Ode7C12.melody
ltx/gr_redirects_goarch/me.m12.d13:meMA.Ode7C12.mode	@ltx/gr_gr_cog/me.m12.d13:meMA.Ode7C12.mode
ltx/gr_redirects_goarch/me.m12.d13:meMA.Ode7C12.ode	@ltx/gr_gr_cog/me.m12.d13:meMA.Ode7C12.ode
ltx/gr_redirects_goarch/me.m12.d13:meMA.Ode7C12.text	@ltx/gr_gr_cog/me.m12.d13:meMA.Ode7C12.text
ltx/gr_redirects_goarch/me.m12.d13:meMA.Ode7C13.incipit	@ltx/gr_gr_cog/me.m12.d13:meMA.Ode7C13.incipit
ltx/gr_redirects_goarch/me.m12.d13:meMA.Ode7C13.melody	@ltx/gr_gr_cog/me.m12.d13:meMA.Ode7C13.melody
ltx/gr_redirects_goarch/me.m12.d13:meMA.Ode7C13.mode	@ltx/gr_gr_cog/me.m12.d13:meMA.Ode7C13.mode
ltx/gr_redirects_goarch/me.m12.d13:meMA.Ode7C13.ode	@ltx/gr_gr_cog/me.m12.d13:meMA.Ode7C13.ode
ltx/gr_redirects_goarch/me.m12.d13:meMA.Ode7C13.text	@ltx/gr_gr_cog/me.m12.d13:meMA.Ode7C13.text
ltx/gr_redirects_goarch/me.m12.d13:meMA.Ode7C14.incipit	@ltx/gr_gr_cog/me.m12.d13:meMA.Ode7C14.incipit
ltx/gr_redirects_goarch/me.m12.d13:meMA.Ode7C14.melody	@ltx/gr_gr_cog/me.m12.d13:meMA.Ode7C14.melody
ltx/gr_redirects_goarch/me.m12.d13:meMA.Ode7C14.mode	@ltx/gr_gr_cog/me.m12.d13:meMA.Ode7C14.mode
ltx/gr_redirects_goarch/me.m12.d13:meMA.Ode7C14.ode	@ltx/gr_gr_cog/me.m12.d13:meMA.Ode7C14.ode
ltx/gr_redirects_goarch/me.m12.d13:meMA.Ode7C14.text	@ltx/gr_gr_cog/me.m12.d13:meMA.Ode7C14.text
ltx/gr_redirects_goarch/me.m12.d13:meMA.Ode7C15.incipit	@ltx/gr_gr_cog/me.m12.d13:meMA.Ode7C15.incipit
ltx/gr_redirects_goarch/me.m12.d13:meMA.Ode7C15.melody	@ltx/gr_gr_cog/me.m12.d13:meMA.Ode7C15.melody
ltx/gr_redirects_goarch/me.m12.d13:meMA.Ode7C15.mode	@ltx/gr_gr_cog/me.m12.d13:meMA.Ode7C15.mode
ltx/gr_redirects_goarch/me.m12.d13:meMA.Ode7C15.ode	@ltx/gr_gr_cog/me.m12.d13:meMA.Ode7C15.ode
ltx/gr_redirects_goarch/me.m12.d13:meMA.Ode7C15.text	@ltx/gr_gr_cog/me.m12.d13:meMA.Ode7C15.text
ltx/gr_redirects_goarch/me.m12.d13:meMA.Ode7C1T.incipit	@ltx/gr_gr_cog/me.m12.d13:meMA.Ode7C1T.incipit
ltx/gr_redirects_goarch/me.m12.d13:meMA.Ode7C1T.melody	@ltx/gr_gr_cog/me.m12.d13:meMA.Ode7C1T.melody
ltx/gr_redirects_goarch/me.m12.d13:meMA.Ode7C1T.mode	@ltx/gr_gr_cog/me.m12.d13:meMA.Ode7C1T.mode
ltx/gr_redirects_goarch/me.m12.d13:meMA.Ode7C1T.ode	@ltx/gr_gr_cog/me.m12.d13:meMA.Ode7C1T.ode
ltx/gr_redirects_goarch/me.m12.d13:meMA.Ode7C1T.text	@ltx/gr_gr_cog/me.m12.d13:meMA.Ode7C1T.text
ltx/gr_redirects_goarch/me.m12.d13:meMA.Ode8C11.greekmelody	@ltx/gr_gr_cog/me.m12.d13:meMA.Ode8C11.greekmelody
ltx/gr_redirects_goarch/me.m12.d13:meMA.Ode8C11.incipit	@ltx/gr_gr_cog/me.m12.d13:meMA.Ode8C11.incipit
ltx/gr_redirects_goarch/me.m12.d13:meMA.Ode8C11.melody	@ltx/gr_gr_cog/me.m12.d13:meMA.Ode8C11.melody
ltx/gr_redirects_goarch/me.m12.d13:meMA.Ode8C11.mode	@ltx/gr_gr_cog/me.m12.d13:meMA.Ode8C11.mode
ltx/gr_redirects_goarch/me.m12.d13:meMA.Ode8C11.ode	@ltx/gr_gr_cog/me.m12.d13:meMA.Ode8C11.ode
ltx/gr_redirects_goarch/me.m12.d13:meMA.Ode8C11.text	@ltx/gr_gr_cog/me.m12.d13:meMA.Ode8C11.text
ltx/gr_redirects_goarch/me.m12.d13:meMA.Ode8C12.incipit	@ltx/gr_gr_cog/me.m12.d13:meMA.Ode8C12.incipit
ltx/gr_redirects_goarch/me.m12.d13:meMA.Ode8C12.melody	@ltx/gr_gr_cog/me.m12.d13:meMA.Ode8C12.melody
ltx/gr_redirects_goarch/me.m12.d13:meMA.Ode8C12.mode	@ltx/gr_gr_cog/me.m12.d13:meMA.Ode8C12.mode
ltx/gr_redirects_goarch/me.m12.d13:meMA.Ode8C12.ode	@ltx/gr_gr_cog/me.m12.d13:meMA.Ode8C12.ode
ltx/gr_redirects_goarch/me.m12.d13:meMA.Ode8C12.text	@ltx/gr_gr_cog/me.m12.d13:meMA.Ode8C12.text
ltx/gr_redirects_goarch/me.m12.d13:meMA.Ode8C13.incipit	@ltx/gr_gr_cog/me.m12.d13:meMA.Ode8C13.incipit
ltx/gr_redirects_goarch/me.m12.d13:meMA.Ode8C13.melody	@ltx/gr_gr_cog/me.m12.d13:meMA.Ode8C13.melody
ltx/gr_redirects_goarch/me.m12.d13:meMA.Ode8C13.mode	@ltx/gr_gr_cog/me.m12.d13:meMA.Ode8C13.mode
ltx/gr_redirects_goarch/me.m12.d13:meMA.Ode8C13.ode	@ltx/gr_gr_cog/me.m12.d13:meMA.Ode8C13.ode
ltx/gr_redirects_goarch/me.m12.d13:meMA.Ode8C13.text	@ltx/gr_gr_cog/me.m12.d13:meMA.Ode8C13.text
ltx/gr_redirects_goarch/me.m12.d13:meMA.Ode8C14.incipit	@ltx/gr_gr_cog/me.m12.d13:meMA.Ode8C14.incipit
ltx/gr_redirects_goarch/me.m12.d13:meMA.Ode8C14.melody	@ltx/gr_gr_cog/me.m12.d13:meMA.Ode8C14.melody
ltx/gr_redirects_goarch/me.m12.d13:meMA.Ode8C14.mode	@ltx/gr_gr_cog/me.m12.d13:meMA.Ode8C14.mode
ltx/gr_redirects_goarch/me.m12.d13:meMA.Ode8C14.ode	@ltx/gr_gr_cog/me.m12.d13:meMA.Ode8C14.ode
ltx/gr_redirects_goarch/me.m12.d13:meMA.Ode8C14.text	@ltx/gr_gr_cog/me.m12.d13:meMA.Ode8C14.text
ltx/gr_redirects_goarch/me.m12.d13:meMA.Ode8C15.incipit	@ltx/gr_gr_cog/me.m12.d13:meMA.Ode8C15.incipit
ltx/gr_redirects_goarch/me.m12.d13:meMA.Ode8C15.melody	@ltx/gr_gr_cog/me.m12.d13:meMA.Ode8C15.melody
ltx/gr_redirects_goarch/me.m12.d13:meMA.Ode8C15.mode	@ltx/gr_gr_cog/me.m12.d13:meMA.Ode8C15.mode
ltx/gr_redirects_goarch/me.m12.d13:meMA.Ode8C15.ode	@ltx/gr_gr_cog/me.m12.d13:meMA.Ode8C15.ode
ltx/gr_redirects_goarch/me.m12.d13:meMA.Ode8C15.text	@ltx/gr_gr_cog/me.m12.d13:meMA.Ode8C15.text
ltx/gr_redirects_goarch/me.m12.d13:meMA.Ode8C1T.incipit	@ltx/gr_gr_cog/me.m12.d13:meMA.Ode8C1T.incipit
ltx/gr_redirects_goarch/me.m12.d13:meMA.Ode8C1T.melody	@ltx/gr_gr_cog/me.m12.d13:meMA.Ode8C1T.melody
ltx/gr_redirects_goarch/me.m12.d13:meMA.Ode8C1T.mode	@ltx/gr_gr_cog/me.m12.d13:meMA.Ode8C1T.mode
ltx/gr_redirects_goarch/me.m12.d13:meMA.Ode8C1T.ode	@ltx/gr_gr_cog/me.m12.d13:meMA.Ode8C1T.ode
ltx/gr_redirects_goarch/me.m12.d13:meMA.Ode8C1T.text	@ltx/gr_gr_cog/me.m12.d13:meMA.Ode8C1T.text
ltx/gr_redirects_goarch/me.m12.d13:meMA.Ode8H.greekmelody	@ltx/gr_gr_cog/me.m12.d13:meMA.Ode8H.greekmelody
ltx/gr_redirects_goarch/me.m12.d13:meMA.Ode8H.incipit	@ltx/gr_gr_cog/me.m12.d13:meMA.Ode8H.incipit
ltx/gr_redirects_goarch/me.m12.d13:meMA.Ode8H.melody	@ltx/gr_gr_cog/me.m12.d13:meMA.Ode8H.melody
ltx/gr_redirects_goarch/me.m12.d13:meMA.Ode8H.mode	@ltx/gr_gr_cog/me.m12.d13:meMA.Ode8H.mode
ltx/gr_redirects_goarch/me.m12.d13:meMA.Ode8H.ode	@ltx/gr_gr_cog/me.m12.d13:meMA.Ode8H.ode
ltx/gr_redirects_goarch/me.m12.d13:meMA.Ode8H.text	@ltx/gr_gr_cog/me.m12.d13:meMA.Ode8H.text
ltx/gr_redirects_goarch/me.m12.d13:meMA.Ode9C11.greekmelody	@ltx/gr_gr_cog/me.m12.d13:meMA.Ode9C11.greekmelody
ltx/gr_redirects_goarch/me.m12.d13:meMA.Ode9C11.incipit	@ltx/gr_gr_cog/me.m12.d13:meMA.Ode9C11.incipit
ltx/gr_redirects_goarch/me.m12.d13:meMA.Ode9C11.melody	@ltx/gr_gr_cog/me.m12.d13:meMA.Ode9C11.melody
ltx/gr_redirects_goarch/me.m12.d13:meMA.Ode9C11.mode	@ltx/gr_gr_cog/me.m12.d13:meMA.Ode9C11.mode
ltx/gr_redirects_goarch/me.m12.d13:meMA.Ode9C11.ode	@ltx/gr_gr_cog/me.m12.d13:meMA.Ode9C11.ode
ltx/gr_redirects_goarch/me.m12.d13:meMA.Ode9C11.text	@ltx/gr_gr_cog/me.m12.d13:meMA.Ode9C11.text
ltx/gr_redirects_goarch/me.m12.d13:meMA.Ode9C12.incipit	@ltx/gr_gr_cog/me.m12.d13:meMA.Ode9C12.incipit
ltx/gr_redirects_goarch/me.m12.d13:meMA.Ode9C12.melody	@ltx/gr_gr_cog/me.m12.d13:meMA.Ode9C12.melody
ltx/gr_redirects_goarch/me.m12.d13:meMA.Ode9C12.mode	@ltx/gr_gr_cog/me.m12.d13:meMA.Ode9C12.mode
ltx/gr_redirects_goarch/me.m12.d13:meMA.Ode9C12.ode	@ltx/gr_gr_cog/me.m12.d13:meMA.Ode9C12.ode
ltx/gr_redirects_goarch/me.m12.d13:meMA.Ode9C12.text	@ltx/gr_gr_cog/me.m12.d13:meMA.Ode9C12.text
ltx/gr_redirects_goarch/me.m12.d13:meMA.Ode9C13.incipit	@ltx/gr_gr_cog/me.m12.d13:meMA.Ode9C13.incipit
ltx/gr_redirects_goarch/me.m12.d13:meMA.Ode9C13.melody	@ltx/gr_gr_cog/me.m12.d13:meMA.Ode9C13.melody
ltx/gr_redirects_goarch/me.m12.d13:meMA.Ode9C13.mode	@ltx/gr_gr_cog/me.m12.d13:meMA.Ode9C13.mode
ltx/gr_redirects_goarch/me.m12.d13:meMA.Ode9C13.ode	@ltx/gr_gr_cog/me.m12.d13:meMA.Ode9C13.ode
ltx/gr_redirects_goarch/me.m12.d13:meMA.Ode9C13.text	@ltx/gr_gr_cog/me.m12.d13:meMA.Ode9C13.text
ltx/gr_redirects_goarch/me.m12.d13:meMA.Ode9C14.incipit	@ltx/gr_gr_cog/me.m12.d13:meMA.Ode9C14.incipit
ltx/gr_redirects_goarch/me.m12.d13:meMA.Ode9C14.melody	@ltx/gr_gr_cog/me.m12.d13:meMA.Ode9C14.melody
ltx/gr_redirects_goarch/me.m12.d13:meMA.Ode9C14.mode	@ltx/gr_gr_cog/me.m12.d13:meMA.Ode9C14.mode
ltx/gr_redirects_goarch/me.m12.d13:meMA.Ode9C14.ode	@ltx/gr_gr_cog/me.m12.d13:meMA.Ode9C14.ode
ltx/gr_redirects_goarch/me.m12.d13:meMA.Ode9C14.text	@ltx/gr_gr_cog/me.m12.d13:meMA.Ode9C14.text
ltx/gr_redirects_goarch/me.m12.d13:meMA.Ode9C15.incipit	@ltx/gr_gr_cog/me.m12.d13:meMA.Ode9C15.incipit
ltx/gr_redirects_goarch/me.m12.d13:meMA.Ode9C15.melody	@ltx/gr_gr_cog/me.m12.d13:meMA.Ode9C15.melody
ltx/gr_redirects_goarch/me.m12.d13:meMA.Ode9C15.mode	@ltx/gr_gr_cog/me.m12.d13:meMA.Ode9C15.mode
ltx/gr_redirects_goarch/me.m12.d13:meMA.Ode9C15.ode	@ltx/gr_gr_cog/me.m12.d13:meMA.Ode9C15.ode
ltx/gr_redirects_goarch/me.m12.d13:meMA.Ode9C15.text	@ltx/gr_gr_cog/me.m12.d13:meMA.Ode9C15.text
ltx/gr_redirects_goarch/me.m12.d13:meMA.Ode9C1T.incipit	@ltx/gr_gr_cog/me.m12.d13:meMA.Ode9C1T.incipit
ltx/gr_redirects_goarch/me.m12.d13:meMA.Ode9C1T.melody	@ltx/gr_gr_cog/me.m12.d13:meMA.Ode9C1T.melody
ltx/gr_redirects_goarch/me.m12.d13:meMA.Ode9C1T.mode	@ltx/gr_gr_cog/me.m12.d13:meMA.Ode9C1T.mode
ltx/gr_redirects_goarch/me.m12.d13:meMA.Ode9C1T.ode	@ltx/gr_gr_cog/me.m12.d13:meMA.Ode9C1T.ode
ltx/gr_redirects_goarch/me.m12.d13:meMA.Ode9C1T.text	@ltx/gr_gr_cog/me.m12.d13:meMA.Ode9C1T.text
ltx/gr_redirects_goarch/me.m12.d13:meMA.Ode9H.greekmelody	@ltx/gr_gr_cog/me.m12.d13:meMA.Ode9H.greekmelody
ltx/gr_redirects_goarch/me.m12.d13:meMA.Ode9H.incipit	@ltx/gr_gr_cog/me.m12.d13:meMA.Ode9H.incipit
ltx/gr_redirects_goarch/me.m12.d13:meMA.Ode9H.melody	@ltx/gr_gr_cog/me.m12.d13:meMA.Ode9H.melody
ltx/gr_redirects_goarch/me.m12.d13:meMA.Ode9H.mode	@ltx/gr_gr_cog/me.m12.d13:meMA.Ode9H.mode
ltx/gr_redirects_goarch/me.m12.d13:meMA.Ode9H.ode	@ltx/gr_gr_cog/me.m12.d13:meMA.Ode9H.ode
ltx/gr_redirects_goarch/me.m12.d13:meMA.Ode9H.text	@ltx/gr_gr_cog/me.m12.d13:meMA.Ode9H.text
ltx/gr_redirects_goarch/me.m12.d13:meMA.Oikos1.text	@ltx/gr_gr_cog/me.m12.d13:meMA.Oikos1.text
ltx/gr_redirects_goarch/me.m12.d13:meVE.Apolytikion1ger.greekmelody	@ltx/gr_gr_cog/me.m12.d13:meVE.Apolytikion1ger.greekmelody
ltx/gr_redirects_goarch/me.m12.d13:meVE.Apolytikion1ger.incipit	@ltx/gr_gr_cog/me.m12.d13:meVE.Apolytikion1ger.incipit
ltx/gr_redirects_goarch/me.m12.d13:meVE.Apolytikion1ger.melody	@ltx/gr_gr_cog/me.m12.d13:meVE.Apolytikion1ger.melody
ltx/gr_redirects_goarch/me.m12.d13:meVE.Apolytikion1ger.mode	@ltx/gr_gr_cog/me.m12.d13:meVE.Apolytikion1ger.mode
ltx/gr_redirects_goarch/me.m12.d13:meVE.Apolytikion1ger.poet	@ltx/gr_gr_cog/me.m12.d13:meVE.Apolytikion1ger.poet
ltx/gr_redirects_goarch/me.m12.d13:meVE.Apolytikion1ger.text	@ltx/gr_gr_cog/me.m12.d13:meVE.Apolytikion1ger.text
ltx/gr_redirects_goarch/me.m12.d13:meVE.Apolytikion2ger.greekmelody	@ltx/gr_gr_cog/me.m12.d13:meVE.Apolytikion2ger.greekmelody
ltx/gr_redirects_goarch/me.m12.d13:meVE.Apolytikion2ger.incipit	@ltx/gr_gr_cog/me.m12.d13:meVE.Apolytikion2ger.incipit
ltx/gr_redirects_goarch/me.m12.d13:meVE.Apolytikion2ger.melody	@ltx/gr_gr_cog/me.m12.d13:meVE.Apolytikion2ger.melody
ltx/gr_redirects_goarch/me.m12.d13:meVE.Apolytikion2ger.mode	@ltx/gr_gr_cog/me.m12.d13:meVE.Apolytikion2ger.mode
ltx/gr_redirects_goarch/me.m12.d13:meVE.Apolytikion2ger.poet	@ltx/gr_gr_cog/me.m12.d13:meVE.Apolytikion2ger.poet
ltx/gr_redirects_goarch/me.m12.d13:meVE.Apolytikion2ger.text	@ltx/gr_gr_cog/me.m12.d13:meVE.Apolytikion2ger.text
ltx/gr_redirects_goarch/me.m12.d13:meVE.AposGlory.incipit	@ltx/gr_gr_cog/me.m12.d13:meVE.AposGlory.incipit
ltx/gr_redirects_goarch/me.m12.d13:meVE.AposGlory.melody	@ltx/gr_gr_cog/me.m12.d13:meVE.AposGlory.melody
ltx/gr_redirects_goarch/me.m12.d13:meVE.AposGlory.mode	@ltx/gr_gr_cog/me.m12.d13:meVE.AposGlory.mode
ltx/gr_redirects_goarch/me.m12.d13:meVE.AposGlory.text	@ltx/gr_gr_cog/me.m12.d13:meVE.AposGlory.text
ltx/gr_redirects_goarch/me.m12.d13:meVE.AposStavrotheotokion.incipit	@ltx/gr_gr_cog/me.m12.d13:meVE.AposStavrotheotokion.incipit
ltx/gr_redirects_goarch/me.m12.d13:meVE.AposStavrotheotokion.melody	@ltx/gr_gr_cog/me.m12.d13:meVE.AposStavrotheotokion.melody
ltx/gr_redirects_goarch/me.m12.d13:meVE.AposStavrotheotokion.mode	@ltx/gr_gr_cog/me.m12.d13:meVE.AposStavrotheotokion.mode
ltx/gr_redirects_goarch/me.m12.d13:meVE.AposStavrotheotokion.text	@ltx/gr_gr_cog/me.m12.d13:meVE.AposStavrotheotokion.text
ltx/gr_redirects_goarch/me.m12.d13:meVE.AposTheotokion.incipit	@ltx/gr_gr_cog/me.m12.d13:meVE.AposTheotokion.incipit
ltx/gr_redirects_goarch/me.m12.d13:meVE.AposTheotokion.melody	@ltx/gr_gr_cog/me.m12.d13:meVE.AposTheotokion.melody
ltx/gr_redirects_goarch/me.m12.d13:meVE.AposTheotokion.mode	@ltx/gr_gr_cog/me.m12.d13:meVE.AposTheotokion.mode
ltx/gr_redirects_goarch/me.m12.d13:meVE.AposTheotokion.text	@ltx/gr_gr_cog/me.m12.d13:meVE.AposTheotokion.text
ltx/gr_redirects_goarch/me.m12.d13:meVE.Aposticha1.greekmelody	@ltx/gr_gr_cog/me.m12.d13:meVE.Aposticha1.greekmelody
ltx/gr_redirects_goarch/me.m12.d13:meVE.Aposticha1.incipit	@ltx/gr_gr_cog/me.m12.d13:meVE.Aposticha1.incipit
ltx/gr_redirects_goarch/me.m12.d13:meVE.Aposticha1.melody	@ltx/gr_gr_cog/me.m12.d13:meVE.Aposticha1.melody
ltx/gr_redirects_goarch/me.m12.d13:meVE.Aposticha1.mode	@ltx/gr_gr_cog/me.m12.d13:meVE.Aposticha1.mode
ltx/gr_redirects_goarch/me.m12.d13:meVE.Aposticha1.text	@ltx/gr_gr_cog/me.m12.d13:meVE.Aposticha1.text
ltx/gr_redirects_goarch/me.m12.d13:meVE.Aposticha2.incipit	@ltx/gr_gr_cog/me.m12.d13:meVE.Aposticha2.incipit
ltx/gr_redirects_goarch/me.m12.d13:meVE.Aposticha2.melody	@ltx/gr_gr_cog/me.m12.d13:meVE.Aposticha2.melody
ltx/gr_redirects_goarch/me.m12.d13:meVE.Aposticha2.mode	@ltx/gr_gr_cog/me.m12.d13:meVE.Aposticha2.mode
ltx/gr_redirects_goarch/me.m12.d13:meVE.Aposticha2.text	@ltx/gr_gr_cog/me.m12.d13:meVE.Aposticha2.text
ltx/gr_redirects_goarch/me.m12.d13:meVE.Aposticha3.incipit	@ltx/gr_gr_cog/me.m12.d13:meVE.Aposticha3.incipit
ltx/gr_redirects_goarch/me.m12.d13:meVE.Aposticha3.melody	@ltx/gr_gr_cog/me.m12.d13:meVE.Aposticha3.melody
ltx/gr_redirects_goarch/me.m12.d13:meVE.Aposticha3.mode	@ltx/gr_gr_cog/me.m12.d13:meVE.Aposticha3.mode
ltx/gr_redirects_goarch/me.m12.d13:meVE.Aposticha3.text	@ltx/gr_gr_cog/me.m12.d13:meVE.Aposticha3.text
ltx/gr_redirects_goarch/me.m12.d13:meVE.SticGlory.incipit	@ltx/gr_gr_cog/me.m12.d13:meVE.SticGlory.incipit
ltx/gr_redirects_goarch/me.m12.d13:meVE.SticGlory.melody	@ltx/gr_gr_cog/me.m12.d13:meVE.SticGlory.melody
ltx/gr_redirects_goarch/me.m12.d13:meVE.SticGlory.mode	@ltx/gr_gr_cog/me.m12.d13:meVE.SticGlory.mode
ltx/gr_redirects_goarch/me.m12.d13:meVE.SticGlory.text	@ltx/gr_gr_cog/me.m12.d13:meVE.SticGlory.text
ltx/gr_redirects_goarch/me.m12.d13:meVE.SticStavrotheotokion.greekmelody	@ltx/gr_gr_cog/me.m12.d13:meVE.SticStavrotheotokion.greekmelody
ltx/gr_redirects_goarch/me.m12.d13:meVE.SticStavrotheotokion.incipit	@ltx/gr_gr_cog/me.m12.d13:meVE.SticStavrotheotokion.incipit
ltx/gr_redirects_goarch/me.m12.d13:meVE.SticStavrotheotokion.melody	@ltx/gr_gr_cog/me.m12.d13:meVE.SticStavrotheotokion.melody
ltx/gr_redirects_goarch/me.m12.d13:meVE.SticStavrotheotokion.mode	@ltx/gr_gr_cog/me.m12.d13:meVE.SticStavrotheotokion.mode
ltx/gr_redirects_goarch/me.m12.d13:meVE.SticStavrotheotokion.text	@ltx/gr_gr_cog/me.m12.d13:meVE.SticStavrotheotokion.text
ltx/gr_redirects_goarch/me.m12.d13:meVE.SticTheotokion.incipit	@ltx/gr_gr_cog/me.m12.d13:meVE.SticTheotokion.incipit
ltx/gr_redirects_goarch/me.m12.d13:meVE.SticTheotokion.melody	@ltx/gr_gr_cog/me.m12.d13:meVE.SticTheotokion.melody
ltx/gr_redirects_goarch/me.m12.d13:meVE.SticTheotokion.mode	@ltx/gr_gr_cog/me.m12.d13:meVE.SticTheotokion.mode
ltx/gr_redirects_goarch/me.m12.d13:meVE.SticTheotokion.text	@ltx/gr_gr_cog/me.m12.d13:meVE.SticTheotokion.text
ltx/gr_redirects_goarch/me.m12.d13:meVE.Stichera01.greekmelody	@ltx/gr_gr_cog/me.m12.d13:meVE.Stichera01.greekmelody
ltx/gr_redirects_goarch/me.m12.d13:meVE.Stichera01.incipit	@ltx/gr_gr_cog/me.m12.d13:meVE.Stichera01.incipit
ltx/gr_redirects_goarch/me.m12.d13:meVE.Stichera01.melody	@ltx/gr_gr_cog/me.m12.d13:meVE.Stichera01.melody
ltx/gr_redirects_goarch/me.m12.d13:meVE.Stichera01.mode	@ltx/gr_gr_cog/me.m12.d13:meVE.Stichera01.mode
ltx/gr_redirects_goarch/me.m12.d13:meVE.Stichera01.text	@ltx/gr_gr_cog/me.m12.d13:meVE.Stichera01.text
ltx/gr_redirects_goarch/me.m12.d13:meVE.Stichera02.incipit	@ltx/gr_gr_cog/me.m12.d13:meVE.Stichera02.incipit
ltx/gr_redirects_goarch/me.m12.d13:meVE.Stichera02.melody	@ltx/gr_gr_cog/me.m12.d13:meVE.Stichera02.melody
ltx/gr_redirects_goarch/me.m12.d13:meVE.Stichera02.mode	@ltx/gr_gr_cog/me.m12.d13:meVE.Stichera02.mode
ltx/gr_redirects_goarch/me.m12.d13:meVE.Stichera02.text	@ltx/gr_gr_cog/me.m12.d13:meVE.Stichera02.text
ltx/gr_redirects_goarch/me.m12.d13:meVE.Stichera03.incipit	@ltx/gr_gr_cog/me.m12.d13:meVE.Stichera03.incipit
ltx/gr_redirects_goarch/me.m12.d13:meVE.Stichera03.melody	@ltx/gr_gr_cog/me.m12.d13:meVE.Stichera03.melody
ltx/gr_redirects_goarch/me.m12.d13:meVE.Stichera03.mode	@ltx/gr_gr_cog/me.m12.d13:meVE.Stichera03.mode
ltx/gr_redirects_goarch/me.m12.d13:meVE.Stichera03.text	@ltx/gr_gr_cog/me.m12.d13:meVE.Stichera03.text
ltx/gr_redirects_goarch/me.m12.d13:meVE.Stichera04.greekmelody	@ltx/gr_gr_cog/me.m12.d13:meVE.Stichera04.greekmelody
ltx/gr_redirects_goarch/me.m12.d13:meVE.Stichera04.incipit	@ltx/gr_gr_cog/me.m12.d13:meVE.Stichera04.incipit
ltx/gr_redirects_goarch/me.m12.d13:meVE.Stichera04.melody	@ltx/gr_gr_cog/me.m12.d13:meVE.Stichera04.melody
ltx/gr_redirects_goarch/me.m12.d13:meVE.Stichera04.mode	@ltx/gr_gr_cog/me.m12.d13:meVE.Stichera04.mode
ltx/gr_redirects_goarch/me.m12.d13:meVE.Stichera04.text	@ltx/gr_gr_cog/me.m12.d13:meVE.Stichera04.text
ltx/gr_redirects_goarch/me.m12.d13:meVE.Stichera05.incipit	@ltx/gr_gr_cog/me.m12.d13:meVE.Stichera05.incipit
ltx/gr_redirects_goarch/me.m12.d13:meVE.Stichera05.melody	@ltx/gr_gr_cog/me.m12.d13:meVE.Stichera05.melody
ltx/gr_redirects_goarch/me.m12.d13:meVE.Stichera05.mode	@ltx/gr_gr_cog/me.m12.d13:meVE.Stichera05.mode
ltx/gr_redirects_goarch/me.m12.d13:meVE.Stichera05.text	@ltx/gr_gr_cog/me.m12.d13:meVE.Stichera05.text
ltx/gr_redirects_goarch/me.m12.d13:meVE.Stichera06.incipit	@ltx/gr_gr_cog/me.m12.d13:meVE.Stichera06.incipit
ltx/gr_redirects_goarch/me.m12.d13:meVE.Stichera06.melody	@ltx/gr_gr_cog/me.m12.d13:meVE.Stichera06.melody
ltx/gr_redirects_goarch/me.m12.d13:meVE.Stichera06.mode	@ltx/gr_gr_cog/me.m12.d13:meVE.Stichera06.mode
ltx/gr_redirects_goarch/me.m12.d13:meVE.Stichera06.text	@ltx/gr_gr_cog/me.m12.d13:meVE.Stichera06.text
