ltx/gr_redirects_goarch/le.pr.tr.d069:lemcH1.Prophecy.book_abbr	@ltx/gr_gr_cog/le.pr.tr.d069:lemcH1.Prophecy.book_abbr
ltx/gr_redirects_goarch/le.pr.tr.d069:lemcH1.Prophecy.book_string	@ltx/gr_gr_cog/le.pr.tr.d069:lemcH1.Prophecy.book_string
ltx/gr_redirects_goarch/le.pr.tr.d069:lemcH1.Prophecy.chapverse	@ltx/gr_gr_cog/le.pr.tr.d069:lemcH1.Prophecy.chapverse
ltx/gr_redirects_goarch/le.pr.tr.d069:lemcH1.Prophecy.incipit	@ltx/gr_gr_cog/le.pr.tr.d069:lemcH1.Prophecy.incipit
ltx/gr_redirects_goarch/le.pr.tr.d069:lemcH1.Prophecy.text	@ltx/gr_gr_cog/le.pr.tr.d069:lemcH1.Prophecy.text
ltx/gr_redirects_goarch/le.pr.tr.d069:lemcH1.Prophecy.title	@ltx/gr_gr_cog/le.pr.tr.d069:lemcH1.Prophecy.title
ltx/gr_redirects_goarch/le.pr.tr.d069:lemcH1.Prophecy.title_abbr	@ltx/gr_gr_cog/le.pr.tr.d069:lemcH1.Prophecy.title_abbr
ltx/gr_redirects_goarch/le.pr.tr.d069:lemcH1.Prophecy.version	@ltx/gr_gr_cog/le.pr.tr.d069:lemcH1.Prophecy.version
ltx/gr_redirects_goarch/le.pr.tr.d069:lemcH3.Prophecy.book_abbr	@ltx/gr_gr_cog/le.pr.tr.d069:lemcH3.Prophecy.book_abbr
ltx/gr_redirects_goarch/le.pr.tr.d069:lemcH3.Prophecy.book_string	@ltx/gr_gr_cog/le.pr.tr.d069:lemcH3.Prophecy.book_string
ltx/gr_redirects_goarch/le.pr.tr.d069:lemcH3.Prophecy.chapverse	@ltx/gr_gr_cog/le.pr.tr.d069:lemcH3.Prophecy.chapverse
ltx/gr_redirects_goarch/le.pr.tr.d069:lemcH3.Prophecy.text	@ltx/gr_gr_cog/le.pr.tr.d069:lemcH3.Prophecy.text
ltx/gr_redirects_goarch/le.pr.tr.d069:lemcH3.Prophecy.title	@ltx/gr_gr_cog/le.pr.tr.d069:lemcH3.Prophecy.title
ltx/gr_redirects_goarch/le.pr.tr.d069:lemcH3.Prophecy.title_abbr	@ltx/gr_gr_cog/le.pr.tr.d069:lemcH3.Prophecy.title_abbr
ltx/gr_redirects_goarch/le.pr.tr.d069:lemcH3.Prophecy.version	@ltx/gr_gr_cog/le.pr.tr.d069:lemcH3.Prophecy.version
ltx/gr_redirects_goarch/le.pr.tr.d069:lemcH6.Prophecy.book_abbr	@ltx/gr_gr_cog/le.pr.tr.d069:lemcH6.Prophecy.book_abbr
ltx/gr_redirects_goarch/le.pr.tr.d069:lemcH6.Prophecy.book_string	@ltx/gr_gr_cog/le.pr.tr.d069:lemcH6.Prophecy.book_string
ltx/gr_redirects_goarch/le.pr.tr.d069:lemcH6.Prophecy.chapverse	@ltx/gr_gr_cog/le.pr.tr.d069:lemcH6.Prophecy.chapverse
ltx/gr_redirects_goarch/le.pr.tr.d069:lemcH6.Prophecy.incipit	@ltx/gr_gr_cog/le.pr.tr.d069:lemcH6.Prophecy.incipit
ltx/gr_redirects_goarch/le.pr.tr.d069:lemcH6.Prophecy.text	@ltx/gr_gr_cog/le.pr.tr.d069:lemcH6.Prophecy.text
ltx/gr_redirects_goarch/le.pr.tr.d069:lemcH6.Prophecy.title	@ltx/gr_gr_cog/le.pr.tr.d069:lemcH6.Prophecy.title
ltx/gr_redirects_goarch/le.pr.tr.d069:lemcH6.Prophecy.title_abbr	@ltx/gr_gr_cog/le.pr.tr.d069:lemcH6.Prophecy.title_abbr
ltx/gr_redirects_goarch/le.pr.tr.d069:lemcH6.Prophecy.version	@ltx/gr_gr_cog/le.pr.tr.d069:lemcH6.Prophecy.version
ltx/gr_redirects_goarch/le.pr.tr.d069:lemcH9.Prophecy.book_abbr	@ltx/gr_gr_cog/le.pr.tr.d069:lemcH9.Prophecy.book_abbr
ltx/gr_redirects_goarch/le.pr.tr.d069:lemcH9.Prophecy.book_string	@ltx/gr_gr_cog/le.pr.tr.d069:lemcH9.Prophecy.book_string
ltx/gr_redirects_goarch/le.pr.tr.d069:lemcH9.Prophecy.chapverse	@ltx/gr_gr_cog/le.pr.tr.d069:lemcH9.Prophecy.chapverse
ltx/gr_redirects_goarch/le.pr.tr.d069:lemcH9.Prophecy.text	@ltx/gr_gr_cog/le.pr.tr.d069:lemcH9.Prophecy.text
ltx/gr_redirects_goarch/le.pr.tr.d069:lemcH9.Prophecy.title	@ltx/gr_gr_cog/le.pr.tr.d069:lemcH9.Prophecy.title
ltx/gr_redirects_goarch/le.pr.tr.d069:lemcH9.Prophecy.title_abbr	@ltx/gr_gr_cog/le.pr.tr.d069:lemcH9.Prophecy.title_abbr
ltx/gr_redirects_goarch/le.pr.tr.d069:lemcH9.Prophecy.version	@ltx/gr_gr_cog/le.pr.tr.d069:lemcH9.Prophecy.version
ltx/gr_redirects_goarch/le.pr.tr.d069:lemcTE.reading1.book_abbr	@ltx/gr_gr_cog/le.pr.tr.d069:lemcTE.reading1.book_abbr
ltx/gr_redirects_goarch/le.pr.tr.d069:lemcTE.reading1.book_string	@ltx/gr_gr_cog/le.pr.tr.d069:lemcTE.reading1.book_string
ltx/gr_redirects_goarch/le.pr.tr.d069:lemcTE.reading1.chapverse	@ltx/gr_gr_cog/le.pr.tr.d069:lemcTE.reading1.chapverse
ltx/gr_redirects_goarch/le.pr.tr.d069:lemcTE.reading1.incipit	@ltx/gr_gr_cog/le.pr.tr.d069:lemcTE.reading1.incipit
ltx/gr_redirects_goarch/le.pr.tr.d069:lemcTE.reading1.text	@ltx/gr_gr_cog/le.pr.tr.d069:lemcTE.reading1.text
ltx/gr_redirects_goarch/le.pr.tr.d069:lemcTE.reading1.title	@ltx/gr_gr_cog/le.pr.tr.d069:lemcTE.reading1.title
ltx/gr_redirects_goarch/le.pr.tr.d069:lemcTE.reading1.title_abbr	@ltx/gr_gr_cog/le.pr.tr.d069:lemcTE.reading1.title_abbr
ltx/gr_redirects_goarch/le.pr.tr.d069:lemcTE.reading1.version	@ltx/gr_gr_cog/le.pr.tr.d069:lemcTE.reading1.version
ltx/gr_redirects_goarch/le.pr.tr.d069:lemcVE.reading1.book_abbr	@ltx/gr_gr_cog/le.pr.tr.d069:lemcVE.reading1.book_abbr
ltx/gr_redirects_goarch/le.pr.tr.d069:lemcVE.reading1.book_string	@ltx/gr_gr_cog/le.pr.tr.d069:lemcVE.reading1.book_string
ltx/gr_redirects_goarch/le.pr.tr.d069:lemcVE.reading1.chapverse	@ltx/gr_gr_cog/le.pr.tr.d069:lemcVE.reading1.chapverse
ltx/gr_redirects_goarch/le.pr.tr.d069:lemcVE.reading1.incipit	@ltx/gr_gr_cog/le.pr.tr.d069:lemcVE.reading1.incipit
ltx/gr_redirects_goarch/le.pr.tr.d069:lemcVE.reading1.text	@ltx/gr_gr_cog/le.pr.tr.d069:lemcVE.reading1.text
ltx/gr_redirects_goarch/le.pr.tr.d069:lemcVE.reading1.title	@ltx/gr_gr_cog/le.pr.tr.d069:lemcVE.reading1.title
ltx/gr_redirects_goarch/le.pr.tr.d069:lemcVE.reading1.title_abbr	@ltx/gr_gr_cog/le.pr.tr.d069:lemcVE.reading1.title_abbr
ltx/gr_redirects_goarch/le.pr.tr.d069:lemcVE.reading1.version	@ltx/gr_gr_cog/le.pr.tr.d069:lemcVE.reading1.version
ltx/gr_redirects_goarch/le.pr.tr.d069:lemcVE.reading2.book_abbr	@ltx/gr_gr_cog/le.pr.tr.d069:lemcVE.reading2.book_abbr
ltx/gr_redirects_goarch/le.pr.tr.d069:lemcVE.reading2.book_string	@ltx/gr_gr_cog/le.pr.tr.d069:lemcVE.reading2.book_string
ltx/gr_redirects_goarch/le.pr.tr.d069:lemcVE.reading2.chapverse	@ltx/gr_gr_cog/le.pr.tr.d069:lemcVE.reading2.chapverse
ltx/gr_redirects_goarch/le.pr.tr.d069:lemcVE.reading2.incipit	@ltx/gr_gr_cog/le.pr.tr.d069:lemcVE.reading2.incipit
ltx/gr_redirects_goarch/le.pr.tr.d069:lemcVE.reading2.text	@ltx/gr_gr_cog/le.pr.tr.d069:lemcVE.reading2.text
ltx/gr_redirects_goarch/le.pr.tr.d069:lemcVE.reading2.title	@ltx/gr_gr_cog/le.pr.tr.d069:lemcVE.reading2.title
ltx/gr_redirects_goarch/le.pr.tr.d069:lemcVE.reading2.title_abbr	@ltx/gr_gr_cog/le.pr.tr.d069:lemcVE.reading2.title_abbr
ltx/gr_redirects_goarch/le.pr.tr.d069:lemcVE.reading2.version	@ltx/gr_gr_cog/le.pr.tr.d069:lemcVE.reading2.version
