ltx/gr_redirects_goarch/me.m09.d27:meDA.commemoration.first	@ltx/gr_gr_cog/me.m09.d27:meDA.commemoration.first
ltx/gr_redirects_goarch/me.m09.d27:meDA.commemoration.first_name	@ltx/gr_gr_cog/me.m09.d27:meDA.commemoration.first_name
ltx/gr_redirects_goarch/me.m09.d27:meDA.commemoration.first_short	@ltx/gr_gr_cog/me.m09.d27:meDA.commemoration.first_short
ltx/gr_redirects_goarch/me.m09.d27:meDA.commemoration.first_title	@ltx/gr_gr_cog/me.m09.d27:meDA.commemoration.first_title
ltx/gr_redirects_goarch/me.m09.d27:meDA.commemoration.full	@ltx/gr_gr_cog/me.m09.d27:meDA.commemoration.full
ltx/gr_redirects_goarch/me.m09.d27:meDA.commemoration.second_name	@ltx/gr_gr_cog/me.m09.d27:meDA.commemoration.second_name
ltx/gr_redirects_goarch/me.m09.d27:meDA.commemoration.second_title	@ltx/gr_gr_cog/me.m09.d27:meDA.commemoration.second_title
ltx/gr_redirects_goarch/me.m09.d27:meDA.date	@ltx/gr_gr_cog/me.m09.d27:meDA.date
ltx/gr_redirects_goarch/me.m09.d27:meDA.fordate	@ltx/gr_gr_cog/me.m09.d27:meDA.fordate
ltx/gr_redirects_goarch/me.m09.d27:meDA.insert1	@ltx/gr_gr_cog/me.m09.d27:meDA.insert1
ltx/gr_redirects_goarch/me.m09.d27:meDA.insert2	@ltx/gr_gr_cog/me.m09.d27:meDA.insert2
ltx/gr_redirects_goarch/me.m09.d27:meDA.note	@ltx/gr_gr_cog/me.m09.d27:meDA.note
ltx/gr_redirects_goarch/me.m09.d27:meDA.pdfcoverdate	@ltx/gr_gr_cog/me.m09.d27:meDA.pdfcoverdate
ltx/gr_redirects_goarch/me.m09.d27:meDA.pdfheaderdate	@ltx/gr_gr_cog/me.m09.d27:meDA.pdfheaderdate
ltx/gr_redirects_goarch/me.m09.d27:meHO.commemorations	@ltx/gr_gr_cog/me.m09.d27:meHO.commemorations
ltx/gr_redirects_goarch/me.m09.d27:meHO.note1	@ltx/gr_gr_cog/me.m09.d27:meHO.note1
ltx/gr_redirects_goarch/me.m09.d27:meHO.note2	@ltx/gr_gr_cog/me.m09.d27:meHO.note2
ltx/gr_redirects_goarch/me.m09.d27:meHO.number	@ltx/gr_gr_cog/me.m09.d27:meHO.number
ltx/gr_redirects_goarch/me.m09.d27:meHO.rank	@ltx/gr_gr_cog/me.m09.d27:meHO.rank
ltx/gr_redirects_goarch/me.m09.d27:meLE.commemoration1	@ltx/gr_gr_cog/me.m09.d27:meLE.commemoration1
ltx/gr_redirects_goarch/me.m09.d27:meLE.commemoration2	@ltx/gr_gr_cog/me.m09.d27:meLE.commemoration2
ltx/gr_redirects_goarch/me.m09.d27:meLI.Kontakion1.greekmelody	@ltx/gr_gr_cog/me.m09.d27:meLI.Kontakion1.greekmelody
ltx/gr_redirects_goarch/me.m09.d27:meLI.Kontakion1.incipit	@ltx/gr_gr_cog/me.m09.d27:meLI.Kontakion1.incipit
ltx/gr_redirects_goarch/me.m09.d27:meLI.Kontakion1.melody	@ltx/gr_gr_cog/me.m09.d27:meLI.Kontakion1.melody
ltx/gr_redirects_goarch/me.m09.d27:meLI.Kontakion1.mode	@ltx/gr_gr_cog/me.m09.d27:meLI.Kontakion1.mode
ltx/gr_redirects_goarch/me.m09.d27:meLI.Kontakion1.text	@ltx/gr_gr_cog/me.m09.d27:meLI.Kontakion1.text
ltx/gr_redirects_goarch/me.m09.d27:meLI.Megalynarion.text	@ltx/gr_gr_cog/me.m09.d27:meLI.Megalynarion.text
ltx/gr_redirects_goarch/me.m09.d27:meMA.C1.acrostic.notice1	@ltx/gr_gr_cog/me.m09.d27:meMA.C1.acrostic.notice1
ltx/gr_redirects_goarch/me.m09.d27:meMA.C1.acrostic.text	@ltx/gr_gr_cog/me.m09.d27:meMA.C1.acrostic.text
ltx/gr_redirects_goarch/me.m09.d27:meMA.C1.acrostic.title	@ltx/gr_gr_cog/me.m09.d27:meMA.C1.acrostic.title
ltx/gr_redirects_goarch/me.m09.d27:meMA.C1.title	@ltx/gr_gr_cog/me.m09.d27:meMA.C1.title
ltx/gr_redirects_goarch/me.m09.d27:meMA.C1.verse	@ltx/gr_gr_cog/me.m09.d27:meMA.C1.verse
ltx/gr_redirects_goarch/me.m09.d27:meMA.ExapTheotokion.incipit	@ltx/gr_gr_cog/me.m09.d27:meMA.ExapTheotokion.incipit
ltx/gr_redirects_goarch/me.m09.d27:meMA.ExapTheotokion.melody	@ltx/gr_gr_cog/me.m09.d27:meMA.ExapTheotokion.melody
ltx/gr_redirects_goarch/me.m09.d27:meMA.ExapTheotokion.mode	@ltx/gr_gr_cog/me.m09.d27:meMA.ExapTheotokion.mode
ltx/gr_redirects_goarch/me.m09.d27:meMA.ExapTheotokion.text	@ltx/gr_gr_cog/me.m09.d27:meMA.ExapTheotokion.text
ltx/gr_redirects_goarch/me.m09.d27:meMA.Exaposteilarion1.greekmelody	@ltx/gr_gr_cog/me.m09.d27:meMA.Exaposteilarion1.greekmelody
ltx/gr_redirects_goarch/me.m09.d27:meMA.Exaposteilarion1.incipit	@ltx/gr_gr_cog/me.m09.d27:meMA.Exaposteilarion1.incipit
ltx/gr_redirects_goarch/me.m09.d27:meMA.Exaposteilarion1.melody	@ltx/gr_gr_cog/me.m09.d27:meMA.Exaposteilarion1.melody
ltx/gr_redirects_goarch/me.m09.d27:meMA.Exaposteilarion1.mode	@ltx/gr_gr_cog/me.m09.d27:meMA.Exaposteilarion1.mode
ltx/gr_redirects_goarch/me.m09.d27:meMA.Exaposteilarion1.text	@ltx/gr_gr_cog/me.m09.d27:meMA.Exaposteilarion1.text
ltx/gr_redirects_goarch/me.m09.d27:meMA.Kontakion1.greekmelody	@ltx/gr_gr_cog/me.m09.d27:meMA.Kontakion1.greekmelody
ltx/gr_redirects_goarch/me.m09.d27:meMA.Kontakion1.incipit	@ltx/gr_gr_cog/me.m09.d27:meMA.Kontakion1.incipit
ltx/gr_redirects_goarch/me.m09.d27:meMA.Kontakion1.melody	@ltx/gr_gr_cog/me.m09.d27:meMA.Kontakion1.melody
ltx/gr_redirects_goarch/me.m09.d27:meMA.Kontakion1.mode	@ltx/gr_gr_cog/me.m09.d27:meMA.Kontakion1.mode
ltx/gr_redirects_goarch/me.m09.d27:meMA.Kontakion1.text	@ltx/gr_gr_cog/me.m09.d27:meMA.Kontakion1.text
ltx/gr_redirects_goarch/me.m09.d27:meMA.Ode1C11.greekmelody	@ltx/gr_gr_cog/me.m09.d27:meMA.Ode1C11.greekmelody
ltx/gr_redirects_goarch/me.m09.d27:meMA.Ode1C11.incipit	@ltx/gr_gr_cog/me.m09.d27:meMA.Ode1C11.incipit
ltx/gr_redirects_goarch/me.m09.d27:meMA.Ode1C11.melody	@ltx/gr_gr_cog/me.m09.d27:meMA.Ode1C11.melody
ltx/gr_redirects_goarch/me.m09.d27:meMA.Ode1C11.mode	@ltx/gr_gr_cog/me.m09.d27:meMA.Ode1C11.mode
ltx/gr_redirects_goarch/me.m09.d27:meMA.Ode1C11.ode	@ltx/gr_gr_cog/me.m09.d27:meMA.Ode1C11.ode
ltx/gr_redirects_goarch/me.m09.d27:meMA.Ode1C11.text	@ltx/gr_gr_cog/me.m09.d27:meMA.Ode1C11.text
ltx/gr_redirects_goarch/me.m09.d27:meMA.Ode1C12.incipit	@ltx/gr_gr_cog/me.m09.d27:meMA.Ode1C12.incipit
ltx/gr_redirects_goarch/me.m09.d27:meMA.Ode1C12.melody	@ltx/gr_gr_cog/me.m09.d27:meMA.Ode1C12.melody
ltx/gr_redirects_goarch/me.m09.d27:meMA.Ode1C12.mode	@ltx/gr_gr_cog/me.m09.d27:meMA.Ode1C12.mode
ltx/gr_redirects_goarch/me.m09.d27:meMA.Ode1C12.ode	@ltx/gr_gr_cog/me.m09.d27:meMA.Ode1C12.ode
ltx/gr_redirects_goarch/me.m09.d27:meMA.Ode1C12.text	@ltx/gr_gr_cog/me.m09.d27:meMA.Ode1C12.text
ltx/gr_redirects_goarch/me.m09.d27:meMA.Ode1C13.incipit	@ltx/gr_gr_cog/me.m09.d27:meMA.Ode1C13.incipit
ltx/gr_redirects_goarch/me.m09.d27:meMA.Ode1C13.melody	@ltx/gr_gr_cog/me.m09.d27:meMA.Ode1C13.melody
ltx/gr_redirects_goarch/me.m09.d27:meMA.Ode1C13.mode	@ltx/gr_gr_cog/me.m09.d27:meMA.Ode1C13.mode
ltx/gr_redirects_goarch/me.m09.d27:meMA.Ode1C13.ode	@ltx/gr_gr_cog/me.m09.d27:meMA.Ode1C13.ode
ltx/gr_redirects_goarch/me.m09.d27:meMA.Ode1C13.text	@ltx/gr_gr_cog/me.m09.d27:meMA.Ode1C13.text
ltx/gr_redirects_goarch/me.m09.d27:meMA.Ode1C14.incipit	@ltx/gr_gr_cog/me.m09.d27:meMA.Ode1C14.incipit
ltx/gr_redirects_goarch/me.m09.d27:meMA.Ode1C14.melody	@ltx/gr_gr_cog/me.m09.d27:meMA.Ode1C14.melody
ltx/gr_redirects_goarch/me.m09.d27:meMA.Ode1C14.mode	@ltx/gr_gr_cog/me.m09.d27:meMA.Ode1C14.mode
ltx/gr_redirects_goarch/me.m09.d27:meMA.Ode1C14.ode	@ltx/gr_gr_cog/me.m09.d27:meMA.Ode1C14.ode
ltx/gr_redirects_goarch/me.m09.d27:meMA.Ode1C14.text	@ltx/gr_gr_cog/me.m09.d27:meMA.Ode1C14.text
ltx/gr_redirects_goarch/me.m09.d27:meMA.Ode1C1T.incipit	@ltx/gr_gr_cog/me.m09.d27:meMA.Ode1C1T.incipit
ltx/gr_redirects_goarch/me.m09.d27:meMA.Ode1C1T.melody	@ltx/gr_gr_cog/me.m09.d27:meMA.Ode1C1T.melody
ltx/gr_redirects_goarch/me.m09.d27:meMA.Ode1C1T.mode	@ltx/gr_gr_cog/me.m09.d27:meMA.Ode1C1T.mode
ltx/gr_redirects_goarch/me.m09.d27:meMA.Ode1C1T.ode	@ltx/gr_gr_cog/me.m09.d27:meMA.Ode1C1T.ode
ltx/gr_redirects_goarch/me.m09.d27:meMA.Ode1C1T.text	@ltx/gr_gr_cog/me.m09.d27:meMA.Ode1C1T.text
ltx/gr_redirects_goarch/me.m09.d27:meMA.Ode3C11.greekmelody	@ltx/gr_gr_cog/me.m09.d27:meMA.Ode3C11.greekmelody
ltx/gr_redirects_goarch/me.m09.d27:meMA.Ode3C11.incipit	@ltx/gr_gr_cog/me.m09.d27:meMA.Ode3C11.incipit
ltx/gr_redirects_goarch/me.m09.d27:meMA.Ode3C11.melody	@ltx/gr_gr_cog/me.m09.d27:meMA.Ode3C11.melody
ltx/gr_redirects_goarch/me.m09.d27:meMA.Ode3C11.mode	@ltx/gr_gr_cog/me.m09.d27:meMA.Ode3C11.mode
ltx/gr_redirects_goarch/me.m09.d27:meMA.Ode3C11.ode	@ltx/gr_gr_cog/me.m09.d27:meMA.Ode3C11.ode
ltx/gr_redirects_goarch/me.m09.d27:meMA.Ode3C11.text	@ltx/gr_gr_cog/me.m09.d27:meMA.Ode3C11.text
ltx/gr_redirects_goarch/me.m09.d27:meMA.Ode3C12.incipit	@ltx/gr_gr_cog/me.m09.d27:meMA.Ode3C12.incipit
ltx/gr_redirects_goarch/me.m09.d27:meMA.Ode3C12.melody	@ltx/gr_gr_cog/me.m09.d27:meMA.Ode3C12.melody
ltx/gr_redirects_goarch/me.m09.d27:meMA.Ode3C12.mode	@ltx/gr_gr_cog/me.m09.d27:meMA.Ode3C12.mode
ltx/gr_redirects_goarch/me.m09.d27:meMA.Ode3C12.ode	@ltx/gr_gr_cog/me.m09.d27:meMA.Ode3C12.ode
ltx/gr_redirects_goarch/me.m09.d27:meMA.Ode3C12.text	@ltx/gr_gr_cog/me.m09.d27:meMA.Ode3C12.text
ltx/gr_redirects_goarch/me.m09.d27:meMA.Ode3C13.incipit	@ltx/gr_gr_cog/me.m09.d27:meMA.Ode3C13.incipit
ltx/gr_redirects_goarch/me.m09.d27:meMA.Ode3C13.melody	@ltx/gr_gr_cog/me.m09.d27:meMA.Ode3C13.melody
ltx/gr_redirects_goarch/me.m09.d27:meMA.Ode3C13.mode	@ltx/gr_gr_cog/me.m09.d27:meMA.Ode3C13.mode
ltx/gr_redirects_goarch/me.m09.d27:meMA.Ode3C13.ode	@ltx/gr_gr_cog/me.m09.d27:meMA.Ode3C13.ode
ltx/gr_redirects_goarch/me.m09.d27:meMA.Ode3C13.text	@ltx/gr_gr_cog/me.m09.d27:meMA.Ode3C13.text
ltx/gr_redirects_goarch/me.m09.d27:meMA.Ode3C1T.incipit	@ltx/gr_gr_cog/me.m09.d27:meMA.Ode3C1T.incipit
ltx/gr_redirects_goarch/me.m09.d27:meMA.Ode3C1T.melody	@ltx/gr_gr_cog/me.m09.d27:meMA.Ode3C1T.melody
ltx/gr_redirects_goarch/me.m09.d27:meMA.Ode3C1T.mode	@ltx/gr_gr_cog/me.m09.d27:meMA.Ode3C1T.mode
ltx/gr_redirects_goarch/me.m09.d27:meMA.Ode3C1T.ode	@ltx/gr_gr_cog/me.m09.d27:meMA.Ode3C1T.ode
ltx/gr_redirects_goarch/me.m09.d27:meMA.Ode3C1T.text	@ltx/gr_gr_cog/me.m09.d27:meMA.Ode3C1T.text
ltx/gr_redirects_goarch/me.m09.d27:meMA.Ode3H.greekmelody	@ltx/gr_gr_cog/me.m09.d27:meMA.Ode3H.greekmelody
ltx/gr_redirects_goarch/me.m09.d27:meMA.Ode3H.incipit	@ltx/gr_gr_cog/me.m09.d27:meMA.Ode3H.incipit
ltx/gr_redirects_goarch/me.m09.d27:meMA.Ode3H.melody	@ltx/gr_gr_cog/me.m09.d27:meMA.Ode3H.melody
ltx/gr_redirects_goarch/me.m09.d27:meMA.Ode3H.mode	@ltx/gr_gr_cog/me.m09.d27:meMA.Ode3H.mode
ltx/gr_redirects_goarch/me.m09.d27:meMA.Ode3H.ode	@ltx/gr_gr_cog/me.m09.d27:meMA.Ode3H.ode
ltx/gr_redirects_goarch/me.m09.d27:meMA.Ode3H.text	@ltx/gr_gr_cog/me.m09.d27:meMA.Ode3H.text
ltx/gr_redirects_goarch/me.m09.d27:meMA.Ode3Kathisma1.greekmelody	@ltx/gr_gr_cog/me.m09.d27:meMA.Ode3Kathisma1.greekmelody
ltx/gr_redirects_goarch/me.m09.d27:meMA.Ode3Kathisma1.incipit	@ltx/gr_gr_cog/me.m09.d27:meMA.Ode3Kathisma1.incipit
ltx/gr_redirects_goarch/me.m09.d27:meMA.Ode3Kathisma1.melody	@ltx/gr_gr_cog/me.m09.d27:meMA.Ode3Kathisma1.melody
ltx/gr_redirects_goarch/me.m09.d27:meMA.Ode3Kathisma1.mode	@ltx/gr_gr_cog/me.m09.d27:meMA.Ode3Kathisma1.mode
ltx/gr_redirects_goarch/me.m09.d27:meMA.Ode3Kathisma1.text	@ltx/gr_gr_cog/me.m09.d27:meMA.Ode3Kathisma1.text
ltx/gr_redirects_goarch/me.m09.d27:meMA.Ode3KathismaSt.incipit	@ltx/gr_gr_cog/me.m09.d27:meMA.Ode3KathismaSt.incipit
ltx/gr_redirects_goarch/me.m09.d27:meMA.Ode3KathismaSt.melody	@ltx/gr_gr_cog/me.m09.d27:meMA.Ode3KathismaSt.melody
ltx/gr_redirects_goarch/me.m09.d27:meMA.Ode3KathismaSt.mode	@ltx/gr_gr_cog/me.m09.d27:meMA.Ode3KathismaSt.mode
ltx/gr_redirects_goarch/me.m09.d27:meMA.Ode3KathismaSt.text	@ltx/gr_gr_cog/me.m09.d27:meMA.Ode3KathismaSt.text
ltx/gr_redirects_goarch/me.m09.d27:meMA.Ode3KathismaT.incipit	@ltx/gr_gr_cog/me.m09.d27:meMA.Ode3KathismaT.incipit
ltx/gr_redirects_goarch/me.m09.d27:meMA.Ode3KathismaT.melody	@ltx/gr_gr_cog/me.m09.d27:meMA.Ode3KathismaT.melody
ltx/gr_redirects_goarch/me.m09.d27:meMA.Ode3KathismaT.mode	@ltx/gr_gr_cog/me.m09.d27:meMA.Ode3KathismaT.mode
ltx/gr_redirects_goarch/me.m09.d27:meMA.Ode3KathismaT.text	@ltx/gr_gr_cog/me.m09.d27:meMA.Ode3KathismaT.text
ltx/gr_redirects_goarch/me.m09.d27:meMA.Ode4C11.greekmelody	@ltx/gr_gr_cog/me.m09.d27:meMA.Ode4C11.greekmelody
ltx/gr_redirects_goarch/me.m09.d27:meMA.Ode4C11.incipit	@ltx/gr_gr_cog/me.m09.d27:meMA.Ode4C11.incipit
ltx/gr_redirects_goarch/me.m09.d27:meMA.Ode4C11.melody	@ltx/gr_gr_cog/me.m09.d27:meMA.Ode4C11.melody
ltx/gr_redirects_goarch/me.m09.d27:meMA.Ode4C11.mode	@ltx/gr_gr_cog/me.m09.d27:meMA.Ode4C11.mode
ltx/gr_redirects_goarch/me.m09.d27:meMA.Ode4C11.ode	@ltx/gr_gr_cog/me.m09.d27:meMA.Ode4C11.ode
ltx/gr_redirects_goarch/me.m09.d27:meMA.Ode4C11.text	@ltx/gr_gr_cog/me.m09.d27:meMA.Ode4C11.text
ltx/gr_redirects_goarch/me.m09.d27:meMA.Ode4C12.incipit	@ltx/gr_gr_cog/me.m09.d27:meMA.Ode4C12.incipit
ltx/gr_redirects_goarch/me.m09.d27:meMA.Ode4C12.melody	@ltx/gr_gr_cog/me.m09.d27:meMA.Ode4C12.melody
ltx/gr_redirects_goarch/me.m09.d27:meMA.Ode4C12.mode	@ltx/gr_gr_cog/me.m09.d27:meMA.Ode4C12.mode
ltx/gr_redirects_goarch/me.m09.d27:meMA.Ode4C12.ode	@ltx/gr_gr_cog/me.m09.d27:meMA.Ode4C12.ode
ltx/gr_redirects_goarch/me.m09.d27:meMA.Ode4C12.text	@ltx/gr_gr_cog/me.m09.d27:meMA.Ode4C12.text
ltx/gr_redirects_goarch/me.m09.d27:meMA.Ode4C13.incipit	@ltx/gr_gr_cog/me.m09.d27:meMA.Ode4C13.incipit
ltx/gr_redirects_goarch/me.m09.d27:meMA.Ode4C13.melody	@ltx/gr_gr_cog/me.m09.d27:meMA.Ode4C13.melody
ltx/gr_redirects_goarch/me.m09.d27:meMA.Ode4C13.mode	@ltx/gr_gr_cog/me.m09.d27:meMA.Ode4C13.mode
ltx/gr_redirects_goarch/me.m09.d27:meMA.Ode4C13.ode	@ltx/gr_gr_cog/me.m09.d27:meMA.Ode4C13.ode
ltx/gr_redirects_goarch/me.m09.d27:meMA.Ode4C13.text	@ltx/gr_gr_cog/me.m09.d27:meMA.Ode4C13.text
ltx/gr_redirects_goarch/me.m09.d27:meMA.Ode4C14.incipit	@ltx/gr_gr_cog/me.m09.d27:meMA.Ode4C14.incipit
ltx/gr_redirects_goarch/me.m09.d27:meMA.Ode4C14.melody	@ltx/gr_gr_cog/me.m09.d27:meMA.Ode4C14.melody
ltx/gr_redirects_goarch/me.m09.d27:meMA.Ode4C14.mode	@ltx/gr_gr_cog/me.m09.d27:meMA.Ode4C14.mode
ltx/gr_redirects_goarch/me.m09.d27:meMA.Ode4C14.ode	@ltx/gr_gr_cog/me.m09.d27:meMA.Ode4C14.ode
ltx/gr_redirects_goarch/me.m09.d27:meMA.Ode4C14.text	@ltx/gr_gr_cog/me.m09.d27:meMA.Ode4C14.text
ltx/gr_redirects_goarch/me.m09.d27:meMA.Ode4C1T.incipit	@ltx/gr_gr_cog/me.m09.d27:meMA.Ode4C1T.incipit
ltx/gr_redirects_goarch/me.m09.d27:meMA.Ode4C1T.melody	@ltx/gr_gr_cog/me.m09.d27:meMA.Ode4C1T.melody
ltx/gr_redirects_goarch/me.m09.d27:meMA.Ode4C1T.mode	@ltx/gr_gr_cog/me.m09.d27:meMA.Ode4C1T.mode
ltx/gr_redirects_goarch/me.m09.d27:meMA.Ode4C1T.ode	@ltx/gr_gr_cog/me.m09.d27:meMA.Ode4C1T.ode
ltx/gr_redirects_goarch/me.m09.d27:meMA.Ode4C1T.text	@ltx/gr_gr_cog/me.m09.d27:meMA.Ode4C1T.text
ltx/gr_redirects_goarch/me.m09.d27:meMA.Ode5C11.greekmelody	@ltx/gr_gr_cog/me.m09.d27:meMA.Ode5C11.greekmelody
ltx/gr_redirects_goarch/me.m09.d27:meMA.Ode5C11.incipit	@ltx/gr_gr_cog/me.m09.d27:meMA.Ode5C11.incipit
ltx/gr_redirects_goarch/me.m09.d27:meMA.Ode5C11.melody	@ltx/gr_gr_cog/me.m09.d27:meMA.Ode5C11.melody
ltx/gr_redirects_goarch/me.m09.d27:meMA.Ode5C11.mode	@ltx/gr_gr_cog/me.m09.d27:meMA.Ode5C11.mode
ltx/gr_redirects_goarch/me.m09.d27:meMA.Ode5C11.ode	@ltx/gr_gr_cog/me.m09.d27:meMA.Ode5C11.ode
ltx/gr_redirects_goarch/me.m09.d27:meMA.Ode5C11.text	@ltx/gr_gr_cog/me.m09.d27:meMA.Ode5C11.text
ltx/gr_redirects_goarch/me.m09.d27:meMA.Ode5C12.incipit	@ltx/gr_gr_cog/me.m09.d27:meMA.Ode5C12.incipit
ltx/gr_redirects_goarch/me.m09.d27:meMA.Ode5C12.melody	@ltx/gr_gr_cog/me.m09.d27:meMA.Ode5C12.melody
ltx/gr_redirects_goarch/me.m09.d27:meMA.Ode5C12.mode	@ltx/gr_gr_cog/me.m09.d27:meMA.Ode5C12.mode
ltx/gr_redirects_goarch/me.m09.d27:meMA.Ode5C12.ode	@ltx/gr_gr_cog/me.m09.d27:meMA.Ode5C12.ode
ltx/gr_redirects_goarch/me.m09.d27:meMA.Ode5C12.text	@ltx/gr_gr_cog/me.m09.d27:meMA.Ode5C12.text
ltx/gr_redirects_goarch/me.m09.d27:meMA.Ode5C13.incipit	@ltx/gr_gr_cog/me.m09.d27:meMA.Ode5C13.incipit
ltx/gr_redirects_goarch/me.m09.d27:meMA.Ode5C13.melody	@ltx/gr_gr_cog/me.m09.d27:meMA.Ode5C13.melody
ltx/gr_redirects_goarch/me.m09.d27:meMA.Ode5C13.mode	@ltx/gr_gr_cog/me.m09.d27:meMA.Ode5C13.mode
ltx/gr_redirects_goarch/me.m09.d27:meMA.Ode5C13.ode	@ltx/gr_gr_cog/me.m09.d27:meMA.Ode5C13.ode
ltx/gr_redirects_goarch/me.m09.d27:meMA.Ode5C13.text	@ltx/gr_gr_cog/me.m09.d27:meMA.Ode5C13.text
ltx/gr_redirects_goarch/me.m09.d27:meMA.Ode5C1T.incipit	@ltx/gr_gr_cog/me.m09.d27:meMA.Ode5C1T.incipit
ltx/gr_redirects_goarch/me.m09.d27:meMA.Ode5C1T.melody	@ltx/gr_gr_cog/me.m09.d27:meMA.Ode5C1T.melody
ltx/gr_redirects_goarch/me.m09.d27:meMA.Ode5C1T.mode	@ltx/gr_gr_cog/me.m09.d27:meMA.Ode5C1T.mode
ltx/gr_redirects_goarch/me.m09.d27:meMA.Ode5C1T.ode	@ltx/gr_gr_cog/me.m09.d27:meMA.Ode5C1T.ode
ltx/gr_redirects_goarch/me.m09.d27:meMA.Ode5C1T.text	@ltx/gr_gr_cog/me.m09.d27:meMA.Ode5C1T.text
ltx/gr_redirects_goarch/me.m09.d27:meMA.Ode6C11.greekmelody	@ltx/gr_gr_cog/me.m09.d27:meMA.Ode6C11.greekmelody
ltx/gr_redirects_goarch/me.m09.d27:meMA.Ode6C11.incipit	@ltx/gr_gr_cog/me.m09.d27:meMA.Ode6C11.incipit
ltx/gr_redirects_goarch/me.m09.d27:meMA.Ode6C11.melody	@ltx/gr_gr_cog/me.m09.d27:meMA.Ode6C11.melody
ltx/gr_redirects_goarch/me.m09.d27:meMA.Ode6C11.mode	@ltx/gr_gr_cog/me.m09.d27:meMA.Ode6C11.mode
ltx/gr_redirects_goarch/me.m09.d27:meMA.Ode6C11.ode	@ltx/gr_gr_cog/me.m09.d27:meMA.Ode6C11.ode
ltx/gr_redirects_goarch/me.m09.d27:meMA.Ode6C11.text	@ltx/gr_gr_cog/me.m09.d27:meMA.Ode6C11.text
ltx/gr_redirects_goarch/me.m09.d27:meMA.Ode6C12.incipit	@ltx/gr_gr_cog/me.m09.d27:meMA.Ode6C12.incipit
ltx/gr_redirects_goarch/me.m09.d27:meMA.Ode6C12.melody	@ltx/gr_gr_cog/me.m09.d27:meMA.Ode6C12.melody
ltx/gr_redirects_goarch/me.m09.d27:meMA.Ode6C12.mode	@ltx/gr_gr_cog/me.m09.d27:meMA.Ode6C12.mode
ltx/gr_redirects_goarch/me.m09.d27:meMA.Ode6C12.ode	@ltx/gr_gr_cog/me.m09.d27:meMA.Ode6C12.ode
ltx/gr_redirects_goarch/me.m09.d27:meMA.Ode6C12.text	@ltx/gr_gr_cog/me.m09.d27:meMA.Ode6C12.text
ltx/gr_redirects_goarch/me.m09.d27:meMA.Ode6C13.incipit	@ltx/gr_gr_cog/me.m09.d27:meMA.Ode6C13.incipit
ltx/gr_redirects_goarch/me.m09.d27:meMA.Ode6C13.melody	@ltx/gr_gr_cog/me.m09.d27:meMA.Ode6C13.melody
ltx/gr_redirects_goarch/me.m09.d27:meMA.Ode6C13.mode	@ltx/gr_gr_cog/me.m09.d27:meMA.Ode6C13.mode
ltx/gr_redirects_goarch/me.m09.d27:meMA.Ode6C13.ode	@ltx/gr_gr_cog/me.m09.d27:meMA.Ode6C13.ode
ltx/gr_redirects_goarch/me.m09.d27:meMA.Ode6C13.text	@ltx/gr_gr_cog/me.m09.d27:meMA.Ode6C13.text
ltx/gr_redirects_goarch/me.m09.d27:meMA.Ode6C1T.incipit	@ltx/gr_gr_cog/me.m09.d27:meMA.Ode6C1T.incipit
ltx/gr_redirects_goarch/me.m09.d27:meMA.Ode6C1T.melody	@ltx/gr_gr_cog/me.m09.d27:meMA.Ode6C1T.melody
ltx/gr_redirects_goarch/me.m09.d27:meMA.Ode6C1T.mode	@ltx/gr_gr_cog/me.m09.d27:meMA.Ode6C1T.mode
ltx/gr_redirects_goarch/me.m09.d27:meMA.Ode6C1T.ode	@ltx/gr_gr_cog/me.m09.d27:meMA.Ode6C1T.ode
ltx/gr_redirects_goarch/me.m09.d27:meMA.Ode6C1T.text	@ltx/gr_gr_cog/me.m09.d27:meMA.Ode6C1T.text
ltx/gr_redirects_goarch/me.m09.d27:meMA.Ode6H.greekmelody	@ltx/gr_gr_cog/me.m09.d27:meMA.Ode6H.greekmelody
ltx/gr_redirects_goarch/me.m09.d27:meMA.Ode6H.incipit	@ltx/gr_gr_cog/me.m09.d27:meMA.Ode6H.incipit
ltx/gr_redirects_goarch/me.m09.d27:meMA.Ode6H.melody	@ltx/gr_gr_cog/me.m09.d27:meMA.Ode6H.melody
ltx/gr_redirects_goarch/me.m09.d27:meMA.Ode6H.mode	@ltx/gr_gr_cog/me.m09.d27:meMA.Ode6H.mode
ltx/gr_redirects_goarch/me.m09.d27:meMA.Ode6H.ode	@ltx/gr_gr_cog/me.m09.d27:meMA.Ode6H.ode
ltx/gr_redirects_goarch/me.m09.d27:meMA.Ode6H.text	@ltx/gr_gr_cog/me.m09.d27:meMA.Ode6H.text
ltx/gr_redirects_goarch/me.m09.d27:meMA.Ode7C11.greekmelody	@ltx/gr_gr_cog/me.m09.d27:meMA.Ode7C11.greekmelody
ltx/gr_redirects_goarch/me.m09.d27:meMA.Ode7C11.incipit	@ltx/gr_gr_cog/me.m09.d27:meMA.Ode7C11.incipit
ltx/gr_redirects_goarch/me.m09.d27:meMA.Ode7C11.melody	@ltx/gr_gr_cog/me.m09.d27:meMA.Ode7C11.melody
ltx/gr_redirects_goarch/me.m09.d27:meMA.Ode7C11.mode	@ltx/gr_gr_cog/me.m09.d27:meMA.Ode7C11.mode
ltx/gr_redirects_goarch/me.m09.d27:meMA.Ode7C11.ode	@ltx/gr_gr_cog/me.m09.d27:meMA.Ode7C11.ode
ltx/gr_redirects_goarch/me.m09.d27:meMA.Ode7C11.text	@ltx/gr_gr_cog/me.m09.d27:meMA.Ode7C11.text
ltx/gr_redirects_goarch/me.m09.d27:meMA.Ode7C12.incipit	@ltx/gr_gr_cog/me.m09.d27:meMA.Ode7C12.incipit
ltx/gr_redirects_goarch/me.m09.d27:meMA.Ode7C12.melody	@ltx/gr_gr_cog/me.m09.d27:meMA.Ode7C12.melody
ltx/gr_redirects_goarch/me.m09.d27:meMA.Ode7C12.mode	@ltx/gr_gr_cog/me.m09.d27:meMA.Ode7C12.mode
ltx/gr_redirects_goarch/me.m09.d27:meMA.Ode7C12.ode	@ltx/gr_gr_cog/me.m09.d27:meMA.Ode7C12.ode
ltx/gr_redirects_goarch/me.m09.d27:meMA.Ode7C12.text	@ltx/gr_gr_cog/me.m09.d27:meMA.Ode7C12.text
ltx/gr_redirects_goarch/me.m09.d27:meMA.Ode7C13.incipit	@ltx/gr_gr_cog/me.m09.d27:meMA.Ode7C13.incipit
ltx/gr_redirects_goarch/me.m09.d27:meMA.Ode7C13.melody	@ltx/gr_gr_cog/me.m09.d27:meMA.Ode7C13.melody
ltx/gr_redirects_goarch/me.m09.d27:meMA.Ode7C13.mode	@ltx/gr_gr_cog/me.m09.d27:meMA.Ode7C13.mode
ltx/gr_redirects_goarch/me.m09.d27:meMA.Ode7C13.ode	@ltx/gr_gr_cog/me.m09.d27:meMA.Ode7C13.ode
ltx/gr_redirects_goarch/me.m09.d27:meMA.Ode7C13.text	@ltx/gr_gr_cog/me.m09.d27:meMA.Ode7C13.text
ltx/gr_redirects_goarch/me.m09.d27:meMA.Ode7C14.incipit	@ltx/gr_gr_cog/me.m09.d27:meMA.Ode7C14.incipit
ltx/gr_redirects_goarch/me.m09.d27:meMA.Ode7C14.melody	@ltx/gr_gr_cog/me.m09.d27:meMA.Ode7C14.melody
ltx/gr_redirects_goarch/me.m09.d27:meMA.Ode7C14.mode	@ltx/gr_gr_cog/me.m09.d27:meMA.Ode7C14.mode
ltx/gr_redirects_goarch/me.m09.d27:meMA.Ode7C14.ode	@ltx/gr_gr_cog/me.m09.d27:meMA.Ode7C14.ode
ltx/gr_redirects_goarch/me.m09.d27:meMA.Ode7C14.text	@ltx/gr_gr_cog/me.m09.d27:meMA.Ode7C14.text
ltx/gr_redirects_goarch/me.m09.d27:meMA.Ode7C1T.incipit	@ltx/gr_gr_cog/me.m09.d27:meMA.Ode7C1T.incipit
ltx/gr_redirects_goarch/me.m09.d27:meMA.Ode7C1T.melody	@ltx/gr_gr_cog/me.m09.d27:meMA.Ode7C1T.melody
ltx/gr_redirects_goarch/me.m09.d27:meMA.Ode7C1T.mode	@ltx/gr_gr_cog/me.m09.d27:meMA.Ode7C1T.mode
ltx/gr_redirects_goarch/me.m09.d27:meMA.Ode7C1T.ode	@ltx/gr_gr_cog/me.m09.d27:meMA.Ode7C1T.ode
ltx/gr_redirects_goarch/me.m09.d27:meMA.Ode7C1T.text	@ltx/gr_gr_cog/me.m09.d27:meMA.Ode7C1T.text
ltx/gr_redirects_goarch/me.m09.d27:meMA.Ode8C11.greekmelody	@ltx/gr_gr_cog/me.m09.d27:meMA.Ode8C11.greekmelody
ltx/gr_redirects_goarch/me.m09.d27:meMA.Ode8C11.incipit	@ltx/gr_gr_cog/me.m09.d27:meMA.Ode8C11.incipit
ltx/gr_redirects_goarch/me.m09.d27:meMA.Ode8C11.melody	@ltx/gr_gr_cog/me.m09.d27:meMA.Ode8C11.melody
ltx/gr_redirects_goarch/me.m09.d27:meMA.Ode8C11.mode	@ltx/gr_gr_cog/me.m09.d27:meMA.Ode8C11.mode
ltx/gr_redirects_goarch/me.m09.d27:meMA.Ode8C11.ode	@ltx/gr_gr_cog/me.m09.d27:meMA.Ode8C11.ode
ltx/gr_redirects_goarch/me.m09.d27:meMA.Ode8C11.text	@ltx/gr_gr_cog/me.m09.d27:meMA.Ode8C11.text
ltx/gr_redirects_goarch/me.m09.d27:meMA.Ode8C12.incipit	@ltx/gr_gr_cog/me.m09.d27:meMA.Ode8C12.incipit
ltx/gr_redirects_goarch/me.m09.d27:meMA.Ode8C12.melody	@ltx/gr_gr_cog/me.m09.d27:meMA.Ode8C12.melody
ltx/gr_redirects_goarch/me.m09.d27:meMA.Ode8C12.mode	@ltx/gr_gr_cog/me.m09.d27:meMA.Ode8C12.mode
ltx/gr_redirects_goarch/me.m09.d27:meMA.Ode8C12.ode	@ltx/gr_gr_cog/me.m09.d27:meMA.Ode8C12.ode
ltx/gr_redirects_goarch/me.m09.d27:meMA.Ode8C12.text	@ltx/gr_gr_cog/me.m09.d27:meMA.Ode8C12.text
ltx/gr_redirects_goarch/me.m09.d27:meMA.Ode8C13.incipit	@ltx/gr_gr_cog/me.m09.d27:meMA.Ode8C13.incipit
ltx/gr_redirects_goarch/me.m09.d27:meMA.Ode8C13.melody	@ltx/gr_gr_cog/me.m09.d27:meMA.Ode8C13.melody
ltx/gr_redirects_goarch/me.m09.d27:meMA.Ode8C13.mode	@ltx/gr_gr_cog/me.m09.d27:meMA.Ode8C13.mode
ltx/gr_redirects_goarch/me.m09.d27:meMA.Ode8C13.ode	@ltx/gr_gr_cog/me.m09.d27:meMA.Ode8C13.ode
ltx/gr_redirects_goarch/me.m09.d27:meMA.Ode8C13.text	@ltx/gr_gr_cog/me.m09.d27:meMA.Ode8C13.text
ltx/gr_redirects_goarch/me.m09.d27:meMA.Ode8C1T.incipit	@ltx/gr_gr_cog/me.m09.d27:meMA.Ode8C1T.incipit
ltx/gr_redirects_goarch/me.m09.d27:meMA.Ode8C1T.melody	@ltx/gr_gr_cog/me.m09.d27:meMA.Ode8C1T.melody
ltx/gr_redirects_goarch/me.m09.d27:meMA.Ode8C1T.mode	@ltx/gr_gr_cog/me.m09.d27:meMA.Ode8C1T.mode
ltx/gr_redirects_goarch/me.m09.d27:meMA.Ode8C1T.ode	@ltx/gr_gr_cog/me.m09.d27:meMA.Ode8C1T.ode
ltx/gr_redirects_goarch/me.m09.d27:meMA.Ode8C1T.text	@ltx/gr_gr_cog/me.m09.d27:meMA.Ode8C1T.text
ltx/gr_redirects_goarch/me.m09.d27:meMA.Ode8H.greekmelody	@ltx/gr_gr_cog/me.m09.d27:meMA.Ode8H.greekmelody
ltx/gr_redirects_goarch/me.m09.d27:meMA.Ode8H.incipit	@ltx/gr_gr_cog/me.m09.d27:meMA.Ode8H.incipit
ltx/gr_redirects_goarch/me.m09.d27:meMA.Ode8H.melody	@ltx/gr_gr_cog/me.m09.d27:meMA.Ode8H.melody
ltx/gr_redirects_goarch/me.m09.d27:meMA.Ode8H.mode	@ltx/gr_gr_cog/me.m09.d27:meMA.Ode8H.mode
ltx/gr_redirects_goarch/me.m09.d27:meMA.Ode8H.ode	@ltx/gr_gr_cog/me.m09.d27:meMA.Ode8H.ode
ltx/gr_redirects_goarch/me.m09.d27:meMA.Ode8H.text	@ltx/gr_gr_cog/me.m09.d27:meMA.Ode8H.text
ltx/gr_redirects_goarch/me.m09.d27:meMA.Ode9C11.greekmelody	@ltx/gr_gr_cog/me.m09.d27:meMA.Ode9C11.greekmelody
ltx/gr_redirects_goarch/me.m09.d27:meMA.Ode9C11.incipit	@ltx/gr_gr_cog/me.m09.d27:meMA.Ode9C11.incipit
ltx/gr_redirects_goarch/me.m09.d27:meMA.Ode9C11.melody	@ltx/gr_gr_cog/me.m09.d27:meMA.Ode9C11.melody
ltx/gr_redirects_goarch/me.m09.d27:meMA.Ode9C11.mode	@ltx/gr_gr_cog/me.m09.d27:meMA.Ode9C11.mode
ltx/gr_redirects_goarch/me.m09.d27:meMA.Ode9C11.ode	@ltx/gr_gr_cog/me.m09.d27:meMA.Ode9C11.ode
ltx/gr_redirects_goarch/me.m09.d27:meMA.Ode9C11.text	@ltx/gr_gr_cog/me.m09.d27:meMA.Ode9C11.text
ltx/gr_redirects_goarch/me.m09.d27:meMA.Ode9C12.incipit	@ltx/gr_gr_cog/me.m09.d27:meMA.Ode9C12.incipit
ltx/gr_redirects_goarch/me.m09.d27:meMA.Ode9C12.melody	@ltx/gr_gr_cog/me.m09.d27:meMA.Ode9C12.melody
ltx/gr_redirects_goarch/me.m09.d27:meMA.Ode9C12.mode	@ltx/gr_gr_cog/me.m09.d27:meMA.Ode9C12.mode
ltx/gr_redirects_goarch/me.m09.d27:meMA.Ode9C12.ode	@ltx/gr_gr_cog/me.m09.d27:meMA.Ode9C12.ode
ltx/gr_redirects_goarch/me.m09.d27:meMA.Ode9C12.text	@ltx/gr_gr_cog/me.m09.d27:meMA.Ode9C12.text
ltx/gr_redirects_goarch/me.m09.d27:meMA.Ode9C13.incipit	@ltx/gr_gr_cog/me.m09.d27:meMA.Ode9C13.incipit
ltx/gr_redirects_goarch/me.m09.d27:meMA.Ode9C13.melody	@ltx/gr_gr_cog/me.m09.d27:meMA.Ode9C13.melody
ltx/gr_redirects_goarch/me.m09.d27:meMA.Ode9C13.mode	@ltx/gr_gr_cog/me.m09.d27:meMA.Ode9C13.mode
ltx/gr_redirects_goarch/me.m09.d27:meMA.Ode9C13.ode	@ltx/gr_gr_cog/me.m09.d27:meMA.Ode9C13.ode
ltx/gr_redirects_goarch/me.m09.d27:meMA.Ode9C13.text	@ltx/gr_gr_cog/me.m09.d27:meMA.Ode9C13.text
ltx/gr_redirects_goarch/me.m09.d27:meMA.Ode9C14.incipit	@ltx/gr_gr_cog/me.m09.d27:meMA.Ode9C14.incipit
ltx/gr_redirects_goarch/me.m09.d27:meMA.Ode9C14.melody	@ltx/gr_gr_cog/me.m09.d27:meMA.Ode9C14.melody
ltx/gr_redirects_goarch/me.m09.d27:meMA.Ode9C14.mode	@ltx/gr_gr_cog/me.m09.d27:meMA.Ode9C14.mode
ltx/gr_redirects_goarch/me.m09.d27:meMA.Ode9C14.ode	@ltx/gr_gr_cog/me.m09.d27:meMA.Ode9C14.ode
ltx/gr_redirects_goarch/me.m09.d27:meMA.Ode9C14.text	@ltx/gr_gr_cog/me.m09.d27:meMA.Ode9C14.text
ltx/gr_redirects_goarch/me.m09.d27:meMA.Ode9C1T.incipit	@ltx/gr_gr_cog/me.m09.d27:meMA.Ode9C1T.incipit
ltx/gr_redirects_goarch/me.m09.d27:meMA.Ode9C1T.melody	@ltx/gr_gr_cog/me.m09.d27:meMA.Ode9C1T.melody
ltx/gr_redirects_goarch/me.m09.d27:meMA.Ode9C1T.mode	@ltx/gr_gr_cog/me.m09.d27:meMA.Ode9C1T.mode
ltx/gr_redirects_goarch/me.m09.d27:meMA.Ode9C1T.ode	@ltx/gr_gr_cog/me.m09.d27:meMA.Ode9C1T.ode
ltx/gr_redirects_goarch/me.m09.d27:meMA.Ode9C1T.text	@ltx/gr_gr_cog/me.m09.d27:meMA.Ode9C1T.text
ltx/gr_redirects_goarch/me.m09.d27:meMA.Ode9H.greekmelody	@ltx/gr_gr_cog/me.m09.d27:meMA.Ode9H.greekmelody
ltx/gr_redirects_goarch/me.m09.d27:meMA.Ode9H.incipit	@ltx/gr_gr_cog/me.m09.d27:meMA.Ode9H.incipit
ltx/gr_redirects_goarch/me.m09.d27:meMA.Ode9H.melody	@ltx/gr_gr_cog/me.m09.d27:meMA.Ode9H.melody
ltx/gr_redirects_goarch/me.m09.d27:meMA.Ode9H.mode	@ltx/gr_gr_cog/me.m09.d27:meMA.Ode9H.mode
ltx/gr_redirects_goarch/me.m09.d27:meMA.Ode9H.ode	@ltx/gr_gr_cog/me.m09.d27:meMA.Ode9H.ode
ltx/gr_redirects_goarch/me.m09.d27:meMA.Ode9H.text	@ltx/gr_gr_cog/me.m09.d27:meMA.Ode9H.text
ltx/gr_redirects_goarch/me.m09.d27:meMA.Oikos1.text	@ltx/gr_gr_cog/me.m09.d27:meMA.Oikos1.text
ltx/gr_redirects_goarch/me.m09.d27:meVE.Apolytikion1ger.greekmelody	@ltx/gr_gr_cog/me.m09.d27:meVE.Apolytikion1ger.greekmelody
ltx/gr_redirects_goarch/me.m09.d27:meVE.Apolytikion1ger.incipit	@ltx/gr_gr_cog/me.m09.d27:meVE.Apolytikion1ger.incipit
ltx/gr_redirects_goarch/me.m09.d27:meVE.Apolytikion1ger.melody	@ltx/gr_gr_cog/me.m09.d27:meVE.Apolytikion1ger.melody
ltx/gr_redirects_goarch/me.m09.d27:meVE.Apolytikion1ger.mode	@ltx/gr_gr_cog/me.m09.d27:meVE.Apolytikion1ger.mode
ltx/gr_redirects_goarch/me.m09.d27:meVE.Apolytikion1ger.poet	@ltx/gr_gr_cog/me.m09.d27:meVE.Apolytikion1ger.poet
ltx/gr_redirects_goarch/me.m09.d27:meVE.Apolytikion1ger.text	@ltx/gr_gr_cog/me.m09.d27:meVE.Apolytikion1ger.text
ltx/gr_redirects_goarch/me.m09.d27:meVE.Apolytikion2ger.greekmelody	@ltx/gr_gr_cog/me.m09.d27:meVE.Apolytikion2ger.greekmelody
ltx/gr_redirects_goarch/me.m09.d27:meVE.Apolytikion2ger.incipit	@ltx/gr_gr_cog/me.m09.d27:meVE.Apolytikion2ger.incipit
ltx/gr_redirects_goarch/me.m09.d27:meVE.Apolytikion2ger.melody	@ltx/gr_gr_cog/me.m09.d27:meVE.Apolytikion2ger.melody
ltx/gr_redirects_goarch/me.m09.d27:meVE.Apolytikion2ger.mode	@ltx/gr_gr_cog/me.m09.d27:meVE.Apolytikion2ger.mode
ltx/gr_redirects_goarch/me.m09.d27:meVE.Apolytikion2ger.poet	@ltx/gr_gr_cog/me.m09.d27:meVE.Apolytikion2ger.poet
ltx/gr_redirects_goarch/me.m09.d27:meVE.Apolytikion2ger.text	@ltx/gr_gr_cog/me.m09.d27:meVE.Apolytikion2ger.text
ltx/gr_redirects_goarch/me.m09.d27:meVE.SticGlory.incipit	@ltx/gr_gr_cog/me.m09.d27:meVE.SticGlory.incipit
ltx/gr_redirects_goarch/me.m09.d27:meVE.SticGlory.melody	@ltx/gr_gr_cog/me.m09.d27:meVE.SticGlory.melody
ltx/gr_redirects_goarch/me.m09.d27:meVE.SticGlory.mode	@ltx/gr_gr_cog/me.m09.d27:meVE.SticGlory.mode
ltx/gr_redirects_goarch/me.m09.d27:meVE.SticGlory.poet	@ltx/gr_gr_cog/me.m09.d27:meVE.SticGlory.poet
ltx/gr_redirects_goarch/me.m09.d27:meVE.SticGlory.text	@ltx/gr_gr_cog/me.m09.d27:meVE.SticGlory.text
ltx/gr_redirects_goarch/me.m09.d27:meVE.SticStavrotheotokion.greekmelody	@ltx/gr_gr_cog/me.m09.d27:meVE.SticStavrotheotokion.greekmelody
ltx/gr_redirects_goarch/me.m09.d27:meVE.SticStavrotheotokion.incipit	@ltx/gr_gr_cog/me.m09.d27:meVE.SticStavrotheotokion.incipit
ltx/gr_redirects_goarch/me.m09.d27:meVE.SticStavrotheotokion.melody	@ltx/gr_gr_cog/me.m09.d27:meVE.SticStavrotheotokion.melody
ltx/gr_redirects_goarch/me.m09.d27:meVE.SticStavrotheotokion.mode	@ltx/gr_gr_cog/me.m09.d27:meVE.SticStavrotheotokion.mode
ltx/gr_redirects_goarch/me.m09.d27:meVE.SticStavrotheotokion.text	@ltx/gr_gr_cog/me.m09.d27:meVE.SticStavrotheotokion.text
ltx/gr_redirects_goarch/me.m09.d27:meVE.SticTheotokion.greekmelody	@ltx/gr_gr_cog/me.m09.d27:meVE.SticTheotokion.greekmelody
ltx/gr_redirects_goarch/me.m09.d27:meVE.SticTheotokion.incipit	@ltx/gr_gr_cog/me.m09.d27:meVE.SticTheotokion.incipit
ltx/gr_redirects_goarch/me.m09.d27:meVE.SticTheotokion.melody	@ltx/gr_gr_cog/me.m09.d27:meVE.SticTheotokion.melody
ltx/gr_redirects_goarch/me.m09.d27:meVE.SticTheotokion.mode	@ltx/gr_gr_cog/me.m09.d27:meVE.SticTheotokion.mode
ltx/gr_redirects_goarch/me.m09.d27:meVE.SticTheotokion.text	@ltx/gr_gr_cog/me.m09.d27:meVE.SticTheotokion.text
ltx/gr_redirects_goarch/me.m09.d27:meVE.Stichera01.greekmelody	@ltx/gr_gr_cog/me.m09.d27:meVE.Stichera01.greekmelody
ltx/gr_redirects_goarch/me.m09.d27:meVE.Stichera01.incipit	@ltx/gr_gr_cog/me.m09.d27:meVE.Stichera01.incipit
ltx/gr_redirects_goarch/me.m09.d27:meVE.Stichera01.melody	@ltx/gr_gr_cog/me.m09.d27:meVE.Stichera01.melody
ltx/gr_redirects_goarch/me.m09.d27:meVE.Stichera01.mode	@ltx/gr_gr_cog/me.m09.d27:meVE.Stichera01.mode
ltx/gr_redirects_goarch/me.m09.d27:meVE.Stichera01.text	@ltx/gr_gr_cog/me.m09.d27:meVE.Stichera01.text
ltx/gr_redirects_goarch/me.m09.d27:meVE.Stichera02.incipit	@ltx/gr_gr_cog/me.m09.d27:meVE.Stichera02.incipit
ltx/gr_redirects_goarch/me.m09.d27:meVE.Stichera02.melody	@ltx/gr_gr_cog/me.m09.d27:meVE.Stichera02.melody
ltx/gr_redirects_goarch/me.m09.d27:meVE.Stichera02.mode	@ltx/gr_gr_cog/me.m09.d27:meVE.Stichera02.mode
ltx/gr_redirects_goarch/me.m09.d27:meVE.Stichera02.text	@ltx/gr_gr_cog/me.m09.d27:meVE.Stichera02.text
ltx/gr_redirects_goarch/me.m09.d27:meVE.Stichera03.incipit	@ltx/gr_gr_cog/me.m09.d27:meVE.Stichera03.incipit
ltx/gr_redirects_goarch/me.m09.d27:meVE.Stichera03.melody	@ltx/gr_gr_cog/me.m09.d27:meVE.Stichera03.melody
ltx/gr_redirects_goarch/me.m09.d27:meVE.Stichera03.mode	@ltx/gr_gr_cog/me.m09.d27:meVE.Stichera03.mode
ltx/gr_redirects_goarch/me.m09.d27:meVE.Stichera03.text	@ltx/gr_gr_cog/me.m09.d27:meVE.Stichera03.text
