ltx/gr_redirects_goarch/eu.ordination:euORD.AD.p500.title	@ltx/gr_gr_cog/eu.ordination:euORD.AD.p500.title
ltx/gr_redirects_goarch/eu.ordination:euORD.AD.p501.text	@ltx/gr_gr_cog/eu.ordination:euORD.AD.p501.text
ltx/gr_redirects_goarch/eu.ordination:euORD.AD.p502.text	@ltx/gr_gr_cog/eu.ordination:euORD.AD.p502.text
ltx/gr_redirects_goarch/eu.ordination:euORD.AD.p503.text	@ltx/gr_gr_cog/eu.ordination:euORD.AD.p503.text
ltx/gr_redirects_goarch/eu.ordination:euORD.AD.p504.text	@ltx/gr_gr_cog/eu.ordination:euORD.AD.p504.text
ltx/gr_redirects_goarch/eu.ordination:euORD.AD.r01	@ltx/gr_gr_cog/eu.ordination:euORD.AD.r01
ltx/gr_redirects_goarch/eu.ordination:euORD.AD.r02	@ltx/gr_gr_cog/eu.ordination:euORD.AD.r02
ltx/gr_redirects_goarch/eu.ordination:euORD.AD.r03	@ltx/gr_gr_cog/eu.ordination:euORD.AD.r03
ltx/gr_redirects_goarch/eu.ordination:euORD.AD.r04	@ltx/gr_gr_cog/eu.ordination:euORD.AD.r04
ltx/gr_redirects_goarch/eu.ordination:euORD.AD.r05	@ltx/gr_gr_cog/eu.ordination:euORD.AD.r05
ltx/gr_redirects_goarch/eu.ordination:euORD.AD.r06	@ltx/gr_gr_cog/eu.ordination:euORD.AD.r06
ltx/gr_redirects_goarch/eu.ordination:euORD.AD.title	@ltx/gr_gr_cog/eu.ordination:euORD.AD.title
ltx/gr_redirects_goarch/eu.ordination:euORD.DE.p200.title	@ltx/gr_gr_cog/eu.ordination:euORD.DE.p200.title
ltx/gr_redirects_goarch/eu.ordination:euORD.DE.p201.text	@ltx/gr_gr_cog/eu.ordination:euORD.DE.p201.text
ltx/gr_redirects_goarch/eu.ordination:euORD.DE.p202.text	@ltx/gr_gr_cog/eu.ordination:euORD.DE.p202.text
ltx/gr_redirects_goarch/eu.ordination:euORD.DE.p203.text	@ltx/gr_gr_cog/eu.ordination:euORD.DE.p203.text
ltx/gr_redirects_goarch/eu.ordination:euORD.DE.p204.incipit	@ltx/gr_gr_cog/eu.ordination:euORD.DE.p204.incipit
ltx/gr_redirects_goarch/eu.ordination:euORD.DE.p204.mode	@ltx/gr_gr_cog/eu.ordination:euORD.DE.p204.mode
ltx/gr_redirects_goarch/eu.ordination:euORD.DE.p204.text	@ltx/gr_gr_cog/eu.ordination:euORD.DE.p204.text
ltx/gr_redirects_goarch/eu.ordination:euORD.DE.p204.title	@ltx/gr_gr_cog/eu.ordination:euORD.DE.p204.title
ltx/gr_redirects_goarch/eu.ordination:euORD.DE.p205.incipit	@ltx/gr_gr_cog/eu.ordination:euORD.DE.p205.incipit
ltx/gr_redirects_goarch/eu.ordination:euORD.DE.p205.mode	@ltx/gr_gr_cog/eu.ordination:euORD.DE.p205.mode
ltx/gr_redirects_goarch/eu.ordination:euORD.DE.p205.text	@ltx/gr_gr_cog/eu.ordination:euORD.DE.p205.text
ltx/gr_redirects_goarch/eu.ordination:euORD.DE.p206.incipit	@ltx/gr_gr_cog/eu.ordination:euORD.DE.p206.incipit
ltx/gr_redirects_goarch/eu.ordination:euORD.DE.p206.mode	@ltx/gr_gr_cog/eu.ordination:euORD.DE.p206.mode
ltx/gr_redirects_goarch/eu.ordination:euORD.DE.p206.text	@ltx/gr_gr_cog/eu.ordination:euORD.DE.p206.text
ltx/gr_redirects_goarch/eu.ordination:euORD.DE.p207.text	@ltx/gr_gr_cog/eu.ordination:euORD.DE.p207.text
ltx/gr_redirects_goarch/eu.ordination:euORD.DE.p207a.text	@ltx/gr_gr_cog/eu.ordination:euORD.DE.p207a.text
ltx/gr_redirects_goarch/eu.ordination:euORD.DE.p207b.text	@ltx/gr_gr_cog/eu.ordination:euORD.DE.p207b.text
ltx/gr_redirects_goarch/eu.ordination:euORD.DE.p207c.text	@ltx/gr_gr_cog/eu.ordination:euORD.DE.p207c.text
ltx/gr_redirects_goarch/eu.ordination:euORD.DE.p208.text	@ltx/gr_gr_cog/eu.ordination:euORD.DE.p208.text
ltx/gr_redirects_goarch/eu.ordination:euORD.DE.p209.text	@ltx/gr_gr_cog/eu.ordination:euORD.DE.p209.text
ltx/gr_redirects_goarch/eu.ordination:euORD.DE.r01	@ltx/gr_gr_cog/eu.ordination:euORD.DE.r01
ltx/gr_redirects_goarch/eu.ordination:euORD.DE.r02	@ltx/gr_gr_cog/eu.ordination:euORD.DE.r02
ltx/gr_redirects_goarch/eu.ordination:euORD.DE.r03	@ltx/gr_gr_cog/eu.ordination:euORD.DE.r03
ltx/gr_redirects_goarch/eu.ordination:euORD.DE.r04	@ltx/gr_gr_cog/eu.ordination:euORD.DE.r04
ltx/gr_redirects_goarch/eu.ordination:euORD.DE.r05	@ltx/gr_gr_cog/eu.ordination:euORD.DE.r05
ltx/gr_redirects_goarch/eu.ordination:euORD.DE.r06	@ltx/gr_gr_cog/eu.ordination:euORD.DE.r06
ltx/gr_redirects_goarch/eu.ordination:euORD.DE.r07	@ltx/gr_gr_cog/eu.ordination:euORD.DE.r07
ltx/gr_redirects_goarch/eu.ordination:euORD.DE.r08	@ltx/gr_gr_cog/eu.ordination:euORD.DE.r08
ltx/gr_redirects_goarch/eu.ordination:euORD.DE.r09	@ltx/gr_gr_cog/eu.ordination:euORD.DE.r09
ltx/gr_redirects_goarch/eu.ordination:euORD.DE.r10	@ltx/gr_gr_cog/eu.ordination:euORD.DE.r10
ltx/gr_redirects_goarch/eu.ordination:euORD.DE.r11	@ltx/gr_gr_cog/eu.ordination:euORD.DE.r11
ltx/gr_redirects_goarch/eu.ordination:euORD.DE.r12	@ltx/gr_gr_cog/eu.ordination:euORD.DE.r12
ltx/gr_redirects_goarch/eu.ordination:euORD.DE.r13	@ltx/gr_gr_cog/eu.ordination:euORD.DE.r13
ltx/gr_redirects_goarch/eu.ordination:euORD.DE.r14	@ltx/gr_gr_cog/eu.ordination:euORD.DE.r14
ltx/gr_redirects_goarch/eu.ordination:euORD.DE.r15	@ltx/gr_gr_cog/eu.ordination:euORD.DE.r15
ltx/gr_redirects_goarch/eu.ordination:euORD.DE.r16	@ltx/gr_gr_cog/eu.ordination:euORD.DE.r16
ltx/gr_redirects_goarch/eu.ordination:euORD.DE.r17	@ltx/gr_gr_cog/eu.ordination:euORD.DE.r17
ltx/gr_redirects_goarch/eu.ordination:euORD.DE.r18	@ltx/gr_gr_cog/eu.ordination:euORD.DE.r18
ltx/gr_redirects_goarch/eu.ordination:euORD.DE.title	@ltx/gr_gr_cog/eu.ordination:euORD.DE.title
ltx/gr_redirects_goarch/eu.ordination:euORD.EP.p400.title	@ltx/gr_us_goa/eu.ordination:euORD.EP.p400.title
ltx/gr_redirects_goarch/eu.ordination:euORD.EP.p401.text	@ltx/gr_us_goa/eu.ordination:euORD.EP.p401.text
ltx/gr_redirects_goarch/eu.ordination:euORD.EP.p402.text	@ltx/gr_us_goa/eu.ordination:euORD.EP.p402.text
ltx/gr_redirects_goarch/eu.ordination:euORD.EP.p402a.text	@ltx/gr_gr_cog/eu.ordination:euORD.EP.p402a.text
ltx/gr_redirects_goarch/eu.ordination:euORD.EP.p402b.text	@ltx/gr_us_goa/eu.ordination:euORD.EP.p402b.text
ltx/gr_redirects_goarch/eu.ordination:euORD.EP.p402c.text	@ltx/gr_us_goa/eu.ordination:euORD.EP.p402c.text
ltx/gr_redirects_goarch/eu.ordination:euORD.EP.p403.text	@ltx/gr_us_goa/eu.ordination:euORD.EP.p403.text
ltx/gr_redirects_goarch/eu.ordination:euORD.EP.p404.text	@ltx/gr_us_goa/eu.ordination:euORD.EP.p404.text
ltx/gr_redirects_goarch/eu.ordination:euORD.EP.p405.text	@ltx/gr_us_goa/eu.ordination:euORD.EP.p405.text
ltx/gr_redirects_goarch/eu.ordination:euORD.EP.p405a.text	@ltx/gr_us_goa/eu.ordination:euORD.EP.p405a.text
ltx/gr_redirects_goarch/eu.ordination:euORD.EP.p405b.text	@ltx/gr_us_goa/eu.ordination:euORD.EP.p405b.text
ltx/gr_redirects_goarch/eu.ordination:euORD.EP.p405c.text	@ltx/gr_us_goa/eu.ordination:euORD.EP.p405c.text
ltx/gr_redirects_goarch/eu.ordination:euORD.EP.p406.text	@ltx/gr_us_goa/eu.ordination:euORD.EP.p406.text
ltx/gr_redirects_goarch/eu.ordination:euORD.EP.p407.text	@ltx/gr_us_goa/eu.ordination:euORD.EP.p407.text
ltx/gr_redirects_goarch/eu.ordination:euORD.EP.p408.text	@ltx/gr_us_goa/eu.ordination:euORD.EP.p408.text
ltx/gr_redirects_goarch/eu.ordination:euORD.EP.p409.text	@ltx/gr_us_goa/eu.ordination:euORD.EP.p409.text
ltx/gr_redirects_goarch/eu.ordination:euORD.EP.p409a.text	@ltx/gr_gr_cog/eu.ordination:euORD.EP.p409a.text
ltx/gr_redirects_goarch/eu.ordination:euORD.EP.p409b.text	@ltx/gr_us_goa/eu.ordination:euORD.EP.p409b.text
ltx/gr_redirects_goarch/eu.ordination:euORD.EP.p409c.text	@ltx/gr_us_goa/eu.ordination:euORD.EP.p409c.text
ltx/gr_redirects_goarch/eu.ordination:euORD.EP.p410.text	@ltx/gr_us_goa/eu.ordination:euORD.EP.p410.text
ltx/gr_redirects_goarch/eu.ordination:euORD.EP.p410a.text	@ltx/gr_us_goa/eu.ordination:euORD.EP.p410a.text
ltx/gr_redirects_goarch/eu.ordination:euORD.EP.p411.text	@ltx/gr_us_goa/eu.ordination:euORD.EP.p411.text
ltx/gr_redirects_goarch/eu.ordination:euORD.EP.p412.text	@ltx/gr_us_goa/eu.ordination:euORD.EP.p412.text
ltx/gr_redirects_goarch/eu.ordination:euORD.EP.p412a.text	@ltx/gr_us_goa/eu.ordination:euORD.EP.p412a.text
ltx/gr_redirects_goarch/eu.ordination:euORD.EP.p412b.text	@ltx/gr_us_goa/eu.ordination:euORD.EP.p412b.text
ltx/gr_redirects_goarch/eu.ordination:euORD.EP.p413.text	@ltx/gr_us_goa/eu.ordination:euORD.EP.p413.text
ltx/gr_redirects_goarch/eu.ordination:euORD.EP.p414.text	@ltx/gr_us_goa/eu.ordination:euORD.EP.p414.text
ltx/gr_redirects_goarch/eu.ordination:euORD.EP.p414a.text	@ltx/gr_us_goa/eu.ordination:euORD.EP.p414a.text
ltx/gr_redirects_goarch/eu.ordination:euORD.EP.p414b.text	@ltx/gr_us_goa/eu.ordination:euORD.EP.p414b.text
ltx/gr_redirects_goarch/eu.ordination:euORD.EP.p414c.text	@ltx/gr_us_goa/eu.ordination:euORD.EP.p414c.text
ltx/gr_redirects_goarch/eu.ordination:euORD.EP.p415.text	@ltx/gr_us_goa/eu.ordination:euORD.EP.p415.text
ltx/gr_redirects_goarch/eu.ordination:euORD.EP.p416.text	@ltx/gr_us_goa/eu.ordination:euORD.EP.p416.text
ltx/gr_redirects_goarch/eu.ordination:euORD.EP.p417.text	@ltx/gr_us_goa/eu.ordination:euORD.EP.p417.text
ltx/gr_redirects_goarch/eu.ordination:euORD.EP.r01	@ltx/gr_us_goa/eu.ordination:euORD.EP.r01
ltx/gr_redirects_goarch/eu.ordination:euORD.EP.r02	@ltx/gr_gr_cog/eu.ordination:euORD.EP.r02
ltx/gr_redirects_goarch/eu.ordination:euORD.EP.r02a	@ltx/gr_us_goa/eu.ordination:euORD.EP.r02a
ltx/gr_redirects_goarch/eu.ordination:euORD.EP.r02b	@ltx/gr_us_goa/eu.ordination:euORD.EP.r02b
ltx/gr_redirects_goarch/eu.ordination:euORD.EP.r03	@ltx/gr_us_goa/eu.ordination:euORD.EP.r03
ltx/gr_redirects_goarch/eu.ordination:euORD.EP.r03b_archbishop	@ltx/gr_us_goa/eu.ordination:euORD.EP.r03b_archbishop
ltx/gr_redirects_goarch/eu.ordination:euORD.EP.r03b_metropolitan	@ltx/gr_us_goa/eu.ordination:euORD.EP.r03b_metropolitan
ltx/gr_redirects_goarch/eu.ordination:euORD.EP.r04	@ltx/gr_us_goa/eu.ordination:euORD.EP.r04
ltx/gr_redirects_goarch/eu.ordination:euORD.EP.r05	@ltx/gr_us_goa/eu.ordination:euORD.EP.r05
ltx/gr_redirects_goarch/eu.ordination:euORD.EP.r05b	@ltx/gr_us_goa/eu.ordination:euORD.EP.r05b
ltx/gr_redirects_goarch/eu.ordination:euORD.EP.r05b_archbishop	@ltx/gr_us_goa/eu.ordination:euORD.EP.r05b_archbishop
ltx/gr_redirects_goarch/eu.ordination:euORD.EP.r06	@ltx/gr_us_goa/eu.ordination:euORD.EP.r06
ltx/gr_redirects_goarch/eu.ordination:euORD.EP.r06_archbishop	@ltx/gr_us_goa/eu.ordination:euORD.EP.r06_archbishop
ltx/gr_redirects_goarch/eu.ordination:euORD.EP.r07	@ltx/gr_us_goa/eu.ordination:euORD.EP.r07
ltx/gr_redirects_goarch/eu.ordination:euORD.EP.r08	@ltx/gr_us_goa/eu.ordination:euORD.EP.r08
ltx/gr_redirects_goarch/eu.ordination:euORD.EP.r09	@ltx/gr_us_goa/eu.ordination:euORD.EP.r09
ltx/gr_redirects_goarch/eu.ordination:euORD.EP.r10	@ltx/gr_us_goa/eu.ordination:euORD.EP.r10
ltx/gr_redirects_goarch/eu.ordination:euORD.EP.r11	@ltx/gr_us_goa/eu.ordination:euORD.EP.r11
ltx/gr_redirects_goarch/eu.ordination:euORD.EP.r12	@ltx/gr_us_goa/eu.ordination:euORD.EP.r12
ltx/gr_redirects_goarch/eu.ordination:euORD.EP.r13	@ltx/gr_us_goa/eu.ordination:euORD.EP.r13
ltx/gr_redirects_goarch/eu.ordination:euORD.EP.r14	@ltx/gr_us_goa/eu.ordination:euORD.EP.r14
ltx/gr_redirects_goarch/eu.ordination:euORD.EP.r15	@ltx/gr_us_goa/eu.ordination:euORD.EP.r15
ltx/gr_redirects_goarch/eu.ordination:euORD.EP.r16	@ltx/gr_us_goa/eu.ordination:euORD.EP.r16
ltx/gr_redirects_goarch/eu.ordination:euORD.EP.r17	@ltx/gr_us_goa/eu.ordination:euORD.EP.r17
ltx/gr_redirects_goarch/eu.ordination:euORD.EP.r18	@ltx/gr_us_goa/eu.ordination:euORD.EP.r18
ltx/gr_redirects_goarch/eu.ordination:euORD.EP.r19	@ltx/gr_us_goa/eu.ordination:euORD.EP.r19
ltx/gr_redirects_goarch/eu.ordination:euORD.EP.r20	@ltx/gr_us_goa/eu.ordination:euORD.EP.r20
ltx/gr_redirects_goarch/eu.ordination:euORD.EP.title	@ltx/gr_us_goa/eu.ordination:euORD.EP.title
ltx/gr_redirects_goarch/eu.ordination:euORD.OI.p600.title	@ltx/gr_gr_cog/eu.ordination:euORD.OI.p600.title
ltx/gr_redirects_goarch/eu.ordination:euORD.OI.p601.text	@ltx/gr_gr_cog/eu.ordination:euORD.OI.p601.text
ltx/gr_redirects_goarch/eu.ordination:euORD.OI.p601a.text	@ltx/gr_gr_cog/eu.ordination:euORD.OI.p601a.text
ltx/gr_redirects_goarch/eu.ordination:euORD.OI.p601b.text	@ltx/gr_gr_cog/eu.ordination:euORD.OI.p601b.text
ltx/gr_redirects_goarch/eu.ordination:euORD.OI.p601c.text	@ltx/gr_gr_cog/eu.ordination:euORD.OI.p601c.text
ltx/gr_redirects_goarch/eu.ordination:euORD.OI.r01	@ltx/gr_gr_cog/eu.ordination:euORD.OI.r01
ltx/gr_redirects_goarch/eu.ordination:euORD.OI.title	@ltx/gr_gr_cog/eu.ordination:euORD.OI.title
ltx/gr_redirects_goarch/eu.ordination:euORD.PP.p800.title	@ltx/gr_gr_cog/eu.ordination:euORD.PP.p800.title
ltx/gr_redirects_goarch/eu.ordination:euORD.PP.p801.text	@ltx/gr_gr_cog/eu.ordination:euORD.PP.p801.text
ltx/gr_redirects_goarch/eu.ordination:euORD.PP.p801a.text	@ltx/gr_gr_cog/eu.ordination:euORD.PP.p801a.text
ltx/gr_redirects_goarch/eu.ordination:euORD.PP.p801b.text	@ltx/gr_gr_cog/eu.ordination:euORD.PP.p801b.text
ltx/gr_redirects_goarch/eu.ordination:euORD.PP.p801c.text	@ltx/gr_gr_cog/eu.ordination:euORD.PP.p801c.text
ltx/gr_redirects_goarch/eu.ordination:euORD.PP.r01	@ltx/gr_gr_cog/eu.ordination:euORD.PP.r01
ltx/gr_redirects_goarch/eu.ordination:euORD.PP.title	@ltx/gr_gr_cog/eu.ordination:euORD.PP.title
ltx/gr_redirects_goarch/eu.ordination:euORD.PR.p300.title	@ltx/gr_gr_cog/eu.ordination:euORD.PR.p300.title
ltx/gr_redirects_goarch/eu.ordination:euORD.PR.p301.text	@ltx/gr_gr_cog/eu.ordination:euORD.PR.p301.text
ltx/gr_redirects_goarch/eu.ordination:euORD.PR.p302.text	@ltx/gr_gr_cog/eu.ordination:euORD.PR.p302.text
ltx/gr_redirects_goarch/eu.ordination:euORD.PR.p303.text	@ltx/gr_gr_cog/eu.ordination:euORD.PR.p303.text
ltx/gr_redirects_goarch/eu.ordination:euORD.PR.p304.text	@ltx/gr_gr_cog/eu.ordination:euORD.PR.p304.text
ltx/gr_redirects_goarch/eu.ordination:euORD.PR.p304a.text	@ltx/gr_gr_cog/eu.ordination:euORD.PR.p304a.text
ltx/gr_redirects_goarch/eu.ordination:euORD.PR.p304b.text	@ltx/gr_gr_cog/eu.ordination:euORD.PR.p304b.text
ltx/gr_redirects_goarch/eu.ordination:euORD.PR.p304c.text	@ltx/gr_gr_cog/eu.ordination:euORD.PR.p304c.text
ltx/gr_redirects_goarch/eu.ordination:euORD.PR.p305.text	@ltx/gr_gr_cog/eu.ordination:euORD.PR.p305.text
ltx/gr_redirects_goarch/eu.ordination:euORD.PR.p306.text	@ltx/gr_gr_cog/eu.ordination:euORD.PR.p306.text
ltx/gr_redirects_goarch/eu.ordination:euORD.PR.p307.text	@ltx/gr_gr_cog/eu.ordination:euORD.PR.p307.text
ltx/gr_redirects_goarch/eu.ordination:euORD.PR.r01	@ltx/gr_gr_cog/eu.ordination:euORD.PR.r01
ltx/gr_redirects_goarch/eu.ordination:euORD.PR.r02	@ltx/gr_gr_cog/eu.ordination:euORD.PR.r02
ltx/gr_redirects_goarch/eu.ordination:euORD.PR.r03	@ltx/gr_gr_cog/eu.ordination:euORD.PR.r03
ltx/gr_redirects_goarch/eu.ordination:euORD.PR.r04	@ltx/gr_gr_cog/eu.ordination:euORD.PR.r04
ltx/gr_redirects_goarch/eu.ordination:euORD.PR.r05a	@ltx/gr_gr_cog/eu.ordination:euORD.PR.r05a
ltx/gr_redirects_goarch/eu.ordination:euORD.PR.r05b	@ltx/gr_gr_cog/eu.ordination:euORD.PR.r05b
ltx/gr_redirects_goarch/eu.ordination:euORD.PR.r06	@ltx/gr_gr_cog/eu.ordination:euORD.PR.r06
ltx/gr_redirects_goarch/eu.ordination:euORD.PR.r07a	@ltx/gr_gr_cog/eu.ordination:euORD.PR.r07a
ltx/gr_redirects_goarch/eu.ordination:euORD.PR.r07b	@ltx/gr_gr_cog/eu.ordination:euORD.PR.r07b
ltx/gr_redirects_goarch/eu.ordination:euORD.PR.r08	@ltx/gr_gr_cog/eu.ordination:euORD.PR.r08
ltx/gr_redirects_goarch/eu.ordination:euORD.PR.r09	@ltx/gr_gr_cog/eu.ordination:euORD.PR.r09
ltx/gr_redirects_goarch/eu.ordination:euORD.PR.r10	@ltx/gr_gr_cog/eu.ordination:euORD.PR.r10
ltx/gr_redirects_goarch/eu.ordination:euORD.PR.r11	@ltx/gr_gr_cog/eu.ordination:euORD.PR.r11
ltx/gr_redirects_goarch/eu.ordination:euORD.PR.r12	@ltx/gr_gr_cog/eu.ordination:euORD.PR.r12
ltx/gr_redirects_goarch/eu.ordination:euORD.PR.r13	@ltx/gr_gr_cog/eu.ordination:euORD.PR.r13
ltx/gr_redirects_goarch/eu.ordination:euORD.PR.r14	@ltx/gr_gr_cog/eu.ordination:euORD.PR.r14
ltx/gr_redirects_goarch/eu.ordination:euORD.PR.r15	@ltx/gr_gr_cog/eu.ordination:euORD.PR.r15
ltx/gr_redirects_goarch/eu.ordination:euORD.PR.title	@ltx/gr_gr_cog/eu.ordination:euORD.PR.title
ltx/gr_redirects_goarch/eu.ordination:euORD.SD.p100.title	@ltx/gr_gr_cog/eu.ordination:euORD.SD.p100.title
ltx/gr_redirects_goarch/eu.ordination:euORD.SD.p101.text	@ltx/gr_gr_cog/eu.ordination:euORD.SD.p101.text
ltx/gr_redirects_goarch/eu.ordination:euORD.SD.p101a.text	@ltx/gr_gr_cog/eu.ordination:euORD.SD.p101a.text
ltx/gr_redirects_goarch/eu.ordination:euORD.SD.p101b.text	@ltx/gr_gr_cog/eu.ordination:euORD.SD.p101b.text
ltx/gr_redirects_goarch/eu.ordination:euORD.SD.p101c.text	@ltx/gr_gr_cog/eu.ordination:euORD.SD.p101c.text
ltx/gr_redirects_goarch/eu.ordination:euORD.SD.p102.text	@ltx/gr_gr_cog/eu.ordination:euORD.SD.p102.text
ltx/gr_redirects_goarch/eu.ordination:euORD.SD.r01	@ltx/gr_gr_cog/eu.ordination:euORD.SD.r01
ltx/gr_redirects_goarch/eu.ordination:euORD.SD.r02	@ltx/gr_gr_cog/eu.ordination:euORD.SD.r02
ltx/gr_redirects_goarch/eu.ordination:euORD.SD.r03	@ltx/gr_gr_cog/eu.ordination:euORD.SD.r03
ltx/gr_redirects_goarch/eu.ordination:euORD.SD.r04	@ltx/gr_gr_cog/eu.ordination:euORD.SD.r04
ltx/gr_redirects_goarch/eu.ordination:euORD.SD.r05	@ltx/gr_gr_cog/eu.ordination:euORD.SD.r05
ltx/gr_redirects_goarch/eu.ordination:euORD.SD.title	@ltx/gr_gr_cog/eu.ordination:euORD.SD.title
ltx/gr_redirects_goarch/eu.ordination:euORD.SF.p700.title	@ltx/gr_gr_cog/eu.ordination:euORD.SF.p700.title
ltx/gr_redirects_goarch/eu.ordination:euORD.SF.p701.text	@ltx/gr_gr_cog/eu.ordination:euORD.SF.p701.text
ltx/gr_redirects_goarch/eu.ordination:euORD.SF.p701a.text	@ltx/gr_gr_cog/eu.ordination:euORD.SF.p701a.text
ltx/gr_redirects_goarch/eu.ordination:euORD.SF.p701b.text	@ltx/gr_gr_cog/eu.ordination:euORD.SF.p701b.text
ltx/gr_redirects_goarch/eu.ordination:euORD.SF.p701c.text	@ltx/gr_gr_cog/eu.ordination:euORD.SF.p701c.text
ltx/gr_redirects_goarch/eu.ordination:euORD.SF.p702.text	@ltx/gr_gr_cog/eu.ordination:euORD.SF.p702.text
ltx/gr_redirects_goarch/eu.ordination:euORD.SF.p702a.text	@ltx/gr_gr_cog/eu.ordination:euORD.SF.p702a.text
ltx/gr_redirects_goarch/eu.ordination:euORD.SF.p702b.text	@ltx/gr_gr_cog/eu.ordination:euORD.SF.p702b.text
ltx/gr_redirects_goarch/eu.ordination:euORD.SF.p702c.text	@ltx/gr_gr_cog/eu.ordination:euORD.SF.p702c.text
ltx/gr_redirects_goarch/eu.ordination:euORD.SF.r01	@ltx/gr_gr_cog/eu.ordination:euORD.SF.r01
ltx/gr_redirects_goarch/eu.ordination:euORD.SF.r02	@ltx/gr_gr_cog/eu.ordination:euORD.SF.r02
ltx/gr_redirects_goarch/eu.ordination:euORD.SF.title	@ltx/gr_gr_cog/eu.ordination:euORD.SF.title
