ltx/gr_redirects_goarch/eo.e01:eo.Doxasticon.incipit	@ltx/gr_gr_cog/eo.e01:eo.Doxasticon.incipit
ltx/gr_redirects_goarch/eo.e01:eo.Doxasticon.mode	@ltx/gr_gr_cog/eo.e01:eo.Doxasticon.mode
ltx/gr_redirects_goarch/eo.e01:eo.Doxasticon.text	@ltx/gr_gr_cog/eo.e01:eo.Doxasticon.text
ltx/gr_redirects_goarch/eo.e01:eo.Exaposteilarion.greekmelody	@ltx/gr_gr_cog/eo.e01:eo.Exaposteilarion.greekmelody
ltx/gr_redirects_goarch/eo.e01:eo.Exaposteilarion.incipit	@ltx/gr_gr_cog/eo.e01:eo.Exaposteilarion.incipit
ltx/gr_redirects_goarch/eo.e01:eo.Exaposteilarion.melody	@ltx/gr_gr_cog/eo.e01:eo.Exaposteilarion.melody
ltx/gr_redirects_goarch/eo.e01:eo.Exaposteilarion.mode	@ltx/gr_gr_cog/eo.e01:eo.Exaposteilarion.mode
ltx/gr_redirects_goarch/eo.e01:eo.Exaposteilarion.text	@ltx/gr_gr_cog/eo.e01:eo.Exaposteilarion.text
ltx/gr_redirects_goarch/eo.e01:eo.Theotokion.incipit	@ltx/gr_gr_cog/eo.e01:eo.Theotokion.incipit
ltx/gr_redirects_goarch/eo.e01:eo.Theotokion.melody	@ltx/gr_gr_cog/eo.e01:eo.Theotokion.melody
ltx/gr_redirects_goarch/eo.e01:eo.Theotokion.mode	@ltx/gr_gr_cog/eo.e01:eo.Theotokion.mode
ltx/gr_redirects_goarch/eo.e01:eo.Theotokion.text	@ltx/gr_gr_cog/eo.e01:eo.Theotokion.text
ltx/gr_redirects_goarch/eo.e01:eo.title	@ltx/gr_gr_cog/eo.e01:eo.title
