ltx/gr_redirects_goarch/ty.typikon.pe:tyPE.PaschalEnarxis1	@ltx/gr_gr_cog/ty.typikon.pe:tyPE.PaschalEnarxis1
ltx/gr_redirects_goarch/ty.typikon.pe:tyPE.PaschalEnarxis2	@ltx/gr_gr_cog/ty.typikon.pe:tyPE.PaschalEnarxis2
ltx/gr_redirects_goarch/ty.typikon.pe:tyPE.PaschalEnarxis3	@ltx/gr_gr_cog/ty.typikon.pe:tyPE.PaschalEnarxis3
ltx/gr_redirects_goarch/ty.typikon.pe:tyPE.PaschalEnarxis4	@ltx/gr_gr_cog/ty.typikon.pe:tyPE.PaschalEnarxis4
ltx/gr_redirects_goarch/ty.typikon.pe:tyPE.PaschalEnarxis5	@ltx/gr_gr_cog/ty.typikon.pe:tyPE.PaschalEnarxis5
ltx/gr_redirects_goarch/ty.typikon.pe:tyPE.PaschalEnarxis6	@ltx/gr_gr_cog/ty.typikon.pe:tyPE.PaschalEnarxis6
ltx/gr_redirects_goarch/ty.typikon.pe:tyPE.PaschalEnarxis7	@ltx/gr_gr_cog/ty.typikon.pe:tyPE.PaschalEnarxis7
