ltx/gr_redirects_goarch/le.go.mc.d068:lemcMA.Gospel.book_abbr	@ltx/gr_gr_cog/le.go.mc.d068:lemcMA.Gospel.book_abbr
ltx/gr_redirects_goarch/le.go.mc.d068:lemcMA.Gospel.book_string	@ltx/gr_gr_cog/le.go.mc.d068:lemcMA.Gospel.book_string
ltx/gr_redirects_goarch/le.go.mc.d068:lemcMA.Gospel.chapverse	@ltx/gr_gr_cog/le.go.mc.d068:lemcMA.Gospel.chapverse
ltx/gr_redirects_goarch/le.go.mc.d068:lemcMA.Gospel.incipit	@ltx/gr_gr_cog/le.go.mc.d068:lemcMA.Gospel.incipit
ltx/gr_redirects_goarch/le.go.mc.d068:lemcMA.Gospel.text	@ltx/gr_gr_cog/le.go.mc.d068:lemcMA.Gospel.text
ltx/gr_redirects_goarch/le.go.mc.d068:lemcMA.Gospel.title	@ltx/gr_gr_cog/le.go.mc.d068:lemcMA.Gospel.title
ltx/gr_redirects_goarch/le.go.mc.d068:lemcMA.Gospel.title_abbr	@ltx/gr_gr_cog/le.go.mc.d068:lemcMA.Gospel.title_abbr
ltx/gr_redirects_goarch/le.go.mc.d068:lemcMA.Gospel.version	@ltx/gr_gr_cog/le.go.mc.d068:lemcMA.Gospel.version
ltx/gr_redirects_goarch/le.go.mc.d068:lemcVE.Gospel.book_abbr	@ltx/gr_gr_cog/le.go.mc.d068:lemcVE.Gospel.book_abbr
ltx/gr_redirects_goarch/le.go.mc.d068:lemcVE.Gospel.book_string	@ltx/gr_gr_cog/le.go.mc.d068:lemcVE.Gospel.book_string
ltx/gr_redirects_goarch/le.go.mc.d068:lemcVE.Gospel.chapverse	@ltx/gr_gr_cog/le.go.mc.d068:lemcVE.Gospel.chapverse
ltx/gr_redirects_goarch/le.go.mc.d068:lemcVE.Gospel.incipit	@ltx/gr_gr_cog/le.go.mc.d068:lemcVE.Gospel.incipit
ltx/gr_redirects_goarch/le.go.mc.d068:lemcVE.Gospel.text	@ltx/gr_gr_cog/le.go.mc.d068:lemcVE.Gospel.text
ltx/gr_redirects_goarch/le.go.mc.d068:lemcVE.Gospel.title	@ltx/gr_gr_cog/le.go.mc.d068:lemcVE.Gospel.title
ltx/gr_redirects_goarch/le.go.mc.d068:lemcVE.Gospel.title_abbr	@ltx/gr_gr_cog/le.go.mc.d068:lemcVE.Gospel.title_abbr
ltx/gr_redirects_goarch/le.go.mc.d068:lemcVE.Gospel.version	@ltx/gr_gr_cog/le.go.mc.d068:lemcVE.Gospel.version
