ltx/gr_redirects_goarch/sy.m02.d01:cl.syMA.commemoration01.text	@ltx/gr_gr_cog/sy.m02.d01:cl.syMA.commemoration01.text
ltx/gr_redirects_goarch/sy.m02.d01:cl.syMA.commemoration02.text	@ltx/gr_gr_cog/sy.m02.d01:cl.syMA.commemoration02.text
ltx/gr_redirects_goarch/sy.m02.d01:cl.syMA.commemoration03.text	@ltx/gr_gr_cog/sy.m02.d01:cl.syMA.commemoration03.text
ltx/gr_redirects_goarch/sy.m02.d01:cl.syMA.commemoration04.text	@ltx/gr_gr_cog/sy.m02.d01:cl.syMA.commemoration04.text
ltx/gr_redirects_goarch/sy.m02.d01:cl.syMA.commemoration05.text	@ltx/gr_gr_cog/sy.m02.d01:cl.syMA.commemoration05.text
ltx/gr_redirects_goarch/sy.m02.d01:cl.syMA.commemoration06.text	@ltx/gr_gr_cog/sy.m02.d01:cl.syMA.commemoration06.text
ltx/gr_redirects_goarch/sy.m02.d01:syMA.commemoration01.couplet1.title	@ltx/gr_gr_cog/sy.m02.d01:syMA.commemoration01.couplet1.title
ltx/gr_redirects_goarch/sy.m02.d01:syMA.commemoration01.couplet1.verse1	@ltx/gr_gr_cog/sy.m02.d01:syMA.commemoration01.couplet1.verse1
ltx/gr_redirects_goarch/sy.m02.d01:syMA.commemoration01.couplet1.verse2	@ltx/gr_gr_cog/sy.m02.d01:syMA.commemoration01.couplet1.verse2
ltx/gr_redirects_goarch/sy.m02.d01:syMA.commemoration01.narration.p01	@ltx/gr_gr_cog/sy.m02.d01:syMA.commemoration01.narration.p01
ltx/gr_redirects_goarch/sy.m02.d01:syMA.commemoration01.narration.p02	@ltx/gr_gr_cog/sy.m02.d01:syMA.commemoration01.narration.p02
ltx/gr_redirects_goarch/sy.m02.d01:syMA.commemoration01.single1	@ltx/gr_gr_cog/sy.m02.d01:syMA.commemoration01.single1
ltx/gr_redirects_goarch/sy.m02.d01:syMA.commemoration01.text	@ltx/gr_gr_cog/sy.m02.d01:syMA.commemoration01.text
ltx/gr_redirects_goarch/sy.m02.d01:syMA.commemoration02.couplet1.title	@ltx/gr_gr_cog/sy.m02.d01:syMA.commemoration02.couplet1.title
ltx/gr_redirects_goarch/sy.m02.d01:syMA.commemoration02.couplet1.verse1	@ltx/gr_gr_cog/sy.m02.d01:syMA.commemoration02.couplet1.verse1
ltx/gr_redirects_goarch/sy.m02.d01:syMA.commemoration02.couplet1.verse2	@ltx/gr_gr_cog/sy.m02.d01:syMA.commemoration02.couplet1.verse2
ltx/gr_redirects_goarch/sy.m02.d01:syMA.commemoration02.narration.p01	@ltx/gr_gr_cog/sy.m02.d01:syMA.commemoration02.narration.p01
ltx/gr_redirects_goarch/sy.m02.d01:syMA.commemoration02.text	@ltx/gr_gr_cog/sy.m02.d01:syMA.commemoration02.text
ltx/gr_redirects_goarch/sy.m02.d01:syMA.commemoration03.couplet1.title	@ltx/gr_gr_cog/sy.m02.d01:syMA.commemoration03.couplet1.title
ltx/gr_redirects_goarch/sy.m02.d01:syMA.commemoration03.couplet1.verse1	@ltx/gr_gr_cog/sy.m02.d01:syMA.commemoration03.couplet1.verse1
ltx/gr_redirects_goarch/sy.m02.d01:syMA.commemoration03.couplet1.verse2	@ltx/gr_gr_cog/sy.m02.d01:syMA.commemoration03.couplet1.verse2
ltx/gr_redirects_goarch/sy.m02.d01:syMA.commemoration03.narration.p01	@ltx/gr_gr_cog/sy.m02.d01:syMA.commemoration03.narration.p01
ltx/gr_redirects_goarch/sy.m02.d01:syMA.commemoration03.text	@ltx/gr_gr_cog/sy.m02.d01:syMA.commemoration03.text
ltx/gr_redirects_goarch/sy.m02.d01:syMA.commemoration04.couplet1.title	@ltx/gr_gr_cog/sy.m02.d01:syMA.commemoration04.couplet1.title
ltx/gr_redirects_goarch/sy.m02.d01:syMA.commemoration04.couplet1.verse1	@ltx/gr_gr_cog/sy.m02.d01:syMA.commemoration04.couplet1.verse1
ltx/gr_redirects_goarch/sy.m02.d01:syMA.commemoration04.couplet1.verse2	@ltx/gr_gr_cog/sy.m02.d01:syMA.commemoration04.couplet1.verse2
ltx/gr_redirects_goarch/sy.m02.d01:syMA.commemoration04.text	@ltx/gr_gr_cog/sy.m02.d01:syMA.commemoration04.text
ltx/gr_redirects_goarch/sy.m02.d01:syMA.commemoration05.couplet1.title	@ltx/gr_gr_cog/sy.m02.d01:syMA.commemoration05.couplet1.title
ltx/gr_redirects_goarch/sy.m02.d01:syMA.commemoration05.couplet1.verse1	@ltx/gr_gr_cog/sy.m02.d01:syMA.commemoration05.couplet1.verse1
ltx/gr_redirects_goarch/sy.m02.d01:syMA.commemoration05.couplet1.verse2	@ltx/gr_gr_cog/sy.m02.d01:syMA.commemoration05.couplet1.verse2
ltx/gr_redirects_goarch/sy.m02.d01:syMA.commemoration05.text	@ltx/gr_gr_cog/sy.m02.d01:syMA.commemoration05.text
ltx/gr_redirects_goarch/sy.m02.d01:syMA.commemoration06.couplet1.title	@ltx/gr_gr_cog/sy.m02.d01:syMA.commemoration06.couplet1.title
ltx/gr_redirects_goarch/sy.m02.d01:syMA.commemoration06.couplet1.verse1	@ltx/gr_gr_cog/sy.m02.d01:syMA.commemoration06.couplet1.verse1
ltx/gr_redirects_goarch/sy.m02.d01:syMA.commemoration06.couplet1.verse2	@ltx/gr_gr_cog/sy.m02.d01:syMA.commemoration06.couplet1.verse2
ltx/gr_redirects_goarch/sy.m02.d01:syMA.commemoration06.text	@ltx/gr_gr_cog/sy.m02.d01:syMA.commemoration06.text
ltx/gr_redirects_goarch/sy.m02.d01:syMA.commemoration07.couplet1.title	@ltx/gr_gr_cog/sy.m02.d01:syMA.commemoration07.couplet1.title
ltx/gr_redirects_goarch/sy.m02.d01:syMA.commemoration07.couplet1.verse1	@ltx/gr_gr_cog/sy.m02.d01:syMA.commemoration07.couplet1.verse1
ltx/gr_redirects_goarch/sy.m02.d01:syMA.commemoration07.couplet1.verse2	@ltx/gr_gr_cog/sy.m02.d01:syMA.commemoration07.couplet1.verse2
ltx/gr_redirects_goarch/sy.m02.d01:syMA.commemoration07.text	@ltx/gr_gr_cog/sy.m02.d01:syMA.commemoration07.text
ltx/gr_redirects_goarch/sy.m02.d01:syMA.commemoration08.couplet1.title	@ltx/gr_gr_cog/sy.m02.d01:syMA.commemoration08.couplet1.title
ltx/gr_redirects_goarch/sy.m02.d01:syMA.commemoration08.couplet1.verse1	@ltx/gr_gr_cog/sy.m02.d01:syMA.commemoration08.couplet1.verse1
ltx/gr_redirects_goarch/sy.m02.d01:syMA.commemoration08.couplet1.verse2	@ltx/gr_gr_cog/sy.m02.d01:syMA.commemoration08.couplet1.verse2
ltx/gr_redirects_goarch/sy.m02.d01:syMA.commemoration08.narration.p01	@ltx/gr_gr_cog/sy.m02.d01:syMA.commemoration08.narration.p01
ltx/gr_redirects_goarch/sy.m02.d01:syMA.commemoration08.text	@ltx/gr_gr_cog/sy.m02.d01:syMA.commemoration08.text
ltx/gr_redirects_goarch/sy.m02.d01:syMA.commemoration09.couplet1.title	@ltx/gr_gr_cog/sy.m02.d01:syMA.commemoration09.couplet1.title
ltx/gr_redirects_goarch/sy.m02.d01:syMA.commemoration09.couplet1.verse1	@ltx/gr_gr_cog/sy.m02.d01:syMA.commemoration09.couplet1.verse1
ltx/gr_redirects_goarch/sy.m02.d01:syMA.commemoration09.couplet1.verse2	@ltx/gr_gr_cog/sy.m02.d01:syMA.commemoration09.couplet1.verse2
ltx/gr_redirects_goarch/sy.m02.d01:syMA.commemoration09.text	@ltx/gr_gr_cog/sy.m02.d01:syMA.commemoration09.text
ltx/gr_redirects_goarch/sy.m02.d01:syMA.lastline	@ltx/gr_gr_cog/sy.m02.d01:syMA.lastline
