ltx/gr_redirects_goarch/oc.m6.d7:ocBK.ModeNaked	@ltx/gr_gr_cog/oc.m6.d7:ocBK.ModeNaked
ltx/gr_redirects_goarch/oc.m6.d7:ocBK.end.title	@ltx/gr_gr_cog/oc.m6.d7:ocBK.end.title
ltx/gr_redirects_goarch/oc.m6.d7:ocBK.end.verse1.text	@ltx/gr_gr_cog/oc.m6.d7:ocBK.end.verse1.text
ltx/gr_redirects_goarch/oc.m6.d7:ocBK.end.verse2.text	@ltx/gr_gr_cog/oc.m6.d7:ocBK.end.verse2.text
ltx/gr_redirects_goarch/oc.m6.d7:ocBK.end.verse3.text	@ltx/gr_gr_cog/oc.m6.d7:ocBK.end.verse3.text
ltx/gr_redirects_goarch/oc.m6.d7:ocBK.end.verse4.text	@ltx/gr_gr_cog/oc.m6.d7:ocBK.end.verse4.text
ltx/gr_redirects_goarch/oc.m6.d7:ocBK.end.verse5.text	@ltx/gr_gr_cog/oc.m6.d7:ocBK.end.verse5.text
ltx/gr_redirects_goarch/oc.m6.d7:ocBK.end.verse6.text	@ltx/gr_gr_cog/oc.m6.d7:ocBK.end.verse6.text
ltx/gr_redirects_goarch/oc.m6.d7:ocLI.Beatitudes1.incipit	@ltx/gr_gr_cog/oc.m6.d7:ocLI.Beatitudes1.incipit
ltx/gr_redirects_goarch/oc.m6.d7:ocLI.Beatitudes1.melody	@ltx/gr_gr_cog/oc.m6.d7:ocLI.Beatitudes1.melody
ltx/gr_redirects_goarch/oc.m6.d7:ocLI.Beatitudes1.mode	@ltx/gr_gr_cog/oc.m6.d7:ocLI.Beatitudes1.mode
ltx/gr_redirects_goarch/oc.m6.d7:ocLI.Beatitudes1.text	@ltx/gr_gr_cog/oc.m6.d7:ocLI.Beatitudes1.text
ltx/gr_redirects_goarch/oc.m6.d7:ocLI.Beatitudes2.incipit	@ltx/gr_gr_cog/oc.m6.d7:ocLI.Beatitudes2.incipit
ltx/gr_redirects_goarch/oc.m6.d7:ocLI.Beatitudes2.melody	@ltx/gr_gr_cog/oc.m6.d7:ocLI.Beatitudes2.melody
ltx/gr_redirects_goarch/oc.m6.d7:ocLI.Beatitudes2.mode	@ltx/gr_gr_cog/oc.m6.d7:ocLI.Beatitudes2.mode
ltx/gr_redirects_goarch/oc.m6.d7:ocLI.Beatitudes2.text	@ltx/gr_gr_cog/oc.m6.d7:ocLI.Beatitudes2.text
ltx/gr_redirects_goarch/oc.m6.d7:ocLI.Beatitudes3.incipit	@ltx/gr_gr_cog/oc.m6.d7:ocLI.Beatitudes3.incipit
ltx/gr_redirects_goarch/oc.m6.d7:ocLI.Beatitudes3.melody	@ltx/gr_gr_cog/oc.m6.d7:ocLI.Beatitudes3.melody
ltx/gr_redirects_goarch/oc.m6.d7:ocLI.Beatitudes3.mode	@ltx/gr_gr_cog/oc.m6.d7:ocLI.Beatitudes3.mode
ltx/gr_redirects_goarch/oc.m6.d7:ocLI.Beatitudes3.text	@ltx/gr_gr_cog/oc.m6.d7:ocLI.Beatitudes3.text
ltx/gr_redirects_goarch/oc.m6.d7:ocLI.Beatitudes4.incipit	@ltx/gr_gr_cog/oc.m6.d7:ocLI.Beatitudes4.incipit
ltx/gr_redirects_goarch/oc.m6.d7:ocLI.Beatitudes4.melody	@ltx/gr_gr_cog/oc.m6.d7:ocLI.Beatitudes4.melody
ltx/gr_redirects_goarch/oc.m6.d7:ocLI.Beatitudes4.mode	@ltx/gr_gr_cog/oc.m6.d7:ocLI.Beatitudes4.mode
ltx/gr_redirects_goarch/oc.m6.d7:ocLI.Beatitudes4.text	@ltx/gr_gr_cog/oc.m6.d7:ocLI.Beatitudes4.text
ltx/gr_redirects_goarch/oc.m6.d7:ocLI.BeatitudesT.incipit	@ltx/gr_gr_cog/oc.m6.d7:ocLI.BeatitudesT.incipit
ltx/gr_redirects_goarch/oc.m6.d7:ocLI.BeatitudesT.melody	@ltx/gr_gr_cog/oc.m6.d7:ocLI.BeatitudesT.melody
ltx/gr_redirects_goarch/oc.m6.d7:ocLI.BeatitudesT.mode	@ltx/gr_gr_cog/oc.m6.d7:ocLI.BeatitudesT.mode
ltx/gr_redirects_goarch/oc.m6.d7:ocLI.BeatitudesT.text	@ltx/gr_gr_cog/oc.m6.d7:ocLI.BeatitudesT.text
ltx/gr_redirects_goarch/oc.m6.d7:ocLI.BeatitudesTr.incipit	@ltx/gr_gr_cog/oc.m6.d7:ocLI.BeatitudesTr.incipit
ltx/gr_redirects_goarch/oc.m6.d7:ocLI.BeatitudesTr.melody	@ltx/gr_gr_cog/oc.m6.d7:ocLI.BeatitudesTr.melody
ltx/gr_redirects_goarch/oc.m6.d7:ocLI.BeatitudesTr.mode	@ltx/gr_gr_cog/oc.m6.d7:ocLI.BeatitudesTr.mode
ltx/gr_redirects_goarch/oc.m6.d7:ocLI.BeatitudesTr.text	@ltx/gr_gr_cog/oc.m6.d7:ocLI.BeatitudesTr.text
ltx/gr_redirects_goarch/oc.m6.d7:ocLI.MM.Beatitudes1234TrTas78910GB.text	@ltx/gr_gr_cog/oc.m6.d7:ocLI.MM.Beatitudes1234TrTas78910GB.text
ltx/gr_redirects_goarch/oc.m6.d7:ocMA.ApolTheotokion.incipit	@ltx/gr_gr_cog/oc.m6.d7:ocMA.ApolTheotokion.incipit
ltx/gr_redirects_goarch/oc.m6.d7:ocMA.ApolTheotokion.melody	@ltx/gr_gr_cog/oc.m6.d7:ocMA.ApolTheotokion.greekmelody
ltx/gr_redirects_goarch/oc.m6.d7:ocMA.ApolTheotokion.mode	@ltx/gr_gr_cog/oc.m6.d7:ocMA.ApolTheotokion.mode
ltx/gr_redirects_goarch/oc.m6.d7:ocMA.ApolTheotokion.text	@ltx/gr_gr_cog/oc.m6.d7:ocMA.ApolTheotokion.text
ltx/gr_redirects_goarch/oc.m6.d7:ocMA.AposTheotokion.greekmelody	@ltx/gr_gr_cog/oc.m6.d7:ocMA.AposTheotokion.greekmelody
ltx/gr_redirects_goarch/oc.m6.d7:ocMA.AposTheotokion.incipit	@ltx/gr_gr_cog/oc.m6.d7:ocMA.AposTheotokion.incipit
ltx/gr_redirects_goarch/oc.m6.d7:ocMA.AposTheotokion.melody	@ltx/gr_gr_cog/oc.m6.d7:ocMA.AposTheotokion.melody
ltx/gr_redirects_goarch/oc.m6.d7:ocMA.AposTheotokion.mode	@ltx/gr_gr_cog/oc.m6.d7:ocMA.AposTheotokion.mode
ltx/gr_redirects_goarch/oc.m6.d7:ocMA.AposTheotokion.text	@ltx/gr_gr_cog/oc.m6.d7:ocMA.AposTheotokion.text
ltx/gr_redirects_goarch/oc.m6.d7:ocMA.Aposticha1.greekmelody	@ltx/gr_gr_cog/oc.m6.d7:ocMA.Aposticha1.greekmelody
ltx/gr_redirects_goarch/oc.m6.d7:ocMA.Aposticha1.incipit	@ltx/gr_gr_cog/oc.m6.d7:ocMA.Aposticha1.incipit
ltx/gr_redirects_goarch/oc.m6.d7:ocMA.Aposticha1.melody	@ltx/gr_gr_cog/oc.m6.d7:ocMA.Aposticha1.melody
ltx/gr_redirects_goarch/oc.m6.d7:ocMA.Aposticha1.mode	@ltx/gr_gr_cog/oc.m6.d7:ocMA.Aposticha1.mode
ltx/gr_redirects_goarch/oc.m6.d7:ocMA.Aposticha1.text	@ltx/gr_gr_cog/oc.m6.d7:ocMA.Aposticha1.text
ltx/gr_redirects_goarch/oc.m6.d7:ocMA.Aposticha2.greekmelody	@ltx/gr_gr_cog/oc.m6.d7:ocMA.Aposticha2.greekmelody
ltx/gr_redirects_goarch/oc.m6.d7:ocMA.Aposticha2.incipit	@ltx/gr_gr_cog/oc.m6.d7:ocMA.Aposticha2.incipit
ltx/gr_redirects_goarch/oc.m6.d7:ocMA.Aposticha2.melody	@ltx/gr_gr_cog/oc.m6.d7:ocMA.Aposticha2.melody
ltx/gr_redirects_goarch/oc.m6.d7:ocMA.Aposticha2.mode	@ltx/gr_gr_cog/oc.m6.d7:ocMA.Aposticha2.mode
ltx/gr_redirects_goarch/oc.m6.d7:ocMA.Aposticha2.text	@ltx/gr_gr_cog/oc.m6.d7:ocMA.Aposticha2.text
ltx/gr_redirects_goarch/oc.m6.d7:ocMA.Aposticha3.greekmelody	@ltx/gr_gr_cog/oc.m6.d7:ocMA.Aposticha3.greekmelody
ltx/gr_redirects_goarch/oc.m6.d7:ocMA.Aposticha3.incipit	@ltx/gr_gr_cog/oc.m6.d7:ocMA.Aposticha3.incipit
ltx/gr_redirects_goarch/oc.m6.d7:ocMA.Aposticha3.melody	@ltx/gr_gr_cog/oc.m6.d7:ocMA.Aposticha3.melody
ltx/gr_redirects_goarch/oc.m6.d7:ocMA.Aposticha3.mode	@ltx/gr_gr_cog/oc.m6.d7:ocMA.Aposticha3.mode
ltx/gr_redirects_goarch/oc.m6.d7:ocMA.Aposticha3.text	@ltx/gr_gr_cog/oc.m6.d7:ocMA.Aposticha3.text
ltx/gr_redirects_goarch/oc.m6.d7:ocMA.C1.acrostic.notice1	@ltx/gr_gr_cog/oc.m6.d7:ocMA.C1.acrostic.notice1
ltx/gr_redirects_goarch/oc.m6.d7:ocMA.C1.acrostic.text	@ltx/gr_gr_cog/oc.m6.d7:ocMA.C1.acrostic.text
ltx/gr_redirects_goarch/oc.m6.d7:ocMA.C1.acrostic.title	@ltx/gr_gr_cog/oc.m6.d7:ocMA.C1.acrostic.title
ltx/gr_redirects_goarch/oc.m6.d7:ocMA.C2.acrostic.notice1	@ltx/gr_gr_cog/oc.m6.d7:ocMA.C2.acrostic.notice1
ltx/gr_redirects_goarch/oc.m6.d7:ocMA.C2.acrostic.text	@ltx/gr_gr_cog/oc.m6.d7:ocMA.C2.acrostic.text
ltx/gr_redirects_goarch/oc.m6.d7:ocMA.C2.acrostic.title	@ltx/gr_gr_cog/oc.m6.d7:ocMA.C2.acrostic.title
ltx/gr_redirects_goarch/oc.m6.d7:ocMA.CA.notice	@ltx/gr_gr_cog/oc.m6.d7:ocMA.CA.notice
ltx/gr_redirects_goarch/oc.m6.d7:ocMA.Kathisma11.greekmelody	@ltx/gr_gr_cog/oc.m6.d7:ocMA.Kathisma11.greekmelody
ltx/gr_redirects_goarch/oc.m6.d7:ocMA.Kathisma11.incipit	@ltx/gr_gr_cog/oc.m6.d7:ocMA.Kathisma11.incipit
ltx/gr_redirects_goarch/oc.m6.d7:ocMA.Kathisma11.melody	@ltx/gr_gr_cog/oc.m6.d7:ocMA.Kathisma11.melody
ltx/gr_redirects_goarch/oc.m6.d7:ocMA.Kathisma11.mode	@ltx/gr_gr_cog/oc.m6.d7:ocMA.Kathisma11.mode
ltx/gr_redirects_goarch/oc.m6.d7:ocMA.Kathisma11.text	@ltx/gr_gr_cog/oc.m6.d7:ocMA.Kathisma11.text
ltx/gr_redirects_goarch/oc.m6.d7:ocMA.Kathisma12.incipit	@ltx/gr_gr_cog/oc.m6.d7:ocMA.Kathisma12.incipit
ltx/gr_redirects_goarch/oc.m6.d7:ocMA.Kathisma12.melody	@ltx/gr_gr_cog/oc.m6.d7:ocMA.Kathisma12.melody
ltx/gr_redirects_goarch/oc.m6.d7:ocMA.Kathisma12.mode	@ltx/gr_gr_cog/oc.m6.d7:ocMA.Kathisma12.mode
ltx/gr_redirects_goarch/oc.m6.d7:ocMA.Kathisma12.text	@ltx/gr_gr_cog/oc.m6.d7:ocMA.Kathisma12.text
ltx/gr_redirects_goarch/oc.m6.d7:ocMA.Kathisma13.incipit	@ltx/gr_gr_cog/oc.m6.d7:ocMA.Kathisma13.incipit
ltx/gr_redirects_goarch/oc.m6.d7:ocMA.Kathisma13.melody	@ltx/gr_gr_cog/oc.m6.d7:ocMA.Kathisma13.melody
ltx/gr_redirects_goarch/oc.m6.d7:ocMA.Kathisma13.mode	@ltx/gr_gr_cog/oc.m6.d7:ocMA.Kathisma13.mode
ltx/gr_redirects_goarch/oc.m6.d7:ocMA.Kathisma13.text	@ltx/gr_gr_cog/oc.m6.d7:ocMA.Kathisma13.text
ltx/gr_redirects_goarch/oc.m6.d7:ocMA.Kathisma14.incipit	@ltx/gr_gr_cog/oc.m6.d7:ocMA.Kathisma14.incipit
ltx/gr_redirects_goarch/oc.m6.d7:ocMA.Kathisma14.melody	@ltx/gr_gr_cog/oc.m6.d7:ocMA.Kathisma14.melody
ltx/gr_redirects_goarch/oc.m6.d7:ocMA.Kathisma14.mode	@ltx/gr_gr_cog/oc.m6.d7:ocMA.Kathisma14.mode
ltx/gr_redirects_goarch/oc.m6.d7:ocMA.Kathisma14.text	@ltx/gr_gr_cog/oc.m6.d7:ocMA.Kathisma14.text
ltx/gr_redirects_goarch/oc.m6.d7:ocMA.Kathisma21.incipit	@ltx/gr_gr_cog/oc.m6.d7:ocMA.Kathisma21.incipit
ltx/gr_redirects_goarch/oc.m6.d7:ocMA.Kathisma21.melody	@ltx/gr_gr_cog/oc.m6.d7:ocMA.Kathisma21.melody
ltx/gr_redirects_goarch/oc.m6.d7:ocMA.Kathisma21.mode	@ltx/gr_gr_cog/oc.m6.d7:ocMA.Kathisma21.mode
ltx/gr_redirects_goarch/oc.m6.d7:ocMA.Kathisma21.text	@ltx/gr_gr_cog/oc.m6.d7:ocMA.Kathisma21.text
ltx/gr_redirects_goarch/oc.m6.d7:ocMA.Kathisma22.incipit	@ltx/gr_gr_cog/oc.m6.d7:ocMA.Kathisma22.incipit
ltx/gr_redirects_goarch/oc.m6.d7:ocMA.Kathisma22.melody	@ltx/gr_gr_cog/oc.m6.d7:ocMA.Kathisma22.melody
ltx/gr_redirects_goarch/oc.m6.d7:ocMA.Kathisma22.mode	@ltx/gr_gr_cog/oc.m6.d7:ocMA.Kathisma22.mode
ltx/gr_redirects_goarch/oc.m6.d7:ocMA.Kathisma22.text	@ltx/gr_gr_cog/oc.m6.d7:ocMA.Kathisma22.text
ltx/gr_redirects_goarch/oc.m6.d7:ocMA.Kathisma23.greekmelody	@ltx/gr_gr_cog/oc.m6.d7:ocMA.Kathisma23.greekmelody
ltx/gr_redirects_goarch/oc.m6.d7:ocMA.Kathisma23.incipit	@ltx/gr_gr_cog/oc.m6.d7:ocMA.Kathisma23.incipit
ltx/gr_redirects_goarch/oc.m6.d7:ocMA.Kathisma23.melody	@ltx/gr_gr_cog/oc.m6.d7:ocMA.Kathisma23.melody
ltx/gr_redirects_goarch/oc.m6.d7:ocMA.Kathisma23.mode	@ltx/gr_gr_cog/oc.m6.d7:ocMA.Kathisma23.mode
ltx/gr_redirects_goarch/oc.m6.d7:ocMA.Kathisma23.text	@ltx/gr_gr_cog/oc.m6.d7:ocMA.Kathisma23.text
ltx/gr_redirects_goarch/oc.m6.d7:ocMA.Lauds1.incipit	@ltx/gr_gr_cog/oc.m6.d7:ocMA.Lauds1.incipit
ltx/gr_redirects_goarch/oc.m6.d7:ocMA.Lauds1.melody	@ltx/gr_gr_cog/oc.m6.d7:ocMA.Lauds1.melody
ltx/gr_redirects_goarch/oc.m6.d7:ocMA.Lauds1.mode	@ltx/gr_gr_cog/oc.m6.d7:ocMA.Lauds1.mode
ltx/gr_redirects_goarch/oc.m6.d7:ocMA.Lauds1.text	@ltx/gr_gr_cog/oc.m6.d7:ocMA.Lauds1.text
ltx/gr_redirects_goarch/oc.m6.d7:ocMA.Lauds2.incipit	@ltx/gr_gr_cog/oc.m6.d7:ocMA.Lauds2.incipit
ltx/gr_redirects_goarch/oc.m6.d7:ocMA.Lauds2.melody	@ltx/gr_gr_cog/oc.m6.d7:ocMA.Lauds2.melody
ltx/gr_redirects_goarch/oc.m6.d7:ocMA.Lauds2.mode	@ltx/gr_gr_cog/oc.m6.d7:ocMA.Lauds2.mode
ltx/gr_redirects_goarch/oc.m6.d7:ocMA.Lauds2.text	@ltx/gr_gr_cog/oc.m6.d7:ocMA.Lauds2.text
ltx/gr_redirects_goarch/oc.m6.d7:ocMA.Lauds3.incipit	@ltx/gr_gr_cog/oc.m6.d7:ocMA.Lauds3.incipit
ltx/gr_redirects_goarch/oc.m6.d7:ocMA.Lauds3.melody	@ltx/gr_gr_cog/oc.m6.d7:ocMA.Lauds3.melody
ltx/gr_redirects_goarch/oc.m6.d7:ocMA.Lauds3.mode	@ltx/gr_gr_cog/oc.m6.d7:ocMA.Lauds3.mode
ltx/gr_redirects_goarch/oc.m6.d7:ocMA.Lauds3.text	@ltx/gr_gr_cog/oc.m6.d7:ocMA.Lauds3.text
ltx/gr_redirects_goarch/oc.m6.d7:ocMA.Lauds4.incipit	@ltx/gr_gr_cog/oc.m6.d7:ocMA.Lauds4.incipit
ltx/gr_redirects_goarch/oc.m6.d7:ocMA.Lauds4.melody	@ltx/gr_gr_cog/oc.m6.d7:ocMA.Lauds4.melody
ltx/gr_redirects_goarch/oc.m6.d7:ocMA.Lauds4.mode	@ltx/gr_gr_cog/oc.m6.d7:ocMA.Lauds4.mode
ltx/gr_redirects_goarch/oc.m6.d7:ocMA.Lauds4.text	@ltx/gr_gr_cog/oc.m6.d7:ocMA.Lauds4.text
ltx/gr_redirects_goarch/oc.m6.d7:ocMA.LaudsGlory.incipit	@ltx/gr_gr_cog/oc.m6.d7:ocMA.LaudsGlory.incipit
ltx/gr_redirects_goarch/oc.m6.d7:ocMA.LaudsGlory.melody	@ltx/gr_gr_cog/oc.m6.d7:ocMA.LaudsGlory.melody
ltx/gr_redirects_goarch/oc.m6.d7:ocMA.LaudsGlory.mode	@ltx/gr_gr_cog/oc.m6.d7:ocMA.LaudsGlory.mode
ltx/gr_redirects_goarch/oc.m6.d7:ocMA.LaudsGlory.text	@ltx/gr_gr_cog/oc.m6.d7:ocMA.LaudsGlory.text
ltx/gr_redirects_goarch/oc.m6.d7:ocMA.LaudsRubric1.text	@ltx/gr_gr_cog/oc.m6.d7:ocMA.LaudsRubric1.text
ltx/gr_redirects_goarch/oc.m6.d7:ocMA.LaudsTheotokion.incipit	@ltx/gr_gr_cog/oc.m6.d7:ocMA.LaudsTheotokion.incipit
ltx/gr_redirects_goarch/oc.m6.d7:ocMA.LaudsTheotokion.melody	@ltx/gr_gr_cog/oc.m6.d7:ocMA.LaudsTheotokion.melody
ltx/gr_redirects_goarch/oc.m6.d7:ocMA.LaudsTheotokion.mode	@ltx/gr_gr_cog/oc.m6.d7:ocMA.LaudsTheotokion.mode
ltx/gr_redirects_goarch/oc.m6.d7:ocMA.LaudsTheotokion.text	@ltx/gr_gr_cog/oc.m6.d7:ocMA.LaudsTheotokion.text
ltx/gr_redirects_goarch/oc.m6.d7:ocMA.MM.Alleluia.text	@ltx/gr_gr_cog/oc.m6.d7:ocMA.MM.Alleluia.text
ltx/gr_redirects_goarch/oc.m6.d7:ocMA.OdeW1C11.incipit	@ltx/gr_gr_cog/oc.m6.d7:ocMA.OdeW1C11.incipit
ltx/gr_redirects_goarch/oc.m6.d7:ocMA.OdeW1C11.melody	@ltx/gr_gr_cog/oc.m6.d7:ocMA.OdeW1C11.melody
ltx/gr_redirects_goarch/oc.m6.d7:ocMA.OdeW1C11.mode	@ltx/gr_gr_cog/oc.m6.d7:ocMA.OdeW1C11.mode
ltx/gr_redirects_goarch/oc.m6.d7:ocMA.OdeW1C11.ode	@ltx/gr_gr_cog/oc.m6.d7:ocMA.OdeW1C11.ode
ltx/gr_redirects_goarch/oc.m6.d7:ocMA.OdeW1C11.text	@ltx/gr_gr_cog/oc.m6.d7:ocMA.OdeW1C11.text
ltx/gr_redirects_goarch/oc.m6.d7:ocMA.OdeW1C12.incipit	@ltx/gr_gr_cog/oc.m6.d7:ocMA.OdeW1C12.incipit
ltx/gr_redirects_goarch/oc.m6.d7:ocMA.OdeW1C12.melody	@ltx/gr_gr_cog/oc.m6.d7:ocMA.OdeW1C12.melody
ltx/gr_redirects_goarch/oc.m6.d7:ocMA.OdeW1C12.mode	@ltx/gr_gr_cog/oc.m6.d7:ocMA.OdeW1C12.mode
ltx/gr_redirects_goarch/oc.m6.d7:ocMA.OdeW1C12.ode	@ltx/gr_gr_cog/oc.m6.d7:ocMA.OdeW1C12.ode
ltx/gr_redirects_goarch/oc.m6.d7:ocMA.OdeW1C12.text	@ltx/gr_gr_cog/oc.m6.d7:ocMA.OdeW1C12.text
ltx/gr_redirects_goarch/oc.m6.d7:ocMA.OdeW1C13.incipit	@ltx/gr_gr_cog/oc.m6.d7:ocMA.OdeW1C13.incipit
ltx/gr_redirects_goarch/oc.m6.d7:ocMA.OdeW1C13.melody	@ltx/gr_gr_cog/oc.m6.d7:ocMA.OdeW1C13.melody
ltx/gr_redirects_goarch/oc.m6.d7:ocMA.OdeW1C13.mode	@ltx/gr_gr_cog/oc.m6.d7:ocMA.OdeW1C13.mode
ltx/gr_redirects_goarch/oc.m6.d7:ocMA.OdeW1C13.ode	@ltx/gr_gr_cog/oc.m6.d7:ocMA.OdeW1C13.ode
ltx/gr_redirects_goarch/oc.m6.d7:ocMA.OdeW1C13.text	@ltx/gr_gr_cog/oc.m6.d7:ocMA.OdeW1C13.text
ltx/gr_redirects_goarch/oc.m6.d7:ocMA.OdeW1C14.incipit	@ltx/gr_gr_cog/oc.m6.d7:ocMA.OdeW1C14.incipit
ltx/gr_redirects_goarch/oc.m6.d7:ocMA.OdeW1C14.melody	@ltx/gr_gr_cog/oc.m6.d7:ocMA.OdeW1C14.melody
ltx/gr_redirects_goarch/oc.m6.d7:ocMA.OdeW1C14.mode	@ltx/gr_gr_cog/oc.m6.d7:ocMA.OdeW1C14.mode
ltx/gr_redirects_goarch/oc.m6.d7:ocMA.OdeW1C14.ode	@ltx/gr_gr_cog/oc.m6.d7:ocMA.OdeW1C14.ode
ltx/gr_redirects_goarch/oc.m6.d7:ocMA.OdeW1C14.text	@ltx/gr_gr_cog/oc.m6.d7:ocMA.OdeW1C14.text
ltx/gr_redirects_goarch/oc.m6.d7:ocMA.OdeW1C1H.greekmelody	@ltx/gr_gr_cog/oc.m6.d7:ocMA.OdeW1C1H.greekmelody
ltx/gr_redirects_goarch/oc.m6.d7:ocMA.OdeW1C1H.incipit	@ltx/gr_gr_cog/oc.m6.d7:ocMA.OdeW1C1H.incipit
ltx/gr_redirects_goarch/oc.m6.d7:ocMA.OdeW1C1H.melody	@ltx/gr_gr_cog/oc.m6.d7:ocMA.OdeW1C1H.melody
ltx/gr_redirects_goarch/oc.m6.d7:ocMA.OdeW1C1H.mode	@ltx/gr_gr_cog/oc.m6.d7:ocMA.OdeW1C1H.mode
ltx/gr_redirects_goarch/oc.m6.d7:ocMA.OdeW1C1H.ode	@ltx/gr_gr_cog/oc.m6.d7:ocMA.OdeW1C1H.ode
ltx/gr_redirects_goarch/oc.m6.d7:ocMA.OdeW1C1H.text	@ltx/gr_gr_cog/oc.m6.d7:ocMA.OdeW1C1H.text
ltx/gr_redirects_goarch/oc.m6.d7:ocMA.OdeW1C1T.incipit	@ltx/gr_gr_cog/oc.m6.d7:ocMA.OdeW1C1T.incipit
ltx/gr_redirects_goarch/oc.m6.d7:ocMA.OdeW1C1T.melody	@ltx/gr_gr_cog/oc.m6.d7:ocMA.OdeW1C1T.melody
ltx/gr_redirects_goarch/oc.m6.d7:ocMA.OdeW1C1T.mode	@ltx/gr_gr_cog/oc.m6.d7:ocMA.OdeW1C1T.mode
ltx/gr_redirects_goarch/oc.m6.d7:ocMA.OdeW1C1T.ode	@ltx/gr_gr_cog/oc.m6.d7:ocMA.OdeW1C1T.ode
ltx/gr_redirects_goarch/oc.m6.d7:ocMA.OdeW1C1T.text	@ltx/gr_gr_cog/oc.m6.d7:ocMA.OdeW1C1T.text
ltx/gr_redirects_goarch/oc.m6.d7:ocMA.OdeW1C21.greekmelody	@ltx/gr_gr_cog/oc.m6.d7:ocMA.OdeW1C21.greekmelody
ltx/gr_redirects_goarch/oc.m6.d7:ocMA.OdeW1C21.incipit	@ltx/gr_gr_cog/oc.m6.d7:ocMA.OdeW1C21.incipit
ltx/gr_redirects_goarch/oc.m6.d7:ocMA.OdeW1C21.melody	@ltx/gr_gr_cog/oc.m6.d7:ocMA.OdeW1C21.melody
ltx/gr_redirects_goarch/oc.m6.d7:ocMA.OdeW1C21.mode	@ltx/gr_gr_cog/oc.m6.d7:ocMA.OdeW1C21.mode
ltx/gr_redirects_goarch/oc.m6.d7:ocMA.OdeW1C21.ode	@ltx/gr_gr_cog/oc.m6.d7:ocMA.OdeW1C21.ode
ltx/gr_redirects_goarch/oc.m6.d7:ocMA.OdeW1C21.text	@ltx/gr_gr_cog/oc.m6.d7:ocMA.OdeW1C21.text
ltx/gr_redirects_goarch/oc.m6.d7:ocMA.OdeW1C22.incipit	@ltx/gr_gr_cog/oc.m6.d7:ocMA.OdeW1C22.incipit
ltx/gr_redirects_goarch/oc.m6.d7:ocMA.OdeW1C22.melody	@ltx/gr_gr_cog/oc.m6.d7:ocMA.OdeW1C22.melody
ltx/gr_redirects_goarch/oc.m6.d7:ocMA.OdeW1C22.mode	@ltx/gr_gr_cog/oc.m6.d7:ocMA.OdeW1C22.mode
ltx/gr_redirects_goarch/oc.m6.d7:ocMA.OdeW1C22.ode	@ltx/gr_gr_cog/oc.m6.d7:ocMA.OdeW1C22.ode
ltx/gr_redirects_goarch/oc.m6.d7:ocMA.OdeW1C22.text	@ltx/gr_gr_cog/oc.m6.d7:ocMA.OdeW1C22.text
ltx/gr_redirects_goarch/oc.m6.d7:ocMA.OdeW1C23.incipit	@ltx/gr_gr_cog/oc.m6.d7:ocMA.OdeW1C23.incipit
ltx/gr_redirects_goarch/oc.m6.d7:ocMA.OdeW1C23.melody	@ltx/gr_gr_cog/oc.m6.d7:ocMA.OdeW1C23.melody
ltx/gr_redirects_goarch/oc.m6.d7:ocMA.OdeW1C23.mode	@ltx/gr_gr_cog/oc.m6.d7:ocMA.OdeW1C23.mode
ltx/gr_redirects_goarch/oc.m6.d7:ocMA.OdeW1C23.ode	@ltx/gr_gr_cog/oc.m6.d7:ocMA.OdeW1C23.ode
ltx/gr_redirects_goarch/oc.m6.d7:ocMA.OdeW1C23.text	@ltx/gr_gr_cog/oc.m6.d7:ocMA.OdeW1C23.text
ltx/gr_redirects_goarch/oc.m6.d7:ocMA.OdeW1C2T.incipit	@ltx/gr_gr_cog/oc.m6.d7:ocMA.OdeW1C2T.incipit
ltx/gr_redirects_goarch/oc.m6.d7:ocMA.OdeW1C2T.melody	@ltx/gr_gr_cog/oc.m6.d7:ocMA.OdeW1C2T.melody
ltx/gr_redirects_goarch/oc.m6.d7:ocMA.OdeW1C2T.mode	@ltx/gr_gr_cog/oc.m6.d7:ocMA.OdeW1C2T.mode
ltx/gr_redirects_goarch/oc.m6.d7:ocMA.OdeW1C2T.ode	@ltx/gr_gr_cog/oc.m6.d7:ocMA.OdeW1C2T.ode
ltx/gr_redirects_goarch/oc.m6.d7:ocMA.OdeW1C2T.text	@ltx/gr_gr_cog/oc.m6.d7:ocMA.OdeW1C2T.text
ltx/gr_redirects_goarch/oc.m6.d7:ocMA.OdeW3C11.incipit	@ltx/gr_gr_cog/oc.m6.d7:ocMA.OdeW3C11.incipit
ltx/gr_redirects_goarch/oc.m6.d7:ocMA.OdeW3C11.melody	@ltx/gr_gr_cog/oc.m6.d7:ocMA.OdeW3C11.melody
ltx/gr_redirects_goarch/oc.m6.d7:ocMA.OdeW3C11.mode	@ltx/gr_gr_cog/oc.m6.d7:ocMA.OdeW3C11.mode
ltx/gr_redirects_goarch/oc.m6.d7:ocMA.OdeW3C11.ode	@ltx/gr_gr_cog/oc.m6.d7:ocMA.OdeW3C11.ode
ltx/gr_redirects_goarch/oc.m6.d7:ocMA.OdeW3C11.text	@ltx/gr_gr_cog/oc.m6.d7:ocMA.OdeW3C11.text
ltx/gr_redirects_goarch/oc.m6.d7:ocMA.OdeW3C12.incipit	@ltx/gr_gr_cog/oc.m6.d7:ocMA.OdeW3C12.incipit
ltx/gr_redirects_goarch/oc.m6.d7:ocMA.OdeW3C12.melody	@ltx/gr_gr_cog/oc.m6.d7:ocMA.OdeW3C12.melody
ltx/gr_redirects_goarch/oc.m6.d7:ocMA.OdeW3C12.mode	@ltx/gr_gr_cog/oc.m6.d7:ocMA.OdeW3C12.mode
ltx/gr_redirects_goarch/oc.m6.d7:ocMA.OdeW3C12.ode	@ltx/gr_gr_cog/oc.m6.d7:ocMA.OdeW3C12.ode
ltx/gr_redirects_goarch/oc.m6.d7:ocMA.OdeW3C12.text	@ltx/gr_gr_cog/oc.m6.d7:ocMA.OdeW3C12.text
ltx/gr_redirects_goarch/oc.m6.d7:ocMA.OdeW3C13.incipit	@ltx/gr_gr_cog/oc.m6.d7:ocMA.OdeW3C13.incipit
ltx/gr_redirects_goarch/oc.m6.d7:ocMA.OdeW3C13.melody	@ltx/gr_gr_cog/oc.m6.d7:ocMA.OdeW3C13.melody
ltx/gr_redirects_goarch/oc.m6.d7:ocMA.OdeW3C13.mode	@ltx/gr_gr_cog/oc.m6.d7:ocMA.OdeW3C13.mode
ltx/gr_redirects_goarch/oc.m6.d7:ocMA.OdeW3C13.ode	@ltx/gr_gr_cog/oc.m6.d7:ocMA.OdeW3C13.ode
ltx/gr_redirects_goarch/oc.m6.d7:ocMA.OdeW3C13.text	@ltx/gr_gr_cog/oc.m6.d7:ocMA.OdeW3C13.text
ltx/gr_redirects_goarch/oc.m6.d7:ocMA.OdeW3C14.incipit	@ltx/gr_gr_cog/oc.m6.d7:ocMA.OdeW3C14.incipit
ltx/gr_redirects_goarch/oc.m6.d7:ocMA.OdeW3C14.melody	@ltx/gr_gr_cog/oc.m6.d7:ocMA.OdeW3C14.melody
ltx/gr_redirects_goarch/oc.m6.d7:ocMA.OdeW3C14.mode	@ltx/gr_gr_cog/oc.m6.d7:ocMA.OdeW3C14.mode
ltx/gr_redirects_goarch/oc.m6.d7:ocMA.OdeW3C14.ode	@ltx/gr_gr_cog/oc.m6.d7:ocMA.OdeW3C14.ode
ltx/gr_redirects_goarch/oc.m6.d7:ocMA.OdeW3C14.text	@ltx/gr_gr_cog/oc.m6.d7:ocMA.OdeW3C14.text
ltx/gr_redirects_goarch/oc.m6.d7:ocMA.OdeW3C1H.greekmelody	@ltx/gr_gr_cog/oc.m6.d7:ocMA.OdeW3C1H.greekmelody
ltx/gr_redirects_goarch/oc.m6.d7:ocMA.OdeW3C1H.incipit	@ltx/gr_gr_cog/oc.m6.d7:ocMA.OdeW3C1H.incipit
ltx/gr_redirects_goarch/oc.m6.d7:ocMA.OdeW3C1H.melody	@ltx/gr_gr_cog/oc.m6.d7:ocMA.OdeW3C1H.melody
ltx/gr_redirects_goarch/oc.m6.d7:ocMA.OdeW3C1H.mode	@ltx/gr_gr_cog/oc.m6.d7:ocMA.OdeW3C1H.mode
ltx/gr_redirects_goarch/oc.m6.d7:ocMA.OdeW3C1H.ode	@ltx/gr_gr_cog/oc.m6.d7:ocMA.OdeW3C1H.ode
ltx/gr_redirects_goarch/oc.m6.d7:ocMA.OdeW3C1H.text	@ltx/gr_gr_cog/oc.m6.d7:ocMA.OdeW3C1H.text
ltx/gr_redirects_goarch/oc.m6.d7:ocMA.OdeW3C1T.incipit	@ltx/gr_gr_cog/oc.m6.d7:ocMA.OdeW3C1T.incipit
ltx/gr_redirects_goarch/oc.m6.d7:ocMA.OdeW3C1T.melody	@ltx/gr_gr_cog/oc.m6.d7:ocMA.OdeW3C1T.melody
ltx/gr_redirects_goarch/oc.m6.d7:ocMA.OdeW3C1T.mode	@ltx/gr_gr_cog/oc.m6.d7:ocMA.OdeW3C1T.mode
ltx/gr_redirects_goarch/oc.m6.d7:ocMA.OdeW3C1T.ode	@ltx/gr_gr_cog/oc.m6.d7:ocMA.OdeW3C1T.ode
ltx/gr_redirects_goarch/oc.m6.d7:ocMA.OdeW3C1T.text	@ltx/gr_gr_cog/oc.m6.d7:ocMA.OdeW3C1T.text
ltx/gr_redirects_goarch/oc.m6.d7:ocMA.OdeW3C21.greekmelody	@ltx/gr_gr_cog/oc.m6.d7:ocMA.OdeW3C21.greekmelody
ltx/gr_redirects_goarch/oc.m6.d7:ocMA.OdeW3C21.incipit	@ltx/gr_gr_cog/oc.m6.d7:ocMA.OdeW3C21.incipit
ltx/gr_redirects_goarch/oc.m6.d7:ocMA.OdeW3C21.melody	@ltx/gr_gr_cog/oc.m6.d7:ocMA.OdeW3C21.melody
ltx/gr_redirects_goarch/oc.m6.d7:ocMA.OdeW3C21.mode	@ltx/gr_gr_cog/oc.m6.d7:ocMA.OdeW3C21.mode
ltx/gr_redirects_goarch/oc.m6.d7:ocMA.OdeW3C21.ode	@ltx/gr_gr_cog/oc.m6.d7:ocMA.OdeW3C21.ode
ltx/gr_redirects_goarch/oc.m6.d7:ocMA.OdeW3C21.text	@ltx/gr_gr_cog/oc.m6.d7:ocMA.OdeW3C21.text
ltx/gr_redirects_goarch/oc.m6.d7:ocMA.OdeW3C22.incipit	@ltx/gr_gr_cog/oc.m6.d7:ocMA.OdeW3C22.incipit
ltx/gr_redirects_goarch/oc.m6.d7:ocMA.OdeW3C22.melody	@ltx/gr_gr_cog/oc.m6.d7:ocMA.OdeW3C22.melody
ltx/gr_redirects_goarch/oc.m6.d7:ocMA.OdeW3C22.mode	@ltx/gr_gr_cog/oc.m6.d7:ocMA.OdeW3C22.mode
ltx/gr_redirects_goarch/oc.m6.d7:ocMA.OdeW3C22.ode	@ltx/gr_gr_cog/oc.m6.d7:ocMA.OdeW3C22.ode
ltx/gr_redirects_goarch/oc.m6.d7:ocMA.OdeW3C22.text	@ltx/gr_gr_cog/oc.m6.d7:ocMA.OdeW3C22.text
ltx/gr_redirects_goarch/oc.m6.d7:ocMA.OdeW3C23.incipit	@ltx/gr_gr_cog/oc.m6.d7:ocMA.OdeW3C23.incipit
ltx/gr_redirects_goarch/oc.m6.d7:ocMA.OdeW3C23.melody	@ltx/gr_gr_cog/oc.m6.d7:ocMA.OdeW3C23.melody
ltx/gr_redirects_goarch/oc.m6.d7:ocMA.OdeW3C23.mode	@ltx/gr_gr_cog/oc.m6.d7:ocMA.OdeW3C23.mode
ltx/gr_redirects_goarch/oc.m6.d7:ocMA.OdeW3C23.ode	@ltx/gr_gr_cog/oc.m6.d7:ocMA.OdeW3C23.ode
ltx/gr_redirects_goarch/oc.m6.d7:ocMA.OdeW3C23.text	@ltx/gr_gr_cog/oc.m6.d7:ocMA.OdeW3C23.text
ltx/gr_redirects_goarch/oc.m6.d7:ocMA.OdeW3C2T.incipit	@ltx/gr_gr_cog/oc.m6.d7:ocMA.OdeW3C2T.incipit
ltx/gr_redirects_goarch/oc.m6.d7:ocMA.OdeW3C2T.melody	@ltx/gr_gr_cog/oc.m6.d7:ocMA.OdeW3C2T.melody
ltx/gr_redirects_goarch/oc.m6.d7:ocMA.OdeW3C2T.mode	@ltx/gr_gr_cog/oc.m6.d7:ocMA.OdeW3C2T.mode
ltx/gr_redirects_goarch/oc.m6.d7:ocMA.OdeW3C2T.ode	@ltx/gr_gr_cog/oc.m6.d7:ocMA.OdeW3C2T.ode
ltx/gr_redirects_goarch/oc.m6.d7:ocMA.OdeW3C2T.text	@ltx/gr_gr_cog/oc.m6.d7:ocMA.OdeW3C2T.text
ltx/gr_redirects_goarch/oc.m6.d7:ocMA.OdeW4C11.incipit	@ltx/gr_gr_cog/oc.m6.d7:ocMA.OdeW4C11.incipit
ltx/gr_redirects_goarch/oc.m6.d7:ocMA.OdeW4C11.melody	@ltx/gr_gr_cog/oc.m6.d7:ocMA.OdeW4C11.melody
ltx/gr_redirects_goarch/oc.m6.d7:ocMA.OdeW4C11.mode	@ltx/gr_gr_cog/oc.m6.d7:ocMA.OdeW4C11.mode
ltx/gr_redirects_goarch/oc.m6.d7:ocMA.OdeW4C11.ode	@ltx/gr_gr_cog/oc.m6.d7:ocMA.OdeW4C11.ode
ltx/gr_redirects_goarch/oc.m6.d7:ocMA.OdeW4C11.text	@ltx/gr_gr_cog/oc.m6.d7:ocMA.OdeW4C11.text
ltx/gr_redirects_goarch/oc.m6.d7:ocMA.OdeW4C12.incipit	@ltx/gr_gr_cog/oc.m6.d7:ocMA.OdeW4C12.incipit
ltx/gr_redirects_goarch/oc.m6.d7:ocMA.OdeW4C12.melody	@ltx/gr_gr_cog/oc.m6.d7:ocMA.OdeW4C12.melody
ltx/gr_redirects_goarch/oc.m6.d7:ocMA.OdeW4C12.mode	@ltx/gr_gr_cog/oc.m6.d7:ocMA.OdeW4C12.mode
ltx/gr_redirects_goarch/oc.m6.d7:ocMA.OdeW4C12.ode	@ltx/gr_gr_cog/oc.m6.d7:ocMA.OdeW4C12.ode
ltx/gr_redirects_goarch/oc.m6.d7:ocMA.OdeW4C12.text	@ltx/gr_gr_cog/oc.m6.d7:ocMA.OdeW4C12.text
ltx/gr_redirects_goarch/oc.m6.d7:ocMA.OdeW4C13.incipit	@ltx/gr_gr_cog/oc.m6.d7:ocMA.OdeW4C13.incipit
ltx/gr_redirects_goarch/oc.m6.d7:ocMA.OdeW4C13.melody	@ltx/gr_gr_cog/oc.m6.d7:ocMA.OdeW4C13.melody
ltx/gr_redirects_goarch/oc.m6.d7:ocMA.OdeW4C13.mode	@ltx/gr_gr_cog/oc.m6.d7:ocMA.OdeW4C13.mode
ltx/gr_redirects_goarch/oc.m6.d7:ocMA.OdeW4C13.ode	@ltx/gr_gr_cog/oc.m6.d7:ocMA.OdeW4C13.ode
ltx/gr_redirects_goarch/oc.m6.d7:ocMA.OdeW4C13.text	@ltx/gr_gr_cog/oc.m6.d7:ocMA.OdeW4C13.text
ltx/gr_redirects_goarch/oc.m6.d7:ocMA.OdeW4C14.incipit	@ltx/gr_gr_cog/oc.m6.d7:ocMA.OdeW4C14.incipit
ltx/gr_redirects_goarch/oc.m6.d7:ocMA.OdeW4C14.melody	@ltx/gr_gr_cog/oc.m6.d7:ocMA.OdeW4C14.melody
ltx/gr_redirects_goarch/oc.m6.d7:ocMA.OdeW4C14.mode	@ltx/gr_gr_cog/oc.m6.d7:ocMA.OdeW4C14.mode
ltx/gr_redirects_goarch/oc.m6.d7:ocMA.OdeW4C14.ode	@ltx/gr_gr_cog/oc.m6.d7:ocMA.OdeW4C14.ode
ltx/gr_redirects_goarch/oc.m6.d7:ocMA.OdeW4C14.text	@ltx/gr_gr_cog/oc.m6.d7:ocMA.OdeW4C14.text
ltx/gr_redirects_goarch/oc.m6.d7:ocMA.OdeW4C1H.greekmelody	@ltx/gr_gr_cog/oc.m6.d7:ocMA.OdeW4C1H.greekmelody
ltx/gr_redirects_goarch/oc.m6.d7:ocMA.OdeW4C1H.incipit	@ltx/gr_gr_cog/oc.m6.d7:ocMA.OdeW4C1H.incipit
ltx/gr_redirects_goarch/oc.m6.d7:ocMA.OdeW4C1H.melody	@ltx/gr_gr_cog/oc.m6.d7:ocMA.OdeW4C1H.melody
ltx/gr_redirects_goarch/oc.m6.d7:ocMA.OdeW4C1H.mode	@ltx/gr_gr_cog/oc.m6.d7:ocMA.OdeW4C1H.mode
ltx/gr_redirects_goarch/oc.m6.d7:ocMA.OdeW4C1H.ode	@ltx/gr_gr_cog/oc.m6.d7:ocMA.OdeW4C1H.ode
ltx/gr_redirects_goarch/oc.m6.d7:ocMA.OdeW4C1H.text	@ltx/gr_gr_cog/oc.m6.d7:ocMA.OdeW4C1H.text
ltx/gr_redirects_goarch/oc.m6.d7:ocMA.OdeW4C1T.incipit	@ltx/gr_gr_cog/oc.m6.d7:ocMA.OdeW4C1T.incipit
ltx/gr_redirects_goarch/oc.m6.d7:ocMA.OdeW4C1T.melody	@ltx/gr_gr_cog/oc.m6.d7:ocMA.OdeW4C1T.melody
ltx/gr_redirects_goarch/oc.m6.d7:ocMA.OdeW4C1T.mode	@ltx/gr_gr_cog/oc.m6.d7:ocMA.OdeW4C1T.mode
ltx/gr_redirects_goarch/oc.m6.d7:ocMA.OdeW4C1T.ode	@ltx/gr_gr_cog/oc.m6.d7:ocMA.OdeW4C1T.ode
ltx/gr_redirects_goarch/oc.m6.d7:ocMA.OdeW4C1T.text	@ltx/gr_gr_cog/oc.m6.d7:ocMA.OdeW4C1T.text
ltx/gr_redirects_goarch/oc.m6.d7:ocMA.OdeW4C21.greekmelody	@ltx/gr_gr_cog/oc.m6.d7:ocMA.OdeW4C21.greekmelody
ltx/gr_redirects_goarch/oc.m6.d7:ocMA.OdeW4C21.incipit	@ltx/gr_gr_cog/oc.m6.d7:ocMA.OdeW4C21.incipit
ltx/gr_redirects_goarch/oc.m6.d7:ocMA.OdeW4C21.melody	@ltx/gr_gr_cog/oc.m6.d7:ocMA.OdeW4C21.melody
ltx/gr_redirects_goarch/oc.m6.d7:ocMA.OdeW4C21.mode	@ltx/gr_gr_cog/oc.m6.d7:ocMA.OdeW4C21.mode
ltx/gr_redirects_goarch/oc.m6.d7:ocMA.OdeW4C21.ode	@ltx/gr_gr_cog/oc.m6.d7:ocMA.OdeW4C21.ode
ltx/gr_redirects_goarch/oc.m6.d7:ocMA.OdeW4C21.text	@ltx/gr_gr_cog/oc.m6.d7:ocMA.OdeW4C21.text
ltx/gr_redirects_goarch/oc.m6.d7:ocMA.OdeW4C22.incipit	@ltx/gr_gr_cog/oc.m6.d7:ocMA.OdeW4C22.incipit
ltx/gr_redirects_goarch/oc.m6.d7:ocMA.OdeW4C22.melody	@ltx/gr_gr_cog/oc.m6.d7:ocMA.OdeW4C22.melody
ltx/gr_redirects_goarch/oc.m6.d7:ocMA.OdeW4C22.mode	@ltx/gr_gr_cog/oc.m6.d7:ocMA.OdeW4C22.mode
ltx/gr_redirects_goarch/oc.m6.d7:ocMA.OdeW4C22.ode	@ltx/gr_gr_cog/oc.m6.d7:ocMA.OdeW4C22.ode
ltx/gr_redirects_goarch/oc.m6.d7:ocMA.OdeW4C22.text	@ltx/gr_gr_cog/oc.m6.d7:ocMA.OdeW4C22.text
ltx/gr_redirects_goarch/oc.m6.d7:ocMA.OdeW4C23.incipit	@ltx/gr_gr_cog/oc.m6.d7:ocMA.OdeW4C23.incipit
ltx/gr_redirects_goarch/oc.m6.d7:ocMA.OdeW4C23.melody	@ltx/gr_gr_cog/oc.m6.d7:ocMA.OdeW4C23.melody
ltx/gr_redirects_goarch/oc.m6.d7:ocMA.OdeW4C23.mode	@ltx/gr_gr_cog/oc.m6.d7:ocMA.OdeW4C23.mode
ltx/gr_redirects_goarch/oc.m6.d7:ocMA.OdeW4C23.ode	@ltx/gr_gr_cog/oc.m6.d7:ocMA.OdeW4C23.ode
ltx/gr_redirects_goarch/oc.m6.d7:ocMA.OdeW4C23.text	@ltx/gr_gr_cog/oc.m6.d7:ocMA.OdeW4C23.text
ltx/gr_redirects_goarch/oc.m6.d7:ocMA.OdeW4C2T.incipit	@ltx/gr_gr_cog/oc.m6.d7:ocMA.OdeW4C2T.incipit
ltx/gr_redirects_goarch/oc.m6.d7:ocMA.OdeW4C2T.melody	@ltx/gr_gr_cog/oc.m6.d7:ocMA.OdeW4C2T.melody
ltx/gr_redirects_goarch/oc.m6.d7:ocMA.OdeW4C2T.mode	@ltx/gr_gr_cog/oc.m6.d7:ocMA.OdeW4C2T.mode
ltx/gr_redirects_goarch/oc.m6.d7:ocMA.OdeW4C2T.ode	@ltx/gr_gr_cog/oc.m6.d7:ocMA.OdeW4C2T.ode
ltx/gr_redirects_goarch/oc.m6.d7:ocMA.OdeW4C2T.text	@ltx/gr_gr_cog/oc.m6.d7:ocMA.OdeW4C2T.text
ltx/gr_redirects_goarch/oc.m6.d7:ocMA.OdeW5C11.incipit	@ltx/gr_gr_cog/oc.m6.d7:ocMA.OdeW5C11.incipit
ltx/gr_redirects_goarch/oc.m6.d7:ocMA.OdeW5C11.melody	@ltx/gr_gr_cog/oc.m6.d7:ocMA.OdeW5C11.melody
ltx/gr_redirects_goarch/oc.m6.d7:ocMA.OdeW5C11.mode	@ltx/gr_gr_cog/oc.m6.d7:ocMA.OdeW5C11.mode
ltx/gr_redirects_goarch/oc.m6.d7:ocMA.OdeW5C11.ode	@ltx/gr_gr_cog/oc.m6.d7:ocMA.OdeW5C11.ode
ltx/gr_redirects_goarch/oc.m6.d7:ocMA.OdeW5C11.text	@ltx/gr_gr_cog/oc.m6.d7:ocMA.OdeW5C11.text
ltx/gr_redirects_goarch/oc.m6.d7:ocMA.OdeW5C12.incipit	@ltx/gr_gr_cog/oc.m6.d7:ocMA.OdeW5C12.incipit
ltx/gr_redirects_goarch/oc.m6.d7:ocMA.OdeW5C12.melody	@ltx/gr_gr_cog/oc.m6.d7:ocMA.OdeW5C12.melody
ltx/gr_redirects_goarch/oc.m6.d7:ocMA.OdeW5C12.mode	@ltx/gr_gr_cog/oc.m6.d7:ocMA.OdeW5C12.mode
ltx/gr_redirects_goarch/oc.m6.d7:ocMA.OdeW5C12.ode	@ltx/gr_gr_cog/oc.m6.d7:ocMA.OdeW5C12.ode
ltx/gr_redirects_goarch/oc.m6.d7:ocMA.OdeW5C12.text	@ltx/gr_gr_cog/oc.m6.d7:ocMA.OdeW5C12.text
ltx/gr_redirects_goarch/oc.m6.d7:ocMA.OdeW5C13.incipit	@ltx/gr_gr_cog/oc.m6.d7:ocMA.OdeW5C13.incipit
ltx/gr_redirects_goarch/oc.m6.d7:ocMA.OdeW5C13.melody	@ltx/gr_gr_cog/oc.m6.d7:ocMA.OdeW5C13.melody
ltx/gr_redirects_goarch/oc.m6.d7:ocMA.OdeW5C13.mode	@ltx/gr_gr_cog/oc.m6.d7:ocMA.OdeW5C13.mode
ltx/gr_redirects_goarch/oc.m6.d7:ocMA.OdeW5C13.ode	@ltx/gr_gr_cog/oc.m6.d7:ocMA.OdeW5C13.ode
ltx/gr_redirects_goarch/oc.m6.d7:ocMA.OdeW5C13.text	@ltx/gr_gr_cog/oc.m6.d7:ocMA.OdeW5C13.text
ltx/gr_redirects_goarch/oc.m6.d7:ocMA.OdeW5C1H.greekmelody	@ltx/gr_gr_cog/oc.m6.d7:ocMA.OdeW5C1H.greekmelody
ltx/gr_redirects_goarch/oc.m6.d7:ocMA.OdeW5C1H.incipit	@ltx/gr_gr_cog/oc.m6.d7:ocMA.OdeW5C1H.incipit
ltx/gr_redirects_goarch/oc.m6.d7:ocMA.OdeW5C1H.melody	@ltx/gr_gr_cog/oc.m6.d7:ocMA.OdeW5C1H.melody
ltx/gr_redirects_goarch/oc.m6.d7:ocMA.OdeW5C1H.mode	@ltx/gr_gr_cog/oc.m6.d7:ocMA.OdeW5C1H.mode
ltx/gr_redirects_goarch/oc.m6.d7:ocMA.OdeW5C1H.ode	@ltx/gr_gr_cog/oc.m6.d7:ocMA.OdeW5C1H.ode
ltx/gr_redirects_goarch/oc.m6.d7:ocMA.OdeW5C1H.text	@ltx/gr_gr_cog/oc.m6.d7:ocMA.OdeW5C1H.text
ltx/gr_redirects_goarch/oc.m6.d7:ocMA.OdeW5C1T.incipit	@ltx/gr_gr_cog/oc.m6.d7:ocMA.OdeW5C1T.incipit
ltx/gr_redirects_goarch/oc.m6.d7:ocMA.OdeW5C1T.melody	@ltx/gr_gr_cog/oc.m6.d7:ocMA.OdeW5C1T.melody
ltx/gr_redirects_goarch/oc.m6.d7:ocMA.OdeW5C1T.mode	@ltx/gr_gr_cog/oc.m6.d7:ocMA.OdeW5C1T.mode
ltx/gr_redirects_goarch/oc.m6.d7:ocMA.OdeW5C1T.ode	@ltx/gr_gr_cog/oc.m6.d7:ocMA.OdeW5C1T.ode
ltx/gr_redirects_goarch/oc.m6.d7:ocMA.OdeW5C1T.text	@ltx/gr_gr_cog/oc.m6.d7:ocMA.OdeW5C1T.text
ltx/gr_redirects_goarch/oc.m6.d7:ocMA.OdeW5C21.greekmelody	@ltx/gr_gr_cog/oc.m6.d7:ocMA.OdeW5C21.greekmelody
ltx/gr_redirects_goarch/oc.m6.d7:ocMA.OdeW5C21.incipit	@ltx/gr_gr_cog/oc.m6.d7:ocMA.OdeW5C21.incipit
ltx/gr_redirects_goarch/oc.m6.d7:ocMA.OdeW5C21.melody	@ltx/gr_gr_cog/oc.m6.d7:ocMA.OdeW5C21.melody
ltx/gr_redirects_goarch/oc.m6.d7:ocMA.OdeW5C21.mode	@ltx/gr_gr_cog/oc.m6.d7:ocMA.OdeW5C21.mode
ltx/gr_redirects_goarch/oc.m6.d7:ocMA.OdeW5C21.ode	@ltx/gr_gr_cog/oc.m6.d7:ocMA.OdeW5C21.ode
ltx/gr_redirects_goarch/oc.m6.d7:ocMA.OdeW5C21.text	@ltx/gr_gr_cog/oc.m6.d7:ocMA.OdeW5C21.text
ltx/gr_redirects_goarch/oc.m6.d7:ocMA.OdeW5C22.incipit	@ltx/gr_gr_cog/oc.m6.d7:ocMA.OdeW5C22.incipit
ltx/gr_redirects_goarch/oc.m6.d7:ocMA.OdeW5C22.melody	@ltx/gr_gr_cog/oc.m6.d7:ocMA.OdeW5C22.melody
ltx/gr_redirects_goarch/oc.m6.d7:ocMA.OdeW5C22.mode	@ltx/gr_gr_cog/oc.m6.d7:ocMA.OdeW5C22.mode
ltx/gr_redirects_goarch/oc.m6.d7:ocMA.OdeW5C22.ode	@ltx/gr_gr_cog/oc.m6.d7:ocMA.OdeW5C22.ode
ltx/gr_redirects_goarch/oc.m6.d7:ocMA.OdeW5C22.text	@ltx/gr_gr_cog/oc.m6.d7:ocMA.OdeW5C22.text
ltx/gr_redirects_goarch/oc.m6.d7:ocMA.OdeW5C23.incipit	@ltx/gr_gr_cog/oc.m6.d7:ocMA.OdeW5C23.incipit
ltx/gr_redirects_goarch/oc.m6.d7:ocMA.OdeW5C23.melody	@ltx/gr_gr_cog/oc.m6.d7:ocMA.OdeW5C23.melody
ltx/gr_redirects_goarch/oc.m6.d7:ocMA.OdeW5C23.mode	@ltx/gr_gr_cog/oc.m6.d7:ocMA.OdeW5C23.mode
ltx/gr_redirects_goarch/oc.m6.d7:ocMA.OdeW5C23.ode	@ltx/gr_gr_cog/oc.m6.d7:ocMA.OdeW5C23.ode
ltx/gr_redirects_goarch/oc.m6.d7:ocMA.OdeW5C23.text	@ltx/gr_gr_cog/oc.m6.d7:ocMA.OdeW5C23.text
ltx/gr_redirects_goarch/oc.m6.d7:ocMA.OdeW5C2T.incipit	@ltx/gr_gr_cog/oc.m6.d7:ocMA.OdeW5C2T.incipit
ltx/gr_redirects_goarch/oc.m6.d7:ocMA.OdeW5C2T.melody	@ltx/gr_gr_cog/oc.m6.d7:ocMA.OdeW5C2T.melody
ltx/gr_redirects_goarch/oc.m6.d7:ocMA.OdeW5C2T.mode	@ltx/gr_gr_cog/oc.m6.d7:ocMA.OdeW5C2T.mode
ltx/gr_redirects_goarch/oc.m6.d7:ocMA.OdeW5C2T.ode	@ltx/gr_gr_cog/oc.m6.d7:ocMA.OdeW5C2T.ode
ltx/gr_redirects_goarch/oc.m6.d7:ocMA.OdeW5C2T.text	@ltx/gr_gr_cog/oc.m6.d7:ocMA.OdeW5C2T.text
ltx/gr_redirects_goarch/oc.m6.d7:ocMA.OdeW6C11.incipit	@ltx/gr_gr_cog/oc.m6.d7:ocMA.OdeW6C11.incipit
ltx/gr_redirects_goarch/oc.m6.d7:ocMA.OdeW6C11.melody	@ltx/gr_gr_cog/oc.m6.d7:ocMA.OdeW6C11.melody
ltx/gr_redirects_goarch/oc.m6.d7:ocMA.OdeW6C11.mode	@ltx/gr_gr_cog/oc.m6.d7:ocMA.OdeW6C11.mode
ltx/gr_redirects_goarch/oc.m6.d7:ocMA.OdeW6C11.ode	@ltx/gr_gr_cog/oc.m6.d7:ocMA.OdeW6C11.ode
ltx/gr_redirects_goarch/oc.m6.d7:ocMA.OdeW6C11.text	@ltx/gr_gr_cog/oc.m6.d7:ocMA.OdeW6C11.text
ltx/gr_redirects_goarch/oc.m6.d7:ocMA.OdeW6C12.incipit	@ltx/gr_gr_cog/oc.m6.d7:ocMA.OdeW6C12.incipit
ltx/gr_redirects_goarch/oc.m6.d7:ocMA.OdeW6C12.melody	@ltx/gr_gr_cog/oc.m6.d7:ocMA.OdeW6C12.melody
ltx/gr_redirects_goarch/oc.m6.d7:ocMA.OdeW6C12.mode	@ltx/gr_gr_cog/oc.m6.d7:ocMA.OdeW6C12.mode
ltx/gr_redirects_goarch/oc.m6.d7:ocMA.OdeW6C12.ode	@ltx/gr_gr_cog/oc.m6.d7:ocMA.OdeW6C12.ode
ltx/gr_redirects_goarch/oc.m6.d7:ocMA.OdeW6C12.text	@ltx/gr_gr_cog/oc.m6.d7:ocMA.OdeW6C12.text
ltx/gr_redirects_goarch/oc.m6.d7:ocMA.OdeW6C13.incipit	@ltx/gr_gr_cog/oc.m6.d7:ocMA.OdeW6C13.incipit
ltx/gr_redirects_goarch/oc.m6.d7:ocMA.OdeW6C13.melody	@ltx/gr_gr_cog/oc.m6.d7:ocMA.OdeW6C13.melody
ltx/gr_redirects_goarch/oc.m6.d7:ocMA.OdeW6C13.mode	@ltx/gr_gr_cog/oc.m6.d7:ocMA.OdeW6C13.mode
ltx/gr_redirects_goarch/oc.m6.d7:ocMA.OdeW6C13.ode	@ltx/gr_gr_cog/oc.m6.d7:ocMA.OdeW6C13.ode
ltx/gr_redirects_goarch/oc.m6.d7:ocMA.OdeW6C13.text	@ltx/gr_gr_cog/oc.m6.d7:ocMA.OdeW6C13.text
ltx/gr_redirects_goarch/oc.m6.d7:ocMA.OdeW6C14.incipit	@ltx/gr_gr_cog/oc.m6.d7:ocMA.OdeW6C14.incipit
ltx/gr_redirects_goarch/oc.m6.d7:ocMA.OdeW6C14.melody	@ltx/gr_gr_cog/oc.m6.d7:ocMA.OdeW6C14.melody
ltx/gr_redirects_goarch/oc.m6.d7:ocMA.OdeW6C14.mode	@ltx/gr_gr_cog/oc.m6.d7:ocMA.OdeW6C14.mode
ltx/gr_redirects_goarch/oc.m6.d7:ocMA.OdeW6C14.ode	@ltx/gr_gr_cog/oc.m6.d7:ocMA.OdeW6C14.ode
ltx/gr_redirects_goarch/oc.m6.d7:ocMA.OdeW6C14.text	@ltx/gr_gr_cog/oc.m6.d7:ocMA.OdeW6C14.text
ltx/gr_redirects_goarch/oc.m6.d7:ocMA.OdeW6C1H.greekmelody	@ltx/gr_gr_cog/oc.m6.d7:ocMA.OdeW6C1H.greekmelody
ltx/gr_redirects_goarch/oc.m6.d7:ocMA.OdeW6C1H.incipit	@ltx/gr_gr_cog/oc.m6.d7:ocMA.OdeW6C1H.incipit
ltx/gr_redirects_goarch/oc.m6.d7:ocMA.OdeW6C1H.melody	@ltx/gr_gr_cog/oc.m6.d7:ocMA.OdeW6C1H.melody
ltx/gr_redirects_goarch/oc.m6.d7:ocMA.OdeW6C1H.mode	@ltx/gr_gr_cog/oc.m6.d7:ocMA.OdeW6C1H.mode
ltx/gr_redirects_goarch/oc.m6.d7:ocMA.OdeW6C1H.ode	@ltx/gr_gr_cog/oc.m6.d7:ocMA.OdeW6C1H.ode
ltx/gr_redirects_goarch/oc.m6.d7:ocMA.OdeW6C1H.text	@ltx/gr_gr_cog/oc.m6.d7:ocMA.OdeW6C1H.text
ltx/gr_redirects_goarch/oc.m6.d7:ocMA.OdeW6C1T.incipit	@ltx/gr_gr_cog/oc.m6.d7:ocMA.OdeW6C1T.incipit
ltx/gr_redirects_goarch/oc.m6.d7:ocMA.OdeW6C1T.melody	@ltx/gr_gr_cog/oc.m6.d7:ocMA.OdeW6C1T.melody
ltx/gr_redirects_goarch/oc.m6.d7:ocMA.OdeW6C1T.mode	@ltx/gr_gr_cog/oc.m6.d7:ocMA.OdeW6C1T.mode
ltx/gr_redirects_goarch/oc.m6.d7:ocMA.OdeW6C1T.ode	@ltx/gr_gr_cog/oc.m6.d7:ocMA.OdeW6C1T.ode
ltx/gr_redirects_goarch/oc.m6.d7:ocMA.OdeW6C1T.text	@ltx/gr_gr_cog/oc.m6.d7:ocMA.OdeW6C1T.text
ltx/gr_redirects_goarch/oc.m6.d7:ocMA.OdeW6C21.greekmelody	@ltx/gr_gr_cog/oc.m6.d7:ocMA.OdeW6C21.greekmelody
ltx/gr_redirects_goarch/oc.m6.d7:ocMA.OdeW6C21.incipit	@ltx/gr_gr_cog/oc.m6.d7:ocMA.OdeW6C21.incipit
ltx/gr_redirects_goarch/oc.m6.d7:ocMA.OdeW6C21.melody	@ltx/gr_gr_cog/oc.m6.d7:ocMA.OdeW6C21.melody
ltx/gr_redirects_goarch/oc.m6.d7:ocMA.OdeW6C21.mode	@ltx/gr_gr_cog/oc.m6.d7:ocMA.OdeW6C21.mode
ltx/gr_redirects_goarch/oc.m6.d7:ocMA.OdeW6C21.ode	@ltx/gr_gr_cog/oc.m6.d7:ocMA.OdeW6C21.ode
ltx/gr_redirects_goarch/oc.m6.d7:ocMA.OdeW6C21.text	@ltx/gr_gr_cog/oc.m6.d7:ocMA.OdeW6C21.text
ltx/gr_redirects_goarch/oc.m6.d7:ocMA.OdeW6C22.incipit	@ltx/gr_gr_cog/oc.m6.d7:ocMA.OdeW6C22.incipit
ltx/gr_redirects_goarch/oc.m6.d7:ocMA.OdeW6C22.melody	@ltx/gr_gr_cog/oc.m6.d7:ocMA.OdeW6C22.melody
ltx/gr_redirects_goarch/oc.m6.d7:ocMA.OdeW6C22.mode	@ltx/gr_gr_cog/oc.m6.d7:ocMA.OdeW6C22.mode
ltx/gr_redirects_goarch/oc.m6.d7:ocMA.OdeW6C22.ode	@ltx/gr_gr_cog/oc.m6.d7:ocMA.OdeW6C22.ode
ltx/gr_redirects_goarch/oc.m6.d7:ocMA.OdeW6C22.text	@ltx/gr_gr_cog/oc.m6.d7:ocMA.OdeW6C22.text
ltx/gr_redirects_goarch/oc.m6.d7:ocMA.OdeW6C23.incipit	@ltx/gr_gr_cog/oc.m6.d7:ocMA.OdeW6C23.incipit
ltx/gr_redirects_goarch/oc.m6.d7:ocMA.OdeW6C23.melody	@ltx/gr_gr_cog/oc.m6.d7:ocMA.OdeW6C23.melody
ltx/gr_redirects_goarch/oc.m6.d7:ocMA.OdeW6C23.mode	@ltx/gr_gr_cog/oc.m6.d7:ocMA.OdeW6C23.mode
ltx/gr_redirects_goarch/oc.m6.d7:ocMA.OdeW6C23.ode	@ltx/gr_gr_cog/oc.m6.d7:ocMA.OdeW6C23.ode
ltx/gr_redirects_goarch/oc.m6.d7:ocMA.OdeW6C23.text	@ltx/gr_gr_cog/oc.m6.d7:ocMA.OdeW6C23.text
ltx/gr_redirects_goarch/oc.m6.d7:ocMA.OdeW6C2T.incipit	@ltx/gr_gr_cog/oc.m6.d7:ocMA.OdeW6C2T.incipit
ltx/gr_redirects_goarch/oc.m6.d7:ocMA.OdeW6C2T.melody	@ltx/gr_gr_cog/oc.m6.d7:ocMA.OdeW6C2T.melody
ltx/gr_redirects_goarch/oc.m6.d7:ocMA.OdeW6C2T.mode	@ltx/gr_gr_cog/oc.m6.d7:ocMA.OdeW6C2T.mode
ltx/gr_redirects_goarch/oc.m6.d7:ocMA.OdeW6C2T.ode	@ltx/gr_gr_cog/oc.m6.d7:ocMA.OdeW6C2T.ode
ltx/gr_redirects_goarch/oc.m6.d7:ocMA.OdeW6C2T.text	@ltx/gr_gr_cog/oc.m6.d7:ocMA.OdeW6C2T.text
ltx/gr_redirects_goarch/oc.m6.d7:ocMA.OdeW7C11.incipit	@ltx/gr_gr_cog/oc.m6.d7:ocMA.OdeW7C11.incipit
ltx/gr_redirects_goarch/oc.m6.d7:ocMA.OdeW7C11.melody	@ltx/gr_gr_cog/oc.m6.d7:ocMA.OdeW7C11.melody
ltx/gr_redirects_goarch/oc.m6.d7:ocMA.OdeW7C11.mode	@ltx/gr_gr_cog/oc.m6.d7:ocMA.OdeW7C11.mode
ltx/gr_redirects_goarch/oc.m6.d7:ocMA.OdeW7C11.ode	@ltx/gr_gr_cog/oc.m6.d7:ocMA.OdeW7C11.ode
ltx/gr_redirects_goarch/oc.m6.d7:ocMA.OdeW7C11.text	@ltx/gr_gr_cog/oc.m6.d7:ocMA.OdeW7C11.text
ltx/gr_redirects_goarch/oc.m6.d7:ocMA.OdeW7C12.incipit	@ltx/gr_gr_cog/oc.m6.d7:ocMA.OdeW7C12.incipit
ltx/gr_redirects_goarch/oc.m6.d7:ocMA.OdeW7C12.melody	@ltx/gr_gr_cog/oc.m6.d7:ocMA.OdeW7C12.melody
ltx/gr_redirects_goarch/oc.m6.d7:ocMA.OdeW7C12.mode	@ltx/gr_gr_cog/oc.m6.d7:ocMA.OdeW7C12.mode
ltx/gr_redirects_goarch/oc.m6.d7:ocMA.OdeW7C12.ode	@ltx/gr_gr_cog/oc.m6.d7:ocMA.OdeW7C12.ode
ltx/gr_redirects_goarch/oc.m6.d7:ocMA.OdeW7C12.text	@ltx/gr_gr_cog/oc.m6.d7:ocMA.OdeW7C12.text
ltx/gr_redirects_goarch/oc.m6.d7:ocMA.OdeW7C13.incipit	@ltx/gr_gr_cog/oc.m6.d7:ocMA.OdeW7C13.incipit
ltx/gr_redirects_goarch/oc.m6.d7:ocMA.OdeW7C13.melody	@ltx/gr_gr_cog/oc.m6.d7:ocMA.OdeW7C13.melody
ltx/gr_redirects_goarch/oc.m6.d7:ocMA.OdeW7C13.mode	@ltx/gr_gr_cog/oc.m6.d7:ocMA.OdeW7C13.mode
ltx/gr_redirects_goarch/oc.m6.d7:ocMA.OdeW7C13.ode	@ltx/gr_gr_cog/oc.m6.d7:ocMA.OdeW7C13.ode
ltx/gr_redirects_goarch/oc.m6.d7:ocMA.OdeW7C13.text	@ltx/gr_gr_cog/oc.m6.d7:ocMA.OdeW7C13.text
ltx/gr_redirects_goarch/oc.m6.d7:ocMA.OdeW7C14.incipit	@ltx/gr_gr_cog/oc.m6.d7:ocMA.OdeW7C14.incipit
ltx/gr_redirects_goarch/oc.m6.d7:ocMA.OdeW7C14.melody	@ltx/gr_gr_cog/oc.m6.d7:ocMA.OdeW7C14.melody
ltx/gr_redirects_goarch/oc.m6.d7:ocMA.OdeW7C14.mode	@ltx/gr_gr_cog/oc.m6.d7:ocMA.OdeW7C14.mode
ltx/gr_redirects_goarch/oc.m6.d7:ocMA.OdeW7C14.ode	@ltx/gr_gr_cog/oc.m6.d7:ocMA.OdeW7C14.ode
ltx/gr_redirects_goarch/oc.m6.d7:ocMA.OdeW7C14.text	@ltx/gr_gr_cog/oc.m6.d7:ocMA.OdeW7C14.text
ltx/gr_redirects_goarch/oc.m6.d7:ocMA.OdeW7C1H.greekmelody	@ltx/gr_gr_cog/oc.m6.d7:ocMA.OdeW7C1H.greekmelody
ltx/gr_redirects_goarch/oc.m6.d7:ocMA.OdeW7C1H.incipit	@ltx/gr_gr_cog/oc.m6.d7:ocMA.OdeW7C1H.incipit
ltx/gr_redirects_goarch/oc.m6.d7:ocMA.OdeW7C1H.melody	@ltx/gr_gr_cog/oc.m6.d7:ocMA.OdeW7C1H.melody
ltx/gr_redirects_goarch/oc.m6.d7:ocMA.OdeW7C1H.mode	@ltx/gr_gr_cog/oc.m6.d7:ocMA.OdeW7C1H.mode
ltx/gr_redirects_goarch/oc.m6.d7:ocMA.OdeW7C1H.ode	@ltx/gr_gr_cog/oc.m6.d7:ocMA.OdeW7C1H.ode
ltx/gr_redirects_goarch/oc.m6.d7:ocMA.OdeW7C1H.text	@ltx/gr_gr_cog/oc.m6.d7:ocMA.OdeW7C1H.text
ltx/gr_redirects_goarch/oc.m6.d7:ocMA.OdeW7C1T.incipit	@ltx/gr_gr_cog/oc.m6.d7:ocMA.OdeW7C1T.incipit
ltx/gr_redirects_goarch/oc.m6.d7:ocMA.OdeW7C1T.melody	@ltx/gr_gr_cog/oc.m6.d7:ocMA.OdeW7C1T.melody
ltx/gr_redirects_goarch/oc.m6.d7:ocMA.OdeW7C1T.mode	@ltx/gr_gr_cog/oc.m6.d7:ocMA.OdeW7C1T.mode
ltx/gr_redirects_goarch/oc.m6.d7:ocMA.OdeW7C1T.ode	@ltx/gr_gr_cog/oc.m6.d7:ocMA.OdeW7C1T.ode
ltx/gr_redirects_goarch/oc.m6.d7:ocMA.OdeW7C1T.text	@ltx/gr_gr_cog/oc.m6.d7:ocMA.OdeW7C1T.text
ltx/gr_redirects_goarch/oc.m6.d7:ocMA.OdeW7C21.greekmelody	@ltx/gr_gr_cog/oc.m6.d7:ocMA.OdeW7C21.greekmelody
ltx/gr_redirects_goarch/oc.m6.d7:ocMA.OdeW7C21.incipit	@ltx/gr_gr_cog/oc.m6.d7:ocMA.OdeW7C21.incipit
ltx/gr_redirects_goarch/oc.m6.d7:ocMA.OdeW7C21.melody	@ltx/gr_gr_cog/oc.m6.d7:ocMA.OdeW7C21.melody
ltx/gr_redirects_goarch/oc.m6.d7:ocMA.OdeW7C21.mode	@ltx/gr_gr_cog/oc.m6.d7:ocMA.OdeW7C21.mode
ltx/gr_redirects_goarch/oc.m6.d7:ocMA.OdeW7C21.ode	@ltx/gr_gr_cog/oc.m6.d7:ocMA.OdeW7C21.ode
ltx/gr_redirects_goarch/oc.m6.d7:ocMA.OdeW7C21.text	@ltx/gr_gr_cog/oc.m6.d7:ocMA.OdeW7C21.text
ltx/gr_redirects_goarch/oc.m6.d7:ocMA.OdeW7C22.incipit	@ltx/gr_gr_cog/oc.m6.d7:ocMA.OdeW7C22.incipit
ltx/gr_redirects_goarch/oc.m6.d7:ocMA.OdeW7C22.melody	@ltx/gr_gr_cog/oc.m6.d7:ocMA.OdeW7C22.melody
ltx/gr_redirects_goarch/oc.m6.d7:ocMA.OdeW7C22.mode	@ltx/gr_gr_cog/oc.m6.d7:ocMA.OdeW7C22.mode
ltx/gr_redirects_goarch/oc.m6.d7:ocMA.OdeW7C22.ode	@ltx/gr_gr_cog/oc.m6.d7:ocMA.OdeW7C22.ode
ltx/gr_redirects_goarch/oc.m6.d7:ocMA.OdeW7C22.text	@ltx/gr_gr_cog/oc.m6.d7:ocMA.OdeW7C22.text
ltx/gr_redirects_goarch/oc.m6.d7:ocMA.OdeW7C23.incipit	@ltx/gr_gr_cog/oc.m6.d7:ocMA.OdeW7C23.incipit
ltx/gr_redirects_goarch/oc.m6.d7:ocMA.OdeW7C23.melody	@ltx/gr_gr_cog/oc.m6.d7:ocMA.OdeW7C23.melody
ltx/gr_redirects_goarch/oc.m6.d7:ocMA.OdeW7C23.mode	@ltx/gr_gr_cog/oc.m6.d7:ocMA.OdeW7C23.mode
ltx/gr_redirects_goarch/oc.m6.d7:ocMA.OdeW7C23.ode	@ltx/gr_gr_cog/oc.m6.d7:ocMA.OdeW7C23.ode
ltx/gr_redirects_goarch/oc.m6.d7:ocMA.OdeW7C23.text	@ltx/gr_gr_cog/oc.m6.d7:ocMA.OdeW7C23.text
ltx/gr_redirects_goarch/oc.m6.d7:ocMA.OdeW7C2T.incipit	@ltx/gr_gr_cog/oc.m6.d7:ocMA.OdeW7C2T.incipit
ltx/gr_redirects_goarch/oc.m6.d7:ocMA.OdeW7C2T.melody	@ltx/gr_gr_cog/oc.m6.d7:ocMA.OdeW7C2T.melody
ltx/gr_redirects_goarch/oc.m6.d7:ocMA.OdeW7C2T.mode	@ltx/gr_gr_cog/oc.m6.d7:ocMA.OdeW7C2T.mode
ltx/gr_redirects_goarch/oc.m6.d7:ocMA.OdeW7C2T.ode	@ltx/gr_gr_cog/oc.m6.d7:ocMA.OdeW7C2T.ode
ltx/gr_redirects_goarch/oc.m6.d7:ocMA.OdeW7C2T.text	@ltx/gr_gr_cog/oc.m6.d7:ocMA.OdeW7C2T.text
ltx/gr_redirects_goarch/oc.m6.d7:ocMA.OdeW8C11.incipit	@ltx/gr_gr_cog/oc.m6.d7:ocMA.OdeW8C11.incipit
ltx/gr_redirects_goarch/oc.m6.d7:ocMA.OdeW8C11.melody	@ltx/gr_gr_cog/oc.m6.d7:ocMA.OdeW8C11.melody
ltx/gr_redirects_goarch/oc.m6.d7:ocMA.OdeW8C11.mode	@ltx/gr_gr_cog/oc.m6.d7:ocMA.OdeW8C11.mode
ltx/gr_redirects_goarch/oc.m6.d7:ocMA.OdeW8C11.ode	@ltx/gr_gr_cog/oc.m6.d7:ocMA.OdeW8C11.ode
ltx/gr_redirects_goarch/oc.m6.d7:ocMA.OdeW8C11.text	@ltx/gr_gr_cog/oc.m6.d7:ocMA.OdeW8C11.text
ltx/gr_redirects_goarch/oc.m6.d7:ocMA.OdeW8C12.incipit	@ltx/gr_gr_cog/oc.m6.d7:ocMA.OdeW8C12.incipit
ltx/gr_redirects_goarch/oc.m6.d7:ocMA.OdeW8C12.melody	@ltx/gr_gr_cog/oc.m6.d7:ocMA.OdeW8C12.melody
ltx/gr_redirects_goarch/oc.m6.d7:ocMA.OdeW8C12.mode	@ltx/gr_gr_cog/oc.m6.d7:ocMA.OdeW8C12.mode
ltx/gr_redirects_goarch/oc.m6.d7:ocMA.OdeW8C12.ode	@ltx/gr_gr_cog/oc.m6.d7:ocMA.OdeW8C12.ode
ltx/gr_redirects_goarch/oc.m6.d7:ocMA.OdeW8C12.text	@ltx/gr_gr_cog/oc.m6.d7:ocMA.OdeW8C12.text
ltx/gr_redirects_goarch/oc.m6.d7:ocMA.OdeW8C13.incipit	@ltx/gr_gr_cog/oc.m6.d7:ocMA.OdeW8C13.incipit
ltx/gr_redirects_goarch/oc.m6.d7:ocMA.OdeW8C13.melody	@ltx/gr_gr_cog/oc.m6.d7:ocMA.OdeW8C13.melody
ltx/gr_redirects_goarch/oc.m6.d7:ocMA.OdeW8C13.mode	@ltx/gr_gr_cog/oc.m6.d7:ocMA.OdeW8C13.mode
ltx/gr_redirects_goarch/oc.m6.d7:ocMA.OdeW8C13.ode	@ltx/gr_gr_cog/oc.m6.d7:ocMA.OdeW8C13.ode
ltx/gr_redirects_goarch/oc.m6.d7:ocMA.OdeW8C13.text	@ltx/gr_gr_cog/oc.m6.d7:ocMA.OdeW8C13.text
ltx/gr_redirects_goarch/oc.m6.d7:ocMA.OdeW8C1H.greekmelody	@ltx/gr_gr_cog/oc.m6.d7:ocMA.OdeW8C1H.greekmelody
ltx/gr_redirects_goarch/oc.m6.d7:ocMA.OdeW8C1H.incipit	@ltx/gr_gr_cog/oc.m6.d7:ocMA.OdeW8C1H.incipit
ltx/gr_redirects_goarch/oc.m6.d7:ocMA.OdeW8C1H.melody	@ltx/gr_gr_cog/oc.m6.d7:ocMA.OdeW8C1H.melody
ltx/gr_redirects_goarch/oc.m6.d7:ocMA.OdeW8C1H.mode	@ltx/gr_gr_cog/oc.m6.d7:ocMA.OdeW8C1H.mode
ltx/gr_redirects_goarch/oc.m6.d7:ocMA.OdeW8C1H.ode	@ltx/gr_gr_cog/oc.m6.d7:ocMA.OdeW8C1H.ode
ltx/gr_redirects_goarch/oc.m6.d7:ocMA.OdeW8C1H.text	@ltx/gr_gr_cog/oc.m6.d7:ocMA.OdeW8C1H.text
ltx/gr_redirects_goarch/oc.m6.d7:ocMA.OdeW8C1T.incipit	@ltx/gr_gr_cog/oc.m6.d7:ocMA.OdeW8C1T.incipit
ltx/gr_redirects_goarch/oc.m6.d7:ocMA.OdeW8C1T.melody	@ltx/gr_gr_cog/oc.m6.d7:ocMA.OdeW8C1T.melody
ltx/gr_redirects_goarch/oc.m6.d7:ocMA.OdeW8C1T.mode	@ltx/gr_gr_cog/oc.m6.d7:ocMA.OdeW8C1T.mode
ltx/gr_redirects_goarch/oc.m6.d7:ocMA.OdeW8C1T.ode	@ltx/gr_gr_cog/oc.m6.d7:ocMA.OdeW8C1T.ode
ltx/gr_redirects_goarch/oc.m6.d7:ocMA.OdeW8C1T.text	@ltx/gr_gr_cog/oc.m6.d7:ocMA.OdeW8C1T.text
ltx/gr_redirects_goarch/oc.m6.d7:ocMA.OdeW8C21.greekmelody	@ltx/gr_gr_cog/oc.m6.d7:ocMA.OdeW8C21.greekmelody
ltx/gr_redirects_goarch/oc.m6.d7:ocMA.OdeW8C21.incipit	@ltx/gr_gr_cog/oc.m6.d7:ocMA.OdeW8C21.incipit
ltx/gr_redirects_goarch/oc.m6.d7:ocMA.OdeW8C21.melody	@ltx/gr_gr_cog/oc.m6.d7:ocMA.OdeW8C21.melody
ltx/gr_redirects_goarch/oc.m6.d7:ocMA.OdeW8C21.mode	@ltx/gr_gr_cog/oc.m6.d7:ocMA.OdeW8C21.mode
ltx/gr_redirects_goarch/oc.m6.d7:ocMA.OdeW8C21.ode	@ltx/gr_gr_cog/oc.m6.d7:ocMA.OdeW8C21.ode
ltx/gr_redirects_goarch/oc.m6.d7:ocMA.OdeW8C21.text	@ltx/gr_gr_cog/oc.m6.d7:ocMA.OdeW8C21.text
ltx/gr_redirects_goarch/oc.m6.d7:ocMA.OdeW8C22.incipit	@ltx/gr_gr_cog/oc.m6.d7:ocMA.OdeW8C22.incipit
ltx/gr_redirects_goarch/oc.m6.d7:ocMA.OdeW8C22.melody	@ltx/gr_gr_cog/oc.m6.d7:ocMA.OdeW8C22.melody
ltx/gr_redirects_goarch/oc.m6.d7:ocMA.OdeW8C22.mode	@ltx/gr_gr_cog/oc.m6.d7:ocMA.OdeW8C22.mode
ltx/gr_redirects_goarch/oc.m6.d7:ocMA.OdeW8C22.ode	@ltx/gr_gr_cog/oc.m6.d7:ocMA.OdeW8C22.ode
ltx/gr_redirects_goarch/oc.m6.d7:ocMA.OdeW8C22.text	@ltx/gr_gr_cog/oc.m6.d7:ocMA.OdeW8C22.text
ltx/gr_redirects_goarch/oc.m6.d7:ocMA.OdeW8C23.incipit	@ltx/gr_gr_cog/oc.m6.d7:ocMA.OdeW8C23.incipit
ltx/gr_redirects_goarch/oc.m6.d7:ocMA.OdeW8C23.melody	@ltx/gr_gr_cog/oc.m6.d7:ocMA.OdeW8C23.melody
ltx/gr_redirects_goarch/oc.m6.d7:ocMA.OdeW8C23.mode	@ltx/gr_gr_cog/oc.m6.d7:ocMA.OdeW8C23.mode
ltx/gr_redirects_goarch/oc.m6.d7:ocMA.OdeW8C23.ode	@ltx/gr_gr_cog/oc.m6.d7:ocMA.OdeW8C23.ode
ltx/gr_redirects_goarch/oc.m6.d7:ocMA.OdeW8C23.text	@ltx/gr_gr_cog/oc.m6.d7:ocMA.OdeW8C23.text
ltx/gr_redirects_goarch/oc.m6.d7:ocMA.OdeW8C2T.incipit	@ltx/gr_gr_cog/oc.m6.d7:ocMA.OdeW8C2T.incipit
ltx/gr_redirects_goarch/oc.m6.d7:ocMA.OdeW8C2T.melody	@ltx/gr_gr_cog/oc.m6.d7:ocMA.OdeW8C2T.melody
ltx/gr_redirects_goarch/oc.m6.d7:ocMA.OdeW8C2T.mode	@ltx/gr_gr_cog/oc.m6.d7:ocMA.OdeW8C2T.mode
ltx/gr_redirects_goarch/oc.m6.d7:ocMA.OdeW8C2T.ode	@ltx/gr_gr_cog/oc.m6.d7:ocMA.OdeW8C2T.ode
ltx/gr_redirects_goarch/oc.m6.d7:ocMA.OdeW8C2T.text	@ltx/gr_gr_cog/oc.m6.d7:ocMA.OdeW8C2T.text
ltx/gr_redirects_goarch/oc.m6.d7:ocMA.OdeW9C11.incipit	@ltx/gr_gr_cog/oc.m6.d7:ocMA.OdeW9C11.incipit
ltx/gr_redirects_goarch/oc.m6.d7:ocMA.OdeW9C11.melody	@ltx/gr_gr_cog/oc.m6.d7:ocMA.OdeW9C11.melody
ltx/gr_redirects_goarch/oc.m6.d7:ocMA.OdeW9C11.mode	@ltx/gr_gr_cog/oc.m6.d7:ocMA.OdeW9C11.mode
ltx/gr_redirects_goarch/oc.m6.d7:ocMA.OdeW9C11.ode	@ltx/gr_gr_cog/oc.m6.d7:ocMA.OdeW9C11.ode
ltx/gr_redirects_goarch/oc.m6.d7:ocMA.OdeW9C11.text	@ltx/gr_gr_cog/oc.m6.d7:ocMA.OdeW9C11.text
ltx/gr_redirects_goarch/oc.m6.d7:ocMA.OdeW9C12.incipit	@ltx/gr_gr_cog/oc.m6.d7:ocMA.OdeW9C12.incipit
ltx/gr_redirects_goarch/oc.m6.d7:ocMA.OdeW9C12.melody	@ltx/gr_gr_cog/oc.m6.d7:ocMA.OdeW9C12.melody
ltx/gr_redirects_goarch/oc.m6.d7:ocMA.OdeW9C12.mode	@ltx/gr_gr_cog/oc.m6.d7:ocMA.OdeW9C12.mode
ltx/gr_redirects_goarch/oc.m6.d7:ocMA.OdeW9C12.ode	@ltx/gr_gr_cog/oc.m6.d7:ocMA.OdeW9C12.ode
ltx/gr_redirects_goarch/oc.m6.d7:ocMA.OdeW9C12.text	@ltx/gr_gr_cog/oc.m6.d7:ocMA.OdeW9C12.text
ltx/gr_redirects_goarch/oc.m6.d7:ocMA.OdeW9C13.incipit	@ltx/gr_gr_cog/oc.m6.d7:ocMA.OdeW9C13.incipit
ltx/gr_redirects_goarch/oc.m6.d7:ocMA.OdeW9C13.melody	@ltx/gr_gr_cog/oc.m6.d7:ocMA.OdeW9C13.melody
ltx/gr_redirects_goarch/oc.m6.d7:ocMA.OdeW9C13.mode	@ltx/gr_gr_cog/oc.m6.d7:ocMA.OdeW9C13.mode
ltx/gr_redirects_goarch/oc.m6.d7:ocMA.OdeW9C13.ode	@ltx/gr_gr_cog/oc.m6.d7:ocMA.OdeW9C13.ode
ltx/gr_redirects_goarch/oc.m6.d7:ocMA.OdeW9C13.text	@ltx/gr_gr_cog/oc.m6.d7:ocMA.OdeW9C13.text
ltx/gr_redirects_goarch/oc.m6.d7:ocMA.OdeW9C14.incipit	@ltx/gr_gr_cog/oc.m6.d7:ocMA.OdeW9C14.incipit
ltx/gr_redirects_goarch/oc.m6.d7:ocMA.OdeW9C14.melody	@ltx/gr_gr_cog/oc.m6.d7:ocMA.OdeW9C14.melody
ltx/gr_redirects_goarch/oc.m6.d7:ocMA.OdeW9C14.mode	@ltx/gr_gr_cog/oc.m6.d7:ocMA.OdeW9C14.mode
ltx/gr_redirects_goarch/oc.m6.d7:ocMA.OdeW9C14.ode	@ltx/gr_gr_cog/oc.m6.d7:ocMA.OdeW9C14.ode
ltx/gr_redirects_goarch/oc.m6.d7:ocMA.OdeW9C14.text	@ltx/gr_gr_cog/oc.m6.d7:ocMA.OdeW9C14.text
ltx/gr_redirects_goarch/oc.m6.d7:ocMA.OdeW9C1H.greekmelody	@ltx/gr_gr_cog/oc.m6.d7:ocMA.OdeW9C1H.greekmelody
ltx/gr_redirects_goarch/oc.m6.d7:ocMA.OdeW9C1H.incipit	@ltx/gr_gr_cog/oc.m6.d7:ocMA.OdeW9C1H.incipit
ltx/gr_redirects_goarch/oc.m6.d7:ocMA.OdeW9C1H.melody	@ltx/gr_gr_cog/oc.m6.d7:ocMA.OdeW9C1H.melody
ltx/gr_redirects_goarch/oc.m6.d7:ocMA.OdeW9C1H.mode	@ltx/gr_gr_cog/oc.m6.d7:ocMA.OdeW9C1H.mode
ltx/gr_redirects_goarch/oc.m6.d7:ocMA.OdeW9C1H.ode	@ltx/gr_gr_cog/oc.m6.d7:ocMA.OdeW9C1H.ode
ltx/gr_redirects_goarch/oc.m6.d7:ocMA.OdeW9C1H.text	@ltx/gr_gr_cog/oc.m6.d7:ocMA.OdeW9C1H.text
ltx/gr_redirects_goarch/oc.m6.d7:ocMA.OdeW9C1T.incipit	@ltx/gr_gr_cog/oc.m6.d7:ocMA.OdeW9C1T.incipit
ltx/gr_redirects_goarch/oc.m6.d7:ocMA.OdeW9C1T.melody	@ltx/gr_gr_cog/oc.m6.d7:ocMA.OdeW9C1T.melody
ltx/gr_redirects_goarch/oc.m6.d7:ocMA.OdeW9C1T.mode	@ltx/gr_gr_cog/oc.m6.d7:ocMA.OdeW9C1T.mode
ltx/gr_redirects_goarch/oc.m6.d7:ocMA.OdeW9C1T.ode	@ltx/gr_gr_cog/oc.m6.d7:ocMA.OdeW9C1T.ode
ltx/gr_redirects_goarch/oc.m6.d7:ocMA.OdeW9C1T.text	@ltx/gr_gr_cog/oc.m6.d7:ocMA.OdeW9C1T.text
ltx/gr_redirects_goarch/oc.m6.d7:ocMA.OdeW9C21.greekmelody	@ltx/gr_gr_cog/oc.m6.d7:ocMA.OdeW9C21.greekmelody
ltx/gr_redirects_goarch/oc.m6.d7:ocMA.OdeW9C21.incipit	@ltx/gr_gr_cog/oc.m6.d7:ocMA.OdeW9C21.incipit
ltx/gr_redirects_goarch/oc.m6.d7:ocMA.OdeW9C21.melody	@ltx/gr_gr_cog/oc.m6.d7:ocMA.OdeW9C21.melody
ltx/gr_redirects_goarch/oc.m6.d7:ocMA.OdeW9C21.mode	@ltx/gr_gr_cog/oc.m6.d7:ocMA.OdeW9C21.mode
ltx/gr_redirects_goarch/oc.m6.d7:ocMA.OdeW9C21.ode	@ltx/gr_gr_cog/oc.m6.d7:ocMA.OdeW9C21.ode
ltx/gr_redirects_goarch/oc.m6.d7:ocMA.OdeW9C21.text	@ltx/gr_gr_cog/oc.m6.d7:ocMA.OdeW9C21.text
ltx/gr_redirects_goarch/oc.m6.d7:ocMA.OdeW9C22.incipit	@ltx/gr_gr_cog/oc.m6.d7:ocMA.OdeW9C22.incipit
ltx/gr_redirects_goarch/oc.m6.d7:ocMA.OdeW9C22.melody	@ltx/gr_gr_cog/oc.m6.d7:ocMA.OdeW9C22.melody
ltx/gr_redirects_goarch/oc.m6.d7:ocMA.OdeW9C22.mode	@ltx/gr_gr_cog/oc.m6.d7:ocMA.OdeW9C22.mode
ltx/gr_redirects_goarch/oc.m6.d7:ocMA.OdeW9C22.ode	@ltx/gr_gr_cog/oc.m6.d7:ocMA.OdeW9C22.ode
ltx/gr_redirects_goarch/oc.m6.d7:ocMA.OdeW9C22.text	@ltx/gr_gr_cog/oc.m6.d7:ocMA.OdeW9C22.text
ltx/gr_redirects_goarch/oc.m6.d7:ocMA.OdeW9C23.incipit	@ltx/gr_gr_cog/oc.m6.d7:ocMA.OdeW9C23.incipit
ltx/gr_redirects_goarch/oc.m6.d7:ocMA.OdeW9C23.melody	@ltx/gr_gr_cog/oc.m6.d7:ocMA.OdeW9C23.melody
ltx/gr_redirects_goarch/oc.m6.d7:ocMA.OdeW9C23.mode	@ltx/gr_gr_cog/oc.m6.d7:ocMA.OdeW9C23.mode
ltx/gr_redirects_goarch/oc.m6.d7:ocMA.OdeW9C23.ode	@ltx/gr_gr_cog/oc.m6.d7:ocMA.OdeW9C23.ode
ltx/gr_redirects_goarch/oc.m6.d7:ocMA.OdeW9C23.text	@ltx/gr_gr_cog/oc.m6.d7:ocMA.OdeW9C23.text
ltx/gr_redirects_goarch/oc.m6.d7:ocMA.OdeW9C2T.incipit	@ltx/gr_gr_cog/oc.m6.d7:ocMA.OdeW9C2T.incipit
ltx/gr_redirects_goarch/oc.m6.d7:ocMA.OdeW9C2T.melody	@ltx/gr_gr_cog/oc.m6.d7:ocMA.OdeW9C2T.melody
ltx/gr_redirects_goarch/oc.m6.d7:ocMA.OdeW9C2T.mode	@ltx/gr_gr_cog/oc.m6.d7:ocMA.OdeW9C2T.mode
ltx/gr_redirects_goarch/oc.m6.d7:ocMA.OdeW9C2T.ode	@ltx/gr_gr_cog/oc.m6.d7:ocMA.OdeW9C2T.ode
ltx/gr_redirects_goarch/oc.m6.d7:ocMA.OdeW9C2T.text	@ltx/gr_gr_cog/oc.m6.d7:ocMA.OdeW9C2T.text
ltx/gr_redirects_goarch/oc.m6.d7:ocVE.ApolTheotokionVM.incipit	@ltx/gr_gr_cog/oc.m6.d7:ocVE.ApolTheotokionVM.incipit
ltx/gr_redirects_goarch/oc.m6.d7:ocVE.ApolTheotokionVM.melody	@ltx/gr_gr_cog/oc.m6.d7:ocVE.ApolTheotokionVM.melody
ltx/gr_redirects_goarch/oc.m6.d7:ocVE.ApolTheotokionVM.mode	@ltx/gr_gr_cog/oc.m6.d7:ocVE.ApolTheotokionVM.mode
ltx/gr_redirects_goarch/oc.m6.d7:ocVE.ApolTheotokionVM.text	@ltx/gr_gr_cog/oc.m6.d7:ocVE.ApolTheotokionVM.text
ltx/gr_redirects_goarch/oc.m6.d7:ocVE.AposTheotokion.greekmelody	@ltx/gr_gr_cog/oc.m6.d7:ocVE.AposTheotokion.greekmelody
ltx/gr_redirects_goarch/oc.m6.d7:ocVE.AposTheotokion.incipit	@ltx/gr_gr_cog/oc.m6.d7:ocVE.AposTheotokion.incipit
ltx/gr_redirects_goarch/oc.m6.d7:ocVE.AposTheotokion.melody	@ltx/gr_gr_cog/oc.m6.d7:ocVE.AposTheotokion.melody
ltx/gr_redirects_goarch/oc.m6.d7:ocVE.AposTheotokion.mode	@ltx/gr_gr_cog/oc.m6.d7:ocVE.AposTheotokion.mode
ltx/gr_redirects_goarch/oc.m6.d7:ocVE.AposTheotokion.text	@ltx/gr_gr_cog/oc.m6.d7:ocVE.AposTheotokion.text
ltx/gr_redirects_goarch/oc.m6.d7:ocVE.Aposticha1.incipit	@ltx/gr_gr_cog/oc.m6.d7:ocVE.Aposticha1.incipit
ltx/gr_redirects_goarch/oc.m6.d7:ocVE.Aposticha1.melody	@ltx/gr_gr_cog/oc.m6.d7:ocVE.Aposticha1.melody
ltx/gr_redirects_goarch/oc.m6.d7:ocVE.Aposticha1.mode	@ltx/gr_gr_cog/oc.m6.d7:ocVE.Aposticha1.mode
ltx/gr_redirects_goarch/oc.m6.d7:ocVE.Aposticha1.text	@ltx/gr_gr_cog/oc.m6.d7:ocVE.Aposticha1.text
ltx/gr_redirects_goarch/oc.m6.d7:ocVE.Aposticha2.incipit	@ltx/gr_gr_cog/oc.m6.d7:ocVE.Aposticha2.incipit
ltx/gr_redirects_goarch/oc.m6.d7:ocVE.Aposticha2.melody	@ltx/gr_gr_cog/oc.m6.d7:ocVE.Aposticha2.melody
ltx/gr_redirects_goarch/oc.m6.d7:ocVE.Aposticha2.mode	@ltx/gr_gr_cog/oc.m6.d7:ocVE.Aposticha2.mode
ltx/gr_redirects_goarch/oc.m6.d7:ocVE.Aposticha2.text	@ltx/gr_gr_cog/oc.m6.d7:ocVE.Aposticha2.text
ltx/gr_redirects_goarch/oc.m6.d7:ocVE.Aposticha3.incipit	@ltx/gr_gr_cog/oc.m6.d7:ocVE.Aposticha3.incipit
ltx/gr_redirects_goarch/oc.m6.d7:ocVE.Aposticha3.melody	@ltx/gr_gr_cog/oc.m6.d7:ocVE.Aposticha3.melody
ltx/gr_redirects_goarch/oc.m6.d7:ocVE.Aposticha3.mode	@ltx/gr_gr_cog/oc.m6.d7:ocVE.Aposticha3.mode
ltx/gr_redirects_goarch/oc.m6.d7:ocVE.Aposticha3.text	@ltx/gr_gr_cog/oc.m6.d7:ocVE.Aposticha3.text
ltx/gr_redirects_goarch/oc.m6.d7:ocVE.SticTheotokion.incipit	@ltx/gr_gr_cog/oc.m6.d7:ocVE.SticTheotokion.incipit
ltx/gr_redirects_goarch/oc.m6.d7:ocVE.SticTheotokion.melody	@ltx/gr_gr_cog/oc.m6.d7:ocVE.SticTheotokion.melody
ltx/gr_redirects_goarch/oc.m6.d7:ocVE.SticTheotokion.mode	@ltx/gr_gr_cog/oc.m6.d7:ocVE.SticTheotokion.mode
ltx/gr_redirects_goarch/oc.m6.d7:ocVE.SticTheotokion.text	@ltx/gr_gr_cog/oc.m6.d7:ocVE.SticTheotokion.text
ltx/gr_redirects_goarch/oc.m6.d7:ocVE.Stichera1.greekmelody	@ltx/gr_gr_cog/oc.m6.d7:ocVE.Stichera1.greekmelody
ltx/gr_redirects_goarch/oc.m6.d7:ocVE.Stichera1.incipit	@ltx/gr_gr_cog/oc.m6.d7:ocVE.Stichera1.incipit
ltx/gr_redirects_goarch/oc.m6.d7:ocVE.Stichera1.melody	@ltx/gr_gr_cog/oc.m6.d7:ocVE.Stichera1.melody
ltx/gr_redirects_goarch/oc.m6.d7:ocVE.Stichera1.mode	@ltx/gr_gr_cog/oc.m6.d7:ocVE.Stichera1.mode
ltx/gr_redirects_goarch/oc.m6.d7:ocVE.Stichera1.text	@ltx/gr_gr_cog/oc.m6.d7:ocVE.Stichera1.text
ltx/gr_redirects_goarch/oc.m6.d7:ocVE.Stichera2.incipit	@ltx/gr_gr_cog/oc.m6.d7:ocVE.Stichera2.incipit
ltx/gr_redirects_goarch/oc.m6.d7:ocVE.Stichera2.melody	@ltx/gr_gr_cog/oc.m6.d7:ocVE.Stichera2.melody
ltx/gr_redirects_goarch/oc.m6.d7:ocVE.Stichera2.mode	@ltx/gr_gr_cog/oc.m6.d7:ocVE.Stichera2.mode
ltx/gr_redirects_goarch/oc.m6.d7:ocVE.Stichera2.text	@ltx/gr_gr_cog/oc.m6.d7:ocVE.Stichera2.text
ltx/gr_redirects_goarch/oc.m6.d7:ocVE.Stichera3.incipit	@ltx/gr_gr_cog/oc.m6.d7:ocVE.Stichera3.incipit
ltx/gr_redirects_goarch/oc.m6.d7:ocVE.Stichera3.melody	@ltx/gr_gr_cog/oc.m6.d7:ocVE.Stichera3.melody
ltx/gr_redirects_goarch/oc.m6.d7:ocVE.Stichera3.mode	@ltx/gr_gr_cog/oc.m6.d7:ocVE.Stichera3.mode
ltx/gr_redirects_goarch/oc.m6.d7:ocVE.Stichera3.text	@ltx/gr_gr_cog/oc.m6.d7:ocVE.Stichera3.text
ltx/gr_redirects_goarch/oc.m6.d7:ocVE.Stichera4.incipit	@ltx/gr_gr_cog/oc.m6.d7:ocVE.Stichera4.incipit
ltx/gr_redirects_goarch/oc.m6.d7:ocVE.Stichera4.melody	@ltx/gr_gr_cog/oc.m6.d7:ocVE.Stichera4.melody
ltx/gr_redirects_goarch/oc.m6.d7:ocVE.Stichera4.mode	@ltx/gr_gr_cog/oc.m6.d7:ocVE.Stichera4.mode
ltx/gr_redirects_goarch/oc.m6.d7:ocVE.Stichera4.text	@ltx/gr_gr_cog/oc.m6.d7:ocVE.Stichera4.text
ltx/gr_redirects_goarch/oc.m6.d7:ocVE.Stichera5.incipit	@ltx/gr_gr_cog/oc.m6.d7:ocVE.Stichera5.incipit
ltx/gr_redirects_goarch/oc.m6.d7:ocVE.Stichera5.melody	@ltx/gr_gr_cog/oc.m6.d7:ocVE.Stichera5.melody
ltx/gr_redirects_goarch/oc.m6.d7:ocVE.Stichera5.mode	@ltx/gr_gr_cog/oc.m6.d7:ocVE.Stichera5.mode
ltx/gr_redirects_goarch/oc.m6.d7:ocVE.Stichera5.text	@ltx/gr_gr_cog/oc.m6.d7:ocVE.Stichera5.text
ltx/gr_redirects_goarch/oc.m6.d7:ocVE.Stichera6.incipit	@ltx/gr_gr_cog/oc.m6.d7:ocVE.Stichera6.incipit
ltx/gr_redirects_goarch/oc.m6.d7:ocVE.Stichera6.melody	@ltx/gr_gr_cog/oc.m6.d7:ocVE.Stichera6.melody
ltx/gr_redirects_goarch/oc.m6.d7:ocVE.Stichera6.mode	@ltx/gr_gr_cog/oc.m6.d7:ocVE.Stichera6.mode
ltx/gr_redirects_goarch/oc.m6.d7:ocVE.Stichera6.text	@ltx/gr_gr_cog/oc.m6.d7:ocVE.Stichera6.text
ltx/gr_redirects_goarch/oc.m6.d7:octrMA.AposTheotokion.incipit	@ltx/gr_gr_cog/oc.m6.d7:octrMA.AposTheotokion.incipit
ltx/gr_redirects_goarch/oc.m6.d7:octrMA.AposTheotokion.melody	@ltx/gr_gr_cog/oc.m6.d7:octrMA.AposTheotokion.melody
ltx/gr_redirects_goarch/oc.m6.d7:octrMA.AposTheotokion.mode	@ltx/gr_gr_cog/oc.m6.d7:octrMA.AposTheotokion.mode
ltx/gr_redirects_goarch/oc.m6.d7:octrMA.AposTheotokion.text	@ltx/gr_gr_cog/oc.m6.d7:octrMA.AposTheotokion.text
ltx/gr_redirects_goarch/oc.m6.d7:octrMA.Aposticha1.greekmelody	@ltx/gr_gr_cog/oc.m6.d7:octrMA.Aposticha1.greekmelody
ltx/gr_redirects_goarch/oc.m6.d7:octrMA.Aposticha1.incipit	@ltx/gr_gr_cog/oc.m6.d7:octrMA.Aposticha1.incipit
ltx/gr_redirects_goarch/oc.m6.d7:octrMA.Aposticha1.melody	@ltx/gr_gr_cog/oc.m6.d7:octrMA.Aposticha1.melody
ltx/gr_redirects_goarch/oc.m6.d7:octrMA.Aposticha1.mode	@ltx/gr_gr_cog/oc.m6.d7:octrMA.Aposticha1.mode
ltx/gr_redirects_goarch/oc.m6.d7:octrMA.Aposticha1.text	@ltx/gr_gr_cog/oc.m6.d7:octrMA.Aposticha1.text
ltx/gr_redirects_goarch/oc.m6.d7:octrMA.Aposticha2.incipit	@ltx/gr_gr_cog/oc.m6.d7:octrMA.Aposticha2.incipit
ltx/gr_redirects_goarch/oc.m6.d7:octrMA.Aposticha2.melody	@ltx/gr_gr_cog/oc.m6.d7:octrMA.Aposticha2.melody
ltx/gr_redirects_goarch/oc.m6.d7:octrMA.Aposticha2.mode	@ltx/gr_gr_cog/oc.m6.d7:octrMA.Aposticha2.mode
ltx/gr_redirects_goarch/oc.m6.d7:octrMA.Aposticha2.text	@ltx/gr_gr_cog/oc.m6.d7:octrMA.Aposticha2.text
ltx/gr_redirects_goarch/oc.m6.d7:octrMA.Aposticha3.incipit	@ltx/gr_gr_cog/oc.m6.d7:octrMA.Aposticha3.incipit
ltx/gr_redirects_goarch/oc.m6.d7:octrMA.Aposticha3.melody	@ltx/gr_gr_cog/oc.m6.d7:octrMA.Aposticha3.melody
ltx/gr_redirects_goarch/oc.m6.d7:octrMA.Aposticha3.mode	@ltx/gr_gr_cog/oc.m6.d7:octrMA.Aposticha3.mode
ltx/gr_redirects_goarch/oc.m6.d7:octrMA.Aposticha3.text	@ltx/gr_gr_cog/oc.m6.d7:octrMA.Aposticha3.text
ltx/gr_redirects_goarch/oc.m6.d7:octrMA.Kathisma11.incipit	@ltx/gr_gr_cog/oc.m6.d7:octrMA.Kathisma11.incipit
ltx/gr_redirects_goarch/oc.m6.d7:octrMA.Kathisma11.melody	@ltx/gr_gr_cog/oc.m6.d7:octrMA.Kathisma11.melody
ltx/gr_redirects_goarch/oc.m6.d7:octrMA.Kathisma11.mode	@ltx/gr_gr_cog/oc.m6.d7:octrMA.Kathisma11.mode
ltx/gr_redirects_goarch/oc.m6.d7:octrMA.Kathisma11.text	@ltx/gr_gr_cog/oc.m6.d7:octrMA.Kathisma11.text
ltx/gr_redirects_goarch/oc.m6.d7:octrMA.Kathisma12.greekmelody	@ltx/gr_gr_cog/oc.m6.d7:octrMA.Kathisma12.greekmelody
ltx/gr_redirects_goarch/oc.m6.d7:octrMA.Kathisma12.incipit	@ltx/gr_gr_cog/oc.m6.d7:octrMA.Kathisma12.incipit
ltx/gr_redirects_goarch/oc.m6.d7:octrMA.Kathisma12.melody	@ltx/gr_gr_cog/oc.m6.d7:octrMA.Kathisma12.melody
ltx/gr_redirects_goarch/oc.m6.d7:octrMA.Kathisma12.mode	@ltx/gr_gr_cog/oc.m6.d7:octrMA.Kathisma12.mode
ltx/gr_redirects_goarch/oc.m6.d7:octrMA.Kathisma12.text	@ltx/gr_gr_cog/oc.m6.d7:octrMA.Kathisma12.text
ltx/gr_redirects_goarch/oc.m6.d7:octrMA.Kathisma13.incipit	@ltx/gr_gr_cog/oc.m6.d7:octrMA.Kathisma13.incipit
ltx/gr_redirects_goarch/oc.m6.d7:octrMA.Kathisma13.melody	@ltx/gr_gr_cog/oc.m6.d7:octrMA.Kathisma13.melody
ltx/gr_redirects_goarch/oc.m6.d7:octrMA.Kathisma13.mode	@ltx/gr_gr_cog/oc.m6.d7:octrMA.Kathisma13.mode
ltx/gr_redirects_goarch/oc.m6.d7:octrMA.Kathisma13.text	@ltx/gr_gr_cog/oc.m6.d7:octrMA.Kathisma13.text
ltx/gr_redirects_goarch/oc.m6.d7:octrMA.Kathisma14.incipit	@ltx/gr_gr_cog/oc.m6.d7:octrMA.Kathisma14.incipit
ltx/gr_redirects_goarch/oc.m6.d7:octrMA.Kathisma14.melody	@ltx/gr_gr_cog/oc.m6.d7:octrMA.Kathisma14.melody
ltx/gr_redirects_goarch/oc.m6.d7:octrMA.Kathisma14.mode	@ltx/gr_gr_cog/oc.m6.d7:octrMA.Kathisma14.mode
ltx/gr_redirects_goarch/oc.m6.d7:octrMA.Kathisma14.text	@ltx/gr_gr_cog/oc.m6.d7:octrMA.Kathisma14.text
ltx/gr_redirects_goarch/oc.m6.d7:octrMA.Kathisma1T.greekmelody	@ltx/gr_gr_cog/oc.m6.d7:octrMA.Kathisma1T.greekmelody
ltx/gr_redirects_goarch/oc.m6.d7:octrMA.Kathisma1T.incipit	@ltx/gr_gr_cog/oc.m6.d7:octrMA.Kathisma1T.incipit
ltx/gr_redirects_goarch/oc.m6.d7:octrMA.Kathisma1T.melody	@ltx/gr_gr_cog/oc.m6.d7:octrMA.Kathisma1T.melody
ltx/gr_redirects_goarch/oc.m6.d7:octrMA.Kathisma1T.mode	@ltx/gr_gr_cog/oc.m6.d7:octrMA.Kathisma1T.mode
ltx/gr_redirects_goarch/oc.m6.d7:octrMA.Kathisma1T.text	@ltx/gr_gr_cog/oc.m6.d7:octrMA.Kathisma1T.text
ltx/gr_redirects_goarch/oc.m6.d7:octrMA.Lauds1.incipit	@ltx/gr_gr_cog/oc.m6.d7:octrMA.Lauds1.incipit
ltx/gr_redirects_goarch/oc.m6.d7:octrMA.Lauds1.melody	@ltx/gr_gr_cog/oc.m6.d7:octrMA.Lauds1.melody
ltx/gr_redirects_goarch/oc.m6.d7:octrMA.Lauds1.mode	@ltx/gr_gr_cog/oc.m6.d7:octrMA.Lauds1.mode
ltx/gr_redirects_goarch/oc.m6.d7:octrMA.Lauds1.text	@ltx/gr_gr_cog/oc.m6.d7:octrMA.Lauds1.text
ltx/gr_redirects_goarch/oc.m6.d7:octrMA.Lauds2.incipit	@ltx/gr_gr_cog/oc.m6.d7:octrMA.Lauds2.incipit
ltx/gr_redirects_goarch/oc.m6.d7:octrMA.Lauds2.melody	@ltx/gr_gr_cog/oc.m6.d7:octrMA.Lauds2.melody
ltx/gr_redirects_goarch/oc.m6.d7:octrMA.Lauds2.mode	@ltx/gr_gr_cog/oc.m6.d7:octrMA.Lauds2.mode
ltx/gr_redirects_goarch/oc.m6.d7:octrMA.Lauds2.text	@ltx/gr_gr_cog/oc.m6.d7:octrMA.Lauds2.text
ltx/gr_redirects_goarch/oc.m6.d7:octrMA.Lauds3.incipit	@ltx/gr_gr_cog/oc.m6.d7:octrMA.Lauds3.incipit
ltx/gr_redirects_goarch/oc.m6.d7:octrMA.Lauds3.melody	@ltx/gr_gr_cog/oc.m6.d7:octrMA.Lauds3.melody
ltx/gr_redirects_goarch/oc.m6.d7:octrMA.Lauds3.mode	@ltx/gr_gr_cog/oc.m6.d7:octrMA.Lauds3.mode
ltx/gr_redirects_goarch/oc.m6.d7:octrMA.Lauds3.text	@ltx/gr_gr_cog/oc.m6.d7:octrMA.Lauds3.text
ltx/gr_redirects_goarch/oc.m6.d7:octrMA.Lauds4.incipit	@ltx/gr_gr_cog/oc.m6.d7:octrMA.Lauds4.incipit
ltx/gr_redirects_goarch/oc.m6.d7:octrMA.Lauds4.melody	@ltx/gr_gr_cog/oc.m6.d7:octrMA.Lauds4.melody
ltx/gr_redirects_goarch/oc.m6.d7:octrMA.Lauds4.mode	@ltx/gr_gr_cog/oc.m6.d7:octrMA.Lauds4.mode
ltx/gr_redirects_goarch/oc.m6.d7:octrMA.Lauds4.text	@ltx/gr_gr_cog/oc.m6.d7:octrMA.Lauds4.text
ltx/gr_redirects_goarch/oc.m6.d7:octrMA.LaudsGlory.incipit	@ltx/gr_gr_cog/oc.m6.d7:octrMA.LaudsGlory.incipit
ltx/gr_redirects_goarch/oc.m6.d7:octrMA.LaudsGlory.melody	@ltx/gr_gr_cog/oc.m6.d7:octrMA.LaudsGlory.melody
ltx/gr_redirects_goarch/oc.m6.d7:octrMA.LaudsGlory.mode	@ltx/gr_gr_cog/oc.m6.d7:octrMA.LaudsGlory.mode
ltx/gr_redirects_goarch/oc.m6.d7:octrMA.LaudsGlory.text	@ltx/gr_gr_cog/oc.m6.d7:octrMA.LaudsGlory.text
ltx/gr_redirects_goarch/oc.m6.d7:octrMA.LaudsTheotokion.greekmelody	@ltx/gr_gr_cog/oc.m6.d7:octrMA.LaudsTheotokion.greekmelody
ltx/gr_redirects_goarch/oc.m6.d7:octrMA.LaudsTheotokion.incipit	@ltx/gr_gr_cog/oc.m6.d7:octrMA.LaudsTheotokion.incipit
ltx/gr_redirects_goarch/oc.m6.d7:octrMA.LaudsTheotokion.melody	@ltx/gr_gr_cog/oc.m6.d7:octrMA.LaudsTheotokion.melody
ltx/gr_redirects_goarch/oc.m6.d7:octrMA.LaudsTheotokion.mode	@ltx/gr_gr_cog/oc.m6.d7:octrMA.LaudsTheotokion.mode
ltx/gr_redirects_goarch/oc.m6.d7:octrMA.LaudsTheotokion.text	@ltx/gr_gr_cog/oc.m6.d7:octrMA.LaudsTheotokion.text
ltx/gr_redirects_goarch/oc.m6.d7:octrMA.Photogogic.incipit	@ltx/gr_gr_cog/oc.m6.d7:octrMA.Photogogic.incipit
ltx/gr_redirects_goarch/oc.m6.d7:octrMA.Photogogic.mode	@ltx/gr_gr_cog/oc.m6.d7:octrMA.Photogogic.mode
ltx/gr_redirects_goarch/oc.m6.d7:octrMA.Photogogic.text	@ltx/gr_gr_cog/oc.m6.d7:octrMA.Photogogic.text
ltx/gr_redirects_goarch/oc.m6.d7:octrVE.SticBoth.incipit	@ltx/gr_gr_cog/oc.m6.d7:octrVE.SticBoth.incipit
ltx/gr_redirects_goarch/oc.m6.d7:octrVE.SticBoth.melody	@ltx/gr_gr_cog/oc.m6.d7:octrVE.SticBoth.melody
ltx/gr_redirects_goarch/oc.m6.d7:octrVE.SticBoth.mode	@ltx/gr_gr_cog/oc.m6.d7:octrVE.SticBoth.mode
ltx/gr_redirects_goarch/oc.m6.d7:octrVE.SticBoth.text	@ltx/gr_gr_cog/oc.m6.d7:octrVE.SticBoth.text
ltx/gr_redirects_goarch/oc.m6.d7:octrVE.SticGlory.incipit	@ltx/gr_gr_cog/oc.m6.d7:octrVE.SticGlory.incipit
ltx/gr_redirects_goarch/oc.m6.d7:octrVE.SticGlory.melody	@ltx/gr_gr_cog/oc.m6.d7:octrVE.SticGlory.melody
ltx/gr_redirects_goarch/oc.m6.d7:octrVE.SticGlory.mode	@ltx/gr_gr_cog/oc.m6.d7:octrVE.SticGlory.mode
ltx/gr_redirects_goarch/oc.m6.d7:octrVE.SticGlory.text	@ltx/gr_gr_cog/oc.m6.d7:octrVE.SticGlory.text
ltx/gr_redirects_goarch/oc.m6.d7:octrVE.Stichera1.incipit	@ltx/gr_gr_cog/oc.m6.d7:octrVE.Stichera1.incipit
ltx/gr_redirects_goarch/oc.m6.d7:octrVE.Stichera1.melody	@ltx/gr_gr_cog/oc.m6.d7:octrVE.Stichera1.melody
ltx/gr_redirects_goarch/oc.m6.d7:octrVE.Stichera1.mode	@ltx/gr_gr_cog/oc.m6.d7:octrVE.Stichera1.mode
ltx/gr_redirects_goarch/oc.m6.d7:octrVE.Stichera1.text	@ltx/gr_gr_cog/oc.m6.d7:octrVE.Stichera1.text
ltx/gr_redirects_goarch/oc.m6.d7:octrVE.Stichera2.incipit	@ltx/gr_gr_cog/oc.m6.d7:octrVE.Stichera2.incipit
ltx/gr_redirects_goarch/oc.m6.d7:octrVE.Stichera2.melody	@ltx/gr_gr_cog/oc.m6.d7:octrVE.Stichera2.melody
ltx/gr_redirects_goarch/oc.m6.d7:octrVE.Stichera2.mode	@ltx/gr_gr_cog/oc.m6.d7:octrVE.Stichera2.mode
ltx/gr_redirects_goarch/oc.m6.d7:octrVE.Stichera2.text	@ltx/gr_gr_cog/oc.m6.d7:octrVE.Stichera2.text
ltx/gr_redirects_goarch/oc.m6.d7:octrVE.Stichera3.incipit	@ltx/gr_gr_cog/oc.m6.d7:octrVE.Stichera3.incipit
ltx/gr_redirects_goarch/oc.m6.d7:octrVE.Stichera3.melody	@ltx/gr_gr_cog/oc.m6.d7:octrVE.Stichera3.melody
ltx/gr_redirects_goarch/oc.m6.d7:octrVE.Stichera3.mode	@ltx/gr_gr_cog/oc.m6.d7:octrVE.Stichera3.mode
ltx/gr_redirects_goarch/oc.m6.d7:octrVE.Stichera3.text	@ltx/gr_gr_cog/oc.m6.d7:octrVE.Stichera3.text
ltx/gr_redirects_goarch/oc.m6.d7:octrVE.Stichera4.incipit	@ltx/gr_gr_cog/oc.m6.d7:octrVE.Stichera4.incipit
ltx/gr_redirects_goarch/oc.m6.d7:octrVE.Stichera4.melody	@ltx/gr_gr_cog/oc.m6.d7:octrVE.Stichera4.melody
ltx/gr_redirects_goarch/oc.m6.d7:octrVE.Stichera4.mode	@ltx/gr_gr_cog/oc.m6.d7:octrVE.Stichera4.mode
ltx/gr_redirects_goarch/oc.m6.d7:octrVE.Stichera4.text	@ltx/gr_gr_cog/oc.m6.d7:octrVE.Stichera4.text
