ltx/gr_redirects_goarch/le.pr.me.r33:leprVE.reading.book_abbr	@ltx/gr_gr_cog/le.pr.me.r33:leprVE.reading.book_abbr
ltx/gr_redirects_goarch/le.pr.me.r33:leprVE.reading.book_string	@ltx/gr_gr_cog/le.pr.me.r33:leprVE.reading.book_string
ltx/gr_redirects_goarch/le.pr.me.r33:leprVE.reading.chapverse	@ltx/gr_gr_cog/le.pr.me.r33:leprVE.reading.chapverse
ltx/gr_redirects_goarch/le.pr.me.r33:leprVE.reading.incipit	@ltx/gr_gr_cog/le.pr.me.r33:leprVE.reading.incipit
ltx/gr_redirects_goarch/le.pr.me.r33:leprVE.reading.text	@ltx/gr_gr_cog/le.pr.me.r33:leprVE.reading.text
ltx/gr_redirects_goarch/le.pr.me.r33:leprVE.reading.title	@ltx/gr_gr_cog/le.pr.me.r33:leprVE.reading.title
ltx/gr_redirects_goarch/le.pr.me.r33:leprVE.reading.title_abbr	@ltx/gr_gr_cog/le.pr.me.r33:leprVE.reading.title_abbr
ltx/gr_redirects_goarch/le.pr.me.r33:leprVE.reading.version	@ltx/gr_gr_cog/le.pr.me.r33:leprVE.reading.version
