ltx/gr_redirects_goarch/ho.ho19:ho.title	@ltx/gr_gr_cog/ho.ho19:ho.title
ltx/gr_redirects_goarch/ho.ho19:ho.title1	@ltx/gr_gr_cog/ho.ho19:ho.title1
ltx/gr_redirects_goarch/ho.ho19:ho.title2	@ltx/gr_gr_cog/ho.ho19:ho.title2
ltx/gr_redirects_goarch/ho.ho19:ho.title3	@ltx/gr_gr_cog/ho.ho19:ho.title3
ltx/gr_redirects_goarch/ho.ho19:ho.title4	@ltx/gr_gr_cog/ho.ho19:ho.title4
ltx/gr_redirects_goarch/ho.ho19:ho.title5	@ltx/gr_gr_cog/ho.ho19:ho.title5
ltx/gr_redirects_goarch/ho.ho19:ho.title6	@ltx/gr_gr_cog/ho.ho19:ho.title6
ltx/gr_redirects_goarch/ho.ho19:ho.title7	@ltx/gr_gr_cog/ho.ho19:ho.title7
ltx/gr_redirects_goarch/ho.ho19:ho.title8	@ltx/gr_gr_cog/ho.ho19:ho.title8
ltx/gr_redirects_goarch/ho.ho19:ho.title9	@ltx/gr_gr_cog/ho.ho19:ho.title9
