ltx/gr_redirects_goarch/ho.ho21:R01	@ltx/gr_gr_cog/ho.ho21:R01
ltx/gr_redirects_goarch/ho.ho21:R02	@ltx/gr_gr_cog/ho.ho21:R02
ltx/gr_redirects_goarch/ho.ho21:R03	@ltx/gr_gr_cog/ho.ho21:R03
ltx/gr_redirects_goarch/ho.ho21:R04	@ltx/gr_gr_cog/ho.ho21:R04
ltx/gr_redirects_goarch/ho.ho21:ho.title	@ltx/gr_gr_cog/ho.ho21:ho.title
ltx/gr_redirects_goarch/ho.ho21:ho.title2	@ltx/gr_gr_cog/ho.ho21:ho.title2
ltx/gr_redirects_goarch/ho.ho21:hoCA.Kontakion.incipit	@ltx/gr_gr_cog/ho.ho21:hoCA.Kontakion.incipit
ltx/gr_redirects_goarch/ho.ho21:hoCA.Kontakion.melody	@ltx/gr_gr_cog/ho.ho21:hoCA.Kontakion.melody
ltx/gr_redirects_goarch/ho.ho21:hoCA.Kontakion.mode	@ltx/gr_gr_cog/ho.ho21:hoCA.Kontakion.mode
ltx/gr_redirects_goarch/ho.ho21:hoCA.Kontakion.text	@ltx/gr_gr_cog/ho.ho21:hoCA.Kontakion.text
ltx/gr_redirects_goarch/ho.ho21:hoCA.Ode11.greekmelody	@ltx/gr_gr_cog/ho.ho21:hoCA.Ode11.greekmelody
ltx/gr_redirects_goarch/ho.ho21:hoCA.Ode11.incipit	@ltx/gr_gr_cog/ho.ho21:hoCA.Ode11.incipit
ltx/gr_redirects_goarch/ho.ho21:hoCA.Ode11.melody	@ltx/gr_gr_cog/ho.ho21:hoCA.Ode11.melody
ltx/gr_redirects_goarch/ho.ho21:hoCA.Ode11.mode	@ltx/gr_gr_cog/ho.ho21:hoCA.Ode11.mode
ltx/gr_redirects_goarch/ho.ho21:hoCA.Ode11.ode	@ltx/gr_gr_cog/ho.ho21:hoCA.Ode11.ode
ltx/gr_redirects_goarch/ho.ho21:hoCA.Ode11.text	@ltx/gr_gr_cog/ho.ho21:hoCA.Ode11.text
ltx/gr_redirects_goarch/ho.ho21:hoCA.Ode12.incipit	@ltx/gr_gr_cog/ho.ho21:hoCA.Ode12.incipit
ltx/gr_redirects_goarch/ho.ho21:hoCA.Ode12.melody	@ltx/gr_gr_cog/ho.ho21:hoCA.Ode12.melody
ltx/gr_redirects_goarch/ho.ho21:hoCA.Ode12.mode	@ltx/gr_gr_cog/ho.ho21:hoCA.Ode12.mode
ltx/gr_redirects_goarch/ho.ho21:hoCA.Ode12.ode	@ltx/gr_gr_cog/ho.ho21:hoCA.Ode12.ode
ltx/gr_redirects_goarch/ho.ho21:hoCA.Ode12.text	@ltx/gr_gr_cog/ho.ho21:hoCA.Ode12.text
ltx/gr_redirects_goarch/ho.ho21:hoCA.Ode1T.incipit	@ltx/gr_gr_cog/ho.ho21:hoCA.Ode1T.incipit
ltx/gr_redirects_goarch/ho.ho21:hoCA.Ode1T.melody	@ltx/gr_gr_cog/ho.ho21:hoCA.Ode1T.melody
ltx/gr_redirects_goarch/ho.ho21:hoCA.Ode1T.mode	@ltx/gr_gr_cog/ho.ho21:hoCA.Ode1T.mode
ltx/gr_redirects_goarch/ho.ho21:hoCA.Ode1T.ode	@ltx/gr_gr_cog/ho.ho21:hoCA.Ode1T.ode
ltx/gr_redirects_goarch/ho.ho21:hoCA.Ode1T.text	@ltx/gr_gr_cog/ho.ho21:hoCA.Ode1T.text
ltx/gr_redirects_goarch/ho.ho21:hoCA.Ode31.greekmelody	@ltx/gr_gr_cog/ho.ho21:hoCA.Ode31.greekmelody
ltx/gr_redirects_goarch/ho.ho21:hoCA.Ode31.incipit	@ltx/gr_gr_cog/ho.ho21:hoCA.Ode31.incipit
ltx/gr_redirects_goarch/ho.ho21:hoCA.Ode31.melody	@ltx/gr_gr_cog/ho.ho21:hoCA.Ode31.melody
ltx/gr_redirects_goarch/ho.ho21:hoCA.Ode31.mode	@ltx/gr_gr_cog/ho.ho21:hoCA.Ode31.mode
ltx/gr_redirects_goarch/ho.ho21:hoCA.Ode31.ode	@ltx/gr_gr_cog/ho.ho21:hoCA.Ode31.ode
ltx/gr_redirects_goarch/ho.ho21:hoCA.Ode31.text	@ltx/gr_gr_cog/ho.ho21:hoCA.Ode31.text
ltx/gr_redirects_goarch/ho.ho21:hoCA.Ode32.incipit	@ltx/gr_gr_cog/ho.ho21:hoCA.Ode32.incipit
ltx/gr_redirects_goarch/ho.ho21:hoCA.Ode32.melody	@ltx/gr_gr_cog/ho.ho21:hoCA.Ode32.melody
ltx/gr_redirects_goarch/ho.ho21:hoCA.Ode32.mode	@ltx/gr_gr_cog/ho.ho21:hoCA.Ode32.mode
ltx/gr_redirects_goarch/ho.ho21:hoCA.Ode32.ode	@ltx/gr_gr_cog/ho.ho21:hoCA.Ode32.ode
ltx/gr_redirects_goarch/ho.ho21:hoCA.Ode32.text	@ltx/gr_gr_cog/ho.ho21:hoCA.Ode32.text
ltx/gr_redirects_goarch/ho.ho21:hoCA.Ode3T.incipit	@ltx/gr_gr_cog/ho.ho21:hoCA.Ode3T.incipit
ltx/gr_redirects_goarch/ho.ho21:hoCA.Ode3T.melody	@ltx/gr_gr_cog/ho.ho21:hoCA.Ode3T.melody
ltx/gr_redirects_goarch/ho.ho21:hoCA.Ode3T.mode	@ltx/gr_gr_cog/ho.ho21:hoCA.Ode3T.mode
ltx/gr_redirects_goarch/ho.ho21:hoCA.Ode3T.ode	@ltx/gr_gr_cog/ho.ho21:hoCA.Ode3T.ode
ltx/gr_redirects_goarch/ho.ho21:hoCA.Ode3T.text	@ltx/gr_gr_cog/ho.ho21:hoCA.Ode3T.text
ltx/gr_redirects_goarch/ho.ho21:hoCA.Ode41.greekmelody	@ltx/gr_gr_cog/ho.ho21:hoCA.Ode41.greekmelody
ltx/gr_redirects_goarch/ho.ho21:hoCA.Ode41.incipit	@ltx/gr_gr_cog/ho.ho21:hoCA.Ode41.incipit
ltx/gr_redirects_goarch/ho.ho21:hoCA.Ode41.melody	@ltx/gr_gr_cog/ho.ho21:hoCA.Ode41.melody
ltx/gr_redirects_goarch/ho.ho21:hoCA.Ode41.mode	@ltx/gr_gr_cog/ho.ho21:hoCA.Ode41.mode
ltx/gr_redirects_goarch/ho.ho21:hoCA.Ode41.ode	@ltx/gr_gr_cog/ho.ho21:hoCA.Ode41.ode
ltx/gr_redirects_goarch/ho.ho21:hoCA.Ode41.text	@ltx/gr_gr_cog/ho.ho21:hoCA.Ode41.text
ltx/gr_redirects_goarch/ho.ho21:hoCA.Ode42.incipit	@ltx/gr_gr_cog/ho.ho21:hoCA.Ode42.incipit
ltx/gr_redirects_goarch/ho.ho21:hoCA.Ode42.melody	@ltx/gr_gr_cog/ho.ho21:hoCA.Ode42.melody
ltx/gr_redirects_goarch/ho.ho21:hoCA.Ode42.mode	@ltx/gr_gr_cog/ho.ho21:hoCA.Ode42.mode
ltx/gr_redirects_goarch/ho.ho21:hoCA.Ode42.ode	@ltx/gr_gr_cog/ho.ho21:hoCA.Ode42.ode
ltx/gr_redirects_goarch/ho.ho21:hoCA.Ode42.text	@ltx/gr_gr_cog/ho.ho21:hoCA.Ode42.text
ltx/gr_redirects_goarch/ho.ho21:hoCA.Ode4T.incipit	@ltx/gr_gr_cog/ho.ho21:hoCA.Ode4T.incipit
ltx/gr_redirects_goarch/ho.ho21:hoCA.Ode4T.melody	@ltx/gr_gr_cog/ho.ho21:hoCA.Ode4T.melody
ltx/gr_redirects_goarch/ho.ho21:hoCA.Ode4T.mode	@ltx/gr_gr_cog/ho.ho21:hoCA.Ode4T.mode
ltx/gr_redirects_goarch/ho.ho21:hoCA.Ode4T.ode	@ltx/gr_gr_cog/ho.ho21:hoCA.Ode4T.ode
ltx/gr_redirects_goarch/ho.ho21:hoCA.Ode4T.text	@ltx/gr_gr_cog/ho.ho21:hoCA.Ode4T.text
ltx/gr_redirects_goarch/ho.ho21:hoCA.Ode51.greekmelody	@ltx/gr_gr_cog/ho.ho21:hoCA.Ode51.greekmelody
ltx/gr_redirects_goarch/ho.ho21:hoCA.Ode51.incipit	@ltx/gr_gr_cog/ho.ho21:hoCA.Ode51.incipit
ltx/gr_redirects_goarch/ho.ho21:hoCA.Ode51.melody	@ltx/gr_gr_cog/ho.ho21:hoCA.Ode51.melody
ltx/gr_redirects_goarch/ho.ho21:hoCA.Ode51.mode	@ltx/gr_gr_cog/ho.ho21:hoCA.Ode51.mode
ltx/gr_redirects_goarch/ho.ho21:hoCA.Ode51.ode	@ltx/gr_gr_cog/ho.ho21:hoCA.Ode51.ode
ltx/gr_redirects_goarch/ho.ho21:hoCA.Ode51.text	@ltx/gr_gr_cog/ho.ho21:hoCA.Ode51.text
ltx/gr_redirects_goarch/ho.ho21:hoCA.Ode52.incipit	@ltx/gr_gr_cog/ho.ho21:hoCA.Ode52.incipit
ltx/gr_redirects_goarch/ho.ho21:hoCA.Ode52.melody	@ltx/gr_gr_cog/ho.ho21:hoCA.Ode52.melody
ltx/gr_redirects_goarch/ho.ho21:hoCA.Ode52.mode	@ltx/gr_gr_cog/ho.ho21:hoCA.Ode52.mode
ltx/gr_redirects_goarch/ho.ho21:hoCA.Ode52.ode	@ltx/gr_gr_cog/ho.ho21:hoCA.Ode52.ode
ltx/gr_redirects_goarch/ho.ho21:hoCA.Ode52.text	@ltx/gr_gr_cog/ho.ho21:hoCA.Ode52.text
ltx/gr_redirects_goarch/ho.ho21:hoCA.Ode5T.incipit	@ltx/gr_gr_cog/ho.ho21:hoCA.Ode5T.incipit
ltx/gr_redirects_goarch/ho.ho21:hoCA.Ode5T.melody	@ltx/gr_gr_cog/ho.ho21:hoCA.Ode5T.melody
ltx/gr_redirects_goarch/ho.ho21:hoCA.Ode5T.mode	@ltx/gr_gr_cog/ho.ho21:hoCA.Ode5T.mode
ltx/gr_redirects_goarch/ho.ho21:hoCA.Ode5T.ode	@ltx/gr_gr_cog/ho.ho21:hoCA.Ode5T.ode
ltx/gr_redirects_goarch/ho.ho21:hoCA.Ode5T.text	@ltx/gr_gr_cog/ho.ho21:hoCA.Ode5T.text
ltx/gr_redirects_goarch/ho.ho21:hoCA.Ode61.greekmelody	@ltx/gr_gr_cog/ho.ho21:hoCA.Ode61.greekmelody
ltx/gr_redirects_goarch/ho.ho21:hoCA.Ode61.incipit	@ltx/gr_gr_cog/ho.ho21:hoCA.Ode61.incipit
ltx/gr_redirects_goarch/ho.ho21:hoCA.Ode61.melody	@ltx/gr_gr_cog/ho.ho21:hoCA.Ode61.melody
ltx/gr_redirects_goarch/ho.ho21:hoCA.Ode61.mode	@ltx/gr_gr_cog/ho.ho21:hoCA.Ode61.mode
ltx/gr_redirects_goarch/ho.ho21:hoCA.Ode61.ode	@ltx/gr_gr_cog/ho.ho21:hoCA.Ode61.ode
ltx/gr_redirects_goarch/ho.ho21:hoCA.Ode61.text	@ltx/gr_gr_cog/ho.ho21:hoCA.Ode61.text
ltx/gr_redirects_goarch/ho.ho21:hoCA.Ode62.incipit	@ltx/gr_gr_cog/ho.ho21:hoCA.Ode62.incipit
ltx/gr_redirects_goarch/ho.ho21:hoCA.Ode62.melody	@ltx/gr_gr_cog/ho.ho21:hoCA.Ode62.melody
ltx/gr_redirects_goarch/ho.ho21:hoCA.Ode62.mode	@ltx/gr_gr_cog/ho.ho21:hoCA.Ode62.mode
ltx/gr_redirects_goarch/ho.ho21:hoCA.Ode62.ode	@ltx/gr_gr_cog/ho.ho21:hoCA.Ode62.ode
ltx/gr_redirects_goarch/ho.ho21:hoCA.Ode62.text	@ltx/gr_gr_cog/ho.ho21:hoCA.Ode62.text
ltx/gr_redirects_goarch/ho.ho21:hoCA.Ode6T.incipit	@ltx/gr_gr_cog/ho.ho21:hoCA.Ode6T.incipit
ltx/gr_redirects_goarch/ho.ho21:hoCA.Ode6T.melody	@ltx/gr_gr_cog/ho.ho21:hoCA.Ode6T.melody
ltx/gr_redirects_goarch/ho.ho21:hoCA.Ode6T.mode	@ltx/gr_gr_cog/ho.ho21:hoCA.Ode6T.mode
ltx/gr_redirects_goarch/ho.ho21:hoCA.Ode6T.ode	@ltx/gr_gr_cog/ho.ho21:hoCA.Ode6T.ode
ltx/gr_redirects_goarch/ho.ho21:hoCA.Ode6T.text	@ltx/gr_gr_cog/ho.ho21:hoCA.Ode6T.text
ltx/gr_redirects_goarch/ho.ho21:hoCA.Ode71.greekmelody	@ltx/gr_gr_cog/ho.ho21:hoCA.Ode71.greekmelody
ltx/gr_redirects_goarch/ho.ho21:hoCA.Ode71.incipit	@ltx/gr_gr_cog/ho.ho21:hoCA.Ode71.incipit
ltx/gr_redirects_goarch/ho.ho21:hoCA.Ode71.melody	@ltx/gr_gr_cog/ho.ho21:hoCA.Ode71.melody
ltx/gr_redirects_goarch/ho.ho21:hoCA.Ode71.mode	@ltx/gr_gr_cog/ho.ho21:hoCA.Ode71.mode
ltx/gr_redirects_goarch/ho.ho21:hoCA.Ode71.ode	@ltx/gr_gr_cog/ho.ho21:hoCA.Ode71.ode
ltx/gr_redirects_goarch/ho.ho21:hoCA.Ode71.text	@ltx/gr_gr_cog/ho.ho21:hoCA.Ode71.text
ltx/gr_redirects_goarch/ho.ho21:hoCA.Ode72.incipit	@ltx/gr_gr_cog/ho.ho21:hoCA.Ode72.incipit
ltx/gr_redirects_goarch/ho.ho21:hoCA.Ode72.melody	@ltx/gr_gr_cog/ho.ho21:hoCA.Ode72.melody
ltx/gr_redirects_goarch/ho.ho21:hoCA.Ode72.mode	@ltx/gr_gr_cog/ho.ho21:hoCA.Ode72.mode
ltx/gr_redirects_goarch/ho.ho21:hoCA.Ode72.ode	@ltx/gr_gr_cog/ho.ho21:hoCA.Ode72.ode
ltx/gr_redirects_goarch/ho.ho21:hoCA.Ode72.text	@ltx/gr_gr_cog/ho.ho21:hoCA.Ode72.text
ltx/gr_redirects_goarch/ho.ho21:hoCA.Ode7T.incipit	@ltx/gr_gr_cog/ho.ho21:hoCA.Ode7T.incipit
ltx/gr_redirects_goarch/ho.ho21:hoCA.Ode7T.melody	@ltx/gr_gr_cog/ho.ho21:hoCA.Ode7T.melody
ltx/gr_redirects_goarch/ho.ho21:hoCA.Ode7T.mode	@ltx/gr_gr_cog/ho.ho21:hoCA.Ode7T.mode
ltx/gr_redirects_goarch/ho.ho21:hoCA.Ode7T.ode	@ltx/gr_gr_cog/ho.ho21:hoCA.Ode7T.ode
ltx/gr_redirects_goarch/ho.ho21:hoCA.Ode7T.text	@ltx/gr_gr_cog/ho.ho21:hoCA.Ode7T.text
ltx/gr_redirects_goarch/ho.ho21:hoCA.Ode81.greekmelody	@ltx/gr_gr_cog/ho.ho21:hoCA.Ode81.greekmelody
ltx/gr_redirects_goarch/ho.ho21:hoCA.Ode81.incipit	@ltx/gr_gr_cog/ho.ho21:hoCA.Ode81.incipit
ltx/gr_redirects_goarch/ho.ho21:hoCA.Ode81.melody	@ltx/gr_gr_cog/ho.ho21:hoCA.Ode81.melody
ltx/gr_redirects_goarch/ho.ho21:hoCA.Ode81.mode	@ltx/gr_gr_cog/ho.ho21:hoCA.Ode81.mode
ltx/gr_redirects_goarch/ho.ho21:hoCA.Ode81.ode	@ltx/gr_gr_cog/ho.ho21:hoCA.Ode81.ode
ltx/gr_redirects_goarch/ho.ho21:hoCA.Ode81.text	@ltx/gr_gr_cog/ho.ho21:hoCA.Ode81.text
ltx/gr_redirects_goarch/ho.ho21:hoCA.Ode82.incipit	@ltx/gr_gr_cog/ho.ho21:hoCA.Ode82.incipit
ltx/gr_redirects_goarch/ho.ho21:hoCA.Ode82.melody	@ltx/gr_gr_cog/ho.ho21:hoCA.Ode82.melody
ltx/gr_redirects_goarch/ho.ho21:hoCA.Ode82.mode	@ltx/gr_gr_cog/ho.ho21:hoCA.Ode82.mode
ltx/gr_redirects_goarch/ho.ho21:hoCA.Ode82.ode	@ltx/gr_gr_cog/ho.ho21:hoCA.Ode82.ode
ltx/gr_redirects_goarch/ho.ho21:hoCA.Ode82.text	@ltx/gr_gr_cog/ho.ho21:hoCA.Ode82.text
ltx/gr_redirects_goarch/ho.ho21:hoCA.Ode8T.incipit	@ltx/gr_gr_cog/ho.ho21:hoCA.Ode8T.incipit
ltx/gr_redirects_goarch/ho.ho21:hoCA.Ode8T.melody	@ltx/gr_gr_cog/ho.ho21:hoCA.Ode8T.melody
ltx/gr_redirects_goarch/ho.ho21:hoCA.Ode8T.mode	@ltx/gr_gr_cog/ho.ho21:hoCA.Ode8T.mode
ltx/gr_redirects_goarch/ho.ho21:hoCA.Ode8T.ode	@ltx/gr_gr_cog/ho.ho21:hoCA.Ode8T.ode
ltx/gr_redirects_goarch/ho.ho21:hoCA.Ode8T.text	@ltx/gr_gr_cog/ho.ho21:hoCA.Ode8T.text
ltx/gr_redirects_goarch/ho.ho21:hoCA.Ode91.greekmelody	@ltx/gr_gr_cog/ho.ho21:hoCA.Ode91.greekmelody
ltx/gr_redirects_goarch/ho.ho21:hoCA.Ode91.incipit	@ltx/gr_gr_cog/ho.ho21:hoCA.Ode91.incipit
ltx/gr_redirects_goarch/ho.ho21:hoCA.Ode91.melody	@ltx/gr_gr_cog/ho.ho21:hoCA.Ode91.melody
ltx/gr_redirects_goarch/ho.ho21:hoCA.Ode91.mode	@ltx/gr_gr_cog/ho.ho21:hoCA.Ode91.mode
ltx/gr_redirects_goarch/ho.ho21:hoCA.Ode91.ode	@ltx/gr_gr_cog/ho.ho21:hoCA.Ode91.ode
ltx/gr_redirects_goarch/ho.ho21:hoCA.Ode91.text	@ltx/gr_gr_cog/ho.ho21:hoCA.Ode91.text
ltx/gr_redirects_goarch/ho.ho21:hoCA.Ode92.incipit	@ltx/gr_gr_cog/ho.ho21:hoCA.Ode92.incipit
ltx/gr_redirects_goarch/ho.ho21:hoCA.Ode92.melody	@ltx/gr_gr_cog/ho.ho21:hoCA.Ode92.melody
ltx/gr_redirects_goarch/ho.ho21:hoCA.Ode92.mode	@ltx/gr_gr_cog/ho.ho21:hoCA.Ode92.mode
ltx/gr_redirects_goarch/ho.ho21:hoCA.Ode92.ode	@ltx/gr_gr_cog/ho.ho21:hoCA.Ode92.ode
ltx/gr_redirects_goarch/ho.ho21:hoCA.Ode92.text	@ltx/gr_gr_cog/ho.ho21:hoCA.Ode92.text
ltx/gr_redirects_goarch/ho.ho21:hoCA.Ode93.incipit	@ltx/gr_gr_cog/ho.ho21:hoCA.Ode93.incipit
ltx/gr_redirects_goarch/ho.ho21:hoCA.Ode93.melody	@ltx/gr_gr_cog/ho.ho21:hoCA.Ode93.melody
ltx/gr_redirects_goarch/ho.ho21:hoCA.Ode93.mode	@ltx/gr_gr_cog/ho.ho21:hoCA.Ode93.mode
ltx/gr_redirects_goarch/ho.ho21:hoCA.Ode93.ode	@ltx/gr_gr_cog/ho.ho21:hoCA.Ode93.ode
ltx/gr_redirects_goarch/ho.ho21:hoCA.Ode93.text	@ltx/gr_gr_cog/ho.ho21:hoCA.Ode93.text
ltx/gr_redirects_goarch/ho.ho21:hoCA.Ode9T.incipit	@ltx/gr_gr_cog/ho.ho21:hoCA.Ode9T.incipit
ltx/gr_redirects_goarch/ho.ho21:hoCA.Ode9T.melody	@ltx/gr_gr_cog/ho.ho21:hoCA.Ode9T.melody
ltx/gr_redirects_goarch/ho.ho21:hoCA.Ode9T.mode	@ltx/gr_gr_cog/ho.ho21:hoCA.Ode9T.mode
ltx/gr_redirects_goarch/ho.ho21:hoCA.Ode9T.ode	@ltx/gr_gr_cog/ho.ho21:hoCA.Ode9T.ode
ltx/gr_redirects_goarch/ho.ho21:hoCA.Ode9T.text	@ltx/gr_gr_cog/ho.ho21:hoCA.Ode9T.text
ltx/gr_redirects_goarch/ho.ho21:hoCA.media.text	@ltx/gr_gr_cog/ho.ho21:hoCA.media.text
ltx/gr_redirects_goarch/ho.ho21:hoCA.poet	@ltx/gr_gr_cog/ho.ho21:hoCA.poet
ltx/gr_redirects_goarch/ho.ho21:hoCA.title	@ltx/gr_gr_cog/ho.ho21:hoCA.title
ltx/gr_redirects_goarch/ho.ho21:hoPrayer.Key000.title	@ltx/gr_gr_cog/ho.ho21:hoPrayer.Key000.title
ltx/gr_redirects_goarch/ho.ho21:hoPrayer.Key001.incipit	@ltx/gr_gr_cog/ho.ho21:hoPrayer.Key001.incipit
ltx/gr_redirects_goarch/ho.ho21:hoPrayer.Key001.text	@ltx/gr_gr_cog/ho.ho21:hoPrayer.Key001.text
ltx/gr_redirects_goarch/ho.ho21:hoPrayer.Key001.title	@ltx/gr_gr_cog/ho.ho21:hoPrayer.Key001.title
ltx/gr_redirects_goarch/ho.ho21:hoPrayer.Key002.incipit	@ltx/gr_gr_cog/ho.ho21:hoPrayer.Key002.incipit
ltx/gr_redirects_goarch/ho.ho21:hoPrayer.Key002.text	@ltx/gr_gr_cog/ho.ho21:hoPrayer.Key002.text
ltx/gr_redirects_goarch/ho.ho21:hoPrayer.Key003.incipit	@ltx/gr_gr_cog/ho.ho21:hoPrayer.Key003.incipit
ltx/gr_redirects_goarch/ho.ho21:hoPrayer.Key003.text	@ltx/gr_gr_cog/ho.ho21:hoPrayer.Key003.text
ltx/gr_redirects_goarch/ho.ho21:hoPrayer.Key004.incipit	@ltx/gr_gr_cog/ho.ho21:hoPrayer.Key004.incipit
ltx/gr_redirects_goarch/ho.ho21:hoPrayer.Key004.text	@ltx/gr_gr_cog/ho.ho21:hoPrayer.Key004.text
ltx/gr_redirects_goarch/ho.ho21:hoPrayer.Key004.title	@ltx/gr_gr_cog/ho.ho21:hoPrayer.Key004.title
ltx/gr_redirects_goarch/ho.ho21:hoPrayer.Key005.poet	@ltx/gr_gr_cog/ho.ho21:hoPrayer.Key005.poet
ltx/gr_redirects_goarch/ho.ho21:hoPrayer.Key005.text	@ltx/gr_gr_cog/ho.ho21:hoPrayer.Key005.text
ltx/gr_redirects_goarch/ho.ho21:hoPrayer.Key005.title	@ltx/gr_gr_cog/ho.ho21:hoPrayer.Key005.title
ltx/gr_redirects_goarch/ho.ho21:hoPrayer.Key005.title2	@ltx/gr_gr_cog/ho.ho21:hoPrayer.Key005.title2
ltx/gr_redirects_goarch/ho.ho21:hoPrayer.Key005_1.text	@ltx/gr_gr_cog/ho.ho21:hoPrayer.Key005_1.text
ltx/gr_redirects_goarch/ho.ho21:hoPrayer.Key005_2.text	@ltx/gr_gr_cog/ho.ho21:hoPrayer.Key005_2.text
ltx/gr_redirects_goarch/ho.ho21:hoPrayer.Key005_3.text	@ltx/gr_gr_cog/ho.ho21:hoPrayer.Key005_3.text
ltx/gr_redirects_goarch/ho.ho21:hoPrayer.Key005_4.text	@ltx/gr_gr_cog/ho.ho21:hoPrayer.Key005_4.text
ltx/gr_redirects_goarch/ho.ho21:hoPrayer.Key005_5.text	@ltx/gr_gr_cog/ho.ho21:hoPrayer.Key005_5.text
ltx/gr_redirects_goarch/ho.ho21:hoPrayer.Key006.text	@ltx/gr_gr_cog/ho.ho21:hoPrayer.Key006.text
ltx/gr_redirects_goarch/ho.ho21:hoPrayer.Key006.title	@ltx/gr_gr_cog/ho.ho21:hoPrayer.Key006.title
ltx/gr_redirects_goarch/ho.ho21:hoPrayer.Key006_1.text	@ltx/gr_gr_cog/ho.ho21:hoPrayer.Key006_1.text
ltx/gr_redirects_goarch/ho.ho21:hoPrayer.Key006_2.text	@ltx/gr_gr_cog/ho.ho21:hoPrayer.Key006_2.text
ltx/gr_redirects_goarch/ho.ho21:hoPrayer.Key006_3.text	@ltx/gr_gr_cog/ho.ho21:hoPrayer.Key006_3.text
ltx/gr_redirects_goarch/ho.ho21:hoPrayer.Key011.poet	@ltx/gr_gr_cog/ho.ho21:hoPrayer.Key011.poet
ltx/gr_redirects_goarch/ho.ho21:hoPrayer.Key011.text	@ltx/gr_gr_cog/ho.ho21:hoPrayer.Key011.text
ltx/gr_redirects_goarch/ho.ho21:hoPrayer.Key011.title	@ltx/gr_gr_cog/ho.ho21:hoPrayer.Key011.title
ltx/gr_redirects_goarch/ho.ho21:hoPrayer.Key021.poet	@ltx/gr_gr_cog/ho.ho21:hoPrayer.Key021.poet
ltx/gr_redirects_goarch/ho.ho21:hoPrayer.Key021.text	@ltx/gr_gr_cog/ho.ho21:hoPrayer.Key021.text
ltx/gr_redirects_goarch/ho.ho21:hoPrayer.Key021.title	@ltx/gr_gr_cog/ho.ho21:hoPrayer.Key021.title
ltx/gr_redirects_goarch/ho.ho21:hoPrayer.Key031.poet	@ltx/gr_gr_cog/ho.ho21:hoPrayer.Key031.poet
ltx/gr_redirects_goarch/ho.ho21:hoPrayer.Key031.text	@ltx/gr_gr_cog/ho.ho21:hoPrayer.Key031.text
ltx/gr_redirects_goarch/ho.ho21:hoPrayer.Key031.title	@ltx/gr_gr_cog/ho.ho21:hoPrayer.Key031.title
ltx/gr_redirects_goarch/ho.ho21:hoPrayer.Key041.poet	@ltx/gr_gr_cog/ho.ho21:hoPrayer.Key041.poet
ltx/gr_redirects_goarch/ho.ho21:hoPrayer.Key041.text	@ltx/gr_gr_cog/ho.ho21:hoPrayer.Key041.text
ltx/gr_redirects_goarch/ho.ho21:hoPrayer.Key041.title	@ltx/gr_gr_cog/ho.ho21:hoPrayer.Key041.title
ltx/gr_redirects_goarch/ho.ho21:hoPrayer.Key051.poet	@ltx/gr_gr_cog/ho.ho21:hoPrayer.Key051.poet
ltx/gr_redirects_goarch/ho.ho21:hoPrayer.Key051.text	@ltx/gr_gr_cog/ho.ho21:hoPrayer.Key051.text
ltx/gr_redirects_goarch/ho.ho21:hoPrayer.Key051.title	@ltx/gr_gr_cog/ho.ho21:hoPrayer.Key051.title
ltx/gr_redirects_goarch/ho.ho21:hoPrayer.Key061.poet	@ltx/gr_gr_cog/ho.ho21:hoPrayer.Key061.poet
ltx/gr_redirects_goarch/ho.ho21:hoPrayer.Key061.text	@ltx/gr_gr_cog/ho.ho21:hoPrayer.Key061.text
ltx/gr_redirects_goarch/ho.ho21:hoPrayer.Key061.title	@ltx/gr_gr_cog/ho.ho21:hoPrayer.Key061.title
ltx/gr_redirects_goarch/ho.ho21:hoPrayer.Key071.poet	@ltx/gr_gr_cog/ho.ho21:hoPrayer.Key071.poet
ltx/gr_redirects_goarch/ho.ho21:hoPrayer.Key071.text	@ltx/gr_gr_cog/ho.ho21:hoPrayer.Key071.text
ltx/gr_redirects_goarch/ho.ho21:hoPrayer.Key071.title	@ltx/gr_gr_cog/ho.ho21:hoPrayer.Key071.title
ltx/gr_redirects_goarch/ho.ho21:hoPrayer.Key071_001.text	@ltx/gr_gr_cog/ho.ho21:hoPrayer.Key071_001.text
ltx/gr_redirects_goarch/ho.ho21:hoPrayer.Key071_002.text	@ltx/gr_gr_cog/ho.ho21:hoPrayer.Key071_002.text
ltx/gr_redirects_goarch/ho.ho21:hoPrayer.Key071_003.text	@ltx/gr_gr_cog/ho.ho21:hoPrayer.Key071_003.text
ltx/gr_redirects_goarch/ho.ho21:hoPrayer.Key071_004.text	@ltx/gr_gr_cog/ho.ho21:hoPrayer.Key071_004.text
ltx/gr_redirects_goarch/ho.ho21:hoPrayer.Key071_005.text	@ltx/gr_gr_cog/ho.ho21:hoPrayer.Key071_005.text
ltx/gr_redirects_goarch/ho.ho21:hoPrayer.Key071_006.text	@ltx/gr_gr_cog/ho.ho21:hoPrayer.Key071_006.text
ltx/gr_redirects_goarch/ho.ho21:hoPrayer.Key071_007.text	@ltx/gr_gr_cog/ho.ho21:hoPrayer.Key071_007.text
ltx/gr_redirects_goarch/ho.ho21:hoPrayer.Key071_008.text	@ltx/gr_gr_cog/ho.ho21:hoPrayer.Key071_008.text
ltx/gr_redirects_goarch/ho.ho21:hoPrayer.Key071_009.text	@ltx/gr_gr_cog/ho.ho21:hoPrayer.Key071_009.text
ltx/gr_redirects_goarch/ho.ho21:hoPrayer.Key071_010.text	@ltx/gr_gr_cog/ho.ho21:hoPrayer.Key071_010.text
ltx/gr_redirects_goarch/ho.ho21:hoPrayer.Key071_011.text	@ltx/gr_gr_cog/ho.ho21:hoPrayer.Key071_011.text
ltx/gr_redirects_goarch/ho.ho21:hoPrayer.Key071_012.text	@ltx/gr_gr_cog/ho.ho21:hoPrayer.Key071_012.text
ltx/gr_redirects_goarch/ho.ho21:hoPrayer.Key071_013.text	@ltx/gr_gr_cog/ho.ho21:hoPrayer.Key071_013.text
ltx/gr_redirects_goarch/ho.ho21:hoPrayer.Key071_014.text	@ltx/gr_gr_cog/ho.ho21:hoPrayer.Key071_014.text
ltx/gr_redirects_goarch/ho.ho21:hoPrayer.Key071_015.text	@ltx/gr_gr_cog/ho.ho21:hoPrayer.Key071_015.text
ltx/gr_redirects_goarch/ho.ho21:hoPrayer.Key071_016.text	@ltx/gr_gr_cog/ho.ho21:hoPrayer.Key071_016.text
ltx/gr_redirects_goarch/ho.ho21:hoPrayer.Key071_017.text	@ltx/gr_gr_cog/ho.ho21:hoPrayer.Key071_017.text
ltx/gr_redirects_goarch/ho.ho21:hoPrayer.Key071_018.text	@ltx/gr_gr_cog/ho.ho21:hoPrayer.Key071_018.text
ltx/gr_redirects_goarch/ho.ho21:hoPrayer.Key071_019.text	@ltx/gr_gr_cog/ho.ho21:hoPrayer.Key071_019.text
ltx/gr_redirects_goarch/ho.ho21:hoPrayer.Key071_020.text	@ltx/gr_gr_cog/ho.ho21:hoPrayer.Key071_020.text
ltx/gr_redirects_goarch/ho.ho21:hoPrayer.Key071_021.text	@ltx/gr_gr_cog/ho.ho21:hoPrayer.Key071_021.text
ltx/gr_redirects_goarch/ho.ho21:hoPrayer.Key071_022.text	@ltx/gr_gr_cog/ho.ho21:hoPrayer.Key071_022.text
ltx/gr_redirects_goarch/ho.ho21:hoPrayer.Key071_023.text	@ltx/gr_gr_cog/ho.ho21:hoPrayer.Key071_023.text
ltx/gr_redirects_goarch/ho.ho21:hoPrayer.Key071_024.text	@ltx/gr_gr_cog/ho.ho21:hoPrayer.Key071_024.text
ltx/gr_redirects_goarch/ho.ho21:hoPrayer.Key071_025.text	@ltx/gr_gr_cog/ho.ho21:hoPrayer.Key071_025.text
ltx/gr_redirects_goarch/ho.ho21:hoPrayer.Key071_026.text	@ltx/gr_gr_cog/ho.ho21:hoPrayer.Key071_026.text
ltx/gr_redirects_goarch/ho.ho21:hoPrayer.Key071_027.text	@ltx/gr_gr_cog/ho.ho21:hoPrayer.Key071_027.text
ltx/gr_redirects_goarch/ho.ho21:hoPrayer.Key071_028.text	@ltx/gr_gr_cog/ho.ho21:hoPrayer.Key071_028.text
ltx/gr_redirects_goarch/ho.ho21:hoPrayer.Key071_029.text	@ltx/gr_gr_cog/ho.ho21:hoPrayer.Key071_029.text
ltx/gr_redirects_goarch/ho.ho21:hoPrayer.Key071_030.text	@ltx/gr_gr_cog/ho.ho21:hoPrayer.Key071_030.text
ltx/gr_redirects_goarch/ho.ho21:hoPrayer.Key071_031.text	@ltx/gr_gr_cog/ho.ho21:hoPrayer.Key071_031.text
ltx/gr_redirects_goarch/ho.ho21:hoPrayer.Key071_032.text	@ltx/gr_gr_cog/ho.ho21:hoPrayer.Key071_032.text
ltx/gr_redirects_goarch/ho.ho21:hoPrayer.Key071_033.text	@ltx/gr_gr_cog/ho.ho21:hoPrayer.Key071_033.text
ltx/gr_redirects_goarch/ho.ho21:hoPrayer.Key071_034.text	@ltx/gr_gr_cog/ho.ho21:hoPrayer.Key071_034.text
ltx/gr_redirects_goarch/ho.ho21:hoPrayer.Key071_035.text	@ltx/gr_gr_cog/ho.ho21:hoPrayer.Key071_035.text
ltx/gr_redirects_goarch/ho.ho21:hoPrayer.Key071_036.text	@ltx/gr_gr_cog/ho.ho21:hoPrayer.Key071_036.text
ltx/gr_redirects_goarch/ho.ho21:hoPrayer.Key071_037.text	@ltx/gr_gr_cog/ho.ho21:hoPrayer.Key071_037.text
ltx/gr_redirects_goarch/ho.ho21:hoPrayer.Key071_038.text	@ltx/gr_gr_cog/ho.ho21:hoPrayer.Key071_038.text
ltx/gr_redirects_goarch/ho.ho21:hoPrayer.Key071_039.text	@ltx/gr_gr_cog/ho.ho21:hoPrayer.Key071_039.text
ltx/gr_redirects_goarch/ho.ho21:hoPrayer.Key071_040.text	@ltx/gr_gr_cog/ho.ho21:hoPrayer.Key071_040.text
ltx/gr_redirects_goarch/ho.ho21:hoPrayer.Key071_041.text	@ltx/gr_gr_cog/ho.ho21:hoPrayer.Key071_041.text
ltx/gr_redirects_goarch/ho.ho21:hoPrayer.Key071_042.text	@ltx/gr_gr_cog/ho.ho21:hoPrayer.Key071_042.text
ltx/gr_redirects_goarch/ho.ho21:hoPrayer.Key071_043.text	@ltx/gr_gr_cog/ho.ho21:hoPrayer.Key071_043.text
ltx/gr_redirects_goarch/ho.ho21:hoPrayer.Key071_044.text	@ltx/gr_gr_cog/ho.ho21:hoPrayer.Key071_044.text
ltx/gr_redirects_goarch/ho.ho21:hoPrayer.Key071_045.text	@ltx/gr_gr_cog/ho.ho21:hoPrayer.Key071_045.text
ltx/gr_redirects_goarch/ho.ho21:hoPrayer.Key071_046.text	@ltx/gr_gr_cog/ho.ho21:hoPrayer.Key071_046.text
ltx/gr_redirects_goarch/ho.ho21:hoPrayer.Key071_047.text	@ltx/gr_gr_cog/ho.ho21:hoPrayer.Key071_047.text
ltx/gr_redirects_goarch/ho.ho21:hoPrayer.Key071_048.text	@ltx/gr_gr_cog/ho.ho21:hoPrayer.Key071_048.text
ltx/gr_redirects_goarch/ho.ho21:hoPrayer.Key071_049.text	@ltx/gr_gr_cog/ho.ho21:hoPrayer.Key071_049.text
ltx/gr_redirects_goarch/ho.ho21:hoPrayer.Key071_050.text	@ltx/gr_gr_cog/ho.ho21:hoPrayer.Key071_050.text
ltx/gr_redirects_goarch/ho.ho21:hoPrayer.Key071_051.text	@ltx/gr_gr_cog/ho.ho21:hoPrayer.Key071_051.text
ltx/gr_redirects_goarch/ho.ho21:hoPrayer.Key071_052.text	@ltx/gr_gr_cog/ho.ho21:hoPrayer.Key071_052.text
ltx/gr_redirects_goarch/ho.ho21:hoPrayer.Key071_053.text	@ltx/gr_gr_cog/ho.ho21:hoPrayer.Key071_053.text
ltx/gr_redirects_goarch/ho.ho21:hoPrayer.Key071_054.text	@ltx/gr_gr_cog/ho.ho21:hoPrayer.Key071_054.text
ltx/gr_redirects_goarch/ho.ho21:hoPrayer.Key071_055.text	@ltx/gr_gr_cog/ho.ho21:hoPrayer.Key071_055.text
ltx/gr_redirects_goarch/ho.ho21:hoPrayer.Key071_056.text	@ltx/gr_gr_cog/ho.ho21:hoPrayer.Key071_056.text
ltx/gr_redirects_goarch/ho.ho21:hoPrayer.Key071_057.text	@ltx/gr_gr_cog/ho.ho21:hoPrayer.Key071_057.text
ltx/gr_redirects_goarch/ho.ho21:hoPrayer.Key071_058.text	@ltx/gr_gr_cog/ho.ho21:hoPrayer.Key071_058.text
ltx/gr_redirects_goarch/ho.ho21:hoPrayer.Key071_059.text	@ltx/gr_gr_cog/ho.ho21:hoPrayer.Key071_059.text
ltx/gr_redirects_goarch/ho.ho21:hoPrayer.Key071_060.text	@ltx/gr_gr_cog/ho.ho21:hoPrayer.Key071_060.text
ltx/gr_redirects_goarch/ho.ho21:hoPrayer.Key071_061.text	@ltx/gr_gr_cog/ho.ho21:hoPrayer.Key071_061.text
ltx/gr_redirects_goarch/ho.ho21:hoPrayer.Key071_062.text	@ltx/gr_gr_cog/ho.ho21:hoPrayer.Key071_062.text
ltx/gr_redirects_goarch/ho.ho21:hoPrayer.Key071_063.text	@ltx/gr_gr_cog/ho.ho21:hoPrayer.Key071_063.text
ltx/gr_redirects_goarch/ho.ho21:hoPrayer.Key071_064.text	@ltx/gr_gr_cog/ho.ho21:hoPrayer.Key071_064.text
ltx/gr_redirects_goarch/ho.ho21:hoPrayer.Key071_065.text	@ltx/gr_gr_cog/ho.ho21:hoPrayer.Key071_065.text
ltx/gr_redirects_goarch/ho.ho21:hoPrayer.Key071_066.text	@ltx/gr_gr_cog/ho.ho21:hoPrayer.Key071_066.text
ltx/gr_redirects_goarch/ho.ho21:hoPrayer.Key071_067.text	@ltx/gr_gr_cog/ho.ho21:hoPrayer.Key071_067.text
ltx/gr_redirects_goarch/ho.ho21:hoPrayer.Key071_068.text	@ltx/gr_gr_cog/ho.ho21:hoPrayer.Key071_068.text
ltx/gr_redirects_goarch/ho.ho21:hoPrayer.Key071_069.text	@ltx/gr_gr_cog/ho.ho21:hoPrayer.Key071_069.text
ltx/gr_redirects_goarch/ho.ho21:hoPrayer.Key071_070.text	@ltx/gr_gr_cog/ho.ho21:hoPrayer.Key071_070.text
ltx/gr_redirects_goarch/ho.ho21:hoPrayer.Key071_071.text	@ltx/gr_gr_cog/ho.ho21:hoPrayer.Key071_071.text
ltx/gr_redirects_goarch/ho.ho21:hoPrayer.Key071_072.text	@ltx/gr_gr_cog/ho.ho21:hoPrayer.Key071_072.text
ltx/gr_redirects_goarch/ho.ho21:hoPrayer.Key071_073.text	@ltx/gr_gr_cog/ho.ho21:hoPrayer.Key071_073.text
ltx/gr_redirects_goarch/ho.ho21:hoPrayer.Key071_074.text	@ltx/gr_gr_cog/ho.ho21:hoPrayer.Key071_074.text
ltx/gr_redirects_goarch/ho.ho21:hoPrayer.Key071_075.text	@ltx/gr_gr_cog/ho.ho21:hoPrayer.Key071_075.text
ltx/gr_redirects_goarch/ho.ho21:hoPrayer.Key071_076.text	@ltx/gr_gr_cog/ho.ho21:hoPrayer.Key071_076.text
ltx/gr_redirects_goarch/ho.ho21:hoPrayer.Key071_077.text	@ltx/gr_gr_cog/ho.ho21:hoPrayer.Key071_077.text
ltx/gr_redirects_goarch/ho.ho21:hoPrayer.Key071_078.text	@ltx/gr_gr_cog/ho.ho21:hoPrayer.Key071_078.text
ltx/gr_redirects_goarch/ho.ho21:hoPrayer.Key071_079.text	@ltx/gr_gr_cog/ho.ho21:hoPrayer.Key071_079.text
ltx/gr_redirects_goarch/ho.ho21:hoPrayer.Key071_080.text	@ltx/gr_gr_cog/ho.ho21:hoPrayer.Key071_080.text
ltx/gr_redirects_goarch/ho.ho21:hoPrayer.Key071_081.text	@ltx/gr_gr_cog/ho.ho21:hoPrayer.Key071_081.text
ltx/gr_redirects_goarch/ho.ho21:hoPrayer.Key071_082.text	@ltx/gr_gr_cog/ho.ho21:hoPrayer.Key071_082.text
ltx/gr_redirects_goarch/ho.ho21:hoPrayer.Key071_083.text	@ltx/gr_gr_cog/ho.ho21:hoPrayer.Key071_083.text
ltx/gr_redirects_goarch/ho.ho21:hoPrayer.Key071_084.text	@ltx/gr_gr_cog/ho.ho21:hoPrayer.Key071_084.text
ltx/gr_redirects_goarch/ho.ho21:hoPrayer.Key071_085.text	@ltx/gr_gr_cog/ho.ho21:hoPrayer.Key071_085.text
ltx/gr_redirects_goarch/ho.ho21:hoPrayer.Key071_086.text	@ltx/gr_gr_cog/ho.ho21:hoPrayer.Key071_086.text
ltx/gr_redirects_goarch/ho.ho21:hoPrayer.Key071_087.text	@ltx/gr_gr_cog/ho.ho21:hoPrayer.Key071_087.text
ltx/gr_redirects_goarch/ho.ho21:hoPrayer.Key071_088.text	@ltx/gr_gr_cog/ho.ho21:hoPrayer.Key071_088.text
ltx/gr_redirects_goarch/ho.ho21:hoPrayer.Key071_089.text	@ltx/gr_gr_cog/ho.ho21:hoPrayer.Key071_089.text
ltx/gr_redirects_goarch/ho.ho21:hoPrayer.Key071_090.text	@ltx/gr_gr_cog/ho.ho21:hoPrayer.Key071_090.text
ltx/gr_redirects_goarch/ho.ho21:hoPrayer.Key071_091.text	@ltx/gr_gr_cog/ho.ho21:hoPrayer.Key071_091.text
ltx/gr_redirects_goarch/ho.ho21:hoPrayer.Key071_092.text	@ltx/gr_gr_cog/ho.ho21:hoPrayer.Key071_092.text
ltx/gr_redirects_goarch/ho.ho21:hoPrayer.Key071_093.text	@ltx/gr_gr_cog/ho.ho21:hoPrayer.Key071_093.text
ltx/gr_redirects_goarch/ho.ho21:hoPrayer.Key071_094.text	@ltx/gr_gr_cog/ho.ho21:hoPrayer.Key071_094.text
ltx/gr_redirects_goarch/ho.ho21:hoPrayer.Key071_095.text	@ltx/gr_gr_cog/ho.ho21:hoPrayer.Key071_095.text
ltx/gr_redirects_goarch/ho.ho21:hoPrayer.Key071_096.text	@ltx/gr_gr_cog/ho.ho21:hoPrayer.Key071_096.text
ltx/gr_redirects_goarch/ho.ho21:hoPrayer.Key071_097.text	@ltx/gr_gr_cog/ho.ho21:hoPrayer.Key071_097.text
ltx/gr_redirects_goarch/ho.ho21:hoPrayer.Key071_098.text	@ltx/gr_gr_cog/ho.ho21:hoPrayer.Key071_098.text
ltx/gr_redirects_goarch/ho.ho21:hoPrayer.Key071_099.text	@ltx/gr_gr_cog/ho.ho21:hoPrayer.Key071_099.text
ltx/gr_redirects_goarch/ho.ho21:hoPrayer.Key071_100.text	@ltx/gr_gr_cog/ho.ho21:hoPrayer.Key071_100.text
ltx/gr_redirects_goarch/ho.ho21:hoPrayer.Key071_101.text	@ltx/gr_gr_cog/ho.ho21:hoPrayer.Key071_101.text
ltx/gr_redirects_goarch/ho.ho21:hoPrayer.Key071_102.text	@ltx/gr_gr_cog/ho.ho21:hoPrayer.Key071_102.text
ltx/gr_redirects_goarch/ho.ho21:hoPrayer.Key071_103.text	@ltx/gr_gr_cog/ho.ho21:hoPrayer.Key071_103.text
ltx/gr_redirects_goarch/ho.ho21:hoPrayer.Key071_104.text	@ltx/gr_gr_cog/ho.ho21:hoPrayer.Key071_104.text
ltx/gr_redirects_goarch/ho.ho21:hoPrayer.Key071_105.text	@ltx/gr_gr_cog/ho.ho21:hoPrayer.Key071_105.text
ltx/gr_redirects_goarch/ho.ho21:hoPrayer.Key071_106.text	@ltx/gr_gr_cog/ho.ho21:hoPrayer.Key071_106.text
ltx/gr_redirects_goarch/ho.ho21:hoPrayer.Key071_107.text	@ltx/gr_gr_cog/ho.ho21:hoPrayer.Key071_107.text
ltx/gr_redirects_goarch/ho.ho21:hoPrayer.Key071_108.text	@ltx/gr_gr_cog/ho.ho21:hoPrayer.Key071_108.text
ltx/gr_redirects_goarch/ho.ho21:hoPrayer.Key071_109.text	@ltx/gr_gr_cog/ho.ho21:hoPrayer.Key071_109.text
ltx/gr_redirects_goarch/ho.ho21:hoPrayer.Key071_110.text	@ltx/gr_gr_cog/ho.ho21:hoPrayer.Key071_110.text
ltx/gr_redirects_goarch/ho.ho21:hoPrayer.Key071_111.text	@ltx/gr_gr_cog/ho.ho21:hoPrayer.Key071_111.text
ltx/gr_redirects_goarch/ho.ho21:hoPrayer.Key071_112.text	@ltx/gr_gr_cog/ho.ho21:hoPrayer.Key071_112.text
ltx/gr_redirects_goarch/ho.ho21:hoPrayer.Key071_113.text	@ltx/gr_gr_cog/ho.ho21:hoPrayer.Key071_113.text
ltx/gr_redirects_goarch/ho.ho21:hoPrayer.Key071_114.text	@ltx/gr_gr_cog/ho.ho21:hoPrayer.Key071_114.text
ltx/gr_redirects_goarch/ho.ho21:hoPrayer.Key071_115.text	@ltx/gr_gr_cog/ho.ho21:hoPrayer.Key071_115.text
ltx/gr_redirects_goarch/ho.ho21:hoPrayer.Key071_116.text	@ltx/gr_gr_cog/ho.ho21:hoPrayer.Key071_116.text
ltx/gr_redirects_goarch/ho.ho21:hoPrayer.Key071_117.text	@ltx/gr_gr_cog/ho.ho21:hoPrayer.Key071_117.text
ltx/gr_redirects_goarch/ho.ho21:hoPrayer.Key071_118.text	@ltx/gr_gr_cog/ho.ho21:hoPrayer.Key071_118.text
ltx/gr_redirects_goarch/ho.ho21:hoPrayer.Key071_119.text	@ltx/gr_gr_cog/ho.ho21:hoPrayer.Key071_119.text
ltx/gr_redirects_goarch/ho.ho21:hoPrayer.Key071_120.text	@ltx/gr_gr_cog/ho.ho21:hoPrayer.Key071_120.text
ltx/gr_redirects_goarch/ho.ho21:hoPrayer.Key071_121.text	@ltx/gr_gr_cog/ho.ho21:hoPrayer.Key071_121.text
ltx/gr_redirects_goarch/ho.ho21:hoPrayer.Key071_122.text	@ltx/gr_gr_cog/ho.ho21:hoPrayer.Key071_122.text
ltx/gr_redirects_goarch/ho.ho21:hoPrayer.Key071_123.text	@ltx/gr_gr_cog/ho.ho21:hoPrayer.Key071_123.text
ltx/gr_redirects_goarch/ho.ho21:hoPrayer.Key071_124.text	@ltx/gr_gr_cog/ho.ho21:hoPrayer.Key071_124.text
ltx/gr_redirects_goarch/ho.ho21:hoPrayer.Key071_125.text	@ltx/gr_gr_cog/ho.ho21:hoPrayer.Key071_125.text
ltx/gr_redirects_goarch/ho.ho21:hoPrayer.Key071_126.text	@ltx/gr_gr_cog/ho.ho21:hoPrayer.Key071_126.text
ltx/gr_redirects_goarch/ho.ho21:hoPrayer.Key071_127.text	@ltx/gr_gr_cog/ho.ho21:hoPrayer.Key071_127.text
ltx/gr_redirects_goarch/ho.ho21:hoPrayer.Key071_128.text	@ltx/gr_gr_cog/ho.ho21:hoPrayer.Key071_128.text
ltx/gr_redirects_goarch/ho.ho21:hoPrayer.Key071_129.text	@ltx/gr_gr_cog/ho.ho21:hoPrayer.Key071_129.text
ltx/gr_redirects_goarch/ho.ho21:hoPrayer.Key071_130.text	@ltx/gr_gr_cog/ho.ho21:hoPrayer.Key071_130.text
ltx/gr_redirects_goarch/ho.ho21:hoPrayer.Key071_131.text	@ltx/gr_gr_cog/ho.ho21:hoPrayer.Key071_131.text
ltx/gr_redirects_goarch/ho.ho21:hoPrayer.Key071_132.text	@ltx/gr_gr_cog/ho.ho21:hoPrayer.Key071_132.text
ltx/gr_redirects_goarch/ho.ho21:hoPrayer.Key071_133.text	@ltx/gr_gr_cog/ho.ho21:hoPrayer.Key071_133.text
ltx/gr_redirects_goarch/ho.ho21:hoPrayer.Key071_134.text	@ltx/gr_gr_cog/ho.ho21:hoPrayer.Key071_134.text
ltx/gr_redirects_goarch/ho.ho21:hoPrayer.Key071_135.text	@ltx/gr_gr_cog/ho.ho21:hoPrayer.Key071_135.text
ltx/gr_redirects_goarch/ho.ho21:hoPrayer.Key071_136.text	@ltx/gr_gr_cog/ho.ho21:hoPrayer.Key071_136.text
ltx/gr_redirects_goarch/ho.ho21:hoPrayer.Key081.poet	@ltx/gr_gr_cog/ho.ho21:hoPrayer.Key081.poet
ltx/gr_redirects_goarch/ho.ho21:hoPrayer.Key081.text	@ltx/gr_gr_cog/ho.ho21:hoPrayer.Key081.text
ltx/gr_redirects_goarch/ho.ho21:hoPrayer.Key081.title	@ltx/gr_gr_cog/ho.ho21:hoPrayer.Key081.title
ltx/gr_redirects_goarch/ho.ho21:hoPrayer.Key091.poet	@ltx/gr_gr_cog/ho.ho21:hoPrayer.Key091.poet
ltx/gr_redirects_goarch/ho.ho21:hoPrayer.Key091.text	@ltx/gr_gr_cog/ho.ho21:hoPrayer.Key091.text
ltx/gr_redirects_goarch/ho.ho21:hoPrayer.Key091.title	@ltx/gr_gr_cog/ho.ho21:hoPrayer.Key091.title
ltx/gr_redirects_goarch/ho.ho21:hoPrayer.Key100.title	@ltx/gr_us_goa/ho.ho21:hoPrayer.Key100.title
ltx/gr_redirects_goarch/ho.ho21:hoPrayer.Key101.poet	@ltx/gr_us_goa/ho.ho21:hoPrayer.Key101.poet
ltx/gr_redirects_goarch/ho.ho21:hoPrayer.Key101.text	@ltx/gr_us_goa/ho.ho21:hoPrayer.Key101.text
ltx/gr_redirects_goarch/ho.ho21:hoPrayer.Key101.title	@ltx/gr_us_goa/ho.ho21:hoPrayer.Key101.title
ltx/gr_redirects_goarch/ho.ho21:hoPrayer.Key110.text	@ltx/gr_us_goa/ho.ho21:hoPrayer.Key110.text
ltx/gr_redirects_goarch/ho.ho21:hoPrayer.Key111.rubric	@ltx/gr_gr_cog/ho.ho21:hoPrayer.Key111.rubric
ltx/gr_redirects_goarch/ho.ho21:hoPrayer.Key111.text	@ltx/gr_us_goa/ho.ho21:hoPrayer.Key111.text
ltx/gr_redirects_goarch/ho.ho21:hoPrayer.Key111.title	@ltx/gr_us_goa/ho.ho21:hoPrayer.Key111.title
ltx/gr_redirects_goarch/ho.ho21:hoPrayer.Key112.text	@ltx/gr_us_goa/ho.ho21:hoPrayer.Key112.text
ltx/gr_redirects_goarch/ho.ho21:hoPrayer.Key113.text	@ltx/gr_us_goa/ho.ho21:hoPrayer.Key113.text
ltx/gr_redirects_goarch/ho.ho21:hoPrayer.Key114.text	@ltx/gr_us_goa/ho.ho21:hoPrayer.Key114.text
ltx/gr_redirects_goarch/ho.ho21:hoPrayer.Key121.text	@ltx/gr_gr_cog/ho.ho21:hoPrayer.Key121.text
ltx/gr_redirects_goarch/ho.ho21:hoPrayer.Key121.title	@ltx/gr_gr_cog/ho.ho21:hoPrayer.Key121.title
ltx/gr_redirects_goarch/ho.ho21:hoPrayer.Key130.text	@ltx/gr_us_goa/ho.ho21:hoPrayer.Key130.text
ltx/gr_redirects_goarch/ho.ho21:hoPrayer.Key131.text	@ltx/gr_us_goa/ho.ho21:hoPrayer.Key131.text
ltx/gr_redirects_goarch/ho.ho21:hoPrayer.Key131.title	@ltx/gr_gr_cog/ho.ho21:hoPrayer.Key131.title
ltx/gr_redirects_goarch/ho.ho21:hoPrayer.Key132.text	@ltx/gr_us_goa/ho.ho21:hoPrayer.Key132.text
ltx/gr_redirects_goarch/ho.ho21:hoPrayer.Key133.text	@ltx/gr_us_goa/ho.ho21:hoPrayer.Key133.text
ltx/gr_redirects_goarch/ho.ho21:hoPrayer.Key134.text	@ltx/gr_us_goa/ho.ho21:hoPrayer.Key134.text
ltx/gr_redirects_goarch/ho.ho21:hoPrayer.Key141.incipit	@ltx/gr_gr_cog/ho.ho21:hoPrayer.Key141.incipit
ltx/gr_redirects_goarch/ho.ho21:hoPrayer.Key141.text	@ltx/gr_gr_cog/ho.ho21:hoPrayer.Key141.text
ltx/gr_redirects_goarch/ho.ho21:hoPrayer.Key141.title	@ltx/gr_gr_cog/ho.ho21:hoPrayer.Key141.title
ltx/gr_redirects_goarch/ho.ho21:hoPrayer.Key151.incipit	@ltx/gr_gr_cog/ho.ho21:hoPrayer.Key151.incipit
ltx/gr_redirects_goarch/ho.ho21:hoPrayer.Key151.text	@ltx/gr_gr_cog/ho.ho21:hoPrayer.Key151.text
ltx/gr_redirects_goarch/ho.ho21:hoPrayer.Key151.title	@ltx/gr_gr_cog/ho.ho21:hoPrayer.Key151.title
ltx/gr_redirects_goarch/ho.ho21:hoPrayer.Key161.text	@ltx/gr_us_goa/ho.ho21:hoPrayer.Key161.text
ltx/gr_redirects_goarch/ho.ho21:hoPrayer.Key161.title	@ltx/gr_gr_cog/ho.ho21:hoPrayer.Key161.title
ltx/gr_redirects_goarch/ho.ho21:hoPrayer.Key200.title	@ltx/gr_gr_cog/ho.ho21:hoPrayer.Key200.title
ltx/gr_redirects_goarch/ho.ho21:hoPrayer.Key200.title2	@ltx/gr_gr_cog/ho.ho21:hoPrayer.Key200.title2
ltx/gr_redirects_goarch/ho.ho21:hoPrayer.Key201.text	@ltx/gr_gr_cog/ho.ho21:hoPrayer.Key201.text
ltx/gr_redirects_goarch/ho.ho21:hoPrayer.Key201.title	@ltx/gr_gr_cog/ho.ho21:hoPrayer.Key201.title
ltx/gr_redirects_goarch/ho.ho21:hoPrayer.Key201_1.text	@ltx/gr_gr_cog/ho.ho21:hoPrayer.Key201_1.text
ltx/gr_redirects_goarch/ho.ho21:hoPrayer.Key201_2.text	@ltx/gr_gr_cog/ho.ho21:hoPrayer.Key201_2.text
ltx/gr_redirects_goarch/ho.ho21:hoPrayer.Key201_3.text	@ltx/gr_gr_cog/ho.ho21:hoPrayer.Key201_3.text
ltx/gr_redirects_goarch/ho.ho21:hoPrayer.Key201_4.text	@ltx/gr_gr_cog/ho.ho21:hoPrayer.Key201_4.text
ltx/gr_redirects_goarch/ho.ho21:hoPrayer.Key201_5.text	@ltx/gr_gr_cog/ho.ho21:hoPrayer.Key201_5.text
ltx/gr_redirects_goarch/ho.ho21:hoPrayer.Key202.text	@ltx/gr_gr_cog/ho.ho21:hoPrayer.Key202.text
ltx/gr_redirects_goarch/ho.ho21:hoPrayer.Key202.title	@ltx/gr_gr_cog/ho.ho21:hoPrayer.Key202.title
ltx/gr_redirects_goarch/ho.ho21:hoPrayer.Key203.text	@ltx/gr_gr_cog/ho.ho21:hoPrayer.Key203.text
ltx/gr_redirects_goarch/ho.ho21:hoPrayer.Key203.title	@ltx/gr_gr_cog/ho.ho21:hoPrayer.Key203.title
ltx/gr_redirects_goarch/ho.ho21:hoPrayer.Key204.text	@ltx/gr_gr_cog/ho.ho21:hoPrayer.Key204.text
ltx/gr_redirects_goarch/ho.ho21:hoPrayer.Key204.title	@ltx/gr_gr_cog/ho.ho21:hoPrayer.Key204.title
ltx/gr_redirects_goarch/ho.ho21:hoPrayer.Key204_001.text	@ltx/gr_gr_cog/ho.ho21:hoPrayer.Key204_001.text
ltx/gr_redirects_goarch/ho.ho21:hoPrayer.Key204_002.text	@ltx/gr_gr_cog/ho.ho21:hoPrayer.Key204_002.text
ltx/gr_redirects_goarch/ho.ho21:hoPrayer.Key204_003.text	@ltx/gr_gr_cog/ho.ho21:hoPrayer.Key204_003.text
ltx/gr_redirects_goarch/ho.ho21:hoPrayer.Key204_004.text	@ltx/gr_gr_cog/ho.ho21:hoPrayer.Key204_004.text
ltx/gr_redirects_goarch/ho.ho21:hoPrayer.Key204_005.text	@ltx/gr_gr_cog/ho.ho21:hoPrayer.Key204_005.text
ltx/gr_redirects_goarch/ho.ho21:hoPrayer.Key204_006.text	@ltx/gr_gr_cog/ho.ho21:hoPrayer.Key204_006.text
ltx/gr_redirects_goarch/ho.ho21:hoPrayer.Key204_007.text	@ltx/gr_gr_cog/ho.ho21:hoPrayer.Key204_007.text
ltx/gr_redirects_goarch/ho.ho21:hoPrayer.Key204_008.text	@ltx/gr_gr_cog/ho.ho21:hoPrayer.Key204_008.text
ltx/gr_redirects_goarch/ho.ho21:hoPrayer.Key204_009.text	@ltx/gr_gr_cog/ho.ho21:hoPrayer.Key204_009.text
ltx/gr_redirects_goarch/ho.ho21:hoPrayer.Key204_010.text	@ltx/gr_gr_cog/ho.ho21:hoPrayer.Key204_010.text
ltx/gr_redirects_goarch/ho.ho21:hoPrayer.Key204_011.text	@ltx/gr_gr_cog/ho.ho21:hoPrayer.Key204_011.text
ltx/gr_redirects_goarch/ho.ho21:hoPrayer.Key204_012.text	@ltx/gr_gr_cog/ho.ho21:hoPrayer.Key204_012.text
ltx/gr_redirects_goarch/ho.ho21:hoPrayer.Key204_013.text	@ltx/gr_gr_cog/ho.ho21:hoPrayer.Key204_013.text
ltx/gr_redirects_goarch/ho.ho21:hoPrayer.Key204_014.text	@ltx/gr_gr_cog/ho.ho21:hoPrayer.Key204_014.text
ltx/gr_redirects_goarch/ho.ho21:hoPrayer.Key204_015.text	@ltx/gr_gr_cog/ho.ho21:hoPrayer.Key204_015.text
ltx/gr_redirects_goarch/ho.ho21:hoPrayer.Key204_016.text	@ltx/gr_gr_cog/ho.ho21:hoPrayer.Key204_016.text
ltx/gr_redirects_goarch/ho.ho21:hoPrayer.Key204_017.text	@ltx/gr_gr_cog/ho.ho21:hoPrayer.Key204_017.text
ltx/gr_redirects_goarch/ho.ho21:hoPrayer.Key204_018.text	@ltx/gr_gr_cog/ho.ho21:hoPrayer.Key204_018.text
ltx/gr_redirects_goarch/ho.ho21:hoPrayer.Key204_019.text	@ltx/gr_gr_cog/ho.ho21:hoPrayer.Key204_019.text
ltx/gr_redirects_goarch/ho.ho21:hoPrayer.Key204_020.text	@ltx/gr_gr_cog/ho.ho21:hoPrayer.Key204_020.text
ltx/gr_redirects_goarch/ho.ho21:hoPrayer.Key204_021.text	@ltx/gr_gr_cog/ho.ho21:hoPrayer.Key204_021.text
ltx/gr_redirects_goarch/ho.ho21:hoPrayer.Key204_022.text	@ltx/gr_gr_cog/ho.ho21:hoPrayer.Key204_022.text
ltx/gr_redirects_goarch/ho.ho21:hoPrayer.Key204_023.text	@ltx/gr_gr_cog/ho.ho21:hoPrayer.Key204_023.text
ltx/gr_redirects_goarch/ho.ho21:hoPrayer.Key204_024.text	@ltx/gr_gr_cog/ho.ho21:hoPrayer.Key204_024.text
ltx/gr_redirects_goarch/ho.ho21:hoPrayer.Key204_025.text	@ltx/gr_gr_cog/ho.ho21:hoPrayer.Key204_025.text
ltx/gr_redirects_goarch/ho.ho21:hoPrayer.Key204_026.text	@ltx/gr_gr_cog/ho.ho21:hoPrayer.Key204_026.text
ltx/gr_redirects_goarch/ho.ho21:hoPrayer.Key204_027.text	@ltx/gr_gr_cog/ho.ho21:hoPrayer.Key204_027.text
ltx/gr_redirects_goarch/ho.ho21:hoPrayer.Key204_028.text	@ltx/gr_gr_cog/ho.ho21:hoPrayer.Key204_028.text
ltx/gr_redirects_goarch/ho.ho21:hoPrayer.Key205.text	@ltx/gr_gr_cog/ho.ho21:hoPrayer.Key205.text
ltx/gr_redirects_goarch/ho.ho21:hoPrayer.Key205.title	@ltx/gr_gr_cog/ho.ho21:hoPrayer.Key205.title
ltx/gr_redirects_goarch/ho.ho21:hoPrayer.Key206.text	@ltx/gr_gr_cog/ho.ho21:hoPrayer.Key206.text
ltx/gr_redirects_goarch/ho.ho21:hoPrayer.Key206.title	@ltx/gr_gr_cog/ho.ho21:hoPrayer.Key206.title
ltx/gr_redirects_goarch/ho.ho21:hoPrayer.Key206.title2	@ltx/gr_gr_cog/ho.ho21:hoPrayer.Key206.title2
ltx/gr_redirects_goarch/ho.ho21:hoPrayer.Key300.title	@ltx/gr_gr_cog/ho.ho21:hoPrayer.Key300.title
ltx/gr_redirects_goarch/ho.ho21:hoPrayer.Key400.title	@ltx/gr_gr_cog/ho.ho21:hoPrayer.Key400.title
ltx/gr_redirects_goarch/ho.ho21:hoPrayer.Key500.title	@ltx/gr_gr_cog/ho.ho21:hoPrayer.Key500.title
ltx/gr_redirects_goarch/ho.ho21:hoPrayer.note1	@ltx/gr_gr_cog/ho.ho21:hoPrayer.note1
ltx/gr_redirects_goarch/ho.ho21:hoPrayer.title	@ltx/gr_gr_cog/ho.ho21:hoPrayer.title
