ltx/gr_redirects_goarch/tr.d046:trCO.header	@ltx/gr_gr_cog/tr.d046:trCO.header
ltx/gr_redirects_goarch/tr.d046:trDA.commemoration.full	@ltx/gr_gr_cog/tr.d046:trDA.commemoration.full
ltx/gr_redirects_goarch/tr.d046:trDA.commemoration.short	@ltx/gr_gr_cog/tr.d046:trDA.commemoration.short
ltx/gr_redirects_goarch/tr.d046:trDA.insert1	@ltx/gr_gr_cog/tr.d046:trDA.insert1
ltx/gr_redirects_goarch/tr.d046:trDA.insert2	@ltx/gr_gr_cog/tr.d046:trDA.insert2
ltx/gr_redirects_goarch/tr.d046:trDA.note	@ltx/gr_gr_cog/tr.d046:trDA.note
ltx/gr_redirects_goarch/tr.d046:trDA.title	@ltx/gr_gr_cog/tr.d046:trDA.title
ltx/gr_redirects_goarch/tr.d046:trHO.commemorations	@ltx/gr_gr_cog/tr.d046:trHO.commemorations
ltx/gr_redirects_goarch/tr.d046:trHO.daytitle	@ltx/gr_gr_cog/tr.d046:trHO.daytitle
ltx/gr_redirects_goarch/tr.d046:trHO.description1	@ltx/gr_gr_cog/tr.d046:trHO.description1
ltx/gr_redirects_goarch/tr.d046:trHO.description2	@ltx/gr_gr_cog/tr.d046:trHO.description2
ltx/gr_redirects_goarch/tr.d046:trHO.note1	@ltx/gr_gr_cog/tr.d046:trHO.note1
ltx/gr_redirects_goarch/tr.d046:trHO.note2	@ltx/gr_gr_cog/tr.d046:trHO.note2
ltx/gr_redirects_goarch/tr.d046:trMA.AposGlory.incipit	@ltx/gr_gr_cog/tr.d046:trMA.AposGlory.incipit
ltx/gr_redirects_goarch/tr.d046:trMA.AposGlory.melody	@ltx/gr_gr_cog/tr.d046:trMA.AposGlory.melody
ltx/gr_redirects_goarch/tr.d046:trMA.AposGlory.mode	@ltx/gr_gr_cog/tr.d046:trMA.AposGlory.mode
ltx/gr_redirects_goarch/tr.d046:trMA.AposGlory.text	@ltx/gr_gr_cog/tr.d046:trMA.AposGlory.text
ltx/gr_redirects_goarch/tr.d046:trMA.AposIdiomelon1.incipit	@ltx/gr_gr_cog/tr.d046:trMA.AposIdiomelon1.incipit
ltx/gr_redirects_goarch/tr.d046:trMA.AposIdiomelon1.melody	@ltx/gr_gr_cog/tr.d046:trMA.AposIdiomelon1.melody
ltx/gr_redirects_goarch/tr.d046:trMA.AposIdiomelon1.mode	@ltx/gr_gr_cog/tr.d046:trMA.AposIdiomelon1.mode
ltx/gr_redirects_goarch/tr.d046:trMA.AposIdiomelon1.text	@ltx/gr_gr_cog/tr.d046:trMA.AposIdiomelon1.text
ltx/gr_redirects_goarch/tr.d046:trMA.AposMartyric.incipit	@ltx/gr_gr_cog/tr.d046:trMA.AposMartyric.incipit
ltx/gr_redirects_goarch/tr.d046:trMA.AposMartyric.melody	@ltx/gr_gr_cog/tr.d046:trMA.AposMartyric.melody
ltx/gr_redirects_goarch/tr.d046:trMA.AposMartyric.mode	@ltx/gr_gr_cog/tr.d046:trMA.AposMartyric.mode
ltx/gr_redirects_goarch/tr.d046:trMA.AposMartyric.text	@ltx/gr_gr_cog/tr.d046:trMA.AposMartyric.text
ltx/gr_redirects_goarch/tr.d046:trMA.C1.acrostic.notice1	@ltx/gr_gr_cog/tr.d046:trMA.C1.acrostic.notice1
ltx/gr_redirects_goarch/tr.d046:trMA.C1.acrostic.text	@ltx/gr_gr_cog/tr.d046:trMA.C1.acrostic.text
ltx/gr_redirects_goarch/tr.d046:trMA.C1.acrostic.title	@ltx/gr_gr_cog/tr.d046:trMA.C1.acrostic.title
ltx/gr_redirects_goarch/tr.d046:trMA.C1.poet	@ltx/gr_gr_cog/tr.d046:trMA.C1.poet
ltx/gr_redirects_goarch/tr.d046:trMA.C1.title	@ltx/gr_gr_cog/tr.d046:trMA.C1.title
ltx/gr_redirects_goarch/tr.d046:trMA.C1.verse	@ltx/gr_gr_cog/tr.d046:trMA.C1.verse
ltx/gr_redirects_goarch/tr.d046:trMA.C2.poet	@ltx/gr_gr_cog/tr.d046:trMA.C2.poet
ltx/gr_redirects_goarch/tr.d046:trMA.C2.title	@ltx/gr_gr_cog/tr.d046:trMA.C2.title
ltx/gr_redirects_goarch/tr.d046:trMA.C2.verse	@ltx/gr_gr_cog/tr.d046:trMA.C2.verse
ltx/gr_redirects_goarch/tr.d046:trMA.C3.poet	@ltx/gr_gr_cog/tr.d046:trMA.C3.poet
ltx/gr_redirects_goarch/tr.d046:trMA.C3.title	@ltx/gr_gr_cog/tr.d046:trMA.C3.title
ltx/gr_redirects_goarch/tr.d046:trMA.C3.verse	@ltx/gr_gr_cog/tr.d046:trMA.C3.verse
ltx/gr_redirects_goarch/tr.d046:trMA.ExapTheotokion.greekmelody	@ltx/gr_gr_cog/tr.d046:trMA.ExapTheotokion.greekmelody
ltx/gr_redirects_goarch/tr.d046:trMA.ExapTheotokion.incipit	@ltx/gr_gr_cog/tr.d046:trMA.ExapTheotokion.incipit
ltx/gr_redirects_goarch/tr.d046:trMA.ExapTheotokion.melody	@ltx/gr_gr_cog/tr.d046:trMA.ExapTheotokion.melody
ltx/gr_redirects_goarch/tr.d046:trMA.ExapTheotokion.mode	@ltx/gr_gr_cog/tr.d046:trMA.ExapTheotokion.mode
ltx/gr_redirects_goarch/tr.d046:trMA.ExapTheotokion.text	@ltx/gr_gr_cog/tr.d046:trMA.ExapTheotokion.text
ltx/gr_redirects_goarch/tr.d046:trMA.Exaposteilarion1.greekmelody	@ltx/gr_gr_cog/tr.d046:trMA.Exaposteilarion1.greekmelody
ltx/gr_redirects_goarch/tr.d046:trMA.Exaposteilarion1.incipit	@ltx/gr_gr_cog/tr.d046:trMA.Exaposteilarion1.incipit
ltx/gr_redirects_goarch/tr.d046:trMA.Exaposteilarion1.melody	@ltx/gr_gr_cog/tr.d046:trMA.Exaposteilarion1.melody
ltx/gr_redirects_goarch/tr.d046:trMA.Exaposteilarion1.mode	@ltx/gr_gr_cog/tr.d046:trMA.Exaposteilarion1.mode
ltx/gr_redirects_goarch/tr.d046:trMA.Exaposteilarion1.text	@ltx/gr_gr_cog/tr.d046:trMA.Exaposteilarion1.text
ltx/gr_redirects_goarch/tr.d046:trMA.Kathisma21.greekmelody	@ltx/gr_gr_cog/tr.d046:trMA.Kathisma21.greekmelody
ltx/gr_redirects_goarch/tr.d046:trMA.Kathisma21.incipit	@ltx/gr_gr_cog/tr.d046:trMA.Kathisma21.incipit
ltx/gr_redirects_goarch/tr.d046:trMA.Kathisma21.melody	@ltx/gr_gr_cog/tr.d046:trMA.Kathisma21.melody
ltx/gr_redirects_goarch/tr.d046:trMA.Kathisma21.mode	@ltx/gr_gr_cog/tr.d046:trMA.Kathisma21.mode
ltx/gr_redirects_goarch/tr.d046:trMA.Kathisma21.text	@ltx/gr_gr_cog/tr.d046:trMA.Kathisma21.text
ltx/gr_redirects_goarch/tr.d046:trMA.Kathisma22.greekmelody	@ltx/gr_gr_cog/tr.d046:trMA.Kathisma22.greekmelody
ltx/gr_redirects_goarch/tr.d046:trMA.Kathisma22.incipit	@ltx/gr_gr_cog/tr.d046:trMA.Kathisma22.incipit
ltx/gr_redirects_goarch/tr.d046:trMA.Kathisma22.melody	@ltx/gr_gr_cog/tr.d046:trMA.Kathisma22.melody
ltx/gr_redirects_goarch/tr.d046:trMA.Kathisma22.mode	@ltx/gr_gr_cog/tr.d046:trMA.Kathisma22.mode
ltx/gr_redirects_goarch/tr.d046:trMA.Kathisma22.text	@ltx/gr_gr_cog/tr.d046:trMA.Kathisma22.text
ltx/gr_redirects_goarch/tr.d046:trMA.Kathisma31.incipit	@ltx/gr_gr_cog/tr.d046:trMA.Kathisma31.incipit
ltx/gr_redirects_goarch/tr.d046:trMA.Kathisma31.melody	@ltx/gr_gr_cog/tr.d046:trMA.Kathisma31.melody
ltx/gr_redirects_goarch/tr.d046:trMA.Kathisma31.mode	@ltx/gr_gr_cog/tr.d046:trMA.Kathisma31.mode
ltx/gr_redirects_goarch/tr.d046:trMA.Kathisma31.text	@ltx/gr_gr_cog/tr.d046:trMA.Kathisma31.text
ltx/gr_redirects_goarch/tr.d046:trMA.Kathisma32.greekmelody	@ltx/gr_gr_cog/tr.d046:trMA.Kathisma32.greekmelody
ltx/gr_redirects_goarch/tr.d046:trMA.Kathisma32.incipit	@ltx/gr_gr_cog/tr.d046:trMA.Kathisma32.incipit
ltx/gr_redirects_goarch/tr.d046:trMA.Kathisma32.melody	@ltx/gr_gr_cog/tr.d046:trMA.Kathisma32.melody
ltx/gr_redirects_goarch/tr.d046:trMA.Kathisma32.mode	@ltx/gr_gr_cog/tr.d046:trMA.Kathisma32.mode
ltx/gr_redirects_goarch/tr.d046:trMA.Kathisma32.text	@ltx/gr_gr_cog/tr.d046:trMA.Kathisma32.text
ltx/gr_redirects_goarch/tr.d046:trMA.Kontakion1.incipit	@ltx/gr_gr_cog/tr.d046:trMA.Kontakion1.incipit
ltx/gr_redirects_goarch/tr.d046:trMA.Kontakion1.melody	@ltx/gr_gr_cog/tr.d046:trMA.Kontakion1.melody
ltx/gr_redirects_goarch/tr.d046:trMA.Kontakion1.mode	@ltx/gr_gr_cog/tr.d046:trMA.Kontakion1.mode
ltx/gr_redirects_goarch/tr.d046:trMA.Kontakion1.text	@ltx/gr_gr_cog/tr.d046:trMA.Kontakion1.text
ltx/gr_redirects_goarch/tr.d046:trMA.Ode1C11.greekmelody	@ltx/gr_gr_cog/tr.d046:trMA.Ode1C11.greekmelody
ltx/gr_redirects_goarch/tr.d046:trMA.Ode1C11.incipit	@ltx/gr_gr_cog/tr.d046:trMA.Ode1C11.incipit
ltx/gr_redirects_goarch/tr.d046:trMA.Ode1C11.melody	@ltx/gr_gr_cog/tr.d046:trMA.Ode1C11.melody
ltx/gr_redirects_goarch/tr.d046:trMA.Ode1C11.mode	@ltx/gr_gr_cog/tr.d046:trMA.Ode1C11.mode
ltx/gr_redirects_goarch/tr.d046:trMA.Ode1C11.ode	@ltx/gr_gr_cog/tr.d046:trMA.Ode1C11.ode
ltx/gr_redirects_goarch/tr.d046:trMA.Ode1C11.text	@ltx/gr_gr_cog/tr.d046:trMA.Ode1C11.text
ltx/gr_redirects_goarch/tr.d046:trMA.Ode1C12.incipit	@ltx/gr_gr_cog/tr.d046:trMA.Ode1C12.incipit
ltx/gr_redirects_goarch/tr.d046:trMA.Ode1C12.melody	@ltx/gr_gr_cog/tr.d046:trMA.Ode1C12.melody
ltx/gr_redirects_goarch/tr.d046:trMA.Ode1C12.mode	@ltx/gr_gr_cog/tr.d046:trMA.Ode1C12.mode
ltx/gr_redirects_goarch/tr.d046:trMA.Ode1C12.ode	@ltx/gr_gr_cog/tr.d046:trMA.Ode1C12.ode
ltx/gr_redirects_goarch/tr.d046:trMA.Ode1C12.text	@ltx/gr_gr_cog/tr.d046:trMA.Ode1C12.text
ltx/gr_redirects_goarch/tr.d046:trMA.Ode1C13.incipit	@ltx/gr_gr_cog/tr.d046:trMA.Ode1C13.incipit
ltx/gr_redirects_goarch/tr.d046:trMA.Ode1C13.melody	@ltx/gr_gr_cog/tr.d046:trMA.Ode1C13.melody
ltx/gr_redirects_goarch/tr.d046:trMA.Ode1C13.mode	@ltx/gr_gr_cog/tr.d046:trMA.Ode1C13.mode
ltx/gr_redirects_goarch/tr.d046:trMA.Ode1C13.ode	@ltx/gr_gr_cog/tr.d046:trMA.Ode1C13.ode
ltx/gr_redirects_goarch/tr.d046:trMA.Ode1C13.text	@ltx/gr_gr_cog/tr.d046:trMA.Ode1C13.text
ltx/gr_redirects_goarch/tr.d046:trMA.Ode1C1H.greekmelody	@ltx/gr_gr_cog/tr.d046:trMA.Ode1C1H.greekmelody
ltx/gr_redirects_goarch/tr.d046:trMA.Ode1C1H.incipit	@ltx/gr_gr_cog/tr.d046:trMA.Ode1C1H.incipit
ltx/gr_redirects_goarch/tr.d046:trMA.Ode1C1H.melody	@ltx/gr_gr_cog/tr.d046:trMA.Ode1C1H.melody
ltx/gr_redirects_goarch/tr.d046:trMA.Ode1C1H.mode	@ltx/gr_gr_cog/tr.d046:trMA.Ode1C1H.mode
ltx/gr_redirects_goarch/tr.d046:trMA.Ode1C1H.ode	@ltx/gr_gr_cog/tr.d046:trMA.Ode1C1H.ode
ltx/gr_redirects_goarch/tr.d046:trMA.Ode1C1H.text	@ltx/gr_gr_cog/tr.d046:trMA.Ode1C1H.text
ltx/gr_redirects_goarch/tr.d046:trMA.Ode1C1T.incipit	@ltx/gr_gr_cog/tr.d046:trMA.Ode1C1T.incipit
ltx/gr_redirects_goarch/tr.d046:trMA.Ode1C1T.melody	@ltx/gr_gr_cog/tr.d046:trMA.Ode1C1T.melody
ltx/gr_redirects_goarch/tr.d046:trMA.Ode1C1T.mode	@ltx/gr_gr_cog/tr.d046:trMA.Ode1C1T.mode
ltx/gr_redirects_goarch/tr.d046:trMA.Ode1C1T.ode	@ltx/gr_gr_cog/tr.d046:trMA.Ode1C1T.ode
ltx/gr_redirects_goarch/tr.d046:trMA.Ode1C1T.text	@ltx/gr_gr_cog/tr.d046:trMA.Ode1C1T.text
ltx/gr_redirects_goarch/tr.d046:trMA.Ode3C11.greekmelody	@ltx/gr_gr_cog/tr.d046:trMA.Ode3C11.greekmelody
ltx/gr_redirects_goarch/tr.d046:trMA.Ode3C11.incipit	@ltx/gr_gr_cog/tr.d046:trMA.Ode3C11.incipit
ltx/gr_redirects_goarch/tr.d046:trMA.Ode3C11.melody	@ltx/gr_gr_cog/tr.d046:trMA.Ode3C11.melody
ltx/gr_redirects_goarch/tr.d046:trMA.Ode3C11.mode	@ltx/gr_gr_cog/tr.d046:trMA.Ode3C11.mode
ltx/gr_redirects_goarch/tr.d046:trMA.Ode3C11.ode	@ltx/gr_gr_cog/tr.d046:trMA.Ode3C11.ode
ltx/gr_redirects_goarch/tr.d046:trMA.Ode3C11.text	@ltx/gr_gr_cog/tr.d046:trMA.Ode3C11.text
ltx/gr_redirects_goarch/tr.d046:trMA.Ode3C12.incipit	@ltx/gr_gr_cog/tr.d046:trMA.Ode3C12.incipit
ltx/gr_redirects_goarch/tr.d046:trMA.Ode3C12.melody	@ltx/gr_gr_cog/tr.d046:trMA.Ode3C12.melody
ltx/gr_redirects_goarch/tr.d046:trMA.Ode3C12.mode	@ltx/gr_gr_cog/tr.d046:trMA.Ode3C12.mode
ltx/gr_redirects_goarch/tr.d046:trMA.Ode3C12.ode	@ltx/gr_gr_cog/tr.d046:trMA.Ode3C12.ode
ltx/gr_redirects_goarch/tr.d046:trMA.Ode3C12.text	@ltx/gr_gr_cog/tr.d046:trMA.Ode3C12.text
ltx/gr_redirects_goarch/tr.d046:trMA.Ode3C13.incipit	@ltx/gr_gr_cog/tr.d046:trMA.Ode3C13.incipit
ltx/gr_redirects_goarch/tr.d046:trMA.Ode3C13.melody	@ltx/gr_gr_cog/tr.d046:trMA.Ode3C13.melody
ltx/gr_redirects_goarch/tr.d046:trMA.Ode3C13.mode	@ltx/gr_gr_cog/tr.d046:trMA.Ode3C13.mode
ltx/gr_redirects_goarch/tr.d046:trMA.Ode3C13.ode	@ltx/gr_gr_cog/tr.d046:trMA.Ode3C13.ode
ltx/gr_redirects_goarch/tr.d046:trMA.Ode3C13.text	@ltx/gr_gr_cog/tr.d046:trMA.Ode3C13.text
ltx/gr_redirects_goarch/tr.d046:trMA.Ode3C1H.greekmelody	@ltx/gr_gr_cog/tr.d046:trMA.Ode3C1H.greekmelody
ltx/gr_redirects_goarch/tr.d046:trMA.Ode3C1H.incipit	@ltx/gr_gr_cog/tr.d046:trMA.Ode3C1H.incipit
ltx/gr_redirects_goarch/tr.d046:trMA.Ode3C1H.melody	@ltx/gr_gr_cog/tr.d046:trMA.Ode3C1H.melody
ltx/gr_redirects_goarch/tr.d046:trMA.Ode3C1H.mode	@ltx/gr_gr_cog/tr.d046:trMA.Ode3C1H.mode
ltx/gr_redirects_goarch/tr.d046:trMA.Ode3C1H.ode	@ltx/gr_gr_cog/tr.d046:trMA.Ode3C1H.ode
ltx/gr_redirects_goarch/tr.d046:trMA.Ode3C1H.text	@ltx/gr_gr_cog/tr.d046:trMA.Ode3C1H.text
ltx/gr_redirects_goarch/tr.d046:trMA.Ode3C1T.incipit	@ltx/gr_gr_cog/tr.d046:trMA.Ode3C1T.incipit
ltx/gr_redirects_goarch/tr.d046:trMA.Ode3C1T.melody	@ltx/gr_gr_cog/tr.d046:trMA.Ode3C1T.melody
ltx/gr_redirects_goarch/tr.d046:trMA.Ode3C1T.mode	@ltx/gr_gr_cog/tr.d046:trMA.Ode3C1T.mode
ltx/gr_redirects_goarch/tr.d046:trMA.Ode3C1T.ode	@ltx/gr_gr_cog/tr.d046:trMA.Ode3C1T.ode
ltx/gr_redirects_goarch/tr.d046:trMA.Ode3C1T.text	@ltx/gr_gr_cog/tr.d046:trMA.Ode3C1T.text
ltx/gr_redirects_goarch/tr.d046:trMA.Ode3C21.greekmelody	@ltx/gr_gr_cog/tr.d046:trMA.Ode3C21.greekmelody
ltx/gr_redirects_goarch/tr.d046:trMA.Ode3C21.incipit	@ltx/gr_gr_cog/tr.d046:trMA.Ode3C21.incipit
ltx/gr_redirects_goarch/tr.d046:trMA.Ode3C21.melody	@ltx/gr_gr_cog/tr.d046:trMA.Ode3C21.melody
ltx/gr_redirects_goarch/tr.d046:trMA.Ode3C21.mode	@ltx/gr_gr_cog/tr.d046:trMA.Ode3C21.mode
ltx/gr_redirects_goarch/tr.d046:trMA.Ode3C21.ode	@ltx/gr_gr_cog/tr.d046:trMA.Ode3C21.ode
ltx/gr_redirects_goarch/tr.d046:trMA.Ode3C21.text	@ltx/gr_gr_cog/tr.d046:trMA.Ode3C21.text
ltx/gr_redirects_goarch/tr.d046:trMA.Ode3C22.incipit	@ltx/gr_gr_cog/tr.d046:trMA.Ode3C22.incipit
ltx/gr_redirects_goarch/tr.d046:trMA.Ode3C22.melody	@ltx/gr_gr_cog/tr.d046:trMA.Ode3C22.melody
ltx/gr_redirects_goarch/tr.d046:trMA.Ode3C22.mode	@ltx/gr_gr_cog/tr.d046:trMA.Ode3C22.mode
ltx/gr_redirects_goarch/tr.d046:trMA.Ode3C22.ode	@ltx/gr_gr_cog/tr.d046:trMA.Ode3C22.ode
ltx/gr_redirects_goarch/tr.d046:trMA.Ode3C22.text	@ltx/gr_gr_cog/tr.d046:trMA.Ode3C22.text
ltx/gr_redirects_goarch/tr.d046:trMA.Ode3C23.incipit	@ltx/gr_gr_cog/tr.d046:trMA.Ode3C23.incipit
ltx/gr_redirects_goarch/tr.d046:trMA.Ode3C23.melody	@ltx/gr_gr_cog/tr.d046:trMA.Ode3C23.melody
ltx/gr_redirects_goarch/tr.d046:trMA.Ode3C23.mode	@ltx/gr_gr_cog/tr.d046:trMA.Ode3C23.mode
ltx/gr_redirects_goarch/tr.d046:trMA.Ode3C23.ode	@ltx/gr_gr_cog/tr.d046:trMA.Ode3C23.ode
ltx/gr_redirects_goarch/tr.d046:trMA.Ode3C23.text	@ltx/gr_gr_cog/tr.d046:trMA.Ode3C23.text
ltx/gr_redirects_goarch/tr.d046:trMA.Ode3C2T.incipit	@ltx/gr_gr_cog/tr.d046:trMA.Ode3C2T.incipit
ltx/gr_redirects_goarch/tr.d046:trMA.Ode3C2T.melody	@ltx/gr_gr_cog/tr.d046:trMA.Ode3C2T.melody
ltx/gr_redirects_goarch/tr.d046:trMA.Ode3C2T.mode	@ltx/gr_gr_cog/tr.d046:trMA.Ode3C2T.mode
ltx/gr_redirects_goarch/tr.d046:trMA.Ode3C2T.ode	@ltx/gr_gr_cog/tr.d046:trMA.Ode3C2T.ode
ltx/gr_redirects_goarch/tr.d046:trMA.Ode3C2T.text	@ltx/gr_gr_cog/tr.d046:trMA.Ode3C2T.text
ltx/gr_redirects_goarch/tr.d046:trMA.Ode3C31.greekmelody	@ltx/gr_gr_cog/tr.d046:trMA.Ode3C31.greekmelody
ltx/gr_redirects_goarch/tr.d046:trMA.Ode3C31.incipit	@ltx/gr_gr_cog/tr.d046:trMA.Ode3C31.incipit
ltx/gr_redirects_goarch/tr.d046:trMA.Ode3C31.melody	@ltx/gr_gr_cog/tr.d046:trMA.Ode3C31.melody
ltx/gr_redirects_goarch/tr.d046:trMA.Ode3C31.mode	@ltx/gr_gr_cog/tr.d046:trMA.Ode3C31.mode
ltx/gr_redirects_goarch/tr.d046:trMA.Ode3C31.ode	@ltx/gr_gr_cog/tr.d046:trMA.Ode3C31.ode
ltx/gr_redirects_goarch/tr.d046:trMA.Ode3C31.text	@ltx/gr_gr_cog/tr.d046:trMA.Ode3C31.text
ltx/gr_redirects_goarch/tr.d046:trMA.Ode3C32.incipit	@ltx/gr_gr_cog/tr.d046:trMA.Ode3C32.incipit
ltx/gr_redirects_goarch/tr.d046:trMA.Ode3C32.melody	@ltx/gr_gr_cog/tr.d046:trMA.Ode3C32.melody
ltx/gr_redirects_goarch/tr.d046:trMA.Ode3C32.mode	@ltx/gr_gr_cog/tr.d046:trMA.Ode3C32.mode
ltx/gr_redirects_goarch/tr.d046:trMA.Ode3C32.ode	@ltx/gr_gr_cog/tr.d046:trMA.Ode3C32.ode
ltx/gr_redirects_goarch/tr.d046:trMA.Ode3C32.text	@ltx/gr_gr_cog/tr.d046:trMA.Ode3C32.text
ltx/gr_redirects_goarch/tr.d046:trMA.Ode3C3A1.incipit	@ltx/gr_gr_cog/tr.d046:trMA.Ode3C3A1.incipit
ltx/gr_redirects_goarch/tr.d046:trMA.Ode3C3A1.melody	@ltx/gr_gr_cog/tr.d046:trMA.Ode3C3A1.melody
ltx/gr_redirects_goarch/tr.d046:trMA.Ode3C3A1.mode	@ltx/gr_gr_cog/tr.d046:trMA.Ode3C3A1.mode
ltx/gr_redirects_goarch/tr.d046:trMA.Ode3C3A1.ode	@ltx/gr_gr_cog/tr.d046:trMA.Ode3C3A1.ode
ltx/gr_redirects_goarch/tr.d046:trMA.Ode3C3A1.text	@ltx/gr_gr_cog/tr.d046:trMA.Ode3C3A1.text
ltx/gr_redirects_goarch/tr.d046:trMA.Ode3C3H.greekmelody	@ltx/gr_gr_cog/tr.d046:trMA.Ode3C3H.greekmelody
ltx/gr_redirects_goarch/tr.d046:trMA.Ode3C3H.incipit	@ltx/gr_gr_cog/tr.d046:trMA.Ode3C3H.incipit
ltx/gr_redirects_goarch/tr.d046:trMA.Ode3C3H.melody	@ltx/gr_gr_cog/tr.d046:trMA.Ode3C3H.melody
ltx/gr_redirects_goarch/tr.d046:trMA.Ode3C3H.mode	@ltx/gr_gr_cog/tr.d046:trMA.Ode3C3H.mode
ltx/gr_redirects_goarch/tr.d046:trMA.Ode3C3H.ode	@ltx/gr_gr_cog/tr.d046:trMA.Ode3C3H.ode
ltx/gr_redirects_goarch/tr.d046:trMA.Ode3C3H.text	@ltx/gr_gr_cog/tr.d046:trMA.Ode3C3H.text
ltx/gr_redirects_goarch/tr.d046:trMA.Ode3C3T.incipit	@ltx/gr_gr_cog/tr.d046:trMA.Ode3C3T.incipit
ltx/gr_redirects_goarch/tr.d046:trMA.Ode3C3T.melody	@ltx/gr_gr_cog/tr.d046:trMA.Ode3C3T.melody
ltx/gr_redirects_goarch/tr.d046:trMA.Ode3C3T.mode	@ltx/gr_gr_cog/tr.d046:trMA.Ode3C3T.mode
ltx/gr_redirects_goarch/tr.d046:trMA.Ode3C3T.ode	@ltx/gr_gr_cog/tr.d046:trMA.Ode3C3T.ode
ltx/gr_redirects_goarch/tr.d046:trMA.Ode3C3T.text	@ltx/gr_gr_cog/tr.d046:trMA.Ode3C3T.text
ltx/gr_redirects_goarch/tr.d046:trMA.Ode3C3Tr.incipit	@ltx/gr_gr_cog/tr.d046:trMA.Ode3C3Tr.incipit
ltx/gr_redirects_goarch/tr.d046:trMA.Ode3C3Tr.melody	@ltx/gr_gr_cog/tr.d046:trMA.Ode3C3Tr.melody
ltx/gr_redirects_goarch/tr.d046:trMA.Ode3C3Tr.mode	@ltx/gr_gr_cog/tr.d046:trMA.Ode3C3Tr.mode
ltx/gr_redirects_goarch/tr.d046:trMA.Ode3C3Tr.ode	@ltx/gr_gr_cog/tr.d046:trMA.Ode3C3Tr.ode
ltx/gr_redirects_goarch/tr.d046:trMA.Ode3C3Tr.text	@ltx/gr_gr_cog/tr.d046:trMA.Ode3C3Tr.text
ltx/gr_redirects_goarch/tr.d046:trMA.Ode3Kathisma1.incipit	@ltx/gr_gr_cog/tr.d046:trMA.Ode3Kathisma1.incipit
ltx/gr_redirects_goarch/tr.d046:trMA.Ode3Kathisma1.melody	@ltx/gr_gr_cog/tr.d046:trMA.Ode3Kathisma1.melody
ltx/gr_redirects_goarch/tr.d046:trMA.Ode3Kathisma1.mode	@ltx/gr_gr_cog/tr.d046:trMA.Ode3Kathisma1.mode
ltx/gr_redirects_goarch/tr.d046:trMA.Ode3Kathisma1.text	@ltx/gr_gr_cog/tr.d046:trMA.Ode3Kathisma1.text
ltx/gr_redirects_goarch/tr.d046:trMA.Ode3Kathisma2.incipit	@ltx/gr_gr_cog/tr.d046:trMA.Ode3Kathisma2.incipit
ltx/gr_redirects_goarch/tr.d046:trMA.Ode3Kathisma2.melody	@ltx/gr_gr_cog/tr.d046:trMA.Ode3Kathisma2.melody
ltx/gr_redirects_goarch/tr.d046:trMA.Ode3Kathisma2.mode	@ltx/gr_gr_cog/tr.d046:trMA.Ode3Kathisma2.mode
ltx/gr_redirects_goarch/tr.d046:trMA.Ode3Kathisma2.text	@ltx/gr_gr_cog/tr.d046:trMA.Ode3Kathisma2.text
ltx/gr_redirects_goarch/tr.d046:trMA.Ode3Kathisma3.incipit	@ltx/gr_gr_cog/tr.d046:trMA.Ode3Kathisma3.incipit
ltx/gr_redirects_goarch/tr.d046:trMA.Ode3Kathisma3.melody	@ltx/gr_gr_cog/tr.d046:trMA.Ode3Kathisma3.melody
ltx/gr_redirects_goarch/tr.d046:trMA.Ode3Kathisma3.mode	@ltx/gr_gr_cog/tr.d046:trMA.Ode3Kathisma3.mode
ltx/gr_redirects_goarch/tr.d046:trMA.Ode3Kathisma3.text	@ltx/gr_gr_cog/tr.d046:trMA.Ode3Kathisma3.text
ltx/gr_redirects_goarch/tr.d046:trMA.Ode4C11.greekmelody	@ltx/gr_gr_cog/tr.d046:trMA.Ode4C11.greekmelody
ltx/gr_redirects_goarch/tr.d046:trMA.Ode4C11.incipit	@ltx/gr_gr_cog/tr.d046:trMA.Ode4C11.incipit
ltx/gr_redirects_goarch/tr.d046:trMA.Ode4C11.melody	@ltx/gr_gr_cog/tr.d046:trMA.Ode4C11.melody
ltx/gr_redirects_goarch/tr.d046:trMA.Ode4C11.mode	@ltx/gr_gr_cog/tr.d046:trMA.Ode4C11.mode
ltx/gr_redirects_goarch/tr.d046:trMA.Ode4C11.ode	@ltx/gr_gr_cog/tr.d046:trMA.Ode4C11.ode
ltx/gr_redirects_goarch/tr.d046:trMA.Ode4C11.text	@ltx/gr_gr_cog/tr.d046:trMA.Ode4C11.text
ltx/gr_redirects_goarch/tr.d046:trMA.Ode4C12.incipit	@ltx/gr_gr_cog/tr.d046:trMA.Ode4C12.incipit
ltx/gr_redirects_goarch/tr.d046:trMA.Ode4C12.melody	@ltx/gr_gr_cog/tr.d046:trMA.Ode4C12.melody
ltx/gr_redirects_goarch/tr.d046:trMA.Ode4C12.mode	@ltx/gr_gr_cog/tr.d046:trMA.Ode4C12.mode
ltx/gr_redirects_goarch/tr.d046:trMA.Ode4C12.ode	@ltx/gr_gr_cog/tr.d046:trMA.Ode4C12.ode
ltx/gr_redirects_goarch/tr.d046:trMA.Ode4C12.text	@ltx/gr_gr_cog/tr.d046:trMA.Ode4C12.text
ltx/gr_redirects_goarch/tr.d046:trMA.Ode4C13.incipit	@ltx/gr_gr_cog/tr.d046:trMA.Ode4C13.incipit
ltx/gr_redirects_goarch/tr.d046:trMA.Ode4C13.melody	@ltx/gr_gr_cog/tr.d046:trMA.Ode4C13.melody
ltx/gr_redirects_goarch/tr.d046:trMA.Ode4C13.mode	@ltx/gr_gr_cog/tr.d046:trMA.Ode4C13.mode
ltx/gr_redirects_goarch/tr.d046:trMA.Ode4C13.ode	@ltx/gr_gr_cog/tr.d046:trMA.Ode4C13.ode
ltx/gr_redirects_goarch/tr.d046:trMA.Ode4C13.text	@ltx/gr_gr_cog/tr.d046:trMA.Ode4C13.text
ltx/gr_redirects_goarch/tr.d046:trMA.Ode4C1H.greekmelody	@ltx/gr_gr_cog/tr.d046:trMA.Ode4C1H.greekmelody
ltx/gr_redirects_goarch/tr.d046:trMA.Ode4C1H.incipit	@ltx/gr_gr_cog/tr.d046:trMA.Ode4C1H.incipit
ltx/gr_redirects_goarch/tr.d046:trMA.Ode4C1H.melody	@ltx/gr_gr_cog/tr.d046:trMA.Ode4C1H.melody
ltx/gr_redirects_goarch/tr.d046:trMA.Ode4C1H.mode	@ltx/gr_gr_cog/tr.d046:trMA.Ode4C1H.mode
ltx/gr_redirects_goarch/tr.d046:trMA.Ode4C1H.ode	@ltx/gr_gr_cog/tr.d046:trMA.Ode4C1H.ode
ltx/gr_redirects_goarch/tr.d046:trMA.Ode4C1H.text	@ltx/gr_gr_cog/tr.d046:trMA.Ode4C1H.text
ltx/gr_redirects_goarch/tr.d046:trMA.Ode4C1T.incipit	@ltx/gr_gr_cog/tr.d046:trMA.Ode4C1T.incipit
ltx/gr_redirects_goarch/tr.d046:trMA.Ode4C1T.melody	@ltx/gr_gr_cog/tr.d046:trMA.Ode4C1T.melody
ltx/gr_redirects_goarch/tr.d046:trMA.Ode4C1T.mode	@ltx/gr_gr_cog/tr.d046:trMA.Ode4C1T.mode
ltx/gr_redirects_goarch/tr.d046:trMA.Ode4C1T.ode	@ltx/gr_gr_cog/tr.d046:trMA.Ode4C1T.ode
ltx/gr_redirects_goarch/tr.d046:trMA.Ode4C1T.text	@ltx/gr_gr_cog/tr.d046:trMA.Ode4C1T.text
ltx/gr_redirects_goarch/tr.d046:trMA.Ode5C11.greekmelody	@ltx/gr_gr_cog/tr.d046:trMA.Ode5C11.greekmelody
ltx/gr_redirects_goarch/tr.d046:trMA.Ode5C11.incipit	@ltx/gr_gr_cog/tr.d046:trMA.Ode5C11.incipit
ltx/gr_redirects_goarch/tr.d046:trMA.Ode5C11.melody	@ltx/gr_gr_cog/tr.d046:trMA.Ode5C11.melody
ltx/gr_redirects_goarch/tr.d046:trMA.Ode5C11.mode	@ltx/gr_gr_cog/tr.d046:trMA.Ode5C11.mode
ltx/gr_redirects_goarch/tr.d046:trMA.Ode5C11.ode	@ltx/gr_gr_cog/tr.d046:trMA.Ode5C11.ode
ltx/gr_redirects_goarch/tr.d046:trMA.Ode5C11.text	@ltx/gr_gr_cog/tr.d046:trMA.Ode5C11.text
ltx/gr_redirects_goarch/tr.d046:trMA.Ode5C12.incipit	@ltx/gr_gr_cog/tr.d046:trMA.Ode5C12.incipit
ltx/gr_redirects_goarch/tr.d046:trMA.Ode5C12.melody	@ltx/gr_gr_cog/tr.d046:trMA.Ode5C12.melody
ltx/gr_redirects_goarch/tr.d046:trMA.Ode5C12.mode	@ltx/gr_gr_cog/tr.d046:trMA.Ode5C12.mode
ltx/gr_redirects_goarch/tr.d046:trMA.Ode5C12.ode	@ltx/gr_gr_cog/tr.d046:trMA.Ode5C12.ode
ltx/gr_redirects_goarch/tr.d046:trMA.Ode5C12.text	@ltx/gr_gr_cog/tr.d046:trMA.Ode5C12.text
ltx/gr_redirects_goarch/tr.d046:trMA.Ode5C13.incipit	@ltx/gr_gr_cog/tr.d046:trMA.Ode5C13.incipit
ltx/gr_redirects_goarch/tr.d046:trMA.Ode5C13.melody	@ltx/gr_gr_cog/tr.d046:trMA.Ode5C13.melody
ltx/gr_redirects_goarch/tr.d046:trMA.Ode5C13.mode	@ltx/gr_gr_cog/tr.d046:trMA.Ode5C13.mode
ltx/gr_redirects_goarch/tr.d046:trMA.Ode5C13.ode	@ltx/gr_gr_cog/tr.d046:trMA.Ode5C13.ode
ltx/gr_redirects_goarch/tr.d046:trMA.Ode5C13.text	@ltx/gr_gr_cog/tr.d046:trMA.Ode5C13.text
ltx/gr_redirects_goarch/tr.d046:trMA.Ode5C1H.greekmelody	@ltx/gr_gr_cog/tr.d046:trMA.Ode5C1H.greekmelody
ltx/gr_redirects_goarch/tr.d046:trMA.Ode5C1H.incipit	@ltx/gr_gr_cog/tr.d046:trMA.Ode5C1H.incipit
ltx/gr_redirects_goarch/tr.d046:trMA.Ode5C1H.melody	@ltx/gr_gr_cog/tr.d046:trMA.Ode5C1H.melody
ltx/gr_redirects_goarch/tr.d046:trMA.Ode5C1H.mode	@ltx/gr_gr_cog/tr.d046:trMA.Ode5C1H.mode
ltx/gr_redirects_goarch/tr.d046:trMA.Ode5C1H.ode	@ltx/gr_gr_cog/tr.d046:trMA.Ode5C1H.ode
ltx/gr_redirects_goarch/tr.d046:trMA.Ode5C1H.text	@ltx/gr_gr_cog/tr.d046:trMA.Ode5C1H.text
ltx/gr_redirects_goarch/tr.d046:trMA.Ode5C1T.incipit	@ltx/gr_gr_cog/tr.d046:trMA.Ode5C1T.incipit
ltx/gr_redirects_goarch/tr.d046:trMA.Ode5C1T.melody	@ltx/gr_gr_cog/tr.d046:trMA.Ode5C1T.melody
ltx/gr_redirects_goarch/tr.d046:trMA.Ode5C1T.mode	@ltx/gr_gr_cog/tr.d046:trMA.Ode5C1T.mode
ltx/gr_redirects_goarch/tr.d046:trMA.Ode5C1T.ode	@ltx/gr_gr_cog/tr.d046:trMA.Ode5C1T.ode
ltx/gr_redirects_goarch/tr.d046:trMA.Ode5C1T.text	@ltx/gr_gr_cog/tr.d046:trMA.Ode5C1T.text
ltx/gr_redirects_goarch/tr.d046:trMA.Ode6C11.greekmelody	@ltx/gr_gr_cog/tr.d046:trMA.Ode6C11.greekmelody
ltx/gr_redirects_goarch/tr.d046:trMA.Ode6C11.incipit	@ltx/gr_gr_cog/tr.d046:trMA.Ode6C11.incipit
ltx/gr_redirects_goarch/tr.d046:trMA.Ode6C11.melody	@ltx/gr_gr_cog/tr.d046:trMA.Ode6C11.melody
ltx/gr_redirects_goarch/tr.d046:trMA.Ode6C11.mode	@ltx/gr_gr_cog/tr.d046:trMA.Ode6C11.mode
ltx/gr_redirects_goarch/tr.d046:trMA.Ode6C11.ode	@ltx/gr_gr_cog/tr.d046:trMA.Ode6C11.ode
ltx/gr_redirects_goarch/tr.d046:trMA.Ode6C11.text	@ltx/gr_gr_cog/tr.d046:trMA.Ode6C11.text
ltx/gr_redirects_goarch/tr.d046:trMA.Ode6C12.incipit	@ltx/gr_gr_cog/tr.d046:trMA.Ode6C12.incipit
ltx/gr_redirects_goarch/tr.d046:trMA.Ode6C12.melody	@ltx/gr_gr_cog/tr.d046:trMA.Ode6C12.melody
ltx/gr_redirects_goarch/tr.d046:trMA.Ode6C12.mode	@ltx/gr_gr_cog/tr.d046:trMA.Ode6C12.mode
ltx/gr_redirects_goarch/tr.d046:trMA.Ode6C12.ode	@ltx/gr_gr_cog/tr.d046:trMA.Ode6C12.ode
ltx/gr_redirects_goarch/tr.d046:trMA.Ode6C12.text	@ltx/gr_gr_cog/tr.d046:trMA.Ode6C12.text
ltx/gr_redirects_goarch/tr.d046:trMA.Ode6C13.incipit	@ltx/gr_gr_cog/tr.d046:trMA.Ode6C13.incipit
ltx/gr_redirects_goarch/tr.d046:trMA.Ode6C13.melody	@ltx/gr_gr_cog/tr.d046:trMA.Ode6C13.melody
ltx/gr_redirects_goarch/tr.d046:trMA.Ode6C13.mode	@ltx/gr_gr_cog/tr.d046:trMA.Ode6C13.mode
ltx/gr_redirects_goarch/tr.d046:trMA.Ode6C13.ode	@ltx/gr_gr_cog/tr.d046:trMA.Ode6C13.ode
ltx/gr_redirects_goarch/tr.d046:trMA.Ode6C13.text	@ltx/gr_gr_cog/tr.d046:trMA.Ode6C13.text
ltx/gr_redirects_goarch/tr.d046:trMA.Ode6C1H.greekmelody	@ltx/gr_gr_cog/tr.d046:trMA.Ode6C1H.greekmelody
ltx/gr_redirects_goarch/tr.d046:trMA.Ode6C1H.incipit	@ltx/gr_gr_cog/tr.d046:trMA.Ode6C1H.incipit
ltx/gr_redirects_goarch/tr.d046:trMA.Ode6C1H.melody	@ltx/gr_gr_cog/tr.d046:trMA.Ode6C1H.melody
ltx/gr_redirects_goarch/tr.d046:trMA.Ode6C1H.mode	@ltx/gr_gr_cog/tr.d046:trMA.Ode6C1H.mode
ltx/gr_redirects_goarch/tr.d046:trMA.Ode6C1H.ode	@ltx/gr_gr_cog/tr.d046:trMA.Ode6C1H.ode
ltx/gr_redirects_goarch/tr.d046:trMA.Ode6C1H.text	@ltx/gr_gr_cog/tr.d046:trMA.Ode6C1H.text
ltx/gr_redirects_goarch/tr.d046:trMA.Ode6C1T.incipit	@ltx/gr_gr_cog/tr.d046:trMA.Ode6C1T.incipit
ltx/gr_redirects_goarch/tr.d046:trMA.Ode6C1T.melody	@ltx/gr_gr_cog/tr.d046:trMA.Ode6C1T.melody
ltx/gr_redirects_goarch/tr.d046:trMA.Ode6C1T.mode	@ltx/gr_gr_cog/tr.d046:trMA.Ode6C1T.mode
ltx/gr_redirects_goarch/tr.d046:trMA.Ode6C1T.ode	@ltx/gr_gr_cog/tr.d046:trMA.Ode6C1T.ode
ltx/gr_redirects_goarch/tr.d046:trMA.Ode6C1T.text	@ltx/gr_gr_cog/tr.d046:trMA.Ode6C1T.text
ltx/gr_redirects_goarch/tr.d046:trMA.Ode7C11.greekmelody	@ltx/gr_gr_cog/tr.d046:trMA.Ode7C11.greekmelody
ltx/gr_redirects_goarch/tr.d046:trMA.Ode7C11.incipit	@ltx/gr_gr_cog/tr.d046:trMA.Ode7C11.incipit
ltx/gr_redirects_goarch/tr.d046:trMA.Ode7C11.melody	@ltx/gr_gr_cog/tr.d046:trMA.Ode7C11.melody
ltx/gr_redirects_goarch/tr.d046:trMA.Ode7C11.mode	@ltx/gr_gr_cog/tr.d046:trMA.Ode7C11.mode
ltx/gr_redirects_goarch/tr.d046:trMA.Ode7C11.ode	@ltx/gr_gr_cog/tr.d046:trMA.Ode7C11.ode
ltx/gr_redirects_goarch/tr.d046:trMA.Ode7C11.text	@ltx/gr_gr_cog/tr.d046:trMA.Ode7C11.text
ltx/gr_redirects_goarch/tr.d046:trMA.Ode7C12.incipit	@ltx/gr_gr_cog/tr.d046:trMA.Ode7C12.incipit
ltx/gr_redirects_goarch/tr.d046:trMA.Ode7C12.melody	@ltx/gr_gr_cog/tr.d046:trMA.Ode7C12.melody
ltx/gr_redirects_goarch/tr.d046:trMA.Ode7C12.mode	@ltx/gr_gr_cog/tr.d046:trMA.Ode7C12.mode
ltx/gr_redirects_goarch/tr.d046:trMA.Ode7C12.ode	@ltx/gr_gr_cog/tr.d046:trMA.Ode7C12.ode
ltx/gr_redirects_goarch/tr.d046:trMA.Ode7C12.text	@ltx/gr_gr_cog/tr.d046:trMA.Ode7C12.text
ltx/gr_redirects_goarch/tr.d046:trMA.Ode7C13.incipit	@ltx/gr_gr_cog/tr.d046:trMA.Ode7C13.incipit
ltx/gr_redirects_goarch/tr.d046:trMA.Ode7C13.melody	@ltx/gr_gr_cog/tr.d046:trMA.Ode7C13.melody
ltx/gr_redirects_goarch/tr.d046:trMA.Ode7C13.mode	@ltx/gr_gr_cog/tr.d046:trMA.Ode7C13.mode
ltx/gr_redirects_goarch/tr.d046:trMA.Ode7C13.ode	@ltx/gr_gr_cog/tr.d046:trMA.Ode7C13.ode
ltx/gr_redirects_goarch/tr.d046:trMA.Ode7C13.text	@ltx/gr_gr_cog/tr.d046:trMA.Ode7C13.text
ltx/gr_redirects_goarch/tr.d046:trMA.Ode7C1H.greekmelody	@ltx/gr_gr_cog/tr.d046:trMA.Ode7C1H.greekmelody
ltx/gr_redirects_goarch/tr.d046:trMA.Ode7C1H.incipit	@ltx/gr_gr_cog/tr.d046:trMA.Ode7C1H.incipit
ltx/gr_redirects_goarch/tr.d046:trMA.Ode7C1H.melody	@ltx/gr_gr_cog/tr.d046:trMA.Ode7C1H.melody
ltx/gr_redirects_goarch/tr.d046:trMA.Ode7C1H.mode	@ltx/gr_gr_cog/tr.d046:trMA.Ode7C1H.mode
ltx/gr_redirects_goarch/tr.d046:trMA.Ode7C1H.ode	@ltx/gr_gr_cog/tr.d046:trMA.Ode7C1H.ode
ltx/gr_redirects_goarch/tr.d046:trMA.Ode7C1H.text	@ltx/gr_gr_cog/tr.d046:trMA.Ode7C1H.text
ltx/gr_redirects_goarch/tr.d046:trMA.Ode7C1T.incipit	@ltx/gr_gr_cog/tr.d046:trMA.Ode7C1T.incipit
ltx/gr_redirects_goarch/tr.d046:trMA.Ode7C1T.melody	@ltx/gr_gr_cog/tr.d046:trMA.Ode7C1T.melody
ltx/gr_redirects_goarch/tr.d046:trMA.Ode7C1T.mode	@ltx/gr_gr_cog/tr.d046:trMA.Ode7C1T.mode
ltx/gr_redirects_goarch/tr.d046:trMA.Ode7C1T.ode	@ltx/gr_gr_cog/tr.d046:trMA.Ode7C1T.ode
ltx/gr_redirects_goarch/tr.d046:trMA.Ode7C1T.text	@ltx/gr_gr_cog/tr.d046:trMA.Ode7C1T.text
ltx/gr_redirects_goarch/tr.d046:trMA.Ode8C11.greekmelody	@ltx/gr_gr_cog/tr.d046:trMA.Ode8C11.greekmelody
ltx/gr_redirects_goarch/tr.d046:trMA.Ode8C11.incipit	@ltx/gr_gr_cog/tr.d046:trMA.Ode8C11.incipit
ltx/gr_redirects_goarch/tr.d046:trMA.Ode8C11.melody	@ltx/gr_gr_cog/tr.d046:trMA.Ode8C11.melody
ltx/gr_redirects_goarch/tr.d046:trMA.Ode8C11.mode	@ltx/gr_gr_cog/tr.d046:trMA.Ode8C11.mode
ltx/gr_redirects_goarch/tr.d046:trMA.Ode8C11.ode	@ltx/gr_gr_cog/tr.d046:trMA.Ode8C11.ode
ltx/gr_redirects_goarch/tr.d046:trMA.Ode8C11.text	@ltx/gr_gr_cog/tr.d046:trMA.Ode8C11.text
ltx/gr_redirects_goarch/tr.d046:trMA.Ode8C12.incipit	@ltx/gr_gr_cog/tr.d046:trMA.Ode8C12.incipit
ltx/gr_redirects_goarch/tr.d046:trMA.Ode8C12.melody	@ltx/gr_gr_cog/tr.d046:trMA.Ode8C12.melody
ltx/gr_redirects_goarch/tr.d046:trMA.Ode8C12.mode	@ltx/gr_gr_cog/tr.d046:trMA.Ode8C12.mode
ltx/gr_redirects_goarch/tr.d046:trMA.Ode8C12.ode	@ltx/gr_gr_cog/tr.d046:trMA.Ode8C12.ode
ltx/gr_redirects_goarch/tr.d046:trMA.Ode8C12.text	@ltx/gr_gr_cog/tr.d046:trMA.Ode8C12.text
ltx/gr_redirects_goarch/tr.d046:trMA.Ode8C13.incipit	@ltx/gr_gr_cog/tr.d046:trMA.Ode8C13.incipit
ltx/gr_redirects_goarch/tr.d046:trMA.Ode8C13.melody	@ltx/gr_gr_cog/tr.d046:trMA.Ode8C13.melody
ltx/gr_redirects_goarch/tr.d046:trMA.Ode8C13.mode	@ltx/gr_gr_cog/tr.d046:trMA.Ode8C13.mode
ltx/gr_redirects_goarch/tr.d046:trMA.Ode8C13.ode	@ltx/gr_gr_cog/tr.d046:trMA.Ode8C13.ode
ltx/gr_redirects_goarch/tr.d046:trMA.Ode8C13.text	@ltx/gr_gr_cog/tr.d046:trMA.Ode8C13.text
ltx/gr_redirects_goarch/tr.d046:trMA.Ode8C1H.greekmelody	@ltx/gr_gr_cog/tr.d046:trMA.Ode8C1H.greekmelody
ltx/gr_redirects_goarch/tr.d046:trMA.Ode8C1H.incipit	@ltx/gr_gr_cog/tr.d046:trMA.Ode8C1H.incipit
ltx/gr_redirects_goarch/tr.d046:trMA.Ode8C1H.melody	@ltx/gr_gr_cog/tr.d046:trMA.Ode8C1H.melody
ltx/gr_redirects_goarch/tr.d046:trMA.Ode8C1H.mode	@ltx/gr_gr_cog/tr.d046:trMA.Ode8C1H.mode
ltx/gr_redirects_goarch/tr.d046:trMA.Ode8C1H.ode	@ltx/gr_gr_cog/tr.d046:trMA.Ode8C1H.ode
ltx/gr_redirects_goarch/tr.d046:trMA.Ode8C1H.text	@ltx/gr_gr_cog/tr.d046:trMA.Ode8C1H.text
ltx/gr_redirects_goarch/tr.d046:trMA.Ode8C1T.incipit	@ltx/gr_gr_cog/tr.d046:trMA.Ode8C1T.incipit
ltx/gr_redirects_goarch/tr.d046:trMA.Ode8C1T.melody	@ltx/gr_gr_cog/tr.d046:trMA.Ode8C1T.melody
ltx/gr_redirects_goarch/tr.d046:trMA.Ode8C1T.mode	@ltx/gr_gr_cog/tr.d046:trMA.Ode8C1T.mode
ltx/gr_redirects_goarch/tr.d046:trMA.Ode8C1T.ode	@ltx/gr_gr_cog/tr.d046:trMA.Ode8C1T.ode
ltx/gr_redirects_goarch/tr.d046:trMA.Ode8C1T.text	@ltx/gr_gr_cog/tr.d046:trMA.Ode8C1T.text
ltx/gr_redirects_goarch/tr.d046:trMA.Ode8C21.greekmelody	@ltx/gr_gr_cog/tr.d046:trMA.Ode8C21.greekmelody
ltx/gr_redirects_goarch/tr.d046:trMA.Ode8C21.incipit	@ltx/gr_gr_cog/tr.d046:trMA.Ode8C21.incipit
ltx/gr_redirects_goarch/tr.d046:trMA.Ode8C21.melody	@ltx/gr_gr_cog/tr.d046:trMA.Ode8C21.melody
ltx/gr_redirects_goarch/tr.d046:trMA.Ode8C21.mode	@ltx/gr_gr_cog/tr.d046:trMA.Ode8C21.mode
ltx/gr_redirects_goarch/tr.d046:trMA.Ode8C21.ode	@ltx/gr_gr_cog/tr.d046:trMA.Ode8C21.ode
ltx/gr_redirects_goarch/tr.d046:trMA.Ode8C21.text	@ltx/gr_gr_cog/tr.d046:trMA.Ode8C21.text
ltx/gr_redirects_goarch/tr.d046:trMA.Ode8C22.incipit	@ltx/gr_gr_cog/tr.d046:trMA.Ode8C22.incipit
ltx/gr_redirects_goarch/tr.d046:trMA.Ode8C22.melody	@ltx/gr_gr_cog/tr.d046:trMA.Ode8C22.melody
ltx/gr_redirects_goarch/tr.d046:trMA.Ode8C22.mode	@ltx/gr_gr_cog/tr.d046:trMA.Ode8C22.mode
ltx/gr_redirects_goarch/tr.d046:trMA.Ode8C22.ode	@ltx/gr_gr_cog/tr.d046:trMA.Ode8C22.ode
ltx/gr_redirects_goarch/tr.d046:trMA.Ode8C22.text	@ltx/gr_gr_cog/tr.d046:trMA.Ode8C22.text
ltx/gr_redirects_goarch/tr.d046:trMA.Ode8C23.incipit	@ltx/gr_gr_cog/tr.d046:trMA.Ode8C23.incipit
ltx/gr_redirects_goarch/tr.d046:trMA.Ode8C23.melody	@ltx/gr_gr_cog/tr.d046:trMA.Ode8C23.melody
ltx/gr_redirects_goarch/tr.d046:trMA.Ode8C23.mode	@ltx/gr_gr_cog/tr.d046:trMA.Ode8C23.mode
ltx/gr_redirects_goarch/tr.d046:trMA.Ode8C23.ode	@ltx/gr_gr_cog/tr.d046:trMA.Ode8C23.ode
ltx/gr_redirects_goarch/tr.d046:trMA.Ode8C23.text	@ltx/gr_gr_cog/tr.d046:trMA.Ode8C23.text
ltx/gr_redirects_goarch/tr.d046:trMA.Ode8C2T.incipit	@ltx/gr_gr_cog/tr.d046:trMA.Ode8C2T.incipit
ltx/gr_redirects_goarch/tr.d046:trMA.Ode8C2T.melody	@ltx/gr_gr_cog/tr.d046:trMA.Ode8C2T.melody
ltx/gr_redirects_goarch/tr.d046:trMA.Ode8C2T.mode	@ltx/gr_gr_cog/tr.d046:trMA.Ode8C2T.mode
ltx/gr_redirects_goarch/tr.d046:trMA.Ode8C2T.ode	@ltx/gr_gr_cog/tr.d046:trMA.Ode8C2T.ode
ltx/gr_redirects_goarch/tr.d046:trMA.Ode8C2T.text	@ltx/gr_gr_cog/tr.d046:trMA.Ode8C2T.text
ltx/gr_redirects_goarch/tr.d046:trMA.Ode8C31.greekmelody	@ltx/gr_gr_cog/tr.d046:trMA.Ode8C31.greekmelody
ltx/gr_redirects_goarch/tr.d046:trMA.Ode8C31.incipit	@ltx/gr_gr_cog/tr.d046:trMA.Ode8C31.incipit
ltx/gr_redirects_goarch/tr.d046:trMA.Ode8C31.melody	@ltx/gr_gr_cog/tr.d046:trMA.Ode8C31.melody
ltx/gr_redirects_goarch/tr.d046:trMA.Ode8C31.mode	@ltx/gr_gr_cog/tr.d046:trMA.Ode8C31.mode
ltx/gr_redirects_goarch/tr.d046:trMA.Ode8C31.ode	@ltx/gr_gr_cog/tr.d046:trMA.Ode8C31.ode
ltx/gr_redirects_goarch/tr.d046:trMA.Ode8C31.text	@ltx/gr_gr_cog/tr.d046:trMA.Ode8C31.text
ltx/gr_redirects_goarch/tr.d046:trMA.Ode8C32.incipit	@ltx/gr_gr_cog/tr.d046:trMA.Ode8C32.incipit
ltx/gr_redirects_goarch/tr.d046:trMA.Ode8C32.melody	@ltx/gr_gr_cog/tr.d046:trMA.Ode8C32.melody
ltx/gr_redirects_goarch/tr.d046:trMA.Ode8C32.mode	@ltx/gr_gr_cog/tr.d046:trMA.Ode8C32.mode
ltx/gr_redirects_goarch/tr.d046:trMA.Ode8C32.ode	@ltx/gr_gr_cog/tr.d046:trMA.Ode8C32.ode
ltx/gr_redirects_goarch/tr.d046:trMA.Ode8C32.text	@ltx/gr_gr_cog/tr.d046:trMA.Ode8C32.text
ltx/gr_redirects_goarch/tr.d046:trMA.Ode8C3A1.incipit	@ltx/gr_gr_cog/tr.d046:trMA.Ode8C3A1.incipit
ltx/gr_redirects_goarch/tr.d046:trMA.Ode8C3A1.melody	@ltx/gr_gr_cog/tr.d046:trMA.Ode8C3A1.melody
ltx/gr_redirects_goarch/tr.d046:trMA.Ode8C3A1.mode	@ltx/gr_gr_cog/tr.d046:trMA.Ode8C3A1.mode
ltx/gr_redirects_goarch/tr.d046:trMA.Ode8C3A1.ode	@ltx/gr_gr_cog/tr.d046:trMA.Ode8C3A1.ode
ltx/gr_redirects_goarch/tr.d046:trMA.Ode8C3A1.text	@ltx/gr_gr_cog/tr.d046:trMA.Ode8C3A1.text
ltx/gr_redirects_goarch/tr.d046:trMA.Ode8C3H.greekmelody	@ltx/gr_gr_cog/tr.d046:trMA.Ode8C3H.greekmelody
ltx/gr_redirects_goarch/tr.d046:trMA.Ode8C3H.incipit	@ltx/gr_gr_cog/tr.d046:trMA.Ode8C3H.incipit
ltx/gr_redirects_goarch/tr.d046:trMA.Ode8C3H.melody	@ltx/gr_gr_cog/tr.d046:trMA.Ode8C3H.melody
ltx/gr_redirects_goarch/tr.d046:trMA.Ode8C3H.mode	@ltx/gr_gr_cog/tr.d046:trMA.Ode8C3H.mode
ltx/gr_redirects_goarch/tr.d046:trMA.Ode8C3H.ode	@ltx/gr_gr_cog/tr.d046:trMA.Ode8C3H.ode
ltx/gr_redirects_goarch/tr.d046:trMA.Ode8C3H.text	@ltx/gr_gr_cog/tr.d046:trMA.Ode8C3H.text
ltx/gr_redirects_goarch/tr.d046:trMA.Ode8C3T.incipit	@ltx/gr_gr_cog/tr.d046:trMA.Ode8C3T.incipit
ltx/gr_redirects_goarch/tr.d046:trMA.Ode8C3T.melody	@ltx/gr_gr_cog/tr.d046:trMA.Ode8C3T.melody
ltx/gr_redirects_goarch/tr.d046:trMA.Ode8C3T.mode	@ltx/gr_gr_cog/tr.d046:trMA.Ode8C3T.mode
ltx/gr_redirects_goarch/tr.d046:trMA.Ode8C3T.ode	@ltx/gr_gr_cog/tr.d046:trMA.Ode8C3T.ode
ltx/gr_redirects_goarch/tr.d046:trMA.Ode8C3T.text	@ltx/gr_gr_cog/tr.d046:trMA.Ode8C3T.text
ltx/gr_redirects_goarch/tr.d046:trMA.Ode8C3Tr.incipit	@ltx/gr_gr_cog/tr.d046:trMA.Ode8C3Tr.incipit
ltx/gr_redirects_goarch/tr.d046:trMA.Ode8C3Tr.melody	@ltx/gr_gr_cog/tr.d046:trMA.Ode8C3Tr.melody
ltx/gr_redirects_goarch/tr.d046:trMA.Ode8C3Tr.mode	@ltx/gr_gr_cog/tr.d046:trMA.Ode8C3Tr.mode
ltx/gr_redirects_goarch/tr.d046:trMA.Ode8C3Tr.ode	@ltx/gr_gr_cog/tr.d046:trMA.Ode8C3Tr.ode
ltx/gr_redirects_goarch/tr.d046:trMA.Ode8C3Tr.text	@ltx/gr_gr_cog/tr.d046:trMA.Ode8C3Tr.text
ltx/gr_redirects_goarch/tr.d046:trMA.Ode9C11.greekmelody	@ltx/gr_gr_cog/tr.d046:trMA.Ode9C11.greekmelody
ltx/gr_redirects_goarch/tr.d046:trMA.Ode9C11.incipit	@ltx/gr_gr_cog/tr.d046:trMA.Ode9C11.incipit
ltx/gr_redirects_goarch/tr.d046:trMA.Ode9C11.melody	@ltx/gr_gr_cog/tr.d046:trMA.Ode9C11.melody
ltx/gr_redirects_goarch/tr.d046:trMA.Ode9C11.mode	@ltx/gr_gr_cog/tr.d046:trMA.Ode9C11.mode
ltx/gr_redirects_goarch/tr.d046:trMA.Ode9C11.ode	@ltx/gr_gr_cog/tr.d046:trMA.Ode9C11.ode
ltx/gr_redirects_goarch/tr.d046:trMA.Ode9C11.text	@ltx/gr_gr_cog/tr.d046:trMA.Ode9C11.text
ltx/gr_redirects_goarch/tr.d046:trMA.Ode9C12.incipit	@ltx/gr_gr_cog/tr.d046:trMA.Ode9C12.incipit
ltx/gr_redirects_goarch/tr.d046:trMA.Ode9C12.melody	@ltx/gr_gr_cog/tr.d046:trMA.Ode9C12.melody
ltx/gr_redirects_goarch/tr.d046:trMA.Ode9C12.mode	@ltx/gr_gr_cog/tr.d046:trMA.Ode9C12.mode
ltx/gr_redirects_goarch/tr.d046:trMA.Ode9C12.ode	@ltx/gr_gr_cog/tr.d046:trMA.Ode9C12.ode
ltx/gr_redirects_goarch/tr.d046:trMA.Ode9C12.text	@ltx/gr_gr_cog/tr.d046:trMA.Ode9C12.text
ltx/gr_redirects_goarch/tr.d046:trMA.Ode9C13.incipit	@ltx/gr_gr_cog/tr.d046:trMA.Ode9C13.incipit
ltx/gr_redirects_goarch/tr.d046:trMA.Ode9C13.melody	@ltx/gr_gr_cog/tr.d046:trMA.Ode9C13.melody
ltx/gr_redirects_goarch/tr.d046:trMA.Ode9C13.mode	@ltx/gr_gr_cog/tr.d046:trMA.Ode9C13.mode
ltx/gr_redirects_goarch/tr.d046:trMA.Ode9C13.ode	@ltx/gr_gr_cog/tr.d046:trMA.Ode9C13.ode
ltx/gr_redirects_goarch/tr.d046:trMA.Ode9C13.text	@ltx/gr_gr_cog/tr.d046:trMA.Ode9C13.text
ltx/gr_redirects_goarch/tr.d046:trMA.Ode9C1H.greekmelody	@ltx/gr_gr_cog/tr.d046:trMA.Ode9C1H.greekmelody
ltx/gr_redirects_goarch/tr.d046:trMA.Ode9C1H.incipit	@ltx/gr_gr_cog/tr.d046:trMA.Ode9C1H.incipit
ltx/gr_redirects_goarch/tr.d046:trMA.Ode9C1H.melody	@ltx/gr_gr_cog/tr.d046:trMA.Ode9C1H.melody
ltx/gr_redirects_goarch/tr.d046:trMA.Ode9C1H.mode	@ltx/gr_gr_cog/tr.d046:trMA.Ode9C1H.mode
ltx/gr_redirects_goarch/tr.d046:trMA.Ode9C1H.ode	@ltx/gr_gr_cog/tr.d046:trMA.Ode9C1H.ode
ltx/gr_redirects_goarch/tr.d046:trMA.Ode9C1H.text	@ltx/gr_gr_cog/tr.d046:trMA.Ode9C1H.text
ltx/gr_redirects_goarch/tr.d046:trMA.Ode9C1T.incipit	@ltx/gr_gr_cog/tr.d046:trMA.Ode9C1T.incipit
ltx/gr_redirects_goarch/tr.d046:trMA.Ode9C1T.melody	@ltx/gr_gr_cog/tr.d046:trMA.Ode9C1T.melody
ltx/gr_redirects_goarch/tr.d046:trMA.Ode9C1T.mode	@ltx/gr_gr_cog/tr.d046:trMA.Ode9C1T.mode
ltx/gr_redirects_goarch/tr.d046:trMA.Ode9C1T.ode	@ltx/gr_gr_cog/tr.d046:trMA.Ode9C1T.ode
ltx/gr_redirects_goarch/tr.d046:trMA.Ode9C1T.text	@ltx/gr_gr_cog/tr.d046:trMA.Ode9C1T.text
ltx/gr_redirects_goarch/tr.d046:trMA.Ode9C21.greekmelody	@ltx/gr_gr_cog/tr.d046:trMA.Ode9C21.greekmelody
ltx/gr_redirects_goarch/tr.d046:trMA.Ode9C21.incipit	@ltx/gr_gr_cog/tr.d046:trMA.Ode9C21.incipit
ltx/gr_redirects_goarch/tr.d046:trMA.Ode9C21.melody	@ltx/gr_gr_cog/tr.d046:trMA.Ode9C21.melody
ltx/gr_redirects_goarch/tr.d046:trMA.Ode9C21.mode	@ltx/gr_gr_cog/tr.d046:trMA.Ode9C21.mode
ltx/gr_redirects_goarch/tr.d046:trMA.Ode9C21.ode	@ltx/gr_gr_cog/tr.d046:trMA.Ode9C21.ode
ltx/gr_redirects_goarch/tr.d046:trMA.Ode9C21.text	@ltx/gr_gr_cog/tr.d046:trMA.Ode9C21.text
ltx/gr_redirects_goarch/tr.d046:trMA.Ode9C22.incipit	@ltx/gr_gr_cog/tr.d046:trMA.Ode9C22.incipit
ltx/gr_redirects_goarch/tr.d046:trMA.Ode9C22.melody	@ltx/gr_gr_cog/tr.d046:trMA.Ode9C22.melody
ltx/gr_redirects_goarch/tr.d046:trMA.Ode9C22.mode	@ltx/gr_gr_cog/tr.d046:trMA.Ode9C22.mode
ltx/gr_redirects_goarch/tr.d046:trMA.Ode9C22.ode	@ltx/gr_gr_cog/tr.d046:trMA.Ode9C22.ode
ltx/gr_redirects_goarch/tr.d046:trMA.Ode9C22.text	@ltx/gr_gr_cog/tr.d046:trMA.Ode9C22.text
ltx/gr_redirects_goarch/tr.d046:trMA.Ode9C23.incipit	@ltx/gr_gr_cog/tr.d046:trMA.Ode9C23.incipit
ltx/gr_redirects_goarch/tr.d046:trMA.Ode9C23.melody	@ltx/gr_gr_cog/tr.d046:trMA.Ode9C23.melody
ltx/gr_redirects_goarch/tr.d046:trMA.Ode9C23.mode	@ltx/gr_gr_cog/tr.d046:trMA.Ode9C23.mode
ltx/gr_redirects_goarch/tr.d046:trMA.Ode9C23.ode	@ltx/gr_gr_cog/tr.d046:trMA.Ode9C23.ode
ltx/gr_redirects_goarch/tr.d046:trMA.Ode9C23.text	@ltx/gr_gr_cog/tr.d046:trMA.Ode9C23.text
ltx/gr_redirects_goarch/tr.d046:trMA.Ode9C2T.incipit	@ltx/gr_gr_cog/tr.d046:trMA.Ode9C2T.incipit
ltx/gr_redirects_goarch/tr.d046:trMA.Ode9C2T.melody	@ltx/gr_gr_cog/tr.d046:trMA.Ode9C2T.melody
ltx/gr_redirects_goarch/tr.d046:trMA.Ode9C2T.mode	@ltx/gr_gr_cog/tr.d046:trMA.Ode9C2T.mode
ltx/gr_redirects_goarch/tr.d046:trMA.Ode9C2T.ode	@ltx/gr_gr_cog/tr.d046:trMA.Ode9C2T.ode
ltx/gr_redirects_goarch/tr.d046:trMA.Ode9C2T.text	@ltx/gr_gr_cog/tr.d046:trMA.Ode9C2T.text
ltx/gr_redirects_goarch/tr.d046:trMA.Ode9C31.greekmelody	@ltx/gr_gr_cog/tr.d046:trMA.Ode9C31.greekmelody
ltx/gr_redirects_goarch/tr.d046:trMA.Ode9C31.incipit	@ltx/gr_gr_cog/tr.d046:trMA.Ode9C31.incipit
ltx/gr_redirects_goarch/tr.d046:trMA.Ode9C31.melody	@ltx/gr_gr_cog/tr.d046:trMA.Ode9C31.melody
ltx/gr_redirects_goarch/tr.d046:trMA.Ode9C31.mode	@ltx/gr_gr_cog/tr.d046:trMA.Ode9C31.mode
ltx/gr_redirects_goarch/tr.d046:trMA.Ode9C31.ode	@ltx/gr_gr_cog/tr.d046:trMA.Ode9C31.ode
ltx/gr_redirects_goarch/tr.d046:trMA.Ode9C31.text	@ltx/gr_gr_cog/tr.d046:trMA.Ode9C31.text
ltx/gr_redirects_goarch/tr.d046:trMA.Ode9C32.incipit	@ltx/gr_gr_cog/tr.d046:trMA.Ode9C32.incipit
ltx/gr_redirects_goarch/tr.d046:trMA.Ode9C32.melody	@ltx/gr_gr_cog/tr.d046:trMA.Ode9C32.melody
ltx/gr_redirects_goarch/tr.d046:trMA.Ode9C32.mode	@ltx/gr_gr_cog/tr.d046:trMA.Ode9C32.mode
ltx/gr_redirects_goarch/tr.d046:trMA.Ode9C32.ode	@ltx/gr_gr_cog/tr.d046:trMA.Ode9C32.ode
ltx/gr_redirects_goarch/tr.d046:trMA.Ode9C32.text	@ltx/gr_gr_cog/tr.d046:trMA.Ode9C32.text
ltx/gr_redirects_goarch/tr.d046:trMA.Ode9C3A1.incipit	@ltx/gr_gr_cog/tr.d046:trMA.Ode9C3A1.incipit
ltx/gr_redirects_goarch/tr.d046:trMA.Ode9C3A1.melody	@ltx/gr_gr_cog/tr.d046:trMA.Ode9C3A1.melody
ltx/gr_redirects_goarch/tr.d046:trMA.Ode9C3A1.mode	@ltx/gr_gr_cog/tr.d046:trMA.Ode9C3A1.mode
ltx/gr_redirects_goarch/tr.d046:trMA.Ode9C3A1.ode	@ltx/gr_gr_cog/tr.d046:trMA.Ode9C3A1.ode
ltx/gr_redirects_goarch/tr.d046:trMA.Ode9C3A1.text	@ltx/gr_gr_cog/tr.d046:trMA.Ode9C3A1.text
ltx/gr_redirects_goarch/tr.d046:trMA.Ode9C3H.greekmelody	@ltx/gr_gr_cog/tr.d046:trMA.Ode9C3H.greekmelody
ltx/gr_redirects_goarch/tr.d046:trMA.Ode9C3H.incipit	@ltx/gr_gr_cog/tr.d046:trMA.Ode9C3H.incipit
ltx/gr_redirects_goarch/tr.d046:trMA.Ode9C3H.melody	@ltx/gr_gr_cog/tr.d046:trMA.Ode9C3H.melody
ltx/gr_redirects_goarch/tr.d046:trMA.Ode9C3H.mode	@ltx/gr_gr_cog/tr.d046:trMA.Ode9C3H.mode
ltx/gr_redirects_goarch/tr.d046:trMA.Ode9C3H.ode	@ltx/gr_gr_cog/tr.d046:trMA.Ode9C3H.ode
ltx/gr_redirects_goarch/tr.d046:trMA.Ode9C3H.text	@ltx/gr_gr_cog/tr.d046:trMA.Ode9C3H.text
ltx/gr_redirects_goarch/tr.d046:trMA.Ode9C3T.incipit	@ltx/gr_gr_cog/tr.d046:trMA.Ode9C3T.incipit
ltx/gr_redirects_goarch/tr.d046:trMA.Ode9C3T.melody	@ltx/gr_gr_cog/tr.d046:trMA.Ode9C3T.melody
ltx/gr_redirects_goarch/tr.d046:trMA.Ode9C3T.mode	@ltx/gr_gr_cog/tr.d046:trMA.Ode9C3T.mode
ltx/gr_redirects_goarch/tr.d046:trMA.Ode9C3T.ode	@ltx/gr_gr_cog/tr.d046:trMA.Ode9C3T.ode
ltx/gr_redirects_goarch/tr.d046:trMA.Ode9C3T.text	@ltx/gr_gr_cog/tr.d046:trMA.Ode9C3T.text
ltx/gr_redirects_goarch/tr.d046:trMA.Ode9C3Tr.incipit	@ltx/gr_gr_cog/tr.d046:trMA.Ode9C3Tr.incipit
ltx/gr_redirects_goarch/tr.d046:trMA.Ode9C3Tr.melody	@ltx/gr_gr_cog/tr.d046:trMA.Ode9C3Tr.melody
ltx/gr_redirects_goarch/tr.d046:trMA.Ode9C3Tr.mode	@ltx/gr_gr_cog/tr.d046:trMA.Ode9C3Tr.mode
ltx/gr_redirects_goarch/tr.d046:trMA.Ode9C3Tr.ode	@ltx/gr_gr_cog/tr.d046:trMA.Ode9C3Tr.ode
ltx/gr_redirects_goarch/tr.d046:trMA.Ode9C3Tr.text	@ltx/gr_gr_cog/tr.d046:trMA.Ode9C3Tr.text
ltx/gr_redirects_goarch/tr.d046:trMA.Oikos1.text	@ltx/gr_gr_cog/tr.d046:trMA.Oikos1.text
ltx/gr_redirects_goarch/tr.d046:trTE.Troparion.incipit	@ltx/gr_gr_cog/tr.d046:trTE.Troparion.incipit
ltx/gr_redirects_goarch/tr.d046:trTE.Troparion.melody	@ltx/gr_gr_cog/tr.d046:trTE.Troparion.melody
ltx/gr_redirects_goarch/tr.d046:trTE.Troparion.mode	@ltx/gr_gr_cog/tr.d046:trTE.Troparion.mode
ltx/gr_redirects_goarch/tr.d046:trTE.Troparion.text	@ltx/gr_gr_cog/tr.d046:trTE.Troparion.text
ltx/gr_redirects_goarch/tr.d046:trTE.Troparion2.incipit	@ltx/gr_gr_cog/tr.d046:trTE.Troparion2.incipit
ltx/gr_redirects_goarch/tr.d046:trTE.Troparion2.text	@ltx/gr_gr_cog/tr.d046:trTE.Troparion2.text
ltx/gr_redirects_goarch/tr.d046:trVE.AposGlory.incipit	@ltx/gr_gr_cog/tr.d046:trVE.AposGlory.incipit
ltx/gr_redirects_goarch/tr.d046:trVE.AposGlory.melody	@ltx/gr_gr_cog/tr.d046:trVE.AposGlory.melody
ltx/gr_redirects_goarch/tr.d046:trVE.AposGlory.mode	@ltx/gr_gr_cog/tr.d046:trVE.AposGlory.mode
ltx/gr_redirects_goarch/tr.d046:trVE.AposGlory.text	@ltx/gr_gr_cog/tr.d046:trVE.AposGlory.text
ltx/gr_redirects_goarch/tr.d046:trVE.AposIdiomelon1.incipit	@ltx/gr_gr_cog/tr.d046:trVE.AposIdiomelon1.incipit
ltx/gr_redirects_goarch/tr.d046:trVE.AposIdiomelon1.melody	@ltx/gr_gr_cog/tr.d046:trVE.AposIdiomelon1.melody
ltx/gr_redirects_goarch/tr.d046:trVE.AposIdiomelon1.mode	@ltx/gr_gr_cog/tr.d046:trVE.AposIdiomelon1.mode
ltx/gr_redirects_goarch/tr.d046:trVE.AposIdiomelon1.text	@ltx/gr_gr_cog/tr.d046:trVE.AposIdiomelon1.text
ltx/gr_redirects_goarch/tr.d046:trVE.AposMartyric.incipit	@ltx/gr_gr_cog/tr.d046:trVE.AposMartyric.incipit
ltx/gr_redirects_goarch/tr.d046:trVE.AposMartyric.melody	@ltx/gr_gr_cog/tr.d046:trVE.AposMartyric.melody
ltx/gr_redirects_goarch/tr.d046:trVE.AposMartyric.mode	@ltx/gr_gr_cog/tr.d046:trVE.AposMartyric.mode
ltx/gr_redirects_goarch/tr.d046:trVE.AposMartyric.text	@ltx/gr_gr_cog/tr.d046:trVE.AposMartyric.text
ltx/gr_redirects_goarch/tr.d046:trVE.MM.Stichera456as8910.text	@ltx/gr_gr_cog/tr.d046:trVE.MM.Stichera456as8910.text
ltx/gr_redirects_goarch/tr.d046:trVE.SticGlory.incipit	@ltx/gr_gr_cog/tr.d046:trVE.SticGlory.incipit
ltx/gr_redirects_goarch/tr.d046:trVE.SticGlory.melody	@ltx/gr_gr_cog/tr.d046:trVE.SticGlory.melody
ltx/gr_redirects_goarch/tr.d046:trVE.SticGlory.mode	@ltx/gr_gr_cog/tr.d046:trVE.SticGlory.mode
ltx/gr_redirects_goarch/tr.d046:trVE.SticGlory.text	@ltx/gr_gr_cog/tr.d046:trVE.SticGlory.text
ltx/gr_redirects_goarch/tr.d046:trVE.Stichera01.greekmelody	@ltx/gr_gr_cog/tr.d046:trVE.Stichera01.greekmelody
ltx/gr_redirects_goarch/tr.d046:trVE.Stichera01.incipit	@ltx/gr_gr_cog/tr.d046:trVE.Stichera01.incipit
ltx/gr_redirects_goarch/tr.d046:trVE.Stichera01.melody	@ltx/gr_gr_cog/tr.d046:trVE.Stichera01.melody
ltx/gr_redirects_goarch/tr.d046:trVE.Stichera01.mode	@ltx/gr_gr_cog/tr.d046:trVE.Stichera01.mode
ltx/gr_redirects_goarch/tr.d046:trVE.Stichera01.text	@ltx/gr_gr_cog/tr.d046:trVE.Stichera01.text
ltx/gr_redirects_goarch/tr.d046:trVE.Stichera02.greekmelody	@ltx/gr_gr_cog/tr.d046:trVE.Stichera02.greekmelody
ltx/gr_redirects_goarch/tr.d046:trVE.Stichera02.incipit	@ltx/gr_gr_cog/tr.d046:trVE.Stichera02.incipit
ltx/gr_redirects_goarch/tr.d046:trVE.Stichera02.melody	@ltx/gr_gr_cog/tr.d046:trVE.Stichera02.melody
ltx/gr_redirects_goarch/tr.d046:trVE.Stichera02.mode	@ltx/gr_gr_cog/tr.d046:trVE.Stichera02.mode
ltx/gr_redirects_goarch/tr.d046:trVE.Stichera02.text	@ltx/gr_gr_cog/tr.d046:trVE.Stichera02.text
ltx/gr_redirects_goarch/tr.d046:trVE.Stichera03.incipit	@ltx/gr_gr_cog/tr.d046:trVE.Stichera03.incipit
ltx/gr_redirects_goarch/tr.d046:trVE.Stichera03.melody	@ltx/gr_gr_cog/tr.d046:trVE.Stichera03.melody
ltx/gr_redirects_goarch/tr.d046:trVE.Stichera03.mode	@ltx/gr_gr_cog/tr.d046:trVE.Stichera03.mode
ltx/gr_redirects_goarch/tr.d046:trVE.Stichera03.text	@ltx/gr_gr_cog/tr.d046:trVE.Stichera03.text
ltx/gr_redirects_goarch/tr.d046:trVE.Stichera04.greekmelody	@ltx/gr_gr_cog/tr.d046:trVE.Stichera04.greekmelody
ltx/gr_redirects_goarch/tr.d046:trVE.Stichera04.incipit	@ltx/gr_gr_cog/tr.d046:trVE.Stichera04.incipit
ltx/gr_redirects_goarch/tr.d046:trVE.Stichera04.melody	@ltx/gr_gr_cog/tr.d046:trVE.Stichera04.melody
ltx/gr_redirects_goarch/tr.d046:trVE.Stichera04.mode	@ltx/gr_gr_cog/tr.d046:trVE.Stichera04.mode
ltx/gr_redirects_goarch/tr.d046:trVE.Stichera04.text	@ltx/gr_gr_cog/tr.d046:trVE.Stichera04.text
ltx/gr_redirects_goarch/tr.d046:trVE.Stichera05.incipit	@ltx/gr_gr_cog/tr.d046:trVE.Stichera05.incipit
ltx/gr_redirects_goarch/tr.d046:trVE.Stichera05.melody	@ltx/gr_gr_cog/tr.d046:trVE.Stichera05.melody
ltx/gr_redirects_goarch/tr.d046:trVE.Stichera05.mode	@ltx/gr_gr_cog/tr.d046:trVE.Stichera05.mode
ltx/gr_redirects_goarch/tr.d046:trVE.Stichera05.text	@ltx/gr_gr_cog/tr.d046:trVE.Stichera05.text
ltx/gr_redirects_goarch/tr.d046:trVE.Stichera06.incipit	@ltx/gr_gr_cog/tr.d046:trVE.Stichera06.incipit
ltx/gr_redirects_goarch/tr.d046:trVE.Stichera06.melody	@ltx/gr_gr_cog/tr.d046:trVE.Stichera06.melody
ltx/gr_redirects_goarch/tr.d046:trVE.Stichera06.mode	@ltx/gr_gr_cog/tr.d046:trVE.Stichera06.mode
ltx/gr_redirects_goarch/tr.d046:trVE.Stichera06.text	@ltx/gr_gr_cog/tr.d046:trVE.Stichera06.text
