ltx/gr_redirects_goarch/le.go.mc.d131:lemcLI.Gospel.book_abbr	@ltx/gr_gr_cog/le.go.mc.d131:lemcLI.Gospel.book_abbr
ltx/gr_redirects_goarch/le.go.mc.d131:lemcLI.Gospel.book_string	@ltx/gr_gr_cog/le.go.mc.d131:lemcLI.Gospel.book_string
ltx/gr_redirects_goarch/le.go.mc.d131:lemcLI.Gospel.chapverse	@ltx/gr_gr_cog/le.go.mc.d131:lemcLI.Gospel.chapverse
ltx/gr_redirects_goarch/le.go.mc.d131:lemcLI.Gospel.incipit	@ltx/gr_gr_cog/le.go.mc.d131:lemcLI.Gospel.incipit
ltx/gr_redirects_goarch/le.go.mc.d131:lemcLI.Gospel.text	@ltx/gr_gr_cog/le.go.mc.d131:lemcLI.Gospel.text
ltx/gr_redirects_goarch/le.go.mc.d131:lemcLI.Gospel.title	@ltx/gr_gr_cog/le.go.mc.d131:lemcLI.Gospel.title
ltx/gr_redirects_goarch/le.go.mc.d131:lemcLI.Gospel.title_abbr	@ltx/gr_gr_cog/le.go.mc.d131:lemcLI.Gospel.title_abbr
ltx/gr_redirects_goarch/le.go.mc.d131:lemcLI.Gospel.version	@ltx/gr_gr_cog/le.go.mc.d131:lemcLI.Gospel.version
