ltx/gr_redirects_goarch/me.m12.d31:meDA.commemoration.first	@ltx/gr_gr_cog/me.m12.d31:meDA.commemoration.first
ltx/gr_redirects_goarch/me.m12.d31:meDA.commemoration.first_name	@ltx/gr_gr_cog/me.m12.d31:meDA.commemoration.first_name
ltx/gr_redirects_goarch/me.m12.d31:meDA.commemoration.first_short	@ltx/gr_gr_cog/me.m12.d31:meDA.commemoration.first_short
ltx/gr_redirects_goarch/me.m12.d31:meDA.commemoration.first_title	@ltx/gr_gr_cog/me.m12.d31:meDA.commemoration.first_title
ltx/gr_redirects_goarch/me.m12.d31:meDA.commemoration.full	@ltx/gr_gr_cog/me.m12.d31:meDA.commemoration.full
ltx/gr_redirects_goarch/me.m12.d31:meDA.commemoration.second_name	@ltx/gr_gr_cog/me.m12.d31:meDA.commemoration.second_name
ltx/gr_redirects_goarch/me.m12.d31:meDA.commemoration.second_title	@ltx/gr_gr_cog/me.m12.d31:meDA.commemoration.second_title
ltx/gr_redirects_goarch/me.m12.d31:meDA.date	@ltx/gr_gr_cog/me.m12.d31:meDA.date
ltx/gr_redirects_goarch/me.m12.d31:meDA.dismissal	@ltx/gr_gr_cog/me.m12.d31:meDA.dismissal
ltx/gr_redirects_goarch/me.m12.d31:meDA.fordate	@ltx/gr_gr_cog/me.m12.d31:meDA.fordate
ltx/gr_redirects_goarch/me.m12.d31:meDA.insert1	@ltx/gr_gr_cog/me.m12.d31:meDA.insert1
ltx/gr_redirects_goarch/me.m12.d31:meDA.insert2	@ltx/gr_gr_cog/me.m12.d31:meDA.insert2
ltx/gr_redirects_goarch/me.m12.d31:meDA.note	@ltx/gr_gr_cog/me.m12.d31:meDA.note
ltx/gr_redirects_goarch/me.m12.d31:meDA.pdfcoverdate	@ltx/gr_gr_cog/me.m12.d31:meDA.pdfcoverdate
ltx/gr_redirects_goarch/me.m12.d31:meDA.pdfheaderdate	@ltx/gr_gr_cog/me.m12.d31:meDA.pdfheaderdate
ltx/gr_redirects_goarch/me.m12.d31:meHO.commemorations	@ltx/gr_gr_cog/me.m12.d31:meHO.commemorations
ltx/gr_redirects_goarch/me.m12.d31:meHO.note1	@ltx/gr_gr_cog/me.m12.d31:meHO.note1
ltx/gr_redirects_goarch/me.m12.d31:meHO.note2	@ltx/gr_gr_cog/me.m12.d31:meHO.note2
ltx/gr_redirects_goarch/me.m12.d31:meHO.number	@ltx/gr_gr_cog/me.m12.d31:meHO.number
ltx/gr_redirects_goarch/me.m12.d31:meHO.rank	@ltx/gr_gr_cog/me.m12.d31:meHO.rank
ltx/gr_redirects_goarch/me.m12.d31:meLE.commemoration1	@ltx/gr_gr_cog/me.m12.d31:meLE.commemoration1
ltx/gr_redirects_goarch/me.m12.d31:meLE.commemoration2	@ltx/gr_gr_cog/me.m12.d31:meLE.commemoration2
ltx/gr_redirects_goarch/me.m12.d31:meMA.Synaxarion.text	@ltx/gr_gr_cog/me.m12.d31:meMA.Synaxarion.text
