ltx/gr_redirects_goarch/eu.footwashing:euFW.Idiomelon1.incipit	@ltx/gr_gr_cog/eu.footwashing:euFW.Idiomelon1.incipit
ltx/gr_redirects_goarch/eu.footwashing:euFW.Idiomelon1.melody	@ltx/gr_gr_cog/eu.footwashing:euFW.Idiomelon1.melody
ltx/gr_redirects_goarch/eu.footwashing:euFW.Idiomelon1.mode	@ltx/gr_gr_cog/eu.footwashing:euFW.Idiomelon1.mode
ltx/gr_redirects_goarch/eu.footwashing:euFW.Idiomelon1.text	@ltx/gr_gr_cog/eu.footwashing:euFW.Idiomelon1.text
ltx/gr_redirects_goarch/eu.footwashing:euFW.Idiomelon2.incipit	@ltx/gr_gr_cog/eu.footwashing:euFW.Idiomelon2.incipit
ltx/gr_redirects_goarch/eu.footwashing:euFW.Idiomelon2.melody	@ltx/gr_gr_cog/eu.footwashing:euFW.Idiomelon2.melody
ltx/gr_redirects_goarch/eu.footwashing:euFW.Idiomelon2.mode	@ltx/gr_gr_cog/eu.footwashing:euFW.Idiomelon2.mode
ltx/gr_redirects_goarch/eu.footwashing:euFW.Idiomelon2.text	@ltx/gr_gr_cog/eu.footwashing:euFW.Idiomelon2.text
ltx/gr_redirects_goarch/eu.footwashing:euFW.Idiomelon3.incipit	@ltx/gr_gr_cog/eu.footwashing:euFW.Idiomelon3.incipit
ltx/gr_redirects_goarch/eu.footwashing:euFW.Idiomelon3.melody	@ltx/gr_gr_cog/eu.footwashing:euFW.Idiomelon3.melody
ltx/gr_redirects_goarch/eu.footwashing:euFW.Idiomelon3.mode	@ltx/gr_gr_cog/eu.footwashing:euFW.Idiomelon3.mode
ltx/gr_redirects_goarch/eu.footwashing:euFW.Idiomelon3.text	@ltx/gr_gr_cog/eu.footwashing:euFW.Idiomelon3.text
ltx/gr_redirects_goarch/eu.footwashing:euFW.Idiomelon4.incipit	@ltx/gr_gr_cog/eu.footwashing:euFW.Idiomelon4.incipit
ltx/gr_redirects_goarch/eu.footwashing:euFW.Idiomelon4.melody	@ltx/gr_gr_cog/eu.footwashing:euFW.Idiomelon4.melody
ltx/gr_redirects_goarch/eu.footwashing:euFW.Idiomelon4.mode	@ltx/gr_gr_cog/eu.footwashing:euFW.Idiomelon4.mode
ltx/gr_redirects_goarch/eu.footwashing:euFW.Idiomelon4.text	@ltx/gr_gr_cog/eu.footwashing:euFW.Idiomelon4.text
ltx/gr_redirects_goarch/eu.footwashing:euFW.Idiomelon5.incipit	@ltx/gr_gr_cog/eu.footwashing:euFW.Idiomelon5.incipit
ltx/gr_redirects_goarch/eu.footwashing:euFW.Idiomelon5.melody	@ltx/gr_gr_cog/eu.footwashing:euFW.Idiomelon5.melody
ltx/gr_redirects_goarch/eu.footwashing:euFW.Idiomelon5.mode	@ltx/gr_gr_cog/eu.footwashing:euFW.Idiomelon5.mode
ltx/gr_redirects_goarch/eu.footwashing:euFW.Idiomelon5.text	@ltx/gr_gr_cog/eu.footwashing:euFW.Idiomelon5.text
ltx/gr_redirects_goarch/eu.footwashing:euFW.Idiomelon6.incipit	@ltx/gr_gr_cog/eu.footwashing:euFW.Idiomelon6.incipit
ltx/gr_redirects_goarch/eu.footwashing:euFW.Idiomelon6.melody	@ltx/gr_gr_cog/eu.footwashing:euFW.Idiomelon6.melody
ltx/gr_redirects_goarch/eu.footwashing:euFW.Idiomelon6.mode	@ltx/gr_gr_cog/eu.footwashing:euFW.Idiomelon6.mode
ltx/gr_redirects_goarch/eu.footwashing:euFW.Idiomelon6.text	@ltx/gr_gr_cog/eu.footwashing:euFW.Idiomelon6.text
ltx/gr_redirects_goarch/eu.footwashing:euFW.title	@ltx/gr_gr_cog/eu.footwashing:euFW.title
