ltx/gr_redirects_goarch/sy.m04.d09:cl.syMA.commemoration01.text	@ltx/gr_gr_cog/sy.m04.d09:cl.syMA.commemoration01.text
ltx/gr_redirects_goarch/sy.m04.d09:cl.syMA.commemoration02.text	@ltx/gr_gr_cog/sy.m04.d09:cl.syMA.commemoration02.text
ltx/gr_redirects_goarch/sy.m04.d09:cl.syMA.commemoration03.text	@ltx/gr_gr_cog/sy.m04.d09:cl.syMA.commemoration03.text
ltx/gr_redirects_goarch/sy.m04.d09:cl.syMA.commemoration04.text	@ltx/gr_gr_cog/sy.m04.d09:cl.syMA.commemoration04.text
ltx/gr_redirects_goarch/sy.m04.d09:cl.syMA.commemoration05.text	@ltx/gr_gr_cog/sy.m04.d09:cl.syMA.commemoration05.text
ltx/gr_redirects_goarch/sy.m04.d09:cl.syMA.commemoration06.text	@ltx/gr_gr_cog/sy.m04.d09:cl.syMA.commemoration06.text
ltx/gr_redirects_goarch/sy.m04.d09:syMA.commemoration01.couplet1.title	@ltx/gr_gr_cog/sy.m04.d09:syMA.commemoration01.couplet1.title
ltx/gr_redirects_goarch/sy.m04.d09:syMA.commemoration01.couplet1.verse1	@ltx/gr_gr_cog/sy.m04.d09:syMA.commemoration01.couplet1.verse1
ltx/gr_redirects_goarch/sy.m04.d09:syMA.commemoration01.couplet1.verse2	@ltx/gr_gr_cog/sy.m04.d09:syMA.commemoration01.couplet1.verse2
ltx/gr_redirects_goarch/sy.m04.d09:syMA.commemoration01.narration.p01	@ltx/gr_gr_cog/sy.m04.d09:syMA.commemoration01.narration.p01
ltx/gr_redirects_goarch/sy.m04.d09:syMA.commemoration01.single1	@ltx/gr_gr_cog/sy.m04.d09:syMA.commemoration01.single1
ltx/gr_redirects_goarch/sy.m04.d09:syMA.commemoration01.text	@ltx/gr_gr_cog/sy.m04.d09:syMA.commemoration01.text
ltx/gr_redirects_goarch/sy.m04.d09:syMA.commemoration02.couplet1.title	@ltx/gr_gr_cog/sy.m04.d09:syMA.commemoration02.couplet1.title
ltx/gr_redirects_goarch/sy.m04.d09:syMA.commemoration02.couplet1.verse1	@ltx/gr_gr_cog/sy.m04.d09:syMA.commemoration02.couplet1.verse1
ltx/gr_redirects_goarch/sy.m04.d09:syMA.commemoration02.couplet1.verse2	@ltx/gr_gr_cog/sy.m04.d09:syMA.commemoration02.couplet1.verse2
ltx/gr_redirects_goarch/sy.m04.d09:syMA.commemoration02.text	@ltx/gr_gr_cog/sy.m04.d09:syMA.commemoration02.text
ltx/gr_redirects_goarch/sy.m04.d09:syMA.commemoration03.couplet1.title	@ltx/gr_gr_cog/sy.m04.d09:syMA.commemoration03.couplet1.title
ltx/gr_redirects_goarch/sy.m04.d09:syMA.commemoration03.couplet1.verse1	@ltx/gr_gr_cog/sy.m04.d09:syMA.commemoration03.couplet1.verse1
ltx/gr_redirects_goarch/sy.m04.d09:syMA.commemoration03.couplet1.verse2	@ltx/gr_gr_cog/sy.m04.d09:syMA.commemoration03.couplet1.verse2
ltx/gr_redirects_goarch/sy.m04.d09:syMA.commemoration03.narration.p01	@ltx/gr_gr_cog/sy.m04.d09:syMA.commemoration03.narration.p01
ltx/gr_redirects_goarch/sy.m04.d09:syMA.commemoration03.narration.p02	@ltx/gr_gr_cog/sy.m04.d09:syMA.commemoration03.narration.p02
ltx/gr_redirects_goarch/sy.m04.d09:syMA.commemoration03.text	@ltx/gr_gr_cog/sy.m04.d09:syMA.commemoration03.text
ltx/gr_redirects_goarch/sy.m04.d09:syMA.commemoration04.couplet1.title	@ltx/gr_gr_cog/sy.m04.d09:syMA.commemoration04.couplet1.title
ltx/gr_redirects_goarch/sy.m04.d09:syMA.commemoration04.couplet1.verse1	@ltx/gr_gr_cog/sy.m04.d09:syMA.commemoration04.couplet1.verse1
ltx/gr_redirects_goarch/sy.m04.d09:syMA.commemoration04.couplet1.verse2	@ltx/gr_gr_cog/sy.m04.d09:syMA.commemoration04.couplet1.verse2
ltx/gr_redirects_goarch/sy.m04.d09:syMA.commemoration04.text	@ltx/gr_gr_cog/sy.m04.d09:syMA.commemoration04.text
ltx/gr_redirects_goarch/sy.m04.d09:syMA.commemoration05.couplet1.title	@ltx/gr_gr_cog/sy.m04.d09:syMA.commemoration05.couplet1.title
ltx/gr_redirects_goarch/sy.m04.d09:syMA.commemoration05.couplet1.verse1	@ltx/gr_gr_cog/sy.m04.d09:syMA.commemoration05.couplet1.verse1
ltx/gr_redirects_goarch/sy.m04.d09:syMA.commemoration05.couplet1.verse2	@ltx/gr_gr_cog/sy.m04.d09:syMA.commemoration05.couplet1.verse2
ltx/gr_redirects_goarch/sy.m04.d09:syMA.commemoration05.couplet2.title	@ltx/gr_gr_cog/sy.m04.d09:syMA.commemoration05.couplet2.title
ltx/gr_redirects_goarch/sy.m04.d09:syMA.commemoration05.couplet2.verse1	@ltx/gr_gr_cog/sy.m04.d09:syMA.commemoration05.couplet2.verse1
ltx/gr_redirects_goarch/sy.m04.d09:syMA.commemoration05.couplet2.verse2	@ltx/gr_gr_cog/sy.m04.d09:syMA.commemoration05.couplet2.verse2
ltx/gr_redirects_goarch/sy.m04.d09:syMA.commemoration05.couplet3.title	@ltx/gr_gr_cog/sy.m04.d09:syMA.commemoration05.couplet3.title
ltx/gr_redirects_goarch/sy.m04.d09:syMA.commemoration05.couplet3.verse1	@ltx/gr_gr_cog/sy.m04.d09:syMA.commemoration05.couplet3.verse1
ltx/gr_redirects_goarch/sy.m04.d09:syMA.commemoration05.couplet3.verse2	@ltx/gr_gr_cog/sy.m04.d09:syMA.commemoration05.couplet3.verse2
ltx/gr_redirects_goarch/sy.m04.d09:syMA.commemoration05.narration.p01	@ltx/gr_gr_cog/sy.m04.d09:syMA.commemoration05.narration.p01
ltx/gr_redirects_goarch/sy.m04.d09:syMA.commemoration05.text	@ltx/gr_gr_cog/sy.m04.d09:syMA.commemoration05.text
ltx/gr_redirects_goarch/sy.m04.d09:syMA.lastline	@ltx/gr_gr_cog/sy.m04.d09:syMA.lastline
ltx/gr_redirects_goarch/sy.m04.d09:syMA.note1	@ltx/gr_gr_cog/sy.m04.d09:syMA.note1
ltx/gr_redirects_goarch/sy.m04.d09:syMA.note2	@ltx/gr_gr_cog/sy.m04.d09:syMA.note2
