ltx/gr_redirects_goarch/me.m12.dFF:meDA.commemoration.first	@ltx/gr_gr_cog/me.m12.dFF:meDA.commemoration.first
ltx/gr_redirects_goarch/me.m12.dFF:meDA.commemoration.first_name	@ltx/gr_gr_cog/me.m12.dFF:meDA.commemoration.first_name
ltx/gr_redirects_goarch/me.m12.dFF:meDA.commemoration.first_short	@ltx/gr_gr_cog/me.m12.dFF:meDA.commemoration.first_short
ltx/gr_redirects_goarch/me.m12.dFF:meDA.commemoration.first_title	@ltx/gr_gr_cog/me.m12.dFF:meDA.commemoration.first_title
ltx/gr_redirects_goarch/me.m12.dFF:meDA.commemoration.full	@ltx/gr_gr_cog/me.m12.dFF:meDA.commemoration.full
ltx/gr_redirects_goarch/me.m12.dFF:meDA.commemoration.second_name	@ltx/gr_gr_cog/me.m12.dFF:meDA.commemoration.second_name
ltx/gr_redirects_goarch/me.m12.dFF:meDA.commemoration.second_title	@ltx/gr_gr_cog/me.m12.dFF:meDA.commemoration.second_title
ltx/gr_redirects_goarch/me.m12.dFF:meDA.date	@ltx/gr_gr_cog/me.m12.dFF:meDA.date
ltx/gr_redirects_goarch/me.m12.dFF:meDA.fordate	@ltx/gr_gr_cog/me.m12.dFF:meDA.fordate
ltx/gr_redirects_goarch/me.m12.dFF:meDA.insert1	@ltx/gr_gr_cog/me.m12.dFF:meDA.insert1
ltx/gr_redirects_goarch/me.m12.dFF:meDA.insert2	@ltx/gr_gr_cog/me.m12.dFF:meDA.insert2
ltx/gr_redirects_goarch/me.m12.dFF:meDA.note	@ltx/gr_gr_cog/me.m12.dFF:meDA.note
ltx/gr_redirects_goarch/me.m12.dFF:meDA.pdfcoverdate	@ltx/gr_gr_cog/me.m12.dFF:meDA.pdfcoverdate
ltx/gr_redirects_goarch/me.m12.dFF:meDA.pdfheaderdate	@ltx/gr_gr_cog/me.m12.dFF:meDA.pdfheaderdate
ltx/gr_redirects_goarch/me.m12.dFF:meHO.commemorations	@ltx/gr_gr_cog/me.m12.dFF:meHO.commemorations
ltx/gr_redirects_goarch/me.m12.dFF:meHO.note1	@ltx/gr_gr_cog/me.m12.dFF:meHO.note1
ltx/gr_redirects_goarch/me.m12.dFF:meHO.note2	@ltx/gr_gr_cog/me.m12.dFF:meHO.note2
ltx/gr_redirects_goarch/me.m12.dFF:meHO.number	@ltx/gr_gr_cog/me.m12.dFF:meHO.number
ltx/gr_redirects_goarch/me.m12.dFF:meHO.rank	@ltx/gr_gr_cog/me.m12.dFF:meHO.rank
ltx/gr_redirects_goarch/me.m12.dFF:meLE.commemoration1	@ltx/gr_gr_cog/me.m12.dFF:meLE.commemoration1
ltx/gr_redirects_goarch/me.m12.dFF:meLE.commemoration2	@ltx/gr_gr_cog/me.m12.dFF:meLE.commemoration2
ltx/gr_redirects_goarch/me.m12.dFF:meLI.Kontakion1.incipit	@ltx/gr_gr_cog/me.m12.dFF:meLI.Kontakion1.incipit
ltx/gr_redirects_goarch/me.m12.dFF:meLI.Kontakion1.melody	@ltx/gr_gr_cog/me.m12.dFF:meLI.Kontakion1.melody
ltx/gr_redirects_goarch/me.m12.dFF:meLI.Kontakion1.mode	@ltx/gr_gr_cog/me.m12.dFF:meLI.Kontakion1.mode
ltx/gr_redirects_goarch/me.m12.dFF:meLI.Kontakion1.text	@ltx/gr_gr_cog/me.m12.dFF:meLI.Kontakion1.text
ltx/gr_redirects_goarch/me.m12.dFF:meLI.Megalynarion.text	@ltx/gr_gr_cog/me.m12.dFF:meLI.Megalynarion.text
ltx/gr_redirects_goarch/me.m12.dFF:meMA.C1.acrostic.notice1	@ltx/gr_gr_cog/me.m12.dFF:meMA.C1.acrostic.notice1
ltx/gr_redirects_goarch/me.m12.dFF:meMA.C1.acrostic.text	@ltx/gr_gr_cog/me.m12.dFF:meMA.C1.acrostic.text
ltx/gr_redirects_goarch/me.m12.dFF:meMA.C1.acrostic.title	@ltx/gr_gr_cog/me.m12.dFF:meMA.C1.acrostic.title
ltx/gr_redirects_goarch/me.m12.dFF:meMA.C1.poet	@ltx/gr_gr_cog/me.m12.dFF:meMA.C1.poet
ltx/gr_redirects_goarch/me.m12.dFF:meMA.C1.title	@ltx/gr_gr_cog/me.m12.dFF:meMA.C1.title
ltx/gr_redirects_goarch/me.m12.dFF:meMA.C1.verse	@ltx/gr_gr_cog/me.m12.dFF:meMA.C1.verse
ltx/gr_redirects_goarch/me.m12.dFF:meMA.C2.acrostic.notice1	@ltx/gr_gr_cog/me.m12.dFF:meMA.C2.acrostic.notice1
ltx/gr_redirects_goarch/me.m12.dFF:meMA.C2.acrostic.text	@ltx/gr_gr_cog/me.m12.dFF:meMA.C2.acrostic.text
ltx/gr_redirects_goarch/me.m12.dFF:meMA.C2.acrostic.title	@ltx/gr_gr_cog/me.m12.dFF:meMA.C2.acrostic.title
ltx/gr_redirects_goarch/me.m12.dFF:meMA.C2.title	@ltx/gr_gr_cog/me.m12.dFF:meMA.C2.title
ltx/gr_redirects_goarch/me.m12.dFF:meMA.C2.verse	@ltx/gr_gr_cog/me.m12.dFF:meMA.C2.verse
ltx/gr_redirects_goarch/me.m12.dFF:meMA.ExapTheotokion.incipit	@ltx/gr_gr_cog/me.m12.dFF:meMA.ExapTheotokion.incipit
ltx/gr_redirects_goarch/me.m12.dFF:meMA.ExapTheotokion.melody	@ltx/gr_gr_cog/me.m12.dFF:meMA.ExapTheotokion.melody
ltx/gr_redirects_goarch/me.m12.dFF:meMA.ExapTheotokion.mode	@ltx/gr_gr_cog/me.m12.dFF:meMA.ExapTheotokion.mode
ltx/gr_redirects_goarch/me.m12.dFF:meMA.ExapTheotokion.text	@ltx/gr_gr_cog/me.m12.dFF:meMA.ExapTheotokion.text
ltx/gr_redirects_goarch/me.m12.dFF:meMA.Exaposteilarion1.greekmelody	@ltx/gr_gr_cog/me.m12.dFF:meMA.Exaposteilarion1.greekmelody
ltx/gr_redirects_goarch/me.m12.dFF:meMA.Exaposteilarion1.incipit	@ltx/gr_gr_cog/me.m12.dFF:meMA.Exaposteilarion1.incipit
ltx/gr_redirects_goarch/me.m12.dFF:meMA.Exaposteilarion1.melody	@ltx/gr_gr_cog/me.m12.dFF:meMA.Exaposteilarion1.melody
ltx/gr_redirects_goarch/me.m12.dFF:meMA.Exaposteilarion1.mode	@ltx/gr_gr_cog/me.m12.dFF:meMA.Exaposteilarion1.mode
ltx/gr_redirects_goarch/me.m12.dFF:meMA.Exaposteilarion1.text	@ltx/gr_gr_cog/me.m12.dFF:meMA.Exaposteilarion1.text
ltx/gr_redirects_goarch/me.m12.dFF:meMA.Exaposteilarion2.greekmelody	@ltx/gr_gr_cog/me.m12.dFF:meMA.Exaposteilarion2.greekmelody
ltx/gr_redirects_goarch/me.m12.dFF:meMA.Exaposteilarion2.incipit	@ltx/gr_gr_cog/me.m12.dFF:meMA.Exaposteilarion2.incipit
ltx/gr_redirects_goarch/me.m12.dFF:meMA.Exaposteilarion2.melody	@ltx/gr_gr_cog/me.m12.dFF:meMA.Exaposteilarion2.melody
ltx/gr_redirects_goarch/me.m12.dFF:meMA.Exaposteilarion2.mode	@ltx/gr_gr_cog/me.m12.dFF:meMA.Exaposteilarion2.mode
ltx/gr_redirects_goarch/me.m12.dFF:meMA.Exaposteilarion2.text	@ltx/gr_gr_cog/me.m12.dFF:meMA.Exaposteilarion2.text
ltx/gr_redirects_goarch/me.m12.dFF:meMA.Hypakoe.incipit	@ltx/gr_gr_cog/me.m12.dFF:meMA.Hypakoe.incipit
ltx/gr_redirects_goarch/me.m12.dFF:meMA.Hypakoe.melody	@ltx/gr_gr_cog/me.m12.dFF:meMA.Hypakoe.melody
ltx/gr_redirects_goarch/me.m12.dFF:meMA.Hypakoe.mode	@ltx/gr_gr_cog/me.m12.dFF:meMA.Hypakoe.mode
ltx/gr_redirects_goarch/me.m12.dFF:meMA.Hypakoe.text	@ltx/gr_gr_cog/me.m12.dFF:meMA.Hypakoe.text
ltx/gr_redirects_goarch/me.m12.dFF:meMA.Kontakion1.incipit	@ltx/gr_gr_cog/me.m12.dFF:meMA.Kontakion1.incipit
ltx/gr_redirects_goarch/me.m12.dFF:meMA.Kontakion1.melody	@ltx/gr_gr_cog/me.m12.dFF:meMA.Kontakion1.melody
ltx/gr_redirects_goarch/me.m12.dFF:meMA.Kontakion1.mode	@ltx/gr_gr_cog/me.m12.dFF:meMA.Kontakion1.mode
ltx/gr_redirects_goarch/me.m12.dFF:meMA.Kontakion1.text	@ltx/gr_gr_cog/me.m12.dFF:meMA.Kontakion1.text
ltx/gr_redirects_goarch/me.m12.dFF:meMA.Lauds1.greekmelody	@ltx/gr_gr_cog/me.m12.dFF:meMA.Lauds1.greekmelody
ltx/gr_redirects_goarch/me.m12.dFF:meMA.Lauds1.incipit	@ltx/gr_gr_cog/me.m12.dFF:meMA.Lauds1.incipit
ltx/gr_redirects_goarch/me.m12.dFF:meMA.Lauds1.melody	@ltx/gr_gr_cog/me.m12.dFF:meMA.Lauds1.melody
ltx/gr_redirects_goarch/me.m12.dFF:meMA.Lauds1.mode	@ltx/gr_gr_cog/me.m12.dFF:meMA.Lauds1.mode
ltx/gr_redirects_goarch/me.m12.dFF:meMA.Lauds1.text	@ltx/gr_gr_cog/me.m12.dFF:meMA.Lauds1.text
ltx/gr_redirects_goarch/me.m12.dFF:meMA.Lauds2.incipit	@ltx/gr_gr_cog/me.m12.dFF:meMA.Lauds2.incipit
ltx/gr_redirects_goarch/me.m12.dFF:meMA.Lauds2.melody	@ltx/gr_gr_cog/me.m12.dFF:meMA.Lauds2.melody
ltx/gr_redirects_goarch/me.m12.dFF:meMA.Lauds2.mode	@ltx/gr_gr_cog/me.m12.dFF:meMA.Lauds2.mode
ltx/gr_redirects_goarch/me.m12.dFF:meMA.Lauds2.text	@ltx/gr_gr_cog/me.m12.dFF:meMA.Lauds2.text
ltx/gr_redirects_goarch/me.m12.dFF:meMA.Lauds3.incipit	@ltx/gr_gr_cog/me.m12.dFF:meMA.Lauds3.incipit
ltx/gr_redirects_goarch/me.m12.dFF:meMA.Lauds3.melody	@ltx/gr_gr_cog/me.m12.dFF:meMA.Lauds3.melody
ltx/gr_redirects_goarch/me.m12.dFF:meMA.Lauds3.mode	@ltx/gr_gr_cog/me.m12.dFF:meMA.Lauds3.mode
ltx/gr_redirects_goarch/me.m12.dFF:meMA.Lauds3.text	@ltx/gr_gr_cog/me.m12.dFF:meMA.Lauds3.text
ltx/gr_redirects_goarch/me.m12.dFF:meMA.LaudsGlory.incipit	@ltx/gr_gr_cog/me.m12.dFF:meMA.LaudsGlory.incipit
ltx/gr_redirects_goarch/me.m12.dFF:meMA.LaudsGlory.melody	@ltx/gr_gr_cog/me.m12.dFF:meMA.LaudsGlory.melody
ltx/gr_redirects_goarch/me.m12.dFF:meMA.LaudsGlory.mode	@ltx/gr_gr_cog/me.m12.dFF:meMA.LaudsGlory.mode
ltx/gr_redirects_goarch/me.m12.dFF:meMA.LaudsGlory.poet	@ltx/gr_gr_cog/me.m12.dFF:meMA.LaudsGlory.poet
ltx/gr_redirects_goarch/me.m12.dFF:meMA.LaudsGlory.text	@ltx/gr_gr_cog/me.m12.dFF:meMA.LaudsGlory.text
ltx/gr_redirects_goarch/me.m12.dFF:meMA.MM.Lauds1123as5678.text	@ltx/gr_gr_cog/me.m12.dFF:meMA.MM.Lauds1123as5678.text
ltx/gr_redirects_goarch/me.m12.dFF:meMA.MM.Lauds123as345.text	@ltx/gr_gr_cog/me.m12.dFF:meMA.MM.Lauds123as345.text
ltx/gr_redirects_goarch/me.m12.dFF:meMA.Ode1C11.greekmelody	@ltx/gr_gr_cog/me.m12.dFF:meMA.Ode1C11.greekmelody
ltx/gr_redirects_goarch/me.m12.dFF:meMA.Ode1C11.incipit	@ltx/gr_gr_cog/me.m12.dFF:meMA.Ode1C11.incipit
ltx/gr_redirects_goarch/me.m12.dFF:meMA.Ode1C11.melody	@ltx/gr_gr_cog/me.m12.dFF:meMA.Ode1C11.melody
ltx/gr_redirects_goarch/me.m12.dFF:meMA.Ode1C11.mode	@ltx/gr_gr_cog/me.m12.dFF:meMA.Ode1C11.mode
ltx/gr_redirects_goarch/me.m12.dFF:meMA.Ode1C11.ode	@ltx/gr_gr_cog/me.m12.dFF:meMA.Ode1C11.ode
ltx/gr_redirects_goarch/me.m12.dFF:meMA.Ode1C11.text	@ltx/gr_gr_cog/me.m12.dFF:meMA.Ode1C11.text
ltx/gr_redirects_goarch/me.m12.dFF:meMA.Ode1C12.incipit	@ltx/gr_gr_cog/me.m12.dFF:meMA.Ode1C12.incipit
ltx/gr_redirects_goarch/me.m12.dFF:meMA.Ode1C12.melody	@ltx/gr_gr_cog/me.m12.dFF:meMA.Ode1C12.melody
ltx/gr_redirects_goarch/me.m12.dFF:meMA.Ode1C12.mode	@ltx/gr_gr_cog/me.m12.dFF:meMA.Ode1C12.mode
ltx/gr_redirects_goarch/me.m12.dFF:meMA.Ode1C12.ode	@ltx/gr_gr_cog/me.m12.dFF:meMA.Ode1C12.ode
ltx/gr_redirects_goarch/me.m12.dFF:meMA.Ode1C12.text	@ltx/gr_gr_cog/me.m12.dFF:meMA.Ode1C12.text
ltx/gr_redirects_goarch/me.m12.dFF:meMA.Ode1C13.incipit	@ltx/gr_gr_cog/me.m12.dFF:meMA.Ode1C13.incipit
ltx/gr_redirects_goarch/me.m12.dFF:meMA.Ode1C13.melody	@ltx/gr_gr_cog/me.m12.dFF:meMA.Ode1C13.melody
ltx/gr_redirects_goarch/me.m12.dFF:meMA.Ode1C13.mode	@ltx/gr_gr_cog/me.m12.dFF:meMA.Ode1C13.mode
ltx/gr_redirects_goarch/me.m12.dFF:meMA.Ode1C13.ode	@ltx/gr_gr_cog/me.m12.dFF:meMA.Ode1C13.ode
ltx/gr_redirects_goarch/me.m12.dFF:meMA.Ode1C13.text	@ltx/gr_gr_cog/me.m12.dFF:meMA.Ode1C13.text
ltx/gr_redirects_goarch/me.m12.dFF:meMA.Ode1C1T.incipit	@ltx/gr_gr_cog/me.m12.dFF:meMA.Ode1C1T.incipit
ltx/gr_redirects_goarch/me.m12.dFF:meMA.Ode1C1T.melody	@ltx/gr_gr_cog/me.m12.dFF:meMA.Ode1C1T.melody
ltx/gr_redirects_goarch/me.m12.dFF:meMA.Ode1C1T.mode	@ltx/gr_gr_cog/me.m12.dFF:meMA.Ode1C1T.mode
ltx/gr_redirects_goarch/me.m12.dFF:meMA.Ode1C1T.ode	@ltx/gr_gr_cog/me.m12.dFF:meMA.Ode1C1T.ode
ltx/gr_redirects_goarch/me.m12.dFF:meMA.Ode1C1T.text	@ltx/gr_gr_cog/me.m12.dFF:meMA.Ode1C1T.text
ltx/gr_redirects_goarch/me.m12.dFF:meMA.Ode1C21.greekmelody	@ltx/gr_gr_cog/me.m12.dFF:meMA.Ode1C21.greekmelody
ltx/gr_redirects_goarch/me.m12.dFF:meMA.Ode1C21.incipit	@ltx/gr_gr_cog/me.m12.dFF:meMA.Ode1C21.incipit
ltx/gr_redirects_goarch/me.m12.dFF:meMA.Ode1C21.melody	@ltx/gr_gr_cog/me.m12.dFF:meMA.Ode1C21.melody
ltx/gr_redirects_goarch/me.m12.dFF:meMA.Ode1C21.mode	@ltx/gr_gr_cog/me.m12.dFF:meMA.Ode1C21.mode
ltx/gr_redirects_goarch/me.m12.dFF:meMA.Ode1C21.ode	@ltx/gr_gr_cog/me.m12.dFF:meMA.Ode1C21.ode
ltx/gr_redirects_goarch/me.m12.dFF:meMA.Ode1C21.text	@ltx/gr_gr_cog/me.m12.dFF:meMA.Ode1C21.text
ltx/gr_redirects_goarch/me.m12.dFF:meMA.Ode1C22.incipit	@ltx/gr_gr_cog/me.m12.dFF:meMA.Ode1C22.incipit
ltx/gr_redirects_goarch/me.m12.dFF:meMA.Ode1C22.melody	@ltx/gr_gr_cog/me.m12.dFF:meMA.Ode1C22.melody
ltx/gr_redirects_goarch/me.m12.dFF:meMA.Ode1C22.mode	@ltx/gr_gr_cog/me.m12.dFF:meMA.Ode1C22.mode
ltx/gr_redirects_goarch/me.m12.dFF:meMA.Ode1C22.ode	@ltx/gr_gr_cog/me.m12.dFF:meMA.Ode1C22.ode
ltx/gr_redirects_goarch/me.m12.dFF:meMA.Ode1C22.text	@ltx/gr_gr_cog/me.m12.dFF:meMA.Ode1C22.text
ltx/gr_redirects_goarch/me.m12.dFF:meMA.Ode1C23.incipit	@ltx/gr_gr_cog/me.m12.dFF:meMA.Ode1C23.incipit
ltx/gr_redirects_goarch/me.m12.dFF:meMA.Ode1C23.melody	@ltx/gr_gr_cog/me.m12.dFF:meMA.Ode1C23.melody
ltx/gr_redirects_goarch/me.m12.dFF:meMA.Ode1C23.mode	@ltx/gr_gr_cog/me.m12.dFF:meMA.Ode1C23.mode
ltx/gr_redirects_goarch/me.m12.dFF:meMA.Ode1C23.ode	@ltx/gr_gr_cog/me.m12.dFF:meMA.Ode1C23.ode
ltx/gr_redirects_goarch/me.m12.dFF:meMA.Ode1C23.text	@ltx/gr_gr_cog/me.m12.dFF:meMA.Ode1C23.text
ltx/gr_redirects_goarch/me.m12.dFF:meMA.Ode1C2T.incipit	@ltx/gr_gr_cog/me.m12.dFF:meMA.Ode1C2T.incipit
ltx/gr_redirects_goarch/me.m12.dFF:meMA.Ode1C2T.melody	@ltx/gr_gr_cog/me.m12.dFF:meMA.Ode1C2T.melody
ltx/gr_redirects_goarch/me.m12.dFF:meMA.Ode1C2T.mode	@ltx/gr_gr_cog/me.m12.dFF:meMA.Ode1C2T.mode
ltx/gr_redirects_goarch/me.m12.dFF:meMA.Ode1C2T.ode	@ltx/gr_gr_cog/me.m12.dFF:meMA.Ode1C2T.ode
ltx/gr_redirects_goarch/me.m12.dFF:meMA.Ode1C2T.text	@ltx/gr_gr_cog/me.m12.dFF:meMA.Ode1C2T.text
ltx/gr_redirects_goarch/me.m12.dFF:meMA.Ode3C11.greekmelody	@ltx/gr_gr_cog/me.m12.dFF:meMA.Ode3C11.greekmelody
ltx/gr_redirects_goarch/me.m12.dFF:meMA.Ode3C11.incipit	@ltx/gr_gr_cog/me.m12.dFF:meMA.Ode3C11.incipit
ltx/gr_redirects_goarch/me.m12.dFF:meMA.Ode3C11.melody	@ltx/gr_gr_cog/me.m12.dFF:meMA.Ode3C11.melody
ltx/gr_redirects_goarch/me.m12.dFF:meMA.Ode3C11.mode	@ltx/gr_gr_cog/me.m12.dFF:meMA.Ode3C11.mode
ltx/gr_redirects_goarch/me.m12.dFF:meMA.Ode3C11.ode	@ltx/gr_gr_cog/me.m12.dFF:meMA.Ode3C11.ode
ltx/gr_redirects_goarch/me.m12.dFF:meMA.Ode3C11.text	@ltx/gr_gr_cog/me.m12.dFF:meMA.Ode3C11.text
ltx/gr_redirects_goarch/me.m12.dFF:meMA.Ode3C12.incipit	@ltx/gr_gr_cog/me.m12.dFF:meMA.Ode3C12.incipit
ltx/gr_redirects_goarch/me.m12.dFF:meMA.Ode3C12.melody	@ltx/gr_gr_cog/me.m12.dFF:meMA.Ode3C12.melody
ltx/gr_redirects_goarch/me.m12.dFF:meMA.Ode3C12.mode	@ltx/gr_gr_cog/me.m12.dFF:meMA.Ode3C12.mode
ltx/gr_redirects_goarch/me.m12.dFF:meMA.Ode3C12.ode	@ltx/gr_gr_cog/me.m12.dFF:meMA.Ode3C12.ode
ltx/gr_redirects_goarch/me.m12.dFF:meMA.Ode3C12.text	@ltx/gr_gr_cog/me.m12.dFF:meMA.Ode3C12.text
ltx/gr_redirects_goarch/me.m12.dFF:meMA.Ode3C13.incipit	@ltx/gr_gr_cog/me.m12.dFF:meMA.Ode3C13.incipit
ltx/gr_redirects_goarch/me.m12.dFF:meMA.Ode3C13.melody	@ltx/gr_gr_cog/me.m12.dFF:meMA.Ode3C13.melody
ltx/gr_redirects_goarch/me.m12.dFF:meMA.Ode3C13.mode	@ltx/gr_gr_cog/me.m12.dFF:meMA.Ode3C13.mode
ltx/gr_redirects_goarch/me.m12.dFF:meMA.Ode3C13.ode	@ltx/gr_gr_cog/me.m12.dFF:meMA.Ode3C13.ode
ltx/gr_redirects_goarch/me.m12.dFF:meMA.Ode3C13.text	@ltx/gr_gr_cog/me.m12.dFF:meMA.Ode3C13.text
ltx/gr_redirects_goarch/me.m12.dFF:meMA.Ode3C1T.incipit	@ltx/gr_gr_cog/me.m12.dFF:meMA.Ode3C1T.incipit
ltx/gr_redirects_goarch/me.m12.dFF:meMA.Ode3C1T.melody	@ltx/gr_gr_cog/me.m12.dFF:meMA.Ode3C1T.melody
ltx/gr_redirects_goarch/me.m12.dFF:meMA.Ode3C1T.mode	@ltx/gr_gr_cog/me.m12.dFF:meMA.Ode3C1T.mode
ltx/gr_redirects_goarch/me.m12.dFF:meMA.Ode3C1T.ode	@ltx/gr_gr_cog/me.m12.dFF:meMA.Ode3C1T.ode
ltx/gr_redirects_goarch/me.m12.dFF:meMA.Ode3C1T.text	@ltx/gr_gr_cog/me.m12.dFF:meMA.Ode3C1T.text
ltx/gr_redirects_goarch/me.m12.dFF:meMA.Ode3C21.greekmelody	@ltx/gr_gr_cog/me.m12.dFF:meMA.Ode3C21.greekmelody
ltx/gr_redirects_goarch/me.m12.dFF:meMA.Ode3C21.incipit	@ltx/gr_gr_cog/me.m12.dFF:meMA.Ode3C21.incipit
ltx/gr_redirects_goarch/me.m12.dFF:meMA.Ode3C21.melody	@ltx/gr_gr_cog/me.m12.dFF:meMA.Ode3C21.melody
ltx/gr_redirects_goarch/me.m12.dFF:meMA.Ode3C21.mode	@ltx/gr_gr_cog/me.m12.dFF:meMA.Ode3C21.mode
ltx/gr_redirects_goarch/me.m12.dFF:meMA.Ode3C21.ode	@ltx/gr_gr_cog/me.m12.dFF:meMA.Ode3C21.ode
ltx/gr_redirects_goarch/me.m12.dFF:meMA.Ode3C21.text	@ltx/gr_gr_cog/me.m12.dFF:meMA.Ode3C21.text
ltx/gr_redirects_goarch/me.m12.dFF:meMA.Ode3C22.incipit	@ltx/gr_gr_cog/me.m12.dFF:meMA.Ode3C22.incipit
ltx/gr_redirects_goarch/me.m12.dFF:meMA.Ode3C22.melody	@ltx/gr_gr_cog/me.m12.dFF:meMA.Ode3C22.melody
ltx/gr_redirects_goarch/me.m12.dFF:meMA.Ode3C22.mode	@ltx/gr_gr_cog/me.m12.dFF:meMA.Ode3C22.mode
ltx/gr_redirects_goarch/me.m12.dFF:meMA.Ode3C22.ode	@ltx/gr_gr_cog/me.m12.dFF:meMA.Ode3C22.ode
ltx/gr_redirects_goarch/me.m12.dFF:meMA.Ode3C22.text	@ltx/gr_gr_cog/me.m12.dFF:meMA.Ode3C22.text
ltx/gr_redirects_goarch/me.m12.dFF:meMA.Ode3C23.incipit	@ltx/gr_gr_cog/me.m12.dFF:meMA.Ode3C23.incipit
ltx/gr_redirects_goarch/me.m12.dFF:meMA.Ode3C23.melody	@ltx/gr_gr_cog/me.m12.dFF:meMA.Ode3C23.melody
ltx/gr_redirects_goarch/me.m12.dFF:meMA.Ode3C23.mode	@ltx/gr_gr_cog/me.m12.dFF:meMA.Ode3C23.mode
ltx/gr_redirects_goarch/me.m12.dFF:meMA.Ode3C23.ode	@ltx/gr_gr_cog/me.m12.dFF:meMA.Ode3C23.ode
ltx/gr_redirects_goarch/me.m12.dFF:meMA.Ode3C23.text	@ltx/gr_gr_cog/me.m12.dFF:meMA.Ode3C23.text
ltx/gr_redirects_goarch/me.m12.dFF:meMA.Ode3C2T.incipit	@ltx/gr_gr_cog/me.m12.dFF:meMA.Ode3C2T.incipit
ltx/gr_redirects_goarch/me.m12.dFF:meMA.Ode3C2T.melody	@ltx/gr_gr_cog/me.m12.dFF:meMA.Ode3C2T.melody
ltx/gr_redirects_goarch/me.m12.dFF:meMA.Ode3C2T.mode	@ltx/gr_gr_cog/me.m12.dFF:meMA.Ode3C2T.mode
ltx/gr_redirects_goarch/me.m12.dFF:meMA.Ode3C2T.ode	@ltx/gr_gr_cog/me.m12.dFF:meMA.Ode3C2T.ode
ltx/gr_redirects_goarch/me.m12.dFF:meMA.Ode3C2T.text	@ltx/gr_gr_cog/me.m12.dFF:meMA.Ode3C2T.text
ltx/gr_redirects_goarch/me.m12.dFF:meMA.Ode3Kathisma1.greekmelody	@ltx/gr_gr_cog/me.m12.dFF:meMA.Ode3Kathisma1.greekmelody
ltx/gr_redirects_goarch/me.m12.dFF:meMA.Ode3Kathisma1.incipit	@ltx/gr_gr_cog/me.m12.dFF:meMA.Ode3Kathisma1.incipit
ltx/gr_redirects_goarch/me.m12.dFF:meMA.Ode3Kathisma1.melody	@ltx/gr_gr_cog/me.m12.dFF:meMA.Ode3Kathisma1.melody
ltx/gr_redirects_goarch/me.m12.dFF:meMA.Ode3Kathisma1.mode	@ltx/gr_gr_cog/me.m12.dFF:meMA.Ode3Kathisma1.mode
ltx/gr_redirects_goarch/me.m12.dFF:meMA.Ode3Kathisma1.text	@ltx/gr_gr_cog/me.m12.dFF:meMA.Ode3Kathisma1.text
ltx/gr_redirects_goarch/me.m12.dFF:meMA.Ode4C11.greekmelody	@ltx/gr_gr_cog/me.m12.dFF:meMA.Ode4C11.greekmelody
ltx/gr_redirects_goarch/me.m12.dFF:meMA.Ode4C11.incipit	@ltx/gr_gr_cog/me.m12.dFF:meMA.Ode4C11.incipit
ltx/gr_redirects_goarch/me.m12.dFF:meMA.Ode4C11.melody	@ltx/gr_gr_cog/me.m12.dFF:meMA.Ode4C11.melody
ltx/gr_redirects_goarch/me.m12.dFF:meMA.Ode4C11.mode	@ltx/gr_gr_cog/me.m12.dFF:meMA.Ode4C11.mode
ltx/gr_redirects_goarch/me.m12.dFF:meMA.Ode4C11.ode	@ltx/gr_gr_cog/me.m12.dFF:meMA.Ode4C11.ode
ltx/gr_redirects_goarch/me.m12.dFF:meMA.Ode4C11.text	@ltx/gr_gr_cog/me.m12.dFF:meMA.Ode4C11.text
ltx/gr_redirects_goarch/me.m12.dFF:meMA.Ode4C12.incipit	@ltx/gr_gr_cog/me.m12.dFF:meMA.Ode4C12.incipit
ltx/gr_redirects_goarch/me.m12.dFF:meMA.Ode4C12.melody	@ltx/gr_gr_cog/me.m12.dFF:meMA.Ode4C12.melody
ltx/gr_redirects_goarch/me.m12.dFF:meMA.Ode4C12.mode	@ltx/gr_gr_cog/me.m12.dFF:meMA.Ode4C12.mode
ltx/gr_redirects_goarch/me.m12.dFF:meMA.Ode4C12.ode	@ltx/gr_gr_cog/me.m12.dFF:meMA.Ode4C12.ode
ltx/gr_redirects_goarch/me.m12.dFF:meMA.Ode4C12.text	@ltx/gr_gr_cog/me.m12.dFF:meMA.Ode4C12.text
ltx/gr_redirects_goarch/me.m12.dFF:meMA.Ode4C13.incipit	@ltx/gr_gr_cog/me.m12.dFF:meMA.Ode4C13.incipit
ltx/gr_redirects_goarch/me.m12.dFF:meMA.Ode4C13.melody	@ltx/gr_gr_cog/me.m12.dFF:meMA.Ode4C13.melody
ltx/gr_redirects_goarch/me.m12.dFF:meMA.Ode4C13.mode	@ltx/gr_gr_cog/me.m12.dFF:meMA.Ode4C13.mode
ltx/gr_redirects_goarch/me.m12.dFF:meMA.Ode4C13.ode	@ltx/gr_gr_cog/me.m12.dFF:meMA.Ode4C13.ode
ltx/gr_redirects_goarch/me.m12.dFF:meMA.Ode4C13.text	@ltx/gr_gr_cog/me.m12.dFF:meMA.Ode4C13.text
ltx/gr_redirects_goarch/me.m12.dFF:meMA.Ode4C1T.incipit	@ltx/gr_gr_cog/me.m12.dFF:meMA.Ode4C1T.incipit
ltx/gr_redirects_goarch/me.m12.dFF:meMA.Ode4C1T.melody	@ltx/gr_gr_cog/me.m12.dFF:meMA.Ode4C1T.melody
ltx/gr_redirects_goarch/me.m12.dFF:meMA.Ode4C1T.mode	@ltx/gr_gr_cog/me.m12.dFF:meMA.Ode4C1T.mode
ltx/gr_redirects_goarch/me.m12.dFF:meMA.Ode4C1T.ode	@ltx/gr_gr_cog/me.m12.dFF:meMA.Ode4C1T.ode
ltx/gr_redirects_goarch/me.m12.dFF:meMA.Ode4C1T.text	@ltx/gr_gr_cog/me.m12.dFF:meMA.Ode4C1T.text
ltx/gr_redirects_goarch/me.m12.dFF:meMA.Ode4C21.greekmelody	@ltx/gr_gr_cog/me.m12.dFF:meMA.Ode4C21.greekmelody
ltx/gr_redirects_goarch/me.m12.dFF:meMA.Ode4C21.incipit	@ltx/gr_gr_cog/me.m12.dFF:meMA.Ode4C21.incipit
ltx/gr_redirects_goarch/me.m12.dFF:meMA.Ode4C21.melody	@ltx/gr_gr_cog/me.m12.dFF:meMA.Ode4C21.melody
ltx/gr_redirects_goarch/me.m12.dFF:meMA.Ode4C21.mode	@ltx/gr_gr_cog/me.m12.dFF:meMA.Ode4C21.mode
ltx/gr_redirects_goarch/me.m12.dFF:meMA.Ode4C21.ode	@ltx/gr_gr_cog/me.m12.dFF:meMA.Ode4C21.ode
ltx/gr_redirects_goarch/me.m12.dFF:meMA.Ode4C21.text	@ltx/gr_gr_cog/me.m12.dFF:meMA.Ode4C21.text
ltx/gr_redirects_goarch/me.m12.dFF:meMA.Ode4C22.incipit	@ltx/gr_gr_cog/me.m12.dFF:meMA.Ode4C22.incipit
ltx/gr_redirects_goarch/me.m12.dFF:meMA.Ode4C22.melody	@ltx/gr_gr_cog/me.m12.dFF:meMA.Ode4C22.melody
ltx/gr_redirects_goarch/me.m12.dFF:meMA.Ode4C22.mode	@ltx/gr_gr_cog/me.m12.dFF:meMA.Ode4C22.mode
ltx/gr_redirects_goarch/me.m12.dFF:meMA.Ode4C22.ode	@ltx/gr_gr_cog/me.m12.dFF:meMA.Ode4C22.ode
ltx/gr_redirects_goarch/me.m12.dFF:meMA.Ode4C22.text	@ltx/gr_gr_cog/me.m12.dFF:meMA.Ode4C22.text
ltx/gr_redirects_goarch/me.m12.dFF:meMA.Ode4C23.incipit	@ltx/gr_gr_cog/me.m12.dFF:meMA.Ode4C23.incipit
ltx/gr_redirects_goarch/me.m12.dFF:meMA.Ode4C23.melody	@ltx/gr_gr_cog/me.m12.dFF:meMA.Ode4C23.melody
ltx/gr_redirects_goarch/me.m12.dFF:meMA.Ode4C23.mode	@ltx/gr_gr_cog/me.m12.dFF:meMA.Ode4C23.mode
ltx/gr_redirects_goarch/me.m12.dFF:meMA.Ode4C23.ode	@ltx/gr_gr_cog/me.m12.dFF:meMA.Ode4C23.ode
ltx/gr_redirects_goarch/me.m12.dFF:meMA.Ode4C23.text	@ltx/gr_gr_cog/me.m12.dFF:meMA.Ode4C23.text
ltx/gr_redirects_goarch/me.m12.dFF:meMA.Ode4C24.incipit	@ltx/gr_gr_cog/me.m12.dFF:meMA.Ode4C24.incipit
ltx/gr_redirects_goarch/me.m12.dFF:meMA.Ode4C24.melody	@ltx/gr_gr_cog/me.m12.dFF:meMA.Ode4C24.melody
ltx/gr_redirects_goarch/me.m12.dFF:meMA.Ode4C24.mode	@ltx/gr_gr_cog/me.m12.dFF:meMA.Ode4C24.mode
ltx/gr_redirects_goarch/me.m12.dFF:meMA.Ode4C24.ode	@ltx/gr_gr_cog/me.m12.dFF:meMA.Ode4C24.ode
ltx/gr_redirects_goarch/me.m12.dFF:meMA.Ode4C24.text	@ltx/gr_gr_cog/me.m12.dFF:meMA.Ode4C24.text
ltx/gr_redirects_goarch/me.m12.dFF:meMA.Ode4C2T.incipit	@ltx/gr_gr_cog/me.m12.dFF:meMA.Ode4C2T.incipit
ltx/gr_redirects_goarch/me.m12.dFF:meMA.Ode4C2T.melody	@ltx/gr_gr_cog/me.m12.dFF:meMA.Ode4C2T.melody
ltx/gr_redirects_goarch/me.m12.dFF:meMA.Ode4C2T.mode	@ltx/gr_gr_cog/me.m12.dFF:meMA.Ode4C2T.mode
ltx/gr_redirects_goarch/me.m12.dFF:meMA.Ode4C2T.ode	@ltx/gr_gr_cog/me.m12.dFF:meMA.Ode4C2T.ode
ltx/gr_redirects_goarch/me.m12.dFF:meMA.Ode4C2T.text	@ltx/gr_gr_cog/me.m12.dFF:meMA.Ode4C2T.text
ltx/gr_redirects_goarch/me.m12.dFF:meMA.Ode5C11.greekmelody	@ltx/gr_gr_cog/me.m12.dFF:meMA.Ode5C11.greekmelody
ltx/gr_redirects_goarch/me.m12.dFF:meMA.Ode5C11.incipit	@ltx/gr_gr_cog/me.m12.dFF:meMA.Ode5C11.incipit
ltx/gr_redirects_goarch/me.m12.dFF:meMA.Ode5C11.melody	@ltx/gr_gr_cog/me.m12.dFF:meMA.Ode5C11.melody
ltx/gr_redirects_goarch/me.m12.dFF:meMA.Ode5C11.mode	@ltx/gr_gr_cog/me.m12.dFF:meMA.Ode5C11.mode
ltx/gr_redirects_goarch/me.m12.dFF:meMA.Ode5C11.ode	@ltx/gr_gr_cog/me.m12.dFF:meMA.Ode5C11.ode
ltx/gr_redirects_goarch/me.m12.dFF:meMA.Ode5C11.text	@ltx/gr_gr_cog/me.m12.dFF:meMA.Ode5C11.text
ltx/gr_redirects_goarch/me.m12.dFF:meMA.Ode5C12.incipit	@ltx/gr_gr_cog/me.m12.dFF:meMA.Ode5C12.incipit
ltx/gr_redirects_goarch/me.m12.dFF:meMA.Ode5C12.melody	@ltx/gr_gr_cog/me.m12.dFF:meMA.Ode5C12.melody
ltx/gr_redirects_goarch/me.m12.dFF:meMA.Ode5C12.mode	@ltx/gr_gr_cog/me.m12.dFF:meMA.Ode5C12.mode
ltx/gr_redirects_goarch/me.m12.dFF:meMA.Ode5C12.ode	@ltx/gr_gr_cog/me.m12.dFF:meMA.Ode5C12.ode
ltx/gr_redirects_goarch/me.m12.dFF:meMA.Ode5C12.text	@ltx/gr_gr_cog/me.m12.dFF:meMA.Ode5C12.text
ltx/gr_redirects_goarch/me.m12.dFF:meMA.Ode5C13.incipit	@ltx/gr_gr_cog/me.m12.dFF:meMA.Ode5C13.incipit
ltx/gr_redirects_goarch/me.m12.dFF:meMA.Ode5C13.melody	@ltx/gr_gr_cog/me.m12.dFF:meMA.Ode5C13.melody
ltx/gr_redirects_goarch/me.m12.dFF:meMA.Ode5C13.mode	@ltx/gr_gr_cog/me.m12.dFF:meMA.Ode5C13.mode
ltx/gr_redirects_goarch/me.m12.dFF:meMA.Ode5C13.ode	@ltx/gr_gr_cog/me.m12.dFF:meMA.Ode5C13.ode
ltx/gr_redirects_goarch/me.m12.dFF:meMA.Ode5C13.text	@ltx/gr_gr_cog/me.m12.dFF:meMA.Ode5C13.text
ltx/gr_redirects_goarch/me.m12.dFF:meMA.Ode5C1T.incipit	@ltx/gr_gr_cog/me.m12.dFF:meMA.Ode5C1T.incipit
ltx/gr_redirects_goarch/me.m12.dFF:meMA.Ode5C1T.melody	@ltx/gr_gr_cog/me.m12.dFF:meMA.Ode5C1T.melody
ltx/gr_redirects_goarch/me.m12.dFF:meMA.Ode5C1T.mode	@ltx/gr_gr_cog/me.m12.dFF:meMA.Ode5C1T.mode
ltx/gr_redirects_goarch/me.m12.dFF:meMA.Ode5C1T.ode	@ltx/gr_gr_cog/me.m12.dFF:meMA.Ode5C1T.ode
ltx/gr_redirects_goarch/me.m12.dFF:meMA.Ode5C1T.text	@ltx/gr_gr_cog/me.m12.dFF:meMA.Ode5C1T.text
ltx/gr_redirects_goarch/me.m12.dFF:meMA.Ode5C21.greekmelody	@ltx/gr_gr_cog/me.m12.dFF:meMA.Ode5C21.greekmelody
ltx/gr_redirects_goarch/me.m12.dFF:meMA.Ode5C21.incipit	@ltx/gr_gr_cog/me.m12.dFF:meMA.Ode5C21.incipit
ltx/gr_redirects_goarch/me.m12.dFF:meMA.Ode5C21.melody	@ltx/gr_gr_cog/me.m12.dFF:meMA.Ode5C21.melody
ltx/gr_redirects_goarch/me.m12.dFF:meMA.Ode5C21.mode	@ltx/gr_gr_cog/me.m12.dFF:meMA.Ode5C21.mode
ltx/gr_redirects_goarch/me.m12.dFF:meMA.Ode5C21.ode	@ltx/gr_gr_cog/me.m12.dFF:meMA.Ode5C21.ode
ltx/gr_redirects_goarch/me.m12.dFF:meMA.Ode5C21.text	@ltx/gr_gr_cog/me.m12.dFF:meMA.Ode5C21.text
ltx/gr_redirects_goarch/me.m12.dFF:meMA.Ode5C22.incipit	@ltx/gr_gr_cog/me.m12.dFF:meMA.Ode5C22.incipit
ltx/gr_redirects_goarch/me.m12.dFF:meMA.Ode5C22.melody	@ltx/gr_gr_cog/me.m12.dFF:meMA.Ode5C22.melody
ltx/gr_redirects_goarch/me.m12.dFF:meMA.Ode5C22.mode	@ltx/gr_gr_cog/me.m12.dFF:meMA.Ode5C22.mode
ltx/gr_redirects_goarch/me.m12.dFF:meMA.Ode5C22.ode	@ltx/gr_gr_cog/me.m12.dFF:meMA.Ode5C22.ode
ltx/gr_redirects_goarch/me.m12.dFF:meMA.Ode5C22.text	@ltx/gr_gr_cog/me.m12.dFF:meMA.Ode5C22.text
ltx/gr_redirects_goarch/me.m12.dFF:meMA.Ode5C23.incipit	@ltx/gr_gr_cog/me.m12.dFF:meMA.Ode5C23.incipit
ltx/gr_redirects_goarch/me.m12.dFF:meMA.Ode5C23.melody	@ltx/gr_gr_cog/me.m12.dFF:meMA.Ode5C23.melody
ltx/gr_redirects_goarch/me.m12.dFF:meMA.Ode5C23.mode	@ltx/gr_gr_cog/me.m12.dFF:meMA.Ode5C23.mode
ltx/gr_redirects_goarch/me.m12.dFF:meMA.Ode5C23.ode	@ltx/gr_gr_cog/me.m12.dFF:meMA.Ode5C23.ode
ltx/gr_redirects_goarch/me.m12.dFF:meMA.Ode5C23.text	@ltx/gr_gr_cog/me.m12.dFF:meMA.Ode5C23.text
ltx/gr_redirects_goarch/me.m12.dFF:meMA.Ode5C2T.incipit	@ltx/gr_gr_cog/me.m12.dFF:meMA.Ode5C2T.incipit
ltx/gr_redirects_goarch/me.m12.dFF:meMA.Ode5C2T.melody	@ltx/gr_gr_cog/me.m12.dFF:meMA.Ode5C2T.melody
ltx/gr_redirects_goarch/me.m12.dFF:meMA.Ode5C2T.mode	@ltx/gr_gr_cog/me.m12.dFF:meMA.Ode5C2T.mode
ltx/gr_redirects_goarch/me.m12.dFF:meMA.Ode5C2T.ode	@ltx/gr_gr_cog/me.m12.dFF:meMA.Ode5C2T.ode
ltx/gr_redirects_goarch/me.m12.dFF:meMA.Ode5C2T.text	@ltx/gr_gr_cog/me.m12.dFF:meMA.Ode5C2T.text
ltx/gr_redirects_goarch/me.m12.dFF:meMA.Ode6C11.greekmelody	@ltx/gr_gr_cog/me.m12.dFF:meMA.Ode6C11.greekmelody
ltx/gr_redirects_goarch/me.m12.dFF:meMA.Ode6C11.incipit	@ltx/gr_gr_cog/me.m12.dFF:meMA.Ode6C11.incipit
ltx/gr_redirects_goarch/me.m12.dFF:meMA.Ode6C11.melody	@ltx/gr_gr_cog/me.m12.dFF:meMA.Ode6C11.melody
ltx/gr_redirects_goarch/me.m12.dFF:meMA.Ode6C11.mode	@ltx/gr_gr_cog/me.m12.dFF:meMA.Ode6C11.mode
ltx/gr_redirects_goarch/me.m12.dFF:meMA.Ode6C11.ode	@ltx/gr_gr_cog/me.m12.dFF:meMA.Ode6C11.ode
ltx/gr_redirects_goarch/me.m12.dFF:meMA.Ode6C11.text	@ltx/gr_gr_cog/me.m12.dFF:meMA.Ode6C11.text
ltx/gr_redirects_goarch/me.m12.dFF:meMA.Ode6C12.incipit	@ltx/gr_gr_cog/me.m12.dFF:meMA.Ode6C12.incipit
ltx/gr_redirects_goarch/me.m12.dFF:meMA.Ode6C12.melody	@ltx/gr_gr_cog/me.m12.dFF:meMA.Ode6C12.melody
ltx/gr_redirects_goarch/me.m12.dFF:meMA.Ode6C12.mode	@ltx/gr_gr_cog/me.m12.dFF:meMA.Ode6C12.mode
ltx/gr_redirects_goarch/me.m12.dFF:meMA.Ode6C12.ode	@ltx/gr_gr_cog/me.m12.dFF:meMA.Ode6C12.ode
ltx/gr_redirects_goarch/me.m12.dFF:meMA.Ode6C12.text	@ltx/gr_gr_cog/me.m12.dFF:meMA.Ode6C12.text
ltx/gr_redirects_goarch/me.m12.dFF:meMA.Ode6C1T.incipit	@ltx/gr_gr_cog/me.m12.dFF:meMA.Ode6C1T.incipit
ltx/gr_redirects_goarch/me.m12.dFF:meMA.Ode6C1T.melody	@ltx/gr_gr_cog/me.m12.dFF:meMA.Ode6C1T.melody
ltx/gr_redirects_goarch/me.m12.dFF:meMA.Ode6C1T.mode	@ltx/gr_gr_cog/me.m12.dFF:meMA.Ode6C1T.mode
ltx/gr_redirects_goarch/me.m12.dFF:meMA.Ode6C1T.ode	@ltx/gr_gr_cog/me.m12.dFF:meMA.Ode6C1T.ode
ltx/gr_redirects_goarch/me.m12.dFF:meMA.Ode6C1T.text	@ltx/gr_gr_cog/me.m12.dFF:meMA.Ode6C1T.text
ltx/gr_redirects_goarch/me.m12.dFF:meMA.Ode6C21.greekmelody	@ltx/gr_gr_cog/me.m12.dFF:meMA.Ode6C21.greekmelody
ltx/gr_redirects_goarch/me.m12.dFF:meMA.Ode6C21.incipit	@ltx/gr_gr_cog/me.m12.dFF:meMA.Ode6C21.incipit
ltx/gr_redirects_goarch/me.m12.dFF:meMA.Ode6C21.melody	@ltx/gr_gr_cog/me.m12.dFF:meMA.Ode6C21.melody
ltx/gr_redirects_goarch/me.m12.dFF:meMA.Ode6C21.mode	@ltx/gr_gr_cog/me.m12.dFF:meMA.Ode6C21.mode
ltx/gr_redirects_goarch/me.m12.dFF:meMA.Ode6C21.ode	@ltx/gr_gr_cog/me.m12.dFF:meMA.Ode6C21.ode
ltx/gr_redirects_goarch/me.m12.dFF:meMA.Ode6C21.text	@ltx/gr_gr_cog/me.m12.dFF:meMA.Ode6C21.text
ltx/gr_redirects_goarch/me.m12.dFF:meMA.Ode6C22.incipit	@ltx/gr_gr_cog/me.m12.dFF:meMA.Ode6C22.incipit
ltx/gr_redirects_goarch/me.m12.dFF:meMA.Ode6C22.melody	@ltx/gr_gr_cog/me.m12.dFF:meMA.Ode6C22.melody
ltx/gr_redirects_goarch/me.m12.dFF:meMA.Ode6C22.mode	@ltx/gr_gr_cog/me.m12.dFF:meMA.Ode6C22.mode
ltx/gr_redirects_goarch/me.m12.dFF:meMA.Ode6C22.ode	@ltx/gr_gr_cog/me.m12.dFF:meMA.Ode6C22.ode
ltx/gr_redirects_goarch/me.m12.dFF:meMA.Ode6C22.text	@ltx/gr_gr_cog/me.m12.dFF:meMA.Ode6C22.text
ltx/gr_redirects_goarch/me.m12.dFF:meMA.Ode6C23.incipit	@ltx/gr_gr_cog/me.m12.dFF:meMA.Ode6C23.incipit
ltx/gr_redirects_goarch/me.m12.dFF:meMA.Ode6C23.melody	@ltx/gr_gr_cog/me.m12.dFF:meMA.Ode6C23.melody
ltx/gr_redirects_goarch/me.m12.dFF:meMA.Ode6C23.mode	@ltx/gr_gr_cog/me.m12.dFF:meMA.Ode6C23.mode
ltx/gr_redirects_goarch/me.m12.dFF:meMA.Ode6C23.ode	@ltx/gr_gr_cog/me.m12.dFF:meMA.Ode6C23.ode
ltx/gr_redirects_goarch/me.m12.dFF:meMA.Ode6C23.text	@ltx/gr_gr_cog/me.m12.dFF:meMA.Ode6C23.text
ltx/gr_redirects_goarch/me.m12.dFF:meMA.Ode6C2T.incipit	@ltx/gr_gr_cog/me.m12.dFF:meMA.Ode6C2T.incipit
ltx/gr_redirects_goarch/me.m12.dFF:meMA.Ode6C2T.melody	@ltx/gr_gr_cog/me.m12.dFF:meMA.Ode6C2T.melody
ltx/gr_redirects_goarch/me.m12.dFF:meMA.Ode6C2T.mode	@ltx/gr_gr_cog/me.m12.dFF:meMA.Ode6C2T.mode
ltx/gr_redirects_goarch/me.m12.dFF:meMA.Ode6C2T.ode	@ltx/gr_gr_cog/me.m12.dFF:meMA.Ode6C2T.ode
ltx/gr_redirects_goarch/me.m12.dFF:meMA.Ode6C2T.text	@ltx/gr_gr_cog/me.m12.dFF:meMA.Ode6C2T.text
ltx/gr_redirects_goarch/me.m12.dFF:meMA.Ode7C11.greekmelody	@ltx/gr_gr_cog/me.m12.dFF:meMA.Ode7C11.greekmelody
ltx/gr_redirects_goarch/me.m12.dFF:meMA.Ode7C11.incipit	@ltx/gr_gr_cog/me.m12.dFF:meMA.Ode7C11.incipit
ltx/gr_redirects_goarch/me.m12.dFF:meMA.Ode7C11.melody	@ltx/gr_gr_cog/me.m12.dFF:meMA.Ode7C11.melody
ltx/gr_redirects_goarch/me.m12.dFF:meMA.Ode7C11.mode	@ltx/gr_gr_cog/me.m12.dFF:meMA.Ode7C11.mode
ltx/gr_redirects_goarch/me.m12.dFF:meMA.Ode7C11.ode	@ltx/gr_gr_cog/me.m12.dFF:meMA.Ode7C11.ode
ltx/gr_redirects_goarch/me.m12.dFF:meMA.Ode7C11.text	@ltx/gr_gr_cog/me.m12.dFF:meMA.Ode7C11.text
ltx/gr_redirects_goarch/me.m12.dFF:meMA.Ode7C12.incipit	@ltx/gr_gr_cog/me.m12.dFF:meMA.Ode7C12.incipit
ltx/gr_redirects_goarch/me.m12.dFF:meMA.Ode7C12.melody	@ltx/gr_gr_cog/me.m12.dFF:meMA.Ode7C12.melody
ltx/gr_redirects_goarch/me.m12.dFF:meMA.Ode7C12.mode	@ltx/gr_gr_cog/me.m12.dFF:meMA.Ode7C12.mode
ltx/gr_redirects_goarch/me.m12.dFF:meMA.Ode7C12.ode	@ltx/gr_gr_cog/me.m12.dFF:meMA.Ode7C12.ode
ltx/gr_redirects_goarch/me.m12.dFF:meMA.Ode7C12.text	@ltx/gr_gr_cog/me.m12.dFF:meMA.Ode7C12.text
ltx/gr_redirects_goarch/me.m12.dFF:meMA.Ode7C13.incipit	@ltx/gr_gr_cog/me.m12.dFF:meMA.Ode7C13.incipit
ltx/gr_redirects_goarch/me.m12.dFF:meMA.Ode7C13.melody	@ltx/gr_gr_cog/me.m12.dFF:meMA.Ode7C13.melody
ltx/gr_redirects_goarch/me.m12.dFF:meMA.Ode7C13.mode	@ltx/gr_gr_cog/me.m12.dFF:meMA.Ode7C13.mode
ltx/gr_redirects_goarch/me.m12.dFF:meMA.Ode7C13.ode	@ltx/gr_gr_cog/me.m12.dFF:meMA.Ode7C13.ode
ltx/gr_redirects_goarch/me.m12.dFF:meMA.Ode7C13.text	@ltx/gr_gr_cog/me.m12.dFF:meMA.Ode7C13.text
ltx/gr_redirects_goarch/me.m12.dFF:meMA.Ode7C1T.incipit	@ltx/gr_gr_cog/me.m12.dFF:meMA.Ode7C1T.incipit
ltx/gr_redirects_goarch/me.m12.dFF:meMA.Ode7C1T.melody	@ltx/gr_gr_cog/me.m12.dFF:meMA.Ode7C1T.melody
ltx/gr_redirects_goarch/me.m12.dFF:meMA.Ode7C1T.mode	@ltx/gr_gr_cog/me.m12.dFF:meMA.Ode7C1T.mode
ltx/gr_redirects_goarch/me.m12.dFF:meMA.Ode7C1T.ode	@ltx/gr_gr_cog/me.m12.dFF:meMA.Ode7C1T.ode
ltx/gr_redirects_goarch/me.m12.dFF:meMA.Ode7C1T.text	@ltx/gr_gr_cog/me.m12.dFF:meMA.Ode7C1T.text
ltx/gr_redirects_goarch/me.m12.dFF:meMA.Ode7C21.greekmelody	@ltx/gr_gr_cog/me.m12.dFF:meMA.Ode7C21.greekmelody
ltx/gr_redirects_goarch/me.m12.dFF:meMA.Ode7C21.incipit	@ltx/gr_gr_cog/me.m12.dFF:meMA.Ode7C21.incipit
ltx/gr_redirects_goarch/me.m12.dFF:meMA.Ode7C21.melody	@ltx/gr_gr_cog/me.m12.dFF:meMA.Ode7C21.melody
ltx/gr_redirects_goarch/me.m12.dFF:meMA.Ode7C21.mode	@ltx/gr_gr_cog/me.m12.dFF:meMA.Ode7C21.mode
ltx/gr_redirects_goarch/me.m12.dFF:meMA.Ode7C21.ode	@ltx/gr_gr_cog/me.m12.dFF:meMA.Ode7C21.ode
ltx/gr_redirects_goarch/me.m12.dFF:meMA.Ode7C21.text	@ltx/gr_gr_cog/me.m12.dFF:meMA.Ode7C21.text
ltx/gr_redirects_goarch/me.m12.dFF:meMA.Ode7C22.incipit	@ltx/gr_gr_cog/me.m12.dFF:meMA.Ode7C22.incipit
ltx/gr_redirects_goarch/me.m12.dFF:meMA.Ode7C22.melody	@ltx/gr_gr_cog/me.m12.dFF:meMA.Ode7C22.melody
ltx/gr_redirects_goarch/me.m12.dFF:meMA.Ode7C22.mode	@ltx/gr_gr_cog/me.m12.dFF:meMA.Ode7C22.mode
ltx/gr_redirects_goarch/me.m12.dFF:meMA.Ode7C22.ode	@ltx/gr_gr_cog/me.m12.dFF:meMA.Ode7C22.ode
ltx/gr_redirects_goarch/me.m12.dFF:meMA.Ode7C22.text	@ltx/gr_gr_cog/me.m12.dFF:meMA.Ode7C22.text
ltx/gr_redirects_goarch/me.m12.dFF:meMA.Ode7C23.incipit	@ltx/gr_gr_cog/me.m12.dFF:meMA.Ode7C23.incipit
ltx/gr_redirects_goarch/me.m12.dFF:meMA.Ode7C23.melody	@ltx/gr_gr_cog/me.m12.dFF:meMA.Ode7C23.melody
ltx/gr_redirects_goarch/me.m12.dFF:meMA.Ode7C23.mode	@ltx/gr_gr_cog/me.m12.dFF:meMA.Ode7C23.mode
ltx/gr_redirects_goarch/me.m12.dFF:meMA.Ode7C23.ode	@ltx/gr_gr_cog/me.m12.dFF:meMA.Ode7C23.ode
ltx/gr_redirects_goarch/me.m12.dFF:meMA.Ode7C23.text	@ltx/gr_gr_cog/me.m12.dFF:meMA.Ode7C23.text
ltx/gr_redirects_goarch/me.m12.dFF:meMA.Ode7C2T.incipit	@ltx/gr_gr_cog/me.m12.dFF:meMA.Ode7C2T.incipit
ltx/gr_redirects_goarch/me.m12.dFF:meMA.Ode7C2T.melody	@ltx/gr_gr_cog/me.m12.dFF:meMA.Ode7C2T.melody
ltx/gr_redirects_goarch/me.m12.dFF:meMA.Ode7C2T.mode	@ltx/gr_gr_cog/me.m12.dFF:meMA.Ode7C2T.mode
ltx/gr_redirects_goarch/me.m12.dFF:meMA.Ode7C2T.ode	@ltx/gr_gr_cog/me.m12.dFF:meMA.Ode7C2T.ode
ltx/gr_redirects_goarch/me.m12.dFF:meMA.Ode7C2T.text	@ltx/gr_gr_cog/me.m12.dFF:meMA.Ode7C2T.text
ltx/gr_redirects_goarch/me.m12.dFF:meMA.Ode8C11.greekmelody	@ltx/gr_gr_cog/me.m12.dFF:meMA.Ode8C11.greekmelody
ltx/gr_redirects_goarch/me.m12.dFF:meMA.Ode8C11.incipit	@ltx/gr_gr_cog/me.m12.dFF:meMA.Ode8C11.incipit
ltx/gr_redirects_goarch/me.m12.dFF:meMA.Ode8C11.melody	@ltx/gr_gr_cog/me.m12.dFF:meMA.Ode8C11.melody
ltx/gr_redirects_goarch/me.m12.dFF:meMA.Ode8C11.mode	@ltx/gr_gr_cog/me.m12.dFF:meMA.Ode8C11.mode
ltx/gr_redirects_goarch/me.m12.dFF:meMA.Ode8C11.ode	@ltx/gr_gr_cog/me.m12.dFF:meMA.Ode8C11.ode
ltx/gr_redirects_goarch/me.m12.dFF:meMA.Ode8C11.text	@ltx/gr_gr_cog/me.m12.dFF:meMA.Ode8C11.text
ltx/gr_redirects_goarch/me.m12.dFF:meMA.Ode8C12.incipit	@ltx/gr_gr_cog/me.m12.dFF:meMA.Ode8C12.incipit
ltx/gr_redirects_goarch/me.m12.dFF:meMA.Ode8C12.melody	@ltx/gr_gr_cog/me.m12.dFF:meMA.Ode8C12.melody
ltx/gr_redirects_goarch/me.m12.dFF:meMA.Ode8C12.mode	@ltx/gr_gr_cog/me.m12.dFF:meMA.Ode8C12.mode
ltx/gr_redirects_goarch/me.m12.dFF:meMA.Ode8C12.ode	@ltx/gr_gr_cog/me.m12.dFF:meMA.Ode8C12.ode
ltx/gr_redirects_goarch/me.m12.dFF:meMA.Ode8C12.text	@ltx/gr_gr_cog/me.m12.dFF:meMA.Ode8C12.text
ltx/gr_redirects_goarch/me.m12.dFF:meMA.Ode8C13.incipit	@ltx/gr_gr_cog/me.m12.dFF:meMA.Ode8C13.incipit
ltx/gr_redirects_goarch/me.m12.dFF:meMA.Ode8C13.melody	@ltx/gr_gr_cog/me.m12.dFF:meMA.Ode8C13.melody
ltx/gr_redirects_goarch/me.m12.dFF:meMA.Ode8C13.mode	@ltx/gr_gr_cog/me.m12.dFF:meMA.Ode8C13.mode
ltx/gr_redirects_goarch/me.m12.dFF:meMA.Ode8C13.ode	@ltx/gr_gr_cog/me.m12.dFF:meMA.Ode8C13.ode
ltx/gr_redirects_goarch/me.m12.dFF:meMA.Ode8C13.text	@ltx/gr_gr_cog/me.m12.dFF:meMA.Ode8C13.text
ltx/gr_redirects_goarch/me.m12.dFF:meMA.Ode8C1T.incipit	@ltx/gr_gr_cog/me.m12.dFF:meMA.Ode8C1T.incipit
ltx/gr_redirects_goarch/me.m12.dFF:meMA.Ode8C1T.melody	@ltx/gr_gr_cog/me.m12.dFF:meMA.Ode8C1T.melody
ltx/gr_redirects_goarch/me.m12.dFF:meMA.Ode8C1T.mode	@ltx/gr_gr_cog/me.m12.dFF:meMA.Ode8C1T.mode
ltx/gr_redirects_goarch/me.m12.dFF:meMA.Ode8C1T.ode	@ltx/gr_gr_cog/me.m12.dFF:meMA.Ode8C1T.ode
ltx/gr_redirects_goarch/me.m12.dFF:meMA.Ode8C1T.text	@ltx/gr_gr_cog/me.m12.dFF:meMA.Ode8C1T.text
ltx/gr_redirects_goarch/me.m12.dFF:meMA.Ode8C21.greekmelody	@ltx/gr_gr_cog/me.m12.dFF:meMA.Ode8C21.greekmelody
ltx/gr_redirects_goarch/me.m12.dFF:meMA.Ode8C21.incipit	@ltx/gr_gr_cog/me.m12.dFF:meMA.Ode8C21.incipit
ltx/gr_redirects_goarch/me.m12.dFF:meMA.Ode8C21.melody	@ltx/gr_gr_cog/me.m12.dFF:meMA.Ode8C21.melody
ltx/gr_redirects_goarch/me.m12.dFF:meMA.Ode8C21.mode	@ltx/gr_gr_cog/me.m12.dFF:meMA.Ode8C21.mode
ltx/gr_redirects_goarch/me.m12.dFF:meMA.Ode8C21.ode	@ltx/gr_gr_cog/me.m12.dFF:meMA.Ode8C21.ode
ltx/gr_redirects_goarch/me.m12.dFF:meMA.Ode8C21.text	@ltx/gr_gr_cog/me.m12.dFF:meMA.Ode8C21.text
ltx/gr_redirects_goarch/me.m12.dFF:meMA.Ode8C22.incipit	@ltx/gr_gr_cog/me.m12.dFF:meMA.Ode8C22.incipit
ltx/gr_redirects_goarch/me.m12.dFF:meMA.Ode8C22.melody	@ltx/gr_gr_cog/me.m12.dFF:meMA.Ode8C22.melody
ltx/gr_redirects_goarch/me.m12.dFF:meMA.Ode8C22.mode	@ltx/gr_gr_cog/me.m12.dFF:meMA.Ode8C22.mode
ltx/gr_redirects_goarch/me.m12.dFF:meMA.Ode8C22.ode	@ltx/gr_gr_cog/me.m12.dFF:meMA.Ode8C22.ode
ltx/gr_redirects_goarch/me.m12.dFF:meMA.Ode8C22.text	@ltx/gr_gr_cog/me.m12.dFF:meMA.Ode8C22.text
ltx/gr_redirects_goarch/me.m12.dFF:meMA.Ode8C23.incipit	@ltx/gr_gr_cog/me.m12.dFF:meMA.Ode8C23.incipit
ltx/gr_redirects_goarch/me.m12.dFF:meMA.Ode8C23.melody	@ltx/gr_gr_cog/me.m12.dFF:meMA.Ode8C23.melody
ltx/gr_redirects_goarch/me.m12.dFF:meMA.Ode8C23.mode	@ltx/gr_gr_cog/me.m12.dFF:meMA.Ode8C23.mode
ltx/gr_redirects_goarch/me.m12.dFF:meMA.Ode8C23.ode	@ltx/gr_gr_cog/me.m12.dFF:meMA.Ode8C23.ode
ltx/gr_redirects_goarch/me.m12.dFF:meMA.Ode8C23.text	@ltx/gr_gr_cog/me.m12.dFF:meMA.Ode8C23.text
ltx/gr_redirects_goarch/me.m12.dFF:meMA.Ode8C2T.incipit	@ltx/gr_gr_cog/me.m12.dFF:meMA.Ode8C2T.incipit
ltx/gr_redirects_goarch/me.m12.dFF:meMA.Ode8C2T.melody	@ltx/gr_gr_cog/me.m12.dFF:meMA.Ode8C2T.melody
ltx/gr_redirects_goarch/me.m12.dFF:meMA.Ode8C2T.mode	@ltx/gr_gr_cog/me.m12.dFF:meMA.Ode8C2T.mode
ltx/gr_redirects_goarch/me.m12.dFF:meMA.Ode8C2T.ode	@ltx/gr_gr_cog/me.m12.dFF:meMA.Ode8C2T.ode
ltx/gr_redirects_goarch/me.m12.dFF:meMA.Ode8C2T.text	@ltx/gr_gr_cog/me.m12.dFF:meMA.Ode8C2T.text
ltx/gr_redirects_goarch/me.m12.dFF:meMA.Ode8C2Tr.incipit	@ltx/gr_gr_cog/me.m12.dFF:meMA.Ode8C2Tr.incipit
ltx/gr_redirects_goarch/me.m12.dFF:meMA.Ode8C2Tr.melody	@ltx/gr_gr_cog/me.m12.dFF:meMA.Ode8C2Tr.melody
ltx/gr_redirects_goarch/me.m12.dFF:meMA.Ode8C2Tr.mode	@ltx/gr_gr_cog/me.m12.dFF:meMA.Ode8C2Tr.mode
ltx/gr_redirects_goarch/me.m12.dFF:meMA.Ode8C2Tr.ode	@ltx/gr_gr_cog/me.m12.dFF:meMA.Ode8C2Tr.ode
ltx/gr_redirects_goarch/me.m12.dFF:meMA.Ode8C2Tr.text	@ltx/gr_gr_cog/me.m12.dFF:meMA.Ode8C2Tr.text
ltx/gr_redirects_goarch/me.m12.dFF:meMA.Ode9C11.greekmelody	@ltx/gr_gr_cog/me.m12.dFF:meMA.Ode9C11.greekmelody
ltx/gr_redirects_goarch/me.m12.dFF:meMA.Ode9C11.incipit	@ltx/gr_gr_cog/me.m12.dFF:meMA.Ode9C11.incipit
ltx/gr_redirects_goarch/me.m12.dFF:meMA.Ode9C11.melody	@ltx/gr_gr_cog/me.m12.dFF:meMA.Ode9C11.melody
ltx/gr_redirects_goarch/me.m12.dFF:meMA.Ode9C11.mode	@ltx/gr_gr_cog/me.m12.dFF:meMA.Ode9C11.mode
ltx/gr_redirects_goarch/me.m12.dFF:meMA.Ode9C11.ode	@ltx/gr_gr_cog/me.m12.dFF:meMA.Ode9C11.ode
ltx/gr_redirects_goarch/me.m12.dFF:meMA.Ode9C11.text	@ltx/gr_gr_cog/me.m12.dFF:meMA.Ode9C11.text
ltx/gr_redirects_goarch/me.m12.dFF:meMA.Ode9C12.incipit	@ltx/gr_gr_cog/me.m12.dFF:meMA.Ode9C12.incipit
ltx/gr_redirects_goarch/me.m12.dFF:meMA.Ode9C12.melody	@ltx/gr_gr_cog/me.m12.dFF:meMA.Ode9C12.melody
ltx/gr_redirects_goarch/me.m12.dFF:meMA.Ode9C12.mode	@ltx/gr_gr_cog/me.m12.dFF:meMA.Ode9C12.mode
ltx/gr_redirects_goarch/me.m12.dFF:meMA.Ode9C12.ode	@ltx/gr_gr_cog/me.m12.dFF:meMA.Ode9C12.ode
ltx/gr_redirects_goarch/me.m12.dFF:meMA.Ode9C12.text	@ltx/gr_gr_cog/me.m12.dFF:meMA.Ode9C12.text
ltx/gr_redirects_goarch/me.m12.dFF:meMA.Ode9C13.incipit	@ltx/gr_gr_cog/me.m12.dFF:meMA.Ode9C13.incipit
ltx/gr_redirects_goarch/me.m12.dFF:meMA.Ode9C13.melody	@ltx/gr_gr_cog/me.m12.dFF:meMA.Ode9C13.melody
ltx/gr_redirects_goarch/me.m12.dFF:meMA.Ode9C13.mode	@ltx/gr_gr_cog/me.m12.dFF:meMA.Ode9C13.mode
ltx/gr_redirects_goarch/me.m12.dFF:meMA.Ode9C13.ode	@ltx/gr_gr_cog/me.m12.dFF:meMA.Ode9C13.ode
ltx/gr_redirects_goarch/me.m12.dFF:meMA.Ode9C13.text	@ltx/gr_gr_cog/me.m12.dFF:meMA.Ode9C13.text
ltx/gr_redirects_goarch/me.m12.dFF:meMA.Ode9C1T.incipit	@ltx/gr_gr_cog/me.m12.dFF:meMA.Ode9C1T.incipit
ltx/gr_redirects_goarch/me.m12.dFF:meMA.Ode9C1T.melody	@ltx/gr_gr_cog/me.m12.dFF:meMA.Ode9C1T.melody
ltx/gr_redirects_goarch/me.m12.dFF:meMA.Ode9C1T.mode	@ltx/gr_gr_cog/me.m12.dFF:meMA.Ode9C1T.mode
ltx/gr_redirects_goarch/me.m12.dFF:meMA.Ode9C1T.ode	@ltx/gr_gr_cog/me.m12.dFF:meMA.Ode9C1T.ode
ltx/gr_redirects_goarch/me.m12.dFF:meMA.Ode9C1T.text	@ltx/gr_gr_cog/me.m12.dFF:meMA.Ode9C1T.text
ltx/gr_redirects_goarch/me.m12.dFF:meMA.Ode9C21.greekmelody	@ltx/gr_gr_cog/me.m12.dFF:meMA.Ode9C21.greekmelody
ltx/gr_redirects_goarch/me.m12.dFF:meMA.Ode9C21.incipit	@ltx/gr_gr_cog/me.m12.dFF:meMA.Ode9C21.incipit
ltx/gr_redirects_goarch/me.m12.dFF:meMA.Ode9C21.melody	@ltx/gr_gr_cog/me.m12.dFF:meMA.Ode9C21.melody
ltx/gr_redirects_goarch/me.m12.dFF:meMA.Ode9C21.mode	@ltx/gr_gr_cog/me.m12.dFF:meMA.Ode9C21.mode
ltx/gr_redirects_goarch/me.m12.dFF:meMA.Ode9C21.ode	@ltx/gr_gr_cog/me.m12.dFF:meMA.Ode9C21.ode
ltx/gr_redirects_goarch/me.m12.dFF:meMA.Ode9C21.text	@ltx/gr_gr_cog/me.m12.dFF:meMA.Ode9C21.text
ltx/gr_redirects_goarch/me.m12.dFF:meMA.Ode9C22.incipit	@ltx/gr_gr_cog/me.m12.dFF:meMA.Ode9C22.incipit
ltx/gr_redirects_goarch/me.m12.dFF:meMA.Ode9C22.melody	@ltx/gr_gr_cog/me.m12.dFF:meMA.Ode9C22.melody
ltx/gr_redirects_goarch/me.m12.dFF:meMA.Ode9C22.mode	@ltx/gr_gr_cog/me.m12.dFF:meMA.Ode9C22.mode
ltx/gr_redirects_goarch/me.m12.dFF:meMA.Ode9C22.ode	@ltx/gr_gr_cog/me.m12.dFF:meMA.Ode9C22.ode
ltx/gr_redirects_goarch/me.m12.dFF:meMA.Ode9C22.text	@ltx/gr_gr_cog/me.m12.dFF:meMA.Ode9C22.text
ltx/gr_redirects_goarch/me.m12.dFF:meMA.Ode9C23.incipit	@ltx/gr_gr_cog/me.m12.dFF:meMA.Ode9C23.incipit
ltx/gr_redirects_goarch/me.m12.dFF:meMA.Ode9C23.melody	@ltx/gr_gr_cog/me.m12.dFF:meMA.Ode9C23.melody
ltx/gr_redirects_goarch/me.m12.dFF:meMA.Ode9C23.mode	@ltx/gr_gr_cog/me.m12.dFF:meMA.Ode9C23.mode
ltx/gr_redirects_goarch/me.m12.dFF:meMA.Ode9C23.ode	@ltx/gr_gr_cog/me.m12.dFF:meMA.Ode9C23.ode
ltx/gr_redirects_goarch/me.m12.dFF:meMA.Ode9C23.text	@ltx/gr_gr_cog/me.m12.dFF:meMA.Ode9C23.text
ltx/gr_redirects_goarch/me.m12.dFF:meMA.Ode9C24.incipit	@ltx/gr_gr_cog/me.m12.dFF:meMA.Ode9C24.incipit
ltx/gr_redirects_goarch/me.m12.dFF:meMA.Ode9C24.melody	@ltx/gr_gr_cog/me.m12.dFF:meMA.Ode9C24.melody
ltx/gr_redirects_goarch/me.m12.dFF:meMA.Ode9C24.mode	@ltx/gr_gr_cog/me.m12.dFF:meMA.Ode9C24.mode
ltx/gr_redirects_goarch/me.m12.dFF:meMA.Ode9C24.ode	@ltx/gr_gr_cog/me.m12.dFF:meMA.Ode9C24.ode
ltx/gr_redirects_goarch/me.m12.dFF:meMA.Ode9C24.text	@ltx/gr_gr_cog/me.m12.dFF:meMA.Ode9C24.text
ltx/gr_redirects_goarch/me.m12.dFF:meMA.Ode9C2T.incipit	@ltx/gr_gr_cog/me.m12.dFF:meMA.Ode9C2T.incipit
ltx/gr_redirects_goarch/me.m12.dFF:meMA.Ode9C2T.melody	@ltx/gr_gr_cog/me.m12.dFF:meMA.Ode9C2T.melody
ltx/gr_redirects_goarch/me.m12.dFF:meMA.Ode9C2T.mode	@ltx/gr_gr_cog/me.m12.dFF:meMA.Ode9C2T.mode
ltx/gr_redirects_goarch/me.m12.dFF:meMA.Ode9C2T.ode	@ltx/gr_gr_cog/me.m12.dFF:meMA.Ode9C2T.ode
ltx/gr_redirects_goarch/me.m12.dFF:meMA.Ode9C2T.text	@ltx/gr_gr_cog/me.m12.dFF:meMA.Ode9C2T.text
ltx/gr_redirects_goarch/me.m12.dFF:meMA.Oikos1.text	@ltx/gr_gr_cog/me.m12.dFF:meMA.Oikos1.text
ltx/gr_redirects_goarch/me.m12.dFF:meVE.Apolytikion1.incipit	@ltx/gr_gr_cog/me.m12.dFF:meVE.Apolytikion1.incipit
ltx/gr_redirects_goarch/me.m12.dFF:meVE.Apolytikion1.melody	@ltx/gr_gr_cog/me.m12.dFF:meVE.Apolytikion1.melody
ltx/gr_redirects_goarch/me.m12.dFF:meVE.Apolytikion1.mode	@ltx/gr_gr_cog/me.m12.dFF:meVE.Apolytikion1.mode
ltx/gr_redirects_goarch/me.m12.dFF:meVE.Apolytikion1.text	@ltx/gr_gr_cog/me.m12.dFF:meVE.Apolytikion1.text
ltx/gr_redirects_goarch/me.m12.dFF:meVE.AposGlory.incipit	@ltx/gr_gr_cog/me.m12.dFF:meVE.AposGlory.incipit
ltx/gr_redirects_goarch/me.m12.dFF:meVE.AposGlory.melody	@ltx/gr_gr_cog/me.m12.dFF:meVE.AposGlory.melody
ltx/gr_redirects_goarch/me.m12.dFF:meVE.AposGlory.mode	@ltx/gr_gr_cog/me.m12.dFF:meVE.AposGlory.mode
ltx/gr_redirects_goarch/me.m12.dFF:meVE.AposGlory.poet	@ltx/gr_gr_cog/me.m12.dFF:meVE.AposGlory.poet
ltx/gr_redirects_goarch/me.m12.dFF:meVE.AposGlory.text	@ltx/gr_gr_cog/me.m12.dFF:meVE.AposGlory.text
ltx/gr_redirects_goarch/me.m12.dFF:meVE.AposTheotokion.incipit	@ltx/gr_gr_cog/me.m12.dFF:meVE.AposTheotokion.incipit
ltx/gr_redirects_goarch/me.m12.dFF:meVE.AposTheotokion.melody	@ltx/gr_gr_cog/me.m12.dFF:meVE.AposTheotokion.melody
ltx/gr_redirects_goarch/me.m12.dFF:meVE.AposTheotokion.mode	@ltx/gr_gr_cog/me.m12.dFF:meVE.AposTheotokion.mode
ltx/gr_redirects_goarch/me.m12.dFF:meVE.AposTheotokion.text	@ltx/gr_gr_cog/me.m12.dFF:meVE.AposTheotokion.text
ltx/gr_redirects_goarch/me.m12.dFF:meVE.MM.Stichera123as567.text	@ltx/gr_gr_cog/me.m12.dFF:meVE.MM.Stichera123as567.text
ltx/gr_redirects_goarch/me.m12.dFF:meVE.SticGlory.incipit	@ltx/gr_gr_cog/me.m12.dFF:meVE.SticGlory.incipit
ltx/gr_redirects_goarch/me.m12.dFF:meVE.SticGlory.melody	@ltx/gr_gr_cog/me.m12.dFF:meVE.SticGlory.melody
ltx/gr_redirects_goarch/me.m12.dFF:meVE.SticGlory.mode	@ltx/gr_gr_cog/me.m12.dFF:meVE.SticGlory.mode
ltx/gr_redirects_goarch/me.m12.dFF:meVE.SticGlory.poet	@ltx/gr_gr_cog/me.m12.dFF:meVE.SticGlory.poet
ltx/gr_redirects_goarch/me.m12.dFF:meVE.SticGlory.text	@ltx/gr_gr_cog/me.m12.dFF:meVE.SticGlory.text
ltx/gr_redirects_goarch/me.m12.dFF:meVE.Stichera01.greekmelody	@ltx/gr_gr_cog/me.m12.dFF:meVE.Stichera01.greekmelody
ltx/gr_redirects_goarch/me.m12.dFF:meVE.Stichera01.incipit	@ltx/gr_gr_cog/me.m12.dFF:meVE.Stichera01.incipit
ltx/gr_redirects_goarch/me.m12.dFF:meVE.Stichera01.melody	@ltx/gr_gr_cog/me.m12.dFF:meVE.Stichera01.melody
ltx/gr_redirects_goarch/me.m12.dFF:meVE.Stichera01.mode	@ltx/gr_gr_cog/me.m12.dFF:meVE.Stichera01.mode
ltx/gr_redirects_goarch/me.m12.dFF:meVE.Stichera01.text	@ltx/gr_gr_cog/me.m12.dFF:meVE.Stichera01.text
ltx/gr_redirects_goarch/me.m12.dFF:meVE.Stichera02.incipit	@ltx/gr_gr_cog/me.m12.dFF:meVE.Stichera02.incipit
ltx/gr_redirects_goarch/me.m12.dFF:meVE.Stichera02.melody	@ltx/gr_gr_cog/me.m12.dFF:meVE.Stichera02.melody
ltx/gr_redirects_goarch/me.m12.dFF:meVE.Stichera02.mode	@ltx/gr_gr_cog/me.m12.dFF:meVE.Stichera02.mode
ltx/gr_redirects_goarch/me.m12.dFF:meVE.Stichera02.text	@ltx/gr_gr_cog/me.m12.dFF:meVE.Stichera02.text
ltx/gr_redirects_goarch/me.m12.dFF:meVE.Stichera03.incipit	@ltx/gr_gr_cog/me.m12.dFF:meVE.Stichera03.incipit
ltx/gr_redirects_goarch/me.m12.dFF:meVE.Stichera03.melody	@ltx/gr_gr_cog/me.m12.dFF:meVE.Stichera03.melody
ltx/gr_redirects_goarch/me.m12.dFF:meVE.Stichera03.mode	@ltx/gr_gr_cog/me.m12.dFF:meVE.Stichera03.mode
ltx/gr_redirects_goarch/me.m12.dFF:meVE.Stichera03.text	@ltx/gr_gr_cog/me.m12.dFF:meVE.Stichera03.text
ltx/gr_redirects_goarch/me.m12.dFF:meVE.Stichera04.greekmelody	@ltx/gr_gr_cog/me.m12.dFF:meVE.Stichera04.greekmelody
ltx/gr_redirects_goarch/me.m12.dFF:meVE.Stichera04.incipit	@ltx/gr_gr_cog/me.m12.dFF:meVE.Stichera04.incipit
ltx/gr_redirects_goarch/me.m12.dFF:meVE.Stichera04.melody	@ltx/gr_gr_cog/me.m12.dFF:meVE.Stichera04.melody
ltx/gr_redirects_goarch/me.m12.dFF:meVE.Stichera04.mode	@ltx/gr_gr_cog/me.m12.dFF:meVE.Stichera04.mode
ltx/gr_redirects_goarch/me.m12.dFF:meVE.Stichera04.text	@ltx/gr_gr_cog/me.m12.dFF:meVE.Stichera04.text
