ltx/gr_redirects_goarch/le.pr.tr.d044:lemcTE.reading1.book_abbr	@ltx/gr_gr_cog/le.pr.tr.d044:lemcTE.reading1.book_abbr
ltx/gr_redirects_goarch/le.pr.tr.d044:lemcTE.reading1.book_string	@ltx/gr_gr_cog/le.pr.tr.d044:lemcTE.reading1.book_string
ltx/gr_redirects_goarch/le.pr.tr.d044:lemcTE.reading1.chapverse	@ltx/gr_gr_cog/le.pr.tr.d044:lemcTE.reading1.chapverse
ltx/gr_redirects_goarch/le.pr.tr.d044:lemcTE.reading1.incipit	@ltx/gr_gr_cog/le.pr.tr.d044:lemcTE.reading1.incipit
ltx/gr_redirects_goarch/le.pr.tr.d044:lemcTE.reading1.text	@ltx/gr_gr_cog/le.pr.tr.d044:lemcTE.reading1.text
ltx/gr_redirects_goarch/le.pr.tr.d044:lemcTE.reading1.title	@ltx/gr_gr_cog/le.pr.tr.d044:lemcTE.reading1.title
ltx/gr_redirects_goarch/le.pr.tr.d044:lemcTE.reading1.title_abbr	@ltx/gr_gr_cog/le.pr.tr.d044:lemcTE.reading1.title_abbr
ltx/gr_redirects_goarch/le.pr.tr.d044:lemcTE.reading1.version	@ltx/gr_gr_cog/le.pr.tr.d044:lemcTE.reading1.version
