ltx/gr_redirects_goarch/le.go.me.m08.d07:lemeLI.Gospel.book_abbr	@ltx/gr_gr_cog/le.go.me.m08.d07:lemeLI.Gospel.book_abbr
ltx/gr_redirects_goarch/le.go.me.m08.d07:lemeLI.Gospel.book_string	@ltx/gr_gr_cog/le.go.me.m08.d07:lemeLI.Gospel.book_string
ltx/gr_redirects_goarch/le.go.me.m08.d07:lemeLI.Gospel.chapverse	@ltx/gr_gr_cog/le.go.me.m08.d07:lemeLI.Gospel.chapverse
ltx/gr_redirects_goarch/le.go.me.m08.d07:lemeLI.Gospel.incipit	@ltx/gr_gr_cog/le.go.me.m08.d07:lemeLI.Gospel.incipit
ltx/gr_redirects_goarch/le.go.me.m08.d07:lemeLI.Gospel.text	@ltx/gr_gr_cog/le.go.me.m08.d07:lemeLI.Gospel.text
ltx/gr_redirects_goarch/le.go.me.m08.d07:lemeLI.Gospel.title	@ltx/gr_gr_cog/le.go.me.m08.d07:lemeLI.Gospel.title
ltx/gr_redirects_goarch/le.go.me.m08.d07:lemeLI.Gospel.title_abbr	@ltx/gr_gr_cog/le.go.me.m08.d07:lemeLI.Gospel.title_abbr
ltx/gr_redirects_goarch/le.go.me.m08.d07:lemeLI.Gospel.version	@ltx/gr_gr_cog/le.go.me.m08.d07:lemeLI.Gospel.version
