ltx/gr_redirects_goarch/ho.ho15.m11:ho.Days	@ltx/gr_gr_cog/ho.ho15.m11:ho.Days
ltx/gr_redirects_goarch/ho.ho15.m11:ho.Hours	@ltx/gr_gr_cog/ho.ho15.m11:ho.Hours
ltx/gr_redirects_goarch/ho.ho15.m11:ho.Month	@ltx/gr_gr_cog/ho.ho15.m11:ho.Month
ltx/gr_redirects_goarch/ho.ho15.m11:hoD03.Apolytikion1.incipit	@ltx/gr_gr_cog/ho.ho15.m11:hoD03.Apolytikion1.incipit
ltx/gr_redirects_goarch/ho.ho15.m11:hoD03.Apolytikion1.melody	@ltx/gr_gr_cog/ho.ho15.m11:hoD03.Apolytikion1.melody
ltx/gr_redirects_goarch/ho.ho15.m11:hoD03.Apolytikion1.mode	@ltx/gr_gr_cog/ho.ho15.m11:hoD03.Apolytikion1.mode
ltx/gr_redirects_goarch/ho.ho15.m11:hoD03.Apolytikion1.poet	@ltx/gr_gr_cog/ho.ho15.m11:hoD03.Apolytikion1.poet
ltx/gr_redirects_goarch/ho.ho15.m11:hoD03.Apolytikion1.text	@ltx/gr_gr_cog/ho.ho15.m11:hoD03.Apolytikion1.text
ltx/gr_redirects_goarch/ho.ho15.m11:hoD03.Apolytikion1.title	@ltx/gr_gr_cog/ho.ho15.m11:hoD03.Apolytikion1.title
ltx/gr_redirects_goarch/ho.ho15.m11:hoD03.Apolytikion2.greekmelody	@ltx/gr_gr_cog/ho.ho15.m11:hoD03.Apolytikion2.greekmelody
ltx/gr_redirects_goarch/ho.ho15.m11:hoD03.Apolytikion2.incipit	@ltx/gr_gr_cog/ho.ho15.m11:hoD03.Apolytikion2.incipit
ltx/gr_redirects_goarch/ho.ho15.m11:hoD03.Apolytikion2.melody	@ltx/gr_gr_cog/ho.ho15.m11:hoD03.Apolytikion2.melody
ltx/gr_redirects_goarch/ho.ho15.m11:hoD03.Apolytikion2.mode	@ltx/gr_gr_cog/ho.ho15.m11:hoD03.Apolytikion2.mode
ltx/gr_redirects_goarch/ho.ho15.m11:hoD03.Apolytikion2.poet	@ltx/gr_gr_cog/ho.ho15.m11:hoD03.Apolytikion2.poet
ltx/gr_redirects_goarch/ho.ho15.m11:hoD03.Apolytikion2.text	@ltx/gr_gr_cog/ho.ho15.m11:hoD03.Apolytikion2.text
ltx/gr_redirects_goarch/ho.ho15.m11:hoD03.Apolytikion2.title	@ltx/gr_gr_cog/ho.ho15.m11:hoD03.Apolytikion2.title
ltx/gr_redirects_goarch/ho.ho15.m11:hoD03.Apolytikion3.greekmelody	@ltx/gr_gr_cog/ho.ho15.m11:hoD03.Apolytikion3.greekmelody
ltx/gr_redirects_goarch/ho.ho15.m11:hoD03.Apolytikion3.incipit	@ltx/gr_gr_cog/ho.ho15.m11:hoD03.Apolytikion3.incipit
ltx/gr_redirects_goarch/ho.ho15.m11:hoD03.Apolytikion3.melody	@ltx/gr_gr_cog/ho.ho15.m11:hoD03.Apolytikion3.melody
ltx/gr_redirects_goarch/ho.ho15.m11:hoD03.Apolytikion3.mode	@ltx/gr_gr_cog/ho.ho15.m11:hoD03.Apolytikion3.mode
ltx/gr_redirects_goarch/ho.ho15.m11:hoD03.Apolytikion3.poet	@ltx/gr_gr_cog/ho.ho15.m11:hoD03.Apolytikion3.poet
ltx/gr_redirects_goarch/ho.ho15.m11:hoD03.Apolytikion3.text	@ltx/gr_gr_cog/ho.ho15.m11:hoD03.Apolytikion3.text
ltx/gr_redirects_goarch/ho.ho15.m11:hoD03.Apolytikion3.title	@ltx/gr_gr_cog/ho.ho15.m11:hoD03.Apolytikion3.title
ltx/gr_redirects_goarch/ho.ho15.m11:hoD05.Apolytikion1.greekmelody	@ltx/gr_gr_cog/ho.ho15.m11:hoD05.Apolytikion1.greekmelody
ltx/gr_redirects_goarch/ho.ho15.m11:hoD05.Apolytikion1.incipit	@ltx/gr_gr_cog/ho.ho15.m11:hoD05.Apolytikion1.incipit
ltx/gr_redirects_goarch/ho.ho15.m11:hoD05.Apolytikion1.melody	@ltx/gr_gr_cog/ho.ho15.m11:hoD05.Apolytikion1.melody
ltx/gr_redirects_goarch/ho.ho15.m11:hoD05.Apolytikion1.mode	@ltx/gr_gr_cog/ho.ho15.m11:hoD05.Apolytikion1.mode
ltx/gr_redirects_goarch/ho.ho15.m11:hoD05.Apolytikion1.poet	@ltx/gr_gr_cog/ho.ho15.m11:hoD05.Apolytikion1.poet
ltx/gr_redirects_goarch/ho.ho15.m11:hoD05.Apolytikion1.text	@ltx/gr_gr_cog/ho.ho15.m11:hoD05.Apolytikion1.text
ltx/gr_redirects_goarch/ho.ho15.m11:hoD05.Apolytikion1.title	@ltx/gr_gr_cog/ho.ho15.m11:hoD05.Apolytikion1.title
ltx/gr_redirects_goarch/ho.ho15.m11:hoD09.GeneralApolytikion1.name	@ltx/gr_gr_cog/ho.ho15.m11:hoD09.GeneralApolytikion1.name
ltx/gr_redirects_goarch/ho.ho15.m11:hoD11.GeneralApolytikion3.melody	@ltx/gr_gr_cog/ho.ho15.m11:hoD11.GeneralApolytikion3.melody
ltx/gr_redirects_goarch/ho.ho15.m11:hoD11.GeneralApolytikion3.mode	@ltx/gr_gr_cog/ho.ho15.m11:hoD11.GeneralApolytikion3.mode
ltx/gr_redirects_goarch/ho.ho15.m11:hoD11.GeneralApolytikion3.name	@ltx/gr_gr_cog/ho.ho15.m11:hoD11.GeneralApolytikion3.name
ltx/gr_redirects_goarch/ho.ho15.m11:hoD11.GeneralApolytikion3.poet	@ltx/gr_gr_cog/ho.ho15.m11:hoD11.GeneralApolytikion3.poet
ltx/gr_redirects_goarch/ho.ho15.m11:hoD11.GeneralApolytikion3.title	@ltx/gr_gr_cog/ho.ho15.m11:hoD11.GeneralApolytikion3.title
ltx/gr_redirects_goarch/ho.ho15.m11:hoD12.GeneralApolytikion2.melody	@ltx/gr_gr_cog/ho.ho15.m11:hoD12.GeneralApolytikion2.melody
ltx/gr_redirects_goarch/ho.ho15.m11:hoD12.GeneralApolytikion2.mode	@ltx/gr_gr_cog/ho.ho15.m11:hoD12.GeneralApolytikion2.mode
ltx/gr_redirects_goarch/ho.ho15.m11:hoD12.GeneralApolytikion2.name	@ltx/gr_gr_cog/ho.ho15.m11:hoD12.GeneralApolytikion2.name
ltx/gr_redirects_goarch/ho.ho15.m11:hoD12.GeneralApolytikion2.poet	@ltx/gr_gr_cog/ho.ho15.m11:hoD12.GeneralApolytikion2.poet
ltx/gr_redirects_goarch/ho.ho15.m11:hoD12.GeneralApolytikion2.title	@ltx/gr_gr_cog/ho.ho15.m11:hoD12.GeneralApolytikion2.title
ltx/gr_redirects_goarch/ho.ho15.m11:hoD19.GeneralApolytikion1.name	@ltx/gr_gr_cog/ho.ho15.m11:hoD19.GeneralApolytikion1.name
