ltx/gr_redirects_goarch/me.m07.d05:meDA.commemoration.first	@ltx/gr_gr_cog/me.m07.d05:meDA.commemoration.first
ltx/gr_redirects_goarch/me.m07.d05:meDA.commemoration.first_name	@ltx/gr_gr_cog/me.m07.d05:meDA.commemoration.first_name
ltx/gr_redirects_goarch/me.m07.d05:meDA.commemoration.first_short	@ltx/gr_gr_cog/me.m07.d05:meDA.commemoration.first_short
ltx/gr_redirects_goarch/me.m07.d05:meDA.commemoration.first_title	@ltx/gr_gr_cog/me.m07.d05:meDA.commemoration.first_title
ltx/gr_redirects_goarch/me.m07.d05:meDA.commemoration.full	@ltx/gr_gr_cog/me.m07.d05:meDA.commemoration.full
ltx/gr_redirects_goarch/me.m07.d05:meDA.commemoration.second_name	@ltx/gr_gr_cog/me.m07.d05:meDA.commemoration.second_name
ltx/gr_redirects_goarch/me.m07.d05:meDA.commemoration.second_title	@ltx/gr_gr_cog/me.m07.d05:meDA.commemoration.second_title
ltx/gr_redirects_goarch/me.m07.d05:meDA.date	@ltx/gr_gr_cog/me.m07.d05:meDA.date
ltx/gr_redirects_goarch/me.m07.d05:meDA.fordate	@ltx/gr_gr_cog/me.m07.d05:meDA.fordate
ltx/gr_redirects_goarch/me.m07.d05:meDA.insert1	@ltx/gr_gr_cog/me.m07.d05:meDA.insert1
ltx/gr_redirects_goarch/me.m07.d05:meDA.insert2	@ltx/gr_gr_cog/me.m07.d05:meDA.insert2
ltx/gr_redirects_goarch/me.m07.d05:meDA.note	@ltx/gr_gr_cog/me.m07.d05:meDA.note
ltx/gr_redirects_goarch/me.m07.d05:meDA.pdfcoverdate	@ltx/gr_gr_cog/me.m07.d05:meDA.pdfcoverdate
ltx/gr_redirects_goarch/me.m07.d05:meDA.pdfheaderdate	@ltx/gr_gr_cog/me.m07.d05:meDA.pdfheaderdate
ltx/gr_redirects_goarch/me.m07.d05:meHO.commemorations	@ltx/gr_gr_cog/me.m07.d05:meHO.commemorations
ltx/gr_redirects_goarch/me.m07.d05:meHO.note1	@ltx/gr_gr_cog/me.m07.d05:meHO.note1
ltx/gr_redirects_goarch/me.m07.d05:meHO.note2	@ltx/gr_gr_cog/me.m07.d05:meHO.note2
ltx/gr_redirects_goarch/me.m07.d05:meHO.number	@ltx/gr_gr_cog/me.m07.d05:meHO.number
ltx/gr_redirects_goarch/me.m07.d05:meHO.rank	@ltx/gr_gr_cog/me.m07.d05:meHO.rank
ltx/gr_redirects_goarch/me.m07.d05:meLE.commemoration1	@ltx/gr_gr_cog/me.m07.d05:meLE.commemoration1
ltx/gr_redirects_goarch/me.m07.d05:meLE.commemoration2	@ltx/gr_gr_cog/me.m07.d05:meLE.commemoration2
ltx/gr_redirects_goarch/me.m07.d05:meLI.Kontakion1.greekmelody	@ltx/gr_gr_cog/me.m07.d05:meLI.Kontakion1.greekmelody
ltx/gr_redirects_goarch/me.m07.d05:meLI.Kontakion1.incipit	@ltx/gr_gr_cog/me.m07.d05:meLI.Kontakion1.incipit
ltx/gr_redirects_goarch/me.m07.d05:meLI.Kontakion1.melody	@ltx/gr_gr_cog/me.m07.d05:meLI.Kontakion1.melody
ltx/gr_redirects_goarch/me.m07.d05:meLI.Kontakion1.mode	@ltx/gr_gr_cog/me.m07.d05:meLI.Kontakion1.mode
ltx/gr_redirects_goarch/me.m07.d05:meLI.Kontakion1.text	@ltx/gr_gr_cog/me.m07.d05:meLI.Kontakion1.text
ltx/gr_redirects_goarch/me.m07.d05:meLI.Megalynarion.text	@ltx/gr_gr_cog/me.m07.d05:meLI.Megalynarion.text
ltx/gr_redirects_goarch/me.m07.d05:meMA.C1.acrostic.notice1	@ltx/gr_gr_cog/me.m07.d05:meMA.C1.acrostic.notice1
ltx/gr_redirects_goarch/me.m07.d05:meMA.C1.acrostic.text	@ltx/gr_gr_cog/me.m07.d05:meMA.C1.acrostic.text
ltx/gr_redirects_goarch/me.m07.d05:meMA.C1.acrostic.title	@ltx/gr_gr_cog/me.m07.d05:meMA.C1.acrostic.title
ltx/gr_redirects_goarch/me.m07.d05:meMA.C1.title	@ltx/gr_gr_cog/me.m07.d05:meMA.C1.title
ltx/gr_redirects_goarch/me.m07.d05:meMA.C1.verse	@ltx/gr_gr_cog/me.m07.d05:meMA.C1.verse
ltx/gr_redirects_goarch/me.m07.d05:meMA.C2.title	@ltx/gr_gr_cog/me.m07.d05:meMA.C2.title
ltx/gr_redirects_goarch/me.m07.d05:meMA.C2.verse	@ltx/gr_gr_cog/me.m07.d05:meMA.C2.verse
ltx/gr_redirects_goarch/me.m07.d05:meMA.ExapTheotokion.incipit	@ltx/gr_gr_cog/me.m07.d05:meMA.ExapTheotokion.incipit
ltx/gr_redirects_goarch/me.m07.d05:meMA.ExapTheotokion.melody	@ltx/gr_gr_cog/me.m07.d05:meMA.ExapTheotokion.melody
ltx/gr_redirects_goarch/me.m07.d05:meMA.ExapTheotokion.mode	@ltx/gr_gr_cog/me.m07.d05:meMA.ExapTheotokion.mode
ltx/gr_redirects_goarch/me.m07.d05:meMA.ExapTheotokion.text	@ltx/gr_gr_cog/me.m07.d05:meMA.ExapTheotokion.text
ltx/gr_redirects_goarch/me.m07.d05:meMA.Exaposteilarion1.greekmelody	@ltx/gr_gr_cog/me.m07.d05:meMA.Exaposteilarion1.greekmelody
ltx/gr_redirects_goarch/me.m07.d05:meMA.Exaposteilarion1.incipit	@ltx/gr_gr_cog/me.m07.d05:meMA.Exaposteilarion1.incipit
ltx/gr_redirects_goarch/me.m07.d05:meMA.Exaposteilarion1.melody	@ltx/gr_gr_cog/me.m07.d05:meMA.Exaposteilarion1.melody
ltx/gr_redirects_goarch/me.m07.d05:meMA.Exaposteilarion1.mode	@ltx/gr_gr_cog/me.m07.d05:meMA.Exaposteilarion1.mode
ltx/gr_redirects_goarch/me.m07.d05:meMA.Exaposteilarion1.text	@ltx/gr_gr_cog/me.m07.d05:meMA.Exaposteilarion1.text
ltx/gr_redirects_goarch/me.m07.d05:meMA.Kathisma11.greekmelody	@ltx/gr_gr_cog/me.m07.d05:meMA.Kathisma11.greekmelody
ltx/gr_redirects_goarch/me.m07.d05:meMA.Kathisma11.incipit	@ltx/gr_gr_cog/me.m07.d05:meMA.Kathisma11.incipit
ltx/gr_redirects_goarch/me.m07.d05:meMA.Kathisma11.melody	@ltx/gr_gr_cog/me.m07.d05:meMA.Kathisma11.melody
ltx/gr_redirects_goarch/me.m07.d05:meMA.Kathisma11.mode	@ltx/gr_gr_cog/me.m07.d05:meMA.Kathisma11.mode
ltx/gr_redirects_goarch/me.m07.d05:meMA.Kathisma11.text	@ltx/gr_gr_cog/me.m07.d05:meMA.Kathisma11.text
ltx/gr_redirects_goarch/me.m07.d05:meMA.Kathisma1T.incipit	@ltx/gr_gr_cog/me.m07.d05:meMA.Kathisma1T.incipit
ltx/gr_redirects_goarch/me.m07.d05:meMA.Kathisma1T.melody	@ltx/gr_gr_cog/me.m07.d05:meMA.Kathisma1T.melody
ltx/gr_redirects_goarch/me.m07.d05:meMA.Kathisma1T.mode	@ltx/gr_gr_cog/me.m07.d05:meMA.Kathisma1T.mode
ltx/gr_redirects_goarch/me.m07.d05:meMA.Kathisma1T.text	@ltx/gr_gr_cog/me.m07.d05:meMA.Kathisma1T.text
ltx/gr_redirects_goarch/me.m07.d05:meMA.Kathisma21.greekmelody	@ltx/gr_gr_cog/me.m07.d05:meMA.Kathisma21.greekmelody
ltx/gr_redirects_goarch/me.m07.d05:meMA.Kathisma21.incipit	@ltx/gr_gr_cog/me.m07.d05:meMA.Kathisma21.incipit
ltx/gr_redirects_goarch/me.m07.d05:meMA.Kathisma21.melody	@ltx/gr_gr_cog/me.m07.d05:meMA.Kathisma21.melody
ltx/gr_redirects_goarch/me.m07.d05:meMA.Kathisma21.mode	@ltx/gr_gr_cog/me.m07.d05:meMA.Kathisma21.mode
ltx/gr_redirects_goarch/me.m07.d05:meMA.Kathisma21.text	@ltx/gr_gr_cog/me.m07.d05:meMA.Kathisma21.text
ltx/gr_redirects_goarch/me.m07.d05:meMA.Kathisma2T.incipit	@ltx/gr_gr_cog/me.m07.d05:meMA.Kathisma2T.incipit
ltx/gr_redirects_goarch/me.m07.d05:meMA.Kathisma2T.melody	@ltx/gr_gr_cog/me.m07.d05:meMA.Kathisma2T.melody
ltx/gr_redirects_goarch/me.m07.d05:meMA.Kathisma2T.mode	@ltx/gr_gr_cog/me.m07.d05:meMA.Kathisma2T.mode
ltx/gr_redirects_goarch/me.m07.d05:meMA.Kathisma2T.text	@ltx/gr_gr_cog/me.m07.d05:meMA.Kathisma2T.text
ltx/gr_redirects_goarch/me.m07.d05:meMA.Kontakion1.greekmelody	@ltx/gr_gr_cog/me.m07.d05:meMA.Kontakion1.greekmelody
ltx/gr_redirects_goarch/me.m07.d05:meMA.Kontakion1.incipit	@ltx/gr_gr_cog/me.m07.d05:meMA.Kontakion1.incipit
ltx/gr_redirects_goarch/me.m07.d05:meMA.Kontakion1.melody	@ltx/gr_gr_cog/me.m07.d05:meMA.Kontakion1.melody
ltx/gr_redirects_goarch/me.m07.d05:meMA.Kontakion1.mode	@ltx/gr_gr_cog/me.m07.d05:meMA.Kontakion1.mode
ltx/gr_redirects_goarch/me.m07.d05:meMA.Kontakion1.text	@ltx/gr_gr_cog/me.m07.d05:meMA.Kontakion1.text
ltx/gr_redirects_goarch/me.m07.d05:meMA.Lauds1.greekmelody	@ltx/gr_gr_cog/me.m07.d05:meMA.Lauds1.greekmelody
ltx/gr_redirects_goarch/me.m07.d05:meMA.Lauds1.incipit	@ltx/gr_gr_cog/me.m07.d05:meMA.Lauds1.incipit
ltx/gr_redirects_goarch/me.m07.d05:meMA.Lauds1.melody	@ltx/gr_gr_cog/me.m07.d05:meMA.Lauds1.melody
ltx/gr_redirects_goarch/me.m07.d05:meMA.Lauds1.mode	@ltx/gr_gr_cog/me.m07.d05:meMA.Lauds1.mode
ltx/gr_redirects_goarch/me.m07.d05:meMA.Lauds1.text	@ltx/gr_gr_cog/me.m07.d05:meMA.Lauds1.text
ltx/gr_redirects_goarch/me.m07.d05:meMA.Lauds2.incipit	@ltx/gr_gr_cog/me.m07.d05:meMA.Lauds2.incipit
ltx/gr_redirects_goarch/me.m07.d05:meMA.Lauds2.melody	@ltx/gr_gr_cog/me.m07.d05:meMA.Lauds2.melody
ltx/gr_redirects_goarch/me.m07.d05:meMA.Lauds2.mode	@ltx/gr_gr_cog/me.m07.d05:meMA.Lauds2.mode
ltx/gr_redirects_goarch/me.m07.d05:meMA.Lauds2.text	@ltx/gr_gr_cog/me.m07.d05:meMA.Lauds2.text
ltx/gr_redirects_goarch/me.m07.d05:meMA.Lauds3.incipit	@ltx/gr_gr_cog/me.m07.d05:meMA.Lauds3.incipit
ltx/gr_redirects_goarch/me.m07.d05:meMA.Lauds3.melody	@ltx/gr_gr_cog/me.m07.d05:meMA.Lauds3.melody
ltx/gr_redirects_goarch/me.m07.d05:meMA.Lauds3.mode	@ltx/gr_gr_cog/me.m07.d05:meMA.Lauds3.mode
ltx/gr_redirects_goarch/me.m07.d05:meMA.Lauds3.text	@ltx/gr_gr_cog/me.m07.d05:meMA.Lauds3.text
ltx/gr_redirects_goarch/me.m07.d05:meMA.LaudsGlory.incipit	@ltx/gr_gr_cog/me.m07.d05:meMA.LaudsGlory.incipit
ltx/gr_redirects_goarch/me.m07.d05:meMA.LaudsGlory.melody	@ltx/gr_gr_cog/me.m07.d05:meMA.LaudsGlory.melody
ltx/gr_redirects_goarch/me.m07.d05:meMA.LaudsGlory.mode	@ltx/gr_gr_cog/me.m07.d05:meMA.LaudsGlory.mode
ltx/gr_redirects_goarch/me.m07.d05:meMA.LaudsGlory.text	@ltx/gr_gr_cog/me.m07.d05:meMA.LaudsGlory.text
ltx/gr_redirects_goarch/me.m07.d05:meMA.LaudsTheotokion.incipit	@ltx/gr_gr_cog/me.m07.d05:meMA.LaudsTheotokion.incipit
ltx/gr_redirects_goarch/me.m07.d05:meMA.LaudsTheotokion.melody	@ltx/gr_gr_cog/me.m07.d05:meMA.LaudsTheotokion.melody
ltx/gr_redirects_goarch/me.m07.d05:meMA.LaudsTheotokion.mode	@ltx/gr_gr_cog/me.m07.d05:meMA.LaudsTheotokion.mode
ltx/gr_redirects_goarch/me.m07.d05:meMA.LaudsTheotokion.text	@ltx/gr_gr_cog/me.m07.d05:meMA.LaudsTheotokion.text
ltx/gr_redirects_goarch/me.m07.d05:meMA.MM.Lauds1123as5678.text	@ltx/gr_gr_cog/me.m07.d05:meMA.MM.Lauds1123as5678.text
ltx/gr_redirects_goarch/me.m07.d05:meMA.Ode1C11.greekmelody	@ltx/gr_gr_cog/me.m07.d05:meMA.Ode1C11.greekmelody
ltx/gr_redirects_goarch/me.m07.d05:meMA.Ode1C11.incipit	@ltx/gr_gr_cog/me.m07.d05:meMA.Ode1C11.incipit
ltx/gr_redirects_goarch/me.m07.d05:meMA.Ode1C11.melody	@ltx/gr_gr_cog/me.m07.d05:meMA.Ode1C11.melody
ltx/gr_redirects_goarch/me.m07.d05:meMA.Ode1C11.mode	@ltx/gr_gr_cog/me.m07.d05:meMA.Ode1C11.mode
ltx/gr_redirects_goarch/me.m07.d05:meMA.Ode1C11.ode	@ltx/gr_gr_cog/me.m07.d05:meMA.Ode1C11.ode
ltx/gr_redirects_goarch/me.m07.d05:meMA.Ode1C11.text	@ltx/gr_gr_cog/me.m07.d05:meMA.Ode1C11.text
ltx/gr_redirects_goarch/me.m07.d05:meMA.Ode1C12.incipit	@ltx/gr_gr_cog/me.m07.d05:meMA.Ode1C12.incipit
ltx/gr_redirects_goarch/me.m07.d05:meMA.Ode1C12.melody	@ltx/gr_gr_cog/me.m07.d05:meMA.Ode1C12.melody
ltx/gr_redirects_goarch/me.m07.d05:meMA.Ode1C12.mode	@ltx/gr_gr_cog/me.m07.d05:meMA.Ode1C12.mode
ltx/gr_redirects_goarch/me.m07.d05:meMA.Ode1C12.ode	@ltx/gr_gr_cog/me.m07.d05:meMA.Ode1C12.ode
ltx/gr_redirects_goarch/me.m07.d05:meMA.Ode1C12.text	@ltx/gr_gr_cog/me.m07.d05:meMA.Ode1C12.text
ltx/gr_redirects_goarch/me.m07.d05:meMA.Ode1C13.incipit	@ltx/gr_gr_cog/me.m07.d05:meMA.Ode1C13.incipit
ltx/gr_redirects_goarch/me.m07.d05:meMA.Ode1C13.melody	@ltx/gr_gr_cog/me.m07.d05:meMA.Ode1C13.melody
ltx/gr_redirects_goarch/me.m07.d05:meMA.Ode1C13.mode	@ltx/gr_gr_cog/me.m07.d05:meMA.Ode1C13.mode
ltx/gr_redirects_goarch/me.m07.d05:meMA.Ode1C13.ode	@ltx/gr_gr_cog/me.m07.d05:meMA.Ode1C13.ode
ltx/gr_redirects_goarch/me.m07.d05:meMA.Ode1C13.text	@ltx/gr_gr_cog/me.m07.d05:meMA.Ode1C13.text
ltx/gr_redirects_goarch/me.m07.d05:meMA.Ode1C1T.incipit	@ltx/gr_gr_cog/me.m07.d05:meMA.Ode1C1T.incipit
ltx/gr_redirects_goarch/me.m07.d05:meMA.Ode1C1T.melody	@ltx/gr_gr_cog/me.m07.d05:meMA.Ode1C1T.melody
ltx/gr_redirects_goarch/me.m07.d05:meMA.Ode1C1T.mode	@ltx/gr_gr_cog/me.m07.d05:meMA.Ode1C1T.mode
ltx/gr_redirects_goarch/me.m07.d05:meMA.Ode1C1T.ode	@ltx/gr_gr_cog/me.m07.d05:meMA.Ode1C1T.ode
ltx/gr_redirects_goarch/me.m07.d05:meMA.Ode1C1T.text	@ltx/gr_gr_cog/me.m07.d05:meMA.Ode1C1T.text
ltx/gr_redirects_goarch/me.m07.d05:meMA.Ode1C21.greekmelody	@ltx/gr_gr_cog/me.m07.d05:meMA.Ode1C21.greekmelody
ltx/gr_redirects_goarch/me.m07.d05:meMA.Ode1C21.incipit	@ltx/gr_gr_cog/me.m07.d05:meMA.Ode1C21.incipit
ltx/gr_redirects_goarch/me.m07.d05:meMA.Ode1C21.melody	@ltx/gr_gr_cog/me.m07.d05:meMA.Ode1C21.melody
ltx/gr_redirects_goarch/me.m07.d05:meMA.Ode1C21.mode	@ltx/gr_gr_cog/me.m07.d05:meMA.Ode1C21.mode
ltx/gr_redirects_goarch/me.m07.d05:meMA.Ode1C21.ode	@ltx/gr_gr_cog/me.m07.d05:meMA.Ode1C21.ode
ltx/gr_redirects_goarch/me.m07.d05:meMA.Ode1C21.text	@ltx/gr_gr_cog/me.m07.d05:meMA.Ode1C21.text
ltx/gr_redirects_goarch/me.m07.d05:meMA.Ode1C22.incipit	@ltx/gr_gr_cog/me.m07.d05:meMA.Ode1C22.incipit
ltx/gr_redirects_goarch/me.m07.d05:meMA.Ode1C22.melody	@ltx/gr_gr_cog/me.m07.d05:meMA.Ode1C22.melody
ltx/gr_redirects_goarch/me.m07.d05:meMA.Ode1C22.mode	@ltx/gr_gr_cog/me.m07.d05:meMA.Ode1C22.mode
ltx/gr_redirects_goarch/me.m07.d05:meMA.Ode1C22.ode	@ltx/gr_gr_cog/me.m07.d05:meMA.Ode1C22.ode
ltx/gr_redirects_goarch/me.m07.d05:meMA.Ode1C22.text	@ltx/gr_gr_cog/me.m07.d05:meMA.Ode1C22.text
ltx/gr_redirects_goarch/me.m07.d05:meMA.Ode1C23.incipit	@ltx/gr_gr_cog/me.m07.d05:meMA.Ode1C23.incipit
ltx/gr_redirects_goarch/me.m07.d05:meMA.Ode1C23.melody	@ltx/gr_gr_cog/me.m07.d05:meMA.Ode1C23.melody
ltx/gr_redirects_goarch/me.m07.d05:meMA.Ode1C23.mode	@ltx/gr_gr_cog/me.m07.d05:meMA.Ode1C23.mode
ltx/gr_redirects_goarch/me.m07.d05:meMA.Ode1C23.ode	@ltx/gr_gr_cog/me.m07.d05:meMA.Ode1C23.ode
ltx/gr_redirects_goarch/me.m07.d05:meMA.Ode1C23.text	@ltx/gr_gr_cog/me.m07.d05:meMA.Ode1C23.text
ltx/gr_redirects_goarch/me.m07.d05:meMA.Ode1C2T.incipit	@ltx/gr_gr_cog/me.m07.d05:meMA.Ode1C2T.incipit
ltx/gr_redirects_goarch/me.m07.d05:meMA.Ode1C2T.melody	@ltx/gr_gr_cog/me.m07.d05:meMA.Ode1C2T.melody
ltx/gr_redirects_goarch/me.m07.d05:meMA.Ode1C2T.mode	@ltx/gr_gr_cog/me.m07.d05:meMA.Ode1C2T.mode
ltx/gr_redirects_goarch/me.m07.d05:meMA.Ode1C2T.ode	@ltx/gr_gr_cog/me.m07.d05:meMA.Ode1C2T.ode
ltx/gr_redirects_goarch/me.m07.d05:meMA.Ode1C2T.text	@ltx/gr_gr_cog/me.m07.d05:meMA.Ode1C2T.text
ltx/gr_redirects_goarch/me.m07.d05:meMA.Ode3C11.greekmelody	@ltx/gr_gr_cog/me.m07.d05:meMA.Ode3C11.greekmelody
ltx/gr_redirects_goarch/me.m07.d05:meMA.Ode3C11.incipit	@ltx/gr_gr_cog/me.m07.d05:meMA.Ode3C11.incipit
ltx/gr_redirects_goarch/me.m07.d05:meMA.Ode3C11.melody	@ltx/gr_gr_cog/me.m07.d05:meMA.Ode3C11.melody
ltx/gr_redirects_goarch/me.m07.d05:meMA.Ode3C11.mode	@ltx/gr_gr_cog/me.m07.d05:meMA.Ode3C11.mode
ltx/gr_redirects_goarch/me.m07.d05:meMA.Ode3C11.ode	@ltx/gr_gr_cog/me.m07.d05:meMA.Ode3C11.ode
ltx/gr_redirects_goarch/me.m07.d05:meMA.Ode3C11.text	@ltx/gr_gr_cog/me.m07.d05:meMA.Ode3C11.text
ltx/gr_redirects_goarch/me.m07.d05:meMA.Ode3C12.incipit	@ltx/gr_gr_cog/me.m07.d05:meMA.Ode3C12.incipit
ltx/gr_redirects_goarch/me.m07.d05:meMA.Ode3C12.melody	@ltx/gr_gr_cog/me.m07.d05:meMA.Ode3C12.melody
ltx/gr_redirects_goarch/me.m07.d05:meMA.Ode3C12.mode	@ltx/gr_gr_cog/me.m07.d05:meMA.Ode3C12.mode
ltx/gr_redirects_goarch/me.m07.d05:meMA.Ode3C12.ode	@ltx/gr_gr_cog/me.m07.d05:meMA.Ode3C12.ode
ltx/gr_redirects_goarch/me.m07.d05:meMA.Ode3C12.text	@ltx/gr_gr_cog/me.m07.d05:meMA.Ode3C12.text
ltx/gr_redirects_goarch/me.m07.d05:meMA.Ode3C13.incipit	@ltx/gr_gr_cog/me.m07.d05:meMA.Ode3C13.incipit
ltx/gr_redirects_goarch/me.m07.d05:meMA.Ode3C13.melody	@ltx/gr_gr_cog/me.m07.d05:meMA.Ode3C13.melody
ltx/gr_redirects_goarch/me.m07.d05:meMA.Ode3C13.mode	@ltx/gr_gr_cog/me.m07.d05:meMA.Ode3C13.mode
ltx/gr_redirects_goarch/me.m07.d05:meMA.Ode3C13.ode	@ltx/gr_gr_cog/me.m07.d05:meMA.Ode3C13.ode
ltx/gr_redirects_goarch/me.m07.d05:meMA.Ode3C13.text	@ltx/gr_gr_cog/me.m07.d05:meMA.Ode3C13.text
ltx/gr_redirects_goarch/me.m07.d05:meMA.Ode3C1T.incipit	@ltx/gr_gr_cog/me.m07.d05:meMA.Ode3C1T.incipit
ltx/gr_redirects_goarch/me.m07.d05:meMA.Ode3C1T.melody	@ltx/gr_gr_cog/me.m07.d05:meMA.Ode3C1T.melody
ltx/gr_redirects_goarch/me.m07.d05:meMA.Ode3C1T.mode	@ltx/gr_gr_cog/me.m07.d05:meMA.Ode3C1T.mode
ltx/gr_redirects_goarch/me.m07.d05:meMA.Ode3C1T.ode	@ltx/gr_gr_cog/me.m07.d05:meMA.Ode3C1T.ode
ltx/gr_redirects_goarch/me.m07.d05:meMA.Ode3C1T.text	@ltx/gr_gr_cog/me.m07.d05:meMA.Ode3C1T.text
ltx/gr_redirects_goarch/me.m07.d05:meMA.Ode3C21.greekmelody	@ltx/gr_gr_cog/me.m07.d05:meMA.Ode3C21.greekmelody
ltx/gr_redirects_goarch/me.m07.d05:meMA.Ode3C21.incipit	@ltx/gr_gr_cog/me.m07.d05:meMA.Ode3C21.incipit
ltx/gr_redirects_goarch/me.m07.d05:meMA.Ode3C21.melody	@ltx/gr_gr_cog/me.m07.d05:meMA.Ode3C21.melody
ltx/gr_redirects_goarch/me.m07.d05:meMA.Ode3C21.mode	@ltx/gr_gr_cog/me.m07.d05:meMA.Ode3C21.mode
ltx/gr_redirects_goarch/me.m07.d05:meMA.Ode3C21.ode	@ltx/gr_gr_cog/me.m07.d05:meMA.Ode3C21.ode
ltx/gr_redirects_goarch/me.m07.d05:meMA.Ode3C21.text	@ltx/gr_gr_cog/me.m07.d05:meMA.Ode3C21.text
ltx/gr_redirects_goarch/me.m07.d05:meMA.Ode3C22.incipit	@ltx/gr_gr_cog/me.m07.d05:meMA.Ode3C22.incipit
ltx/gr_redirects_goarch/me.m07.d05:meMA.Ode3C22.melody	@ltx/gr_gr_cog/me.m07.d05:meMA.Ode3C22.melody
ltx/gr_redirects_goarch/me.m07.d05:meMA.Ode3C22.mode	@ltx/gr_gr_cog/me.m07.d05:meMA.Ode3C22.mode
ltx/gr_redirects_goarch/me.m07.d05:meMA.Ode3C22.ode	@ltx/gr_gr_cog/me.m07.d05:meMA.Ode3C22.ode
ltx/gr_redirects_goarch/me.m07.d05:meMA.Ode3C22.text	@ltx/gr_gr_cog/me.m07.d05:meMA.Ode3C22.text
ltx/gr_redirects_goarch/me.m07.d05:meMA.Ode3C23.incipit	@ltx/gr_gr_cog/me.m07.d05:meMA.Ode3C23.incipit
ltx/gr_redirects_goarch/me.m07.d05:meMA.Ode3C23.melody	@ltx/gr_gr_cog/me.m07.d05:meMA.Ode3C23.melody
ltx/gr_redirects_goarch/me.m07.d05:meMA.Ode3C23.mode	@ltx/gr_gr_cog/me.m07.d05:meMA.Ode3C23.mode
ltx/gr_redirects_goarch/me.m07.d05:meMA.Ode3C23.ode	@ltx/gr_gr_cog/me.m07.d05:meMA.Ode3C23.ode
ltx/gr_redirects_goarch/me.m07.d05:meMA.Ode3C23.text	@ltx/gr_gr_cog/me.m07.d05:meMA.Ode3C23.text
ltx/gr_redirects_goarch/me.m07.d05:meMA.Ode3C2T.incipit	@ltx/gr_gr_cog/me.m07.d05:meMA.Ode3C2T.incipit
ltx/gr_redirects_goarch/me.m07.d05:meMA.Ode3C2T.melody	@ltx/gr_gr_cog/me.m07.d05:meMA.Ode3C2T.melody
ltx/gr_redirects_goarch/me.m07.d05:meMA.Ode3C2T.mode	@ltx/gr_gr_cog/me.m07.d05:meMA.Ode3C2T.mode
ltx/gr_redirects_goarch/me.m07.d05:meMA.Ode3C2T.ode	@ltx/gr_gr_cog/me.m07.d05:meMA.Ode3C2T.ode
ltx/gr_redirects_goarch/me.m07.d05:meMA.Ode3C2T.text	@ltx/gr_gr_cog/me.m07.d05:meMA.Ode3C2T.text
ltx/gr_redirects_goarch/me.m07.d05:meMA.Ode3Kathisma1.greekmelody	@ltx/gr_gr_cog/me.m07.d05:meMA.Ode3Kathisma1.greekmelody
ltx/gr_redirects_goarch/me.m07.d05:meMA.Ode3Kathisma1.incipit	@ltx/gr_gr_cog/me.m07.d05:meMA.Ode3Kathisma1.incipit
ltx/gr_redirects_goarch/me.m07.d05:meMA.Ode3Kathisma1.melody	@ltx/gr_gr_cog/me.m07.d05:meMA.Ode3Kathisma1.melody
ltx/gr_redirects_goarch/me.m07.d05:meMA.Ode3Kathisma1.mode	@ltx/gr_gr_cog/me.m07.d05:meMA.Ode3Kathisma1.mode
ltx/gr_redirects_goarch/me.m07.d05:meMA.Ode3Kathisma1.text	@ltx/gr_gr_cog/me.m07.d05:meMA.Ode3Kathisma1.text
ltx/gr_redirects_goarch/me.m07.d05:meMA.Ode3KathismaT.incipit	@ltx/gr_gr_cog/me.m07.d05:meMA.Ode3KathismaT.incipit
ltx/gr_redirects_goarch/me.m07.d05:meMA.Ode3KathismaT.melody	@ltx/gr_gr_cog/me.m07.d05:meMA.Ode3KathismaT.melody
ltx/gr_redirects_goarch/me.m07.d05:meMA.Ode3KathismaT.mode	@ltx/gr_gr_cog/me.m07.d05:meMA.Ode3KathismaT.mode
ltx/gr_redirects_goarch/me.m07.d05:meMA.Ode3KathismaT.text	@ltx/gr_gr_cog/me.m07.d05:meMA.Ode3KathismaT.text
ltx/gr_redirects_goarch/me.m07.d05:meMA.Ode4C11.greekmelody	@ltx/gr_gr_cog/me.m07.d05:meMA.Ode4C11.greekmelody
ltx/gr_redirects_goarch/me.m07.d05:meMA.Ode4C11.incipit	@ltx/gr_gr_cog/me.m07.d05:meMA.Ode4C11.incipit
ltx/gr_redirects_goarch/me.m07.d05:meMA.Ode4C11.melody	@ltx/gr_gr_cog/me.m07.d05:meMA.Ode4C11.melody
ltx/gr_redirects_goarch/me.m07.d05:meMA.Ode4C11.mode	@ltx/gr_gr_cog/me.m07.d05:meMA.Ode4C11.mode
ltx/gr_redirects_goarch/me.m07.d05:meMA.Ode4C11.ode	@ltx/gr_gr_cog/me.m07.d05:meMA.Ode4C11.ode
ltx/gr_redirects_goarch/me.m07.d05:meMA.Ode4C11.text	@ltx/gr_gr_cog/me.m07.d05:meMA.Ode4C11.text
ltx/gr_redirects_goarch/me.m07.d05:meMA.Ode4C12.incipit	@ltx/gr_gr_cog/me.m07.d05:meMA.Ode4C12.incipit
ltx/gr_redirects_goarch/me.m07.d05:meMA.Ode4C12.melody	@ltx/gr_gr_cog/me.m07.d05:meMA.Ode4C12.melody
ltx/gr_redirects_goarch/me.m07.d05:meMA.Ode4C12.mode	@ltx/gr_gr_cog/me.m07.d05:meMA.Ode4C12.mode
ltx/gr_redirects_goarch/me.m07.d05:meMA.Ode4C12.ode	@ltx/gr_gr_cog/me.m07.d05:meMA.Ode4C12.ode
ltx/gr_redirects_goarch/me.m07.d05:meMA.Ode4C12.text	@ltx/gr_gr_cog/me.m07.d05:meMA.Ode4C12.text
ltx/gr_redirects_goarch/me.m07.d05:meMA.Ode4C13.incipit	@ltx/gr_gr_cog/me.m07.d05:meMA.Ode4C13.incipit
ltx/gr_redirects_goarch/me.m07.d05:meMA.Ode4C13.melody	@ltx/gr_gr_cog/me.m07.d05:meMA.Ode4C13.melody
ltx/gr_redirects_goarch/me.m07.d05:meMA.Ode4C13.mode	@ltx/gr_gr_cog/me.m07.d05:meMA.Ode4C13.mode
ltx/gr_redirects_goarch/me.m07.d05:meMA.Ode4C13.ode	@ltx/gr_gr_cog/me.m07.d05:meMA.Ode4C13.ode
ltx/gr_redirects_goarch/me.m07.d05:meMA.Ode4C13.text	@ltx/gr_gr_cog/me.m07.d05:meMA.Ode4C13.text
ltx/gr_redirects_goarch/me.m07.d05:meMA.Ode4C1T.incipit	@ltx/gr_gr_cog/me.m07.d05:meMA.Ode4C1T.incipit
ltx/gr_redirects_goarch/me.m07.d05:meMA.Ode4C1T.melody	@ltx/gr_gr_cog/me.m07.d05:meMA.Ode4C1T.melody
ltx/gr_redirects_goarch/me.m07.d05:meMA.Ode4C1T.mode	@ltx/gr_gr_cog/me.m07.d05:meMA.Ode4C1T.mode
ltx/gr_redirects_goarch/me.m07.d05:meMA.Ode4C1T.ode	@ltx/gr_gr_cog/me.m07.d05:meMA.Ode4C1T.ode
ltx/gr_redirects_goarch/me.m07.d05:meMA.Ode4C1T.text	@ltx/gr_gr_cog/me.m07.d05:meMA.Ode4C1T.text
ltx/gr_redirects_goarch/me.m07.d05:meMA.Ode4C21.greekmelody	@ltx/gr_gr_cog/me.m07.d05:meMA.Ode4C21.greekmelody
ltx/gr_redirects_goarch/me.m07.d05:meMA.Ode4C21.incipit	@ltx/gr_gr_cog/me.m07.d05:meMA.Ode4C21.incipit
ltx/gr_redirects_goarch/me.m07.d05:meMA.Ode4C21.melody	@ltx/gr_gr_cog/me.m07.d05:meMA.Ode4C21.melody
ltx/gr_redirects_goarch/me.m07.d05:meMA.Ode4C21.mode	@ltx/gr_gr_cog/me.m07.d05:meMA.Ode4C21.mode
ltx/gr_redirects_goarch/me.m07.d05:meMA.Ode4C21.ode	@ltx/gr_gr_cog/me.m07.d05:meMA.Ode4C21.ode
ltx/gr_redirects_goarch/me.m07.d05:meMA.Ode4C21.text	@ltx/gr_gr_cog/me.m07.d05:meMA.Ode4C21.text
ltx/gr_redirects_goarch/me.m07.d05:meMA.Ode4C22.incipit	@ltx/gr_gr_cog/me.m07.d05:meMA.Ode4C22.incipit
ltx/gr_redirects_goarch/me.m07.d05:meMA.Ode4C22.melody	@ltx/gr_gr_cog/me.m07.d05:meMA.Ode4C22.melody
ltx/gr_redirects_goarch/me.m07.d05:meMA.Ode4C22.mode	@ltx/gr_gr_cog/me.m07.d05:meMA.Ode4C22.mode
ltx/gr_redirects_goarch/me.m07.d05:meMA.Ode4C22.ode	@ltx/gr_gr_cog/me.m07.d05:meMA.Ode4C22.ode
ltx/gr_redirects_goarch/me.m07.d05:meMA.Ode4C22.text	@ltx/gr_gr_cog/me.m07.d05:meMA.Ode4C22.text
ltx/gr_redirects_goarch/me.m07.d05:meMA.Ode4C23.incipit	@ltx/gr_gr_cog/me.m07.d05:meMA.Ode4C23.incipit
ltx/gr_redirects_goarch/me.m07.d05:meMA.Ode4C23.melody	@ltx/gr_gr_cog/me.m07.d05:meMA.Ode4C23.melody
ltx/gr_redirects_goarch/me.m07.d05:meMA.Ode4C23.mode	@ltx/gr_gr_cog/me.m07.d05:meMA.Ode4C23.mode
ltx/gr_redirects_goarch/me.m07.d05:meMA.Ode4C23.ode	@ltx/gr_gr_cog/me.m07.d05:meMA.Ode4C23.ode
ltx/gr_redirects_goarch/me.m07.d05:meMA.Ode4C23.text	@ltx/gr_gr_cog/me.m07.d05:meMA.Ode4C23.text
ltx/gr_redirects_goarch/me.m07.d05:meMA.Ode4C2T.incipit	@ltx/gr_gr_cog/me.m07.d05:meMA.Ode4C2T.incipit
ltx/gr_redirects_goarch/me.m07.d05:meMA.Ode4C2T.melody	@ltx/gr_gr_cog/me.m07.d05:meMA.Ode4C2T.melody
ltx/gr_redirects_goarch/me.m07.d05:meMA.Ode4C2T.mode	@ltx/gr_gr_cog/me.m07.d05:meMA.Ode4C2T.mode
ltx/gr_redirects_goarch/me.m07.d05:meMA.Ode4C2T.ode	@ltx/gr_gr_cog/me.m07.d05:meMA.Ode4C2T.ode
ltx/gr_redirects_goarch/me.m07.d05:meMA.Ode4C2T.text	@ltx/gr_gr_cog/me.m07.d05:meMA.Ode4C2T.text
ltx/gr_redirects_goarch/me.m07.d05:meMA.Ode5C11.greekmelody	@ltx/gr_gr_cog/me.m07.d05:meMA.Ode5C11.greekmelody
ltx/gr_redirects_goarch/me.m07.d05:meMA.Ode5C11.incipit	@ltx/gr_gr_cog/me.m07.d05:meMA.Ode5C11.incipit
ltx/gr_redirects_goarch/me.m07.d05:meMA.Ode5C11.melody	@ltx/gr_gr_cog/me.m07.d05:meMA.Ode5C11.melody
ltx/gr_redirects_goarch/me.m07.d05:meMA.Ode5C11.mode	@ltx/gr_gr_cog/me.m07.d05:meMA.Ode5C11.mode
ltx/gr_redirects_goarch/me.m07.d05:meMA.Ode5C11.ode	@ltx/gr_gr_cog/me.m07.d05:meMA.Ode5C11.ode
ltx/gr_redirects_goarch/me.m07.d05:meMA.Ode5C11.text	@ltx/gr_gr_cog/me.m07.d05:meMA.Ode5C11.text
ltx/gr_redirects_goarch/me.m07.d05:meMA.Ode5C12.incipit	@ltx/gr_gr_cog/me.m07.d05:meMA.Ode5C12.incipit
ltx/gr_redirects_goarch/me.m07.d05:meMA.Ode5C12.melody	@ltx/gr_gr_cog/me.m07.d05:meMA.Ode5C12.melody
ltx/gr_redirects_goarch/me.m07.d05:meMA.Ode5C12.mode	@ltx/gr_gr_cog/me.m07.d05:meMA.Ode5C12.mode
ltx/gr_redirects_goarch/me.m07.d05:meMA.Ode5C12.ode	@ltx/gr_gr_cog/me.m07.d05:meMA.Ode5C12.ode
ltx/gr_redirects_goarch/me.m07.d05:meMA.Ode5C12.text	@ltx/gr_gr_cog/me.m07.d05:meMA.Ode5C12.text
ltx/gr_redirects_goarch/me.m07.d05:meMA.Ode5C13.incipit	@ltx/gr_gr_cog/me.m07.d05:meMA.Ode5C13.incipit
ltx/gr_redirects_goarch/me.m07.d05:meMA.Ode5C13.melody	@ltx/gr_gr_cog/me.m07.d05:meMA.Ode5C13.melody
ltx/gr_redirects_goarch/me.m07.d05:meMA.Ode5C13.mode	@ltx/gr_gr_cog/me.m07.d05:meMA.Ode5C13.mode
ltx/gr_redirects_goarch/me.m07.d05:meMA.Ode5C13.ode	@ltx/gr_gr_cog/me.m07.d05:meMA.Ode5C13.ode
ltx/gr_redirects_goarch/me.m07.d05:meMA.Ode5C13.text	@ltx/gr_gr_cog/me.m07.d05:meMA.Ode5C13.text
ltx/gr_redirects_goarch/me.m07.d05:meMA.Ode5C1T.incipit	@ltx/gr_gr_cog/me.m07.d05:meMA.Ode5C1T.incipit
ltx/gr_redirects_goarch/me.m07.d05:meMA.Ode5C1T.melody	@ltx/gr_gr_cog/me.m07.d05:meMA.Ode5C1T.melody
ltx/gr_redirects_goarch/me.m07.d05:meMA.Ode5C1T.mode	@ltx/gr_gr_cog/me.m07.d05:meMA.Ode5C1T.mode
ltx/gr_redirects_goarch/me.m07.d05:meMA.Ode5C1T.ode	@ltx/gr_gr_cog/me.m07.d05:meMA.Ode5C1T.ode
ltx/gr_redirects_goarch/me.m07.d05:meMA.Ode5C1T.text	@ltx/gr_gr_cog/me.m07.d05:meMA.Ode5C1T.text
ltx/gr_redirects_goarch/me.m07.d05:meMA.Ode5C21.greekmelody	@ltx/gr_gr_cog/me.m07.d05:meMA.Ode5C21.greekmelody
ltx/gr_redirects_goarch/me.m07.d05:meMA.Ode5C21.incipit	@ltx/gr_gr_cog/me.m07.d05:meMA.Ode5C21.incipit
ltx/gr_redirects_goarch/me.m07.d05:meMA.Ode5C21.melody	@ltx/gr_gr_cog/me.m07.d05:meMA.Ode5C21.melody
ltx/gr_redirects_goarch/me.m07.d05:meMA.Ode5C21.mode	@ltx/gr_gr_cog/me.m07.d05:meMA.Ode5C21.mode
ltx/gr_redirects_goarch/me.m07.d05:meMA.Ode5C21.ode	@ltx/gr_gr_cog/me.m07.d05:meMA.Ode5C21.ode
ltx/gr_redirects_goarch/me.m07.d05:meMA.Ode5C21.text	@ltx/gr_gr_cog/me.m07.d05:meMA.Ode5C21.text
ltx/gr_redirects_goarch/me.m07.d05:meMA.Ode5C22.incipit	@ltx/gr_gr_cog/me.m07.d05:meMA.Ode5C22.incipit
ltx/gr_redirects_goarch/me.m07.d05:meMA.Ode5C22.melody	@ltx/gr_gr_cog/me.m07.d05:meMA.Ode5C22.melody
ltx/gr_redirects_goarch/me.m07.d05:meMA.Ode5C22.mode	@ltx/gr_gr_cog/me.m07.d05:meMA.Ode5C22.mode
ltx/gr_redirects_goarch/me.m07.d05:meMA.Ode5C22.ode	@ltx/gr_gr_cog/me.m07.d05:meMA.Ode5C22.ode
ltx/gr_redirects_goarch/me.m07.d05:meMA.Ode5C22.text	@ltx/gr_gr_cog/me.m07.d05:meMA.Ode5C22.text
ltx/gr_redirects_goarch/me.m07.d05:meMA.Ode5C23.incipit	@ltx/gr_gr_cog/me.m07.d05:meMA.Ode5C23.incipit
ltx/gr_redirects_goarch/me.m07.d05:meMA.Ode5C23.melody	@ltx/gr_gr_cog/me.m07.d05:meMA.Ode5C23.melody
ltx/gr_redirects_goarch/me.m07.d05:meMA.Ode5C23.mode	@ltx/gr_gr_cog/me.m07.d05:meMA.Ode5C23.mode
ltx/gr_redirects_goarch/me.m07.d05:meMA.Ode5C23.ode	@ltx/gr_gr_cog/me.m07.d05:meMA.Ode5C23.ode
ltx/gr_redirects_goarch/me.m07.d05:meMA.Ode5C23.text	@ltx/gr_gr_cog/me.m07.d05:meMA.Ode5C23.text
ltx/gr_redirects_goarch/me.m07.d05:meMA.Ode5C2T.incipit	@ltx/gr_gr_cog/me.m07.d05:meMA.Ode5C2T.incipit
ltx/gr_redirects_goarch/me.m07.d05:meMA.Ode5C2T.melody	@ltx/gr_gr_cog/me.m07.d05:meMA.Ode5C2T.melody
ltx/gr_redirects_goarch/me.m07.d05:meMA.Ode5C2T.mode	@ltx/gr_gr_cog/me.m07.d05:meMA.Ode5C2T.mode
ltx/gr_redirects_goarch/me.m07.d05:meMA.Ode5C2T.ode	@ltx/gr_gr_cog/me.m07.d05:meMA.Ode5C2T.ode
ltx/gr_redirects_goarch/me.m07.d05:meMA.Ode5C2T.text	@ltx/gr_gr_cog/me.m07.d05:meMA.Ode5C2T.text
ltx/gr_redirects_goarch/me.m07.d05:meMA.Ode6C11.greekmelody	@ltx/gr_gr_cog/me.m07.d05:meMA.Ode6C11.greekmelody
ltx/gr_redirects_goarch/me.m07.d05:meMA.Ode6C11.incipit	@ltx/gr_gr_cog/me.m07.d05:meMA.Ode6C11.incipit
ltx/gr_redirects_goarch/me.m07.d05:meMA.Ode6C11.melody	@ltx/gr_gr_cog/me.m07.d05:meMA.Ode6C11.melody
ltx/gr_redirects_goarch/me.m07.d05:meMA.Ode6C11.mode	@ltx/gr_gr_cog/me.m07.d05:meMA.Ode6C11.mode
ltx/gr_redirects_goarch/me.m07.d05:meMA.Ode6C11.ode	@ltx/gr_gr_cog/me.m07.d05:meMA.Ode6C11.ode
ltx/gr_redirects_goarch/me.m07.d05:meMA.Ode6C11.text	@ltx/gr_gr_cog/me.m07.d05:meMA.Ode6C11.text
ltx/gr_redirects_goarch/me.m07.d05:meMA.Ode6C12.incipit	@ltx/gr_gr_cog/me.m07.d05:meMA.Ode6C12.incipit
ltx/gr_redirects_goarch/me.m07.d05:meMA.Ode6C12.melody	@ltx/gr_gr_cog/me.m07.d05:meMA.Ode6C12.melody
ltx/gr_redirects_goarch/me.m07.d05:meMA.Ode6C12.mode	@ltx/gr_gr_cog/me.m07.d05:meMA.Ode6C12.mode
ltx/gr_redirects_goarch/me.m07.d05:meMA.Ode6C12.ode	@ltx/gr_gr_cog/me.m07.d05:meMA.Ode6C12.ode
ltx/gr_redirects_goarch/me.m07.d05:meMA.Ode6C12.text	@ltx/gr_gr_cog/me.m07.d05:meMA.Ode6C12.text
ltx/gr_redirects_goarch/me.m07.d05:meMA.Ode6C13.incipit	@ltx/gr_gr_cog/me.m07.d05:meMA.Ode6C13.incipit
ltx/gr_redirects_goarch/me.m07.d05:meMA.Ode6C13.melody	@ltx/gr_gr_cog/me.m07.d05:meMA.Ode6C13.melody
ltx/gr_redirects_goarch/me.m07.d05:meMA.Ode6C13.mode	@ltx/gr_gr_cog/me.m07.d05:meMA.Ode6C13.mode
ltx/gr_redirects_goarch/me.m07.d05:meMA.Ode6C13.ode	@ltx/gr_gr_cog/me.m07.d05:meMA.Ode6C13.ode
ltx/gr_redirects_goarch/me.m07.d05:meMA.Ode6C13.text	@ltx/gr_gr_cog/me.m07.d05:meMA.Ode6C13.text
ltx/gr_redirects_goarch/me.m07.d05:meMA.Ode6C1T.incipit	@ltx/gr_gr_cog/me.m07.d05:meMA.Ode6C1T.incipit
ltx/gr_redirects_goarch/me.m07.d05:meMA.Ode6C1T.melody	@ltx/gr_gr_cog/me.m07.d05:meMA.Ode6C1T.melody
ltx/gr_redirects_goarch/me.m07.d05:meMA.Ode6C1T.mode	@ltx/gr_gr_cog/me.m07.d05:meMA.Ode6C1T.mode
ltx/gr_redirects_goarch/me.m07.d05:meMA.Ode6C1T.ode	@ltx/gr_gr_cog/me.m07.d05:meMA.Ode6C1T.ode
ltx/gr_redirects_goarch/me.m07.d05:meMA.Ode6C1T.text	@ltx/gr_gr_cog/me.m07.d05:meMA.Ode6C1T.text
ltx/gr_redirects_goarch/me.m07.d05:meMA.Ode6C21.greekmelody	@ltx/gr_gr_cog/me.m07.d05:meMA.Ode6C21.greekmelody
ltx/gr_redirects_goarch/me.m07.d05:meMA.Ode6C21.incipit	@ltx/gr_gr_cog/me.m07.d05:meMA.Ode6C21.incipit
ltx/gr_redirects_goarch/me.m07.d05:meMA.Ode6C21.melody	@ltx/gr_gr_cog/me.m07.d05:meMA.Ode6C21.melody
ltx/gr_redirects_goarch/me.m07.d05:meMA.Ode6C21.mode	@ltx/gr_gr_cog/me.m07.d05:meMA.Ode6C21.mode
ltx/gr_redirects_goarch/me.m07.d05:meMA.Ode6C21.ode	@ltx/gr_gr_cog/me.m07.d05:meMA.Ode6C21.ode
ltx/gr_redirects_goarch/me.m07.d05:meMA.Ode6C21.text	@ltx/gr_gr_cog/me.m07.d05:meMA.Ode6C21.text
ltx/gr_redirects_goarch/me.m07.d05:meMA.Ode6C22.incipit	@ltx/gr_gr_cog/me.m07.d05:meMA.Ode6C22.incipit
ltx/gr_redirects_goarch/me.m07.d05:meMA.Ode6C22.melody	@ltx/gr_gr_cog/me.m07.d05:meMA.Ode6C22.melody
ltx/gr_redirects_goarch/me.m07.d05:meMA.Ode6C22.mode	@ltx/gr_gr_cog/me.m07.d05:meMA.Ode6C22.mode
ltx/gr_redirects_goarch/me.m07.d05:meMA.Ode6C22.ode	@ltx/gr_gr_cog/me.m07.d05:meMA.Ode6C22.ode
ltx/gr_redirects_goarch/me.m07.d05:meMA.Ode6C22.text	@ltx/gr_gr_cog/me.m07.d05:meMA.Ode6C22.text
ltx/gr_redirects_goarch/me.m07.d05:meMA.Ode6C23.incipit	@ltx/gr_gr_cog/me.m07.d05:meMA.Ode6C23.incipit
ltx/gr_redirects_goarch/me.m07.d05:meMA.Ode6C23.melody	@ltx/gr_gr_cog/me.m07.d05:meMA.Ode6C23.melody
ltx/gr_redirects_goarch/me.m07.d05:meMA.Ode6C23.mode	@ltx/gr_gr_cog/me.m07.d05:meMA.Ode6C23.mode
ltx/gr_redirects_goarch/me.m07.d05:meMA.Ode6C23.ode	@ltx/gr_gr_cog/me.m07.d05:meMA.Ode6C23.ode
ltx/gr_redirects_goarch/me.m07.d05:meMA.Ode6C23.text	@ltx/gr_gr_cog/me.m07.d05:meMA.Ode6C23.text
ltx/gr_redirects_goarch/me.m07.d05:meMA.Ode6C2T.incipit	@ltx/gr_gr_cog/me.m07.d05:meMA.Ode6C2T.incipit
ltx/gr_redirects_goarch/me.m07.d05:meMA.Ode6C2T.melody	@ltx/gr_gr_cog/me.m07.d05:meMA.Ode6C2T.melody
ltx/gr_redirects_goarch/me.m07.d05:meMA.Ode6C2T.mode	@ltx/gr_gr_cog/me.m07.d05:meMA.Ode6C2T.mode
ltx/gr_redirects_goarch/me.m07.d05:meMA.Ode6C2T.ode	@ltx/gr_gr_cog/me.m07.d05:meMA.Ode6C2T.ode
ltx/gr_redirects_goarch/me.m07.d05:meMA.Ode6C2T.text	@ltx/gr_gr_cog/me.m07.d05:meMA.Ode6C2T.text
ltx/gr_redirects_goarch/me.m07.d05:meMA.Ode7C11.greekmelody	@ltx/gr_gr_cog/me.m07.d05:meMA.Ode7C11.greekmelody
ltx/gr_redirects_goarch/me.m07.d05:meMA.Ode7C11.incipit	@ltx/gr_gr_cog/me.m07.d05:meMA.Ode7C11.incipit
ltx/gr_redirects_goarch/me.m07.d05:meMA.Ode7C11.melody	@ltx/gr_gr_cog/me.m07.d05:meMA.Ode7C11.melody
ltx/gr_redirects_goarch/me.m07.d05:meMA.Ode7C11.mode	@ltx/gr_gr_cog/me.m07.d05:meMA.Ode7C11.mode
ltx/gr_redirects_goarch/me.m07.d05:meMA.Ode7C11.ode	@ltx/gr_gr_cog/me.m07.d05:meMA.Ode7C11.ode
ltx/gr_redirects_goarch/me.m07.d05:meMA.Ode7C11.text	@ltx/gr_gr_cog/me.m07.d05:meMA.Ode7C11.text
ltx/gr_redirects_goarch/me.m07.d05:meMA.Ode7C12.incipit	@ltx/gr_gr_cog/me.m07.d05:meMA.Ode7C12.incipit
ltx/gr_redirects_goarch/me.m07.d05:meMA.Ode7C12.melody	@ltx/gr_gr_cog/me.m07.d05:meMA.Ode7C12.melody
ltx/gr_redirects_goarch/me.m07.d05:meMA.Ode7C12.mode	@ltx/gr_gr_cog/me.m07.d05:meMA.Ode7C12.mode
ltx/gr_redirects_goarch/me.m07.d05:meMA.Ode7C12.ode	@ltx/gr_gr_cog/me.m07.d05:meMA.Ode7C12.ode
ltx/gr_redirects_goarch/me.m07.d05:meMA.Ode7C12.text	@ltx/gr_gr_cog/me.m07.d05:meMA.Ode7C12.text
ltx/gr_redirects_goarch/me.m07.d05:meMA.Ode7C13.incipit	@ltx/gr_gr_cog/me.m07.d05:meMA.Ode7C13.incipit
ltx/gr_redirects_goarch/me.m07.d05:meMA.Ode7C13.melody	@ltx/gr_gr_cog/me.m07.d05:meMA.Ode7C13.melody
ltx/gr_redirects_goarch/me.m07.d05:meMA.Ode7C13.mode	@ltx/gr_gr_cog/me.m07.d05:meMA.Ode7C13.mode
ltx/gr_redirects_goarch/me.m07.d05:meMA.Ode7C13.ode	@ltx/gr_gr_cog/me.m07.d05:meMA.Ode7C13.ode
ltx/gr_redirects_goarch/me.m07.d05:meMA.Ode7C13.text	@ltx/gr_gr_cog/me.m07.d05:meMA.Ode7C13.text
ltx/gr_redirects_goarch/me.m07.d05:meMA.Ode7C1T.incipit	@ltx/gr_gr_cog/me.m07.d05:meMA.Ode7C1T.incipit
ltx/gr_redirects_goarch/me.m07.d05:meMA.Ode7C1T.melody	@ltx/gr_gr_cog/me.m07.d05:meMA.Ode7C1T.melody
ltx/gr_redirects_goarch/me.m07.d05:meMA.Ode7C1T.mode	@ltx/gr_gr_cog/me.m07.d05:meMA.Ode7C1T.mode
ltx/gr_redirects_goarch/me.m07.d05:meMA.Ode7C1T.ode	@ltx/gr_gr_cog/me.m07.d05:meMA.Ode7C1T.ode
ltx/gr_redirects_goarch/me.m07.d05:meMA.Ode7C1T.text	@ltx/gr_gr_cog/me.m07.d05:meMA.Ode7C1T.text
ltx/gr_redirects_goarch/me.m07.d05:meMA.Ode7C21.greekmelody	@ltx/gr_gr_cog/me.m07.d05:meMA.Ode7C21.greekmelody
ltx/gr_redirects_goarch/me.m07.d05:meMA.Ode7C21.incipit	@ltx/gr_gr_cog/me.m07.d05:meMA.Ode7C21.incipit
ltx/gr_redirects_goarch/me.m07.d05:meMA.Ode7C21.melody	@ltx/gr_gr_cog/me.m07.d05:meMA.Ode7C21.melody
ltx/gr_redirects_goarch/me.m07.d05:meMA.Ode7C21.mode	@ltx/gr_gr_cog/me.m07.d05:meMA.Ode7C21.mode
ltx/gr_redirects_goarch/me.m07.d05:meMA.Ode7C21.ode	@ltx/gr_gr_cog/me.m07.d05:meMA.Ode7C21.ode
ltx/gr_redirects_goarch/me.m07.d05:meMA.Ode7C21.text	@ltx/gr_gr_cog/me.m07.d05:meMA.Ode7C21.text
ltx/gr_redirects_goarch/me.m07.d05:meMA.Ode7C22.incipit	@ltx/gr_gr_cog/me.m07.d05:meMA.Ode7C22.incipit
ltx/gr_redirects_goarch/me.m07.d05:meMA.Ode7C22.melody	@ltx/gr_gr_cog/me.m07.d05:meMA.Ode7C22.melody
ltx/gr_redirects_goarch/me.m07.d05:meMA.Ode7C22.mode	@ltx/gr_gr_cog/me.m07.d05:meMA.Ode7C22.mode
ltx/gr_redirects_goarch/me.m07.d05:meMA.Ode7C22.ode	@ltx/gr_gr_cog/me.m07.d05:meMA.Ode7C22.ode
ltx/gr_redirects_goarch/me.m07.d05:meMA.Ode7C22.text	@ltx/gr_gr_cog/me.m07.d05:meMA.Ode7C22.text
ltx/gr_redirects_goarch/me.m07.d05:meMA.Ode7C23.incipit	@ltx/gr_gr_cog/me.m07.d05:meMA.Ode7C23.incipit
ltx/gr_redirects_goarch/me.m07.d05:meMA.Ode7C23.melody	@ltx/gr_gr_cog/me.m07.d05:meMA.Ode7C23.melody
ltx/gr_redirects_goarch/me.m07.d05:meMA.Ode7C23.mode	@ltx/gr_gr_cog/me.m07.d05:meMA.Ode7C23.mode
ltx/gr_redirects_goarch/me.m07.d05:meMA.Ode7C23.ode	@ltx/gr_gr_cog/me.m07.d05:meMA.Ode7C23.ode
ltx/gr_redirects_goarch/me.m07.d05:meMA.Ode7C23.text	@ltx/gr_gr_cog/me.m07.d05:meMA.Ode7C23.text
ltx/gr_redirects_goarch/me.m07.d05:meMA.Ode7C2T.incipit	@ltx/gr_gr_cog/me.m07.d05:meMA.Ode7C2T.incipit
ltx/gr_redirects_goarch/me.m07.d05:meMA.Ode7C2T.melody	@ltx/gr_gr_cog/me.m07.d05:meMA.Ode7C2T.melody
ltx/gr_redirects_goarch/me.m07.d05:meMA.Ode7C2T.mode	@ltx/gr_gr_cog/me.m07.d05:meMA.Ode7C2T.mode
ltx/gr_redirects_goarch/me.m07.d05:meMA.Ode7C2T.ode	@ltx/gr_gr_cog/me.m07.d05:meMA.Ode7C2T.ode
ltx/gr_redirects_goarch/me.m07.d05:meMA.Ode7C2T.text	@ltx/gr_gr_cog/me.m07.d05:meMA.Ode7C2T.text
ltx/gr_redirects_goarch/me.m07.d05:meMA.Ode8C11.greekmelody	@ltx/gr_gr_cog/me.m07.d05:meMA.Ode8C11.greekmelody
ltx/gr_redirects_goarch/me.m07.d05:meMA.Ode8C11.incipit	@ltx/gr_gr_cog/me.m07.d05:meMA.Ode8C11.incipit
ltx/gr_redirects_goarch/me.m07.d05:meMA.Ode8C11.melody	@ltx/gr_gr_cog/me.m07.d05:meMA.Ode8C11.melody
ltx/gr_redirects_goarch/me.m07.d05:meMA.Ode8C11.mode	@ltx/gr_gr_cog/me.m07.d05:meMA.Ode8C11.mode
ltx/gr_redirects_goarch/me.m07.d05:meMA.Ode8C11.ode	@ltx/gr_gr_cog/me.m07.d05:meMA.Ode8C11.ode
ltx/gr_redirects_goarch/me.m07.d05:meMA.Ode8C11.text	@ltx/gr_gr_cog/me.m07.d05:meMA.Ode8C11.text
ltx/gr_redirects_goarch/me.m07.d05:meMA.Ode8C12.incipit	@ltx/gr_gr_cog/me.m07.d05:meMA.Ode8C12.incipit
ltx/gr_redirects_goarch/me.m07.d05:meMA.Ode8C12.melody	@ltx/gr_gr_cog/me.m07.d05:meMA.Ode8C12.melody
ltx/gr_redirects_goarch/me.m07.d05:meMA.Ode8C12.mode	@ltx/gr_gr_cog/me.m07.d05:meMA.Ode8C12.mode
ltx/gr_redirects_goarch/me.m07.d05:meMA.Ode8C12.ode	@ltx/gr_gr_cog/me.m07.d05:meMA.Ode8C12.ode
ltx/gr_redirects_goarch/me.m07.d05:meMA.Ode8C12.text	@ltx/gr_gr_cog/me.m07.d05:meMA.Ode8C12.text
ltx/gr_redirects_goarch/me.m07.d05:meMA.Ode8C13.incipit	@ltx/gr_gr_cog/me.m07.d05:meMA.Ode8C13.incipit
ltx/gr_redirects_goarch/me.m07.d05:meMA.Ode8C13.melody	@ltx/gr_gr_cog/me.m07.d05:meMA.Ode8C13.melody
ltx/gr_redirects_goarch/me.m07.d05:meMA.Ode8C13.mode	@ltx/gr_gr_cog/me.m07.d05:meMA.Ode8C13.mode
ltx/gr_redirects_goarch/me.m07.d05:meMA.Ode8C13.ode	@ltx/gr_gr_cog/me.m07.d05:meMA.Ode8C13.ode
ltx/gr_redirects_goarch/me.m07.d05:meMA.Ode8C13.text	@ltx/gr_gr_cog/me.m07.d05:meMA.Ode8C13.text
ltx/gr_redirects_goarch/me.m07.d05:meMA.Ode8C1T.incipit	@ltx/gr_gr_cog/me.m07.d05:meMA.Ode8C1T.incipit
ltx/gr_redirects_goarch/me.m07.d05:meMA.Ode8C1T.melody	@ltx/gr_gr_cog/me.m07.d05:meMA.Ode8C1T.melody
ltx/gr_redirects_goarch/me.m07.d05:meMA.Ode8C1T.mode	@ltx/gr_gr_cog/me.m07.d05:meMA.Ode8C1T.mode
ltx/gr_redirects_goarch/me.m07.d05:meMA.Ode8C1T.ode	@ltx/gr_gr_cog/me.m07.d05:meMA.Ode8C1T.ode
ltx/gr_redirects_goarch/me.m07.d05:meMA.Ode8C1T.text	@ltx/gr_gr_cog/me.m07.d05:meMA.Ode8C1T.text
ltx/gr_redirects_goarch/me.m07.d05:meMA.Ode8C21.greekmelody	@ltx/gr_gr_cog/me.m07.d05:meMA.Ode8C21.greekmelody
ltx/gr_redirects_goarch/me.m07.d05:meMA.Ode8C21.incipit	@ltx/gr_gr_cog/me.m07.d05:meMA.Ode8C21.incipit
ltx/gr_redirects_goarch/me.m07.d05:meMA.Ode8C21.melody	@ltx/gr_gr_cog/me.m07.d05:meMA.Ode8C21.melody
ltx/gr_redirects_goarch/me.m07.d05:meMA.Ode8C21.mode	@ltx/gr_gr_cog/me.m07.d05:meMA.Ode8C21.mode
ltx/gr_redirects_goarch/me.m07.d05:meMA.Ode8C21.ode	@ltx/gr_gr_cog/me.m07.d05:meMA.Ode8C21.ode
ltx/gr_redirects_goarch/me.m07.d05:meMA.Ode8C21.text	@ltx/gr_gr_cog/me.m07.d05:meMA.Ode8C21.text
ltx/gr_redirects_goarch/me.m07.d05:meMA.Ode8C22.incipit	@ltx/gr_gr_cog/me.m07.d05:meMA.Ode8C22.incipit
ltx/gr_redirects_goarch/me.m07.d05:meMA.Ode8C22.melody	@ltx/gr_gr_cog/me.m07.d05:meMA.Ode8C22.melody
ltx/gr_redirects_goarch/me.m07.d05:meMA.Ode8C22.mode	@ltx/gr_gr_cog/me.m07.d05:meMA.Ode8C22.mode
ltx/gr_redirects_goarch/me.m07.d05:meMA.Ode8C22.ode	@ltx/gr_gr_cog/me.m07.d05:meMA.Ode8C22.ode
ltx/gr_redirects_goarch/me.m07.d05:meMA.Ode8C22.text	@ltx/gr_gr_cog/me.m07.d05:meMA.Ode8C22.text
ltx/gr_redirects_goarch/me.m07.d05:meMA.Ode8C23.incipit	@ltx/gr_gr_cog/me.m07.d05:meMA.Ode8C23.incipit
ltx/gr_redirects_goarch/me.m07.d05:meMA.Ode8C23.melody	@ltx/gr_gr_cog/me.m07.d05:meMA.Ode8C23.melody
ltx/gr_redirects_goarch/me.m07.d05:meMA.Ode8C23.mode	@ltx/gr_gr_cog/me.m07.d05:meMA.Ode8C23.mode
ltx/gr_redirects_goarch/me.m07.d05:meMA.Ode8C23.ode	@ltx/gr_gr_cog/me.m07.d05:meMA.Ode8C23.ode
ltx/gr_redirects_goarch/me.m07.d05:meMA.Ode8C23.text	@ltx/gr_gr_cog/me.m07.d05:meMA.Ode8C23.text
ltx/gr_redirects_goarch/me.m07.d05:meMA.Ode8C2T.incipit	@ltx/gr_gr_cog/me.m07.d05:meMA.Ode8C2T.incipit
ltx/gr_redirects_goarch/me.m07.d05:meMA.Ode8C2T.melody	@ltx/gr_gr_cog/me.m07.d05:meMA.Ode8C2T.melody
ltx/gr_redirects_goarch/me.m07.d05:meMA.Ode8C2T.mode	@ltx/gr_gr_cog/me.m07.d05:meMA.Ode8C2T.mode
ltx/gr_redirects_goarch/me.m07.d05:meMA.Ode8C2T.ode	@ltx/gr_gr_cog/me.m07.d05:meMA.Ode8C2T.ode
ltx/gr_redirects_goarch/me.m07.d05:meMA.Ode8C2T.text	@ltx/gr_gr_cog/me.m07.d05:meMA.Ode8C2T.text
ltx/gr_redirects_goarch/me.m07.d05:meMA.Ode9C11.greekmelody	@ltx/gr_gr_cog/me.m07.d05:meMA.Ode9C11.greekmelody
ltx/gr_redirects_goarch/me.m07.d05:meMA.Ode9C11.incipit	@ltx/gr_gr_cog/me.m07.d05:meMA.Ode9C11.incipit
ltx/gr_redirects_goarch/me.m07.d05:meMA.Ode9C11.melody	@ltx/gr_gr_cog/me.m07.d05:meMA.Ode9C11.melody
ltx/gr_redirects_goarch/me.m07.d05:meMA.Ode9C11.mode	@ltx/gr_gr_cog/me.m07.d05:meMA.Ode9C11.mode
ltx/gr_redirects_goarch/me.m07.d05:meMA.Ode9C11.ode	@ltx/gr_gr_cog/me.m07.d05:meMA.Ode9C11.ode
ltx/gr_redirects_goarch/me.m07.d05:meMA.Ode9C11.text	@ltx/gr_gr_cog/me.m07.d05:meMA.Ode9C11.text
ltx/gr_redirects_goarch/me.m07.d05:meMA.Ode9C12.incipit	@ltx/gr_gr_cog/me.m07.d05:meMA.Ode9C12.incipit
ltx/gr_redirects_goarch/me.m07.d05:meMA.Ode9C12.melody	@ltx/gr_gr_cog/me.m07.d05:meMA.Ode9C12.melody
ltx/gr_redirects_goarch/me.m07.d05:meMA.Ode9C12.mode	@ltx/gr_gr_cog/me.m07.d05:meMA.Ode9C12.mode
ltx/gr_redirects_goarch/me.m07.d05:meMA.Ode9C12.ode	@ltx/gr_gr_cog/me.m07.d05:meMA.Ode9C12.ode
ltx/gr_redirects_goarch/me.m07.d05:meMA.Ode9C12.text	@ltx/gr_gr_cog/me.m07.d05:meMA.Ode9C12.text
ltx/gr_redirects_goarch/me.m07.d05:meMA.Ode9C13.incipit	@ltx/gr_gr_cog/me.m07.d05:meMA.Ode9C13.incipit
ltx/gr_redirects_goarch/me.m07.d05:meMA.Ode9C13.melody	@ltx/gr_gr_cog/me.m07.d05:meMA.Ode9C13.melody
ltx/gr_redirects_goarch/me.m07.d05:meMA.Ode9C13.mode	@ltx/gr_gr_cog/me.m07.d05:meMA.Ode9C13.mode
ltx/gr_redirects_goarch/me.m07.d05:meMA.Ode9C13.ode	@ltx/gr_gr_cog/me.m07.d05:meMA.Ode9C13.ode
ltx/gr_redirects_goarch/me.m07.d05:meMA.Ode9C13.text	@ltx/gr_gr_cog/me.m07.d05:meMA.Ode9C13.text
ltx/gr_redirects_goarch/me.m07.d05:meMA.Ode9C1T.incipit	@ltx/gr_gr_cog/me.m07.d05:meMA.Ode9C1T.incipit
ltx/gr_redirects_goarch/me.m07.d05:meMA.Ode9C1T.melody	@ltx/gr_gr_cog/me.m07.d05:meMA.Ode9C1T.melody
ltx/gr_redirects_goarch/me.m07.d05:meMA.Ode9C1T.mode	@ltx/gr_gr_cog/me.m07.d05:meMA.Ode9C1T.mode
ltx/gr_redirects_goarch/me.m07.d05:meMA.Ode9C1T.ode	@ltx/gr_gr_cog/me.m07.d05:meMA.Ode9C1T.ode
ltx/gr_redirects_goarch/me.m07.d05:meMA.Ode9C1T.text	@ltx/gr_gr_cog/me.m07.d05:meMA.Ode9C1T.text
ltx/gr_redirects_goarch/me.m07.d05:meMA.Ode9C21.greekmelody	@ltx/gr_gr_cog/me.m07.d05:meMA.Ode9C21.greekmelody
ltx/gr_redirects_goarch/me.m07.d05:meMA.Ode9C21.incipit	@ltx/gr_gr_cog/me.m07.d05:meMA.Ode9C21.incipit
ltx/gr_redirects_goarch/me.m07.d05:meMA.Ode9C21.melody	@ltx/gr_gr_cog/me.m07.d05:meMA.Ode9C21.melody
ltx/gr_redirects_goarch/me.m07.d05:meMA.Ode9C21.mode	@ltx/gr_gr_cog/me.m07.d05:meMA.Ode9C21.mode
ltx/gr_redirects_goarch/me.m07.d05:meMA.Ode9C21.ode	@ltx/gr_gr_cog/me.m07.d05:meMA.Ode9C21.ode
ltx/gr_redirects_goarch/me.m07.d05:meMA.Ode9C21.text	@ltx/gr_gr_cog/me.m07.d05:meMA.Ode9C21.text
ltx/gr_redirects_goarch/me.m07.d05:meMA.Ode9C22.incipit	@ltx/gr_gr_cog/me.m07.d05:meMA.Ode9C22.incipit
ltx/gr_redirects_goarch/me.m07.d05:meMA.Ode9C22.melody	@ltx/gr_gr_cog/me.m07.d05:meMA.Ode9C22.melody
ltx/gr_redirects_goarch/me.m07.d05:meMA.Ode9C22.mode	@ltx/gr_gr_cog/me.m07.d05:meMA.Ode9C22.mode
ltx/gr_redirects_goarch/me.m07.d05:meMA.Ode9C22.ode	@ltx/gr_gr_cog/me.m07.d05:meMA.Ode9C22.ode
ltx/gr_redirects_goarch/me.m07.d05:meMA.Ode9C22.text	@ltx/gr_gr_cog/me.m07.d05:meMA.Ode9C22.text
ltx/gr_redirects_goarch/me.m07.d05:meMA.Ode9C2T.incipit	@ltx/gr_gr_cog/me.m07.d05:meMA.Ode9C2T.incipit
ltx/gr_redirects_goarch/me.m07.d05:meMA.Ode9C2T.melody	@ltx/gr_gr_cog/me.m07.d05:meMA.Ode9C2T.melody
ltx/gr_redirects_goarch/me.m07.d05:meMA.Ode9C2T.mode	@ltx/gr_gr_cog/me.m07.d05:meMA.Ode9C2T.mode
ltx/gr_redirects_goarch/me.m07.d05:meMA.Ode9C2T.ode	@ltx/gr_gr_cog/me.m07.d05:meMA.Ode9C2T.ode
ltx/gr_redirects_goarch/me.m07.d05:meMA.Ode9C2T.text	@ltx/gr_gr_cog/me.m07.d05:meMA.Ode9C2T.text
ltx/gr_redirects_goarch/me.m07.d05:meMA.Oikos1.text	@ltx/gr_gr_cog/me.m07.d05:meMA.Oikos1.text
ltx/gr_redirects_goarch/me.m07.d05:meMA.Oikos12.text	@ltx/gr_gr_cog/me.m07.d05:meMA.Oikos12.text
ltx/gr_redirects_goarch/me.m07.d05:meMA.Oikos13.text	@ltx/gr_gr_cog/me.m07.d05:meMA.Oikos13.text
ltx/gr_redirects_goarch/me.m07.d05:meMA.Oikos14.text	@ltx/gr_gr_cog/me.m07.d05:meMA.Oikos14.text
ltx/gr_redirects_goarch/me.m07.d05:meMA.Oikos15.text	@ltx/gr_gr_cog/me.m07.d05:meMA.Oikos15.text
ltx/gr_redirects_goarch/me.m07.d05:meMA.Oikos16.text	@ltx/gr_gr_cog/me.m07.d05:meMA.Oikos16.text
ltx/gr_redirects_goarch/me.m07.d05:meMA.Oikos17.text	@ltx/gr_gr_cog/me.m07.d05:meMA.Oikos17.text
ltx/gr_redirects_goarch/me.m07.d05:meMA.Oikos18.text	@ltx/gr_gr_cog/me.m07.d05:meMA.Oikos18.text
ltx/gr_redirects_goarch/me.m07.d05:meVE.Apolytikion1.greekmelody	@ltx/gr_gr_cog/me.m07.d05:meVE.Apolytikion1.greekmelody
ltx/gr_redirects_goarch/me.m07.d05:meVE.Apolytikion1.incipit	@ltx/gr_gr_cog/me.m07.d05:meVE.Apolytikion1.incipit
ltx/gr_redirects_goarch/me.m07.d05:meVE.Apolytikion1.melody	@ltx/gr_gr_cog/me.m07.d05:meVE.Apolytikion1.melody
ltx/gr_redirects_goarch/me.m07.d05:meVE.Apolytikion1.mode	@ltx/gr_gr_cog/me.m07.d05:meVE.Apolytikion1.mode
ltx/gr_redirects_goarch/me.m07.d05:meVE.Apolytikion1.text	@ltx/gr_gr_cog/me.m07.d05:meVE.Apolytikion1.text
ltx/gr_redirects_goarch/me.m07.d05:meVE.AposGlory.incipit	@ltx/gr_gr_cog/me.m07.d05:meVE.AposGlory.incipit
ltx/gr_redirects_goarch/me.m07.d05:meVE.AposGlory.melody	@ltx/gr_gr_cog/me.m07.d05:meVE.AposGlory.melody
ltx/gr_redirects_goarch/me.m07.d05:meVE.AposGlory.mode	@ltx/gr_gr_cog/me.m07.d05:meVE.AposGlory.mode
ltx/gr_redirects_goarch/me.m07.d05:meVE.AposGlory.text	@ltx/gr_gr_cog/me.m07.d05:meVE.AposGlory.text
ltx/gr_redirects_goarch/me.m07.d05:meVE.AposTheotokion.incipit	@ltx/gr_gr_cog/me.m07.d05:meVE.AposTheotokion.incipit
ltx/gr_redirects_goarch/me.m07.d05:meVE.AposTheotokion.melody	@ltx/gr_gr_cog/me.m07.d05:meVE.AposTheotokion.melody
ltx/gr_redirects_goarch/me.m07.d05:meVE.AposTheotokion.mode	@ltx/gr_gr_cog/me.m07.d05:meVE.AposTheotokion.mode
ltx/gr_redirects_goarch/me.m07.d05:meVE.AposTheotokion.text	@ltx/gr_gr_cog/me.m07.d05:meVE.AposTheotokion.text
ltx/gr_redirects_goarch/me.m07.d05:meVE.Aposticha1.greekmelody	@ltx/gr_gr_cog/me.m07.d05:meVE.Aposticha1.greekmelody
ltx/gr_redirects_goarch/me.m07.d05:meVE.Aposticha1.incipit	@ltx/gr_gr_cog/me.m07.d05:meVE.Aposticha1.incipit
ltx/gr_redirects_goarch/me.m07.d05:meVE.Aposticha1.melody	@ltx/gr_gr_cog/me.m07.d05:meVE.Aposticha1.melody
ltx/gr_redirects_goarch/me.m07.d05:meVE.Aposticha1.mode	@ltx/gr_gr_cog/me.m07.d05:meVE.Aposticha1.mode
ltx/gr_redirects_goarch/me.m07.d05:meVE.Aposticha1.text	@ltx/gr_gr_cog/me.m07.d05:meVE.Aposticha1.text
ltx/gr_redirects_goarch/me.m07.d05:meVE.Aposticha2.incipit	@ltx/gr_gr_cog/me.m07.d05:meVE.Aposticha2.incipit
ltx/gr_redirects_goarch/me.m07.d05:meVE.Aposticha2.melody	@ltx/gr_gr_cog/me.m07.d05:meVE.Aposticha2.melody
ltx/gr_redirects_goarch/me.m07.d05:meVE.Aposticha2.mode	@ltx/gr_gr_cog/me.m07.d05:meVE.Aposticha2.mode
ltx/gr_redirects_goarch/me.m07.d05:meVE.Aposticha2.text	@ltx/gr_gr_cog/me.m07.d05:meVE.Aposticha2.text
ltx/gr_redirects_goarch/me.m07.d05:meVE.Aposticha3.incipit	@ltx/gr_gr_cog/me.m07.d05:meVE.Aposticha3.incipit
ltx/gr_redirects_goarch/me.m07.d05:meVE.Aposticha3.melody	@ltx/gr_gr_cog/me.m07.d05:meVE.Aposticha3.melody
ltx/gr_redirects_goarch/me.m07.d05:meVE.Aposticha3.mode	@ltx/gr_gr_cog/me.m07.d05:meVE.Aposticha3.mode
ltx/gr_redirects_goarch/me.m07.d05:meVE.Aposticha3.text	@ltx/gr_gr_cog/me.m07.d05:meVE.Aposticha3.text
ltx/gr_redirects_goarch/me.m07.d05:meVE.Lity1.incipit	@ltx/gr_gr_cog/me.m07.d05:meVE.Lity1.incipit
ltx/gr_redirects_goarch/me.m07.d05:meVE.Lity1.melody	@ltx/gr_gr_cog/me.m07.d05:meVE.Lity1.melody
ltx/gr_redirects_goarch/me.m07.d05:meVE.Lity1.mode	@ltx/gr_gr_cog/me.m07.d05:meVE.Lity1.mode
ltx/gr_redirects_goarch/me.m07.d05:meVE.Lity1.text	@ltx/gr_gr_cog/me.m07.d05:meVE.Lity1.text
ltx/gr_redirects_goarch/me.m07.d05:meVE.Lity2.incipit	@ltx/gr_gr_cog/me.m07.d05:meVE.Lity2.incipit
ltx/gr_redirects_goarch/me.m07.d05:meVE.Lity2.melody	@ltx/gr_gr_cog/me.m07.d05:meVE.Lity2.melody
ltx/gr_redirects_goarch/me.m07.d05:meVE.Lity2.mode	@ltx/gr_gr_cog/me.m07.d05:meVE.Lity2.mode
ltx/gr_redirects_goarch/me.m07.d05:meVE.Lity2.text	@ltx/gr_gr_cog/me.m07.d05:meVE.Lity2.text
ltx/gr_redirects_goarch/me.m07.d05:meVE.Lity3.incipit	@ltx/gr_gr_cog/me.m07.d05:meVE.Lity3.incipit
ltx/gr_redirects_goarch/me.m07.d05:meVE.Lity3.melody	@ltx/gr_gr_cog/me.m07.d05:meVE.Lity3.melody
ltx/gr_redirects_goarch/me.m07.d05:meVE.Lity3.mode	@ltx/gr_gr_cog/me.m07.d05:meVE.Lity3.mode
ltx/gr_redirects_goarch/me.m07.d05:meVE.Lity3.text	@ltx/gr_gr_cog/me.m07.d05:meVE.Lity3.text
ltx/gr_redirects_goarch/me.m07.d05:meVE.LityBoth.incipit	@ltx/gr_gr_cog/me.m07.d05:meVE.LityBoth.incipit
ltx/gr_redirects_goarch/me.m07.d05:meVE.LityBoth.melody	@ltx/gr_gr_cog/me.m07.d05:meVE.LityBoth.melody
ltx/gr_redirects_goarch/me.m07.d05:meVE.LityBoth.mode	@ltx/gr_gr_cog/me.m07.d05:meVE.LityBoth.mode
ltx/gr_redirects_goarch/me.m07.d05:meVE.LityBoth.text	@ltx/gr_gr_cog/me.m07.d05:meVE.LityBoth.text
ltx/gr_redirects_goarch/me.m07.d05:meVE.LityGlory.incipit	@ltx/gr_gr_cog/me.m07.d05:meVE.LityGlory.incipit
ltx/gr_redirects_goarch/me.m07.d05:meVE.LityGlory.melody	@ltx/gr_gr_cog/me.m07.d05:meVE.LityGlory.melody
ltx/gr_redirects_goarch/me.m07.d05:meVE.LityGlory.mode	@ltx/gr_gr_cog/me.m07.d05:meVE.LityGlory.mode
ltx/gr_redirects_goarch/me.m07.d05:meVE.LityGlory.text	@ltx/gr_gr_cog/me.m07.d05:meVE.LityGlory.text
ltx/gr_redirects_goarch/me.m07.d05:meVE.SticGlory.incipit	@ltx/gr_gr_cog/me.m07.d05:meVE.SticGlory.incipit
ltx/gr_redirects_goarch/me.m07.d05:meVE.SticGlory.melody	@ltx/gr_gr_cog/me.m07.d05:meVE.SticGlory.melody
ltx/gr_redirects_goarch/me.m07.d05:meVE.SticGlory.mode	@ltx/gr_gr_cog/me.m07.d05:meVE.SticGlory.mode
ltx/gr_redirects_goarch/me.m07.d05:meVE.SticGlory.text	@ltx/gr_gr_cog/me.m07.d05:meVE.SticGlory.text
ltx/gr_redirects_goarch/me.m07.d05:meVE.SticTheotokion.incipit	@ltx/gr_gr_cog/me.m07.d05:meVE.SticTheotokion.incipit
ltx/gr_redirects_goarch/me.m07.d05:meVE.SticTheotokion.melody	@ltx/gr_gr_cog/me.m07.d05:meVE.SticTheotokion.melody
ltx/gr_redirects_goarch/me.m07.d05:meVE.SticTheotokion.mode	@ltx/gr_gr_cog/me.m07.d05:meVE.SticTheotokion.mode
ltx/gr_redirects_goarch/me.m07.d05:meVE.SticTheotokion.text	@ltx/gr_gr_cog/me.m07.d05:meVE.SticTheotokion.text
ltx/gr_redirects_goarch/me.m07.d05:meVE.Stichera01.greekmelody	@ltx/gr_gr_cog/me.m07.d05:meVE.Stichera01.greekmelody
ltx/gr_redirects_goarch/me.m07.d05:meVE.Stichera01.incipit	@ltx/gr_gr_cog/me.m07.d05:meVE.Stichera01.incipit
ltx/gr_redirects_goarch/me.m07.d05:meVE.Stichera01.melody	@ltx/gr_gr_cog/me.m07.d05:meVE.Stichera01.melody
ltx/gr_redirects_goarch/me.m07.d05:meVE.Stichera01.mode	@ltx/gr_gr_cog/me.m07.d05:meVE.Stichera01.mode
ltx/gr_redirects_goarch/me.m07.d05:meVE.Stichera01.text	@ltx/gr_gr_cog/me.m07.d05:meVE.Stichera01.text
ltx/gr_redirects_goarch/me.m07.d05:meVE.Stichera02.incipit	@ltx/gr_gr_cog/me.m07.d05:meVE.Stichera02.incipit
ltx/gr_redirects_goarch/me.m07.d05:meVE.Stichera02.melody	@ltx/gr_gr_cog/me.m07.d05:meVE.Stichera02.melody
ltx/gr_redirects_goarch/me.m07.d05:meVE.Stichera02.mode	@ltx/gr_gr_cog/me.m07.d05:meVE.Stichera02.mode
ltx/gr_redirects_goarch/me.m07.d05:meVE.Stichera02.text	@ltx/gr_gr_cog/me.m07.d05:meVE.Stichera02.text
ltx/gr_redirects_goarch/me.m07.d05:meVE.Stichera03.incipit	@ltx/gr_gr_cog/me.m07.d05:meVE.Stichera03.incipit
ltx/gr_redirects_goarch/me.m07.d05:meVE.Stichera03.melody	@ltx/gr_gr_cog/me.m07.d05:meVE.Stichera03.melody
ltx/gr_redirects_goarch/me.m07.d05:meVE.Stichera03.mode	@ltx/gr_gr_cog/me.m07.d05:meVE.Stichera03.mode
ltx/gr_redirects_goarch/me.m07.d05:meVE.Stichera03.text	@ltx/gr_gr_cog/me.m07.d05:meVE.Stichera03.text
ltx/gr_redirects_goarch/me.m07.d05:meVE.Stichera04.greekmelody	@ltx/gr_gr_cog/me.m07.d05:meVE.Stichera04.greekmelody
ltx/gr_redirects_goarch/me.m07.d05:meVE.Stichera04.incipit	@ltx/gr_gr_cog/me.m07.d05:meVE.Stichera04.incipit
ltx/gr_redirects_goarch/me.m07.d05:meVE.Stichera04.melody	@ltx/gr_gr_cog/me.m07.d05:meVE.Stichera04.melody
ltx/gr_redirects_goarch/me.m07.d05:meVE.Stichera04.mode	@ltx/gr_gr_cog/me.m07.d05:meVE.Stichera04.mode
ltx/gr_redirects_goarch/me.m07.d05:meVE.Stichera04.text	@ltx/gr_gr_cog/me.m07.d05:meVE.Stichera04.text
ltx/gr_redirects_goarch/me.m07.d05:meVE.Stichera05.incipit	@ltx/gr_gr_cog/me.m07.d05:meVE.Stichera05.incipit
ltx/gr_redirects_goarch/me.m07.d05:meVE.Stichera05.melody	@ltx/gr_gr_cog/me.m07.d05:meVE.Stichera05.melody
ltx/gr_redirects_goarch/me.m07.d05:meVE.Stichera05.mode	@ltx/gr_gr_cog/me.m07.d05:meVE.Stichera05.mode
ltx/gr_redirects_goarch/me.m07.d05:meVE.Stichera05.text	@ltx/gr_gr_cog/me.m07.d05:meVE.Stichera05.text
ltx/gr_redirects_goarch/me.m07.d05:meVE.Stichera06.incipit	@ltx/gr_gr_cog/me.m07.d05:meVE.Stichera06.incipit
ltx/gr_redirects_goarch/me.m07.d05:meVE.Stichera06.melody	@ltx/gr_gr_cog/me.m07.d05:meVE.Stichera06.melody
ltx/gr_redirects_goarch/me.m07.d05:meVE.Stichera06.mode	@ltx/gr_gr_cog/me.m07.d05:meVE.Stichera06.mode
ltx/gr_redirects_goarch/me.m07.d05:meVE.Stichera06.text	@ltx/gr_gr_cog/me.m07.d05:meVE.Stichera06.text
