ltx/gr_redirects_goarch/he.a.m7:heAU.KatafronisantesPanton.greekname	@ltx/gr_gr_cog/he.a.m7:heAU.KatafronisantesPanton.greekname
ltx/gr_redirects_goarch/he.a.m7:heAU.KatafronisantesPanton.incipit	@ltx/gr_gr_cog/he.a.m7:heAU.KatafronisantesPanton.incipit
ltx/gr_redirects_goarch/he.a.m7:heAU.KatafronisantesPanton.melody	@ltx/gr_gr_cog/he.a.m7:heAU.KatafronisantesPanton.melody
ltx/gr_redirects_goarch/he.a.m7:heAU.KatafronisantesPanton.mode	@ltx/gr_gr_cog/he.a.m7:heAU.KatafronisantesPanton.mode
ltx/gr_redirects_goarch/he.a.m7:heAU.KatafronisantesPanton.name	@ltx/gr_gr_cog/he.a.m7:heAU.KatafronisantesPanton.name
ltx/gr_redirects_goarch/he.a.m7:heAU.KatafronisantesPanton.text	@ltx/gr_gr_cog/he.a.m7:heAU.KatafronisantesPanton.text
ltx/gr_redirects_goarch/he.a.m7:heAU.ODiEmeAnaschomenos.greekname	@ltx/gr_gr_cog/he.a.m7:heAU.ODiEmeAnaschomenos.greekname
ltx/gr_redirects_goarch/he.a.m7:heAU.ODiEmeAnaschomenos.incipit	@ltx/gr_gr_cog/he.a.m7:heAU.ODiEmeAnaschomenos.incipit
ltx/gr_redirects_goarch/he.a.m7:heAU.ODiEmeAnaschomenos.melody	@ltx/gr_gr_cog/he.a.m7:heAU.ODiEmeAnaschomenos.melody
ltx/gr_redirects_goarch/he.a.m7:heAU.ODiEmeAnaschomenos.mode	@ltx/gr_gr_cog/he.a.m7:heAU.ODiEmeAnaschomenos.mode
ltx/gr_redirects_goarch/he.a.m7:heAU.ODiEmeAnaschomenos.name	@ltx/gr_gr_cog/he.a.m7:heAU.ODiEmeAnaschomenos.name
ltx/gr_redirects_goarch/he.a.m7:heAU.ODiEmeAnaschomenos.text	@ltx/gr_gr_cog/he.a.m7:heAU.ODiEmeAnaschomenos.text
ltx/gr_redirects_goarch/he.a.m7:heAU.OsEchousaToSympathes.greekname	@ltx/gr_gr_cog/he.a.m7:heAU.OsEchousaToSympathes.greekname
ltx/gr_redirects_goarch/he.a.m7:heAU.OsEchousaToSympathes.incipit	@ltx/gr_gr_cog/he.a.m7:heAU.OsEchousaToSympathes.incipit
ltx/gr_redirects_goarch/he.a.m7:heAU.OsEchousaToSympathes.melody	@ltx/gr_gr_cog/he.a.m7:heAU.OsEchousaToSympathes.melody
ltx/gr_redirects_goarch/he.a.m7:heAU.OsEchousaToSympathes.mode	@ltx/gr_gr_cog/he.a.m7:heAU.OsEchousaToSympathes.mode
ltx/gr_redirects_goarch/he.a.m7:heAU.OsEchousaToSympathes.name	@ltx/gr_gr_cog/he.a.m7:heAU.OsEchousaToSympathes.name
ltx/gr_redirects_goarch/he.a.m7:heAU.OsEchousaToSympathes.text	@ltx/gr_gr_cog/he.a.m7:heAU.OsEchousaToSympathes.text
ltx/gr_redirects_goarch/he.a.m7:heAU.OukEtiKolyometha.greekname	@ltx/gr_gr_cog/he.a.m7:heAU.OukEtiKolyometha.greekname
ltx/gr_redirects_goarch/he.a.m7:heAU.OukEtiKolyometha.incipit	@ltx/gr_gr_cog/he.a.m7:heAU.OukEtiKolyometha.incipit
ltx/gr_redirects_goarch/he.a.m7:heAU.OukEtiKolyometha.melody	@ltx/gr_gr_cog/he.a.m7:heAU.OukEtiKolyometha.melody
ltx/gr_redirects_goarch/he.a.m7:heAU.OukEtiKolyometha.mode	@ltx/gr_gr_cog/he.a.m7:heAU.OukEtiKolyometha.mode
ltx/gr_redirects_goarch/he.a.m7:heAU.OukEtiKolyometha.name	@ltx/gr_gr_cog/he.a.m7:heAU.OukEtiKolyometha.name
ltx/gr_redirects_goarch/he.a.m7:heAU.OukEtiKolyometha.text	@ltx/gr_gr_cog/he.a.m7:heAU.OukEtiKolyometha.text
ltx/gr_redirects_goarch/he.a.m7:heAU.OuketiFloginiRomfaia.greekname	@ltx/gr_gr_cog/he.a.m7:heAU.OuketiFloginiRomfaia.greekname
ltx/gr_redirects_goarch/he.a.m7:heAU.OuketiFloginiRomfaia.incipit	@ltx/gr_gr_cog/he.a.m7:heAU.OuketiFloginiRomfaia.incipit
ltx/gr_redirects_goarch/he.a.m7:heAU.OuketiFloginiRomfaia.melody	@ltx/gr_gr_cog/he.a.m7:heAU.OuketiFloginiRomfaia.melody
ltx/gr_redirects_goarch/he.a.m7:heAU.OuketiFloginiRomfaia.mode	@ltx/gr_gr_cog/he.a.m7:heAU.OuketiFloginiRomfaia.mode
ltx/gr_redirects_goarch/he.a.m7:heAU.OuketiFloginiRomfaia.name	@ltx/gr_gr_cog/he.a.m7:heAU.OuketiFloginiRomfaia.name
ltx/gr_redirects_goarch/he.a.m7:heAU.OuketiFloginiRomfaia.text	@ltx/gr_gr_cog/he.a.m7:heAU.OuketiFloginiRomfaia.text
ltx/gr_redirects_goarch/he.a.m7:heAU.PyrosFoteinoteron.greekname	@ltx/gr_gr_cog/he.a.m7:heAU.PyrosFoteinoteron.greekname
ltx/gr_redirects_goarch/he.a.m7:heAU.PyrosFoteinoteron.incipit	@ltx/gr_gr_cog/he.a.m7:heAU.PyrosFoteinoteron.incipit
ltx/gr_redirects_goarch/he.a.m7:heAU.PyrosFoteinoteron.melody	@ltx/gr_gr_cog/he.a.m7:heAU.PyrosFoteinoteron.melody
ltx/gr_redirects_goarch/he.a.m7:heAU.PyrosFoteinoteron.mode	@ltx/gr_gr_cog/he.a.m7:heAU.PyrosFoteinoteron.mode
ltx/gr_redirects_goarch/he.a.m7:heAU.PyrosFoteinoteron.name	@ltx/gr_gr_cog/he.a.m7:heAU.PyrosFoteinoteron.name
ltx/gr_redirects_goarch/he.a.m7:heAU.PyrosFoteinoteron.text	@ltx/gr_gr_cog/he.a.m7:heAU.PyrosFoteinoteron.text
ltx/gr_redirects_goarch/he.a.m7:heAU.SimeronGrigoreiOIoudas.greekname	@ltx/gr_gr_cog/he.a.m7:heAU.SimeronGrigoreiOIoudas.greekname
ltx/gr_redirects_goarch/he.a.m7:heAU.SimeronGrigoreiOIoudas.incipit	@ltx/gr_gr_cog/he.a.m7:heAU.SimeronGrigoreiOIoudas.incipit
ltx/gr_redirects_goarch/he.a.m7:heAU.SimeronGrigoreiOIoudas.melody	@ltx/gr_gr_cog/he.a.m7:heAU.SimeronGrigoreiOIoudas.melody
ltx/gr_redirects_goarch/he.a.m7:heAU.SimeronGrigoreiOIoudas.mode	@ltx/gr_gr_cog/he.a.m7:heAU.SimeronGrigoreiOIoudas.mode
ltx/gr_redirects_goarch/he.a.m7:heAU.SimeronGrigoreiOIoudas.name	@ltx/gr_gr_cog/he.a.m7:heAU.SimeronGrigoreiOIoudas.name
ltx/gr_redirects_goarch/he.a.m7:heAU.SimeronGrigoreiOIoudas.text	@ltx/gr_gr_cog/he.a.m7:heAU.SimeronGrigoreiOIoudas.text
ltx/gr_redirects_goarch/he.a.m7:heAU.XylonZois.greekname	@ltx/gr_gr_cog/he.a.m7:heAU.XylonZois.greekname
ltx/gr_redirects_goarch/he.a.m7:heAU.XylonZois.incipit	@ltx/gr_gr_cog/he.a.m7:heAU.XylonZois.incipit
ltx/gr_redirects_goarch/he.a.m7:heAU.XylonZois.melody	@ltx/gr_gr_cog/he.a.m7:heAU.XylonZois.melody
ltx/gr_redirects_goarch/he.a.m7:heAU.XylonZois.mode	@ltx/gr_gr_cog/he.a.m7:heAU.XylonZois.mode
ltx/gr_redirects_goarch/he.a.m7:heAU.XylonZois.name	@ltx/gr_gr_cog/he.a.m7:heAU.XylonZois.name
ltx/gr_redirects_goarch/he.a.m7:heAU.XylonZois.text	@ltx/gr_gr_cog/he.a.m7:heAU.XylonZois.text
ltx/gr_redirects_goarch/he.a.m7:heAU.title	@ltx/gr_gr_cog/he.a.m7:heAU.title
