ltx/gr_redirects_goarch/le.go.lu.d073:leluLI.Gospel.book_abbr	@ltx/gr_gr_cog/le.go.lu.d073:leluLI.Gospel.book_abbr
ltx/gr_redirects_goarch/le.go.lu.d073:leluLI.Gospel.book_string	@ltx/gr_gr_cog/le.go.lu.d073:leluLI.Gospel.book_string
ltx/gr_redirects_goarch/le.go.lu.d073:leluLI.Gospel.chapverse	@ltx/gr_gr_cog/le.go.lu.d073:leluLI.Gospel.chapverse
ltx/gr_redirects_goarch/le.go.lu.d073:leluLI.Gospel.incipit	@ltx/gr_gr_cog/le.go.lu.d073:leluLI.Gospel.incipit
ltx/gr_redirects_goarch/le.go.lu.d073:leluLI.Gospel.text	@ltx/gr_gr_cog/le.go.lu.d073:leluLI.Gospel.text
ltx/gr_redirects_goarch/le.go.lu.d073:leluLI.Gospel.title	@ltx/gr_gr_cog/le.go.lu.d073:leluLI.Gospel.title
ltx/gr_redirects_goarch/le.go.lu.d073:leluLI.Gospel.title_abbr	@ltx/gr_gr_cog/le.go.lu.d073:leluLI.Gospel.title_abbr
ltx/gr_redirects_goarch/le.go.lu.d073:leluLI.Gospel.version	@ltx/gr_gr_cog/le.go.lu.d073:leluLI.Gospel.version
