ltx/gr_redirects_goarch/le.go.me.m01.d10:lemeLI.Gospel.book_abbr	@ltx/gr_gr_cog/le.go.me.m01.d10:lemeLI.Gospel.book_abbr
ltx/gr_redirects_goarch/le.go.me.m01.d10:lemeLI.Gospel.book_string	@ltx/gr_gr_cog/le.go.me.m01.d10:lemeLI.Gospel.book_string
ltx/gr_redirects_goarch/le.go.me.m01.d10:lemeLI.Gospel.chapverse	@ltx/gr_gr_cog/le.go.me.m01.d10:lemeLI.Gospel.chapverse
ltx/gr_redirects_goarch/le.go.me.m01.d10:lemeLI.Gospel.incipit	@ltx/gr_gr_cog/le.go.me.m01.d10:lemeLI.Gospel.incipit
ltx/gr_redirects_goarch/le.go.me.m01.d10:lemeLI.Gospel.text	@ltx/gr_gr_cog/le.go.me.m01.d10:lemeLI.Gospel.text
ltx/gr_redirects_goarch/le.go.me.m01.d10:lemeLI.Gospel.title	@ltx/gr_gr_cog/le.go.me.m01.d10:lemeLI.Gospel.title
ltx/gr_redirects_goarch/le.go.me.m01.d10:lemeLI.Gospel.title_abbr	@ltx/gr_gr_cog/le.go.me.m01.d10:lemeLI.Gospel.title_abbr
ltx/gr_redirects_goarch/le.go.me.m01.d10:lemeLI.Gospel.version	@ltx/gr_gr_cog/le.go.me.m01.d10:lemeLI.Gospel.version
ltx/gr_redirects_goarch/le.go.me.m01.d10:lemeLI.Gospel2.book_abbr	@ltx/gr_gr_cog/le.go.me.m01.d10:lemeLI.Gospel2.book_abbr
ltx/gr_redirects_goarch/le.go.me.m01.d10:lemeLI.Gospel2.book_string	@ltx/gr_gr_cog/le.go.me.m01.d10:lemeLI.Gospel2.book_string
ltx/gr_redirects_goarch/le.go.me.m01.d10:lemeLI.Gospel2.chapverse	@ltx/gr_gr_cog/le.go.me.m01.d10:lemeLI.Gospel2.chapverse
ltx/gr_redirects_goarch/le.go.me.m01.d10:lemeLI.Gospel2.incipit	@ltx/gr_gr_cog/le.go.me.m01.d10:lemeLI.Gospel2.incipit
ltx/gr_redirects_goarch/le.go.me.m01.d10:lemeLI.Gospel2.text	@ltx/gr_gr_cog/le.go.me.m01.d10:lemeLI.Gospel2.text
ltx/gr_redirects_goarch/le.go.me.m01.d10:lemeLI.Gospel2.title	@ltx/gr_gr_cog/le.go.me.m01.d10:lemeLI.Gospel2.title
ltx/gr_redirects_goarch/le.go.me.m01.d10:lemeLI.Gospel2.title_abbr	@ltx/gr_gr_cog/le.go.me.m01.d10:lemeLI.Gospel2.title_abbr
ltx/gr_redirects_goarch/le.go.me.m01.d10:lemeLI.Gospel2.version	@ltx/gr_gr_cog/le.go.me.m01.d10:lemeLI.Gospel2.version
