ltx/gr_redirects_goarch/le.pr.tr.d033:lemcTE.reading1.book_abbr	@ltx/gr_gr_cog/le.pr.tr.d033:lemcTE.reading1.book_abbr
ltx/gr_redirects_goarch/le.pr.tr.d033:lemcTE.reading1.book_string	@ltx/gr_gr_cog/le.pr.tr.d033:lemcTE.reading1.book_string
ltx/gr_redirects_goarch/le.pr.tr.d033:lemcTE.reading1.chapverse	@ltx/gr_gr_cog/le.pr.tr.d033:lemcTE.reading1.chapverse
ltx/gr_redirects_goarch/le.pr.tr.d033:lemcTE.reading1.text	@ltx/gr_gr_cog/le.pr.tr.d033:lemcTE.reading1.text
ltx/gr_redirects_goarch/le.pr.tr.d033:lemcTE.reading1.title	@ltx/gr_gr_cog/le.pr.tr.d033:lemcTE.reading1.title
ltx/gr_redirects_goarch/le.pr.tr.d033:lemcTE.reading1.title_abbr	@ltx/gr_gr_cog/le.pr.tr.d033:lemcTE.reading1.title_abbr
ltx/gr_redirects_goarch/le.pr.tr.d033:lemcTE.reading1.version	@ltx/gr_gr_cog/le.pr.tr.d033:lemcTE.reading1.version
ltx/gr_redirects_goarch/le.pr.tr.d033:lemcVE.reading1.book_abbr	@ltx/gr_gr_cog/le.pr.tr.d033:lemcVE.reading1.book_abbr
ltx/gr_redirects_goarch/le.pr.tr.d033:lemcVE.reading1.book_string	@ltx/gr_gr_cog/le.pr.tr.d033:lemcVE.reading1.book_string
ltx/gr_redirects_goarch/le.pr.tr.d033:lemcVE.reading1.chapverse	@ltx/gr_gr_cog/le.pr.tr.d033:lemcVE.reading1.chapverse
ltx/gr_redirects_goarch/le.pr.tr.d033:lemcVE.reading1.incipit	@ltx/gr_gr_cog/le.pr.tr.d033:lemcVE.reading1.incipit
ltx/gr_redirects_goarch/le.pr.tr.d033:lemcVE.reading1.text	@ltx/gr_gr_cog/le.pr.tr.d033:lemcVE.reading1.text
ltx/gr_redirects_goarch/le.pr.tr.d033:lemcVE.reading1.title	@ltx/gr_gr_cog/le.pr.tr.d033:lemcVE.reading1.title
ltx/gr_redirects_goarch/le.pr.tr.d033:lemcVE.reading1.title_abbr	@ltx/gr_gr_cog/le.pr.tr.d033:lemcVE.reading1.title_abbr
ltx/gr_redirects_goarch/le.pr.tr.d033:lemcVE.reading1.version	@ltx/gr_gr_cog/le.pr.tr.d033:lemcVE.reading1.version
ltx/gr_redirects_goarch/le.pr.tr.d033:lemcVE.reading2.book_abbr	@ltx/gr_gr_cog/le.pr.tr.d033:lemcVE.reading2.book_abbr
ltx/gr_redirects_goarch/le.pr.tr.d033:lemcVE.reading2.book_string	@ltx/gr_gr_cog/le.pr.tr.d033:lemcVE.reading2.book_string
ltx/gr_redirects_goarch/le.pr.tr.d033:lemcVE.reading2.chapverse	@ltx/gr_gr_cog/le.pr.tr.d033:lemcVE.reading2.chapverse
ltx/gr_redirects_goarch/le.pr.tr.d033:lemcVE.reading2.incipit	@ltx/gr_gr_cog/le.pr.tr.d033:lemcVE.reading2.incipit
ltx/gr_redirects_goarch/le.pr.tr.d033:lemcVE.reading2.text	@ltx/gr_gr_cog/le.pr.tr.d033:lemcVE.reading2.text
ltx/gr_redirects_goarch/le.pr.tr.d033:lemcVE.reading2.title	@ltx/gr_gr_cog/le.pr.tr.d033:lemcVE.reading2.title
ltx/gr_redirects_goarch/le.pr.tr.d033:lemcVE.reading2.title_abbr	@ltx/gr_gr_cog/le.pr.tr.d033:lemcVE.reading2.title_abbr
ltx/gr_redirects_goarch/le.pr.tr.d033:lemcVE.reading2.version	@ltx/gr_gr_cog/le.pr.tr.d033:lemcVE.reading2.version
