ltx/gr_redirects_goarch/tr.d060:trCO.header	@ltx/gr_gr_cog/tr.d060:trCO.header
ltx/gr_redirects_goarch/tr.d060:trDA.commemoration.full	@ltx/gr_gr_cog/tr.d060:trDA.commemoration.full
ltx/gr_redirects_goarch/tr.d060:trDA.commemoration.short	@ltx/gr_gr_cog/tr.d060:trDA.commemoration.short
ltx/gr_redirects_goarch/tr.d060:trDA.insert1	@ltx/gr_gr_cog/tr.d060:trDA.insert1
ltx/gr_redirects_goarch/tr.d060:trDA.insert2	@ltx/gr_gr_cog/tr.d060:trDA.insert2
ltx/gr_redirects_goarch/tr.d060:trDA.note	@ltx/gr_gr_cog/tr.d060:trDA.note
ltx/gr_redirects_goarch/tr.d060:trDA.title	@ltx/gr_gr_cog/tr.d060:trDA.title
ltx/gr_redirects_goarch/tr.d060:trHO.commemorations	@ltx/gr_gr_cog/tr.d060:trHO.commemorations
ltx/gr_redirects_goarch/tr.d060:trHO.daytitle	@ltx/gr_gr_cog/tr.d060:trHO.daytitle
ltx/gr_redirects_goarch/tr.d060:trHO.description1	@ltx/gr_gr_cog/tr.d060:trHO.description1
ltx/gr_redirects_goarch/tr.d060:trHO.description2	@ltx/gr_gr_cog/tr.d060:trHO.description2
ltx/gr_redirects_goarch/tr.d060:trHO.note1	@ltx/gr_gr_cog/tr.d060:trHO.note1
ltx/gr_redirects_goarch/tr.d060:trHO.note2	@ltx/gr_gr_cog/tr.d060:trHO.note2
ltx/gr_redirects_goarch/tr.d060:trMA.AposIdiomelon1.incipit	@ltx/gr_gr_cog/tr.d060:trMA.AposIdiomelon1.incipit
ltx/gr_redirects_goarch/tr.d060:trMA.AposIdiomelon1.melody	@ltx/gr_gr_cog/tr.d060:trMA.AposIdiomelon1.melody
ltx/gr_redirects_goarch/tr.d060:trMA.AposIdiomelon1.mode	@ltx/gr_gr_cog/tr.d060:trMA.AposIdiomelon1.mode
ltx/gr_redirects_goarch/tr.d060:trMA.AposIdiomelon1.text	@ltx/gr_gr_cog/tr.d060:trMA.AposIdiomelon1.text
ltx/gr_redirects_goarch/tr.d060:trMA.AposMartyric.incipit	@ltx/gr_gr_cog/tr.d060:trMA.AposMartyric.incipit
ltx/gr_redirects_goarch/tr.d060:trMA.AposMartyric.melody	@ltx/gr_gr_cog/tr.d060:trMA.AposMartyric.melody
ltx/gr_redirects_goarch/tr.d060:trMA.AposMartyric.mode	@ltx/gr_gr_cog/tr.d060:trMA.AposMartyric.mode
ltx/gr_redirects_goarch/tr.d060:trMA.AposMartyric.text	@ltx/gr_gr_cog/tr.d060:trMA.AposMartyric.text
ltx/gr_redirects_goarch/tr.d060:trMA.AposTheotokion.greekmelody	@ltx/gr_gr_cog/tr.d060:trMA.AposTheotokion.greekmelody
ltx/gr_redirects_goarch/tr.d060:trMA.AposTheotokion.incipit	@ltx/gr_gr_cog/tr.d060:trMA.AposTheotokion.incipit
ltx/gr_redirects_goarch/tr.d060:trMA.AposTheotokion.melody	@ltx/gr_gr_cog/tr.d060:trMA.AposTheotokion.melody
ltx/gr_redirects_goarch/tr.d060:trMA.AposTheotokion.mode	@ltx/gr_gr_cog/tr.d060:trMA.AposTheotokion.mode
ltx/gr_redirects_goarch/tr.d060:trMA.AposTheotokion.text	@ltx/gr_gr_cog/tr.d060:trMA.AposTheotokion.text
ltx/gr_redirects_goarch/tr.d060:trMA.C1.poet	@ltx/gr_gr_cog/tr.d060:trMA.C1.poet
ltx/gr_redirects_goarch/tr.d060:trMA.C2.poet	@ltx/gr_gr_cog/tr.d060:trMA.C2.poet
ltx/gr_redirects_goarch/tr.d060:trMA.Kathisma21.incipit	@ltx/gr_gr_cog/tr.d060:trMA.Kathisma21.incipit
ltx/gr_redirects_goarch/tr.d060:trMA.Kathisma21.melody	@ltx/gr_gr_cog/tr.d060:trMA.Kathisma21.melody
ltx/gr_redirects_goarch/tr.d060:trMA.Kathisma21.mode	@ltx/gr_gr_cog/tr.d060:trMA.Kathisma21.mode
ltx/gr_redirects_goarch/tr.d060:trMA.Kathisma21.text	@ltx/gr_gr_cog/tr.d060:trMA.Kathisma21.text
ltx/gr_redirects_goarch/tr.d060:trMA.Kathisma22.incipit	@ltx/gr_gr_cog/tr.d060:trMA.Kathisma22.incipit
ltx/gr_redirects_goarch/tr.d060:trMA.Kathisma22.melody	@ltx/gr_gr_cog/tr.d060:trMA.Kathisma22.melody
ltx/gr_redirects_goarch/tr.d060:trMA.Kathisma22.mode	@ltx/gr_gr_cog/tr.d060:trMA.Kathisma22.mode
ltx/gr_redirects_goarch/tr.d060:trMA.Kathisma22.text	@ltx/gr_gr_cog/tr.d060:trMA.Kathisma22.text
ltx/gr_redirects_goarch/tr.d060:trMA.Kathisma31.greekmelody	@ltx/gr_gr_cog/tr.d060:trMA.Kathisma31.greekmelody
ltx/gr_redirects_goarch/tr.d060:trMA.Kathisma31.incipit	@ltx/gr_gr_cog/tr.d060:trMA.Kathisma31.incipit
ltx/gr_redirects_goarch/tr.d060:trMA.Kathisma31.melody	@ltx/gr_gr_cog/tr.d060:trMA.Kathisma31.melody
ltx/gr_redirects_goarch/tr.d060:trMA.Kathisma31.mode	@ltx/gr_gr_cog/tr.d060:trMA.Kathisma31.mode
ltx/gr_redirects_goarch/tr.d060:trMA.Kathisma31.text	@ltx/gr_gr_cog/tr.d060:trMA.Kathisma31.text
ltx/gr_redirects_goarch/tr.d060:trMA.Kathisma32.greekmelody	@ltx/gr_gr_cog/tr.d060:trMA.Kathisma32.greekmelody
ltx/gr_redirects_goarch/tr.d060:trMA.Kathisma32.incipit	@ltx/gr_gr_cog/tr.d060:trMA.Kathisma32.incipit
ltx/gr_redirects_goarch/tr.d060:trMA.Kathisma32.melody	@ltx/gr_gr_cog/tr.d060:trMA.Kathisma32.melody
ltx/gr_redirects_goarch/tr.d060:trMA.Kathisma32.mode	@ltx/gr_gr_cog/tr.d060:trMA.Kathisma32.mode
ltx/gr_redirects_goarch/tr.d060:trMA.Kathisma32.text	@ltx/gr_gr_cog/tr.d060:trMA.Kathisma32.text
ltx/gr_redirects_goarch/tr.d060:trMA.Ode3C11.greekmelody	@ltx/gr_gr_cog/tr.d060:trMA.Ode3C11.greekmelody
ltx/gr_redirects_goarch/tr.d060:trMA.Ode3C11.incipit	@ltx/gr_gr_cog/tr.d060:trMA.Ode3C11.incipit
ltx/gr_redirects_goarch/tr.d060:trMA.Ode3C11.melody	@ltx/gr_gr_cog/tr.d060:trMA.Ode3C11.melody
ltx/gr_redirects_goarch/tr.d060:trMA.Ode3C11.mode	@ltx/gr_gr_cog/tr.d060:trMA.Ode3C11.mode
ltx/gr_redirects_goarch/tr.d060:trMA.Ode3C11.ode	@ltx/gr_gr_cog/tr.d060:trMA.Ode3C11.ode
ltx/gr_redirects_goarch/tr.d060:trMA.Ode3C11.text	@ltx/gr_gr_cog/tr.d060:trMA.Ode3C11.text
ltx/gr_redirects_goarch/tr.d060:trMA.Ode3C12.incipit	@ltx/gr_gr_cog/tr.d060:trMA.Ode3C12.incipit
ltx/gr_redirects_goarch/tr.d060:trMA.Ode3C12.melody	@ltx/gr_gr_cog/tr.d060:trMA.Ode3C12.melody
ltx/gr_redirects_goarch/tr.d060:trMA.Ode3C12.mode	@ltx/gr_gr_cog/tr.d060:trMA.Ode3C12.mode
ltx/gr_redirects_goarch/tr.d060:trMA.Ode3C12.ode	@ltx/gr_gr_cog/tr.d060:trMA.Ode3C12.ode
ltx/gr_redirects_goarch/tr.d060:trMA.Ode3C12.text	@ltx/gr_gr_cog/tr.d060:trMA.Ode3C12.text
ltx/gr_redirects_goarch/tr.d060:trMA.Ode3C13.incipit	@ltx/gr_gr_cog/tr.d060:trMA.Ode3C13.incipit
ltx/gr_redirects_goarch/tr.d060:trMA.Ode3C13.melody	@ltx/gr_gr_cog/tr.d060:trMA.Ode3C13.melody
ltx/gr_redirects_goarch/tr.d060:trMA.Ode3C13.mode	@ltx/gr_gr_cog/tr.d060:trMA.Ode3C13.mode
ltx/gr_redirects_goarch/tr.d060:trMA.Ode3C13.ode	@ltx/gr_gr_cog/tr.d060:trMA.Ode3C13.ode
ltx/gr_redirects_goarch/tr.d060:trMA.Ode3C13.text	@ltx/gr_gr_cog/tr.d060:trMA.Ode3C13.text
ltx/gr_redirects_goarch/tr.d060:trMA.Ode3C1T.incipit	@ltx/gr_gr_cog/tr.d060:trMA.Ode3C1T.incipit
ltx/gr_redirects_goarch/tr.d060:trMA.Ode3C1T.melody	@ltx/gr_gr_cog/tr.d060:trMA.Ode3C1T.melody
ltx/gr_redirects_goarch/tr.d060:trMA.Ode3C1T.mode	@ltx/gr_gr_cog/tr.d060:trMA.Ode3C1T.mode
ltx/gr_redirects_goarch/tr.d060:trMA.Ode3C1T.ode	@ltx/gr_gr_cog/tr.d060:trMA.Ode3C1T.ode
ltx/gr_redirects_goarch/tr.d060:trMA.Ode3C1T.text	@ltx/gr_gr_cog/tr.d060:trMA.Ode3C1T.text
ltx/gr_redirects_goarch/tr.d060:trMA.Ode3C21.greekmelody	@ltx/gr_gr_cog/tr.d060:trMA.Ode3C21.greekmelody
ltx/gr_redirects_goarch/tr.d060:trMA.Ode3C21.incipit	@ltx/gr_gr_cog/tr.d060:trMA.Ode3C21.incipit
ltx/gr_redirects_goarch/tr.d060:trMA.Ode3C21.melody	@ltx/gr_gr_cog/tr.d060:trMA.Ode3C21.melody
ltx/gr_redirects_goarch/tr.d060:trMA.Ode3C21.mode	@ltx/gr_gr_cog/tr.d060:trMA.Ode3C21.mode
ltx/gr_redirects_goarch/tr.d060:trMA.Ode3C21.ode	@ltx/gr_gr_cog/tr.d060:trMA.Ode3C21.ode
ltx/gr_redirects_goarch/tr.d060:trMA.Ode3C21.text	@ltx/gr_gr_cog/tr.d060:trMA.Ode3C21.text
ltx/gr_redirects_goarch/tr.d060:trMA.Ode3C22.incipit	@ltx/gr_gr_cog/tr.d060:trMA.Ode3C22.incipit
ltx/gr_redirects_goarch/tr.d060:trMA.Ode3C22.melody	@ltx/gr_gr_cog/tr.d060:trMA.Ode3C22.melody
ltx/gr_redirects_goarch/tr.d060:trMA.Ode3C22.mode	@ltx/gr_gr_cog/tr.d060:trMA.Ode3C22.mode
ltx/gr_redirects_goarch/tr.d060:trMA.Ode3C22.ode	@ltx/gr_gr_cog/tr.d060:trMA.Ode3C22.ode
ltx/gr_redirects_goarch/tr.d060:trMA.Ode3C22.text	@ltx/gr_gr_cog/tr.d060:trMA.Ode3C22.text
ltx/gr_redirects_goarch/tr.d060:trMA.Ode3C2A1.incipit	@ltx/gr_gr_cog/tr.d060:trMA.Ode3C2A1.incipit
ltx/gr_redirects_goarch/tr.d060:trMA.Ode3C2A1.melody	@ltx/gr_gr_cog/tr.d060:trMA.Ode3C2A1.melody
ltx/gr_redirects_goarch/tr.d060:trMA.Ode3C2A1.mode	@ltx/gr_gr_cog/tr.d060:trMA.Ode3C2A1.mode
ltx/gr_redirects_goarch/tr.d060:trMA.Ode3C2A1.ode	@ltx/gr_gr_cog/tr.d060:trMA.Ode3C2A1.ode
ltx/gr_redirects_goarch/tr.d060:trMA.Ode3C2A1.text	@ltx/gr_gr_cog/tr.d060:trMA.Ode3C2A1.text
ltx/gr_redirects_goarch/tr.d060:trMA.Ode3C2H.greekmelody	@ltx/gr_gr_cog/tr.d060:trMA.Ode3C2H.greekmelody
ltx/gr_redirects_goarch/tr.d060:trMA.Ode3C2H.incipit	@ltx/gr_gr_cog/tr.d060:trMA.Ode3C2H.incipit
ltx/gr_redirects_goarch/tr.d060:trMA.Ode3C2H.melody	@ltx/gr_gr_cog/tr.d060:trMA.Ode3C2H.melody
ltx/gr_redirects_goarch/tr.d060:trMA.Ode3C2H.mode	@ltx/gr_gr_cog/tr.d060:trMA.Ode3C2H.mode
ltx/gr_redirects_goarch/tr.d060:trMA.Ode3C2H.ode	@ltx/gr_gr_cog/tr.d060:trMA.Ode3C2H.ode
ltx/gr_redirects_goarch/tr.d060:trMA.Ode3C2H.text	@ltx/gr_gr_cog/tr.d060:trMA.Ode3C2H.text
ltx/gr_redirects_goarch/tr.d060:trMA.Ode3C2T.incipit	@ltx/gr_gr_cog/tr.d060:trMA.Ode3C2T.incipit
ltx/gr_redirects_goarch/tr.d060:trMA.Ode3C2T.melody	@ltx/gr_gr_cog/tr.d060:trMA.Ode3C2T.melody
ltx/gr_redirects_goarch/tr.d060:trMA.Ode3C2T.mode	@ltx/gr_gr_cog/tr.d060:trMA.Ode3C2T.mode
ltx/gr_redirects_goarch/tr.d060:trMA.Ode3C2T.ode	@ltx/gr_gr_cog/tr.d060:trMA.Ode3C2T.ode
ltx/gr_redirects_goarch/tr.d060:trMA.Ode3C2T.text	@ltx/gr_gr_cog/tr.d060:trMA.Ode3C2T.text
ltx/gr_redirects_goarch/tr.d060:trMA.Ode3C2Tr.incipit	@ltx/gr_gr_cog/tr.d060:trMA.Ode3C2Tr.incipit
ltx/gr_redirects_goarch/tr.d060:trMA.Ode3C2Tr.melody	@ltx/gr_gr_cog/tr.d060:trMA.Ode3C2Tr.melody
ltx/gr_redirects_goarch/tr.d060:trMA.Ode3C2Tr.mode	@ltx/gr_gr_cog/tr.d060:trMA.Ode3C2Tr.mode
ltx/gr_redirects_goarch/tr.d060:trMA.Ode3C2Tr.ode	@ltx/gr_gr_cog/tr.d060:trMA.Ode3C2Tr.ode
ltx/gr_redirects_goarch/tr.d060:trMA.Ode3C2Tr.text	@ltx/gr_gr_cog/tr.d060:trMA.Ode3C2Tr.text
ltx/gr_redirects_goarch/tr.d060:trMA.Ode8C11.greekmelody	@ltx/gr_gr_cog/tr.d060:trMA.Ode8C11.greekmelody
ltx/gr_redirects_goarch/tr.d060:trMA.Ode8C11.incipit	@ltx/gr_gr_cog/tr.d060:trMA.Ode8C11.incipit
ltx/gr_redirects_goarch/tr.d060:trMA.Ode8C11.melody	@ltx/gr_gr_cog/tr.d060:trMA.Ode8C11.melody
ltx/gr_redirects_goarch/tr.d060:trMA.Ode8C11.mode	@ltx/gr_gr_cog/tr.d060:trMA.Ode8C11.mode
ltx/gr_redirects_goarch/tr.d060:trMA.Ode8C11.ode	@ltx/gr_gr_cog/tr.d060:trMA.Ode8C11.ode
ltx/gr_redirects_goarch/tr.d060:trMA.Ode8C11.text	@ltx/gr_gr_cog/tr.d060:trMA.Ode8C11.text
ltx/gr_redirects_goarch/tr.d060:trMA.Ode8C12.incipit	@ltx/gr_gr_cog/tr.d060:trMA.Ode8C12.incipit
ltx/gr_redirects_goarch/tr.d060:trMA.Ode8C12.melody	@ltx/gr_gr_cog/tr.d060:trMA.Ode8C12.melody
ltx/gr_redirects_goarch/tr.d060:trMA.Ode8C12.mode	@ltx/gr_gr_cog/tr.d060:trMA.Ode8C12.mode
ltx/gr_redirects_goarch/tr.d060:trMA.Ode8C12.ode	@ltx/gr_gr_cog/tr.d060:trMA.Ode8C12.ode
ltx/gr_redirects_goarch/tr.d060:trMA.Ode8C12.text	@ltx/gr_gr_cog/tr.d060:trMA.Ode8C12.text
ltx/gr_redirects_goarch/tr.d060:trMA.Ode8C13.incipit	@ltx/gr_gr_cog/tr.d060:trMA.Ode8C13.incipit
ltx/gr_redirects_goarch/tr.d060:trMA.Ode8C13.melody	@ltx/gr_gr_cog/tr.d060:trMA.Ode8C13.melody
ltx/gr_redirects_goarch/tr.d060:trMA.Ode8C13.mode	@ltx/gr_gr_cog/tr.d060:trMA.Ode8C13.mode
ltx/gr_redirects_goarch/tr.d060:trMA.Ode8C13.ode	@ltx/gr_gr_cog/tr.d060:trMA.Ode8C13.ode
ltx/gr_redirects_goarch/tr.d060:trMA.Ode8C13.text	@ltx/gr_gr_cog/tr.d060:trMA.Ode8C13.text
ltx/gr_redirects_goarch/tr.d060:trMA.Ode8C1T.incipit	@ltx/gr_gr_cog/tr.d060:trMA.Ode8C1T.incipit
ltx/gr_redirects_goarch/tr.d060:trMA.Ode8C1T.melody	@ltx/gr_gr_cog/tr.d060:trMA.Ode8C1T.melody
ltx/gr_redirects_goarch/tr.d060:trMA.Ode8C1T.mode	@ltx/gr_gr_cog/tr.d060:trMA.Ode8C1T.mode
ltx/gr_redirects_goarch/tr.d060:trMA.Ode8C1T.ode	@ltx/gr_gr_cog/tr.d060:trMA.Ode8C1T.ode
ltx/gr_redirects_goarch/tr.d060:trMA.Ode8C1T.text	@ltx/gr_gr_cog/tr.d060:trMA.Ode8C1T.text
ltx/gr_redirects_goarch/tr.d060:trMA.Ode8C21.greekmelody	@ltx/gr_gr_cog/tr.d060:trMA.Ode8C21.greekmelody
ltx/gr_redirects_goarch/tr.d060:trMA.Ode8C21.incipit	@ltx/gr_gr_cog/tr.d060:trMA.Ode8C21.incipit
ltx/gr_redirects_goarch/tr.d060:trMA.Ode8C21.melody	@ltx/gr_gr_cog/tr.d060:trMA.Ode8C21.melody
ltx/gr_redirects_goarch/tr.d060:trMA.Ode8C21.mode	@ltx/gr_gr_cog/tr.d060:trMA.Ode8C21.mode
ltx/gr_redirects_goarch/tr.d060:trMA.Ode8C21.ode	@ltx/gr_gr_cog/tr.d060:trMA.Ode8C21.ode
ltx/gr_redirects_goarch/tr.d060:trMA.Ode8C21.text	@ltx/gr_gr_cog/tr.d060:trMA.Ode8C21.text
ltx/gr_redirects_goarch/tr.d060:trMA.Ode8C22.incipit	@ltx/gr_gr_cog/tr.d060:trMA.Ode8C22.incipit
ltx/gr_redirects_goarch/tr.d060:trMA.Ode8C22.melody	@ltx/gr_gr_cog/tr.d060:trMA.Ode8C22.melody
ltx/gr_redirects_goarch/tr.d060:trMA.Ode8C22.mode	@ltx/gr_gr_cog/tr.d060:trMA.Ode8C22.mode
ltx/gr_redirects_goarch/tr.d060:trMA.Ode8C22.ode	@ltx/gr_gr_cog/tr.d060:trMA.Ode8C22.ode
ltx/gr_redirects_goarch/tr.d060:trMA.Ode8C22.text	@ltx/gr_gr_cog/tr.d060:trMA.Ode8C22.text
ltx/gr_redirects_goarch/tr.d060:trMA.Ode8C2A1.incipit	@ltx/gr_gr_cog/tr.d060:trMA.Ode8C2A1.incipit
ltx/gr_redirects_goarch/tr.d060:trMA.Ode8C2A1.melody	@ltx/gr_gr_cog/tr.d060:trMA.Ode8C2A1.melody
ltx/gr_redirects_goarch/tr.d060:trMA.Ode8C2A1.mode	@ltx/gr_gr_cog/tr.d060:trMA.Ode8C2A1.mode
ltx/gr_redirects_goarch/tr.d060:trMA.Ode8C2A1.ode	@ltx/gr_gr_cog/tr.d060:trMA.Ode8C2A1.ode
ltx/gr_redirects_goarch/tr.d060:trMA.Ode8C2A1.text	@ltx/gr_gr_cog/tr.d060:trMA.Ode8C2A1.text
ltx/gr_redirects_goarch/tr.d060:trMA.Ode8C2H.greekmelody	@ltx/gr_gr_cog/tr.d060:trMA.Ode8C2H.greekmelody
ltx/gr_redirects_goarch/tr.d060:trMA.Ode8C2H.incipit	@ltx/gr_gr_cog/tr.d060:trMA.Ode8C2H.incipit
ltx/gr_redirects_goarch/tr.d060:trMA.Ode8C2H.melody	@ltx/gr_gr_cog/tr.d060:trMA.Ode8C2H.melody
ltx/gr_redirects_goarch/tr.d060:trMA.Ode8C2H.mode	@ltx/gr_gr_cog/tr.d060:trMA.Ode8C2H.mode
ltx/gr_redirects_goarch/tr.d060:trMA.Ode8C2H.ode	@ltx/gr_gr_cog/tr.d060:trMA.Ode8C2H.ode
ltx/gr_redirects_goarch/tr.d060:trMA.Ode8C2H.text	@ltx/gr_gr_cog/tr.d060:trMA.Ode8C2H.text
ltx/gr_redirects_goarch/tr.d060:trMA.Ode8C2T.incipit	@ltx/gr_gr_cog/tr.d060:trMA.Ode8C2T.incipit
ltx/gr_redirects_goarch/tr.d060:trMA.Ode8C2T.melody	@ltx/gr_gr_cog/tr.d060:trMA.Ode8C2T.melody
ltx/gr_redirects_goarch/tr.d060:trMA.Ode8C2T.mode	@ltx/gr_gr_cog/tr.d060:trMA.Ode8C2T.mode
ltx/gr_redirects_goarch/tr.d060:trMA.Ode8C2T.ode	@ltx/gr_gr_cog/tr.d060:trMA.Ode8C2T.ode
ltx/gr_redirects_goarch/tr.d060:trMA.Ode8C2T.text	@ltx/gr_gr_cog/tr.d060:trMA.Ode8C2T.text
ltx/gr_redirects_goarch/tr.d060:trMA.Ode8C2Tr.incipit	@ltx/gr_gr_cog/tr.d060:trMA.Ode8C2Tr.incipit
ltx/gr_redirects_goarch/tr.d060:trMA.Ode8C2Tr.melody	@ltx/gr_gr_cog/tr.d060:trMA.Ode8C2Tr.melody
ltx/gr_redirects_goarch/tr.d060:trMA.Ode8C2Tr.mode	@ltx/gr_gr_cog/tr.d060:trMA.Ode8C2Tr.mode
ltx/gr_redirects_goarch/tr.d060:trMA.Ode8C2Tr.ode	@ltx/gr_gr_cog/tr.d060:trMA.Ode8C2Tr.ode
ltx/gr_redirects_goarch/tr.d060:trMA.Ode8C2Tr.text	@ltx/gr_gr_cog/tr.d060:trMA.Ode8C2Tr.text
ltx/gr_redirects_goarch/tr.d060:trMA.Ode9C11.greekmelody	@ltx/gr_gr_cog/tr.d060:trMA.Ode9C11.greekmelody
ltx/gr_redirects_goarch/tr.d060:trMA.Ode9C11.incipit	@ltx/gr_gr_cog/tr.d060:trMA.Ode9C11.incipit
ltx/gr_redirects_goarch/tr.d060:trMA.Ode9C11.melody	@ltx/gr_gr_cog/tr.d060:trMA.Ode9C11.melody
ltx/gr_redirects_goarch/tr.d060:trMA.Ode9C11.mode	@ltx/gr_gr_cog/tr.d060:trMA.Ode9C11.mode
ltx/gr_redirects_goarch/tr.d060:trMA.Ode9C11.ode	@ltx/gr_gr_cog/tr.d060:trMA.Ode9C11.ode
ltx/gr_redirects_goarch/tr.d060:trMA.Ode9C11.text	@ltx/gr_gr_cog/tr.d060:trMA.Ode9C11.text
ltx/gr_redirects_goarch/tr.d060:trMA.Ode9C12.incipit	@ltx/gr_gr_cog/tr.d060:trMA.Ode9C12.incipit
ltx/gr_redirects_goarch/tr.d060:trMA.Ode9C12.melody	@ltx/gr_gr_cog/tr.d060:trMA.Ode9C12.melody
ltx/gr_redirects_goarch/tr.d060:trMA.Ode9C12.mode	@ltx/gr_gr_cog/tr.d060:trMA.Ode9C12.mode
ltx/gr_redirects_goarch/tr.d060:trMA.Ode9C12.ode	@ltx/gr_gr_cog/tr.d060:trMA.Ode9C12.ode
ltx/gr_redirects_goarch/tr.d060:trMA.Ode9C12.text	@ltx/gr_gr_cog/tr.d060:trMA.Ode9C12.text
ltx/gr_redirects_goarch/tr.d060:trMA.Ode9C13.incipit	@ltx/gr_gr_cog/tr.d060:trMA.Ode9C13.incipit
ltx/gr_redirects_goarch/tr.d060:trMA.Ode9C13.melody	@ltx/gr_gr_cog/tr.d060:trMA.Ode9C13.melody
ltx/gr_redirects_goarch/tr.d060:trMA.Ode9C13.mode	@ltx/gr_gr_cog/tr.d060:trMA.Ode9C13.mode
ltx/gr_redirects_goarch/tr.d060:trMA.Ode9C13.ode	@ltx/gr_gr_cog/tr.d060:trMA.Ode9C13.ode
ltx/gr_redirects_goarch/tr.d060:trMA.Ode9C13.text	@ltx/gr_gr_cog/tr.d060:trMA.Ode9C13.text
ltx/gr_redirects_goarch/tr.d060:trMA.Ode9C1T.incipit	@ltx/gr_gr_cog/tr.d060:trMA.Ode9C1T.incipit
ltx/gr_redirects_goarch/tr.d060:trMA.Ode9C1T.melody	@ltx/gr_gr_cog/tr.d060:trMA.Ode9C1T.melody
ltx/gr_redirects_goarch/tr.d060:trMA.Ode9C1T.mode	@ltx/gr_gr_cog/tr.d060:trMA.Ode9C1T.mode
ltx/gr_redirects_goarch/tr.d060:trMA.Ode9C1T.ode	@ltx/gr_gr_cog/tr.d060:trMA.Ode9C1T.ode
ltx/gr_redirects_goarch/tr.d060:trMA.Ode9C1T.text	@ltx/gr_gr_cog/tr.d060:trMA.Ode9C1T.text
ltx/gr_redirects_goarch/tr.d060:trMA.Ode9C21.greekmelody	@ltx/gr_gr_cog/tr.d060:trMA.Ode9C21.greekmelody
ltx/gr_redirects_goarch/tr.d060:trMA.Ode9C21.incipit	@ltx/gr_gr_cog/tr.d060:trMA.Ode9C21.incipit
ltx/gr_redirects_goarch/tr.d060:trMA.Ode9C21.melody	@ltx/gr_gr_cog/tr.d060:trMA.Ode9C21.melody
ltx/gr_redirects_goarch/tr.d060:trMA.Ode9C21.mode	@ltx/gr_gr_cog/tr.d060:trMA.Ode9C21.mode
ltx/gr_redirects_goarch/tr.d060:trMA.Ode9C21.ode	@ltx/gr_gr_cog/tr.d060:trMA.Ode9C21.ode
ltx/gr_redirects_goarch/tr.d060:trMA.Ode9C21.text	@ltx/gr_gr_cog/tr.d060:trMA.Ode9C21.text
ltx/gr_redirects_goarch/tr.d060:trMA.Ode9C22.incipit	@ltx/gr_gr_cog/tr.d060:trMA.Ode9C22.incipit
ltx/gr_redirects_goarch/tr.d060:trMA.Ode9C22.melody	@ltx/gr_gr_cog/tr.d060:trMA.Ode9C22.melody
ltx/gr_redirects_goarch/tr.d060:trMA.Ode9C22.mode	@ltx/gr_gr_cog/tr.d060:trMA.Ode9C22.mode
ltx/gr_redirects_goarch/tr.d060:trMA.Ode9C22.ode	@ltx/gr_gr_cog/tr.d060:trMA.Ode9C22.ode
ltx/gr_redirects_goarch/tr.d060:trMA.Ode9C22.text	@ltx/gr_gr_cog/tr.d060:trMA.Ode9C22.text
ltx/gr_redirects_goarch/tr.d060:trMA.Ode9C2A1.incipit	@ltx/gr_gr_cog/tr.d060:trMA.Ode9C2A1.incipit
ltx/gr_redirects_goarch/tr.d060:trMA.Ode9C2A1.melody	@ltx/gr_gr_cog/tr.d060:trMA.Ode9C2A1.melody
ltx/gr_redirects_goarch/tr.d060:trMA.Ode9C2A1.mode	@ltx/gr_gr_cog/tr.d060:trMA.Ode9C2A1.mode
ltx/gr_redirects_goarch/tr.d060:trMA.Ode9C2A1.ode	@ltx/gr_gr_cog/tr.d060:trMA.Ode9C2A1.ode
ltx/gr_redirects_goarch/tr.d060:trMA.Ode9C2A1.text	@ltx/gr_gr_cog/tr.d060:trMA.Ode9C2A1.text
ltx/gr_redirects_goarch/tr.d060:trMA.Ode9C2H.greekmelody	@ltx/gr_gr_cog/tr.d060:trMA.Ode9C2H.greekmelody
ltx/gr_redirects_goarch/tr.d060:trMA.Ode9C2H.incipit	@ltx/gr_gr_cog/tr.d060:trMA.Ode9C2H.incipit
ltx/gr_redirects_goarch/tr.d060:trMA.Ode9C2H.melody	@ltx/gr_gr_cog/tr.d060:trMA.Ode9C2H.melody
ltx/gr_redirects_goarch/tr.d060:trMA.Ode9C2H.mode	@ltx/gr_gr_cog/tr.d060:trMA.Ode9C2H.mode
ltx/gr_redirects_goarch/tr.d060:trMA.Ode9C2H.ode	@ltx/gr_gr_cog/tr.d060:trMA.Ode9C2H.ode
ltx/gr_redirects_goarch/tr.d060:trMA.Ode9C2H.text	@ltx/gr_gr_cog/tr.d060:trMA.Ode9C2H.text
ltx/gr_redirects_goarch/tr.d060:trMA.Ode9C2T.incipit	@ltx/gr_gr_cog/tr.d060:trMA.Ode9C2T.incipit
ltx/gr_redirects_goarch/tr.d060:trMA.Ode9C2T.melody	@ltx/gr_gr_cog/tr.d060:trMA.Ode9C2T.melody
ltx/gr_redirects_goarch/tr.d060:trMA.Ode9C2T.mode	@ltx/gr_gr_cog/tr.d060:trMA.Ode9C2T.mode
ltx/gr_redirects_goarch/tr.d060:trMA.Ode9C2T.ode	@ltx/gr_gr_cog/tr.d060:trMA.Ode9C2T.ode
ltx/gr_redirects_goarch/tr.d060:trMA.Ode9C2T.text	@ltx/gr_gr_cog/tr.d060:trMA.Ode9C2T.text
ltx/gr_redirects_goarch/tr.d060:trMA.Ode9C2Tr.incipit	@ltx/gr_gr_cog/tr.d060:trMA.Ode9C2Tr.incipit
ltx/gr_redirects_goarch/tr.d060:trMA.Ode9C2Tr.melody	@ltx/gr_gr_cog/tr.d060:trMA.Ode9C2Tr.melody
ltx/gr_redirects_goarch/tr.d060:trMA.Ode9C2Tr.mode	@ltx/gr_gr_cog/tr.d060:trMA.Ode9C2Tr.mode
ltx/gr_redirects_goarch/tr.d060:trMA.Ode9C2Tr.ode	@ltx/gr_gr_cog/tr.d060:trMA.Ode9C2Tr.ode
ltx/gr_redirects_goarch/tr.d060:trMA.Ode9C2Tr.text	@ltx/gr_gr_cog/tr.d060:trMA.Ode9C2Tr.text
ltx/gr_redirects_goarch/tr.d060:trTE.Troparion.incipit	@ltx/gr_gr_cog/tr.d060:trTE.Troparion.incipit
ltx/gr_redirects_goarch/tr.d060:trTE.Troparion.melody	@ltx/gr_gr_cog/tr.d060:trTE.Troparion.melody
ltx/gr_redirects_goarch/tr.d060:trTE.Troparion.mode	@ltx/gr_gr_cog/tr.d060:trTE.Troparion.mode
ltx/gr_redirects_goarch/tr.d060:trTE.Troparion.text	@ltx/gr_gr_cog/tr.d060:trTE.Troparion.text
ltx/gr_redirects_goarch/tr.d060:trTE.Troparion2.text	@ltx/gr_gr_cog/tr.d060:trTE.Troparion2.text
ltx/gr_redirects_goarch/tr.d060:trVE.AposIdiomelon1.incipit	@ltx/gr_gr_cog/tr.d060:trVE.AposIdiomelon1.incipit
ltx/gr_redirects_goarch/tr.d060:trVE.AposIdiomelon1.melody	@ltx/gr_gr_cog/tr.d060:trVE.AposIdiomelon1.melody
ltx/gr_redirects_goarch/tr.d060:trVE.AposIdiomelon1.mode	@ltx/gr_gr_cog/tr.d060:trVE.AposIdiomelon1.mode
ltx/gr_redirects_goarch/tr.d060:trVE.AposIdiomelon1.text	@ltx/gr_gr_cog/tr.d060:trVE.AposIdiomelon1.text
ltx/gr_redirects_goarch/tr.d060:trVE.AposMartyric.incipit	@ltx/gr_gr_cog/tr.d060:trVE.AposMartyric.incipit
ltx/gr_redirects_goarch/tr.d060:trVE.AposMartyric.melody	@ltx/gr_gr_cog/tr.d060:trVE.AposMartyric.melody
ltx/gr_redirects_goarch/tr.d060:trVE.AposMartyric.mode	@ltx/gr_gr_cog/tr.d060:trVE.AposMartyric.mode
ltx/gr_redirects_goarch/tr.d060:trVE.AposMartyric.text	@ltx/gr_gr_cog/tr.d060:trVE.AposMartyric.text
ltx/gr_redirects_goarch/tr.d060:trVE.AposTheotokion.greekmelody	@ltx/gr_gr_cog/tr.d060:trVE.AposTheotokion.greekmelody
ltx/gr_redirects_goarch/tr.d060:trVE.AposTheotokion.incipit	@ltx/gr_gr_cog/tr.d060:trVE.AposTheotokion.incipit
ltx/gr_redirects_goarch/tr.d060:trVE.AposTheotokion.melody	@ltx/gr_gr_cog/tr.d060:trVE.AposTheotokion.melody
ltx/gr_redirects_goarch/tr.d060:trVE.AposTheotokion.mode	@ltx/gr_gr_cog/tr.d060:trVE.AposTheotokion.mode
ltx/gr_redirects_goarch/tr.d060:trVE.AposTheotokion.text	@ltx/gr_gr_cog/tr.d060:trVE.AposTheotokion.text
ltx/gr_redirects_goarch/tr.d060:trVE.Stichera01.greekmelody	@ltx/gr_gr_cog/tr.d060:trVE.Stichera01.greekmelody
ltx/gr_redirects_goarch/tr.d060:trVE.Stichera01.incipit	@ltx/gr_gr_cog/tr.d060:trVE.Stichera01.incipit
ltx/gr_redirects_goarch/tr.d060:trVE.Stichera01.melody	@ltx/gr_gr_cog/tr.d060:trVE.Stichera01.melody
ltx/gr_redirects_goarch/tr.d060:trVE.Stichera01.mode	@ltx/gr_gr_cog/tr.d060:trVE.Stichera01.mode
ltx/gr_redirects_goarch/tr.d060:trVE.Stichera01.text	@ltx/gr_gr_cog/tr.d060:trVE.Stichera01.text
ltx/gr_redirects_goarch/tr.d060:trVE.Stichera02.greekmelody	@ltx/gr_gr_cog/tr.d060:trVE.Stichera02.greekmelody
ltx/gr_redirects_goarch/tr.d060:trVE.Stichera02.incipit	@ltx/gr_gr_cog/tr.d060:trVE.Stichera02.incipit
ltx/gr_redirects_goarch/tr.d060:trVE.Stichera02.melody	@ltx/gr_gr_cog/tr.d060:trVE.Stichera02.melody
ltx/gr_redirects_goarch/tr.d060:trVE.Stichera02.mode	@ltx/gr_gr_cog/tr.d060:trVE.Stichera02.mode
ltx/gr_redirects_goarch/tr.d060:trVE.Stichera02.text	@ltx/gr_gr_cog/tr.d060:trVE.Stichera02.text
ltx/gr_redirects_goarch/tr.d060:trVE.Stichera03.incipit	@ltx/gr_gr_cog/tr.d060:trVE.Stichera03.incipit
ltx/gr_redirects_goarch/tr.d060:trVE.Stichera03.melody	@ltx/gr_gr_cog/tr.d060:trVE.Stichera03.melody
ltx/gr_redirects_goarch/tr.d060:trVE.Stichera03.mode	@ltx/gr_gr_cog/tr.d060:trVE.Stichera03.mode
ltx/gr_redirects_goarch/tr.d060:trVE.Stichera03.text	@ltx/gr_gr_cog/tr.d060:trVE.Stichera03.text
