ltx/gr_redirects_goarch/sy.m10.d26:cl.syMA.commemoration01.text	@ltx/gr_gr_cog/sy.m10.d26:cl.syMA.commemoration01.text
ltx/gr_redirects_goarch/sy.m10.d26:cl.syMA.commemoration02.text	@ltx/gr_gr_cog/sy.m10.d26:cl.syMA.commemoration02.text
ltx/gr_redirects_goarch/sy.m10.d26:cl.syMA.commemoration03.text	@ltx/gr_gr_cog/sy.m10.d26:cl.syMA.commemoration03.text
ltx/gr_redirects_goarch/sy.m10.d26:cl.syMA.commemoration04.text	@ltx/gr_gr_cog/sy.m10.d26:cl.syMA.commemoration04.text
ltx/gr_redirects_goarch/sy.m10.d26:cl.syMA.commemoration05.text	@ltx/gr_gr_cog/sy.m10.d26:cl.syMA.commemoration05.text
ltx/gr_redirects_goarch/sy.m10.d26:cl.syMA.commemoration06.text	@ltx/gr_gr_cog/sy.m10.d26:cl.syMA.commemoration06.text
ltx/gr_redirects_goarch/sy.m10.d26:syMA.commemoration01.couplet1.title	@ltx/gr_gr_cog/sy.m10.d26:syMA.commemoration01.couplet1.title
ltx/gr_redirects_goarch/sy.m10.d26:syMA.commemoration01.couplet1.verse1	@ltx/gr_gr_cog/sy.m10.d26:syMA.commemoration01.couplet1.verse1
ltx/gr_redirects_goarch/sy.m10.d26:syMA.commemoration01.couplet1.verse2	@ltx/gr_gr_cog/sy.m10.d26:syMA.commemoration01.couplet1.verse2
ltx/gr_redirects_goarch/sy.m10.d26:syMA.commemoration01.narration.p01	@ltx/gr_gr_cog/sy.m10.d26:syMA.commemoration01.narration.p01
ltx/gr_redirects_goarch/sy.m10.d26:syMA.commemoration01.narration.p02	@ltx/gr_gr_cog/sy.m10.d26:syMA.commemoration01.narration.p02
ltx/gr_redirects_goarch/sy.m10.d26:syMA.commemoration01.narration.p03	@ltx/gr_gr_cog/sy.m10.d26:syMA.commemoration01.narration.p03
ltx/gr_redirects_goarch/sy.m10.d26:syMA.commemoration01.narration.p04	@ltx/gr_gr_cog/sy.m10.d26:syMA.commemoration01.narration.p04
ltx/gr_redirects_goarch/sy.m10.d26:syMA.commemoration01.narration.p05	@ltx/gr_gr_cog/sy.m10.d26:syMA.commemoration01.narration.p05
ltx/gr_redirects_goarch/sy.m10.d26:syMA.commemoration01.narration.p06	@ltx/gr_gr_cog/sy.m10.d26:syMA.commemoration01.narration.p06
ltx/gr_redirects_goarch/sy.m10.d26:syMA.commemoration01.narration.p07	@ltx/gr_gr_cog/sy.m10.d26:syMA.commemoration01.narration.p07
ltx/gr_redirects_goarch/sy.m10.d26:syMA.commemoration01.narration.p08	@ltx/gr_gr_cog/sy.m10.d26:syMA.commemoration01.narration.p08
ltx/gr_redirects_goarch/sy.m10.d26:syMA.commemoration01.narration.p09	@ltx/gr_gr_cog/sy.m10.d26:syMA.commemoration01.narration.p09
ltx/gr_redirects_goarch/sy.m10.d26:syMA.commemoration01.narration.p10	@ltx/gr_gr_cog/sy.m10.d26:syMA.commemoration01.narration.p10
ltx/gr_redirects_goarch/sy.m10.d26:syMA.commemoration01.narration.p11	@ltx/gr_gr_cog/sy.m10.d26:syMA.commemoration01.narration.p11
ltx/gr_redirects_goarch/sy.m10.d26:syMA.commemoration01.narration.p12	@ltx/gr_gr_cog/sy.m10.d26:syMA.commemoration01.narration.p12
ltx/gr_redirects_goarch/sy.m10.d26:syMA.commemoration01.narration.p13	@ltx/gr_gr_cog/sy.m10.d26:syMA.commemoration01.narration.p13
ltx/gr_redirects_goarch/sy.m10.d26:syMA.commemoration01.narration.p14	@ltx/gr_gr_cog/sy.m10.d26:syMA.commemoration01.narration.p14
ltx/gr_redirects_goarch/sy.m10.d26:syMA.commemoration01.narration.p15	@ltx/gr_gr_cog/sy.m10.d26:syMA.commemoration01.narration.p15
ltx/gr_redirects_goarch/sy.m10.d26:syMA.commemoration01.narration.p16	@ltx/gr_gr_cog/sy.m10.d26:syMA.commemoration01.narration.p16
ltx/gr_redirects_goarch/sy.m10.d26:syMA.commemoration01.narration.p17	@ltx/gr_gr_cog/sy.m10.d26:syMA.commemoration01.narration.p17
ltx/gr_redirects_goarch/sy.m10.d26:syMA.commemoration01.narration.p18	@ltx/gr_gr_cog/sy.m10.d26:syMA.commemoration01.narration.p18
ltx/gr_redirects_goarch/sy.m10.d26:syMA.commemoration01.single1	@ltx/gr_gr_cog/sy.m10.d26:syMA.commemoration01.single1
ltx/gr_redirects_goarch/sy.m10.d26:syMA.commemoration01.text	@ltx/gr_gr_cog/sy.m10.d26:syMA.commemoration01.text
ltx/gr_redirects_goarch/sy.m10.d26:syMA.commemoration02.couplet1.title	@ltx/gr_gr_cog/sy.m10.d26:syMA.commemoration02.couplet1.title
ltx/gr_redirects_goarch/sy.m10.d26:syMA.commemoration02.couplet1.verse1	@ltx/gr_gr_cog/sy.m10.d26:syMA.commemoration02.couplet1.verse1
ltx/gr_redirects_goarch/sy.m10.d26:syMA.commemoration02.couplet1.verse2	@ltx/gr_gr_cog/sy.m10.d26:syMA.commemoration02.couplet1.verse2
ltx/gr_redirects_goarch/sy.m10.d26:syMA.commemoration02.text	@ltx/gr_gr_cog/sy.m10.d26:syMA.commemoration02.text
ltx/gr_redirects_goarch/sy.m10.d26:syMA.commemoration03.couplet1.title	@ltx/gr_gr_cog/sy.m10.d26:syMA.commemoration03.couplet1.title
ltx/gr_redirects_goarch/sy.m10.d26:syMA.commemoration03.couplet1.verse1	@ltx/gr_gr_cog/sy.m10.d26:syMA.commemoration03.couplet1.verse1
ltx/gr_redirects_goarch/sy.m10.d26:syMA.commemoration03.couplet1.verse2	@ltx/gr_gr_cog/sy.m10.d26:syMA.commemoration03.couplet1.verse2
ltx/gr_redirects_goarch/sy.m10.d26:syMA.commemoration03.text	@ltx/gr_gr_cog/sy.m10.d26:syMA.commemoration03.text
ltx/gr_redirects_goarch/sy.m10.d26:syMA.commemoration04.couplet1.title	@ltx/gr_gr_cog/sy.m10.d26:syMA.commemoration04.couplet1.title
ltx/gr_redirects_goarch/sy.m10.d26:syMA.commemoration04.couplet1.verse1	@ltx/gr_gr_cog/sy.m10.d26:syMA.commemoration04.couplet1.verse1
ltx/gr_redirects_goarch/sy.m10.d26:syMA.commemoration04.couplet1.verse2	@ltx/gr_gr_cog/sy.m10.d26:syMA.commemoration04.couplet1.verse2
ltx/gr_redirects_goarch/sy.m10.d26:syMA.commemoration04.text	@ltx/gr_gr_cog/sy.m10.d26:syMA.commemoration04.text
ltx/gr_redirects_goarch/sy.m10.d26:syMA.commemoration05.couplet1.title	@ltx/gr_gr_cog/sy.m10.d26:syMA.commemoration05.couplet1.title
ltx/gr_redirects_goarch/sy.m10.d26:syMA.commemoration05.couplet1.verse1	@ltx/gr_gr_cog/sy.m10.d26:syMA.commemoration05.couplet1.verse1
ltx/gr_redirects_goarch/sy.m10.d26:syMA.commemoration05.couplet1.verse2	@ltx/gr_gr_cog/sy.m10.d26:syMA.commemoration05.couplet1.verse2
ltx/gr_redirects_goarch/sy.m10.d26:syMA.commemoration05.narration.p01	@ltx/gr_gr_cog/sy.m10.d26:syMA.commemoration05.narration.p01
ltx/gr_redirects_goarch/sy.m10.d26:syMA.commemoration05.text	@ltx/gr_gr_cog/sy.m10.d26:syMA.commemoration05.text
ltx/gr_redirects_goarch/sy.m10.d26:syMA.commemoration06.couplet1.title	@ltx/gr_gr_cog/sy.m10.d26:syMA.commemoration06.couplet1.title
ltx/gr_redirects_goarch/sy.m10.d26:syMA.commemoration06.couplet1.verse1	@ltx/gr_gr_cog/sy.m10.d26:syMA.commemoration06.couplet1.verse1
ltx/gr_redirects_goarch/sy.m10.d26:syMA.commemoration06.couplet1.verse2	@ltx/gr_gr_cog/sy.m10.d26:syMA.commemoration06.couplet1.verse2
ltx/gr_redirects_goarch/sy.m10.d26:syMA.commemoration06.text	@ltx/gr_gr_cog/sy.m10.d26:syMA.commemoration06.text
ltx/gr_redirects_goarch/sy.m10.d26:syMA.lastline	@ltx/gr_gr_cog/sy.m10.d26:syMA.lastline
