ltx/gr_redirects_goarch/me.m09.d16:meDA.commemoration.first	@ltx/gr_gr_cog/me.m09.d16:meDA.commemoration.first
ltx/gr_redirects_goarch/me.m09.d16:meDA.commemoration.first_name	@ltx/gr_gr_cog/me.m09.d16:meDA.commemoration.first_name
ltx/gr_redirects_goarch/me.m09.d16:meDA.commemoration.first_short	@ltx/gr_gr_cog/me.m09.d16:meDA.commemoration.first_short
ltx/gr_redirects_goarch/me.m09.d16:meDA.commemoration.first_title	@ltx/gr_gr_cog/me.m09.d16:meDA.commemoration.first_title
ltx/gr_redirects_goarch/me.m09.d16:meDA.commemoration.full	@ltx/gr_gr_cog/me.m09.d16:meDA.commemoration.full
ltx/gr_redirects_goarch/me.m09.d16:meDA.commemoration.second_name	@ltx/gr_gr_cog/me.m09.d16:meDA.commemoration.second_name
ltx/gr_redirects_goarch/me.m09.d16:meDA.commemoration.second_title	@ltx/gr_gr_cog/me.m09.d16:meDA.commemoration.second_title
ltx/gr_redirects_goarch/me.m09.d16:meDA.date	@ltx/gr_gr_cog/me.m09.d16:meDA.date
ltx/gr_redirects_goarch/me.m09.d16:meDA.fordate	@ltx/gr_gr_cog/me.m09.d16:meDA.fordate
ltx/gr_redirects_goarch/me.m09.d16:meDA.insert1	@ltx/gr_gr_cog/me.m09.d16:meDA.insert1
ltx/gr_redirects_goarch/me.m09.d16:meDA.insert2	@ltx/gr_gr_cog/me.m09.d16:meDA.insert2
ltx/gr_redirects_goarch/me.m09.d16:meDA.note	@ltx/gr_gr_cog/me.m09.d16:meDA.note
ltx/gr_redirects_goarch/me.m09.d16:meDA.pdfcoverdate	@ltx/gr_gr_cog/me.m09.d16:meDA.pdfcoverdate
ltx/gr_redirects_goarch/me.m09.d16:meDA.pdfheaderdate	@ltx/gr_gr_cog/me.m09.d16:meDA.pdfheaderdate
ltx/gr_redirects_goarch/me.m09.d16:meHO.commemorations	@ltx/gr_gr_cog/me.m09.d16:meHO.commemorations
ltx/gr_redirects_goarch/me.m09.d16:meHO.note1	@ltx/gr_gr_cog/me.m09.d16:meHO.note1
ltx/gr_redirects_goarch/me.m09.d16:meHO.note2	@ltx/gr_gr_cog/me.m09.d16:meHO.note2
ltx/gr_redirects_goarch/me.m09.d16:meHO.number	@ltx/gr_gr_cog/me.m09.d16:meHO.number
ltx/gr_redirects_goarch/me.m09.d16:meHO.rank	@ltx/gr_gr_cog/me.m09.d16:meHO.rank
ltx/gr_redirects_goarch/me.m09.d16:meLE.commemoration1	@ltx/gr_gr_cog/me.m09.d16:meLE.commemoration1
ltx/gr_redirects_goarch/me.m09.d16:meLE.commemoration2	@ltx/gr_gr_cog/me.m09.d16:meLE.commemoration2
ltx/gr_redirects_goarch/me.m09.d16:meLI.Kontakion1.greekmelody	@ltx/gr_gr_cog/me.m09.d16:meLI.Kontakion1.greekmelody
ltx/gr_redirects_goarch/me.m09.d16:meLI.Kontakion1.incipit	@ltx/gr_gr_cog/me.m09.d16:meLI.Kontakion1.incipit
ltx/gr_redirects_goarch/me.m09.d16:meLI.Kontakion1.melody	@ltx/gr_gr_cog/me.m09.d16:meLI.Kontakion1.melody
ltx/gr_redirects_goarch/me.m09.d16:meLI.Kontakion1.mode	@ltx/gr_gr_cog/me.m09.d16:meLI.Kontakion1.mode
ltx/gr_redirects_goarch/me.m09.d16:meLI.Kontakion1.text	@ltx/gr_gr_cog/me.m09.d16:meLI.Kontakion1.text
ltx/gr_redirects_goarch/me.m09.d16:meLI.MM.CommunionHymn.text	@ltx/gr_gr_cog/me.m09.d16:meLI.MM.CommunionHymn.text
ltx/gr_redirects_goarch/me.m09.d16:meLI.Megalynarion.text	@ltx/gr_gr_cog/me.m09.d16:meLI.Megalynarion.text
ltx/gr_redirects_goarch/me.m09.d16:meMA.AposBoth.incipit	@ltx/gr_gr_cog/me.m09.d16:meMA.AposBoth.incipit
ltx/gr_redirects_goarch/me.m09.d16:meMA.AposBoth.melody	@ltx/gr_gr_cog/me.m09.d16:meMA.AposBoth.melody
ltx/gr_redirects_goarch/me.m09.d16:meMA.AposBoth.mode	@ltx/gr_gr_cog/me.m09.d16:meMA.AposBoth.mode
ltx/gr_redirects_goarch/me.m09.d16:meMA.AposBoth.poet	@ltx/gr_gr_cog/me.m09.d16:meMA.AposBoth.poet
ltx/gr_redirects_goarch/me.m09.d16:meMA.AposBoth.text	@ltx/gr_gr_cog/me.m09.d16:meMA.AposBoth.text
ltx/gr_redirects_goarch/me.m09.d16:meMA.AposGlory.incipit	@ltx/gr_gr_cog/me.m09.d16:meMA.AposGlory.incipit
ltx/gr_redirects_goarch/me.m09.d16:meMA.AposGlory.melody	@ltx/gr_gr_cog/me.m09.d16:meMA.AposGlory.melody
ltx/gr_redirects_goarch/me.m09.d16:meMA.AposGlory.mode	@ltx/gr_gr_cog/me.m09.d16:meMA.AposGlory.mode
ltx/gr_redirects_goarch/me.m09.d16:meMA.AposGlory.poet	@ltx/gr_gr_cog/me.m09.d16:meMA.AposGlory.poet
ltx/gr_redirects_goarch/me.m09.d16:meMA.AposGlory.text	@ltx/gr_gr_cog/me.m09.d16:meMA.AposGlory.text
ltx/gr_redirects_goarch/me.m09.d16:meMA.Aposticha1.greekmelody	@ltx/gr_gr_cog/me.m09.d16:meMA.Aposticha1.greekmelody
ltx/gr_redirects_goarch/me.m09.d16:meMA.Aposticha1.incipit	@ltx/gr_gr_cog/me.m09.d16:meMA.Aposticha1.incipit
ltx/gr_redirects_goarch/me.m09.d16:meMA.Aposticha1.melody	@ltx/gr_gr_cog/me.m09.d16:meMA.Aposticha1.melody
ltx/gr_redirects_goarch/me.m09.d16:meMA.Aposticha1.mode	@ltx/gr_gr_cog/me.m09.d16:meMA.Aposticha1.mode
ltx/gr_redirects_goarch/me.m09.d16:meMA.Aposticha1.text	@ltx/gr_gr_cog/me.m09.d16:meMA.Aposticha1.text
ltx/gr_redirects_goarch/me.m09.d16:meMA.Aposticha2.incipit	@ltx/gr_gr_cog/me.m09.d16:meMA.Aposticha2.incipit
ltx/gr_redirects_goarch/me.m09.d16:meMA.Aposticha2.melody	@ltx/gr_gr_cog/me.m09.d16:meMA.Aposticha2.melody
ltx/gr_redirects_goarch/me.m09.d16:meMA.Aposticha2.mode	@ltx/gr_gr_cog/me.m09.d16:meMA.Aposticha2.mode
ltx/gr_redirects_goarch/me.m09.d16:meMA.Aposticha2.text	@ltx/gr_gr_cog/me.m09.d16:meMA.Aposticha2.text
ltx/gr_redirects_goarch/me.m09.d16:meMA.Aposticha3.incipit	@ltx/gr_gr_cog/me.m09.d16:meMA.Aposticha3.incipit
ltx/gr_redirects_goarch/me.m09.d16:meMA.Aposticha3.melody	@ltx/gr_gr_cog/me.m09.d16:meMA.Aposticha3.melody
ltx/gr_redirects_goarch/me.m09.d16:meMA.Aposticha3.mode	@ltx/gr_gr_cog/me.m09.d16:meMA.Aposticha3.mode
ltx/gr_redirects_goarch/me.m09.d16:meMA.Aposticha3.text	@ltx/gr_gr_cog/me.m09.d16:meMA.Aposticha3.text
ltx/gr_redirects_goarch/me.m09.d16:meMA.C1.acrostic.notice1	@ltx/gr_gr_cog/me.m09.d16:meMA.C1.acrostic.notice1
ltx/gr_redirects_goarch/me.m09.d16:meMA.C1.acrostic.notice2	@ltx/gr_gr_cog/me.m09.d16:meMA.C1.acrostic.notice2
ltx/gr_redirects_goarch/me.m09.d16:meMA.C1.acrostic.text	@ltx/gr_gr_cog/me.m09.d16:meMA.C1.acrostic.text
ltx/gr_redirects_goarch/me.m09.d16:meMA.C1.acrostic.title	@ltx/gr_gr_cog/me.m09.d16:meMA.C1.acrostic.title
ltx/gr_redirects_goarch/me.m09.d16:meMA.C1.poet	@ltx/gr_gr_cog/me.m09.d16:meMA.C1.poet
ltx/gr_redirects_goarch/me.m09.d16:meMA.C1.title	@ltx/gr_gr_cog/me.m09.d16:meMA.C1.title
ltx/gr_redirects_goarch/me.m09.d16:meMA.C1.verse	@ltx/gr_gr_cog/me.m09.d16:meMA.C1.verse
ltx/gr_redirects_goarch/me.m09.d16:meMA.Exaposteilarion1.greekmelody	@ltx/gr_gr_cog/me.m09.d16:meMA.Exaposteilarion1.greekmelody
ltx/gr_redirects_goarch/me.m09.d16:meMA.Exaposteilarion1.incipit	@ltx/gr_gr_cog/me.m09.d16:meMA.Exaposteilarion1.incipit
ltx/gr_redirects_goarch/me.m09.d16:meMA.Exaposteilarion1.melody	@ltx/gr_gr_cog/me.m09.d16:meMA.Exaposteilarion1.melody
ltx/gr_redirects_goarch/me.m09.d16:meMA.Exaposteilarion1.mode	@ltx/gr_gr_cog/me.m09.d16:meMA.Exaposteilarion1.mode
ltx/gr_redirects_goarch/me.m09.d16:meMA.Exaposteilarion1.text	@ltx/gr_gr_cog/me.m09.d16:meMA.Exaposteilarion1.text
ltx/gr_redirects_goarch/me.m09.d16:meMA.Exaposteilarion2.greekmelody	@ltx/gr_gr_cog/me.m09.d16:meMA.Exaposteilarion2.greekmelody
ltx/gr_redirects_goarch/me.m09.d16:meMA.Exaposteilarion2.incipit	@ltx/gr_gr_cog/me.m09.d16:meMA.Exaposteilarion2.incipit
ltx/gr_redirects_goarch/me.m09.d16:meMA.Exaposteilarion2.melody	@ltx/gr_gr_cog/me.m09.d16:meMA.Exaposteilarion2.melody
ltx/gr_redirects_goarch/me.m09.d16:meMA.Exaposteilarion2.mode	@ltx/gr_gr_cog/me.m09.d16:meMA.Exaposteilarion2.mode
ltx/gr_redirects_goarch/me.m09.d16:meMA.Exaposteilarion2.text	@ltx/gr_gr_cog/me.m09.d16:meMA.Exaposteilarion2.text
ltx/gr_redirects_goarch/me.m09.d16:meMA.Kathisma11.greekmelody	@ltx/gr_gr_cog/me.m09.d16:meMA.Kathisma11.greekmelody
ltx/gr_redirects_goarch/me.m09.d16:meMA.Kathisma11.incipit	@ltx/gr_gr_cog/me.m09.d16:meMA.Kathisma11.incipit
ltx/gr_redirects_goarch/me.m09.d16:meMA.Kathisma11.melody	@ltx/gr_gr_cog/me.m09.d16:meMA.Kathisma11.melody
ltx/gr_redirects_goarch/me.m09.d16:meMA.Kathisma11.mode	@ltx/gr_gr_cog/me.m09.d16:meMA.Kathisma11.mode
ltx/gr_redirects_goarch/me.m09.d16:meMA.Kathisma11.text	@ltx/gr_gr_cog/me.m09.d16:meMA.Kathisma11.text
ltx/gr_redirects_goarch/me.m09.d16:meMA.Kathisma12.greekmelody	@ltx/gr_gr_cog/me.m09.d16:meMA.Kathisma12.greekmelody
ltx/gr_redirects_goarch/me.m09.d16:meMA.Kathisma12.incipit	@ltx/gr_gr_cog/me.m09.d16:meMA.Kathisma12.incipit
ltx/gr_redirects_goarch/me.m09.d16:meMA.Kathisma12.melody	@ltx/gr_gr_cog/me.m09.d16:meMA.Kathisma12.melody
ltx/gr_redirects_goarch/me.m09.d16:meMA.Kathisma12.mode	@ltx/gr_gr_cog/me.m09.d16:meMA.Kathisma12.mode
ltx/gr_redirects_goarch/me.m09.d16:meMA.Kathisma12.text	@ltx/gr_gr_cog/me.m09.d16:meMA.Kathisma12.text
ltx/gr_redirects_goarch/me.m09.d16:meMA.Kathisma21.greekmelody	@ltx/gr_gr_cog/me.m09.d16:meMA.Kathisma21.greekmelody
ltx/gr_redirects_goarch/me.m09.d16:meMA.Kathisma21.incipit	@ltx/gr_gr_cog/me.m09.d16:meMA.Kathisma21.incipit
ltx/gr_redirects_goarch/me.m09.d16:meMA.Kathisma21.melody	@ltx/gr_gr_cog/me.m09.d16:meMA.Kathisma21.melody
ltx/gr_redirects_goarch/me.m09.d16:meMA.Kathisma21.mode	@ltx/gr_gr_cog/me.m09.d16:meMA.Kathisma21.mode
ltx/gr_redirects_goarch/me.m09.d16:meMA.Kathisma21.text	@ltx/gr_gr_cog/me.m09.d16:meMA.Kathisma21.text
ltx/gr_redirects_goarch/me.m09.d16:meMA.Kathisma22.greekmelody	@ltx/gr_gr_cog/me.m09.d16:meMA.Kathisma22.greekmelody
ltx/gr_redirects_goarch/me.m09.d16:meMA.Kathisma22.incipit	@ltx/gr_gr_cog/me.m09.d16:meMA.Kathisma22.incipit
ltx/gr_redirects_goarch/me.m09.d16:meMA.Kathisma22.melody	@ltx/gr_gr_cog/me.m09.d16:meMA.Kathisma22.melody
ltx/gr_redirects_goarch/me.m09.d16:meMA.Kathisma22.mode	@ltx/gr_gr_cog/me.m09.d16:meMA.Kathisma22.mode
ltx/gr_redirects_goarch/me.m09.d16:meMA.Kathisma22.text	@ltx/gr_gr_cog/me.m09.d16:meMA.Kathisma22.text
ltx/gr_redirects_goarch/me.m09.d16:meMA.Kontakion1.greekmelody	@ltx/gr_gr_cog/me.m09.d16:meMA.Kontakion1.greekmelody
ltx/gr_redirects_goarch/me.m09.d16:meMA.Kontakion1.incipit	@ltx/gr_gr_cog/me.m09.d16:meMA.Kontakion1.incipit
ltx/gr_redirects_goarch/me.m09.d16:meMA.Kontakion1.melody	@ltx/gr_gr_cog/me.m09.d16:meMA.Kontakion1.melody
ltx/gr_redirects_goarch/me.m09.d16:meMA.Kontakion1.mode	@ltx/gr_gr_cog/me.m09.d16:meMA.Kontakion1.mode
ltx/gr_redirects_goarch/me.m09.d16:meMA.Kontakion1.text	@ltx/gr_gr_cog/me.m09.d16:meMA.Kontakion1.text
ltx/gr_redirects_goarch/me.m09.d16:meMA.Lauds1.incipit	@ltx/gr_gr_cog/me.m09.d16:meMA.Lauds1.incipit
ltx/gr_redirects_goarch/me.m09.d16:meMA.Lauds1.melody	@ltx/gr_gr_cog/me.m09.d16:meMA.Lauds1.melody
ltx/gr_redirects_goarch/me.m09.d16:meMA.Lauds1.mode	@ltx/gr_gr_cog/me.m09.d16:meMA.Lauds1.mode
ltx/gr_redirects_goarch/me.m09.d16:meMA.Lauds1.text	@ltx/gr_gr_cog/me.m09.d16:meMA.Lauds1.text
ltx/gr_redirects_goarch/me.m09.d16:meMA.Lauds2.incipit	@ltx/gr_gr_cog/me.m09.d16:meMA.Lauds2.incipit
ltx/gr_redirects_goarch/me.m09.d16:meMA.Lauds2.melody	@ltx/gr_gr_cog/me.m09.d16:meMA.Lauds2.melody
ltx/gr_redirects_goarch/me.m09.d16:meMA.Lauds2.mode	@ltx/gr_gr_cog/me.m09.d16:meMA.Lauds2.mode
ltx/gr_redirects_goarch/me.m09.d16:meMA.Lauds2.text	@ltx/gr_gr_cog/me.m09.d16:meMA.Lauds2.text
ltx/gr_redirects_goarch/me.m09.d16:meMA.Lauds3.incipit	@ltx/gr_gr_cog/me.m09.d16:meMA.Lauds3.incipit
ltx/gr_redirects_goarch/me.m09.d16:meMA.Lauds3.melody	@ltx/gr_gr_cog/me.m09.d16:meMA.Lauds3.melody
ltx/gr_redirects_goarch/me.m09.d16:meMA.Lauds3.mode	@ltx/gr_gr_cog/me.m09.d16:meMA.Lauds3.mode
ltx/gr_redirects_goarch/me.m09.d16:meMA.Lauds3.text	@ltx/gr_gr_cog/me.m09.d16:meMA.Lauds3.text
ltx/gr_redirects_goarch/me.m09.d16:meMA.LaudsBoth.incipit	@ltx/gr_gr_cog/me.m09.d16:meMA.LaudsBoth.incipit
ltx/gr_redirects_goarch/me.m09.d16:meMA.LaudsBoth.melody	@ltx/gr_gr_cog/me.m09.d16:meMA.LaudsBoth.melody
ltx/gr_redirects_goarch/me.m09.d16:meMA.LaudsBoth.mode	@ltx/gr_gr_cog/me.m09.d16:meMA.LaudsBoth.mode
ltx/gr_redirects_goarch/me.m09.d16:meMA.LaudsBoth.text	@ltx/gr_gr_cog/me.m09.d16:meMA.LaudsBoth.text
ltx/gr_redirects_goarch/me.m09.d16:meMA.LaudsGlory.incipit	@ltx/gr_gr_cog/me.m09.d16:meMA.LaudsGlory.incipit
ltx/gr_redirects_goarch/me.m09.d16:meMA.LaudsGlory.melody	@ltx/gr_gr_cog/me.m09.d16:meMA.LaudsGlory.melody
ltx/gr_redirects_goarch/me.m09.d16:meMA.LaudsGlory.mode	@ltx/gr_gr_cog/me.m09.d16:meMA.LaudsGlory.mode
ltx/gr_redirects_goarch/me.m09.d16:meMA.LaudsGlory.poet	@ltx/gr_gr_cog/me.m09.d16:meMA.LaudsGlory.poet
ltx/gr_redirects_goarch/me.m09.d16:meMA.LaudsGlory.text	@ltx/gr_gr_cog/me.m09.d16:meMA.LaudsGlory.text
ltx/gr_redirects_goarch/me.m09.d16:meMA.Ode1C11.greekmelody	@ltx/gr_gr_cog/me.m09.d16:meMA.Ode1C11.greekmelody
ltx/gr_redirects_goarch/me.m09.d16:meMA.Ode1C11.incipit	@ltx/gr_gr_cog/me.m09.d16:meMA.Ode1C11.incipit
ltx/gr_redirects_goarch/me.m09.d16:meMA.Ode1C11.melody	@ltx/gr_gr_cog/me.m09.d16:meMA.Ode1C11.melody
ltx/gr_redirects_goarch/me.m09.d16:meMA.Ode1C11.mode	@ltx/gr_gr_cog/me.m09.d16:meMA.Ode1C11.mode
ltx/gr_redirects_goarch/me.m09.d16:meMA.Ode1C11.ode	@ltx/gr_gr_cog/me.m09.d16:meMA.Ode1C11.ode
ltx/gr_redirects_goarch/me.m09.d16:meMA.Ode1C11.text	@ltx/gr_gr_cog/me.m09.d16:meMA.Ode1C11.text
ltx/gr_redirects_goarch/me.m09.d16:meMA.Ode1C12.incipit	@ltx/gr_gr_cog/me.m09.d16:meMA.Ode1C12.incipit
ltx/gr_redirects_goarch/me.m09.d16:meMA.Ode1C12.melody	@ltx/gr_gr_cog/me.m09.d16:meMA.Ode1C12.melody
ltx/gr_redirects_goarch/me.m09.d16:meMA.Ode1C12.mode	@ltx/gr_gr_cog/me.m09.d16:meMA.Ode1C12.mode
ltx/gr_redirects_goarch/me.m09.d16:meMA.Ode1C12.ode	@ltx/gr_gr_cog/me.m09.d16:meMA.Ode1C12.ode
ltx/gr_redirects_goarch/me.m09.d16:meMA.Ode1C12.text	@ltx/gr_gr_cog/me.m09.d16:meMA.Ode1C12.text
ltx/gr_redirects_goarch/me.m09.d16:meMA.Ode1C13.incipit	@ltx/gr_gr_cog/me.m09.d16:meMA.Ode1C13.incipit
ltx/gr_redirects_goarch/me.m09.d16:meMA.Ode1C13.melody	@ltx/gr_gr_cog/me.m09.d16:meMA.Ode1C13.melody
ltx/gr_redirects_goarch/me.m09.d16:meMA.Ode1C13.mode	@ltx/gr_gr_cog/me.m09.d16:meMA.Ode1C13.mode
ltx/gr_redirects_goarch/me.m09.d16:meMA.Ode1C13.ode	@ltx/gr_gr_cog/me.m09.d16:meMA.Ode1C13.ode
ltx/gr_redirects_goarch/me.m09.d16:meMA.Ode1C13.text	@ltx/gr_gr_cog/me.m09.d16:meMA.Ode1C13.text
ltx/gr_redirects_goarch/me.m09.d16:meMA.Ode1C1T.incipit	@ltx/gr_gr_cog/me.m09.d16:meMA.Ode1C1T.incipit
ltx/gr_redirects_goarch/me.m09.d16:meMA.Ode1C1T.melody	@ltx/gr_gr_cog/me.m09.d16:meMA.Ode1C1T.melody
ltx/gr_redirects_goarch/me.m09.d16:meMA.Ode1C1T.mode	@ltx/gr_gr_cog/me.m09.d16:meMA.Ode1C1T.mode
ltx/gr_redirects_goarch/me.m09.d16:meMA.Ode1C1T.ode	@ltx/gr_gr_cog/me.m09.d16:meMA.Ode1C1T.ode
ltx/gr_redirects_goarch/me.m09.d16:meMA.Ode1C1T.text	@ltx/gr_gr_cog/me.m09.d16:meMA.Ode1C1T.text
ltx/gr_redirects_goarch/me.m09.d16:meMA.Ode3C11.greekmelody	@ltx/gr_gr_cog/me.m09.d16:meMA.Ode3C11.greekmelody
ltx/gr_redirects_goarch/me.m09.d16:meMA.Ode3C11.incipit	@ltx/gr_gr_cog/me.m09.d16:meMA.Ode3C11.incipit
ltx/gr_redirects_goarch/me.m09.d16:meMA.Ode3C11.melody	@ltx/gr_gr_cog/me.m09.d16:meMA.Ode3C11.melody
ltx/gr_redirects_goarch/me.m09.d16:meMA.Ode3C11.mode	@ltx/gr_gr_cog/me.m09.d16:meMA.Ode3C11.mode
ltx/gr_redirects_goarch/me.m09.d16:meMA.Ode3C11.ode	@ltx/gr_gr_cog/me.m09.d16:meMA.Ode3C11.ode
ltx/gr_redirects_goarch/me.m09.d16:meMA.Ode3C11.text	@ltx/gr_gr_cog/me.m09.d16:meMA.Ode3C11.text
ltx/gr_redirects_goarch/me.m09.d16:meMA.Ode3C12.incipit	@ltx/gr_gr_cog/me.m09.d16:meMA.Ode3C12.incipit
ltx/gr_redirects_goarch/me.m09.d16:meMA.Ode3C12.melody	@ltx/gr_gr_cog/me.m09.d16:meMA.Ode3C12.melody
ltx/gr_redirects_goarch/me.m09.d16:meMA.Ode3C12.mode	@ltx/gr_gr_cog/me.m09.d16:meMA.Ode3C12.mode
ltx/gr_redirects_goarch/me.m09.d16:meMA.Ode3C12.ode	@ltx/gr_gr_cog/me.m09.d16:meMA.Ode3C12.ode
ltx/gr_redirects_goarch/me.m09.d16:meMA.Ode3C12.text	@ltx/gr_gr_cog/me.m09.d16:meMA.Ode3C12.text
ltx/gr_redirects_goarch/me.m09.d16:meMA.Ode3C13.incipit	@ltx/gr_gr_cog/me.m09.d16:meMA.Ode3C13.incipit
ltx/gr_redirects_goarch/me.m09.d16:meMA.Ode3C13.melody	@ltx/gr_gr_cog/me.m09.d16:meMA.Ode3C13.melody
ltx/gr_redirects_goarch/me.m09.d16:meMA.Ode3C13.mode	@ltx/gr_gr_cog/me.m09.d16:meMA.Ode3C13.mode
ltx/gr_redirects_goarch/me.m09.d16:meMA.Ode3C13.ode	@ltx/gr_gr_cog/me.m09.d16:meMA.Ode3C13.ode
ltx/gr_redirects_goarch/me.m09.d16:meMA.Ode3C13.text	@ltx/gr_gr_cog/me.m09.d16:meMA.Ode3C13.text
ltx/gr_redirects_goarch/me.m09.d16:meMA.Ode3C1T.incipit	@ltx/gr_gr_cog/me.m09.d16:meMA.Ode3C1T.incipit
ltx/gr_redirects_goarch/me.m09.d16:meMA.Ode3C1T.melody	@ltx/gr_gr_cog/me.m09.d16:meMA.Ode3C1T.melody
ltx/gr_redirects_goarch/me.m09.d16:meMA.Ode3C1T.mode	@ltx/gr_gr_cog/me.m09.d16:meMA.Ode3C1T.mode
ltx/gr_redirects_goarch/me.m09.d16:meMA.Ode3C1T.ode	@ltx/gr_gr_cog/me.m09.d16:meMA.Ode3C1T.ode
ltx/gr_redirects_goarch/me.m09.d16:meMA.Ode3C1T.text	@ltx/gr_gr_cog/me.m09.d16:meMA.Ode3C1T.text
ltx/gr_redirects_goarch/me.m09.d16:meMA.Ode3H.greekmelody	@ltx/gr_gr_cog/me.m09.d16:meMA.Ode3H.greekmelody
ltx/gr_redirects_goarch/me.m09.d16:meMA.Ode3H.incipit	@ltx/gr_gr_cog/me.m09.d16:meMA.Ode3H.incipit
ltx/gr_redirects_goarch/me.m09.d16:meMA.Ode3H.melody	@ltx/gr_gr_cog/me.m09.d16:meMA.Ode3H.melody
ltx/gr_redirects_goarch/me.m09.d16:meMA.Ode3H.mode	@ltx/gr_gr_cog/me.m09.d16:meMA.Ode3H.mode
ltx/gr_redirects_goarch/me.m09.d16:meMA.Ode3H.ode	@ltx/gr_gr_cog/me.m09.d16:meMA.Ode3H.ode
ltx/gr_redirects_goarch/me.m09.d16:meMA.Ode3H.text	@ltx/gr_gr_cog/me.m09.d16:meMA.Ode3H.text
ltx/gr_redirects_goarch/me.m09.d16:meMA.Ode3Kathisma1.greekmelody	@ltx/gr_gr_cog/me.m09.d16:meMA.Ode3Kathisma1.greekmelody
ltx/gr_redirects_goarch/me.m09.d16:meMA.Ode3Kathisma1.incipit	@ltx/gr_gr_cog/me.m09.d16:meMA.Ode3Kathisma1.incipit
ltx/gr_redirects_goarch/me.m09.d16:meMA.Ode3Kathisma1.melody	@ltx/gr_gr_cog/me.m09.d16:meMA.Ode3Kathisma1.melody
ltx/gr_redirects_goarch/me.m09.d16:meMA.Ode3Kathisma1.mode	@ltx/gr_gr_cog/me.m09.d16:meMA.Ode3Kathisma1.mode
ltx/gr_redirects_goarch/me.m09.d16:meMA.Ode3Kathisma1.text	@ltx/gr_gr_cog/me.m09.d16:meMA.Ode3Kathisma1.text
ltx/gr_redirects_goarch/me.m09.d16:meMA.Ode3Kathisma2.greekmelody	@ltx/gr_gr_cog/me.m09.d16:meMA.Ode3Kathisma2.greekmelody
ltx/gr_redirects_goarch/me.m09.d16:meMA.Ode3Kathisma2.incipit	@ltx/gr_gr_cog/me.m09.d16:meMA.Ode3Kathisma2.incipit
ltx/gr_redirects_goarch/me.m09.d16:meMA.Ode3Kathisma2.melody	@ltx/gr_gr_cog/me.m09.d16:meMA.Ode3Kathisma2.melody
ltx/gr_redirects_goarch/me.m09.d16:meMA.Ode3Kathisma2.mode	@ltx/gr_gr_cog/me.m09.d16:meMA.Ode3Kathisma2.mode
ltx/gr_redirects_goarch/me.m09.d16:meMA.Ode3Kathisma2.text	@ltx/gr_gr_cog/me.m09.d16:meMA.Ode3Kathisma2.text
ltx/gr_redirects_goarch/me.m09.d16:meMA.Ode4C11.greekmelody	@ltx/gr_gr_cog/me.m09.d16:meMA.Ode4C11.greekmelody
ltx/gr_redirects_goarch/me.m09.d16:meMA.Ode4C11.incipit	@ltx/gr_gr_cog/me.m09.d16:meMA.Ode4C11.incipit
ltx/gr_redirects_goarch/me.m09.d16:meMA.Ode4C11.melody	@ltx/gr_gr_cog/me.m09.d16:meMA.Ode4C11.melody
ltx/gr_redirects_goarch/me.m09.d16:meMA.Ode4C11.mode	@ltx/gr_gr_cog/me.m09.d16:meMA.Ode4C11.mode
ltx/gr_redirects_goarch/me.m09.d16:meMA.Ode4C11.ode	@ltx/gr_gr_cog/me.m09.d16:meMA.Ode4C11.ode
ltx/gr_redirects_goarch/me.m09.d16:meMA.Ode4C11.text	@ltx/gr_gr_cog/me.m09.d16:meMA.Ode4C11.text
ltx/gr_redirects_goarch/me.m09.d16:meMA.Ode4C12.incipit	@ltx/gr_gr_cog/me.m09.d16:meMA.Ode4C12.incipit
ltx/gr_redirects_goarch/me.m09.d16:meMA.Ode4C12.melody	@ltx/gr_gr_cog/me.m09.d16:meMA.Ode4C12.melody
ltx/gr_redirects_goarch/me.m09.d16:meMA.Ode4C12.mode	@ltx/gr_gr_cog/me.m09.d16:meMA.Ode4C12.mode
ltx/gr_redirects_goarch/me.m09.d16:meMA.Ode4C12.ode	@ltx/gr_gr_cog/me.m09.d16:meMA.Ode4C12.ode
ltx/gr_redirects_goarch/me.m09.d16:meMA.Ode4C12.text	@ltx/gr_gr_cog/me.m09.d16:meMA.Ode4C12.text
ltx/gr_redirects_goarch/me.m09.d16:meMA.Ode4C13.incipit	@ltx/gr_gr_cog/me.m09.d16:meMA.Ode4C13.incipit
ltx/gr_redirects_goarch/me.m09.d16:meMA.Ode4C13.melody	@ltx/gr_gr_cog/me.m09.d16:meMA.Ode4C13.melody
ltx/gr_redirects_goarch/me.m09.d16:meMA.Ode4C13.mode	@ltx/gr_gr_cog/me.m09.d16:meMA.Ode4C13.mode
ltx/gr_redirects_goarch/me.m09.d16:meMA.Ode4C13.ode	@ltx/gr_gr_cog/me.m09.d16:meMA.Ode4C13.ode
ltx/gr_redirects_goarch/me.m09.d16:meMA.Ode4C13.text	@ltx/gr_gr_cog/me.m09.d16:meMA.Ode4C13.text
ltx/gr_redirects_goarch/me.m09.d16:meMA.Ode4C14.incipit	@ltx/gr_gr_cog/me.m09.d16:meMA.Ode4C14.incipit
ltx/gr_redirects_goarch/me.m09.d16:meMA.Ode4C14.melody	@ltx/gr_gr_cog/me.m09.d16:meMA.Ode4C14.melody
ltx/gr_redirects_goarch/me.m09.d16:meMA.Ode4C14.mode	@ltx/gr_gr_cog/me.m09.d16:meMA.Ode4C14.mode
ltx/gr_redirects_goarch/me.m09.d16:meMA.Ode4C14.ode	@ltx/gr_gr_cog/me.m09.d16:meMA.Ode4C14.ode
ltx/gr_redirects_goarch/me.m09.d16:meMA.Ode4C14.text	@ltx/gr_gr_cog/me.m09.d16:meMA.Ode4C14.text
ltx/gr_redirects_goarch/me.m09.d16:meMA.Ode4C1T.incipit	@ltx/gr_gr_cog/me.m09.d16:meMA.Ode4C1T.incipit
ltx/gr_redirects_goarch/me.m09.d16:meMA.Ode4C1T.melody	@ltx/gr_gr_cog/me.m09.d16:meMA.Ode4C1T.melody
ltx/gr_redirects_goarch/me.m09.d16:meMA.Ode4C1T.mode	@ltx/gr_gr_cog/me.m09.d16:meMA.Ode4C1T.mode
ltx/gr_redirects_goarch/me.m09.d16:meMA.Ode4C1T.ode	@ltx/gr_gr_cog/me.m09.d16:meMA.Ode4C1T.ode
ltx/gr_redirects_goarch/me.m09.d16:meMA.Ode4C1T.text	@ltx/gr_gr_cog/me.m09.d16:meMA.Ode4C1T.text
ltx/gr_redirects_goarch/me.m09.d16:meMA.Ode5C11.greekmelody	@ltx/gr_gr_cog/me.m09.d16:meMA.Ode5C11.greekmelody
ltx/gr_redirects_goarch/me.m09.d16:meMA.Ode5C11.incipit	@ltx/gr_gr_cog/me.m09.d16:meMA.Ode5C11.incipit
ltx/gr_redirects_goarch/me.m09.d16:meMA.Ode5C11.melody	@ltx/gr_gr_cog/me.m09.d16:meMA.Ode5C11.melody
ltx/gr_redirects_goarch/me.m09.d16:meMA.Ode5C11.mode	@ltx/gr_gr_cog/me.m09.d16:meMA.Ode5C11.mode
ltx/gr_redirects_goarch/me.m09.d16:meMA.Ode5C11.ode	@ltx/gr_gr_cog/me.m09.d16:meMA.Ode5C11.ode
ltx/gr_redirects_goarch/me.m09.d16:meMA.Ode5C11.text	@ltx/gr_gr_cog/me.m09.d16:meMA.Ode5C11.text
ltx/gr_redirects_goarch/me.m09.d16:meMA.Ode5C12.incipit	@ltx/gr_gr_cog/me.m09.d16:meMA.Ode5C12.incipit
ltx/gr_redirects_goarch/me.m09.d16:meMA.Ode5C12.melody	@ltx/gr_gr_cog/me.m09.d16:meMA.Ode5C12.melody
ltx/gr_redirects_goarch/me.m09.d16:meMA.Ode5C12.mode	@ltx/gr_gr_cog/me.m09.d16:meMA.Ode5C12.mode
ltx/gr_redirects_goarch/me.m09.d16:meMA.Ode5C12.ode	@ltx/gr_gr_cog/me.m09.d16:meMA.Ode5C12.ode
ltx/gr_redirects_goarch/me.m09.d16:meMA.Ode5C12.text	@ltx/gr_gr_cog/me.m09.d16:meMA.Ode5C12.text
ltx/gr_redirects_goarch/me.m09.d16:meMA.Ode5C13.incipit	@ltx/gr_gr_cog/me.m09.d16:meMA.Ode5C13.incipit
ltx/gr_redirects_goarch/me.m09.d16:meMA.Ode5C13.melody	@ltx/gr_gr_cog/me.m09.d16:meMA.Ode5C13.melody
ltx/gr_redirects_goarch/me.m09.d16:meMA.Ode5C13.mode	@ltx/gr_gr_cog/me.m09.d16:meMA.Ode5C13.mode
ltx/gr_redirects_goarch/me.m09.d16:meMA.Ode5C13.ode	@ltx/gr_gr_cog/me.m09.d16:meMA.Ode5C13.ode
ltx/gr_redirects_goarch/me.m09.d16:meMA.Ode5C13.text	@ltx/gr_gr_cog/me.m09.d16:meMA.Ode5C13.text
ltx/gr_redirects_goarch/me.m09.d16:meMA.Ode5C1T.incipit	@ltx/gr_gr_cog/me.m09.d16:meMA.Ode5C1T.incipit
ltx/gr_redirects_goarch/me.m09.d16:meMA.Ode5C1T.melody	@ltx/gr_gr_cog/me.m09.d16:meMA.Ode5C1T.melody
ltx/gr_redirects_goarch/me.m09.d16:meMA.Ode5C1T.mode	@ltx/gr_gr_cog/me.m09.d16:meMA.Ode5C1T.mode
ltx/gr_redirects_goarch/me.m09.d16:meMA.Ode5C1T.ode	@ltx/gr_gr_cog/me.m09.d16:meMA.Ode5C1T.ode
ltx/gr_redirects_goarch/me.m09.d16:meMA.Ode5C1T.text	@ltx/gr_gr_cog/me.m09.d16:meMA.Ode5C1T.text
ltx/gr_redirects_goarch/me.m09.d16:meMA.Ode6C11.greekmelody	@ltx/gr_gr_cog/me.m09.d16:meMA.Ode6C11.greekmelody
ltx/gr_redirects_goarch/me.m09.d16:meMA.Ode6C11.incipit	@ltx/gr_gr_cog/me.m09.d16:meMA.Ode6C11.incipit
ltx/gr_redirects_goarch/me.m09.d16:meMA.Ode6C11.melody	@ltx/gr_gr_cog/me.m09.d16:meMA.Ode6C11.melody
ltx/gr_redirects_goarch/me.m09.d16:meMA.Ode6C11.mode	@ltx/gr_gr_cog/me.m09.d16:meMA.Ode6C11.mode
ltx/gr_redirects_goarch/me.m09.d16:meMA.Ode6C11.ode	@ltx/gr_gr_cog/me.m09.d16:meMA.Ode6C11.ode
ltx/gr_redirects_goarch/me.m09.d16:meMA.Ode6C11.text	@ltx/gr_gr_cog/me.m09.d16:meMA.Ode6C11.text
ltx/gr_redirects_goarch/me.m09.d16:meMA.Ode6C12.incipit	@ltx/gr_gr_cog/me.m09.d16:meMA.Ode6C12.incipit
ltx/gr_redirects_goarch/me.m09.d16:meMA.Ode6C12.melody	@ltx/gr_gr_cog/me.m09.d16:meMA.Ode6C12.melody
ltx/gr_redirects_goarch/me.m09.d16:meMA.Ode6C12.mode	@ltx/gr_gr_cog/me.m09.d16:meMA.Ode6C12.mode
ltx/gr_redirects_goarch/me.m09.d16:meMA.Ode6C12.ode	@ltx/gr_gr_cog/me.m09.d16:meMA.Ode6C12.ode
ltx/gr_redirects_goarch/me.m09.d16:meMA.Ode6C12.text	@ltx/gr_gr_cog/me.m09.d16:meMA.Ode6C12.text
ltx/gr_redirects_goarch/me.m09.d16:meMA.Ode6C13.incipit	@ltx/gr_gr_cog/me.m09.d16:meMA.Ode6C13.incipit
ltx/gr_redirects_goarch/me.m09.d16:meMA.Ode6C13.melody	@ltx/gr_gr_cog/me.m09.d16:meMA.Ode6C13.melody
ltx/gr_redirects_goarch/me.m09.d16:meMA.Ode6C13.mode	@ltx/gr_gr_cog/me.m09.d16:meMA.Ode6C13.mode
ltx/gr_redirects_goarch/me.m09.d16:meMA.Ode6C13.ode	@ltx/gr_gr_cog/me.m09.d16:meMA.Ode6C13.ode
ltx/gr_redirects_goarch/me.m09.d16:meMA.Ode6C13.text	@ltx/gr_gr_cog/me.m09.d16:meMA.Ode6C13.text
ltx/gr_redirects_goarch/me.m09.d16:meMA.Ode6C1T.incipit	@ltx/gr_gr_cog/me.m09.d16:meMA.Ode6C1T.incipit
ltx/gr_redirects_goarch/me.m09.d16:meMA.Ode6C1T.melody	@ltx/gr_gr_cog/me.m09.d16:meMA.Ode6C1T.melody
ltx/gr_redirects_goarch/me.m09.d16:meMA.Ode6C1T.mode	@ltx/gr_gr_cog/me.m09.d16:meMA.Ode6C1T.mode
ltx/gr_redirects_goarch/me.m09.d16:meMA.Ode6C1T.ode	@ltx/gr_gr_cog/me.m09.d16:meMA.Ode6C1T.ode
ltx/gr_redirects_goarch/me.m09.d16:meMA.Ode6C1T.text	@ltx/gr_gr_cog/me.m09.d16:meMA.Ode6C1T.text
ltx/gr_redirects_goarch/me.m09.d16:meMA.Ode6H.greekmelody	@ltx/gr_gr_cog/me.m09.d16:meMA.Ode6H.greekmelody
ltx/gr_redirects_goarch/me.m09.d16:meMA.Ode6H.incipit	@ltx/gr_gr_cog/me.m09.d16:meMA.Ode6H.incipit
ltx/gr_redirects_goarch/me.m09.d16:meMA.Ode6H.melody	@ltx/gr_gr_cog/me.m09.d16:meMA.Ode6H.melody
ltx/gr_redirects_goarch/me.m09.d16:meMA.Ode6H.mode	@ltx/gr_gr_cog/me.m09.d16:meMA.Ode6H.mode
ltx/gr_redirects_goarch/me.m09.d16:meMA.Ode6H.ode	@ltx/gr_gr_cog/me.m09.d16:meMA.Ode6H.ode
ltx/gr_redirects_goarch/me.m09.d16:meMA.Ode6H.text	@ltx/gr_gr_cog/me.m09.d16:meMA.Ode6H.text
ltx/gr_redirects_goarch/me.m09.d16:meMA.Ode7C11.greekmelody	@ltx/gr_gr_cog/me.m09.d16:meMA.Ode7C11.greekmelody
ltx/gr_redirects_goarch/me.m09.d16:meMA.Ode7C11.incipit	@ltx/gr_gr_cog/me.m09.d16:meMA.Ode7C11.incipit
ltx/gr_redirects_goarch/me.m09.d16:meMA.Ode7C11.melody	@ltx/gr_gr_cog/me.m09.d16:meMA.Ode7C11.melody
ltx/gr_redirects_goarch/me.m09.d16:meMA.Ode7C11.mode	@ltx/gr_gr_cog/me.m09.d16:meMA.Ode7C11.mode
ltx/gr_redirects_goarch/me.m09.d16:meMA.Ode7C11.ode	@ltx/gr_gr_cog/me.m09.d16:meMA.Ode7C11.ode
ltx/gr_redirects_goarch/me.m09.d16:meMA.Ode7C11.text	@ltx/gr_gr_cog/me.m09.d16:meMA.Ode7C11.text
ltx/gr_redirects_goarch/me.m09.d16:meMA.Ode7C12.incipit	@ltx/gr_gr_cog/me.m09.d16:meMA.Ode7C12.incipit
ltx/gr_redirects_goarch/me.m09.d16:meMA.Ode7C12.melody	@ltx/gr_gr_cog/me.m09.d16:meMA.Ode7C12.melody
ltx/gr_redirects_goarch/me.m09.d16:meMA.Ode7C12.mode	@ltx/gr_gr_cog/me.m09.d16:meMA.Ode7C12.mode
ltx/gr_redirects_goarch/me.m09.d16:meMA.Ode7C12.ode	@ltx/gr_gr_cog/me.m09.d16:meMA.Ode7C12.ode
ltx/gr_redirects_goarch/me.m09.d16:meMA.Ode7C12.text	@ltx/gr_gr_cog/me.m09.d16:meMA.Ode7C12.text
ltx/gr_redirects_goarch/me.m09.d16:meMA.Ode7C13.incipit	@ltx/gr_gr_cog/me.m09.d16:meMA.Ode7C13.incipit
ltx/gr_redirects_goarch/me.m09.d16:meMA.Ode7C13.melody	@ltx/gr_gr_cog/me.m09.d16:meMA.Ode7C13.melody
ltx/gr_redirects_goarch/me.m09.d16:meMA.Ode7C13.mode	@ltx/gr_gr_cog/me.m09.d16:meMA.Ode7C13.mode
ltx/gr_redirects_goarch/me.m09.d16:meMA.Ode7C13.ode	@ltx/gr_gr_cog/me.m09.d16:meMA.Ode7C13.ode
ltx/gr_redirects_goarch/me.m09.d16:meMA.Ode7C13.text	@ltx/gr_gr_cog/me.m09.d16:meMA.Ode7C13.text
ltx/gr_redirects_goarch/me.m09.d16:meMA.Ode7C14.incipit	@ltx/gr_gr_cog/me.m09.d16:meMA.Ode7C14.incipit
ltx/gr_redirects_goarch/me.m09.d16:meMA.Ode7C14.melody	@ltx/gr_gr_cog/me.m09.d16:meMA.Ode7C14.melody
ltx/gr_redirects_goarch/me.m09.d16:meMA.Ode7C14.mode	@ltx/gr_gr_cog/me.m09.d16:meMA.Ode7C14.mode
ltx/gr_redirects_goarch/me.m09.d16:meMA.Ode7C14.ode	@ltx/gr_gr_cog/me.m09.d16:meMA.Ode7C14.ode
ltx/gr_redirects_goarch/me.m09.d16:meMA.Ode7C14.text	@ltx/gr_gr_cog/me.m09.d16:meMA.Ode7C14.text
ltx/gr_redirects_goarch/me.m09.d16:meMA.Ode7C1T.incipit	@ltx/gr_gr_cog/me.m09.d16:meMA.Ode7C1T.incipit
ltx/gr_redirects_goarch/me.m09.d16:meMA.Ode7C1T.melody	@ltx/gr_gr_cog/me.m09.d16:meMA.Ode7C1T.melody
ltx/gr_redirects_goarch/me.m09.d16:meMA.Ode7C1T.mode	@ltx/gr_gr_cog/me.m09.d16:meMA.Ode7C1T.mode
ltx/gr_redirects_goarch/me.m09.d16:meMA.Ode7C1T.ode	@ltx/gr_gr_cog/me.m09.d16:meMA.Ode7C1T.ode
ltx/gr_redirects_goarch/me.m09.d16:meMA.Ode7C1T.text	@ltx/gr_gr_cog/me.m09.d16:meMA.Ode7C1T.text
ltx/gr_redirects_goarch/me.m09.d16:meMA.Ode8C11.greekmelody	@ltx/gr_gr_cog/me.m09.d16:meMA.Ode8C11.greekmelody
ltx/gr_redirects_goarch/me.m09.d16:meMA.Ode8C11.incipit	@ltx/gr_gr_cog/me.m09.d16:meMA.Ode8C11.incipit
ltx/gr_redirects_goarch/me.m09.d16:meMA.Ode8C11.melody	@ltx/gr_gr_cog/me.m09.d16:meMA.Ode8C11.melody
ltx/gr_redirects_goarch/me.m09.d16:meMA.Ode8C11.mode	@ltx/gr_gr_cog/me.m09.d16:meMA.Ode8C11.mode
ltx/gr_redirects_goarch/me.m09.d16:meMA.Ode8C11.ode	@ltx/gr_gr_cog/me.m09.d16:meMA.Ode8C11.ode
ltx/gr_redirects_goarch/me.m09.d16:meMA.Ode8C11.text	@ltx/gr_gr_cog/me.m09.d16:meMA.Ode8C11.text
ltx/gr_redirects_goarch/me.m09.d16:meMA.Ode8C12.incipit	@ltx/gr_gr_cog/me.m09.d16:meMA.Ode8C12.incipit
ltx/gr_redirects_goarch/me.m09.d16:meMA.Ode8C12.melody	@ltx/gr_gr_cog/me.m09.d16:meMA.Ode8C12.melody
ltx/gr_redirects_goarch/me.m09.d16:meMA.Ode8C12.mode	@ltx/gr_gr_cog/me.m09.d16:meMA.Ode8C12.mode
ltx/gr_redirects_goarch/me.m09.d16:meMA.Ode8C12.ode	@ltx/gr_gr_cog/me.m09.d16:meMA.Ode8C12.ode
ltx/gr_redirects_goarch/me.m09.d16:meMA.Ode8C12.text	@ltx/gr_gr_cog/me.m09.d16:meMA.Ode8C12.text
ltx/gr_redirects_goarch/me.m09.d16:meMA.Ode8C13.incipit	@ltx/gr_gr_cog/me.m09.d16:meMA.Ode8C13.incipit
ltx/gr_redirects_goarch/me.m09.d16:meMA.Ode8C13.melody	@ltx/gr_gr_cog/me.m09.d16:meMA.Ode8C13.melody
ltx/gr_redirects_goarch/me.m09.d16:meMA.Ode8C13.mode	@ltx/gr_gr_cog/me.m09.d16:meMA.Ode8C13.mode
ltx/gr_redirects_goarch/me.m09.d16:meMA.Ode8C13.ode	@ltx/gr_gr_cog/me.m09.d16:meMA.Ode8C13.ode
ltx/gr_redirects_goarch/me.m09.d16:meMA.Ode8C13.text	@ltx/gr_gr_cog/me.m09.d16:meMA.Ode8C13.text
ltx/gr_redirects_goarch/me.m09.d16:meMA.Ode8C14.incipit	@ltx/gr_gr_cog/me.m09.d16:meMA.Ode8C14.incipit
ltx/gr_redirects_goarch/me.m09.d16:meMA.Ode8C14.melody	@ltx/gr_gr_cog/me.m09.d16:meMA.Ode8C14.melody
ltx/gr_redirects_goarch/me.m09.d16:meMA.Ode8C14.mode	@ltx/gr_gr_cog/me.m09.d16:meMA.Ode8C14.mode
ltx/gr_redirects_goarch/me.m09.d16:meMA.Ode8C14.ode	@ltx/gr_gr_cog/me.m09.d16:meMA.Ode8C14.ode
ltx/gr_redirects_goarch/me.m09.d16:meMA.Ode8C14.text	@ltx/gr_gr_cog/me.m09.d16:meMA.Ode8C14.text
ltx/gr_redirects_goarch/me.m09.d16:meMA.Ode8C1T.incipit	@ltx/gr_gr_cog/me.m09.d16:meMA.Ode8C1T.incipit
ltx/gr_redirects_goarch/me.m09.d16:meMA.Ode8C1T.melody	@ltx/gr_gr_cog/me.m09.d16:meMA.Ode8C1T.melody
ltx/gr_redirects_goarch/me.m09.d16:meMA.Ode8C1T.mode	@ltx/gr_gr_cog/me.m09.d16:meMA.Ode8C1T.mode
ltx/gr_redirects_goarch/me.m09.d16:meMA.Ode8C1T.ode	@ltx/gr_gr_cog/me.m09.d16:meMA.Ode8C1T.ode
ltx/gr_redirects_goarch/me.m09.d16:meMA.Ode8C1T.text	@ltx/gr_gr_cog/me.m09.d16:meMA.Ode8C1T.text
ltx/gr_redirects_goarch/me.m09.d16:meMA.Ode8H.greekmelody	@ltx/gr_gr_cog/me.m09.d16:meMA.Ode8H.greekmelody
ltx/gr_redirects_goarch/me.m09.d16:meMA.Ode8H.incipit	@ltx/gr_gr_cog/me.m09.d16:meMA.Ode8H.incipit
ltx/gr_redirects_goarch/me.m09.d16:meMA.Ode8H.melody	@ltx/gr_gr_cog/me.m09.d16:meMA.Ode8H.melody
ltx/gr_redirects_goarch/me.m09.d16:meMA.Ode8H.mode	@ltx/gr_gr_cog/me.m09.d16:meMA.Ode8H.mode
ltx/gr_redirects_goarch/me.m09.d16:meMA.Ode8H.ode	@ltx/gr_gr_cog/me.m09.d16:meMA.Ode8H.ode
ltx/gr_redirects_goarch/me.m09.d16:meMA.Ode8H.text	@ltx/gr_gr_cog/me.m09.d16:meMA.Ode8H.text
ltx/gr_redirects_goarch/me.m09.d16:meMA.Ode9C11.greekmelody	@ltx/gr_gr_cog/me.m09.d16:meMA.Ode9C11.greekmelody
ltx/gr_redirects_goarch/me.m09.d16:meMA.Ode9C11.incipit	@ltx/gr_gr_cog/me.m09.d16:meMA.Ode9C11.incipit
ltx/gr_redirects_goarch/me.m09.d16:meMA.Ode9C11.melody	@ltx/gr_gr_cog/me.m09.d16:meMA.Ode9C11.melody
ltx/gr_redirects_goarch/me.m09.d16:meMA.Ode9C11.mode	@ltx/gr_gr_cog/me.m09.d16:meMA.Ode9C11.mode
ltx/gr_redirects_goarch/me.m09.d16:meMA.Ode9C11.ode	@ltx/gr_gr_cog/me.m09.d16:meMA.Ode9C11.ode
ltx/gr_redirects_goarch/me.m09.d16:meMA.Ode9C11.text	@ltx/gr_gr_cog/me.m09.d16:meMA.Ode9C11.text
ltx/gr_redirects_goarch/me.m09.d16:meMA.Ode9C12.incipit	@ltx/gr_gr_cog/me.m09.d16:meMA.Ode9C12.incipit
ltx/gr_redirects_goarch/me.m09.d16:meMA.Ode9C12.melody	@ltx/gr_gr_cog/me.m09.d16:meMA.Ode9C12.melody
ltx/gr_redirects_goarch/me.m09.d16:meMA.Ode9C12.mode	@ltx/gr_gr_cog/me.m09.d16:meMA.Ode9C12.mode
ltx/gr_redirects_goarch/me.m09.d16:meMA.Ode9C12.ode	@ltx/gr_gr_cog/me.m09.d16:meMA.Ode9C12.ode
ltx/gr_redirects_goarch/me.m09.d16:meMA.Ode9C12.text	@ltx/gr_gr_cog/me.m09.d16:meMA.Ode9C12.text
ltx/gr_redirects_goarch/me.m09.d16:meMA.Ode9C13.incipit	@ltx/gr_gr_cog/me.m09.d16:meMA.Ode9C13.incipit
ltx/gr_redirects_goarch/me.m09.d16:meMA.Ode9C13.melody	@ltx/gr_gr_cog/me.m09.d16:meMA.Ode9C13.melody
ltx/gr_redirects_goarch/me.m09.d16:meMA.Ode9C13.mode	@ltx/gr_gr_cog/me.m09.d16:meMA.Ode9C13.mode
ltx/gr_redirects_goarch/me.m09.d16:meMA.Ode9C13.ode	@ltx/gr_gr_cog/me.m09.d16:meMA.Ode9C13.ode
ltx/gr_redirects_goarch/me.m09.d16:meMA.Ode9C13.text	@ltx/gr_gr_cog/me.m09.d16:meMA.Ode9C13.text
ltx/gr_redirects_goarch/me.m09.d16:meMA.Ode9C1T.incipit	@ltx/gr_gr_cog/me.m09.d16:meMA.Ode9C1T.incipit
ltx/gr_redirects_goarch/me.m09.d16:meMA.Ode9C1T.melody	@ltx/gr_gr_cog/me.m09.d16:meMA.Ode9C1T.melody
ltx/gr_redirects_goarch/me.m09.d16:meMA.Ode9C1T.mode	@ltx/gr_gr_cog/me.m09.d16:meMA.Ode9C1T.mode
ltx/gr_redirects_goarch/me.m09.d16:meMA.Ode9C1T.ode	@ltx/gr_gr_cog/me.m09.d16:meMA.Ode9C1T.ode
ltx/gr_redirects_goarch/me.m09.d16:meMA.Ode9C1T.text	@ltx/gr_gr_cog/me.m09.d16:meMA.Ode9C1T.text
ltx/gr_redirects_goarch/me.m09.d16:meMA.Ode9H.greekmelody	@ltx/gr_gr_cog/me.m09.d16:meMA.Ode9H.greekmelody
ltx/gr_redirects_goarch/me.m09.d16:meMA.Ode9H.incipit	@ltx/gr_gr_cog/me.m09.d16:meMA.Ode9H.incipit
ltx/gr_redirects_goarch/me.m09.d16:meMA.Ode9H.melody	@ltx/gr_gr_cog/me.m09.d16:meMA.Ode9H.melody
ltx/gr_redirects_goarch/me.m09.d16:meMA.Ode9H.mode	@ltx/gr_gr_cog/me.m09.d16:meMA.Ode9H.mode
ltx/gr_redirects_goarch/me.m09.d16:meMA.Ode9H.ode	@ltx/gr_gr_cog/me.m09.d16:meMA.Ode9H.ode
ltx/gr_redirects_goarch/me.m09.d16:meMA.Ode9H.text	@ltx/gr_gr_cog/me.m09.d16:meMA.Ode9H.text
ltx/gr_redirects_goarch/me.m09.d16:meMA.Oikos1.text	@ltx/gr_gr_cog/me.m09.d16:meMA.Oikos1.text
ltx/gr_redirects_goarch/me.m09.d16:meMA.PostGospelIdiomelon.incipit	@ltx/gr_gr_cog/me.m09.d16:meMA.PostGospelIdiomelon.incipit
ltx/gr_redirects_goarch/me.m09.d16:meMA.PostGospelIdiomelon.melody	@ltx/gr_gr_cog/me.m09.d16:meMA.PostGospelIdiomelon.melody
ltx/gr_redirects_goarch/me.m09.d16:meMA.PostGospelIdiomelon.mode	@ltx/gr_gr_cog/me.m09.d16:meMA.PostGospelIdiomelon.mode
ltx/gr_redirects_goarch/me.m09.d16:meMA.PostGospelIdiomelon.text	@ltx/gr_gr_cog/me.m09.d16:meMA.PostGospelIdiomelon.text
ltx/gr_redirects_goarch/me.m09.d16:meVE.Apolytikion1.greekmelody	@ltx/gr_gr_cog/me.m09.d16:meVE.Apolytikion1.greekmelody
ltx/gr_redirects_goarch/me.m09.d16:meVE.Apolytikion1.incipit	@ltx/gr_gr_cog/me.m09.d16:meVE.Apolytikion1.incipit
ltx/gr_redirects_goarch/me.m09.d16:meVE.Apolytikion1.melody	@ltx/gr_gr_cog/me.m09.d16:meVE.Apolytikion1.melody
ltx/gr_redirects_goarch/me.m09.d16:meVE.Apolytikion1.mode	@ltx/gr_gr_cog/me.m09.d16:meVE.Apolytikion1.mode
ltx/gr_redirects_goarch/me.m09.d16:meVE.Apolytikion1.text	@ltx/gr_gr_cog/me.m09.d16:meVE.Apolytikion1.text
ltx/gr_redirects_goarch/me.m09.d16:meVE.AposBoth.incipit	@ltx/gr_gr_cog/me.m09.d16:meVE.AposBoth.incipit
ltx/gr_redirects_goarch/me.m09.d16:meVE.AposBoth.melody	@ltx/gr_gr_cog/me.m09.d16:meVE.AposBoth.melody
ltx/gr_redirects_goarch/me.m09.d16:meVE.AposBoth.mode	@ltx/gr_gr_cog/me.m09.d16:meVE.AposBoth.mode
ltx/gr_redirects_goarch/me.m09.d16:meVE.AposBoth.text	@ltx/gr_gr_cog/me.m09.d16:meVE.AposBoth.text
ltx/gr_redirects_goarch/me.m09.d16:meVE.AposGlory.incipit	@ltx/gr_gr_cog/me.m09.d16:meVE.AposGlory.incipit
ltx/gr_redirects_goarch/me.m09.d16:meVE.AposGlory.melody	@ltx/gr_gr_cog/me.m09.d16:meVE.AposGlory.melody
ltx/gr_redirects_goarch/me.m09.d16:meVE.AposGlory.mode	@ltx/gr_gr_cog/me.m09.d16:meVE.AposGlory.mode
ltx/gr_redirects_goarch/me.m09.d16:meVE.AposGlory.poet	@ltx/gr_gr_cog/me.m09.d16:meVE.AposGlory.poet
ltx/gr_redirects_goarch/me.m09.d16:meVE.AposGlory.text	@ltx/gr_gr_cog/me.m09.d16:meVE.AposGlory.text
ltx/gr_redirects_goarch/me.m09.d16:meVE.Aposticha1.greekmelody	@ltx/gr_gr_cog/me.m09.d16:meVE.Aposticha1.greekmelody
ltx/gr_redirects_goarch/me.m09.d16:meVE.Aposticha1.incipit	@ltx/gr_gr_cog/me.m09.d16:meVE.Aposticha1.incipit
ltx/gr_redirects_goarch/me.m09.d16:meVE.Aposticha1.melody	@ltx/gr_gr_cog/me.m09.d16:meVE.Aposticha1.melody
ltx/gr_redirects_goarch/me.m09.d16:meVE.Aposticha1.mode	@ltx/gr_gr_cog/me.m09.d16:meVE.Aposticha1.mode
ltx/gr_redirects_goarch/me.m09.d16:meVE.Aposticha1.text	@ltx/gr_gr_cog/me.m09.d16:meVE.Aposticha1.text
ltx/gr_redirects_goarch/me.m09.d16:meVE.Aposticha2.incipit	@ltx/gr_gr_cog/me.m09.d16:meVE.Aposticha2.incipit
ltx/gr_redirects_goarch/me.m09.d16:meVE.Aposticha2.melody	@ltx/gr_gr_cog/me.m09.d16:meVE.Aposticha2.melody
ltx/gr_redirects_goarch/me.m09.d16:meVE.Aposticha2.mode	@ltx/gr_gr_cog/me.m09.d16:meVE.Aposticha2.mode
ltx/gr_redirects_goarch/me.m09.d16:meVE.Aposticha2.text	@ltx/gr_gr_cog/me.m09.d16:meVE.Aposticha2.text
ltx/gr_redirects_goarch/me.m09.d16:meVE.Aposticha3.incipit	@ltx/gr_gr_cog/me.m09.d16:meVE.Aposticha3.incipit
ltx/gr_redirects_goarch/me.m09.d16:meVE.Aposticha3.melody	@ltx/gr_gr_cog/me.m09.d16:meVE.Aposticha3.melody
ltx/gr_redirects_goarch/me.m09.d16:meVE.Aposticha3.mode	@ltx/gr_gr_cog/me.m09.d16:meVE.Aposticha3.mode
ltx/gr_redirects_goarch/me.m09.d16:meVE.Aposticha3.text	@ltx/gr_gr_cog/me.m09.d16:meVE.Aposticha3.text
ltx/gr_redirects_goarch/me.m09.d16:meVE.SticBoth.incipit	@ltx/gr_gr_cog/me.m09.d16:meVE.SticBoth.incipit
ltx/gr_redirects_goarch/me.m09.d16:meVE.SticBoth.melody	@ltx/gr_gr_cog/me.m09.d16:meVE.SticBoth.melody
ltx/gr_redirects_goarch/me.m09.d16:meVE.SticBoth.mode	@ltx/gr_gr_cog/me.m09.d16:meVE.SticBoth.mode
ltx/gr_redirects_goarch/me.m09.d16:meVE.SticBoth.text	@ltx/gr_gr_cog/me.m09.d16:meVE.SticBoth.text
ltx/gr_redirects_goarch/me.m09.d16:meVE.SticGlory.incipit	@ltx/gr_gr_cog/me.m09.d16:meVE.SticGlory.incipit
ltx/gr_redirects_goarch/me.m09.d16:meVE.SticGlory.melody	@ltx/gr_gr_cog/me.m09.d16:meVE.SticGlory.melody
ltx/gr_redirects_goarch/me.m09.d16:meVE.SticGlory.mode	@ltx/gr_gr_cog/me.m09.d16:meVE.SticGlory.mode
ltx/gr_redirects_goarch/me.m09.d16:meVE.SticGlory.poet	@ltx/gr_gr_cog/me.m09.d16:meVE.SticGlory.poet
ltx/gr_redirects_goarch/me.m09.d16:meVE.SticGlory.text	@ltx/gr_gr_cog/me.m09.d16:meVE.SticGlory.text
ltx/gr_redirects_goarch/me.m09.d16:meVE.Stichera01.greekmelody	@ltx/gr_gr_cog/me.m09.d16:meVE.Stichera01.greekmelody
ltx/gr_redirects_goarch/me.m09.d16:meVE.Stichera01.incipit	@ltx/gr_gr_cog/me.m09.d16:meVE.Stichera01.incipit
ltx/gr_redirects_goarch/me.m09.d16:meVE.Stichera01.melody	@ltx/gr_gr_cog/me.m09.d16:meVE.Stichera01.melody
ltx/gr_redirects_goarch/me.m09.d16:meVE.Stichera01.mode	@ltx/gr_gr_cog/me.m09.d16:meVE.Stichera01.mode
ltx/gr_redirects_goarch/me.m09.d16:meVE.Stichera01.text	@ltx/gr_gr_cog/me.m09.d16:meVE.Stichera01.text
ltx/gr_redirects_goarch/me.m09.d16:meVE.Stichera02.incipit	@ltx/gr_gr_cog/me.m09.d16:meVE.Stichera02.incipit
ltx/gr_redirects_goarch/me.m09.d16:meVE.Stichera02.melody	@ltx/gr_gr_cog/me.m09.d16:meVE.Stichera02.melody
ltx/gr_redirects_goarch/me.m09.d16:meVE.Stichera02.mode	@ltx/gr_gr_cog/me.m09.d16:meVE.Stichera02.mode
ltx/gr_redirects_goarch/me.m09.d16:meVE.Stichera02.text	@ltx/gr_gr_cog/me.m09.d16:meVE.Stichera02.text
ltx/gr_redirects_goarch/me.m09.d16:meVE.Stichera03.incipit	@ltx/gr_gr_cog/me.m09.d16:meVE.Stichera03.incipit
ltx/gr_redirects_goarch/me.m09.d16:meVE.Stichera03.melody	@ltx/gr_gr_cog/me.m09.d16:meVE.Stichera03.melody
ltx/gr_redirects_goarch/me.m09.d16:meVE.Stichera03.mode	@ltx/gr_gr_cog/me.m09.d16:meVE.Stichera03.mode
ltx/gr_redirects_goarch/me.m09.d16:meVE.Stichera03.text	@ltx/gr_gr_cog/me.m09.d16:meVE.Stichera03.text
ltx/gr_redirects_goarch/me.m09.d16:meVE.Stichera04.greekmelody	@ltx/gr_gr_cog/me.m09.d16:meVE.Stichera04.greekmelody
ltx/gr_redirects_goarch/me.m09.d16:meVE.Stichera04.incipit	@ltx/gr_gr_cog/me.m09.d16:meVE.Stichera04.incipit
ltx/gr_redirects_goarch/me.m09.d16:meVE.Stichera04.melody	@ltx/gr_gr_cog/me.m09.d16:meVE.Stichera04.melody
ltx/gr_redirects_goarch/me.m09.d16:meVE.Stichera04.mode	@ltx/gr_gr_cog/me.m09.d16:meVE.Stichera04.mode
ltx/gr_redirects_goarch/me.m09.d16:meVE.Stichera04.text	@ltx/gr_gr_cog/me.m09.d16:meVE.Stichera04.text
ltx/gr_redirects_goarch/me.m09.d16:meVE.Stichera05.incipit	@ltx/gr_gr_cog/me.m09.d16:meVE.Stichera05.incipit
ltx/gr_redirects_goarch/me.m09.d16:meVE.Stichera05.melody	@ltx/gr_gr_cog/me.m09.d16:meVE.Stichera05.melody
ltx/gr_redirects_goarch/me.m09.d16:meVE.Stichera05.mode	@ltx/gr_gr_cog/me.m09.d16:meVE.Stichera05.mode
ltx/gr_redirects_goarch/me.m09.d16:meVE.Stichera05.text	@ltx/gr_gr_cog/me.m09.d16:meVE.Stichera05.text
ltx/gr_redirects_goarch/me.m09.d16:meVE.Stichera06.incipit	@ltx/gr_gr_cog/me.m09.d16:meVE.Stichera06.incipit
ltx/gr_redirects_goarch/me.m09.d16:meVE.Stichera06.melody	@ltx/gr_gr_cog/me.m09.d16:meVE.Stichera06.melody
ltx/gr_redirects_goarch/me.m09.d16:meVE.Stichera06.mode	@ltx/gr_gr_cog/me.m09.d16:meVE.Stichera06.mode
ltx/gr_redirects_goarch/me.m09.d16:meVE.Stichera06.text	@ltx/gr_gr_cog/me.m09.d16:meVE.Stichera06.text
