ltx/gr_redirects_goarch/tr.d018:trCO.header	@ltx/gr_gr_cog/tr.d018:trCO.header
ltx/gr_redirects_goarch/tr.d018:trDA.commemoration.full	@ltx/gr_gr_cog/tr.d018:trDA.commemoration.full
ltx/gr_redirects_goarch/tr.d018:trDA.commemoration.short	@ltx/gr_gr_cog/tr.d018:trDA.commemoration.short
ltx/gr_redirects_goarch/tr.d018:trDA.insert1	@ltx/gr_gr_cog/tr.d018:trDA.insert1
ltx/gr_redirects_goarch/tr.d018:trDA.insert2	@ltx/gr_gr_cog/tr.d018:trDA.insert2
ltx/gr_redirects_goarch/tr.d018:trDA.note	@ltx/gr_gr_cog/tr.d018:trDA.note
ltx/gr_redirects_goarch/tr.d018:trDA.title	@ltx/gr_gr_cog/tr.d018:trDA.title
ltx/gr_redirects_goarch/tr.d018:trHO.commemorations	@ltx/gr_gr_cog/tr.d018:trHO.commemorations
ltx/gr_redirects_goarch/tr.d018:trHO.daytitle	@ltx/gr_gr_cog/tr.d018:trHO.daytitle
ltx/gr_redirects_goarch/tr.d018:trHO.description1	@ltx/gr_gr_cog/tr.d018:trHO.description1
ltx/gr_redirects_goarch/tr.d018:trHO.description2	@ltx/gr_gr_cog/tr.d018:trHO.description2
ltx/gr_redirects_goarch/tr.d018:trHO.note1	@ltx/gr_gr_cog/tr.d018:trHO.note1
ltx/gr_redirects_goarch/tr.d018:trHO.note2	@ltx/gr_gr_cog/tr.d018:trHO.note2
ltx/gr_redirects_goarch/tr.d018:trMA.AposIdiomelon1.incipit	@ltx/gr_gr_cog/tr.d018:trMA.AposIdiomelon1.incipit
ltx/gr_redirects_goarch/tr.d018:trMA.AposIdiomelon1.melody	@ltx/gr_gr_cog/tr.d018:trMA.AposIdiomelon1.melody
ltx/gr_redirects_goarch/tr.d018:trMA.AposIdiomelon1.mode	@ltx/gr_gr_cog/tr.d018:trMA.AposIdiomelon1.mode
ltx/gr_redirects_goarch/tr.d018:trMA.AposIdiomelon1.text	@ltx/gr_gr_cog/tr.d018:trMA.AposIdiomelon1.text
ltx/gr_redirects_goarch/tr.d018:trMA.AposMartyric.incipit	@ltx/gr_gr_cog/tr.d018:trMA.AposMartyric.incipit
ltx/gr_redirects_goarch/tr.d018:trMA.AposMartyric.melody	@ltx/gr_gr_cog/tr.d018:trMA.AposMartyric.melody
ltx/gr_redirects_goarch/tr.d018:trMA.AposMartyric.mode	@ltx/gr_gr_cog/tr.d018:trMA.AposMartyric.mode
ltx/gr_redirects_goarch/tr.d018:trMA.AposMartyric.text	@ltx/gr_gr_cog/tr.d018:trMA.AposMartyric.text
ltx/gr_redirects_goarch/tr.d018:trMA.AposTheotokion.greekmelody	@ltx/gr_gr_cog/tr.d018:trMA.AposTheotokion.greekmelody
ltx/gr_redirects_goarch/tr.d018:trMA.AposTheotokion.incipit	@ltx/gr_gr_cog/tr.d018:trMA.AposTheotokion.incipit
ltx/gr_redirects_goarch/tr.d018:trMA.AposTheotokion.melody	@ltx/gr_gr_cog/tr.d018:trMA.AposTheotokion.melody
ltx/gr_redirects_goarch/tr.d018:trMA.AposTheotokion.mode	@ltx/gr_gr_cog/tr.d018:trMA.AposTheotokion.mode
ltx/gr_redirects_goarch/tr.d018:trMA.AposTheotokion.text	@ltx/gr_gr_cog/tr.d018:trMA.AposTheotokion.text
ltx/gr_redirects_goarch/tr.d018:trMA.C1.poet	@ltx/gr_gr_cog/tr.d018:trMA.C1.poet
ltx/gr_redirects_goarch/tr.d018:trMA.C1.title	@ltx/gr_gr_cog/tr.d018:trMA.C1.title
ltx/gr_redirects_goarch/tr.d018:trMA.C1.verse	@ltx/gr_gr_cog/tr.d018:trMA.C1.verse
ltx/gr_redirects_goarch/tr.d018:trMA.C2.poet	@ltx/gr_gr_cog/tr.d018:trMA.C2.poet
ltx/gr_redirects_goarch/tr.d018:trMA.Kathisma21.greekmelody	@ltx/gr_gr_cog/tr.d018:trMA.Kathisma21.greekmelody
ltx/gr_redirects_goarch/tr.d018:trMA.Kathisma21.incipit	@ltx/gr_gr_cog/tr.d018:trMA.Kathisma21.incipit
ltx/gr_redirects_goarch/tr.d018:trMA.Kathisma21.melody	@ltx/gr_gr_cog/tr.d018:trMA.Kathisma21.melody
ltx/gr_redirects_goarch/tr.d018:trMA.Kathisma21.mode	@ltx/gr_gr_cog/tr.d018:trMA.Kathisma21.mode
ltx/gr_redirects_goarch/tr.d018:trMA.Kathisma21.text	@ltx/gr_gr_cog/tr.d018:trMA.Kathisma21.text
ltx/gr_redirects_goarch/tr.d018:trMA.Kathisma22.greekmelody	@ltx/gr_gr_cog/tr.d018:trMA.Kathisma22.greekmelody
ltx/gr_redirects_goarch/tr.d018:trMA.Kathisma22.incipit	@ltx/gr_gr_cog/tr.d018:trMA.Kathisma22.incipit
ltx/gr_redirects_goarch/tr.d018:trMA.Kathisma22.melody	@ltx/gr_gr_cog/tr.d018:trMA.Kathisma22.melody
ltx/gr_redirects_goarch/tr.d018:trMA.Kathisma22.mode	@ltx/gr_gr_cog/tr.d018:trMA.Kathisma22.mode
ltx/gr_redirects_goarch/tr.d018:trMA.Kathisma22.text	@ltx/gr_gr_cog/tr.d018:trMA.Kathisma22.text
ltx/gr_redirects_goarch/tr.d018:trMA.Ode1C11.greekmelody	@ltx/gr_gr_cog/tr.d018:trMA.Ode1C11.greekmelody
ltx/gr_redirects_goarch/tr.d018:trMA.Ode1C11.incipit	@ltx/gr_gr_cog/tr.d018:trMA.Ode1C11.incipit
ltx/gr_redirects_goarch/tr.d018:trMA.Ode1C11.melody	@ltx/gr_gr_cog/tr.d018:trMA.Ode1C11.melody
ltx/gr_redirects_goarch/tr.d018:trMA.Ode1C11.mode	@ltx/gr_gr_cog/tr.d018:trMA.Ode1C11.mode
ltx/gr_redirects_goarch/tr.d018:trMA.Ode1C11.ode	@ltx/gr_gr_cog/tr.d018:trMA.Ode1C11.ode
ltx/gr_redirects_goarch/tr.d018:trMA.Ode1C11.text	@ltx/gr_gr_cog/tr.d018:trMA.Ode1C11.text
ltx/gr_redirects_goarch/tr.d018:trMA.Ode1C12.incipit	@ltx/gr_gr_cog/tr.d018:trMA.Ode1C12.incipit
ltx/gr_redirects_goarch/tr.d018:trMA.Ode1C12.melody	@ltx/gr_gr_cog/tr.d018:trMA.Ode1C12.melody
ltx/gr_redirects_goarch/tr.d018:trMA.Ode1C12.mode	@ltx/gr_gr_cog/tr.d018:trMA.Ode1C12.mode
ltx/gr_redirects_goarch/tr.d018:trMA.Ode1C12.ode	@ltx/gr_gr_cog/tr.d018:trMA.Ode1C12.ode
ltx/gr_redirects_goarch/tr.d018:trMA.Ode1C12.text	@ltx/gr_gr_cog/tr.d018:trMA.Ode1C12.text
ltx/gr_redirects_goarch/tr.d018:trMA.Ode1C13.incipit	@ltx/gr_gr_cog/tr.d018:trMA.Ode1C13.incipit
ltx/gr_redirects_goarch/tr.d018:trMA.Ode1C13.melody	@ltx/gr_gr_cog/tr.d018:trMA.Ode1C13.melody
ltx/gr_redirects_goarch/tr.d018:trMA.Ode1C13.mode	@ltx/gr_gr_cog/tr.d018:trMA.Ode1C13.mode
ltx/gr_redirects_goarch/tr.d018:trMA.Ode1C13.ode	@ltx/gr_gr_cog/tr.d018:trMA.Ode1C13.ode
ltx/gr_redirects_goarch/tr.d018:trMA.Ode1C13.text	@ltx/gr_gr_cog/tr.d018:trMA.Ode1C13.text
ltx/gr_redirects_goarch/tr.d018:trMA.Ode1C1H.greekmelody	@ltx/gr_gr_cog/tr.d018:trMA.Ode1C1H.greekmelody
ltx/gr_redirects_goarch/tr.d018:trMA.Ode1C1H.incipit	@ltx/gr_gr_cog/tr.d018:trMA.Ode1C1H.incipit
ltx/gr_redirects_goarch/tr.d018:trMA.Ode1C1H.melody	@ltx/gr_gr_cog/tr.d018:trMA.Ode1C1H.melody
ltx/gr_redirects_goarch/tr.d018:trMA.Ode1C1H.mode	@ltx/gr_gr_cog/tr.d018:trMA.Ode1C1H.mode
ltx/gr_redirects_goarch/tr.d018:trMA.Ode1C1H.ode	@ltx/gr_gr_cog/tr.d018:trMA.Ode1C1H.ode
ltx/gr_redirects_goarch/tr.d018:trMA.Ode1C1H.text	@ltx/gr_gr_cog/tr.d018:trMA.Ode1C1H.text
ltx/gr_redirects_goarch/tr.d018:trMA.Ode1C1T.incipit	@ltx/gr_gr_cog/tr.d018:trMA.Ode1C1T.incipit
ltx/gr_redirects_goarch/tr.d018:trMA.Ode1C1T.melody	@ltx/gr_gr_cog/tr.d018:trMA.Ode1C1T.melody
ltx/gr_redirects_goarch/tr.d018:trMA.Ode1C1T.mode	@ltx/gr_gr_cog/tr.d018:trMA.Ode1C1T.mode
ltx/gr_redirects_goarch/tr.d018:trMA.Ode1C1T.ode	@ltx/gr_gr_cog/tr.d018:trMA.Ode1C1T.ode
ltx/gr_redirects_goarch/tr.d018:trMA.Ode1C1T.text	@ltx/gr_gr_cog/tr.d018:trMA.Ode1C1T.text
ltx/gr_redirects_goarch/tr.d018:trMA.Ode3C11.greekmelody	@ltx/gr_gr_cog/tr.d018:trMA.Ode3C11.greekmelody
ltx/gr_redirects_goarch/tr.d018:trMA.Ode3C11.incipit	@ltx/gr_gr_cog/tr.d018:trMA.Ode3C11.incipit
ltx/gr_redirects_goarch/tr.d018:trMA.Ode3C11.melody	@ltx/gr_gr_cog/tr.d018:trMA.Ode3C11.melody
ltx/gr_redirects_goarch/tr.d018:trMA.Ode3C11.mode	@ltx/gr_gr_cog/tr.d018:trMA.Ode3C11.mode
ltx/gr_redirects_goarch/tr.d018:trMA.Ode3C11.ode	@ltx/gr_gr_cog/tr.d018:trMA.Ode3C11.ode
ltx/gr_redirects_goarch/tr.d018:trMA.Ode3C11.text	@ltx/gr_gr_cog/tr.d018:trMA.Ode3C11.text
ltx/gr_redirects_goarch/tr.d018:trMA.Ode3C12.incipit	@ltx/gr_gr_cog/tr.d018:trMA.Ode3C12.incipit
ltx/gr_redirects_goarch/tr.d018:trMA.Ode3C12.melody	@ltx/gr_gr_cog/tr.d018:trMA.Ode3C12.melody
ltx/gr_redirects_goarch/tr.d018:trMA.Ode3C12.mode	@ltx/gr_gr_cog/tr.d018:trMA.Ode3C12.mode
ltx/gr_redirects_goarch/tr.d018:trMA.Ode3C12.ode	@ltx/gr_gr_cog/tr.d018:trMA.Ode3C12.ode
ltx/gr_redirects_goarch/tr.d018:trMA.Ode3C12.text	@ltx/gr_gr_cog/tr.d018:trMA.Ode3C12.text
ltx/gr_redirects_goarch/tr.d018:trMA.Ode3C13.incipit	@ltx/gr_gr_cog/tr.d018:trMA.Ode3C13.incipit
ltx/gr_redirects_goarch/tr.d018:trMA.Ode3C13.melody	@ltx/gr_gr_cog/tr.d018:trMA.Ode3C13.melody
ltx/gr_redirects_goarch/tr.d018:trMA.Ode3C13.mode	@ltx/gr_gr_cog/tr.d018:trMA.Ode3C13.mode
ltx/gr_redirects_goarch/tr.d018:trMA.Ode3C13.ode	@ltx/gr_gr_cog/tr.d018:trMA.Ode3C13.ode
ltx/gr_redirects_goarch/tr.d018:trMA.Ode3C13.text	@ltx/gr_gr_cog/tr.d018:trMA.Ode3C13.text
ltx/gr_redirects_goarch/tr.d018:trMA.Ode3C1H.greekmelody	@ltx/gr_gr_cog/tr.d018:trMA.Ode3C1H.greekmelody
ltx/gr_redirects_goarch/tr.d018:trMA.Ode3C1H.incipit	@ltx/gr_gr_cog/tr.d018:trMA.Ode3C1H.incipit
ltx/gr_redirects_goarch/tr.d018:trMA.Ode3C1H.melody	@ltx/gr_gr_cog/tr.d018:trMA.Ode3C1H.melody
ltx/gr_redirects_goarch/tr.d018:trMA.Ode3C1H.mode	@ltx/gr_gr_cog/tr.d018:trMA.Ode3C1H.mode
ltx/gr_redirects_goarch/tr.d018:trMA.Ode3C1H.ode	@ltx/gr_gr_cog/tr.d018:trMA.Ode3C1H.ode
ltx/gr_redirects_goarch/tr.d018:trMA.Ode3C1H.text	@ltx/gr_gr_cog/tr.d018:trMA.Ode3C1H.text
ltx/gr_redirects_goarch/tr.d018:trMA.Ode3C1T.incipit	@ltx/gr_gr_cog/tr.d018:trMA.Ode3C1T.incipit
ltx/gr_redirects_goarch/tr.d018:trMA.Ode3C1T.melody	@ltx/gr_gr_cog/tr.d018:trMA.Ode3C1T.melody
ltx/gr_redirects_goarch/tr.d018:trMA.Ode3C1T.mode	@ltx/gr_gr_cog/tr.d018:trMA.Ode3C1T.mode
ltx/gr_redirects_goarch/tr.d018:trMA.Ode3C1T.ode	@ltx/gr_gr_cog/tr.d018:trMA.Ode3C1T.ode
ltx/gr_redirects_goarch/tr.d018:trMA.Ode3C1T.text	@ltx/gr_gr_cog/tr.d018:trMA.Ode3C1T.text
ltx/gr_redirects_goarch/tr.d018:trMA.Ode3C21.greekmelody	@ltx/gr_gr_cog/tr.d018:trMA.Ode3C21.greekmelody
ltx/gr_redirects_goarch/tr.d018:trMA.Ode3C21.incipit	@ltx/gr_gr_cog/tr.d018:trMA.Ode3C21.incipit
ltx/gr_redirects_goarch/tr.d018:trMA.Ode3C21.melody	@ltx/gr_gr_cog/tr.d018:trMA.Ode3C21.melody
ltx/gr_redirects_goarch/tr.d018:trMA.Ode3C21.mode	@ltx/gr_gr_cog/tr.d018:trMA.Ode3C21.mode
ltx/gr_redirects_goarch/tr.d018:trMA.Ode3C21.ode	@ltx/gr_gr_cog/tr.d018:trMA.Ode3C21.ode
ltx/gr_redirects_goarch/tr.d018:trMA.Ode3C21.text	@ltx/gr_gr_cog/tr.d018:trMA.Ode3C21.text
ltx/gr_redirects_goarch/tr.d018:trMA.Ode3C22.incipit	@ltx/gr_gr_cog/tr.d018:trMA.Ode3C22.incipit
ltx/gr_redirects_goarch/tr.d018:trMA.Ode3C22.melody	@ltx/gr_gr_cog/tr.d018:trMA.Ode3C22.melody
ltx/gr_redirects_goarch/tr.d018:trMA.Ode3C22.mode	@ltx/gr_gr_cog/tr.d018:trMA.Ode3C22.mode
ltx/gr_redirects_goarch/tr.d018:trMA.Ode3C22.ode	@ltx/gr_gr_cog/tr.d018:trMA.Ode3C22.ode
ltx/gr_redirects_goarch/tr.d018:trMA.Ode3C22.text	@ltx/gr_gr_cog/tr.d018:trMA.Ode3C22.text
ltx/gr_redirects_goarch/tr.d018:trMA.Ode3C23.incipit	@ltx/gr_gr_cog/tr.d018:trMA.Ode3C23.incipit
ltx/gr_redirects_goarch/tr.d018:trMA.Ode3C23.melody	@ltx/gr_gr_cog/tr.d018:trMA.Ode3C23.melody
ltx/gr_redirects_goarch/tr.d018:trMA.Ode3C23.mode	@ltx/gr_gr_cog/tr.d018:trMA.Ode3C23.mode
ltx/gr_redirects_goarch/tr.d018:trMA.Ode3C23.ode	@ltx/gr_gr_cog/tr.d018:trMA.Ode3C23.ode
ltx/gr_redirects_goarch/tr.d018:trMA.Ode3C23.text	@ltx/gr_gr_cog/tr.d018:trMA.Ode3C23.text
ltx/gr_redirects_goarch/tr.d018:trMA.Ode3C24.incipit	@ltx/gr_gr_cog/tr.d018:trMA.Ode3C24.incipit
ltx/gr_redirects_goarch/tr.d018:trMA.Ode3C24.melody	@ltx/gr_gr_cog/tr.d018:trMA.Ode3C24.melody
ltx/gr_redirects_goarch/tr.d018:trMA.Ode3C24.mode	@ltx/gr_gr_cog/tr.d018:trMA.Ode3C24.mode
ltx/gr_redirects_goarch/tr.d018:trMA.Ode3C24.ode	@ltx/gr_gr_cog/tr.d018:trMA.Ode3C24.ode
ltx/gr_redirects_goarch/tr.d018:trMA.Ode3C24.text	@ltx/gr_gr_cog/tr.d018:trMA.Ode3C24.text
ltx/gr_redirects_goarch/tr.d018:trMA.Ode3C25.incipit	@ltx/gr_gr_cog/tr.d018:trMA.Ode3C25.incipit
ltx/gr_redirects_goarch/tr.d018:trMA.Ode3C25.melody	@ltx/gr_gr_cog/tr.d018:trMA.Ode3C25.melody
ltx/gr_redirects_goarch/tr.d018:trMA.Ode3C25.mode	@ltx/gr_gr_cog/tr.d018:trMA.Ode3C25.mode
ltx/gr_redirects_goarch/tr.d018:trMA.Ode3C25.ode	@ltx/gr_gr_cog/tr.d018:trMA.Ode3C25.ode
ltx/gr_redirects_goarch/tr.d018:trMA.Ode3C25.text	@ltx/gr_gr_cog/tr.d018:trMA.Ode3C25.text
ltx/gr_redirects_goarch/tr.d018:trMA.Ode3C26.incipit	@ltx/gr_gr_cog/tr.d018:trMA.Ode3C26.incipit
ltx/gr_redirects_goarch/tr.d018:trMA.Ode3C26.melody	@ltx/gr_gr_cog/tr.d018:trMA.Ode3C26.melody
ltx/gr_redirects_goarch/tr.d018:trMA.Ode3C26.mode	@ltx/gr_gr_cog/tr.d018:trMA.Ode3C26.mode
ltx/gr_redirects_goarch/tr.d018:trMA.Ode3C26.ode	@ltx/gr_gr_cog/tr.d018:trMA.Ode3C26.ode
ltx/gr_redirects_goarch/tr.d018:trMA.Ode3C26.text	@ltx/gr_gr_cog/tr.d018:trMA.Ode3C26.text
ltx/gr_redirects_goarch/tr.d018:trMA.Ode3C2T.incipit	@ltx/gr_gr_cog/tr.d018:trMA.Ode3C2T.incipit
ltx/gr_redirects_goarch/tr.d018:trMA.Ode3C2T.melody	@ltx/gr_gr_cog/tr.d018:trMA.Ode3C2T.melody
ltx/gr_redirects_goarch/tr.d018:trMA.Ode3C2T.mode	@ltx/gr_gr_cog/tr.d018:trMA.Ode3C2T.mode
ltx/gr_redirects_goarch/tr.d018:trMA.Ode3C2T.ode	@ltx/gr_gr_cog/tr.d018:trMA.Ode3C2T.ode
ltx/gr_redirects_goarch/tr.d018:trMA.Ode3C2T.text	@ltx/gr_gr_cog/tr.d018:trMA.Ode3C2T.text
ltx/gr_redirects_goarch/tr.d018:trMA.Ode3C31.greekmelody	@ltx/gr_gr_cog/tr.d018:trMA.Ode3C31.greekmelody
ltx/gr_redirects_goarch/tr.d018:trMA.Ode3C31.incipit	@ltx/gr_gr_cog/tr.d018:trMA.Ode3C31.incipit
ltx/gr_redirects_goarch/tr.d018:trMA.Ode3C31.melody	@ltx/gr_gr_cog/tr.d018:trMA.Ode3C31.melody
ltx/gr_redirects_goarch/tr.d018:trMA.Ode3C31.mode	@ltx/gr_gr_cog/tr.d018:trMA.Ode3C31.mode
ltx/gr_redirects_goarch/tr.d018:trMA.Ode3C31.ode	@ltx/gr_gr_cog/tr.d018:trMA.Ode3C31.ode
ltx/gr_redirects_goarch/tr.d018:trMA.Ode3C31.text	@ltx/gr_gr_cog/tr.d018:trMA.Ode3C31.text
ltx/gr_redirects_goarch/tr.d018:trMA.Ode3C32.incipit	@ltx/gr_gr_cog/tr.d018:trMA.Ode3C32.incipit
ltx/gr_redirects_goarch/tr.d018:trMA.Ode3C32.melody	@ltx/gr_gr_cog/tr.d018:trMA.Ode3C32.melody
ltx/gr_redirects_goarch/tr.d018:trMA.Ode3C32.mode	@ltx/gr_gr_cog/tr.d018:trMA.Ode3C32.mode
ltx/gr_redirects_goarch/tr.d018:trMA.Ode3C32.ode	@ltx/gr_gr_cog/tr.d018:trMA.Ode3C32.ode
ltx/gr_redirects_goarch/tr.d018:trMA.Ode3C32.text	@ltx/gr_gr_cog/tr.d018:trMA.Ode3C32.text
ltx/gr_redirects_goarch/tr.d018:trMA.Ode3C3A1.incipit	@ltx/gr_gr_cog/tr.d018:trMA.Ode3C3A1.incipit
ltx/gr_redirects_goarch/tr.d018:trMA.Ode3C3A1.melody	@ltx/gr_gr_cog/tr.d018:trMA.Ode3C3A1.melody
ltx/gr_redirects_goarch/tr.d018:trMA.Ode3C3A1.mode	@ltx/gr_gr_cog/tr.d018:trMA.Ode3C3A1.mode
ltx/gr_redirects_goarch/tr.d018:trMA.Ode3C3A1.ode	@ltx/gr_gr_cog/tr.d018:trMA.Ode3C3A1.ode
ltx/gr_redirects_goarch/tr.d018:trMA.Ode3C3A1.text	@ltx/gr_gr_cog/tr.d018:trMA.Ode3C3A1.text
ltx/gr_redirects_goarch/tr.d018:trMA.Ode3C3H.greekmelody	@ltx/gr_gr_cog/tr.d018:trMA.Ode3C3H.greekmelody
ltx/gr_redirects_goarch/tr.d018:trMA.Ode3C3H.incipit	@ltx/gr_gr_cog/tr.d018:trMA.Ode3C3H.incipit
ltx/gr_redirects_goarch/tr.d018:trMA.Ode3C3H.melody	@ltx/gr_gr_cog/tr.d018:trMA.Ode3C3H.melody
ltx/gr_redirects_goarch/tr.d018:trMA.Ode3C3H.mode	@ltx/gr_gr_cog/tr.d018:trMA.Ode3C3H.mode
ltx/gr_redirects_goarch/tr.d018:trMA.Ode3C3H.ode	@ltx/gr_gr_cog/tr.d018:trMA.Ode3C3H.ode
ltx/gr_redirects_goarch/tr.d018:trMA.Ode3C3H.text	@ltx/gr_gr_cog/tr.d018:trMA.Ode3C3H.text
ltx/gr_redirects_goarch/tr.d018:trMA.Ode3C3T.incipit	@ltx/gr_gr_cog/tr.d018:trMA.Ode3C3T.incipit
ltx/gr_redirects_goarch/tr.d018:trMA.Ode3C3T.melody	@ltx/gr_gr_cog/tr.d018:trMA.Ode3C3T.melody
ltx/gr_redirects_goarch/tr.d018:trMA.Ode3C3T.mode	@ltx/gr_gr_cog/tr.d018:trMA.Ode3C3T.mode
ltx/gr_redirects_goarch/tr.d018:trMA.Ode3C3T.ode	@ltx/gr_gr_cog/tr.d018:trMA.Ode3C3T.ode
ltx/gr_redirects_goarch/tr.d018:trMA.Ode3C3T.text	@ltx/gr_gr_cog/tr.d018:trMA.Ode3C3T.text
ltx/gr_redirects_goarch/tr.d018:trMA.Ode3C3Tr.incipit	@ltx/gr_gr_cog/tr.d018:trMA.Ode3C3Tr.incipit
ltx/gr_redirects_goarch/tr.d018:trMA.Ode3C3Tr.melody	@ltx/gr_gr_cog/tr.d018:trMA.Ode3C3Tr.melody
ltx/gr_redirects_goarch/tr.d018:trMA.Ode3C3Tr.mode	@ltx/gr_gr_cog/tr.d018:trMA.Ode3C3Tr.mode
ltx/gr_redirects_goarch/tr.d018:trMA.Ode3C3Tr.ode	@ltx/gr_gr_cog/tr.d018:trMA.Ode3C3Tr.ode
ltx/gr_redirects_goarch/tr.d018:trMA.Ode3C3Tr.text	@ltx/gr_gr_cog/tr.d018:trMA.Ode3C3Tr.text
ltx/gr_redirects_goarch/tr.d018:trMA.Ode4C11.greekmelody	@ltx/gr_gr_cog/tr.d018:trMA.Ode4C11.greekmelody
ltx/gr_redirects_goarch/tr.d018:trMA.Ode4C11.incipit	@ltx/gr_gr_cog/tr.d018:trMA.Ode4C11.incipit
ltx/gr_redirects_goarch/tr.d018:trMA.Ode4C11.melody	@ltx/gr_gr_cog/tr.d018:trMA.Ode4C11.melody
ltx/gr_redirects_goarch/tr.d018:trMA.Ode4C11.mode	@ltx/gr_gr_cog/tr.d018:trMA.Ode4C11.mode
ltx/gr_redirects_goarch/tr.d018:trMA.Ode4C11.ode	@ltx/gr_gr_cog/tr.d018:trMA.Ode4C11.ode
ltx/gr_redirects_goarch/tr.d018:trMA.Ode4C11.text	@ltx/gr_gr_cog/tr.d018:trMA.Ode4C11.text
ltx/gr_redirects_goarch/tr.d018:trMA.Ode4C12.incipit	@ltx/gr_gr_cog/tr.d018:trMA.Ode4C12.incipit
ltx/gr_redirects_goarch/tr.d018:trMA.Ode4C12.melody	@ltx/gr_gr_cog/tr.d018:trMA.Ode4C12.melody
ltx/gr_redirects_goarch/tr.d018:trMA.Ode4C12.mode	@ltx/gr_gr_cog/tr.d018:trMA.Ode4C12.mode
ltx/gr_redirects_goarch/tr.d018:trMA.Ode4C12.ode	@ltx/gr_gr_cog/tr.d018:trMA.Ode4C12.ode
ltx/gr_redirects_goarch/tr.d018:trMA.Ode4C12.text	@ltx/gr_gr_cog/tr.d018:trMA.Ode4C12.text
ltx/gr_redirects_goarch/tr.d018:trMA.Ode4C13.incipit	@ltx/gr_gr_cog/tr.d018:trMA.Ode4C13.incipit
ltx/gr_redirects_goarch/tr.d018:trMA.Ode4C13.melody	@ltx/gr_gr_cog/tr.d018:trMA.Ode4C13.melody
ltx/gr_redirects_goarch/tr.d018:trMA.Ode4C13.mode	@ltx/gr_gr_cog/tr.d018:trMA.Ode4C13.mode
ltx/gr_redirects_goarch/tr.d018:trMA.Ode4C13.ode	@ltx/gr_gr_cog/tr.d018:trMA.Ode4C13.ode
ltx/gr_redirects_goarch/tr.d018:trMA.Ode4C13.text	@ltx/gr_gr_cog/tr.d018:trMA.Ode4C13.text
ltx/gr_redirects_goarch/tr.d018:trMA.Ode4C1T.incipit	@ltx/gr_gr_cog/tr.d018:trMA.Ode4C1T.incipit
ltx/gr_redirects_goarch/tr.d018:trMA.Ode4C1T.melody	@ltx/gr_gr_cog/tr.d018:trMA.Ode4C1T.melody
ltx/gr_redirects_goarch/tr.d018:trMA.Ode4C1T.mode	@ltx/gr_gr_cog/tr.d018:trMA.Ode4C1T.mode
ltx/gr_redirects_goarch/tr.d018:trMA.Ode4C1T.ode	@ltx/gr_gr_cog/tr.d018:trMA.Ode4C1T.ode
ltx/gr_redirects_goarch/tr.d018:trMA.Ode4C1T.text	@ltx/gr_gr_cog/tr.d018:trMA.Ode4C1T.text
ltx/gr_redirects_goarch/tr.d018:trMA.Ode5C11.greekmelody	@ltx/gr_gr_cog/tr.d018:trMA.Ode5C11.greekmelody
ltx/gr_redirects_goarch/tr.d018:trMA.Ode5C11.incipit	@ltx/gr_gr_cog/tr.d018:trMA.Ode5C11.incipit
ltx/gr_redirects_goarch/tr.d018:trMA.Ode5C11.melody	@ltx/gr_gr_cog/tr.d018:trMA.Ode5C11.melody
ltx/gr_redirects_goarch/tr.d018:trMA.Ode5C11.mode	@ltx/gr_gr_cog/tr.d018:trMA.Ode5C11.mode
ltx/gr_redirects_goarch/tr.d018:trMA.Ode5C11.ode	@ltx/gr_gr_cog/tr.d018:trMA.Ode5C11.ode
ltx/gr_redirects_goarch/tr.d018:trMA.Ode5C11.text	@ltx/gr_gr_cog/tr.d018:trMA.Ode5C11.text
ltx/gr_redirects_goarch/tr.d018:trMA.Ode5C12.incipit	@ltx/gr_gr_cog/tr.d018:trMA.Ode5C12.incipit
ltx/gr_redirects_goarch/tr.d018:trMA.Ode5C12.melody	@ltx/gr_gr_cog/tr.d018:trMA.Ode5C12.melody
ltx/gr_redirects_goarch/tr.d018:trMA.Ode5C12.mode	@ltx/gr_gr_cog/tr.d018:trMA.Ode5C12.mode
ltx/gr_redirects_goarch/tr.d018:trMA.Ode5C12.ode	@ltx/gr_gr_cog/tr.d018:trMA.Ode5C12.ode
ltx/gr_redirects_goarch/tr.d018:trMA.Ode5C12.text	@ltx/gr_gr_cog/tr.d018:trMA.Ode5C12.text
ltx/gr_redirects_goarch/tr.d018:trMA.Ode5C13.incipit	@ltx/gr_gr_cog/tr.d018:trMA.Ode5C13.incipit
ltx/gr_redirects_goarch/tr.d018:trMA.Ode5C13.melody	@ltx/gr_gr_cog/tr.d018:trMA.Ode5C13.melody
ltx/gr_redirects_goarch/tr.d018:trMA.Ode5C13.mode	@ltx/gr_gr_cog/tr.d018:trMA.Ode5C13.mode
ltx/gr_redirects_goarch/tr.d018:trMA.Ode5C13.ode	@ltx/gr_gr_cog/tr.d018:trMA.Ode5C13.ode
ltx/gr_redirects_goarch/tr.d018:trMA.Ode5C13.text	@ltx/gr_gr_cog/tr.d018:trMA.Ode5C13.text
ltx/gr_redirects_goarch/tr.d018:trMA.Ode5C1T.incipit	@ltx/gr_gr_cog/tr.d018:trMA.Ode5C1T.incipit
ltx/gr_redirects_goarch/tr.d018:trMA.Ode5C1T.melody	@ltx/gr_gr_cog/tr.d018:trMA.Ode5C1T.melody
ltx/gr_redirects_goarch/tr.d018:trMA.Ode5C1T.mode	@ltx/gr_gr_cog/tr.d018:trMA.Ode5C1T.mode
ltx/gr_redirects_goarch/tr.d018:trMA.Ode5C1T.ode	@ltx/gr_gr_cog/tr.d018:trMA.Ode5C1T.ode
ltx/gr_redirects_goarch/tr.d018:trMA.Ode5C1T.text	@ltx/gr_gr_cog/tr.d018:trMA.Ode5C1T.text
ltx/gr_redirects_goarch/tr.d018:trMA.Ode6C11.greekmelody	@ltx/gr_gr_cog/tr.d018:trMA.Ode6C11.greekmelody
ltx/gr_redirects_goarch/tr.d018:trMA.Ode6C11.incipit	@ltx/gr_gr_cog/tr.d018:trMA.Ode6C11.incipit
ltx/gr_redirects_goarch/tr.d018:trMA.Ode6C11.melody	@ltx/gr_gr_cog/tr.d018:trMA.Ode6C11.melody
ltx/gr_redirects_goarch/tr.d018:trMA.Ode6C11.mode	@ltx/gr_gr_cog/tr.d018:trMA.Ode6C11.mode
ltx/gr_redirects_goarch/tr.d018:trMA.Ode6C11.ode	@ltx/gr_gr_cog/tr.d018:trMA.Ode6C11.ode
ltx/gr_redirects_goarch/tr.d018:trMA.Ode6C11.text	@ltx/gr_gr_cog/tr.d018:trMA.Ode6C11.text
ltx/gr_redirects_goarch/tr.d018:trMA.Ode6C12.incipit	@ltx/gr_gr_cog/tr.d018:trMA.Ode6C12.incipit
ltx/gr_redirects_goarch/tr.d018:trMA.Ode6C12.melody	@ltx/gr_gr_cog/tr.d018:trMA.Ode6C12.melody
ltx/gr_redirects_goarch/tr.d018:trMA.Ode6C12.mode	@ltx/gr_gr_cog/tr.d018:trMA.Ode6C12.mode
ltx/gr_redirects_goarch/tr.d018:trMA.Ode6C12.ode	@ltx/gr_gr_cog/tr.d018:trMA.Ode6C12.ode
ltx/gr_redirects_goarch/tr.d018:trMA.Ode6C12.text	@ltx/gr_gr_cog/tr.d018:trMA.Ode6C12.text
ltx/gr_redirects_goarch/tr.d018:trMA.Ode6C13.incipit	@ltx/gr_gr_cog/tr.d018:trMA.Ode6C13.incipit
ltx/gr_redirects_goarch/tr.d018:trMA.Ode6C13.melody	@ltx/gr_gr_cog/tr.d018:trMA.Ode6C13.melody
ltx/gr_redirects_goarch/tr.d018:trMA.Ode6C13.mode	@ltx/gr_gr_cog/tr.d018:trMA.Ode6C13.mode
ltx/gr_redirects_goarch/tr.d018:trMA.Ode6C13.ode	@ltx/gr_gr_cog/tr.d018:trMA.Ode6C13.ode
ltx/gr_redirects_goarch/tr.d018:trMA.Ode6C13.text	@ltx/gr_gr_cog/tr.d018:trMA.Ode6C13.text
ltx/gr_redirects_goarch/tr.d018:trMA.Ode6C1H.greekmelody	@ltx/gr_gr_cog/tr.d018:trMA.Ode6C1H.greekmelody
ltx/gr_redirects_goarch/tr.d018:trMA.Ode6C1H.incipit	@ltx/gr_gr_cog/tr.d018:trMA.Ode6C1H.incipit
ltx/gr_redirects_goarch/tr.d018:trMA.Ode6C1H.melody	@ltx/gr_gr_cog/tr.d018:trMA.Ode6C1H.melody
ltx/gr_redirects_goarch/tr.d018:trMA.Ode6C1H.mode	@ltx/gr_gr_cog/tr.d018:trMA.Ode6C1H.mode
ltx/gr_redirects_goarch/tr.d018:trMA.Ode6C1H.ode	@ltx/gr_gr_cog/tr.d018:trMA.Ode6C1H.ode
ltx/gr_redirects_goarch/tr.d018:trMA.Ode6C1H.text	@ltx/gr_gr_cog/tr.d018:trMA.Ode6C1H.text
ltx/gr_redirects_goarch/tr.d018:trMA.Ode6C1T.incipit	@ltx/gr_gr_cog/tr.d018:trMA.Ode6C1T.incipit
ltx/gr_redirects_goarch/tr.d018:trMA.Ode6C1T.melody	@ltx/gr_gr_cog/tr.d018:trMA.Ode6C1T.melody
ltx/gr_redirects_goarch/tr.d018:trMA.Ode6C1T.mode	@ltx/gr_gr_cog/tr.d018:trMA.Ode6C1T.mode
ltx/gr_redirects_goarch/tr.d018:trMA.Ode6C1T.ode	@ltx/gr_gr_cog/tr.d018:trMA.Ode6C1T.ode
ltx/gr_redirects_goarch/tr.d018:trMA.Ode6C1T.text	@ltx/gr_gr_cog/tr.d018:trMA.Ode6C1T.text
ltx/gr_redirects_goarch/tr.d018:trMA.Ode7C11.greekmelody	@ltx/gr_gr_cog/tr.d018:trMA.Ode7C11.greekmelody
ltx/gr_redirects_goarch/tr.d018:trMA.Ode7C11.incipit	@ltx/gr_gr_cog/tr.d018:trMA.Ode7C11.incipit
ltx/gr_redirects_goarch/tr.d018:trMA.Ode7C11.melody	@ltx/gr_gr_cog/tr.d018:trMA.Ode7C11.melody
ltx/gr_redirects_goarch/tr.d018:trMA.Ode7C11.mode	@ltx/gr_gr_cog/tr.d018:trMA.Ode7C11.mode
ltx/gr_redirects_goarch/tr.d018:trMA.Ode7C11.ode	@ltx/gr_gr_cog/tr.d018:trMA.Ode7C11.ode
ltx/gr_redirects_goarch/tr.d018:trMA.Ode7C11.text	@ltx/gr_gr_cog/tr.d018:trMA.Ode7C11.text
ltx/gr_redirects_goarch/tr.d018:trMA.Ode7C12.incipit	@ltx/gr_gr_cog/tr.d018:trMA.Ode7C12.incipit
ltx/gr_redirects_goarch/tr.d018:trMA.Ode7C12.melody	@ltx/gr_gr_cog/tr.d018:trMA.Ode7C12.melody
ltx/gr_redirects_goarch/tr.d018:trMA.Ode7C12.mode	@ltx/gr_gr_cog/tr.d018:trMA.Ode7C12.mode
ltx/gr_redirects_goarch/tr.d018:trMA.Ode7C12.ode	@ltx/gr_gr_cog/tr.d018:trMA.Ode7C12.ode
ltx/gr_redirects_goarch/tr.d018:trMA.Ode7C12.text	@ltx/gr_gr_cog/tr.d018:trMA.Ode7C12.text
ltx/gr_redirects_goarch/tr.d018:trMA.Ode7C13.incipit	@ltx/gr_gr_cog/tr.d018:trMA.Ode7C13.incipit
ltx/gr_redirects_goarch/tr.d018:trMA.Ode7C13.melody	@ltx/gr_gr_cog/tr.d018:trMA.Ode7C13.melody
ltx/gr_redirects_goarch/tr.d018:trMA.Ode7C13.mode	@ltx/gr_gr_cog/tr.d018:trMA.Ode7C13.mode
ltx/gr_redirects_goarch/tr.d018:trMA.Ode7C13.ode	@ltx/gr_gr_cog/tr.d018:trMA.Ode7C13.ode
ltx/gr_redirects_goarch/tr.d018:trMA.Ode7C13.text	@ltx/gr_gr_cog/tr.d018:trMA.Ode7C13.text
ltx/gr_redirects_goarch/tr.d018:trMA.Ode7C1T.incipit	@ltx/gr_gr_cog/tr.d018:trMA.Ode7C1T.incipit
ltx/gr_redirects_goarch/tr.d018:trMA.Ode7C1T.melody	@ltx/gr_gr_cog/tr.d018:trMA.Ode7C1T.melody
ltx/gr_redirects_goarch/tr.d018:trMA.Ode7C1T.mode	@ltx/gr_gr_cog/tr.d018:trMA.Ode7C1T.mode
ltx/gr_redirects_goarch/tr.d018:trMA.Ode7C1T.ode	@ltx/gr_gr_cog/tr.d018:trMA.Ode7C1T.ode
ltx/gr_redirects_goarch/tr.d018:trMA.Ode7C1T.text	@ltx/gr_gr_cog/tr.d018:trMA.Ode7C1T.text
ltx/gr_redirects_goarch/tr.d018:trMA.Ode8C11.greekmelody	@ltx/gr_gr_cog/tr.d018:trMA.Ode8C11.greekmelody
ltx/gr_redirects_goarch/tr.d018:trMA.Ode8C11.incipit	@ltx/gr_gr_cog/tr.d018:trMA.Ode8C11.incipit
ltx/gr_redirects_goarch/tr.d018:trMA.Ode8C11.melody	@ltx/gr_gr_cog/tr.d018:trMA.Ode8C11.melody
ltx/gr_redirects_goarch/tr.d018:trMA.Ode8C11.mode	@ltx/gr_gr_cog/tr.d018:trMA.Ode8C11.mode
ltx/gr_redirects_goarch/tr.d018:trMA.Ode8C11.ode	@ltx/gr_gr_cog/tr.d018:trMA.Ode8C11.ode
ltx/gr_redirects_goarch/tr.d018:trMA.Ode8C11.text	@ltx/gr_gr_cog/tr.d018:trMA.Ode8C11.text
ltx/gr_redirects_goarch/tr.d018:trMA.Ode8C12.incipit	@ltx/gr_gr_cog/tr.d018:trMA.Ode8C12.incipit
ltx/gr_redirects_goarch/tr.d018:trMA.Ode8C12.melody	@ltx/gr_gr_cog/tr.d018:trMA.Ode8C12.melody
ltx/gr_redirects_goarch/tr.d018:trMA.Ode8C12.mode	@ltx/gr_gr_cog/tr.d018:trMA.Ode8C12.mode
ltx/gr_redirects_goarch/tr.d018:trMA.Ode8C12.ode	@ltx/gr_gr_cog/tr.d018:trMA.Ode8C12.ode
ltx/gr_redirects_goarch/tr.d018:trMA.Ode8C12.text	@ltx/gr_gr_cog/tr.d018:trMA.Ode8C12.text
ltx/gr_redirects_goarch/tr.d018:trMA.Ode8C13.incipit	@ltx/gr_gr_cog/tr.d018:trMA.Ode8C13.incipit
ltx/gr_redirects_goarch/tr.d018:trMA.Ode8C13.melody	@ltx/gr_gr_cog/tr.d018:trMA.Ode8C13.melody
ltx/gr_redirects_goarch/tr.d018:trMA.Ode8C13.mode	@ltx/gr_gr_cog/tr.d018:trMA.Ode8C13.mode
ltx/gr_redirects_goarch/tr.d018:trMA.Ode8C13.ode	@ltx/gr_gr_cog/tr.d018:trMA.Ode8C13.ode
ltx/gr_redirects_goarch/tr.d018:trMA.Ode8C13.text	@ltx/gr_gr_cog/tr.d018:trMA.Ode8C13.text
ltx/gr_redirects_goarch/tr.d018:trMA.Ode8C1H.greekmelody	@ltx/gr_gr_cog/tr.d018:trMA.Ode8C1H.greekmelody
ltx/gr_redirects_goarch/tr.d018:trMA.Ode8C1H.incipit	@ltx/gr_gr_cog/tr.d018:trMA.Ode8C1H.incipit
ltx/gr_redirects_goarch/tr.d018:trMA.Ode8C1H.melody	@ltx/gr_gr_cog/tr.d018:trMA.Ode8C1H.melody
ltx/gr_redirects_goarch/tr.d018:trMA.Ode8C1H.mode	@ltx/gr_gr_cog/tr.d018:trMA.Ode8C1H.mode
ltx/gr_redirects_goarch/tr.d018:trMA.Ode8C1H.ode	@ltx/gr_gr_cog/tr.d018:trMA.Ode8C1H.ode
ltx/gr_redirects_goarch/tr.d018:trMA.Ode8C1H.text	@ltx/gr_gr_cog/tr.d018:trMA.Ode8C1H.text
ltx/gr_redirects_goarch/tr.d018:trMA.Ode8C1T.incipit	@ltx/gr_gr_cog/tr.d018:trMA.Ode8C1T.incipit
ltx/gr_redirects_goarch/tr.d018:trMA.Ode8C1T.melody	@ltx/gr_gr_cog/tr.d018:trMA.Ode8C1T.melody
ltx/gr_redirects_goarch/tr.d018:trMA.Ode8C1T.mode	@ltx/gr_gr_cog/tr.d018:trMA.Ode8C1T.mode
ltx/gr_redirects_goarch/tr.d018:trMA.Ode8C1T.ode	@ltx/gr_gr_cog/tr.d018:trMA.Ode8C1T.ode
ltx/gr_redirects_goarch/tr.d018:trMA.Ode8C1T.text	@ltx/gr_gr_cog/tr.d018:trMA.Ode8C1T.text
ltx/gr_redirects_goarch/tr.d018:trMA.Ode8C21.greekmelody	@ltx/gr_gr_cog/tr.d018:trMA.Ode8C21.greekmelody
ltx/gr_redirects_goarch/tr.d018:trMA.Ode8C21.incipit	@ltx/gr_gr_cog/tr.d018:trMA.Ode8C21.incipit
ltx/gr_redirects_goarch/tr.d018:trMA.Ode8C21.melody	@ltx/gr_gr_cog/tr.d018:trMA.Ode8C21.melody
ltx/gr_redirects_goarch/tr.d018:trMA.Ode8C21.mode	@ltx/gr_gr_cog/tr.d018:trMA.Ode8C21.mode
ltx/gr_redirects_goarch/tr.d018:trMA.Ode8C21.ode	@ltx/gr_gr_cog/tr.d018:trMA.Ode8C21.ode
ltx/gr_redirects_goarch/tr.d018:trMA.Ode8C21.text	@ltx/gr_gr_cog/tr.d018:trMA.Ode8C21.text
ltx/gr_redirects_goarch/tr.d018:trMA.Ode8C22.incipit	@ltx/gr_gr_cog/tr.d018:trMA.Ode8C22.incipit
ltx/gr_redirects_goarch/tr.d018:trMA.Ode8C22.melody	@ltx/gr_gr_cog/tr.d018:trMA.Ode8C22.melody
ltx/gr_redirects_goarch/tr.d018:trMA.Ode8C22.mode	@ltx/gr_gr_cog/tr.d018:trMA.Ode8C22.mode
ltx/gr_redirects_goarch/tr.d018:trMA.Ode8C22.ode	@ltx/gr_gr_cog/tr.d018:trMA.Ode8C22.ode
ltx/gr_redirects_goarch/tr.d018:trMA.Ode8C22.text	@ltx/gr_gr_cog/tr.d018:trMA.Ode8C22.text
ltx/gr_redirects_goarch/tr.d018:trMA.Ode8C23.incipit	@ltx/gr_gr_cog/tr.d018:trMA.Ode8C23.incipit
ltx/gr_redirects_goarch/tr.d018:trMA.Ode8C23.melody	@ltx/gr_gr_cog/tr.d018:trMA.Ode8C23.melody
ltx/gr_redirects_goarch/tr.d018:trMA.Ode8C23.mode	@ltx/gr_gr_cog/tr.d018:trMA.Ode8C23.mode
ltx/gr_redirects_goarch/tr.d018:trMA.Ode8C23.ode	@ltx/gr_gr_cog/tr.d018:trMA.Ode8C23.ode
ltx/gr_redirects_goarch/tr.d018:trMA.Ode8C23.text	@ltx/gr_gr_cog/tr.d018:trMA.Ode8C23.text
ltx/gr_redirects_goarch/tr.d018:trMA.Ode8C24.incipit	@ltx/gr_gr_cog/tr.d018:trMA.Ode8C24.incipit
ltx/gr_redirects_goarch/tr.d018:trMA.Ode8C24.melody	@ltx/gr_gr_cog/tr.d018:trMA.Ode8C24.melody
ltx/gr_redirects_goarch/tr.d018:trMA.Ode8C24.mode	@ltx/gr_gr_cog/tr.d018:trMA.Ode8C24.mode
ltx/gr_redirects_goarch/tr.d018:trMA.Ode8C24.ode	@ltx/gr_gr_cog/tr.d018:trMA.Ode8C24.ode
ltx/gr_redirects_goarch/tr.d018:trMA.Ode8C24.text	@ltx/gr_gr_cog/tr.d018:trMA.Ode8C24.text
ltx/gr_redirects_goarch/tr.d018:trMA.Ode8C25.incipit	@ltx/gr_gr_cog/tr.d018:trMA.Ode8C25.incipit
ltx/gr_redirects_goarch/tr.d018:trMA.Ode8C25.melody	@ltx/gr_gr_cog/tr.d018:trMA.Ode8C25.melody
ltx/gr_redirects_goarch/tr.d018:trMA.Ode8C25.mode	@ltx/gr_gr_cog/tr.d018:trMA.Ode8C25.mode
ltx/gr_redirects_goarch/tr.d018:trMA.Ode8C25.ode	@ltx/gr_gr_cog/tr.d018:trMA.Ode8C25.ode
ltx/gr_redirects_goarch/tr.d018:trMA.Ode8C25.text	@ltx/gr_gr_cog/tr.d018:trMA.Ode8C25.text
ltx/gr_redirects_goarch/tr.d018:trMA.Ode8C26.incipit	@ltx/gr_gr_cog/tr.d018:trMA.Ode8C26.incipit
ltx/gr_redirects_goarch/tr.d018:trMA.Ode8C26.melody	@ltx/gr_gr_cog/tr.d018:trMA.Ode8C26.melody
ltx/gr_redirects_goarch/tr.d018:trMA.Ode8C26.mode	@ltx/gr_gr_cog/tr.d018:trMA.Ode8C26.mode
ltx/gr_redirects_goarch/tr.d018:trMA.Ode8C26.ode	@ltx/gr_gr_cog/tr.d018:trMA.Ode8C26.ode
ltx/gr_redirects_goarch/tr.d018:trMA.Ode8C26.text	@ltx/gr_gr_cog/tr.d018:trMA.Ode8C26.text
ltx/gr_redirects_goarch/tr.d018:trMA.Ode8C2T.incipit	@ltx/gr_gr_cog/tr.d018:trMA.Ode8C2T.incipit
ltx/gr_redirects_goarch/tr.d018:trMA.Ode8C2T.melody	@ltx/gr_gr_cog/tr.d018:trMA.Ode8C2T.melody
ltx/gr_redirects_goarch/tr.d018:trMA.Ode8C2T.mode	@ltx/gr_gr_cog/tr.d018:trMA.Ode8C2T.mode
ltx/gr_redirects_goarch/tr.d018:trMA.Ode8C2T.ode	@ltx/gr_gr_cog/tr.d018:trMA.Ode8C2T.ode
ltx/gr_redirects_goarch/tr.d018:trMA.Ode8C2T.text	@ltx/gr_gr_cog/tr.d018:trMA.Ode8C2T.text
ltx/gr_redirects_goarch/tr.d018:trMA.Ode8C31.greekmelody	@ltx/gr_gr_cog/tr.d018:trMA.Ode8C31.greekmelody
ltx/gr_redirects_goarch/tr.d018:trMA.Ode8C31.incipit	@ltx/gr_gr_cog/tr.d018:trMA.Ode8C31.incipit
ltx/gr_redirects_goarch/tr.d018:trMA.Ode8C31.melody	@ltx/gr_gr_cog/tr.d018:trMA.Ode8C31.melody
ltx/gr_redirects_goarch/tr.d018:trMA.Ode8C31.mode	@ltx/gr_gr_cog/tr.d018:trMA.Ode8C31.mode
ltx/gr_redirects_goarch/tr.d018:trMA.Ode8C31.ode	@ltx/gr_gr_cog/tr.d018:trMA.Ode8C31.ode
ltx/gr_redirects_goarch/tr.d018:trMA.Ode8C31.text	@ltx/gr_gr_cog/tr.d018:trMA.Ode8C31.text
ltx/gr_redirects_goarch/tr.d018:trMA.Ode8C32.incipit	@ltx/gr_gr_cog/tr.d018:trMA.Ode8C32.incipit
ltx/gr_redirects_goarch/tr.d018:trMA.Ode8C32.melody	@ltx/gr_gr_cog/tr.d018:trMA.Ode8C32.melody
ltx/gr_redirects_goarch/tr.d018:trMA.Ode8C32.mode	@ltx/gr_gr_cog/tr.d018:trMA.Ode8C32.mode
ltx/gr_redirects_goarch/tr.d018:trMA.Ode8C32.ode	@ltx/gr_gr_cog/tr.d018:trMA.Ode8C32.ode
ltx/gr_redirects_goarch/tr.d018:trMA.Ode8C32.text	@ltx/gr_gr_cog/tr.d018:trMA.Ode8C32.text
ltx/gr_redirects_goarch/tr.d018:trMA.Ode8C3A1.incipit	@ltx/gr_gr_cog/tr.d018:trMA.Ode8C3A1.incipit
ltx/gr_redirects_goarch/tr.d018:trMA.Ode8C3A1.melody	@ltx/gr_gr_cog/tr.d018:trMA.Ode8C3A1.melody
ltx/gr_redirects_goarch/tr.d018:trMA.Ode8C3A1.mode	@ltx/gr_gr_cog/tr.d018:trMA.Ode8C3A1.mode
ltx/gr_redirects_goarch/tr.d018:trMA.Ode8C3A1.ode	@ltx/gr_gr_cog/tr.d018:trMA.Ode8C3A1.ode
ltx/gr_redirects_goarch/tr.d018:trMA.Ode8C3A1.text	@ltx/gr_gr_cog/tr.d018:trMA.Ode8C3A1.text
ltx/gr_redirects_goarch/tr.d018:trMA.Ode8C3H.greekmelody	@ltx/gr_gr_cog/tr.d018:trMA.Ode8C3H.greekmelody
ltx/gr_redirects_goarch/tr.d018:trMA.Ode8C3H.incipit	@ltx/gr_gr_cog/tr.d018:trMA.Ode8C3H.incipit
ltx/gr_redirects_goarch/tr.d018:trMA.Ode8C3H.melody	@ltx/gr_gr_cog/tr.d018:trMA.Ode8C3H.melody
ltx/gr_redirects_goarch/tr.d018:trMA.Ode8C3H.mode	@ltx/gr_gr_cog/tr.d018:trMA.Ode8C3H.mode
ltx/gr_redirects_goarch/tr.d018:trMA.Ode8C3H.ode	@ltx/gr_gr_cog/tr.d018:trMA.Ode8C3H.ode
ltx/gr_redirects_goarch/tr.d018:trMA.Ode8C3H.text	@ltx/gr_gr_cog/tr.d018:trMA.Ode8C3H.text
ltx/gr_redirects_goarch/tr.d018:trMA.Ode8C3T.incipit	@ltx/gr_gr_cog/tr.d018:trMA.Ode8C3T.incipit
ltx/gr_redirects_goarch/tr.d018:trMA.Ode8C3T.melody	@ltx/gr_gr_cog/tr.d018:trMA.Ode8C3T.melody
ltx/gr_redirects_goarch/tr.d018:trMA.Ode8C3T.mode	@ltx/gr_gr_cog/tr.d018:trMA.Ode8C3T.mode
ltx/gr_redirects_goarch/tr.d018:trMA.Ode8C3T.ode	@ltx/gr_gr_cog/tr.d018:trMA.Ode8C3T.ode
ltx/gr_redirects_goarch/tr.d018:trMA.Ode8C3T.text	@ltx/gr_gr_cog/tr.d018:trMA.Ode8C3T.text
ltx/gr_redirects_goarch/tr.d018:trMA.Ode8C3Tr.incipit	@ltx/gr_gr_cog/tr.d018:trMA.Ode8C3Tr.incipit
ltx/gr_redirects_goarch/tr.d018:trMA.Ode8C3Tr.melody	@ltx/gr_gr_cog/tr.d018:trMA.Ode8C3Tr.melody
ltx/gr_redirects_goarch/tr.d018:trMA.Ode8C3Tr.mode	@ltx/gr_gr_cog/tr.d018:trMA.Ode8C3Tr.mode
ltx/gr_redirects_goarch/tr.d018:trMA.Ode8C3Tr.ode	@ltx/gr_gr_cog/tr.d018:trMA.Ode8C3Tr.ode
ltx/gr_redirects_goarch/tr.d018:trMA.Ode8C3Tr.text	@ltx/gr_gr_cog/tr.d018:trMA.Ode8C3Tr.text
ltx/gr_redirects_goarch/tr.d018:trMA.Ode9C11.greekmelody	@ltx/gr_gr_cog/tr.d018:trMA.Ode9C11.greekmelody
ltx/gr_redirects_goarch/tr.d018:trMA.Ode9C11.incipit	@ltx/gr_gr_cog/tr.d018:trMA.Ode9C11.incipit
ltx/gr_redirects_goarch/tr.d018:trMA.Ode9C11.melody	@ltx/gr_gr_cog/tr.d018:trMA.Ode9C11.melody
ltx/gr_redirects_goarch/tr.d018:trMA.Ode9C11.mode	@ltx/gr_gr_cog/tr.d018:trMA.Ode9C11.mode
ltx/gr_redirects_goarch/tr.d018:trMA.Ode9C11.ode	@ltx/gr_gr_cog/tr.d018:trMA.Ode9C11.ode
ltx/gr_redirects_goarch/tr.d018:trMA.Ode9C11.text	@ltx/gr_gr_cog/tr.d018:trMA.Ode9C11.text
ltx/gr_redirects_goarch/tr.d018:trMA.Ode9C12.incipit	@ltx/gr_gr_cog/tr.d018:trMA.Ode9C12.incipit
ltx/gr_redirects_goarch/tr.d018:trMA.Ode9C12.melody	@ltx/gr_gr_cog/tr.d018:trMA.Ode9C12.melody
ltx/gr_redirects_goarch/tr.d018:trMA.Ode9C12.mode	@ltx/gr_gr_cog/tr.d018:trMA.Ode9C12.mode
ltx/gr_redirects_goarch/tr.d018:trMA.Ode9C12.ode	@ltx/gr_gr_cog/tr.d018:trMA.Ode9C12.ode
ltx/gr_redirects_goarch/tr.d018:trMA.Ode9C12.text	@ltx/gr_gr_cog/tr.d018:trMA.Ode9C12.text
ltx/gr_redirects_goarch/tr.d018:trMA.Ode9C13.incipit	@ltx/gr_gr_cog/tr.d018:trMA.Ode9C13.incipit
ltx/gr_redirects_goarch/tr.d018:trMA.Ode9C13.melody	@ltx/gr_gr_cog/tr.d018:trMA.Ode9C13.melody
ltx/gr_redirects_goarch/tr.d018:trMA.Ode9C13.mode	@ltx/gr_gr_cog/tr.d018:trMA.Ode9C13.mode
ltx/gr_redirects_goarch/tr.d018:trMA.Ode9C13.ode	@ltx/gr_gr_cog/tr.d018:trMA.Ode9C13.ode
ltx/gr_redirects_goarch/tr.d018:trMA.Ode9C13.text	@ltx/gr_gr_cog/tr.d018:trMA.Ode9C13.text
ltx/gr_redirects_goarch/tr.d018:trMA.Ode9C1H.greekmelody	@ltx/gr_gr_cog/tr.d018:trMA.Ode9C1H.greekmelody
ltx/gr_redirects_goarch/tr.d018:trMA.Ode9C1H.incipit	@ltx/gr_gr_cog/tr.d018:trMA.Ode9C1H.incipit
ltx/gr_redirects_goarch/tr.d018:trMA.Ode9C1H.melody	@ltx/gr_gr_cog/tr.d018:trMA.Ode9C1H.melody
ltx/gr_redirects_goarch/tr.d018:trMA.Ode9C1H.mode	@ltx/gr_gr_cog/tr.d018:trMA.Ode9C1H.mode
ltx/gr_redirects_goarch/tr.d018:trMA.Ode9C1H.ode	@ltx/gr_gr_cog/tr.d018:trMA.Ode9C1H.ode
ltx/gr_redirects_goarch/tr.d018:trMA.Ode9C1H.text	@ltx/gr_gr_cog/tr.d018:trMA.Ode9C1H.text
ltx/gr_redirects_goarch/tr.d018:trMA.Ode9C1T.incipit	@ltx/gr_gr_cog/tr.d018:trMA.Ode9C1T.incipit
ltx/gr_redirects_goarch/tr.d018:trMA.Ode9C1T.melody	@ltx/gr_gr_cog/tr.d018:trMA.Ode9C1T.melody
ltx/gr_redirects_goarch/tr.d018:trMA.Ode9C1T.mode	@ltx/gr_gr_cog/tr.d018:trMA.Ode9C1T.mode
ltx/gr_redirects_goarch/tr.d018:trMA.Ode9C1T.ode	@ltx/gr_gr_cog/tr.d018:trMA.Ode9C1T.ode
ltx/gr_redirects_goarch/tr.d018:trMA.Ode9C1T.text	@ltx/gr_gr_cog/tr.d018:trMA.Ode9C1T.text
ltx/gr_redirects_goarch/tr.d018:trMA.Ode9C21.greekmelody	@ltx/gr_gr_cog/tr.d018:trMA.Ode9C21.greekmelody
ltx/gr_redirects_goarch/tr.d018:trMA.Ode9C21.incipit	@ltx/gr_gr_cog/tr.d018:trMA.Ode9C21.incipit
ltx/gr_redirects_goarch/tr.d018:trMA.Ode9C21.melody	@ltx/gr_gr_cog/tr.d018:trMA.Ode9C21.melody
ltx/gr_redirects_goarch/tr.d018:trMA.Ode9C21.mode	@ltx/gr_gr_cog/tr.d018:trMA.Ode9C21.mode
ltx/gr_redirects_goarch/tr.d018:trMA.Ode9C21.ode	@ltx/gr_gr_cog/tr.d018:trMA.Ode9C21.ode
ltx/gr_redirects_goarch/tr.d018:trMA.Ode9C21.text	@ltx/gr_gr_cog/tr.d018:trMA.Ode9C21.text
ltx/gr_redirects_goarch/tr.d018:trMA.Ode9C22.incipit	@ltx/gr_gr_cog/tr.d018:trMA.Ode9C22.incipit
ltx/gr_redirects_goarch/tr.d018:trMA.Ode9C22.melody	@ltx/gr_gr_cog/tr.d018:trMA.Ode9C22.melody
ltx/gr_redirects_goarch/tr.d018:trMA.Ode9C22.mode	@ltx/gr_gr_cog/tr.d018:trMA.Ode9C22.mode
ltx/gr_redirects_goarch/tr.d018:trMA.Ode9C22.ode	@ltx/gr_gr_cog/tr.d018:trMA.Ode9C22.ode
ltx/gr_redirects_goarch/tr.d018:trMA.Ode9C22.text	@ltx/gr_gr_cog/tr.d018:trMA.Ode9C22.text
ltx/gr_redirects_goarch/tr.d018:trMA.Ode9C23.incipit	@ltx/gr_gr_cog/tr.d018:trMA.Ode9C23.incipit
ltx/gr_redirects_goarch/tr.d018:trMA.Ode9C23.melody	@ltx/gr_gr_cog/tr.d018:trMA.Ode9C23.melody
ltx/gr_redirects_goarch/tr.d018:trMA.Ode9C23.mode	@ltx/gr_gr_cog/tr.d018:trMA.Ode9C23.mode
ltx/gr_redirects_goarch/tr.d018:trMA.Ode9C23.ode	@ltx/gr_gr_cog/tr.d018:trMA.Ode9C23.ode
ltx/gr_redirects_goarch/tr.d018:trMA.Ode9C23.text	@ltx/gr_gr_cog/tr.d018:trMA.Ode9C23.text
ltx/gr_redirects_goarch/tr.d018:trMA.Ode9C24.incipit	@ltx/gr_gr_cog/tr.d018:trMA.Ode9C24.incipit
ltx/gr_redirects_goarch/tr.d018:trMA.Ode9C24.melody	@ltx/gr_gr_cog/tr.d018:trMA.Ode9C24.melody
ltx/gr_redirects_goarch/tr.d018:trMA.Ode9C24.mode	@ltx/gr_gr_cog/tr.d018:trMA.Ode9C24.mode
ltx/gr_redirects_goarch/tr.d018:trMA.Ode9C24.ode	@ltx/gr_gr_cog/tr.d018:trMA.Ode9C24.ode
ltx/gr_redirects_goarch/tr.d018:trMA.Ode9C24.text	@ltx/gr_gr_cog/tr.d018:trMA.Ode9C24.text
ltx/gr_redirects_goarch/tr.d018:trMA.Ode9C25.incipit	@ltx/gr_gr_cog/tr.d018:trMA.Ode9C25.incipit
ltx/gr_redirects_goarch/tr.d018:trMA.Ode9C25.melody	@ltx/gr_gr_cog/tr.d018:trMA.Ode9C25.melody
ltx/gr_redirects_goarch/tr.d018:trMA.Ode9C25.mode	@ltx/gr_gr_cog/tr.d018:trMA.Ode9C25.mode
ltx/gr_redirects_goarch/tr.d018:trMA.Ode9C25.ode	@ltx/gr_gr_cog/tr.d018:trMA.Ode9C25.ode
ltx/gr_redirects_goarch/tr.d018:trMA.Ode9C25.text	@ltx/gr_gr_cog/tr.d018:trMA.Ode9C25.text
ltx/gr_redirects_goarch/tr.d018:trMA.Ode9C2T.incipit	@ltx/gr_gr_cog/tr.d018:trMA.Ode9C2T.incipit
ltx/gr_redirects_goarch/tr.d018:trMA.Ode9C2T.melody	@ltx/gr_gr_cog/tr.d018:trMA.Ode9C2T.melody
ltx/gr_redirects_goarch/tr.d018:trMA.Ode9C2T.mode	@ltx/gr_gr_cog/tr.d018:trMA.Ode9C2T.mode
ltx/gr_redirects_goarch/tr.d018:trMA.Ode9C2T.ode	@ltx/gr_gr_cog/tr.d018:trMA.Ode9C2T.ode
ltx/gr_redirects_goarch/tr.d018:trMA.Ode9C2T.text	@ltx/gr_gr_cog/tr.d018:trMA.Ode9C2T.text
ltx/gr_redirects_goarch/tr.d018:trMA.Ode9C31.greekmelody	@ltx/gr_gr_cog/tr.d018:trMA.Ode9C31.greekmelody
ltx/gr_redirects_goarch/tr.d018:trMA.Ode9C31.incipit	@ltx/gr_gr_cog/tr.d018:trMA.Ode9C31.incipit
ltx/gr_redirects_goarch/tr.d018:trMA.Ode9C31.melody	@ltx/gr_gr_cog/tr.d018:trMA.Ode9C31.melody
ltx/gr_redirects_goarch/tr.d018:trMA.Ode9C31.mode	@ltx/gr_gr_cog/tr.d018:trMA.Ode9C31.mode
ltx/gr_redirects_goarch/tr.d018:trMA.Ode9C31.ode	@ltx/gr_gr_cog/tr.d018:trMA.Ode9C31.ode
ltx/gr_redirects_goarch/tr.d018:trMA.Ode9C31.text	@ltx/gr_gr_cog/tr.d018:trMA.Ode9C31.text
ltx/gr_redirects_goarch/tr.d018:trMA.Ode9C32.incipit	@ltx/gr_gr_cog/tr.d018:trMA.Ode9C32.incipit
ltx/gr_redirects_goarch/tr.d018:trMA.Ode9C32.melody	@ltx/gr_gr_cog/tr.d018:trMA.Ode9C32.melody
ltx/gr_redirects_goarch/tr.d018:trMA.Ode9C32.mode	@ltx/gr_gr_cog/tr.d018:trMA.Ode9C32.mode
ltx/gr_redirects_goarch/tr.d018:trMA.Ode9C32.ode	@ltx/gr_gr_cog/tr.d018:trMA.Ode9C32.ode
ltx/gr_redirects_goarch/tr.d018:trMA.Ode9C32.text	@ltx/gr_gr_cog/tr.d018:trMA.Ode9C32.text
ltx/gr_redirects_goarch/tr.d018:trMA.Ode9C3A1.incipit	@ltx/gr_gr_cog/tr.d018:trMA.Ode9C3A1.incipit
ltx/gr_redirects_goarch/tr.d018:trMA.Ode9C3A1.melody	@ltx/gr_gr_cog/tr.d018:trMA.Ode9C3A1.melody
ltx/gr_redirects_goarch/tr.d018:trMA.Ode9C3A1.mode	@ltx/gr_gr_cog/tr.d018:trMA.Ode9C3A1.mode
ltx/gr_redirects_goarch/tr.d018:trMA.Ode9C3A1.ode	@ltx/gr_gr_cog/tr.d018:trMA.Ode9C3A1.ode
ltx/gr_redirects_goarch/tr.d018:trMA.Ode9C3A1.text	@ltx/gr_gr_cog/tr.d018:trMA.Ode9C3A1.text
ltx/gr_redirects_goarch/tr.d018:trMA.Ode9C3H.greekmelody	@ltx/gr_gr_cog/tr.d018:trMA.Ode9C3H.greekmelody
ltx/gr_redirects_goarch/tr.d018:trMA.Ode9C3H.incipit	@ltx/gr_gr_cog/tr.d018:trMA.Ode9C3H.incipit
ltx/gr_redirects_goarch/tr.d018:trMA.Ode9C3H.melody	@ltx/gr_gr_cog/tr.d018:trMA.Ode9C3H.melody
ltx/gr_redirects_goarch/tr.d018:trMA.Ode9C3H.mode	@ltx/gr_gr_cog/tr.d018:trMA.Ode9C3H.mode
ltx/gr_redirects_goarch/tr.d018:trMA.Ode9C3H.ode	@ltx/gr_gr_cog/tr.d018:trMA.Ode9C3H.ode
ltx/gr_redirects_goarch/tr.d018:trMA.Ode9C3H.text	@ltx/gr_gr_cog/tr.d018:trMA.Ode9C3H.text
ltx/gr_redirects_goarch/tr.d018:trMA.Ode9C3T.incipit	@ltx/gr_gr_cog/tr.d018:trMA.Ode9C3T.incipit
ltx/gr_redirects_goarch/tr.d018:trMA.Ode9C3T.melody	@ltx/gr_gr_cog/tr.d018:trMA.Ode9C3T.melody
ltx/gr_redirects_goarch/tr.d018:trMA.Ode9C3T.mode	@ltx/gr_gr_cog/tr.d018:trMA.Ode9C3T.mode
ltx/gr_redirects_goarch/tr.d018:trMA.Ode9C3T.ode	@ltx/gr_gr_cog/tr.d018:trMA.Ode9C3T.ode
ltx/gr_redirects_goarch/tr.d018:trMA.Ode9C3T.text	@ltx/gr_gr_cog/tr.d018:trMA.Ode9C3T.text
ltx/gr_redirects_goarch/tr.d018:trMA.Ode9C3Tr.incipit	@ltx/gr_gr_cog/tr.d018:trMA.Ode9C3Tr.incipit
ltx/gr_redirects_goarch/tr.d018:trMA.Ode9C3Tr.melody	@ltx/gr_gr_cog/tr.d018:trMA.Ode9C3Tr.melody
ltx/gr_redirects_goarch/tr.d018:trMA.Ode9C3Tr.mode	@ltx/gr_gr_cog/tr.d018:trMA.Ode9C3Tr.mode
ltx/gr_redirects_goarch/tr.d018:trMA.Ode9C3Tr.ode	@ltx/gr_gr_cog/tr.d018:trMA.Ode9C3Tr.ode
ltx/gr_redirects_goarch/tr.d018:trMA.Ode9C3Tr.text	@ltx/gr_gr_cog/tr.d018:trMA.Ode9C3Tr.text
ltx/gr_redirects_goarch/tr.d018:trTE.Troparion.incipit	@ltx/gr_gr_cog/tr.d018:trTE.Troparion.incipit
ltx/gr_redirects_goarch/tr.d018:trTE.Troparion.melody	@ltx/gr_gr_cog/tr.d018:trTE.Troparion.melody
ltx/gr_redirects_goarch/tr.d018:trTE.Troparion.mode	@ltx/gr_gr_cog/tr.d018:trTE.Troparion.mode
ltx/gr_redirects_goarch/tr.d018:trTE.Troparion.text	@ltx/gr_gr_cog/tr.d018:trTE.Troparion.text
ltx/gr_redirects_goarch/tr.d018:trTE.Troparion2.incipit	@ltx/gr_gr_cog/tr.d018:trTE.Troparion2.incipit
ltx/gr_redirects_goarch/tr.d018:trTE.Troparion2.text	@ltx/gr_gr_cog/tr.d018:trTE.Troparion2.text
ltx/gr_redirects_goarch/tr.d018:trVE.AposIdiomelon1.incipit	@ltx/gr_gr_cog/tr.d018:trVE.AposIdiomelon1.incipit
ltx/gr_redirects_goarch/tr.d018:trVE.AposIdiomelon1.melody	@ltx/gr_gr_cog/tr.d018:trVE.AposIdiomelon1.melody
ltx/gr_redirects_goarch/tr.d018:trVE.AposIdiomelon1.mode	@ltx/gr_gr_cog/tr.d018:trVE.AposIdiomelon1.mode
ltx/gr_redirects_goarch/tr.d018:trVE.AposIdiomelon1.text	@ltx/gr_gr_cog/tr.d018:trVE.AposIdiomelon1.text
ltx/gr_redirects_goarch/tr.d018:trVE.AposMartyric.incipit	@ltx/gr_gr_cog/tr.d018:trVE.AposMartyric.incipit
ltx/gr_redirects_goarch/tr.d018:trVE.AposMartyric.melody	@ltx/gr_gr_cog/tr.d018:trVE.AposMartyric.melody
ltx/gr_redirects_goarch/tr.d018:trVE.AposMartyric.mode	@ltx/gr_gr_cog/tr.d018:trVE.AposMartyric.mode
ltx/gr_redirects_goarch/tr.d018:trVE.AposMartyric.text	@ltx/gr_gr_cog/tr.d018:trVE.AposMartyric.text
ltx/gr_redirects_goarch/tr.d018:trVE.AposTheotokion.greekmelody	@ltx/gr_gr_cog/tr.d018:trVE.AposTheotokion.greekmelody
ltx/gr_redirects_goarch/tr.d018:trVE.AposTheotokion.incipit	@ltx/gr_gr_cog/tr.d018:trVE.AposTheotokion.incipit
ltx/gr_redirects_goarch/tr.d018:trVE.AposTheotokion.melody	@ltx/gr_gr_cog/tr.d018:trVE.AposTheotokion.melody
ltx/gr_redirects_goarch/tr.d018:trVE.AposTheotokion.mode	@ltx/gr_gr_cog/tr.d018:trVE.AposTheotokion.mode
ltx/gr_redirects_goarch/tr.d018:trVE.AposTheotokion.text	@ltx/gr_gr_cog/tr.d018:trVE.AposTheotokion.text
