ltx/gr_redirects_goarch/da.d6:daCommemoration.text	@ltx/gr_gr_cog/da.d6:daCommemoration.text
ltx/gr_redirects_goarch/da.d6:daDay.text	@ltx/gr_gr_cog/da.d6:daDay.text
ltx/gr_redirects_goarch/da.d6:daForDay.text	@ltx/gr_gr_cog/da.d6:daForDay.text
ltx/gr_redirects_goarch/da.d6:daLI.MM.CommunionHymn.text	@ltx/gr_gr_cog/da.d6:daLI.MM.CommunionHymn.text
ltx/gr_redirects_goarch/da.d6:daLI.MM.CommunionHymnAlt.text	@ltx/gr_gr_cog/da.d6:daLI.MM.CommunionHymnAlt.text
ltx/gr_redirects_goarch/da.d6:daMA.ExapTheotokion2.greekmelody	@ltx/gr_gr_cog/da.d6:daMA.ExapTheotokion2.greekmelody
ltx/gr_redirects_goarch/da.d6:daMA.ExapTheotokion2.incipit	@ltx/gr_gr_cog/da.d6:daMA.ExapTheotokion2.incipit
ltx/gr_redirects_goarch/da.d6:daMA.ExapTheotokion2.melody	@ltx/gr_gr_cog/da.d6:daMA.ExapTheotokion2.melody
ltx/gr_redirects_goarch/da.d6:daMA.ExapTheotokion2.mode	@ltx/gr_gr_cog/da.d6:daMA.ExapTheotokion2.mode
ltx/gr_redirects_goarch/da.d6:daMA.ExapTheotokion2.text	@ltx/gr_gr_cog/da.d6:daMA.ExapTheotokion2.text
ltx/gr_redirects_goarch/da.d6:daMA.Exaposteilarion1.greekmelody	@ltx/gr_gr_cog/da.d6:daMA.Exaposteilarion1.greekmelody
ltx/gr_redirects_goarch/da.d6:daMA.Exaposteilarion1.incipit	@ltx/gr_gr_cog/da.d6:daMA.Exaposteilarion1.incipit
ltx/gr_redirects_goarch/da.d6:daMA.Exaposteilarion1.melody	@ltx/gr_gr_cog/da.d6:daMA.Exaposteilarion1.melody
ltx/gr_redirects_goarch/da.d6:daMA.Exaposteilarion1.mode	@ltx/gr_gr_cog/da.d6:daMA.Exaposteilarion1.mode
ltx/gr_redirects_goarch/da.d6:daMA.Exaposteilarion1.text	@ltx/gr_gr_cog/da.d6:daMA.Exaposteilarion1.text
ltx/gr_redirects_goarch/da.d6:daMA.Exaposteilarion2.greekmelody	@ltx/gr_gr_cog/da.d6:daMA.Exaposteilarion2.greekmelody
ltx/gr_redirects_goarch/da.d6:daMA.Exaposteilarion2.incipit	@ltx/gr_gr_cog/da.d6:daMA.Exaposteilarion2.incipit
ltx/gr_redirects_goarch/da.d6:daMA.Exaposteilarion2.melody	@ltx/gr_gr_cog/da.d6:daMA.Exaposteilarion2.melody
ltx/gr_redirects_goarch/da.d6:daMA.Exaposteilarion2.mode	@ltx/gr_gr_cog/da.d6:daMA.Exaposteilarion2.mode
ltx/gr_redirects_goarch/da.d6:daMA.Exaposteilarion2.text	@ltx/gr_gr_cog/da.d6:daMA.Exaposteilarion2.text
ltx/gr_redirects_goarch/da.d6:daMA.Photagogic1Beginning.text	@ltx/gr_gr_cog/da.d6:daMA.Photagogic1Beginning.text
ltx/gr_redirects_goarch/da.d6:daMA.Photagogic1Ending.text	@ltx/gr_gr_cog/da.d6:daMA.Photagogic1Ending.text
ltx/gr_redirects_goarch/da.d6:daMA.Photagogic2Beginning.text	@ltx/gr_gr_cog/da.d6:daMA.Photagogic2Beginning.text
ltx/gr_redirects_goarch/da.d6:daMA.Photagogic2Ending.text	@ltx/gr_gr_cog/da.d6:daMA.Photagogic2Ending.text
ltx/gr_redirects_goarch/da.d6:daMA.Photagogic3Beginning.text	@ltx/gr_gr_cog/da.d6:daMA.Photagogic3Beginning.text
ltx/gr_redirects_goarch/da.d6:daMA.Photagogic3Ending.text	@ltx/gr_gr_cog/da.d6:daMA.Photagogic3Ending.text
ltx/gr_redirects_goarch/da.d6:daMA.Triadic1Ending.text	@ltx/gr_gr_cog/da.d6:daMA.Triadic1Ending.text
ltx/gr_redirects_goarch/da.d6:daMA.Triadic2Ending.text	@ltx/gr_gr_cog/da.d6:daMA.Triadic2Ending.text
ltx/gr_redirects_goarch/da.d6:daMA.Triadic3Ending.text	@ltx/gr_gr_cog/da.d6:daMA.Triadic3Ending.text
ltx/gr_redirects_goarch/da.d6:daOnDay.text	@ltx/gr_gr_cog/da.d6:daOnDay.text
ltx/gr_redirects_goarch/da.d6:daVE.ApolTheotokion.incipit	@ltx/gr_gr_cog/da.d6:daVE.ApolTheotokion.incipit
ltx/gr_redirects_goarch/da.d6:daVE.ApolTheotokion.melody	@ltx/gr_gr_cog/da.d6:daVE.ApolTheotokion.melody
ltx/gr_redirects_goarch/da.d6:daVE.ApolTheotokion.mode	@ltx/gr_gr_cog/da.d6:daVE.ApolTheotokion.mode
ltx/gr_redirects_goarch/da.d6:daVE.ApolTheotokion.text	@ltx/gr_gr_cog/da.d6:daVE.ApolTheotokion.text
ltx/gr_redirects_goarch/da.d6:daVE.Apolytikion1.incipit	@ltx/gr_gr_cog/da.d6:daVE.Apolytikion1.incipit
ltx/gr_redirects_goarch/da.d6:daVE.Apolytikion1.melody	@ltx/gr_gr_cog/da.d6:daVE.Apolytikion1.melody
ltx/gr_redirects_goarch/da.d6:daVE.Apolytikion1.mode	@ltx/gr_gr_cog/da.d6:daVE.Apolytikion1.mode
ltx/gr_redirects_goarch/da.d6:daVE.Apolytikion1.text	@ltx/gr_gr_cog/da.d6:daVE.Apolytikion1.text
ltx/gr_redirects_goarch/da.d6:daVE.OnTheDayBefore.text	@ltx/gr_gr_cog/da.d6:daVE.OnTheDayBefore.text
ltx/gr_redirects_goarch/da.d6:daVE.OnTheEveningBefore.text	@ltx/gr_gr_cog/da.d6:daVE.OnTheEveningBefore.text
ltx/gr_redirects_goarch/da.d6:daVE.OnTheMorningBefore.text	@ltx/gr_gr_cog/da.d6:daVE.OnTheMorningBefore.text
