ltx/gr_redirects_goarch/website.preferences.titles:mc.eothinongospel.position1	@ltx/gr_gr_cog/website.preferences.titles:mc.eothinongospel.position1
ltx/gr_redirects_goarch/website.preferences.titles:mc.eothinongospel.position2	@ltx/gr_gr_cog/website.preferences.titles:mc.eothinongospel.position2
ltx/gr_redirects_goarch/website.preferences.titles:mc.kontakion.position1	@ltx/gr_gr_cog/website.preferences.titles:mc.kontakion.position1
ltx/gr_redirects_goarch/website.preferences.titles:mc.kontakion.position12	@ltx/gr_gr_cog/website.preferences.titles:mc.kontakion.position12
ltx/gr_redirects_goarch/website.preferences.titles:mc.kontakion.position2	@ltx/gr_gr_cog/website.preferences.titles:mc.kontakion.position2
ltx/gr_redirects_goarch/website.preferences.titles:mc.magnificat.modeofcanon	@ltx/gr_gr_cog/website.preferences.titles:mc.magnificat.modeofcanon
ltx/gr_redirects_goarch/website.preferences.titles:mc.magnificat.modeofkatavasia	@ltx/gr_gr_cog/website.preferences.titles:mc.magnificat.modeofkatavasia
ltx/gr_redirects_goarch/website.preferences.titles:mc.matins.close	@ltx/gr_gr_cog/website.preferences.titles:mc.matins.close
ltx/gr_redirects_goarch/website.preferences.titles:mc.matins.dismissal	@ltx/gr_gr_cog/website.preferences.titles:mc.matins.dismissal
ltx/gr_redirects_goarch/website.preferences.titles:mc.matins.end.before.dismissal	@ltx/gr_gr_cog/website.preferences.titles:mc.matins.end.before.dismissal
ltx/gr_redirects_goarch/website.preferences.titles:mc.matins.end.no.dismissal	@ltx/gr_gr_cog/website.preferences.titles:mc.matins.end.no.dismissal
ltx/gr_redirects_goarch/website.preferences.titles:mc.matinsordinary	@ltx/gr_gr_cog/website.preferences.titles:mc.matinsordinary
ltx/gr_redirects_goarch/website.preferences.titles:mc.ode1hocanon1	@ltx/gr_gr_cog/website.preferences.titles:mc.ode1hocanon1
ltx/gr_redirects_goarch/website.preferences.titles:mc.ode1katavasia	@ltx/gr_gr_cog/website.preferences.titles:mc.ode1katavasia
ltx/gr_redirects_goarch/website.preferences.titles:mc.ode1mecanon1	@ltx/gr_gr_cog/website.preferences.titles:mc.ode1mecanon1
ltx/gr_redirects_goarch/website.preferences.titles:mc.ode1mecanon2	@ltx/gr_gr_cog/website.preferences.titles:mc.ode1mecanon2
ltx/gr_redirects_goarch/website.preferences.titles:mc.ode1mecanon3	@ltx/gr_gr_cog/website.preferences.titles:mc.ode1mecanon3
ltx/gr_redirects_goarch/website.preferences.titles:mc.ode1occanon1	@ltx/gr_gr_cog/website.preferences.titles:mc.ode1occanon1
ltx/gr_redirects_goarch/website.preferences.titles:mc.ode1occanon2	@ltx/gr_gr_cog/website.preferences.titles:mc.ode1occanon2
ltx/gr_redirects_goarch/website.preferences.titles:mc.ode1occanon3	@ltx/gr_gr_cog/website.preferences.titles:mc.ode1occanon3
ltx/gr_redirects_goarch/website.preferences.titles:mc.ode1pacanon1	@ltx/gr_gr_cog/website.preferences.titles:mc.ode1pacanon1
ltx/gr_redirects_goarch/website.preferences.titles:mc.ode1pecanon1	@ltx/gr_gr_cog/website.preferences.titles:mc.ode1pecanon1
ltx/gr_redirects_goarch/website.preferences.titles:mc.ode1pecanon2	@ltx/gr_gr_cog/website.preferences.titles:mc.ode1pecanon2
ltx/gr_redirects_goarch/website.preferences.titles:mc.ode1trcanon1	@ltx/gr_gr_cog/website.preferences.titles:mc.ode1trcanon1
ltx/gr_redirects_goarch/website.preferences.titles:mc.ode1trcanon2	@ltx/gr_gr_cog/website.preferences.titles:mc.ode1trcanon2
ltx/gr_redirects_goarch/website.preferences.titles:mc.ode1trcanon3	@ltx/gr_gr_cog/website.preferences.titles:mc.ode1trcanon3
ltx/gr_redirects_goarch/website.preferences.titles:mc.ode2trcanon1	@ltx/gr_gr_cog/website.preferences.titles:mc.ode2trcanon1
ltx/gr_redirects_goarch/website.preferences.titles:mc.ode2trcanon2	@ltx/gr_gr_cog/website.preferences.titles:mc.ode2trcanon2
ltx/gr_redirects_goarch/website.preferences.titles:mc.ode2trcanon3	@ltx/gr_gr_cog/website.preferences.titles:mc.ode2trcanon3
ltx/gr_redirects_goarch/website.preferences.titles:mc.ode3.kathisma	@ltx/gr_gr_cog/website.preferences.titles:mc.ode3.kathisma
ltx/gr_redirects_goarch/website.preferences.titles:mc.ode3.litany	@ltx/gr_gr_cog/website.preferences.titles:mc.ode3.litany
ltx/gr_redirects_goarch/website.preferences.titles:mc.ode3hocanon1	@ltx/gr_gr_cog/website.preferences.titles:mc.ode3hocanon1
ltx/gr_redirects_goarch/website.preferences.titles:mc.ode3katavasia	@ltx/gr_gr_cog/website.preferences.titles:mc.ode3katavasia
ltx/gr_redirects_goarch/website.preferences.titles:mc.ode3mecanon1	@ltx/gr_gr_cog/website.preferences.titles:mc.ode3mecanon1
ltx/gr_redirects_goarch/website.preferences.titles:mc.ode3mecanon2	@ltx/gr_gr_cog/website.preferences.titles:mc.ode3mecanon2
ltx/gr_redirects_goarch/website.preferences.titles:mc.ode3mecanon3	@ltx/gr_gr_cog/website.preferences.titles:mc.ode3mecanon3
ltx/gr_redirects_goarch/website.preferences.titles:mc.ode3occanon1	@ltx/gr_gr_cog/website.preferences.titles:mc.ode3occanon1
ltx/gr_redirects_goarch/website.preferences.titles:mc.ode3occanon2	@ltx/gr_gr_cog/website.preferences.titles:mc.ode3occanon2
ltx/gr_redirects_goarch/website.preferences.titles:mc.ode3occanon3	@ltx/gr_gr_cog/website.preferences.titles:mc.ode3occanon3
ltx/gr_redirects_goarch/website.preferences.titles:mc.ode3pacanon1	@ltx/gr_gr_cog/website.preferences.titles:mc.ode3pacanon1
ltx/gr_redirects_goarch/website.preferences.titles:mc.ode3pecanon1	@ltx/gr_gr_cog/website.preferences.titles:mc.ode3pecanon1
ltx/gr_redirects_goarch/website.preferences.titles:mc.ode3pecanon2	@ltx/gr_gr_cog/website.preferences.titles:mc.ode3pecanon2
ltx/gr_redirects_goarch/website.preferences.titles:mc.ode3trcanon1	@ltx/gr_gr_cog/website.preferences.titles:mc.ode3trcanon1
ltx/gr_redirects_goarch/website.preferences.titles:mc.ode3trcanon2	@ltx/gr_gr_cog/website.preferences.titles:mc.ode3trcanon2
ltx/gr_redirects_goarch/website.preferences.titles:mc.ode3trcanon3	@ltx/gr_gr_cog/website.preferences.titles:mc.ode3trcanon3
ltx/gr_redirects_goarch/website.preferences.titles:mc.ode4hocanon1	@ltx/gr_gr_cog/website.preferences.titles:mc.ode4hocanon1
ltx/gr_redirects_goarch/website.preferences.titles:mc.ode4katavasia	@ltx/gr_gr_cog/website.preferences.titles:mc.ode4katavasia
ltx/gr_redirects_goarch/website.preferences.titles:mc.ode4mecanon1	@ltx/gr_gr_cog/website.preferences.titles:mc.ode4mecanon1
ltx/gr_redirects_goarch/website.preferences.titles:mc.ode4mecanon2	@ltx/gr_gr_cog/website.preferences.titles:mc.ode4mecanon2
ltx/gr_redirects_goarch/website.preferences.titles:mc.ode4mecanon3	@ltx/gr_gr_cog/website.preferences.titles:mc.ode4mecanon3
ltx/gr_redirects_goarch/website.preferences.titles:mc.ode4occanon1	@ltx/gr_gr_cog/website.preferences.titles:mc.ode4occanon1
ltx/gr_redirects_goarch/website.preferences.titles:mc.ode4occanon2	@ltx/gr_gr_cog/website.preferences.titles:mc.ode4occanon2
ltx/gr_redirects_goarch/website.preferences.titles:mc.ode4occanon3	@ltx/gr_gr_cog/website.preferences.titles:mc.ode4occanon3
ltx/gr_redirects_goarch/website.preferences.titles:mc.ode4pacanon1	@ltx/gr_gr_cog/website.preferences.titles:mc.ode4pacanon1
ltx/gr_redirects_goarch/website.preferences.titles:mc.ode4pecanon1	@ltx/gr_gr_cog/website.preferences.titles:mc.ode4pecanon1
ltx/gr_redirects_goarch/website.preferences.titles:mc.ode4pecanon2	@ltx/gr_gr_cog/website.preferences.titles:mc.ode4pecanon2
ltx/gr_redirects_goarch/website.preferences.titles:mc.ode4trcanon1	@ltx/gr_gr_cog/website.preferences.titles:mc.ode4trcanon1
ltx/gr_redirects_goarch/website.preferences.titles:mc.ode4trcanon2	@ltx/gr_gr_cog/website.preferences.titles:mc.ode4trcanon2
ltx/gr_redirects_goarch/website.preferences.titles:mc.ode4trcanon3	@ltx/gr_gr_cog/website.preferences.titles:mc.ode4trcanon3
ltx/gr_redirects_goarch/website.preferences.titles:mc.ode5hocanon1	@ltx/gr_gr_cog/website.preferences.titles:mc.ode5hocanon1
ltx/gr_redirects_goarch/website.preferences.titles:mc.ode5katavasia	@ltx/gr_gr_cog/website.preferences.titles:mc.ode5katavasia
ltx/gr_redirects_goarch/website.preferences.titles:mc.ode5mecanon1	@ltx/gr_gr_cog/website.preferences.titles:mc.ode5mecanon1
ltx/gr_redirects_goarch/website.preferences.titles:mc.ode5mecanon2	@ltx/gr_gr_cog/website.preferences.titles:mc.ode5mecanon2
ltx/gr_redirects_goarch/website.preferences.titles:mc.ode5mecanon3	@ltx/gr_gr_cog/website.preferences.titles:mc.ode5mecanon3
ltx/gr_redirects_goarch/website.preferences.titles:mc.ode5occanon1	@ltx/gr_gr_cog/website.preferences.titles:mc.ode5occanon1
ltx/gr_redirects_goarch/website.preferences.titles:mc.ode5occanon2	@ltx/gr_gr_cog/website.preferences.titles:mc.ode5occanon2
ltx/gr_redirects_goarch/website.preferences.titles:mc.ode5occanon3	@ltx/gr_gr_cog/website.preferences.titles:mc.ode5occanon3
ltx/gr_redirects_goarch/website.preferences.titles:mc.ode5pacanon1	@ltx/gr_gr_cog/website.preferences.titles:mc.ode5pacanon1
ltx/gr_redirects_goarch/website.preferences.titles:mc.ode5pecanon1	@ltx/gr_gr_cog/website.preferences.titles:mc.ode5pecanon1
ltx/gr_redirects_goarch/website.preferences.titles:mc.ode5pecanon2	@ltx/gr_gr_cog/website.preferences.titles:mc.ode5pecanon2
ltx/gr_redirects_goarch/website.preferences.titles:mc.ode5trcanon1	@ltx/gr_gr_cog/website.preferences.titles:mc.ode5trcanon1
ltx/gr_redirects_goarch/website.preferences.titles:mc.ode5trcanon2	@ltx/gr_gr_cog/website.preferences.titles:mc.ode5trcanon2
ltx/gr_redirects_goarch/website.preferences.titles:mc.ode5trcanon3	@ltx/gr_gr_cog/website.preferences.titles:mc.ode5trcanon3
ltx/gr_redirects_goarch/website.preferences.titles:mc.ode6.litany	@ltx/gr_gr_cog/website.preferences.titles:mc.ode6.litany
ltx/gr_redirects_goarch/website.preferences.titles:mc.ode6hocanon1	@ltx/gr_gr_cog/website.preferences.titles:mc.ode6hocanon1
ltx/gr_redirects_goarch/website.preferences.titles:mc.ode6katavasia	@ltx/gr_gr_cog/website.preferences.titles:mc.ode6katavasia
ltx/gr_redirects_goarch/website.preferences.titles:mc.ode6mecanon1	@ltx/gr_gr_cog/website.preferences.titles:mc.ode6mecanon1
ltx/gr_redirects_goarch/website.preferences.titles:mc.ode6mecanon2	@ltx/gr_gr_cog/website.preferences.titles:mc.ode6mecanon2
ltx/gr_redirects_goarch/website.preferences.titles:mc.ode6mecanon3	@ltx/gr_gr_cog/website.preferences.titles:mc.ode6mecanon3
ltx/gr_redirects_goarch/website.preferences.titles:mc.ode6occanon1	@ltx/gr_gr_cog/website.preferences.titles:mc.ode6occanon1
ltx/gr_redirects_goarch/website.preferences.titles:mc.ode6occanon2	@ltx/gr_gr_cog/website.preferences.titles:mc.ode6occanon2
ltx/gr_redirects_goarch/website.preferences.titles:mc.ode6occanon3	@ltx/gr_gr_cog/website.preferences.titles:mc.ode6occanon3
ltx/gr_redirects_goarch/website.preferences.titles:mc.ode6pacanon1	@ltx/gr_gr_cog/website.preferences.titles:mc.ode6pacanon1
ltx/gr_redirects_goarch/website.preferences.titles:mc.ode6pecanon1	@ltx/gr_gr_cog/website.preferences.titles:mc.ode6pecanon1
ltx/gr_redirects_goarch/website.preferences.titles:mc.ode6pecanon2	@ltx/gr_gr_cog/website.preferences.titles:mc.ode6pecanon2
ltx/gr_redirects_goarch/website.preferences.titles:mc.ode6trcanon1	@ltx/gr_gr_cog/website.preferences.titles:mc.ode6trcanon1
ltx/gr_redirects_goarch/website.preferences.titles:mc.ode6trcanon2	@ltx/gr_gr_cog/website.preferences.titles:mc.ode6trcanon2
ltx/gr_redirects_goarch/website.preferences.titles:mc.ode6trcanon3	@ltx/gr_gr_cog/website.preferences.titles:mc.ode6trcanon3
ltx/gr_redirects_goarch/website.preferences.titles:mc.ode7hocanon1	@ltx/gr_gr_cog/website.preferences.titles:mc.ode7hocanon1
ltx/gr_redirects_goarch/website.preferences.titles:mc.ode7katavasia	@ltx/gr_gr_cog/website.preferences.titles:mc.ode7katavasia
ltx/gr_redirects_goarch/website.preferences.titles:mc.ode7mecanon1	@ltx/gr_gr_cog/website.preferences.titles:mc.ode7mecanon1
ltx/gr_redirects_goarch/website.preferences.titles:mc.ode7mecanon2	@ltx/gr_gr_cog/website.preferences.titles:mc.ode7mecanon2
ltx/gr_redirects_goarch/website.preferences.titles:mc.ode7mecanon3	@ltx/gr_gr_cog/website.preferences.titles:mc.ode7mecanon3
ltx/gr_redirects_goarch/website.preferences.titles:mc.ode7occanon1	@ltx/gr_gr_cog/website.preferences.titles:mc.ode7occanon1
ltx/gr_redirects_goarch/website.preferences.titles:mc.ode7occanon2	@ltx/gr_gr_cog/website.preferences.titles:mc.ode7occanon2
ltx/gr_redirects_goarch/website.preferences.titles:mc.ode7occanon3	@ltx/gr_gr_cog/website.preferences.titles:mc.ode7occanon3
ltx/gr_redirects_goarch/website.preferences.titles:mc.ode7pacanon1	@ltx/gr_gr_cog/website.preferences.titles:mc.ode7pacanon1
ltx/gr_redirects_goarch/website.preferences.titles:mc.ode7pecanon1	@ltx/gr_gr_cog/website.preferences.titles:mc.ode7pecanon1
ltx/gr_redirects_goarch/website.preferences.titles:mc.ode7pecanon2	@ltx/gr_gr_cog/website.preferences.titles:mc.ode7pecanon2
ltx/gr_redirects_goarch/website.preferences.titles:mc.ode7trcanon1	@ltx/gr_gr_cog/website.preferences.titles:mc.ode7trcanon1
ltx/gr_redirects_goarch/website.preferences.titles:mc.ode7trcanon2	@ltx/gr_gr_cog/website.preferences.titles:mc.ode7trcanon2
ltx/gr_redirects_goarch/website.preferences.titles:mc.ode7trcanon3	@ltx/gr_gr_cog/website.preferences.titles:mc.ode7trcanon3
ltx/gr_redirects_goarch/website.preferences.titles:mc.ode8hocanon1	@ltx/gr_gr_cog/website.preferences.titles:mc.ode8hocanon1
ltx/gr_redirects_goarch/website.preferences.titles:mc.ode8katavasia	@ltx/gr_gr_cog/website.preferences.titles:mc.ode8katavasia
ltx/gr_redirects_goarch/website.preferences.titles:mc.ode8mecanon1	@ltx/gr_gr_cog/website.preferences.titles:mc.ode8mecanon1
ltx/gr_redirects_goarch/website.preferences.titles:mc.ode8mecanon2	@ltx/gr_gr_cog/website.preferences.titles:mc.ode8mecanon2
ltx/gr_redirects_goarch/website.preferences.titles:mc.ode8mecanon3	@ltx/gr_gr_cog/website.preferences.titles:mc.ode8mecanon3
ltx/gr_redirects_goarch/website.preferences.titles:mc.ode8occanon1	@ltx/gr_gr_cog/website.preferences.titles:mc.ode8occanon1
ltx/gr_redirects_goarch/website.preferences.titles:mc.ode8occanon2	@ltx/gr_gr_cog/website.preferences.titles:mc.ode8occanon2
ltx/gr_redirects_goarch/website.preferences.titles:mc.ode8occanon3	@ltx/gr_gr_cog/website.preferences.titles:mc.ode8occanon3
ltx/gr_redirects_goarch/website.preferences.titles:mc.ode8pacanon1	@ltx/gr_gr_cog/website.preferences.titles:mc.ode8pacanon1
ltx/gr_redirects_goarch/website.preferences.titles:mc.ode8pecanon1	@ltx/gr_gr_cog/website.preferences.titles:mc.ode8pecanon1
ltx/gr_redirects_goarch/website.preferences.titles:mc.ode8pecanon2	@ltx/gr_gr_cog/website.preferences.titles:mc.ode8pecanon2
ltx/gr_redirects_goarch/website.preferences.titles:mc.ode8trcanon1	@ltx/gr_gr_cog/website.preferences.titles:mc.ode8trcanon1
ltx/gr_redirects_goarch/website.preferences.titles:mc.ode8trcanon2	@ltx/gr_gr_cog/website.preferences.titles:mc.ode8trcanon2
ltx/gr_redirects_goarch/website.preferences.titles:mc.ode8trcanon3	@ltx/gr_gr_cog/website.preferences.titles:mc.ode8trcanon3
ltx/gr_redirects_goarch/website.preferences.titles:mc.ode9hocanon1	@ltx/gr_gr_cog/website.preferences.titles:mc.ode9hocanon1
ltx/gr_redirects_goarch/website.preferences.titles:mc.ode9katavasia	@ltx/gr_gr_cog/website.preferences.titles:mc.ode9katavasia
ltx/gr_redirects_goarch/website.preferences.titles:mc.ode9mecanon1	@ltx/gr_gr_cog/website.preferences.titles:mc.ode9mecanon1
ltx/gr_redirects_goarch/website.preferences.titles:mc.ode9mecanon2	@ltx/gr_gr_cog/website.preferences.titles:mc.ode9mecanon2
ltx/gr_redirects_goarch/website.preferences.titles:mc.ode9mecanon3	@ltx/gr_gr_cog/website.preferences.titles:mc.ode9mecanon3
ltx/gr_redirects_goarch/website.preferences.titles:mc.ode9occanon1	@ltx/gr_gr_cog/website.preferences.titles:mc.ode9occanon1
ltx/gr_redirects_goarch/website.preferences.titles:mc.ode9occanon2	@ltx/gr_gr_cog/website.preferences.titles:mc.ode9occanon2
ltx/gr_redirects_goarch/website.preferences.titles:mc.ode9occanon3	@ltx/gr_gr_cog/website.preferences.titles:mc.ode9occanon3
ltx/gr_redirects_goarch/website.preferences.titles:mc.ode9pacanon1	@ltx/gr_gr_cog/website.preferences.titles:mc.ode9pacanon1
ltx/gr_redirects_goarch/website.preferences.titles:mc.ode9pecanon1	@ltx/gr_gr_cog/website.preferences.titles:mc.ode9pecanon1
ltx/gr_redirects_goarch/website.preferences.titles:mc.ode9pecanon2	@ltx/gr_gr_cog/website.preferences.titles:mc.ode9pecanon2
ltx/gr_redirects_goarch/website.preferences.titles:mc.ode9trcanon1	@ltx/gr_gr_cog/website.preferences.titles:mc.ode9trcanon1
ltx/gr_redirects_goarch/website.preferences.titles:mc.ode9trcanon2	@ltx/gr_gr_cog/website.preferences.titles:mc.ode9trcanon2
ltx/gr_redirects_goarch/website.preferences.titles:mc.ode9trcanon3	@ltx/gr_gr_cog/website.preferences.titles:mc.ode9trcanon3
ltx/gr_redirects_goarch/website.preferences.titles:mc.odes1345678katavasia	@ltx/gr_gr_cog/website.preferences.titles:mc.odes1345678katavasia
ltx/gr_redirects_goarch/website.preferences.titles:mc.synaxarion.extended	@ltx/gr_gr_cog/website.preferences.titles:mc.synaxarion.extended
ltx/gr_redirects_goarch/website.preferences.titles:mc.tag	@ltx/gr_gr_cog/website.preferences.titles:mc.tag
ltx/gr_redirects_goarch/website.preferences.titles:mc.vesperslity	@ltx/gr_gr_cog/website.preferences.titles:mc.vesperslity
ltx/gr_redirects_goarch/website.preferences.titles:mc.vespersstichologia	@ltx/gr_gr_cog/website.preferences.titles:mc.vespersstichologia
