ltx/gr_redirects_goarch/me.m08.d27:alt1.meDA.commemoration.first_name	@ltx/gr_gr_cog/me.m08.d27:alt1.meDA.commemoration.first_name
ltx/gr_redirects_goarch/me.m08.d27:alt1.meDA.commemoration.first_short	@ltx/gr_gr_cog/me.m08.d27:alt1.meDA.commemoration.first_short
ltx/gr_redirects_goarch/me.m08.d27:alt1.meDA.commemoration.first_title	@ltx/gr_gr_cog/me.m08.d27:alt1.meDA.commemoration.first_title
ltx/gr_redirects_goarch/me.m08.d27:alt1.meDA.commemoration.full	@ltx/gr_gr_cog/me.m08.d27:alt1.meDA.commemoration.full
ltx/gr_redirects_goarch/me.m08.d27:alt1.meDA.commemoration.second_name	@ltx/gr_gr_cog/me.m08.d27:alt1.meDA.commemoration.second_name
ltx/gr_redirects_goarch/me.m08.d27:alt1.meDA.commemoration.second_title	@ltx/gr_gr_cog/me.m08.d27:alt1.meDA.commemoration.second_title
ltx/gr_redirects_goarch/me.m08.d27:alt1.meDA.date	@ltx/gr_gr_cog/me.m08.d27:alt1.meDA.date
ltx/gr_redirects_goarch/me.m08.d27:alt1.meDA.insert1	@ltx/gr_gr_cog/me.m08.d27:alt1.meDA.insert1
ltx/gr_redirects_goarch/me.m08.d27:alt1.meDA.insert2	@ltx/gr_gr_cog/me.m08.d27:alt1.meDA.insert2
ltx/gr_redirects_goarch/me.m08.d27:alt1.meDA.note	@ltx/gr_gr_cog/me.m08.d27:alt1.meDA.note
ltx/gr_redirects_goarch/me.m08.d27:alt1.meHO.commemorations	@ltx/gr_gr_cog/me.m08.d27:alt1.meHO.commemorations
ltx/gr_redirects_goarch/me.m08.d27:alt1.meHO.note1	@ltx/gr_gr_cog/me.m08.d27:alt1.meHO.note1
ltx/gr_redirects_goarch/me.m08.d27:alt1.meHO.note2	@ltx/gr_gr_cog/me.m08.d27:alt1.meHO.note2
ltx/gr_redirects_goarch/me.m08.d27:alt1.meHO.number	@ltx/gr_gr_cog/me.m08.d27:alt1.meHO.number
ltx/gr_redirects_goarch/me.m08.d27:alt1.meHO.rank	@ltx/gr_gr_cog/me.m08.d27:alt1.meHO.rank
ltx/gr_redirects_goarch/me.m08.d27:alt1.meLE.commemoration1	@ltx/gr_gr_cog/me.m08.d27:alt1.meLE.commemoration1
ltx/gr_redirects_goarch/me.m08.d27:alt1.meLE.commemoration2	@ltx/gr_gr_cog/me.m08.d27:alt1.meLE.commemoration2
ltx/gr_redirects_goarch/me.m08.d27:alt1.meLI.Kontakion1.incipit	@ltx/gr_gr_cog/me.m08.d27:alt1.meLI.Kontakion1.incipit
ltx/gr_redirects_goarch/me.m08.d27:alt1.meLI.Kontakion1.melody	@ltx/gr_gr_cog/me.m08.d27:alt1.meLI.Kontakion1.melody
ltx/gr_redirects_goarch/me.m08.d27:alt1.meLI.Kontakion1.mode	@ltx/gr_gr_cog/me.m08.d27:alt1.meLI.Kontakion1.mode
ltx/gr_redirects_goarch/me.m08.d27:alt1.meLI.Kontakion1.text	@ltx/gr_gr_cog/me.m08.d27:alt1.meLI.Kontakion1.text
ltx/gr_redirects_goarch/me.m08.d27:alt1.meLI.MM.CommunionHymn.text	@ltx/gr_gr_cog/me.m08.d27:alt1.meLI.MM.CommunionHymn.text
ltx/gr_redirects_goarch/me.m08.d27:alt1.meLI.Megalynarion.text	@ltx/gr_gr_cog/me.m08.d27:alt1.meLI.Megalynarion.text
ltx/gr_redirects_goarch/me.m08.d27:alt1.meLI.Megalynarion2.text	@ltx/gr_gr_cog/me.m08.d27:alt1.meLI.Megalynarion2.text
ltx/gr_redirects_goarch/me.m08.d27:alt1.meMA.C1.acrostic.notice1	@ltx/gr_gr_cog/me.m08.d27:alt1.meMA.C1.acrostic.notice1
ltx/gr_redirects_goarch/me.m08.d27:alt1.meMA.C1.acrostic.text	@ltx/gr_gr_cog/me.m08.d27:alt1.meMA.C1.acrostic.text
ltx/gr_redirects_goarch/me.m08.d27:alt1.meMA.C1.acrostic.title	@ltx/gr_gr_cog/me.m08.d27:alt1.meMA.C1.acrostic.title
ltx/gr_redirects_goarch/me.m08.d27:alt1.meMA.C1.title	@ltx/gr_gr_cog/me.m08.d27:alt1.meMA.C1.title
ltx/gr_redirects_goarch/me.m08.d27:alt1.meMA.C1.verse	@ltx/gr_gr_cog/me.m08.d27:alt1.meMA.C1.verse
ltx/gr_redirects_goarch/me.m08.d27:alt1.meMA.ExapTheotokion.incipit	@ltx/gr_gr_cog/me.m08.d27:alt1.meMA.ExapTheotokion.incipit
ltx/gr_redirects_goarch/me.m08.d27:alt1.meMA.ExapTheotokion.melody	@ltx/gr_gr_cog/me.m08.d27:alt1.meMA.ExapTheotokion.melody
ltx/gr_redirects_goarch/me.m08.d27:alt1.meMA.ExapTheotokion.mode	@ltx/gr_gr_cog/me.m08.d27:alt1.meMA.ExapTheotokion.mode
ltx/gr_redirects_goarch/me.m08.d27:alt1.meMA.ExapTheotokion.text	@ltx/gr_gr_cog/me.m08.d27:alt1.meMA.ExapTheotokion.text
ltx/gr_redirects_goarch/me.m08.d27:alt1.meMA.Exaposteilarion1.greekmelody	@ltx/gr_gr_cog/me.m08.d27:alt1.meMA.Exaposteilarion1.greekmelody
ltx/gr_redirects_goarch/me.m08.d27:alt1.meMA.Exaposteilarion1.incipit	@ltx/gr_gr_cog/me.m08.d27:alt1.meMA.Exaposteilarion1.incipit
ltx/gr_redirects_goarch/me.m08.d27:alt1.meMA.Exaposteilarion1.melody	@ltx/gr_gr_cog/me.m08.d27:alt1.meMA.Exaposteilarion1.melody
ltx/gr_redirects_goarch/me.m08.d27:alt1.meMA.Exaposteilarion1.mode	@ltx/gr_gr_cog/me.m08.d27:alt1.meMA.Exaposteilarion1.mode
ltx/gr_redirects_goarch/me.m08.d27:alt1.meMA.Exaposteilarion1.text	@ltx/gr_gr_cog/me.m08.d27:alt1.meMA.Exaposteilarion1.text
ltx/gr_redirects_goarch/me.m08.d27:alt1.meMA.Kathisma11.greekmelody	@ltx/gr_gr_cog/me.m08.d27:alt1.meMA.Kathisma11.greekmelody
ltx/gr_redirects_goarch/me.m08.d27:alt1.meMA.Kathisma11.incipit	@ltx/gr_gr_cog/me.m08.d27:alt1.meMA.Kathisma11.incipit
ltx/gr_redirects_goarch/me.m08.d27:alt1.meMA.Kathisma11.melody	@ltx/gr_gr_cog/me.m08.d27:alt1.meMA.Kathisma11.melody
ltx/gr_redirects_goarch/me.m08.d27:alt1.meMA.Kathisma11.mode	@ltx/gr_gr_cog/me.m08.d27:alt1.meMA.Kathisma11.mode
ltx/gr_redirects_goarch/me.m08.d27:alt1.meMA.Kathisma11.text	@ltx/gr_gr_cog/me.m08.d27:alt1.meMA.Kathisma11.text
ltx/gr_redirects_goarch/me.m08.d27:alt1.meMA.Kathisma1T.greekmelody	@ltx/gr_gr_cog/me.m08.d27:alt1.meMA.Kathisma1T.greekmelody
ltx/gr_redirects_goarch/me.m08.d27:alt1.meMA.Kathisma1T.incipit	@ltx/gr_gr_cog/me.m08.d27:alt1.meMA.Kathisma1T.incipit
ltx/gr_redirects_goarch/me.m08.d27:alt1.meMA.Kathisma1T.melody	@ltx/gr_gr_cog/me.m08.d27:alt1.meMA.Kathisma1T.melody
ltx/gr_redirects_goarch/me.m08.d27:alt1.meMA.Kathisma1T.mode	@ltx/gr_gr_cog/me.m08.d27:alt1.meMA.Kathisma1T.mode
ltx/gr_redirects_goarch/me.m08.d27:alt1.meMA.Kathisma1T.text	@ltx/gr_gr_cog/me.m08.d27:alt1.meMA.Kathisma1T.text
ltx/gr_redirects_goarch/me.m08.d27:alt1.meMA.Kathisma21.greekmelody	@ltx/gr_gr_cog/me.m08.d27:alt1.meMA.Kathisma21.greekmelody
ltx/gr_redirects_goarch/me.m08.d27:alt1.meMA.Kathisma21.incipit	@ltx/gr_gr_cog/me.m08.d27:alt1.meMA.Kathisma21.incipit
ltx/gr_redirects_goarch/me.m08.d27:alt1.meMA.Kathisma21.melody	@ltx/gr_gr_cog/me.m08.d27:alt1.meMA.Kathisma21.melody
ltx/gr_redirects_goarch/me.m08.d27:alt1.meMA.Kathisma21.mode	@ltx/gr_gr_cog/me.m08.d27:alt1.meMA.Kathisma21.mode
ltx/gr_redirects_goarch/me.m08.d27:alt1.meMA.Kathisma21.text	@ltx/gr_gr_cog/me.m08.d27:alt1.meMA.Kathisma21.text
ltx/gr_redirects_goarch/me.m08.d27:alt1.meMA.Kathisma2T.greekmelody	@ltx/gr_gr_cog/me.m08.d27:alt1.meMA.Kathisma2T.greekmelody
ltx/gr_redirects_goarch/me.m08.d27:alt1.meMA.Kathisma2T.incipit	@ltx/gr_gr_cog/me.m08.d27:alt1.meMA.Kathisma2T.incipit
ltx/gr_redirects_goarch/me.m08.d27:alt1.meMA.Kathisma2T.melody	@ltx/gr_gr_cog/me.m08.d27:alt1.meMA.Kathisma2T.melody
ltx/gr_redirects_goarch/me.m08.d27:alt1.meMA.Kathisma2T.mode	@ltx/gr_gr_cog/me.m08.d27:alt1.meMA.Kathisma2T.mode
ltx/gr_redirects_goarch/me.m08.d27:alt1.meMA.Kathisma2T.text	@ltx/gr_gr_cog/me.m08.d27:alt1.meMA.Kathisma2T.text
ltx/gr_redirects_goarch/me.m08.d27:alt1.meMA.Kathisma31.greekmelody	@ltx/gr_gr_cog/me.m08.d27:alt1.meMA.Kathisma31.greekmelody
ltx/gr_redirects_goarch/me.m08.d27:alt1.meMA.Kathisma31.incipit	@ltx/gr_gr_cog/me.m08.d27:alt1.meMA.Kathisma31.incipit
ltx/gr_redirects_goarch/me.m08.d27:alt1.meMA.Kathisma31.melody	@ltx/gr_gr_cog/me.m08.d27:alt1.meMA.Kathisma31.melody
ltx/gr_redirects_goarch/me.m08.d27:alt1.meMA.Kathisma31.mode	@ltx/gr_gr_cog/me.m08.d27:alt1.meMA.Kathisma31.mode
ltx/gr_redirects_goarch/me.m08.d27:alt1.meMA.Kathisma31.text	@ltx/gr_gr_cog/me.m08.d27:alt1.meMA.Kathisma31.text
ltx/gr_redirects_goarch/me.m08.d27:alt1.meMA.Kathisma3T.greekmelody	@ltx/gr_gr_cog/me.m08.d27:alt1.meMA.Kathisma3T.greekmelody
ltx/gr_redirects_goarch/me.m08.d27:alt1.meMA.Kathisma3T.incipit	@ltx/gr_gr_cog/me.m08.d27:alt1.meMA.Kathisma3T.incipit
ltx/gr_redirects_goarch/me.m08.d27:alt1.meMA.Kathisma3T.melody	@ltx/gr_gr_cog/me.m08.d27:alt1.meMA.Kathisma3T.melody
ltx/gr_redirects_goarch/me.m08.d27:alt1.meMA.Kathisma3T.mode	@ltx/gr_gr_cog/me.m08.d27:alt1.meMA.Kathisma3T.mode
ltx/gr_redirects_goarch/me.m08.d27:alt1.meMA.Kathisma3T.text	@ltx/gr_gr_cog/me.m08.d27:alt1.meMA.Kathisma3T.text
ltx/gr_redirects_goarch/me.m08.d27:alt1.meMA.Kontakion1.greekmelody	@ltx/gr_gr_cog/me.m08.d27:alt1.meMA.Kontakion1.greekmelody
ltx/gr_redirects_goarch/me.m08.d27:alt1.meMA.Kontakion1.incipit	@ltx/gr_gr_cog/me.m08.d27:alt1.meMA.Kontakion1.incipit
ltx/gr_redirects_goarch/me.m08.d27:alt1.meMA.Kontakion1.melody	@ltx/gr_gr_cog/me.m08.d27:alt1.meMA.Kontakion1.melody
ltx/gr_redirects_goarch/me.m08.d27:alt1.meMA.Kontakion1.mode	@ltx/gr_gr_cog/me.m08.d27:alt1.meMA.Kontakion1.mode
ltx/gr_redirects_goarch/me.m08.d27:alt1.meMA.Kontakion1.text	@ltx/gr_gr_cog/me.m08.d27:alt1.meMA.Kontakion1.text
ltx/gr_redirects_goarch/me.m08.d27:alt1.meMA.Lauds1.greekmelody	@ltx/gr_gr_cog/me.m08.d27:alt1.meMA.Lauds1.greekmelody
ltx/gr_redirects_goarch/me.m08.d27:alt1.meMA.Lauds1.incipit	@ltx/gr_gr_cog/me.m08.d27:alt1.meMA.Lauds1.incipit
ltx/gr_redirects_goarch/me.m08.d27:alt1.meMA.Lauds1.melody	@ltx/gr_gr_cog/me.m08.d27:alt1.meMA.Lauds1.melody
ltx/gr_redirects_goarch/me.m08.d27:alt1.meMA.Lauds1.mode	@ltx/gr_gr_cog/me.m08.d27:alt1.meMA.Lauds1.mode
ltx/gr_redirects_goarch/me.m08.d27:alt1.meMA.Lauds1.text	@ltx/gr_gr_cog/me.m08.d27:alt1.meMA.Lauds1.text
ltx/gr_redirects_goarch/me.m08.d27:alt1.meMA.Lauds2.incipit	@ltx/gr_gr_cog/me.m08.d27:alt1.meMA.Lauds2.incipit
ltx/gr_redirects_goarch/me.m08.d27:alt1.meMA.Lauds2.melody	@ltx/gr_gr_cog/me.m08.d27:alt1.meMA.Lauds2.melody
ltx/gr_redirects_goarch/me.m08.d27:alt1.meMA.Lauds2.mode	@ltx/gr_gr_cog/me.m08.d27:alt1.meMA.Lauds2.mode
ltx/gr_redirects_goarch/me.m08.d27:alt1.meMA.Lauds2.text	@ltx/gr_gr_cog/me.m08.d27:alt1.meMA.Lauds2.text
ltx/gr_redirects_goarch/me.m08.d27:alt1.meMA.Lauds3.incipit	@ltx/gr_gr_cog/me.m08.d27:alt1.meMA.Lauds3.incipit
ltx/gr_redirects_goarch/me.m08.d27:alt1.meMA.Lauds3.melody	@ltx/gr_gr_cog/me.m08.d27:alt1.meMA.Lauds3.melody
ltx/gr_redirects_goarch/me.m08.d27:alt1.meMA.Lauds3.mode	@ltx/gr_gr_cog/me.m08.d27:alt1.meMA.Lauds3.mode
ltx/gr_redirects_goarch/me.m08.d27:alt1.meMA.Lauds3.text	@ltx/gr_gr_cog/me.m08.d27:alt1.meMA.Lauds3.text
ltx/gr_redirects_goarch/me.m08.d27:alt1.meMA.Lauds4.incipit	@ltx/gr_gr_cog/me.m08.d27:alt1.meMA.Lauds4.incipit
ltx/gr_redirects_goarch/me.m08.d27:alt1.meMA.Lauds4.melody	@ltx/gr_gr_cog/me.m08.d27:alt1.meMA.Lauds4.melody
ltx/gr_redirects_goarch/me.m08.d27:alt1.meMA.Lauds4.mode	@ltx/gr_gr_cog/me.m08.d27:alt1.meMA.Lauds4.mode
ltx/gr_redirects_goarch/me.m08.d27:alt1.meMA.Lauds4.text	@ltx/gr_gr_cog/me.m08.d27:alt1.meMA.Lauds4.text
ltx/gr_redirects_goarch/me.m08.d27:alt1.meMA.LaudsGlory.incipit	@ltx/gr_gr_cog/me.m08.d27:alt1.meMA.LaudsGlory.incipit
ltx/gr_redirects_goarch/me.m08.d27:alt1.meMA.LaudsGlory.melody	@ltx/gr_gr_cog/me.m08.d27:alt1.meMA.LaudsGlory.melody
ltx/gr_redirects_goarch/me.m08.d27:alt1.meMA.LaudsGlory.mode	@ltx/gr_gr_cog/me.m08.d27:alt1.meMA.LaudsGlory.mode
ltx/gr_redirects_goarch/me.m08.d27:alt1.meMA.LaudsGlory.text	@ltx/gr_gr_cog/me.m08.d27:alt1.meMA.LaudsGlory.text
ltx/gr_redirects_goarch/me.m08.d27:alt1.meMA.LaudsTheotokion.incipit	@ltx/gr_gr_cog/me.m08.d27:alt1.meMA.LaudsTheotokion.incipit
ltx/gr_redirects_goarch/me.m08.d27:alt1.meMA.LaudsTheotokion.melody	@ltx/gr_gr_cog/me.m08.d27:alt1.meMA.LaudsTheotokion.melody
ltx/gr_redirects_goarch/me.m08.d27:alt1.meMA.LaudsTheotokion.mode	@ltx/gr_gr_cog/me.m08.d27:alt1.meMA.LaudsTheotokion.mode
ltx/gr_redirects_goarch/me.m08.d27:alt1.meMA.LaudsTheotokion.text	@ltx/gr_gr_cog/me.m08.d27:alt1.meMA.LaudsTheotokion.text
ltx/gr_redirects_goarch/me.m08.d27:alt1.meMA.Ode1C11.greekmelody	@ltx/gr_gr_cog/me.m08.d27:alt1.meMA.Ode1C11.greekmelody
ltx/gr_redirects_goarch/me.m08.d27:alt1.meMA.Ode1C11.incipit	@ltx/gr_gr_cog/me.m08.d27:alt1.meMA.Ode1C11.incipit
ltx/gr_redirects_goarch/me.m08.d27:alt1.meMA.Ode1C11.melody	@ltx/gr_gr_cog/me.m08.d27:alt1.meMA.Ode1C11.melody
ltx/gr_redirects_goarch/me.m08.d27:alt1.meMA.Ode1C11.mode	@ltx/gr_gr_cog/me.m08.d27:alt1.meMA.Ode1C11.mode
ltx/gr_redirects_goarch/me.m08.d27:alt1.meMA.Ode1C11.ode	@ltx/gr_gr_cog/me.m08.d27:alt1.meMA.Ode1C11.ode
ltx/gr_redirects_goarch/me.m08.d27:alt1.meMA.Ode1C11.text	@ltx/gr_gr_cog/me.m08.d27:alt1.meMA.Ode1C11.text
ltx/gr_redirects_goarch/me.m08.d27:alt1.meMA.Ode1C12.incipit	@ltx/gr_gr_cog/me.m08.d27:alt1.meMA.Ode1C12.incipit
ltx/gr_redirects_goarch/me.m08.d27:alt1.meMA.Ode1C12.melody	@ltx/gr_gr_cog/me.m08.d27:alt1.meMA.Ode1C12.melody
ltx/gr_redirects_goarch/me.m08.d27:alt1.meMA.Ode1C12.mode	@ltx/gr_gr_cog/me.m08.d27:alt1.meMA.Ode1C12.mode
ltx/gr_redirects_goarch/me.m08.d27:alt1.meMA.Ode1C12.ode	@ltx/gr_gr_cog/me.m08.d27:alt1.meMA.Ode1C12.ode
ltx/gr_redirects_goarch/me.m08.d27:alt1.meMA.Ode1C12.text	@ltx/gr_gr_cog/me.m08.d27:alt1.meMA.Ode1C12.text
ltx/gr_redirects_goarch/me.m08.d27:alt1.meMA.Ode1C13.incipit	@ltx/gr_gr_cog/me.m08.d27:alt1.meMA.Ode1C13.incipit
ltx/gr_redirects_goarch/me.m08.d27:alt1.meMA.Ode1C13.melody	@ltx/gr_gr_cog/me.m08.d27:alt1.meMA.Ode1C13.melody
ltx/gr_redirects_goarch/me.m08.d27:alt1.meMA.Ode1C13.mode	@ltx/gr_gr_cog/me.m08.d27:alt1.meMA.Ode1C13.mode
ltx/gr_redirects_goarch/me.m08.d27:alt1.meMA.Ode1C13.ode	@ltx/gr_gr_cog/me.m08.d27:alt1.meMA.Ode1C13.ode
ltx/gr_redirects_goarch/me.m08.d27:alt1.meMA.Ode1C13.text	@ltx/gr_gr_cog/me.m08.d27:alt1.meMA.Ode1C13.text
ltx/gr_redirects_goarch/me.m08.d27:alt1.meMA.Ode1C1T.incipit	@ltx/gr_gr_cog/me.m08.d27:alt1.meMA.Ode1C1T.incipit
ltx/gr_redirects_goarch/me.m08.d27:alt1.meMA.Ode1C1T.melody	@ltx/gr_gr_cog/me.m08.d27:alt1.meMA.Ode1C1T.melody
ltx/gr_redirects_goarch/me.m08.d27:alt1.meMA.Ode1C1T.mode	@ltx/gr_gr_cog/me.m08.d27:alt1.meMA.Ode1C1T.mode
ltx/gr_redirects_goarch/me.m08.d27:alt1.meMA.Ode1C1T.ode	@ltx/gr_gr_cog/me.m08.d27:alt1.meMA.Ode1C1T.ode
ltx/gr_redirects_goarch/me.m08.d27:alt1.meMA.Ode1C1T.text	@ltx/gr_gr_cog/me.m08.d27:alt1.meMA.Ode1C1T.text
ltx/gr_redirects_goarch/me.m08.d27:alt1.meMA.Ode3C11.greekmelody	@ltx/gr_gr_cog/me.m08.d27:alt1.meMA.Ode3C11.greekmelody
ltx/gr_redirects_goarch/me.m08.d27:alt1.meMA.Ode3C11.incipit	@ltx/gr_gr_cog/me.m08.d27:alt1.meMA.Ode3C11.incipit
ltx/gr_redirects_goarch/me.m08.d27:alt1.meMA.Ode3C11.melody	@ltx/gr_gr_cog/me.m08.d27:alt1.meMA.Ode3C11.melody
ltx/gr_redirects_goarch/me.m08.d27:alt1.meMA.Ode3C11.mode	@ltx/gr_gr_cog/me.m08.d27:alt1.meMA.Ode3C11.mode
ltx/gr_redirects_goarch/me.m08.d27:alt1.meMA.Ode3C11.ode	@ltx/gr_gr_cog/me.m08.d27:alt1.meMA.Ode3C11.ode
ltx/gr_redirects_goarch/me.m08.d27:alt1.meMA.Ode3C11.text	@ltx/gr_gr_cog/me.m08.d27:alt1.meMA.Ode3C11.text
ltx/gr_redirects_goarch/me.m08.d27:alt1.meMA.Ode3C12.incipit	@ltx/gr_gr_cog/me.m08.d27:alt1.meMA.Ode3C12.incipit
ltx/gr_redirects_goarch/me.m08.d27:alt1.meMA.Ode3C12.melody	@ltx/gr_gr_cog/me.m08.d27:alt1.meMA.Ode3C12.melody
ltx/gr_redirects_goarch/me.m08.d27:alt1.meMA.Ode3C12.mode	@ltx/gr_gr_cog/me.m08.d27:alt1.meMA.Ode3C12.mode
ltx/gr_redirects_goarch/me.m08.d27:alt1.meMA.Ode3C12.ode	@ltx/gr_gr_cog/me.m08.d27:alt1.meMA.Ode3C12.ode
ltx/gr_redirects_goarch/me.m08.d27:alt1.meMA.Ode3C12.text	@ltx/gr_gr_cog/me.m08.d27:alt1.meMA.Ode3C12.text
ltx/gr_redirects_goarch/me.m08.d27:alt1.meMA.Ode3C13.incipit	@ltx/gr_gr_cog/me.m08.d27:alt1.meMA.Ode3C13.incipit
ltx/gr_redirects_goarch/me.m08.d27:alt1.meMA.Ode3C13.melody	@ltx/gr_gr_cog/me.m08.d27:alt1.meMA.Ode3C13.melody
ltx/gr_redirects_goarch/me.m08.d27:alt1.meMA.Ode3C13.mode	@ltx/gr_gr_cog/me.m08.d27:alt1.meMA.Ode3C13.mode
ltx/gr_redirects_goarch/me.m08.d27:alt1.meMA.Ode3C13.ode	@ltx/gr_gr_cog/me.m08.d27:alt1.meMA.Ode3C13.ode
ltx/gr_redirects_goarch/me.m08.d27:alt1.meMA.Ode3C13.text	@ltx/gr_gr_cog/me.m08.d27:alt1.meMA.Ode3C13.text
ltx/gr_redirects_goarch/me.m08.d27:alt1.meMA.Ode3C1T.incipit	@ltx/gr_gr_cog/me.m08.d27:alt1.meMA.Ode3C1T.incipit
ltx/gr_redirects_goarch/me.m08.d27:alt1.meMA.Ode3C1T.melody	@ltx/gr_gr_cog/me.m08.d27:alt1.meMA.Ode3C1T.melody
ltx/gr_redirects_goarch/me.m08.d27:alt1.meMA.Ode3C1T.mode	@ltx/gr_gr_cog/me.m08.d27:alt1.meMA.Ode3C1T.mode
ltx/gr_redirects_goarch/me.m08.d27:alt1.meMA.Ode3C1T.ode	@ltx/gr_gr_cog/me.m08.d27:alt1.meMA.Ode3C1T.ode
ltx/gr_redirects_goarch/me.m08.d27:alt1.meMA.Ode3C1T.text	@ltx/gr_gr_cog/me.m08.d27:alt1.meMA.Ode3C1T.text
ltx/gr_redirects_goarch/me.m08.d27:alt1.meMA.Ode3Kathisma1.greekmelody	@ltx/gr_gr_cog/me.m08.d27:alt1.meMA.Ode3Kathisma1.greekmelody
ltx/gr_redirects_goarch/me.m08.d27:alt1.meMA.Ode3Kathisma1.incipit	@ltx/gr_gr_cog/me.m08.d27:alt1.meMA.Ode3Kathisma1.incipit
ltx/gr_redirects_goarch/me.m08.d27:alt1.meMA.Ode3Kathisma1.melody	@ltx/gr_gr_cog/me.m08.d27:alt1.meMA.Ode3Kathisma1.melody
ltx/gr_redirects_goarch/me.m08.d27:alt1.meMA.Ode3Kathisma1.mode	@ltx/gr_gr_cog/me.m08.d27:alt1.meMA.Ode3Kathisma1.mode
ltx/gr_redirects_goarch/me.m08.d27:alt1.meMA.Ode3Kathisma1.text	@ltx/gr_gr_cog/me.m08.d27:alt1.meMA.Ode3Kathisma1.text
ltx/gr_redirects_goarch/me.m08.d27:alt1.meMA.Ode3KathismaT.incipit	@ltx/gr_gr_cog/me.m08.d27:alt1.meMA.Ode3KathismaT.incipit
ltx/gr_redirects_goarch/me.m08.d27:alt1.meMA.Ode3KathismaT.melody	@ltx/gr_gr_cog/me.m08.d27:alt1.meMA.Ode3KathismaT.melody
ltx/gr_redirects_goarch/me.m08.d27:alt1.meMA.Ode3KathismaT.mode	@ltx/gr_gr_cog/me.m08.d27:alt1.meMA.Ode3KathismaT.mode
ltx/gr_redirects_goarch/me.m08.d27:alt1.meMA.Ode3KathismaT.text	@ltx/gr_gr_cog/me.m08.d27:alt1.meMA.Ode3KathismaT.text
ltx/gr_redirects_goarch/me.m08.d27:alt1.meMA.Ode4C11.greekmelody	@ltx/gr_gr_cog/me.m08.d27:alt1.meMA.Ode4C11.greekmelody
ltx/gr_redirects_goarch/me.m08.d27:alt1.meMA.Ode4C11.incipit	@ltx/gr_gr_cog/me.m08.d27:alt1.meMA.Ode4C11.incipit
ltx/gr_redirects_goarch/me.m08.d27:alt1.meMA.Ode4C11.melody	@ltx/gr_gr_cog/me.m08.d27:alt1.meMA.Ode4C11.melody
ltx/gr_redirects_goarch/me.m08.d27:alt1.meMA.Ode4C11.mode	@ltx/gr_gr_cog/me.m08.d27:alt1.meMA.Ode4C11.mode
ltx/gr_redirects_goarch/me.m08.d27:alt1.meMA.Ode4C11.ode	@ltx/gr_gr_cog/me.m08.d27:alt1.meMA.Ode4C11.ode
ltx/gr_redirects_goarch/me.m08.d27:alt1.meMA.Ode4C11.text	@ltx/gr_gr_cog/me.m08.d27:alt1.meMA.Ode4C11.text
ltx/gr_redirects_goarch/me.m08.d27:alt1.meMA.Ode4C12.incipit	@ltx/gr_gr_cog/me.m08.d27:alt1.meMA.Ode4C12.incipit
ltx/gr_redirects_goarch/me.m08.d27:alt1.meMA.Ode4C12.melody	@ltx/gr_gr_cog/me.m08.d27:alt1.meMA.Ode4C12.melody
ltx/gr_redirects_goarch/me.m08.d27:alt1.meMA.Ode4C12.mode	@ltx/gr_gr_cog/me.m08.d27:alt1.meMA.Ode4C12.mode
ltx/gr_redirects_goarch/me.m08.d27:alt1.meMA.Ode4C12.ode	@ltx/gr_gr_cog/me.m08.d27:alt1.meMA.Ode4C12.ode
ltx/gr_redirects_goarch/me.m08.d27:alt1.meMA.Ode4C12.text	@ltx/gr_gr_cog/me.m08.d27:alt1.meMA.Ode4C12.text
ltx/gr_redirects_goarch/me.m08.d27:alt1.meMA.Ode4C13.incipit	@ltx/gr_gr_cog/me.m08.d27:alt1.meMA.Ode4C13.incipit
ltx/gr_redirects_goarch/me.m08.d27:alt1.meMA.Ode4C13.melody	@ltx/gr_gr_cog/me.m08.d27:alt1.meMA.Ode4C13.melody
ltx/gr_redirects_goarch/me.m08.d27:alt1.meMA.Ode4C13.mode	@ltx/gr_gr_cog/me.m08.d27:alt1.meMA.Ode4C13.mode
ltx/gr_redirects_goarch/me.m08.d27:alt1.meMA.Ode4C13.ode	@ltx/gr_gr_cog/me.m08.d27:alt1.meMA.Ode4C13.ode
ltx/gr_redirects_goarch/me.m08.d27:alt1.meMA.Ode4C13.text	@ltx/gr_gr_cog/me.m08.d27:alt1.meMA.Ode4C13.text
ltx/gr_redirects_goarch/me.m08.d27:alt1.meMA.Ode4C14.incipit	@ltx/gr_gr_cog/me.m08.d27:alt1.meMA.Ode4C14.incipit
ltx/gr_redirects_goarch/me.m08.d27:alt1.meMA.Ode4C14.melody	@ltx/gr_gr_cog/me.m08.d27:alt1.meMA.Ode4C14.melody
ltx/gr_redirects_goarch/me.m08.d27:alt1.meMA.Ode4C14.mode	@ltx/gr_gr_cog/me.m08.d27:alt1.meMA.Ode4C14.mode
ltx/gr_redirects_goarch/me.m08.d27:alt1.meMA.Ode4C14.ode	@ltx/gr_gr_cog/me.m08.d27:alt1.meMA.Ode4C14.ode
ltx/gr_redirects_goarch/me.m08.d27:alt1.meMA.Ode4C14.text	@ltx/gr_gr_cog/me.m08.d27:alt1.meMA.Ode4C14.text
ltx/gr_redirects_goarch/me.m08.d27:alt1.meMA.Ode4C1T.incipit	@ltx/gr_gr_cog/me.m08.d27:alt1.meMA.Ode4C1T.incipit
ltx/gr_redirects_goarch/me.m08.d27:alt1.meMA.Ode4C1T.melody	@ltx/gr_gr_cog/me.m08.d27:alt1.meMA.Ode4C1T.melody
ltx/gr_redirects_goarch/me.m08.d27:alt1.meMA.Ode4C1T.mode	@ltx/gr_gr_cog/me.m08.d27:alt1.meMA.Ode4C1T.mode
ltx/gr_redirects_goarch/me.m08.d27:alt1.meMA.Ode4C1T.ode	@ltx/gr_gr_cog/me.m08.d27:alt1.meMA.Ode4C1T.ode
ltx/gr_redirects_goarch/me.m08.d27:alt1.meMA.Ode4C1T.text	@ltx/gr_gr_cog/me.m08.d27:alt1.meMA.Ode4C1T.text
ltx/gr_redirects_goarch/me.m08.d27:alt1.meMA.Ode5C11.greekmelody	@ltx/gr_gr_cog/me.m08.d27:alt1.meMA.Ode5C11.greekmelody
ltx/gr_redirects_goarch/me.m08.d27:alt1.meMA.Ode5C11.incipit	@ltx/gr_gr_cog/me.m08.d27:alt1.meMA.Ode5C11.incipit
ltx/gr_redirects_goarch/me.m08.d27:alt1.meMA.Ode5C11.melody	@ltx/gr_gr_cog/me.m08.d27:alt1.meMA.Ode5C11.melody
ltx/gr_redirects_goarch/me.m08.d27:alt1.meMA.Ode5C11.mode	@ltx/gr_gr_cog/me.m08.d27:alt1.meMA.Ode5C11.mode
ltx/gr_redirects_goarch/me.m08.d27:alt1.meMA.Ode5C11.ode	@ltx/gr_gr_cog/me.m08.d27:alt1.meMA.Ode5C11.ode
ltx/gr_redirects_goarch/me.m08.d27:alt1.meMA.Ode5C11.text	@ltx/gr_gr_cog/me.m08.d27:alt1.meMA.Ode5C11.text
ltx/gr_redirects_goarch/me.m08.d27:alt1.meMA.Ode5C12.incipit	@ltx/gr_gr_cog/me.m08.d27:alt1.meMA.Ode5C12.incipit
ltx/gr_redirects_goarch/me.m08.d27:alt1.meMA.Ode5C12.melody	@ltx/gr_gr_cog/me.m08.d27:alt1.meMA.Ode5C12.melody
ltx/gr_redirects_goarch/me.m08.d27:alt1.meMA.Ode5C12.mode	@ltx/gr_gr_cog/me.m08.d27:alt1.meMA.Ode5C12.mode
ltx/gr_redirects_goarch/me.m08.d27:alt1.meMA.Ode5C12.ode	@ltx/gr_gr_cog/me.m08.d27:alt1.meMA.Ode5C12.ode
ltx/gr_redirects_goarch/me.m08.d27:alt1.meMA.Ode5C12.text	@ltx/gr_gr_cog/me.m08.d27:alt1.meMA.Ode5C12.text
ltx/gr_redirects_goarch/me.m08.d27:alt1.meMA.Ode5C13.incipit	@ltx/gr_gr_cog/me.m08.d27:alt1.meMA.Ode5C13.incipit
ltx/gr_redirects_goarch/me.m08.d27:alt1.meMA.Ode5C13.melody	@ltx/gr_gr_cog/me.m08.d27:alt1.meMA.Ode5C13.melody
ltx/gr_redirects_goarch/me.m08.d27:alt1.meMA.Ode5C13.mode	@ltx/gr_gr_cog/me.m08.d27:alt1.meMA.Ode5C13.mode
ltx/gr_redirects_goarch/me.m08.d27:alt1.meMA.Ode5C13.ode	@ltx/gr_gr_cog/me.m08.d27:alt1.meMA.Ode5C13.ode
ltx/gr_redirects_goarch/me.m08.d27:alt1.meMA.Ode5C13.text	@ltx/gr_gr_cog/me.m08.d27:alt1.meMA.Ode5C13.text
ltx/gr_redirects_goarch/me.m08.d27:alt1.meMA.Ode5C1T.incipit	@ltx/gr_gr_cog/me.m08.d27:alt1.meMA.Ode5C1T.incipit
ltx/gr_redirects_goarch/me.m08.d27:alt1.meMA.Ode5C1T.melody	@ltx/gr_gr_cog/me.m08.d27:alt1.meMA.Ode5C1T.melody
ltx/gr_redirects_goarch/me.m08.d27:alt1.meMA.Ode5C1T.mode	@ltx/gr_gr_cog/me.m08.d27:alt1.meMA.Ode5C1T.mode
ltx/gr_redirects_goarch/me.m08.d27:alt1.meMA.Ode5C1T.ode	@ltx/gr_gr_cog/me.m08.d27:alt1.meMA.Ode5C1T.ode
ltx/gr_redirects_goarch/me.m08.d27:alt1.meMA.Ode5C1T.text	@ltx/gr_gr_cog/me.m08.d27:alt1.meMA.Ode5C1T.text
ltx/gr_redirects_goarch/me.m08.d27:alt1.meMA.Ode6C11.greekmelody	@ltx/gr_gr_cog/me.m08.d27:alt1.meMA.Ode6C11.greekmelody
ltx/gr_redirects_goarch/me.m08.d27:alt1.meMA.Ode6C11.incipit	@ltx/gr_gr_cog/me.m08.d27:alt1.meMA.Ode6C11.incipit
ltx/gr_redirects_goarch/me.m08.d27:alt1.meMA.Ode6C11.melody	@ltx/gr_gr_cog/me.m08.d27:alt1.meMA.Ode6C11.melody
ltx/gr_redirects_goarch/me.m08.d27:alt1.meMA.Ode6C11.mode	@ltx/gr_gr_cog/me.m08.d27:alt1.meMA.Ode6C11.mode
ltx/gr_redirects_goarch/me.m08.d27:alt1.meMA.Ode6C11.ode	@ltx/gr_gr_cog/me.m08.d27:alt1.meMA.Ode6C11.ode
ltx/gr_redirects_goarch/me.m08.d27:alt1.meMA.Ode6C11.text	@ltx/gr_gr_cog/me.m08.d27:alt1.meMA.Ode6C11.text
ltx/gr_redirects_goarch/me.m08.d27:alt1.meMA.Ode6C12.incipit	@ltx/gr_gr_cog/me.m08.d27:alt1.meMA.Ode6C12.incipit
ltx/gr_redirects_goarch/me.m08.d27:alt1.meMA.Ode6C12.melody	@ltx/gr_gr_cog/me.m08.d27:alt1.meMA.Ode6C12.melody
ltx/gr_redirects_goarch/me.m08.d27:alt1.meMA.Ode6C12.mode	@ltx/gr_gr_cog/me.m08.d27:alt1.meMA.Ode6C12.mode
ltx/gr_redirects_goarch/me.m08.d27:alt1.meMA.Ode6C12.ode	@ltx/gr_gr_cog/me.m08.d27:alt1.meMA.Ode6C12.ode
ltx/gr_redirects_goarch/me.m08.d27:alt1.meMA.Ode6C12.text	@ltx/gr_gr_cog/me.m08.d27:alt1.meMA.Ode6C12.text
ltx/gr_redirects_goarch/me.m08.d27:alt1.meMA.Ode6C13.incipit	@ltx/gr_gr_cog/me.m08.d27:alt1.meMA.Ode6C13.incipit
ltx/gr_redirects_goarch/me.m08.d27:alt1.meMA.Ode6C13.melody	@ltx/gr_gr_cog/me.m08.d27:alt1.meMA.Ode6C13.melody
ltx/gr_redirects_goarch/me.m08.d27:alt1.meMA.Ode6C13.mode	@ltx/gr_gr_cog/me.m08.d27:alt1.meMA.Ode6C13.mode
ltx/gr_redirects_goarch/me.m08.d27:alt1.meMA.Ode6C13.ode	@ltx/gr_gr_cog/me.m08.d27:alt1.meMA.Ode6C13.ode
ltx/gr_redirects_goarch/me.m08.d27:alt1.meMA.Ode6C13.text	@ltx/gr_gr_cog/me.m08.d27:alt1.meMA.Ode6C13.text
ltx/gr_redirects_goarch/me.m08.d27:alt1.meMA.Ode6C1T.incipit	@ltx/gr_gr_cog/me.m08.d27:alt1.meMA.Ode6C1T.incipit
ltx/gr_redirects_goarch/me.m08.d27:alt1.meMA.Ode6C1T.melody	@ltx/gr_gr_cog/me.m08.d27:alt1.meMA.Ode6C1T.melody
ltx/gr_redirects_goarch/me.m08.d27:alt1.meMA.Ode6C1T.mode	@ltx/gr_gr_cog/me.m08.d27:alt1.meMA.Ode6C1T.mode
ltx/gr_redirects_goarch/me.m08.d27:alt1.meMA.Ode6C1T.ode	@ltx/gr_gr_cog/me.m08.d27:alt1.meMA.Ode6C1T.ode
ltx/gr_redirects_goarch/me.m08.d27:alt1.meMA.Ode6C1T.text	@ltx/gr_gr_cog/me.m08.d27:alt1.meMA.Ode6C1T.text
ltx/gr_redirects_goarch/me.m08.d27:alt1.meMA.Ode7C11.greekmelody	@ltx/gr_gr_cog/me.m08.d27:alt1.meMA.Ode7C11.greekmelody
ltx/gr_redirects_goarch/me.m08.d27:alt1.meMA.Ode7C11.incipit	@ltx/gr_gr_cog/me.m08.d27:alt1.meMA.Ode7C11.incipit
ltx/gr_redirects_goarch/me.m08.d27:alt1.meMA.Ode7C11.melody	@ltx/gr_gr_cog/me.m08.d27:alt1.meMA.Ode7C11.melody
ltx/gr_redirects_goarch/me.m08.d27:alt1.meMA.Ode7C11.mode	@ltx/gr_gr_cog/me.m08.d27:alt1.meMA.Ode7C11.mode
ltx/gr_redirects_goarch/me.m08.d27:alt1.meMA.Ode7C11.ode	@ltx/gr_gr_cog/me.m08.d27:alt1.meMA.Ode7C11.ode
ltx/gr_redirects_goarch/me.m08.d27:alt1.meMA.Ode7C11.text	@ltx/gr_gr_cog/me.m08.d27:alt1.meMA.Ode7C11.text
ltx/gr_redirects_goarch/me.m08.d27:alt1.meMA.Ode7C12.incipit	@ltx/gr_gr_cog/me.m08.d27:alt1.meMA.Ode7C12.incipit
ltx/gr_redirects_goarch/me.m08.d27:alt1.meMA.Ode7C12.melody	@ltx/gr_gr_cog/me.m08.d27:alt1.meMA.Ode7C12.melody
ltx/gr_redirects_goarch/me.m08.d27:alt1.meMA.Ode7C12.mode	@ltx/gr_gr_cog/me.m08.d27:alt1.meMA.Ode7C12.mode
ltx/gr_redirects_goarch/me.m08.d27:alt1.meMA.Ode7C12.ode	@ltx/gr_gr_cog/me.m08.d27:alt1.meMA.Ode7C12.ode
ltx/gr_redirects_goarch/me.m08.d27:alt1.meMA.Ode7C12.text	@ltx/gr_gr_cog/me.m08.d27:alt1.meMA.Ode7C12.text
ltx/gr_redirects_goarch/me.m08.d27:alt1.meMA.Ode7C13.incipit	@ltx/gr_gr_cog/me.m08.d27:alt1.meMA.Ode7C13.incipit
ltx/gr_redirects_goarch/me.m08.d27:alt1.meMA.Ode7C13.melody	@ltx/gr_gr_cog/me.m08.d27:alt1.meMA.Ode7C13.melody
ltx/gr_redirects_goarch/me.m08.d27:alt1.meMA.Ode7C13.mode	@ltx/gr_gr_cog/me.m08.d27:alt1.meMA.Ode7C13.mode
ltx/gr_redirects_goarch/me.m08.d27:alt1.meMA.Ode7C13.ode	@ltx/gr_gr_cog/me.m08.d27:alt1.meMA.Ode7C13.ode
ltx/gr_redirects_goarch/me.m08.d27:alt1.meMA.Ode7C13.text	@ltx/gr_gr_cog/me.m08.d27:alt1.meMA.Ode7C13.text
ltx/gr_redirects_goarch/me.m08.d27:alt1.meMA.Ode7C1T.incipit	@ltx/gr_gr_cog/me.m08.d27:alt1.meMA.Ode7C1T.incipit
ltx/gr_redirects_goarch/me.m08.d27:alt1.meMA.Ode7C1T.melody	@ltx/gr_gr_cog/me.m08.d27:alt1.meMA.Ode7C1T.melody
ltx/gr_redirects_goarch/me.m08.d27:alt1.meMA.Ode7C1T.mode	@ltx/gr_gr_cog/me.m08.d27:alt1.meMA.Ode7C1T.mode
ltx/gr_redirects_goarch/me.m08.d27:alt1.meMA.Ode7C1T.ode	@ltx/gr_gr_cog/me.m08.d27:alt1.meMA.Ode7C1T.ode
ltx/gr_redirects_goarch/me.m08.d27:alt1.meMA.Ode7C1T.text	@ltx/gr_gr_cog/me.m08.d27:alt1.meMA.Ode7C1T.text
ltx/gr_redirects_goarch/me.m08.d27:alt1.meMA.Ode8C11.greekmelody	@ltx/gr_gr_cog/me.m08.d27:alt1.meMA.Ode8C11.greekmelody
ltx/gr_redirects_goarch/me.m08.d27:alt1.meMA.Ode8C11.incipit	@ltx/gr_gr_cog/me.m08.d27:alt1.meMA.Ode8C11.incipit
ltx/gr_redirects_goarch/me.m08.d27:alt1.meMA.Ode8C11.melody	@ltx/gr_gr_cog/me.m08.d27:alt1.meMA.Ode8C11.melody
ltx/gr_redirects_goarch/me.m08.d27:alt1.meMA.Ode8C11.mode	@ltx/gr_gr_cog/me.m08.d27:alt1.meMA.Ode8C11.mode
ltx/gr_redirects_goarch/me.m08.d27:alt1.meMA.Ode8C11.ode	@ltx/gr_gr_cog/me.m08.d27:alt1.meMA.Ode8C11.ode
ltx/gr_redirects_goarch/me.m08.d27:alt1.meMA.Ode8C11.text	@ltx/gr_gr_cog/me.m08.d27:alt1.meMA.Ode8C11.text
ltx/gr_redirects_goarch/me.m08.d27:alt1.meMA.Ode8C12.incipit	@ltx/gr_gr_cog/me.m08.d27:alt1.meMA.Ode8C12.incipit
ltx/gr_redirects_goarch/me.m08.d27:alt1.meMA.Ode8C12.melody	@ltx/gr_gr_cog/me.m08.d27:alt1.meMA.Ode8C12.melody
ltx/gr_redirects_goarch/me.m08.d27:alt1.meMA.Ode8C12.mode	@ltx/gr_gr_cog/me.m08.d27:alt1.meMA.Ode8C12.mode
ltx/gr_redirects_goarch/me.m08.d27:alt1.meMA.Ode8C12.ode	@ltx/gr_gr_cog/me.m08.d27:alt1.meMA.Ode8C12.ode
ltx/gr_redirects_goarch/me.m08.d27:alt1.meMA.Ode8C12.text	@ltx/gr_gr_cog/me.m08.d27:alt1.meMA.Ode8C12.text
ltx/gr_redirects_goarch/me.m08.d27:alt1.meMA.Ode8C13.incipit	@ltx/gr_gr_cog/me.m08.d27:alt1.meMA.Ode8C13.incipit
ltx/gr_redirects_goarch/me.m08.d27:alt1.meMA.Ode8C13.melody	@ltx/gr_gr_cog/me.m08.d27:alt1.meMA.Ode8C13.melody
ltx/gr_redirects_goarch/me.m08.d27:alt1.meMA.Ode8C13.mode	@ltx/gr_gr_cog/me.m08.d27:alt1.meMA.Ode8C13.mode
ltx/gr_redirects_goarch/me.m08.d27:alt1.meMA.Ode8C13.ode	@ltx/gr_gr_cog/me.m08.d27:alt1.meMA.Ode8C13.ode
ltx/gr_redirects_goarch/me.m08.d27:alt1.meMA.Ode8C13.text	@ltx/gr_gr_cog/me.m08.d27:alt1.meMA.Ode8C13.text
ltx/gr_redirects_goarch/me.m08.d27:alt1.meMA.Ode8C1T.incipit	@ltx/gr_gr_cog/me.m08.d27:alt1.meMA.Ode8C1T.incipit
ltx/gr_redirects_goarch/me.m08.d27:alt1.meMA.Ode8C1T.melody	@ltx/gr_gr_cog/me.m08.d27:alt1.meMA.Ode8C1T.melody
ltx/gr_redirects_goarch/me.m08.d27:alt1.meMA.Ode8C1T.mode	@ltx/gr_gr_cog/me.m08.d27:alt1.meMA.Ode8C1T.mode
ltx/gr_redirects_goarch/me.m08.d27:alt1.meMA.Ode8C1T.ode	@ltx/gr_gr_cog/me.m08.d27:alt1.meMA.Ode8C1T.ode
ltx/gr_redirects_goarch/me.m08.d27:alt1.meMA.Ode8C1T.text	@ltx/gr_gr_cog/me.m08.d27:alt1.meMA.Ode8C1T.text
ltx/gr_redirects_goarch/me.m08.d27:alt1.meMA.Ode9C11.greekmelody	@ltx/gr_gr_cog/me.m08.d27:alt1.meMA.Ode9C11.greekmelody
ltx/gr_redirects_goarch/me.m08.d27:alt1.meMA.Ode9C11.incipit	@ltx/gr_gr_cog/me.m08.d27:alt1.meMA.Ode9C11.incipit
ltx/gr_redirects_goarch/me.m08.d27:alt1.meMA.Ode9C11.melody	@ltx/gr_gr_cog/me.m08.d27:alt1.meMA.Ode9C11.melody
ltx/gr_redirects_goarch/me.m08.d27:alt1.meMA.Ode9C11.mode	@ltx/gr_gr_cog/me.m08.d27:alt1.meMA.Ode9C11.mode
ltx/gr_redirects_goarch/me.m08.d27:alt1.meMA.Ode9C11.ode	@ltx/gr_gr_cog/me.m08.d27:alt1.meMA.Ode9C11.ode
ltx/gr_redirects_goarch/me.m08.d27:alt1.meMA.Ode9C11.text	@ltx/gr_gr_cog/me.m08.d27:alt1.meMA.Ode9C11.text
ltx/gr_redirects_goarch/me.m08.d27:alt1.meMA.Ode9C12.incipit	@ltx/gr_gr_cog/me.m08.d27:alt1.meMA.Ode9C12.incipit
ltx/gr_redirects_goarch/me.m08.d27:alt1.meMA.Ode9C12.melody	@ltx/gr_gr_cog/me.m08.d27:alt1.meMA.Ode9C12.melody
ltx/gr_redirects_goarch/me.m08.d27:alt1.meMA.Ode9C12.mode	@ltx/gr_gr_cog/me.m08.d27:alt1.meMA.Ode9C12.mode
ltx/gr_redirects_goarch/me.m08.d27:alt1.meMA.Ode9C12.ode	@ltx/gr_gr_cog/me.m08.d27:alt1.meMA.Ode9C12.ode
ltx/gr_redirects_goarch/me.m08.d27:alt1.meMA.Ode9C12.text	@ltx/gr_gr_cog/me.m08.d27:alt1.meMA.Ode9C12.text
ltx/gr_redirects_goarch/me.m08.d27:alt1.meMA.Ode9C13.incipit	@ltx/gr_gr_cog/me.m08.d27:alt1.meMA.Ode9C13.incipit
ltx/gr_redirects_goarch/me.m08.d27:alt1.meMA.Ode9C13.melody	@ltx/gr_gr_cog/me.m08.d27:alt1.meMA.Ode9C13.melody
ltx/gr_redirects_goarch/me.m08.d27:alt1.meMA.Ode9C13.mode	@ltx/gr_gr_cog/me.m08.d27:alt1.meMA.Ode9C13.mode
ltx/gr_redirects_goarch/me.m08.d27:alt1.meMA.Ode9C13.ode	@ltx/gr_gr_cog/me.m08.d27:alt1.meMA.Ode9C13.ode
ltx/gr_redirects_goarch/me.m08.d27:alt1.meMA.Ode9C13.text	@ltx/gr_gr_cog/me.m08.d27:alt1.meMA.Ode9C13.text
ltx/gr_redirects_goarch/me.m08.d27:alt1.meMA.Ode9C14.incipit	@ltx/gr_gr_cog/me.m08.d27:alt1.meMA.Ode9C14.incipit
ltx/gr_redirects_goarch/me.m08.d27:alt1.meMA.Ode9C14.melody	@ltx/gr_gr_cog/me.m08.d27:alt1.meMA.Ode9C14.melody
ltx/gr_redirects_goarch/me.m08.d27:alt1.meMA.Ode9C14.mode	@ltx/gr_gr_cog/me.m08.d27:alt1.meMA.Ode9C14.mode
ltx/gr_redirects_goarch/me.m08.d27:alt1.meMA.Ode9C14.ode	@ltx/gr_gr_cog/me.m08.d27:alt1.meMA.Ode9C14.ode
ltx/gr_redirects_goarch/me.m08.d27:alt1.meMA.Ode9C14.text	@ltx/gr_gr_cog/me.m08.d27:alt1.meMA.Ode9C14.text
ltx/gr_redirects_goarch/me.m08.d27:alt1.meMA.Ode9C1T.incipit	@ltx/gr_gr_cog/me.m08.d27:alt1.meMA.Ode9C1T.incipit
ltx/gr_redirects_goarch/me.m08.d27:alt1.meMA.Ode9C1T.melody	@ltx/gr_gr_cog/me.m08.d27:alt1.meMA.Ode9C1T.melody
ltx/gr_redirects_goarch/me.m08.d27:alt1.meMA.Ode9C1T.mode	@ltx/gr_gr_cog/me.m08.d27:alt1.meMA.Ode9C1T.mode
ltx/gr_redirects_goarch/me.m08.d27:alt1.meMA.Ode9C1T.ode	@ltx/gr_gr_cog/me.m08.d27:alt1.meMA.Ode9C1T.ode
ltx/gr_redirects_goarch/me.m08.d27:alt1.meMA.Ode9C1T.text	@ltx/gr_gr_cog/me.m08.d27:alt1.meMA.Ode9C1T.text
ltx/gr_redirects_goarch/me.m08.d27:alt1.meMA.Ode9K2.incipit	@ltx/gr_gr_cog/me.m08.d27:alt1.meMA.Ode9K2.incipit
ltx/gr_redirects_goarch/me.m08.d27:alt1.meMA.Ode9K2.melody	@ltx/gr_gr_cog/me.m08.d27:alt1.meMA.Ode9K2.melody
ltx/gr_redirects_goarch/me.m08.d27:alt1.meMA.Ode9K2.mode	@ltx/gr_gr_cog/me.m08.d27:alt1.meMA.Ode9K2.mode
ltx/gr_redirects_goarch/me.m08.d27:alt1.meMA.Ode9K2.ode	@ltx/gr_gr_cog/me.m08.d27:alt1.meMA.Ode9K2.ode
ltx/gr_redirects_goarch/me.m08.d27:alt1.meMA.Ode9K2.text	@ltx/gr_gr_cog/me.m08.d27:alt1.meMA.Ode9K2.text
ltx/gr_redirects_goarch/me.m08.d27:alt1.meMA.Oikos1.text	@ltx/gr_gr_cog/me.m08.d27:alt1.meMA.Oikos1.text
ltx/gr_redirects_goarch/me.m08.d27:alt1.meMA.PostGospelBoth.incipit	@ltx/gr_gr_cog/me.m08.d27:alt1.meMA.PostGospelBoth.incipit
ltx/gr_redirects_goarch/me.m08.d27:alt1.meMA.PostGospelBoth.melody	@ltx/gr_gr_cog/me.m08.d27:alt1.meMA.PostGospelBoth.melody
ltx/gr_redirects_goarch/me.m08.d27:alt1.meMA.PostGospelBoth.mode	@ltx/gr_gr_cog/me.m08.d27:alt1.meMA.PostGospelBoth.mode
ltx/gr_redirects_goarch/me.m08.d27:alt1.meMA.PostGospelBoth.text	@ltx/gr_gr_cog/me.m08.d27:alt1.meMA.PostGospelBoth.text
ltx/gr_redirects_goarch/me.m08.d27:alt1.meMA.PostGospelGlory.incipit	@ltx/gr_gr_cog/me.m08.d27:alt1.meMA.PostGospelGlory.incipit
ltx/gr_redirects_goarch/me.m08.d27:alt1.meMA.PostGospelGlory.melody	@ltx/gr_gr_cog/me.m08.d27:alt1.meMA.PostGospelGlory.melody
ltx/gr_redirects_goarch/me.m08.d27:alt1.meMA.PostGospelGlory.mode	@ltx/gr_gr_cog/me.m08.d27:alt1.meMA.PostGospelGlory.mode
ltx/gr_redirects_goarch/me.m08.d27:alt1.meMA.PostGospelGlory.text	@ltx/gr_gr_cog/me.m08.d27:alt1.meMA.PostGospelGlory.text
ltx/gr_redirects_goarch/me.m08.d27:alt1.meMA.PostGospelIdiomelon.incipit	@ltx/gr_gr_cog/me.m08.d27:alt1.meMA.PostGospelIdiomelon.incipit
ltx/gr_redirects_goarch/me.m08.d27:alt1.meMA.PostGospelIdiomelon.melody	@ltx/gr_gr_cog/me.m08.d27:alt1.meMA.PostGospelIdiomelon.melody
ltx/gr_redirects_goarch/me.m08.d27:alt1.meMA.PostGospelIdiomelon.mode	@ltx/gr_gr_cog/me.m08.d27:alt1.meMA.PostGospelIdiomelon.mode
ltx/gr_redirects_goarch/me.m08.d27:alt1.meMA.PostGospelIdiomelon.text	@ltx/gr_gr_cog/me.m08.d27:alt1.meMA.PostGospelIdiomelon.text
ltx/gr_redirects_goarch/me.m08.d27:alt1.meSV.AposBoth.incipit	@ltx/gr_gr_cog/me.m08.d27:alt1.meSV.AposBoth.incipit
ltx/gr_redirects_goarch/me.m08.d27:alt1.meSV.AposBoth.melody	@ltx/gr_gr_cog/me.m08.d27:alt1.meSV.AposBoth.melody
ltx/gr_redirects_goarch/me.m08.d27:alt1.meSV.AposBoth.mode	@ltx/gr_gr_cog/me.m08.d27:alt1.meSV.AposBoth.mode
ltx/gr_redirects_goarch/me.m08.d27:alt1.meSV.AposBoth.text	@ltx/gr_gr_cog/me.m08.d27:alt1.meSV.AposBoth.text
ltx/gr_redirects_goarch/me.m08.d27:alt1.meSV.AposGlory.incipit	@ltx/gr_gr_cog/me.m08.d27:alt1.meSV.AposGlory.incipit
ltx/gr_redirects_goarch/me.m08.d27:alt1.meSV.AposGlory.melody	@ltx/gr_gr_cog/me.m08.d27:alt1.meSV.AposGlory.melody
ltx/gr_redirects_goarch/me.m08.d27:alt1.meSV.AposGlory.mode	@ltx/gr_gr_cog/me.m08.d27:alt1.meSV.AposGlory.mode
ltx/gr_redirects_goarch/me.m08.d27:alt1.meSV.AposGlory.text	@ltx/gr_gr_cog/me.m08.d27:alt1.meSV.AposGlory.text
ltx/gr_redirects_goarch/me.m08.d27:alt1.meSV.Aposticha1.greekmelody	@ltx/gr_gr_cog/me.m08.d27:alt1.meSV.Aposticha1.greekmelody
ltx/gr_redirects_goarch/me.m08.d27:alt1.meSV.Aposticha1.incipit	@ltx/gr_gr_cog/me.m08.d27:alt1.meSV.Aposticha1.incipit
ltx/gr_redirects_goarch/me.m08.d27:alt1.meSV.Aposticha1.melody	@ltx/gr_gr_cog/me.m08.d27:alt1.meSV.Aposticha1.melody
ltx/gr_redirects_goarch/me.m08.d27:alt1.meSV.Aposticha1.mode	@ltx/gr_gr_cog/me.m08.d27:alt1.meSV.Aposticha1.mode
ltx/gr_redirects_goarch/me.m08.d27:alt1.meSV.Aposticha1.text	@ltx/gr_gr_cog/me.m08.d27:alt1.meSV.Aposticha1.text
ltx/gr_redirects_goarch/me.m08.d27:alt1.meSV.Aposticha2.incipit	@ltx/gr_gr_cog/me.m08.d27:alt1.meSV.Aposticha2.incipit
ltx/gr_redirects_goarch/me.m08.d27:alt1.meSV.Aposticha2.melody	@ltx/gr_gr_cog/me.m08.d27:alt1.meSV.Aposticha2.melody
ltx/gr_redirects_goarch/me.m08.d27:alt1.meSV.Aposticha2.mode	@ltx/gr_gr_cog/me.m08.d27:alt1.meSV.Aposticha2.mode
ltx/gr_redirects_goarch/me.m08.d27:alt1.meSV.Aposticha2.text	@ltx/gr_gr_cog/me.m08.d27:alt1.meSV.Aposticha2.text
ltx/gr_redirects_goarch/me.m08.d27:alt1.meSV.Aposticha3.incipit	@ltx/gr_gr_cog/me.m08.d27:alt1.meSV.Aposticha3.incipit
ltx/gr_redirects_goarch/me.m08.d27:alt1.meSV.Aposticha3.melody	@ltx/gr_gr_cog/me.m08.d27:alt1.meSV.Aposticha3.melody
ltx/gr_redirects_goarch/me.m08.d27:alt1.meSV.Aposticha3.mode	@ltx/gr_gr_cog/me.m08.d27:alt1.meSV.Aposticha3.mode
ltx/gr_redirects_goarch/me.m08.d27:alt1.meSV.Aposticha3.text	@ltx/gr_gr_cog/me.m08.d27:alt1.meSV.Aposticha3.text
ltx/gr_redirects_goarch/me.m08.d27:alt1.meSV.SticBoth.incipit	@ltx/gr_gr_cog/me.m08.d27:alt1.meSV.SticBoth.incipit
ltx/gr_redirects_goarch/me.m08.d27:alt1.meSV.SticBoth.melody	@ltx/gr_gr_cog/me.m08.d27:alt1.meSV.SticBoth.melody
ltx/gr_redirects_goarch/me.m08.d27:alt1.meSV.SticBoth.mode	@ltx/gr_gr_cog/me.m08.d27:alt1.meSV.SticBoth.mode
ltx/gr_redirects_goarch/me.m08.d27:alt1.meSV.SticBoth.text	@ltx/gr_gr_cog/me.m08.d27:alt1.meSV.SticBoth.text
ltx/gr_redirects_goarch/me.m08.d27:alt1.meSV.SticGlory.incipit	@ltx/gr_gr_cog/me.m08.d27:alt1.meSV.SticGlory.incipit
ltx/gr_redirects_goarch/me.m08.d27:alt1.meSV.SticGlory.melody	@ltx/gr_gr_cog/me.m08.d27:alt1.meSV.SticGlory.melody
ltx/gr_redirects_goarch/me.m08.d27:alt1.meSV.SticGlory.mode	@ltx/gr_gr_cog/me.m08.d27:alt1.meSV.SticGlory.mode
ltx/gr_redirects_goarch/me.m08.d27:alt1.meSV.SticGlory.text	@ltx/gr_gr_cog/me.m08.d27:alt1.meSV.SticGlory.text
ltx/gr_redirects_goarch/me.m08.d27:alt1.meSV.Stichera1.greekmelody	@ltx/gr_gr_cog/me.m08.d27:alt1.meSV.Stichera1.greekmelody
ltx/gr_redirects_goarch/me.m08.d27:alt1.meSV.Stichera1.incipit	@ltx/gr_gr_cog/me.m08.d27:alt1.meSV.Stichera1.incipit
ltx/gr_redirects_goarch/me.m08.d27:alt1.meSV.Stichera1.melody	@ltx/gr_gr_cog/me.m08.d27:alt1.meSV.Stichera1.melody
ltx/gr_redirects_goarch/me.m08.d27:alt1.meSV.Stichera1.mode	@ltx/gr_gr_cog/me.m08.d27:alt1.meSV.Stichera1.mode
ltx/gr_redirects_goarch/me.m08.d27:alt1.meSV.Stichera1.text	@ltx/gr_gr_cog/me.m08.d27:alt1.meSV.Stichera1.text
ltx/gr_redirects_goarch/me.m08.d27:alt1.meSV.Stichera2.incipit	@ltx/gr_gr_cog/me.m08.d27:alt1.meSV.Stichera2.incipit
ltx/gr_redirects_goarch/me.m08.d27:alt1.meSV.Stichera2.melody	@ltx/gr_gr_cog/me.m08.d27:alt1.meSV.Stichera2.melody
ltx/gr_redirects_goarch/me.m08.d27:alt1.meSV.Stichera2.mode	@ltx/gr_gr_cog/me.m08.d27:alt1.meSV.Stichera2.mode
ltx/gr_redirects_goarch/me.m08.d27:alt1.meSV.Stichera2.text	@ltx/gr_gr_cog/me.m08.d27:alt1.meSV.Stichera2.text
ltx/gr_redirects_goarch/me.m08.d27:alt1.meSV.Stichera3.incipit	@ltx/gr_gr_cog/me.m08.d27:alt1.meSV.Stichera3.incipit
ltx/gr_redirects_goarch/me.m08.d27:alt1.meSV.Stichera3.melody	@ltx/gr_gr_cog/me.m08.d27:alt1.meSV.Stichera3.melody
ltx/gr_redirects_goarch/me.m08.d27:alt1.meSV.Stichera3.mode	@ltx/gr_gr_cog/me.m08.d27:alt1.meSV.Stichera3.mode
ltx/gr_redirects_goarch/me.m08.d27:alt1.meSV.Stichera3.text	@ltx/gr_gr_cog/me.m08.d27:alt1.meSV.Stichera3.text
ltx/gr_redirects_goarch/me.m08.d27:alt1.meSV.Stichera4.greekmelody	@ltx/gr_gr_cog/me.m08.d27:alt1.meSV.Stichera4.greekmelody
ltx/gr_redirects_goarch/me.m08.d27:alt1.meSV.Stichera4.incipit	@ltx/gr_gr_cog/me.m08.d27:alt1.meSV.Stichera4.incipit
ltx/gr_redirects_goarch/me.m08.d27:alt1.meSV.Stichera4.melody	@ltx/gr_gr_cog/me.m08.d27:alt1.meSV.Stichera4.melody
ltx/gr_redirects_goarch/me.m08.d27:alt1.meSV.Stichera4.mode	@ltx/gr_gr_cog/me.m08.d27:alt1.meSV.Stichera4.mode
ltx/gr_redirects_goarch/me.m08.d27:alt1.meSV.Stichera4.text	@ltx/gr_gr_cog/me.m08.d27:alt1.meSV.Stichera4.text
ltx/gr_redirects_goarch/me.m08.d27:alt1.meVE.Apolytikion1.greekmelody	@ltx/gr_gr_cog/me.m08.d27:alt1.meVE.Apolytikion1.greekmelody
ltx/gr_redirects_goarch/me.m08.d27:alt1.meVE.Apolytikion1.incipit	@ltx/gr_gr_cog/me.m08.d27:alt1.meVE.Apolytikion1.incipit
ltx/gr_redirects_goarch/me.m08.d27:alt1.meVE.Apolytikion1.melody	@ltx/gr_gr_cog/me.m08.d27:alt1.meVE.Apolytikion1.melody
ltx/gr_redirects_goarch/me.m08.d27:alt1.meVE.Apolytikion1.mode	@ltx/gr_gr_cog/me.m08.d27:alt1.meVE.Apolytikion1.mode
ltx/gr_redirects_goarch/me.m08.d27:alt1.meVE.Apolytikion1.text	@ltx/gr_gr_cog/me.m08.d27:alt1.meVE.Apolytikion1.text
ltx/gr_redirects_goarch/me.m08.d27:alt1.meVE.Apolytikion2.greekmelody	@ltx/gr_gr_cog/me.m08.d27:alt1.meVE.Apolytikion2.greekmelody
ltx/gr_redirects_goarch/me.m08.d27:alt1.meVE.Apolytikion2.incipit	@ltx/gr_gr_cog/me.m08.d27:alt1.meVE.Apolytikion2.incipit
ltx/gr_redirects_goarch/me.m08.d27:alt1.meVE.Apolytikion2.melody	@ltx/gr_gr_cog/me.m08.d27:alt1.meVE.Apolytikion2.melody
ltx/gr_redirects_goarch/me.m08.d27:alt1.meVE.Apolytikion2.mode	@ltx/gr_gr_cog/me.m08.d27:alt1.meVE.Apolytikion2.mode
ltx/gr_redirects_goarch/me.m08.d27:alt1.meVE.Apolytikion2.text	@ltx/gr_gr_cog/me.m08.d27:alt1.meVE.Apolytikion2.text
ltx/gr_redirects_goarch/me.m08.d27:alt1.meVE.AposGlory.incipit	@ltx/gr_gr_cog/me.m08.d27:alt1.meVE.AposGlory.incipit
ltx/gr_redirects_goarch/me.m08.d27:alt1.meVE.AposGlory.melody	@ltx/gr_gr_cog/me.m08.d27:alt1.meVE.AposGlory.melody
ltx/gr_redirects_goarch/me.m08.d27:alt1.meVE.AposGlory.mode	@ltx/gr_gr_cog/me.m08.d27:alt1.meVE.AposGlory.mode
ltx/gr_redirects_goarch/me.m08.d27:alt1.meVE.AposGlory.text	@ltx/gr_gr_cog/me.m08.d27:alt1.meVE.AposGlory.text
ltx/gr_redirects_goarch/me.m08.d27:alt1.meVE.AposTheotokion.incipit	@ltx/gr_gr_cog/me.m08.d27:alt1.meVE.AposTheotokion.incipit
ltx/gr_redirects_goarch/me.m08.d27:alt1.meVE.AposTheotokion.melody	@ltx/gr_gr_cog/me.m08.d27:alt1.meVE.AposTheotokion.melody
ltx/gr_redirects_goarch/me.m08.d27:alt1.meVE.AposTheotokion.mode	@ltx/gr_gr_cog/me.m08.d27:alt1.meVE.AposTheotokion.mode
ltx/gr_redirects_goarch/me.m08.d27:alt1.meVE.AposTheotokion.text	@ltx/gr_gr_cog/me.m08.d27:alt1.meVE.AposTheotokion.text
ltx/gr_redirects_goarch/me.m08.d27:alt1.meVE.Aposticha1.greekmelody	@ltx/gr_gr_cog/me.m08.d27:alt1.meVE.Aposticha1.greekmelody
ltx/gr_redirects_goarch/me.m08.d27:alt1.meVE.Aposticha1.incipit	@ltx/gr_gr_cog/me.m08.d27:alt1.meVE.Aposticha1.incipit
ltx/gr_redirects_goarch/me.m08.d27:alt1.meVE.Aposticha1.melody	@ltx/gr_gr_cog/me.m08.d27:alt1.meVE.Aposticha1.melody
ltx/gr_redirects_goarch/me.m08.d27:alt1.meVE.Aposticha1.mode	@ltx/gr_gr_cog/me.m08.d27:alt1.meVE.Aposticha1.mode
ltx/gr_redirects_goarch/me.m08.d27:alt1.meVE.Aposticha1.text	@ltx/gr_gr_cog/me.m08.d27:alt1.meVE.Aposticha1.text
ltx/gr_redirects_goarch/me.m08.d27:alt1.meVE.Aposticha2.incipit	@ltx/gr_gr_cog/me.m08.d27:alt1.meVE.Aposticha2.incipit
ltx/gr_redirects_goarch/me.m08.d27:alt1.meVE.Aposticha2.melody	@ltx/gr_gr_cog/me.m08.d27:alt1.meVE.Aposticha2.melody
ltx/gr_redirects_goarch/me.m08.d27:alt1.meVE.Aposticha2.mode	@ltx/gr_gr_cog/me.m08.d27:alt1.meVE.Aposticha2.mode
ltx/gr_redirects_goarch/me.m08.d27:alt1.meVE.Aposticha2.text	@ltx/gr_gr_cog/me.m08.d27:alt1.meVE.Aposticha2.text
ltx/gr_redirects_goarch/me.m08.d27:alt1.meVE.Aposticha3.incipit	@ltx/gr_gr_cog/me.m08.d27:alt1.meVE.Aposticha3.incipit
ltx/gr_redirects_goarch/me.m08.d27:alt1.meVE.Aposticha3.melody	@ltx/gr_gr_cog/me.m08.d27:alt1.meVE.Aposticha3.melody
ltx/gr_redirects_goarch/me.m08.d27:alt1.meVE.Aposticha3.mode	@ltx/gr_gr_cog/me.m08.d27:alt1.meVE.Aposticha3.mode
ltx/gr_redirects_goarch/me.m08.d27:alt1.meVE.Aposticha3.text	@ltx/gr_gr_cog/me.m08.d27:alt1.meVE.Aposticha3.text
ltx/gr_redirects_goarch/me.m08.d27:alt1.meVE.Lity1.incipit	@ltx/gr_gr_cog/me.m08.d27:alt1.meVE.Lity1.incipit
ltx/gr_redirects_goarch/me.m08.d27:alt1.meVE.Lity1.melody	@ltx/gr_gr_cog/me.m08.d27:alt1.meVE.Lity1.melody
ltx/gr_redirects_goarch/me.m08.d27:alt1.meVE.Lity1.mode	@ltx/gr_gr_cog/me.m08.d27:alt1.meVE.Lity1.mode
ltx/gr_redirects_goarch/me.m08.d27:alt1.meVE.Lity1.text	@ltx/gr_gr_cog/me.m08.d27:alt1.meVE.Lity1.text
ltx/gr_redirects_goarch/me.m08.d27:alt1.meVE.Lity2.incipit	@ltx/gr_gr_cog/me.m08.d27:alt1.meVE.Lity2.incipit
ltx/gr_redirects_goarch/me.m08.d27:alt1.meVE.Lity2.melody	@ltx/gr_gr_cog/me.m08.d27:alt1.meVE.Lity2.melody
ltx/gr_redirects_goarch/me.m08.d27:alt1.meVE.Lity2.mode	@ltx/gr_gr_cog/me.m08.d27:alt1.meVE.Lity2.mode
ltx/gr_redirects_goarch/me.m08.d27:alt1.meVE.Lity2.text	@ltx/gr_gr_cog/me.m08.d27:alt1.meVE.Lity2.text
ltx/gr_redirects_goarch/me.m08.d27:alt1.meVE.Lity3.incipit	@ltx/gr_gr_cog/me.m08.d27:alt1.meVE.Lity3.incipit
ltx/gr_redirects_goarch/me.m08.d27:alt1.meVE.Lity3.melody	@ltx/gr_gr_cog/me.m08.d27:alt1.meVE.Lity3.melody
ltx/gr_redirects_goarch/me.m08.d27:alt1.meVE.Lity3.mode	@ltx/gr_gr_cog/me.m08.d27:alt1.meVE.Lity3.mode
ltx/gr_redirects_goarch/me.m08.d27:alt1.meVE.Lity3.text	@ltx/gr_gr_cog/me.m08.d27:alt1.meVE.Lity3.text
ltx/gr_redirects_goarch/me.m08.d27:alt1.meVE.Lity4.incipit	@ltx/gr_gr_cog/me.m08.d27:alt1.meVE.Lity4.incipit
ltx/gr_redirects_goarch/me.m08.d27:alt1.meVE.Lity4.melody	@ltx/gr_gr_cog/me.m08.d27:alt1.meVE.Lity4.melody
ltx/gr_redirects_goarch/me.m08.d27:alt1.meVE.Lity4.mode	@ltx/gr_gr_cog/me.m08.d27:alt1.meVE.Lity4.mode
ltx/gr_redirects_goarch/me.m08.d27:alt1.meVE.Lity4.text	@ltx/gr_gr_cog/me.m08.d27:alt1.meVE.Lity4.text
ltx/gr_redirects_goarch/me.m08.d27:alt1.meVE.LityBoth.incipit	@ltx/gr_gr_cog/me.m08.d27:alt1.meVE.LityBoth.incipit
ltx/gr_redirects_goarch/me.m08.d27:alt1.meVE.LityBoth.melody	@ltx/gr_gr_cog/me.m08.d27:alt1.meVE.LityBoth.melody
ltx/gr_redirects_goarch/me.m08.d27:alt1.meVE.LityBoth.mode	@ltx/gr_gr_cog/me.m08.d27:alt1.meVE.LityBoth.mode
ltx/gr_redirects_goarch/me.m08.d27:alt1.meVE.LityBoth.text	@ltx/gr_gr_cog/me.m08.d27:alt1.meVE.LityBoth.text
ltx/gr_redirects_goarch/me.m08.d27:alt1.meVE.LityGlory.incipit	@ltx/gr_gr_cog/me.m08.d27:alt1.meVE.LityGlory.incipit
ltx/gr_redirects_goarch/me.m08.d27:alt1.meVE.LityGlory.melody	@ltx/gr_gr_cog/me.m08.d27:alt1.meVE.LityGlory.melody
ltx/gr_redirects_goarch/me.m08.d27:alt1.meVE.LityGlory.mode	@ltx/gr_gr_cog/me.m08.d27:alt1.meVE.LityGlory.mode
ltx/gr_redirects_goarch/me.m08.d27:alt1.meVE.LityGlory.text	@ltx/gr_gr_cog/me.m08.d27:alt1.meVE.LityGlory.text
ltx/gr_redirects_goarch/me.m08.d27:alt1.meVE.SticGlory.incipit	@ltx/gr_gr_cog/me.m08.d27:alt1.meVE.SticGlory.incipit
ltx/gr_redirects_goarch/me.m08.d27:alt1.meVE.SticGlory.melody	@ltx/gr_gr_cog/me.m08.d27:alt1.meVE.SticGlory.melody
ltx/gr_redirects_goarch/me.m08.d27:alt1.meVE.SticGlory.mode	@ltx/gr_gr_cog/me.m08.d27:alt1.meVE.SticGlory.mode
ltx/gr_redirects_goarch/me.m08.d27:alt1.meVE.SticGlory.text	@ltx/gr_gr_cog/me.m08.d27:alt1.meVE.SticGlory.text
ltx/gr_redirects_goarch/me.m08.d27:alt1.meVE.SticTheotokion.incipit	@ltx/gr_gr_cog/me.m08.d27:alt1.meVE.SticTheotokion.incipit
ltx/gr_redirects_goarch/me.m08.d27:alt1.meVE.SticTheotokion.melody	@ltx/gr_gr_cog/me.m08.d27:alt1.meVE.SticTheotokion.melody
ltx/gr_redirects_goarch/me.m08.d27:alt1.meVE.SticTheotokion.mode	@ltx/gr_gr_cog/me.m08.d27:alt1.meVE.SticTheotokion.mode
ltx/gr_redirects_goarch/me.m08.d27:alt1.meVE.SticTheotokion.text	@ltx/gr_gr_cog/me.m08.d27:alt1.meVE.SticTheotokion.text
ltx/gr_redirects_goarch/me.m08.d27:alt1.meVE.Stichera01.greekmelody	@ltx/gr_gr_cog/me.m08.d27:alt1.meVE.Stichera01.greekmelody
ltx/gr_redirects_goarch/me.m08.d27:alt1.meVE.Stichera01.incipit	@ltx/gr_gr_cog/me.m08.d27:alt1.meVE.Stichera01.incipit
ltx/gr_redirects_goarch/me.m08.d27:alt1.meVE.Stichera01.melody	@ltx/gr_gr_cog/me.m08.d27:alt1.meVE.Stichera01.melody
ltx/gr_redirects_goarch/me.m08.d27:alt1.meVE.Stichera01.mode	@ltx/gr_gr_cog/me.m08.d27:alt1.meVE.Stichera01.mode
ltx/gr_redirects_goarch/me.m08.d27:alt1.meVE.Stichera01.text	@ltx/gr_gr_cog/me.m08.d27:alt1.meVE.Stichera01.text
ltx/gr_redirects_goarch/me.m08.d27:alt1.meVE.Stichera02.incipit	@ltx/gr_gr_cog/me.m08.d27:alt1.meVE.Stichera02.incipit
ltx/gr_redirects_goarch/me.m08.d27:alt1.meVE.Stichera02.melody	@ltx/gr_gr_cog/me.m08.d27:alt1.meVE.Stichera02.melody
ltx/gr_redirects_goarch/me.m08.d27:alt1.meVE.Stichera02.mode	@ltx/gr_gr_cog/me.m08.d27:alt1.meVE.Stichera02.mode
ltx/gr_redirects_goarch/me.m08.d27:alt1.meVE.Stichera02.text	@ltx/gr_gr_cog/me.m08.d27:alt1.meVE.Stichera02.text
ltx/gr_redirects_goarch/me.m08.d27:alt1.meVE.Stichera03.incipit	@ltx/gr_gr_cog/me.m08.d27:alt1.meVE.Stichera03.incipit
ltx/gr_redirects_goarch/me.m08.d27:alt1.meVE.Stichera03.melody	@ltx/gr_gr_cog/me.m08.d27:alt1.meVE.Stichera03.melody
ltx/gr_redirects_goarch/me.m08.d27:alt1.meVE.Stichera03.mode	@ltx/gr_gr_cog/me.m08.d27:alt1.meVE.Stichera03.mode
ltx/gr_redirects_goarch/me.m08.d27:alt1.meVE.Stichera03.text	@ltx/gr_gr_cog/me.m08.d27:alt1.meVE.Stichera03.text
ltx/gr_redirects_goarch/me.m08.d27:alt1.meVE.Stichera04.greekmelody	@ltx/gr_gr_cog/me.m08.d27:alt1.meVE.Stichera04.greekmelody
ltx/gr_redirects_goarch/me.m08.d27:alt1.meVE.Stichera04.incipit	@ltx/gr_gr_cog/me.m08.d27:alt1.meVE.Stichera04.incipit
ltx/gr_redirects_goarch/me.m08.d27:alt1.meVE.Stichera04.melody	@ltx/gr_gr_cog/me.m08.d27:alt1.meVE.Stichera04.melody
ltx/gr_redirects_goarch/me.m08.d27:alt1.meVE.Stichera04.mode	@ltx/gr_gr_cog/me.m08.d27:alt1.meVE.Stichera04.mode
ltx/gr_redirects_goarch/me.m08.d27:alt1.meVE.Stichera04.text	@ltx/gr_gr_cog/me.m08.d27:alt1.meVE.Stichera04.text
ltx/gr_redirects_goarch/me.m08.d27:alt1.meVE.Stichera05.greekmelody	@ltx/gr_gr_cog/me.m08.d27:alt1.meVE.Stichera05.greekmelody
ltx/gr_redirects_goarch/me.m08.d27:alt1.meVE.Stichera05.incipit	@ltx/gr_gr_cog/me.m08.d27:alt1.meVE.Stichera05.incipit
ltx/gr_redirects_goarch/me.m08.d27:alt1.meVE.Stichera05.melody	@ltx/gr_gr_cog/me.m08.d27:alt1.meVE.Stichera05.melody
ltx/gr_redirects_goarch/me.m08.d27:alt1.meVE.Stichera05.mode	@ltx/gr_gr_cog/me.m08.d27:alt1.meVE.Stichera05.mode
ltx/gr_redirects_goarch/me.m08.d27:alt1.meVE.Stichera05.text	@ltx/gr_gr_cog/me.m08.d27:alt1.meVE.Stichera05.text
ltx/gr_redirects_goarch/me.m08.d27:alt1.meVE.Stichera06.incipit	@ltx/gr_gr_cog/me.m08.d27:alt1.meVE.Stichera06.incipit
ltx/gr_redirects_goarch/me.m08.d27:alt1.meVE.Stichera06.melody	@ltx/gr_gr_cog/me.m08.d27:alt1.meVE.Stichera06.melody
ltx/gr_redirects_goarch/me.m08.d27:alt1.meVE.Stichera06.mode	@ltx/gr_gr_cog/me.m08.d27:alt1.meVE.Stichera06.mode
ltx/gr_redirects_goarch/me.m08.d27:alt1.meVE.Stichera06.text	@ltx/gr_gr_cog/me.m08.d27:alt1.meVE.Stichera06.text
ltx/gr_redirects_goarch/me.m08.d27:meDA.commemoration.first	@ltx/gr_gr_cog/me.m08.d27:meDA.commemoration.first
ltx/gr_redirects_goarch/me.m08.d27:meDA.commemoration.first_name	@ltx/gr_gr_cog/me.m08.d27:meDA.commemoration.first_name
ltx/gr_redirects_goarch/me.m08.d27:meDA.commemoration.first_short	@ltx/gr_gr_cog/me.m08.d27:meDA.commemoration.first_short
ltx/gr_redirects_goarch/me.m08.d27:meDA.commemoration.first_title	@ltx/gr_gr_cog/me.m08.d27:meDA.commemoration.first_title
ltx/gr_redirects_goarch/me.m08.d27:meDA.commemoration.full	@ltx/gr_gr_cog/me.m08.d27:meDA.commemoration.full
ltx/gr_redirects_goarch/me.m08.d27:meDA.commemoration.second_name	@ltx/gr_gr_cog/me.m08.d27:meDA.commemoration.second_name
ltx/gr_redirects_goarch/me.m08.d27:meDA.commemoration.second_title	@ltx/gr_gr_cog/me.m08.d27:meDA.commemoration.second_title
ltx/gr_redirects_goarch/me.m08.d27:meDA.date	@ltx/gr_gr_cog/me.m08.d27:meDA.date
ltx/gr_redirects_goarch/me.m08.d27:meDA.fordate	@ltx/gr_gr_cog/me.m08.d27:meDA.fordate
ltx/gr_redirects_goarch/me.m08.d27:meDA.insert1	@ltx/gr_gr_cog/me.m08.d27:meDA.insert1
ltx/gr_redirects_goarch/me.m08.d27:meDA.insert2	@ltx/gr_gr_cog/me.m08.d27:meDA.insert2
ltx/gr_redirects_goarch/me.m08.d27:meDA.note	@ltx/gr_gr_cog/me.m08.d27:meDA.note
ltx/gr_redirects_goarch/me.m08.d27:meDA.pdfcoverdate	@ltx/gr_gr_cog/me.m08.d27:meDA.pdfcoverdate
ltx/gr_redirects_goarch/me.m08.d27:meDA.pdfheaderdate	@ltx/gr_gr_cog/me.m08.d27:meDA.pdfheaderdate
ltx/gr_redirects_goarch/me.m08.d27:meHO.commemorations	@ltx/gr_gr_cog/me.m08.d27:meHO.commemorations
ltx/gr_redirects_goarch/me.m08.d27:meHO.note1	@ltx/gr_gr_cog/me.m08.d27:meHO.note1
ltx/gr_redirects_goarch/me.m08.d27:meHO.note2	@ltx/gr_gr_cog/me.m08.d27:meHO.note2
ltx/gr_redirects_goarch/me.m08.d27:meHO.number	@ltx/gr_gr_cog/me.m08.d27:meHO.number
ltx/gr_redirects_goarch/me.m08.d27:meHO.rank	@ltx/gr_gr_cog/me.m08.d27:meHO.rank
ltx/gr_redirects_goarch/me.m08.d27:meLE.commemoration1	@ltx/gr_gr_cog/me.m08.d27:meLE.commemoration1
ltx/gr_redirects_goarch/me.m08.d27:meLE.commemoration2	@ltx/gr_gr_cog/me.m08.d27:meLE.commemoration2
ltx/gr_redirects_goarch/me.m08.d27:meLI.Kontakion1.greekmelody	@ltx/gr_gr_cog/me.m08.d27:meLI.Kontakion1.greekmelody
ltx/gr_redirects_goarch/me.m08.d27:meLI.Kontakion1.incipit	@ltx/gr_gr_cog/me.m08.d27:meLI.Kontakion1.incipit
ltx/gr_redirects_goarch/me.m08.d27:meLI.Kontakion1.melody	@ltx/gr_gr_cog/me.m08.d27:meLI.Kontakion1.melody
ltx/gr_redirects_goarch/me.m08.d27:meLI.Kontakion1.mode	@ltx/gr_gr_cog/me.m08.d27:meLI.Kontakion1.mode
ltx/gr_redirects_goarch/me.m08.d27:meLI.Kontakion1.text	@ltx/gr_gr_cog/me.m08.d27:meLI.Kontakion1.text
ltx/gr_redirects_goarch/me.m08.d27:meLI.Megalynarion.text	@ltx/gr_gr_cog/me.m08.d27:meLI.Megalynarion.text
ltx/gr_redirects_goarch/me.m08.d27:meMA.C1.poet	@ltx/gr_gr_cog/me.m08.d27:meMA.C1.poet
ltx/gr_redirects_goarch/me.m08.d27:meMA.C1.title	@ltx/gr_gr_cog/me.m08.d27:meMA.C1.title
ltx/gr_redirects_goarch/me.m08.d27:meMA.C1.verse	@ltx/gr_gr_cog/me.m08.d27:meMA.C1.verse
ltx/gr_redirects_goarch/me.m08.d27:meMA.ExapTheotokion.incipit	@ltx/gr_gr_cog/me.m08.d27:meMA.ExapTheotokion.incipit
ltx/gr_redirects_goarch/me.m08.d27:meMA.ExapTheotokion.melody	@ltx/gr_gr_cog/me.m08.d27:meMA.ExapTheotokion.melody
ltx/gr_redirects_goarch/me.m08.d27:meMA.ExapTheotokion.mode	@ltx/gr_gr_cog/me.m08.d27:meMA.ExapTheotokion.mode
ltx/gr_redirects_goarch/me.m08.d27:meMA.ExapTheotokion.text	@ltx/gr_gr_cog/me.m08.d27:meMA.ExapTheotokion.text
ltx/gr_redirects_goarch/me.m08.d27:meMA.Exaposteilarion1.greekmelody	@ltx/gr_gr_cog/me.m08.d27:meMA.Exaposteilarion1.greekmelody
ltx/gr_redirects_goarch/me.m08.d27:meMA.Exaposteilarion1.incipit	@ltx/gr_gr_cog/me.m08.d27:meMA.Exaposteilarion1.incipit
ltx/gr_redirects_goarch/me.m08.d27:meMA.Exaposteilarion1.melody	@ltx/gr_gr_cog/me.m08.d27:meMA.Exaposteilarion1.melody
ltx/gr_redirects_goarch/me.m08.d27:meMA.Exaposteilarion1.mode	@ltx/gr_gr_cog/me.m08.d27:meMA.Exaposteilarion1.mode
ltx/gr_redirects_goarch/me.m08.d27:meMA.Exaposteilarion1.text	@ltx/gr_gr_cog/me.m08.d27:meMA.Exaposteilarion1.text
ltx/gr_redirects_goarch/me.m08.d27:meMA.Kontakion1.greekmelody	@ltx/gr_gr_cog/me.m08.d27:meMA.Kontakion1.greekmelody
ltx/gr_redirects_goarch/me.m08.d27:meMA.Kontakion1.incipit	@ltx/gr_gr_cog/me.m08.d27:meMA.Kontakion1.incipit
ltx/gr_redirects_goarch/me.m08.d27:meMA.Kontakion1.melody	@ltx/gr_gr_cog/me.m08.d27:meMA.Kontakion1.melody
ltx/gr_redirects_goarch/me.m08.d27:meMA.Kontakion1.mode	@ltx/gr_gr_cog/me.m08.d27:meMA.Kontakion1.mode
ltx/gr_redirects_goarch/me.m08.d27:meMA.Kontakion1.text	@ltx/gr_gr_cog/me.m08.d27:meMA.Kontakion1.text
ltx/gr_redirects_goarch/me.m08.d27:meMA.Ode1C11.greekmelody	@ltx/gr_gr_cog/me.m08.d27:meMA.Ode1C11.greekmelody
ltx/gr_redirects_goarch/me.m08.d27:meMA.Ode1C11.incipit	@ltx/gr_gr_cog/me.m08.d27:meMA.Ode1C11.incipit
ltx/gr_redirects_goarch/me.m08.d27:meMA.Ode1C11.melody	@ltx/gr_gr_cog/me.m08.d27:meMA.Ode1C11.melody
ltx/gr_redirects_goarch/me.m08.d27:meMA.Ode1C11.mode	@ltx/gr_gr_cog/me.m08.d27:meMA.Ode1C11.mode
ltx/gr_redirects_goarch/me.m08.d27:meMA.Ode1C11.ode	@ltx/gr_gr_cog/me.m08.d27:meMA.Ode1C11.ode
ltx/gr_redirects_goarch/me.m08.d27:meMA.Ode1C11.text	@ltx/gr_gr_cog/me.m08.d27:meMA.Ode1C11.text
ltx/gr_redirects_goarch/me.m08.d27:meMA.Ode1C12.incipit	@ltx/gr_gr_cog/me.m08.d27:meMA.Ode1C12.incipit
ltx/gr_redirects_goarch/me.m08.d27:meMA.Ode1C12.melody	@ltx/gr_gr_cog/me.m08.d27:meMA.Ode1C12.melody
ltx/gr_redirects_goarch/me.m08.d27:meMA.Ode1C12.mode	@ltx/gr_gr_cog/me.m08.d27:meMA.Ode1C12.mode
ltx/gr_redirects_goarch/me.m08.d27:meMA.Ode1C12.ode	@ltx/gr_gr_cog/me.m08.d27:meMA.Ode1C12.ode
ltx/gr_redirects_goarch/me.m08.d27:meMA.Ode1C12.text	@ltx/gr_gr_cog/me.m08.d27:meMA.Ode1C12.text
ltx/gr_redirects_goarch/me.m08.d27:meMA.Ode1C13.incipit	@ltx/gr_gr_cog/me.m08.d27:meMA.Ode1C13.incipit
ltx/gr_redirects_goarch/me.m08.d27:meMA.Ode1C13.melody	@ltx/gr_gr_cog/me.m08.d27:meMA.Ode1C13.melody
ltx/gr_redirects_goarch/me.m08.d27:meMA.Ode1C13.mode	@ltx/gr_gr_cog/me.m08.d27:meMA.Ode1C13.mode
ltx/gr_redirects_goarch/me.m08.d27:meMA.Ode1C13.ode	@ltx/gr_gr_cog/me.m08.d27:meMA.Ode1C13.ode
ltx/gr_redirects_goarch/me.m08.d27:meMA.Ode1C13.text	@ltx/gr_gr_cog/me.m08.d27:meMA.Ode1C13.text
ltx/gr_redirects_goarch/me.m08.d27:meMA.Ode1C1T.incipit	@ltx/gr_gr_cog/me.m08.d27:meMA.Ode1C1T.incipit
ltx/gr_redirects_goarch/me.m08.d27:meMA.Ode1C1T.melody	@ltx/gr_gr_cog/me.m08.d27:meMA.Ode1C1T.melody
ltx/gr_redirects_goarch/me.m08.d27:meMA.Ode1C1T.mode	@ltx/gr_gr_cog/me.m08.d27:meMA.Ode1C1T.mode
ltx/gr_redirects_goarch/me.m08.d27:meMA.Ode1C1T.ode	@ltx/gr_gr_cog/me.m08.d27:meMA.Ode1C1T.ode
ltx/gr_redirects_goarch/me.m08.d27:meMA.Ode1C1T.text	@ltx/gr_gr_cog/me.m08.d27:meMA.Ode1C1T.text
ltx/gr_redirects_goarch/me.m08.d27:meMA.Ode3C11.greekmelody	@ltx/gr_gr_cog/me.m08.d27:meMA.Ode3C11.greekmelody
ltx/gr_redirects_goarch/me.m08.d27:meMA.Ode3C11.incipit	@ltx/gr_gr_cog/me.m08.d27:meMA.Ode3C11.incipit
ltx/gr_redirects_goarch/me.m08.d27:meMA.Ode3C11.melody	@ltx/gr_gr_cog/me.m08.d27:meMA.Ode3C11.melody
ltx/gr_redirects_goarch/me.m08.d27:meMA.Ode3C11.mode	@ltx/gr_gr_cog/me.m08.d27:meMA.Ode3C11.mode
ltx/gr_redirects_goarch/me.m08.d27:meMA.Ode3C11.ode	@ltx/gr_gr_cog/me.m08.d27:meMA.Ode3C11.ode
ltx/gr_redirects_goarch/me.m08.d27:meMA.Ode3C11.text	@ltx/gr_gr_cog/me.m08.d27:meMA.Ode3C11.text
ltx/gr_redirects_goarch/me.m08.d27:meMA.Ode3C12.incipit	@ltx/gr_gr_cog/me.m08.d27:meMA.Ode3C12.incipit
ltx/gr_redirects_goarch/me.m08.d27:meMA.Ode3C12.melody	@ltx/gr_gr_cog/me.m08.d27:meMA.Ode3C12.melody
ltx/gr_redirects_goarch/me.m08.d27:meMA.Ode3C12.mode	@ltx/gr_gr_cog/me.m08.d27:meMA.Ode3C12.mode
ltx/gr_redirects_goarch/me.m08.d27:meMA.Ode3C12.ode	@ltx/gr_gr_cog/me.m08.d27:meMA.Ode3C12.ode
ltx/gr_redirects_goarch/me.m08.d27:meMA.Ode3C12.text	@ltx/gr_gr_cog/me.m08.d27:meMA.Ode3C12.text
ltx/gr_redirects_goarch/me.m08.d27:meMA.Ode3C13.incipit	@ltx/gr_gr_cog/me.m08.d27:meMA.Ode3C13.incipit
ltx/gr_redirects_goarch/me.m08.d27:meMA.Ode3C13.melody	@ltx/gr_gr_cog/me.m08.d27:meMA.Ode3C13.melody
ltx/gr_redirects_goarch/me.m08.d27:meMA.Ode3C13.mode	@ltx/gr_gr_cog/me.m08.d27:meMA.Ode3C13.mode
ltx/gr_redirects_goarch/me.m08.d27:meMA.Ode3C13.ode	@ltx/gr_gr_cog/me.m08.d27:meMA.Ode3C13.ode
ltx/gr_redirects_goarch/me.m08.d27:meMA.Ode3C13.text	@ltx/gr_gr_cog/me.m08.d27:meMA.Ode3C13.text
ltx/gr_redirects_goarch/me.m08.d27:meMA.Ode3C1T.incipit	@ltx/gr_gr_cog/me.m08.d27:meMA.Ode3C1T.incipit
ltx/gr_redirects_goarch/me.m08.d27:meMA.Ode3C1T.melody	@ltx/gr_gr_cog/me.m08.d27:meMA.Ode3C1T.melody
ltx/gr_redirects_goarch/me.m08.d27:meMA.Ode3C1T.mode	@ltx/gr_gr_cog/me.m08.d27:meMA.Ode3C1T.mode
ltx/gr_redirects_goarch/me.m08.d27:meMA.Ode3C1T.ode	@ltx/gr_gr_cog/me.m08.d27:meMA.Ode3C1T.ode
ltx/gr_redirects_goarch/me.m08.d27:meMA.Ode3C1T.text	@ltx/gr_gr_cog/me.m08.d27:meMA.Ode3C1T.text
ltx/gr_redirects_goarch/me.m08.d27:meMA.Ode3H.greekmelody	@ltx/gr_gr_cog/me.m08.d27:meMA.Ode3H.greekmelody
ltx/gr_redirects_goarch/me.m08.d27:meMA.Ode3H.incipit	@ltx/gr_gr_cog/me.m08.d27:meMA.Ode3H.incipit
ltx/gr_redirects_goarch/me.m08.d27:meMA.Ode3H.melody	@ltx/gr_gr_cog/me.m08.d27:meMA.Ode3H.melody
ltx/gr_redirects_goarch/me.m08.d27:meMA.Ode3H.mode	@ltx/gr_gr_cog/me.m08.d27:meMA.Ode3H.mode
ltx/gr_redirects_goarch/me.m08.d27:meMA.Ode3H.ode	@ltx/gr_gr_cog/me.m08.d27:meMA.Ode3H.ode
ltx/gr_redirects_goarch/me.m08.d27:meMA.Ode3H.text	@ltx/gr_gr_cog/me.m08.d27:meMA.Ode3H.text
ltx/gr_redirects_goarch/me.m08.d27:meMA.Ode3Kathisma1.greekmelody	@ltx/gr_gr_cog/me.m08.d27:meMA.Ode3Kathisma1.greekmelody
ltx/gr_redirects_goarch/me.m08.d27:meMA.Ode3Kathisma1.incipit	@ltx/gr_gr_cog/me.m08.d27:meMA.Ode3Kathisma1.incipit
ltx/gr_redirects_goarch/me.m08.d27:meMA.Ode3Kathisma1.melody	@ltx/gr_gr_cog/me.m08.d27:meMA.Ode3Kathisma1.melody
ltx/gr_redirects_goarch/me.m08.d27:meMA.Ode3Kathisma1.mode	@ltx/gr_gr_cog/me.m08.d27:meMA.Ode3Kathisma1.mode
ltx/gr_redirects_goarch/me.m08.d27:meMA.Ode3Kathisma1.text	@ltx/gr_gr_cog/me.m08.d27:meMA.Ode3Kathisma1.text
ltx/gr_redirects_goarch/me.m08.d27:meMA.Ode3KathismaSt.incipit	@ltx/gr_gr_cog/me.m08.d27:meMA.Ode3KathismaSt.incipit
ltx/gr_redirects_goarch/me.m08.d27:meMA.Ode3KathismaSt.melody	@ltx/gr_gr_cog/me.m08.d27:meMA.Ode3KathismaSt.melody
ltx/gr_redirects_goarch/me.m08.d27:meMA.Ode3KathismaSt.mode	@ltx/gr_gr_cog/me.m08.d27:meMA.Ode3KathismaSt.mode
ltx/gr_redirects_goarch/me.m08.d27:meMA.Ode3KathismaSt.text	@ltx/gr_gr_cog/me.m08.d27:meMA.Ode3KathismaSt.text
ltx/gr_redirects_goarch/me.m08.d27:meMA.Ode3KathismaT.incipit	@ltx/gr_gr_cog/me.m08.d27:meMA.Ode3KathismaT.incipit
ltx/gr_redirects_goarch/me.m08.d27:meMA.Ode3KathismaT.melody	@ltx/gr_gr_cog/me.m08.d27:meMA.Ode3KathismaT.melody
ltx/gr_redirects_goarch/me.m08.d27:meMA.Ode3KathismaT.mode	@ltx/gr_gr_cog/me.m08.d27:meMA.Ode3KathismaT.mode
ltx/gr_redirects_goarch/me.m08.d27:meMA.Ode3KathismaT.text	@ltx/gr_gr_cog/me.m08.d27:meMA.Ode3KathismaT.text
ltx/gr_redirects_goarch/me.m08.d27:meMA.Ode4C11.greekmelody	@ltx/gr_gr_cog/me.m08.d27:meMA.Ode4C11.greekmelody
ltx/gr_redirects_goarch/me.m08.d27:meMA.Ode4C11.incipit	@ltx/gr_gr_cog/me.m08.d27:meMA.Ode4C11.incipit
ltx/gr_redirects_goarch/me.m08.d27:meMA.Ode4C11.melody	@ltx/gr_gr_cog/me.m08.d27:meMA.Ode4C11.melody
ltx/gr_redirects_goarch/me.m08.d27:meMA.Ode4C11.mode	@ltx/gr_gr_cog/me.m08.d27:meMA.Ode4C11.mode
ltx/gr_redirects_goarch/me.m08.d27:meMA.Ode4C11.ode	@ltx/gr_gr_cog/me.m08.d27:meMA.Ode4C11.ode
ltx/gr_redirects_goarch/me.m08.d27:meMA.Ode4C11.text	@ltx/gr_gr_cog/me.m08.d27:meMA.Ode4C11.text
ltx/gr_redirects_goarch/me.m08.d27:meMA.Ode4C12.incipit	@ltx/gr_gr_cog/me.m08.d27:meMA.Ode4C12.incipit
ltx/gr_redirects_goarch/me.m08.d27:meMA.Ode4C12.melody	@ltx/gr_gr_cog/me.m08.d27:meMA.Ode4C12.melody
ltx/gr_redirects_goarch/me.m08.d27:meMA.Ode4C12.mode	@ltx/gr_gr_cog/me.m08.d27:meMA.Ode4C12.mode
ltx/gr_redirects_goarch/me.m08.d27:meMA.Ode4C12.ode	@ltx/gr_gr_cog/me.m08.d27:meMA.Ode4C12.ode
ltx/gr_redirects_goarch/me.m08.d27:meMA.Ode4C12.text	@ltx/gr_gr_cog/me.m08.d27:meMA.Ode4C12.text
ltx/gr_redirects_goarch/me.m08.d27:meMA.Ode4C13.incipit	@ltx/gr_gr_cog/me.m08.d27:meMA.Ode4C13.incipit
ltx/gr_redirects_goarch/me.m08.d27:meMA.Ode4C13.melody	@ltx/gr_gr_cog/me.m08.d27:meMA.Ode4C13.melody
ltx/gr_redirects_goarch/me.m08.d27:meMA.Ode4C13.mode	@ltx/gr_gr_cog/me.m08.d27:meMA.Ode4C13.mode
ltx/gr_redirects_goarch/me.m08.d27:meMA.Ode4C13.ode	@ltx/gr_gr_cog/me.m08.d27:meMA.Ode4C13.ode
ltx/gr_redirects_goarch/me.m08.d27:meMA.Ode4C13.text	@ltx/gr_gr_cog/me.m08.d27:meMA.Ode4C13.text
ltx/gr_redirects_goarch/me.m08.d27:meMA.Ode4C1T.incipit	@ltx/gr_gr_cog/me.m08.d27:meMA.Ode4C1T.incipit
ltx/gr_redirects_goarch/me.m08.d27:meMA.Ode4C1T.melody	@ltx/gr_gr_cog/me.m08.d27:meMA.Ode4C1T.melody
ltx/gr_redirects_goarch/me.m08.d27:meMA.Ode4C1T.mode	@ltx/gr_gr_cog/me.m08.d27:meMA.Ode4C1T.mode
ltx/gr_redirects_goarch/me.m08.d27:meMA.Ode4C1T.ode	@ltx/gr_gr_cog/me.m08.d27:meMA.Ode4C1T.ode
ltx/gr_redirects_goarch/me.m08.d27:meMA.Ode4C1T.text	@ltx/gr_gr_cog/me.m08.d27:meMA.Ode4C1T.text
ltx/gr_redirects_goarch/me.m08.d27:meMA.Ode5C11.greekmelody	@ltx/gr_gr_cog/me.m08.d27:meMA.Ode5C11.greekmelody
ltx/gr_redirects_goarch/me.m08.d27:meMA.Ode5C11.incipit	@ltx/gr_gr_cog/me.m08.d27:meMA.Ode5C11.incipit
ltx/gr_redirects_goarch/me.m08.d27:meMA.Ode5C11.melody	@ltx/gr_gr_cog/me.m08.d27:meMA.Ode5C11.melody
ltx/gr_redirects_goarch/me.m08.d27:meMA.Ode5C11.mode	@ltx/gr_gr_cog/me.m08.d27:meMA.Ode5C11.mode
ltx/gr_redirects_goarch/me.m08.d27:meMA.Ode5C11.ode	@ltx/gr_gr_cog/me.m08.d27:meMA.Ode5C11.ode
ltx/gr_redirects_goarch/me.m08.d27:meMA.Ode5C11.text	@ltx/gr_gr_cog/me.m08.d27:meMA.Ode5C11.text
ltx/gr_redirects_goarch/me.m08.d27:meMA.Ode5C12.incipit	@ltx/gr_gr_cog/me.m08.d27:meMA.Ode5C12.incipit
ltx/gr_redirects_goarch/me.m08.d27:meMA.Ode5C12.melody	@ltx/gr_gr_cog/me.m08.d27:meMA.Ode5C12.melody
ltx/gr_redirects_goarch/me.m08.d27:meMA.Ode5C12.mode	@ltx/gr_gr_cog/me.m08.d27:meMA.Ode5C12.mode
ltx/gr_redirects_goarch/me.m08.d27:meMA.Ode5C12.ode	@ltx/gr_gr_cog/me.m08.d27:meMA.Ode5C12.ode
ltx/gr_redirects_goarch/me.m08.d27:meMA.Ode5C12.text	@ltx/gr_gr_cog/me.m08.d27:meMA.Ode5C12.text
ltx/gr_redirects_goarch/me.m08.d27:meMA.Ode5C13.incipit	@ltx/gr_gr_cog/me.m08.d27:meMA.Ode5C13.incipit
ltx/gr_redirects_goarch/me.m08.d27:meMA.Ode5C13.melody	@ltx/gr_gr_cog/me.m08.d27:meMA.Ode5C13.melody
ltx/gr_redirects_goarch/me.m08.d27:meMA.Ode5C13.mode	@ltx/gr_gr_cog/me.m08.d27:meMA.Ode5C13.mode
ltx/gr_redirects_goarch/me.m08.d27:meMA.Ode5C13.ode	@ltx/gr_gr_cog/me.m08.d27:meMA.Ode5C13.ode
ltx/gr_redirects_goarch/me.m08.d27:meMA.Ode5C13.text	@ltx/gr_gr_cog/me.m08.d27:meMA.Ode5C13.text
ltx/gr_redirects_goarch/me.m08.d27:meMA.Ode5C1T.incipit	@ltx/gr_gr_cog/me.m08.d27:meMA.Ode5C1T.incipit
ltx/gr_redirects_goarch/me.m08.d27:meMA.Ode5C1T.melody	@ltx/gr_gr_cog/me.m08.d27:meMA.Ode5C1T.melody
ltx/gr_redirects_goarch/me.m08.d27:meMA.Ode5C1T.mode	@ltx/gr_gr_cog/me.m08.d27:meMA.Ode5C1T.mode
ltx/gr_redirects_goarch/me.m08.d27:meMA.Ode5C1T.ode	@ltx/gr_gr_cog/me.m08.d27:meMA.Ode5C1T.ode
ltx/gr_redirects_goarch/me.m08.d27:meMA.Ode5C1T.text	@ltx/gr_gr_cog/me.m08.d27:meMA.Ode5C1T.text
ltx/gr_redirects_goarch/me.m08.d27:meMA.Ode6C11.greekmelody	@ltx/gr_gr_cog/me.m08.d27:meMA.Ode6C11.greekmelody
ltx/gr_redirects_goarch/me.m08.d27:meMA.Ode6C11.incipit	@ltx/gr_gr_cog/me.m08.d27:meMA.Ode6C11.incipit
ltx/gr_redirects_goarch/me.m08.d27:meMA.Ode6C11.melody	@ltx/gr_gr_cog/me.m08.d27:meMA.Ode6C11.melody
ltx/gr_redirects_goarch/me.m08.d27:meMA.Ode6C11.mode	@ltx/gr_gr_cog/me.m08.d27:meMA.Ode6C11.mode
ltx/gr_redirects_goarch/me.m08.d27:meMA.Ode6C11.ode	@ltx/gr_gr_cog/me.m08.d27:meMA.Ode6C11.ode
ltx/gr_redirects_goarch/me.m08.d27:meMA.Ode6C11.text	@ltx/gr_gr_cog/me.m08.d27:meMA.Ode6C11.text
ltx/gr_redirects_goarch/me.m08.d27:meMA.Ode6C12.incipit	@ltx/gr_gr_cog/me.m08.d27:meMA.Ode6C12.incipit
ltx/gr_redirects_goarch/me.m08.d27:meMA.Ode6C12.melody	@ltx/gr_gr_cog/me.m08.d27:meMA.Ode6C12.melody
ltx/gr_redirects_goarch/me.m08.d27:meMA.Ode6C12.mode	@ltx/gr_gr_cog/me.m08.d27:meMA.Ode6C12.mode
ltx/gr_redirects_goarch/me.m08.d27:meMA.Ode6C12.ode	@ltx/gr_gr_cog/me.m08.d27:meMA.Ode6C12.ode
ltx/gr_redirects_goarch/me.m08.d27:meMA.Ode6C12.text	@ltx/gr_gr_cog/me.m08.d27:meMA.Ode6C12.text
ltx/gr_redirects_goarch/me.m08.d27:meMA.Ode6C13.incipit	@ltx/gr_gr_cog/me.m08.d27:meMA.Ode6C13.incipit
ltx/gr_redirects_goarch/me.m08.d27:meMA.Ode6C13.melody	@ltx/gr_gr_cog/me.m08.d27:meMA.Ode6C13.melody
ltx/gr_redirects_goarch/me.m08.d27:meMA.Ode6C13.mode	@ltx/gr_gr_cog/me.m08.d27:meMA.Ode6C13.mode
ltx/gr_redirects_goarch/me.m08.d27:meMA.Ode6C13.ode	@ltx/gr_gr_cog/me.m08.d27:meMA.Ode6C13.ode
ltx/gr_redirects_goarch/me.m08.d27:meMA.Ode6C13.text	@ltx/gr_gr_cog/me.m08.d27:meMA.Ode6C13.text
ltx/gr_redirects_goarch/me.m08.d27:meMA.Ode6C1T.incipit	@ltx/gr_gr_cog/me.m08.d27:meMA.Ode6C1T.incipit
ltx/gr_redirects_goarch/me.m08.d27:meMA.Ode6C1T.melody	@ltx/gr_gr_cog/me.m08.d27:meMA.Ode6C1T.melody
ltx/gr_redirects_goarch/me.m08.d27:meMA.Ode6C1T.mode	@ltx/gr_gr_cog/me.m08.d27:meMA.Ode6C1T.mode
ltx/gr_redirects_goarch/me.m08.d27:meMA.Ode6C1T.ode	@ltx/gr_gr_cog/me.m08.d27:meMA.Ode6C1T.ode
ltx/gr_redirects_goarch/me.m08.d27:meMA.Ode6C1T.text	@ltx/gr_gr_cog/me.m08.d27:meMA.Ode6C1T.text
ltx/gr_redirects_goarch/me.m08.d27:meMA.Ode6H.greekmelody	@ltx/gr_gr_cog/me.m08.d27:meMA.Ode6H.greekmelody
ltx/gr_redirects_goarch/me.m08.d27:meMA.Ode6H.incipit	@ltx/gr_gr_cog/me.m08.d27:meMA.Ode6H.incipit
ltx/gr_redirects_goarch/me.m08.d27:meMA.Ode6H.melody	@ltx/gr_gr_cog/me.m08.d27:meMA.Ode6H.melody
ltx/gr_redirects_goarch/me.m08.d27:meMA.Ode6H.mode	@ltx/gr_gr_cog/me.m08.d27:meMA.Ode6H.mode
ltx/gr_redirects_goarch/me.m08.d27:meMA.Ode6H.ode	@ltx/gr_gr_cog/me.m08.d27:meMA.Ode6H.ode
ltx/gr_redirects_goarch/me.m08.d27:meMA.Ode6H.text	@ltx/gr_gr_cog/me.m08.d27:meMA.Ode6H.text
ltx/gr_redirects_goarch/me.m08.d27:meMA.Ode7C11.greekmelody	@ltx/gr_gr_cog/me.m08.d27:meMA.Ode7C11.greekmelody
ltx/gr_redirects_goarch/me.m08.d27:meMA.Ode7C11.incipit	@ltx/gr_gr_cog/me.m08.d27:meMA.Ode7C11.incipit
ltx/gr_redirects_goarch/me.m08.d27:meMA.Ode7C11.melody	@ltx/gr_gr_cog/me.m08.d27:meMA.Ode7C11.melody
ltx/gr_redirects_goarch/me.m08.d27:meMA.Ode7C11.mode	@ltx/gr_gr_cog/me.m08.d27:meMA.Ode7C11.mode
ltx/gr_redirects_goarch/me.m08.d27:meMA.Ode7C11.ode	@ltx/gr_gr_cog/me.m08.d27:meMA.Ode7C11.ode
ltx/gr_redirects_goarch/me.m08.d27:meMA.Ode7C11.text	@ltx/gr_gr_cog/me.m08.d27:meMA.Ode7C11.text
ltx/gr_redirects_goarch/me.m08.d27:meMA.Ode7C12.incipit	@ltx/gr_gr_cog/me.m08.d27:meMA.Ode7C12.incipit
ltx/gr_redirects_goarch/me.m08.d27:meMA.Ode7C12.melody	@ltx/gr_gr_cog/me.m08.d27:meMA.Ode7C12.melody
ltx/gr_redirects_goarch/me.m08.d27:meMA.Ode7C12.mode	@ltx/gr_gr_cog/me.m08.d27:meMA.Ode7C12.mode
ltx/gr_redirects_goarch/me.m08.d27:meMA.Ode7C12.ode	@ltx/gr_gr_cog/me.m08.d27:meMA.Ode7C12.ode
ltx/gr_redirects_goarch/me.m08.d27:meMA.Ode7C12.text	@ltx/gr_gr_cog/me.m08.d27:meMA.Ode7C12.text
ltx/gr_redirects_goarch/me.m08.d27:meMA.Ode7C13.incipit	@ltx/gr_gr_cog/me.m08.d27:meMA.Ode7C13.incipit
ltx/gr_redirects_goarch/me.m08.d27:meMA.Ode7C13.melody	@ltx/gr_gr_cog/me.m08.d27:meMA.Ode7C13.melody
ltx/gr_redirects_goarch/me.m08.d27:meMA.Ode7C13.mode	@ltx/gr_gr_cog/me.m08.d27:meMA.Ode7C13.mode
ltx/gr_redirects_goarch/me.m08.d27:meMA.Ode7C13.ode	@ltx/gr_gr_cog/me.m08.d27:meMA.Ode7C13.ode
ltx/gr_redirects_goarch/me.m08.d27:meMA.Ode7C13.text	@ltx/gr_gr_cog/me.m08.d27:meMA.Ode7C13.text
ltx/gr_redirects_goarch/me.m08.d27:meMA.Ode7C1T.incipit	@ltx/gr_gr_cog/me.m08.d27:meMA.Ode7C1T.incipit
ltx/gr_redirects_goarch/me.m08.d27:meMA.Ode7C1T.melody	@ltx/gr_gr_cog/me.m08.d27:meMA.Ode7C1T.melody
ltx/gr_redirects_goarch/me.m08.d27:meMA.Ode7C1T.mode	@ltx/gr_gr_cog/me.m08.d27:meMA.Ode7C1T.mode
ltx/gr_redirects_goarch/me.m08.d27:meMA.Ode7C1T.ode	@ltx/gr_gr_cog/me.m08.d27:meMA.Ode7C1T.ode
ltx/gr_redirects_goarch/me.m08.d27:meMA.Ode7C1T.text	@ltx/gr_gr_cog/me.m08.d27:meMA.Ode7C1T.text
ltx/gr_redirects_goarch/me.m08.d27:meMA.Ode8C11.greekmelody	@ltx/gr_gr_cog/me.m08.d27:meMA.Ode8C11.greekmelody
ltx/gr_redirects_goarch/me.m08.d27:meMA.Ode8C11.incipit	@ltx/gr_gr_cog/me.m08.d27:meMA.Ode8C11.incipit
ltx/gr_redirects_goarch/me.m08.d27:meMA.Ode8C11.melody	@ltx/gr_gr_cog/me.m08.d27:meMA.Ode8C11.melody
ltx/gr_redirects_goarch/me.m08.d27:meMA.Ode8C11.mode	@ltx/gr_gr_cog/me.m08.d27:meMA.Ode8C11.mode
ltx/gr_redirects_goarch/me.m08.d27:meMA.Ode8C11.ode	@ltx/gr_gr_cog/me.m08.d27:meMA.Ode8C11.ode
ltx/gr_redirects_goarch/me.m08.d27:meMA.Ode8C11.text	@ltx/gr_gr_cog/me.m08.d27:meMA.Ode8C11.text
ltx/gr_redirects_goarch/me.m08.d27:meMA.Ode8C12.incipit	@ltx/gr_gr_cog/me.m08.d27:meMA.Ode8C12.incipit
ltx/gr_redirects_goarch/me.m08.d27:meMA.Ode8C12.melody	@ltx/gr_gr_cog/me.m08.d27:meMA.Ode8C12.melody
ltx/gr_redirects_goarch/me.m08.d27:meMA.Ode8C12.mode	@ltx/gr_gr_cog/me.m08.d27:meMA.Ode8C12.mode
ltx/gr_redirects_goarch/me.m08.d27:meMA.Ode8C12.ode	@ltx/gr_gr_cog/me.m08.d27:meMA.Ode8C12.ode
ltx/gr_redirects_goarch/me.m08.d27:meMA.Ode8C12.text	@ltx/gr_gr_cog/me.m08.d27:meMA.Ode8C12.text
ltx/gr_redirects_goarch/me.m08.d27:meMA.Ode8C13.incipit	@ltx/gr_gr_cog/me.m08.d27:meMA.Ode8C13.incipit
ltx/gr_redirects_goarch/me.m08.d27:meMA.Ode8C13.melody	@ltx/gr_gr_cog/me.m08.d27:meMA.Ode8C13.melody
ltx/gr_redirects_goarch/me.m08.d27:meMA.Ode8C13.mode	@ltx/gr_gr_cog/me.m08.d27:meMA.Ode8C13.mode
ltx/gr_redirects_goarch/me.m08.d27:meMA.Ode8C13.ode	@ltx/gr_gr_cog/me.m08.d27:meMA.Ode8C13.ode
ltx/gr_redirects_goarch/me.m08.d27:meMA.Ode8C13.text	@ltx/gr_gr_cog/me.m08.d27:meMA.Ode8C13.text
ltx/gr_redirects_goarch/me.m08.d27:meMA.Ode8C1T.incipit	@ltx/gr_gr_cog/me.m08.d27:meMA.Ode8C1T.incipit
ltx/gr_redirects_goarch/me.m08.d27:meMA.Ode8C1T.melody	@ltx/gr_gr_cog/me.m08.d27:meMA.Ode8C1T.melody
ltx/gr_redirects_goarch/me.m08.d27:meMA.Ode8C1T.mode	@ltx/gr_gr_cog/me.m08.d27:meMA.Ode8C1T.mode
ltx/gr_redirects_goarch/me.m08.d27:meMA.Ode8C1T.ode	@ltx/gr_gr_cog/me.m08.d27:meMA.Ode8C1T.ode
ltx/gr_redirects_goarch/me.m08.d27:meMA.Ode8C1T.text	@ltx/gr_gr_cog/me.m08.d27:meMA.Ode8C1T.text
ltx/gr_redirects_goarch/me.m08.d27:meMA.Ode8H.greekmelody	@ltx/gr_gr_cog/me.m08.d27:meMA.Ode8H.greekmelody
ltx/gr_redirects_goarch/me.m08.d27:meMA.Ode8H.incipit	@ltx/gr_gr_cog/me.m08.d27:meMA.Ode8H.incipit
ltx/gr_redirects_goarch/me.m08.d27:meMA.Ode8H.melody	@ltx/gr_gr_cog/me.m08.d27:meMA.Ode8H.melody
ltx/gr_redirects_goarch/me.m08.d27:meMA.Ode8H.mode	@ltx/gr_gr_cog/me.m08.d27:meMA.Ode8H.mode
ltx/gr_redirects_goarch/me.m08.d27:meMA.Ode8H.ode	@ltx/gr_gr_cog/me.m08.d27:meMA.Ode8H.ode
ltx/gr_redirects_goarch/me.m08.d27:meMA.Ode8H.text	@ltx/gr_gr_cog/me.m08.d27:meMA.Ode8H.text
ltx/gr_redirects_goarch/me.m08.d27:meMA.Ode9C11.greekmelody	@ltx/gr_gr_cog/me.m08.d27:meMA.Ode9C11.greekmelody
ltx/gr_redirects_goarch/me.m08.d27:meMA.Ode9C11.incipit	@ltx/gr_gr_cog/me.m08.d27:meMA.Ode9C11.incipit
ltx/gr_redirects_goarch/me.m08.d27:meMA.Ode9C11.melody	@ltx/gr_gr_cog/me.m08.d27:meMA.Ode9C11.melody
ltx/gr_redirects_goarch/me.m08.d27:meMA.Ode9C11.mode	@ltx/gr_gr_cog/me.m08.d27:meMA.Ode9C11.mode
ltx/gr_redirects_goarch/me.m08.d27:meMA.Ode9C11.ode	@ltx/gr_gr_cog/me.m08.d27:meMA.Ode9C11.ode
ltx/gr_redirects_goarch/me.m08.d27:meMA.Ode9C11.text	@ltx/gr_gr_cog/me.m08.d27:meMA.Ode9C11.text
ltx/gr_redirects_goarch/me.m08.d27:meMA.Ode9C12.incipit	@ltx/gr_gr_cog/me.m08.d27:meMA.Ode9C12.incipit
ltx/gr_redirects_goarch/me.m08.d27:meMA.Ode9C12.melody	@ltx/gr_gr_cog/me.m08.d27:meMA.Ode9C12.melody
ltx/gr_redirects_goarch/me.m08.d27:meMA.Ode9C12.mode	@ltx/gr_gr_cog/me.m08.d27:meMA.Ode9C12.mode
ltx/gr_redirects_goarch/me.m08.d27:meMA.Ode9C12.ode	@ltx/gr_gr_cog/me.m08.d27:meMA.Ode9C12.ode
ltx/gr_redirects_goarch/me.m08.d27:meMA.Ode9C12.text	@ltx/gr_gr_cog/me.m08.d27:meMA.Ode9C12.text
ltx/gr_redirects_goarch/me.m08.d27:meMA.Ode9C13.incipit	@ltx/gr_gr_cog/me.m08.d27:meMA.Ode9C13.incipit
ltx/gr_redirects_goarch/me.m08.d27:meMA.Ode9C13.melody	@ltx/gr_gr_cog/me.m08.d27:meMA.Ode9C13.melody
ltx/gr_redirects_goarch/me.m08.d27:meMA.Ode9C13.mode	@ltx/gr_gr_cog/me.m08.d27:meMA.Ode9C13.mode
ltx/gr_redirects_goarch/me.m08.d27:meMA.Ode9C13.ode	@ltx/gr_gr_cog/me.m08.d27:meMA.Ode9C13.ode
ltx/gr_redirects_goarch/me.m08.d27:meMA.Ode9C13.text	@ltx/gr_gr_cog/me.m08.d27:meMA.Ode9C13.text
ltx/gr_redirects_goarch/me.m08.d27:meMA.Ode9C1T.incipit	@ltx/gr_gr_cog/me.m08.d27:meMA.Ode9C1T.incipit
ltx/gr_redirects_goarch/me.m08.d27:meMA.Ode9C1T.melody	@ltx/gr_gr_cog/me.m08.d27:meMA.Ode9C1T.melody
ltx/gr_redirects_goarch/me.m08.d27:meMA.Ode9C1T.mode	@ltx/gr_gr_cog/me.m08.d27:meMA.Ode9C1T.mode
ltx/gr_redirects_goarch/me.m08.d27:meMA.Ode9C1T.ode	@ltx/gr_gr_cog/me.m08.d27:meMA.Ode9C1T.ode
ltx/gr_redirects_goarch/me.m08.d27:meMA.Ode9C1T.text	@ltx/gr_gr_cog/me.m08.d27:meMA.Ode9C1T.text
ltx/gr_redirects_goarch/me.m08.d27:meMA.Ode9H.greekmelody	@ltx/gr_gr_cog/me.m08.d27:meMA.Ode9H.greekmelody
ltx/gr_redirects_goarch/me.m08.d27:meMA.Ode9H.incipit	@ltx/gr_gr_cog/me.m08.d27:meMA.Ode9H.incipit
ltx/gr_redirects_goarch/me.m08.d27:meMA.Ode9H.melody	@ltx/gr_gr_cog/me.m08.d27:meMA.Ode9H.melody
ltx/gr_redirects_goarch/me.m08.d27:meMA.Ode9H.mode	@ltx/gr_gr_cog/me.m08.d27:meMA.Ode9H.mode
ltx/gr_redirects_goarch/me.m08.d27:meMA.Ode9H.ode	@ltx/gr_gr_cog/me.m08.d27:meMA.Ode9H.ode
ltx/gr_redirects_goarch/me.m08.d27:meMA.Ode9H.text	@ltx/gr_gr_cog/me.m08.d27:meMA.Ode9H.text
ltx/gr_redirects_goarch/me.m08.d27:meVE.Apolytikion1ger.greekmelody	@ltx/gr_gr_cog/me.m08.d27:meVE.Apolytikion1ger.greekmelody
ltx/gr_redirects_goarch/me.m08.d27:meVE.Apolytikion1ger.incipit	@ltx/gr_gr_cog/me.m08.d27:meVE.Apolytikion1ger.incipit
ltx/gr_redirects_goarch/me.m08.d27:meVE.Apolytikion1ger.melody	@ltx/gr_gr_cog/me.m08.d27:meVE.Apolytikion1ger.melody
ltx/gr_redirects_goarch/me.m08.d27:meVE.Apolytikion1ger.mode	@ltx/gr_gr_cog/me.m08.d27:meVE.Apolytikion1ger.mode
ltx/gr_redirects_goarch/me.m08.d27:meVE.Apolytikion1ger.poet	@ltx/gr_gr_cog/me.m08.d27:meVE.Apolytikion1ger.poet
ltx/gr_redirects_goarch/me.m08.d27:meVE.Apolytikion1ger.text	@ltx/gr_gr_cog/me.m08.d27:meVE.Apolytikion1ger.text
ltx/gr_redirects_goarch/me.m08.d27:meVE.SticStavrotheotokion.greekmelody	@ltx/gr_gr_cog/me.m08.d27:meVE.SticStavrotheotokion.greekmelody
ltx/gr_redirects_goarch/me.m08.d27:meVE.SticStavrotheotokion.incipit	@ltx/gr_gr_cog/me.m08.d27:meVE.SticStavrotheotokion.incipit
ltx/gr_redirects_goarch/me.m08.d27:meVE.SticStavrotheotokion.melody	@ltx/gr_gr_cog/me.m08.d27:meVE.SticStavrotheotokion.melody
ltx/gr_redirects_goarch/me.m08.d27:meVE.SticStavrotheotokion.mode	@ltx/gr_gr_cog/me.m08.d27:meVE.SticStavrotheotokion.mode
ltx/gr_redirects_goarch/me.m08.d27:meVE.SticStavrotheotokion.text	@ltx/gr_gr_cog/me.m08.d27:meVE.SticStavrotheotokion.text
ltx/gr_redirects_goarch/me.m08.d27:meVE.SticTheotokion.greekmelody	@ltx/gr_gr_cog/me.m08.d27:meVE.SticTheotokion.greekmelody
ltx/gr_redirects_goarch/me.m08.d27:meVE.SticTheotokion.incipit	@ltx/gr_gr_cog/me.m08.d27:meVE.SticTheotokion.incipit
ltx/gr_redirects_goarch/me.m08.d27:meVE.SticTheotokion.melody	@ltx/gr_gr_cog/me.m08.d27:meVE.SticTheotokion.melody
ltx/gr_redirects_goarch/me.m08.d27:meVE.SticTheotokion.mode	@ltx/gr_gr_cog/me.m08.d27:meVE.SticTheotokion.mode
ltx/gr_redirects_goarch/me.m08.d27:meVE.SticTheotokion.text	@ltx/gr_gr_cog/me.m08.d27:meVE.SticTheotokion.text
ltx/gr_redirects_goarch/me.m08.d27:meVE.Stichera01.greekmelody	@ltx/gr_gr_cog/me.m08.d27:meVE.Stichera01.greekmelody
ltx/gr_redirects_goarch/me.m08.d27:meVE.Stichera01.incipit	@ltx/gr_gr_cog/me.m08.d27:meVE.Stichera01.incipit
ltx/gr_redirects_goarch/me.m08.d27:meVE.Stichera01.melody	@ltx/gr_gr_cog/me.m08.d27:meVE.Stichera01.melody
ltx/gr_redirects_goarch/me.m08.d27:meVE.Stichera01.mode	@ltx/gr_gr_cog/me.m08.d27:meVE.Stichera01.mode
ltx/gr_redirects_goarch/me.m08.d27:meVE.Stichera01.text	@ltx/gr_gr_cog/me.m08.d27:meVE.Stichera01.text
ltx/gr_redirects_goarch/me.m08.d27:meVE.Stichera02.incipit	@ltx/gr_gr_cog/me.m08.d27:meVE.Stichera02.incipit
ltx/gr_redirects_goarch/me.m08.d27:meVE.Stichera02.melody	@ltx/gr_gr_cog/me.m08.d27:meVE.Stichera02.melody
ltx/gr_redirects_goarch/me.m08.d27:meVE.Stichera02.mode	@ltx/gr_gr_cog/me.m08.d27:meVE.Stichera02.mode
ltx/gr_redirects_goarch/me.m08.d27:meVE.Stichera02.text	@ltx/gr_gr_cog/me.m08.d27:meVE.Stichera02.text
ltx/gr_redirects_goarch/me.m08.d27:meVE.Stichera03.incipit	@ltx/gr_gr_cog/me.m08.d27:meVE.Stichera03.incipit
ltx/gr_redirects_goarch/me.m08.d27:meVE.Stichera03.melody	@ltx/gr_gr_cog/me.m08.d27:meVE.Stichera03.melody
ltx/gr_redirects_goarch/me.m08.d27:meVE.Stichera03.mode	@ltx/gr_gr_cog/me.m08.d27:meVE.Stichera03.mode
ltx/gr_redirects_goarch/me.m08.d27:meVE.Stichera03.text	@ltx/gr_gr_cog/me.m08.d27:meVE.Stichera03.text
