ltx/gr_gr_cog/le.pr.me.r37:leprVE.reading.book_abbr	@ltx/gr_gr_cog/bible:Wisdom.abbr
ltx/gr_gr_cog/le.pr.me.r37:leprVE.reading.book_string	@ltx/gr_gr_cog/bible:Wisdom.text
ltx/gr_gr_cog/le.pr.me.r37:leprVE.reading.chapverse	4, ἐκλογή, καὶ 5, 17
ltx/gr_gr_cog/le.pr.me.r37:leprVE.reading.incipit	Δίκαιος ἐὰν φθάσῃ τελευτῆσαι ἐν ἀναπαύσει ἔσται. Κατακρινεῖ δίκαιος…
ltx/gr_gr_cog/le.pr.me.r37:leprVE.reading.text	Δίκαιος ἐὰν φθάσῃ τελευτῆσαι ἐν ἀναπαύσει ἔσται. Κατακρινεῖ δίκαιος ἀποθανὼν τοὺς ζῶντας ἀσεβεῖς· ὄψονται γὰρ τελευτὴν δικαίου, καὶ οὐ μὴ συνήσουσι τί ἐβουλεύσαντο περὶ αὐτοῦ. Ὅτι ῥήξει Κύριος τοὺς ἀσεβεῖς ἀφώνους πρηνεῖς, καὶ σαλεύσει αὐτοὺς ἐκ θεμελίων, καὶ ἕως ἐσχάτου χερσωθήσονται ἐν ὀδύνῃ, καὶ ἡ μνήμη αὐτῶν ἀπολεῖται. Ἐλεύσονται γὰρ ἐν συλλογισμῷ ἁμαρτημάτων αὐτῶν δειλοί, καὶ ἐλέγξει αὐτοὺς ἐξ ἐναντίας τὰ ἀνομήματα αὐτῶν. Τότε στήσεται ἐν παῤῥησίᾳ πολλῇ ὁ δίκαιος κατὰ πρόσωπον τῶν θλιψάντων αὐτόν, καὶ τῶν ἀθετούντων τοὺς πόνους αὐτοῦ, ἰδόντες ταραχθήσονται φόβῳ δεινῷ, καὶ ἐκστήσονται ἐπὶ τῷ παραδόξῳ τῆς σωτηρίας αὐτοῦ. Ἐροῦσι γὰρ ἐν ἑαυτοῖς μετανοοῦντες καὶ διὰ στενοχωρίαν στενάξουσι καὶ ἐροῦσιν. Οὗτος ἦν, ὃν ἔσχομεν ποτε εἰς γέλωτα καὶ εἰς παραβολὴν ὀνειδισμοῦ οἱ ἄφρονες; Τὸν βίον αὐτοῦ ἐλογισάμεθα μανίαν, καὶ τὴν τελευτὴν αὐτοῦ ἄτιμον. Πῶς δὲ κατελογίσθη ἐν υἱοῖς Θεοῦ, καὶ ἐν ἁγίοις ὁ κλῆρος αὐτοῦ ἐστιν. Ἄρα ἐπλανήθημεν ἀπὸ ὁδοῦ ἀληθείας, καὶ τὸ τῆς δικαιοσύνης φῶς οὐκ ἐπέλαμψεν ἡμῖν, καὶ ὁ ἥλιος οὐκ ἀνέτειλεν ἡμῖν. Ἀνομίας ἐνεπλήσθημεν τρίβους καὶ ἀπωλείας, καὶ ὡδεύσαμεν τρίβους ἀβάτους, τὴν δὲ ὁδὸν Κυρίου οὐκ ἔγνωμεν.
ltx/gr_gr_cog/le.pr.me.r37:leprVE.reading.title	
ltx/gr_gr_cog/le.pr.me.r37:leprVE.reading.title_abbr	
ltx/gr_gr_cog/le.pr.me.r37:leprVE.reading.version	@ltx/gr_gr_cog/properties:version.designation
