ltx/gr_gr_cog/le.go.mc.d155:lemcLI.Gospel.book_abbr	@ltx/gr_gr_cog/bible:Matthew.abbr
ltx/gr_gr_cog/le.go.mc.d155:lemcLI.Gospel.book_string	@ltx/gr_gr_cog/bible:Matthew.text
ltx/gr_gr_cog/le.go.mc.d155:lemcLI.Gospel.chapverse	8:28 – 34, 9:1
ltx/gr_gr_cog/le.go.mc.d155:lemcLI.Gospel.incipit	Ἐλθόντι τῷ Ἰησοῦ εἰς τὴν χώραν…
ltx/gr_gr_cog/le.go.mc.d155:lemcLI.Gospel.text	Τῷ καιρῷ ἐκείνῳ, ἐλθόντι τῷ Ἰησοῦ εἰς τὴν χώραν τῶν Γεργεσηνῶν ὑπήντησαν αὐτῷ δύο δαιμονιζόμενοι ἐκ τῶν μνημείων ἐξερχόμενοι, χαλεποὶ λίαν, ὥστε μὴ ἰσχύειν τινὰ παρελθεῖν διὰ τῆς ὁδοῦ ἐκείνης. καὶ ἰδοὺ ἔκραξαν λέγοντες· τί ἡμῖν καὶ σοί, Ἰησοῦ υἱὲ τοῦ Θεοῦ; ἦλθες ὧδε πρὸ καιροῦ βασανίσαι ἡμᾶς; ἦν δὲ μακρὰν ἀπ᾿ αὐτῶν ἀγέλη χοίρων πολλῶν βοσκομένη. οἱ δὲ δαίμονες παρεκάλουν αὐτὸν λέγοντες· εἰ ἐκβάλλεις ἡμᾶς, ἐπίτρεψον ἡμῖν ἀπελθεῖν εἰς τὴν ἀγέλην τῶν χοίρων. καὶ εἶπεν αὐτοῖς· ὑπάγετε. οἱ δὲ ἐξελθόντες ἀπῆλθον εἰς τὴν ἀγέλην τῶν χοίρων· καὶ ἰδοὺ ὥρμησε πᾶσα ἡ ἀγέλη τῶν χοίρων κατὰ τοῦ κρημνοῦ εἰς τὴν θάλασσαν καὶ ἀπέθανον ἐν τοῖς ὕδασιν. οἱ δὲ βόσκοντες ἔφυγον, καὶ ἀπελθόντες εἰς τὴν πόλιν ἀπήγγειλαν πάντα καὶ τὰ τῶν δαιμονιζομένων. καὶ ἰδοὺ πᾶσα ἡ πόλις ἐξῆλθεν εἰς συνάντησιν τῷ Ἰησοῦ, καὶ ἰδόντες αὐτὸν παρεκάλεσαν ὅπως μεταβῇ ἀπὸ τῶν ὁρίων αὐτῶν. Καὶ ἐμβὰς εἰς πλοῖον διεπέρασε καὶ ἦλθεν εἰς τὴν ἰδίαν πόλιν.
ltx/gr_gr_cog/le.go.mc.d155:lemcLI.Gospel.title	Κυριακῇ Πέμπτῃ τοῦ Ματθαίου
ltx/gr_gr_cog/le.go.mc.d155:lemcLI.Gospel.title_abbr	Κυριακῇ Εʹ Ματθαίου
ltx/gr_gr_cog/le.go.mc.d155:lemcLI.Gospel.version	@ltx/gr_gr_cog/properties:version.designation
