ltx/gr_gr_cog/he.h.m8:heHE.AkikoaKyrieTinAkoin.greekname	 
ltx/gr_gr_cog/he.h.m8:heHE.AkikoaKyrieTinAkoin.incipit	Ἀκήκοα Κύριε τὴν ἀκοήν…
ltx/gr_gr_cog/he.h.m8:heHE.AkikoaKyrieTinAkoin.melody	@ltx/gr_gr_cog/miscellanea:misc.Heirmos
ltx/gr_gr_cog/he.h.m8:heHE.AkikoaKyrieTinAkoin.mode	@ltx/gr_gr_cog/miscellanea:misc.Mode8
ltx/gr_gr_cog/he.h.m8:heHE.AkikoaKyrieTinAkoin.name	Ἀκήκοα Κύριε τὴν ἀκοήν.
ltx/gr_gr_cog/he.h.m8:heHE.AkikoaKyrieTinAkoin.ode	@ltx/gr_gr_cog/miscellanea:misc.Ode4
ltx/gr_gr_cog/he.h.m8:heHE.AkikoaKyrieTinAkoin.text	Ἀκήκοα Κύριε, τὴν ἀκοήν σου καὶ ἐφοβήθην, ὅτι ἀῤῥήτῳ βουλῇ, Θεὸς ὢν ἀΐδιος, ἐκ τῆς Παρθένου προῆλθες σαρκωθείς. Δόξα τῇ δόξῃ σου Χριστέ, δόξα τῇ δυνάμει σου.
ltx/gr_gr_cog/he.h.m8:heHE.AllotrionTonMiteron.greekname	 
ltx/gr_gr_cog/he.h.m8:heHE.AllotrionTonMiteron.incipit	Ἀλλότριον τῶν μητέρων…
ltx/gr_gr_cog/he.h.m8:heHE.AllotrionTonMiteron.melody	@ltx/gr_gr_cog/miscellanea:misc.Heirmos
ltx/gr_gr_cog/he.h.m8:heHE.AllotrionTonMiteron.mode	@ltx/gr_gr_cog/miscellanea:misc.Mode8
ltx/gr_gr_cog/he.h.m8:heHE.AllotrionTonMiteron.name	Ἀλλότριον τῶν μητέρων.
ltx/gr_gr_cog/he.h.m8:heHE.AllotrionTonMiteron.ode	@ltx/gr_gr_cog/miscellanea:misc.Ode9
ltx/gr_gr_cog/he.h.m8:heHE.AllotrionTonMiteron.text	Ἀλλότριον τῶν μητέρων ἡ παρθενία, καὶ ξένον ταῖς παρθένοις ἡ παιδοποιΐα· ἐπὶ σοὶ Θεοτόκε ἀμφότερα ᾠκονομήθη· διό σε πᾶσαι αἱ φυλαὶ τῆς γῆς, ἀπαύστως μακαρίζομεν.
ltx/gr_gr_cog/he.h.m8:heHE.AngeloiKaiOuranoi.greekname	 
ltx/gr_gr_cog/he.h.m8:heHE.AngeloiKaiOuranoi.incipit	Ἄγγελοι καὶ οὐρανοί…
ltx/gr_gr_cog/he.h.m8:heHE.AngeloiKaiOuranoi.melody	@ltx/gr_gr_cog/miscellanea:misc.Heirmos
ltx/gr_gr_cog/he.h.m8:heHE.AngeloiKaiOuranoi.mode	@ltx/gr_gr_cog/miscellanea:misc.Mode8
ltx/gr_gr_cog/he.h.m8:heHE.AngeloiKaiOuranoi.name	Ἄγγελοι καὶ οὐρανοί.
ltx/gr_gr_cog/he.h.m8:heHE.AngeloiKaiOuranoi.ode	@ltx/gr_gr_cog/miscellanea:misc.Ode8
ltx/gr_gr_cog/he.h.m8:heHE.AngeloiKaiOuranoi.text	Ἄγγελοι καὶ οὐρανοί, τὸν ἐπὶ θρόνου δόξης ἐποχούμενον, καὶ ὡς Θεὸν ἀπαύστως δοξαζόμενον, εὐλογεῖτε, ὑμνεῖτε, καὶ ὑπερυψοῦτε εἰς πάντας τοὺς αἰῶνας.
ltx/gr_gr_cog/he.h.m8:heHE.ArmatilatinFarao.greekname	 
ltx/gr_gr_cog/he.h.m8:heHE.ArmatilatinFarao.incipit	Ἁρματηλάτην Φαραώ…
ltx/gr_gr_cog/he.h.m8:heHE.ArmatilatinFarao.melody	@ltx/gr_gr_cog/miscellanea:misc.Heirmos
ltx/gr_gr_cog/he.h.m8:heHE.ArmatilatinFarao.mode	@ltx/gr_gr_cog/miscellanea:misc.Mode8
ltx/gr_gr_cog/he.h.m8:heHE.ArmatilatinFarao.name	Ἁρματηλάτην Φαραώ.
ltx/gr_gr_cog/he.h.m8:heHE.ArmatilatinFarao.ode	@ltx/gr_gr_cog/miscellanea:misc.Ode1
ltx/gr_gr_cog/he.h.m8:heHE.ArmatilatinFarao.text	Ἁρματηλάτην Φαραὼ ἐβύθισε, τερατουργοῦσα ποτέ, Μωσαϊκὴ ῥάβδος, σταυροτύπως πλήξασα, καὶ διελοῦσα θάλασσαν· Ἰσραὴλ δὲ φυγάδα, πεζὸν ὁδίτην διέσωσεν, ᾆσμα τῷ Θεῷ ἀναμέλποντα.
ltx/gr_gr_cog/he.h.m8:heHE.AseveiasOrgana.greekname	 
ltx/gr_gr_cog/he.h.m8:heHE.AseveiasOrgana.incipit	Ἀσεβείας ὄργανα…
ltx/gr_gr_cog/he.h.m8:heHE.AseveiasOrgana.melody	@ltx/gr_gr_cog/miscellanea:misc.Heirmos
ltx/gr_gr_cog/he.h.m8:heHE.AseveiasOrgana.mode	@ltx/gr_gr_cog/miscellanea:misc.Mode8
ltx/gr_gr_cog/he.h.m8:heHE.AseveiasOrgana.name	Ἀσεβείας ὄργανα.
ltx/gr_gr_cog/he.h.m8:heHE.AseveiasOrgana.ode	@ltx/gr_gr_cog/miscellanea:misc.Ode8
ltx/gr_gr_cog/he.h.m8:heHE.AseveiasOrgana.text	Ἀσεβείας ὄργανα ἅλιον μέλος, εὐσεβείας δὲ αἱ θεοφθόγγοι, ἐκελάδουν φόρμιγγες. Εὐλογεῖτε πάντα τὰ ἔργα, Χριστὸν εἰς τοὺς αἰῶνας.
ltx/gr_gr_cog/he.h.m8:heHE.AsmaAnapempsomen.greekname	 
ltx/gr_gr_cog/he.h.m8:heHE.AsmaAnapempsomen.incipit	Ἆσμα ἀναπέμψωμεν…
ltx/gr_gr_cog/he.h.m8:heHE.AsmaAnapempsomen.melody	@ltx/gr_gr_cog/miscellanea:misc.Heirmos
ltx/gr_gr_cog/he.h.m8:heHE.AsmaAnapempsomen.mode	@ltx/gr_gr_cog/miscellanea:misc.Mode8
ltx/gr_gr_cog/he.h.m8:heHE.AsmaAnapempsomen.name	Ἆσμα ἀναπέμψωμεν.
ltx/gr_gr_cog/he.h.m8:heHE.AsmaAnapempsomen.ode	@ltx/gr_gr_cog/miscellanea:misc.Ode1
ltx/gr_gr_cog/he.h.m8:heHE.AsmaAnapempsomen.text	Ἆσμα ἀναπέμψωμεν λαοί, τῷ θαυμαστῷ Θεῷ ἡμῶν, τῷ ἀπαλλάξαντι τὸν Ἰσραὴλ ἐκ δουλείας, ᾠδὴν ἐπινίκιον, ᾄδοντες καὶ βοῶντες· ᾌσωμέν σοι τῷ μόνῳ Δεσπότῃ.
ltx/gr_gr_cog/he.h.m8:heHE.AsmaAsmaton.greekname	 
ltx/gr_gr_cog/he.h.m8:heHE.AsmaAsmaton.incipit	Ἆσμα ἀσμάτων…
ltx/gr_gr_cog/he.h.m8:heHE.AsmaAsmaton.melody	@ltx/gr_gr_cog/miscellanea:misc.Heirmos
ltx/gr_gr_cog/he.h.m8:heHE.AsmaAsmaton.mode	@ltx/gr_gr_cog/miscellanea:misc.Mode8
ltx/gr_gr_cog/he.h.m8:heHE.AsmaAsmaton.name	Ἆσμα ἀσμάτων.
ltx/gr_gr_cog/he.h.m8:heHE.AsmaAsmaton.ode	@ltx/gr_gr_cog/miscellanea:misc.Ode1
ltx/gr_gr_cog/he.h.m8:heHE.AsmaAsmaton.text	[Missing.]
ltx/gr_gr_cog/he.h.m8:heHE.AsomenOdinToTheo.greekname	 
ltx/gr_gr_cog/he.h.m8:heHE.AsomenOdinToTheo.incipit	ᾌσωμεν ᾠδὴν τῷ Θεῷ…
ltx/gr_gr_cog/he.h.m8:heHE.AsomenOdinToTheo.melody	@ltx/gr_gr_cog/miscellanea:misc.Heirmos
ltx/gr_gr_cog/he.h.m8:heHE.AsomenOdinToTheo.mode	@ltx/gr_gr_cog/miscellanea:misc.Mode8
ltx/gr_gr_cog/he.h.m8:heHE.AsomenOdinToTheo.name	ᾌσωμεν ᾠδὴν τῷ Θεῷ.
ltx/gr_gr_cog/he.h.m8:heHE.AsomenOdinToTheo.ode	@ltx/gr_gr_cog/miscellanea:misc.Ode1
ltx/gr_gr_cog/he.h.m8:heHE.AsomenOdinToTheo.text	ᾌσωμεν ᾠδὴν τῷ Θεῷ, τῷ ἐκ πικρὰς δουλείας, τοῦ Φαραὼ ῥυσαμένῳ Ἰσραήλ, καὶ ἐν πυρίνῳ στύλῳ, καὶ φωτὸς νεφέλῃ καθοδηγήσαντι, ὅτι δεδόξασται.
ltx/gr_gr_cog/he.h.m8:heHE.AsomenToKyrio.greekname	 
ltx/gr_gr_cog/he.h.m8:heHE.AsomenToKyrio.incipit	ᾌσωμεν τῷ Κυρίῳ…
ltx/gr_gr_cog/he.h.m8:heHE.AsomenToKyrio.melody	@ltx/gr_gr_cog/miscellanea:misc.Heirmos
ltx/gr_gr_cog/he.h.m8:heHE.AsomenToKyrio.mode	@ltx/gr_gr_cog/miscellanea:misc.Mode8
ltx/gr_gr_cog/he.h.m8:heHE.AsomenToKyrio.name	ᾌσωμεν τῷ Κυρίῳ.
ltx/gr_gr_cog/he.h.m8:heHE.AsomenToKyrio.ode	@ltx/gr_gr_cog/miscellanea:misc.Ode1
ltx/gr_gr_cog/he.h.m8:heHE.AsomenToKyrio.text	ᾌσωμεν τῷ Κυρίῳ, τῷ διαγαγόντι τὸν λαὸν αὐτοῦ, ἐν Ἐρυθρᾷ θαλάσσῃ, ὅτι μόνος ἐνδόξως δεδόξασται.
ltx/gr_gr_cog/he.h.m8:heHE.AsomenToKyrioPantesLaoi.greekname	 
ltx/gr_gr_cog/he.h.m8:heHE.AsomenToKyrioPantesLaoi.incipit	ᾌσωμεν τῷ Κυρίῳ πάντες λαοί…
ltx/gr_gr_cog/he.h.m8:heHE.AsomenToKyrioPantesLaoi.melody	@ltx/gr_gr_cog/miscellanea:misc.Heirmos
ltx/gr_gr_cog/he.h.m8:heHE.AsomenToKyrioPantesLaoi.mode	@ltx/gr_gr_cog/miscellanea:misc.Mode8
ltx/gr_gr_cog/he.h.m8:heHE.AsomenToKyrioPantesLaoi.name	ᾌσωμεν τῷ Κυρίῳ πάντες λαοί.
ltx/gr_gr_cog/he.h.m8:heHE.AsomenToKyrioPantesLaoi.ode	@ltx/gr_gr_cog/miscellanea:misc.Ode1
ltx/gr_gr_cog/he.h.m8:heHE.AsomenToKyrioPantesLaoi.text	ᾌσωμεν τῷ Κυρίῳ πάντες λαοί, τῷ ἐν θαλάσσῃ Ἐρυθρᾷ, τὸν Φαραὼ βυθίσαντι, ἐπινίκιον ᾠδήν, ὅτι δεδόξασται.
ltx/gr_gr_cog/he.h.m8:heHE.AvyssosAmartion.greekname	 
ltx/gr_gr_cog/he.h.m8:heHE.AvyssosAmartion.incipit	Ἄβυσσος ἁμαρτιῶν…
ltx/gr_gr_cog/he.h.m8:heHE.AvyssosAmartion.melody	@ltx/gr_gr_cog/miscellanea:misc.Heirmos
ltx/gr_gr_cog/he.h.m8:heHE.AvyssosAmartion.mode	@ltx/gr_gr_cog/miscellanea:misc.Mode8
ltx/gr_gr_cog/he.h.m8:heHE.AvyssosAmartion.name	Ἄβυσσος ἁμαρτιῶν.
ltx/gr_gr_cog/he.h.m8:heHE.AvyssosAmartion.ode	@ltx/gr_gr_cog/miscellanea:misc.Ode6
ltx/gr_gr_cog/he.h.m8:heHE.AvyssosAmartion.text	Ἄβυσσος ἁμαρτιῶν, καὶ πταισμάτων καταιγίς με ταράττει, καὶ πρὸς βυθὸν βιαίως, συνωθεῖ ἀπογνώσεως· ἀλλ’ αὐτὸς τὴν κραταιὰν χεῖρά μοι ἔκτεινον, ὡς τῷ Πέτρῳ, ὦ Κυβερνῆτα Θεὲ καὶ διάσωσον.
ltx/gr_gr_cog/he.h.m8:heHE.ChitonaMoiParaschou.greekname	 
ltx/gr_gr_cog/he.h.m8:heHE.ChitonaMoiParaschou.incipit	Χιτῶνά μοι παράσχου…
ltx/gr_gr_cog/he.h.m8:heHE.ChitonaMoiParaschou.melody	@ltx/gr_gr_cog/miscellanea:misc.Heirmos
ltx/gr_gr_cog/he.h.m8:heHE.ChitonaMoiParaschou.mode	@ltx/gr_gr_cog/miscellanea:misc.Mode8
ltx/gr_gr_cog/he.h.m8:heHE.ChitonaMoiParaschou.name	Χιτῶνά μοι παράσχου.
ltx/gr_gr_cog/he.h.m8:heHE.ChitonaMoiParaschou.ode	@ltx/gr_gr_cog/miscellanea:misc.Ode6
ltx/gr_gr_cog/he.h.m8:heHE.ChitonaMoiParaschou.text	Χιτῶνά μοι παράσχου φωτεινόν, ὁ ἀναβαλλόμενος, φῶς ὡς ἱμάτιον, πολυέλεε Χριστὲ ὁ Θεὸς ἡμῶν.
ltx/gr_gr_cog/he.h.m8:heHE.EfrixePasaAkoi.greekname	 
ltx/gr_gr_cog/he.h.m8:heHE.EfrixePasaAkoi.incipit	Ἔφριξε πᾶσα ἀκοή…
ltx/gr_gr_cog/he.h.m8:heHE.EfrixePasaAkoi.melody	@ltx/gr_gr_cog/miscellanea:misc.Heirmos
ltx/gr_gr_cog/he.h.m8:heHE.EfrixePasaAkoi.mode	@ltx/gr_gr_cog/miscellanea:misc.Mode8
ltx/gr_gr_cog/he.h.m8:heHE.EfrixePasaAkoi.name	Ἔφριξε πᾶσα ἀκοή.
ltx/gr_gr_cog/he.h.m8:heHE.EfrixePasaAkoi.ode	@ltx/gr_gr_cog/miscellanea:misc.Ode9
ltx/gr_gr_cog/he.h.m8:heHE.EfrixePasaAkoi.text	Ἔφριξε πᾶσα ἀκοή, τὴν ἀπόῤῥητον Θεοῦ συγκατάβασιν, ὅπως ὁ Ὕψιστος, ἑκὼν κατῆλθεν μέχρι καὶ σώματος, παρθενικῆς ἀπὸ γαστρός, γενόμενος ἄνθρωπος· διὸ τὴν ἄχραντον, Θεοτόκον οἱ πιστοὶ μεγαλύνομεν.
ltx/gr_gr_cog/he.h.m8:heHE.EisakikoaKyrie.greekname	 
ltx/gr_gr_cog/he.h.m8:heHE.EisakikoaKyrie.incipit	Εἰσακήκοα Κύριε…
ltx/gr_gr_cog/he.h.m8:heHE.EisakikoaKyrie.melody	@ltx/gr_gr_cog/miscellanea:misc.Heirmos
ltx/gr_gr_cog/he.h.m8:heHE.EisakikoaKyrie.mode	@ltx/gr_gr_cog/miscellanea:misc.Mode8
ltx/gr_gr_cog/he.h.m8:heHE.EisakikoaKyrie.name	Εἰσακήκοα Κύριε.
ltx/gr_gr_cog/he.h.m8:heHE.EisakikoaKyrie.ode	@ltx/gr_gr_cog/miscellanea:misc.Ode4
ltx/gr_gr_cog/he.h.m8:heHE.EisakikoaKyrie.text	Εἰσακήκοα Κύριε, τῆς οἰκονομίας σου τὸ μυστήριον, κατενόησα τὰ ἔργα σου, καὶ ἐδόξασά σου τὴν θεότητα.
ltx/gr_gr_cog/he.h.m8:heHE.EisakikoaKyrieTinAkoinSou.greekname	 
ltx/gr_gr_cog/he.h.m8:heHE.EisakikoaKyrieTinAkoinSou.incipit	Εἰσακήκος Κύριε, τὴν ἀκοήν…
ltx/gr_gr_cog/he.h.m8:heHE.EisakikoaKyrieTinAkoinSou.melody	@ltx/gr_gr_cog/miscellanea:misc.Heirmos
ltx/gr_gr_cog/he.h.m8:heHE.EisakikoaKyrieTinAkoinSou.mode	@ltx/gr_gr_cog/miscellanea:misc.Mode8
ltx/gr_gr_cog/he.h.m8:heHE.EisakikoaKyrieTinAkoinSou.name	Εἰσακήκος Κύριε, τὴν ἀκοήν.
ltx/gr_gr_cog/he.h.m8:heHE.EisakikoaKyrieTinAkoinSou.ode	@ltx/gr_gr_cog/miscellanea:misc.Ode4
ltx/gr_gr_cog/he.h.m8:heHE.EisakikoaKyrieTinAkoinSou.text	Εἰσακήκοα Κύριε, τὴν ἀκοήν σου καὶ ἐφοβήθην, κατενόησα τὰ ἔργα σου, καὶ ἐδόξασα τὸ κράτος σου Δέσποτα.
ltx/gr_gr_cog/he.h.m8:heHE.EkSarkosSouVolides.greekname	 
ltx/gr_gr_cog/he.h.m8:heHE.EkSarkosSouVolides.incipit	Ἐκ σαρκός σου βολίδες…
ltx/gr_gr_cog/he.h.m8:heHE.EkSarkosSouVolides.melody	@ltx/gr_gr_cog/miscellanea:misc.Heirmos
ltx/gr_gr_cog/he.h.m8:heHE.EkSarkosSouVolides.mode	@ltx/gr_gr_cog/miscellanea:misc.Mode8
ltx/gr_gr_cog/he.h.m8:heHE.EkSarkosSouVolides.name	Ἐκ σαρκός σου βολίδες.
ltx/gr_gr_cog/he.h.m8:heHE.EkSarkosSouVolides.ode	@ltx/gr_gr_cog/miscellanea:misc.Ode4
ltx/gr_gr_cog/he.h.m8:heHE.EkSarkosSouVolides.text	Ἐκ σαρκός σου βολίδες Θεότητος, ἐξεπορεύοντο, Προφητῶν καὶ Ἀποστόλων· ὅθεν οἱ πρόκριτοι, μέλποντες ἀνεβόων· Δόξα τῇ δυνάμει σου Κύριε.
ltx/gr_gr_cog/he.h.m8:heHE.EknoonProstagma.greekname	 
ltx/gr_gr_cog/he.h.m8:heHE.EknoonProstagma.incipit	Ἔκνοον πρόσταγμα…
ltx/gr_gr_cog/he.h.m8:heHE.EknoonProstagma.melody	@ltx/gr_gr_cog/miscellanea:misc.Heirmos
ltx/gr_gr_cog/he.h.m8:heHE.EknoonProstagma.mode	@ltx/gr_gr_cog/miscellanea:misc.Mode8
ltx/gr_gr_cog/he.h.m8:heHE.EknoonProstagma.name	Ἔκνοον πρόσταγμα.
ltx/gr_gr_cog/he.h.m8:heHE.EknoonProstagma.ode	@ltx/gr_gr_cog/miscellanea:misc.Ode7
ltx/gr_gr_cog/he.h.m8:heHE.EknoonProstagma.text	Ἔκνοον πρόσταγμα τυράννου δυσσεβοῦς, λαοὺς ἐκλόνησε, πνέον ἀπειλῆς καὶ δυσφημίας θεοστυγοῦς. Ὅμως τρεῖς Παῖδας οὐκ ἐδειμάτωσε, θυμὸς θηριώδης, οὐ πῦρ βρόμιον· ἀλλʼ ἀντηχούντι δροσοβόλῳ πνεύματι, πυρὶ συνόντες ἔψαλλον· Ὁ ὑπερύμνητος, τῶν πατέρων καὶ ἡμῶν, Θεὸς εὐλογητὸς εἶ.
ltx/gr_gr_cog/he.h.m8:heHE.EnPedioDeeira.greekname	 
ltx/gr_gr_cog/he.h.m8:heHE.EnPedioDeeira.incipit	Ἐν πεδίῳ Δεειρᾷ…
ltx/gr_gr_cog/he.h.m8:heHE.EnPedioDeeira.melody	@ltx/gr_gr_cog/miscellanea:misc.Heirmos
ltx/gr_gr_cog/he.h.m8:heHE.EnPedioDeeira.mode	@ltx/gr_gr_cog/miscellanea:misc.Mode8
ltx/gr_gr_cog/he.h.m8:heHE.EnPedioDeeira.name	Ἐν πεδίῳ Δεειρᾷ.
ltx/gr_gr_cog/he.h.m8:heHE.EnPedioDeeira.ode	@ltx/gr_gr_cog/miscellanea:misc.Ode7
ltx/gr_gr_cog/he.h.m8:heHE.EnPedioDeeira.text	Ἐν πεδίῳ Δεειρᾷ ποτε ὁ τύραννος κάμινον ἔστησε, πρὸς τιμωρίαν τῶν θεοφόρων ἐν ᾗ οἱ τρεῖς Παῖδες ὁμολογοῦντες ἕνα Θεὸν τρισσῶς ἀνύμνουν λέγοντες, ὁ τῶν πατέρων ἡμῶν Θεὸς εὐλογητὸς εἶ.
ltx/gr_gr_cog/he.h.m8:heHE.EpevisEfIppous.greekname	 
ltx/gr_gr_cog/he.h.m8:heHE.EpevisEfIppous.incipit	Ἐπέβης ἐφʼ ἵππους…
ltx/gr_gr_cog/he.h.m8:heHE.EpevisEfIppous.melody	@ltx/gr_gr_cog/miscellanea:misc.Heirmos
ltx/gr_gr_cog/he.h.m8:heHE.EpevisEfIppous.mode	@ltx/gr_gr_cog/miscellanea:misc.Mode8
ltx/gr_gr_cog/he.h.m8:heHE.EpevisEfIppous.name	Ἐπέβης ἐφʼ ἵππους.
ltx/gr_gr_cog/he.h.m8:heHE.EpevisEfIppous.ode	@ltx/gr_gr_cog/miscellanea:misc.Ode4
ltx/gr_gr_cog/he.h.m8:heHE.EpevisEfIppous.text	Ἐπέβης ἐφʼ ἵππους, τοὺς ἀποστόλους σου Κύριε, καὶ ἐδέξω χερσί σου, ἡνίας αὐτῶν, καὶ σωτηρία γέγονεν, ἡ ἱππασία σου, τοῖς πιστῶς μελῳδοῦσι· Δόξα τῇ δυνάμει σου Κύριε.
ltx/gr_gr_cog/he.h.m8:heHE.EptaplasiosKaminon.greekname	 
ltx/gr_gr_cog/he.h.m8:heHE.EptaplasiosKaminon.incipit	Ἑπταπλασίως κάμινον…
ltx/gr_gr_cog/he.h.m8:heHE.EptaplasiosKaminon.melody	@ltx/gr_gr_cog/miscellanea:misc.Heirmos
ltx/gr_gr_cog/he.h.m8:heHE.EptaplasiosKaminon.mode	@ltx/gr_gr_cog/miscellanea:misc.Mode8
ltx/gr_gr_cog/he.h.m8:heHE.EptaplasiosKaminon.name	Ἑπταπλασίως κάμινον.
ltx/gr_gr_cog/he.h.m8:heHE.EptaplasiosKaminon.ode	@ltx/gr_gr_cog/miscellanea:misc.Ode8
ltx/gr_gr_cog/he.h.m8:heHE.EptaplasiosKaminon.text	Ἑπταπλασίως κάμινον, τῶν Χαλδαίων ὁ τύραννος, τοῖς θεοσεβέσιν, ἐμμανῶς ἐξέκαυσε· δυνάμει δὲ κρείττονι, περισωθέντας τούτους ἰδών, τὸν Δημιουργόν, καὶ Λυτρωτὴν ἀνεβόα, οἱ παῖδες εὐλογεῖτε, ἱερεῖς ἀνυμνεῖτε, λαὸς ὑπερυψοῦτε, εἰς πάντας τοὺς αἰῶνας.
ltx/gr_gr_cog/he.h.m8:heHE.EstereothiIKardiaMouEnKyrio.greekname	 
ltx/gr_gr_cog/he.h.m8:heHE.EstereothiIKardiaMouEnKyrio.incipit	Ἐστερεώθη ἡ καρδία μου…
ltx/gr_gr_cog/he.h.m8:heHE.EstereothiIKardiaMouEnKyrio.melody	@ltx/gr_gr_cog/miscellanea:misc.Heirmos
ltx/gr_gr_cog/he.h.m8:heHE.EstereothiIKardiaMouEnKyrio.mode	@ltx/gr_gr_cog/miscellanea:misc.Mode8
ltx/gr_gr_cog/he.h.m8:heHE.EstereothiIKardiaMouEnKyrio.name	Ἐστερεώθη ἡ καρδία μου.
ltx/gr_gr_cog/he.h.m8:heHE.EstereothiIKardiaMouEnKyrio.ode	@ltx/gr_gr_cog/miscellanea:misc.Ode3
ltx/gr_gr_cog/he.h.m8:heHE.EstereothiIKardiaMouEnKyrio.text	Ἐστερεώθη ἡ καρδία μου ἐν Κυρίῳ, ὑψώθη κέρας μου ἐν Θεῷ μου, ἐπλατύνθη ἐπʼ ἐχθρούς μου τὸ στόμα μου, εὐφράνθην ἐν σωτηρίῳ σου.
ltx/gr_gr_cog/he.h.m8:heHE.EvlogeitePaides.greekname	 
ltx/gr_gr_cog/he.h.m8:heHE.EvlogeitePaides.incipit	Εὐλογεῖτε Παῖδες…
ltx/gr_gr_cog/he.h.m8:heHE.EvlogeitePaides.melody	@ltx/gr_gr_cog/miscellanea:misc.Heirmos
ltx/gr_gr_cog/he.h.m8:heHE.EvlogeitePaides.mode	@ltx/gr_gr_cog/miscellanea:misc.Mode8
ltx/gr_gr_cog/he.h.m8:heHE.EvlogeitePaides.name	Εὐλογεῖτε Παῖδες.
ltx/gr_gr_cog/he.h.m8:heHE.EvlogeitePaides.ode	@ltx/gr_gr_cog/miscellanea:misc.Ode8
ltx/gr_gr_cog/he.h.m8:heHE.EvlogeitePaides.text	Εὐλογεῖτε Παῖδες, τῆς Τριάδος ἰσάριθμοι, δημιουργὸν Πατέρα Θεόν· ὑμνεῖτε τὸν συγκαταβάντα Λόγον, καὶ τὸ πῦρ εἰς δρόσον μεταποιήσαντα· καὶ ὑπερυψοῦτε, τὸ πᾶσι ζωὴν παρέχον, Πνεῦμα πανάγιον εἰς τοὺς αἰῶνας.
ltx/gr_gr_cog/he.h.m8:heHE.EvlogitosOKyrios.greekname	 
ltx/gr_gr_cog/he.h.m8:heHE.EvlogitosOKyrios.incipit	Εὐλογητὸς ὁ Κύριος…
ltx/gr_gr_cog/he.h.m8:heHE.EvlogitosOKyrios.melody	@ltx/gr_gr_cog/miscellanea:misc.Heirmos
ltx/gr_gr_cog/he.h.m8:heHE.EvlogitosOKyrios.mode	@ltx/gr_gr_cog/miscellanea:misc.Mode8
ltx/gr_gr_cog/he.h.m8:heHE.EvlogitosOKyrios.name	Εὐλογητὸς ὁ Κύριος.
ltx/gr_gr_cog/he.h.m8:heHE.EvlogitosOKyrios.ode	@ltx/gr_gr_cog/miscellanea:misc.Ode9
ltx/gr_gr_cog/he.h.m8:heHE.EvlogitosOKyrios.text	Εὐλογητὸς ὁ Κύριος, ὁ Θεὸς τοῦ Ἰσραήλ, ὁ ἐγείρας κέρας σωτηρίας ἡμῖν, ἐν οἴκῳ Δαυῒδ τοῦ παιδὸς αὑτοῦ· ἐν οἷς ἐπεσκέψατο ἡμᾶς, ἀνατολὴ ἐξ ὕψους, καὶ κατεύθυνεν ἡμᾶς, εἰς ὁδὸν εἰρήνης.
ltx/gr_gr_cog/he.h.m8:heHE.ExOrousKataskiou.greekname	 
ltx/gr_gr_cog/he.h.m8:heHE.ExOrousKataskiou.incipit	Ἐξ ὄρους κατασκίου…
ltx/gr_gr_cog/he.h.m8:heHE.ExOrousKataskiou.melody	@ltx/gr_gr_cog/miscellanea:misc.Heirmos
ltx/gr_gr_cog/he.h.m8:heHE.ExOrousKataskiou.mode	@ltx/gr_gr_cog/miscellanea:misc.Mode8
ltx/gr_gr_cog/he.h.m8:heHE.ExOrousKataskiou.name	Ἐξ ὄρους κατασκίου.
ltx/gr_gr_cog/he.h.m8:heHE.ExOrousKataskiou.ode	@ltx/gr_gr_cog/miscellanea:misc.Ode4
ltx/gr_gr_cog/he.h.m8:heHE.ExOrousKataskiou.text	Ἐξ ὄρους κατασκίου, Λόγε ὁ προφήτης, τῆς μόνης Θεοτόκου, μέλλοντος σαρκοῦσθαι, θεοπτικῶς κατενόησε καὶ ἐν φόβῳ ἐδοξολόγει σου τὴν δύναμιν.
ltx/gr_gr_cog/he.h.m8:heHE.ExestiEpiTouto.greekname	 
ltx/gr_gr_cog/he.h.m8:heHE.ExestiEpiTouto.incipit	Ἐξέστη ἐπὶ τούτῳ…
ltx/gr_gr_cog/he.h.m8:heHE.ExestiEpiTouto.melody	@ltx/gr_gr_cog/miscellanea:misc.Heirmos
ltx/gr_gr_cog/he.h.m8:heHE.ExestiEpiTouto.mode	@ltx/gr_gr_cog/miscellanea:misc.Mode8
ltx/gr_gr_cog/he.h.m8:heHE.ExestiEpiTouto.name	Ἐξέστη ἐπὶ τούτῳ.
ltx/gr_gr_cog/he.h.m8:heHE.ExestiEpiTouto.ode	@ltx/gr_gr_cog/miscellanea:misc.Ode9
ltx/gr_gr_cog/he.h.m8:heHE.ExestiEpiTouto.text	Ἐξέστη ἐπὶ τούτῳ ὁ οὐρανός, καὶ τῆς γῆς κατεπλάγη τὰ πέρατα, ὅτι Θεός, ὤφθη τοῖς ἀνθρώποις σωματικῶς, καὶ ἡ γαστήρ σου γέγονεν, εὐρυχωροτέρα τῶν οὐρανῶν· διό σε Θεοτόκε, Ἀγγέλων καὶ ἀνθρώπων, ταξιαρχίαι μεγαλύνουσι.
ltx/gr_gr_cog/he.h.m8:heHE.FotisonImas.greekname	 
ltx/gr_gr_cog/he.h.m8:heHE.FotisonImas.incipit	Φώτισον ἡμᾶς…
ltx/gr_gr_cog/he.h.m8:heHE.FotisonImas.melody	@ltx/gr_gr_cog/miscellanea:misc.Heirmos
ltx/gr_gr_cog/he.h.m8:heHE.FotisonImas.mode	@ltx/gr_gr_cog/miscellanea:misc.Mode8
ltx/gr_gr_cog/he.h.m8:heHE.FotisonImas.name	Φώτισον ἡμᾶς.
ltx/gr_gr_cog/he.h.m8:heHE.FotisonImas.ode	@ltx/gr_gr_cog/miscellanea:misc.Ode5
ltx/gr_gr_cog/he.h.m8:heHE.FotisonImas.text	Φώτισον ἡμᾶς, τοῖς προστάγμασί σου Κύριε, καὶ τῷ βραχίονί σου τῷ ὑψηλῷ, τὴν σὴν εἰρήνην, παράσχου ἡμῖν φιλάνθρωπε.
ltx/gr_gr_cog/he.h.m8:heHE.IKekommeni.greekname	 
ltx/gr_gr_cog/he.h.m8:heHE.IKekommeni.incipit	Ἡ κεκομμένη…
ltx/gr_gr_cog/he.h.m8:heHE.IKekommeni.melody	@ltx/gr_gr_cog/miscellanea:misc.Heirmos
ltx/gr_gr_cog/he.h.m8:heHE.IKekommeni.mode	@ltx/gr_gr_cog/miscellanea:misc.Mode8
ltx/gr_gr_cog/he.h.m8:heHE.IKekommeni.name	Ἡ κεκομμένη.
ltx/gr_gr_cog/he.h.m8:heHE.IKekommeni.ode	@ltx/gr_gr_cog/miscellanea:misc.Ode1
ltx/gr_gr_cog/he.h.m8:heHE.IKekommeni.text	Ἡ κεκομμένη τὴν ἄτομον ἔτεμε, καὶ εἶδεν ἥλιος γῆν, ἢν οὐκ ἐθεάσατο, ἀλάστορα ἐχθρὸν τὸ ὕδωρ κατεπόντισε, καὶ ἄβατον διῆλθεν Ἰσραήλ, ᾠδὴ δὲ ἀνεμέλπετο· Τῷ Κυρίῳ ᾄσωμεν, ἐνδόξως γὰρ δεδόξασται.
ltx/gr_gr_cog/he.h.m8:heHE.IdeteIdeteOKathierosas.greekname	 
ltx/gr_gr_cog/he.h.m8:heHE.IdeteIdeteOKathierosas.incipit	Ἴδετε ἴδετε.ὁ καθιέρωσας…
ltx/gr_gr_cog/he.h.m8:heHE.IdeteIdeteOKathierosas.melody	@ltx/gr_gr_cog/miscellanea:misc.Heirmos
ltx/gr_gr_cog/he.h.m8:heHE.IdeteIdeteOKathierosas.mode	@ltx/gr_gr_cog/miscellanea:misc.Mode8
ltx/gr_gr_cog/he.h.m8:heHE.IdeteIdeteOKathierosas.name	Ἴδετε ἴδετε.ὁ καθιέρωσας.
ltx/gr_gr_cog/he.h.m8:heHE.IdeteIdeteOKathierosas.ode	@ltx/gr_gr_cog/miscellanea:misc.Ode2
ltx/gr_gr_cog/he.h.m8:heHE.IdeteIdeteOKathierosas.text	Ἴδετε, ἴδετε, ὅτι ἐγώ εἰμι ὁ Θεὸς ἡμῶν, ὁ καθιέρωσας ἀπαρχὴν ὑμῖν δεκτήν, τὴν ἐξ ἡμερῶν ὅλου τοῦ ἔτους ἀποδεκάτωσιν, καὶ ταύτην δοὺς τῷ λαῷ μου, εἰς ἐκλύτρωσιν παθῶν, εἰς σωτηρίας ἀρχήν.
ltx/gr_gr_cog/he.h.m8:heHE.IdeteIdeteOPalaiTonIsrail.greekname	 
ltx/gr_gr_cog/he.h.m8:heHE.IdeteIdeteOPalaiTonIsrail.incipit	Ἴδετε ἴδετε.ὁ πάλαι τὸν Ἰσραήλ…
ltx/gr_gr_cog/he.h.m8:heHE.IdeteIdeteOPalaiTonIsrail.melody	@ltx/gr_gr_cog/miscellanea:misc.Heirmos
ltx/gr_gr_cog/he.h.m8:heHE.IdeteIdeteOPalaiTonIsrail.mode	@ltx/gr_gr_cog/miscellanea:misc.Mode8
ltx/gr_gr_cog/he.h.m8:heHE.IdeteIdeteOPalaiTonIsrail.name	Ἴδετε ἴδετε.ὁ πάλαι τὸν Ἰσραήλ.
ltx/gr_gr_cog/he.h.m8:heHE.IdeteIdeteOPalaiTonIsrail.ode	@ltx/gr_gr_cog/miscellanea:misc.Ode2
ltx/gr_gr_cog/he.h.m8:heHE.IdeteIdeteOPalaiTonIsrail.text	Ἴδετε, ἴδετε, ὅτι ἐγώ εἰμι ὁ Θεός, ὁ πάλαι τὸν Ἰσραήλ, ἐν Ἐρυθρᾷ θαλάσσῃ διαγαγών, καὶ σώσας καὶ θρέψας, καὶ ἐκ δουλείας πικρᾶς, ἐλευθερώσας Φαραώ.
ltx/gr_gr_cog/he.h.m8:heHE.IdeteIdeteOPrinGenesthai.greekname	 
ltx/gr_gr_cog/he.h.m8:heHE.IdeteIdeteOPrinGenesthai.incipit	Ἴδετε ἴδετε.ὁ πρὶν γενέσθαι…
ltx/gr_gr_cog/he.h.m8:heHE.IdeteIdeteOPrinGenesthai.melody	@ltx/gr_gr_cog/miscellanea:misc.Heirmos
ltx/gr_gr_cog/he.h.m8:heHE.IdeteIdeteOPrinGenesthai.mode	@ltx/gr_gr_cog/miscellanea:misc.Mode8
ltx/gr_gr_cog/he.h.m8:heHE.IdeteIdeteOPrinGenesthai.name	Ἴδετε ἴδετε.ὁ πρὶν γενέσθαι.
ltx/gr_gr_cog/he.h.m8:heHE.IdeteIdeteOPrinGenesthai.ode	@ltx/gr_gr_cog/miscellanea:misc.Ode2
ltx/gr_gr_cog/he.h.m8:heHE.IdeteIdeteOPrinGenesthai.text	Ἴδετε, ἴδετε, ὅτι ἐγώ ειμι Θεός, ὁ πρὶν γενέσθαι τὸ πᾶν, καὶ πρὸ τοῦ στῆναι τὴν γῆν καὶ τὸν οὐρανόν, γινώσκων τὰ πάντα, ὡς ὅλος ὢν ἐν Πατρί, καὶ ὅλον φέρων ἐν ἐμοί.
ltx/gr_gr_cog/he.h.m8:heHE.IdeteIdeteOProTonAionon.greekname	 
ltx/gr_gr_cog/he.h.m8:heHE.IdeteIdeteOProTonAionon.incipit	Ἴδετε ἴδετε.ὁ πρὸ τῶν αἰώνων…
ltx/gr_gr_cog/he.h.m8:heHE.IdeteIdeteOProTonAionon.melody	@ltx/gr_gr_cog/miscellanea:misc.Heirmos
ltx/gr_gr_cog/he.h.m8:heHE.IdeteIdeteOProTonAionon.mode	@ltx/gr_gr_cog/miscellanea:misc.Mode8
ltx/gr_gr_cog/he.h.m8:heHE.IdeteIdeteOProTonAionon.name	Ἴδετε ἴδετε.ὁ πρὸ τῶν αἰώνων.
ltx/gr_gr_cog/he.h.m8:heHE.IdeteIdeteOProTonAionon.ode	@ltx/gr_gr_cog/miscellanea:misc.Ode2
ltx/gr_gr_cog/he.h.m8:heHE.IdeteIdeteOProTonAionon.text	Ἴδετε, ἴδετε, ὅτι ἐγώ εἰμι ὁ Θεὸς ὑμῶν, ὁ πρὸ τῶν αἰώνων γεννηθεὶς ἐκ τοῦ Πατρός, καὶ ἐκ τῆς Παρθένου ἐπʼ ἐσχάτων, δίχα ἀνδρὸς κυηθείς, καὶ λύσας τὴν ἁμαρτίαν, τοῦ προπάτορος Ἀδάμ, ὡς φιλάνθρωπος.
ltx/gr_gr_cog/he.h.m8:heHE.IlasthitiMoiSotir.greekname	 
ltx/gr_gr_cog/he.h.m8:heHE.IlasthitiMoiSotir.incipit	Ἱλάσθητί μοι Σωτήρ…
ltx/gr_gr_cog/he.h.m8:heHE.IlasthitiMoiSotir.melody	@ltx/gr_gr_cog/miscellanea:misc.Heirmos
ltx/gr_gr_cog/he.h.m8:heHE.IlasthitiMoiSotir.mode	@ltx/gr_gr_cog/miscellanea:misc.Mode8
ltx/gr_gr_cog/he.h.m8:heHE.IlasthitiMoiSotir.name	Ἱλάσθητί μοι Σωτήρ.
ltx/gr_gr_cog/he.h.m8:heHE.IlasthitiMoiSotir.ode	@ltx/gr_gr_cog/miscellanea:misc.Ode6
ltx/gr_gr_cog/he.h.m8:heHE.IlasthitiMoiSotir.text	Ἱλάσθητί μοι Σωτήρ, πολλαὶ γὰρ αἱ ἀνομίαι μου· καὶ ἐκ βυθοῦ τῶν κακῶν, ἀνάγαγε δέομαι· πρὸς σὲ γὰρ ἐβόησα, καὶ ἐπάκουσόν μου, ὁ Θεὸς τῆς σωτηρίας μου.
ltx/gr_gr_cog/he.h.m8:heHE.InaTiMeAposo.greekname	 
ltx/gr_gr_cog/he.h.m8:heHE.InaTiMeAposo.incipit	Ἵνα τί με ἀπώσω…
ltx/gr_gr_cog/he.h.m8:heHE.InaTiMeAposo.melody	@ltx/gr_gr_cog/miscellanea:misc.Heirmos
ltx/gr_gr_cog/he.h.m8:heHE.InaTiMeAposo.mode	@ltx/gr_gr_cog/miscellanea:misc.Mode8
ltx/gr_gr_cog/he.h.m8:heHE.InaTiMeAposo.name	Ἵνα τί με ἀπώσω.
ltx/gr_gr_cog/he.h.m8:heHE.InaTiMeAposo.ode	@ltx/gr_gr_cog/miscellanea:misc.Ode5
ltx/gr_gr_cog/he.h.m8:heHE.InaTiMeAposo.text	Ἵνα τί με ἀπώσω, ἀπὸ τοῦ προσώπου σου τὸ φῶς τὸ ἄδυτον, καὶ ἐκάλυψέ με, τὸ ἀλλότριον σκότος τὸν δείλαιον; Ἀλλʼ ἐπίστρεψόν με, καὶ πρὸς τὸ φῶς τῶν ἐντολῶν σου, τὰς ὁδούς μου κατεύθυνον δέομαι.
ltx/gr_gr_cog/he.h.m8:heHE.KyrieOTheosImon.greekname	 
ltx/gr_gr_cog/he.h.m8:heHE.KyrieOTheosImon.incipit	Κύριε ὁ Θεὸς ἡμῶν…
ltx/gr_gr_cog/he.h.m8:heHE.KyrieOTheosImon.melody	@ltx/gr_gr_cog/miscellanea:misc.Heirmos
ltx/gr_gr_cog/he.h.m8:heHE.KyrieOTheosImon.mode	@ltx/gr_gr_cog/miscellanea:misc.Mode8
ltx/gr_gr_cog/he.h.m8:heHE.KyrieOTheosImon.name	Κύριε ὁ Θεὸς ἡμῶν.
ltx/gr_gr_cog/he.h.m8:heHE.KyrieOTheosImon.ode	@ltx/gr_gr_cog/miscellanea:misc.Ode5
ltx/gr_gr_cog/he.h.m8:heHE.KyrieOTheosImon.text	Κύριε ὁ Θεὸς ἡμῶν, εἰρήνην δὸς ἡμῖν, Κύριε ὁ Θεὸς ἡμῶν, κτῆσαι ἡμᾶς, Κύριε, ἐκτός σου ἄλλον οὐκ οἴδαμεν, τὸ ὄνομά σου ὀνομάζομεν.
ltx/gr_gr_cog/he.h.m8:heHE.KyriosTheotokon.greekname	 
ltx/gr_gr_cog/he.h.m8:heHE.KyriosTheotokon.incipit	Κυρίως Θεοτόκον…
ltx/gr_gr_cog/he.h.m8:heHE.KyriosTheotokon.melody	@ltx/gr_gr_cog/miscellanea:misc.Heirmos
ltx/gr_gr_cog/he.h.m8:heHE.KyriosTheotokon.mode	@ltx/gr_gr_cog/miscellanea:misc.Mode8
ltx/gr_gr_cog/he.h.m8:heHE.KyriosTheotokon.name	Κυρίως Θεοτόκον.
ltx/gr_gr_cog/he.h.m8:heHE.KyriosTheotokon.ode	@ltx/gr_gr_cog/miscellanea:misc.Ode9
ltx/gr_gr_cog/he.h.m8:heHE.KyriosTheotokon.text	Κυρίως Θεοτόκον, σὲ ὁμολογοῦμεν, οἱ διὰ σοῦ σεσωσμένοι Παρθένε Ἁγνή, σὺν Ἀσωμάτοις χορείαις, σὲ μεγαλύνοντες.
ltx/gr_gr_cog/he.h.m8:heHE.MegalynomenSeTinMiteraTouFotos.greekname	 
ltx/gr_gr_cog/he.h.m8:heHE.MegalynomenSeTinMiteraTouFotos.incipit	Μεγαλύνομέν σε τὴν Μητέρα τοῦ φωτός…
ltx/gr_gr_cog/he.h.m8:heHE.MegalynomenSeTinMiteraTouFotos.melody	@ltx/gr_gr_cog/miscellanea:misc.Heirmos
ltx/gr_gr_cog/he.h.m8:heHE.MegalynomenSeTinMiteraTouFotos.mode	@ltx/gr_gr_cog/miscellanea:misc.Mode8
ltx/gr_gr_cog/he.h.m8:heHE.MegalynomenSeTinMiteraTouFotos.name	Μεγαλύνομέν σε τὴν Μητέρα τοῦ φωτός.
ltx/gr_gr_cog/he.h.m8:heHE.MegalynomenSeTinMiteraTouFotos.ode	@ltx/gr_gr_cog/miscellanea:misc.Ode9
ltx/gr_gr_cog/he.h.m8:heHE.MegalynomenSeTinMiteraTouFotos.text	Μεγαλύνομέν σε, τὴν Μητέρα τοῦ φωτός, καὶ δοξάζομέν σε, Θεοτόκε Παρθένε, ὡς τεκοῦσαν Χριστόν, τὸν Σωτῆρα τῶν ψυχῶν ἡμῶν.
ltx/gr_gr_cog/he.h.m8:heHE.MegalynomenSeTinMiteraTouTheou.greekname	 
ltx/gr_gr_cog/he.h.m8:heHE.MegalynomenSeTinMiteraTouTheou.incipit	Μεγαλύνομέν σε τὴν Μητέρα τοῦ Θεοῦ…
ltx/gr_gr_cog/he.h.m8:heHE.MegalynomenSeTinMiteraTouTheou.melody	@ltx/gr_gr_cog/miscellanea:misc.Heirmos
ltx/gr_gr_cog/he.h.m8:heHE.MegalynomenSeTinMiteraTouTheou.mode	@ltx/gr_gr_cog/miscellanea:misc.Mode8
ltx/gr_gr_cog/he.h.m8:heHE.MegalynomenSeTinMiteraTouTheou.name	Μεγαλύνομέν σε τὴν Μητέρα τοῦ Θεοῦ.
ltx/gr_gr_cog/he.h.m8:heHE.MegalynomenSeTinMiteraTouTheou.ode	@ltx/gr_gr_cog/miscellanea:misc.Ode9
ltx/gr_gr_cog/he.h.m8:heHE.MegalynomenSeTinMiteraTouTheou.text	Μεγαλύνομέν σε τὴν Μητέρα τοῦ Θεοῦ, καὶ δοξάζομέν σε Θεοτόκε Παρθένε, ὡς Σωτῆρα τεκοῦσαν τῶν ψυχῶν ἡμῶν.
ltx/gr_gr_cog/he.h.m8:heHE.MegalynomenSeTinPanamomon.greekname	 
ltx/gr_gr_cog/he.h.m8:heHE.MegalynomenSeTinPanamomon.incipit	Μεγαλύνομέν σε τὴν πανάμωμον…
ltx/gr_gr_cog/he.h.m8:heHE.MegalynomenSeTinPanamomon.melody	@ltx/gr_gr_cog/miscellanea:misc.Heirmos
ltx/gr_gr_cog/he.h.m8:heHE.MegalynomenSeTinPanamomon.mode	@ltx/gr_gr_cog/miscellanea:misc.Mode8
ltx/gr_gr_cog/he.h.m8:heHE.MegalynomenSeTinPanamomon.name	Μεγαλύνομέν σε τὴν πανάμωμον.
ltx/gr_gr_cog/he.h.m8:heHE.MegalynomenSeTinPanamomon.ode	@ltx/gr_gr_cog/miscellanea:misc.Ode9
ltx/gr_gr_cog/he.h.m8:heHE.MegalynomenSeTinPanamomon.text	Μεγαλύνομέν σε, τὴν πανάμωμον Μητέρα, Χριστοῦ τοῦ Θεοῦ, ἐν ᾗ ἐπεσκίασε τὸ Πνεῦμα τὸ πανάγιον.
ltx/gr_gr_cog/he.h.m8:heHE.MousikonOrganon.greekname	 
ltx/gr_gr_cog/he.h.m8:heHE.MousikonOrganon.incipit	Μουσικῶν ὀργάνων…
ltx/gr_gr_cog/he.h.m8:heHE.MousikonOrganon.melody	@ltx/gr_gr_cog/miscellanea:misc.Heirmos
ltx/gr_gr_cog/he.h.m8:heHE.MousikonOrganon.mode	@ltx/gr_gr_cog/miscellanea:misc.Mode8
ltx/gr_gr_cog/he.h.m8:heHE.MousikonOrganon.name	Μουσικῶν ὀργάνων.
ltx/gr_gr_cog/he.h.m8:heHE.MousikonOrganon.ode	@ltx/gr_gr_cog/miscellanea:misc.Ode8
ltx/gr_gr_cog/he.h.m8:heHE.MousikonOrganon.text	Μουσικῶν ὀργάνων συμφωνούντων, καὶ λαῶν ἀπείρων προσκυνούντων, εἰκόνι τῇ ἐν Δεηρᾷ, τρεῖς Παῖδες μὴ πεισθέντες, τὸν Κύριον ἀνύμνουν, καὶ ἐδοξολόγουν, εἰς πάντας τοὺς αἰῶνας.
ltx/gr_gr_cog/he.h.m8:heHE.MystikosEiTheotoke.greekname	 
ltx/gr_gr_cog/he.h.m8:heHE.MystikosEiTheotoke.incipit	Μυστικὸς εἶ Θεοτόκε…
ltx/gr_gr_cog/he.h.m8:heHE.MystikosEiTheotoke.melody	@ltx/gr_gr_cog/miscellanea:misc.Heirmos
ltx/gr_gr_cog/he.h.m8:heHE.MystikosEiTheotoke.mode	@ltx/gr_gr_cog/miscellanea:misc.Mode8
ltx/gr_gr_cog/he.h.m8:heHE.MystikosEiTheotoke.name	Μυστικὸς εἶ Θεοτόκε.
ltx/gr_gr_cog/he.h.m8:heHE.MystikosEiTheotoke.ode	@ltx/gr_gr_cog/miscellanea:misc.Ode9
ltx/gr_gr_cog/he.h.m8:heHE.MystikosEiTheotoke.text	Μυστικὸς εἶ Θεοτόκε Παράδεισος, ἀγεωργήτως βλαστήσασα Χριστόν, ὑφʼ οὗ τὸ τοῦ Σταυροῦ, ζωηφόρον ἐν γῇ, πεφυτούργηται δένδρον· διʼ οὗ νῦν ὑψουμένου, προσκυνοῦντες αὐτόν, σὲ μεγαλύνομεν.
ltx/gr_gr_cog/he.h.m8:heHE.MystikosOProfitis.greekname	 
ltx/gr_gr_cog/he.h.m8:heHE.MystikosOProfitis.incipit	Μυστικῶς ὁ Προφήτης…
ltx/gr_gr_cog/he.h.m8:heHE.MystikosOProfitis.melody	@ltx/gr_gr_cog/miscellanea:misc.Heirmos
ltx/gr_gr_cog/he.h.m8:heHE.MystikosOProfitis.mode	@ltx/gr_gr_cog/miscellanea:misc.Mode8
ltx/gr_gr_cog/he.h.m8:heHE.MystikosOProfitis.name	Μυστικῶς ὁ Προφήτης.
ltx/gr_gr_cog/he.h.m8:heHE.MystikosOProfitis.ode	@ltx/gr_gr_cog/miscellanea:misc.Ode4
ltx/gr_gr_cog/he.h.m8:heHE.MystikosOProfitis.text	Μυστικῶς ὁ προφήτης προορῶν ἐκ Παρθένου σε Λόγε σαρκούμενον μελῳδικῶς ἀνεβόα· δόξα τῇ δυνάμει σου Κύριε.
ltx/gr_gr_cog/he.h.m8:heHE.NikitaiTyrannou.greekname	 
ltx/gr_gr_cog/he.h.m8:heHE.NikitaiTyrannou.incipit	Νικηταὶ τυράννου…
ltx/gr_gr_cog/he.h.m8:heHE.NikitaiTyrannou.melody	@ltx/gr_gr_cog/miscellanea:misc.Heirmos
ltx/gr_gr_cog/he.h.m8:heHE.NikitaiTyrannou.mode	@ltx/gr_gr_cog/miscellanea:misc.Mode8
ltx/gr_gr_cog/he.h.m8:heHE.NikitaiTyrannou.name	Νικηταὶ τυράννου.
ltx/gr_gr_cog/he.h.m8:heHE.NikitaiTyrannou.ode	@ltx/gr_gr_cog/miscellanea:misc.Ode8
ltx/gr_gr_cog/he.h.m8:heHE.NikitaiTyrannou.text	Νικηταὶ τυράννου, καὶ φλογὸς τῇ χάριτί σου γεγονότες, οἱ τῶν ἐντολῶν σου σφόδρα ἀντεχόμενοι Παῖδες ἐβόων· εὐλογεῖτε πάντα τὰ ἔργα τὸν Κύριον, καὶ ὑπερυψοῦτε αὐτὸν εἰς τοὺς αἰῶνας.
ltx/gr_gr_cog/he.h.m8:heHE.NotiouThiros.greekname	 
ltx/gr_gr_cog/he.h.m8:heHE.NotiouThiros.incipit	Νοτίου θηρός…
ltx/gr_gr_cog/he.h.m8:heHE.NotiouThiros.melody	@ltx/gr_gr_cog/miscellanea:misc.Heirmos
ltx/gr_gr_cog/he.h.m8:heHE.NotiouThiros.mode	@ltx/gr_gr_cog/miscellanea:misc.Mode8
ltx/gr_gr_cog/he.h.m8:heHE.NotiouThiros.name	Νοτίου θηρός.
ltx/gr_gr_cog/he.h.m8:heHE.NotiouThiros.ode	@ltx/gr_gr_cog/miscellanea:misc.Ode6
ltx/gr_gr_cog/he.h.m8:heHE.NotiouThiros.text	Νοτίου θηρὸς ἐν σπλάγχνοις, παλάμας Ἰωνᾶς, σταυροειδῶς διεκπετάσας, τὸ σωτήριον πάθος, προδιετύπου σαφῶς· ὅθεν τριήμερος ἐκδύς, τὴν ὑπερκόσμιον ἀνάστασιν ὑπεζωγράφησε, τοῦ σαρκὶ προσπαγέντος Χριστοῦ τοῦ Θεοῦ, καὶ τριημέρῳ ἐγέρσει, τὸν κόσμον φωτίσαντος.
ltx/gr_gr_cog/he.h.m8:heHE.ODiAngelouPaidas.greekname	 
ltx/gr_gr_cog/he.h.m8:heHE.ODiAngelouPaidas.incipit	Ὁ διʼ Ἀγγέλου Παῖδας…
ltx/gr_gr_cog/he.h.m8:heHE.ODiAngelouPaidas.melody	@ltx/gr_gr_cog/miscellanea:misc.Heirmos
ltx/gr_gr_cog/he.h.m8:heHE.ODiAngelouPaidas.mode	@ltx/gr_gr_cog/miscellanea:misc.Mode8
ltx/gr_gr_cog/he.h.m8:heHE.ODiAngelouPaidas.name	Ὁ διʼ Ἀγγέλου Παῖδας.
ltx/gr_gr_cog/he.h.m8:heHE.ODiAngelouPaidas.ode	@ltx/gr_gr_cog/miscellanea:misc.Ode7
ltx/gr_gr_cog/he.h.m8:heHE.ODiAngelouPaidas.text	Ὁ διʼ Ἀγγέλου Παῖδας, ἐκ πυρὸς διασώσας, καὶ τὴν βροντῶσαν κάμινον, μεταβαλὼν εἰς δρόσον, εὐλογητὸς εἶ ὁ Θεός, ὁ τῶν πατέρων ἡμῶν.
ltx/gr_gr_cog/he.h.m8:heHE.ODiaVroseos.greekname	 
ltx/gr_gr_cog/he.h.m8:heHE.ODiaVroseos.incipit	Ὁ διὰ βρώσεως…
ltx/gr_gr_cog/he.h.m8:heHE.ODiaVroseos.melody	@ltx/gr_gr_cog/miscellanea:misc.Heirmos
ltx/gr_gr_cog/he.h.m8:heHE.ODiaVroseos.mode	@ltx/gr_gr_cog/miscellanea:misc.Mode8
ltx/gr_gr_cog/he.h.m8:heHE.ODiaVroseos.name	Ὁ διὰ βρώσεως.
ltx/gr_gr_cog/he.h.m8:heHE.ODiaVroseos.ode	@ltx/gr_gr_cog/miscellanea:misc.Ode9
ltx/gr_gr_cog/he.h.m8:heHE.ODiaVroseos.text	Ὁ διὰ βρώσεως τοῦ ξύλου, τῷ γένει προσγενόμενος θάνατος, διὰ Σταυροῦ κατήργηται σήμερον· τῆς γὰρ προμήτορος ἡ παγγενής, κατάρα διαλέλυται, τῷ βλαστῷ τῆς ἁγνῆς Θεομήτορος· ἢν πᾶσαι αἱ δυνάμεις, τῶν οὐρανῶν μεγαλύνουσι.
ltx/gr_gr_cog/he.h.m8:heHE.OEkNyktosAgnoias.greekname	 
ltx/gr_gr_cog/he.h.m8:heHE.OEkNyktosAgnoias.incipit	Ὁ ἐκ νυκτὸς ἀγνοίας…
ltx/gr_gr_cog/he.h.m8:heHE.OEkNyktosAgnoias.melody	@ltx/gr_gr_cog/miscellanea:misc.Heirmos
ltx/gr_gr_cog/he.h.m8:heHE.OEkNyktosAgnoias.mode	@ltx/gr_gr_cog/miscellanea:misc.Mode8
ltx/gr_gr_cog/he.h.m8:heHE.OEkNyktosAgnoias.name	Ὁ ἐκ νυκτὸς ἀγνοίας.
ltx/gr_gr_cog/he.h.m8:heHE.OEkNyktosAgnoias.ode	@ltx/gr_gr_cog/miscellanea:misc.Ode5
ltx/gr_gr_cog/he.h.m8:heHE.OEkNyktosAgnoias.text	Ὁ ἐκ νυκτὸς ἀγνοίας, θεογνωσίᾳ φαιδρύνας τὰ πέρατα, φώτισόν με τῷ ὄρθρῳ, τῆς φιλανθρωπίας σου Κύριε.
ltx/gr_gr_cog/he.h.m8:heHE.OEnArchiTinGin.greekname	 
ltx/gr_gr_cog/he.h.m8:heHE.OEnArchiTinGin.incipit	Ὁ ἐν ἀρχῇ τὴν γῆν…
ltx/gr_gr_cog/he.h.m8:heHE.OEnArchiTinGin.melody	@ltx/gr_gr_cog/miscellanea:misc.Heirmos
ltx/gr_gr_cog/he.h.m8:heHE.OEnArchiTinGin.mode	@ltx/gr_gr_cog/miscellanea:misc.Mode8
ltx/gr_gr_cog/he.h.m8:heHE.OEnArchiTinGin.name	Ὁ ἐν ἀρχῇ τὴν γῆν.
ltx/gr_gr_cog/he.h.m8:heHE.OEnArchiTinGin.ode	@ltx/gr_gr_cog/miscellanea:misc.Ode7
ltx/gr_gr_cog/he.h.m8:heHE.OEnArchiTinGin.text	Ὁ ἐν ἀρχῇ τὴν γῆν θεμελιώσας, καὶ οὐρανοὺς τῷ λόγῳ στερεώσας, εὐλογητὸς εἶ εἰς τοὺς αιῶνας, Κύριε ὁ Θεὸς τῶν πατέρων ἡμῶν.
ltx/gr_gr_cog/he.h.m8:heHE.OProfitisAvvakoum.greekname	 
ltx/gr_gr_cog/he.h.m8:heHE.OProfitisAvvakoum.incipit	Ὁ Προφήτης Ἀββακούμ…
ltx/gr_gr_cog/he.h.m8:heHE.OProfitisAvvakoum.melody	@ltx/gr_gr_cog/miscellanea:misc.Heirmos
ltx/gr_gr_cog/he.h.m8:heHE.OProfitisAvvakoum.mode	@ltx/gr_gr_cog/miscellanea:misc.Mode8
ltx/gr_gr_cog/he.h.m8:heHE.OProfitisAvvakoum.name	Ὁ Προφήτης Ἀββακούμ.
ltx/gr_gr_cog/he.h.m8:heHE.OProfitisAvvakoum.ode	@ltx/gr_gr_cog/miscellanea:misc.Ode4
ltx/gr_gr_cog/he.h.m8:heHE.OProfitisAvvakoum.text	Ὁ Προφήτης Ἀββακούμ, τοῖς νοεροῖς ὀφθαλμοῖς προεώρα Κύριε, τὴν παρουσίαν σου· διὸ καὶ ἀνέκραζεν· Ἀπὸ Θαιμὰν ἥξει ὁ Θεός· Δόξα τῇ δόξῃ σου Χριστέ, δόξα τῇ συγκαταβάσει σου.
ltx/gr_gr_cog/he.h.m8:heHE.OStegazonEnYdasi.greekname	 
ltx/gr_gr_cog/he.h.m8:heHE.OStegazonEnYdasi.incipit	Ὁ στεγάζων ἐν ὕδασι…
ltx/gr_gr_cog/he.h.m8:heHE.OStegazonEnYdasi.melody	@ltx/gr_gr_cog/miscellanea:misc.Heirmos
ltx/gr_gr_cog/he.h.m8:heHE.OStegazonEnYdasi.mode	@ltx/gr_gr_cog/miscellanea:misc.Mode8
ltx/gr_gr_cog/he.h.m8:heHE.OStegazonEnYdasi.name	Ὁ στεγάζων ἐν ὕδασι.
ltx/gr_gr_cog/he.h.m8:heHE.OStegazonEnYdasi.ode	@ltx/gr_gr_cog/miscellanea:misc.Ode8
ltx/gr_gr_cog/he.h.m8:heHE.OStegazonEnYdasi.text	Ὁ στεγάζων ἐν ὕδασι, τὰ ὑπερῷα αὐτοῦ, ὁ τιθεὶς θαλάσσῃ ὅριον ψάμμον, καὶ συνέχων τὸ πᾶν, σὲ ὑμνεῖ ἥλιος, σὲ δοξάζει σελήνη, σοὶ προσφέρει ὕμνον πᾶσα κτίσις, τῷ Δημιουργῷ καὶ Κτίστῃ εἰς τοὺς αἰώνας.
ltx/gr_gr_cog/he.h.m8:heHE.OStereosasEnTiCheiriSou.greekname	 
ltx/gr_gr_cog/he.h.m8:heHE.OStereosasEnTiCheiriSou.incipit	Ὁ στερεώσας ἐν τῇ χειρί σου…
ltx/gr_gr_cog/he.h.m8:heHE.OStereosasEnTiCheiriSou.melody	@ltx/gr_gr_cog/miscellanea:misc.Heirmos
ltx/gr_gr_cog/he.h.m8:heHE.OStereosasEnTiCheiriSou.mode	@ltx/gr_gr_cog/miscellanea:misc.Mode8
ltx/gr_gr_cog/he.h.m8:heHE.OStereosasEnTiCheiriSou.name	Ὁ στερεώσας ἐν τῇ χειρί σου.
ltx/gr_gr_cog/he.h.m8:heHE.OStereosasEnTiCheiriSou.ode	@ltx/gr_gr_cog/miscellanea:misc.Ode3
ltx/gr_gr_cog/he.h.m8:heHE.OStereosasEnTiCheiriSou.text	Ὁ στερεώσας ἐν τῇ χειρί σου, Λόγε Θεοῦ τοὺς ουρανοὺς ἐν τῷ φωτισμῷ, τῆς σῆς ἀληθοῦς ἐπιγνώσεως, στερέωσον καὶ ἡμῶν, τῶν ἐπὶ σοὶ πεποιθότων τὰς καρδίας.
ltx/gr_gr_cog/he.h.m8:heHE.OStereosasKatArchas.greekname	 
ltx/gr_gr_cog/he.h.m8:heHE.OStereosasKatArchas.incipit	Ὁ στερεώσας κατʼ ἀρχάς…
ltx/gr_gr_cog/he.h.m8:heHE.OStereosasKatArchas.melody	@ltx/gr_gr_cog/miscellanea:misc.Heirmos
ltx/gr_gr_cog/he.h.m8:heHE.OStereosasKatArchas.mode	@ltx/gr_gr_cog/miscellanea:misc.Mode8
ltx/gr_gr_cog/he.h.m8:heHE.OStereosasKatArchas.name	Ὁ στερεώσας κατʼ ἀρχάς.
ltx/gr_gr_cog/he.h.m8:heHE.OStereosasKatArchas.ode	@ltx/gr_gr_cog/miscellanea:misc.Ode3
ltx/gr_gr_cog/he.h.m8:heHE.OStereosasKatArchas.text	Ὁ στερεώσας κατʼ ἀρχάς, τοὺς οὐρανοὺς ἐν συνέσει, καὶ τὴν γῆν ἐπὶ ὑδάτων ἑδράσας, ἐν τῇ πέτρᾳ με Χριστέ, τῆς Ἐκκλησιάς στήριξον, ὅτι οὐκ ἔστι πλήν σου, ἅγιος μόνε Φιλάνθρωπε.
ltx/gr_gr_cog/he.h.m8:heHE.OStereosasLogo.greekname	 
ltx/gr_gr_cog/he.h.m8:heHE.OStereosasLogo.incipit	Ὁ στερεώσας λόγῳ…
ltx/gr_gr_cog/he.h.m8:heHE.OStereosasLogo.melody	@ltx/gr_gr_cog/miscellanea:misc.Heirmos
ltx/gr_gr_cog/he.h.m8:heHE.OStereosasLogo.mode	@ltx/gr_gr_cog/miscellanea:misc.Mode8
ltx/gr_gr_cog/he.h.m8:heHE.OStereosasLogo.name	Ὁ στερεώσας λόγῳ.
ltx/gr_gr_cog/he.h.m8:heHE.OStereosasLogo.ode	@ltx/gr_gr_cog/miscellanea:misc.Ode3
ltx/gr_gr_cog/he.h.m8:heHE.OStereosasLogo.text	Ὁ στερεώσας λόγῳ τοὺς οὐρανούς, καὶ τὴν γῆν ἑδράσας ἐπὶ ὑδάτων πολλῶν, στερέωσόν με πρὸς ὕμνον, τῆς δοξολογίας σου Κύριε.
ltx/gr_gr_cog/he.h.m8:heHE.OTousPaidasDrosisas.greekname	 
ltx/gr_gr_cog/he.h.m8:heHE.OTousPaidasDrosisas.incipit	Ὁ τοὺς Παῖδας δροσίσας…
ltx/gr_gr_cog/he.h.m8:heHE.OTousPaidasDrosisas.melody	@ltx/gr_gr_cog/miscellanea:misc.Heirmos
ltx/gr_gr_cog/he.h.m8:heHE.OTousPaidasDrosisas.mode	@ltx/gr_gr_cog/miscellanea:misc.Mode8
ltx/gr_gr_cog/he.h.m8:heHE.OTousPaidasDrosisas.name	Ὁ τοὺς Παῖδας δροσίσας.
ltx/gr_gr_cog/he.h.m8:heHE.OTousPaidasDrosisas.ode	@ltx/gr_gr_cog/miscellanea:misc.Ode7
ltx/gr_gr_cog/he.h.m8:heHE.OTousPaidasDrosisas.text	Ὁ τοὺς Παῖδας δροσίσας ἐν καμίνῳ, καὶ παρθένον φυλάξας μετὰ τόκον, τὴν σὲ τεκοῦσαν, εὐλογητὸς εἶ Κύριε, ὁ Θεὸς ὁ τῶν Πατέρων ἡμῶν.
ltx/gr_gr_cog/he.h.m8:heHE.OTrismakaristonXylon.greekname	 
ltx/gr_gr_cog/he.h.m8:heHE.OTrismakaristonXylon.incipit	Ὦ τρισμακάριστον ξύλον…
ltx/gr_gr_cog/he.h.m8:heHE.OTrismakaristonXylon.melody	@ltx/gr_gr_cog/miscellanea:misc.Heirmos
ltx/gr_gr_cog/he.h.m8:heHE.OTrismakaristonXylon.mode	@ltx/gr_gr_cog/miscellanea:misc.Mode8
ltx/gr_gr_cog/he.h.m8:heHE.OTrismakaristonXylon.name	Ὦ τρισμακάριστον ξύλον.
ltx/gr_gr_cog/he.h.m8:heHE.OTrismakaristonXylon.ode	@ltx/gr_gr_cog/miscellanea:misc.Ode5
ltx/gr_gr_cog/he.h.m8:heHE.OTrismakaristonXylon.text	Ὢ τρισμακάριστον ξύλον! ἐν ᾧ ἐτάθη Χριστός, ὁ Βασιλεὺς καὶ Κύριος· διʼ οὗ πέπτωκεν ὁ ξύλῳ ἀπατήσας, τῷ ἐν σοὶ δελεασθείς, Θεῷ τῷ προσπαγέντι σαρκί, τῷ παρέχοντι, τὴν εἰρήνην ταῖς ψυχαῖς ἡμῶν.
ltx/gr_gr_cog/he.h.m8:heHE.OiEkTisIoudaias.greekname	 
ltx/gr_gr_cog/he.h.m8:heHE.OiEkTisIoudaias.incipit	Οἱ ἐκ τῆς Ἰουδαίας…
ltx/gr_gr_cog/he.h.m8:heHE.OiEkTisIoudaias.melody	@ltx/gr_gr_cog/miscellanea:misc.Heirmos
ltx/gr_gr_cog/he.h.m8:heHE.OiEkTisIoudaias.mode	@ltx/gr_gr_cog/miscellanea:misc.Mode8
ltx/gr_gr_cog/he.h.m8:heHE.OiEkTisIoudaias.name	Οἱ ἐκ τῆς Ἰουδαίας.
ltx/gr_gr_cog/he.h.m8:heHE.OiEkTisIoudaias.ode	@ltx/gr_gr_cog/miscellanea:misc.Ode7
ltx/gr_gr_cog/he.h.m8:heHE.OiEkTisIoudaias.text	Οἱ ἐκ τῆς Ἰουδαίας, καταντήσαντες Παῖδες, ἐν Βαβυλῶνί ποτε, τῇ πίστει τῆς Τριάδος, τὴν φλόγα τῆς καμίνου, κατεπάτησαν ψάλλοντες· Ὁ τῶν Πατέρων ἡμῶν, Θεὸς εὐλογητὸς εἶ.
ltx/gr_gr_cog/he.h.m8:heHE.OiTheorrimonesPaides.greekname	 
ltx/gr_gr_cog/he.h.m8:heHE.OiTheorrimonesPaides.incipit	Οἱ θεοῤῥήμονες Παῖδες…
ltx/gr_gr_cog/he.h.m8:heHE.OiTheorrimonesPaides.melody	@ltx/gr_gr_cog/miscellanea:misc.Heirmos
ltx/gr_gr_cog/he.h.m8:heHE.OiTheorrimonesPaides.mode	@ltx/gr_gr_cog/miscellanea:misc.Mode8
ltx/gr_gr_cog/he.h.m8:heHE.OiTheorrimonesPaides.name	Οἱ θεοῤῥήμονες Παῖδες.
ltx/gr_gr_cog/he.h.m8:heHE.OiTheorrimonesPaides.ode	@ltx/gr_gr_cog/miscellanea:misc.Ode8
ltx/gr_gr_cog/he.h.m8:heHE.OiTheorrimonesPaides.text	Οἱ θεοῤῥήμονες Παῖδες ἐν τῇ καμίνῳ, σὺν τῷ πυρὶ καὶ τὴν πλάνην, καταπατοῦντες ὑπέψαλλον· Εὐλογεῖτε τὰ ἔργα Κυρίου τὸν Κύριον.
ltx/gr_gr_cog/he.h.m8:heHE.OiTisChaldaiasKaminou.greekname	 
ltx/gr_gr_cog/he.h.m8:heHE.OiTisChaldaiasKaminou.incipit	Οἱ τῆς Χαλδαίας καμίνου…
ltx/gr_gr_cog/he.h.m8:heHE.OiTisChaldaiasKaminou.melody	@ltx/gr_gr_cog/miscellanea:misc.Heirmos
ltx/gr_gr_cog/he.h.m8:heHE.OiTisChaldaiasKaminou.mode	@ltx/gr_gr_cog/miscellanea:misc.Mode8
ltx/gr_gr_cog/he.h.m8:heHE.OiTisChaldaiasKaminou.name	Οἱ τῆς Χαλδαίας καμίνου.
ltx/gr_gr_cog/he.h.m8:heHE.OiTisChaldaiasKaminou.ode	@ltx/gr_gr_cog/miscellanea:misc.Ode7
ltx/gr_gr_cog/he.h.m8:heHE.OiTisChaldaiasKaminou.text	Οἱ τῆς Χαλδαίας καμίνου, τὴν πανώλεθρον δύναμιν σβέσαντες, μορφῇ Ἀγγέλου συγκαταβάντος, τῷ Δημιουργῷ Νεανίαι ἐκραύγαζον· Εὐλογητὸς εἶ καὶ αἰνετός, ὁ Θεὸς ὁ τῶν Πατέρων ἡμῶν.
ltx/gr_gr_cog/he.h.m8:heHE.OrousParilthes.greekname	 
ltx/gr_gr_cog/he.h.m8:heHE.OrousParilthes.incipit	Ὅρους παρῆλθες…
ltx/gr_gr_cog/he.h.m8:heHE.OrousParilthes.melody	@ltx/gr_gr_cog/miscellanea:misc.Heirmos
ltx/gr_gr_cog/he.h.m8:heHE.OrousParilthes.mode	@ltx/gr_gr_cog/miscellanea:misc.Mode8
ltx/gr_gr_cog/he.h.m8:heHE.OrousParilthes.name	Ὅρους παρῆλθες.
ltx/gr_gr_cog/he.h.m8:heHE.OrousParilthes.ode	@ltx/gr_gr_cog/miscellanea:misc.Ode9
ltx/gr_gr_cog/he.h.m8:heHE.OrousParilthes.text	Ὅρους παρῆλθες τῆς φύσεως, τὸν Δημιουργὸν συλλαβοῦσα καὶ Κύριον, καὶ πύλη σωτηρίας τῷ κόσμῳ γέγονας· διό σε Θεοτόκε, ἀκαταπαύστως μεγαλύνομεν.
ltx/gr_gr_cog/he.h.m8:heHE.OrthrizeiToPnevmaMou.greekname	 
ltx/gr_gr_cog/he.h.m8:heHE.OrthrizeiToPnevmaMou.incipit	Ὀρθρίζει τὸ πνεῦμά μου…
ltx/gr_gr_cog/he.h.m8:heHE.OrthrizeiToPnevmaMou.melody	@ltx/gr_gr_cog/miscellanea:misc.Heirmos
ltx/gr_gr_cog/he.h.m8:heHE.OrthrizeiToPnevmaMou.mode	@ltx/gr_gr_cog/miscellanea:misc.Mode8
ltx/gr_gr_cog/he.h.m8:heHE.OrthrizeiToPnevmaMou.name	Ὀρθρίζει τὸ πνεῦμά μου.
ltx/gr_gr_cog/he.h.m8:heHE.OrthrizeiToPnevmaMou.ode	@ltx/gr_gr_cog/miscellanea:misc.Ode5
ltx/gr_gr_cog/he.h.m8:heHE.OrthrizeiToPnevmaMou.text	Ὀρθρίζει τὸ πνεῦμά μου, πρὸς σὲ ὁ Θεός, διότι φῶς τὰ προστάγματα, τῆς παρουσίας σου· ἐν αὐτοῖς οὖν καταύγασον, τὸν νοῦν ἡμῶν Δέσποτα, καὶ ὁδήγησον, ἐν τρίβῳ ζωῆς.
ltx/gr_gr_cog/he.h.m8:heHE.OrthrizontesVoomenSoi.greekname	 
ltx/gr_gr_cog/he.h.m8:heHE.OrthrizontesVoomenSoi.incipit	Ὀρθρίζοντες βοῶμέν σοι…
ltx/gr_gr_cog/he.h.m8:heHE.OrthrizontesVoomenSoi.melody	@ltx/gr_gr_cog/miscellanea:misc.Heirmos
ltx/gr_gr_cog/he.h.m8:heHE.OrthrizontesVoomenSoi.mode	@ltx/gr_gr_cog/miscellanea:misc.Mode8
ltx/gr_gr_cog/he.h.m8:heHE.OrthrizontesVoomenSoi.name	Ὀρθρίζοντες βοῶμέν σοι.
ltx/gr_gr_cog/he.h.m8:heHE.OrthrizontesVoomenSoi.ode	@ltx/gr_gr_cog/miscellanea:misc.Ode5
ltx/gr_gr_cog/he.h.m8:heHE.OrthrizontesVoomenSoi.text	Ὀρθρίζοντες βοῶμέν σοι Κύριε· Σῶσον ἡμᾶς· σὺ γὰρ εἶ Θεὸς ἡμῶν, ἐκτός σοῦ ἄλλον οὐκ οἴδαμεν.
ltx/gr_gr_cog/he.h.m8:heHE.OsTonProfitinErryso.greekname	 
ltx/gr_gr_cog/he.h.m8:heHE.OsTonProfitinErryso.incipit	Ὡς τὸν Προφήτην ἐῤῥύσω…
ltx/gr_gr_cog/he.h.m8:heHE.OsTonProfitinErryso.melody	@ltx/gr_gr_cog/miscellanea:misc.Heirmos
ltx/gr_gr_cog/he.h.m8:heHE.OsTonProfitinErryso.mode	@ltx/gr_gr_cog/miscellanea:misc.Mode8
ltx/gr_gr_cog/he.h.m8:heHE.OsTonProfitinErryso.name	Ὡς τὸν Προφήτην ἐῤῥύσω.
ltx/gr_gr_cog/he.h.m8:heHE.OsTonProfitinErryso.ode	@ltx/gr_gr_cog/miscellanea:misc.Ode6
ltx/gr_gr_cog/he.h.m8:heHE.OsTonProfitinErryso.text	Ὡς τὸν Προφήτην ἐῤῥύσω, ἐκ βυθοῦ κατωτάτου Χριστὲ ὁ Θεός, κἀμὲ τῶν πταισμάτων μου, ῥῦσαι ὡς φιλάνθρωπος, καὶ κυβέρνησον τὴν ζωήν μου δέομαι.
ltx/gr_gr_cog/he.h.m8:heHE.OsYdataThalassis.greekname	 
ltx/gr_gr_cog/he.h.m8:heHE.OsYdataThalassis.incipit	Ὡς ὕδατα θαλάσσης…
ltx/gr_gr_cog/he.h.m8:heHE.OsYdataThalassis.melody	@ltx/gr_gr_cog/miscellanea:misc.Heirmos
ltx/gr_gr_cog/he.h.m8:heHE.OsYdataThalassis.mode	@ltx/gr_gr_cog/miscellanea:misc.Mode8
ltx/gr_gr_cog/he.h.m8:heHE.OsYdataThalassis.name	Ὡς ὕδατα θαλάσσης.
ltx/gr_gr_cog/he.h.m8:heHE.OsYdataThalassis.ode	@ltx/gr_gr_cog/miscellanea:misc.Ode6
ltx/gr_gr_cog/he.h.m8:heHE.OsYdataThalassis.text	Ὡς ὕδατα θαλάσσης φιλάνθρωπε, τὰ κύματα τοῦ βίου χειμάζει με· διὸ ὡς Ἰωνᾶς, σοὶ κραυγάζω Λόγε· Ἀνάγαγε ἐκ φθορᾶς τὴν ζωήν μου, εὔσπλαγχνε Κύριε.
ltx/gr_gr_cog/he.h.m8:heHE.OukEstinAgios.greekname	 
ltx/gr_gr_cog/he.h.m8:heHE.OukEstinAgios.incipit	Οὔκ ἐστιν ἅγιος…
ltx/gr_gr_cog/he.h.m8:heHE.OukEstinAgios.melody	@ltx/gr_gr_cog/miscellanea:misc.Heirmos
ltx/gr_gr_cog/he.h.m8:heHE.OukEstinAgios.mode	@ltx/gr_gr_cog/miscellanea:misc.Mode8
ltx/gr_gr_cog/he.h.m8:heHE.OukEstinAgios.name	Οὔκ ἐστιν ἅγιος.
ltx/gr_gr_cog/he.h.m8:heHE.OukEstinAgios.ode	@ltx/gr_gr_cog/miscellanea:misc.Ode3
ltx/gr_gr_cog/he.h.m8:heHE.OukEstinAgios.text	Οὔκ ἐστιν ἅγιος ὡς ὁ Κύριος, καὶ οὔκ ἐστι δίκαιος, ὡς ὁ Θεὸς ἡμῶν, ὂν ὑμνεῖ πᾶσα κτίσις, οὔκ ἐστιν ἅγιος πλὴν σοῦ Κύριε.
ltx/gr_gr_cog/he.h.m8:heHE.OukEstinAgiosOsOTheos.greekname	 
ltx/gr_gr_cog/he.h.m8:heHE.OukEstinAgiosOsOTheos.incipit	Οὔκ ἐστιν ἅγιος ὡς ὁ Θεός…
ltx/gr_gr_cog/he.h.m8:heHE.OukEstinAgiosOsOTheos.melody	@ltx/gr_gr_cog/miscellanea:misc.Heirmos
ltx/gr_gr_cog/he.h.m8:heHE.OukEstinAgiosOsOTheos.mode	@ltx/gr_gr_cog/miscellanea:misc.Mode8
ltx/gr_gr_cog/he.h.m8:heHE.OukEstinAgiosOsOTheos.name	Οὔκ ἐστιν ἅγιος ὡς ὁ Θεός.
ltx/gr_gr_cog/he.h.m8:heHE.OukEstinAgiosOsOTheos.ode	@ltx/gr_gr_cog/miscellanea:misc.Ode3
ltx/gr_gr_cog/he.h.m8:heHE.OukEstinAgiosOsOTheos.text	[Missing]
ltx/gr_gr_cog/he.h.m8:heHE.OuraniasApsidos.greekname	 
ltx/gr_gr_cog/he.h.m8:heHE.OuraniasApsidos.incipit	Οὐρανίας ἁψῖδος…
ltx/gr_gr_cog/he.h.m8:heHE.OuraniasApsidos.melody	@ltx/gr_gr_cog/miscellanea:misc.Heirmos
ltx/gr_gr_cog/he.h.m8:heHE.OuraniasApsidos.mode	@ltx/gr_gr_cog/miscellanea:misc.Mode8
ltx/gr_gr_cog/he.h.m8:heHE.OuraniasApsidos.name	Οὐρανίας ἁψῖδος.
ltx/gr_gr_cog/he.h.m8:heHE.OuraniasApsidos.ode	@ltx/gr_gr_cog/miscellanea:misc.Ode3
ltx/gr_gr_cog/he.h.m8:heHE.OuraniasApsidos.text	Οὐρανίας ἁψῖδος, ὀροφουργὲ Κύριε, καὶ τῆς Ἐκκλησίας Δομῆτορ, σὺ με στερέωσον, ἐν τῇ ἀγάπῃ τῇ σῇ, τῶν ἐφετῶν ἡ ἀκρότης, τῶν πιστῶν τὸ στήριγμα, μόνε φιλάνθρωπε.
ltx/gr_gr_cog/he.h.m8:heHE.PaidesEvraion.greekname	 
ltx/gr_gr_cog/he.h.m8:heHE.PaidesEvraion.incipit	Παῖδες Ἑβραίων…
ltx/gr_gr_cog/he.h.m8:heHE.PaidesEvraion.melody	@ltx/gr_gr_cog/miscellanea:misc.Heirmos
ltx/gr_gr_cog/he.h.m8:heHE.PaidesEvraion.mode	@ltx/gr_gr_cog/miscellanea:misc.Mode8
ltx/gr_gr_cog/he.h.m8:heHE.PaidesEvraion.name	Παῖδες Ἑβραίων.
ltx/gr_gr_cog/he.h.m8:heHE.PaidesEvraion.ode	@ltx/gr_gr_cog/miscellanea:misc.Ode7
ltx/gr_gr_cog/he.h.m8:heHE.PaidesEvraion.text	Παῖδες Ἑβραίων ἐν καμίνῳ, κατεπάτησαν τὴν φλόγα θαρσαλέως, καὶ εἰς δρόσον τὸ πῦρ, μετέβαλον βοῶντες· Εὐλογητὸς εἶ Κύριε, ὁ Θεὸς εἰς τοὺς αἰώνας.
ltx/gr_gr_cog/he.h.m8:heHE.PaidesTheoseveis.greekname	 
ltx/gr_gr_cog/he.h.m8:heHE.PaidesTheoseveis.incipit	Παῖδες θεοσεβεῖς…
ltx/gr_gr_cog/he.h.m8:heHE.PaidesTheoseveis.melody	@ltx/gr_gr_cog/miscellanea:misc.Heirmos
ltx/gr_gr_cog/he.h.m8:heHE.PaidesTheoseveis.mode	@ltx/gr_gr_cog/miscellanea:misc.Mode8
ltx/gr_gr_cog/he.h.m8:heHE.PaidesTheoseveis.name	Παῖδες θεοσεβεῖς.
ltx/gr_gr_cog/he.h.m8:heHE.PaidesTheoseveis.ode	@ltx/gr_gr_cog/miscellanea:misc.Ode7
ltx/gr_gr_cog/he.h.m8:heHE.PaidesTheoseveis.text	Παῖδες θεοσεβεῖς ἐν Βαβυλῶνι, εἰκόνι χρυσῇ οὐ προσεκύνησαν· ἀλλʼ ἐν μέσῳ καμίνου, πυρὸς δροσιζόμενοι, τὴν ᾠδὴν ἀνέμελπον λέγοντες· Εὐλογητὸς ὁ Θεός, ὁ τῶν πατέρων ἡμῶν.
ltx/gr_gr_cog/he.h.m8:heHE.ProsTonDynamenonSozein.greekname	 
ltx/gr_gr_cog/he.h.m8:heHE.ProsTonDynamenonSozein.incipit	Πρὸς τὸν δυνάμενον σῴζειν…
ltx/gr_gr_cog/he.h.m8:heHE.ProsTonDynamenonSozein.melody	@ltx/gr_gr_cog/miscellanea:misc.Heirmos
ltx/gr_gr_cog/he.h.m8:heHE.ProsTonDynamenonSozein.mode	@ltx/gr_gr_cog/miscellanea:misc.Mode8
ltx/gr_gr_cog/he.h.m8:heHE.ProsTonDynamenonSozein.name	Πρὸς τὸν δυνάμενον σῴζειν.
ltx/gr_gr_cog/he.h.m8:heHE.ProsTonDynamenonSozein.ode	@ltx/gr_gr_cog/miscellanea:misc.Ode6
ltx/gr_gr_cog/he.h.m8:heHE.ProsTonDynamenonSozein.text	Πρὸς τὸν δυνάμενον σῴζειν με Κύριον, ἐκ βυθοῦ ἁμαρτιῶν ἐβόησα, καὶ ἐκ φθορᾶς ἀνήγαγε, τὴν ζωήν μου ὡς φιλάνθρωπος.
ltx/gr_gr_cog/he.h.m8:heHE.ProsecheOurane.greekname	 
ltx/gr_gr_cog/he.h.m8:heHE.ProsecheOurane.incipit	Πρόσεχε οὐρανέ…
ltx/gr_gr_cog/he.h.m8:heHE.ProsecheOurane.melody	@ltx/gr_gr_cog/miscellanea:misc.Heirmos
ltx/gr_gr_cog/he.h.m8:heHE.ProsecheOurane.mode	@ltx/gr_gr_cog/miscellanea:misc.Mode8
ltx/gr_gr_cog/he.h.m8:heHE.ProsecheOurane.name	Πρόσεχε οὐρανέ.
ltx/gr_gr_cog/he.h.m8:heHE.ProsecheOurane.ode	@ltx/gr_gr_cog/miscellanea:misc.Ode2
ltx/gr_gr_cog/he.h.m8:heHE.ProsecheOurane.text	Πρόσεχε, οὐρανὲ καὶ λαλήσω, καὶ ἀνυμνήσω Χριστόν, τὸν ἐκ Παρθένου, σαρκὶ ἐπιδημήσαντα.
ltx/gr_gr_cog/he.h.m8:heHE.RavdosEisTypon.greekname	 
ltx/gr_gr_cog/he.h.m8:heHE.RavdosEisTypon.incipit	Ῥάβδος εἰς τύπον…
ltx/gr_gr_cog/he.h.m8:heHE.RavdosEisTypon.melody	@ltx/gr_gr_cog/miscellanea:misc.Heirmos
ltx/gr_gr_cog/he.h.m8:heHE.RavdosEisTypon.mode	@ltx/gr_gr_cog/miscellanea:misc.Mode8
ltx/gr_gr_cog/he.h.m8:heHE.RavdosEisTypon.name	Ῥάβδος εἰς τύπον.
ltx/gr_gr_cog/he.h.m8:heHE.RavdosEisTypon.ode	@ltx/gr_gr_cog/miscellanea:misc.Ode3
ltx/gr_gr_cog/he.h.m8:heHE.RavdosEisTypon.text	Ῥάβδος εἰς τύπον, τοῦ μυστηρίου παραλαμβάνεται· τῷ βλαστῷ γὰρ προκρίνει τὸν ἱερέα· τῇ στειρευούσῃ δὲ πρῴην, Ἐκκλησίᾳ νῦν ἐξήνθησε, ξύλον Σταυροῦ, εἰς κράτος καὶ στερέωμα.
ltx/gr_gr_cog/he.h.m8:heHE.SeTinApeirogamon.greekname	 
ltx/gr_gr_cog/he.h.m8:heHE.SeTinApeirogamon.incipit	Σὲ τὴν ἀπειρόγαμον…
ltx/gr_gr_cog/he.h.m8:heHE.SeTinApeirogamon.melody	@ltx/gr_gr_cog/miscellanea:misc.Heirmos
ltx/gr_gr_cog/he.h.m8:heHE.SeTinApeirogamon.mode	@ltx/gr_gr_cog/miscellanea:misc.Mode8
ltx/gr_gr_cog/he.h.m8:heHE.SeTinApeirogamon.name	Σὲ τὴν ἀπειρόγαμον.
ltx/gr_gr_cog/he.h.m8:heHE.SeTinApeirogamon.ode	@ltx/gr_gr_cog/miscellanea:misc.Ode9
ltx/gr_gr_cog/he.h.m8:heHE.SeTinApeirogamon.text	Σὲ τὴν ἀπειρόγαμον, Θεοῦ Μητέρα τοῦ Ὑψίστου, σὲ τὴν ὑπὲρ νοῦν κυήσασαν, διὰ λόγου τὸν ὄντως Θεόν, τὴν ὑψηλοτέραν τῶν ἀχράντων Δυνάμεων, ἀσιγήτοις δοξολογίαις μεγαλύνομεν.
ltx/gr_gr_cog/he.h.m8:heHE.SeTinOuranou.greekname	 
ltx/gr_gr_cog/he.h.m8:heHE.SeTinOuranou.incipit	Σὲ τὴν οὐρανοῦ…
ltx/gr_gr_cog/he.h.m8:heHE.SeTinOuranou.melody	@ltx/gr_gr_cog/miscellanea:misc.Heirmos
ltx/gr_gr_cog/he.h.m8:heHE.SeTinOuranou.mode	@ltx/gr_gr_cog/miscellanea:misc.Mode8
ltx/gr_gr_cog/he.h.m8:heHE.SeTinOuranou.name	Σὲ τὴν οὐρανοῦ.
ltx/gr_gr_cog/he.h.m8:heHE.SeTinOuranou.ode	@ltx/gr_gr_cog/miscellanea:misc.Ode9
ltx/gr_gr_cog/he.h.m8:heHE.SeTinOuranou.text	Σὲ τὴν οὐρανοῦ καὶ γῆς μεσῖτιν, πᾶσαι γενεαὶ μεγαλύνομεν· σωματικῶς γὰρ ἐσκήνωσεν ἐν σοί, τὸ πλήρωμα Παρθένε τῆς Θεότητος.
ltx/gr_gr_cog/he.h.m8:heHE.StavronCharaxasMosis.greekname	 
ltx/gr_gr_cog/he.h.m8:heHE.StavronCharaxasMosis.incipit	Σταυρὸν χαράξας Μωσῆς…
ltx/gr_gr_cog/he.h.m8:heHE.StavronCharaxasMosis.melody	@ltx/gr_gr_cog/miscellanea:misc.Heirmos
ltx/gr_gr_cog/he.h.m8:heHE.StavronCharaxasMosis.mode	@ltx/gr_gr_cog/miscellanea:misc.Mode8
ltx/gr_gr_cog/he.h.m8:heHE.StavronCharaxasMosis.name	Σταυρὸν χαράξας Μωσῆς.
ltx/gr_gr_cog/he.h.m8:heHE.StavronCharaxasMosis.ode	@ltx/gr_gr_cog/miscellanea:misc.Ode1
ltx/gr_gr_cog/he.h.m8:heHE.StavronCharaxasMosis.text	Σταυρὸν χαράξας Μωσῆς, ἐπʼ εὐθείας ῥάβδῳ, τὴν Ἐρυθρὰν διέτεμε, τῷ Ἰσραὴλ πεζεύσαντι· τὴν δὲ ἐπιστρεπτικῶς, Φαραὼ τοῖς ἅρμασι, κροτήσας ἥνωσεν, ἐπʼ εὔρους διαγράψας, τὸ ἀήττητον ὅπλον· διὸ Χριστῷ ᾄσωμεν, τῷ Θεῷ ἡμῶν ὅτι δεδόξασται.
ltx/gr_gr_cog/he.h.m8:heHE.StereomaMouSotir.greekname	 
ltx/gr_gr_cog/he.h.m8:heHE.StereomaMouSotir.incipit	Στερέωμά μου Σωτήρ…
ltx/gr_gr_cog/he.h.m8:heHE.StereomaMouSotir.melody	@ltx/gr_gr_cog/miscellanea:misc.Heirmos
ltx/gr_gr_cog/he.h.m8:heHE.StereomaMouSotir.mode	@ltx/gr_gr_cog/miscellanea:misc.Mode8
ltx/gr_gr_cog/he.h.m8:heHE.StereomaMouSotir.name	Στερέωμά μου Σωτήρ.
ltx/gr_gr_cog/he.h.m8:heHE.StereomaMouSotir.ode	@ltx/gr_gr_cog/miscellanea:misc.Ode3
ltx/gr_gr_cog/he.h.m8:heHE.StereomaMouSotir.text	Στερέωμά μου Σωτὴρ ὑπάρχεις, καταφυγή μου καὶ δύναμις, σαλευθεῖσαν τὴν καρδίαν μου, στερέωσον εἰς τὸν φόβον σου, ὅτι οὐκ ἔστιν ἅγιος, ὡς σὺ ὁ Θεὸς ἡμῶν.
ltx/gr_gr_cog/he.h.m8:heHE.StereosonImonTonNoun.greekname	 
ltx/gr_gr_cog/he.h.m8:heHE.StereosonImonTonNoun.incipit	Στερέωσον ἡμῶν τὸν νοῦν…
ltx/gr_gr_cog/he.h.m8:heHE.StereosonImonTonNoun.melody	@ltx/gr_gr_cog/miscellanea:misc.Heirmos
ltx/gr_gr_cog/he.h.m8:heHE.StereosonImonTonNoun.mode	@ltx/gr_gr_cog/miscellanea:misc.Mode8
ltx/gr_gr_cog/he.h.m8:heHE.StereosonImonTonNoun.name	Στερέωσον ἡμῶν τὸν νοῦν.
ltx/gr_gr_cog/he.h.m8:heHE.StereosonImonTonNoun.ode	@ltx/gr_gr_cog/miscellanea:misc.Ode3
ltx/gr_gr_cog/he.h.m8:heHE.StereosonImonTonNoun.text	Στερέωσον ἡμῶν τὸν νοῦν καὶ τὴν καρδίαν, ὁ τοὺς οὐρανοὺς τῷ λόγῳ στερεώσας, εἰς τὸ ὑμνεῖν καὶ δοξάζειν σε τὸν Σωτῆρα, καὶ λυτρωτὴν καὶ πανοικτίρμονα.
ltx/gr_gr_cog/he.h.m8:heHE.SyEiToStereoma.greekname	 
ltx/gr_gr_cog/he.h.m8:heHE.SyEiToStereoma.incipit	Σὺ εἶ τὸ στερέωμα…
ltx/gr_gr_cog/he.h.m8:heHE.SyEiToStereoma.melody	@ltx/gr_gr_cog/miscellanea:misc.Heirmos
ltx/gr_gr_cog/he.h.m8:heHE.SyEiToStereoma.mode	@ltx/gr_gr_cog/miscellanea:misc.Mode8
ltx/gr_gr_cog/he.h.m8:heHE.SyEiToStereoma.name	Σὺ εἶ τὸ στερέωμα.
ltx/gr_gr_cog/he.h.m8:heHE.SyEiToStereoma.ode	@ltx/gr_gr_cog/miscellanea:misc.Ode3
ltx/gr_gr_cog/he.h.m8:heHE.SyEiToStereoma.text	Σὺ εἶ τὸ στερέωμα, τῶν προστρεχόντων σοι Κύριε· σὺ εἶ τὸ φῶς τῶν ἐσκοτισμένων, καὶ ὑμνεῖ σε τὸ πνεῦμά μου.
ltx/gr_gr_cog/he.h.m8:heHE.SyMouIschys.greekname	 
ltx/gr_gr_cog/he.h.m8:heHE.SyMouIschys.incipit	Σύ μου ἰσχύς…
ltx/gr_gr_cog/he.h.m8:heHE.SyMouIschys.melody	@ltx/gr_gr_cog/miscellanea:misc.Heirmos
ltx/gr_gr_cog/he.h.m8:heHE.SyMouIschys.mode	@ltx/gr_gr_cog/miscellanea:misc.Mode8
ltx/gr_gr_cog/he.h.m8:heHE.SyMouIschys.name	Σύ μου ἰσχύς.
ltx/gr_gr_cog/he.h.m8:heHE.SyMouIschys.ode	@ltx/gr_gr_cog/miscellanea:misc.Ode4
ltx/gr_gr_cog/he.h.m8:heHE.SyMouIschys.text	Σύ μου ἰσχύς, Κύριε· σύ μου καὶ δύναμις· σὺ Θεός μου· σύ μου ἀγαλλίαμα, ὁ πατρικοὺς κόλπους μὴ λιπών, καὶ τὴν ἡμετέραν, πτωχείαν ἐπισκεψάμενος· διὸ σὺν τῷ προφήτῃ, Ἀββακούμ σοι κραυγάζω· Τῇ δυνάμει σου δόξα Φιλάνθρωπε.
ltx/gr_gr_cog/he.h.m8:heHE.SynechomenonDexaiMe.greekname	 
ltx/gr_gr_cog/he.h.m8:heHE.SynechomenonDexaiMe.incipit	Συνεχόμενον δέξαι με…
ltx/gr_gr_cog/he.h.m8:heHE.SynechomenonDexaiMe.melody	@ltx/gr_gr_cog/miscellanea:misc.Heirmos
ltx/gr_gr_cog/he.h.m8:heHE.SynechomenonDexaiMe.mode	@ltx/gr_gr_cog/miscellanea:misc.Mode8
ltx/gr_gr_cog/he.h.m8:heHE.SynechomenonDexaiMe.name	Συνεχόμενον δέξαι με.
ltx/gr_gr_cog/he.h.m8:heHE.SynechomenonDexaiMe.ode	@ltx/gr_gr_cog/miscellanea:misc.Ode6
ltx/gr_gr_cog/he.h.m8:heHE.SynechomenonDexaiMe.text	Συνεχόμενον δέξαι με φιλάνθρωπε, ἐκ πταισμάτων πολλῶν, προσπίπτοντα τοῖς οἰκτιρμοῖς σου, ὡς τὸν Προφήτην Κύριε, καὶ σῶσόν με.
ltx/gr_gr_cog/he.h.m8:heHE.ThalassanEpixas.greekname	 
ltx/gr_gr_cog/he.h.m8:heHE.ThalassanEpixas.incipit	Θάλασσαν ἔπηξας…
ltx/gr_gr_cog/he.h.m8:heHE.ThalassanEpixas.melody	@ltx/gr_gr_cog/miscellanea:misc.Heirmos
ltx/gr_gr_cog/he.h.m8:heHE.ThalassanEpixas.mode	@ltx/gr_gr_cog/miscellanea:misc.Mode8
ltx/gr_gr_cog/he.h.m8:heHE.ThalassanEpixas.name	Θάλασσαν ἔπηξας.
ltx/gr_gr_cog/he.h.m8:heHE.ThalassanEpixas.ode	@ltx/gr_gr_cog/miscellanea:misc.Ode1
ltx/gr_gr_cog/he.h.m8:heHE.ThalassanEpixas.text	Θάλασσαν ἔπηξας, βυθίσας σὺν ἅρμασι τὸν ἀλαζόνα Φαραώ, καὶ λαὸν διέσωσας ἁβρόχως Κύριε, καὶ εἰσήγαγες αὐτοὺς εἰς ὄρος ἁγιάσματος, βοῶντας· ᾌσωμέν σοι τῷ Θεῷ ἡμῶν, ᾠδὴν ἐπινίκιον, τῷ ἐν πολέμοις κραταιῷ.
ltx/gr_gr_cog/he.h.m8:heHE.TheouSynkatavasin.greekname	 
ltx/gr_gr_cog/he.h.m8:heHE.TheouSynkatavasin.incipit	Θεοῦ συγκατάβασιν…
ltx/gr_gr_cog/he.h.m8:heHE.TheouSynkatavasin.melody	@ltx/gr_gr_cog/miscellanea:misc.Heirmos
ltx/gr_gr_cog/he.h.m8:heHE.TheouSynkatavasin.mode	@ltx/gr_gr_cog/miscellanea:misc.Mode8
ltx/gr_gr_cog/he.h.m8:heHE.TheouSynkatavasin.name	Θεοῦ συγκατάβασιν.
ltx/gr_gr_cog/he.h.m8:heHE.TheouSynkatavasin.ode	@ltx/gr_gr_cog/miscellanea:misc.Ode7
ltx/gr_gr_cog/he.h.m8:heHE.TheouSynkatavasin.text	Θεοῦ συγκατάβασιν, τὸ πῦρ ἠδέσθη ἐν Βαβυλῶνι ποτέ· διὰ τοῦτο οἱ παῖδες, ἐν τῇ καμίνῳ ἀγαλλομένῳ ποδί, ὡς ἐν λειμῶνι χορεύοντες ἔψαλλον· Εὐλογητὸς ὁ Θεός, ὁ τῶν πατέρων ἡμῶν.
ltx/gr_gr_cog/he.h.m8:heHE.TinAgninEndoxos.greekname	 
ltx/gr_gr_cog/he.h.m8:heHE.TinAgninEndoxos.incipit	Τὴν ἁγνὴν ἐνδόξως…
ltx/gr_gr_cog/he.h.m8:heHE.TinAgninEndoxos.melody	@ltx/gr_gr_cog/miscellanea:misc.Heirmos
ltx/gr_gr_cog/he.h.m8:heHE.TinAgninEndoxos.mode	@ltx/gr_gr_cog/miscellanea:misc.Mode8
ltx/gr_gr_cog/he.h.m8:heHE.TinAgninEndoxos.name	Τὴν ἁγνὴν ἐνδόξως.
ltx/gr_gr_cog/he.h.m8:heHE.TinAgninEndoxos.ode	@ltx/gr_gr_cog/miscellanea:misc.Ode9
ltx/gr_gr_cog/he.h.m8:heHE.TinAgninEndoxos.text	Τὴν ἁγνὴν ἐνδόξως τιμήσωμεν, λαοὶ Θεοτόκον τὴν τὸ θεῖον πῦρ ἐν γαστρὶ ἀφλέκτως συλλαβοῦσαν ὕμνοις ἀσιγήτοις μεγαλύνωμεν.
ltx/gr_gr_cog/he.h.m8:heHE.TinDeisinEkcheo.greekname	 
ltx/gr_gr_cog/he.h.m8:heHE.TinDeisinEkcheo.incipit	Τὴν δέησιν ἐκχεῶ…
ltx/gr_gr_cog/he.h.m8:heHE.TinDeisinEkcheo.melody	@ltx/gr_gr_cog/miscellanea:misc.Heirmos
ltx/gr_gr_cog/he.h.m8:heHE.TinDeisinEkcheo.mode	@ltx/gr_gr_cog/miscellanea:misc.Mode8
ltx/gr_gr_cog/he.h.m8:heHE.TinDeisinEkcheo.name	Τὴν δέησιν ἐκχεῶ.
ltx/gr_gr_cog/he.h.m8:heHE.TinDeisinEkcheo.ode	@ltx/gr_gr_cog/miscellanea:misc.Ode6
ltx/gr_gr_cog/he.h.m8:heHE.TinDeisinEkcheo.text	Τὴν δέησιν ἐκχεῶ πρὸς Κύριον, καὶ αὐτῷ ἀπαγγελῶ μου τὰς θλίψεις, ὅτι κακῶν ἡ ψυχή μου ἐπλήσθη, καὶ ἡ ζωή μου τῷ ᾍδῃ προσήγγισε, καὶ δέομαι ὡς Ἰωνᾶς· Ἐκ φθορᾶς ὁ Θεός με ἀνάγαγε.
ltx/gr_gr_cog/he.h.m8:heHE.TisTonPathonMeAchlyos.greekname	 
ltx/gr_gr_cog/he.h.m8:heHE.TisTonPathonMeAchlyos.incipit	Τῆς τῶν παθῶν με ἀχλύος…
ltx/gr_gr_cog/he.h.m8:heHE.TisTonPathonMeAchlyos.melody	@ltx/gr_gr_cog/miscellanea:misc.Heirmos
ltx/gr_gr_cog/he.h.m8:heHE.TisTonPathonMeAchlyos.mode	@ltx/gr_gr_cog/miscellanea:misc.Mode8
ltx/gr_gr_cog/he.h.m8:heHE.TisTonPathonMeAchlyos.name	Τῆς τῶν παθῶν με ἀχλύος.
ltx/gr_gr_cog/he.h.m8:heHE.TisTonPathonMeAchlyos.ode	@ltx/gr_gr_cog/miscellanea:misc.Ode5
ltx/gr_gr_cog/he.h.m8:heHE.TisTonPathonMeAchlyos.text	Τῆς τῶν παθῶν με ἀχλύος, ὡς ἐκ νυκτὸς βαθυτάτης λυτρούμενος, ὀρθρίζειν ἀξίωσον, τὸ πνεῦμά μου δέομαι, ἐν φωτὶ ἡμέρας, τῶν σῶν προσταγμάτων Χριστέ.
ltx/gr_gr_cog/he.h.m8:heHE.ToEktinaxanti.greekname	 
ltx/gr_gr_cog/he.h.m8:heHE.ToEktinaxanti.incipit	Τῷ ἐκτινάξαντι…
ltx/gr_gr_cog/he.h.m8:heHE.ToEktinaxanti.melody	@ltx/gr_gr_cog/miscellanea:misc.Heirmos
ltx/gr_gr_cog/he.h.m8:heHE.ToEktinaxanti.mode	@ltx/gr_gr_cog/miscellanea:misc.Mode8
ltx/gr_gr_cog/he.h.m8:heHE.ToEktinaxanti.name	Τῷ ἐκτινάξαντι.
ltx/gr_gr_cog/he.h.m8:heHE.ToEktinaxanti.ode	@ltx/gr_gr_cog/miscellanea:misc.Ode1
ltx/gr_gr_cog/he.h.m8:heHE.ToEktinaxanti.text	Τῷ ἐκτινάξαντι ἐν θαλάσσῃ, τὴν τυραννίδα Φαραώ, καὶ τὸν Ἰσραὴλ διὰ ξηρᾶς ὁδηγήσαντι, ᾄσωμεν τῷ Χριστῷ, ὅτι δεδόξασται εἰς τοὺς αιῶνας.
ltx/gr_gr_cog/he.h.m8:heHE.ToSyntripsantiPolemous.greekname	 
ltx/gr_gr_cog/he.h.m8:heHE.ToSyntripsantiPolemous.incipit	Τῷ συντρίψαντι πολέμους…
ltx/gr_gr_cog/he.h.m8:heHE.ToSyntripsantiPolemous.melody	@ltx/gr_gr_cog/miscellanea:misc.Heirmos
ltx/gr_gr_cog/he.h.m8:heHE.ToSyntripsantiPolemous.mode	@ltx/gr_gr_cog/miscellanea:misc.Mode8
ltx/gr_gr_cog/he.h.m8:heHE.ToSyntripsantiPolemous.name	Τῷ συντρίψαντι πολέμους.
ltx/gr_gr_cog/he.h.m8:heHE.ToSyntripsantiPolemous.ode	@ltx/gr_gr_cog/miscellanea:misc.Ode1
ltx/gr_gr_cog/he.h.m8:heHE.ToSyntripsantiPolemous.text	Τῷ συντρίψαντι πολέμους, ἐν βραχίονι αὐτοῦ, καὶ διαβιβάσαντι τὸν Ἰσραήλ, ἐν Ἐρυθρᾷ θαλάσσῃ, ᾄσωμεν αὐτῷ, ὡς λυτρωτῇ ἡμῶν Θεῷ, ὅτι δεδόξασται.
ltx/gr_gr_cog/he.h.m8:heHE.TonAnarchonVasilea.greekname	 
ltx/gr_gr_cog/he.h.m8:heHE.TonAnarchonVasilea.incipit	Τὸν ἄναρχον Βασιλέα…
ltx/gr_gr_cog/he.h.m8:heHE.TonAnarchonVasilea.melody	@ltx/gr_gr_cog/miscellanea:misc.Heirmos
ltx/gr_gr_cog/he.h.m8:heHE.TonAnarchonVasilea.mode	@ltx/gr_gr_cog/miscellanea:misc.Mode8
ltx/gr_gr_cog/he.h.m8:heHE.TonAnarchonVasilea.name	Τὸν ἄναρχον Βασιλέα.
ltx/gr_gr_cog/he.h.m8:heHE.TonAnarchonVasilea.ode	@ltx/gr_gr_cog/miscellanea:misc.Ode8
ltx/gr_gr_cog/he.h.m8:heHE.TonAnarchonVasilea.text	Τὸν ἄναρχον Βασιλέα τῆς δόξης, ὂν φρίττουσι στρατιαὶ τῶν Ἀγγέλων, ὑμνεῖτε ἱερεῖς, λαὸς ὑπερυψοῦτε, εἰς πάντας τοὺς αἰῶνας.
ltx/gr_gr_cog/he.h.m8:heHE.TonAoratonMorfi.greekname	 
ltx/gr_gr_cog/he.h.m8:heHE.TonAoratonMorfi.incipit	Τὸν ἀόρατον μορφῇ…
ltx/gr_gr_cog/he.h.m8:heHE.TonAoratonMorfi.melody	@ltx/gr_gr_cog/miscellanea:misc.Heirmos
ltx/gr_gr_cog/he.h.m8:heHE.TonAoratonMorfi.mode	@ltx/gr_gr_cog/miscellanea:misc.Mode8
ltx/gr_gr_cog/he.h.m8:heHE.TonAoratonMorfi.name	Τὸν ἀόρατον μορφῇ.
ltx/gr_gr_cog/he.h.m8:heHE.TonAoratonMorfi.ode	@ltx/gr_gr_cog/miscellanea:misc.Ode9
ltx/gr_gr_cog/he.h.m8:heHE.TonAoratonMorfi.text	Τὸν ἀόρατον μορφῇ, θεϊκῇ δεξαμένη, ἀπειρόγαμε Παρθένε καὶ Μήτηρ, ὕμνοις τὸν τόκον σου μεγαλύνομεν.
ltx/gr_gr_cog/he.h.m8:heHE.TonChaldaionIKaminos.greekname	 
ltx/gr_gr_cog/he.h.m8:heHE.TonChaldaionIKaminos.incipit	Τῶν Χαλδαίων ἡ κάμινος…
ltx/gr_gr_cog/he.h.m8:heHE.TonChaldaionIKaminos.melody	@ltx/gr_gr_cog/miscellanea:misc.Heirmos
ltx/gr_gr_cog/he.h.m8:heHE.TonChaldaionIKaminos.mode	@ltx/gr_gr_cog/miscellanea:misc.Mode8
ltx/gr_gr_cog/he.h.m8:heHE.TonChaldaionIKaminos.name	Τῶν Χαλδαίων ἡ κάμινος.
ltx/gr_gr_cog/he.h.m8:heHE.TonChaldaionIKaminos.ode	@ltx/gr_gr_cog/miscellanea:misc.Ode7
ltx/gr_gr_cog/he.h.m8:heHE.TonChaldaionIKaminos.text	Τῶν Χαλδαίων ἡ κάμινος, πυρὶ φλογιζομένη, ἐδροσίζετο πνεύματι, Θεοῦ ἐπιστασίᾳ, οἱ Παῖδες ὑπέψαλλον· Εὐλογητὸς ὁ Θεὸς ὁ τῶν Πατέρων ἡμῶν.
ltx/gr_gr_cog/he.h.m8:heHE.TonEkNyktosAgnosias.greekname	 
ltx/gr_gr_cog/he.h.m8:heHE.TonEkNyktosAgnosias.incipit	Τὸν ἐκ νυκτὸς ἀγνωσίας…
ltx/gr_gr_cog/he.h.m8:heHE.TonEkNyktosAgnosias.melody	@ltx/gr_gr_cog/miscellanea:misc.Heirmos
ltx/gr_gr_cog/he.h.m8:heHE.TonEkNyktosAgnosias.mode	@ltx/gr_gr_cog/miscellanea:misc.Mode8
ltx/gr_gr_cog/he.h.m8:heHE.TonEkNyktosAgnosias.name	Τὸν ἐκ νυκτὸς ἀγνωσίας.
ltx/gr_gr_cog/he.h.m8:heHE.TonEkNyktosAgnosias.ode	@ltx/gr_gr_cog/miscellanea:misc.Ode5
ltx/gr_gr_cog/he.h.m8:heHE.TonEkNyktosAgnosias.text	Τὸν ἐκ νυκτὸς ἀγνωσίας, ἐπὶ τὴν ψυχάλωτον ὀδὸν ἀεὶ πλανώμενον, φωτὶ τῆς γνώσεώς σου Κύριε, ποδηγῶν με ἐν τῇ τρίβῳ τῶν ἐντολῶν σου καθοδήγησον.
ltx/gr_gr_cog/he.h.m8:heHE.TonEkPatrosProAionon.greekname	 
ltx/gr_gr_cog/he.h.m8:heHE.TonEkPatrosProAionon.incipit	Τὸν ἐκ Πατρὸς πρὸ αἰώνων…
ltx/gr_gr_cog/he.h.m8:heHE.TonEkPatrosProAionon.melody	@ltx/gr_gr_cog/miscellanea:misc.Heirmos
ltx/gr_gr_cog/he.h.m8:heHE.TonEkPatrosProAionon.mode	@ltx/gr_gr_cog/miscellanea:misc.Mode8
ltx/gr_gr_cog/he.h.m8:heHE.TonEkPatrosProAionon.name	Τὸν ἐκ Πατρὸς πρὸ αἰώνων.
ltx/gr_gr_cog/he.h.m8:heHE.TonEkPatrosProAionon.ode	@ltx/gr_gr_cog/miscellanea:misc.Ode8
ltx/gr_gr_cog/he.h.m8:heHE.TonEkPatrosProAionon.text	Τὸν ἐκ Πατρὸς πρὸ αἰώνων γεννηθέντα, καὶ ἐκ Μητρὸς ἐπʼ ἐσχάτων σαρκωθέντα, Ἱερεῖς εὐλογεῖτε, λαὸς ὑπερυψοῦτε, εἰς πάντας τοὺς αἰῶνας.
ltx/gr_gr_cog/he.h.m8:heHE.TonEnOreiAgio.greekname	 
ltx/gr_gr_cog/he.h.m8:heHE.TonEnOreiAgio.incipit	Τὸν ἐν ὄρει ἁγίῳ…
ltx/gr_gr_cog/he.h.m8:heHE.TonEnOreiAgio.melody	@ltx/gr_gr_cog/miscellanea:misc.Heirmos
ltx/gr_gr_cog/he.h.m8:heHE.TonEnOreiAgio.mode	@ltx/gr_gr_cog/miscellanea:misc.Mode8
ltx/gr_gr_cog/he.h.m8:heHE.TonEnOreiAgio.name	Τὸν ἐν ὄρει ἁγίῳ.
ltx/gr_gr_cog/he.h.m8:heHE.TonEnOreiAgio.ode	@ltx/gr_gr_cog/miscellanea:misc.Ode8
ltx/gr_gr_cog/he.h.m8:heHE.TonEnOreiAgio.text	Τὸν ἐν ὄρει ἁγίῳ δοξασθέντα, καὶ ἐν βάτῳ πυρὶ τὸ τῆς Ἀειπαρθένου, τῷ Μωϋσῇ μυστήριον γνωρίσαντα, Κύριον ὑμνεῖτε, καὶ ὑπερυψοῦτε, εἰς πάντας τοὺς αἰῶνας.
ltx/gr_gr_cog/he.h.m8:heHE.TonFovonSouKyrie.greekname	 
ltx/gr_gr_cog/he.h.m8:heHE.TonFovonSouKyrie.incipit	Τὸν φόβον σου Κύριε…
ltx/gr_gr_cog/he.h.m8:heHE.TonFovonSouKyrie.melody	@ltx/gr_gr_cog/miscellanea:misc.Heirmos
ltx/gr_gr_cog/he.h.m8:heHE.TonFovonSouKyrie.mode	@ltx/gr_gr_cog/miscellanea:misc.Mode8
ltx/gr_gr_cog/he.h.m8:heHE.TonFovonSouKyrie.name	Τὸν φόβον σου Κύριε.
ltx/gr_gr_cog/he.h.m8:heHE.TonFovonSouKyrie.ode	@ltx/gr_gr_cog/miscellanea:misc.Ode3
ltx/gr_gr_cog/he.h.m8:heHE.TonFovonSouKyrie.text	Τὸν φόβον σου Κύριε, ἐμφύτευσον ταῖς καρδίαις τῶν δούλων σου, καὶ γενοῦ ἡμῖν στερέωμα, τοῖς σὲ ἐν ἀληθείᾳ, ἐπικαλουμένοις.
ltx/gr_gr_cog/he.h.m8:heHE.TonIonanEnToKitei.greekname	 
ltx/gr_gr_cog/he.h.m8:heHE.TonIonanEnToKitei.incipit	Τὸν Ἰωνᾶν ἐν τῷ κήτει…
ltx/gr_gr_cog/he.h.m8:heHE.TonIonanEnToKitei.melody	@ltx/gr_gr_cog/miscellanea:misc.Heirmos
ltx/gr_gr_cog/he.h.m8:heHE.TonIonanEnToKitei.mode	@ltx/gr_gr_cog/miscellanea:misc.Mode8
ltx/gr_gr_cog/he.h.m8:heHE.TonIonanEnToKitei.name	Τὸν Ἰωνᾶν ἐν τῷ κήτει.
ltx/gr_gr_cog/he.h.m8:heHE.TonIonanEnToKitei.ode	@ltx/gr_gr_cog/miscellanea:misc.Ode6
ltx/gr_gr_cog/he.h.m8:heHE.TonIonanEnToKitei.text	Τὸν Ἰωνᾶν, ἐν τῷ κήτει Κύριε, μονώτατον κατῴκισας· ἐμὲ δὲ τὸν πεπεδημένον, ἐν ἄρκυσι τοῦ ἐχθροῦ, ὡς ἐκ φθορᾶς ἐκεῖνον διάσωσον.
ltx/gr_gr_cog/he.h.m8:heHE.TonIsrailEkDouleias.greekname	 
ltx/gr_gr_cog/he.h.m8:heHE.TonIsrailEkDouleias.incipit	Τὸν Ἰσραὴλ ἐκ δουλείας…
ltx/gr_gr_cog/he.h.m8:heHE.TonIsrailEkDouleias.melody	@ltx/gr_gr_cog/miscellanea:misc.Heirmos
ltx/gr_gr_cog/he.h.m8:heHE.TonIsrailEkDouleias.mode	@ltx/gr_gr_cog/miscellanea:misc.Mode8
ltx/gr_gr_cog/he.h.m8:heHE.TonIsrailEkDouleias.name	Τὸν Ἰσραὴλ ἐκ δουλείας.
ltx/gr_gr_cog/he.h.m8:heHE.TonIsrailEkDouleias.ode	@ltx/gr_gr_cog/miscellanea:misc.Ode1
ltx/gr_gr_cog/he.h.m8:heHE.TonIsrailEkDouleias.text	Τὸν Ἰσραὴλ ἐκ δουλείας ἐλυτρώσω Κύριε τῇ δεξιᾷ σου τῇ κραταιᾷ ὡς εκεῖνον ἔσωσας καὶ ἡμᾶς διάσωσον.
ltx/gr_gr_cog/he.h.m8:heHE.TonProdilothenta.greekname	 
ltx/gr_gr_cog/he.h.m8:heHE.TonProdilothenta.incipit	Τὸν προδηλωθέντα…
ltx/gr_gr_cog/he.h.m8:heHE.TonProdilothenta.melody	@ltx/gr_gr_cog/miscellanea:misc.Heirmos
ltx/gr_gr_cog/he.h.m8:heHE.TonProdilothenta.mode	@ltx/gr_gr_cog/miscellanea:misc.Mode8
ltx/gr_gr_cog/he.h.m8:heHE.TonProdilothenta.name	Τὸν προδηλωθέντα.
ltx/gr_gr_cog/he.h.m8:heHE.TonProdilothenta.ode	@ltx/gr_gr_cog/miscellanea:misc.Ode9
ltx/gr_gr_cog/he.h.m8:heHE.TonProdilothenta.text	Τὸν προδηλωθέντα ἐν ὄρει τῷ Νομοθέτῃ, ἐν πυρὶ καὶ βάτῳ τόκον τὸν τῆς Ἀειπαρθένου, εἰς ἡμῶν τῶν πιστῶν σωτηρίαν, ὕμνοις ἀσιγήτοις μεγαλύνωμεν.
ltx/gr_gr_cog/he.h.m8:heHE.TonVasileaTonOuranon.greekname	 
ltx/gr_gr_cog/he.h.m8:heHE.TonVasileaTonOuranon.incipit	Τὸν Βασιλέα τῶν οὐρανῶν…
ltx/gr_gr_cog/he.h.m8:heHE.TonVasileaTonOuranon.melody	@ltx/gr_gr_cog/miscellanea:misc.Heirmos
ltx/gr_gr_cog/he.h.m8:heHE.TonVasileaTonOuranon.mode	@ltx/gr_gr_cog/miscellanea:misc.Mode8
ltx/gr_gr_cog/he.h.m8:heHE.TonVasileaTonOuranon.name	Τὸν Βασιλέα τῶν οὐρανῶν.
ltx/gr_gr_cog/he.h.m8:heHE.TonVasileaTonOuranon.ode	@ltx/gr_gr_cog/miscellanea:misc.Ode8
ltx/gr_gr_cog/he.h.m8:heHE.TonVasileaTonOuranon.text	Τὸν Βασιλέα τῶν οὐρανῶν ὂν ὑμνοῦσι, στρατιαὶ τῶν Ἀγγέλων ὑμνεῖτε, καὶ ὑπερυψοῦτε εἰς πάντας τοὺς αἰῶνας.
ltx/gr_gr_cog/he.h.m8:heHE.TonZofonTisPsychisMou.greekname	 
ltx/gr_gr_cog/he.h.m8:heHE.TonZofonTisPsychisMou.incipit	Τὸν ζόφον τῆς ψυχῆς μου…
ltx/gr_gr_cog/he.h.m8:heHE.TonZofonTisPsychisMou.melody	@ltx/gr_gr_cog/miscellanea:misc.Heirmos
ltx/gr_gr_cog/he.h.m8:heHE.TonZofonTisPsychisMou.mode	@ltx/gr_gr_cog/miscellanea:misc.Mode8
ltx/gr_gr_cog/he.h.m8:heHE.TonZofonTisPsychisMou.name	Τὸν ζόφον τῆς ψυχῆς μου.
ltx/gr_gr_cog/he.h.m8:heHE.TonZofonTisPsychisMou.ode	@ltx/gr_gr_cog/miscellanea:misc.Ode5
ltx/gr_gr_cog/he.h.m8:heHE.TonZofonTisPsychisMou.text	Τὸν ζόφον τῆς ψυχῆς μου, διασκέδασον φωτοδότα Χριστὲ ὁ Θεός, τὸ ἀρχέγονον σκότος, διώξας τῆς ἀβύσσου, καὶ δώρησαί μοι τὸ φῶς, τῶν προσταγμάτων σου Λόγε, ἵνα ὀρθρίζων δοξάζω σε.
ltx/gr_gr_cog/he.h.m8:heHE.YgranDiodefsas.greekname	 
ltx/gr_gr_cog/he.h.m8:heHE.YgranDiodefsas.incipit	Ὑγρὰν διοδεύσας…
ltx/gr_gr_cog/he.h.m8:heHE.YgranDiodefsas.melody	@ltx/gr_gr_cog/miscellanea:misc.Heirmos
ltx/gr_gr_cog/he.h.m8:heHE.YgranDiodefsas.mode	@ltx/gr_gr_cog/miscellanea:misc.Mode8
ltx/gr_gr_cog/he.h.m8:heHE.YgranDiodefsas.name	Ὑγρὰν διοδεύσας.
ltx/gr_gr_cog/he.h.m8:heHE.YgranDiodefsas.ode	@ltx/gr_gr_cog/miscellanea:misc.Ode1
ltx/gr_gr_cog/he.h.m8:heHE.YgranDiodefsas.text	Ὑγρὰν διοδεύσας ὡσεὶ ξηράν, καὶ τὴν αἰγυπτίαν, μοχθηρίαν διαφυγών, ὁ Ἰσραηλίτης ἀνεβόα· Τῷ Λυτρωτῇ καὶ Θεῷ ἡμῶν ᾄσωμεν.
