ltx/gr_gr_cog/le.go.me.m07.d11:lemeLI.Gospel.book_abbr	@ltx/gr_gr_cog/le.go.lu.d022:leluLI.Gospel.book_abbr
ltx/gr_gr_cog/le.go.me.m07.d11:lemeLI.Gospel.book_string	@ltx/gr_gr_cog/le.go.lu.d022:leluLI.Gospel.book_string
ltx/gr_gr_cog/le.go.me.m07.d11:lemeLI.Gospel.chapverse	@ltx/gr_gr_cog/le.go.lu.d022:leluLI.Gospel.chapverse
ltx/gr_gr_cog/le.go.me.m07.d11:lemeLI.Gospel.incipit	@ltx/gr_gr_cog/le.go.lu.d022:leluLI.Gospel.incipit
ltx/gr_gr_cog/le.go.me.m07.d11:lemeLI.Gospel.text	@ltx/gr_gr_cog/le.go.lu.d022:leluLI.Gospel.text
ltx/gr_gr_cog/le.go.me.m07.d11:lemeLI.Gospel.title	Τῆς Ἁγίας
ltx/gr_gr_cog/le.go.me.m07.d11:lemeLI.Gospel.title_abbr	Τῆς Ἁγίας
ltx/gr_gr_cog/le.go.me.m07.d11:lemeLI.Gospel.version	@ltx/gr_gr_cog/le.go.lu.d022:leluLI.Gospel.version
