ltx/gr_gr_cog/ho.ho26:hoCA.Kathisma11.incipit	Ὁ τῆς ψυχῆς μου φυλακτὴρ…
ltx/gr_gr_cog/ho.ho26:hoCA.Kathisma11.melody	@ltx/gr_gr_cog/he.a.m4:heAU.OYpsotheisEnToStavro.name
ltx/gr_gr_cog/ho.ho26:hoCA.Kathisma11.mode	@ltx/gr_gr_cog/miscellanea:misc.Mode4
ltx/gr_gr_cog/ho.ho26:hoCA.Kathisma11.text	Ὁ τῆς ψυχῆς μου φυλακτὴρ καὶ τοῦ σώματος, ἀφορισθείς μοι ἐκ Θεοῦ, θεῖε Ἄγγελε, θεομιμήτωρ πάριδε πανάγιε, ἅπαντα τὰ πταίσματα, τῆς ἀθλίας ψυχῆς μου· ῥῦσαι τοῦ δολίου με, τῶν ποικίλων παγίδων, καὶ τὸν κοινὸν ἱλέωσαι Θεόν, ἵνα ἐν κρίσει παράσχῃ μοι ἄφεσιν.
ltx/gr_gr_cog/ho.ho26:hoCA.Kontakion.incipit	Θεοῦ λειτουργέ, καὶ φύλαξ μου…
ltx/gr_gr_cog/ho.ho26:hoCA.Kontakion.melody	@ltx/gr_gr_cog/he.a.m2:heAU.TaAnoZiton.name
ltx/gr_gr_cog/ho.ho26:hoCA.Kontakion.mode	@ltx/gr_gr_cog/miscellanea:misc.Mode2
ltx/gr_gr_cog/ho.ho26:hoCA.Kontakion.text	Θεοῦ λειτουργέ, καὶ φύλαξ μου πανάριστε, τῷ ἁμαρτωλῷ, ἀεί μοι συμπαράμενε, κακουργίας πάσης με τῶν δαιμόνων ἐκλυτρούμενονς, καὶ πρὸς θείας τρίβους ὁδηγῶν, ζωὴν προξενούσας τὴν ἀκήρατον.
ltx/gr_gr_cog/ho.ho26:hoCA.Ode11.greekmelody	@ltx/gr_gr_cog/he.h.m8:heHE.YgranDiodefsas.greekname
ltx/gr_gr_cog/ho.ho26:hoCA.Ode11.incipit	Τὸν ἄγυπνον φύλακα τῆς ἐμῆς…
ltx/gr_gr_cog/ho.ho26:hoCA.Ode11.melody	@ltx/gr_gr_cog/he.h.m8:heHE.YgranDiodefsas.name
ltx/gr_gr_cog/ho.ho26:hoCA.Ode11.mode	@ltx/gr_gr_cog/miscellanea:misc.Mode8
ltx/gr_gr_cog/ho.ho26:hoCA.Ode11.ode	@ltx/gr_gr_cog/miscellanea:misc.Ode1
ltx/gr_gr_cog/ho.ho26:hoCA.Ode11.text	Τὸν ἄγυπνον φύλακα τῆς ἐμῆς, ψυχῆς καὶ προστάτην, τῆς ζωῆς μου καὶ ὁδηγόν, θεόθεν, ὃν ἔλαχον, ὑμνῶ σε, Ἄγγελε θεῖε τοῦ Θεοῦ παντοκράτορος.
ltx/gr_gr_cog/ho.ho26:hoCA.Ode12.incipit	Ὁ θέλων σωθῆναι πάντας βροτούς…
ltx/gr_gr_cog/ho.ho26:hoCA.Ode12.melody	@ltx/gr_gr_cog/he.h.m8:heHE.YgranDiodefsas.name
ltx/gr_gr_cog/ho.ho26:hoCA.Ode12.mode	@ltx/gr_gr_cog/miscellanea:misc.Mode8
ltx/gr_gr_cog/ho.ho26:hoCA.Ode12.ode	@ltx/gr_gr_cog/miscellanea:misc.Ode1
ltx/gr_gr_cog/ho.ho26:hoCA.Ode12.text	Ὁ θέλων σωθῆναι πάντας βροτούς, ἁγίους Ἀγγέλους, ὁδηγοὺς καὶ φωταγωγούς, ἐπέστησας Λόγε τοῖς ἀνθρώποις, χειραγωγοῦντας ἡμᾶς πρὸς τὸν φόβον σου.
ltx/gr_gr_cog/ho.ho26:hoCA.Ode13.incipit	Νυκτὶ συνεχόμενον ζοφερᾷ, καὶ μέλανι…
ltx/gr_gr_cog/ho.ho26:hoCA.Ode13.melody	@ltx/gr_gr_cog/he.h.m8:heHE.YgranDiodefsas.name
ltx/gr_gr_cog/ho.ho26:hoCA.Ode13.mode	@ltx/gr_gr_cog/miscellanea:misc.Mode8
ltx/gr_gr_cog/ho.ho26:hoCA.Ode13.ode	@ltx/gr_gr_cog/miscellanea:misc.Ode1
ltx/gr_gr_cog/ho.ho26:hoCA.Ode13.text	Νυκτὶ συνεχόμενον ζοφερᾷ, καὶ μέλανι γνόφῳ, καλυπτόμενον τῶν παθῶν, φωτὶ μετανοίας αὔγασόν με, ὁ ὁδηγὸς καὶ προστάτης καὶ φύλαξ μου.
ltx/gr_gr_cog/ho.ho26:hoCA.Ode14.incipit	Ἀισχρῶν ἐνθυμήσεων ἐν ἐμοί, πηγάζει…
ltx/gr_gr_cog/ho.ho26:hoCA.Ode14.melody	@ltx/gr_gr_cog/he.h.m8:heHE.YgranDiodefsas.name
ltx/gr_gr_cog/ho.ho26:hoCA.Ode14.mode	@ltx/gr_gr_cog/miscellanea:misc.Mode8
ltx/gr_gr_cog/ho.ho26:hoCA.Ode14.ode	@ltx/gr_gr_cog/miscellanea:misc.Ode1
ltx/gr_gr_cog/ho.ho26:hoCA.Ode14.text	Ἀισχρῶν ἐνθυμήσεων ἐν ἐμοί, πηγάζει πλημμύρα, βορβορώδης καὶ ζοφερά, τοῦ Θεοῦ χωρίζουσα τὸν νοῦν μου, ἣν ἀποξήρανον, ὦ ἀντιλῆπτορ μου.
ltx/gr_gr_cog/ho.ho26:hoCA.Ode1H.greekmelody	@ltx/gr_gr_cog/he.h.m8:heHE.YgranDiodefsas.greekname
ltx/gr_gr_cog/ho.ho26:hoCA.Ode1H.incipit	@ltx/gr_gr_cog/he.h.m8:heHE.YgranDiodefsas.incipit
ltx/gr_gr_cog/ho.ho26:hoCA.Ode1H.melody	@ltx/gr_gr_cog/he.h.m8:heHE.YgranDiodefsas.melody
ltx/gr_gr_cog/ho.ho26:hoCA.Ode1H.mode	@ltx/gr_gr_cog/miscellanea:misc.Mode8
ltx/gr_gr_cog/ho.ho26:hoCA.Ode1H.ode	@ltx/gr_gr_cog/miscellanea:misc.Ode1
ltx/gr_gr_cog/ho.ho26:hoCA.Ode1H.text	@ltx/gr_gr_cog/he.h.m8:heHE.YgranDiodefsas.text
ltx/gr_gr_cog/ho.ho26:hoCA.Ode1T.incipit	Γαλήνη σὺ Δέσποινα καὶ λιμήν…
ltx/gr_gr_cog/ho.ho26:hoCA.Ode1T.melody	@ltx/gr_gr_cog/he.h.m8:heHE.YgranDiodefsas.name
ltx/gr_gr_cog/ho.ho26:hoCA.Ode1T.mode	@ltx/gr_gr_cog/miscellanea:misc.Mode8
ltx/gr_gr_cog/ho.ho26:hoCA.Ode1T.ode	@ltx/gr_gr_cog/miscellanea:misc.Ode1
ltx/gr_gr_cog/ho.ho26:hoCA.Ode1T.text	Γαλήνη σὺ Δέσποινα καὶ λιμήν, τῶν χειμαζομένων ἐν πελάγει ἁμαρτιῶν· διό σου προστρέχω τῷ λιμένι, κλυδωνιζόμενος σάλῳ ποικίλων παθῶν.
ltx/gr_gr_cog/ho.ho26:hoCA.Ode31.greekmelody	@ltx/gr_gr_cog/he.h.m8:heHE.OuraniasApsidos.greekname
ltx/gr_gr_cog/ho.ho26:hoCA.Ode31.incipit	Γεηροῦ καὶ πηλίνου, καὶ χοϊκοῦ…
ltx/gr_gr_cog/ho.ho26:hoCA.Ode31.melody	@ltx/gr_gr_cog/he.h.m8:heHE.OuraniasApsidos.name
ltx/gr_gr_cog/ho.ho26:hoCA.Ode31.mode	@ltx/gr_gr_cog/miscellanea:misc.Mode8
ltx/gr_gr_cog/ho.ho26:hoCA.Ode31.ode	@ltx/gr_gr_cog/miscellanea:misc.Ode3
ltx/gr_gr_cog/ho.ho26:hoCA.Ode31.text	Γεηροῦ καὶ πηλίνου, καὶ χοϊκοῦ κράματος, ἐσχηκὼς τὴν ὕπαρξιν, τῇ γῇ προσήλωμαι· ἀλλʼ ὦ προστάτα μου, καὶ ὁδηγέ μου καὶ ῥῦστα, τρέψον μου τὴν ἔφεσιν, πρὸς τὰ οὐράνια.
ltx/gr_gr_cog/ho.ho26:hoCA.Ode32.incipit	Ἐν νυκτὶ καὶ ἡμέρᾳ, τοῖς…
ltx/gr_gr_cog/ho.ho26:hoCA.Ode32.melody	@ltx/gr_gr_cog/he.h.m8:heHE.OuraniasApsidos.name
ltx/gr_gr_cog/ho.ho26:hoCA.Ode32.mode	@ltx/gr_gr_cog/miscellanea:misc.Mode8
ltx/gr_gr_cog/ho.ho26:hoCA.Ode32.ode	@ltx/gr_gr_cog/miscellanea:misc.Ode3
ltx/gr_gr_cog/ho.ho26:hoCA.Ode32.text	Ἐν νυκτὶ καὶ ἡμέρᾳ, τοῖς πονηροῖς ἔργοις μου, παραπικραίνω καὶ θλίβω, καὶ παροξύνω σε, καὶ οὐκ ἐθέλοντα, ἀπὸ μακρόθεν ἑστάναι, τὸν ὑπέρμαχον, καταναγκάζω σε.
ltx/gr_gr_cog/ho.ho26:hoCA.Ode33.incipit	Λύπης καὶ ἀθυμίας, παρεστικὸς γίνομαι…
ltx/gr_gr_cog/ho.ho26:hoCA.Ode33.melody	@ltx/gr_gr_cog/he.h.m8:heHE.OuraniasApsidos.name
ltx/gr_gr_cog/ho.ho26:hoCA.Ode33.mode	@ltx/gr_gr_cog/miscellanea:misc.Mode8
ltx/gr_gr_cog/ho.ho26:hoCA.Ode33.ode	@ltx/gr_gr_cog/miscellanea:misc.Ode3
ltx/gr_gr_cog/ho.ho26:hoCA.Ode33.text	Λύπης καὶ ἀθυμίας, παρεστικὸς γίνομαι, ὡς ἀμετανόητος μένων καὶ ἀδιόρθωτος· διό μοι δώρησαι, μετανοῆσαι γνησίως, καὶ χαροποιῆσαί σε, τὸν ἐμὸν φύλακα.
ltx/gr_gr_cog/ho.ho26:hoCA.Ode34.incipit	Ὁ ὁρῶν ἀοράτως, τὸ τοῦ…
ltx/gr_gr_cog/ho.ho26:hoCA.Ode34.melody	@ltx/gr_gr_cog/he.h.m8:heHE.OuraniasApsidos.name
ltx/gr_gr_cog/ho.ho26:hoCA.Ode34.mode	@ltx/gr_gr_cog/miscellanea:misc.Mode8
ltx/gr_gr_cog/ho.ho26:hoCA.Ode34.ode	@ltx/gr_gr_cog/miscellanea:misc.Ode3
ltx/gr_gr_cog/ho.ho26:hoCA.Ode34.text	Ὁ ὁρῶν ἀοράτως, τὸ τοῦ Θεοῦ πρόσωπον, τοῦ ἐν οὐρανοῖς καθημένου, καὶ ἐπιβλέποντος, ἐπὶ τὴν γῆν φοερῶς, καὶ τρέμειν ταύτην ποιοῦντος, αἴτησαι σωθῆναί με, ἅγιε Ἄγγελε.
ltx/gr_gr_cog/ho.ho26:hoCA.Ode3H.greekmelody	@ltx/gr_gr_cog/he.h.m8:heHE.OuraniasApsidos.greekname
ltx/gr_gr_cog/ho.ho26:hoCA.Ode3H.incipit	@ltx/gr_gr_cog/he.h.m8:heHE.OuraniasApsidos.incipit
ltx/gr_gr_cog/ho.ho26:hoCA.Ode3H.melody	@ltx/gr_gr_cog/he.h.m8:heHE.OuraniasApsidos.melody
ltx/gr_gr_cog/ho.ho26:hoCA.Ode3H.mode	@ltx/gr_gr_cog/miscellanea:misc.Mode8
ltx/gr_gr_cog/ho.ho26:hoCA.Ode3H.ode	@ltx/gr_gr_cog/miscellanea:misc.Ode3
ltx/gr_gr_cog/ho.ho26:hoCA.Ode3H.text	@ltx/gr_gr_cog/he.h.m8:heHE.OuraniasApsidos.text
ltx/gr_gr_cog/ho.ho26:hoCA.Ode3T.incipit	Νοῦν καὶ φρένα καὶ λόγον…
ltx/gr_gr_cog/ho.ho26:hoCA.Ode3T.melody	@ltx/gr_gr_cog/he.h.m8:heHE.OuraniasApsidos.name
ltx/gr_gr_cog/ho.ho26:hoCA.Ode3T.mode	@ltx/gr_gr_cog/miscellanea:misc.Mode8
ltx/gr_gr_cog/ho.ho26:hoCA.Ode3T.ode	@ltx/gr_gr_cog/miscellanea:misc.Ode3
ltx/gr_gr_cog/ho.ho26:hoCA.Ode3T.text	Νοῦν καὶ φρένα καὶ λόγον, δῶρον Θεοῦ εἴληφα, ὅπως ἐπιγνοὺς τὸν Δεσπότην, ἔργοις τιμήσω καλοῖς· ἐγὼ δὲ πάθεσι, τὴν δωρεὰν ἀτιμάσας, τὸν δοτῆρα ὕβρισα· Δέσποινα σῶσόν με.
ltx/gr_gr_cog/ho.ho26:hoCA.Ode41.greekmelody	@ltx/gr_gr_cog/he.h.m8:heHE.SyMouIschys.greekname
ltx/gr_gr_cog/ho.ho26:hoCA.Ode41.incipit	Μὴ ἐννοῶν, τὸ φοβερὸν δικαστήριον…
ltx/gr_gr_cog/ho.ho26:hoCA.Ode41.melody	@ltx/gr_gr_cog/he.h.m8:heHE.SyMouIschys.name
ltx/gr_gr_cog/ho.ho26:hoCA.Ode41.mode	@ltx/gr_gr_cog/miscellanea:misc.Mode8
ltx/gr_gr_cog/ho.ho26:hoCA.Ode41.ode	@ltx/gr_gr_cog/miscellanea:misc.Ode4
ltx/gr_gr_cog/ho.ho26:hoCA.Ode41.text	Μὴ ἐννοῶν, τὸ φοβερὸν δικαστήριον, ἐν ᾧ μέλλω, Σῶτερ παραστήσεσθαι, καὶ δοῦναι λόγον περὶ παντός, ἔργου τε καὶ λόγου, μηδὲ θανάτου τὸ ἄδηλον, εἰς νοῦν λαμβάνων ὅλως ἀδιόρθωτος μένω. Ὁδηγέ μου μὴ ἐγκαταλίπης με.
ltx/gr_gr_cog/ho.ho26:hoCA.Ode42.incipit	Ἐπιμελῶς, πᾶσαν κακίαν ἐτέλεσα, νηπιόθεν…
ltx/gr_gr_cog/ho.ho26:hoCA.Ode42.melody	@ltx/gr_gr_cog/he.h.m8:heHE.SyMouIschys.name
ltx/gr_gr_cog/ho.ho26:hoCA.Ode42.mode	@ltx/gr_gr_cog/miscellanea:misc.Mode8
ltx/gr_gr_cog/ho.ho26:hoCA.Ode42.ode	@ltx/gr_gr_cog/miscellanea:misc.Ode4
ltx/gr_gr_cog/ho.ho26:hoCA.Ode42.text	Ἐπιμελῶς, πᾶσαν κακίαν ἐτέλεσα, νηπιόθεν καὶ οὐκ ἐπαυσάμην σε, τὸν ἀντιλήπτορα τὸν ἐμόν, τοῦ παραπικραίνειν, ἀθέσμοις λόγοις καὶ πράξεσιν· ἀλλʼ οὖν μὴ ἐκκακίσῃς, ἀλλʼ ἐπίμεινον ἔτι συνετίζων, φωτίζων, στηρίζων με.
ltx/gr_gr_cog/ho.ho26:hoCA.Ode43.incipit	Λόγου Θεοῦ, μακροθυμίαν μιμούμενος, τοῦ…
ltx/gr_gr_cog/ho.ho26:hoCA.Ode43.melody	@ltx/gr_gr_cog/he.h.m8:heHE.SyMouIschys.name
ltx/gr_gr_cog/ho.ho26:hoCA.Ode43.mode	@ltx/gr_gr_cog/miscellanea:misc.Mode8
ltx/gr_gr_cog/ho.ho26:hoCA.Ode43.ode	@ltx/gr_gr_cog/miscellanea:misc.Ode4
ltx/gr_gr_cog/ho.ho26:hoCA.Ode43.text	Λόγου Θεοῦ, μακροθυμίαν μιμούμενος, τοῦ ἐλθόντος, ὅπως εἰς μετάνοιαν καλέσῃ πάντας ἁμαρτωλούς, καὶ ἐνδεχομένου αὐθαίρετον τὴν διόρθωσιν, καὶ μὴ βιαζομένου, καὶ αὐτὸς ὁδηγέ μου, ἐπʼ ἐμοὶ μακροθύμως παράμεινον.
ltx/gr_gr_cog/ho.ho26:hoCA.Ode44.incipit	Πόῤῥω Θεοῦ, ἡ ἁμαρτία με…
ltx/gr_gr_cog/ho.ho26:hoCA.Ode44.melody	@ltx/gr_gr_cog/he.h.m8:heHE.SyMouIschys.name
ltx/gr_gr_cog/ho.ho26:hoCA.Ode44.mode	@ltx/gr_gr_cog/miscellanea:misc.Mode8
ltx/gr_gr_cog/ho.ho26:hoCA.Ode44.ode	@ltx/gr_gr_cog/miscellanea:misc.Ode4
ltx/gr_gr_cog/ho.ho26:hoCA.Ode44.text	Πόῤῥω Θεοῦ, ἡ ἁμαρτία με ἔλαβε, τὸν ἀχρεῖον, δοῦλον καὶ ἀνάξιον· ἀλλʼ ὁ Δεσπότης μου Ἰησοῦς, προσέλαβετό με, εὐσπλάγχνως καὶ ᾠκειώσατο· ἐγὼ δὲ τὴν τοσαύτην, ἀθετῶν αὐτοῦ χάριν, ἔτι θλίβω καὶ σέ, θεῖε Ἄγγελε.
ltx/gr_gr_cog/ho.ho26:hoCA.Ode4H.greekmelody	@ltx/gr_gr_cog/he.h.m8:heHE.SyMouIschys.greekname
ltx/gr_gr_cog/ho.ho26:hoCA.Ode4H.incipit	@ltx/gr_gr_cog/he.h.m8:heHE.SyMouIschys.incipit
ltx/gr_gr_cog/ho.ho26:hoCA.Ode4H.melody	@ltx/gr_gr_cog/he.h.m8:heHE.SyMouIschys.melody
ltx/gr_gr_cog/ho.ho26:hoCA.Ode4H.mode	@ltx/gr_gr_cog/miscellanea:misc.Mode8
ltx/gr_gr_cog/ho.ho26:hoCA.Ode4H.ode	@ltx/gr_gr_cog/miscellanea:misc.Ode4
ltx/gr_gr_cog/ho.ho26:hoCA.Ode4H.text	@ltx/gr_gr_cog/he.h.m8:heHE.SyMouIschys.text
ltx/gr_gr_cog/ho.ho26:hoCA.Ode4T.incipit	Ὡς ἀληθῶς, ὁ Κύριος ἐβασίλευσε…
ltx/gr_gr_cog/ho.ho26:hoCA.Ode4T.melody	@ltx/gr_gr_cog/he.h.m8:heHE.SyMouIschys.name
ltx/gr_gr_cog/ho.ho26:hoCA.Ode4T.mode	@ltx/gr_gr_cog/miscellanea:misc.Mode8
ltx/gr_gr_cog/ho.ho26:hoCA.Ode4T.ode	@ltx/gr_gr_cog/miscellanea:misc.Ode4
ltx/gr_gr_cog/ho.ho26:hoCA.Ode4T.text	Ὡς ἀληθῶς, ὁ Κύριος ἐβασίλευσε, βασιλείαν, τὴν μὴ διαπίπτουσαν, καὶ ἐνεδύσατο ψαλμικῶς, ἐκ σοῦ Θεομῆτορ, ὡραιοτάτην εὑπρέπειαν, τὴν σάρκα τὴν ἁγίαν, διʼ ἧς θάνατον εἶλε, καὶ καθεῖλεν αὐτοῦ τὰ βασίλεια.
ltx/gr_gr_cog/ho.ho26:hoCA.Ode51.greekmelody	@ltx/gr_gr_cog/he.h.m8:heHE.InaTiMeAposo.greekname
ltx/gr_gr_cog/ho.ho26:hoCA.Ode51.incipit	Σὲ φρουρὸν κεκτημένος, σύνοικον, συνόμιλον…
ltx/gr_gr_cog/ho.ho26:hoCA.Ode51.melody	@ltx/gr_gr_cog/he.h.m8:heHE.InaTiMeAposo.name
ltx/gr_gr_cog/ho.ho26:hoCA.Ode51.mode	@ltx/gr_gr_cog/miscellanea:misc.Mode8
ltx/gr_gr_cog/ho.ho26:hoCA.Ode51.ode	@ltx/gr_gr_cog/miscellanea:misc.Ode5
ltx/gr_gr_cog/ho.ho26:hoCA.Ode51.text	Σὲ φρουρὸν κεκτημένος, σύνοικον, συνόμιλον, ἅγιε Ἄγγελε, συμπαρομαρτοῦντα, συνοδεύοντα, συμπαραμένοντα, τὰ σωτηριώδη, ὑποτιθέμενον ἀεί μοι, ποίαν ἔξω συγγνώμην, ἀσύνετος ὤν;
ltx/gr_gr_cog/ho.ho26:hoCA.Ode52.incipit	Ἐν πολλῇ παῤῥησίᾳ, θρόνῳ παριστάμενος…
ltx/gr_gr_cog/ho.ho26:hoCA.Ode52.melody	@ltx/gr_gr_cog/he.h.m8:heHE.InaTiMeAposo.name
ltx/gr_gr_cog/ho.ho26:hoCA.Ode52.mode	@ltx/gr_gr_cog/miscellanea:misc.Mode8
ltx/gr_gr_cog/ho.ho26:hoCA.Ode52.ode	@ltx/gr_gr_cog/miscellanea:misc.Ode5
ltx/gr_gr_cog/ho.ho26:hoCA.Ode52.text	Ἐν πολλῇ παῤῥησίᾳ, θρόνῳ παριστάμενος τοῦ Παντοκράτορος, καὶ περιχορεύων περὶ τὸν Βασιλέα τῆς κτίσεως, τῶν πολλῶν κακῶν μου, παρασχεθῆναί μοι συγγνώμην, ὁ ὑπερασπιστής μου δεήθητι.
ltx/gr_gr_cog/ho.ho26:hoCA.Ode53.incipit	Τὰς βασάνους προβλέπων, καὶ τὰς…
ltx/gr_gr_cog/ho.ho26:hoCA.Ode53.melody	@ltx/gr_gr_cog/he.h.m8:heHE.InaTiMeAposo.name
ltx/gr_gr_cog/ho.ho26:hoCA.Ode53.mode	@ltx/gr_gr_cog/miscellanea:misc.Mode8
ltx/gr_gr_cog/ho.ho26:hoCA.Ode53.ode	@ltx/gr_gr_cog/miscellanea:misc.Ode5
ltx/gr_gr_cog/ho.ho26:hoCA.Ode53.text	Τὰς βασάνους προβλέπων, καὶ τὰς τιμωρίας τὰς ἀναμενούσας με, καὶ τὴν πώρωσίν μου, καὶ τὴν ἀναλγησίαν καὶ τύφλωσιν, ἐλεῶν στενάζεις καὶ σκυθρωπάζεις καὶ στυγνάζεις, κατηφείας πληρούμενος, ῥῦστά μου.
ltx/gr_gr_cog/ho.ho26:hoCA.Ode54.incipit	Οὐδεμίαν πρὸς ὥραν, ἀλλʼ οὐδὲ…
ltx/gr_gr_cog/ho.ho26:hoCA.Ode54.melody	@ltx/gr_gr_cog/he.h.m8:heHE.InaTiMeAposo.name
ltx/gr_gr_cog/ho.ho26:hoCA.Ode54.mode	@ltx/gr_gr_cog/miscellanea:misc.Mode8
ltx/gr_gr_cog/ho.ho26:hoCA.Ode54.ode	@ltx/gr_gr_cog/miscellanea:misc.Ode5
ltx/gr_gr_cog/ho.ho26:hoCA.Ode54.text	Οὐδεμίαν πρὸς ὥραν, ἀλλʼ οὐδὲ στιγμήν, ἢ καὶ ταύτης βραχύτερον, συνεχώρησά μοι, τῷ ἐμῷ εὐεργέτῃ καὶ φύλακι, ἐπʼ ἐμοὶ χαρῆναι, καὶ εὐφρανθῆναι καὶ σκιρτῆσαι, ἁμαρτίαις ἀεὶ συμφθειρόμενος.
ltx/gr_gr_cog/ho.ho26:hoCA.Ode5H.greekmelody	@ltx/gr_gr_cog/he.h.m8:heHE.InaTiMeAposo.greekname
ltx/gr_gr_cog/ho.ho26:hoCA.Ode5H.incipit	@ltx/gr_gr_cog/he.h.m8:heHE.InaTiMeAposo.incipit
ltx/gr_gr_cog/ho.ho26:hoCA.Ode5H.melody	@ltx/gr_gr_cog/he.h.m8:heHE.InaTiMeAposo.melody
ltx/gr_gr_cog/ho.ho26:hoCA.Ode5H.mode	@ltx/gr_gr_cog/miscellanea:misc.Mode8
ltx/gr_gr_cog/ho.ho26:hoCA.Ode5H.ode	@ltx/gr_gr_cog/miscellanea:misc.Ode5
ltx/gr_gr_cog/ho.ho26:hoCA.Ode5H.text	@ltx/gr_gr_cog/he.h.m8:heHE.InaTiMeAposo.text
ltx/gr_gr_cog/ho.ho26:hoCA.Ode5T.incipit	Νέον βρέφος ὡράθη, ὁ ἀπερινόητος…
ltx/gr_gr_cog/ho.ho26:hoCA.Ode5T.melody	@ltx/gr_gr_cog/he.h.m8:heHE.InaTiMeAposo.name
ltx/gr_gr_cog/ho.ho26:hoCA.Ode5T.mode	@ltx/gr_gr_cog/miscellanea:misc.Mode8
ltx/gr_gr_cog/ho.ho26:hoCA.Ode5T.ode	@ltx/gr_gr_cog/miscellanea:misc.Ode5
ltx/gr_gr_cog/ho.ho26:hoCA.Ode5T.text	Νέον βρέφος ὡράθη, ὁ ἀπερινόητος ἐκ σοῦ Πανάμωμε· ὁ σταθμῷ τὰς νάπας, καὶ τὰ ὄρη ζυγῷ στήσας γνώσεως· ὁ χορὸν ἀστέρων, διαριθμῶν, καὶ βῶλον δρόσου, καὶ ἀνέμων πνοὴν μεταθέμενος.
ltx/gr_gr_cog/ho.ho26:hoCA.Ode61.greekmelody	@ltx/gr_gr_cog/he.h.m8:heHE.TinDeisinEkcheo.greekname
ltx/gr_gr_cog/ho.ho26:hoCA.Ode61.incipit	Φυλάσσων καὶ παρεμβάλλων κύκλω μου…
ltx/gr_gr_cog/ho.ho26:hoCA.Ode61.melody	@ltx/gr_gr_cog/he.h.m8:heHE.TinDeisinEkcheo.name
ltx/gr_gr_cog/ho.ho26:hoCA.Ode61.mode	@ltx/gr_gr_cog/miscellanea:misc.Mode8
ltx/gr_gr_cog/ho.ho26:hoCA.Ode61.ode	@ltx/gr_gr_cog/miscellanea:misc.Ode6
ltx/gr_gr_cog/ho.ho26:hoCA.Ode61.text	Φυλάσσων καὶ παρεμβάλλων κύκλω μου, καὶ ὁρμὰς ἀναχαιτίζων δαιμόνων, καὶ τὰς αὐτῶν θηριώδεις ἐφόδους τὰς κατʼ ἐμοῦ ἀναστέλλων ἑκάστοτε, μὴ λίπῃς, ὁ φύλαξ ὁ ἐμός, σὲ γὰρ ἔχω θερμὸν ἀντιλήπτορα.
ltx/gr_gr_cog/ho.ho26:hoCA.Ode62.incipit	Ὑπέρτιμον καὶ εὐῶδες ὢν μύρον…
ltx/gr_gr_cog/ho.ho26:hoCA.Ode62.melody	@ltx/gr_gr_cog/he.h.m8:heHE.TinDeisinEkcheo.name
ltx/gr_gr_cog/ho.ho26:hoCA.Ode62.mode	@ltx/gr_gr_cog/miscellanea:misc.Mode8
ltx/gr_gr_cog/ho.ho26:hoCA.Ode62.ode	@ltx/gr_gr_cog/miscellanea:misc.Ode6
ltx/gr_gr_cog/ho.ho26:hoCA.Ode62.text	Ὑπέρτιμον καὶ εὐῶδες ὢν μύρον, μὴ βδελύξῃ τὴν ἐμὴν δυσωδίαν, μὴ ἀποστῇς ἀπʼ ἐμοῦ μέχρι τέλους, ἀλλʼ ἀδιάστατος ἔσο μοι φύλαξ ἀεί· καὶ ἥλιος τόπους ῥυπαρούς, διερχόμενος γὰρ οὐ μολύνεται.
ltx/gr_gr_cog/ho.ho26:hoCA.Ode63.incipit	Λιβάδας δακρυομβρύτους ὀμβρίζειν, τὸν στεγάζοντα…
ltx/gr_gr_cog/ho.ho26:hoCA.Ode63.melody	@ltx/gr_gr_cog/he.h.m8:heHE.TinDeisinEkcheo.name
ltx/gr_gr_cog/ho.ho26:hoCA.Ode63.mode	@ltx/gr_gr_cog/miscellanea:misc.Mode8
ltx/gr_gr_cog/ho.ho26:hoCA.Ode63.ode	@ltx/gr_gr_cog/miscellanea:misc.Ode6
ltx/gr_gr_cog/ho.ho26:hoCA.Ode63.text	Λιβάδας δακρυομβρύτους ὀμβρίζειν, τὸν στεγάζοντα ἐν ὕδασι λόγῳ, τὰ ἑαυτοῦ ὑψηλὰ ὑπερῷα, χάριν μοι δοῦναι δυσώπει προστάτα μου· ὡς ἄν διʼ ἐκείνων καθαρθῇ, ἡ καρδία μου, καὶ καθορᾷ τὸν Θεόν.
ltx/gr_gr_cog/ho.ho26:hoCA.Ode64.incipit	Ἀΰλως, ὡς καθαρὸς καὶ ἄϋλος…
ltx/gr_gr_cog/ho.ho26:hoCA.Ode64.melody	@ltx/gr_gr_cog/he.h.m8:heHE.TinDeisinEkcheo.name
ltx/gr_gr_cog/ho.ho26:hoCA.Ode64.mode	@ltx/gr_gr_cog/miscellanea:misc.Mode8
ltx/gr_gr_cog/ho.ho26:hoCA.Ode64.ode	@ltx/gr_gr_cog/miscellanea:misc.Ode6
ltx/gr_gr_cog/ho.ho26:hoCA.Ode64.text	Ἀΰλως, ὡς καθαρὸς καὶ ἄϋλος, παρεστὼς τῷ καθαρῷ καὶ ἀΰλῳ, καὶ πρὸς αὐτὸν κεκτημένος πλουσίαν, τὴν παῤῥησίαν καὶ τὴν οἰκειότητα, δυσώπησον τοῦτον ἐκτενῶς, τὴν ψυχήν μου σωθεῖσαν χαρίσαι μοι.
ltx/gr_gr_cog/ho.ho26:hoCA.Ode65.incipit	Καλύψειεν ἐντροπὴ καὶ αἰσχύνη, τὰς…
ltx/gr_gr_cog/ho.ho26:hoCA.Ode65.melody	@ltx/gr_gr_cog/he.h.m8:heHE.TinDeisinEkcheo.name
ltx/gr_gr_cog/ho.ho26:hoCA.Ode65.mode	@ltx/gr_gr_cog/miscellanea:misc.Mode8
ltx/gr_gr_cog/ho.ho26:hoCA.Ode65.ode	@ltx/gr_gr_cog/miscellanea:misc.Ode6
ltx/gr_gr_cog/ho.ho26:hoCA.Ode65.text	Καλύψειεν ἐντροπὴ καὶ αἰσχύνη, τὰς αἰσχρὰς καὶ δυσειδεῖς καὶ ζοφώδεις, ὄψεις ἐχθρῶν, ὁπηνίκα τοῦ σκήνους, ἡ ταπεινή μου ψυχὴ διαζεύγνηται· αὐτὴν δὲ σκεπάσαις, ὁδηγέ, σαῖς λαμπραῖς πανιέροις τε πτέρυξι.
ltx/gr_gr_cog/ho.ho26:hoCA.Ode6H.greekmelody	@ltx/gr_gr_cog/he.h.m8:heHE.TinDeisinEkcheo.greekname
ltx/gr_gr_cog/ho.ho26:hoCA.Ode6H.incipit	@ltx/gr_gr_cog/he.h.m8:heHE.TinDeisinEkcheo.incipit
ltx/gr_gr_cog/ho.ho26:hoCA.Ode6H.melody	@ltx/gr_gr_cog/he.h.m8:heHE.TinDeisinEkcheo.melody
ltx/gr_gr_cog/ho.ho26:hoCA.Ode6H.mode	@ltx/gr_gr_cog/miscellanea:misc.Mode8
ltx/gr_gr_cog/ho.ho26:hoCA.Ode6H.ode	@ltx/gr_gr_cog/miscellanea:misc.Ode6
ltx/gr_gr_cog/ho.ho26:hoCA.Ode6H.text	@ltx/gr_gr_cog/he.h.m8:heHE.TinDeisinEkcheo.text
ltx/gr_gr_cog/ho.ho26:hoCA.Ode6T.incipit	Ἁγίων ἁγιωτέρα Ἀγγέλων, Χερουβεὶμ καὶ…
ltx/gr_gr_cog/ho.ho26:hoCA.Ode6T.melody	@ltx/gr_gr_cog/he.h.m8:heHE.TinDeisinEkcheo.name
ltx/gr_gr_cog/ho.ho26:hoCA.Ode6T.mode	@ltx/gr_gr_cog/miscellanea:misc.Mode8
ltx/gr_gr_cog/ho.ho26:hoCA.Ode6T.ode	@ltx/gr_gr_cog/miscellanea:misc.Ode6
ltx/gr_gr_cog/ho.ho26:hoCA.Ode6T.text	Ἁγίων ἁγιωτέρα Ἀγγέλων, Χερουβεὶμ καὶ Σεραφεὶμ ὑπερτέρα, τὸν χαμερπῆ καὶ χαμίζηλον νοῦν μου, τῆς γεηρᾶς καὶ προσύλου ἐφέσεως, ὑπέρτερον δεῖξον ἀπὸ γῆς, πρὸς οὐράνιον πόθον ὑψώσασα.
ltx/gr_gr_cog/ho.ho26:hoCA.Ode71.greekmelody	@ltx/gr_gr_cog/he.h.m8:heHE.OiEkTisIoudaias.greekname
ltx/gr_gr_cog/ho.ho26:hoCA.Ode71.incipit	Μυριάδας τῶν κύκλῳ, συνεπιτιθεμένων ἐμοὶ…
ltx/gr_gr_cog/ho.ho26:hoCA.Ode71.melody	@ltx/gr_gr_cog/he.h.m8:heHE.OiEkTisIoudaias.name
ltx/gr_gr_cog/ho.ho26:hoCA.Ode71.mode	@ltx/gr_gr_cog/miscellanea:misc.Mode8
ltx/gr_gr_cog/ho.ho26:hoCA.Ode71.ode	@ltx/gr_gr_cog/miscellanea:misc.Ode7
ltx/gr_gr_cog/ho.ho26:hoCA.Ode71.text	Μυριάδας τῶν κύκλῳ, συνεπιτιθεμένων ἐμοὶ λῃστῶν ἀφανῶν, ζητούντων τὴν ψυχήν μου ἁρπάσαι καὶ σπαράξαι, τῇ πυρίνῃ ῥομφαίᾳ σου, ἀποσοβῶν κραταιῶς, μὴ λύπῃς βοηθέ μου.
ltx/gr_gr_cog/ho.ho26:hoCA.Ode72.incipit	Ὅταν μέλλῃ με κρῖναι, ὁ…
ltx/gr_gr_cog/ho.ho26:hoCA.Ode72.melody	@ltx/gr_gr_cog/he.h.m8:heHE.OiEkTisIoudaias.name
ltx/gr_gr_cog/ho.ho26:hoCA.Ode72.mode	@ltx/gr_gr_cog/miscellanea:misc.Mode8
ltx/gr_gr_cog/ho.ho26:hoCA.Ode72.ode	@ltx/gr_gr_cog/miscellanea:misc.Ode7
ltx/gr_gr_cog/ho.ho26:hoCA.Ode72.text	Ὅταν μέλλῃ με κρῖναι, ὁ Κριτὴς καὶ Θεός μου καὶ κατακρῖναί με, τὸν κατακεκριμένον, ὑπὸ τοῦ συνειδότος, πρὸ ἐκείνης τῆς κρίσεως, μὴ ἐπιλάθῃ τοῦ σοῦ δούλου χειραγωγέ μου.
ltx/gr_gr_cog/ho.ho26:hoCA.Ode73.incipit	Ὕλην σχὼν τὴν μητέρα, καὶ…
ltx/gr_gr_cog/ho.ho26:hoCA.Ode73.melody	@ltx/gr_gr_cog/he.h.m8:heHE.OiEkTisIoudaias.name
ltx/gr_gr_cog/ho.ho26:hoCA.Ode73.mode	@ltx/gr_gr_cog/miscellanea:misc.Mode8
ltx/gr_gr_cog/ho.ho26:hoCA.Ode73.ode	@ltx/gr_gr_cog/miscellanea:misc.Ode7
ltx/gr_gr_cog/ho.ho26:hoCA.Ode73.text	Ὕλην σχὼν τὴν μητέρα, καὶ πηλὸν τὸν πατέρα, καὶ τὸν προπάτορα χοῦν, τῇ τούτων συγγενείᾳ, εἰς γῆν διόλου βλέπω· ἀδεῶς δὸς προστάτα μου, καὶ ἄνω βλέψαι ποτέ, πρὸς οὐρανοῦ τὸ κάλλος.
ltx/gr_gr_cog/ho.ho26:hoCA.Ode74.incipit	Ὠς ὡραῖος τῷ κάλλει, καὶ…
ltx/gr_gr_cog/ho.ho26:hoCA.Ode74.melody	@ltx/gr_gr_cog/he.h.m8:heHE.OiEkTisIoudaias.name
ltx/gr_gr_cog/ho.ho26:hoCA.Ode74.mode	@ltx/gr_gr_cog/miscellanea:misc.Mode8
ltx/gr_gr_cog/ho.ho26:hoCA.Ode74.ode	@ltx/gr_gr_cog/miscellanea:misc.Ode7
ltx/gr_gr_cog/ho.ho26:hoCA.Ode74.text	Ὠς ὡραῖος τῷ κάλλει, καὶ γλυκὺς καὶ χαρίεις, ἡλιόμροφος νοῦς, φαιδρῶς παράστηθί μοι, προσώπῳ μειδιῶντι, ἱλαρῷ τε προσβλέμματι, ἡνίκα μέλλω τῆς γῆς, ἀπαίρειν ὁδηγέ μου.
ltx/gr_gr_cog/ho.ho26:hoCA.Ode75.incipit	Διὰ σπλάγχνα ἐλέους, διὰ φιλανθρωπίας…
ltx/gr_gr_cog/ho.ho26:hoCA.Ode75.melody	@ltx/gr_gr_cog/he.h.m8:heHE.OiEkTisIoudaias.name
ltx/gr_gr_cog/ho.ho26:hoCA.Ode75.mode	@ltx/gr_gr_cog/miscellanea:misc.Mode8
ltx/gr_gr_cog/ho.ho26:hoCA.Ode75.ode	@ltx/gr_gr_cog/miscellanea:misc.Ode7
ltx/gr_gr_cog/ho.ho26:hoCA.Ode75.text	Διὰ σπλάγχνα ἐλέους, διὰ φιλανθρωπίας περιουσίαν πολλήν, τῶν σῶν πτερύγων σκέπῃ φρουρέ μου σκέπασόν με, ἐκδημοῦντα τοῦ σώματος, ὡς μὴ ἰδεῖν δυσειδῆ, πρόσωπα τῶν δαιμόνων.
ltx/gr_gr_cog/ho.ho26:hoCA.Ode7H.greekmelody	@ltx/gr_gr_cog/he.h.m8:heHE.OiEkTisIoudaias.greekname
ltx/gr_gr_cog/ho.ho26:hoCA.Ode7H.incipit	@ltx/gr_gr_cog/he.h.m8:heHE.OiEkTisIoudaias.incipit
ltx/gr_gr_cog/ho.ho26:hoCA.Ode7H.melody	@ltx/gr_gr_cog/he.h.m8:heHE.OiEkTisIoudaias.melody
ltx/gr_gr_cog/ho.ho26:hoCA.Ode7H.mode	@ltx/gr_gr_cog/miscellanea:misc.Mode8
ltx/gr_gr_cog/ho.ho26:hoCA.Ode7H.ode	@ltx/gr_gr_cog/miscellanea:misc.Ode7
ltx/gr_gr_cog/ho.ho26:hoCA.Ode7H.text	@ltx/gr_gr_cog/he.h.m8:heHE.OiEkTisIoudaias.text
ltx/gr_gr_cog/ho.ho26:hoCA.Ode7T.incipit	Ἡ οὐράνιος πύλη, ἡ σωτήριος…
ltx/gr_gr_cog/ho.ho26:hoCA.Ode7T.melody	@ltx/gr_gr_cog/he.h.m8:heHE.OiEkTisIoudaias.name
ltx/gr_gr_cog/ho.ho26:hoCA.Ode7T.mode	@ltx/gr_gr_cog/miscellanea:misc.Mode8
ltx/gr_gr_cog/ho.ho26:hoCA.Ode7T.ode	@ltx/gr_gr_cog/miscellanea:misc.Ode7
ltx/gr_gr_cog/ho.ho26:hoCA.Ode7T.text	Ἡ οὐράνιος πύλη, ἡ σωτήριος θύρα, ἡ κλῖμαξ ἡ νοητή, διʼ ἧς Θεὸς κατέβη, καὶ ἄνθρωπος ἀνέβη, οὐρανῶν βασιλείας με, τοῖς οἰκτιρμοῖς σου Σεμνή, ἀξίωσον σὸν δοῦλον.
ltx/gr_gr_cog/ho.ho26:hoCA.Ode81.greekmelody	@ltx/gr_gr_cog/he.h.m8:heHE.EptaplasiosKaminon.greekname
ltx/gr_gr_cog/ho.ho26:hoCA.Ode81.incipit	Μετὰ Θεόν σε ἔλαβον, ἐκ…
ltx/gr_gr_cog/ho.ho26:hoCA.Ode81.melody	@ltx/gr_gr_cog/he.h.m8:heHE.EptaplasiosKaminon.name
ltx/gr_gr_cog/ho.ho26:hoCA.Ode81.mode	@ltx/gr_gr_cog/miscellanea:misc.Mode8
ltx/gr_gr_cog/ho.ho26:hoCA.Ode81.ode	@ltx/gr_gr_cog/miscellanea:misc.Ode8
ltx/gr_gr_cog/ho.ho26:hoCA.Ode81.text	Μετὰ Θεόν σε ἔλαβον, ἐκ Θεοῦ ἀντιλήπτορα, καὶ χειργωγόν, καὶ βοηθὸν καὶ πρόμαχον, πανάγιε Ἄγγελε· διὸ μὴ παύσῃ δέομαι, καὶ παιδαγωγῶν καὶ νουθετῶν, καὶ διδάσκων, τὰ δέοντα με πράττειν, καὶ φωτίζων τὀν νοῦν μου, ἕως με παραστήσῃς, τῷ Χριστῷ σεσωσμένον.
ltx/gr_gr_cog/ho.ho26:hoCA.Ode82.incipit	Ὅταν οἱ θρόνοι τίθωνται, καὶ…
ltx/gr_gr_cog/ho.ho26:hoCA.Ode82.melody	@ltx/gr_gr_cog/he.h.m8:heHE.EptaplasiosKaminon.name
ltx/gr_gr_cog/ho.ho26:hoCA.Ode82.mode	@ltx/gr_gr_cog/miscellanea:misc.Mode8
ltx/gr_gr_cog/ho.ho26:hoCA.Ode82.ode	@ltx/gr_gr_cog/miscellanea:misc.Ode8
ltx/gr_gr_cog/ho.ho26:hoCA.Ode82.text	Ὅταν οἱ θρόνοι τίθωνται, καὶ αἱ βίβλοι ἀνοίγωνται, καὶ ὁ παλαιὸς τῶν ἡμερῶν καθέζηται, καὶ κρίνωνται ἄνθρωποι, καὶ κλονῆται γῆ, καὶ πάντα φρίσσῃ καὶ τρέμῃ, τὴν σὴν φιλανθρωπίαν ἐπʼ ἐμοὶ δεῖξον τότε, καὶ ῥυσαί με γεέννης, Χριστὸν καθικευτεύων.
ltx/gr_gr_cog/ho.ho26:hoCA.Ode83.incipit	Νῦν, ὡς κηρίον μέλισσαι, ἀοράτως…
ltx/gr_gr_cog/ho.ho26:hoCA.Ode83.melody	@ltx/gr_gr_cog/he.h.m8:heHE.EptaplasiosKaminon.name
ltx/gr_gr_cog/ho.ho26:hoCA.Ode83.mode	@ltx/gr_gr_cog/miscellanea:misc.Mode8
ltx/gr_gr_cog/ho.ho26:hoCA.Ode83.ode	@ltx/gr_gr_cog/miscellanea:misc.Ode8
ltx/gr_gr_cog/ho.ho26:hoCA.Ode83.text	Νῦν, ὡς κηρίον μέλισσαι, ἀοράτως κυκλοῦσί με, οἱ θεοστυγεῖς καὶ λυμεῶνες δαίμονες, ὡς ἅρπαγες ὄρνιθες, ὡς δολεραὶ ἀλώπεκες, καὶ ὡς αἱμοφάγα, πετεινὰ σαρκοβόρα, κυκλόθεν ἵπτανταί μου· σκέπασόν με φρουρέ μου, ὡς ἀετὸς σκεπάζει τὰ ἑαυτοῦ νοσσία.
ltx/gr_gr_cog/ho.ho26:hoCA.Ode84.incipit	Ἀπὸ βλεφάρων δάκρυα, ἀστακτὶ καταῤῥέοντα…
ltx/gr_gr_cog/ho.ho26:hoCA.Ode84.melody	@ltx/gr_gr_cog/he.h.m8:heHE.EptaplasiosKaminon.name
ltx/gr_gr_cog/ho.ho26:hoCA.Ode84.mode	@ltx/gr_gr_cog/miscellanea:misc.Mode8
ltx/gr_gr_cog/ho.ho26:hoCA.Ode84.ode	@ltx/gr_gr_cog/miscellanea:misc.Ode8
ltx/gr_gr_cog/ho.ho26:hoCA.Ode84.text	Ἀπὸ βλεφάρων δάκρυα, ἀστακτὶ καταῤῥέοντα, μετὰ δαψιλοῦς τῆς προχοῆς παράσχου μοι, διʼ ὅλου με πλύνοντα, ἐκ κορυφῆς μέχρι ποδῶν, ὡς ὑπὲρ χιόνα, λευκαθέντα χιτῶνα, φορέσας μετανοίας, εἰς νυμφῶνα τὸν θεῖον, εἰσέλθω σε γεραίρων τὸν ὑπερασπιστήν μου.
ltx/gr_gr_cog/ho.ho26:hoCA.Ode85.incipit	Χριστοῦ ναὸν ὑπάρχουσαν, τὴν καρδίαν…
ltx/gr_gr_cog/ho.ho26:hoCA.Ode85.melody	@ltx/gr_gr_cog/he.h.m8:heHE.EptaplasiosKaminon.name
ltx/gr_gr_cog/ho.ho26:hoCA.Ode85.mode	@ltx/gr_gr_cog/miscellanea:misc.Mode8
ltx/gr_gr_cog/ho.ho26:hoCA.Ode85.ode	@ltx/gr_gr_cog/miscellanea:misc.Ode8
ltx/gr_gr_cog/ho.ho26:hoCA.Ode85.text	Χριστοῦ ναὸν ὑπάρχουσαν, τὴν καρδίαν μου πάθεσι, χοίρων νοητῶν διατριβὴν ἐτέλεσα· ἀλλά με δινάμωσον, ὁ τῆς ἐμῆς ψυχῆς βοηθός, ταύτην καθαρίσαι, θυμιάσαι, ῥαντίσαι, ἀρώμασι καὶ μύροις, προσευχῶν καὶ ἀγνοίας, ὡς ἂν ὑπάρξῃ πάλιν, ναὸς Χριστοῦ εὐώδης.
ltx/gr_gr_cog/ho.ho26:hoCA.Ode86.incipit	Ὁ ὁδηγὸς καὶ φύλαξ μου…
ltx/gr_gr_cog/ho.ho26:hoCA.Ode86.melody	@ltx/gr_gr_cog/he.h.m8:heHE.EptaplasiosKaminon.name
ltx/gr_gr_cog/ho.ho26:hoCA.Ode86.mode	@ltx/gr_gr_cog/miscellanea:misc.Mode8
ltx/gr_gr_cog/ho.ho26:hoCA.Ode86.ode	@ltx/gr_gr_cog/miscellanea:misc.Ode8
ltx/gr_gr_cog/ho.ho26:hoCA.Ode86.text	Ὁ ὁδηγὸς καὶ φύλαξ μου, καὶ προστάτης καὶ ῥύστης μου, τῆς ἀπεγνωσμένης μου ψυχῆς ὁ ἔφορος, ἡνίκα τῆς σάλπιγγος, τὸ φοβερὸν ἀπήχημα, μέλλῃ με τῆς γῆς, ἐξαναστῆσαι εἰς κρίσιν, ἐγγύς μου στῆθι τότε, ἱλαρὸς καὶ χαρίεις, ἐλπίδι σωτηρίας, ἐξαίρων μου τὸν φόβον.
ltx/gr_gr_cog/ho.ho26:hoCA.Ode8H.greekmelody	@ltx/gr_gr_cog/he.h.m8:heHE.EptaplasiosKaminon.greekname
ltx/gr_gr_cog/ho.ho26:hoCA.Ode8H.incipit	@ltx/gr_gr_cog/he.h.m8:heHE.EptaplasiosKaminon.incipit
ltx/gr_gr_cog/ho.ho26:hoCA.Ode8H.melody	@ltx/gr_gr_cog/he.h.m8:heHE.EptaplasiosKaminon.melody
ltx/gr_gr_cog/ho.ho26:hoCA.Ode8H.mode	@ltx/gr_gr_cog/miscellanea:misc.Mode8
ltx/gr_gr_cog/ho.ho26:hoCA.Ode8H.ode	@ltx/gr_gr_cog/miscellanea:misc.Ode8
ltx/gr_gr_cog/ho.ho26:hoCA.Ode8H.text	@ltx/gr_gr_cog/he.h.m8:heHE.EptaplasiosKaminon.text
ltx/gr_gr_cog/ho.ho26:hoCA.Ode8T.incipit	Ὑπερβολῇ χρηστότητος, δωρεάν με ἐλέησον…
ltx/gr_gr_cog/ho.ho26:hoCA.Ode8T.melody	@ltx/gr_gr_cog/he.h.m8:heHE.EptaplasiosKaminon.name
ltx/gr_gr_cog/ho.ho26:hoCA.Ode8T.mode	@ltx/gr_gr_cog/miscellanea:misc.Mode8
ltx/gr_gr_cog/ho.ho26:hoCA.Ode8T.ode	@ltx/gr_gr_cog/miscellanea:misc.Ode8
ltx/gr_gr_cog/ho.ho26:hoCA.Ode8T.text	Ὑπερβολῇ χρηστότητος, δωρεάν με ἐλέησον, ἡ τῆς εὐσπλαγχνίας τὴν πηγὴν κυήσασα· ἐλέους γὰρ ἄξιον, οὐκ ἔχω τί προσάξω σοι, τῶν γὰρ ἀγαθῶν μου, οὐδαμῶς χρείαν ἔχεις, ὡς τὸν ἀγαθοδότην, καὶ σωτῆρα τοῦ κόσμου, ἀῤῥήτως συλλαβοῦσα ἡ Κεχαριτωμένη.
ltx/gr_gr_cog/ho.ho26:hoCA.Ode91.greekmelody	@ltx/gr_gr_cog/he.h.m8:heHE.EfrixePasaAkoi.greekname
ltx/gr_gr_cog/ho.ho26:hoCA.Ode91.incipit	Ἴδοιμί σε ἐκ δεξιῶν, τῆς…
ltx/gr_gr_cog/ho.ho26:hoCA.Ode91.melody	@ltx/gr_gr_cog/he.h.m8:heHE.EfrixePasaAkoi.name
ltx/gr_gr_cog/ho.ho26:hoCA.Ode91.mode	@ltx/gr_gr_cog/miscellanea:misc.Mode8
ltx/gr_gr_cog/ho.ho26:hoCA.Ode91.ode	@ltx/gr_gr_cog/miscellanea:misc.Ode9
ltx/gr_gr_cog/ho.ho26:hoCA.Ode91.text	Ἴδοιμί σε ἐκ δεξιῶν, τῆς ἀθλίας μου ψυχῆς παριστάμενον, φαιδρὸν καὶ ἥμερον, τὸν ἀντιλήπτορα καὶ προστάτην μου, ἐν τῷ ἐκλείπειν ἐξ ἐμοῦ, βιαίως τὸ πνεῦμά μου· καὶ τοὺς ζητοῦντάς με, συλλαβεῖν πικροὺς ἐχθροὺς φυγαδεύοντα.
ltx/gr_gr_cog/ho.ho26:hoCA.Ode92.incipit	Ὡς Θεοῦ θεῖος λειτρουγός, ὁ…
ltx/gr_gr_cog/ho.ho26:hoCA.Ode92.melody	@ltx/gr_gr_cog/he.h.m8:heHE.EfrixePasaAkoi.name
ltx/gr_gr_cog/ho.ho26:hoCA.Ode92.mode	@ltx/gr_gr_cog/miscellanea:misc.Mode8
ltx/gr_gr_cog/ho.ho26:hoCA.Ode92.ode	@ltx/gr_gr_cog/miscellanea:misc.Ode9
ltx/gr_gr_cog/ho.ho26:hoCA.Ode92.text	Ὡς Θεοῦ θεῖος λειτρουγός, ὁ ποιῶν αὐτοῦ τὰ θεῖα θελήματα, πολλὴν πλουτεῖς πρὸς αὐτόν, τὴν παῤῥησίαν, ἅγιε Ἄγγελε· διὸ θερμῶς ὑπὲρ ἐμοῦ, αὐτὸν παρακάλεσον, ὡς ἂν σωθεὶς διὰ σοῦ, ἀνυμνῶ τὴν προστασίαν καὶ σκέπην σου.
ltx/gr_gr_cog/ho.ho26:hoCA.Ode93.incipit	Ἅπασαν τὴν ἐμὴν ζωήν, ἐν…
ltx/gr_gr_cog/ho.ho26:hoCA.Ode93.melody	@ltx/gr_gr_cog/he.h.m8:heHE.EfrixePasaAkoi.name
ltx/gr_gr_cog/ho.ho26:hoCA.Ode93.mode	@ltx/gr_gr_cog/miscellanea:misc.Mode8
ltx/gr_gr_cog/ho.ho26:hoCA.Ode93.ode	@ltx/gr_gr_cog/miscellanea:misc.Ode9
ltx/gr_gr_cog/ho.ho26:hoCA.Ode93.text	Ἅπασαν τὴν ἐμὴν ζωήν, ἐν πολλῇ διαδραμὼν ματαιότητι, τῷ τέλει ἤγγισα, καὶ δυσωπῶ σε, τὸν ἐμὸν φύλακα· Γενοῦ μοι ὑπερασπιστής, καὶ πρόμαχος ἄμαχος, ὅταν διέρχωμαι, τοὺς τελώνας τοῦ δεινοῦ κοσμοκράτορος.
ltx/gr_gr_cog/ho.ho26:hoCA.Ode94.incipit	Νοός μου τὰς παρεκτροπάς, ῥεμβασμοὺς…
ltx/gr_gr_cog/ho.ho26:hoCA.Ode94.melody	@ltx/gr_gr_cog/he.h.m8:heHE.EfrixePasaAkoi.name
ltx/gr_gr_cog/ho.ho26:hoCA.Ode94.mode	@ltx/gr_gr_cog/miscellanea:misc.Mode8
ltx/gr_gr_cog/ho.ho26:hoCA.Ode94.ode	@ltx/gr_gr_cog/miscellanea:misc.Ode9
ltx/gr_gr_cog/ho.ho26:hoCA.Ode94.text	Νοός μου τὰς παρεκτροπάς, ῥεμβασμοὺς αἰχμαλωσίας, φαυλότητας, καὶ τὴν αἰσχρόνοιαν, τῶν ἀκαθάρτων καὶ ῥυπαρῶν λογισμῶν, τρέπειν ἐννοίας εἱς καλάς, μὴ λίπῃς προστάτα μου, καὶ ἀγαθοὺς λογισμούς, κατανύξεως ἐμπύρου γεννήτορος.
ltx/gr_gr_cog/ho.ho26:hoCA.Ode95.incipit	Νίκησον ἐμῶν κακῶν, Ἰησοῦ μονογενὲς…
ltx/gr_gr_cog/ho.ho26:hoCA.Ode95.melody	@ltx/gr_gr_cog/he.h.m8:heHE.EfrixePasaAkoi.name
ltx/gr_gr_cog/ho.ho26:hoCA.Ode95.mode	@ltx/gr_gr_cog/miscellanea:misc.Mode8
ltx/gr_gr_cog/ho.ho26:hoCA.Ode95.ode	@ltx/gr_gr_cog/miscellanea:misc.Ode9
ltx/gr_gr_cog/ho.ho26:hoCA.Ode95.text	Νίκησον ἐμῶν κακῶν, Ἰησοῦ μονογενὲς ὑπεράγαθε, τῇ εὐσπλαγχνίᾳ σου, τὴν ἀμετρίαν καὶ πολυπλήθειαν, τοῦ σοῦ ἀΰλου λειτουργοῦ, θείαις παρακλήσεσιν· ὃν μοι ἐπέστησας, νηπιόθεν, ὡς φιλάνθρωπος, φύλακα.
ltx/gr_gr_cog/ho.ho26:hoCA.Ode96.incipit	Ὅλην μου σοὶ μετὰ Θεόν…
ltx/gr_gr_cog/ho.ho26:hoCA.Ode96.melody	@ltx/gr_gr_cog/he.h.m8:heHE.EfrixePasaAkoi.name
ltx/gr_gr_cog/ho.ho26:hoCA.Ode96.mode	@ltx/gr_gr_cog/miscellanea:misc.Mode8
ltx/gr_gr_cog/ho.ho26:hoCA.Ode96.ode	@ltx/gr_gr_cog/miscellanea:misc.Ode9
ltx/gr_gr_cog/ho.ho26:hoCA.Ode96.text	Ὅλην μου σοὶ μετὰ Θεόν, σωτηρίας τὴν ἐλπίδα ἀνέθηκα, τῷ ἐμῷ φύλακι, καὶ κηδεμόνι καὶ ἀντιλήπτορι· κοινὴν πρεσβείαν πρὸς Θεόν, ὑπὲρ ἐμοῦ ποίησον, συμπρεσβευτὰς προσλαβών, τῶν Ἀγγέλων τοὺς χορούς, καὶ συλλήπτορας.
ltx/gr_gr_cog/ho.ho26:hoCA.Ode9H.greekmelody	@ltx/gr_gr_cog/he.h.m8:heHE.EfrixePasaAkoi.greekname
ltx/gr_gr_cog/ho.ho26:hoCA.Ode9H.incipit	@ltx/gr_gr_cog/he.h.m8:heHE.EfrixePasaAkoi.incipit
ltx/gr_gr_cog/ho.ho26:hoCA.Ode9H.melody	@ltx/gr_gr_cog/he.h.m8:heHE.EfrixePasaAkoi.melody
ltx/gr_gr_cog/ho.ho26:hoCA.Ode9H.mode	@ltx/gr_gr_cog/miscellanea:misc.Mode8
ltx/gr_gr_cog/ho.ho26:hoCA.Ode9H.ode	@ltx/gr_gr_cog/miscellanea:misc.Ode9
ltx/gr_gr_cog/ho.ho26:hoCA.Ode9H.text	@ltx/gr_gr_cog/he.h.m8:heHE.EfrixePasaAkoi.text
ltx/gr_gr_cog/ho.ho26:hoCA.Ode9T.incipit	Ὕψωσον κέρας εὐσεβῶν, καὶ κατάβαλε…
ltx/gr_gr_cog/ho.ho26:hoCA.Ode9T.melody	@ltx/gr_gr_cog/he.h.m8:heHE.EfrixePasaAkoi.name
ltx/gr_gr_cog/ho.ho26:hoCA.Ode9T.mode	@ltx/gr_gr_cog/miscellanea:misc.Mode8
ltx/gr_gr_cog/ho.ho26:hoCA.Ode9T.ode	@ltx/gr_gr_cog/miscellanea:misc.Ode9
ltx/gr_gr_cog/ho.ho26:hoCA.Ode9T.text	Ὕψωσον κέρας εὐσεβῶν, καὶ κατάβαλε βαρβάρων φρυάγματα, Θεογεννήτρια, ἀπολιόρκητον διασώζουσα, ταύτην τὴν ποίμνην σου, ἐν ᾗ, τὸ μέγα σου ὄνομα, καὶ πολυδόξαστον, μεγαλύνεται πιστῶς καὶ δοξάζεται.
ltx/gr_gr_cog/ho.ho26:hoCA.SticTheotokion.incipit	Ἀγγέλων καὶ βροτῶν, Δέσποινα Θεοτόκε…
ltx/gr_gr_cog/ho.ho26:hoCA.SticTheotokion.melody	@ltx/gr_gr_cog/he.a.m2:heAU.OikosTouEfratha.name
ltx/gr_gr_cog/ho.ho26:hoCA.SticTheotokion.mode	@ltx/gr_gr_cog/miscellanea:misc.Mode2
ltx/gr_gr_cog/ho.ho26:hoCA.SticTheotokion.text	Ἀγγέλων καὶ βροτῶν, Δέσποινα Θεοτόκε, μὴ παύσῃ ἱκετεύειν, Παρθένε τὸν Υἱόν σου ὑπὲρ ἐμοῦ τοῦ δούλου σου.
ltx/gr_gr_cog/ho.ho26:hoCA.Stichera1.incipit	Ὦ Ἄγγελε Θεοῦ, ὁ παρεστὼς…
ltx/gr_gr_cog/ho.ho26:hoCA.Stichera1.melody	@ltx/gr_gr_cog/he.a.m2:heAU.OikosTouEfratha.name
ltx/gr_gr_cog/ho.ho26:hoCA.Stichera1.mode	@ltx/gr_gr_cog/miscellanea:misc.Mode2
ltx/gr_gr_cog/ho.ho26:hoCA.Stichera1.text	Ὦ Ἄγγελε Θεοῦ, ὁ παρεστὼς ἀμέσως, τῇ ἁγίᾳ Τριάδι, μὴ παύσῃ ἱκετεύων, ὑπὲρ ἐμοῦ τοῦ δούλου σου.
ltx/gr_gr_cog/ho.ho26:hoCA.Stichera2.incipit	Ὡς ἔλαβες ἰσχύν, φυλάττειν τὴν…
ltx/gr_gr_cog/ho.ho26:hoCA.Stichera2.melody	@ltx/gr_gr_cog/he.a.m2:heAU.OikosTouEfratha.name
ltx/gr_gr_cog/ho.ho26:hoCA.Stichera2.mode	@ltx/gr_gr_cog/miscellanea:misc.Mode2
ltx/gr_gr_cog/ho.ho26:hoCA.Stichera2.text	Ὡς ἔλαβες ἰσχύν, φυλάττειν τὴν ψυχήν μου, παρὰ Θεοῦ μὴ παύσῃ, σκέπῃ τῶν σῶν πτερύγων, αὐτὴν σκέπων ἑκάστοτε.
ltx/gr_gr_cog/ho.ho26:hoCA.Stichera3.incipit	Χάρις τῷ Ἰησοῦ, τῷ δόντι…
ltx/gr_gr_cog/ho.ho26:hoCA.Stichera3.melody	@ltx/gr_gr_cog/he.a.m2:heAU.OikosTouEfratha.name
ltx/gr_gr_cog/ho.ho26:hoCA.Stichera3.mode	@ltx/gr_gr_cog/miscellanea:misc.Mode2
ltx/gr_gr_cog/ho.ho26:hoCA.Stichera3.text	Χάρις τῷ Ἰησοῦ, τῷ δόντι μοί σε μέγαν, φύλακα τῆς ψυχῆς μου, καὶ ὅπλον κατʼ ἐχθρῶν μου, Ἄγγελε θεοτίμητε.
ltx/gr_gr_cog/ho.ho26:hoCA.Stichera4.incipit	Ἀξίωσον κἀμέ, τυχεῖν τῆς βασιλείας…
ltx/gr_gr_cog/ho.ho26:hoCA.Stichera4.melody	@ltx/gr_gr_cog/he.a.m2:heAU.OikosTouEfratha.name
ltx/gr_gr_cog/ho.ho26:hoCA.Stichera4.mode	@ltx/gr_gr_cog/miscellanea:misc.Mode2
ltx/gr_gr_cog/ho.ho26:hoCA.Stichera4.text	Ἀξίωσον κἀμέ, τυχεῖν τῆς βασιλείας, τοῦ Θεοῦ τοῦ Ὑψίστου, ἵνα σὺν σοὶ κραυγάζω, τὸν ὕμνον τὸν Τρισάγιον.
ltx/gr_gr_cog/ho.ho26:hoCA.Stichera5.incipit	Φῶς δεύτερον σὺ εἶ, μετὰ…
ltx/gr_gr_cog/ho.ho26:hoCA.Stichera5.melody	@ltx/gr_gr_cog/he.a.m2:heAU.OikosTouEfratha.name
ltx/gr_gr_cog/ho.ho26:hoCA.Stichera5.mode	@ltx/gr_gr_cog/miscellanea:misc.Mode2
ltx/gr_gr_cog/ho.ho26:hoCA.Stichera5.text	Φῶς δεύτερον σὺ εἶ, μετὰ Θεὸν φρουρέ μου· μὴ παύσῃ προστατεύων, ἰδεῖν κἀμὲ τὸ σέλας τῆς τριλαμποῦς Θεότητος.
ltx/gr_gr_cog/ho.ho26:hoCA.acrostic.notice1	οὗ ἡ ἀκροστιχίς·
ltx/gr_gr_cog/ho.ho26:hoCA.acrostic.text	Τὸν Ἄγγελον μέλπω σε τὸν φύλακά μου. ᾨδὴ Μοναχοῦ Ἰωάννου.
ltx/gr_gr_cog/ho.ho26:hoCA.acrostic.title	Ὁ Κανών,
ltx/gr_gr_cog/ho.ho26:hoCA.poet	Ποίημα Ἰωάννου Μοναχοῦ τοῦ Μαυρόποδος
ltx/gr_gr_cog/ho.ho26:hoCA.title	Κανὼν τοῦ Φύλακος Ἀγγέλου.
ltx/gr_gr_cog/ho.ho26:hoCA.title1	Κανὼν Ἰκετήριος εἰς τὸν Ἄγγελον
ltx/gr_gr_cog/ho.ho26:hoCA.title2	τὸν Φύλακα τῆς τοῦ Ἀνθρώπου Ζωῆς
ltx/gr_gr_cog/ho.ho26:hoCA.title3	Κανὼν Ἰκετήριος εἰς τὸν Φύλακα Ἄγγελον
ltx/gr_gr_cog/ho.ho26:hoCA.translator	
ltx/gr_gr_cog/ho.ho26:hoCA.verse	Ἄγγελε τοῦ Θεοῦ, πρέσβευε ὑπὲρ ἡμῶν.
