ltx/gr_gr_cog/le.ep.mc.d082:lemcLI.Epistle.book_abbr	@ltx/gr_gr_cog/bible:Acts.abbr
ltx/gr_gr_cog/le.ep.mc.d082:lemcLI.Epistle.book_string	@ltx/gr_gr_cog/bible:Acts.text
ltx/gr_gr_cog/le.ep.mc.d082:lemcLI.Epistle.chapverse	4:23 – 31
ltx/gr_gr_cog/le.ep.mc.d082:lemcLI.Epistle.incipit	Ἀπολυθέντες οἱ ἀπόστολοι ἦλθον…
ltx/gr_gr_cog/le.ep.mc.d082:lemcLI.Epistle.text	Ἐν ταῖς ἡμέραις ἐκείναις, ἀπολυθέντες οἱ ἀπόστολοι ἦλθον πρὸς τοὺς ἰδίους καὶ ἀπήγγειλαν ὅσα πρὸς αὐτοὺς οἱ ἀρχιερεῖς καὶ οἱ πρεσβύτεροι εἶπον. οἱ δὲ ἀκούσαντες ὁμοθυμαδὸν ἦραν φωνὴν πρὸς τὸν Θεὸν καὶ εἶπον· Δέσποτα, σὺ ὁ ποιήσας τὸν οὐρανὸν καὶ τὴν γῆν καὶ τὴν θάλασσαν καὶ πάντα τὰ ἐν αὐτοῖς, ὁ διὰ στόματος Δαυῒδ παιδός σου εἰπών· ἵνα τί ἐφρύαξαν ἔθνη καὶ λαοὶ ἐμελέτησαν κενά; παρέστησαν οἱ βασιλεῖς τῆς γῆς καὶ οἱ ἄρχοντες συνήχθησαν ἐπὶ τὸ αὐτὸ κατὰ τοῦ Κυρίου καὶ κατὰ τοῦ Χριστοῦ αὐτοῦ. συνήχθησαν γὰρ ἐπ᾿ ἀληθείας ἐπὶ τὸν ἅγιον παῖδά σου Ἰησοῦν, ὃν ἔχρισας, Ἡρῴδης τε καὶ Πόντιος Πιλᾶτος σὺν ἔθνεσι καὶ λαοῖς Ἰσραήλ, ποιῆσαι ὅσα ἡ χείρ σου καὶ ἡ βουλή σου προώρισε γενέσθαι. καὶ τὰ νῦν, Κύριε, ἔπιδε ἐπὶ τὰς ἀπειλὰς αὐτῶν, καὶ δὸς τοῖς δούλοις σου μετὰ παρρησίας πάσης λαλεῖν τὸν λόγον σου ἐν τῷ τὴν χεῖρά σου ἐκτείνειν σε εἰς ἴασιν καὶ σημεῖα καὶ τέρατα γίνεσθαι διὰ τοῦ ὀνόματος τοῦ ἁγίου παιδός σου Ἰησοῦ. καὶ δεηθέντων αὐτῶν ἐσαλεύθη ὁ τόπος ἐν ᾧ ἦσαν συνηγμένοι, καὶ ἐπλήσθησαν ἅπαντες Πνεύματος Ἁγίου, καὶ ἐλάλουν τὸν λόγον τοῦ Θεοῦ μετὰ παρρησίας.
ltx/gr_gr_cog/le.ep.mc.d082:lemcLI.Epistle.title	Τῇ Πέμτῃ τῆς Βʹ Ἑβδομάδος
ltx/gr_gr_cog/le.ep.mc.d082:lemcLI.Epistle.title_abbr	Πέμτῃ τῆς Βʹ Ἑβδομάδος
ltx/gr_gr_cog/le.ep.mc.d082:lemcLI.Epistle.version	@ltx/gr_gr_cog/properties:version.designation
