ltx/gr_gr_cog/sy.m04.d15:cl.syMA.commemoration01.text	[saint/com 1]
ltx/gr_gr_cog/sy.m04.d15:cl.syMA.commemoration02.text	[saint/com 2]
ltx/gr_gr_cog/sy.m04.d15:cl.syMA.commemoration03.text	[saint/com 3]
ltx/gr_gr_cog/sy.m04.d15:cl.syMA.commemoration04.text	[saint/com 4]
ltx/gr_gr_cog/sy.m04.d15:cl.syMA.commemoration05.text	[saint/com 5]
ltx/gr_gr_cog/sy.m04.d15:cl.syMA.commemoration06.text	[saint/com list]
ltx/gr_gr_cog/sy.m04.d15:syMA.commemoration01.couplet1.title	@ltx/gr_gr_cog/titles:ti.Verses
ltx/gr_gr_cog/sy.m04.d15:syMA.commemoration01.couplet1.verse1	Θάμβος βλέπειν Κρήσκεντα τοῦ πυρὸς μέσον,
ltx/gr_gr_cog/sy.m04.d15:syMA.commemoration01.couplet1.verse2	Ἡγούμενον λειμῶνα τερπνὸν τὴν φλόγα.
ltx/gr_gr_cog/sy.m04.d15:syMA.commemoration01.narration.p01	Οὗτος ἦν ἐκ πόλεως Μύρων τῆς Λυκίας, γένους ἐνδόξου, τὴν ἡλικίαν προβεβηκώς. Ὁρῶν δὲ τὴν ἀσέβειαν κομῶσαν καὶ τὴν τῶν εἰδώλων θρησκείαν ἐπαιρομένην καὶ πολλοὺς τῇ πλάνῃ δεδουλωμένους καὶ σέβας τοῖς ἀψύχοις προσάγοντας, παρῄνει τῆς ματαιότητος ἀποστῆναι (προσελθὼν μέσον αὐτῶν) καὶ πρὸς τὸν Θεὸν ἐπιστρέψαι, τὸν παρὰ τοῖς Χριστιανοῖς σεβαζόμενον, μόνον ὄντα δημιουργὸν καὶ πνοῆς καὶ ζωῆς ἁπάσης χορηγόν.
ltx/gr_gr_cog/sy.m04.d15:syMA.commemoration01.narration.p02	Τοῦ δὲ Ἡγεμόνος, κακοδαίμονα τὸν Ἅγιον ὀνομάσαντος, ὅτι δὴ αὐθαιρέτως πρὸς τὰ δεινὰ χωρεῖν ἔγνωκε, Τῆς ἐσχάτης μενοῦν εὐκλείας καὶ εὐδαιμονίας, ἀντέφησεν ὁ Ἅγιος, τὸ πάσχειν ὑπὲρ Χριστοῦ. Ἐρωτώμενος δὲ τύχην, καὶ πατρίδα, καὶ ὄνομα, ἀντὶ πάντων, χριστιανὸν ἑαυτὸν εἶναι ἔλεγε, μὴ καταδεξάμενος μηδὲ ἐν σχήματι σέβας τοῖς εἰδώλοις προσενεγκεῖν, καθὼς ὁ ἡγεμὼν συνεβούλευεν· ἀλλʼ ἐπὶ πάντων τῷ Θεῷ ἐξομολογούμενος καὶ φάσκων μὴ δύνασθαι ἄλλο τι τὸ σῶμα ποιῆσαι, παρὰ τὸ δοκοῦν τῇ ψυχῇ ὡς παρʼ αὐτῆς ἀγόμενον καὶ κινούμενον. Διὰ ταῦτα οὖν πρῶτον μὲν ἀναρτηθεὶς τύπτεται, εἶτα ξέεται· καὶ μετὰ τοῦτο, πυρᾶς ἐξαφθείσης, ἐν αὐτῇ βληθῆναι κατεκρίθη. Τοῦ δὲ πυρὸς μηδὲ τριχὸς αὐτοῦ διαφθαρέντος, τῷ Θεῷ τὸ πνεῦμα παρέδωκε.
ltx/gr_gr_cog/sy.m04.d15:syMA.commemoration01.single1	Κάτθανε καὶ Κρήσκης πέμπτῃ δεκάτῃ πυρὶ λαύρῳ.
ltx/gr_gr_cog/sy.m04.d15:syMA.commemoration01.text	Τῇ ΙΕʹ τοῦ αὐτοῦ μηνός, μνήμη τοῦ Ἁγίου Μάρτυρος Κρήσκεντος, τοῦ ἐν Μύροις τῆς Λυκίας.
ltx/gr_gr_cog/sy.m04.d15:syMA.commemoration02.couplet1.title	@ltx/gr_gr_cog/titles:ti.Verses
ltx/gr_gr_cog/sy.m04.d15:syMA.commemoration02.couplet1.verse1	Ἀμνοῦ Θεοῦ σφάττουσιν ἀμνάδας δύο,
ltx/gr_gr_cog/sy.m04.d15:syMA.commemoration02.couplet1.verse2	Ἀναστασίαν καὶ Βασίλισσαν ἅμα.
ltx/gr_gr_cog/sy.m04.d15:syMA.commemoration02.narration.p01	Αὗται ὑπῆρχον ἐκ τῆς μεγαλοπόλεως Ῥώμης, εὐγενεῖς καὶ πλούσιαι, μαθήτριαι γεγονυῖαι τῶν Ἁγίων Ἀποστόλων. Μετὰ δὲ τὴν ἐκείνων τελείωσιν, τὰ τίμια αὐτῶν λείψανα νυκτὸς ἀνελόμεναι καὶ κηδεύσασαι, διεγνώσθησαν τῷ βασιλεῖ Νέρωνι. Καταμηνυθεῖσαι δέ, τότε μὲν εἰς φυλακὴν παρεπέμφθησαν· ὕστερον δὲ ἐξαχθεῖσαι καὶ τῇ εἰς Χριστὸν ὁμολογίᾳ ἐμμένειν εἰποῦσαι, ἀναρτῶνται, καὶ τοὺς μαστοὺς καὶ τὰς χεῖρας καὶ τοὺς πόδας καὶ τὰς γλώσσας ἀποτέμνονται· καὶ τέλος, μαχαίρᾳ καρατομοῦνται.
ltx/gr_gr_cog/sy.m04.d15:syMA.commemoration02.text	Τῇ αὐτῇ ἡμέρᾳ, μνήμη τῶν Ἁγίων Μαρτύρων γυναικῶν, Βασιλίσσης καὶ Ἀναστασίας.
ltx/gr_gr_cog/sy.m04.d15:syMA.commemoration03.couplet1.title	@ltx/gr_gr_cog/titles:ti.Verses
ltx/gr_gr_cog/sy.m04.d15:syMA.commemoration03.couplet1.verse1	Σκότος συνέσχε τὰς Ἀθήνας ἀθρόον,
ltx/gr_gr_cog/sy.m04.d15:syMA.commemoration03.couplet1.verse2	Δύναντος αὐταῖς ἡλίου Λεωνίδου.
ltx/gr_gr_cog/sy.m04.d15:syMA.commemoration03.text	Τῇ αὐτῇ ἡμέρᾳ, μνήμη τοῦ ἐν Ἁγίοις Πατρὸς ἡμῶν Λεωνίδου Ἐπισκόπου Ἀθηνῶν.
ltx/gr_gr_cog/sy.m04.d15:syMA.commemoration04.couplet1.title	@ltx/gr_gr_cog/titles:ti.Verses
ltx/gr_gr_cog/sy.m04.d15:syMA.commemoration04.couplet1.verse1	Παυσολυπίῳ καὶ Θεοδώρῳ Θύτῃ,
ltx/gr_gr_cog/sy.m04.d15:syMA.commemoration04.couplet1.verse2	Δῶρόν τι παυσίλυπον ὄντως τὸ ξίφος.
ltx/gr_gr_cog/sy.m04.d15:syMA.commemoration04.text	Τῇ αὐτῇ ἡμέρᾳ, μνήμη τῶν Ἁγίων Μαρτύρων Θεοδώρου Πρεσβυτέρου καὶ Παυσολυπίου.
ltx/gr_gr_cog/sy.m04.d15:syMA.lastline	Ταῖς αὐτῶν ἁγίαις πρεσβείαις, Χριστὲ ὁ Θεός, ἐλέησον ἡμᾶς. Ἀμήν.
