ltx/gr_gr_cog/le.go.lu.d004:leluLI.Gospel.book_abbr	@ltx/gr_gr_cog/bible:Luke.abbr
ltx/gr_gr_cog/le.go.lu.d004:leluLI.Gospel.book_string	@ltx/gr_gr_cog/bible:Luke.text
ltx/gr_gr_cog/le.go.lu.d004:leluLI.Gospel.chapverse	4:16 – 22
ltx/gr_gr_cog/le.go.lu.d004:leluLI.Gospel.incipit	Ἦλθεν ὁ Ἰησοῦς εἰς τὴν Ναζαρέτ…
ltx/gr_gr_cog/le.go.lu.d004:leluLI.Gospel.text	Τῷ καιρῷ ἐκείνῳ, ἦλθεν ὁ Ἰησοῦς εἰς τὴν Ναζαρέτ, οὗ ἦν τεθραμμένος, καὶ εἰσῆλθε κατὰ τὸ εἰωθὸς αὐτῷ ἐν τῇ ἡμέρᾳ τῶν σαββάτων εἰς τὴν συναγωγήν, καὶ ἀνέστη ἀναγνῶναι. καὶ ἐπεδόθη αὐτῷ βιβλίον Ἡσαΐου τοῦ προφήτου, καὶ ἀναπτύξας τὸ βιβλίον εὗρε τὸν τόπον οὗ ἦν γεγραμμένον· Πνεῦμα Κυρίου ἐπ᾿ ἐμέ, οὗ εἵνεκεν ἔχρισέ με, εὐαγγελίσασθαι πτωχοῖς ἀπέσταλκέ με, ἰάσασθαι τοὺς συντετριμμένους τὴν καρδίαν, κηρῦξαι αἰχμαλώτοις ἄφεσιν καὶ τυφλοῖς ἀνάβλεψιν, ἀποστεῖλαι τεθραυσμένους ἐν ἀφέσει, κηρῦξαι ἐνιαυτὸν Κυρίου δεκτόν. καὶ πτύξας τὸ βιβλίον ἀποδοὺς τῷ ὑπηρέτῃ ἐκάθισε· καὶ πάντων ἐν τῇ συναγωγῇ οἱ ὀφθαλμοὶ ἦσαν ἀτενίζοντες αὐτῷ. ἤρξατο δὲ λέγειν πρὸς αὐτοὺς ὅτι σήμερον πεπλήρωται ἡ γραφὴ αὕτη ἐν τοῖς ὠσὶν ὑμῶν. καὶ πάντες ἐμαρτύρουν αὐτῷ καὶ ἐθαύμαζον ἐπὶ τοῖς λόγοις τῆς χάριτος τοῖς ἐκπορευομένοις ἐκ τοῦ στόματος αὐτοῦ.
ltx/gr_gr_cog/le.go.lu.d004:leluLI.Gospel.title	Τῇ Πέμπτῃ τῆς Αʹ Ἑβδομάδος τοῦ Λουκᾶ
ltx/gr_gr_cog/le.go.lu.d004:leluLI.Gospel.title_abbr	Τῇ Πέμπτῃ τῆς Αʹ Ἑβδομάδος τοῦ Λουκᾶ
ltx/gr_gr_cog/le.go.lu.d004:leluLI.Gospel.version	@ltx/gr_gr_cog/properties:version.designation
