ltx/gr_gr_cog/me.m09.d05:meDA.commemoration.first	Μνήμη τοῦ Ἁγίου Προφήτου Ζαχαρίου, Πατρὸς τοῦ Προδρόμου
ltx/gr_gr_cog/me.m09.d05:meDA.commemoration.first_name	
ltx/gr_gr_cog/me.m09.d05:meDA.commemoration.first_short	Μνήμη τοῦ Ἁγίου Προφήτου Ζαχαρίου, Πατρὸς τοῦ Προδρόμου
ltx/gr_gr_cog/me.m09.d05:meDA.commemoration.first_title	@ltx/gr_gr_cog/titles:ti.Prophet
ltx/gr_gr_cog/me.m09.d05:meDA.commemoration.full	Μνήμη τοῦ Ἁγίου Προφήτου Ζαχαρίου, Πατρὸς τοῦ Προδρόμου
ltx/gr_gr_cog/me.m09.d05:meDA.commemoration.second_name	
ltx/gr_gr_cog/me.m09.d05:meDA.commemoration.second_title	
ltx/gr_gr_cog/me.m09.d05:meDA.date	Τῌ Εʹ ΣΕΠΤΕΜΒΡΙΟΥ
ltx/gr_gr_cog/me.m09.d05:meDA.fordate	διὰ τὴν 5ην Σεπτεμβρίου
ltx/gr_gr_cog/me.m09.d05:meDA.insert1	καὶ τοῦ Ἁγίου Προφήτου Ζαχαρίου, πατρὸς τοῦ Προδρόμου,
ltx/gr_gr_cog/me.m09.d05:meDA.insert2	οὗ καὶ τὴν μνήμην ἐπιτελοῦμεν·
ltx/gr_gr_cog/me.m09.d05:meDA.note	
ltx/gr_gr_cog/me.m09.d05:meDA.pdfcoverdate	τῆς 5ης Σεπτεμβρίου,
ltx/gr_gr_cog/me.m09.d05:meDA.pdfheaderdate	τῆς 5ης Σεπτεμβρίου
ltx/gr_gr_cog/me.m09.d05:meHO.commemorations	
ltx/gr_gr_cog/me.m09.d05:meHO.note1	
ltx/gr_gr_cog/me.m09.d05:meHO.note2	
ltx/gr_gr_cog/me.m09.d05:meHO.number	
ltx/gr_gr_cog/me.m09.d05:meHO.rank	
ltx/gr_gr_cog/me.m09.d05:meLE.commemoration1	Μνήμη τοῦ Ἁγίου Προφήτου Ζαχαρίου, Πατρὸς τοῦ Τιμίου Προδρόμου.
ltx/gr_gr_cog/me.m09.d05:meLE.commemoration2	
ltx/gr_gr_cog/me.m09.d05:meLI.Kontakion1.greekmelody	@ltx/gr_gr_cog/me.m09.d05:meMA.Kontakion1.greekmelody
ltx/gr_gr_cog/me.m09.d05:meLI.Kontakion1.incipit	@ltx/gr_gr_cog/me.m09.d05:meMA.Kontakion1.incipit
ltx/gr_gr_cog/me.m09.d05:meLI.Kontakion1.melody	@ltx/gr_gr_cog/me.m09.d05:meMA.Kontakion1.melody
ltx/gr_gr_cog/me.m09.d05:meLI.Kontakion1.mode	@ltx/gr_gr_cog/me.m09.d05:meMA.Kontakion1.mode
ltx/gr_gr_cog/me.m09.d05:meLI.Kontakion1.text	@ltx/gr_gr_cog/me.m09.d05:meMA.Kontakion1.text
ltx/gr_gr_cog/me.m09.d05:meLI.MM.CommunionHymn.text	@ltx/gr_gr_cog/properties:media.key
ltx/gr_gr_cog/me.m09.d05:meLI.Megalynarion.text	
ltx/gr_gr_cog/me.m09.d05:meMA.C1.acrostic.notice1	οὗ ἡ Ἀκροστιχίς·
ltx/gr_gr_cog/me.m09.d05:meMA.C1.acrostic.text	Τὸν Προδρόμοιο τοκῆα κροτῷ σοφὸν Ἀρχιερῆα.
ltx/gr_gr_cog/me.m09.d05:meMA.C1.acrostic.title	Κανὼν τοῦ Ἁγίου,
ltx/gr_gr_cog/me.m09.d05:meMA.C1.poet	@ltx/gr_gr_cog/poets:po.Theofanous
ltx/gr_gr_cog/me.m09.d05:meMA.C1.title	@ltx/gr_gr_cog/titles:ti.CanonProphet
ltx/gr_gr_cog/me.m09.d05:meMA.C1.verse	@ltx/gr_gr_cog/prayers:pr.verse_Prophet.text
ltx/gr_gr_cog/me.m09.d05:meMA.ExapTheotokion.incipit	Παρῆλθον Μητροπάρθενε…
ltx/gr_gr_cog/me.m09.d05:meMA.ExapTheotokion.melody	@ltx/gr_gr_cog/he.a.m2:heAU.GynaikesAkoutisthite.name
ltx/gr_gr_cog/me.m09.d05:meMA.ExapTheotokion.mode	@ltx/gr_gr_cog/miscellanea:misc.Mode2
ltx/gr_gr_cog/me.m09.d05:meMA.ExapTheotokion.text	Παρῆλθον Μητροπάρθενε, τὰ σκιωδῶς τελούμενα, τῷ πάλαι νόμῳ καὶ τύπῳ· τὸν γὰρ τοῦ νόμου δοτῆρα, Θεὸν ἀσπόρως ἔτεκες, βροτῶν εἰς ἀπολύτρωσιν· διὸ κἀμὲ τροπούμενον, τῆς ἁμαρτίας τῷ νόμῳ, στήριξον νόμῳ τῷ θείῳ.
ltx/gr_gr_cog/me.m09.d05:meMA.Exaposteilarion1.greekmelody	@ltx/gr_gr_cog/he.a.m2:heAU.GynaikesAkoutisthite.greekname
ltx/gr_gr_cog/me.m09.d05:meMA.Exaposteilarion1.incipit	Ἀμέμπτως ἱεράτευσας…
ltx/gr_gr_cog/me.m09.d05:meMA.Exaposteilarion1.melody	@ltx/gr_gr_cog/he.a.m2:heAU.GynaikesAkoutisthite.name
ltx/gr_gr_cog/me.m09.d05:meMA.Exaposteilarion1.mode	@ltx/gr_gr_cog/miscellanea:misc.Mode2
ltx/gr_gr_cog/me.m09.d05:meMA.Exaposteilarion1.text	Ἀμέμπτως ἱεράτευσας, Θεῷ τῷ παντοκράτορι, τῇ νομικῇ διατάξει, ὦ Ζαχαρία Προφῆτα· διὸ καὶ θυμιῶντί σοι, Ἄγγελος λέγων φαίνεται· Τέξῃ Χριστοῦ τὸν Πρόδρομον, μεσίτην ὄντα τοῦ Νόμου, καὶ χάριτος τῆς ἐνθέου.
ltx/gr_gr_cog/me.m09.d05:meMA.Kontakion1.greekmelody	@ltx/gr_gr_cog/he.a.m3:heAU.IParthenosSimeron.greekname
ltx/gr_gr_cog/me.m09.d05:meMA.Kontakion1.incipit	Ὁ Προφήτης σήμερον…
ltx/gr_gr_cog/me.m09.d05:meMA.Kontakion1.melody	@ltx/gr_gr_cog/he.a.m3:heAU.IParthenosSimeron.name
ltx/gr_gr_cog/me.m09.d05:meMA.Kontakion1.mode	@ltx/gr_gr_cog/miscellanea:misc.Mode3
ltx/gr_gr_cog/me.m09.d05:meMA.Kontakion1.text	Ὁ Προφήτης σήμερον, καὶ ἱερεὺς τοῦ Ὑψίστου, Ζαχαρίας προὔθηκεν, ὁ τοῦ Προδρόμου γενέτης, τράπεζαν τῆς αὐτοῦ μνήμης Πιστοὺς ἐκτρέφων, πόμα τε δικαιοσύνης τούτοις κεράσας. Διὸ τοῦτον εὐφημοῦμεν, ὡς θεῖον μύστην Θεοῦ τῆς χάριτος.
ltx/gr_gr_cog/me.m09.d05:meMA.MM.VeApos1123as5678.text	@ltx/gr_gr_cog/properties:media.key
ltx/gr_gr_cog/me.m09.d05:meMA.Ode1C11.greekmelody	@ltx/gr_gr_cog/he.h.m8:heHE.YgranDiodefsas.greekname
ltx/gr_gr_cog/me.m09.d05:meMA.Ode1C11.incipit	Τὴν μνήμην Προφῆτα…
ltx/gr_gr_cog/me.m09.d05:meMA.Ode1C11.melody	@ltx/gr_gr_cog/he.h.m8:heHE.YgranDiodefsas.name
ltx/gr_gr_cog/me.m09.d05:meMA.Ode1C11.mode	@ltx/gr_gr_cog/miscellanea:misc.Mode8
ltx/gr_gr_cog/me.m09.d05:meMA.Ode1C11.ode	@ltx/gr_gr_cog/miscellanea:misc.Ode1
ltx/gr_gr_cog/me.m09.d05:meMA.Ode1C11.text	Τὴν μνήμην Προφῆτα σου εὐφημῶν, τοῦ Πνεύματος χάριν, ἱκετεύω μοι συνεργεῖν, τῇ σῇ μεσιτείᾳ ἀνακράζων· Τῷ λυτρωτῇ καὶ Θεῷ ἡμῶν ᾄσωμεν.
ltx/gr_gr_cog/me.m09.d05:meMA.Ode1C12.incipit	Ὁ βίος σου ἄμεμπτος εὑρεθείς…
ltx/gr_gr_cog/me.m09.d05:meMA.Ode1C12.melody	@ltx/gr_gr_cog/he.h.m8:heHE.YgranDiodefsas.name
ltx/gr_gr_cog/me.m09.d05:meMA.Ode1C12.mode	@ltx/gr_gr_cog/miscellanea:misc.Mode8
ltx/gr_gr_cog/me.m09.d05:meMA.Ode1C12.ode	@ltx/gr_gr_cog/miscellanea:misc.Ode1
ltx/gr_gr_cog/me.m09.d05:meMA.Ode1C12.text	Ὁ βίος σου ἄμεμπτος εὑρεθείς, τῆς ἱερωσύνης, ἐκοσμήθη καταστολῇ, καὶ τῆς προφητείας φωτοφόροις, μαρμαρυγαῖς θεοῤῥῆμον μακάριε.
ltx/gr_gr_cog/me.m09.d05:meMA.Ode1C13.incipit	Νομίμῳ ταινίᾳ τὴν κεφαλήν, κατηγλαϊσμένος…
ltx/gr_gr_cog/me.m09.d05:meMA.Ode1C13.melody	@ltx/gr_gr_cog/he.h.m8:heHE.YgranDiodefsas.name
ltx/gr_gr_cog/me.m09.d05:meMA.Ode1C13.mode	@ltx/gr_gr_cog/miscellanea:misc.Mode8
ltx/gr_gr_cog/me.m09.d05:meMA.Ode1C13.ode	@ltx/gr_gr_cog/miscellanea:misc.Ode1
ltx/gr_gr_cog/me.m09.d05:meMA.Ode1C13.text	Νομίμῳ ταινίᾳ τὴν κεφαλήν, κατηγλαϊσμένος, Ζαχαρία ἀναδειχθείς, ὡς ἱεροφάντωρ ἀνεβόας· Τῷ λυτρωτῇ καὶ Θεῷ ἡμῶν ᾄσωμεν.
ltx/gr_gr_cog/me.m09.d05:meMA.Ode1C1T.incipit	Ποδήρη χιτῶνα ὡς Ἀαρών, περιβεβλημένος…
ltx/gr_gr_cog/me.m09.d05:meMA.Ode1C1T.melody	@ltx/gr_gr_cog/he.h.m8:heHE.YgranDiodefsas.name
ltx/gr_gr_cog/me.m09.d05:meMA.Ode1C1T.mode	@ltx/gr_gr_cog/miscellanea:misc.Mode8
ltx/gr_gr_cog/me.m09.d05:meMA.Ode1C1T.ode	@ltx/gr_gr_cog/miscellanea:misc.Ode1
ltx/gr_gr_cog/me.m09.d05:meMA.Ode1C1T.text	Ποδήρη χιτῶνα ὡς Ἀαρών, περιβεβλημένος, τὴν ἐκ ῥίζης τοῦ Ἰεσσαί, βλαστήσασαν Κόρην ὑπεδέξω, τὸν Λυτρωτὴν ἐν κοιλίᾳ βαστάζουσαν.
ltx/gr_gr_cog/me.m09.d05:meMA.Ode3C11.greekmelody	@ltx/gr_gr_cog/he.h.m8:heHE.SyEiToStereoma.greekname
ltx/gr_gr_cog/me.m09.d05:meMA.Ode3C11.incipit	Ὅτε τὸ θυμίαμα, τὸ τῆς…
ltx/gr_gr_cog/me.m09.d05:meMA.Ode3C11.melody	@ltx/gr_gr_cog/he.h.m8:heHE.SyEiToStereoma.name
ltx/gr_gr_cog/me.m09.d05:meMA.Ode3C11.mode	@ltx/gr_gr_cog/miscellanea:misc.Mode8
ltx/gr_gr_cog/me.m09.d05:meMA.Ode3C11.ode	@ltx/gr_gr_cog/miscellanea:misc.Ode3
ltx/gr_gr_cog/me.m09.d05:meMA.Ode3C11.text	Ὅτε τὸ θυμίαμα, τὸ τῆς συνθέσεως ἔφερες, Ἀρχιερεῦ, τότε τοῦ Προδρόμου, ἐκομίσω τὴν γέννησιν.
ltx/gr_gr_cog/me.m09.d05:meMA.Ode3C12.incipit	Μύρον ἁγιάσματος, ἱερατεύειν σε ἔχρισεν…
ltx/gr_gr_cog/me.m09.d05:meMA.Ode3C12.melody	@ltx/gr_gr_cog/he.h.m8:heHE.SyEiToStereoma.name
ltx/gr_gr_cog/me.m09.d05:meMA.Ode3C12.mode	@ltx/gr_gr_cog/miscellanea:misc.Mode8
ltx/gr_gr_cog/me.m09.d05:meMA.Ode3C12.ode	@ltx/gr_gr_cog/miscellanea:misc.Ode3
ltx/gr_gr_cog/me.m09.d05:meMA.Ode3C12.text	Μύρον ἁγιάσματος, ἱερατεύειν σε ἔχρισεν, ὡς Ἀαρών· ὅθεν ὀπτασίας, Ἀγγέλου ἠξίωσαι.
ltx/gr_gr_cog/me.m09.d05:meMA.Ode3C13.incipit	Ὄρθρον προμηνύοντα, τῇ οἰκουμένῃ σε…
ltx/gr_gr_cog/me.m09.d05:meMA.Ode3C13.melody	@ltx/gr_gr_cog/he.h.m8:heHE.SyEiToStereoma.name
ltx/gr_gr_cog/me.m09.d05:meMA.Ode3C13.mode	@ltx/gr_gr_cog/miscellanea:misc.Mode8
ltx/gr_gr_cog/me.m09.d05:meMA.Ode3C13.ode	@ltx/gr_gr_cog/miscellanea:misc.Ode3
ltx/gr_gr_cog/me.m09.d05:meMA.Ode3C13.text	Ὄρθρον προμηνύοντα, τῇ οἰκουμένῃ σε ἥλιον, τὸν νοητόν, Σῶτερ Ζαχαρίας, Ἰωάννην ἐκτέτοκεν.
ltx/gr_gr_cog/me.m09.d05:meMA.Ode3C1T.incipit	Ἴθυνον τὸν βίον μου, Θεογεννήτρια…
ltx/gr_gr_cog/me.m09.d05:meMA.Ode3C1T.melody	@ltx/gr_gr_cog/he.h.m8:heHE.SyEiToStereoma.name
ltx/gr_gr_cog/me.m09.d05:meMA.Ode3C1T.mode	@ltx/gr_gr_cog/miscellanea:misc.Mode8
ltx/gr_gr_cog/me.m09.d05:meMA.Ode3C1T.ode	@ltx/gr_gr_cog/miscellanea:misc.Ode3
ltx/gr_gr_cog/me.m09.d05:meMA.Ode3C1T.text	Ἴθυνον τὸν βίον μου, Θεογεννήτρια πάναγνε, καὶ τὴν ζωήν, ἡ τοῦ Ζαχαρίου, τὴν οἰκίαν φαιδρύνασα.
ltx/gr_gr_cog/me.m09.d05:meMA.Ode3H.greekmelody	@ltx/gr_gr_cog/he.h.m8:heHE.SyEiToStereoma.greekname
ltx/gr_gr_cog/me.m09.d05:meMA.Ode3H.incipit	@ltx/gr_gr_cog/he.h.m8:heHE.SyEiToStereoma.incipit
ltx/gr_gr_cog/me.m09.d05:meMA.Ode3H.melody	@ltx/gr_gr_cog/he.h.m8:heHE.SyEiToStereoma.melody
ltx/gr_gr_cog/me.m09.d05:meMA.Ode3H.mode	@ltx/gr_gr_cog/miscellanea:misc.Mode8
ltx/gr_gr_cog/me.m09.d05:meMA.Ode3H.ode	@ltx/gr_gr_cog/miscellanea:misc.Ode3
ltx/gr_gr_cog/me.m09.d05:meMA.Ode3H.text	@ltx/gr_gr_cog/he.h.m8:heHE.SyEiToStereoma.text
ltx/gr_gr_cog/me.m09.d05:meMA.Ode3Kathisma1.greekmelody	@ltx/gr_gr_cog/he.a.m8:heAU.ToProstachthen.greekname
ltx/gr_gr_cog/me.m09.d05:meMA.Ode3Kathisma1.incipit	Ἱερουργήσας τῷ Θεῷ…
ltx/gr_gr_cog/me.m09.d05:meMA.Ode3Kathisma1.melody	@ltx/gr_gr_cog/he.a.m8:heAU.ToProstachthen.name
ltx/gr_gr_cog/me.m09.d05:meMA.Ode3Kathisma1.mode	@ltx/gr_gr_cog/miscellanea:misc.Mode8
ltx/gr_gr_cog/me.m09.d05:meMA.Ode3Kathisma1.text	Ἱερουργήσας τῷ Θεῷ κατὰ τὸν νόμον, καὶ προφητεύσας τὸν Χριστὸν ἐκ τῆς Παρθένου, Ζαχαρία σαρκούμενον ἐκ Πνεύματος Ἁγίου, ἐφάνης τῇ οἰκουμένῃ στῦλος φωτός, καὶ ἔφης δικαιοσύνης ἀνατολήν, ἐξ ὕψους κόσμον ἐκλάμπουσαν, καὶ εἰς εἰρήνης ὁδόν, εὐθύνουσαν τοὺς πόδας ἡμῶν, τὸν σῴζοντα τὸ ἄνθρωπον.
ltx/gr_gr_cog/me.m09.d05:meMA.Ode3Kathisma2.greekmelody	@ltx/gr_gr_cog/he.a.m8:heAU.ToProstachthen.greekname
ltx/gr_gr_cog/me.m09.d05:meMA.Ode3Kathisma2.incipit	Τοῦ Βαραχίου τὸν υἱὸν…
ltx/gr_gr_cog/me.m09.d05:meMA.Ode3Kathisma2.melody	@ltx/gr_gr_cog/he.a.m8:heAU.ToProstachthen.name
ltx/gr_gr_cog/me.m09.d05:meMA.Ode3Kathisma2.mode	@ltx/gr_gr_cog/miscellanea:misc.Mode8
ltx/gr_gr_cog/me.m09.d05:meMA.Ode3Kathisma2.text	Τοῦ Βαραχίου τὸν υἱὸν νῦν μακαρίσωμεν, ὅτι τὸν νόμον ψαλμικῶς προεμελέτησε, Ζαχαρίας ὁ δίκαιος νυκτός τε καὶ ἡμέρας, λατρεύων τῷ ἐν ὑψίστοις πάντων Θεῷ, ὡς ἔφη ὁ ἐν Προφήταις μέγας Δαυΐδ· ὃς καὶ τέλος διʼ αἵματος, σφαγεὶς ἐτύθη ὡς ἀμνός, δεκτὸς εἰς ὁλοκάρπωσιν, τοῦ Σωτῆρος τῶν ψυχῶν ἡμῶν.
ltx/gr_gr_cog/me.m09.d05:meMA.Ode3KathismaSt.incipit	Τῷ τοῦ Υἱοῦ σου καὶ Θεοῦ…
ltx/gr_gr_cog/me.m09.d05:meMA.Ode3KathismaSt.melody	@ltx/gr_gr_cog/he.a.m8:heAU.ToProstachthen.name
ltx/gr_gr_cog/me.m09.d05:meMA.Ode3KathismaSt.mode	@ltx/gr_gr_cog/miscellanea:misc.Mode8
ltx/gr_gr_cog/me.m09.d05:meMA.Ode3KathismaSt.text	Τῷ τοῦ Υἱοῦ σου καὶ Θεοῦ Σταυρῷ Παρθένε, περιφρουρούμενοι ἀεὶ τὰς τῶν δαιμόνων, προσβολὰς ἐκτρεπόμεθα, καὶ τὰς μεθοδείας, κυρίως σε Θεοτόκον καὶ ἀληθῶς, ὑμνοῦντες, καὶ πόθῳ πᾶσαι αἱ γενεαί, μακαρίζοντες ἄχραντε, ὡς προεφήτευσας· διό, πταισμάτων ἡμῖν ἄφεσιν, ταῖς πρεσβείαις σου δώρησαι.
ltx/gr_gr_cog/me.m09.d05:meMA.Ode3KathismaT.incipit	Θεοχαρίτωτε Ἁγνὴ…
ltx/gr_gr_cog/me.m09.d05:meMA.Ode3KathismaT.melody	@ltx/gr_gr_cog/he.a.m8:heAU.ToProstachthen.name
ltx/gr_gr_cog/me.m09.d05:meMA.Ode3KathismaT.mode	@ltx/gr_gr_cog/miscellanea:misc.Mode8
ltx/gr_gr_cog/me.m09.d05:meMA.Ode3KathismaT.text	Θεοχαρίτωτε Ἁγνὴ εὐλογημένη, τὸν διὰ σπλάγχνα οἰκτιρμῶν ἐκ σοῦ τεχθέντα, σὺν ταῖς ἄνω Δυνάμεσι, καὶ σὺν τοῖς Προφήταις, καὶ ἅπασι τοῖς Ἁγίοις ὑπὲρ ἡμῶν, δυσώπει ἀκαταπαύστως δοῦναι ἡμῖν, πρὸ τοῦ τέλους διόρθωσιν, καὶ ἱλασμὸν ἁμαρτιῶν, καὶ βίου ἐπανόρθωσιν, ὅπως εὔρωμεν ἔλεος.
ltx/gr_gr_cog/me.m09.d05:meMA.Ode4C11.greekmelody	@ltx/gr_gr_cog/he.h.m8:heHE.EisakikoaKyrie.greekname
ltx/gr_gr_cog/me.m09.d05:meMA.Ode4C11.incipit	Ὁ Προφήτης σου Δέσποτα, τύποις…
ltx/gr_gr_cog/me.m09.d05:meMA.Ode4C11.melody	@ltx/gr_gr_cog/he.h.m8:heHE.EisakikoaKyrie.name
ltx/gr_gr_cog/me.m09.d05:meMA.Ode4C11.mode	@ltx/gr_gr_cog/miscellanea:misc.Mode8
ltx/gr_gr_cog/me.m09.d05:meMA.Ode4C11.ode	@ltx/gr_gr_cog/miscellanea:misc.Ode4
ltx/gr_gr_cog/me.m09.d05:meMA.Ode4C11.text	Ὁ Προφήτης σου Δέσποτα, τύποις νομικοῖς, πιστῶς ἐλειτούργει σοι, καὶ τῆς χάριτος ἠξίωται, κατιδεῖν ἐν γνώσει τὴν ἀλήθειαν.
ltx/gr_gr_cog/me.m09.d05:meMA.Ode4C12.incipit	Τῷ φωτὶ φῶς προσέλαβες, τῷ…
ltx/gr_gr_cog/me.m09.d05:meMA.Ode4C12.melody	@ltx/gr_gr_cog/he.h.m8:heHE.EisakikoaKyrie.name
ltx/gr_gr_cog/me.m09.d05:meMA.Ode4C12.mode	@ltx/gr_gr_cog/miscellanea:misc.Mode8
ltx/gr_gr_cog/me.m09.d05:meMA.Ode4C12.ode	@ltx/gr_gr_cog/miscellanea:misc.Ode4
ltx/gr_gr_cog/me.m09.d05:meMA.Ode4C12.text	Τῷ φωτὶ φῶς προσέλαβες, τῷ ἀμαυροτέρῳ σὺ τὸ τρανότερον, Παμμακάριστε· τῷ νόμῳ γάρ, καὶ ἡ χάρις ὄντως προσετέθη σοι.
ltx/gr_gr_cog/me.m09.d05:meMA.Ode4C13.incipit	Ὁ Θεῷ παριστάμενος, θεῖος Γαβριὴλ…
ltx/gr_gr_cog/me.m09.d05:meMA.Ode4C13.melody	@ltx/gr_gr_cog/he.h.m8:heHE.EisakikoaKyrie.name
ltx/gr_gr_cog/me.m09.d05:meMA.Ode4C13.mode	@ltx/gr_gr_cog/miscellanea:misc.Mode8
ltx/gr_gr_cog/me.m09.d05:meMA.Ode4C13.ode	@ltx/gr_gr_cog/miscellanea:misc.Ode4
ltx/gr_gr_cog/me.m09.d05:meMA.Ode4C13.text	Ὁ Θεῷ παριστάμενος, θεῖος Γαβριὴλ εὐαγγελιζόμενος, ἀνεφάνη σοι Μακάριε, τὴν φωνὴν τοῦ λόγου καὶ τὸν Πρόδρομον.
ltx/gr_gr_cog/me.m09.d05:meMA.Ode4C1T.incipit	Καθαρὸν ἐνδιαίτημα, ὁ Δημιουργὸς Παρθένε…
ltx/gr_gr_cog/me.m09.d05:meMA.Ode4C1T.melody	@ltx/gr_gr_cog/he.h.m8:heHE.EisakikoaKyrie.name
ltx/gr_gr_cog/me.m09.d05:meMA.Ode4C1T.mode	@ltx/gr_gr_cog/miscellanea:misc.Mode8
ltx/gr_gr_cog/me.m09.d05:meMA.Ode4C1T.ode	@ltx/gr_gr_cog/miscellanea:misc.Ode4
ltx/gr_gr_cog/me.m09.d05:meMA.Ode4C1T.text	Καθαρὸν ἐνδιαίτημα, ὁ Δημιουργὸς Παρθένε τῆς κτίσεως, εὑρηκώς σε κατεσκήνωσεν, ὁ τῆς Ἐλισάβετ λύσας στείρωσιν.
ltx/gr_gr_cog/me.m09.d05:meMA.Ode5C11.greekmelody	@ltx/gr_gr_cog/he.h.m8:heHE.OrthrizontesVoomenSoi.greekname
ltx/gr_gr_cog/me.m09.d05:meMA.Ode5C11.incipit	Ἡ κίδαρις ἐτέθη τῇ κάρᾳ…
ltx/gr_gr_cog/me.m09.d05:meMA.Ode5C11.melody	@ltx/gr_gr_cog/he.h.m8:heHE.OrthrizontesVoomenSoi.name
ltx/gr_gr_cog/me.m09.d05:meMA.Ode5C11.mode	@ltx/gr_gr_cog/miscellanea:misc.Mode8
ltx/gr_gr_cog/me.m09.d05:meMA.Ode5C11.ode	@ltx/gr_gr_cog/miscellanea:misc.Ode5
ltx/gr_gr_cog/me.m09.d05:meMA.Ode5C11.text	Ἡ κίδαρις ἐτέθη τῇ κάρᾳ σου, ὦ Προφῆτα, ἐν σφραγῖδι ἔχουσα, τύπον τῆς χάριτος ἔνδοξε.
ltx/gr_gr_cog/me.m09.d05:meMA.Ode5C12.incipit	Ἀγάλλεται ἡ κτίσις τῷ τόκῳ…
ltx/gr_gr_cog/me.m09.d05:meMA.Ode5C12.melody	@ltx/gr_gr_cog/he.h.m8:heHE.OrthrizontesVoomenSoi.name
ltx/gr_gr_cog/me.m09.d05:meMA.Ode5C12.mode	@ltx/gr_gr_cog/miscellanea:misc.Mode8
ltx/gr_gr_cog/me.m09.d05:meMA.Ode5C12.ode	@ltx/gr_gr_cog/miscellanea:misc.Ode5
ltx/gr_gr_cog/me.m09.d05:meMA.Ode5C12.text	Ἀγάλλεται ἡ κτίσις τῷ τόκῳ σου, Ἀρχιερεῦ· σὺ γὰρ ἀνεβλάστησας, τῆς μετανοίας τὸν κήρυκα.
ltx/gr_gr_cog/me.m09.d05:meMA.Ode5C13.incipit	Κοσμίως σου τὸν βίον διήνυσας…
ltx/gr_gr_cog/me.m09.d05:meMA.Ode5C13.melody	@ltx/gr_gr_cog/he.h.m8:heHE.OrthrizontesVoomenSoi.name
ltx/gr_gr_cog/me.m09.d05:meMA.Ode5C13.mode	@ltx/gr_gr_cog/miscellanea:misc.Mode8
ltx/gr_gr_cog/me.m09.d05:meMA.Ode5C13.ode	@ltx/gr_gr_cog/miscellanea:misc.Ode5
ltx/gr_gr_cog/me.m09.d05:meMA.Ode5C13.text	Κοσμίως σου τὸν βίον διήνυσας τὰς ἐντολάς, πάσας τοῦ Κυρίου γάρ, σὺν Ἐλισάβετ ἐτέλεσας.
ltx/gr_gr_cog/me.m09.d05:meMA.Ode5C1T.incipit	Ῥυθμίζεται πρὸς ὕμνον ἡ γλῶσσά…
ltx/gr_gr_cog/me.m09.d05:meMA.Ode5C1T.melody	@ltx/gr_gr_cog/he.h.m8:heHE.OrthrizontesVoomenSoi.name
ltx/gr_gr_cog/me.m09.d05:meMA.Ode5C1T.mode	@ltx/gr_gr_cog/miscellanea:misc.Mode8
ltx/gr_gr_cog/me.m09.d05:meMA.Ode5C1T.ode	@ltx/gr_gr_cog/miscellanea:misc.Ode5
ltx/gr_gr_cog/me.m09.d05:meMA.Ode5C1T.text	Ῥυθμίζεται πρὸς ὕμνον ἡ γλῶσσά σου, Θεοῤῥῆμον· τὴν γὰρ Ἀπειρόγαμον, κυοφοροῦσαν ἑώρακας.
ltx/gr_gr_cog/me.m09.d05:meMA.Ode6C11.greekmelody	@ltx/gr_gr_cog/he.h.m8:heHE.ChitonaMoiParaschou.greekname
ltx/gr_gr_cog/me.m09.d05:meMA.Ode6C11.incipit	Ὁ νόμου λατρεύων τῇ σκιᾷ…
ltx/gr_gr_cog/me.m09.d05:meMA.Ode6C11.melody	@ltx/gr_gr_cog/he.h.m8:heHE.ChitonaMoiParaschou.name
ltx/gr_gr_cog/me.m09.d05:meMA.Ode6C11.mode	@ltx/gr_gr_cog/miscellanea:misc.Mode8
ltx/gr_gr_cog/me.m09.d05:meMA.Ode6C11.ode	@ltx/gr_gr_cog/miscellanea:misc.Ode6
ltx/gr_gr_cog/me.m09.d05:meMA.Ode6C11.text	Ὁ νόμου λατρεύων τῇ σκιᾷ, ὤφθη καὶ τῆς χάριτος κήρυξ, Σωτὴρ ἡμῶν· ἠξιώθη γὰρ ἰδεῖν σου τὴν σάρκωσιν.
ltx/gr_gr_cog/me.m09.d05:meMA.Ode6C12.incipit	Τῷ κρίσεων λογείῳ κοσμηθείς, Λόγον…
ltx/gr_gr_cog/me.m09.d05:meMA.Ode6C12.melody	@ltx/gr_gr_cog/he.h.m8:heHE.ChitonaMoiParaschou.name
ltx/gr_gr_cog/me.m09.d05:meMA.Ode6C12.mode	@ltx/gr_gr_cog/miscellanea:misc.Mode8
ltx/gr_gr_cog/me.m09.d05:meMA.Ode6C12.ode	@ltx/gr_gr_cog/miscellanea:misc.Ode6
ltx/gr_gr_cog/me.m09.d05:meMA.Ode6C12.text	Τῷ κρίσεων λογείῳ κοσμηθείς, Λόγον τὸν ἀΐδιον, σάρκα φορέσαντα, Ζαχαρία, ἱερεῦ ὑποδέδεξαι.
ltx/gr_gr_cog/me.m09.d05:meMA.Ode6C13.incipit	Ὡράθης τοῦ ναοῦ ἔνδον χωρῶν…
ltx/gr_gr_cog/me.m09.d05:meMA.Ode6C13.melody	@ltx/gr_gr_cog/he.h.m8:heHE.ChitonaMoiParaschou.name
ltx/gr_gr_cog/me.m09.d05:meMA.Ode6C13.mode	@ltx/gr_gr_cog/miscellanea:misc.Mode8
ltx/gr_gr_cog/me.m09.d05:meMA.Ode6C13.ode	@ltx/gr_gr_cog/miscellanea:misc.Ode6
ltx/gr_gr_cog/me.m09.d05:meMA.Ode6C13.text	Ὡράθης τοῦ ναοῦ ἔνδον χωρῶν, Θεῷ συγγινόμενος, Μύστα θεόπνευστε, ἱερεὺς καὶ λειτουργὸς ἀξιάγαστος.
ltx/gr_gr_cog/me.m09.d05:meMA.Ode6C1T.incipit	Σωτῆρα Θεομῆτορ ἐν γαστρί, Παρθένε…
ltx/gr_gr_cog/me.m09.d05:meMA.Ode6C1T.melody	@ltx/gr_gr_cog/he.h.m8:heHE.ChitonaMoiParaschou.name
ltx/gr_gr_cog/me.m09.d05:meMA.Ode6C1T.mode	@ltx/gr_gr_cog/miscellanea:misc.Mode8
ltx/gr_gr_cog/me.m09.d05:meMA.Ode6C1T.ode	@ltx/gr_gr_cog/miscellanea:misc.Ode6
ltx/gr_gr_cog/me.m09.d05:meMA.Ode6C1T.text	Σωτῆρα Θεομῆτορ ἐν γαστρί, Παρθένε βαστάζουσα, Λόγον τὸν ἄναρχον, ἐγνωρίσθης Ἐλισάβετ τῇ προφήτιδι.
ltx/gr_gr_cog/me.m09.d05:meMA.Ode6H.greekmelody	@ltx/gr_gr_cog/he.h.m8:heHE.ChitonaMoiParaschou.greekname
ltx/gr_gr_cog/me.m09.d05:meMA.Ode6H.incipit	@ltx/gr_gr_cog/he.h.m8:heHE.ChitonaMoiParaschou.incipit
ltx/gr_gr_cog/me.m09.d05:meMA.Ode6H.melody	@ltx/gr_gr_cog/he.h.m8:heHE.ChitonaMoiParaschou.melody
ltx/gr_gr_cog/me.m09.d05:meMA.Ode6H.mode	@ltx/gr_gr_cog/miscellanea:misc.Mode8
ltx/gr_gr_cog/me.m09.d05:meMA.Ode6H.ode	@ltx/gr_gr_cog/miscellanea:misc.Ode6
ltx/gr_gr_cog/me.m09.d05:meMA.Ode6H.text	@ltx/gr_gr_cog/he.h.m8:heHE.ChitonaMoiParaschou.text
ltx/gr_gr_cog/me.m09.d05:meMA.Ode7C11.greekmelody	@ltx/gr_gr_cog/he.h.m8:heHE.PaidesEvraion.greekname
ltx/gr_gr_cog/me.m09.d05:meMA.Ode7C11.incipit	Ὅτε φωνὴ ἡ τοῦ βοῶντος…
ltx/gr_gr_cog/me.m09.d05:meMA.Ode7C11.melody	@ltx/gr_gr_cog/he.h.m8:heHE.PaidesEvraion.name
ltx/gr_gr_cog/me.m09.d05:meMA.Ode7C11.mode	@ltx/gr_gr_cog/miscellanea:misc.Mode8
ltx/gr_gr_cog/me.m09.d05:meMA.Ode7C11.ode	@ltx/gr_gr_cog/miscellanea:misc.Ode7
ltx/gr_gr_cog/me.m09.d05:meMA.Ode7C11.text	Ὅτε φωνὴ ἡ τοῦ βοῶντος, προελήλυθεν ἐκ στείρας Ζαχαρία, τῆς σῆς γλώσσης δεσμά, διέλυσε κραυγάζειν· Εὐλογητὸς εἶ Κύριε, ὁ Θεὸς εἰς τοὺς αἰῶνας.
ltx/gr_gr_cog/me.m09.d05:meMA.Ode7C12.incipit	Φίλος ἐτέχθη τοῦ νυμφίου, ἐκ…
ltx/gr_gr_cog/me.m09.d05:meMA.Ode7C12.melody	@ltx/gr_gr_cog/he.h.m8:heHE.PaidesEvraion.name
ltx/gr_gr_cog/me.m09.d05:meMA.Ode7C12.mode	@ltx/gr_gr_cog/miscellanea:misc.Mode8
ltx/gr_gr_cog/me.m09.d05:meMA.Ode7C12.ode	@ltx/gr_gr_cog/miscellanea:misc.Ode7
ltx/gr_gr_cog/me.m09.d05:meMA.Ode7C12.text	Φίλος ἐτέχθη τοῦ νυμφίου, ἐκ στειρώσεως τὸν τόκον τῆς Παρθένου, προμηνύων σαφῶς, ὁ Πρόδρομος τοῖς πίστει· Εὐλογητὸς εἶ κράζουσιν, ὁ Θεὸς εἰς τοὺς αἰῶνας.
ltx/gr_gr_cog/me.m09.d05:meMA.Ode7C13.incipit	Ὅλος ἐγένου Ζαχαρία, θεῖον ὄργανον…
ltx/gr_gr_cog/me.m09.d05:meMA.Ode7C13.melody	@ltx/gr_gr_cog/he.h.m8:heHE.PaidesEvraion.name
ltx/gr_gr_cog/me.m09.d05:meMA.Ode7C13.mode	@ltx/gr_gr_cog/miscellanea:misc.Mode8
ltx/gr_gr_cog/me.m09.d05:meMA.Ode7C13.ode	@ltx/gr_gr_cog/miscellanea:misc.Ode7
ltx/gr_gr_cog/me.m09.d05:meMA.Ode7C13.text	Ὅλος ἐγένου Ζαχαρία, θεῖον ὄργανον τοῦ Πνεύματος τρισμάκαρ, καὶ προφήτην τὸ σόν, προέλεγες παιδίον· Εὐλογητὸς εἶ Κύριε, ἐκβοῶν εἰς τοὺς αἰῶνας.
ltx/gr_gr_cog/me.m09.d05:meMA.Ode7C1T.incipit	Νόμου τὸ πλήρωμά σε Κόρη…
ltx/gr_gr_cog/me.m09.d05:meMA.Ode7C1T.melody	@ltx/gr_gr_cog/he.h.m8:heHE.PaidesEvraion.name
ltx/gr_gr_cog/me.m09.d05:meMA.Ode7C1T.mode	@ltx/gr_gr_cog/miscellanea:misc.Mode8
ltx/gr_gr_cog/me.m09.d05:meMA.Ode7C1T.ode	@ltx/gr_gr_cog/miscellanea:misc.Ode7
ltx/gr_gr_cog/me.m09.d05:meMA.Ode7C1T.text	Νόμου τὸ πλήρωμά σε Κόρη, τὸ κεφάλαιον τῆς ὅλης προφητείας, Ζαχαρίας ὁρῶν, ἐγνώρισε κραυγάζων· Εὐλογημένος πάναγνε, ὁ καρπὸς τῆς σῆς κοιλίας.
ltx/gr_gr_cog/me.m09.d05:meMA.Ode8C11.greekmelody	@ltx/gr_gr_cog/he.h.m8:heHE.TonEnOreiAgio.greekname
ltx/gr_gr_cog/me.m09.d05:meMA.Ode8C11.incipit	Ἀληθείας ἐδείχθης ὑποφήτης· τοῦ Χριστοῦ…
ltx/gr_gr_cog/me.m09.d05:meMA.Ode8C11.melody	@ltx/gr_gr_cog/he.h.m8:heHE.TonEnOreiAgio.name
ltx/gr_gr_cog/me.m09.d05:meMA.Ode8C11.mode	@ltx/gr_gr_cog/miscellanea:misc.Mode8
ltx/gr_gr_cog/me.m09.d05:meMA.Ode8C11.ode	@ltx/gr_gr_cog/miscellanea:misc.Ode8
ltx/gr_gr_cog/me.m09.d05:meMA.Ode8C11.text	Ἀληθείας ἐδείχθης ὑποφήτης· τοῦ Χριστοῦ γὰρ τὰς τρίβους Ἰωάννης, προπορευθεὶς ἡτοίμασεν ὁ Πρόδρομος, μάκαρ ἱεράρχα, ὃν ὑπερυψοῦμεν, εἰς πάντας τοὺς αἰῶνας.
ltx/gr_gr_cog/me.m09.d05:meMA.Ode8C12.incipit	Ῥητορεύων εὐλόγεις τὸν Δεσπότην, σωτηρίαν…
ltx/gr_gr_cog/me.m09.d05:meMA.Ode8C12.melody	@ltx/gr_gr_cog/he.h.m8:heHE.TonEnOreiAgio.name
ltx/gr_gr_cog/me.m09.d05:meMA.Ode8C12.mode	@ltx/gr_gr_cog/miscellanea:misc.Mode8
ltx/gr_gr_cog/me.m09.d05:meMA.Ode8C12.ode	@ltx/gr_gr_cog/miscellanea:misc.Ode8
ltx/gr_gr_cog/me.m09.d05:meMA.Ode8C12.text	Ῥητορεύων εὐλόγεις τὸν Δεσπότην, σωτηρίαν ἡμῖν τὸν δεδωκότα, τὸν ἐκ Δαυῒδ σαρκὶ ἐξανατείλαντα, Κύριον τῆς δόξης, ὃν ὑπερυψοῦμεν, εἰς πάντας τοὺς αἰῶνας.
ltx/gr_gr_cog/me.m09.d05:meMA.Ode8C13.incipit	Χαρισμάτων μεγάλων ἠξιώθης, θεοφάντορ τὸν…
ltx/gr_gr_cog/me.m09.d05:meMA.Ode8C13.melody	@ltx/gr_gr_cog/he.h.m8:heHE.TonEnOreiAgio.name
ltx/gr_gr_cog/me.m09.d05:meMA.Ode8C13.mode	@ltx/gr_gr_cog/miscellanea:misc.Mode8
ltx/gr_gr_cog/me.m09.d05:meMA.Ode8C13.ode	@ltx/gr_gr_cog/miscellanea:misc.Ode8
ltx/gr_gr_cog/me.m09.d05:meMA.Ode8C13.text	Χαρισμάτων μεγάλων ἠξιώθης, θεοφάντορ τὸν Πρόδρομον γεννήσας, τὸν Προφητῶν ἁπάντων ὑπερκείμενον· Κύριον ὑμνοῦντα, καὶ ὑπερυψοῦντα, εἰς πάντας τοὺς αἰῶνας.
ltx/gr_gr_cog/me.m09.d05:meMA.Ode8C1T.incipit	Ἱεράρχης ὁμοῦ καὶ θεοκήρυξ, Ζαχαρίας…
ltx/gr_gr_cog/me.m09.d05:meMA.Ode8C1T.melody	@ltx/gr_gr_cog/he.h.m8:heHE.TonEnOreiAgio.name
ltx/gr_gr_cog/me.m09.d05:meMA.Ode8C1T.mode	@ltx/gr_gr_cog/miscellanea:misc.Mode8
ltx/gr_gr_cog/me.m09.d05:meMA.Ode8C1T.ode	@ltx/gr_gr_cog/miscellanea:misc.Ode8
ltx/gr_gr_cog/me.m09.d05:meMA.Ode8C1T.text	Ἱεράρχης ὁμοῦ καὶ θεοκήρυξ, Ζαχαρίας Μητέρα καὶ Παρθένον, τὸν Κύριον βαστάζουσαν τῆς κτίσεως, χαίρων προσεκύνει· ἣν ὑπερυψοῦμεν, εἰς πάντας τοὺς αἰῶνας.
ltx/gr_gr_cog/me.m09.d05:meMA.Ode8H.greekmelody	@ltx/gr_gr_cog/he.h.m8:heHE.TonEnOreiAgio.greekname
ltx/gr_gr_cog/me.m09.d05:meMA.Ode8H.incipit	@ltx/gr_gr_cog/he.h.m8:heHE.TonEnOreiAgio.incipit
ltx/gr_gr_cog/me.m09.d05:meMA.Ode8H.melody	@ltx/gr_gr_cog/he.h.m8:heHE.TonEnOreiAgio.melody
ltx/gr_gr_cog/me.m09.d05:meMA.Ode8H.mode	@ltx/gr_gr_cog/miscellanea:misc.Mode8
ltx/gr_gr_cog/me.m09.d05:meMA.Ode8H.ode	@ltx/gr_gr_cog/miscellanea:misc.Ode8
ltx/gr_gr_cog/me.m09.d05:meMA.Ode8H.text	@ltx/gr_gr_cog/he.h.m8:heHE.TonEnOreiAgio.text
ltx/gr_gr_cog/me.m09.d05:meMA.Ode9C11.greekmelody	@ltx/gr_gr_cog/he.h.m8:heHE.KyriosTheotokon.greekname
ltx/gr_gr_cog/me.m09.d05:meMA.Ode9C11.incipit	Ἐπλήσθης ἐπιπνοίας…
ltx/gr_gr_cog/me.m09.d05:meMA.Ode9C11.melody	@ltx/gr_gr_cog/he.h.m8:heHE.KyriosTheotokon.name
ltx/gr_gr_cog/me.m09.d05:meMA.Ode9C11.mode	@ltx/gr_gr_cog/miscellanea:misc.Mode8
ltx/gr_gr_cog/me.m09.d05:meMA.Ode9C11.ode	@ltx/gr_gr_cog/miscellanea:misc.Ode9
ltx/gr_gr_cog/me.m09.d05:meMA.Ode9C11.text	Ἐπλήσθης ἐπιπνοίας, τῆς τοῦ Παρακλήτου, καὶ εὐλογεῖν ἐπεχείρεις τὸν Κύριον, ἱερομύστα θεόφρον θεομακάριστε.
ltx/gr_gr_cog/me.m09.d05:meMA.Ode9C12.incipit	Ῥημάτων τὰς ἐκβάσεις, τῶν τοῦ…
ltx/gr_gr_cog/me.m09.d05:meMA.Ode9C12.melody	@ltx/gr_gr_cog/he.h.m8:heHE.KyriosTheotokon.name
ltx/gr_gr_cog/me.m09.d05:meMA.Ode9C12.mode	@ltx/gr_gr_cog/miscellanea:misc.Mode8
ltx/gr_gr_cog/me.m09.d05:meMA.Ode9C12.ode	@ltx/gr_gr_cog/miscellanea:misc.Ode9
ltx/gr_gr_cog/me.m09.d05:meMA.Ode9C12.text	Ῥημάτων τὰς ἐκβάσεις, τῶν τοῦ Ἀρχαγγέλου, ἑωρακὼς θεοῤῥῆμον πανεύφημε, πρὸς εὐλογίαν τὴν γλῶτταν εὐθὺς ἐκίνησας.
ltx/gr_gr_cog/me.m09.d05:meMA.Ode9C13.incipit	Ἠλέησεν ὁ Πλάστης, τοὺς ἀπολλυμένους…
ltx/gr_gr_cog/me.m09.d05:meMA.Ode9C13.melody	@ltx/gr_gr_cog/he.h.m8:heHE.KyriosTheotokon.name
ltx/gr_gr_cog/me.m09.d05:meMA.Ode9C13.mode	@ltx/gr_gr_cog/miscellanea:misc.Mode8
ltx/gr_gr_cog/me.m09.d05:meMA.Ode9C13.ode	@ltx/gr_gr_cog/miscellanea:misc.Ode9
ltx/gr_gr_cog/me.m09.d05:meMA.Ode9C13.text	Ἠλέησεν ὁ Πλάστης, τοὺς ἀπολλυμένους, καὶ Ἀβραὰμ διαθήκης ἐμνήσθη σαφῶς, ὡς προφητεύων ἐφθέγξω, πλησθεὶς τοῦ Πνεύματος.
ltx/gr_gr_cog/me.m09.d05:meMA.Ode9C14.incipit	Ἀθλήσεως στεφάνοις, καὶ ἱερωσύνης, καὶ…
ltx/gr_gr_cog/me.m09.d05:meMA.Ode9C14.melody	@ltx/gr_gr_cog/he.h.m8:heHE.KyriosTheotokon.name
ltx/gr_gr_cog/me.m09.d05:meMA.Ode9C14.mode	@ltx/gr_gr_cog/miscellanea:misc.Mode8
ltx/gr_gr_cog/me.m09.d05:meMA.Ode9C14.ode	@ltx/gr_gr_cog/miscellanea:misc.Ode9
ltx/gr_gr_cog/me.m09.d05:meMA.Ode9C14.text	Ἀθλήσεως στεφάνοις, καὶ ἱερωσύνης, καὶ φωτισμῷ προφητείας κεκόσμησαι, ὦ Ζαχαρία, καὶ δόξης μετέσχες κρείττονος.
ltx/gr_gr_cog/me.m09.d05:meMA.Ode9C1T.incipit	Φωτὸς οὖσα δοχεῖον, φώτισον Παρθένε…
ltx/gr_gr_cog/me.m09.d05:meMA.Ode9C1T.melody	@ltx/gr_gr_cog/he.h.m8:heHE.KyriosTheotokon.name
ltx/gr_gr_cog/me.m09.d05:meMA.Ode9C1T.mode	@ltx/gr_gr_cog/miscellanea:misc.Mode8
ltx/gr_gr_cog/me.m09.d05:meMA.Ode9C1T.ode	@ltx/gr_gr_cog/miscellanea:misc.Ode9
ltx/gr_gr_cog/me.m09.d05:meMA.Ode9C1T.text	Φωτὸς οὖσα δοχεῖον, φώτισον Παρθένε, τὴν σκοτισθεῖσαν ψυχήν μου τοῖς πάθεσι, καὶ ἐξωτέρου με σκότους, ῥῦσαι πρεσβείαις σου.
ltx/gr_gr_cog/me.m09.d05:meMA.Ode9H.greekmelody	@ltx/gr_gr_cog/he.h.m8:heHE.KyriosTheotokon.greekname
ltx/gr_gr_cog/me.m09.d05:meMA.Ode9H.incipit	@ltx/gr_gr_cog/he.h.m8:heHE.KyriosTheotokon.incipit
ltx/gr_gr_cog/me.m09.d05:meMA.Ode9H.melody	@ltx/gr_gr_cog/he.h.m8:heHE.KyriosTheotokon.melody
ltx/gr_gr_cog/me.m09.d05:meMA.Ode9H.mode	@ltx/gr_gr_cog/miscellanea:misc.Mode8
ltx/gr_gr_cog/me.m09.d05:meMA.Ode9H.ode	@ltx/gr_gr_cog/miscellanea:misc.Ode9
ltx/gr_gr_cog/me.m09.d05:meMA.Ode9H.text	@ltx/gr_gr_cog/he.h.m8:heHE.KyriosTheotokon.text
ltx/gr_gr_cog/me.m09.d05:meMA.Oikos1.text	Τὴν τοῦ νόμου σιγὴν ὁ ἱεράρχης δέδεκται, διʼ Ἀγγέλου φωνῆς, τὸν Ἄγγελον δεχόμενος, Χριστοῦ παρουσίας Προφήτην καὶ μύστην, σὺν Ἐλισάβετ στείρᾳ καὶ σώφρονι, οὗ γεννηθέντος, ἀνεκαινίσθη χάρις καὶ λυτρωσις, καὶ καταλλαγὴ ἡμῶν παγκόσμιος· κηρύττει γὰρ τὸν ἀμνόν, καὶ πλάστην, καὶ τῆς φύσεως νεουργόν, τὸν ἐκ τῆς στείρας τὸν καρπὸν χορηγοῦντα, Υἱὸν δὲ φανέντα τῆς Παρθένου, ὡς θεῖος μύστης Θεοῦ τῆς χάριτος.
ltx/gr_gr_cog/me.m09.d05:meVE.Apolytikion1.greekmelody	@ltx/gr_gr_cog/he.a.m4:heAU.KateplagiIosif.greekname
ltx/gr_gr_cog/me.m09.d05:meVE.Apolytikion1.incipit	Ἱερωσύνης στολισμόν…
ltx/gr_gr_cog/me.m09.d05:meVE.Apolytikion1.melody	@ltx/gr_gr_cog/he.a.m4:heAU.KateplagiIosif.name
ltx/gr_gr_cog/me.m09.d05:meVE.Apolytikion1.mode	@ltx/gr_gr_cog/miscellanea:misc.Mode4
ltx/gr_gr_cog/me.m09.d05:meVE.Apolytikion1.text	Ἱερωσύνης στολισμόν, περιβαλλόμενος σοφέ, κατὰ τὸν νόμον τοῦ Θεοῦ, ὁλοκαυτώματα δεκτά, ἱεροπρεπῶς προσενήνοχας Ζαχαρία· καὶ γέγονας φωστήρ, καὶ θεατὴς μυστικῶν, τὰ σύμβολα ἐν σοί, τὰ τῆς χάριτος, φέρων ἐκδήλως πάνσοφε, καὶ ξίφει ἀναιρεθεὶς ἐν τῷ ναῷ τοῦ Θεοῦ, Χριστοῦ Προφῆτα, σὺν τῷ Προδρόμῳ, πρέσβευε σωθῆναι τὰς ψυχὰς ἡμῶν.
ltx/gr_gr_cog/me.m09.d05:meVE.AposGlory.incipit	Ὡς καθαρὸς ἱερεύς…
ltx/gr_gr_cog/me.m09.d05:meVE.AposGlory.melody	
ltx/gr_gr_cog/me.m09.d05:meVE.AposGlory.mode	@ltx/gr_gr_cog/miscellanea:misc.Mode2
ltx/gr_gr_cog/me.m09.d05:meVE.AposGlory.poet	@ltx/gr_gr_cog/poets:po.Anatoliou
ltx/gr_gr_cog/me.m09.d05:meVE.AposGlory.text	Ὡς καθαρὸς ἱερεύς, εἰς τὰ Ἅγια τῶν Ἁγίων εἰσέδυς· καὶ τὴν στολὴν τὴν ἱερὰν ἐνδυσάμενος, ἀμέμπως τῷ Θεῷ ἐλειτούργησας, ὡς Ἀαρὼν νομοθετῶν, καὶ ὡς Μωσῆς ποδηγῶν τὰς φυλὰς τοῦ Ἰσραήλ, ἐν τῇ τῶν κωδώνων ἀκραιφνεῖ συμβολῇ· διὸ καὶ πεφόνευσαι· ἀλλὰ τὸ αἷμά σου τὸ δίκαιον, ἡμῖν σωτήριον ἴαμα γέγονε, καὶ ὡς μύρον εὐῶδες, τὰς ἀκοὰς ἀνοίγει, πρὸς πορισμὸν τῆς αἰωνίου ζωῆς, Ζαχαρία τρισόλβιε, τοῦ Βαπτιστοῦ Ἰωάννου ὁ γενέτης, καὶ τῆς Ἐλισάβετ ὁ σύνευνος, ἐκτενῶς πρέσβευε, ὑπὲρ τῶν ψυχῶν ἡμῶν.
ltx/gr_gr_cog/me.m09.d05:meVE.AposStavrotheotokion.greekmelody	@ltx/gr_gr_cog/he.a.m2:heAU.OteEkTouXylou.greekname
ltx/gr_gr_cog/me.m09.d05:meVE.AposStavrotheotokion.incipit	@ltx/gr_gr_cog/me.m06.d01:meVE.SticStavrotheotokion.incipit
ltx/gr_gr_cog/me.m09.d05:meVE.AposStavrotheotokion.melody	@ltx/gr_gr_cog/he.a.m2:heAU.OteEkTouXylou.name
ltx/gr_gr_cog/me.m09.d05:meVE.AposStavrotheotokion.mode	@ltx/gr_gr_cog/miscellanea:misc.Mode2
ltx/gr_gr_cog/me.m09.d05:meVE.AposStavrotheotokion.text	@ltx/gr_gr_cog/me.m06.d01:meVE.SticStavrotheotokion.text
ltx/gr_gr_cog/me.m09.d05:meVE.AposTheotokion.greekmelody	@ltx/gr_gr_cog/he.a.m2:heAU.OteEkTouXylou.greekname
ltx/gr_gr_cog/me.m09.d05:meVE.AposTheotokion.incipit	@ltx/gr_gr_cog/oc.m2.d4:ocVE.Stichera5.incipit
ltx/gr_gr_cog/me.m09.d05:meVE.AposTheotokion.melody	@ltx/gr_gr_cog/he.a.m2:heAU.OteEkTouXylou.name
ltx/gr_gr_cog/me.m09.d05:meVE.AposTheotokion.mode	@ltx/gr_gr_cog/miscellanea:misc.Mode2
ltx/gr_gr_cog/me.m09.d05:meVE.AposTheotokion.text	@ltx/gr_gr_cog/oc.m2.d4:ocVE.Stichera5.text
ltx/gr_gr_cog/me.m09.d05:meVE.Aposticha1.greekmelody	@ltx/gr_gr_cog/he.a.m8:heAU.OTouParadoxou.greekname
ltx/gr_gr_cog/me.m09.d05:meVE.Aposticha1.incipit	Ὢ τοῦ παραδόξου θαύματος…
ltx/gr_gr_cog/me.m09.d05:meVE.Aposticha1.melody	@ltx/gr_gr_cog/he.a.m8:heAU.OTouParadoxou.name
ltx/gr_gr_cog/me.m09.d05:meVE.Aposticha1.mode	@ltx/gr_gr_cog/miscellanea:misc.Mode8
ltx/gr_gr_cog/me.m09.d05:meVE.Aposticha1.text	Ὢ τοῦ παραδόξου θαύματος! ὁ παρεστὼς τῷ Θεῷ, ἐν ὑψίστοις Ἀρχάγγελος, λειτουργῷ θεόφρονι, Ζαχαρία τὴν σύλληψιν, τὴν τοῦ Προδρόμου εὐαγγελίζεται, παρʼ ἡλικίαν ἐκ τῆς στειρώσεως, Ὢ τῆς ἀφράστου σου, προμηθείας Δέσποτα! διʼ ἧς Χριστέ, σῶσον τὰς ψυχὰς ἡμῶν, ὡς μόνος εὔσπλαγχνος.
ltx/gr_gr_cog/me.m09.d05:meVE.Aposticha2.incipit	Ὢ τοῦ παραδόξου θαύματος! τῆς Παλαιᾶς…
ltx/gr_gr_cog/me.m09.d05:meVE.Aposticha2.melody	@ltx/gr_gr_cog/he.a.m8:heAU.OTouParadoxou.name
ltx/gr_gr_cog/me.m09.d05:meVE.Aposticha2.mode	@ltx/gr_gr_cog/miscellanea:misc.Mode8
ltx/gr_gr_cog/me.m09.d05:meVE.Aposticha2.text	Ὢ τοῦ παραδόξου θαύματος! τῆς Παλαιᾶς τὴν σιγήν, καὶ τῆς Νέας τὴν ἔκφανσιν, Ζαχαρίου κώφευσις, προφητεύει σαφέστατα· τὴν γὰρ τοῦ νόμου σιγήσας πλήρωσιν, τὸ φῶς ὑπέδειξε τὸ τῆς χάριτος, Ὢ τῆς προνοίας σου, τῆς σοφῆς Φιλάνθρωπε! διʼ ἧς ἡμᾶς, πάντας περιφρούρησον ὡς παντοδύναμος.
ltx/gr_gr_cog/me.m09.d05:meVE.Aposticha3.incipit	Ὢ τοῦ παραδόξου θαύματος! ἐν ἱερεῦσι…
ltx/gr_gr_cog/me.m09.d05:meVE.Aposticha3.melody	@ltx/gr_gr_cog/he.a.m8:heAU.OTouParadoxou.name
ltx/gr_gr_cog/me.m09.d05:meVE.Aposticha3.mode	@ltx/gr_gr_cog/miscellanea:misc.Mode8
ltx/gr_gr_cog/me.m09.d05:meVE.Aposticha3.text	Ὢ τοῦ παραδόξου θαύματος! ἐν ἱερεῦσι πιστός, καὶ ἐν Μάρτυσιν ἄριστος, καὶ Προφήτης ἔνδοξος, προμηνύων τὰ μέλλοντα, ὁ Ζαχαρίας Δέσποτα δείκνυται, τριπλῷ στεφάνῳ κατακοσμούμενος, Ὢ τῶν πλουσίων σου, δωρεῶν φιλάνθρωπε! δι’ ὧν Χριστέ, πάντας καταξίωσον, τῆς βασιλείας σου.
ltx/gr_gr_cog/me.m09.d05:meVE.SticGlory.incipit	Ἱερωσύνης νομικῆς…
ltx/gr_gr_cog/me.m09.d05:meVE.SticGlory.melody	
ltx/gr_gr_cog/me.m09.d05:meVE.SticGlory.mode	@ltx/gr_gr_cog/miscellanea:misc.Mode8
ltx/gr_gr_cog/me.m09.d05:meVE.SticGlory.poet	@ltx/gr_gr_cog/poets:po.IoannouMonachou
ltx/gr_gr_cog/me.m09.d05:meVE.SticGlory.text	Ἱερωσύνης νομικῆς, ἐνδεδυμένος ὄντως στολήν, κατὰ τὴν τάξιν Ἀαρὼν ἐλειτούργησας· καὶ παρεστὼς ἐν τῷ ναῷ, ἀγγελικὴν μορφὴν ἐμφανῶς, ἐθεάσω παμμακάριστε· διό σου τὴν μετάστασιν ἅπαντες, μέλποντες χρεωστικῶς Ζαχαρία, ᾄσμασιν εὐφημοῦμεν, σὲ τὸν μετὰ τὸ γῆρας ἐκβλαστήσαντα, Ἰωάννην τὸν ἔνδοξον. Πρέσβευε ὑπέρ ἡμῶν, τὸν ἐλεήμονα Θεόν, σωθῆναι ἡμᾶς.
ltx/gr_gr_cog/me.m09.d05:meVE.SticStavrotheotokion.greekmelody	@ltx/gr_gr_cog/he.a.m8:heAU.KyrieEiKaiKritirio.greekname
ltx/gr_gr_cog/me.m09.d05:meVE.SticStavrotheotokion.incipit	Κύριε, ὅτε σε ὁ ἥλιος…
ltx/gr_gr_cog/me.m09.d05:meVE.SticStavrotheotokion.melody	@ltx/gr_gr_cog/he.a.m8:heAU.KyrieEiKaiKritirio.name
ltx/gr_gr_cog/me.m09.d05:meVE.SticStavrotheotokion.mode	@ltx/gr_gr_cog/miscellanea:misc.Mode8
ltx/gr_gr_cog/me.m09.d05:meVE.SticStavrotheotokion.text	Κύριε, ὅτε σε ὁ ἥλιος εἶδεν, ἐπὶ τοῦ ξύλου κρεμάμενον, Ἥλιε τῆς δικαιοσύνης, τὰς ἀκτῖνας ἐναπέκρυψε· καὶ τῆς σελήνης τὸ φῶς, εἰς σκότος μετεβάλετο, ἡ δὲ πανάμωμός σου Μήτηρ, τὰ σπλάγχνα διετέτρωτο.
ltx/gr_gr_cog/me.m09.d05:meVE.SticTheotokion.greekmelody	@ltx/gr_gr_cog/he.a.m8:heAU.KyrieEiKaiKritirio.greekname
ltx/gr_gr_cog/me.m09.d05:meVE.SticTheotokion.incipit	Κύριε, σὺ τῆς σὲ τεκούσης…
ltx/gr_gr_cog/me.m09.d05:meVE.SticTheotokion.melody	@ltx/gr_gr_cog/he.a.m8:heAU.KyrieEiKaiKritirio.name
ltx/gr_gr_cog/me.m09.d05:meVE.SticTheotokion.mode	@ltx/gr_gr_cog/miscellanea:misc.Mode8
ltx/gr_gr_cog/me.m09.d05:meVE.SticTheotokion.text	Κύριε, σὺ τῆς σὲ τεκούσης πρεσβείαις, περιφρούρησον τὴν ποίμνην σου, ἣν περ αἵματί σου τιμίῳ, ὡς οἰκτίρμων ἐξηγόρασας, καὶ ἐπηρείας ἐχθρῶν, ἀπήμαντον συντήρησον, ὅπως ὑμνοῦντες δοξολογῶμεν, σοῦ τὴν θείαν συγκατάβασιν.
ltx/gr_gr_cog/me.m09.d05:meVE.Stichera01.greekmelody	@ltx/gr_gr_cog/he.a.m4:heAU.EdokasSimeiosin.greekname
ltx/gr_gr_cog/me.m09.d05:meVE.Stichera01.incipit	Χρῖσμα περικείμενος…
ltx/gr_gr_cog/me.m09.d05:meVE.Stichera01.melody	@ltx/gr_gr_cog/he.a.m4:heAU.EdokasSimeiosin.name
ltx/gr_gr_cog/me.m09.d05:meVE.Stichera01.mode	@ltx/gr_gr_cog/miscellanea:misc.Mode4
ltx/gr_gr_cog/me.m09.d05:meVE.Stichera01.text	Χρῖσμα περικείμενος, στολήν τε θείαν ἀοίδιμε, Ζαχαρία ὡς ἄγγελος, Θεῷ ἱεράτευσας, μεσιτεύων πλάστῃ, καὶ πλάσματι μάκαρ, καὶ τὰς δηλώσεις ἐναργῶς, τοῦ θείου Πνεύματος εἰσδεχόμενος· διό σε μακαρίζομεν, καὶ τὴν ἁγίαν σου σήμερον, ἐκτελοῦντες πανήγυριν, τὸν Σωτῆρα δοξάζομεν.
ltx/gr_gr_cog/me.m09.d05:meVE.Stichera02.incipit	Παιδίον ἑώρακας…
ltx/gr_gr_cog/me.m09.d05:meVE.Stichera02.melody	@ltx/gr_gr_cog/he.a.m4:heAU.EdokasSimeiosin.name
ltx/gr_gr_cog/me.m09.d05:meVE.Stichera02.mode	@ltx/gr_gr_cog/miscellanea:misc.Mode4
ltx/gr_gr_cog/me.m09.d05:meVE.Stichera02.text	Παιδίον ἑώρακας, ἀποτεχθὲν τῆς νεάνιδος, Ζαχαρία θεόπνευστε, Πατρὸς τὸν συνάναρχον, καὶ τῷ σῷ προδήλως, προλέγεις παιδίῳ· Προφήτης ἔσῃ ἀληθῶς, τούτου τὰς τρίβους ἑτοιμαζόμενος· μεθʼ οὗ σε μακαρίζομεν, καὶ τὴν σεπτήν σου πανήγυριν, ἱερῶς ἑορτάζομεν, θεοφόρε Πανόλβιε.
ltx/gr_gr_cog/me.m09.d05:meVE.Stichera03.incipit	Ναὸς ζῶν καὶ ἔμψυχος…
ltx/gr_gr_cog/me.m09.d05:meVE.Stichera03.melody	@ltx/gr_gr_cog/he.a.m4:heAU.EdokasSimeiosin.name
ltx/gr_gr_cog/me.m09.d05:meVE.Stichera03.mode	@ltx/gr_gr_cog/miscellanea:misc.Mode4
ltx/gr_gr_cog/me.m09.d05:meVE.Stichera03.text	Ναὸς ζῶν καὶ ἔμψυχος, τοῦ θείου Πνεύματος πέφυκας· καὶ ναοῦ μέσον ἔνδοξε, Θεῷ συγγινόμενος, καθαρᾷ καρδίᾳ ἀδίκως ἐσφάγης, μαρτυρικῶς ἀποπληρῶν, τὸν θεῖον δρόμον σου Ἀξιάγαστε· διὸ πρὸς τὸν οὐράνιον, ναὸν ἀνῆλθες ἐν αἵματι, τῷ ἰδίῳ αἰτούμενος, ἱλασμὸν τοῖς τιμῶσι σε.
