ltx/gr_gr_cog/le.go.me.m06.d19:lemeLI.Gospel.book_abbr	@ltx/gr_gr_cog/bible:John.abbr
ltx/gr_gr_cog/le.go.me.m06.d19:lemeLI.Gospel.book_string	@ltx/gr_gr_cog/bible:John.text
ltx/gr_gr_cog/le.go.me.m06.d19:lemeLI.Gospel.chapverse	14:21 – 24
ltx/gr_gr_cog/le.go.me.m06.d19:lemeLI.Gospel.incipit	Ὁ ἔχων τὰς ἐντολάς μου…
ltx/gr_gr_cog/le.go.me.m06.d19:lemeLI.Gospel.text	Εἶπεν ὁ Κύριος τοῖς ἑαυτοῦ μαθηταῖς· ὁ ἔχων τὰς ἐντολάς μου καὶ τηρῶν αὐτάς, ἐκεῖνός ἐστιν ὁ ἀγαπῶν με· ὁ δὲ ἀγαπῶν με ἀγαπηθήσεται ὑπὸ τοῦ πατρός μου, καὶ ἐγὼ ἀγαπήσω αὐτὸν καὶ ἐμφανίσω αὐτῷ ἐμαυτόν. Λέγει αὐτῷ Ἰούδας, οὐχ ὁ Ἰσκαριώτης· Κύριε, καὶ τί γέγονεν ὅτι ἡμῖν μέλλεις ἐμφανίζειν σεαυτὸν καὶ οὐχὶ τῷ κόσμῳ; ἀπεκρίθη Ἰησοῦς καὶ εἶπεν αὐτῷ· ἐάν τις ἀγαπᾷ με, τὸν λόγον μου τηρήσει, καὶ ὁ πατήρ μου ἀγαπήσει αὐτόν, καὶ πρὸς αὐτὸν ἐλευσόμεθα καὶ μονὴν παρ᾽ αὐτῷ ποιήσομεν. ὁ μὴ ἀγαπῶν με τοὺς λόγους μου οὐ τηρεῖ· καὶ ὁ λόγος ὃν ἀκούετε οὐκ ἔστιν ἐμός, ἀλλὰ τοῦ πέμψαντός με πατρός.
ltx/gr_gr_cog/le.go.me.m06.d19:lemeLI.Gospel.title	Τοῦ Ἀποστόλου
ltx/gr_gr_cog/le.go.me.m06.d19:lemeLI.Gospel.title_abbr	Τοῦ Ἀποστόλου
ltx/gr_gr_cog/le.go.me.m06.d19:lemeLI.Gospel.version	@ltx/gr_gr_cog/properties:version.designation
