ltx/gr_gr_cog/sy.m06.d08:cl.syMA.commemoration01.text	[saint/com 1]
ltx/gr_gr_cog/sy.m06.d08:cl.syMA.commemoration02.text	[saint/com 2]
ltx/gr_gr_cog/sy.m06.d08:cl.syMA.commemoration03.text	[saint/com 3]
ltx/gr_gr_cog/sy.m06.d08:cl.syMA.commemoration04.text	[saint/com 4]
ltx/gr_gr_cog/sy.m06.d08:cl.syMA.commemoration05.text	[saint/com 5]
ltx/gr_gr_cog/sy.m06.d08:cl.syMA.commemoration06.text	[saint/com list]
ltx/gr_gr_cog/sy.m06.d08:syMA.commemoration01.couplet1.title	@ltx/gr_gr_cog/titles:ti.Verses
ltx/gr_gr_cog/sy.m06.d08:syMA.commemoration01.couplet1.verse1	Νεκρόν με Θεόδωρον ἡ πατρὶς δέχου,
ltx/gr_gr_cog/sy.m06.d08:syMA.commemoration01.couplet1.verse2	Ὃν ζῶντα πλουτεῖ Μαρτύρων πατρὶς πόλος.
ltx/gr_gr_cog/sy.m06.d08:syMA.commemoration01.narration.p01	Οὗτος ἦν ἐπὶ Λικινίου, ἐν Εὐχαΐτοις μὲν γεγονώς, καὶ τὸ γένος ἐκεῖθεν ἕλκων, ἐν Ἡρακλείᾳ δὲ τῇ κατὰ Πόντον κειμένῃ τὰς διατριβὰς ποιούμενος, ὡραῖος τὸν σωματικὸν χαρακτῆρα, καὶ τὴν ψυχὴν ὡραιότερος λόγῳ καὶ γνώσει καὶ τῇ λοιπῇ σοφίᾳ κεκοσμημένος· ὅθεν καί τινες αὐτόν, Βρυοῤῥήτορα ἀνηγόρευον. Οὗτος, διὰ πάντων τῶν κολαστηρίων ὀργάνων διελθών, τὸ μὲν μακάριον αὑτοῦ σῶμα τῇ γῇ καταλελοιπώς, τοῖς πιστῶς προσιοῦσιν αὐτῷ τῶν ἰαμάτων ἐκβλύζει ῥεῖθρα· τὸ δὲ ἅγιον αὐτοῦ πνεῦμα ἐν οὐρανοῖς αὐλίζεται· οὗ τινος τιμίου καὶ ἁγίου σώματος τὴν μετακομιδὴν ἑορτάζομεν.
ltx/gr_gr_cog/sy.m06.d08:syMA.commemoration01.single1	Ὄλβιον ὀγδοάτῃ Θεοδώρου σῶμα κομίσθη.
ltx/gr_gr_cog/sy.m06.d08:syMA.commemoration01.text	Τῇ Ηʹ τοῦ αὐτοῦ μηνός, μνήμη τῆς ἀνακομιδῆς τοῦ Λειψάνου τοῦ Ἁγίου Μεγαλομάρτυρος Θεοδώρου τοῦ Στρατηλάτου.
ltx/gr_gr_cog/sy.m06.d08:syMA.commemoration02.text	Τῇ αὐτῇ ἡμέρᾳ, τελεῖται ἡ σύναξις τῆς ὑπεραγίας Θεοτόκου καὶ τοῦ Ἀρχαγγέλου Μιχαὴλ ἐν τῷ Σωσθενείῳ.
ltx/gr_gr_cog/sy.m06.d08:syMA.commemoration03.couplet1.title	@ltx/gr_gr_cog/titles:ti.Verses
ltx/gr_gr_cog/sy.m06.d08:syMA.commemoration03.couplet1.verse1	Τοῦ Μαρκιανοῦ τῷ ξίφει τετμημένου,
ltx/gr_gr_cog/sy.m06.d08:syMA.commemoration03.couplet1.verse2	Νίκανδρος εἶπεν, ἀκόλουθος εἰμί σοι.
ltx/gr_gr_cog/sy.m06.d08:syMA.commemoration03.narration.p01	Οὗτοι, διὰ τὴν εἰς Χριστὸν ὁμολογίαν, ἐπὶ Μαξίμου τοῦ Ἡγεμόνος ἐξητάσθησαν, καὶ φρουρᾷ ὑπεβλήθησαν. Μετά τοῦτο δὲ πάλιν, ἀναγκασθέντες ἀρνήσασθαι τὸν Χριστόν, καὶ μὴ πεισθέντες, ξέονται ὄνυξι σιδηροῖς καὶ ἐπί ξύλοις ὀρθοῖς μετεωρίζονται, καὶ κατακεντῶνται σιδήροις, καὶ πυρὶ καταφλέγονται· καὶ κατενεχθέντες, ἐπʼ ἀνθράκων πυρὸς ἐφαπλοῦνται, καὶ ῥάβδοις ἄνωθεν τύπτονται, καὶ ὀξάλμῃ ταῖς πληγαῖς ἐπιτυθέντες, ὀστράκοις ὀξέσι συντρίβονται, καί λίθοις τὰ στόματα καὶ τὰς ὄψεις συνθλῶνται, καὶ τάς γλώσσας μαχαίρᾳ ἐκτέμνονται, καὶ τέλος τὸν διὰ ξίφους δέχονται θάνατον.
ltx/gr_gr_cog/sy.m06.d08:syMA.commemoration03.text	Τῇ αὐτῇ ἡμέρᾳ, μνήμη τῶν Ἁγίων Μαρτύρων Νικάνδρου καὶ Μαρκιανοῦ.
ltx/gr_gr_cog/sy.m06.d08:syMA.commemoration04.couplet1.title	@ltx/gr_gr_cog/titles:ti.Verses
ltx/gr_gr_cog/sy.m06.d08:syMA.commemoration04.couplet1.verse1	Κάλλη παραβλέπουσα τῶν ποιημάτων,
ltx/gr_gr_cog/sy.m06.d08:syMA.commemoration04.couplet1.verse2	Κτίστου τὰ κάλλη ὀπτάνῃ Καλλιόπη.
ltx/gr_gr_cog/sy.m06.d08:syMA.commemoration04.narration.p01	Αὕτη ἦν κατὰ τοὺς χρόνους Δεκίου τοῦ βασιλέως, ὡραιότητι σώματος καὶ κάλλει ψυχῆς διαλάμπουσα. Συσχεθεῖσα οὖν, ἀναγκάζεται ἀποστῆναι τῆς τοῦ Χριστοῦ ἀγάπης καὶ πίστεως. Ὡς δὲ κραταιῶς ταύτης ἀντείχετο, αἰκίζεται σφοδρῶς καὶ τοὺς μαστοὺς κόπτεται, οὓς Ἄγγελος ἐπιστὰς ὑγιεῖς ἀπέδειξεν. Εἶτα ἐπʼ ὀστράκου κεκομμένου σύρεται, καὶ πυρὶ καταφλέγεται καὶ τὰς καταφλεχθείσας σάρκας ἅλατι ἐπιπάσσεται, καὶ τριχίνοις ὑφάσματι κατατρίβεται. Εἶθʼ οὕτω τὴν κεφαλὴν ἀποτέμνεται εἰς δόξαν τοῦ Κυρίου ἡμῶν Ἰησοῦ Χριστοῦ.
ltx/gr_gr_cog/sy.m06.d08:syMA.commemoration04.text	Τῇ αὐτῇ ἡμέρᾳ, μνήμη τῆς Ἁγίας Μάρτυρος Καλλιόπης.
ltx/gr_gr_cog/sy.m06.d08:syMA.commemoration05.couplet1.title	@ltx/gr_gr_cog/titles:ti.Verses
ltx/gr_gr_cog/sy.m06.d08:syMA.commemoration05.couplet1.verse1	Ὁ Θεοφάνης ὀγγίνοις στέφος μέγα
ltx/gr_gr_cog/sy.m06.d08:syMA.commemoration05.couplet1.verse2	Ἐξηγόρασεν· ὢ συναλλαγῆς ξένης!
ltx/gr_gr_cog/sy.m06.d08:syMA.commemoration05.text	Τῇ αὐτῇ ἡμέρᾳ, ὁ Ἅγιος Νεομάρτυς Θεοφάνης, ὁ μαρτυρήσας ἐν Κωνστανινουπόλει κατὰ τὸ ἔτος 1559, ὀγγίνοις (ἤτοι τζεγγελίοις) τελειοῦται.
ltx/gr_gr_cog/sy.m06.d08:syMA.lastline	Ταῖς αὐτῶν ἀγίαις πρεσβείαις, Χριστὲ ὁ Θεός, ἐλέησον ἡμᾶς. Ἀμήν.
