ltx/gr_gr_cog/me.m09.d04:meDA.commemoration.first	Μνήμη τοῦ Ἁγίου Ἱερομάρτυρος Βαβύλα, Ἐπισκόπου Ἀντιοχείας
ltx/gr_gr_cog/me.m09.d04:meDA.commemoration.first_name	
ltx/gr_gr_cog/me.m09.d04:meDA.commemoration.first_short	Μνήμη τοῦ Ἁγίου Ἱερομάρτυρος Βαβύλα, Ἐπισκόπου Ἀντιοχείας
ltx/gr_gr_cog/me.m09.d04:meDA.commemoration.first_title	@ltx/gr_gr_cog/titles:ti.SaintM
ltx/gr_gr_cog/me.m09.d04:meDA.commemoration.full	Μνήμη τοῦ Ἁγίου Ἱερομάρτυρος Βαβύλα, Ἐπισκόπου Ἀντιοχείας, καὶ τοῦ Ἁγίου καὶ Θεόπτου Μωϋσέως τοῦ Προφήτου.
ltx/gr_gr_cog/me.m09.d04:meDA.commemoration.second_name	
ltx/gr_gr_cog/me.m09.d04:meDA.commemoration.second_title	
ltx/gr_gr_cog/me.m09.d04:meDA.date	Τῌ Δʹ ΣΕΠΤΕΜΒΡΙΟΥ
ltx/gr_gr_cog/me.m09.d04:meDA.fordate	διὰ τὴν 4ην Σεπτεμβρίου
ltx/gr_gr_cog/me.m09.d04:meDA.insert1	καὶ τοῦ Ἁγίου Ἱερομάρτυρος Βαβύλα, Ἐπισκόπου Ἀντιοχείας,
ltx/gr_gr_cog/me.m09.d04:meDA.insert2	οὗ καὶ τὴν μνήμην ἐπιτελοῦμεν·
ltx/gr_gr_cog/me.m09.d04:meDA.note	
ltx/gr_gr_cog/me.m09.d04:meDA.pdfcoverdate	τῆς 4ης Σεπτεμβρίου,
ltx/gr_gr_cog/me.m09.d04:meDA.pdfheaderdate	τῆς 4ης Σεπτεμβρίου
ltx/gr_gr_cog/me.m09.d04:meHO.commemorations	
ltx/gr_gr_cog/me.m09.d04:meHO.note1	
ltx/gr_gr_cog/me.m09.d04:meHO.note2	
ltx/gr_gr_cog/me.m09.d04:meHO.number	
ltx/gr_gr_cog/me.m09.d04:meHO.rank	
ltx/gr_gr_cog/me.m09.d04:meLE.commemoration1	Μνήμη τοῦ Ἁγίου Ἱερομάρτυρος Βαβύλα, Ἐπισκόπου Ἀντιοχείας.
ltx/gr_gr_cog/me.m09.d04:meLE.commemoration2	
ltx/gr_gr_cog/me.m09.d04:meLI.Kontakion1.greekmelody	@ltx/gr_gr_cog/me.m09.d04:meMA.Kontakion1.greekmelody
ltx/gr_gr_cog/me.m09.d04:meLI.Kontakion1.incipit	@ltx/gr_gr_cog/me.m09.d04:meMA.Kontakion1.incipit
ltx/gr_gr_cog/me.m09.d04:meLI.Kontakion1.melody	@ltx/gr_gr_cog/me.m09.d04:meMA.Kontakion1.melody
ltx/gr_gr_cog/me.m09.d04:meLI.Kontakion1.mode	@ltx/gr_gr_cog/me.m09.d04:meMA.Kontakion1.mode
ltx/gr_gr_cog/me.m09.d04:meLI.Kontakion1.text	@ltx/gr_gr_cog/me.m09.d04:meMA.Kontakion1.text
ltx/gr_gr_cog/me.m09.d04:meLI.MM.CommunionHymn.text	@ltx/gr_gr_cog/properties:media.key
ltx/gr_gr_cog/me.m09.d04:meLI.Megalynarion.text	
ltx/gr_gr_cog/me.m09.d04:meMA.C1.poet	Ποίημα Θεοφάνους. Οἱ δέ, Ἰωάννου Μοναχοῦ· ἀλλʼ οὐδετέρου τούτων δοκεῖ κάλαμος εἶναι.
ltx/gr_gr_cog/me.m09.d04:meMA.C1.title	@ltx/gr_gr_cog/titles:ti.CanonHieromartyr
ltx/gr_gr_cog/me.m09.d04:meMA.C1.verse	@ltx/gr_gr_cog/prayers:pr.verse_SaintM.text
ltx/gr_gr_cog/me.m09.d04:meMA.C2.acrostic.notice1	οὗ ἡ Ἀκροστιχίς·
ltx/gr_gr_cog/me.m09.d04:meMA.C2.acrostic.notice2	Ἐν δὲ τοῖς Θεοτοκίοις, Κλήμεντος.
ltx/gr_gr_cog/me.m09.d04:meMA.C2.acrostic.text	Μωσῆς Προφητῶν πρῶτος, αἰνείσθω λόγοις.
ltx/gr_gr_cog/me.m09.d04:meMA.C2.acrostic.title	Κανὼν του Προφήτου,
ltx/gr_gr_cog/me.m09.d04:meMA.C2.title	@ltx/gr_gr_cog/titles:ti.CanonProphet
ltx/gr_gr_cog/me.m09.d04:meMA.C2.verse	@ltx/gr_gr_cog/prayers:pr.verse_Prophet.text
ltx/gr_gr_cog/me.m09.d04:meMA.ExapTheotokion.incipit	Τοὺς μὴ τὴν σὴν εἰκόνα…
ltx/gr_gr_cog/me.m09.d04:meMA.ExapTheotokion.melody	@ltx/gr_gr_cog/he.a.m3:heAU.OOuranonToisAstrois.name
ltx/gr_gr_cog/me.m09.d04:meMA.ExapTheotokion.mode	@ltx/gr_gr_cog/miscellanea:misc.Mode3
ltx/gr_gr_cog/me.m09.d04:meMA.ExapTheotokion.text	Τοὺς μὴ τὴν σὴν εἰκόνα, Παρθένε ἀσπαζομένους, καὶ τοῦ Υἱοῦ καὶ Θεοῦ σου, ἐκ πίστεως εἰλικρινοῦς, κατάβαλε ὡς ἀθέους, καὶ τῇ γεέννῃ παράδος.
ltx/gr_gr_cog/me.m09.d04:meMA.Exaposteilarion1.greekmelody	@ltx/gr_gr_cog/he.a.m3:heAU.OOuranonToisAstrois.greekname
ltx/gr_gr_cog/me.m09.d04:meMA.Exaposteilarion1.incipit	Θύτης ὁμοῦ καὶ θῦμα, Βαβύλα…
ltx/gr_gr_cog/me.m09.d04:meMA.Exaposteilarion1.melody	@ltx/gr_gr_cog/he.a.m3:heAU.OOuranonToisAstrois.name
ltx/gr_gr_cog/me.m09.d04:meMA.Exaposteilarion1.mode	@ltx/gr_gr_cog/miscellanea:misc.Mode3
ltx/gr_gr_cog/me.m09.d04:meMA.Exaposteilarion1.text	Θύτης ὁμοῦ καὶ θῦμα, Βαβύλα ὤφθης τοῦ Θεοῦ, θύων αὐτῷ ἀναιμάκτως, καὶ σοῖς ἐν αἵμασι τυθείς, σὺν τοῖς τελείοις νηπίοις, μεθʼ ὧν σε ἀνευφημοῦμεν.
ltx/gr_gr_cog/me.m09.d04:meMA.Kontakion1.greekmelody	@ltx/gr_gr_cog/he.a.m8:heAU.OsAparchas.greekname
ltx/gr_gr_cog/me.m09.d04:meMA.Kontakion1.incipit	Ὡς εὐσεβείας κήρυκα…
ltx/gr_gr_cog/me.m09.d04:meMA.Kontakion1.melody	@ltx/gr_gr_cog/he.a.m8:heAU.OsAparchas.name
ltx/gr_gr_cog/me.m09.d04:meMA.Kontakion1.mode	@ltx/gr_gr_cog/miscellanea:misc.Mode8
ltx/gr_gr_cog/me.m09.d04:meMA.Kontakion1.text	Ὡς εὐσεβείας κήρυκα, καὶ ἀθλητῶν ἑδραίωμα, ἡ Ἐκκλησία δοξάζει σε ἔνδοξε, λαμπρυνομένη σήμερον· ἀλλʼ ὡς ἔχων παῤῥησίαν, ἐν εἰρήνῃ τελείᾳ, τοὺς ἀνυμνοῦντάς σε, τὸν Χριστὸν φυλαχθῆναι δυσώπησον, ὦ Πολύαθλε.
ltx/gr_gr_cog/me.m09.d04:meMA.Ode1C11.greekmelody	@ltx/gr_gr_cog/he.h.m6:heHE.OsEnIpeiroPezefsas.greekname
ltx/gr_gr_cog/me.m09.d04:meMA.Ode1C11.incipit	Τὴν τῶν οἰκείων…
ltx/gr_gr_cog/me.m09.d04:meMA.Ode1C11.melody	@ltx/gr_gr_cog/he.h.m6:heHE.OsEnIpeiroPezefsas.name
ltx/gr_gr_cog/me.m09.d04:meMA.Ode1C11.mode	@ltx/gr_gr_cog/miscellanea:misc.Mode6
ltx/gr_gr_cog/me.m09.d04:meMA.Ode1C11.ode	@ltx/gr_gr_cog/miscellanea:misc.Ode1
ltx/gr_gr_cog/me.m09.d04:meMA.Ode1C11.text	Τὴν τῶν οἰκείων αἱμάτων ὡς Μωϋσῆς, ἐρυθραίαν θάλασσαν, ἀκυμάντως διελθών, Βαβύλα μακάριε Θεῷ, ἐπινίκιον ᾠδήν, ἐβόας ᾄσωμεν.
ltx/gr_gr_cog/me.m09.d04:meMA.Ode1C12.incipit	Σὺ τῶν γηΐνων…
ltx/gr_gr_cog/me.m09.d04:meMA.Ode1C12.melody	@ltx/gr_gr_cog/he.h.m6:heHE.OsEnIpeiroPezefsas.name
ltx/gr_gr_cog/me.m09.d04:meMA.Ode1C12.mode	@ltx/gr_gr_cog/miscellanea:misc.Mode6
ltx/gr_gr_cog/me.m09.d04:meMA.Ode1C12.ode	@ltx/gr_gr_cog/miscellanea:misc.Ode1
ltx/gr_gr_cog/me.m09.d04:meMA.Ode1C12.text	Σὺ τῶν γηΐνων τὸν πόθον τῷ θεϊκῷ, ὑποτάξας ἔρωτι, κατεφρόνησας τοῦ ζῆν, Βαβύλα μακάριε Χριστοῦ, ἐπειγόμενος ἰδεῖν τὴν ὡραιότητα.
ltx/gr_gr_cog/me.m09.d04:meMA.Ode1C13.incipit	Τῆς ὑπερθέου Τριάδος…
ltx/gr_gr_cog/me.m09.d04:meMA.Ode1C13.melody	@ltx/gr_gr_cog/he.h.m6:heHE.OsEnIpeiroPezefsas.name
ltx/gr_gr_cog/me.m09.d04:meMA.Ode1C13.mode	@ltx/gr_gr_cog/miscellanea:misc.Mode6
ltx/gr_gr_cog/me.m09.d04:meMA.Ode1C13.ode	@ltx/gr_gr_cog/miscellanea:misc.Ode1
ltx/gr_gr_cog/me.m09.d04:meMA.Ode1C13.text	Τῆς ὑπερθέου Τριάδος ὡς ἐραστής, τοῖς τρισὶ συνέθανες, ἀγαλλόμενος παισί, Βαβύλα μακάριε τὴν σήν, προϊέμενος ψυχήν, τῷ ταύτης ἔρωτι.
ltx/gr_gr_cog/me.m09.d04:meMA.Ode1C1T.incipit	Τὸν σεαυτῆς τετοκυῖα…
ltx/gr_gr_cog/me.m09.d04:meMA.Ode1C1T.melody	@ltx/gr_gr_cog/he.h.m6:heHE.OsEnIpeiroPezefsas.name
ltx/gr_gr_cog/me.m09.d04:meMA.Ode1C1T.mode	@ltx/gr_gr_cog/miscellanea:misc.Mode6
ltx/gr_gr_cog/me.m09.d04:meMA.Ode1C1T.ode	@ltx/gr_gr_cog/miscellanea:misc.Ode1
ltx/gr_gr_cog/me.m09.d04:meMA.Ode1C1T.text	Τὸν σεαυτῆς τετοκυῖα Δημιουργόν, ὡς αὐτὸς ἠθέλησεν, ἐξ ἀσπόρου σου γαστρός, ὑπὲρ νοῦν σαρκούμενον Ἁγνή, τῶν κτισμάτων ἀληθῶς ἐδείχθης Δέσποινα.
ltx/gr_gr_cog/me.m09.d04:meMA.Ode1C21.greekmelody	@ltx/gr_gr_cog/he.h.m4:heHE.ThalassisToErythraion.greekname
ltx/gr_gr_cog/me.m09.d04:meMA.Ode1C21.incipit	Μωσῆς Προφητῶν αἰνείσθω πρότερος, ὡς…
ltx/gr_gr_cog/me.m09.d04:meMA.Ode1C21.melody	@ltx/gr_gr_cog/he.h.m4:heHE.ThalassisToErythraion.name
ltx/gr_gr_cog/me.m09.d04:meMA.Ode1C21.mode	@ltx/gr_gr_cog/miscellanea:misc.Mode4
ltx/gr_gr_cog/me.m09.d04:meMA.Ode1C21.ode	@ltx/gr_gr_cog/miscellanea:misc.Ode1
ltx/gr_gr_cog/me.m09.d04:meMA.Ode1C21.text	Μωσῆς Προφητῶν αἰνείσθω πρότερος, ὡς ἐνωπίῳ Θεῷ, συνομιλήσας πρῶτος ἐμφανῶς, ἐν προσώπῳ πρὸς πρόσωπον, οὐκ αἰνιγμάτων φάσμασιν, ἀλλʼ ὡς ἐν εἴδει σαρκός βλέψας αὐτόν.
ltx/gr_gr_cog/me.m09.d04:meMA.Ode1C22.incipit	Ὡς θεῖον δημαγωγὸν καὶ ῥύστην…
ltx/gr_gr_cog/me.m09.d04:meMA.Ode1C22.melody	@ltx/gr_gr_cog/he.h.m4:heHE.ThalassisToErythraion.name
ltx/gr_gr_cog/me.m09.d04:meMA.Ode1C22.mode	@ltx/gr_gr_cog/miscellanea:misc.Mode4
ltx/gr_gr_cog/me.m09.d04:meMA.Ode1C22.ode	@ltx/gr_gr_cog/miscellanea:misc.Ode1
ltx/gr_gr_cog/me.m09.d04:meMA.Ode1C22.text	Ὡς θεῖον δημαγωγὸν καὶ ῥύστην σε, τοῦ συγγενοῦς Ἰσραήλ, Μωσῆ θεόπτα δέδωκε Θεός, τῷ πατρὶ ὥσπερ ηὔξατο, ἐπαγγελίας ῥήματι, προμυηθέντι σου τὴν γέννησιν.
ltx/gr_gr_cog/me.m09.d04:meMA.Ode1C23.incipit	Σοφίας σε θησαυρὸν ἐφεύραντο, αἱ…
ltx/gr_gr_cog/me.m09.d04:meMA.Ode1C23.melody	@ltx/gr_gr_cog/he.h.m4:heHE.ThalassisToErythraion.name
ltx/gr_gr_cog/me.m09.d04:meMA.Ode1C23.mode	@ltx/gr_gr_cog/miscellanea:misc.Mode4
ltx/gr_gr_cog/me.m09.d04:meMA.Ode1C23.ode	@ltx/gr_gr_cog/miscellanea:misc.Ode1
ltx/gr_gr_cog/me.m09.d04:meMA.Ode1C23.text	Σοφίας σε θησαυρὸν ἐφεύραντο, αἱ γενικαὶ ἀρεταί, ἐγκεκρυμμένον γνώσει τοῦ Θεοῦ, ὡς ἐν Θήβῃ Θεόπτα, Μωσῆ· διό σε ἀνεθρέψατο, ἡ βασιλὶς καὶ θεία πρόνοια.
ltx/gr_gr_cog/me.m09.d04:meMA.Ode1C24.incipit	Ἠρνήσω θεοπτικῶς Πανεύφημε, ἐκ βρέφους…
ltx/gr_gr_cog/me.m09.d04:meMA.Ode1C24.melody	@ltx/gr_gr_cog/he.h.m4:heHE.ThalassisToErythraion.name
ltx/gr_gr_cog/me.m09.d04:meMA.Ode1C24.mode	@ltx/gr_gr_cog/miscellanea:misc.Mode4
ltx/gr_gr_cog/me.m09.d04:meMA.Ode1C24.ode	@ltx/gr_gr_cog/miscellanea:misc.Ode1
ltx/gr_gr_cog/me.m09.d04:meMA.Ode1C24.text	Ἠρνήσω θεοπτικῶς Πανεύφημε, ἐκ βρέφους πᾶσαν θηλήν, τῷ δὲ γνησίῳ γάλακτι τραφείς, προεδήλους σαφέστατα, τῆς πρὸς Θεὸν ἐγγύτητος, τὸ ὑπεραῖρόν σου ἀξίωμα.
ltx/gr_gr_cog/me.m09.d04:meMA.Ode1C2T.incipit	Κατέπτηξε ἰδὼν Μωσῆς παράδοξον, ἐν…
ltx/gr_gr_cog/me.m09.d04:meMA.Ode1C2T.melody	@ltx/gr_gr_cog/he.h.m4:heHE.ThalassisToErythraion.name
ltx/gr_gr_cog/me.m09.d04:meMA.Ode1C2T.mode	@ltx/gr_gr_cog/miscellanea:misc.Mode4
ltx/gr_gr_cog/me.m09.d04:meMA.Ode1C2T.ode	@ltx/gr_gr_cog/miscellanea:misc.Ode1
ltx/gr_gr_cog/me.m09.d04:meMA.Ode1C2T.text	Κατέπτηξε ἰδὼν Μωσῆς παράδοξον, ἐν πρώτοις θέαμα, βάτον καὶ φλόγα, ξένην συμπλοκήν, τὸν Θεὸν ἐκ Παρθένου Μητρός, προζωγραφοῦσαν ἄφθαρτον, ὃν διαβὰς τοὺς χρόνους εἶδε σαρκί.
ltx/gr_gr_cog/me.m09.d04:meMA.Ode3C11.greekmelody	@ltx/gr_gr_cog/he.h.m6:heHE.OukEstinAgios.greekname
ltx/gr_gr_cog/me.m09.d04:meMA.Ode3C11.incipit	Οὐκ ἔστιν Ἅγιος…
ltx/gr_gr_cog/me.m09.d04:meMA.Ode3C11.melody	@ltx/gr_gr_cog/he.h.m6:heHE.OukEstinAgios.name
ltx/gr_gr_cog/me.m09.d04:meMA.Ode3C11.mode	@ltx/gr_gr_cog/miscellanea:misc.Mode6
ltx/gr_gr_cog/me.m09.d04:meMA.Ode3C11.ode	@ltx/gr_gr_cog/miscellanea:misc.Ode3
ltx/gr_gr_cog/me.m09.d04:meMA.Ode3C11.text	Οὐκ ἔστιν Ἅγιος ὡς σύ, Κύριε ὁ Θεός μου, ὁ ὑψώσας τὸ κέρας σοῦ Βαβύλα τοῦ πιστοῦ, καὶ στεφανώσας αὐτόν, τῷ στεφάνῳ τῆς ὁμολογίας σου.
ltx/gr_gr_cog/me.m09.d04:meMA.Ode3C12.incipit	Μαρτύρων γέγονεν ἰσχύς…
ltx/gr_gr_cog/me.m09.d04:meMA.Ode3C12.melody	@ltx/gr_gr_cog/he.h.m6:heHE.OukEstinAgios.name
ltx/gr_gr_cog/me.m09.d04:meMA.Ode3C12.mode	@ltx/gr_gr_cog/miscellanea:misc.Mode6
ltx/gr_gr_cog/me.m09.d04:meMA.Ode3C12.ode	@ltx/gr_gr_cog/miscellanea:misc.Ode3
ltx/gr_gr_cog/me.m09.d04:meMA.Ode3C12.text	Μαρτύρων γέγονεν ἰσχύς, Κύριε ὁ Σταυρός σου, στερεώσας τοὺς παῖδας, σὺν Βαβύλᾳ τῷ κλεινῷ, καὶ καθελὼν διʼ αὐτῶν, τὰ τῆς πλάνης ἄθεα φρυάγματα.
ltx/gr_gr_cog/me.m09.d04:meMA.Ode3C13.incipit	Ἰσχὺς ἐξέλιπε Χριστέ…
ltx/gr_gr_cog/me.m09.d04:meMA.Ode3C13.melody	@ltx/gr_gr_cog/he.h.m6:heHE.OukEstinAgios.name
ltx/gr_gr_cog/me.m09.d04:meMA.Ode3C13.mode	@ltx/gr_gr_cog/miscellanea:misc.Mode6
ltx/gr_gr_cog/me.m09.d04:meMA.Ode3C13.ode	@ltx/gr_gr_cog/miscellanea:misc.Ode3
ltx/gr_gr_cog/me.m09.d04:meMA.Ode3C13.text	Ἰσχὺς ἐξέλιπε Χριστέ, διαβόλου εἰς τέλος· τοῖς ἀκάκοις παισὶ γὰρ καὶ Βαβύλᾳ τῷ κλεινῷ, ἡττᾶται ὁ ἰσχυρός, καὶ γελᾶται ὑπʼ αὐτῶν παιζόμενος.
ltx/gr_gr_cog/me.m09.d04:meMA.Ode3C1T.incipit	Ἰσχύς μου ὕμνησις…
ltx/gr_gr_cog/me.m09.d04:meMA.Ode3C1T.melody	@ltx/gr_gr_cog/he.h.m6:heHE.OukEstinAgios.name
ltx/gr_gr_cog/me.m09.d04:meMA.Ode3C1T.mode	@ltx/gr_gr_cog/miscellanea:misc.Mode6
ltx/gr_gr_cog/me.m09.d04:meMA.Ode3C1T.ode	@ltx/gr_gr_cog/miscellanea:misc.Ode3
ltx/gr_gr_cog/me.m09.d04:meMA.Ode3C1T.text	Ἰσχύς μου ὕμνησις Χριστός, ὁ ἐκ σοῦ ἀνατείλας, περικείμενος σάρκα, Θεοτόκε δουλικήν, καὶ ἐκ δουλείας ἡμᾶς, διαβόλου σῴζων ἀγαθότητι.
ltx/gr_gr_cog/me.m09.d04:meMA.Ode3C21.greekmelody	@ltx/gr_gr_cog/he.h.m4:heHE.ToxonDynatonIsthenise.greekname
ltx/gr_gr_cog/me.m09.d04:meMA.Ode3C21.incipit	Ὅλως τῆς ἀῤῥήτου γνώσεως, ἐπλήσθης…
ltx/gr_gr_cog/me.m09.d04:meMA.Ode3C21.melody	@ltx/gr_gr_cog/he.h.m4:heHE.ToxonDynatonIsthenise.name
ltx/gr_gr_cog/me.m09.d04:meMA.Ode3C21.mode	@ltx/gr_gr_cog/miscellanea:misc.Mode4
ltx/gr_gr_cog/me.m09.d04:meMA.Ode3C21.ode	@ltx/gr_gr_cog/miscellanea:misc.Ode3
ltx/gr_gr_cog/me.m09.d04:meMA.Ode3C21.text	Ὅλως τῆς ἀῤῥήτου γνώσεως, ἐπλήσθης θεόπτα· τὸ γὰρ Πνεῦμα τὸ Πανάγιον, διʼ Ἀγγέλου τὴν τῶν ἀρχαίων, ἐμυήσατό σε γνῶσιν τρανῶς.
ltx/gr_gr_cog/me.m09.d04:meMA.Ode3C22.incipit	Φέρων τηλαυγῶς τὰς θείας αὐγάς…
ltx/gr_gr_cog/me.m09.d04:meMA.Ode3C22.melody	@ltx/gr_gr_cog/he.h.m4:heHE.ToxonDynatonIsthenise.name
ltx/gr_gr_cog/me.m09.d04:meMA.Ode3C22.mode	@ltx/gr_gr_cog/miscellanea:misc.Mode4
ltx/gr_gr_cog/me.m09.d04:meMA.Ode3C22.ode	@ltx/gr_gr_cog/miscellanea:misc.Ode3
ltx/gr_gr_cog/me.m09.d04:meMA.Ode3C22.text	Φέρων τηλαυγῶς τὰς θείας αὐγάς, ταῖς θεοσημείαις, κατέπληττες Αἴγυπτον, μεταβάλλων τὴν τῶν στοιχείων, παραδόξως φύσιν Πάνσοφε.
ltx/gr_gr_cog/me.m09.d04:meMA.Ode3C23.incipit	Ηὔγει τὸ ὡραῖον κάλος σου…
ltx/gr_gr_cog/me.m09.d04:meMA.Ode3C23.melody	@ltx/gr_gr_cog/he.h.m4:heHE.ToxonDynatonIsthenise.name
ltx/gr_gr_cog/me.m09.d04:meMA.Ode3C23.mode	@ltx/gr_gr_cog/miscellanea:misc.Mode4
ltx/gr_gr_cog/me.m09.d04:meMA.Ode3C23.ode	@ltx/gr_gr_cog/miscellanea:misc.Ode3
ltx/gr_gr_cog/me.m09.d04:meMA.Ode3C23.text	Ηὔγει τὸ ὡραῖον κάλος σου, τὴν ἐκ θείας σου αἴγλης, λαμπρὰν ἀστειότητα, καὶ πρὸς θείαν ἀπλήστως πάντας, ἐπεσπάσω ὡραιότητα.
ltx/gr_gr_cog/me.m09.d04:meMA.Ode3C2T.incipit	Ἤχθης τοῦ φρικτοῦ ὁράματος, πρὸς…
ltx/gr_gr_cog/me.m09.d04:meMA.Ode3C2T.melody	@ltx/gr_gr_cog/he.h.m4:heHE.ToxonDynatonIsthenise.name
ltx/gr_gr_cog/me.m09.d04:meMA.Ode3C2T.mode	@ltx/gr_gr_cog/miscellanea:misc.Mode4
ltx/gr_gr_cog/me.m09.d04:meMA.Ode3C2T.ode	@ltx/gr_gr_cog/miscellanea:misc.Ode3
ltx/gr_gr_cog/me.m09.d04:meMA.Ode3C2T.text	Ἤχθης τοῦ φρικτοῦ ὁράματος, πρὸς ἐκστατικὴν κατανόησιν Πάνσοφε, ἀλλʼ ἐσχέθης φωνῇ Κυρίου, τοῦ τεχθέντος ἐκ Παρθένου σαρκί.
ltx/gr_gr_cog/me.m09.d04:meMA.Ode3H.greekmelody	@ltx/gr_gr_cog/he.h.m4:heHE.ToxonDynatonIsthenise.greekname
ltx/gr_gr_cog/me.m09.d04:meMA.Ode3H.incipit	@ltx/gr_gr_cog/he.h.m4:heHE.ToxonDynatonIsthenise.incipit
ltx/gr_gr_cog/me.m09.d04:meMA.Ode3H.melody	@ltx/gr_gr_cog/he.h.m4:heHE.ToxonDynatonIsthenise.melody
ltx/gr_gr_cog/me.m09.d04:meMA.Ode3H.mode	@ltx/gr_gr_cog/miscellanea:misc.Mode4
ltx/gr_gr_cog/me.m09.d04:meMA.Ode3H.ode	@ltx/gr_gr_cog/miscellanea:misc.Ode3
ltx/gr_gr_cog/me.m09.d04:meMA.Ode3H.text	@ltx/gr_gr_cog/he.h.m4:heHE.ToxonDynatonIsthenise.text
ltx/gr_gr_cog/me.m09.d04:meMA.Ode3Kathisma1.greekmelody	@ltx/gr_gr_cog/he.a.m3:heAU.TheiasPisteos.greekname
ltx/gr_gr_cog/me.m09.d04:meMA.Ode3Kathisma1.incipit	Ζέων πίστεως…
ltx/gr_gr_cog/me.m09.d04:meMA.Ode3Kathisma1.melody	@ltx/gr_gr_cog/he.a.m3:heAU.TheiasPisteos.name
ltx/gr_gr_cog/me.m09.d04:meMA.Ode3Kathisma1.mode	@ltx/gr_gr_cog/miscellanea:misc.Mode3
ltx/gr_gr_cog/me.m09.d04:meMA.Ode3Kathisma1.text	Ζέων πίστεως ὁμολογίᾳ, πλάνης ἔσβεσας κακοδοξίαν, στηλιτεύσας τῶν εἰδώλων τὸ ἄθεον· καὶ ὁλοκαύτωμα θεῖον γενόμενος, θαυματουργίαις δροσίζεις τὰ πέρατα. Πάτερ Ὅσιε, Χριστὸν τὸν Θεὸν ἱκέτευε, δωρήσασθαι ἡμῖν τὸ μέγα ἔλεος.
ltx/gr_gr_cog/me.m09.d04:meMA.Ode3Kathisma2.greekmelody	@ltx/gr_gr_cog/he.a.m4:heAU.EpefanisSimeron.greekname
ltx/gr_gr_cog/me.m09.d04:meMA.Ode3Kathisma2.incipit	Προφητῶν ἁπάντων σε, πρῶτον ὡς…
ltx/gr_gr_cog/me.m09.d04:meMA.Ode3Kathisma2.melody	@ltx/gr_gr_cog/he.a.m4:heAU.EpefanisSimeron.name
ltx/gr_gr_cog/me.m09.d04:meMA.Ode3Kathisma2.mode	@ltx/gr_gr_cog/miscellanea:misc.Mode4
ltx/gr_gr_cog/me.m09.d04:meMA.Ode3Kathisma2.text	Προφητῶν ἁπάντων σε, πρῶτον ὡς ὄντα, εὐσεβῶς γινώσκοντες, ἀνευφημοῦμεν οἱ πιστοί· πρῶτος Θεὸν γὰρ ἑώρακας, ὡς δυνατὸν ἦν, ἀνθρώπῳ θεάσασθαι.
ltx/gr_gr_cog/me.m09.d04:meMA.Ode3KathismaSt.incipit	Ἐπὶ ξύλου βλέπουσα, ἀναρτηθέντα, τὸν…
ltx/gr_gr_cog/me.m09.d04:meMA.Ode3KathismaSt.melody	@ltx/gr_gr_cog/he.a.m4:heAU.EpefanisSimeron.name
ltx/gr_gr_cog/me.m09.d04:meMA.Ode3KathismaSt.mode	@ltx/gr_gr_cog/miscellanea:misc.Mode4
ltx/gr_gr_cog/me.m09.d04:meMA.Ode3KathismaSt.text	Ἐπὶ ξύλου βλέπουσα, ἀναρτηθέντα, τὸν Υιόν σου Πάναγνε, σπλάγχνα μητρῷα γοερῶς, σπαρασσομένη ἐκραύγαζες, Οἴμοι! πῶς ἔδυς, τὸ φῶς μου τὸ ἄχρονον.
ltx/gr_gr_cog/me.m09.d04:meMA.Ode3KathismaT.incipit	Τὴν θερμὴν ἀντίληψιν, τῶν ἐν…
ltx/gr_gr_cog/me.m09.d04:meMA.Ode3KathismaT.melody	@ltx/gr_gr_cog/he.a.m4:heAU.EpefanisSimeron.name
ltx/gr_gr_cog/me.m09.d04:meMA.Ode3KathismaT.mode	@ltx/gr_gr_cog/miscellanea:misc.Mode4
ltx/gr_gr_cog/me.m09.d04:meMA.Ode3KathismaT.text	Τὴν θερμὴν ἀντίληψιν, τῶν ἐν ἀνάγκαις, τὴν ἡμῶν βοήθειαν, καὶ πρὸς Θεὸν καταλλαγήν, διʼ ἧς φθορᾶς ἐλυτρώθημεν, τὴν Θεοτόκον πιστοὶ μακαρίσωμεν.
ltx/gr_gr_cog/me.m09.d04:meMA.Ode4C11.greekmelody	@ltx/gr_gr_cog/he.h.m6:heHE.ChristosMouDynamis.greekname
ltx/gr_gr_cog/me.m09.d04:meMA.Ode4C11.incipit	Χριστός μου δύναμις…
ltx/gr_gr_cog/me.m09.d04:meMA.Ode4C11.melody	@ltx/gr_gr_cog/he.h.m6:heHE.ChristosMouDynamis.name
ltx/gr_gr_cog/me.m09.d04:meMA.Ode4C11.mode	@ltx/gr_gr_cog/miscellanea:misc.Mode6
ltx/gr_gr_cog/me.m09.d04:meMA.Ode4C11.ode	@ltx/gr_gr_cog/miscellanea:misc.Ode4
ltx/gr_gr_cog/me.m09.d04:meMA.Ode4C11.text	Χριστός μου δύναμις, Θεὸς καὶ Κύριος, πρὸ βημάτων ἐβόας τυραννικῶν, ἀπειλαῖς ἀπτόητος, Ἱερομάρτυς Βαβύλα, ἐν Κυρίῳ ἀγαλλόμενος.
ltx/gr_gr_cog/me.m09.d04:meMA.Ode4C12.incipit	Θυσίαν ἄμωμον…
ltx/gr_gr_cog/me.m09.d04:meMA.Ode4C12.melody	@ltx/gr_gr_cog/he.h.m6:heHE.ChristosMouDynamis.name
ltx/gr_gr_cog/me.m09.d04:meMA.Ode4C12.mode	@ltx/gr_gr_cog/miscellanea:misc.Mode6
ltx/gr_gr_cog/me.m09.d04:meMA.Ode4C12.ode	@ltx/gr_gr_cog/miscellanea:misc.Ode4
ltx/gr_gr_cog/me.m09.d04:meMA.Ode4C12.text	Θυσίαν ἄμωμον, φρικτὴν ἀναίμακτον, τῷ Κυρίῳ προσφέρων, καὶ σεαυτόν, σφάγιον διʼ αἵματος, Ἱερομάρτυς Βαβύλα, ἀκηλίδωτον προσήγαγες.
ltx/gr_gr_cog/me.m09.d04:meMA.Ode4C13.incipit	Τῶν παίδων Ὅσιε…
ltx/gr_gr_cog/me.m09.d04:meMA.Ode4C13.melody	@ltx/gr_gr_cog/he.h.m6:heHE.ChristosMouDynamis.name
ltx/gr_gr_cog/me.m09.d04:meMA.Ode4C13.mode	@ltx/gr_gr_cog/miscellanea:misc.Mode6
ltx/gr_gr_cog/me.m09.d04:meMA.Ode4C13.ode	@ltx/gr_gr_cog/miscellanea:misc.Ode4
ltx/gr_gr_cog/me.m09.d04:meMA.Ode4C13.text	Τῶν παίδων Ὅσιε, τὸ νέον φρόνημα, ὡς σοφὸς παιδοτρίβης πνευματικῷ, ἀποτρέφων γάλακτι, Ἱερομάρτυς Βαβύλα, εἰς τελείωσιν κατήρτισας.
ltx/gr_gr_cog/me.m09.d04:meMA.Ode4C1T.incipit	Ναὸν πανάγιον…
ltx/gr_gr_cog/me.m09.d04:meMA.Ode4C1T.melody	@ltx/gr_gr_cog/he.h.m6:heHE.ChristosMouDynamis.name
ltx/gr_gr_cog/me.m09.d04:meMA.Ode4C1T.mode	@ltx/gr_gr_cog/miscellanea:misc.Mode6
ltx/gr_gr_cog/me.m09.d04:meMA.Ode4C1T.ode	@ltx/gr_gr_cog/miscellanea:misc.Ode4
ltx/gr_gr_cog/me.m09.d04:meMA.Ode4C1T.text	Ναὸν πανάγιον, Θεοῦ γινώσκοντες, σὲ τὴν ἄσπιλον μόνην, καὶ τῶν πιστῶν, πάντων ὑπερέχουσαν, ἱερωτάταις σε φωναῖς, Θεοτόκε μακαρίζομεν.
ltx/gr_gr_cog/me.m09.d04:meMA.Ode4C21.greekmelody	@ltx/gr_gr_cog/he.h.m4:heHE.EparthentaSeIdousa.greekname
ltx/gr_gr_cog/me.m09.d04:meMA.Ode4C21.incipit	Τῆς ἰσχνότητος τῆς γλώττης καὶ…
ltx/gr_gr_cog/me.m09.d04:meMA.Ode4C21.melody	@ltx/gr_gr_cog/he.h.m4:heHE.EparthentaSeIdousa.name
ltx/gr_gr_cog/me.m09.d04:meMA.Ode4C21.mode	@ltx/gr_gr_cog/miscellanea:misc.Mode4
ltx/gr_gr_cog/me.m09.d04:meMA.Ode4C21.ode	@ltx/gr_gr_cog/miscellanea:misc.Ode4
ltx/gr_gr_cog/me.m09.d04:meMA.Ode4C21.text	Τῆς ἰσχνότητος τῆς γλώττης καὶ τῆς φωνῆς σου, διαμειφθείσης θείᾳ προνοίᾳ θεόπτα, φρικτῶν μυστηρίων Θεοῦ, ἐδείχθης διάκονος, καὶ πληγαῖς ἐμάστιξας Αἴγυπτον.
ltx/gr_gr_cog/me.m09.d04:meMA.Ode4C22.incipit	Ὡς παράδοξος ἡ κλῆσίς σου…
ltx/gr_gr_cog/me.m09.d04:meMA.Ode4C22.melody	@ltx/gr_gr_cog/he.h.m4:heHE.EparthentaSeIdousa.name
ltx/gr_gr_cog/me.m09.d04:meMA.Ode4C22.mode	@ltx/gr_gr_cog/miscellanea:misc.Mode4
ltx/gr_gr_cog/me.m09.d04:meMA.Ode4C22.ode	@ltx/gr_gr_cog/miscellanea:misc.Ode4
ltx/gr_gr_cog/me.m09.d04:meMA.Ode4C22.text	Ὡς παράδοξος ἡ κλῆσίς σου ὦ θεόπτα, ὡς φοβερὰ τὰ ἔργα τῶν σῶν τεραστίων! ὦπται γὰρ ὁ ὤν σοι Θεός, καὶ δόξῃ ὑψώσας σε,, Ἰσραὴλ Σωτῆρα ἀπέστειλε.
ltx/gr_gr_cog/me.m09.d04:meMA.Ode4C23.incipit	Νομοθέτην παραδόξων καὶ δυσεφίκτων, τοῦ…
ltx/gr_gr_cog/me.m09.d04:meMA.Ode4C23.melody	@ltx/gr_gr_cog/he.h.m4:heHE.EparthentaSeIdousa.name
ltx/gr_gr_cog/me.m09.d04:meMA.Ode4C23.mode	@ltx/gr_gr_cog/miscellanea:misc.Mode4
ltx/gr_gr_cog/me.m09.d04:meMA.Ode4C23.ode	@ltx/gr_gr_cog/miscellanea:misc.Ode4
ltx/gr_gr_cog/me.m09.d04:meMA.Ode4C23.text	Νομοθέτην παραδόξων καὶ δυσεφίκτων, τοῦ Θεοῦ διδαγμάτων, ὑμνοῦντές σε πίστει, κράζομεν θεόπτα Μωσῆ· Τὴν ἵλεων αἴτησαι, τοῦ Θεοῦ ἡμῖν θείαν δύναμιν.
ltx/gr_gr_cog/me.m09.d04:meMA.Ode4C24.incipit	Πᾶν πρωτότοκον ἐπάταξας τῆς Αἰγύπτου…
ltx/gr_gr_cog/me.m09.d04:meMA.Ode4C24.melody	@ltx/gr_gr_cog/he.h.m4:heHE.EparthentaSeIdousa.name
ltx/gr_gr_cog/me.m09.d04:meMA.Ode4C24.mode	@ltx/gr_gr_cog/miscellanea:misc.Mode4
ltx/gr_gr_cog/me.m09.d04:meMA.Ode4C24.ode	@ltx/gr_gr_cog/miscellanea:misc.Ode4
ltx/gr_gr_cog/me.m09.d04:meMA.Ode4C24.text	Πᾶν πρωτότοκον ἐπάταξας τῆς Αἰγύπτου, ὡς ὁ Χριστὸς δαιμόνων ἐνέκρωσε κράτος, τύπος γάρ· τοῦ μέλλοντος, τὰ σοὶ ἐνεργούμενα, ἀληθῶς ὑπῆρχον Ἀοίδιμε.
ltx/gr_gr_cog/me.m09.d04:meMA.Ode4C2T.incipit	Μὴ ἐγγίσῃς ἐν τοῖς ὧδε…
ltx/gr_gr_cog/me.m09.d04:meMA.Ode4C2T.melody	@ltx/gr_gr_cog/he.h.m4:heHE.EparthentaSeIdousa.name
ltx/gr_gr_cog/me.m09.d04:meMA.Ode4C2T.mode	@ltx/gr_gr_cog/miscellanea:misc.Mode4
ltx/gr_gr_cog/me.m09.d04:meMA.Ode4C2T.ode	@ltx/gr_gr_cog/miscellanea:misc.Ode4
ltx/gr_gr_cog/me.m09.d04:meMA.Ode4C2T.text	Μὴ ἐγγίσῃς ἐν τοῖς ὧδε, Μωσῆς ἀκούσας, Θεοῦ φωνῆς βοώσης, ἐκ φλογὸς καὶ τῆς βάτου· ἅγιος ὁ τόπος γάρ, εἰκότως προέγραψεν, ἐν σαρκὶ τεχθήσεσθαι Χριστὸν ἐξ Ἁγνῆς.
ltx/gr_gr_cog/me.m09.d04:meMA.Ode5C11.greekmelody	@ltx/gr_gr_cog/he.h.m6:heHE.ToTheioFengeiSou.greekname
ltx/gr_gr_cog/me.m09.d04:meMA.Ode5C11.incipit	Τὴν θείαν χάριν σου…
ltx/gr_gr_cog/me.m09.d04:meMA.Ode5C11.melody	@ltx/gr_gr_cog/he.h.m6:heHE.ToTheioFengeiSou.name
ltx/gr_gr_cog/me.m09.d04:meMA.Ode5C11.mode	@ltx/gr_gr_cog/miscellanea:misc.Mode6
ltx/gr_gr_cog/me.m09.d04:meMA.Ode5C11.ode	@ltx/gr_gr_cog/miscellanea:misc.Ode5
ltx/gr_gr_cog/me.m09.d04:meMA.Ode5C11.text	Τὴν θείαν χάριν σου Ἰησοῦ, ὁ Ἱερομάρτυς Βαβύλας, ὄντως ἐξ ὕψους ἐδέξατο, ὡς καὶ παῖδας νέους, πρὸς σὴν ἀγάπησιν, ἀλείφειν καὶ θανάτου πρὸς καταφρόνησιν.
ltx/gr_gr_cog/me.m09.d04:meMA.Ode5C12.incipit	Τῇ θείᾳ γνώσει σου…
ltx/gr_gr_cog/me.m09.d04:meMA.Ode5C12.melody	@ltx/gr_gr_cog/he.h.m6:heHE.ToTheioFengeiSou.name
ltx/gr_gr_cog/me.m09.d04:meMA.Ode5C12.mode	@ltx/gr_gr_cog/miscellanea:misc.Mode6
ltx/gr_gr_cog/me.m09.d04:meMA.Ode5C12.ode	@ltx/gr_gr_cog/miscellanea:misc.Ode5
ltx/gr_gr_cog/me.m09.d04:meMA.Ode5C12.text	Τῇ θείᾳ γνώσει σου ἐλλαμφθείς, ὁ Ἱερομάρτυς Βαβύλας, πάντας ἐδίδασκε Κύριε, σὲ εἰδέναι μόνον Θεὸν τὸν ὄντως Θεόν, ἐκ ζόφου καὶ τῆς πλάνης ἀνακαλούμενον.
ltx/gr_gr_cog/me.m09.d04:meMA.Ode5C13.incipit	Τῇ θείᾳ ψήφῳ σου…
ltx/gr_gr_cog/me.m09.d04:meMA.Ode5C13.melody	@ltx/gr_gr_cog/he.h.m6:heHE.ToTheioFengeiSou.name
ltx/gr_gr_cog/me.m09.d04:meMA.Ode5C13.mode	@ltx/gr_gr_cog/miscellanea:misc.Mode6
ltx/gr_gr_cog/me.m09.d04:meMA.Ode5C13.ode	@ltx/gr_gr_cog/miscellanea:misc.Ode5
ltx/gr_gr_cog/me.m09.d04:meMA.Ode5C13.text	Τῇ θείᾳ ψήφῳ σου προκριθείς, ὁ Ἱερομάρτυς Βαβύλας, τὴν λογικὴν νέμειν ποίμνην σου, σοὶ προσφέρει Λόγε Θεοῦ, τὸ αἷμα αὐτοῦ, πρὸς τρίβον σωτηρίας, πάντας σοφῶς ὁδηγῶν.
ltx/gr_gr_cog/me.m09.d04:meMA.Ode5C1T.incipit	Ὑπὲρ τῶν δούλων σου…
ltx/gr_gr_cog/me.m09.d04:meMA.Ode5C1T.melody	@ltx/gr_gr_cog/he.h.m6:heHE.ToTheioFengeiSou.name
ltx/gr_gr_cog/me.m09.d04:meMA.Ode5C1T.mode	@ltx/gr_gr_cog/miscellanea:misc.Mode6
ltx/gr_gr_cog/me.m09.d04:meMA.Ode5C1T.ode	@ltx/gr_gr_cog/miscellanea:misc.Ode5
ltx/gr_gr_cog/me.m09.d04:meMA.Ode5C1T.text	Ὑπὲρ τῶν δούλων σου τὸν ἐκ σοῦ, Πάναγνε Δεσπότην τοῦ παντός, ἐκδυσωποῦσα ἱκέτευε, πάσης ἐναντίας βλάβης λυτρώσασθαι, τοὺς σὲ ὁμολογοῦντας Παρθενομήτορα.
ltx/gr_gr_cog/me.m09.d04:meMA.Ode5C21.greekmelody	@ltx/gr_gr_cog/he.h.m4:heHE.SyKyrieMouFos.greekname
ltx/gr_gr_cog/me.m09.d04:meMA.Ode5C21.incipit	Ῥαπίζεις Ἐρυθράν, καὶ δεικνύεις ἰσχὺν…
ltx/gr_gr_cog/me.m09.d04:meMA.Ode5C21.melody	@ltx/gr_gr_cog/he.h.m4:heHE.SyKyrieMouFos.name
ltx/gr_gr_cog/me.m09.d04:meMA.Ode5C21.mode	@ltx/gr_gr_cog/miscellanea:misc.Mode4
ltx/gr_gr_cog/me.m09.d04:meMA.Ode5C21.ode	@ltx/gr_gr_cog/miscellanea:misc.Ode5
ltx/gr_gr_cog/me.m09.d04:meMA.Ode5C21.text	Ῥαπίζεις Ἐρυθράν, καὶ δεικνύεις ἰσχὺν τοῦ Θεοῦ, τῇ ῥάβδῳ σου ὦ θεόπτα, καὶ χαράττεις ἐν ταύτῃ, Σταυροῦ τὴν θείαν δύναμιν.
ltx/gr_gr_cog/me.m09.d04:meMA.Ode5C22.incipit	Ὢ τόλμης προσφιλοῦς! ὢ ἁπλότητος…
ltx/gr_gr_cog/me.m09.d04:meMA.Ode5C22.melody	@ltx/gr_gr_cog/he.h.m4:heHE.SyKyrieMouFos.name
ltx/gr_gr_cog/me.m09.d04:meMA.Ode5C22.mode	@ltx/gr_gr_cog/miscellanea:misc.Mode4
ltx/gr_gr_cog/me.m09.d04:meMA.Ode5C22.ode	@ltx/gr_gr_cog/miscellanea:misc.Ode5
ltx/gr_gr_cog/me.m09.d04:meMA.Ode5C22.text	Ὢ τόλμης προσφιλοῦς! ὢ ἁπλότητος ψυχῆς καθαρᾶς! Εἰ ἔγνως με παρὰ πάντας, πρὸς Θεὸν ὁ θεόπτης φησί, γνωστῶς μοι φάνηθι.
ltx/gr_gr_cog/me.m09.d04:meMA.Ode5C23.incipit	Τῇ πέτρᾳ σκεπασθείς, οὐ Θεοῦ…
ltx/gr_gr_cog/me.m09.d04:meMA.Ode5C23.melody	@ltx/gr_gr_cog/he.h.m4:heHE.SyKyrieMouFos.name
ltx/gr_gr_cog/me.m09.d04:meMA.Ode5C23.mode	@ltx/gr_gr_cog/miscellanea:misc.Mode4
ltx/gr_gr_cog/me.m09.d04:meMA.Ode5C23.ode	@ltx/gr_gr_cog/miscellanea:misc.Ode5
ltx/gr_gr_cog/me.m09.d04:meMA.Ode5C23.text	Τῇ πέτρᾳ σκεπασθείς, οὐ Θεοῦ εἶδες πρόσωπον, ὡς κρύφιον ὦ θεόπτα, τὴν δὲ σάρκωσιν ἔγνως, τοῦ Λόγου ὡς ὀπίσθια.
ltx/gr_gr_cog/me.m09.d04:meMA.Ode5C24.incipit	Ο ὕων ὑετόν, ἀντὶ ὕδατος…
ltx/gr_gr_cog/me.m09.d04:meMA.Ode5C24.melody	@ltx/gr_gr_cog/he.h.m4:heHE.SyKyrieMouFos.name
ltx/gr_gr_cog/me.m09.d04:meMA.Ode5C24.mode	@ltx/gr_gr_cog/miscellanea:misc.Mode4
ltx/gr_gr_cog/me.m09.d04:meMA.Ode5C24.ode	@ltx/gr_gr_cog/miscellanea:misc.Ode5
ltx/gr_gr_cog/me.m09.d04:meMA.Ode5C24.text	Ο ὕων ὑετόν, ἀντὶ ὕδατος Μάννα ποτέ, Μωσῆς ἐστιν ὁ θεόπτης, ὁ δοὺς ὀρτυγομήτρας, τροφὴν τῷ, Ἰσραὴλ διʼ εὐχῆς.
ltx/gr_gr_cog/me.m09.d04:meMA.Ode5C2T.incipit	Εἰσέδυς αἰσθητῶς, τῷ γνόφῳ καὶ…
ltx/gr_gr_cog/me.m09.d04:meMA.Ode5C2T.melody	@ltx/gr_gr_cog/he.h.m4:heHE.SyKyrieMouFos.name
ltx/gr_gr_cog/me.m09.d04:meMA.Ode5C2T.mode	@ltx/gr_gr_cog/miscellanea:misc.Mode4
ltx/gr_gr_cog/me.m09.d04:meMA.Ode5C2T.ode	@ltx/gr_gr_cog/miscellanea:misc.Ode5
ltx/gr_gr_cog/me.m09.d04:meMA.Ode5C2T.text	Εἰσέδυς αἰσθητῶς, τῷ γνόφῳ καὶ ἔμαθες, τὰ ἄῤῥητα ὦ θεόπτα, ὡς μέλλει ἐκ Παρθένου, Θεὸς σαρκὶ τεχθήσεσθαι.
ltx/gr_gr_cog/me.m09.d04:meMA.Ode6C11.greekmelody	@ltx/gr_gr_cog/he.h.m6:heHE.TouViouTinThalassan.greekname
ltx/gr_gr_cog/me.m09.d04:meMA.Ode6C11.incipit	Τοῦ βίου τὴν θάλασσαν…
ltx/gr_gr_cog/me.m09.d04:meMA.Ode6C11.melody	@ltx/gr_gr_cog/he.h.m6:heHE.TouViouTinThalassan.name
ltx/gr_gr_cog/me.m09.d04:meMA.Ode6C11.mode	@ltx/gr_gr_cog/miscellanea:misc.Mode6
ltx/gr_gr_cog/me.m09.d04:meMA.Ode6C11.ode	@ltx/gr_gr_cog/miscellanea:misc.Ode6
ltx/gr_gr_cog/me.m09.d04:meMA.Ode6C11.text	Τοῦ βίου τὴν θάλασσαν, τῷ τῆς πλάνης καθορῶν, κυμαινομένην κλύδωνι, Βαβύλας ὁ ἀοίδιμος ἀθλητής, ἐβόα· Ἀνάγαγε, ἐκ φθορᾶς τὴν ζωήν μου Πολυέλεε.
ltx/gr_gr_cog/me.m09.d04:meMA.Ode6C12.incipit	Χριστὸν ἐκμιμούμενος…
ltx/gr_gr_cog/me.m09.d04:meMA.Ode6C12.melody	@ltx/gr_gr_cog/he.h.m6:heHE.TouViouTinThalassan.name
ltx/gr_gr_cog/me.m09.d04:meMA.Ode6C12.mode	@ltx/gr_gr_cog/miscellanea:misc.Mode6
ltx/gr_gr_cog/me.m09.d04:meMA.Ode6C12.ode	@ltx/gr_gr_cog/miscellanea:misc.Ode6
ltx/gr_gr_cog/me.m09.d04:meMA.Ode6C12.text	Χριστὸν ἐκμιμούμενος, πρὸ τῆς ποίμνης τὴν ψυχήν, τὴν ἑαυτοῦ προδέδωκεν, ὁ ἀοίδιμος Μάρτυς καὶ ἀθλητής, ζωὴν πρὸς αἰώνιον, ἐκ φθορᾶς τοῦ θανάτου μεθιστάμενος.
ltx/gr_gr_cog/me.m09.d04:meMA.Ode6C13.incipit	Τῶν παίδων τὸ ἄστατον…
ltx/gr_gr_cog/me.m09.d04:meMA.Ode6C13.melody	@ltx/gr_gr_cog/he.h.m6:heHE.TouViouTinThalassan.name
ltx/gr_gr_cog/me.m09.d04:meMA.Ode6C13.mode	@ltx/gr_gr_cog/miscellanea:misc.Mode6
ltx/gr_gr_cog/me.m09.d04:meMA.Ode6C13.ode	@ltx/gr_gr_cog/miscellanea:misc.Ode6
ltx/gr_gr_cog/me.m09.d04:meMA.Ode6C13.text	Τῶν παίδων τὸ ἄστατον, ἐπεστήριζε σοφῶς, τοῖς ἑαυτοῦ παθήμασι, Βαβύλας ὁ ἀοίδιμος ἀθλητής, ζωὴν πρὸς οὐράνιον, ἀπὸ γῆς μεταφέρων ὁ πανεύφημος.
ltx/gr_gr_cog/me.m09.d04:meMA.Ode6C1T.incipit	Δεσμῶν ἀπολέλυμαι…
ltx/gr_gr_cog/me.m09.d04:meMA.Ode6C1T.melody	@ltx/gr_gr_cog/he.h.m6:heHE.TouViouTinThalassan.name
ltx/gr_gr_cog/me.m09.d04:meMA.Ode6C1T.mode	@ltx/gr_gr_cog/miscellanea:misc.Mode6
ltx/gr_gr_cog/me.m09.d04:meMA.Ode6C1T.ode	@ltx/gr_gr_cog/miscellanea:misc.Ode6
ltx/gr_gr_cog/me.m09.d04:meMA.Ode6C1T.text	Δεσμῶν ἀπολέλυμαι, καταδίκης καὶ ἀρᾶς, εὐλογημένη Πάναγνε, τῷ τοκετῷ σου· μόνη γὰρ ἐπὶ γῆς, Θεὸν ἐσωμάτωσας, καθαρῶν ἐξ αἱμάτων σου Πανάμωμε.
ltx/gr_gr_cog/me.m09.d04:meMA.Ode6C21.greekmelody	@ltx/gr_gr_cog/he.h.m4:heHE.ThysoSoiMetaFonis.greekname
ltx/gr_gr_cog/me.m09.d04:meMA.Ode6C21.incipit	Στρατείαν, κεκτημένος Θεοῦ Ἰσραὴλ δυνατήν…
ltx/gr_gr_cog/me.m09.d04:meMA.Ode6C21.melody	@ltx/gr_gr_cog/he.h.m4:heHE.ThysoSoiMetaFonis.name
ltx/gr_gr_cog/me.m09.d04:meMA.Ode6C21.mode	@ltx/gr_gr_cog/miscellanea:misc.Mode4
ltx/gr_gr_cog/me.m09.d04:meMA.Ode6C21.ode	@ltx/gr_gr_cog/miscellanea:misc.Ode6
ltx/gr_gr_cog/me.m09.d04:meMA.Ode6C21.text	Στρατείαν, κεκτημένος Θεοῦ Ἰσραὴλ δυνατήν, τὰ μὲν ἑπτὰ τῆς κακίας, Χαναναίων ἔθνη ἐξαφανίζεις, τῷ λαῷ σου, κατακληροδοτεῖς δὲ τὴν γῆν τὴν αὐτῶν.
ltx/gr_gr_cog/me.m09.d04:meMA.Ode6C22.incipit	Ἀῤῥήτως, ὑπελθὼν ἐν τῷ γνόφῳ…
ltx/gr_gr_cog/me.m09.d04:meMA.Ode6C22.melody	@ltx/gr_gr_cog/he.h.m4:heHE.ThysoSoiMetaFonis.name
ltx/gr_gr_cog/me.m09.d04:meMA.Ode6C22.mode	@ltx/gr_gr_cog/miscellanea:misc.Mode4
ltx/gr_gr_cog/me.m09.d04:meMA.Ode6C22.ode	@ltx/gr_gr_cog/miscellanea:misc.Ode6
ltx/gr_gr_cog/me.m09.d04:meMA.Ode6C22.text	Ἀῤῥήτως, ὑπελθὼν ἐν τῷ γνόφῳ τῷ θείῳ Μωσῇ, οὗ ὁ Θεὸς ἦν καλῶν σε, τὰς γραφείσας πλάκας δακτύλῳ αὐτοῦ, τῶν νομίμων, ὑπεδέξω ὡς μέγας θεράπων αὐτοῦ.
ltx/gr_gr_cog/me.m09.d04:meMA.Ode6C23.incipit	Ἵστησιν, ὑπακούειν Θεὸς τῆς φωνῆς…
ltx/gr_gr_cog/me.m09.d04:meMA.Ode6C23.melody	@ltx/gr_gr_cog/he.h.m4:heHE.ThysoSoiMetaFonis.name
ltx/gr_gr_cog/me.m09.d04:meMA.Ode6C23.mode	@ltx/gr_gr_cog/miscellanea:misc.Mode4
ltx/gr_gr_cog/me.m09.d04:meMA.Ode6C23.ode	@ltx/gr_gr_cog/miscellanea:misc.Ode6
ltx/gr_gr_cog/me.m09.d04:meMA.Ode6C23.text	Ἵστησιν, ὑπακούειν Θεὸς τῆς φωνῆς αὐτοῦ, τὸν Μωϋσῆν τὸν θεόπτην, κατενώπιον τοῦ λαοῦ ἐμφανῶς, ἵνα δείξῃ, φοβερὸν μετὰ δόξης τὸν μύστην αὐτοῦ.
ltx/gr_gr_cog/me.m09.d04:meMA.Ode6C24.incipit	Νόμιμοι, ὡς τῆς χάριτος παῖδες…
ltx/gr_gr_cog/me.m09.d04:meMA.Ode6C24.melody	@ltx/gr_gr_cog/he.h.m4:heHE.ThysoSoiMetaFonis.name
ltx/gr_gr_cog/me.m09.d04:meMA.Ode6C24.mode	@ltx/gr_gr_cog/miscellanea:misc.Mode4
ltx/gr_gr_cog/me.m09.d04:meMA.Ode6C24.ode	@ltx/gr_gr_cog/miscellanea:misc.Ode6
ltx/gr_gr_cog/me.m09.d04:meMA.Ode6C24.text	Νόμιμοι, ὡς τῆς χάριτος παῖδες ὑπάρχοντες, τὴν εὐλογίαν τρυγῶμεν, εὐφημοῦντες Μάκαρ σε, καὶ Ἑβραίους, ὥς περ πάλαι Ἰακώβ, τὸν Ἡσαῦ νῦν πτερνίζοντες.
ltx/gr_gr_cog/me.m09.d04:meMA.Ode6C2T.incipit	Νεύματι, θεϊκῷ σὲ προγράφει Μωσῆς…
ltx/gr_gr_cog/me.m09.d04:meMA.Ode6C2T.melody	@ltx/gr_gr_cog/he.h.m4:heHE.ThysoSoiMetaFonis.name
ltx/gr_gr_cog/me.m09.d04:meMA.Ode6C2T.mode	@ltx/gr_gr_cog/miscellanea:misc.Mode4
ltx/gr_gr_cog/me.m09.d04:meMA.Ode6C2T.ode	@ltx/gr_gr_cog/miscellanea:misc.Ode6
ltx/gr_gr_cog/me.m09.d04:meMA.Ode6C2T.text	Νεύματι, θεϊκῷ σὲ προγράφει Μωσῆς ὁ κλεινός, ὡς κιβωτὸν Θεοτόκε, ταῖς αὐγαῖς τοῦ Πνεύματος πανταχόθεν, ὡς χρυσίῳ, κατακεκαλυμμένην εἰς δόξαν Θεοῦ.
ltx/gr_gr_cog/me.m09.d04:meMA.Ode6H.greekmelody	@ltx/gr_gr_cog/he.h.m4:heHE.ThysoSoiMetaFonis.greekname
ltx/gr_gr_cog/me.m09.d04:meMA.Ode6H.incipit	@ltx/gr_gr_cog/he.h.m4:heHE.ThysoSoiMetaFonis.incipit
ltx/gr_gr_cog/me.m09.d04:meMA.Ode6H.melody	@ltx/gr_gr_cog/he.h.m4:heHE.ThysoSoiMetaFonis.melody
ltx/gr_gr_cog/me.m09.d04:meMA.Ode6H.mode	@ltx/gr_gr_cog/miscellanea:misc.Mode4
ltx/gr_gr_cog/me.m09.d04:meMA.Ode6H.ode	@ltx/gr_gr_cog/miscellanea:misc.Ode6
ltx/gr_gr_cog/me.m09.d04:meMA.Ode6H.text	@ltx/gr_gr_cog/he.h.m4:heHE.ThysoSoiMetaFonis.text
ltx/gr_gr_cog/me.m09.d04:meMA.Ode7C11.greekmelody	@ltx/gr_gr_cog/he.h.m6:heHE.DrosovolonMenTinKaminon.greekname
ltx/gr_gr_cog/me.m09.d04:meMA.Ode7C11.incipit	Αἱ οὐράνιαι δυνάμεις…
ltx/gr_gr_cog/me.m09.d04:meMA.Ode7C11.melody	@ltx/gr_gr_cog/he.h.m6:heHE.DrosovolonMenTinKaminon.name
ltx/gr_gr_cog/me.m09.d04:meMA.Ode7C11.mode	@ltx/gr_gr_cog/miscellanea:misc.Mode6
ltx/gr_gr_cog/me.m09.d04:meMA.Ode7C11.ode	@ltx/gr_gr_cog/miscellanea:misc.Ode7
ltx/gr_gr_cog/me.m09.d04:meMA.Ode7C11.text	Αἱ οὐράνιαι Δυνάμεις κατοπτεύουσαι, παῖδας καὶ παιδοτρίβην ὁμοῦ, κατὰ τῆς πλάνης, νικηφόρους δυνάμει τοῦ Σταυροῦ, ἐβόων χορεύουσαι Χριστῷ· Εὐλογητὸς εἶ ὁ Θεός, ὁ δοὺς τὴν νίκην αὐτοῖς.
ltx/gr_gr_cog/me.m09.d04:meMA.Ode7C12.incipit	Ἡ φωσφόρος…
ltx/gr_gr_cog/me.m09.d04:meMA.Ode7C12.melody	@ltx/gr_gr_cog/he.h.m6:heHE.DrosovolonMenTinKaminon.name
ltx/gr_gr_cog/me.m09.d04:meMA.Ode7C12.mode	@ltx/gr_gr_cog/miscellanea:misc.Mode6
ltx/gr_gr_cog/me.m09.d04:meMA.Ode7C12.ode	@ltx/gr_gr_cog/miscellanea:misc.Ode7
ltx/gr_gr_cog/me.m09.d04:meMA.Ode7C12.text	Ἡ φωσφόρος τοῦ Δεσπότου κατελάμπρυνε, χάρις τοὺς συνελθόντας πιστούς, ὁ ἀοίδιμός τε Βαβύλας στεφανηφορῶν, προτρέπει συγχαίροντας βοᾶν· Εὐλογητὸς εἶ ὁ Θεός, ὁ τῶν Πατέρων ἡμῶν.
ltx/gr_gr_cog/me.m09.d04:meMA.Ode7C13.incipit	Τῶν τυράννων…
ltx/gr_gr_cog/me.m09.d04:meMA.Ode7C13.melody	@ltx/gr_gr_cog/he.h.m6:heHE.DrosovolonMenTinKaminon.name
ltx/gr_gr_cog/me.m09.d04:meMA.Ode7C13.mode	@ltx/gr_gr_cog/miscellanea:misc.Mode6
ltx/gr_gr_cog/me.m09.d04:meMA.Ode7C13.ode	@ltx/gr_gr_cog/miscellanea:misc.Ode7
ltx/gr_gr_cog/me.m09.d04:meMA.Ode7C13.text	Τῶν τυράννων μὲν ἠπόρει ἡ ἐπίνοια, βοηθεῖν τοῖς μὴ οὖσι θεοῖς, τῇ Τριάδι δὲ τῇ Ἁγίᾳ Βαβύλας ὁ κλεινός, προτρέπει πιστοὺς τοῦ ἐκβοᾶν· Εὐλογητὸς εἶ ὁ Θεός, ὁ τῶν Πατέρων ἡμῶν.
ltx/gr_gr_cog/me.m09.d04:meMA.Ode7C1T.incipit	Λαμπροτάταις ἀστραπαῖς…
ltx/gr_gr_cog/me.m09.d04:meMA.Ode7C1T.melody	@ltx/gr_gr_cog/he.h.m6:heHE.DrosovolonMenTinKaminon.name
ltx/gr_gr_cog/me.m09.d04:meMA.Ode7C1T.mode	@ltx/gr_gr_cog/miscellanea:misc.Mode6
ltx/gr_gr_cog/me.m09.d04:meMA.Ode7C1T.ode	@ltx/gr_gr_cog/miscellanea:misc.Ode7
ltx/gr_gr_cog/me.m09.d04:meMA.Ode7C1T.text	Λαμπροτάταις ἀστραπαῖς σου καταλάμπρυνον, τὴν ζοφερὰν καρδίαν μου, ἡ κυήσασα ἐπὶ γῆς τὸν ἥλιον Χριστόν, Παρθένε· ᾗ ψάλλομεν ἀεί, Εὐλογημένη ἡ Θεὸν σαρκὶ κυήσασα.
ltx/gr_gr_cog/me.m09.d04:meMA.Ode7C21.greekmelody	@ltx/gr_gr_cog/he.h.m2:heHE.EnTiKamino.greekname
ltx/gr_gr_cog/me.m09.d04:meMA.Ode7C21.incipit	Ἐν θεοπτίαις, τῶν ἀποῤῥήτων θεῖος…
ltx/gr_gr_cog/me.m09.d04:meMA.Ode7C21.melody	@ltx/gr_gr_cog/he.h.m2:heHE.EnTiKamino.name
ltx/gr_gr_cog/me.m09.d04:meMA.Ode7C21.mode	@ltx/gr_gr_cog/miscellanea:misc.Mode4
ltx/gr_gr_cog/me.m09.d04:meMA.Ode7C21.ode	@ltx/gr_gr_cog/miscellanea:misc.Ode7
ltx/gr_gr_cog/me.m09.d04:meMA.Ode7C21.text	Ἐν θεοπτίαις, τῶν ἀποῤῥήτων θεῖος γραφεὺς γεγονώς, πᾶσαν τὴν σοφὴν ἰδέαν σὺ τῆς σκηνῆς, διὰ λόγων τεχνησάμενος, τῷ ἀρχιτέκτονι, Βεσελεὴλ παρέθου τὴν πρᾶξιν Μωσῇ.
ltx/gr_gr_cog/me.m09.d04:meMA.Ode7C22.incipit	Ἱερατεύειν, θρασυστομήσας πάλαι Κορὲ μετὰ…
ltx/gr_gr_cog/me.m09.d04:meMA.Ode7C22.melody	@ltx/gr_gr_cog/he.h.m2:heHE.EnTiKamino.name
ltx/gr_gr_cog/me.m09.d04:meMA.Ode7C22.mode	@ltx/gr_gr_cog/miscellanea:misc.Mode4
ltx/gr_gr_cog/me.m09.d04:meMA.Ode7C22.ode	@ltx/gr_gr_cog/miscellanea:misc.Ode7
ltx/gr_gr_cog/me.m09.d04:meMA.Ode7C22.text	Ἱερατεύειν, θρασυστομήσας πάλαι Κορὲ μετὰ σοῦ, ὤφθη κατελθὼν εἰς ᾍδου παγκλήρως ζῶν, τοῦ Θεοῦ σοι τὸ αἰδέσιμον, Μωσῇ φυλάττοντος, βασιλείας καὶ ἱερατείας ὁμοῦ.
ltx/gr_gr_cog/me.m09.d04:meMA.Ode7C23.incipit	Συστρατηγῶν σοι, τοῦ Ἰουδαίων ἔθνους…
ltx/gr_gr_cog/me.m09.d04:meMA.Ode7C23.melody	@ltx/gr_gr_cog/he.h.m2:heHE.EnTiKamino.name
ltx/gr_gr_cog/me.m09.d04:meMA.Ode7C23.mode	@ltx/gr_gr_cog/miscellanea:misc.Mode4
ltx/gr_gr_cog/me.m09.d04:meMA.Ode7C23.ode	@ltx/gr_gr_cog/miscellanea:misc.Ode7
ltx/gr_gr_cog/me.m09.d04:meMA.Ode7C23.text	Συστρατηγῶν σοι, τοῦ Ἰουδαίων ἔθνους πάλαι Μωσῆ, ὤφθη Μιχαὴλ ὁ Ἄρχων τῶν οὐρανῶν, καὶ τοῦ σώματός σου θεῖος φρουρός· τὸν γὰρ ἀρχέκακον, ἀνθεστηκότα οὗτος κατήσχυνε.
ltx/gr_gr_cog/me.m09.d04:meMA.Ode7C2T.incipit	Τοῦ Ἀαρών σε, ἡ θεία…
ltx/gr_gr_cog/me.m09.d04:meMA.Ode7C2T.melody	@ltx/gr_gr_cog/he.h.m2:heHE.EnTiKamino.name
ltx/gr_gr_cog/me.m09.d04:meMA.Ode7C2T.mode	@ltx/gr_gr_cog/miscellanea:misc.Mode4
ltx/gr_gr_cog/me.m09.d04:meMA.Ode7C2T.ode	@ltx/gr_gr_cog/miscellanea:misc.Ode7
ltx/gr_gr_cog/me.m09.d04:meMA.Ode7C2T.text	Τοῦ Ἀαρών σε, ἡ θεία ῥάβδος βλαστάνειν ἐδήλωσε, πᾶσι Θεοτόκε λύσιν ἁμαρτιῶν· ἱλασμὸς γὰρ βροτοῖς γέγονας, καὶ ἀπολύτρωσις, τῆς φρικτῆς τοῦ Θεοῦ πρὸς ἡμᾶς ἀπειλῆς.
ltx/gr_gr_cog/me.m09.d04:meMA.Ode8C11.greekmelody	@ltx/gr_gr_cog/he.h.m6:heHE.TheonPateraDimiourgon.greekname
ltx/gr_gr_cog/me.m09.d04:meMA.Ode8C11.incipit	Ἡ μνήμη σήμερον…
ltx/gr_gr_cog/me.m09.d04:meMA.Ode8C11.melody	@ltx/gr_gr_cog/he.h.m6:heHE.TheonPateraDimiourgon.name
ltx/gr_gr_cog/me.m09.d04:meMA.Ode8C11.mode	@ltx/gr_gr_cog/miscellanea:misc.Mode6
ltx/gr_gr_cog/me.m09.d04:meMA.Ode8C11.ode	@ltx/gr_gr_cog/miscellanea:misc.Ode8
ltx/gr_gr_cog/me.m09.d04:meMA.Ode8C11.text	Ἡ μνήμη σήμερον ἀδελφοί, τοῦ ἱερέως καὶ Μάρτυρος Βαβύλα, τοῦ ἐν φλογὶ Νεανίας ᾄδειν προτρέπεται· Εὐλογεῖτε, τὸν Κύριον τὰ ἔργα, καὶ ὑπερυψοῦτε, εἰς πάντας τοὺς αἰῶνας.
ltx/gr_gr_cog/me.m09.d04:meMA.Ode8C12.incipit	Οἱ νέοι σήμερον…
ltx/gr_gr_cog/me.m09.d04:meMA.Ode8C12.melody	@ltx/gr_gr_cog/he.h.m6:heHE.TheonPateraDimiourgon.name
ltx/gr_gr_cog/me.m09.d04:meMA.Ode8C12.mode	@ltx/gr_gr_cog/miscellanea:misc.Mode6
ltx/gr_gr_cog/me.m09.d04:meMA.Ode8C12.ode	@ltx/gr_gr_cog/miscellanea:misc.Ode8
ltx/gr_gr_cog/me.m09.d04:meMA.Ode8C12.text	Οἱ νέοι σήμερον φοιτηταί, τοῦ ἱερέως καὶ Μάρτυρος Βαβύλα, σὺν τῷ πρεσβύτῃ στεφθέντες ᾄδειν προτρέπονται· Εὐλογεῖτε, τὸν Κύριον τὰ ἔργα, καὶ ὑπερυψοῦτε, εἰς πάντας τοὺς αἰῶνας.
ltx/gr_gr_cog/me.m09.d04:meMA.Ode8C13.incipit	Τὸ χρῖσμα τὸ ἱερατικόν…
ltx/gr_gr_cog/me.m09.d04:meMA.Ode8C13.melody	@ltx/gr_gr_cog/he.h.m6:heHE.TheonPateraDimiourgon.name
ltx/gr_gr_cog/me.m09.d04:meMA.Ode8C13.mode	@ltx/gr_gr_cog/miscellanea:misc.Mode6
ltx/gr_gr_cog/me.m09.d04:meMA.Ode8C13.ode	@ltx/gr_gr_cog/miscellanea:misc.Ode8
ltx/gr_gr_cog/me.m09.d04:meMA.Ode8C13.text	Τὸ χρῖσμα τὸ ἱερατικόν, τοῦ ἱερέως καὶ Μάρτυρος Βαβύλα, ἐν τῇ τοῦ αἵματος χύσει πλέον δοξάζεται· διὰ τοῦτο τὸν Κύριον ὑμνεῖτε τὰ ἔργα, καὶ ὑπερυψοῦτε, εἰς πάντας τοὺς αἰῶνας.
ltx/gr_gr_cog/me.m09.d04:meMA.Ode8C1T.incipit	Θεὸν ἐκύησας ἐν σαρκί…
ltx/gr_gr_cog/me.m09.d04:meMA.Ode8C1T.melody	@ltx/gr_gr_cog/he.h.m6:heHE.TheonPateraDimiourgon.name
ltx/gr_gr_cog/me.m09.d04:meMA.Ode8C1T.mode	@ltx/gr_gr_cog/miscellanea:misc.Mode6
ltx/gr_gr_cog/me.m09.d04:meMA.Ode8C1T.ode	@ltx/gr_gr_cog/miscellanea:misc.Ode8
ltx/gr_gr_cog/me.m09.d04:meMA.Ode8C1T.text	Θεὸν ἐκύησας ἐν σαρκί, τὸν κατέχοντα χειρὶ τὰ πάντα, καὶ ἐν ἀγκάλαις Παρθένε τοῦτον ἐβάστασας· ὃν ὑμνοῦσιν ὡς Κύριον τὰ ἔργα, καὶ ὑπερυψοῦσιν, εἰς πάντας τοὺς αἰῶνας.
ltx/gr_gr_cog/me.m09.d04:meMA.Ode8C21.greekmelody	@ltx/gr_gr_cog/he.h.m4:heHE.CheirasEkpetasasDaniil.greekname
ltx/gr_gr_cog/me.m09.d04:meMA.Ode8C21.incipit	Θεράπων εἰκότως τοῦ Θεοῦ, ὡς…
ltx/gr_gr_cog/me.m09.d04:meMA.Ode8C21.melody	@ltx/gr_gr_cog/he.h.m4:heHE.CheirasEkpetasasDaniil.name
ltx/gr_gr_cog/me.m09.d04:meMA.Ode8C21.mode	@ltx/gr_gr_cog/miscellanea:misc.Mode4
ltx/gr_gr_cog/me.m09.d04:meMA.Ode8C21.ode	@ltx/gr_gr_cog/miscellanea:misc.Ode8
ltx/gr_gr_cog/me.m09.d04:meMA.Ode8C21.text	Θεράπων εἰκότως τοῦ Θεοῦ, ὡς πρᾷος ἤκουσας καὶ ἔργοις γέγονας· διὸ ἐγνώσθη σοι Κύριος, ὑπὲρ πάντας τοὺς προφήτας Μωσῆ, καὶ ἐνοικήσας σοι πιστῶς, ψάλλειν ἐδίδαξεν· Εὐλογεῖτε πάντα τὰ ἔργα Κυρίου τὸν Κύριον.
ltx/gr_gr_cog/me.m09.d04:meMA.Ode8C22.incipit	Ὡς μύστης Θεοῦ καὶ λειτουργός…
ltx/gr_gr_cog/me.m09.d04:meMA.Ode8C22.melody	@ltx/gr_gr_cog/he.h.m4:heHE.CheirasEkpetasasDaniil.name
ltx/gr_gr_cog/me.m09.d04:meMA.Ode8C22.mode	@ltx/gr_gr_cog/miscellanea:misc.Mode4
ltx/gr_gr_cog/me.m09.d04:meMA.Ode8C22.ode	@ltx/gr_gr_cog/miscellanea:misc.Ode8
ltx/gr_gr_cog/me.m09.d04:meMA.Ode8C22.text	Ὡς μύστης Θεοῦ καὶ λειτουργός, καὶ βασιλεύς, Ἰσραήλ, Μωσῆ Θεόπτα δειχθείς, Χριστὸν ἐκήρυξας ἔρχεσθαι, ἐν σαρκὶ προδιαγράψας αὐτοῦ, τὴν πρὸς ἀνθρώπους φοβεράν καὶ θείαν ἔλευσιν, οὗ καὶ τύπος ἔμψυχος ὤφθης σαφῶς, καὶ Προφήτης πιστός.
ltx/gr_gr_cog/me.m09.d04:meMA.Ode8C23.incipit	Λόγου προφητείαις τὸν λαόν, καὶ…
ltx/gr_gr_cog/me.m09.d04:meMA.Ode8C23.melody	@ltx/gr_gr_cog/he.h.m4:heHE.CheirasEkpetasasDaniil.name
ltx/gr_gr_cog/me.m09.d04:meMA.Ode8C23.mode	@ltx/gr_gr_cog/miscellanea:misc.Mode4
ltx/gr_gr_cog/me.m09.d04:meMA.Ode8C23.ode	@ltx/gr_gr_cog/miscellanea:misc.Ode8
ltx/gr_gr_cog/me.m09.d04:meMA.Ode8C23.text	Λόγου προφητείαις τὸν λαόν, καὶ νόμου διαταγαῖς καθοδηγήσας πιστῶς, σημείων τέρασιν ἴθυνας, καὶ θαυμάτων ἐπιδείξεσιν· ὑπὸ Θεοῦ δὲ προσκληθείς, ἐν γῇ θεόπτα Μωάβ, προσετέθης, πρὸς τοὺς πατέρας τοὺς σοὺς μετὰ δόξης πολλῆς.
ltx/gr_gr_cog/me.m09.d04:meMA.Ode8C24.incipit	Ὄρει ἐπιβὰς ὡς οὐρανῷ, Θεοῦ…
ltx/gr_gr_cog/me.m09.d04:meMA.Ode8C24.melody	@ltx/gr_gr_cog/he.h.m4:heHE.CheirasEkpetasasDaniil.name
ltx/gr_gr_cog/me.m09.d04:meMA.Ode8C24.mode	@ltx/gr_gr_cog/miscellanea:misc.Mode4
ltx/gr_gr_cog/me.m09.d04:meMA.Ode8C24.ode	@ltx/gr_gr_cog/miscellanea:misc.Ode8
ltx/gr_gr_cog/me.m09.d04:meMA.Ode8C24.text	Ὄρει ἐπιβὰς ὡς οὐρανῷ, Θεοῦ προστάξαντος κατεῖδες πνεύματι, τὴν τῶν πραέων γῆν Πάνσοφε· αἰσθητῶς δὲ κατενόησας, ἐπαγγελίας τὴν τρυφήν· καὶ μεταστάντος ἐκ γῆς, ἐπεκρύβη, οἰκονομίᾳ Θεοῦ καὶ τὸ σκῆνός σου.
ltx/gr_gr_cog/me.m09.d04:meMA.Ode8C2T.incipit	Οὐδεὶς προακήκοε πρὸ σοῦ, θεόπτης…
ltx/gr_gr_cog/me.m09.d04:meMA.Ode8C2T.melody	@ltx/gr_gr_cog/he.h.m4:heHE.CheirasEkpetasasDaniil.name
ltx/gr_gr_cog/me.m09.d04:meMA.Ode8C2T.mode	@ltx/gr_gr_cog/miscellanea:misc.Mode4
ltx/gr_gr_cog/me.m09.d04:meMA.Ode8C2T.ode	@ltx/gr_gr_cog/miscellanea:misc.Ode8
ltx/gr_gr_cog/me.m09.d04:meMA.Ode8C2T.text	Οὐδεὶς προακήκοε πρὸ σοῦ, θεόπτης ἔνδοξε, Μωσῆ θεράπον Χριστοῦ, διότι ἅπαντα ἔβλεψας, τῆς Παρθένου τὰ ἰνδάλματα, προδιαγράφοντα αὐτῆς τὴν θείαν γέννησιν· ἐν φλογὶ γὰρ βάτου, κατεῖδες μορφὴν τὴν ἀόρατον.
ltx/gr_gr_cog/me.m09.d04:meMA.Ode8H.greekmelody	@ltx/gr_gr_cog/he.h.m4:heHE.CheirasEkpetasasDaniil.greekname
ltx/gr_gr_cog/me.m09.d04:meMA.Ode8H.incipit	@ltx/gr_gr_cog/he.h.m4:heHE.CheirasEkpetasasDaniil.incipit
ltx/gr_gr_cog/me.m09.d04:meMA.Ode8H.melody	@ltx/gr_gr_cog/he.h.m4:heHE.CheirasEkpetasasDaniil.melody
ltx/gr_gr_cog/me.m09.d04:meMA.Ode8H.mode	@ltx/gr_gr_cog/miscellanea:misc.Mode4
ltx/gr_gr_cog/me.m09.d04:meMA.Ode8H.ode	@ltx/gr_gr_cog/miscellanea:misc.Ode8
ltx/gr_gr_cog/me.m09.d04:meMA.Ode8H.text	@ltx/gr_gr_cog/he.h.m4:heHE.CheirasEkpetasasDaniil.text
ltx/gr_gr_cog/me.m09.d04:meMA.Ode9C11.greekmelody	@ltx/gr_gr_cog/he.h.m6:heHE.TheonAnthropois.greekname
ltx/gr_gr_cog/me.m09.d04:meMA.Ode9C11.incipit	Χριστὸς ἀνθρώποις…
ltx/gr_gr_cog/me.m09.d04:meMA.Ode9C11.melody	@ltx/gr_gr_cog/he.h.m6:heHE.TheonAnthropois.name
ltx/gr_gr_cog/me.m09.d04:meMA.Ode9C11.mode	@ltx/gr_gr_cog/miscellanea:misc.Mode6
ltx/gr_gr_cog/me.m09.d04:meMA.Ode9C11.ode	@ltx/gr_gr_cog/miscellanea:misc.Ode9
ltx/gr_gr_cog/me.m09.d04:meMA.Ode9C11.text	Χριστὸς ἀνθρώποις ὁδὸν ὑπέδειξε, διὰ Σταυροῦ πρὸς ὕψος οὐρανῶν εὐεπίβατον· διὰ τοῦτο θάνατος ἡττᾶται βροτοῖς· παῖδες γὰρ νεανίαι, τοῦτον οὐκ ἔπτηξαν, σύν τῷ θαυμασίῳ Βαβύλᾳ, οὓς μακαρίσωμεν.
ltx/gr_gr_cog/me.m09.d04:meMA.Ode9C12.incipit	Εὑρὼν τῶν πόνων…
ltx/gr_gr_cog/me.m09.d04:meMA.Ode9C12.melody	@ltx/gr_gr_cog/he.h.m6:heHE.TheonAnthropois.name
ltx/gr_gr_cog/me.m09.d04:meMA.Ode9C12.mode	@ltx/gr_gr_cog/miscellanea:misc.Mode6
ltx/gr_gr_cog/me.m09.d04:meMA.Ode9C12.ode	@ltx/gr_gr_cog/miscellanea:misc.Ode9
ltx/gr_gr_cog/me.m09.d04:meMA.Ode9C12.text	Εὑρὼν τῶν πόνων σου τὴν ἀντάμειψιν, παρὰ Χριστοῦ θαυμάτων, παροχὴν καὶ αἰώνιον, κληρουχίαν Βαβύλα θεσπέσιε, μέλπεις σὺν τοῖς Ἀγγέλοις· Ἅγιος, Ἅγιος, Ἅγιος, Τριὰς ἡ παντουργὸς καὶ παντοδύναμος.
ltx/gr_gr_cog/me.m09.d04:meMA.Ode9C13.incipit	Παθῶν ἰάματα…
ltx/gr_gr_cog/me.m09.d04:meMA.Ode9C13.melody	@ltx/gr_gr_cog/he.h.m6:heHE.TheonAnthropois.name
ltx/gr_gr_cog/me.m09.d04:meMA.Ode9C13.mode	@ltx/gr_gr_cog/miscellanea:misc.Mode6
ltx/gr_gr_cog/me.m09.d04:meMA.Ode9C13.ode	@ltx/gr_gr_cog/miscellanea:misc.Ode9
ltx/gr_gr_cog/me.m09.d04:meMA.Ode9C13.text	Παθῶν ἰάματα ἀρυσώμεθα, τῇ εὐκλεεῖ σκηνῇ τῶν ἀθλοφόρων προστρέχοντες· ἐν αὐτῇ γὰρ πάρεισιν Ἀγγέλων χοροί, πνεύματά τε δικαίων, πάντων ἡ Δέσποινα, σὺν τῷ θαυμασίῳ Βαβύλᾳ ἰάσεις νέμοντες.
ltx/gr_gr_cog/me.m09.d04:meMA.Ode9C1T.incipit	ᾨδὴν προσάγω σοι…
ltx/gr_gr_cog/me.m09.d04:meMA.Ode9C1T.melody	@ltx/gr_gr_cog/he.h.m6:heHE.TheonAnthropois.name
ltx/gr_gr_cog/me.m09.d04:meMA.Ode9C1T.mode	@ltx/gr_gr_cog/miscellanea:misc.Mode6
ltx/gr_gr_cog/me.m09.d04:meMA.Ode9C1T.ode	@ltx/gr_gr_cog/miscellanea:misc.Ode9
ltx/gr_gr_cog/me.m09.d04:meMA.Ode9C1T.text	ᾨδὴν προσάγω σοι Κόρη Δέσποινα, ἐκ ῥυπαρῶν χειλέων μου ὁ τάλας δεόμενος, τοῦ βορβόρου ῥῦσαί με τῶν ἔργων μου· ἅπαντας δὲ τοὺς πίστει, νῦν εὐφημοῦντάς σε, τῆς ἐκ δεξιῶν τοῦ σοῦ Υἱοῦ δόξης ἀξίωσον.
ltx/gr_gr_cog/me.m09.d04:meMA.Ode9C21.greekmelody	@ltx/gr_gr_cog/he.h.m4:heHE.LithosAcheirotmitos.greekname
ltx/gr_gr_cog/me.m09.d04:meMA.Ode9C21.incipit	Γέγονας αὐτόπτης θεόπτα, καὶ μετὰ…
ltx/gr_gr_cog/me.m09.d04:meMA.Ode9C21.melody	@ltx/gr_gr_cog/he.h.m4:heHE.LithosAcheirotmitos.name
ltx/gr_gr_cog/me.m09.d04:meMA.Ode9C21.mode	@ltx/gr_gr_cog/miscellanea:misc.Mode4
ltx/gr_gr_cog/me.m09.d04:meMA.Ode9C21.ode	@ltx/gr_gr_cog/miscellanea:misc.Ode9
ltx/gr_gr_cog/me.m09.d04:meMA.Ode9C21.text	Γέγονας αὐτόπτης θεόπτα, καὶ μετὰ θάνατον Κυρίου, οὐ διʼ ἀμυδρῶν αἰνιγμάτων, Χριστὸν ἀθρήσας, ὡς ἐν τῇ πέτρᾳ τὸ πρίν, ἀλλʼ ἀνθρωπίνῳ σώματι, φῶς ἀπαστράπτοντα θεότητος.
ltx/gr_gr_cog/me.m09.d04:meMA.Ode9C22.incipit	Ὄρος τὸ Θαβὼρ ἐδοξάσθη, ὑπὲρ…
ltx/gr_gr_cog/me.m09.d04:meMA.Ode9C22.melody	@ltx/gr_gr_cog/he.h.m4:heHE.LithosAcheirotmitos.name
ltx/gr_gr_cog/me.m09.d04:meMA.Ode9C22.mode	@ltx/gr_gr_cog/miscellanea:misc.Mode4
ltx/gr_gr_cog/me.m09.d04:meMA.Ode9C22.ode	@ltx/gr_gr_cog/miscellanea:misc.Ode9
ltx/gr_gr_cog/me.m09.d04:meMA.Ode9C22.text	Ὄρος τὸ Θαβὼρ ἐδοξάσθη, ὑπὲρ τὸ Σίναιον πλουσίως, ἔνθα Μωϋσῆς ἐκ νεκάδων, καὶ ὁ Θεσβίτης ἐκ χώρας ζώντων Χριστόν, σὺν Ἀποστόλοις ἔβλεπον, μεταμορφούμενον ὡς ὄντως Θεόν.
ltx/gr_gr_cog/me.m09.d04:meMA.Ode9C23.incipit	Σῶσον συμπαθεῖ σου πρεσβείᾳ, καὶ…
ltx/gr_gr_cog/me.m09.d04:meMA.Ode9C23.melody	@ltx/gr_gr_cog/he.h.m4:heHE.LithosAcheirotmitos.name
ltx/gr_gr_cog/me.m09.d04:meMA.Ode9C23.mode	@ltx/gr_gr_cog/miscellanea:misc.Mode4
ltx/gr_gr_cog/me.m09.d04:meMA.Ode9C23.ode	@ltx/gr_gr_cog/miscellanea:misc.Ode9
ltx/gr_gr_cog/me.m09.d04:meMA.Ode9C23.text	Σῶσον συμπαθεῖ σου πρεσβείᾳ, καὶ προσευχῶν τῇ παῤῥησίᾳ, ὡς τὸν Ἰσραὴλ ἐκ κινδύνων, Μωσῆ θεόπτα, καὶ χαλεπῶν καὶ δεινῶν, Χριστιανῶν τὸ πλήρωμα, ἐκ πάσης βλάβης τῶν ὑμνούντων σε.
ltx/gr_gr_cog/me.m09.d04:meMA.Ode9C2T.incipit	Στάμνον σε χρυσῆν τε καὶ…
ltx/gr_gr_cog/me.m09.d04:meMA.Ode9C2T.melody	@ltx/gr_gr_cog/he.h.m4:heHE.LithosAcheirotmitos.name
ltx/gr_gr_cog/me.m09.d04:meMA.Ode9C2T.mode	@ltx/gr_gr_cog/miscellanea:misc.Mode4
ltx/gr_gr_cog/me.m09.d04:meMA.Ode9C2T.ode	@ltx/gr_gr_cog/miscellanea:misc.Ode9
ltx/gr_gr_cog/me.m09.d04:meMA.Ode9C2T.text	Στάμνον σε χρυσῆν τε καὶ πλάκα, καὶ θείαν τράπεζαν Παρθένε, πρότερον Μωσῆς διαγράψας, τρανῶς ἐδήλου Θεὸν τεχθῆναι ἐκ σοῦ, ὅν περ ἰδόντες σώματι, πιστῶς τὸν ὕμνον συμπληροῦμέν σοι.
ltx/gr_gr_cog/me.m09.d04:meMA.Ode9H.greekmelody	@ltx/gr_gr_cog/he.h.m4:heHE.LithosAcheirotmitos.greekname
ltx/gr_gr_cog/me.m09.d04:meMA.Ode9H.incipit	@ltx/gr_gr_cog/he.h.m4:heHE.LithosAcheirotmitos.incipit
ltx/gr_gr_cog/me.m09.d04:meMA.Ode9H.melody	@ltx/gr_gr_cog/he.h.m4:heHE.LithosAcheirotmitos.melody
ltx/gr_gr_cog/me.m09.d04:meMA.Ode9H.mode	@ltx/gr_gr_cog/miscellanea:misc.Mode4
ltx/gr_gr_cog/me.m09.d04:meMA.Ode9H.ode	@ltx/gr_gr_cog/miscellanea:misc.Ode9
ltx/gr_gr_cog/me.m09.d04:meMA.Ode9H.text	@ltx/gr_gr_cog/he.h.m4:heHE.LithosAcheirotmitos.text
ltx/gr_gr_cog/me.m09.d04:meMA.Oikos1.text	Τὴν τοῦ κόσμου σαφῶς ματαιότητα, ἐννοῶν ὁ τοῦ κόσμου ἀλλότριος, καὶ τὰ πάθη Χριστοῦ μιμησάμενος, τὰ τοῦ σώματος πάθη ἐνέκρωσας· καὶ τὸν σταυρόν σου ἀράμενος, ἠκολούθησας Μάρτυς τῷ Κτίστῃ σου· καὶ συμμένων αὐτῷ νῦν ἱκέτευε, ὑπὲρ τῶν σὲ τιμώντων ἀληθῶς, ὦ Πολύαθλε.
ltx/gr_gr_cog/me.m09.d04:meVE.Apolytikion1ger.greekmelody	@ltx/gr_gr_cog/he.a.m4:heAU.OYpsotheisEnToStavro.greekname
ltx/gr_gr_cog/me.m09.d04:meVE.Apolytikion1ger.incipit	Ἱεραρχίας τῷ φωτὶ…
ltx/gr_gr_cog/me.m09.d04:meVE.Apolytikion1ger.melody	@ltx/gr_gr_cog/he.a.m4:heAU.OYpsotheisEnToStavro.name
ltx/gr_gr_cog/me.m09.d04:meVE.Apolytikion1ger.mode	@ltx/gr_gr_cog/miscellanea:misc.Mode4
ltx/gr_gr_cog/me.m09.d04:meVE.Apolytikion1ger.poet	@ltx/gr_gr_cog/poets:po.Gerasimou
ltx/gr_gr_cog/me.m09.d04:meVE.Apolytikion1ger.text	Ἱεραρχίας τῷ φωτὶ ἀπαστράπτων, δικαιοσύνης φυτοκόμος ἐδείχθης, ἀποτεμὼν τὴν ἄκανθαν τῆς πλάνης ἀληθῶς· ὅθεν τῶν αἱμάτων σου, φοινιχθεὶς ταῖς ῥανίσι, τῷ Χριστῷ παρέστηκας, ἀνακράζων.
ltx/gr_gr_cog/me.m09.d04:meVE.AposGlory.incipit	Βήματι τυράννου…
ltx/gr_gr_cog/me.m09.d04:meVE.AposGlory.melody	
ltx/gr_gr_cog/me.m09.d04:meVE.AposGlory.mode	@ltx/gr_gr_cog/miscellanea:misc.Mode6
ltx/gr_gr_cog/me.m09.d04:meVE.AposGlory.text	Βήματι τυράννου παρεστηκώς, καὶ ἀγωνιζόμενος ὑπὲρ τῆς εὐσεβείας ἐκραύγαζες· ἰδοὺ ἐγὼ καὶ τὰ παιδία, ἃ μοι ἔδωκεν ὁ Θεός· μεθʼ ὧν ἐστεφανώθης ἐν οὐρανοῖς, Βαβύλα Ἱερομάρτυς, πρεσβεύων ἀπαύστως, τῶν παγίδων τοῦ ἐχθροῦ, ῥυσθῆναι τὰς ψυχὰς ἡμῶν.
ltx/gr_gr_cog/me.m09.d04:meVE.AposStavrotheotokion.greekmelody	@ltx/gr_gr_cog/he.a.m6:heAU.TriimerosAnestis.greekname
ltx/gr_gr_cog/me.m09.d04:meVE.AposStavrotheotokion.incipit	@ltx/gr_gr_cog/me.m01.d21:meVE.SticStavrotheotokion.incipit
ltx/gr_gr_cog/me.m09.d04:meVE.AposStavrotheotokion.melody	@ltx/gr_gr_cog/he.a.m6:heAU.TriimerosAnestis.name
ltx/gr_gr_cog/me.m09.d04:meVE.AposStavrotheotokion.mode	@ltx/gr_gr_cog/miscellanea:misc.Mode6
ltx/gr_gr_cog/me.m09.d04:meVE.AposStavrotheotokion.text	@ltx/gr_gr_cog/me.m01.d21:meVE.SticStavrotheotokion.text
ltx/gr_gr_cog/me.m09.d04:meVE.AposTheotokion.greekmelody	@ltx/gr_gr_cog/he.a.m6:heAU.TriimerosAnestis.greekname
ltx/gr_gr_cog/me.m09.d04:meVE.AposTheotokion.incipit	Παρθένε παναμώμητε…
ltx/gr_gr_cog/me.m09.d04:meVE.AposTheotokion.melody	@ltx/gr_gr_cog/he.a.m6:heAU.TriimerosAnestis.name
ltx/gr_gr_cog/me.m09.d04:meVE.AposTheotokion.mode	@ltx/gr_gr_cog/miscellanea:misc.Mode6
ltx/gr_gr_cog/me.m09.d04:meVE.AposTheotokion.text	Παρθένε παναμώμητε, δυσώπησον ὃν ἔτεκες, Βασιλέα, τοῦ παντὸς καὶ Ποιητήν, ἐν ὥρα ὅταν κρίνῃ, τὸ γένος τῶν ἀνθρώπων, κατοικτειρῆσαί με τὸν δοῦλόν σου.
ltx/gr_gr_cog/me.m09.d04:meVE.GeneralApolytikion1.name	Βαβύλα·
ltx/gr_gr_cog/me.m09.d04:meVE.GeneralApolytikion2.name	Μωϋσέως
ltx/gr_gr_cog/me.m09.d04:meVE.MM.GeneralApolytikion1.text	@ltx/gr_gr_cog/properties:media.key
ltx/gr_gr_cog/me.m09.d04:meVE.MM.GeneralApolytikion2.text	@ltx/gr_gr_cog/properties:media.key
ltx/gr_gr_cog/me.m09.d04:meVE.MM.Stichera1123as78910.text	@ltx/gr_gr_cog/properties:media.key
ltx/gr_gr_cog/me.m09.d04:meVE.SticGlory.incipit	Βάσιμον κρηπῖδα ἡ Ἐκκλησία…
ltx/gr_gr_cog/me.m09.d04:meVE.SticGlory.melody	
ltx/gr_gr_cog/me.m09.d04:meVE.SticGlory.mode	@ltx/gr_gr_cog/miscellanea:misc.Mode6
ltx/gr_gr_cog/me.m09.d04:meVE.SticGlory.text	Βάσιμον κρηπῖδα ἡ Ἐκκλησία κέκτηται, τοὺς ἱερούς σου ἀγῶνας, Ἱερομάρτυς Βαβύλα· ἣν καὶ φυλάττοις ἀκράδαντον, καὶ ἀνεπιβούλευτον ἐκ λύκων κραταιῶν, κηρύττουσαν τὰς ἀριστείας σου, καὶ μεγαλύνουσαν σὺν σοὶ τὰ νήπια, τὰ ὑπὲρ Χριστοῦ τυθέντα, μετὰ σοῦ μακάριε.
ltx/gr_gr_cog/me.m09.d04:meVE.SticStavrotheotokion.greekmelody	@ltx/gr_gr_cog/he.a.m6:heAU.TriimerosAnestis.greekname
ltx/gr_gr_cog/me.m09.d04:meVE.SticStavrotheotokion.incipit	@ltx/gr_gr_cog/me.m01.d16:meVE.SticStavrotheotokion.incipit
ltx/gr_gr_cog/me.m09.d04:meVE.SticStavrotheotokion.melody	@ltx/gr_gr_cog/he.a.m6:heAU.TriimerosAnestis.name
ltx/gr_gr_cog/me.m09.d04:meVE.SticStavrotheotokion.mode	@ltx/gr_gr_cog/miscellanea:misc.Mode6
ltx/gr_gr_cog/me.m09.d04:meVE.SticStavrotheotokion.text	@ltx/gr_gr_cog/me.m01.d16:meVE.SticStavrotheotokion.text
ltx/gr_gr_cog/me.m09.d04:meVE.SticTheotokion.greekmelody	@ltx/gr_gr_cog/he.a.m6:heAU.TriimerosAnestis.greekname
ltx/gr_gr_cog/me.m09.d04:meVE.SticTheotokion.incipit	@ltx/gr_gr_cog/me.m03.d01:meVE.SticTheotokion2.incipit
ltx/gr_gr_cog/me.m09.d04:meVE.SticTheotokion.melody	@ltx/gr_gr_cog/he.a.m6:heAU.TriimerosAnestis.name
ltx/gr_gr_cog/me.m09.d04:meVE.SticTheotokion.mode	@ltx/gr_gr_cog/miscellanea:misc.Mode6
ltx/gr_gr_cog/me.m09.d04:meVE.SticTheotokion.text	@ltx/gr_gr_cog/me.m03.d01:meVE.SticTheotokion2.text
ltx/gr_gr_cog/me.m09.d04:meVE.Stichera01.greekmelody	@ltx/gr_gr_cog/he.a.m6:heAU.OlinApothemenoi.greekname
ltx/gr_gr_cog/me.m09.d04:meVE.Stichera01.incipit	Ἐν αἵματι βάψας σου…
ltx/gr_gr_cog/me.m09.d04:meVE.Stichera01.melody	@ltx/gr_gr_cog/he.a.m6:heAU.OlinApothemenoi.name
ltx/gr_gr_cog/me.m09.d04:meVE.Stichera01.mode	@ltx/gr_gr_cog/miscellanea:misc.Mode6
ltx/gr_gr_cog/me.m09.d04:meVE.Stichera01.text	Ἐν αἵματι βάψας σου, τὴν ἱερὰν διπλοΐδα, εἰσῆλθες εἰς ἅγια, τῶν ἁγίων ἅγιος σὺ γενόμενος, Βαβύλα ἔνδοξε, καὶ σαφῶς πάντοτε, ἀπολαύεις τῆς θεώσεως, ὡραϊζόμενος, καὶ τῷ μαρτυρίῳ λαμπόμενος, καὶ ἄγγελος δεικνύμενος, ταῖς καθαρωτάταις μεθέξεσιν· ὅθεν σε τιμῶμεν, καὶ πόθῳ ἑορτάζομεν τὴν σήν, ἱερωτάτην πανήγυριν, ἀξιομακάριστε.
ltx/gr_gr_cog/me.m09.d04:meVE.Stichera02.incipit	Σιδήρῳ πεδούμενος…
ltx/gr_gr_cog/me.m09.d04:meVE.Stichera02.melody	@ltx/gr_gr_cog/he.a.m6:heAU.OlinApothemenoi.name
ltx/gr_gr_cog/me.m09.d04:meVE.Stichera02.mode	@ltx/gr_gr_cog/miscellanea:misc.Mode6
ltx/gr_gr_cog/me.m09.d04:meVE.Stichera02.text	Σιδήρῳ πεδούμενος, ἀνεμποδίστως τὴν τρίβον, διώδευσας Ὅσιε, τὴν πρὸς τὴν οὐράνιον πόλιν φέρουσαν, τὰ σεπτὰ στίγματα, Βαβύλα πάνσοφε, ὥσπερ κόσμον περικείμενος, ἐν ᾗ γενόμενος, οἷα νικητὴς ἀληθέστατος, καὶ Μάρτυς ἀπαράτρωτος, καὶ ἱερουργὸς ἱερώτατος, μέλπεις σὺν Ἀγγέλοις, μελῴδημα τὸ θεῖον καθαρῶς· Ἅγιος, Ἅγιος, Ἅγιος, Τριὰς ὁμοούσιε.
ltx/gr_gr_cog/me.m09.d04:meVE.Stichera03.incipit	Ποίμνης προϊστάμενος…
ltx/gr_gr_cog/me.m09.d04:meVE.Stichera03.melody	@ltx/gr_gr_cog/he.a.m6:heAU.OlinApothemenoi.name
ltx/gr_gr_cog/me.m09.d04:meVE.Stichera03.mode	@ltx/gr_gr_cog/miscellanea:misc.Mode6
ltx/gr_gr_cog/me.m09.d04:meVE.Stichera03.text	Ποίμνης προϊστάμενος, τῆς λογικῆς ἱεράρχα, βακτηρία γνώσεως, ἐπὶ χλόην ἔθρεψας ταύτην πιστῶς, καὶ θηρῶν ἔσωσας, καὶ Θεὸν εὔφρανας, τὸν ἐξ ὕψους σε ποιμάναντα· ὃν κατενώπιον, τῶν ἀθεωτάτων μακάριε, κηρύττων, ὥσπερ ἄκακον, τέθυσαι ἀρνίον γηθόμενος, μετὰ τῶν ἀκάκων, παιδίων καὶ προσήχθης σὺν αὐτοῖς, θῦμα εὐῶδες ὁλόκληρον, Βαβύλα θεσπέσιε.
ltx/gr_gr_cog/me.m09.d04:meVE.Stichera04.greekmelody	@ltx/gr_gr_cog/he.a.m4:heAU.OsGennaionEnMartysi.greekname
ltx/gr_gr_cog/me.m09.d04:meVE.Stichera04.incipit	Ἐν θυέλλῃ τὸν ἄσαρκον…
ltx/gr_gr_cog/me.m09.d04:meVE.Stichera04.melody	@ltx/gr_gr_cog/he.a.m4:heAU.OsGennaionEnMartysi.name
ltx/gr_gr_cog/me.m09.d04:meVE.Stichera04.mode	@ltx/gr_gr_cog/miscellanea:misc.Mode4
ltx/gr_gr_cog/me.m09.d04:meVE.Stichera04.text	Ἐν θυέλλῃ τὸν ἄσαρκον, καὶ ἐν γνόφῳ τὸν ἄϋλον, Μωϋσῆ τεθέασαι, ὡς χωρεῖν δυνατόν· θεοειδής τε γενόμενος, τῇ δόξῃ τῇ κρείττονι, τῷ σαρκίνῳ Ἰσραήλ, Νομοθέτης κεχείρισαι· ἀλλʼ οὐ πέφυκε, νοῦς γεώδης τοῖς θείοις ἐμβατεύειν· ἡ γὰρ χάρις τοῖς ὁρῶσι, τὰ λίαν κρείττονα δίδοται.
ltx/gr_gr_cog/me.m09.d04:meVE.Stichera05.incipit	Ἱερεὺς ἐννομώτατος…
ltx/gr_gr_cog/me.m09.d04:meVE.Stichera05.melody	@ltx/gr_gr_cog/he.a.m4:heAU.OsGennaionEnMartysi.name
ltx/gr_gr_cog/me.m09.d04:meVE.Stichera05.mode	@ltx/gr_gr_cog/miscellanea:misc.Mode4
ltx/gr_gr_cog/me.m09.d04:meVE.Stichera05.text	Ἱερεὺς ἐννομώτατος, στρατηγὸς γενναιότατος, τῷ παραπικραίνοντι ἀναδέδειξαι, Μωσῆ μαστίζων τὴν Αἴγυπτον, τῇ ῥάβδῳ δὲ θάλασσαν, διαιρῶν τὴν Ἐρυθράν, καὶ βυθίζων ἀλάστορα, καὶ ὑψαύχενα, Φαραὼ σὺν τριστάταις, καὶ διάγων, ἐν ἐρήμῳ καὶ ἐκτρέφων, τὸν Ἰσραὴλ τὸν ἀγνώμονα.
ltx/gr_gr_cog/me.m09.d04:meVE.Stichera06.incipit	Μωϋσῆ τὸ ὑπόδημα…
ltx/gr_gr_cog/me.m09.d04:meVE.Stichera06.melody	@ltx/gr_gr_cog/he.a.m4:heAU.OsGennaionEnMartysi.name
ltx/gr_gr_cog/me.m09.d04:meVE.Stichera06.mode	@ltx/gr_gr_cog/miscellanea:misc.Mode4
ltx/gr_gr_cog/me.m09.d04:meVE.Stichera06.text	Μωϋσῆ τὸ ὑπόδημα, τῶν ποδῶν λῦσον τάχιον· ὁ γὰρ τόπος ἅγιος, ἐν ᾧ ἕστηκας· μή τι νεκρώσεως σύμβολον, ἐν σοὶ περιφέροιτο· ἐν γὰρ βάτῳ καὶ πυρί, μυστικῶς σοι ὀπτάνεται, τὰ παράδοξα, τῆς θεόπαιδος Κόρης, ἐν τῷ ὄρει, τῷ Χωρὴβ ὁ χρηματίζων, τῷ Μωϋσῇ ἀπεφθέγγετο.
