ltx/gr_gr_cog/le.go.mc.d237:lemcLI.Gospel.book_string	book_stringtest
ltx/gr_gr_cog/le.go.mc.d237:lemcLI.Gospel.chapverse	
ltx/gr_gr_cog/le.go.mc.d237:lemcLI.Gospel.text	Matt test
ltx/gr_gr_cog/le.go.mc.d237:lemcLI.Gospel.title	
ltx/gr_gr_cog/le.go.mc.d237:lemcLI.Gospel.title_abbr	
ltx/gr_gr_cog/le.go.mc.d237:lemcLI.Gospel.version	@ltx/gr_gr_cog/properties:version.designation
