ltx/gr_gr_cog/le.ep.me.m05.d08:lemeLI.Epistle.book_abbr	@ltx/gr_gr_cog/bible:John1.abbr
ltx/gr_gr_cog/le.ep.me.m05.d08:lemeLI.Epistle.book_string	@ltx/gr_gr_cog/bible:John1.text
ltx/gr_gr_cog/le.ep.me.m05.d08:lemeLI.Epistle.chapverse	1:1 – 7
ltx/gr_gr_cog/le.ep.me.m05.d08:lemeLI.Epistle.incipit	Ὃ ἦν ἀπʼ ἀρχῆς, ὃ ἀκηκόαμεν…
ltx/gr_gr_cog/le.ep.me.m05.d08:lemeLI.Epistle.text	Ὃ ἦν ἀπ᾿ ἀρχῆς, ὃ ἀκηκόαμεν, ὃ ἑωράκαμεν τοῖς ὀφθαλμοῖς ἡμῶν, ὃ ἐθεασάμεθα καὶ αἱ χεῖρες ἡμῶν ἐψηλάφησαν, περὶ τοῦ λόγου τῆς ζωῆς· — καὶ ἡ ζωὴ ἐφανερώθη, καὶ ἑωράκαμεν καὶ μαρτυροῦμεν καὶ ἀπαγγέλλομεν ὑμῖν τὴν ζωὴν τὴν αἰώνιον, ἥτις ἦν πρὸς τὸν πατέρα καὶ ἐφανερώθη ἡμῖν· — ὃ ἑωράκαμεν καὶ ἀκηκόαμεν, ἀπαγγέλλομεν ὑμῖν, ἵνα καὶ ὑμεῖς κοινωνίαν ἔχητε μεθ᾽ ἡμῶν· καὶ ἡ κοινωνία δὲ ἡ ἡμετέρα μετὰ τοῦ πατρὸς καὶ μετὰ τοῦ υἱοῦ αὐτοῦ Ἰησοῦ Χριστοῦ. Καὶ ταῦτα γράφομεν ὑμῖν, ἵνα ἡ χαρὰ ἡμῶν ᾖ πεπληρωμένη. Καὶ αὕτη ἐστὶν ἡ ἐπαγγελία ἣν ἀκηκόαμεν ἀπ᾿ αὐτοῦ καὶ ἀναγγέλλομεν ὑμῖν, ὅτι ὁ Θεὸς φῶς ἐστι καὶ σκοτία ἐν αὐτῷ οὐκ ἔστιν οὐδεμία. ἐὰν εἴπωμεν ὅτι κοινωνίαν ἔχομεν μετ᾿ αὐτοῦ καὶ ἐν τῷ σκότει περιπατῶμεν, ψευδόμεθα καὶ οὐ ποιοῦμεν τὴν ἀλήθειαν· ἐὰν δὲ ἐν τῷ φωτὶ περιπατῶμεν, ὡς αὐτός ἐστιν ἐν τῷ φωτί, κοινωνίαν ἔχομεν μετ᾿ ἀλλήλων, καὶ τὸ αἷμα Ἰησοῦ Χριστοῦ τοῦ υἱοῦ αὐτοῦ καθαρίζει ἡμᾶς ἀπὸ πάσης ἁμαρτίας.
ltx/gr_gr_cog/le.ep.me.m05.d08:lemeLI.Epistle.title	Τοῦ Εὐαγγελιστοῦ
ltx/gr_gr_cog/le.ep.me.m05.d08:lemeLI.Epistle.title_abbr	Τοῦ Εὐαγγελιστοῦ
ltx/gr_gr_cog/le.ep.me.m05.d08:lemeLI.Epistle.version	@ltx/gr_gr_cog/properties:version.designation
ltx/gr_gr_cog/le.ep.me.m05.d08:lemeVE.Reading1.book_abbr	@ltx/gr_gr_cog/bible:John1.abbr
ltx/gr_gr_cog/le.ep.me.m05.d08:lemeVE.Reading1.book_string	@ltx/gr_gr_cog/bible:John1.text
ltx/gr_gr_cog/le.ep.me.m05.d08:lemeVE.Reading1.chapverse	3:21 – 4:6
ltx/gr_gr_cog/le.ep.me.m05.d08:lemeVE.Reading1.incipit	Ἀγαπητοί, ἐὰν ἡ καρδία ἡμῶν…
ltx/gr_gr_cog/le.ep.me.m05.d08:lemeVE.Reading1.text	Ἀγαπητοί, ἐὰν ἡ καρδία ἡμῶν μὴ καταγινώσκῃ ἡμῶν, παρρησίαν ἔχομεν πρὸς τὸν Θεόν, καὶ ὃ ἐὰν αἰτῶμεν λαμβάνομεν παρ᾿ αὐτοῦ, ὅτι τὰς ἐντολὰς αὐτοῦ τηροῦμεν καὶ τὰ ἀρεστὰ ἐνώπιον αὐτοῦ ποιοῦμεν. καὶ αὕτη ἐστὶν ἡ ἐντολὴ αὐτοῦ, ἵνα πιστεύσωμεν τῷ ὀνόματι τοῦ υἱοῦ αὐτοῦ Ἰησοῦ Χριστοῦ καὶ ἀγαπῶμεν ἀλλήλους καθὼς ἔδωκεν ἐντολήν. καὶ ὁ τηρῶν τὰς ἐντολὰς αὐτοῦ ἐν αὐτῷ μένει καὶ αὐτὸς ἐν αὐτῷ. καὶ ἐν τούτῳ γινώσκομεν ὅτι μένει ἐν ἡμῖν, ἐκ τοῦ Πνεύματος οὗ ἡμῖν ἔδωκεν. Ἀγαπητοί, μὴ παντὶ πνεύματι πιστεύετε, ἀλλὰ δοκιμάζετε τὰ πνεύματα εἰ ἐκ τοῦ Θεοῦ ἐστιν, ὅτι πολλοὶ ψευδοπροφῆται ἐξεληλύθασιν εἰς τὸν κόσμον. ἐν τούτῳ γινώσκετε τὸ πνεῦμα τοῦ Θεοῦ· πᾶν πνεῦμα ὃ ὁμολογεῖ Ἰησοῦν Χριστὸν ἐν σαρκὶ ἐληλυθότα, ἐκ τοῦ Θεοῦ ἔστι· καὶ πᾶν πνεῦμα ὃ μὴ ὁμολογεῖ τὸν Ἰησοῦν Χριστὸν ἐν σαρκὶ ἐληλυθότα, ἐκ τοῦ Θεοῦ οὐκ ἔστι· καὶ τοῦτό ἐστι τὸ τοῦ ἀντιχρίστου ὃ ἀκηκόατε ὅτι ἔρχεται, καὶ νῦν ἐν τῷ κόσμῳ ἐστὶν ἤδη. Ὑμεῖς ἐκ τοῦ Θεοῦ ἐστε, τεκνία, καὶ νενικήκατε αὐτούς, ὅτι μείζων ἐστὶν ὁ ἐν ὑμῖν ἢ ὁ ἐν τῷ κόσμῳ. αὐτοὶ ἐκ τοῦ κόσμου εἰσί· διὰ τοῦτο ἐκ τοῦ κόσμου λαλοῦσι καὶ ὁ κόσμος αὐτῶν ἀκούει. ἡμεῖς ἐκ τοῦ Θεοῦ ἐσμεν· ὁ γινώσκων τὸν Θεὸν ἀκούει ἡμῶν. ὃς οὐκ ἔστιν ἐκ τοῦ Θεοῦ οὐκ ἀκούει ἡμῶν.
ltx/gr_gr_cog/le.ep.me.m05.d08:lemeVE.Reading1.title	Τοῦ Εὐαγγελιστοῦ
ltx/gr_gr_cog/le.ep.me.m05.d08:lemeVE.Reading1.title_abbr	Τοῦ Εὐαγγελιστοῦ
ltx/gr_gr_cog/le.ep.me.m05.d08:lemeVE.Reading1.version	@ltx/gr_gr_cog/properties:version.designation
ltx/gr_gr_cog/le.ep.me.m05.d08:lemeVE.Reading2.book_abbr	@ltx/gr_gr_cog/bible:John1.abbr
ltx/gr_gr_cog/le.ep.me.m05.d08:lemeVE.Reading2.book_string	@ltx/gr_gr_cog/bible:John1.text
ltx/gr_gr_cog/le.ep.me.m05.d08:lemeVE.Reading2.chapverse	4:11 – 16
ltx/gr_gr_cog/le.ep.me.m05.d08:lemeVE.Reading2.incipit	Ἀγαπητοί, εἰ οὕτως ὁ Θεὸς ἠγάπησεν ἡμᾶς…
ltx/gr_gr_cog/le.ep.me.m05.d08:lemeVE.Reading2.text	Ἀγαπητοί, εἰ οὕτως ὁ Θεὸς ἠγάπησεν ἡμᾶς, καὶ ἡμεῖς ὀφείλομεν ἀλλήλους ἀγαπᾶν. Θεὸν οὐδεὶς πώποτε τεθέαται· ἐὰν ἀγαπῶμεν ἀλλήλους, ὁ Θεὸς ἐν ἡμῖν μένει καὶ ἡ ἀγάπη αὐτοῦ τετελειωμένη ἐστὶν ἐν ἡμῖν. ἐν τούτῳ γινώσκομεν ὅτι ἐν αὐτῷ μένομεν καὶ αὐτὸς ἐν ἡμῖν, ὅτι ἐκ τοῦ Πνεύματος αὐτοῦ δέδωκεν ἡμῖν. Καὶ ἡμεῖς τεθεάμεθα καὶ μαρτυροῦμεν ὅτι ὁ πατὴρ ἀπέσταλκε τὸν υἱὸν σωτῆρα τοῦ κόσμου. ὃς ἂν ὁμολογήσῃ ὅτι Ἰησοῦς ἐστιν ὁ υἱὸς τοῦ Θεοῦ, ὁ Θεὸς ἐν αὐτῷ μένει καὶ αὐτὸς ἐν τῷ Θεῷ. καὶ ἡμεῖς ἐγνώκαμεν καὶ πεπιστεύκαμεν τὴν ἀγάπην ἣν ἔχει ὁ Θεὸς ἐν ἡμῖν. ῾Ο Θεὸς ἀγάπη ἐστί, καὶ ὁ μένων ἐν τῇ ἀγάπῃ ἐν τῷ Θεῷ μένει καὶ ὁ Θεὸς ἐν αὐτῷ.
ltx/gr_gr_cog/le.ep.me.m05.d08:lemeVE.Reading2.title	Τοῦ Εὐαγγελιστοῦ
ltx/gr_gr_cog/le.ep.me.m05.d08:lemeVE.Reading2.title_abbr	Τοῦ Εὐαγγελιστοῦ
ltx/gr_gr_cog/le.ep.me.m05.d08:lemeVE.Reading2.version	@ltx/gr_gr_cog/properties:version.designation
ltx/gr_gr_cog/le.ep.me.m05.d08:lemeVE.Reading3.book_abbr	@ltx/gr_gr_cog/bible:John1.abbr
ltx/gr_gr_cog/le.ep.me.m05.d08:lemeVE.Reading3.book_string	@ltx/gr_gr_cog/bible:John1.text
ltx/gr_gr_cog/le.ep.me.m05.d08:lemeVE.Reading3.chapverse	4:20 – 5:5
ltx/gr_gr_cog/le.ep.me.m05.d08:lemeVE.Reading3.incipit	Ἐάν τις εἴπῃ ὅτι ἀγαπῶ τὸν Θεόν…
ltx/gr_gr_cog/le.ep.me.m05.d08:lemeVE.Reading3.text	Ἀγαπητοί, ἐάν τις εἴπῃ ὅτι ἀγαπῶ τὸν Θεόν, καὶ τὸν ἀδελφὸν αὐτοῦ μισῇ, ψεύστης ἐστίν· ὁ γὰρ μὴ ἀγαπῶν τὸν ἀδελφὸν ὃν ἐώρακε, τὸν Θεὸν ὃν οὐχ ἑώρακε πῶς δύναται ἀγαπᾶν; καὶ ταύτην τὴν ἐντολὴν ἔχομεν ἀπ᾿ αὐτοῦ, ἵνα ὁ ἀγαπῶν τὸν Θεὸν ἀγαπᾷ καὶ τὸν ἀδελφὸν αὐτοῦ. Πᾶς ὁ πιστεύων ὅτι Ἰησοῦς ἐστιν ὁ Χριστός, ἐκ τοῦ Θεοῦ γεγέννηται, καὶ πᾶς ὁ ἀγαπῶν τὸν γεννήσαντα ἀγαπᾷ καὶ τὸν γεγεννημένον ἐξ αὐτοῦ. ἐν τούτῳ γινώσκομεν ὅτι ἀγαπῶμεν τὰ τέκνα τοῦ Θεοῦ, ὅταν τὸν Θεὸν ἀγαπῶμεν καὶ τὰς ἐντολὰς αὐτοῦ τηρῶμεν. αὕτη γάρ ἐστιν ἡ ἀγάπη τοῦ Θεοῦ, ἵνα τὰς ἐντολὰς αὐτοῦ τηρῶμεν· καὶ αἱ ἐντολαὶ αὐτοῦ βαρεῖαι οὐκ εἰσίν, ὅτι πᾶν τὸ γεγεννημένον ἐκ τοῦ Θεοῦ νικᾷ τὸν κόσμον· καὶ αὕτη ἐστὶν ἡ νίκη ἡ νικήσασα τὸν κόσμον, ἡ πίστις ἡμῶν. τίς ἐστιν ὁ νικῶν τὸν κόσμον εἰ μὴ ὁ πιστεύων ὅτι Ἰησοῦς ἐστιν ὁ υἱὸς τοῦ Θεοῦ;
ltx/gr_gr_cog/le.ep.me.m05.d08:lemeVE.Reading3.title	Τοῦ Εὐαγγελιστοῦ
ltx/gr_gr_cog/le.ep.me.m05.d08:lemeVE.Reading3.title_abbr	Τοῦ Εὐαγγελιστοῦ
ltx/gr_gr_cog/le.ep.me.m05.d08:lemeVE.Reading3.version	@ltx/gr_gr_cog/properties:version.designation
