ltx/gr_gr_cog/le.go.me.m08.d16:lemeLI.Gospel.book_abbr	@ltx/gr_gr_cog/bible:Luke.abbr
ltx/gr_gr_cog/le.go.me.m08.d16:lemeLI.Gospel.book_string	@ltx/gr_gr_cog/bible:Luke.text
ltx/gr_gr_cog/le.go.me.m08.d16:lemeLI.Gospel.chapverse	9:51 – 57, 10:22 – 24, 13:22
ltx/gr_gr_cog/le.go.me.m08.d16:lemeLI.Gospel.incipit	 Ἐγένετο ἐν τῷ συμπληροῦσθαι τὰς ἡμέρας…
ltx/gr_gr_cog/le.go.me.m08.d16:lemeLI.Gospel.text	Τῷ καιρῷ ἐκείνῳ, ἐγένετο ἐν τῷ συμπληροῦσθαι τὰς ἡμέρας τῆς ἀναλήψεως αὐτοῦ καὶ αὐτὸς ἐστήριξε τὸ πρόσωπον αὐτοῦ τοῦ πορεύεσθαι εἰς Ἱερουσαλήμ, καὶ ἀπέστειλεν ἀγγέλους πρὸ προσώπου αὐτοῦ. καὶ πορευθέντες εἰσῆλθον εἰς κώμην Σαμαρειτῶν, ὥστε ἑτοιμάσαι αὐτῷ· καὶ οὐκ ἐδέξαντο αὐτόν, ὅτι τὸ πρόσωπον αὐτοῦ ἦν πορευόμενον εἰς Ἱερουσαλήμ. ἰδόντες δὲ οἱ μαθηταὶ αὐτοῦ Ἰάκωβος καὶ Ἰωάννης εἶπον· Κύριε, θέλεις εἴπωμεν πῦρ καταβῆναι ἀπὸ οὐρανοῦ καὶ ἀναλῶσαι αὐτούς, ὡς καὶ Ἠλίας ἐποίησε; στραφεὶς δὲ ἐπετίμησεν αὐτοῖς καὶ εἶπεν· οὐκ οἴδατε ποίου πνεύματός ἐστε ὑμεῖς· ὁ υἱὸς τοῦ ἀνθρώπου οὐκ ἦλθε ψυχὰς ἀνθρώπων ἀπολέσαι, ἀλλὰ σῶσαι. καὶ ἐπορεύθησαν εἰς ἑτέραν κώμην. Ἐγένετο δὲ πορευομένων αὐτῶν ἐν τῇ ὁδῷ ἔλεγε τοῖς ἀκολουθοῦσιν αὐτῷ· πάντα μοι παρεδόθη ὑπὸ τοῦ πατρός μου· καὶ οὐδεὶς ἐπιγινώσκει τίς ἐστιν ὁ υἱός, εἰ μὴ ὁ πατήρ, καὶ τίς ἐστιν ὁ πατήρ, εἰ μὴ ὁ υἱὸς καὶ ᾧ ἐὰν βούληται ὁ υἱὸς ἀποκαλύψαι. Καὶ στραφεὶς πρὸς τοὺς μαθητὰς κατ᾿ ἰδίαν εἶπε· μακάριοι οἱ ὀφθαλμοὶ οἱ βλέποντες ἃ βλέπετε. λέγω γὰρ ὑμῖν ὅτι πολλοὶ προφῆται καὶ βασιλεῖς ἠθέλησαν ἰδεῖν ἃ ὑμεῖς βλέπετε, καὶ οὐκ εἶδον, καὶ ἀκοῦσαι ἃ ἀκούετε, καὶ οὐκ ἤκουσαν. Καὶ διεπορεύετο κατὰ πόλεις καὶ κώμας διδάσκων καὶ πορείαν ποιούμενος εἰς Ἱερουσαλήμ.
ltx/gr_gr_cog/le.go.me.m08.d16:lemeLI.Gospel.title	Τοῦ Ἁγίου Μανδηλίου
ltx/gr_gr_cog/le.go.me.m08.d16:lemeLI.Gospel.title_abbr	Τοῦ Ἁγίου Μανδηλίου
ltx/gr_gr_cog/le.go.me.m08.d16:lemeLI.Gospel.version	@ltx/gr_gr_cog/properties:version.designation
