ltx/gr_gr_cog/tr.d018:trCO.header	
ltx/gr_gr_cog/tr.d018:trDA.commemoration.full	Τετάρτη τῆς Τυρινῆς
ltx/gr_gr_cog/tr.d018:trDA.commemoration.short	Τετάρτη τῆς Τυρινῆς
ltx/gr_gr_cog/tr.d018:trDA.insert1	
ltx/gr_gr_cog/tr.d018:trDA.insert2	
ltx/gr_gr_cog/tr.d018:trDA.note	
ltx/gr_gr_cog/tr.d018:trDA.title	
ltx/gr_gr_cog/tr.d018:trHO.commemorations	
ltx/gr_gr_cog/tr.d018:trHO.daytitle	
ltx/gr_gr_cog/tr.d018:trHO.description1	
ltx/gr_gr_cog/tr.d018:trHO.description2	
ltx/gr_gr_cog/tr.d018:trHO.note1	
ltx/gr_gr_cog/tr.d018:trHO.note2	
ltx/gr_gr_cog/tr.d018:trMA.AposIdiomelon1.incipit	Βρωμάτων νηστεύουσα ψυχή μου, καὶ…
ltx/gr_gr_cog/tr.d018:trMA.AposIdiomelon1.melody	@ltx/gr_gr_cog/miscellanea:misc.Idiomelon
ltx/gr_gr_cog/tr.d018:trMA.AposIdiomelon1.mode	@ltx/gr_gr_cog/miscellanea:misc.Mode1
ltx/gr_gr_cog/tr.d018:trMA.AposIdiomelon1.text	Βρωμάτων νηστεύουσα ψυχή μου, καὶ παθῶν μὴ καθαρεύουσα, μάτην ἐπαγάλλῃ τῇ ἀτροφίᾳ· εἰ μὴ γὰρ ἀφορμή σοι γένηται πρὸς διόρθωσιν, ὡς ψευδὴς μισεῖσαι παρὰ Θεοῦ, καὶ τοῖς κακίστοις δαίμοσιν ὁμοιοῦσαι, τοῖς μηδέποτε σιτουμένοις· μὴ οὖν ἁμαρτάνουσα, τὴν νηστείαν ἀχρειώσῃς, ἀλλʼ ἀκίνητος, πρὸς ὁρμὰς ἀτόπους μένε, δοκοῦσα παρεστάναι ἐσταυρωμένῳ τῷ Σωτῆρι, μᾶλλον δὲ συσταυροῦσθαι, τῷ διὰ σὲ σταυρωθέντι, ἐκβοῶσα πρὸς αὐτόν· Μνήσθητί μου Κύριε, ὅταν ἔλθῃς ἐν τῇ βασιλείᾳ σου.
ltx/gr_gr_cog/tr.d018:trMA.AposMartyric.incipit	@ltx/gr_gr_cog/oc.m1.d4:ocMA.Aposticha3.incipit
ltx/gr_gr_cog/tr.d018:trMA.AposMartyric.melody	
ltx/gr_gr_cog/tr.d018:trMA.AposMartyric.mode	@ltx/gr_gr_cog/miscellanea:misc.Mode1
ltx/gr_gr_cog/tr.d018:trMA.AposMartyric.text	@ltx/gr_gr_cog/oc.m1.d4:ocMA.Aposticha3.text
ltx/gr_gr_cog/tr.d018:trMA.AposTheotokion.greekmelody	@ltx/gr_gr_cog/he.a.m1:heAU.TonOuranionTagmaton.greekname
ltx/gr_gr_cog/tr.d018:trMA.AposTheotokion.incipit	@ltx/gr_gr_cog/oc.m1.d6:ocVE.SticTheotokion.incipit
ltx/gr_gr_cog/tr.d018:trMA.AposTheotokion.melody	@ltx/gr_gr_cog/he.a.m1:heAU.TonOuranionTagmaton.name
ltx/gr_gr_cog/tr.d018:trMA.AposTheotokion.mode	@ltx/gr_gr_cog/miscellanea:misc.Mode1
ltx/gr_gr_cog/tr.d018:trMA.AposTheotokion.text	@ltx/gr_gr_cog/oc.m1.d6:ocVE.SticTheotokion.text
ltx/gr_gr_cog/tr.d018:trMA.C1.poet	@ltx/gr_gr_cog/poets:po.AndreouKritis
ltx/gr_gr_cog/tr.d018:trMA.C1.title	
ltx/gr_gr_cog/tr.d018:trMA.C1.verse	
ltx/gr_gr_cog/tr.d018:trMA.C2.poet	@ltx/gr_gr_cog/poets:po.KyriouIosif
ltx/gr_gr_cog/tr.d018:trMA.Kathisma21.greekmelody	@ltx/gr_gr_cog/he.a.m2:heAU.EfsplagchniasYparchousa.greekname
ltx/gr_gr_cog/tr.d018:trMA.Kathisma21.incipit	Μετʼ εἰρήνης διελθεῖν ἡμᾶς τοὺς…
ltx/gr_gr_cog/tr.d018:trMA.Kathisma21.melody	@ltx/gr_gr_cog/he.a.m2:heAU.EfsplagchniasYparchousa.name
ltx/gr_gr_cog/tr.d018:trMA.Kathisma21.mode	@ltx/gr_gr_cog/miscellanea:misc.Mode2
ltx/gr_gr_cog/tr.d018:trMA.Kathisma21.text	Μετʼ εἰρήνης διελθεῖν ἡμᾶς τοὺς ταπεινούς, τὴν προκαθάρσιμον εὐδόκησον τῶν Νηστειῶν, τῇ ἀφάτῳ φιλανθρωπίᾳ σου Χριστὲ ὁ Θεός, κατάβαλε τοῦ ἐχθροῦ τὰ πανουργεύματα, καὶ τῷ Σταυρῷ σου πάντας διάσωσον, ὁ μόνος γινώσκων τὰ ἐγκάρδια.
ltx/gr_gr_cog/tr.d018:trMA.Kathisma22.greekmelody	@ltx/gr_gr_cog/he.a.m2:heAU.EfsplagchniasYparchousa.greekname
ltx/gr_gr_cog/tr.d018:trMA.Kathisma22.incipit	@ltx/gr_gr_cog/oc.m2.d4:ocMA.Kathisma23.incipit
ltx/gr_gr_cog/tr.d018:trMA.Kathisma22.melody	@ltx/gr_gr_cog/he.a.m2:heAU.EfsplagchniasYparchousa.name
ltx/gr_gr_cog/tr.d018:trMA.Kathisma22.mode	@ltx/gr_gr_cog/miscellanea:misc.Mode2
ltx/gr_gr_cog/tr.d018:trMA.Kathisma22.text	@ltx/gr_gr_cog/oc.m2.d4:ocMA.Kathisma23.text
ltx/gr_gr_cog/tr.d018:trMA.Ode1C11.greekmelody	@ltx/gr_gr_cog/he.h.m4:heHE.AsomaiSoiKyrie.greekname
ltx/gr_gr_cog/tr.d018:trMA.Ode1C11.incipit	Νηστεύων ὁ Κύριος ἀνθρωπίνως, πρὸς…
ltx/gr_gr_cog/tr.d018:trMA.Ode1C11.melody	@ltx/gr_gr_cog/he.h.m4:heHE.AsomaiSoiKyrie.name
ltx/gr_gr_cog/tr.d018:trMA.Ode1C11.mode	@ltx/gr_gr_cog/miscellanea:misc.Mode4
ltx/gr_gr_cog/tr.d018:trMA.Ode1C11.ode	@ltx/gr_gr_cog/miscellanea:misc.Ode1
ltx/gr_gr_cog/tr.d018:trMA.Ode1C11.text	Νηστεύων ὁ Κύριος ἀνθρωπίνως, πρὸς ὑποτύπωσιν ἡμῶν, νικᾷ τὸν πειράζοντα, δεικνὺς τὸ ἡμέτερον, καὶ ὅρους ὑπογράφων ἡμῖν.
ltx/gr_gr_cog/tr.d018:trMA.Ode1C12.incipit	Μωσῆς ὁ θειότατος ἐν Σιναίῳ…
ltx/gr_gr_cog/tr.d018:trMA.Ode1C12.melody	@ltx/gr_gr_cog/he.h.m4:heHE.AsomaiSoiKyrie.name
ltx/gr_gr_cog/tr.d018:trMA.Ode1C12.mode	@ltx/gr_gr_cog/miscellanea:misc.Mode4
ltx/gr_gr_cog/tr.d018:trMA.Ode1C12.ode	@ltx/gr_gr_cog/miscellanea:misc.Ode1
ltx/gr_gr_cog/tr.d018:trMA.Ode1C12.text	Μωσῆς ὁ θειότατος ἐν Σιναίῳ, διʼ ἐγκρατείας τῷ Θεῷ, πρόσωπον πρὸς πρόσωπον, λαλεῖν κατηξίωται· Αὐτὸν πιστοὶ ζηλώσωμεν.
ltx/gr_gr_cog/tr.d018:trMA.Ode1C13.incipit	Ἱλάσθητι Κύριε τῷ λαῷ σου…
ltx/gr_gr_cog/tr.d018:trMA.Ode1C13.melody	@ltx/gr_gr_cog/he.h.m4:heHE.AsomaiSoiKyrie.name
ltx/gr_gr_cog/tr.d018:trMA.Ode1C13.mode	@ltx/gr_gr_cog/miscellanea:misc.Mode4
ltx/gr_gr_cog/tr.d018:trMA.Ode1C13.ode	@ltx/gr_gr_cog/miscellanea:misc.Ode1
ltx/gr_gr_cog/tr.d018:trMA.Ode1C13.text	Ἱλάσθητι Κύριε τῷ λαῷ σου, καὶ ἐπιβλέψας ὡς Θεός, ἱλέῳ σου ὄμματι, ἐπίσκεψαι ἅπαντας, τῷ πλήθει τοῦ ἐλέους σου.
ltx/gr_gr_cog/tr.d018:trMA.Ode1C1H.greekmelody	@ltx/gr_gr_cog/he.h.m4:heHE.AsomaiSoiKyrie.greekname
ltx/gr_gr_cog/tr.d018:trMA.Ode1C1H.incipit	@ltx/gr_gr_cog/he.h.m4:heHE.AsomaiSoiKyrie.incipit
ltx/gr_gr_cog/tr.d018:trMA.Ode1C1H.melody	@ltx/gr_gr_cog/he.h.m4:heHE.AsomaiSoiKyrie.melody
ltx/gr_gr_cog/tr.d018:trMA.Ode1C1H.mode	@ltx/gr_gr_cog/miscellanea:misc.Mode4
ltx/gr_gr_cog/tr.d018:trMA.Ode1C1H.ode	@ltx/gr_gr_cog/miscellanea:misc.Ode1
ltx/gr_gr_cog/tr.d018:trMA.Ode1C1H.text	@ltx/gr_gr_cog/he.h.m4:heHE.AsomaiSoiKyrie.text
ltx/gr_gr_cog/tr.d018:trMA.Ode1C1T.incipit	Σοὶ πάντες προστρέχομεν Θεοτόκε, ὡς…
ltx/gr_gr_cog/tr.d018:trMA.Ode1C1T.melody	@ltx/gr_gr_cog/he.h.m4:heHE.AsomaiSoiKyrie.name
ltx/gr_gr_cog/tr.d018:trMA.Ode1C1T.mode	@ltx/gr_gr_cog/miscellanea:misc.Mode4
ltx/gr_gr_cog/tr.d018:trMA.Ode1C1T.ode	@ltx/gr_gr_cog/miscellanea:misc.Ode1
ltx/gr_gr_cog/tr.d018:trMA.Ode1C1T.text	Σοὶ πάντες προστρέχομεν Θεοτόκε, ὡς ὑπερμάχῳ ἀσφαλεῖ, εἰς πρεσβείαν κινοῦντές σε, λυτρώσασθαι τὴν ποίμνην σου ἐκ πάσης περιστάσεως.
ltx/gr_gr_cog/tr.d018:trMA.Ode3C11.greekmelody	@ltx/gr_gr_cog/he.h.m4:heHE.EnKyrioTheoMou.greekname
ltx/gr_gr_cog/tr.d018:trMA.Ode3C11.incipit	Ὁ θαυμάσιος Ἐνώχ, διʼ ἐγκρατείας…
ltx/gr_gr_cog/tr.d018:trMA.Ode3C11.melody	@ltx/gr_gr_cog/he.h.m4:heHE.EnKyrioTheoMou.name
ltx/gr_gr_cog/tr.d018:trMA.Ode3C11.mode	@ltx/gr_gr_cog/miscellanea:misc.Mode4
ltx/gr_gr_cog/tr.d018:trMA.Ode3C11.ode	@ltx/gr_gr_cog/miscellanea:misc.Ode3
ltx/gr_gr_cog/tr.d018:trMA.Ode3C11.text	Ὁ θαυμάσιος Ἐνώχ, διʼ ἐγκρατείας μετετέθη ἐκ γῆς, αὐτὸν ζηλοτυποῦντες, μετατεθῶμεν ἐκ φθορᾶς πρὸς ζωήν.
ltx/gr_gr_cog/tr.d018:trMA.Ode3C12.incipit	Προσευχαῖς καὶ νηστείαις, τὸν Λυτρωτὴν…
ltx/gr_gr_cog/tr.d018:trMA.Ode3C12.melody	@ltx/gr_gr_cog/he.h.m4:heHE.EnKyrioTheoMou.name
ltx/gr_gr_cog/tr.d018:trMA.Ode3C12.mode	@ltx/gr_gr_cog/miscellanea:misc.Mode4
ltx/gr_gr_cog/tr.d018:trMA.Ode3C12.ode	@ltx/gr_gr_cog/miscellanea:misc.Ode3
ltx/gr_gr_cog/tr.d018:trMA.Ode3C12.text	Προσευχαῖς καὶ νηστείαις, τὸν Λυτρωτὴν ἱλεωσώμεθα· συγχαίρει γὰρ ὁ Κτίστης, τῇ μετανοίᾳ τῶν κτισμάτων αὐτοῦ.
ltx/gr_gr_cog/tr.d018:trMA.Ode3C13.incipit	Ἑτοιμάζου ὦ ψυχή, καὶ προκαθαίρου…
ltx/gr_gr_cog/tr.d018:trMA.Ode3C13.melody	@ltx/gr_gr_cog/he.h.m4:heHE.EnKyrioTheoMou.name
ltx/gr_gr_cog/tr.d018:trMA.Ode3C13.mode	@ltx/gr_gr_cog/miscellanea:misc.Mode4
ltx/gr_gr_cog/tr.d018:trMA.Ode3C13.ode	@ltx/gr_gr_cog/miscellanea:misc.Ode3
ltx/gr_gr_cog/tr.d018:trMA.Ode3C13.text	Ἑτοιμάζου ὦ ψυχή, καὶ προκαθαίρου, πρὸ τοῦ πάθους Χριστοῦ, ἵνα τῇ ἀναστάσει, πνευματικῶς συνεορτάσῃς αὐτῷ.
ltx/gr_gr_cog/tr.d018:trMA.Ode3C1H.greekmelody	@ltx/gr_gr_cog/he.h.m4:heHE.EnKyrioTheoMou.greekname
ltx/gr_gr_cog/tr.d018:trMA.Ode3C1H.incipit	@ltx/gr_gr_cog/he.h.m4:heHE.EnKyrioTheoMou.incipit
ltx/gr_gr_cog/tr.d018:trMA.Ode3C1H.melody	@ltx/gr_gr_cog/he.h.m4:heHE.EnKyrioTheoMou.melody
ltx/gr_gr_cog/tr.d018:trMA.Ode3C1H.mode	@ltx/gr_gr_cog/miscellanea:misc.Mode4
ltx/gr_gr_cog/tr.d018:trMA.Ode3C1H.ode	@ltx/gr_gr_cog/miscellanea:misc.Ode3
ltx/gr_gr_cog/tr.d018:trMA.Ode3C1H.text	@ltx/gr_gr_cog/he.h.m4:heHE.EnKyrioTheoMou.text
ltx/gr_gr_cog/tr.d018:trMA.Ode3C1T.incipit	Ὡς τεκοῦσα Θεόν, ὑπὲρ ἡμῶν…
ltx/gr_gr_cog/tr.d018:trMA.Ode3C1T.melody	@ltx/gr_gr_cog/he.h.m4:heHE.EnKyrioTheoMou.name
ltx/gr_gr_cog/tr.d018:trMA.Ode3C1T.mode	@ltx/gr_gr_cog/miscellanea:misc.Mode4
ltx/gr_gr_cog/tr.d018:trMA.Ode3C1T.ode	@ltx/gr_gr_cog/miscellanea:misc.Ode3
ltx/gr_gr_cog/tr.d018:trMA.Ode3C1T.text	Ὡς τεκοῦσα Θεόν, ὑπὲρ ἡμῶν ἀπαύστως πρέσβευε· πρὸς σὲ γὰρ Θεοτόκε, ἁμαρτωλοὶ καταφεύγομεν.
ltx/gr_gr_cog/tr.d018:trMA.Ode3C21.greekmelody	@ltx/gr_gr_cog/he.h.m2:heHE.EnPetraMeTisPisteos.greekname
ltx/gr_gr_cog/tr.d018:trMA.Ode3C21.incipit	Ἐξέτεινας παλάμας ἐν τῷ Σταυρῷ…
ltx/gr_gr_cog/tr.d018:trMA.Ode3C21.melody	@ltx/gr_gr_cog/he.h.m2:heHE.EnPetraMeTisPisteos.name
ltx/gr_gr_cog/tr.d018:trMA.Ode3C21.mode	@ltx/gr_gr_cog/miscellanea:misc.Mode2
ltx/gr_gr_cog/tr.d018:trMA.Ode3C21.ode	@ltx/gr_gr_cog/miscellanea:misc.Ode3
ltx/gr_gr_cog/tr.d018:trMA.Ode3C21.text	Ἐξέτεινας παλάμας ἐν τῷ Σταυρῷ σου, ἐνέκρωσας νεκρώσει σου τὴν κατάραν, ἐζώωσας τῷ πάθει σου τοὺς ἀνθρώπους· διὸ ὑμνοῦμέν σου, τὴν θείαν Σταύρωσιν, Ἰησοῦ φιλάνθρωπε ὁ Θεὸς ἡμῶν.
ltx/gr_gr_cog/tr.d018:trMA.Ode3C22.incipit	Τῇ βρώσει τῇ τοῦ ξύλου…
ltx/gr_gr_cog/tr.d018:trMA.Ode3C22.melody	@ltx/gr_gr_cog/he.h.m2:heHE.EnPetraMeTisPisteos.name
ltx/gr_gr_cog/tr.d018:trMA.Ode3C22.mode	@ltx/gr_gr_cog/miscellanea:misc.Mode2
ltx/gr_gr_cog/tr.d018:trMA.Ode3C22.ode	@ltx/gr_gr_cog/miscellanea:misc.Ode3
ltx/gr_gr_cog/tr.d018:trMA.Ode3C22.text	Τῇ βρώσει τῇ τοῦ ξύλου θανατωθέντες, τῷ ξύλῳ ἐζωώθημεν τοῦ Σταυροῦ σου. Αὐτὸν οὖν σοι προσάγομεν εἰς πρεσβείαν, χάριν καὶ ἔλεος, ἡμῖν κατάπεμψον, εὐεργέτα Δέσποτα πολυέλεε.
ltx/gr_gr_cog/tr.d018:trMA.Ode3C23.incipit	Τὰ πρόθυρα ἠνέῳκται τῆς νηστείας…
ltx/gr_gr_cog/tr.d018:trMA.Ode3C23.melody	@ltx/gr_gr_cog/he.h.m2:heHE.EnPetraMeTisPisteos.name
ltx/gr_gr_cog/tr.d018:trMA.Ode3C23.mode	@ltx/gr_gr_cog/miscellanea:misc.Mode2
ltx/gr_gr_cog/tr.d018:trMA.Ode3C23.ode	@ltx/gr_gr_cog/miscellanea:misc.Ode3
ltx/gr_gr_cog/tr.d018:trMA.Ode3C23.text	Τὰ πρόθυρα ἠνέῳκται τῆς νηστείας, τὸ στάδιον ἐγγίζει τῆς ἐγκρατείας, ζεούσῃ προθυμίᾳ διανιστῶμεν, ὑποδεξόμενοι, δῶρον θεόσδοτον, ἀναστέλλον καύσωνα παραπτώσεων.
ltx/gr_gr_cog/tr.d018:trMA.Ode3C24.incipit	Ὁ χρόνος ὁ μακάριος τῆς…
ltx/gr_gr_cog/tr.d018:trMA.Ode3C24.melody	@ltx/gr_gr_cog/he.h.m2:heHE.EnPetraMeTisPisteos.name
ltx/gr_gr_cog/tr.d018:trMA.Ode3C24.mode	@ltx/gr_gr_cog/miscellanea:misc.Mode2
ltx/gr_gr_cog/tr.d018:trMA.Ode3C24.ode	@ltx/gr_gr_cog/miscellanea:misc.Ode3
ltx/gr_gr_cog/tr.d018:trMA.Ode3C24.text	Ὁ χρόνος ὁ μακάριος τῆς νηστείας, ἀκτῖνας ἀποστίλβων τῆς μετανοίας, ἀνέτειλε, προσέλθωμεν φιλοτίμως, ἐκτιναξάμενοι, σκότος βαθύτατον, ῥαθυμίας ἅπαντες ἀγαλλόμενοι.
ltx/gr_gr_cog/tr.d018:trMA.Ode3C25.incipit	Νηστείαν ἁγιάσωμεν φιλοφρόνως, κηρύξωμεν ἐγκράτειαν…
ltx/gr_gr_cog/tr.d018:trMA.Ode3C25.melody	@ltx/gr_gr_cog/he.h.m2:heHE.EnPetraMeTisPisteos.name
ltx/gr_gr_cog/tr.d018:trMA.Ode3C25.mode	@ltx/gr_gr_cog/miscellanea:misc.Mode2
ltx/gr_gr_cog/tr.d018:trMA.Ode3C25.ode	@ltx/gr_gr_cog/miscellanea:misc.Ode3
ltx/gr_gr_cog/tr.d018:trMA.Ode3C25.text	Νηστείαν ἁγιάσωμεν φιλοφρόνως, κηρύξωμεν ἐγκράτειαν παθημάτων, βοήσωμεν ἐν δάκρυσι, τῷ Δεσπότῃ· Δὸς ἡμῖν Κύριε, χάριν συμπράττουσαν, εἰς τὰ σὰ θελήματα πολυέλεε.
ltx/gr_gr_cog/tr.d018:trMA.Ode3C26.incipit	Δεξάμενοι τὸ δώρημα τῆς νηστείας…
ltx/gr_gr_cog/tr.d018:trMA.Ode3C26.melody	@ltx/gr_gr_cog/he.h.m2:heHE.EnPetraMeTisPisteos.name
ltx/gr_gr_cog/tr.d018:trMA.Ode3C26.mode	@ltx/gr_gr_cog/miscellanea:misc.Mode2
ltx/gr_gr_cog/tr.d018:trMA.Ode3C26.ode	@ltx/gr_gr_cog/miscellanea:misc.Ode3
ltx/gr_gr_cog/tr.d018:trMA.Ode3C26.text	Δεξάμενοι τὸ δώρημα τῆς νηστείας, δοξάσωμεν τὸν δόντα εἰς σωτηρίαν, καὶ τοῦτο ἐργασώμεθα ἐπιπόνως, ἵνα τὴν ἄφεσιν, τῶν ἐπταισμένων ἡμῖν, ἐκ χειρὸς δεξώμεθα τοῦ ποιήσαντος.
ltx/gr_gr_cog/tr.d018:trMA.Ode3C2T.incipit	Κατεύνασον τὸν τάραχον τῶν παθῶν…
ltx/gr_gr_cog/tr.d018:trMA.Ode3C2T.melody	@ltx/gr_gr_cog/he.h.m2:heHE.EnPetraMeTisPisteos.name
ltx/gr_gr_cog/tr.d018:trMA.Ode3C2T.mode	@ltx/gr_gr_cog/miscellanea:misc.Mode2
ltx/gr_gr_cog/tr.d018:trMA.Ode3C2T.ode	@ltx/gr_gr_cog/miscellanea:misc.Ode3
ltx/gr_gr_cog/tr.d018:trMA.Ode3C2T.text	Κατεύνασον τὸν τάραχον τῶν παθῶν μου, θεράπευσον τὰ τραύματα τῆς ψυχῆς μου, ἐξέγειρον ἐξ ὕπνου με ῥαθυμίας, τῇ μεσιτείᾳ σου, τῇ προστασίᾳ σου, Παναγία Δέσποινα Μητροπάρθενε.
ltx/gr_gr_cog/tr.d018:trMA.Ode3C31.greekmelody	@ltx/gr_gr_cog/he.h.m2:heHE.SteirothentaMouTonNoun.greekname
ltx/gr_gr_cog/tr.d018:trMA.Ode3C31.incipit	Ὑψωθέντος σου Σωτήρ, ἑκουσίως ἐν…
ltx/gr_gr_cog/tr.d018:trMA.Ode3C31.melody	@ltx/gr_gr_cog/he.h.m2:heHE.SteirothentaMouTonNoun.name
ltx/gr_gr_cog/tr.d018:trMA.Ode3C31.mode	@ltx/gr_gr_cog/miscellanea:misc.Mode2
ltx/gr_gr_cog/tr.d018:trMA.Ode3C31.ode	@ltx/gr_gr_cog/miscellanea:misc.Ode3
ltx/gr_gr_cog/tr.d018:trMA.Ode3C31.text	Ὑψωθέντος σου Σωτήρ, ἑκουσίως ἐν Σταυρῷ, ἡ κτίσις πᾶσα, ἐδονήθη τῆς γῆς, καὶ ἐῤῥάγη τοῦ Ναοῦ τὸ καταπέτασμα.
ltx/gr_gr_cog/tr.d018:trMA.Ode3C32.incipit	Ἐμαστίχθης ἐν Σταυρῷ ὦ Ἰησοῦ…
ltx/gr_gr_cog/tr.d018:trMA.Ode3C32.melody	@ltx/gr_gr_cog/he.h.m2:heHE.SteirothentaMouTonNoun.name
ltx/gr_gr_cog/tr.d018:trMA.Ode3C32.mode	@ltx/gr_gr_cog/miscellanea:misc.Mode2
ltx/gr_gr_cog/tr.d018:trMA.Ode3C32.ode	@ltx/gr_gr_cog/miscellanea:misc.Ode3
ltx/gr_gr_cog/tr.d018:trMA.Ode3C32.text	Ἐμαστίχθης ἐν Σταυρῷ ὦ Ἰησοῦ μου διʼ ἐμέ, καὶ ἐκεντήθης, τὴν πλευρὰν ἀγαθέ· ὅθεν πίστει προσκυνῶ, τὸ θεῖον κράτος σου.
ltx/gr_gr_cog/tr.d018:trMA.Ode3C3A1.incipit	Τῆς νηστείας τὸν καιρόν, τῇ…
ltx/gr_gr_cog/tr.d018:trMA.Ode3C3A1.melody	@ltx/gr_gr_cog/he.h.m2:heHE.SteirothentaMouTonNoun.name
ltx/gr_gr_cog/tr.d018:trMA.Ode3C3A1.mode	@ltx/gr_gr_cog/miscellanea:misc.Mode2
ltx/gr_gr_cog/tr.d018:trMA.Ode3C3A1.ode	@ltx/gr_gr_cog/miscellanea:misc.Ode3
ltx/gr_gr_cog/tr.d018:trMA.Ode3C3A1.text	Τῆς νηστείας τὸν καιρόν, τῇ δυνάμει σου Χριστέ, καθαγιάσας, σῶσον πάντας ἡμᾶς, τῶν παγίδων τοῦ ἐχθροῦ, τοὺς προσκυνοῦντάς σε.
ltx/gr_gr_cog/tr.d018:trMA.Ode3C3H.greekmelody	@ltx/gr_gr_cog/he.h.m2:heHE.SteirothentaMouTonNoun.greekname
ltx/gr_gr_cog/tr.d018:trMA.Ode3C3H.incipit	@ltx/gr_gr_cog/he.h.m2:heHE.SteirothentaMouTonNoun.incipit
ltx/gr_gr_cog/tr.d018:trMA.Ode3C3H.melody	@ltx/gr_gr_cog/he.h.m2:heHE.SteirothentaMouTonNoun.melody
ltx/gr_gr_cog/tr.d018:trMA.Ode3C3H.mode	@ltx/gr_gr_cog/miscellanea:misc.Mode2
ltx/gr_gr_cog/tr.d018:trMA.Ode3C3H.ode	@ltx/gr_gr_cog/miscellanea:misc.Ode3
ltx/gr_gr_cog/tr.d018:trMA.Ode3C3H.text	@ltx/gr_gr_cog/he.h.m2:heHE.SteirothentaMouTonNoun.text
ltx/gr_gr_cog/tr.d018:trMA.Ode3C3T.incipit	Ἀκατάληπτόν ἐστι τὸ μυστήριον σεμνή…
ltx/gr_gr_cog/tr.d018:trMA.Ode3C3T.melody	@ltx/gr_gr_cog/he.h.m2:heHE.SteirothentaMouTonNoun.name
ltx/gr_gr_cog/tr.d018:trMA.Ode3C3T.mode	@ltx/gr_gr_cog/miscellanea:misc.Mode2
ltx/gr_gr_cog/tr.d018:trMA.Ode3C3T.ode	@ltx/gr_gr_cog/miscellanea:misc.Ode3
ltx/gr_gr_cog/tr.d018:trMA.Ode3C3T.text	Ἀκατάληπτόν ἐστι τὸ μυστήριον σεμνή, τῆς σῆς λοχείας· τίκτεις γὰρ Μαριάμ, ἀπειράνδρως τὸν Θεόν, καὶ μένεις ἄφθορος.
ltx/gr_gr_cog/tr.d018:trMA.Ode3C3Tr.incipit	Κλίνας γόνυ ἐν τῇ γῇ…
ltx/gr_gr_cog/tr.d018:trMA.Ode3C3Tr.melody	@ltx/gr_gr_cog/he.h.m2:heHE.SteirothentaMouTonNoun.name
ltx/gr_gr_cog/tr.d018:trMA.Ode3C3Tr.mode	@ltx/gr_gr_cog/miscellanea:misc.Mode2
ltx/gr_gr_cog/tr.d018:trMA.Ode3C3Tr.ode	@ltx/gr_gr_cog/miscellanea:misc.Ode3
ltx/gr_gr_cog/tr.d018:trMA.Ode3C3Tr.text	Κλίνας γόνυ ἐν τῇ γῇ, τὸν Πατέρα προσκυνῶ, Υἱὸν δοξάζω, καὶ τὸ πνεῦμα ἀνυμνῶ, τὴν μονόθελον ἀρχήν, καὶ τρισυπόστατον.
ltx/gr_gr_cog/tr.d018:trMA.Ode4C11.greekmelody	@ltx/gr_gr_cog/he.h.m4:heHE.EisakikoaTinAkoinSou.greekname
ltx/gr_gr_cog/tr.d018:trMA.Ode4C11.incipit	Ὁ Ἀβραὰμ διʼ ἀρετῆς καὶ…
ltx/gr_gr_cog/tr.d018:trMA.Ode4C11.melody	@ltx/gr_gr_cog/he.h.m4:heHE.EisakikoaTinAkoinSou.name
ltx/gr_gr_cog/tr.d018:trMA.Ode4C11.mode	@ltx/gr_gr_cog/miscellanea:misc.Mode4
ltx/gr_gr_cog/tr.d018:trMA.Ode4C11.ode	@ltx/gr_gr_cog/miscellanea:misc.Ode4
ltx/gr_gr_cog/tr.d018:trMA.Ode4C11.text	Ὁ Ἀβραὰμ διʼ ἀρετῆς καὶ φιλοξενίας, τὴν Τριάδα ὑπεδέξατο, ἀγγελικῶς ἐνδημήσασαν.
ltx/gr_gr_cog/tr.d018:trMA.Ode4C12.incipit	Πλοῦτος ἄσυλος τῆς ἐγκρατείας ἐστί…
ltx/gr_gr_cog/tr.d018:trMA.Ode4C12.melody	@ltx/gr_gr_cog/he.h.m4:heHE.EisakikoaTinAkoinSou.name
ltx/gr_gr_cog/tr.d018:trMA.Ode4C12.mode	@ltx/gr_gr_cog/miscellanea:misc.Mode4
ltx/gr_gr_cog/tr.d018:trMA.Ode4C12.ode	@ltx/gr_gr_cog/miscellanea:misc.Ode4
ltx/gr_gr_cog/tr.d018:trMA.Ode4C12.text	Πλοῦτος ἄσυλος τῆς ἐγκρατείας ἐστί, τὸ δῶρον, καὶ ὁ τούτῳ πλουτιζόμενος, καταπλουτήσει Θεότητα
ltx/gr_gr_cog/tr.d018:trMA.Ode4C13.incipit	Δεῦτε κλαύσωμεν ἅμα τῷ λόγῳ…
ltx/gr_gr_cog/tr.d018:trMA.Ode4C13.melody	@ltx/gr_gr_cog/he.h.m4:heHE.EisakikoaTinAkoinSou.name
ltx/gr_gr_cog/tr.d018:trMA.Ode4C13.mode	@ltx/gr_gr_cog/miscellanea:misc.Mode4
ltx/gr_gr_cog/tr.d018:trMA.Ode4C13.ode	@ltx/gr_gr_cog/miscellanea:misc.Ode4
ltx/gr_gr_cog/tr.d018:trMA.Ode4C13.text	Δεῦτε κλαύσωμεν ἅμα τῷ λόγῳ, πίστει βοῶντες· ὁ Θεὸς ἡμῖν Ἱλάσθητι, τοῖς πολλὰ πλημμελήσασι.
ltx/gr_gr_cog/tr.d018:trMA.Ode4C1T.incipit	Μήτηρ ἄχραντε εὐλογημένη, ἁγνὴ Παρθένε…
ltx/gr_gr_cog/tr.d018:trMA.Ode4C1T.melody	@ltx/gr_gr_cog/he.h.m4:heHE.EisakikoaTinAkoinSou.name
ltx/gr_gr_cog/tr.d018:trMA.Ode4C1T.mode	@ltx/gr_gr_cog/miscellanea:misc.Mode4
ltx/gr_gr_cog/tr.d018:trMA.Ode4C1T.ode	@ltx/gr_gr_cog/miscellanea:misc.Ode4
ltx/gr_gr_cog/tr.d018:trMA.Ode4C1T.text	Μήτηρ ἄχραντε εὐλογημένη, ἁγνὴ Παρθένε, τὸν Υἱόν σου καὶ Θεὸν ἡμῶν, ὑπὲρ τοῦ κόσμου ἱκέτευε.
ltx/gr_gr_cog/tr.d018:trMA.Ode5C11.greekmelody	@ltx/gr_gr_cog/he.h.m4:heHE.OAnateilasToFos.greekname
ltx/gr_gr_cog/tr.d018:trMA.Ode5C11.incipit	Νηστεύσας πάλαι Μωσῆς, ἐν Σιναίῳ…
ltx/gr_gr_cog/tr.d018:trMA.Ode5C11.melody	@ltx/gr_gr_cog/he.h.m4:heHE.OAnateilasToFos.name
ltx/gr_gr_cog/tr.d018:trMA.Ode5C11.mode	@ltx/gr_gr_cog/miscellanea:misc.Mode4
ltx/gr_gr_cog/tr.d018:trMA.Ode5C11.ode	@ltx/gr_gr_cog/miscellanea:misc.Ode5
ltx/gr_gr_cog/tr.d018:trMA.Ode5C11.text	Νηστεύσας πάλαι Μωσῆς, ἐν Σιναίῳ τῷ ὄρει, θεόπτης ἀνεδείχθη, καὶ Ἠλίας ἔμπυρος, ἁρματηλάτης ἀνεφέρετο.
ltx/gr_gr_cog/tr.d018:trMA.Ode5C12.incipit	Διὰ νηστείας ποτέ, ὁ σοφὸς…
ltx/gr_gr_cog/tr.d018:trMA.Ode5C12.melody	@ltx/gr_gr_cog/he.h.m4:heHE.OAnateilasToFos.name
ltx/gr_gr_cog/tr.d018:trMA.Ode5C12.mode	@ltx/gr_gr_cog/miscellanea:misc.Mode4
ltx/gr_gr_cog/tr.d018:trMA.Ode5C12.ode	@ltx/gr_gr_cog/miscellanea:misc.Ode5
ltx/gr_gr_cog/tr.d018:trMA.Ode5C12.text	Διὰ νηστείας ποτέ, ὁ σοφὸς Ἠσαΐας τοῦ ἄνθρακος ἐκείνου, τῇ λαβίδι γεύεται, ὅτε χειλέων αὐτοῦ καθήψατο.
ltx/gr_gr_cog/tr.d018:trMA.Ode5C13.incipit	Νηστεύσας πρὶν ὁ Δανιήλ, καὶ…
ltx/gr_gr_cog/tr.d018:trMA.Ode5C13.melody	@ltx/gr_gr_cog/he.h.m4:heHE.OAnateilasToFos.name
ltx/gr_gr_cog/tr.d018:trMA.Ode5C13.mode	@ltx/gr_gr_cog/miscellanea:misc.Mode4
ltx/gr_gr_cog/tr.d018:trMA.Ode5C13.ode	@ltx/gr_gr_cog/miscellanea:misc.Ode5
ltx/gr_gr_cog/tr.d018:trMA.Ode5C13.text	Νηστεύσας πρὶν ὁ Δανιήλ, καὶ οἱ τρεῖς Παῖδες ἅμα, τὰς μύλας τῶν λεόντων θλάσαντες, καιομένης φλογὸς κατεπάτησαν.
ltx/gr_gr_cog/tr.d018:trMA.Ode5C1T.incipit	Θεογεννῆτορ Ἁγνή, Θεὸν ἐν γαστρί…
ltx/gr_gr_cog/tr.d018:trMA.Ode5C1T.melody	@ltx/gr_gr_cog/he.h.m4:heHE.OAnateilasToFos.name
ltx/gr_gr_cog/tr.d018:trMA.Ode5C1T.mode	@ltx/gr_gr_cog/miscellanea:misc.Mode4
ltx/gr_gr_cog/tr.d018:trMA.Ode5C1T.ode	@ltx/gr_gr_cog/miscellanea:misc.Ode5
ltx/gr_gr_cog/tr.d018:trMA.Ode5C1T.text	Θεογεννῆτορ Ἁγνή, Θεὸν ἐν γαστρί σου, βαστάσασα ἀφθόρως, φύλαττε τὴν ποίμνην σου, καὶ διατήρησον ἄτρωτον
ltx/gr_gr_cog/tr.d018:trMA.Ode6C11.greekmelody	@ltx/gr_gr_cog/he.h.m4:heHE.OsIonanTonProfitin.greekname
ltx/gr_gr_cog/tr.d018:trMA.Ode6C11.incipit	Τὸν Ἰωνᾶν ἐν τῷ κήτει…
ltx/gr_gr_cog/tr.d018:trMA.Ode6C11.melody	@ltx/gr_gr_cog/he.h.m4:heHE.OsIonanTonProfitin.name
ltx/gr_gr_cog/tr.d018:trMA.Ode6C11.mode	@ltx/gr_gr_cog/miscellanea:misc.Mode4
ltx/gr_gr_cog/tr.d018:trMA.Ode6C11.ode	@ltx/gr_gr_cog/miscellanea:misc.Ode6
ltx/gr_gr_cog/tr.d018:trMA.Ode6C11.text	Τὸν Ἰωνᾶν ἐν τῷ κήτει, ἡ σεμνὴ διασῴζει νηστεία ποτέ. Νηστεύσωμεν οὖν ἐκ καρδίας, καὶ φύγωμεν ἐκείνην, τὴν ἐν γεέννῃ φθοράν.
ltx/gr_gr_cog/tr.d018:trMA.Ode6C12.incipit	Οἱ Νινευῖται δὲ πάλιν, τὴν…
ltx/gr_gr_cog/tr.d018:trMA.Ode6C12.melody	@ltx/gr_gr_cog/he.h.m4:heHE.OsIonanTonProfitin.name
ltx/gr_gr_cog/tr.d018:trMA.Ode6C12.mode	@ltx/gr_gr_cog/miscellanea:misc.Mode4
ltx/gr_gr_cog/tr.d018:trMA.Ode6C12.ode	@ltx/gr_gr_cog/miscellanea:misc.Ode6
ltx/gr_gr_cog/tr.d018:trMA.Ode6C12.text	Οἱ Νινευῖται δὲ πάλιν, τὴν ὀργὴν τοῦ Θεοῦ μετεποίησαν, θερμῇ μετανοίᾳ καὶ πόθῳ, αὐτοὺς νῦν ἐκ πόθου, πάντες ζηλώσωμεν.
ltx/gr_gr_cog/tr.d018:trMA.Ode6C13.incipit	Ἡ ἐνεστῶσα νηστεία, συγκαλεῖται ἡμᾶς…
ltx/gr_gr_cog/tr.d018:trMA.Ode6C13.melody	@ltx/gr_gr_cog/he.h.m4:heHE.OsIonanTonProfitin.name
ltx/gr_gr_cog/tr.d018:trMA.Ode6C13.mode	@ltx/gr_gr_cog/miscellanea:misc.Mode4
ltx/gr_gr_cog/tr.d018:trMA.Ode6C13.ode	@ltx/gr_gr_cog/miscellanea:misc.Ode6
ltx/gr_gr_cog/tr.d018:trMA.Ode6C13.text	Ἡ ἐνεστῶσα νηστεία, συγκαλεῖται ἡμᾶς εἰς μετάνοιαν· προσδράμωμεν, οὖν ἐκ πόθου, καὶ γνῶμεν, τί τὸ δῶρον τῆς ἐγκρατείας ἐστίν.
ltx/gr_gr_cog/tr.d018:trMA.Ode6C1H.greekmelody	@ltx/gr_gr_cog/he.h.m4:heHE.OsIonanTonProfitin.greekname
ltx/gr_gr_cog/tr.d018:trMA.Ode6C1H.incipit	@ltx/gr_gr_cog/he.h.m4:heHE.OsIonanTonProfitin.incipit
ltx/gr_gr_cog/tr.d018:trMA.Ode6C1H.melody	@ltx/gr_gr_cog/he.h.m4:heHE.OsIonanTonProfitin.melody
ltx/gr_gr_cog/tr.d018:trMA.Ode6C1H.mode	@ltx/gr_gr_cog/miscellanea:misc.Mode4
ltx/gr_gr_cog/tr.d018:trMA.Ode6C1H.ode	@ltx/gr_gr_cog/miscellanea:misc.Ode6
ltx/gr_gr_cog/tr.d018:trMA.Ode6C1H.text	@ltx/gr_gr_cog/he.h.m4:heHE.OsIonanTonProfitin.text
ltx/gr_gr_cog/tr.d018:trMA.Ode6C1T.incipit	Ἡ ἀφράστως τεκοῦσα, τὸν Σωτῆρα…
ltx/gr_gr_cog/tr.d018:trMA.Ode6C1T.melody	@ltx/gr_gr_cog/he.h.m4:heHE.OsIonanTonProfitin.name
ltx/gr_gr_cog/tr.d018:trMA.Ode6C1T.mode	@ltx/gr_gr_cog/miscellanea:misc.Mode4
ltx/gr_gr_cog/tr.d018:trMA.Ode6C1T.ode	@ltx/gr_gr_cog/miscellanea:misc.Ode6
ltx/gr_gr_cog/tr.d018:trMA.Ode6C1T.text	Ἡ ἀφράστως τεκοῦσα, τὸν Σωτῆρα τοῦ κόσμου, Χριστὸν τὸν Θεὸν ἡμῶν, αὐτὸν δυσωποῦσα μὴ παύσῃ, τὸ γένος ἅπαν σῶσαι τῶν ἀνυμνούντων σε.
ltx/gr_gr_cog/tr.d018:trMA.Ode7C11.greekmelody	@ltx/gr_gr_cog/he.h.m4:heHE.OTonPateronTheos.greekname
ltx/gr_gr_cog/tr.d018:trMA.Ode7C11.incipit	Γενώμεθα καὶ ἡμεῖς, ὡς ὁ…
ltx/gr_gr_cog/tr.d018:trMA.Ode7C11.melody	@ltx/gr_gr_cog/he.h.m4:heHE.OTonPateronTheos.name
ltx/gr_gr_cog/tr.d018:trMA.Ode7C11.mode	@ltx/gr_gr_cog/miscellanea:misc.Mode4
ltx/gr_gr_cog/tr.d018:trMA.Ode7C11.ode	@ltx/gr_gr_cog/miscellanea:misc.Ode7
ltx/gr_gr_cog/tr.d018:trMA.Ode7C11.text	Γενώμεθα καὶ ἡμεῖς, ὡς ὁ Δανιὴλ ἐκεῖνος, ὁ τοὺς λέοντας ποτέ, διὰ νηστείας ἐν λάκκῳ, ἐξημερώσας βρύχοντας.
ltx/gr_gr_cog/tr.d018:trMA.Ode7C12.incipit	Τοὺς νεανίας τοὺς τρεῖς, ζηλώσωμεν…
ltx/gr_gr_cog/tr.d018:trMA.Ode7C12.melody	@ltx/gr_gr_cog/he.h.m4:heHE.OTonPateronTheos.name
ltx/gr_gr_cog/tr.d018:trMA.Ode7C12.mode	@ltx/gr_gr_cog/miscellanea:misc.Mode4
ltx/gr_gr_cog/tr.d018:trMA.Ode7C12.ode	@ltx/gr_gr_cog/miscellanea:misc.Ode7
ltx/gr_gr_cog/tr.d018:trMA.Ode7C12.text	Τοὺς νεανίας τοὺς τρεῖς, ζηλώσωμεν ἐν φόβῳ, ἵνα φύγωμεν, καὶ τὸ πῦρ τῆς γεέννης, ὡς οὗτοι τὴν Βαβυλῶνος κάμινον.
ltx/gr_gr_cog/tr.d018:trMA.Ode7C13.incipit	Νηστεύσωμεν καὶ ἡμεῖς, ἐν καθαρᾷ…
ltx/gr_gr_cog/tr.d018:trMA.Ode7C13.melody	@ltx/gr_gr_cog/he.h.m4:heHE.OTonPateronTheos.name
ltx/gr_gr_cog/tr.d018:trMA.Ode7C13.mode	@ltx/gr_gr_cog/miscellanea:misc.Mode4
ltx/gr_gr_cog/tr.d018:trMA.Ode7C13.ode	@ltx/gr_gr_cog/miscellanea:misc.Ode7
ltx/gr_gr_cog/tr.d018:trMA.Ode7C13.text	Νηστεύσωμεν καὶ ἡμεῖς, ἐν καθαρᾷ τῇ καρδίᾳ, καὶ ἁγνίσωμεν σῶμα, καὶ ὅλον ὅλως τὸ πνεῦμα, Θεῷ καθιερώσωμεν.
ltx/gr_gr_cog/tr.d018:trMA.Ode7C1T.incipit	Παρθενομῆτορ Ἁγνή, τὸν ἐκ σοῦ…
ltx/gr_gr_cog/tr.d018:trMA.Ode7C1T.melody	@ltx/gr_gr_cog/he.h.m4:heHE.OTonPateronTheos.name
ltx/gr_gr_cog/tr.d018:trMA.Ode7C1T.mode	@ltx/gr_gr_cog/miscellanea:misc.Mode4
ltx/gr_gr_cog/tr.d018:trMA.Ode7C1T.ode	@ltx/gr_gr_cog/miscellanea:misc.Ode7
ltx/gr_gr_cog/tr.d018:trMA.Ode7C1T.text	Παρθενομῆτορ Ἁγνή, τὸν ἐκ σοῦ σαρκωθέντα, προαιώνιον Λόγον, ἐκδυσωποῦσα μὴ παύσῃ, σωθῆναι τὰς ψυχὰς ἡμῶν.
ltx/gr_gr_cog/tr.d018:trMA.Ode8C11.greekmelody	@ltx/gr_gr_cog/he.h.m4:heHE.TonVasileaChriston.greekname
ltx/gr_gr_cog/tr.d018:trMA.Ode8C11.incipit	Νηστεύσας πρὶν Ἰωσήφ, μίξιν ἔφυγε…
ltx/gr_gr_cog/tr.d018:trMA.Ode8C11.melody	@ltx/gr_gr_cog/he.h.m4:heHE.TonVasileaChriston.name
ltx/gr_gr_cog/tr.d018:trMA.Ode8C11.mode	@ltx/gr_gr_cog/miscellanea:misc.Mode4
ltx/gr_gr_cog/tr.d018:trMA.Ode8C11.ode	@ltx/gr_gr_cog/miscellanea:misc.Ode8
ltx/gr_gr_cog/tr.d018:trMA.Ode8C11.text	Νηστεύσας πρὶν Ἰωσήφ, μίξιν ἔφυγε παρανόμου γυναίου, καὶ βασιλείας ἔτυχε· διὸ καὶ ἡμεῖς σβέσωμεν, διὰ νηστείας τὰ πεπυρωμένα βέλη, τοῦ ἐχθροῦ Βελίαρ.
ltx/gr_gr_cog/tr.d018:trMA.Ode8C12.incipit	Διὰ νηστείας Δαυΐδ, νίκην ἐστήσατο…
ltx/gr_gr_cog/tr.d018:trMA.Ode8C12.melody	@ltx/gr_gr_cog/he.h.m4:heHE.TonVasileaChriston.name
ltx/gr_gr_cog/tr.d018:trMA.Ode8C12.mode	@ltx/gr_gr_cog/miscellanea:misc.Mode4
ltx/gr_gr_cog/tr.d018:trMA.Ode8C12.ode	@ltx/gr_gr_cog/miscellanea:misc.Ode8
ltx/gr_gr_cog/tr.d018:trMA.Ode8C12.text	Διὰ νηστείας Δαυΐδ, νίκην ἐστήσατο κατὰ τοῦ ἀλλοφύλου, καὶ βασιλείαν εὕρατο· διὸ καὶ ἡμεῖς λάβωμεν, διʼ ἐγκρατείας νίκην κατʼ ἐχθρῶν καὶ ἐν Κυρίῳ στεφανωθῶμεν.
ltx/gr_gr_cog/tr.d018:trMA.Ode8C13.incipit	Φυλάξωμεν καὶ ἡμεῖς, τὰς ἀρετὰς…
ltx/gr_gr_cog/tr.d018:trMA.Ode8C13.melody	@ltx/gr_gr_cog/he.h.m4:heHE.TonVasileaChriston.name
ltx/gr_gr_cog/tr.d018:trMA.Ode8C13.mode	@ltx/gr_gr_cog/miscellanea:misc.Mode4
ltx/gr_gr_cog/tr.d018:trMA.Ode8C13.ode	@ltx/gr_gr_cog/miscellanea:misc.Ode8
ltx/gr_gr_cog/tr.d018:trMA.Ode8C13.text	Φυλάξωμεν καὶ ἡμεῖς, τὰς ἀρετὰς αὐτῶν, τοῦ Ἰὼβ τὴν ἀνδρείαν, τοῦ Ἰακὼβ τὸ ἄπλαστον, τὴν πίστιν Ἀβραάμ, τὴν σωφροσύνην τὴν τοῦ Ἰωσήφ, καὶ τοῦ Δαυῒδ τὰς ἀριστείας.
ltx/gr_gr_cog/tr.d018:trMA.Ode8C1H.greekmelody	@ltx/gr_gr_cog/he.h.m4:heHE.TonVasileaChriston.greekname
ltx/gr_gr_cog/tr.d018:trMA.Ode8C1H.incipit	@ltx/gr_gr_cog/he.h.m4:heHE.TonVasileaChriston.incipit
ltx/gr_gr_cog/tr.d018:trMA.Ode8C1H.melody	@ltx/gr_gr_cog/he.h.m4:heHE.TonVasileaChriston.melody
ltx/gr_gr_cog/tr.d018:trMA.Ode8C1H.mode	@ltx/gr_gr_cog/miscellanea:misc.Mode4
ltx/gr_gr_cog/tr.d018:trMA.Ode8C1H.ode	@ltx/gr_gr_cog/miscellanea:misc.Ode8
ltx/gr_gr_cog/tr.d018:trMA.Ode8C1H.text	@ltx/gr_gr_cog/he.h.m4:heHE.TonVasileaChriston.text
ltx/gr_gr_cog/tr.d018:trMA.Ode8C1T.incipit	Τὸν Βασιλέα Χριστόν, ὃν ἡμῖν…
ltx/gr_gr_cog/tr.d018:trMA.Ode8C1T.melody	@ltx/gr_gr_cog/he.h.m4:heHE.TonVasileaChriston.name
ltx/gr_gr_cog/tr.d018:trMA.Ode8C1T.mode	@ltx/gr_gr_cog/miscellanea:misc.Mode4
ltx/gr_gr_cog/tr.d018:trMA.Ode8C1T.ode	@ltx/gr_gr_cog/miscellanea:misc.Ode8
ltx/gr_gr_cog/tr.d018:trMA.Ode8C1T.text	Τὸν Βασιλέα Χριστόν, ὃν ἡμῖν ἔτεκεν ἡ Παρθένος Μαρία καὶ μετὰ τόκον ἔμεινε παρθένος ἁγνή, πάντα τὰ ἔργα ὑμνεῖτε τὸν Κύριον.
ltx/gr_gr_cog/tr.d018:trMA.Ode8C21.greekmelody	@ltx/gr_gr_cog/he.h.m2:heHE.TonEnKaminoTouPyros.greekname
ltx/gr_gr_cog/tr.d018:trMA.Ode8C21.incipit	Σταυροφανῶς ὁ Μωϋσῆς, τὰς παλάμας…
ltx/gr_gr_cog/tr.d018:trMA.Ode8C21.melody	@ltx/gr_gr_cog/he.h.m2:heHE.TonEnKaminoTouPyros.name
ltx/gr_gr_cog/tr.d018:trMA.Ode8C21.mode	@ltx/gr_gr_cog/miscellanea:misc.Mode2
ltx/gr_gr_cog/tr.d018:trMA.Ode8C21.ode	@ltx/gr_gr_cog/miscellanea:misc.Ode8
ltx/gr_gr_cog/tr.d018:trMA.Ode8C21.text	Σταυροφανῶς ὁ Μωϋσῆς, τὰς παλάμας ἀνυψῶν ἐπὶ τοῦ ὄρους, τοὺς ἐχθροὺς ἐτροποῦτο, σὺ δὲ Σωτὴρ ἐν Σταυρῷ, τὰς χεῖρας ἐκτείνας ἐνέκρωσας, τὴν ὀλεθροτόκον, τοῦ ᾍδου τυραννίδα.
ltx/gr_gr_cog/tr.d018:trMA.Ode8C22.incipit	Ἥλοις παγεὶς ἐπὶ Σταυροῦ, καὶ…
ltx/gr_gr_cog/tr.d018:trMA.Ode8C22.melody	@ltx/gr_gr_cog/he.h.m2:heHE.TonEnKaminoTouPyros.name
ltx/gr_gr_cog/tr.d018:trMA.Ode8C22.mode	@ltx/gr_gr_cog/miscellanea:misc.Mode2
ltx/gr_gr_cog/tr.d018:trMA.Ode8C22.ode	@ltx/gr_gr_cog/miscellanea:misc.Ode8
ltx/gr_gr_cog/tr.d018:trMA.Ode8C22.text	Ἥλοις παγεὶς ἐπὶ Σταυροῦ, καὶ πλευρὰν διανυγείς, Χριστὲ Σωτήρ μου, τῆς κατάρας ἐῤῥύσω τοὺς γηγενεῖς, καὶ χαρᾶς ἀλήκτου, μετόχους ἀνέδειξας· ὅθεν εὐλογοῦμεν, τὴν σὴν φιλανθρωπίαν.
ltx/gr_gr_cog/tr.d018:trMA.Ode8C23.incipit	Τῆς ἐγκρατείας ὁ καιρός, ἀνατείλας…
ltx/gr_gr_cog/tr.d018:trMA.Ode8C23.melody	@ltx/gr_gr_cog/he.h.m2:heHE.TonEnKaminoTouPyros.name
ltx/gr_gr_cog/tr.d018:trMA.Ode8C23.mode	@ltx/gr_gr_cog/miscellanea:misc.Mode2
ltx/gr_gr_cog/tr.d018:trMA.Ode8C23.ode	@ltx/gr_gr_cog/miscellanea:misc.Ode8
ltx/gr_gr_cog/tr.d018:trMA.Ode8C23.text	Τῆς ἐγκρατείας ὁ καιρός, ἀνατείλας νοητῶς καταφωτίζει, τῆς ψυχῆς τὰς αἰσθήσεις, καὶ παθῶν τὴν ἀχλὺν ἐλαύνει· διὸ ἀσπασώμεθα, τοῦτον ἐκ καρδίας, Χριστόν ὑπερυψοῦντες.
ltx/gr_gr_cog/tr.d018:trMA.Ode8C24.incipit	Πάθη ὀλέθρια ψυχῆς, ἡδονὰς θανατηφόρους…
ltx/gr_gr_cog/tr.d018:trMA.Ode8C24.melody	@ltx/gr_gr_cog/he.h.m2:heHE.TonEnKaminoTouPyros.name
ltx/gr_gr_cog/tr.d018:trMA.Ode8C24.mode	@ltx/gr_gr_cog/miscellanea:misc.Mode2
ltx/gr_gr_cog/tr.d018:trMA.Ode8C24.ode	@ltx/gr_gr_cog/miscellanea:misc.Ode8
ltx/gr_gr_cog/tr.d018:trMA.Ode8C24.text	Πάθη ὀλέθρια ψυχῆς, ἡδονὰς θανατηφόρους νηστεία θανατοῖ, καὶ τῷ ὄντι ἐν καταστάσει ποιεῖ, καρδίας ὁρμὰς καὶ κινήματα· ταύτην οὖν ἐν πίστει, δεξώμεθα προθύμως.
ltx/gr_gr_cog/tr.d018:trMA.Ode8C25.incipit	Οὐχὶ νηστείας ἀπαρχήν, τὴν παροῦσαν…
ltx/gr_gr_cog/tr.d018:trMA.Ode8C25.melody	@ltx/gr_gr_cog/he.h.m2:heHE.TonEnKaminoTouPyros.name
ltx/gr_gr_cog/tr.d018:trMA.Ode8C25.mode	@ltx/gr_gr_cog/miscellanea:misc.Mode2
ltx/gr_gr_cog/tr.d018:trMA.Ode8C25.ode	@ltx/gr_gr_cog/miscellanea:misc.Ode8
ltx/gr_gr_cog/tr.d018:trMA.Ode8C25.text	Οὐχὶ νηστείας ἀπαρχήν, τὴν παροῦσαν ἱερὰν πιστοὶ ἡμέραν, ἐπιστάμενοι, ταύτην εἰλικρινεῖ λογισμῷ, τιμῶμεν, ἀλλʼ εἴσοδον λέγοντες, καὶ τῶν τῆς νηστείας, παρείσβασιν προθύρων.
ltx/gr_gr_cog/tr.d018:trMA.Ode8C26.incipit	Προδεξιοῦται δεξιῶς, τὴν φιλόθεον ψυχὴν…
ltx/gr_gr_cog/tr.d018:trMA.Ode8C26.melody	@ltx/gr_gr_cog/he.h.m2:heHE.TonEnKaminoTouPyros.name
ltx/gr_gr_cog/tr.d018:trMA.Ode8C26.mode	@ltx/gr_gr_cog/miscellanea:misc.Mode2
ltx/gr_gr_cog/tr.d018:trMA.Ode8C26.ode	@ltx/gr_gr_cog/miscellanea:misc.Ode8
ltx/gr_gr_cog/tr.d018:trMA.Ode8C26.text	Προδεξιοῦται δεξιῶς, τὴν φιλόθεον ψυχὴν τοῖς προοιμίοις, ἡ καλλίστη νηστεία, προκαθαρσίων γερῶν, οἷα βαθμίσι καὶ κλίμακι, ταύτῃ προστεθεῖσα τὴν σήμερον ἡμέραν.
ltx/gr_gr_cog/tr.d018:trMA.Ode8C2T.incipit	Ἄνοιξον κρούουσιν ἡμῖν, καὶ τὸ…
ltx/gr_gr_cog/tr.d018:trMA.Ode8C2T.melody	@ltx/gr_gr_cog/he.h.m2:heHE.TonEnKaminoTouPyros.name
ltx/gr_gr_cog/tr.d018:trMA.Ode8C2T.mode	@ltx/gr_gr_cog/miscellanea:misc.Mode2
ltx/gr_gr_cog/tr.d018:trMA.Ode8C2T.ode	@ltx/gr_gr_cog/miscellanea:misc.Ode8
ltx/gr_gr_cog/tr.d018:trMA.Ode8C2T.text	Ἄνοιξον κρούουσιν ἡμῖν, καὶ τὸ ἔλεος, τὸ σὸν προσκαλουμένοις, ταχινὴ τῶν ἀνθρώπων καταφυγὴ καὶ στεῤῥά, ἐν πᾶσι Παρθένε βοήθεια, καὶ τῶν ἐν ἀνάγκαις βεβαία προστασία.
ltx/gr_gr_cog/tr.d018:trMA.Ode8C31.greekmelody	@ltx/gr_gr_cog/he.h.m2:heHE.TonEnTiVatoMosi.greekname
ltx/gr_gr_cog/tr.d018:trMA.Ode8C31.incipit	Ἀναρτηθεὶς ἐν Σταυρῷ, ὁ τῶν…
ltx/gr_gr_cog/tr.d018:trMA.Ode8C31.melody	@ltx/gr_gr_cog/he.h.m2:heHE.TonEnTiVatoMosi.name
ltx/gr_gr_cog/tr.d018:trMA.Ode8C31.mode	@ltx/gr_gr_cog/miscellanea:misc.Mode2
ltx/gr_gr_cog/tr.d018:trMA.Ode8C31.ode	@ltx/gr_gr_cog/miscellanea:misc.Ode8
ltx/gr_gr_cog/tr.d018:trMA.Ode8C31.text	Ἀναρτηθεὶς ἐν Σταυρῷ, ὁ τῶν ὅλων Δεσπότης, τὸν Ἀδὰμ σὺν τῇ Εὔᾳ, πάλιν ἀνεκαλέσω, καὶ ἐν τῷ Παραδείσῳ Χριστὲ Σωτὴρ εἰσῆξας, σὲ ἀνυμνολογοῦσιν, εἰς πάντας τοὺς αἰῶνας.
ltx/gr_gr_cog/tr.d018:trMA.Ode8C32.incipit	Σοῦ ὑψωθέντος Χριστέ, ἐν Σταυρῷ…
ltx/gr_gr_cog/tr.d018:trMA.Ode8C32.melody	@ltx/gr_gr_cog/he.h.m2:heHE.TonEnTiVatoMosi.name
ltx/gr_gr_cog/tr.d018:trMA.Ode8C32.mode	@ltx/gr_gr_cog/miscellanea:misc.Mode2
ltx/gr_gr_cog/tr.d018:trMA.Ode8C32.ode	@ltx/gr_gr_cog/miscellanea:misc.Ode8
ltx/gr_gr_cog/tr.d018:trMA.Ode8C32.text	Σοῦ ὑψωθέντος Χριστέ, ἐν Σταυρῷ ἑκουσίως, αἱ αὐγαὶ τοῦ ἡλίου, συνεστάλησαν φόβῳ, καὶ ἔδυ ἡ ἡμέρα· ὅθεν ὁ Λῃστὴς σὲ Θεὸν καθωμολόγει, εἰς πάντας τοὺς αἰῶνας.
ltx/gr_gr_cog/tr.d018:trMA.Ode8C3A1.incipit	Σταυρὲ πιστῶν ἡ ἐλπίς, Βασιλέων…
ltx/gr_gr_cog/tr.d018:trMA.Ode8C3A1.melody	@ltx/gr_gr_cog/he.h.m2:heHE.TonEnTiVatoMosi.name
ltx/gr_gr_cog/tr.d018:trMA.Ode8C3A1.mode	@ltx/gr_gr_cog/miscellanea:misc.Mode2
ltx/gr_gr_cog/tr.d018:trMA.Ode8C3A1.ode	@ltx/gr_gr_cog/miscellanea:misc.Ode8
ltx/gr_gr_cog/tr.d018:trMA.Ode8C3A1.text	Σταυρὲ πιστῶν ἡ ἐλπίς, Βασιλέων τὸ ὅπλον, Ἱερέων ἡ δόξα, Μοναζόντων τὸ σθένος, τῇ σῇ δυνάμει πάντας, τοὺς σὲ δοξολογοῦντας, σῷζε εἰς αἰῶνας.
ltx/gr_gr_cog/tr.d018:trMA.Ode8C3H.greekmelody	@ltx/gr_gr_cog/he.h.m2:heHE.TonEnTiVatoMosi.greekname
ltx/gr_gr_cog/tr.d018:trMA.Ode8C3H.incipit	@ltx/gr_gr_cog/he.h.m2:heHE.TonEnTiVatoMosi.incipit
ltx/gr_gr_cog/tr.d018:trMA.Ode8C3H.melody	@ltx/gr_gr_cog/he.h.m2:heHE.TonEnTiVatoMosi.melody
ltx/gr_gr_cog/tr.d018:trMA.Ode8C3H.mode	@ltx/gr_gr_cog/miscellanea:misc.Mode2
ltx/gr_gr_cog/tr.d018:trMA.Ode8C3H.ode	@ltx/gr_gr_cog/miscellanea:misc.Ode8
ltx/gr_gr_cog/tr.d018:trMA.Ode8C3H.text	@ltx/gr_gr_cog/he.h.m2:heHE.TonEnTiVatoMosi.text
ltx/gr_gr_cog/tr.d018:trMA.Ode8C3T.incipit	Πῶς σε ὑμνήσω ὡς δεῖ…
ltx/gr_gr_cog/tr.d018:trMA.Ode8C3T.melody	@ltx/gr_gr_cog/he.h.m2:heHE.TonEnTiVatoMosi.name
ltx/gr_gr_cog/tr.d018:trMA.Ode8C3T.mode	@ltx/gr_gr_cog/miscellanea:misc.Mode2
ltx/gr_gr_cog/tr.d018:trMA.Ode8C3T.ode	@ltx/gr_gr_cog/miscellanea:misc.Ode8
ltx/gr_gr_cog/tr.d018:trMA.Ode8C3T.text	Πῶς σε ὑμνήσω ὡς δεῖ, Θεοτόκε Παρθένε, δυσωδῶν ἁμαρτιῶν ἐγὼ νῦν ὁ σκοτεινός; ἀλλʼ οὖν Ὑπεραγία, σύγγνωθί μοι τῇ τόλμῃ, τοῦ πενιχροῦ μου ἔπους.
ltx/gr_gr_cog/tr.d018:trMA.Ode8C3Tr.incipit	Ἴσον Πατρὶ τὸν Υἱόν, καὶ…
ltx/gr_gr_cog/tr.d018:trMA.Ode8C3Tr.melody	@ltx/gr_gr_cog/he.h.m2:heHE.TonEnTiVatoMosi.name
ltx/gr_gr_cog/tr.d018:trMA.Ode8C3Tr.mode	@ltx/gr_gr_cog/miscellanea:misc.Mode2
ltx/gr_gr_cog/tr.d018:trMA.Ode8C3Tr.ode	@ltx/gr_gr_cog/miscellanea:misc.Ode8
ltx/gr_gr_cog/tr.d018:trMA.Ode8C3Tr.text	Ἴσον Πατρὶ τὸν Υἱόν, καὶ τὸ ἅγιον Πνεῦμα, πεπιστεύκαμεν εἶναι, τὴν ἁγίαν Τριάδα, ἐν Θεότητι μιᾷ, ἣν πίστει προσκυνοῦμεν, τὸ τοῦ Ἀρείου δόγμα, ἀεὶ καταπατοῦντες.
ltx/gr_gr_cog/tr.d018:trMA.Ode9C11.greekmelody	@ltx/gr_gr_cog/he.h.m4:heHE.MegalynomenPantes.greekname
ltx/gr_gr_cog/tr.d018:trMA.Ode9C11.incipit	Μωϋσῆς ἐν Αἰγύπτῳ, θάλασσαν διέῤῥηξε…
ltx/gr_gr_cog/tr.d018:trMA.Ode9C11.melody	@ltx/gr_gr_cog/he.h.m4:heHE.MegalynomenPantes.name
ltx/gr_gr_cog/tr.d018:trMA.Ode9C11.mode	@ltx/gr_gr_cog/miscellanea:misc.Mode4
ltx/gr_gr_cog/tr.d018:trMA.Ode9C11.ode	@ltx/gr_gr_cog/miscellanea:misc.Ode9
ltx/gr_gr_cog/tr.d018:trMA.Ode9C11.text	Μωϋσῆς ἐν Αἰγύπτῳ, θάλασσαν διέῤῥηξε, καὶ λαὸν διήγαγε, καὶ τοῦτον ἔθρεψεν, ἐν ἐρήμῳ ἀβάτῳ, διὰ νηστείας ἐκτελῶν τεράστια.
ltx/gr_gr_cog/tr.d018:trMA.Ode9C12.incipit	Ἰησοῦς ὁ τοῦ Ναυῆ, διὰ…
ltx/gr_gr_cog/tr.d018:trMA.Ode9C12.melody	@ltx/gr_gr_cog/he.h.m4:heHE.MegalynomenPantes.name
ltx/gr_gr_cog/tr.d018:trMA.Ode9C12.mode	@ltx/gr_gr_cog/miscellanea:misc.Mode4
ltx/gr_gr_cog/tr.d018:trMA.Ode9C12.ode	@ltx/gr_gr_cog/miscellanea:misc.Ode9
ltx/gr_gr_cog/tr.d018:trMA.Ode9C12.text	Ἰησοῦς ὁ τοῦ Ναυῆ, διὰ τῆς ἐγκρατείας λαὸν καθηγίασε, καὶ ἐκληροδότησεν, εἰς γῆν ἐπαγγελίας, τὸν Ἰορδάνην διαβιβάσας τὸ πρότερον.
ltx/gr_gr_cog/tr.d018:trMA.Ode9C13.incipit	Ὁ Γεδεὼν ἐκεῖνος, μόνοις τριακοσίοις…
ltx/gr_gr_cog/tr.d018:trMA.Ode9C13.melody	@ltx/gr_gr_cog/he.h.m4:heHE.MegalynomenPantes.name
ltx/gr_gr_cog/tr.d018:trMA.Ode9C13.mode	@ltx/gr_gr_cog/miscellanea:misc.Mode4
ltx/gr_gr_cog/tr.d018:trMA.Ode9C13.ode	@ltx/gr_gr_cog/miscellanea:misc.Ode9
ltx/gr_gr_cog/tr.d018:trMA.Ode9C13.text	Ὁ Γεδεὼν ἐκεῖνος, μόνοις τριακοσίοις, ἀνδράσι τοῖς λάμψασι, νικᾷ τὸν ἀλλόφυλον, ἐγκρατείᾳ καὶ εὐχῇ, αὐτὸν ζηλοῦντες, καὶ ἡμεῖς μιμησώμεθα.
ltx/gr_gr_cog/tr.d018:trMA.Ode9C1H.greekmelody	@ltx/gr_gr_cog/he.h.m4:heHE.MegalynomenPantes.greekname
ltx/gr_gr_cog/tr.d018:trMA.Ode9C1H.incipit	@ltx/gr_gr_cog/he.h.m4:heHE.MegalynomenPantes.incipit
ltx/gr_gr_cog/tr.d018:trMA.Ode9C1H.melody	@ltx/gr_gr_cog/he.h.m4:heHE.MegalynomenPantes.melody
ltx/gr_gr_cog/tr.d018:trMA.Ode9C1H.mode	@ltx/gr_gr_cog/miscellanea:misc.Mode4
ltx/gr_gr_cog/tr.d018:trMA.Ode9C1H.ode	@ltx/gr_gr_cog/miscellanea:misc.Ode9
ltx/gr_gr_cog/tr.d018:trMA.Ode9C1H.text	@ltx/gr_gr_cog/he.h.m4:heHE.MegalynomenPantes.text
ltx/gr_gr_cog/tr.d018:trMA.Ode9C1T.incipit	Χαῖρε πάνσεμνε Ἁγνή, παρθενίας τὸ…
ltx/gr_gr_cog/tr.d018:trMA.Ode9C1T.melody	@ltx/gr_gr_cog/he.h.m4:heHE.MegalynomenPantes.name
ltx/gr_gr_cog/tr.d018:trMA.Ode9C1T.mode	@ltx/gr_gr_cog/miscellanea:misc.Mode4
ltx/gr_gr_cog/tr.d018:trMA.Ode9C1T.ode	@ltx/gr_gr_cog/miscellanea:misc.Ode9
ltx/gr_gr_cog/tr.d018:trMA.Ode9C1T.text	Χαῖρε πάνσεμνε Ἁγνή, παρθενίας τὸ καύχημα, Ἀγγέλων τὸ στήριγμα, ἀνθρώπων βοήθεια, κόσμου ἡ χαρά, Μαρία, καὶ Μήτηρ, καὶ δούλη τοῦ Θεοῦ ἡμῶν.
ltx/gr_gr_cog/tr.d018:trMA.Ode9C21.greekmelody	@ltx/gr_gr_cog/he.h.m2:heHE.TonEkTheouTheonLogon.greekname
ltx/gr_gr_cog/tr.d018:trMA.Ode9C21.incipit	Σταυρῷ τὰς θείας παλάμας ἐξαπλώσας…
ltx/gr_gr_cog/tr.d018:trMA.Ode9C21.melody	@ltx/gr_gr_cog/he.h.m2:heHE.TonEkTheouTheonLogon.name
ltx/gr_gr_cog/tr.d018:trMA.Ode9C21.mode	@ltx/gr_gr_cog/miscellanea:misc.Mode2
ltx/gr_gr_cog/tr.d018:trMA.Ode9C21.ode	@ltx/gr_gr_cog/miscellanea:misc.Ode9
ltx/gr_gr_cog/tr.d018:trMA.Ode9C21.text	Σταυρῷ τὰς θείας παλάμας ἐξαπλώσας, συνῆψας, τὰ πρῴην διεστῶτα Λυτρωτά, καὶ τῷ Πατρὶ τὴν κατάκριτον, μεσιτεύσας ὡς δῶρον, προσήγαγες οὐσίαν τῶν βροτῶν· διὰ τοῦτο ὑμνοῦμεν, τὴν ἄχραντόν σου Σταύρωσιν.
ltx/gr_gr_cog/tr.d018:trMA.Ode9C22.incipit	Ἡ τῆς ἁγίας Νηστείας, ἐπιλάμψασα…
ltx/gr_gr_cog/tr.d018:trMA.Ode9C22.melody	@ltx/gr_gr_cog/he.h.m2:heHE.TonEkTheouTheonLogon.name
ltx/gr_gr_cog/tr.d018:trMA.Ode9C22.mode	@ltx/gr_gr_cog/miscellanea:misc.Mode2
ltx/gr_gr_cog/tr.d018:trMA.Ode9C22.ode	@ltx/gr_gr_cog/miscellanea:misc.Ode9
ltx/gr_gr_cog/tr.d018:trMA.Ode9C22.text	Ἡ τῆς ἁγίας Νηστείας, ἐπιλάμψασα χάρις, ἀκτῖνας ἐπαφίησιν ἡμῖν, προκαθαιρούσας παλίῤῥοιαν λογισμῶν, καὶ τοῦ κόρου, τὸ σκότος ἐλαυνούσας· οἱ πιστοί, διὰ τοῦτο προθύμως, ταύτην ὑποδεξώμεθα.
ltx/gr_gr_cog/tr.d018:trMA.Ode9C23.incipit	Ἡ φωτοφόρος Νηστεία, χαρισμάτων ἐνθέων…
ltx/gr_gr_cog/tr.d018:trMA.Ode9C23.melody	@ltx/gr_gr_cog/he.h.m2:heHE.TonEkTheouTheonLogon.name
ltx/gr_gr_cog/tr.d018:trMA.Ode9C23.mode	@ltx/gr_gr_cog/miscellanea:misc.Mode2
ltx/gr_gr_cog/tr.d018:trMA.Ode9C23.ode	@ltx/gr_gr_cog/miscellanea:misc.Ode9
ltx/gr_gr_cog/tr.d018:trMA.Ode9C23.text	Ἡ φωτοφόρος Νηστεία, χαρισμάτων ἐνθέων, κρατῆρα συγκεράσασα ἡμῖν, σήμερον πᾶσι προδείκνυσιν, ὡς βουλόμενοι τούτων μεθέξειν, εἰς ὠφέλειαν ψυχῆς, τῷ Δεσπότῃ τῶν ὅλων, συμπρᾶξαι δυσωπήσωμεν.
ltx/gr_gr_cog/tr.d018:trMA.Ode9C24.incipit	Ἥλοις τῶν θείων χειρῶν σου…
ltx/gr_gr_cog/tr.d018:trMA.Ode9C24.melody	@ltx/gr_gr_cog/he.h.m2:heHE.TonEkTheouTheonLogon.name
ltx/gr_gr_cog/tr.d018:trMA.Ode9C24.mode	@ltx/gr_gr_cog/miscellanea:misc.Mode2
ltx/gr_gr_cog/tr.d018:trMA.Ode9C24.ode	@ltx/gr_gr_cog/miscellanea:misc.Ode9
ltx/gr_gr_cog/tr.d018:trMA.Ode9C24.text	Ἥλοις τῶν θείων χειρῶν σου, προσηλώσας Οἰκτίρμον, ἡμῶν τὰς ἁμαρτίας ἐν Σταυρῷ, Λόγχῃ πλευράς σου διέῤῥηξας, πονηρὰ γραμματεῖα, σφαλμάτων καὶ πταισμάτων χαλεπῶν· διὰ τοῦτο ὑμνοῦμεν, τὴν ἄχραντόν σου Σταύρωσιν.
ltx/gr_gr_cog/tr.d018:trMA.Ode9C25.incipit	Τῶν ἀρετῶν ἡ καλλίστη, ἐξανοίγεται…
ltx/gr_gr_cog/tr.d018:trMA.Ode9C25.melody	@ltx/gr_gr_cog/he.h.m2:heHE.TonEkTheouTheonLogon.name
ltx/gr_gr_cog/tr.d018:trMA.Ode9C25.mode	@ltx/gr_gr_cog/miscellanea:misc.Mode2
ltx/gr_gr_cog/tr.d018:trMA.Ode9C25.ode	@ltx/gr_gr_cog/miscellanea:misc.Ode9
ltx/gr_gr_cog/tr.d018:trMA.Ode9C25.text	Τῶν ἀρετῶν ἡ καλλίστη, ἐξανοίγεται τρίβος, τὸ στάδιον τῶν θείων Νηστειῶν, πᾶσιν ἰδοὺ εὐτρεπίζεται· οἱ ἀθλῆσαι νομίμως, βουλόμενοι αἰτήσατε Χριστόν, εἰρηναῖον ἐξ ὕψους, καιρὸν ἡμῖν δωρήσασθαι.
ltx/gr_gr_cog/tr.d018:trMA.Ode9C2T.incipit	Τῇ ὀξυτάτῃ πρεσβείᾳ, τῇ ἀγρύπνῳ…
ltx/gr_gr_cog/tr.d018:trMA.Ode9C2T.melody	@ltx/gr_gr_cog/he.h.m2:heHE.TonEkTheouTheonLogon.name
ltx/gr_gr_cog/tr.d018:trMA.Ode9C2T.mode	@ltx/gr_gr_cog/miscellanea:misc.Mode2
ltx/gr_gr_cog/tr.d018:trMA.Ode9C2T.ode	@ltx/gr_gr_cog/miscellanea:misc.Ode9
ltx/gr_gr_cog/tr.d018:trMA.Ode9C2T.text	Τῇ ὀξυτάτῃ πρεσβείᾳ, τῇ ἀγρύπνῳ σου σκέπῃ, τῇ κραταιᾷ σου Δέσποινα ἁγνή, νῦν βοηθείᾳ συντήρησον, τοὺς πιστούς σου οἰκέτας, ἐκ πάσης ἐναντίας προσβολῆς, καὶ παθῶν καὶ πταισμάτων, καὶ πειρασμῶν διάσωσον.
ltx/gr_gr_cog/tr.d018:trMA.Ode9C31.greekmelody	@ltx/gr_gr_cog/he.h.m2:heHE.TinYperfyosSarki.greekname
ltx/gr_gr_cog/tr.d018:trMA.Ode9C31.incipit	Ἐν τῷ ξύλῳ τοῦ Σταυροῦ…
ltx/gr_gr_cog/tr.d018:trMA.Ode9C31.melody	@ltx/gr_gr_cog/he.h.m2:heHE.TinYperfyosSarki.name
ltx/gr_gr_cog/tr.d018:trMA.Ode9C31.mode	@ltx/gr_gr_cog/miscellanea:misc.Mode2
ltx/gr_gr_cog/tr.d018:trMA.Ode9C31.ode	@ltx/gr_gr_cog/miscellanea:misc.Ode9
ltx/gr_gr_cog/tr.d018:trMA.Ode9C31.text	Ἐν τῷ ξύλῳ τοῦ Σταυροῦ, ἑκουσίως προσπαγείς, πάντας ἡμᾶς ἐῤῥύσω, τῆς κατάρας τοῦ νόμου· διό σε κατὰ χρέος μεγαλύνομεν Χριστέ.
ltx/gr_gr_cog/tr.d018:trMA.Ode9C32.incipit	Πάντες προσκυνοῦμέν σου, τὰ παθήματα…
ltx/gr_gr_cog/tr.d018:trMA.Ode9C32.melody	@ltx/gr_gr_cog/he.h.m2:heHE.TinYperfyosSarki.name
ltx/gr_gr_cog/tr.d018:trMA.Ode9C32.mode	@ltx/gr_gr_cog/miscellanea:misc.Mode2
ltx/gr_gr_cog/tr.d018:trMA.Ode9C32.ode	@ltx/gr_gr_cog/miscellanea:misc.Ode9
ltx/gr_gr_cog/tr.d018:trMA.Ode9C32.text	Πάντες προσκυνοῦμέν σου, τὰ παθήματα Σωτήρ, ἅπερ ἑκὼν ἐδέξω, ἵνα ἐλευθερώσῃς, τὸ γένος τῶν ἀνθρώπων, τῆς δουλείας τοῦ ἐχθροῦ.
ltx/gr_gr_cog/tr.d018:trMA.Ode9C3A1.incipit	Τοὺς ἀσπαζομένους σε, τῇ δυνάμει…
ltx/gr_gr_cog/tr.d018:trMA.Ode9C3A1.melody	@ltx/gr_gr_cog/he.h.m2:heHE.TinYperfyosSarki.name
ltx/gr_gr_cog/tr.d018:trMA.Ode9C3A1.mode	@ltx/gr_gr_cog/miscellanea:misc.Mode2
ltx/gr_gr_cog/tr.d018:trMA.Ode9C3A1.ode	@ltx/gr_gr_cog/miscellanea:misc.Ode9
ltx/gr_gr_cog/tr.d018:trMA.Ode9C3A1.text	Τοὺς ἀσπαζομένους σε, τῇ δυνάμει σου Σταυρέ, τὸν τῆς νηστείας χρόνον, διελθεῖν ἐν εἰρήνῃ, ἀξίωσον καὶ ῥῦσαι, τῆς δουλείας τοῦ ἐχθροῦ.
ltx/gr_gr_cog/tr.d018:trMA.Ode9C3H.greekmelody	@ltx/gr_gr_cog/he.h.m2:heHE.TinYperfyosSarki.greekname
ltx/gr_gr_cog/tr.d018:trMA.Ode9C3H.incipit	@ltx/gr_gr_cog/he.h.m2:heHE.TinYperfyosSarki.incipit
ltx/gr_gr_cog/tr.d018:trMA.Ode9C3H.melody	@ltx/gr_gr_cog/he.h.m2:heHE.TinYperfyosSarki.melody
ltx/gr_gr_cog/tr.d018:trMA.Ode9C3H.mode	@ltx/gr_gr_cog/miscellanea:misc.Mode2
ltx/gr_gr_cog/tr.d018:trMA.Ode9C3H.ode	@ltx/gr_gr_cog/miscellanea:misc.Ode9
ltx/gr_gr_cog/tr.d018:trMA.Ode9C3H.text	@ltx/gr_gr_cog/he.h.m2:heHE.TinYperfyosSarki.text
ltx/gr_gr_cog/tr.d018:trMA.Ode9C3T.incipit	Νέμειν τὴν συγχώρησιν, τῶν πταισμάτων…
ltx/gr_gr_cog/tr.d018:trMA.Ode9C3T.melody	@ltx/gr_gr_cog/he.h.m2:heHE.TinYperfyosSarki.name
ltx/gr_gr_cog/tr.d018:trMA.Ode9C3T.mode	@ltx/gr_gr_cog/miscellanea:misc.Mode2
ltx/gr_gr_cog/tr.d018:trMA.Ode9C3T.ode	@ltx/gr_gr_cog/miscellanea:misc.Ode9
ltx/gr_gr_cog/tr.d018:trMA.Ode9C3T.text	Νέμειν τὴν συγχώρησιν, τῶν πταισμάτων Μαρία, ὑπερευλογημένη, τὸν ἐκ σοῦ σαρκωθέντα, ἱκέτευε Σωτῆρα, ἡμῖν τοῖς ἁμαρτωλοῖς.
ltx/gr_gr_cog/tr.d018:trMA.Ode9C3Tr.incipit	Ἀϊδίως ὁ Πατήρ, καὶ ἀῤῥεύστως…
ltx/gr_gr_cog/tr.d018:trMA.Ode9C3Tr.melody	@ltx/gr_gr_cog/he.h.m2:heHE.TinYperfyosSarki.name
ltx/gr_gr_cog/tr.d018:trMA.Ode9C3Tr.mode	@ltx/gr_gr_cog/miscellanea:misc.Mode2
ltx/gr_gr_cog/tr.d018:trMA.Ode9C3Tr.ode	@ltx/gr_gr_cog/miscellanea:misc.Ode9
ltx/gr_gr_cog/tr.d018:trMA.Ode9C3Tr.text	Ἀϊδίως ὁ Πατήρ, καὶ ἀῤῥεύστως τὸν Υἱόν, ἐγέννησε, καὶ Πνεῦμα ἐκπεπόρευκεν· ὅθεν, ἀμέριστος πέλει, καὶ ὁμότιμος Τριάς.
ltx/gr_gr_cog/tr.d018:trTE.Troparion.incipit	Βασιλεῦ ἅγιε παντοδύναμε, ὃν φρίσσει…
ltx/gr_gr_cog/tr.d018:trTE.Troparion.melody	
ltx/gr_gr_cog/tr.d018:trTE.Troparion.mode	@ltx/gr_gr_cog/miscellanea:misc.Mode3
ltx/gr_gr_cog/tr.d018:trTE.Troparion.text	Βασιλεῦ ἅγιε παντοδύναμε, ὃν φρίσσει καὶ τρέμει τὰ σύμπαντα, σῶσον ἡμᾶς· δύνασαι γὰρ συγχωρεῖν ἁμαρτίας, ὡς εὔσπλαγχνος.
ltx/gr_gr_cog/tr.d018:trTE.Troparion2.incipit	δύνασαι γὰρ συγχωρεῖν ἁμαρτίας, ὡς…
ltx/gr_gr_cog/tr.d018:trTE.Troparion2.text	δύνασαι γὰρ συγχωρεῖν ἁμαρτίας, ὡς εὔσπλαγχνος.
ltx/gr_gr_cog/tr.d018:trVE.AposIdiomelon1.incipit	Περιχαρῶς δεξώμεθα πιστοί, τὸ θεόπνευστον…
ltx/gr_gr_cog/tr.d018:trVE.AposIdiomelon1.melody	@ltx/gr_gr_cog/miscellanea:misc.Idiomelon
ltx/gr_gr_cog/tr.d018:trVE.AposIdiomelon1.mode	@ltx/gr_gr_cog/miscellanea:misc.Mode1
ltx/gr_gr_cog/tr.d018:trVE.AposIdiomelon1.text	Περιχαρῶς δεξώμεθα πιστοί, τὸ θεόπνευστον διάγγελμα τῆς Νηστείας, ὡς πρῴην οἱ Νινευῖται, καὶ αὖθις πόρναι καὶ τελῶναι, τὸ τῆς μετανοίας κήρυγμα, παρὰ τοῦ Ἰωάννου, διʼ ἐγκρατείας ἑτοιμασθῶμεν πρὸς μετουσίαν, τῆς ἐν τῇ Σιὼν δεσποτικῆς ἱερουργίας, διὰ δακρύων προκαθαρθῶμεν τοῦ ἐν αὐτῇ θείου Νιπτῆρος, προσευξώμεθα ἰδεῖν τὴν τοῦ τυπικοῦ ἐνταῦθα, Πάσχα τελείωσιν, καὶ τοῦ ἀληθινοῦ ἀνάδειξιν, παρασκευασθῶμεν εἰς προσκύνησιν τοῦ Σταυροῦ, καὶ τῆς Ἐγέρσεως Χριστοῦ τοῦ Θεοῦ, βοῶντες πρὸς αὐτόν· Μὴ καταισχύνῃς ἡμᾶς, ἀπὸ τῆς προσδοκίας ἡμῶν φιλάνθρωπε!
ltx/gr_gr_cog/tr.d018:trVE.AposMartyric.incipit	@ltx/gr_gr_cog/oc.m1.d4:ocVE.Aposticha3.incipit
ltx/gr_gr_cog/tr.d018:trVE.AposMartyric.melody	
ltx/gr_gr_cog/tr.d018:trVE.AposMartyric.mode	@ltx/gr_gr_cog/miscellanea:misc.Mode1
ltx/gr_gr_cog/tr.d018:trVE.AposMartyric.text	@ltx/gr_gr_cog/oc.m1.d4:ocVE.Aposticha3.text
ltx/gr_gr_cog/tr.d018:trVE.AposTheotokion.greekmelody	@ltx/gr_gr_cog/he.a.m1:heAU.PaneffimoiMartyres.greekname
ltx/gr_gr_cog/tr.d018:trVE.AposTheotokion.incipit	Παρθένος ἡ ἄσπιλος ποτέ, ἐπὶ…
ltx/gr_gr_cog/tr.d018:trVE.AposTheotokion.melody	@ltx/gr_gr_cog/he.a.m1:heAU.PaneffimoiMartyres.name
ltx/gr_gr_cog/tr.d018:trVE.AposTheotokion.mode	@ltx/gr_gr_cog/miscellanea:misc.Mode1
ltx/gr_gr_cog/tr.d018:trVE.AposTheotokion.text	Παρθένος ἡ ἄσπιλος ποτέ, ἐπὶ ξύλου βλέπουσα· ὃν ἐξ ἀσπόρου γὰρ ἔτεκε, γαστρὸς μὴ φέρουσα, τὴν τῶν σπλάγχνων τρῶσιν, τρυχομένη ἔλεγεν· ὁ νεύματι κρατῶν κτίσιν ἅπασαν, πῶς ὡς κατάκριτος, ἐν Σταυρῷ ἐναπῃώρησαι; πάντως θέλων, σῶσαι τὸ ἀνθρώπινον.
