ltx/gr_gr_cog/me.m10.d19:meDA.commemoration.first	Μνήμη τοῦ Ἁγίου Προφήτου Ἰωήλ
ltx/gr_gr_cog/me.m10.d19:meDA.commemoration.first_name	
ltx/gr_gr_cog/me.m10.d19:meDA.commemoration.first_short	Μνήμη τοῦ Ἁγίου Προφήτου Ἰωήλ
ltx/gr_gr_cog/me.m10.d19:meDA.commemoration.first_title	@ltx/gr_gr_cog/titles:ti.Prophet
ltx/gr_gr_cog/me.m10.d19:meDA.commemoration.full	Μνήμη τοῦ Ἁγίου Προφήτου Ἰωήλ· καὶ τοῦ Ἁγίου Μάρτυρος Οὐάρου
ltx/gr_gr_cog/me.m10.d19:meDA.commemoration.second_name	
ltx/gr_gr_cog/me.m10.d19:meDA.commemoration.second_title	@ltx/gr_gr_cog/titles:ti.Martyr
ltx/gr_gr_cog/me.m10.d19:meDA.date	Τῌ ΙΘʹ ΟΚΤΩΒΡΙΟΥ
ltx/gr_gr_cog/me.m10.d19:meDA.fordate	διὰ τὴν 19ην Ὀκτωβρίου
ltx/gr_gr_cog/me.m10.d19:meDA.insert1	καὶ τοῦ ἁγίου Προφήτου Ἰωήλ, καὶ τοῦ Ἁγίου Μάρτυρος Οὐάρου,
ltx/gr_gr_cog/me.m10.d19:meDA.insert2	ὧν καὶ τὴν μνήμην ἐπιτελοῦμεν·
ltx/gr_gr_cog/me.m10.d19:meDA.note	
ltx/gr_gr_cog/me.m10.d19:meDA.pdfcoverdate	τῆς 19ης Ὀκτωβρίου,
ltx/gr_gr_cog/me.m10.d19:meDA.pdfheaderdate	τῆς 19ης Ὀκτωβρίου
ltx/gr_gr_cog/me.m10.d19:meHO.commemorations	
ltx/gr_gr_cog/me.m10.d19:meHO.note1	
ltx/gr_gr_cog/me.m10.d19:meHO.note2	
ltx/gr_gr_cog/me.m10.d19:meHO.number	
ltx/gr_gr_cog/me.m10.d19:meHO.rank	
ltx/gr_gr_cog/me.m10.d19:meLE.commemoration1	Μνήμη τοῦ Ἁγίου Προφήτου Ἰωήλ.
ltx/gr_gr_cog/me.m10.d19:meLE.commemoration2	
ltx/gr_gr_cog/me.m10.d19:meLI.Kontakion1.incipit	…
ltx/gr_gr_cog/me.m10.d19:meLI.Kontakion1.melody	
ltx/gr_gr_cog/me.m10.d19:meLI.Kontakion1.mode	
ltx/gr_gr_cog/me.m10.d19:meLI.Kontakion1.text	
ltx/gr_gr_cog/me.m10.d19:meLI.Megalynarion.text	
ltx/gr_gr_cog/me.m10.d19:meMA.C1.acrostic.notice1	οὗ ἡ Ἀκροστιχίς·
ltx/gr_gr_cog/me.m10.d19:meMA.C1.acrostic.text	Χρησμούς, Ἰωὴλ τοῦ Προφήτου θαυμάσω.
ltx/gr_gr_cog/me.m10.d19:meMA.C1.acrostic.title	Ὁ Κανὼν τοῦ Προφήτου,
ltx/gr_gr_cog/me.m10.d19:meMA.C1.poet	@ltx/gr_gr_cog/poets:po.Theofanous
ltx/gr_gr_cog/me.m10.d19:meMA.C1.title	@ltx/gr_gr_cog/titles:ti.CanonProphet
ltx/gr_gr_cog/me.m10.d19:meMA.C1.verse	@ltx/gr_gr_cog/prayers:pr.verse_Prophet.text
ltx/gr_gr_cog/me.m10.d19:meMA.C2.acrostic.notice1	φέρων Ἀκροστιχίδα·
ltx/gr_gr_cog/me.m10.d19:meMA.C2.acrostic.text	Ἄθλους ἐπαινεῖν Οὐάρου κλέος μέγα. Ἰωσήφ.
ltx/gr_gr_cog/me.m10.d19:meMA.C2.acrostic.title	Ὁ Κανὼν τοῦ Μάρτυρος,
ltx/gr_gr_cog/me.m10.d19:meMA.C2.title	@ltx/gr_gr_cog/titles:ti.CanonMartyrM
ltx/gr_gr_cog/me.m10.d19:meMA.C2.verse	@ltx/gr_gr_cog/prayers:pr.verse_SaintM.text
ltx/gr_gr_cog/me.m10.d19:meMA.Ode1C11.greekmelody	@ltx/gr_gr_cog/he.h.m2:heHE.DefteLaoi.greekname
ltx/gr_gr_cog/me.m10.d19:meMA.Ode1C11.incipit	Χορὸς ἡμῖν, τῶν Προφητῶν συνευφραίνεται…
ltx/gr_gr_cog/me.m10.d19:meMA.Ode1C11.melody	@ltx/gr_gr_cog/he.h.m2:heHE.DefteLaoi.name
ltx/gr_gr_cog/me.m10.d19:meMA.Ode1C11.mode	@ltx/gr_gr_cog/miscellanea:misc.Mode2
ltx/gr_gr_cog/me.m10.d19:meMA.Ode1C11.ode	@ltx/gr_gr_cog/miscellanea:misc.Ode1
ltx/gr_gr_cog/me.m10.d19:meMA.Ode1C11.text	Χορὸς ἡμῖν, τῶν Προφητῶν συνευφραίνεται, ἐγκωμιαζομένου σου, τοῦ οὐρανόφρονος, Ἰωὴλ θεοφάντορ, μεθʼ ὧν ἡμᾶς σωθῆναι, Μάκαρ δυσώπησον.
ltx/gr_gr_cog/me.m10.d19:meMA.Ode1C12.incipit	Ῥῆμα Θεοῦ, προκαταγγέλλων θεσπέσιε, τὴν…
ltx/gr_gr_cog/me.m10.d19:meMA.Ode1C12.melody	@ltx/gr_gr_cog/he.h.m2:heHE.DefteLaoi.name
ltx/gr_gr_cog/me.m10.d19:meMA.Ode1C12.mode	@ltx/gr_gr_cog/miscellanea:misc.Mode2
ltx/gr_gr_cog/me.m10.d19:meMA.Ode1C12.ode	@ltx/gr_gr_cog/miscellanea:misc.Ode1
ltx/gr_gr_cog/me.m10.d19:meMA.Ode1C12.text	Ῥῆμα Θεοῦ, προκαταγγέλλων θεσπέσιε, τὴν χαλεπὴν ἐμήνυσας, ὀργὴν καὶ ἔνδικον, τὴν ἐκ τῆς ἀσεβείας, συμβάσαν τῷ λαῷ σου τῷ ματαιόφρονι.
ltx/gr_gr_cog/me.m10.d19:meMA.Ode1C13.incipit	Ἡ θαυμαστή, καὶ φωτοφόρος τοῦ…
ltx/gr_gr_cog/me.m10.d19:meMA.Ode1C13.melody	@ltx/gr_gr_cog/he.h.m2:heHE.DefteLaoi.name
ltx/gr_gr_cog/me.m10.d19:meMA.Ode1C13.mode	@ltx/gr_gr_cog/miscellanea:misc.Mode2
ltx/gr_gr_cog/me.m10.d19:meMA.Ode1C13.ode	@ltx/gr_gr_cog/miscellanea:misc.Ode1
ltx/gr_gr_cog/me.m10.d19:meMA.Ode1C13.text	Ἡ θαυμαστή, καὶ φωτοφόρος τοῦ Πνεύματος, ζωοποιὸς ἐπίπνοια, σοὶ ἐπεσκίασε, καὶ μελλόντων τὴν γνῶσιν, ἐνέπνευσε Προφῆτα, μακαριώτατε.
ltx/gr_gr_cog/me.m10.d19:meMA.Ode1C1T.incipit	Σὲ ἡ σκηνή, τοῦ μαρτυρίου…
ltx/gr_gr_cog/me.m10.d19:meMA.Ode1C1T.melody	@ltx/gr_gr_cog/he.h.m2:heHE.DefteLaoi.name
ltx/gr_gr_cog/me.m10.d19:meMA.Ode1C1T.mode	@ltx/gr_gr_cog/miscellanea:misc.Mode2
ltx/gr_gr_cog/me.m10.d19:meMA.Ode1C1T.ode	@ltx/gr_gr_cog/miscellanea:misc.Ode1
ltx/gr_gr_cog/me.m10.d19:meMA.Ode1C1T.text	Σὲ ἡ σκηνή, τοῦ μαρτυρίου προέγραψε, πολυειδῶς τυπούμενον, ἀποδεικνύουσα, τὸν ἐκ σοῦ σαρκωθέντα, ἀτρέπτως Θεομῆτορ, Πάναγνε Δέσποινα.
ltx/gr_gr_cog/me.m10.d19:meMA.Ode1C21.greekmelody	@ltx/gr_gr_cog/he.h.m6:heHE.OsEnIpeiroPezefsas.greekname
ltx/gr_gr_cog/me.m10.d19:meMA.Ode1C21.incipit	Ἀναφανεὶς ἐν τῷ ὕψει τῆς…
ltx/gr_gr_cog/me.m10.d19:meMA.Ode1C21.melody	@ltx/gr_gr_cog/he.h.m6:heHE.OsEnIpeiroPezefsas.name
ltx/gr_gr_cog/me.m10.d19:meMA.Ode1C21.mode	@ltx/gr_gr_cog/miscellanea:misc.Mode6
ltx/gr_gr_cog/me.m10.d19:meMA.Ode1C21.ode	@ltx/gr_gr_cog/miscellanea:misc.Ode1
ltx/gr_gr_cog/me.m10.d19:meMA.Ode1C21.text	Ἀναφανεὶς ἐν τῷ ὕψει τῆς τοῦ Χριστοῦ, Ἐκκλησίας Οὔαρε, ὥσπερ ἥλιος φαιδρός, ἀστραπαῖς ἐλάμπρυνας τῶν σῶν, παλαισμάτων τὰ τῆς γῆς Μάκαρ πληρώματα.
ltx/gr_gr_cog/me.m10.d19:meMA.Ode1C22.incipit	Θείας ἀγάπης Παμμάκαρ κατασχεθείς, τῷ…
ltx/gr_gr_cog/me.m10.d19:meMA.Ode1C22.melody	@ltx/gr_gr_cog/he.h.m6:heHE.OsEnIpeiroPezefsas.name
ltx/gr_gr_cog/me.m10.d19:meMA.Ode1C22.mode	@ltx/gr_gr_cog/miscellanea:misc.Mode6
ltx/gr_gr_cog/me.m10.d19:meMA.Ode1C22.ode	@ltx/gr_gr_cog/miscellanea:misc.Ode1
ltx/gr_gr_cog/me.m10.d19:meMA.Ode1C22.text	Θείας ἀγάπης Παμμάκαρ κατασχεθείς, τῷ γλυκίστῳ ἔρωτι, ἀπηρνήσω σεαυτόν, καὶ πρὸς πᾶσαν βάσανον σαρκός, προσεχώρησας στεῤῥῶς ἀγωνισάμενος.
ltx/gr_gr_cog/me.m10.d19:meMA.Ode1C23.incipit	Λελογισμένως τῶν θείων ἀγωνιστῶν, τοῖς…
ltx/gr_gr_cog/me.m10.d19:meMA.Ode1C23.melody	@ltx/gr_gr_cog/he.h.m6:heHE.OsEnIpeiroPezefsas.name
ltx/gr_gr_cog/me.m10.d19:meMA.Ode1C23.mode	@ltx/gr_gr_cog/miscellanea:misc.Mode6
ltx/gr_gr_cog/me.m10.d19:meMA.Ode1C23.ode	@ltx/gr_gr_cog/miscellanea:misc.Ode1
ltx/gr_gr_cog/me.m10.d19:meMA.Ode1C23.text	Λελογισμένως τῶν θείων ἀγωνιστῶν, τοῖς δεσμοῖς συνέδησας, Ἀθλοφόρε σεαυτόν, καὶ τῆς πλάνης ἔλυσας δεσμά, σταθηρᾷ ὑπομονῇ πολλῶν κολάσεων.
ltx/gr_gr_cog/me.m10.d19:meMA.Ode1C2T.incipit	Ὁ ὑπερούσιος Λόγος σου ἐν…
ltx/gr_gr_cog/me.m10.d19:meMA.Ode1C2T.melody	@ltx/gr_gr_cog/he.h.m6:heHE.OsEnIpeiroPezefsas.name
ltx/gr_gr_cog/me.m10.d19:meMA.Ode1C2T.mode	@ltx/gr_gr_cog/miscellanea:misc.Mode6
ltx/gr_gr_cog/me.m10.d19:meMA.Ode1C2T.ode	@ltx/gr_gr_cog/miscellanea:misc.Ode1
ltx/gr_gr_cog/me.m10.d19:meMA.Ode1C2T.text	Ὁ ὑπερούσιος Λόγος σου ἐν γαστρί, ὑπὲρ λόγον ᾤκησε, καὶ τεχθεὶς θεοπρεπῶς, τῶν Μαρτύρων ἄχραντε χορούς, ἐπεσπάσατο, μεθʼ ὧν ὑμνολογοῦμέν σε.
ltx/gr_gr_cog/me.m10.d19:meMA.Ode3C11.greekmelody	@ltx/gr_gr_cog/he.h.m2:heHE.StereosonImasEnSoiKyrie.greekname
ltx/gr_gr_cog/me.m10.d19:meMA.Ode3C11.incipit	Μυούμενοι τοῖς σοῖς σοφοῖς δόγμασι…
ltx/gr_gr_cog/me.m10.d19:meMA.Ode3C11.melody	@ltx/gr_gr_cog/he.h.m2:heHE.StereosonImasEnSoiKyrie.name
ltx/gr_gr_cog/me.m10.d19:meMA.Ode3C11.mode	@ltx/gr_gr_cog/miscellanea:misc.Mode2
ltx/gr_gr_cog/me.m10.d19:meMA.Ode3C11.ode	@ltx/gr_gr_cog/miscellanea:misc.Ode3
ltx/gr_gr_cog/me.m10.d19:meMA.Ode3C11.text	Μυούμενοι τοῖς σοῖς σοφοῖς δόγμασι, νηστείαν Προφῆτα καὶ θεραπείαν, εὐσεβῶς ἀνακηρύττομεν, εἰς τὸν οἶκον Κυρίου πορευόμενοι.
ltx/gr_gr_cog/me.m10.d19:meMA.Ode3C12.incipit	Οἱ ταῖς σαῖς διδαχαῖς ἀκολουθήσαντες…
ltx/gr_gr_cog/me.m10.d19:meMA.Ode3C12.melody	@ltx/gr_gr_cog/he.h.m2:heHE.StereosonImasEnSoiKyrie.name
ltx/gr_gr_cog/me.m10.d19:meMA.Ode3C12.mode	@ltx/gr_gr_cog/miscellanea:misc.Mode2
ltx/gr_gr_cog/me.m10.d19:meMA.Ode3C12.ode	@ltx/gr_gr_cog/miscellanea:misc.Ode3
ltx/gr_gr_cog/me.m10.d19:meMA.Ode3C12.text	Οἱ ταῖς σαῖς διδαχαῖς ἀκολουθήσαντες, ἐξ ὅλης καρδίας καὶ διανοίας, ἐν κλαυθμῷ τε καὶ δεήσεσι, τὸν Θεὸν ἐκζητοῦμεν ἀξιάγαστε.
ltx/gr_gr_cog/me.m10.d19:meMA.Ode3C13.incipit	Ὑπέφηνας ἡμῖν τοῦ Παντοκράτορος, Δεσπότου…
ltx/gr_gr_cog/me.m10.d19:meMA.Ode3C13.melody	@ltx/gr_gr_cog/he.h.m2:heHE.StereosonImasEnSoiKyrie.name
ltx/gr_gr_cog/me.m10.d19:meMA.Ode3C13.mode	@ltx/gr_gr_cog/miscellanea:misc.Mode2
ltx/gr_gr_cog/me.m10.d19:meMA.Ode3C13.ode	@ltx/gr_gr_cog/miscellanea:misc.Ode3
ltx/gr_gr_cog/me.m10.d19:meMA.Ode3C13.text	Ὑπέφηνας ἡμῖν τοῦ Παντοκράτορος, Δεσπότου Προφῆτα μακροθυμίαν, καὶ τὴν θείαν ἀγαθότητα, διετράνωσας τούτου καὶ χρηστότητα.
ltx/gr_gr_cog/me.m10.d19:meMA.Ode3C1T.incipit	Συνέλαβες Ἁγνὴ Θεὸν καὶ ἔτεκες…
ltx/gr_gr_cog/me.m10.d19:meMA.Ode3C1T.melody	@ltx/gr_gr_cog/he.h.m2:heHE.StereosonImasEnSoiKyrie.name
ltx/gr_gr_cog/me.m10.d19:meMA.Ode3C1T.mode	@ltx/gr_gr_cog/miscellanea:misc.Mode2
ltx/gr_gr_cog/me.m10.d19:meMA.Ode3C1T.ode	@ltx/gr_gr_cog/miscellanea:misc.Ode3
ltx/gr_gr_cog/me.m10.d19:meMA.Ode3C1T.text	Συνέλαβες Ἁγνὴ Θεὸν καὶ ἔτεκες, τὸν Λόγον ἀφράστως σεσαρκωμένον, ἐν Προφήταις τὸν λαλήσαντα καὶ τελέσαντα τούτων τὰ κηρύγματα.
ltx/gr_gr_cog/me.m10.d19:meMA.Ode3C21.greekmelody	@ltx/gr_gr_cog/he.h.m6:heHE.OukEstinAgios.greekname
ltx/gr_gr_cog/me.m10.d19:meMA.Ode3C21.incipit	Ὑπῆλθες γνώμῃ σταθηρᾷ, τοὺς ἀνδρείους…
ltx/gr_gr_cog/me.m10.d19:meMA.Ode3C21.melody	@ltx/gr_gr_cog/he.h.m6:heHE.OukEstinAgios.name
ltx/gr_gr_cog/me.m10.d19:meMA.Ode3C21.mode	@ltx/gr_gr_cog/miscellanea:misc.Mode6
ltx/gr_gr_cog/me.m10.d19:meMA.Ode3C21.ode	@ltx/gr_gr_cog/miscellanea:misc.Ode3
ltx/gr_gr_cog/me.m10.d19:meMA.Ode3C21.text	Ὑπῆλθες γνώμῃ σταθηρᾷ, τοὺς ἀνδρείους ἀγῶνας, νευρωθεὶς ταῖς ἐλπίσι, τῶν μελλόντων ἀγαθῶν, καὶ τῶν Μαρτύρων Χριστοῦ, ταῖς πανσόφοις, Μάκαρ παραινέσεσι.
ltx/gr_gr_cog/me.m10.d19:meMA.Ode3C22.incipit	Στρατὸν Ἁγίων Ἀθλητῶν, ἐναθλοῦντα νομίμως…
ltx/gr_gr_cog/me.m10.d19:meMA.Ode3C22.melody	@ltx/gr_gr_cog/he.h.m6:heHE.OukEstinAgios.name
ltx/gr_gr_cog/me.m10.d19:meMA.Ode3C22.mode	@ltx/gr_gr_cog/miscellanea:misc.Mode6
ltx/gr_gr_cog/me.m10.d19:meMA.Ode3C22.ode	@ltx/gr_gr_cog/miscellanea:misc.Ode3
ltx/gr_gr_cog/me.m10.d19:meMA.Ode3C22.text	Στρατὸν Ἁγίων Ἀθλητῶν, ἐναθλοῦντα νομίμως, καθορῶν τὴν ἐκείνων, ἐπεδείξω ἀνδρικῶς, στεῤῥότητα ὁμιλῶν, πολυτρόποις Οὔαρε κολάσεσιν.
ltx/gr_gr_cog/me.m10.d19:meMA.Ode3C23.incipit	Ἐν παρατάξει ἱερᾷ Οὔαρε ὡς…
ltx/gr_gr_cog/me.m10.d19:meMA.Ode3C23.melody	@ltx/gr_gr_cog/he.h.m6:heHE.OukEstinAgios.name
ltx/gr_gr_cog/me.m10.d19:meMA.Ode3C23.mode	@ltx/gr_gr_cog/miscellanea:misc.Mode6
ltx/gr_gr_cog/me.m10.d19:meMA.Ode3C23.ode	@ltx/gr_gr_cog/miscellanea:misc.Ode3
ltx/gr_gr_cog/me.m10.d19:meMA.Ode3C23.text	Ἐν παρατάξει ἱερᾷ Οὔαρε ὡς γενναῖος, στρατιώτης εὑρέθης, καὶ κατέσφαξας πληθύν, ἀνδρείας ξίφει Σοφέ, πολεμίων, νίκαις κλεϊζόμενος.
ltx/gr_gr_cog/me.m10.d19:meMA.Ode3C2T.incipit	Παρθένε Μήτηρ τοῦ Θεοῦ, τῆς…
ltx/gr_gr_cog/me.m10.d19:meMA.Ode3C2T.melody	@ltx/gr_gr_cog/he.h.m6:heHE.OukEstinAgios.name
ltx/gr_gr_cog/me.m10.d19:meMA.Ode3C2T.mode	@ltx/gr_gr_cog/miscellanea:misc.Mode6
ltx/gr_gr_cog/me.m10.d19:meMA.Ode3C2T.ode	@ltx/gr_gr_cog/miscellanea:misc.Ode3
ltx/gr_gr_cog/me.m10.d19:meMA.Ode3C2T.text	Παρθένε Μήτηρ τοῦ Θεοῦ, τῆς ἐμῆς ῥαθυμίας, τὸ βαρύτατον σκότος, καὶ τὰ νέφη τῶν παθῶν, τῷ φωτισμῷ τῆς ἐν σοί, δυσωπῶ σε, χάριτος ἀπέλασον.
ltx/gr_gr_cog/me.m10.d19:meMA.Ode3H.greekmelody	@ltx/gr_gr_cog/he.h.m6:heHE.OukEstinAgios.greekname
ltx/gr_gr_cog/me.m10.d19:meMA.Ode3H.incipit	@ltx/gr_gr_cog/he.h.m6:heHE.OukEstinAgios.incipit
ltx/gr_gr_cog/me.m10.d19:meMA.Ode3H.melody	@ltx/gr_gr_cog/he.h.m6:heHE.OukEstinAgios.melody
ltx/gr_gr_cog/me.m10.d19:meMA.Ode3H.mode	@ltx/gr_gr_cog/miscellanea:misc.Mode6
ltx/gr_gr_cog/me.m10.d19:meMA.Ode3H.ode	@ltx/gr_gr_cog/miscellanea:misc.Ode3
ltx/gr_gr_cog/me.m10.d19:meMA.Ode3H.text	@ltx/gr_gr_cog/he.h.m6:heHE.OukEstinAgios.text
ltx/gr_gr_cog/me.m10.d19:meMA.Ode3Kathisma1.greekmelody	@ltx/gr_gr_cog/he.a.m4:heAU.OYpsotheisEnToStavro.greekname
ltx/gr_gr_cog/me.m10.d19:meMA.Ode3Kathisma1.incipit	Τῶν μολυσμῶν προκαθαρθεὶς τῆς καρδίας…
ltx/gr_gr_cog/me.m10.d19:meMA.Ode3Kathisma1.melody	@ltx/gr_gr_cog/he.a.m4:heAU.OYpsotheisEnToStavro.name
ltx/gr_gr_cog/me.m10.d19:meMA.Ode3Kathisma1.mode	@ltx/gr_gr_cog/miscellanea:misc.Mode4
ltx/gr_gr_cog/me.m10.d19:meMA.Ode3Kathisma1.text	Τῶν μολυσμῶν προκαθαρθεὶς τῆς καρδίας, δοχεῖον ὤφθης καθαρὸν θεοῤῥῆμον, τοῦ Παναγίου Πνεύματος Προφῆτα Ἰωήλ· ὅθεν καθυπέδειξας, ἀληθείας τὴν γνῶσιν, καὶ προανεκήρυξας, τοῦ Σωτῆρος καὶ Κτίστου, τὴν ἐν σαρκὶ ἐπέλευσιν ἐν γῇ, τὴν ἐπʼ ἐσχάτων φανεῖσαν τοῖς ἔθνεσι.
ltx/gr_gr_cog/me.m10.d19:meMA.Ode3Kathisma2.greekmelody	@ltx/gr_gr_cog/he.a.m1:heAU.TonTafonSouSotir.greekname
ltx/gr_gr_cog/me.m10.d19:meMA.Ode3Kathisma2.incipit	Τοὺς ἄθλους τῶν σεπτῶν, θεωρήσας…
ltx/gr_gr_cog/me.m10.d19:meMA.Ode3Kathisma2.melody	@ltx/gr_gr_cog/he.a.m1:heAU.TonTafonSouSotir.name
ltx/gr_gr_cog/me.m10.d19:meMA.Ode3Kathisma2.mode	@ltx/gr_gr_cog/miscellanea:misc.Mode1
ltx/gr_gr_cog/me.m10.d19:meMA.Ode3Kathisma2.text	Τοὺς ἄθλους τῶν σεπτῶν, θεωρήσας Μαρτύρων, καὶ τούτων τὰ δεσμά, ἀσπαζόμενος πόθῳ, εἰς ὕψος ἀνέδραμες, μαρτυρίου Πανθαύμαστε· ἐπὶ ξύλου γάρ, ἀναρτηθεὶς τὰς αἰκίσεις, ἐκαρτέρησας, ἕως εἰς χεῖρας Κυρίου, τὸ πνεῦμα παρέδωκας.
ltx/gr_gr_cog/me.m10.d19:meMA.Ode3KathismaSt.incipit	Ἡ ἄσπιλος ἀμνάς, τὸν ἀμνὸν…
ltx/gr_gr_cog/me.m10.d19:meMA.Ode3KathismaSt.melody	@ltx/gr_gr_cog/he.a.m1:heAU.TonTafonSouSotir.name
ltx/gr_gr_cog/me.m10.d19:meMA.Ode3KathismaSt.mode	@ltx/gr_gr_cog/miscellanea:misc.Mode1
ltx/gr_gr_cog/me.m10.d19:meMA.Ode3KathismaSt.text	Ἡ ἄσπιλος ἀμνάς, τὸν ἀμνὸν καὶ ποιμένα, κρεμάμενον νεκρόν, ἐπὶ ξύλου ὁρῶσα, θρηνοῦσα ἐφθέγγετο, μητρικῶς ὀλολύζουσα· Πῶς ἐνέγκω σου, τὴν ὑπὲρ λόγον Υἱέ μου, συγκατάβασιν, καὶ τὸ ἑκούσιον πάθος, Θεὲ ὑπεράγαθε;
ltx/gr_gr_cog/me.m10.d19:meMA.Ode3KathismaT.incipit	Ἀνύμφευτε Ἁγνή, Θεοτόκε Μαρία, ἡ…
ltx/gr_gr_cog/me.m10.d19:meMA.Ode3KathismaT.melody	@ltx/gr_gr_cog/he.a.m1:heAU.TonTafonSouSotir.name
ltx/gr_gr_cog/me.m10.d19:meMA.Ode3KathismaT.mode	@ltx/gr_gr_cog/miscellanea:misc.Mode1
ltx/gr_gr_cog/me.m10.d19:meMA.Ode3KathismaT.text	Ἀνύμφευτε Ἁγνή, Θεοτόκε Μαρία, ἡ μόνη τῶν πιστῶν, προστασία καὶ σκέπη, κινδύνων καὶ θλίψεων, καὶ δεινῶν περιστάσεων, πάντας λύτρωσαι, τοὺς ἐπὶ σοὶ τὰς ἐλπίδας, Κόρη ἔχοντας, καὶ τὰς ψυχὰς ἡμῶν σῶσον, ταῖς θείαις πρεσβείαις σου.
ltx/gr_gr_cog/me.m10.d19:meMA.Ode4C11.greekmelody	@ltx/gr_gr_cog/he.h.m2:heHE.EisakikoaKyrieTinAkoin.greekname
ltx/gr_gr_cog/me.m10.d19:meMA.Ode4C11.incipit	Ἵλεως γενοῦ Κύριε, τοῖς εὐσεβῶς…
ltx/gr_gr_cog/me.m10.d19:meMA.Ode4C11.melody	@ltx/gr_gr_cog/he.h.m2:heHE.EisakikoaKyrieTinAkoin.name
ltx/gr_gr_cog/me.m10.d19:meMA.Ode4C11.mode	@ltx/gr_gr_cog/miscellanea:misc.Mode2
ltx/gr_gr_cog/me.m10.d19:meMA.Ode4C11.ode	@ltx/gr_gr_cog/miscellanea:misc.Ode4
ltx/gr_gr_cog/me.m10.d19:meMA.Ode4C11.text	Ἵλεως γενοῦ Κύριε, τοῖς εὐσεβῶς πρὸς σὲ μετανοοῦσιν, ὡς μόνος οἰκτίρμων καὶ πολυέλεος.
ltx/gr_gr_cog/me.m10.d19:meMA.Ode4C12.incipit	Ὡς προήγγειλας Ἔνδοξε, παρὰ Θεοῦ…
ltx/gr_gr_cog/me.m10.d19:meMA.Ode4C12.melody	@ltx/gr_gr_cog/he.h.m2:heHE.EisakikoaKyrieTinAkoin.name
ltx/gr_gr_cog/me.m10.d19:meMA.Ode4C12.mode	@ltx/gr_gr_cog/miscellanea:misc.Mode2
ltx/gr_gr_cog/me.m10.d19:meMA.Ode4C12.ode	@ltx/gr_gr_cog/miscellanea:misc.Ode4
ltx/gr_gr_cog/me.m10.d19:meMA.Ode4C12.text	Ὡς προήγγειλας Ἔνδοξε, παρὰ Θεοῦ ἐκκέχυται τὸ Πνεῦμα, ἐπὶ πᾶσαν σάρκα ἤδη πιστεύσασαν.
ltx/gr_gr_cog/me.m10.d19:meMA.Ode4C13.incipit	Ἡ τοῦ Πνεύματος κάθοδος, τοὺς…
ltx/gr_gr_cog/me.m10.d19:meMA.Ode4C13.melody	@ltx/gr_gr_cog/he.h.m2:heHE.EisakikoaKyrieTinAkoin.name
ltx/gr_gr_cog/me.m10.d19:meMA.Ode4C13.mode	@ltx/gr_gr_cog/miscellanea:misc.Mode2
ltx/gr_gr_cog/me.m10.d19:meMA.Ode4C13.ode	@ltx/gr_gr_cog/miscellanea:misc.Ode4
ltx/gr_gr_cog/me.m10.d19:meMA.Ode4C13.text	Ἡ τοῦ Πνεύματος κάθοδος, τοὺς Μαθητὰς σοφίσασα Κυρίου, τοὺς σοὺς θεηγόρους λόγους ἐτέλεσε.
ltx/gr_gr_cog/me.m10.d19:meMA.Ode4C1T.incipit	Λελυτρωμένοι Πάναγνε, τῶν ζοφερῶν του…
ltx/gr_gr_cog/me.m10.d19:meMA.Ode4C1T.melody	@ltx/gr_gr_cog/he.h.m2:heHE.EisakikoaKyrieTinAkoin.name
ltx/gr_gr_cog/me.m10.d19:meMA.Ode4C1T.mode	@ltx/gr_gr_cog/miscellanea:misc.Mode2
ltx/gr_gr_cog/me.m10.d19:meMA.Ode4C1T.ode	@ltx/gr_gr_cog/miscellanea:misc.Ode4
ltx/gr_gr_cog/me.m10.d19:meMA.Ode4C1T.text	Λελυτρωμένοι Πάναγνε, τῶν ζοφερῶν του ᾋδου κενεώνων, τῷ θείῳ σου τόκῳ, σὲ μακαρίζομεν.
ltx/gr_gr_cog/me.m10.d19:meMA.Ode4C21.greekmelody	@ltx/gr_gr_cog/he.h.m6:heHE.ChristosMouDynamis.greekname
ltx/gr_gr_cog/me.m10.d19:meMA.Ode4C21.incipit	Ἁγίοις στίγμασι, καλλωπιζόμενος, ὡραιότατος ὤφθης…
ltx/gr_gr_cog/me.m10.d19:meMA.Ode4C21.melody	@ltx/gr_gr_cog/he.h.m6:heHE.ChristosMouDynamis.name
ltx/gr_gr_cog/me.m10.d19:meMA.Ode4C21.mode	@ltx/gr_gr_cog/miscellanea:misc.Mode6
ltx/gr_gr_cog/me.m10.d19:meMA.Ode4C21.ode	@ltx/gr_gr_cog/miscellanea:misc.Ode4
ltx/gr_gr_cog/me.m10.d19:meMA.Ode4C21.text	Ἁγίοις στίγμασι, καλλωπιζόμενος, ὡραιότατος ὤφθης καὶ τῷ Θεῷ, Οὔαρε ποθούμενος, τῷ στεφανώσαντι τὴν σήν, κορυφὴν ἀξιοθαύμαστε.
ltx/gr_gr_cog/me.m10.d19:meMA.Ode4C22.incipit	Ἰκρίῳ ἔνδοξε, προσαναρτώμενος, καὶ εἰς…
ltx/gr_gr_cog/me.m10.d19:meMA.Ode4C22.melody	@ltx/gr_gr_cog/he.h.m6:heHE.ChristosMouDynamis.name
ltx/gr_gr_cog/me.m10.d19:meMA.Ode4C22.mode	@ltx/gr_gr_cog/miscellanea:misc.Mode6
ltx/gr_gr_cog/me.m10.d19:meMA.Ode4C22.ode	@ltx/gr_gr_cog/miscellanea:misc.Ode4
ltx/gr_gr_cog/me.m10.d19:meMA.Ode4C22.text	Ἰκρίῳ ἔνδοξε, προσαναρτώμενος, καὶ εἰς γῆν τεταμένος τοὺς χαλεπούς, πόνους ἐκαρτέρησας διʼ ὧν τὴν ἄπονον ζωήν, ἐκληρώσω ἀγαλλόμενος.
ltx/gr_gr_cog/me.m10.d19:meMA.Ode4C23.incipit	Νομίμως βλέποντες, οἱ θεῖοι Μάρτυρες…
ltx/gr_gr_cog/me.m10.d19:meMA.Ode4C23.melody	@ltx/gr_gr_cog/he.h.m6:heHE.ChristosMouDynamis.name
ltx/gr_gr_cog/me.m10.d19:meMA.Ode4C23.mode	@ltx/gr_gr_cog/miscellanea:misc.Mode6
ltx/gr_gr_cog/me.m10.d19:meMA.Ode4C23.ode	@ltx/gr_gr_cog/miscellanea:misc.Ode4
ltx/gr_gr_cog/me.m10.d19:meMA.Ode4C23.text	Νομίμως βλέποντες, οἱ θεῖοι Μάρτυρες, ἐναθλοῦντά σε Μάκαρ ὑπομονῆς, λόγοις παρεθάῤῥυνον, μεθʼ ὧν τοὺς πόνους τοὺς μακρούς, διανύσας μεμακάρισαι.
ltx/gr_gr_cog/me.m10.d19:meMA.Ode4C2T.incipit	Ἰλύος Δέσποινα, παθῶν ἀνάγαγε, καὶ…
ltx/gr_gr_cog/me.m10.d19:meMA.Ode4C2T.melody	@ltx/gr_gr_cog/he.h.m6:heHE.ChristosMouDynamis.name
ltx/gr_gr_cog/me.m10.d19:meMA.Ode4C2T.mode	@ltx/gr_gr_cog/miscellanea:misc.Mode6
ltx/gr_gr_cog/me.m10.d19:meMA.Ode4C2T.ode	@ltx/gr_gr_cog/miscellanea:misc.Ode4
ltx/gr_gr_cog/me.m10.d19:meMA.Ode4C2T.text	Ἰλύος Δέσποινα, παθῶν ἀνάγαγε, καὶ τῆς ταλαιπωρίας τῶν λογισμῶν, τῶν ἀλλοτριούντων με, Θεοῦ τοῦ μόνου καθαροῦ, ἵνα πίστει μακαρίζω σε.
ltx/gr_gr_cog/me.m10.d19:meMA.Ode5C11.greekmelody	@ltx/gr_gr_cog/he.h.m2:heHE.TisNyktosDielthousis.greekname
ltx/gr_gr_cog/me.m10.d19:meMA.Ode5C11.incipit	Τὴν Χριστοῦ παρουσίαν, Ἰωὴλ ὁ…
ltx/gr_gr_cog/me.m10.d19:meMA.Ode5C11.melody	@ltx/gr_gr_cog/he.h.m2:heHE.TisNyktosDielthousis.name
ltx/gr_gr_cog/me.m10.d19:meMA.Ode5C11.mode	@ltx/gr_gr_cog/miscellanea:misc.Mode2
ltx/gr_gr_cog/me.m10.d19:meMA.Ode5C11.ode	@ltx/gr_gr_cog/miscellanea:misc.Ode5
ltx/gr_gr_cog/me.m10.d19:meMA.Ode5C11.text	Τὴν Χριστοῦ παρουσίαν, Ἰωὴλ ὁ θεῖος, διαῤῥήδην πᾶσι προέλεγεν. Ὅτι ἣξει καὶ σώσει, ἀνθρώπων τὸ γένος, ἐκ τῆς τῶν εἰδώλων κακότητος.
ltx/gr_gr_cog/me.m10.d19:meMA.Ode5C12.incipit	Ὁλικῶς ἀνανεύσας, ἔνδοξε Προφῆτα, πρὸς…
ltx/gr_gr_cog/me.m10.d19:meMA.Ode5C12.melody	@ltx/gr_gr_cog/he.h.m2:heHE.TisNyktosDielthousis.name
ltx/gr_gr_cog/me.m10.d19:meMA.Ode5C12.mode	@ltx/gr_gr_cog/miscellanea:misc.Mode2
ltx/gr_gr_cog/me.m10.d19:meMA.Ode5C12.ode	@ltx/gr_gr_cog/miscellanea:misc.Ode5
ltx/gr_gr_cog/me.m10.d19:meMA.Ode5C12.text	Ὁλικῶς ἀνανεύσας, ἔνδοξε Προφῆτα, πρὸς τὰ ὑπὲρ νοῦν καὶ διάνοιαν, προφητείας τὴν χάριν, εἵλκυσας ἐκεῖθεν, καὶ δικαιοσύνην ἐκήρυξας.
ltx/gr_gr_cog/me.m10.d19:meMA.Ode5C13.incipit	Ὑπὲρ τῶν σὲ ὑμνούντων, πρέσβευε…
ltx/gr_gr_cog/me.m10.d19:meMA.Ode5C13.melody	@ltx/gr_gr_cog/he.h.m2:heHE.TisNyktosDielthousis.name
ltx/gr_gr_cog/me.m10.d19:meMA.Ode5C13.mode	@ltx/gr_gr_cog/miscellanea:misc.Mode2
ltx/gr_gr_cog/me.m10.d19:meMA.Ode5C13.ode	@ltx/gr_gr_cog/miscellanea:misc.Ode5
ltx/gr_gr_cog/me.m10.d19:meMA.Ode5C13.text	Ὑπὲρ τῶν σὲ ὑμνούντων, πρέσβευε σωθῆναι, πάσης ἐπηρείας πανόλβιε, Ἰωὴλ καὶ τῆς θείας, χάριτος καὶ αἴγλης, καταξιωθῆναι δυσώπησον.
ltx/gr_gr_cog/me.m10.d19:meMA.Ode5C1T.incipit	Παναγία Παρθένε, Δέσποινα τοῦ κόσμου…
ltx/gr_gr_cog/me.m10.d19:meMA.Ode5C1T.melody	@ltx/gr_gr_cog/he.h.m2:heHE.TisNyktosDielthousis.name
ltx/gr_gr_cog/me.m10.d19:meMA.Ode5C1T.mode	@ltx/gr_gr_cog/miscellanea:misc.Mode2
ltx/gr_gr_cog/me.m10.d19:meMA.Ode5C1T.ode	@ltx/gr_gr_cog/miscellanea:misc.Ode5
ltx/gr_gr_cog/me.m10.d19:meMA.Ode5C1T.text	Παναγία Παρθένε, Δέσποινα τοῦ κόσμου, τοὺς σὲ Θεοτόκον κηρύττοντας, ἐξ ἀμέτρων πταισμάτων, πρέσβευε ῥυσθῆναι, καὶ βιωτικῶν περιστάσεων.
ltx/gr_gr_cog/me.m10.d19:meMA.Ode5C21.greekmelody	@ltx/gr_gr_cog/he.h.m6:heHE.ToTheioFengeiSou.greekname
ltx/gr_gr_cog/me.m10.d19:meMA.Ode5C21.incipit	Νευροῦσαι νεύσεσι θεϊκαῖς, καὶ τοὺς…
ltx/gr_gr_cog/me.m10.d19:meMA.Ode5C21.melody	@ltx/gr_gr_cog/he.h.m6:heHE.ToTheioFengeiSou.name
ltx/gr_gr_cog/me.m10.d19:meMA.Ode5C21.mode	@ltx/gr_gr_cog/miscellanea:misc.Mode6
ltx/gr_gr_cog/me.m10.d19:meMA.Ode5C21.ode	@ltx/gr_gr_cog/miscellanea:misc.Ode5
ltx/gr_gr_cog/me.m10.d19:meMA.Ode5C21.text	Νευροῦσαι νεύσεσι θεϊκαῖς, καὶ τοὺς ἀνενδότους σπαραγμούς, φέρεις γενναίῳ φρονήματι, Οὔαρε σπαράττων τὴν τοῦ ἀλάστορος, καρδίαν τοῦ κακίαν δημιουργήσαντος.
ltx/gr_gr_cog/me.m10.d19:meMA.Ode5C22.incipit	Ὁ περιδέξιος Ἀθλητής, βλέπων ἐκπιπτούσας…
ltx/gr_gr_cog/me.m10.d19:meMA.Ode5C22.melody	@ltx/gr_gr_cog/he.h.m6:heHE.ToTheioFengeiSou.name
ltx/gr_gr_cog/me.m10.d19:meMA.Ode5C22.mode	@ltx/gr_gr_cog/miscellanea:misc.Mode6
ltx/gr_gr_cog/me.m10.d19:meMA.Ode5C22.ode	@ltx/gr_gr_cog/miscellanea:misc.Ode5
ltx/gr_gr_cog/me.m10.d19:meMA.Ode5C22.text	Ὁ περιδέξιος Ἀθλητής, βλέπων ἐκπιπτούσας εἰς τὴν γῆν, τὰς ἑαυτοῦ σάρκας ἔχαιρε, τὰς αἰωνιζούσας νοῒ λαμπρότητας, καὶ θείας ἀντιδόσεις προφανταζόμενος.
ltx/gr_gr_cog/me.m10.d19:meMA.Ode5C23.incipit	 Ὑμνῶ σε Κύριε ὁ…
ltx/gr_gr_cog/me.m10.d19:meMA.Ode5C23.melody	@ltx/gr_gr_cog/he.h.m6:heHE.ToTheioFengeiSou.name
ltx/gr_gr_cog/me.m10.d19:meMA.Ode5C23.mode	@ltx/gr_gr_cog/miscellanea:misc.Mode6
ltx/gr_gr_cog/me.m10.d19:meMA.Ode5C23.ode	@ltx/gr_gr_cog/miscellanea:misc.Ode5
ltx/gr_gr_cog/me.m10.d19:meMA.Ode5C23.text	 Ὑμνῶ σε Κύριε ὁ Θεός, καὶ δοξολογῶ καὶ προσκυνῶ, τῶν ἀγαθῶν ἀξιούμενος, τῶν ἡτοιμασμένων τοῖς σὲ ποθήσασιν, ὁ Μάρτυς ἐν τῷ πάσχειν Οὔαρος ἔκραζεν.
ltx/gr_gr_cog/me.m10.d19:meMA.Ode5C2T.incipit	Ἀναφανεῖσα τῶν Χερουβίμ, καὶ τῶν…
ltx/gr_gr_cog/me.m10.d19:meMA.Ode5C2T.melody	@ltx/gr_gr_cog/he.h.m6:heHE.ToTheioFengeiSou.name
ltx/gr_gr_cog/me.m10.d19:meMA.Ode5C2T.mode	@ltx/gr_gr_cog/miscellanea:misc.Mode6
ltx/gr_gr_cog/me.m10.d19:meMA.Ode5C2T.ode	@ltx/gr_gr_cog/miscellanea:misc.Ode5
ltx/gr_gr_cog/me.m10.d19:meMA.Ode5C2T.text	Ἀναφανεῖσα τῶν Χερουβίμ, καὶ τῶν Σεραφὶμ ὡς ἀληθῶς, ἁγιωτέρα Πανάμωμε, πάντας τοὺς πιστῶς σε νῦν μακαρίζοντας, ἁγίασον καὶ σῶσον τῇ μεσιτείᾳ σου.
ltx/gr_gr_cog/me.m10.d19:meMA.Ode6C11.greekmelody	@ltx/gr_gr_cog/he.h.m2:heHE.AvyssosAmartimaton.greekname
ltx/gr_gr_cog/me.m10.d19:meMA.Ode6C11.incipit	Ῥέουσι τῶν σῶν δογμάτων, πηγαὶ…
ltx/gr_gr_cog/me.m10.d19:meMA.Ode6C11.melody	@ltx/gr_gr_cog/he.h.m2:heHE.AvyssosAmartimaton.name
ltx/gr_gr_cog/me.m10.d19:meMA.Ode6C11.mode	@ltx/gr_gr_cog/miscellanea:misc.Mode2
ltx/gr_gr_cog/me.m10.d19:meMA.Ode6C11.ode	@ltx/gr_gr_cog/miscellanea:misc.Ode6
ltx/gr_gr_cog/me.m10.d19:meMA.Ode6C11.text	Ῥέουσι τῶν σῶν δογμάτων, πηγαὶ τῆς θεηγορίας, καὶ τὸν ψυχοτρόφον γλυκασμόν, στάζουσιν Ἔνδοξε, ἀρδεύουσαι, τοὺς πιστῶς σε τιμῶντας.
ltx/gr_gr_cog/me.m10.d19:meMA.Ode6C12.incipit	Ὄρος σε τῆς προφητείας, γλυκύτητα…
ltx/gr_gr_cog/me.m10.d19:meMA.Ode6C12.melody	@ltx/gr_gr_cog/he.h.m2:heHE.AvyssosAmartimaton.name
ltx/gr_gr_cog/me.m10.d19:meMA.Ode6C12.mode	@ltx/gr_gr_cog/miscellanea:misc.Mode2
ltx/gr_gr_cog/me.m10.d19:meMA.Ode6C12.ode	@ltx/gr_gr_cog/miscellanea:misc.Ode6
ltx/gr_gr_cog/me.m10.d19:meMA.Ode6C12.text	Ὄρος σε τῆς προφητείας, γλυκύτητα ἀποστάζον, καὶ θεοσεβείας Ἰωήλ, κήρυκα πάνσοφον, γνωρίζομεν θεηγόρε Προφῆτα.
ltx/gr_gr_cog/me.m10.d19:meMA.Ode6C13.incipit	Φρούρησον σαῖς ἱκεσίαις, Θεοῦ Προφῆτα…
ltx/gr_gr_cog/me.m10.d19:meMA.Ode6C13.melody	@ltx/gr_gr_cog/he.h.m2:heHE.AvyssosAmartimaton.name
ltx/gr_gr_cog/me.m10.d19:meMA.Ode6C13.mode	@ltx/gr_gr_cog/miscellanea:misc.Mode2
ltx/gr_gr_cog/me.m10.d19:meMA.Ode6C13.ode	@ltx/gr_gr_cog/miscellanea:misc.Ode6
ltx/gr_gr_cog/me.m10.d19:meMA.Ode6C13.text	Φρούρησον σαῖς ἱκεσίαις, Θεοῦ Προφῆτα ὡς ἔχων, θείαν παῤῥησίαν πρὸς τὸν Θεόν, τοὺς πόθῳ ὑμνοῦντας σου, τὴν ἔνδοξον, καὶ ἀοίδιμον μνήμην.
ltx/gr_gr_cog/me.m10.d19:meMA.Ode6C1T.incipit	Φώτισον ἡ φῶς τεκοῦσα, τὸ…
ltx/gr_gr_cog/me.m10.d19:meMA.Ode6C1T.melody	@ltx/gr_gr_cog/he.h.m2:heHE.AvyssosAmartimaton.name
ltx/gr_gr_cog/me.m10.d19:meMA.Ode6C1T.mode	@ltx/gr_gr_cog/miscellanea:misc.Mode2
ltx/gr_gr_cog/me.m10.d19:meMA.Ode6C1T.ode	@ltx/gr_gr_cog/miscellanea:misc.Ode6
ltx/gr_gr_cog/me.m10.d19:meMA.Ode6C1T.text	Φώτισον ἡ φῶς τεκοῦσα, τὸ ἄδυτον τὰς καρδίας, τῶν δοξολογούντων σε πιστῶς, ἄχραντε Δέσποινα, καὶ τὸν ἐκ σοῦ ἀποῤῥήτως τεχθέντα.
ltx/gr_gr_cog/me.m10.d19:meMA.Ode6C21.greekmelody	@ltx/gr_gr_cog/he.h.m6:heHE.TouViouTinThalassan.greekname
ltx/gr_gr_cog/me.m10.d19:meMA.Ode6C21.incipit	Ῥημάτων ἠλόγησας, παρανόμου δικαστοῦ, καὶ…
ltx/gr_gr_cog/me.m10.d19:meMA.Ode6C21.melody	@ltx/gr_gr_cog/he.h.m6:heHE.TouViouTinThalassan.name
ltx/gr_gr_cog/me.m10.d19:meMA.Ode6C21.mode	@ltx/gr_gr_cog/miscellanea:misc.Mode6
ltx/gr_gr_cog/me.m10.d19:meMA.Ode6C21.ode	@ltx/gr_gr_cog/miscellanea:misc.Ode6
ltx/gr_gr_cog/me.m10.d19:meMA.Ode6C21.text	Ῥημάτων ἠλόγησας, παρανόμου δικαστοῦ, καὶ τὴν πυρὰν ὑπέμεινας, τῶν ἀνυποίστων πόνων καρτερικῶς, πολύαθλε Οὔαρε, πρεσβευτὰ τῶν ἐν πίστει ἀνυμνούντων σε.
ltx/gr_gr_cog/me.m10.d19:meMA.Ode6C22.incipit	Οὐκ ἔληξε τύραννος, ὁ παράφρων…
ltx/gr_gr_cog/me.m10.d19:meMA.Ode6C22.melody	@ltx/gr_gr_cog/he.h.m6:heHE.TouViouTinThalassan.name
ltx/gr_gr_cog/me.m10.d19:meMA.Ode6C22.mode	@ltx/gr_gr_cog/miscellanea:misc.Mode6
ltx/gr_gr_cog/me.m10.d19:meMA.Ode6C22.ode	@ltx/gr_gr_cog/miscellanea:misc.Ode6
ltx/gr_gr_cog/me.m10.d19:meMA.Ode6C22.text	Οὐκ ἔληξε τύραννος, ὁ παράφρων ταῖς πληγαῖς, ἀνηλεῶς συγκόπτων σε, ἕως Θεοῦ εἰς χεῖρας τὴν ἱεράν, ψυχὴν ἐναπέδωκας, καλλοναῖς λαμπρυνθεῖσαν τῶν ἀγώνων σου.
ltx/gr_gr_cog/me.m10.d19:meMA.Ode6C23.incipit	Ὑψώθης μιμούμενος, ἐπὶ ξύλου τὸν…
ltx/gr_gr_cog/me.m10.d19:meMA.Ode6C23.melody	@ltx/gr_gr_cog/he.h.m6:heHE.TouViouTinThalassan.name
ltx/gr_gr_cog/me.m10.d19:meMA.Ode6C23.mode	@ltx/gr_gr_cog/miscellanea:misc.Mode6
ltx/gr_gr_cog/me.m10.d19:meMA.Ode6C23.ode	@ltx/gr_gr_cog/miscellanea:misc.Ode6
ltx/gr_gr_cog/me.m10.d19:meMA.Ode6C23.text	Ὑψώθης μιμούμενος, ἐπὶ ξύλου τὸν Χριστόν, καὶ ἐν αὐτῷ κρεμάμενος, τὴν σὴν ψυχὴν παρέδωκας τῷ Θεῷ, τῷ σὲ στεφανώσαντι, Ἀθλοφόρε νομίμως ἀριστεύσαντα.
ltx/gr_gr_cog/me.m10.d19:meMA.Ode6C2T.incipit	Κυβέρνησον Δέσποινα, ἐν πελάγει τῶν…
ltx/gr_gr_cog/me.m10.d19:meMA.Ode6C2T.melody	@ltx/gr_gr_cog/he.h.m6:heHE.TouViouTinThalassan.name
ltx/gr_gr_cog/me.m10.d19:meMA.Ode6C2T.mode	@ltx/gr_gr_cog/miscellanea:misc.Mode6
ltx/gr_gr_cog/me.m10.d19:meMA.Ode6C2T.ode	@ltx/gr_gr_cog/miscellanea:misc.Ode6
ltx/gr_gr_cog/me.m10.d19:meMA.Ode6C2T.text	Κυβέρνησον Δέσποινα, ἐν πελάγει τῶν δεινῶν, χειμαζομένην πάντοτε, τὴν ταπεινὴν ψυχήν μου, καὶ γαληνόν, πρὸς ὅρμον ἀνάγαγε, ἀδιστάκτῳ σε γνώμῃ μακαρίζουσαν.
ltx/gr_gr_cog/me.m10.d19:meMA.Ode6H.greekmelody	@ltx/gr_gr_cog/he.h.m6:heHE.TouViouTinThalassan.greekname
ltx/gr_gr_cog/me.m10.d19:meMA.Ode6H.incipit	@ltx/gr_gr_cog/he.h.m6:heHE.TouViouTinThalassan.incipit
ltx/gr_gr_cog/me.m10.d19:meMA.Ode6H.melody	@ltx/gr_gr_cog/he.h.m6:heHE.TouViouTinThalassan.melody
ltx/gr_gr_cog/me.m10.d19:meMA.Ode6H.mode	@ltx/gr_gr_cog/miscellanea:misc.Mode6
ltx/gr_gr_cog/me.m10.d19:meMA.Ode6H.ode	@ltx/gr_gr_cog/miscellanea:misc.Ode6
ltx/gr_gr_cog/me.m10.d19:meMA.Ode6H.text	@ltx/gr_gr_cog/he.h.m6:heHE.TouViouTinThalassan.text
ltx/gr_gr_cog/me.m10.d19:meMA.Ode7C11.greekmelody	@ltx/gr_gr_cog/he.h.m2:heHE.OTinKaminonPalai.greekname
ltx/gr_gr_cog/me.m10.d19:meMA.Ode7C11.incipit	Ἡ ἐκπορευομένη, ἐκ τοῦ οἴκου…
ltx/gr_gr_cog/me.m10.d19:meMA.Ode7C11.melody	@ltx/gr_gr_cog/he.h.m2:heHE.OTinKaminonPalai.name
ltx/gr_gr_cog/me.m10.d19:meMA.Ode7C11.mode	@ltx/gr_gr_cog/miscellanea:misc.Mode2
ltx/gr_gr_cog/me.m10.d19:meMA.Ode7C11.ode	@ltx/gr_gr_cog/miscellanea:misc.Ode7
ltx/gr_gr_cog/me.m10.d19:meMA.Ode7C11.text	Ἡ ἐκπορευομένη, ἐκ τοῦ οἴκου Κυρίου, καὶ ποτίζουσα κρήνη, ὡς προέφης προῆλθε, Προφῆτα πανσεβάσμιε.
ltx/gr_gr_cog/me.m10.d19:meMA.Ode7C12.incipit	Τὸν χειμάῤῥουν τῶν σχοίνων, σιτοφόρον…
ltx/gr_gr_cog/me.m10.d19:meMA.Ode7C12.melody	@ltx/gr_gr_cog/he.h.m2:heHE.OTinKaminonPalai.name
ltx/gr_gr_cog/me.m10.d19:meMA.Ode7C12.mode	@ltx/gr_gr_cog/miscellanea:misc.Mode2
ltx/gr_gr_cog/me.m10.d19:meMA.Ode7C12.ode	@ltx/gr_gr_cog/miscellanea:misc.Ode7
ltx/gr_gr_cog/me.m10.d19:meMA.Ode7C12.text	Τὸν χειμάῤῥουν τῶν σχοίνων, σιτοφόρον εἰργάσω, τῆς τρυφῆς ὁ χειμάῤῥους, Ἰωὴλ ὡς προεῖπεν· Εὐλογητὸς εἶ Κύριε, ὁ Θεὸς ὁ τῶν Πατέρων ἡμῶν.
ltx/gr_gr_cog/me.m10.d19:meMA.Ode7C1T.incipit	Ὁ τὰ πάντα ποιήσας, γεννηθεὶς…
ltx/gr_gr_cog/me.m10.d19:meMA.Ode7C1T.melody	@ltx/gr_gr_cog/he.h.m2:heHE.OTinKaminonPalai.name
ltx/gr_gr_cog/me.m10.d19:meMA.Ode7C1T.mode	@ltx/gr_gr_cog/miscellanea:misc.Mode2
ltx/gr_gr_cog/me.m10.d19:meMA.Ode7C1T.ode	@ltx/gr_gr_cog/miscellanea:misc.Ode7
ltx/gr_gr_cog/me.m10.d19:meMA.Ode7C1T.text	Ὁ τὰ πάντα ποιήσας, γεννηθεὶς ἐκ Παρθένου, διεσώσατο κόσμον, εὐσεβῶς ἀνυμνοῦντα· Εὐλογητὸς εἶ Κύριε, ὁ Θεὸς ὁ τῶν Πατέρων ἡμῶν.
ltx/gr_gr_cog/me.m10.d19:meMA.Ode7C21.greekmelody	@ltx/gr_gr_cog/he.h.m6:heHE.DrosovolonMenTinKaminon.greekname
ltx/gr_gr_cog/me.m10.d19:meMA.Ode7C21.incipit	Λαμπρυνθέντα σε ἀγώνων ἐπιδόσεσιν, ἡ…
ltx/gr_gr_cog/me.m10.d19:meMA.Ode7C21.melody	@ltx/gr_gr_cog/he.h.m6:heHE.DrosovolonMenTinKaminon.name
ltx/gr_gr_cog/me.m10.d19:meMA.Ode7C21.mode	@ltx/gr_gr_cog/miscellanea:misc.Mode6
ltx/gr_gr_cog/me.m10.d19:meMA.Ode7C21.ode	@ltx/gr_gr_cog/miscellanea:misc.Ode7
ltx/gr_gr_cog/me.m10.d19:meMA.Ode7C21.text	Λαμπρυνθέντα σε ἀγώνων ἐπιδόσεσιν, ἡ Κλεοπάτρα ἔνδοξε, συνεκόμισεν, εὑραμένη κλέος διὰ σοῦ, τῆς πίστεως ἄξιον σαφῶς, ἧς ἐνεδείξατο θερμῶς, εἰς σὲ τελείῳ νοΐ.
ltx/gr_gr_cog/me.m10.d19:meMA.Ode7C22.incipit	Ἐπιχέουσά σοι δάκρυα καὶ μύροις…
ltx/gr_gr_cog/me.m10.d19:meMA.Ode7C22.melody	@ltx/gr_gr_cog/he.h.m6:heHE.DrosovolonMenTinKaminon.name
ltx/gr_gr_cog/me.m10.d19:meMA.Ode7C22.mode	@ltx/gr_gr_cog/miscellanea:misc.Mode6
ltx/gr_gr_cog/me.m10.d19:meMA.Ode7C22.ode	@ltx/gr_gr_cog/miscellanea:misc.Ode7
ltx/gr_gr_cog/me.m10.d19:meMA.Ode7C22.text	Ἐπιχέουσά σοι δάκρυα καὶ μύροις σε, ἐντίμοις ἐπαλείφουσα, κατακρύπτει σε, ὑπὸ γῆν ἡ πάνσεμνος γυνή, ἐνθάψαντα πλάνην πονηράν, καὶ ταῖς ἐκ τάφου ἀστραπαῖς, φωταγωγοῦντα ἡμᾶς.
ltx/gr_gr_cog/me.m10.d19:meMA.Ode7C23.incipit	Οὐκ ἐνέδωκεν ὁσίως θεραπεύουσα, σὲ…
ltx/gr_gr_cog/me.m10.d19:meMA.Ode7C23.melody	@ltx/gr_gr_cog/he.h.m6:heHE.DrosovolonMenTinKaminon.name
ltx/gr_gr_cog/me.m10.d19:meMA.Ode7C23.mode	@ltx/gr_gr_cog/miscellanea:misc.Mode6
ltx/gr_gr_cog/me.m10.d19:meMA.Ode7C23.ode	@ltx/gr_gr_cog/miscellanea:misc.Ode7
ltx/gr_gr_cog/me.m10.d19:meMA.Ode7C23.text	Οὐκ ἐνέδωκεν ὁσίως θεραπεύουσα, σὲ τὸν Χριστοῦ θεράποντα, ἡ ἀείμνηστος, ἕως ὤφθης πρόξενος αὐτῇ, Σοφὲ βασιλείας οὐρανῶν, ἧς ἠξιώθη διὰ σοῦ, σὺν τῷ φιλτάτῳ υἱῷ.
ltx/gr_gr_cog/me.m10.d19:meMA.Ode7C2T.incipit	Συντριβέντα με ἀμέτροις παραβάσεσι, Παρθένε…
ltx/gr_gr_cog/me.m10.d19:meMA.Ode7C2T.melody	@ltx/gr_gr_cog/he.h.m6:heHE.DrosovolonMenTinKaminon.name
ltx/gr_gr_cog/me.m10.d19:meMA.Ode7C2T.mode	@ltx/gr_gr_cog/miscellanea:misc.Mode6
ltx/gr_gr_cog/me.m10.d19:meMA.Ode7C2T.ode	@ltx/gr_gr_cog/miscellanea:misc.Ode7
ltx/gr_gr_cog/me.m10.d19:meMA.Ode7C2T.text	Συντριβέντα με ἀμέτροις παραβάσεσι, Παρθένε μεσιτείᾳ σου, καινοποίησον, ἰατρεύουσά μου τὴν ψυχήν, καὶ λόγον παρέχουσα βοᾶν· Εὐλογημένη ἡ Θεὸν σαρκὶ κυήσασα.
ltx/gr_gr_cog/me.m10.d19:meMA.Ode8C11.greekmelody	@ltx/gr_gr_cog/he.h.m2:heHE.TonPalaiDrosisanta.greekname
ltx/gr_gr_cog/me.m10.d19:meMA.Ode8C11.incipit	Ὑπέδειξας ἔνδοξε, μετανοίας τοὺς τρόπους…
ltx/gr_gr_cog/me.m10.d19:meMA.Ode8C11.melody	@ltx/gr_gr_cog/he.h.m2:heHE.TonPalaiDrosisanta.name
ltx/gr_gr_cog/me.m10.d19:meMA.Ode8C11.mode	@ltx/gr_gr_cog/miscellanea:misc.Mode2
ltx/gr_gr_cog/me.m10.d19:meMA.Ode8C11.ode	@ltx/gr_gr_cog/miscellanea:misc.Ode8
ltx/gr_gr_cog/me.m10.d19:meMA.Ode8C11.text	Ὑπέδειξας ἔνδοξε, μετανοίας τοὺς τρόπους ἐμφανῶς, τὸν εὔσπλαγχον Κύριον, ἐγγυώμενον τοῖς πίστει πρὸς αὐτόν, προσιοῦσι καὶ ψάλλουσιν· Εὐλογεῖτε καὶ ὑπερυψοῦτε, Θεὸν εἰς τοὺς αἰῶνας.
ltx/gr_gr_cog/me.m10.d19:meMA.Ode8C12.incipit	Θεράπων γενόμενος, τοῦ Κυρίου προφῆτα…
ltx/gr_gr_cog/me.m10.d19:meMA.Ode8C12.melody	@ltx/gr_gr_cog/he.h.m2:heHE.TonPalaiDrosisanta.name
ltx/gr_gr_cog/me.m10.d19:meMA.Ode8C12.mode	@ltx/gr_gr_cog/miscellanea:misc.Mode2
ltx/gr_gr_cog/me.m10.d19:meMA.Ode8C12.ode	@ltx/gr_gr_cog/miscellanea:misc.Ode8
ltx/gr_gr_cog/me.m10.d19:meMA.Ode8C12.text	Θεράπων γενόμενος, τοῦ Κυρίου προφῆτα Ἰωήλ, τὰ τούτου μυστήρια, ἐπιστεύθης προφητεύων τοῖς λαοῖς, ἀνυμνοῦσι καὶ λέγουσιν· Εὐλογεῖτε καὶ ὑπερυψοῦτε, Θεόν εἰς τοὺς αἰῶνας.
ltx/gr_gr_cog/me.m10.d19:meMA.Ode8C13.incipit	Ἀφέσεις προχέουσι, τοῦ Ἰούδα θαυμάτων…
ltx/gr_gr_cog/me.m10.d19:meMA.Ode8C13.melody	@ltx/gr_gr_cog/he.h.m2:heHE.TonPalaiDrosisanta.name
ltx/gr_gr_cog/me.m10.d19:meMA.Ode8C13.mode	@ltx/gr_gr_cog/miscellanea:misc.Mode2
ltx/gr_gr_cog/me.m10.d19:meMA.Ode8C13.ode	@ltx/gr_gr_cog/miscellanea:misc.Ode8
ltx/gr_gr_cog/me.m10.d19:meMA.Ode8C13.text	Ἀφέσεις προχέουσι, τοῦ Ἰούδα θαυμάτων ποταμοί, Ἀπόστολοι ἔνδοξοι, τοῦ Κυρίου ὡς προέφη Ἰωήλ, τοὺς βοῶντας ἀρδεύοντες· Εὐλογεῖτε καὶ ὑπερυψοῦτε, Θεὸν εἰς τοὺς αἰῶνας.
ltx/gr_gr_cog/me.m10.d19:meMA.Ode8C1T.incipit	Ὑπόστασιν σύνθετον, ἐν δυσὶ ταῖς…
ltx/gr_gr_cog/me.m10.d19:meMA.Ode8C1T.melody	@ltx/gr_gr_cog/he.h.m2:heHE.TonPalaiDrosisanta.name
ltx/gr_gr_cog/me.m10.d19:meMA.Ode8C1T.mode	@ltx/gr_gr_cog/miscellanea:misc.Mode2
ltx/gr_gr_cog/me.m10.d19:meMA.Ode8C1T.ode	@ltx/gr_gr_cog/miscellanea:misc.Ode8
ltx/gr_gr_cog/me.m10.d19:meMA.Ode8C1T.text	Ὑπόστασιν σύνθετον, ἐν δυσὶ ταῖς οὐσίαις τὸν Χριστόν, Πανάμωμε τέτοκας, διαμείνασα Παρθένος καθαρά· ὃν ὑμνοῦντες κραυγάζομεν· Εὐλογεῖτε καὶ ὑπερυψοῦτε, εἰς πάντας τοὺς αἰῶνας.
ltx/gr_gr_cog/me.m10.d19:meMA.Ode8C21.greekmelody	@ltx/gr_gr_cog/he.h.m6:heHE.EkFlogosToisOsiois.greekname
ltx/gr_gr_cog/me.m10.d19:meMA.Ode8C21.incipit	Μητρικῶς ὑπακούσας Μάρτυς δεήσεων, οὐρανίῳ…
ltx/gr_gr_cog/me.m10.d19:meMA.Ode8C21.melody	@ltx/gr_gr_cog/he.h.m6:heHE.EkFlogosToisOsiois.name
ltx/gr_gr_cog/me.m10.d19:meMA.Ode8C21.mode	@ltx/gr_gr_cog/miscellanea:misc.Mode6
ltx/gr_gr_cog/me.m10.d19:meMA.Ode8C21.ode	@ltx/gr_gr_cog/miscellanea:misc.Ode8
ltx/gr_gr_cog/me.m10.d19:meMA.Ode8C21.text	Μητρικῶς ὑπακούσας Μάρτυς δεήσεων, οὐρανίῳ στρατείᾳ λαμπρῶς ἐστράτευσας, παῖδα τὸν σεπτόν, καὶ τῆς σῆς συμμεθέξοντα, ἔδειξας εὐκλείας, ἀῤῥήτῳ συμπαθείᾳ.
ltx/gr_gr_cog/me.m10.d19:meMA.Ode8C22.incipit	Ἐξ Αἰγύπτου σε ὄλβον ὥς…
ltx/gr_gr_cog/me.m10.d19:meMA.Ode8C22.melody	@ltx/gr_gr_cog/he.h.m6:heHE.EkFlogosToisOsiois.name
ltx/gr_gr_cog/me.m10.d19:meMA.Ode8C22.mode	@ltx/gr_gr_cog/miscellanea:misc.Mode6
ltx/gr_gr_cog/me.m10.d19:meMA.Ode8C22.ode	@ltx/gr_gr_cog/miscellanea:misc.Ode8
ltx/gr_gr_cog/me.m10.d19:meMA.Ode8C22.text	Ἐξ Αἰγύπτου σε ὄλβον ὥς περ πολύτιμον, μετηγάγετο Μάρτυς καταπλουτίζοντα, θείαις δωρεαῖς, Κλεοπάτρα ἰάσεων, πᾶσαν Παλαιστίνην, τὴν πόθῳ σε τιμῶσαν.
ltx/gr_gr_cog/me.m10.d19:meMA.Ode8C23.incipit	Γεγηθὼς τοὺς ἀγῶνας τοὺς σοὺς…
ltx/gr_gr_cog/me.m10.d19:meMA.Ode8C23.melody	@ltx/gr_gr_cog/he.h.m6:heHE.EkFlogosToisOsiois.name
ltx/gr_gr_cog/me.m10.d19:meMA.Ode8C23.mode	@ltx/gr_gr_cog/miscellanea:misc.Mode6
ltx/gr_gr_cog/me.m10.d19:meMA.Ode8C23.ode	@ltx/gr_gr_cog/miscellanea:misc.Ode8
ltx/gr_gr_cog/me.m10.d19:meMA.Ode8C23.text	Γεγηθὼς τοὺς ἀγῶνας τοὺς σοὺς διήνυσας, στρατιῶτα γενναῖε τοῦ Παντοκράτορος, καὶ ὡς νικητής, παρʼ αὐτοῦ ἐστεφάνωσαι, Οὔαρε παμμάκαρ, τῶν Ἀθλοφόρων κλέος.
ltx/gr_gr_cog/me.m10.d19:meMA.Ode8C2T.incipit	Ἁμαρτίας συνάπτω ἐφʼ ἁμαρτήμασι, καὶ…
ltx/gr_gr_cog/me.m10.d19:meMA.Ode8C2T.melody	@ltx/gr_gr_cog/he.h.m6:heHE.EkFlogosToisOsiois.name
ltx/gr_gr_cog/me.m10.d19:meMA.Ode8C2T.mode	@ltx/gr_gr_cog/miscellanea:misc.Mode6
ltx/gr_gr_cog/me.m10.d19:meMA.Ode8C2T.ode	@ltx/gr_gr_cog/miscellanea:misc.Ode8
ltx/gr_gr_cog/me.m10.d19:meMA.Ode8C2T.text	Ἁμαρτίας συνάπτω ἐφʼ ἁμαρτήμασι, καὶ τὸ μέλλον οὐ φρίττω φρικτὸν κριτήριον, ἴασαι Ἁγνὴ τῆς ψυχῆς μου τὴν πώρωσιν, καὶ τῇ σῇ πρεσβείᾳ, ἐπίστρεψόν με σῶσον.
ltx/gr_gr_cog/me.m10.d19:meMA.Ode8H.greekmelody	@ltx/gr_gr_cog/he.h.m6:heHE.EkFlogosToisOsiois.greekname
ltx/gr_gr_cog/me.m10.d19:meMA.Ode8H.incipit	@ltx/gr_gr_cog/he.h.m6:heHE.EkFlogosToisOsiois.incipit
ltx/gr_gr_cog/me.m10.d19:meMA.Ode8H.melody	@ltx/gr_gr_cog/he.h.m6:heHE.EkFlogosToisOsiois.melody
ltx/gr_gr_cog/me.m10.d19:meMA.Ode8H.mode	@ltx/gr_gr_cog/miscellanea:misc.Mode6
ltx/gr_gr_cog/me.m10.d19:meMA.Ode8H.ode	@ltx/gr_gr_cog/miscellanea:misc.Ode8
ltx/gr_gr_cog/me.m10.d19:meMA.Ode8H.text	@ltx/gr_gr_cog/he.h.m6:heHE.EkFlogosToisOsiois.text
ltx/gr_gr_cog/me.m10.d19:meMA.Ode9C11.greekmelody	@ltx/gr_gr_cog/he.h.m2:heHE.IEnOuranois.greekname
ltx/gr_gr_cog/me.m10.d19:meMA.Ode9C11.incipit	Μετὰ Προφητῶν ὡς ὑποφήτης, χαρμονικῶς…
ltx/gr_gr_cog/me.m10.d19:meMA.Ode9C11.melody	@ltx/gr_gr_cog/he.h.m2:heHE.IEnOuranois.name
ltx/gr_gr_cog/me.m10.d19:meMA.Ode9C11.mode	@ltx/gr_gr_cog/miscellanea:misc.Mode2
ltx/gr_gr_cog/me.m10.d19:meMA.Ode9C11.ode	@ltx/gr_gr_cog/miscellanea:misc.Ode9
ltx/gr_gr_cog/me.m10.d19:meMA.Ode9C11.text	Μετὰ Προφητῶν ὡς ὑποφήτης, χαρμονικῶς ἐν ἐπουρανίοις, νῦν εὐφραίνῃ σκηνώμασιν.
ltx/gr_gr_cog/me.m10.d19:meMA.Ode9C12.incipit	Ἄνωθεν ἡμᾶς νῦν ἐποπτεύοις, τοὺς…
ltx/gr_gr_cog/me.m10.d19:meMA.Ode9C12.melody	@ltx/gr_gr_cog/he.h.m2:heHE.IEnOuranois.name
ltx/gr_gr_cog/me.m10.d19:meMA.Ode9C12.mode	@ltx/gr_gr_cog/miscellanea:misc.Mode2
ltx/gr_gr_cog/me.m10.d19:meMA.Ode9C12.ode	@ltx/gr_gr_cog/miscellanea:misc.Ode9
ltx/gr_gr_cog/me.m10.d19:meMA.Ode9C12.text	Ἄνωθεν ἡμᾶς νῦν ἐποπτεύοις, τοὺς εὐσεβῶς σε δοξολογοῦντας, θεηγόρε πανόλβιε.
ltx/gr_gr_cog/me.m10.d19:meMA.Ode9C13.incipit	Σύντομον ὁδὸν τῆς σωτηρίας, ὁ…
ltx/gr_gr_cog/me.m10.d19:meMA.Ode9C13.melody	@ltx/gr_gr_cog/he.h.m2:heHE.IEnOuranois.name
ltx/gr_gr_cog/me.m10.d19:meMA.Ode9C13.mode	@ltx/gr_gr_cog/miscellanea:misc.Mode2
ltx/gr_gr_cog/me.m10.d19:meMA.Ode9C13.ode	@ltx/gr_gr_cog/miscellanea:misc.Ode9
ltx/gr_gr_cog/me.m10.d19:meMA.Ode9C13.text	Σύντομον ὁδὸν τῆς σωτηρίας, ὁ Ἰωὴλ διὰ μετανοίας, θεοφρόνως ὑπέδειξεν.
ltx/gr_gr_cog/me.m10.d19:meMA.Ode9C1T.incipit	Ὤρθωσας ἡμᾶς τοὺς πεπτωκότας, Μήτηρ…
ltx/gr_gr_cog/me.m10.d19:meMA.Ode9C1T.melody	@ltx/gr_gr_cog/he.h.m2:heHE.IEnOuranois.name
ltx/gr_gr_cog/me.m10.d19:meMA.Ode9C1T.mode	@ltx/gr_gr_cog/miscellanea:misc.Mode2
ltx/gr_gr_cog/me.m10.d19:meMA.Ode9C1T.ode	@ltx/gr_gr_cog/miscellanea:misc.Ode9
ltx/gr_gr_cog/me.m10.d19:meMA.Ode9C1T.text	Ὤρθωσας ἡμᾶς τοὺς πεπτωκότας, Μήτηρ Θεοῦ, εὔσπλαγχνον Δεσπότην, καὶ Σωτῆρα γεννήσασα.
ltx/gr_gr_cog/me.m10.d19:meMA.Ode9C21.greekmelody	@ltx/gr_gr_cog/he.h.m6:heHE.TheonAnthropois.greekname
ltx/gr_gr_cog/me.m10.d19:meMA.Ode9C21.incipit	Ἰσχὺν καθεῖλες τοῦ πολεμήτορος, τὴν…
ltx/gr_gr_cog/me.m10.d19:meMA.Ode9C21.melody	@ltx/gr_gr_cog/he.h.m6:heHE.TheonAnthropois.name
ltx/gr_gr_cog/me.m10.d19:meMA.Ode9C21.mode	@ltx/gr_gr_cog/miscellanea:misc.Mode6
ltx/gr_gr_cog/me.m10.d19:meMA.Ode9C21.ode	@ltx/gr_gr_cog/miscellanea:misc.Ode9
ltx/gr_gr_cog/me.m10.d19:meMA.Ode9C21.text	Ἰσχὺν καθεῖλες τοῦ πολεμήτορος, τὴν θεϊκὴν σαφῶς περιζωσάμενος δύναμιν, Ἀθλητὰ γενναιότατε Οὔαρε· ὅθεν σε εὐφημοῦμεν, ἴασιν ἄφθονον, ἐκ τῶν σῶν λειψάνων, οἱ πιστοὶ ἀπαρυόμενοι.
ltx/gr_gr_cog/me.m10.d19:meMA.Ode9C22.incipit	Ὡς φῶς ὡς ὄρθρος ὡς…
ltx/gr_gr_cog/me.m10.d19:meMA.Ode9C22.melody	@ltx/gr_gr_cog/he.h.m6:heHE.TheonAnthropois.name
ltx/gr_gr_cog/me.m10.d19:meMA.Ode9C22.mode	@ltx/gr_gr_cog/miscellanea:misc.Mode6
ltx/gr_gr_cog/me.m10.d19:meMA.Ode9C22.ode	@ltx/gr_gr_cog/miscellanea:misc.Ode9
ltx/gr_gr_cog/me.m10.d19:meMA.Ode9C22.text	Ὡς φῶς ὡς ὄρθρος ὡς μέγας ἥλιος, πάση τῇ γῇ ἡ μνήμη σου ἐξήπλωται Οὔαρε, σελασφόροις φωτίζουσα λάμψεσι, σοῦ τῶν σεπτῶν ἀγώνων, πάντας πανεύφημε, καὶ τὸν σκοτασμὸν τῶν καρδιῶν ἀποδιώκουσα.
ltx/gr_gr_cog/me.m10.d19:meMA.Ode9C23.incipit	Σὺν σοὶ ἀστράπτοντα ὡς ἑώρακε…
ltx/gr_gr_cog/me.m10.d19:meMA.Ode9C23.melody	@ltx/gr_gr_cog/he.h.m6:heHE.TheonAnthropois.name
ltx/gr_gr_cog/me.m10.d19:meMA.Ode9C23.mode	@ltx/gr_gr_cog/miscellanea:misc.Mode6
ltx/gr_gr_cog/me.m10.d19:meMA.Ode9C23.ode	@ltx/gr_gr_cog/miscellanea:misc.Ode9
ltx/gr_gr_cog/me.m10.d19:meMA.Ode9C23.text	Σὺν σοὶ ἀστράπτοντα ὡς ἑώρακε, δόξῃ πολλῇ τὸν ἴδιον υἱὸν ἡ φιλότεκνος, τὸν τῶν ὅλων Θεὸν ἐμεγάλυνε, σὲ δὲ γνησιωτάτως, Μάρτυς ἐδόξασε, μέγιστον προστάτην, ἐμφανῶς καταπλουτήσασα.
ltx/gr_gr_cog/me.m10.d19:meMA.Ode9C24.incipit	Ἡ γῆ ἐν ᾗ σου…
ltx/gr_gr_cog/me.m10.d19:meMA.Ode9C24.melody	@ltx/gr_gr_cog/he.h.m6:heHE.TheonAnthropois.name
ltx/gr_gr_cog/me.m10.d19:meMA.Ode9C24.mode	@ltx/gr_gr_cog/miscellanea:misc.Mode6
ltx/gr_gr_cog/me.m10.d19:meMA.Ode9C24.ode	@ltx/gr_gr_cog/miscellanea:misc.Ode9
ltx/gr_gr_cog/me.m10.d19:meMA.Ode9C24.text	Ἡ γῆ ἐν ᾗ σου τὸ καρτερώτατον, σῶμα Σοφὲ κατάκειται, ἐνθέως ἡγίασται, ἀλλὰ δίδου ἡμῖν ταῖς πρεσβείαις σου, λύσιν ἁμαρτημάτων, βίου διόρθωσιν, Οὔαρε καὶ πάντων, δυσχερῶν τὴν ἀπολυτρωσιν.
ltx/gr_gr_cog/me.m10.d19:meMA.Ode9C2T.incipit	Φανεὶς Παρθένε ἐκ σοῦ ὁ…
ltx/gr_gr_cog/me.m10.d19:meMA.Ode9C2T.melody	@ltx/gr_gr_cog/he.h.m6:heHE.TheonAnthropois.name
ltx/gr_gr_cog/me.m10.d19:meMA.Ode9C2T.mode	@ltx/gr_gr_cog/miscellanea:misc.Mode6
ltx/gr_gr_cog/me.m10.d19:meMA.Ode9C2T.ode	@ltx/gr_gr_cog/miscellanea:misc.Ode9
ltx/gr_gr_cog/me.m10.d19:meMA.Ode9C2T.text	Φανεὶς Παρθένε ἐκ σοῦ ὁ Κύριος, τῆς φωτεινῆς νεφέλης, τῆς Αἰγύπτου τὰ ξόανα, παντελεῖ ἀπωλείᾳ παρέδωκε, πλήθους δὲ Ἀθλοφόρων, ταύτην ἠξίωσε, φέρειν μιμουμένων, τὰ αὐτοῦ σεπτὰ παθήματα.
ltx/gr_gr_cog/me.m10.d19:meMA.Ode9H.greekmelody	@ltx/gr_gr_cog/he.h.m6:heHE.TheonAnthropois.greekname
ltx/gr_gr_cog/me.m10.d19:meMA.Ode9H.incipit	@ltx/gr_gr_cog/he.h.m6:heHE.TheonAnthropois.incipit
ltx/gr_gr_cog/me.m10.d19:meMA.Ode9H.melody	@ltx/gr_gr_cog/he.h.m6:heHE.TheonAnthropois.melody
ltx/gr_gr_cog/me.m10.d19:meMA.Ode9H.mode	@ltx/gr_gr_cog/miscellanea:misc.Mode6
ltx/gr_gr_cog/me.m10.d19:meMA.Ode9H.ode	@ltx/gr_gr_cog/miscellanea:misc.Ode9
ltx/gr_gr_cog/me.m10.d19:meMA.Ode9H.text	@ltx/gr_gr_cog/he.h.m6:heHE.TheonAnthropois.text
ltx/gr_gr_cog/me.m10.d19:meVE.Apolytikion1ger.greekmelody	@ltx/gr_gr_cog/he.a.m4:heAU.TachyProkatalave.greekname
ltx/gr_gr_cog/me.m10.d19:meVE.Apolytikion1ger.incipit	Ὡς ἔμπνουν κειμήλιον, τῶν ἱερῶν…
ltx/gr_gr_cog/me.m10.d19:meVE.Apolytikion1ger.melody	@ltx/gr_gr_cog/he.a.m4:heAU.TachyProkatalave.name
ltx/gr_gr_cog/me.m10.d19:meVE.Apolytikion1ger.mode	@ltx/gr_gr_cog/miscellanea:misc.Mode4
ltx/gr_gr_cog/me.m10.d19:meVE.Apolytikion1ger.poet	@ltx/gr_gr_cog/poets:po.Gerasimou
ltx/gr_gr_cog/me.m10.d19:meVE.Apolytikion1ger.text	Ὡς ἔμπνουν κειμήλιον, τῶν ἱερῶν ἀρετῶν, Προφήτης θεόληπτος, ὤφθης σοφέ, Ἰωήλ, ἐλλάμψει τοῦ Πνεύματος· ὅθεν τῆς εὐσεβείας, ἡ πηγὴ ὡς προέφης, ἔβλυσε τοῖς ἐν κόσμῳ, ἐκ τοῦ οἴκου Κυρίου· ἧς νῦν καταπλαύοντες, πόθῳ τιμῶμέν σε.
ltx/gr_gr_cog/me.m10.d19:meVE.Apolytikion2ger.greekmelody	@ltx/gr_gr_cog/he.a.m5:heAU.TonSynanarchonLogon.greekname
ltx/gr_gr_cog/me.m10.d19:meVE.Apolytikion2ger.incipit	Τῶν Μαρτύρων ζηλώσας τὰ κατορθώματα…
ltx/gr_gr_cog/me.m10.d19:meVE.Apolytikion2ger.melody	@ltx/gr_gr_cog/he.a.m5:heAU.TonSynanarchonLogon.name
ltx/gr_gr_cog/me.m10.d19:meVE.Apolytikion2ger.mode	@ltx/gr_gr_cog/miscellanea:misc.Mode5
ltx/gr_gr_cog/me.m10.d19:meVE.Apolytikion2ger.poet	@ltx/gr_gr_cog/poets:po.Gerasimou
ltx/gr_gr_cog/me.m10.d19:meVE.Apolytikion2ger.text	Τῶν Μαρτύρων ζηλώσας τὰ κατορθώματα, μαρτυρικῶς ἠγωνίσω ὑπὲρ τῆς δόξης Χριστοῦ, καὶ καθεῖλες τὸν ἐχθρὸν παμμάκαρ Οὔαρε· ἐν γὰρ ἰκρίῳ προσδεθείς, πρὸς τῷ ξύλῳ τῆς ζωῆς, νομίμως ἀποκατέστης, πρεσβευτικῇ χορηγίᾳ, καταφαιδρύνων τὰς ψυχὰς ἡμῶν.
ltx/gr_gr_cog/me.m10.d19:meVE.SticStavrotheotokion.greekmelody	@ltx/gr_gr_cog/he.a.m6:heAU.OlinApothemenoi.greekname
ltx/gr_gr_cog/me.m10.d19:meVE.SticStavrotheotokion.incipit	@ltx/gr_gr_cog/me.m01.d15:meVE.AposStavrotheotokion.incipit
ltx/gr_gr_cog/me.m10.d19:meVE.SticStavrotheotokion.melody	@ltx/gr_gr_cog/he.a.m6:heAU.OlinApothemenoi.name
ltx/gr_gr_cog/me.m10.d19:meVE.SticStavrotheotokion.mode	@ltx/gr_gr_cog/miscellanea:misc.Mode6
ltx/gr_gr_cog/me.m10.d19:meVE.SticStavrotheotokion.text	@ltx/gr_gr_cog/me.m01.d15:meVE.AposStavrotheotokion.text
ltx/gr_gr_cog/me.m10.d19:meVE.SticTheotokion.greekmelody	@ltx/gr_gr_cog/he.a.m6:heAU.OlinApothemenoi.greekname
ltx/gr_gr_cog/me.m10.d19:meVE.SticTheotokion.incipit	@ltx/gr_gr_cog/me.m10.d16:meVE.SticTheotokion.incipit
ltx/gr_gr_cog/me.m10.d19:meVE.SticTheotokion.melody	@ltx/gr_gr_cog/he.a.m6:heAU.OlinApothemenoi.name
ltx/gr_gr_cog/me.m10.d19:meVE.SticTheotokion.mode	@ltx/gr_gr_cog/miscellanea:misc.Mode6
ltx/gr_gr_cog/me.m10.d19:meVE.SticTheotokion.text	@ltx/gr_gr_cog/me.m10.d16:meVE.SticTheotokion.text
ltx/gr_gr_cog/me.m10.d19:meVE.Stichera01.greekmelody	@ltx/gr_gr_cog/he.a.m8:heAU.OTouParadoxou.greekname
ltx/gr_gr_cog/me.m10.d19:meVE.Stichera01.incipit	Τὸ θεῖον Πνεῦμα ἐκκέχυται, ὡς…
ltx/gr_gr_cog/me.m10.d19:meVE.Stichera01.melody	@ltx/gr_gr_cog/he.a.m8:heAU.OTouParadoxou.name
ltx/gr_gr_cog/me.m10.d19:meVE.Stichera01.mode	@ltx/gr_gr_cog/miscellanea:misc.Mode8
ltx/gr_gr_cog/me.m10.d19:meVE.Stichera01.text	Τὸ θεῖον Πνεῦμα ἐκκέχυται, ὡς ὁ σεπτὸς Ἰωήλ, προφητεύων ἐθέσπισε, παρʼ αὐτοῦ κινούμενος, ἐφʼ ἡμᾶς τοὺς πιστεύοντας, καὶ μυστηρίων θείων φανέρωσιν, ἀποκαλύπτει, καὶ προφητεύουσιν, οἱ τὴν ἐνέργειαν, τὴν αὐτοῦ δεξάμενοι, καὶ θεϊκῇ, αἴγλῃ φωτιζόμενοι, καὶ θείᾳ χάριτι.
ltx/gr_gr_cog/me.m10.d19:meVE.Stichera02.incipit	Θεηγορίας ἀνάπλεως, ὁ θαυμαστὸς Ἰωήλ…
ltx/gr_gr_cog/me.m10.d19:meVE.Stichera02.melody	@ltx/gr_gr_cog/he.a.m8:heAU.OTouParadoxou.name
ltx/gr_gr_cog/me.m10.d19:meVE.Stichera02.mode	@ltx/gr_gr_cog/miscellanea:misc.Mode8
ltx/gr_gr_cog/me.m10.d19:meVE.Stichera02.text	Θεηγορίας ἀνάπλεως, ὁ θαυμαστὸς Ἰωήλ, ὡς πηγὴ ἐκπορεύεται, τὰς ψυχὰς ἀρδεύουσα, ἐκ τοῦ οἴκου σου Δέσποτα, καὶ γλυκασμὸν ἡμῖν ἀπεστάλαξε, τὰς διανοίας καταγλυκαίνοντα, ὅλος μετάρσιος, γεγονὼς τῷ πνεύματι, δι ʼ ἀρετῆς, ἀνακουφιζόμενος, πρὸς θεῖον ὕψωμα.
ltx/gr_gr_cog/me.m10.d19:meVE.Stichera03.incipit	Προφητικῇ παῤῥησίᾳ σου, καὶ νοερᾷ…
ltx/gr_gr_cog/me.m10.d19:meVE.Stichera03.melody	@ltx/gr_gr_cog/he.a.m8:heAU.OTouParadoxou.name
ltx/gr_gr_cog/me.m10.d19:meVE.Stichera03.mode	@ltx/gr_gr_cog/miscellanea:misc.Mode8
ltx/gr_gr_cog/me.m10.d19:meVE.Stichera03.text	Προφητικῇ παῤῥησίᾳ σου, καὶ νοερᾷ πρὸς Θεόν, Ἰωὴλ οἰκειότητι, διʼ ἧς τὰ οὐράνια, κατοπτεύεις θεάματα, ὑπὲρ ἡμῶν αὐτὸν ἐξιλέωσαι, τῶν ἐκτελούντων, πίστει τὴν μνήμην σου, λύσιν αἰτούμενος, τῶν πταισμάτων ἔνδοξε, καὶ μετοχήν, θείων ἀπολαύσεων, καὶ μέγα ἔλεος.
ltx/gr_gr_cog/me.m10.d19:meVE.Stichera04.greekmelody	@ltx/gr_gr_cog/he.a.m6:heAU.OlinApothemenoi.greekname
ltx/gr_gr_cog/me.m10.d19:meVE.Stichera04.incipit	Ἄθλους θεασάμενος, τῶν καλλινίκων Μαρτύρων…
ltx/gr_gr_cog/me.m10.d19:meVE.Stichera04.melody	@ltx/gr_gr_cog/he.a.m6:heAU.OlinApothemenoi.name
ltx/gr_gr_cog/me.m10.d19:meVE.Stichera04.mode	@ltx/gr_gr_cog/miscellanea:misc.Mode6
ltx/gr_gr_cog/me.m10.d19:meVE.Stichera04.text	Ἄθλους θεασάμενος, τῶν καλλινίκων Μαρτύρων, θάρσους θείου ἔμπλεως, γεγονὼς εἰσέδραμες εἰς τὸ στάδιον, καὶ Χριστὸν Οὔαρε, διʼ ἡμᾶς ἄνθρωπον, γεγονότα ἀνεκήρυξας, μὴ πτήξας θάνατον, μηδὲ τὰ προκείμενα βάσανα· διὸ καταικιζόμενος, καὶ ἀνηλεῶς συγκοπτόμενος, ἔχαιρες τελείῳ, νοῒ ἀποσκοπούμενος σοφέ, τὴν διαμένουσαν εὔκλειαν, τοῖς Θεὸν ποθήσασι.
ltx/gr_gr_cog/me.m10.d19:meVE.Stichera05.incipit	Σάρκας σὺν τοῖς αἵμασι, καταπιπτούσας…
ltx/gr_gr_cog/me.m10.d19:meVE.Stichera05.melody	@ltx/gr_gr_cog/he.a.m6:heAU.OlinApothemenoi.name
ltx/gr_gr_cog/me.m10.d19:meVE.Stichera05.mode	@ltx/gr_gr_cog/miscellanea:misc.Mode6
ltx/gr_gr_cog/me.m10.d19:meVE.Stichera05.text	Σάρκας σὺν τοῖς αἵμασι, καταπιπτούσας ἑώρας, καὶ ὡς ἄλλου πάσχοντος, Ἀθλητὰ διέκεισο γενναιότατε, προσδεθεὶς ξύλῳ γάρ, σπαραγμοὺς ἤνεγκας, ὑπʼ ἀνόμων καρτερώτατα, Θεοῦ εἰς χεῖρας δέ, πνεῦμά σου τὸ θεῖον παρέδωκας, ἐκπλήξας τοὺς ὁρῶντάς σε, ταῖς ἀπεριτρέπτοις ἐνστάσεσιν· ὅθεν σε τιμῶμεν, μεγάλως ἀριστεύσαντα Σοφέ, καὶ καθελόντα τὸν τύραννον, Οὔαρε τοῖς πόνοις σου.
ltx/gr_gr_cog/me.m10.d19:meVE.Stichera06.incipit	Ἀλείφουσα μύροις σε, ἡ θαυμαστὴ…
ltx/gr_gr_cog/me.m10.d19:meVE.Stichera06.melody	@ltx/gr_gr_cog/he.a.m6:heAU.OlinApothemenoi.name
ltx/gr_gr_cog/me.m10.d19:meVE.Stichera06.mode	@ltx/gr_gr_cog/miscellanea:misc.Mode6
ltx/gr_gr_cog/me.m10.d19:meVE.Stichera06.text	Ἀλείφουσα μύροις σε, ἡ θαυμαστὴ Κλεοπάτρα, ὑπὸ γῆν κατέθετο, καὶ ναὸν πανάγιον ἀνεδείματο, ἑορτὴν ἄγουσα, θαυμαστὴν Οὔαρε, καὶ πιστῶς σε λιτανεύουσα· ἧς τὸ παιδάριον, νοητῇ στρατείᾳ κατέλεξας, καὶ δόξῃ κατεκάλλυνας, καὶ χοροῖς Ἁγίων συνέταξας· οὗ πὲρ τῆς μερίδος, ἀξίωσον ἡμᾶς τοὺς εὐσεβῶς, τὴν σὴν τελοῦντας πανήγυριν, Μάρτυς ἀξιάγαστε.
