ltx/gr_gr_cog/sy.m06.d25:cl.syMA.commemoration01.text	[saint/com 1]
ltx/gr_gr_cog/sy.m06.d25:cl.syMA.commemoration02.text	[saint/com 2]
ltx/gr_gr_cog/sy.m06.d25:cl.syMA.commemoration03.text	[saint/com 3]
ltx/gr_gr_cog/sy.m06.d25:cl.syMA.commemoration04.text	[saint/com 4]
ltx/gr_gr_cog/sy.m06.d25:cl.syMA.commemoration05.text	[saint/com 5]
ltx/gr_gr_cog/sy.m06.d25:cl.syMA.commemoration06.text	[saint/com list]
ltx/gr_gr_cog/sy.m06.d25:syMA.commemoration01.couplet1.title	@ltx/gr_gr_cog/titles:ti.Verses
ltx/gr_gr_cog/sy.m06.d25:syMA.commemoration01.couplet1.verse1	Προὶξ τῇ γυναικῶν καλλονῇ Φεβρωνία.
ltx/gr_gr_cog/sy.m06.d25:syMA.commemoration01.couplet1.verse2	Τομὴ κεφαλῆς· ὡς καλή σοι προὶξ γύναι!
ltx/gr_gr_cog/sy.m06.d25:syMA.commemoration01.narration.p01	Αὕτη ἡ ἀοίδιμος καὶ Ὁσία ἐκ νεαρᾶς ἡλικίας τὸν χρηστὸν τοῦ Κυρίου ζυγὸν ἀραμένη, καὶ ὁσίως βιοῦσα ὑπὸ τὸν κανόνα τῆς κατʼ αὐτὴν Μονῆς, ἐν τοῖς μεθορίοις Περσῶν καὶ Ῥωμαίων διακειμένης, ἐν πόλει λεγομένῃ Νισίβει, ἥτις λέγεται Ἀντιόχεια τῆς Μυγδονίας, πάσας τὰς σὺν αὐτῇ, μεθʼ ὧν ἦν, ὑπερήλασεν ἐν τῇ ἀσκήσει καὶ συνέσει, καὶ τῇ τῶν γραφῶν ἀναγνώσει. Ἐξῆρχε δὲ καὶ καθηγεῖτο πασῶν ἡ οὕτω καλουμένη Βρυαίνη.
ltx/gr_gr_cog/sy.m06.d25:syMA.commemoration01.narration.p02	Κατὰ δὲ τοὺς καιροὺς Διοκλητιανοῦ, Σελήνου τοῦ Ἡγεμόνος διώκοντος τοὺς Χριστιανούς, αἱ μὲν λοιπαὶ τῶν μοναζουσῶν τοῦ Μοναστηρίου ἐξῆλθον, ἐκφυγεῖν τὸν ἐπικείμενον θάνατον σπεύδουσαι, ἡ δὲ μακαρία Φεβρωνία, νόσου τότε κατασχούσης αὐτήν, μὴ δυναμένη τῷ σώματι χρήσασθαι, ἐπί τινος κατέκειτο βάθρου, παρακαθεζομένων αὐτῇ τῆς τε Βρυαίνης, καὶ τῆς οὕτω καλουμένης συγκλητικῆς Ἱερείας. Ἐπεὶ δὲ παρῆσαν οἱ Σελήνου στρατιῶται, καὶ πελέκεσι τὰς θύρας καταῤῥάξαντες εἰσῆλθον, εὐθὺς μὲν σπασάμενοι τὰς μαχαίρας, κατακόψαι ἐβούλοντο τὴν Βρυαίνην. Ἀλλὰ ταῦτα μὲν τὰ ἀνήκεστα παθεῖν αὐτὴν παρῃτήσατο Πρῖμος ὁ τοῦ Λυσιμάχου ἀνεψιός, τοῖς Χριστιανοῖς ἀεὶ ἐπιεικῶς καὶ συμπαθῶς προσφερόμενος.
ltx/gr_gr_cog/sy.m06.d25:syMA.commemoration01.narration.p03	Τὴν οὖν Φεβρωνίαν ἁρπάσαντες, πρὸς τὸν ἡγεμόνα Σελῆνον ἦγον, ᾗ παρηκολούθουν Βρυαίνῃ καὶ Ἱερεία καὶ Θωμαΐς, ἐπιστηρίζουσαι αὐτὴν τῇ πίστει, καὶ νουθετοῦσαι μὴ καταπλαγῆναι τὰς βασάνους, μηδὲ τὴν εἰς Χριστὸν προδοῦναι εὐσέβειαν, μνησθεῖσαν Λιβύης καὶ Λεωνίδος τῶν ἀδελφῶν, καὶ τῆς Εὐτροπίας· ὧν Λιβύη μὲν διὰ Χριστὸν ἐτμήθη τὴν κεφαλήν, ἡ Λεωνὶς δὲ παρεδέδοτο πυρί, τὸ δὲ παιδίον Εὐτροπία, ἀκούσασα παρὰ τῆς μητρός· «Μή φύγῃς τέκνον», τὰς χεῖρας αὐτῆς ὀπίσω ποιήσασα, τοῖς δημίοις τὸν αὐχένα ὑπέθηκε. Καὶ ἡ μὲν Βρυαίνη, μετὰ τὸ ἱκανῶς νουθετῆσαι αὐτήν, ἐν τῷ Μοναστηρίῳ ὑπέστρεψεν, ὀλολύζουσα καὶ θρηνοῦσα καὶ τοῦ τέλους τὸ ἄδηλον φοβουμένη, καὶ νίκην αὐτῇ κατὰ τοῦ διαβόλου παρὰ Θεοῦ ἐξαιτοῦσα. Ἡ δὲ Θωμαΐς καὶ Ἱέρεια, ἀνδρικὸν σχῆμα περιθέμεναι, συνηκολούθουν τῇ Ἁγίᾳ μετὰ τῶν οἰκετῶν ἑαυτὰς ἐγκαταμίξασαι.
ltx/gr_gr_cog/sy.m06.d25:syMA.commemoration01.narration.p04	Ἐπεὶ δὲ ἤχθη, πρῶτον μὲν ἐπί Λυσιμάχου τοῦ ἀνεψιοῦ Σελήνου τό τε ὄνομα, καὶ τὸ γένος καὶ τὴν θρησκείαν εἰπεῖν ἐρωτηθεῖσα, καὶ ἀντὶ πάντων Χριστιανὴν ἑαυτὴν ὀνομάσασα, ἔπειτα τὴν ἐξέτασιν ὑπέστη· ὃς αὐτὴν θωπείαις καὶ κολακείαις μεταθεῖναι ἀπὸ τῆς εἰς Χριστὸν πίστεως ἐπιχειρήσας, καὶ μὴ δυνηθείς, ταθῆναι ἐκ τεσσάρων ἐκέλευσε, καὶ κάτωθεν μὲν πυρὶ ὑποκαίεσθαι, ἄνωθεν δὲ ὑπὸ στρατιωτῶν τύπτεσθαι. Ὑπὸ δὲ τῶν πληγῶν καὶ τοῦ πυρός, ἐλαίῳ ἐρεθιζομένου καὶ ἀναφλεγομένου, διελύοντο καὶ κατέῤῥεον αἱ σάρκες αὐτῆς. Εἶτα κρεμασθῆναι ταύτην, καὶ σιδηροῖς ξέεσθαι πλήκτροις, καὶ πυρὶ καταφλεχθῆναι προστάττει, καὶ μετὰ ταῦτα τὴν γλῶτταν τμηθῆναι, ἣν προὔτεινεν εὐθαρσῶς· καὶ τοὺς ὀδόντας ἐκριζωθῆναι, εἶτα ξίφει τοὺς δύο ἀφαιρεθῆναι μαστούς, κατὰ τῆς τομῆς πῦρ ἐπιχεθῆναι, καὶ ἐπὶ τούτοις τὰς χεῖρας καὶ τοὺς πόδας ἐκκοπῆναι, καὶ ἐπὶ πᾶσι τούτοις ἀποτμηθῆναι τὴν κεφαλήν.
ltx/gr_gr_cog/sy.m06.d25:syMA.commemoration01.narration.p05	Συγκομισθὲν δὲ τὸ τῆς Ἁγίας λείψανον παρά τῶν πιστῶν, τοῦ Λυσιμάχου προστάξαντος, διὰ Φίρμου τοῦ Κόμητος, ἀπήχθη ἐν τῇ Μονῇ στρατιωτῶν βασταζόντων αὐτὸ ἅμα τῷ Φίρμῳ· καὶ συνετέθη ἕκαστον ἐν τάξει τῶν μελῶν, τῶν ὀδόντων αὐτῆς ἐν τῷ ἑαυτῆς στήθει τεθέντων. Καὶ οὕτω μετά ψαλμῶν καὶ ὕμνων, συνδραμόντων Ἐπισκόπων καὶ Κληρικῶν ἅμα καὶ πλήθους πολλοῦ τῶν Χριστιανῶν, παννύχοις ᾠδαῖς ἔτυχε τῆς ὀφειλομένης κηδείας.
ltx/gr_gr_cog/sy.m06.d25:syMA.commemoration01.narration.p06	Τῆς οὖν μνήμης αὐτῆς ἐτησίως τελουμένης ἐν τῇ Μονῇ, λέγεται ἡ Μάρτυς καθορᾶσθαι, συμπαροῦσα καὶ συμψάλλουσα ταῖς παρθένοις, καὶ τὸν ἑαυτῆς τόπον ἀναπληροῦσα μέχρι τῆς εὐχῆς· ἣν ἐπιχειρησάσης τῆς Βρυαίνης ποτὲ κατασχεῖν, εὐθέως ἀφανῆ γενέσθαι, τὴν ἐπιβολὴν μὴ ὑπομείνασαν τῆς χειρός. Τὸν δὲ Λυσίμαχον, βαρεῖαν συμφορὰν ἡγησάμενον τὸ συμβάν, διά τε τὸ ἐκ μητρὸς εἶναι Χριστιανῆς, καὶ διὰ τὸ ὠμῶς αὐτῇ καὶ θηριωδῶς τὸν Σελῆνον χρήσασθαι, καὶ διαφθεῖραι τὸ τῆς παρθένου κάλλος κρεῖττον ἢ κατὰ ἄνθρωπον ὄν, τότε μὲν ἀπόσιτον γενέσθαι, καὶ τὸν τῆς Μάρτυρος θάνατον κόψασθαι, καὶ θρηνῆσαι πικρῶς, μικρὸν δὲ ὕστερον μετὰ Πρίμου προσελθεῖν τῷ Χριστῷ, καὶ τὸ θεῖον δέξασθαι Βάπτισμα. Τὸν δὲ Σελῆνον, ἔξω γενόμενον αὑτοῦ, ἀτενίσαι πρὸς τὸν οὐρανὸν καὶ ὥσπερ βοῦν μυκησάμενον μέγα, ἑνὶ τῶν κιόνων προσρῆξαι τὴν κεφαλήν, καὶ οὕτω κακῶς τὴν ψυχὴν ἀποῤῥῆξαι.
ltx/gr_gr_cog/sy.m06.d25:syMA.commemoration01.single1	Δῶκε δὲ Φεβρωνίη ξίφει αὐχένα εἰκάδι πέμπτῃ.
ltx/gr_gr_cog/sy.m06.d25:syMA.commemoration01.text	Τῇ ΚΕʹ τοῦ αὐτοῦ μηνός, μνήμη τῆς Ἁγίας Ὁσιομάρτυρος καὶ πολυάθλου Φεβρωνίας.
ltx/gr_gr_cog/sy.m06.d25:syMA.commemoration02.couplet1.title	Στίχοι εἰς τὸν Ὀρέντιον
ltx/gr_gr_cog/sy.m06.d25:syMA.commemoration02.couplet1.verse1	Ἐκδὺς θαλάσσης ζῶν Ὀρέντιος βάθους,
ltx/gr_gr_cog/sy.m06.d25:syMA.commemoration02.couplet1.verse2	Ἐν γῆ τελευτᾷ καὶ πρὸς οὐρανὸν τρέχει.
ltx/gr_gr_cog/sy.m06.d25:syMA.commemoration02.couplet2.title	Εἰς τὸν Φαρνάκιον
ltx/gr_gr_cog/sy.m06.d25:syMA.commemoration02.couplet2.verse1	Ἄρας ὁ Φαρνάκιος ἐκ γῆς πηλίνης,
ltx/gr_gr_cog/sy.m06.d25:syMA.commemoration02.couplet2.verse2	Ἀνῆλθεν εἰς ἔδαφος οἴκου Κυρίου.
ltx/gr_gr_cog/sy.m06.d25:syMA.commemoration02.couplet3.title	Εἰς τὸν Ἔρωτα
ltx/gr_gr_cog/sy.m06.d25:syMA.commemoration02.couplet3.verse1	Ἐρῶν ὑπῆρχεν οὐρανῶν κάλλους Ἔρως,
ltx/gr_gr_cog/sy.m06.d25:syMA.commemoration02.couplet3.verse2	Πρὸς οὓς μεταστάς, ὥσπερ ἦρα χαιρέτω.
ltx/gr_gr_cog/sy.m06.d25:syMA.commemoration02.couplet4.title	Εἰς τὸν Φῖρμον καὶ Φιρμῖνον
ltx/gr_gr_cog/sy.m06.d25:syMA.commemoration02.couplet4.verse1	Θρόνοι νοητοὶ Φιρμῖνός τε καὶ Φῖρμος,
ltx/gr_gr_cog/sy.m06.d25:syMA.commemoration02.couplet4.verse2	Οἷς ἐγκάθηται Βασιλεὺς τῶν Ἀγγέλων.
ltx/gr_gr_cog/sy.m06.d25:syMA.commemoration02.couplet5.title	Εἰς τὸν Κυριακὸν καὶ Λογγῖνον
ltx/gr_gr_cog/sy.m06.d25:syMA.commemoration02.couplet5.verse1	Κυριακόν, Λογγῖνον ὡς ἰσαγγέλους,
ltx/gr_gr_cog/sy.m06.d25:syMA.commemoration02.couplet5.verse2	Θεὸς τίθησιν ἰσοτίμους Ἀγγέλοις.
ltx/gr_gr_cog/sy.m06.d25:syMA.commemoration02.narration.p01	Οὗτοι οἱ Ἅγιοι ἑπτὰ Μάρτυρες ἀδελφοὶ ὑπῆρχον, ἐπὶ Διοκλητιανοῦ καὶ Μαξιμιανοῦ τῶν βασιλέων, ὁρμώμενοι τῶν ἀφʼ ἡλίου ἀνατολῶν, στρατευόμενοί τε μετὰ χιλίων διακοσίων Τυρώνων (νεοσυλλέκτων στρατιωτῶν) ὑπὸ Ῥόδωνα Κουβικουλάριον (θαλαμηπόλον) ἐν τῇ Ἀντιοχέων πόλει· οἳ καὶ ἦλθον ἐν τοῖς Θρᾳκώοις μέρεσι, ταχθέντες εἰς λεγεῶνα, καλούμενον Λεγέανδρον. Ἐπαναστάσεως δὲ κατὰ τοὺς τότε χρόνους γεγενημένης, τῶν Σκυθῶν διαβάντων τὸν Ἴστρον, καὶ τὴν Θρᾴκην ληϊζομένων, ἄρτι μετὰ τὴν τελευτὴν Διοκλητιανοῦ, Μαξιμιανὸς τὴν βασιλείαν κατασχών, ἐν φροντίδι πολλῇ καὶ ἀμηχανίᾳ γέγονε, μάλιστα, διὰ τὸν Μαραθὼμ τὸν ἐξάρχοντα τῶν Σκυθῶν, μεγέθει σώματος καὶ ῥώμῃ τῶν πολλῶν διαφέροντα, προσκαλεῖσθαι αὐτόν, ἢ τινὰ τῶν μετʼ αὐτοῦ διαγωνίσασθαι· καὶ παρʼ οἷς ἂν τὸ κρεῖττον γένηται, τούτοις παραχωρῆσαι τοὺς ἑτέρους τῆς νίκης.
ltx/gr_gr_cog/sy.m06.d25:syMA.commemoration02.narration.p02	Διὰ ταῦτα τοίνυν τοῦ βασιλέως ἐν πολλῇ ἀπορίᾳ καθεστηκότος, ὡς μηδενὸς θαῤῥοῦντος ἀντεπεξιέναι καὶ συμπλακῆναι τῷ βαρβάρῳ, προετράπη ὁ ἅγιος Ὀρέντιος ἐξελθεῖν· πάσαις γὰρ ψήφοις ἐκρίθη, ὡς εἴη ῥωμαλέος καὶ πολέμων ἔμπειρος, καί, διʼ εὐστροφίαν σώματος καὶ ἀνδρείαν, δεινὸς ἐπιθέσθαι, καὶ τόν ἐπεξιόντα καταβαλεῖν. Ὃς τὴν εἰς Χριστὸν πίστιν προβαλλόμενος, καὶ πρὸς τὸν πόλεμον ἐξελθών, καὶ τῷ Σκύθῃ παραταξάμενος, ἀκοντίῳ τοῦτον διήλασε· καὶ ξίφει αὐτοῦ τὴν κεφαλὴν ἐκτεμών, τῷ βασιλεῖ προσεκόμισε καὶ τὸ τρόπαιον ἔστησεν. Ἐφʼ οἷς τοῦ βασιλέως ὑπερθαυμάσαντος καὶ ἀγασθέντος, καὶ διὰ τοῦτο ἐπινικίους σπονδὰς τοῖς εἰδώλοις προσάγοντος, αὐτὸς τῇ τοῦ Χριστοῦ συμμαχίᾳ καὶ δυνάμει περιγενέσθαι τοῦ ἀλαζόνος, οὐ τῇ τῶν ψευδωνύμων θεῶν βοηθείᾳ, παῤῥησίᾳ καθομολογεῖ.
ltx/gr_gr_cog/sy.m06.d25:syMA.commemoration02.narration.p03	Ἀλλὰ τότε μὲν καρποῦσθαι τὰς βασιλικὰς συνεχωρήθη τιμάς, αἰδεσθέντος, οἶμαι, τοῦ βασιλέως τὸ τοῦ κατορθώματος μέγιστον, καὶ τὴν ζώνην αὐτῷ προπαρασχομένου τοῦ καταβληθέντος βαρβάρου, πολυτελῆ καὶ πολυτάλαντον οὖσαν. Ὕστερον δέ, ἐπεὶ παραινῶν ἀποστῆναι τοῦ Χριστοῦ οὐκ ἔπειθεν, ἐκπέμπει αὐτὸν μετὰ τῶν ἓξ ἀδελφῶν αὐτοῦ ἐν τῇ κατὰ Ἀρμενίαν πόλει τῶν Σατάλων, ἐπιστείλας τῷ ἐκεῖ Δουκί, εἰ μὲν ἐξεταζόμενοι πεισθῶσι θῦσαι τοῖς θεοῖς, ἀναπέμψαι τούτους πρὸς αὐτόν· εἰ δὲ οὐ πείθονται, ὑπερορίους ἐν ταῖς κατὰ Ἀβασγίαν καὶ Ζηκχίαν χώραις ποιῆσαι.
ltx/gr_gr_cog/sy.m06.d25:syMA.commemoration02.narration.p04	Κατὰ οὖν τὸ τοῦ βασιλέως πρόσταγμα, ἀπαγομένων αὐτῶν, καὶ τὴν οὕτω λεγομένην Κοινὴν Παρεμβολὴν φθασάντων, Ἔρως, ὁ τῶν ἀδελφῶν πρῶτος, πρὸς Κύριον ἐξεδήμησε, μηνὶ Ἰουνίῳ εἰκοστῇ δευτέρᾳ. Ὁ δὲ ἅγιος Ὀρέντιος, τὸ Ῥίζιον καταλαβών, λίθῳ τῷ τραχήλῳ περιτεθείς, ἐῤῥίφθη ἐν τῇ θαλάσσῃ· περὶ αὐτοῦ γὰρ καὶ τοῦτο ἐδέδοκτο. Ἐκεῖθεν δέ, διʼ ἐπιστησίας Ἀγγέλου, ἀβλαβὴς ἐξῆλθε, κομίσαντος αὐτόν, καὶ κατὰ τὴν ξηρὰν ἐπί τινος πέτρας στήσαντος, καὶ εὐξάμενος, ἀφῆκε τὸ πνεῦμα, καὶ ἐκεῖ ἐτάφη, μηνὶ τῷ αὐτῷ εἰκοστῇ τετάρτῃ. Ὁ δὲ ἅγιος Φαρνάκιος, γενόμενος ἐν Κορδύλῃ, πρὸς Κύριον μετετέθη, τῇ τρίτῃ τοῦ Ἰουλίου μηνός. Τῇ δὲ ἑβδόμῃ, Φῖρμος καὶ Φιρμῖνος, καταλαβόντες τὴν Ἅψαρον, τέλος εὕραντο τῆς προσκαίρου ζωῆς. Ὁ δὲ ἅγιος Κυριακός, ἀπαχθεὶς εἰς τὴν τῶν Λαζῶν χώραν, ἐν τόπῳ λεγομένῳ Ζυγάνεως, ἀνεπαύσατο ἐν Κυρίῳ, τῇ τεσσαρεσκαιδεκάτῃ τοῦ μηνός. Ὁ δὲ μακάριος Λογγῖνος ὕστερος πάντων· ὅς, ἐν τῷ παραπλέειν ἀπὸ τῆς Ζυγάνεως ἐπὶ τὴν Λιβυκήν, τρικυμίας ἐν τῇ θαλάσσῃ γενομένης καὶ μεγάλου κλύδωνος, εὐξάμενος, τῷ Θεῷ τὸ πνεῦμα παρέθετο, καὶ κατετέθη εἰς Πιτυοῦντα, μεθʼ ἡμέρας τέσσαρας ἐκεῖσε τοῦ πλοίου ὁρμήσαντος.
ltx/gr_gr_cog/sy.m06.d25:syMA.commemoration02.text	Τῇ αὐτῇ ἡμέρᾳ, Μνήμη τοῦ Ἁγίου Μάρτυρος Ὀρεντίου, καὶ τῶν ἓξ γνησίων ἀδελφῶν αὐτοῦ, ὧν τὰ ὀνόματα Φαρνάκιος, Ἔρως, Φῖρμος, Φιρμῖνος, Κυριακὸς καὶ Λογγῖνος.
ltx/gr_gr_cog/sy.m06.d25:syMA.commemoration03.text	Τῇ αὐτῇ ἡμέρᾳ, ἡ ἀνάμνησις τῆς ὑπὲρ λόγον καὶ πᾶσαν ἐλπίδα δοθείσης ἡμῖν βοηθείας παρὰ τοῦ μεγάλου Θεοῦ καὶ Σωτῆρος ἡμῶν Ἰησοῦ Χριστοῦ, διὰ τῶν πρεσβείων τῆς ἀσπόρως αὐτὸν τεκούσης, κατὰ τῶν διὰ γῆς τε καὶ θαλάσσης, κυκλωσάντων τὴν καθʼ ἡμᾶς Βασιλίδα τῶν πόλεων, καὶ πανωλεθρίᾳ παραδοθέντων τελείῳ ἀφανισμῷ.
ltx/gr_gr_cog/sy.m06.d25:syMA.lastline	Ταῖς τῆς Θεοτόκου καὶ πάντων σου τῶν Ἁγίων πρεσβείαις, Χριστὲ ὁ Θεός, ἐλέησον ἡμᾶς. Ἀμήν.
