ltx/gr_gr_cog/le.ep.va.museum:levaMU.Epistle1.book_abbr	@ltx/gr_gr_cog/bible:Acts.abbr
ltx/gr_gr_cog/le.ep.va.museum:levaMU.Epistle1.book_string	@ltx/gr_gr_cog/bible:Acts.text
ltx/gr_gr_cog/le.ep.va.museum:levaMU.Epistle1.chapverse	@ltx/gr_gr_cog/le.ep.mc.d071:lemcLI.Epistle.chapverse
ltx/gr_gr_cog/le.ep.va.museum:levaMU.Epistle1.incipit	@ltx/gr_gr_cog/le.ep.mc.d071:lemcLI.Epistle.incipit
ltx/gr_gr_cog/le.ep.va.museum:levaMU.Epistle1.text	@ltx/gr_gr_cog/le.ep.mc.d071:lemcLI.Epistle.text
ltx/gr_gr_cog/le.ep.va.museum:levaMU.Epistle1.title	Εἰς Μουσεῖον
ltx/gr_gr_cog/le.ep.va.museum:levaMU.Epistle1.title_abbr	Εἰς Μουσεῖον
ltx/gr_gr_cog/le.ep.va.museum:levaMU.Epistle1.version	@ltx/gr_gr_cog/properties:version.designation
