ltx/gr_gr_cog/le.ep.mc.d202:lemcLI.Epistle.book_abbr	@ltx/gr_gr_cog/bible:Corinthians2.abbr
ltx/gr_gr_cog/le.ep.mc.d202:lemcLI.Epistle.book_string	@ltx/gr_gr_cog/bible:Corinthians2.text
ltx/gr_gr_cog/le.ep.mc.d202:lemcLI.Epistle.chapverse	7:10 – 16
ltx/gr_gr_cog/le.ep.mc.d202:lemcLI.Epistle.incipit	Ἡ κατὰ Θεὸν λύπη μετάνοιαν εἰς σωτηρίαν…
ltx/gr_gr_cog/le.ep.mc.d202:lemcLI.Epistle.text	Ἀδελφοί, ἡ κατὰ Θεὸν λύπη μετάνοιαν εἰς σωτηρίαν ἀμεταμέλητον κατεργάζεται· ἡ δὲ τοῦ κόσμου λύπη θάνατον κατεργάζεται. ἰδοὺ γὰρ αὐτὸ τοῦτο, τὸ κατὰ Θεὸν λυπηθῆναι ὑμᾶς, πόσην κατειργάσατο ὑμῖν σπουδήν, ἀλλὰ ἀπολογίαν, ἀλλὰ ἀγανάκτησιν, ἀλλὰ φόβον, ἀλλὰ ἐπιπόθησιν, ἀλλὰ ζῆλον, ἀλλὰ ἐκδίκησιν! ἐν παντὶ συνεστήσατε ἑαυτοὺς ἁγνοὺς εἶναι ἐν τῷ πράγματι. ἄρα εἰ καὶ ἔγραψα ὑμῖν, οὐχ εἵνεκεν τοῦ ἀδικήσαντος, οὐδὲ εἵνεκεν τοῦ ἀδικηθέντος, ἀλλ᾿ εἵνεκεν τοῦ φανερωθῆναι τὴν σπουδὴν ὑμῶν τὴν ὑπὲρ ἡμῶν πρὸς ὑμᾶς ἐνώπιον τοῦ Θεοῦ. Διὰ τοῦτο παρακεκλήμεθα. ἐπὶ δὲ τῇ παρακλήσει ὑμῶν περισσοτέρως μᾶλλον ἐχάρημεν ἐπὶ τῇ χαρᾷ Τίτου, ὅτι ἀναπέπαυται τὸ πνεῦμα αὐτοῦ ἀπὸ πάντων ὑμῶν· ὅτι εἴ τι αὐτῷ ὑπὲρ ὑμῶν κεκαύχημαι, οὐ κατῃσχύνθην, ἀλλ᾿ ὡς πάντα ἐν ἀληθείᾳ ἐλαλήσαμεν ὑμῖν, οὕτω καὶ ἡ καύχησις ἡμῶν ἡ ἐπὶ Τίτου ἀλήθεια ἐγενήθη. καὶ τὰ σπλάγχνα αὐτοῦ περισσοτέρως εἰς ὑμᾶς ἐστιν ἀναμιμνησκομένου τὴν πάντων ὑμῶν ὑπακοήν, ὡς μετὰ φόβου καὶ τρόμου ἐδέξασθε αὐτόν. χαίρω ὅτι ἐν παντὶ θαρρῶ ἐν ὑμῖν.
ltx/gr_gr_cog/le.ep.mc.d202:lemcLI.Epistle.title	Τῇ Παρασκευῇ τῆς ΙΒʹ Ἑβδομάδος
ltx/gr_gr_cog/le.ep.mc.d202:lemcLI.Epistle.title_abbr	Παρασκευῇ τῆς ΙΒʹ Ἑβδομάδος
ltx/gr_gr_cog/le.ep.mc.d202:lemcLI.Epistle.version	@ltx/gr_gr_cog/properties:version.designation
