ltx/gr_gr_cog/tr.d046:trCO.header	(Μέγα)
ltx/gr_gr_cog/tr.d046:trDA.commemoration.full	
ltx/gr_gr_cog/tr.d046:trDA.commemoration.short	Τετάρτη τῆς Δʹ Ἑβδομάδος
ltx/gr_gr_cog/tr.d046:trDA.insert1	
ltx/gr_gr_cog/tr.d046:trDA.insert2	
ltx/gr_gr_cog/tr.d046:trDA.note	
ltx/gr_gr_cog/tr.d046:trDA.title	
ltx/gr_gr_cog/tr.d046:trHO.commemorations	
ltx/gr_gr_cog/tr.d046:trHO.daytitle	
ltx/gr_gr_cog/tr.d046:trHO.description1	
ltx/gr_gr_cog/tr.d046:trHO.description2	
ltx/gr_gr_cog/tr.d046:trHO.note1	
ltx/gr_gr_cog/tr.d046:trHO.note2	
ltx/gr_gr_cog/tr.d046:trMA.AposGlory.incipit	Μεσάσαντες τὸ πέλαγος τῆς ἐγκρατείας…
ltx/gr_gr_cog/tr.d046:trMA.AposGlory.melody	@ltx/gr_gr_cog/miscellanea:misc.Idiomelon
ltx/gr_gr_cog/tr.d046:trMA.AposGlory.mode	@ltx/gr_gr_cog/miscellanea:misc.Mode8
ltx/gr_gr_cog/tr.d046:trMA.AposGlory.text	Μεσάσαντες τὸ πέλαγος τῆς ἐγκρατείας, λιμένα ἐκδεχόμεθα τῆς σωτηρίας, τὸν καιρὸν τοῦ Πάθους σου, τοῦ ἑκουσίου Κύριε, ἀλλʼ ὡς εὔσπλαγχνος καὶ οἰκτίρμων, καὶ τὴν ἡμέραν τῆς ἐνδόξου Ἀναστάσεώς σου, ἐν εἰρήνῃ ἀξίωσον ἡμᾶς, θεάσασθαι φιλάνθρωπε.
ltx/gr_gr_cog/tr.d046:trMA.AposIdiomelon1.incipit	Τῆς Νηστείας τὴν ὁδὸν μεσάσαντες…
ltx/gr_gr_cog/tr.d046:trMA.AposIdiomelon1.melody	@ltx/gr_gr_cog/miscellanea:misc.Idiomelon
ltx/gr_gr_cog/tr.d046:trMA.AposIdiomelon1.mode	@ltx/gr_gr_cog/miscellanea:misc.Mode8
ltx/gr_gr_cog/tr.d046:trMA.AposIdiomelon1.text	Τῆς Νηστείας τὴν ὁδὸν μεσάσαντες, τὴν ἄγουσαν ἐπὶ τὸν Σταυρόν σου τὸν τίμιον, τὴν σὴν ἡμέραν ἰδεῖν, ἣν εἶδεν Ἀβραὰμ καὶ ἐχάρη, ὡς ἐκ τάφου τοῦ βουνοῦ, ζῶντα λαβὼν τὸν Ἰσαάκ, εὐδόκησον καὶ ἡμᾶς, πίστει ῥυσθέντας τοῦ ἐχθροῦ, καὶ Δείπνου μετασχεῖν τοῦ μυστικοῦ, ἐν εἰρήνῃ κράζοντας· ὁ φωτισμὸς καὶ ὁ Σωτὴρ ἡμῶν, δόξα σοι.
ltx/gr_gr_cog/tr.d046:trMA.AposMartyric.incipit	Μάρτυρες Χριστοῦ οἱ ἀήττητοι, οἱ…
ltx/gr_gr_cog/tr.d046:trMA.AposMartyric.melody	
ltx/gr_gr_cog/tr.d046:trMA.AposMartyric.mode	@ltx/gr_gr_cog/miscellanea:misc.Mode8
ltx/gr_gr_cog/tr.d046:trMA.AposMartyric.text	Μάρτυρες Χριστοῦ οἱ ἀήττητοι, οἱ νικήσαντες τὴν πλάνην, τῇ δυνάμει τοῦ Σταυροῦ, ἀπελάβετε τὴν χάριν τῆς αἰωνίου ζωῆς. Τυράννων ἀπειλὰς οὐκ ἑπτοήθητε, βασάνοις αἰκιζόμενοι εὐφραίνεσθε, καὶ νῦν τὰ αἵματα ὑμῶν, γέγονεν ἰάματα ταῖς ψυχαῖς ἡμῶν, πρεσβεύσατε τοῦ σωθῆναι τὰς ψυχὰς ἡμῶν.
ltx/gr_gr_cog/tr.d046:trMA.C1.acrostic.notice1	οὗ ἡ Ἀκροστιχίς·
ltx/gr_gr_cog/tr.d046:trMA.C1.acrostic.text	Τὸ πανσέβαστον προσκυνήσωμεν Ξύλον.
ltx/gr_gr_cog/tr.d046:trMA.C1.acrostic.title	Κανὼν τοῦ Σταυροῦ,
ltx/gr_gr_cog/tr.d046:trMA.C1.poet	@ltx/gr_gr_cog/poets:po.KyriouTheofanous
ltx/gr_gr_cog/tr.d046:trMA.C1.title	@ltx/gr_gr_cog/titles:ti.Canon1Triodion
ltx/gr_gr_cog/tr.d046:trMA.C1.verse	@ltx/gr_gr_cog/prayers:pr.verse_Cross.text
ltx/gr_gr_cog/tr.d046:trMA.C2.poet	@ltx/gr_gr_cog/poets:po.Iosif
ltx/gr_gr_cog/tr.d046:trMA.C2.title	Τὸ Τριῴδιον.
ltx/gr_gr_cog/tr.d046:trMA.C2.verse	@ltx/gr_gr_cog/prayers:pr.verse_Cross.text
ltx/gr_gr_cog/tr.d046:trMA.C3.poet	@ltx/gr_gr_cog/poets:po.Theodorou
ltx/gr_gr_cog/tr.d046:trMA.C3.title	Ἕτερον Τριῴδιον.
ltx/gr_gr_cog/tr.d046:trMA.C3.verse	@ltx/gr_gr_cog/prayers:pr.verse_Cross.text
ltx/gr_gr_cog/tr.d046:trMA.ExapTheotokion.greekmelody	@ltx/gr_gr_cog/he.a.m3:heAU.EnPnevmatiToIero.greekname
ltx/gr_gr_cog/tr.d046:trMA.ExapTheotokion.incipit	Ἡ ἄνυμφος καὶ πάναγνος, τοῦ…
ltx/gr_gr_cog/tr.d046:trMA.ExapTheotokion.melody	@ltx/gr_gr_cog/he.a.m3:heAU.EnPnevmatiToIero.name
ltx/gr_gr_cog/tr.d046:trMA.ExapTheotokion.mode	@ltx/gr_gr_cog/miscellanea:misc.Mode3
ltx/gr_gr_cog/tr.d046:trMA.ExapTheotokion.text	Ἡ ἄνυμφος καὶ πάναγνος, τοῦ Θεοῦ Λόγου Μήτηρ, ἐβόα ὀλολύζουσα, ἐν κλαυθμῷ θρηνῳδοῦσα· Τοιαῦτά μοι ὁ Γαβριήλ, τῆς χαρᾶς ἐκόμιζε, τὰ εὐαγγέλια Τέκνον, ἄπιθι τοῦ πληρῶσαι, τὴν ἀπόῤῥητον βουλήν, καὶ θείαν οἰκονομίαν.
ltx/gr_gr_cog/tr.d046:trMA.Exaposteilarion1.greekmelody	@ltx/gr_gr_cog/he.a.m3:heAU.EnPnevmatiToIero.greekname
ltx/gr_gr_cog/tr.d046:trMA.Exaposteilarion1.incipit	Μεσότητι τῶν Νηστειῶν, τὸ πανσέβαστον…
ltx/gr_gr_cog/tr.d046:trMA.Exaposteilarion1.melody	@ltx/gr_gr_cog/he.a.m3:heAU.EnPnevmatiToIero.name
ltx/gr_gr_cog/tr.d046:trMA.Exaposteilarion1.mode	@ltx/gr_gr_cog/miscellanea:misc.Mode3
ltx/gr_gr_cog/tr.d046:trMA.Exaposteilarion1.text	Μεσότητι τῶν Νηστειῶν, τὸ πανσέβαστον Ξύλον, τοὺς πάντας εἰς προσκύνησιν, προσκαλεῖται τοὺς ὅσοι, τὰ ἑαυτῶν παθήματα, τοῖς τοῦ Χριστοῦ παθήμασιν, ἀξίως συναφικνοῦσι. Δεῦτε πάντες οἱ πιστοί, προσκυνήσωμεν τὸ Ξύλον, τοῦ φρικτοῦ μυστηρίου.
ltx/gr_gr_cog/tr.d046:trMA.Kathisma21.greekmelody	@ltx/gr_gr_cog/he.a.m6:heAU.ElpisTouKosmouAgathi.greekname
ltx/gr_gr_cog/tr.d046:trMA.Kathisma21.incipit	Τῆς ἐγκρατείας τὸν καιρόν, ἁγιάζων…
ltx/gr_gr_cog/tr.d046:trMA.Kathisma21.melody	@ltx/gr_gr_cog/he.a.m6:heAU.ElpisTouKosmouAgathi.name
ltx/gr_gr_cog/tr.d046:trMA.Kathisma21.mode	@ltx/gr_gr_cog/miscellanea:misc.Mode6
ltx/gr_gr_cog/tr.d046:trMA.Kathisma21.text	Τῆς ἐγκρατείας τὸν καιρόν, ἁγιάζων ὁ θεῖος, καὶ πανσεβάσμιος Σταυρός, εἰς προσκύνησιν κεῖται, προσέλθωμεν ἐν συνειδήσει καθαρᾷ, ἀντλήσωμεν ἁγιασμὸν καὶ φωτισμόν, καὶ φόβῳ ἐκβοήσωμεν· Σωτὴρ ἡμῶν φιλάνθρωπε, δόξα τῇ εὐσπλαγχνίᾳ σου.
ltx/gr_gr_cog/tr.d046:trMA.Kathisma22.greekmelody	@ltx/gr_gr_cog/he.a.m6:heAU.ElpisTouKosmouAgathi.greekname
ltx/gr_gr_cog/tr.d046:trMA.Kathisma22.incipit	Παρισταμένη τῷ Σταυρῷ, ἡ ἀπειρόγαμος…
ltx/gr_gr_cog/tr.d046:trMA.Kathisma22.melody	@ltx/gr_gr_cog/he.a.m6:heAU.ElpisTouKosmouAgathi.name
ltx/gr_gr_cog/tr.d046:trMA.Kathisma22.mode	@ltx/gr_gr_cog/miscellanea:misc.Mode6
ltx/gr_gr_cog/tr.d046:trMA.Kathisma22.text	Παρισταμένη τῷ Σταυρῷ, ἡ ἀπειρόγαμος Μήτηρ, τοῦ ἐξ αὐτῆς ἄνευ σπορᾶς τεχθέντος, ἀνεβόησε· Ῥομφαία τὴν καρδίαν μου, διῆλθεν ὦ Υἱέ, μὴ φέρουσα κρεμάμενον ἐν ξύλῳ σε ὁρᾶν, ὃν τρέμουσι τὰ σύμπαντα, ὡς Κτίστην καὶ Θεόν· Μακρόθυμε δόξα σοι.
ltx/gr_gr_cog/tr.d046:trMA.Kathisma31.incipit	Λαμπροφοροῦντες ταῖς ἀρεταῖς προσέλθωμεν, τῆς…
ltx/gr_gr_cog/tr.d046:trMA.Kathisma31.melody	Ἀπεγνωσμένην.
ltx/gr_gr_cog/tr.d046:trMA.Kathisma31.mode	@ltx/gr_gr_cog/miscellanea:misc.Mode1
ltx/gr_gr_cog/tr.d046:trMA.Kathisma31.text	Λαμπροφοροῦντες ταῖς ἀρεταῖς προσέλθωμεν, τῆς ἐγκρατείας τὸ καθαρὸν κτησάμενοι, καὶ Σταυρὸν τὸν τίμιον, βοῶντες προσκυνήσωμεν. Ἁγίασον ἡμῶν σὺν ταῖς ψυχαῖς, καὶ τὰ σώματα, ἀξίωσον ἡμᾶς, καὶ τοῦ ἀχράντου Πάθους σου, ὁ μόνος Θεὸς ἁπάντων, χαριζόμενος ἡμῖν καὶ τὰ ἐλέη σου.
ltx/gr_gr_cog/tr.d046:trMA.Kathisma32.greekmelody	@ltx/gr_gr_cog/he.a.m1:heAU.TonTafonSouSotir.greekname
ltx/gr_gr_cog/tr.d046:trMA.Kathisma32.incipit	Ὁρῶσά σε Χριστέ, ἡ πανάμωμος…
ltx/gr_gr_cog/tr.d046:trMA.Kathisma32.melody	@ltx/gr_gr_cog/he.a.m1:heAU.TonTafonSouSotir.name
ltx/gr_gr_cog/tr.d046:trMA.Kathisma32.mode	@ltx/gr_gr_cog/miscellanea:misc.Mode1
ltx/gr_gr_cog/tr.d046:trMA.Kathisma32.text	Ὁρῶσά σε Χριστέ, ἡ πανάμωμος Μήτηρ, νεκρὸν ἐπὶ Σταυροῦ, ἡπλωμένον ἐβόα· Υἱέ μου συνάναρχε, τῷ Πατρὶ καὶ τῷ Πνεύματι, τίς ἡ ἄφατος οἰκονομία σου αὕτη, διʼ ἧς ἔσωσας, τὸ τῶν ἀχράντων χειρῶν σου, Οἰκτίρμον πλαστούργημα;
ltx/gr_gr_cog/tr.d046:trMA.Kontakion1.incipit	@ltx/gr_gr_cog/tr.d043:trMA.Kontakion1.incipit
ltx/gr_gr_cog/tr.d046:trMA.Kontakion1.melody	@ltx/gr_gr_cog/miscellanea:misc.Automelon
ltx/gr_gr_cog/tr.d046:trMA.Kontakion1.mode	@ltx/gr_gr_cog/miscellanea:misc.Mode7
ltx/gr_gr_cog/tr.d046:trMA.Kontakion1.text	@ltx/gr_gr_cog/tr.d043:trMA.Kontakion1.text
ltx/gr_gr_cog/tr.d046:trMA.Ode1C11.greekmelody	@ltx/gr_gr_cog/he.h.m4:heHE.AnoixoToStomaMou.greekname
ltx/gr_gr_cog/tr.d046:trMA.Ode1C11.incipit	Τὸ Ξύλον τὸ ἅγιον, ἐν…
ltx/gr_gr_cog/tr.d046:trMA.Ode1C11.melody	@ltx/gr_gr_cog/he.h.m4:heHE.AnoixoToStomaMou.name
ltx/gr_gr_cog/tr.d046:trMA.Ode1C11.mode	@ltx/gr_gr_cog/miscellanea:misc.Mode4
ltx/gr_gr_cog/tr.d046:trMA.Ode1C11.ode	@ltx/gr_gr_cog/miscellanea:misc.Ode1
ltx/gr_gr_cog/tr.d046:trMA.Ode1C11.text	Τὸ Ξύλον τὸ ἅγιον, ἐν ᾧ Χριστὸς ἐξεπέτασε, παλάμας τροπούμενος, τὰς ἐναντίας ἀρχάς, προσκυνήσωμεν, νηστείᾳ φαιδρυνθέντες, εἰς δόξαν καὶ αἴνεσιν, τοῦ Παντοκράτορος.
ltx/gr_gr_cog/tr.d046:trMA.Ode1C12.incipit	Ὁρᾶται προκείμενος, ἁγιασμὸν παρεχόμενος, Σταυρὸς…
ltx/gr_gr_cog/tr.d046:trMA.Ode1C12.melody	@ltx/gr_gr_cog/he.h.m4:heHE.AnoixoToStomaMou.name
ltx/gr_gr_cog/tr.d046:trMA.Ode1C12.mode	@ltx/gr_gr_cog/miscellanea:misc.Mode4
ltx/gr_gr_cog/tr.d046:trMA.Ode1C12.ode	@ltx/gr_gr_cog/miscellanea:misc.Ode1
ltx/gr_gr_cog/tr.d046:trMA.Ode1C12.text	Ὁρᾶται προκείμενος, ἁγιασμὸν παρεχόμενος, Σταυρὸς ὁ σωτήριος, τούτῳ προσέλθωμεν, καθαγνίσαντες, καὶ σῶμα καὶ καρδίαν, καὶ ἀπαρυσώμεθα, χάριν σωτήριον.
ltx/gr_gr_cog/tr.d046:trMA.Ode1C13.incipit	Πυρί με καθάρισον, τῶν ἐντολῶν…
ltx/gr_gr_cog/tr.d046:trMA.Ode1C13.melody	@ltx/gr_gr_cog/he.h.m4:heHE.AnoixoToStomaMou.name
ltx/gr_gr_cog/tr.d046:trMA.Ode1C13.mode	@ltx/gr_gr_cog/miscellanea:misc.Mode4
ltx/gr_gr_cog/tr.d046:trMA.Ode1C13.ode	@ltx/gr_gr_cog/miscellanea:misc.Ode1
ltx/gr_gr_cog/tr.d046:trMA.Ode1C13.text	Πυρί με καθάρισον, τῶν ἐντολῶν σου φιλάνθρωπε, καὶ σοῦ τὰ σωτηρία, δίδου Παθήματα, νῦν θεάσασθαι, καὶ πόθῳ προσκυνῆσαι, Σταυρῷ τειχιζόμενον, καὶ συντηρούμενον.
ltx/gr_gr_cog/tr.d046:trMA.Ode1C1H.greekmelody	@ltx/gr_gr_cog/he.h.m4:heHE.AnoixoToStomaMou.greekname
ltx/gr_gr_cog/tr.d046:trMA.Ode1C1H.incipit	@ltx/gr_gr_cog/he.h.m4:heHE.AnoixoToStomaMou.incipit
ltx/gr_gr_cog/tr.d046:trMA.Ode1C1H.melody	@ltx/gr_gr_cog/he.h.m4:heHE.AnoixoToStomaMou.melody
ltx/gr_gr_cog/tr.d046:trMA.Ode1C1H.mode	@ltx/gr_gr_cog/miscellanea:misc.Mode4
ltx/gr_gr_cog/tr.d046:trMA.Ode1C1H.ode	@ltx/gr_gr_cog/miscellanea:misc.Ode1
ltx/gr_gr_cog/tr.d046:trMA.Ode1C1H.text	@ltx/gr_gr_cog/he.h.m4:heHE.AnoixoToStomaMou.text
ltx/gr_gr_cog/tr.d046:trMA.Ode1C1T.incipit	Ἀνάρτησιν βλέπουσα, τὴν ἐν Σταυρῷ…
ltx/gr_gr_cog/tr.d046:trMA.Ode1C1T.melody	@ltx/gr_gr_cog/he.h.m4:heHE.AnoixoToStomaMou.name
ltx/gr_gr_cog/tr.d046:trMA.Ode1C1T.mode	@ltx/gr_gr_cog/miscellanea:misc.Mode4
ltx/gr_gr_cog/tr.d046:trMA.Ode1C1T.ode	@ltx/gr_gr_cog/miscellanea:misc.Ode1
ltx/gr_gr_cog/tr.d046:trMA.Ode1C1T.text	Ἀνάρτησιν βλέπουσα, τὴν ἐν Σταυρῷ σου Φιλάνθρωπε, ὠλόλυζε κράζουσα, ἡ σὲ κυήσασα. Πῶς κατάκριτος, ὁ μέλλων πάντα κρῖναι, ὁρᾶται κρεμάμενος, δόξης ὁ Κύριος
ltx/gr_gr_cog/tr.d046:trMA.Ode3C11.greekmelody	@ltx/gr_gr_cog/he.h.m4:heHE.TousSousYmnologous.greekname
ltx/gr_gr_cog/tr.d046:trMA.Ode3C11.incipit	Νηστείας ἐν ὕδατι καρδίας, ῥιφθέντες…
ltx/gr_gr_cog/tr.d046:trMA.Ode3C11.melody	@ltx/gr_gr_cog/he.h.m4:heHE.TousSousYmnologous.name
ltx/gr_gr_cog/tr.d046:trMA.Ode3C11.mode	@ltx/gr_gr_cog/miscellanea:misc.Mode4
ltx/gr_gr_cog/tr.d046:trMA.Ode3C11.ode	@ltx/gr_gr_cog/miscellanea:misc.Ode3
ltx/gr_gr_cog/tr.d046:trMA.Ode3C11.text	Νηστείας ἐν ὕδατι καρδίας, ῥιφθέντες τὸ ξύλον τοῦ Σταυροῦ, πιστῶς περιπτυξώμεθα, ἐν ᾧ Χριστὸς σταυρούμενος, ὕδωρ ἡμῖν ἐπήγασεν, ὡς εὐεργέτης, ἀφέσεως.
ltx/gr_gr_cog/tr.d046:trMA.Ode3C12.incipit	Σταυροῦ τῷ ἱστίῳ πτερωθέντες, τὸν…
ltx/gr_gr_cog/tr.d046:trMA.Ode3C12.melody	@ltx/gr_gr_cog/he.h.m4:heHE.TousSousYmnologous.name
ltx/gr_gr_cog/tr.d046:trMA.Ode3C12.mode	@ltx/gr_gr_cog/miscellanea:misc.Mode4
ltx/gr_gr_cog/tr.d046:trMA.Ode3C12.ode	@ltx/gr_gr_cog/miscellanea:misc.Ode3
ltx/gr_gr_cog/tr.d046:trMA.Ode3C12.text	Σταυροῦ τῷ ἱστίῳ πτερωθέντες, τὸν πλοῦτον σωτήριον ἰδού, νηστείας ἐκμεσάσαντες, Μεσσία Ἰησοῦ ὁ Θεός, διʼ οὗ ἡμᾶς τοῦ Πάθους σου πρὸς τὸν λιμένα ἐγκαθόρμισον.
ltx/gr_gr_cog/tr.d046:trMA.Ode3C13.incipit	Ἐτύπου Μωσῆς σε ἐν τῷ…
ltx/gr_gr_cog/tr.d046:trMA.Ode3C13.melody	@ltx/gr_gr_cog/he.h.m4:heHE.TousSousYmnologous.name
ltx/gr_gr_cog/tr.d046:trMA.Ode3C13.mode	@ltx/gr_gr_cog/miscellanea:misc.Mode4
ltx/gr_gr_cog/tr.d046:trMA.Ode3C13.ode	@ltx/gr_gr_cog/miscellanea:misc.Ode3
ltx/gr_gr_cog/tr.d046:trMA.Ode3C13.text	Ἐτύπου Μωσῆς σε ἐν τῷ ὄρει, ἐθνῶν εἰς ἀναίρεσιν Σταυρέ, ἡμεῖς δὲ ἐκτυποῦμέν σε, καρδίᾳ καθορῶντές σε, καὶ προσκυνοῦντες τρέπομεν, ἐχθροὺς ἀσάρκους τῇ δυνάμει σου.
ltx/gr_gr_cog/tr.d046:trMA.Ode3C1H.greekmelody	@ltx/gr_gr_cog/he.h.m4:heHE.TousSousYmnologous.greekname
ltx/gr_gr_cog/tr.d046:trMA.Ode3C1H.incipit	@ltx/gr_gr_cog/he.h.m4:heHE.TousSousYmnologous.incipit
ltx/gr_gr_cog/tr.d046:trMA.Ode3C1H.melody	@ltx/gr_gr_cog/he.h.m4:heHE.TousSousYmnologous.melody
ltx/gr_gr_cog/tr.d046:trMA.Ode3C1H.mode	@ltx/gr_gr_cog/miscellanea:misc.Mode4
ltx/gr_gr_cog/tr.d046:trMA.Ode3C1H.ode	@ltx/gr_gr_cog/miscellanea:misc.Ode3
ltx/gr_gr_cog/tr.d046:trMA.Ode3C1H.text	@ltx/gr_gr_cog/he.h.m4:heHE.TousSousYmnologous.text
ltx/gr_gr_cog/tr.d046:trMA.Ode3C1T.incipit	Βουλήσει σου ἄνθρωπος ἐγένου, Θεὸς…
ltx/gr_gr_cog/tr.d046:trMA.Ode3C1T.melody	@ltx/gr_gr_cog/he.h.m4:heHE.TousSousYmnologous.name
ltx/gr_gr_cog/tr.d046:trMA.Ode3C1T.mode	@ltx/gr_gr_cog/miscellanea:misc.Mode4
ltx/gr_gr_cog/tr.d046:trMA.Ode3C1T.ode	@ltx/gr_gr_cog/miscellanea:misc.Ode3
ltx/gr_gr_cog/tr.d046:trMA.Ode3C1T.text	Βουλήσει σου ἄνθρωπος ἐγένου, Θεὸς ὤν, καὶ πάντων Ποιητής, καὶ νῦν Σταυρῷ κρεμάμενον, σὲ καθορῶ Υἱέ μου Χριστέ, ἡ σὲ τεκοῦσα ἔλεγε, καὶ τὴν καρδίαν τιτρώσκομαι.
ltx/gr_gr_cog/tr.d046:trMA.Ode3C21.greekmelody	@ltx/gr_gr_cog/he.h.m6:heHE.KyriosOnPanton.greekname
ltx/gr_gr_cog/tr.d046:trMA.Ode3C21.incipit	Κύριος ὢν πάντων, καὶ κτίστης…
ltx/gr_gr_cog/tr.d046:trMA.Ode3C21.melody	@ltx/gr_gr_cog/he.h.m6:heHE.KyriosOnPanton.name
ltx/gr_gr_cog/tr.d046:trMA.Ode3C21.mode	@ltx/gr_gr_cog/miscellanea:misc.Mode6
ltx/gr_gr_cog/tr.d046:trMA.Ode3C21.ode	@ltx/gr_gr_cog/miscellanea:misc.Ode3
ltx/gr_gr_cog/tr.d046:trMA.Ode3C21.text	Κύριος ὢν πάντων, καὶ κτίστης Θεός, μέσον γῆς ἐπὶ Σταυροῦ ὑψώθης, πρὸς σεαυτὸν ἀνυψῶν, τὴν πεσοῦσαν ἀνθρώπων οὐσίαν, κακίστῃ τοῦ ἐχθροῦ συμβουλίᾳ· ὅθεν σε πιστῶς δοξάζομεν, τῷ πάθει στερεούμενοι.
ltx/gr_gr_cog/tr.d046:trMA.Ode3C22.incipit	Καθάραντες αἰσθήσεις νηστείας φωτί, τοῦ…
ltx/gr_gr_cog/tr.d046:trMA.Ode3C22.melody	@ltx/gr_gr_cog/he.h.m6:heHE.KyriosOnPanton.name
ltx/gr_gr_cog/tr.d046:trMA.Ode3C22.mode	@ltx/gr_gr_cog/miscellanea:misc.Mode6
ltx/gr_gr_cog/tr.d046:trMA.Ode3C22.ode	@ltx/gr_gr_cog/miscellanea:misc.Ode3
ltx/gr_gr_cog/tr.d046:trMA.Ode3C22.text	Καθάραντες αἰσθήσεις νηστείας φωτί, τοῦ Σταυροῦ ταῖς νοηταῖς ἀκτῖσι, πλουσιωτάτως πιστοὶ αὐγασθῶμεν, καὶ τοῦτον εὐλαβῶς, προκείμενον σήμερον ὁρῶντες, χείλεσιν ἁγνοῖς καὶ στόμασι, καὶ καρδίᾳ προσκυνήσωμεν.
ltx/gr_gr_cog/tr.d046:trMA.Ode3C23.incipit	Τόπον οὗ ἔστησαν οἱ πόδες…
ltx/gr_gr_cog/tr.d046:trMA.Ode3C23.melody	@ltx/gr_gr_cog/he.h.m6:heHE.KyriosOnPanton.name
ltx/gr_gr_cog/tr.d046:trMA.Ode3C23.mode	@ltx/gr_gr_cog/miscellanea:misc.Mode6
ltx/gr_gr_cog/tr.d046:trMA.Ode3C23.ode	@ltx/gr_gr_cog/miscellanea:misc.Ode3
ltx/gr_gr_cog/tr.d046:trMA.Ode3C23.text	Τόπον οὗ ἔστησαν οἱ πόδες Χριστοῦ, προσκυνήσωμεν Σταυρὸν τὸν θεῖον, πέτρᾳ Θεοῦ ἐντολῶν, στηριχθῆναι τοὺς πόδας αἰτοῦντες, ψυχῆς ἡμῶν καὶ κατευθυνθῆναι, ταύτης διαβήματα ὁδόν, εἰς εἰρήνης θείᾳ χάριτι.
ltx/gr_gr_cog/tr.d046:trMA.Ode3C2T.incipit	Κόρης ἐξ ἀνάνδρου Χριστὲ προῆλθες…
ltx/gr_gr_cog/tr.d046:trMA.Ode3C2T.melody	@ltx/gr_gr_cog/he.h.m6:heHE.KyriosOnPanton.name
ltx/gr_gr_cog/tr.d046:trMA.Ode3C2T.mode	@ltx/gr_gr_cog/miscellanea:misc.Mode6
ltx/gr_gr_cog/tr.d046:trMA.Ode3C2T.ode	@ltx/gr_gr_cog/miscellanea:misc.Ode3
ltx/gr_gr_cog/tr.d046:trMA.Ode3C2T.text	Κόρης ἐξ ἀνάνδρου Χριστὲ προῆλθες, προσλαβόμενος ἐκ ταύτης σάρκα, ἔννουν καὶ ἔμψυχον, καὶ Σταυρῷ σου ἐχθρὸν ἀφανίσας, φθαρεῖσαν τῶν βροτῶν τὴν οὐσίαν, πάλιν ἀνεκαίνισας· διὸ δοξάζει τὴν εὐσπλαγχνίαν σου.
ltx/gr_gr_cog/tr.d046:trMA.Ode3C31.greekmelody	@ltx/gr_gr_cog/he.h.m1:heHE.StereosonKyrie.greekname
ltx/gr_gr_cog/tr.d046:trMA.Ode3C31.incipit	Κροτήσατε ἅπαντα ὕμνοις τὰ πέρατα…
ltx/gr_gr_cog/tr.d046:trMA.Ode3C31.melody	@ltx/gr_gr_cog/he.h.m1:heHE.StereosonKyrie.name
ltx/gr_gr_cog/tr.d046:trMA.Ode3C31.mode	@ltx/gr_gr_cog/miscellanea:misc.Mode1
ltx/gr_gr_cog/tr.d046:trMA.Ode3C31.ode	@ltx/gr_gr_cog/miscellanea:misc.Ode3
ltx/gr_gr_cog/tr.d046:trMA.Ode3C31.text	Κροτήσατε ἅπαντα ὕμνοις τὰ πέρατα, καθορῶντα προσκυνούμενον τὸ Ξύλον ἐν ᾧ Χριστὸς ἀπεκρεμάσθη, καὶ διάβολος ἐτραυματίσθη.
ltx/gr_gr_cog/tr.d046:trMA.Ode3C32.incipit	Προτίθεται σήμερον ὁ ζωηφόρος· χαρᾷ…
ltx/gr_gr_cog/tr.d046:trMA.Ode3C32.melody	@ltx/gr_gr_cog/he.h.m1:heHE.StereosonKyrie.name
ltx/gr_gr_cog/tr.d046:trMA.Ode3C32.mode	@ltx/gr_gr_cog/miscellanea:misc.Mode1
ltx/gr_gr_cog/tr.d046:trMA.Ode3C32.ode	@ltx/gr_gr_cog/miscellanea:misc.Ode3
ltx/gr_gr_cog/tr.d046:trMA.Ode3C32.text	Προτίθεται σήμερον ὁ ζωηφόρος· χαρᾷ, δεῦτε προσκυνήσωμεν σὺν φόβῳ, τὸν τοῦ Κυρίου τίμιον Σταυρόν, ἵνα λάβωμεν ἅγιον Πνεῦμα.
ltx/gr_gr_cog/tr.d046:trMA.Ode3C3A1.incipit	Ἐρχόμενος ἅψασθαι σοῦ ζωηφόρε Σταυρέ…
ltx/gr_gr_cog/tr.d046:trMA.Ode3C3A1.melody	@ltx/gr_gr_cog/he.h.m1:heHE.StereosonKyrie.name
ltx/gr_gr_cog/tr.d046:trMA.Ode3C3A1.mode	@ltx/gr_gr_cog/miscellanea:misc.Mode1
ltx/gr_gr_cog/tr.d046:trMA.Ode3C3A1.ode	@ltx/gr_gr_cog/miscellanea:misc.Ode3
ltx/gr_gr_cog/tr.d046:trMA.Ode3C3A1.text	Ἐρχόμενος ἅψασθαι σοῦ ζωηφόρε Σταυρέ, φρίττω γλῶσσαν καὶ διάνοιαν, προβλέπων, ὅτι ἐν σοὶ κατεκενώθη, τοῦ Κυρίου μου τὸ θεῖον Αἷμα.
ltx/gr_gr_cog/tr.d046:trMA.Ode3C3H.greekmelody	@ltx/gr_gr_cog/he.h.m1:heHE.StereosonKyrie.greekname
ltx/gr_gr_cog/tr.d046:trMA.Ode3C3H.incipit	@ltx/gr_gr_cog/he.h.m1:heHE.StereosonKyrie.incipit
ltx/gr_gr_cog/tr.d046:trMA.Ode3C3H.melody	@ltx/gr_gr_cog/he.h.m1:heHE.StereosonKyrie.melody
ltx/gr_gr_cog/tr.d046:trMA.Ode3C3H.mode	@ltx/gr_gr_cog/miscellanea:misc.Mode1
ltx/gr_gr_cog/tr.d046:trMA.Ode3C3H.ode	@ltx/gr_gr_cog/miscellanea:misc.Ode3
ltx/gr_gr_cog/tr.d046:trMA.Ode3C3H.text	@ltx/gr_gr_cog/he.h.m1:heHE.StereosonKyrie.text
ltx/gr_gr_cog/tr.d046:trMA.Ode3C3T.incipit	Ὑμνοῦσί σε τάξεις Ἀγγέλων εὐλογημένη…
ltx/gr_gr_cog/tr.d046:trMA.Ode3C3T.melody	@ltx/gr_gr_cog/he.h.m1:heHE.StereosonKyrie.name
ltx/gr_gr_cog/tr.d046:trMA.Ode3C3T.mode	@ltx/gr_gr_cog/miscellanea:misc.Mode1
ltx/gr_gr_cog/tr.d046:trMA.Ode3C3T.ode	@ltx/gr_gr_cog/miscellanea:misc.Ode3
ltx/gr_gr_cog/tr.d046:trMA.Ode3C3T.text	Ὑμνοῦσί σε τάξεις Ἀγγέλων εὐλογημένη, Θεοτόκε, πανύμνητε καὶ Παρθένε, μεθʼ ὧν σε νῦν γένος ἀνθρώπων, ὡς ἀνύμφευτον δοξολογοῦμεν.
ltx/gr_gr_cog/tr.d046:trMA.Ode3C3Tr.incipit	Τρισάκτινε Ἥλιε τρισσοκλεέστατον φῶς, Θεὲ…
ltx/gr_gr_cog/tr.d046:trMA.Ode3C3Tr.melody	@ltx/gr_gr_cog/he.h.m1:heHE.StereosonKyrie.name
ltx/gr_gr_cog/tr.d046:trMA.Ode3C3Tr.mode	@ltx/gr_gr_cog/miscellanea:misc.Mode1
ltx/gr_gr_cog/tr.d046:trMA.Ode3C3Tr.ode	@ltx/gr_gr_cog/miscellanea:misc.Ode3
ltx/gr_gr_cog/tr.d046:trMA.Ode3C3Tr.text	Τρισάκτινε Ἥλιε τρισσοκλεέστατον φῶς, Θεὲ Πάτερ Υἱέ, καὶ ἅγιον Πνεῦμα, ἡ ἄναρχος φύσις καὶ δόξα, τοὺς ὑμνοῦντάς σε ῥῦσαι κινδύνων.
ltx/gr_gr_cog/tr.d046:trMA.Ode3Kathisma1.incipit	Σήμερον τὸ προφητικὸν πεπλήρωται λόγιον…
ltx/gr_gr_cog/tr.d046:trMA.Ode3Kathisma1.melody	
ltx/gr_gr_cog/tr.d046:trMA.Ode3Kathisma1.mode	@ltx/gr_gr_cog/miscellanea:misc.Mode6
ltx/gr_gr_cog/tr.d046:trMA.Ode3Kathisma1.text	Σήμερον τὸ προφητικὸν πεπλήρωται λόγιον· ἰδοὺ γὰρ προσκυνοῦμεν, εἰς τὸν τόπον, οὗ ἔστησαν οἱ πόδες σου Κύριε, καὶ ξύλου σωτηρίας γευσάμενοι, τῶν ἐξ ἁμαρτίας παθῶν, ἐλευθερίας ἐτύχομεν, πρεσβείαις τῆς Θεοτόκου, μόνε φιλάνθρωπε
ltx/gr_gr_cog/tr.d046:trMA.Ode3Kathisma2.incipit	Ὁ Σταυρός σου Κύριε ἡγίασται…
ltx/gr_gr_cog/tr.d046:trMA.Ode3Kathisma2.melody	
ltx/gr_gr_cog/tr.d046:trMA.Ode3Kathisma2.mode	@ltx/gr_gr_cog/miscellanea:misc.Mode6
ltx/gr_gr_cog/tr.d046:trMA.Ode3Kathisma2.text	Ὁ Σταυρός σου Κύριε ἡγίασται· ἐν αὐτῷ γὰρ γίνονται ἰάματα, τοῖς ἀσθενοῦσιν ἐν ἁμαρτίαις, διʼ αὐτοῦ σοι προσπίπτομεν· Ἐλέησον ἡμᾶς.
ltx/gr_gr_cog/tr.d046:trMA.Ode3Kathisma3.incipit	Μόνον ἐπάγη τὸ ξύλον Χριστὲ…
ltx/gr_gr_cog/tr.d046:trMA.Ode3Kathisma3.melody	
ltx/gr_gr_cog/tr.d046:trMA.Ode3Kathisma3.mode	@ltx/gr_gr_cog/miscellanea:misc.Mode6
ltx/gr_gr_cog/tr.d046:trMA.Ode3Kathisma3.text	Μόνον ἐπάγη τὸ ξύλον Χριστὲ τοῦ Σταυροῦ σου, τὰ θεμέλια ἐσαλεύθησαν τοῦ θανάτου Κύριε· ὃν γὰρ κατέπιε πόθῳ ὁ ᾍδης, ἀπέλυσε τρόμῳ, ἔδειξας ἡμῖν τὸ σωτήριόν σου Ἅγιε, καὶ δοξολογοῦμέν σε, Υἱὲ Θεοῦ, ἐλέησον ἡμᾶς.
ltx/gr_gr_cog/tr.d046:trMA.Ode4C11.greekmelody	@ltx/gr_gr_cog/he.h.m4:heHE.OKathimenosEnDoxi.greekname
ltx/gr_gr_cog/tr.d046:trMA.Ode4C11.incipit	Αἰνιττόμενος τὸν τύπον, τοῦ Σταυροῦ…
ltx/gr_gr_cog/tr.d046:trMA.Ode4C11.melody	@ltx/gr_gr_cog/he.h.m4:heHE.OKathimenosEnDoxi.name
ltx/gr_gr_cog/tr.d046:trMA.Ode4C11.mode	@ltx/gr_gr_cog/miscellanea:misc.Mode4
ltx/gr_gr_cog/tr.d046:trMA.Ode4C11.ode	@ltx/gr_gr_cog/miscellanea:misc.Ode4
ltx/gr_gr_cog/tr.d046:trMA.Ode4C11.text	Αἰνιττόμενος τὸν τύπον, τοῦ Σταυροῦ χεῖρας ἔτεινεν, ἐναλλὰξ ἐγγόνοις, πάλαι Ἰακὼβ ὁ ἀοίδιμος, ἐπευλογῶν καὶ σημαίνων τὴν σωτήριον, εὐλογίαν πάντας, ἐφʼ ἡμᾶς διαβαίνουσαν.
ltx/gr_gr_cog/tr.d046:trMA.Ode4C12.incipit	Συντηρούμενοι σφραγῖδι, τοῦ Σταυροῦ καὶ…
ltx/gr_gr_cog/tr.d046:trMA.Ode4C12.melody	@ltx/gr_gr_cog/he.h.m4:heHE.OKathimenosEnDoxi.name
ltx/gr_gr_cog/tr.d046:trMA.Ode4C12.mode	@ltx/gr_gr_cog/miscellanea:misc.Mode4
ltx/gr_gr_cog/tr.d046:trMA.Ode4C12.ode	@ltx/gr_gr_cog/miscellanea:misc.Ode4
ltx/gr_gr_cog/tr.d046:trMA.Ode4C12.text	Συντηρούμενοι σφραγῖδι, τοῦ Σταυροῦ καὶ προκείμενον, ἐν ἀγαλλιάσει, πνεύματος αὐτὸν ἀσπαζόμενοι, πρὸς τὰ σωτήρια Πάθη ἐπειχθείημεν, τὰ ὀλέθρια, πάθη σαρκός θανατώσαντες.
ltx/gr_gr_cog/tr.d046:trMA.Ode4C13.incipit	Τὸ σωτήριόν σε ὅπλον, τὸ…
ltx/gr_gr_cog/tr.d046:trMA.Ode4C13.melody	@ltx/gr_gr_cog/he.h.m4:heHE.OKathimenosEnDoxi.name
ltx/gr_gr_cog/tr.d046:trMA.Ode4C13.mode	@ltx/gr_gr_cog/miscellanea:misc.Mode4
ltx/gr_gr_cog/tr.d046:trMA.Ode4C13.ode	@ltx/gr_gr_cog/miscellanea:misc.Ode4
ltx/gr_gr_cog/tr.d046:trMA.Ode4C13.text	Τὸ σωτήριόν σε ὅπλον, τὸ ἀήττητον τρόπαιον, τὸ χαρᾶς σημεῖον, θάνατος διʼ οὗ τεθανάτωται, περιπτυσσόμεθα δόξῃ κλεϊζόμενοι, τοῦ ἐν σοὶ προσπαγέντος, Σταυρὲ πανσεβάσμιε.
ltx/gr_gr_cog/tr.d046:trMA.Ode4C1H.greekmelody	@ltx/gr_gr_cog/he.h.m4:heHE.OKathimenosEnDoxi.greekname
ltx/gr_gr_cog/tr.d046:trMA.Ode4C1H.incipit	@ltx/gr_gr_cog/he.h.m4:heHE.OKathimenosEnDoxi.incipit
ltx/gr_gr_cog/tr.d046:trMA.Ode4C1H.melody	@ltx/gr_gr_cog/he.h.m4:heHE.OKathimenosEnDoxi.melody
ltx/gr_gr_cog/tr.d046:trMA.Ode4C1H.mode	@ltx/gr_gr_cog/miscellanea:misc.Mode4
ltx/gr_gr_cog/tr.d046:trMA.Ode4C1H.ode	@ltx/gr_gr_cog/miscellanea:misc.Ode4
ltx/gr_gr_cog/tr.d046:trMA.Ode4C1H.text	@ltx/gr_gr_cog/he.h.m4:heHE.OKathimenosEnDoxi.text
ltx/gr_gr_cog/tr.d046:trMA.Ode4C1T.incipit	Ὁρατός μοι καθωράθης, ὁ Ἀγγέλοις…
ltx/gr_gr_cog/tr.d046:trMA.Ode4C1T.melody	@ltx/gr_gr_cog/he.h.m4:heHE.OKathimenosEnDoxi.name
ltx/gr_gr_cog/tr.d046:trMA.Ode4C1T.mode	@ltx/gr_gr_cog/miscellanea:misc.Mode4
ltx/gr_gr_cog/tr.d046:trMA.Ode4C1T.ode	@ltx/gr_gr_cog/miscellanea:misc.Ode4
ltx/gr_gr_cog/tr.d046:trMA.Ode4C1T.text	Ὁρατός μοι καθωράθης, ὁ Ἀγγέλοις ἀπρόσιτος, Ἰησοῦ Υἱέ μου, σάρκα ἐξ ἐμοῦ δανεισάμενος, καὶ νῦν ὁρῶσά σε ξύλῳ καθηλούμενον, ἐποδύρομαι, ἡ τοῦ Χριστοῦ Μήτηρ ἔλεγε.
ltx/gr_gr_cog/tr.d046:trMA.Ode5C11.greekmelody	@ltx/gr_gr_cog/he.h.m4:heHE.ExestiTaSympanta.greekname
ltx/gr_gr_cog/tr.d046:trMA.Ode5C11.incipit	Νεκρὸς ἐχρημάτισας, ἐπὶ Σταυροῦ ἡλούμενος…
ltx/gr_gr_cog/tr.d046:trMA.Ode5C11.melody	@ltx/gr_gr_cog/he.h.m4:heHE.ExestiTaSympanta.name
ltx/gr_gr_cog/tr.d046:trMA.Ode5C11.mode	@ltx/gr_gr_cog/miscellanea:misc.Mode4
ltx/gr_gr_cog/tr.d046:trMA.Ode5C11.ode	@ltx/gr_gr_cog/miscellanea:misc.Ode5
ltx/gr_gr_cog/tr.d046:trMA.Ode5C11.text	Νεκρὸς ἐχρημάτισας, ἐπὶ Σταυροῦ ἡλούμενος, πάντων ἡ ζωὴ καὶ σωτηρία. Τοῦτον οὖν δίδου, κεκαθαρμένῃ ψυχῇ, Σῶτερ περιπτύξασθαι, καὶ σοῦ, Πάθη τὰ σωτήρια, κατιδεῖν ἀγαλλόμενοι.
ltx/gr_gr_cog/tr.d046:trMA.Ode5C12.incipit	Παρίστανται τάξεις σοι, τῶν Ἀσωμάτων…
ltx/gr_gr_cog/tr.d046:trMA.Ode5C12.melody	@ltx/gr_gr_cog/he.h.m4:heHE.ExestiTaSympanta.name
ltx/gr_gr_cog/tr.d046:trMA.Ode5C12.mode	@ltx/gr_gr_cog/miscellanea:misc.Mode4
ltx/gr_gr_cog/tr.d046:trMA.Ode5C12.ode	@ltx/gr_gr_cog/miscellanea:misc.Ode5
ltx/gr_gr_cog/tr.d046:trMA.Ode5C12.text	Παρίστανται τάξεις σοι, τῶν Ἀσωμάτων τρέμουσαι, Ξύλον ζωοδώρητον· ἐν σοὶ γάρ, τίμιον Αἷμα Χριστὸς ἐξέχεε, λύθρον ἀναστέλλων ἐναγές, δαίμοσι φερόμενον, ἐπʼ ὀλέθρῳ τοῦ πλάσματος.
ltx/gr_gr_cog/tr.d046:trMA.Ode5C13.incipit	Ῥομφαίᾳ πληγέντα με, τοῦ δυσμενοῦς…
ltx/gr_gr_cog/tr.d046:trMA.Ode5C13.melody	@ltx/gr_gr_cog/he.h.m4:heHE.ExestiTaSympanta.name
ltx/gr_gr_cog/tr.d046:trMA.Ode5C13.mode	@ltx/gr_gr_cog/miscellanea:misc.Mode4
ltx/gr_gr_cog/tr.d046:trMA.Ode5C13.ode	@ltx/gr_gr_cog/miscellanea:misc.Ode5
ltx/gr_gr_cog/tr.d046:trMA.Ode5C13.text	Ῥομφαίᾳ πληγέντα με, τοῦ δυσμενοῦς ἰάτρευσον, Αἵματί σου Λόγε καὶ τῇ λόγχῃ, ἁμαρτιῶν μου τάχος διάῤῥηξον, Σῶτερ τὸ χειρόγραφον βοῶ, βίβλῳ καταγράφων με, σῳζομένων ὡς εὔσπλαγχνος.
ltx/gr_gr_cog/tr.d046:trMA.Ode5C1H.greekmelody	@ltx/gr_gr_cog/he.h.m4:heHE.ExestiTaSympanta.greekname
ltx/gr_gr_cog/tr.d046:trMA.Ode5C1H.incipit	@ltx/gr_gr_cog/he.h.m4:heHE.ExestiTaSympanta.incipit
ltx/gr_gr_cog/tr.d046:trMA.Ode5C1H.melody	@ltx/gr_gr_cog/he.h.m4:heHE.ExestiTaSympanta.melody
ltx/gr_gr_cog/tr.d046:trMA.Ode5C1H.mode	@ltx/gr_gr_cog/miscellanea:misc.Mode4
ltx/gr_gr_cog/tr.d046:trMA.Ode5C1H.ode	@ltx/gr_gr_cog/miscellanea:misc.Ode5
ltx/gr_gr_cog/tr.d046:trMA.Ode5C1H.text	@ltx/gr_gr_cog/he.h.m4:heHE.ExestiTaSympanta.text
ltx/gr_gr_cog/tr.d046:trMA.Ode5C1T.incipit	Ὁ βότρυς ὁ πέπειρος, πῶς…
ltx/gr_gr_cog/tr.d046:trMA.Ode5C1T.melody	@ltx/gr_gr_cog/he.h.m4:heHE.ExestiTaSympanta.name
ltx/gr_gr_cog/tr.d046:trMA.Ode5C1T.mode	@ltx/gr_gr_cog/miscellanea:misc.Mode4
ltx/gr_gr_cog/tr.d046:trMA.Ode5C1T.ode	@ltx/gr_gr_cog/miscellanea:misc.Ode5
ltx/gr_gr_cog/tr.d046:trMA.Ode5C1T.text	Ὁ βότρυς ὁ πέπειρος, πῶς ἐπὶ ξύλου κρέμασαι; Ἥλιε τῆς δόξης πῶς ἐπήρθης, φέγγος ἡλίου, σκοτίζων πάθει σου. Σῶτερ ἡ τεκοῦσά σε, Ἀμνάς, πάλαι ἀνεβόα σοι, μητρικῶς ἀλαλάζουσα.
ltx/gr_gr_cog/tr.d046:trMA.Ode6C11.greekmelody	@ltx/gr_gr_cog/he.h.m4:heHE.EvoiseProtypon.greekname
ltx/gr_gr_cog/tr.d046:trMA.Ode6C11.incipit	Συνέσεισας, τὸ τοῦ ᾍδου πηγνύμενος…
ltx/gr_gr_cog/tr.d046:trMA.Ode6C11.melody	@ltx/gr_gr_cog/he.h.m4:heHE.EvoiseProtypon.name
ltx/gr_gr_cog/tr.d046:trMA.Ode6C11.mode	@ltx/gr_gr_cog/miscellanea:misc.Mode4
ltx/gr_gr_cog/tr.d046:trMA.Ode6C11.ode	@ltx/gr_gr_cog/miscellanea:misc.Ode6
ltx/gr_gr_cog/tr.d046:trMA.Ode6C11.text	Συνέσεισας, τὸ τοῦ ᾍδου πηγνύμενος οἴκημα, τοῖς πιστοῖς δέ, ἀδειάσειστον ἔρεισμα γέγονας, καὶ βεβαία σκέπη, τοῦ Κυρίου Σταυρὲ πανσεβάσμιε.
ltx/gr_gr_cog/tr.d046:trMA.Ode6C12.incipit	Κατάκαρποι, ἀρεταῖς γεγονότες τρυγήσωμεν, θείου…
ltx/gr_gr_cog/tr.d046:trMA.Ode6C12.melody	@ltx/gr_gr_cog/he.h.m4:heHE.EvoiseProtypon.name
ltx/gr_gr_cog/tr.d046:trMA.Ode6C12.mode	@ltx/gr_gr_cog/miscellanea:misc.Mode4
ltx/gr_gr_cog/tr.d046:trMA.Ode6C12.ode	@ltx/gr_gr_cog/miscellanea:misc.Ode6
ltx/gr_gr_cog/tr.d046:trMA.Ode6C12.text	Κατάκαρποι, ἀρεταῖς γεγονότες τρυγήσωμεν, θείου Ξύλου, ζωηφόρους καρπούς, οὓς ἐβλάστησεν, ἁπλωθεὶς ἐν τούτῳ, Ἰησοῦς ἡ κατάκαρπος ἄμπελος.
ltx/gr_gr_cog/tr.d046:trMA.Ode6C13.incipit	Ὑμνοῦμέν σου, Ἰησοῦ τὴν πολλὴν…
ltx/gr_gr_cog/tr.d046:trMA.Ode6C13.melody	@ltx/gr_gr_cog/he.h.m4:heHE.EvoiseProtypon.name
ltx/gr_gr_cog/tr.d046:trMA.Ode6C13.mode	@ltx/gr_gr_cog/miscellanea:misc.Mode4
ltx/gr_gr_cog/tr.d046:trMA.Ode6C13.ode	@ltx/gr_gr_cog/miscellanea:misc.Ode6
ltx/gr_gr_cog/tr.d046:trMA.Ode6C13.text	Ὑμνοῦμέν σου, Ἰησοῦ τὴν πολλὴν ἀγαθότητα, προσκυνοῦντες, τὸν Σταυρόν σου τὴν λόγχην, τὸν κάλαμον· διʼ αὐτῶν γὰρ εἷλες, τὸ τῆς ἔχθρας Οἰκτίρμον μεσότοιχον.
ltx/gr_gr_cog/tr.d046:trMA.Ode6C1H.greekmelody	@ltx/gr_gr_cog/he.h.m4:heHE.EvoiseProtypon.greekname
ltx/gr_gr_cog/tr.d046:trMA.Ode6C1H.incipit	@ltx/gr_gr_cog/he.h.m4:heHE.EvoiseProtypon.incipit
ltx/gr_gr_cog/tr.d046:trMA.Ode6C1H.melody	@ltx/gr_gr_cog/he.h.m4:heHE.EvoiseProtypon.melody
ltx/gr_gr_cog/tr.d046:trMA.Ode6C1H.mode	@ltx/gr_gr_cog/miscellanea:misc.Mode4
ltx/gr_gr_cog/tr.d046:trMA.Ode6C1H.ode	@ltx/gr_gr_cog/miscellanea:misc.Ode6
ltx/gr_gr_cog/tr.d046:trMA.Ode6C1H.text	@ltx/gr_gr_cog/he.h.m4:heHE.EvoiseProtypon.text
ltx/gr_gr_cog/tr.d046:trMA.Ode6C1T.incipit	Ναμάτων σε, ποταμὸν ζωηῤῥήτων ἐκύησεν…
ltx/gr_gr_cog/tr.d046:trMA.Ode6C1T.melody	@ltx/gr_gr_cog/he.h.m4:heHE.EvoiseProtypon.name
ltx/gr_gr_cog/tr.d046:trMA.Ode6C1T.mode	@ltx/gr_gr_cog/miscellanea:misc.Mode4
ltx/gr_gr_cog/tr.d046:trMA.Ode6C1T.ode	@ltx/gr_gr_cog/miscellanea:misc.Ode6
ltx/gr_gr_cog/tr.d046:trMA.Ode6C1T.text	Ναμάτων σε, ποταμὸν ζωηῤῥήτων ἐκύησεν, ἡ Παρθένος, ὡς πηγὴ τῆς ἡμῶν ἀναπλάσεως, τὸν Σταυρῷ ταθέντα, καὶ κρουνοὺς σωτηρίας πηγάσαντα.
ltx/gr_gr_cog/tr.d046:trMA.Ode7C11.greekmelody	@ltx/gr_gr_cog/he.h.m4:heHE.OukElatrefsan.greekname
ltx/gr_gr_cog/tr.d046:trMA.Ode7C11.incipit	Ἡ ἀξίνη, Ἐλισσαῖος ἣν ἀνείλετο…
ltx/gr_gr_cog/tr.d046:trMA.Ode7C11.melody	@ltx/gr_gr_cog/he.h.m4:heHE.OukElatrefsan.name
ltx/gr_gr_cog/tr.d046:trMA.Ode7C11.mode	@ltx/gr_gr_cog/miscellanea:misc.Mode4
ltx/gr_gr_cog/tr.d046:trMA.Ode7C11.ode	@ltx/gr_gr_cog/miscellanea:misc.Ode7
ltx/gr_gr_cog/tr.d046:trMA.Ode7C11.text	Ἡ ἀξίνη, Ἐλισσαῖος ἣν ἀνείλετο, ἐξ Ἰορδάνου Χριστέ, Σταυρὸν ἐδήλου, διʼ οὗ, βυθοῦ ματαιότητος, ἔθνη ἀνείλκυσας, ἀναμέλποντα· Ὁ τῶν Πατέρων Κύριος, καὶ Θεός εὐλογητὸς εἶ.
ltx/gr_gr_cog/tr.d046:trMA.Ode7C12.incipit	Συναγάλλονται, τῇ γῇ τὰ ἐπουράνια…
ltx/gr_gr_cog/tr.d046:trMA.Ode7C12.melody	@ltx/gr_gr_cog/he.h.m4:heHE.OukElatrefsan.name
ltx/gr_gr_cog/tr.d046:trMA.Ode7C12.mode	@ltx/gr_gr_cog/miscellanea:misc.Mode4
ltx/gr_gr_cog/tr.d046:trMA.Ode7C12.ode	@ltx/gr_gr_cog/miscellanea:misc.Ode7
ltx/gr_gr_cog/tr.d046:trMA.Ode7C12.text	Συναγάλλονται, τῇ γῇ τὰ ἐπουράνια, τῇ προσκυνήσει σου Σταυρέ· καὶ γὰρ διὰ σοῦ, Ἀγγέλων ἀνθρώπων τε, ἕνωσις γέγονε, Παντοδύναμε, ἀναβοώντων· Κύριε, ὁ Θεός εὐλογητὸς εἶ.
ltx/gr_gr_cog/tr.d046:trMA.Ode7C13.incipit	Ὡς κυπάρισσον, συμπάθειαν ὡς κέδρον…
ltx/gr_gr_cog/tr.d046:trMA.Ode7C13.melody	@ltx/gr_gr_cog/he.h.m4:heHE.OukElatrefsan.name
ltx/gr_gr_cog/tr.d046:trMA.Ode7C13.mode	@ltx/gr_gr_cog/miscellanea:misc.Mode4
ltx/gr_gr_cog/tr.d046:trMA.Ode7C13.ode	@ltx/gr_gr_cog/miscellanea:misc.Ode7
ltx/gr_gr_cog/tr.d046:trMA.Ode7C13.text	Ὡς κυπάρισσον, συμπάθειαν ὡς κέδρον τε, πίστιν ἡδύπνοον, ὡς πεύκην ἀληθινήν, ἀγάπην προσφέροντες, τὸν τοῦ Κυρίου Σταυρόν, προσκυνήσωμεν, τὸν ἐν αὐτῷ δοξάζοντες Λυτρωτὴν προσηλωθέντα.
ltx/gr_gr_cog/tr.d046:trMA.Ode7C1H.greekmelody	@ltx/gr_gr_cog/he.h.m4:heHE.OukElatrefsan.greekname
ltx/gr_gr_cog/tr.d046:trMA.Ode7C1H.incipit	@ltx/gr_gr_cog/he.h.m4:heHE.OukElatrefsan.incipit
ltx/gr_gr_cog/tr.d046:trMA.Ode7C1H.melody	@ltx/gr_gr_cog/he.h.m4:heHE.OukElatrefsan.melody
ltx/gr_gr_cog/tr.d046:trMA.Ode7C1H.mode	@ltx/gr_gr_cog/miscellanea:misc.Mode4
ltx/gr_gr_cog/tr.d046:trMA.Ode7C1H.ode	@ltx/gr_gr_cog/miscellanea:misc.Ode7
ltx/gr_gr_cog/tr.d046:trMA.Ode7C1H.text	@ltx/gr_gr_cog/he.h.m4:heHE.OukElatrefsan.text
ltx/gr_gr_cog/tr.d046:trMA.Ode7C1T.incipit	Μὴ σαλεύσας, τὰ οὐράνια ἐν…
ltx/gr_gr_cog/tr.d046:trMA.Ode7C1T.melody	@ltx/gr_gr_cog/he.h.m4:heHE.OukElatrefsan.name
ltx/gr_gr_cog/tr.d046:trMA.Ode7C1T.mode	@ltx/gr_gr_cog/miscellanea:misc.Mode4
ltx/gr_gr_cog/tr.d046:trMA.Ode7C1T.ode	@ltx/gr_gr_cog/miscellanea:misc.Ode7
ltx/gr_gr_cog/tr.d046:trMA.Ode7C1T.text	Μὴ σαλεύσας, τὰ οὐράνια ἐν μήτρᾳ σου, Θεὸς ἐσκήνωσε, πόλις Θεοῦ ἐκλεκτή. Σταυρῷ δὲ κρεμάμενος, Κτίσιν ἐσάλευσεν, ὃν ἱκέτευε, ἐν ἀσαλεύτῳ πέτρᾳ με, τῇ αὐτοῦ συντηρηθῆναι.
ltx/gr_gr_cog/tr.d046:trMA.Ode8C11.greekmelody	@ltx/gr_gr_cog/he.h.m4:heHE.PaidasEvageis.greekname
ltx/gr_gr_cog/tr.d046:trMA.Ode8C11.incipit	Ἐξέτεινας χεῖρας ἐπὶ ξύλου, χειρὸς…
ltx/gr_gr_cog/tr.d046:trMA.Ode8C11.melody	@ltx/gr_gr_cog/he.h.m4:heHE.PaidasEvageis.name
ltx/gr_gr_cog/tr.d046:trMA.Ode8C11.mode	@ltx/gr_gr_cog/miscellanea:misc.Mode4
ltx/gr_gr_cog/tr.d046:trMA.Ode8C11.ode	@ltx/gr_gr_cog/miscellanea:misc.Ode8
ltx/gr_gr_cog/tr.d046:trMA.Ode8C11.text	Ἐξέτεινας χεῖρας ἐπὶ ξύλου, χειρὸς ἀκρατοῦς λύων ἁμάρτημα, λόγχῃ ἐκεντήθης δέ, ταύτῃ τὸν πολέμιον, κατατιτρώσκων Κύριε, χολῆς ἐγεύσω τε, ἐνήδονον κακίαν ἐξαίρων, ὄξος ἐποτίσθης, ἡ πάντων εὐφροσύνη.
ltx/gr_gr_cog/tr.d046:trMA.Ode8C12.incipit	Νοῒ καθαρῷ καὶ συνειδότι, λαμπρῶς…
ltx/gr_gr_cog/tr.d046:trMA.Ode8C12.melody	@ltx/gr_gr_cog/he.h.m4:heHE.PaidasEvageis.name
ltx/gr_gr_cog/tr.d046:trMA.Ode8C12.mode	@ltx/gr_gr_cog/miscellanea:misc.Mode4
ltx/gr_gr_cog/tr.d046:trMA.Ode8C12.ode	@ltx/gr_gr_cog/miscellanea:misc.Ode8
ltx/gr_gr_cog/tr.d046:trMA.Ode8C12.text	Νοῒ καθαρῷ καὶ συνειδότι, λαμπρῶς προσελθόντες προσκυνήσωμεν, πρόκειται τὸ τίμιον, Ξύλον καὶ σεβάσμιον, διʼ οὗ Χριστὸς τὸν ἄτιμον, ὑπέστη θάνατον, τιμήν ὑπερτιθεὶς ἀνωτάτην, τοῖς τῇ παραβάσει, δεινῶς ἀτιμασθεῖσι.
ltx/gr_gr_cog/tr.d046:trMA.Ode8C13.incipit	Ξύλῳ ἁμαρτίας ἐνεκρώθην, καὶ γεύσει…
ltx/gr_gr_cog/tr.d046:trMA.Ode8C13.melody	@ltx/gr_gr_cog/he.h.m4:heHE.PaidasEvageis.name
ltx/gr_gr_cog/tr.d046:trMA.Ode8C13.mode	@ltx/gr_gr_cog/miscellanea:misc.Mode4
ltx/gr_gr_cog/tr.d046:trMA.Ode8C13.ode	@ltx/gr_gr_cog/miscellanea:misc.Ode8
ltx/gr_gr_cog/tr.d046:trMA.Ode8C13.text	Ξύλῳ ἁμαρτίας ἐνεκρώθην, καὶ γεύσει τῇ ἐνηδόνῳ τεθανάτωμαι, ζώωσόν με Κύριε, ἔγειρόν με κείμενον, προσκυνητὴν ἀνάδειξον, τῶν Παθημάτων σου, καὶ μέτοχον Ἐγέρσεως θείας, καὶ συγκληρονόμον, τῶν σὲ ἠγαπηκότων.
ltx/gr_gr_cog/tr.d046:trMA.Ode8C1H.greekmelody	@ltx/gr_gr_cog/he.h.m4:heHE.PaidasEvageis.greekname
ltx/gr_gr_cog/tr.d046:trMA.Ode8C1H.incipit	@ltx/gr_gr_cog/he.h.m4:heHE.PaidasEvageis.incipit
ltx/gr_gr_cog/tr.d046:trMA.Ode8C1H.melody	@ltx/gr_gr_cog/he.h.m4:heHE.PaidasEvageis.melody
ltx/gr_gr_cog/tr.d046:trMA.Ode8C1H.mode	@ltx/gr_gr_cog/miscellanea:misc.Mode4
ltx/gr_gr_cog/tr.d046:trMA.Ode8C1H.ode	@ltx/gr_gr_cog/miscellanea:misc.Ode8
ltx/gr_gr_cog/tr.d046:trMA.Ode8C1H.text	@ltx/gr_gr_cog/he.h.m4:heHE.PaidasEvageis.text
ltx/gr_gr_cog/tr.d046:trMA.Ode8C1T.incipit	Ὑψούμενον βλέπω σε καὶ κάλλος…
ltx/gr_gr_cog/tr.d046:trMA.Ode8C1T.melody	@ltx/gr_gr_cog/he.h.m4:heHE.PaidasEvageis.name
ltx/gr_gr_cog/tr.d046:trMA.Ode8C1T.mode	@ltx/gr_gr_cog/miscellanea:misc.Mode4
ltx/gr_gr_cog/tr.d046:trMA.Ode8C1T.ode	@ltx/gr_gr_cog/miscellanea:misc.Ode8
ltx/gr_gr_cog/tr.d046:trMA.Ode8C1T.text	Ὑψούμενον βλέπω σε καὶ κάλλος, τῷ πάσχειν οὐκ εἶδος περικείμενον, ὅν περ σωματούμενον, ἔγνων ὡραιότατον, ὑπὲρ υἱοὺς ἀνθρώπων σε, μονογενὲς Υἱέ, ἡ Πάναγνος ἐβόα Παρθένος, δεῖξόν σου τὴν δόξαν, ἡ πάντων σωτηρία.
ltx/gr_gr_cog/tr.d046:trMA.Ode8C21.greekmelody	@ltx/gr_gr_cog/he.h.m6:heHE.NomonPatroon.greekname
ltx/gr_gr_cog/tr.d046:trMA.Ode8C21.incipit	Μέσης ἡμέρας σταυρουμένου σου, μέσον…
ltx/gr_gr_cog/tr.d046:trMA.Ode8C21.melody	@ltx/gr_gr_cog/he.h.m6:heHE.NomonPatroon.name
ltx/gr_gr_cog/tr.d046:trMA.Ode8C21.mode	@ltx/gr_gr_cog/miscellanea:misc.Mode6
ltx/gr_gr_cog/tr.d046:trMA.Ode8C21.ode	@ltx/gr_gr_cog/miscellanea:misc.Ode8
ltx/gr_gr_cog/tr.d046:trMA.Ode8C21.text	Μέσης ἡμέρας σταυρουμένου σου, μέσον τῆς γῆς βουλήσει Κόσμου τὰ πέρατα, μέσον φάρυγγος τοῦ δράκοντος, ἐξέσπασας Οἰκτίρμον· διὸ ἐν μέσῃ, θείων ἑβδομάδι Νηστειῶν, προσκυνοῦντες δοξάζομεν τὸν τίμιον Σταυρόν σου, τὸν Κύριον ὑμνεῖτε, βοῶντες, καὶ ὑπερυψοῦτε εἰς πάντας τοὺς αἰῶνας.
ltx/gr_gr_cog/tr.d046:trMA.Ode8C22.incipit	Χαρᾶς σημεῖον ὅπλον ἄῤῥηκτον, τῆς…
ltx/gr_gr_cog/tr.d046:trMA.Ode8C22.melody	@ltx/gr_gr_cog/he.h.m6:heHE.NomonPatroon.name
ltx/gr_gr_cog/tr.d046:trMA.Ode8C22.mode	@ltx/gr_gr_cog/miscellanea:misc.Mode6
ltx/gr_gr_cog/tr.d046:trMA.Ode8C22.ode	@ltx/gr_gr_cog/miscellanea:misc.Ode8
ltx/gr_gr_cog/tr.d046:trMA.Ode8C22.text	Χαρᾶς σημεῖον ὅπλον ἄῤῥηκτον, τῆς Ἐκκλησίας τεῖχος, Μαρτύρων καύχημα, Ἀποστόλων ἐγκαλλώπισμα, Ἀρχιερέων σθένος, ἐνδυναμώσας τὴν ἐξασθενοῦσάν μου ψυχήν, προσκυνεῖν σε ἀξίωσον, καὶ μέλπειν σοι βοῶντα· Τὸν Κύριον ὑμνεῖτε τὰ ἔργα, καὶ ὑπερυψοῦτε εἰς πάντας τοὺς αἰῶνας.
ltx/gr_gr_cog/tr.d046:trMA.Ode8C23.incipit	Θρηνῶ καὶ κλαίω καὶ ὀδύρομαι…
ltx/gr_gr_cog/tr.d046:trMA.Ode8C23.melody	@ltx/gr_gr_cog/he.h.m6:heHE.NomonPatroon.name
ltx/gr_gr_cog/tr.d046:trMA.Ode8C23.mode	@ltx/gr_gr_cog/miscellanea:misc.Mode6
ltx/gr_gr_cog/tr.d046:trMA.Ode8C23.ode	@ltx/gr_gr_cog/miscellanea:misc.Ode8
ltx/gr_gr_cog/tr.d046:trMA.Ode8C23.text	Θρηνῶ καὶ κλαίω καὶ ὀδύρομαι, ὅταν, εἰς νοῦν μου λάβω τὸ δικαστήριον, τὸ ἀδέκαστον Μακρόθυμε, κατάκριτος ὑπάρχων· διό μου φεῖσαι, καὶ τὸν ἐπικείμενον κλοιόν, τῆς ψυχῆς μου ἐλάφρυνον, ἵνα χαίρων κραυγάζω· Τὸν Κύριον ὑμνεῖτε τὰ ἔργα, καὶ ὑπερυψοῦτε εἰς πάντας τοὺς αἰῶνας.
ltx/gr_gr_cog/tr.d046:trMA.Ode8C2T.incipit	Ἐτύπου βάτος τὸ μυστήριον, τοῦ…
ltx/gr_gr_cog/tr.d046:trMA.Ode8C2T.melody	@ltx/gr_gr_cog/he.h.m6:heHE.NomonPatroon.name
ltx/gr_gr_cog/tr.d046:trMA.Ode8C2T.mode	@ltx/gr_gr_cog/miscellanea:misc.Mode6
ltx/gr_gr_cog/tr.d046:trMA.Ode8C2T.ode	@ltx/gr_gr_cog/miscellanea:misc.Ode8
ltx/gr_gr_cog/tr.d046:trMA.Ode8C2T.text	Ἐτύπου βάτος τὸ μυστήριον, τοῦ ὑπὲρ νοῦν σου τόκου, Κόρη πανάμωμε· ὡς ἐκείνου γὰρ διέμεινας, ἀφλέκτως πῦρ τεκοῦσα, Χριστὸν Σωτῆρα, τὸν ἀνυψωθέντα ἐν Σταυρῷ, ὃν δυσώπει ῥυσθῆναί με, πυρὸς τοῦ αἰωνίου· Τὸν Κύριον ὑμνεῖτε βοῶντα, καὶ ὑπερυψοῦτε εἰς πάντας τοὺς αἰῶνας.
ltx/gr_gr_cog/tr.d046:trMA.Ode8C31.greekmelody	@ltx/gr_gr_cog/he.h.m1:heHE.AftiIKliti.greekname
ltx/gr_gr_cog/tr.d046:trMA.Ode8C31.incipit	Δεῦτε τὸν Σταυρὸν προτεθέντα Κυρίου…
ltx/gr_gr_cog/tr.d046:trMA.Ode8C31.melody	@ltx/gr_gr_cog/he.h.m1:heHE.AftiIKliti.name
ltx/gr_gr_cog/tr.d046:trMA.Ode8C31.mode	@ltx/gr_gr_cog/miscellanea:misc.Mode1
ltx/gr_gr_cog/tr.d046:trMA.Ode8C31.ode	@ltx/gr_gr_cog/miscellanea:misc.Ode8
ltx/gr_gr_cog/tr.d046:trMA.Ode8C31.text	Δεῦτε τὸν Σταυρὸν προτεθέντα Κυρίου, νηστείᾳ καθαρθέντες, περιπτυξώμεθα πόθῳ· θησαυρὸς γὰρ ἡμῖν ἁγιάσματος ἐστί, καὶ δυνάμεως, διʼ οὗ ἀνυμνοῦμεν, Χριστόν εἰς τοὺς αἰῶνας.
ltx/gr_gr_cog/tr.d046:trMA.Ode8C32.incipit	Οὗτος ὁ Σταυρὸς τριμερὴς καὶ…
ltx/gr_gr_cog/tr.d046:trMA.Ode8C32.melody	@ltx/gr_gr_cog/he.h.m1:heHE.AftiIKliti.name
ltx/gr_gr_cog/tr.d046:trMA.Ode8C32.mode	@ltx/gr_gr_cog/miscellanea:misc.Mode1
ltx/gr_gr_cog/tr.d046:trMA.Ode8C32.ode	@ltx/gr_gr_cog/miscellanea:misc.Ode8
ltx/gr_gr_cog/tr.d046:trMA.Ode8C32.text	Οὗτος ὁ Σταυρὸς τριμερὴς καὶ μέγας, μικροφανὴς τυγχάνων, οὐρανομήκης ὑπάρχει, τῇ δυνάμει αὐτοῦ, τοὺς ἀνθρώπους πρὸς Θεόν, ἀναφέρει ἀεί, διʼ οὗ εὐλογοῦμεν, Χριστὸν εἰς τοὺς αἰῶνας.
ltx/gr_gr_cog/tr.d046:trMA.Ode8C3A1.incipit	Τοῦτο τὸ πανάγιον Ξύλον τιμάσθω…
ltx/gr_gr_cog/tr.d046:trMA.Ode8C3A1.melody	@ltx/gr_gr_cog/he.h.m1:heHE.AftiIKliti.name
ltx/gr_gr_cog/tr.d046:trMA.Ode8C3A1.mode	@ltx/gr_gr_cog/miscellanea:misc.Mode1
ltx/gr_gr_cog/tr.d046:trMA.Ode8C3A1.ode	@ltx/gr_gr_cog/miscellanea:misc.Ode8
ltx/gr_gr_cog/tr.d046:trMA.Ode8C3A1.text	Τοῦτο τὸ πανάγιον Ξύλον τιμάσθω, ὁ Προφήτης πάλαι, βληθῆναι ἀνακραυγάζει, εἰς τὸν ἄρτον Χριστοῦ, ὑπὸ Ἰσραηλιτῶν, τῶν σταυρούντων αὐτόν, ὃν ὑπερυψοῦμεν, εἰς πάντας τοὺς αἰῶνας.
ltx/gr_gr_cog/tr.d046:trMA.Ode8C3H.greekmelody	@ltx/gr_gr_cog/he.h.m1:heHE.CheirasEnToLakko.greekname
ltx/gr_gr_cog/tr.d046:trMA.Ode8C3H.incipit	@ltx/gr_gr_cog/he.h.m1:heHE.CheirasEnToLakko.incipit
ltx/gr_gr_cog/tr.d046:trMA.Ode8C3H.melody	@ltx/gr_gr_cog/he.h.m1:heHE.CheirasEnToLakko.melody
ltx/gr_gr_cog/tr.d046:trMA.Ode8C3H.mode	@ltx/gr_gr_cog/miscellanea:misc.Mode1
ltx/gr_gr_cog/tr.d046:trMA.Ode8C3H.ode	@ltx/gr_gr_cog/miscellanea:misc.Ode8
ltx/gr_gr_cog/tr.d046:trMA.Ode8C3H.text	@ltx/gr_gr_cog/he.h.m1:heHE.CheirasEnToLakko.text
ltx/gr_gr_cog/tr.d046:trMA.Ode8C3T.incipit	Μόνη ἐν μητράσιν ἐδείχθης παρθένος…
ltx/gr_gr_cog/tr.d046:trMA.Ode8C3T.melody	@ltx/gr_gr_cog/he.h.m1:heHE.AftiIKliti.name
ltx/gr_gr_cog/tr.d046:trMA.Ode8C3T.mode	@ltx/gr_gr_cog/miscellanea:misc.Mode1
ltx/gr_gr_cog/tr.d046:trMA.Ode8C3T.ode	@ltx/gr_gr_cog/miscellanea:misc.Ode8
ltx/gr_gr_cog/tr.d046:trMA.Ode8C3T.text	Μόνη ἐν μητράσιν ἐδείχθης παρθένος, Θεόνυμφε Μαρία, ἄνευ ἀνδρὸς τετοκυῖα, τὸν Σωτῆρα Χριστόν, τῆς ἁγνείας τὴν σφραγῖδα φυλάξασα. Σὲ μακαριοῦμεν, πιστοὶ εἰς τοὺς αἰῶνας.
ltx/gr_gr_cog/tr.d046:trMA.Ode8C3Tr.incipit	Μίαν ἐν τρισὶ χαρακτῆρσιν οὐσίαν…
ltx/gr_gr_cog/tr.d046:trMA.Ode8C3Tr.melody	@ltx/gr_gr_cog/he.h.m1:heHE.AftiIKliti.name
ltx/gr_gr_cog/tr.d046:trMA.Ode8C3Tr.mode	@ltx/gr_gr_cog/miscellanea:misc.Mode1
ltx/gr_gr_cog/tr.d046:trMA.Ode8C3Tr.ode	@ltx/gr_gr_cog/miscellanea:misc.Ode8
ltx/gr_gr_cog/tr.d046:trMA.Ode8C3Tr.text	Μίαν ἐν τρισὶ χαρακτῆρσιν οὐσίαν, δοξάζων οὐ συγχέω, μονοπροσώπως τὰ τρία, οὐδὲ τέμνω μορφήν, τὸν Πατέρα, καὶ Υἱὸν σὺν τῷ Πνεύματι· εἷς γὰρ ἐπὶ πάντων, Θεὸς ὁ ἐν Τριάδι.
ltx/gr_gr_cog/tr.d046:trMA.Ode9C11.greekmelody	@ltx/gr_gr_cog/he.h.m4:heHE.ApasGigenis.greekname
ltx/gr_gr_cog/tr.d046:trMA.Ode9C11.incipit	Λόγχῃ σου Πλευράν, ἐνύγης ἀφέσεως…
ltx/gr_gr_cog/tr.d046:trMA.Ode9C11.melody	@ltx/gr_gr_cog/he.h.m4:heHE.ApasGigenis.name
ltx/gr_gr_cog/tr.d046:trMA.Ode9C11.mode	@ltx/gr_gr_cog/miscellanea:misc.Mode4
ltx/gr_gr_cog/tr.d046:trMA.Ode9C11.ode	@ltx/gr_gr_cog/miscellanea:misc.Ode9
ltx/gr_gr_cog/tr.d046:trMA.Ode9C11.text	Λόγχῃ σου Πλευράν, ἐνύγης ἀφέσεως, ἀναστομῶν μοι πηγάς, ξύλῳ προσηλώθης δέ, τὴν διὰ ξύλου ἱστῶν κατάκρισιν, μέσον τῆς γῆς Φιλάνθρωπε, ὅπερ ἡμεῖς μεσασμῷ, τῆς Νηστείας, νῦν περιπτυσσόμεθα, ἀνυμνοῦντες τὴν σὴν ἀγαθότητα.
ltx/gr_gr_cog/tr.d046:trMA.Ode9C12.incipit	Ὄρη γλυκασμόν, βουνοὶ ἀγαλλίασιν, πόθῳ…
ltx/gr_gr_cog/tr.d046:trMA.Ode9C12.melody	@ltx/gr_gr_cog/he.h.m4:heHE.ApasGigenis.name
ltx/gr_gr_cog/tr.d046:trMA.Ode9C12.mode	@ltx/gr_gr_cog/miscellanea:misc.Mode4
ltx/gr_gr_cog/tr.d046:trMA.Ode9C12.ode	@ltx/gr_gr_cog/miscellanea:misc.Ode9
ltx/gr_gr_cog/tr.d046:trMA.Ode9C12.text	Ὄρη γλυκασμόν, βουνοὶ ἀγαλλίασιν, πόθῳ σταλάξατε, ξύλα τοῦ πεδίου δέ, Λιβάνου κέδροι περιχορεύσατε, τῇ προσκυνήσει σήμερον, τοῦ ζωηφόρου Σταυροῦ, οἱ Προφῆται, Μάρτυρες, Ἀπόστολοι, καὶ Δικαίων σκιρτήσατε πνεύματα.
ltx/gr_gr_cog/tr.d046:trMA.Ode9C13.incipit	Νεῦσον εἰς λαόν, καὶ κλῆρόν…
ltx/gr_gr_cog/tr.d046:trMA.Ode9C13.melody	@ltx/gr_gr_cog/he.h.m4:heHE.ApasGigenis.name
ltx/gr_gr_cog/tr.d046:trMA.Ode9C13.mode	@ltx/gr_gr_cog/miscellanea:misc.Mode4
ltx/gr_gr_cog/tr.d046:trMA.Ode9C13.ode	@ltx/gr_gr_cog/miscellanea:misc.Ode9
ltx/gr_gr_cog/tr.d046:trMA.Ode9C13.text	Νεῦσον εἰς λαόν, καὶ κλῆρόν σου Κύριε, φόβῳ ὑμνοῦντάς σε, θάνατον ἑκούσιον, διʼ οὗ ὑπέστης, μὴ νικησάτω σου, τὴν εὐσπλαγχνίαν ἄμετρος, πληθὺς κακῶν ἡμῶν, ἀλλὰ σῶσον, πάντας ὑπεράγαθε, τῷ Σταυρῷ σου ἡμᾶς ὡς φιλάνθρωπος.
ltx/gr_gr_cog/tr.d046:trMA.Ode9C1H.greekmelody	@ltx/gr_gr_cog/he.h.m4:heHE.ApasGigenis.greekname
ltx/gr_gr_cog/tr.d046:trMA.Ode9C1H.incipit	@ltx/gr_gr_cog/he.h.m4:heHE.ApasGigenis.incipit
ltx/gr_gr_cog/tr.d046:trMA.Ode9C1H.melody	@ltx/gr_gr_cog/he.h.m4:heHE.ApasGigenis.melody
ltx/gr_gr_cog/tr.d046:trMA.Ode9C1H.mode	@ltx/gr_gr_cog/miscellanea:misc.Mode4
ltx/gr_gr_cog/tr.d046:trMA.Ode9C1H.ode	@ltx/gr_gr_cog/miscellanea:misc.Ode9
ltx/gr_gr_cog/tr.d046:trMA.Ode9C1H.text	@ltx/gr_gr_cog/he.h.m4:heHE.ApasGigenis.text
ltx/gr_gr_cog/tr.d046:trMA.Ode9C1T.incipit	Νεύματι τῷ σῷ, κλονεῖς τὸν…
ltx/gr_gr_cog/tr.d046:trMA.Ode9C1T.melody	@ltx/gr_gr_cog/he.h.m4:heHE.ApasGigenis.name
ltx/gr_gr_cog/tr.d046:trMA.Ode9C1T.mode	@ltx/gr_gr_cog/miscellanea:misc.Mode4
ltx/gr_gr_cog/tr.d046:trMA.Ode9C1T.ode	@ltx/gr_gr_cog/miscellanea:misc.Ode9
ltx/gr_gr_cog/tr.d046:trMA.Ode9C1T.text	Νεύματι τῷ σῷ, κλονεῖς τὸν ὁρώμενον, Κόσμον σταυρούμενος, μένεις δὲ κρεμάμενος, ἡ Θεοτόκος κλαίουσα ἔλεγε· τὰ ἐμπαθῆ νοήματα, τοῦ Πρωτοπλάστου Χριστέ, ἐξηλῶσαι, θέλων καὶ ἰάσασθαι, τὴν αὐτοῦ συντριβὴν ἀγαθότητα.
ltx/gr_gr_cog/tr.d046:trMA.Ode9C21.greekmelody	@ltx/gr_gr_cog/he.h.m6:heHE.AporeiPasaGlossa.greekname
ltx/gr_gr_cog/tr.d046:trMA.Ode9C21.incipit	Ὁ Ἐλισσαῖος, πάλαι ποταμοῦ τὴν…
ltx/gr_gr_cog/tr.d046:trMA.Ode9C21.melody	@ltx/gr_gr_cog/he.h.m6:heHE.AporeiPasaGlossa.name
ltx/gr_gr_cog/tr.d046:trMA.Ode9C21.mode	@ltx/gr_gr_cog/miscellanea:misc.Mode6
ltx/gr_gr_cog/tr.d046:trMA.Ode9C21.ode	@ltx/gr_gr_cog/miscellanea:misc.Ode9
ltx/gr_gr_cog/tr.d046:trMA.Ode9C21.text	Ὁ Ἐλισσαῖος, πάλαι ποταμοῦ τὴν ἀξίνην, ἀνέλκων ξύλῳ, σὲ τὸ ζωοδώρητον, ἐτύπου Σταυρὲ ξύλον, διʼ οὗ ἐκ βυθοῦ ἀνείλκυσε Χριστὸς τὰ ἔθνη, εἰδωλικῆς μανίας, ἐν σοὶ προσηλωθείς· ὅθεν σε προσκυνοῦντες, τὸ κράτος αὐτοῦ δοξάζομεν.
ltx/gr_gr_cog/tr.d046:trMA.Ode9C22.incipit	Ἡλίου σέλας, Σῶτερ μετεβλήθη εἰς…
ltx/gr_gr_cog/tr.d046:trMA.Ode9C22.melody	@ltx/gr_gr_cog/he.h.m6:heHE.AporeiPasaGlossa.name
ltx/gr_gr_cog/tr.d046:trMA.Ode9C22.mode	@ltx/gr_gr_cog/miscellanea:misc.Mode6
ltx/gr_gr_cog/tr.d046:trMA.Ode9C22.ode	@ltx/gr_gr_cog/miscellanea:misc.Ode9
ltx/gr_gr_cog/tr.d046:trMA.Ode9C22.text	Ἡλίου σέλας, Σῶτερ μετεβλήθη εἰς σκότος, τῇ σῇ σταυρώσει, φέγγος τε σελήνης ἀπεσβέσθη, καὶ στοιχεῖα τρόμῳ ἠλλοιώθη ἅπαντα· διὸ βοῶ σοι· Ἀλλοιωθέντα σκότει παθῶν μου λογισμούς, Λόγε σῇ δεξιᾷ ἀλλοιώσας, φώτισον σῶσόν με.
ltx/gr_gr_cog/tr.d046:trMA.Ode9C23.incipit	Τῷ μώλωπί σου, ἴασαι ψυχῆς…
ltx/gr_gr_cog/tr.d046:trMA.Ode9C23.melody	@ltx/gr_gr_cog/he.h.m6:heHE.AporeiPasaGlossa.name
ltx/gr_gr_cog/tr.d046:trMA.Ode9C23.mode	@ltx/gr_gr_cog/miscellanea:misc.Mode6
ltx/gr_gr_cog/tr.d046:trMA.Ode9C23.ode	@ltx/gr_gr_cog/miscellanea:misc.Ode9
ltx/gr_gr_cog/tr.d046:trMA.Ode9C23.text	Τῷ μώλωπί σου, ἴασαι ψυχῆς μου τὰ πάθη, Πλευρᾶς σου τρώσει παῦσον, ἐπωδύνους τε, τὰς τρώσεις τῶν δαιμόνων, ἥλοις σου Χριστὲ ἐξήλωσας, τὰς ἐνηδόνους, καὶ ἐμπαθεῖς ὀρέξεις, διδούς μοι ἀπαθῶς Πάθη σου, τὰ σεπτὰ προσκυνῆσαι, καὶ τὴν Ἀνάστασιν.
ltx/gr_gr_cog/tr.d046:trMA.Ode9C2T.incipit	Ὡραῖον κάλλει, τέτοκεν ὡραῖα σε…
ltx/gr_gr_cog/tr.d046:trMA.Ode9C2T.melody	@ltx/gr_gr_cog/he.h.m6:heHE.AporeiPasaGlossa.name
ltx/gr_gr_cog/tr.d046:trMA.Ode9C2T.mode	@ltx/gr_gr_cog/miscellanea:misc.Mode6
ltx/gr_gr_cog/tr.d046:trMA.Ode9C2T.ode	@ltx/gr_gr_cog/miscellanea:misc.Ode9
ltx/gr_gr_cog/tr.d046:trMA.Ode9C2T.text	Ὡραῖον κάλλει, τέτοκεν ὡραῖα σε Κόρη, ὃν καθορῶσα, κάλλος ἐν τῷ πάσχειν, οὐδὲ εἶδος κεκτημένον Σῶτερ, θρηνῳδοῦσα ἔλεγεν· Ἐκπλήττομαί σου, τὴν ὑπὲρ νοῦν Υἱέ μου ταπείνωσιν, διʼ ἧς σῴζεις, ταπεινωθεῖσαν τὴν φύσιν, τῆς ἀνθρωπότητος.
ltx/gr_gr_cog/tr.d046:trMA.Ode9C31.greekmelody	@ltx/gr_gr_cog/he.h.m1:heHE.FotizouFotizou.greekname
ltx/gr_gr_cog/tr.d046:trMA.Ode9C31.incipit	Προέρχου φαιδρύνου, πᾶς ὁ λαὸς…
ltx/gr_gr_cog/tr.d046:trMA.Ode9C31.melody	@ltx/gr_gr_cog/he.h.m1:heHE.FotizouFotizou.name
ltx/gr_gr_cog/tr.d046:trMA.Ode9C31.mode	@ltx/gr_gr_cog/miscellanea:misc.Mode1
ltx/gr_gr_cog/tr.d046:trMA.Ode9C31.ode	@ltx/gr_gr_cog/miscellanea:misc.Ode9
ltx/gr_gr_cog/tr.d046:trMA.Ode9C31.text	Προέρχου φαιδρύνου, πᾶς ὁ λαὸς ὁ τοῦ Θεοῦ, καὶ τὸ ξύλον προβλέπων, τοῦ Σταυροῦ λάβε χαράν, προκείμενον, ἄσπασαι φόβῳ, καὶ τὸν ἐν αὐτῷ, Κύριον τῆς δόξης, ἀναρτηθέντα δοξάζων ἀεί.
ltx/gr_gr_cog/tr.d046:trMA.Ode9C32.incipit	Τὸ ὅπλον τὸ θεῖον, σὺ…
ltx/gr_gr_cog/tr.d046:trMA.Ode9C32.melody	@ltx/gr_gr_cog/he.h.m1:heHE.FotizouFotizou.name
ltx/gr_gr_cog/tr.d046:trMA.Ode9C32.mode	@ltx/gr_gr_cog/miscellanea:misc.Mode1
ltx/gr_gr_cog/tr.d046:trMA.Ode9C32.ode	@ltx/gr_gr_cog/miscellanea:misc.Ode9
ltx/gr_gr_cog/tr.d046:trMA.Ode9C32.text	Τὸ ὅπλον τὸ θεῖον, σὺ τῆς ζωῆς μου ὁ Σταυρός, ἐπὶ σὲ ὁ Δεσπότης, ἀνελθών με ἔσωσεν, ἔβλυσεν αἷμα, καὶ ὕδωρ νυγείς, ἐκ τῆς Πλευρᾶς, οὗ μεταλαμβάνων, ἀγαλλιῶμαι δοξάζων αὐτόν.
ltx/gr_gr_cog/tr.d046:trMA.Ode9C3A1.incipit	Τὸ σκῆπτρον τὸ θεῖον, τοῦ…
ltx/gr_gr_cog/tr.d046:trMA.Ode9C3A1.melody	@ltx/gr_gr_cog/he.h.m1:heHE.FotizouFotizou.name
ltx/gr_gr_cog/tr.d046:trMA.Ode9C3A1.mode	@ltx/gr_gr_cog/miscellanea:misc.Mode1
ltx/gr_gr_cog/tr.d046:trMA.Ode9C3A1.ode	@ltx/gr_gr_cog/miscellanea:misc.Ode9
ltx/gr_gr_cog/tr.d046:trMA.Ode9C3A1.text	Τὸ σκῆπτρον τὸ θεῖον, τοῦ Βασιλέως ὁ Σταυρός, τοῦ στρατοῦ ἡ ἀνδρεία, ἐν τῇ πεποιθήσει σου, τοὺς πολεμίους ἐκτρέπομεν, νίκας ἀεὶ τοῖς σὲ προσκυνοῦσι, κατὰ βαρβάρων παράσχου ἡμῖν.
ltx/gr_gr_cog/tr.d046:trMA.Ode9C3H.greekmelody	@ltx/gr_gr_cog/he.h.m1:heHE.OMiterParthene.greekname
ltx/gr_gr_cog/tr.d046:trMA.Ode9C3H.incipit	@ltx/gr_gr_cog/he.h.m1:heHE.OMiterParthene.incipit
ltx/gr_gr_cog/tr.d046:trMA.Ode9C3H.melody	@ltx/gr_gr_cog/he.h.m1:heHE.OMiterParthene.melody
ltx/gr_gr_cog/tr.d046:trMA.Ode9C3H.mode	@ltx/gr_gr_cog/miscellanea:misc.Mode1
ltx/gr_gr_cog/tr.d046:trMA.Ode9C3H.ode	@ltx/gr_gr_cog/miscellanea:misc.Ode9
ltx/gr_gr_cog/tr.d046:trMA.Ode9C3H.text	@ltx/gr_gr_cog/he.h.m1:heHE.OMiterParthene.text
ltx/gr_gr_cog/tr.d046:trMA.Ode9C3T.incipit	Τὸ ὄρος τὸ μέγα, ἐν…
ltx/gr_gr_cog/tr.d046:trMA.Ode9C3T.melody	@ltx/gr_gr_cog/he.h.m1:heHE.FotizouFotizou.name
ltx/gr_gr_cog/tr.d046:trMA.Ode9C3T.mode	@ltx/gr_gr_cog/miscellanea:misc.Mode1
ltx/gr_gr_cog/tr.d046:trMA.Ode9C3T.ode	@ltx/gr_gr_cog/miscellanea:misc.Ode9
ltx/gr_gr_cog/tr.d046:trMA.Ode9C3T.text	Τὸ ὄρος τὸ μέγα, ἐν ᾧ κατῴκησε Χριστός, σὺ ὑπάρχεις Παρθένε, ὡς Δαυῒδ ὁ θεῖος βοᾷ, δι ἧς ἡμεῖς ἀνυψώθημεν, πρὸς οὐρανόν, υἱοθετηθέντες, τῷ Πνεύματι παμμακάριστε.
ltx/gr_gr_cog/tr.d046:trMA.Ode9C3Tr.incipit	Τριάδα προσώποις, Μονάδα φύσει προσκυνῶ…
ltx/gr_gr_cog/tr.d046:trMA.Ode9C3Tr.melody	@ltx/gr_gr_cog/he.h.m1:heHE.FotizouFotizou.name
ltx/gr_gr_cog/tr.d046:trMA.Ode9C3Tr.mode	@ltx/gr_gr_cog/miscellanea:misc.Mode1
ltx/gr_gr_cog/tr.d046:trMA.Ode9C3Tr.ode	@ltx/gr_gr_cog/miscellanea:misc.Ode9
ltx/gr_gr_cog/tr.d046:trMA.Ode9C3Tr.text	Τριάδα προσώποις, Μονάδα φύσει προσκυνῶ, σὲ Θεότης ἁγία, τὸν Πατέρα καὶ τὸν Υἱόν, σὺν τῷ ἁγίῳ τε Πνεύματι, μίαν ἀρχήν, μίαν βασιλείαν, τὴν τῶν ἁπάντων δεσπόζουσαν.
ltx/gr_gr_cog/tr.d046:trMA.Oikos1.text	@ltx/gr_gr_cog/tr.d043:trMA.Oikos1.text
ltx/gr_gr_cog/tr.d046:trTE.Troparion.incipit	@ltx/gr_gr_cog/ho.ho07:hoLI.TonStavronSou.incipit
ltx/gr_gr_cog/tr.d046:trTE.Troparion.melody	
ltx/gr_gr_cog/tr.d046:trTE.Troparion.mode	@ltx/gr_gr_cog/miscellanea:misc.Mode6
ltx/gr_gr_cog/tr.d046:trTE.Troparion.text	@ltx/gr_gr_cog/ho.ho07:hoLI.TonStavronSou.text
ltx/gr_gr_cog/tr.d046:trTE.Troparion2.incipit	
ltx/gr_gr_cog/tr.d046:trTE.Troparion2.text	
ltx/gr_gr_cog/tr.d046:trVE.AposGlory.incipit	@ltx/gr_gr_cog/tr.d043:trVE.LityGlory.incipit
ltx/gr_gr_cog/tr.d046:trVE.AposGlory.melody	@ltx/gr_gr_cog/miscellanea:misc.Idiomelon
ltx/gr_gr_cog/tr.d046:trVE.AposGlory.mode	@ltx/gr_gr_cog/miscellanea:misc.Mode5
ltx/gr_gr_cog/tr.d046:trVE.AposGlory.text	@ltx/gr_gr_cog/tr.d043:trVE.LityGlory.text
ltx/gr_gr_cog/tr.d046:trVE.AposIdiomelon1.incipit	Νικῶν τὸν Τελώνην τοῖς παραπτώμασιν…
ltx/gr_gr_cog/tr.d046:trVE.AposIdiomelon1.melody	@ltx/gr_gr_cog/miscellanea:misc.Idiomelon
ltx/gr_gr_cog/tr.d046:trVE.AposIdiomelon1.mode	@ltx/gr_gr_cog/miscellanea:misc.Mode3
ltx/gr_gr_cog/tr.d046:trVE.AposIdiomelon1.text	Νικῶν τὸν Τελώνην τοῖς παραπτώμασιν, οὐ ζηλῶ τῇ μετανοίᾳ, τοῦ δὲ Φαρισαίου μὴ κεκτημένος τὰ κατορθώματα, μιμοῦμαι τὴν οἴησιν. Ἀλλʼ ἡ τῆς σῆς ταπεινώσεως ὑπερβολή, Χριστὲ ὁ Θεός, τὴν δαιμονικὴν ὑψηλοφροσύνην ἐν τῷ Σταυρῷ καθελών, τοῦ μέν, τῆς προτέρας·πονηρίας, τοῦ δέ, τῆς ἐσχάτης ἀπονοίας, ἀλλοτρίωσόν με, τὴν ἑκατέρων χρηστὴν διάθεσιν, ἐν τῇ ψυχῇ μου βεβαιώσας, καὶ σῶσόν με.
ltx/gr_gr_cog/tr.d046:trVE.AposMartyric.incipit	Προφῆται καὶ Ἀπόστολοι, Χριστοῦ καὶ…
ltx/gr_gr_cog/tr.d046:trVE.AposMartyric.melody	
ltx/gr_gr_cog/tr.d046:trVE.AposMartyric.mode	@ltx/gr_gr_cog/miscellanea:misc.Mode3
ltx/gr_gr_cog/tr.d046:trVE.AposMartyric.text	Προφῆται καὶ Ἀπόστολοι, Χριστοῦ καὶ Μάρτυρες, ἐδίδαξαν ὑμνεῖσθαι, Τριάδα ὁμοούσιον, καὶ ἐφώτισαν τὰ ἔθνη τὰ πεπλανημένα, καὶ κοινωνοὺς Ἀγγέλων ἐποίησαν, τοὺς υἱοὺς τῶν ἀνθρώπων.
ltx/gr_gr_cog/tr.d046:trVE.MM.Stichera456as8910.text	@ltx/gr_gr_cog/properties:media.key
ltx/gr_gr_cog/tr.d046:trVE.SticGlory.incipit	@ltx/gr_gr_cog/tr.d043:trMA.AdditionalIdiomelon2.incipit
ltx/gr_gr_cog/tr.d046:trVE.SticGlory.melody	@ltx/gr_gr_cog/miscellanea:misc.Idiomelon
ltx/gr_gr_cog/tr.d046:trVE.SticGlory.mode	@ltx/gr_gr_cog/miscellanea:misc.Mode8
ltx/gr_gr_cog/tr.d046:trVE.SticGlory.text	@ltx/gr_gr_cog/tr.d043:trMA.AdditionalIdiomelon2.text
ltx/gr_gr_cog/tr.d046:trVE.Stichera01.greekmelody	@ltx/gr_gr_cog/he.a.m6:heAU.OlinApothemenoi.greekname
ltx/gr_gr_cog/tr.d046:trVE.Stichera01.incipit	Μέσον γῆς ὑπέμεινας, Σταυρὸν καὶ…
ltx/gr_gr_cog/tr.d046:trVE.Stichera01.melody	@ltx/gr_gr_cog/he.a.m6:heAU.OlinApothemenoi.name
ltx/gr_gr_cog/tr.d046:trVE.Stichera01.mode	@ltx/gr_gr_cog/miscellanea:misc.Mode6
ltx/gr_gr_cog/tr.d046:trVE.Stichera01.text	Μέσον γῆς ὑπέμεινας, Σταυρὸν καὶ Πάθος οἰκτίρμον, πᾶσι τὴν ἀπάθειαν, καὶ τὴν ἀπολύτρωσιν παρεχόμενος, μεσασμῷ σήμερον, Νηστειῶν ἅπαντες· διὰ τοῦτο εἰς προσκύνησιν, αὐτὸν προτίθεμεν, καὶ περιχαρῶς ἀσπαζόμεθα, ἰδεῖν σου τὰ Παθήματα, καὶ τὴν ζωηφόρον Ἀνάστασιν, ἐκλελαμπρυσμένοι, ταῖς θείαις ἀρεταῖς Λόγε Θεοῦ, ἀναδειχθείημεν ἅπαντες, μόνε πολυέλεε.
ltx/gr_gr_cog/tr.d046:trVE.Stichera02.greekmelody	@ltx/gr_gr_cog/he.a.m6:heAU.OlinApothemenoi.greekname
ltx/gr_gr_cog/tr.d046:trVE.Stichera02.incipit	Νεκρὸς ἐχρημάτισας, ἐπὶ σταυροῦ ἡπλωμένος…
ltx/gr_gr_cog/tr.d046:trVE.Stichera02.melody	@ltx/gr_gr_cog/he.a.m6:heAU.OlinApothemenoi.name
ltx/gr_gr_cog/tr.d046:trVE.Stichera02.mode	@ltx/gr_gr_cog/miscellanea:misc.Mode6
ltx/gr_gr_cog/tr.d046:trVE.Stichera02.text	Νεκρὸς ἐχρημάτισας, ἐπὶ σταυροῦ ἡπλωμένος, καὶ λόγχῃ νυττόμενος, καὶ χολὴν Μακρόθυμε ποτιζόμενος, ὁ Μεῤῥᾶς ὕδατα, ἐν χειρὶ Δέσποτα, Μωϋσέως εἰς γλυκύτητα, μεταβαλόμενος· ὅθεν δυσωπῶ σε καὶ δέομαι. Τὰ πάθη τὰ πικρότατα, ἐκ τῆς διανοίας μου ἔκτιλον, καὶ τῆς μετανοίας, τῷ μέλιτι γλυκάνας μου τὸν νοῦν, προσκυνητήν με ἀνάδειξον, τοῦ τιμίου Πάθους σου.
ltx/gr_gr_cog/tr.d046:trVE.Stichera03.incipit	Ὃν πάλαι Μωϋσῆς προτυπώσας, ἐν…
ltx/gr_gr_cog/tr.d046:trVE.Stichera03.melody	Ὁ πάλαι τῷ Μωσεῖ.
ltx/gr_gr_cog/tr.d046:trVE.Stichera03.mode	@ltx/gr_gr_cog/miscellanea:misc.Mode1
ltx/gr_gr_cog/tr.d046:trVE.Stichera03.text	Ὃν πάλαι Μωϋσῆς προτυπώσας, ἐν ταῖς παλάμαις αὐτοῦ, κατετροποῦτο τὸν Ἀμαλήκ, μέγαν Σταυρόν, σήμερον ἐπʼ ὄψει ἡμῶν βλέποντες, λαοὶ προτεθέντα, φρικτῶς ψαύσωμεν ἐν ἁγνότητι νοῦ τε καὶ χειλέων· ἐν αὐτῷ γὰρ Χριστὸς ὑψώθη, ἀπονεκρώσας τὸν θάνατον, καὶ τῆς τοιαύτης χάριτος, ἅπαντες καταξιούμενοι, ἐν ᾠδαῖς θεοπνεύστοις, τοῦ παντὸς τὸν Σωτῆρα ὑμνολογοῦντες, προσευξώμεθα προφθάσαι, καὶ αὐτὴν τὴν σωτήριον Ἀνάστασιν.
ltx/gr_gr_cog/tr.d046:trVE.Stichera04.greekmelody	@ltx/gr_gr_cog/he.a.m4:heAU.EdokasSimeiosin.greekname
ltx/gr_gr_cog/tr.d046:trVE.Stichera04.incipit	Δεῦτε προσκυνήσωμεν, τὸ τῆς ζωῆς…
ltx/gr_gr_cog/tr.d046:trVE.Stichera04.melody	@ltx/gr_gr_cog/he.a.m4:heAU.EdokasSimeiosin.name
ltx/gr_gr_cog/tr.d046:trVE.Stichera04.mode	@ltx/gr_gr_cog/miscellanea:misc.Mode4
ltx/gr_gr_cog/tr.d046:trVE.Stichera04.text	Δεῦτε προσκυνήσωμεν, τὸ τῆς ζωῆς ἡμῶν πρόξενον, πεφηνὸς ξύλον σήμερον, Χριστοῦ τοῦ Θεοῦ ἡμῶν, τὸν Σταυρόν, διʼ οὗ περ θάνατος ἐτρώθη, καὶ ἡ ἀνάστασις ἡμῖν, τοῖς ἑπταικόσιν ἐκαινουργήθη σαφῶς, τῷ ῥυσαμένῳ κράζοντες· Ὁ διʼ ἡμᾶς ἑκουσίως παθών, ἵνα σώσῃς τὰ σύμπαντα, ὁ Θεὸς ἡμῶν δόξα σοι.
ltx/gr_gr_cog/tr.d046:trVE.Stichera05.incipit	Κράτος ἀπροσμάχητον, Χριστιανοῖς ἡμῖν δέδοται…
ltx/gr_gr_cog/tr.d046:trVE.Stichera05.melody	@ltx/gr_gr_cog/he.a.m4:heAU.EdokasSimeiosin.name
ltx/gr_gr_cog/tr.d046:trVE.Stichera05.mode	@ltx/gr_gr_cog/miscellanea:misc.Mode4
ltx/gr_gr_cog/tr.d046:trVE.Stichera05.text	Κράτος ἀπροσμάχητον, Χριστιανοῖς ἡμῖν δέδοται, ὁ Σταυρός σου Σωτὴρ ἡμῶν, διʼ οὗ τὰ ἀλλόφυλα τῶν ἐθνῶν τροποῦνται, πλήθη καὶ εἰρήνη, τῆς Ἐκκλησίας σου Χριστέ, ἐπισκιάζει ὀρθοδοξούσης καλῶς, ὅν περ νῦν ἀσπαζόμεθα, καὶ σοὶ θερμῶς ἀνακράζομεν· Τῆς μερίδος ἀξίωσον, καὶ ἡμᾶς τῶν Ἁγίων σου.
ltx/gr_gr_cog/tr.d046:trVE.Stichera06.incipit	Δάκρυσι καθάραντες, τὰ τῆς ψυχῆς…
ltx/gr_gr_cog/tr.d046:trVE.Stichera06.melody	@ltx/gr_gr_cog/he.a.m4:heAU.EdokasSimeiosin.name
ltx/gr_gr_cog/tr.d046:trVE.Stichera06.mode	@ltx/gr_gr_cog/miscellanea:misc.Mode4
ltx/gr_gr_cog/tr.d046:trVE.Stichera06.text	Δάκρυσι καθάραντες, τὰ τῆς ψυχῆς αἰσθητήρια, καὶ νηστείᾳ ἁγνίσαντες, δεῦτε προσκυνήσωμεν, τοῦ Σταυροῦ τὸ ξύλον, διʼ οὗ καταργοῦνται τὰ ψυχοφθόρα τῆς σαρκός, τῇ ἐγκρατείᾳ ἀνασκιρτήματα, τῷ σταυρωθέντι κράζοντες· Τῆς σῆς Σωτὴρ καταξίωσον, τριημέρου Ἐγέρσεως, προσκυνῆσαι τὴν ἔλλαμψιν.
