ltx/gr_gr_cog/le.ep.mc.d073:lemcLI.Epistle.book_abbr	@ltx/gr_gr_cog/bible:Acts.abbr
ltx/gr_gr_cog/le.ep.mc.d073:lemcLI.Epistle.book_string	@ltx/gr_gr_cog/bible:Acts.text
ltx/gr_gr_cog/le.ep.mc.d073:lemcLI.Epistle.chapverse	2:14 – 21
ltx/gr_gr_cog/le.ep.mc.d073:lemcLI.Epistle.incipit	Σταθεὶς ὁ Πέτρος σὺν τοῖς ἕνδεκα…
ltx/gr_gr_cog/le.ep.mc.d073:lemcLI.Epistle.text	Ἐν ταῖς ἡμέραις ἐκείναις, σταθεὶς ὁ Πέτρος σὺν τοῖς ἕνδεκα ἐπῆρε τὴν φωνὴν αὐτοῦ καὶ ἀπεφθέγξατο αὐτοῖς· ἄνδρες Ἰουδαῖοι καὶ οἱ κατοικοῦντες Ἱερουσαλὴμ ἅπαντες, τοῦτο ὑμῖν γνωστὸν ἔστω καὶ ἐνωτίσασθε τὰ ῥήματά μου. οὐ γάρ, ὡς ὑμεῖς ὑπολαμβάνετε, οὗτοι μεθύουσιν· ἔστι γὰρ ὥρα τρίτη τῆς ἡμέρας· ἀλλὰ τοῦτό ἐστι τὸ εἰρημένον διὰ τοῦ προφήτου Ἰωήλ· καὶ ἔσται ἐν ταῖς ἐσχάταις ἡμέραις, λέγει ὁ Θεός, ἐκχεῶ ἀπὸ τοῦ πνεύματός μου ἐπὶ πᾶσαν σάρκα, καὶ προφητεύσουσιν οἱ υἱοὶ ὑμῶν καὶ αἱ θυγατέρες ὑμῶν, καὶ οἱ νεανίσκοι ὑμῶν ὁράσεις ὄψονται, καὶ οἱ πρεσβύτεροι ὑμῶν ἐνύπνια ἐνυπνιασθήσονται· καί γε ἐπὶ τοὺς δούλους μου καὶ ἐπὶ τὰς δούλας μου ἐν ταῖς ἡμέραις ἐκείναις ἐκχεῶ ἀπὸ τοῦ πνεύματός μου, καὶ προφητεύσουσι. καὶ δώσω τέρατα ἐν τῷ οὐρανῷ ἄνω καὶ σημεῖα ἐπὶ τῆς γῆς κάτω, αἷμα καὶ πῦρ καὶ ἀτμίδα καπνοῦ· ὁ ἥλιος μεταστραφήσεται εἰς σκότος καὶ ἡ σελήνη εἰς αἷμα πρὶν ἢ ἐλθεῖν τὴν ἡμέραν Κυρίου τὴν μεγάλην καὶ ἐπιφανῆ. καὶ ἔσται πᾶς ὃς ἂν ἐπικαλέσηται τὸ ὄνομα Κυρίου σωθήσεται.
ltx/gr_gr_cog/le.ep.mc.d073:lemcLI.Epistle.title	Τῇ Τρίτῃ τῆς Διακαινησίμου
ltx/gr_gr_cog/le.ep.mc.d073:lemcLI.Epistle.title_abbr	Τρίτῃ τῆς Διακαινησίμου
ltx/gr_gr_cog/le.ep.mc.d073:lemcLI.Epistle.version	@ltx/gr_gr_cog/properties:version.designation
