ltx/gr_gr_cog/sy.m01.d31:cl.syMA.commemoration01.narration.p01	
ltx/gr_gr_cog/sy.m01.d31:cl.syMA.commemoration01.narration.p02	
ltx/gr_gr_cog/sy.m01.d31:cl.syMA.commemoration01.narration.p03	
ltx/gr_gr_cog/sy.m01.d31:cl.syMA.commemoration01.narration.p04	
ltx/gr_gr_cog/sy.m01.d31:cl.syMA.commemoration01.narration.p05	
ltx/gr_gr_cog/sy.m01.d31:cl.syMA.commemoration01.narration.p06	
ltx/gr_gr_cog/sy.m01.d31:cl.syMA.commemoration01.narration.p07	
ltx/gr_gr_cog/sy.m01.d31:cl.syMA.commemoration01.text	[saint/com 1]
ltx/gr_gr_cog/sy.m01.d31:cl.syMA.commemoration02.narration.p01	
ltx/gr_gr_cog/sy.m01.d31:cl.syMA.commemoration02.narration.p02	
ltx/gr_gr_cog/sy.m01.d31:cl.syMA.commemoration02.narration.p03	
ltx/gr_gr_cog/sy.m01.d31:cl.syMA.commemoration02.narration.p04	
ltx/gr_gr_cog/sy.m01.d31:cl.syMA.commemoration02.narration.p05	
ltx/gr_gr_cog/sy.m01.d31:cl.syMA.commemoration02.narration.p06	
ltx/gr_gr_cog/sy.m01.d31:cl.syMA.commemoration02.narration.p07	
ltx/gr_gr_cog/sy.m01.d31:cl.syMA.commemoration02.text	[saint/com 2]
ltx/gr_gr_cog/sy.m01.d31:cl.syMA.commemoration03.narration.p01	
ltx/gr_gr_cog/sy.m01.d31:cl.syMA.commemoration03.narration.p02	
ltx/gr_gr_cog/sy.m01.d31:cl.syMA.commemoration03.narration.p03	
ltx/gr_gr_cog/sy.m01.d31:cl.syMA.commemoration03.narration.p04	
ltx/gr_gr_cog/sy.m01.d31:cl.syMA.commemoration03.narration.p05	
ltx/gr_gr_cog/sy.m01.d31:cl.syMA.commemoration03.narration.p06	
ltx/gr_gr_cog/sy.m01.d31:cl.syMA.commemoration03.narration.p07	
ltx/gr_gr_cog/sy.m01.d31:cl.syMA.commemoration03.text	[saint/com 3]
ltx/gr_gr_cog/sy.m01.d31:cl.syMA.commemoration04.narration.p01	
ltx/gr_gr_cog/sy.m01.d31:cl.syMA.commemoration04.narration.p02	
ltx/gr_gr_cog/sy.m01.d31:cl.syMA.commemoration04.narration.p03	
ltx/gr_gr_cog/sy.m01.d31:cl.syMA.commemoration04.narration.p04	
ltx/gr_gr_cog/sy.m01.d31:cl.syMA.commemoration04.narration.p05	
ltx/gr_gr_cog/sy.m01.d31:cl.syMA.commemoration04.narration.p06	
ltx/gr_gr_cog/sy.m01.d31:cl.syMA.commemoration04.narration.p07	
ltx/gr_gr_cog/sy.m01.d31:cl.syMA.commemoration04.text	[saint/com 4]
ltx/gr_gr_cog/sy.m01.d31:cl.syMA.commemoration05.narration.p01	
ltx/gr_gr_cog/sy.m01.d31:cl.syMA.commemoration05.narration.p02	
ltx/gr_gr_cog/sy.m01.d31:cl.syMA.commemoration05.narration.p03	
ltx/gr_gr_cog/sy.m01.d31:cl.syMA.commemoration05.narration.p04	
ltx/gr_gr_cog/sy.m01.d31:cl.syMA.commemoration05.narration.p05	
ltx/gr_gr_cog/sy.m01.d31:cl.syMA.commemoration05.narration.p06	
ltx/gr_gr_cog/sy.m01.d31:cl.syMA.commemoration05.narration.p07	
ltx/gr_gr_cog/sy.m01.d31:cl.syMA.commemoration05.text	[saint/com 5]
ltx/gr_gr_cog/sy.m01.d31:cl.syMA.commemoration06.text	[saint/com list]
ltx/gr_gr_cog/sy.m01.d31:syMA.commemoration01.couplet1.title	@ltx/gr_gr_cog/titles:ti.Verses
ltx/gr_gr_cog/sy.m01.d31:syMA.commemoration01.couplet1.verse1	Κύρῳ συναθλῶν Ἰωάννης πρὸς ξίφος,
ltx/gr_gr_cog/sy.m01.d31:syMA.commemoration01.couplet1.verse2	Συνθαυματουργεῖ καὶ μετὰ ξίφος Κύρῳ.
ltx/gr_gr_cog/sy.m01.d31:syMA.commemoration01.couplet2.verse1	Μήτηρ ἀρίστη, καὶ τριὰς θυγατέρων,
ltx/gr_gr_cog/sy.m01.d31:syMA.commemoration01.couplet2.verse2	Πόθῳ Πατρὸς θνῄσκουσι τοῦ πάντων ξίφει.
ltx/gr_gr_cog/sy.m01.d31:syMA.commemoration01.narration.p01	Οὗτοι οἱ Ἅγιοι Μάρτυρες, Κῦρος καὶ Ἰωάννης, ὑπῆρχον ἐπὶ Διοκλητιανοῦ τοῦ Βασιλέως· ὁ µὲν Κῦρος, ἐκ τῆς Ἀλεξανδρέων πόλεως, ὁ δὲ Ἰωάννης ἐξ Ἐδέσσσης. Διὰ τὸν ἐπικρατοῦντα οὖν διωγµόν, καὶ τοὺς Χριστιανοὺς ἐκπορθοῦντα, τὸν πρὸς τὴν Ἀραβίαν τόπον θαλάσσιον καταλαβὼν ὁ Κῦρος, καὶ τὸ µοναχικὸν ἀµφιασάµενος σχῆµα, ἐν αὐτῷ κατοικεῖ. Ὁ δὲ Ἰωάννης, ἐν τοῖς Ἱεροσολύµοις γενόµενος, περὶ τῶν θαυµατουργιῶν τοῦ Ἁγίου Κύρου ἀκούσας (καὶ γὰρ ἦν πᾶσαν νόσον καὶ πᾶσαν µαλακίαν ἐξιώµενος), παρεγένετο εἰς Ἀλεξάνδρειαν, κἀκεῖθεν κατὰ φήµην, ἔνθα διέτριβεν, ἀπελθών, συνῆν µετʼ αὐτοῦ.
ltx/gr_gr_cog/sy.m01.d31:syMA.commemoration01.narration.p02	Συλληφθείσης δὲ γυναικός τινος, οὕτω καλουµένης Ἀθανασίας, µετὰ τῶν τριῶν αὐτῆς θυγατέρων, Θεοδότης, Θεοκτίστης, καὶ Εὐδοξίας, ὑπὲρ τῆς εἰς Χριστὸν πίστεως, καὶ µελλουσῶν παρίστασθαι τῷ δικάζοντι, δείσαντες οἱ Ἅγιοι µήτι πάθωσιν, οἷα πάσχειν γυναῖκας εἰκός, τοῦ ἀγῶνος τὸ µέγεθος καταπτήξασαι, παραγενόµενοι ἐθαρσοποίουν αὐτάς, καὶ πρὸς τοὺς ἀγῶνας ὑπήλειφον. Συγκατασχεθέντες οὖν καὶ οὗτοι καὶ τὸν Κύριον ἡµῶν Ἰησοῦν Χριστόν, Θεὸν ἀληθινὸν ὄντα, ὁµολογήσαντες, καὶ αἰκισµοῖς ὑποβληθέντες πολλοῖς, ξίφει τὰς κεφαλὰς ἀπετµήθησαν ἅµα ταῖς ῥηθείσαις γυναιξί. Τελεῖται δὲ ἡ αὐτῶν Σύναξις ἐν τῷ Μαρτυρίῳ αὐτῶν, τῷ ὄντι ἐν τοῖς Φωρακίου.
ltx/gr_gr_cog/sy.m01.d31:syMA.commemoration01.single1	Κῦρον Ἰωάννην τε τάμον πρώτῃ τριακοστῇ.
ltx/gr_gr_cog/sy.m01.d31:syMA.commemoration01.text	Τῇ ΛΑʹ τοῦ αὐτοῦ μηνός, μνήμη τῶν Ἁγίων καὶ θαυματουργῶν Ἀναργύρων, Κύρου καὶ Ἰωάννου· καὶ τῆς Ἁγίας Μάρτυρος Ἀθανασίας, καὶ τῶν τριῶν αὐτῆς θυγατέρων καὶ παρθένων, Θεοδότης, Θεοκτίστης, καὶ Εὐδοξίας.
ltx/gr_gr_cog/sy.m01.d31:syMA.commemoration02.couplet1.title	@ltx/gr_gr_cog/titles:ti.Verses
ltx/gr_gr_cog/sy.m01.d31:syMA.commemoration02.couplet1.verse1	Ὅλμῳ μέλη τρεῖς συντριβέντες γεννάδαι,
ltx/gr_gr_cog/sy.m01.d31:syMA.commemoration02.couplet1.verse2	Ὤφθησαν οἱ τρεῖς σώματος Χριστοῦ μέλη.
ltx/gr_gr_cog/sy.m01.d31:syMA.commemoration02.couplet2.verse1	Καλὴν ἀπαρχὴν Κλαύδιος τῷ Κυρίῳ,
ltx/gr_gr_cog/sy.m01.d31:syMA.commemoration02.couplet2.verse2	Ἐκ σώματος δίδωσι χεῖρας καὶ πόδας.
ltx/gr_gr_cog/sy.m01.d31:syMA.commemoration02.couplet3.verse1	Ἐν τῇ καμίνῳ καὶ τὸ τοῦ πόνου στέφος.
ltx/gr_gr_cog/sy.m01.d31:syMA.commemoration02.couplet3.verse2	Εἴσελθε Διόδωρε Μάρτυς, καὶ στέφου.
ltx/gr_gr_cog/sy.m01.d31:syMA.commemoration02.couplet4.verse1	Εἰ τοῦ ξίφους στέρξω σὲ τῷ φόβῳ βίε,
ltx/gr_gr_cog/sy.m01.d31:syMA.commemoration02.couplet4.verse2	Καὶ πῶς Θεὸς στέρξει με τὸν Σαραπῖνον.
ltx/gr_gr_cog/sy.m01.d31:syMA.commemoration02.couplet5.verse1	Λοῦσαι θαλάσσης πικρὰ λουτρὰ Παπία,
ltx/gr_gr_cog/sy.m01.d31:syMA.commemoration02.couplet5.verse2	Καὶ τοῦ γλυκασμοῦ τῆς ἄνω τρυφῆς τύχης.
ltx/gr_gr_cog/sy.m01.d31:syMA.commemoration02.narration.p01	Οὗτοι, ἐπὶ Δεκίου τοῦ Βασιλέως, διὰ τὴν εἰς Χριστὸν ὁµολογίαν συσχεθέντες, καὶ ἀχθέντες Τερτίῳ τῷ Ἀνθυπάτῳ, ἐν Κορίνθῳ τὴν ἀρχὴν τῆς Ἑλλάδος διέποντι (ἐκ Κορίνθου γὰρ ὥρµηντο οἱ Ἅγιοι), µετὰ πλείστας αἰκίας καὶ ἀνυποίστους, διαφόρους ἐδέξαντο τελευτάς. Οὐϊκτωρῖνος γάρ, καὶ Οὐΐκτωρ, καὶ Νικηφόρος, ἐν ὅλµῳ βληθέντες, ἀπέδωκαν τὰς ψυχάς. Ὁ δὲ Κλαύδιος, τµηθεὶς χεῖρας καὶ πόδας τοῦ βίου µετέστη. Ὁ δὲ Διόδωρος τὸ διὰ πυρὸς ἐδέξατο τέλος. Σαραπῖνος δὲ τὴν κεφαλὴν ἀπετµήθη. Ὁ δὲ Παπίας καταποντισθεὶς διήνυσε τὸ µαρτύριον.
ltx/gr_gr_cog/sy.m01.d31:syMA.commemoration02.text	Τῇ αὐτῇ ἡμέρᾳ, μνήμη τῶν Ἁγίων Μαρτύρων, Οὐϊκτωρίνου, Οὐΐκτωρος, Νικηφόρου, Κλαυδίου, Διοδώρου, Σαραπίνου, καὶ Παπία τῶν ἐν Κορίνθῳ.
ltx/gr_gr_cog/sy.m01.d31:syMA.commemoration03.couplet1.title	@ltx/gr_gr_cog/titles:ti.Verses
ltx/gr_gr_cog/sy.m01.d31:syMA.commemoration03.couplet1.verse1	Ταῦρος Τρύφαινα σοῦ τρυφᾷ τὸ σαρκίον,
ltx/gr_gr_cog/sy.m01.d31:syMA.commemoration03.couplet1.verse2	Καὶ πρὸς τρυφὰς πέμπει σε τὰς ἀκηράτους.
ltx/gr_gr_cog/sy.m01.d31:syMA.commemoration03.narration.p01	Αὕτη ἦν ἐκ πόλεως Κυζίκου, τῆς ἐν τῷ Ἑλλησπόντῳ κειµένης, θυγάτηρ Ἀναστασίου τινὸς Συγκλητικοῦ, καὶ µητρὸς Σωκρατίας Χριστιανῆς. Κατέστη δὲ εἰς τὸ Μαρτύριον, οὐχ ὑφʼ ἑτέρων ἀχθεῖσα, ἀλλʼ αὐτὴ ἑαυτὴν προσενέγκασα. Διεχλεύαζε γὰρ τὰ αἰσχρὰ καὶ διέσυρεν οἷς τοὺς θεοὺς αὐτῶν οἱ ἄφρονες τιµῶντες ᾤοντο, καὶ ἀποστῆναι τῶν µαταίων ἐδίδασκε, καὶ ἐπιστροφὴν ἐκ Θεοῦ πεµφθῆναι ἐπηύχετο. Ὅθεν, προστάξαντος Καισαρίου Ἡγεµόνος, ἐν καµίνῳ ἐµβάλλεται. Ῥυσθεῖσα δὲ παραδόξως ἐκεῖθεν, ἐπὶ µετεώρου κρεµᾶται· καὶ ἀποῤῥιφθεῖσα, τοῖς ὑποκειµένοις ἥλοις ἐµπείρεται. Εἶτα θηρίοις ἀφίεται· καὶ τὰ µὲν ἄλλα τῶν θηρίων ταύτης οὐχ ἥψαντο· εἷς δὲ ὕστερον πελάσας ταῦρος, καὶ διακερατίσας, διέσχισε ταύτην, ἔνθα προσέβαλε. Λέγεται δέ, ἐνῷ τὸ αἷµα αὐτῆς ἐῤῥύη, προελθεῖν πηγὴν ὕδατος διειδοῦς· ἐξ οὗ αἱ µετὰ τὸ τεκεῖν ἀποροῦσαι γάλακτος, εἴτε ἄνθρωποι εἶεν, εἴτε κτήνη, ἀρυόµεναι καὶ µετέχουσαι, εὐθὺς τοῖς νεογνοῖς τὸ γάλα προχέουσι.
ltx/gr_gr_cog/sy.m01.d31:syMA.commemoration03.text	Τῇ αὐτῇ ἡμέρᾳ, μνήμη τῆς Ἁγίας Μάρτυρος Τρυφαίνης.
ltx/gr_gr_cog/sy.m01.d31:syMA.commemoration04.couplet1.title	@ltx/gr_gr_cog/titles:ti.Verses
ltx/gr_gr_cog/sy.m01.d31:syMA.commemoration04.couplet1.verse1	Οὐ πῦρ φλέγει σε Ἠλία στεφηφόρε,
ltx/gr_gr_cog/sy.m01.d31:syMA.commemoration04.couplet1.verse2	Ἔνδον γὰρ εἶχε, πῦρ Θεοῦ τῆς ἀγάπης.
ltx/gr_gr_cog/sy.m01.d31:syMA.commemoration04.text	Ὁ Ἅγιος Νέος Ὁσιομάρτυς Ἠλίας ὁ Ἀρδούνης, ὁ ἐν Καλαμάτᾳ τῆς Πελοποννήσου μαρτυρήσας ἐν ἔτει ᾳχπςʹ (1686), πυρὶ τελειοῦται.
ltx/gr_gr_cog/sy.m01.d31:syMA.lastline	Ταῖς αὐτῶν ἁγίαις πρεσβείαις, ὁ Θεὸς ἐλέησον ἡμᾶς. Ἀμήν.
