ltx/gr_gr_cog/le.ep.me.m09.d13:lemeLI.Epistle.book_abbr	@ltx/gr_gr_cog/bible:Hebrews.abbr
ltx/gr_gr_cog/le.ep.me.m09.d13:lemeLI.Epistle.book_string	@ltx/gr_gr_cog/bible:Hebrews.text
ltx/gr_gr_cog/le.ep.me.m09.d13:lemeLI.Epistle.chapverse	3:1 – 4
ltx/gr_gr_cog/le.ep.me.m09.d13:lemeLI.Epistle.incipit	Ἀδελφοί ἅγιοι, κλήσεως ἐπουρανίου μέτοχοι…
ltx/gr_gr_cog/le.ep.me.m09.d13:lemeLI.Epistle.text	Ἀδελφοὶ ἅγιοι, κλήσεως ἐπουρανίου μέτοχοι, κατανοήσατε τὸν ἀπόστολον καὶ ἀρχιερέα τῆς ὁμολογίας ἡμῶν Ἰησοῦν Χριστόν, πιστὸν ὄντα τῷ ποιήσαντι αὐτόν, ὡς καὶ Μωϋσῆς ἐν ὅλῳ τῷ οἴκῳ αὐτοῦ. πλείονος γὰρ δόξης οὗτος παρὰ Μωϋσῆν ἠξίωται, καθ᾽ ὅσον πλείονα τιμὴν ἔχει τοῦ οἴκου ὁ κατασκευάσας αὐτόν. πᾶς γὰρ οἶκος κατασκευάζεται ὑπό τινος, ὁ δὲ τὰ πάντα κατασκευάσας Θεός.
ltx/gr_gr_cog/le.ep.me.m09.d13:lemeLI.Epistle.title	Τῶν Ἐγκαινίων
ltx/gr_gr_cog/le.ep.me.m09.d13:lemeLI.Epistle.title_abbr	Τῶν Ἐγκαινίων
ltx/gr_gr_cog/le.ep.me.m09.d13:lemeLI.Epistle.version	@ltx/gr_gr_cog/properties:version.designation
