ltx/gr_gr_cog/le.go.me.m06.d24:lemeLI.Gospel.book_abbr	@ltx/gr_gr_cog/bible:Luke.abbr
ltx/gr_gr_cog/le.go.me.m06.d24:lemeLI.Gospel.book_string	@ltx/gr_gr_cog/bible:Luke.text
ltx/gr_gr_cog/le.go.me.m06.d24:lemeLI.Gospel.chapverse	1:1 – 25, 57 – 68, 76 – 80
ltx/gr_gr_cog/le.go.me.m06.d24:lemeLI.Gospel.incipit	Ἐπειδήπερ πολλοὶ ἐπεχείρησαν…
ltx/gr_gr_cog/le.go.me.m06.d24:lemeLI.Gospel.text	Ἐπειδήπερ πολλοὶ ἐπεχείρησαν ἀνατάξασθαι διήγησιν περὶ τῶν πεπληροφορημένων ἐν ἡμῖν πραγμάτων καθὼς παρέδοσαν ἡμῖν οἱ ἀπ᾿ ἀρχῆς αὐτόπται καὶ ὑπηρέται γενόμενοι τοῦ λόγου, ἔδοξε κἀμοί, παρηκολουθηκότι ἄνωθεν πᾶσιν ἀκριβῶς, καθεξῆς σοι γράψαι, κράτιστε Θεόφιλε, ἵνα ἐπιγνῷς περὶ ὧν κατηχήθης λόγων τὴν ἀσφάλειαν. Ἐγένετο ἐν ταῖς ἡμέραις Ἡρῴδου τοῦ βασιλέως τῆς Ἰουδαίας ἱερεύς τις ὀνόματι Ζαχαρίας ἐξ ἐφημερίας Ἀβιά, καὶ ἡ γυνὴ αὐτοῦ ἐκ τῶν θυγατέρων Ἀαρών, καὶ τὸ ὄνομα αὐτῆς Ἐλισάβετ. ἦσαν δὲ δίκαιοι ἀμφότεροι ἐνώπιον τοῦ Θεοῦ, πορευόμενοι ἐν πάσαις ταῖς ἐντολαῖς καὶ δικαιώμασι τοῦ Κυρίου ἄμεμπτοι. καὶ οὐκ ἦν αὐτοῖς τέκνον, καθότι ἡ Ἐλισάβετ ἦν στεῖρα, καὶ ἀμφότεροι προβεβηκότες ἐν ταῖς ἡμέραις αὐτῶν ἦσαν. Ἐγένετο δὲ ἐν τῷ ἱερατεύειν αὐτὸν ἐν τῇ τάξει τῆς ἐφημερίας αὐτοῦ ἔναντι τοῦ Θεοῦ, κατὰ τὸ ἔθος τῆς ἱερατείας ἔλαχε τοῦ θυμιᾶσαι εἰσελθὼν εἰς τὸν ναὸν τοῦ Κυρίου· καὶ πᾶν τὸ πλῆθος ἦν τοῦ λαοῦ προσευχόμενον ἔξω τῇ ὥρᾳ τοῦ θυμιάματος. ὤφθη δὲ αὐτῷ ἄγγελος Κυρίου ἑστὼς ἐκ δεξιῶν τοῦ θυσιαστηρίου τοῦ θυμιάματος. καὶ ἐταράχθη Ζαχαρίας ἰδών, καὶ φόβος ἐπέπεσεν ἐπ᾿ αὐτόν. εἶπε δὲ πρὸς αὐτὸν ὁ ἄγγελος· μὴ φοβοῦ, Ζαχαρία· διότι εἰσηκούσθη ἡ δέησίς σου, καὶ ἡ γυνή σου Ἐλισάβετ γεννήσει υἱόν σοι, καὶ καλέσεις τὸ ὄνομα αὐτοῦ Ἰωάννην· καὶ ἔσται χαρά σοι καὶ ἀγαλλίασις, καὶ πολλοὶ ἐπὶ τῇ γεννήσει αὐτοῦ χαρήσονται. ἔσται γὰρ μέγας ἐνώπιον τοῦ Κυρίου, καὶ οἶνον καὶ σίκερα οὐ μὴ πίῃ καὶ Πνεύματος Ἁγίου πλησθήσεται ἔτι ἐκ κοιλίας μητρὸς αὐτοῦ, καὶ πολλοὺς τῶν υἱῶν Ἰσραὴλ ἐπιστρέψει ἐπὶ Κύριον τὸν Θεὸν αὐτῶν· καὶ αὐτὸς προελεύσεται ἐνώπιον αὐτοῦ ἐν πνεύματι καὶ δυνάμει Ἠλιού, ἐπιστρέψαι καρδίας πατέρων ἐπὶ τέκνα καὶ ἀπειθεῖς ἐν φρονήσει δικαίων, ἑτοιμάσαι Κυρίῳ λαὸν κατεσκευασμένον. καὶ εἶπε Ζαχαρίας πρὸς τὸν ἄγγελον· κατὰ τί γνώσομαι τοῦτο; ἐγὼ γάρ εἰμι πρεσβύτης καὶ ἡ γυνή μου προβεβηκυῖα ἐν ταῖς ἡμέραις αὐτῆς. καὶ ἀποκριθεὶς ὁ ἄγγελος εἶπεν αὐτῷ· ἐγώ εἰμι Γαβριὴλ ὁ παρεστηκὼς ἐνώπιον τοῦ Θεοῦ, καὶ ἀπεστάλην λαλῆσαι πρός σε καὶ εὐαγγελίσασθαί σοι ταῦτα. καὶ ἰδοὺ ἔσῃ σιωπῶν καὶ μὴ δυνάμενος λαλῆσαι ἄχρι ἧς ἡμέρας γένηται ταῦτα, ἀνθ᾿ ὧν οὐκ ἐπίστευσας τοῖς λόγοις μου, οἵτινες πληρωθήσονται εἰς τὸν καιρὸν αὐτῶν. καὶ ἦν ὁ λαὸς προσδοκῶν τὸν Ζαχαρίαν, καὶ ἐθαύμαζον ἐν τῷ χρονίζειν αὐτὸν ἐν τῷ ναῷ. ἐξελθὼν δὲ οὐκ ἠδύνατο λαλῆσαι αὐτοῖς, καὶ ἐπέγνωσαν ὅτι ὀπτασίαν ἑώρακεν ἐν τῷ ναῷ· καὶ αὐτὸς ἦν διανεύων αὐτοῖς, καὶ διέμενε κωφός. καὶ ἐγένετο ὡς ἐπλήσθησαν αἱ ἡμέραι τῆς λειτουργίας αὐτοῦ, ἀπῆλθεν εἰς τὸν οἶκον αὐτοῦ. Μετὰ δὲ ταύτας τὰς ἡμέρας συνέλαβεν Ἐλισάβετ ἡ γυνὴ αὐτοῦ, καὶ περιέκρυβεν ἑαυτὴν μῆνας πέντε, λέγουσα ὅτι οὕτω μοι πεποίηκεν ὁ Κύριος ἐν ἡμέραις αἷς ἐπεῖδεν ἀφελεῖν τὸ ὄνειδός μου ἐν ἀνθρώποις. Τῇ Ἐλισάβετ ἐπλήσθη ὁ χρόνος τοῦ τεκεῖν αὐτήν, καὶ ἐγέννησεν υἱόν. καὶ ἤκουσαν οἱ περίοικοι καὶ οἱ συγγενεῖς αὐτῆς ὅτι ἐμεγάλυνε Κύριος τὸ ἔλεος αὐτοῦ μετ᾿ αὐτῆς, καὶ συνέχαιρον αὐτῇ. Καὶ ἐγένετο ἐν τῇ ὀγδόῃ ἡμέρᾳ ἦλθον περιτεμεῖν τὸ παιδίον, καὶ ἐκάλουν αὐτὸ ἐπὶ τῷ ὀνόματι τοῦ πατρὸς αὐτοῦ Ζαχαρίαν. καὶ ἀποκριθεῖσα ἡ μήτηρ αὐτοῦ εἶπεν· οὐχί, ἀλλὰ κληθήσεται Ἰωάννης. καὶ εἶπον πρὸς αὐτὴν ὅτι οὐδείς ἐστιν ἐν τῇ συγγενείᾳ σου ὃς καλεῖται τῷ ὀνόματι τούτῳ· ἐνένευον δὲ τῷ πατρὶ αὐτοῦ τὸ τί ἂν θέλοι καλεῖσθαι αὐτόν. καὶ αἰτήσας πινακίδιον ἔγραψε λέγων· Ἰωάννης ἐστὶ τὸ ὄνομα αὐτοῦ· καὶ ἐθαύμασαν πάντες. ἀνεῴχθη δὲ τὸ στόμα αὐτοῦ παραχρῆμα καὶ ἡ γλῶσσα αὐτοῦ, καὶ ἐλάλει εὐλογῶν τὸν Θεόν. καὶ ἐγένετο ἐπὶ πάντας φόβος τοὺς περιοικοῦντας αὐτούς, καὶ ἐν ὅλῃ τῇ ὀρεινῇ τῆς Ἰουδαίας διελαλεῖτο πάντα τὰ ῥήματα ταῦτα, καὶ ἔθεντο πάντες οἱ ἀκούσαντες ἐν τῇ καρδίᾳ αὐτῶν λέγοντες· τί ἄρα τὸ παιδίον τοῦτο ἔσται; καὶ χεὶρ Κυρίου ἦν μετ᾿ αὐτοῦ. Καὶ Ζαχαρίας ὁ πατὴρ αὐτοῦ ἐπλήσθη Πνεύματος Ἁγίου καὶ προεφήτευσε λέγων· Εὐλογητὸς Κύριος, ὁ Θεὸς τοῦ Ἰσραήλ, ὅτι ἐπεσκέψατο καὶ ἐποίησε λύτρωσιν τῷ λαῷ αὐτοῦ. Καὶ σύ, παιδίον, προφήτης ὑψίστου κληθήσῃ· προπορεύσῃ γὰρ πρὸ προσώπου Κυρίου ἑτοιμάσαι ὁδοὺς αὐτοῦ, τοῦ δοῦναι γνῶσιν σωτηρίας τῷ λαῷ αὐτοῦ, ἐν ἀφέσει ἁμαρτιῶν αὐτῶν διὰ σπλάγχνα ἐλέους Θεοῦ ἡμῶν, ἐν οἷς ἐπεσκέψατο ἡμᾶς ἀνατολὴ ἐξ ὕψους ἐπιφᾶναι τοῖς ἐν σκότει καὶ σκιᾷ θανάτου καθημένοις, τοῦ κατευθῦναι τοὺς πόδας ἡμῶν εἰς ὁδὸν εἰρήνης. Τὸ δὲ παιδίον ηὔξανε καὶ ἐκραταιοῦτο πνεύματι, καὶ ἦν ἐν ταῖς ἐρήμοις ἕως ἡμέρας ἀναδείξεως αὐτοῦ πρὸς τὸν Ἰσραήλ.
ltx/gr_gr_cog/le.go.me.m06.d24:lemeLI.Gospel.title	Τοῦ Προδρόμου
ltx/gr_gr_cog/le.go.me.m06.d24:lemeLI.Gospel.title_abbr	Τοῦ Προδρόμου
ltx/gr_gr_cog/le.go.me.m06.d24:lemeLI.Gospel.version	@ltx/gr_gr_cog/properties:version.designation
ltx/gr_gr_cog/le.go.me.m06.d24:lemeMA.Gospel.book_abbr	@ltx/gr_gr_cog/bible:Luke.abbr
ltx/gr_gr_cog/le.go.me.m06.d24:lemeMA.Gospel.book_string	@ltx/gr_gr_cog/bible:Luke.text
ltx/gr_gr_cog/le.go.me.m06.d24:lemeMA.Gospel.chapverse	1:24 – 25, 57 – 68, 76, 80
ltx/gr_gr_cog/le.go.me.m06.d24:lemeMA.Gospel.incipit	Συνέλαβεν Ἐλισάβετ ἡ γυνὴ Ζαχαρίου…
ltx/gr_gr_cog/le.go.me.m06.d24:lemeMA.Gospel.text	Τῷ καιρῷ ἐκείνῳ, συνέλαβεν Ἐλισάβετ ἡ γυνὴ Ζαχαρίου, καὶ περιέκρυβεν ἑαυτὴν μῆνας πέντε, λέγουσα ὅτι οὕτω μοι πεποίηκεν ὁ Κύριος ἐν ἡμέραις αἷς ἐπεῖδεν ἀφελεῖν τὸ ὄνειδός μου ἐν ἀνθρώποις. Τῇ Ἐλισάβετ ἐπλήσθη ὁ χρόνος τοῦ τεκεῖν αὐτήν, καὶ ἐγέννησεν υἱόν. καὶ ἤκουσαν οἱ περίοικοι καὶ οἱ συγγενεῖς αὐτῆς ὅτι ἐμεγάλυνε Κύριος τὸ ἔλεος αὐτοῦ μετ᾿ αὐτῆς, καὶ συνέχαιρον αὐτῇ. Καὶ ἐγένετο ἐν τῇ ὀγδόῃ ἡμέρᾳ ἦλθον περιτεμεῖν τὸ παιδίον, καὶ ἐκάλουν αὐτὸ ἐπὶ τῷ ὀνόματι τοῦ πατρὸς αὐτοῦ Ζαχαρίαν. καὶ ἀποκριθεῖσα ἡ μήτηρ αὐτοῦ εἶπεν· οὐχί, ἀλλὰ κληθήσεται Ἰωάννης. καὶ εἶπον πρὸς αὐτὴν ὅτι οὐδείς ἐστιν ἐν τῇ συγγενείᾳ σου ὃς καλεῖται τῷ ὀνόματι τούτῳ· ἐνένευον δὲ τῷ πατρὶ αὐτοῦ τὸ τί ἂν θέλοι καλεῖσθαι αὐτόν. καὶ αἰτήσας πινακίδιον ἔγραψε λέγων· Ἰωάννης ἐστὶ τὸ ὄνομα αὐτοῦ· καὶ ἐθαύμασαν πάντες. ἀνεῴχθη δὲ τὸ στόμα αὐτοῦ παραχρῆμα καὶ ἡ γλῶσσα αὐτοῦ, καὶ ἐλάλει εὐλογῶν τὸν Θεόν. καὶ ἐγένετο ἐπὶ πάντας φόβος τοὺς περιοικοῦντας αὐτούς, καὶ ἐν ὅλῃ τῇ ὀρεινῇ τῆς Ἰουδαίας διελαλεῖτο πάντα τὰ ῥήματα ταῦτα, καὶ ἔθεντο πάντες οἱ ἀκούσαντες ἐν τῇ καρδίᾳ αὐτῶν λέγοντες· τί ἄρα τὸ παιδίον τοῦτο ἔσται; καὶ χεὶρ Κυρίου ἦν μετ᾿ αὐτοῦ. Καὶ Ζαχαρίας ὁ πατὴρ αὐτοῦ ἐπλήσθη Πνεύματος Ἁγίου καὶ προεφήτευσε λέγων· Εὐλογητὸς Κύριος, ὁ Θεὸς τοῦ Ἰσραήλ, ὅτι ἐπεσκέψατο καὶ ἐποίησε λύτρωσιν τῷ λαῷ αὐτοῦ. Καὶ σύ, παιδίον, προφήτης ὑψίστου κληθήσῃ· προπορεύσῃ γὰρ πρὸ προσώπου Κυρίου ἑτοιμάσαι ὁδοὺς αὐτοῦ. Τὸ δὲ παιδίον ηὔξανε καὶ ἐκραταιοῦτο πνεύματι, καὶ ἦν ἐν ταῖς ἐρήμοις ἕως ἡμέρας ἀναδείξεως αὐτοῦ πρὸς τὸν Ἰσραήλ.
ltx/gr_gr_cog/le.go.me.m06.d24:lemeMA.Gospel.title	Τοῦ Προδρόμου
ltx/gr_gr_cog/le.go.me.m06.d24:lemeMA.Gospel.title_abbr	Τοῦ Προδρόμου
ltx/gr_gr_cog/le.go.me.m06.d24:lemeMA.Gospel.version	@ltx/gr_gr_cog/properties:version.designation
