ltx/gr_gr_cog/sy.m01.d18:cl.syMA.commemoration01.narration.p01	
ltx/gr_gr_cog/sy.m01.d18:cl.syMA.commemoration01.narration.p02	
ltx/gr_gr_cog/sy.m01.d18:cl.syMA.commemoration01.narration.p03	
ltx/gr_gr_cog/sy.m01.d18:cl.syMA.commemoration01.narration.p04	
ltx/gr_gr_cog/sy.m01.d18:cl.syMA.commemoration01.narration.p05	
ltx/gr_gr_cog/sy.m01.d18:cl.syMA.commemoration01.narration.p06	
ltx/gr_gr_cog/sy.m01.d18:cl.syMA.commemoration01.narration.p07	
ltx/gr_gr_cog/sy.m01.d18:cl.syMA.commemoration01.text	[saint/com 1]
ltx/gr_gr_cog/sy.m01.d18:cl.syMA.commemoration02.narration.p01	
ltx/gr_gr_cog/sy.m01.d18:cl.syMA.commemoration02.narration.p02	
ltx/gr_gr_cog/sy.m01.d18:cl.syMA.commemoration02.narration.p03	
ltx/gr_gr_cog/sy.m01.d18:cl.syMA.commemoration02.narration.p04	
ltx/gr_gr_cog/sy.m01.d18:cl.syMA.commemoration02.narration.p05	
ltx/gr_gr_cog/sy.m01.d18:cl.syMA.commemoration02.narration.p06	
ltx/gr_gr_cog/sy.m01.d18:cl.syMA.commemoration02.narration.p07	
ltx/gr_gr_cog/sy.m01.d18:cl.syMA.commemoration02.text	[saint/com 2]
ltx/gr_gr_cog/sy.m01.d18:cl.syMA.commemoration03.narration.p01	
ltx/gr_gr_cog/sy.m01.d18:cl.syMA.commemoration03.narration.p02	
ltx/gr_gr_cog/sy.m01.d18:cl.syMA.commemoration03.narration.p03	
ltx/gr_gr_cog/sy.m01.d18:cl.syMA.commemoration03.narration.p04	
ltx/gr_gr_cog/sy.m01.d18:cl.syMA.commemoration03.narration.p05	
ltx/gr_gr_cog/sy.m01.d18:cl.syMA.commemoration03.narration.p06	
ltx/gr_gr_cog/sy.m01.d18:cl.syMA.commemoration03.narration.p07	
ltx/gr_gr_cog/sy.m01.d18:cl.syMA.commemoration03.text	[saint/com 3]
ltx/gr_gr_cog/sy.m01.d18:cl.syMA.commemoration04.narration.p01	
ltx/gr_gr_cog/sy.m01.d18:cl.syMA.commemoration04.narration.p02	
ltx/gr_gr_cog/sy.m01.d18:cl.syMA.commemoration04.narration.p03	
ltx/gr_gr_cog/sy.m01.d18:cl.syMA.commemoration04.narration.p04	
ltx/gr_gr_cog/sy.m01.d18:cl.syMA.commemoration04.narration.p05	
ltx/gr_gr_cog/sy.m01.d18:cl.syMA.commemoration04.narration.p06	
ltx/gr_gr_cog/sy.m01.d18:cl.syMA.commemoration04.narration.p07	
ltx/gr_gr_cog/sy.m01.d18:cl.syMA.commemoration04.text	[saint/com 4]
ltx/gr_gr_cog/sy.m01.d18:cl.syMA.commemoration05.narration.p01	
ltx/gr_gr_cog/sy.m01.d18:cl.syMA.commemoration05.narration.p02	
ltx/gr_gr_cog/sy.m01.d18:cl.syMA.commemoration05.narration.p03	
ltx/gr_gr_cog/sy.m01.d18:cl.syMA.commemoration05.narration.p04	
ltx/gr_gr_cog/sy.m01.d18:cl.syMA.commemoration05.narration.p05	
ltx/gr_gr_cog/sy.m01.d18:cl.syMA.commemoration05.narration.p06	
ltx/gr_gr_cog/sy.m01.d18:cl.syMA.commemoration05.narration.p07	
ltx/gr_gr_cog/sy.m01.d18:cl.syMA.commemoration05.text	[saint/com 5]
ltx/gr_gr_cog/sy.m01.d18:cl.syMA.commemoration06.text	[saint/com list]
ltx/gr_gr_cog/sy.m01.d18:syMA.commemoration01.couplet1.title	@ltx/gr_gr_cog/titles:ti.Verses
ltx/gr_gr_cog/sy.m01.d18:syMA.commemoration01.couplet1.verse1	Ἀθανάσιον καὶ θανόντα ζῆν λέγω.
ltx/gr_gr_cog/sy.m01.d18:syMA.commemoration01.couplet1.verse2	Οἱ γὰρ δίκαιοι ζῶσι καὶ τεθνηκότες.
ltx/gr_gr_cog/sy.m01.d18:syMA.commemoration01.couplet2.verse1	Φυγῆς Κυρίλλου σήμερον μνήμην ἄγει,
ltx/gr_gr_cog/sy.m01.d18:syMA.commemoration01.couplet2.verse2	Ἀλλʼ οὐ τελευτῆς τῆς ἀειμνήστου κτίσις.
ltx/gr_gr_cog/sy.m01.d18:syMA.commemoration01.narration.p01	Τούτων ὁ µὲν Ἅγιος Ἀθανάσιος ἦν ἐπὶ τοῦ µεγάλου Βασιλέως Κωνσταντίνου· καὶ ἐν τῇ κατὰ Νίκαιαν Πρώτῃ Συνόδῳ, µήπω τεταγµένος ἐν Ἐπισκόποις, λόγοις σοφίας καὶ γραφικαῖς ἀποδείξεσι τὸν Ἄρειον κατῄσχυνε. Μετὰ δὲ τὴν τελευτὴν Ἀλεξάνδρου, Ἀρχιεπίσκοπος Ἀλεξανδρείας καταστάς, παρὰ Κωνσταντίου ἐν διαφόροις ὑπερορίαις ἐλαύνεται· καὶ ἐπὶ δύω καὶ τεσσαράκοντα χρόνοις τοῖς διωγµοῖς ἐναθλήσας, πρὸς Κύριον ἐκδηµεῖ.
ltx/gr_gr_cog/sy.m01.d18:syMA.commemoration01.narration.p02	Ὁ δὲ Ἅγιος Κύριλλος ἦν ἐπὶ τῆς Βασιλείας Θεοδοσίου τοῦ µικροῦ, ἀδελφιδοῦς γεγονὼς Θεοφίλου, Ἀρχιεπισκόπου Ἀλεξανδρείας, καὶ τοῦ θρόνου αὐτοῦ διάδοχος. Γέγονε δὲ προστάτης τῆς ἐν Ἐφέσῳ Ἁγίας Συνόδου, τῆς τρίτης, καὶ τὸν δυσσεβῆ καθεῖλε Νεστόριον, βλάσφηµα πολλὰ κατὰ τῆς Ἁγίας Δεσποίνης ἡµῶν Θεοτόκου δογµατίσαντα. Ἐν πολλοῖς οὖν κατορθώµασι διαλάµψας, πρὸς Κύριον ἐξεδήµησεν.
ltx/gr_gr_cog/sy.m01.d18:syMA.commemoration01.narration.p03	Ὑπῆρχον δὲ κατὰ τὴν ἰδέαν τοῦ σώµατος, ὁ µὲν Ἅγιος Ἀθανάσιος µέτριος τὴν ἡλικίαν, ἡρέµα πλατύς, ἔγκυφος, χαρίεις τὸ πρόσωπον, εὔχρους, ἀναφαλαντίας, τὴν ῥῖνα ἐπίγρυπος, γενείῳ οὐκ ἐπιµήκει, ἐπιπλάτει δὲ τὰς σιαγόνας πυκάζων, καὶ στόµατι βραχεῖ ἐντετµηµένος· οὐ πολιὸς ἄγαν, οὐκ ἀκραιφνεῖ τῷ λευκῷ, ἀλλʼ ὑποξανθίζοντι κεχρῃµένος.
ltx/gr_gr_cog/sy.m01.d18:syMA.commemoration01.narration.p04	Ὁ δὲ Ἅγιος Κύριλλος βραχύ τι πρὸς τὸ εὐχρούστερον τὴν πρόσοψιν ἀπονενευκώς· ὀφρύσι δασείαις τε καὶ µεγάλαις, εἰς ἁψῖδας κυκλουµέναις, ὑπογράφων τὸ µέτωπον· ἐπίῤῤιν τὸ τῶν µυκτήρων διάφραγµα φέρων προσπεπτωκός· ἐντεταµένος τὰς παρειὰς χείλεσι παχυτέροις· τὸ στόµα διεσταλµένος· φαλακρὸς ἐπὶ µετώπῳ βραχεῖ, δασεῖ καὶ ἐπιµήκει τῷ πώγωνι σεµνυνόµενος· οὖλος, ἑκατέραν τὴν τρίχωσιν ὑπόξανθος, µιξοπόλιος. Τελεῖται δὲ ἡ αὐτῶν Σύναξις ἐν τῇ ἁγιωτάτῃ µεγάλῃ Ἐκκλησίᾳ.
ltx/gr_gr_cog/sy.m01.d18:syMA.commemoration01.single1	Τάρχυσαν ὀγδοάτῃ δεκάτῃ νέκυν Ἀθανασίου.
ltx/gr_gr_cog/sy.m01.d18:syMA.commemoration01.text	Τῇ ΙΗʹ τοῦ αὐτοῦ μηνός, μνήμη τῶν ἐν Ἁγίοις Πατέρων ἡμῶν, Ἀθανασίου καὶ Κυρίλλου, Πατριαρχῶν Ἀλεξανδρείας.
ltx/gr_gr_cog/sy.m01.d18:syMA.commemoration02.couplet1.title	@ltx/gr_gr_cog/titles:ti.Verses
ltx/gr_gr_cog/sy.m01.d18:syMA.commemoration02.couplet1.verse1	Τὴν θεοδούλην ἐκ ξίφους τεθνηκέναι,
ltx/gr_gr_cog/sy.m01.d18:syMA.commemoration02.couplet1.verse2	Δοῦλοι Θεῶν κρίνουσι τῶν ψευδωνύμων.
ltx/gr_gr_cog/sy.m01.d18:syMA.commemoration02.narration.p01	Αὕτη ὑπῆρχεν ἐκ τῆς Ἀναζαρβέων πόλεως, ἐπὶ τῆς βασιλείας Διοκλητιανοῦ· διὰ δὲ τὴν εἰς Χριστὸν ὁµολογίαν παρέστη τῷ Ἄρχοντι Πελαγίῳ· καὶ ἰσχυρῶς βασανιζοµένη, ἐθαυµατούργησε, καὶ πολλοὺς ἐπεσπάσατο πρὸς τὴν εἰς Χριστὸν πίστιν, ἐξ ὧν ἦσαν ὁ Κοµενταρήσιος, καὶ ὁ βοηθὸς Ἑλλάδιος· οἳ καὶ τὰς κεφαλὰς ἀπετµήθησαν. Ἡ δὲ Ἁγία ὑπὸ σουβλίων πυρωθέντων διετρυπήθη τοὺς µαστούς· εἶτα ἀπὸ τῶν τριχῶν ἐκρεµάσθη ἐν Κυπαρίσσῳ, καὶ τοὺς πόδας µεθʼ ἥλων σιδηρῶν καθηλώθη· καὶ µετὰ ταῦτα εἰς κάµινον πυρὸς µετὰ καὶ ἑτέρων Ἁγίων ἐµβληθεῖσα, καὶ ἐπὶ πολὺ προσευξαµένη, καὶ τὰς χεῖρας ἐκτείνασα, καὶ εὐχαριστοῦσα, παρέδωκε τὸ πνεῦµα.
ltx/gr_gr_cog/sy.m01.d18:syMA.commemoration02.text	Τῇ αὐτῇ ἡμέρᾳ, μνήμη τῆς Ἁγίας Μάρτυρος Θεοδούλης.
ltx/gr_gr_cog/sy.m01.d18:syMA.commemoration03.couplet1.title	@ltx/gr_gr_cog/titles:ti.Verses
ltx/gr_gr_cog/sy.m01.d18:syMA.commemoration03.couplet1.verse1	Ὁ Χριστὸς ἦλθεν πῦρ βαλεῖν εἰς τὴν γῆν πάλαι,
ltx/gr_gr_cog/sy.m01.d18:syMA.commemoration03.couplet1.verse2	Ξένη τρέφουσα καρτερεῖ τὸ πῦρ ξένως.
ltx/gr_gr_cog/sy.m01.d18:syMA.commemoration03.text	Τῇ αὐτῇ ἡμέρᾳ, ἡ Ἁγία Μάρτυς Ξένη πυρὶ τελειοῦται.
ltx/gr_gr_cog/sy.m01.d18:syMA.lastline	Ταῖς αὐτῶν ἁγίαις πρεσβείαις, ὁ Θεός, ἐλέησον ἡμᾶς. Ἀμήν.
