ltx/gr_gr_cog/le.go.me.m02.d24:lemeLI.Gospel.book_abbr	@ltx/gr_gr_cog/le.go.mc.d142:lemcLI.Gospel.book_abbr
ltx/gr_gr_cog/le.go.me.m02.d24:lemeLI.Gospel.book_string	@ltx/gr_gr_cog/le.go.mc.d142:lemcLI.Gospel.book_string
ltx/gr_gr_cog/le.go.me.m02.d24:lemeLI.Gospel.chapverse	@ltx/gr_gr_cog/le.go.mc.d142:lemcLI.Gospel.chapverse
ltx/gr_gr_cog/le.go.me.m02.d24:lemeLI.Gospel.incipit	@ltx/gr_gr_cog/le.go.mc.d142:lemcLI.Gospel.incipit
ltx/gr_gr_cog/le.go.me.m02.d24:lemeLI.Gospel.text	@ltx/gr_gr_cog/le.go.mc.d142:lemcLI.Gospel.text
ltx/gr_gr_cog/le.go.me.m02.d24:lemeLI.Gospel.title	Τοῦ Προδρόμου
ltx/gr_gr_cog/le.go.me.m02.d24:lemeLI.Gospel.title_abbr	Τοῦ Προδρόμου
ltx/gr_gr_cog/le.go.me.m02.d24:lemeLI.Gospel.version	@ltx/gr_gr_cog/properties:version.designation
ltx/gr_gr_cog/le.go.me.m02.d24:lemeMA.Gospel.book_abbr	@ltx/gr_gr_cog/le.go.lu.d018:leluLI.Gospel.book_abbr
ltx/gr_gr_cog/le.go.me.m02.d24:lemeMA.Gospel.book_string	@ltx/gr_gr_cog/le.go.lu.d018:leluLI.Gospel.book_string
ltx/gr_gr_cog/le.go.me.m02.d24:lemeMA.Gospel.chapverse	@ltx/gr_gr_cog/le.go.lu.d018:leluLI.Gospel.chapverse
ltx/gr_gr_cog/le.go.me.m02.d24:lemeMA.Gospel.incipit	@ltx/gr_gr_cog/le.go.lu.d018:leluLI.Gospel.incipit
ltx/gr_gr_cog/le.go.me.m02.d24:lemeMA.Gospel.text	@ltx/gr_gr_cog/le.go.lu.d018:leluLI.Gospel.text
ltx/gr_gr_cog/le.go.me.m02.d24:lemeMA.Gospel.title	Τοῦ Προδρόμου
ltx/gr_gr_cog/le.go.me.m02.d24:lemeMA.Gospel.title_abbr	Τοῦ Προδρόμου
ltx/gr_gr_cog/le.go.me.m02.d24:lemeMA.Gospel.version	@ltx/gr_gr_cog/properties:version.designation
