ltx/gr_gr_cog/le.pr.me.r34:leprVE.reading.book_abbr	@ltx/gr_gr_cog/bible:Isaiah.abbr
ltx/gr_gr_cog/le.pr.me.r34:leprVE.reading.book_string	@ltx/gr_gr_cog/bible:Isaiah.text
ltx/gr_gr_cog/le.pr.me.r34:leprVE.reading.chapverse	ιθʹ 1
ltx/gr_gr_cog/le.pr.me.r34:leprVE.reading.incipit	Ἰδοὺ Κύριος καθήσεται ἐπὶ νεφέλης κούφης, καὶ ἥξει εἰς…
ltx/gr_gr_cog/le.pr.me.r34:leprVE.reading.text	Ἰδοὺ Κύριος καθήσεται ἐπὶ νεφέλης κούφης, καὶ ἥξει εἰς Αἴγυπτον, καὶ σεισθήσεται τὰ χειροποίητα Αἰγύπτου ἀπὸ προσώπου αὐτοῦ, καὶ ἡ καρδία αὐτῶν ἡττηθήσεται ἐν αὐτοῖς. Καὶ ταραχθήσεται τὸ πνεῦμα αὐτῶν ἐν αὐτοῖς, καὶ τὴν βουλὴν αὐτῶν διασκεδάσω, καὶ παραδώσω τὴν Αἴγυπτον εἰς χεῖρας κυρίων σκληρῶν, τάδε λέγει Κύριος Σαβαώθ. Καὶ πίονται οἱ Αἰγύπτιοι ὕδωρ τὸ παρὰ θάλασσαν, ὁ δὲ ποταμὸς ἐκλείψει καὶ ξηρανθήσεται. Τάδε λέγει Κύριος· Ποῦ εἰσι νῦν οἱ σοφοί σου; καὶ ἀναγγειλάτωσάν σοι, καὶ εἰπάτωσαν· Τί βεβούλευται Κύριος Σαβαὼθ ἐπʼ Αἴγυπτον τῇ ἡμέρα ἐκείνῃ ἔσονται οἱ Αἰγύπτιοι ὡς γυναῖκες, ἐν φόβῳ καὶ ἐν τρόμῳ ἀπὸ προσώπου τῆς χειρὸς Κυρίου Σαβαώθ, ἣν αὐτὸς ἐπιβαλεῖ αὐτοῖς. Καὶ ἔσται θυσιαστήριον τῷ Κυρίῳ ἐν χώρᾳ Αἰγυπτίων, καὶ στήλη πρὸς τὸ ὅριον αὐτῆς τῷ Κυρίῳ. Καὶ ἔσται εἰς σημεῖον εἰς τὸν αἰῶνα Κυρίῳ ἐν χώρᾳ Αἰγύπτου, ὅτι κεκράξονται πρὸς Κύριον, καὶ ἀποστελεῖ αὐτοῖς ἄνθρωπον, ὃς σώσει αὐτούς. Καὶ γνωστὸς ἔσται Κύριος τοῖς Αἰγυπτίοις, καὶ γνώσονται οἱ Αἰγύπτιοι τὸν Κύριον ἐν τῇ ἡμέρᾳ ἐκείνῃ, καὶ ποιήσουσι θυσίαν καὶ δῶρον, καὶ εὔξονται εὐχὰς τῷ Κυρίῳ, καὶ ἀποδώσουσι.
ltx/gr_gr_cog/le.pr.me.r34:leprVE.reading.title	
ltx/gr_gr_cog/le.pr.me.r34:leprVE.reading.title_abbr	
ltx/gr_gr_cog/le.pr.me.r34:leprVE.reading.version	@ltx/gr_gr_cog/properties:version.designation
