ltx/gr_gr_cog/me.m09.d14:meDA.commemoration.first	Ἡ Ὕψωσις τοῦ Τιμίου Σταυροῦ
ltx/gr_gr_cog/me.m09.d14:meDA.commemoration.first_name	Τίμιος Σταυρός
ltx/gr_gr_cog/me.m09.d14:meDA.commemoration.first_short	Ἡ Ὕψωσις τοῦ Τιμίου Σταυροῦ
ltx/gr_gr_cog/me.m09.d14:meDA.commemoration.first_title	@ltx/gr_gr_cog/titles:ti.Cross
ltx/gr_gr_cog/me.m09.d14:meDA.commemoration.full	Ἡ Παγκόσμιος Ὕψωσις τοῦ Τιμίου καὶ Ζωοποιοῦ Σταυροῦ
ltx/gr_gr_cog/me.m09.d14:meDA.commemoration.second_name	
ltx/gr_gr_cog/me.m09.d14:meDA.commemoration.second_title	
ltx/gr_gr_cog/me.m09.d14:meDA.date	Τῌ ΙΔʹ ΣΕΠΤΕΜΒΡΙΟΥ
ltx/gr_gr_cog/me.m09.d14:meDA.dismissal	@ltx/gr_gr_cog/dismissals:dis00.resurrection
ltx/gr_gr_cog/me.m09.d14:meDA.fordate	διὰ τὴν 14ην Σεπτεμβρίου
ltx/gr_gr_cog/me.m09.d14:meDA.insert1	
ltx/gr_gr_cog/me.m09.d14:meDA.insert2	οὗ καὶ τὴν παγκόσμιον Ὕψωσιν ἑορτάζομεν·
ltx/gr_gr_cog/me.m09.d14:meDA.note	
ltx/gr_gr_cog/me.m09.d14:meDA.pdfcoverdate	τῆς 14ης Σεπτεμβρίου,
ltx/gr_gr_cog/me.m09.d14:meDA.pdfheaderdate	τῆς 14ης Σεπτεμβρίου
ltx/gr_gr_cog/me.m09.d14:meHO.commemorations	
ltx/gr_gr_cog/me.m09.d14:meHO.note1	
ltx/gr_gr_cog/me.m09.d14:meHO.note2	
ltx/gr_gr_cog/me.m09.d14:meHO.number	
ltx/gr_gr_cog/me.m09.d14:meHO.rank	
ltx/gr_gr_cog/me.m09.d14:meLE.commemoration1	Ἡ Παγκόσμιος Ὕψωσις τοῦ Τιμίου καὶ Ζωοποιοῦ Σταυροῦ.
ltx/gr_gr_cog/me.m09.d14:meLE.commemoration2	
ltx/gr_gr_cog/me.m09.d14:meLI.Kontakion1.greekmelody	@ltx/gr_gr_cog/me.m09.d14:meMA.Kontakion1.greekmelody
ltx/gr_gr_cog/me.m09.d14:meLI.Kontakion1.incipit	@ltx/gr_gr_cog/me.m09.d14:meMA.Kontakion1.incipit
ltx/gr_gr_cog/me.m09.d14:meLI.Kontakion1.melody	@ltx/gr_gr_cog/me.m09.d14:meMA.Kontakion1.melody
ltx/gr_gr_cog/me.m09.d14:meLI.Kontakion1.mode	@ltx/gr_gr_cog/me.m09.d14:meMA.Kontakion1.mode
ltx/gr_gr_cog/me.m09.d14:meLI.Kontakion1.text	@ltx/gr_gr_cog/me.m09.d14:meMA.Kontakion1.text
ltx/gr_gr_cog/me.m09.d14:meLI.MM.Antiphon2.text	@ltx/gr_gr_cog/properties:media.key
ltx/gr_gr_cog/me.m09.d14:meLI.MM.CommunionHymn.text	@ltx/gr_gr_cog/properties:media.key
ltx/gr_gr_cog/me.m09.d14:meLI.MM.EntranceHymn.text	@ltx/gr_gr_cog/properties:media.key
ltx/gr_gr_cog/me.m09.d14:meLI.Megalynarion.text	Σήμερον ἡ κτίσις πᾶσα Σωτήρ, πόθῳ ἀνυψοῦσα, τὸν πανάγιόν σου Σταυρόν, τὴν φωνήν σοι αἴρει, καὶ πίστει ἐκβοᾷ σοι· Δώρησαι τῷ λαῷ σου, Λόγε τὴν χάριν σου.
ltx/gr_gr_cog/me.m09.d14:meLI.TheotokosHymn.incipit	@ltx/gr_gr_cog/me.m09.d14:meMA.Ode9C1H.incipit
ltx/gr_gr_cog/me.m09.d14:meLI.TheotokosHymn.mode	@ltx/gr_gr_cog/me.m09.d14:meMA.Ode9C1H.mode
ltx/gr_gr_cog/me.m09.d14:meLI.TheotokosHymn.text	@ltx/gr_gr_cog/me.m09.d14:meMA.Ode9C1H.text
ltx/gr_gr_cog/me.m09.d14:meMA.AdditionalIdiomelon1.incipit	Δεῦτε Πιστοί, τὸ ζωοποιὸν ξύλον…
ltx/gr_gr_cog/me.m09.d14:meMA.AdditionalIdiomelon1.melody	
ltx/gr_gr_cog/me.m09.d14:meMA.AdditionalIdiomelon1.mode	@ltx/gr_gr_cog/miscellanea:misc.Mode2
ltx/gr_gr_cog/me.m09.d14:meMA.AdditionalIdiomelon1.text	Δεῦτε Πιστοί, τὸ ζωοποιὸν ξύλον προσκυνήσωμεν, ἐν ᾧ Χριστὸς ὁ Βασιλεὺς τῆς δόξης, ἑκουσίως χεῖρας ἐκτείνας, ὕψωσεν ἡμᾶς εἰς τὴν ἀρχαίαν μακαριότητα, οὓς πρὶν ὁ ἐχθρός, διʼ ἡδονῆς συλήσας, ἐξορίστους Θεοῦ πεποίηκε. Δεῦτε Πιστοί, ξύλον προσκυνήσωμεν, διʼ οὗ ἠξιώθημεν, τῶν ἀοράτων ἐχθρῶν συντρίβειν τὰς κάρας. Δεῦτε πᾶσαι αἱ πατριαὶ τῶν ἐθνῶν, τὸν Σταυρὸν τοῦ Κυρίου ὕμνοις τιμήσωμεν. Χαίροις Σταυρὲ τοῦ πεσόντος Ἀδὰμ ἡ τελεία λύτρωσις. Ἐν σοὶ οἱ πιστότατοι Βασιλεῖς ἡμῶν καυχῶνται, ὡς τῇ σῇ δυνάμει, Ἰσμαηλίτην λαὸν κραταιῶς ὑποτάττοντες. Σὲ νῦν μετὰ φόβου Χριστιανοὶ ἀσπαζόμενοι, τὸν ἐν σοὶ προσπαγέντα Θεὸν δοξάζομεν λέγοντες· Κύριε, ὁ ἐν αὐτῷ σταυρωθείς, ἐλέησον ἡμᾶς, ὡς ἀγαθὸς καὶ φιλάνθρωπος.
ltx/gr_gr_cog/me.m09.d14:meMA.AdditionalIdiomelon2.incipit	Δεῦτε λαοί, τὸ παράδοξον θαῦμα…
ltx/gr_gr_cog/me.m09.d14:meMA.AdditionalIdiomelon2.melody	
ltx/gr_gr_cog/me.m09.d14:meMA.AdditionalIdiomelon2.mode	@ltx/gr_gr_cog/miscellanea:misc.Mode5
ltx/gr_gr_cog/me.m09.d14:meMA.AdditionalIdiomelon2.text	Δεῦτε λαοί, τὸ παράδοξον θαῦμα καθορῶντες, τοῦ Σταυροῦ τὴν δύναμιν προσκυνήσωμεν· ὅτι ξύλον ἐν Παραδείσῳ θάνατον ἐβλάστησε, τὸ δέ, τὴν ζωὴν ἐξήνθησεν, ἀναμάρτητον ἔχον προσηλωμένον τὸν Κύριον, ἐξ οὗ πάντα τὰ ἔθνη, ἀφθαρσίαν τρυγῶντες κραυγάζομεν· ὁ διὰ Σταυροῦ θάνατον καταργήσας, καὶ ἡμᾶς ἐλευθερώσας, δόξα σοι.
ltx/gr_gr_cog/me.m09.d14:meMA.AdditionalIdiomelon3.incipit	Ἡ φωνὴ τῶν Προφητῶν σου…
ltx/gr_gr_cog/me.m09.d14:meMA.AdditionalIdiomelon3.melody	
ltx/gr_gr_cog/me.m09.d14:meMA.AdditionalIdiomelon3.mode	@ltx/gr_gr_cog/miscellanea:misc.Mode5
ltx/gr_gr_cog/me.m09.d14:meMA.AdditionalIdiomelon3.text	Ἡ φωνὴ τῶν Προφητῶν σου, Ἠσαΐου καὶ Δαυΐδ, ἐπληρώθη ὁ Θεός, ἡ λέγουσα· Ἥξουσι πάντα τὰ ἔθνη Κύριε, καὶ προσκυνήσουσιν ἐνώπιόν σου· ἰδοὺ γὰρ ὁ λαός, ὅς τῆς σῆς ἀγαθὲ χάριτος πεπλήρωται, ἐν ταῖς αὐλαῖς σου Ἱερουσαλήμ, ὁ Σταυρὸν ὑπομείνας ὑπὲρ ἡμῶν, καὶ τῇ ἀναστάσει σου ζωοποιῶν, φύλαξον καὶ σῶσον ἡμᾶς.
ltx/gr_gr_cog/me.m09.d14:meMA.AdditionalIdiomelon4.incipit	Σήμερον τὸ φυτὸν τῆς ζωῆς…
ltx/gr_gr_cog/me.m09.d14:meMA.AdditionalIdiomelon4.melody	
ltx/gr_gr_cog/me.m09.d14:meMA.AdditionalIdiomelon4.mode	@ltx/gr_gr_cog/miscellanea:misc.Mode6
ltx/gr_gr_cog/me.m09.d14:meMA.AdditionalIdiomelon4.text	Σήμερον τὸ φυτὸν τῆς ζωῆς, ἐκ τῶν τῆς γῆς ἀδύτων ἀνιστάμενον, τοῦ ἐν αὐτῷ παγέντος Χριστοῦ, πιστοῦται τὴν ἀνάστασιν· καὶ ἀνυψούμενον χερσὶν ἱεραῖς, τὴν αὐτοῦ πρὸς οὐρανοὺς καταγγέλλει ἀνύψωσιν, διʼ ἧς τὸ ἡμέτερον φύραμα, ἐκ τῆς εἰς γῆν καταπτώσεως, εἰς οὐρανοὺς πολιτεύεται· διὸ εὐχαρίστως βοήσωμεν· Κύριε, ὁ ὑψωθεὶς ἐν αὐτῷ, καὶ διʼ αὐτοῦ συνυψώσας ἡμᾶς, τῆς οὐρανίου χαρᾶς, ἀξίωσον τοὺς ὑμνοῦντάς σε.
ltx/gr_gr_cog/me.m09.d14:meMA.AdditionalIdiomelon5.incipit	Ὁ τετραπέρατος κόσμος σήμερον ἁγιάζεται…
ltx/gr_gr_cog/me.m09.d14:meMA.AdditionalIdiomelon5.melody	
ltx/gr_gr_cog/me.m09.d14:meMA.AdditionalIdiomelon5.mode	@ltx/gr_gr_cog/miscellanea:misc.Mode6
ltx/gr_gr_cog/me.m09.d14:meMA.AdditionalIdiomelon5.text	Ὁ τετραπέρατος κόσμος σήμερον ἁγιάζεται, τοῦ τετραμεροῦς ὑψουμένου σου Σταυροῦ, Χριστὲ ὁ Θεὸς ἡμῶν, καὶ τὸ κέρας τῶν πιστῶν, συνυψοῦται Βασιλέων ἡμῶν, ἐν αὐτῷ τῶν δυσμενῶν συντριβόντων τὰ κέρατα. Μέγας εἶ Κύριε καὶ θαυμαστὸς ἐν τοῖς ἔργοις σου! δόξα σοι.
ltx/gr_gr_cog/me.m09.d14:meMA.AdditionalIdiomelon6.incipit	Τῶν Προφητῶν αἱ φωναί, τὸ…
ltx/gr_gr_cog/me.m09.d14:meMA.AdditionalIdiomelon6.melody	
ltx/gr_gr_cog/me.m09.d14:meMA.AdditionalIdiomelon6.mode	@ltx/gr_gr_cog/miscellanea:misc.Mode6
ltx/gr_gr_cog/me.m09.d14:meMA.AdditionalIdiomelon6.text	Τῶν Προφητῶν αἱ φωναί, τὸ Ξύλον τὸ ἅγιον προκατήγγειλαν, διʼ οὗ τῆς ἀρχαίας ἠλευθερώθη κατάρας, τῆς τοῦ θανάτου ὁ Ἀδάμ· ἡ κτίσις σήμερον, ὑψουμένου τούτου, συνυψοῖ τὴν φωνήν, τὸ ἐκ Θεοῦ αἰτουμένη πλούσιον ἔλεος. Ἀλλʼ ὁ μόνος ἐν ἐλέει ἀμέτρητος Δέσποτα, ἱλασμὸς γενοῦ ἡμῖν, καὶ σῶσον τὰς ψυχὰς ἡμῶν.
ltx/gr_gr_cog/me.m09.d14:meMA.AdditionalIdiomelonGlory.incipit	Ἡ φωνὴ τοῦ Προφήτου σου…
ltx/gr_gr_cog/me.m09.d14:meMA.AdditionalIdiomelonGlory.melody	
ltx/gr_gr_cog/me.m09.d14:meMA.AdditionalIdiomelonGlory.mode	@ltx/gr_gr_cog/miscellanea:misc.Mode8
ltx/gr_gr_cog/me.m09.d14:meMA.AdditionalIdiomelonGlory.text	Ἡ φωνὴ τοῦ Προφήτου σου, Μωϋσέως ὁ Θεός, πεπλήρωται ἡ λέγουσα· Ὄψεσθε τὴν ζωὴν ὑμῶν κρεμαμένην, ἀπέναντι τῶν ὀφθαλμῶν ὑμῶν. Σήμερον Σταυρὸς ὑψοῦται, καὶ κόσμος ἐκ πλάνης ἠλευθέρωται. Σήμερον τοῦ Χριστοῦ ἡ, Ἀνάστασις ἐγκαινίζεται, καὶ τὰ πέρατα τῆς γῆς ἀγάλλονται, ἐν κυμβάλοις Δαυϊτικοῖς, ὕμνον σοι προσφέροντα, καὶ λέγοντα· Εἰργάσω σωτηρίαν ἐν μέσῳ τῆς γῆς ὁ Θεός, Σταυρὸν καὶ τὴν Ἀνάστασιν, διʼ ὧν ἡμᾶς ἔσωσας, ἀγαθὲ καὶ φιλάνθρωπε, Παντοδύναμε Κύριε δόξα σοι.
ltx/gr_gr_cog/me.m09.d14:meMA.C1.acrostic.notice1	ὃς τὴν δε τὴν Ἀκροστιχίδα φέρει·
ltx/gr_gr_cog/me.m09.d14:meMA.C1.acrostic.text	Σταυρῷ πεποιθώς, ὕμνον ἐξερεύγομαι.
ltx/gr_gr_cog/me.m09.d14:meMA.C1.acrostic.title	Ὁ Κανών,
ltx/gr_gr_cog/me.m09.d14:meMA.C1.poet	@ltx/gr_gr_cog/poets:po.KyriouKosma
ltx/gr_gr_cog/me.m09.d14:meMA.C1.title	@ltx/gr_gr_cog/titles:ti.CanonFeast
ltx/gr_gr_cog/me.m09.d14:meMA.C1.verse	@ltx/gr_gr_cog/prayers:pr.verse_Cross.text
ltx/gr_gr_cog/me.m09.d14:meMA.Exaposteilarion1.greekmelody	@ltx/gr_gr_cog/he.a.m2:heAU.TonMathitonOrontonSe.greekname
ltx/gr_gr_cog/me.m09.d14:meMA.Exaposteilarion1.incipit	Σταυρός, ὁ φύλαξ πάσης τῆς οἰκουμένης…
ltx/gr_gr_cog/me.m09.d14:meMA.Exaposteilarion1.melody	@ltx/gr_gr_cog/he.a.m2:heAU.TonMathitonOrontonSe.name
ltx/gr_gr_cog/me.m09.d14:meMA.Exaposteilarion1.mode	@ltx/gr_gr_cog/miscellanea:misc.Mode2
ltx/gr_gr_cog/me.m09.d14:meMA.Exaposteilarion1.text	Σταυρός, ὁ φύλαξ πάσης τῆς οἰκουμένης· Σταυρός, ἡ ὡραιότης τῆς Ἐκκλησίας, Σταυρός, Βασιλέων τὸ κραταίωμα· Σταυρός, Πιστῶν τὸ στήριγμα· Σταυρός, Ἀγγέλων ἡ δόξα, καὶ τῶν δαιμόνων τὸ τραῦμα.
ltx/gr_gr_cog/me.m09.d14:meMA.Exaposteilarion2.greekmelody	@ltx/gr_gr_cog/he.a.m2:heAU.GynaikesAkoutisthite.greekname
ltx/gr_gr_cog/me.m09.d14:meMA.Exaposteilarion2.incipit	Σταυρὸς ὑψοῦται σήμερον, καὶ κόσμος…
ltx/gr_gr_cog/me.m09.d14:meMA.Exaposteilarion2.melody	@ltx/gr_gr_cog/he.a.m2:heAU.GynaikesAkoutisthite.name
ltx/gr_gr_cog/me.m09.d14:meMA.Exaposteilarion2.mode	@ltx/gr_gr_cog/miscellanea:misc.Mode2
ltx/gr_gr_cog/me.m09.d14:meMA.Exaposteilarion2.text	Σταυρὸς ὑψοῦται σήμερον, καὶ κόσμος ἁγιάζεται· ὁ γὰρ Πατρὶ συνεδρεύων, καὶ Πνεύματι τῷ Ἁγίῳ, ἐν τούτῳ χεῖρας ἁπλώσας, τὸν κόσμον ὅλον εἵλκυσας, πρὸς σήν Χριστὲ ἐπίγνωσιν· τοὺς οὖν εἰς σὲ πεποιθότας, θείας ἀξίωσον δόξης.
ltx/gr_gr_cog/me.m09.d14:meMA.Kathisma11.greekmelody	@ltx/gr_gr_cog/he.a.m1:heAU.TouLithouSfragisthentos.greekname
ltx/gr_gr_cog/me.m09.d14:meMA.Kathisma11.incipit	Τοῦ Σταυροῦ σου τὸ ξύλον…
ltx/gr_gr_cog/me.m09.d14:meMA.Kathisma11.melody	@ltx/gr_gr_cog/he.a.m1:heAU.TouLithouSfragisthentos.name
ltx/gr_gr_cog/me.m09.d14:meMA.Kathisma11.mode	@ltx/gr_gr_cog/miscellanea:misc.Mode1
ltx/gr_gr_cog/me.m09.d14:meMA.Kathisma11.text	Τοῦ Σταυροῦ σου τὸ ξύλον προσκυνοῦμεν Φιλάνθρωπε, ὅτι ἐν αὐτῷ προσηλώθης ἡ ζωὴ τῶν ἁπάντων· Παράδεισον ἠνέῳξας Σωτήρ, τῷ πίστει προσελθόντι σοι Ληστῇ· καὶ τρυφῆς κατηξιώθη, ὁμολογῶν σοι, Μνήσθητί μου Κύριε. Δέξαι ὥσπερ ἐκεῖνον καὶ ἡμᾶς, κραυγάζοντας· Ἡμάρτομεν, πάντες τῇ εὐσπλαγχνίᾳ σου, μὴ ὑπερίδῃς ἡμᾶς.
ltx/gr_gr_cog/me.m09.d14:meMA.Kathisma21.incipit	@ltx/gr_gr_cog/oc.m6.d4:ocMA.Kathisma11.incipit
ltx/gr_gr_cog/me.m09.d14:meMA.Kathisma21.melody	
ltx/gr_gr_cog/me.m09.d14:meMA.Kathisma21.mode	@ltx/gr_gr_cog/miscellanea:misc.Mode6
ltx/gr_gr_cog/me.m09.d14:meMA.Kathisma21.text	@ltx/gr_gr_cog/oc.m6.d4:ocMA.Kathisma11.text
ltx/gr_gr_cog/me.m09.d14:meMA.Kathisma31.greekmelody	@ltx/gr_gr_cog/he.a.m8:heAU.ToProstachthen.greekname
ltx/gr_gr_cog/me.m09.d14:meMA.Kathisma31.incipit	Προδιετύπου μυστικῶς πάλαι τῷ χρόνῳ…
ltx/gr_gr_cog/me.m09.d14:meMA.Kathisma31.melody	@ltx/gr_gr_cog/he.a.m8:heAU.ToProstachthen.name
ltx/gr_gr_cog/me.m09.d14:meMA.Kathisma31.mode	@ltx/gr_gr_cog/miscellanea:misc.Mode8
ltx/gr_gr_cog/me.m09.d14:meMA.Kathisma31.text	Προδιετύπου μυστικῶς πάλαι τῷ χρόνῳ, ὁ Ἰησοῦς ὁ τοῦ Ναυῆ, Σταυροῦ τὸν τύπον, ὡς τὰς χεῖρας ἐξέτεινε σταυροφανῶς Σωτήρ μου· καὶ ἔστη ὁ ἥλιος ἕως ἐχθρούς, ἀνεῖλεν, ἀνθισταμένους σοι τῷ Θεῷ· νῦν δὲ οὗτος ἐσκότισται, ἐπὶ Σταυροῦ σε ὁρῶν, θανάτου κράτος λύοντα, καὶ τὸν ᾍδην σκυλεύοντα.
ltx/gr_gr_cog/me.m09.d14:meMA.Kontakion1.greekmelody	@ltx/gr_gr_cog/he.a.m4:heAU.OYpsotheisEnToStavro.greekname
ltx/gr_gr_cog/me.m09.d14:meMA.Kontakion1.incipit	@ltx/gr_gr_cog/he.a.m4:heAU.OYpsotheisEnToStavro.incipit
ltx/gr_gr_cog/me.m09.d14:meMA.Kontakion1.melody	@ltx/gr_gr_cog/he.a.m4:heAU.OYpsotheisEnToStavro.melody
ltx/gr_gr_cog/me.m09.d14:meMA.Kontakion1.mode	@ltx/gr_gr_cog/miscellanea:misc.Mode4
ltx/gr_gr_cog/me.m09.d14:meMA.Kontakion1.text	@ltx/gr_gr_cog/he.a.m4:heAU.OYpsotheisEnToStavro.text
ltx/gr_gr_cog/me.m09.d14:meMA.Lauds1.greekmelody	@ltx/gr_gr_cog/he.a.m8:heAU.OTouParadoxou.greekname
ltx/gr_gr_cog/me.m09.d14:meMA.Lauds1.incipit	Ὢ τοῦ παραδόξου θαύματος! τὸ…
ltx/gr_gr_cog/me.m09.d14:meMA.Lauds1.melody	@ltx/gr_gr_cog/he.a.m8:heAU.OTouParadoxou.name
ltx/gr_gr_cog/me.m09.d14:meMA.Lauds1.mode	@ltx/gr_gr_cog/miscellanea:misc.Mode8
ltx/gr_gr_cog/me.m09.d14:meMA.Lauds1.text	Ὢ τοῦ παραδόξου θαύματος! τὸ ζωηφόρον φυτόν, ὁ Σταυρὸς ὁ πανάγιος, εἰς ὕψος αἰρόμενος, ἐμφανίζεται σήμερον· δοξολογοῦσι πάντα τὰ πέρατα· ἐκδειματοῦνται δαίμονες ἅπαντες, ὢ οἷον δώρημα, τοῖς βροτοῖς κεχάρισται! διʼ οὗ Χριστέ, σῶσον τὰς ψυχὰς ἡμῶν, ὡς μόνος εὔσπλαγχνος.
ltx/gr_gr_cog/me.m09.d14:meMA.Lauds2.incipit	Ὢ τοῦ παραδόξου θαύματος! ὡς…
ltx/gr_gr_cog/me.m09.d14:meMA.Lauds2.melody	@ltx/gr_gr_cog/he.a.m8:heAU.OTouParadoxou.name
ltx/gr_gr_cog/me.m09.d14:meMA.Lauds2.mode	@ltx/gr_gr_cog/miscellanea:misc.Mode8
ltx/gr_gr_cog/me.m09.d14:meMA.Lauds2.text	Ὢ τοῦ παραδόξου θαύματος! ὡς βότρυν πλήρη ζωῆς, ὁ βαστάσας τὸν ὕψιστον, ἀπὸ γῆς ὑψούμενος, Σταυρὸς ὁρᾶται σήμερον· διʼ οὗ πρὸς Θεὸν πάντες εἱλκύσθημεν, καὶ κατεπόθη εἰς τέλος θάνατος, Ὦ ξύλον ἄχραντον! ὑφʼ οὗ ἀπολαύομεν τῆς ἐν Ἐδέμ, ἀθανάτου βρώσεως, Χριστὸν δοξάζοντες.
ltx/gr_gr_cog/me.m09.d14:meMA.Lauds3.incipit	Ὢ τοῦ παραδόξου θαύματος! εὖρος…
ltx/gr_gr_cog/me.m09.d14:meMA.Lauds3.melody	@ltx/gr_gr_cog/he.a.m8:heAU.OTouParadoxou.name
ltx/gr_gr_cog/me.m09.d14:meMA.Lauds3.mode	@ltx/gr_gr_cog/miscellanea:misc.Mode8
ltx/gr_gr_cog/me.m09.d14:meMA.Lauds3.text	Ὢ τοῦ παραδόξου θαύματος! εὖρος καὶ μῆκος Σταυροῦ, οὐρανοῦ ἰσοστάσιον, ὅτι θείᾳ χάριτι, ἁγιάζει τὰ σύμπαντα, ἐν τούτῳ ἔθνη βάρβαρα ἥττηνται· ἐν τούτῳ σκῆπτρα ἀνάκτων ἥδρασται. Ὢ θείας κλίμακος! διʼ ἧς ἀνατρέχομεν εἰς οὐρανούς, ὑψοῦντες ἐν ᾄσμασι, Χριστὸν τὸν Κύριον.
ltx/gr_gr_cog/me.m09.d14:meMA.LaudsGlory.incipit	Σήμερον προέρχεται ὁ Σταυρὸς τοῦ…
ltx/gr_gr_cog/me.m09.d14:meMA.LaudsGlory.melody	
ltx/gr_gr_cog/me.m09.d14:meMA.LaudsGlory.mode	@ltx/gr_gr_cog/miscellanea:misc.Mode6
ltx/gr_gr_cog/me.m09.d14:meMA.LaudsGlory.text	Σήμερον προέρχεται ὁ Σταυρὸς τοῦ Κυρίου, καὶ πιστοὶ εἰσδέχονται αὐτὸν ἐκ πόθου, καὶ λαμβάνουσιν ἰάματα ψυχῆς τε καὶ σώματος, καὶ πάσης μαλακίας. Αὐτὸν ἀσπασώμεθα τῇ χαρᾷ καὶ τῷ φόβῳ· φόβῳ διὰ τὴν ἁμαρτίαν, ὡς ἀνάξιοι ὄντες· χαρᾷ δὲ διὰ τὴν σωτηρίαν, ἣν παρέχει τῷ κόσμῳ, ὁ ἐν αὐτῷ προσπαγεὶς Χριστὸς ὁ Κύριος, ὁ ἔχων τὸ μέγα ἔλεος.
ltx/gr_gr_cog/me.m09.d14:meMA.MM.Lauds1123as5678.text	@ltx/gr_gr_cog/properties:media.key
ltx/gr_gr_cog/me.m09.d14:meMA.MM.Lauds12as45.text	@ltx/gr_gr_cog/properties:media.key
ltx/gr_gr_cog/me.m09.d14:meMA.MM.Sv1123as3456.text	@ltx/gr_gr_cog/properties:media.key
ltx/gr_gr_cog/me.m09.d14:meMA.MM.Sv123as123.text	@ltx/gr_gr_cog/properties:media.key
ltx/gr_gr_cog/me.m09.d14:meMA.Ode1C11.greekmelody	@ltx/gr_gr_cog/he.h.m8:heHE.StavronCharaxasMosis.greekname
ltx/gr_gr_cog/me.m09.d14:meMA.Ode1C11.incipit	Τὸν τύπον πάλαι Μωσῆς, τοῦ…
ltx/gr_gr_cog/me.m09.d14:meMA.Ode1C11.melody	@ltx/gr_gr_cog/he.h.m8:heHE.StavronCharaxasMosis.name
ltx/gr_gr_cog/me.m09.d14:meMA.Ode1C11.mode	@ltx/gr_gr_cog/miscellanea:misc.Mode8
ltx/gr_gr_cog/me.m09.d14:meMA.Ode1C11.ode	@ltx/gr_gr_cog/miscellanea:misc.Ode1
ltx/gr_gr_cog/me.m09.d14:meMA.Ode1C11.text	Τὸν τύπον πάλαι Μωσῆς, τοῦ ἀχράντου πάθους, ἐν ἑαυτῷ προέφηνε, τῶν ἱερῶν μεσούμενος, Σταυρῷ δὲ σχηματισθείς, τεταμέναις τρόπαιον, παλάμαις ἤγειρε, τὸ κράτος διολέσας, Ἀμαλὴκ τοῦ πανώλους· διὸ Χριστῷ ᾄσωμεν, τῷ Θεῷ ἡμῶν, ὅτι δεδόξασται.
ltx/gr_gr_cog/me.m09.d14:meMA.Ode1C12.incipit	Ἀνέθηκε Μωϋσῆς, ἐπὶ στήλης ἄκος…
ltx/gr_gr_cog/me.m09.d14:meMA.Ode1C12.melody	@ltx/gr_gr_cog/he.h.m8:heHE.StavronCharaxasMosis.name
ltx/gr_gr_cog/me.m09.d14:meMA.Ode1C12.mode	@ltx/gr_gr_cog/miscellanea:misc.Mode8
ltx/gr_gr_cog/me.m09.d14:meMA.Ode1C12.ode	@ltx/gr_gr_cog/miscellanea:misc.Ode1
ltx/gr_gr_cog/me.m09.d14:meMA.Ode1C12.text	Ἀνέθηκε Μωϋσῆς, ἐπὶ στήλης ἄκος, φθοροποιοῦ λυτήριον, καὶ ἰοβόλου δήγματος· καὶ ξύλῳ τύπῳ Σταυροῦ, τὸν πρὸς γῆν συρόμενον, ὄφιν προσέδησεν, ἐγκάρσιον ἐν τούτῳ, θριαμβεύσας τὸ πῆμα· διὸ Χριστῷ ᾄσωμεν, τῷ Θεῷ ἡμῶν, ὅτι δεδόξασται.
ltx/gr_gr_cog/me.m09.d14:meMA.Ode1C13.incipit	Ὑπέδειξεν οὐρανός, τοῦ Σταυροῦ τὸ…
ltx/gr_gr_cog/me.m09.d14:meMA.Ode1C13.melody	@ltx/gr_gr_cog/he.h.m8:heHE.StavronCharaxasMosis.name
ltx/gr_gr_cog/me.m09.d14:meMA.Ode1C13.mode	@ltx/gr_gr_cog/miscellanea:misc.Mode8
ltx/gr_gr_cog/me.m09.d14:meMA.Ode1C13.ode	@ltx/gr_gr_cog/miscellanea:misc.Ode1
ltx/gr_gr_cog/me.m09.d14:meMA.Ode1C13.text	Ὑπέδειξεν οὐρανός, τοῦ Σταυροῦ τὸ τρόπαιον, τῷ εὐσεβείας κράτορι, καὶ Βασιλεῖ θεόφρονι, ἐχθρῶν ἐν ᾧ δυσμενῶν, κατεβλήθη φρύαγμα· ἀπάτη ἀνετράπη δέ· καὶ πίστις ἐφηπλώθη, γῆς τοῖς πέρασι θεία· διὸ Χριστῷ ᾄσωμεν, τῷ Θεῷ ἡμῶν, ὅτι δεδόξασται.
ltx/gr_gr_cog/me.m09.d14:meMA.Ode1C1H.greekmelody	@ltx/gr_gr_cog/he.h.m8:heHE.StavronCharaxasMosis.greekname
ltx/gr_gr_cog/me.m09.d14:meMA.Ode1C1H.incipit	@ltx/gr_gr_cog/he.h.m8:heHE.StavronCharaxasMosis.incipit
ltx/gr_gr_cog/me.m09.d14:meMA.Ode1C1H.melody	@ltx/gr_gr_cog/he.h.m8:heHE.StavronCharaxasMosis.melody
ltx/gr_gr_cog/me.m09.d14:meMA.Ode1C1H.mode	@ltx/gr_gr_cog/miscellanea:misc.Mode8
ltx/gr_gr_cog/me.m09.d14:meMA.Ode1C1H.ode	@ltx/gr_gr_cog/miscellanea:misc.Ode1
ltx/gr_gr_cog/me.m09.d14:meMA.Ode1C1H.text	@ltx/gr_gr_cog/he.h.m8:heHE.StavronCharaxasMosis.text
ltx/gr_gr_cog/me.m09.d14:meMA.Ode3C11.greekmelody	@ltx/gr_gr_cog/he.h.m8:heHE.RavdosEisTypon.greekname
ltx/gr_gr_cog/me.m09.d14:meMA.Ode3C11.incipit	Ὡς ἐπαφῆκε ῥαπιζομένη ὕδωρ ἀκρότομος…
ltx/gr_gr_cog/me.m09.d14:meMA.Ode3C11.melody	@ltx/gr_gr_cog/he.h.m8:heHE.RavdosEisTypon.name
ltx/gr_gr_cog/me.m09.d14:meMA.Ode3C11.mode	@ltx/gr_gr_cog/miscellanea:misc.Mode8
ltx/gr_gr_cog/me.m09.d14:meMA.Ode3C11.ode	@ltx/gr_gr_cog/miscellanea:misc.Ode3
ltx/gr_gr_cog/me.m09.d14:meMA.Ode3C11.text	Ὡς ἐπαφῆκε ῥαπιζομένη ὕδωρ ἀκρότομος, ἀπειθοῦντι λαῷ, καὶ σκληροκαρδίῳ, τῆς θεοκλήτου ἐδήλου, Ἐκκλησίας τὸ μυστήριον, ἧς ὁ Σταυρός, τὸ κράτος καὶ στερέωμα.
ltx/gr_gr_cog/me.m09.d14:meMA.Ode3C12.incipit	Πλευρᾶς ἀχράντου λόγχῃ τρωθείσης, ὕδωρ…
ltx/gr_gr_cog/me.m09.d14:meMA.Ode3C12.melody	@ltx/gr_gr_cog/he.h.m8:heHE.RavdosEisTypon.name
ltx/gr_gr_cog/me.m09.d14:meMA.Ode3C12.mode	@ltx/gr_gr_cog/miscellanea:misc.Mode8
ltx/gr_gr_cog/me.m09.d14:meMA.Ode3C12.ode	@ltx/gr_gr_cog/miscellanea:misc.Ode3
ltx/gr_gr_cog/me.m09.d14:meMA.Ode3C12.text	Πλευρᾶς ἀχράντου λόγχῃ τρωθείσης, ὕδωρ σὺν αἵματι ἐξεβλήθη, ἐγκαινίζον διαθήκην, καὶ ῥυπτικὸν ἁμαρτίας· τῶν πιστῶν γὰρ Σταυρὸς καύχημα, καὶ Βασιλέων κράτος καὶ στερέωμα.
ltx/gr_gr_cog/me.m09.d14:meMA.Ode3C1H.greekmelody	@ltx/gr_gr_cog/he.h.m8:heHE.RavdosEisTypon.greekname
ltx/gr_gr_cog/me.m09.d14:meMA.Ode3C1H.incipit	@ltx/gr_gr_cog/he.h.m8:heHE.RavdosEisTypon.incipit
ltx/gr_gr_cog/me.m09.d14:meMA.Ode3C1H.melody	@ltx/gr_gr_cog/he.h.m8:heHE.RavdosEisTypon.melody
ltx/gr_gr_cog/me.m09.d14:meMA.Ode3C1H.mode	@ltx/gr_gr_cog/miscellanea:misc.Mode8
ltx/gr_gr_cog/me.m09.d14:meMA.Ode3C1H.ode	@ltx/gr_gr_cog/miscellanea:misc.Ode3
ltx/gr_gr_cog/me.m09.d14:meMA.Ode3C1H.text	@ltx/gr_gr_cog/he.h.m8:heHE.RavdosEisTypon.text
ltx/gr_gr_cog/me.m09.d14:meMA.Ode3Kathisma1.greekmelody	@ltx/gr_gr_cog/he.a.m8:heAU.ToProstachthen.greekname
ltx/gr_gr_cog/me.m09.d14:meMA.Ode3Kathisma1.incipit	@ltx/gr_gr_cog/oc.m8.d4:ocMA.Kathisma22.incipit
ltx/gr_gr_cog/me.m09.d14:meMA.Ode3Kathisma1.melody	@ltx/gr_gr_cog/he.a.m8:heAU.ToProstachthen.name
ltx/gr_gr_cog/me.m09.d14:meMA.Ode3Kathisma1.mode	@ltx/gr_gr_cog/miscellanea:misc.Mode8
ltx/gr_gr_cog/me.m09.d14:meMA.Ode3Kathisma1.text	@ltx/gr_gr_cog/oc.m8.d4:ocMA.Kathisma22.text
ltx/gr_gr_cog/me.m09.d14:meMA.Ode4C11.greekmelody	@ltx/gr_gr_cog/he.h.m8:heHE.EisakikoaKyrie.greekname
ltx/gr_gr_cog/me.m09.d14:meMA.Ode4C11.incipit	Πικρογόνους μετέβαλε, ξύλῳ Μωϋσῆς πηγὰς…
ltx/gr_gr_cog/me.m09.d14:meMA.Ode4C11.melody	@ltx/gr_gr_cog/he.h.m8:heHE.EisakikoaKyrie.name
ltx/gr_gr_cog/me.m09.d14:meMA.Ode4C11.mode	@ltx/gr_gr_cog/miscellanea:misc.Mode8
ltx/gr_gr_cog/me.m09.d14:meMA.Ode4C11.ode	@ltx/gr_gr_cog/miscellanea:misc.Ode4
ltx/gr_gr_cog/me.m09.d14:meMA.Ode4C11.text	Πικρογόνους μετέβαλε, ξύλῳ Μωϋσῆς πηγὰς ἐν ἐρήμῳ πάλαι, τῷ Σταυρῷ πρὸς τὴν εὐσέβειαν, τῶν ἐθνῶν προφαίνων τὴν μετάθεσιν.
ltx/gr_gr_cog/me.m09.d14:meMA.Ode4C12.incipit	Ὁ βυθῷ κολπωσάμενος, τέμνουσαν ἀνέδωκεν…
ltx/gr_gr_cog/me.m09.d14:meMA.Ode4C12.melody	@ltx/gr_gr_cog/he.h.m8:heHE.EisakikoaKyrie.name
ltx/gr_gr_cog/me.m09.d14:meMA.Ode4C12.mode	@ltx/gr_gr_cog/miscellanea:misc.Mode8
ltx/gr_gr_cog/me.m09.d14:meMA.Ode4C12.ode	@ltx/gr_gr_cog/miscellanea:misc.Ode4
ltx/gr_gr_cog/me.m09.d14:meMA.Ode4C12.text	Ὁ βυθῷ κολπωσάμενος, τέμνουσαν ἀνέδωκεν Ἰορδάνης ξύλῳ, τῷ Σταυρῷ καὶ τῷ Βαπτίσματι, τὴν τομὴν τῆς πλάνης τεκμαιρόμενος.
ltx/gr_gr_cog/me.m09.d14:meMA.Ode4C13.incipit	Ἱερῶς προστοιβάζεται, ὁ τετραμερὴς λαὸς…
ltx/gr_gr_cog/me.m09.d14:meMA.Ode4C13.melody	@ltx/gr_gr_cog/he.h.m8:heHE.EisakikoaKyrie.name
ltx/gr_gr_cog/me.m09.d14:meMA.Ode4C13.mode	@ltx/gr_gr_cog/miscellanea:misc.Mode8
ltx/gr_gr_cog/me.m09.d14:meMA.Ode4C13.ode	@ltx/gr_gr_cog/miscellanea:misc.Ode4
ltx/gr_gr_cog/me.m09.d14:meMA.Ode4C13.text	Ἱερῶς προστοιβάζεται, ὁ τετραμερὴς λαὸς προηγούμενος, τῆς ἐν τύπῳ μαρτυρίου σκηνῆς, σταυροτύποις τάξεσι κλεϊζόμενος.
ltx/gr_gr_cog/me.m09.d14:meMA.Ode4C14.incipit	Θαυμαστῶς ἐφαπλούμενος, τὰς ἡλιακὰς βολὰς…
ltx/gr_gr_cog/me.m09.d14:meMA.Ode4C14.melody	@ltx/gr_gr_cog/he.h.m8:heHE.EisakikoaKyrie.name
ltx/gr_gr_cog/me.m09.d14:meMA.Ode4C14.mode	@ltx/gr_gr_cog/miscellanea:misc.Mode8
ltx/gr_gr_cog/me.m09.d14:meMA.Ode4C14.ode	@ltx/gr_gr_cog/miscellanea:misc.Ode4
ltx/gr_gr_cog/me.m09.d14:meMA.Ode4C14.text	Θαυμαστῶς ἐφαπλούμενος, τὰς ἡλιακὰς βολὰς ἐξηκόντισεν, ὁ Σταυρός· καὶ διηγήσαντο, οὐρανοὶ τὴν δόξαν τοῦ Θεοῦ ἡμῶν.
ltx/gr_gr_cog/me.m09.d14:meMA.Ode4C1H.greekmelody	@ltx/gr_gr_cog/he.h.m8:heHE.EisakikoaKyrie.greekname
ltx/gr_gr_cog/me.m09.d14:meMA.Ode4C1H.incipit	@ltx/gr_gr_cog/he.h.m8:heHE.EisakikoaKyrie.incipit
ltx/gr_gr_cog/me.m09.d14:meMA.Ode4C1H.melody	@ltx/gr_gr_cog/he.h.m8:heHE.EisakikoaKyrie.melody
ltx/gr_gr_cog/me.m09.d14:meMA.Ode4C1H.mode	@ltx/gr_gr_cog/miscellanea:misc.Mode8
ltx/gr_gr_cog/me.m09.d14:meMA.Ode4C1H.ode	@ltx/gr_gr_cog/miscellanea:misc.Ode4
ltx/gr_gr_cog/me.m09.d14:meMA.Ode4C1H.text	@ltx/gr_gr_cog/he.h.m8:heHE.EisakikoaKyrie.text
ltx/gr_gr_cog/me.m09.d14:meMA.Ode5C11.greekmelody	@ltx/gr_gr_cog/he.h.m8:heHE.OTrismakaristonXylon.greekname
ltx/gr_gr_cog/me.m09.d14:meMA.Ode5C11.incipit	Σὲ τὸ ἀοίδιμον ξύλον, ἐν…
ltx/gr_gr_cog/me.m09.d14:meMA.Ode5C11.melody	@ltx/gr_gr_cog/he.h.m8:heHE.OTrismakaristonXylon.name
ltx/gr_gr_cog/me.m09.d14:meMA.Ode5C11.mode	@ltx/gr_gr_cog/miscellanea:misc.Mode8
ltx/gr_gr_cog/me.m09.d14:meMA.Ode5C11.ode	@ltx/gr_gr_cog/miscellanea:misc.Ode5
ltx/gr_gr_cog/me.m09.d14:meMA.Ode5C11.text	Σὲ τὸ ἀοίδιμον ξύλον, ἐν ᾧ ἐτάθη Χριστός, τὴν Ἐδὲμ φυλάττουσα, στρεφομένη ῥομφαία, Σταυρὲ ᾐδέσθη, τὸ φρικτὸν δὲ Χερουβίμ, εἶξε τῷ σοὶ παγέντι Χριστῷ, τῷ παρέχοντι, τὴν εἰρήνην ταῖς ψυχαῖς ἡμῶν.
ltx/gr_gr_cog/me.m09.d14:meMA.Ode5C12.incipit	Ὑποχθονίων δυνάμεις, ἀντίπαλοι τοῦ Σταυροῦ…
ltx/gr_gr_cog/me.m09.d14:meMA.Ode5C12.melody	@ltx/gr_gr_cog/he.h.m8:heHE.OTrismakaristonXylon.name
ltx/gr_gr_cog/me.m09.d14:meMA.Ode5C12.mode	@ltx/gr_gr_cog/miscellanea:misc.Mode8
ltx/gr_gr_cog/me.m09.d14:meMA.Ode5C12.ode	@ltx/gr_gr_cog/miscellanea:misc.Ode5
ltx/gr_gr_cog/me.m09.d14:meMA.Ode5C12.text	Ὑποχθονίων δυνάμεις, ἀντίπαλοι τοῦ Σταυροῦ, φρίττουσι χαραττόμενον, τὸ σημεῖον ἐν ἀέρι ᾧ πολοῦσιν· οὐρανίων γηγενῶν, γένος δὲ γόνυ κάμπτει Χριστῷ, τῷ παρέχοντι, τὴν εἰρήνην ταῖς ψυχαῖς ἡμῶν.
ltx/gr_gr_cog/me.m09.d14:meMA.Ode5C13.incipit	Μαρμαρυγαῖς ἀκηράτοις, φανεὶς ὁ θεῖος…
ltx/gr_gr_cog/me.m09.d14:meMA.Ode5C13.melody	@ltx/gr_gr_cog/he.h.m8:heHE.OTrismakaristonXylon.name
ltx/gr_gr_cog/me.m09.d14:meMA.Ode5C13.mode	@ltx/gr_gr_cog/miscellanea:misc.Mode8
ltx/gr_gr_cog/me.m09.d14:meMA.Ode5C13.ode	@ltx/gr_gr_cog/miscellanea:misc.Ode5
ltx/gr_gr_cog/me.m09.d14:meMA.Ode5C13.text	Μαρμαρυγαῖς ἀκηράτοις, φανεὶς ὁ θεῖος Σταυρός, ἐσκοτισμένοις ἔθνεσι, τοῖς ἐν πλάνῃ ἀπάτης τὸ θεῖον φέγγος, ἀπαστράψας οἰκειοῖ, τῷ ἐν αὐτῷ παγέντι Χριστῷ, τῷ παρέχοντι, τὴν εἰρήνην ταῖς ψυχαῖς ἡμῶν.
ltx/gr_gr_cog/me.m09.d14:meMA.Ode5C1H.greekmelody	@ltx/gr_gr_cog/he.h.m8:heHE.OTrismakaristonXylon.greekname
ltx/gr_gr_cog/me.m09.d14:meMA.Ode5C1H.incipit	@ltx/gr_gr_cog/he.h.m8:heHE.OTrismakaristonXylon.incipit
ltx/gr_gr_cog/me.m09.d14:meMA.Ode5C1H.melody	@ltx/gr_gr_cog/he.h.m8:heHE.OTrismakaristonXylon.melody
ltx/gr_gr_cog/me.m09.d14:meMA.Ode5C1H.mode	@ltx/gr_gr_cog/miscellanea:misc.Mode8
ltx/gr_gr_cog/me.m09.d14:meMA.Ode5C1H.ode	@ltx/gr_gr_cog/miscellanea:misc.Ode5
ltx/gr_gr_cog/me.m09.d14:meMA.Ode5C1H.text	@ltx/gr_gr_cog/he.h.m8:heHE.OTrismakaristonXylon.text
ltx/gr_gr_cog/me.m09.d14:meMA.Ode6C11.greekmelody	@ltx/gr_gr_cog/he.h.m8:heHE.NotiouThiros.greekname
ltx/gr_gr_cog/me.m09.d14:meMA.Ode6C11.incipit	Ὁ γήρᾳ καμφθείς, καὶ νόσῳ…
ltx/gr_gr_cog/me.m09.d14:meMA.Ode6C11.melody	@ltx/gr_gr_cog/he.h.m8:heHE.NotiouThiros.name
ltx/gr_gr_cog/me.m09.d14:meMA.Ode6C11.mode	@ltx/gr_gr_cog/miscellanea:misc.Mode8
ltx/gr_gr_cog/me.m09.d14:meMA.Ode6C11.ode	@ltx/gr_gr_cog/miscellanea:misc.Ode6
ltx/gr_gr_cog/me.m09.d14:meMA.Ode6C11.text	Ὁ γήρᾳ καμφθείς, καὶ νόσῳ τρυχωθείς, ἀνωρθοῦτο Ἰακὼβ χεῖρας ἀμείψας, τὴν ἐνέργειαν φαίνων τοῦ ζωηφόρου Σταυροῦ· τὴν παλαιότητα καὶ γάρ, τοῦ νομικοῦ σκιώδους, γράμματος ἐκαινογράφησεν, ὁ ἐν τούτῳ σαρκὶ προσπαγεὶς Θεός, καὶ τὴν ψυχόλεθρον νόσον, τῆς πλάνης ἀπήλασε.
ltx/gr_gr_cog/me.m09.d14:meMA.Ode6C12.incipit	Νεαζούσαις θεὶς παλάμας, ὁ θεῖος…
ltx/gr_gr_cog/me.m09.d14:meMA.Ode6C12.melody	@ltx/gr_gr_cog/he.h.m8:heHE.NotiouThiros.name
ltx/gr_gr_cog/me.m09.d14:meMA.Ode6C12.mode	@ltx/gr_gr_cog/miscellanea:misc.Mode6
ltx/gr_gr_cog/me.m09.d14:meMA.Ode6C12.ode	@ltx/gr_gr_cog/miscellanea:misc.Ode8
ltx/gr_gr_cog/me.m09.d14:meMA.Ode6C12.text	Νεαζούσαις θεὶς παλάμας, ὁ θεῖος Ἰσραήλ, σταυροειδῶς κάραις ἐδήλου, ὡς πρεσβύτερον κλέος ὁ νομολάτρης λαός· ὑποπτευθεὶς ὅθεν οὕτως ἐξηπατῆσθαι, οὐκ ἠλλοίωσε τὸν ζωηφόρον τύπον· ὑπερέξει λαὸς γὰρ Χριστοῦ τοῦ Θεοῦ, νεοπαγὴς ἀνεβόα, Σταυρῷ τειχιζόμενος.
ltx/gr_gr_cog/me.m09.d14:meMA.Ode6C1H.greekmelody	@ltx/gr_gr_cog/he.h.m8:heHE.NotiouThiros.greekname
ltx/gr_gr_cog/me.m09.d14:meMA.Ode6C1H.incipit	@ltx/gr_gr_cog/he.h.m8:heHE.NotiouThiros.incipit
ltx/gr_gr_cog/me.m09.d14:meMA.Ode6C1H.melody	@ltx/gr_gr_cog/he.h.m8:heHE.NotiouThiros.melody
ltx/gr_gr_cog/me.m09.d14:meMA.Ode6C1H.mode	@ltx/gr_gr_cog/miscellanea:misc.Mode8
ltx/gr_gr_cog/me.m09.d14:meMA.Ode6C1H.ode	@ltx/gr_gr_cog/miscellanea:misc.Ode6
ltx/gr_gr_cog/me.m09.d14:meMA.Ode6C1H.text	@ltx/gr_gr_cog/he.h.m8:heHE.NotiouThiros.text
ltx/gr_gr_cog/me.m09.d14:meMA.Ode7C11.greekmelody	@ltx/gr_gr_cog/he.h.m8:heHE.EknoonProstagma.greekname
ltx/gr_gr_cog/me.m09.d14:meMA.Ode7C11.incipit	Ξύλου γευσάμενος ὁ πρῶτος ἐν…
ltx/gr_gr_cog/me.m09.d14:meMA.Ode7C11.melody	@ltx/gr_gr_cog/he.h.m8:heHE.EknoonProstagma.name
ltx/gr_gr_cog/me.m09.d14:meMA.Ode7C11.mode	@ltx/gr_gr_cog/miscellanea:misc.Mode8
ltx/gr_gr_cog/me.m09.d14:meMA.Ode7C11.ode	@ltx/gr_gr_cog/miscellanea:misc.Ode7
ltx/gr_gr_cog/me.m09.d14:meMA.Ode7C11.text	Ξύλου γευσάμενος ὁ πρῶτος ἐν βροτοῖς, φθορᾷ παρῴκησε· ῥίψιν γὰρ ζωῆς ἀτιμοτάτην κατακριθείς, ὅλῳ τῷ γένει σωματοφθόρος τις, ὡς λύμη τῆς νόσου μετέδωκεν· ἀλλʼ εὑρηκότες γηγενεῖς ἀνάκλησιν, Σταυροῦ τὸ ξύλον κράζομεν· Ὁ ὑπερύμνητος, τῶν Πατέρων καὶ ἡμῶν, Θεὸς εὐλογητὸς εἶ.
ltx/gr_gr_cog/me.m09.d14:meMA.Ode7C12.incipit	Ἔλυσε πρόσταγμα Θεοῦ παρακοή, καὶ…
ltx/gr_gr_cog/me.m09.d14:meMA.Ode7C12.melody	@ltx/gr_gr_cog/he.h.m8:heHE.EknoonProstagma.name
ltx/gr_gr_cog/me.m09.d14:meMA.Ode7C12.mode	@ltx/gr_gr_cog/miscellanea:misc.Mode8
ltx/gr_gr_cog/me.m09.d14:meMA.Ode7C12.ode	@ltx/gr_gr_cog/miscellanea:misc.Ode7
ltx/gr_gr_cog/me.m09.d14:meMA.Ode7C12.text	Ἔλυσε πρόσταγμα Θεοῦ παρακοή, καὶ ξύλον ἤνεγκε θάνατον βροτοῖς, τὸ μὴ εὐκαίρως μεταληφθέν· ἐν ἀσφαλείᾳ τῆς ἐριτίμου δέ, ἐντεῦθεν ζωῆς τὸ ξύλον εἴργετο, ὃ νυκτιλόχου δυσθανοῦς ἠνέῳξεν, εὐγνωμοσύνης κράζοντος· ὁ ὑπερύμνητος, τῶν Πατέρων καὶ ἡμῶν, Θεὸς εὐλογητὸς εἶ.
ltx/gr_gr_cog/me.m09.d14:meMA.Ode7C13.incipit	Ῥάβδου προσπτύσσεται τὸ ἄκρον, Ἰωσήφ…
ltx/gr_gr_cog/me.m09.d14:meMA.Ode7C13.melody	@ltx/gr_gr_cog/he.h.m8:heHE.EknoonProstagma.name
ltx/gr_gr_cog/me.m09.d14:meMA.Ode7C13.mode	@ltx/gr_gr_cog/miscellanea:misc.Mode8
ltx/gr_gr_cog/me.m09.d14:meMA.Ode7C13.ode	@ltx/gr_gr_cog/miscellanea:misc.Ode7
ltx/gr_gr_cog/me.m09.d14:meMA.Ode7C13.text	Ῥάβδου προσπτύσσεται τὸ ἄκρον, Ἰωσήφ, ὁ γενησόμενον, βλέπων, Ἰσραήλ, τῆς βασιλείας τὸ κραταιόν, ὅπως συνέξει ὁ ὑπερένδοξος Σταυρὸς προδηλῶν· οὗτος γὰρ τοῖς βασιλεῦσι, τροπαιοῦχον καύχημα, καὶ φῶς τοῖς πίστει κράζουσιν· ὁ ὑπερύμνητος, τῶν Πατέρων καὶ ἡμῶν, Θεὸς εὐλογητὸς εἶ.
ltx/gr_gr_cog/me.m09.d14:meMA.Ode7C1H.greekmelody	@ltx/gr_gr_cog/he.h.m8:heHE.EknoonProstagma.greekname
ltx/gr_gr_cog/me.m09.d14:meMA.Ode7C1H.incipit	@ltx/gr_gr_cog/he.h.m8:heHE.EknoonProstagma.incipit
ltx/gr_gr_cog/me.m09.d14:meMA.Ode7C1H.melody	@ltx/gr_gr_cog/he.h.m8:heHE.EknoonProstagma.melody
ltx/gr_gr_cog/me.m09.d14:meMA.Ode7C1H.mode	@ltx/gr_gr_cog/miscellanea:misc.Mode8
ltx/gr_gr_cog/me.m09.d14:meMA.Ode7C1H.ode	@ltx/gr_gr_cog/miscellanea:misc.Ode7
ltx/gr_gr_cog/me.m09.d14:meMA.Ode7C1H.text	@ltx/gr_gr_cog/he.h.m8:heHE.EknoonProstagma.text
ltx/gr_gr_cog/me.m09.d14:meMA.Ode8C11.greekmelody	@ltx/gr_gr_cog/he.h.m8:heHE.EvlogeitePaides.greekname
ltx/gr_gr_cog/me.m09.d14:meMA.Ode8C11.incipit	Ὑψουμένου ξύλου, ῥαντισθέντος ἐν αἵματι…
ltx/gr_gr_cog/me.m09.d14:meMA.Ode8C11.melody	@ltx/gr_gr_cog/he.h.m8:heHE.EvlogeitePaides.name
ltx/gr_gr_cog/me.m09.d14:meMA.Ode8C11.mode	@ltx/gr_gr_cog/miscellanea:misc.Mode8
ltx/gr_gr_cog/me.m09.d14:meMA.Ode8C11.ode	@ltx/gr_gr_cog/miscellanea:misc.Ode8
ltx/gr_gr_cog/me.m09.d14:meMA.Ode8C11.text	Ὑψουμένου ξύλου, ῥαντισθέντος ἐν αἵματι, τοῦ σαρκωθέντος Λόγου Θεοῦ, ὑμνεῖτε αἱ τῶν οὐρανῶν Δυνάμεις, βροτῶν τὴν ἀνάκλησιν ἑορτάζουσαι· Λαοὶ προσκυνεῖτε Χριστοῦ τὸν Σταυρόν, διʼ οὗ τῷ κόσμῳ ἀνάστασις εἰς τοὺς αἰῶνας.
ltx/gr_gr_cog/me.m09.d14:meMA.Ode8C12.incipit	Γηγενεῖς παλάμαις, οἰκονόμοι τῆς χάριτος…
ltx/gr_gr_cog/me.m09.d14:meMA.Ode8C12.melody	@ltx/gr_gr_cog/he.h.m8:heHE.EvlogeitePaides.name
ltx/gr_gr_cog/me.m09.d14:meMA.Ode8C12.mode	@ltx/gr_gr_cog/miscellanea:misc.Mode8
ltx/gr_gr_cog/me.m09.d14:meMA.Ode8C12.ode	@ltx/gr_gr_cog/miscellanea:misc.Ode8
ltx/gr_gr_cog/me.m09.d14:meMA.Ode8C12.text	Γηγενεῖς παλάμαις, οἰκονόμοι τῆς χάριτος, Σταυρὸν οὗ ἔστη Χριστὸς ὁ Θεός, ὑψοῦτε ἱεροπρεπῶς καὶ Λόγχην, Θεοῦ Λόγου σῶμα ἀντιτορήσασαν. Ἰδέτωσαν ἔθνη πάντα τὸ σωτήριον, τοῦ Θεοῦ δοξάζοντα εἰς τοὺς αἰῶνας.
ltx/gr_gr_cog/me.m09.d14:meMA.Ode8C13.incipit	Οἱ τῇ θείᾳ ψήφῳ, προκριθέντες…
ltx/gr_gr_cog/me.m09.d14:meMA.Ode8C13.melody	@ltx/gr_gr_cog/he.h.m8:heHE.EvlogeitePaides.name
ltx/gr_gr_cog/me.m09.d14:meMA.Ode8C13.mode	@ltx/gr_gr_cog/miscellanea:misc.Mode8
ltx/gr_gr_cog/me.m09.d14:meMA.Ode8C13.ode	@ltx/gr_gr_cog/miscellanea:misc.Ode8
ltx/gr_gr_cog/me.m09.d14:meMA.Ode8C13.text	Οἱ τῇ θείᾳ ψήφῳ, προκριθέντες ἀγάλλεσθε, Χριστιανῶν πιστοὶ Βασιλεῖς· καυχᾶσθε τῷ τροπαιοφόρῳ ὅπλῳ, λαχόντες θεόθεν, Σταυρὸν τὸν τίμιον· ἐν τούτῳ γὰρ φῦλα πολέμων, θράσος ἐπιζητοῦντα, σκεδάννυνται εἰς τοὺς αἰῶνας.
ltx/gr_gr_cog/me.m09.d14:meMA.Ode8C1H.greekmelody	@ltx/gr_gr_cog/he.h.m8:heHE.EvlogeitePaides.greekname
ltx/gr_gr_cog/me.m09.d14:meMA.Ode8C1H.incipit	@ltx/gr_gr_cog/he.h.m8:heHE.EvlogeitePaides.incipit
ltx/gr_gr_cog/me.m09.d14:meMA.Ode8C1H.melody	@ltx/gr_gr_cog/he.h.m8:heHE.EvlogeitePaides.melody
ltx/gr_gr_cog/me.m09.d14:meMA.Ode8C1H.mode	@ltx/gr_gr_cog/miscellanea:misc.Mode8
ltx/gr_gr_cog/me.m09.d14:meMA.Ode8C1H.ode	@ltx/gr_gr_cog/miscellanea:misc.Ode8
ltx/gr_gr_cog/me.m09.d14:meMA.Ode8C1H.text	@ltx/gr_gr_cog/he.h.m8:heHE.EvlogeitePaides.text
ltx/gr_gr_cog/me.m09.d14:meMA.Ode9C11.greekmelody	@ltx/gr_gr_cog/he.h.m8:heHE.MystikosEiTheotoke.greekname
ltx/gr_gr_cog/me.m09.d14:meMA.Ode9C11.incipit	Ἀγαλλέσθω τὰ δρυμοῦ ξύλα σύμπαντα…
ltx/gr_gr_cog/me.m09.d14:meMA.Ode9C11.melody	@ltx/gr_gr_cog/he.h.m8:heHE.MystikosEiTheotoke.name
ltx/gr_gr_cog/me.m09.d14:meMA.Ode9C11.mode	@ltx/gr_gr_cog/miscellanea:misc.Mode8
ltx/gr_gr_cog/me.m09.d14:meMA.Ode9C11.ode	@ltx/gr_gr_cog/miscellanea:misc.Ode9
ltx/gr_gr_cog/me.m09.d14:meMA.Ode9C11.text	Ἀγαλλέσθω τὰ δρυμοῦ ξύλα σύμπαντα, ἁγιασθείσης τῆς φύσεως αὐτῶν, ὑφʼ οὗ περ ἐξ ἀρχῆς, ἐφυτεύθη Χριστοῦ, τανυθέντος ἐν ξύλῳ· διʼ οὗ νῦν ὑψουμένου, προσκυνοῦμεν αὐτὸν καὶ μεγαλύνομεν.
ltx/gr_gr_cog/me.m09.d14:meMA.Ode9C12.incipit	Ἱερὸν ἠγέρθη κέρας θεόφροσι, τῆς…
ltx/gr_gr_cog/me.m09.d14:meMA.Ode9C12.melody	@ltx/gr_gr_cog/he.h.m8:heHE.MystikosEiTheotoke.name
ltx/gr_gr_cog/me.m09.d14:meMA.Ode9C12.mode	@ltx/gr_gr_cog/miscellanea:misc.Mode8
ltx/gr_gr_cog/me.m09.d14:meMA.Ode9C12.ode	@ltx/gr_gr_cog/miscellanea:misc.Ode9
ltx/gr_gr_cog/me.m09.d14:meMA.Ode9C12.text	Ἱερὸν ἠγέρθη κέρας θεόφροσι, τῆς κεφαλῆς τῶν ἁπάντων ὁ Σταυρός, ἐν ᾧ ἁμαρτωλῶν νοουμένων, συνθλῶνται τὰ κέρατα πάντα, διʼ οὗ νῦν ὑψουμένου, προσκυνοῦμεν αὐτὸν καὶ μεγαλύνομεν.
ltx/gr_gr_cog/me.m09.d14:meMA.Ode9C1H.greekmelody	@ltx/gr_gr_cog/he.h.m8:heHE.MystikosEiTheotoke.greekname
ltx/gr_gr_cog/me.m09.d14:meMA.Ode9C1H.incipit	@ltx/gr_gr_cog/he.h.m8:heHE.MystikosEiTheotoke.incipit
ltx/gr_gr_cog/me.m09.d14:meMA.Ode9C1H.melody	@ltx/gr_gr_cog/he.h.m8:heHE.MystikosEiTheotoke.melody
ltx/gr_gr_cog/me.m09.d14:meMA.Ode9C1H.mode	@ltx/gr_gr_cog/miscellanea:misc.Mode8
ltx/gr_gr_cog/me.m09.d14:meMA.Ode9C1H.ode	@ltx/gr_gr_cog/miscellanea:misc.Ode9
ltx/gr_gr_cog/me.m09.d14:meMA.Ode9C1H.text	@ltx/gr_gr_cog/he.h.m8:heHE.MystikosEiTheotoke.text
ltx/gr_gr_cog/me.m09.d14:meMA.Ode9C21.greekmelody	@ltx/gr_gr_cog/he.h.m8:heHE.ODiaVroseos.greekname
ltx/gr_gr_cog/me.m09.d14:meMA.Ode9C21.incipit	Μὴ τὴν πικρίαν τὴν τοῦ…
ltx/gr_gr_cog/me.m09.d14:meMA.Ode9C21.melody	@ltx/gr_gr_cog/he.h.m8:heHE.ODiaVroseos.name
ltx/gr_gr_cog/me.m09.d14:meMA.Ode9C21.mode	@ltx/gr_gr_cog/miscellanea:misc.Mode8
ltx/gr_gr_cog/me.m09.d14:meMA.Ode9C21.ode	@ltx/gr_gr_cog/miscellanea:misc.Ode9
ltx/gr_gr_cog/me.m09.d14:meMA.Ode9C21.text	Μὴ τὴν πικρίαν τὴν τοῦ ξύλου, ἐάσας ἀναιρέσιμον Κύριε, διὰ Σταυροῦ τελείως ἐξήλειψας· ὅθεν καὶ ξύλον ἔλυσε ποτέ, πικρίαν ὑδάτων Μεῤῥᾶς, προτυποῦν τοῦ Σταυροῦ τὴν ἐνέργειαν· ἣν πᾶσαι αἱ Δυνάμεις, τῶν οὐρανῶν μεγαλύνουσιν.
ltx/gr_gr_cog/me.m09.d14:meMA.Ode9C22.incipit	Ἀδιαλείπτως βαπτομένους, τῷ ζόφῳ τοῦ…
ltx/gr_gr_cog/me.m09.d14:meMA.Ode9C22.melody	@ltx/gr_gr_cog/he.h.m8:heHE.ODiaVroseos.name
ltx/gr_gr_cog/me.m09.d14:meMA.Ode9C22.mode	@ltx/gr_gr_cog/miscellanea:misc.Mode8
ltx/gr_gr_cog/me.m09.d14:meMA.Ode9C22.ode	@ltx/gr_gr_cog/miscellanea:misc.Ode9
ltx/gr_gr_cog/me.m09.d14:meMA.Ode9C22.text	Ἀδιαλείπτως βαπτομένους, τῷ ζόφῳ τοῦ προπάτορος Κύριε, διὰ Σταυροῦ ἀνύψωσας σήμερον· ὡς γὰρ τῇ πλάνῃ ἄγαν ἀκρατῶς, ἡ φύσις προκατηνέχθη, παγκλήρως ἡμᾶς πάλιν ἀνώρθωσε, τὸ φῶς τὸ τοῦ Σταυροῦ σου· ὃν οἱ πιστοὶ μεγαλύνομεν.
ltx/gr_gr_cog/me.m09.d14:meMA.Ode9C23.incipit	Ἴνα τὸν τύπον ὑποδείξῃς, τῷ…
ltx/gr_gr_cog/me.m09.d14:meMA.Ode9C23.melody	@ltx/gr_gr_cog/he.h.m8:heHE.ODiaVroseos.name
ltx/gr_gr_cog/me.m09.d14:meMA.Ode9C23.mode	@ltx/gr_gr_cog/miscellanea:misc.Mode8
ltx/gr_gr_cog/me.m09.d14:meMA.Ode9C23.ode	@ltx/gr_gr_cog/miscellanea:misc.Ode9
ltx/gr_gr_cog/me.m09.d14:meMA.Ode9C23.text	Ἴνα τὸν τύπον ὑποδείξῃς, τῷ κόσμῳ προσκυνούμενον Κύριε, τὸν τοῦ Σταυροῦ ἐν πᾶσιν ὡς ἔνδοξον, ἐν οὐρανῷ ἐμόρφωσας, φωτὶ ἀπλέτῳ ἠγλαϊσμένον, Βασιλεῖ πανοπλίαν ἀήττητον· ἣν πᾶσαι αἱ Δυνάμεις, τῶν οὐρανῶν μεγαλύνουσιν.
ltx/gr_gr_cog/me.m09.d14:meMA.Ode9C2H.greekmelody	@ltx/gr_gr_cog/he.h.m8:heHE.ODiaVroseos.greekname
ltx/gr_gr_cog/me.m09.d14:meMA.Ode9C2H.incipit	@ltx/gr_gr_cog/he.h.m8:heHE.ODiaVroseos.incipit
ltx/gr_gr_cog/me.m09.d14:meMA.Ode9C2H.melody	@ltx/gr_gr_cog/he.h.m8:heHE.ODiaVroseos.melody
ltx/gr_gr_cog/me.m09.d14:meMA.Ode9C2H.mode	@ltx/gr_gr_cog/miscellanea:misc.Mode8
ltx/gr_gr_cog/me.m09.d14:meMA.Ode9C2H.ode	@ltx/gr_gr_cog/miscellanea:misc.Ode9
ltx/gr_gr_cog/me.m09.d14:meMA.Ode9C2H.text	@ltx/gr_gr_cog/he.h.m8:heHE.ODiaVroseos.text
ltx/gr_gr_cog/me.m09.d14:meMA.Oikos1.text	Ὁ μετὰ τρίτον οὐρανὸν ἀρθεὶς ἐν Παραδείσῳ, καὶ ῥήματα τὰ ἄῤῥητα καὶ θεῖα, ἃ οὐκ ἐξὸν γλώσσαις λαλεῖν, τί τοῖς Γαλάταις γράφει, ὡς ἐρασταὶ τῶν Γραφῶν, ἀνέγνωτε καὶ ἔγνωτε. Ἐμοί, φησί, καυχᾶσθαι μὴ γένοιτο, πλὴν εἰ μὴ ἐν μόνῳ τῷ Σταυρῷ τῷ τοῦ Κυρίου, ἐν ᾧ παθών, ἔκτεινε τὰ πάθη. Αὐτὸν οὖν καὶ ἡμεῖς βεβαίως κρατῶμεν τοῦ Κυρίου τὸν Σταυρὸν καύχημα πάντες· ἔστι γὰρ σωτήριον ἡμῖν τοῦτο τὸ ξύλον, ὅπλον εἰρήνης ἀήττητον τρόπαιον.
ltx/gr_gr_cog/me.m09.d14:meMA.PostGospelBoth.incipit	@ltx/gr_gr_cog/me.m09.d14:meSV.SticGlory.incipit
ltx/gr_gr_cog/me.m09.d14:meMA.PostGospelBoth.melody	
ltx/gr_gr_cog/me.m09.d14:meMA.PostGospelBoth.mode	@ltx/gr_gr_cog/miscellanea:misc.Mode2
ltx/gr_gr_cog/me.m09.d14:meMA.PostGospelBoth.text	@ltx/gr_gr_cog/me.m09.d14:meSV.SticGlory.text
ltx/gr_gr_cog/me.m09.d14:meMA.PostGospelGlory.incipit	@ltx/gr_gr_cog/me.m09.d14:meSV.SticGlory.incipit
ltx/gr_gr_cog/me.m09.d14:meMA.PostGospelGlory.melody	
ltx/gr_gr_cog/me.m09.d14:meMA.PostGospelGlory.mode	@ltx/gr_gr_cog/miscellanea:misc.Mode2
ltx/gr_gr_cog/me.m09.d14:meMA.PostGospelGlory.text	@ltx/gr_gr_cog/me.m09.d14:meSV.SticGlory.text
ltx/gr_gr_cog/me.m09.d14:meMA.PostGospelIdiomelon.incipit	Σταυρὲ τοῦ Χριστοῦ, Χριστιανῶν ἡ…
ltx/gr_gr_cog/me.m09.d14:meMA.PostGospelIdiomelon.melody	
ltx/gr_gr_cog/me.m09.d14:meMA.PostGospelIdiomelon.mode	@ltx/gr_gr_cog/miscellanea:misc.Mode6
ltx/gr_gr_cog/me.m09.d14:meMA.PostGospelIdiomelon.text	Σταυρὲ τοῦ Χριστοῦ, Χριστιανῶν ἡ ἐλπίς, πεπλανημένων ὁδηγέ, χειμαζομένων λιμήν, ἐν πολέμοις νῖκος, οἰκουμένης ἀσφάλεια, ἀσθενούντων ἰατρέ, νεκρῶν ἡ ἀνάστασις, ἐλέησον ἡμᾶς.
ltx/gr_gr_cog/me.m09.d14:meSV.AposGlory.incipit	Δεῦτε χαρμονικῶς, ἀσπασώμεθα πάντες, τὸ…
ltx/gr_gr_cog/me.m09.d14:meSV.AposGlory.melody	@ltx/gr_gr_cog/he.a.m2:heAU.OikosTouEfratha.name
ltx/gr_gr_cog/me.m09.d14:meSV.AposGlory.mode	@ltx/gr_gr_cog/miscellanea:misc.Mode2
ltx/gr_gr_cog/me.m09.d14:meSV.AposGlory.text	Δεῦτε χαρμονικῶς, ἀσπασώμεθα πάντες, τὸ σωτήριον ξύλον, ἐν ᾧ ἐξετανύθη, Χριστὸς ἡ ἀπολύτρωσις.
ltx/gr_gr_cog/me.m09.d14:meSV.Aposticha1.incipit	Σήμερον τοῦ Χριστοῦ, ὁ Σταυρὸς…
ltx/gr_gr_cog/me.m09.d14:meSV.Aposticha1.melody	@ltx/gr_gr_cog/he.a.m2:heAU.OikosTouEfratha.name
ltx/gr_gr_cog/me.m09.d14:meSV.Aposticha1.mode	@ltx/gr_gr_cog/miscellanea:misc.Mode2
ltx/gr_gr_cog/me.m09.d14:meSV.Aposticha1.text	Σήμερον τοῦ Χριστοῦ, ὁ Σταυρὸς ἀνυψοῦται, τὸ ζωηφόρον ξύλον, ἐν ᾧ σαρκὶ ἐπάγη, πάντας ἀνακαλούμενος.
ltx/gr_gr_cog/me.m09.d14:meSV.Aposticha2.incipit	Ξύλον τὸ τοῦ Σταυροῦ, ὑψούμενον…
ltx/gr_gr_cog/me.m09.d14:meSV.Aposticha2.melody	@ltx/gr_gr_cog/he.a.m2:heAU.OikosTouEfratha.name
ltx/gr_gr_cog/me.m09.d14:meSV.Aposticha2.mode	@ltx/gr_gr_cog/miscellanea:misc.Mode2
ltx/gr_gr_cog/me.m09.d14:meSV.Aposticha2.text	Ξύλον τὸ τοῦ Σταυροῦ, ὑψούμενον ὁρῶντες, μεγαλωσύνην δῶμεν, Θεῷ τῷ σταυρωθέντι, σαρκὶ διʼ ἀγαθότητα.
ltx/gr_gr_cog/me.m09.d14:meSV.Aposticha3.incipit	Χαίροις τὸ τῶν Πιστῶν, φυλακτήριον…
ltx/gr_gr_cog/me.m09.d14:meSV.Aposticha3.melody	@ltx/gr_gr_cog/he.a.m2:heAU.OikosTouEfratha.name
ltx/gr_gr_cog/me.m09.d14:meSV.Aposticha3.mode	@ltx/gr_gr_cog/miscellanea:misc.Mode2
ltx/gr_gr_cog/me.m09.d14:meSV.Aposticha3.text	Χαίροις τὸ τῶν Πιστῶν, φυλακτήριον θεῖον, ἀπροσμάχητον τεῖχος, Σταυρὸς ὁ τοῦ Κυρίου, διʼ οὗ ἀπὸ γῆς ἤρθημεν.
ltx/gr_gr_cog/me.m09.d14:meSV.SticGlory.incipit	Σύ μου σκέπη κραταιὰ ὑπάρχεις…
ltx/gr_gr_cog/me.m09.d14:meSV.SticGlory.melody	
ltx/gr_gr_cog/me.m09.d14:meSV.SticGlory.mode	@ltx/gr_gr_cog/miscellanea:misc.Mode2
ltx/gr_gr_cog/me.m09.d14:meSV.SticGlory.text	Σύ μου σκέπη κραταιὰ ὑπάρχεις, ὁ τριμερὴς Σταυρὸς τοῦ Χριστοῦ, ἁγίασόν με τῇ δυνάμει σου, ἵνα πίστει καὶ πόθῳ προσκυνῶ καὶ δοξάζω σε.
ltx/gr_gr_cog/me.m09.d14:meSV.Stichera1.incipit	Ὑψουμένου σου Δέσποτα, ἐν Σταυρῷ…
ltx/gr_gr_cog/me.m09.d14:meSV.Stichera1.melody	@ltx/gr_gr_cog/he.a.m4:heAU.OsGennaionEnMartysi.name
ltx/gr_gr_cog/me.m09.d14:meSV.Stichera1.mode	@ltx/gr_gr_cog/miscellanea:misc.Mode4
ltx/gr_gr_cog/me.m09.d14:meSV.Stichera1.text	Ὑψουμένου σου Δέσποτα, ἐν Σταυρῷ συνανύψωσας, τοῦ Ἀδὰμ τὴν ἔκπτωτον, φύσιν ἅπασαν· διὸ ὑψοῦντες τὸν ἄχραντον, Σταυρόν σου φιλάνθρωπε, τὴν ἐξ ὕψους σου ἰσχύν, ἐξαιτοῦμεν κραυγάζοντες· Σῶσον Ὑψιστε, ὡς Θεὸς ἐλεήμων τοὺς τιμῶντας, τὴν σεπτήν τε καὶ φωσφόρον, τοῦ σοῦ Σταυροῦ θείαν ὕψωσιν.
ltx/gr_gr_cog/me.m09.d14:meSV.Stichera2.incipit	Ψαλμικῶς νυνὶ βλέπομεν, ὑποπόδιον Δέσποτα…
ltx/gr_gr_cog/me.m09.d14:meSV.Stichera2.melody	@ltx/gr_gr_cog/he.a.m4:heAU.OsGennaionEnMartysi.name
ltx/gr_gr_cog/me.m09.d14:meSV.Stichera2.mode	@ltx/gr_gr_cog/miscellanea:misc.Mode4
ltx/gr_gr_cog/me.m09.d14:meSV.Stichera2.text	Ψαλμικῶς νυνὶ βλέπομεν, ὑποπόδιον Δέσποτα, ἔνθα πόδες ἔστησαν, σοῦ οἱ ἄχραντοι, σήμερον πόθῳ ὑψούμενον, Σταυρόν σου τὸν τίμιον, καὶ ὑψοῦντες εὐσεβῶς, δυσωποῦμέν σε κράζοντες· Πάντας Ὕψιστε, τῷ Σταυρῷ σου τῷ θείῳ ἁγιάσας, τῆς ἀφάτου εὐσπλαγχνίας, μετόχους δεῖξον καὶ χάριτος.
ltx/gr_gr_cog/me.m09.d14:meSV.Stichera3.incipit	Ὡς ἀήττητον τρόπαιον, θυρεὸν ἀπροσμάχητον…
ltx/gr_gr_cog/me.m09.d14:meSV.Stichera3.melody	@ltx/gr_gr_cog/he.a.m4:heAU.OsGennaionEnMartysi.name
ltx/gr_gr_cog/me.m09.d14:meSV.Stichera3.mode	@ltx/gr_gr_cog/miscellanea:misc.Mode4
ltx/gr_gr_cog/me.m09.d14:meSV.Stichera3.text	Ὡς ἀήττητον τρόπαιον, θυρεὸν ἀπροσμάχητον· καὶ ὡς σκῆπτρον ἔνθεον, προσκυνοῦμέν σου, Σταυρὸν Χριστὲ τὸν πανάγιον, διʼ οὗ κόσμος σέσωσται, καὶ χορεύει ὁ Ἀδάμ, γηγενῶν τὰ συστήματα, τοῦτον ᾄσμασιν, εὐφημοῦντες τιμῶμεν, καὶ τὴν τούτου, θείαν Ὕψωσιν τελοῦντες, τὸν ἱλασμὸν ἐξαιτούμεθα.
ltx/gr_gr_cog/me.m09.d14:meVE.Apolytikion1.incipit	Σῶσον, Κύριε, τὸν λαόν σου…
ltx/gr_gr_cog/me.m09.d14:meVE.Apolytikion1.melody	
ltx/gr_gr_cog/me.m09.d14:meVE.Apolytikion1.mode	@ltx/gr_gr_cog/miscellanea:misc.Mode1
ltx/gr_gr_cog/me.m09.d14:meVE.Apolytikion1.text	Σῶσον, Κύριε, τὸν λαόν σου καὶ εὐλόγησον τὴν κληρονομίαν σου, νίκας τοῖς βασιλεῦσι κατὰ βαρβάρων δωρούμενος, καὶ τὸ σὸν φυλάττων διὰ τοῦ Σταυροῦ σου πολίτευμα.
ltx/gr_gr_cog/me.m09.d14:meVE.AposGlory.incipit	Ὅνπερ πάλαι Μωυσῆς…
ltx/gr_gr_cog/me.m09.d14:meVE.AposGlory.melody	
ltx/gr_gr_cog/me.m09.d14:meVE.AposGlory.mode	@ltx/gr_gr_cog/miscellanea:misc.Mode8
ltx/gr_gr_cog/me.m09.d14:meVE.AposGlory.poet	@ltx/gr_gr_cog/poets:po.IoannouMonachou
ltx/gr_gr_cog/me.m09.d14:meVE.AposGlory.text	Ὅνπερ πάλαι Μωυσῆς, προτυπώσας ἐν ἑαυτῷ, τὸν Ἀμαλὴκ καταβαλὼν ἐτροπώσατο· καὶ Δαυΐδ ὁ μελῳδός, ὑποπόδιόν σοι βοῶν, προσκυνεῖσθαι διετάξατο, τίμιον Σταυρόν σου Χριστὲ ὁ Θεός, σήμερον ἁμαρτωλοὶ προσκυνοῦντες χείλεσιν ἀναξίοις, σὲ τὸν καταξιώσαντα, παγῆναι ἐν αὐτῷ, ἀνυμνοῦντες βοῶμέν σοι· Κύριε, σὺν τῷ ληστῇ τῆς βασιλείας σου ἀξίωσον ἡμᾶς.
ltx/gr_gr_cog/me.m09.d14:meVE.Aposticha1.greekmelody	@ltx/gr_gr_cog/he.a.m5:heAU.ChairoisAskitikon.greekname
ltx/gr_gr_cog/me.m09.d14:meVE.Aposticha1.incipit	@ltx/gr_gr_cog/me.m09.d13:meVE.Aposticha1.incipit
ltx/gr_gr_cog/me.m09.d14:meVE.Aposticha1.melody	@ltx/gr_gr_cog/he.a.m5:heAU.ChairoisAskitikon.name
ltx/gr_gr_cog/me.m09.d14:meVE.Aposticha1.mode	@ltx/gr_gr_cog/miscellanea:misc.Mode5
ltx/gr_gr_cog/me.m09.d14:meVE.Aposticha1.text	@ltx/gr_gr_cog/me.m09.d13:meVE.Aposticha1.text
ltx/gr_gr_cog/me.m09.d14:meVE.Aposticha2.incipit	@ltx/gr_gr_cog/me.m09.d13:meVE.Aposticha2.incipit
ltx/gr_gr_cog/me.m09.d14:meVE.Aposticha2.melody	@ltx/gr_gr_cog/he.a.m5:heAU.ChairoisAskitikon.name
ltx/gr_gr_cog/me.m09.d14:meVE.Aposticha2.mode	@ltx/gr_gr_cog/miscellanea:misc.Mode5
ltx/gr_gr_cog/me.m09.d14:meVE.Aposticha2.text	@ltx/gr_gr_cog/me.m09.d13:meVE.Aposticha2.text
ltx/gr_gr_cog/me.m09.d14:meVE.Aposticha3.incipit	@ltx/gr_gr_cog/me.m09.d13:meVE.Aposticha3.incipit
ltx/gr_gr_cog/me.m09.d14:meVE.Aposticha3.melody	@ltx/gr_gr_cog/he.a.m5:heAU.ChairoisAskitikon.name
ltx/gr_gr_cog/me.m09.d14:meVE.Aposticha3.mode	@ltx/gr_gr_cog/miscellanea:misc.Mode5
ltx/gr_gr_cog/me.m09.d14:meVE.Aposticha3.text	@ltx/gr_gr_cog/me.m09.d13:meVE.Aposticha3.text
ltx/gr_gr_cog/me.m09.d14:meVE.Lity1.incipit	Σήμερον ὡς ἀληθῶς, ἡ ἁγιόφθογγος…
ltx/gr_gr_cog/me.m09.d14:meVE.Lity1.melody	
ltx/gr_gr_cog/me.m09.d14:meVE.Lity1.mode	@ltx/gr_gr_cog/miscellanea:misc.Mode1
ltx/gr_gr_cog/me.m09.d14:meVE.Lity1.poet	@ltx/gr_gr_cog/poets:po.AndreouIerosolymitou
ltx/gr_gr_cog/me.m09.d14:meVE.Lity1.text	Σήμερον ὡς ἀληθῶς, ἡ ἁγιόφθογγος ῥῆσις τοῦ Δαυῒδ πέρας εἴληφεν· ἰδοὺ γὰρ ἐμφανῶς, τὸ τῶν ἀχράντων ποδῶν σου προσκυνοῦμεν ὑποπόδιον· καὶ ἐν τῇ τῶν πτερύγων σου ἐλπίζοντες σκιᾷ, πανοικτίρμον βοῶμέν σοι· Σημειωθήτω ἐφʼ ἡμᾶς τὸ φῶς τοῦ προσώπου σου, καὶ ἀνύψωσον τοῦ ὀρθοδόξου λαοῦ σου τὸ κέρας, τῇ τοῦ τιμίου Σταυροῦ σου ἀνυψώσει, Χριστὲ πολυέλεε.
ltx/gr_gr_cog/me.m09.d14:meVE.Lity2.incipit	Τὸ φυτευθὲν ἐν Κρανίου τόπῳ…
ltx/gr_gr_cog/me.m09.d14:meVE.Lity2.melody	
ltx/gr_gr_cog/me.m09.d14:meVE.Lity2.mode	@ltx/gr_gr_cog/miscellanea:misc.Mode1
ltx/gr_gr_cog/me.m09.d14:meVE.Lity2.text	Τὸ φυτευθὲν ἐν Κρανίου τόπῳ ξύλον τῆς ὄντως ζωῆς, ἐν ᾧ εἰργάσατο σωτηρίαν ὁ τῶν αἰώνων Βασιλεύς, ἐν μέσῳ τῆς γῆς, ὑψούμενον σήμερον ἁγιάζει τοῦ κόσμου τὰ πέρατα, καὶ ἐγκαινίζεται τῆς Ἀναστάσεως ὁ οἶκος· ἀγάλλονται Ἄγγελοι ἐν οὐρανῷ, καὶ εὐφραίνονται ἄνθρωποι ἐπὶ τῆς γῆς, δαυϊτικῶς βοῶντες καὶ λέγοντες· Ὑψοῦτε Κύριον τὸν Θεὸν ἡμῶν, καὶ προσκυνεῖτε τῷ ὑποποδίῳ τῶν ποδῶν αὐτοῦ, ὅτι ἅγιός ἐστιν ὁ παρέχων τῷ κόσμῳ τὸ μέγα ἔλεος.
ltx/gr_gr_cog/me.m09.d14:meVE.Lity3.incipit	Προτυπῶν τὸν Σταυρόν σου Χριστέ…
ltx/gr_gr_cog/me.m09.d14:meVE.Lity3.melody	
ltx/gr_gr_cog/me.m09.d14:meVE.Lity3.mode	@ltx/gr_gr_cog/miscellanea:misc.Mode1
ltx/gr_gr_cog/me.m09.d14:meVE.Lity3.text	Προτυπῶν τὸν Σταυρόν σου Χριστέ, ὁ πατριάρχης Ἰακώβ, τοῖς ἐγγόνοις τὴν εὐλογίαν χαριζόμενος, ἐπὶ ταῖς κάραις ἐναλλὰξ τὰς χεῖρας ἐπέθηκε· τοῦτον δὲ Σωτήρ ἡμεῖς, σήμερον ἀνυψοῦντες κραυγάζομεν· Δώρησαι τῷ φιλοχρίστῳ Βασιλεῖ τὸ νῖκος, ὡς Κωνσταντίνῳ τὸ τρόπαιον.
ltx/gr_gr_cog/me.m09.d14:meVE.Lity4.incipit	@ltx/gr_gr_cog/me.m09.d13:meVE.AposBoth.incipit
ltx/gr_gr_cog/me.m09.d14:meVE.Lity4.melody	
ltx/gr_gr_cog/me.m09.d14:meVE.Lity4.mode	@ltx/gr_gr_cog/miscellanea:misc.Mode2
ltx/gr_gr_cog/me.m09.d14:meVE.Lity4.poet	@ltx/gr_gr_cog/poets:po.Theofanous
ltx/gr_gr_cog/me.m09.d14:meVE.Lity4.text	@ltx/gr_gr_cog/me.m09.d13:meVE.AposBoth.text
ltx/gr_gr_cog/me.m09.d14:meVE.Lity5.incipit	Ἡ τῶν χειρῶν ἐναλλαγὴ τοῦ…
ltx/gr_gr_cog/me.m09.d14:meVE.Lity5.melody	
ltx/gr_gr_cog/me.m09.d14:meVE.Lity5.mode	@ltx/gr_gr_cog/miscellanea:misc.Mode2
ltx/gr_gr_cog/me.m09.d14:meVE.Lity5.poet	@ltx/gr_gr_cog/poets:po.Kyprianou
ltx/gr_gr_cog/me.m09.d14:meVE.Lity5.text	Ἡ τῶν χειρῶν ἐναλλαγὴ τοῦ Πατριάρχου Ἰακώβ, ἐπʼ εὐλογίᾳ τῶν τέκνων, τὸ κραταιὸν τοῦ Σταυροῦ σου προεδήλωσε σύμβολον· ὅν περ ἡμεῖς κατέχοντες ἀῤῥαγὲς φυλακτήριον, τὴν τῶν δαιμόνων πανσθενῶς ἐκδιώκομεν φάλαγγα, καὶ τοῦ Βελίαρ ἐν αὐτῷ τὴν ὀφρὺν καταβαλόντες, τοῦ ἐχθίστου Ἀμαλὴκ τροπούμεθα τὴν πανώλεθρον δύναμιν. Αὐτόν καὶ νῦν ἀνυψούμενον, εὐσεβοφρόνως οἱ πιστοί, εἰς ἱλασμὸν ἁμαρτιῶν, τῇ σῇ ἀγαθότητι, ἐν πολλῷ πλείονι φωνῇ βοῶντες προσφέρομεν· Κύριε ἐλέησον, ὁ ἐκ Παρθένου σαρκωθείς· οἴκτιρον τὸ τῶν χειρῶν σου ἀγαθέ, σοφὸν δημιούργημα.
ltx/gr_gr_cog/me.m09.d14:meVE.Lity6.incipit	@ltx/gr_gr_cog/me.m09.d14:meSV.SticGlory.incipit
ltx/gr_gr_cog/me.m09.d14:meVE.Lity6.melody	
ltx/gr_gr_cog/me.m09.d14:meVE.Lity6.mode	@ltx/gr_gr_cog/miscellanea:misc.Mode2
ltx/gr_gr_cog/me.m09.d14:meVE.Lity6.poet	@ltx/gr_gr_cog/poets:po.LeontosDespotou
ltx/gr_gr_cog/me.m09.d14:meVE.Lity6.text	@ltx/gr_gr_cog/me.m09.d14:meSV.SticGlory.text
ltx/gr_gr_cog/me.m09.d14:meVE.Lity7.incipit	Κροτήσωμεν σήμερον ᾀσματικὴν πανήγυριν, καὶ…
ltx/gr_gr_cog/me.m09.d14:meVE.Lity7.melody	
ltx/gr_gr_cog/me.m09.d14:meVE.Lity7.mode	@ltx/gr_gr_cog/miscellanea:misc.Mode4
ltx/gr_gr_cog/me.m09.d14:meVE.Lity7.text	Κροτήσωμεν σήμερον ᾀσματικὴν πανήγυριν, καὶ φαιδρῷ τῷ προσώπῳ, καὶ τῇ γλώττῃ τρανῶς βοήσωμεν· ὁ διʼ ἡμᾶς Χριστέ, κρίσιν καταδεξάμενος, καὶ ἐμπτυσμοὺς καὶ μάστιγας, καὶ τὸ κόκκινον περιβαλόμενος, καὶ ἐν Σταυρῷ ἀνελθών· ὃν ἰδὼν ὁ ἥλιος καὶ ἡ σελήνη, τὸ φέγγος ἀπέκρυψαν, καὶ τῷ φόβῳ γῆ ἐσείετο, καὶ τὸ καταπέτασμα τοῦ ναοῦ ἐσχίσθη διχῶς· αὐτὸς καὶ νῦν δώρησαι, τὸν Σταυρόν σου τὸν τίμιον, ἡμῖν φρουρὸν καὶ φύλακα, καὶ ἐλατῆρα τῶν δαιμόνων, ἵνα πάντες προσπτυσσόμενοι, βοῶμεν αὐτῷ· Σῶσον ἡμᾶς Σταυρὲ τῇ δυνάμει σου· ἁγίασον ἡμᾶς τῇ λαμπρότητί σου, τίμιε Σταυρέ, καὶ κραταίωσον ἡμᾶς τῇ ὑψώσει σου· ὅτι φῶς ἡμῖν δεδώρησαι, καὶ σωτηρία τῶν ψυχῶν ἡμῶν.
ltx/gr_gr_cog/me.m09.d14:meVE.Lity8.incipit	Φωτολαμπὴς ἀστέρων τύπος, προεδείκνυε Σταυρέ…
ltx/gr_gr_cog/me.m09.d14:meVE.Lity8.melody	
ltx/gr_gr_cog/me.m09.d14:meVE.Lity8.mode	@ltx/gr_gr_cog/miscellanea:misc.Mode4
ltx/gr_gr_cog/me.m09.d14:meVE.Lity8.poet	@ltx/gr_gr_cog/poets:po.Anatoliou
ltx/gr_gr_cog/me.m09.d14:meVE.Lity8.text	Φωτολαμπὴς ἀστέρων τύπος, προεδείκνυε Σταυρέ, τρόπαιον νίκης εὐσεβεῖ ἄνακτι τῷ πάνυ· οὗ ἡ μήτηρ Ἑλένη ἀνευραμένη, κοσμοφανῆ πεποίηκε· καὶ σὲ σήμερον ἀνυψοῦντες τῶν πιστῶν αἱ χορεῖαι κραυγάζομεν· Φώτισον ἡμᾶς τῇ ἐλλάμψει σου, Σταυρὲ ζωηφόρε· ἁγίασον ἡμᾶς τῇ ἰσχύϊ σου, πανσέβαστε Σταυρέ· καὶ κράτυνον ἡμᾶς, τῇ ὑψώσει σου, ὑψούμενος πρὸς παράταξιν ἐχθρῶν.
ltx/gr_gr_cog/me.m09.d14:meVE.LityGlory.incipit	Τοῦ τιμίου Σταυροῦ Χριστὲ τὴν…
ltx/gr_gr_cog/me.m09.d14:meVE.LityGlory.melody	
ltx/gr_gr_cog/me.m09.d14:meVE.LityGlory.mode	@ltx/gr_gr_cog/miscellanea:misc.Mode4
ltx/gr_gr_cog/me.m09.d14:meVE.LityGlory.poet	@ltx/gr_gr_cog/poets:po.Anatoliou
ltx/gr_gr_cog/me.m09.d14:meVE.LityGlory.text	Τοῦ τιμίου Σταυροῦ Χριστὲ τὴν ἐνέργειαν, προδιατυπώσας Μωϋσῆς, ἐτροπώσατο τὸν ἐναντίον Ἀμαλήκ, ἐν τῇ ἐρήμῳ Σινᾷ· ὅτε γὰρ ἐφήπλου τὰς χεῖρας, Σταυροῦ τὸν τύπον ποιῶν, ἐνίσχυεν ὁ λαός· νυνὶ τῶν πραγμάτων ἡ ἔκβασις εἰς ἡμᾶς πεπλήρωται. Σήμερον Σταυρὸς ὑψοῦται, καὶ δαίμονες φυγαδεύονται. Σήμερον ἡ κτίσις πᾶσα ἐκ τῆς φθορᾶς ἠλευθέρωται· πάντα γὰρ διὰ Σταυροῦ, ἐπέλαμψεν ἡμῖν τὰ χαρίσματα· διὸ γηθόμενοι πάντες, προσπίπτομέν σοι, λέγοντες· Ὡς ἐμεγαλύνθη τὰ ἔργα σου, Κύριε δόξα σοι.
ltx/gr_gr_cog/me.m09.d14:meVE.MM.Stichera1123as78910.text	@ltx/gr_gr_cog/properties:media.key
ltx/gr_gr_cog/me.m09.d14:meVE.SticGlory.incipit	Δεῦτε ἅπαντα τὰ ἔθνη, τὸ…
ltx/gr_gr_cog/me.m09.d14:meVE.SticGlory.melody	
ltx/gr_gr_cog/me.m09.d14:meVE.SticGlory.mode	@ltx/gr_gr_cog/miscellanea:misc.Mode2
ltx/gr_gr_cog/me.m09.d14:meVE.SticGlory.text	Δεῦτε ἅπαντα τὰ ἔθνη, τὸ εὐλογημένον ξύλον προσκυνήσωμεν, διʼ οὗ γέγονεν ἡ αἰώνιος δικαιοσύνη· τὸν γὰρ Προπάτορα Ἀδάμ, ὁ ἀπατήσας ἐν ξύλῳ, τῷ Σταυρῷ δελεάζεται· καὶ πίστει κατενεχθεὶς πτῶμα ἐξαίσιον, ὁ τυραννίδι κρατήσας τοῦ βασιλείου πλάσματος, Αἵματι Θεοῦ, ὁ ἰὸς τοῦ ὄφεως ἀποπλύνεται· καὶ κατάρα λέλυται, καταδίκης δικαίας, ἀδίκῳ δίκῃ τοῦ δικαίου κατακριθέντος· ξύλῳ γὰρ ἔδει τὸ ξύλον ἰάσασθαι, καὶ πάθει τοῦ ἀπαθοῦς, τὰ ἐν ξύλῳ λῦσαι πάθη τοῦ κατακρίτου. Ἀλλὰ δόξα Χριστὲ Βασιλεῦ, τῇ περὶ ἡμᾶς σου φρικτῇ οικονομίᾳ διʼ ἧς ἔσωσας πάντας, ὡς ἀγαθὸς καὶ φιλάνθρωπος.
ltx/gr_gr_cog/me.m09.d14:meVE.Stichera01.greekmelody	@ltx/gr_gr_cog/he.a.m6:heAU.OlinApothemenoi.greekname
ltx/gr_gr_cog/me.m09.d14:meVE.Stichera01.incipit	Σταυρὸς ἀνυψούμενος, τοῦ ἐν αὐτῷ…
ltx/gr_gr_cog/me.m09.d14:meVE.Stichera01.melody	@ltx/gr_gr_cog/he.a.m6:heAU.OlinApothemenoi.name
ltx/gr_gr_cog/me.m09.d14:meVE.Stichera01.mode	@ltx/gr_gr_cog/miscellanea:misc.Mode6
ltx/gr_gr_cog/me.m09.d14:meVE.Stichera01.text	Σταυρὸς ἀνυψούμενος, τοῦ ἐν αὐτῷ ὑψωθέντος, τὸ πάθος τὸ ἄχραντον, ἀνυμνεῖν προτρέπεται κτίσιν ἅπασαν· ἐν αὐτῷ κτείνας γάρ, τὸν ἡμᾶς κτείναντα, νεκρωθέντας ἀνεζώωσε, καὶ κατεκάλλυνε, καὶ εἰς οὐρανοὺς πολιτεύεσθαι, ἠξίωσεν ὡς εὔσπλαγχνος, διʼ ὑπερβολὴν ἀγαθότητος· ὅθεν γεγηθότες, ὑψώσωμεν τὸ ὄνομα αὐτοῦ, καὶ τὴν αὐτοῦ μεγαλύνωμεν, ἄκραν συγκατάβασιν.
ltx/gr_gr_cog/me.m09.d14:meVE.Stichera02.incipit	Μωσῆς προετύπου σε, χεῖρας ἐκτείνας…
ltx/gr_gr_cog/me.m09.d14:meVE.Stichera02.melody	@ltx/gr_gr_cog/he.a.m6:heAU.OlinApothemenoi.name
ltx/gr_gr_cog/me.m09.d14:meVE.Stichera02.mode	@ltx/gr_gr_cog/miscellanea:misc.Mode6
ltx/gr_gr_cog/me.m09.d14:meVE.Stichera02.text	Μωσῆς προετύπου σε, χεῖρας ἐκτείνας εἰς ὕψος, καὶ κατατροπούμενος, Ἀμαλὴκ τὸν τύραννον, Σταυρὲ τίμιε, τῶν πιστῶν καύχημα, Ἀθλητῶν στήριγμα, Ἀποστόλων ἐγκαλλώπισμα, Δικαίων πρόμαχε, πάντων τῶν Ὁσίων διάσωσμα· διό σε ἀνυψούμενον, βλέπουσα ἡ κτίσις εὐφραίνεται, καὶ πανηγυρίζει, δοξάζουσα Χριστὸν τὸν διὰ σοῦ, τὰ διεστῶτα συνάψαντα, ἄκρᾳ ἀγαθότητι.
ltx/gr_gr_cog/me.m09.d14:meVE.Stichera03.incipit	Σταυρὲ πανσεβάσμιε, ὅν περιέπουσι τάξεις…
ltx/gr_gr_cog/me.m09.d14:meVE.Stichera03.melody	@ltx/gr_gr_cog/he.a.m6:heAU.OlinApothemenoi.name
ltx/gr_gr_cog/me.m09.d14:meVE.Stichera03.mode	@ltx/gr_gr_cog/miscellanea:misc.Mode6
ltx/gr_gr_cog/me.m09.d14:meVE.Stichera03.text	Σταυρὲ πανσεβάσμιε, ὅν περιέπουσι τάξεις, Ἀγγέλων γηθόμεναι, σήμερον ὑψούμενος, θείῳ νεύματι, ἀνυψοῖς ἅπαντας, τοὺς κλοπῇ βρώσεως, ἀπωσθέντας καὶ εἰς θάνατον, κατολισθήσαντας· ὅθεν σε καρδίᾳ καὶ χείλεσι, πιστῶς περιπτυσσόμενοι, τὸν ἁγιασμὸν ἀρυόμεθα· Ὑψοῦτε βοῶντες, Χριστὸν τὸν ὑπεράγαθον Θεόν, καὶ τὸ αὐτοῦ προσκυνήσατε, θεῖον ὑποπόδιον.
