ltx/gr_gr_cog/le.go.mc.d145:lemcLI.Gospel.book_abbr	@ltx/gr_gr_cog/bible:Matthew.abbr
ltx/gr_gr_cog/le.go.mc.d145:lemcLI.Gospel.book_string	@ltx/gr_gr_cog/bible:Matthew.text
ltx/gr_gr_cog/le.go.mc.d145:lemcLI.Gospel.chapverse	11:27 – 30
ltx/gr_gr_cog/le.go.mc.d145:lemcLI.Gospel.incipit	Πάντα μοι παρεδόθη…
ltx/gr_gr_cog/le.go.mc.d145:lemcLI.Gospel.text	Εἶπεν ὁ Κύριος τοῖς ἑαυτοῦ μαθηταῖς· Πάντα μοι παρεδόθη ὑπὸ τοῦ πατρός μου· καὶ οὐδεὶς ἐπιγινώσκει τὸν υἱὸν εἰ μὴ ὁ πατήρ, οὐδὲ τὸν πατέρα τις ἐπιγινώσκει εἰ μὴ ὁ υἱὸς καὶ ᾧ ἐὰν βούληται ὁ υἱὸς ἀποκαλύψαι. Δεῦτε πρός με πάντες οἱ κοπιῶντες καὶ πεφορτισμένοι, κἀγὼ ἀναπαύσω ὑμᾶς. ἄρατε τὸν ζυγόν μου ἐφ᾿ ὑμᾶς καὶ μάθετε ἀπ᾿ ἐμοῦ, ὅτι πρᾷός εἰμι καὶ ταπεινὸς τῇ καρδίᾳ, καὶ εὑρήσετε ἀνάπαυσιν ταῖς ψυχαῖς ὑμῶν· ὁ γὰρ ζυγός μου χρηστὸς καὶ τὸ φορτίον μου ἐλαφρόν ἐστιν.
ltx/gr_gr_cog/le.go.mc.d145:lemcLI.Gospel.title	Τῇ Πέμπτῃ τῆς Δʹ Ἑβδομάδος τοῦ Ματθαίου
ltx/gr_gr_cog/le.go.mc.d145:lemcLI.Gospel.title_abbr	Πέμπτῃ τῆς Δʹ Ἑβδομάδος
ltx/gr_gr_cog/le.go.mc.d145:lemcLI.Gospel.version	@ltx/gr_gr_cog/properties:version.designation
