ltx/gr_gr_cog/le.go.me.m09.d07:lemeLI.Gospel.book_abbr	@ltx/gr_gr_cog/le.go.lu.d079:leluLI.Gospel.book_abbr
ltx/gr_gr_cog/le.go.me.m09.d07:lemeLI.Gospel.book_string	@ltx/gr_gr_cog/le.go.lu.d079:leluLI.Gospel.book_string
ltx/gr_gr_cog/le.go.me.m09.d07:lemeLI.Gospel.chapverse	@ltx/gr_gr_cog/le.go.lu.d079:leluLI.Gospel.chapverse
ltx/gr_gr_cog/le.go.me.m09.d07:lemeLI.Gospel.incipit	@ltx/gr_gr_cog/le.go.lu.d079:leluLI.Gospel.incipit
ltx/gr_gr_cog/le.go.me.m09.d07:lemeLI.Gospel.text	@ltx/gr_gr_cog/le.go.lu.d079:leluLI.Gospel.text
ltx/gr_gr_cog/le.go.me.m09.d07:lemeLI.Gospel.title	Τοῦ Μάρτυρος
ltx/gr_gr_cog/le.go.me.m09.d07:lemeLI.Gospel.title_abbr	Τοῦ Μάρτυρος
ltx/gr_gr_cog/le.go.me.m09.d07:lemeLI.Gospel.version	@ltx/gr_gr_cog/le.go.lu.d079:leluLI.Gospel.version
