ltx/gr_gr_cog/le.ep.mc.d112:lemcLI.Epistle.book_abbr	@ltx/gr_gr_cog/bible:Acts.abbr
ltx/gr_gr_cog/le.ep.mc.d112:lemcLI.Epistle.book_string	@ltx/gr_gr_cog/bible:Acts.text
ltx/gr_gr_cog/le.ep.mc.d112:lemcLI.Epistle.chapverse	20:7 – 12
ltx/gr_gr_cog/le.ep.mc.d112:lemcLI.Epistle.incipit	Συνηγμένων τῶν μαθητῶν κλάσαι ἄρτον…
ltx/gr_gr_cog/le.ep.mc.d112:lemcLI.Epistle.text	Ἐν ταῖς ἡμέραις ἐκείναις, συνηγμένων τῶν μαθητῶν κλάσαι ἄρτον, ὁ Παῦλος διελέγετο αὐτοῖς, μέλλων ἐξιέναι τῇ ἐπαύριον, παρέτεινέ τε τὸν λόγον μέχρι μεσονυκτίου. ἦσαν δὲ λαμπάδες ἱκαναὶ ἐν τῷ ὑπερῴῳ οὗ ἦμεν συνηγμένοι. καθήμενος δέ τις νεανίας ὀνόματι Εὔτυχος ἐπὶ τῆς θυρίδος, καταφερόμενος ὕπνῳ βαθεῖ διαλεγομένου τοῦ Παύλου ἐπὶ πλεῖον, κατενεχθεὶς ἀπὸ τοῦ ὕπνου ἔπεσεν ἀπὸ τοῦ τριστέγου κάτω καὶ ἤρθη νεκρός. καταβὰς δὲ ὁ Παῦλος ἐπέπεσεν αὐτῷ καὶ συμπεριλαβὼν εἶπε· μὴ θορυβεῖσθε· ἡ γὰρ ψυχὴ αὐτοῦ ἐν αὐτῷ ἐστιν. ἀναβὰς δὲ καὶ κλάσας ἄρτον καὶ γευσάμενος, ἐφ᾿ ἱκανόν τε ὁμιλήσας ἄχρις αὐγῆς, οὕτως ἐξῆλθεν. ἤγαγον δὲ τὸν παῖδα ζῶντα, καὶ παρεκλήθησαν οὐ μετρίως.
ltx/gr_gr_cog/le.ep.mc.d112:lemcLI.Epistle.title	Τῷ Σαββάτῳ τῆς Ϛʹ Ἑβδομάδος
ltx/gr_gr_cog/le.ep.mc.d112:lemcLI.Epistle.title_abbr	Σαββάτῳ τῆς Ϛʹ Ἑβδομάδος
ltx/gr_gr_cog/le.ep.mc.d112:lemcLI.Epistle.version	@ltx/gr_gr_cog/properties:version.designation
