ltx/gr_gr_cog/ty.typikon.parts:tyLDP.Eothinon	Ἑωθινόν:
ltx/gr_gr_cog/ty.typikon.parts:tyLDP.ModeOfWeek	Ἦχος τῆς ἑβδομάδος:
ltx/gr_gr_cog/ty.typikon.parts:tyNote	Σημείωσις:
ltx/gr_gr_cog/ty.typikon.parts:tyPart.AfterCommunion	Μετὰ τὴν Θ. Κοινωνίαν:
ltx/gr_gr_cog/ty.typikon.parts:tyPart.AfterEntrance	Μετὰ τήν Εἴσοδον.
ltx/gr_gr_cog/ty.typikon.parts:tyPart.AfterOde3	Ἀπὸ γʹ ᾨδῆς·
ltx/gr_gr_cog/ty.typikon.parts:tyPart.AfterOde3MidodeKathisma	Ἀπὸ γʹ ᾨδῆς, Μεσῴδιον Κάθισμα:
ltx/gr_gr_cog/ty.typikon.parts:tyPart.AfterOde6	Ἀπὸ Ϛʹ ᾨδῆς·
ltx/gr_gr_cog/ty.typikon.parts:tyPart.AfterPsalm50	Μετὰ τὸν Νʹ Ψαλμόν, 
ltx/gr_gr_cog/ty.typikon.parts:tyPart.AmboPrayer	Ὀπισθάμβωνος Εὐχή:
ltx/gr_gr_cog/ty.typikon.parts:tyPart.Anavathmoi	Ἀναβαθμοί:
ltx/gr_gr_cog/ty.typikon.parts:tyPart.Antiphons	Ἀντίφωνα:
ltx/gr_gr_cog/ty.typikon.parts:tyPart.Apolytikia	Ἀπολυτίκια:
ltx/gr_gr_cog/ty.typikon.parts:tyPart.Apolytikion	Ἀπολυτίκιον:
ltx/gr_gr_cog/ty.typikon.parts:tyPart.Aposticha	Ἀπόστιχα:
ltx/gr_gr_cog/ty.typikon.parts:tyPart.AtDiptychs	Εἰς τὰ Δίπτυχα:
ltx/gr_gr_cog/ty.typikon.parts:tyPart.AtEntrance	Εἰς τὴν Εἴσοδον:
ltx/gr_gr_cog/ty.typikon.parts:tyPart.AtEspecially	Εἰς τό Ἐξαιρέτως:
ltx/gr_gr_cog/ty.typikon.parts:tyPart.AtLiturgy	ΕΙΣ ΤΗΝ Θ. ΛΕΙΤΟΥΡΓΙΑΝ
ltx/gr_gr_cog/ty.typikon.parts:tyPart.BothNow	Καί νῦν:
ltx/gr_gr_cog/ty.typikon.parts:tyPart.Canon	Κανών:
ltx/gr_gr_cog/ty.typikon.parts:tyPart.Canons	Κανόνες:
ltx/gr_gr_cog/ty.typikon.parts:tyPart.CommunionHymn	Κοινωνικόν:
ltx/gr_gr_cog/ty.typikon.parts:tyPart.Disclaimer.text	(Texts indicated by rubrics with shaded background may not be included in this file.)
ltx/gr_gr_cog/ty.typikon.parts:tyPart.Dismissal	Ἀπόλυσις:
ltx/gr_gr_cog/ty.typikon.parts:tyPart.Doxology	Δοξολογία:
ltx/gr_gr_cog/ty.typikon.parts:tyPart.Efthis.text	Εὐθύς·
ltx/gr_gr_cog/ty.typikon.parts:tyPart.Eita.text	Εἶτα·
ltx/gr_gr_cog/ty.typikon.parts:tyPart.Enarxis	Ἔναρξις:
ltx/gr_gr_cog/ty.typikon.parts:tyPart.Entrance	Εἴσοδος:
ltx/gr_gr_cog/ty.typikon.parts:tyPart.EntranceHymn	Εἰσοδικόν:
ltx/gr_gr_cog/ty.typikon.parts:tyPart.Epistle	Ἀπόστολος:
ltx/gr_gr_cog/ty.typikon.parts:tyPart.Evlogitaria	Εὐλογητάρια:
ltx/gr_gr_cog/ty.typikon.parts:tyPart.Exaposteilaria	Ἐξαποστειλάρια:
ltx/gr_gr_cog/ty.typikon.parts:tyPart.Exaposteilarion	Ἐξαποστειλάριον:
ltx/gr_gr_cog/ty.typikon.parts:tyPart.Friday.Evening	Τῇ Παρασκευῇ ἑσπέρας:
ltx/gr_gr_cog/ty.typikon.parts:tyPart.Friday.Morning	Τῇ Παρασκευῇ πρωΐ:
ltx/gr_gr_cog/ty.typikon.parts:tyPart.GITL	Εἰς τό·
ltx/gr_gr_cog/ty.typikon.parts:tyPart.Glory	Δόξα:
ltx/gr_gr_cog/ty.typikon.parts:tyPart.GloryBoth	Δόξα, Καί νῦν:
ltx/gr_gr_cog/ty.typikon.parts:tyPart.Gospel	Εὐαγγέλιον:
ltx/gr_gr_cog/ty.typikon.parts:tyPart.GreatLitany	Μεγάλη Συναπτή
ltx/gr_gr_cog/ty.typikon.parts:tyPart.HolyIsTheLord	«Ἅγιος Κύριος…».
ltx/gr_gr_cog/ty.typikon.parts:tyPart.Hypakoe	Ὑπακοή:
ltx/gr_gr_cog/ty.typikon.parts:tyPart.HypakoeOfMode	Ὑπακοὴ τοῦ ἤχου:
ltx/gr_gr_cog/ty.typikon.parts:tyPart.InsteadOfTrisagion	Ἀντί τοῦ Τρισαγίου:
ltx/gr_gr_cog/ty.typikon.parts:tyPart.IntroductoryPsalm	Προοιμιακὸς Ψαλμός
ltx/gr_gr_cog/ty.typikon.parts:tyPart.Katavasia9	Καταβασία θʹ ᾨδῆς:
ltx/gr_gr_cog/ty.typikon.parts:tyPart.Katavasia91	Καταβασία αʹ:
ltx/gr_gr_cog/ty.typikon.parts:tyPart.Katavasia92	Καταβασία βʹ:
ltx/gr_gr_cog/ty.typikon.parts:tyPart.Katavasias	Καταβασίαι:
ltx/gr_gr_cog/ty.typikon.parts:tyPart.Kathisma1	Κάθισμα Αʹ:
ltx/gr_gr_cog/ty.typikon.parts:tyPart.Kathisma2	Κάθισμα Βʹ:
ltx/gr_gr_cog/ty.typikon.parts:tyPart.Kathisma3	Κάθισμα Γʹ:
ltx/gr_gr_cog/ty.typikon.parts:tyPart.Kathismata	Καθίσματα:
ltx/gr_gr_cog/ty.typikon.parts:tyPart.Kontakion	Κοντάκιον:
ltx/gr_gr_cog/ty.typikon.parts:tyPart.KontakionOikos	Κοντάκιον - Οἶκος:
ltx/gr_gr_cog/ty.typikon.parts:tyPart.LIHC	Εἰς τό·
ltx/gr_gr_cog/ty.typikon.parts:tyPart.Lauds	Εἰς τοὺς Αἴνους:
ltx/gr_gr_cog/ty.typikon.parts:tyPart.LaudsStichera	Στιχηρὰ τῶν Αἴνων:
ltx/gr_gr_cog/ty.typikon.parts:tyPart.Lauds_04	Ἱστῶμεν Στίχους δʹ.
ltx/gr_gr_cog/ty.typikon.parts:tyPart.Lauds_06	Ἱστῶμεν Στίχους Ϛʹ.
ltx/gr_gr_cog/ty.typikon.parts:tyPart.Lauds_08	Ἱστῶμεν Στίχους ηʹ.
ltx/gr_gr_cog/ty.typikon.parts:tyPart.LityHymns	Τὰ Ἰδιόμελα τῆς Λιτῆς:
ltx/gr_gr_cog/ty.typikon.parts:tyPart.Magnificat	Ἡ Τιμιωτέρα:
ltx/gr_gr_cog/ty.typikon.parts:tyPart.Matins	ΟΡΘΡΟΣ
ltx/gr_gr_cog/ty.typikon.parts:tyPart.MatinsGospel	Εὐαγγέλιον Ὄρθρου:
ltx/gr_gr_cog/ty.typikon.parts:tyPart.MatinsOrdinary	Ἀρκτικὴ ἀκολουθία.
ltx/gr_gr_cog/ty.typikon.parts:tyPart.MidnightOffice	ΜΕΣΟΝΥΚΤΙΚΟΝ
ltx/gr_gr_cog/ty.typikon.parts:tyPart.MidodeKathisma	Μεσῴδιον Κάθισμα:
ltx/gr_gr_cog/ty.typikon.parts:tyPart.Monday.Evening	Τῇ Δευτέρᾳ ἑσπέρας:
ltx/gr_gr_cog/ty.typikon.parts:tyPart.Monday.Morning	Τῇ Δευτέρᾳ πρωΐ:
ltx/gr_gr_cog/ty.typikon.parts:tyPart.NoEntrance	Εἴσοδος οὐ γίνεται:
ltx/gr_gr_cog/ty.typikon.parts:tyPart.OdeOfSymeon	Νῦν ἀπολύεις
ltx/gr_gr_cog/ty.typikon.parts:tyPart.PostGospelIdiomelon	Τὸ Ἰδιόμελον:
ltx/gr_gr_cog/ty.typikon.parts:tyPart.Prokeimenon	Προκείμενον:
ltx/gr_gr_cog/ty.typikon.parts:tyPart.Psalm50	Ὁ Νʹ Ψαλμός:
ltx/gr_gr_cog/ty.typikon.parts:tyPart.Psalter	Ψαλτήριον:
ltx/gr_gr_cog/ty.typikon.parts:tyPart.Readings	Τὰ Ἀναγνώσματα.
ltx/gr_gr_cog/ty.typikon.parts:tyPart.RestOfBasilLiturgy	Καθεξῆς ἡ Θ. Λειτουργία τοῦ Μεγάλου Βασιλείου.
ltx/gr_gr_cog/ty.typikon.parts:tyPart.Saturday.Evening	Τῷ Σαββάτῳ ἑσπέρας:
ltx/gr_gr_cog/ty.typikon.parts:tyPart.Saturday.Morning	Τῷ Σαββάτῳ πρωΐ:
ltx/gr_gr_cog/ty.typikon.parts:tyPart.ShortLitany	Μικρὰ Συναπτή
ltx/gr_gr_cog/ty.typikon.parts:tyPart.SixPsalms	Ἑξάψαλμος.
ltx/gr_gr_cog/ty.typikon.parts:tyPart.Stichera	Ἑσπέρια:
ltx/gr_gr_cog/ty.typikon.parts:tyPart.Sunday.Evening	Τῇ Κυριακῇ ἑσπέρας:
ltx/gr_gr_cog/ty.typikon.parts:tyPart.Sunday.Morning	Τῇ Κυριακῇ πρωΐ:
ltx/gr_gr_cog/ty.typikon.parts:tyPart.Synaxarion	Συναξάριον:
ltx/gr_gr_cog/ty.typikon.parts:tyPart.Thursday.Evening	Τῇ Πέμπτῃ ἑσπέρας:
ltx/gr_gr_cog/ty.typikon.parts:tyPart.Thursday.Morning	Τῇ Πέμπτῃ πρωΐ:
ltx/gr_gr_cog/ty.typikon.parts:tyPart.ToAfto.text	Τὸ αὐτό.
ltx/gr_gr_cog/ty.typikon.parts:tyPart.TriadicCanon	Ὁ Τριαδικὸς Κανών:
ltx/gr_gr_cog/ty.typikon.parts:tyPart.TriadicMegalynaria	Τὰ Τριαδικά:
ltx/gr_gr_cog/ty.typikon.parts:tyPart.Trisagion	Τρισάγιον.
ltx/gr_gr_cog/ty.typikon.parts:tyPart.TrisagionHymn	Τρισάγιον:
ltx/gr_gr_cog/ty.typikon.parts:tyPart.Tuesday.Evening	Τῇ Τρίτῃ ἑσπέρας:
ltx/gr_gr_cog/ty.typikon.parts:tyPart.Tuesday.Morning	Τῇ Τρίτῃ πρωΐ:
ltx/gr_gr_cog/ty.typikon.parts:tyPart.Typikon	ΤΟ ΤΥΠΙΚΟΝ
ltx/gr_gr_cog/ty.typikon.parts:tyPart.Vespers	ΕΣΠΕΡΙΝΟΣ
ltx/gr_gr_cog/ty.typikon.parts:tyPart.VespersKathisma	Κάθισμα
ltx/gr_gr_cog/ty.typikon.parts:tyPart.Wednesday.Evening	Τῇ Τετάρτῃ ἑσπέρας:
ltx/gr_gr_cog/ty.typikon.parts:tyPart.Wednesday.Morning	Τῇ Τετάρτῃ πρωΐ:
ltx/gr_gr_cog/ty.typikon.parts:tyPart.vVerse	Στίχος:
ltx/gr_gr_cog/ty.typikon.parts:tyPartLiturgicalDayProperties	
ltx/gr_gr_cog/ty.typikon.parts:tyRubric.AlleluiaMode8	Ἀντί τοῦ Προκειμένου τῆς ἡμέρας, εἰς ἦχον πλ. δʹ τό· «Ἀλληλούια» τρίς:
ltx/gr_gr_cog/ty.typikon.parts:tyRubric.Aposticha.Resurrectional.All	Τὸ Ἀναστάσιμον, καὶ τὰ κατ’ Ἀλφάβητον τοῦ ἤχου.
ltx/gr_gr_cog/ty.typikon.parts:tyRubric.Aposticha.Resurrectional.First	Τὸ Ἀναστάσιμον Στιχηρόν.
ltx/gr_gr_cog/ty.typikon.parts:tyRubric.Canon.BothIn4	Ἀμφότερα εἰς 4
ltx/gr_gr_cog/ty.typikon.parts:tyRubric.Canon.In4	Εἰς 4 τροπάρια
ltx/gr_gr_cog/ty.typikon.parts:tyRubric.Canon.In6	Εἰς 6.
ltx/gr_gr_cog/ty.typikon.parts:tyRubric.Canon.InsteadUseOde9	Ἀντʼ αὐτῆς ἡ θ ᾨδή
ltx/gr_gr_cog/ty.typikon.parts:tyRubric.Canon.LastTwo	Εἰς τὰ δύο τελευταῖα· Δόξα, Καὶ νῦν.
ltx/gr_gr_cog/ty.typikon.parts:tyRubric.Canon.MagnificatNotSung	Οὐ στιχολογεῖται.
ltx/gr_gr_cog/ty.typikon.parts:tyRubric.Canon.OfBothCanonsOfFeast	ἀμφοτέρων τῶν Κανόνων τῆς Ἑορτῆς,
ltx/gr_gr_cog/ty.typikon.parts:tyRubric.Canon.Resurrectional	Ὁ Ἀναστάσιμος·
ltx/gr_gr_cog/ty.typikon.parts:tyRubric.Canon.ResurrectionalKontakionOikos	Τὸ Ἀναστάσιμον Κοντάκιον καί ὁ Οἶκος (χῦμα)
ltx/gr_gr_cog/ty.typikon.parts:tyRubric.Canon.WithItsHeirmoi	μετὰ τῶν Εἱρμῶν αὐτου.
ltx/gr_gr_cog/ty.typikon.parts:tyRubric.Canon.WithItsTheotokion	μετὰ τοῦ Θεοτοκίου αὐτοῦ:
ltx/gr_gr_cog/ty.typikon.parts:tyRubric.Canon.WithTheirMegalynaria	μετὰ τῶν Μεγαλυναρίων
ltx/gr_gr_cog/ty.typikon.parts:tyRubric.Canon.h123	Ὁ Εἱρμὸς καὶ 3 τροπάρια
ltx/gr_gr_cog/ty.typikon.parts:tyRubric.Canon.h12t	Ὁ Εἱρμὸς καὶ 3 τροπάρια
ltx/gr_gr_cog/ty.typikon.parts:tyRubric.Canon.noverse	Ἄνευ στίχου.
ltx/gr_gr_cog/ty.typikon.parts:tyRubric.Canon.verse	Μετὰ στίχου:
ltx/gr_gr_cog/ty.typikon.parts:tyRubric.Cross.Prosomoia3as4	Τὰ 3 Στιχηρὰ Προσόμοια τοῦ Σταυροῦ, τὸ πρῶτον δίς.
ltx/gr_gr_cog/ty.typikon.parts:tyRubric.Cross.Prosomoia3as6	Τὰ 3 Στιχηρὰ Προσόμοια τοῦ Σταυροῦ, ἅπαντα ἐκ δευτέρου.
ltx/gr_gr_cog/ty.typikon.parts:tyRubric.Date.Aug06.LI01	Τὸ τροπάριον τῆς ζʹ ᾨδῆς τοῦ βʹ Κανόνος τῆς Ἑορτῆς
ltx/gr_gr_cog/ty.typikon.parts:tyRubric.Date.Aug17.MA01	(τὸ μετὰ τὴν βʹ Στιχολογίαν 17ῃ Αὐγούστου)
ltx/gr_gr_cog/ty.typikon.parts:tyRubric.Doxology.Great	Μεγάλη
ltx/gr_gr_cog/ty.typikon.parts:tyRubric.Doxology.Small	Μικρή
ltx/gr_gr_cog/ty.typikon.parts:tyRubric.EvlogitariaHypakoeAnavathmoiProkeimenon	Τὰ Εὐλογητάρια. Ἡ Ὑπακοή, οἱ Ἀναβαθμοί, καί τὸ Προκείμενον τοῦ ἤχου.
ltx/gr_gr_cog/ty.typikon.parts:tyRubric.Fathers.Prosomoia3as4	Τὰ 3 Στιχηρὰ Προσόμοια τῶν Πατέρων, τὸ πρῶτον δίς.
ltx/gr_gr_cog/ty.typikon.parts:tyRubric.Fathers.Prosomoia4as6	Τὰ 4 Στιχηρὰ Προσόμοια τῶν Πατέρων, τὰ δύο πρῶτα ἐκ δευτέρου.
ltx/gr_gr_cog/ty.typikon.parts:tyRubric.Feast.EightModeIdiomelon	Τὸ ὀκτώηχον Ἰδιόμελον τῆς Ἑορτῆς, δίχορον.
ltx/gr_gr_cog/ty.typikon.parts:tyRubric.Feast.Idiomela3	Τὰ 3 Στιχηρὰ Ἰδιόμελα τῆς Ἑορτῆς.
ltx/gr_gr_cog/ty.typikon.parts:tyRubric.Feast.Idiomela4	Τὰ 4 Στιχηρὰ Ἰδιόμελα τῆς Ἑορτῆς.
ltx/gr_gr_cog/ty.typikon.parts:tyRubric.Feast.Idiomela4as6	Τὰ 4 Στιχηρὰ Ἰδιόμελα τῆς Ἑορτῆς, τὰ δύο πρῶτα ἐκ δευτέρου.
ltx/gr_gr_cog/ty.typikon.parts:tyRubric.Feast.Idiomela6	Τὰ 6 Στιχηρὰ Ἰδιόμελα τῆς Ἑορτῆς.
ltx/gr_gr_cog/ty.typikon.parts:tyRubric.Feast.Idiomelon	Τὸ Ἰδιόμελον τῆς Ἑορτῆς.
ltx/gr_gr_cog/ty.typikon.parts:tyRubric.Feast.KontakionOikos	Τὸ Κοντάκιον καὶ ὁ Οἶκος τῆς Ἑορτῆς (χῦμα)
ltx/gr_gr_cog/ty.typikon.parts:tyRubric.Feast.OtherIdiomelon	Τὸ ἕτερον Ἰδιόμελον τῆς Ἑορτῆς.
ltx/gr_gr_cog/ty.typikon.parts:tyRubric.Feast.Prosomoia3	Τὰ 3 Στιχηρὰ Προσόμοια τῆς Ἑορτῆς·
ltx/gr_gr_cog/ty.typikon.parts:tyRubric.Feast.Prosomoia3as4	Τὰ 3 Στιχηρὰ Προσόμοια τῆς Ἑορτῆς, τὸ πρῶτον δίς.
ltx/gr_gr_cog/ty.typikon.parts:tyRubric.Feast.Prosomoia3as6	Τὰ 3 Στιχηρὰ Προσόμοια τῆς Ἑορτῆς, ἅπαντα ἐκ δευτέρου.
ltx/gr_gr_cog/ty.typikon.parts:tyRubric.Find.Lity	Ζήτει τοῦτο εἰς τὴν Λιτήν.
ltx/gr_gr_cog/ty.typikon.parts:tyRubric.Find.LityBoth	Ζήτει τοῦτο εἰς τὸ Καὶ νῦν, τῆς Λιτῆς.
ltx/gr_gr_cog/ty.typikon.parts:tyRubric.Find.LityGlory	Ζήτει τοῦτο εἰς τὸ Δόξα, τῆς Λιτῆς.
ltx/gr_gr_cog/ty.typikon.parts:tyRubric.FirstTheotokion.ModeOfWeek	Τὸ αʹ Θεοτοκίον τοῦ ἤχου τῆς ἑβδομάδος.
ltx/gr_gr_cog/ty.typikon.parts:tyRubric.FirstTheotokion.SameMode	Τὸ ὁμόηχον αʹ Θεοτοκίον.
ltx/gr_gr_cog/ty.typikon.parts:tyRubric.Forerunner.Prosomoia3as4	Τὰ 3 Στιχηρὰ Προσόμοια τοῦ Προδρόμου, τὸ πρῶτον δίς.
ltx/gr_gr_cog/ty.typikon.parts:tyRubric.IsRead	ἀναγινώσκεται.
ltx/gr_gr_cog/ty.typikon.parts:tyRubric.ItsTheotokion	Τὸ Θεοτοκίον αὐτοῦ.
ltx/gr_gr_cog/ty.typikon.parts:tyRubric.ItsTheotokionSameMode	Τὸ ὁμόηχον Θεοτοκίον αὐτοῦ.
ltx/gr_gr_cog/ty.typikon.parts:tyRubric.Litanies1	Ἡ Ἐκτενής. Τὸ
ltx/gr_gr_cog/ty.typikon.parts:tyRubric.Litanies2	Τὰ Πληρωτικά, καὶ ἡ Εὐχὴ τῆς Κεφαλοκλισίας.
ltx/gr_gr_cog/ty.typikon.parts:tyRubric.Mode4Antiphon1	Τὸ αʹ Ἀντίφωνον τοῦ δʹ ἤχου·
ltx/gr_gr_cog/ty.typikon.parts:tyRubric.OmitEvlogetaria	Τὰ Εὐλογητάρια καταλιμπάνονται. Μικρὰ Συναπτὴ καὶ ἡ Ἐκφώνησις·
ltx/gr_gr_cog/ty.typikon.parts:tyRubric.Once	Ἅπαξ.
ltx/gr_gr_cog/ty.typikon.parts:tyRubric.OnlySayEvening1	Ἐκφωνεῖται ἁπλῶς·
ltx/gr_gr_cog/ty.typikon.parts:tyRubric.OnlySayEvening2	καί οὐχί·
ltx/gr_gr_cog/ty.typikon.parts:tyRubric.Prokeimenon.Daily	Προκείμενον.
ltx/gr_gr_cog/ty.typikon.parts:tyRubric.Prokeimenon.Great	Μέγα Προκείμενον.
ltx/gr_gr_cog/ty.typikon.parts:tyRubric.Prophet.Prosomoia3as4	Τὰ 3 Στιχηρὰ Προσόμοια τοῦ Προφήτου, τὸ πρῶτον δίς.
ltx/gr_gr_cog/ty.typikon.parts:tyRubric.Prosomoia3	Τὰ 3 Στιχηρὰ Προσόμοια
ltx/gr_gr_cog/ty.typikon.parts:tyRubric.PsalterKathisma1Stanza1	Ἡ αʹ στάσις τοῦ αʹ καθίσματος.
ltx/gr_gr_cog/ty.typikon.parts:tyRubric.Read	(χῦμα)
ltx/gr_gr_cog/ty.typikon.parts:tyRubric.Repeat	Τὸ αὐτό.
ltx/gr_gr_cog/ty.typikon.parts:tyRubric.Resurrectional	Ἀναστάσιμα.
ltx/gr_gr_cog/ty.typikon.parts:tyRubric.Resurrectional.Stichera3	Τὰ 3 Στιχηρὰ Ἀναστάσιμα.
ltx/gr_gr_cog/ty.typikon.parts:tyRubric.Resurrectional.Stichera4	Τὰ 3 Στιχηρὰ Ἀναστάσιμα. Τὸ 1 Στιχηρὸν Ἀνατολικόν.
ltx/gr_gr_cog/ty.typikon.parts:tyRubric.Resurrectional.Stichera6	Τὰ 3 Στιχηρὰ Ἀναστάσιμα. Τὰ 3 Στιχηρὰ Ἀνατολικά.
ltx/gr_gr_cog/ty.typikon.parts:tyRubric.Resurrectional.Stichera7	Τὰ 3 Στιχηρὰ Ἀναστάσιμα. Τὰ 4 Στιχηρὰ Ἀνατολικά.
ltx/gr_gr_cog/ty.typikon.parts:tyRubric.SaintM.Prosomoia3	Τὰ 3 Στιχηρὰ Προσόμοια τοῦ Ἁγίου·
ltx/gr_gr_cog/ty.typikon.parts:tyRubric.SaintM.Prosomoia3as4	Τὰ 3 Στιχηρὰ Προσόμοια τοῦ Ἁγίου, τὸ πρῶτον δίς.
ltx/gr_gr_cog/ty.typikon.parts:tyRubric.SaintW.Prosomoia3	Τὰ 3 Στιχηρὰ Προσόμοια τῆς Ἁγίας·
ltx/gr_gr_cog/ty.typikon.parts:tyRubric.SaintW.Prosomoia3as4	Τὰ 3 Στιχηρὰ Προσόμοια τῆς Ἁγίας, τὸ πρῶτον δίς.
ltx/gr_gr_cog/ty.typikon.parts:tyRubric.Saints.Prosomoia3	Τὰ 3 Στιχηρὰ Προσόμοια τῶν Ἁγίων·
ltx/gr_gr_cog/ty.typikon.parts:tyRubric.Saints.Prosomoia3as6	Τὰ 3 Στιχηρὰ Προσόμοια τῶν Ἁγίων, ἅπαντα ἐκ δευτέρου.
ltx/gr_gr_cog/ty.typikon.parts:tyRubric.Synaxarion.Fathers	καὶ τὸ Ὑπόμνημα τῆς Κυριακῆς τῶν Πατέρων
ltx/gr_gr_cog/ty.typikon.parts:tyRubric.Synaxarion.Forefathers	καὶ τὸ Ὑπόμνημα τῶν Προπατόρων
ltx/gr_gr_cog/ty.typikon.parts:tyRubric.Synaxarion.Menaion	ἐκ τοῦ Μηναίου
ltx/gr_gr_cog/ty.typikon.parts:tyRubric.Synaxarion.OfTheDay	Τῆς ἡμέαρς
ltx/gr_gr_cog/ty.typikon.parts:tyRubric.Synaxarion.Pentecostarion	καὶ τὸ Ὑπόμνημα τοῦ Πεντηκοσταρίου
ltx/gr_gr_cog/ty.typikon.parts:tyRubric.Synaxarion.SundayAC	καὶ τὸ Ὑπόμνημα τῆς Κυριακῆς πρὸ τῆς Χριστοῦ Γεννήσεως
ltx/gr_gr_cog/ty.typikon.parts:tyRubric.Synaxarion.SundayBC	καὶ τὸ Ὑπόμνημα τῆς Κυριακῆς μετὰ τὴν Χριστοῦ Γέννησιν
ltx/gr_gr_cog/ty.typikon.parts:tyRubric.Synaxarion.Triodion	καὶ τὸ Ὑπόμνημα τοῦ Τριῳδίου
ltx/gr_gr_cog/ty.typikon.parts:tyRubric.TheirTheotokion	Τὸ Θεοτοκίον αὐτῶν.
ltx/gr_gr_cog/ty.typikon.parts:tyRubric.Theotokion.SameMode	Τὸ ὁμόηχον Θεοτοκίον.
ltx/gr_gr_cog/ty.typikon.parts:tyRubric.TheotokionOfModeOfWeek	Τὸ Θεοτοκίον τοῦ ἤχου.
ltx/gr_gr_cog/ty.typikon.parts:tyRubric.Thrice	Τρίς.
ltx/gr_gr_cog/ty.typikon.parts:tyRubric.Twice	Δίς.
ltx/gr_gr_cog/ty.typikon.parts:tyRubric.VE.LIHC_04	Ἱστῶμεν Στίχους δʹ.
ltx/gr_gr_cog/ty.typikon.parts:tyRubric.VE.LIHC_06	Ἱστῶμεν Στίχους Ϛʹ.
ltx/gr_gr_cog/ty.typikon.parts:tyRubric.VE.LIHC_08	Ἱστῶμεν Στίχους ηʹ.
ltx/gr_gr_cog/ty.typikon.parts:tyRubric.VE.LIHC_10	Ἱστῶμεν Στίχους ιʹ.
ltx/gr_gr_cog/ty.typikon.parts:tyRubric.WithGospel	Μετʼ Εὐαγγελίου.
ltx/gr_gr_cog/ty.typikon.parts:tySource.Hieratikon	Ἱερατικόν.
ltx/gr_gr_cog/ty.typikon.parts:tySource.Horologion	Ὡρολόγιον.
ltx/gr_gr_cog/ty.typikon.parts:tySource.Menaion	Μηναῖον.
ltx/gr_gr_cog/ty.typikon.parts:tySource.Octoechos	Παρακλητική.
ltx/gr_gr_cog/ty.typikon.parts:tySource.Pentecostarion	Πεντηκοστάριον.
ltx/gr_gr_cog/ty.typikon.parts:tySource.Triodion	Τριῴδιον.
ltx/gr_gr_cog/ty.typikon.parts:tySources	Βιβλία - Πηγαί:
