ltx/gr_gr_cog/le.go.lu.d105:leluLI.Gospel.book_abbr	@ltx/gr_gr_cog/bible:Luke.abbr
ltx/gr_gr_cog/le.go.lu.d105:leluLI.Gospel.book_string	@ltx/gr_gr_cog/bible:Luke.text
ltx/gr_gr_cog/le.go.lu.d105:leluLI.Gospel.chapverse	19:1 – 10
ltx/gr_gr_cog/le.go.lu.d105:leluLI.Gospel.incipit	Διήρχετο ὁ Ἰησοῦς τὴν Ἰεριχώ…
ltx/gr_gr_cog/le.go.lu.d105:leluLI.Gospel.text	Τῷ καιρῷ ἐκείνῳ, διήρχετο ὁ Ἰησοῦς τὴν Ἰεριχώ· καὶ ἰδοὺ ἀνὴρ ὀνόματι καλούμενος Ζακχαῖος, καὶ αὐτὸς ἦν ἀρχιτελώνης, καὶ οὗτος ἦν πλούσιος, καὶ ἐζήτει ἰδεῖν τὸν Ἰησοῦν τίς ἐστι, καὶ οὐκ ἠδύνατο ἀπὸ τοῦ ὄχλου, ὅτι τῇ ἡλικίᾳ μικρὸς ἦν. καὶ προδραμὼν ἔμπροσθεν ἀνέβη ἐπὶ συκομορέαν, ἵνα ἴδῃ αὐτόν, ὅτι διʼ ἐκείνης ἤμελλε διέρχεσθαι. καὶ ὡς ἦλθεν ἐπὶ τὸν τόπον, ἀναβλέψας ὁ Ἰησοῦς εἶδεν αὐτόν καὶ εἶπεν πρὸς αὐτόν· Ζακχαῖε, σπεύσας κατάβηθι· σήμερον γὰρ ἐν τῷ οἴκῳ σου δεῖ με μεῖναι. καὶ σπεύσας κατέβη, καὶ ὑπεδέξατο αὐτὸν χαίρων. καὶ ἰδόντες πάντες διεγόγγυζον λέγοντες ὅτι παρὰ ἁμαρτωλῷ ἀνδρὶ εἰσῆλθε καταλῦσαι. σταθεὶς δὲ Ζακχαῖος εἶπε πρὸς τὸν Κύριον· Ἰδοὺ τὰ ἡμίση τῶν ὑπαρχόντων μου, Κύριε, δίδωμι τοῖς πτωχοῖς, καὶ εἴ τινός τι ἐσυκοφάντησα, ἀποδίδωμι τετραπλοῦν. εἶπε δὲ πρὸς αὐτὸν ὁ Ἰησοῦς ὅτι σήμερον σωτηρία τῷ οἴκῳ τούτῳ ἐγένετο, καθότι καὶ αὐτὸς υἱὸς Ἀβραάμ ἐστιν· ἦλθε γὰρ ὁ υἱὸς τοῦ ἀνθρώπου ζητῆσαι καὶ σῶσαι τὸ ἀπολωλός.
ltx/gr_gr_cog/le.go.lu.d105:leluLI.Gospel.title	Κυριακῇ Δεκάτῃ Πέμπτῃ τοῦ Λουκᾶ
ltx/gr_gr_cog/le.go.lu.d105:leluLI.Gospel.title_abbr	Κυριακῇ ΙΕʹ Λουκᾶ
ltx/gr_gr_cog/le.go.lu.d105:leluLI.Gospel.version	@ltx/gr_gr_cog/properties:version.designation
