ltx/gr_gr_cog/sy.m12.d08:cl.syMA.commemoration01.text	[saint/com 1]
ltx/gr_gr_cog/sy.m12.d08:cl.syMA.commemoration02.text	[saint/com 2]
ltx/gr_gr_cog/sy.m12.d08:cl.syMA.commemoration03.text	[saint/com 3]
ltx/gr_gr_cog/sy.m12.d08:cl.syMA.commemoration04.text	[saint/com 4]
ltx/gr_gr_cog/sy.m12.d08:cl.syMA.commemoration05.text	[saint/com 5]
ltx/gr_gr_cog/sy.m12.d08:cl.syMA.commemoration06.text	[saint/com list]
ltx/gr_gr_cog/sy.m12.d08:syMA.commemoration01.couplet1.title	@ltx/gr_gr_cog/titles:ti.Verses
ltx/gr_gr_cog/sy.m12.d08:syMA.commemoration01.couplet1.verse1	Φθαρτὸν λελοιπώς, Πατάπιε, γῆς πάτον,
ltx/gr_gr_cog/sy.m12.d08:syMA.commemoration01.couplet1.verse2	Πατεῖς, ὅπου πατοῦσι πραέων πόδες.
ltx/gr_gr_cog/sy.m12.d08:syMA.commemoration01.narration.p01	Οὗτος, ἐκ Θηβῶν τῶν κατʼ Αἴγυπτον ὁρµώµενος, τὸν µονήρη βίον ἐπανελόµενος, τῷ Χριστῷ ἠκολούθησε· καὶ πολλοὺς χρόνους ἐν ἐρήµῳ ἀσκήσας, εἶτα ἐν Κωνσταντινουπόλει ἐλθών, πλεῖστα κατειργάσατο θαύµατα, τυφλοὺς ὀµµατώσας, καὶ ὑδεριῶντας διὰ χρίσεως Ἁγίου Ἐλαίου ἰασάµενος, καὶ δαίµονας ἐλάσας, καὶ καρκῖνον θεραπεύσας, ἐν εἰρήνῃ τῷ Κυρίῳ τὸ ἑαυτοῦ παρέθετο πνεῦµα.
ltx/gr_gr_cog/sy.m12.d08:syMA.commemoration01.single1	Ὀγδοάτῃ, Πατάπιε, χλόης πέδον ἀµφεπάτησας.
ltx/gr_gr_cog/sy.m12.d08:syMA.commemoration01.text	Τῇ Ηʹ τοῦ αὐτοῦ μηνὸς μνήμη τοῦ ὁσίου Πατρὸς ἡμῶν Παταπίου.
ltx/gr_gr_cog/sy.m12.d08:syMA.commemoration02.couplet1.title	@ltx/gr_gr_cog/titles:ti.Verses
ltx/gr_gr_cog/sy.m12.d08:syMA.commemoration02.couplet1.verse1	Ἀποστόλους σήµερον ἑπτὰ γεραίρω,
ltx/gr_gr_cog/sy.m12.d08:syMA.commemoration02.couplet1.verse2	Ὡς γενναίους κήρυκας τοῦ Θεοῦ Λόγου.
ltx/gr_gr_cog/sy.m12.d08:syMA.commemoration02.narration.p01	Τούτων ὁ µὲν Σωσθένης, οὗ καὶ ὁ ἅγιος Παῦλος µέµνηται, Ἐπίσκοπος Κολοφῶνος ἐγένετο. Ὁ δὲ Ἀπολλώς, οὗ τινος καὶ αὐτοῦ ὁ Ἀπόστολος µέµνηται, δεύτερος Ἐπίσκοπος Κολοφῶνος µετὰ Σωσθένην ἐγένετο. Ὁ δὲ Ἐπαφρόδιτος, οὗ τινος καὶ αὐτοῦ ὁ Ἀπόστολος µέµνηται, Ἐπίσκοπος Κολώνης ἐγένετο. Ὁ δὲ Ὀνησιφόρος, Ἐπίσκοπος Καισαρείας ἐγένετο· Ὁ δὲ Καῖσαρ, ὑπὸ τοῦ Παύλου ἀναφερόµενος καὶ οὗτος, Ἐπίσκοπος τῆς ἐν Πελοποννήσῳ Κορώνης ἐγένετο. Οὗτοι πάντες καλῶς πολιτευσάµενοι καὶ ὁσίως ποιµάναντες καὶ κυβερνήσαντες τὰς λαχούσας αὐτοῖς Ἐκκλησίας καὶ τὸν λαόν, καὶ πολλοὺς πειρασµοὺς ὑποµείναντες ὑπὲρ Χριστοῦ, ὑπὸ τῶν εἰδωλολατρῶν ἐτελειώθησαν, παραδόντες τὰς ψυχὰς ἑαυτῶν τῷ Κυρίῳ.
ltx/gr_gr_cog/sy.m12.d08:syMA.commemoration02.text	Τῇ αὐτῇ ἡμέρᾳ μνήμη τῶν ἅγίων Ἀποστόλων ἐκ τῶν Ἑβδομήκοντα, Σωσθένους, Ἀπολλώ, Κηφᾶ, Τυχικοῦ, Ἐπαφροδίτου, Καίσαρος, καὶ Ὀνησιφόρου.
ltx/gr_gr_cog/sy.m12.d08:syMA.commemoration03.couplet1.title	@ltx/gr_gr_cog/titles:ti.Verses
ltx/gr_gr_cog/sy.m12.d08:syMA.commemoration03.couplet1.verse1	Πᾶν Σωφρόνιος σαρκικὸν σβέσας πάθος,
ltx/gr_gr_cog/sy.m12.d08:syMA.commemoration03.couplet1.verse2	Καὶ σαρκὸς αὐτῆς ἐξαπέπτη πηλίνης.
ltx/gr_gr_cog/sy.m12.d08:syMA.commemoration03.narration.p01	Ὃς ἦν γέννηµα καὶ θρέµµα τῆς αὐτῆς Νήσου, χριστιανῶν καὶ εὐσεβῶν γονέων υἱός. Ἦν δέ, διʼ ὀξύτητα νοὸς καὶ εὐφυΐαν, πολυµαθής, ἀναγνοὺς ἐπιµελῶς πᾶσαν τὴν θείαν Γραφήν. Τοσοῦτον δὲ γέγονεν ἐνάρετος, ὡς καὶ µεγάλων θαυµάτων ἀξιωθῆναι καὶ πολλὰ θαύµατα ποιῆσαι. Διὸ καὶ µετὰ θάνατον Δαµιανοῦ τοῦ ἁγιωτάτου Ἐπισκόπου Κύπρου, ὑπὸ τοῦ λαοῦ παντὸς καὶ τῶν Ἐπισκόπων προχειρίζεται Ἐπίσκοπος. Ὅς, µετὰ τοῦτο, πενήτων ἐγένετο τροφεύς· ὀρφανῶν ἀντιλήπτωρ, χηρῶν προστάτης, ἀδικουµένων βοηθός, καὶ γυµνῶν σκέπη· καὶ µετὰ τούτους καὶ τοιούτους ἀγῶνας, πρὸς Θεὸν ἐν εἰρήνῃ ἐξεδήµησεν.
ltx/gr_gr_cog/sy.m12.d08:syMA.commemoration03.text	Τῇ αὐτῇ ἡμέρᾳ μνήμη τοῦ ὁσίου Πατρὸς ἡμῶν Σωφρονίου, Ἐπισκόπου Κύπρου.
ltx/gr_gr_cog/sy.m12.d08:syMA.lastline	Ταῖς αὐτῶν ἁγίαις πρεσβείαις, ὁ Θεός, ἐλέησον καὶ σῶσον ἡμᾶς. Ἀμήν.
