ltx/gr_gr_cog/me.m05.d05:meDA.commemoration.first	Μνήμη τῆς Ἁγίας καὶ ἐνδόξου Μεγαλομάρτυρος Εἰρήνης.
ltx/gr_gr_cog/me.m05.d05:meDA.commemoration.first_name	
ltx/gr_gr_cog/me.m05.d05:meDA.commemoration.first_short	Μνήμη τῆς Ἁγίας καὶ ἐνδόξου Μεγαλομάρτυρος Εἰρήνης.
ltx/gr_gr_cog/me.m05.d05:meDA.commemoration.first_title	@ltx/gr_gr_cog/titles:ti.SaintW
ltx/gr_gr_cog/me.m05.d05:meDA.commemoration.full	Μνήμη τῆς Ἁγίας καὶ ἐνδόξου Μεγαλομάρτυρος Εἰρήνης.
ltx/gr_gr_cog/me.m05.d05:meDA.commemoration.second_name	
ltx/gr_gr_cog/me.m05.d05:meDA.commemoration.second_title	
ltx/gr_gr_cog/me.m05.d05:meDA.date	Τῌ Εʹ ΜΑΪΟΥ
ltx/gr_gr_cog/me.m05.d05:meDA.fordate	διὰ τὴν 5ην Μαΐου
ltx/gr_gr_cog/me.m05.d05:meDA.insert1	καὶ τῆς Ἁγίας καὶ ἐνδόξου Μεγαλομάρτυρος Εἰρήνης,
ltx/gr_gr_cog/me.m05.d05:meDA.insert2	ἧς καὶ τὴν μνήμην ἐπιτελοῦμεν·
ltx/gr_gr_cog/me.m05.d05:meDA.note	
ltx/gr_gr_cog/me.m05.d05:meDA.pdfcoverdate	τῆς 5ης Μαΐου,
ltx/gr_gr_cog/me.m05.d05:meDA.pdfheaderdate	τῆς 5ης Μαΐου
ltx/gr_gr_cog/me.m05.d05:meHO.commemorations	
ltx/gr_gr_cog/me.m05.d05:meHO.note1	
ltx/gr_gr_cog/me.m05.d05:meHO.note2	
ltx/gr_gr_cog/me.m05.d05:meHO.number	
ltx/gr_gr_cog/me.m05.d05:meHO.rank	
ltx/gr_gr_cog/me.m05.d05:meLE.commemoration1	Μνήμη τῆς Ἁγίας καὶ ἐνδόξου Μεγαλομάρτυρος Εἰρήνης.
ltx/gr_gr_cog/me.m05.d05:meLE.commemoration2	
ltx/gr_gr_cog/me.m05.d05:meLI.Kontakion1.greekmelody	@ltx/gr_gr_cog/me.m05.d05:meMA.Kontakion1.greekmelody
ltx/gr_gr_cog/me.m05.d05:meLI.Kontakion1.incipit	@ltx/gr_gr_cog/me.m05.d05:meMA.Kontakion1.incipit
ltx/gr_gr_cog/me.m05.d05:meLI.Kontakion1.melody	@ltx/gr_gr_cog/me.m05.d05:meMA.Kontakion1.melody
ltx/gr_gr_cog/me.m05.d05:meLI.Kontakion1.mode	@ltx/gr_gr_cog/me.m05.d05:meMA.Kontakion1.mode
ltx/gr_gr_cog/me.m05.d05:meLI.Kontakion1.text	@ltx/gr_gr_cog/me.m05.d05:meMA.Kontakion1.text
ltx/gr_gr_cog/me.m05.d05:meLI.MM.CommunionHymn.text	@ltx/gr_gr_cog/properties:media.key
ltx/gr_gr_cog/me.m05.d05:meLI.Megalynarion.text	Τῇ εἰρηνωνύμῳ κλήσει σεμνή, κατακολουθοῦσα, εὐηγγέλισαι μυστικῶς, ἄθλοις σου θαυμάτων, ψυχαῖς πολεμουμέναις, σωτήριον εἰρήνην, Εἰρήνη ἔνδοξε.
ltx/gr_gr_cog/me.m05.d05:meMA.C1.acrostic.notice1	οὗ ἡ Ἀκροστιχίς·
ltx/gr_gr_cog/me.m05.d05:meMA.C1.acrostic.text	Σαῖς με προσευχαῖς μάρτυς Εἰρήνη σκέπε.
ltx/gr_gr_cog/me.m05.d05:meMA.C1.acrostic.title	Ὁ Κανὼν τῆς Ἁγίας,
ltx/gr_gr_cog/me.m05.d05:meMA.C1.title	@ltx/gr_gr_cog/titles:ti.CanonSaintW
ltx/gr_gr_cog/me.m05.d05:meMA.C1.verse	@ltx/gr_gr_cog/prayers:pr.verse_SaintW.text
ltx/gr_gr_cog/me.m05.d05:meMA.Exaposteilarion1.greekmelody	@ltx/gr_gr_cog/he.a.m2:heAU.GynaikesAkoutisthite.greekname
ltx/gr_gr_cog/me.m05.d05:meMA.Exaposteilarion1.incipit	Ῥωσθεῖσα καλλιπάρθενε, Σταυρῷ τῷ τοῦ…
ltx/gr_gr_cog/me.m05.d05:meMA.Exaposteilarion1.melody	@ltx/gr_gr_cog/he.a.m2:heAU.GynaikesAkoutisthite.name
ltx/gr_gr_cog/me.m05.d05:meMA.Exaposteilarion1.mode	@ltx/gr_gr_cog/miscellanea:misc.Mode2
ltx/gr_gr_cog/me.m05.d05:meMA.Exaposteilarion1.text	Ῥωσθεῖσα καλλιπάρθενε, Σταυρῷ τῷ τοῦ Κυρίου σου, τυράννων ἔλυσας θράσος, ἀθλοῦσα Μάρτυς γενναίως, καὶ πρὸς Χριστοῦ ἀπείληφας, βραβεῖα νίκης πάνσοφε, Εἰρήνη μεγαλώνυμε, ὑπὲρ ὑμῶν δυσωποῦσα, τῶν σὲ τιμώντων ἐκ πόθου.
ltx/gr_gr_cog/me.m05.d05:meMA.Kontakion1.greekmelody	@ltx/gr_gr_cog/he.a.m3:heAU.IParthenosSimeron.greekname
ltx/gr_gr_cog/me.m05.d05:meMA.Kontakion1.incipit	Παρθενίας κάλλεσι, πεποικιλμένη παρθένε, καὶ…
ltx/gr_gr_cog/me.m05.d05:meMA.Kontakion1.melody	@ltx/gr_gr_cog/he.a.m3:heAU.IParthenosSimeron.name
ltx/gr_gr_cog/me.m05.d05:meMA.Kontakion1.mode	@ltx/gr_gr_cog/miscellanea:misc.Mode3
ltx/gr_gr_cog/me.m05.d05:meMA.Kontakion1.text	Παρθενίας κάλλεσι, πεποικιλμένη παρθένε, καὶ Μαρτύρων στέμμασι, στεφανωθεῖσα Εἰρήνη, αἵματι τοῦ μαρτυρίου ἐῤῥαντισμένη, θαύμασι καταστραφθεῖσα τῶν ἰαμάτων, εὐσεβῶς Μάρτυς ἐδέξω, βραβεῖον νίκης τῆς σῆς ἀθλήσεως.
ltx/gr_gr_cog/me.m05.d05:meMA.Ode1C11.greekmelody	@ltx/gr_gr_cog/he.h.m4:heHE.AsomaiSoiKyrie.greekname
ltx/gr_gr_cog/me.m05.d05:meMA.Ode1C11.incipit	Στέφανος ὑπάρχων τῆς Ἀθληφόρου, ταύτης…
ltx/gr_gr_cog/me.m05.d05:meMA.Ode1C11.melody	@ltx/gr_gr_cog/he.h.m4:heHE.AsomaiSoiKyrie.name
ltx/gr_gr_cog/me.m05.d05:meMA.Ode1C11.mode	@ltx/gr_gr_cog/miscellanea:misc.Mode4
ltx/gr_gr_cog/me.m05.d05:meMA.Ode1C11.ode	@ltx/gr_gr_cog/miscellanea:misc.Ode1
ltx/gr_gr_cog/me.m05.d05:meMA.Ode1C11.text	Στέφανος ὑπάρχων τῆς Ἀθληφόρου, ταύτης Χριστὲ ταῖς πρεσβείαις, εἰρήνην τῷ κόσμῳ, καὶ δόξαν τὴν ἀμάραντον, τοῖς ὑμνοῦσί σε δώρησαι.
ltx/gr_gr_cog/me.m05.d05:meMA.Ode1C12.incipit	Αἴγλῃ διαλάμπουσα παρθενίας, καὶ κοσμουμένη…
ltx/gr_gr_cog/me.m05.d05:meMA.Ode1C12.melody	@ltx/gr_gr_cog/he.h.m4:heHE.AsomaiSoiKyrie.name
ltx/gr_gr_cog/me.m05.d05:meMA.Ode1C12.mode	@ltx/gr_gr_cog/miscellanea:misc.Mode4
ltx/gr_gr_cog/me.m05.d05:meMA.Ode1C12.ode	@ltx/gr_gr_cog/miscellanea:misc.Ode1
ltx/gr_gr_cog/me.m05.d05:meMA.Ode1C12.text	Αἴγλῃ διαλάμπουσα παρθενίας, καὶ κοσμουμένη τῷ κάλλει, τῆς σῆς μαρτυρίας, Εἰρήνη μεγαλώνυμε, σῷ νυμφίῳ παρίστασαι.
ltx/gr_gr_cog/me.m05.d05:meMA.Ode1C13.incipit	Ἵλεων γενέσθαι ταῖς Ἐκκλησίαις, τὸν…
ltx/gr_gr_cog/me.m05.d05:meMA.Ode1C13.melody	@ltx/gr_gr_cog/he.h.m4:heHE.AsomaiSoiKyrie.name
ltx/gr_gr_cog/me.m05.d05:meMA.Ode1C13.mode	@ltx/gr_gr_cog/miscellanea:misc.Mode4
ltx/gr_gr_cog/me.m05.d05:meMA.Ode1C13.ode	@ltx/gr_gr_cog/miscellanea:misc.Ode1
ltx/gr_gr_cog/me.m05.d05:meMA.Ode1C13.text	Ἵλεων γενέσθαι ταῖς Ἐκκλησίαις, τὸν σὸν δυσώπει νυμφίον, Εἰρήνη θεόφρον, καὶ πταισμάτων τὴν ἄφεσιν, παρέχειν τοῖς ὑμνοῦσί σε.
ltx/gr_gr_cog/me.m05.d05:meMA.Ode1C1T.incipit	Σάρκα γεγονότα τὸν Θεὸν Λόγον…
ltx/gr_gr_cog/me.m05.d05:meMA.Ode1C1T.melody	@ltx/gr_gr_cog/he.h.m4:heHE.AsomaiSoiKyrie.name
ltx/gr_gr_cog/me.m05.d05:meMA.Ode1C1T.mode	@ltx/gr_gr_cog/miscellanea:misc.Mode4
ltx/gr_gr_cog/me.m05.d05:meMA.Ode1C1T.ode	@ltx/gr_gr_cog/miscellanea:misc.Ode1
ltx/gr_gr_cog/me.m05.d05:meMA.Ode1C1T.text	Σάρκα γεγονότα τὸν Θεὸν Λόγον, καὶ πεφηνότα καθʼ ἡμᾶς, ἁγία Παρθένε, ἀφράστως ἀπεκύησας, ὑπὲρ λόγον καὶ ἔννοιαν.
ltx/gr_gr_cog/me.m05.d05:meMA.Ode3C11.greekmelody	@ltx/gr_gr_cog/he.h.m4:heHE.ToxonDynatonIsthenise.greekname
ltx/gr_gr_cog/me.m05.d05:meMA.Ode3C11.incipit	Μύρου κενωθέντος αἴσθησιν, τοῦ τὴν…
ltx/gr_gr_cog/me.m05.d05:meMA.Ode3C11.melody	@ltx/gr_gr_cog/he.h.m4:heHE.ToxonDynatonIsthenise.name
ltx/gr_gr_cog/me.m05.d05:meMA.Ode3C11.mode	@ltx/gr_gr_cog/miscellanea:misc.Mode4
ltx/gr_gr_cog/me.m05.d05:meMA.Ode3C11.ode	@ltx/gr_gr_cog/miscellanea:misc.Ode3
ltx/gr_gr_cog/me.m05.d05:meMA.Ode3C11.text	Μύρου κενωθέντος αἴσθησιν, τοῦ τὴν οἰκουμένην εὐωδιάσαντος χάριτι, δεξαμένη ἀνεπτερώθης, πρὸς τὸν τούτου πόθον Ἔνδοξε.
ltx/gr_gr_cog/me.m05.d05:meMA.Ode3C12.incipit	Ἔσχες τὸν Θεὸν συλλήπτορα, ἐν…
ltx/gr_gr_cog/me.m05.d05:meMA.Ode3C12.melody	@ltx/gr_gr_cog/he.h.m4:heHE.ToxonDynatonIsthenise.name
ltx/gr_gr_cog/me.m05.d05:meMA.Ode3C12.mode	@ltx/gr_gr_cog/miscellanea:misc.Mode4
ltx/gr_gr_cog/me.m05.d05:meMA.Ode3C12.ode	@ltx/gr_gr_cog/miscellanea:misc.Ode3
ltx/gr_gr_cog/me.m05.d05:meMA.Ode3C12.text	Ἔσχες τὸν Θεὸν συλλήπτορα, ἐν τοῖς σοῖς ἀγῶσι, καὶ συνασπίζοντα Πάνσοφε· διὰ τοῦτο στεφανωθεῖσα, τοὺς τυράννους κατεπάλαισας.
ltx/gr_gr_cog/me.m05.d05:meMA.Ode3C13.incipit	Πύργος ἀρετῶν ἀκλόνητος, καὶ θεοσεβείας…
ltx/gr_gr_cog/me.m05.d05:meMA.Ode3C13.melody	@ltx/gr_gr_cog/he.h.m4:heHE.ToxonDynatonIsthenise.name
ltx/gr_gr_cog/me.m05.d05:meMA.Ode3C13.mode	@ltx/gr_gr_cog/miscellanea:misc.Mode4
ltx/gr_gr_cog/me.m05.d05:meMA.Ode3C13.ode	@ltx/gr_gr_cog/miscellanea:misc.Ode3
ltx/gr_gr_cog/me.m05.d05:meMA.Ode3C13.text	Πύργος ἀρετῶν ἀκλόνητος, καὶ θεοσεβείας κατοικητήριον γέγονας, καὶ ἀνδρείας καὶ σωφροσύνης, ἐνδιαίτημα Πανεύφημε.
ltx/gr_gr_cog/me.m05.d05:meMA.Ode3C1T.incipit	Ῥέων μέχρι σοῦ, ὁ θάνατος…
ltx/gr_gr_cog/me.m05.d05:meMA.Ode3C1T.melody	@ltx/gr_gr_cog/he.h.m4:heHE.ToxonDynatonIsthenise.name
ltx/gr_gr_cog/me.m05.d05:meMA.Ode3C1T.mode	@ltx/gr_gr_cog/miscellanea:misc.Mode4
ltx/gr_gr_cog/me.m05.d05:meMA.Ode3C1T.ode	@ltx/gr_gr_cog/miscellanea:misc.Ode3
ltx/gr_gr_cog/me.m05.d05:meMA.Ode3C1T.text	Ῥέων μέχρι σοῦ, ὁ θάνατος, ἔστη προσβαλὼν τῷ ἐκ σοῦ τεχθέντι Πανάμωμε· διὰ τοῦτο ἀθανασίας, ἀπαρχήν σε ὀνομάζομεν.
ltx/gr_gr_cog/me.m05.d05:meMA.Ode3H.greekmelody	@ltx/gr_gr_cog/he.h.m4:heHE.ToxonDynatonIsthenise.greekname
ltx/gr_gr_cog/me.m05.d05:meMA.Ode3H.incipit	@ltx/gr_gr_cog/he.h.m4:heHE.ToxonDynatonIsthenise.incipit
ltx/gr_gr_cog/me.m05.d05:meMA.Ode3H.melody	@ltx/gr_gr_cog/he.h.m4:heHE.ToxonDynatonIsthenise.melody
ltx/gr_gr_cog/me.m05.d05:meMA.Ode3H.mode	@ltx/gr_gr_cog/miscellanea:misc.Mode4
ltx/gr_gr_cog/me.m05.d05:meMA.Ode3H.ode	@ltx/gr_gr_cog/miscellanea:misc.Ode3
ltx/gr_gr_cog/me.m05.d05:meMA.Ode3H.text	@ltx/gr_gr_cog/he.h.m4:heHE.ToxonDynatonIsthenise.text
ltx/gr_gr_cog/me.m05.d05:meMA.Ode3Kathisma1.greekmelody	@ltx/gr_gr_cog/he.a.m1:heAU.TonTafonSouSotir.greekname
ltx/gr_gr_cog/me.m05.d05:meMA.Ode3Kathisma1.incipit	Τῷ κάλλει σου Χριστέ, ἡ…
ltx/gr_gr_cog/me.m05.d05:meMA.Ode3Kathisma1.melody	@ltx/gr_gr_cog/he.a.m1:heAU.TonTafonSouSotir.name
ltx/gr_gr_cog/me.m05.d05:meMA.Ode3Kathisma1.mode	@ltx/gr_gr_cog/miscellanea:misc.Mode1
ltx/gr_gr_cog/me.m05.d05:meMA.Ode3Kathisma1.text	Τῷ κάλλει σου Χριστέ, ἡ παρθένος τρωθεῖσα, παρέδραμε σπουδῇ, τὰ ὁρώμενα πάντα, καὶ πᾶσαν τὴν τοῦ σώματος, εὐμορφίαν ἐκδέδωκε, ταῖς κολάσεσι, καὶ ταῖς πικραῖς τιμωρίαις, ἀφανίζεσθαι· ἣν εἰς ὡραίους νυμφῶνας, εἰσήγαγες Δέσποτα.
ltx/gr_gr_cog/me.m05.d05:meMA.Ode4C11.greekmelody	@ltx/gr_gr_cog/he.h.m4:heHE.TisSisEpiGis.greekname
ltx/gr_gr_cog/me.m05.d05:meMA.Ode4C11.incipit	Ὁ τὴν εἰρήνην σοι βραβεύων…
ltx/gr_gr_cog/me.m05.d05:meMA.Ode4C11.melody	@ltx/gr_gr_cog/he.h.m4:heHE.TisSisEpiGis.name
ltx/gr_gr_cog/me.m05.d05:meMA.Ode4C11.mode	@ltx/gr_gr_cog/miscellanea:misc.Mode4
ltx/gr_gr_cog/me.m05.d05:meMA.Ode4C11.ode	@ltx/gr_gr_cog/miscellanea:misc.Ode4
ltx/gr_gr_cog/me.m05.d05:meMA.Ode4C11.text	Ὁ τὴν εἰρήνην σοι βραβεύων εἰρηνώνυμε, διʼ αὐτὸν μαχομένην σε θεώμενος, ἀνδροπρεποῦς φρονήματος, Μάρτυς καὶ δυνάμεως ἔπλησε.
ltx/gr_gr_cog/me.m05.d05:meMA.Ode4C12.incipit	Συντονωτάταις προθυμίαις ὑπερβέβηκας, τὸ τοῦ…
ltx/gr_gr_cog/me.m05.d05:meMA.Ode4C12.melody	@ltx/gr_gr_cog/he.h.m4:heHE.TisSisEpiGis.name
ltx/gr_gr_cog/me.m05.d05:meMA.Ode4C12.mode	@ltx/gr_gr_cog/miscellanea:misc.Mode4
ltx/gr_gr_cog/me.m05.d05:meMA.Ode4C12.ode	@ltx/gr_gr_cog/miscellanea:misc.Ode4
ltx/gr_gr_cog/me.m05.d05:meMA.Ode4C12.text	Συντονωτάταις προθυμίαις ὑπερβέβηκας, τὸ τοῦ θήλεος χαῦνον παμμακάριστε, καὶ σταθερῶς διήλεγξας, Μάρτυς τοὺς τῇ πλάνῃ δουλεύοντας.
ltx/gr_gr_cog/me.m05.d05:meMA.Ode4C13.incipit	Ἐνθεωτάτην καρτερίαν ἐπιδέδειξαι, καὶ τυράννων…
ltx/gr_gr_cog/me.m05.d05:meMA.Ode4C13.melody	@ltx/gr_gr_cog/he.h.m4:heHE.TisSisEpiGis.name
ltx/gr_gr_cog/me.m05.d05:meMA.Ode4C13.mode	@ltx/gr_gr_cog/miscellanea:misc.Mode4
ltx/gr_gr_cog/me.m05.d05:meMA.Ode4C13.ode	@ltx/gr_gr_cog/miscellanea:misc.Ode4
ltx/gr_gr_cog/me.m05.d05:meMA.Ode4C13.text	Ἐνθεωτάτην καρτερίαν ἐπιδέδειξαι, καὶ τυράννων τὸ θράσος καταβέβληκας, τῷ σῷ νυμφίῳ κράζουσα· Δόξα τῇ δυνάμει σου Κύριε.
ltx/gr_gr_cog/me.m05.d05:meMA.Ode4C14.incipit	Ὑμνολογίαις ἀσιγήτοις καὶ δεήσεσι, τὸν…
ltx/gr_gr_cog/me.m05.d05:meMA.Ode4C14.melody	@ltx/gr_gr_cog/he.h.m4:heHE.TisSisEpiGis.name
ltx/gr_gr_cog/me.m05.d05:meMA.Ode4C14.mode	@ltx/gr_gr_cog/miscellanea:misc.Mode4
ltx/gr_gr_cog/me.m05.d05:meMA.Ode4C14.ode	@ltx/gr_gr_cog/miscellanea:misc.Ode4
ltx/gr_gr_cog/me.m05.d05:meMA.Ode4C14.text	Ὑμνολογίαις ἀσιγήτοις καὶ δεήσεσι, τὸν Δεσπότην θεόφρον ὑμνολόγησας, καὶ πρὸς αὐτὸν ἀνέδραμες, δόξαν ὀψομένη τὴν ἄφραστον.
ltx/gr_gr_cog/me.m05.d05:meMA.Ode4C1T.incipit	Χαρμονικήν σοι γεγηθότες φωνὴν πάναγνε…
ltx/gr_gr_cog/me.m05.d05:meMA.Ode4C1T.melody	@ltx/gr_gr_cog/he.h.m4:heHE.TisSisEpiGis.name
ltx/gr_gr_cog/me.m05.d05:meMA.Ode4C1T.mode	@ltx/gr_gr_cog/miscellanea:misc.Mode4
ltx/gr_gr_cog/me.m05.d05:meMA.Ode4C1T.ode	@ltx/gr_gr_cog/miscellanea:misc.Ode4
ltx/gr_gr_cog/me.m05.d05:meMA.Ode4C1T.text	Χαρμονικήν σοι γεγηθότες φωνὴν πάναγνε, διὰ σοῦ οἱ σωθέντες ἀνακράζομεν· Χαῖρε Παρθένε πάνσεμνε, χαῖρε Θεοτόκε πανύμνητε.
ltx/gr_gr_cog/me.m05.d05:meMA.Ode5C11.greekmelody	@ltx/gr_gr_cog/he.h.m4:heHE.TonFotismonSouKyrie.greekname
ltx/gr_gr_cog/me.m05.d05:meMA.Ode5C11.incipit	Ἀνδρειοτέρῳ Ἔνδοξε, φρονήματι Χριστόν, Θεὸν…
ltx/gr_gr_cog/me.m05.d05:meMA.Ode5C11.melody	@ltx/gr_gr_cog/he.h.m4:heHE.TonFotismonSouKyrie.name
ltx/gr_gr_cog/me.m05.d05:meMA.Ode5C11.mode	@ltx/gr_gr_cog/miscellanea:misc.Mode4
ltx/gr_gr_cog/me.m05.d05:meMA.Ode5C11.ode	@ltx/gr_gr_cog/miscellanea:misc.Ode5
ltx/gr_gr_cog/me.m05.d05:meMA.Ode5C11.text	Ἀνδρειοτέρῳ Ἔνδοξε, φρονήματι Χριστόν, Θεὸν τῶν ὅλων, τρανῶς ὡμολόγεις, λόγῳ δὲ στεῤῥῷ τοὺς ἀντιπάλους, ἀθληφόρε κατῄσχυνας.
ltx/gr_gr_cog/me.m05.d05:meMA.Ode5C12.incipit	Ἰχνηλατεῖν ἐπόθησας τὸ πάθος τοῦ…
ltx/gr_gr_cog/me.m05.d05:meMA.Ode5C12.melody	@ltx/gr_gr_cog/he.h.m4:heHE.TonFotismonSouKyrie.name
ltx/gr_gr_cog/me.m05.d05:meMA.Ode5C12.mode	@ltx/gr_gr_cog/miscellanea:misc.Mode4
ltx/gr_gr_cog/me.m05.d05:meMA.Ode5C12.ode	@ltx/gr_gr_cog/miscellanea:misc.Ode5
ltx/gr_gr_cog/me.m05.d05:meMA.Ode5C12.text	Ἰχνηλατεῖν ἐπόθησας τὸ πάθος τοῦ Χριστοῦ, καὶ τῇ μιμήσει θερμῶς ἠκολούθεις, ἀγωνιστικῶς ὑπεραθλοῦσα, τοῦ Δεσπότου πανόλβιε.
ltx/gr_gr_cog/me.m05.d05:meMA.Ode5C13.incipit	Στίφη Μαρτύρων Ἔνδοξε, προσήνεγκας Χριστῷ…
ltx/gr_gr_cog/me.m05.d05:meMA.Ode5C13.melody	@ltx/gr_gr_cog/he.h.m4:heHE.TonFotismonSouKyrie.name
ltx/gr_gr_cog/me.m05.d05:meMA.Ode5C13.mode	@ltx/gr_gr_cog/miscellanea:misc.Mode4
ltx/gr_gr_cog/me.m05.d05:meMA.Ode5C13.ode	@ltx/gr_gr_cog/miscellanea:misc.Ode5
ltx/gr_gr_cog/me.m05.d05:meMA.Ode5C13.text	Στίφη Μαρτύρων Ἔνδοξε, προσήνεγκας Χριστῷ, τῇ σῇ σοφίᾳ καὶ θεολογίᾳ, τούτους ἀληθῶς μυσταγωγοῦσα, καὶ τῷ λόγῳ τῆς χάριτος.
ltx/gr_gr_cog/me.m05.d05:meMA.Ode5C1T.incipit	Μεμυημένοι μυστήριον συλλήψεως τῆς σῆς…
ltx/gr_gr_cog/me.m05.d05:meMA.Ode5C1T.melody	@ltx/gr_gr_cog/he.h.m4:heHE.TonFotismonSouKyrie.name
ltx/gr_gr_cog/me.m05.d05:meMA.Ode5C1T.mode	@ltx/gr_gr_cog/miscellanea:misc.Mode4
ltx/gr_gr_cog/me.m05.d05:meMA.Ode5C1T.ode	@ltx/gr_gr_cog/miscellanea:misc.Ode5
ltx/gr_gr_cog/me.m05.d05:meMA.Ode5C1T.text	Μεμυημένοι μυστήριον συλλήψεως τῆς σῆς, καὶ τοῦ ἀφράστου καὶ θείου σου τόκου, σὲ πανευσεβῶς ὑμνολογοῦμεν, Θεοτόκε πανύμνητε.
ltx/gr_gr_cog/me.m05.d05:meMA.Ode6C11.greekmelody	@ltx/gr_gr_cog/he.h.m4:heHE.EvoiseProtypon.greekname
ltx/gr_gr_cog/me.m05.d05:meMA.Ode6C11.incipit	Ἀνώρθωσας, τῆς προμήτορος Εὔας τὴν…
ltx/gr_gr_cog/me.m05.d05:meMA.Ode6C11.melody	@ltx/gr_gr_cog/he.h.m4:heHE.EvoiseProtypon.name
ltx/gr_gr_cog/me.m05.d05:meMA.Ode6C11.mode	@ltx/gr_gr_cog/miscellanea:misc.Mode4
ltx/gr_gr_cog/me.m05.d05:meMA.Ode6C11.ode	@ltx/gr_gr_cog/miscellanea:misc.Ode6
ltx/gr_gr_cog/me.m05.d05:meMA.Ode6C11.text	Ἀνώρθωσας, τῆς προμήτορος Εὔας τὴν ἔκπτωσιν Ἀθληφόρε, τοῦ ἐχθροῦ καθελοῦσα τὴν δύναμιν, καὶ καταβαλοῦσα, τὴν ἐκείνου ὀφρὺν θείᾳ χάριτι.
ltx/gr_gr_cog/me.m05.d05:meMA.Ode6C12.incipit	Ῥωμαλέον, κεκτημένη Εἰρήνη τὸ φρόνημα…
ltx/gr_gr_cog/me.m05.d05:meMA.Ode6C12.melody	@ltx/gr_gr_cog/he.h.m4:heHE.EvoiseProtypon.name
ltx/gr_gr_cog/me.m05.d05:meMA.Ode6C12.mode	@ltx/gr_gr_cog/miscellanea:misc.Mode4
ltx/gr_gr_cog/me.m05.d05:meMA.Ode6C12.ode	@ltx/gr_gr_cog/miscellanea:misc.Ode6
ltx/gr_gr_cog/me.m05.d05:meMA.Ode6C12.text	Ῥωμαλέον, κεκτημένη Εἰρήνη τὸ φρόνημα, τοῖς τυράννοις, ἀντετάξω ψυχῆς γενναιότητι, καὶ στεφάνῳ νίκης, πρὸς Χριστοῦ τοῦ Θεοῦ ἐστεφάνωσαι.
ltx/gr_gr_cog/me.m05.d05:meMA.Ode6C13.incipit	Τῷ αἵματι, τῆς ἀθλήσεως Μάρτυς…
ltx/gr_gr_cog/me.m05.d05:meMA.Ode6C13.melody	@ltx/gr_gr_cog/he.h.m4:heHE.EvoiseProtypon.name
ltx/gr_gr_cog/me.m05.d05:meMA.Ode6C13.mode	@ltx/gr_gr_cog/miscellanea:misc.Mode4
ltx/gr_gr_cog/me.m05.d05:meMA.Ode6C13.ode	@ltx/gr_gr_cog/miscellanea:misc.Ode6
ltx/gr_gr_cog/me.m05.d05:meMA.Ode6C13.text	Τῷ αἵματι, τῆς ἀθλήσεως Μάρτυς φαιδρότερον, ἀπειργάσω, τὸ τῆς φύσεως κάλλος τὸ ἄχραντον, γενικοὺς ἀγῶνας, ὑποστᾶσα στεῤῥῶς καλλιπάρθενε.
ltx/gr_gr_cog/me.m05.d05:meMA.Ode6C1T.incipit	Ὑπέφηνε, τὸ μυστήριον σοῦ τῆς…
ltx/gr_gr_cog/me.m05.d05:meMA.Ode6C1T.melody	@ltx/gr_gr_cog/he.h.m4:heHE.EvoiseProtypon.name
ltx/gr_gr_cog/me.m05.d05:meMA.Ode6C1T.mode	@ltx/gr_gr_cog/miscellanea:misc.Mode4
ltx/gr_gr_cog/me.m05.d05:meMA.Ode6C1T.ode	@ltx/gr_gr_cog/miscellanea:misc.Ode6
ltx/gr_gr_cog/me.m05.d05:meMA.Ode6C1T.text	Ὑπέφηνε, τὸ μυστήριον σοῦ τῆς κυήσεως, ὁ θεόπτης, καιομένην τὴν βάτον θεώμενος, καὶ μὴ φλεγομένην, Θεοτόκε ἁγνὴ ἀειπάρθενε.
ltx/gr_gr_cog/me.m05.d05:meMA.Ode6H.greekmelody	@ltx/gr_gr_cog/he.h.m4:heHE.EvoiseProtypon.greekname
ltx/gr_gr_cog/me.m05.d05:meMA.Ode6H.incipit	@ltx/gr_gr_cog/he.h.m4:heHE.EvoiseProtypon.incipit
ltx/gr_gr_cog/me.m05.d05:meMA.Ode6H.melody	@ltx/gr_gr_cog/he.h.m4:heHE.EvoiseProtypon.melody
ltx/gr_gr_cog/me.m05.d05:meMA.Ode6H.mode	@ltx/gr_gr_cog/miscellanea:misc.Mode4
ltx/gr_gr_cog/me.m05.d05:meMA.Ode6H.ode	@ltx/gr_gr_cog/miscellanea:misc.Ode6
ltx/gr_gr_cog/me.m05.d05:meMA.Ode6H.text	@ltx/gr_gr_cog/he.h.m4:heHE.EvoiseProtypon.text
ltx/gr_gr_cog/me.m05.d05:meMA.Ode7C11.greekmelody	@ltx/gr_gr_cog/he.h.m4:heHE.AvramiaioiPote.greekname
ltx/gr_gr_cog/me.m05.d05:meMA.Ode7C11.incipit	Στεφανηφόρος Σεμνή, παρισταμένη θρόνῳ, τοῦ…
ltx/gr_gr_cog/me.m05.d05:meMA.Ode7C11.melody	@ltx/gr_gr_cog/he.h.m4:heHE.AvramiaioiPote.name
ltx/gr_gr_cog/me.m05.d05:meMA.Ode7C11.mode	@ltx/gr_gr_cog/miscellanea:misc.Mode4
ltx/gr_gr_cog/me.m05.d05:meMA.Ode7C11.ode	@ltx/gr_gr_cog/miscellanea:misc.Ode7
ltx/gr_gr_cog/me.m05.d05:meMA.Ode7C11.text	Στεφανηφόρος Σεμνή, παρισταμένη θρόνῳ, τοῦ σοῦ Δεσπότου περιφρούρησον, τοὺς πίστει κραυγάζοντας, ὁ τῶν Πατέρων ἡμῶν Θεὸς εὐλογητὸς εἶ.
ltx/gr_gr_cog/me.m05.d05:meMA.Ode7C12.incipit	Ἐν οὐρανίαις σκηναῖς, περιχορεύειν Μάρτυς…
ltx/gr_gr_cog/me.m05.d05:meMA.Ode7C12.melody	@ltx/gr_gr_cog/he.h.m4:heHE.AvramiaioiPote.name
ltx/gr_gr_cog/me.m05.d05:meMA.Ode7C12.mode	@ltx/gr_gr_cog/miscellanea:misc.Mode4
ltx/gr_gr_cog/me.m05.d05:meMA.Ode7C12.ode	@ltx/gr_gr_cog/miscellanea:misc.Ode7
ltx/gr_gr_cog/me.m05.d05:meMA.Ode7C12.text	Ἐν οὐρανίαις σκηναῖς, περιχορεύειν Μάρτυς, κατηξιώθης ἀξιάγαστε, Εἰρήνη κραυγάζουσα· ὁ τῶν Πατέρων ἡμῶν Θεὸς εὐλογητὸς εἶ.
ltx/gr_gr_cog/me.m05.d05:meMA.Ode7C13.incipit	Ἰμειρομένη τυχεῖν, τοῦ ἐραστοῦ σου…
ltx/gr_gr_cog/me.m05.d05:meMA.Ode7C13.melody	@ltx/gr_gr_cog/he.h.m4:heHE.AvramiaioiPote.name
ltx/gr_gr_cog/me.m05.d05:meMA.Ode7C13.mode	@ltx/gr_gr_cog/miscellanea:misc.Mode4
ltx/gr_gr_cog/me.m05.d05:meMA.Ode7C13.ode	@ltx/gr_gr_cog/miscellanea:misc.Ode7
ltx/gr_gr_cog/me.m05.d05:meMA.Ode7C13.text	Ἰμειρομένη τυχεῖν, τοῦ ἐραστοῦ σου κάλλους, βασάνων πόνους ἐκαρτέρησας, Εἰρήνη κραυγάζουσα· ὁ τῶν Πατέρων ἡμῶν Θεὸς εὐλογητὸς εἶ.
ltx/gr_gr_cog/me.m05.d05:meMA.Ode7C1T.incipit	Ῥήσει χειλέων τῶν σῶν, ἀκολουθοῦντες…
ltx/gr_gr_cog/me.m05.d05:meMA.Ode7C1T.melody	@ltx/gr_gr_cog/he.h.m4:heHE.AvramiaioiPote.name
ltx/gr_gr_cog/me.m05.d05:meMA.Ode7C1T.mode	@ltx/gr_gr_cog/miscellanea:misc.Mode4
ltx/gr_gr_cog/me.m05.d05:meMA.Ode7C1T.ode	@ltx/gr_gr_cog/miscellanea:misc.Ode7
ltx/gr_gr_cog/me.m05.d05:meMA.Ode7C1T.text	Ῥήσει χειλέων τῶν σῶν, ἀκολουθοῦντες πίστει, σὲ Θεομῆτορ μακαρίζομεν, βοῶντες τῷ τόκῳ σου· ὁ τῶν Πατέρων ἡμῶν Θεὸς εὐλογητὸς εἶ.
ltx/gr_gr_cog/me.m05.d05:meMA.Ode8C11.greekmelody	@ltx/gr_gr_cog/he.h.m4:heHE.PaidasEvageis.greekname
ltx/gr_gr_cog/me.m05.d05:meMA.Ode8C11.incipit	Ἤθλησας Εἰρήνη μακαρία, γενναίως καὶ…
ltx/gr_gr_cog/me.m05.d05:meMA.Ode8C11.melody	@ltx/gr_gr_cog/he.h.m4:heHE.PaidasEvageis.name
ltx/gr_gr_cog/me.m05.d05:meMA.Ode8C11.mode	@ltx/gr_gr_cog/miscellanea:misc.Mode4
ltx/gr_gr_cog/me.m05.d05:meMA.Ode8C11.ode	@ltx/gr_gr_cog/miscellanea:misc.Ode8
ltx/gr_gr_cog/me.m05.d05:meMA.Ode8C11.text	Ἤθλησας Εἰρήνη μακαρία, γενναίως καὶ τοὺς τυράννους καταβέβληκας, ἔχουσα συμπράττουσαν, τὴν ἀκαταμάχητον, τοῦ σοῦ Δεσπότου δύναμιν, καὶ συνεργοῦσάν σοι καί, Κύριον ὑμνεῖτε, ἐβόας, καὶ ὑπερυψοῦτε, εἰς πάντας τοὺς αἰῶνας.
ltx/gr_gr_cog/me.m05.d05:meMA.Ode8C12.incipit	Νεᾶνις ἀγάπῃ τετρωμένη, ὀπίσω τοῦ…
ltx/gr_gr_cog/me.m05.d05:meMA.Ode8C12.melody	@ltx/gr_gr_cog/he.h.m4:heHE.PaidasEvageis.name
ltx/gr_gr_cog/me.m05.d05:meMA.Ode8C12.mode	@ltx/gr_gr_cog/miscellanea:misc.Mode4
ltx/gr_gr_cog/me.m05.d05:meMA.Ode8C12.ode	@ltx/gr_gr_cog/miscellanea:misc.Ode8
ltx/gr_gr_cog/me.m05.d05:meMA.Ode8C12.text	Νεᾶνις ἀγάπῃ τετρωμένη, ὀπίσω τοῦ σοῦ νυμφίου ἠκολούθησας, Εἰρήνη πανένδοξε, τούτου τὰ παθήματα, ἐν τῇ σαρκί σου φέρουσα, καὶ ἀναμέλπουσα, τὸν Κύριον ὑμνεῖτε τὰ ἔργα, καὶ ὑπερυψοῦτε, εἰς πάντας τοὺς αἰῶνας.
ltx/gr_gr_cog/me.m05.d05:meMA.Ode8C13.incipit	Ἡ σὴ ἐν βασάνοις καρτερία…
ltx/gr_gr_cog/me.m05.d05:meMA.Ode8C13.melody	@ltx/gr_gr_cog/he.h.m4:heHE.PaidasEvageis.name
ltx/gr_gr_cog/me.m05.d05:meMA.Ode8C13.mode	@ltx/gr_gr_cog/miscellanea:misc.Mode4
ltx/gr_gr_cog/me.m05.d05:meMA.Ode8C13.ode	@ltx/gr_gr_cog/miscellanea:misc.Ode8
ltx/gr_gr_cog/me.m05.d05:meMA.Ode8C13.text	Ἡ σὴ ἐν βασάνοις καρτερία, Εἰρήνη στεφανηφόρε κατεγέλασε, τῶν τῆς ματαιότητος, καὶ τῆς ἀθεότητος, ἀντεχομένων ἔνδοξε, πίστει δὲ ἔψαλλες· τὸν Κύριον ὑμνεῖτε τὰ ἔργα, καὶ ὑπερυψοῦτε, εἰς πάντας τοὺς αἰῶνας.
ltx/gr_gr_cog/me.m05.d05:meMA.Ode8C1T.incipit	Σοφία Θεοῦ πάντων τεχνῖτις, γαστρί…
ltx/gr_gr_cog/me.m05.d05:meMA.Ode8C1T.melody	@ltx/gr_gr_cog/he.h.m4:heHE.PaidasEvageis.name
ltx/gr_gr_cog/me.m05.d05:meMA.Ode8C1T.mode	@ltx/gr_gr_cog/miscellanea:misc.Mode4
ltx/gr_gr_cog/me.m05.d05:meMA.Ode8C1T.ode	@ltx/gr_gr_cog/miscellanea:misc.Ode8
ltx/gr_gr_cog/me.m05.d05:meMA.Ode8C1T.text	Σοφία Θεοῦ πάντων τεχνῖτις, γαστρί σου Παρθενομῆτορ ἐνσκηνώσασα, οἶκον ᾠκοδόμησεν, ἔννουν τε καὶ ἔμψυχον, τὸν ἑαυτῆς καὶ ἔσωσε, κόσμον κραυγάζοντα· τὸν Κύριον ὑμνεῖτε τὰ ἔργα, καὶ ὑπερυψοῦτε, εἰς πάντας τοὺς αἰῶνας.
ltx/gr_gr_cog/me.m05.d05:meMA.Ode8H.greekmelody	@ltx/gr_gr_cog/he.h.m4:heHE.PaidasEvageis.greekname
ltx/gr_gr_cog/me.m05.d05:meMA.Ode8H.incipit	@ltx/gr_gr_cog/he.h.m4:heHE.PaidasEvageis.incipit
ltx/gr_gr_cog/me.m05.d05:meMA.Ode8H.melody	@ltx/gr_gr_cog/he.h.m4:heHE.PaidasEvageis.melody
ltx/gr_gr_cog/me.m05.d05:meMA.Ode8H.mode	@ltx/gr_gr_cog/miscellanea:misc.Mode4
ltx/gr_gr_cog/me.m05.d05:meMA.Ode8H.ode	@ltx/gr_gr_cog/miscellanea:misc.Ode8
ltx/gr_gr_cog/me.m05.d05:meMA.Ode8H.text	@ltx/gr_gr_cog/he.h.m4:heHE.PaidasEvageis.text
ltx/gr_gr_cog/me.m05.d05:meMA.Ode9C11.greekmelody	@ltx/gr_gr_cog/he.h.m4:heHE.EvaMenToTisParakois.greekname
ltx/gr_gr_cog/me.m05.d05:meMA.Ode9C11.incipit	Κύκλῳ περὶ τὸν σὸν ἐραστὴν…
ltx/gr_gr_cog/me.m05.d05:meMA.Ode9C11.melody	@ltx/gr_gr_cog/he.h.m4:heHE.EvaMenToTisParakois.name
ltx/gr_gr_cog/me.m05.d05:meMA.Ode9C11.mode	@ltx/gr_gr_cog/miscellanea:misc.Mode4
ltx/gr_gr_cog/me.m05.d05:meMA.Ode9C11.ode	@ltx/gr_gr_cog/miscellanea:misc.Ode9
ltx/gr_gr_cog/me.m05.d05:meMA.Ode9C11.text	Κύκλῳ περὶ τὸν σὸν ἐραστὴν χορεύουσα, ἐν ὑψίστοις καλλιπάρθενε, αἴτησαι κόσμῳ τὴν εἰρήνην, Εἰρήνη, καὶ πταισμάτων τὴν ἄφεσιν, τοῖς πίστει ἐκτελοῦσι τὴν μνήμην σου, τὴν φωτοφόρον καὶ πανίερον.
ltx/gr_gr_cog/me.m05.d05:meMA.Ode9C12.incipit	Ἔνδον τῆς παστάδος σε Χριστὸς…
ltx/gr_gr_cog/me.m05.d05:meMA.Ode9C12.melody	@ltx/gr_gr_cog/he.h.m4:heHE.EvaMenToTisParakois.name
ltx/gr_gr_cog/me.m05.d05:meMA.Ode9C12.mode	@ltx/gr_gr_cog/miscellanea:misc.Mode4
ltx/gr_gr_cog/me.m05.d05:meMA.Ode9C12.ode	@ltx/gr_gr_cog/miscellanea:misc.Ode9
ltx/gr_gr_cog/me.m05.d05:meMA.Ode9C12.text	Ἔνδον τῆς παστάδος σε Χριστὸς ὡς Μάρτυρα, καὶ Παρθένον κατεσκήνωσεν, ἔνθα Παρθένοις συναγάλλῃ, καὶ σὺν τοῖς τῶν Μαρτύρων στρατεύμασιν, Εἰρήνη, στεφανηφόρε πανεύφημε· ὅθεν σε πάντες μακαρίζομεν.
ltx/gr_gr_cog/me.m05.d05:meMA.Ode9C13.incipit	Πύλας διανοίξας οὐρανῶν ἐδέξατο, τὴν…
ltx/gr_gr_cog/me.m05.d05:meMA.Ode9C13.melody	@ltx/gr_gr_cog/he.h.m4:heHE.EvaMenToTisParakois.name
ltx/gr_gr_cog/me.m05.d05:meMA.Ode9C13.mode	@ltx/gr_gr_cog/miscellanea:misc.Mode4
ltx/gr_gr_cog/me.m05.d05:meMA.Ode9C13.ode	@ltx/gr_gr_cog/miscellanea:misc.Ode9
ltx/gr_gr_cog/me.m05.d05:meMA.Ode9C13.text	Πύλας διανοίξας οὐρανῶν ἐδέξατο, τὴν ψυχήν σου τὴν πανάμωμον, μόνος ὁ πάντων βασιλεύων, καὶ τῆς δικαιοσύνης ὁ πρύτανις, Εἰρήνη, θείας εἰρήνης ἐπώνυμε· ὅθεν σε πάντες μακαρίζομεν.
ltx/gr_gr_cog/me.m05.d05:meMA.Ode9C1T.incipit	Ἔχουσα πρὸς τὸν ἐκ σοῦ…
ltx/gr_gr_cog/me.m05.d05:meMA.Ode9C1T.melody	@ltx/gr_gr_cog/he.h.m4:heHE.EvaMenToTisParakois.name
ltx/gr_gr_cog/me.m05.d05:meMA.Ode9C1T.mode	@ltx/gr_gr_cog/miscellanea:misc.Mode4
ltx/gr_gr_cog/me.m05.d05:meMA.Ode9C1T.ode	@ltx/gr_gr_cog/miscellanea:misc.Ode9
ltx/gr_gr_cog/me.m05.d05:meMA.Ode9C1T.text	Ἔχουσα πρὸς τὸν ἐκ σοῦ Υἱὸν πανάχραντε, παῤῥησίαν ἀνεπαίσχυντον, τοῦτον δυσώπει Παναγία, τῷ κόσμῳ τὴν εἰρήνην δωρήσασθαι, καὶ πάσαις Ἐκκλησίαις ὁμόνοιαν, ἵνα σε πάντες μεγαλύνωμεν.
ltx/gr_gr_cog/me.m05.d05:meMA.Ode9H.greekmelody	@ltx/gr_gr_cog/he.h.m4:heHE.EvaMenToTisParakois.greekname
ltx/gr_gr_cog/me.m05.d05:meMA.Ode9H.incipit	@ltx/gr_gr_cog/he.h.m4:heHE.EvaMenToTisParakois.incipit
ltx/gr_gr_cog/me.m05.d05:meMA.Ode9H.melody	@ltx/gr_gr_cog/he.h.m4:heHE.EvaMenToTisParakois.melody
ltx/gr_gr_cog/me.m05.d05:meMA.Ode9H.mode	@ltx/gr_gr_cog/miscellanea:misc.Mode4
ltx/gr_gr_cog/me.m05.d05:meMA.Ode9H.ode	@ltx/gr_gr_cog/miscellanea:misc.Ode9
ltx/gr_gr_cog/me.m05.d05:meMA.Ode9H.text	@ltx/gr_gr_cog/he.h.m4:heHE.EvaMenToTisParakois.text
ltx/gr_gr_cog/me.m05.d05:meMA.Oikos1.text	Τοῦ νυμφίου Χριστοῦ ἔρωτι, Παναοίδιμε, ἀπὸ βρέφους σεμνὴ πυρποληθεῖσα ἔδραμες, δορκὰς ὡς διψῶσα πηγαῖς ἀειρύτοις, καὶ τῇ ἀθλήσει σαυτὴν συντηρήσασα, ἐν τῷ ἀφθάρτῳ, ὄντως τοῦ Κτίστου σου θαλάμῳ ἔνδοξε, ὡς νύμφη εὐκλεής, ἐστολισμένη, πεποικιλμένη, εἰσῆλθες ὡς ἐκλεκτή, στεφανηφόρος ὁραθεῖσα, ἐξ ἀφθάρτου νυμφίου δεξαμένη, ὡς χρυσίον, βραβεῖον νίκης τῆς σῆς ἀθλήσεως.
ltx/gr_gr_cog/me.m05.d05:meVE.Apolytikion1ger.greekmelody	@ltx/gr_gr_cog/he.a.m4:heAU.TachyProkatalave.greekname
ltx/gr_gr_cog/me.m05.d05:meVE.Apolytikion1ger.incipit	Εἰρήνης τὸν ἄρχοντα, ἰχνηλατοῦσα σεμνή…
ltx/gr_gr_cog/me.m05.d05:meVE.Apolytikion1ger.melody	@ltx/gr_gr_cog/he.a.m4:heAU.TachyProkatalave.name
ltx/gr_gr_cog/me.m05.d05:meVE.Apolytikion1ger.mode	@ltx/gr_gr_cog/miscellanea:misc.Mode4
ltx/gr_gr_cog/me.m05.d05:meVE.Apolytikion1ger.poet	@ltx/gr_gr_cog/poets:po.Gerasimou
ltx/gr_gr_cog/me.m05.d05:meVE.Apolytikion1ger.text	Εἰρήνης τὸν ἄρχοντα, ἰχνηλατοῦσα σεμνή, εἰρήνης ἐπώνυμος, διʼ ἐπιπνοίας Θεοῦ, ἐδείχθης πανεύφημε· σὺ γὰρ τοῦ πολεμίου, τὰς ἐνέδρας φυγοῦσα, ἤθλησας ἡπὲρ φύσιν, ὡς παρθένος φρονίμη· διὸ Μεγαλομάρτυς Εἰρήνη, εἰρήνην ἡμῖν αἴτησαι.
ltx/gr_gr_cog/me.m05.d05:meVE.Apolytikion2ger.greekmelody	@ltx/gr_gr_cog/he.a.m4:heAU.TachyProkatalave.greekname
ltx/gr_gr_cog/me.m05.d05:meVE.Apolytikion2ger.incipit	Μαδύτου σε πρόεδρον, καὶ Ἱεράρχην…
ltx/gr_gr_cog/me.m05.d05:meVE.Apolytikion2ger.melody	@ltx/gr_gr_cog/he.a.m4:heAU.TachyProkatalave.name
ltx/gr_gr_cog/me.m05.d05:meVE.Apolytikion2ger.mode	@ltx/gr_gr_cog/miscellanea:misc.Mode4
ltx/gr_gr_cog/me.m05.d05:meVE.Apolytikion2ger.poet	@ltx/gr_gr_cog/poets:po.Gerasimou
ltx/gr_gr_cog/me.m05.d05:meVE.Apolytikion2ger.text	Μαδύτου σε πρόεδρον, καὶ Ἱεράρχην κλεινόν, ἡ χάρις ἀνέδειξεν, ὡς τοῦ Χριστοῦ μιμητήν, Εὐθύμιε Ὅσιε· ὅθεν ἱερατεύσας, θεοφρόνως Κυρίῳ, ὤφθης τῆς εὐσεβείας, πρακτικὸς ὑποφήτης· καὶ νῦν Πάτερ ἱκέτευε, ὑπὲρ τῶν τιμώντων σε.
ltx/gr_gr_cog/me.m05.d05:meVE.Stichera01.greekmelody	@ltx/gr_gr_cog/he.a.m1:heAU.PaneffimoiMartyres.greekname
ltx/gr_gr_cog/me.m05.d05:meVE.Stichera01.incipit	Πορφύραν ἐξ αἵματος λαμπράν, τοῦ…
ltx/gr_gr_cog/me.m05.d05:meVE.Stichera01.melody	@ltx/gr_gr_cog/he.a.m1:heAU.PaneffimoiMartyres.name
ltx/gr_gr_cog/me.m05.d05:meVE.Stichera01.mode	@ltx/gr_gr_cog/miscellanea:misc.Mode1
ltx/gr_gr_cog/me.m05.d05:meVE.Stichera01.text	Πορφύραν ἐξ αἵματος λαμπράν, τοῦ οἰκείου Πάνσεμνε, περιθεμένη ἀνέδραμες, πρὸς ὃν ἐπόθησας, Βασιλέα Κτίστην, τοῦ παντὸς καὶ Κύριον, πρὸς τούτου τε τῆς νίκης τὸν στέφανον, ὄντως ἀπείληφας, σὺν αὐτῷ νῦν βασιλεύουσα, ὡς παρθένος, καὶ Μάρτυς πολύαθλος.
ltx/gr_gr_cog/me.m05.d05:meVE.Stichera02.incipit	Πυρὸς καταφλέγοντος ὁρμήν, ἤνεγκας Πανεύφημε…
ltx/gr_gr_cog/me.m05.d05:meVE.Stichera02.melody	@ltx/gr_gr_cog/he.a.m1:heAU.PaneffimoiMartyres.name
ltx/gr_gr_cog/me.m05.d05:meVE.Stichera02.mode	@ltx/gr_gr_cog/miscellanea:misc.Mode1
ltx/gr_gr_cog/me.m05.d05:meVE.Stichera02.text	Πυρὸς καταφλέγοντος ὁρμήν, ἤνεγκας Πανεύφημε, ξέσεις τε πάσας τοῦ σώματος, ἐνατενίζουσα, πρὸς τὰς ἀντιδόσεις, τὰς ἐκεῖσε πάνσεμνε, ἃς μόνοις Ἰησοῦς προητοίμασε, τοῖς ἀγαπήσασι, καὶ θερμῶς αὐτὸν ποθήσασιν, ὡς νυμφίον, ψυχῶν ὡραιότατον.
ltx/gr_gr_cog/me.m05.d05:meVE.Stichera03.incipit	Ἐθέλχθης τῷ ἔρωτι Χριστοῦ, καὶ…
ltx/gr_gr_cog/me.m05.d05:meVE.Stichera03.melody	@ltx/gr_gr_cog/he.a.m1:heAU.PaneffimoiMartyres.name
ltx/gr_gr_cog/me.m05.d05:meVE.Stichera03.mode	@ltx/gr_gr_cog/miscellanea:misc.Mode1
ltx/gr_gr_cog/me.m05.d05:meVE.Stichera03.text	Ἐθέλχθης τῷ ἔρωτι Χριστοῦ, καὶ θεοὺς ἐμίσησας, ἐθνῶν καὶ ἄψυχα ξόανα, Εἰρήνη ἔνδοξε, καὶ θεογνωσίας, στήλην ἐμφανέστατα, σαυτὴν τοῖς καθορῶσιν ἀνέστησας ὡς εναθλήσασα, καὶ τὸν δρόμον, τελειώσασα, καὶ τὴν πίστιν, ἄμωμον τηρήσασα.
