ltx/gr_gr_cog/oc.m6.d7:ocBK.ModeNaked	@ltx/gr_gr_cog/miscellanea:misc.Mode6.naked
ltx/gr_gr_cog/oc.m6.d7:ocBK.end.title	ΤΕΛΟΣ ΤΟΥ ΠΛΑΓΙΟΥ ΔΕΥΤΕΡΟΥ ΗΧΟΥ
ltx/gr_gr_cog/oc.m6.d7:ocBK.end.verse1.text	Ἕκτος μελῳδός, ἀλλʼ ὑπέρπρωτος πέλεις,
ltx/gr_gr_cog/oc.m6.d7:ocBK.end.verse2.text	Ὁ δεύτερος σύ, τῶν μελῶν δευτερεύων.
ltx/gr_gr_cog/oc.m6.d7:ocBK.end.verse3.text	Τὰς ἡδονὰς σὺ διπλοσυνθέτους φέρεις,
ltx/gr_gr_cog/oc.m6.d7:ocBK.end.verse4.text	Τοῦ δευτέρου πως δευτερεύων δευτέρως.
ltx/gr_gr_cog/oc.m6.d7:ocBK.end.verse5.text	Σὲ τὸν μελιχρόν, τὸν γλυκύν, τὸν τέττιγα,
ltx/gr_gr_cog/oc.m6.d7:ocBK.end.verse6.text	Τὸν ἐν πλαγίοις δεύτερον τίς οὐ φιλεῖ;
ltx/gr_gr_cog/oc.m6.d7:ocLI.Beatitudes1.incipit	@ltx/gr_gr_cog/oc.m6.d1:ocLI.Beatitudes1.incipit
ltx/gr_gr_cog/oc.m6.d7:ocLI.Beatitudes1.melody	@ltx/gr_gr_cog/he.h.m6:heHE.IToChaireDiAngelou.name
ltx/gr_gr_cog/oc.m6.d7:ocLI.Beatitudes1.mode	@ltx/gr_gr_cog/miscellanea:misc.Mode6
ltx/gr_gr_cog/oc.m6.d7:ocLI.Beatitudes1.text	@ltx/gr_gr_cog/oc.m6.d1:ocLI.Beatitudes1.text
ltx/gr_gr_cog/oc.m6.d7:ocLI.Beatitudes2.incipit	Ὁ Προφήτας, Διδασκάλους καί, Ὁσίους…
ltx/gr_gr_cog/oc.m6.d7:ocLI.Beatitudes2.melody	@ltx/gr_gr_cog/he.h.m6:heHE.IToChaireDiAngelou.name
ltx/gr_gr_cog/oc.m6.d7:ocLI.Beatitudes2.mode	@ltx/gr_gr_cog/miscellanea:misc.Mode6
ltx/gr_gr_cog/oc.m6.d7:ocLI.Beatitudes2.text	Ὁ Προφήτας, Διδασκάλους καὶ Ὁσίους, καὶ Δικαίους δοξάσας Φιλάνθρωπε, αὐτῶν πρεσβείαις, σῶσον ἡμᾶς, Κύριε.
ltx/gr_gr_cog/oc.m6.d7:ocLI.Beatitudes3.incipit	Πῦρ καὶ ξίφος, ξέσεις καὶ…
ltx/gr_gr_cog/oc.m6.d7:ocLI.Beatitudes3.melody	@ltx/gr_gr_cog/he.h.m6:heHE.IToChaireDiAngelou.name
ltx/gr_gr_cog/oc.m6.d7:ocLI.Beatitudes3.mode	@ltx/gr_gr_cog/miscellanea:misc.Mode6
ltx/gr_gr_cog/oc.m6.d7:ocLI.Beatitudes3.text	Πῦρ καὶ ξίφος, ξέσεις καὶ ἀγρίους θῆρας, Ἀθλοφόροι μὴ πτήξαντες ἔνδοξοι, τῆς ἀϊδίου, ζωῆς ἠξιώθητε.
ltx/gr_gr_cog/oc.m6.d7:ocLI.Beatitudes4.incipit	Μετὰ πάντων, τῶν Ἁγίων καὶ…
ltx/gr_gr_cog/oc.m6.d7:ocLI.Beatitudes4.melody	@ltx/gr_gr_cog/he.h.m6:heHE.IToChaireDiAngelou.name
ltx/gr_gr_cog/oc.m6.d7:ocLI.Beatitudes4.mode	@ltx/gr_gr_cog/miscellanea:misc.Mode6
ltx/gr_gr_cog/oc.m6.d7:ocLI.Beatitudes4.text	Μετὰ πάντων, τῶν Ἁγίων καὶ Δικαίων, τάξον Λόγε οὓς πίστει μετέστησας, ἐκ τῶν προσκαίρων, ὅπως σε δοξάζωμεν.
ltx/gr_gr_cog/oc.m6.d7:ocLI.BeatitudesT.incipit	Μακαρία, γενεαῖς ἐν πάσαις ὤφθης…
ltx/gr_gr_cog/oc.m6.d7:ocLI.BeatitudesT.melody	@ltx/gr_gr_cog/he.h.m6:heHE.IToChaireDiAngelou.name
ltx/gr_gr_cog/oc.m6.d7:ocLI.BeatitudesT.mode	@ltx/gr_gr_cog/miscellanea:misc.Mode6
ltx/gr_gr_cog/oc.m6.d7:ocLI.BeatitudesT.text	Μακαρία, γενεαῖς ἐν πάσαις ὤφθης· τὸν Θεὸν γὰρ τὸν ὄντως μακάριον, ἀνερμηνεύτως, ἐκύησας Ἄχραντε.
ltx/gr_gr_cog/oc.m6.d7:ocLI.BeatitudesTr.incipit	Παντοκράτορ, ἡ Τριὰς ἡ ἐν…
ltx/gr_gr_cog/oc.m6.d7:ocLI.BeatitudesTr.melody	@ltx/gr_gr_cog/he.h.m6:heHE.IToChaireDiAngelou.name
ltx/gr_gr_cog/oc.m6.d7:ocLI.BeatitudesTr.mode	@ltx/gr_gr_cog/miscellanea:misc.Mode6
ltx/gr_gr_cog/oc.m6.d7:ocLI.BeatitudesTr.text	Παντοκράτορ, ἡ Τριὰς ἡ ἐν Μονάδι, ὑμνουμένη ἐκ γῆς οὓς μετέστησας, πιστοὺς ἐν κόλποις, Ἀβραὰμ κατάταξον.
ltx/gr_gr_cog/oc.m6.d7:ocLI.MM.Beatitudes1234TrTas78910GB.text	@ltx/gr_gr_cog/properties:media.key
ltx/gr_gr_cog/oc.m6.d7:ocMA.ApolTheotokion.greekmelody	@ltx/gr_gr_cog/he.a.m6:heAU.ElpisTouKosmouAgathi.greekname
ltx/gr_gr_cog/oc.m6.d7:ocMA.ApolTheotokion.incipit	@ltx/gr_gr_cog/oc.m6.d3:ocMA.Kathisma13.incipit
ltx/gr_gr_cog/oc.m6.d7:ocMA.ApolTheotokion.melody	@ltx/gr_gr_cog/he.a.m6:heAU.ElpisTouKosmouAgathi.name
ltx/gr_gr_cog/oc.m6.d7:ocMA.ApolTheotokion.mode	@ltx/gr_gr_cog/miscellanea:misc.Mode6
ltx/gr_gr_cog/oc.m6.d7:ocMA.ApolTheotokion.text	@ltx/gr_gr_cog/oc.m6.d3:ocMA.Kathisma13.text
ltx/gr_gr_cog/oc.m6.d7:ocMA.AposTheotokion.greekmelody	@ltx/gr_gr_cog/he.a.m6:heAU.OlinApothemenoi.greekname
ltx/gr_gr_cog/oc.m6.d7:ocMA.AposTheotokion.incipit	Ὤφθης ἐνδιαίτημα, θεοπρεπὲς Παναγία· Θεὸν…
ltx/gr_gr_cog/oc.m6.d7:ocMA.AposTheotokion.melody	@ltx/gr_gr_cog/he.a.m6:heAU.OlinApothemenoi.name
ltx/gr_gr_cog/oc.m6.d7:ocMA.AposTheotokion.mode	@ltx/gr_gr_cog/miscellanea:misc.Mode6
ltx/gr_gr_cog/oc.m6.d7:ocMA.AposTheotokion.text	Ὤφθης ἐνδιαίτημα, θεοπρεπὲς Παναγία· Θεὸν γὰρ ἐχώρησας, καὶ Χριστὸν ἐγέννησας ἀπειρόγαμε, βροτὸν ὁρώμενον, ἐν δυσὶν οὐσίαις, ἐν μιὰ τῇ ὑποστάσει δέ, ὃν ἐκδυσώπησον, ὡς μονογενῆ καὶ πρωτότοκον, τὸν σὲ παρθένον ἄμωμον, καὶ μετὰ τὸν τόκον φυλάξαντα, ψυχὰς ἀναπαῦσαι, τῶν πίστει κοιμηθέντων ἐν φωτί, ἐν ἀκηράτῳ φαιδρότητι, καὶ μακαριότητι.
ltx/gr_gr_cog/oc.m6.d7:ocMA.Aposticha1.greekmelody	@ltx/gr_gr_cog/he.a.m6:heAU.OlinApothemenoi.greekname
ltx/gr_gr_cog/oc.m6.d7:ocMA.Aposticha1.incipit	Ἔχων ἀκατάληπτον, τὴν εἰς ἡμᾶς…
ltx/gr_gr_cog/oc.m6.d7:ocMA.Aposticha1.melody	@ltx/gr_gr_cog/he.a.m6:heAU.OlinApothemenoi.name
ltx/gr_gr_cog/oc.m6.d7:ocMA.Aposticha1.mode	@ltx/gr_gr_cog/miscellanea:misc.Mode6
ltx/gr_gr_cog/oc.m6.d7:ocMA.Aposticha1.text	Ἔχων ἀκατάληπτον, τὴν εἰς ἡμᾶς εὐσπλαγχνίαν, καὶ πηγὴν ἀκένωτον θεϊκῆς χρηστότητος πολυέλεε, τοὺς πρὸς σὲ Δέσποτα, μεταβεβηκότας, ἐν γῇ ζώντων κατασκήνωσον, εἰς τὰ σκηνώματα, τὰ ἀγαπητὰ καὶ ποθούμενα, κατάσχεσιν δωρούμενος, τὴν διηνεκῶς διαμένουσαν· σὺ γὰρ ὑπὲρ πάντων, ἐξέχεας τὸ αἷμά σου Χριστέ, καὶ ζωηφόρῳ τιμήματι, κόσμον ἐξηγόρασας.
ltx/gr_gr_cog/oc.m6.d7:ocMA.Aposticha2.greekmelody	@ltx/gr_gr_cog/he.a.m6:heAU.OlinApothemenoi.greekname
ltx/gr_gr_cog/oc.m6.d7:ocMA.Aposticha2.incipit	Νέκρωσιν ὑπέμεινας, ζωοποιὸν ἑκουσίως, καὶ…
ltx/gr_gr_cog/oc.m6.d7:ocMA.Aposticha2.melody	@ltx/gr_gr_cog/he.a.m6:heAU.OlinApothemenoi.name
ltx/gr_gr_cog/oc.m6.d7:ocMA.Aposticha2.mode	@ltx/gr_gr_cog/miscellanea:misc.Mode6
ltx/gr_gr_cog/oc.m6.d7:ocMA.Aposticha2.text	Νέκρωσιν ὑπέμεινας, ζωοποιὸν ἑκουσίως, καὶ ζωὴν ἐπήγασας, καὶ τρυφὴν ἀΐδιον πιστοῖς δέδωκας, ἐν ᾗ κατάταξον, τοὺς κεκοιμημένους, ἐπʼ ἐλπίδι ἀναστάσεως, τὰ τούτων πταίσματα, πάντα συγχωρῶν ἀγαθότητι, ὡς μόνος ἀναμάρτητος, μόνος ἀγαθὸς καὶ φιλάνθρωπος, ἵνα διὰ πάντων, ὑμνῆταί σου τὸ ὄνομα Χριστέ, καὶ σεσωσμένοι δοξάζωμεν, τὴν οἰκονομίαν σου.
ltx/gr_gr_cog/oc.m6.d7:ocMA.Aposticha3.greekmelody	@ltx/gr_gr_cog/he.a.m6:heAU.OlinApothemenoi.greekname
ltx/gr_gr_cog/oc.m6.d7:ocMA.Aposticha3.incipit	Ζώντων κυριεύοντα, θεαρχικῇ ἐξουσίᾳ, καὶ…
ltx/gr_gr_cog/oc.m6.d7:ocMA.Aposticha3.melody	@ltx/gr_gr_cog/he.a.m6:heAU.OlinApothemenoi.name
ltx/gr_gr_cog/oc.m6.d7:ocMA.Aposticha3.mode	@ltx/gr_gr_cog/miscellanea:misc.Mode6
ltx/gr_gr_cog/oc.m6.d7:ocMA.Aposticha3.text	Ζώντων κυριεύοντα, θεαρχικῇ ἐξουσίᾳ, καὶ νεκρῶν δεσπόζοντα, σὲ Χριστὲ γινώσκοντες ἱκετεύομεν. Τοὺς πιστοὺς δούλους σου, τοὺς πρὸς σὲ τὸν μόνον, εὐεργέτην ἐκδημήσαντας, αὐτοὺς ἀνάπαυσον, σὺν τοῖς ἐκλεκτοῖς σου φιλάνθρωπε, ἐν τόποις ἀναψύξεως, ἐν ταῖς τῶν Ἁγίων λαμπρότησι, θελητὴς ἐλέους· ὑπάρχεις γὰρ καὶ σώζεις ὡς Θεός, οὓς κατʼ εἰκόνα σου ἔπλασας, μόνε πολυέλεε.
ltx/gr_gr_cog/oc.m6.d7:ocMA.C1.acrostic.notice1	οὗ ἡ ἀκροστιχίς, μετὰ τῶν Νεκρωσίμων καὶ τῶν Θεοτοκίων·
ltx/gr_gr_cog/oc.m6.d7:ocMA.C1.acrostic.text	Λόγοις γεραίρω τοὺς ἐραστὰς τοῦ Λόγου, ὁ Ἰωσήφ.
ltx/gr_gr_cog/oc.m6.d7:ocMA.C1.acrostic.title	Κανὼν εἰς πάντας τοὺς Ἁγίους,
ltx/gr_gr_cog/oc.m6.d7:ocMA.C2.acrostic.notice1	οὗ ἡ ἀκροστιχίς μετὰ τῶν Θεοτοκίων·
ltx/gr_gr_cog/oc.m6.d7:ocMA.C2.acrostic.text	Ἕκτον προσαυδῶ τοῖς ἀπελθοῦσι μέλος.
ltx/gr_gr_cog/oc.m6.d7:ocMA.C2.acrostic.title	Κανὼν εἰς Κοιμηθέντας,
ltx/gr_gr_cog/oc.m6.d7:ocMA.CA.notice	
ltx/gr_gr_cog/oc.m6.d7:ocMA.Kathisma11.greekmelody	@ltx/gr_gr_cog/he.a.m6:heAU.AngelikaiDynameis.greekname
ltx/gr_gr_cog/oc.m6.d7:ocMA.Kathisma11.incipit	@ltx/gr_gr_cog/oc.m6.d3:ocMA.Kathisma32.incipit
ltx/gr_gr_cog/oc.m6.d7:ocMA.Kathisma11.melody	@ltx/gr_gr_cog/he.a.m6:heAU.AngelikaiDynameis.name
ltx/gr_gr_cog/oc.m6.d7:ocMA.Kathisma11.mode	@ltx/gr_gr_cog/miscellanea:misc.Mode6
ltx/gr_gr_cog/oc.m6.d7:ocMA.Kathisma11.text	@ltx/gr_gr_cog/oc.m6.d3:ocMA.Kathisma32.text
ltx/gr_gr_cog/oc.m6.d7:ocMA.Kathisma12.incipit	@ltx/gr_gr_cog/oc.m6.d4:ocMA.Kathisma32.incipit
ltx/gr_gr_cog/oc.m6.d7:ocMA.Kathisma12.melody	
ltx/gr_gr_cog/oc.m6.d7:ocMA.Kathisma12.mode	@ltx/gr_gr_cog/miscellanea:misc.Mode6
ltx/gr_gr_cog/oc.m6.d7:ocMA.Kathisma12.text	@ltx/gr_gr_cog/oc.m6.d4:ocMA.Kathisma32.text
ltx/gr_gr_cog/oc.m6.d7:ocMA.Kathisma13.incipit	@ltx/gr_gr_cog/oc.m6.d5:ocMA.Kathisma32.incipit
ltx/gr_gr_cog/oc.m6.d7:ocMA.Kathisma13.melody	
ltx/gr_gr_cog/oc.m6.d7:ocMA.Kathisma13.mode	@ltx/gr_gr_cog/miscellanea:misc.Mode6
ltx/gr_gr_cog/oc.m6.d7:ocMA.Kathisma13.text	@ltx/gr_gr_cog/oc.m6.d5:ocMA.Kathisma32.text
ltx/gr_gr_cog/oc.m6.d7:ocMA.Kathisma14.incipit	@ltx/gr_gr_cog/oc.m6.d1:ocVE.ApolTheotokionVM.incipit
ltx/gr_gr_cog/oc.m6.d7:ocMA.Kathisma14.melody	
ltx/gr_gr_cog/oc.m6.d7:ocMA.Kathisma14.mode	@ltx/gr_gr_cog/miscellanea:misc.Mode6
ltx/gr_gr_cog/oc.m6.d7:ocMA.Kathisma14.text	@ltx/gr_gr_cog/oc.m6.d1:ocVE.ApolTheotokionVM.text
ltx/gr_gr_cog/oc.m6.d7:ocMA.Kathisma21.incipit	@ltx/gr_gr_cog/oc.m6.d2:ocMA.Kathisma32.incipit
ltx/gr_gr_cog/oc.m6.d7:ocMA.Kathisma21.melody	
ltx/gr_gr_cog/oc.m6.d7:ocMA.Kathisma21.mode	@ltx/gr_gr_cog/miscellanea:misc.Mode6
ltx/gr_gr_cog/oc.m6.d7:ocMA.Kathisma21.text	@ltx/gr_gr_cog/oc.m6.d2:ocMA.Kathisma32.text
ltx/gr_gr_cog/oc.m6.d7:ocMA.Kathisma22.incipit	Ἀληθῶς ματαιότης τὰ σύμπαντα, ὁ…
ltx/gr_gr_cog/oc.m6.d7:ocMA.Kathisma22.melody	
ltx/gr_gr_cog/oc.m6.d7:ocMA.Kathisma22.mode	@ltx/gr_gr_cog/miscellanea:misc.Mode6
ltx/gr_gr_cog/oc.m6.d7:ocMA.Kathisma22.text	Ἀληθῶς ματαιότης τὰ σύμπαντα, ὁ δὲ βίος σκιὰ καὶ ἐνύπνιον· καὶ γὰρ μάτην ταράττεται πᾶς γηγενής, ὡς εἶπεν ἡ Γραφή, ὅτε τὸν κόσμον κερδήσομεν, τότε τῷ τάφῳ οἰκήσομεν, ὅπου ὁμοῦ Βασιλεῖς καὶ πτωχοί. Διὸ Χριστὲ ὁ Θεός, τοὺς μεταστάντας ἀνάπαυσον, ὡς φιλάνθρωπος.
ltx/gr_gr_cog/oc.m6.d7:ocMA.Kathisma23.greekmelody	@ltx/gr_gr_cog/he.a.m6:heAU.ElpisTouKosmouAgathi.greekname
ltx/gr_gr_cog/oc.m6.d7:ocMA.Kathisma23.incipit	Ἡ κραταιὰ τῶν γηγενῶν, προστασία…
ltx/gr_gr_cog/oc.m6.d7:ocMA.Kathisma23.melody	@ltx/gr_gr_cog/he.a.m6:heAU.ElpisTouKosmouAgathi.name
ltx/gr_gr_cog/oc.m6.d7:ocMA.Kathisma23.mode	@ltx/gr_gr_cog/miscellanea:misc.Mode6
ltx/gr_gr_cog/oc.m6.d7:ocMA.Kathisma23.text	Ἡ κραταιὰ τῶν γηγενῶν, προστασία καὶ σκέπη, Θεοκυῆτορ Μαριάμ, ἡ τεκοῦσα ἐν χρόνῳ, τὸν ἄχρονον Υἱὸν καὶ Λόγον τοῦ Θεοῦ, ἱκέτευε αὐτόν, ὡς Μήτηρ οὖσα ἐκτενῶς, σὺν Μάρτυσι καὶ Προφήταις, καὶ θείοις Ἀσκηταῖς, σῶσαι τοὺς μεταστάντας.
ltx/gr_gr_cog/oc.m6.d7:ocMA.Lauds1.incipit	@ltx/gr_gr_cog/oc.m6.d2:ocMA.Aposticha3.incipit
ltx/gr_gr_cog/oc.m6.d7:ocMA.Lauds1.melody	
ltx/gr_gr_cog/oc.m6.d7:ocMA.Lauds1.mode	@ltx/gr_gr_cog/miscellanea:misc.Mode6
ltx/gr_gr_cog/oc.m6.d7:ocMA.Lauds1.text	@ltx/gr_gr_cog/oc.m6.d2:ocMA.Aposticha3.text
ltx/gr_gr_cog/oc.m6.d7:ocMA.Lauds2.incipit	@ltx/gr_gr_cog/oc.m6.d3:ocMA.Aposticha3.incipit
ltx/gr_gr_cog/oc.m6.d7:ocMA.Lauds2.melody	
ltx/gr_gr_cog/oc.m6.d7:ocMA.Lauds2.mode	@ltx/gr_gr_cog/miscellanea:misc.Mode6
ltx/gr_gr_cog/oc.m6.d7:ocMA.Lauds2.text	@ltx/gr_gr_cog/oc.m6.d3:ocMA.Aposticha3.text
ltx/gr_gr_cog/oc.m6.d7:ocMA.Lauds3.incipit	@ltx/gr_gr_cog/oc.m6.d4:ocMA.Aposticha3.incipit
ltx/gr_gr_cog/oc.m6.d7:ocMA.Lauds3.melody	
ltx/gr_gr_cog/oc.m6.d7:ocMA.Lauds3.mode	@ltx/gr_gr_cog/miscellanea:misc.Mode6
ltx/gr_gr_cog/oc.m6.d7:ocMA.Lauds3.text	@ltx/gr_gr_cog/oc.m6.d4:ocMA.Aposticha3.text
ltx/gr_gr_cog/oc.m6.d7:ocMA.Lauds4.incipit	@ltx/gr_gr_cog/oc.m6.d5:ocMA.Aposticha3.incipit
ltx/gr_gr_cog/oc.m6.d7:ocMA.Lauds4.melody	
ltx/gr_gr_cog/oc.m6.d7:ocMA.Lauds4.mode	@ltx/gr_gr_cog/miscellanea:misc.Mode6
ltx/gr_gr_cog/oc.m6.d7:ocMA.Lauds4.text	@ltx/gr_gr_cog/oc.m6.d5:ocMA.Aposticha3.text
ltx/gr_gr_cog/oc.m6.d7:ocMA.LaudsGlory.incipit	Ἐτίμησας εἰκόνι σου…
ltx/gr_gr_cog/oc.m6.d7:ocMA.LaudsGlory.melody	
ltx/gr_gr_cog/oc.m6.d7:ocMA.LaudsGlory.mode	@ltx/gr_gr_cog/miscellanea:misc.Mode6
ltx/gr_gr_cog/oc.m6.d7:ocMA.LaudsGlory.text	Ἐτίμησας εἰκόνι σου, τὸ τῶν χειρῶν σου Σῶτερ πλαστούργημα, ζωγραφήσας ἐν ὑλικῇ μορφῇ, τῆς νοερᾶς οὐσίας τὸ ὁμοίωμα, ἧς καὶ κοινωνόν με κατέστησας, θέμενος τῶν ἐπὶ γῆς κατάρχειν με τῷ αὐτεξουσίῳ Λόγε· διὸ Σῶτερ τοὺς δούλους σου, ἐν χώρᾳ ζώντων, ἐν σκηναῖς Δικαίων ἀνάπαυσον.
ltx/gr_gr_cog/oc.m6.d7:ocMA.LaudsRubric1.text	@ltx/gr_gr_cog/oc.m1.d7:ocMA.LaudsRubric1.text
ltx/gr_gr_cog/oc.m6.d7:ocMA.LaudsTheotokion.incipit	Σὺ εἶ ὁ Θεὸς ἡμῶν…
ltx/gr_gr_cog/oc.m6.d7:ocMA.LaudsTheotokion.melody	
ltx/gr_gr_cog/oc.m6.d7:ocMA.LaudsTheotokion.mode	@ltx/gr_gr_cog/miscellanea:misc.Mode6
ltx/gr_gr_cog/oc.m6.d7:ocMA.LaudsTheotokion.text	Σὺ εἶ ὁ Θεὸς ἡμῶν, ὁ ἐν σοφίᾳ τὰ πάντα δημιουργῶν καὶ πληρῶν. Προφήτας ἐξαπέστειλας, Χριστέ, προφητεῦσαί σου τὴν παρουσίαν, καὶ Ἀποστόλους κηρῦξαί σου τὰ μεγαλεῖα, καὶ οἱ μὲν προεφήτευσαν τὴν ἔλευσίν σου, οἱ δὲ τῷ βαπτίσματι ἐφώτισαν τὰ ἔθνη. Μάρτυρες δὲ ἔτυχον ὧν περ ἐπόθουν, καὶ πρεσβεύει σοι ὁ χορὸς τῶν ἀμφοτέρων, σὺν τῇ τεκούσῃ σε. Ἀνάπαυσον Κύριε ψυχάς, ἃς προσελάβου, καὶ ἡμᾶς καταξίωσον τῆς Βασιλείας σου, ὁ Σταυρὸν ὑπομείνας, διʼ ἐμὲ τὸν κατάκριτον, ὁ Λυτρωτής μου καὶ Θεός.
ltx/gr_gr_cog/oc.m6.d7:ocMA.MM.Alleluia.text	@ltx/gr_gr_cog/properties:media.key
ltx/gr_gr_cog/oc.m6.d7:ocMA.OdeW1C11.incipit	Λελαμπρυσμένῳ νοΐ, τοὺς σκοτεινοὺς περὶ…
ltx/gr_gr_cog/oc.m6.d7:ocMA.OdeW1C11.melody	@ltx/gr_gr_cog/he.h.m6:heHE.OAisthitosFarao.name
ltx/gr_gr_cog/oc.m6.d7:ocMA.OdeW1C11.mode	@ltx/gr_gr_cog/miscellanea:misc.Mode6
ltx/gr_gr_cog/oc.m6.d7:ocMA.OdeW1C11.ode	@ltx/gr_gr_cog/miscellanea:misc.Ode1
ltx/gr_gr_cog/oc.m6.d7:ocMA.OdeW1C11.text	Λελαμπρυσμένῳ νοΐ, τοὺς σκοτεινοὺς περὶ τὸ φῶς, δυσσεβοῦντας τυράννους οἱ Μάρτυρες αἰσχύναντες, πρὸς ἀνέσπερον φέγγος, νικηφόροι γενόμενοι, σοφῶς μετέβησαν.
ltx/gr_gr_cog/oc.m6.d7:ocMA.OdeW1C12.incipit	Οἱ Ἱεράρχαι Χριστοῦ, τῶν Ὁσίων…
ltx/gr_gr_cog/oc.m6.d7:ocMA.OdeW1C12.melody	@ltx/gr_gr_cog/he.h.m6:heHE.OAisthitosFarao.name
ltx/gr_gr_cog/oc.m6.d7:ocMA.OdeW1C12.mode	@ltx/gr_gr_cog/miscellanea:misc.Mode6
ltx/gr_gr_cog/oc.m6.d7:ocMA.OdeW1C12.ode	@ltx/gr_gr_cog/miscellanea:misc.Ode1
ltx/gr_gr_cog/oc.m6.d7:ocMA.OdeW1C12.text	Οἱ Ἱεράρχαι Χριστοῦ, τῶν Ὁσίων ὁ χορός, Προφητῶν καὶ Δικαίων ἁπάντων ὁμήγυρις, ἀρετῶν ταῖς ἰδέαις, ἀστραπτόμενοι ἔφθασαν, πρὸς οὐρανίους σκηνάς.
ltx/gr_gr_cog/oc.m6.d7:ocMA.OdeW1C13.incipit	Γυναίων πᾶσα πληθύς, προσῳκειώθη τῷ…
ltx/gr_gr_cog/oc.m6.d7:ocMA.OdeW1C13.melody	@ltx/gr_gr_cog/he.h.m6:heHE.OAisthitosFarao.name
ltx/gr_gr_cog/oc.m6.d7:ocMA.OdeW1C13.mode	@ltx/gr_gr_cog/miscellanea:misc.Mode6
ltx/gr_gr_cog/oc.m6.d7:ocMA.OdeW1C13.ode	@ltx/gr_gr_cog/miscellanea:misc.Ode1
ltx/gr_gr_cog/oc.m6.d7:ocMA.OdeW1C13.text	Γυναίων πᾶσα πληθύς, προσῳκειώθη τῷ Θεῷ, καὶ τὴν Εὔαν τὸν δεινῶς ἀπάτῃ θανατώσαντα, συμπατήσασα πόνοις, ἀνδρικοῖς μακαρίζεται, ἐνθέοις ᾄσμασι.
ltx/gr_gr_cog/oc.m6.d7:ocMA.OdeW1C14.incipit	Ὁ ἀπὸ γῆς κατʼ ἀρχάς…
ltx/gr_gr_cog/oc.m6.d7:ocMA.OdeW1C14.melody	@ltx/gr_gr_cog/he.h.m6:heHE.OAisthitosFarao.name
ltx/gr_gr_cog/oc.m6.d7:ocMA.OdeW1C14.mode	@ltx/gr_gr_cog/miscellanea:misc.Mode6
ltx/gr_gr_cog/oc.m6.d7:ocMA.OdeW1C14.ode	@ltx/gr_gr_cog/miscellanea:misc.Ode1
ltx/gr_gr_cog/oc.m6.d7:ocMA.OdeW1C14.text	Ὁ ἀπὸ γῆς κατʼ ἀρχάς, πλάσας τὸν ἄνθρωπον Χριστέ, τὰς ψυχὰς τῶν σῶν δούλων, ἀνάπαυσον δεόμεθα, ἐν σκηναῖς τῶν δικαίων, καὶ ἐν τόποις ἀνέσεως, ὡς Ὑπεράγαθος.
ltx/gr_gr_cog/oc.m6.d7:ocMA.OdeW1C1H.greekmelody	@ltx/gr_gr_cog/he.h.m6:heHE.OAisthitosFarao.greekname
ltx/gr_gr_cog/oc.m6.d7:ocMA.OdeW1C1H.incipit	@ltx/gr_gr_cog/he.h.m6:heHE.OAisthitosFarao.incipit
ltx/gr_gr_cog/oc.m6.d7:ocMA.OdeW1C1H.melody	@ltx/gr_gr_cog/he.h.m6:heHE.OAisthitosFarao.melody
ltx/gr_gr_cog/oc.m6.d7:ocMA.OdeW1C1H.mode	@ltx/gr_gr_cog/miscellanea:misc.Mode6
ltx/gr_gr_cog/oc.m6.d7:ocMA.OdeW1C1H.ode	@ltx/gr_gr_cog/miscellanea:misc.Ode1
ltx/gr_gr_cog/oc.m6.d7:ocMA.OdeW1C1H.text	@ltx/gr_gr_cog/he.h.m6:heHE.OAisthitosFarao.text
ltx/gr_gr_cog/oc.m6.d7:ocMA.OdeW1C1T.incipit	Ἱερωτέρα Ἁγνή, τῶν Χερουβεὶμ καὶ…
ltx/gr_gr_cog/oc.m6.d7:ocMA.OdeW1C1T.melody	@ltx/gr_gr_cog/he.h.m6:heHE.OAisthitosFarao.name
ltx/gr_gr_cog/oc.m6.d7:ocMA.OdeW1C1T.mode	@ltx/gr_gr_cog/miscellanea:misc.Mode6
ltx/gr_gr_cog/oc.m6.d7:ocMA.OdeW1C1T.ode	@ltx/gr_gr_cog/miscellanea:misc.Ode1
ltx/gr_gr_cog/oc.m6.d7:ocMA.OdeW1C1T.text	Ἱερωτέρα Ἁγνή, τῶν Χερουβεὶμ καὶ Σεραφείμ, ἀνεδείχθης τεκοῦσα, τὸν ποιητὴν τῆς κτίσεως, ὃν ἀπαύστως δυσώπει, οἰκτειρῆσαι τοὺς δούλους σου, τοὺς σὲ δοξάζοντας.
ltx/gr_gr_cog/oc.m6.d7:ocMA.OdeW1C21.greekmelody	@ltx/gr_gr_cog/he.h.m6:heHE.OsEnIpeiroPezefsas.greekname
ltx/gr_gr_cog/oc.m6.d7:ocMA.OdeW1C21.incipit	Ἐν οὐρανίοις θαλάμοις διηνεκῶς, οἱ…
ltx/gr_gr_cog/oc.m6.d7:ocMA.OdeW1C21.melody	@ltx/gr_gr_cog/he.h.m6:heHE.OsEnIpeiroPezefsas.name
ltx/gr_gr_cog/oc.m6.d7:ocMA.OdeW1C21.mode	@ltx/gr_gr_cog/miscellanea:misc.Mode6
ltx/gr_gr_cog/oc.m6.d7:ocMA.OdeW1C21.ode	@ltx/gr_gr_cog/miscellanea:misc.Ode1
ltx/gr_gr_cog/oc.m6.d7:ocMA.OdeW1C21.text	Ἐν οὐρανίοις θαλάμοις διηνεκῶς, οἱ γενναῖοι Μάρτυρες, δυσωποῦσί σε Χριστέ. Οὓς ἐκ γῆς μετέστησας πιστούς, αἰωνίων ἀγαθῶν, τυχεῖν ἀξίωσον.
ltx/gr_gr_cog/oc.m6.d7:ocMA.OdeW1C22.incipit	Κατακοσμήσας τὰ πάντα ζῶον μικτόν…
ltx/gr_gr_cog/oc.m6.d7:ocMA.OdeW1C22.melody	@ltx/gr_gr_cog/he.h.m6:heHE.OsEnIpeiroPezefsas.name
ltx/gr_gr_cog/oc.m6.d7:ocMA.OdeW1C22.mode	@ltx/gr_gr_cog/miscellanea:misc.Mode6
ltx/gr_gr_cog/oc.m6.d7:ocMA.OdeW1C22.ode	@ltx/gr_gr_cog/miscellanea:misc.Ode1
ltx/gr_gr_cog/oc.m6.d7:ocMA.OdeW1C22.text	Κατακοσμήσας τὰ πάντα ζῶον μικτόν, μέσον με τὸν ἄνθρωπον, ταπεινότητος ὁμοῦ, καὶ μεγέθους ἔπλασας· διό, τὰς τῶν δούλων σου ψυχάς, Σῶτερ ἀνάπαυσον.
ltx/gr_gr_cog/oc.m6.d7:ocMA.OdeW1C23.incipit	Τοῦ παραδείσου πολίτην καὶ γεωργόν…
ltx/gr_gr_cog/oc.m6.d7:ocMA.OdeW1C23.melody	@ltx/gr_gr_cog/he.h.m6:heHE.OsEnIpeiroPezefsas.name
ltx/gr_gr_cog/oc.m6.d7:ocMA.OdeW1C23.mode	@ltx/gr_gr_cog/miscellanea:misc.Mode6
ltx/gr_gr_cog/oc.m6.d7:ocMA.OdeW1C23.ode	@ltx/gr_gr_cog/miscellanea:misc.Ode1
ltx/gr_gr_cog/oc.m6.d7:ocMA.OdeW1C23.text	Τοῦ παραδείσου πολίτην καὶ γεωργόν, κατʼ ἀρχάς με ἔταξας, παραβάντα δὲ τὴν σήν, ἐντολὴν ἐξώρισας· διό, τὰς τῶν δούλων σου ψυχάς, Σῶτερ ἀνάπαυσον.
ltx/gr_gr_cog/oc.m6.d7:ocMA.OdeW1C2T.incipit	Ὁ ἐκ πλευρᾶς διαπλάσας Εὔαν…
ltx/gr_gr_cog/oc.m6.d7:ocMA.OdeW1C2T.melody	@ltx/gr_gr_cog/he.h.m6:heHE.OsEnIpeiroPezefsas.name
ltx/gr_gr_cog/oc.m6.d7:ocMA.OdeW1C2T.mode	@ltx/gr_gr_cog/miscellanea:misc.Mode6
ltx/gr_gr_cog/oc.m6.d7:ocMA.OdeW1C2T.ode	@ltx/gr_gr_cog/miscellanea:misc.Ode1
ltx/gr_gr_cog/oc.m6.d7:ocMA.OdeW1C2T.text	Ὁ ἐκ πλευρᾶς διαπλάσας Εὔαν τὸ πρίν, τὴν ἡμῶν προμήτορα, ἐξ ἀχράντου σου γαστρός, σάρκα περιβάλλεται διʼ ἧς, τοῦ θανάτου τὴν ἰσχύν, Ἁγνὴ διέλυσε.
ltx/gr_gr_cog/oc.m6.d7:ocMA.OdeW3C11.incipit	Σωματικοῖς, ὁμιλοῦντες νῦν πόνοις, οἱ…
ltx/gr_gr_cog/oc.m6.d7:ocMA.OdeW3C11.melody	@ltx/gr_gr_cog/he.h.m6:heHE.EnTiSterraTisPisteos.name
ltx/gr_gr_cog/oc.m6.d7:ocMA.OdeW3C11.mode	@ltx/gr_gr_cog/miscellanea:misc.Mode6
ltx/gr_gr_cog/oc.m6.d7:ocMA.OdeW3C11.ode	@ltx/gr_gr_cog/miscellanea:misc.Ode3
ltx/gr_gr_cog/oc.m6.d7:ocMA.OdeW3C11.text	Σωματικοῖς, ὁμιλοῦντες νῦν πόνοις, οἱ Ἀθληταί, τὴν ἄπονον ἐσκόπουν, ἀντίδοσιν χαίροντες, καὶ νῦν παύουσιν ἡμῶν, πόνους παντοίους ἐν χάριτι.
ltx/gr_gr_cog/oc.m6.d7:ocMA.OdeW3C12.incipit	Γνώμῃ στεῤῥᾷ, σοβοῦντες τὰ θηρία…
ltx/gr_gr_cog/oc.m6.d7:ocMA.OdeW3C12.melody	@ltx/gr_gr_cog/he.h.m6:heHE.EnTiSterraTisPisteos.name
ltx/gr_gr_cog/oc.m6.d7:ocMA.OdeW3C12.mode	@ltx/gr_gr_cog/miscellanea:misc.Mode6
ltx/gr_gr_cog/oc.m6.d7:ocMA.OdeW3C12.ode	@ltx/gr_gr_cog/miscellanea:misc.Ode3
ltx/gr_gr_cog/oc.m6.d7:ocMA.OdeW3C12.text	Γνώμῃ στεῤῥᾷ, σοβοῦντες τὰ θηρία, τὰ πονηρά, οἱ θεῖοι Ἱεράρχαι, ἐῤῥύσαντο ἄτρωτα, τῆς κακίας τῆς αὐτῶν, τὰ τοῦ Χριστοῦ θεῖα θρέμματα.
ltx/gr_gr_cog/oc.m6.d7:ocMA.OdeW3C13.incipit	Ἐθελοντί, ζυγὸν τὸν τοῦ Κυρίου…
ltx/gr_gr_cog/oc.m6.d7:ocMA.OdeW3C13.melody	@ltx/gr_gr_cog/he.h.m6:heHE.EnTiSterraTisPisteos.name
ltx/gr_gr_cog/oc.m6.d7:ocMA.OdeW3C13.mode	@ltx/gr_gr_cog/miscellanea:misc.Mode6
ltx/gr_gr_cog/oc.m6.d7:ocMA.OdeW3C13.ode	@ltx/gr_gr_cog/miscellanea:misc.Ode3
ltx/gr_gr_cog/oc.m6.d7:ocMA.OdeW3C13.text	Ἐθελοντί, ζυγὸν τὸν τοῦ Κυρίου, ὑπεισελθών, χορὸς ὁ τῶν ὁσίων, ἐνέκρωσε φρόνημα, τῆς σαρκὸς καὶ τὴν ζωήν, τὴν διʼ αἰῶνος ἀπέλαβε.
ltx/gr_gr_cog/oc.m6.d7:ocMA.OdeW3C14.incipit	Ῥῦσαι πυρός, Χριστὲ τοῦ αἰωνίου…
ltx/gr_gr_cog/oc.m6.d7:ocMA.OdeW3C14.melody	@ltx/gr_gr_cog/he.h.m6:heHE.EnTiSterraTisPisteos.name
ltx/gr_gr_cog/oc.m6.d7:ocMA.OdeW3C14.mode	@ltx/gr_gr_cog/miscellanea:misc.Mode6
ltx/gr_gr_cog/oc.m6.d7:ocMA.OdeW3C14.ode	@ltx/gr_gr_cog/miscellanea:misc.Ode3
ltx/gr_gr_cog/oc.m6.d7:ocMA.OdeW3C14.text	Ῥῦσαι πυρός, Χριστὲ τοῦ αἰωνίου, τοὺς εὐσεβῶς, τοῦ βίου μεταστάντας, καὶ δὸς αὐτοῖς ἄφεσιν, ὀφλημάτων ἀγαθέ, καὶ αἰωνίαν ἀπόλαυσιν.
ltx/gr_gr_cog/oc.m6.d7:ocMA.OdeW3C1H.greekmelody	@ltx/gr_gr_cog/he.h.m6:heHE.EnTiSterraTisPisteos.greekname
ltx/gr_gr_cog/oc.m6.d7:ocMA.OdeW3C1H.incipit	@ltx/gr_gr_cog/he.h.m6:heHE.EnTiSterraTisPisteos.incipit
ltx/gr_gr_cog/oc.m6.d7:ocMA.OdeW3C1H.melody	@ltx/gr_gr_cog/he.h.m6:heHE.EnTiSterraTisPisteos.melody
ltx/gr_gr_cog/oc.m6.d7:ocMA.OdeW3C1H.mode	@ltx/gr_gr_cog/miscellanea:misc.Mode6
ltx/gr_gr_cog/oc.m6.d7:ocMA.OdeW3C1H.ode	@ltx/gr_gr_cog/miscellanea:misc.Ode3
ltx/gr_gr_cog/oc.m6.d7:ocMA.OdeW3C1H.text	@ltx/gr_gr_cog/he.h.m6:heHE.EnTiSterraTisPisteos.text
ltx/gr_gr_cog/oc.m6.d7:ocMA.OdeW3C1T.incipit	Αἱ τὸν Χριστόν, ποθήσασαι Γυναῖκες…
ltx/gr_gr_cog/oc.m6.d7:ocMA.OdeW3C1T.melody	@ltx/gr_gr_cog/he.h.m6:heHE.EnTiSterraTisPisteos.name
ltx/gr_gr_cog/oc.m6.d7:ocMA.OdeW3C1T.mode	@ltx/gr_gr_cog/miscellanea:misc.Mode6
ltx/gr_gr_cog/oc.m6.d7:ocMA.OdeW3C1T.ode	@ltx/gr_gr_cog/miscellanea:misc.Ode3
ltx/gr_gr_cog/oc.m6.d7:ocMA.OdeW3C1T.text	Αἱ τὸν Χριστόν, ποθήσασαι Γυναῖκες, σὲ τὴν αὐτόν, ἀῤῥήτως τετοκυῖαν, πανάχραντε Δέσποινα, γεγηθότι λογισμῷ, παρεστῶσαι νῦν χορεύουσι.
ltx/gr_gr_cog/oc.m6.d7:ocMA.OdeW3C21.greekmelody	@ltx/gr_gr_cog/he.h.m6:heHE.OukEstinAgios.greekname
ltx/gr_gr_cog/oc.m6.d7:ocMA.OdeW3C21.incipit	Νομίμως ἤθλησαν οἱ σοί, Μάρτυρες…
ltx/gr_gr_cog/oc.m6.d7:ocMA.OdeW3C21.melody	@ltx/gr_gr_cog/he.h.m6:heHE.OukEstinAgios.name
ltx/gr_gr_cog/oc.m6.d7:ocMA.OdeW3C21.mode	@ltx/gr_gr_cog/miscellanea:misc.Mode6
ltx/gr_gr_cog/oc.m6.d7:ocMA.OdeW3C21.ode	@ltx/gr_gr_cog/miscellanea:misc.Ode3
ltx/gr_gr_cog/oc.m6.d7:ocMA.OdeW3C21.text	Νομίμως ἤθλησαν οἱ σοί, Μάρτυρες ζωοδότα, καὶ στεφάνῳ τῆς νίκης, κοσμηθέντες παρὰ σοῦ, τοῖς μεταστᾶσι πιστοῖς, αἰωνίαν λύτρωσιν αἰτοῦσί σε.
ltx/gr_gr_cog/oc.m6.d7:ocMA.OdeW3C22.incipit	Παιδεύσας πρότερον πολλοῖς, τέρασι καὶ…
ltx/gr_gr_cog/oc.m6.d7:ocMA.OdeW3C22.melody	@ltx/gr_gr_cog/he.h.m6:heHE.OukEstinAgios.name
ltx/gr_gr_cog/oc.m6.d7:ocMA.OdeW3C22.mode	@ltx/gr_gr_cog/miscellanea:misc.Mode6
ltx/gr_gr_cog/oc.m6.d7:ocMA.OdeW3C22.ode	@ltx/gr_gr_cog/miscellanea:misc.Ode3
ltx/gr_gr_cog/oc.m6.d7:ocMA.OdeW3C22.text	Παιδεύσας πρότερον πολλοῖς, τέρασι καὶ σημείοις, ἐμὲ τὸν πλανηθέντα, ἐπʼ ἐσχάτων σεαυτόν, κενώσας ὡς συμπαθής, καὶ ζητήσας εὗρες καὶ διέσωσας.
ltx/gr_gr_cog/oc.m6.d7:ocMA.OdeW3C23.incipit	Ῥεόντων ἄστατον φοράν, τοὺς πρὸς…
ltx/gr_gr_cog/oc.m6.d7:ocMA.OdeW3C23.melody	@ltx/gr_gr_cog/he.h.m6:heHE.OukEstinAgios.name
ltx/gr_gr_cog/oc.m6.d7:ocMA.OdeW3C23.mode	@ltx/gr_gr_cog/miscellanea:misc.Mode6
ltx/gr_gr_cog/oc.m6.d7:ocMA.OdeW3C23.ode	@ltx/gr_gr_cog/miscellanea:misc.Ode3
ltx/gr_gr_cog/oc.m6.d7:ocMA.OdeW3C23.text	Ῥεόντων ἄστατον φοράν, τοὺς πρὸς σὲ διαβάντας, ἐν σκηναῖς αἰωνίοις, κατοικεῖν χαρμονικῶς, ἀξίωσον Ἀγαθέ, δικαιώσας πίστει τε καὶ χάριτι.
ltx/gr_gr_cog/oc.m6.d7:ocMA.OdeW3C2T.incipit	Οὐκ ἔστιν ἄμεμπτος ὡς σύ…
ltx/gr_gr_cog/oc.m6.d7:ocMA.OdeW3C2T.melody	@ltx/gr_gr_cog/he.h.m6:heHE.OukEstinAgios.name
ltx/gr_gr_cog/oc.m6.d7:ocMA.OdeW3C2T.mode	@ltx/gr_gr_cog/miscellanea:misc.Mode6
ltx/gr_gr_cog/oc.m6.d7:ocMA.OdeW3C2T.ode	@ltx/gr_gr_cog/miscellanea:misc.Ode3
ltx/gr_gr_cog/oc.m6.d7:ocMA.OdeW3C2T.text	Οὐκ ἔστιν ἄμεμπτος ὡς σύ, πάναγνε Θεομῆτορ· μόνη γὰρ ἐξ αἰῶνος, τὸν Θεὸν τὸν ἀληθῆ, συνέλαβες ἐν γαστρί, τοῦ θανάτου λύσαντα τὴν δύναμιν.
ltx/gr_gr_cog/oc.m6.d7:ocMA.OdeW4C11.incipit	Ἱστάμενοι ἔβλεπον, τὸν ἀλαζόνα οἱ…
ltx/gr_gr_cog/oc.m6.d7:ocMA.OdeW4C11.melody	@ltx/gr_gr_cog/he.h.m6:heHE.AkikoaKyrieTinAkoin.name
ltx/gr_gr_cog/oc.m6.d7:ocMA.OdeW4C11.mode	@ltx/gr_gr_cog/miscellanea:misc.Mode6
ltx/gr_gr_cog/oc.m6.d7:ocMA.OdeW4C11.ode	@ltx/gr_gr_cog/miscellanea:misc.Ode4
ltx/gr_gr_cog/oc.m6.d7:ocMA.OdeW4C11.text	Ἱστάμενοι ἔβλεπον, τὸν ἀλαζόνα οἱ Ἀθλοφόροι, πρὸ ποδῶν αὐτῶν πατούμενον, καὶ τὸν πάντων Κτίστην, εὐχαρίστως ἐδόξαζον.
ltx/gr_gr_cog/oc.m6.d7:ocMA.OdeW4C12.incipit	Ῥημάτων λαμπρότητος, οἱ Ἱεράρχαι καθοπλισθέντες…
ltx/gr_gr_cog/oc.m6.d7:ocMA.OdeW4C12.melody	@ltx/gr_gr_cog/he.h.m6:heHE.AkikoaKyrieTinAkoin.name
ltx/gr_gr_cog/oc.m6.d7:ocMA.OdeW4C12.mode	@ltx/gr_gr_cog/miscellanea:misc.Mode6
ltx/gr_gr_cog/oc.m6.d7:ocMA.OdeW4C12.ode	@ltx/gr_gr_cog/miscellanea:misc.Ode4
ltx/gr_gr_cog/oc.m6.d7:ocMA.OdeW4C12.text	Ῥημάτων λαμπρότητος, οἱ Ἱεράρχαι καθοπλισθέντες, πρὸς τὸ φῶς τῆς ἐπιγνώσεως, τοὺς ἀνθρώπους, σκότους τῶν αἱρέσεων ἔσωσαν.
ltx/gr_gr_cog/oc.m6.d7:ocMA.OdeW4C13.incipit	Ὡς ἄνθρακες ὤφθησαν, τῇ πρὸς…
ltx/gr_gr_cog/oc.m6.d7:ocMA.OdeW4C13.melody	@ltx/gr_gr_cog/he.h.m6:heHE.AkikoaKyrieTinAkoin.name
ltx/gr_gr_cog/oc.m6.d7:ocMA.OdeW4C13.mode	@ltx/gr_gr_cog/miscellanea:misc.Mode6
ltx/gr_gr_cog/oc.m6.d7:ocMA.OdeW4C13.ode	@ltx/gr_gr_cog/miscellanea:misc.Ode4
ltx/gr_gr_cog/oc.m6.d7:ocMA.OdeW4C13.text	Ὡς ἄνθρακες ὤφθησαν, τῇ πρὸς τὸ θεῖον θερμῇ συνέσει, καὶ τὰ πάθη καταφλέξαντες, τὰ ὑλώδη, Ὅσιοι μεγάλως δοξάζονται.
ltx/gr_gr_cog/oc.m6.d7:ocMA.OdeW4C14.incipit	Τῶν ζώντων τε Κύριε, καὶ…
ltx/gr_gr_cog/oc.m6.d7:ocMA.OdeW4C14.melody	@ltx/gr_gr_cog/he.h.m6:heHE.AkikoaKyrieTinAkoin.name
ltx/gr_gr_cog/oc.m6.d7:ocMA.OdeW4C14.mode	@ltx/gr_gr_cog/miscellanea:misc.Mode6
ltx/gr_gr_cog/oc.m6.d7:ocMA.OdeW4C14.ode	@ltx/gr_gr_cog/miscellanea:misc.Ode4
ltx/gr_gr_cog/oc.m6.d7:ocMA.OdeW4C14.text	Τῶν ζώντων τε Κύριε, καὶ τῶν θανόντων ἐξουσιάζων, οὓς μετέστησας ἀνάπαυσον, μετὰ πάντων, εὐαρεστησάντων σοι Δέσποτα.
ltx/gr_gr_cog/oc.m6.d7:ocMA.OdeW4C1H.greekmelody	@ltx/gr_gr_cog/he.h.m6:heHE.AkikoaKyrieTinAkoin.greekname
ltx/gr_gr_cog/oc.m6.d7:ocMA.OdeW4C1H.incipit	@ltx/gr_gr_cog/he.h.m6:heHE.AkikoaKyrieTinAkoin.incipit
ltx/gr_gr_cog/oc.m6.d7:ocMA.OdeW4C1H.melody	@ltx/gr_gr_cog/he.h.m6:heHE.AkikoaKyrieTinAkoin.melody
ltx/gr_gr_cog/oc.m6.d7:ocMA.OdeW4C1H.mode	@ltx/gr_gr_cog/miscellanea:misc.Mode6
ltx/gr_gr_cog/oc.m6.d7:ocMA.OdeW4C1H.ode	@ltx/gr_gr_cog/miscellanea:misc.Ode4
ltx/gr_gr_cog/oc.m6.d7:ocMA.OdeW4C1H.text	@ltx/gr_gr_cog/he.h.m6:heHE.AkikoaKyrieTinAkoin.text
ltx/gr_gr_cog/oc.m6.d7:ocMA.OdeW4C1T.incipit	Κύριος Ἄχραντε, ἐκ σοῦ ἀῤῥήτως…
ltx/gr_gr_cog/oc.m6.d7:ocMA.OdeW4C1T.melody	@ltx/gr_gr_cog/he.h.m6:heHE.AkikoaKyrieTinAkoin.name
ltx/gr_gr_cog/oc.m6.d7:ocMA.OdeW4C1T.mode	@ltx/gr_gr_cog/miscellanea:misc.Mode6
ltx/gr_gr_cog/oc.m6.d7:ocMA.OdeW4C1T.ode	@ltx/gr_gr_cog/miscellanea:misc.Ode4
ltx/gr_gr_cog/oc.m6.d7:ocMA.OdeW4C1T.text	Κύριος Ἄχραντε, ἐκ σοῦ ἀῤῥήτως σάρκα φορέσας, τῶν Γυναίων τὸν κατάλογον, ἐν ἀνδρείᾳ, διηγωνισμένον προσήκατο.
ltx/gr_gr_cog/oc.m6.d7:ocMA.OdeW4C21.greekmelody	@ltx/gr_gr_cog/he.h.m6:heHE.ChristosMouDynamis.greekname
ltx/gr_gr_cog/oc.m6.d7:ocMA.OdeW4C21.incipit	Σοφίας μείζονος, δεικνύων γνώρισμα, καὶ…
ltx/gr_gr_cog/oc.m6.d7:ocMA.OdeW4C21.melody	@ltx/gr_gr_cog/he.h.m6:heHE.ChristosMouDynamis.name
ltx/gr_gr_cog/oc.m6.d7:ocMA.OdeW4C21.mode	@ltx/gr_gr_cog/miscellanea:misc.Mode6
ltx/gr_gr_cog/oc.m6.d7:ocMA.OdeW4C21.ode	@ltx/gr_gr_cog/miscellanea:misc.Ode4
ltx/gr_gr_cog/oc.m6.d7:ocMA.OdeW4C21.text	Σοφίας μείζονος, δεικνύων γνώρισμα, καὶ τῆς περὶ τὰ δῶρα πολυτελοῦς, Δέσποτα χρηστότητος, τὰς τῶν Μαρτύρων χορείας, τοῖς Ἀγγέλοις συνηρίθμησας.
ltx/gr_gr_cog/oc.m6.d7:ocMA.OdeW4C22.incipit	Ἀφράστου δόξης σου, τυχεῖν ἀξίωσον…
ltx/gr_gr_cog/oc.m6.d7:ocMA.OdeW4C22.melody	@ltx/gr_gr_cog/he.h.m6:heHE.ChristosMouDynamis.name
ltx/gr_gr_cog/oc.m6.d7:ocMA.OdeW4C22.mode	@ltx/gr_gr_cog/miscellanea:misc.Mode6
ltx/gr_gr_cog/oc.m6.d7:ocMA.OdeW4C22.ode	@ltx/gr_gr_cog/miscellanea:misc.Ode4
ltx/gr_gr_cog/oc.m6.d7:ocMA.OdeW4C22.text	Ἀφράστου δόξης σου, τυχεῖν ἀξίωσον, τοὺς πρὸς σὲ μεταστάντας, ἔνθα Χριστέ, τῶν εὐφραινομένων ἐστίν, ἡ κατοικία καὶ φωνή, καθαρᾶς ἀγαλλιάσεως.
ltx/gr_gr_cog/oc.m6.d7:ocMA.OdeW4C23.incipit	Ὑμνοῦντας πρόσδεξαι, τὸ θεῖον κράτος…
ltx/gr_gr_cog/oc.m6.d7:ocMA.OdeW4C23.melody	@ltx/gr_gr_cog/he.h.m6:heHE.ChristosMouDynamis.name
ltx/gr_gr_cog/oc.m6.d7:ocMA.OdeW4C23.mode	@ltx/gr_gr_cog/miscellanea:misc.Mode6
ltx/gr_gr_cog/oc.m6.d7:ocMA.OdeW4C23.ode	@ltx/gr_gr_cog/miscellanea:misc.Ode4
ltx/gr_gr_cog/oc.m6.d7:ocMA.OdeW4C23.text	Ὑμνοῦντας πρόσδεξαι, τὸ θεῖον κράτος σου, οὓς ἐκ γῆς προσελάβου, τέκνα φωτός, τούτους ἐργαζόμενος, τῆς ἁμαρτίας τὴν ἀχλύν, ἐκκαθαίρων πολυέλεε.
ltx/gr_gr_cog/oc.m6.d7:ocMA.OdeW4C2T.incipit	Δοχεῖον ἄχραντον, Ναὸν πανάμωμον, Κιβωτὸν…
ltx/gr_gr_cog/oc.m6.d7:ocMA.OdeW4C2T.melody	@ltx/gr_gr_cog/he.h.m6:heHE.ChristosMouDynamis.name
ltx/gr_gr_cog/oc.m6.d7:ocMA.OdeW4C2T.mode	@ltx/gr_gr_cog/miscellanea:misc.Mode6
ltx/gr_gr_cog/oc.m6.d7:ocMA.OdeW4C2T.ode	@ltx/gr_gr_cog/miscellanea:misc.Ode4
ltx/gr_gr_cog/oc.m6.d7:ocMA.OdeW4C2T.text	Δοχεῖον ἄχραντον, Ναὸν πανάμωμον, Κιβωτὸν παναγίαν, παρθενικόν, τόπον ἁγιάσματος, σὲ καλλονὴν τοῦ Ἰακώβ, ὁ Δεσπότης ἐξελέξατο.
ltx/gr_gr_cog/oc.m6.d7:ocMA.OdeW5C11.incipit	Ὑφαντὸν ἐκ τῆς ἄνωθεν χάριτος…
ltx/gr_gr_cog/oc.m6.d7:ocMA.OdeW5C11.melody	@ltx/gr_gr_cog/he.h.m6:heHE.OToFosAnatellon.name
ltx/gr_gr_cog/oc.m6.d7:ocMA.OdeW5C11.mode	@ltx/gr_gr_cog/miscellanea:misc.Mode6
ltx/gr_gr_cog/oc.m6.d7:ocMA.OdeW5C11.ode	@ltx/gr_gr_cog/miscellanea:misc.Ode5
ltx/gr_gr_cog/oc.m6.d7:ocMA.OdeW5C11.text	Ὑφαντὸν ἐκ τῆς ἄνωθεν χάριτος, ἐνδυθέντες ἱμάτιον Ἀθληταί, τὸν ἐχθρὸν ἀπεγυμνώσατε.
ltx/gr_gr_cog/oc.m6.d7:ocMA.OdeW5C12.incipit	Σὺν ἁγίοις Προφήταις τιμήσωμεν, Ἱεράρχας…
ltx/gr_gr_cog/oc.m6.d7:ocMA.OdeW5C12.melody	@ltx/gr_gr_cog/he.h.m6:heHE.OToFosAnatellon.name
ltx/gr_gr_cog/oc.m6.d7:ocMA.OdeW5C12.mode	@ltx/gr_gr_cog/miscellanea:misc.Mode6
ltx/gr_gr_cog/oc.m6.d7:ocMA.OdeW5C12.ode	@ltx/gr_gr_cog/miscellanea:misc.Ode5
ltx/gr_gr_cog/oc.m6.d7:ocMA.OdeW5C12.text	Σὺν ἁγίοις Προφήταις τιμήσωμεν, Ἱεράρχας θεόφρονας, καὶ Ὁσίους Θεῷ εὐαρεστήσαντας.
ltx/gr_gr_cog/oc.m6.d7:ocMA.OdeW5C13.incipit	Ἐκ περάτων τοῦ σύμπαντος Μάρτυρες…
ltx/gr_gr_cog/oc.m6.d7:ocMA.OdeW5C13.melody	@ltx/gr_gr_cog/he.h.m6:heHE.OToFosAnatellon.name
ltx/gr_gr_cog/oc.m6.d7:ocMA.OdeW5C13.mode	@ltx/gr_gr_cog/miscellanea:misc.Mode6
ltx/gr_gr_cog/oc.m6.d7:ocMA.OdeW5C13.ode	@ltx/gr_gr_cog/miscellanea:misc.Ode5
ltx/gr_gr_cog/oc.m6.d7:ocMA.OdeW5C13.text	Ἐκ περάτων τοῦ σύμπαντος Μάρτυρες, ἐναθλοῦντες κεκράγατε, καὶ Χριστὸς τῆς φωνῆς ὑμῶν εἰσήκουσε.
ltx/gr_gr_cog/oc.m6.d7:ocMA.OdeW5C1H.greekmelody	@ltx/gr_gr_cog/he.h.m6:heHE.OToFosAnatellon.greekname
ltx/gr_gr_cog/oc.m6.d7:ocMA.OdeW5C1H.incipit	@ltx/gr_gr_cog/he.h.m6:heHE.OToFosAnatellon.incipit
ltx/gr_gr_cog/oc.m6.d7:ocMA.OdeW5C1H.melody	@ltx/gr_gr_cog/he.h.m6:heHE.OToFosAnatellon.melody
ltx/gr_gr_cog/oc.m6.d7:ocMA.OdeW5C1H.mode	@ltx/gr_gr_cog/miscellanea:misc.Mode6
ltx/gr_gr_cog/oc.m6.d7:ocMA.OdeW5C1H.ode	@ltx/gr_gr_cog/miscellanea:misc.Ode5
ltx/gr_gr_cog/oc.m6.d7:ocMA.OdeW5C1H.text	@ltx/gr_gr_cog/he.h.m6:heHE.OToFosAnatellon.text
ltx/gr_gr_cog/oc.m6.d7:ocMA.OdeW5C1T.incipit	Ῥυομένη ἡμᾶς πάσης φάνηθι, τοῦ…
ltx/gr_gr_cog/oc.m6.d7:ocMA.OdeW5C1T.melody	@ltx/gr_gr_cog/he.h.m6:heHE.OToFosAnatellon.name
ltx/gr_gr_cog/oc.m6.d7:ocMA.OdeW5C1T.mode	@ltx/gr_gr_cog/miscellanea:misc.Mode6
ltx/gr_gr_cog/oc.m6.d7:ocMA.OdeW5C1T.ode	@ltx/gr_gr_cog/miscellanea:misc.Ode5
ltx/gr_gr_cog/oc.m6.d7:ocMA.OdeW5C1T.text	Ῥυομένη ἡμᾶς πάσης φάνηθι, τοῦ ἐχθροῦ βλάβης Δέσποινα, δυσωποῦσα Χριστὸν τὸν μόνον εὔσπλαγχνον.
ltx/gr_gr_cog/oc.m6.d7:ocMA.OdeW5C21.greekmelody	@ltx/gr_gr_cog/he.h.m6:heHE.ToTheioFengeiSou.greekname
ltx/gr_gr_cog/oc.m6.d7:ocMA.OdeW5C21.incipit	Ὡς ὁλοκάρπωσις ἱερά, καὶ ὡς…
ltx/gr_gr_cog/oc.m6.d7:ocMA.OdeW5C21.melody	@ltx/gr_gr_cog/he.h.m6:heHE.ToTheioFengeiSou.name
ltx/gr_gr_cog/oc.m6.d7:ocMA.OdeW5C21.mode	@ltx/gr_gr_cog/miscellanea:misc.Mode6
ltx/gr_gr_cog/oc.m6.d7:ocMA.OdeW5C21.ode	@ltx/gr_gr_cog/miscellanea:misc.Ode5
ltx/gr_gr_cog/oc.m6.d7:ocMA.OdeW5C21.text	Ὡς ὁλοκάρπωσις ἱερά, καὶ ὡς ἀπαρχὴ τῆς ἀνθρωπίνης οἱ Μάρτυρες φύσεως, τῷ δεδοξασμένῳ προσενεχθέντες Θεῷ, ἡμῖν τὴν σωτηρίαν ἀεὶ βραβεύουσι.
ltx/gr_gr_cog/oc.m6.d7:ocMA.OdeW5C22.incipit	Τῆς οὐρανίου διαγωγῆς, τῆς διανομῆς…
ltx/gr_gr_cog/oc.m6.d7:ocMA.OdeW5C22.melody	@ltx/gr_gr_cog/he.h.m6:heHE.ToTheioFengeiSou.name
ltx/gr_gr_cog/oc.m6.d7:ocMA.OdeW5C22.mode	@ltx/gr_gr_cog/miscellanea:misc.Mode6
ltx/gr_gr_cog/oc.m6.d7:ocMA.OdeW5C22.ode	@ltx/gr_gr_cog/miscellanea:misc.Ode5
ltx/gr_gr_cog/oc.m6.d7:ocMA.OdeW5C22.text	Τῆς οὐρανίου διαγωγῆς, τῆς διανομῆς τῶν χαρισμάτων ἀξίωσον Δέσποτα, τοὺς προκοιμηθέντας πιστοὺς ἱκέτας σου, παρέχων τῶν πταισμάτων τὴν ἀπολύτρωσιν.
ltx/gr_gr_cog/oc.m6.d7:ocMA.OdeW5C23.incipit	Ὁ μόνος φύσει ζωοποιός, τὸ…
ltx/gr_gr_cog/oc.m6.d7:ocMA.OdeW5C23.melody	@ltx/gr_gr_cog/he.h.m6:heHE.ToTheioFengeiSou.name
ltx/gr_gr_cog/oc.m6.d7:ocMA.OdeW5C23.mode	@ltx/gr_gr_cog/miscellanea:misc.Mode6
ltx/gr_gr_cog/oc.m6.d7:ocMA.OdeW5C23.ode	@ltx/gr_gr_cog/miscellanea:misc.Ode5
ltx/gr_gr_cog/oc.m6.d7:ocMA.OdeW5C23.text	Ὁ μόνος φύσει ζωοποιός, τὸ τῆς ἀγαθότητος ὄντως, ἀνεξιχνίαστον πέλαγος, τοὺς τελειωθέντας, τῆς Βασιλείας τῆς σῆς, ἀξίωσον Οἰκτίρμον μόνε ἀθάνατε.
ltx/gr_gr_cog/oc.m6.d7:ocMA.OdeW5C2T.incipit	Ἰσχὺς καὶ ὕμνησις ὁ ἐκ…
ltx/gr_gr_cog/oc.m6.d7:ocMA.OdeW5C2T.melody	@ltx/gr_gr_cog/he.h.m6:heHE.ToTheioFengeiSou.name
ltx/gr_gr_cog/oc.m6.d7:ocMA.OdeW5C2T.mode	@ltx/gr_gr_cog/miscellanea:misc.Mode6
ltx/gr_gr_cog/oc.m6.d7:ocMA.OdeW5C2T.ode	@ltx/gr_gr_cog/miscellanea:misc.Ode5
ltx/gr_gr_cog/oc.m6.d7:ocMA.OdeW5C2T.text	Ἰσχὺς καὶ ὕμνησις ὁ ἐκ σοῦ, Δέσποινα τοῦ κόσμου γεννηθείς, καὶ σωτηρία ἐγένετο τοῖς ἀπολλυμένοις, ἐκ τῶν τοῦ ᾍδου πυλῶν, ῥυόμενος τοὺς πίστει σε μακαρίζοντας.
ltx/gr_gr_cog/oc.m6.d7:ocMA.OdeW6C11.incipit	Αἱμάτων θείαις ῥοαῖς, νοητοὺς ἐχθροὺς…
ltx/gr_gr_cog/oc.m6.d7:ocMA.OdeW6C11.melody	@ltx/gr_gr_cog/he.h.m6:heHE.ToKiteiKatapotheis.name
ltx/gr_gr_cog/oc.m6.d7:ocMA.OdeW6C11.mode	@ltx/gr_gr_cog/miscellanea:misc.Mode6
ltx/gr_gr_cog/oc.m6.d7:ocMA.OdeW6C11.ode	@ltx/gr_gr_cog/miscellanea:misc.Ode6
ltx/gr_gr_cog/oc.m6.d7:ocMA.OdeW6C11.text	Αἱμάτων θείαις ῥοαῖς, νοητοὺς ἐχθροὺς ἐβυθίσατε, πιστῶν δὲ τὰς καρδίας, Ἀθλοφόροι κατηρδεύσατε.
ltx/gr_gr_cog/oc.m6.d7:ocMA.OdeW6C12.incipit	Σταυρώσαντες ἑαυτούς, κόσμῳ καὶ τοῖς…
ltx/gr_gr_cog/oc.m6.d7:ocMA.OdeW6C12.melody	@ltx/gr_gr_cog/he.h.m6:heHE.ToKiteiKatapotheis.name
ltx/gr_gr_cog/oc.m6.d7:ocMA.OdeW6C12.mode	@ltx/gr_gr_cog/miscellanea:misc.Mode6
ltx/gr_gr_cog/oc.m6.d7:ocMA.OdeW6C12.ode	@ltx/gr_gr_cog/miscellanea:misc.Ode6
ltx/gr_gr_cog/oc.m6.d7:ocMA.OdeW6C12.text	Σταυρώσαντες ἑαυτούς, κόσμῳ καὶ τοῖς πάθεσιν, Ὅσιοι σοφοὶ σὺν Ἱεράρχαις, θείας δόξης ἠξιώθητε.
ltx/gr_gr_cog/oc.m6.d7:ocMA.OdeW6C13.incipit	Τῶν Προφητῶν ὁ χορός, καὶ…
ltx/gr_gr_cog/oc.m6.d7:ocMA.OdeW6C13.melody	@ltx/gr_gr_cog/he.h.m6:heHE.ToKiteiKatapotheis.name
ltx/gr_gr_cog/oc.m6.d7:ocMA.OdeW6C13.mode	@ltx/gr_gr_cog/miscellanea:misc.Mode6
ltx/gr_gr_cog/oc.m6.d7:ocMA.OdeW6C13.ode	@ltx/gr_gr_cog/miscellanea:misc.Ode6
ltx/gr_gr_cog/oc.m6.d7:ocMA.OdeW6C13.text	Τῶν Προφητῶν ὁ χορός, καὶ σεπτῶν Γυναίων κατάλογος, καλῶς ἠγωνισμένος, κατὰ χρέος μακαρίζονται.
ltx/gr_gr_cog/oc.m6.d7:ocMA.OdeW6C14.incipit	Ἀνάπαυσον ὁ Θεός, τῶν προκοιμηθέντων…
ltx/gr_gr_cog/oc.m6.d7:ocMA.OdeW6C14.melody	@ltx/gr_gr_cog/he.h.m6:heHE.ToKiteiKatapotheis.name
ltx/gr_gr_cog/oc.m6.d7:ocMA.OdeW6C14.mode	@ltx/gr_gr_cog/miscellanea:misc.Mode6
ltx/gr_gr_cog/oc.m6.d7:ocMA.OdeW6C14.ode	@ltx/gr_gr_cog/miscellanea:misc.Ode6
ltx/gr_gr_cog/oc.m6.d7:ocMA.OdeW6C14.text	Ἀνάπαυσον ὁ Θεός, τῶν προκοιμηθέντων τὰ πνεύματα, μετὰ τῶν ἐκλεκτῶν σου, παρορῶν αὐτῶν τὰ πταίσματα.
ltx/gr_gr_cog/oc.m6.d7:ocMA.OdeW6C1H.greekmelody	@ltx/gr_gr_cog/he.h.m6:heHE.ToKiteiKatapotheis.greekname
ltx/gr_gr_cog/oc.m6.d7:ocMA.OdeW6C1H.incipit	@ltx/gr_gr_cog/he.h.m6:heHE.ToKiteiKatapotheis.incipit
ltx/gr_gr_cog/oc.m6.d7:ocMA.OdeW6C1H.melody	@ltx/gr_gr_cog/he.h.m6:heHE.ToKiteiKatapotheis.melody
ltx/gr_gr_cog/oc.m6.d7:ocMA.OdeW6C1H.mode	@ltx/gr_gr_cog/miscellanea:misc.Mode6
ltx/gr_gr_cog/oc.m6.d7:ocMA.OdeW6C1H.ode	@ltx/gr_gr_cog/miscellanea:misc.Ode6
ltx/gr_gr_cog/oc.m6.d7:ocMA.OdeW6C1H.text	@ltx/gr_gr_cog/he.h.m6:heHE.ToKiteiKatapotheis.text
ltx/gr_gr_cog/oc.m6.d7:ocMA.OdeW6C1T.incipit	Σαρκὶ τεκοῦσα Χριστόν, τῆς σαρκός…
ltx/gr_gr_cog/oc.m6.d7:ocMA.OdeW6C1T.melody	@ltx/gr_gr_cog/he.h.m6:heHE.ToKiteiKatapotheis.name
ltx/gr_gr_cog/oc.m6.d7:ocMA.OdeW6C1T.mode	@ltx/gr_gr_cog/miscellanea:misc.Mode6
ltx/gr_gr_cog/oc.m6.d7:ocMA.OdeW6C1T.ode	@ltx/gr_gr_cog/miscellanea:misc.Ode6
ltx/gr_gr_cog/oc.m6.d7:ocMA.OdeW6C1T.text	Σαρκὶ τεκοῦσα Χριστόν, τῆς σαρκός μου τὰ πάθη θανάτωσον, καὶ ζώωσον Παρθένε, τὴν ψυχήν μου μεσιτείᾳ σου.
ltx/gr_gr_cog/oc.m6.d7:ocMA.OdeW6C21.greekmelody	@ltx/gr_gr_cog/he.h.m6:heHE.TouViouTinThalassan.greekname
ltx/gr_gr_cog/oc.m6.d7:ocMA.OdeW6C21.incipit	Σταυρῷ προσηλούμενος, τῶν Μαρτύρων τοὺς…
ltx/gr_gr_cog/oc.m6.d7:ocMA.OdeW6C21.melody	@ltx/gr_gr_cog/he.h.m6:heHE.TouViouTinThalassan.name
ltx/gr_gr_cog/oc.m6.d7:ocMA.OdeW6C21.mode	@ltx/gr_gr_cog/miscellanea:misc.Mode6
ltx/gr_gr_cog/oc.m6.d7:ocMA.OdeW6C21.ode	@ltx/gr_gr_cog/miscellanea:misc.Ode6
ltx/gr_gr_cog/oc.m6.d7:ocMA.OdeW6C21.text	Σταυρῷ προσηλούμενος, τῶν Μαρτύρων τοὺς χορούς, πρὸς ἑαυτὸν συνήγαγες, μιμουμένους τὸ πάθος σου Ἀγαθέ· διό σου δεόμεθα, τοὺς πρὸς σὲ μεταστάντας διανάπαυσον.
ltx/gr_gr_cog/oc.m6.d7:ocMA.OdeW6C22.incipit	Ἀφράστῳ τῇ δόξῃ σου, ὅταν…
ltx/gr_gr_cog/oc.m6.d7:ocMA.OdeW6C22.melody	@ltx/gr_gr_cog/he.h.m6:heHE.TouViouTinThalassan.name
ltx/gr_gr_cog/oc.m6.d7:ocMA.OdeW6C22.mode	@ltx/gr_gr_cog/miscellanea:misc.Mode6
ltx/gr_gr_cog/oc.m6.d7:ocMA.OdeW6C22.ode	@ltx/gr_gr_cog/miscellanea:misc.Ode6
ltx/gr_gr_cog/oc.m6.d7:ocMA.OdeW6C22.text	Ἀφράστῳ τῇ δόξῃ σου, ὅταν ἔλθῃς φοβερός, κρῖναι τὸν κόσμον ἅπαντα, ἐν νεφέλαις εὐδόκησον Λυτρωτά, φαιδρῶς ὑπαντῆσαί σοι, οὓς ἐκ γῆς προσελάβου, πιστούς δούλους σου.
ltx/gr_gr_cog/oc.m6.d7:ocMA.OdeW6C23.incipit	Πηγὴ ζωῆς πέφυκας, ἐν ἀνδρείᾳ…
ltx/gr_gr_cog/oc.m6.d7:ocMA.OdeW6C23.melody	@ltx/gr_gr_cog/he.h.m6:heHE.TouViouTinThalassan.name
ltx/gr_gr_cog/oc.m6.d7:ocMA.OdeW6C23.mode	@ltx/gr_gr_cog/miscellanea:misc.Mode6
ltx/gr_gr_cog/oc.m6.d7:ocMA.OdeW6C23.ode	@ltx/gr_gr_cog/miscellanea:misc.Ode6
ltx/gr_gr_cog/oc.m6.d7:ocMA.OdeW6C23.text	Πηγὴ ζωῆς πέφυκας, ἐν ἀνδρείᾳ θεϊκῇ, πεπεδημένους Δέσποτα, ὁ ἐξάγων τοὺς δούλους σου τοὺς πρὸς σέ, πιστῶς ἐκδημήσαντας, ἐν τρυφῇ Παραδείσου κατασκήνωσον.
ltx/gr_gr_cog/oc.m6.d7:ocMA.OdeW6C2T.incipit	Εἰς γῆν ἀπεστράφημεν, παραβάντες τοῦ…
ltx/gr_gr_cog/oc.m6.d7:ocMA.OdeW6C2T.melody	@ltx/gr_gr_cog/he.h.m6:heHE.TouViouTinThalassan.name
ltx/gr_gr_cog/oc.m6.d7:ocMA.OdeW6C2T.mode	@ltx/gr_gr_cog/miscellanea:misc.Mode6
ltx/gr_gr_cog/oc.m6.d7:ocMA.OdeW6C2T.ode	@ltx/gr_gr_cog/miscellanea:misc.Ode6
ltx/gr_gr_cog/oc.m6.d7:ocMA.OdeW6C2T.text	Εἰς γῆν ἀπεστράφημεν, παραβάντες τοῦ Θεοῦ, τὴν ἐντολὴν τὴν ἔνθεον, διὰ σοῦ, δὲ Παρθένε πρὸς οὐρανόν, ἐκ γῆς ἀνυψώθημεν, τὴν φθορὰν τοῦ θανάτου ἐκτινάξαντες.
ltx/gr_gr_cog/oc.m6.d7:ocMA.OdeW7C11.incipit	Τοὺς τοῦ Χριστοῦ Ἀθλοφόρους, τοὺς…
ltx/gr_gr_cog/oc.m6.d7:ocMA.OdeW7C11.melody	@ltx/gr_gr_cog/he.h.m6:heHE.OTonOsionSouPaidon.name
ltx/gr_gr_cog/oc.m6.d7:ocMA.OdeW7C11.mode	@ltx/gr_gr_cog/miscellanea:misc.Mode6
ltx/gr_gr_cog/oc.m6.d7:ocMA.OdeW7C11.ode	@ltx/gr_gr_cog/miscellanea:misc.Ode7
ltx/gr_gr_cog/oc.m6.d7:ocMA.OdeW7C11.text	Τοὺς τοῦ Χριστοῦ Ἀθλοφόρους, τοὺς σβέσαντας τὴν φλόγα, ὄμβροις αἱμάτων, τῆς δεινῆς ἀθεΐας, μελῳδικῶς τιμήσωμεν.
ltx/gr_gr_cog/oc.m6.d7:ocMA.OdeW7C12.incipit	Οἱ εὐκλεεῖς Ἱεράρχαι, αἱρέσεων χειμῶνα…
ltx/gr_gr_cog/oc.m6.d7:ocMA.OdeW7C12.melody	@ltx/gr_gr_cog/he.h.m6:heHE.OTonOsionSouPaidon.name
ltx/gr_gr_cog/oc.m6.d7:ocMA.OdeW7C12.mode	@ltx/gr_gr_cog/miscellanea:misc.Mode6
ltx/gr_gr_cog/oc.m6.d7:ocMA.OdeW7C12.ode	@ltx/gr_gr_cog/miscellanea:misc.Ode7
ltx/gr_gr_cog/oc.m6.d7:ocMA.OdeW7C12.text	Οἱ εὐκλεεῖς Ἱεράρχαι, αἱρέσεων χειμῶνα διαλύσαντες, πρὸς τὸ ἔαρ τὸ θεῖον, χαρμονικῶς μετέστησαν.
ltx/gr_gr_cog/oc.m6.d7:ocMA.OdeW7C13.incipit	Ὑπομονῇ ἐν πλουσίᾳ, τοῦ Πνεύματος…
ltx/gr_gr_cog/oc.m6.d7:ocMA.OdeW7C13.melody	@ltx/gr_gr_cog/he.h.m6:heHE.OTonOsionSouPaidon.name
ltx/gr_gr_cog/oc.m6.d7:ocMA.OdeW7C13.mode	@ltx/gr_gr_cog/miscellanea:misc.Mode6
ltx/gr_gr_cog/oc.m6.d7:ocMA.OdeW7C13.ode	@ltx/gr_gr_cog/miscellanea:misc.Ode7
ltx/gr_gr_cog/oc.m6.d7:ocMA.OdeW7C13.text	Ὑπομονῇ ἐν πλουσίᾳ, τοῦ Πνεύματος τὴν χάριν, ἐπλουτήσατε Ἀσκηταὶ καὶ τὰ θράση, τῶν δυσμενῶν ὠλέσατε.
ltx/gr_gr_cog/oc.m6.d7:ocMA.OdeW7C14.incipit	Λειμῶνας τοὺς τῆς τρυφῆς σου…
ltx/gr_gr_cog/oc.m6.d7:ocMA.OdeW7C14.melody	@ltx/gr_gr_cog/he.h.m6:heHE.OTonOsionSouPaidon.name
ltx/gr_gr_cog/oc.m6.d7:ocMA.OdeW7C14.mode	@ltx/gr_gr_cog/miscellanea:misc.Mode6
ltx/gr_gr_cog/oc.m6.d7:ocMA.OdeW7C14.ode	@ltx/gr_gr_cog/miscellanea:misc.Ode7
ltx/gr_gr_cog/oc.m6.d7:ocMA.OdeW7C14.text	Λειμῶνας τοὺς τῆς τρυφῆς σου, κληρώσασθαι, ἐν πίστει καταξίωσον, τοὺς μεταστάντας τοῦ βίου, Οἰκτίρμον ὡς φιλάνθρωπος.
ltx/gr_gr_cog/oc.m6.d7:ocMA.OdeW7C1H.greekmelody	@ltx/gr_gr_cog/he.h.m6:heHE.OTonOsionSouPaidon.greekname
ltx/gr_gr_cog/oc.m6.d7:ocMA.OdeW7C1H.incipit	@ltx/gr_gr_cog/he.h.m6:heHE.OTonOsionSouPaidon.incipit
ltx/gr_gr_cog/oc.m6.d7:ocMA.OdeW7C1H.melody	@ltx/gr_gr_cog/he.h.m6:heHE.OTonOsionSouPaidon.melody
ltx/gr_gr_cog/oc.m6.d7:ocMA.OdeW7C1H.mode	@ltx/gr_gr_cog/miscellanea:misc.Mode6
ltx/gr_gr_cog/oc.m6.d7:ocMA.OdeW7C1H.ode	@ltx/gr_gr_cog/miscellanea:misc.Ode7
ltx/gr_gr_cog/oc.m6.d7:ocMA.OdeW7C1H.text	@ltx/gr_gr_cog/he.h.m6:heHE.OTonOsionSouPaidon.text
ltx/gr_gr_cog/oc.m6.d7:ocMA.OdeW7C1T.incipit	Ὁ σὲ τὴν Παρθένον δείξας…
ltx/gr_gr_cog/oc.m6.d7:ocMA.OdeW7C1T.melody	@ltx/gr_gr_cog/he.h.m6:heHE.OTonOsionSouPaidon.name
ltx/gr_gr_cog/oc.m6.d7:ocMA.OdeW7C1T.mode	@ltx/gr_gr_cog/miscellanea:misc.Mode6
ltx/gr_gr_cog/oc.m6.d7:ocMA.OdeW7C1T.ode	@ltx/gr_gr_cog/miscellanea:misc.Ode7
ltx/gr_gr_cog/oc.m6.d7:ocMA.OdeW7C1T.text	Ὁ σὲ τὴν Παρθένον δείξας, ἁγνὴν καὶ μετὰ τόκον, τῶν ἁγίων σοι, Γυναικῶν τὰς χορείας, ἀκολουθούσας ἔσχηκε.
ltx/gr_gr_cog/oc.m6.d7:ocMA.OdeW7C21.greekmelody	@ltx/gr_gr_cog/he.h.m6:heHE.DrosovolonMenTinKaminon.greekname
ltx/gr_gr_cog/oc.m6.d7:ocMA.OdeW7C21.incipit	Λυτρωθέντες τῷ σῷ αἵματι οἱ…
ltx/gr_gr_cog/oc.m6.d7:ocMA.OdeW7C21.melody	@ltx/gr_gr_cog/he.h.m6:heHE.DrosovolonMenTinKaminon.name
ltx/gr_gr_cog/oc.m6.d7:ocMA.OdeW7C21.mode	@ltx/gr_gr_cog/miscellanea:misc.Mode6
ltx/gr_gr_cog/oc.m6.d7:ocMA.OdeW7C21.ode	@ltx/gr_gr_cog/miscellanea:misc.Ode7
ltx/gr_gr_cog/oc.m6.d7:ocMA.OdeW7C21.text	Λυτρωθέντες τῷ σῷ αἵματι οἱ Μάρτυρες, τῆς πρώτης παραβάσεως, ῥαντισθέντες δὲ τῷ ἰδίῳ αἵματι, τὴν σὴν σαφῶς εἰκονίζουσι σφαγήν. Εὐλογητὸς εἶ ὁ Θεός, ὁ τῶν Πατέρων ἡμῶν.
ltx/gr_gr_cog/oc.m6.d7:ocMA.OdeW7C22.incipit	Θρασυνόμενον τὸν θάνατον ἐνέκρωσας, Λόγε…
ltx/gr_gr_cog/oc.m6.d7:ocMA.OdeW7C22.melody	@ltx/gr_gr_cog/he.h.m6:heHE.DrosovolonMenTinKaminon.name
ltx/gr_gr_cog/oc.m6.d7:ocMA.OdeW7C22.mode	@ltx/gr_gr_cog/miscellanea:misc.Mode6
ltx/gr_gr_cog/oc.m6.d7:ocMA.OdeW7C22.ode	@ltx/gr_gr_cog/miscellanea:misc.Ode7
ltx/gr_gr_cog/oc.m6.d7:ocMA.OdeW7C22.text	Θρασυνόμενον τὸν θάνατον ἐνέκρωσας, Λόγε ζωαρχικώτατε, τοὺς ἐν πίστει δὲ κοιμηθέντας, πρόσδεξαι τανῦν, ὑμνοῦντας καὶ ψάλλοντας Χριστέ· Εὐλογητὸς εἶ ὁ Θεός, ὁ τῶν Πατέρων ἡμῶν.
ltx/gr_gr_cog/oc.m6.d7:ocMA.OdeW7C23.incipit	Ὁ ψυχώσας με τὸν ἄνθρωπον…
ltx/gr_gr_cog/oc.m6.d7:ocMA.OdeW7C23.melody	@ltx/gr_gr_cog/he.h.m6:heHE.DrosovolonMenTinKaminon.name
ltx/gr_gr_cog/oc.m6.d7:ocMA.OdeW7C23.mode	@ltx/gr_gr_cog/miscellanea:misc.Mode6
ltx/gr_gr_cog/oc.m6.d7:ocMA.OdeW7C23.ode	@ltx/gr_gr_cog/miscellanea:misc.Ode7
ltx/gr_gr_cog/oc.m6.d7:ocMA.OdeW7C23.text	Ὁ ψυχώσας με τὸν ἄνθρωπον φυσήματι, θείῳ θεαρχικώτατε, τοὺς μεταστάντας βασιλείας Δέσποτα τῆς σῆς, ἀξίωσον ψάλλειν σοι Σωτήρ. Εὐλογητὸς εἶ ὁ Θεός, ὁ τῶν Πατέρων ἡμῶν.
ltx/gr_gr_cog/oc.m6.d7:ocMA.OdeW7C2T.incipit	Ὑπερτέρα πάσης κτίσεως Πανάμωμε, γέγονας…
ltx/gr_gr_cog/oc.m6.d7:ocMA.OdeW7C2T.melody	@ltx/gr_gr_cog/he.h.m6:heHE.DrosovolonMenTinKaminon.name
ltx/gr_gr_cog/oc.m6.d7:ocMA.OdeW7C2T.mode	@ltx/gr_gr_cog/miscellanea:misc.Mode6
ltx/gr_gr_cog/oc.m6.d7:ocMA.OdeW7C2T.ode	@ltx/gr_gr_cog/miscellanea:misc.Ode7
ltx/gr_gr_cog/oc.m6.d7:ocMA.OdeW7C2T.text	Ὑπερτέρα πάσης κτίσεως Πανάμωμε, γέγονας συλλαβοῦσα Θεόν, τὸν συντρίψαντα τοῦ θανάτου πύλας, καὶ μοχλοὺς συνθλάσαντα· ὅθεν σε Ἁγνή, ὑμνολογοῦμεν οἱ πιστοὶ ὡς Θεομήτορα.
ltx/gr_gr_cog/oc.m6.d7:ocMA.OdeW8C11.incipit	Γενναίως τῶν βασάνων τὴν τρικυμίαν…
ltx/gr_gr_cog/oc.m6.d7:ocMA.OdeW8C11.melody	@ltx/gr_gr_cog/he.h.m6:heHE.OiOsioiSouPaides.name
ltx/gr_gr_cog/oc.m6.d7:ocMA.OdeW8C11.mode	@ltx/gr_gr_cog/miscellanea:misc.Mode6
ltx/gr_gr_cog/oc.m6.d7:ocMA.OdeW8C11.ode	@ltx/gr_gr_cog/miscellanea:misc.Ode8
ltx/gr_gr_cog/oc.m6.d7:ocMA.OdeW8C11.text	Γενναίως τῶν βασάνων τὴν τρικυμίαν, αἰκιζόμενοι χάριτι, οἱ θεῖοι Μάρτυρες διελθόντες, εἰς γαλήνην βαθεῖαν, τῆς ἄνω Βασιλείας κατήντησαν.
ltx/gr_gr_cog/oc.m6.d7:ocMA.OdeW8C12.incipit	Οἱ ὅσιοι καὶ πάνσοφοι Ἱεράρχαι…
ltx/gr_gr_cog/oc.m6.d7:ocMA.OdeW8C12.melody	@ltx/gr_gr_cog/he.h.m6:heHE.OiOsioiSouPaides.name
ltx/gr_gr_cog/oc.m6.d7:ocMA.OdeW8C12.mode	@ltx/gr_gr_cog/miscellanea:misc.Mode6
ltx/gr_gr_cog/oc.m6.d7:ocMA.OdeW8C12.ode	@ltx/gr_gr_cog/miscellanea:misc.Ode8
ltx/gr_gr_cog/oc.m6.d7:ocMA.OdeW8C12.text	Οἱ ὅσιοι καὶ πάνσοφοι Ἱεράρχαι, ἀναφανέντες ὡς ἥλιος, φωταγωγοῦσι τὴν οἰκουμένην, διδαγμάτων ἀκτῖσι, καὶ ταῖς τῶν θαυμάτων λαμπρότησι.
ltx/gr_gr_cog/oc.m6.d7:ocMA.OdeW8C13.incipit	Ὑμνήσωμεν Γυναίων τὰς φιλοθέους, καὶ…
ltx/gr_gr_cog/oc.m6.d7:ocMA.OdeW8C13.melody	@ltx/gr_gr_cog/he.h.m6:heHE.OiOsioiSouPaides.name
ltx/gr_gr_cog/oc.m6.d7:ocMA.OdeW8C13.mode	@ltx/gr_gr_cog/miscellanea:misc.Mode6
ltx/gr_gr_cog/oc.m6.d7:ocMA.OdeW8C13.ode	@ltx/gr_gr_cog/miscellanea:misc.Ode8
ltx/gr_gr_cog/oc.m6.d7:ocMA.OdeW8C13.text	Ὑμνήσωμεν Γυναίων τὰς φιλοθέους, καὶ τοὺς ἀσκήσει τε καὶ ἀθλήσει, δουλεύσαντας τῷ Κτίστῃ, καὶ πρεσβευτὰς γενομένους, πρὸς τὸν τῶν ὅλων Δεσπότην καὶ Κύριον.
ltx/gr_gr_cog/oc.m6.d7:ocMA.OdeW8C1H.greekmelody	@ltx/gr_gr_cog/he.h.m6:heHE.OiOsioiSouPaides.greekname
ltx/gr_gr_cog/oc.m6.d7:ocMA.OdeW8C1H.incipit	@ltx/gr_gr_cog/he.h.m6:heHE.OiOsioiSouPaides.incipit
ltx/gr_gr_cog/oc.m6.d7:ocMA.OdeW8C1H.melody	@ltx/gr_gr_cog/he.h.m6:heHE.OiOsioiSouPaides.melody
ltx/gr_gr_cog/oc.m6.d7:ocMA.OdeW8C1H.mode	@ltx/gr_gr_cog/miscellanea:misc.Mode6
ltx/gr_gr_cog/oc.m6.d7:ocMA.OdeW8C1H.ode	@ltx/gr_gr_cog/miscellanea:misc.Ode8
ltx/gr_gr_cog/oc.m6.d7:ocMA.OdeW8C1H.text	@ltx/gr_gr_cog/he.h.m6:heHE.OiOsioiSouPaides.text
ltx/gr_gr_cog/oc.m6.d7:ocMA.OdeW8C1T.incipit	Ὅλην σε τὴν πλησίον Θεοῦ…
ltx/gr_gr_cog/oc.m6.d7:ocMA.OdeW8C1T.melody	@ltx/gr_gr_cog/he.h.m6:heHE.OiOsioiSouPaides.name
ltx/gr_gr_cog/oc.m6.d7:ocMA.OdeW8C1T.mode	@ltx/gr_gr_cog/miscellanea:misc.Mode6
ltx/gr_gr_cog/oc.m6.d7:ocMA.OdeW8C1T.ode	@ltx/gr_gr_cog/miscellanea:misc.Ode8
ltx/gr_gr_cog/oc.m6.d7:ocMA.OdeW8C1T.text	Ὅλην σε τὴν πλησίον Θεοῦ Παρθένε, χορὸς Γυναίων ἠγάπησε, καὶ σοῦ ὀπίσω προσηνέχθη, τῷ Δεσπότῃ τῶν ὅλων, συμφώνως μακαρίζων σε Ἄχραντε.
ltx/gr_gr_cog/oc.m6.d7:ocMA.OdeW8C21.greekmelody	@ltx/gr_gr_cog/he.h.m6:heHE.EkFlogosToisOsiois.greekname
ltx/gr_gr_cog/oc.m6.d7:ocMA.OdeW8C21.incipit	Σταθερῶς τοὺς ἀγῶνας ἐπιδειξάμενοι, τῷ…
ltx/gr_gr_cog/oc.m6.d7:ocMA.OdeW8C21.melody	@ltx/gr_gr_cog/he.h.m6:heHE.EkFlogosToisOsiois.name
ltx/gr_gr_cog/oc.m6.d7:ocMA.OdeW8C21.mode	@ltx/gr_gr_cog/miscellanea:misc.Mode6
ltx/gr_gr_cog/oc.m6.d7:ocMA.OdeW8C21.ode	@ltx/gr_gr_cog/miscellanea:misc.Ode8
ltx/gr_gr_cog/oc.m6.d7:ocMA.OdeW8C21.text	Σταθερῶς τοὺς ἀγῶνας ἐπιδειξάμενοι, τῷ τῆς νίκης στεφάνῳ κατεκοσμήθητε, Μάρτυρες Χριστοῦ, ἀθλοφόροι κραυγάζοντες· Σὲ ὑπερυψοῦμεν, εἰς πάντας τοὺς αἰῶνας.
ltx/gr_gr_cog/oc.m6.d7:ocMA.OdeW8C22.incipit	Ἱερῶς τοὺς τὸν βίον ἀπολιπόντας…
ltx/gr_gr_cog/oc.m6.d7:ocMA.OdeW8C22.melody	@ltx/gr_gr_cog/he.h.m6:heHE.EkFlogosToisOsiois.name
ltx/gr_gr_cog/oc.m6.d7:ocMA.OdeW8C22.mode	@ltx/gr_gr_cog/miscellanea:misc.Mode6
ltx/gr_gr_cog/oc.m6.d7:ocMA.OdeW8C22.ode	@ltx/gr_gr_cog/miscellanea:misc.Ode8
ltx/gr_gr_cog/oc.m6.d7:ocMA.OdeW8C22.text	Ἱερῶς τοὺς τὸν βίον ἀπολιπόντας πιστούς, καὶ πρὸς σὲ τὸν Δεσπότην μεταχωρήσαντας, δέξαι προσηνῶς ἀναπαύων ὡς εὔσπλαγχνος, σὲ ὑπερυψοῦντας, εἰς πάντας τοὺς αἰῶνας.
ltx/gr_gr_cog/oc.m6.d7:ocMA.OdeW8C23.incipit	Νῦν ἐν γῇ τῶν πρᾳέων…
ltx/gr_gr_cog/oc.m6.d7:ocMA.OdeW8C23.melody	@ltx/gr_gr_cog/he.h.m6:heHE.EkFlogosToisOsiois.name
ltx/gr_gr_cog/oc.m6.d7:ocMA.OdeW8C23.mode	@ltx/gr_gr_cog/miscellanea:misc.Mode6
ltx/gr_gr_cog/oc.m6.d7:ocMA.OdeW8C23.ode	@ltx/gr_gr_cog/miscellanea:misc.Ode8
ltx/gr_gr_cog/oc.m6.d7:ocMA.OdeW8C23.text	Νῦν ἐν γῇ τῶν πρᾳέων πάντας αὐλίζεσθαι, τοὺς προκεκοιμημένους Σῶτερ εὐδόκησον, πίστει τῇ εἰς σέ, δικαιώσας καὶ χάριτι, σὲ ὑπερυψοῦντας, εἰς πάντας τοὺς αἰῶνας.
ltx/gr_gr_cog/oc.m6.d7:ocMA.OdeW8C2T.incipit	Μακαρίζομεν πάντες, σὲ Παμμακάριστε, τὴν…
ltx/gr_gr_cog/oc.m6.d7:ocMA.OdeW8C2T.melody	@ltx/gr_gr_cog/he.h.m6:heHE.EkFlogosToisOsiois.name
ltx/gr_gr_cog/oc.m6.d7:ocMA.OdeW8C2T.mode	@ltx/gr_gr_cog/miscellanea:misc.Mode6
ltx/gr_gr_cog/oc.m6.d7:ocMA.OdeW8C2T.ode	@ltx/gr_gr_cog/miscellanea:misc.Ode8
ltx/gr_gr_cog/oc.m6.d7:ocMA.OdeW8C2T.text	Μακαρίζομεν πάντες, σὲ Παμμακάριστε, τὴν τὸν Λόγον τὸν ὄντως ὄντα μακάριον, σάρκα διʼ ἡμᾶς, γεγονότα γεννήσασαν, ὃν ὑπερυψοῦμεν, εἰς πάντας τοὺς αἰῶνας.
ltx/gr_gr_cog/oc.m6.d7:ocMA.OdeW9C11.incipit	Ἱερεῖα καθαρὰ προσενεχθέντες τῷ Δεσπότῃ…
ltx/gr_gr_cog/oc.m6.d7:ocMA.OdeW9C11.melody	@ltx/gr_gr_cog/he.h.m6:heHE.IToChaireDiAngelou.name
ltx/gr_gr_cog/oc.m6.d7:ocMA.OdeW9C11.mode	@ltx/gr_gr_cog/miscellanea:misc.Mode6
ltx/gr_gr_cog/oc.m6.d7:ocMA.OdeW9C11.ode	@ltx/gr_gr_cog/miscellanea:misc.Ode9
ltx/gr_gr_cog/oc.m6.d7:ocMA.OdeW9C11.text	Ἱερεῖα καθαρὰ προσενεχθέντες τῷ Δεσπότῃ ἀθλοφόροι Μάρτυρες αὐτὸν αἰτεῖσθε σῶσαι τὰς ψυχὰς ἡμῶν.
ltx/gr_gr_cog/oc.m6.d7:ocMA.OdeW9C12.incipit	Ὡς ποιμένες, ἐπὶ χλόην εὐσεβείας…
ltx/gr_gr_cog/oc.m6.d7:ocMA.OdeW9C12.melody	@ltx/gr_gr_cog/he.h.m6:heHE.IToChaireDiAngelou.name
ltx/gr_gr_cog/oc.m6.d7:ocMA.OdeW9C12.mode	@ltx/gr_gr_cog/miscellanea:misc.Mode6
ltx/gr_gr_cog/oc.m6.d7:ocMA.OdeW9C12.ode	@ltx/gr_gr_cog/miscellanea:misc.Ode9
ltx/gr_gr_cog/oc.m6.d7:ocMA.OdeW9C12.text	Ὡς ποιμένες, ἐπὶ χλόην εὐσεβείας, Ἱεράρχαι πιστοὺς ἐποιμάνατε, καὶ νῦν εἰς μάνδραν θείαν ἐσκηνώσατε.
ltx/gr_gr_cog/oc.m6.d7:ocMA.OdeW9C13.incipit	Σὺν ἁγίοις, Ἱεράρχαις καὶ Προφήταις…
ltx/gr_gr_cog/oc.m6.d7:ocMA.OdeW9C13.melody	@ltx/gr_gr_cog/he.h.m6:heHE.IToChaireDiAngelou.name
ltx/gr_gr_cog/oc.m6.d7:ocMA.OdeW9C13.mode	@ltx/gr_gr_cog/miscellanea:misc.Mode6
ltx/gr_gr_cog/oc.m6.d7:ocMA.OdeW9C13.ode	@ltx/gr_gr_cog/miscellanea:misc.Ode9
ltx/gr_gr_cog/oc.m6.d7:ocMA.OdeW9C13.text	Σὺν ἁγίοις, Ἱεράρχαις καὶ Προφήταις καὶ Γυναίων χορῷ ἐναθλήσαντι, τοὺς τῶν Ὁσίων χοροὺς μακαρίσωμεν.
ltx/gr_gr_cog/oc.m6.d7:ocMA.OdeW9C14.incipit	Ἧς μετέσχον, εὐφροσύνης ἀϊδίου, τῶν…
ltx/gr_gr_cog/oc.m6.d7:ocMA.OdeW9C14.melody	@ltx/gr_gr_cog/he.h.m6:heHE.IToChaireDiAngelou.name
ltx/gr_gr_cog/oc.m6.d7:ocMA.OdeW9C14.mode	@ltx/gr_gr_cog/miscellanea:misc.Mode6
ltx/gr_gr_cog/oc.m6.d7:ocMA.OdeW9C14.ode	@ltx/gr_gr_cog/miscellanea:misc.Ode9
ltx/gr_gr_cog/oc.m6.d7:ocMA.OdeW9C14.text	Ἧς μετέσχον, εὐφροσύνης ἀϊδίου, τῶν Ἁγίων οἱ δῆμοι, ἀξίωσον τοὺς μεταστάντας, τυχεῖν Πολυέλεε.
ltx/gr_gr_cog/oc.m6.d7:ocMA.OdeW9C1H.greekmelody	@ltx/gr_gr_cog/he.h.m6:heHE.IToChaireDiAngelou.greekname
ltx/gr_gr_cog/oc.m6.d7:ocMA.OdeW9C1H.incipit	@ltx/gr_gr_cog/he.h.m6:heHE.IToChaireDiAngelou.incipit
ltx/gr_gr_cog/oc.m6.d7:ocMA.OdeW9C1H.melody	@ltx/gr_gr_cog/he.h.m6:heHE.IToChaireDiAngelou.melody
ltx/gr_gr_cog/oc.m6.d7:ocMA.OdeW9C1H.mode	@ltx/gr_gr_cog/miscellanea:misc.Mode6
ltx/gr_gr_cog/oc.m6.d7:ocMA.OdeW9C1H.ode	@ltx/gr_gr_cog/miscellanea:misc.Ode9
ltx/gr_gr_cog/oc.m6.d7:ocMA.OdeW9C1H.text	@ltx/gr_gr_cog/he.h.m6:heHE.IToChaireDiAngelou.text
ltx/gr_gr_cog/oc.m6.d7:ocMA.OdeW9C1T.incipit	Φῶς τεκοῦσα, φωταγώγησον Παρθένε τὴν…
ltx/gr_gr_cog/oc.m6.d7:ocMA.OdeW9C1T.melody	@ltx/gr_gr_cog/he.h.m6:heHE.IToChaireDiAngelou.name
ltx/gr_gr_cog/oc.m6.d7:ocMA.OdeW9C1T.mode	@ltx/gr_gr_cog/miscellanea:misc.Mode6
ltx/gr_gr_cog/oc.m6.d7:ocMA.OdeW9C1T.ode	@ltx/gr_gr_cog/miscellanea:misc.Ode9
ltx/gr_gr_cog/oc.m6.d7:ocMA.OdeW9C1T.text	Φῶς τεκοῦσα, φωταγώγησον Παρθένε τὴν ψυχήν μου τὸ σκότος διώκουσα, τῆς ἁμαρτίας, Ἁγνὴ τὸ βαρύτατον.
ltx/gr_gr_cog/oc.m6.d7:ocMA.OdeW9C21.greekmelody	@ltx/gr_gr_cog/he.h.m6:heHE.TheonAnthropois.greekname
ltx/gr_gr_cog/oc.m6.d7:ocMA.OdeW9C21.incipit	Ἐλπὶς Μαρτύρων χοροὺς ἐνεύρωσε, καὶ…
ltx/gr_gr_cog/oc.m6.d7:ocMA.OdeW9C21.melody	@ltx/gr_gr_cog/he.h.m6:heHE.TheonAnthropois.name
ltx/gr_gr_cog/oc.m6.d7:ocMA.OdeW9C21.mode	@ltx/gr_gr_cog/miscellanea:misc.Mode6
ltx/gr_gr_cog/oc.m6.d7:ocMA.OdeW9C21.ode	@ltx/gr_gr_cog/miscellanea:misc.Ode9
ltx/gr_gr_cog/oc.m6.d7:ocMA.OdeW9C21.text	Ἐλπὶς Μαρτύρων χοροὺς ἐνεύρωσε, καὶ πρὸς τὴν σὴν ἀγάπην διαπύρως ἐπτέρωσε, τῶν μελλόντων τούτοις προτυπώσασα, τὴν μὴ σαλευομένην ὄντως ἀνάπαυσιν, ἧς τοὺς μεταστάντας Ἀγαθὲ πιστοὺς ἀξίωσον.
ltx/gr_gr_cog/oc.m6.d7:ocMA.OdeW9C22.incipit	Λαμπρᾶς καὶ θείας τυχεῖν ἐλλάμψεως…
ltx/gr_gr_cog/oc.m6.d7:ocMA.OdeW9C22.melody	@ltx/gr_gr_cog/he.h.m6:heHE.TheonAnthropois.name
ltx/gr_gr_cog/oc.m6.d7:ocMA.OdeW9C22.mode	@ltx/gr_gr_cog/miscellanea:misc.Mode6
ltx/gr_gr_cog/oc.m6.d7:ocMA.OdeW9C22.ode	@ltx/gr_gr_cog/miscellanea:misc.Ode9
ltx/gr_gr_cog/oc.m6.d7:ocMA.OdeW9C22.text	Λαμπρᾶς καὶ θείας τυχεῖν ἐλλάμψεως, τῆς σῆς Χριστὲ τοὺς πίστει μεταστάντας εὐδόκησον, τὴν ἐν κόλποις Ἀβραὰμ ἀνάπαυσιν, μόνος ὡς ἐλεήμων, τούτοις δωρούμενος, καὶ τῆς αἰωνίου ἀξιῶν μακαριότητος.
ltx/gr_gr_cog/oc.m6.d7:ocMA.OdeW9C23.incipit	Ὁ ὢν τῇ φύσει χρηστὸς…
ltx/gr_gr_cog/oc.m6.d7:ocMA.OdeW9C23.melody	@ltx/gr_gr_cog/he.h.m6:heHE.TheonAnthropois.name
ltx/gr_gr_cog/oc.m6.d7:ocMA.OdeW9C23.mode	@ltx/gr_gr_cog/miscellanea:misc.Mode6
ltx/gr_gr_cog/oc.m6.d7:ocMA.OdeW9C23.ode	@ltx/gr_gr_cog/miscellanea:misc.Ode9
ltx/gr_gr_cog/oc.m6.d7:ocMA.OdeW9C23.text	Ὁ ὢν τῇ φύσει χρηστὸς καὶ εὔσπλαγχνος, καὶ θελητὴς ἐλέους, εὐσπλαγχνίας ἡ ἄβυσσος, οὓς ἐκ τόπου τούτου τῆς κακώσεως, καὶ σκιᾶς τοῦ θανάτου Σῶτερ μετέστησας ἔνθα καταλάμπει σου τὸ φῶς, τούτους κατάταξον.
ltx/gr_gr_cog/oc.m6.d7:ocMA.OdeW9C2T.incipit	Σκηνὴν ἁγίαν Ἁγνὴ γινώσκομεν, καὶ…
ltx/gr_gr_cog/oc.m6.d7:ocMA.OdeW9C2T.melody	@ltx/gr_gr_cog/he.h.m6:heHE.TheonAnthropois.name
ltx/gr_gr_cog/oc.m6.d7:ocMA.OdeW9C2T.mode	@ltx/gr_gr_cog/miscellanea:misc.Mode6
ltx/gr_gr_cog/oc.m6.d7:ocMA.OdeW9C2T.ode	@ltx/gr_gr_cog/miscellanea:misc.Ode9
ltx/gr_gr_cog/oc.m6.d7:ocMA.OdeW9C2T.text	Σκηνὴν ἁγίαν Ἁγνὴ γινώσκομεν, καὶ Κιβωτὸν καὶ Πλάκα σὲ τοῦ νόμου τῆς χάριτος· διὰ σοῦ γὰρ ἄφεσις δεδώρηται τοῖς δεδικαιωμένοις, διὰ τοῦ αἵματος τοῦ σωματωθέντος, ἐκ τῆς σῆς γαστρὸς Πανάμωμε.
ltx/gr_gr_cog/oc.m6.d7:ocVE.ApolTheotokionVM.incipit	@ltx/gr_gr_cog/oc.m6.d1:ocVE.ApolTheotokionVM.incipit
ltx/gr_gr_cog/oc.m6.d7:ocVE.ApolTheotokionVM.melody	
ltx/gr_gr_cog/oc.m6.d7:ocVE.ApolTheotokionVM.mode	@ltx/gr_gr_cog/miscellanea:misc.Mode6
ltx/gr_gr_cog/oc.m6.d7:ocVE.ApolTheotokionVM.text	@ltx/gr_gr_cog/oc.m6.d1:ocVE.ApolTheotokionVM.text
ltx/gr_gr_cog/oc.m6.d7:ocVE.AposTheotokion.greekmelody	@ltx/gr_gr_cog/he.a.m6:heAU.TriimerosAnestis.greekname
ltx/gr_gr_cog/oc.m6.d7:ocVE.AposTheotokion.incipit	Πρεσβείαις τῆς Τεκούσης σε, Χριστὲ…
ltx/gr_gr_cog/oc.m6.d7:ocVE.AposTheotokion.melody	@ltx/gr_gr_cog/he.a.m6:heAU.TriimerosAnestis.name
ltx/gr_gr_cog/oc.m6.d7:ocVE.AposTheotokion.mode	@ltx/gr_gr_cog/miscellanea:misc.Mode6
ltx/gr_gr_cog/oc.m6.d7:ocVE.AposTheotokion.text	Πρεσβείαις τῆς Τεκούσης σε, Χριστὲ καὶ τῶν Μαρτύρων σου, Ἀποστόλων Προφητῶν Ἱεραρχῶν, ὁσίων καὶ Δικαίων, καὶ πάντων τῶν Ἁγίων, τοὺς κοιμηθέντας δούλους σου ἀνάπαυσον.
ltx/gr_gr_cog/oc.m6.d7:ocVE.Aposticha1.incipit	@ltx/gr_gr_cog/oc.m6.d2:ocVE.Aposticha3.incipit
ltx/gr_gr_cog/oc.m6.d7:ocVE.Aposticha1.melody	
ltx/gr_gr_cog/oc.m6.d7:ocVE.Aposticha1.mode	@ltx/gr_gr_cog/miscellanea:misc.Mode6
ltx/gr_gr_cog/oc.m6.d7:ocVE.Aposticha1.text	@ltx/gr_gr_cog/oc.m6.d2:ocVE.Aposticha3.text
ltx/gr_gr_cog/oc.m6.d7:ocVE.Aposticha2.incipit	Ἀρχή μοι καὶ ὑπόστασις, τὸ…
ltx/gr_gr_cog/oc.m6.d7:ocVE.Aposticha2.melody	
ltx/gr_gr_cog/oc.m6.d7:ocVE.Aposticha2.mode	@ltx/gr_gr_cog/miscellanea:misc.Mode6
ltx/gr_gr_cog/oc.m6.d7:ocVE.Aposticha2.text	Ἀρχή μοι καὶ ὑπόστασις, τὸ πλαστουργόν σου γέγονε πρόσταγμα· βουληθεὶς γὰρ ἐξ ἀοράτου τε καὶ ὁρατῆς, ζῶόν με συμπῆξαι φύσεως, γῆθέν μου τὸ σῶμα διέπλασας, δέδωκας δέ μοι ψυχήν, τῇ θείᾳ σου καὶ ζωοποιῷ ἐμπνεύσει. Διὸ Σωτὴρ τοὺς δούλους σου, ἐν χώρᾳ ζώντων, ἐν σκηναῖς Δικαίων ἀνάπαυσον.
ltx/gr_gr_cog/oc.m6.d7:ocVE.Aposticha3.incipit	Ἄλγος τῷ Ἀδὰμ ἐχρημάτισεν, ἡ…
ltx/gr_gr_cog/oc.m6.d7:ocVE.Aposticha3.melody	
ltx/gr_gr_cog/oc.m6.d7:ocVE.Aposticha3.mode	@ltx/gr_gr_cog/miscellanea:misc.Mode6
ltx/gr_gr_cog/oc.m6.d7:ocVE.Aposticha3.text	Ἄλγος τῷ Ἀδὰμ ἐχρημάτισεν, ἡ τοῦ ξύλου ἀπόγευσις, πάλαι ἐν Ἐδέμ, ὅτε ὄφις ἰὸν ἐξηρεύξατο· διʼ αὐτοῦ γὰρ εἰσῆλθεν ὁ θάνατος, παγγενῆ κατεσθίων τὸν ἄνθρωπον. Ἀλλʼ ἐλθὼν ὁ Δεσπότης, καθεῖλε τὸν δράκοντα, καὶ ἀνάστασιν ἡμῖν ἐδωρήσατο. Πρὸς αὐτὸν οὖν βοήσωμεν· Φεῖσαι Σωτήρ, καὶ οὓς προσελάβου, μετὰ τῶν Δικαίων ἀνάπαυσον.
ltx/gr_gr_cog/oc.m6.d7:ocVE.SticTheotokion.incipit	@ltx/gr_gr_cog/oc.m6.d1:ocVE.SticTheotokion.incipit
ltx/gr_gr_cog/oc.m6.d7:ocVE.SticTheotokion.melody	
ltx/gr_gr_cog/oc.m6.d7:ocVE.SticTheotokion.mode	@ltx/gr_gr_cog/miscellanea:misc.Mode6
ltx/gr_gr_cog/oc.m6.d7:ocVE.SticTheotokion.text	@ltx/gr_gr_cog/oc.m6.d1:ocVE.SticTheotokion.text
ltx/gr_gr_cog/oc.m6.d7:ocVE.Stichera1.greekmelody	@ltx/gr_gr_cog/he.a.m6:heAU.IApegnosmeni.greekname
ltx/gr_gr_cog/oc.m6.d7:ocVE.Stichera1.incipit	Ῥῦσαί με γεέννης ἀποκειμενης, ἐξελοῦ…
ltx/gr_gr_cog/oc.m6.d7:ocVE.Stichera1.melody	@ltx/gr_gr_cog/he.a.m6:heAU.IApegnosmeni.name
ltx/gr_gr_cog/oc.m6.d7:ocVE.Stichera1.mode	@ltx/gr_gr_cog/miscellanea:misc.Mode6
ltx/gr_gr_cog/oc.m6.d7:ocVE.Stichera1.text	Ῥῦσαί με γεέννης ἀποκειμενης, ἐξελοῦ πυρός με τοῦ αἰωνίου, Κριτὰ δικαιότατε, τὸν κατακεκριμένον, δεῖξον ἐκ ζάλης ἐναντίας, ἀνάλωτόν με Λόγε, τρέμω ὁ τάλας ἐννοῶν μου, τὸ τῶν πταισμάτων πλῆθος, καὶ προσπίπτω σοι μετὰ δακρύων, καὶ συντριβῆς τῆς καρδίας μου Φιλάνθρωπε, τὸ σὸν αἰτούμενος ἔλεος.
ltx/gr_gr_cog/oc.m6.d7:ocVE.Stichera2.incipit	Τίς ἐμὲ μὴ κλαύσῃ τὸν…
ltx/gr_gr_cog/oc.m6.d7:ocVE.Stichera2.melody	@ltx/gr_gr_cog/he.a.m6:heAU.IApegnosmeni.name
ltx/gr_gr_cog/oc.m6.d7:ocVE.Stichera2.mode	@ltx/gr_gr_cog/miscellanea:misc.Mode6
ltx/gr_gr_cog/oc.m6.d7:ocVE.Stichera2.text	Τίς ἐμὲ μὴ κλαύσῃ τὸν παραβάντα, ἐντολὴν Δεσπότου διʼ ἀκρασίαν, τὸν ᾍδην οἰκήσαντα, ἀντὶ τοῦ Παραδείσου, βρῶσις γλυκεῖά μοι φανεῖσα εἰς χολὴν μετετράπη, ξένος τῆς δόξης σου Οἰκτίρμον, καὶ Ἀγγέλων ἐδείχθην, ἀλλὰ δέξαι με μετανοοῦντα ὡς ἐλεήμων καὶ φιλάνθρωπος Κύριος διὰ τὸ μέγα σου ἔλεος.
ltx/gr_gr_cog/oc.m6.d7:ocVE.Stichera3.incipit	Πάντας τοὺς ἐν πίστει κεκοιμημένους…
ltx/gr_gr_cog/oc.m6.d7:ocVE.Stichera3.melody	@ltx/gr_gr_cog/he.a.m6:heAU.IApegnosmeni.name
ltx/gr_gr_cog/oc.m6.d7:ocVE.Stichera3.mode	@ltx/gr_gr_cog/miscellanea:misc.Mode6
ltx/gr_gr_cog/oc.m6.d7:ocVE.Stichera3.text	Πάντας τοὺς ἐν πίστει κεκοιμημένους τάξον ζωοδότα ἐν χώρᾳ ζώντων, ἐν τόποις ἀνέσεως, ἐν σκηναῖς αἰωνίοις, ἔνθα τὸ φῶς τοῦ σοῦ προσώπου, ἀφθόνως καταλάμπει, ὅπου τρυφὴ καὶ χαρμοσύνη, καὶ εἰρήνη τῶν Δικαίων, παριδὼν αὐτῶν τὰ ἐπταισμένα, ἔργῳ καὶ λόγῳ διανοίᾳ τε Δέσποτα, διὰ πολλὴν ἀγαθότητα.
ltx/gr_gr_cog/oc.m6.d7:ocVE.Stichera4.incipit	@ltx/gr_gr_cog/oc.m6.d3:ocVE.Aposticha3.incipit
ltx/gr_gr_cog/oc.m6.d7:ocVE.Stichera4.melody	
ltx/gr_gr_cog/oc.m6.d7:ocVE.Stichera4.mode	@ltx/gr_gr_cog/miscellanea:misc.Mode6
ltx/gr_gr_cog/oc.m6.d7:ocVE.Stichera4.text	@ltx/gr_gr_cog/oc.m6.d3:ocVE.Aposticha3.text
ltx/gr_gr_cog/oc.m6.d7:ocVE.Stichera5.incipit	@ltx/gr_gr_cog/oc.m6.d4:ocVE.Aposticha3.incipit
ltx/gr_gr_cog/oc.m6.d7:ocVE.Stichera5.melody	
ltx/gr_gr_cog/oc.m6.d7:ocVE.Stichera5.mode	@ltx/gr_gr_cog/miscellanea:misc.Mode6
ltx/gr_gr_cog/oc.m6.d7:ocVE.Stichera5.text	@ltx/gr_gr_cog/oc.m6.d4:ocVE.Aposticha3.text
ltx/gr_gr_cog/oc.m6.d7:ocVE.Stichera6.incipit	@ltx/gr_gr_cog/oc.m6.d5:ocVE.Aposticha3.incipit
ltx/gr_gr_cog/oc.m6.d7:ocVE.Stichera6.melody	
ltx/gr_gr_cog/oc.m6.d7:ocVE.Stichera6.mode	@ltx/gr_gr_cog/miscellanea:misc.Mode6
ltx/gr_gr_cog/oc.m6.d7:ocVE.Stichera6.text	@ltx/gr_gr_cog/oc.m6.d5:ocVE.Aposticha3.text
ltx/gr_gr_cog/oc.m6.d7:octrMA.AposTheotokion.incipit	@ltx/gr_gr_cog/oc.m6.d7:ocMA.AposTheotokion.incipit
ltx/gr_gr_cog/oc.m6.d7:octrMA.AposTheotokion.melody	@ltx/gr_gr_cog/oc.m6.d7:ocMA.AposTheotokion.melody
ltx/gr_gr_cog/oc.m6.d7:octrMA.AposTheotokion.mode	@ltx/gr_gr_cog/miscellanea:misc.Mode6
ltx/gr_gr_cog/oc.m6.d7:octrMA.AposTheotokion.text	@ltx/gr_gr_cog/oc.m6.d7:ocMA.AposTheotokion.text
ltx/gr_gr_cog/oc.m6.d7:octrMA.Aposticha1.greekmelody	@ltx/gr_gr_cog/oc.m6.d7:ocMA.Aposticha1.greekmelody
ltx/gr_gr_cog/oc.m6.d7:octrMA.Aposticha1.incipit	@ltx/gr_gr_cog/oc.m6.d7:ocMA.Aposticha1.incipit
ltx/gr_gr_cog/oc.m6.d7:octrMA.Aposticha1.melody	@ltx/gr_gr_cog/oc.m6.d7:ocMA.Aposticha1.melody
ltx/gr_gr_cog/oc.m6.d7:octrMA.Aposticha1.mode	@ltx/gr_gr_cog/miscellanea:misc.Mode6
ltx/gr_gr_cog/oc.m6.d7:octrMA.Aposticha1.text	@ltx/gr_gr_cog/oc.m6.d7:ocMA.Aposticha1.text
ltx/gr_gr_cog/oc.m6.d7:octrMA.Aposticha2.incipit	@ltx/gr_gr_cog/oc.m6.d7:ocMA.Aposticha2.incipit
ltx/gr_gr_cog/oc.m6.d7:octrMA.Aposticha2.melody	@ltx/gr_gr_cog/oc.m6.d7:ocMA.Aposticha2.melody
ltx/gr_gr_cog/oc.m6.d7:octrMA.Aposticha2.mode	@ltx/gr_gr_cog/miscellanea:misc.Mode6
ltx/gr_gr_cog/oc.m6.d7:octrMA.Aposticha2.text	@ltx/gr_gr_cog/oc.m6.d7:ocMA.Aposticha2.text
ltx/gr_gr_cog/oc.m6.d7:octrMA.Aposticha3.incipit	@ltx/gr_gr_cog/oc.m6.d7:ocMA.Aposticha3.incipit
ltx/gr_gr_cog/oc.m6.d7:octrMA.Aposticha3.melody	@ltx/gr_gr_cog/oc.m6.d7:ocMA.Aposticha3.melody
ltx/gr_gr_cog/oc.m6.d7:octrMA.Aposticha3.mode	@ltx/gr_gr_cog/miscellanea:misc.Mode6
ltx/gr_gr_cog/oc.m6.d7:octrMA.Aposticha3.text	@ltx/gr_gr_cog/oc.m6.d7:ocMA.Aposticha3.text
ltx/gr_gr_cog/oc.m6.d7:octrMA.Kathisma11.incipit	@ltx/gr_gr_cog/oc.m6.d7:ocMA.Kathisma12.incipit
ltx/gr_gr_cog/oc.m6.d7:octrMA.Kathisma11.melody	
ltx/gr_gr_cog/oc.m6.d7:octrMA.Kathisma11.mode	@ltx/gr_gr_cog/miscellanea:misc.Mode6
ltx/gr_gr_cog/oc.m6.d7:octrMA.Kathisma11.text	@ltx/gr_gr_cog/oc.m6.d7:ocMA.Kathisma12.text
ltx/gr_gr_cog/oc.m6.d7:octrMA.Kathisma12.greekmelody	@ltx/gr_gr_cog/oc.m6.d7:ocMA.Kathisma11.greekmelody
ltx/gr_gr_cog/oc.m6.d7:octrMA.Kathisma12.incipit	@ltx/gr_gr_cog/oc.m6.d7:ocMA.Kathisma11.incipit
ltx/gr_gr_cog/oc.m6.d7:octrMA.Kathisma12.melody	@ltx/gr_gr_cog/oc.m6.d7:ocMA.Kathisma11.melody
ltx/gr_gr_cog/oc.m6.d7:octrMA.Kathisma12.mode	@ltx/gr_gr_cog/miscellanea:misc.Mode6
ltx/gr_gr_cog/oc.m6.d7:octrMA.Kathisma12.text	@ltx/gr_gr_cog/oc.m6.d7:ocMA.Kathisma11.text
ltx/gr_gr_cog/oc.m6.d7:octrMA.Kathisma13.incipit	@ltx/gr_gr_cog/oc.m6.d7:ocMA.Kathisma13.incipit
ltx/gr_gr_cog/oc.m6.d7:octrMA.Kathisma13.melody	
ltx/gr_gr_cog/oc.m6.d7:octrMA.Kathisma13.mode	@ltx/gr_gr_cog/miscellanea:misc.Mode6
ltx/gr_gr_cog/oc.m6.d7:octrMA.Kathisma13.text	@ltx/gr_gr_cog/oc.m6.d7:ocMA.Kathisma13.text
ltx/gr_gr_cog/oc.m6.d7:octrMA.Kathisma14.incipit	@ltx/gr_gr_cog/oc.m6.d7:ocMA.Kathisma22.incipit
ltx/gr_gr_cog/oc.m6.d7:octrMA.Kathisma14.melody	
ltx/gr_gr_cog/oc.m6.d7:octrMA.Kathisma14.mode	@ltx/gr_gr_cog/miscellanea:misc.Mode6
ltx/gr_gr_cog/oc.m6.d7:octrMA.Kathisma14.text	@ltx/gr_gr_cog/oc.m6.d7:ocMA.Kathisma22.text
ltx/gr_gr_cog/oc.m6.d7:octrMA.Kathisma1T.greekmelody	@ltx/gr_gr_cog/oc.m6.d3:ocMA.Kathisma23.greekmelody
ltx/gr_gr_cog/oc.m6.d7:octrMA.Kathisma1T.incipit	@ltx/gr_gr_cog/oc.m6.d3:ocMA.Kathisma23.incipit
ltx/gr_gr_cog/oc.m6.d7:octrMA.Kathisma1T.melody	@ltx/gr_gr_cog/oc.m6.d3:ocMA.Kathisma23.melody
ltx/gr_gr_cog/oc.m6.d7:octrMA.Kathisma1T.mode	@ltx/gr_gr_cog/miscellanea:misc.Mode6
ltx/gr_gr_cog/oc.m6.d7:octrMA.Kathisma1T.text	@ltx/gr_gr_cog/oc.m6.d3:ocMA.Kathisma23.text
ltx/gr_gr_cog/oc.m6.d7:octrMA.Lauds1.incipit	@ltx/gr_gr_cog/oc.m6.d7:ocMA.Lauds1.incipit
ltx/gr_gr_cog/oc.m6.d7:octrMA.Lauds1.melody	
ltx/gr_gr_cog/oc.m6.d7:octrMA.Lauds1.mode	@ltx/gr_gr_cog/miscellanea:misc.Mode6
ltx/gr_gr_cog/oc.m6.d7:octrMA.Lauds1.text	@ltx/gr_gr_cog/oc.m6.d7:ocMA.Lauds1.text
ltx/gr_gr_cog/oc.m6.d7:octrMA.Lauds2.incipit	@ltx/gr_gr_cog/oc.m6.d7:ocMA.Lauds2.incipit
ltx/gr_gr_cog/oc.m6.d7:octrMA.Lauds2.melody	
ltx/gr_gr_cog/oc.m6.d7:octrMA.Lauds2.mode	@ltx/gr_gr_cog/miscellanea:misc.Mode6
ltx/gr_gr_cog/oc.m6.d7:octrMA.Lauds2.text	@ltx/gr_gr_cog/oc.m6.d7:ocMA.Lauds2.text
ltx/gr_gr_cog/oc.m6.d7:octrMA.Lauds3.incipit	@ltx/gr_gr_cog/oc.m6.d7:ocMA.Lauds3.incipit
ltx/gr_gr_cog/oc.m6.d7:octrMA.Lauds3.melody	
ltx/gr_gr_cog/oc.m6.d7:octrMA.Lauds3.mode	@ltx/gr_gr_cog/miscellanea:misc.Mode6
ltx/gr_gr_cog/oc.m6.d7:octrMA.Lauds3.text	@ltx/gr_gr_cog/oc.m6.d7:ocMA.Lauds3.text
ltx/gr_gr_cog/oc.m6.d7:octrMA.Lauds4.incipit	@ltx/gr_gr_cog/oc.m6.d7:ocMA.Lauds4.incipit
ltx/gr_gr_cog/oc.m6.d7:octrMA.Lauds4.melody	
ltx/gr_gr_cog/oc.m6.d7:octrMA.Lauds4.mode	@ltx/gr_gr_cog/miscellanea:misc.Mode6
ltx/gr_gr_cog/oc.m6.d7:octrMA.Lauds4.text	@ltx/gr_gr_cog/oc.m6.d7:ocMA.Lauds4.text
ltx/gr_gr_cog/oc.m6.d7:octrMA.LaudsGlory.incipit	@ltx/gr_gr_cog/oc.m6.d7:ocVE.Aposticha3.incipit
ltx/gr_gr_cog/oc.m6.d7:octrMA.LaudsGlory.melody	
ltx/gr_gr_cog/oc.m6.d7:octrMA.LaudsGlory.mode	@ltx/gr_gr_cog/miscellanea:misc.Mode6
ltx/gr_gr_cog/oc.m6.d7:octrMA.LaudsGlory.text	@ltx/gr_gr_cog/oc.m6.d7:ocVE.Aposticha3.text
ltx/gr_gr_cog/oc.m6.d7:octrMA.LaudsTheotokion.greekmelody	@ltx/gr_gr_cog/oc.m6.d7:ocVE.AposTheotokion.greekmelody
ltx/gr_gr_cog/oc.m6.d7:octrMA.LaudsTheotokion.incipit	@ltx/gr_gr_cog/oc.m6.d7:ocVE.AposTheotokion.incipit
ltx/gr_gr_cog/oc.m6.d7:octrMA.LaudsTheotokion.melody	@ltx/gr_gr_cog/oc.m6.d7:ocVE.AposTheotokion.melody
ltx/gr_gr_cog/oc.m6.d7:octrMA.LaudsTheotokion.mode	@ltx/gr_gr_cog/miscellanea:misc.Mode6
ltx/gr_gr_cog/oc.m6.d7:octrMA.LaudsTheotokion.text	@ltx/gr_gr_cog/oc.m6.d7:ocVE.AposTheotokion.text
ltx/gr_gr_cog/oc.m6.d7:octrMA.Photogogic.incipit	@ltx/gr_gr_cog/oc.m6.d2:octrMA.Photagogic.incipit
ltx/gr_gr_cog/oc.m6.d7:octrMA.Photogogic.mode	@ltx/gr_gr_cog/miscellanea:misc.Mode6
ltx/gr_gr_cog/oc.m6.d7:octrMA.Photogogic.text	@ltx/gr_gr_cog/oc.m6.d2:octrMA.Photagogic.text
ltx/gr_gr_cog/oc.m6.d7:octrVE.SticBoth.incipit	@ltx/gr_gr_cog/oc.m6.d7:ocVE.SticTheotokion.incipit
ltx/gr_gr_cog/oc.m6.d7:octrVE.SticBoth.melody	
ltx/gr_gr_cog/oc.m6.d7:octrVE.SticBoth.mode	@ltx/gr_gr_cog/miscellanea:misc.Mode6
ltx/gr_gr_cog/oc.m6.d7:octrVE.SticBoth.text	@ltx/gr_gr_cog/oc.m6.d7:ocVE.SticTheotokion.text
ltx/gr_gr_cog/oc.m6.d7:octrVE.SticGlory.incipit	@ltx/gr_gr_cog/oc.m6.d7:ocVE.Aposticha2.incipit
ltx/gr_gr_cog/oc.m6.d7:octrVE.SticGlory.melody	
ltx/gr_gr_cog/oc.m6.d7:octrVE.SticGlory.mode	@ltx/gr_gr_cog/miscellanea:misc.Mode6
ltx/gr_gr_cog/oc.m6.d7:octrVE.SticGlory.text	@ltx/gr_gr_cog/oc.m6.d7:ocVE.Aposticha2.text
ltx/gr_gr_cog/oc.m6.d7:octrVE.Stichera1.incipit	@ltx/gr_gr_cog/oc.m6.d7:ocVE.Aposticha1.incipit
ltx/gr_gr_cog/oc.m6.d7:octrVE.Stichera1.melody	
ltx/gr_gr_cog/oc.m6.d7:octrVE.Stichera1.mode	@ltx/gr_gr_cog/miscellanea:misc.Mode6
ltx/gr_gr_cog/oc.m6.d7:octrVE.Stichera1.text	@ltx/gr_gr_cog/oc.m6.d7:ocVE.Aposticha1.text
ltx/gr_gr_cog/oc.m6.d7:octrVE.Stichera2.incipit	@ltx/gr_gr_cog/oc.m6.d3:ocVE.Aposticha3.incipit
ltx/gr_gr_cog/oc.m6.d7:octrVE.Stichera2.melody	
ltx/gr_gr_cog/oc.m6.d7:octrVE.Stichera2.mode	@ltx/gr_gr_cog/miscellanea:misc.Mode6
ltx/gr_gr_cog/oc.m6.d7:octrVE.Stichera2.text	@ltx/gr_gr_cog/oc.m6.d3:ocVE.Aposticha3.text
ltx/gr_gr_cog/oc.m6.d7:octrVE.Stichera3.incipit	@ltx/gr_gr_cog/oc.m6.d4:ocVE.Aposticha3.incipit
ltx/gr_gr_cog/oc.m6.d7:octrVE.Stichera3.melody	
ltx/gr_gr_cog/oc.m6.d7:octrVE.Stichera3.mode	@ltx/gr_gr_cog/miscellanea:misc.Mode6
ltx/gr_gr_cog/oc.m6.d7:octrVE.Stichera3.text	@ltx/gr_gr_cog/oc.m6.d4:ocVE.Aposticha3.text
ltx/gr_gr_cog/oc.m6.d7:octrVE.Stichera4.incipit	@ltx/gr_gr_cog/oc.m6.d5:ocVE.Aposticha3.incipit
ltx/gr_gr_cog/oc.m6.d7:octrVE.Stichera4.melody	
ltx/gr_gr_cog/oc.m6.d7:octrVE.Stichera4.mode	@ltx/gr_gr_cog/miscellanea:misc.Mode6
ltx/gr_gr_cog/oc.m6.d7:octrVE.Stichera4.text	@ltx/gr_gr_cog/oc.m6.d5:ocVE.Aposticha3.text
