ltx/gr_gr_cog/le.ep.mc.d284:lemcLI.Epistle.book_abbr	@ltx/gr_gr_cog/bible:Thessalonians1.abbr
ltx/gr_gr_cog/le.ep.mc.d284:lemcLI.Epistle.book_string	@ltx/gr_gr_cog/bible:Thessalonians1.text
ltx/gr_gr_cog/le.ep.mc.d284:lemcLI.Epistle.chapverse	4:1 – 12
ltx/gr_gr_cog/le.ep.mc.d284:lemcLI.Epistle.incipit	Ἀδελφοί, ἐρωτῶμεν ὑμᾶς καὶ παρακαλοῦμεν…
ltx/gr_gr_cog/le.ep.mc.d284:lemcLI.Epistle.text	Ἀδελφοί, ἐρωτῶμεν ὑμᾶς καὶ παρακαλοῦμεν ἐν Κυρίῳ Ἰησοῦ, καθὼς παρελάβετε παρ᾽ ἡμῶν τὸ πῶς δεῖ ὑμᾶς περιπατεῖν καὶ ἀρέσκειν Θεῷ, ἵνα περισσεύητε μᾶλλον· οἴδατε γὰρ τίνας παραγγελίας ἐδώκαμεν ὑμῖν διὰ τοῦ Κυρίου Ἰησοῦ. Τοῦτο γάρ ἐστι θέλημα τοῦ Θεοῦ, ὁ ἁγιασμὸς ὑμῶν, ἀπέχεσθαι ὑμᾶς ἀπὸ τῆς πορνείας, εἰδέναι ἕκαστον ὑμῶν τὸ ἑαυτοῦ σκεῦος κτᾶσθαι ἐν ἁγιασμῷ καὶ τιμῇ, μὴ ἐν πάθει ἐπιθυμίας καθάπερ καὶ τὰ ἔθνη τὰ μὴ εἰδότα τὸν Θεόν, τὸ μὴ ὑπερβαίνειν καὶ πλεονεκτεῖν ἐν τῷ πράγματι τὸν ἀδελφὸν αὐτοῦ, διότι ἔκδικος ὁ Κύριος περὶ πάντων τούτων, καθὼς καὶ προείπομεν ὑμῖν καὶ διεμαρτυράμεθα. οὐ γὰρ ἐκάλεσεν ἡμᾶς ὁ Θεὸς ἐπὶ ἀκαθαρσίᾳ, ἀλλ᾽ ἐν ἁγιασμῷ. τοιγαροῦν ὁ ἀθετῶν οὐκ ἄνθρωπον ἀθετεῖ, ἀλλὰ τὸν Θεὸν τὸν καὶ δόντα τὸ Πνεῦμα αὐτοῦ τὸ Ἅγιον εἰς ὑμᾶς. Περὶ δὲ τῆς φιλαδελφίας οὐ χρείαν ἔχετε γράφειν ὑμῖν· αὐτοὶ γὰρ ὑμεῖς θεοδίδακτοί ἐστε εἰς τὸ ἀγαπᾶν ἀλλήλους· καὶ γὰρ ποιεῖτε αὐτὸ εἰς πάντας τοὺς ἀδελφοὺς τοὺς ἐν ὅλῃ τῇ Μακεδονίᾳ. παρακαλοῦμεν δὲ ὑμᾶς, ἀδελφοί, περισσεύειν μᾶλλον καὶ φιλοτιμεῖσθαι ἡσυχάζειν καὶ πράσσειν τὰ ἴδια καὶ ἐργάζεσθαι ταῖς ἰδίαις χερσὶν ὑμῶν, καθὼς ὑμῖν παρηγγείλαμεν, ἵνα περιπατῆτε εὐσχημόνως πρὸς τοὺς ἔξω καὶ μηδενὸς χρείαν ἔχητε.
ltx/gr_gr_cog/le.ep.mc.d284:lemcLI.Epistle.title	Τῇ Τετάρτῃ τῆς ΚΔʹ Ἑβδομάδος
ltx/gr_gr_cog/le.ep.mc.d284:lemcLI.Epistle.title_abbr	Τετάρτῃ τῆς ΚΔʹ Ἑβδομάδος
ltx/gr_gr_cog/le.ep.mc.d284:lemcLI.Epistle.version	@ltx/gr_gr_cog/properties:version.designation
