ltx/gr_gr_cog/le.ep.me.m10.d20:lemeLI.Epistle.book_abbr	@ltx/gr_gr_cog/le.ep.ge.martyr:legeLI.Epistle.book_abbr
ltx/gr_gr_cog/le.ep.me.m10.d20:lemeLI.Epistle.book_string	@ltx/gr_gr_cog/le.ep.ge.martyr:legeLI.Epistle.book_string
ltx/gr_gr_cog/le.ep.me.m10.d20:lemeLI.Epistle.chapverse	@ltx/gr_gr_cog/le.ep.ge.martyr:legeLI.Epistle.chapverse
ltx/gr_gr_cog/le.ep.me.m10.d20:lemeLI.Epistle.incipit	@ltx/gr_gr_cog/le.ep.ge.martyr:legeLI.Epistle.incipit
ltx/gr_gr_cog/le.ep.me.m10.d20:lemeLI.Epistle.text	@ltx/gr_gr_cog/le.ep.ge.martyr:legeLI.Epistle.text
ltx/gr_gr_cog/le.ep.me.m10.d20:lemeLI.Epistle.title	Τοῦ Ἁγίου Ἀρτεμίου
ltx/gr_gr_cog/le.ep.me.m10.d20:lemeLI.Epistle.title_abbr	Τοῦ Ἁγίου Ἀρτεμίου
ltx/gr_gr_cog/le.ep.me.m10.d20:lemeLI.Epistle.version	@ltx/gr_gr_cog/le.ep.ge.martyr:legeLI.Epistle.version
ltx/gr_gr_cog/le.ep.me.m10.d20:lemeLI.Epistle2.book_abbr	@ltx/gr_gr_cog/le.ep.mc.d308:lemcLI.Epistle.book_abbr
ltx/gr_gr_cog/le.ep.me.m10.d20:lemeLI.Epistle2.book_string	@ltx/gr_gr_cog/le.ep.mc.d308:lemcLI.Epistle.book_string
ltx/gr_gr_cog/le.ep.me.m10.d20:lemeLI.Epistle2.chapverse	@ltx/gr_gr_cog/le.ep.mc.d308:lemcLI.Epistle.chapverse
ltx/gr_gr_cog/le.ep.me.m10.d20:lemeLI.Epistle2.incipit	@ltx/gr_gr_cog/le.ep.mc.d308:lemcLI.Epistle.incipit
ltx/gr_gr_cog/le.ep.me.m10.d20:lemeLI.Epistle2.text	@ltx/gr_gr_cog/le.ep.mc.d308:lemcLI.Epistle.text
ltx/gr_gr_cog/le.ep.me.m10.d20:lemeLI.Epistle2.title	Τοῦ Ἁγίου Γερασίμου
ltx/gr_gr_cog/le.ep.me.m10.d20:lemeLI.Epistle2.title_abbr	Τοῦ Ἁγίου Γερασίμου
ltx/gr_gr_cog/le.ep.me.m10.d20:lemeLI.Epistle2.version	@ltx/gr_gr_cog/le.ep.mc.d308:lemcLI.Epistle.version
