ltx/gr_gr_cog/le.ep.mc.d099:lemcLI.Epistle.book_abbr	@ltx/gr_gr_cog/bible:Acts.abbr
ltx/gr_gr_cog/le.ep.mc.d099:lemcLI.Epistle.book_string	@ltx/gr_gr_cog/bible:Acts.text
ltx/gr_gr_cog/le.ep.mc.d099:lemcLI.Epistle.chapverse	11:19 – 30
ltx/gr_gr_cog/le.ep.mc.d099:lemcLI.Epistle.incipit	Διασπαρέντες οἱ ἀπόστολοι…
ltx/gr_gr_cog/le.ep.mc.d099:lemcLI.Epistle.text	Ἐν ταῖς ἡμέραις ἐκείναις, διασπαρέντες οἱ ἀπόστολοι ἀπὸ τῆς θλίψεως τῆς γενομένης ἐπὶ Στεφάνῳ διῆλθον ἕως Φοινίκης καὶ Κύπρου καὶ Ἀντιοχείας, μηδενὶ λαλοῦντες τὸν λόγον εἰ μὴ μόνον Ἰουδαίοις. Ἦσαν δέ τινες ἐξ αὐτῶν ἄνδρες Κύπριοι καὶ Κυρηναῖοι, οἵτινες εἰσελθόντες εἰς Ἀντιόχειαν ἐλάλουν πρὸς τοὺς Ἑλληνιστάς, εὐαγγελιζόμενοι τὸν Κύριον Ἰησοῦν. καὶ ἦν χεὶρ Κυρίου μετ᾿ αὐτῶν, πολύς τε ἀριθμὸς πιστεύσας ἐπέστρεψεν ἐπὶ τὸν Κύριον. Ἠκούσθη δὲ ὁ λόγος εἰς τὰ ὦτα τῆς ἐκκλησίας τῆς ἐν Ἱεροσολύμοις περὶ αὐτῶν, καὶ ἐξαπέστειλαν Βαρνάβαν διελθεῖν ἕως Ἀντιοχείας· ὃς παραγενόμενος καὶ ἰδὼν τὴν χάριν τοῦ Θεοῦ ἐχάρη, καὶ παρεκάλει πάντας τῇ προθέσει τῆς καρδίας προσμένειν τῷ Κυρίῳ, ὅτι ἦν ἀνὴρ ἀγαθὸς καὶ πλήρης Πνεύματος Ἁγίου καὶ πίστεως· καὶ προσετέθη ὄχλος ἱκανὸς τῷ Κυρίῳ. ἐξῆλθε δὲ εἰς Ταρσὸν ὁ Βαρνάβας ἀναζητῆσαι Σαῦλον, καὶ εὑρὼν αὐτὸν ἤγαγεν αὐτὸν εἰς Ἀντιόχειαν. ἐγένετο δὲ αὐτοὺς ἐνιαυτὸν ὅλον συναχθῆναι ἐν τῇ ἐκκλησίᾳ καὶ διδάξαι ὄχλον ἱκανόν, χρηματίσαι τε πρῶτον ἐν Ἀντιοχείᾳ τοὺς μαθητὰς Χριστιανούς. Ἐν ταύταις δὲ ταῖς ἡμέραις κατῆλθον ἀπὸ Ἱεροσολύμων προφῆται εἰς Ἀντιόχειαν· ἀναστὰς δὲ εἷς ἐξ αὐτῶν ὀνόματι Ἄγαβος ἐσήμανε διὰ τοῦ Πνεύματος λιμὸν μέγαν μέλλειν ἔσεσθαι ἐφ᾿ ὅλην τὴν οἰκουμένην· ὅστις καὶ ἐγένετο ἐπὶ Κλαυδίου Καίσαρος. τῶν δὲ μαθητῶν καθὼς ηὐπορεῖτό τις, ὥρισαν ἕκαστος αὐτῶν εἰς διακονίαν πέμψαι τοῖς κατοικοῦσιν ἐν τῇ Ἰουδαίᾳ ἀδελφοῖς· ὃ καὶ ἐποίησαν ἀποστείλαντες πρὸς τοὺς πρεσβυτέρους διὰ χειρὸς Βαρνάβα καὶ Σαύλου.
ltx/gr_gr_cog/le.ep.mc.d099:lemcLI.Epistle.title	Κυριακῇ Πέμπτῃ, τῆς Σαμαρείτιδος
ltx/gr_gr_cog/le.ep.mc.d099:lemcLI.Epistle.title_abbr	Κυριακῇ τῆς Σαμαρείτιδος
ltx/gr_gr_cog/le.ep.mc.d099:lemcLI.Epistle.version	@ltx/gr_gr_cog/properties:version.designation
