ltx/gr_gr_cog/me.m10.d23:alt1.meMA.Kathisma11.greekmelody	@ltx/gr_gr_cog/he.a.m1:heAU.TonTafonSouSotir.greekname
ltx/gr_gr_cog/me.m10.d23:alt1.meMA.Kathisma11.incipit	Ἀπόστολε Χριστοῦ, καὶ αὐτόπτα καὶ…
ltx/gr_gr_cog/me.m10.d23:alt1.meMA.Kathisma11.melody	@ltx/gr_gr_cog/he.a.m1:heAU.TonTafonSouSotir.name
ltx/gr_gr_cog/me.m10.d23:alt1.meMA.Kathisma11.mode	@ltx/gr_gr_cog/miscellanea:misc.Mode1
ltx/gr_gr_cog/me.m10.d23:alt1.meMA.Kathisma11.text	Ἀπόστολε Χριστοῦ, καὶ αὐτόπτα καὶ Μάρτυς, Ἰάκωβε σοφέ, Ἀδελφόθεε μάκαρ, τοὺς πίστει ἑορτάζοντας, τὸ σεπτόν σου μνημόσυνον, ἐλευθέρωσον, τῶν συνεχόντων πταισμάτων, ταῖς πρεσβείαις σου, τοὺς οὐρανοὺς ἐμβατεύων, δυνάμει τοῦ Πνεύματος.
ltx/gr_gr_cog/me.m10.d23:alt1.meMA.Kathisma1T.greekmelody	@ltx/gr_gr_cog/he.a.m1:heAU.TonTafonSouSotir.greekname
ltx/gr_gr_cog/me.m10.d23:alt1.meMA.Kathisma1T.incipit	Μαρία, ἡ τὰς τρεῖς ἀνηκούστους…
ltx/gr_gr_cog/me.m10.d23:alt1.meMA.Kathisma1T.melody	@ltx/gr_gr_cog/he.a.m1:heAU.TonTafonSouSotir.name
ltx/gr_gr_cog/me.m10.d23:alt1.meMA.Kathisma1T.mode	@ltx/gr_gr_cog/miscellanea:misc.Mode1
ltx/gr_gr_cog/me.m10.d23:alt1.meMA.Kathisma1T.text	Μαρία, ἡ τὰς τρεῖς ἀνηκούστους ἑνώσεις, ἑνώσασα φρικτῶς, παρθενίαν καὶ τόκον, Θεόν τε καὶ ἄνθρωπον, πίστιν τε καὶ πιστεύουσαν, τοῖς ξενίζουσι τούτοις καρδίαν ἀνθρώπου, ἡμᾶς ἕνωσον τῇ τοῦ Υἱοῦ σου ἀγάπῃ, καὶ σῶσον, πανύμνητε.
ltx/gr_gr_cog/me.m10.d23:alt1.meMA.Kathisma21.greekmelody	@ltx/gr_gr_cog/he.a.m4:heAU.KateplagiIosif.greekname
ltx/gr_gr_cog/me.m10.d23:alt1.meMA.Kathisma21.incipit	Ἡ σεπτὴ ἐπιστολὴ σοῦ, ὦ…
ltx/gr_gr_cog/me.m10.d23:alt1.meMA.Kathisma21.melody	@ltx/gr_gr_cog/he.a.m4:heAU.KateplagiIosif.name
ltx/gr_gr_cog/me.m10.d23:alt1.meMA.Kathisma21.mode	@ltx/gr_gr_cog/miscellanea:misc.Mode4
ltx/gr_gr_cog/me.m10.d23:alt1.meMA.Kathisma21.text	Ἡ σεπτὴ ἐπιστολὴ σοῦ, ὦ Ἰάκωβε σοφέ, εὖ ποιεῖ διηνεκῶς τὴν Ἐκκλησίαν τοῦ Χριστοῦ, καὶ ἐκδιδάσκει τῇ πίστει σύμφωνα ἔχειν, ἔργα ἀγαθὰ πιστοὺς ἅπαντας, εὐθύμως καρτερεῖν ἐν ταῖς θλίψεσι, γλώττης κρατεῖν καὶ τὴν τοῦ κόσμου, φιλίαν ἔχθραν λογίζεσθαι, Θεοῦ, καὶ χρίειν τοὺς ἀσθενοῦντας, ἐν ἐλαίῳ ἁγίῳ.
ltx/gr_gr_cog/me.m10.d23:alt1.meMA.Kathisma2T.greekmelody	@ltx/gr_gr_cog/he.a.m4:heAU.KateplagiIosif.greekname
ltx/gr_gr_cog/me.m10.d23:alt1.meMA.Kathisma2T.incipit	Ἀπειρόγαμε ἁγνή, πῶς συλλαμβάνεις ἐν…
ltx/gr_gr_cog/me.m10.d23:alt1.meMA.Kathisma2T.melody	@ltx/gr_gr_cog/he.a.m4:heAU.KateplagiIosif.name
ltx/gr_gr_cog/me.m10.d23:alt1.meMA.Kathisma2T.mode	@ltx/gr_gr_cog/miscellanea:misc.Mode4
ltx/gr_gr_cog/me.m10.d23:alt1.meMA.Kathisma2T.text	Ἀπειρόγαμε ἁγνή, πῶς συλλαμβάνεις ἐν γαστρί, τὸν ἁπάντων τὴν πνοὴν περιλαβόντα ἐν χερσί; φράσον ἡμῖν τὸν λόγον τοῦ μυστηρίου σου. Πανάληθές ἐστι τοῦτο, ὦ ἄνθρωπε, καὶ παῦσαι ἐρευνῶν τὸ ἀκατάληπτον, ὕψος καὶ βάθος, μῆκος καὶ πλάτος, τῆς ἀποῤῥήτου λοχείας μου· νικᾷ γὰρ ὄντως ἔννοιαν πᾶσαν, ἀγγέλων καὶ τῶν ἀνθρώπων.
ltx/gr_gr_cog/me.m10.d23:alt1.meMA.Kathisma31.greekmelody	@ltx/gr_gr_cog/he.a.m3:heAU.TinOraiotita.greekname
ltx/gr_gr_cog/me.m10.d23:alt1.meMA.Kathisma31.incipit	Τοῦ θείου Πνεύματος τὴν ἐπιφοίτησιν…
ltx/gr_gr_cog/me.m10.d23:alt1.meMA.Kathisma31.melody	@ltx/gr_gr_cog/he.a.m3:heAU.TinOraiotita.name
ltx/gr_gr_cog/me.m10.d23:alt1.meMA.Kathisma31.mode	@ltx/gr_gr_cog/miscellanea:misc.Mode3
ltx/gr_gr_cog/me.m10.d23:alt1.meMA.Kathisma31.text	Τοῦ θείου Πνεύματος τὴν ἐπιφοίτησιν, μάκαρ, δεξάμενος τέμενος γέγονας, τῶν χαρισμάτων τῶν αὐτοῦ, καὶ μυστικῶς συνέγραψας, τύπον πλάτος ἔχοντα πανιέροις νοήμασι, καὶ σοφαῖς ἐν φράσεσι, θεοφόρε Ἰάκωβε, φρικτῆς ἱερουργίας καὶ τοῦτον, παρέδωκας τῇ Ἐκκλησίᾳ.
ltx/gr_gr_cog/me.m10.d23:alt1.meMA.Kathisma3T.greekmelody	@ltx/gr_gr_cog/he.a.m3:heAU.TinOraiotita.greekname
ltx/gr_gr_cog/me.m10.d23:alt1.meMA.Kathisma3T.incipit	Ἐν τῇ κοιμήσει σου, Παρθένε…
ltx/gr_gr_cog/me.m10.d23:alt1.meMA.Kathisma3T.melody	@ltx/gr_gr_cog/he.a.m3:heAU.TinOraiotita.name
ltx/gr_gr_cog/me.m10.d23:alt1.meMA.Kathisma3T.mode	@ltx/gr_gr_cog/miscellanea:misc.Mode3
ltx/gr_gr_cog/me.m10.d23:alt1.meMA.Kathisma3T.text	Ἐν τῇ κοιμήσει σου, Παρθένε ἄχραντε, καὶ ὁ Ἰάκωβος ὁ ἀδελφόθεος, μετὰ τῶν ἄλλων μαθητῶν παρῆν, ὡς θεασόμενος, τὸ ζωαρχικώτατον καὶ πανάχραντον σκῆνός σου, καὶ τὸ ἀνερμήνευτον ἀνυμνήσων μυστήριον, τῆς θείας καὶ φρικτῆς σου λοχείας, ὃ προσκυνοῦντας ἡμᾶς σῶσον.
ltx/gr_gr_cog/me.m10.d23:alt1.meMA.PostGospelBoth.incipit	@ltx/gr_gr_cog/ho.ho03:hoMA.PostGospelTheotokos.incipit
ltx/gr_gr_cog/me.m10.d23:alt1.meMA.PostGospelBoth.melody	
ltx/gr_gr_cog/me.m10.d23:alt1.meMA.PostGospelBoth.mode	@ltx/gr_gr_cog/miscellanea:misc.Mode2
ltx/gr_gr_cog/me.m10.d23:alt1.meMA.PostGospelBoth.text	@ltx/gr_gr_cog/ho.ho03:hoMA.PostGospelTheotokos.text
ltx/gr_gr_cog/me.m10.d23:alt1.meMA.PostGospelGlory.incipit	@ltx/gr_gr_cog/ho.ho03:hoMA.PostGospelApostle.incipit
ltx/gr_gr_cog/me.m10.d23:alt1.meMA.PostGospelGlory.melody	
ltx/gr_gr_cog/me.m10.d23:alt1.meMA.PostGospelGlory.mode	@ltx/gr_gr_cog/miscellanea:misc.Mode2
ltx/gr_gr_cog/me.m10.d23:alt1.meMA.PostGospelGlory.text	@ltx/gr_gr_cog/ho.ho03:hoMA.PostGospelApostle.text
ltx/gr_gr_cog/me.m10.d23:alt1.meMA.PostGospelIdiomelon.incipit	Παρεστηκὼς τῷ θρόνῳ τοῦ Δεσπότου…
ltx/gr_gr_cog/me.m10.d23:alt1.meMA.PostGospelIdiomelon.melody	
ltx/gr_gr_cog/me.m10.d23:alt1.meMA.PostGospelIdiomelon.mode	@ltx/gr_gr_cog/miscellanea:misc.Mode6
ltx/gr_gr_cog/me.m10.d23:alt1.meMA.PostGospelIdiomelon.text	Παρεστηκὼς τῷ θρόνῳ τοῦ Δεσπότου Χριστοῦ, καὶ παῤῥησίας τυγχάνων πρὸς αὐτὸν διὰ τὴν συγγενῆ οἰκειότητα, μὴ ἀποκάμῃς ἱκετεύειν ὑπὲρ ἡμῶν τὴν αὐτοῦ ἀγαθότητα, Ἰάκωβε θεάδελφε, τῶν δεσποσύνων ὁ πρώτιστος.
ltx/gr_gr_cog/me.m10.d23:alt1.meVE.Lity1.incipit	Πᾶσα δόσις ἀγαθὴ καὶ πᾶν…
ltx/gr_gr_cog/me.m10.d23:alt1.meVE.Lity1.melody	
ltx/gr_gr_cog/me.m10.d23:alt1.meVE.Lity1.mode	@ltx/gr_gr_cog/miscellanea:misc.Mode1
ltx/gr_gr_cog/me.m10.d23:alt1.meVE.Lity1.text	Πᾶσα δόσις ἀγαθὴ καὶ πᾶν δώρημα τέλειον, ἄνωθεν καταπέμπεται, ὡς ἔφης, θεόπτα Ἰάκωβε· ὅθεν ἐκ κοιλίας μητρός σε, ὁ Θεὸς Λόγος σαρκούμενος ἐξελέξατο, καὶ ἀδελφὸν ἑαυτοῦ προσήκατο, ὑπέρτιμόν σοι χάριν δωρησάμενος, ἧς οὐκ ἔστιν ὁ κόσμος ἀντάξιος. Διὸ παῤῥησίαν μεγίστην πρὸς Αὐτὸν εὑράμενος, ἐκτενῶς ἱκέτευε, ὑπὲρ τῶν ψυχῶν ἡμῶν.
ltx/gr_gr_cog/me.m10.d23:alt1.meVE.Lity2.incipit	Διαφερόντως ἠγαπήθης παρὰ τοῦ σοῦ…
ltx/gr_gr_cog/me.m10.d23:alt1.meVE.Lity2.melody	
ltx/gr_gr_cog/me.m10.d23:alt1.meVE.Lity2.mode	@ltx/gr_gr_cog/miscellanea:misc.Mode3
ltx/gr_gr_cog/me.m10.d23:alt1.meVE.Lity2.text	Διαφερόντως ἠγαπήθης παρὰ τοῦ σοῦ διδασκάλου Χριστοῦ τοῦ Θεοῦ, θεάδελφε Ἰάκωβε. Ὅθεν καὶ ὑπὲρ τοὺς λοιπούς σου ἀδελφοὺς καὶ συναποστόλους, τιμῆς ἐξαιρέτου παρ’ Αὐτοῦ κατηξίωσαι. Τοὺς μὲν γὰρ ἄλλους εἰς ἄλλας παροικίας ἀποστείλας τῆς οἰκουμένης, σὲ μόνον ἐν Ἱεροσολύμοις, ἐν τῇ πόλει τοῦ Μεγάλου βασιλέως, εἰς ἣν παρὰ τοῦ Πατρὸς αὐτὸς ἀπεστάλη, Ἀρχιποιμένα κατέστησε, καὶ τῆς ἰδίας ἀποστολῆς καὶ ἀδιαδόχου ἱεραρχίας, διάδοχον προεχειρίσατο ἄμεσον. Ὤ δόξης ἧς μετέσχες, Ἀπόστολε θεοδόξαστε, δι’ ἣν σὲ αἰνέσουσιν οἱ κατὰ σάρκα ἀδελφοί σου, καὶ κατὰ πνεῦμα συνάδελφοί σου Ἀπόστολοι, μεθ’ ὧν πρέσβευε σωθῆναι τὰς ψυχὰς ἡμῶν.
ltx/gr_gr_cog/me.m10.d23:alt1.meVE.LityGlory.incipit	Σήμερον ἐπέφανεν ἡμῖν ὡς εὐωδέστατον…
ltx/gr_gr_cog/me.m10.d23:alt1.meVE.LityGlory.melody	
ltx/gr_gr_cog/me.m10.d23:alt1.meVE.LityGlory.mode	@ltx/gr_gr_cog/miscellanea:misc.Mode4
ltx/gr_gr_cog/me.m10.d23:alt1.meVE.LityGlory.text	Σήμερον ἐπέφανεν ἡμῖν ὡς εὐωδέστατον μῆλον ἐν μετοπώρῳ, ἡ σεβασμία ἑορτὴ τοῦ Ἀποστόλου. Δεῦτε οὖν, φιλέορτοι, πνευματικῶς εὐφραινόμενοι, ἐν φωναῖς ἀλαλαγμοῦ αὐτὸν προσείπωμεν λέγοντες· Χαίροις, Ἰάκωβε ἔνδοξε, τῶν Ἀποστόλων τὸ εὖχος, Ἱεραρχῶν ἡ ἀκρότης, καὶ τῶν Δικαίων τὸ σεμνολόγημα· χαίροις, ὁ τοῦ πρὸ αἰώνων ἐκ Πατρὸς ἀῤῥεύστως γεννηθέντος, κατὰ σάρκα χρηματίσας ἀδελφὸς ἰδιαίτατος· χαίροις, ὁ τὸν σὸν διδάσκαλον Χριστόν, ὡς ἔννομος μαθητὴς μιμησάμενος. Ὡς γὰρ Ἐκεῖνος ὑπὲρ τῶν σταυρωτῶν, οὕτω καὶ σὺ ὑπὲρ τῶν φονευόντων σε παρεκάλεις. Αἴτησαι πρεσβείαις σου, δωρηθῆναι ἡμῖν τὸ μέγα ἔλεος.
ltx/gr_gr_cog/me.m10.d23:meDA.commemoration.first	Μνήμη τοῦ Ἁγίου Ἀποστόλου Ἰακώβου τοῦ Ἀδελφοθέου
ltx/gr_gr_cog/me.m10.d23:meDA.commemoration.first_name	Ἰάκωβος Ἀδελφόθεος
ltx/gr_gr_cog/me.m10.d23:meDA.commemoration.first_short	Μνήμη τοῦ Ἁγίου Ἀποστόλου Ἰακώβου τοῦ Ἀδελφοθέου
ltx/gr_gr_cog/me.m10.d23:meDA.commemoration.first_title	@ltx/gr_gr_cog/titles:ti.Apostle
ltx/gr_gr_cog/me.m10.d23:meDA.commemoration.full	Μνήμη τοῦ Ἁγίου Ἱερομάρτυρος καὶ Ἀποστόλου Ἰακώβου τοῦ Ἀδελφοθέου
ltx/gr_gr_cog/me.m10.d23:meDA.commemoration.second_name	
ltx/gr_gr_cog/me.m10.d23:meDA.commemoration.second_title	
ltx/gr_gr_cog/me.m10.d23:meDA.date	Τῌ ΚΓʹ ΟΚΤΩΒΡΙΟΥ
ltx/gr_gr_cog/me.m10.d23:meDA.fordate	διὰ τὴν 23ην Ὀκτωβρίου
ltx/gr_gr_cog/me.m10.d23:meDA.insert1	καὶ τοῦ ἁγίου Ἱερομάρτυρος καὶ Ἀποστόλου Ἰακώβου τοῦ Ἀδελφοθέου,
ltx/gr_gr_cog/me.m10.d23:meDA.insert2	οὗ καὶ τὴν μνήμην ἐπιτελοῦμεν·
ltx/gr_gr_cog/me.m10.d23:meDA.note	Ἡ συμπλήρωσις τῆς ἀκολουθίας ἐγένετο ὑπὸ τοῦ ὁσίου Νικοδήμου τοῦ Ἁγιορείτου, ἐξεδόθη δὲ αὕτη ὑπὸ τοῦ μακαριστοῦ Μητροπολίτου Μηθύμνης Ἰακώβου ἐν ἀθήναις τῷ 1972. Ἐξ αὐτῆς παρατίθενται τὰ ἀπολύτως ἀναγκαῖα στοιχεῖα. (Σύστημα Τυπικοῦ, σελ. 186)
ltx/gr_gr_cog/me.m10.d23:meDA.pdfcoverdate	τῆς 23ης Ὀκτωβρίου,
ltx/gr_gr_cog/me.m10.d23:meDA.pdfheaderdate	τῆς 23ης Ὀκτωβρίου
ltx/gr_gr_cog/me.m10.d23:meHO.commemorations	
ltx/gr_gr_cog/me.m10.d23:meHO.note1	
ltx/gr_gr_cog/me.m10.d23:meHO.note2	
ltx/gr_gr_cog/me.m10.d23:meHO.number	
ltx/gr_gr_cog/me.m10.d23:meHO.rank	
ltx/gr_gr_cog/me.m10.d23:meLE.commemoration1	Μνήμη τοῦ Ἁγίου Ἱερομάρτυρος καὶ Ἀποστόλου Ἰακώβου τοῦ Ἀδελφοθέου.
ltx/gr_gr_cog/me.m10.d23:meLE.commemoration2	
ltx/gr_gr_cog/me.m10.d23:meLI.Kontakion1.greekmelody	@ltx/gr_gr_cog/me.m10.d23:meMA.Kontakion1.greekmelody
ltx/gr_gr_cog/me.m10.d23:meLI.Kontakion1.incipit	@ltx/gr_gr_cog/me.m10.d23:meMA.Kontakion1.incipit
ltx/gr_gr_cog/me.m10.d23:meLI.Kontakion1.melody	@ltx/gr_gr_cog/me.m10.d23:meMA.Kontakion1.melody
ltx/gr_gr_cog/me.m10.d23:meLI.Kontakion1.mode	@ltx/gr_gr_cog/me.m10.d23:meMA.Kontakion1.mode
ltx/gr_gr_cog/me.m10.d23:meLI.Kontakion1.text	@ltx/gr_gr_cog/me.m10.d23:meMA.Kontakion1.text
ltx/gr_gr_cog/me.m10.d23:meLI.MM.CommunionHymn.text	@ltx/gr_gr_cog/properties:media.key
ltx/gr_gr_cog/me.m10.d23:meLI.Megalynarion.text	Κλήσει ἀδελφόθεος πεφηνώς, Ἰάκωβε μάκαρ, τῶν ἀρρήτων μυσταγωγός, ἐν Σιών ἐδείχθης, καὶ πάθει σου τιμίῳ, τὸ ζωηφόρον πάθος Χριστοῦ ἐδόξασας.
ltx/gr_gr_cog/me.m10.d23:meMA.C1.poet	@ltx/gr_gr_cog/poets:po.Theofanous
ltx/gr_gr_cog/me.m10.d23:meMA.C1.title	@ltx/gr_gr_cog/titles:ti.CanonApostle
ltx/gr_gr_cog/me.m10.d23:meMA.C1.verse	@ltx/gr_gr_cog/prayers:pr.verse_Apostle.text
ltx/gr_gr_cog/me.m10.d23:meMA.ExapTheotokion.incipit	Ἡ φοβερὰ τῆς κρίσεως, καὶ…
ltx/gr_gr_cog/me.m10.d23:meMA.ExapTheotokion.melody	@ltx/gr_gr_cog/he.a.m2:heAU.ToisMathitaisSynelthomen.name
ltx/gr_gr_cog/me.m10.d23:meMA.ExapTheotokion.mode	@ltx/gr_gr_cog/miscellanea:misc.Mode2
ltx/gr_gr_cog/me.m10.d23:meMA.ExapTheotokion.text	Ἡ φοβερὰ τῆς κρίσεως, καὶ μεγάλη ἡμέρα, νῦν ἐπὶ θύραις ἕστηκεν· ὅρα πρόσεχε νῆφε, ψυχή μου καὶ ἐκ καρδίας, πρόσπεσον τῇ Παρθένῳ, καὶ μόνῃ Θεομήτορι, δάκρυσιν ἐκβοῶσα· Πάσης Ἁγνή, τιμωρίας ῥῦσαί με δυσωπῶ σε, καὶ δεξιοῖς προβάτοις με, σύνταξον τοῦ Υἱοῦ σου.
ltx/gr_gr_cog/me.m10.d23:meMA.Exaposteilarion1.greekmelody	@ltx/gr_gr_cog/he.a.m2:heAU.ToisMathitaisSynelthomen.greekname
ltx/gr_gr_cog/me.m10.d23:meMA.Exaposteilarion1.incipit	Ὡς Ἱεράρχης πρώτιστος, τῆς καινῆς…
ltx/gr_gr_cog/me.m10.d23:meMA.Exaposteilarion1.melody	@ltx/gr_gr_cog/he.a.m2:heAU.ToisMathitaisSynelthomen.name
ltx/gr_gr_cog/me.m10.d23:meMA.Exaposteilarion1.mode	@ltx/gr_gr_cog/miscellanea:misc.Mode2
ltx/gr_gr_cog/me.m10.d23:meMA.Exaposteilarion1.text	Ὡς Ἱεράρχης πρώτιστος, τῆς καινῆς Διαθήκης, ὡς μέγιστος Ἀπόστολος, ὡς σοφὸς Ὑποφήτης, καὶ Μάρτυς ὢν ἀληθείας, παρὰ πάντας πλουτήσας, ἐξαίρετον ἀξίωμα, ἀδελφός τοῦ Κυρίου, νῦν πρὸς αὐτόν, λίθοις ἀναιρούμενος μετετέθης, παρʼ οὗ ἡμῖν Ἰάκωβε, λύσιν αἴτει πταισμάτων.
ltx/gr_gr_cog/me.m10.d23:meMA.Kontakion1.greekmelody	@ltx/gr_gr_cog/he.a.m4:heAU.OYpsotheisEnToStavro.greekname
ltx/gr_gr_cog/me.m10.d23:meMA.Kontakion1.incipit	Ὁ του Πατρὸς μονογενὴς Θεὸς…
ltx/gr_gr_cog/me.m10.d23:meMA.Kontakion1.melody	@ltx/gr_gr_cog/he.a.m4:heAU.OYpsotheisEnToStavro.name
ltx/gr_gr_cog/me.m10.d23:meMA.Kontakion1.mode	@ltx/gr_gr_cog/miscellanea:misc.Mode4
ltx/gr_gr_cog/me.m10.d23:meMA.Kontakion1.text	Ὁ του Πατρὸς μονογενὴς Θεὸς Λόγος, ἐπιδημήσας πρὸς ἡμᾶς ἐπʼ ἐσχάτων, τῶν ἡμερῶν Ἰάκωβε θεσπέσιε, πρῶτόν σε ἀνέδειξε τῶν Ἱεροσολύμων, Ποιμένα καὶ Διδάσκαλον, καὶ πιστὸν οἰκονόμον, τῶν Μυστηρίων τῶν πνευματικῶν· ὄθεν σε πάντες τιμῶμεν Ἀπόστολε.
ltx/gr_gr_cog/me.m10.d23:meMA.Lauds1.greekmelody	@ltx/gr_gr_cog/he.a.m1:heAU.TonOuranionTagmaton.greekname
ltx/gr_gr_cog/me.m10.d23:meMA.Lauds1.incipit	Τῶν εὐσεβούντων τὰ πλήθη, νῦν…
ltx/gr_gr_cog/me.m10.d23:meMA.Lauds1.melody	@ltx/gr_gr_cog/he.a.m1:heAU.TonOuranionTagmaton.name
ltx/gr_gr_cog/me.m10.d23:meMA.Lauds1.mode	@ltx/gr_gr_cog/miscellanea:misc.Mode1
ltx/gr_gr_cog/me.m10.d23:meMA.Lauds1.text	Τῶν εὐσεβούντων τὰ πλήθη, νῦν ἱερὰν ἑορτήν, χαρμονικῶς τελοῦντες, ἀλαλάξωμεν πάντες, πιστῶς ἀνευφημοῦντες, ψαλμοῖς καὶ ᾠδαῖς, τὸν θεάδελφον σήμερον, καὶ μαθητὴν τοῦ Κυρίου, ὅστις ἀεί, ἱκετεύει τοῦ σωθῆναι ἡμᾶς.
ltx/gr_gr_cog/me.m10.d23:meMA.Lauds2.incipit	Τῆς κατὰ σάρκα Κυρίου, ἐπιδημίας…
ltx/gr_gr_cog/me.m10.d23:meMA.Lauds2.melody	@ltx/gr_gr_cog/he.a.m1:heAU.TonOuranionTagmaton.name
ltx/gr_gr_cog/me.m10.d23:meMA.Lauds2.mode	@ltx/gr_gr_cog/miscellanea:misc.Mode1
ltx/gr_gr_cog/me.m10.d23:meMA.Lauds2.text	Τῆς κατὰ σάρκα Κυρίου, ἐπιδημίας Σοφέ, ἀδελφὸς ἀνεδείχθης, μαθητὴς καὶ αὐτόπτης, τῶν θείων μυστηρίων, φυγὰς σὺν αὐτῷ, ἐν Αἰγύπτῳ γενόμενος, σὺν Ἰωσὴφ τῇ Μητρί τε τοῦ Ἰησοῦ, μεθʼ ὧν πρέσβευε σωθῆναι ἡμᾶς.
ltx/gr_gr_cog/me.m10.d23:meMA.Lauds3.incipit	Τῶν Ἀποστόλων ὁ δῆμος, σὲ…
ltx/gr_gr_cog/me.m10.d23:meMA.Lauds3.melody	@ltx/gr_gr_cog/he.a.m1:heAU.TonOuranionTagmaton.name
ltx/gr_gr_cog/me.m10.d23:meMA.Lauds3.mode	@ltx/gr_gr_cog/miscellanea:misc.Mode1
ltx/gr_gr_cog/me.m10.d23:meMA.Lauds3.text	Τῶν Ἀποστόλων ὁ δῆμος, σὲ ἐξελέξατο, ἱερατεύειν πρῶτον, ἐν Σιὼν τῇ ἁγίᾳ, Χριστῷ τῷ εὐεργέτῃ, ὡς ὄντα αὐτοῦ, τῆς κατὰ σάρκα γεννήσεως, καὶ ἀδελφὸν συνοδίτην καὶ ὀπαδόν, τῶν ἰχνῶν αὐτοῦ, Ἰάκωβε.
ltx/gr_gr_cog/me.m10.d23:meMA.LaudsGlory.incipit	Ἐν τῇ πυρίνῃ αἴγλῃ τοῦ…
ltx/gr_gr_cog/me.m10.d23:meMA.LaudsGlory.melody	
ltx/gr_gr_cog/me.m10.d23:meMA.LaudsGlory.mode	@ltx/gr_gr_cog/miscellanea:misc.Mode1
ltx/gr_gr_cog/me.m10.d23:meMA.LaudsGlory.poet	@ltx/gr_gr_cog/poets:po.Vyzantiou
ltx/gr_gr_cog/me.m10.d23:meMA.LaudsGlory.text	Ἐν τῇ πυρίνῃ αἴγλῃ τοῦ θείου Πνεύματος φωτισθείς, τῆς εὐσεβείας ὤφθης θεῖος ζηλωτής, Ἀδελφόθεε Ἰάκωβε· ὅθεν καὶ στολήν σε νομικῆς ἱερωσύνης, ὡς Ἀαρὼν τοῦ πάλαι, τιμιωτέραν ἐνέδυσεν ὁ διʼ οἶκτον εἰς ἀδελφότητα δεξάμενος· Αὐτὸν ἱκέτευε, Ἀποστόλων Ἔνδοξε, τοῦ σωθῆναι τὰς ψυχὰς ἡμῶν.
ltx/gr_gr_cog/me.m10.d23:meMA.LaudsTheotokion.incipit	@ltx/gr_gr_cog/oc.m1.d3:ocVE.AposTheotokion.incipit
ltx/gr_gr_cog/me.m10.d23:meMA.LaudsTheotokion.melody	
ltx/gr_gr_cog/me.m10.d23:meMA.LaudsTheotokion.mode	@ltx/gr_gr_cog/miscellanea:misc.Mode1
ltx/gr_gr_cog/me.m10.d23:meMA.LaudsTheotokion.text	@ltx/gr_gr_cog/oc.m1.d3:ocVE.AposTheotokion.text
ltx/gr_gr_cog/me.m10.d23:meMA.MM.Lauds1123as5678.text	@ltx/gr_gr_cog/properties:media.key
ltx/gr_gr_cog/me.m10.d23:meMA.Ode1C11.greekmelody	@ltx/gr_gr_cog/he.h.m4:heHE.ThalassisToErythraion.greekname
ltx/gr_gr_cog/me.m10.d23:meMA.Ode1C11.incipit	Τὴν δόσιν, τὴν ἀγαθὴν Ἰάκωβε…
ltx/gr_gr_cog/me.m10.d23:meMA.Ode1C11.melody	@ltx/gr_gr_cog/he.h.m4:heHE.ThalassisToErythraion.name
ltx/gr_gr_cog/me.m10.d23:meMA.Ode1C11.mode	@ltx/gr_gr_cog/miscellanea:misc.Mode4
ltx/gr_gr_cog/me.m10.d23:meMA.Ode1C11.ode	@ltx/gr_gr_cog/miscellanea:misc.Ode1
ltx/gr_gr_cog/me.m10.d23:meMA.Ode1C11.text	Τὴν δόσιν, τὴν ἀγαθὴν Ἰάκωβε, καὶ δῶρον τέλειον, ἐκ τοῦ Πατρὸς τῶν φώτων τοῖς βροτοῖς, χορηγεῖσθαι διδάσκεις σαφῶς, ἧς μετασχεῖν Ἀπόστολε, τοὺς σὲ ὑμνοῦντας καθικέτευε.
ltx/gr_gr_cog/me.m10.d23:meMA.Ode1C12.incipit	Τῇ αἴγλῃ, σὺ φωτισθεὶς Ἰάκωβε…
ltx/gr_gr_cog/me.m10.d23:meMA.Ode1C12.melody	@ltx/gr_gr_cog/he.h.m4:heHE.ThalassisToErythraion.name
ltx/gr_gr_cog/me.m10.d23:meMA.Ode1C12.mode	@ltx/gr_gr_cog/miscellanea:misc.Mode4
ltx/gr_gr_cog/me.m10.d23:meMA.Ode1C12.ode	@ltx/gr_gr_cog/miscellanea:misc.Ode1
ltx/gr_gr_cog/me.m10.d23:meMA.Ode1C12.text	Τῇ αἴγλῃ, σὺ φωτισθεὶς Ἰάκωβε, τοῦ θείου Πνεύματος, καὶ σὺν αὐτῷ τοὺς νόμους ἐκτιθείς, Ἐκκλησίας ῥυθμίζεις ἐθνῶν, ὡς τοῦ Χριστοῦ Ἀπόστολος, ἱεροφάντορ παμμακάριστε.
ltx/gr_gr_cog/me.m10.d23:meMA.Ode1C13.incipit	Χορείαν, τῶν Ἀποστόλων πάνσοφε, σαφῶς…
ltx/gr_gr_cog/me.m10.d23:meMA.Ode1C13.melody	@ltx/gr_gr_cog/he.h.m4:heHE.ThalassisToErythraion.name
ltx/gr_gr_cog/me.m10.d23:meMA.Ode1C13.mode	@ltx/gr_gr_cog/miscellanea:misc.Mode4
ltx/gr_gr_cog/me.m10.d23:meMA.Ode1C13.ode	@ltx/gr_gr_cog/miscellanea:misc.Ode1
ltx/gr_gr_cog/me.m10.d23:meMA.Ode1C13.text	Χορείαν, τῶν Ἀποστόλων πάνσοφε, σαφῶς ἐκόσμησας, Ἀρχιερεὺς ὡς πρῶτος γεγονώς, αὐτουργίᾳ τοῦ Λόγου χρισθείς, ὡς μαθητὴς θεάδελφος, ἱεροκήρυξ μυστικώτατος.
ltx/gr_gr_cog/me.m10.d23:meMA.Ode1C1T.incipit	Πηγήν σε, τῶν ἰαμάτων ἔχοντες…
ltx/gr_gr_cog/me.m10.d23:meMA.Ode1C1T.melody	@ltx/gr_gr_cog/he.h.m4:heHE.ThalassisToErythraion.name
ltx/gr_gr_cog/me.m10.d23:meMA.Ode1C1T.mode	@ltx/gr_gr_cog/miscellanea:misc.Mode4
ltx/gr_gr_cog/me.m10.d23:meMA.Ode1C1T.ode	@ltx/gr_gr_cog/miscellanea:misc.Ode1
ltx/gr_gr_cog/me.m10.d23:meMA.Ode1C1T.text	Πηγήν σε, τῶν ἰαμάτων ἔχοντες, ἀπαρυόμεθα, ὡς τὴν πηγὴν τεκοῦσαν τῆς ζωῆς, Θεοτόκε πανύμνητε, καὶ τῶν ψυχῶν τὴν ἴασιν, καὶ τῶν σωμάτων τὴν ἀνάκτησιν.
ltx/gr_gr_cog/me.m10.d23:meMA.Ode3C11.greekmelody	@ltx/gr_gr_cog/he.h.m4:heHE.EffrainetaiEpiSoi.greekname
ltx/gr_gr_cog/me.m10.d23:meMA.Ode3C11.incipit	Εὐφραίνεται ἡ φυλή, ἡ τοῦ…
ltx/gr_gr_cog/me.m10.d23:meMA.Ode3C11.melody	@ltx/gr_gr_cog/he.h.m4:heHE.EffrainetaiEpiSoi.name
ltx/gr_gr_cog/me.m10.d23:meMA.Ode3C11.mode	@ltx/gr_gr_cog/miscellanea:misc.Mode4
ltx/gr_gr_cog/me.m10.d23:meMA.Ode3C11.ode	@ltx/gr_gr_cog/miscellanea:misc.Ode3
ltx/gr_gr_cog/me.m10.d23:meMA.Ode3C11.text	Εὐφραίνεται ἡ φυλή, ἡ τοῦ Ἰούδα ἐπὶ σοὶ σήμερον, ταῖς τοῦ Χριστοῦ βλέπουσα, σὲ μαρμαρυγαῖς ἀπαστράπτοντα.
ltx/gr_gr_cog/me.m10.d23:meMA.Ode3C12.incipit	Ἀστέρα θεολαμπῆ, σὲ ἡ Ἐκκλησία…
ltx/gr_gr_cog/me.m10.d23:meMA.Ode3C12.melody	@ltx/gr_gr_cog/he.h.m4:heHE.EffrainetaiEpiSoi.name
ltx/gr_gr_cog/me.m10.d23:meMA.Ode3C12.mode	@ltx/gr_gr_cog/miscellanea:misc.Mode4
ltx/gr_gr_cog/me.m10.d23:meMA.Ode3C12.ode	@ltx/gr_gr_cog/miscellanea:misc.Ode3
ltx/gr_gr_cog/me.m10.d23:meMA.Ode3C12.text	Ἀστέρα θεολαμπῆ, σὲ ἡ Ἐκκλησία τῶν ἐθνῶν ἔχουσα, τὸν εὐκλεῆ κήρυκα, θείαις δᾳδουχίαις λαμπρύνεται.
ltx/gr_gr_cog/me.m10.d23:meMA.Ode3C13.incipit	Τὸν νόμον τὸν τῆς ζωῆς…
ltx/gr_gr_cog/me.m10.d23:meMA.Ode3C13.melody	@ltx/gr_gr_cog/he.h.m4:heHE.EffrainetaiEpiSoi.name
ltx/gr_gr_cog/me.m10.d23:meMA.Ode3C13.mode	@ltx/gr_gr_cog/miscellanea:misc.Mode4
ltx/gr_gr_cog/me.m10.d23:meMA.Ode3C13.ode	@ltx/gr_gr_cog/miscellanea:misc.Ode3
ltx/gr_gr_cog/me.m10.d23:meMA.Ode3C13.text	Τὸν νόμον τὸν τῆς ζωῆς, τῇ Ἐκκλησίᾳ τοῦ Χριστοῦ τέθεικας, ζωοποιῷ Πνεύματι, σὺ νομοθετῶν καὶ φθεγγόμενος.
ltx/gr_gr_cog/me.m10.d23:meMA.Ode3C1T.incipit	Ὃν ἔτεκες ἐν σαρκί, Παρθενομῆτορ…
ltx/gr_gr_cog/me.m10.d23:meMA.Ode3C1T.melody	@ltx/gr_gr_cog/he.h.m4:heHE.EffrainetaiEpiSoi.name
ltx/gr_gr_cog/me.m10.d23:meMA.Ode3C1T.mode	@ltx/gr_gr_cog/miscellanea:misc.Mode4
ltx/gr_gr_cog/me.m10.d23:meMA.Ode3C1T.ode	@ltx/gr_gr_cog/miscellanea:misc.Ode3
ltx/gr_gr_cog/me.m10.d23:meMA.Ode3C1T.text	Ὃν ἔτεκες ἐν σαρκί, Παρθενομῆτορ ἐκ Πατρὸς λάμψαντα, τοῦτον Ἁγνή, Ἰάκωβος, ὡς Θεὸν τῶν ὅλων ἐκήρυττε.
ltx/gr_gr_cog/me.m10.d23:meMA.Ode3H.greekmelody	@ltx/gr_gr_cog/he.h.m4:heHE.EffrainetaiEpiSoi.greekname
ltx/gr_gr_cog/me.m10.d23:meMA.Ode3H.incipit	@ltx/gr_gr_cog/he.h.m4:heHE.EffrainetaiEpiSoi.incipit
ltx/gr_gr_cog/me.m10.d23:meMA.Ode3H.melody	@ltx/gr_gr_cog/he.h.m4:heHE.EffrainetaiEpiSoi.melody
ltx/gr_gr_cog/me.m10.d23:meMA.Ode3H.mode	@ltx/gr_gr_cog/miscellanea:misc.Mode4
ltx/gr_gr_cog/me.m10.d23:meMA.Ode3H.ode	@ltx/gr_gr_cog/miscellanea:misc.Ode3
ltx/gr_gr_cog/me.m10.d23:meMA.Ode3H.text	@ltx/gr_gr_cog/he.h.m4:heHE.EffrainetaiEpiSoi.text
ltx/gr_gr_cog/me.m10.d23:meMA.Ode3Kathisma1.greekmelody	@ltx/gr_gr_cog/he.a.m1:heAU.TonTafonSouSotir.greekname
ltx/gr_gr_cog/me.m10.d23:meMA.Ode3Kathisma1.incipit	Ἀπόστολε Χριστοῦ, καὶ αὐτόπτα καὶ…
ltx/gr_gr_cog/me.m10.d23:meMA.Ode3Kathisma1.melody	@ltx/gr_gr_cog/he.a.m1:heAU.TonTafonSouSotir.name
ltx/gr_gr_cog/me.m10.d23:meMA.Ode3Kathisma1.mode	@ltx/gr_gr_cog/miscellanea:misc.Mode1
ltx/gr_gr_cog/me.m10.d23:meMA.Ode3Kathisma1.text	Ἀπόστολε Χριστοῦ, καὶ αὐτόπτα καὶ Μάρτυς, Ἰάκωβε σοφέ, Ἀδελφόθεε μάκαρ, τοὺς πίστει ἑορτάζοντας, τὸ σεπτόν σου μνημόσυνον, ἐλευθέρωσον, τῶν συνεχόντων πταισμάτων, ταῖς πρεσβείαις σου, τοὺς οὐρανοὺς ἐμβατεύων, δυνάμει τοῦ Πνεύματος.
ltx/gr_gr_cog/me.m10.d23:meMA.Ode3Kathisma2.greekmelody	@ltx/gr_gr_cog/he.a.m8:heAU.TinSofianKaiLogon.greekname
ltx/gr_gr_cog/me.m10.d23:meMA.Ode3Kathisma2.incipit	Συγγενὴς κατὰ σάρκα τοῦ Ἰησοῦ…
ltx/gr_gr_cog/me.m10.d23:meMA.Ode3Kathisma2.melody	@ltx/gr_gr_cog/he.a.m8:heAU.TinSofianKaiLogon.name
ltx/gr_gr_cog/me.m10.d23:meMA.Ode3Kathisma2.mode	@ltx/gr_gr_cog/miscellanea:misc.Mode1
ltx/gr_gr_cog/me.m10.d23:meMA.Ode3Kathisma2.text	Συγγενὴς κατὰ σάρκα τοῦ Ἰησοῦ, χρηματίσας πρὸς τούτου χάριν πολλήν, Ἀπόστολε εἴληφας, καὶ τοῖς πᾶσι μετέδωκας, φωτισμοῦ καὶ γνώσεως, πανσόφου, Ἰάκωβε, καὶ εἰδώλων πλάνην, ῥιζόθεν ἀνέσπασας· ὅθεν οἱ τοῦ σκότους, προϊστάμενοι πλάνοι, ἀδίκως σε κτείνουσι, τὸν Σωτῆρα κηρύττοντα· διὰ τοῦτο βοῶμέν σοι· Πρέσβευε Χριστῷ τῷ Θεῷ, τῶν πταισμάτων ἄφεσιν δωρήσασθαι, τοῖς ἑορτάζουσι πόθῳ, τὴν ἁγίαν μνήμην σου.
ltx/gr_gr_cog/me.m10.d23:meMA.Ode3KathismaT.incipit	@ltx/gr_gr_cog/me.m01.d17:meMA.Ode3KathismaT.incipit
ltx/gr_gr_cog/me.m10.d23:meMA.Ode3KathismaT.melody	@ltx/gr_gr_cog/he.a.m8:heAU.TinSofianKaiLogon.name
ltx/gr_gr_cog/me.m10.d23:meMA.Ode3KathismaT.mode	@ltx/gr_gr_cog/miscellanea:misc.Mode1
ltx/gr_gr_cog/me.m10.d23:meMA.Ode3KathismaT.text	@ltx/gr_gr_cog/me.m01.d17:meMA.Ode3KathismaT.text
ltx/gr_gr_cog/me.m10.d23:meMA.Ode4C11.greekmelody	@ltx/gr_gr_cog/he.h.m4:heHE.DiAgapisinOiktirmon.greekname
ltx/gr_gr_cog/me.m10.d23:meMA.Ode4C11.incipit	Ἐπεβίβασας εἰς θάλασσαν σοῦ τοὺς…
ltx/gr_gr_cog/me.m10.d23:meMA.Ode4C11.melody	@ltx/gr_gr_cog/he.h.m4:heHE.DiAgapisinOiktirmon.name
ltx/gr_gr_cog/me.m10.d23:meMA.Ode4C11.mode	@ltx/gr_gr_cog/miscellanea:misc.Mode4
ltx/gr_gr_cog/me.m10.d23:meMA.Ode4C11.ode	@ltx/gr_gr_cog/miscellanea:misc.Ode4
ltx/gr_gr_cog/me.m10.d23:meMA.Ode4C11.text	Ἐπεβίβασας εἰς θάλασσαν σοῦ τοὺς ἵππους, τοὺς Ἀποστόλους Σῶτερ, καὶ ἐφώτισαν τὰ ἔθνη, πρὸς τὴν σὴν ἐπίγνωσιν, ἑλκύσαντες Κύριε.
ltx/gr_gr_cog/me.m10.d23:meMA.Ode4C12.incipit	Ἀκηλίδωτον ὡς ἔσοπτρον δεδειγμένος, καὶ…
ltx/gr_gr_cog/me.m10.d23:meMA.Ode4C12.melody	@ltx/gr_gr_cog/he.h.m4:heHE.DiAgapisinOiktirmon.name
ltx/gr_gr_cog/me.m10.d23:meMA.Ode4C12.mode	@ltx/gr_gr_cog/miscellanea:misc.Mode4
ltx/gr_gr_cog/me.m10.d23:meMA.Ode4C12.ode	@ltx/gr_gr_cog/miscellanea:misc.Ode4
ltx/gr_gr_cog/me.m10.d23:meMA.Ode4C12.text	Ἀκηλίδωτον ὡς ἔσοπτρον δεδειγμένος, καὶ πρωτουργοὺς ἀκτῖνας, τῆς ἀκτίστου Τριάδος, ἀκριβῶς δεξάμενος, τοῖς πᾶσιν ἐξέλαμψας.
ltx/gr_gr_cog/me.m10.d23:meMA.Ode4C13.incipit	Κυλιόμενόν σε λίθον ἡ προφητεία…
ltx/gr_gr_cog/me.m10.d23:meMA.Ode4C13.melody	@ltx/gr_gr_cog/he.h.m4:heHE.DiAgapisinOiktirmon.name
ltx/gr_gr_cog/me.m10.d23:meMA.Ode4C13.mode	@ltx/gr_gr_cog/miscellanea:misc.Mode4
ltx/gr_gr_cog/me.m10.d23:meMA.Ode4C13.ode	@ltx/gr_gr_cog/miscellanea:misc.Ode4
ltx/gr_gr_cog/me.m10.d23:meMA.Ode4C13.text	Κυλιόμενόν σε λίθον ἡ προφητεία, ἡγιασμένον βλέπει, καὶ συντρίβοντα πλάνης, σαθρὰν ματαιότητα, ἰσχὺῒ τοῦ Πνεύματος.
ltx/gr_gr_cog/me.m10.d23:meMA.Ode4C1T.incipit	Ὑποδὺς Παρθενομῆτορ τὴν σὴν γαστέρα…
ltx/gr_gr_cog/me.m10.d23:meMA.Ode4C1T.melody	@ltx/gr_gr_cog/he.h.m4:heHE.DiAgapisinOiktirmon.name
ltx/gr_gr_cog/me.m10.d23:meMA.Ode4C1T.mode	@ltx/gr_gr_cog/miscellanea:misc.Mode4
ltx/gr_gr_cog/me.m10.d23:meMA.Ode4C1T.ode	@ltx/gr_gr_cog/miscellanea:misc.Ode4
ltx/gr_gr_cog/me.m10.d23:meMA.Ode4C1T.text	Ὑποδὺς Παρθενομῆτορ τὴν σὴν γαστέρα, ὁ πρὸ αἰώνων Λόγος, γεννηθεὶς ἀποῤῥήτως, ἐκ Πατρός, Ἰάκωβον, Ἀπόστολον δείκνυσι.
ltx/gr_gr_cog/me.m10.d23:meMA.Ode5C11.greekmelody	@ltx/gr_gr_cog/he.h.m4:heHE.SyKyrieMouFos.greekname
ltx/gr_gr_cog/me.m10.d23:meMA.Ode5C11.incipit	Σὺ Κύριε φωτός, ἀστραπὴν τὸν…
ltx/gr_gr_cog/me.m10.d23:meMA.Ode5C11.melody	@ltx/gr_gr_cog/he.h.m4:heHE.SyKyrieMouFos.name
ltx/gr_gr_cog/me.m10.d23:meMA.Ode5C11.mode	@ltx/gr_gr_cog/miscellanea:misc.Mode4
ltx/gr_gr_cog/me.m10.d23:meMA.Ode5C11.ode	@ltx/gr_gr_cog/miscellanea:misc.Ode5
ltx/gr_gr_cog/me.m10.d23:meMA.Ode5C11.text	Σὺ Κύριε φωτός, ἀστραπὴν τὸν Ἰάκωβον, ἀνέδειξας φρυκτωροῦσαν, καὶ βροτοὺς τῆς ἀγνοίας, καὶ πλάνης ἀπαλλάττουσαν.
ltx/gr_gr_cog/me.m10.d23:meMA.Ode5C12.incipit	Σὲ Κύριε φωνή, ἐλευθέρα ἐκήρυξεν…
ltx/gr_gr_cog/me.m10.d23:meMA.Ode5C12.melody	@ltx/gr_gr_cog/he.h.m4:heHE.SyKyrieMouFos.name
ltx/gr_gr_cog/me.m10.d23:meMA.Ode5C12.mode	@ltx/gr_gr_cog/miscellanea:misc.Mode4
ltx/gr_gr_cog/me.m10.d23:meMA.Ode5C12.ode	@ltx/gr_gr_cog/miscellanea:misc.Ode5
ltx/gr_gr_cog/me.m10.d23:meMA.Ode5C12.text	Σὲ Κύριε φωνή, ἐλευθέρα ἐκήρυξεν, ὁ δίκαιος ἀδελφός σου, μιμητής τε τοῦ πάθους, ἐγένετο κτεινόμενος.
ltx/gr_gr_cog/me.m10.d23:meMA.Ode5C13.incipit	Τίς βρότειός σοι νοῦς, ἐγκωμίων…
ltx/gr_gr_cog/me.m10.d23:meMA.Ode5C13.melody	@ltx/gr_gr_cog/he.h.m4:heHE.SyKyrieMouFos.name
ltx/gr_gr_cog/me.m10.d23:meMA.Ode5C13.mode	@ltx/gr_gr_cog/miscellanea:misc.Mode4
ltx/gr_gr_cog/me.m10.d23:meMA.Ode5C13.ode	@ltx/gr_gr_cog/miscellanea:misc.Ode5
ltx/gr_gr_cog/me.m10.d23:meMA.Ode5C13.text	Τίς βρότειός σοι νοῦς, ἐγκωμίων ἐφύμνιον, δυνήσεται προσκομίζειν, ἀρετῆς λαμπρυνθέντι, ταῖς χάρισιν Ἰάκωβε;
ltx/gr_gr_cog/me.m10.d23:meMA.Ode5C1T.incipit	Σὲ θεῖον ἀληθῶς, εὑρηκὼς ἐνδιαίτημα…
ltx/gr_gr_cog/me.m10.d23:meMA.Ode5C1T.melody	@ltx/gr_gr_cog/he.h.m4:heHE.SyKyrieMouFos.name
ltx/gr_gr_cog/me.m10.d23:meMA.Ode5C1T.mode	@ltx/gr_gr_cog/miscellanea:misc.Mode4
ltx/gr_gr_cog/me.m10.d23:meMA.Ode5C1T.ode	@ltx/gr_gr_cog/miscellanea:misc.Ode5
ltx/gr_gr_cog/me.m10.d23:meMA.Ode5C1T.text	Σὲ θεῖον ἀληθῶς, εὑρηκὼς ἐνδιαίτημα, κατῴκησεν ὦ Παρθένε, τὴν ἡμῶν σωτηρίαν, ὁ Λόγος προμηθούμενος.
ltx/gr_gr_cog/me.m10.d23:meMA.Ode6C11.greekmelody	@ltx/gr_gr_cog/he.h.m4:heHE.ThysoSoiMetaFonis.greekname
ltx/gr_gr_cog/me.m10.d23:meMA.Ode6C11.incipit	Στολήν σε, τῆς νομικῆς…
ltx/gr_gr_cog/me.m10.d23:meMA.Ode6C11.melody	@ltx/gr_gr_cog/he.h.m4:heHE.ThysoSoiMetaFonis.name
ltx/gr_gr_cog/me.m10.d23:meMA.Ode6C11.mode	@ltx/gr_gr_cog/miscellanea:misc.Mode4
ltx/gr_gr_cog/me.m10.d23:meMA.Ode6C11.ode	@ltx/gr_gr_cog/miscellanea:misc.Ode6
ltx/gr_gr_cog/me.m10.d23:meMA.Ode6C11.text	Στολήν σε, τῆς νομικῆς ἐνέδυσε κρείττονα, καὶ Ἱεράρχην δεικνύει, Ἀαρὼν τοῦ πάλαι τιμιωτέραν, ὁ διʼ οἶκτον, εἰς ἀδελφότητά σε δεξάμενος.
ltx/gr_gr_cog/me.m10.d23:meMA.Ode6C12.incipit	Ὄργανον, ἐνεργείαις…
ltx/gr_gr_cog/me.m10.d23:meMA.Ode6C12.melody	@ltx/gr_gr_cog/he.h.m4:heHE.ThysoSoiMetaFonis.name
ltx/gr_gr_cog/me.m10.d23:meMA.Ode6C12.mode	@ltx/gr_gr_cog/miscellanea:misc.Mode4
ltx/gr_gr_cog/me.m10.d23:meMA.Ode6C12.ode	@ltx/gr_gr_cog/miscellanea:misc.Ode6
ltx/gr_gr_cog/me.m10.d23:meMA.Ode6C12.text	Ὄργανον, ἐνεργείαις κρουόμενον Πνεύματος, πᾶσαν διάνοιαν θέλγον, καὶ Θεῷ προσάγον τοὺς σῳζομένους, ἐκ δουλείας, χαλεπωτάτης γέγονας ἄριστον.
ltx/gr_gr_cog/me.m10.d23:meMA.Ode6C13.incipit	Διψήσας, τοῦ τῆς ζωῆς…
ltx/gr_gr_cog/me.m10.d23:meMA.Ode6C13.melody	@ltx/gr_gr_cog/he.h.m4:heHE.ThysoSoiMetaFonis.name
ltx/gr_gr_cog/me.m10.d23:meMA.Ode6C13.mode	@ltx/gr_gr_cog/miscellanea:misc.Mode4
ltx/gr_gr_cog/me.m10.d23:meMA.Ode6C13.ode	@ltx/gr_gr_cog/miscellanea:misc.Ode6
ltx/gr_gr_cog/me.m10.d23:meMA.Ode6C13.text	Διψήσας, τοῦ τῆς ζωῆς ἐξέπιες νάματος, καὶ ποταμοὺς ἀναβλύζεις, θεοῤῥημοσύνης τῆς σῆς κοιλίας, ἁλλομένους, τῇ οἰκουμένῃ τῷ Θείῳ Πνεύματι.
ltx/gr_gr_cog/me.m10.d23:meMA.Ode6C1T.incipit	Εὔα μέν, παρακοῇ…
ltx/gr_gr_cog/me.m10.d23:meMA.Ode6C1T.melody	@ltx/gr_gr_cog/he.h.m4:heHE.ThysoSoiMetaFonis.name
ltx/gr_gr_cog/me.m10.d23:meMA.Ode6C1T.mode	@ltx/gr_gr_cog/miscellanea:misc.Mode4
ltx/gr_gr_cog/me.m10.d23:meMA.Ode6C1T.ode	@ltx/gr_gr_cog/miscellanea:misc.Ode6
ltx/gr_gr_cog/me.m10.d23:meMA.Ode6C1T.text	Εὔα μέν, παρακοῇ τὸν θάνατον ἔτεκεν· ἡ Θεοτόκος ζωὴν δέ, συλλαβοῦσα τέτοκε τὴν ἀγήρω, καὶ τὸ πάλαι, ὑπὲρ πάντων ἀπέτισεν ὄφλημα.
ltx/gr_gr_cog/me.m10.d23:meMA.Ode6H.greekmelody	@ltx/gr_gr_cog/he.h.m4:heHE.ThysoSoiMetaFonis.greekname
ltx/gr_gr_cog/me.m10.d23:meMA.Ode6H.incipit	@ltx/gr_gr_cog/he.h.m4:heHE.ThysoSoiMetaFonis.incipit
ltx/gr_gr_cog/me.m10.d23:meMA.Ode6H.melody	@ltx/gr_gr_cog/he.h.m4:heHE.ThysoSoiMetaFonis.melody
ltx/gr_gr_cog/me.m10.d23:meMA.Ode6H.mode	@ltx/gr_gr_cog/miscellanea:misc.Mode4
ltx/gr_gr_cog/me.m10.d23:meMA.Ode6H.ode	@ltx/gr_gr_cog/miscellanea:misc.Ode6
ltx/gr_gr_cog/me.m10.d23:meMA.Ode6H.text	@ltx/gr_gr_cog/he.h.m4:heHE.ThysoSoiMetaFonis.text
ltx/gr_gr_cog/me.m10.d23:meMA.Ode7C11.greekmelody	@ltx/gr_gr_cog/he.h.m4:heHE.EnTiKaminoAvramiaioi.greekname
ltx/gr_gr_cog/me.m10.d23:meMA.Ode7C11.incipit	Ὡς ἐν καμίνῳ τῷ ὑπερώῳ…
ltx/gr_gr_cog/me.m10.d23:meMA.Ode7C11.melody	@ltx/gr_gr_cog/he.h.m4:heHE.EnTiKaminoAvramiaioi.name
ltx/gr_gr_cog/me.m10.d23:meMA.Ode7C11.mode	@ltx/gr_gr_cog/miscellanea:misc.Mode4
ltx/gr_gr_cog/me.m10.d23:meMA.Ode7C11.ode	@ltx/gr_gr_cog/miscellanea:misc.Ode7
ltx/gr_gr_cog/me.m10.d23:meMA.Ode7C11.text	Ὡς ἐν καμίνῳ τῷ ὑπερώῳ πυρσευόμενος, Θείου παρουσίᾳ Πνεύματος μυστικῶς, ὁ Ἰάκωβος ἐβόησεν· Εὐλογημένος εἶ, ἐν τῷ ναῷ τῆς δόξης σου Κύριε.
ltx/gr_gr_cog/me.m10.d23:meMA.Ode7C12.incipit	Ἡ ἐκ τοῦ ὕψους, πνοὴ…
ltx/gr_gr_cog/me.m10.d23:meMA.Ode7C12.melody	@ltx/gr_gr_cog/he.h.m4:heHE.EnTiKaminoAvramiaioi.name
ltx/gr_gr_cog/me.m10.d23:meMA.Ode7C12.mode	@ltx/gr_gr_cog/miscellanea:misc.Mode4
ltx/gr_gr_cog/me.m10.d23:meMA.Ode7C12.ode	@ltx/gr_gr_cog/miscellanea:misc.Ode7
ltx/gr_gr_cog/me.m10.d23:meMA.Ode7C12.text	Ἡ ἐκ τοῦ ὕψους, πνοὴ βιαία τὸν Ἰάκωβον, γλώσσῃ πυριμόρφῳ φθέγγεσθαι τοῦ Θεοῦ, μεγαλεῖα παρεσκεύασεν· Εὐλογημένος εἶ, ἐν τῷ ναῷ τῆς δόξης σου Κύριε.
ltx/gr_gr_cog/me.m10.d23:meMA.Ode7C13.incipit	Τῆς θεωρίας, τῆς πρακτικῆς σὺ…
ltx/gr_gr_cog/me.m10.d23:meMA.Ode7C13.melody	@ltx/gr_gr_cog/he.h.m4:heHE.EnTiKaminoAvramiaioi.name
ltx/gr_gr_cog/me.m10.d23:meMA.Ode7C13.mode	@ltx/gr_gr_cog/miscellanea:misc.Mode4
ltx/gr_gr_cog/me.m10.d23:meMA.Ode7C13.ode	@ltx/gr_gr_cog/miscellanea:misc.Ode7
ltx/gr_gr_cog/me.m10.d23:meMA.Ode7C13.text	Τῆς θεωρίας, τῆς πρακτικῆς σὺ ἐκτιθέμενος, δέλτον ἐκ πυξίδος ὥσπερ πνευματικῆς, τοὺς ἀνθρώπους ἐβελτίωσας· Εὐλογημένος εἶ, ὁ Θεός μου κραυγάζων καὶ Κύριος.
ltx/gr_gr_cog/me.m10.d23:meMA.Ode7C1T.incipit	Ὁ ἀναπλάσας, κόσμον ἐν μήτρᾳ…
ltx/gr_gr_cog/me.m10.d23:meMA.Ode7C1T.melody	@ltx/gr_gr_cog/he.h.m4:heHE.EnTiKaminoAvramiaioi.name
ltx/gr_gr_cog/me.m10.d23:meMA.Ode7C1T.mode	@ltx/gr_gr_cog/miscellanea:misc.Mode4
ltx/gr_gr_cog/me.m10.d23:meMA.Ode7C1T.ode	@ltx/gr_gr_cog/miscellanea:misc.Ode7
ltx/gr_gr_cog/me.m10.d23:meMA.Ode7C1T.text	Ὁ ἀναπλάσας, κόσμον ἐν μήτρᾳ σου Θεόνυμφε, θείας λειτουργίας δείκνυσι τελεστήν, τὸν Ἰάκωβον κραυγάζοντα· Εὐλογημένη σύ, ἐν γυναιξὶν ὑπάρχεις πανάμωμε.
ltx/gr_gr_cog/me.m10.d23:meMA.Ode8C11.greekmelody	@ltx/gr_gr_cog/he.h.m4:heHE.CheirasEkpetasasDaniil.greekname
ltx/gr_gr_cog/me.m10.d23:meMA.Ode8C11.incipit	Χεῖρας ἐκπετάσας κραταιάς, τοὺς Ἀποστόλους…
ltx/gr_gr_cog/me.m10.d23:meMA.Ode8C11.melody	@ltx/gr_gr_cog/he.h.m4:heHE.CheirasEkpetasasDaniil.name
ltx/gr_gr_cog/me.m10.d23:meMA.Ode8C11.mode	@ltx/gr_gr_cog/miscellanea:misc.Mode4
ltx/gr_gr_cog/me.m10.d23:meMA.Ode8C11.ode	@ltx/gr_gr_cog/miscellanea:misc.Ode8
ltx/gr_gr_cog/me.m10.d23:meMA.Ode8C11.text	Χεῖρας ἐκπετάσας κραταιάς, τοὺς Ἀποστόλους σου Σῶτερ εὐλόγησας, ἐπανερχόμενος Δέσποτα, πρὸς τὸν ἄναρχον Πατέρα σου, καὶ παρεσκεύασας αὐτοὺς μέτʼ εὐφροσύνης βοᾶν· Εὐλογεῖτε, πάντα τὰ ἔργα Κυρίου τὸν Κύριον.
ltx/gr_gr_cog/me.m10.d23:meMA.Ode8C12.incipit	Ὥσπερ ἐπηγγείλω ἀψευδῶς, τοῖς, Ἀποστόλοις…
ltx/gr_gr_cog/me.m10.d23:meMA.Ode8C12.melody	@ltx/gr_gr_cog/he.h.m4:heHE.CheirasEkpetasasDaniil.name
ltx/gr_gr_cog/me.m10.d23:meMA.Ode8C12.mode	@ltx/gr_gr_cog/miscellanea:misc.Mode4
ltx/gr_gr_cog/me.m10.d23:meMA.Ode8C12.ode	@ltx/gr_gr_cog/miscellanea:misc.Ode8
ltx/gr_gr_cog/me.m10.d23:meMA.Ode8C12.text	Ὥσπερ ἐπηγγείλω ἀψευδῶς, τοῖς, Ἀποστόλοις σου Πνεῦμα ἀπέστειλας, τούτου, Ἰάκωβος Δέσποτα, τῇ λαμπρότητι λαμπόμενος, τὴν οἰκουμένην ἀστραπαῖς, καταγλαΐζει φαιδρῶς, καὶ κραυγάζει· Πάντα τὰ ἔργα ὑμνεῖτε τὸν Κύριον.
ltx/gr_gr_cog/me.m10.d23:meMA.Ode8C13.incipit	Σοφίαν Ἰάκωβε σοφέ, τὴν ἐνυπόστατον…
ltx/gr_gr_cog/me.m10.d23:meMA.Ode8C13.melody	@ltx/gr_gr_cog/he.h.m4:heHE.CheirasEkpetasasDaniil.name
ltx/gr_gr_cog/me.m10.d23:meMA.Ode8C13.mode	@ltx/gr_gr_cog/miscellanea:misc.Mode4
ltx/gr_gr_cog/me.m10.d23:meMA.Ode8C13.ode	@ltx/gr_gr_cog/miscellanea:misc.Ode8
ltx/gr_gr_cog/me.m10.d23:meMA.Ode8C13.text	Σοφίαν Ἰάκωβε σοφέ, τὴν ἐνυπόστατον ἔσχες διδάσκαλον, μυσταγωγοῦσάν σε ἄῤῥητα, καὶ ἀνέκφραστα μυστήρια, καὶ πρὸς εὐσέβειαν λαούς, μέλπων διήγειρας· Εὐλογεῖτε, πάντα τὰ ἔργα Κυρίου τὸν Κύριον.
ltx/gr_gr_cog/me.m10.d23:meMA.Ode8C1T.incipit	Ὄρος ἐκφανθεῖσαν νοητόν, Παρθένε ἄχραντε…
ltx/gr_gr_cog/me.m10.d23:meMA.Ode8C1T.melody	@ltx/gr_gr_cog/he.h.m4:heHE.CheirasEkpetasasDaniil.name
ltx/gr_gr_cog/me.m10.d23:meMA.Ode8C1T.mode	@ltx/gr_gr_cog/miscellanea:misc.Mode4
ltx/gr_gr_cog/me.m10.d23:meMA.Ode8C1T.ode	@ltx/gr_gr_cog/miscellanea:misc.Ode8
ltx/gr_gr_cog/me.m10.d23:meMA.Ode8C1T.text	Ὄρος ἐκφανθεῖσαν νοητόν, Παρθένε ἄχραντε, Προφήτης βλέπει σε· ἐκ σοῦ ὑπέρτιμος λίθος γάρ, ἐκτμηθεὶς περιεσώσατο, τὴν οἰκουμένην ἀληθῶς, ἐνθέως ψάλλουσαν· Εὐλογεῖτε, πάντα τὰ ἔργα Κυρίου τὸν Κύριον.
ltx/gr_gr_cog/me.m10.d23:meMA.Ode8H.greekmelody	@ltx/gr_gr_cog/he.h.m4:heHE.CheirasEkpetasasDaniil.greekname
ltx/gr_gr_cog/me.m10.d23:meMA.Ode8H.incipit	@ltx/gr_gr_cog/he.h.m4:heHE.CheirasEkpetasasDaniil.incipit
ltx/gr_gr_cog/me.m10.d23:meMA.Ode8H.melody	@ltx/gr_gr_cog/he.h.m4:heHE.CheirasEkpetasasDaniil.melody
ltx/gr_gr_cog/me.m10.d23:meMA.Ode8H.mode	@ltx/gr_gr_cog/miscellanea:misc.Mode4
ltx/gr_gr_cog/me.m10.d23:meMA.Ode8H.ode	@ltx/gr_gr_cog/miscellanea:misc.Ode8
ltx/gr_gr_cog/me.m10.d23:meMA.Ode8H.text	@ltx/gr_gr_cog/he.h.m4:heHE.CheirasEkpetasasDaniil.text
ltx/gr_gr_cog/me.m10.d23:meMA.Ode9C11.greekmelody	@ltx/gr_gr_cog/he.h.m4:heHE.LithosAcheirotmitos.greekname
ltx/gr_gr_cog/me.m10.d23:meMA.Ode9C11.incipit	Δεῦτε τὸν πρωτόθρονον πάντες, τῆς…
ltx/gr_gr_cog/me.m10.d23:meMA.Ode9C11.melody	@ltx/gr_gr_cog/he.h.m4:heHE.LithosAcheirotmitos.name
ltx/gr_gr_cog/me.m10.d23:meMA.Ode9C11.mode	@ltx/gr_gr_cog/miscellanea:misc.Mode4
ltx/gr_gr_cog/me.m10.d23:meMA.Ode9C11.ode	@ltx/gr_gr_cog/miscellanea:misc.Ode9
ltx/gr_gr_cog/me.m10.d23:meMA.Ode9C11.text	Δεῦτε τὸν πρωτόθρονον πάντες, τῆς Ἐκκλησίας τὸν φωστῆρα, ἱεροῖς Ἰάκωβον ὕμνοις, ὡς ἱεράρχην καὶ θεῖον κήρυκα, τὸν φερωνύμως Δίκαιον, ὀνομασθέντα μεγαλύνωμεν.
ltx/gr_gr_cog/me.m10.d23:meMA.Ode9C12.incipit	Θείας κοινωνὸν ὡς φανέντα, ἀτελευτήτου…
ltx/gr_gr_cog/me.m10.d23:meMA.Ode9C12.melody	@ltx/gr_gr_cog/he.h.m4:heHE.LithosAcheirotmitos.name
ltx/gr_gr_cog/me.m10.d23:meMA.Ode9C12.mode	@ltx/gr_gr_cog/miscellanea:misc.Mode4
ltx/gr_gr_cog/me.m10.d23:meMA.Ode9C12.ode	@ltx/gr_gr_cog/miscellanea:misc.Ode9
ltx/gr_gr_cog/me.m10.d23:meMA.Ode9C12.text	Θείας κοινωνὸν ὡς φανέντα, ἀτελευτήτου βασιλείας, καὶ Θεοῦ κληρωθέντα ἀδελφόν, καὶ πολιτείαν ἐπαληθεύουσαν, προσηγορίᾳ δείξαντα, σὲ μεγαλύνομεν Ἰάκωβε.
ltx/gr_gr_cog/me.m10.d23:meMA.Ode9C13.incipit	Θρόνῳ παριστάμενος Μάκαρ, στεφανηφόρος τῆς…
ltx/gr_gr_cog/me.m10.d23:meMA.Ode9C13.melody	@ltx/gr_gr_cog/he.h.m4:heHE.LithosAcheirotmitos.name
ltx/gr_gr_cog/me.m10.d23:meMA.Ode9C13.mode	@ltx/gr_gr_cog/miscellanea:misc.Mode4
ltx/gr_gr_cog/me.m10.d23:meMA.Ode9C13.ode	@ltx/gr_gr_cog/miscellanea:misc.Ode9
ltx/gr_gr_cog/me.m10.d23:meMA.Ode9C13.text	Θρόνῳ παριστάμενος Μάκαρ, στεφανηφόρος τῆς Τριάδος, πίστει τοὺς τιμῶντάς σε πόθῳ, τῶν ἀκηράτων κατατρυφῆσαι γερῶν, Ἀρχιερεῦ Ἰάκωβε, τὸν σὸν Δεσπότην καθικέτευε.
ltx/gr_gr_cog/me.m10.d23:meMA.Ode9C1T.incipit	Σὺ τὸν ἐκ Παρθένου τεχθέντα…
ltx/gr_gr_cog/me.m10.d23:meMA.Ode9C1T.melody	@ltx/gr_gr_cog/he.h.m4:heHE.LithosAcheirotmitos.name
ltx/gr_gr_cog/me.m10.d23:meMA.Ode9C1T.mode	@ltx/gr_gr_cog/miscellanea:misc.Mode4
ltx/gr_gr_cog/me.m10.d23:meMA.Ode9C1T.ode	@ltx/gr_gr_cog/miscellanea:misc.Ode9
ltx/gr_gr_cog/me.m10.d23:meMA.Ode9C1T.text	Σὺ τὸν ἐκ Παρθένου τεχθέντα, ἀπειρογάμως Θεοφάντορ, ταῖς μυσταγωγίαις σου σαφῶς Θεόν, διδάσκεις σεσαρκωμένον Λόγον, εἰς ὅν περ καὶ πιστεύοντες, νῦν ἐπαξίως μεγαλύνομεν.
ltx/gr_gr_cog/me.m10.d23:meMA.Ode9H.greekmelody	@ltx/gr_gr_cog/he.h.m4:heHE.LithosAcheirotmitos.greekname
ltx/gr_gr_cog/me.m10.d23:meMA.Ode9H.incipit	@ltx/gr_gr_cog/he.h.m4:heHE.LithosAcheirotmitos.incipit
ltx/gr_gr_cog/me.m10.d23:meMA.Ode9H.melody	@ltx/gr_gr_cog/he.h.m4:heHE.LithosAcheirotmitos.melody
ltx/gr_gr_cog/me.m10.d23:meMA.Ode9H.mode	@ltx/gr_gr_cog/miscellanea:misc.Mode4
ltx/gr_gr_cog/me.m10.d23:meMA.Ode9H.ode	@ltx/gr_gr_cog/miscellanea:misc.Ode9
ltx/gr_gr_cog/me.m10.d23:meMA.Ode9H.text	@ltx/gr_gr_cog/he.h.m4:heHE.LithosAcheirotmitos.text
ltx/gr_gr_cog/me.m10.d23:meMA.Oikos1.text	Τὸν γόνον σε τοῦ Ἰωσήφ, καὶ Ἱεροσολύμων τὸν πρῶτον ἱεράρχην, Ἰάκωβε θεόπτα, καὶ τοῦ Κυρίου ἀδελφὸν ὕμνοις ἐγκωμίων ἀνυμνοῦμεν εὐσεβῶς, καὶ πίστει ἀνακράζομεν· Δώρησαι ἡμῖν δώρημα τέλειον ἐκ τοῦ Πατρὸς τῶν φώτων, καὶ ἀπέλασον τὴν θλῖψιν τὴν ἐπερχομένην καὶ ἐνεστῶσαν ἐκ πλήθους πταισμάτων· ἐπῆραν γὰρ οἱ ἐχθροὶ καθʼ ἡμῶν τὴν πτέρναν, καὶ ἐκύκλωσαν ἡμᾶς Ἰσμαηλῖται· ὧν θραῦσον ταχὺ τὰ τόξα ἱεροφάντορ, ἵνα σε πάντες τιμῶμεν Ἀπόστολε.
ltx/gr_gr_cog/me.m10.d23:meVE.Apolytikion1.incipit	Ὡς τοῦ Κυρίου μαθητής…
ltx/gr_gr_cog/me.m10.d23:meVE.Apolytikion1.melody	
ltx/gr_gr_cog/me.m10.d23:meVE.Apolytikion1.mode	@ltx/gr_gr_cog/miscellanea:misc.Mode4
ltx/gr_gr_cog/me.m10.d23:meVE.Apolytikion1.text	Ὡς τοῦ Κυρίου μαθητής, ἀνεδέξω Δίκαιε τὸ Εὐαγγέλιον· ὡς Μάρτυς ἔχεις τὸ ἀπαράτρεπτον· τὴν παῤῥησίαν ὡς Ἀδελφόθεος, τὸ πρεσβεύειν ὡς Ἱεράρχης. Ἱκέτευε Χριστῷ τῷ Θεῷ, σωθῆναι τὰς ψυχὰς ἠμών.
ltx/gr_gr_cog/me.m10.d23:meVE.AposGlory.incipit	Τοῦ ἀρχιποίμενος Χριστοῦ, Ἀδελφὸς χρηματίσας…
ltx/gr_gr_cog/me.m10.d23:meVE.AposGlory.melody	
ltx/gr_gr_cog/me.m10.d23:meVE.AposGlory.mode	@ltx/gr_gr_cog/miscellanea:misc.Mode8
ltx/gr_gr_cog/me.m10.d23:meVE.AposGlory.text	Τοῦ ἀρχιποίμενος Χριστοῦ, Ἀδελφὸς χρηματίσας καὶ διάδοχος, καὶ ἐν Ἀποστόλοις ἐπίσημος, τὸν ὑπὲρ αὐτοῦ θάνατον ἠγάπησας, καὶ τὸ μαρτύριον οὐκ ἐπῃσχύνθης, Ἰάκωβε ἔνδοξε· Αὐτὸν ἱκέτευε ἀδιαλείπτως, τοῦ σωθῆναι τὰς ψυχὰς ἡμῶν.
ltx/gr_gr_cog/me.m10.d23:meVE.AposTheotokion.greekmelody	@ltx/gr_gr_cog/he.a.m8:heAU.KyrieEiKaiKritirio.greekname
ltx/gr_gr_cog/me.m10.d23:meVE.AposTheotokion.incipit	@ltx/gr_gr_cog/oc.m8.d5:ocVE.SticTheotokion.incipit
ltx/gr_gr_cog/me.m10.d23:meVE.AposTheotokion.melody	@ltx/gr_gr_cog/he.a.m8:heAU.KyrieEiKaiKritirio.name
ltx/gr_gr_cog/me.m10.d23:meVE.AposTheotokion.mode	@ltx/gr_gr_cog/miscellanea:misc.Mode8
ltx/gr_gr_cog/me.m10.d23:meVE.AposTheotokion.text	@ltx/gr_gr_cog/oc.m8.d5:ocVE.SticTheotokion.text
ltx/gr_gr_cog/me.m10.d23:meVE.Aposticha1.greekmelody	@ltx/gr_gr_cog/he.a.m8:heAU.KyrieEiKaiKritirio.greekname
ltx/gr_gr_cog/me.m10.d23:meVE.Aposticha1.incipit	Κύριε, εἰ καὶ πτερυγίῳ παρέστη…
ltx/gr_gr_cog/me.m10.d23:meVE.Aposticha1.melody	@ltx/gr_gr_cog/he.a.m8:heAU.KyrieEiKaiKritirio.name
ltx/gr_gr_cog/me.m10.d23:meVE.Aposticha1.mode	@ltx/gr_gr_cog/miscellanea:misc.Mode8
ltx/gr_gr_cog/me.m10.d23:meVE.Aposticha1.text	Κύριε, εἰ καὶ πτερυγίῳ παρέστη, τοῦ ἱεροῦ ὁ Ἰάκωβος, ἀλλὰ παῤῥησίᾳ λαλήσας, Θεὸν Λόγον σε ἐκήρυξε, Δημιουργὸν τοῦ παντός, κόσμῳ ἐπιδημήσαντα· οὗ ταῖς πρεσβείαις καὶ νῦν παράσχου, τὸν φωτισμὸν ταῖς ψυχαῖς ἡμῶν.
ltx/gr_gr_cog/me.m10.d23:meVE.Aposticha2.incipit	Κύριε, εἰ καὶ ἐν τῷ…
ltx/gr_gr_cog/me.m10.d23:meVE.Aposticha2.melody	@ltx/gr_gr_cog/he.a.m8:heAU.KyrieEiKaiKritirio.name
ltx/gr_gr_cog/me.m10.d23:meVE.Aposticha2.mode	@ltx/gr_gr_cog/miscellanea:misc.Mode8
ltx/gr_gr_cog/me.m10.d23:meVE.Aposticha2.text	Κύριε, εἰ καὶ ἐν τῷ ξύλῳ ἡ κάρα, τοῦ Ἀποστόλου συντέτριπται, ἀλλʼ ἐν Παραδείσῳ τῷ ξύλω, τῷ τῆς ζωῆς σοι προσήνεκται· τῶν γὰρ προσκαίρων λυθείς, αἰωνίως ἀγάλλεται, οὗ ταῖς πρεσβείαις ταῖς Ἐκκλησίαις, τὴν εἰρήνην σου κατάπεμψον.
ltx/gr_gr_cog/me.m10.d23:meVE.Aposticha3.incipit	Κύριε, σὲ ὁμολογήσας γενναίως, ὁ…
ltx/gr_gr_cog/me.m10.d23:meVE.Aposticha3.melody	@ltx/gr_gr_cog/he.a.m8:heAU.KyrieEiKaiKritirio.name
ltx/gr_gr_cog/me.m10.d23:meVE.Aposticha3.mode	@ltx/gr_gr_cog/miscellanea:misc.Mode8
ltx/gr_gr_cog/me.m10.d23:meVE.Aposticha3.text	Κύριε, σὲ ὁμολογήσας γενναίως, ὁ Ἀδελφόθεος γέγηθεν, Υἱὸν τοῦ Θεοῦ τοῦ ὑψίστου, εἰλικρινῶς ὁ ἀοίδιμος· τοὺς δὲ δυσφήμους ἐχθρούς, κατῄσχυνε καὶ ἔπαυσε· διὰ τοῦτο καὶ ἐναθλήσας, σοὶ παρέστη ἀγαλλόμενος.
ltx/gr_gr_cog/me.m10.d23:meVE.MM.Stichera1123as78910.text	
ltx/gr_gr_cog/me.m10.d23:meVE.SticGlory.incipit	Αἵματι τοῦ μαρτυρίου, τὴν ἱερωσύνην…
ltx/gr_gr_cog/me.m10.d23:meVE.SticGlory.melody	
ltx/gr_gr_cog/me.m10.d23:meVE.SticGlory.mode	@ltx/gr_gr_cog/miscellanea:misc.Mode6
ltx/gr_gr_cog/me.m10.d23:meVE.SticGlory.text	Αἵματι τοῦ μαρτυρίου, τὴν ἱερωσύνην κατεποίκιλας, Ἱερομάρτυς, Ἀπόστολε· τῷ γὰρ πτερυγίῳ του ἱεροῦ παρεστώς, Θεὸν Λόγον ἐκήρυξας, Δημιουργὸν ὄντα τοῦ παντός· ὅθεν ὑπὸ Ἰουδαίων ῥιφείς, οὐρανίων θαλάμων ἠξίωσαι, Ἀδελφόθεε Ἰάκωβε, Χριστὸν τὸν Θεὸν ἱκέτευε, τοῦ σωθῆναι τὰς ψυχὰς ἡμῶν.
ltx/gr_gr_cog/me.m10.d23:meVE.SticTheotokion.greekmelody	@ltx/gr_gr_cog/he.a.m6:heAU.TriimerosAnestis.greekname
ltx/gr_gr_cog/me.m10.d23:meVE.SticTheotokion.incipit	@ltx/gr_gr_cog/me.m09.d30:meVE.SticTheotokion.incipit
ltx/gr_gr_cog/me.m10.d23:meVE.SticTheotokion.melody	@ltx/gr_gr_cog/he.a.m6:heAU.TriimerosAnestis.name
ltx/gr_gr_cog/me.m10.d23:meVE.SticTheotokion.mode	@ltx/gr_gr_cog/miscellanea:misc.Mode6
ltx/gr_gr_cog/me.m10.d23:meVE.SticTheotokion.text	@ltx/gr_gr_cog/me.m09.d30:meVE.SticTheotokion.text
ltx/gr_gr_cog/me.m10.d23:meVE.Stichera01.greekmelody	@ltx/gr_gr_cog/he.a.m4:heAU.EdokasSimeiosin.greekname
ltx/gr_gr_cog/me.m10.d23:meVE.Stichera01.incipit	Δεῦτε τὸ μνημόσυνον, τοῦ θεαδέλφου…
ltx/gr_gr_cog/me.m10.d23:meVE.Stichera01.melody	@ltx/gr_gr_cog/he.a.m4:heAU.EdokasSimeiosin.name
ltx/gr_gr_cog/me.m10.d23:meVE.Stichera01.mode	@ltx/gr_gr_cog/miscellanea:misc.Mode4
ltx/gr_gr_cog/me.m10.d23:meVE.Stichera01.text	Δεῦτε τὸ μνημόσυνον, τοῦ θεαδέλφου τιμήσωμεν, ἱερῶς οἱ θεόφρονες· ζυγὸν γὰρ δεξάμενος, τοῦ Χριστοῦ προθύμως, τοῦ Εὐαγγελίου, τῆς ἀγαθότητος αὐτοῦ, καὶ βασιλείας κήρυξ γεγένηται, καὶ τούτου τὴν ἀνέκφραστον, οἰκονομίαν πιστεύεται. Διʼ αὐτοῦ Παντοδύναμε, ἱλασμὸν ἡμῖν δώρησαι.
ltx/gr_gr_cog/me.m10.d23:meVE.Stichera02.incipit	Πάντα περιήχησε, τῆς οἰκουμένης τὰ…
ltx/gr_gr_cog/me.m10.d23:meVE.Stichera02.melody	@ltx/gr_gr_cog/he.a.m4:heAU.EdokasSimeiosin.name
ltx/gr_gr_cog/me.m10.d23:meVE.Stichera02.mode	@ltx/gr_gr_cog/miscellanea:misc.Mode4
ltx/gr_gr_cog/me.m10.d23:meVE.Stichera02.text	Πάντα περιήχησε, τῆς οἰκουμένης τὰ πέρατα, τῶν ῥημάτων ὁ φθόγγος σου, διʼ ὧν φωτιζόμεθα, ἀρετῆς ἐνθέου, πρὸς πᾶσαν ἰδέαν, καὶ ὁδηγούμεθα πιστῶς, πρὸς τῆς Τριάδος θείαν ἐπίγνωσιν· διὸ ἐκδυσωποῦμέν σε, ὡς Ἱεράρχης ἱκέτευε, Ἰησοῦν τὸν φιλάνθρωπον, τοῦ σωθῆναι τὰς ψυχὰς ἡμῶν.
ltx/gr_gr_cog/me.m10.d23:meVE.Stichera03.incipit	Πόῤῥωθεν προβλέπων σου, τὴν πολιτείαν…
ltx/gr_gr_cog/me.m10.d23:meVE.Stichera03.melody	@ltx/gr_gr_cog/he.a.m4:heAU.EdokasSimeiosin.name
ltx/gr_gr_cog/me.m10.d23:meVE.Stichera03.mode	@ltx/gr_gr_cog/miscellanea:misc.Mode4
ltx/gr_gr_cog/me.m10.d23:meVE.Stichera03.text	Πόῤῥωθεν προβλέπων σου, τὴν πολιτείαν Ἰάκωβε, ἀδελφόν σε προσήκατο, Χριστὸς ὁ φιλάνθρωπος, ὁ σοφὸς προγνώστης, Ἱεροσολύμων, ἱεροφάντορα πιστόν, καὶ ποιμενάρχην προχειρισάμενος, καὶ μύστην τὰ ἀπόῤῥητα, ἱερουργοῦντα μυστήρια. Ὃν καὶ νῦν καθικέτευε, τοῦ σωθῆναι τὰς ψυχὰς ἡμῶν.
