ltx/gr_gr_cog/ty.m09.d05:tyDA.Commemoration.text	
ltx/gr_gr_cog/ty.m09.d05:tyDA.Date.text	
ltx/gr_gr_cog/ty.m09.d05:tyDA.Note1.text	
ltx/gr_gr_cog/ty.m09.d05:tyLI.AfterCommunion.text	
ltx/gr_gr_cog/ty.m09.d05:tyLI.AmboPrayer.text	
ltx/gr_gr_cog/ty.m09.d05:tyLI.Antiphons.text	
ltx/gr_gr_cog/ty.m09.d05:tyLI.Apolytikia.text	
ltx/gr_gr_cog/ty.m09.d05:tyLI.CommunionHymn.text	
ltx/gr_gr_cog/ty.m09.d05:tyLI.Dismissal.text	
ltx/gr_gr_cog/ty.m09.d05:tyLI.EntranceHymn.text	
ltx/gr_gr_cog/ty.m09.d05:tyLI.Epistle.text	
ltx/gr_gr_cog/ty.m09.d05:tyLI.Gospel.text	
ltx/gr_gr_cog/ty.m09.d05:tyLI.Kontakion.text	
ltx/gr_gr_cog/ty.m09.d05:tyLI.Megalynarion.text	
ltx/gr_gr_cog/ty.m09.d05:tyLI.TheotokosHymn.text	
ltx/gr_gr_cog/ty.m09.d05:tyMA.Anavathmoi.text	
ltx/gr_gr_cog/ty.m09.d05:tyMA.Apolytikia.text	
ltx/gr_gr_cog/ty.m09.d05:tyMA.Canon1_onSunday.text	Ὁ Ἀναστάσιμος, μετά τῶν Εἱρμῶν αὐτοῦ, εἰς 4.
ltx/gr_gr_cog/ty.m09.d05:tyMA.Canon2_onSunday.text	Τοῦ Προφήτου, μετά στίχου, εἰς 4.
ltx/gr_gr_cog/ty.m09.d05:tyMA.Doxology.text	
ltx/gr_gr_cog/ty.m09.d05:tyMA.EndApolytikion.text	
ltx/gr_gr_cog/ty.m09.d05:tyMA.Exaposteilaria.text	
ltx/gr_gr_cog/ty.m09.d05:tyMA.Katavasias.text	
ltx/gr_gr_cog/ty.m09.d05:tyMA.Kathismata.text	
ltx/gr_gr_cog/ty.m09.d05:tyMA.KontakionOikos.text	
ltx/gr_gr_cog/ty.m09.d05:tyMA.Lauds.text	
ltx/gr_gr_cog/ty.m09.d05:tyMA.LaudsBoth.text	
ltx/gr_gr_cog/ty.m09.d05:tyMA.LaudsGlory.text	
ltx/gr_gr_cog/ty.m09.d05:tyMA.LaudsVerses.text	
ltx/gr_gr_cog/ty.m09.d05:tyMA.Magnificat.text	
ltx/gr_gr_cog/ty.m09.d05:tyMA.MatinsGospel.text	
ltx/gr_gr_cog/ty.m09.d05:tyMA.MidodeKath.text	
ltx/gr_gr_cog/ty.m09.d05:tyMA.MidodeKontakion.text	
ltx/gr_gr_cog/ty.m09.d05:tyMA.Ode9_1.text	
ltx/gr_gr_cog/ty.m09.d05:tyMA.Ode9_2.text	
ltx/gr_gr_cog/ty.m09.d05:tyMA.Ode9_3.text	
ltx/gr_gr_cog/ty.m09.d05:tyMA.Ode9_4.text	
ltx/gr_gr_cog/ty.m09.d05:tyMA.Ode9_5.text	
ltx/gr_gr_cog/ty.m09.d05:tyMA.Ode9_6.text	
ltx/gr_gr_cog/ty.m09.d05:tyMA.Ode9_7.text	
ltx/gr_gr_cog/ty.m09.d05:tyMA.Ode9_8.text	
ltx/gr_gr_cog/ty.m09.d05:tyMA.Ode9_Katavasia1.text	
ltx/gr_gr_cog/ty.m09.d05:tyMA.ProkVerse.text	
ltx/gr_gr_cog/ty.m09.d05:tyMA.Prokeimenon.text	
ltx/gr_gr_cog/ty.m09.d05:tyMA.Psalm50.text	
ltx/gr_gr_cog/ty.m09.d05:tyMA.Synaxarion.text	
ltx/gr_gr_cog/ty.m09.d05:tyMO.Rubric1.text	
ltx/gr_gr_cog/ty.m09.d05:tyVE.Apolytikia.text	
ltx/gr_gr_cog/ty.m09.d05:tyVE.AposBoth.text	
ltx/gr_gr_cog/ty.m09.d05:tyVE.AposGlory.text	
ltx/gr_gr_cog/ty.m09.d05:tyVE.AposGloryBoth.text	
ltx/gr_gr_cog/ty.m09.d05:tyVE.Aposticha.text	
ltx/gr_gr_cog/ty.m09.d05:tyVE.Dismissal.text	
ltx/gr_gr_cog/ty.m09.d05:tyVE.Entrance.text	
ltx/gr_gr_cog/ty.m09.d05:tyVE.Intro.text	
ltx/gr_gr_cog/ty.m09.d05:tyVE.LIHC.text	
ltx/gr_gr_cog/ty.m09.d05:tyVE.Note1.text	
ltx/gr_gr_cog/ty.m09.d05:tyVE.Note2.text	
ltx/gr_gr_cog/ty.m09.d05:tyVE.SticBoth.text	
ltx/gr_gr_cog/ty.m09.d05:tyVE.SticGlory.text	
ltx/gr_gr_cog/ty.m09.d05:tyVE.SticGloryBoth.text	
ltx/gr_gr_cog/ty.m09.d05:tyVE.Stichera.text	
