ltx/gr_gr_cog/le.ep.me.m10.d19:lemeLI.Epistle.book_abbr	@ltx/gr_gr_cog/le.ep.mc.d073:lemcLI.Epistle.book_abbr
ltx/gr_gr_cog/le.ep.me.m10.d19:lemeLI.Epistle.book_string	@ltx/gr_gr_cog/le.ep.mc.d073:lemcLI.Epistle.book_string
ltx/gr_gr_cog/le.ep.me.m10.d19:lemeLI.Epistle.chapverse	@ltx/gr_gr_cog/le.ep.mc.d073:lemcLI.Epistle.chapverse
ltx/gr_gr_cog/le.ep.me.m10.d19:lemeLI.Epistle.incipit	@ltx/gr_gr_cog/le.ep.mc.d073:lemcLI.Epistle.incipit
ltx/gr_gr_cog/le.ep.me.m10.d19:lemeLI.Epistle.text	@ltx/gr_gr_cog/le.ep.mc.d073:lemcLI.Epistle.text
ltx/gr_gr_cog/le.ep.me.m10.d19:lemeLI.Epistle.title	Τοῦ Προφήτου
ltx/gr_gr_cog/le.ep.me.m10.d19:lemeLI.Epistle.title_abbr	Τοῦ Προφήτου
ltx/gr_gr_cog/le.ep.me.m10.d19:lemeLI.Epistle.version	@ltx/gr_gr_cog/le.ep.mc.d073:lemcLI.Epistle.version
