ltx/gr_gr_cog/tr.d045:trCO.header	(Μέγα)
ltx/gr_gr_cog/tr.d045:trDA.commemoration.full	
ltx/gr_gr_cog/tr.d045:trDA.commemoration.short	Τρίτη τῆς Δʹ Ἑβδομάδος
ltx/gr_gr_cog/tr.d045:trDA.insert1	
ltx/gr_gr_cog/tr.d045:trDA.insert2	
ltx/gr_gr_cog/tr.d045:trDA.note	
ltx/gr_gr_cog/tr.d045:trDA.title	
ltx/gr_gr_cog/tr.d045:trHO.commemorations	
ltx/gr_gr_cog/tr.d045:trHO.daytitle	
ltx/gr_gr_cog/tr.d045:trHO.description1	
ltx/gr_gr_cog/tr.d045:trHO.description2	
ltx/gr_gr_cog/tr.d045:trHO.note1	
ltx/gr_gr_cog/tr.d045:trHO.note2	
ltx/gr_gr_cog/tr.d045:trMA.AposIdiomelon1.incipit	Τοῦ μεγαλαύχου Φαρισαίου, τὴν ἐξ…
ltx/gr_gr_cog/tr.d045:trMA.AposIdiomelon1.melody	@ltx/gr_gr_cog/miscellanea:misc.Idiomelon
ltx/gr_gr_cog/tr.d045:trMA.AposIdiomelon1.mode	@ltx/gr_gr_cog/miscellanea:misc.Mode8
ltx/gr_gr_cog/tr.d045:trMA.AposIdiomelon1.text	Τοῦ μεγαλαύχου Φαρισαίου, τὴν ἐξ οἰήσεως ἐννοοῦσα ψυχή μου κατάκρισιν, καὶ τοῦ ταπεινόφρονος Τελώνου, τὴν διʼ ἐξαγορεύσεως πταισμάτων, ἐπιγνοῦσα δικαίωσιν, τοῦ μὲν ἀποθέσθαι κατεπείγου, τὴν ἐπ ἀρετῆς προπέτειαν, τοῦ δὲ προλαβέσθαι, τὴν ἐφʼ οἷς ἐπλημμέλησας ἐξομολόγησιν, διεγείρου τὴν ἀταπείνωτον σεαυτῇ καρπουμένη, διὰ μετριοπαθείας ὕψωσιν, παρὰ Χριστοῦ τοῦ ἔχοντος τὸ μέγα ἔλεος.
ltx/gr_gr_cog/tr.d045:trMA.AposMartyric.incipit	Μεγάλως ἠγωνίσασθε Μάρτυρες, τὰς βασάνους…
ltx/gr_gr_cog/tr.d045:trMA.AposMartyric.melody	
ltx/gr_gr_cog/tr.d045:trMA.AposMartyric.mode	@ltx/gr_gr_cog/miscellanea:misc.Mode8
ltx/gr_gr_cog/tr.d045:trMA.AposMartyric.text	Μεγάλως ἠγωνίσασθε Μάρτυρες, τὰς βασάνους τῶν ἀνόμων, ὑπομείναντες γενναίως, τὸν Χριστὸν ὁμολογοῦντες, ἐναντίον βασιλέων, καὶ πάλιν μεταστάντες ἐκ τοῦ βίου, δυνάμεις ἐνεργεῖτε ἐν τῷ Κόσμῳ, καὶ ἀσθενεῖς θεραπεύετε, ἐκ τῶν παθῶν αὐτῶν Ἅγιοι, πρεσβεύσατε, τοῦ σωθῆναι τὰς ψυχὰς ἡμῶν.
ltx/gr_gr_cog/tr.d045:trMA.AposTheotokion.incipit	@ltx/gr_gr_cog/oc.m8.d3:ocVE.AposTheotokion.incipit
ltx/gr_gr_cog/tr.d045:trMA.AposTheotokion.melody	
ltx/gr_gr_cog/tr.d045:trMA.AposTheotokion.mode	@ltx/gr_gr_cog/miscellanea:misc.Mode8
ltx/gr_gr_cog/tr.d045:trMA.AposTheotokion.text	@ltx/gr_gr_cog/oc.m8.d3:ocVE.AposTheotokion.text
ltx/gr_gr_cog/tr.d045:trMA.C1.poet	@ltx/gr_gr_cog/poets:po.Iosif
ltx/gr_gr_cog/tr.d045:trMA.C2.poet	@ltx/gr_gr_cog/poets:po.Theodorou
ltx/gr_gr_cog/tr.d045:trMA.Kathisma21.incipit	Ἐγκρατείᾳ λαμπρύναντες, τὰς ψυχὰς ἡμῶν…
ltx/gr_gr_cog/tr.d045:trMA.Kathisma21.melody	Τὸ ἀσάλευτον στήριγμα.
ltx/gr_gr_cog/tr.d045:trMA.Kathisma21.mode	@ltx/gr_gr_cog/miscellanea:misc.Mode8
ltx/gr_gr_cog/tr.d045:trMA.Kathisma21.text	Ἐγκρατείᾳ λαμπρύναντες, τὰς ψυχὰς ἡμῶν, τὸν Σταυρὸν προσκυνήσωμεν, τὸν σωτήριον, ἐν ᾧ Χριστὸς προσηλώθη, καὶ βοήσωμεν αὐτῷ· Χαῖρε νηστευόντων ἡ τρυφή, καὶ βεβαία βοήθεια. Χαῖρε ἀναιρέτα τῶν παθῶν, τῶν δαιμόνων ἀντίπαλε, χαῖρε Ξύλον μακάριον.
ltx/gr_gr_cog/tr.d045:trMA.Kathisma22.incipit	Τὸ ἀσάλευτον στήριγμα, τὸ τῆς…
ltx/gr_gr_cog/tr.d045:trMA.Kathisma22.melody	@ltx/gr_gr_cog/miscellanea:misc.Automelon
ltx/gr_gr_cog/tr.d045:trMA.Kathisma22.mode	@ltx/gr_gr_cog/miscellanea:misc.Mode8
ltx/gr_gr_cog/tr.d045:trMA.Kathisma22.text	Τὸ ἀσάλευτον στήριγμα, τὸ τῆς Πίστεως, καὶ σεβάσμιον δώρημα, τῶν ψυχῶν ἡμῶν, τὴν Θεοτόκον ἐν ὕμνοις μεγαλύνωμεν πιστοί. Χαῖρε ἡ τὴν πέτραν τῆς ζωῆς, ἐν γαστρί σου χωρήσασα, χαῖρε τῶν περάτων ἡ ἐλπίς, θλιβομένων ἀντίληψις, χαῖρε Νύμφη ἀνύμφευτε.
ltx/gr_gr_cog/tr.d045:trMA.Kathisma31.greekmelody	@ltx/gr_gr_cog/he.a.m8:heAU.OsAparchas.greekname
ltx/gr_gr_cog/tr.d045:trMA.Kathisma31.incipit	Ὥσπερ ζωὴν τῆς Κτίσεως, τὸν…
ltx/gr_gr_cog/tr.d045:trMA.Kathisma31.melody	@ltx/gr_gr_cog/he.a.m8:heAU.OsAparchas.name
ltx/gr_gr_cog/tr.d045:trMA.Kathisma31.mode	@ltx/gr_gr_cog/miscellanea:misc.Mode8
ltx/gr_gr_cog/tr.d045:trMA.Kathisma31.text	Ὥσπερ ζωὴν τῆς Κτίσεως, τὸν σὸν Σταυρὸν προκείμενον, ἡ Οἰκουμένη ἀσπάζεται Κύριε, καὶ προσκυνοῦσα κράζει σοι· τῇ αὐτοῦ ἐνεργείᾳ, ἐν εἰρήνῃ βαθείᾳ, τοὺς ἀνυμνοῦντάς σε, τοὺς εὐλογοῦντάς σε, διὰ τῆς ἐγκρατείας συντήρησον Πολυέλεε.
ltx/gr_gr_cog/tr.d045:trMA.Kathisma32.greekmelody	@ltx/gr_gr_cog/he.a.m8:heAU.OsAparchas.greekname
ltx/gr_gr_cog/tr.d045:trMA.Kathisma32.incipit	@ltx/gr_gr_cog/oc.m8.d2:ocVE.ApolTheotokionVM.incipit
ltx/gr_gr_cog/tr.d045:trMA.Kathisma32.melody	@ltx/gr_gr_cog/he.a.m8:heAU.OsAparchas.name
ltx/gr_gr_cog/tr.d045:trMA.Kathisma32.mode	@ltx/gr_gr_cog/miscellanea:misc.Mode8
ltx/gr_gr_cog/tr.d045:trMA.Kathisma32.text	@ltx/gr_gr_cog/oc.m8.d2:ocVE.ApolTheotokionVM.text
ltx/gr_gr_cog/tr.d045:trMA.Ode2C11.greekmelody	@ltx/gr_gr_cog/he.h.m8:heHE.IdeteIdeteOPalaiTonIsrail.greekname
ltx/gr_gr_cog/tr.d045:trMA.Ode2C11.incipit	Μέσον τῆς Κτίσεως, ὃν καθυπέμεινας…
ltx/gr_gr_cog/tr.d045:trMA.Ode2C11.melody	@ltx/gr_gr_cog/he.h.m8:heHE.IdeteIdeteOPalaiTonIsrail.name
ltx/gr_gr_cog/tr.d045:trMA.Ode2C11.mode	@ltx/gr_gr_cog/miscellanea:misc.Mode8
ltx/gr_gr_cog/tr.d045:trMA.Ode2C11.ode	@ltx/gr_gr_cog/miscellanea:misc.Ode2
ltx/gr_gr_cog/tr.d045:trMA.Ode2C11.text	Μέσον τῆς Κτίσεως, ὃν καθυπέμεινας Σταυρόν, Μεσσία Λόγε Θεοῦ, τῷ τῆς Νηστείας σήμερον μεσασμῷ, πιστῶς προσκυνοῦμεν, αἰτούμενοι κατιδεῖν, καὶ τὴν Ἀνάστασιν τὴν σήν.
ltx/gr_gr_cog/tr.d045:trMA.Ode2C12.incipit	Ῥάβδῳ δυνάμεως, προτυπωθείσῃ τῷ Μωσῇ…
ltx/gr_gr_cog/tr.d045:trMA.Ode2C12.melody	@ltx/gr_gr_cog/he.h.m8:heHE.IdeteIdeteOPalaiTonIsrail.name
ltx/gr_gr_cog/tr.d045:trMA.Ode2C12.mode	@ltx/gr_gr_cog/miscellanea:misc.Mode8
ltx/gr_gr_cog/tr.d045:trMA.Ode2C12.ode	@ltx/gr_gr_cog/miscellanea:misc.Ode2
ltx/gr_gr_cog/tr.d045:trMA.Ode2C12.text	Ῥάβδῳ δυνάμεως, προτυπωθείσῃ τῷ Μωσῇ, τὴν θάλασσαν τῶν παθῶν, διατεμόντες φθάσωμεν πρὸς γῆν, τῆς ἐπαγγελίας, καὶ μάννα τοῦ νοητοῦ, ἐμφορηθῶμεν δαψιλῶς.
ltx/gr_gr_cog/tr.d045:trMA.Ode2C13.incipit	Τίς μὴ θρηνήσει σε; τίς…
ltx/gr_gr_cog/tr.d045:trMA.Ode2C13.melody	@ltx/gr_gr_cog/he.h.m8:heHE.IdeteIdeteOPalaiTonIsrail.name
ltx/gr_gr_cog/tr.d045:trMA.Ode2C13.mode	@ltx/gr_gr_cog/miscellanea:misc.Mode8
ltx/gr_gr_cog/tr.d045:trMA.Ode2C13.ode	@ltx/gr_gr_cog/miscellanea:misc.Ode2
ltx/gr_gr_cog/tr.d045:trMA.Ode2C13.text	Τίς μὴ θρηνήσει σε; τίς μὴ πενθήσει σε ψυχή, ποθοῦσαν τὰ πονηρά, οὐκ ἐκζητοῦσαν πόθῳ τὰ ἀγαθά, δικαίου Κριτοῦ δέ, καταφρονοῦσαν ἀεί, μακροθυμοῦντος ἐπὶ σοί;
ltx/gr_gr_cog/tr.d045:trMA.Ode2C1H.greekmelody	@ltx/gr_gr_cog/he.h.m8:heHE.IdeteIdeteOPalaiTonIsrail.greekname
ltx/gr_gr_cog/tr.d045:trMA.Ode2C1H.incipit	@ltx/gr_gr_cog/he.h.m8:heHE.IdeteIdeteOPalaiTonIsrail.incipit
ltx/gr_gr_cog/tr.d045:trMA.Ode2C1H.melody	@ltx/gr_gr_cog/he.h.m8:heHE.IdeteIdeteOPalaiTonIsrail.melody
ltx/gr_gr_cog/tr.d045:trMA.Ode2C1H.mode	@ltx/gr_gr_cog/miscellanea:misc.Mode8
ltx/gr_gr_cog/tr.d045:trMA.Ode2C1H.ode	@ltx/gr_gr_cog/miscellanea:misc.Ode2
ltx/gr_gr_cog/tr.d045:trMA.Ode2C1H.text	@ltx/gr_gr_cog/he.h.m8:heHE.IdeteIdeteOPalaiTonIsrail.text
ltx/gr_gr_cog/tr.d045:trMA.Ode2C1T.incipit	Σάρκα γενόμενον, ἀναλλοιώτως τὸν Χριστόν…
ltx/gr_gr_cog/tr.d045:trMA.Ode2C1T.melody	@ltx/gr_gr_cog/he.h.m8:heHE.IdeteIdeteOPalaiTonIsrail.name
ltx/gr_gr_cog/tr.d045:trMA.Ode2C1T.mode	@ltx/gr_gr_cog/miscellanea:misc.Mode8
ltx/gr_gr_cog/tr.d045:trMA.Ode2C1T.ode	@ltx/gr_gr_cog/miscellanea:misc.Ode2
ltx/gr_gr_cog/tr.d045:trMA.Ode2C1T.text	Σάρκα γενόμενον, ἀναλλοιώτως τὸν Χριστόν, Παρθένε κυοφορεῖς, ὃν ἐκτενῶς ἱκέτευε, σαρκικῶν παθῶν ἀπαλλάξαι, τοὺς προσκυνοῦντας Σταυρόν, ὃν καθυπέμεινε σαρκί.
ltx/gr_gr_cog/tr.d045:trMA.Ode2C21.greekmelody	@ltx/gr_gr_cog/he.h.m8:heHE.IdeteIdeteOProTonAionon.greekname
ltx/gr_gr_cog/tr.d045:trMA.Ode2C21.incipit	Ἴδετε ἴδετε, ὅτι ἐγώ εἰμι…
ltx/gr_gr_cog/tr.d045:trMA.Ode2C21.melody	@ltx/gr_gr_cog/he.h.m8:heHE.IdeteIdeteOProTonAionon.name
ltx/gr_gr_cog/tr.d045:trMA.Ode2C21.mode	@ltx/gr_gr_cog/miscellanea:misc.Mode8
ltx/gr_gr_cog/tr.d045:trMA.Ode2C21.ode	@ltx/gr_gr_cog/miscellanea:misc.Ode2
ltx/gr_gr_cog/tr.d045:trMA.Ode2C21.text	Ἴδετε ἴδετε, ὅτι ἐγώ εἰμι ὁ Θεὸς ἡμῶν, ὁ τῇ Οἰκουμένῃ, τὸν Σταυρόν μου παρασχών, ὅπλον σωτηρίας, εἰς τὸ νῦν προσκυνεῖσθαι αὐτόν, ὅπως οἱ ἀσπαζόμενοι, καταργῶσι τοῦ ἐχθροῦ μηχανήματα.
ltx/gr_gr_cog/tr.d045:trMA.Ode2C22.incipit	Μέγας εἶ Κύριε, καὶ πολυέλεος…
ltx/gr_gr_cog/tr.d045:trMA.Ode2C22.melody	@ltx/gr_gr_cog/he.h.m8:heHE.IdeteIdeteOProTonAionon.name
ltx/gr_gr_cog/tr.d045:trMA.Ode2C22.mode	@ltx/gr_gr_cog/miscellanea:misc.Mode8
ltx/gr_gr_cog/tr.d045:trMA.Ode2C22.ode	@ltx/gr_gr_cog/miscellanea:misc.Ode2
ltx/gr_gr_cog/tr.d045:trMA.Ode2C22.text	Μέγας εἶ Κύριε, καὶ πολυέλεος, ὅτι δέδωκας τὸν ζωοποιόν σου, προσκυνεῖσθαι νῦν Σταυρόν, ἔνθα σου αἱ χεῖρες, καὶ οἱ πόδες ἡλώθησαν· ἐν ᾧ τὸ αἷμα ἐῤῥύη, τῆς ἀχράντου σου Πλευρᾶς, ζωὴν πηγάζον ἡμῖν.
ltx/gr_gr_cog/tr.d045:trMA.Ode2C2A1.incipit	Σὲ Μωσῆς ὁ μέγας, προδιετύπωσε…
ltx/gr_gr_cog/tr.d045:trMA.Ode2C2A1.melody	@ltx/gr_gr_cog/he.h.m8:heHE.IdeteIdeteOProTonAionon.name
ltx/gr_gr_cog/tr.d045:trMA.Ode2C2A1.mode	@ltx/gr_gr_cog/miscellanea:misc.Mode8
ltx/gr_gr_cog/tr.d045:trMA.Ode2C2A1.ode	@ltx/gr_gr_cog/miscellanea:misc.Ode2
ltx/gr_gr_cog/tr.d045:trMA.Ode2C2A1.text	Σὲ Μωσῆς ὁ μέγας, προδιετύπωσε, τὸν Σταυρὸν ἡμῖν, χεῖρας ἐκπετάσας, καὶ πορθήσας Ἀμαλήκ, σὲ ἐκτυποῦντες ἐν σκιαῖς καὶ ἀέρι, ἡμεῖς ἐκτρέπομεν καὶ νικῶμεν, τὸν ἀρχέκακον ἐχθρόν, ὑμνολογοῦντες Χριστόν.
ltx/gr_gr_cog/tr.d045:trMA.Ode2C2H.greekmelody	@ltx/gr_gr_cog/he.h.m8:heHE.IdeteIdeteOProTonAionon.greekname
ltx/gr_gr_cog/tr.d045:trMA.Ode2C2H.incipit	@ltx/gr_gr_cog/he.h.m8:heHE.IdeteIdeteOProTonAionon.incipit
ltx/gr_gr_cog/tr.d045:trMA.Ode2C2H.melody	@ltx/gr_gr_cog/he.h.m8:heHE.IdeteIdeteOProTonAionon.melody
ltx/gr_gr_cog/tr.d045:trMA.Ode2C2H.mode	@ltx/gr_gr_cog/miscellanea:misc.Mode8
ltx/gr_gr_cog/tr.d045:trMA.Ode2C2H.ode	@ltx/gr_gr_cog/miscellanea:misc.Ode2
ltx/gr_gr_cog/tr.d045:trMA.Ode2C2H.text	@ltx/gr_gr_cog/he.h.m8:heHE.IdeteIdeteOProTonAionon.text
ltx/gr_gr_cog/tr.d045:trMA.Ode2C2T.incipit	Ἄῤῥητον τὸ θαῦμα, τῆς σῆς…
ltx/gr_gr_cog/tr.d045:trMA.Ode2C2T.melody	@ltx/gr_gr_cog/he.h.m8:heHE.IdeteIdeteOProTonAionon.name
ltx/gr_gr_cog/tr.d045:trMA.Ode2C2T.mode	@ltx/gr_gr_cog/miscellanea:misc.Mode8
ltx/gr_gr_cog/tr.d045:trMA.Ode2C2T.ode	@ltx/gr_gr_cog/miscellanea:misc.Ode2
ltx/gr_gr_cog/tr.d045:trMA.Ode2C2T.text	Ἄῤῥητον τὸ θαῦμα, τῆς σῆς κυήσεως Μητροπάρθενε· πῶς γὰρ καὶ λοχεύεις, καὶ ἁγνεύεις ἐν ταὐτῷ; πῶς παιδοτοκεῖς, καὶ ἀγνοεῖς πεῖραν ὅλως ἀνδρός; Ὡς εἶδεν ὁ ὑπὲρ φύσιν, ἐξ ἐμοῦ καινοπρεπῶς, Λόγος Θεοῦ γεννηθείς.
ltx/gr_gr_cog/tr.d045:trMA.Ode2C2Tr.incipit	Ὑπερτελεστάτη Μονάς, ὑπέρθεε, τρισυπόστατε, ἀγέννητε…
ltx/gr_gr_cog/tr.d045:trMA.Ode2C2Tr.melody	@ltx/gr_gr_cog/he.h.m8:heHE.IdeteIdeteOProTonAionon.name
ltx/gr_gr_cog/tr.d045:trMA.Ode2C2Tr.mode	@ltx/gr_gr_cog/miscellanea:misc.Mode8
ltx/gr_gr_cog/tr.d045:trMA.Ode2C2Tr.ode	@ltx/gr_gr_cog/miscellanea:misc.Ode2
ltx/gr_gr_cog/tr.d045:trMA.Ode2C2Tr.text	Ὑπερτελεστάτη Μονάς, ὑπέρθεε, τρισυπόστατε, ἀγέννητε Πάτερ, καὶ Υἱὲ μονογενές, Πνεῦμα ἐκ Πατρὸς ἐκπορευθέν, διʼ Υἱοῦ δὲ φανέν, οὐσία μία καὶ φύσις, κυριότης, βασιλεία, σῶσον πάντας ἡμᾶς.
ltx/gr_gr_cog/tr.d045:trMA.Ode8C11.greekmelody	@ltx/gr_gr_cog/he.h.m8:heHE.OStegazonEnYdasi.greekname
ltx/gr_gr_cog/tr.d045:trMA.Ode8C11.incipit	Ὁ συσσείσας θεμέλια, πάσης τῆς…
ltx/gr_gr_cog/tr.d045:trMA.Ode8C11.melody	@ltx/gr_gr_cog/he.h.m8:heHE.OStegazonEnYdasi.name
ltx/gr_gr_cog/tr.d045:trMA.Ode8C11.mode	@ltx/gr_gr_cog/miscellanea:misc.Mode8
ltx/gr_gr_cog/tr.d045:trMA.Ode8C11.ode	@ltx/gr_gr_cog/miscellanea:misc.Ode8
ltx/gr_gr_cog/tr.d045:trMA.Ode8C11.text	Ὁ συσσείσας θεμέλια, πάσης τῆς γῆς ὡς Θεός, ὑψωθεὶς ἐν ξύλῳ, ἄσειστον πᾶσιν ἐδωρήσω, πιστοῖς ἔρεισμα Κύριε, τὸ σωτήριον ὅπλον τοῦ Σταυροῦ σου, ὅν περ προσκυνοῦντες, σὲ ὑπερυψοῦμεν, εἰς πάντας τοὺς αἰῶνας.
ltx/gr_gr_cog/tr.d045:trMA.Ode8C12.incipit	Ἀπαστράπτον θεώμενοι, ὑπὲρ ἡλίου αὐγάς…
ltx/gr_gr_cog/tr.d045:trMA.Ode8C12.melody	@ltx/gr_gr_cog/he.h.m8:heHE.OStegazonEnYdasi.name
ltx/gr_gr_cog/tr.d045:trMA.Ode8C12.mode	@ltx/gr_gr_cog/miscellanea:misc.Mode8
ltx/gr_gr_cog/tr.d045:trMA.Ode8C12.ode	@ltx/gr_gr_cog/miscellanea:misc.Ode8
ltx/gr_gr_cog/tr.d045:trMA.Ode8C12.text	Ἀπαστράπτον θεώμενοι, ὑπὲρ ἡλίου αὐγάς, τοῦ Σταυροῦ τὸ ξύλον, δεῦτε νηστείᾳ ἀστραπτόμενοι, νῦν ἀσπασώμεθα, ἀρυόμενοι χάριν φωτοφόρον, σκότος ἐκμειοῦσαν, τῶν ὑπερυψούντων, Χριστὸν εἰς τοὺς αἰῶνας.
ltx/gr_gr_cog/tr.d045:trMA.Ode8C13.incipit	Ὕδωρ ζῶν τὸ ἁλλόμενον, εἰς…
ltx/gr_gr_cog/tr.d045:trMA.Ode8C13.melody	@ltx/gr_gr_cog/he.h.m8:heHE.OStegazonEnYdasi.name
ltx/gr_gr_cog/tr.d045:trMA.Ode8C13.mode	@ltx/gr_gr_cog/miscellanea:misc.Mode8
ltx/gr_gr_cog/tr.d045:trMA.Ode8C13.ode	@ltx/gr_gr_cog/miscellanea:misc.Ode8
ltx/gr_gr_cog/tr.d045:trMA.Ode8C13.text	Ὕδωρ ζῶν τὸ ἁλλόμενον, εἰς αἰωνίαν ζωήν, σὺ ὑπάρχων Λόγε, αἷμα καὶ ὕδωρ, ἐκ πλευρᾶς ἐν Σταυρῷ, ἔβλυσας Δέσποτα, ἁμαρτίας χειμάῤῥους ἀναστέλλων. Ὅθεν δυσωπῶ σε· Ξήρανον παθῶν μου, τὰς πονηρὰς ἐκβλύσεις.
ltx/gr_gr_cog/tr.d045:trMA.Ode8C1T.incipit	Νοητὸν ὡς ἁγίασμα, τὸν ἐν…
ltx/gr_gr_cog/tr.d045:trMA.Ode8C1T.melody	@ltx/gr_gr_cog/he.h.m8:heHE.OStegazonEnYdasi.name
ltx/gr_gr_cog/tr.d045:trMA.Ode8C1T.mode	@ltx/gr_gr_cog/miscellanea:misc.Mode8
ltx/gr_gr_cog/tr.d045:trMA.Ode8C1T.ode	@ltx/gr_gr_cog/miscellanea:misc.Ode8
ltx/gr_gr_cog/tr.d045:trMA.Ode8C1T.text	Νοητὸν ὡς ἁγίασμα, τὸν ἐν ἁγίοις Θεόν, ἀναπεπαυμένον, τίκτεις ἁγία, Θεομῆτορ ἁγνή, πάντα τὰ πέρατα, ἁγιάζοντα θείᾳ προσκυνήσει, σήμερον Παρθένε Ξύλου παναγίου, ἐν ᾧ σαρκὶ ἐπάγη.
ltx/gr_gr_cog/tr.d045:trMA.Ode8C21.greekmelody	@ltx/gr_gr_cog/he.h.m8:heHE.AngeloiKaiOuranoi.greekname
ltx/gr_gr_cog/tr.d045:trMA.Ode8C21.incipit	Δεῦτε ἴδωμεν λαοί, τὸ Ζωηφόρον…
ltx/gr_gr_cog/tr.d045:trMA.Ode8C21.melody	@ltx/gr_gr_cog/he.h.m8:heHE.AngeloiKaiOuranoi.name
ltx/gr_gr_cog/tr.d045:trMA.Ode8C21.mode	@ltx/gr_gr_cog/miscellanea:misc.Mode8
ltx/gr_gr_cog/tr.d045:trMA.Ode8C21.ode	@ltx/gr_gr_cog/miscellanea:misc.Ode8
ltx/gr_gr_cog/tr.d045:trMA.Ode8C21.text	Δεῦτε ἴδωμεν λαοί, τὸ Ζωηφόρον Ξύλον, νῦν προκείμενον, ἐν ᾧ Χριστὸς ἐπάγη ὁ Θεὸς ἡμῶν, καὶ σὺ φόβῳ ὑμνοῦντες, τοῦτον προσκυνοῦμεν εἰς πάντας τοὺς αἰῶνας.
ltx/gr_gr_cog/tr.d045:trMA.Ode8C22.incipit	Τὸν τρισύνθετον Σταυρόν, ὡς τῆς…
ltx/gr_gr_cog/tr.d045:trMA.Ode8C22.melody	@ltx/gr_gr_cog/he.h.m8:heHE.AngeloiKaiOuranoi.name
ltx/gr_gr_cog/tr.d045:trMA.Ode8C22.mode	@ltx/gr_gr_cog/miscellanea:misc.Mode8
ltx/gr_gr_cog/tr.d045:trMA.Ode8C22.ode	@ltx/gr_gr_cog/miscellanea:misc.Ode8
ltx/gr_gr_cog/tr.d045:trMA.Ode8C22.text	Τὸν τρισύνθετον Σταυρόν, ὡς τῆς Τριάδος τύπον ἀνυμνήσωμεν, καὶ προσκυνοῦντες φόβῳ ἀνακράξωμεν· Εὐλογοῦντες ὑμνοῦντες, καὶ ὑπερυψοῦντες Χριστὸν εἰς τοὺς αἰῶνας.
ltx/gr_gr_cog/tr.d045:trMA.Ode8C2A1.incipit	Τὸν τυφλὸν ἐκ γενετῆς, ὁ…
ltx/gr_gr_cog/tr.d045:trMA.Ode8C2A1.melody	@ltx/gr_gr_cog/he.h.m8:heHE.AngeloiKaiOuranoi.name
ltx/gr_gr_cog/tr.d045:trMA.Ode8C2A1.mode	@ltx/gr_gr_cog/miscellanea:misc.Mode8
ltx/gr_gr_cog/tr.d045:trMA.Ode8C2A1.ode	@ltx/gr_gr_cog/miscellanea:misc.Ode8
ltx/gr_gr_cog/tr.d045:trMA.Ode8C2A1.text	Τὸν τυφλὸν ἐκ γενετῆς, ὁ ὀμματώσας λόγῳ, πηρωθέν μου σύ, τὸ τῆς καρδίας ὄμμα, πάλιν ἄνοιξον, ἵνα βλέψω τὸ φῶς, τῶν σῶν προσταγμάτων, Χριστὲ εἰς τοὺς αἰῶνας.
ltx/gr_gr_cog/tr.d045:trMA.Ode8C2H.greekmelody	@ltx/gr_gr_cog/he.h.m8:heHE.AngeloiKaiOuranoi.greekname
ltx/gr_gr_cog/tr.d045:trMA.Ode8C2H.incipit	@ltx/gr_gr_cog/he.h.m8:heHE.AngeloiKaiOuranoi.incipit
ltx/gr_gr_cog/tr.d045:trMA.Ode8C2H.melody	@ltx/gr_gr_cog/he.h.m8:heHE.AngeloiKaiOuranoi.melody
ltx/gr_gr_cog/tr.d045:trMA.Ode8C2H.mode	@ltx/gr_gr_cog/miscellanea:misc.Mode8
ltx/gr_gr_cog/tr.d045:trMA.Ode8C2H.ode	@ltx/gr_gr_cog/miscellanea:misc.Ode8
ltx/gr_gr_cog/tr.d045:trMA.Ode8C2H.text	@ltx/gr_gr_cog/he.h.m8:heHE.AngeloiKaiOuranoi.text
ltx/gr_gr_cog/tr.d045:trMA.Ode8C2T.incipit	Μόνη ἀφθόρως κύεις, μόνη θηλάζεις…
ltx/gr_gr_cog/tr.d045:trMA.Ode8C2T.melody	@ltx/gr_gr_cog/he.h.m8:heHE.AngeloiKaiOuranoi.name
ltx/gr_gr_cog/tr.d045:trMA.Ode8C2T.mode	@ltx/gr_gr_cog/miscellanea:misc.Mode8
ltx/gr_gr_cog/tr.d045:trMA.Ode8C2T.ode	@ltx/gr_gr_cog/miscellanea:misc.Ode8
ltx/gr_gr_cog/tr.d045:trMA.Ode8C2T.text	Μόνη ἀφθόρως κύεις, μόνη θηλάζεις βρέφος μὴ λοχεύουσα, μόνη τὸν Κτίστην τίκτεις καὶ Δεσπότην σου, εἰ καὶ δούλη καὶ μήτηρ, σὲ Παρθενομῆτορ, ὑμνοῦμεν εἰς αἰῶνας.
ltx/gr_gr_cog/tr.d045:trMA.Ode8C2Tr.incipit	Εἷς Θεὸς οὖν ἡ Τριάς…
ltx/gr_gr_cog/tr.d045:trMA.Ode8C2Tr.melody	@ltx/gr_gr_cog/he.h.m8:heHE.AngeloiKaiOuranoi.name
ltx/gr_gr_cog/tr.d045:trMA.Ode8C2Tr.mode	@ltx/gr_gr_cog/miscellanea:misc.Mode8
ltx/gr_gr_cog/tr.d045:trMA.Ode8C2Tr.ode	@ltx/gr_gr_cog/miscellanea:misc.Ode8
ltx/gr_gr_cog/tr.d045:trMA.Ode8C2Tr.text	Εἷς Θεὸς οὖν ἡ Τριάς, οὐ τοῦ Πατρὸς ἐκστάντος εἰς υἱότητα, οὐδὲ Υἱοῦ τραπέντος εἰς ἐκπόρευσιν, ἀλλʼ ἰδίᾳ καὶ ἄμφω, ὡς Θεὸν τὰ τρία δοξάζω εἰς αἰῶνας.
ltx/gr_gr_cog/tr.d045:trMA.Ode9C11.greekmelody	@ltx/gr_gr_cog/he.h.m8:heHE.EvlogitosOKyrios.greekname
ltx/gr_gr_cog/tr.d045:trMA.Ode9C11.incipit	Εὐλογητὸς Κύριος, ὁ Θεὸς τοῦ…
ltx/gr_gr_cog/tr.d045:trMA.Ode9C11.melody	@ltx/gr_gr_cog/he.h.m8:heHE.EvlogitosOKyrios.name
ltx/gr_gr_cog/tr.d045:trMA.Ode9C11.mode	@ltx/gr_gr_cog/miscellanea:misc.Mode8
ltx/gr_gr_cog/tr.d045:trMA.Ode9C11.ode	@ltx/gr_gr_cog/miscellanea:misc.Ode9
ltx/gr_gr_cog/tr.d045:trMA.Ode9C11.text	Εὐλογητὸς Κύριος, ὁ Θεὸς τοῦ Ἰσραήλ, ὁ Σταυρῷ σου λύσας τὴν ἀρχαίαν ἀράν, καὶ τοῦτον ἡμῖν δωρησάμενος, κραταίωμα καὶ καταφυγήν, καὶ ἀσφαλη κρηπῖδα· διʼ οὗ τοὺς ἐχθροὺς ἡμῶν, νῦν κερατιοῦμεν.
ltx/gr_gr_cog/tr.d045:trMA.Ode9C12.incipit	Ὅτι σειραῖς συσφίγγομαι, ἀμετρήτων μου…
ltx/gr_gr_cog/tr.d045:trMA.Ode9C12.melody	@ltx/gr_gr_cog/he.h.m8:heHE.EvlogitosOKyrios.name
ltx/gr_gr_cog/tr.d045:trMA.Ode9C12.mode	@ltx/gr_gr_cog/miscellanea:misc.Mode8
ltx/gr_gr_cog/tr.d045:trMA.Ode9C12.ode	@ltx/gr_gr_cog/miscellanea:misc.Ode9
ltx/gr_gr_cog/tr.d045:trMA.Ode9C12.text	Ὅτι σειραῖς συσφίγγομαι, ἀμετρήτων μου κακῶν, καὶ τὰς τρίβους σου τὰς σωτηρίους Χριστέ, ἑκὼν ἐπιγνῶναι οὐ βούλομαι, τῷ σῷ με ἐπίστρεψον Σταυρῷ, τὴν πώρωσίν μου λύων, διʼ ἄφατον ἔλεος, τῆς σῆς εὐσπλαγχνίας.
ltx/gr_gr_cog/tr.d045:trMA.Ode9C13.incipit	Τὴν Φαρισαίου ἔπαρσιν, μιμησάμενος κακῶς…
ltx/gr_gr_cog/tr.d045:trMA.Ode9C13.melody	@ltx/gr_gr_cog/he.h.m8:heHE.EvlogitosOKyrios.name
ltx/gr_gr_cog/tr.d045:trMA.Ode9C13.mode	@ltx/gr_gr_cog/miscellanea:misc.Mode8
ltx/gr_gr_cog/tr.d045:trMA.Ode9C13.ode	@ltx/gr_gr_cog/miscellanea:misc.Ode9
ltx/gr_gr_cog/tr.d045:trMA.Ode9C13.text	Τὴν Φαρισαίου ἔπαρσιν, μιμησάμενος κακῶς, κατηνέχθην, πτῶμα χαλεπὸν καὶ δεινόν, καὶ κεῖμαι ἐχθρῶν καταπάτημα, ἀλλʼ οἴκτειρον σῶσόν με Χριστέ, σεαυτὸν διʼ οἶκτον, ταπεινώσας ὕψιστε, Βασιλεῦ τῆς δόξης.
ltx/gr_gr_cog/tr.d045:trMA.Ode9C1T.incipit	Αἱ γενεαί σε ἅπασαι, μακαρίζουσιν…
ltx/gr_gr_cog/tr.d045:trMA.Ode9C1T.melody	@ltx/gr_gr_cog/he.h.m8:heHE.EvlogitosOKyrios.name
ltx/gr_gr_cog/tr.d045:trMA.Ode9C1T.mode	@ltx/gr_gr_cog/miscellanea:misc.Mode8
ltx/gr_gr_cog/tr.d045:trMA.Ode9C1T.ode	@ltx/gr_gr_cog/miscellanea:misc.Ode9
ltx/gr_gr_cog/tr.d045:trMA.Ode9C1T.text	Αἱ γενεαί σε ἅπασαι, μακαρίζουσιν Ἁγνή· Ἰησοῦς γὰρ μόνος, ὁ τεχθεὶς ἐκ τῆς σῆς νηδύος, αὐτὸς ὡς ἐπίσταται, ἐποίησε Κόρη μετὰ σοῦ, Παρθένε μεγαλεῖα, ὃν δυσώπει σῴζεσθαι, ποίμνην καὶ λαόν σου.
ltx/gr_gr_cog/tr.d045:trMA.Ode9C21.greekmelody	@ltx/gr_gr_cog/he.h.m8:heHE.EvlogitosOKyrios.greekname
ltx/gr_gr_cog/tr.d045:trMA.Ode9C21.incipit	Εὐλογητὸς Κύριος, ὁ Θεὸς τοῦ…
ltx/gr_gr_cog/tr.d045:trMA.Ode9C21.melody	@ltx/gr_gr_cog/he.h.m8:heHE.EvlogitosOKyrios.name
ltx/gr_gr_cog/tr.d045:trMA.Ode9C21.mode	@ltx/gr_gr_cog/miscellanea:misc.Mode8
ltx/gr_gr_cog/tr.d045:trMA.Ode9C21.ode	@ltx/gr_gr_cog/miscellanea:misc.Ode9
ltx/gr_gr_cog/tr.d045:trMA.Ode9C21.text	Εὐλογητὸς Κύριος, ὁ Θεὸς τοῦ Ἰσραήλ, ὁ Σταυρῷ σου λύσας, τὴν ἀρχαίαν ἀράν, καὶ τοῦτον τιθεὶς ἡμῖν εἰς προσκύνησιν, αὐτὸν ἀσπαζόμενοι πιστῶς, αὐτὸν καὶ ἀνυμνοῦντες, σοῦ τὸ μέγα ἔλεος, ὑμνοῦμεν ἀπαύστως.
ltx/gr_gr_cog/tr.d045:trMA.Ode9C22.incipit	Τῆς Ἐκκλησίας καύχημα, σὺ εἶ…
ltx/gr_gr_cog/tr.d045:trMA.Ode9C22.melody	@ltx/gr_gr_cog/he.h.m8:heHE.EvlogitosOKyrios.name
ltx/gr_gr_cog/tr.d045:trMA.Ode9C22.mode	@ltx/gr_gr_cog/miscellanea:misc.Mode8
ltx/gr_gr_cog/tr.d045:trMA.Ode9C22.ode	@ltx/gr_gr_cog/miscellanea:misc.Ode9
ltx/gr_gr_cog/tr.d045:trMA.Ode9C22.text	Τῆς Ἐκκλησίας καύχημα, σὺ εἶ τίμιε Σταυρέ, βασιλείας ὅπλον, καὶ τοῦ Κόσμου παντός, εἰρήνης βραβεῖον θεότευκτον. Σταυρὲ Ὀρθοδόξων ἡ χαρά, τῆς Οἰκουμένης φύλαξ, φύλαξον ἁγίασον, τοὺς σὲ προσκυνοῦντας.
ltx/gr_gr_cog/tr.d045:trMA.Ode9C2A1.incipit	Τὸν Μανασσῆν ὡς ἔσωσας, μεταγνόντα…
ltx/gr_gr_cog/tr.d045:trMA.Ode9C2A1.melody	@ltx/gr_gr_cog/he.h.m8:heHE.EvlogitosOKyrios.name
ltx/gr_gr_cog/tr.d045:trMA.Ode9C2A1.mode	@ltx/gr_gr_cog/miscellanea:misc.Mode8
ltx/gr_gr_cog/tr.d045:trMA.Ode9C2A1.ode	@ltx/gr_gr_cog/miscellanea:misc.Ode9
ltx/gr_gr_cog/tr.d045:trMA.Ode9C2A1.text	Τὸν Μανασσῆν ὡς ἔσωσας, μεταγνόντα ὁ Θεός, σῶσον κᾀμέ, δάκρυσι μετανοοῦντα πικρῶς, καὶ μὴ ἀποστρέψῃς τὸν δοῦλόν σου· ἐξέκλινα γάρ μου τὴν ψυχήν, ὡς πάλαι Ἰσραὴλ ἐκεῖνος, πάσας τὰς ἡμέρας μου, ζῶν ἐν ἀσωτίᾳ.
ltx/gr_gr_cog/tr.d045:trMA.Ode9C2H.greekmelody	@ltx/gr_gr_cog/he.h.m8:heHE.EvlogitosOKyrios.greekname
ltx/gr_gr_cog/tr.d045:trMA.Ode9C2H.incipit	@ltx/gr_gr_cog/he.h.m8:heHE.EvlogitosOKyrios.incipit
ltx/gr_gr_cog/tr.d045:trMA.Ode9C2H.melody	@ltx/gr_gr_cog/he.h.m8:heHE.EvlogitosOKyrios.melody
ltx/gr_gr_cog/tr.d045:trMA.Ode9C2H.mode	@ltx/gr_gr_cog/miscellanea:misc.Mode8
ltx/gr_gr_cog/tr.d045:trMA.Ode9C2H.ode	@ltx/gr_gr_cog/miscellanea:misc.Ode9
ltx/gr_gr_cog/tr.d045:trMA.Ode9C2H.text	@ltx/gr_gr_cog/he.h.m8:heHE.EvlogitosOKyrios.text
ltx/gr_gr_cog/tr.d045:trMA.Ode9C2T.incipit	Ἐν τῷ Σταυρῷ ὡς ἵστατο…
ltx/gr_gr_cog/tr.d045:trMA.Ode9C2T.melody	@ltx/gr_gr_cog/he.h.m8:heHE.EvlogitosOKyrios.name
ltx/gr_gr_cog/tr.d045:trMA.Ode9C2T.mode	@ltx/gr_gr_cog/miscellanea:misc.Mode8
ltx/gr_gr_cog/tr.d045:trMA.Ode9C2T.ode	@ltx/gr_gr_cog/miscellanea:misc.Ode9
ltx/gr_gr_cog/tr.d045:trMA.Ode9C2T.text	Ἐν τῷ Σταυρῷ ὡς ἵστατο, ἡ Ἀμνάς σου Ἰησοῦ, τὸν Ποιμένα, καὶ Δεσπότην αὐτῆς, ὁρῶσα πικρῶς ἐπωδύρετο, καὶ σπλάγχνα κινοῦσα ἐπὶ σοί, Χριστὲ ἀνεκαλεῖτο. τί τὸ ξένον θέαμα; ἡ ζωὴ πῶς θνῄσκεις;
ltx/gr_gr_cog/tr.d045:trMA.Ode9C2Tr.incipit	Τριὰς ἁγία δόξα σοι, ἡ…
ltx/gr_gr_cog/tr.d045:trMA.Ode9C2Tr.melody	@ltx/gr_gr_cog/he.h.m8:heHE.EvlogitosOKyrios.name
ltx/gr_gr_cog/tr.d045:trMA.Ode9C2Tr.mode	@ltx/gr_gr_cog/miscellanea:misc.Mode8
ltx/gr_gr_cog/tr.d045:trMA.Ode9C2Tr.ode	@ltx/gr_gr_cog/miscellanea:misc.Ode9
ltx/gr_gr_cog/tr.d045:trMA.Ode9C2Tr.text	Τριὰς ἁγία δόξα σοι, ἡ Ὁμότιμος Μονάς, θεία φύσις, μία βασιλεία φρικτή. Ὁ Πατήρ, ὁ Υἱὸς σὺν τῷ Πνεύματι, τὸ φῶς τὸ ἀπρόσιτον παντί, ἡ ἄναρχος Θεότης, σῶσον τοὺς λατρεύοντας, σοὶ τῷ πάντων Κτίστῃ.
ltx/gr_gr_cog/tr.d045:trTE.Troparion.incipit	@ltx/gr_gr_cog/ho.ho07:hoLI.TonStavronSou.incipit
ltx/gr_gr_cog/tr.d045:trTE.Troparion.melody	
ltx/gr_gr_cog/tr.d045:trTE.Troparion.mode	@ltx/gr_gr_cog/miscellanea:misc.Mode6
ltx/gr_gr_cog/tr.d045:trTE.Troparion.text	@ltx/gr_gr_cog/ho.ho07:hoLI.TonStavronSou.text
ltx/gr_gr_cog/tr.d045:trTE.Troparion2.incipit	
ltx/gr_gr_cog/tr.d045:trTE.Troparion2.text	
ltx/gr_gr_cog/tr.d045:trVE.AposIdiomelon1.incipit	Μεγαλοῤῥήμων Φαρισαῖος, ἑβδελύχθη καυχησάμενος, καὶ…
ltx/gr_gr_cog/tr.d045:trVE.AposIdiomelon1.melody	@ltx/gr_gr_cog/miscellanea:misc.Idiomelon
ltx/gr_gr_cog/tr.d045:trVE.AposIdiomelon1.mode	@ltx/gr_gr_cog/miscellanea:misc.Mode8
ltx/gr_gr_cog/tr.d045:trVE.AposIdiomelon1.text	Μεγαλοῤῥήμων Φαρισαῖος, ἑβδελύχθη καυχησάμενος, καὶ Τελώνης ταπεινόφρων, διὰ σιγῆς ἐδικαιώθη προσευξάμενος· διὸ τῶν ἑκατέρων μαθοῦσα ψυχή μου τὸ διάφορον, τὴν ταπεινοφροσύνην ἑλοῦ καὶ κατάσπαζε· Χριστὸς γὰρ ταπεινοῖς ἐπηγγείλατο, διδόναι χάριν ὡς φιλάνθρωπος.
ltx/gr_gr_cog/tr.d045:trVE.AposMartyric.incipit	Μάρτυρες Κυρίου, ἱκετεύσατε τὸν Θεὸν…
ltx/gr_gr_cog/tr.d045:trVE.AposMartyric.melody	
ltx/gr_gr_cog/tr.d045:trVE.AposMartyric.mode	@ltx/gr_gr_cog/miscellanea:misc.Mode8
ltx/gr_gr_cog/tr.d045:trVE.AposMartyric.text	Μάρτυρες Κυρίου, ἱκετεύσατε τὸν Θεὸν ἡμῶν, καὶ αἰτήσασθε ταῖς ψυχαῖς ἡμῶν, πλῆθος οἰκτιρμῶν, καὶ τὸν ἱλασμόν, τῶν πολλῶν παραπτωμάτων δεόμεθα.
ltx/gr_gr_cog/tr.d045:trVE.AposTheotokion.incipit	@ltx/gr_gr_cog/oc.m8.d3:ocMA.AposTheotokion.incipit
ltx/gr_gr_cog/tr.d045:trVE.AposTheotokion.melody	
ltx/gr_gr_cog/tr.d045:trVE.AposTheotokion.mode	@ltx/gr_gr_cog/miscellanea:misc.Mode8
ltx/gr_gr_cog/tr.d045:trVE.AposTheotokion.text	@ltx/gr_gr_cog/oc.m8.d3:ocMA.AposTheotokion.text
ltx/gr_gr_cog/tr.d045:trVE.Stichera01.greekmelody	@ltx/gr_gr_cog/he.a.m8:heAU.TiYmasKalesomen.greekname
ltx/gr_gr_cog/tr.d045:trVE.Stichera01.incipit	Μέσον διϊππεύοντες σήμερον, ἡμερῶν τῆς…
ltx/gr_gr_cog/tr.d045:trVE.Stichera01.melody	@ltx/gr_gr_cog/he.a.m8:heAU.TiYmasKalesomen.name
ltx/gr_gr_cog/tr.d045:trVE.Stichera01.mode	@ltx/gr_gr_cog/miscellanea:misc.Mode8
ltx/gr_gr_cog/tr.d045:trVE.Stichera01.text	Μέσον διϊππεύοντες σήμερον, ἡμερῶν τῆς ἐγκρατείας, τῇ δυνάμει τοῦ Σταυροῦ, τὸν ἐν τούτῳ ὑψωθέντα, μέσον γῆς ὡς κραταιόν, Σωτῆρα, καὶ Θεὸν δοξολογήσωμεν, βοῶντες, θεωροὺς ἡμᾶς ἀνάδειξον, τῶν Παθημάτων σου Δέσποτα, καὶ τῆς σεπτῆς Ἀναστάσεως, δωρούμενος, ἱλασμὸν ἡμῖν, καὶ μέγα ἔλεος.
ltx/gr_gr_cog/tr.d045:trVE.Stichera02.greekmelody	@ltx/gr_gr_cog/he.a.m8:heAU.TiYmasKalesomen.greekname
ltx/gr_gr_cog/tr.d045:trVE.Stichera02.incipit	Πάθη ταπεινώσωμεν σώματος, τῶν βρωμάτων…
ltx/gr_gr_cog/tr.d045:trVE.Stichera02.melody	@ltx/gr_gr_cog/he.a.m8:heAU.TiYmasKalesomen.name
ltx/gr_gr_cog/tr.d045:trVE.Stichera02.mode	@ltx/gr_gr_cog/miscellanea:misc.Mode8
ltx/gr_gr_cog/tr.d045:trVE.Stichera02.text	Πάθη ταπεινώσωμεν σώματος, τῶν βρωμάτων ἀποχῇ, καὶ ἡδονῶν ἀποστροφῇ, καὶ τὸ ξύλον τοῦ Σταυροῦ περιπτυξώμεθα πιστῶς. Ὁρᾶται, ἐμφανῶς γὰρ προσκυνούμενος, καὶ πάντας, ἁγιάζει θείᾳ χάριτι, καὶ τῷ Κυρίῳ βοήσωμεν· Εὐχαριστοῦμέν σοι Εὔσπλαγχνε, τῷ σῴζοντι, διὰ τούτου τὰς ψυχὰς ἡμῶν.
ltx/gr_gr_cog/tr.d045:trVE.Stichera03.incipit	Νῦν τὸν Σταυρὸν προσκυνοῦντες, πάντες…
ltx/gr_gr_cog/tr.d045:trVE.Stichera03.melody	Τὴν Θεοτόκον.
ltx/gr_gr_cog/tr.d045:trVE.Stichera03.mode	@ltx/gr_gr_cog/miscellanea:misc.Mode8
ltx/gr_gr_cog/tr.d045:trVE.Stichera03.text	Νῦν τὸν Σταυρὸν προσκυνοῦντες, πάντες κραυγάζομεν· Χαῖρε ξύλον τῆς ζωῆς, χαῖρε σκῆπτρον ἅγιον τοῦ Χριστοῦ, χαῖρε βροτῶν δόξα ἐπουράνιε, χαῖρε Ἀνάκτων τὸ καύχημα, χαῖρε τὸ κράτος τῆς πίστεως, χαῖρε ὅπλον ἀήττητον, χαῖρε τῶν ἐχθρῶν φυγαδευτήριον, χαῖρε φέγγος λαμπρόν, σωτήριον τοῦ Κόσμου, χαῖρε Μαρτύρων τὸ μέγα κλέος, χαῖρε σθένος Δικαίων, χαῖρε Ἀγγέλων λαμπρότης, χαῖρε πάνσεπτε.
