ltx/gr_gr_cog/le.ep.os:leosLI.Jan06_CommunionHymn.book_abbr	@ltx/gr_gr_cog/bible:Titus.abbr
ltx/gr_gr_cog/le.ep.os:leosLI.Jan06_CommunionHymn.book_string	@ltx/gr_gr_cog/bible:Titus.text
ltx/gr_gr_cog/le.ep.os:leosLI.Jan06_CommunionHymn.chapverse	2:11
ltx/gr_gr_cog/le.ep.os:leosLI.Jan06_CommunionHymn.text	Ἐπεφάνη ἡ χάρις τοῦ Θεοῦ, ἡ σωτήριος πᾶσιν ἀνθρώποις.
ltx/gr_gr_cog/le.ep.os:leosLI.Jan06_CommunionHymn.title	
ltx/gr_gr_cog/le.ep.os:leosLI.Jan06_CommunionHymn.title_abbr	
ltx/gr_gr_cog/le.ep.os:leosLI.Jan06_CommunionHymn.version	@ltx/gr_gr_cog/properties:version.designation
