ltx/gr_gr_cog/me.m04.d22:meDA.commemoration.first	Μνήμη τοῦ Ἁγίου Θεοδώρου τοῦ Συκεώτου
ltx/gr_gr_cog/me.m04.d22:meDA.commemoration.first_name	
ltx/gr_gr_cog/me.m04.d22:meDA.commemoration.first_short	Μνήμη τοῦ Ἁγίου Θεοδώρου τοῦ Συκεώτου
ltx/gr_gr_cog/me.m04.d22:meDA.commemoration.first_title	@ltx/gr_gr_cog/titles:ti.SaintM
ltx/gr_gr_cog/me.m04.d22:meDA.commemoration.full	Μνήμη τοῦ Ὁσίου Πατρὸς ἡμῶν Θεοδώρου τοῦ Συκεώτου
ltx/gr_gr_cog/me.m04.d22:meDA.commemoration.second_name	
ltx/gr_gr_cog/me.m04.d22:meDA.commemoration.second_title	
ltx/gr_gr_cog/me.m04.d22:meDA.date	Τῌ ΚΒʹ ΑΠΡΙΛΙΟΥ
ltx/gr_gr_cog/me.m04.d22:meDA.fordate	διὰ τὴν 22αν Ἀπριλίου
ltx/gr_gr_cog/me.m04.d22:meDA.insert1	καὶ τοῦ Ὁσίου Πατρὸς ἡμῶν Θεοδώρου τοῦ Συκεώτου,
ltx/gr_gr_cog/me.m04.d22:meDA.insert2	οὗ καὶ τὴν μνήμην ἐπιτελοῦμεν·
ltx/gr_gr_cog/me.m04.d22:meDA.note	
ltx/gr_gr_cog/me.m04.d22:meDA.pdfcoverdate	τῆς 22ας Ἀπριλίου,
ltx/gr_gr_cog/me.m04.d22:meDA.pdfheaderdate	τῆς 22ας Ἀπριλίου
ltx/gr_gr_cog/me.m04.d22:meHO.commemorations	
ltx/gr_gr_cog/me.m04.d22:meHO.note1	
ltx/gr_gr_cog/me.m04.d22:meHO.note2	
ltx/gr_gr_cog/me.m04.d22:meHO.number	
ltx/gr_gr_cog/me.m04.d22:meHO.rank	
ltx/gr_gr_cog/me.m04.d22:meLE.commemoration1	Μνήμη τοῦ Ὁσίου Πατρὸς ἡμῶν Θεοδώρου τοῦ Συκεώτου
ltx/gr_gr_cog/me.m04.d22:meLE.commemoration2	
ltx/gr_gr_cog/me.m04.d22:meLI.Kontakion1.greekmelody	@ltx/gr_gr_cog/me.m04.d22:meMA.Kontakion1.greekmelody
ltx/gr_gr_cog/me.m04.d22:meLI.Kontakion1.incipit	@ltx/gr_gr_cog/me.m04.d22:meMA.Kontakion1.incipit
ltx/gr_gr_cog/me.m04.d22:meLI.Kontakion1.melody	@ltx/gr_gr_cog/me.m04.d22:meMA.Kontakion1.melody
ltx/gr_gr_cog/me.m04.d22:meLI.Kontakion1.mode	@ltx/gr_gr_cog/me.m04.d22:meMA.Kontakion1.mode
ltx/gr_gr_cog/me.m04.d22:meLI.Kontakion1.text	@ltx/gr_gr_cog/me.m04.d22:meMA.Kontakion1.text
ltx/gr_gr_cog/me.m04.d22:meLI.MM.CommunionHymn.text	@ltx/gr_gr_cog/properties:media.key
ltx/gr_gr_cog/me.m04.d22:meLI.Megalynarion.text	
ltx/gr_gr_cog/me.m04.d22:meMA.C1.acrostic.notice1	οὗ ἡ Ἀκροστιχίς·
ltx/gr_gr_cog/me.m04.d22:meMA.C1.acrostic.text	Θεῖό[ν σε δ]ῶρον παμμάκαρ μέλπω, Πάτερ. Ὁ Ἰωσήφ.
ltx/gr_gr_cog/me.m04.d22:meMA.C1.acrostic.title	Κανὼν τοῦ Ἁγίου,
ltx/gr_gr_cog/me.m04.d22:meMA.C1.title	@ltx/gr_gr_cog/titles:ti.CanonSaintM
ltx/gr_gr_cog/me.m04.d22:meMA.C1.verse	@ltx/gr_gr_cog/prayers:pr.verse_SaintM.text
ltx/gr_gr_cog/me.m04.d22:meMA.Kontakion1.greekmelody	@ltx/gr_gr_cog/he.a.m3:heAU.IParthenosSimeron.greekname
ltx/gr_gr_cog/me.m04.d22:meMA.Kontakion1.incipit	Ὡς πυρίνῳ ἅρματι, ταῖς ἀρεταῖς…
ltx/gr_gr_cog/me.m04.d22:meMA.Kontakion1.melody	@ltx/gr_gr_cog/he.a.m3:heAU.IParthenosSimeron.name
ltx/gr_gr_cog/me.m04.d22:meMA.Kontakion1.mode	@ltx/gr_gr_cog/miscellanea:misc.Mode3
ltx/gr_gr_cog/me.m04.d22:meMA.Kontakion1.text	Ὡς πυρίνῳ ἅρματι, ταῖς ἀρεταῖς Θεοφόρε, ἐπιβὰς ἀνέδραμες, εἰς οὐρανίους οἰκήσεις, Ἄγγελος μετὰ ἀνθρώπων συμβιοτεύων, ἄνθρωπος σὺν τοῖς Ἀγγέλοις περιχορεύων· διὰ τοῦτο ἀνεδείχθης, θαυμάτων θεῖον, δοχεῖον Θεόδωρε.
ltx/gr_gr_cog/me.m04.d22:meMA.Ode1C11.greekmelody	@ltx/gr_gr_cog/he.h.m4:heHE.ToOdigisantiPalai.greekname
ltx/gr_gr_cog/me.m04.d22:meMA.Ode1C11.incipit	Θεοφεγγῆ σε ἀστέρα, ὁ νοητὸς…
ltx/gr_gr_cog/me.m04.d22:meMA.Ode1C11.melody	@ltx/gr_gr_cog/he.h.m4:heHE.ToOdigisantiPalai.name
ltx/gr_gr_cog/me.m04.d22:meMA.Ode1C11.mode	@ltx/gr_gr_cog/miscellanea:misc.Mode4
ltx/gr_gr_cog/me.m04.d22:meMA.Ode1C11.ode	@ltx/gr_gr_cog/miscellanea:misc.Ode1
ltx/gr_gr_cog/me.m04.d22:meMA.Ode1C11.text	Θεοφεγγῆ σε ἀστέρα, ὁ νοητὸς Ἥλιος, τῷ στερεώματι Σοφέ, τῆς Ἐκκλησίας ἀνέδειξε, βολὰς θαυμάτων ἐκπέμποντα πάντοτε, καὶ παθημάτων τὴν ἀχλὺν ἀφανίζοντα.
ltx/gr_gr_cog/me.m04.d22:meMA.Ode1C12.incipit	Ἐκ μητρικῆς σε νηδύος, ὁ…
ltx/gr_gr_cog/me.m04.d22:meMA.Ode1C12.melody	@ltx/gr_gr_cog/he.h.m4:heHE.ToOdigisantiPalai.name
ltx/gr_gr_cog/me.m04.d22:meMA.Ode1C12.mode	@ltx/gr_gr_cog/miscellanea:misc.Mode4
ltx/gr_gr_cog/me.m04.d22:meMA.Ode1C12.ode	@ltx/gr_gr_cog/miscellanea:misc.Ode1
ltx/gr_gr_cog/me.m04.d22:meMA.Ode1C12.text	Ἐκ μητρικῆς σε νηδύος, ὁ Ποιητὴς Ὅσιε, Ἱερεμίαν ὡς τὸ πρίν, καθαγιάσας εἰργάσατο, σκεῦος τοῦ Πνεύματος εὔχρηστον, πνεύματα ἀποσοβοῦντα, πονηρὰ Πάτερ Θεόδωρε.
ltx/gr_gr_cog/me.m04.d22:meMA.Ode1C13.incipit	Ἱδρῶσι τῆς ἐγκρατείας, φλόγα παθῶν…
ltx/gr_gr_cog/me.m04.d22:meMA.Ode1C13.melody	@ltx/gr_gr_cog/he.h.m4:heHE.ToOdigisantiPalai.name
ltx/gr_gr_cog/me.m04.d22:meMA.Ode1C13.mode	@ltx/gr_gr_cog/miscellanea:misc.Mode4
ltx/gr_gr_cog/me.m04.d22:meMA.Ode1C13.ode	@ltx/gr_gr_cog/miscellanea:misc.Ode1
ltx/gr_gr_cog/me.m04.d22:meMA.Ode1C13.text	Ἱδρῶσι τῆς ἐγκρατείας, φλόγα παθῶν ἔσβεσας, καὶ ἐπομβρίᾳ προσευχῶν, ῥεῖθρα θαυμάτων ἔβλυσας, καύσωνα ἀῤῥωστημάτων σβεννύοντα, Πάτερ Θεόδωρε.
ltx/gr_gr_cog/me.m04.d22:meMA.Ode1C1H.greekmelody	@ltx/gr_gr_cog/he.h.m4:heHE.ToOdigisantiPalai.greekname
ltx/gr_gr_cog/me.m04.d22:meMA.Ode1C1H.incipit	@ltx/gr_gr_cog/he.h.m4:heHE.ToOdigisantiPalai.incipit
ltx/gr_gr_cog/me.m04.d22:meMA.Ode1C1H.melody	@ltx/gr_gr_cog/he.h.m4:heHE.ToOdigisantiPalai.melody
ltx/gr_gr_cog/me.m04.d22:meMA.Ode1C1H.mode	@ltx/gr_gr_cog/miscellanea:misc.Mode4
ltx/gr_gr_cog/me.m04.d22:meMA.Ode1C1H.ode	@ltx/gr_gr_cog/miscellanea:misc.Ode1
ltx/gr_gr_cog/me.m04.d22:meMA.Ode1C1H.text	@ltx/gr_gr_cog/he.h.m4:heHE.ToOdigisantiPalai.text
ltx/gr_gr_cog/me.m04.d22:meMA.Ode1C1T.incipit	Ὁ ἀγεώργητος βότρυς, σοῦ ἐκ…
ltx/gr_gr_cog/me.m04.d22:meMA.Ode1C1T.melody	@ltx/gr_gr_cog/he.h.m4:heHE.ToOdigisantiPalai.name
ltx/gr_gr_cog/me.m04.d22:meMA.Ode1C1T.mode	@ltx/gr_gr_cog/miscellanea:misc.Mode4
ltx/gr_gr_cog/me.m04.d22:meMA.Ode1C1T.ode	@ltx/gr_gr_cog/miscellanea:misc.Ode1
ltx/gr_gr_cog/me.m04.d22:meMA.Ode1C1T.text	Ὁ ἀγεώργητος βότρυς, σοῦ ἐκ γαστρὸς ἤνθησε, Παρθενομῆτορ γλυκασμόν, ἀναβλαστάνων ἀφέσεως, καὶ εὐφροσύνης πανάχραντε, ἅπασι τοῖς ἐκ τῆς μέθης, τῶν δεινῶν παραφρονήσασιν.
ltx/gr_gr_cog/me.m04.d22:meMA.Ode3C11.greekmelody	@ltx/gr_gr_cog/he.h.m4:heHE.OStereonVrontin.greekname
ltx/gr_gr_cog/me.m04.d22:meMA.Ode3C11.incipit	Ὡς θαυμαστὸς ὁ βίος σου…
ltx/gr_gr_cog/me.m04.d22:meMA.Ode3C11.melody	@ltx/gr_gr_cog/he.h.m4:heHE.OStereonVrontin.name
ltx/gr_gr_cog/me.m04.d22:meMA.Ode3C11.mode	@ltx/gr_gr_cog/miscellanea:misc.Mode4
ltx/gr_gr_cog/me.m04.d22:meMA.Ode3C11.ode	@ltx/gr_gr_cog/miscellanea:misc.Ode3
ltx/gr_gr_cog/me.m04.d22:meMA.Ode3C11.text	Ὡς θαυμαστὸς ὁ βίος σου θεόφρον! ὡς φοβερὰ τὰ θαύματα! ὡς ὑψηλή σου ἡ πρὸς Θεόν, οἰκείωσις καὶ νεῦσις, καὶ ἀκλινὴς ἀνάβασις! πανένδοξε Θεόδωρε.
ltx/gr_gr_cog/me.m04.d22:meMA.Ode3C12.incipit	Ῥύμην παθῶν ἀνέστειλας παμμάκαρ, τῶν…
ltx/gr_gr_cog/me.m04.d22:meMA.Ode3C12.melody	@ltx/gr_gr_cog/he.h.m4:heHE.OStereonVrontin.name
ltx/gr_gr_cog/me.m04.d22:meMA.Ode3C12.mode	@ltx/gr_gr_cog/miscellanea:misc.Mode4
ltx/gr_gr_cog/me.m04.d22:meMA.Ode3C12.ode	@ltx/gr_gr_cog/miscellanea:misc.Ode3
ltx/gr_gr_cog/me.m04.d22:meMA.Ode3C12.text	Ῥύμην παθῶν ἀνέστειλας παμμάκαρ, τῶν πόνων ἐπιδόσεσι, καὶ τῶν δαιμόνων τὰς δολεράς, ἐξηφάνισας ἐνέδρας, τοῦ Παναγίου Πνεύματος, ἰσχὺϊ Θεόδωρε.
ltx/gr_gr_cog/me.m04.d22:meMA.Ode3C13.incipit	Οἱ τῇ σεπτῇ προστρέχοντες σορῷ…
ltx/gr_gr_cog/me.m04.d22:meMA.Ode3C13.melody	@ltx/gr_gr_cog/he.h.m4:heHE.OStereonVrontin.name
ltx/gr_gr_cog/me.m04.d22:meMA.Ode3C13.mode	@ltx/gr_gr_cog/miscellanea:misc.Mode4
ltx/gr_gr_cog/me.m04.d22:meMA.Ode3C13.ode	@ltx/gr_gr_cog/miscellanea:misc.Ode3
ltx/gr_gr_cog/me.m04.d22:meMA.Ode3C13.text	Οἱ τῇ σεπτῇ προστρέχοντες σορῷ σου, ἐκ ταύτης ἀρυόμεθα, τῶν ἰαμάτων τοὺς θησαυρούς, καὶ θαυμάτων τὰ πελάγη, καὶ δωρεὰν τὴν ἄφθονον, ὑμνοῦντές σε Θεόδωρε.
ltx/gr_gr_cog/me.m04.d22:meMA.Ode3C1H.greekmelody	@ltx/gr_gr_cog/he.h.m4:heHE.OStereonVrontin.greekname
ltx/gr_gr_cog/me.m04.d22:meMA.Ode3C1H.incipit	@ltx/gr_gr_cog/he.h.m4:heHE.OStereonVrontin.incipit
ltx/gr_gr_cog/me.m04.d22:meMA.Ode3C1H.melody	@ltx/gr_gr_cog/he.h.m4:heHE.OStereonVrontin.melody
ltx/gr_gr_cog/me.m04.d22:meMA.Ode3C1H.mode	@ltx/gr_gr_cog/miscellanea:misc.Mode4
ltx/gr_gr_cog/me.m04.d22:meMA.Ode3C1H.ode	@ltx/gr_gr_cog/miscellanea:misc.Ode3
ltx/gr_gr_cog/me.m04.d22:meMA.Ode3C1H.text	@ltx/gr_gr_cog/he.h.m4:heHE.OStereonVrontin.text
ltx/gr_gr_cog/me.m04.d22:meMA.Ode3C1T.incipit	Νόμοι ἐν σοὶ τῆς φύσεως…
ltx/gr_gr_cog/me.m04.d22:meMA.Ode3C1T.melody	@ltx/gr_gr_cog/he.h.m4:heHE.OStereonVrontin.name
ltx/gr_gr_cog/me.m04.d22:meMA.Ode3C1T.mode	@ltx/gr_gr_cog/miscellanea:misc.Mode4
ltx/gr_gr_cog/me.m04.d22:meMA.Ode3C1T.ode	@ltx/gr_gr_cog/miscellanea:misc.Ode3
ltx/gr_gr_cog/me.m04.d22:meMA.Ode3C1T.text	Νόμοι ἐν σοὶ τῆς φύσεως Παρθένε, καινοτομοῦνται· τίκτεις γάρ, ὑπερφυῶς τὸν Δημιουργόν, ὑπὲρ λόγον τὸν Δεσπότην, ὃν ἐκτενῶς ἱκέτευε, σωθῆναι τοὺς δούλους σου.
ltx/gr_gr_cog/me.m04.d22:meMA.Ode3Kathisma1.greekmelody	@ltx/gr_gr_cog/he.a.m4:heAU.OYpsotheisEnToStavro.greekname
ltx/gr_gr_cog/me.m04.d22:meMA.Ode3Kathisma1.incipit	Ἀγωνισάμενος καλῶς Ἱεράρχα, κατὰ πνευμάτων…
ltx/gr_gr_cog/me.m04.d22:meMA.Ode3Kathisma1.melody	@ltx/gr_gr_cog/he.a.m4:heAU.OYpsotheisEnToStavro.name
ltx/gr_gr_cog/me.m04.d22:meMA.Ode3Kathisma1.mode	@ltx/gr_gr_cog/miscellanea:misc.Mode4
ltx/gr_gr_cog/me.m04.d22:meMA.Ode3Kathisma1.text	Ἀγωνισάμενος καλῶς Ἱεράρχα, κατὰ πνευμάτων πονηρῶν ἐξουσίαν, παρὰ Κυρίου ἔλαβες Θεόδωρε, λύειν τὰ νοσήματα, καὶ ἰάσθαι ποικίλα, πάντων ἀῤῥωστήματα, τῶν πιστῶς προστρεχόντων, τῇ σῇ τιμίᾳ πάντοτε σορῷ, ἣν προσκυνοῦντες ἀεὶ εὐφημοῦμέν σε.
ltx/gr_gr_cog/me.m04.d22:meMA.Ode3KathismaSt.incipit	Τὸν ἐξ ἀνάρχου τοῦ Πατρὸς…
ltx/gr_gr_cog/me.m04.d22:meMA.Ode3KathismaSt.melody	@ltx/gr_gr_cog/he.a.m4:heAU.OYpsotheisEnToStavro.name
ltx/gr_gr_cog/me.m04.d22:meMA.Ode3KathismaSt.mode	@ltx/gr_gr_cog/miscellanea:misc.Mode4
ltx/gr_gr_cog/me.m04.d22:meMA.Ode3KathismaSt.text	Τὸν ἐξ ἀνάρχου τοῦ Πατρὸς γεννηθέντα, ἡ ἐπʼ ἐσχάτων σε σαρκὶ τετοκυῖα, ἐπὶ Σταυροῦ κρεμάμενον ὁρῶσά σε Χριστέ· Οἴμοι! ἀνεκραύγαζε, ποθεινότατον Τέκνον, τί, σοι ἀνταπέδωκε, τῶν Ἑβραίων ὁ δῆμος; Ἀλλὰ ἀνάστηθι καὶ σῶσον ὡς Θεός, τὸν κόσμον πάντα, χειρὸς τοῦ ἀλάστορος.
ltx/gr_gr_cog/me.m04.d22:meMA.Ode3KathismaT.incipit	Τῶν ἀκαθάρτων λογισμῶν μου τὰ…
ltx/gr_gr_cog/me.m04.d22:meMA.Ode3KathismaT.melody	@ltx/gr_gr_cog/he.a.m4:heAU.OYpsotheisEnToStavro.name
ltx/gr_gr_cog/me.m04.d22:meMA.Ode3KathismaT.mode	@ltx/gr_gr_cog/miscellanea:misc.Mode4
ltx/gr_gr_cog/me.m04.d22:meMA.Ode3KathismaT.text	Τῶν ἀκαθάρτων λογισμῶν μου τὰ πλήθη, καὶ τῶν ἀτόπων ἐννοιῶν τὰς νιφάδας, τίς ἐξειπεῖν δυνήσεται Παρθένε ἁγνή; τὰς ἐπαναστάσεις δέ, τῶν ἀσάρκων ἐχθρῶν μου, τίς ἐκδιηγήσεται, καὶ τὴν τούτων κακίαν; Ἀλλὰ τῇ σῇ, πρεσβείᾳ ἀγαθή, τούτων μοι πάντων, τὴν λύτρωσιν δώρησαι.
ltx/gr_gr_cog/me.m04.d22:meMA.Ode4C11.greekmelody	@ltx/gr_gr_cog/he.h.m4:heHE.EisakikoaOTheos.greekname
ltx/gr_gr_cog/me.m04.d22:meMA.Ode4C11.incipit	Ποταμὸς ὑπάρχεις σαφῶς, πεπληρωμένος ναμάτων…
ltx/gr_gr_cog/me.m04.d22:meMA.Ode4C11.melody	@ltx/gr_gr_cog/he.h.m4:heHE.EisakikoaOTheos.name
ltx/gr_gr_cog/me.m04.d22:meMA.Ode4C11.mode	@ltx/gr_gr_cog/miscellanea:misc.Mode4
ltx/gr_gr_cog/me.m04.d22:meMA.Ode4C11.ode	@ltx/gr_gr_cog/miscellanea:misc.Ode4
ltx/gr_gr_cog/me.m04.d22:meMA.Ode4C11.text	Ποταμὸς ὑπάρχεις σαφῶς, πεπληρωμένος ναμάτων θείων, χαρισμάτων τε τοῦ Πνεύματος, καταρδεύων ἅπασαν, τὴν Ἐκκλησίαν Πάτερ Θεόδωρε.
ltx/gr_gr_cog/me.m04.d22:meMA.Ode4C12.incipit	Ἀπηγχόνισας τὸν ἐχθρόν, νευραῖς τῶν…
ltx/gr_gr_cog/me.m04.d22:meMA.Ode4C12.melody	@ltx/gr_gr_cog/he.h.m4:heHE.EisakikoaOTheos.name
ltx/gr_gr_cog/me.m04.d22:meMA.Ode4C12.mode	@ltx/gr_gr_cog/miscellanea:misc.Mode4
ltx/gr_gr_cog/me.m04.d22:meMA.Ode4C12.ode	@ltx/gr_gr_cog/miscellanea:misc.Ode4
ltx/gr_gr_cog/me.m04.d22:meMA.Ode4C12.text	Ἀπηγχόνισας τὸν ἐχθρόν, νευραῖς τῶν πόνων τῶν σῶν παμμάκαρ, καὶ τὰ τούτου ἐξωλόθρευσας, πονηρὰ στρατεύματα, τῶν προσευχῶν σου ξίφει Θεόδωρε.
ltx/gr_gr_cog/me.m04.d22:meMA.Ode4C13.incipit	Μελετῶν τὸν νόμον Θεοῦ, ἐν…
ltx/gr_gr_cog/me.m04.d22:meMA.Ode4C13.melody	@ltx/gr_gr_cog/he.h.m4:heHE.EisakikoaOTheos.name
ltx/gr_gr_cog/me.m04.d22:meMA.Ode4C13.mode	@ltx/gr_gr_cog/miscellanea:misc.Mode4
ltx/gr_gr_cog/me.m04.d22:meMA.Ode4C13.ode	@ltx/gr_gr_cog/miscellanea:misc.Ode4
ltx/gr_gr_cog/me.m04.d22:meMA.Ode4C13.text	Μελετῶν τὸν νόμον Θεοῦ, ἐν διεξόδοις τῆς ἐγκρατείας, θεῖον ξύλον ἀνεβλάστησας, εὐκαρπίαν πράξεων, τῶν ἐναρέτων φέρων Θεόδωρε.
ltx/gr_gr_cog/me.m04.d22:meMA.Ode4C1H.greekmelody	@ltx/gr_gr_cog/he.h.m4:heHE.EisakikoaOTheos.greekname
ltx/gr_gr_cog/me.m04.d22:meMA.Ode4C1H.incipit	@ltx/gr_gr_cog/he.h.m4:heHE.EisakikoaOTheos.incipit
ltx/gr_gr_cog/me.m04.d22:meMA.Ode4C1H.melody	@ltx/gr_gr_cog/he.h.m4:heHE.EisakikoaOTheos.melody
ltx/gr_gr_cog/me.m04.d22:meMA.Ode4C1H.mode	@ltx/gr_gr_cog/miscellanea:misc.Mode4
ltx/gr_gr_cog/me.m04.d22:meMA.Ode4C1H.ode	@ltx/gr_gr_cog/miscellanea:misc.Ode4
ltx/gr_gr_cog/me.m04.d22:meMA.Ode4C1H.text	@ltx/gr_gr_cog/he.h.m4:heHE.EisakikoaOTheos.text
ltx/gr_gr_cog/me.m04.d22:meMA.Ode4C1T.incipit	Μακαρία ἐκ γενεῶν, πασῶν ἐδείχθης…
ltx/gr_gr_cog/me.m04.d22:meMA.Ode4C1T.melody	@ltx/gr_gr_cog/he.h.m4:heHE.EisakikoaOTheos.name
ltx/gr_gr_cog/me.m04.d22:meMA.Ode4C1T.mode	@ltx/gr_gr_cog/miscellanea:misc.Mode4
ltx/gr_gr_cog/me.m04.d22:meMA.Ode4C1T.ode	@ltx/gr_gr_cog/miscellanea:misc.Ode4
ltx/gr_gr_cog/me.m04.d22:meMA.Ode4C1T.text	Μακαρία ἐκ γενεῶν, πασῶν ἐδείχθης, Χριστὸν τεκοῦσα, μακαρίους ἐργαζόμενον, τοὺς αὐτῷ δουλεύοντας, Παρθενομῆτορ ἄχραντε Δέσποινα.
ltx/gr_gr_cog/me.m04.d22:meMA.Ode5C11.greekmelody	@ltx/gr_gr_cog/he.h.m4:heHE.AnateilonMoiKyrie.greekname
ltx/gr_gr_cog/me.m04.d22:meMA.Ode5C11.incipit	Ἀκοίμητον λαμπάδα σε, καὶ λύχνον…
ltx/gr_gr_cog/me.m04.d22:meMA.Ode5C11.melody	@ltx/gr_gr_cog/he.h.m4:heHE.AnateilonMoiKyrie.name
ltx/gr_gr_cog/me.m04.d22:meMA.Ode5C11.mode	@ltx/gr_gr_cog/miscellanea:misc.Mode4
ltx/gr_gr_cog/me.m04.d22:meMA.Ode5C11.ode	@ltx/gr_gr_cog/miscellanea:misc.Ode5
ltx/gr_gr_cog/me.m04.d22:meMA.Ode5C11.text	Ἀκοίμητον λαμπάδα σε, καὶ λύχνον μὴ σβεννύμενον, τὸ φῶς τὸ ἄχρονον ἀνέδειξε, τοῖς ζόφῳ κρατουμένοις, τῶν παθῶν Θεόδωρε, καὶ τῇ ἀμαυρότητι, τῶν πολλῶν ἁμαρτιῶν.
ltx/gr_gr_cog/me.m04.d22:meMA.Ode5C12.incipit	Καλῶς παιδοτριβοῦντά σε, τὸν Μάρτυρα…
ltx/gr_gr_cog/me.m04.d22:meMA.Ode5C12.melody	@ltx/gr_gr_cog/he.h.m4:heHE.AnateilonMoiKyrie.name
ltx/gr_gr_cog/me.m04.d22:meMA.Ode5C12.mode	@ltx/gr_gr_cog/miscellanea:misc.Mode4
ltx/gr_gr_cog/me.m04.d22:meMA.Ode5C12.ode	@ltx/gr_gr_cog/miscellanea:misc.Ode5
ltx/gr_gr_cog/me.m04.d22:meMA.Ode5C12.text	Καλῶς παιδοτριβοῦντά σε, τὸν Μάρτυρα Γεώργιον, ἐξ ἁπαλῶν ὀνύχων ἔσχηκας, καὶ τούτου ἐμιμήσω, τὸ ἐν πᾶσι πρόθυμον, καὶ τὴν πρὸς τὸν Κύριον, Πάτερ Ὅσιε στοργήν.
ltx/gr_gr_cog/me.m04.d22:meMA.Ode5C13.incipit	Ἀνόθευτον ἐγκράτειαν, ὑπομονὴν ἀσύγκριτον, πίστιν…
ltx/gr_gr_cog/me.m04.d22:meMA.Ode5C13.melody	@ltx/gr_gr_cog/he.h.m4:heHE.AnateilonMoiKyrie.name
ltx/gr_gr_cog/me.m04.d22:meMA.Ode5C13.mode	@ltx/gr_gr_cog/miscellanea:misc.Mode4
ltx/gr_gr_cog/me.m04.d22:meMA.Ode5C13.ode	@ltx/gr_gr_cog/miscellanea:misc.Ode5
ltx/gr_gr_cog/me.m04.d22:meMA.Ode5C13.text	Ἀνόθευτον ἐγκράτειαν, ὑπομονὴν ἀσύγκριτον, πίστιν ἐλπίδα καὶ ταπείνωσιν, ἔσχες ὑπὲρ ἄνθρωπον· ὅθεν ὑπερβάλλουσαν, χάριν εὗρες ἐκ Θεοῦ.
ltx/gr_gr_cog/me.m04.d22:meMA.Ode5C1H.greekmelody	@ltx/gr_gr_cog/he.h.m4:heHE.AnateilonMoiKyrie.greekname
ltx/gr_gr_cog/me.m04.d22:meMA.Ode5C1H.incipit	@ltx/gr_gr_cog/he.h.m4:heHE.AnateilonMoiKyrie.incipit
ltx/gr_gr_cog/me.m04.d22:meMA.Ode5C1H.melody	@ltx/gr_gr_cog/he.h.m4:heHE.AnateilonMoiKyrie.melody
ltx/gr_gr_cog/me.m04.d22:meMA.Ode5C1H.mode	@ltx/gr_gr_cog/miscellanea:misc.Mode4
ltx/gr_gr_cog/me.m04.d22:meMA.Ode5C1H.ode	@ltx/gr_gr_cog/miscellanea:misc.Ode5
ltx/gr_gr_cog/me.m04.d22:meMA.Ode5C1H.text	@ltx/gr_gr_cog/he.h.m4:heHE.AnateilonMoiKyrie.text
ltx/gr_gr_cog/me.m04.d22:meMA.Ode5C1T.incipit	Ῥανίσι τοῦ ἐλέους σου, κατάρδευσον…
ltx/gr_gr_cog/me.m04.d22:meMA.Ode5C1T.melody	@ltx/gr_gr_cog/he.h.m4:heHE.AnateilonMoiKyrie.name
ltx/gr_gr_cog/me.m04.d22:meMA.Ode5C1T.mode	@ltx/gr_gr_cog/miscellanea:misc.Mode4
ltx/gr_gr_cog/me.m04.d22:meMA.Ode5C1T.ode	@ltx/gr_gr_cog/miscellanea:misc.Ode5
ltx/gr_gr_cog/me.m04.d22:meMA.Ode5C1T.text	Ῥανίσι τοῦ ἐλέους σου, κατάρδευσον Πανάχραντε, τὴν ἐκτακεῖσάν μου διάνοιαν, φλογμῷ τῆς ἁμαρτίας, καὶ τὸν ἐσβεσμένον μου, τῆς καρδίας ἄναψον, λύχνον πύλη τοῦ φωτός.
ltx/gr_gr_cog/me.m04.d22:meMA.Ode6C11.greekmelody	@ltx/gr_gr_cog/he.h.m4:heHE.ZaliMeLogismon.greekname
ltx/gr_gr_cog/me.m04.d22:meMA.Ode6C11.incipit	Μέριμναν τῶν γηΐνων ἀπεκρούσω, ὅλον…
ltx/gr_gr_cog/me.m04.d22:meMA.Ode6C11.melody	@ltx/gr_gr_cog/he.h.m4:heHE.ZaliMeLogismon.name
ltx/gr_gr_cog/me.m04.d22:meMA.Ode6C11.mode	@ltx/gr_gr_cog/miscellanea:misc.Mode4
ltx/gr_gr_cog/me.m04.d22:meMA.Ode6C11.ode	@ltx/gr_gr_cog/miscellanea:misc.Ode6
ltx/gr_gr_cog/me.m04.d22:meMA.Ode6C11.text	Μέριμναν τῶν γηΐνων ἀπεκρούσω, ὅλον δὲ ἐκένωσας, τὸν πόθον πρὸς τὸν Δεσπότην, ἐνηδόμενος τούτου καλλοναῖς, καὶ ταῖς ἀναβλυζούσαις, Πάτερ ἐκεῖθεν ἐλλάμψεσιν.
ltx/gr_gr_cog/me.m04.d22:meMA.Ode6C12.incipit	Ἔλυσας παγετὸν τῆς ἁμαρτίας, κρύει…
ltx/gr_gr_cog/me.m04.d22:meMA.Ode6C12.melody	@ltx/gr_gr_cog/he.h.m4:heHE.ZaliMeLogismon.name
ltx/gr_gr_cog/me.m04.d22:meMA.Ode6C12.mode	@ltx/gr_gr_cog/miscellanea:misc.Mode4
ltx/gr_gr_cog/me.m04.d22:meMA.Ode6C12.ode	@ltx/gr_gr_cog/miscellanea:misc.Ode6
ltx/gr_gr_cog/me.m04.d22:meMA.Ode6C12.text	Ἔλυσας παγετὸν τῆς ἁμαρτίας, κρύει πιεζόμενος, κλωβοῦ ἱστάμενος μέσον, καὶ ὡς ἄσαρκος Πάτερ, προσβολάς, ὑπήνεγκας ἀέρων, θείᾳ θαλπόμενος χάριτι.
ltx/gr_gr_cog/me.m04.d22:meMA.Ode6C13.incipit	Λάρνακι ἱερᾷ σου προσιόντες, ὀσμῆς…
ltx/gr_gr_cog/me.m04.d22:meMA.Ode6C13.melody	@ltx/gr_gr_cog/he.h.m4:heHE.ZaliMeLogismon.name
ltx/gr_gr_cog/me.m04.d22:meMA.Ode6C13.mode	@ltx/gr_gr_cog/miscellanea:misc.Mode4
ltx/gr_gr_cog/me.m04.d22:meMA.Ode6C13.ode	@ltx/gr_gr_cog/miscellanea:misc.Ode6
ltx/gr_gr_cog/me.m04.d22:meMA.Ode6C13.text	Λάρνακι ἱερᾷ σου προσιόντες, ὀσμῆς θείας γνώσεως, πληρούμεθα Ἱεράρχα, δυσωδίας λυτρούμενοι παθῶν, οἱ πόθῳ σε τιμῶντες, θαυματουργὲ Πάτερ Ὅσιε.
ltx/gr_gr_cog/me.m04.d22:meMA.Ode6C1H.greekmelody	@ltx/gr_gr_cog/he.h.m4:heHE.ZaliMeLogismon.greekname
ltx/gr_gr_cog/me.m04.d22:meMA.Ode6C1H.incipit	@ltx/gr_gr_cog/he.h.m4:heHE.ZaliMeLogismon.incipit
ltx/gr_gr_cog/me.m04.d22:meMA.Ode6C1H.melody	@ltx/gr_gr_cog/he.h.m4:heHE.ZaliMeLogismon.melody
ltx/gr_gr_cog/me.m04.d22:meMA.Ode6C1H.mode	@ltx/gr_gr_cog/miscellanea:misc.Mode4
ltx/gr_gr_cog/me.m04.d22:meMA.Ode6C1H.ode	@ltx/gr_gr_cog/miscellanea:misc.Ode6
ltx/gr_gr_cog/me.m04.d22:meMA.Ode6C1H.text	@ltx/gr_gr_cog/he.h.m4:heHE.ZaliMeLogismon.text
ltx/gr_gr_cog/me.m04.d22:meMA.Ode6C1T.incipit	Παθῶν με τρικυμία συνταράσσει, βυθὸς…
ltx/gr_gr_cog/me.m04.d22:meMA.Ode6C1T.melody	@ltx/gr_gr_cog/he.h.m4:heHE.ZaliMeLogismon.name
ltx/gr_gr_cog/me.m04.d22:meMA.Ode6C1T.mode	@ltx/gr_gr_cog/miscellanea:misc.Mode4
ltx/gr_gr_cog/me.m04.d22:meMA.Ode6C1T.ode	@ltx/gr_gr_cog/miscellanea:misc.Ode6
ltx/gr_gr_cog/me.m04.d22:meMA.Ode6C1T.text	Παθῶν με τρικυμία συνταράσσει, βυθὸς ἀπογνώσεως, χειμάζει μου τὴν καρδίαν, κυβερνήτην κυήσασα Χριστόν, Παρθένε καὶ Σωτῆρα, ῥῦσαι καὶ σῶσόν με δέομαι.
ltx/gr_gr_cog/me.m04.d22:meMA.Ode7C11.greekmelody	@ltx/gr_gr_cog/he.h.m4:heHE.TonEnKaminoTouPyros.greekname
ltx/gr_gr_cog/me.m04.d22:meMA.Ode7C11.incipit	Ὡς ἀψευδὴς Ἱεράρχης, θυσίαν ἀναίμακτον…
ltx/gr_gr_cog/me.m04.d22:meMA.Ode7C11.melody	@ltx/gr_gr_cog/he.h.m4:heHE.TonEnKaminoTouPyros.name
ltx/gr_gr_cog/me.m04.d22:meMA.Ode7C11.mode	@ltx/gr_gr_cog/miscellanea:misc.Mode4
ltx/gr_gr_cog/me.m04.d22:meMA.Ode7C11.ode	@ltx/gr_gr_cog/miscellanea:misc.Ode7
ltx/gr_gr_cog/me.m04.d22:meMA.Ode7C11.text	Ὡς ἀψευδὴς Ἱεράρχης, θυσίαν ἀναίμακτον, προσήγαγες ἐν Πνεύματι, καὶ παθῶν νεκρότητι, θῦμα εὐῶδες Παμμάκαρ, σεαυτὸν τῷ Δεσπότῃ, προσήνεγκας ἐν πίστει.
ltx/gr_gr_cog/me.m04.d22:meMA.Ode7C12.incipit	Πῦρ ἡδονῶν ἐγκρατείας, ἱδρῶσι κατέσβεσας…
ltx/gr_gr_cog/me.m04.d22:meMA.Ode7C12.melody	@ltx/gr_gr_cog/he.h.m4:heHE.TonEnKaminoTouPyros.name
ltx/gr_gr_cog/me.m04.d22:meMA.Ode7C12.mode	@ltx/gr_gr_cog/miscellanea:misc.Mode4
ltx/gr_gr_cog/me.m04.d22:meMA.Ode7C12.ode	@ltx/gr_gr_cog/miscellanea:misc.Ode7
ltx/gr_gr_cog/me.m04.d22:meMA.Ode7C12.text	Πῦρ ἡδονῶν ἐγκρατείας, ἱδρῶσι κατέσβεσας, αὐχμόν τε γῆς ἀνέστειλας, ὄμβρων ἐπικλύσεσι θαυματουργέ, ὡς Ἠλίας οὐρανοὺς κεκλεισμένους, εὐχαῖς σου ὑπανοίγων.
ltx/gr_gr_cog/me.m04.d22:meMA.Ode7C13.incipit	Ἁγιασθεὶς ἀπὸ βρέφους, εὐχῆς γενναιότητι…
ltx/gr_gr_cog/me.m04.d22:meMA.Ode7C13.melody	@ltx/gr_gr_cog/he.h.m4:heHE.TonEnKaminoTouPyros.name
ltx/gr_gr_cog/me.m04.d22:meMA.Ode7C13.mode	@ltx/gr_gr_cog/miscellanea:misc.Mode4
ltx/gr_gr_cog/me.m04.d22:meMA.Ode7C13.ode	@ltx/gr_gr_cog/miscellanea:misc.Ode7
ltx/gr_gr_cog/me.m04.d22:meMA.Ode7C13.text	Ἁγιασθεὶς ἀπὸ βρέφους, εὐχῆς γενναιότητι στειρευούσας ἐποίησας, γαστέρας πολύπαιδας, τυφλοῖς παρέσχες τὸ βλέπειν, καὶ χωλοῖς εὐδρομίαν, Θεόδωρε τρισμάκαρ.
ltx/gr_gr_cog/me.m04.d22:meMA.Ode7C1H.greekmelody	@ltx/gr_gr_cog/he.h.m4:heHE.TonEnKaminoTouPyros.greekname
ltx/gr_gr_cog/me.m04.d22:meMA.Ode7C1H.incipit	@ltx/gr_gr_cog/he.h.m4:heHE.TonEnKaminoTouPyros.incipit
ltx/gr_gr_cog/me.m04.d22:meMA.Ode7C1H.melody	@ltx/gr_gr_cog/he.h.m4:heHE.TonEnKaminoTouPyros.melody
ltx/gr_gr_cog/me.m04.d22:meMA.Ode7C1H.mode	@ltx/gr_gr_cog/miscellanea:misc.Mode4
ltx/gr_gr_cog/me.m04.d22:meMA.Ode7C1H.ode	@ltx/gr_gr_cog/miscellanea:misc.Ode7
ltx/gr_gr_cog/me.m04.d22:meMA.Ode7C1H.text	@ltx/gr_gr_cog/he.h.m4:heHE.TonEnKaminoTouPyros.text
ltx/gr_gr_cog/me.m04.d22:meMA.Ode7C1T.incipit	Τὴν καλλονὴν Ἰακὼβ σε, Θεὸς…
ltx/gr_gr_cog/me.m04.d22:meMA.Ode7C1T.melody	@ltx/gr_gr_cog/he.h.m4:heHE.TonEnKaminoTouPyros.name
ltx/gr_gr_cog/me.m04.d22:meMA.Ode7C1T.mode	@ltx/gr_gr_cog/miscellanea:misc.Mode4
ltx/gr_gr_cog/me.m04.d22:meMA.Ode7C1T.ode	@ltx/gr_gr_cog/miscellanea:misc.Ode7
ltx/gr_gr_cog/me.m04.d22:meMA.Ode7C1T.text	Τὴν καλλονὴν Ἰακὼβ σε, Θεὸς ἐξελέξατο, καὶ ἐν σοὶ κατεσκήνωσε, καὶ σὲ διετήρησε, καὶ μετὰ τόκον Παρθένον, ὥσπερ ἦς πρὸ τοῦ τόκου, Παρθένε Θεοτόκε.
ltx/gr_gr_cog/me.m04.d22:meMA.Ode8C11.greekmelody	@ltx/gr_gr_cog/he.h.m4:heHE.GiKaiPantaTaEnAfti.greekname
ltx/gr_gr_cog/me.m04.d22:meMA.Ode8C11.incipit	Ἐπὶ πέτραν ὑπομονῆς, ἐρείσας σου…
ltx/gr_gr_cog/me.m04.d22:meMA.Ode8C11.melody	@ltx/gr_gr_cog/he.h.m4:heHE.GiKaiPantaTaEnAfti.name
ltx/gr_gr_cog/me.m04.d22:meMA.Ode8C11.mode	@ltx/gr_gr_cog/miscellanea:misc.Mode4
ltx/gr_gr_cog/me.m04.d22:meMA.Ode8C11.ode	@ltx/gr_gr_cog/miscellanea:misc.Ode8
ltx/gr_gr_cog/me.m04.d22:meMA.Ode8C11.text	Ἐπὶ πέτραν ὑπομονῆς, ἐρείσας σου τὰς βάσεις τῆς ψυχῆς, οὐ παρετράπης προσβολαῖς ἐναντίαις, οὐκ ἐσαλεύθης, ἐχθρῶν ἐπηρείαις, ἀλλὰ ὕψος πρὸς θεῖον ἀνέδραμες, ὑπὲρ τῶν πίστει τιμώντων σε πρεσβεύων.
ltx/gr_gr_cog/me.m04.d22:meMA.Ode8C12.incipit	Ῥεῖθρον πρόεισιν ἐκ σοροῦ, ἰάσεων…
ltx/gr_gr_cog/me.m04.d22:meMA.Ode8C12.melody	@ltx/gr_gr_cog/he.h.m4:heHE.GiKaiPantaTaEnAfti.name
ltx/gr_gr_cog/me.m04.d22:meMA.Ode8C12.mode	@ltx/gr_gr_cog/miscellanea:misc.Mode4
ltx/gr_gr_cog/me.m04.d22:meMA.Ode8C12.ode	@ltx/gr_gr_cog/miscellanea:misc.Ode8
ltx/gr_gr_cog/me.m04.d22:meMA.Ode8C12.text	Ῥεῖθρον πρόεισιν ἐκ σοροῦ, ἰάσεων τῆς σῆς θαυματουργέ, καὶ ἀποπλύνει μολυσμοὺς παθημάτων, καὶ σηπεδόνας δεινῶν ἐκκαθαίρει, καὶ πιστῶν καταρδεύει Θεόδωρε, πάντων τὰς καρδίας, τῶν πόθῳ σε τιμώντων.
ltx/gr_gr_cog/me.m04.d22:meMA.Ode8C13.incipit	Ὁ τῶν δώρων τῶν θεϊκῶν…
ltx/gr_gr_cog/me.m04.d22:meMA.Ode8C13.melody	@ltx/gr_gr_cog/he.h.m4:heHE.GiKaiPantaTaEnAfti.name
ltx/gr_gr_cog/me.m04.d22:meMA.Ode8C13.mode	@ltx/gr_gr_cog/miscellanea:misc.Mode4
ltx/gr_gr_cog/me.m04.d22:meMA.Ode8C13.ode	@ltx/gr_gr_cog/miscellanea:misc.Ode8
ltx/gr_gr_cog/me.m04.d22:meMA.Ode8C13.text	Ὁ τῶν δώρων τῶν θεϊκῶν, ἐπώνυμος, καὶ μύστης τοῦ Χριστοῦ, τῶν Ἀσκητῶν ἡ καλλονή, Ἱερέων ὡραιότης, θαυμάτων ἡ βρύσις, ἡ σεπτὴ μυροθήκη τοῦ Πνεύματος, νῦν ἀνευφημείσθω, Θεόδωρος ὁ μέγας.
ltx/gr_gr_cog/me.m04.d22:meMA.Ode8C1H.greekmelody	@ltx/gr_gr_cog/he.h.m4:heHE.GiKaiPantaTaEnAfti.greekname
ltx/gr_gr_cog/me.m04.d22:meMA.Ode8C1H.incipit	@ltx/gr_gr_cog/he.h.m4:heHE.GiKaiPantaTaEnAfti.incipit
ltx/gr_gr_cog/me.m04.d22:meMA.Ode8C1H.melody	@ltx/gr_gr_cog/he.h.m4:heHE.GiKaiPantaTaEnAfti.melody
ltx/gr_gr_cog/me.m04.d22:meMA.Ode8C1H.mode	@ltx/gr_gr_cog/miscellanea:misc.Mode4
ltx/gr_gr_cog/me.m04.d22:meMA.Ode8C1H.ode	@ltx/gr_gr_cog/miscellanea:misc.Ode8
ltx/gr_gr_cog/me.m04.d22:meMA.Ode8C1H.text	@ltx/gr_gr_cog/he.h.m4:heHE.GiKaiPantaTaEnAfti.text
ltx/gr_gr_cog/me.m04.d22:meMA.Ode8C1T.incipit	Ἱεραὶ σεπτῶν Προφητῶν, κηρύττουσι φωναὶ…
ltx/gr_gr_cog/me.m04.d22:meMA.Ode8C1T.melody	@ltx/gr_gr_cog/he.h.m4:heHE.GiKaiPantaTaEnAfti.name
ltx/gr_gr_cog/me.m04.d22:meMA.Ode8C1T.mode	@ltx/gr_gr_cog/miscellanea:misc.Mode4
ltx/gr_gr_cog/me.m04.d22:meMA.Ode8C1T.ode	@ltx/gr_gr_cog/miscellanea:misc.Ode8
ltx/gr_gr_cog/me.m04.d22:meMA.Ode8C1T.text	Ἱεραὶ σεπτῶν Προφητῶν, κηρύττουσι φωναὶ συμβολικῶς, πύλην καὶ ὄρος καὶ σκηνήν, καὶ ἁγίαν φωτὸς νεφέλην, ἐξ ἧς τοῖς ἐν σκότει καὶ σκιᾷ καθημένοις ἀνέτειλεν, Ἥλιος Παρθένε, Χριστὸς ὁ φωτοδότης.
ltx/gr_gr_cog/me.m04.d22:meMA.Ode9C11.greekmelody	@ltx/gr_gr_cog/he.h.m4:heHE.OtiEpoiiseMoiMegaleia.greekname
ltx/gr_gr_cog/me.m04.d22:meMA.Ode9C11.incipit	Ὡς ὄρθρος, ὡς ἡμέρα διαυγής…
ltx/gr_gr_cog/me.m04.d22:meMA.Ode9C11.melody	@ltx/gr_gr_cog/he.h.m4:heHE.OtiEpoiiseMoiMegaleia.name
ltx/gr_gr_cog/me.m04.d22:meMA.Ode9C11.mode	@ltx/gr_gr_cog/miscellanea:misc.Mode4
ltx/gr_gr_cog/me.m04.d22:meMA.Ode9C11.ode	@ltx/gr_gr_cog/miscellanea:misc.Ode9
ltx/gr_gr_cog/me.m04.d22:meMA.Ode9C11.text	Ὡς ὄρθρος, ὡς ἡμέρα διαυγής, ἡ σὴ ἑορτή, ἐπέφανε φωτίζουσα ἡμῶν, τὰς καρδίας τῶν πιστῶς ἀνευφημούντων, τοὺς σεπτοὺς πόνους σου Πάνσοφε.
ltx/gr_gr_cog/me.m04.d22:meMA.Ode9C12.incipit	Συνόμιλος, Ἀγγέλων, Ἀποστόλων καὶ Ἀθλητῶν…
ltx/gr_gr_cog/me.m04.d22:meMA.Ode9C12.melody	@ltx/gr_gr_cog/he.h.m4:heHE.OtiEpoiiseMoiMegaleia.name
ltx/gr_gr_cog/me.m04.d22:meMA.Ode9C12.mode	@ltx/gr_gr_cog/miscellanea:misc.Mode4
ltx/gr_gr_cog/me.m04.d22:meMA.Ode9C12.ode	@ltx/gr_gr_cog/miscellanea:misc.Ode9
ltx/gr_gr_cog/me.m04.d22:meMA.Ode9C12.text	Συνόμιλος, Ἀγγέλων, Ἀποστόλων καὶ Ἀθλητῶν, Ὁσίων καὶ Δικαίων γεγονώς, Πάτερ καὶ Ἱεραρχῶν, ἐν οὐρανοῖς ὑπὲρ ἡμῶν, Χριστῷ πρεσβεύεις ἀεί.
ltx/gr_gr_cog/me.m04.d22:meMA.Ode9C13.incipit	Ἡ θήκη τῶν ἁγίων σου…
ltx/gr_gr_cog/me.m04.d22:meMA.Ode9C13.melody	@ltx/gr_gr_cog/he.h.m4:heHE.OtiEpoiiseMoiMegaleia.name
ltx/gr_gr_cog/me.m04.d22:meMA.Ode9C13.mode	@ltx/gr_gr_cog/miscellanea:misc.Mode4
ltx/gr_gr_cog/me.m04.d22:meMA.Ode9C13.ode	@ltx/gr_gr_cog/miscellanea:misc.Ode9
ltx/gr_gr_cog/me.m04.d22:meMA.Ode9C13.text	Ἡ θήκη τῶν ἁγίων σου, λειψάνων Πάτερ σοφέ, ὡς ἄλλη κολυμβήθρα Σιλωάμ, ἐγνωρίσθη τοῖς πιστοῖς· ᾗ προσιόντες, τὰς ψυχὰς ἁγιαζόμεθα.
ltx/gr_gr_cog/me.m04.d22:meMA.Ode9C1H.greekmelody	@ltx/gr_gr_cog/he.h.m4:heHE.OtiEpoiiseMoiMegaleia.greekname
ltx/gr_gr_cog/me.m04.d22:meMA.Ode9C1H.incipit	@ltx/gr_gr_cog/he.h.m4:heHE.OtiEpoiiseMoiMegaleia.incipit
ltx/gr_gr_cog/me.m04.d22:meMA.Ode9C1H.melody	@ltx/gr_gr_cog/he.h.m4:heHE.OtiEpoiiseMoiMegaleia.melody
ltx/gr_gr_cog/me.m04.d22:meMA.Ode9C1H.mode	@ltx/gr_gr_cog/miscellanea:misc.Mode4
ltx/gr_gr_cog/me.m04.d22:meMA.Ode9C1H.ode	@ltx/gr_gr_cog/miscellanea:misc.Ode9
ltx/gr_gr_cog/me.m04.d22:meMA.Ode9C1H.text	@ltx/gr_gr_cog/he.h.m4:heHE.OtiEpoiiseMoiMegaleia.text
ltx/gr_gr_cog/me.m04.d22:meMA.Ode9C1T.incipit	Φρικτή σου ἡ λοχεία, Θεοτόκε…
ltx/gr_gr_cog/me.m04.d22:meMA.Ode9C1T.melody	@ltx/gr_gr_cog/he.h.m4:heHE.OtiEpoiiseMoiMegaleia.name
ltx/gr_gr_cog/me.m04.d22:meMA.Ode9C1T.mode	@ltx/gr_gr_cog/miscellanea:misc.Mode4
ltx/gr_gr_cog/me.m04.d22:meMA.Ode9C1T.ode	@ltx/gr_gr_cog/miscellanea:misc.Ode9
ltx/gr_gr_cog/me.m04.d22:meMA.Ode9C1T.text	Φρικτή σου ἡ λοχεία, Θεοτόκε Μήτηρ Θεοῦ· διὸ σὲ μακαρίζομεν ἀεί, καὶ δοξάζομεν πιστῶς, αἱ γενεαὶ τῶν γενεῶν, εἰς τοὺς αἰῶνας. Ἀμήν.
ltx/gr_gr_cog/me.m04.d22:meVE.Apolytikion1ger.greekmelody	@ltx/gr_gr_cog/he.a.m5:heAU.TonSynanarchonLogon.greekname
ltx/gr_gr_cog/me.m04.d22:meVE.Apolytikion1ger.incipit	Ἐκ σπαργάνων ἐπλήσθης τῆς θείας…
ltx/gr_gr_cog/me.m04.d22:meVE.Apolytikion1ger.melody	@ltx/gr_gr_cog/he.a.m5:heAU.TonSynanarchonLogon.name
ltx/gr_gr_cog/me.m04.d22:meVE.Apolytikion1ger.mode	@ltx/gr_gr_cog/miscellanea:misc.Mode5
ltx/gr_gr_cog/me.m04.d22:meVE.Apolytikion1ger.poet	@ltx/gr_gr_cog/poets:po.Gerasimou
ltx/gr_gr_cog/me.m04.d22:meVE.Apolytikion1ger.text	Ἐκ σπαργάνων ἐπλήσθης τῆς θείας χάριτος, καὶ τῷ Θεῷ ἀνετέθης ὡς Σαμουὴλ ὁ κλεινός, τὴν ὑπέρτιμον στολὴν Πάτερ κληρούμενος· ὅθεν θαυμάτων αὐτουργός, καὶ Χριστοῦ μυσταγωγός, Θεόδωρε ἀνεδείχθης, θεοδωρήτως ἐκλάμπων, τὰς ψυχοτρόφους δωρεὰς τοῖς πιστοῖς.
ltx/gr_gr_cog/me.m04.d22:meVE.SticStavrotheotokion.greekmelody	@ltx/gr_gr_cog/he.a.m1:heAU.TonOuranionTagmaton.greekname
ltx/gr_gr_cog/me.m04.d22:meVE.SticStavrotheotokion.incipit	Ἐν τῷ Σταυρῷ σε ὁρῶσα…
ltx/gr_gr_cog/me.m04.d22:meVE.SticStavrotheotokion.melody	@ltx/gr_gr_cog/he.a.m1:heAU.TonOuranionTagmaton.name
ltx/gr_gr_cog/me.m04.d22:meVE.SticStavrotheotokion.mode	@ltx/gr_gr_cog/miscellanea:misc.Mode1
ltx/gr_gr_cog/me.m04.d22:meVE.SticStavrotheotokion.text	Ἐν τῷ Σταυρῷ σε ὁρῶσα, Χριστὲ κρεμάμενον, ἡ ἄμωμος Παρθένος, ἡ ἀσπόρως τεκοῦσα, ἐβόα θρηνῳδοῦσα, Υἱὲ καὶ Θεέ, τίς ἡ θεία καὶ ἄφατος, οἰκονομία σου Λόγε, διʼ ἧς βροτούς, τῆς κατάρας ἠλευθέρωσας!
ltx/gr_gr_cog/me.m04.d22:meVE.SticTheotokion.greekmelody	@ltx/gr_gr_cog/he.a.m1:heAU.TonOuranionTagmaton.greekname
ltx/gr_gr_cog/me.m04.d22:meVE.SticTheotokion.incipit	Θεομακάριστε Κόρη Θεοχαρίτωτε, ἡ τῶν…
ltx/gr_gr_cog/me.m04.d22:meVE.SticTheotokion.melody	@ltx/gr_gr_cog/he.a.m1:heAU.TonOuranionTagmaton.name
ltx/gr_gr_cog/me.m04.d22:meVE.SticTheotokion.mode	@ltx/gr_gr_cog/miscellanea:misc.Mode1
ltx/gr_gr_cog/me.m04.d22:meVE.SticTheotokion.text	Θεομακάριστε Κόρη Θεοχαρίτωτε, ἡ τῶν ἁμαρτανόντων, κραταιὰ προστασία, τῶν καταπονουμένων ἡ κραταιά, καὶ βεβαία ἀντίληψις, Θεοκυῆτορ Παρθένε, πάντων πιστῶν, καταφύγιον πανύμνητε.
ltx/gr_gr_cog/me.m04.d22:meVE.Stichera01.greekmelody	@ltx/gr_gr_cog/he.a.m1:heAU.TonOuranionTagmaton.greekname
ltx/gr_gr_cog/me.m04.d22:meVE.Stichera01.incipit	Ἱερομύστης τοῦ Λόγου Πάτερ γενόμενος…
ltx/gr_gr_cog/me.m04.d22:meVE.Stichera01.melody	@ltx/gr_gr_cog/he.a.m1:heAU.TonOuranionTagmaton.name
ltx/gr_gr_cog/me.m04.d22:meVE.Stichera01.mode	@ltx/gr_gr_cog/miscellanea:misc.Mode1
ltx/gr_gr_cog/me.m04.d22:meVE.Stichera01.text	Ἱερομύστης τοῦ Λόγου Πάτερ γενόμενος, καὶ ἀρεταῖς ἐκλάμψας, τῇ τοῦ Πνεύματος αἴγλῃ, Θεόδωρε τρισμάκαρ, παρέχεις ἡμῖν, ἰαμάτων χαρίσματα, τοῖς ἐν τῇ μνήμῃ σου ταύτῃ τῇ ἱερᾷ, προσιοῦσι καὶ τιμῶσί σε.
ltx/gr_gr_cog/me.m04.d22:meVE.Stichera02.incipit	Ταῖς οὐρανίαις ἀκτῖσι περιλαμπόμενος, τῇ…
ltx/gr_gr_cog/me.m04.d22:meVE.Stichera02.melody	@ltx/gr_gr_cog/he.a.m1:heAU.TonOuranionTagmaton.name
ltx/gr_gr_cog/me.m04.d22:meVE.Stichera02.mode	@ltx/gr_gr_cog/miscellanea:misc.Mode1
ltx/gr_gr_cog/me.m04.d22:meVE.Stichera02.text	Ταῖς οὐρανίαις ἀκτῖσι περιλαμπόμενος, τῇ τοῦ Χριστοῦ δυνάμει, τὰς ἰάσεις παρέχεις, τοῖς πίστει σε αἰτοῦσι, καὶ εὐσεβῶς, ἐκτελοῦσι τὴν μνήμην σου, θεομακάριστε Πάτερ θαυματουργέ, ἀξιάγαστε Θεόδωρε.
ltx/gr_gr_cog/me.m04.d22:meVE.Stichera03.incipit	Τοῦ ἀμπελωνος ἐργάτης, διὰ τῆς…
ltx/gr_gr_cog/me.m04.d22:meVE.Stichera03.melody	@ltx/gr_gr_cog/he.a.m1:heAU.TonOuranionTagmaton.name
ltx/gr_gr_cog/me.m04.d22:meVE.Stichera03.mode	@ltx/gr_gr_cog/miscellanea:misc.Mode1
ltx/gr_gr_cog/me.m04.d22:meVE.Stichera03.text	Τοῦ ἀμπελωνος ἐργάτης, διὰ τῆς πράξεως, τῶν ἐντολῶν ἐδείχθης, τοῦ Χριστοῦ θεοφόρε· διὸ τῆς βασιλείας, τῆς ἄνω λαβών, μυστικῶς τὸ δηνάριον, ἀδιαλείπτως πρεσβεύεις ὑπὲρ ἡμῶν, τῶν τιμώντων σε Θεόδωρε.
