ltx/gr_gr_cog/pe.d091:peDA.commemoration.full	
ltx/gr_gr_cog/pe.d091:peDA.commemoration.short	Σάββατον τῆς Γʹ Ἑβδομάδος
ltx/gr_gr_cog/pe.d091:peDA.dismissal	@ltx/gr_gr_cog/dismissals:dis00.resurrection
ltx/gr_gr_cog/pe.d091:peDA.insert1	
ltx/gr_gr_cog/pe.d091:peDA.insert2	
ltx/gr_gr_cog/pe.d091:peDA.note	
ltx/gr_gr_cog/pe.d091:peHO.commemorations	
ltx/gr_gr_cog/pe.d091:peHO.daytitle	
ltx/gr_gr_cog/pe.d091:peHO.description1	
ltx/gr_gr_cog/pe.d091:peHO.description2	
ltx/gr_gr_cog/pe.d091:peHO.note1	
ltx/gr_gr_cog/pe.d091:peHO.note2	
ltx/gr_gr_cog/pe.d091:peMA.AposGlory.incipit	@ltx/gr_gr_cog/pe.d085:peVE.LityGlory.incipit
ltx/gr_gr_cog/pe.d091:peMA.AposGlory.melody	@ltx/gr_gr_cog/miscellanea:misc.Idiomelon
ltx/gr_gr_cog/pe.d091:peMA.AposGlory.mode	@ltx/gr_gr_cog/miscellanea:misc.Mode6
ltx/gr_gr_cog/pe.d091:peMA.AposGlory.text	@ltx/gr_gr_cog/pe.d085:peVE.LityGlory.text
ltx/gr_gr_cog/pe.d091:peMA.Aposticha1.incipit	@ltx/gr_gr_cog/tr.d070:trVE.Aposticha1.incipit
ltx/gr_gr_cog/pe.d091:peMA.Aposticha1.melody	@ltx/gr_gr_cog/tr.d070:trVE.Aposticha1.melody
ltx/gr_gr_cog/pe.d091:peMA.Aposticha1.mode	@ltx/gr_gr_cog/miscellanea:misc.Mode2
ltx/gr_gr_cog/pe.d091:peMA.Aposticha1.text	@ltx/gr_gr_cog/tr.d070:trVE.Aposticha1.text
ltx/gr_gr_cog/pe.d091:peMA.Aposticha2.incipit	@ltx/gr_gr_cog/tr.d070:trVE.Aposticha2.incipit
ltx/gr_gr_cog/pe.d091:peMA.Aposticha2.melody	@ltx/gr_gr_cog/tr.d070:trVE.Aposticha2.melody
ltx/gr_gr_cog/pe.d091:peMA.Aposticha2.mode	@ltx/gr_gr_cog/miscellanea:misc.Mode2
ltx/gr_gr_cog/pe.d091:peMA.Aposticha2.text	@ltx/gr_gr_cog/tr.d070:trVE.Aposticha2.text
ltx/gr_gr_cog/pe.d091:peMA.Aposticha3.incipit	@ltx/gr_gr_cog/tr.d070:trVE.Aposticha4.incipit
ltx/gr_gr_cog/pe.d091:peMA.Aposticha3.melody	@ltx/gr_gr_cog/tr.d070:trVE.Aposticha4.melody
ltx/gr_gr_cog/pe.d091:peMA.Aposticha3.mode	@ltx/gr_gr_cog/miscellanea:misc.Mode2
ltx/gr_gr_cog/pe.d091:peMA.Aposticha3.text	@ltx/gr_gr_cog/tr.d070:trVE.Aposticha4.text
ltx/gr_gr_cog/pe.d091:peMA.Kathisma11.incipit	@ltx/gr_gr_cog/pe.d085:peMA.Kathisma11.incipit
ltx/gr_gr_cog/pe.d091:peMA.Kathisma11.melody	
ltx/gr_gr_cog/pe.d091:peMA.Kathisma11.mode	@ltx/gr_gr_cog/miscellanea:misc.Mode2
ltx/gr_gr_cog/pe.d091:peMA.Kathisma11.text	@ltx/gr_gr_cog/pe.d085:peMA.Kathisma11.text
ltx/gr_gr_cog/pe.d091:peMA.Kathisma12.incipit	@ltx/gr_gr_cog/pe.d085:peMA.Kathisma12.incipit
ltx/gr_gr_cog/pe.d091:peMA.Kathisma12.melody	
ltx/gr_gr_cog/pe.d091:peMA.Kathisma12.mode	@ltx/gr_gr_cog/miscellanea:misc.Mode2
ltx/gr_gr_cog/pe.d091:peMA.Kathisma12.text	@ltx/gr_gr_cog/pe.d085:peMA.Kathisma12.text
ltx/gr_gr_cog/pe.d091:peMA.Kathisma1T.incipit	@ltx/gr_gr_cog/oc.m2.d7:ocMA.Kathisma14.incipit
ltx/gr_gr_cog/pe.d091:peMA.Kathisma1T.melody	@ltx/gr_gr_cog/oc.m2.d7:ocMA.Kathisma14.melody
ltx/gr_gr_cog/pe.d091:peMA.Kathisma1T.mode	@ltx/gr_gr_cog/miscellanea:misc.Mode2
ltx/gr_gr_cog/pe.d091:peMA.Kathisma1T.text	@ltx/gr_gr_cog/oc.m2.d7:ocMA.Kathisma14.text
ltx/gr_gr_cog/pe.d091:peMA.Kathisma21.incipit	@ltx/gr_gr_cog/pe.d085:peMA.Ode3Kathisma2.incipit
ltx/gr_gr_cog/pe.d091:peMA.Kathisma21.melody	
ltx/gr_gr_cog/pe.d091:peMA.Kathisma21.mode	@ltx/gr_gr_cog/miscellanea:misc.Mode2
ltx/gr_gr_cog/pe.d091:peMA.Kathisma21.text	@ltx/gr_gr_cog/pe.d085:peMA.Ode3Kathisma2.text
ltx/gr_gr_cog/pe.d091:peMA.Lauds1.incipit	@ltx/gr_gr_cog/oc.m2.d1:ocMA.Lauds1.incipit
ltx/gr_gr_cog/pe.d091:peMA.Lauds1.melody	
ltx/gr_gr_cog/pe.d091:peMA.Lauds1.mode	@ltx/gr_gr_cog/miscellanea:misc.Mode2
ltx/gr_gr_cog/pe.d091:peMA.Lauds1.text	@ltx/gr_gr_cog/oc.m2.d1:ocMA.Lauds1.text
ltx/gr_gr_cog/pe.d091:peMA.Lauds2.incipit	@ltx/gr_gr_cog/oc.m2.d1:ocMA.Lauds2.incipit
ltx/gr_gr_cog/pe.d091:peMA.Lauds2.melody	
ltx/gr_gr_cog/pe.d091:peMA.Lauds2.mode	@ltx/gr_gr_cog/miscellanea:misc.Mode2
ltx/gr_gr_cog/pe.d091:peMA.Lauds2.text	@ltx/gr_gr_cog/oc.m2.d1:ocMA.Lauds2.text
ltx/gr_gr_cog/pe.d091:peMA.Lauds3.incipit	@ltx/gr_gr_cog/oc.m2.d1:ocMA.Lauds3.incipit
ltx/gr_gr_cog/pe.d091:peMA.Lauds3.melody	
ltx/gr_gr_cog/pe.d091:peMA.Lauds3.mode	@ltx/gr_gr_cog/miscellanea:misc.Mode2
ltx/gr_gr_cog/pe.d091:peMA.Lauds3.text	@ltx/gr_gr_cog/oc.m2.d1:ocMA.Lauds3.text
ltx/gr_gr_cog/pe.d091:peMA.Lauds4.incipit	@ltx/gr_gr_cog/oc.m2.d1:ocMA.Lauds4.incipit
ltx/gr_gr_cog/pe.d091:peMA.Lauds4.melody	
ltx/gr_gr_cog/pe.d091:peMA.Lauds4.mode	@ltx/gr_gr_cog/miscellanea:misc.Mode2
ltx/gr_gr_cog/pe.d091:peMA.Lauds4.text	@ltx/gr_gr_cog/oc.m2.d1:ocMA.Lauds4.text
ltx/gr_gr_cog/pe.d091:peMA.LaudsGlory.incipit	@ltx/gr_gr_cog/pe.d085:peVE.Lity3.incipit
ltx/gr_gr_cog/pe.d091:peMA.LaudsGlory.melody	@ltx/gr_gr_cog/miscellanea:misc.Idiomelon
ltx/gr_gr_cog/pe.d091:peMA.LaudsGlory.mode	@ltx/gr_gr_cog/miscellanea:misc.Mode1
ltx/gr_gr_cog/pe.d091:peMA.LaudsGlory.text	@ltx/gr_gr_cog/pe.d085:peVE.Lity3.text
ltx/gr_gr_cog/pe.d091:peMA.MM.Lauds12as12.text	@ltx/gr_gr_cog/properties:media.key
ltx/gr_gr_cog/pe.d091:peVE.AposGlory.incipit	@ltx/gr_gr_cog/pe.d085:peVE.AposGlory.incipit
ltx/gr_gr_cog/pe.d091:peVE.AposGlory.melody	@ltx/gr_gr_cog/miscellanea:misc.Idiomelon
ltx/gr_gr_cog/pe.d091:peVE.AposGlory.mode	@ltx/gr_gr_cog/miscellanea:misc.Mode5
ltx/gr_gr_cog/pe.d091:peVE.AposGlory.text	@ltx/gr_gr_cog/pe.d085:peVE.AposGlory.text
ltx/gr_gr_cog/pe.d091:peVE.Aposticha1.incipit	@ltx/gr_gr_cog/oc.m2.d1:ocVE.Stichera1.incipit
ltx/gr_gr_cog/pe.d091:peVE.Aposticha1.melody	
ltx/gr_gr_cog/pe.d091:peVE.Aposticha1.mode	@ltx/gr_gr_cog/miscellanea:misc.Mode2
ltx/gr_gr_cog/pe.d091:peVE.Aposticha1.text	@ltx/gr_gr_cog/oc.m2.d1:ocVE.Stichera1.text
ltx/gr_gr_cog/pe.d091:peVE.Aposticha2.incipit	@ltx/gr_gr_cog/oc.m2.d1:ocVE.Stichera2.incipit
ltx/gr_gr_cog/pe.d091:peVE.Aposticha2.melody	
ltx/gr_gr_cog/pe.d091:peVE.Aposticha2.mode	@ltx/gr_gr_cog/miscellanea:misc.Mode2
ltx/gr_gr_cog/pe.d091:peVE.Aposticha2.text	@ltx/gr_gr_cog/oc.m2.d1:ocVE.Stichera2.text
ltx/gr_gr_cog/pe.d091:peVE.Aposticha3.incipit	@ltx/gr_gr_cog/oc.m2.d1:ocVE.Stichera3.incipit
ltx/gr_gr_cog/pe.d091:peVE.Aposticha3.melody	
ltx/gr_gr_cog/pe.d091:peVE.Aposticha3.mode	@ltx/gr_gr_cog/miscellanea:misc.Mode2
ltx/gr_gr_cog/pe.d091:peVE.Aposticha3.text	@ltx/gr_gr_cog/oc.m2.d1:ocVE.Stichera3.text
ltx/gr_gr_cog/pe.d091:peVE.Aposticha4.incipit	@ltx/gr_gr_cog/oc.m2.d1:ocVE.Aposticha1.incipit
ltx/gr_gr_cog/pe.d091:peVE.Aposticha4.melody	
ltx/gr_gr_cog/pe.d091:peVE.Aposticha4.mode	@ltx/gr_gr_cog/miscellanea:misc.Mode2
ltx/gr_gr_cog/pe.d091:peVE.Aposticha4.text	@ltx/gr_gr_cog/oc.m2.d1:ocVE.Aposticha1.text
ltx/gr_gr_cog/pe.d091:peVE.MM.Stichera12as34.text	
ltx/gr_gr_cog/pe.d091:peVE.SticBoth.incipit	@ltx/gr_gr_cog/oc.m2.d1:ocVE.SticTheotokion.incipit
ltx/gr_gr_cog/pe.d091:peVE.SticBoth.melody	@ltx/gr_gr_cog/miscellanea:misc.Idiomelon
ltx/gr_gr_cog/pe.d091:peVE.SticBoth.mode	@ltx/gr_gr_cog/miscellanea:misc.Mode2
ltx/gr_gr_cog/pe.d091:peVE.SticBoth.text	@ltx/gr_gr_cog/oc.m2.d1:ocVE.SticTheotokion.text
ltx/gr_gr_cog/pe.d091:peVE.SticGlory.incipit	@ltx/gr_gr_cog/pe.d085:peVE.SticGlory.incipit
ltx/gr_gr_cog/pe.d091:peVE.SticGlory.melody	@ltx/gr_gr_cog/miscellanea:misc.Idiomelon
ltx/gr_gr_cog/pe.d091:peVE.SticGlory.mode	@ltx/gr_gr_cog/miscellanea:misc.Mode6
ltx/gr_gr_cog/pe.d091:peVE.SticGlory.text	@ltx/gr_gr_cog/pe.d085:peVE.SticGlory.text
ltx/gr_gr_cog/pe.d091:peVE.Stichera01.incipit	@ltx/gr_gr_cog/pe.d085:peVE.Stichera08.incipit
ltx/gr_gr_cog/pe.d091:peVE.Stichera01.melody	@ltx/gr_gr_cog/miscellanea:misc.Idiomelon
ltx/gr_gr_cog/pe.d091:peVE.Stichera01.mode	@ltx/gr_gr_cog/miscellanea:misc.Mode2
ltx/gr_gr_cog/pe.d091:peVE.Stichera01.text	@ltx/gr_gr_cog/pe.d085:peVE.Stichera08.text
ltx/gr_gr_cog/pe.d091:peVE.Stichera02.incipit	@ltx/gr_gr_cog/pe.d085:peVE.Stichera09.incipit
ltx/gr_gr_cog/pe.d091:peVE.Stichera02.melody	@ltx/gr_gr_cog/miscellanea:misc.Idiomelon
ltx/gr_gr_cog/pe.d091:peVE.Stichera02.mode	@ltx/gr_gr_cog/miscellanea:misc.Mode2
ltx/gr_gr_cog/pe.d091:peVE.Stichera02.text	@ltx/gr_gr_cog/pe.d085:peVE.Stichera09.text
ltx/gr_gr_cog/pe.d091:peVE.Stichera03.incipit	@ltx/gr_gr_cog/pe.d085:peVE.Stichera10.incipit
ltx/gr_gr_cog/pe.d091:peVE.Stichera03.melody	@ltx/gr_gr_cog/miscellanea:misc.Idiomelon
ltx/gr_gr_cog/pe.d091:peVE.Stichera03.mode	@ltx/gr_gr_cog/miscellanea:misc.Mode2
ltx/gr_gr_cog/pe.d091:peVE.Stichera03.text	@ltx/gr_gr_cog/pe.d085:peVE.Stichera10.text
