ltx/gr_gr_cog/le.ep.me.m12.d26:lemeLI.Epistle.book_abbr	@ltx/gr_gr_cog/le.ep.me.m03.d25:lemeLI.Epistle.book_abbr
ltx/gr_gr_cog/le.ep.me.m12.d26:lemeLI.Epistle.book_string	@ltx/gr_gr_cog/le.ep.me.m03.d25:lemeLI.Epistle.book_string
ltx/gr_gr_cog/le.ep.me.m12.d26:lemeLI.Epistle.chapverse	@ltx/gr_gr_cog/le.ep.me.m03.d25:lemeLI.Epistle.chapverse
ltx/gr_gr_cog/le.ep.me.m12.d26:lemeLI.Epistle.incipit	@ltx/gr_gr_cog/le.ep.me.m03.d25:lemeLI.Epistle.incipit
ltx/gr_gr_cog/le.ep.me.m12.d26:lemeLI.Epistle.text	@ltx/gr_gr_cog/le.ep.me.m03.d25:lemeLI.Epistle.text
ltx/gr_gr_cog/le.ep.me.m12.d26:lemeLI.Epistle.title	Τῆς Θεοτόκου
ltx/gr_gr_cog/le.ep.me.m12.d26:lemeLI.Epistle.title_abbr	Τῆς Θεοτόκου
ltx/gr_gr_cog/le.ep.me.m12.d26:lemeLI.Epistle.version	@ltx/gr_gr_cog/properties:version.designation
