ltx/gr_gr_cog/sy.m11.d27:cl.syMA.commemoration01.text	[saint/com 1]
ltx/gr_gr_cog/sy.m11.d27:cl.syMA.commemoration02.text	[saint/com 2]
ltx/gr_gr_cog/sy.m11.d27:cl.syMA.commemoration03.text	[saint/com 3]
ltx/gr_gr_cog/sy.m11.d27:cl.syMA.commemoration04.text	[saint/com 4]
ltx/gr_gr_cog/sy.m11.d27:cl.syMA.commemoration05.text	[saint/com 5]
ltx/gr_gr_cog/sy.m11.d27:cl.syMA.commemoration06.text	[saint/com list]
ltx/gr_gr_cog/sy.m11.d27:syMA.commemoration01.couplet1.title	@ltx/gr_gr_cog/titles:ti.Verses
ltx/gr_gr_cog/sy.m11.d27:syMA.commemoration01.couplet1.verse1	Τμηθεὶς μεληδόν, καὶ σφαγὴν Πέρσης φέρων,
ltx/gr_gr_cog/sy.m11.d27:syMA.commemoration01.couplet1.verse2	«Ψυχὴ σεσώσθω, φροῦδά μοι μέλη» λέγει.
ltx/gr_gr_cog/sy.m11.d27:syMA.commemoration01.narration.p01	Οὗτος ἦν ἐπὶ Ὀνωρίου καὶ Ἀρκαδίου τῶν βασιλέων, χριστιανὸς ὢν ἐκ προγόνων, οἰκῶν ἐν Βηθλαβᾷ τῇ πόλει, ἐν χώρᾳ τῶν Ἐλουζησίων, γένους ἐντίμου καὶ περιφανοῦς, καὶ πάνυ παρὰ τοῦ βασιλέως Ἰσδιγέρδου τιμώμενος. Διὰ δὲ τοῦτο, τῷ παρὰ τοῦ βασιλέως σφόδρα φιλεῖσθαι Περσῶν, ἀπέστη τῆς τῶν χριστιανῶν πίστεως καὶ συνεφειλκύσθη τῷ βασιλεῖ πρὸς τὴν ἀπώλειαν, ἀπαρνησάμενος τὸν Χριστόν. Ἐπεὶ δὲ ἥ τε μήτηρ αὐτοῦ καὶ ἡ γαμετὴ ἠλλοτρίωσαν ἑαυτὰς τῆς κοινωνίας αὐτοῦ, καθότι τῆς τοῦ Χριστοῦ ἀγάπης τὴν τοῦ βασιλέως προετιμήσατο καί, διὰ πρόσκαιρον δόξαν, αἰωνίαν αἰσχύνην ἠλλάξατο καὶ κατάκρισιν, καὶ τοῦτο αὐτῷ διὰ γραμμάτων ἐμήνυσαν, πληγεὶς τὴν ψυχήν, ἀπέστη τῆς ματαίας τοῦ βασιλέως θρησκείας καὶ ἀπεκλαίετο ἐφʼ οἷς ἐξήμαρτεν, ἀποστὰς ἀπὸ τοῦ Χριστοῦ. Διά τοι τοῦτο καθίσταται εἰς ἐξέτασιν, τοῦ βασιλέως λίαν ἐν τούτῳ χαλεπήναντος. Ὅθεν τὸν πικρὸν ὑπέστη θάνατον, κατὰ μίαν ἑκάστην τοῦ σώματος ἁρμονίαν κατατμηθείς, τῶν χειρῶν καὶ τῶν ποδῶν καὶ βραχιόνων, ὡς περιλειφθῆναι μόνον αὐτῷ μετὰ τῆς κοιλίας τὴν κεφαλήν· εἶθʼ οὕτω καὶ ταύτην μαχαίρᾳ ἀφαιρεθῆναι.
ltx/gr_gr_cog/sy.m11.d27:syMA.commemoration01.single1	Εἰκάδι Πέρσης ἑβδομάτῃ σφάγη ἐκμελεϊσθείς.
ltx/gr_gr_cog/sy.m11.d27:syMA.commemoration01.text	Τῇ ΚΖʹ τοῦ αὐτοῦ μηνὸς μνήμη τῆς ἀθλήσεως τοῦ ἁγίου Μεγαλομάρτυρος Ἰακώβου τοῦ Πέρσου.
ltx/gr_gr_cog/sy.m11.d27:syMA.commemoration02.couplet1.title	@ltx/gr_gr_cog/titles:ti.Verses
ltx/gr_gr_cog/sy.m11.d27:syMA.commemoration02.couplet1.verse1	Ὁ Πινούφριος ἀρετῶν πολλαῖς χρόαις,
ltx/gr_gr_cog/sy.m11.d27:syMA.commemoration02.couplet1.verse2	Ἐν οὐρανοῖς ἔλαμψεν ὡς ἴρις νέα.
ltx/gr_gr_cog/sy.m11.d27:syMA.commemoration02.text	Τῇ αὐτῇ ἡμέρᾳ ὁ ὅσιος Πινούφριος ἐν εἰρήνῃ τελειοῦται.
ltx/gr_gr_cog/sy.m11.d27:syMA.commemoration03.couplet1.title	@ltx/gr_gr_cog/titles:ti.Verses
ltx/gr_gr_cog/sy.m11.d27:syMA.commemoration03.couplet1.verse1	«Ἀφεῖσα κόσμον, πρὸς Θεόν, ψυχή, τρέχε»,
ltx/gr_gr_cog/sy.m11.d27:syMA.commemoration03.couplet1.verse2	Ναθαναὴλ ἔκραζε, μέλλων ἐκπνέειν.
ltx/gr_gr_cog/sy.m11.d27:syMA.commemoration03.text	Τῇ αὐτῇ ἡμέρᾳ ὁ ἅγιος Ναθαναὴλ ἐν εἰρήνῃ τελειοῦται.
ltx/gr_gr_cog/sy.m11.d27:syMA.lastline	Ταῖς αὐτῶν ἁγίαις πρεσβείαις, ὁ Θεός, ἑλέησον καὶ σῶσον ἡμᾶς. Ἀμήν.
