ltx/gr_gr_cog/le.ep.me.m12.d22:lemeLI.Epistle.book_abbr	@ltx/gr_gr_cog/le.ep.mc.d222:lemcLI.Epistle.book_abbr
ltx/gr_gr_cog/le.ep.me.m12.d22:lemeLI.Epistle.book_string	@ltx/gr_gr_cog/le.ep.mc.d222:lemcLI.Epistle.book_string
ltx/gr_gr_cog/le.ep.me.m12.d22:lemeLI.Epistle.chapverse	@ltx/gr_gr_cog/le.ep.mc.d222:lemcLI.Epistle.chapverse
ltx/gr_gr_cog/le.ep.me.m12.d22:lemeLI.Epistle.incipit	@ltx/gr_gr_cog/le.ep.mc.d222:lemcLI.Epistle.incipit
ltx/gr_gr_cog/le.ep.me.m12.d22:lemeLI.Epistle.text	@ltx/gr_gr_cog/le.ep.mc.d222:lemcLI.Epistle.text
ltx/gr_gr_cog/le.ep.me.m12.d22:lemeLI.Epistle.title	Τῆς Ἁγίας
ltx/gr_gr_cog/le.ep.me.m12.d22:lemeLI.Epistle.title_abbr	Τῆς Ἁγίας
ltx/gr_gr_cog/le.ep.me.m12.d22:lemeLI.Epistle.version	@ltx/gr_gr_cog/le.ep.mc.d222:lemcLI.Epistle.version
