ltx/gr_gr_cog/me.m11.d10:meDA.commemoration.first	Μνήμη τῶν Ἁγίων Ἀποστόλων Ὀλυμπᾶ, Ῥοδίωνος, Σωσιπάτρου, Τερτίου, Ἐράστου καὶ Κουάρτου
ltx/gr_gr_cog/me.m11.d10:meDA.commemoration.first_name	
ltx/gr_gr_cog/me.m11.d10:meDA.commemoration.first_short	Μνήμη τῶν Ἁγίων Ἀποστόλων Ὀλυμπᾶ, Ῥοδίωνος, Σωσιπάτρου, Τερτίου, Ἐράστου καὶ Κουάρτου
ltx/gr_gr_cog/me.m11.d10:meDA.commemoration.first_title	@ltx/gr_gr_cog/titles:ti.Apostles
ltx/gr_gr_cog/me.m11.d10:meDA.commemoration.full	Μνήμη τῶν Ἁγίων Ἀποστόλων Ὀλυμπᾶ, Ῥοδίωνος, Σωσιπάτρου, Τερτίου, Ἐράστου καὶ Κουάρτου· καὶ τοῦ Ἁγίου Μάρτυρος Ὀρέστου.
ltx/gr_gr_cog/me.m11.d10:meDA.commemoration.second_name	
ltx/gr_gr_cog/me.m11.d10:meDA.commemoration.second_title	@ltx/gr_gr_cog/titles:ti.Martyr
ltx/gr_gr_cog/me.m11.d10:meDA.date	Τῌ Ιʹ ΝΟΕΜΒΡΙΟΥ
ltx/gr_gr_cog/me.m11.d10:meDA.fordate	διὰ τὴν 10ην Νοεμβρίου
ltx/gr_gr_cog/me.m11.d10:meDA.insert1	
ltx/gr_gr_cog/me.m11.d10:meDA.insert2	
ltx/gr_gr_cog/me.m11.d10:meDA.note	
ltx/gr_gr_cog/me.m11.d10:meDA.pdfcoverdate	τῆς 10ης Νοεμβρίου,
ltx/gr_gr_cog/me.m11.d10:meDA.pdfheaderdate	τῆς 10ης Νοεμβρίου
ltx/gr_gr_cog/me.m11.d10:meHO.commemorations	
ltx/gr_gr_cog/me.m11.d10:meHO.note1	
ltx/gr_gr_cog/me.m11.d10:meHO.note2	
ltx/gr_gr_cog/me.m11.d10:meHO.number	
ltx/gr_gr_cog/me.m11.d10:meHO.rank	
ltx/gr_gr_cog/me.m11.d10:meLE.commemoration1	Μνήμη τῶν Ἁγίων Ἀποστόλων ἐκ τῶν Ο´ Ἐράστου, Ὀλυμπᾶ, καὶ τῶν σὺν αὐτοῖς.
ltx/gr_gr_cog/me.m11.d10:meLE.commemoration2	
ltx/gr_gr_cog/me.m11.d10:meLI.Kontakion1.greekmelody	@ltx/gr_gr_cog/me.m11.d10:meMA.Kontakion1.greekmelody
ltx/gr_gr_cog/me.m11.d10:meLI.Kontakion1.incipit	@ltx/gr_gr_cog/me.m11.d10:meMA.Kontakion1.incipit
ltx/gr_gr_cog/me.m11.d10:meLI.Kontakion1.melody	@ltx/gr_gr_cog/me.m11.d10:meMA.Kontakion1.melody
ltx/gr_gr_cog/me.m11.d10:meLI.Kontakion1.mode	@ltx/gr_gr_cog/me.m11.d10:meMA.Kontakion1.mode
ltx/gr_gr_cog/me.m11.d10:meLI.Kontakion1.text	@ltx/gr_gr_cog/me.m11.d10:meMA.Kontakion1.text
ltx/gr_gr_cog/me.m11.d10:meLI.MM.CommunionHymn.text	@ltx/gr_gr_cog/properties:media.key
ltx/gr_gr_cog/me.m11.d10:meLI.Megalynarion.text	
ltx/gr_gr_cog/me.m11.d10:meMA.C1.acrostic.notice1	οὗ ἡ Ἀκροστιχίς·
ltx/gr_gr_cog/me.m11.d10:meMA.C1.acrostic.text	Θεηγόρους Μαθητὰς ὑμνῶ συντόνως. Ἰωσήφ.
ltx/gr_gr_cog/me.m11.d10:meMA.C1.acrostic.title	Ὁ Κανὼν τῶν Ἀποστόλων,
ltx/gr_gr_cog/me.m11.d10:meMA.C1.title	@ltx/gr_gr_cog/titles:ti.CanonApostles
ltx/gr_gr_cog/me.m11.d10:meMA.C1.verse	@ltx/gr_gr_cog/prayers:pr.verse_Apostles.text
ltx/gr_gr_cog/me.m11.d10:meMA.C2.acrostic.notice1	οὗ ἡ Ἀκροστιχίς·
ltx/gr_gr_cog/me.m11.d10:meMA.C2.acrostic.text	Τοὺς σούς, Ὀρέστα Μάρτυς, ἄθλους αἰνέσω.
ltx/gr_gr_cog/me.m11.d10:meMA.C2.acrostic.title	Ὁ Κανὼν τοῦ Μάρτυρος,
ltx/gr_gr_cog/me.m11.d10:meMA.C2.title	@ltx/gr_gr_cog/titles:ti.CanonMartyrM
ltx/gr_gr_cog/me.m11.d10:meMA.C2.verse	@ltx/gr_gr_cog/prayers:pr.verse_SaintM.text
ltx/gr_gr_cog/me.m11.d10:meMA.ExapTheotokion.incipit	@ltx/gr_gr_cog/ho.ho03:hoMA.ExapThuTh.incipit
ltx/gr_gr_cog/me.m11.d10:meMA.ExapTheotokion.melody	@ltx/gr_gr_cog/he.a.m2:heAU.GynaikesAkoutisthite.name
ltx/gr_gr_cog/me.m11.d10:meMA.ExapTheotokion.mode	@ltx/gr_gr_cog/miscellanea:misc.Mode2
ltx/gr_gr_cog/me.m11.d10:meMA.ExapTheotokion.text	@ltx/gr_gr_cog/ho.ho03:hoMA.ExapThuTh.text
ltx/gr_gr_cog/me.m11.d10:meMA.Exaposteilarion1.greekmelody	@ltx/gr_gr_cog/he.a.m2:heAU.GynaikesAkoutisthite.greekname
ltx/gr_gr_cog/me.m11.d10:meMA.Exaposteilarion1.incipit	Ῥοδίων καὶ Σωσίπατρος, καὶ Ὀλυμπᾶς…
ltx/gr_gr_cog/me.m11.d10:meMA.Exaposteilarion1.melody	@ltx/gr_gr_cog/he.a.m2:heAU.GynaikesAkoutisthite.name
ltx/gr_gr_cog/me.m11.d10:meMA.Exaposteilarion1.mode	@ltx/gr_gr_cog/miscellanea:misc.Mode2
ltx/gr_gr_cog/me.m11.d10:meMA.Exaposteilarion1.text	Ῥοδίων καὶ Σωσίπατρος, καὶ Ὀλυμπᾶς καὶ Τέρτιος, καὶ Ἔραστος σὺν Κουάρτῳ, νῦν παρʼ ἡμῶν κατὰ χρέος, λαμπρῶς ἀνευφημείσθωσαν, ὡς τοῦ Χριστοῦ Ἀπόστολοι, καὶ Μαθηταὶ πρεσβεύοντες, ὑπὲρ ἡμῶν τῶν τελούντων, τὴν ἱερὰν αὐτῶν μνήμην.
ltx/gr_gr_cog/me.m11.d10:meMA.Kontakion1.greekmelody	@ltx/gr_gr_cog/he.a.m1:heAU.ChorosAngelikos.greekname
ltx/gr_gr_cog/me.m11.d10:meMA.Kontakion1.incipit	Τριάδος τῆς σεπτῆς, ἐκηρύξατε πίστιν…
ltx/gr_gr_cog/me.m11.d10:meMA.Kontakion1.melody	@ltx/gr_gr_cog/he.a.m1:heAU.ChorosAngelikos.name
ltx/gr_gr_cog/me.m11.d10:meMA.Kontakion1.mode	@ltx/gr_gr_cog/miscellanea:misc.Mode1
ltx/gr_gr_cog/me.m11.d10:meMA.Kontakion1.text	Τριάδος τῆς σεπτῆς, ἐκηρύξατε πίστιν, πολύθεον σοφοί, τῶν εἰδώλων ἀπάτην, ἐκ μέσου ποιήσαντες, ταῖς σεπταῖς διδαχαῖς ὑμῶν· ὅθεν εὕρατε, τὴν ἀμοιβὴν τῶν καμάτων, αἰωνίζουσαν, ἐν οὐρανοῖς τοὺς στεφάνους, λαβόντες Ἀπόστολοι.
ltx/gr_gr_cog/me.m11.d10:meMA.Ode1C11.greekmelody	@ltx/gr_gr_cog/he.h.m1:heHE.SouITropaiouchos.greekname
ltx/gr_gr_cog/me.m11.d10:meMA.Ode1C11.incipit	Θεῖοι πεφυκότες Μαθηταί, τοῦ σαρκωθέντος…
ltx/gr_gr_cog/me.m11.d10:meMA.Ode1C11.melody	@ltx/gr_gr_cog/he.h.m1:heHE.SouITropaiouchos.name
ltx/gr_gr_cog/me.m11.d10:meMA.Ode1C11.mode	@ltx/gr_gr_cog/miscellanea:misc.Mode1
ltx/gr_gr_cog/me.m11.d10:meMA.Ode1C11.ode	@ltx/gr_gr_cog/miscellanea:misc.Ode1
ltx/gr_gr_cog/me.m11.d10:meMA.Ode1C11.text	Θεῖοι πεφυκότες Μαθηταί, τοῦ σαρκωθέντος διʼ οἶκτον Θεοῦ ἡμῶν, τοῦτον δυσωπήσατε, ἁμαρτιῶν δωρήσασθαι συγχώρησιν, τοῖς ἐπιτελοῦσιν, ὑμῶν τὴν μνήμην Μακάριοι.
ltx/gr_gr_cog/me.m11.d10:meMA.Ode1C12.incipit	Ἔσοπτρα Θεοῦ φωτοειδῆ, χωρητικὰ τῶν…
ltx/gr_gr_cog/me.m11.d10:meMA.Ode1C12.melody	@ltx/gr_gr_cog/he.h.m1:heHE.SouITropaiouchos.name
ltx/gr_gr_cog/me.m11.d10:meMA.Ode1C12.mode	@ltx/gr_gr_cog/miscellanea:misc.Mode1
ltx/gr_gr_cog/me.m11.d10:meMA.Ode1C12.ode	@ltx/gr_gr_cog/miscellanea:misc.Ode1
ltx/gr_gr_cog/me.m11.d10:meMA.Ode1C12.text	Ἔσοπτρα Θεοῦ φωτοειδῆ, χωρητικὰ τῶν αὐτοῦ διαδόσεων, ὤφθητε μακάριοι, πᾶσι πιστοῖς ἀγαθοδότως νέμοντες, τὰς σωτηριώδεις, αὐγὰς θεόπται Ἀπόστολοι.
ltx/gr_gr_cog/me.m11.d10:meMA.Ode1C13.incipit	Ηὔγασαν τοῖς πᾶσι φωτισμόν, ἀπαυγασμάτων…
ltx/gr_gr_cog/me.m11.d10:meMA.Ode1C13.melody	@ltx/gr_gr_cog/he.h.m1:heHE.SouITropaiouchos.name
ltx/gr_gr_cog/me.m11.d10:meMA.Ode1C13.mode	@ltx/gr_gr_cog/miscellanea:misc.Mode1
ltx/gr_gr_cog/me.m11.d10:meMA.Ode1C13.ode	@ltx/gr_gr_cog/miscellanea:misc.Ode1
ltx/gr_gr_cog/me.m11.d10:meMA.Ode1C13.text	Ηὔγασαν τοῖς πᾶσι φωτισμόν, ἀπαυγασμάτων πηγὰς ἀρυσάμενοι, Ἔραστος καὶ Τέρτιος, καὶ Ὀλυμπᾶς, Ῥοδίων καὶ Σωσίπατρος, ἅμα τῷ Κουάρτῳ, οὓς εὐσεβῶς μακαρίσωμεν.
ltx/gr_gr_cog/me.m11.d10:meMA.Ode1C1T.incipit	Γένος τὸ ἀνθρώπινον τῇ σῇ…
ltx/gr_gr_cog/me.m11.d10:meMA.Ode1C1T.melody	@ltx/gr_gr_cog/he.h.m1:heHE.SouITropaiouchos.name
ltx/gr_gr_cog/me.m11.d10:meMA.Ode1C1T.mode	@ltx/gr_gr_cog/miscellanea:misc.Mode1
ltx/gr_gr_cog/me.m11.d10:meMA.Ode1C1T.ode	@ltx/gr_gr_cog/miscellanea:misc.Ode1
ltx/gr_gr_cog/me.m11.d10:meMA.Ode1C1T.text	Γένος τὸ ἀνθρώπινον τῇ σῇ, κυοφορίᾳ Παρθένε ἀνέπλασας· Λόγον γὰρ ἐκύησας, τὸν τοῦ Πατρὸς σάρκα θνητὴν φορέσαντα, καὶ ἀθανασίας, ὁδοὺς ἡμῖν ὑποδείξαντα.
ltx/gr_gr_cog/me.m11.d10:meMA.Ode1C21.greekmelody	@ltx/gr_gr_cog/he.h.m2:heHE.DefteLaoi.greekname
ltx/gr_gr_cog/me.m11.d10:meMA.Ode1C21.incipit	Ταῖς θεϊκαῖς, καταστραπτόμενος πάντοτε, μαρμαρυγαῖς…
ltx/gr_gr_cog/me.m11.d10:meMA.Ode1C21.melody	@ltx/gr_gr_cog/he.h.m2:heHE.DefteLaoi.name
ltx/gr_gr_cog/me.m11.d10:meMA.Ode1C21.mode	@ltx/gr_gr_cog/miscellanea:misc.Mode2
ltx/gr_gr_cog/me.m11.d10:meMA.Ode1C21.ode	@ltx/gr_gr_cog/miscellanea:misc.Ode1
ltx/gr_gr_cog/me.m11.d10:meMA.Ode1C21.text	Ταῖς θεϊκαῖς, καταστραπτόμενος πάντοτε, μαρμαρυγαῖς Πανεύφημε, τὴν φωτοφόρον σου ἑορτὴν τοὺς τιμῶντας, καταύγασον, καὶ σκότους δεινῶν ἀπάλλαξον.
ltx/gr_gr_cog/me.m11.d10:meMA.Ode1C22.incipit	Ὁ τοῦ Χριστοῦ, θεῖός σε…
ltx/gr_gr_cog/me.m11.d10:meMA.Ode1C22.melody	@ltx/gr_gr_cog/he.h.m2:heHE.DefteLaoi.name
ltx/gr_gr_cog/me.m11.d10:meMA.Ode1C22.mode	@ltx/gr_gr_cog/miscellanea:misc.Mode2
ltx/gr_gr_cog/me.m11.d10:meMA.Ode1C22.ode	@ltx/gr_gr_cog/miscellanea:misc.Ode1
ltx/gr_gr_cog/me.m11.d10:meMA.Ode1C22.text	Ὁ τοῦ Χριστοῦ, θεῖός σε πόθος ἐξέκαυσε, καὶ δυνατὸν εἰργάσατο, τὴν εὐκατάπρηστον, καταφλέγοντα ὕλην, τῆς εἰδωλομανίας, Μάρτυς πανάριστε.
ltx/gr_gr_cog/me.m11.d10:meMA.Ode1C23.incipit	Ὑπομονῇ, καὶ καρτερίᾳ διήλεγξας, τοὺς…
ltx/gr_gr_cog/me.m11.d10:meMA.Ode1C23.melody	@ltx/gr_gr_cog/he.h.m2:heHE.DefteLaoi.name
ltx/gr_gr_cog/me.m11.d10:meMA.Ode1C23.mode	@ltx/gr_gr_cog/miscellanea:misc.Mode2
ltx/gr_gr_cog/me.m11.d10:meMA.Ode1C23.ode	@ltx/gr_gr_cog/miscellanea:misc.Ode1
ltx/gr_gr_cog/me.m11.d10:meMA.Ode1C23.text	Ὑπομονῇ, καὶ καρτερίᾳ διήλεγξας, τοὺς παρανόμους σέβειν σε, καταναγκάζοντας, Ἀθλοφόρε, Ὀρέστα, ἔργα χειρῶν ἀνθρώπων, ἄψυχα ξόανα.
ltx/gr_gr_cog/me.m11.d10:meMA.Ode1C2T.incipit	Σὲ τοῦ Θεοῦ, τὸ καθαρώτατον…
ltx/gr_gr_cog/me.m11.d10:meMA.Ode1C2T.melody	@ltx/gr_gr_cog/he.h.m2:heHE.DefteLaoi.name
ltx/gr_gr_cog/me.m11.d10:meMA.Ode1C2T.mode	@ltx/gr_gr_cog/miscellanea:misc.Mode2
ltx/gr_gr_cog/me.m11.d10:meMA.Ode1C2T.ode	@ltx/gr_gr_cog/miscellanea:misc.Ode1
ltx/gr_gr_cog/me.m11.d10:meMA.Ode1C2T.text	Σὲ τοῦ Θεοῦ, τὸ καθαρώτατον σκήνωμα, καθικετεύω Ἄχραντε, τὴν σπιλωθεῖσάν μου, ἡδοναῖς ἀκαθάρτοις, καθάρισον καρδίαν, τῇ μεσιτείᾳ σου.
ltx/gr_gr_cog/me.m11.d10:meMA.Ode3C11.greekmelody	@ltx/gr_gr_cog/he.h.m1:heHE.OMonosEidos.greekname
ltx/gr_gr_cog/me.m11.d10:meMA.Ode3C11.incipit	Οἱ λόγον ὡς λύχνον νοητόν…
ltx/gr_gr_cog/me.m11.d10:meMA.Ode3C11.melody	@ltx/gr_gr_cog/he.h.m1:heHE.OMonosEidos.name
ltx/gr_gr_cog/me.m11.d10:meMA.Ode3C11.mode	@ltx/gr_gr_cog/miscellanea:misc.Mode1
ltx/gr_gr_cog/me.m11.d10:meMA.Ode3C11.ode	@ltx/gr_gr_cog/miscellanea:misc.Ode3
ltx/gr_gr_cog/me.m11.d10:meMA.Ode3C11.text	Οἱ λόγον ὡς λύχνον νοητόν, προσφέροντες Ἀπόστολοι, θεοπειθῶς τὴν πᾶσαν κτίσιν διήλθετε, τὸ ταύτης σκότος ἀποδιώκοντες, καὶ υἱοὺς δεικνύοντες, τοῦ φωτός ἐν χάριτι, τοὺς νυκτὶ ἀγνωσίας δουλεύοντας.
ltx/gr_gr_cog/me.m11.d10:meMA.Ode3C12.incipit	Ῥημάτων ὑμῶν προφητικῶς, εἰς πᾶσαν…
ltx/gr_gr_cog/me.m11.d10:meMA.Ode3C12.melody	@ltx/gr_gr_cog/he.h.m1:heHE.OMonosEidos.name
ltx/gr_gr_cog/me.m11.d10:meMA.Ode3C12.mode	@ltx/gr_gr_cog/miscellanea:misc.Mode1
ltx/gr_gr_cog/me.m11.d10:meMA.Ode3C12.ode	@ltx/gr_gr_cog/miscellanea:misc.Ode3
ltx/gr_gr_cog/me.m11.d10:meMA.Ode3C12.text	Ῥημάτων ὑμῶν προφητικῶς, εἰς πᾶσαν ἐξελήλυθε, τὴν οἰκουμένην φθόγγος σωτήριος, καὶ ἡ τῶν ἔργων λαμπρὰ ἐπίδειξις, πᾶσαν γῆν ἐπέδραμε, ψυχὰς μεταπλάττουσα, θεηγόροι Κυρίου Ἀπόστολοι.
ltx/gr_gr_cog/me.m11.d10:meMA.Ode3C13.incipit	Οἰκῆσαν ψυχαῖς ὑμῶν σοφοί, τὸ…
ltx/gr_gr_cog/me.m11.d10:meMA.Ode3C13.melody	@ltx/gr_gr_cog/he.h.m1:heHE.OMonosEidos.name
ltx/gr_gr_cog/me.m11.d10:meMA.Ode3C13.mode	@ltx/gr_gr_cog/miscellanea:misc.Mode1
ltx/gr_gr_cog/me.m11.d10:meMA.Ode3C13.ode	@ltx/gr_gr_cog/miscellanea:misc.Ode3
ltx/gr_gr_cog/me.m11.d10:meMA.Ode3C13.text	Οἰκῆσαν ψυχαῖς ὑμῶν σοφοί, τὸ Πνεῦμα τὸ Πανάγιον, θεοειδεῖς διόλου εἰργάσατο, ἐντεῦθεν κόσμον περιερχόμενοι, ναοὺς κατεστρέψατε, τῶν εἰδώλων χάριτι, καὶ Θεῷ ἐκκλησίας ἐδείμασθε.
ltx/gr_gr_cog/me.m11.d10:meMA.Ode3C1T.incipit	Υἱὸν τοῦ Πατρὸς μονογενῆ, ἀμήτορα…
ltx/gr_gr_cog/me.m11.d10:meMA.Ode3C1T.melody	@ltx/gr_gr_cog/he.h.m1:heHE.OMonosEidos.name
ltx/gr_gr_cog/me.m11.d10:meMA.Ode3C1T.mode	@ltx/gr_gr_cog/miscellanea:misc.Mode1
ltx/gr_gr_cog/me.m11.d10:meMA.Ode3C1T.ode	@ltx/gr_gr_cog/miscellanea:misc.Ode3
ltx/gr_gr_cog/me.m11.d10:meMA.Ode3C1T.text	Υἱὸν τοῦ Πατρὸς μονογενῆ, ἀμήτορα τὸ πρότερον, ἐκ σοῦ τεχθέντα γνόντες ἀπάτορα, Θεοῦ Μητέρα ὁμολογοῦμέν σε, ἀπαθῶς κυήσασαν, καὶ Παρθένον μείνασαν, ὑπέρ λόγον Μαρία θεονυμφε.
ltx/gr_gr_cog/me.m11.d10:meMA.Ode3C21.greekmelody	@ltx/gr_gr_cog/he.h.m2:heHE.EnPetraMeTisPisteos.greekname
ltx/gr_gr_cog/me.m11.d10:meMA.Ode3C21.incipit	Σθενούμενος, δυνάμει τοῦ Παρακλήτου, παρέστης…
ltx/gr_gr_cog/me.m11.d10:meMA.Ode3C21.melody	@ltx/gr_gr_cog/he.h.m2:heHE.EnPetraMeTisPisteos.name
ltx/gr_gr_cog/me.m11.d10:meMA.Ode3C21.mode	@ltx/gr_gr_cog/miscellanea:misc.Mode2
ltx/gr_gr_cog/me.m11.d10:meMA.Ode3C21.ode	@ltx/gr_gr_cog/miscellanea:misc.Ode3
ltx/gr_gr_cog/me.m11.d10:meMA.Ode3C21.text	Σθενούμενος, δυνάμει τοῦ Παρακλήτου, παρέστης τῷ δικάζοντι παρανόμως, καὶ τοῦτον τῇ τῶν λόγων σου δυναστείᾳ, Παμμάκαρ ᾔσχυνας, καὶ ψάλλων ἔλεγες· Ὡς οὐκ ἔστιν Ἅγιος, πλήν σου Κύριε.
ltx/gr_gr_cog/me.m11.d10:meMA.Ode3C22.incipit	Ὁ λόγος σου, τῷ βίῳ…
ltx/gr_gr_cog/me.m11.d10:meMA.Ode3C22.melody	@ltx/gr_gr_cog/he.h.m2:heHE.EnPetraMeTisPisteos.name
ltx/gr_gr_cog/me.m11.d10:meMA.Ode3C22.mode	@ltx/gr_gr_cog/miscellanea:misc.Mode2
ltx/gr_gr_cog/me.m11.d10:meMA.Ode3C22.ode	@ltx/gr_gr_cog/miscellanea:misc.Ode3
ltx/gr_gr_cog/me.m11.d10:meMA.Ode3C22.text	Ὁ λόγος σου, τῷ βίῳ λελαμπρυσμένος, ὁ βίος σου τῷ λόγῳ πεπυρσευμένος, πολλοὺς πρὸς φῶς μετήγαγον εὐσεβείας, Μάρτυς πολύαθλε, μεθʼ ὧν καὶ ἔψαλλες· Ὡς οὐκ ἔστιν Ἅγιος, πλήν σου Κύριε.
ltx/gr_gr_cog/me.m11.d10:meMA.Ode3C23.incipit	Ὑψούμενον, τὸν ἄνομον ἀπονοίᾳ, κατέῤῥαξας…
ltx/gr_gr_cog/me.m11.d10:meMA.Ode3C23.melody	@ltx/gr_gr_cog/he.h.m2:heHE.EnPetraMeTisPisteos.name
ltx/gr_gr_cog/me.m11.d10:meMA.Ode3C23.mode	@ltx/gr_gr_cog/miscellanea:misc.Mode2
ltx/gr_gr_cog/me.m11.d10:meMA.Ode3C23.ode	@ltx/gr_gr_cog/miscellanea:misc.Ode3
ltx/gr_gr_cog/me.m11.d10:meMA.Ode3C23.text	Ὑψούμενον, τὸν ἄνομον ἀπονοίᾳ, κατέῤῥαξας ἀνδρείᾳ καὶ καρτερίᾳ, ὑψώθης δὲ πρὸς Κύριον Ἀθλοφόρε, Ὀρέστα ἔνδοξε, καὶ ψάλλων ἔλεγες· Ὡς οὐκ ἔστιν Ἅγιος, πλήν σου Κύριε.
ltx/gr_gr_cog/me.m11.d10:meMA.Ode3C2T.incipit	Συνέλαβες, ἐν μήτρᾳ σου Θεομῆτορ…
ltx/gr_gr_cog/me.m11.d10:meMA.Ode3C2T.melody	@ltx/gr_gr_cog/he.h.m2:heHE.EnPetraMeTisPisteos.name
ltx/gr_gr_cog/me.m11.d10:meMA.Ode3C2T.mode	@ltx/gr_gr_cog/miscellanea:misc.Mode2
ltx/gr_gr_cog/me.m11.d10:meMA.Ode3C2T.ode	@ltx/gr_gr_cog/miscellanea:misc.Ode3
ltx/gr_gr_cog/me.m11.d10:meMA.Ode3C2T.text	Συνέλαβες, ἐν μήτρᾳ σου Θεομῆτορ, τὸν Πλάστην σου καὶ Κύριον τῶν ἁπάντων, καὶ τοῦτον ἀπεκύησας ὑπὲρ λόγον, σάρκα γενόμενον· διὸ σοὶ κράζομεν· Ὡς οὐκ ἔστιν ἄχραντος, πλήν σου Δέσποινα.
ltx/gr_gr_cog/me.m11.d10:meMA.Ode3H.greekmelody	@ltx/gr_gr_cog/he.h.m2:heHE.EnPetraMeTisPisteos.greekname
ltx/gr_gr_cog/me.m11.d10:meMA.Ode3H.incipit	@ltx/gr_gr_cog/he.h.m2:heHE.EnPetraMeTisPisteos.incipit
ltx/gr_gr_cog/me.m11.d10:meMA.Ode3H.melody	@ltx/gr_gr_cog/he.h.m2:heHE.EnPetraMeTisPisteos.melody
ltx/gr_gr_cog/me.m11.d10:meMA.Ode3H.mode	@ltx/gr_gr_cog/miscellanea:misc.Mode2
ltx/gr_gr_cog/me.m11.d10:meMA.Ode3H.ode	@ltx/gr_gr_cog/miscellanea:misc.Ode3
ltx/gr_gr_cog/me.m11.d10:meMA.Ode3H.text	@ltx/gr_gr_cog/he.h.m2:heHE.EnPetraMeTisPisteos.text
ltx/gr_gr_cog/me.m11.d10:meMA.Ode3Kathisma1.greekmelody	@ltx/gr_gr_cog/he.a.m1:heAU.TonTafonSouSotir.greekname
ltx/gr_gr_cog/me.m11.d10:meMA.Ode3Kathisma1.incipit	Ἐράστου Ὀλυμπᾶ, Σωσιπάτρου Τερτίου, Ῥοδίωνος…
ltx/gr_gr_cog/me.m11.d10:meMA.Ode3Kathisma1.melody	@ltx/gr_gr_cog/he.a.m1:heAU.TonTafonSouSotir.name
ltx/gr_gr_cog/me.m11.d10:meMA.Ode3Kathisma1.mode	@ltx/gr_gr_cog/miscellanea:misc.Mode1
ltx/gr_gr_cog/me.m11.d10:meMA.Ode3Kathisma1.text	Ἐράστου Ὀλυμπᾶ, Σωσιπάτρου Τερτίου, Ῥοδίωνος ὁμοῦ, καὶ Κουάρτου τὴν μνήμην, συμφώνως τιμήσωμεν, πρὸς αὐτοὺς ἀνακράζοντες· θεῖοι Κήρυκες, καὶ ὑπηρέται τοῦ Λόγου, τὰς ψυχὰς ἡμῶν, αἰωνιζούσης βασάνου, εὐχαῖς ὑμῶν ρύσασθε.
ltx/gr_gr_cog/me.m11.d10:meMA.Ode3Kathisma2.greekmelody	@ltx/gr_gr_cog/he.a.m4:heAU.OYpsotheisEnToStavro.greekname
ltx/gr_gr_cog/me.m11.d10:meMA.Ode3Kathisma2.incipit	Τὴν τῶν μελῶν ἀποκοπὴν καρτερήσας…
ltx/gr_gr_cog/me.m11.d10:meMA.Ode3Kathisma2.melody	@ltx/gr_gr_cog/he.a.m4:heAU.OYpsotheisEnToStavro.name
ltx/gr_gr_cog/me.m11.d10:meMA.Ode3Kathisma2.mode	@ltx/gr_gr_cog/miscellanea:misc.Mode4
ltx/gr_gr_cog/me.m11.d10:meMA.Ode3Kathisma2.text	Τὴν τῶν μελῶν ἀποκοπὴν καρτερήσας, καὶ τοῦ πυρὸς τὴν χαλεπὴν τιμωρίαν, μαρτυρικῶς ἠγώνισαι πανόλβιε· στέφος ἀνεπλέξω δέ, ἀφθαρσίας παμμάκαρ, θρόνῳ παριστάμενος, τῆς Ἁγίας Τριάδος, ἣν ἐκδυσώπει ῥύσασθαι κακῶν, Μάρτυς Ὀρέστα, τοὺς πίστει ὑμνοῦντάς σε.
ltx/gr_gr_cog/me.m11.d10:meMA.Ode3KathismaSt.incipit	Τὸν ἐξ ἀνάρχου τοῦ Πατρὸς…
ltx/gr_gr_cog/me.m11.d10:meMA.Ode3KathismaSt.melody	@ltx/gr_gr_cog/he.a.m4:heAU.OYpsotheisEnToStavro.name
ltx/gr_gr_cog/me.m11.d10:meMA.Ode3KathismaSt.mode	@ltx/gr_gr_cog/miscellanea:misc.Mode4
ltx/gr_gr_cog/me.m11.d10:meMA.Ode3KathismaSt.text	Τὸν ἐξ ἀνάρχου τοῦ Πατρὸς γεννηθέντα, ἡ ἐπʼ ἐσχάτων σε σαρκὶ τετοκυῖα, ἐπὶ Σταυροῦ κρεμάμενον ὁρῶσά σε Χριστέ, Οἴμοι! ποθεινότατε, Ἰησοῦ ἀνεβόα, πῶς ὁ δοξαζόμενος, ὡς Θεὸς ὑπʼ Ἀγγέλων, ὑπὸ ἀνόμων νῦν βροτῶν Υἱέ, θέλων σταυροῦσαι; Ὑμνῶ σε Μακρόθυμε.
ltx/gr_gr_cog/me.m11.d10:meMA.Ode3KathismaT.incipit	@ltx/gr_gr_cog/me.m06.d28:meMA.Ode3KathismaT.incipit
ltx/gr_gr_cog/me.m11.d10:meMA.Ode3KathismaT.melody	@ltx/gr_gr_cog/he.a.m4:heAU.OYpsotheisEnToStavro.name
ltx/gr_gr_cog/me.m11.d10:meMA.Ode3KathismaT.mode	@ltx/gr_gr_cog/miscellanea:misc.Mode4
ltx/gr_gr_cog/me.m11.d10:meMA.Ode3KathismaT.text	@ltx/gr_gr_cog/me.m06.d28:meMA.Ode3KathismaT.text
ltx/gr_gr_cog/me.m11.d10:meMA.Ode4C11.greekmelody	@ltx/gr_gr_cog/he.h.m1:heHE.OrosSeTiChariti.greekname
ltx/gr_gr_cog/me.m11.d10:meMA.Ode4C11.incipit	Στηρίγματα τοῖς πάλαι, ἀστηρίκτοις γενόμενοι…
ltx/gr_gr_cog/me.m11.d10:meMA.Ode4C11.melody	@ltx/gr_gr_cog/he.h.m1:heHE.OrosSeTiChariti.name
ltx/gr_gr_cog/me.m11.d10:meMA.Ode4C11.mode	@ltx/gr_gr_cog/miscellanea:misc.Mode1
ltx/gr_gr_cog/me.m11.d10:meMA.Ode4C11.ode	@ltx/gr_gr_cog/miscellanea:misc.Ode4
ltx/gr_gr_cog/me.m11.d10:meMA.Ode4C11.text	Στηρίγματα τοῖς πάλαι, ἀστηρίκτοις γενόμενοι, ἀνεμοχλεύσατε ὑμῶν θεοπαρόχοις διδαχαῖς, ἐχθροῦ ὀχυρώματα παντοδαπά, καὶ ἀφανείᾳ δεδώκατε, θεοειδεῖς τοῦ Σωτῆρος Ἀπόστολοι.
ltx/gr_gr_cog/me.m11.d10:meMA.Ode4C12.incipit	Μεγάλως Χριστοῦ, τὰ μεγαλεῖα κηρύττοντες…
ltx/gr_gr_cog/me.m11.d10:meMA.Ode4C12.melody	@ltx/gr_gr_cog/he.h.m1:heHE.OrosSeTiChariti.name
ltx/gr_gr_cog/me.m11.d10:meMA.Ode4C12.mode	@ltx/gr_gr_cog/miscellanea:misc.Mode1
ltx/gr_gr_cog/me.m11.d10:meMA.Ode4C12.ode	@ltx/gr_gr_cog/miscellanea:misc.Ode4
ltx/gr_gr_cog/me.m11.d10:meMA.Ode4C12.text	Μεγάλως Χριστοῦ, τὰ μεγαλεῖα κηρύττοντες, τοὺς σμικρυνθέντας παντελῶς, μεγαλοκήρυκες βροτούς, μεγάλως φωτίσαντες, περιφανεῖς τῷ μεγαλείῳ τῆς χάριτος, ἀπετελέσατε θεῖοι Ἀπόστολοι.
ltx/gr_gr_cog/me.m11.d10:meMA.Ode4C13.incipit	Αἰνείσθω ἐνθέοις, Ὀλυμπᾶς μελῳδήμασι, καὶ…
ltx/gr_gr_cog/me.m11.d10:meMA.Ode4C13.melody	@ltx/gr_gr_cog/he.h.m1:heHE.OrosSeTiChariti.name
ltx/gr_gr_cog/me.m11.d10:meMA.Ode4C13.mode	@ltx/gr_gr_cog/miscellanea:misc.Mode1
ltx/gr_gr_cog/me.m11.d10:meMA.Ode4C13.ode	@ltx/gr_gr_cog/miscellanea:misc.Ode4
ltx/gr_gr_cog/me.m11.d10:meMA.Ode4C13.text	Αἰνείσθω ἐνθέοις, Ὀλυμπᾶς μελῳδήμασι, καὶ ὁ Ῥοδίων σὺν αὐτῷ, μεγαλυνέσθω εὐσεβῶς, τὸν δρόμον τελέσαντες μαρτυρικῶς, σὺν Πέτρῳ τῷ θεοκήρυκι, ἐπὶ τῆς Ῥώμης τὰς κάρας τεμνόμενοι.
ltx/gr_gr_cog/me.m11.d10:meMA.Ode4C1T.incipit	Θαυμάτων ἐπέκεινα, ἁπάντων πανάμωμε, τὸ…
ltx/gr_gr_cog/me.m11.d10:meMA.Ode4C1T.melody	@ltx/gr_gr_cog/he.h.m1:heHE.OrosSeTiChariti.name
ltx/gr_gr_cog/me.m11.d10:meMA.Ode4C1T.mode	@ltx/gr_gr_cog/miscellanea:misc.Mode1
ltx/gr_gr_cog/me.m11.d10:meMA.Ode4C1T.ode	@ltx/gr_gr_cog/miscellanea:misc.Ode4
ltx/gr_gr_cog/me.m11.d10:meMA.Ode4C1T.text	Θαυμάτων ἐπέκεινα, ἁπάντων πανάμωμε, τὸ ἐπὶ σοὶ καινουργηθέν, θαῦμα ἐδείχθη ἐμφανῶς· Θεὸν γὰρ ἐκύησας σωματικῶς, βροτοῖς διʼ οἶκτον ἑνούμενον, ἐν ἀσυγχύτῳ ἑνώσει Θεόνυμφε.
ltx/gr_gr_cog/me.m11.d10:meMA.Ode4C21.greekmelody	@ltx/gr_gr_cog/he.h.m2:heHE.ElilythasEkParthenou.greekname
ltx/gr_gr_cog/me.m11.d10:meMA.Ode4C21.incipit	Οὐκ ἔσεισαν, τῆς ψυχῆς σου…
ltx/gr_gr_cog/me.m11.d10:meMA.Ode4C21.melody	@ltx/gr_gr_cog/he.h.m2:heHE.ElilythasEkParthenou.name
ltx/gr_gr_cog/me.m11.d10:meMA.Ode4C21.mode	@ltx/gr_gr_cog/miscellanea:misc.Mode2
ltx/gr_gr_cog/me.m11.d10:meMA.Ode4C21.ode	@ltx/gr_gr_cog/miscellanea:misc.Ode4
ltx/gr_gr_cog/me.m11.d10:meMA.Ode4C21.text	Οὐκ ἔσεισαν, τῆς ψυχῆς σου τὸν πύργον συῤῥεύσαντες, βασάνων οἱ χείμαῤῥοι, Μάρτυς Ὀρέστα μακάριε· πέτρᾳ γὰρ ἐστήρικτο, τῆς τοῦ Κυρίου ἀγάπης ἀξιάγαστε.
ltx/gr_gr_cog/me.m11.d10:meMA.Ode4C22.incipit	Ῥημάτων σου, ἀντιβλέψαι τῷ φέγγει…
ltx/gr_gr_cog/me.m11.d10:meMA.Ode4C22.melody	@ltx/gr_gr_cog/he.h.m2:heHE.ElilythasEkParthenou.name
ltx/gr_gr_cog/me.m11.d10:meMA.Ode4C22.mode	@ltx/gr_gr_cog/miscellanea:misc.Mode2
ltx/gr_gr_cog/me.m11.d10:meMA.Ode4C22.ode	@ltx/gr_gr_cog/miscellanea:misc.Ode4
ltx/gr_gr_cog/me.m11.d10:meMA.Ode4C22.text	Ῥημάτων σου, ἀντιβλέψαι τῷ φέγγει ὁ τύραννος, νυκτὶ πορευόμενος, τῆς ἀγνωσίας οὐκ ἴσχυσεν· ὅθεν καταικίζων σε, υἱὸν φωτὸς καὶ ἡμέρας ἀπειργάσατο.
ltx/gr_gr_cog/me.m11.d10:meMA.Ode4C23.incipit	Ἐνεύρου σε, Ἰησοῦς ὁ Χριστὸς…
ltx/gr_gr_cog/me.m11.d10:meMA.Ode4C23.melody	@ltx/gr_gr_cog/he.h.m2:heHE.ElilythasEkParthenou.name
ltx/gr_gr_cog/me.m11.d10:meMA.Ode4C23.mode	@ltx/gr_gr_cog/miscellanea:misc.Mode2
ltx/gr_gr_cog/me.m11.d10:meMA.Ode4C23.ode	@ltx/gr_gr_cog/miscellanea:misc.Ode4
ltx/gr_gr_cog/me.m11.d10:meMA.Ode4C23.text	Ἐνεύρου σε, Ἰησοῦς ὁ Χριστὸς θείᾳ χάριτι, βασάνοις θλιβόμενον, καὶ αἰκισμοῖς δαπανώμενον, καὶ κατατεινόμενον, ἀνηλεῶς Ἀθλοφόρε παναοίδιμε.
ltx/gr_gr_cog/me.m11.d10:meMA.Ode4C2T.incipit	Σὲ Ἄχραντε, Ἀββακοὺμ ὄρος γράφει…
ltx/gr_gr_cog/me.m11.d10:meMA.Ode4C2T.melody	@ltx/gr_gr_cog/he.h.m2:heHE.ElilythasEkParthenou.name
ltx/gr_gr_cog/me.m11.d10:meMA.Ode4C2T.mode	@ltx/gr_gr_cog/miscellanea:misc.Mode2
ltx/gr_gr_cog/me.m11.d10:meMA.Ode4C2T.ode	@ltx/gr_gr_cog/miscellanea:misc.Ode4
ltx/gr_gr_cog/me.m11.d10:meMA.Ode4C2T.text	Σὲ Ἄχραντε, Ἀββακοὺμ ὄρος γράφει κατάσκιον, ἐξ οὗ ἐπεδήμησε, μόνος ὁ Λόγος σαρκούμενος, ἄνθρωπος γενόμενος, ὑπερβολῇ εὐσπλαγχνίας ὁ φιλάνθρωπος.
ltx/gr_gr_cog/me.m11.d10:meMA.Ode5C11.greekmelody	@ltx/gr_gr_cog/he.h.m1:heHE.OFotisasTiEllampsei.greekname
ltx/gr_gr_cog/me.m11.d10:meMA.Ode5C11.incipit	Ἡ σοφία τοῦ Πατρὸς ἡ…
ltx/gr_gr_cog/me.m11.d10:meMA.Ode5C11.melody	@ltx/gr_gr_cog/he.h.m1:heHE.OFotisasTiEllampsei.name
ltx/gr_gr_cog/me.m11.d10:meMA.Ode5C11.mode	@ltx/gr_gr_cog/miscellanea:misc.Mode1
ltx/gr_gr_cog/me.m11.d10:meMA.Ode5C11.ode	@ltx/gr_gr_cog/miscellanea:misc.Ode5
ltx/gr_gr_cog/me.m11.d10:meMA.Ode5C11.text	Ἡ σοφία τοῦ Πατρὸς ἡ τὸ πᾶν οὐσιώσασα, διδασκάλους εἰς τὸν κόσμον ὑμᾶς ἐξαπέστειλεν, ἐν σοφίᾳ Πνεύματος, καὶ ἀληθείας ἐπιδείξει, πάντας ἐνθέως φωτίζοντας.
ltx/gr_gr_cog/me.m11.d10:meMA.Ode5C12.incipit	Τὸ τοῦ λόγου ἐπιβάλλοντες Πάνσοφοι…
ltx/gr_gr_cog/me.m11.d10:meMA.Ode5C12.melody	@ltx/gr_gr_cog/he.h.m1:heHE.OFotisasTiEllampsei.name
ltx/gr_gr_cog/me.m11.d10:meMA.Ode5C12.mode	@ltx/gr_gr_cog/miscellanea:misc.Mode1
ltx/gr_gr_cog/me.m11.d10:meMA.Ode5C12.ode	@ltx/gr_gr_cog/miscellanea:misc.Ode5
ltx/gr_gr_cog/me.m11.d10:meMA.Ode5C12.text	Τὸ τοῦ λόγου ἐπιβάλλοντες Πάνσοφοι ἄγκιστρον, ἀνιμᾶσθε ἐκ βυθοῦ ἀγνωσίας ἐν χάριτι, τοὺς ἰχθύων πέλοντας, ἀφωνοτέρους καὶ Κυρίῳ, πεπιστευκότας προσήξατε.
ltx/gr_gr_cog/me.m11.d10:meMA.Ode5C13.incipit	Αἰνέσωμεν, Ὀλυμπᾶν καὶ τὸν μέγαν…
ltx/gr_gr_cog/me.m11.d10:meMA.Ode5C13.melody	@ltx/gr_gr_cog/he.h.m1:heHE.OFotisasTiEllampsei.name
ltx/gr_gr_cog/me.m11.d10:meMA.Ode5C13.mode	@ltx/gr_gr_cog/miscellanea:misc.Mode1
ltx/gr_gr_cog/me.m11.d10:meMA.Ode5C13.ode	@ltx/gr_gr_cog/miscellanea:misc.Ode5
ltx/gr_gr_cog/me.m11.d10:meMA.Ode5C13.text	Αἰνέσωμεν, Ὀλυμπᾶν καὶ τὸν μέγαν Ῥοδίωνα, καὶ Τέρτιον καὶ Σωσίπατρον ἅμα καὶ Ἔραστον, καὶ τὸν θεῖον Κούαρτον, τοὺς Χριστοκήρυκας καὶ πάντων, τῶν εὐσεβῶν ἀντιλήπτορας.
ltx/gr_gr_cog/me.m11.d10:meMA.Ode5C1T.incipit	Συνέλαβες διὰ λόγου τὸν Λόγον…
ltx/gr_gr_cog/me.m11.d10:meMA.Ode5C1T.melody	@ltx/gr_gr_cog/he.h.m1:heHE.OFotisasTiEllampsei.name
ltx/gr_gr_cog/me.m11.d10:meMA.Ode5C1T.mode	@ltx/gr_gr_cog/miscellanea:misc.Mode1
ltx/gr_gr_cog/me.m11.d10:meMA.Ode5C1T.ode	@ltx/gr_gr_cog/miscellanea:misc.Ode5
ltx/gr_gr_cog/me.m11.d10:meMA.Ode5C1T.text	Συνέλαβες διὰ λόγου τὸν Λόγον Πανάμωμε, καὶ ἔτεκες ὑπὲρ λόγον γενόμενον ἄνθρωπον, Θεοτόκε Δέσποινα· διό σε λόγοις θεοπνεύστοις, διαπαντὸς μακαρίζομεν.
ltx/gr_gr_cog/me.m11.d10:meMA.Ode5C21.greekmelody	@ltx/gr_gr_cog/he.h.m2:heHE.OFotismos.greekname
ltx/gr_gr_cog/me.m11.d10:meMA.Ode5C21.incipit	Τοῖς ῥαβδισμοῖς, συντριβόμενος Μάκαρ, ἅπαν…
ltx/gr_gr_cog/me.m11.d10:meMA.Ode5C21.melody	@ltx/gr_gr_cog/he.h.m2:heHE.OFotismos.name
ltx/gr_gr_cog/me.m11.d10:meMA.Ode5C21.mode	@ltx/gr_gr_cog/miscellanea:misc.Mode2
ltx/gr_gr_cog/me.m11.d10:meMA.Ode5C21.ode	@ltx/gr_gr_cog/miscellanea:misc.Ode5
ltx/gr_gr_cog/me.m11.d10:meMA.Ode5C21.text	Τοῖς ῥαβδισμοῖς, συντριβόμενος Μάκαρ, ἅπαν τὸ σῶμα, ἔστης ὡς ἀδάμας εὐσθενεστάτην, τὴν καρτερίαν ἐνδεικνύμενος πίστει, καὶ κραυγάζων Ὀρέστα Ἔνδοξε· Ἕτερον ἐκτός σου, Θεὸν οὐκ ἐπίσταμαι.
ltx/gr_gr_cog/me.m11.d10:meMA.Ode5C22.incipit	Ἀφανισμῷ, τοὺς Θεοὺς τῶν Ἑλλήνων…
ltx/gr_gr_cog/me.m11.d10:meMA.Ode5C22.melody	@ltx/gr_gr_cog/he.h.m2:heHE.OFotismos.name
ltx/gr_gr_cog/me.m11.d10:meMA.Ode5C22.mode	@ltx/gr_gr_cog/miscellanea:misc.Mode2
ltx/gr_gr_cog/me.m11.d10:meMA.Ode5C22.ode	@ltx/gr_gr_cog/miscellanea:misc.Ode5
ltx/gr_gr_cog/me.m11.d10:meMA.Ode5C22.text	Ἀφανισμῷ, τοὺς Θεοὺς τῶν Ἑλλήνων σὺ παραπέμψας, ταῖς ἱερωτάταις σου πρὸς τὸν Κτίστην, εὐχαῖς Ὀρέστα, αἰκισμοὺς καθυπέστης, σφοδροτάτους καταικιζόμενος, καὶ τὴν τῆς σαρκός σου, δορὰν ἀφαιρουμενος.
ltx/gr_gr_cog/me.m11.d10:meMA.Ode5C2T.incipit	Ἀνατολῆς, τοῦ Ἡλίου τῆς δόξης…
ltx/gr_gr_cog/me.m11.d10:meMA.Ode5C2T.melody	@ltx/gr_gr_cog/he.h.m2:heHE.OFotismos.name
ltx/gr_gr_cog/me.m11.d10:meMA.Ode5C2T.mode	@ltx/gr_gr_cog/miscellanea:misc.Mode2
ltx/gr_gr_cog/me.m11.d10:meMA.Ode5C2T.ode	@ltx/gr_gr_cog/miscellanea:misc.Ode5
ltx/gr_gr_cog/me.m11.d10:meMA.Ode5C2T.text	Ἀνατολῆς, τοῦ Ἡλίου τῆς δόξης Μήτηρ ἐδείχθης, Κόρη ἐπὶ δύσιν τῆς ἀνθρωπίνης, γεγεννημένου ἀπωσμένης οὐσίας, καί τους πάντας καταφωτίζοντος, πάντας ἐκ νυκτός τῶν δεινῶν ἀπαλλάττοντος.
ltx/gr_gr_cog/me.m11.d10:meMA.Ode5C2Tr.incipit	Μίαν ἀρχήν, τρισυπόστατον σέβων μίαν…
ltx/gr_gr_cog/me.m11.d10:meMA.Ode5C2Tr.melody	@ltx/gr_gr_cog/he.h.m2:heHE.OFotismos.name
ltx/gr_gr_cog/me.m11.d10:meMA.Ode5C2Tr.mode	@ltx/gr_gr_cog/miscellanea:misc.Mode2
ltx/gr_gr_cog/me.m11.d10:meMA.Ode5C2Tr.ode	@ltx/gr_gr_cog/miscellanea:misc.Ode5
ltx/gr_gr_cog/me.m11.d10:meMA.Ode5C2Tr.text	Μίαν ἀρχήν, τρισυπόστατον σέβων μίαν οὐσίαν, μίαν κυριότητα καταγγέλλων, τῆς ὑπερθέου καὶ ἀκτίστου Τριάδος, ψευδωνύμους Θεοὺς συνέτριψας, καὶ τοὺς τῶν εἰδώλων, ναοὺς κατηδάφισας.
ltx/gr_gr_cog/me.m11.d10:meMA.Ode6C11.greekmelody	@ltx/gr_gr_cog/he.h.m1:heHE.EkyklosenImas.greekname
ltx/gr_gr_cog/me.m11.d10:meMA.Ode6C11.incipit	Ὑπέρτιμοι ὡς λίθοι κυλιόμενοι, ἐν…
ltx/gr_gr_cog/me.m11.d10:meMA.Ode6C11.melody	@ltx/gr_gr_cog/he.h.m1:heHE.EkyklosenImas.name
ltx/gr_gr_cog/me.m11.d10:meMA.Ode6C11.mode	@ltx/gr_gr_cog/miscellanea:misc.Mode1
ltx/gr_gr_cog/me.m11.d10:meMA.Ode6C11.ode	@ltx/gr_gr_cog/miscellanea:misc.Ode6
ltx/gr_gr_cog/me.m11.d10:meMA.Ode6C11.text	Ὑπέρτιμοι ὡς λίθοι κυλιόμενοι, ἐν γῇ κατεκυλίσατε, πρὸς εὐσέβειαν τοὺς γνώμῃ πονηρᾷ, λίθοις ἀναισθήτοις ἐπιθύοντας, θεοειδεῖς, τοῦ Λόγου μύσται μακαριώτατοι.
ltx/gr_gr_cog/me.m11.d10:meMA.Ode6C12.incipit	Μονάδα ἐν τρισὶ προσώποις ἄτμητον…
ltx/gr_gr_cog/me.m11.d10:meMA.Ode6C12.melody	@ltx/gr_gr_cog/he.h.m1:heHE.EkyklosenImas.name
ltx/gr_gr_cog/me.m11.d10:meMA.Ode6C12.mode	@ltx/gr_gr_cog/miscellanea:misc.Mode1
ltx/gr_gr_cog/me.m11.d10:meMA.Ode6C12.ode	@ltx/gr_gr_cog/miscellanea:misc.Ode6
ltx/gr_gr_cog/me.m11.d10:meMA.Ode6C12.text	Μονάδα ἐν τρισὶ προσώποις ἄτμητον, ἀσύγχυτον κηρύττοντες, τὴν πολύθεον ἐξήρατε ἐκ γῆς, πλάνην ἀπλανεῖς Χριστοῦ Ἀπόστολοι, καὶ τοὺς δεινῶς, πεπλανημένους καθωδηγήσατε.
ltx/gr_gr_cog/me.m11.d10:meMA.Ode6C13.incipit	Νοήμασι τερπνοῖς ἀνοηταίνοντας, τοὺς ἄφρονας…
ltx/gr_gr_cog/me.m11.d10:meMA.Ode6C13.melody	@ltx/gr_gr_cog/he.h.m1:heHE.EkyklosenImas.name
ltx/gr_gr_cog/me.m11.d10:meMA.Ode6C13.mode	@ltx/gr_gr_cog/miscellanea:misc.Mode1
ltx/gr_gr_cog/me.m11.d10:meMA.Ode6C13.ode	@ltx/gr_gr_cog/miscellanea:misc.Ode6
ltx/gr_gr_cog/me.m11.d10:meMA.Ode6C13.text	Νοήμασι τερπνοῖς ἀνοηταίνοντας, τοὺς ἄφρονας οἱ ἔμφρονες, ἐβεβαίωσαν Θεῷ παμβασιλεῖ, μόνῳ προσανέχειν κτίσιν ἅπασαν, ταῖς θεϊκαῖς, φωτοχυσίαις καταφαιδρύνοντι.
ltx/gr_gr_cog/me.m11.d10:meMA.Ode6C1T.incipit	Ὡς ἄλλον οὐρανὸν τοῦ πρώην…
ltx/gr_gr_cog/me.m11.d10:meMA.Ode6C1T.melody	@ltx/gr_gr_cog/he.h.m1:heHE.EkyklosenImas.name
ltx/gr_gr_cog/me.m11.d10:meMA.Ode6C1T.mode	@ltx/gr_gr_cog/miscellanea:misc.Mode1
ltx/gr_gr_cog/me.m11.d10:meMA.Ode6C1T.ode	@ltx/gr_gr_cog/miscellanea:misc.Ode6
ltx/gr_gr_cog/me.m11.d10:meMA.Ode6C1T.text	Ὡς ἄλλον οὐρανὸν τοῦ πρώην Δέσποινα, δειχθεῖσαν ὑψηλότερον, σὲ δοξάζομεν τὸν Ἥλιον ἡμῖν, τῆς δικαιοσύνης ἀνατείλασαν, καὶ τὸ βαθύ, τῆς ἀγνωσίας σκότος διώξασαν.
ltx/gr_gr_cog/me.m11.d10:meMA.Ode6C21.greekmelody	@ltx/gr_gr_cog/he.h.m2:heHE.EnAvyssoPtaismaton.greekname
ltx/gr_gr_cog/me.m11.d10:meMA.Ode6C21.incipit	Ῥαντισμῷ τῶν πανσέπτων αἱμάτων σου…
ltx/gr_gr_cog/me.m11.d10:meMA.Ode6C21.melody	@ltx/gr_gr_cog/he.h.m2:heHE.EnAvyssoPtaismaton.name
ltx/gr_gr_cog/me.m11.d10:meMA.Ode6C21.mode	@ltx/gr_gr_cog/miscellanea:misc.Mode2
ltx/gr_gr_cog/me.m11.d10:meMA.Ode6C21.ode	@ltx/gr_gr_cog/miscellanea:misc.Ode6
ltx/gr_gr_cog/me.m11.d10:meMA.Ode6C21.text	Ῥαντισμῷ τῶν πανσέπτων αἱμάτων σου, λύθρον ἐναγὲς ἀπεπαύθη τοῖς δαίμοσι, φρενοβλαβῶς φερόμενον, Ἀθλοφόρε Χριστοῦ γενναιότατε.
ltx/gr_gr_cog/me.m11.d10:meMA.Ode6C22.incipit	Τῶν ψυχῶν ἰατρὸν καὶ σωμάτων…
ltx/gr_gr_cog/me.m11.d10:meMA.Ode6C22.melody	@ltx/gr_gr_cog/he.h.m2:heHE.EnAvyssoPtaismaton.name
ltx/gr_gr_cog/me.m11.d10:meMA.Ode6C22.mode	@ltx/gr_gr_cog/miscellanea:misc.Mode2
ltx/gr_gr_cog/me.m11.d10:meMA.Ode6C22.ode	@ltx/gr_gr_cog/miscellanea:misc.Ode6
ltx/gr_gr_cog/me.m11.d10:meMA.Ode6C22.text	Τῶν ψυχῶν ἰατρὸν καὶ σωμάτων σε, Μάρτυς εὐμοιρήσαντες παθῶν λυτρούμεθα, καὶ πειρασμῶν καὶ θλίψεων, εὐπροσδέκτοις καὶ θείαις πρεσβείαις σου.
ltx/gr_gr_cog/me.m11.d10:meMA.Ode6C23.incipit	Ὑφαντὸν ἐκ τῆς ἄνωθεν χάριτος…
ltx/gr_gr_cog/me.m11.d10:meMA.Ode6C23.melody	@ltx/gr_gr_cog/he.h.m2:heHE.EnAvyssoPtaismaton.name
ltx/gr_gr_cog/me.m11.d10:meMA.Ode6C23.mode	@ltx/gr_gr_cog/miscellanea:misc.Mode2
ltx/gr_gr_cog/me.m11.d10:meMA.Ode6C23.ode	@ltx/gr_gr_cog/miscellanea:misc.Ode6
ltx/gr_gr_cog/me.m11.d10:meMA.Ode6C23.text	Ὑφαντὸν ἐκ τῆς ἄνωθεν χάριτος, ἐν τῇ ἀπεκδύσει τοῦ σώματος ἔνδυμα, ἀπολαβὼν ἐγύμνωσας, δυσμενῶν παρατάξεις Πανόλβιε.
ltx/gr_gr_cog/me.m11.d10:meMA.Ode6C2T.incipit	Συμπαθείας με θείας ἀξίωσον, τὸν…
ltx/gr_gr_cog/me.m11.d10:meMA.Ode6C2T.melody	@ltx/gr_gr_cog/he.h.m2:heHE.EnAvyssoPtaismaton.name
ltx/gr_gr_cog/me.m11.d10:meMA.Ode6C2T.mode	@ltx/gr_gr_cog/miscellanea:misc.Mode2
ltx/gr_gr_cog/me.m11.d10:meMA.Ode6C2T.ode	@ltx/gr_gr_cog/miscellanea:misc.Ode6
ltx/gr_gr_cog/me.m11.d10:meMA.Ode6C2T.text	Συμπαθείας με θείας ἀξίωσον, τὸν ἀσυμπαθῆ καὶ κακίᾳ κρατούμενον, καὶ ἡδοναῖς προσκείμενον, Παναγία Παρθένε Θεόνυμφε.
ltx/gr_gr_cog/me.m11.d10:meMA.Ode6H.greekmelody	@ltx/gr_gr_cog/he.h.m2:heHE.EnAvyssoPtaismaton.greekname
ltx/gr_gr_cog/me.m11.d10:meMA.Ode6H.incipit	@ltx/gr_gr_cog/he.h.m2:heHE.EnAvyssoPtaismaton.incipit
ltx/gr_gr_cog/me.m11.d10:meMA.Ode6H.melody	@ltx/gr_gr_cog/he.h.m2:heHE.EnAvyssoPtaismaton.melody
ltx/gr_gr_cog/me.m11.d10:meMA.Ode6H.mode	@ltx/gr_gr_cog/miscellanea:misc.Mode2
ltx/gr_gr_cog/me.m11.d10:meMA.Ode6H.ode	@ltx/gr_gr_cog/miscellanea:misc.Ode6
ltx/gr_gr_cog/me.m11.d10:meMA.Ode6H.text	@ltx/gr_gr_cog/he.h.m2:heHE.EnAvyssoPtaismaton.text
ltx/gr_gr_cog/me.m11.d10:meMA.Ode7C11.greekmelody	@ltx/gr_gr_cog/he.h.m1:heHE.SeNoitin.greekname
ltx/gr_gr_cog/me.m11.d10:meMA.Ode7C11.incipit	Σὲ ἱερόν, οἰκονόμον Ἔραστε, τῆς…
ltx/gr_gr_cog/me.m11.d10:meMA.Ode7C11.melody	@ltx/gr_gr_cog/he.h.m1:heHE.SeNoitin.name
ltx/gr_gr_cog/me.m11.d10:meMA.Ode7C11.mode	@ltx/gr_gr_cog/miscellanea:misc.Mode1
ltx/gr_gr_cog/me.m11.d10:meMA.Ode7C11.ode	@ltx/gr_gr_cog/miscellanea:misc.Ode7
ltx/gr_gr_cog/me.m11.d10:meMA.Ode7C11.text	Σὲ ἱερόν, οἰκονόμον Ἔραστε, τῆς Ἐκκλησίας τοῦ Χριστοῦ, τῆς ἐν τῇ Ἱερουσαλήμ, γράφων ἀνεκήρυττε, Παῦλος ὁ Ἀπόστολος, μεθʼ οὗ τιμῶντές σε ψάλλομεν· Ὁ αἰνετός τῶν Πατέρων, Θεὸς καὶ ὑπερένδοξος.
ltx/gr_gr_cog/me.m11.d10:meMA.Ode7C12.incipit	Ὑπομονῇ, πειρασμῶν καὶ θλίψεων, καὶ…
ltx/gr_gr_cog/me.m11.d10:meMA.Ode7C12.melody	@ltx/gr_gr_cog/he.h.m1:heHE.SeNoitin.name
ltx/gr_gr_cog/me.m11.d10:meMA.Ode7C12.mode	@ltx/gr_gr_cog/miscellanea:misc.Mode1
ltx/gr_gr_cog/me.m11.d10:meMA.Ode7C12.ode	@ltx/gr_gr_cog/miscellanea:misc.Ode7
ltx/gr_gr_cog/me.m11.d10:meMA.Ode7C12.text	Ὑπομονῇ, πειρασμῶν καὶ θλίψεων, καὶ διωγμῶν δοκιμασθείς, καὶ τοῖς στίγμασι τοῦ Χριστοῦ, ἐγκαλλωπιζόμενος, Ἔραστε πανόλβιε, μεγαλοφώνως ἐκραύγαζες· Ὁ αἰνετός τῶν Πατέρων, Θεὸς καὶ ὑπερένδοξος.
ltx/gr_gr_cog/me.m11.d10:meMA.Ode7C13.incipit	Νόμου καινοῦ, ἀνεδείχθης Κούαρτε, καταγγελεὺς…
ltx/gr_gr_cog/me.m11.d10:meMA.Ode7C13.melody	@ltx/gr_gr_cog/he.h.m1:heHE.SeNoitin.name
ltx/gr_gr_cog/me.m11.d10:meMA.Ode7C13.mode	@ltx/gr_gr_cog/miscellanea:misc.Mode1
ltx/gr_gr_cog/me.m11.d10:meMA.Ode7C13.ode	@ltx/gr_gr_cog/miscellanea:misc.Ode7
ltx/gr_gr_cog/me.m11.d10:meMA.Ode7C13.text	Νόμου καινοῦ, ἀνεδείχθης Κούαρτε, καταγγελεὺς τῆς παλαιᾶς, ἀνομίας προσαφιστῶν, τοὺς ἀλλοτριόφρονας, καὶ πρὸς ἀνακαίνισιν, ζωῆς μετάγων κραυγάζοντας· Ὁ αἰνετὸς τῶν Πατέρων, Θεὸς καὶ ὑπερένδοξος.
ltx/gr_gr_cog/me.m11.d10:meMA.Ode7C1T.incipit	Τὸν τοῦ Πατρὸς Λόγον συναΐδιον…
ltx/gr_gr_cog/me.m11.d10:meMA.Ode7C1T.melody	@ltx/gr_gr_cog/he.h.m1:heHE.SeNoitin.name
ltx/gr_gr_cog/me.m11.d10:meMA.Ode7C1T.mode	@ltx/gr_gr_cog/miscellanea:misc.Mode1
ltx/gr_gr_cog/me.m11.d10:meMA.Ode7C1T.ode	@ltx/gr_gr_cog/miscellanea:misc.Ode7
ltx/gr_gr_cog/me.m11.d10:meMA.Ode7C1T.text	Τὸν τοῦ Πατρὸς Λόγον συναΐδιον, ἐμφανισθέντα τοῖς βροτοῖς, ἐσωμάτωσας καὶ σαρκί, Κόρη ἀπεκύησας, ἄνθρωπον γενόμενον, διὰ τὸ σῶσαι τὸν ἄνθρωπον, τὸν αἰνετόν τῶν Πατέρων, Θεὸν καὶ ὑπερένδοξον.
ltx/gr_gr_cog/me.m11.d10:meMA.Ode7C21.greekmelody	@ltx/gr_gr_cog/he.h.m2:heHE.EikonosChrysis.greekname
ltx/gr_gr_cog/me.m11.d10:meMA.Ode7C21.incipit	Αἱμάτων κρουνοῖς, ἀθεΐας τὴν πυρὰν…
ltx/gr_gr_cog/me.m11.d10:meMA.Ode7C21.melody	@ltx/gr_gr_cog/he.h.m2:heHE.EikonosChrysis.name
ltx/gr_gr_cog/me.m11.d10:meMA.Ode7C21.mode	@ltx/gr_gr_cog/miscellanea:misc.Mode2
ltx/gr_gr_cog/me.m11.d10:meMA.Ode7C21.ode	@ltx/gr_gr_cog/miscellanea:misc.Ode7
ltx/gr_gr_cog/me.m11.d10:meMA.Ode7C21.text	Αἱμάτων κρουνοῖς, ἀθεΐας τὴν πυρὰν ἐναποσβέσας, ὄμβροις θαυμάτων Ἀξιάγαστε, τοὺς ἐκτακέντας τοῖς πάθεσι, πάντοτε δροσίζεις βοῶντας, καὶ πιστῶς ἀναμέλποντας· Εὐλογητὸς εἶ ὁ Θεός, ὁ τῶν Πατέρων ἡμῶν.
ltx/gr_gr_cog/me.m11.d10:meMA.Ode7C22.incipit	Θαυμάτων βυθός, ἰαμάτων ποταμὸς κρήνη…
ltx/gr_gr_cog/me.m11.d10:meMA.Ode7C22.melody	@ltx/gr_gr_cog/he.h.m2:heHE.EikonosChrysis.name
ltx/gr_gr_cog/me.m11.d10:meMA.Ode7C22.mode	@ltx/gr_gr_cog/miscellanea:misc.Mode2
ltx/gr_gr_cog/me.m11.d10:meMA.Ode7C22.ode	@ltx/gr_gr_cog/miscellanea:misc.Ode7
ltx/gr_gr_cog/me.m11.d10:meMA.Ode7C22.text	Θαυμάτων βυθός, ἰαμάτων ποταμὸς κρήνη προχέουσα, πᾶσαν ὑγείαν πᾶσαν ἄφεσιν, τῶν λυπηρῶν ἀναδέδεικται, Μάρτυς ἀθλοφόρε Ὀρέστα, ἡ σωρὸς τῶν λειψάνων σου· ἣν προσκυνοῦντες εὐσεβῶς, σὲ μακαρίζομεν.
ltx/gr_gr_cog/me.m11.d10:meMA.Ode7C23.incipit	Λυθεὶς τῶν παθῶν, τῶν τοῦ…
ltx/gr_gr_cog/me.m11.d10:meMA.Ode7C23.melody	@ltx/gr_gr_cog/he.h.m2:heHE.EikonosChrysis.name
ltx/gr_gr_cog/me.m11.d10:meMA.Ode7C23.mode	@ltx/gr_gr_cog/miscellanea:misc.Mode2
ltx/gr_gr_cog/me.m11.d10:meMA.Ode7C23.ode	@ltx/gr_gr_cog/miscellanea:misc.Ode7
ltx/gr_gr_cog/me.m11.d10:meMA.Ode7C23.text	Λυθεὶς τῶν παθῶν, τῶν τοῦ σώματος σοφὲ διὰ βασάνων, ζῴῳ δεσμεῖσαι ἀπαγόμενος, καὶ ὠμοτάτως συρόμενος· ὅθεν τῆς σαρκὸς ἀπελύθης, καὶ Θεῷ καθαρώτερον, καὶ τελεώτερον σαυτόν, Μάρτυς συνέδησας.
ltx/gr_gr_cog/me.m11.d10:meMA.Ode7C2T.incipit	Ὁ φύσει Θεός, φύσιν εἴληφεν…
ltx/gr_gr_cog/me.m11.d10:meMA.Ode7C2T.melody	@ltx/gr_gr_cog/he.h.m2:heHE.EikonosChrysis.name
ltx/gr_gr_cog/me.m11.d10:meMA.Ode7C2T.mode	@ltx/gr_gr_cog/miscellanea:misc.Mode2
ltx/gr_gr_cog/me.m11.d10:meMA.Ode7C2T.ode	@ltx/gr_gr_cog/miscellanea:misc.Ode7
ltx/gr_gr_cog/me.m11.d10:meMA.Ode7C2T.text	Ὁ φύσει Θεός, φύσιν εἴληφεν ἐκ σοῦ Ἁγνὴ βροτείαν, καὶ σάρξ ὡράθη ὑπὲρ ἔννοιαν, διὰ πολλὴν ἀγαθότητα, σῶσαι βουληθεὶς τοὺς ἀνθρώπους· ὃν ὑμνοῦντες κραυγάζομεν· Εὐλογητὸς εἶ ὁ Θεός, ὁ τῶν Πατέρων ἡμῶν.
ltx/gr_gr_cog/me.m11.d10:meMA.Ode8C11.greekmelody	@ltx/gr_gr_cog/he.h.m1:heHE.EnKaminoPaides.greekname
ltx/gr_gr_cog/me.m11.d10:meMA.Ode8C11.incipit	Οἱ ἀῤῥαγεῖς πύργοι τῆς Χριστοῦ…
ltx/gr_gr_cog/me.m11.d10:meMA.Ode8C11.melody	@ltx/gr_gr_cog/he.h.m1:heHE.EnKaminoPaides.name
ltx/gr_gr_cog/me.m11.d10:meMA.Ode8C11.mode	@ltx/gr_gr_cog/miscellanea:misc.Mode1
ltx/gr_gr_cog/me.m11.d10:meMA.Ode8C11.ode	@ltx/gr_gr_cog/miscellanea:misc.Ode8
ltx/gr_gr_cog/me.m11.d10:meMA.Ode8C11.text	Οἱ ἀῤῥαγεῖς πύργοι τῆς Χριστοῦ, δειχθέντες Ἐκκλησίας, κατέστρεψαν δυσσεβείας τείχη, ἅπαντας πιστούς, ὡς λίθους δομήσαντες, ἐπὶ πέτραν τοῦ θεμελίου Χριστοῦ τῆς Ἐκκλησίας· ὃν ὑπερυψοῦτε, εἰς πάντας τοὺς αἰῶνας.
ltx/gr_gr_cog/me.m11.d10:meMA.Ode8C12.incipit	Νομοθέται ὤφθητε ὑμεῖς, τοῦ Πνεύματος…
ltx/gr_gr_cog/me.m11.d10:meMA.Ode8C12.melody	@ltx/gr_gr_cog/he.h.m1:heHE.EnKaminoPaides.name
ltx/gr_gr_cog/me.m11.d10:meMA.Ode8C12.mode	@ltx/gr_gr_cog/miscellanea:misc.Mode1
ltx/gr_gr_cog/me.m11.d10:meMA.Ode8C12.ode	@ltx/gr_gr_cog/miscellanea:misc.Ode8
ltx/gr_gr_cog/me.m11.d10:meMA.Ode8C12.text	Νομοθέται ὤφθητε ὑμεῖς, τοῦ Πνεύματος τὸν νόμον, ἐγγράφοντες ἐν καρδίαις, Παμμακάριστοι πιστῶν· διʼ οὗ φωτιζόμενοι ἀνεβόων· Πάντα τὰ ἔργα Κυρίου τὸν Κύριον ὑμνεῖτε, καὶ ὑπερυψοῦτε, εἰς πάντας τοὺς αἰῶνας.
ltx/gr_gr_cog/me.m11.d10:meMA.Ode8C13.incipit	Ὡραιώθης Μάκαρ Ὀλυμπᾶ, καθʼ ἣν…
ltx/gr_gr_cog/me.m11.d10:meMA.Ode8C13.melody	@ltx/gr_gr_cog/he.h.m1:heHE.EnKaminoPaides.name
ltx/gr_gr_cog/me.m11.d10:meMA.Ode8C13.mode	@ltx/gr_gr_cog/miscellanea:misc.Mode1
ltx/gr_gr_cog/me.m11.d10:meMA.Ode8C13.ode	@ltx/gr_gr_cog/miscellanea:misc.Ode8
ltx/gr_gr_cog/me.m11.d10:meMA.Ode8C13.text	Ὡραιώθης Μάκαρ Ὀλυμπᾶ, καθʼ ἣν ἡμέραν Πέτρος, ὁ μέγας τέλος ἐδέξατο, σαφῶς τελειωθείς, ἅμα τῷ Ῥοδίωνι διὰ ξίφους, Νέρωνος προστάξει ἀνόμου βασιλέως, καὶ ταῖς οὐρανίαις, συνήφθητε χορείαις.
ltx/gr_gr_cog/me.m11.d10:meMA.Ode8C1T.incipit	Στάμνος πάλαι φέρουσαν Ἁγνή, ἐτύπου…
ltx/gr_gr_cog/me.m11.d10:meMA.Ode8C1T.melody	@ltx/gr_gr_cog/he.h.m1:heHE.EnKaminoPaides.name
ltx/gr_gr_cog/me.m11.d10:meMA.Ode8C1T.mode	@ltx/gr_gr_cog/miscellanea:misc.Mode1
ltx/gr_gr_cog/me.m11.d10:meMA.Ode8C1T.ode	@ltx/gr_gr_cog/miscellanea:misc.Ode8
ltx/gr_gr_cog/me.m11.d10:meMA.Ode8C1T.text	Στάμνος πάλαι φέρουσαν Ἁγνή, ἐτύπου σε τὸ μάννα· Χριστὸν γὰρ τὸν γλυκασμόν, ἡμῶν ἐβάστασας γαστρί, καὶ σαρκὶ ἐκύησας, ἐξαιροῦντας πάσης πικρίας, ἀτόπων ἐγκλημάτων, τοὺς ὑπερυψοῦντας, αὐτὸν εἰς τοὺς αἰῶνας.
ltx/gr_gr_cog/me.m11.d10:meMA.Ode8C21.greekmelody	@ltx/gr_gr_cog/he.h.m2:heHE.TonEnKaminoTouPyros.greekname
ltx/gr_gr_cog/me.m11.d10:meMA.Ode8C21.incipit	Ὑπὲρ τὴν πρόσκαιρον ζωήν, τὴν…
ltx/gr_gr_cog/me.m11.d10:meMA.Ode8C21.melody	@ltx/gr_gr_cog/he.h.m2:heHE.TonEnKaminoTouPyros.name
ltx/gr_gr_cog/me.m11.d10:meMA.Ode8C21.mode	@ltx/gr_gr_cog/miscellanea:misc.Mode2
ltx/gr_gr_cog/me.m11.d10:meMA.Ode8C21.ode	@ltx/gr_gr_cog/miscellanea:misc.Ode8
ltx/gr_gr_cog/me.m11.d10:meMA.Ode8C21.text	Ὑπὲρ τὴν πρόσκαιρον ζωήν, τὴν αἰώνιον σοφὲ ἐπιποθήσας, τῆς θνῃσκούσης Ὀρέστα, καὶ φθειρομένης σαρκός, οὐδόλως ἐφείσω πανόλβιε· ὅθεν τὰς βασάνους, ὑπέμεινας γενναίως.
ltx/gr_gr_cog/me.m11.d10:meMA.Ode8C22.incipit	Σὲ τὸ ἀρνίον τοῦ Χριστοῦ…
ltx/gr_gr_cog/me.m11.d10:meMA.Ode8C22.melody	@ltx/gr_gr_cog/he.h.m2:heHE.TonEnKaminoTouPyros.name
ltx/gr_gr_cog/me.m11.d10:meMA.Ode8C22.mode	@ltx/gr_gr_cog/miscellanea:misc.Mode2
ltx/gr_gr_cog/me.m11.d10:meMA.Ode8C22.ode	@ltx/gr_gr_cog/miscellanea:misc.Ode8
ltx/gr_gr_cog/me.m11.d10:meMA.Ode8C22.text	Σὲ τὸ ἀρνίον τοῦ Χριστοῦ, ὥσπερ λύκος πονηρὸς κατασπαράττων, αἰκισμοῖς ὁ διώκτης, θῦμα δεκτὸν ἱερόν, καὶ θεῖον εἰργάσαντο σφάγιον, ἄξιον τῆς ἄνω, Δεσποτικῆς τραπέζης.
ltx/gr_gr_cog/me.m11.d10:meMA.Ode8C23.incipit	Ἅρμα τοῦ Λόγου γεγονώς, ἐποχούμενον…
ltx/gr_gr_cog/me.m11.d10:meMA.Ode8C23.melody	@ltx/gr_gr_cog/he.h.m2:heHE.TonEnKaminoTouPyros.name
ltx/gr_gr_cog/me.m11.d10:meMA.Ode8C23.mode	@ltx/gr_gr_cog/miscellanea:misc.Mode2
ltx/gr_gr_cog/me.m11.d10:meMA.Ode8C23.ode	@ltx/gr_gr_cog/miscellanea:misc.Ode8
ltx/gr_gr_cog/me.m11.d10:meMA.Ode8C23.text	Ἅρμα τοῦ Λόγου γεγονώς, ἐποχούμενον αὐτὸν ἔσχες Παμμάκαρ· ὅθεν δεθεὶς ἀλόγοις ἀπαγωγῇ πονηρᾷ, συρμῷ τε βιαίῳ ἐξέπνευσας, καὶ πρὸς τὴν ἀγήρω, νύσσαν ἔφθασας χαίρων.
ltx/gr_gr_cog/me.m11.d10:meMA.Ode8C2T.incipit	Ἱερωτάταις σε φωναῖς, προκατήγγειλαν Θεοῦ…
ltx/gr_gr_cog/me.m11.d10:meMA.Ode8C2T.melody	@ltx/gr_gr_cog/he.h.m2:heHE.TonEnKaminoTouPyros.name
ltx/gr_gr_cog/me.m11.d10:meMA.Ode8C2T.mode	@ltx/gr_gr_cog/miscellanea:misc.Mode2
ltx/gr_gr_cog/me.m11.d10:meMA.Ode8C2T.ode	@ltx/gr_gr_cog/miscellanea:misc.Ode8
ltx/gr_gr_cog/me.m11.d10:meMA.Ode8C2T.text	Ἱερωτάταις σε φωναῖς, προκατήγγειλαν Θεοῦ σεπτοὶ Προφῆται, ἐσομένην Μητέρα, ξενοπρεπεῖ τοκετῷ, τοῦ πάντων κτισμάτων δεσπόζοντος· ὅθεν σε ὑμνοῦμεν, εἰς πάντας τοὺς αἰῶνας.
ltx/gr_gr_cog/me.m11.d10:meMA.Ode8H.greekmelody	@ltx/gr_gr_cog/he.h.m2:heHE.TonEnKaminoTouPyros.greekname
ltx/gr_gr_cog/me.m11.d10:meMA.Ode8H.incipit	@ltx/gr_gr_cog/he.h.m2:heHE.TonEnKaminoTouPyros.incipit
ltx/gr_gr_cog/me.m11.d10:meMA.Ode8H.melody	@ltx/gr_gr_cog/he.h.m2:heHE.TonEnKaminoTouPyros.melody
ltx/gr_gr_cog/me.m11.d10:meMA.Ode8H.mode	@ltx/gr_gr_cog/miscellanea:misc.Mode2
ltx/gr_gr_cog/me.m11.d10:meMA.Ode8H.ode	@ltx/gr_gr_cog/miscellanea:misc.Ode8
ltx/gr_gr_cog/me.m11.d10:meMA.Ode8H.text	@ltx/gr_gr_cog/he.h.m2:heHE.TonEnKaminoTouPyros.text
ltx/gr_gr_cog/me.m11.d10:meMA.Ode9C11.greekmelody	@ltx/gr_gr_cog/he.h.m1:heHE.TyponTisAgnis.greekname
ltx/gr_gr_cog/me.m11.d10:meMA.Ode9C11.incipit	Ἴσον δρόμον διανύσαντες, ἴσον πρὸς…
ltx/gr_gr_cog/me.m11.d10:meMA.Ode9C11.melody	@ltx/gr_gr_cog/he.h.m1:heHE.TyponTisAgnis.name
ltx/gr_gr_cog/me.m11.d10:meMA.Ode9C11.mode	@ltx/gr_gr_cog/miscellanea:misc.Mode1
ltx/gr_gr_cog/me.m11.d10:meMA.Ode9C11.ode	@ltx/gr_gr_cog/miscellanea:misc.Ode9
ltx/gr_gr_cog/me.m11.d10:meMA.Ode9C11.text	Ἴσον δρόμον διανύσαντες, ἴσον πρὸς τοῦ Δεσπότου λόγον πλουτήσαντες, ἴσων δωρεῶν ἀξιωθέντες τοῦ Πνεύματος, καὶ βραβείων τῶν ἴσων ἐτύχετε, Ἀπόστολοι Κυρίου, φωταγωγοὶ τῶν καρδιῶν ἡμῶν.
ltx/gr_gr_cog/me.m11.d10:meMA.Ode9C12.incipit	Ὥσπερ οὐρανοὶ κατάστεροι, θεοσημείαις πᾶσαν…
ltx/gr_gr_cog/me.m11.d10:meMA.Ode9C12.melody	@ltx/gr_gr_cog/he.h.m1:heHE.TyponTisAgnis.name
ltx/gr_gr_cog/me.m11.d10:meMA.Ode9C12.mode	@ltx/gr_gr_cog/miscellanea:misc.Mode1
ltx/gr_gr_cog/me.m11.d10:meMA.Ode9C12.ode	@ltx/gr_gr_cog/miscellanea:misc.Ode9
ltx/gr_gr_cog/me.m11.d10:meMA.Ode9C12.text	Ὥσπερ οὐρανοὶ κατάστεροι, θεοσημείαις πᾶσαν γῆν ἐφωτίσατε, σκότος τὸ βαθὺ τῆς ἀγνωσίας διώξαντες, καὶ ἡμέρας υἱοὺς ἀναδείξαντες, τοὺς πάλαι δουλωθέντας· Ταῖς μεθοδείαις τοῦ ἀλάστορος.
ltx/gr_gr_cog/me.m11.d10:meMA.Ode9C13.incipit	Στῖφος δυσμενῶν ὠλέσατε, τῇ ἀπωλείᾳ…
ltx/gr_gr_cog/me.m11.d10:meMA.Ode9C13.melody	@ltx/gr_gr_cog/he.h.m1:heHE.TyponTisAgnis.name
ltx/gr_gr_cog/me.m11.d10:meMA.Ode9C13.mode	@ltx/gr_gr_cog/miscellanea:misc.Mode1
ltx/gr_gr_cog/me.m11.d10:meMA.Ode9C13.ode	@ltx/gr_gr_cog/miscellanea:misc.Ode9
ltx/gr_gr_cog/me.m11.d10:meMA.Ode9C13.text	Στῖφος δυσμενῶν ὠλέσατε, τῇ ἀπωλείᾳ πάλαι παραπεμψάμενοι, ἔθνη καὶ λαούς· δῆ μον Θεῷ δὲ προσήξατε, σεσωσμένον πληθὺϊ ἑνούμενον, Δυνάμεων ἀΰλων, πανευκλεεῖς σοφοὶ Ἀπόστολοι.
ltx/gr_gr_cog/me.m11.d10:meMA.Ode9C14.incipit	Ἤρθη πρὸς τὰ ὑπερκόσμια, ὁ…
ltx/gr_gr_cog/me.m11.d10:meMA.Ode9C14.melody	@ltx/gr_gr_cog/he.h.m1:heHE.TyponTisAgnis.name
ltx/gr_gr_cog/me.m11.d10:meMA.Ode9C14.mode	@ltx/gr_gr_cog/miscellanea:misc.Mode1
ltx/gr_gr_cog/me.m11.d10:meMA.Ode9C14.ode	@ltx/gr_gr_cog/miscellanea:misc.Ode9
ltx/gr_gr_cog/me.m11.d10:meMA.Ode9C14.text	Ἤρθη πρὸς τὰ ὑπερκόσμια, ὁ, Ὀλυμπᾶς ὁ μέγας καὶ ὁ Σωσίπατρος, Τέρτιος ὁμοῦ καὶ ὁ Ῥοδίων καὶ Κούαρτος, καὶ ὁ Ἔραστος ὁ ἱερώτατος· καὶ νῦν ὑπὲρ τοῦ κόσμου, τὸν Λυτρωτὴν καθικετεύουσιν.
ltx/gr_gr_cog/me.m11.d10:meMA.Ode9C1T.incipit	Φεῖσαι τοῦ λαοῦ σου Κύριε…
ltx/gr_gr_cog/me.m11.d10:meMA.Ode9C1T.melody	@ltx/gr_gr_cog/he.h.m1:heHE.TyponTisAgnis.name
ltx/gr_gr_cog/me.m11.d10:meMA.Ode9C1T.mode	@ltx/gr_gr_cog/miscellanea:misc.Mode1
ltx/gr_gr_cog/me.m11.d10:meMA.Ode9C1T.ode	@ltx/gr_gr_cog/miscellanea:misc.Ode9
ltx/gr_gr_cog/me.m11.d10:meMA.Ode9C1T.text	Φεῖσαι τοῦ λαοῦ σου Κύριε, ἐπιδρομῆς βαρβάρων ἡμᾶς λυτρούμενος, καὶ ἁμαρτιῶν καὶ πειρασμῶν καὶ κολάσεως, αἰωνίου εὐχαῖς τῆς τεκούσης σε, Παρθένου παναγίας, καὶ τῶν ἐνδόξων Ἀποστόλων σου.
ltx/gr_gr_cog/me.m11.d10:meMA.Ode9C21.greekmelody	@ltx/gr_gr_cog/he.h.m2:heHE.TonEkTheouTheonLogon.greekname
ltx/gr_gr_cog/me.m11.d10:meMA.Ode9C21.incipit	Νενικηκὼς τοὺς τυράννους, μετὰ πλείστας…
ltx/gr_gr_cog/me.m11.d10:meMA.Ode9C21.melody	@ltx/gr_gr_cog/he.h.m2:heHE.TonEkTheouTheonLogon.name
ltx/gr_gr_cog/me.m11.d10:meMA.Ode9C21.mode	@ltx/gr_gr_cog/miscellanea:misc.Mode2
ltx/gr_gr_cog/me.m11.d10:meMA.Ode9C21.ode	@ltx/gr_gr_cog/miscellanea:misc.Ode9
ltx/gr_gr_cog/me.m11.d10:meMA.Ode9C21.text	Νενικηκὼς τοὺς τυράννους, μετὰ πλείστας βασάνους, μετῆλθες πρὸς Θεὸν περιχαρῶς, νίκης βραβεῖα δεξάμενος, ὡς ὁπλίτης γενναῖος, ὡς μέγας ἀριστεύς, ὡς ἐκλεκτός τοῦ Χριστοῦ στρατιώτης, Ὀρέστα παμμακάριστε.
ltx/gr_gr_cog/me.m11.d10:meMA.Ode9C22.incipit	Ἐν οὐρανοῖς συγχορεύεις, τοῖς Ἀγγέλοις…
ltx/gr_gr_cog/me.m11.d10:meMA.Ode9C22.melody	@ltx/gr_gr_cog/he.h.m2:heHE.TonEkTheouTheonLogon.name
ltx/gr_gr_cog/me.m11.d10:meMA.Ode9C22.mode	@ltx/gr_gr_cog/miscellanea:misc.Mode2
ltx/gr_gr_cog/me.m11.d10:meMA.Ode9C22.ode	@ltx/gr_gr_cog/miscellanea:misc.Ode9
ltx/gr_gr_cog/me.m11.d10:meMA.Ode9C22.text	Ἐν οὐρανοῖς συγχορεύεις, τοῖς Ἀγγέλοις παμμάκαρ, καὶ μέλπεις σὺν αὐτοῖς χαρμονικῶς· Ἅγιος, Ἅγιος, Ἅγιος, Πατὴρ ὁ παντοκράτωρ, Υἱὸς ὁ ὁμοούσιος Πατρί, καὶ τὸ Ἅγιον Πνεῦμα, Τριὰς ἡ παντοδύναμος.
ltx/gr_gr_cog/me.m11.d10:meMA.Ode9C23.incipit	Συναγελάζων χορείαις, Ἀποστόλων Μαρτύρων, Ὁσίων…
ltx/gr_gr_cog/me.m11.d10:meMA.Ode9C23.melody	@ltx/gr_gr_cog/he.h.m2:heHE.TonEkTheouTheonLogon.name
ltx/gr_gr_cog/me.m11.d10:meMA.Ode9C23.mode	@ltx/gr_gr_cog/miscellanea:misc.Mode2
ltx/gr_gr_cog/me.m11.d10:meMA.Ode9C23.ode	@ltx/gr_gr_cog/miscellanea:misc.Ode9
ltx/gr_gr_cog/me.m11.d10:meMA.Ode9C23.text	Συναγελάζων χορείαις, Ἀποστόλων Μαρτύρων, Ὁσίων Προφητῶν ἱεραρχῶν, Μάρτυς σὺν τούτοις δεήθητι, τοῖς τιμῶσί σε πόθῳ, δοθῆναι ἱλασμὸν ἁμαρτιῶν, καὶ παντοίων κινδύνων, Ὀρέστα ἀπολύτρωσιν.
ltx/gr_gr_cog/me.m11.d10:meMA.Ode9C2T.incipit	Ὡς τοῦ Κυρίου Μητέρα, Χερουβὶμ…
ltx/gr_gr_cog/me.m11.d10:meMA.Ode9C2T.melody	@ltx/gr_gr_cog/he.h.m2:heHE.TonEkTheouTheonLogon.name
ltx/gr_gr_cog/me.m11.d10:meMA.Ode9C2T.mode	@ltx/gr_gr_cog/miscellanea:misc.Mode2
ltx/gr_gr_cog/me.m11.d10:meMA.Ode9C2T.ode	@ltx/gr_gr_cog/miscellanea:misc.Ode9
ltx/gr_gr_cog/me.m11.d10:meMA.Ode9C2T.text	Ὡς τοῦ Κυρίου Μητέρα, Χερουβὶμ ὑπερτέραν, πανάχραντε Παρθένε δυσωπῶ· Τῆς ταλαιπώρου καρδίας μου, τὰ ἐπώδυνα πάθη, θεράπευσον καὶ ῥῦσαί με πυρός, ἐν ἡμέρᾳ τῆς δίκης, τὸν καταδίκης ἄξιον.
ltx/gr_gr_cog/me.m11.d10:meMA.Ode9H.greekmelody	@ltx/gr_gr_cog/he.h.m2:heHE.TonEkTheouTheonLogon.greekname
ltx/gr_gr_cog/me.m11.d10:meMA.Ode9H.incipit	@ltx/gr_gr_cog/he.h.m2:heHE.TonEkTheouTheonLogon.incipit
ltx/gr_gr_cog/me.m11.d10:meMA.Ode9H.melody	@ltx/gr_gr_cog/he.h.m2:heHE.TonEkTheouTheonLogon.melody
ltx/gr_gr_cog/me.m11.d10:meMA.Ode9H.mode	@ltx/gr_gr_cog/miscellanea:misc.Mode2
ltx/gr_gr_cog/me.m11.d10:meMA.Ode9H.ode	@ltx/gr_gr_cog/miscellanea:misc.Ode9
ltx/gr_gr_cog/me.m11.d10:meMA.Ode9H.text	@ltx/gr_gr_cog/he.h.m2:heHE.TonEkTheouTheonLogon.text
ltx/gr_gr_cog/me.m11.d10:meVE.Apolytikion1ger.greekmelody	@ltx/gr_gr_cog/he.a.m5:heAU.TonSynanarchonLogon.greekname
ltx/gr_gr_cog/me.m11.d10:meVE.Apolytikion1ger.incipit	Τῆς σοφίας τὸν λόγον καταπλουτήσαντες…
ltx/gr_gr_cog/me.m11.d10:meVE.Apolytikion1ger.melody	@ltx/gr_gr_cog/he.a.m5:heAU.TonSynanarchonLogon.name
ltx/gr_gr_cog/me.m11.d10:meVE.Apolytikion1ger.mode	@ltx/gr_gr_cog/miscellanea:misc.Mode5
ltx/gr_gr_cog/me.m11.d10:meVE.Apolytikion1ger.poet	@ltx/gr_gr_cog/poets:po.Gerasimou
ltx/gr_gr_cog/me.m11.d10:meVE.Apolytikion1ger.text	Τῆς σοφίας τὸν λόγον καταπλουτήσαντες, τῆς εὐσεβείας φωστῆρες καὶ ὑποφῆται σοφοί, ἀνεδείχθητε ἡμῖν Χριστὸν κηρύττοντες, Κούαρτε Ἔρασμε κλεινέ, Τέρτιε καὶ Ὀλυμπᾶ, Σωσίπατρε καὶ Ῥοδίων, Ἀπόστολοι θεηγόροι, φωταγωγοὶ τῶν καρδιῶν ἡμῶν.
ltx/gr_gr_cog/me.m11.d10:meVE.Apolytikion2ger.greekmelody	@ltx/gr_gr_cog/he.a.m1:heAU.TouLithouSfragisthentos.greekname
ltx/gr_gr_cog/me.m11.d10:meVE.Apolytikion2ger.incipit	Χριστὸν ὁμολογήσας ἐπὶ τῶν ἀσεβούντων…
ltx/gr_gr_cog/me.m11.d10:meVE.Apolytikion2ger.melody	@ltx/gr_gr_cog/he.a.m1:heAU.TouLithouSfragisthentos.name
ltx/gr_gr_cog/me.m11.d10:meVE.Apolytikion2ger.mode	@ltx/gr_gr_cog/miscellanea:misc.Mode1
ltx/gr_gr_cog/me.m11.d10:meVE.Apolytikion2ger.poet	@ltx/gr_gr_cog/poets:po.Gerasimou
ltx/gr_gr_cog/me.m11.d10:meVE.Apolytikion2ger.text	Χριστὸν ὁμολογήσας ἐπὶ τῶν ἀσεβούντων, εἰδωλομανίας τὸ θράσος καθεῖλες Ἀθλοφόρε, καὶ δόξης ἐγένου κοινωνός, ἀγῶνας πολυτρόπους ἐνεγκών· διὰ τοῦτό σε Ὀρέστα ὡς νικητήν, τιμῶντές σοι ἐκβοῶμεν· δόξα τῷ παρασχόντι σοι ἰσχύν, δόξα τῷ σὲ στεφανώσαντι, δόξα τῷ ἐνεργοῦντι διὰ σοῦ, πᾶσιιν ἰάματα.
ltx/gr_gr_cog/me.m11.d10:meVE.SticStavrotheotokion.greekmelody	@ltx/gr_gr_cog/he.a.m1:heAU.PaneffimoiMartyres.greekname
ltx/gr_gr_cog/me.m11.d10:meVE.SticStavrotheotokion.incipit	@ltx/gr_gr_cog/me.m03.d05:meVE.SticStavrotheotokion.incipit
ltx/gr_gr_cog/me.m11.d10:meVE.SticStavrotheotokion.melody	@ltx/gr_gr_cog/he.a.m1:heAU.PaneffimoiMartyres.name
ltx/gr_gr_cog/me.m11.d10:meVE.SticStavrotheotokion.mode	@ltx/gr_gr_cog/miscellanea:misc.Mode1
ltx/gr_gr_cog/me.m11.d10:meVE.SticStavrotheotokion.text	@ltx/gr_gr_cog/me.m03.d05:meVE.SticStavrotheotokion.text
ltx/gr_gr_cog/me.m11.d10:meVE.SticTheotokion.greekmelody	@ltx/gr_gr_cog/he.a.m1:heAU.PaneffimoiMartyres.greekname
ltx/gr_gr_cog/me.m11.d10:meVE.SticTheotokion.incipit	@ltx/gr_gr_cog/me.m03.d05:meVE.SticTheotokion.incipit
ltx/gr_gr_cog/me.m11.d10:meVE.SticTheotokion.melody	@ltx/gr_gr_cog/he.a.m1:heAU.PaneffimoiMartyres.name
ltx/gr_gr_cog/me.m11.d10:meVE.SticTheotokion.mode	@ltx/gr_gr_cog/miscellanea:misc.Mode1
ltx/gr_gr_cog/me.m11.d10:meVE.SticTheotokion.text	@ltx/gr_gr_cog/me.m03.d05:meVE.SticTheotokion.text
ltx/gr_gr_cog/me.m11.d10:meVE.Stichera01.greekmelody	@ltx/gr_gr_cog/he.a.m1:heAU.PaneffimoiMartyres.greekname
ltx/gr_gr_cog/me.m11.d10:meVE.Stichera01.incipit	Κόσμου τὰ πληρώματα καθά, ἀετοὶ…
ltx/gr_gr_cog/me.m11.d10:meVE.Stichera01.melody	@ltx/gr_gr_cog/he.a.m1:heAU.PaneffimoiMartyres.name
ltx/gr_gr_cog/me.m11.d10:meVE.Stichera01.mode	@ltx/gr_gr_cog/miscellanea:misc.Mode1
ltx/gr_gr_cog/me.m11.d10:meVE.Stichera01.text	Κόσμου τὰ πληρώματα καθά, ἀετοὶ ὑπόπτεροι, περιφανῶς περιθέοντες, Ἱεροκήρυκες, τοὺς ἐζωγρημένους, ὑπὸ τοῦ ἀλάστορος, εἱλκύσατε πρὸς πίστιν ἀμώμητον· διὸ πρεσβεύσατε, δωρηθῆναι ταῖς ψυχαῖς ἡμῶν, τὴν εἰρήνην, καὶ τὸ μέγα ἔλεος.
ltx/gr_gr_cog/me.m11.d10:meVE.Stichera02.incipit	Τέρτιον Σωσίπατρον φωναῖς, ἱεραῖς τιμήσωμεν…
ltx/gr_gr_cog/me.m11.d10:meVE.Stichera02.melody	@ltx/gr_gr_cog/he.a.m1:heAU.PaneffimoiMartyres.name
ltx/gr_gr_cog/me.m11.d10:meVE.Stichera02.mode	@ltx/gr_gr_cog/miscellanea:misc.Mode1
ltx/gr_gr_cog/me.m11.d10:meVE.Stichera02.text	Τέρτιον Σωσίπατρον φωναῖς, ἱεραῖς τιμήσωμεν, καὶ Ὀλυμπᾶν καὶ Ῥοδίωνα, σὺν τούτοις Ἔραστον, τὸν ἱερομύστην, καὶ τὸν θεῖον Κούαρτον, δοξάζοντας Χριστὸν τὸν Θεὸν ἡμῶν, καὶ ἱκετεύοντας, δωρηθῆναι ταῖς ψυχαῖς ἡμῶν, τὴν εἰρήνην, καὶ τὸ μέγα ἔλεος.
ltx/gr_gr_cog/me.m11.d10:meVE.Stichera03.incipit	Ἔθνη προσηγάγετε Χριστῷ, τῷ Θεῷ…
ltx/gr_gr_cog/me.m11.d10:meVE.Stichera03.melody	@ltx/gr_gr_cog/he.a.m1:heAU.PaneffimoiMartyres.name
ltx/gr_gr_cog/me.m11.d10:meVE.Stichera03.mode	@ltx/gr_gr_cog/miscellanea:misc.Mode1
ltx/gr_gr_cog/me.m11.d10:meVE.Stichera03.text	Ἔθνη προσηγάγετε Χριστῷ, τῷ Θεῷ Μακάριοι, λελυτρωμένα τῷ αἵματι, τοῦ εὐδοκήσαντος, ἐπὶ γῆς τεχθῆναι, καὶ σταυρὸν καὶ θάνατον, θελήσει ὑπομείναντος πάνσοφοι· ᾧ νῦν πρεσβεύσατε, δωρηθῆναι ταῖς ψυχαῖς ἡμῶν, τὴν εἰρήνην, καὶ τὸ μέγα ἔλεος.
ltx/gr_gr_cog/me.m11.d10:meVE.Stichera04.greekmelody	@ltx/gr_gr_cog/he.a.m1:heAU.PaneffimoiMartyres.greekname
ltx/gr_gr_cog/me.m11.d10:meVE.Stichera04.incipit	Ὀρέστα πανόλβιε βαφαῖς, τοῦ ἰδίου…
ltx/gr_gr_cog/me.m11.d10:meVE.Stichera04.melody	@ltx/gr_gr_cog/he.a.m1:heAU.PaneffimoiMartyres.name
ltx/gr_gr_cog/me.m11.d10:meVE.Stichera04.mode	@ltx/gr_gr_cog/miscellanea:misc.Mode1
ltx/gr_gr_cog/me.m11.d10:meVE.Stichera04.text	Ὀρέστα πανόλβιε βαφαῖς, τοῦ ἰδίου αἵματος, σαυτῷ πορφύραν ἐπέχρωσας, ἣν στολισάμενος, καὶ τῆς νίκης στέφος, ἐπαναδησάμενος, Χριστῷ τῷ ἀθανάτῳ παρίστασαι· ὃν καθικέτευε, δωρηθῆναι ταῖς ψυχαῖς ἡμῶν, τὴν εἰρήνην, καὶ τὸ μέγα ἔλεος.
ltx/gr_gr_cog/me.m11.d10:meVE.Stichera05.incipit	Πυρὶ τῶν ἀγώνων σου σοφέ…
ltx/gr_gr_cog/me.m11.d10:meVE.Stichera05.melody	@ltx/gr_gr_cog/he.a.m1:heAU.PaneffimoiMartyres.name
ltx/gr_gr_cog/me.m11.d10:meVE.Stichera05.mode	@ltx/gr_gr_cog/miscellanea:misc.Mode1
ltx/gr_gr_cog/me.m11.d10:meVE.Stichera05.text	Πυρὶ τῶν ἀγώνων σου σοφέ, πλάνην κατενέπρησας, καὶ ταῖς σταγόσι τοῦ αἵματος, ἐχθρῶν ἐβύθισας, παρατάξεις πάσας, καὶ πιστῶν κατήρδευσας, καρδίας βλαστανούσας εὐσέβειαν· καὶ νῦν ἱκέτευε, δωρηθῆναι ταῖς ψυχαῖς ἡμῶν, τὴν εἰρήνην, καὶ τὸ μέγα ἔλεος.
ltx/gr_gr_cog/me.m11.d10:meVE.Stichera06.incipit	Ὄρθρος ἐξανέτειλας αὐγαῖς, καταστράπτων ἅπασαν…
ltx/gr_gr_cog/me.m11.d10:meVE.Stichera06.melody	@ltx/gr_gr_cog/he.a.m1:heAU.PaneffimoiMartyres.name
ltx/gr_gr_cog/me.m11.d10:meVE.Stichera06.mode	@ltx/gr_gr_cog/miscellanea:misc.Mode1
ltx/gr_gr_cog/me.m11.d10:meVE.Stichera06.text	Ὄρθρος ἐξανέτειλας αὐγαῖς, καταστράπτων ἅπασαν, τὴν οἰκουμένην τῶν ἄθλων σου, Ὀρέστα ἔνδοξε, Ἀθλητῶν τὸ κλέος, καὶ τῆς ἀθεότητος, τὸ σκότος ἐκδιώκων τῇ χάριτι· διὸ ἱκέτευε, δωρηθῆναι ταῖς ψυχαῖς ἡμῶν, τὴν εἰρήνην, καὶ τὸ μέγα ἔλεος.
