ltx/gr_gr_cog/le.ep.mc.d343:lemcLI.Epistle.book_abbr	@ltx/gr_gr_cog/bible:Thessalonians1.abbr
ltx/gr_gr_cog/le.ep.mc.d343:lemcLI.Epistle.book_string	@ltx/gr_gr_cog/bible:Thessalonians1.text
ltx/gr_gr_cog/le.ep.mc.d343:lemcLI.Epistle.chapverse	5:14 – 23
ltx/gr_gr_cog/le.ep.mc.d343:lemcLI.Epistle.incipit	Παρακαλοῦμεν ὑμᾶς, νουθετεῖτε τοὺς ἀτάκτους…
ltx/gr_gr_cog/le.ep.mc.d343:lemcLI.Epistle.text	Ἀδελφοί, παρακαλοῦμεν ὑμᾶς, νουθετεῖτε τοὺς ἀτάκτους, παραμυθεῖσθε τοὺς ὀλιγοψύχους, ἀντέχεσθε τῶν ἀσθενῶν, μακροθυμεῖτε πρὸς πάντας. ὁρᾶτε μή τις κακὸν ἀντὶ κακοῦ τινι ἀποδῷ, ἀλλὰ πάντοτε τὸ ἀγαθὸν διώκετε καὶ εἰς ἀλλήλους καὶ εἰς πάντας. Πάντοτε χαίρετε, ἀδιαλείπτως προσεύχεσθε, ἐν παντὶ εὐχαριστεῖτε· τοῦτο γὰρ θέλημα Θεοῦ ἐν Χριστῷ Ἰησοῦ εἰς ὑμᾶς. τὸ Πνεῦμα μὴ σβέννυτε, προφητείας μὴ ἐξουθενεῖτε. πάντα δὲ δοκιμάζετε, τὸ καλὸν κατέχετε· ἀπὸ παντὸς εἴδους πονηροῦ ἀπέχεσθε. Αὐτὸς δὲ ὁ Θεὸς τῆς εἰρήνης ἁγιάσαι ὑμᾶς ὁλοτελεῖς, καὶ ὁλόκληρον ὑμῶν τὸ πνεῦμα καὶ ἡ ψυχὴ καὶ τὸ σῶμα ἀμέμπτως ἐν τῇ παρουσίᾳ τοῦ Κυρίου ἡμῶν Ἰησοῦ Χριστοῦ τηρηθείη.
ltx/gr_gr_cog/le.ep.mc.d343:lemcLI.Epistle.title	Τῷ Σαββάτῳ τῆς ΛΒʹ Ἑβδομάδος
ltx/gr_gr_cog/le.ep.mc.d343:lemcLI.Epistle.title_abbr	Σαββάτῳ τῆς ΛΒʹ Ἑβδομάδος
ltx/gr_gr_cog/le.ep.mc.d343:lemcLI.Epistle.version	@ltx/gr_gr_cog/properties:version.designation
