ltx/gr_gr_cog/le.go.me.m01.d16:lemeLI.Gospel.book_abbr	@ltx/gr_gr_cog/le.go.eo.w11:leeoMA.Gospel.book_abbr
ltx/gr_gr_cog/le.go.me.m01.d16:lemeLI.Gospel.book_string	@ltx/gr_gr_cog/le.go.eo.w11:leeoMA.Gospel.book_string
ltx/gr_gr_cog/le.go.me.m01.d16:lemeLI.Gospel.chapverse	@ltx/gr_gr_cog/le.go.eo.w11:leeoMA.Gospel.chapverse
ltx/gr_gr_cog/le.go.me.m01.d16:lemeLI.Gospel.incipit	@ltx/gr_gr_cog/le.go.eo.w11:leeoMA.Gospel.incipit
ltx/gr_gr_cog/le.go.me.m01.d16:lemeLI.Gospel.text	@ltx/gr_gr_cog/le.go.eo.w11:leeoMA.Gospel.text
ltx/gr_gr_cog/le.go.me.m01.d16:lemeLI.Gospel.title	Τοῦ Ἀποστόλου
ltx/gr_gr_cog/le.go.me.m01.d16:lemeLI.Gospel.title_abbr	Τοῦ Ἀποστόλου
ltx/gr_gr_cog/le.go.me.m01.d16:lemeLI.Gospel.version	@ltx/gr_gr_cog/le.go.eo.w11:leeoMA.Gospel.version
