ltx/gr_gr_cog/actors:ac.Archbishop	ΑΡΧΙΕΠΙΣΚΟΠΟΣ
ltx/gr_gr_cog/actors:ac.Archdeacon	ΑΡΧΙΔΙΑΚΟΝΟΣ
ltx/gr_gr_cog/actors:ac.Bishop_Elect	ΕΨΗΦΙΣΜΕΝΟΣ ΕΠΙΣΚΟΠΟΣ
ltx/gr_gr_cog/actors:ac.Candidate_Sponsor	ΚΑΤΗΧΟΥΜΕΝΟΣ/ΑΝΑΔΟΧΟΣ
ltx/gr_gr_cog/actors:ac.Chanter	ΨΑΛΤΗΣ
ltx/gr_gr_cog/actors:ac.ChanterOrReader	ΨΑΛΤΗΣ/ΑΝΑΓΝΩΣΤΗΣ
ltx/gr_gr_cog/actors:ac.Chanters	ΨΑΛΤΑΙ
ltx/gr_gr_cog/actors:ac.Choir	ΧΟΡΟΣ
ltx/gr_gr_cog/actors:ac.ChoirL	ΑΡΙΣΤΕΡΟΣ ΧΟΡΟΣ
ltx/gr_gr_cog/actors:ac.ChoirOrClergy	ΧΟΡΟΣ/ΚΛΗΡΟΣ
ltx/gr_gr_cog/actors:ac.ChoirR	ΔΕΞΙΟΣ ΧΟΡΟΣ
ltx/gr_gr_cog/actors:ac.Clergy	ΚΛΗΡΟΣ
ltx/gr_gr_cog/actors:ac.ClergyAndPeople	ΚΛΗΡΟΣ ΚΑΙ ΛΑΟΣ
ltx/gr_gr_cog/actors:ac.Deacon	ΔΙΑΚΟΝΟΣ
ltx/gr_gr_cog/actors:ac.Deacon1	Αʹ ΔΙΑΚΟΝΟΣ
ltx/gr_gr_cog/actors:ac.Deacon2	Βʹ ΔΙΑΚΟΝΟΣ
ltx/gr_gr_cog/actors:ac.Hierarch	ΑΡΧΙΕΡΕΥΣ
ltx/gr_gr_cog/actors:ac.HierarchOrPriest	ΑΡΧΙΕΡΕΥΣ/ΙΕΡΕΥΣ
ltx/gr_gr_cog/actors:ac.Hierarchs	ΑΡΧΙΕΡΕΙΣ
ltx/gr_gr_cog/actors:ac.IL.Archbishop	ΑΡΧΙΕΠΙΣΚΟΠΟΣ:
ltx/gr_gr_cog/actors:ac.IL.Archdeacon	ΑΡΧΙΔΙΑΚΟΝΟΣ:
ltx/gr_gr_cog/actors:ac.IL.Bishop_Elect	ΕΨΗΦΙΣΜΕΝΟΣ ΕΠΙΣΚΟΠΟΣ:
ltx/gr_gr_cog/actors:ac.IL.Candidate_Sponsor	ΚΑΤΗΧΟΥΜΕΝΟΣ/ΑΝΑΔΟΧΟΣ:
ltx/gr_gr_cog/actors:ac.IL.Chanter	ΨΑΛΤΗΣ:
ltx/gr_gr_cog/actors:ac.IL.ChanterOrReader	ΨΑΛΤΗΣ/ΑΝΑΓΝΩΣΤΗΣ:
ltx/gr_gr_cog/actors:ac.IL.Chanters	ΨΑΛΤΑΙ:
ltx/gr_gr_cog/actors:ac.IL.Choir	ΧΟΡΟΣ:
ltx/gr_gr_cog/actors:ac.IL.ChoirL	ΑΡΙΣΤΕΡΟΣ ΧΟΡΟΣ:
ltx/gr_gr_cog/actors:ac.IL.ChoirOrClergy	ΧΟΡΟΣ/ΚΛΗΡΟΣ:
ltx/gr_gr_cog/actors:ac.IL.ChoirR	ΔΕΞΙΟΣ ΧΟΡΟΣ:
ltx/gr_gr_cog/actors:ac.IL.Clergy	ΚΛΗΡΟΣ:
ltx/gr_gr_cog/actors:ac.IL.ClergyAndPeople	ΚΛΗΡΟΣ ΚΑΙ ΛΑΟΣ:
ltx/gr_gr_cog/actors:ac.IL.Deacon	ΔΙΑΚΟΝΟΣ:
ltx/gr_gr_cog/actors:ac.IL.Deacon1	Αʹ ΔΙΑΚΟΝΟΣ:
ltx/gr_gr_cog/actors:ac.IL.Deacon2	Βʹ ΔΙΑΚΟΝΟΣ:
ltx/gr_gr_cog/actors:ac.IL.Hierarch	ΑΡΧΙΕΡΕΥΣ:
ltx/gr_gr_cog/actors:ac.IL.HierarchOrPriest	ΑΡΧΙΕΡΕΥΣ/ΙΕΡΕΥΣ:
ltx/gr_gr_cog/actors:ac.IL.Hierarchs	ΑΡΧΙΕΡΕΙΣ:
ltx/gr_gr_cog/actors:ac.IL.Metropolitan	ΜΗΤΡΟΠΟΛΙΤΗΣ:
ltx/gr_gr_cog/actors:ac.IL.Metropolitans	ΜΗΤΡΟΠΟΛΙΤΑΙ:
ltx/gr_gr_cog/actors:ac.IL.Patriarch	ΠΑΤΡΙΑΡΧΗΣ:
ltx/gr_gr_cog/actors:ac.IL.People	ΛΑΟΣ:
ltx/gr_gr_cog/actors:ac.IL.Priest	ΙΕΡΕΥΣ:
ltx/gr_gr_cog/actors:ac.IL.Priest1	Αʹ ΙΕΡΕΥΣ:
ltx/gr_gr_cog/actors:ac.IL.Priest2	Βʹ ΙΕΡΕΥΣ:
ltx/gr_gr_cog/actors:ac.IL.PriestOrDeacon	ΙΕΡΕΥΣ/ΔΙΑΚΟΝΟΣ:
ltx/gr_gr_cog/actors:ac.IL.Priests	ΙΕΡΕΙΣ:
ltx/gr_gr_cog/actors:ac.IL.Reader	ΑΝΑΓΝΩΣΤΗΣ:
ltx/gr_gr_cog/actors:ac.IL.Respondent	ΑΝΤΙΦΩΝΩΝ:
ltx/gr_gr_cog/actors:ac.IL.Subdeacon	ΥΠΟΔΙΑΚΟΝΟΣ:
ltx/gr_gr_cog/actors:ac.IL.Superior	ΠΡΟΕΣΤΩΣ:
ltx/gr_gr_cog/actors:ac.IL.SuperiorOrReader	ΠΡΟΕΣΤΩΣ ἢ ΑΝΑΓΝΩΣΤΗΣ:
ltx/gr_gr_cog/actors:ac.IL.clChoirL	ΧΟΡΟΣ:
ltx/gr_gr_cog/actors:ac.IL.clChoirR	ΧΟΡΟΣ:
ltx/gr_gr_cog/actors:ac.Metropolitan	ΜΗΤΡΟΠΟΛΙΤΗΣ
ltx/gr_gr_cog/actors:ac.Metropolitans	ΜΗΤΡΟΠΟΛΙΤΑΙ
ltx/gr_gr_cog/actors:ac.Patriarch	ΠΑΤΡΙΑΡΧΗΣ
ltx/gr_gr_cog/actors:ac.People	ΛΑΟΣ
ltx/gr_gr_cog/actors:ac.Priest	ΙΕΡΕΥΣ
ltx/gr_gr_cog/actors:ac.Priest1	Αʹ ΙΕΡΕΥΣ
ltx/gr_gr_cog/actors:ac.Priest2	Βʹ ΙΕΡΕΥΣ
ltx/gr_gr_cog/actors:ac.PriestOrDeacon	ΙΕΡΕΥΣ/ΔΙΑΚΟΝΟΣ
ltx/gr_gr_cog/actors:ac.Priests	ΙΕΡΕΙΣ
ltx/gr_gr_cog/actors:ac.Reader	ΑΝΑΓΝΩΣΤΗΣ
ltx/gr_gr_cog/actors:ac.Respondent	ΑΝΤΙΦΩΝΩΝ
ltx/gr_gr_cog/actors:ac.Subdeacon	ΥΠΟΔΙΑΚΟΝΟΣ
ltx/gr_gr_cog/actors:ac.Superior	ΠΡΟΕΣΤΩΣ
ltx/gr_gr_cog/actors:ac.SuperiorOrReader	ΠΡΟΕΣΤΩΣ ἢ ΑΝΑΓΝΩΣΤΗΣ
ltx/gr_gr_cog/actors:ac.clChoirL	ΧΟΡΟΣ
ltx/gr_gr_cog/actors:ac.clChoirR	ΧΟΡΟΣ
