ltx/gr_gr_cog/me.m10.d05:meDA.commemoration.first	Μνήμη της Ἁγίας Μάρτυρος Χαριτίνης
ltx/gr_gr_cog/me.m10.d05:meDA.commemoration.first_name	
ltx/gr_gr_cog/me.m10.d05:meDA.commemoration.first_short	Μνήμη της Ἁγίας Μάρτυρος Χαριτίνης
ltx/gr_gr_cog/me.m10.d05:meDA.commemoration.first_title	@ltx/gr_gr_cog/titles:ti.SaintW
ltx/gr_gr_cog/me.m10.d05:meDA.commemoration.full	Μνήμη της Ἁγίας Μάρτυρος Χαριτίνης
ltx/gr_gr_cog/me.m10.d05:meDA.commemoration.second_name	
ltx/gr_gr_cog/me.m10.d05:meDA.commemoration.second_title	
ltx/gr_gr_cog/me.m10.d05:meDA.date	Τῌ Εʹ ΟΚΤΩΒΡΙΟΥ
ltx/gr_gr_cog/me.m10.d05:meDA.fordate	διὰ τὴν 5ην Ὀκτωβρίου
ltx/gr_gr_cog/me.m10.d05:meDA.insert1	καὶ της Ἁγίας Μάρτυρος Χαριτίνης,
ltx/gr_gr_cog/me.m10.d05:meDA.insert2	ἧς καὶ τὴν μνήμην ἐπιτελοῦμεν·
ltx/gr_gr_cog/me.m10.d05:meDA.note	
ltx/gr_gr_cog/me.m10.d05:meDA.pdfcoverdate	τῆς 5ης Ὀκτωβρίου,
ltx/gr_gr_cog/me.m10.d05:meDA.pdfheaderdate	τῆς 5ης Ὀκτωβρίου
ltx/gr_gr_cog/me.m10.d05:meHO.commemorations	
ltx/gr_gr_cog/me.m10.d05:meHO.note1	
ltx/gr_gr_cog/me.m10.d05:meHO.note2	
ltx/gr_gr_cog/me.m10.d05:meHO.number	
ltx/gr_gr_cog/me.m10.d05:meHO.rank	
ltx/gr_gr_cog/me.m10.d05:meLE.commemoration1	Μνήμη της Ἁγίας Μάρτυρος Χαριτίνης.
ltx/gr_gr_cog/me.m10.d05:meLE.commemoration2	
ltx/gr_gr_cog/me.m10.d05:meLI.Kontakion1.incipit	…
ltx/gr_gr_cog/me.m10.d05:meLI.Kontakion1.melody	
ltx/gr_gr_cog/me.m10.d05:meLI.Kontakion1.mode	
ltx/gr_gr_cog/me.m10.d05:meLI.Kontakion1.text	
ltx/gr_gr_cog/me.m10.d05:meLI.Megalynarion.text	
ltx/gr_gr_cog/me.m10.d05:meMA.C1.acrostic.notice1	οὗ ἡ Ἀκροστιχίς·
ltx/gr_gr_cog/me.m10.d05:meMA.C1.acrostic.text	Τῆς Χαριτίνης τὴν χάριν μέλπω πόθῳ. Ἰωσήφ.
ltx/gr_gr_cog/me.m10.d05:meMA.C1.acrostic.title	Κανὼν τῆς Ἁγίας,
ltx/gr_gr_cog/me.m10.d05:meMA.C1.title	@ltx/gr_gr_cog/titles:ti.CanonSaintW
ltx/gr_gr_cog/me.m10.d05:meMA.C1.verse	@ltx/gr_gr_cog/prayers:pr.verse_SaintW.text
ltx/gr_gr_cog/me.m10.d05:meMA.ExapTheotokion.incipit	Τὸν σὸν Υἱὸν Παρθένε, μὴ…
ltx/gr_gr_cog/me.m10.d05:meMA.ExapTheotokion.melody	@ltx/gr_gr_cog/he.a.m3:heAU.OOuranonToisAstrois.name
ltx/gr_gr_cog/me.m10.d05:meMA.ExapTheotokion.mode	@ltx/gr_gr_cog/miscellanea:misc.Mode3
ltx/gr_gr_cog/me.m10.d05:meMA.ExapTheotokion.text	Τὸν σὸν Υἱὸν Παρθένε, μὴ διαλίπῃς δυσωπεῖν, ὑπὲρ ἡμῶν τῶν σῶν δούλων, ἵνα ῥυσθῶμεν τῆς ἐκεῖ, φρικτῆς κολάσεως πάντες, καὶ τοῦ πυρὸς τοῦ ἀσβέστου.
ltx/gr_gr_cog/me.m10.d05:meMA.Exaposteilarion1.greekmelody	@ltx/gr_gr_cog/he.a.m3:heAU.OOuranonToisAstrois.greekname
ltx/gr_gr_cog/me.m10.d05:meMA.Exaposteilarion1.incipit	Ἐν οὐρανοῖς ὡς Μάρτυς, Χαριτίνη…
ltx/gr_gr_cog/me.m10.d05:meMA.Exaposteilarion1.melody	@ltx/gr_gr_cog/he.a.m3:heAU.OOuranonToisAstrois.name
ltx/gr_gr_cog/me.m10.d05:meMA.Exaposteilarion1.mode	@ltx/gr_gr_cog/miscellanea:misc.Mode3
ltx/gr_gr_cog/me.m10.d05:meMA.Exaposteilarion1.text	Ἐν οὐρανοῖς ὡς Μάρτυς, Χαριτίνη τῷ Θεῷ, παρισταμένη ἐνδόξως, πάντας ἡμᾶς τοὺς εὐσεβεῖς, μνήμην τὴν σὴν ἐκτελοῦντας, σῷζε θερμαῖς σου πρεσβείαις.
ltx/gr_gr_cog/me.m10.d05:meMA.Ode1C11.greekmelody	@ltx/gr_gr_cog/he.h.m4:heHE.ThalassisToErythraion.greekname
ltx/gr_gr_cog/me.m10.d05:meMA.Ode1C11.incipit	Ταῖς σαῖς μου, ὦ Χαριτίνη…
ltx/gr_gr_cog/me.m10.d05:meMA.Ode1C11.melody	@ltx/gr_gr_cog/he.h.m4:heHE.ThalassisToErythraion.name
ltx/gr_gr_cog/me.m10.d05:meMA.Ode1C11.mode	@ltx/gr_gr_cog/miscellanea:misc.Mode4
ltx/gr_gr_cog/me.m10.d05:meMA.Ode1C11.ode	@ltx/gr_gr_cog/miscellanea:misc.Ode1
ltx/gr_gr_cog/me.m10.d05:meMA.Ode1C11.text	Ταῖς σαῖς μου, ὦ Χαριτίνη χάρισι, τὸν νοῦν χαρίτωσον, χαριτωθεῖσα ἄθλοις ἱεροῖς, ἱερῶς ἀνυμνῆσαί σε, ὡς ἀθληφόρον Μάρτυρα, καὶ παρθενίᾳ διαλάμπουσαν.
ltx/gr_gr_cog/me.m10.d05:meMA.Ode1C12.incipit	Ἡ χάρις, τοῦ Παναγίου Πνεύματος…
ltx/gr_gr_cog/me.m10.d05:meMA.Ode1C12.melody	@ltx/gr_gr_cog/he.h.m4:heHE.ThalassisToErythraion.name
ltx/gr_gr_cog/me.m10.d05:meMA.Ode1C12.mode	@ltx/gr_gr_cog/miscellanea:misc.Mode4
ltx/gr_gr_cog/me.m10.d05:meMA.Ode1C12.ode	@ltx/gr_gr_cog/miscellanea:misc.Ode1
ltx/gr_gr_cog/me.m10.d05:meMA.Ode1C12.text	Ἡ χάρις, τοῦ Παναγίου Πνεύματος, σὲ χαριτώσασα, χαροποιαῖς ἐφαίδρυνε πλοκαῖς, καὶ χαρὰν τὴν αἰώνιον, κληρονομεῖν ἐνίσχυσεν, ἀνδρειοφρόνως ἐναθλήσασαν.
ltx/gr_gr_cog/me.m10.d05:meMA.Ode1C13.incipit	Σταυρῷ σε, ἀναρτηθέντα Δέσποτα, κατανοήσασα…
ltx/gr_gr_cog/me.m10.d05:meMA.Ode1C13.melody	@ltx/gr_gr_cog/he.h.m4:heHE.ThalassisToErythraion.name
ltx/gr_gr_cog/me.m10.d05:meMA.Ode1C13.mode	@ltx/gr_gr_cog/miscellanea:misc.Mode4
ltx/gr_gr_cog/me.m10.d05:meMA.Ode1C13.ode	@ltx/gr_gr_cog/miscellanea:misc.Ode1
ltx/gr_gr_cog/me.m10.d05:meMA.Ode1C13.text	Σταυρῷ σε, ἀναρτηθέντα Δέσποτα, κατανοήσασα, ἡ εὐκλεής σου Μάρτυς αἰκισμῶν, καρτερεῖ τὸ ἐπίπονον, δυναμουμένη σθένει σου, τοῦ τὴν ἡμῶν φύσιν νευρώσαντος.
ltx/gr_gr_cog/me.m10.d05:meMA.Ode1C1T.incipit	Χωρίον, χωρητικὸν γεγένησαι, τῆς θείας…
ltx/gr_gr_cog/me.m10.d05:meMA.Ode1C1T.melody	@ltx/gr_gr_cog/he.h.m4:heHE.ThalassisToErythraion.name
ltx/gr_gr_cog/me.m10.d05:meMA.Ode1C1T.mode	@ltx/gr_gr_cog/miscellanea:misc.Mode4
ltx/gr_gr_cog/me.m10.d05:meMA.Ode1C1T.ode	@ltx/gr_gr_cog/miscellanea:misc.Ode1
ltx/gr_gr_cog/me.m10.d05:meMA.Ode1C1T.text	Χωρίον, χωρητικὸν γεγένησαι, τῆς θείας φύσεως, θεογεννῆτορ ἄχραντε· διό, Χαριτίνη ποθήσασα, παρθενικῶς ὀπίσω σου, τῷ σῷ Υἰῷ προσαπενήνεκται.
ltx/gr_gr_cog/me.m10.d05:meMA.Ode3C11.greekmelody	@ltx/gr_gr_cog/he.h.m4:heHE.EffrainetaiEpiSoi.greekname
ltx/gr_gr_cog/me.m10.d05:meMA.Ode3C11.incipit	Ἀνάψας σου τὴν ψυχήν, ἔρως…
ltx/gr_gr_cog/me.m10.d05:meMA.Ode3C11.melody	@ltx/gr_gr_cog/he.h.m4:heHE.EffrainetaiEpiSoi.name
ltx/gr_gr_cog/me.m10.d05:meMA.Ode3C11.mode	@ltx/gr_gr_cog/miscellanea:misc.Mode4
ltx/gr_gr_cog/me.m10.d05:meMA.Ode3C11.ode	@ltx/gr_gr_cog/miscellanea:misc.Ode3
ltx/gr_gr_cog/me.m10.d05:meMA.Ode3C11.text	Ἀνάψας σου τὴν ψυχήν, ἔρως ὁ θεῖος τῆς σαρκὸς ἔρωτας, καὶ χαλεπὰ βράσματα, τὰ τῶν αἰκισμῶν ἐναπέσβεσε.
ltx/gr_gr_cog/me.m10.d05:meMA.Ode3C12.incipit	Ῥηγνύμενον πρὸ ποδῶν, Μαρτυρικῶν τὸν…
ltx/gr_gr_cog/me.m10.d05:meMA.Ode3C12.melody	@ltx/gr_gr_cog/he.h.m4:heHE.EffrainetaiEpiSoi.name
ltx/gr_gr_cog/me.m10.d05:meMA.Ode3C12.mode	@ltx/gr_gr_cog/miscellanea:misc.Mode4
ltx/gr_gr_cog/me.m10.d05:meMA.Ode3C12.ode	@ltx/gr_gr_cog/miscellanea:misc.Ode3
ltx/gr_gr_cog/me.m10.d05:meMA.Ode3C12.text	Ῥηγνύμενον πρὸ ποδῶν, Μαρτυρικῶν τὸν δυσμενῆ βλέποντες, τῇ τοῦ Χριστοῦ χάριτι, αἴνεσιν αὐτῷ προσενέγκωμεν.
ltx/gr_gr_cog/me.m10.d05:meMA.Ode3C13.incipit	Ἰσχὺϊ παντουργικῇ, τὴν κεφαλὴν τοῦ…
ltx/gr_gr_cog/me.m10.d05:meMA.Ode3C13.melody	@ltx/gr_gr_cog/he.h.m4:heHE.EffrainetaiEpiSoi.name
ltx/gr_gr_cog/me.m10.d05:meMA.Ode3C13.mode	@ltx/gr_gr_cog/miscellanea:misc.Mode4
ltx/gr_gr_cog/me.m10.d05:meMA.Ode3C13.ode	@ltx/gr_gr_cog/miscellanea:misc.Ode3
ltx/gr_gr_cog/me.m10.d05:meMA.Ode3C13.text	Ἰσχὺϊ παντουργικῇ, τὴν κεφαλὴν τοῦ δυσμενοῦς ἔθλασας, σῆς κεφαλῆς φέρουσα, Μάρτυς καρτερικῶς τὴν κατάφλεξιν.
ltx/gr_gr_cog/me.m10.d05:meMA.Ode3C1T.incipit	Τὴν μόνην ἐν γυναιξίν, εὔλογημένην…
ltx/gr_gr_cog/me.m10.d05:meMA.Ode3C1T.melody	@ltx/gr_gr_cog/he.h.m4:heHE.EffrainetaiEpiSoi.name
ltx/gr_gr_cog/me.m10.d05:meMA.Ode3C1T.mode	@ltx/gr_gr_cog/miscellanea:misc.Mode4
ltx/gr_gr_cog/me.m10.d05:meMA.Ode3C1T.ode	@ltx/gr_gr_cog/miscellanea:misc.Ode3
ltx/gr_gr_cog/me.m10.d05:meMA.Ode3C1T.text	Τὴν μόνην ἐν γυναιξίν, εὔλογημένην σε Ἁγνὴ στέργουσα, σαῖς ἀγαθαῖς χάρισι, Μάρτυς Χαριτίνη δεδόξασται.
ltx/gr_gr_cog/me.m10.d05:meMA.Ode3H.greekmelody	@ltx/gr_gr_cog/he.h.m4:heHE.EffrainetaiEpiSoi.greekname
ltx/gr_gr_cog/me.m10.d05:meMA.Ode3H.incipit	@ltx/gr_gr_cog/he.h.m4:heHE.EffrainetaiEpiSoi.incipit
ltx/gr_gr_cog/me.m10.d05:meMA.Ode3H.melody	@ltx/gr_gr_cog/he.h.m4:heHE.EffrainetaiEpiSoi.melody
ltx/gr_gr_cog/me.m10.d05:meMA.Ode3H.mode	@ltx/gr_gr_cog/miscellanea:misc.Mode4
ltx/gr_gr_cog/me.m10.d05:meMA.Ode3H.ode	@ltx/gr_gr_cog/miscellanea:misc.Ode3
ltx/gr_gr_cog/me.m10.d05:meMA.Ode3H.text	@ltx/gr_gr_cog/he.h.m4:heHE.EffrainetaiEpiSoi.text
ltx/gr_gr_cog/me.m10.d05:meMA.Ode3Kathisma1.greekmelody	@ltx/gr_gr_cog/he.a.m4:heAU.OYpsotheisEnToStavro.greekname
ltx/gr_gr_cog/me.m10.d05:meMA.Ode3Kathisma1.incipit	Τῶν νοουμένων τὸ τερπνὸν ἀγαπήσασα…
ltx/gr_gr_cog/me.m10.d05:meMA.Ode3Kathisma1.melody	@ltx/gr_gr_cog/he.a.m4:heAU.OYpsotheisEnToStavro.name
ltx/gr_gr_cog/me.m10.d05:meMA.Ode3Kathisma1.mode	@ltx/gr_gr_cog/miscellanea:misc.Mode4
ltx/gr_gr_cog/me.m10.d05:meMA.Ode3Kathisma1.text	Τῶν νοουμένων τὸ τερπνὸν ἀγαπήσασα, τῶν ὀρωμένων τὸ ῥευστὸν καταλείψασα, ταῖς θεϊκαῖς ὠχύρωσαι ἐλπίσι τὸν νοῦν· ὅθεν πρὸς τὸ στάδιον, τῆς ἀθλήσεως Μάρτυς, χαίρουσα εἰσέδραμες, καὶ τὸν ὄφιν καθεῖλες, καὶ ἀνεπλέξω νίκης εὐπρεπῆ, στέφανον κόρη, Μαρτύρων ἀγλάϊσμα.
ltx/gr_gr_cog/me.m10.d05:meMA.Ode3KathismaSt.incipit	Τὸν ἐξ ἀνάρχου τοῦ Πατρὸς…
ltx/gr_gr_cog/me.m10.d05:meMA.Ode3KathismaSt.melody	@ltx/gr_gr_cog/he.a.m4:heAU.OYpsotheisEnToStavro.name
ltx/gr_gr_cog/me.m10.d05:meMA.Ode3KathismaSt.mode	@ltx/gr_gr_cog/miscellanea:misc.Mode4
ltx/gr_gr_cog/me.m10.d05:meMA.Ode3KathismaSt.text	Τὸν ἐξ ἀνάρχου τοῦ Πατρὸς γεννηθέντα, ἡ ἐπʼ ἐσχάτων σε σαρκὶ τετοκυῖα, ἐπὶ Σταυροῦ κρεμάμενον ὁρῶσά σε Χριστέ· Οἴμοι ποθεινότατε, Ἰησοῦ! Ἀνεβόα, πῶς ὁ δοξαζόμενος, ὡς Θεὸς ὑπʼ Ἀγγέλων, ὑπὸ ἀνόμων νῦν βροτῶν Υἱέ, θέλων σταυροῦσαι; Ὑμνῶ σε Μακρόθυμε.
ltx/gr_gr_cog/me.m10.d05:meMA.Ode3KathismaT.incipit	@ltx/gr_gr_cog/me.m06.d28:meMA.Ode3KathismaT.incipit
ltx/gr_gr_cog/me.m10.d05:meMA.Ode3KathismaT.melody	@ltx/gr_gr_cog/he.a.m4:heAU.OYpsotheisEnToStavro.name
ltx/gr_gr_cog/me.m10.d05:meMA.Ode3KathismaT.mode	@ltx/gr_gr_cog/miscellanea:misc.Mode4
ltx/gr_gr_cog/me.m10.d05:meMA.Ode3KathismaT.text	@ltx/gr_gr_cog/me.m06.d28:meMA.Ode3KathismaT.text
ltx/gr_gr_cog/me.m10.d05:meMA.Ode4C11.greekmelody	@ltx/gr_gr_cog/he.h.m4:heHE.EparthentaSeIdousa.greekname
ltx/gr_gr_cog/me.m10.d05:meMA.Ode4C11.incipit	Ἱερεῖον ὥσπερ ἄμωμον πρὸς σφαγήν…
ltx/gr_gr_cog/me.m10.d05:meMA.Ode4C11.melody	@ltx/gr_gr_cog/he.h.m4:heHE.EparthentaSeIdousa.name
ltx/gr_gr_cog/me.m10.d05:meMA.Ode4C11.mode	@ltx/gr_gr_cog/miscellanea:misc.Mode4
ltx/gr_gr_cog/me.m10.d05:meMA.Ode4C11.ode	@ltx/gr_gr_cog/miscellanea:misc.Ode4
ltx/gr_gr_cog/me.m10.d05:meMA.Ode4C11.text	Ἱερεῖον ὥσπερ ἄμωμον πρὸς σφαγήν σε, ἐκ πατρικῶν ἀφήρπασαν, Μάρτυς ἀθληφόρε, ἀγκαλῶν οἱ τύραννοι, Πατέρα οὐράνιον, ὑπερβολικῶς ἀγαπήσασαν.
ltx/gr_gr_cog/me.m10.d05:meMA.Ode4C12.incipit	Νεάνισι ταῖς φρονίμοις ἀκολουθοῦσα, τὴν…
ltx/gr_gr_cog/me.m10.d05:meMA.Ode4C12.melody	@ltx/gr_gr_cog/he.h.m4:heHE.EparthentaSeIdousa.name
ltx/gr_gr_cog/me.m10.d05:meMA.Ode4C12.mode	@ltx/gr_gr_cog/miscellanea:misc.Mode4
ltx/gr_gr_cog/me.m10.d05:meMA.Ode4C12.ode	@ltx/gr_gr_cog/miscellanea:misc.Ode4
ltx/gr_gr_cog/me.m10.d05:meMA.Ode4C12.text	Νεάνισι ταῖς φρονίμοις ἀκολουθοῦσα, τὴν ψυχικὴν λαμπάδα σου, αἵματι πλουσίως, ἤρδευσας πανεύφημε, καὶ θεῖον κεκλήρωσαι, Μάρτυς χαριτώνυμε θάλαμον.
ltx/gr_gr_cog/me.m10.d05:meMA.Ode4C13.incipit	Ἡ καρδία σου τῷ ἔρωτι…
ltx/gr_gr_cog/me.m10.d05:meMA.Ode4C13.melody	@ltx/gr_gr_cog/he.h.m4:heHE.EparthentaSeIdousa.name
ltx/gr_gr_cog/me.m10.d05:meMA.Ode4C13.mode	@ltx/gr_gr_cog/miscellanea:misc.Mode4
ltx/gr_gr_cog/me.m10.d05:meMA.Ode4C13.ode	@ltx/gr_gr_cog/miscellanea:misc.Ode4
ltx/gr_gr_cog/me.m10.d05:meMA.Ode4C13.text	Ἡ καρδία σου τῷ ἔρωτι τοῦ νυμφίου, πυρπολουμένη ἄνθρακας, πλάνης γενναιόφρον, λύθρῳ ἐναπέσβεσεν, αἱμάτων καὶ θάλασσαν, τῆς πολυθεΐας ἐξήρανεν.
ltx/gr_gr_cog/me.m10.d05:meMA.Ode4C1T.incipit	Σωματούμενον ἐκύησας Θεὸν Λόγον, Θεογεννῆτορ…
ltx/gr_gr_cog/me.m10.d05:meMA.Ode4C1T.melody	@ltx/gr_gr_cog/he.h.m4:heHE.EparthentaSeIdousa.name
ltx/gr_gr_cog/me.m10.d05:meMA.Ode4C1T.mode	@ltx/gr_gr_cog/miscellanea:misc.Mode4
ltx/gr_gr_cog/me.m10.d05:meMA.Ode4C1T.ode	@ltx/gr_gr_cog/miscellanea:misc.Ode4
ltx/gr_gr_cog/me.m10.d05:meMA.Ode4C1T.text	Σωματούμενον ἐκύησας Θεὸν Λόγον, Θεογεννῆτορ ἄχραντε, ὃν ἡ Χαριτίνη, στέργουσα θερμότατα, πυρὶ ἀντετάξατο, καὶ πολυειδέσι στρεβλώσεσι.
ltx/gr_gr_cog/me.m10.d05:meMA.Ode5C11.greekmelody	@ltx/gr_gr_cog/he.h.m4:heHE.SyKyrieMouFos.greekname
ltx/gr_gr_cog/me.m10.d05:meMA.Ode5C11.incipit	Τὴν κάραν ξυρισμῷ, καὶ ἀνθράκων…
ltx/gr_gr_cog/me.m10.d05:meMA.Ode5C11.melody	@ltx/gr_gr_cog/he.h.m4:heHE.SyKyrieMouFos.name
ltx/gr_gr_cog/me.m10.d05:meMA.Ode5C11.mode	@ltx/gr_gr_cog/miscellanea:misc.Mode4
ltx/gr_gr_cog/me.m10.d05:meMA.Ode5C11.ode	@ltx/gr_gr_cog/miscellanea:misc.Ode5
ltx/gr_gr_cog/me.m10.d05:meMA.Ode5C11.text	Τὴν κάραν ξυρισμῷ, καὶ ἀνθράκων πυρώσει, συνθλίβοντές σου θεόφρον, λογισμοῦ σου τὸν τόνον, οὐδόλως παρεσάλευσαν.
ltx/gr_gr_cog/me.m10.d05:meMA.Ode5C12.incipit	Ἥλους σου καὶ σφαγήν, εἰκονίζουσα…
ltx/gr_gr_cog/me.m10.d05:meMA.Ode5C12.melody	@ltx/gr_gr_cog/he.h.m4:heHE.SyKyrieMouFos.name
ltx/gr_gr_cog/me.m10.d05:meMA.Ode5C12.mode	@ltx/gr_gr_cog/miscellanea:misc.Mode4
ltx/gr_gr_cog/me.m10.d05:meMA.Ode5C12.ode	@ltx/gr_gr_cog/miscellanea:misc.Ode5
ltx/gr_gr_cog/me.m10.d05:meMA.Ode5C12.text	Ἥλους σου καὶ σφαγήν, εἰκονίζουσα Κύριε, τὴν ἔμπυρον ὀβελίσκων, ὑποφέρω ὀδύνην, ἡ Μάρτυς ἀνεκραύγαζεν.
ltx/gr_gr_cog/me.m10.d05:meMA.Ode5C13.incipit	Νίκαις τὴν κεφαλήν, Χαριτίνη κατέστεψαι…
ltx/gr_gr_cog/me.m10.d05:meMA.Ode5C13.melody	@ltx/gr_gr_cog/he.h.m4:heHE.SyKyrieMouFos.name
ltx/gr_gr_cog/me.m10.d05:meMA.Ode5C13.mode	@ltx/gr_gr_cog/miscellanea:misc.Mode4
ltx/gr_gr_cog/me.m10.d05:meMA.Ode5C13.ode	@ltx/gr_gr_cog/miscellanea:misc.Ode5
ltx/gr_gr_cog/me.m10.d05:meMA.Ode5C13.text	Νίκαις τὴν κεφαλήν, Χαριτίνη κατέστεψαι, νικήσασα τὸν τὴν Εὔαν, ἐκνικήσαντα ὄφιν, τοῖς ἄθλοις καλλιπάρθενε.
ltx/gr_gr_cog/me.m10.d05:meMA.Ode5C1T.incipit	Νοῦς βρότειος τὴν σήν, ὑπὲρ…
ltx/gr_gr_cog/me.m10.d05:meMA.Ode5C1T.melody	@ltx/gr_gr_cog/he.h.m4:heHE.SyKyrieMouFos.name
ltx/gr_gr_cog/me.m10.d05:meMA.Ode5C1T.mode	@ltx/gr_gr_cog/miscellanea:misc.Mode4
ltx/gr_gr_cog/me.m10.d05:meMA.Ode5C1T.ode	@ltx/gr_gr_cog/miscellanea:misc.Ode5
ltx/gr_gr_cog/me.m10.d05:meMA.Ode5C1T.text	Νοῦς βρότειος τὴν σήν, ὑπὲρ ἔννοιαν σύλληψιν, οὐ δύναται ἐννοῆσαι, Μητροπάρθενε Κόρη· Θεὸν γὰρ ἀπεκύησας.
ltx/gr_gr_cog/me.m10.d05:meMA.Ode6C11.greekmelody	@ltx/gr_gr_cog/he.h.m4:heHE.ThysoSoiMetaFonis.greekname
ltx/gr_gr_cog/me.m10.d05:meMA.Ode6C11.incipit	Χάρισι, καὶ σημείοις Χριστὸς ἐστεφάνωσε…
ltx/gr_gr_cog/me.m10.d05:meMA.Ode6C11.melody	@ltx/gr_gr_cog/he.h.m4:heHE.ThysoSoiMetaFonis.name
ltx/gr_gr_cog/me.m10.d05:meMA.Ode6C11.mode	@ltx/gr_gr_cog/miscellanea:misc.Mode4
ltx/gr_gr_cog/me.m10.d05:meMA.Ode6C11.ode	@ltx/gr_gr_cog/miscellanea:misc.Ode6
ltx/gr_gr_cog/me.m10.d05:meMA.Ode6C11.text	Χάρισι, καὶ σημείοις Χριστὸς ἐστεφάνωσε, τὴν ἱερὰν κορυφήν σου, ὑπὲρ οὗ τὸ πάσχειν προῄρησο, Ἀθληφόρε, τῆς χαρᾶς τῆς ἐνθέου ἐπώνυμε.
ltx/gr_gr_cog/me.m10.d05:meMA.Ode6C12.incipit	Ἅγιος, Ἰωνᾶν ἐκ βυθοῦ ὁ…
ltx/gr_gr_cog/me.m10.d05:meMA.Ode6C12.melody	@ltx/gr_gr_cog/he.h.m4:heHE.ThysoSoiMetaFonis.name
ltx/gr_gr_cog/me.m10.d05:meMA.Ode6C12.mode	@ltx/gr_gr_cog/miscellanea:misc.Mode4
ltx/gr_gr_cog/me.m10.d05:meMA.Ode6C12.ode	@ltx/gr_gr_cog/miscellanea:misc.Ode6
ltx/gr_gr_cog/me.m10.d05:meMA.Ode6C12.text	Ἅγιος, Ἰωνᾶν ἐκ βυθοῦ ὁ ῥυσάμενος, σὲ θαλαττίῳ πελάγει, ἐῤῥιμμένην σῴζει, ζῶσαν θεόφρον, καὶ βυθῷ σου, τῶν αἱμάτων ἐχθροὺς κατεπόντισε.
ltx/gr_gr_cog/me.m10.d05:meMA.Ode6C13.incipit	Ῥομφαίᾳ, καρτερίας ἐχθροὺς ἐθανάτωσας, καὶ…
ltx/gr_gr_cog/me.m10.d05:meMA.Ode6C13.melody	@ltx/gr_gr_cog/he.h.m4:heHE.ThysoSoiMetaFonis.name
ltx/gr_gr_cog/me.m10.d05:meMA.Ode6C13.mode	@ltx/gr_gr_cog/miscellanea:misc.Mode4
ltx/gr_gr_cog/me.m10.d05:meMA.Ode6C13.ode	@ltx/gr_gr_cog/miscellanea:misc.Ode6
ltx/gr_gr_cog/me.m10.d05:meMA.Ode6C13.text	Ῥομφαίᾳ, καρτερίας ἐχθροὺς ἐθανάτωσας, καὶ καρτεροῦσα ὀδόντων, παντελῆ ἐκρίζωσιν Ἔνδοξε, τῶν λεόντων, τῶν ἀσάρκων τὰς μύλας συνέθλασας.
ltx/gr_gr_cog/me.m10.d05:meMA.Ode6C1T.incipit	Ἰσχύν σε, εὑραμένη Παρθένε καὶ…
ltx/gr_gr_cog/me.m10.d05:meMA.Ode6C1T.melody	@ltx/gr_gr_cog/he.h.m4:heHE.ThysoSoiMetaFonis.name
ltx/gr_gr_cog/me.m10.d05:meMA.Ode6C1T.mode	@ltx/gr_gr_cog/miscellanea:misc.Mode4
ltx/gr_gr_cog/me.m10.d05:meMA.Ode6C1T.ode	@ltx/gr_gr_cog/miscellanea:misc.Ode6
ltx/gr_gr_cog/me.m10.d05:meMA.Ode6C1T.text	Ἰσχύν σε, εὑραμένη Παρθένε καὶ στήριγμα, ἡ Χαριτίνη αἰκίσεις, καρτερῶς ὑποφέρει· καὶ χαίρουσα, σοῦ ὀπίσω, τῷ τῶν ὅλων Δεσπότῃ προσάγεται.
ltx/gr_gr_cog/me.m10.d05:meMA.Ode6H.greekmelody	@ltx/gr_gr_cog/he.h.m4:heHE.ThysoSoiMetaFonis.greekname
ltx/gr_gr_cog/me.m10.d05:meMA.Ode6H.incipit	@ltx/gr_gr_cog/he.h.m4:heHE.ThysoSoiMetaFonis.incipit
ltx/gr_gr_cog/me.m10.d05:meMA.Ode6H.melody	@ltx/gr_gr_cog/he.h.m4:heHE.ThysoSoiMetaFonis.melody
ltx/gr_gr_cog/me.m10.d05:meMA.Ode6H.mode	@ltx/gr_gr_cog/miscellanea:misc.Mode4
ltx/gr_gr_cog/me.m10.d05:meMA.Ode6H.ode	@ltx/gr_gr_cog/miscellanea:misc.Ode6
ltx/gr_gr_cog/me.m10.d05:meMA.Ode6H.text	@ltx/gr_gr_cog/he.h.m4:heHE.ThysoSoiMetaFonis.text
ltx/gr_gr_cog/me.m10.d05:meMA.Ode7C11.greekmelody	@ltx/gr_gr_cog/he.h.m4:heHE.EnTiKaminoAvramiaioi.greekname
ltx/gr_gr_cog/me.m10.d05:meMA.Ode7C11.incipit	Νέους τρεῖς παίδας, ὁ ἐκ…
ltx/gr_gr_cog/me.m10.d05:meMA.Ode7C11.melody	@ltx/gr_gr_cog/he.h.m4:heHE.EnTiKaminoAvramiaioi.name
ltx/gr_gr_cog/me.m10.d05:meMA.Ode7C11.mode	@ltx/gr_gr_cog/miscellanea:misc.Mode4
ltx/gr_gr_cog/me.m10.d05:meMA.Ode7C11.ode	@ltx/gr_gr_cog/miscellanea:misc.Ode7
ltx/gr_gr_cog/me.m10.d05:meMA.Ode7C11.text	Νέους τρεῖς παίδας, ὁ ἐκ καμίνου λυτρωσάμενος, σῴζει ἐκ τροχοῦ σε Μάρτυς πυροειδοῦς, Χαριτίνη ἀναμέλπουσαν· Εὐλογημένος εἶ ἐν τῷ Ναῷ, τῆς δόξης σου Κύριε.
ltx/gr_gr_cog/me.m10.d05:meMA.Ode7C12.incipit	Μετὰ Παρθένων, λαμπαδηφόρος εἰς οὐράνια…
ltx/gr_gr_cog/me.m10.d05:meMA.Ode7C12.melody	@ltx/gr_gr_cog/he.h.m4:heHE.EnTiKaminoAvramiaioi.name
ltx/gr_gr_cog/me.m10.d05:meMA.Ode7C12.mode	@ltx/gr_gr_cog/miscellanea:misc.Mode4
ltx/gr_gr_cog/me.m10.d05:meMA.Ode7C12.ode	@ltx/gr_gr_cog/miscellanea:misc.Ode7
ltx/gr_gr_cog/me.m10.d05:meMA.Ode7C12.text	Μετὰ Παρθένων, λαμπαδηφόρος εἰς οὐράνια, βαίνεις τοῦ πυρὸς λαμπάδας καρτερικῶς, ἐν τῷ ψάλλειν ὑπομείνασα· Εὐλογημένος εἶ ἐν τῷ Ναῷ, τῆς δόξης σου Κύριε.
ltx/gr_gr_cog/me.m10.d05:meMA.Ode7C13.incipit	Ἐληλεγμένος, ὑπομονῇ σου ὁ παράνομος…
ltx/gr_gr_cog/me.m10.d05:meMA.Ode7C13.melody	@ltx/gr_gr_cog/he.h.m4:heHE.EnTiKaminoAvramiaioi.name
ltx/gr_gr_cog/me.m10.d05:meMA.Ode7C13.mode	@ltx/gr_gr_cog/miscellanea:misc.Mode4
ltx/gr_gr_cog/me.m10.d05:meMA.Ode7C13.ode	@ltx/gr_gr_cog/miscellanea:misc.Ode7
ltx/gr_gr_cog/me.m10.d05:meMA.Ode7C13.text	Ἐληλεγμένος, ὑπομονῇ σου ὁ παράνομος, χεῖρας συνδεσμεῖ καὶ πόδας καὶ τῷ βυθῷ, παραπέμπει σε κραυγάζουσαν· Εὐλογημένος εἶ ἐν τῷ Ναῷ, τῆς δόξης σου Κύριε.
ltx/gr_gr_cog/me.m10.d05:meMA.Ode7C14.incipit	Λόγῳ σου θείῳ, τὴν ἀλογίαν…
ltx/gr_gr_cog/me.m10.d05:meMA.Ode7C14.melody	@ltx/gr_gr_cog/he.h.m4:heHE.EnTiKaminoAvramiaioi.name
ltx/gr_gr_cog/me.m10.d05:meMA.Ode7C14.mode	@ltx/gr_gr_cog/miscellanea:misc.Mode4
ltx/gr_gr_cog/me.m10.d05:meMA.Ode7C14.ode	@ltx/gr_gr_cog/miscellanea:misc.Ode7
ltx/gr_gr_cog/me.m10.d05:meMA.Ode7C14.text	Λόγῳ σου θείῳ, τὴν ἀλογίαν στηλιτεύσασα, πάθει παθημάτων Μάρτυς ζωοποιῶν, ἀνεπλήρωσας ὑστέρημα· Εὐλογημένος εἶ ὁ Θεός μου, βοῶσα καὶ Κύριος.
ltx/gr_gr_cog/me.m10.d05:meMA.Ode7C1T.incipit	Παρθένον μόνην, καὶ καθαρὰν σε…
ltx/gr_gr_cog/me.m10.d05:meMA.Ode7C1T.melody	@ltx/gr_gr_cog/he.h.m4:heHE.EnTiKaminoAvramiaioi.name
ltx/gr_gr_cog/me.m10.d05:meMA.Ode7C1T.mode	@ltx/gr_gr_cog/miscellanea:misc.Mode4
ltx/gr_gr_cog/me.m10.d05:meMA.Ode7C1T.ode	@ltx/gr_gr_cog/miscellanea:misc.Ode7
ltx/gr_gr_cog/me.m10.d05:meMA.Ode7C1T.text	Παρθένον μόνην, καὶ καθαράν σε καὶ ἀκήρατον, Λόγος καθαρὸς ἠγάπησε καὶ ἐκ σοῦ, ἀνεπλάσατο σαρκούμενος, Κόρη τὸν ἄνθρωπον, ὁ Χαριτίνην δοξάσας τοῖς θαύμασι.
ltx/gr_gr_cog/me.m10.d05:meMA.Ode8C11.greekmelody	@ltx/gr_gr_cog/he.h.m4:heHE.CheirasEkpetasasDaniil.greekname
ltx/gr_gr_cog/me.m10.d05:meMA.Ode8C11.incipit	Ὡραία ἐν κάλλεσι τῶν σῶν…
ltx/gr_gr_cog/me.m10.d05:meMA.Ode8C11.melody	@ltx/gr_gr_cog/he.h.m4:heHE.CheirasEkpetasasDaniil.name
ltx/gr_gr_cog/me.m10.d05:meMA.Ode8C11.mode	@ltx/gr_gr_cog/miscellanea:misc.Mode4
ltx/gr_gr_cog/me.m10.d05:meMA.Ode8C11.ode	@ltx/gr_gr_cog/miscellanea:misc.Ode8
ltx/gr_gr_cog/me.m10.d05:meMA.Ode8C11.text	Ὡραία ἐν κάλλεσι τῶν σῶν, στιγμάτων γέγονας, καὶ κατηγγύησαι, Παρθένος ἄφθορος μείνασα, τῷ ὡραίῳ Λόγῳ πάνσεμνε, τῷ ἐκ Παρθένου διʼ ἡμᾶς, σεσαρκωμένῳ Χριστῷ, ᾧ βοῶμεν· Πάντα τὰ ἔργα ὑμνεῖτε τὸν Κύριον.
ltx/gr_gr_cog/me.m10.d05:meMA.Ode8C12.incipit	Πάσαις μαχομένη προσβολαῖς, τῶν τιμωρούντων…
ltx/gr_gr_cog/me.m10.d05:meMA.Ode8C12.melody	@ltx/gr_gr_cog/he.h.m4:heHE.CheirasEkpetasasDaniil.name
ltx/gr_gr_cog/me.m10.d05:meMA.Ode8C12.mode	@ltx/gr_gr_cog/miscellanea:misc.Mode4
ltx/gr_gr_cog/me.m10.d05:meMA.Ode8C12.ode	@ltx/gr_gr_cog/miscellanea:misc.Ode8
ltx/gr_gr_cog/me.m10.d05:meMA.Ode8C12.text	Πάσαις μαχομένη προσβολαῖς, τῶν τιμωρούντων σε, γενναίως ἤνεγκας, τροχοῦ φλογίζοντος κάκωσιν, ὀβελίσκων τὴν πυράκτωσιν, τὴν εἰς βυθὸν ἀποῤῥιφήν, καὶ τῶν ὀδόντων Σεμνή, καὶ ὀνύχων τὰς ἐκριζώσεις, Χριστὸν μεγαλύνουσα.
ltx/gr_gr_cog/me.m10.d05:meMA.Ode8C13.incipit	Οἱ πόδες οἱ σοί, ταῖς…
ltx/gr_gr_cog/me.m10.d05:meMA.Ode8C13.melody	@ltx/gr_gr_cog/he.h.m4:heHE.CheirasEkpetasasDaniil.name
ltx/gr_gr_cog/me.m10.d05:meMA.Ode8C13.mode	@ltx/gr_gr_cog/miscellanea:misc.Mode4
ltx/gr_gr_cog/me.m10.d05:meMA.Ode8C13.ode	@ltx/gr_gr_cog/miscellanea:misc.Ode8
ltx/gr_gr_cog/me.m10.d05:meMA.Ode8C13.text	Οἱ πόδες οἱ σοί, ταῖς καλλοναῖς τῶν πόνων ἔνδοξε καθωραΐσθησαν· διὸ ἐν ὕδασι βαίνοντες, οὐκ ἑβράχησαν συνόντων σοι, Παρθενομάρτυς ευκλεῶν Θεοῦ Ἀγγέλων, μεθ ὧν ἀνεβόας· Πάντα τὰ ἔργα ὑμνεῖτε τὸν Κύριον.
ltx/gr_gr_cog/me.m10.d05:meMA.Ode8C14.incipit	Θαῦμα καταπλῆττον πάντα νοῦν, μετὰ…
ltx/gr_gr_cog/me.m10.d05:meMA.Ode8C14.melody	@ltx/gr_gr_cog/he.h.m4:heHE.CheirasEkpetasasDaniil.name
ltx/gr_gr_cog/me.m10.d05:meMA.Ode8C14.mode	@ltx/gr_gr_cog/miscellanea:misc.Mode4
ltx/gr_gr_cog/me.m10.d05:meMA.Ode8C14.ode	@ltx/gr_gr_cog/miscellanea:misc.Ode8
ltx/gr_gr_cog/me.m10.d05:meMA.Ode8C14.text	Θαῦμα καταπλῆττον πάντα νοῦν, μετὰ τελείωσιν, πῶς τῷ γεννήτορι, τὸ σὸν ἐκδέδωκε λείψανον, βυθὸς ὁ κολπωσάμενος, ὅπερ κηδεύσας πατρικῶς, τρυγᾷ τὴν χάριν ἐκ σοῦ, Χαριτίνη, τὴν βασιλείαν λαβὼν τὴν οὐράνιον.
ltx/gr_gr_cog/me.m10.d05:meMA.Ode8C1T.incipit	Ὤφθης ὑπερτέρα οὐρανῶν, Θεὸν οὐράνιον…
ltx/gr_gr_cog/me.m10.d05:meMA.Ode8C1T.melody	@ltx/gr_gr_cog/he.h.m4:heHE.CheirasEkpetasasDaniil.name
ltx/gr_gr_cog/me.m10.d05:meMA.Ode8C1T.mode	@ltx/gr_gr_cog/miscellanea:misc.Mode4
ltx/gr_gr_cog/me.m10.d05:meMA.Ode8C1T.ode	@ltx/gr_gr_cog/miscellanea:misc.Ode8
ltx/gr_gr_cog/me.m10.d05:meMA.Ode8C1T.text	Ὤφθης ὑπερτέρα οὐρανῶν, Θεὸν οὐράνιον ἀποκυήσασα, τὸν οὐρανώσαντα Πάναγνε, γηγενῶν ὅλων τὸ φύραμα, καὶ Χαριτίνης τὴν σεπτήν, μνήμην φαιδρύναντα, ᾧ βοῶμεν· Πάντα τὰ ἔργα ὑμνεῖτε τὸν Κύριον.
ltx/gr_gr_cog/me.m10.d05:meMA.Ode8H.greekmelody	@ltx/gr_gr_cog/he.h.m4:heHE.CheirasEkpetasasDaniil.greekname
ltx/gr_gr_cog/me.m10.d05:meMA.Ode8H.incipit	@ltx/gr_gr_cog/he.h.m4:heHE.CheirasEkpetasasDaniil.incipit
ltx/gr_gr_cog/me.m10.d05:meMA.Ode8H.melody	@ltx/gr_gr_cog/he.h.m4:heHE.CheirasEkpetasasDaniil.melody
ltx/gr_gr_cog/me.m10.d05:meMA.Ode8H.mode	@ltx/gr_gr_cog/miscellanea:misc.Mode4
ltx/gr_gr_cog/me.m10.d05:meMA.Ode8H.ode	@ltx/gr_gr_cog/miscellanea:misc.Ode8
ltx/gr_gr_cog/me.m10.d05:meMA.Ode8H.text	@ltx/gr_gr_cog/he.h.m4:heHE.CheirasEkpetasasDaniil.text
ltx/gr_gr_cog/me.m10.d05:meMA.Ode9C11.greekmelody	@ltx/gr_gr_cog/he.h.m4:heHE.LithosAcheirotmitos.greekname
ltx/gr_gr_cog/me.m10.d05:meMA.Ode9C11.incipit	Ἵνα τῶν στεφάνων τῆς δόξης…
ltx/gr_gr_cog/me.m10.d05:meMA.Ode9C11.melody	@ltx/gr_gr_cog/he.h.m4:heHE.LithosAcheirotmitos.name
ltx/gr_gr_cog/me.m10.d05:meMA.Ode9C11.mode	@ltx/gr_gr_cog/miscellanea:misc.Mode4
ltx/gr_gr_cog/me.m10.d05:meMA.Ode9C11.ode	@ltx/gr_gr_cog/miscellanea:misc.Ode9
ltx/gr_gr_cog/me.m10.d05:meMA.Ode9C11.text	Ἵνα τῶν στεφάνων τῆς δόξης, ὡς ἀδιάφθορος παρθένος, Μάρτυς ἐπιτύχῃς παντοίων, κολαστηρίων εἶδος ὑπήνεγκας, ἀγαλλομένη πνεύματι, καὶ διανοίας ἀναστήματι.
ltx/gr_gr_cog/me.m10.d05:meMA.Ode9C12.incipit	Ὡς περικαλὴς ὡς ὡραία, ὡς…
ltx/gr_gr_cog/me.m10.d05:meMA.Ode9C12.melody	@ltx/gr_gr_cog/he.h.m4:heHE.LithosAcheirotmitos.name
ltx/gr_gr_cog/me.m10.d05:meMA.Ode9C12.mode	@ltx/gr_gr_cog/miscellanea:misc.Mode4
ltx/gr_gr_cog/me.m10.d05:meMA.Ode9C12.ode	@ltx/gr_gr_cog/miscellanea:misc.Ode9
ltx/gr_gr_cog/me.m10.d05:meMA.Ode9C12.text	Ὡς περικαλὴς ὡς ὡραία, ὡς περιδέξιος παρθένος, ὡς ἀκαταγώνιστος Μάρτυς, ὡς τοῦ Δεσπότου νύμφη πανάμωμος, χρυσοειδέσι πτέρυξι, πρὸς τὰ οὐράνια κατέπαυσας.
ltx/gr_gr_cog/me.m10.d05:meMA.Ode9C13.incipit	Σὺ φωτοειδεῖς Χαριτίνη, ἐναπαστράπτεις λαμπηδόνας…
ltx/gr_gr_cog/me.m10.d05:meMA.Ode9C13.melody	@ltx/gr_gr_cog/he.h.m4:heHE.LithosAcheirotmitos.name
ltx/gr_gr_cog/me.m10.d05:meMA.Ode9C13.mode	@ltx/gr_gr_cog/miscellanea:misc.Mode4
ltx/gr_gr_cog/me.m10.d05:meMA.Ode9C13.ode	@ltx/gr_gr_cog/miscellanea:misc.Ode9
ltx/gr_gr_cog/me.m10.d05:meMA.Ode9C13.text	Σὺ φωτοειδεῖς Χαριτίνη, ἐναπαστράπτεις λαμπηδόνας, ζόφον πονηρίας δαιμόνων, καὶ παθημάτων ἀποδιώκουσα, ταῖς θεοδότοις πάντοτε, θαυματουργίαις ἀξιάγαστε.
ltx/gr_gr_cog/me.m10.d05:meMA.Ode9C14.incipit	Ἡ περιχαρής σου ἡμέρα, περιχαρῶς…
ltx/gr_gr_cog/me.m10.d05:meMA.Ode9C14.melody	@ltx/gr_gr_cog/he.h.m4:heHE.LithosAcheirotmitos.name
ltx/gr_gr_cog/me.m10.d05:meMA.Ode9C14.mode	@ltx/gr_gr_cog/miscellanea:misc.Mode4
ltx/gr_gr_cog/me.m10.d05:meMA.Ode9C14.ode	@ltx/gr_gr_cog/miscellanea:misc.Ode9
ltx/gr_gr_cog/me.m10.d05:meMA.Ode9C14.text	Ἡ περιχαρής σου ἡμέρα, περιχαρῶς λαοὺς ἀθροίζει, σοῦ τὰς ἀριστείας ὑμνῆσαι, καὶ τοὺς ἀγῶνας καὶ τὰ παλαίσματα, καὶ τὴν γενναίαν ἄθλησιν, Μεγαλομάρτυς χαριτώνυμε.
ltx/gr_gr_cog/me.m10.d05:meMA.Ode9C1T.incipit	Φῶς ἡμῖν ἀνέτειλε μήτρας, ἐξ…
ltx/gr_gr_cog/me.m10.d05:meMA.Ode9C1T.melody	@ltx/gr_gr_cog/he.h.m4:heHE.LithosAcheirotmitos.name
ltx/gr_gr_cog/me.m10.d05:meMA.Ode9C1T.mode	@ltx/gr_gr_cog/miscellanea:misc.Mode4
ltx/gr_gr_cog/me.m10.d05:meMA.Ode9C1T.ode	@ltx/gr_gr_cog/miscellanea:misc.Ode9
ltx/gr_gr_cog/me.m10.d05:meMA.Ode9C1T.text	Φῶς ἡμῖν ἀνέτειλε μήτρας, ἐξ ἀπειράνδρου σου Παρθένε, οὗ ταῖς φρυκτωρίαις ἐνθέως, καταυγασθεῖσα φῶς ἐχρημάτισεν, ἡ τῆς χαρᾶς ἐπώνυμος, Θεοκυῆτορ ἀπειρόγαμε.
ltx/gr_gr_cog/me.m10.d05:meMA.Ode9H.greekmelody	@ltx/gr_gr_cog/he.h.m4:heHE.LithosAcheirotmitos.greekname
ltx/gr_gr_cog/me.m10.d05:meMA.Ode9H.incipit	@ltx/gr_gr_cog/he.h.m4:heHE.LithosAcheirotmitos.incipit
ltx/gr_gr_cog/me.m10.d05:meMA.Ode9H.melody	@ltx/gr_gr_cog/he.h.m4:heHE.LithosAcheirotmitos.melody
ltx/gr_gr_cog/me.m10.d05:meMA.Ode9H.mode	@ltx/gr_gr_cog/miscellanea:misc.Mode4
ltx/gr_gr_cog/me.m10.d05:meMA.Ode9H.ode	@ltx/gr_gr_cog/miscellanea:misc.Ode9
ltx/gr_gr_cog/me.m10.d05:meMA.Ode9H.text	@ltx/gr_gr_cog/he.h.m4:heHE.LithosAcheirotmitos.text
ltx/gr_gr_cog/me.m10.d05:meVE.Apolytikion1ger.greekmelody	@ltx/gr_gr_cog/he.a.m3:heAU.TheiasPisteos.greekname
ltx/gr_gr_cog/me.m10.d05:meVE.Apolytikion1ger.incipit	Θείᾳ χάριτι, κραταιωθεῖσα, κράτος ᾔσχυνας…
ltx/gr_gr_cog/me.m10.d05:meVE.Apolytikion1ger.melody	@ltx/gr_gr_cog/he.a.m3:heAU.TheiasPisteos.name
ltx/gr_gr_cog/me.m10.d05:meVE.Apolytikion1ger.mode	@ltx/gr_gr_cog/miscellanea:misc.Mode3
ltx/gr_gr_cog/me.m10.d05:meVE.Apolytikion1ger.poet	@ltx/gr_gr_cog/poets:po.Gerasimou
ltx/gr_gr_cog/me.m10.d05:meVE.Apolytikion1ger.text	Θείᾳ χάριτι, κραταιωθεῖσα, κράτος ᾔσχυνας, τῆς δυσσεβείας, Χαριτίνη ὑπὲρ φύσιν ἀθλήσασα· ὅθεν χαρίτων πηγὴν ἀδαπάνητον, ὡς γλυκασμὸν ἀναβλήζεις τοῖς κράζουσι. Μάρτυς ἔνδοξε, Χριστὸν τὸν Θεὸν ἱκέτευε, δωρήσασθαι ἡμῖν τὸ μέγα ἔλεος.
ltx/gr_gr_cog/me.m10.d05:meVE.SticStavrotheotokion.greekmelody	@ltx/gr_gr_cog/he.a.m4:heAU.OsGennaionEnMartysi.greekname
ltx/gr_gr_cog/me.m10.d05:meVE.SticStavrotheotokion.incipit	Ἡ ἀμνὰς ἡ κυήσασα…
ltx/gr_gr_cog/me.m10.d05:meVE.SticStavrotheotokion.melody	@ltx/gr_gr_cog/he.a.m4:heAU.OsGennaionEnMartysi.name
ltx/gr_gr_cog/me.m10.d05:meVE.SticStavrotheotokion.mode	@ltx/gr_gr_cog/miscellanea:misc.Mode4
ltx/gr_gr_cog/me.m10.d05:meVE.SticStavrotheotokion.text	Ἡ ἀμνὰς ἡ κυήσασα, τὸ ἀρνίον τὸ ἄμωμον, τὸ τὴν ἁμαρτίαν ἐλθὸν ἰάσασθαι, παντὸς τοῦ κόσμου Πανάχραντε, οἰκείῳ ἐν αἵματι, τὸ σφαγὲν ὑπὲρ ἡμῶν, καὶ ζωῶσαν τὰ σύμπαντα· σὺ με ἔνδυσον, γυμνωθέντα τῆς θείας ἀφθαρσίας, ἐξ ἐρίου τοῦ σοῦ τόκου, περιβολὴν θείας χάριτος.
ltx/gr_gr_cog/me.m10.d05:meVE.SticTheotokion.greekmelody	@ltx/gr_gr_cog/he.a.m4:heAU.OsGennaionEnMartysi.greekname
ltx/gr_gr_cog/me.m10.d05:meVE.SticTheotokion.incipit	Σωτηρίας λιμένα σε, τὸν πανάκλυστον…
ltx/gr_gr_cog/me.m10.d05:meVE.SticTheotokion.melody	@ltx/gr_gr_cog/he.a.m4:heAU.OsGennaionEnMartysi.name
ltx/gr_gr_cog/me.m10.d05:meVE.SticTheotokion.mode	@ltx/gr_gr_cog/miscellanea:misc.Mode4
ltx/gr_gr_cog/me.m10.d05:meVE.SticTheotokion.text	Σωτηρίας λιμένα σε, τὸν πανάκλυστον Ἄχραντε, καὶ πραεῖαν ὄντως γαλήνην ἔχομεν, οἱ ἐν πελάγει Θεόνυμφε, σφοδρῶς χειμαζόμενοι, τῶν τοῦ βίου δυσχερῶν, καὶ δεινῶν περιστάσεων, διὰ τοῦτό σοι, καὶ προστρέχομεν πάντες ἐκβοῶντες· Εἰς τοὺς αἰῶνας μὴ ἐλλίπῃς, τῶν οἰκετῶν σου προΐστασθαι.
ltx/gr_gr_cog/me.m10.d05:meVE.Stichera01.greekmelody	@ltx/gr_gr_cog/he.a.m4:heAU.OsGennaionEnMartysi.greekname
ltx/gr_gr_cog/me.m10.d05:meVE.Stichera01.incipit	Τῆς χαρᾶς ὡς ἐπώνυμος, ἐν…
ltx/gr_gr_cog/me.m10.d05:meVE.Stichera01.melody	@ltx/gr_gr_cog/he.a.m4:heAU.OsGennaionEnMartysi.name
ltx/gr_gr_cog/me.m10.d05:meVE.Stichera01.mode	@ltx/gr_gr_cog/miscellanea:misc.Mode4
ltx/gr_gr_cog/me.m10.d05:meVE.Stichera01.text	Τῆς χαρᾶς ὡς ἐπώνυμος, ἐν χαρᾷ προσεχώρησας, εἰς νυμφῶνα πάνσεμνε τὸν οὐράνιον, ἔνθα τὸ σὸν ἐπεπόθησας, κεκτῆσθαι πολίτευμα, ὑπομείνασα στεῤῥῶς, ἀλγεινήν ὄντως βάσανον, τῶν ὀδόντων τε, καὶ ὀνύχων ἁπάντων ἐκριζώσεις, ἀθλοφόρε Χαριτίνη, Παρθενομάρτυς πολύαθλε.
ltx/gr_gr_cog/me.m10.d05:meVE.Stichera02.incipit	Τῶν λεόντων συνέθλασας, σιαγόνας πολύαθλε…
ltx/gr_gr_cog/me.m10.d05:meVE.Stichera02.melody	@ltx/gr_gr_cog/he.a.m4:heAU.OsGennaionEnMartysi.name
ltx/gr_gr_cog/me.m10.d05:meVE.Stichera02.mode	@ltx/gr_gr_cog/miscellanea:misc.Mode4
ltx/gr_gr_cog/me.m10.d05:meVE.Stichera02.text	Τῶν λεόντων συνέθλασας, σιαγόνας πολύαθλε, σιαγόνων φέρουσα τὰ συνθλάματα, τῶν δὲ ὀνύχων ἐκρίζωσιν, γενναίως ὑπήνεγκας, ἐκριζοῦσα τὰ δεινά, τῆς ἀπάτης φρυάγματα, θαλαττίοις δέ, ἐν βυθοῖς ἀπεῤῥίφης, τὴν κακίαν, ὑποβρύχιον ποιοῦσα, τοῦ πονηροῦ πολεμήτορος.
ltx/gr_gr_cog/me.m10.d05:meVE.Stichera03.incipit	Μετὰ τέλος μακάριον, ἐν θαλάσσῃ…
ltx/gr_gr_cog/me.m10.d05:meVE.Stichera03.melody	@ltx/gr_gr_cog/he.a.m4:heAU.OsGennaionEnMartysi.name
ltx/gr_gr_cog/me.m10.d05:meVE.Stichera03.mode	@ltx/gr_gr_cog/miscellanea:misc.Mode4
ltx/gr_gr_cog/me.m10.d05:meVE.Stichera03.text	Μετὰ τέλος μακάριον, ἐν θαλάσσῃ ῥιφεῖσάν σε, σὸς γεννήτωρ Ἔνδοξε συνεκόμισεν, ἀναβοὼν μετʼ ἐκπλήξεως· Πῶς νῦν κεχαρίτωσαι, ἱερώτατον ἐμόν, καὶ ποθούμενον γέννημα, ταῖς κολάσεσι, τοῦ σεπτοῦ μαρτυρίου, καὶ τὴν κλῆσιν, ἀληθεύουσαν εἰργάσω, προτυπωθεῖσάν σοι χάριτι!
