ltx/gr_gr_cog/le.pr.tr.d034:lemcTE.reading1.book_abbr	@ltx/gr_gr_cog/bible:Isaiah.abbr
ltx/gr_gr_cog/le.pr.tr.d034:lemcTE.reading1.book_string	@ltx/gr_gr_cog/bible:Isaiah.text
ltx/gr_gr_cog/le.pr.tr.d034:lemcTE.reading1.chapverse	Ζʹ, 1 – 14
ltx/gr_gr_cog/le.pr.tr.d034:lemcTE.reading1.incipit	Ἐγένετο ἐν ταῖς ἡμέραις Ἄχαζ τοῦ Ἰωάθαμ, τοῦ υἱοῦ…
ltx/gr_gr_cog/le.pr.tr.d034:lemcTE.reading1.text	Ἐγένετο ἐν ταῖς ἡμέραις Ἄχαζ τοῦ Ἰωάθαμ, τοῦ υἱοῦ Ὀζίου βασιλέως Ἰούδα, ἀνέβη Ῥασείμ, βασιλεὺς Ἀράμ, καὶ Φακκεέ, υἱὸς Ῥωμελίου, βασιλεὺς Ἰσραὴλ ἐπὶ Ἱερουσαλήμ, πολεμῆσαι αὐτήν, καὶ οὐκ ἡδυνήθησαν πολιορκῆσαι αὐτήν. Καὶ ἀνηγγέλη εἰς τὸν οἶκον Δαυΐδ, λέγων· Συνεφώνησεν Ἀρὰμ πρὸς τὸν Ἐφραΐμ, καὶ ἐξέστη ἡ ψυχὴ αὐτοῦ, καὶ ἡ ψυχὴ τοῦ λαοῦ αὐτοῦ, ὃν τρόπον ἐν δρυμῷ ξύλον ὑπὸ πνεύματος σαλευθῇ. Καὶ εἶπε Κύριος πρὸς Ἠσαΐαν· Ἔξελθε εἰς συνάντησιν τῷ Ἄχαζ σύ, καὶ ὁ καταλειφθείς Ἰασοὺβ ὁ υἱός σου, πρὸς τὴν κολυμβήθραν τῆς ἄνω ὁδοῦ τοῦ ἀγροῦ τοῦ κναφέως, καὶ ἐρεῖς αὐτῷ· Φύλαξαι τοῦ ἡσυχάσαι, καὶ μὴ φοβοῦ, μηδὲ ἡ ψυχή σου ἀσθενείτω ἀπὸ τῶν δύο ξύλων, τῶν δαυλῶν τῶν καπνιζομένων τούτων· ὅταν γὰρ ὀργὴ τοῦ θυμοῦ μου γένηται, πάλιν ἰάσομαι. Καὶ ὁ υἱὸς τοῦ Ἀράμ, καὶ ὁ υἱὸς τοῦ Ῥωμελίου, ὅτι ἐβουλεύσαντο βουλὴν πονηράν, Ἐφραΐμ περὶ σοῦ, λέγοντες· Ἀναβησόμεθα εἰς τὴν Ἰουδαίαν, καὶ συλλαλήσαντες αὐτοῖς, ἀποστρέψομεν αὐτοὺς πρὸς ἡμᾶς, καὶ βασιλεύσομεν αὐτοῖς τὸν υἱὸν Ταβεήλ, τάδε λέγει κύριος Σαβαώθ. Οὐ μὴ μείνῃ ἡ βουλὴ αὕτη, οὐδὲ ἔσται, ἀλλʼ ἡ κεφαλὴ Ἀράμ, Δαμασκός, καὶ ἡ κεφαλὴ Δαμασκοῦ, Ῥαασείμ, ἀλλ ἐφʼ ἑξήκοντα καὶ πέντε ἐτῶν ἐκλείψει ἡ βασιλεία Ἐφραῒμ ἀπὸ λαοῦ, καὶ ἡ κεφαλὴ Ἐφραῒμ Σομόρων, καὶ ἡ κεφαλὴ Σομόρων, υἱὸς τοῦ Ῥωμελίου, καὶ ἐὰν μὴ πιστεύσητε, οὐδὲ μὴ συνῆτε. Καὶ προσέθετο Κύριος λαλῆσαι τῷ Ἄχαζ, λέγων· Αἴτησον σεαυτῷ σημεῖον παρὰ Κυρίου τοῦ Θεοῦ σου εἰς βάθος, ἢ εἰς ὕψος. Καὶ εἶπεν Ἄχαζ· Οὐ μὴ αἰτήσω, οὐδὲ μὴ πειράσω Κύριον. Καὶ εἶπεν· Ἀκούσατε δὴ οἶκος Δαυΐδ, μὴ μικρὸν ὑμῖν ἀγῶνα παρέχειν ἀνθρώποις, καὶ πῶς Κυρίῳ παρέχετε ἀγῶνα; Διὰ τοῦτο δώσει Κύριος αὐτὸς ὑμῖν σημεῖον.
ltx/gr_gr_cog/le.pr.tr.d034:lemcTE.reading1.title	
ltx/gr_gr_cog/le.pr.tr.d034:lemcTE.reading1.title_abbr	
ltx/gr_gr_cog/le.pr.tr.d034:lemcTE.reading1.version	@ltx/gr_gr_cog/properties:version.designation
ltx/gr_gr_cog/le.pr.tr.d034:lemcVE.reading1.book_abbr	@ltx/gr_gr_cog/bible:Genesis.abbr
ltx/gr_gr_cog/le.pr.tr.d034:lemcVE.reading1.book_string	@ltx/gr_gr_cog/bible:Genesis.text
ltx/gr_gr_cog/le.pr.tr.d034:lemcVE.reading1.chapverse	Εʹ 1 – 24
ltx/gr_gr_cog/le.pr.tr.d034:lemcVE.reading1.incipit	Αὕτὴ ἡ βίβλος γενέσεως ἀνθρώπων, ᾗ ἡμέρᾳ ἐποίησεν ὁ…
ltx/gr_gr_cog/le.pr.tr.d034:lemcVE.reading1.text	Αὕτὴ ἡ βίβλος γενέσεως ἀνθρώπων, ᾗ ἡμέρᾳ ἐποίησεν ὁ Θεὸς τὸν Ἀδάμ, κατʼ εἰκόνα Θεοῦ ἐποίησεν αὐτόν, ἄρσεν καὶ θῆλυ ἐποίησεν αὐτούς, καὶ εὐλόγησεν αὐτούς, καὶ ἐπωνόμασε τὸ ὄνομα αὐτοῦ, Ἀδὰμ ᾗ ἡμέρᾳ ἐποίησεν αὐτούς. Ἔζησε δὲ Ἀδὰμ διακόσια τριάκοντα ἔτη, καὶ ἐγέννησεν υἱὸν κατὰ τὴν ἰδέαν αὐτοῦ, καὶ κατὰ τὴν εἰκόνα αὐτοῦ, καὶ ἐπωνόμασε τὸ ὄνομα αὐτοῦ, Σήθ. Ἐγένοντο δὲ αἱ ἡμέραι Ἀδάμ, ἃς ἔζησε μετὰ τὸ γεννῆσαι αὐτὸν τὸν Σήθ, ἔτη, ἑπτακόσια· καὶ ἐγέννησεν υἱοὺς καὶ θυγατέρας. Καὶ ἐγένοντο πᾶσαι αἱ ἡμέραι Ἀδάμ, ἃς ἔζησεν, ἐννακόσια τριάκοντα ἔτη, καὶ ἀπέθανεν. Ἔζησε δὲ Σήθ, πέντε καὶ διακόσια ἔτη, καὶ ἐγέννησε τὸν Ἐνώς. Καὶ ἔζησε Σήθ, μετὰ τὸ γεννῆσαι αὐτὸν τὸν Ἐνώς, ἑπτὰ ἔτη καὶ ἑπτακόσια, καὶ ἐγέννησεν υἱοὺς καὶ θυγατέρας. Καὶ ἐγένοντο πᾶσαι αἱ ἡμέραι Σήθ, δώδεκα καὶ ἐννακόσια ἔτη, καὶ ἀπέθανε. Καὶ ἔζησεν Ἐνὼς ἔτη ἑκατὸν ἐνενήκοντα, καὶ ἐγέννησε τὸν Καϊνᾶν. Καὶ ἔζησεν Ἐνώς, μετὰ τὸ γεννῆσαι αὐτὸν τὸν Καϊνᾶν, πεντεκαίδεκα ἔτη καὶ ἑπτακόσια, καὶ ἐγέννησεν υἱοὺς καὶ θυγατέρας. Καὶ ἐγένοντο πᾶσαι αἱ ἡμέραι Ἐνώς, πέντε ἔτη καὶ ἐννακόσια, καὶ ἀπέθανε. Καὶ ἔζησε Καϊνᾶν ἑβδομήκοντα καὶ ἑκατὸν ἔτη, καὶ ἐγέννησε τὸν Μαλελεήλ. Καὶ ἔζησε Καϊνᾶν, μετὰ τὸ γεννῆσαι αὐτὸν τὸν Μαλελεήλ, τεσσαράκοντα καὶ ἑπτακόσια ἔτη, καὶ ἐγέννησεν υἱοὺς καὶ θυγατέρας. Καὶ ἐγένοντο πᾶσαι αἱ ἡμέραι Καϊνᾶν, δέκα ἔτη καὶ ἐννακόσια, καὶ ἀπέθανε. Καὶ ἔζησε Μαλελεὴλ πέντε καὶ ἑξήκοντα καὶ ἑκατὸν ἔτη, καὶ ἐγέννησε τὸν Ἰάρεδ. Καὶ ἔζησε Μαλελεήλ, μετὰ τὸ γεννῆσαι αὐτὸν τὸν Ἰάρεδ, ἔτη ἑπτακόσια τριάκοντα, καὶ ἐγέννησεν υἱοὺς καὶ θυγατέρας. Καὶ ἐγένοντο πᾶσαι αἱ ἡμέραι Μαλελεήλ, ἔτη πέντε καὶ ἐνενήκοντα, καὶ ὀκτακόσια, καὶ ἀπέθανε. Καὶ ἔζησεν Ἰάρεδ δύο καὶ ἑξήκοντα ἔτη καὶ ἑκατόν, καὶ ἐγέννησε τὸν Ἐνώχ. Καὶ ἔζησεν Ἰάρεδ, μετὰ τὸ γεννῆσαι αὐτὸν τὸν Ἐνώχ, ὀκτακόσια ἔτη, καὶ ἐγέννησεν υἱοὺς καὶ θυγατέρας. Καὶ ἐγένοντο πᾶσαι αἱ ἡμέραι Ἰάρεδ, δύο καὶ ἑξήκοντα καὶ ἐννακόσια ἔτη, καὶ ἀπέθανε. Καὶ ἔζησεν Ἐνὼχ πέντε καὶ ἑξήκοντα καὶ ἑκατὸν ἔτη, καὶ ἐγέννησε τὸν Μαθουσάλα. Εὐηρέστησε δὲ Ἐνὼχ τῷ Θεῷ, μετὰ τὸ γεννῆσαι αὐτὸν τὸν Μαθουσάλα, διακόσια ἔτη, καὶ ἐγέννησεν υἱοὺς καὶ θυγατέρας. Καὶ ἐγένοντο πᾶσαι αἱ ἡμέραι Ἐνώχ, πέντε καὶ ἑξήκοντα, καὶ τριακόσια ἔτη. Καὶ εὐηρέστησεν Ἐνὼχ τῷ Θεῷ, καὶ οὐχ εὑρίσκετο, διότι μετέθηκεν αὐτὸν ὁ Θεός.
ltx/gr_gr_cog/le.pr.tr.d034:lemcVE.reading1.title	
ltx/gr_gr_cog/le.pr.tr.d034:lemcVE.reading1.title_abbr	
ltx/gr_gr_cog/le.pr.tr.d034:lemcVE.reading1.version	@ltx/gr_gr_cog/properties:version.designation
ltx/gr_gr_cog/le.pr.tr.d034:lemcVE.reading2.book_abbr	@ltx/gr_gr_cog/bible:Proverbs.abbr
ltx/gr_gr_cog/le.pr.tr.d034:lemcVE.reading2.book_string	@ltx/gr_gr_cog/bible:Proverbs.text
ltx/gr_gr_cog/le.pr.tr.d034:lemcVE.reading2.chapverse	Ϛʹ, 3 – 20
ltx/gr_gr_cog/le.pr.tr.d034:lemcVE.reading2.incipit	Ποίει, υἱέ, ἃ ἐγώ σοι ἐντέλλομαι, καὶ σῴζου· ἥκεις…
ltx/gr_gr_cog/le.pr.tr.d034:lemcVE.reading2.text	Ποίει, υἱέ, ἃ ἐγώ σοι ἐντέλλομαι, καὶ σῴζου· ἥκεις γὰρ εἰς χεῖρας κακῶν διὰ σὸν φίλον, ἴσθι μὴ ἐκλυόμενος, παρόξυνε δὲ καὶ τὸν φίλον σου, ὃν ἐγγυήσω. Μὴ δῷς ὕπνον σοῖς ὄμμασι, μηδὲ ἐπινυστάξῃς σοῖς βλεφάροις, ἵνα σώζῃ ὥσπερ δορκὰς ἐκ βρόχων, καὶ ὥσπερ ὄρνεον ἐκ παγίδος. Ἴθι πρὸς τὸν μύρμηκα, ὦ ὀκνηρέ, καὶ ζήλωσον, ἰδὼν τὰς ὁδοὺς αὐτοῦ καὶ γενοῦ ἐκείνου σοφώτερος. Ἐκείνῳ γάρ, γεωργίου μὴ ὑπάρχοντος, μηδὲ τὸν ἀναγκάζοντα ἔχων, μηδὲ ὑπὸ δεσπότην ὤν, ἑτοιμάζεται θέρους τὴν τροφήν, πολλήν τε ἐν τῷ ἀμητῷ ποιεῖται τὴν παράθεσιν. Ἢ πορεύθητι πρὸς τὴν μέλισσαν, καὶ μάθε ὡς ἐργάτις ἐστί, τὴν τε ἐργασίαν ὡς σεμνὴν ποιεῖται, ἧς τοὺς πόνους βασιλεῖς τε καὶ ἰδιῶται πρὸς ὑγείαν προσφέρονται· ποθεινὴ δέ ἐστι πᾶσι, καὶ περίδοξος, καί περ οὖσα τῇ ῥώμῃ ἀσθενής, τὴν σοφίαν τιμήσασα προήχθη. Ἕως τίνος, ὦ ὀκνηρέ, κατάκεισαι; πότε δὲ ἐξ ὕπνου ἐγερθήσῃ; Ὀλίγον μὲν ὑπνοῖς ὀλίγον δὲ κάθησαι, μικρὸν δὲ νυστάζεις, ὀλίγον δὲ ἐναγκαλίζῃ χερσὶ στήθη, εἴτʼ ἐμπαραγίνεταί σοι, ὥσπερ κακὸς ὁδοιπόρος, ἡ πενία, καὶ ἡ ἔνδεια, ὥσπερ ἀγαθὸς δρομεύς. Ἐὰν δὲ ἄοκνος ἦς, ἥξει ὥσπερ πηγὴ ὁ ἀμητός σου, ἡ δὲ ἔνδεια, ὥσπερ κακὸς δρομεὺς ἀπαυτομολήσει. Ἀνὴρ ἄφρων καὶ παράνομος πορεύεται ὁδοὺς οὐκ ἀγαθάς, ὁ δʼ αὐτὸς ἐννεύει ὀφθαλμῷ, σημαίνει δὲ ποδί, διδάσκει δὲ νεύμασι δακτύλων. Διεστραμμένη καρδία τεκταίνεται κακά, ἐν παντὶ καιρῷ ὁ τοιοῦτος ταραχὰς συνίστησι πόλει. Διὰ τοῦτο ἐξαπίνης ἔρχεται ἡ ἀπώλεια αὐτοῦ, διακοπὴ καὶ συντριβὴ ἀνίατος, ὅτι χαίρει ἐπὶ πᾶσιν, οἷς μισεῖ ὁ Κύριος, συντρίβεται δὲ διʼ ἀκαθαρσίαν ψυχῆς. Ὀφθαλμὸς ὑβριστοῦ, γλῶσσα ἄδικος, χεῖρες ἐκχέουσαι αἷμα δικαίου, καὶ καρδία τεκταινομένη λογισμοὺς κακούς, καὶ πόδες ἐπισπεύδοντες κακοποιεῖν, ἐξολοθρευθήσονται. Ἐκκαίει ψευδῆ μάρτυς ἄδικος, καὶ ἐπιπέμπει κρίσεις ἀνὰ μέσον ἀδελφῶν. Υἱέ, φύλασσε νόμους πατρός σου, καὶ μὴ ἀπώσῃ θεσμοὺς μητρός σου.
ltx/gr_gr_cog/le.pr.tr.d034:lemcVE.reading2.title	
ltx/gr_gr_cog/le.pr.tr.d034:lemcVE.reading2.title_abbr	
ltx/gr_gr_cog/le.pr.tr.d034:lemcVE.reading2.version	@ltx/gr_gr_cog/properties:version.designation
