ltx/gr_gr_cog/me.m12.d21:meCO.C1.acrostic.notice1	οὗ ἡ Ἀκροστιχίς·
ltx/gr_gr_cog/me.m12.d21:meCO.C1.acrostic.text	Τρίτῃ τε.
ltx/gr_gr_cog/me.m12.d21:meCO.C1.acrostic.title	Διῴδιον,
ltx/gr_gr_cog/me.m12.d21:meCO.C1.title	Κανὼν Διῴδιον Προεόρτιον.
ltx/gr_gr_cog/me.m12.d21:meCO.C1.verse	@ltx/gr_gr_cog/prayers:pr.verse_God.text
ltx/gr_gr_cog/me.m12.d21:meCO.Ode8C11.incipit	Ῥαθυμίας ὕπνον ἀφʼ ἡμῶν, βαλώμεθα…
ltx/gr_gr_cog/me.m12.d21:meCO.Ode8C11.melody	@ltx/gr_gr_cog/he.h.m2:heHE.ToDogmatiToTyranniko.name
ltx/gr_gr_cog/me.m12.d21:meCO.Ode8C11.mode	@ltx/gr_gr_cog/miscellanea:misc.Mode2
ltx/gr_gr_cog/me.m12.d21:meCO.Ode8C11.ode	@ltx/gr_gr_cog/miscellanea:misc.Ode8
ltx/gr_gr_cog/me.m12.d21:meCO.Ode8C11.text	Ῥαθυμίας ὕπνον ἀφʼ ἡμῶν, βαλώμεθα, καὶ ψυχῶν ἐγρηγόρσει, τῷ τικτομένῳ ἐκ Κόρης ἁγνῆς, Χριστῷ ἀναμέλψωμεν· Εὐλογεῖτε τὰ ἔργα, Κυρίου τὸν Κύριον.
ltx/gr_gr_cog/me.m12.d21:meCO.Ode8C12.incipit	Ἱκανούσθω πρᾶξις ἀγαθή, ἡμῶν τῷ…
ltx/gr_gr_cog/me.m12.d21:meCO.Ode8C12.melody	@ltx/gr_gr_cog/he.h.m2:heHE.ToDogmatiToTyranniko.name
ltx/gr_gr_cog/me.m12.d21:meCO.Ode8C12.mode	@ltx/gr_gr_cog/miscellanea:misc.Mode2
ltx/gr_gr_cog/me.m12.d21:meCO.Ode8C12.ode	@ltx/gr_gr_cog/miscellanea:misc.Ode8
ltx/gr_gr_cog/me.m12.d21:meCO.Ode8C12.text	Ἱκανούσθω πρᾶξις ἀγαθή, ἡμῶν τῷ τῆς ψυχῆς ταμείῳ, ὅπως φαιδρῷ τῷ προσώπῳ, Χριστῷ τικτομένῳ ψάλλωμεν·Εὐλογεῖτε τὰ ἔργα, Κυρίου τὸν Κύριον.
ltx/gr_gr_cog/me.m12.d21:meCO.Ode8C13.incipit	Τὸ τάλαντον ἔργοις ἀγαθοῖς, αὐξήσαντες…
ltx/gr_gr_cog/me.m12.d21:meCO.Ode8C13.melody	@ltx/gr_gr_cog/he.h.m2:heHE.ToDogmatiToTyranniko.name
ltx/gr_gr_cog/me.m12.d21:meCO.Ode8C13.mode	@ltx/gr_gr_cog/miscellanea:misc.Mode2
ltx/gr_gr_cog/me.m12.d21:meCO.Ode8C13.ode	@ltx/gr_gr_cog/miscellanea:misc.Ode8
ltx/gr_gr_cog/me.m12.d21:meCO.Ode8C13.text	Τὸ τάλαντον ἔργοις ἀγαθοῖς, αὐξήσαντες, ὥσπερ δῶρα τῷ δόντι, ἀντὶ χρυσοῦ καὶ λιβάνου Χριστῷ, καὶ σμύρνης προσάξωμεν, ἐρχομένῳ τεχθῆναι, ἐκ Κόρης θεόπαιδος.
ltx/gr_gr_cog/me.m12.d21:meCO.Ode8C1H.incipit	@ltx/gr_gr_cog/he.h.m2:heHE.ToDogmatiToTyranniko.incipit
ltx/gr_gr_cog/me.m12.d21:meCO.Ode8C1H.melody	@ltx/gr_gr_cog/he.h.m2:heHE.ToDogmatiToTyranniko.melody
ltx/gr_gr_cog/me.m12.d21:meCO.Ode8C1H.mode	@ltx/gr_gr_cog/miscellanea:misc.Mode2
ltx/gr_gr_cog/me.m12.d21:meCO.Ode8C1H.ode	@ltx/gr_gr_cog/miscellanea:misc.Ode8
ltx/gr_gr_cog/me.m12.d21:meCO.Ode8C1H.text	@ltx/gr_gr_cog/he.h.m2:heHE.ToDogmatiToTyranniko.text
ltx/gr_gr_cog/me.m12.d21:meCO.Ode9C11.incipit	Τοῖς ἐπιγνώμοσι Χριστός, γρηγορεῖν ἐντέταλται…
ltx/gr_gr_cog/me.m12.d21:meCO.Ode9C11.melody	@ltx/gr_gr_cog/he.h.m2:heHE.ITonAchoritonTheon.name
ltx/gr_gr_cog/me.m12.d21:meCO.Ode9C11.mode	@ltx/gr_gr_cog/miscellanea:misc.Mode2
ltx/gr_gr_cog/me.m12.d21:meCO.Ode9C11.ode	@ltx/gr_gr_cog/miscellanea:misc.Ode9
ltx/gr_gr_cog/me.m12.d21:meCO.Ode9C11.text	Τοῖς ἐπιγνώμοσι Χριστός, γρηγορεῖν ἐντέταλται, τὴν αὐτοῦ ἐλπίζουσιν ἔλευσιν, ἐκ Παρθένου· καὶ γὰρ ἥκει τεχθῆναι.
ltx/gr_gr_cog/me.m12.d21:meCO.Ode9C12.incipit	Ἐν τῇ δευτέρᾳ σου Χριστέ…
ltx/gr_gr_cog/me.m12.d21:meCO.Ode9C12.melody	@ltx/gr_gr_cog/he.h.m2:heHE.ITonAchoritonTheon.name
ltx/gr_gr_cog/me.m12.d21:meCO.Ode9C12.mode	@ltx/gr_gr_cog/miscellanea:misc.Mode2
ltx/gr_gr_cog/me.m12.d21:meCO.Ode9C12.ode	@ltx/gr_gr_cog/miscellanea:misc.Ode9
ltx/gr_gr_cog/me.m12.d21:meCO.Ode9C12.text	Ἐν τῇ δευτέρᾳ σου Χριστέ, ἐνδημίᾳ σύσκηνον, δεξιοῖς με δεῖξον προβάτοις σου, σὴν τιμῶντα, ἐν σαρκὶ παρουσίαν.
ltx/gr_gr_cog/me.m12.d21:meCO.Ode9C13.incipit	Ἐν τῇ προτέρᾳ σου Χριστέ…
ltx/gr_gr_cog/me.m12.d21:meCO.Ode9C13.melody	@ltx/gr_gr_cog/he.h.m2:heHE.ITonAchoritonTheon.name
ltx/gr_gr_cog/me.m12.d21:meCO.Ode9C13.mode	@ltx/gr_gr_cog/miscellanea:misc.Mode2
ltx/gr_gr_cog/me.m12.d21:meCO.Ode9C13.ode	@ltx/gr_gr_cog/miscellanea:misc.Ode9
ltx/gr_gr_cog/me.m12.d21:meCO.Ode9C13.text	Ἐν τῇ προτέρᾳ σου Χριστέ, παρουσίᾳ ἔσωσας, τὸν Ἀδάμ, ἀλλʼ ἐν τῇ δευτέρᾳ σου, τοὺς τιμῶντας, τὴν σὴν Γέννησιν σῷζε.
ltx/gr_gr_cog/me.m12.d21:meCO.Ode9C1H.incipit	@ltx/gr_gr_cog/he.h.m2:heHE.ITonAchoritonTheon.incipit
ltx/gr_gr_cog/me.m12.d21:meCO.Ode9C1H.melody	@ltx/gr_gr_cog/he.h.m2:heHE.ITonAchoritonTheon.melody
ltx/gr_gr_cog/me.m12.d21:meCO.Ode9C1H.mode	@ltx/gr_gr_cog/miscellanea:misc.Mode2
ltx/gr_gr_cog/me.m12.d21:meCO.Ode9C1H.ode	@ltx/gr_gr_cog/miscellanea:misc.Ode9
ltx/gr_gr_cog/me.m12.d21:meCO.Ode9C1H.text	@ltx/gr_gr_cog/he.h.m2:heHE.ITonAchoritonTheon.text
ltx/gr_gr_cog/me.m12.d21:meDA.commemoration.first	Μνήμη τῆς Ἁγίας Μάρτυρος Ἰουλιανῆς
ltx/gr_gr_cog/me.m12.d21:meDA.commemoration.first_name	
ltx/gr_gr_cog/me.m12.d21:meDA.commemoration.first_short	Μνήμη τῆς Ἁγίας Μάρτυρος Ἰουλιανῆς
ltx/gr_gr_cog/me.m12.d21:meDA.commemoration.first_title	@ltx/gr_gr_cog/titles:ti.SaintW
ltx/gr_gr_cog/me.m12.d21:meDA.commemoration.full	Μνήμη τῆς Ἁγίας Μάρτυρος Ἰουλιανῆς, τῆς ἐν Νικομηδείᾳ
ltx/gr_gr_cog/me.m12.d21:meDA.commemoration.second_name	
ltx/gr_gr_cog/me.m12.d21:meDA.commemoration.second_title	
ltx/gr_gr_cog/me.m12.d21:meDA.date	Τῌ ΚΑʹ ΔΕΚΕΜΒΡΙΟΥ
ltx/gr_gr_cog/me.m12.d21:meDA.fordate	διὰ τὴν 21ην Δεκεμβρίου
ltx/gr_gr_cog/me.m12.d21:meDA.insert1	καὶ τῆς Ἁγίας Μάρτυρος Ἰουλιανῆς, τῆς ἐν Νικομηδείᾳ,
ltx/gr_gr_cog/me.m12.d21:meDA.insert2	ἧς καὶ τὴν μνήμην ἐπιτελοῦμεν·
ltx/gr_gr_cog/me.m12.d21:meDA.note	
ltx/gr_gr_cog/me.m12.d21:meDA.pdfcoverdate	τῆς 21ης Δεκεμβρίου,
ltx/gr_gr_cog/me.m12.d21:meDA.pdfheaderdate	τῆς 21ης Δεκεμβρίου
ltx/gr_gr_cog/me.m12.d21:meHO.commemorations	
ltx/gr_gr_cog/me.m12.d21:meHO.note1	
ltx/gr_gr_cog/me.m12.d21:meHO.note2	
ltx/gr_gr_cog/me.m12.d21:meHO.number	
ltx/gr_gr_cog/me.m12.d21:meHO.rank	
ltx/gr_gr_cog/me.m12.d21:meLE.commemoration1	Μνήμη τῆς Ἁγίας Μάρτυρος Ἰουλιανῆς, τῆς ἐν Νικομηδείᾳ.
ltx/gr_gr_cog/me.m12.d21:meLE.commemoration2	
ltx/gr_gr_cog/me.m12.d21:meLI.Kontakion1.greekmelody	@ltx/gr_gr_cog/me.m12.d21:meMA.Kontakion1.greekmelody
ltx/gr_gr_cog/me.m12.d21:meLI.Kontakion1.incipit	@ltx/gr_gr_cog/me.m12.d21:meMA.Kontakion1.incipit
ltx/gr_gr_cog/me.m12.d21:meLI.Kontakion1.melody	@ltx/gr_gr_cog/me.m12.d21:meMA.Kontakion1.melody
ltx/gr_gr_cog/me.m12.d21:meLI.Kontakion1.mode	@ltx/gr_gr_cog/me.m12.d21:meMA.Kontakion1.mode
ltx/gr_gr_cog/me.m12.d21:meLI.Kontakion1.text	@ltx/gr_gr_cog/me.m12.d21:meMA.Kontakion1.text
ltx/gr_gr_cog/me.m12.d21:meLI.Megalynarion.text	
ltx/gr_gr_cog/me.m12.d21:meMA.AposGlory.incipit	Δεῦτε οἱ γηγενεῖς, συμφώνως τὴν…
ltx/gr_gr_cog/me.m12.d21:meMA.AposGlory.melody	@ltx/gr_gr_cog/he.a.m2:heAU.OikosTouEfratha.name
ltx/gr_gr_cog/me.m12.d21:meMA.AposGlory.mode	@ltx/gr_gr_cog/miscellanea:misc.Mode2
ltx/gr_gr_cog/me.m12.d21:meMA.AposGlory.text	Δεῦτε οἱ γηγενεῖς, συμφώνως τὴν Παρθένον, Θεοτόκον Μαρίαν, ὑμνήσωμεν ἀπαύστως, ἐξ ἧς ὁ Χριστὸς τίκτεται.
ltx/gr_gr_cog/me.m12.d21:meMA.Aposticha1.greekmelody	@ltx/gr_gr_cog/he.a.m2:heAU.OikosTouEfratha.greekname
ltx/gr_gr_cog/me.m12.d21:meMA.Aposticha1.incipit	Προλάμπει ὁ ἀστήρ, ἤδη ἐν…
ltx/gr_gr_cog/me.m12.d21:meMA.Aposticha1.melody	@ltx/gr_gr_cog/he.a.m2:heAU.OikosTouEfratha.name
ltx/gr_gr_cog/me.m12.d21:meMA.Aposticha1.mode	@ltx/gr_gr_cog/miscellanea:misc.Mode2
ltx/gr_gr_cog/me.m12.d21:meMA.Aposticha1.text	Προλάμπει ὁ ἀστήρ, ἤδη ἐν τῷ Σπηλαίῳ· Ποιμένες μέτʼ Ἀγγέλων, οἱ Μάγοι μετὰ δώρων, προφθάσαι εὐτρεπίσθητε.
ltx/gr_gr_cog/me.m12.d21:meMA.Aposticha2.incipit	Ἵνα τῶν Προφητῶν, πληρώσῃ τὰς…
ltx/gr_gr_cog/me.m12.d21:meMA.Aposticha2.melody	@ltx/gr_gr_cog/he.a.m2:heAU.OikosTouEfratha.name
ltx/gr_gr_cog/me.m12.d21:meMA.Aposticha2.mode	@ltx/gr_gr_cog/miscellanea:misc.Mode2
ltx/gr_gr_cog/me.m12.d21:meMA.Aposticha2.text	Ἵνα τῶν Προφητῶν, πληρώσῃ τὰς προῤῥήσεις, ἐν Βηθλεὲμ γεννᾶται, καὶ τὴν Ἐδὲμ ἀνοίγει, τοῖς ἐξ Ἀδὰμ ὁ Κύριος.
ltx/gr_gr_cog/me.m12.d21:meMA.Aposticha3.incipit	Μύρισον Βηθλεέμ, τὴν Φάτνην τὴν…
ltx/gr_gr_cog/me.m12.d21:meMA.Aposticha3.melody	@ltx/gr_gr_cog/he.a.m2:heAU.OikosTouEfratha.name
ltx/gr_gr_cog/me.m12.d21:meMA.Aposticha3.mode	@ltx/gr_gr_cog/miscellanea:misc.Mode2
ltx/gr_gr_cog/me.m12.d21:meMA.Aposticha3.text	Μύρισον Βηθλεέμ, τὴν Φάτνην τὴν ἁγίαν· ἐν σοὶ γὰρ ὁ Δεσπότης, προσεφαπλοῖ ἀκτῖνας, τῆς ἑαυτοῦ Θεότητος.
ltx/gr_gr_cog/me.m12.d21:meMA.C1.acrostic.notice1	οὗ ἡ Ἀκροστιχὶς κατὰ ἀλφάβητον.
ltx/gr_gr_cog/me.m12.d21:meMA.C1.acrostic.title	Κανὼν ὁ Προεόρτιος,
ltx/gr_gr_cog/me.m12.d21:meMA.C1.poet	@ltx/gr_gr_cog/poets:po.Iosif
ltx/gr_gr_cog/me.m12.d21:meMA.C1.title	@ltx/gr_gr_cog/titles:ti.CanonForefeast
ltx/gr_gr_cog/me.m12.d21:meMA.C1.verse	@ltx/gr_gr_cog/prayers:pr.verse_God.text
ltx/gr_gr_cog/me.m12.d21:meMA.C2.acrostic.notice1	οὗ ἡ Ἀκροστιχίς·
ltx/gr_gr_cog/me.m12.d21:meMA.C2.acrostic.text	Μέλπειν σε Μάρτυς προσθέτω Θεὸς χάριν. Ἰωσήφ.
ltx/gr_gr_cog/me.m12.d21:meMA.C2.acrostic.title	Ἕτερος Κανὼν τῆς Ἁγίας,
ltx/gr_gr_cog/me.m12.d21:meMA.C2.title	@ltx/gr_gr_cog/titles:ti.CanonSaintW
ltx/gr_gr_cog/me.m12.d21:meMA.C2.verse	@ltx/gr_gr_cog/prayers:pr.verse_SaintW.text
ltx/gr_gr_cog/me.m12.d21:meMA.Exaposteilarion1.greekmelody	@ltx/gr_gr_cog/he.a.m3:heAU.TonNymfonaSouVlepo.greekname
ltx/gr_gr_cog/me.m12.d21:meMA.Exaposteilarion1.incipit	Τὸν νυμφῶνά σου Λόγε…
ltx/gr_gr_cog/me.m12.d21:meMA.Exaposteilarion1.melody	@ltx/gr_gr_cog/he.a.m3:heAU.TonNymfonaSouVlepo.name
ltx/gr_gr_cog/me.m12.d21:meMA.Exaposteilarion1.mode	@ltx/gr_gr_cog/miscellanea:misc.Mode3
ltx/gr_gr_cog/me.m12.d21:meMA.Exaposteilarion1.text	Τὸν νυμφῶνά σου Λόγε, ἡ Μάρτυς ἐπιποθοῦσα, βασάνων ἅπασαν πεῖραν, στεῤῥῶς ὑπέστη ῥοπῇ σου· Ἧς πρεσβείαις ὡς Θεός, δέομαί σου, τὴν ψυχήν μου οἰκτείρησον.
ltx/gr_gr_cog/me.m12.d21:meMA.Exaposteilarion2.greekmelody	@ltx/gr_gr_cog/he.a.m3:heAU.TonNymfonaSouVlepo.greekname
ltx/gr_gr_cog/me.m12.d21:meMA.Exaposteilarion2.incipit	Βηθλεὲμ γῆ Ἰούδα…
ltx/gr_gr_cog/me.m12.d21:meMA.Exaposteilarion2.melody	@ltx/gr_gr_cog/he.a.m3:heAU.TonNymfonaSouVlepo.name
ltx/gr_gr_cog/me.m12.d21:meMA.Exaposteilarion2.mode	@ltx/gr_gr_cog/miscellanea:misc.Mode3
ltx/gr_gr_cog/me.m12.d21:meMA.Exaposteilarion2.text	Βηθλεὲμ γῆ Ἰούδα, εὐτρέπισον τὰς εἰσόδους· ἐν σοὶ γὰρ ἡ Παρθένος, καὶ Θεοτόκος ἥκει νῦν, ἐν Σπηλαίῳ τοῦ τεκεῖν, ὡς βροτόν, τὸν Θεόν μου καὶ Κύριον.
ltx/gr_gr_cog/me.m12.d21:meMA.Kathisma11.greekmelody	
ltx/gr_gr_cog/me.m12.d21:meMA.Kathisma11.incipit	Ὁ ἀπρόσιτος Θεός, διʼ εὐσπλαγχνίαν…
ltx/gr_gr_cog/me.m12.d21:meMA.Kathisma11.melody	Ὁ εὐσχήμων Ἰωσήφ.
ltx/gr_gr_cog/me.m12.d21:meMA.Kathisma11.mode	@ltx/gr_gr_cog/miscellanea:misc.Mode2
ltx/gr_gr_cog/me.m12.d21:meMA.Kathisma11.text	Ὁ ἀπρόσιτος Θεός, διʼ εὐσπλαγχνίαν προσιτός, γενόμενός μοι θέλων, προέρχεται σαρκί, γεννηθῆναι ὡς ἄνθρωπος, ἐν πόλει Βηθλεέμ, ἐκ Παρθένου νεάνιδος, ὃν ὑποδέξασθαι προθύμως σπουδάσωμεν, ἀνακράζοντες φόβῳ· Κύριε δόξα σοι.
ltx/gr_gr_cog/me.m12.d21:meMA.Kathisma21.greekmelody	@ltx/gr_gr_cog/he.a.m3:heAU.TinOraiotita.greekname
ltx/gr_gr_cog/me.m12.d21:meMA.Kathisma21.incipit	Θαῦμα παράδοξον, ὁρᾶται σήμερον! ὁ…
ltx/gr_gr_cog/me.m12.d21:meMA.Kathisma21.melody	@ltx/gr_gr_cog/he.a.m3:heAU.TinOraiotita.name
ltx/gr_gr_cog/me.m12.d21:meMA.Kathisma21.mode	@ltx/gr_gr_cog/miscellanea:misc.Mode3
ltx/gr_gr_cog/me.m12.d21:meMA.Kathisma21.text	Θαῦμα παράδοξον, ὁρᾶται σήμερον! ὁ γὰρ Σωτὴρ ἡμῶν, ἐν τῷ σπηλαίῳ σαρκί, ἐκ τῆς Παρθένου διʼ ἡμᾶς, τεχθῆναι νῦν ἐπείγεται, Μάγοι μετὰ δώρων δέ, ὡς βασιλεῖ προσκυνήσουσι, Ποιμένες τε καὶ Ἄγγελοι, αὐτὸν δοξολογήσουσι, μεθʼ ὧν καὶ ἡμεῖς βοῶμεν· Δόξα τῷ διʼ ἡμᾶς ἐνανθρωπήσαντι.
ltx/gr_gr_cog/me.m12.d21:meMA.Kontakion1.greekmelody	@ltx/gr_gr_cog/he.a.m2:heAU.TaAnoZiton.greekname
ltx/gr_gr_cog/me.m12.d21:meMA.Kontakion1.incipit	Ἐν τῇ Βηθλεέμ ὁρῶντες…
ltx/gr_gr_cog/me.m12.d21:meMA.Kontakion1.melody	@ltx/gr_gr_cog/he.a.m2:heAU.TaAnoZiton.name
ltx/gr_gr_cog/me.m12.d21:meMA.Kontakion1.mode	@ltx/gr_gr_cog/miscellanea:misc.Mode2
ltx/gr_gr_cog/me.m12.d21:meMA.Kontakion1.text	Ἐν τῇ Βηθλεέμ, ὁρῶντες σπαργανούμενον, τὸν πᾶσαν τὴν γῆν, κρατοῦντα τῇ χειρὶ αὐτοῦ, προεόρτια ᾄσματα, τῇ Τεκούσῃ τοῦτον προσενέγκωμεν· μητρικῶς γὰρ εὐφραίνεται, κρατοῦσα ἐν κόλποις τὸν Υἱὸν τοῦ Θεοῦ.
ltx/gr_gr_cog/me.m12.d21:meMA.Lauds1.greekmelody	@ltx/gr_gr_cog/he.a.m6:heAU.AiAngelikai.greekname
ltx/gr_gr_cog/me.m12.d21:meMA.Lauds1.incipit	Ἡ δημιουργός, νῦν προέρχεται Σοφία…
ltx/gr_gr_cog/me.m12.d21:meMA.Lauds1.melody	@ltx/gr_gr_cog/he.a.m6:heAU.AiAngelikai.name
ltx/gr_gr_cog/me.m12.d21:meMA.Lauds1.mode	@ltx/gr_gr_cog/miscellanea:misc.Mode6
ltx/gr_gr_cog/me.m12.d21:meMA.Lauds1.text	Ἡ δημιουργός, νῦν προέρχεται Σοφία, αἱ προφητικαί, διανίσχουσι νεφέλαι, ἡ χάρις αἰθριάζει, ἡ ἀλήθεια ἔλαμψε, παύεται αἰνίγματα σκιώδη, ἡ τῆς Ἐδὲμ ἠνοίγη πύλη, Ἀδὰμ χόρευε, ὁ πλαστουργὸς Θεὸς ἡμῶν, ἑκὼν πεπλαστούργηται.
ltx/gr_gr_cog/me.m12.d21:meMA.Lauds2.incipit	Θεσπίσματα πληρῶν, Προφητῶν καὶ τὰς…
ltx/gr_gr_cog/me.m12.d21:meMA.Lauds2.melody	@ltx/gr_gr_cog/he.a.m6:heAU.AiAngelikai.name
ltx/gr_gr_cog/me.m12.d21:meMA.Lauds2.mode	@ltx/gr_gr_cog/miscellanea:misc.Mode6
ltx/gr_gr_cog/me.m12.d21:meMA.Lauds2.text	Θεσπίσματα πληρῶν, Προφητῶν καὶ τὰς ὁράσεις, τίκτεται σαρκί, καὶ παχύνεται ὁ Λόγος, καὶ φάτνῃ τῶν ἀλόγων, γεννηθεὶς ἀνακλίνεται. Τοῦτο συγκατάβασις ἡ ἄκρα! τοῦτο ἡ φρικτὴ οἰκονομία! διʼ ἣν ψάλλομεν· Ὁ Βασιλεὺς τοῦ Ἰσραήλ, Χριστὸς παραγίνεται.
ltx/gr_gr_cog/me.m12.d21:meMA.Lauds3.incipit	Ἵνα τῆς φθορᾶς, τὸν ἰὸν…
ltx/gr_gr_cog/me.m12.d21:meMA.Lauds3.melody	@ltx/gr_gr_cog/he.a.m6:heAU.AiAngelikai.name
ltx/gr_gr_cog/me.m12.d21:meMA.Lauds3.mode	@ltx/gr_gr_cog/miscellanea:misc.Mode6
ltx/gr_gr_cog/me.m12.d21:meMA.Lauds3.text	Ἵνα τῆς φθορᾶς, τὸν ἰὸν ἀποκαθάρῃς, καὶ τὴν ἀρχικήν, ἀναπλάσῃς μοι εἰκόνα, σαρκοῦσαι καὶ θηλάζεις, καὶ σπαργάνοις ὁ νεύματι, πάντα περιάγων ἐνειλίσσῃ, τερατουργὲ ὑμνῶ σε Λόγε, βουλῆς Ἄγγελε, τῆς πατρικῆς, διʼ ἧς ἐγώ, ἀπαθανατίζομαι.
ltx/gr_gr_cog/me.m12.d21:meMA.Lauds4.greekmelody	@ltx/gr_gr_cog/he.a.m6:heAU.AiAngelikai.greekname
ltx/gr_gr_cog/me.m12.d21:meMA.Lauds4.incipit	Κόλπων Πατρικῶν, οὐκ ἐκστὰς βροτὸς…
ltx/gr_gr_cog/me.m12.d21:meMA.Lauds4.melody	@ltx/gr_gr_cog/he.a.m6:heAU.AiAngelikai.name
ltx/gr_gr_cog/me.m12.d21:meMA.Lauds4.mode	@ltx/gr_gr_cog/miscellanea:misc.Mode6
ltx/gr_gr_cog/me.m12.d21:meMA.Lauds4.text	Κόλπων Πατρικῶν, οὐκ ἐκστὰς βροτὸς ὡράθης, καὶ Παρθενικαῖς, ἐποχούμενος ὠλέναις, τοὺς Μάγους ἐκ Περσίδος, διʼ ἀστέρος ἐκάλεσας, ἄνακτα Θεόν σε προσκυνοῦντας· πνεύματι χειλέων ἀσεβοῦντας, ἐθνῶν ἄρχοντας, ὃς ἀνελεῖς, καὶ ποιμανεῖς, λαὸν περιούσιον.
ltx/gr_gr_cog/me.m12.d21:meMA.LaudsBoth.incipit	Μάντεως χρησμοί, Βαλαὰμ ἀποπληροῦνται· οἱ…
ltx/gr_gr_cog/me.m12.d21:meMA.LaudsBoth.melody	@ltx/gr_gr_cog/he.a.m6:heAU.AiAngelikai.name
ltx/gr_gr_cog/me.m12.d21:meMA.LaudsBoth.mode	@ltx/gr_gr_cog/miscellanea:misc.Mode6
ltx/gr_gr_cog/me.m12.d21:meMA.LaudsBoth.text	Μάντεως χρησμοί, Βαλαὰμ ἀποπληροῦνται· οἱ γὰρ Περσικαῖς, τερατείαις κεχηνότες, ἀστέρος ἀσυνήθους, τῇ ἐλλάμψει τὸν ἄδυτον, Ἥλιον Χριστὸν καταυγασθέντες, ἐν Βηθλεὲμ σωματωθέντα, Θεὸν ἄνακτα, καὶ ἐθελούσιον νεκρόν, τοῖς δώροις τεκμαίρονται.
ltx/gr_gr_cog/me.m12.d21:meMA.LaudsGlory.incipit	Λόγος ὁ Πατρί, ὁμοούσιος ὑπάρχων…
ltx/gr_gr_cog/me.m12.d21:meMA.LaudsGlory.melody	@ltx/gr_gr_cog/he.a.m6:heAU.AiAngelikai.name
ltx/gr_gr_cog/me.m12.d21:meMA.LaudsGlory.mode	@ltx/gr_gr_cog/miscellanea:misc.Mode6
ltx/gr_gr_cog/me.m12.d21:meMA.LaudsGlory.text	Λόγος ὁ Πατρί, ὁμοούσιος ὑπάρχων, ἐκ παρθενικῶν, φυραθεὶς ἁγνῶν αἱμάτων, καὶ πλάττεται καὶ αὔξει, χρονικῷ διαστήματι, αὖθίς τε γεννᾶται ἐν Σπηλαίῳ, ἔκπληξις! ἀλλʼ Ἄγγελοι κροτοῦσι, βροτοὶ μέλπουσιν· Ὁ Βασιλεὺς τοῦ Ἰσραήλ, Χριστὸς παραγίνεται.
ltx/gr_gr_cog/me.m12.d21:meMA.Ode1C11.greekmelody	@ltx/gr_gr_cog/he.h.m4:heHE.TristatasKrataious.greekname
ltx/gr_gr_cog/me.m12.d21:meMA.Ode1C11.incipit	Ἀγάλλου οὐρανέ, καὶ ἡ γῆ…
ltx/gr_gr_cog/me.m12.d21:meMA.Ode1C11.melody	@ltx/gr_gr_cog/he.h.m4:heHE.TristatasKrataious.name
ltx/gr_gr_cog/me.m12.d21:meMA.Ode1C11.mode	@ltx/gr_gr_cog/miscellanea:misc.Mode4
ltx/gr_gr_cog/me.m12.d21:meMA.Ode1C11.ode	@ltx/gr_gr_cog/miscellanea:misc.Ode1
ltx/gr_gr_cog/me.m12.d21:meMA.Ode1C11.text	Ἀγάλλου οὐρανέ, καὶ ἡ γῆ εὐφραινέσθω· ὁ Θεὸς γὰρ μεθʼ ἡμῶν, γενόμενος σαρκί, ἐκ Παρθένου νεάνιδος, τίκτεται καὶ σπαργανοῦται, τὰς σειρὰς διαλύει δέ, τῶν ἐμῶν ἐγκλημάτων ὡς εὔσπλαγχνος.
ltx/gr_gr_cog/me.m12.d21:meMA.Ode1C12.incipit	Βασίλισσα ἁγνή, Βασιλέα τῶν ὅλων…
ltx/gr_gr_cog/me.m12.d21:meMA.Ode1C12.melody	@ltx/gr_gr_cog/he.h.m4:heHE.TristatasKrataious.name
ltx/gr_gr_cog/me.m12.d21:meMA.Ode1C12.mode	@ltx/gr_gr_cog/miscellanea:misc.Mode4
ltx/gr_gr_cog/me.m12.d21:meMA.Ode1C12.ode	@ltx/gr_gr_cog/miscellanea:misc.Ode1
ltx/gr_gr_cog/me.m12.d21:meMA.Ode1C12.text	Βασίλισσα ἁγνή, Βασιλέα τῶν ὅλων, ἀποτίκτει ὑπὲρ νοῦν, τὸν ἄνω τοῖς πιστοῖς, βασιλείαν ἀνοίγοντα, καὶ τὴν ἐν ἡμῖν ἀθλίως, βασιλεύουσαν πάντοτε, ἁμαρτίαν τελείως ἐξαίροντα.
ltx/gr_gr_cog/me.m12.d21:meMA.Ode1C13.incipit	Γραφαὶ προφητικαί, περαιοῦνται· Ἰδοὺ γάρ…
ltx/gr_gr_cog/me.m12.d21:meMA.Ode1C13.melody	@ltx/gr_gr_cog/he.h.m4:heHE.TristatasKrataious.name
ltx/gr_gr_cog/me.m12.d21:meMA.Ode1C13.mode	@ltx/gr_gr_cog/miscellanea:misc.Mode4
ltx/gr_gr_cog/me.m12.d21:meMA.Ode1C13.ode	@ltx/gr_gr_cog/miscellanea:misc.Ode1
ltx/gr_gr_cog/me.m12.d21:meMA.Ode1C13.text	Γραφαὶ προφητικαί, περαιοῦνται· Ἰδοὺ γάρ, ὃν προήγγειλαν Χριστόν, ἐν πόλει Βηθλεέμ, φανεροῦται σαρκούμενος· τούτου νῦν προεορτάσαι, τα Γενέθλια σπεύσωμεν, διανοίας εὐθύτητι σήμερον.
ltx/gr_gr_cog/me.m12.d21:meMA.Ode1C1H.greekmelody	@ltx/gr_gr_cog/he.h.m4:heHE.TristatasKrataious.greekname
ltx/gr_gr_cog/me.m12.d21:meMA.Ode1C1H.incipit	@ltx/gr_gr_cog/he.h.m4:heHE.TristatasKrataious.incipit
ltx/gr_gr_cog/me.m12.d21:meMA.Ode1C1H.melody	@ltx/gr_gr_cog/he.h.m4:heHE.TristatasKrataious.melody
ltx/gr_gr_cog/me.m12.d21:meMA.Ode1C1H.mode	@ltx/gr_gr_cog/miscellanea:misc.Mode4
ltx/gr_gr_cog/me.m12.d21:meMA.Ode1C1H.ode	@ltx/gr_gr_cog/miscellanea:misc.Ode1
ltx/gr_gr_cog/me.m12.d21:meMA.Ode1C1H.text	@ltx/gr_gr_cog/he.h.m4:heHE.TristatasKrataious.text
ltx/gr_gr_cog/me.m12.d21:meMA.Ode1C21.greekmelody	@ltx/gr_gr_cog/he.h.m4:heHE.ThalassisToErythraion.greekname
ltx/gr_gr_cog/me.m12.d21:meMA.Ode1C21.incipit	Μαρτύρων, περιφανῶς λαμπρότησι, περιαστράπτουσα, περὶ…
ltx/gr_gr_cog/me.m12.d21:meMA.Ode1C21.melody	@ltx/gr_gr_cog/he.h.m4:heHE.ThalassisToErythraion.name
ltx/gr_gr_cog/me.m12.d21:meMA.Ode1C21.mode	@ltx/gr_gr_cog/miscellanea:misc.Mode4
ltx/gr_gr_cog/me.m12.d21:meMA.Ode1C21.ode	@ltx/gr_gr_cog/miscellanea:misc.Ode1
ltx/gr_gr_cog/me.m12.d21:meMA.Ode1C21.text	Μαρτύρων, περιφανῶς λαμπρότησι, περιαστράπτουσα, περὶ Θεὸν χορεύεις ἱερῶς, θεουμένη Πανεύφημε, καὶ φωτισμὸν πρεσβείαις σου, παρεχομένη τοῖς ὑμνοῦσί σε.
ltx/gr_gr_cog/me.m12.d21:meMA.Ode1C22.incipit	Ἐτρώθης, τῷ γλυκυτάτῳ ἔρωτι, Χριστοῦ…
ltx/gr_gr_cog/me.m12.d21:meMA.Ode1C22.melody	@ltx/gr_gr_cog/he.h.m4:heHE.ThalassisToErythraion.name
ltx/gr_gr_cog/me.m12.d21:meMA.Ode1C22.mode	@ltx/gr_gr_cog/miscellanea:misc.Mode4
ltx/gr_gr_cog/me.m12.d21:meMA.Ode1C22.ode	@ltx/gr_gr_cog/miscellanea:misc.Ode1
ltx/gr_gr_cog/me.m12.d21:meMA.Ode1C22.text	Ἐτρώθης, τῷ γλυκυτάτῳ ἔρωτι, Χριστοῦ πανεύφημε, καὶ σαρκικὰς λιποῦσα ἡδονάς, καὶ μνηστῆρα ἐπίκηρον, κατεγγυήθης ἄμωμος, Ἁγνὴ Παρθένος τῷ Νυμφίῳ σου.
ltx/gr_gr_cog/me.m12.d21:meMA.Ode1C23.incipit	Λαμπρύνας, φωτοφανέσι κάλλεσι, τὴν σὴν…
ltx/gr_gr_cog/me.m12.d21:meMA.Ode1C23.melody	@ltx/gr_gr_cog/he.h.m4:heHE.ThalassisToErythraion.name
ltx/gr_gr_cog/me.m12.d21:meMA.Ode1C23.mode	@ltx/gr_gr_cog/miscellanea:misc.Mode4
ltx/gr_gr_cog/me.m12.d21:meMA.Ode1C23.ode	@ltx/gr_gr_cog/miscellanea:misc.Ode1
ltx/gr_gr_cog/me.m12.d21:meMA.Ode1C23.text	Λαμπρύνας, φωτοφανέσι κάλλεσι, τὴν σὴν διάνοιαν, ὁ Πλαστουργὸς τῶν ὅλων καὶ Θεός, οὐρανίων θαλάμων σε, παρθενικῶς χορεύουσαν, Μάρτυς θεόφρον κατηξίωσε.
ltx/gr_gr_cog/me.m12.d21:meMA.Ode1C2T.incipit	Παρθένος, τὸν Πλαστουργὸν τῆς φύσεως…
ltx/gr_gr_cog/me.m12.d21:meMA.Ode1C2T.melody	@ltx/gr_gr_cog/he.h.m4:heHE.ThalassisToErythraion.name
ltx/gr_gr_cog/me.m12.d21:meMA.Ode1C2T.mode	@ltx/gr_gr_cog/miscellanea:misc.Mode4
ltx/gr_gr_cog/me.m12.d21:meMA.Ode1C2T.ode	@ltx/gr_gr_cog/miscellanea:misc.Ode1
ltx/gr_gr_cog/me.m12.d21:meMA.Ode1C2T.text	Παρθένος, τὸν Πλαστουργὸν τῆς φύσεως, τεκεῖν ἐπείγεται, ἐν τῷ Σπηλαίῳ σάρκα ἐξ αὐτῆς, καθʼ ὑπόστασιν ἄῤῥητον, ὑπερφυῶς φορέσαντα, ὅπως θεώσῃ τὸ ἀνθρώπινον.
ltx/gr_gr_cog/me.m12.d21:meMA.Ode3C11.greekmelody	@ltx/gr_gr_cog/he.h.m4:heHE.OtiSteiraEteken.greekname
ltx/gr_gr_cog/me.m12.d21:meMA.Ode3C11.incipit	Δανιὴλ ἐξ ὄρους σε…
ltx/gr_gr_cog/me.m12.d21:meMA.Ode3C11.melody	@ltx/gr_gr_cog/he.h.m4:heHE.OtiSteiraEteken.name
ltx/gr_gr_cog/me.m12.d21:meMA.Ode3C11.mode	@ltx/gr_gr_cog/miscellanea:misc.Mode4
ltx/gr_gr_cog/me.m12.d21:meMA.Ode3C11.ode	@ltx/gr_gr_cog/miscellanea:misc.Ode3
ltx/gr_gr_cog/me.m12.d21:meMA.Ode3C11.text	Δανιὴλ ἐξ ὄρους σε, παρθενικοῦ λίθον Λόγε, ἀποτμηθέντα βλέπει, ἐκλεπτύνοντα βωμούς, εἰδωλικοὺς τῷ κράτει σου· διὰ τοῦτο φόβῳ σε δοξάζομεν.
ltx/gr_gr_cog/me.m12.d21:meMA.Ode3C12.incipit	Ἐξ Ἑῴας Μάγοι σε…
ltx/gr_gr_cog/me.m12.d21:meMA.Ode3C12.melody	@ltx/gr_gr_cog/he.h.m4:heHE.OtiSteiraEteken.name
ltx/gr_gr_cog/me.m12.d21:meMA.Ode3C12.mode	@ltx/gr_gr_cog/miscellanea:misc.Mode4
ltx/gr_gr_cog/me.m12.d21:meMA.Ode3C12.ode	@ltx/gr_gr_cog/miscellanea:misc.Ode3
ltx/gr_gr_cog/me.m12.d21:meMA.Ode3C12.text	Ἐξ Ἑῴας Μάγοι σε, τῷ Βασιλεῖ τῶν ἁπάντων, ὁδηγηθέντες ἄστρῳ, δῶρα προσάγουσι Χριστέ, σμύρναν χρυσὸν καὶ λίβανον, ἐκπλαγέντες τὴν σὴν συγκατάβασιν.
ltx/gr_gr_cog/me.m12.d21:meMA.Ode3C13.incipit	Ζωηφόρον ἄσταχυν…
ltx/gr_gr_cog/me.m12.d21:meMA.Ode3C13.melody	@ltx/gr_gr_cog/he.h.m4:heHE.OtiSteiraEteken.name
ltx/gr_gr_cog/me.m12.d21:meMA.Ode3C13.mode	@ltx/gr_gr_cog/miscellanea:misc.Mode4
ltx/gr_gr_cog/me.m12.d21:meMA.Ode3C13.ode	@ltx/gr_gr_cog/miscellanea:misc.Ode3
ltx/gr_gr_cog/me.m12.d21:meMA.Ode3C13.text	Ζωηφόρον ἄσταχυν, χώρα ἀνήροτος φέρει, ἀποτεκεῖν ἐν πόλει, τῆς Βηθλεὲμ ἡ Μαριάμ, πάντων ψυχὰς ἐκτρέφοντα, τῶν βοώντων· Ἅγιος εἶ Κύριε.
ltx/gr_gr_cog/me.m12.d21:meMA.Ode3C1H.greekmelody	@ltx/gr_gr_cog/he.h.m4:heHE.OtiSteiraEteken.greekname
ltx/gr_gr_cog/me.m12.d21:meMA.Ode3C1H.incipit	@ltx/gr_gr_cog/he.h.m4:heHE.OtiSteiraEteken.incipit
ltx/gr_gr_cog/me.m12.d21:meMA.Ode3C1H.melody	@ltx/gr_gr_cog/he.h.m4:heHE.OtiSteiraEteken.melody
ltx/gr_gr_cog/me.m12.d21:meMA.Ode3C1H.mode	@ltx/gr_gr_cog/miscellanea:misc.Mode4
ltx/gr_gr_cog/me.m12.d21:meMA.Ode3C1H.ode	@ltx/gr_gr_cog/miscellanea:misc.Ode3
ltx/gr_gr_cog/me.m12.d21:meMA.Ode3C1H.text	@ltx/gr_gr_cog/he.h.m4:heHE.OtiSteiraEteken.text
ltx/gr_gr_cog/me.m12.d21:meMA.Ode3C21.greekmelody	@ltx/gr_gr_cog/he.h.m4:heHE.EffrainetaiEpiSoi.greekname
ltx/gr_gr_cog/me.m12.d21:meMA.Ode3C21.incipit	Ἐτέλεσας τὴν ψυχήν, ναὸν πανάγιον…
ltx/gr_gr_cog/me.m12.d21:meMA.Ode3C21.melody	@ltx/gr_gr_cog/he.h.m4:heHE.EffrainetaiEpiSoi.name
ltx/gr_gr_cog/me.m12.d21:meMA.Ode3C21.mode	@ltx/gr_gr_cog/miscellanea:misc.Mode4
ltx/gr_gr_cog/me.m12.d21:meMA.Ode3C21.ode	@ltx/gr_gr_cog/miscellanea:misc.Ode3
ltx/gr_gr_cog/me.m12.d21:meMA.Ode3C21.text	Ἐτέλεσας τὴν ψυχήν, ναὸν πανάγιον Θεοῦ Ἔνδοξε, θείοις ναοῖς πάντοτε, ὕμνοις καὶ εὐχαῖς παρεδρεύουσα.
ltx/gr_gr_cog/me.m12.d21:meMA.Ode3C22.incipit	Μεγίστων ἐπιτυχεῖν, ἐφιεμένη δωρεῶν Πάνσεμνε…
ltx/gr_gr_cog/me.m12.d21:meMA.Ode3C22.melody	@ltx/gr_gr_cog/he.h.m4:heHE.EffrainetaiEpiSoi.name
ltx/gr_gr_cog/me.m12.d21:meMA.Ode3C22.mode	@ltx/gr_gr_cog/miscellanea:misc.Mode4
ltx/gr_gr_cog/me.m12.d21:meMA.Ode3C22.ode	@ltx/gr_gr_cog/miscellanea:misc.Ode3
ltx/gr_gr_cog/me.m12.d21:meMA.Ode3C22.text	Μεγίστων ἐπιτυχεῖν, ἐφιεμένη δωρεῶν Πάνσεμνε, πόνους σαρκὸς ἔφερες, ὡς ἐν ἀλλοτρίῳ τῷ σώματι.
ltx/gr_gr_cog/me.m12.d21:meMA.Ode3C23.incipit	Αἱμάτων σου σταλαγμοῖς, τῆς ἀθεΐας…
ltx/gr_gr_cog/me.m12.d21:meMA.Ode3C23.melody	@ltx/gr_gr_cog/he.h.m4:heHE.EffrainetaiEpiSoi.name
ltx/gr_gr_cog/me.m12.d21:meMA.Ode3C23.mode	@ltx/gr_gr_cog/miscellanea:misc.Mode4
ltx/gr_gr_cog/me.m12.d21:meMA.Ode3C23.ode	@ltx/gr_gr_cog/miscellanea:misc.Ode3
ltx/gr_gr_cog/me.m12.d21:meMA.Ode3C23.text	Αἱμάτων σου σταλαγμοῖς, τῆς ἀθεΐας τὴν πυρὰν ἔσβεσας, καὶ τῶν πιστῶν ἤρδευσας, Ἰουλιανὴ τὰ φρονήματα.
ltx/gr_gr_cog/me.m12.d21:meMA.Ode3C2T.incipit	Ῥυόμενος τοὺς βροτούς, ὁ συμπαθὴς…
ltx/gr_gr_cog/me.m12.d21:meMA.Ode3C2T.melody	@ltx/gr_gr_cog/he.h.m4:heHE.EffrainetaiEpiSoi.name
ltx/gr_gr_cog/me.m12.d21:meMA.Ode3C2T.mode	@ltx/gr_gr_cog/miscellanea:misc.Mode4
ltx/gr_gr_cog/me.m12.d21:meMA.Ode3C2T.ode	@ltx/gr_gr_cog/miscellanea:misc.Ode3
ltx/gr_gr_cog/me.m12.d21:meMA.Ode3C2T.text	Ῥυόμενος τοὺς βροτούς, ὁ συμπαθὴς ἐκ τῆς ἁγνῆς τίκτεται, ἐν Βηθλεὲμ σπάργανα, νήπιον καθάπερ δεχόμενος.
ltx/gr_gr_cog/me.m12.d21:meMA.Ode3H.greekmelody	@ltx/gr_gr_cog/he.h.m4:heHE.EffrainetaiEpiSoi.greekname
ltx/gr_gr_cog/me.m12.d21:meMA.Ode3H.incipit	@ltx/gr_gr_cog/he.h.m4:heHE.EffrainetaiEpiSoi.incipit
ltx/gr_gr_cog/me.m12.d21:meMA.Ode3H.melody	@ltx/gr_gr_cog/he.h.m4:heHE.EffrainetaiEpiSoi.melody
ltx/gr_gr_cog/me.m12.d21:meMA.Ode3H.mode	@ltx/gr_gr_cog/miscellanea:misc.Mode4
ltx/gr_gr_cog/me.m12.d21:meMA.Ode3H.ode	@ltx/gr_gr_cog/miscellanea:misc.Ode3
ltx/gr_gr_cog/me.m12.d21:meMA.Ode3H.text	@ltx/gr_gr_cog/he.h.m4:heHE.EffrainetaiEpiSoi.text
ltx/gr_gr_cog/me.m12.d21:meMA.Ode3Kathisma1.greekmelody	@ltx/gr_gr_cog/he.a.m3:heAU.TinOraiotita.greekname
ltx/gr_gr_cog/me.m12.d21:meMA.Ode3Kathisma1.incipit	Χαρᾶς ἐμπλήσθητε, πάντα τὰ πέρατα…
ltx/gr_gr_cog/me.m12.d21:meMA.Ode3Kathisma1.melody	@ltx/gr_gr_cog/he.a.m3:heAU.TinOraiotita.name
ltx/gr_gr_cog/me.m12.d21:meMA.Ode3Kathisma1.mode	@ltx/gr_gr_cog/miscellanea:misc.Mode3
ltx/gr_gr_cog/me.m12.d21:meMA.Ode3Kathisma1.text	Χαρᾶς ἐμπλήσθητε, πάντα τὰ πέρατα· ἡ Θεοτόκος γάρ, τεκεῖν ἐπείγεται, τὸν Βασιλέα τοῦ παντός, ὢ θαύματος ἀνεκφράστου! ἄρχεται ὁ Ἄναρχος, καὶ σαρκοῦται ὁ Ἄσαρκος Σπήλαιον εἰσδέχεται, τὸν συνέχοντα ἅπαντα. Ἡ Βηθλεὲμ ἀγάλλου, καὶ χόρευε ἡ κτίσις, ἡμέραν προεόρτιον.
ltx/gr_gr_cog/me.m12.d21:meMA.Ode3Kathisma2.greekmelody	@ltx/gr_gr_cog/he.a.m4:heAU.OYpsotheisEnToStavro.greekname
ltx/gr_gr_cog/me.m12.d21:meMA.Ode3Kathisma2.incipit	Πεποικιλμένη ἀρεταῖς θεοσδότοις, διηνθισμένη τῷ…
ltx/gr_gr_cog/me.m12.d21:meMA.Ode3Kathisma2.melody	@ltx/gr_gr_cog/he.a.m4:heAU.OYpsotheisEnToStavro.name
ltx/gr_gr_cog/me.m12.d21:meMA.Ode3Kathisma2.mode	@ltx/gr_gr_cog/miscellanea:misc.Mode4
ltx/gr_gr_cog/me.m12.d21:meMA.Ode3Kathisma2.text	Πεποικιλμένη ἀρεταῖς θεοσδότοις, διηνθισμένη τῷ σεπτῷ μαρτυρίῳ, ὅλη καλὴ καὶ ἄμωμος ὡράθης σεμνή· ὅθεν σου ὁ Κύριος, νῦν ἠράσθη τοῦ κάλλους, καὶ πρὸς φωτεινότατον, σὲ νυμφῶνα εἰσῆξεν, ἐν ᾧ χορεύεις, Ἰουλιανή, μετὰ Μαρτύρων Χριστὸν μεγαλύνουσα.
ltx/gr_gr_cog/me.m12.d21:meMA.Ode3Kathisma3.greekmelody	@ltx/gr_gr_cog/he.a.m4:heAU.TachyProkatalave.greekname
ltx/gr_gr_cog/me.m12.d21:meMA.Ode3Kathisma3.incipit	Παρθένοι προεξάρξατε, τῇ τῆς Παρθένου…
ltx/gr_gr_cog/me.m12.d21:meMA.Ode3Kathisma3.melody	@ltx/gr_gr_cog/he.a.m4:heAU.TachyProkatalave.name
ltx/gr_gr_cog/me.m12.d21:meMA.Ode3Kathisma3.mode	@ltx/gr_gr_cog/miscellanea:misc.Mode4
ltx/gr_gr_cog/me.m12.d21:meMA.Ode3Kathisma3.text	Παρθένοι προεξάρξατε, τῇ τῆς Παρθένου χαρᾷ, Μητέρες αἰνέσατε, τὴν προπομπὴν τῆς Μητρός, Χριστοῦ τοῦ Θεοῦ ἡμῶν, Μάγοι σὺν τοῖς Ἀγγέλοις, σὺν ἡμῖν οἱ Ποιμένες· ἔρχεται γὰρ ἐν πόλει, Βηθλεὲμ τοῦ γεννῆσαι, υἱὸν τὸν πρὸ αἰώνων Θεόν, σῴζοντα κόσμον φθορᾶς.
ltx/gr_gr_cog/me.m12.d21:meMA.Ode4C11.greekmelody	@ltx/gr_gr_cog/he.h.m4:heHE.OKathimenosEnDoxi.greekname
ltx/gr_gr_cog/me.m12.d21:meMA.Ode4C11.incipit	Ἡ ἁγία μυροθήκη, τοῦ σεπτοῦ…
ltx/gr_gr_cog/me.m12.d21:meMA.Ode4C11.melody	@ltx/gr_gr_cog/he.h.m4:heHE.OKathimenosEnDoxi.name
ltx/gr_gr_cog/me.m12.d21:meMA.Ode4C11.mode	@ltx/gr_gr_cog/miscellanea:misc.Mode4
ltx/gr_gr_cog/me.m12.d21:meMA.Ode4C11.ode	@ltx/gr_gr_cog/miscellanea:misc.Ode4
ltx/gr_gr_cog/me.m12.d21:meMA.Ode4C11.text	Ἡ ἁγία μυροθήκη, τοῦ σεπτοῦ ἁγιάσματος, Βηθλεὲμ ἐν πόλει, τοῦτο ἐκκενῶσαι προέρχεται, ἁγιασμὸν ἡμῖν πᾶσι παρεχόμενον, τοῖς κραυγάζουσι· Δόξα Χριστὲ τῇ δυνάμει σου.
ltx/gr_gr_cog/me.m12.d21:meMA.Ode4C12.incipit	Θεηγόρε Ἠσαΐα, τὰ σεπτά σου…
ltx/gr_gr_cog/me.m12.d21:meMA.Ode4C12.melody	@ltx/gr_gr_cog/he.h.m4:heHE.OKathimenosEnDoxi.name
ltx/gr_gr_cog/me.m12.d21:meMA.Ode4C12.mode	@ltx/gr_gr_cog/miscellanea:misc.Mode4
ltx/gr_gr_cog/me.m12.d21:meMA.Ode4C12.ode	@ltx/gr_gr_cog/miscellanea:misc.Ode4
ltx/gr_gr_cog/me.m12.d21:meMA.Ode4C12.text	Θεηγόρε Ἠσαΐα, τὰ σεπτά σου κηρύγματα, γεγονότα βλέπων, πράγματα ἀγάλλου καὶ χόρευε· ἡ γὰρ Παρθένος ἀσπόρως ἀπεκύησεν, ἐν Σπηλαίῳ σαρκί, Βηθλεὲμ τὸν ἀχώρητον.
ltx/gr_gr_cog/me.m12.d21:meMA.Ode4C13.incipit	Ἰησοῦς σαρκὶ γεννᾶται, καὶ ἐν…
ltx/gr_gr_cog/me.m12.d21:meMA.Ode4C13.melody	@ltx/gr_gr_cog/he.h.m4:heHE.OKathimenosEnDoxi.name
ltx/gr_gr_cog/me.m12.d21:meMA.Ode4C13.mode	@ltx/gr_gr_cog/miscellanea:misc.Mode4
ltx/gr_gr_cog/me.m12.d21:meMA.Ode4C13.ode	@ltx/gr_gr_cog/miscellanea:misc.Ode4
ltx/gr_gr_cog/me.m12.d21:meMA.Ode4C13.text	Ἰησοῦς σαρκὶ γεννᾶται, καὶ ἐν χρόνῳ ὁ Ἄχρονος, καθορᾶται βρέφος, λύων μου τὰ χρόνια πταίσματα, καὶ τῇ ἀφάτῳ πτωχείᾳ πλουτίζει με, τὸν πτωχεύσαντα, φθοροποιαῖς παραβάσεσι.
ltx/gr_gr_cog/me.m12.d21:meMA.Ode4C1H.greekmelody	@ltx/gr_gr_cog/he.h.m4:heHE.OKathimenosEnDoxi.greekname
ltx/gr_gr_cog/me.m12.d21:meMA.Ode4C1H.incipit	@ltx/gr_gr_cog/he.h.m4:heHE.OKathimenosEnDoxi.incipit
ltx/gr_gr_cog/me.m12.d21:meMA.Ode4C1H.melody	@ltx/gr_gr_cog/he.h.m4:heHE.OKathimenosEnDoxi.melody
ltx/gr_gr_cog/me.m12.d21:meMA.Ode4C1H.mode	@ltx/gr_gr_cog/miscellanea:misc.Mode4
ltx/gr_gr_cog/me.m12.d21:meMA.Ode4C1H.ode	@ltx/gr_gr_cog/miscellanea:misc.Ode4
ltx/gr_gr_cog/me.m12.d21:meMA.Ode4C1H.text	@ltx/gr_gr_cog/he.h.m4:heHE.OKathimenosEnDoxi.text
ltx/gr_gr_cog/me.m12.d21:meMA.Ode4C21.greekmelody	@ltx/gr_gr_cog/he.h.m4:heHE.EparthentaSeIdousa.greekname
ltx/gr_gr_cog/me.m12.d21:meMA.Ode4C21.incipit	Τεταμένην τὴν διάνοιαν κεκτημένη, πρὸς…
ltx/gr_gr_cog/me.m12.d21:meMA.Ode4C21.melody	@ltx/gr_gr_cog/he.h.m4:heHE.EparthentaSeIdousa.name
ltx/gr_gr_cog/me.m12.d21:meMA.Ode4C21.mode	@ltx/gr_gr_cog/miscellanea:misc.Mode4
ltx/gr_gr_cog/me.m12.d21:meMA.Ode4C21.ode	@ltx/gr_gr_cog/miscellanea:misc.Ode4
ltx/gr_gr_cog/me.m12.d21:meMA.Ode4C21.text	Τεταμένην τὴν διάνοιαν κεκτημένη, πρὸς τὸν τῶν ὅλων Κύριον, σαρκὸς τεταμένης, καὶ μαστιζομένης δεινῶς, οὐδόλως ἐφρόντισας, Ἰουλιανὴ καλλιπάρθενε.
ltx/gr_gr_cog/me.m12.d21:meMA.Ode4C22.incipit	Ὑπερίσχυσαν οἱ ἔρωτες τοῦ Δεσπότου…
ltx/gr_gr_cog/me.m12.d21:meMA.Ode4C22.melody	@ltx/gr_gr_cog/he.h.m4:heHE.EparthentaSeIdousa.name
ltx/gr_gr_cog/me.m12.d21:meMA.Ode4C22.mode	@ltx/gr_gr_cog/miscellanea:misc.Mode4
ltx/gr_gr_cog/me.m12.d21:meMA.Ode4C22.ode	@ltx/gr_gr_cog/miscellanea:misc.Ode4
ltx/gr_gr_cog/me.m12.d21:meMA.Ode4C22.text	Ὑπερίσχυσαν οἱ ἔρωτες τοῦ Δεσπότου, τοὺς τῆς σαρκὸς πανεύφημε, Μάρτυς ἀμαυρῶσαι· ὅθεν κατεφρόνησας, καὶ πλούτου καὶ μνήστορος, καὶ πολυτρόπων κολάσεων.
ltx/gr_gr_cog/me.m12.d21:meMA.Ode4C23.incipit	Σὲ τὴν ἄσπιλον ἀμνάδα καθάπερ…
ltx/gr_gr_cog/me.m12.d21:meMA.Ode4C23.melody	@ltx/gr_gr_cog/he.h.m4:heHE.EparthentaSeIdousa.name
ltx/gr_gr_cog/me.m12.d21:meMA.Ode4C23.mode	@ltx/gr_gr_cog/miscellanea:misc.Mode4
ltx/gr_gr_cog/me.m12.d21:meMA.Ode4C23.ode	@ltx/gr_gr_cog/miscellanea:misc.Ode4
ltx/gr_gr_cog/me.m12.d21:meMA.Ode4C23.text	Σὲ τὴν ἄσπιλον ἀμνάδα καθάπερ λύκοι, οἱ δυσμενεῖς σπαράττοντες, Μάρτυς ταῖς αἰκίαις, ἄμωμον ὁλόκληρον, Θεοῦ ἀπετέλεσαν, θεῖον ἱερεῖον καὶ σφάγιον.
ltx/gr_gr_cog/me.m12.d21:meMA.Ode4C2T.incipit	Παρθενίαν μετὰ τόκον ἐσφραγισμένην, ἡ…
ltx/gr_gr_cog/me.m12.d21:meMA.Ode4C2T.melody	@ltx/gr_gr_cog/he.h.m4:heHE.EparthentaSeIdousa.name
ltx/gr_gr_cog/me.m12.d21:meMA.Ode4C2T.mode	@ltx/gr_gr_cog/miscellanea:misc.Mode4
ltx/gr_gr_cog/me.m12.d21:meMA.Ode4C2T.ode	@ltx/gr_gr_cog/miscellanea:misc.Ode4
ltx/gr_gr_cog/me.m12.d21:meMA.Ode4C2T.text	Παρθενίαν μετὰ τόκον ἐσφραγισμένην, ἡ Θεοτόκος βλέπουσα, θάμβει συσχεθεῖσα, Τέκνον ἀνεκραύγαζε· πῶς νῦν σπαργανώσω σε, ψάμμῳ σπαργανοῦντα τὴν θάλασσαν.
ltx/gr_gr_cog/me.m12.d21:meMA.Ode5C11.greekmelody	@ltx/gr_gr_cog/he.h.m4:heHE.AseveisOukOpsontai.greekname
ltx/gr_gr_cog/me.m12.d21:meMA.Ode5C11.incipit	Κόρης ἀποτίκτεται, Θεὸς Ἐμμανουήλ, καὶ…
ltx/gr_gr_cog/me.m12.d21:meMA.Ode5C11.melody	@ltx/gr_gr_cog/he.h.m4:heHE.AseveisOukOpsontai.name
ltx/gr_gr_cog/me.m12.d21:meMA.Ode5C11.mode	@ltx/gr_gr_cog/miscellanea:misc.Mode4
ltx/gr_gr_cog/me.m12.d21:meMA.Ode5C11.ode	@ltx/gr_gr_cog/miscellanea:misc.Ode5
ltx/gr_gr_cog/me.m12.d21:meMA.Ode5C11.text	Κόρης ἀποτίκτεται, Θεὸς Ἐμμανουήλ, καὶ ἐν φάτνῃ ἀνακλιθείς, τὴν ἡμῶν ἀνάκλησιν, θέλων ἐργάζεται· τούτου τὰ Γενέθλια, εὐσεβῶς προεορτάσωμεν.
ltx/gr_gr_cog/me.m12.d21:meMA.Ode5C12.incipit	Λόγος ὢν προάναρχος, Πατρὸς καὶ…
ltx/gr_gr_cog/me.m12.d21:meMA.Ode5C12.melody	@ltx/gr_gr_cog/he.h.m4:heHE.AseveisOukOpsontai.name
ltx/gr_gr_cog/me.m12.d21:meMA.Ode5C12.mode	@ltx/gr_gr_cog/miscellanea:misc.Mode4
ltx/gr_gr_cog/me.m12.d21:meMA.Ode5C12.ode	@ltx/gr_gr_cog/miscellanea:misc.Ode5
ltx/gr_gr_cog/me.m12.d21:meMA.Ode5C12.text	Λόγος ὢν προάναρχος, Πατρὸς καὶ συμφυής, ἐπὶ φάτνης ἀνακλιθείς, τῶν ἀλόγων ἔλυσας, τῆς ἀλογίας ἡμᾶς, τοὺς προεορτάζοντας, εὐσεβῶς τὰ σὰ Γενέθλια.
ltx/gr_gr_cog/me.m12.d21:meMA.Ode5C13.incipit	Μακαρία πέφυκεν, ἡ ῥίζα Ἰεσσαί…
ltx/gr_gr_cog/me.m12.d21:meMA.Ode5C13.melody	@ltx/gr_gr_cog/he.h.m4:heHE.AseveisOukOpsontai.name
ltx/gr_gr_cog/me.m12.d21:meMA.Ode5C13.mode	@ltx/gr_gr_cog/miscellanea:misc.Mode4
ltx/gr_gr_cog/me.m12.d21:meMA.Ode5C13.ode	@ltx/gr_gr_cog/miscellanea:misc.Ode5
ltx/gr_gr_cog/me.m12.d21:meMA.Ode5C13.text	Μακαρία πέφυκεν, ἡ ῥίζα Ἰεσσαί, ἐκβλαστήσασα τὴν ἁγνήν, ἄνθος θεῖον φέρουσαν, Χριστὸν τὸν Κύριον, οὗ προερτάσωμεν, τὰ Γενέθλια γηθόμενοι.
ltx/gr_gr_cog/me.m12.d21:meMA.Ode5C1H.greekmelody	@ltx/gr_gr_cog/he.h.m4:heHE.AseveisOukOpsontai.greekname
ltx/gr_gr_cog/me.m12.d21:meMA.Ode5C1H.incipit	@ltx/gr_gr_cog/he.h.m4:heHE.AseveisOukOpsontai.incipit
ltx/gr_gr_cog/me.m12.d21:meMA.Ode5C1H.melody	@ltx/gr_gr_cog/he.h.m4:heHE.AseveisOukOpsontai.melody
ltx/gr_gr_cog/me.m12.d21:meMA.Ode5C1H.mode	@ltx/gr_gr_cog/miscellanea:misc.Mode4
ltx/gr_gr_cog/me.m12.d21:meMA.Ode5C1H.ode	@ltx/gr_gr_cog/miscellanea:misc.Ode5
ltx/gr_gr_cog/me.m12.d21:meMA.Ode5C1H.text	@ltx/gr_gr_cog/he.h.m4:heHE.AseveisOukOpsontai.text
ltx/gr_gr_cog/me.m12.d21:meMA.Ode5C21.greekmelody	@ltx/gr_gr_cog/he.h.m4:heHE.SyKyrieMouFos.greekname
ltx/gr_gr_cog/me.m12.d21:meMA.Ode5C21.incipit	Ῥοῦν μάρτυς δυσσεβοῦς, ἀθεΐας ἐξήρανας…
ltx/gr_gr_cog/me.m12.d21:meMA.Ode5C21.melody	@ltx/gr_gr_cog/he.h.m4:heHE.SyKyrieMouFos.name
ltx/gr_gr_cog/me.m12.d21:meMA.Ode5C21.mode	@ltx/gr_gr_cog/miscellanea:misc.Mode4
ltx/gr_gr_cog/me.m12.d21:meMA.Ode5C21.ode	@ltx/gr_gr_cog/miscellanea:misc.Ode5
ltx/gr_gr_cog/me.m12.d21:meMA.Ode5C21.text	Ῥοῦν μάρτυς δυσσεβοῦς, ἀθεΐας ἐξήρανας, τοῖς ῥεύμασι τῶν αἱμάτων, τῶν ἀδίκως χυθέντων, καὶ πῦρ ἁπάσης ἔσβεσας.
ltx/gr_gr_cog/me.m12.d21:meMA.Ode5C22.incipit	Ὁλόκληρον σαυτήν, τῷ Θεῷ προσενήνοχας…
ltx/gr_gr_cog/me.m12.d21:meMA.Ode5C22.melody	@ltx/gr_gr_cog/he.h.m4:heHE.SyKyrieMouFos.name
ltx/gr_gr_cog/me.m12.d21:meMA.Ode5C22.mode	@ltx/gr_gr_cog/miscellanea:misc.Mode4
ltx/gr_gr_cog/me.m12.d21:meMA.Ode5C22.ode	@ltx/gr_gr_cog/miscellanea:misc.Ode5
ltx/gr_gr_cog/me.m12.d21:meMA.Ode5C22.text	Ὁλόκληρον σαυτήν, τῷ Θεῷ προσενήνοχας, ἐρύθημα παρθενίας, ταῖς βαφαῖς τῶν αἱμάτων, λαμπρότερον τελέσασα.
ltx/gr_gr_cog/me.m12.d21:meMA.Ode5C23.incipit	Σῷ κάλλει τὴν ψυχήν, τετρωμένη…
ltx/gr_gr_cog/me.m12.d21:meMA.Ode5C23.melody	@ltx/gr_gr_cog/he.h.m4:heHE.SyKyrieMouFos.name
ltx/gr_gr_cog/me.m12.d21:meMA.Ode5C23.mode	@ltx/gr_gr_cog/miscellanea:misc.Mode4
ltx/gr_gr_cog/me.m12.d21:meMA.Ode5C23.ode	@ltx/gr_gr_cog/miscellanea:misc.Ode5
ltx/gr_gr_cog/me.m12.d21:meMA.Ode5C23.text	Σῷ κάλλει τὴν ψυχήν, τετρωμένη παρέδραμεν, ὦ Δέσποτα ἡ Παρθένος, τὰ ὁρώμενα κάλλη, ἀθλήσει διαλάμπουσα.
ltx/gr_gr_cog/me.m12.d21:meMA.Ode5C2T.incipit	Θαῦμα καινοπρεπές! ἡ Παρθένος ἐπείγεται…
ltx/gr_gr_cog/me.m12.d21:meMA.Ode5C2T.melody	@ltx/gr_gr_cog/he.h.m4:heHE.SyKyrieMouFos.name
ltx/gr_gr_cog/me.m12.d21:meMA.Ode5C2T.mode	@ltx/gr_gr_cog/miscellanea:misc.Mode4
ltx/gr_gr_cog/me.m12.d21:meMA.Ode5C2T.ode	@ltx/gr_gr_cog/miscellanea:misc.Ode5
ltx/gr_gr_cog/me.m12.d21:meMA.Ode5C2T.text	Θαῦμα καινοπρεπές! ἡ Παρθένος ἐπείγεται, ἡ Ἄχραντος ἐν Σπηλαίῳ, Βηθλεὲμ τοῦ κυῆσαι, Θεὸν ἐνανθρωπήσαντα.
ltx/gr_gr_cog/me.m12.d21:meMA.Ode6C11.greekmelody	@ltx/gr_gr_cog/he.h.m4:heHE.IlthonEisTaVathi.greekname
ltx/gr_gr_cog/me.m12.d21:meMA.Ode6C11.incipit	Νέον ἐπὶ γῆς ἡμῖν Παιδίον…
ltx/gr_gr_cog/me.m12.d21:meMA.Ode6C11.melody	@ltx/gr_gr_cog/he.h.m4:heHE.IlthonEisTaVathi.name
ltx/gr_gr_cog/me.m12.d21:meMA.Ode6C11.mode	@ltx/gr_gr_cog/miscellanea:misc.Mode4
ltx/gr_gr_cog/me.m12.d21:meMA.Ode6C11.ode	@ltx/gr_gr_cog/miscellanea:misc.Ode6
ltx/gr_gr_cog/me.m12.d21:meMA.Ode6C11.text	Νέον ἐπὶ γῆς ἡμῖν Παιδίον, τεχθεὶς ὁ πρὸ αἰώνων, ἐκ Πατρὸς ἀῤῥήτως ἀναλάμψας, τῆς παλαιᾶς, πάντας ἠλευθέρωσε, παραβάσεως ὡς εὔσπλαγχνος.
ltx/gr_gr_cog/me.m12.d21:meMA.Ode6C12.incipit	Ξένα καὶ παράδοξα ἠκούσθη, ἐν…
ltx/gr_gr_cog/me.m12.d21:meMA.Ode6C12.melody	@ltx/gr_gr_cog/he.h.m4:heHE.IlthonEisTaVathi.name
ltx/gr_gr_cog/me.m12.d21:meMA.Ode6C12.mode	@ltx/gr_gr_cog/miscellanea:misc.Mode4
ltx/gr_gr_cog/me.m12.d21:meMA.Ode6C12.ode	@ltx/gr_gr_cog/miscellanea:misc.Ode6
ltx/gr_gr_cog/me.m12.d21:meMA.Ode6C12.text	Ξένα καὶ παράδοξα ἠκούσθη, ἐν Βηθλεὲμ τῇ πόλει, γεννηθέντος σου ἄναρχε Λόγε· Ποιμένες γάρ, μετʼ Ἀγγέλων ὕμνον σοι, ὡς Δεσπότῃ προσεκόμιζον.
ltx/gr_gr_cog/me.m12.d21:meMA.Ode6C13.incipit	Ὁ ἀστὴρ τὸν τῆς δικαιοσύνης…
ltx/gr_gr_cog/me.m12.d21:meMA.Ode6C13.melody	@ltx/gr_gr_cog/he.h.m4:heHE.IlthonEisTaVathi.name
ltx/gr_gr_cog/me.m12.d21:meMA.Ode6C13.mode	@ltx/gr_gr_cog/miscellanea:misc.Mode4
ltx/gr_gr_cog/me.m12.d21:meMA.Ode6C13.ode	@ltx/gr_gr_cog/miscellanea:misc.Ode6
ltx/gr_gr_cog/me.m12.d21:meMA.Ode6C13.text	Ὁ ἀστὴρ τὸν τῆς δικαιοσύνης, καταμηνύει Μάγοις, ἀποῤῥήτως Ἥλιον τεχθέντα, οὗ τὰ σεπτά, νῦν προεορτάσωμεν, ἀγαλλόμενοι Γενέθλια.
ltx/gr_gr_cog/me.m12.d21:meMA.Ode6C1H.greekmelody	@ltx/gr_gr_cog/he.h.m4:heHE.IlthonEisTaVathi.greekname
ltx/gr_gr_cog/me.m12.d21:meMA.Ode6C1H.incipit	@ltx/gr_gr_cog/he.h.m4:heHE.IlthonEisTaVathi.incipit
ltx/gr_gr_cog/me.m12.d21:meMA.Ode6C1H.melody	@ltx/gr_gr_cog/he.h.m4:heHE.IlthonEisTaVathi.melody
ltx/gr_gr_cog/me.m12.d21:meMA.Ode6C1H.mode	@ltx/gr_gr_cog/miscellanea:misc.Mode4
ltx/gr_gr_cog/me.m12.d21:meMA.Ode6C1H.ode	@ltx/gr_gr_cog/miscellanea:misc.Ode6
ltx/gr_gr_cog/me.m12.d21:meMA.Ode6C1H.text	@ltx/gr_gr_cog/he.h.m4:heHE.IlthonEisTaVathi.text
ltx/gr_gr_cog/me.m12.d21:meMA.Ode6C21.greekmelody	@ltx/gr_gr_cog/he.h.m4:heHE.ThysoSoiMetaFonis.greekname
ltx/gr_gr_cog/me.m12.d21:meMA.Ode6C21.incipit	Ἔρωτι, τετρωμένη τῷ θείῳ ἐκραύγαζες…
ltx/gr_gr_cog/me.m12.d21:meMA.Ode6C21.melody	@ltx/gr_gr_cog/he.h.m4:heHE.ThysoSoiMetaFonis.name
ltx/gr_gr_cog/me.m12.d21:meMA.Ode6C21.mode	@ltx/gr_gr_cog/miscellanea:misc.Mode4
ltx/gr_gr_cog/me.m12.d21:meMA.Ode6C21.ode	@ltx/gr_gr_cog/miscellanea:misc.Ode6
ltx/gr_gr_cog/me.m12.d21:meMA.Ode6C21.text	Ἔρωτι, τετρωμένη τῷ θείῳ ἐκραύγαζες· Χριστὸν ἐπείγομαι φθάσαι, τὸν ὡραῖον κάλλει· ὅθεν βασάνους, ὑπομένω, ἀκλινεῖ γηθομένη φρονήματι.
ltx/gr_gr_cog/me.m12.d21:meMA.Ode6C22.incipit	Τείνεσθαι, ἀνηλεῶς καὶ ῥάβδοις συντρίβεσθαι…
ltx/gr_gr_cog/me.m12.d21:meMA.Ode6C22.melody	@ltx/gr_gr_cog/he.h.m4:heHE.ThysoSoiMetaFonis.name
ltx/gr_gr_cog/me.m12.d21:meMA.Ode6C22.mode	@ltx/gr_gr_cog/miscellanea:misc.Mode4
ltx/gr_gr_cog/me.m12.d21:meMA.Ode6C22.ode	@ltx/gr_gr_cog/miscellanea:misc.Ode6
ltx/gr_gr_cog/me.m12.d21:meMA.Ode6C22.text	Τείνεσθαι, ἀνηλεῶς καὶ ῥάβδοις συντρίβεσθαι, τὴν τοῦ Κυρίου ἀμνάδα, πονηρὸς διώκτης προσέταττε, τεταμένην, πρὸς Χριστὸν τὴν διάνοιαν ἔχουσαν.
ltx/gr_gr_cog/me.m12.d21:meMA.Ode6C23.incipit	Ὤρθρισας, πρὸς Χριστὸν τὸν ἀνέσπερον…
ltx/gr_gr_cog/me.m12.d21:meMA.Ode6C23.melody	@ltx/gr_gr_cog/he.h.m4:heHE.ThysoSoiMetaFonis.name
ltx/gr_gr_cog/me.m12.d21:meMA.Ode6C23.mode	@ltx/gr_gr_cog/miscellanea:misc.Mode4
ltx/gr_gr_cog/me.m12.d21:meMA.Ode6C23.ode	@ltx/gr_gr_cog/miscellanea:misc.Ode6
ltx/gr_gr_cog/me.m12.d21:meMA.Ode6C23.text	Ὤρθρισας, πρὸς Χριστὸν τὸν ἀνέσπερον Ἥλιον, καὶ ταῖς αὐτοῦ φρυκτωρίαις, καὶ ψυχὴν θεόφρον, καὶ τὴν καρδίαν, κατηυγάσθης, καὶ πρὸς φῶς μετετέθης ἀΐδιον.
ltx/gr_gr_cog/me.m12.d21:meMA.Ode6C2T.incipit	Θάλασσαν, σπαργανώσας ὁμίχλῃ βουλήματι, κυοφορεῖται…
ltx/gr_gr_cog/me.m12.d21:meMA.Ode6C2T.melody	@ltx/gr_gr_cog/he.h.m4:heHE.ThysoSoiMetaFonis.name
ltx/gr_gr_cog/me.m12.d21:meMA.Ode6C2T.mode	@ltx/gr_gr_cog/miscellanea:misc.Mode4
ltx/gr_gr_cog/me.m12.d21:meMA.Ode6C2T.ode	@ltx/gr_gr_cog/miscellanea:misc.Ode6
ltx/gr_gr_cog/me.m12.d21:meMA.Ode6C2T.text	Θάλασσαν, σπαργανώσας ὁμίχλῃ βουλήματι, κυοφορεῖται ὁ Κτίστης, ἐκ Παρθένου Κόρης καὶ σπάργανα, ὥσπερ βρέφος, καταδέχεται κόσμον λυτρούμενος.
ltx/gr_gr_cog/me.m12.d21:meMA.Ode6H.greekmelody	@ltx/gr_gr_cog/he.h.m4:heHE.ThysoSoiMetaFonis.greekname
ltx/gr_gr_cog/me.m12.d21:meMA.Ode6H.incipit	@ltx/gr_gr_cog/he.h.m4:heHE.ThysoSoiMetaFonis.incipit
ltx/gr_gr_cog/me.m12.d21:meMA.Ode6H.melody	@ltx/gr_gr_cog/he.h.m4:heHE.ThysoSoiMetaFonis.melody
ltx/gr_gr_cog/me.m12.d21:meMA.Ode6H.mode	@ltx/gr_gr_cog/miscellanea:misc.Mode4
ltx/gr_gr_cog/me.m12.d21:meMA.Ode6H.ode	@ltx/gr_gr_cog/miscellanea:misc.Ode6
ltx/gr_gr_cog/me.m12.d21:meMA.Ode6H.text	@ltx/gr_gr_cog/he.h.m4:heHE.ThysoSoiMetaFonis.text
ltx/gr_gr_cog/me.m12.d21:meMA.Ode7C11.greekmelody	@ltx/gr_gr_cog/he.h.m4:heHE.NeoiTreisEnVavyloni.greekname
ltx/gr_gr_cog/me.m12.d21:meMA.Ode7C11.incipit	Πῶς σε Σπήλαιον χωρήσει, ἐρχόμενον…
ltx/gr_gr_cog/me.m12.d21:meMA.Ode7C11.melody	@ltx/gr_gr_cog/he.h.m4:heHE.NeoiTreisEnVavyloni.name
ltx/gr_gr_cog/me.m12.d21:meMA.Ode7C11.mode	@ltx/gr_gr_cog/miscellanea:misc.Mode4
ltx/gr_gr_cog/me.m12.d21:meMA.Ode7C11.ode	@ltx/gr_gr_cog/miscellanea:misc.Ode7
ltx/gr_gr_cog/me.m12.d21:meMA.Ode7C11.text	Πῶς σε Σπήλαιον χωρήσει, ἐρχόμενον διʼ ἡμᾶς, τεχθῆναι Ἀχώρητε; πῶς σε γαλουχήσει Παρθένος, τροφέα πάντων εὔσπλαγχνε, Ἰησοῦ χρηματίζοντα;
ltx/gr_gr_cog/me.m12.d21:meMA.Ode7C12.incipit	Ῥήμασιν ἀκολουθοῦντες, τοῦ Μάντεως Βαλαάμ…
ltx/gr_gr_cog/me.m12.d21:meMA.Ode7C12.melody	@ltx/gr_gr_cog/he.h.m4:heHE.NeoiTreisEnVavyloni.name
ltx/gr_gr_cog/me.m12.d21:meMA.Ode7C12.mode	@ltx/gr_gr_cog/miscellanea:misc.Mode4
ltx/gr_gr_cog/me.m12.d21:meMA.Ode7C12.ode	@ltx/gr_gr_cog/miscellanea:misc.Ode7
ltx/gr_gr_cog/me.m12.d21:meMA.Ode7C12.text	Ῥήμασιν ἀκολουθοῦντες, τοῦ Μάντεως Βαλαάμ, Μάγοι ἐπισπεύδουσι, Χριστὸν προσκυνῆσαι σὺν δώροις, ἐπεγνωκότες τοῦτον, πάσης πνοῆς βασιλεύοντα.
ltx/gr_gr_cog/me.m12.d21:meMA.Ode7C13.incipit	Στειρεύουσα τῶν ἀνθρώπων, φύσις πάσης…
ltx/gr_gr_cog/me.m12.d21:meMA.Ode7C13.melody	@ltx/gr_gr_cog/he.h.m4:heHE.NeoiTreisEnVavyloni.name
ltx/gr_gr_cog/me.m12.d21:meMA.Ode7C13.mode	@ltx/gr_gr_cog/miscellanea:misc.Mode4
ltx/gr_gr_cog/me.m12.d21:meMA.Ode7C13.ode	@ltx/gr_gr_cog/miscellanea:misc.Ode7
ltx/gr_gr_cog/me.m12.d21:meMA.Ode7C13.text	Στειρεύουσα τῶν ἀνθρώπων, φύσις πάσης ἀρετῆς, ἀγάλλου καὶ χόρευε· ἥκει γὰρ Χριστὸς ἐκ Παρθένου, σαρκὶ τεχθῆναι, ὅπως δείξῃ καλοῖς εὐτεκνοῦσάν σε.
ltx/gr_gr_cog/me.m12.d21:meMA.Ode7C1H.greekmelody	@ltx/gr_gr_cog/he.h.m4:heHE.NeoiTreisEnVavyloni.greekname
ltx/gr_gr_cog/me.m12.d21:meMA.Ode7C1H.incipit	@ltx/gr_gr_cog/he.h.m4:heHE.NeoiTreisEnVavyloni.incipit
ltx/gr_gr_cog/me.m12.d21:meMA.Ode7C1H.melody	@ltx/gr_gr_cog/he.h.m4:heHE.NeoiTreisEnVavyloni.melody
ltx/gr_gr_cog/me.m12.d21:meMA.Ode7C1H.mode	@ltx/gr_gr_cog/miscellanea:misc.Mode4
ltx/gr_gr_cog/me.m12.d21:meMA.Ode7C1H.ode	@ltx/gr_gr_cog/miscellanea:misc.Ode7
ltx/gr_gr_cog/me.m12.d21:meMA.Ode7C1H.text	@ltx/gr_gr_cog/he.h.m4:heHE.NeoiTreisEnVavyloni.text
ltx/gr_gr_cog/me.m12.d21:meMA.Ode7C21.greekmelody	@ltx/gr_gr_cog/he.h.m4:heHE.EnTiKaminoAvramiaioi.greekname
ltx/gr_gr_cog/me.m12.d21:meMA.Ode7C21.incipit	Ἐν ἀφροσύνῃ, πυρακτωθέντι σε τῷ…
ltx/gr_gr_cog/me.m12.d21:meMA.Ode7C21.melody	@ltx/gr_gr_cog/he.h.m4:heHE.EnTiKaminoAvramiaioi.name
ltx/gr_gr_cog/me.m12.d21:meMA.Ode7C21.mode	@ltx/gr_gr_cog/miscellanea:misc.Mode4
ltx/gr_gr_cog/me.m12.d21:meMA.Ode7C21.ode	@ltx/gr_gr_cog/miscellanea:misc.Ode7
ltx/gr_gr_cog/me.m12.d21:meMA.Ode7C21.text	Ἐν ἀφροσύνῃ, πυρακτωθέντι σε τῷ λέβητι, Μάρτυς, δικαστὴς προσρίπτει ἀνηλεῶς, διʼ Ἀγγέλου δὲ ὁ Κύριος, ἀδιαλώβητόν σε διέσωσε, τοῦτον γεραίρουσαν.
ltx/gr_gr_cog/me.m12.d21:meMA.Ode7C22.incipit	Οὐ δειλιῶσα, ἀνδρειοφρόνως μᾶλλον δὲ…
ltx/gr_gr_cog/me.m12.d21:meMA.Ode7C22.melody	@ltx/gr_gr_cog/he.h.m4:heHE.EnTiKaminoAvramiaioi.name
ltx/gr_gr_cog/me.m12.d21:meMA.Ode7C22.mode	@ltx/gr_gr_cog/miscellanea:misc.Mode4
ltx/gr_gr_cog/me.m12.d21:meMA.Ode7C22.ode	@ltx/gr_gr_cog/miscellanea:misc.Ode7
ltx/gr_gr_cog/me.m12.d21:meMA.Ode7C22.text	Οὐ δειλιῶσα, ἀνδρειοφρόνως μᾶλλον δὲ πάνσεμνε, Μάρτυς, τῇ πυρᾷ προσέρχῃ ἀναψυχῆς, αἰσθομένη καὶ κραυγάζουσα· Εὐλογημένος εἶ, ἐν τῷ ναῷ τῆς δόξης σου Κύριε.
ltx/gr_gr_cog/me.m12.d21:meMA.Ode7C23.incipit	Σοῦ τῷ Νυμφίῳ, καθάπερ προῖκα…
ltx/gr_gr_cog/me.m12.d21:meMA.Ode7C23.melody	@ltx/gr_gr_cog/he.h.m4:heHE.EnTiKaminoAvramiaioi.name
ltx/gr_gr_cog/me.m12.d21:meMA.Ode7C23.mode	@ltx/gr_gr_cog/miscellanea:misc.Mode4
ltx/gr_gr_cog/me.m12.d21:meMA.Ode7C23.ode	@ltx/gr_gr_cog/miscellanea:misc.Ode7
ltx/gr_gr_cog/me.m12.d21:meMA.Ode7C23.text	Σοῦ τῷ Νυμφίῳ, καθάπερ προῖκα προσήγαγες, δῆμον καὶ λαὸν πιστεύσαντα εἰς αὐτὸν καὶ τῆς πλάνης ἀμαυρότητα, ταῖς φωτοβόλοις σου, θαυματουργίαις ἀποκρουσάμενον.
ltx/gr_gr_cog/me.m12.d21:meMA.Ode7C2T.incipit	Χαῖρε χωρίον, τοῦ Ἀχωρήτου Μητροπάρθενε…
ltx/gr_gr_cog/me.m12.d21:meMA.Ode7C2T.melody	@ltx/gr_gr_cog/he.h.m4:heHE.EnTiKaminoAvramiaioi.name
ltx/gr_gr_cog/me.m12.d21:meMA.Ode7C2T.mode	@ltx/gr_gr_cog/miscellanea:misc.Mode4
ltx/gr_gr_cog/me.m12.d21:meMA.Ode7C2T.ode	@ltx/gr_gr_cog/miscellanea:misc.Ode7
ltx/gr_gr_cog/me.m12.d21:meMA.Ode7C2T.text	Χαῖρε χωρίον, τοῦ Ἀχωρήτου Μητροπάρθενε, τοῦτον· σαρκοφόρον μέλλεις γὰρ διʼ ἡμᾶς, ἐν Σπηλαίῳ τίκτειν Ἄχραντε, ἐπανορθούμενον, τῶν οἰκείων χειρῶν τὸ πλαστούργημα.
ltx/gr_gr_cog/me.m12.d21:meMA.Ode8C11.greekmelody	@ltx/gr_gr_cog/he.h.m4:heHE.LytrotaTouPantos.greekname
ltx/gr_gr_cog/me.m12.d21:meMA.Ode8C11.incipit	Τὸν πολλαῖς με Χριστὲ παραβάσεσι…
ltx/gr_gr_cog/me.m12.d21:meMA.Ode8C11.melody	@ltx/gr_gr_cog/he.h.m4:heHE.LytrotaTouPantos.name
ltx/gr_gr_cog/me.m12.d21:meMA.Ode8C11.mode	@ltx/gr_gr_cog/miscellanea:misc.Mode4
ltx/gr_gr_cog/me.m12.d21:meMA.Ode8C11.ode	@ltx/gr_gr_cog/miscellanea:misc.Ode8
ltx/gr_gr_cog/me.m12.d21:meMA.Ode8C11.text	Τὸν πολλαῖς με Χριστὲ παραβάσεσι, τῶν ληστῶν χρηματίσαντα σπήλαιον, διʼ εὐσπλαγχνίαν ἄφατον, διασῴζων τεχθῆναι, ἐν τῷ Σπηλαίῳ, ἐκ Παρθένου Ἁγνῆς κατηξίωσας.
ltx/gr_gr_cog/me.m12.d21:meMA.Ode8C12.incipit	Ὑπογράφων τελείαν μοι ἄφεσιν, ἀπεγράφης…
ltx/gr_gr_cog/me.m12.d21:meMA.Ode8C12.melody	@ltx/gr_gr_cog/he.h.m4:heHE.LytrotaTouPantos.name
ltx/gr_gr_cog/me.m12.d21:meMA.Ode8C12.mode	@ltx/gr_gr_cog/miscellanea:misc.Mode4
ltx/gr_gr_cog/me.m12.d21:meMA.Ode8C12.ode	@ltx/gr_gr_cog/miscellanea:misc.Ode8
ltx/gr_gr_cog/me.m12.d21:meMA.Ode8C12.text	Ὑπογράφων τελείαν μοι ἄφεσιν, ἀπεγράφης τῷ Καίσαρος δόγματι, ὁ Ποιητὴς τῆς κτίσεως, σὺν τοῖς δούλοις, ὑμνῶ σου τῆς εὐσπλαγχνίας, τὸ ἀμέτρητον ἔλεος Δέσποτα.
ltx/gr_gr_cog/me.m12.d21:meMA.Ode8C13.incipit	Φωτεινὸν τοῦ Δεσπότου Παλάτιον, πῶς…
ltx/gr_gr_cog/me.m12.d21:meMA.Ode8C13.melody	@ltx/gr_gr_cog/he.h.m4:heHE.LytrotaTouPantos.name
ltx/gr_gr_cog/me.m12.d21:meMA.Ode8C13.mode	@ltx/gr_gr_cog/miscellanea:misc.Mode4
ltx/gr_gr_cog/me.m12.d21:meMA.Ode8C13.ode	@ltx/gr_gr_cog/miscellanea:misc.Ode8
ltx/gr_gr_cog/me.m12.d21:meMA.Ode8C13.text	Φωτεινὸν τοῦ Δεσπότου Παλάτιον, πῶς ὑπῆλθες σμικρότατον Σπήλαιον, τὸν Βασιλέα Κύριον, δι ἡμᾶς σαρκωθέντα, ἀποκυῆσαι, Παναγία Παρθένε Θεόνυμφε;
ltx/gr_gr_cog/me.m12.d21:meMA.Ode8C1H.greekmelody	@ltx/gr_gr_cog/he.h.m4:heHE.LytrotaTouPantos.greekname
ltx/gr_gr_cog/me.m12.d21:meMA.Ode8C1H.incipit	@ltx/gr_gr_cog/he.h.m4:heHE.LytrotaTouPantos.incipit
ltx/gr_gr_cog/me.m12.d21:meMA.Ode8C1H.melody	@ltx/gr_gr_cog/he.h.m4:heHE.LytrotaTouPantos.melody
ltx/gr_gr_cog/me.m12.d21:meMA.Ode8C1H.mode	@ltx/gr_gr_cog/miscellanea:misc.Mode4
ltx/gr_gr_cog/me.m12.d21:meMA.Ode8C1H.ode	@ltx/gr_gr_cog/miscellanea:misc.Ode8
ltx/gr_gr_cog/me.m12.d21:meMA.Ode8C1H.text	@ltx/gr_gr_cog/he.h.m4:heHE.LytrotaTouPantos.text
ltx/gr_gr_cog/me.m12.d21:meMA.Ode8C21.greekmelody	@ltx/gr_gr_cog/he.h.m4:heHE.CheirasEkpetasasDaniil.greekname
ltx/gr_gr_cog/me.m12.d21:meMA.Ode8C21.incipit	Ἄνω σου τὸ ὄμμα καὶ…
ltx/gr_gr_cog/me.m12.d21:meMA.Ode8C21.melody	@ltx/gr_gr_cog/he.h.m4:heHE.CheirasEkpetasasDaniil.name
ltx/gr_gr_cog/me.m12.d21:meMA.Ode8C21.mode	@ltx/gr_gr_cog/miscellanea:misc.Mode4
ltx/gr_gr_cog/me.m12.d21:meMA.Ode8C21.ode	@ltx/gr_gr_cog/miscellanea:misc.Ode8
ltx/gr_gr_cog/me.m12.d21:meMA.Ode8C21.text	Ἄνω σου τὸ ὄμμα καὶ τὸν νοῦν, πρὸς τὸν δυνάμενον, ἔχουσα σῴζειν Θεόν, λεβήτων βράσματα χάριτι, θείου Πνεύματος κατέσβεσας, ἀναβοῶσα τὴν ᾠδήν, τῶν Παίδων Μάρτυς πιστῶς· Εὐλογεῖτε, πάντα τὰ ἔργα Κυρίου τὸν Κύριον.
ltx/gr_gr_cog/me.m12.d21:meMA.Ode8C22.incipit	Ῥήμασι τυράννου δυσμενοῦς, ὑπηρετούμενοι, πυρὸς…
ltx/gr_gr_cog/me.m12.d21:meMA.Ode8C22.melody	@ltx/gr_gr_cog/he.h.m4:heHE.CheirasEkpetasasDaniil.name
ltx/gr_gr_cog/me.m12.d21:meMA.Ode8C22.mode	@ltx/gr_gr_cog/miscellanea:misc.Mode4
ltx/gr_gr_cog/me.m12.d21:meMA.Ode8C22.ode	@ltx/gr_gr_cog/miscellanea:misc.Ode8
ltx/gr_gr_cog/me.m12.d21:meMA.Ode8C22.text	Ῥήμασι τυράννου δυσμενοῦς, ὑπηρετούμενοι, πυρὸς ἐπάξιοι, οἱ ματαιόφρονες ζῶσάν σε, τῇ πυρᾷ Μάρτυς ἐνέβαλον, ἀλλʼ οὐκ ἐφλέχθης τῷ πυρί, τῇ τοῦ Νυμφίου στοργῇ θεοφόρε, δροσιζομένη καὶ τοῦτον γεραίρουσα.
ltx/gr_gr_cog/me.m12.d21:meMA.Ode8C23.incipit	Ἵστασο πρὸ βήματος Χριστόν, ἀνακηρύττουσα…
ltx/gr_gr_cog/me.m12.d21:meMA.Ode8C23.melody	@ltx/gr_gr_cog/he.h.m4:heHE.CheirasEkpetasasDaniil.name
ltx/gr_gr_cog/me.m12.d21:meMA.Ode8C23.mode	@ltx/gr_gr_cog/miscellanea:misc.Mode4
ltx/gr_gr_cog/me.m12.d21:meMA.Ode8C23.ode	@ltx/gr_gr_cog/miscellanea:misc.Ode8
ltx/gr_gr_cog/me.m12.d21:meMA.Ode8C23.text	Ἵστασο πρὸ βήματος Χριστόν, ἀνακηρύττουσα, Θεὸν ἀθάνατον, καθυπομείναντα σταύρωσιν, καὶ τὴν πλάνην θανατώσαντα, καὶ τὴν ἀθάνατον ζωήν, πιστοῖς παρέχοντα, τοῖς βοῶσι· Πάντα τὰ ἔργα ὑμνεῖτε τὸν Κύριον.
ltx/gr_gr_cog/me.m12.d21:meMA.Ode8C2T.incipit	Νέφει τὴν ἐπίβασιν αὐτοῦ, τιθεὶς…
ltx/gr_gr_cog/me.m12.d21:meMA.Ode8C2T.melody	@ltx/gr_gr_cog/he.h.m4:heHE.CheirasEkpetasasDaniil.name
ltx/gr_gr_cog/me.m12.d21:meMA.Ode8C2T.mode	@ltx/gr_gr_cog/miscellanea:misc.Mode4
ltx/gr_gr_cog/me.m12.d21:meMA.Ode8C2T.ode	@ltx/gr_gr_cog/miscellanea:misc.Ode8
ltx/gr_gr_cog/me.m12.d21:meMA.Ode8C2T.text	Νέφει τὴν ἐπίβασιν αὐτοῦ, τιθεὶς ὁ Κύριος διὰ νεφέλης ἡμῖν, Παρθένου τίκτεσθαι ἔρχεται, ὅπως λύσῃ τῶν ψυχῶν ἡμῶν, τῆς ἁμαρτίας ζοφερά, νέφη βοώντων αὐτῷ· Εὐλογεῖτε, πάντα τὰ ἔργα Κυρίου τὸν Κύριον.
ltx/gr_gr_cog/me.m12.d21:meMA.Ode8H.greekmelody	@ltx/gr_gr_cog/he.h.m4:heHE.CheirasEkpetasasDaniil.greekname
ltx/gr_gr_cog/me.m12.d21:meMA.Ode8H.incipit	@ltx/gr_gr_cog/he.h.m4:heHE.CheirasEkpetasasDaniil.incipit
ltx/gr_gr_cog/me.m12.d21:meMA.Ode8H.melody	@ltx/gr_gr_cog/he.h.m4:heHE.CheirasEkpetasasDaniil.melody
ltx/gr_gr_cog/me.m12.d21:meMA.Ode8H.mode	@ltx/gr_gr_cog/miscellanea:misc.Mode4
ltx/gr_gr_cog/me.m12.d21:meMA.Ode8H.ode	@ltx/gr_gr_cog/miscellanea:misc.Ode8
ltx/gr_gr_cog/me.m12.d21:meMA.Ode8H.text	@ltx/gr_gr_cog/he.h.m4:heHE.CheirasEkpetasasDaniil.text
ltx/gr_gr_cog/me.m12.d21:meMA.Ode9C11.greekmelody	@ltx/gr_gr_cog/he.h.m4:heHE.EvaMenToTisParakois.greekname
ltx/gr_gr_cog/me.m12.d21:meMA.Ode9C11.incipit	Χορεύσωμεν ἅπαντες πιστοί, σκιρτήσωμεν, καὶ…
ltx/gr_gr_cog/me.m12.d21:meMA.Ode9C11.melody	@ltx/gr_gr_cog/he.h.m4:heHE.EvaMenToTisParakois.name
ltx/gr_gr_cog/me.m12.d21:meMA.Ode9C11.mode	@ltx/gr_gr_cog/miscellanea:misc.Mode4
ltx/gr_gr_cog/me.m12.d21:meMA.Ode9C11.ode	@ltx/gr_gr_cog/miscellanea:misc.Ode9
ltx/gr_gr_cog/me.m12.d21:meMA.Ode9C11.text	Χορεύσωμεν ἅπαντες πιστοί, σκιρτήσωμεν, καὶ συμφώνως ἀλαλάξωμεν, ἥκει ἡ πάντων σωτηρία, ἐγγίζει τοῦ τεχθῆναι ὁ Κύριος, καὶ σῶσαι τοὺς αὐτοῦ τὰ Γενέθλια, εὐσεβοφρόνως ἑορτάζοντας.
ltx/gr_gr_cog/me.m12.d21:meMA.Ode9C12.incipit	Ψαλτήριον ἅγιε Δαυῒδ ἀνάλαβε, καὶ…
ltx/gr_gr_cog/me.m12.d21:meMA.Ode9C12.melody	@ltx/gr_gr_cog/he.h.m4:heHE.EvaMenToTisParakois.name
ltx/gr_gr_cog/me.m12.d21:meMA.Ode9C12.mode	@ltx/gr_gr_cog/miscellanea:misc.Mode4
ltx/gr_gr_cog/me.m12.d21:meMA.Ode9C12.ode	@ltx/gr_gr_cog/miscellanea:misc.Ode9
ltx/gr_gr_cog/me.m12.d21:meMA.Ode9C12.text	Ψαλτήριον ἅγιε Δαυῒδ ἀνάλαβε, καὶ κιθάραν καὶ μελῴδησον· Τοῦ Ἐφραθᾶ οἶκος εὐφραίνου· Πατὴρ γὰρ ἐκ γαστρὸς ὃν ἐγέννησεν, ἐν σοὶ περιφανῶς ἀποτίκτεται, ἐκ τῆς Παρθένου σωματούμενος.
ltx/gr_gr_cog/me.m12.d21:meMA.Ode9C1H.greekmelody	@ltx/gr_gr_cog/he.h.m4:heHE.EvaMenToTisParakois.greekname
ltx/gr_gr_cog/me.m12.d21:meMA.Ode9C1H.incipit	@ltx/gr_gr_cog/he.h.m4:heHE.EvaMenToTisParakois.incipit
ltx/gr_gr_cog/me.m12.d21:meMA.Ode9C1H.melody	@ltx/gr_gr_cog/he.h.m4:heHE.EvaMenToTisParakois.melody
ltx/gr_gr_cog/me.m12.d21:meMA.Ode9C1H.mode	@ltx/gr_gr_cog/miscellanea:misc.Mode4
ltx/gr_gr_cog/me.m12.d21:meMA.Ode9C1H.ode	@ltx/gr_gr_cog/miscellanea:misc.Ode9
ltx/gr_gr_cog/me.m12.d21:meMA.Ode9C1H.text	@ltx/gr_gr_cog/he.h.m4:heHE.EvaMenToTisParakois.text
ltx/gr_gr_cog/me.m12.d21:meMA.Ode9C1T.incipit	Ὡς ὄμβρος, ὡς μέγας ὑετὸς…
ltx/gr_gr_cog/me.m12.d21:meMA.Ode9C1T.melody	@ltx/gr_gr_cog/he.h.m4:heHE.EvaMenToTisParakois.name
ltx/gr_gr_cog/me.m12.d21:meMA.Ode9C1T.mode	@ltx/gr_gr_cog/miscellanea:misc.Mode4
ltx/gr_gr_cog/me.m12.d21:meMA.Ode9C1T.ode	@ltx/gr_gr_cog/miscellanea:misc.Ode9
ltx/gr_gr_cog/me.m12.d21:meMA.Ode9C1T.text	Ὡς ὄμβρος, ὡς μέγας ὑετὸς ἐν τῇ μήτρᾳ σου, ὁ Δεσπότης καταβέβηκε, καὶ αὐχμηρίᾳ ἀθεΐας, τὴν γῆν κεχερσωμένην κατήρδευσε, καὶ πλάνης τὰς θαλάσσας ἐξήρανε, Θεογεννῆτορ Μητροπάρθενε.
ltx/gr_gr_cog/me.m12.d21:meMA.Ode9C21.greekmelody	@ltx/gr_gr_cog/he.h.m4:heHE.LithosAcheirotmitos.greekname
ltx/gr_gr_cog/me.m12.d21:meMA.Ode9C21.incipit	Ἰουλιανῆς ἀθληφόρου, τοὺς ὑπὲρ πίστεως…
ltx/gr_gr_cog/me.m12.d21:meMA.Ode9C21.melody	@ltx/gr_gr_cog/he.h.m4:heHE.LithosAcheirotmitos.name
ltx/gr_gr_cog/me.m12.d21:meMA.Ode9C21.mode	@ltx/gr_gr_cog/miscellanea:misc.Mode4
ltx/gr_gr_cog/me.m12.d21:meMA.Ode9C21.ode	@ltx/gr_gr_cog/miscellanea:misc.Ode9
ltx/gr_gr_cog/me.m12.d21:meMA.Ode9C21.text	Ἰουλιανῆς ἀθληφόρου, τοὺς ὑπὲρ πίστεως ἀγῶνας, Ἄγγελοι ἐθαύμασαν ὅπως, ἐν γυναικείᾳ φύσει κατῄσχυνε, τὸν τὴν αὐτῆς προμήτορα, ἐν Παραδείσῳ θανατώσαντα.
ltx/gr_gr_cog/me.m12.d21:meMA.Ode9C22.incipit	Ὡς περικαλὴς ἀθληφόρος, καὶ περιδέξιος…
ltx/gr_gr_cog/me.m12.d21:meMA.Ode9C22.melody	@ltx/gr_gr_cog/he.h.m4:heHE.LithosAcheirotmitos.name
ltx/gr_gr_cog/me.m12.d21:meMA.Ode9C22.mode	@ltx/gr_gr_cog/miscellanea:misc.Mode4
ltx/gr_gr_cog/me.m12.d21:meMA.Ode9C22.ode	@ltx/gr_gr_cog/miscellanea:misc.Ode9
ltx/gr_gr_cog/me.m12.d21:meMA.Ode9C22.text	Ὡς περικαλὴς ἀθληφόρος, καὶ περιδέξιος Παρθένος, στέφος ἀνεπλέξω νομίμως, δικαιοσύνης καταπατήσασα, μετὰ σαρκὸς τὸν ἄσαρκον, καὶ νικηφόρος χρηματίσασα.
ltx/gr_gr_cog/me.m12.d21:meMA.Ode9C23.incipit	Σὲ τὴν νοητὴν Χελιδόνα, καὶ…
ltx/gr_gr_cog/me.m12.d21:meMA.Ode9C23.melody	@ltx/gr_gr_cog/he.h.m4:heHE.LithosAcheirotmitos.name
ltx/gr_gr_cog/me.m12.d21:meMA.Ode9C23.mode	@ltx/gr_gr_cog/miscellanea:misc.Mode4
ltx/gr_gr_cog/me.m12.d21:meMA.Ode9C23.ode	@ltx/gr_gr_cog/miscellanea:misc.Ode9
ltx/gr_gr_cog/me.m12.d21:meMA.Ode9C23.text	Σὲ τὴν νοητὴν Χελιδόνα, καὶ ἀδιάφθορον Τρυγόνα, καὶ Περιστερὰν μαρτυρίῳ, κεχρυσωμένας ἔχουσαν πτέρυγας, καὶ πρὸς τὸν Θεὸν πετάσασαν, καταπαύσασαν γεραίρομεν.
ltx/gr_gr_cog/me.m12.d21:meMA.Ode9C24.incipit	Ἤνθησας κοιλάσιν ὡς κρίνον, ταῖς…
ltx/gr_gr_cog/me.m12.d21:meMA.Ode9C24.melody	@ltx/gr_gr_cog/he.h.m4:heHE.LithosAcheirotmitos.name
ltx/gr_gr_cog/me.m12.d21:meMA.Ode9C24.mode	@ltx/gr_gr_cog/miscellanea:misc.Mode4
ltx/gr_gr_cog/me.m12.d21:meMA.Ode9C24.ode	@ltx/gr_gr_cog/miscellanea:misc.Ode9
ltx/gr_gr_cog/me.m12.d21:meMA.Ode9C24.text	Ἤνθησας κοιλάσιν ὡς κρίνον, ταῖς τῶν Μαρτύρων ἀθλοφόρε, Ἰουλιανή, καὶ ὡς ῥόδον, τὴν παρθενίαν εὔοσμον φέρουσα, τῷ νοητῷ Νυμφίῳ σου, θεῖον ὀσφράδιον γεγένησαι.
ltx/gr_gr_cog/me.m12.d21:meMA.Ode9C2T.incipit	Φέρουσα τὸν φέροντα πάντα, πρὸς…
ltx/gr_gr_cog/me.m12.d21:meMA.Ode9C2T.melody	@ltx/gr_gr_cog/he.h.m4:heHE.LithosAcheirotmitos.name
ltx/gr_gr_cog/me.m12.d21:meMA.Ode9C2T.mode	@ltx/gr_gr_cog/miscellanea:misc.Mode4
ltx/gr_gr_cog/me.m12.d21:meMA.Ode9C2T.ode	@ltx/gr_gr_cog/miscellanea:misc.Ode9
ltx/gr_gr_cog/me.m12.d21:meMA.Ode9C2T.text	Φέρουσα τὸν φέροντα πάντα, πρὸς Βηθλεὲμ ἔρχῃ Παρθένε, τοῦτον καὶ κυῆσαι ἐν φάτνῃ, προσανακλῖναι καθάπερ νήπιον, τὴν τῶν βροτῶν ἀνάκλησιν, διαφερόντως ἐργαζόμενον.
ltx/gr_gr_cog/me.m12.d21:meMA.Ode9H.greekmelody	@ltx/gr_gr_cog/he.h.m4:heHE.LithosAcheirotmitos.greekname
ltx/gr_gr_cog/me.m12.d21:meMA.Ode9H.incipit	@ltx/gr_gr_cog/he.h.m4:heHE.LithosAcheirotmitos.incipit
ltx/gr_gr_cog/me.m12.d21:meMA.Ode9H.melody	@ltx/gr_gr_cog/he.h.m4:heHE.LithosAcheirotmitos.melody
ltx/gr_gr_cog/me.m12.d21:meMA.Ode9H.mode	@ltx/gr_gr_cog/miscellanea:misc.Mode4
ltx/gr_gr_cog/me.m12.d21:meMA.Ode9H.ode	@ltx/gr_gr_cog/miscellanea:misc.Ode9
ltx/gr_gr_cog/me.m12.d21:meMA.Ode9H.text	@ltx/gr_gr_cog/he.h.m4:heHE.LithosAcheirotmitos.text
ltx/gr_gr_cog/me.m12.d21:meMA.Oikos1.text	Τὸν τοῦ Θεοῦ Υἱὸν ἡ Παρθένος ἐν ἀγκάλαις κρατοῦσα, καὶ μητρικοῖς ἀσπασμοῖς καταφιλοῦσα ἐφθέγγετο· Σπορὰν οὐκ ἔγνων ἐν τῇ συλλήψει, καὶ φθορὰν οὐχ ὑπέστην ἐν τῇ γεννήσει, ἀλλʼ ἁγνὴ ὥσπερ πρώην εἰμὶ καὶ μετὰ γέννησιν· διό σου προσκυνῶ Τέκνον τὴν πολλὴν εὐσπλαγχνίαν, καὶ ἄφατον μεγαλουργίαν, ἣν ἔδειξας εἰς ἐμέ· ὅθεν καὶ ἀγάλλομαι, κρατοῦσα ἐν κόλποις τὸν Υἱὸν τοῦ Θεοῦ.
ltx/gr_gr_cog/me.m12.d21:meVE.Apolytikion1.greekmelody	@ltx/gr_gr_cog/he.a.m4:heAU.KateplagiIosif.greekname
ltx/gr_gr_cog/me.m12.d21:meVE.Apolytikion1.incipit	@ltx/gr_gr_cog/me.m12.d20:meVE.Apolytikion1.incipit
ltx/gr_gr_cog/me.m12.d21:meVE.Apolytikion1.melody	@ltx/gr_gr_cog/he.a.m4:heAU.KateplagiIosif.name
ltx/gr_gr_cog/me.m12.d21:meVE.Apolytikion1.mode	@ltx/gr_gr_cog/miscellanea:misc.Mode4
ltx/gr_gr_cog/me.m12.d21:meVE.Apolytikion1.text	@ltx/gr_gr_cog/me.m12.d20:meVE.Apolytikion1.text
ltx/gr_gr_cog/me.m12.d21:meVE.Apolytikion2ger.greekmelody	@ltx/gr_gr_cog/he.a.m4:heAU.TachyProkatalave.greekname
ltx/gr_gr_cog/me.m12.d21:meVE.Apolytikion2ger.incipit	Ὡς νύμφη πανάμωμος…
ltx/gr_gr_cog/me.m12.d21:meVE.Apolytikion2ger.melody	@ltx/gr_gr_cog/he.a.m4:heAU.TachyProkatalave.name
ltx/gr_gr_cog/me.m12.d21:meVE.Apolytikion2ger.mode	@ltx/gr_gr_cog/miscellanea:misc.Mode4
ltx/gr_gr_cog/me.m12.d21:meVE.Apolytikion2ger.poet	@ltx/gr_gr_cog/poets:po.Gerasimou
ltx/gr_gr_cog/me.m12.d21:meVE.Apolytikion2ger.text	Ὡς νύμφη πανάμωμος, καὶ Ἀθληφόρος σεμνή, τῷ Λόγῳ νενύμφευσαι, τοῦ ἀθανάτου Πατρός, Ἰουλιανὴ ἔνδοξε· σὺ γὰρ φθαρτὸν μνηστῆρα, παριδοῦσα ἐμφρόνως, ἤθλησας ὑπὲρ φύσιν καὶ τὸν ὄφιν καθεῖλες. Καὶ νῦν ταῖς τοῦ Νυμφίου σου, τρυφᾷς φαιδρότησι.
ltx/gr_gr_cog/me.m12.d21:meVE.AposGlory.incipit	Ἡ πόλις Βηθλεέμ, εὐτρέπισον…
ltx/gr_gr_cog/me.m12.d21:meVE.AposGlory.melody	@ltx/gr_gr_cog/he.a.m2:heAU.OikosTouEfratha.name
ltx/gr_gr_cog/me.m12.d21:meVE.AposGlory.mode	@ltx/gr_gr_cog/miscellanea:misc.Mode2
ltx/gr_gr_cog/me.m12.d21:meVE.AposGlory.text	Ἡ πόλις Βηθλεέμ, εὐτρέπισον τῷ Κτίστῃ, τὸ Σπήλαιον, τὴν Φάτνην, τὰ σπάργανα· ἐν σοὶ γάρ, τεχθῆναι παραγίνεται.
ltx/gr_gr_cog/me.m12.d21:meVE.Aposticha1.greekmelody	@ltx/gr_gr_cog/he.a.m2:heAU.OikosTouEfratha.greekname
ltx/gr_gr_cog/me.m12.d21:meVE.Aposticha1.incipit	Πάντων τῶν Προφητῶν…
ltx/gr_gr_cog/me.m12.d21:meVE.Aposticha1.melody	@ltx/gr_gr_cog/he.a.m2:heAU.OikosTouEfratha.name
ltx/gr_gr_cog/me.m12.d21:meVE.Aposticha1.mode	@ltx/gr_gr_cog/miscellanea:misc.Mode2
ltx/gr_gr_cog/me.m12.d21:meVE.Aposticha1.text	Πάντων τῶν Προφητῶν, αἱ προῤῥήσεις πληροῦνται· ὁ Χριστὸς γὰρ γεννᾶται, ἐν Βηθλεὲμ τῇ πόλει, ἐκ τῆς ἁγνῆς θεόπαιδος.
ltx/gr_gr_cog/me.m12.d21:meVE.Aposticha2.incipit	Δόξα τῶν γηγενῶν…
ltx/gr_gr_cog/me.m12.d21:meVE.Aposticha2.melody	@ltx/gr_gr_cog/he.a.m2:heAU.OikosTouEfratha.name
ltx/gr_gr_cog/me.m12.d21:meVE.Aposticha2.mode	@ltx/gr_gr_cog/miscellanea:misc.Mode2
ltx/gr_gr_cog/me.m12.d21:meVE.Aposticha2.text	Δόξα τῶν γηγενῶν, καὶ καύχημα καὶ κλέος, Βηθλεὲμ ἡ τιμία, μητρόπολις ἡ θεία, ὑπόδεξαι τὸν Κτίστην σου.
ltx/gr_gr_cog/me.m12.d21:meVE.Aposticha3.incipit	Λόγος ὁ τοῦ Πατρός’…
ltx/gr_gr_cog/me.m12.d21:meVE.Aposticha3.melody	@ltx/gr_gr_cog/he.a.m2:heAU.OikosTouEfratha.name
ltx/gr_gr_cog/me.m12.d21:meVE.Aposticha3.mode	@ltx/gr_gr_cog/miscellanea:misc.Mode2
ltx/gr_gr_cog/me.m12.d21:meVE.Aposticha3.text	Λόγος ὁ τοῦ Πατρός, διʼ οὗ τὸ πᾶν ὑπέστη, ἀπαθῶς καὶ ἀῤῥεύστως, ὑπόστασις ὁρᾶται, μία ἐκ δύο φύσεων.
ltx/gr_gr_cog/me.m12.d21:meVE.SticGlory.incipit	Σιὼν πανηγύριζε…
ltx/gr_gr_cog/me.m12.d21:meVE.SticGlory.melody	
ltx/gr_gr_cog/me.m12.d21:meVE.SticGlory.mode	@ltx/gr_gr_cog/miscellanea:misc.Mode6
ltx/gr_gr_cog/me.m12.d21:meVE.SticGlory.text	Σιὼν πανηγύριζε, Ἱερουσαλὴμ εὐφραίνου, Πόλις Χριστοῦ τοῦ Θεοῦ, ὑπόδεξαι τὸν Κτίστην, ἐν Σπηλαίῳ καὶ Φάτνῃ χωρούμενον· ἀνοίξατέ μοι πύλας, εἰσελθὼν ἐν αὐταῖς, ὄψομαι τὸν ὡς βρέφος σπαργανούμενον, καὶ τῇ δρακὶ συνέχοντα τὴν κτίσιν, ὃν ὑμνοῦσιν Ἄγγελοι, ἀκαταπαύστῳ φωνῇ· Ζωοδότην Κύριον, τὸν σῴζοντα τὸ γένος ἡμῶν.
ltx/gr_gr_cog/me.m12.d21:meVE.Stichera01.greekmelody	@ltx/gr_gr_cog/he.a.m4:heAU.EdokasSimeiosin.greekname
ltx/gr_gr_cog/me.m12.d21:meVE.Stichera01.incipit	Οὗτος ὁ Θεὸς ἡμῶν…
ltx/gr_gr_cog/me.m12.d21:meVE.Stichera01.melody	@ltx/gr_gr_cog/he.a.m4:heAU.EdokasSimeiosin.name
ltx/gr_gr_cog/me.m12.d21:meVE.Stichera01.mode	@ltx/gr_gr_cog/miscellanea:misc.Mode4
ltx/gr_gr_cog/me.m12.d21:meVE.Stichera01.text	Οὗτος ὁ Θεὸς ἡμῶν, οὐ λογισθήσεται ἕτερος, πρὸς αὐτὸν ἀνακέκραγε, Προφήτης ἐν πνεύματι· ὁδὸν γὰρ ἐξεῦρε, πᾶσαν ἐπιστήμης, μετὰ δὲ ταῦτα τοῖς βροτοῖς, σάρκα φορέσας ὁμοιωθήσεται· Παρθένου γὰρ θεόπαιδος, ἀποτεχθῆναι ἐπείγεται, προσιτός μοι γενόμενος, ὁ τῇ φύσει ἀπρόσιτος.
ltx/gr_gr_cog/me.m12.d21:meVE.Stichera02.incipit	Θημωνία ἅλωνος…
ltx/gr_gr_cog/me.m12.d21:meVE.Stichera02.melody	@ltx/gr_gr_cog/he.a.m4:heAU.EdokasSimeiosin.name
ltx/gr_gr_cog/me.m12.d21:meVE.Stichera02.mode	@ltx/gr_gr_cog/miscellanea:misc.Mode4
ltx/gr_gr_cog/me.m12.d21:meVE.Stichera02.text	Θημωνία ἅλωνος, ἡ σὴ κοιλία Πανάμωμε, Θεοτόκε γνωρίζεται, στάχυν ἐγεώργητον, ὑπὲρ νοῦν καὶ λόγον, φέρουσα ἀφράστως· ὃν ἐν Σπηλαίῳ Βηθλεέμ, ἀποκυήσεις τὴν κτίσιν ἅπασαν, ταῖς θείαις ἐπιγνώσεσι, μέλλοντα θρέψειν ἐν χάριτι, καὶ λιμοῦ τὸ ἀνθρώπινον, ψυχοφθόρου λυτρώσεσθαι.
ltx/gr_gr_cog/me.m12.d21:meVE.Stichera03.incipit	Δάμαλις ἡ ἄμωμος…
ltx/gr_gr_cog/me.m12.d21:meVE.Stichera03.melody	@ltx/gr_gr_cog/he.a.m4:heAU.EdokasSimeiosin.name
ltx/gr_gr_cog/me.m12.d21:meVE.Stichera03.mode	@ltx/gr_gr_cog/miscellanea:misc.Mode4
ltx/gr_gr_cog/me.m12.d21:meVE.Stichera03.text	Δάμαλις ἡ ἄμωμος, τὸν σιτευτὸν Μόσχον φέρουσα, ἐν κοιλίᾳ προέρχεται, εἰς ἅγιον Σπήλαιον, παραδόξῳ λόγῳ, τοῦτον ἀποτέξαι, καὶ σπαργανῶσαι ὡς βροτόν, καὶ ἀνακλῖναι φάτνῃ ὡς νήπιον. Ἡ κτίσις προεόρταζε, χαρμονικῶς μεγαλύνουσα, τὸν τοιαῦτα παράδοξα, ἐπὶ γῆς ἐργαζόμενον.
ltx/gr_gr_cog/me.m12.d21:meVE.Stichera04.greekmelody	@ltx/gr_gr_cog/he.a.m4:heAU.OsGennaionEnMartysi.greekname
ltx/gr_gr_cog/me.m12.d21:meVE.Stichera04.incipit	Ταῖς βαφαῖς ταῖς ἐξ αἵματος…
ltx/gr_gr_cog/me.m12.d21:meVE.Stichera04.melody	@ltx/gr_gr_cog/he.a.m4:heAU.OsGennaionEnMartysi.name
ltx/gr_gr_cog/me.m12.d21:meVE.Stichera04.mode	@ltx/gr_gr_cog/miscellanea:misc.Mode4
ltx/gr_gr_cog/me.m12.d21:meVE.Stichera04.text	Ταῖς βαφαῖς ταῖς ἐξ αἵματος, σωτηρίου ἱμάτιον, σεαυτῇ πανεύφημε ἐπιχρώσασα, καὶ λαμπρυνθεῖσα τῷ πνεύματι, Κυρίῳ μεμνήστευσαι, ἀθανάτῳ Βασιλεῖ, συντηροῦντί σε ἄμωμον, ἀδιάφθορον, εἰς αἰῶνα αἰῶνος ἐν θαλάμοις, οὐρανίοις ὡς Παρθένον, περικαλῆ καὶ ἀκήρατον.
ltx/gr_gr_cog/me.m12.d21:meVE.Stichera05.incipit	Αἰκισμοῖς ὁμιλήσασα…
ltx/gr_gr_cog/me.m12.d21:meVE.Stichera05.melody	@ltx/gr_gr_cog/he.a.m4:heAU.OsGennaionEnMartysi.name
ltx/gr_gr_cog/me.m12.d21:meVE.Stichera05.mode	@ltx/gr_gr_cog/miscellanea:misc.Mode4
ltx/gr_gr_cog/me.m12.d21:meVE.Stichera05.text	Αἰκισμοῖς ὁμιλήσασα, καὶ πυρὶ προσπελάσασα, καὶ σαρκὸς σπαράγματα καρτερήσασα, καὶ τῶν λεβήτων τὰ βράσματα, γενναίως ἐνέγκασα, οὐχ ἡττήθης λογισμῷ, οὐ ξοάνοις ἐπέθυσας, ἀλλὰ κλίνασα, τῷ Θεῷ τὸν αὐχένα τῇ τοῦ ξίφους, τιμωρίᾳ στεφηφόρος, πρὸς οὐρανοὺς ἀνελήλυθας.
ltx/gr_gr_cog/me.m12.d21:meVE.Stichera06.incipit	Ὥσπερ προῖκα πολύτιμον…
ltx/gr_gr_cog/me.m12.d21:meVE.Stichera06.melody	@ltx/gr_gr_cog/he.a.m4:heAU.OsGennaionEnMartysi.name
ltx/gr_gr_cog/me.m12.d21:meVE.Stichera06.mode	@ltx/gr_gr_cog/miscellanea:misc.Mode4
ltx/gr_gr_cog/me.m12.d21:meVE.Stichera06.text	Ὥσπερ προῖκα πολύτιμον, τῷ Νυμφίῳ προσήγαγες, Ἀθληφόρε ἔνδοξε δῆμον ἅγιον, τοῖς θαυμασίοις πιστεύσαντα, οἷς πίστει ἐτέλεσας, ἀνωτέρα καὶ ποινῶν, καὶ τροχοῦ καταφλέγοντος, καὶ στρεβλώσεων, ἐν Χριστῷ δεικνυμένη τῷ τὴν νίκην, οὐρανόθεν σοι Παρθένε, θεουργικῶς χορηγήσαντι.
