ltx/gr_gr_cog/me.m11.d16:alt1.meMA.PostGospelBoth.incipit	@ltx/gr_gr_cog/ho.ho03:hoMA.PostGospelTheotokos.incipit
ltx/gr_gr_cog/me.m11.d16:alt1.meMA.PostGospelBoth.melody	
ltx/gr_gr_cog/me.m11.d16:alt1.meMA.PostGospelBoth.mode	@ltx/gr_gr_cog/miscellanea:misc.Mode2
ltx/gr_gr_cog/me.m11.d16:alt1.meMA.PostGospelBoth.text	@ltx/gr_gr_cog/ho.ho03:hoMA.PostGospelTheotokos.text
ltx/gr_gr_cog/me.m11.d16:alt1.meMA.PostGospelGlory.incipit	@ltx/gr_gr_cog/ho.ho03:hoMA.PostGospelApostle.incipit
ltx/gr_gr_cog/me.m11.d16:alt1.meMA.PostGospelGlory.melody	
ltx/gr_gr_cog/me.m11.d16:alt1.meMA.PostGospelGlory.mode	@ltx/gr_gr_cog/miscellanea:misc.Mode2
ltx/gr_gr_cog/me.m11.d16:alt1.meMA.PostGospelGlory.text	@ltx/gr_gr_cog/ho.ho03:hoMA.PostGospelApostle.text
ltx/gr_gr_cog/me.m11.d16:alt1.meMA.PostGospelIdiomelon.incipit	Τὸν Ἀπόστολον Χριστοῦ…
ltx/gr_gr_cog/me.m11.d16:alt1.meMA.PostGospelIdiomelon.melody	
ltx/gr_gr_cog/me.m11.d16:alt1.meMA.PostGospelIdiomelon.mode	@ltx/gr_gr_cog/miscellanea:misc.Mode6
ltx/gr_gr_cog/me.m11.d16:alt1.meMA.PostGospelIdiomelon.text	Τὸν Ἀπόστολον Χριστοῦ, μαθητὴν καὶ αὐτόπτην, καὶ εὐαγγελιστὴν τοῦ Σωτῆρος, Ματθαῖον τὸν πανένδοξον, συνελθόντες ἅπαντες οἱ πιστοί, ἐν ᾠδαῖς πνευματικαῖς ἀνυμνήσωμεν.
ltx/gr_gr_cog/me.m11.d16:meDA.commemoration.first	Μνήμη τοῦ Ἁγίου Εὐαγγελιστοῦ Ματθαίου
ltx/gr_gr_cog/me.m11.d16:meDA.commemoration.first_name	Ἅγιος Ματθαῖος
ltx/gr_gr_cog/me.m11.d16:meDA.commemoration.first_short	Μνήμη τοῦ Ἁγίου Εὐαγγελιστοῦ Ματθαίου
ltx/gr_gr_cog/me.m11.d16:meDA.commemoration.first_title	@ltx/gr_gr_cog/titles:ti.Evangelist
ltx/gr_gr_cog/me.m11.d16:meDA.commemoration.full	Μνήμη τοῦ Ἁγίου Ἀποστόλου καὶ Εὐαγγελιστοῦ Ματθαίου
ltx/gr_gr_cog/me.m11.d16:meDA.commemoration.second_name	
ltx/gr_gr_cog/me.m11.d16:meDA.commemoration.second_title	
ltx/gr_gr_cog/me.m11.d16:meDA.date	Τῌ ΙϚʹ ΝΟΕΜΒΡΙΟΥ
ltx/gr_gr_cog/me.m11.d16:meDA.fordate	διὰ τὴν 16ην Νοεμβρίου
ltx/gr_gr_cog/me.m11.d16:meDA.insert1	καὶ τοῦ ἁγίου Ἀποστόλου καὶ Εὐαγγελιστοῦ Ματθαίου,
ltx/gr_gr_cog/me.m11.d16:meDA.insert2	οὗ καὶ τὴν μνήμην ἐπιτελοῦμεν·
ltx/gr_gr_cog/me.m11.d16:meDA.note	
ltx/gr_gr_cog/me.m11.d16:meDA.pdfcoverdate	τῆς 16ης Νοεμβρίου,
ltx/gr_gr_cog/me.m11.d16:meDA.pdfheaderdate	τῆς 16ης Νοεμβρίου
ltx/gr_gr_cog/me.m11.d16:meHO.commemorations	
ltx/gr_gr_cog/me.m11.d16:meHO.note1	
ltx/gr_gr_cog/me.m11.d16:meHO.note2	
ltx/gr_gr_cog/me.m11.d16:meHO.number	
ltx/gr_gr_cog/me.m11.d16:meHO.rank	
ltx/gr_gr_cog/me.m11.d16:meLE.commemoration1	Μνήμη τοῦ Ἁγίου Ἀποστόλου καὶ Εὐαγγελιστοῦ Ματθαίου.
ltx/gr_gr_cog/me.m11.d16:meLE.commemoration2	
ltx/gr_gr_cog/me.m11.d16:meLI.Kontakion1.greekmelody	@ltx/gr_gr_cog/me.m11.d16:meMA.Kontakion1.greekmelody
ltx/gr_gr_cog/me.m11.d16:meLI.Kontakion1.incipit	@ltx/gr_gr_cog/me.m11.d16:meMA.Kontakion1.incipit
ltx/gr_gr_cog/me.m11.d16:meLI.Kontakion1.melody	@ltx/gr_gr_cog/me.m11.d16:meMA.Kontakion1.melody
ltx/gr_gr_cog/me.m11.d16:meLI.Kontakion1.mode	@ltx/gr_gr_cog/me.m11.d16:meMA.Kontakion1.mode
ltx/gr_gr_cog/me.m11.d16:meLI.Kontakion1.text	@ltx/gr_gr_cog/me.m11.d16:meMA.Kontakion1.text
ltx/gr_gr_cog/me.m11.d16:meLI.MM.CommunionHymn.text	@ltx/gr_gr_cog/properties:media.key
ltx/gr_gr_cog/me.m11.d16:meLI.Megalynarion.text	Σύσκηνος τῷ λόγῳ διατελῶν, θείων μυστηρίων, ἐμυήθης τὰς ἀστραπάς· ἔνθεν θεογράφως, Ἀπόστολε Ματθαῖε, ζωῆς διετυπώσω τὸ Εὐαγγέλιον.
ltx/gr_gr_cog/me.m11.d16:meMA.C1.poet	@ltx/gr_gr_cog/poets:po.Theofanous
ltx/gr_gr_cog/me.m11.d16:meMA.C1.title	@ltx/gr_gr_cog/titles:ti.CanonEvangelist
ltx/gr_gr_cog/me.m11.d16:meMA.C1.verse	@ltx/gr_gr_cog/prayers:pr.verse_Apostle.text
ltx/gr_gr_cog/me.m11.d16:meMA.ExapTheotokion.incipit	Τὰς παναγίας χεῖράς σου, Θεοτόκε…
ltx/gr_gr_cog/me.m11.d16:meMA.ExapTheotokion.melody	@ltx/gr_gr_cog/he.a.m3:heAU.EnPnevmatiToIero.name
ltx/gr_gr_cog/me.m11.d16:meMA.ExapTheotokion.mode	@ltx/gr_gr_cog/miscellanea:misc.Mode3
ltx/gr_gr_cog/me.m11.d16:meMA.ExapTheotokion.text	Τὰς παναγίας χεῖράς σου, Θεοτόκε Παρθένε, αἷς τὸν κτίστην ἐβάστασας, ἔπαρον εἰς πρεσβείαν, ὑπὲρ ἡμῶν δυσωποῦσα, ὅπως ῥύσηται ἡμᾶς, πάσης πείρας Δαιμόνων, καὶ τοῦ τυχεῖν Πανάμωμε, τῶν μελλόντων ἐκείνων, ἀγαθῶν ἀξιώσῃ.
ltx/gr_gr_cog/me.m11.d16:meMA.Exaposteilarion1.greekmelody	@ltx/gr_gr_cog/he.a.m3:heAU.EnPnevmatiToIero.greekname
ltx/gr_gr_cog/me.m11.d16:meMA.Exaposteilarion1.incipit	Τοῦ τελωνείου τὸν ζυγόν, ἀποῤῥίψας…
ltx/gr_gr_cog/me.m11.d16:meMA.Exaposteilarion1.melody	@ltx/gr_gr_cog/he.a.m3:heAU.EnPnevmatiToIero.name
ltx/gr_gr_cog/me.m11.d16:meMA.Exaposteilarion1.mode	@ltx/gr_gr_cog/miscellanea:misc.Mode3
ltx/gr_gr_cog/me.m11.d16:meMA.Exaposteilarion1.text	Τοῦ τελωνείου τὸν ζυγόν, ἀποῤῥίψας ἐμφρόνως, Χριστῷ κατηκολούθησας, ὦ Ματθαῖε θεόφρον, τοῖς ἴχνεσι δὲ τοῖς αὐτοῦ, θαυμαστῶς ἑπόμενος, ἐν μετοχῇ ἐγεγόνεις, τῆς αὐτοῦ βασιλείας, καὶ τῆς δόξης κοινωνός, καὶ μύστης τῶν ἀποῤῥήτων.
ltx/gr_gr_cog/me.m11.d16:meMA.Kathisma11.greekmelody	@ltx/gr_gr_cog/he.a.m4:heAU.TachyProkatalave.greekname
ltx/gr_gr_cog/me.m11.d16:meMA.Kathisma11.incipit	Ματθαῖε ἀπόστολε πιστῶς ὑμνοῦμέν σε…
ltx/gr_gr_cog/me.m11.d16:meMA.Kathisma11.melody	@ltx/gr_gr_cog/he.a.m4:heAU.TachyProkatalave.name
ltx/gr_gr_cog/me.m11.d16:meMA.Kathisma11.mode	@ltx/gr_gr_cog/miscellanea:misc.Mode4
ltx/gr_gr_cog/me.m11.d16:meMA.Kathisma11.poet	@ltx/gr_gr_cog/poets:po.SymeonThessalonikis
ltx/gr_gr_cog/me.m11.d16:meMA.Kathisma11.text	Ματθαῖε ἀπόστολε πιστῶς ὑμνοῦμέν σε, καὶ πόθῳ τμῶμέν σε ὡς ὑπηρέτην Χριστοῦ, αὐτόπτην καὶ κήρυκα, πρῶτόν τε συγγραφέα τῶν ἐκείνου λογίων, μέγιστόν τε φωστῆρα Ἐκκλησίας καὶ στῦλον, καὶ μνήμν τὴν πανίερον σοῦ νῦν γεραίρομεν.
ltx/gr_gr_cog/me.m11.d16:meMA.Kathisma1T.incipit	@ltx/gr_gr_cog/me.m09.d01:meMA.Kathisma2T.incipit
ltx/gr_gr_cog/me.m11.d16:meMA.Kathisma1T.melody	@ltx/gr_gr_cog/me.m09.d01:meMA.Kathisma2T.melody
ltx/gr_gr_cog/me.m11.d16:meMA.Kathisma1T.mode	@ltx/gr_gr_cog/me.m09.d01:meMA.Kathisma2T.mode
ltx/gr_gr_cog/me.m11.d16:meMA.Kathisma1T.text	@ltx/gr_gr_cog/me.m09.d01:meMA.Kathisma2T.text
ltx/gr_gr_cog/me.m11.d16:meMA.Kathisma21.greekmelody	@ltx/gr_gr_cog/he.a.m8:heAU.TinSofianKaiLogon.greekname
ltx/gr_gr_cog/me.m11.d16:meMA.Kathisma21.incipit	Οὓς ἐχάραξας λόγους οἱ εὐσεβεῖς…
ltx/gr_gr_cog/me.m11.d16:meMA.Kathisma21.melody	@ltx/gr_gr_cog/he.a.m8:heAU.TinSofianKaiLogon.name
ltx/gr_gr_cog/me.m11.d16:meMA.Kathisma21.mode	@ltx/gr_gr_cog/miscellanea:misc.Mode8
ltx/gr_gr_cog/me.m11.d16:meMA.Kathisma21.poet	@ltx/gr_gr_cog/poets:po.SymeonThessalonikis
ltx/gr_gr_cog/me.m11.d16:meMA.Kathisma21.text	Οὓς ἐχάραξας λόγους οἱ εὐσεβεῖς, εὐσεβείας θεμέλιον ἀῤῥαγῆ καὶ ῥίζαν τῆς πίστεως κεκτημένοι ὑμνοῦμέν σε· τοὺς γὰρ θείους λόγους Χριστοῦ καὶ τὰ θαύματα, καὶ τὰ θεῖα πάθη, ταφὴν καὶ ἀνάστασιν, ἀπὸ σῆς ἀπαύστως ἀκροώμενοι γλώσσης, Ματθαῖε ἀπόστολε, τὰς ψυχὰς φωτιζόμεθα, καὶ πιστῶς ἐκβοῶμέν σοι· Πρέσβευε Χριστῷ τῷ Θεῷ, τῶν πταισμάτων ἄφεσιν δωρήσασθαι, τοῖς ἑορτάζουσι πόθῷ τὴν ἁγίαν μνήμην σου.
ltx/gr_gr_cog/me.m11.d16:meMA.Kathisma2T.incipit	Τὴν εἰκόνα, Παρένε, τὴν ἑαυτοῦ…
ltx/gr_gr_cog/me.m11.d16:meMA.Kathisma2T.melody	@ltx/gr_gr_cog/he.a.m8:heAU.TinSofianKaiLogon.name
ltx/gr_gr_cog/me.m11.d16:meMA.Kathisma2T.mode	@ltx/gr_gr_cog/miscellanea:misc.Mode8
ltx/gr_gr_cog/me.m11.d16:meMA.Kathisma2T.poet	@ltx/gr_gr_cog/poets:po.SymeonThessalonikis
ltx/gr_gr_cog/me.m11.d16:meMA.Kathisma2T.text	Τὴν εἰκόνα, Παρένε, τὴν ἑαυτοῦ, συντριβεῖσαν ὁ πλάστης ἀναλαβών, ἐκ σοῦ, Θεονύμφευτε, συμπαθῶς ἀνεμόρφωσε· τῇ γὰρ θείᾳ φύσει ἑνώσας ὡς ἔσπλαγχνος, θεϊκαῖς ἀκτῖσιν αὐτὴν κατεκάλλυνεν· ὅθεν τὸν λαβόντα τὴν μορφὴν τῆς εἰκόνος, καί σάρκα γενόμενον εἰκονίζοντες Κύριον, προσκυνοῦμεν θεάνθρωπον, τῆς σαρκὸς τὸ εἶδος πιστῶς, ὡς θεῖον τιμῶντές τε καί γράφοντες, καί τό σόν, Θεοτόκε, ψυχὰς φωτιζόμενοι.
ltx/gr_gr_cog/me.m11.d16:meMA.Kontakion1.greekmelody	@ltx/gr_gr_cog/he.a.m4:heAU.OYpsotheisEnToStavro.greekname
ltx/gr_gr_cog/me.m11.d16:meMA.Kontakion1.incipit	Τοῦ τελωνείου τὸν ζυγὸν ἀποῤῥίψας…
ltx/gr_gr_cog/me.m11.d16:meMA.Kontakion1.melody	@ltx/gr_gr_cog/he.a.m4:heAU.OYpsotheisEnToStavro.name
ltx/gr_gr_cog/me.m11.d16:meMA.Kontakion1.mode	@ltx/gr_gr_cog/miscellanea:misc.Mode4
ltx/gr_gr_cog/me.m11.d16:meMA.Kontakion1.text	Τοῦ τελωνείου τὸν ζυγὸν ἀποῤῥίψας, δικαιοσύνης τῷ ζυγῷ προσηρμόσθης, καὶ ἀνεδείχθης ἔμπορος πανάριστος, πλοῦτον κομισάμενος, τὴν ἐξ ὕψους σοφίαν· ὅθεν ἀνεκήρυξας, ἀληθείας τὸν λόγον, καὶ τῶν ῥαθύμων ἤγειρας ψυχάς, καθυπογράψας, τὴν ὥραν τῆς κρίσεως.
ltx/gr_gr_cog/me.m11.d16:meMA.Lauds1.greekmelody	@ltx/gr_gr_cog/he.a.m4:heAU.EdokasSimeiosin.greekname
ltx/gr_gr_cog/me.m11.d16:meMA.Lauds1.incipit	Ἔλαμψας Ἀπόστολε, φωτοειδὴς ὥσπερ ἥλιος…
ltx/gr_gr_cog/me.m11.d16:meMA.Lauds1.melody	@ltx/gr_gr_cog/he.a.m4:heAU.EdokasSimeiosin.name
ltx/gr_gr_cog/me.m11.d16:meMA.Lauds1.mode	@ltx/gr_gr_cog/miscellanea:misc.Mode4
ltx/gr_gr_cog/me.m11.d16:meMA.Lauds1.text	Ἔλαμψας Ἀπόστολε, φωτοειδὴς ὥσπερ ἥλιος, ταῖς ἀκτῖσι τοῦ Πνεύματος, καὶ πᾶσαν κατηύγασας, οἰκουμένην μάκαρ, τῇ θεογνωσίᾳ, καὶ ἀπεδίωξας ἀχλύν, πολυθεΐας Ματθαῖε πάνσοφε· διό σου τὴν ὑπέρφωτον, καὶ ἀξιάγαστον σήμερον, ἐκτελοῦμεν πανήγυριν, ὡς πηγὴν ἁγιάσματος.
ltx/gr_gr_cog/me.m11.d16:meMA.Lauds2.incipit	Ἐν ὕψει καθήμενος, θεογνωσίας Ἀπόστολε…
ltx/gr_gr_cog/me.m11.d16:meMA.Lauds2.melody	@ltx/gr_gr_cog/he.a.m4:heAU.EdokasSimeiosin.name
ltx/gr_gr_cog/me.m11.d16:meMA.Lauds2.mode	@ltx/gr_gr_cog/miscellanea:misc.Mode4
ltx/gr_gr_cog/me.m11.d16:meMA.Lauds2.text	Ἐν ὕψει καθήμενος, θεογνωσίας Ἀπόστολε, ὑπεδέξω τοῦ Πνεύματος, τὴν αἴγλην φανεῖσάν σοι, τοῦ πυρὸς ἐν εἴδει, καὶ γλώσσῃ πυρίνῃ, πᾶσαν κατέφλεξας σαφῶς, τῆς ἀσεβείας ὕλην πολύθεον· διό σε ὡς Ἀπόστολον, καὶ θεηγόρον γεραίρομεν, τὴν ἁγίαν σου σήμερον, ἐκτελοῦντες πανήγυριν.
ltx/gr_gr_cog/me.m11.d16:meMA.Lauds3.incipit	Ἑβρόντησας πάνσοφε, τῇ οἰκουμένῃ διδάγματα…
ltx/gr_gr_cog/me.m11.d16:meMA.Lauds3.melody	@ltx/gr_gr_cog/he.a.m4:heAU.EdokasSimeiosin.name
ltx/gr_gr_cog/me.m11.d16:meMA.Lauds3.mode	@ltx/gr_gr_cog/miscellanea:misc.Mode4
ltx/gr_gr_cog/me.m11.d16:meMA.Lauds3.text	Ἑβρόντησας πάνσοφε, τῇ οἰκουμένῃ διδάγματα, ἱερὰ καὶ σωτήρια, καὶ πᾶσαν ἐκάθηρας, εἰδωλομανίας, τὴν κτίσιν Ματθαῖε, καὶ κατεφώτισας λαούς, Εὐαγγελίου ταῖς ἐπιλάμψεσιν, εἰδώλων τὰ τεμένη δέ, καταστρεψάμενος χάριτι, Ἐκκλησίας εἰς αἴνεσιν, τοῦ Θεοῦ ᾠκοδόμησας.
ltx/gr_gr_cog/me.m11.d16:meMA.LaudsGlory.incipit	Κροτήσωμεν ἐν ᾄσμασι σήμερον πιστοί…
ltx/gr_gr_cog/me.m11.d16:meMA.LaudsGlory.melody	
ltx/gr_gr_cog/me.m11.d16:meMA.LaudsGlory.mode	@ltx/gr_gr_cog/miscellanea:misc.Mode8
ltx/gr_gr_cog/me.m11.d16:meMA.LaudsGlory.text	Κροτήσωμεν ἐν ᾄσμασι σήμερον πιστοί, ἐπὶ τῇ μνήμῃ τοῦ σεπτοῦ Ἀποστόλου, καὶ Εὐαγγελιστοῦ Ματθαίου· οὗτος γὰρ ῥίψας τὸν ζυγόν, καὶ τὸν χρυσὸν τοῦ τελωνείου, ἠκολούθησε Χριστῷ, καὶ κήρυξ τοῦ Εὐαγγελίου θεῖος ἐχρημάτισεν· ὅθεν ἐξῆλθε προφητικῶς ὁ φθόγγος αὐτοῦ, εἰς τὴν οἰκουμένην, καὶ πρεσβεύει σωθῆναι τὰς ψυχάς ἡμῶν.
ltx/gr_gr_cog/me.m11.d16:meMA.LaudsTheotokion.incipit	@ltx/gr_gr_cog/oc.m8.d5:ocMA.AposTheotokion.incipit
ltx/gr_gr_cog/me.m11.d16:meMA.LaudsTheotokion.melody	
ltx/gr_gr_cog/me.m11.d16:meMA.LaudsTheotokion.mode	@ltx/gr_gr_cog/miscellanea:misc.Mode8
ltx/gr_gr_cog/me.m11.d16:meMA.LaudsTheotokion.text	@ltx/gr_gr_cog/oc.m8.d5:ocMA.AposTheotokion.text
ltx/gr_gr_cog/me.m11.d16:meMA.MM.Lauds1123as5678.text	@ltx/gr_gr_cog/properties:media.key
ltx/gr_gr_cog/me.m11.d16:meMA.Ode1C11.greekmelody	@ltx/gr_gr_cog/he.h.m4:heHE.AnoixoToStomaMou.greekname
ltx/gr_gr_cog/me.m11.d16:meMA.Ode1C11.incipit	Πλουσίως μετάδος μοι, τῆς ἐνοικούσης…
ltx/gr_gr_cog/me.m11.d16:meMA.Ode1C11.melody	@ltx/gr_gr_cog/he.h.m4:heHE.AnoixoToStomaMou.name
ltx/gr_gr_cog/me.m11.d16:meMA.Ode1C11.mode	@ltx/gr_gr_cog/miscellanea:misc.Mode4
ltx/gr_gr_cog/me.m11.d16:meMA.Ode1C11.ode	@ltx/gr_gr_cog/miscellanea:misc.Ode1
ltx/gr_gr_cog/me.m11.d16:meMA.Ode1C11.text	Πλουσίως μετάδος μοι, τῆς ἐνοικούσης σοι χάριτος, Ματθαῖε πανένδοξε, καὶ ὑπηρέτα Χριστοῦ, καὶ βοήσομαι, λαμπρῶς ἀνακηρύττων, καὶ μέλψω γηθόμενος, τὰ σὰ θαυμάσια.
ltx/gr_gr_cog/me.m11.d16:meMA.Ode1C12.incipit	Τελείως κατέλιπες, τῶν ἐπιγείων τὴν…
ltx/gr_gr_cog/me.m11.d16:meMA.Ode1C12.melody	@ltx/gr_gr_cog/he.h.m4:heHE.AnoixoToStomaMou.name
ltx/gr_gr_cog/me.m11.d16:meMA.Ode1C12.mode	@ltx/gr_gr_cog/miscellanea:misc.Mode4
ltx/gr_gr_cog/me.m11.d16:meMA.Ode1C12.ode	@ltx/gr_gr_cog/miscellanea:misc.Ode1
ltx/gr_gr_cog/me.m11.d16:meMA.Ode1C12.text	Τελείως κατέλιπες, τῶν ἐπιγείων τὴν σύγχυσιν, τοῦ Λόγου ὦς ἤκουσας, τοῦ σαρκωθέντος φωνῆς, καὶ τῆς χάριτος, ἐδείχθης οἰκονόμος, καὶ κήρυξ θεόληπτος, θεομακάριστε.
ltx/gr_gr_cog/me.m11.d16:meMA.Ode1C13.incipit	Αὐτόπτης γενόμενος, καὶ ὑπηρέτης διέπρεψας…
ltx/gr_gr_cog/me.m11.d16:meMA.Ode1C13.melody	@ltx/gr_gr_cog/he.h.m4:heHE.AnoixoToStomaMou.name
ltx/gr_gr_cog/me.m11.d16:meMA.Ode1C13.mode	@ltx/gr_gr_cog/miscellanea:misc.Mode4
ltx/gr_gr_cog/me.m11.d16:meMA.Ode1C13.ode	@ltx/gr_gr_cog/miscellanea:misc.Ode1
ltx/gr_gr_cog/me.m11.d16:meMA.Ode1C13.text	Αὐτόπτης γενόμενος, καὶ ὑπηρέτης διέπρεψας, τοῦ Λόγου Ἀπόστολε, τοῦ πρὸ αἰώνων Πατρός, καὶ διέδραμες, αὐτοῦ τὴν παρουσίαν, εὐαγγελιζόμενος, πᾶσι τοῖς ἔθνεσιν.
ltx/gr_gr_cog/me.m11.d16:meMA.Ode1C1T.incipit	Θανάτου καθαίρεσιν, καὶ τῆς φθορᾶς…
ltx/gr_gr_cog/me.m11.d16:meMA.Ode1C1T.melody	@ltx/gr_gr_cog/he.h.m4:heHE.AnoixoToStomaMou.name
ltx/gr_gr_cog/me.m11.d16:meMA.Ode1C1T.mode	@ltx/gr_gr_cog/miscellanea:misc.Mode4
ltx/gr_gr_cog/me.m11.d16:meMA.Ode1C1T.ode	@ltx/gr_gr_cog/miscellanea:misc.Ode1
ltx/gr_gr_cog/me.m11.d16:meMA.Ode1C1T.text	Θανάτου καθαίρεσιν, καὶ τῆς φθορᾶς τὴν κατάλυσιν, ζωῆς τε φανέρωσιν, εὐηγγελίσω Σοφέ· τῆς Παρθένου γάρ, ἐν μήτρᾳ ἐνοικήσας, ὁ ἀπεριόριστος, κόσμον ἀνέπλασεν.
ltx/gr_gr_cog/me.m11.d16:meMA.Ode3C11.greekmelody	@ltx/gr_gr_cog/he.h.m4:heHE.TousSousYmnologous.greekname
ltx/gr_gr_cog/me.m11.d16:meMA.Ode3C11.incipit	Τοὺς σοὺς Ἀποστόλους Θεοῦ Λόγε…
ltx/gr_gr_cog/me.m11.d16:meMA.Ode3C11.melody	@ltx/gr_gr_cog/he.h.m4:heHE.TousSousYmnologous.name
ltx/gr_gr_cog/me.m11.d16:meMA.Ode3C11.mode	@ltx/gr_gr_cog/miscellanea:misc.Mode4
ltx/gr_gr_cog/me.m11.d16:meMA.Ode3C11.ode	@ltx/gr_gr_cog/miscellanea:misc.Ode3
ltx/gr_gr_cog/me.m11.d16:meMA.Ode3C11.text	Τοὺς σοὺς Ἀποστόλους Θεοῦ Λόγε, φωστῆρας ἀνέδειξας ζωῆς, τὸν ζόφον ἀπελαύνοντας, τῆς ἀθεΐας Δέσποτα, καὶ ἐν τῇ θείᾳ δόξῃ σου, τὸν κόσμον ὅλον φωτίζοντας.
ltx/gr_gr_cog/me.m11.d16:meMA.Ode3C12.incipit	Τῇ σῇ καθοπλίσας, παντευχίᾳ, Ματθαῖον…
ltx/gr_gr_cog/me.m11.d16:meMA.Ode3C12.melody	@ltx/gr_gr_cog/he.h.m4:heHE.TousSousYmnologous.name
ltx/gr_gr_cog/me.m11.d16:meMA.Ode3C12.mode	@ltx/gr_gr_cog/miscellanea:misc.Mode4
ltx/gr_gr_cog/me.m11.d16:meMA.Ode3C12.ode	@ltx/gr_gr_cog/miscellanea:misc.Ode3
ltx/gr_gr_cog/me.m11.d16:meMA.Ode3C12.text	Τῇ σῇ καθοπλίσας, παντευχίᾳ, Ματθαῖον τὸν ἄριστον Σωτήρ, τυράννων δυνατώτερον, τοῦτον εἰργάσω Δέσποτα, καὶ καθαιρέτην ἔδειξας, εἰδώλων πλάνης Φιλάνθρωπε.
ltx/gr_gr_cog/me.m11.d16:meMA.Ode3C13.incipit	Γλώσσης τῆς πυρίνης σου ὁ…
ltx/gr_gr_cog/me.m11.d16:meMA.Ode3C13.melody	@ltx/gr_gr_cog/he.h.m4:heHE.TousSousYmnologous.name
ltx/gr_gr_cog/me.m11.d16:meMA.Ode3C13.mode	@ltx/gr_gr_cog/miscellanea:misc.Mode4
ltx/gr_gr_cog/me.m11.d16:meMA.Ode3C13.ode	@ltx/gr_gr_cog/miscellanea:misc.Ode3
ltx/gr_gr_cog/me.m11.d16:meMA.Ode3C13.text	Γλώσσης τῆς πυρίνης σου ὁ φθόγγος, δαιμόνων ἐνέπρησε βωμούς, Ματθαῖε τὸ θεότευκτον, τοῦ Παρακλήτου ὄργανον, διʼ οὗ Χριστὸς κηρύττεται, Λόγος ὁ ἐνυπόστατος.
ltx/gr_gr_cog/me.m11.d16:meMA.Ode3C1T.incipit	Σάλπιγξ θεολόγος φθεγγομένη, συντόνως ἐφώτισε…
ltx/gr_gr_cog/me.m11.d16:meMA.Ode3C1T.melody	@ltx/gr_gr_cog/he.h.m4:heHE.TousSousYmnologous.name
ltx/gr_gr_cog/me.m11.d16:meMA.Ode3C1T.mode	@ltx/gr_gr_cog/miscellanea:misc.Mode4
ltx/gr_gr_cog/me.m11.d16:meMA.Ode3C1T.ode	@ltx/gr_gr_cog/miscellanea:misc.Ode3
ltx/gr_gr_cog/me.m11.d16:meMA.Ode3C1T.text	Σάλπιγξ θεολόγος φθεγγομένη, συντόνως ἐφώτισε λαούς, Ματθαίου τοῦ θεόφρονος, τὴν τῆς Τριάδος ἔλλαμψιν, τὴν ὑπὲρ νοῦν τε σάρκωσιν, τοῦ Λόγου ἐκ σοῦ Πανάχραντε.
ltx/gr_gr_cog/me.m11.d16:meMA.Ode3H.greekmelody	@ltx/gr_gr_cog/he.h.m4:heHE.TousSousYmnologous.greekname
ltx/gr_gr_cog/me.m11.d16:meMA.Ode3H.incipit	@ltx/gr_gr_cog/he.h.m4:heHE.TousSousYmnologous.incipit
ltx/gr_gr_cog/me.m11.d16:meMA.Ode3H.melody	@ltx/gr_gr_cog/he.h.m4:heHE.TousSousYmnologous.melody
ltx/gr_gr_cog/me.m11.d16:meMA.Ode3H.mode	@ltx/gr_gr_cog/miscellanea:misc.Mode4
ltx/gr_gr_cog/me.m11.d16:meMA.Ode3H.ode	@ltx/gr_gr_cog/miscellanea:misc.Ode3
ltx/gr_gr_cog/me.m11.d16:meMA.Ode3H.text	@ltx/gr_gr_cog/he.h.m4:heHE.TousSousYmnologous.text
ltx/gr_gr_cog/me.m11.d16:meMA.Ode3Kathisma1.greekmelody	@ltx/gr_gr_cog/he.a.m1:heAU.TonTafonSouSotir.greekname
ltx/gr_gr_cog/me.m11.d16:meMA.Ode3Kathisma1.incipit	Ὁ πρῶτος τοῦ Χριστοῦ, Εὐαγγέλιον…
ltx/gr_gr_cog/me.m11.d16:meMA.Ode3Kathisma1.melody	@ltx/gr_gr_cog/he.a.m1:heAU.TonTafonSouSotir.name
ltx/gr_gr_cog/me.m11.d16:meMA.Ode3Kathisma1.mode	@ltx/gr_gr_cog/miscellanea:misc.Mode1
ltx/gr_gr_cog/me.m11.d16:meMA.Ode3Kathisma1.text	Ὁ πρῶτος τοῦ Χριστοῦ, Εὐαγγέλιον γράψας, καὶ πᾶσαν δᾳδουχῶν, τὴν ὑφήλιον κτίσιν, Ματθαῖος ὁ σοφώτατος, καὶ Χριστοῦ μύστης ἄριστος, νῦν τιμώμενος, ταῖς ἱεραῖς μελῳδίαις, πᾶσιν ἄφεσιν, ἁμαρτιῶν ἐξαιτεῖται, τοῖς πόθῳ τιμῶσιν αὐτόν.
ltx/gr_gr_cog/me.m11.d16:meMA.Ode3Kathisma2.greekmelody	@ltx/gr_gr_cog/he.a.m8:heAU.TinSofianKaiLogon.greekname
ltx/gr_gr_cog/me.m11.d16:meMA.Ode3Kathisma2.incipit	Τὸν χρυσὸν καταλείψας ὡς ἀληθῶς…
ltx/gr_gr_cog/me.m11.d16:meMA.Ode3Kathisma2.melody	@ltx/gr_gr_cog/he.a.m8:heAU.TinSofianKaiLogon.name
ltx/gr_gr_cog/me.m11.d16:meMA.Ode3Kathisma2.mode	@ltx/gr_gr_cog/miscellanea:misc.Mode8
ltx/gr_gr_cog/me.m11.d16:meMA.Ode3Kathisma2.text	Τὸν χρυσὸν καταλείψας ὡς ἀληθῶς, τὸν Χριστὸν δὲ ποθήσας φιλευσεβῶς, Ματθαῖε Ἀπόστολε, τῶν περάτων ἐδείχθης φωστήρ, καὶ ἐκ Τελώνου ὤφθης, Ἀπόστολος ἔνδοξος, μαθητὴς γενόμενος, καὶ κήρυξ τῆς πίστεως. Ὅθεν συνελθόντες, κατὰ χρέος τιμῶμεν, τὴν πάνσεπτον μνήμην σου, καὶ πιστῶς ἑορτάζομεν, μελῳδοῦντες καὶ λέγοντες. Πρέσβευε Χριστῷ τῷ Θεῷ, τῶν πταισμάτων ἄφεσιν δωρήσασθαι, τοῖς ἑορτάζουσι πόθῳ, τὴν ἁγίαν μνήμην σου.
ltx/gr_gr_cog/me.m11.d16:meMA.Ode3KathismaT.incipit	@ltx/gr_gr_cog/oc.m8.d1:ocMA.Kathisma13.incipit
ltx/gr_gr_cog/me.m11.d16:meMA.Ode3KathismaT.melody	@ltx/gr_gr_cog/he.a.m8:heAU.TinSofianKaiLogon.name
ltx/gr_gr_cog/me.m11.d16:meMA.Ode3KathismaT.mode	@ltx/gr_gr_cog/miscellanea:misc.Mode8
ltx/gr_gr_cog/me.m11.d16:meMA.Ode3KathismaT.text	@ltx/gr_gr_cog/oc.m8.d1:ocMA.Kathisma13.text
ltx/gr_gr_cog/me.m11.d16:meMA.Ode4C11.greekmelody	@ltx/gr_gr_cog/he.h.m4:heHE.TinAnexichniaston.greekname
ltx/gr_gr_cog/me.m11.d16:meMA.Ode4C11.incipit	Τῷ ἐνυποστάτῳ σου Λόγῳ Θεέ…
ltx/gr_gr_cog/me.m11.d16:meMA.Ode4C11.melody	@ltx/gr_gr_cog/he.h.m4:heHE.TinAnexichniaston.name
ltx/gr_gr_cog/me.m11.d16:meMA.Ode4C11.mode	@ltx/gr_gr_cog/miscellanea:misc.Mode4
ltx/gr_gr_cog/me.m11.d16:meMA.Ode4C11.ode	@ltx/gr_gr_cog/miscellanea:misc.Ode4
ltx/gr_gr_cog/me.m11.d16:meMA.Ode4C11.text	Τῷ ἐνυποστάτῳ σου Λόγῳ Θεέ, μεμαθητευμένος διέλυσε, κόσμου σοφίαν, ὁ θεόπτης Μαθητής, μεγαλοφώνως κράζων σοι. Δόξα τῇ δυνάμει σου Κύριε.
ltx/gr_gr_cog/me.m11.d16:meMA.Ode4C12.incipit	Τῷ μεμακαρισμένῳ ὑπὸ Χριστοῦ, ποίαν…
ltx/gr_gr_cog/me.m11.d16:meMA.Ode4C12.melody	@ltx/gr_gr_cog/he.h.m4:heHE.TinAnexichniaston.name
ltx/gr_gr_cog/me.m11.d16:meMA.Ode4C12.mode	@ltx/gr_gr_cog/miscellanea:misc.Mode4
ltx/gr_gr_cog/me.m11.d16:meMA.Ode4C12.ode	@ltx/gr_gr_cog/miscellanea:misc.Ode4
ltx/gr_gr_cog/me.m11.d16:meMA.Ode4C12.text	Τῷ μεμακαρισμένῳ ὑπὸ Χριστοῦ, ποίαν εὐφημίαν προσείπωμεν, σοὶ θεηγόρε; οὐκ ἰσχύει γὰρ βροτός, τὴν ἐπανθοῦσαν χάριν σοι, λόγῳ ἐξειπεῖν ἀξιάγαστε.
ltx/gr_gr_cog/me.m11.d16:meMA.Ode4C13.incipit	Σοῦ τὸν ἀκηλίδωτον καὶ ἀκραιφνῆ…
ltx/gr_gr_cog/me.m11.d16:meMA.Ode4C13.melody	@ltx/gr_gr_cog/he.h.m4:heHE.TinAnexichniaston.name
ltx/gr_gr_cog/me.m11.d16:meMA.Ode4C13.mode	@ltx/gr_gr_cog/miscellanea:misc.Mode4
ltx/gr_gr_cog/me.m11.d16:meMA.Ode4C13.ode	@ltx/gr_gr_cog/miscellanea:misc.Ode4
ltx/gr_gr_cog/me.m11.d16:meMA.Ode4C13.text	Σοῦ τὸν ἀκηλίδωτον καὶ ἀκραιφνῆ, νοῦν τεθεαμένος ὁ Ὕψιστος, ὥσπερ λαμπάδα, εἰς λυχνίαν ὑψηλήν, τοῖς ἐν τῷ σκότει φαίνουσαν, πᾶσι θεοφάντορ προτέθεικεν.
ltx/gr_gr_cog/me.m11.d16:meMA.Ode4C1T.incipit	Τὴν τεταπεινωμένην φύσιν βροτῶν, ἡ…
ltx/gr_gr_cog/me.m11.d16:meMA.Ode4C1T.melody	@ltx/gr_gr_cog/he.h.m4:heHE.TinAnexichniaston.name
ltx/gr_gr_cog/me.m11.d16:meMA.Ode4C1T.mode	@ltx/gr_gr_cog/miscellanea:misc.Mode4
ltx/gr_gr_cog/me.m11.d16:meMA.Ode4C1T.ode	@ltx/gr_gr_cog/miscellanea:misc.Ode4
ltx/gr_gr_cog/me.m11.d16:meMA.Ode4C1T.text	Τὴν τεταπεινωμένην φύσιν βροτῶν, ἡ εὐλογημένη ἀνύψωσας, τὴν τοῦ Ὑψίστου, ὡς κυήσασα ἰσχύν, ὑπερφυῶς πανάχραντε, Μήτηρ ὡς Ματθαῖος ἐδίδαξεν.
ltx/gr_gr_cog/me.m11.d16:meMA.Ode5C11.greekmelody	@ltx/gr_gr_cog/he.h.m4:heHE.ExestiTaSympanta.greekname
ltx/gr_gr_cog/me.m11.d16:meMA.Ode5C11.incipit	Τὴν χάριν δεξάμενος, τοῦ Παναγίου…
ltx/gr_gr_cog/me.m11.d16:meMA.Ode5C11.melody	@ltx/gr_gr_cog/he.h.m4:heHE.ExestiTaSympanta.name
ltx/gr_gr_cog/me.m11.d16:meMA.Ode5C11.mode	@ltx/gr_gr_cog/miscellanea:misc.Mode4
ltx/gr_gr_cog/me.m11.d16:meMA.Ode5C11.ode	@ltx/gr_gr_cog/miscellanea:misc.Ode5
ltx/gr_gr_cog/me.m11.d16:meMA.Ode5C11.text	Τὴν χάριν δεξάμενος, τοῦ Παναγίου Πνεύματος, θεῖον ἐνδιαίτημα ἐδείχθης, θείως διδάξας, θεογνωσίας τὸ φῶς, πιστευθεὶς τὰ δόγματα Χριστοῦ, γράμμασιν ἐκτίθεσθαι, ὡς αὐτόπτης θεόκριτος.
ltx/gr_gr_cog/me.m11.d16:meMA.Ode5C12.incipit	Ἡ γλῶσσά σου κάλαμος, τοῦ…
ltx/gr_gr_cog/me.m11.d16:meMA.Ode5C12.melody	@ltx/gr_gr_cog/he.h.m4:heHE.ExestiTaSympanta.name
ltx/gr_gr_cog/me.m11.d16:meMA.Ode5C12.mode	@ltx/gr_gr_cog/miscellanea:misc.Mode4
ltx/gr_gr_cog/me.m11.d16:meMA.Ode5C12.ode	@ltx/gr_gr_cog/miscellanea:misc.Ode5
ltx/gr_gr_cog/me.m11.d16:meMA.Ode5C12.text	Ἡ γλῶσσά σου κάλαμος, τοῦ Παρακλήτου γέγονεν, ἐνθέως τοῦ λύτρωσιν διδόντος, τοῖς ἐπιγνοῦσι τὴν δεσποτείαν αὐτοῦ, καὶ ταῖς σοφῶν ἐμπνέοντος ψυχαῖς, γνῶσιν ἐπουράνιον, ὦ Ματθαῖε πανέντιμε.
ltx/gr_gr_cog/me.m11.d16:meMA.Ode5C13.incipit	Ἀστράπτοντα θαύμασι, καὶ ἰαμάτων χάρισι…
ltx/gr_gr_cog/me.m11.d16:meMA.Ode5C13.melody	@ltx/gr_gr_cog/he.h.m4:heHE.ExestiTaSympanta.name
ltx/gr_gr_cog/me.m11.d16:meMA.Ode5C13.mode	@ltx/gr_gr_cog/miscellanea:misc.Mode4
ltx/gr_gr_cog/me.m11.d16:meMA.Ode5C13.ode	@ltx/gr_gr_cog/miscellanea:misc.Ode5
ltx/gr_gr_cog/me.m11.d16:meMA.Ode5C13.text	Ἀστράπτοντα θαύμασι, καὶ ἰαμάτων χάρισι, σὲ Χριστὸς ἐξέπεμψε τῷ κόσμῳ, τὴν τῶν δαιμόνων καταπατοῦντα ἰσχύν, καὶ ψυχὰς φωτίζοντα Πιστῶν, πάντων τῶν ὑμνούντων σε, τῆς εἰρήνης τὸν κήρυκα.
ltx/gr_gr_cog/me.m11.d16:meMA.Ode5C1T.incipit	Παρθένος γεγέννηκεν, Υἱὸν τὸν προαιώνιον…
ltx/gr_gr_cog/me.m11.d16:meMA.Ode5C1T.melody	@ltx/gr_gr_cog/he.h.m4:heHE.ExestiTaSympanta.name
ltx/gr_gr_cog/me.m11.d16:meMA.Ode5C1T.mode	@ltx/gr_gr_cog/miscellanea:misc.Mode4
ltx/gr_gr_cog/me.m11.d16:meMA.Ode5C1T.ode	@ltx/gr_gr_cog/miscellanea:misc.Ode5
ltx/gr_gr_cog/me.m11.d16:meMA.Ode5C1T.text	Παρθένος γεγέννηκεν, Υἱὸν τὸν προαιώνιον, φύσιν ἐνδυσάμενον ἀνθρώπων, ὡς ἐκδιδάσκων ὁ θεηγόρος φησί, καὶ σώσαντα ταύτην ἐκ φθορᾶς, πάθει τῷ τοῦ σώματος, καὶ Παρθένος διέμεινεν.
ltx/gr_gr_cog/me.m11.d16:meMA.Ode6C11.greekmelody	@ltx/gr_gr_cog/he.h.m4:heHE.IlthonEisTaVathi.greekname
ltx/gr_gr_cog/me.m11.d16:meMA.Ode6C11.incipit	Εὐαγγελιστὴς ἀπὸ τελώνου, ὡς ἠκολούθησέ…
ltx/gr_gr_cog/me.m11.d16:meMA.Ode6C11.melody	@ltx/gr_gr_cog/he.h.m4:heHE.IlthonEisTaVathi.name
ltx/gr_gr_cog/me.m11.d16:meMA.Ode6C11.mode	@ltx/gr_gr_cog/miscellanea:misc.Mode4
ltx/gr_gr_cog/me.m11.d16:meMA.Ode6C11.ode	@ltx/gr_gr_cog/miscellanea:misc.Ode6
ltx/gr_gr_cog/me.m11.d16:meMA.Ode6C11.text	Εὐαγγελιστὴς ἀπὸ τελώνου, ὡς ἠκολούθησέ σοι, μετεσκεύασται ὁ θεηγόρος, τῇ παναλκεῖ Παντουργὲ δυνάμει σου, ὁ Ματθαῖος ὁ πανάριστος.
ltx/gr_gr_cog/me.m11.d16:meMA.Ode6C12.incipit	Ῥυθμίζεται τοῦ Εὐαγγελίου, τοῖς ψυχοτρόφοις…
ltx/gr_gr_cog/me.m11.d16:meMA.Ode6C12.melody	@ltx/gr_gr_cog/he.h.m4:heHE.IlthonEisTaVathi.name
ltx/gr_gr_cog/me.m11.d16:meMA.Ode6C12.mode	@ltx/gr_gr_cog/miscellanea:misc.Mode4
ltx/gr_gr_cog/me.m11.d16:meMA.Ode6C12.ode	@ltx/gr_gr_cog/miscellanea:misc.Ode6
ltx/gr_gr_cog/me.m11.d16:meMA.Ode6C12.text	Ῥυθμίζεται τοῦ Εὐαγγελίου, τοῖς ψυχοτρόφοις λόγοις, τῶν ἐθνῶν πληθὺς ἀνυψουμένη, πρὸς ἀρετῶν ὑψηλῶν ἀκρότητα, ὦ Ματθαῖε παμμακάριστε.
ltx/gr_gr_cog/me.m11.d16:meMA.Ode6C13.incipit	Ματθαίου ζωγρεῖται θεοπλόκοις, τοῦ Μαθητοῦ…
ltx/gr_gr_cog/me.m11.d16:meMA.Ode6C13.melody	@ltx/gr_gr_cog/he.h.m4:heHE.IlthonEisTaVathi.name
ltx/gr_gr_cog/me.m11.d16:meMA.Ode6C13.mode	@ltx/gr_gr_cog/miscellanea:misc.Mode4
ltx/gr_gr_cog/me.m11.d16:meMA.Ode6C13.ode	@ltx/gr_gr_cog/miscellanea:misc.Ode6
ltx/gr_gr_cog/me.m11.d16:meMA.Ode6C13.text	Ματθαίου ζωγρεῖται θεοπλόκοις, τοῦ Μαθητοῦ δικτύοις, τὰ συστήματα τῶν πιστευόντων, διὰ παντὸς πρὸς τὴν σὴν ἐπίγνωσιν, Εὐεργέτα ποδηγούμενα.
ltx/gr_gr_cog/me.m11.d16:meMA.Ode6C1T.incipit	Παρθένον τεκοῦσαν ἀναγράφων, εὐαγγελίζεταί σε…
ltx/gr_gr_cog/me.m11.d16:meMA.Ode6C1T.melody	@ltx/gr_gr_cog/he.h.m4:heHE.IlthonEisTaVathi.name
ltx/gr_gr_cog/me.m11.d16:meMA.Ode6C1T.mode	@ltx/gr_gr_cog/miscellanea:misc.Mode4
ltx/gr_gr_cog/me.m11.d16:meMA.Ode6C1T.ode	@ltx/gr_gr_cog/miscellanea:misc.Ode6
ltx/gr_gr_cog/me.m11.d16:meMA.Ode6C1T.text	Παρθένον τεκοῦσαν ἀναγράφων, εὐαγγελίζεταί σε, τὸν τὰ σύμπαντα πεποιηκότα, ἄνευ σπορᾶς καὶ φθορᾶς Πανάμωμε, ὁ Ματθαῖος ὁ πανάριστος.
ltx/gr_gr_cog/me.m11.d16:meMA.Ode6H.greekmelody	@ltx/gr_gr_cog/he.h.m4:heHE.IlthonEisTaVathi.greekname
ltx/gr_gr_cog/me.m11.d16:meMA.Ode6H.incipit	@ltx/gr_gr_cog/he.h.m4:heHE.IlthonEisTaVathi.incipit
ltx/gr_gr_cog/me.m11.d16:meMA.Ode6H.melody	@ltx/gr_gr_cog/he.h.m4:heHE.IlthonEisTaVathi.melody
ltx/gr_gr_cog/me.m11.d16:meMA.Ode6H.mode	@ltx/gr_gr_cog/miscellanea:misc.Mode4
ltx/gr_gr_cog/me.m11.d16:meMA.Ode6H.ode	@ltx/gr_gr_cog/miscellanea:misc.Ode6
ltx/gr_gr_cog/me.m11.d16:meMA.Ode6H.text	@ltx/gr_gr_cog/he.h.m4:heHE.IlthonEisTaVathi.text
ltx/gr_gr_cog/me.m11.d16:meMA.Ode7C11.greekmelody	@ltx/gr_gr_cog/he.h.m4:heHE.OukElatrefsan.greekname
ltx/gr_gr_cog/me.m11.d16:meMA.Ode7C11.incipit	Ἐχρημάτισας τοῦ πρώτου ἀπαυγάσματος, θεῖον…
ltx/gr_gr_cog/me.m11.d16:meMA.Ode7C11.melody	@ltx/gr_gr_cog/he.h.m4:heHE.OukElatrefsan.name
ltx/gr_gr_cog/me.m11.d16:meMA.Ode7C11.mode	@ltx/gr_gr_cog/miscellanea:misc.Mode4
ltx/gr_gr_cog/me.m11.d16:meMA.Ode7C11.ode	@ltx/gr_gr_cog/miscellanea:misc.Ode7
ltx/gr_gr_cog/me.m11.d16:meMA.Ode7C11.text	Ἐχρημάτισας τοῦ πρώτου ἀπαυγάσματος, θεῖον ἐκτύπωμα, ὡς Μαθητὴς ταῖς αὐτοῦ, ἀκτῖσι πυρσούμενος, ᾧ ψάλλων ἔλεγες· Ὑπερύμνητε, ὁ τῶν Πατέρων Κύριος, καὶ Θεός εὐλογητὸς εἶ.
ltx/gr_gr_cog/me.m11.d16:meMA.Ode7C12.incipit	Ὡς διάκονον τοῦ λόγου Παμμακάριστε…
ltx/gr_gr_cog/me.m11.d16:meMA.Ode7C12.melody	@ltx/gr_gr_cog/he.h.m4:heHE.OukElatrefsan.name
ltx/gr_gr_cog/me.m11.d16:meMA.Ode7C12.mode	@ltx/gr_gr_cog/miscellanea:misc.Mode4
ltx/gr_gr_cog/me.m11.d16:meMA.Ode7C12.ode	@ltx/gr_gr_cog/miscellanea:misc.Ode7
ltx/gr_gr_cog/me.m11.d16:meMA.Ode7C12.text	Ὡς διάκονον τοῦ λόγου Παμμακάριστε, θείοις σκηνώμασιν, ὅπου Χριστὸς κατοικεῖ, ἐκεῖ σε κατῴκισεν, ὡς σοὶ ὑπέσχετο, ὁ ὑπέρθεος, ὁ τῶν Πατέρων Κύριος, καὶ Θεὸς μόνος τῶν ὅλων.
ltx/gr_gr_cog/me.m11.d16:meMA.Ode7C13.incipit	Τὰ νοσήματα Ματθαῖε φυγαδεύονται, καὶ…
ltx/gr_gr_cog/me.m11.d16:meMA.Ode7C13.melody	@ltx/gr_gr_cog/he.h.m4:heHE.OukElatrefsan.name
ltx/gr_gr_cog/me.m11.d16:meMA.Ode7C13.mode	@ltx/gr_gr_cog/miscellanea:misc.Mode4
ltx/gr_gr_cog/me.m11.d16:meMA.Ode7C13.ode	@ltx/gr_gr_cog/miscellanea:misc.Ode7
ltx/gr_gr_cog/me.m11.d16:meMA.Ode7C13.text	Τὰ νοσήματα Ματθαῖε φυγαδεύονται, καὶ δραπετεύουσιν, ἡ τῶν δαιμόνων πληθύς, τοῖς ἐν σοὶ χαρίσμασι, τοῦ θείου Πνεύματος, ἐν οἷς ἔψαλλες, ὁ τῶν Πατέρων Κύριος, καὶ Θεὸς εὐλογητὸς εἶ.
ltx/gr_gr_cog/me.m11.d16:meMA.Ode7C1T.incipit	Τὴν πανύμνητον Παρθένον ἐξιστόρησας, τοῖς…
ltx/gr_gr_cog/me.m11.d16:meMA.Ode7C1T.melody	@ltx/gr_gr_cog/he.h.m4:heHE.OukElatrefsan.name
ltx/gr_gr_cog/me.m11.d16:meMA.Ode7C1T.mode	@ltx/gr_gr_cog/miscellanea:misc.Mode4
ltx/gr_gr_cog/me.m11.d16:meMA.Ode7C1T.ode	@ltx/gr_gr_cog/miscellanea:misc.Ode7
ltx/gr_gr_cog/me.m11.d16:meMA.Ode7C1T.text	Τὴν πανύμνητον Παρθένον ἐξιστόρησας, τοῖς θείοις λόγοις σου, τὸν Ποιητὴν τοῦ παντός, τεκοῦσαν Ἀπόστολε, ᾧ πάντες ψάλλομεν· Ὑπερύμνητε, ὁ τῶν Πατέρων Κύριος, καὶ Θεὸς εὐλογητὸς εἶ.
ltx/gr_gr_cog/me.m11.d16:meMA.Ode8C11.greekmelody	@ltx/gr_gr_cog/he.h.m4:heHE.PaidasEvageis.greekname
ltx/gr_gr_cog/me.m11.d16:meMA.Ode8C11.incipit	Νεύσεσι πρὸς σὲ ταῖς ἀνενδότοις…
ltx/gr_gr_cog/me.m11.d16:meMA.Ode8C11.melody	@ltx/gr_gr_cog/he.h.m4:heHE.PaidasEvageis.name
ltx/gr_gr_cog/me.m11.d16:meMA.Ode8C11.mode	@ltx/gr_gr_cog/miscellanea:misc.Mode4
ltx/gr_gr_cog/me.m11.d16:meMA.Ode8C11.ode	@ltx/gr_gr_cog/miscellanea:misc.Ode8
ltx/gr_gr_cog/me.m11.d16:meMA.Ode8C11.text	Νεύσεσι πρὸς σὲ ταῖς ἀνενδότοις Ματθαῖος ὁ ἱερώτατος θεούμενος, θέσει χρηματίσας τε, φύσει ὅπερ πέφυκας, τὴν οἰκουμένην Δέσποτα, εἵλκυσε ψάλλειν σοι. Τόν Κύριον ὑμνεῖτε τὰ ἔργα, καὶ ὑπερυψοῦτε, εἰς πάντας τοὺς αἰῶνας.
ltx/gr_gr_cog/me.m11.d16:meMA.Ode8C12.incipit	Ὥσπερ ἀστραπὴν τῇ οἰκουμένῃ, ὁ…
ltx/gr_gr_cog/me.m11.d16:meMA.Ode8C12.melody	@ltx/gr_gr_cog/he.h.m4:heHE.PaidasEvageis.name
ltx/gr_gr_cog/me.m11.d16:meMA.Ode8C12.mode	@ltx/gr_gr_cog/miscellanea:misc.Mode4
ltx/gr_gr_cog/me.m11.d16:meMA.Ode8C12.ode	@ltx/gr_gr_cog/miscellanea:misc.Ode8
ltx/gr_gr_cog/me.m11.d16:meMA.Ode8C12.text	Ὥσπερ ἀστραπὴν τῇ οἰκουμένῃ, ὁ Λόγος τὸν Θεολόγον ἐξαπέστειλε, ζόφον μὲν διώκοντα, ἔθνη δὲ φωτίζοντα, θεολογίας δόγμασιν· ὅθεν καὶ ἔψαλλε· Τὸν Κύριον ὑμνεῖτε τὰ ἔργα, καὶ ὑπερυψοῦτε, εἰς πάντας τοὺς αἰῶνας.
ltx/gr_gr_cog/me.m11.d16:meMA.Ode8C13.incipit	Λόγῳ καθαρῷ καὶ διανοίᾳ, Θεῷ…
ltx/gr_gr_cog/me.m11.d16:meMA.Ode8C13.melody	@ltx/gr_gr_cog/he.h.m4:heHE.PaidasEvageis.name
ltx/gr_gr_cog/me.m11.d16:meMA.Ode8C13.mode	@ltx/gr_gr_cog/miscellanea:misc.Mode4
ltx/gr_gr_cog/me.m11.d16:meMA.Ode8C13.ode	@ltx/gr_gr_cog/miscellanea:misc.Ode8
ltx/gr_gr_cog/me.m11.d16:meMA.Ode8C13.text	Λόγῳ καθαρῷ καὶ διανοίᾳ, Θεῷ σοι προσομιλῆσαι ἐξεγένετο· ὕλην γὰρ ὡς ἔτεμες, τούτῳ προσεπέλασας, καὶ συνεκράθης, Ἔνδοξε· ὅθεν καὶ ἔψαλλες· Τὸν Κύριον ὑμνεῖτε τὰ ἔργα, καὶ ὑπερυψοῦτε, εἰς πάντας τοὺς αἰῶνας.
ltx/gr_gr_cog/me.m11.d16:meMA.Ode8C1T.incipit	Ἐπʼ εὐεργεσίᾳ τῶν ἀνθρώπων, ὁ…
ltx/gr_gr_cog/me.m11.d16:meMA.Ode8C1T.melody	@ltx/gr_gr_cog/he.h.m4:heHE.PaidasEvageis.name
ltx/gr_gr_cog/me.m11.d16:meMA.Ode8C1T.mode	@ltx/gr_gr_cog/miscellanea:misc.Mode4
ltx/gr_gr_cog/me.m11.d16:meMA.Ode8C1T.ode	@ltx/gr_gr_cog/miscellanea:misc.Ode8
ltx/gr_gr_cog/me.m11.d16:meMA.Ode8C1T.text	Ἐπʼ εὐεργεσίᾳ τῶν ἀνθρώπων, ὁ Λόγος σωματωθῆναι κατηξίωσε· πύλην παρθενίας γάρ, ὥδευσεν ὁ Κύριος, καὶ Θεοτόκον ἔδειξε· διὸ κραυγάζομεν. Τὸν Κύριον ὑμνεῖτε τὰ ἔργα, καὶ ὑπερυψοῦτε, εἰς πάντας τους αἰῶνας.
ltx/gr_gr_cog/me.m11.d16:meMA.Ode8H.greekmelody	@ltx/gr_gr_cog/he.h.m4:heHE.PaidasEvageis.greekname
ltx/gr_gr_cog/me.m11.d16:meMA.Ode8H.incipit	@ltx/gr_gr_cog/he.h.m4:heHE.PaidasEvageis.incipit
ltx/gr_gr_cog/me.m11.d16:meMA.Ode8H.melody	@ltx/gr_gr_cog/he.h.m4:heHE.PaidasEvageis.melody
ltx/gr_gr_cog/me.m11.d16:meMA.Ode8H.mode	@ltx/gr_gr_cog/miscellanea:misc.Mode4
ltx/gr_gr_cog/me.m11.d16:meMA.Ode8H.ode	@ltx/gr_gr_cog/miscellanea:misc.Ode8
ltx/gr_gr_cog/me.m11.d16:meMA.Ode8H.text	@ltx/gr_gr_cog/he.h.m4:heHE.PaidasEvageis.text
ltx/gr_gr_cog/me.m11.d16:meMA.Ode9C11.greekmelody	@ltx/gr_gr_cog/he.h.m4:heHE.ApasGigenis.greekname
ltx/gr_gr_cog/me.m11.d16:meMA.Ode9C11.incipit	Κάλλους νοητοῦ, ἐδέξω διάδημα, θεῖον…
ltx/gr_gr_cog/me.m11.d16:meMA.Ode9C11.melody	@ltx/gr_gr_cog/he.h.m4:heHE.ApasGigenis.name
ltx/gr_gr_cog/me.m11.d16:meMA.Ode9C11.mode	@ltx/gr_gr_cog/miscellanea:misc.Mode4
ltx/gr_gr_cog/me.m11.d16:meMA.Ode9C11.ode	@ltx/gr_gr_cog/miscellanea:misc.Ode9
ltx/gr_gr_cog/me.m11.d16:meMA.Ode9C11.text	Κάλλους νοητοῦ, ἐδέξω διάδημα, θεῖον Ἀπόστολε, καὶ τῆς βασιλείας δέ, εὐπρεπεστάτῳ στέφει κεκόσμησαι, χειρὶ τοῦ Παντοκράτορος, καὶ διαλάμπεις σοφέ, σὺν Ἀγγέλοις, θρόνῳ παριστάμενος, τοῦ Δεσπότου Χριστοῦ παμμακάριστε.
ltx/gr_gr_cog/me.m11.d16:meMA.Ode9C12.incipit	Ξύλου τῆς ζωῆς, ἀξίως τετύχηκας…
ltx/gr_gr_cog/me.m11.d16:meMA.Ode9C12.melody	@ltx/gr_gr_cog/he.h.m4:heHE.ApasGigenis.name
ltx/gr_gr_cog/me.m11.d16:meMA.Ode9C12.mode	@ltx/gr_gr_cog/miscellanea:misc.Mode4
ltx/gr_gr_cog/me.m11.d16:meMA.Ode9C12.ode	@ltx/gr_gr_cog/miscellanea:misc.Ode9
ltx/gr_gr_cog/me.m11.d16:meMA.Ode9C12.text	Ξύλου τῆς ζωῆς, ἀξίως τετύχηκας, κήρυξ τοῦ ζῶντος Θεοῦ, εὐαγγελισάμενος, ζωῆς τῷ κόσμῳ θείαν ἐπίσκεψιν· τῷ γὰρ φυτῷ τῆς γνώσεως, οὐ διεφθάρης τὸν νοῦν, διαμείνας, ἄσειστος ἀκράδαντος, Ἐκκλησίας κρηπὶς παμμακάριστε.
ltx/gr_gr_cog/me.m11.d16:meMA.Ode9C13.incipit	Νύμφην τοῦ Χριστοῦ, ἐνθέως ἐκόσμησας…
ltx/gr_gr_cog/me.m11.d16:meMA.Ode9C13.melody	@ltx/gr_gr_cog/he.h.m4:heHE.ApasGigenis.name
ltx/gr_gr_cog/me.m11.d16:meMA.Ode9C13.mode	@ltx/gr_gr_cog/miscellanea:misc.Mode4
ltx/gr_gr_cog/me.m11.d16:meMA.Ode9C13.ode	@ltx/gr_gr_cog/miscellanea:misc.Ode9
ltx/gr_gr_cog/me.m11.d16:meMA.Ode9C13.text	Νύμφην τοῦ Χριστοῦ, ἐνθέως ἐκόσμησας, Εὐαγγελίῳ σου, ὥσπερ διαδήματι, τὴν Ἐκκλησίαν θεομακάριστε, καὶ νῦν τὴν θείαν μνήμην σου, πανηγυρίζει φαιδρῶς, ἥν ῥυσθῆναι, πάσης περιστάσεως, καὶ κινδύνων δεινῶν καθικέτευε.
ltx/gr_gr_cog/me.m11.d16:meMA.Ode9C1T.incipit	Κόλπων οὐκ ἐκστάς, ἀνάρχου Γεννήτορος…
ltx/gr_gr_cog/me.m11.d16:meMA.Ode9C1T.melody	@ltx/gr_gr_cog/he.h.m4:heHE.ApasGigenis.name
ltx/gr_gr_cog/me.m11.d16:meMA.Ode9C1T.mode	@ltx/gr_gr_cog/miscellanea:misc.Mode4
ltx/gr_gr_cog/me.m11.d16:meMA.Ode9C1T.ode	@ltx/gr_gr_cog/miscellanea:misc.Ode9
ltx/gr_gr_cog/me.m11.d16:meMA.Ode9C1T.text	Κόλπων οὐκ ἐκστάς, ἀνάρχου Γεννήτορος, Λόγος ὁ ἄναρχος, ὡς εὐαγγελίζεται, Ματθαῖος γράφων, Θεὸς σεσάρκωται, ἐκ σοῦ Ἁγνὴ πανύμνητε, τὴν τῶν ἀνθρώπων μορφήν, ὁλοτρόπως, πᾶσαν ἐνδυσάμενος, καὶ τὰ ταύτης λαβὼν ἰδιώματα.
ltx/gr_gr_cog/me.m11.d16:meMA.Ode9H.greekmelody	@ltx/gr_gr_cog/he.h.m4:heHE.ApasGigenis.greekname
ltx/gr_gr_cog/me.m11.d16:meMA.Ode9H.incipit	@ltx/gr_gr_cog/he.h.m4:heHE.ApasGigenis.incipit
ltx/gr_gr_cog/me.m11.d16:meMA.Ode9H.melody	@ltx/gr_gr_cog/he.h.m4:heHE.ApasGigenis.melody
ltx/gr_gr_cog/me.m11.d16:meMA.Ode9H.mode	@ltx/gr_gr_cog/miscellanea:misc.Mode4
ltx/gr_gr_cog/me.m11.d16:meMA.Ode9H.ode	@ltx/gr_gr_cog/miscellanea:misc.Ode9
ltx/gr_gr_cog/me.m11.d16:meMA.Ode9H.text	@ltx/gr_gr_cog/he.h.m4:heHE.ApasGigenis.text
ltx/gr_gr_cog/me.m11.d16:meMA.Oikos1.text	Ἡ τοῦ ἐχθροῦ με τυραννὶς βιάζεται ἀπλήστως, καὶ τῆς ψυχῆς μου ὅλον τὸν σπόρον καθαρπάζει, Ματθαῖε φίλε τοῦ Χριστοῦ· ἀλλʼ αὐτὸς τὸν σπόρον τῶν εὐχῶν σου δεδωκώς, πρὸς σὴν δουλείαν κάρπωσον, καὶ δεῖξον ὑμνῳδόν σου σμικρότατον, καὶ ὑφηγητήν με τῶν πολλῶν σου καὶ μεγάλων κατορθωμάτων, καὶ τῆς πρὸς Χριστόν σου σχέσεως, τὰ πάντα παρευθὺς ἐγκαταλείψας, ἠκολούθησας θερμῶς τῷ κεκληκότι, πρῶτος γεγονὼς Εὐαγγελιστὴς ἐν τῷ κόσμῳ, καθυπογράψας τὴν ὥραν τῆς κρίσεως.
ltx/gr_gr_cog/me.m11.d16:meVE.Apolytikion2ger.greekmelody	@ltx/gr_gr_cog/he.a.m3:heAU.TheiasPisteos.greekname
ltx/gr_gr_cog/me.m11.d16:meVE.Apolytikion2ger.incipit	Θείας ἤκουσας, φωνῆς τοῦ Λόγου…
ltx/gr_gr_cog/me.m11.d16:meVE.Apolytikion2ger.melody	@ltx/gr_gr_cog/he.a.m3:heAU.TheiasPisteos.name
ltx/gr_gr_cog/me.m11.d16:meVE.Apolytikion2ger.mode	@ltx/gr_gr_cog/miscellanea:misc.Mode3
ltx/gr_gr_cog/me.m11.d16:meVE.Apolytikion2ger.poet	@ltx/gr_gr_cog/poets:po.Gerasimou
ltx/gr_gr_cog/me.m11.d16:meVE.Apolytikion2ger.text	Θείας ἤκουσας, φωνῆς τοῦ Λόγου, καὶ τῆς πίστεως, τὸ φῶς ἐκέξω, καταλείψας τελωνείου τὸν σύνδεσμον· ὅθεν Χριστοῦ τὴν ἀπόῤῥητον κένωσιν, εὐηγγελίσω Ματθαῖε Ἀπόστολε. Καὶ νῦν πρέσβευε, δοθῆναι τοῖς σὲ γεραίρουσι, πταισμάτων ἱλασμὸν καὶ μέγα ἔλεος.
ltx/gr_gr_cog/me.m11.d16:meVE.AposGlory.incipit	Ἐκ πυθμένος κακίας ἐσχάτης, πρὸς…
ltx/gr_gr_cog/me.m11.d16:meVE.AposGlory.melody	
ltx/gr_gr_cog/me.m11.d16:meVE.AposGlory.mode	@ltx/gr_gr_cog/miscellanea:misc.Mode6
ltx/gr_gr_cog/me.m11.d16:meVE.AposGlory.text	Ἐκ πυθμένος κακίας ἐσχάτης, πρὸς ἀκρότατον ὕψος ἀρετῆς, ὡς ἀετὸς ὑψιπέτης, παραδόξως ἀνέδραμες, Ματθαῖε πανεύφημε· τοῦ γὰρ καλύψαντος οὐρανοὺς ἀρετῇ, καὶ τῆς συνέσεως αὐτοῦ πᾶσαν τὴν γῆν πληρώσαντος, Χριστοῦ ἀκολουθήσας τοῖς ἴχνεσι, μιμητὴς διάπυρος ἐν πᾶσιν αὐτοῦ πεφανέρωσαι, εὐαγγελιζόμενος εἰρήνην, ζωήν καὶ σωτηρίαν, τοῖς πειθαρχοῦσιν εὐσεβῶς, τοῖς θείοις προστάγμασιν, ἐν οἷς ἡμᾶς καθοδήγησον, εὐαρεστοῦντας τῷ Κτίστῃ, καὶ σὲ μακαρίζοντας.
ltx/gr_gr_cog/me.m11.d16:meVE.AposTheotokion.incipit	@ltx/gr_gr_cog/he.o:heOT.TheotokeSyEi.incipit
ltx/gr_gr_cog/me.m11.d16:meVE.AposTheotokion.melody	@ltx/gr_gr_cog/he.o:heOT.TheotokeSyEi.name
ltx/gr_gr_cog/me.m11.d16:meVE.AposTheotokion.mode	@ltx/gr_gr_cog/miscellanea:misc.Mode6
ltx/gr_gr_cog/me.m11.d16:meVE.AposTheotokion.text	@ltx/gr_gr_cog/he.o:heOT.TheotokeSyEiApostolou.text
ltx/gr_gr_cog/me.m11.d16:meVE.Aposticha1.greekmelody	@ltx/gr_gr_cog/he.a.m4:heAU.OsGennaionEnMartysi.greekname
ltx/gr_gr_cog/me.m11.d16:meVE.Aposticha1.incipit	Τῇ τῶν λόγων σου σάλπιγγι…
ltx/gr_gr_cog/me.m11.d16:meVE.Aposticha1.melody	@ltx/gr_gr_cog/he.a.m4:heAU.OsGennaionEnMartysi.name
ltx/gr_gr_cog/me.m11.d16:meVE.Aposticha1.mode	@ltx/gr_gr_cog/miscellanea:misc.Mode4
ltx/gr_gr_cog/me.m11.d16:meVE.Aposticha1.text	Τῇ τῶν λόγων σου σάλπιγγι, τοὺς ἀνθρώπους συνήθροισας, εἰς Θεοῦ ἐπίγνωσιν Παναοίδιμε, καὶ τὰ τῆς πλάνης ἀθροίσματα, ἐκ γῆς ἀπεσόβησας, καὶ εἰς μίαν τοὺς πιστούς, τὴν ὁμόνοιαν ἴθυνας, καὶ πρεσβεύεις νῦν, ἐκ φθορᾶς καὶ κινδύνων λυτρωθῆναι, τοὺς ἐν πίστει ἐκτελοῦντας, τὴν ἀεισέβαστον μνήμην σου.
ltx/gr_gr_cog/me.m11.d16:meVE.Aposticha2.incipit	Ὁ ἐν γλώσσῃ πυρίνῃ σε…
ltx/gr_gr_cog/me.m11.d16:meVE.Aposticha2.melody	@ltx/gr_gr_cog/he.a.m4:heAU.OsGennaionEnMartysi.name
ltx/gr_gr_cog/me.m11.d16:meVE.Aposticha2.mode	@ltx/gr_gr_cog/miscellanea:misc.Mode4
ltx/gr_gr_cog/me.m11.d16:meVE.Aposticha2.text	Ὁ ἐν γλώσσῃ πυρίνῃ σε, καθοπλίσας τοῦ Πνεύματος, κραταιὸν ἀνέδειξε πολεμήτορα, κατὰ τῆς πλάνης Ἀπόστολε, Χριστὸς ὁ Θεὸς ἡμῶν, παρʼ οὗ ἔλαβες λαμπρά, τὰ βραβεῖα τῆς χάριτος, ὃν ἱκέτευε, ἐκ φθορᾶς καὶ κινδύνων λυτρωθῆναι, τοὺς ἐν πίστει ἐκτελοῦντας, τὴν ἀεισέβαστον μνήμην σου.
ltx/gr_gr_cog/me.m11.d16:meVE.Aposticha3.incipit	Εἰς τὰ βάθη τοῦ Πνεύματος…
ltx/gr_gr_cog/me.m11.d16:meVE.Aposticha3.melody	@ltx/gr_gr_cog/he.a.m4:heAU.OsGennaionEnMartysi.name
ltx/gr_gr_cog/me.m11.d16:meVE.Aposticha3.mode	@ltx/gr_gr_cog/miscellanea:misc.Mode4
ltx/gr_gr_cog/me.m11.d16:meVE.Aposticha3.text	Εἰς τὰ βάθη τοῦ Πνεύματος, διακύψας Ἀπόστολε, πλοῦτον τὸν ἀκένωτον κατενόησας, καὶ ἐξ αὐτοῦ ἀρυσάμενος, τὴν χάριν τὴν ἄφθονον, ἡμῖν εὐαγγελικῶς, πᾶσι ταύτην διένειμας, καὶ πρεσβεύεις νῦν, ἐκ φθορᾶς καὶ κινδύνων λυτρωθῆναι, τοὺς ἐν πίστει ἐκτελοῦντας, τὴν ἀεισέβαστον μνήμην σου.
ltx/gr_gr_cog/me.m11.d16:meVE.GeneralApolytikion1.melody	@ltx/gr_gr_cog/he.ga:heGA.ApostoleAgie.name
ltx/gr_gr_cog/me.m11.d16:meVE.GeneralApolytikion1.mode	@ltx/gr_gr_cog/miscellanea:misc.Mode3
ltx/gr_gr_cog/me.m11.d16:meVE.GeneralApolytikion1.name	Ματθαῖε,
ltx/gr_gr_cog/me.m11.d16:meVE.MM.GeneralApolytikion1.text	
ltx/gr_gr_cog/me.m11.d16:meVE.MM.Stichera1123as78910.text	
ltx/gr_gr_cog/me.m11.d16:meVE.SticGlory.incipit	Καλοῦντι Χριστῷ, πρὸς μαθητείαν οὐράνιον…
ltx/gr_gr_cog/me.m11.d16:meVE.SticGlory.melody	
ltx/gr_gr_cog/me.m11.d16:meVE.SticGlory.mode	@ltx/gr_gr_cog/miscellanea:misc.Mode4
ltx/gr_gr_cog/me.m11.d16:meVE.SticGlory.text	Καλοῦντι Χριστῷ, πρὸς μαθητείαν οὐράνιον, προθύμως ἠκολούθησας θεόληπτε, πᾶσαν σχολὴν φροντίδος γηΐνης, ὑφʼ ἓν παρωσάμενος· ἐπαξίαν γὰρ τῆς ἄνω βασιλείας, γνώμην εὐπειθῶς ἀναλαβόμενος, τῆς χαμαιζήλου πολιτείας, καὶ δόξης κενῆς ἀπέστης, Εὐαγγελιστὴς ἀπὸ Τελώνου γενόμενος, φῶς τε τῶν ἐν σκότει χρηματίσας, καὶ πεπλανημένων ὁδηγὸς πρὸς σωτηρίαν· νῦν δὲ πρεσβευτὴς παντὸς τοῦ κόσμου θερμότατος, καὶ τῶν σὲ γεραιρόντων Ματθαῖε, φύλαξ σωτήριος.
ltx/gr_gr_cog/me.m11.d16:meVE.SticTheotokion.greekmelody	@ltx/gr_gr_cog/he.a.m4:heAU.OExYpsistouKlitheis.greekname
ltx/gr_gr_cog/me.m11.d16:meVE.SticTheotokion.incipit	Σωματωθέντα τὸν Κτίστην τῶν ἁπάντων…
ltx/gr_gr_cog/me.m11.d16:meVE.SticTheotokion.melody	@ltx/gr_gr_cog/he.a.m4:heAU.OExYpsistouKlitheis.name
ltx/gr_gr_cog/me.m11.d16:meVE.SticTheotokion.mode	@ltx/gr_gr_cog/miscellanea:misc.Mode4
ltx/gr_gr_cog/me.m11.d16:meVE.SticTheotokion.text	Σωματωθέντα τὸν Κτίστην τῶν ἁπάντων, ἔσχες ἐν τῇ μήτρᾳ σου, θεομακάριστε, ἀναμορφοῦντα τὸν ἄνθρωπον, τὸν πρὶν πεσόντα, τῇ παραβάσει διὰ τοῦ ὄφεως· Θεόν γὰρ ἐγέννησας, Λόγον ἀφράστως Ἁγνή, καὶ τῆς φθορᾶς ἠλευθέρωσας, τὴν φύσιν πᾶσαν, παλαιωθεῖσαν διὰ τοῦ τόκου σου· διὸ ὑμνοῦμεν καὶ δοξάζομεν, σοῦ τὴν χάριν Παρθένε ἀνύμφευτε, διʼ ἦς σκέπε καὶ σῷζε, τοὺς ἐν πίστει σὲ δοξάζοντας.
ltx/gr_gr_cog/me.m11.d16:meVE.Stichera01.greekmelody	@ltx/gr_gr_cog/he.a.m4:heAU.OExYpsistouKlitheis.greekname
ltx/gr_gr_cog/me.m11.d16:meVE.Stichera01.incipit	Ὁ ἐμβατεύων καρδίας τῶν ἀνθρώπων…
ltx/gr_gr_cog/me.m11.d16:meVE.Stichera01.melody	@ltx/gr_gr_cog/he.a.m4:heAU.OExYpsistouKlitheis.name
ltx/gr_gr_cog/me.m11.d16:meVE.Stichera01.mode	@ltx/gr_gr_cog/miscellanea:misc.Mode4
ltx/gr_gr_cog/me.m11.d16:meVE.Stichera01.text	Ὁ ἐμβατεύων καρδίας τῶν ἀνθρώπων, ὅτε σου τὴν ἔνθεον γνώμην Ἀπόστολε, θείᾳ προγνώσει ἑώρακε, καὶ ἐκ τοῦ κόσμου, τῆς ἀδικίας σὲ ἐλυτρώσατο, τότε σε παγκόσμιον, φῶς ἀπειργάσατο, τῆς οἰκουμένης τὰ πέρατα, καταφωτίζειν, καὶ διαλάμπειν ἐγκελευσάμενος, οὗ καὶ τὸ θεῖον Εὐαγγέλιον, ἠξιώθης σαφῶς ἀναγράψασθαι· ὃν ἱκέτευε σῶσαι, καὶ φωτίσαι τὰς ψυχὰς ἡμῶν.
ltx/gr_gr_cog/me.m11.d16:meVE.Stichera02.incipit	Ὁ ἐκ τελώνου κληθεὶς εἰς…
ltx/gr_gr_cog/me.m11.d16:meVE.Stichera02.melody	@ltx/gr_gr_cog/he.a.m4:heAU.OExYpsistouKlitheis.name
ltx/gr_gr_cog/me.m11.d16:meVE.Stichera02.mode	@ltx/gr_gr_cog/miscellanea:misc.Mode4
ltx/gr_gr_cog/me.m11.d16:meVE.Stichera02.text	Ὁ ἐκ τελώνου κληθεὶς εἰς μαθητείαν, ὅτε σε ὁ ἄναρχος Λόγος ἐφώνησεν, ἀκολουθεῖν προτρεπόμενος, καὶ κοινωνίαν, τῆς βασιλείας ἐπαγγειλάμενος, τότε Παμμακάριστε, πάντα ἀφέμενος, καὶ ταραχώδους συγχύσεως, ἀναχωρήσας, αὐτῷ συντόνως ἐπηκολούθησας· καὶ νῦν Θεόπτα ἐμφορούμενος, τῆς ἀφράστου αὐτοῦ θεωρίας τρανῶς, καθικέτευε σῶσαι, καὶ φωτίσαι τὰς ψυχὰς ἡμῶν.
ltx/gr_gr_cog/me.m11.d16:meVE.Stichera03.incipit	Προφητική τις σαφῶς ὀξυδερκία, πάλαι…
ltx/gr_gr_cog/me.m11.d16:meVE.Stichera03.melody	@ltx/gr_gr_cog/he.a.m4:heAU.OExYpsistouKlitheis.name
ltx/gr_gr_cog/me.m11.d16:meVE.Stichera03.mode	@ltx/gr_gr_cog/miscellanea:misc.Mode4
ltx/gr_gr_cog/me.m11.d16:meVE.Stichera03.text	Προφητική τις σαφῶς ὀξυδερκία, πάλαι μέν σε Ἅγιον, λίθον τεθέαται, ἐπὶ τῆς γῆς κυλιόμενον, καὶ τῆς ἀπάτης, τὰς ἑλεπόλεις καταλεαίνοντα· ὁ Λόγος δὲ πάνσοφε, ὁ ἐνυπόστατος, φῶς σε τοῦ κόσμου καὶ κήρυκα, δικαιοσύνης, καὶ ἀληθείας ἀποτετέλεκε, λελαμπρυσμένον ταῖς λαμπρότησι, τοῦ τρισηλίου φωτὸς Πανσεβάσμιε, ὃν ἱκέτευε σῶσαι, καὶ φωτίσαι τὰς ψυχὰς ἡμῶν.
