ltx/gr_gr_cog/pe.d078:alt1.peDA.commemoration.full	Μνήμη τῶν Ἁγίων Πέντε Ἐνδόξων Νεομαρτύρων τῆς Σαμοθράκης
ltx/gr_gr_cog/pe.d078:alt1.peVE.Apolytikion1.greekmelody	@ltx/gr_gr_cog/he.a.m1:heAU.TisErimouPolitis.greekname
ltx/gr_gr_cog/pe.d078:alt1.peVE.Apolytikion1.incipit	Σαμοθράκης λαμπτῆρες…
ltx/gr_gr_cog/pe.d078:alt1.peVE.Apolytikion1.melody	@ltx/gr_gr_cog/he.a.m1:heAU.TisErimouPolitis.name
ltx/gr_gr_cog/pe.d078:alt1.peVE.Apolytikion1.mode	@ltx/gr_gr_cog/miscellanea:misc.Mode1
ltx/gr_gr_cog/pe.d078:alt1.peVE.Apolytikion1.text	Σαμοθράκης λαμπτῆρες καὶ τῆς Μάκρης ἀγλάϊσμα, Νεομάρτυρες θεῖοι ἀληθῶς ἀνεδείχθητε, ἀθλήσαντες στερρῶς ὑπὲρ Χριστοῦ, καὶ λύσαντες τὴν πλάνην τοῦ ἐχθροῦ, Μανουὴλ σὺν Θεοδώρῳ καὶ Μιχαήλ, καὶ οἱ διττοὶ Γεώργιοι. Δόξα τῷ ἐνισχύσαντι ὑμᾶς. Δόξα τῷ στεφανώσαντι. Δόξα τῷ χορηγοῦντι δι’ ὑμῶν, ἡμῖν χάριν καὶ ἔλεος.
ltx/gr_gr_cog/pe.d078:peDA.commemoration.full	ΚΥΡΙΑΚΗ ΤΟΥ ΑΝΤΙΠΑΣΧΑ ΗΤΟΙ Η ΨΗΛΑΦΗΣΙΣ ΤΟΥ ΑΓΙΟΥ ΑΠΟΣΤΟΛΟΥ ΘΩΜΑ
ltx/gr_gr_cog/pe.d078:peDA.commemoration.short	Κυριακὴ τοῦ τοῦ Ἀντιπάσχα (τοῦ Θωμᾶ)
ltx/gr_gr_cog/pe.d078:peDA.dismissal	@ltx/gr_gr_cog/dismissals:dis00.resurrection
ltx/gr_gr_cog/pe.d078:peDA.insert1	τοῦ ἁγίου Ἀποστόλου Θωμᾶ,
ltx/gr_gr_cog/pe.d078:peDA.insert2	οὗ καὶ τὴν Ψηλάφησιν ἑορτάζομεν,
ltx/gr_gr_cog/pe.d078:peDA.note	
ltx/gr_gr_cog/pe.d078:peHO.commemorations	
ltx/gr_gr_cog/pe.d078:peHO.daytitle	
ltx/gr_gr_cog/pe.d078:peHO.description1	
ltx/gr_gr_cog/pe.d078:peHO.description2	
ltx/gr_gr_cog/pe.d078:peHO.note1	
ltx/gr_gr_cog/pe.d078:peHO.note2	
ltx/gr_gr_cog/pe.d078:peLI.Kontakion1.incipit	@ltx/gr_gr_cog/pe.d078:peMA.Kontakion1.incipit
ltx/gr_gr_cog/pe.d078:peLI.Kontakion1.melody	@ltx/gr_gr_cog/pe.d078:peMA.Kontakion1.melody
ltx/gr_gr_cog/pe.d078:peLI.Kontakion1.mode	@ltx/gr_gr_cog/pe.d078:peMA.Kontakion1.mode
ltx/gr_gr_cog/pe.d078:peLI.Kontakion1.text	@ltx/gr_gr_cog/pe.d078:peMA.Kontakion1.text
ltx/gr_gr_cog/pe.d078:peLI.MM.CommunionHymn.text	@ltx/gr_gr_cog/properties:media.key
ltx/gr_gr_cog/pe.d078:peLI.Megalynarion.text	Θυρῶν κεκλεισμένων τοῖς Μαθηταῖς, ἐπέστης Σωτήρ μου, τὴν εἰρήνη σου δοὺς αὐτοῖς· ὅθεν ὁ Θωμᾶς σε, δακτύλῳ ψηλαφήσας, ἐβόα· Σὺ Θεός μου πέλεις καὶ Κύριος.
ltx/gr_gr_cog/pe.d078:peLI.TheotokosHymn.incipit	@ltx/gr_gr_cog/pe.d078:peMA.Ode9C1H.incipit
ltx/gr_gr_cog/pe.d078:peLI.TheotokosHymn.mode	@ltx/gr_gr_cog/miscellanea:misc.Mode1
ltx/gr_gr_cog/pe.d078:peLI.TheotokosHymn.text	@ltx/gr_gr_cog/pe.d078:peMA.Ode9C1H.text
ltx/gr_gr_cog/pe.d078:peMA.C1.poet	@ltx/gr_gr_cog/poets:po.IoannouMonachou
ltx/gr_gr_cog/pe.d078:peMA.C1.title	@ltx/gr_gr_cog/titles:ti.CanonFeast
ltx/gr_gr_cog/pe.d078:peMA.C1.verse	@ltx/gr_gr_cog/prayers:pr.verse_Resurrection.text
ltx/gr_gr_cog/pe.d078:peMA.Exaposteilarion1.greekmelody	@ltx/gr_gr_cog/he.a.m3:heAU.OOuranonToisAstrois.greekname
ltx/gr_gr_cog/pe.d078:peMA.Exaposteilarion1.incipit	Ἐμῶν μελῶν χειρί σου, ἐξερευνήσας…
ltx/gr_gr_cog/pe.d078:peMA.Exaposteilarion1.melody	@ltx/gr_gr_cog/he.a.m3:heAU.OOuranonToisAstrois.name
ltx/gr_gr_cog/pe.d078:peMA.Exaposteilarion1.mode	@ltx/gr_gr_cog/miscellanea:misc.Mode3
ltx/gr_gr_cog/pe.d078:peMA.Exaposteilarion1.text	Ἐμῶν μελῶν χειρί σου, ἐξερευνήσας τὰς πληγάς, μή μοι Θωμᾶ ἀπιστήσῃς, τραυματισθέντι διὰ σέ, σὺν Μαθηταῖς ὁμοφρόνει, καὶ ζῶντα κήρυττε Θεόν.
ltx/gr_gr_cog/pe.d078:peMA.Exaposteilarion2.greekmelody	@ltx/gr_gr_cog/he.a.m3:heAU.OOuranonToisAstrois.greekname
ltx/gr_gr_cog/pe.d078:peMA.Exaposteilarion2.incipit	Σήμερον ἔαρ μυρίζει, καὶ καινὴ…
ltx/gr_gr_cog/pe.d078:peMA.Exaposteilarion2.melody	@ltx/gr_gr_cog/he.a.m3:heAU.OOuranonToisAstrois.name
ltx/gr_gr_cog/pe.d078:peMA.Exaposteilarion2.mode	@ltx/gr_gr_cog/miscellanea:misc.Mode3
ltx/gr_gr_cog/pe.d078:peMA.Exaposteilarion2.text	Σήμερον ἔαρ μυρίζει, καὶ καινὴ κτίσις χορεύει, σήμερον αἴρονται κλεῖθρα, θυρῶν καὶ τῆς ἀπιστίας, Θωμᾶ τοῦ φίλου βοῶντος· ὁ Κύριος καὶ Θεός μου.
ltx/gr_gr_cog/pe.d078:peMA.Hypakoe.incipit	@ltx/gr_gr_cog/oc.m6.d5:ocMA.Kathisma11.incipit
ltx/gr_gr_cog/pe.d078:peMA.Hypakoe.melody	
ltx/gr_gr_cog/pe.d078:peMA.Hypakoe.mode	@ltx/gr_gr_cog/miscellanea:misc.Mode6
ltx/gr_gr_cog/pe.d078:peMA.Hypakoe.text	@ltx/gr_gr_cog/oc.m6.d5:ocMA.Kathisma11.text
ltx/gr_gr_cog/pe.d078:peMA.Kathisma11.greekmelody	@ltx/gr_gr_cog/he.a.m1:heAU.TouLithouSfragisthentos.greekname
ltx/gr_gr_cog/pe.d078:peMA.Kathisma11.incipit	Τῷ φόβῳ τῶν Ἑβραίων, κεκρυμμένων…
ltx/gr_gr_cog/pe.d078:peMA.Kathisma11.melody	@ltx/gr_gr_cog/he.a.m1:heAU.TouLithouSfragisthentos.name
ltx/gr_gr_cog/pe.d078:peMA.Kathisma11.mode	@ltx/gr_gr_cog/miscellanea:misc.Mode1
ltx/gr_gr_cog/pe.d078:peMA.Kathisma11.text	Τῷ φόβῳ τῶν Ἑβραίων, κεκρυμμένων τῶν Μαθητῶν, καὶ ἐν τῇ Σιὼν συνηγμένων, εἰσῆλθες πρὸς αὐτοὺς Ἀγαθέ, καὶ ἔστης κεκλεισμένων τῶν θυρῶν, ἐν μέσῳ αὐτῶν χαροποιός καὶ ὑπέδειξας αὐτοῖς τὰς χεῖρας, καὶ τῆς ἀχράντου σου πλευρᾶς τοὺς μώλωπας, λέγων τῷ ἀπιστοῦντι Μαθητῇ· Φέρε τὴν χεῖρά σου καὶ ἐρεύνα, ὅτι αὐτὸς ἐγὼ εἰμί, ὁ διὰ σὲ παθητός.
ltx/gr_gr_cog/pe.d078:peMA.Kathisma21.greekmelody	@ltx/gr_gr_cog/he.a.m1:heAU.TonTafonSouSotir.greekname
ltx/gr_gr_cog/pe.d078:peMA.Kathisma21.incipit	Ἐπέστης ἡ ζωή, τῶν θυρῶν…
ltx/gr_gr_cog/pe.d078:peMA.Kathisma21.melody	@ltx/gr_gr_cog/he.a.m1:heAU.TonTafonSouSotir.name
ltx/gr_gr_cog/pe.d078:peMA.Kathisma21.mode	@ltx/gr_gr_cog/miscellanea:misc.Mode1
ltx/gr_gr_cog/pe.d078:peMA.Kathisma21.text	Ἐπέστης ἡ ζωή, τῶν θυρῶν κεκλεισμένων, Χριστὲ τοῖς Μαθηταῖς, καὶ πλευρὰν ὑπεδείκνυς, καὶ χεῖράς σου καὶ πόδας σου, τὴν ἐκ τάφου σου Ἔγερσιν, προπιστούμενος· ἀλλʼ ὁ Θωμᾶς οὐχ εὑρέθη· ὅθεν ἔλεγεν· Ἢν μὴ θεάσωμαι τοῦτον, οὐ πείθομαι τοῖς λόγοις ὑμῶν.
ltx/gr_gr_cog/pe.d078:peMA.Kathisma31.greekmelody	@ltx/gr_gr_cog/he.a.m1:heAU.TonTafonSouSotir.greekname
ltx/gr_gr_cog/pe.d078:peMA.Kathisma31.incipit	Ἰδών μου τὴν πλευρὰν καὶ…
ltx/gr_gr_cog/pe.d078:peMA.Kathisma31.melody	@ltx/gr_gr_cog/he.a.m1:heAU.TonTafonSouSotir.name
ltx/gr_gr_cog/pe.d078:peMA.Kathisma31.mode	@ltx/gr_gr_cog/miscellanea:misc.Mode1
ltx/gr_gr_cog/pe.d078:peMA.Kathisma31.text	Ἰδών μου τὴν πλευρὰν καὶ τὰς τρήσεις τῶν ἥλων, Θωμᾶ, τί ἀπιστεῖς, τῇ ἐμῇ Ἀναστάσει; ὁ Κύριος ἔλεγεν ἀναστὰς ἐκ τοῦ μνήματος, ὀπτανόμενος, τοῖς Ἀποστόλοις ἀῤῥήτως, ὁ δὲ Δίδυμος, πεισθεὶς ἐβόα τῷ κτίστῃ· Θεός μου εἶ καὶ Κύριος.
ltx/gr_gr_cog/pe.d078:peMA.Kontakion1.incipit	Τῇ φιλοπράγμονι δεξιᾷ, τὴν ζωοπάροχόν…
ltx/gr_gr_cog/pe.d078:peMA.Kontakion1.melody	
ltx/gr_gr_cog/pe.d078:peMA.Kontakion1.mode	@ltx/gr_gr_cog/miscellanea:misc.Mode8
ltx/gr_gr_cog/pe.d078:peMA.Kontakion1.text	Τῇ φιλοπράγμονι δεξιᾷ, τὴν ζωοπάροχόν σου πλευράν, ὁ Θωμᾶς ἐξηρεύνησε Χριστὲ ὁ Θεός· συγκεκλεισμένων γὰρ τῶν θυρῶν ὡς εἰσῆλθες, σὺν τοῖς λοιποῖς Ἀποστόλοις ἐβόα σοι· Κύριος ὑπάρχεις καὶ Θεός μου.
ltx/gr_gr_cog/pe.d078:peMA.Lauds1.greekmelody	@ltx/gr_gr_cog/he.a.m1:heAU.PaneffimoiMartyres.greekname
ltx/gr_gr_cog/pe.d078:peMA.Lauds1.incipit	Μετὰ τὴν ἐκ τάφου σου…
ltx/gr_gr_cog/pe.d078:peMA.Lauds1.melody	@ltx/gr_gr_cog/he.a.m1:heAU.PaneffimoiMartyres.name
ltx/gr_gr_cog/pe.d078:peMA.Lauds1.mode	@ltx/gr_gr_cog/miscellanea:misc.Mode1
ltx/gr_gr_cog/pe.d078:peMA.Lauds1.text	Μετὰ τὴν ἐκ τάφου σου φρικτήν, Ζωοδότα Ἔγερσιν, ὥσπερ σφραγῖδας οὐκ ἔλυσας, Χριστὲ τοῦ μνήματος οὕτω κεκλεισμένων, θυρῶν εἰσελήλυθας, πρὸς τοὺς πανευκλεεῖς Ἄποστόλους σου, χαροποιῶν αὐτούς, καὶ εὐθές σου παρεχόμενος, τούτοις Πνεῦμα, διʼ ἄμετρον ἔλεος.
ltx/gr_gr_cog/pe.d078:peMA.Lauds2.greekmelody	@ltx/gr_gr_cog/he.a.m1:heAU.PaneffimoiMartyres.greekname
ltx/gr_gr_cog/pe.d078:peMA.Lauds2.incipit	Θωμᾶς ὁ καὶ Δίδυμος οὐκ…
ltx/gr_gr_cog/pe.d078:peMA.Lauds2.melody	@ltx/gr_gr_cog/he.a.m1:heAU.PaneffimoiMartyres.name
ltx/gr_gr_cog/pe.d078:peMA.Lauds2.mode	@ltx/gr_gr_cog/miscellanea:misc.Mode1
ltx/gr_gr_cog/pe.d078:peMA.Lauds2.text	Θωμᾶς ὁ καὶ Δίδυμος οὐκ ἦν, ἐνδημῶν ἡνίκα σύ, τοῖς Μαθηταῖς ὤφθης Κύριε· ὅθεν ἠπίστησε, τῇ σῇ Ἀναστάσει, καὶ τοῖς κατιδοῦσί σε, ἐβόα· Εἰ μὴ βάλω τὸν δάκτυλον, εἰς τὴν πλευρὰν αὐτοῦ, καὶ τῶν ἥλων τὰ τυλώματα, οὐ πιστεύω, ὅτι ἐξεγήγερται.
ltx/gr_gr_cog/pe.d078:peMA.Lauds3.greekmelody	@ltx/gr_gr_cog/he.a.m1:heAU.PaneffimoiMartyres.greekname
ltx/gr_gr_cog/pe.d078:peMA.Lauds3.incipit	Ὡς θέλεις ψηλάφησον Χριστὸς τῷ…
ltx/gr_gr_cog/pe.d078:peMA.Lauds3.melody	@ltx/gr_gr_cog/he.a.m1:heAU.PaneffimoiMartyres.name
ltx/gr_gr_cog/pe.d078:peMA.Lauds3.mode	@ltx/gr_gr_cog/miscellanea:misc.Mode1
ltx/gr_gr_cog/pe.d078:peMA.Lauds3.text	Ὡς θέλεις ψηλάφησον Χριστὸς τῷ Θωμᾷ ἐβόησε· βάλε τὴν χεῖρα καὶ γνῶθί με ὀστέα ἔχοντα, καὶ γεῶδες σῶμα, καὶ μὴ γίνου ἄπιστος, ἐπίσης δὲ τοῖς ἄλλοις πιστώθητι, ὁ δὲ ἐβόησεν· ὁ Θεός μου καὶ ὁ Κύριος, σὺ ὑπάρχεις, δόξα τῇ Ἐγέρσει σου.
ltx/gr_gr_cog/pe.d078:peMA.LaudsGlory.incipit	Μεθʼ ἡμέρας ὀκτὼ τῆς Ἐγέρσεώς…
ltx/gr_gr_cog/pe.d078:peMA.LaudsGlory.melody	@ltx/gr_gr_cog/miscellanea:misc.Idiomelon
ltx/gr_gr_cog/pe.d078:peMA.LaudsGlory.mode	@ltx/gr_gr_cog/miscellanea:misc.Mode6
ltx/gr_gr_cog/pe.d078:peMA.LaudsGlory.text	Μεθʼ ἡμέρας ὀκτὼ τῆς Ἐγέρσεώς σου Ἰησοῦ Βασιλεῦ, μονογενὲς Λόγε τοῦ Πατρός, ὤφθης τοῖς Μαθηταῖς σου, κεκλεισμένων τῶν θυρῶν, τὴν εἰρήνην σου παρεχόμενος· καὶ τῷ ἀπιστοῦντι Μαθητῇ τοὺς τύπους ἔδειξας. Δεῦρο ψηλάφησον τὰς χεῖρας, καὶ τοὺς πόδας, καὶ τὴν ἀκήρατόν μου πλευράν· ὁ δὲ πεισθεὶς ἐβόα σοι· Ὁ Κύριός μου καὶ ὁ Θεός μου, δόξα σοι.
ltx/gr_gr_cog/pe.d078:peMA.MM.Lauds123as123.text	@ltx/gr_gr_cog/properties:media.key
ltx/gr_gr_cog/pe.d078:peMA.MM.Lauds123as345.text	@ltx/gr_gr_cog/properties:media.key
ltx/gr_gr_cog/pe.d078:peMA.MM.Lauds123as456.text	@ltx/gr_gr_cog/properties:media.key
ltx/gr_gr_cog/pe.d078:peMA.MM.Prokeimenon.text	@ltx/gr_gr_cog/properties:media.key
ltx/gr_gr_cog/pe.d078:peMA.Ode1C11.greekmelody	@ltx/gr_gr_cog/he.h.m1:heHE.AsomenPantesLaoi.greekname
ltx/gr_gr_cog/pe.d078:peMA.Ode1C11.incipit	Σήμερον ἔαρ ψυχῶν, ὅτι Χριστὸς…
ltx/gr_gr_cog/pe.d078:peMA.Ode1C11.melody	@ltx/gr_gr_cog/he.h.m1:heHE.AsomenPantesLaoi.name
ltx/gr_gr_cog/pe.d078:peMA.Ode1C11.mode	@ltx/gr_gr_cog/miscellanea:misc.Mode1
ltx/gr_gr_cog/pe.d078:peMA.Ode1C11.ode	@ltx/gr_gr_cog/miscellanea:misc.Ode1
ltx/gr_gr_cog/pe.d078:peMA.Ode1C11.text	Σήμερον ἔαρ ψυχῶν, ὅτι Χριστὸς ἐκ τάφου, ὥσπερ ἥλιος ἐκλάμψας τριήμερος, τὸν ζοφερὸν χειμῶνα ἀπήλασε τῆς ἁμαρτίας ἡμῶν, αὐτὸν ἀνυμνήσωμεν, ὅτι δεδόξασται.
ltx/gr_gr_cog/pe.d078:peMA.Ode1C12.incipit	Ἡ βασιλὶς τῶν ὡρῶν, τῇ…
ltx/gr_gr_cog/pe.d078:peMA.Ode1C12.melody	@ltx/gr_gr_cog/he.h.m1:heHE.AsomenPantesLaoi.name
ltx/gr_gr_cog/pe.d078:peMA.Ode1C12.mode	@ltx/gr_gr_cog/miscellanea:misc.Mode1
ltx/gr_gr_cog/pe.d078:peMA.Ode1C12.ode	@ltx/gr_gr_cog/miscellanea:misc.Ode1
ltx/gr_gr_cog/pe.d078:peMA.Ode1C12.text	Ἡ βασιλὶς τῶν ὡρῶν, τῇ λαμπροφόρῳ ἡμέρᾳ, ἡμερῶν τε βασιλίδι φανότατα, δορυφοροῦσα τέρπει, τὸν ἔγκριτον τῆς Ἐκκλησίας λαόν, ἀπαύστως ἀνυμνοῦσα, τὸν ἀναστάντα Χριστόν.
ltx/gr_gr_cog/pe.d078:peMA.Ode1C13.incipit	Πύλαι θανάτου Χριστέ, οὐδὲ τοῦ…
ltx/gr_gr_cog/pe.d078:peMA.Ode1C13.melody	@ltx/gr_gr_cog/he.h.m1:heHE.AsomenPantesLaoi.name
ltx/gr_gr_cog/pe.d078:peMA.Ode1C13.mode	@ltx/gr_gr_cog/miscellanea:misc.Mode1
ltx/gr_gr_cog/pe.d078:peMA.Ode1C13.ode	@ltx/gr_gr_cog/miscellanea:misc.Ode1
ltx/gr_gr_cog/pe.d078:peMA.Ode1C13.text	Πύλαι θανάτου Χριστέ, οὐδὲ τοῦ τάφου σφραγῖδες, οὐδὲ κλεῖθρα τῶν θυρῶν σοι ἀντέστησαν, ἀλλʼ ἐξαναστὰς ἐπέστης, τοῖς φίλοις σου εἰρήνην Δέσποτα δωρούμενος, τὴν πάντα νοῦν ὑπερέχουσαν.
ltx/gr_gr_cog/pe.d078:peMA.Ode1C1H.greekmelody	@ltx/gr_gr_cog/he.h.m1:heHE.AsomenPantesLaoi.greekname
ltx/gr_gr_cog/pe.d078:peMA.Ode1C1H.incipit	@ltx/gr_gr_cog/he.h.m1:heHE.AsomenPantesLaoi.incipit
ltx/gr_gr_cog/pe.d078:peMA.Ode1C1H.melody	@ltx/gr_gr_cog/he.h.m1:heHE.AsomenPantesLaoi.melody
ltx/gr_gr_cog/pe.d078:peMA.Ode1C1H.mode	@ltx/gr_gr_cog/miscellanea:misc.Mode1
ltx/gr_gr_cog/pe.d078:peMA.Ode1C1H.ode	@ltx/gr_gr_cog/miscellanea:misc.Ode1
ltx/gr_gr_cog/pe.d078:peMA.Ode1C1H.text	@ltx/gr_gr_cog/he.h.m1:heHE.AsomenPantesLaoi.text
ltx/gr_gr_cog/pe.d078:peMA.Ode3C11.greekmelody	@ltx/gr_gr_cog/he.h.m1:heHE.StereosonMeChriste.greekname
ltx/gr_gr_cog/pe.d078:peMA.Ode3C11.incipit	Καινοὺς ἀντὶ παλαιῶν, ἀντὶ φθαρτῶν…
ltx/gr_gr_cog/pe.d078:peMA.Ode3C11.melody	@ltx/gr_gr_cog/he.h.m1:heHE.StereosonMeChriste.name
ltx/gr_gr_cog/pe.d078:peMA.Ode3C11.mode	@ltx/gr_gr_cog/miscellanea:misc.Mode1
ltx/gr_gr_cog/pe.d078:peMA.Ode3C11.ode	@ltx/gr_gr_cog/miscellanea:misc.Ode3
ltx/gr_gr_cog/pe.d078:peMA.Ode3C11.text	Καινοὺς ἀντὶ παλαιῶν, ἀντὶ φθαρτῶν δὲ ἀφθάρτους, διὰ Σταυροῦ σου Χριστέ, τελέσας ἡμᾶς, ἐν καινότητι ζωῆς πολιτεύεσθαι, ἀξίως προσέταξας.
ltx/gr_gr_cog/pe.d078:peMA.Ode3C12.incipit	Ἐν τάφῳ περικλεισθείς, τῇ περιγράπτῳ…
ltx/gr_gr_cog/pe.d078:peMA.Ode3C12.melody	@ltx/gr_gr_cog/he.h.m1:heHE.StereosonMeChriste.name
ltx/gr_gr_cog/pe.d078:peMA.Ode3C12.mode	@ltx/gr_gr_cog/miscellanea:misc.Mode1
ltx/gr_gr_cog/pe.d078:peMA.Ode3C12.ode	@ltx/gr_gr_cog/miscellanea:misc.Ode3
ltx/gr_gr_cog/pe.d078:peMA.Ode3C12.text	Ἐν τάφῳ περικλεισθείς, τῇ περιγράπτῳ σαρκί σου, ὁ ἀπερίγραπτος, Χριστὲ ἀνέστης, θυρῶν κεκλεισμένων δὲ ἐπέστης, σοῦ τοῖς Μαθηταῖς, παντοδύναμε.
ltx/gr_gr_cog/pe.d078:peMA.Ode3C13.incipit	Τοὺς μώλωπάς σου Χριστέ, οὓς…
ltx/gr_gr_cog/pe.d078:peMA.Ode3C13.melody	@ltx/gr_gr_cog/he.h.m1:heHE.StereosonMeChriste.name
ltx/gr_gr_cog/pe.d078:peMA.Ode3C13.mode	@ltx/gr_gr_cog/miscellanea:misc.Mode1
ltx/gr_gr_cog/pe.d078:peMA.Ode3C13.ode	@ltx/gr_gr_cog/miscellanea:misc.Ode3
ltx/gr_gr_cog/pe.d078:peMA.Ode3C13.text	Τοὺς μώλωπάς σου Χριστέ, οὓς ἑκουσίως ὑπέστης, ὑπὲρ ἡμῶν τοῖς Μαθηταῖς σου φυλάξας μαρτύριον, τῆς σῆς ἔδειξας, ἐνδόξου Ἀναστάσεως.
ltx/gr_gr_cog/pe.d078:peMA.Ode3C1H.greekmelody	@ltx/gr_gr_cog/he.h.m1:heHE.StereosonMeChriste.greekname
ltx/gr_gr_cog/pe.d078:peMA.Ode3C1H.incipit	@ltx/gr_gr_cog/he.h.m1:heHE.StereosonMeChriste.incipit
ltx/gr_gr_cog/pe.d078:peMA.Ode3C1H.melody	@ltx/gr_gr_cog/he.h.m1:heHE.StereosonMeChriste.melody
ltx/gr_gr_cog/pe.d078:peMA.Ode3C1H.mode	@ltx/gr_gr_cog/miscellanea:misc.Mode1
ltx/gr_gr_cog/pe.d078:peMA.Ode3C1H.ode	@ltx/gr_gr_cog/miscellanea:misc.Ode3
ltx/gr_gr_cog/pe.d078:peMA.Ode3C1H.text	@ltx/gr_gr_cog/he.h.m1:heHE.StereosonMeChriste.text
ltx/gr_gr_cog/pe.d078:peMA.Ode4C11.greekmelody	@ltx/gr_gr_cog/he.h.m1:heHE.MegaToMystirion.greekname
ltx/gr_gr_cog/pe.d078:peMA.Ode4C11.incipit	Χολῆς μὲν ἐγεύσατο, τὴν πάλαι…
ltx/gr_gr_cog/pe.d078:peMA.Ode4C11.melody	@ltx/gr_gr_cog/he.h.m1:heHE.MegaToMystirion.name
ltx/gr_gr_cog/pe.d078:peMA.Ode4C11.mode	@ltx/gr_gr_cog/miscellanea:misc.Mode1
ltx/gr_gr_cog/pe.d078:peMA.Ode4C11.ode	@ltx/gr_gr_cog/miscellanea:misc.Ode4
ltx/gr_gr_cog/pe.d078:peMA.Ode4C11.text	Χολῆς μὲν ἐγεύσατο, τὴν πάλαι γεῦσιν ἰώμενος, νυνὶ δὲ σὺν κηρίῳ μέλιτος, τοῦ φωτισμοῦ μεταδιδοὺς Χριστὸς τῷ Προπάτορι, καὶ τῆς αὐτοῦ γλυκείας μεθέξεως.
ltx/gr_gr_cog/pe.d078:peMA.Ode4C12.incipit	Χαίρεις ἐρευνώμενος· διὸ φιλάνθρωπε πρὸς…
ltx/gr_gr_cog/pe.d078:peMA.Ode4C12.melody	@ltx/gr_gr_cog/he.h.m1:heHE.MegaToMystirion.name
ltx/gr_gr_cog/pe.d078:peMA.Ode4C12.mode	@ltx/gr_gr_cog/miscellanea:misc.Mode1
ltx/gr_gr_cog/pe.d078:peMA.Ode4C12.ode	@ltx/gr_gr_cog/miscellanea:misc.Ode4
ltx/gr_gr_cog/pe.d078:peMA.Ode4C12.text	Χαίρεις ἐρευνώμενος· διὸ φιλάνθρωπε πρὸς τοῦτο, προτρέπεις τὸν Θωμᾶν, προτείνων τῷ διαπιστοῦντι τὴν πλευράν, κόσμῳ πιστούμενος, τὴν σὴν Χριστὲ τριήμερον Ἔγερσιν.
ltx/gr_gr_cog/pe.d078:peMA.Ode4C13.incipit	Πλοῦτον ἀρυσάμενος, ἐκ θησαυροῦ τοῦ…
ltx/gr_gr_cog/pe.d078:peMA.Ode4C13.melody	@ltx/gr_gr_cog/he.h.m1:heHE.MegaToMystirion.name
ltx/gr_gr_cog/pe.d078:peMA.Ode4C13.mode	@ltx/gr_gr_cog/miscellanea:misc.Mode1
ltx/gr_gr_cog/pe.d078:peMA.Ode4C13.ode	@ltx/gr_gr_cog/miscellanea:misc.Ode4
ltx/gr_gr_cog/pe.d078:peMA.Ode4C13.text	Πλοῦτον ἀρυσάμενος, ἐκ θησαυροῦ τοῦ ἀσυλήτου, τῆς θείας Εὐεργέτα, λόγχῃ διανοιγείσης σου πλευρᾶς, σοφίας καὶ γνώσεως, ἀναπιμπλᾷ τὸν κόσμον ὁ Δίδυμος.
ltx/gr_gr_cog/pe.d078:peMA.Ode4C14.incipit	Σοῦ ἡ παμμακάριστος, ὑμνεῖται γλῶσσα…
ltx/gr_gr_cog/pe.d078:peMA.Ode4C14.melody	@ltx/gr_gr_cog/he.h.m1:heHE.MegaToMystirion.name
ltx/gr_gr_cog/pe.d078:peMA.Ode4C14.mode	@ltx/gr_gr_cog/miscellanea:misc.Mode1
ltx/gr_gr_cog/pe.d078:peMA.Ode4C14.ode	@ltx/gr_gr_cog/miscellanea:misc.Ode4
ltx/gr_gr_cog/pe.d078:peMA.Ode4C14.text	Σοῦ ἡ παμμακάριστος, ὑμνεῖται γλῶσσα ὦ Δίδυμε· πρώτη γὰρ εὐσεβῶς κηρύττει τὸν ζωοδότην Ἰησοῦν, Θεόν τε καὶ Κύριον, ἐκ τῆς ἁφῆς πλησθεῖσα τῆς χάριτος.
ltx/gr_gr_cog/pe.d078:peMA.Ode4C1H.greekmelody	@ltx/gr_gr_cog/he.h.m1:heHE.MegaToMystirion.greekname
ltx/gr_gr_cog/pe.d078:peMA.Ode4C1H.incipit	@ltx/gr_gr_cog/he.h.m1:heHE.MegaToMystirion.incipit
ltx/gr_gr_cog/pe.d078:peMA.Ode4C1H.melody	@ltx/gr_gr_cog/he.h.m1:heHE.MegaToMystirion.melody
ltx/gr_gr_cog/pe.d078:peMA.Ode4C1H.mode	@ltx/gr_gr_cog/miscellanea:misc.Mode1
ltx/gr_gr_cog/pe.d078:peMA.Ode4C1H.ode	@ltx/gr_gr_cog/miscellanea:misc.Ode4
ltx/gr_gr_cog/pe.d078:peMA.Ode4C1H.text	@ltx/gr_gr_cog/he.h.m1:heHE.MegaToMystirion.text
ltx/gr_gr_cog/pe.d078:peMA.Ode5C11.greekmelody	@ltx/gr_gr_cog/he.h.m1:heHE.EkNyktosOrthrizontesYmnoumenSe.greekname
ltx/gr_gr_cog/pe.d078:peMA.Ode5C11.incipit	Ἐπιστὰς τοῖς φίλοις ἀθυμοῦσιν ὁ…
ltx/gr_gr_cog/pe.d078:peMA.Ode5C11.melody	@ltx/gr_gr_cog/he.h.m1:heHE.EkNyktosOrthrizontesYmnoumenSe.name
ltx/gr_gr_cog/pe.d078:peMA.Ode5C11.mode	@ltx/gr_gr_cog/miscellanea:misc.Mode1
ltx/gr_gr_cog/pe.d078:peMA.Ode5C11.ode	@ltx/gr_gr_cog/miscellanea:misc.Ode5
ltx/gr_gr_cog/pe.d078:peMA.Ode5C11.text	Ἐπιστὰς τοῖς φίλοις ἀθυμοῦσιν ὁ Σωτήρ, τῇ παρουσίᾳ ἅπασαν, ἀπελαύνει τὴν κατήφειαν, καὶ σκιρτᾶν διεγείρει, τῇ Ἀναστάσει αὐτοῦ.
ltx/gr_gr_cog/pe.d078:peMA.Ode5C12.incipit	Ὢ τῆς ἀληθῶς ἐπαινουμένης τοῦ…
ltx/gr_gr_cog/pe.d078:peMA.Ode5C12.melody	@ltx/gr_gr_cog/he.h.m1:heHE.EkNyktosOrthrizontesYmnoumenSe.name
ltx/gr_gr_cog/pe.d078:peMA.Ode5C12.mode	@ltx/gr_gr_cog/miscellanea:misc.Mode1
ltx/gr_gr_cog/pe.d078:peMA.Ode5C12.ode	@ltx/gr_gr_cog/miscellanea:misc.Ode5
ltx/gr_gr_cog/pe.d078:peMA.Ode5C12.text	Ὢ τῆς ἀληθῶς ἐπαινουμένης τοῦ Θωμᾶ, φρικτῆς ἐγχειρήσεως! τολμηρῶς γὰρ ἐψηλάφησε τὴν πλευράν, τὴν τῷ θείῳ πυρὶ ἀπαστράπτουσαν.
ltx/gr_gr_cog/pe.d078:peMA.Ode5C13.incipit	Ἀπιστίαν πίστεως γεννήτριαν ἡμῖν, τὴν…
ltx/gr_gr_cog/pe.d078:peMA.Ode5C13.melody	@ltx/gr_gr_cog/he.h.m1:heHE.EkNyktosOrthrizontesYmnoumenSe.name
ltx/gr_gr_cog/pe.d078:peMA.Ode5C13.mode	@ltx/gr_gr_cog/miscellanea:misc.Mode1
ltx/gr_gr_cog/pe.d078:peMA.Ode5C13.ode	@ltx/gr_gr_cog/miscellanea:misc.Ode5
ltx/gr_gr_cog/pe.d078:peMA.Ode5C13.text	Ἀπιστίαν πίστεως γεννήτριαν ἡμῖν, τὴν τοῦ Θωμᾶ ἀνέδειξας· σὺ γὰρ πάντα τῇ σοφίᾳ σου, προνοεῖς συμφερόντως, Χριστὲ ὡς φιλάνθρωπος.
ltx/gr_gr_cog/pe.d078:peMA.Ode5C1H.greekmelody	@ltx/gr_gr_cog/he.h.m1:heHE.EkNyktosOrthrizontesYmnoumenSe.greekname
ltx/gr_gr_cog/pe.d078:peMA.Ode5C1H.incipit	@ltx/gr_gr_cog/he.h.m1:heHE.EkNyktosOrthrizontesYmnoumenSe.incipit
ltx/gr_gr_cog/pe.d078:peMA.Ode5C1H.melody	@ltx/gr_gr_cog/he.h.m1:heHE.EkNyktosOrthrizontesYmnoumenSe.melody
ltx/gr_gr_cog/pe.d078:peMA.Ode5C1H.mode	@ltx/gr_gr_cog/miscellanea:misc.Mode1
ltx/gr_gr_cog/pe.d078:peMA.Ode5C1H.ode	@ltx/gr_gr_cog/miscellanea:misc.Ode5
ltx/gr_gr_cog/pe.d078:peMA.Ode5C1H.text	@ltx/gr_gr_cog/he.h.m1:heHE.EkNyktosOrthrizontesYmnoumenSe.text
ltx/gr_gr_cog/pe.d078:peMA.Ode6C11.greekmelody	@ltx/gr_gr_cog/he.h.m1:heHE.TonProfitinDiesosas.greekname
ltx/gr_gr_cog/pe.d078:peMA.Ode6C11.incipit	Τὸν Θωμᾶν οὐ κατέλιπες, βαπτιζόμενον…
ltx/gr_gr_cog/pe.d078:peMA.Ode6C11.melody	@ltx/gr_gr_cog/he.h.m1:heHE.TonProfitinDiesosas.name
ltx/gr_gr_cog/pe.d078:peMA.Ode6C11.mode	@ltx/gr_gr_cog/miscellanea:misc.Mode1
ltx/gr_gr_cog/pe.d078:peMA.Ode6C11.ode	@ltx/gr_gr_cog/miscellanea:misc.Ode6
ltx/gr_gr_cog/pe.d078:peMA.Ode6C11.text	Τὸν Θωμᾶν οὐ κατέλιπες, βαπτιζόμενον Δέσποτα, βυθῷ ἀπιστίας παλάμας, προτείνας εἰς ἔρευναν.
ltx/gr_gr_cog/pe.d078:peMA.Ode6C12.incipit	Ὁ Σωτὴρ ἡμῶν ἔλεγε· Ψηλαφῶντές…
ltx/gr_gr_cog/pe.d078:peMA.Ode6C12.melody	@ltx/gr_gr_cog/he.h.m1:heHE.TonProfitinDiesosas.name
ltx/gr_gr_cog/pe.d078:peMA.Ode6C12.mode	@ltx/gr_gr_cog/miscellanea:misc.Mode1
ltx/gr_gr_cog/pe.d078:peMA.Ode6C12.ode	@ltx/gr_gr_cog/miscellanea:misc.Ode6
ltx/gr_gr_cog/pe.d078:peMA.Ode6C12.text	Ὁ Σωτὴρ ἡμῶν ἔλεγε· Ψηλαφῶντές με ἴδετε, ὀστέα καὶ σάρκα φοροῦντα, ἐγὼ οὐκ ἠλλοίωμαι.
ltx/gr_gr_cog/pe.d078:peMA.Ode6C13.incipit	Τὴν πλευρὰν ἐψηλάφησε, καὶ πιστεύσας…
ltx/gr_gr_cog/pe.d078:peMA.Ode6C13.melody	@ltx/gr_gr_cog/he.h.m1:heHE.TonProfitinDiesosas.name
ltx/gr_gr_cog/pe.d078:peMA.Ode6C13.mode	@ltx/gr_gr_cog/miscellanea:misc.Mode1
ltx/gr_gr_cog/pe.d078:peMA.Ode6C13.ode	@ltx/gr_gr_cog/miscellanea:misc.Ode6
ltx/gr_gr_cog/pe.d078:peMA.Ode6C13.text	Τὴν πλευρὰν ἐψηλάφησε, καὶ πιστεύσας ἐπέγνωκε, Θωμᾶς μὴ παρών σου τῇ πρώτῃ, εἰσόδῳ Σωτὴρ ἡμῶν.
ltx/gr_gr_cog/pe.d078:peMA.Ode6C1H.greekmelody	@ltx/gr_gr_cog/he.h.m1:heHE.TonProfitinDiesosas.greekname
ltx/gr_gr_cog/pe.d078:peMA.Ode6C1H.incipit	@ltx/gr_gr_cog/he.h.m1:heHE.TonProfitinDiesosas.incipit
ltx/gr_gr_cog/pe.d078:peMA.Ode6C1H.melody	@ltx/gr_gr_cog/he.h.m1:heHE.TonProfitinDiesosas.melody
ltx/gr_gr_cog/pe.d078:peMA.Ode6C1H.mode	@ltx/gr_gr_cog/miscellanea:misc.Mode1
ltx/gr_gr_cog/pe.d078:peMA.Ode6C1H.ode	@ltx/gr_gr_cog/miscellanea:misc.Ode6
ltx/gr_gr_cog/pe.d078:peMA.Ode6C1H.text	@ltx/gr_gr_cog/he.h.m1:heHE.TonProfitinDiesosas.text
ltx/gr_gr_cog/pe.d078:peMA.Ode7C11.greekmelody	@ltx/gr_gr_cog/he.h.m1:heHE.EikoniLatrevein.greekname
ltx/gr_gr_cog/pe.d078:peMA.Ode7C11.incipit	Ὡς πρώτη ὑπάρχει, ἡμερῶν καὶ…
ltx/gr_gr_cog/pe.d078:peMA.Ode7C11.melody	@ltx/gr_gr_cog/he.h.m1:heHE.EikoniLatrevein.name
ltx/gr_gr_cog/pe.d078:peMA.Ode7C11.mode	@ltx/gr_gr_cog/miscellanea:misc.Mode1
ltx/gr_gr_cog/pe.d078:peMA.Ode7C11.ode	@ltx/gr_gr_cog/miscellanea:misc.Ode7
ltx/gr_gr_cog/pe.d078:peMA.Ode7C11.text	Ὡς πρώτη ὑπάρχει, ἡμερῶν καὶ κυρία, ἡ λαμπροφόρος αὕτη, ἐν ᾗ ἀγάλλεσθαι ἄξιον, τὸν καινὸν καὶ θεῖον λαόν· ἐν τρόμῳ φέρει γάρ, καὶ αἰῶνος τὸν τύπον, ὡς ὀγδοὰς τελοῦσα τοῦ μέλλοντος, ὁ ὑπερυψούμενος τῶν Πατέρων καὶ ἡμῶν, Θεὸς εὐλογητὸς εἶ.
ltx/gr_gr_cog/pe.d078:peMA.Ode7C12.incipit	Ὁ μόνος τολμήσας, τῇ ἀπίστῳ…
ltx/gr_gr_cog/pe.d078:peMA.Ode7C12.melody	@ltx/gr_gr_cog/he.h.m1:heHE.EikoniLatrevein.name
ltx/gr_gr_cog/pe.d078:peMA.Ode7C12.mode	@ltx/gr_gr_cog/miscellanea:misc.Mode1
ltx/gr_gr_cog/pe.d078:peMA.Ode7C12.ode	@ltx/gr_gr_cog/miscellanea:misc.Ode7
ltx/gr_gr_cog/pe.d078:peMA.Ode7C12.text	Ὁ μόνος τολμήσας, τῇ ἀπίστῳ τε πίστει, εὐεργετήσας ἡμᾶς, Θωμᾶς ὁ Δίδυμος, λύει μὲν τὴν ζοφώδη ἄγνοιαν τοῖς πᾶσι πέρασι, τῇ πιστῇ ἀπιστίᾳ, ἑαυτῷ δὲ τὸν στέφανον πλέκει σαφῶς, λέγων· Σὺ εἶ Κύριος, ὁ ὑπερυψούμενος τῶν Πατέρων καὶ ἡμῶν, Θεὸς εὐλογητὸς εἶ.
ltx/gr_gr_cog/pe.d078:peMA.Ode7C13.incipit	Οὐ μάτην διστάσας, ὁ Θωμᾶς…
ltx/gr_gr_cog/pe.d078:peMA.Ode7C13.melody	@ltx/gr_gr_cog/he.h.m1:heHE.EikoniLatrevein.name
ltx/gr_gr_cog/pe.d078:peMA.Ode7C13.mode	@ltx/gr_gr_cog/miscellanea:misc.Mode1
ltx/gr_gr_cog/pe.d078:peMA.Ode7C13.ode	@ltx/gr_gr_cog/miscellanea:misc.Ode7
ltx/gr_gr_cog/pe.d078:peMA.Ode7C13.text	Οὐ μάτην διστάσας, ὁ Θωμᾶς τῇ Ἐγέρσει σου, οὐ κατέθετο, ἀλλʼ ἀναμφίλεκτον ἔσπευδεν, ἀποδεῖξαι ταύτην, Χριστὲ τοῖς πᾶσιν ἔθνεσιν· ὅθεν διʼ ἀπιστίας πιστωσάμενος πάντας, ἐδίδαξε λέγειν· Σὺ εἶ Κύριος, ὁ ὑπερυψούμενος, τῶν Πατέρων καὶ ἡμῶν, Θεὸς εὐλογητὸς εἶ.
ltx/gr_gr_cog/pe.d078:peMA.Ode7C14.incipit	Ἐμφόβως τὴν χεῖρα, ὁ Θωμᾶς…
ltx/gr_gr_cog/pe.d078:peMA.Ode7C14.melody	@ltx/gr_gr_cog/he.h.m1:heHE.EikoniLatrevein.name
ltx/gr_gr_cog/pe.d078:peMA.Ode7C14.mode	@ltx/gr_gr_cog/miscellanea:misc.Mode1
ltx/gr_gr_cog/pe.d078:peMA.Ode7C14.ode	@ltx/gr_gr_cog/miscellanea:misc.Ode7
ltx/gr_gr_cog/pe.d078:peMA.Ode7C14.text	Ἐμφόβως τὴν χεῖρα, ὁ Θωμᾶς τῇ πλευρᾷ σου, τῇ ζωηφόρῳ Χριστέ, ἐνθεὶς ὑπότρομος ᾔσθετο, ἐνεργείας Σῶτερ διπλῆς τῶν δύο φύσεων, τῶν ἐν σοὶ ἡνωμένων ἀσυγχύτως, καὶ πίστει ἐκραύγαζε, λέγων· Σὺ εἶ Κύριος, ὁ ὑπερυψούμενος, τῶν Πατέρων καὶ ἡμῶν, Θεὸς εὐλογητὸς εἶ.
ltx/gr_gr_cog/pe.d078:peMA.Ode7C1H.greekmelody	@ltx/gr_gr_cog/he.h.m1:heHE.EikoniLatrevein.greekname
ltx/gr_gr_cog/pe.d078:peMA.Ode7C1H.incipit	@ltx/gr_gr_cog/he.h.m1:heHE.EikoniLatrevein.incipit
ltx/gr_gr_cog/pe.d078:peMA.Ode7C1H.melody	@ltx/gr_gr_cog/he.h.m1:heHE.EikoniLatrevein.melody
ltx/gr_gr_cog/pe.d078:peMA.Ode7C1H.mode	@ltx/gr_gr_cog/miscellanea:misc.Mode1
ltx/gr_gr_cog/pe.d078:peMA.Ode7C1H.ode	@ltx/gr_gr_cog/miscellanea:misc.Ode7
ltx/gr_gr_cog/pe.d078:peMA.Ode7C1H.text	@ltx/gr_gr_cog/he.h.m1:heHE.EikoniLatrevein.text
ltx/gr_gr_cog/pe.d078:peMA.Ode8C11.greekmelody	@ltx/gr_gr_cog/he.h.m1:heHE.TonEnFlogiPyros.greekname
ltx/gr_gr_cog/pe.d078:peMA.Ode8C11.incipit	Ἐπιποθήσας σου, τὴν χαρμόσυνον θέαν…
ltx/gr_gr_cog/pe.d078:peMA.Ode8C11.melody	@ltx/gr_gr_cog/he.h.m1:heHE.TonEnFlogiPyros.name
ltx/gr_gr_cog/pe.d078:peMA.Ode8C11.mode	@ltx/gr_gr_cog/miscellanea:misc.Mode1
ltx/gr_gr_cog/pe.d078:peMA.Ode8C11.ode	@ltx/gr_gr_cog/miscellanea:misc.Ode8
ltx/gr_gr_cog/pe.d078:peMA.Ode8C11.text	Ἐπιποθήσας σου, τὴν χαρμόσυνον θέαν, τὸ πρὶν ἠπίστει ὁ Θωμᾶς, ἀξιωθεὶς δὲ ταύτης, Θεὸν καὶ Κύριόν σε ἐκάλει Δέσποτα, ὃν ὑπερυψοῦμεν εἰς πάντας τοὺς αἰῶνας.
ltx/gr_gr_cog/pe.d078:peMA.Ode8C12.incipit	Τὸν ἀνασχόμενον τῆς Θωμᾶ ἀπιστίας…
ltx/gr_gr_cog/pe.d078:peMA.Ode8C12.melody	@ltx/gr_gr_cog/he.h.m1:heHE.TonEnFlogiPyros.name
ltx/gr_gr_cog/pe.d078:peMA.Ode8C12.mode	@ltx/gr_gr_cog/miscellanea:misc.Mode1
ltx/gr_gr_cog/pe.d078:peMA.Ode8C12.ode	@ltx/gr_gr_cog/miscellanea:misc.Ode8
ltx/gr_gr_cog/pe.d078:peMA.Ode8C12.text	Τὸν ἀνασχόμενον τῆς Θωμᾶ ἀπιστίας, καὶ ὑποδείξαντα πλευράν, καὶ τῇ αὐτοῦ παλάμῃ ἀκριβολογηθέντα, ὑμνεῖτε Κύριον, καὶ ὑπερυψοῦτε αὐτὸν εἰς τοὺς αἰῶνας.
ltx/gr_gr_cog/pe.d078:peMA.Ode8C13.incipit	Σοῦ τὸ περίεργον, θησαυρὸν ἡμῖν…
ltx/gr_gr_cog/pe.d078:peMA.Ode8C13.melody	@ltx/gr_gr_cog/he.h.m1:heHE.TonEnFlogiPyros.name
ltx/gr_gr_cog/pe.d078:peMA.Ode8C13.mode	@ltx/gr_gr_cog/miscellanea:misc.Mode1
ltx/gr_gr_cog/pe.d078:peMA.Ode8C13.ode	@ltx/gr_gr_cog/miscellanea:misc.Ode8
ltx/gr_gr_cog/pe.d078:peMA.Ode8C13.text	Σοῦ τὸ περίεργον, θησαυρὸν ἡμῖν ἀνέῳξε Θωμᾶ· θεολογήσας γλώσσῃ γὰρ θεοφορουμένῃ· Ὑμνεῖτε, ἔλεγες, καὶ ὑπερυψοῦτε Χριστὸν εἰς τοὺς αἰῶνας.
ltx/gr_gr_cog/pe.d078:peMA.Ode8C1H.greekmelody	@ltx/gr_gr_cog/he.h.m1:heHE.TonEnFlogiPyros.greekname
ltx/gr_gr_cog/pe.d078:peMA.Ode8C1H.incipit	@ltx/gr_gr_cog/he.h.m1:heHE.TonEnFlogiPyros.incipit
ltx/gr_gr_cog/pe.d078:peMA.Ode8C1H.melody	@ltx/gr_gr_cog/he.h.m1:heHE.TonEnFlogiPyros.melody
ltx/gr_gr_cog/pe.d078:peMA.Ode8C1H.mode	@ltx/gr_gr_cog/miscellanea:misc.Mode1
ltx/gr_gr_cog/pe.d078:peMA.Ode8C1H.ode	@ltx/gr_gr_cog/miscellanea:misc.Ode8
ltx/gr_gr_cog/pe.d078:peMA.Ode8C1H.text	@ltx/gr_gr_cog/he.h.m1:heHE.TonEnFlogiPyros.text
ltx/gr_gr_cog/pe.d078:peMA.Ode9C11.greekmelody	@ltx/gr_gr_cog/he.h.m1:heHE.SeTinFaeinin.greekname
ltx/gr_gr_cog/pe.d078:peMA.Ode9C11.incipit	Σοῦ τὴν φαεινὴν ἡμέραν…
ltx/gr_gr_cog/pe.d078:peMA.Ode9C11.melody	@ltx/gr_gr_cog/he.h.m1:heHE.SeTinFaeinin.name
ltx/gr_gr_cog/pe.d078:peMA.Ode9C11.mode	@ltx/gr_gr_cog/miscellanea:misc.Mode1
ltx/gr_gr_cog/pe.d078:peMA.Ode9C11.ode	@ltx/gr_gr_cog/miscellanea:misc.Ode9
ltx/gr_gr_cog/pe.d078:peMA.Ode9C11.text	Σοῦ τὴν φαεινὴν ἡμέραν, καὶ ὑπέρλαμπρον Χριστὲ τὴν ὁλόφωτον χάριν, ἐν ᾗ ὡραῖος κάλλει τοῖς Μαθηταῖς σου, ἐπέστης μεγαλύνομεν.
ltx/gr_gr_cog/pe.d078:peMA.Ode9C12.incipit	Σὲ τὸν χοϊκῇ παλάμῃ…
ltx/gr_gr_cog/pe.d078:peMA.Ode9C12.melody	@ltx/gr_gr_cog/he.h.m1:heHE.SeTinFaeinin.name
ltx/gr_gr_cog/pe.d078:peMA.Ode9C12.mode	@ltx/gr_gr_cog/miscellanea:misc.Mode1
ltx/gr_gr_cog/pe.d078:peMA.Ode9C12.ode	@ltx/gr_gr_cog/miscellanea:misc.Ode9
ltx/gr_gr_cog/pe.d078:peMA.Ode9C12.text	Σὲ τὸν χοϊκῇ παλάμῃ, ψηλαφώμενον πλευράν, καὶ μὴ φλέξαντα ταύτην, πυρὶ τῷ τῆς ἀΰλου θείας οὐσίας, ἐν ὕμνοις μεγαλύνομεν.
ltx/gr_gr_cog/pe.d078:peMA.Ode9C13.incipit	Σὲ τὸν ὡς Θεὸν ἐκ τάφου…
ltx/gr_gr_cog/pe.d078:peMA.Ode9C13.melody	@ltx/gr_gr_cog/he.h.m1:heHE.SeTinFaeinin.name
ltx/gr_gr_cog/pe.d078:peMA.Ode9C13.mode	@ltx/gr_gr_cog/miscellanea:misc.Mode1
ltx/gr_gr_cog/pe.d078:peMA.Ode9C13.ode	@ltx/gr_gr_cog/miscellanea:misc.Ode9
ltx/gr_gr_cog/pe.d078:peMA.Ode9C13.text	Σὲ τὸν ὡς Θεὸν ἐκ τάφου, ἀναστάντα Χριστόν, οὐ βλεφάροις ἰδόντες, ἀλλὰ καρδίας πόθῳ πεπιστευκότες, ἐν ὕμνοις μεγαλύνομεν.
ltx/gr_gr_cog/pe.d078:peMA.Ode9C1H.greekmelody	@ltx/gr_gr_cog/he.h.m1:heHE.SeTinFaeinin.greekname
ltx/gr_gr_cog/pe.d078:peMA.Ode9C1H.incipit	@ltx/gr_gr_cog/he.h.m1:heHE.SeTinFaeinin.incipit
ltx/gr_gr_cog/pe.d078:peMA.Ode9C1H.melody	@ltx/gr_gr_cog/he.h.m1:heHE.SeTinFaeinin.melody
ltx/gr_gr_cog/pe.d078:peMA.Ode9C1H.mode	@ltx/gr_gr_cog/miscellanea:misc.Mode1
ltx/gr_gr_cog/pe.d078:peMA.Ode9C1H.ode	@ltx/gr_gr_cog/miscellanea:misc.Ode9
ltx/gr_gr_cog/pe.d078:peMA.Ode9C1H.text	@ltx/gr_gr_cog/he.h.m1:heHE.SeTinFaeinin.text
ltx/gr_gr_cog/pe.d078:peMA.Oikos1.text	Τίς ἐφύλαξε τὴν τοῦ Μαθητοῦ παλάμην τότε ἀχώνευτον, ὅτε τῇ πυρίνῃ πλευρᾷ προσῆλθε τοῦ Κυρίου; τίς ἔδωκε ταύτῃ τόλμαν, καὶ ἴσχυσε ψηλαφῆσαι φλόγεον ὀστοῦν, πάντως ἡ ψηλαφηθεῖσα· εἰ μὴ γὰρ ἡ πλευρὰ δύναμιν ἐχορήγησε πηλίνῃ δεξιᾷ, πῶς εἶχε ψηλαφῆσαι παθήματα, σαλεύσαντα τὰ ἄνω καὶ τὰ κάτω; Αὕτη ἡ χάρις Θωμᾷ ἐδόθη, ταύτην ψηλαφῆσαι, Χριστῷ δὲ ἐκβοῆσαι· Κύριος ὑπάρχεις καὶ Θεός μου.
ltx/gr_gr_cog/pe.d078:peMA.PostGospelBoth.incipit	@ltx/gr_gr_cog/ho.ho03:hoMA.PostGospelTheotokos.incipit
ltx/gr_gr_cog/pe.d078:peMA.PostGospelBoth.melody	
ltx/gr_gr_cog/pe.d078:peMA.PostGospelBoth.mode	@ltx/gr_gr_cog/miscellanea:misc.Mode2
ltx/gr_gr_cog/pe.d078:peMA.PostGospelBoth.text	@ltx/gr_gr_cog/ho.ho03:hoMA.PostGospelTheotokos.text
ltx/gr_gr_cog/pe.d078:peMA.PostGospelGlory.incipit	@ltx/gr_gr_cog/ho.ho03:hoMA.PostGospelApostles.incipit
ltx/gr_gr_cog/pe.d078:peMA.PostGospelGlory.melody	
ltx/gr_gr_cog/pe.d078:peMA.PostGospelGlory.mode	@ltx/gr_gr_cog/miscellanea:misc.Mode2
ltx/gr_gr_cog/pe.d078:peMA.PostGospelGlory.text	@ltx/gr_gr_cog/ho.ho03:hoMA.PostGospelApostles.text
ltx/gr_gr_cog/pe.d078:peMA.PostGospelIdiomelon.incipit	@ltx/gr_gr_cog/ho.ho03:hoMA.SunPostGospelIdiomelon.incipit
ltx/gr_gr_cog/pe.d078:peMA.PostGospelIdiomelon.melody	@ltx/gr_gr_cog/miscellanea:misc.Idiomelon
ltx/gr_gr_cog/pe.d078:peMA.PostGospelIdiomelon.mode	@ltx/gr_gr_cog/miscellanea:misc.Mode2
ltx/gr_gr_cog/pe.d078:peMA.PostGospelIdiomelon.text	@ltx/gr_gr_cog/ho.ho03:hoMA.SunPostGospelIdiomelon.text
ltx/gr_gr_cog/pe.d078:peSV.AposGlory.incipit	Νέμεις ὦ Λυτρωτά, εἰρήνην τῷ…
ltx/gr_gr_cog/pe.d078:peSV.AposGlory.melody	@ltx/gr_gr_cog/he.a.m2:heAU.OikosTouEfratha.name
ltx/gr_gr_cog/pe.d078:peSV.AposGlory.mode	@ltx/gr_gr_cog/miscellanea:misc.Mode2
ltx/gr_gr_cog/pe.d078:peSV.AposGlory.text	Νέμεις ὦ Λυτρωτά, εἰρήνην τῷ λαῷ σου, καὶ ὀφλημάτων λύσιν, πρεσβείαις τῆς πανάγνου, καὶ μόνης Θεομήτορος.
ltx/gr_gr_cog/pe.d078:peSV.Aposticha1.incipit	Χείλεσι καθαροῖς, ὑμνεῖτε σὺν Ἀγγέλοις…
ltx/gr_gr_cog/pe.d078:peSV.Aposticha1.melody	@ltx/gr_gr_cog/he.a.m2:heAU.OikosTouEfratha.name
ltx/gr_gr_cog/pe.d078:peSV.Aposticha1.mode	@ltx/gr_gr_cog/miscellanea:misc.Mode2
ltx/gr_gr_cog/pe.d078:peSV.Aposticha1.text	Χείλεσι καθαροῖς, ὑμνεῖτε σὺν Ἀγγέλοις, βροτοὶ τὸν Ἀναστάντα, τριήμερον ἐκ τάφου, καὶ κόσμον συνεγείραντα.
ltx/gr_gr_cog/pe.d078:peSV.Aposticha2.incipit	Ὤφθης τοῖς ἱεροῖς, σοῦ Σῶτερ…
ltx/gr_gr_cog/pe.d078:peSV.Aposticha2.melody	@ltx/gr_gr_cog/he.a.m2:heAU.OikosTouEfratha.name
ltx/gr_gr_cog/pe.d078:peSV.Aposticha2.mode	@ltx/gr_gr_cog/miscellanea:misc.Mode2
ltx/gr_gr_cog/pe.d078:peSV.Aposticha2.text	Ὤφθης τοῖς ἱεροῖς, σοῦ Σῶτερ Ἀποστόλοις, τῶν θυρῶν κεκλεισμένων, διʼ αὐτῶν ἐγκαινίζων, ἡμῖν τὸ θεῖον Πνεῦμά σου.
ltx/gr_gr_cog/pe.d078:peSV.Aposticha3.incipit	Νῦν σε Παμβασιλεῦ, ἰδόντες οὐ…
ltx/gr_gr_cog/pe.d078:peSV.Aposticha3.melody	@ltx/gr_gr_cog/he.a.m2:heAU.OikosTouEfratha.name
ltx/gr_gr_cog/pe.d078:peSV.Aposticha3.mode	@ltx/gr_gr_cog/miscellanea:misc.Mode2
ltx/gr_gr_cog/pe.d078:peSV.Aposticha3.text	Νῦν σε Παμβασιλεῦ, ἰδόντες οὐ βλεφάροις, ἀλλὰ καρδίας πόθῳ, Θεὸν πεπιστευκότες, ἐν ὕμνοις μεγαλύνομεν.
ltx/gr_gr_cog/pe.d078:peSV.SticGlory.incipit	Μετὰ τὴν Ἔγερσίν σου Κύριε…
ltx/gr_gr_cog/pe.d078:peSV.SticGlory.melody	@ltx/gr_gr_cog/miscellanea:misc.Idiomelon
ltx/gr_gr_cog/pe.d078:peSV.SticGlory.mode	@ltx/gr_gr_cog/miscellanea:misc.Mode2
ltx/gr_gr_cog/pe.d078:peSV.SticGlory.text	Μετὰ τὴν Ἔγερσίν σου Κύριε, συνηγμένων τῶν Μαθητῶν σου, καὶ τῶν θυρῶν κεκλεισμένων, ἐν μέσῳ ἔστης, εἰρήνην παρέχων αὐτοῖς. Πεισθεὶς δὲ καὶ ὁ Θωμᾶς, τῇ ὁράσει τῶν χειρῶν καὶ τῆς πλευρᾶς σου, Κύριον καὶ Θεόν σε ὡμολόγησε, σῴζοντα τοὺς ἐλπίζοντας εἰς σέ, φιλάνθρωπε.
ltx/gr_gr_cog/pe.d078:peSV.Stichera1.incipit	Φέρει Χριστὸς φιλανθρώπως, καὶ τὴν…
ltx/gr_gr_cog/pe.d078:peSV.Stichera1.melody	@ltx/gr_gr_cog/he.a.m1:heAU.TonOuranionTagmaton.name
ltx/gr_gr_cog/pe.d078:peSV.Stichera1.mode	@ltx/gr_gr_cog/miscellanea:misc.Mode1
ltx/gr_gr_cog/pe.d078:peSV.Stichera1.text	Φέρει Χριστὸς φιλανθρώπως, καὶ τὴν ψηλάφησιν, ὡς καὶ Σταυρὸν πρὸ ταύτης, καὶ τὸν ἄδικον φόνον, τάφου τριημέρως ἐξαναστάς, ἐσφραγισμένου τοῦ μνήματος, καὶ τῶν θυρῶν κεκλεισμένων τοῖς Μαθηταῖς, ἐπιστὰς ὡς παντοδύναμος.
ltx/gr_gr_cog/pe.d078:peSV.Stichera2.incipit	Ἡ τοῦ Θωμᾶ ἀπιστία, τὴν…
ltx/gr_gr_cog/pe.d078:peSV.Stichera2.melody	@ltx/gr_gr_cog/he.a.m1:heAU.TonOuranionTagmaton.name
ltx/gr_gr_cog/pe.d078:peSV.Stichera2.mode	@ltx/gr_gr_cog/miscellanea:misc.Mode1
ltx/gr_gr_cog/pe.d078:peSV.Stichera2.text	Ἡ τοῦ Θωμᾶ ἀπιστία, τὴν κοσμοσώτειραν, τοῦ θεανθρώπου Λόγου, τὴν ἐξ ᾍδου κευθμώνων, Ἔγερσιν πιστοῦται, τρῆσιν χειρῶν καὶ ποδῶν τολμηρότερον, ἐκψηλαφῶσα πρὸς πίστωσιν κοσμικήν, δεξιᾷ τῇ φιλοπράγμονι.
ltx/gr_gr_cog/pe.d078:peSV.Stichera3.incipit	Συνηθροισμένων τῷ φόβῳ, τῷ ἐκ…
ltx/gr_gr_cog/pe.d078:peSV.Stichera3.melody	@ltx/gr_gr_cog/he.a.m1:heAU.TonOuranionTagmaton.name
ltx/gr_gr_cog/pe.d078:peSV.Stichera3.mode	@ltx/gr_gr_cog/miscellanea:misc.Mode1
ltx/gr_gr_cog/pe.d078:peSV.Stichera3.text	Συνηθροισμένων τῷ φόβῳ, τῷ ἐκ τοῦ πάθους σου, τῶν Ἀποστόλων Λόγε, καὶ θυρῶν κεκλεισμένων, ἄφνω συνεισῆλθες, μέσον αὐτῶν, τὴν εἰρήνην δωρούμενος, καὶ τῷ Θωμᾷ προτεινόμενος ψηλαφᾶν, τοὺς σεπτοὺς πλευρᾶς σου μώλωπας.
ltx/gr_gr_cog/pe.d078:peSY.commemoration.couplet1.title	@ltx/gr_gr_cog/titles:ti.Verses
ltx/gr_gr_cog/pe.d078:peSY.commemoration.couplet1.verse1	Εἰ νηδύος κλείς, ἢ τάφου μὴ κωλύει,
ltx/gr_gr_cog/pe.d078:peSY.commemoration.couplet1.verse2	Σὴν Σῶτερ ὁρμὴν κλεὶς θυρῶν πῶς κωλύσει;
ltx/gr_gr_cog/pe.d078:peSY.commemoration.narration.p01	[paragraph 01]
ltx/gr_gr_cog/pe.d078:peSY.commemoration.narration.p02	[paragraph 02]
ltx/gr_gr_cog/pe.d078:peSY.commemoration.narration.p03	[paragraph 03]
ltx/gr_gr_cog/pe.d078:peSY.commemoration.narration.p04	[paragraph 04]
ltx/gr_gr_cog/pe.d078:peSY.commemoration.narration.p05	[paragraph 05]
ltx/gr_gr_cog/pe.d078:peSY.commemoration.narration.p06	[paragraph 06]
ltx/gr_gr_cog/pe.d078:peSY.commemoration.narration.p07	[paragraph 07]
ltx/gr_gr_cog/pe.d078:peSY.commemoration.text	Τῇ αὐτῇ ἡμέρᾳ, Κυριακῇ δευτέρᾳ ἀπὸ τοῦ Πάσχα, τὰ ἐγκαίνια ἑορτάζομεν τῆς Χριστοῦ Ἀναστάσεως, καὶ τὴν τοῦ ἁγίου Ἀποστόλου Θωμᾶ ψηλάφησιν.
ltx/gr_gr_cog/pe.d078:peSY.lastline	Ταῖς τοῦ σοῦ Ἀποστόλου Θωμᾶ πρεσβείαις, Χριστὲ ὁ Θεὸς ἡμῶν, ἐλέησον ἡμᾶς. Ἀμήν.
ltx/gr_gr_cog/pe.d078:peVE.Apolytikion1.incipit	@ltx/gr_gr_cog/oc.m7.d1:ocMA.Kathisma21.incipit
ltx/gr_gr_cog/pe.d078:peVE.Apolytikion1.melody	
ltx/gr_gr_cog/pe.d078:peVE.Apolytikion1.mode	@ltx/gr_gr_cog/miscellanea:misc.Mode7
ltx/gr_gr_cog/pe.d078:peVE.Apolytikion1.text	@ltx/gr_gr_cog/oc.m7.d1:ocMA.Kathisma21.text
ltx/gr_gr_cog/pe.d078:peVE.AposGlory.incipit	Φιλάνθρωπε, μέγα καὶ ἀνείκαστον τὸ…
ltx/gr_gr_cog/pe.d078:peVE.AposGlory.melody	@ltx/gr_gr_cog/miscellanea:misc.Idiomelon
ltx/gr_gr_cog/pe.d078:peVE.AposGlory.mode	@ltx/gr_gr_cog/miscellanea:misc.Mode5
ltx/gr_gr_cog/pe.d078:peVE.AposGlory.text	Φιλάνθρωπε, μέγα καὶ ἀνείκαστον τὸ πλῆθος τῶν οἰκτιρμῶν σου· ὅτι ἐμακροθύμησας, ὑπὸ Ἰουδαίων ῥαπιζόμενος, ὑπὸ Ἀποστόλου ψηλαφώμενος, καὶ ὑπὸ τῶν ἀθετούντων σε πολυπραγμονούμενος. Πῶς ἐσαρκώθης; πῶς ἐσταυρώθης ὁ Ἁναμάρτητος; ἀλλὰ συνέτισον ἡμᾶς, ὡς τὸν Θωμᾶν βοᾶν σοι· Ο Κύριός μου καὶ ὁ Θεός μου, δόξα σοι.
ltx/gr_gr_cog/pe.d078:peVE.Aposticha1.incipit	Ὢ τοῦ παραδόξου θαύματος! ἀπιστία…
ltx/gr_gr_cog/pe.d078:peVE.Aposticha1.melody	@ltx/gr_gr_cog/miscellanea:misc.Idiomelon
ltx/gr_gr_cog/pe.d078:peVE.Aposticha1.mode	@ltx/gr_gr_cog/miscellanea:misc.Mode4
ltx/gr_gr_cog/pe.d078:peVE.Aposticha1.text	Ὢ τοῦ παραδόξου θαύματος! ἀπιστία πίστιν βεβαίαν ἐγέννησεν· εἰπὼν γὰρ ὁ Θωμᾶς· Ἐὰν μὴ ἴδω, οὐ μὴ πιστεύσω· ψηλαφήσας δὲ τὴν πλευράν, ἐθεολόγει τὸν σαρκωθέντα, τὸν αὐτὸν Υἱὸν τοῦ Θεοῦ· ἐγνώρισεν ὡς πεπονθότα σαρκί· ἐκήρυξε τὸν ἀναστάντα Θεόν· καὶ ἐβόησε λαμπρᾷ τῇ φωνῇ· Ὁ Κύριός μου καὶ ὁ Θεός μου, δόξα σοι.
ltx/gr_gr_cog/pe.d078:peVE.Aposticha2.incipit	Ὢ τοῦ παραδόξου θαύματος! τοῦ…
ltx/gr_gr_cog/pe.d078:peVE.Aposticha2.melody	@ltx/gr_gr_cog/miscellanea:misc.Idiomelon
ltx/gr_gr_cog/pe.d078:peVE.Aposticha2.mode	@ltx/gr_gr_cog/miscellanea:misc.Mode4
ltx/gr_gr_cog/pe.d078:peVE.Aposticha2.text	Ὢ τοῦ παραδόξου θαύματος! τοῦ πυρὸς ὁ χόρτος ἁψάμενος σέσωσται· βαλὼν γὰρ ὁ Θωμᾶς ἐν τῇ πυρίνῃ πλευρᾷ τὴν χεῖρα, Ἰησοῦ Χριστοῦ τοῦ Θεοῦ, οὐ κατεφλέχθη τῇ ψηλαφήσει· τῆς ψυχῆς γὰρ τὸ δυσπειθές, μετέβαλεν εἰς εὐπιστίαν θερμῶς· ἐκέκραξεν ἀπὸ βαθέων ψυχῆς· Ὁ Δεσπότης σύ μου εἶ καὶ Θεός, ὁ ἐκ νεκρῶν ἐγηγερμένος· δόξα σοι.
ltx/gr_gr_cog/pe.d078:peVE.Aposticha3.incipit	Ὢ τοῦ παραδόξου θαύματος! Ἰωάννης…
ltx/gr_gr_cog/pe.d078:peVE.Aposticha3.melody	@ltx/gr_gr_cog/miscellanea:misc.Idiomelon
ltx/gr_gr_cog/pe.d078:peVE.Aposticha3.mode	@ltx/gr_gr_cog/miscellanea:misc.Mode4
ltx/gr_gr_cog/pe.d078:peVE.Aposticha3.text	Ὢ τοῦ παραδόξου θαύματος! Ἰωάννης στήθει τοῦ Λόγου ἀνέπεσε, Θωμᾶς δὲ τὴν πλευρὰν προσψηλαφῆσαι κατηξιώθη· ἀλλʼ ὁ μέν, ἐκεῖθεν φρικτῶς Θεολογίας βυθὸν ἀνέλκει, τὴν οἰκονομίαν· ὁ δέ, ἠξίωται μυσταγωγῆσαι ἡμᾶς· παρίστησι γὰρ τὰς ἀποδείξεις τρανῶς τῆς Ἐγέρσεως αὐτοῦ, ἐκβοῶν· Ὁ Κύριός μου καὶ ὁ Θεός μου, δόξα σοι.
ltx/gr_gr_cog/pe.d078:peVE.Lity1.incipit	Κύριε, τῇ ἀστέκτῳ τῆς σῆς Θεότητος…
ltx/gr_gr_cog/pe.d078:peVE.Lity1.melody	@ltx/gr_gr_cog/miscellanea:misc.Idiomelon
ltx/gr_gr_cog/pe.d078:peVE.Lity1.mode	@ltx/gr_gr_cog/miscellanea:misc.Mode4
ltx/gr_gr_cog/pe.d078:peVE.Lity1.text	Κύριε, τῇ ἀστέκτῳ τῆς σῆς Θεότητος αἴγλῃ, τῶν θυρῶν ἐπέστης οὐσῶν κεκλεισμένων· καὶ στὰς ἐν μέσῳ τῶν Μαθητῶν, τὴν πλευρὰν ἐξεγύμνωσας· καὶ τραυμάτων σου χειρῶν καὶ τῶν ποδῶν, τὰς ὠτειλὰς δεικνύων, ἀθυμίας τὴν κατήφειάν τε λύων, σαφῶς ἐφώνησας· Ὃν τρόπον ἐν ἐμοὶ καθορᾶτε, ὦ φίλοι, τῆς σαρκὸς τὴν πρόσληψιν, οὐ πνεύματος φέρω φύσιν. Τῷ δὲ διστάζοντι Μαθητῇ, προετρέπου ψηλαφῆσαι φρικτῶς, κατειπών· Ἐρευνήσας ἅπαντα, δεῦρο λοιπὸν μὴ ἀμφίβαλλε. Ὁ δὲ αἰσθόμενος ἐν τῇ χειρί, τῆς σῆς διπλῆς οὐσίας, ἐν φόβῳ ἀνεβόα πιστῶς, τῇ πίστει ἑλκόμενος· Ὁ Κύριός μου καὶ ὁ Θεός μου, δόξα σοι.
ltx/gr_gr_cog/pe.d078:peVE.Lity2.incipit	Ἅψαι Θωμᾶ τῆς πλευρᾶς…
ltx/gr_gr_cog/pe.d078:peVE.Lity2.melody	@ltx/gr_gr_cog/miscellanea:misc.Idiomelon
ltx/gr_gr_cog/pe.d078:peVE.Lity2.mode	@ltx/gr_gr_cog/miscellanea:misc.Mode8
ltx/gr_gr_cog/pe.d078:peVE.Lity2.text	Ἅψαι Θωμᾶ τῆς πλευρᾶς τῇ χειρί, λέγει Χριστός, καὶ τοὺς τύπους τῶν ἥλων δεῦρο ψηλάφησον, πίστει ἐρεύνησον, καὶ γίνου μοι πιστός, καὶ μὴ γίνου ἄπιστος. Ὁ δὲ Θωμᾶς, τῷ δακτύλῳ ὡς ἥψατο τοῦ Δεσπότου, μέγα ἀνεβόησε· Σύ μου Θεὸς καὶ Κύριος, εὔσπλαγχνε, δόξα σοι.
ltx/gr_gr_cog/pe.d078:peVE.LityGlory.incipit	Τῶν θυρῶν κεκλεισμένων, τῶν Μαθητῶν…
ltx/gr_gr_cog/pe.d078:peVE.LityGlory.melody	@ltx/gr_gr_cog/miscellanea:misc.Idiomelon
ltx/gr_gr_cog/pe.d078:peVE.LityGlory.mode	@ltx/gr_gr_cog/miscellanea:misc.Mode8
ltx/gr_gr_cog/pe.d078:peVE.LityGlory.poet	@ltx/gr_gr_cog/poets:po.Anatoliou
ltx/gr_gr_cog/pe.d078:peVE.LityGlory.text	Τῶν θυρῶν κεκλεισμένων, τῶν Μαθητῶν συνθροισμένων, ἐπέστη ὁ Σωτήρ, οὗ ἦσαν συνηγμένοι, καὶ στὰς ἐν μέσῳ αὐτῶν, λέγει τῷ Θωμᾷ· Δεῦρο ψηλάφησον, καὶ ἴδε τοὺς τύπους τῶν ἥλων, ἔκτεινόν σου τὴν χεῖρα, καὶ ἅψαι τῆς πλευρᾶς μου, καὶ μὴ γίνου ἄπιστος, ἀλλὰ πίστει κήρυξον, τὴν ἐκ νεκρῶν μου Ἀνάστασιν.
ltx/gr_gr_cog/pe.d078:peVE.MM.Stichera1234as3456.text	@ltx/gr_gr_cog/properties:media.key
ltx/gr_gr_cog/pe.d078:peVE.SticGlory.incipit	Τῶν θυρῶν κεκλεισμένων, ἐπέστης Χριστὲ…
ltx/gr_gr_cog/pe.d078:peVE.SticGlory.melody	@ltx/gr_gr_cog/miscellanea:misc.Idiomelon
ltx/gr_gr_cog/pe.d078:peVE.SticGlory.mode	@ltx/gr_gr_cog/miscellanea:misc.Mode6
ltx/gr_gr_cog/pe.d078:peVE.SticGlory.text	Τῶν θυρῶν κεκλεισμένων, ἐπέστης Χριστὲ πρὸς τοὺς Μαθητάς. Τότε ὁ Θωμᾶς, οἰκονομικῶς οὐχ εὑρέθη μετʼ αὐτῶν· ἔλεγε γάρ· Οὐ μὴ πιστεύσω, ἐὰν μὴ ἴδω κἀγὼ τὸν Δεσπότην· ἴδω τὴν πλευράν, ὅθεν ἐξῆλθε τὸ αἷμα, τὸ ὕδωρ, τὸ βάπτισμα· ἴδω τὴν πληγήν, ἐξ ἧς ἰάθη τὸ μέγα τραῦμα ὁ ἄνθρωπος· ἴδω, πῶς οὐκ ἦν, ὡς πνεῦμα, ἀλλὰ σάρξ καὶ ὀστέα. Ὁ τὸν θάνατον πατήσας, καὶ Θωμᾶν πληροφορήσας, Κύριε, δόξα σοι.
ltx/gr_gr_cog/pe.d078:peVE.Stichera01.incipit	Τῶν θυρῶν κεκλεισμένων τῶν Μαθητῶν…
ltx/gr_gr_cog/pe.d078:peVE.Stichera01.melody	@ltx/gr_gr_cog/miscellanea:misc.Idiomelon
ltx/gr_gr_cog/pe.d078:peVE.Stichera01.mode	@ltx/gr_gr_cog/miscellanea:misc.Mode1
ltx/gr_gr_cog/pe.d078:peVE.Stichera01.poet	@ltx/gr_gr_cog/poets:po.IoannouMonachou
ltx/gr_gr_cog/pe.d078:peVE.Stichera01.text	Τῶν θυρῶν κεκλεισμένων τῶν Μαθητῶν συνηθροισμένων, εἰσῆλθες ἄφνω παντοδύναμε, Ἰησοῦ, ὁ Θεὸς ἡμῶν, καὶ στὰς ἐν μέσῳ αὐτῶν, εἰρήνην δούς, ἐπλήρωσας ἁγίου Πνεύματος, προσμένειν τε προσέταξας, καὶ μηδαμοῦ χωρίζεσθαι ἀπὸ Ἱερουσαλήμ, ἕως οὗ ἐνδύσωνται τὴν ἐξ ὕψους δύναμιν· διὸ βοῶμέν σοι· Ὁ φωτισμός, καὶ ἡ ἀνάστασις, καὶ ἡ εἰρήνη ἡμῶν, δόξα σοι.
ltx/gr_gr_cog/pe.d078:peVE.Stichera02.incipit	Μεθʼ ἡμέρας ὀκτώ, τῆς Ἐγέρσεώς…
ltx/gr_gr_cog/pe.d078:peVE.Stichera02.melody	@ltx/gr_gr_cog/miscellanea:misc.Idiomelon
ltx/gr_gr_cog/pe.d078:peVE.Stichera02.mode	@ltx/gr_gr_cog/miscellanea:misc.Mode1
ltx/gr_gr_cog/pe.d078:peVE.Stichera02.text	Μεθʼ ἡμέρας ὀκτώ, τῆς Ἐγέρσεώς σου Κύριε, ὤφθης τοῖς Μαθηταῖς σου ἐν τόπῳ οὗ ἦσαν συνηγμένοι, καὶ φωνήσας αὐτοῖς· Εἰρήνη ὑμῖν, τῷ ἀπιστοῦντι Μαθητῇ τὰς χεῖρας ὑπέδειξας, καὶ τὴν ἄχραντον πλευράν, ὁ δὲ πεισθεὶς ἐβόα σοι· Ὁ Κύριός μου καὶ ὁ Θεός μου, δόξα σοι.
ltx/gr_gr_cog/pe.d078:peVE.Stichera03.incipit	Θωμᾶς, ὁ λεγόμενος Δίδυμος, οὐκ…
ltx/gr_gr_cog/pe.d078:peVE.Stichera03.melody	@ltx/gr_gr_cog/miscellanea:misc.Idiomelon
ltx/gr_gr_cog/pe.d078:peVE.Stichera03.mode	@ltx/gr_gr_cog/miscellanea:misc.Mode1
ltx/gr_gr_cog/pe.d078:peVE.Stichera03.text	Θωμᾶς, ὁ λεγόμενος Δίδυμος, οὐκ ἦν μετʼ αὐτῶν, ὅτε εἰσῆλθες Χριστέ, κεκλεισμένων τῶν θυρῶν· ὅθεν καὶ ἠπίστει τοῖς ῥηθεῖσιν αὐτῷ, ἐξ ἀπιστίας εἰς πίστιν βεβαιῶν, οὐκ ἀπηξίωσας δὲ Ἀγαθέ, ὑποδεῖξαι αὐτῷ τὴν ἄχραντον πλευράν σου, καὶ τῶν χειρῶν καὶ τῶν ποδῶν τοὺς μώλωπας, ὁ δὲ ψηλαφήσας καὶ ἰδών, ὡμολόγησέ σε εἶναι Θεὸν οὐ γυμνόν, καὶ ἄνθρωπον οὐ ψιλόν, καὶ ἐβόα· Ὁ Κύριός μου καὶ ὁ Θεός μου, δόξα σοι.
ltx/gr_gr_cog/pe.d078:peVE.Stichera04.incipit	Τῶν Μαθητῶν δισταζόντων, τῇ ὀγδόῃ…
ltx/gr_gr_cog/pe.d078:peVE.Stichera04.melody	@ltx/gr_gr_cog/miscellanea:misc.Idiomelon
ltx/gr_gr_cog/pe.d078:peVE.Stichera04.mode	@ltx/gr_gr_cog/miscellanea:misc.Mode1
ltx/gr_gr_cog/pe.d078:peVE.Stichera04.text	Τῶν Μαθητῶν δισταζόντων, τῇ ὀγδόῃ ἡμέρᾳ, ἐπέστη ὁ Σωτήρ, οὗ ἦσαν συνηγμένοι, καὶ τὴν εἰρήνην δοὺς τῷ Θωμᾷ ἐβόησε· Δεῦρο Ἀπόστολε, ψηλάφησον παλάμας, αἷς τοὺς ἥλους ἔπηξαν. Ὦ καλὴ ἀπιστία τοῦ Θωμᾶ! τῶν πιστῶν τὰς καρδίας εἰς ἐπίγνωσιν ἦξε, καὶ μετὰ φόβου ἐβόησεν· Ὁ Κύριός μου καὶ ὁ Θεός μου, δόξα σοι.
ltx/gr_gr_cog/pe.d078:peVE.Stichera05.incipit	Μετὰ τὴν Ἐγερσίν σου Κύριε…
ltx/gr_gr_cog/pe.d078:peVE.Stichera05.melody	@ltx/gr_gr_cog/miscellanea:misc.Idiomelon
ltx/gr_gr_cog/pe.d078:peVE.Stichera05.mode	@ltx/gr_gr_cog/miscellanea:misc.Mode2
ltx/gr_gr_cog/pe.d078:peVE.Stichera05.text	Μετὰ τὴν Ἐγερσίν σου Κύριε, συνηγμένων τῶν Μαθητῶν σου, καὶ τῶν θυρῶν κεκλεισμένων, ἐν μέσῳ ἔστης, εἰρήνην παρέχων αὐτοῖς. Πεισθεὶς δὲ καὶ ὁ Θωμᾶς, τῇ ὁράσει τῶν χειρῶν καὶ τῆς πλευρᾶς σου, Κύριον καὶ Θεόν σε ὡμολόγησε, σῴζοντα τοὺς ἐλπίζοντας εἰς σέ, φιλάνθρωπε.
ltx/gr_gr_cog/pe.d078:peVE.Stichera06.incipit	Τῶν θυρῶν κεκλεισμένων, ἐπιστὰς ὁ…
ltx/gr_gr_cog/pe.d078:peVE.Stichera06.melody	@ltx/gr_gr_cog/miscellanea:misc.Idiomelon
ltx/gr_gr_cog/pe.d078:peVE.Stichera06.mode	@ltx/gr_gr_cog/miscellanea:misc.Mode2
ltx/gr_gr_cog/pe.d078:peVE.Stichera06.text	Τῶν θυρῶν κεκλεισμένων, ἐπιστὰς ὁ Ἰησοῦς τοῖς Μαθηταῖς ἀφοβίαν καὶ εἰρήνην ἐδίδου. Εἶτα λέγει τῷ Θωμᾷ· Τί μοι ἀπιστεῖς, ὅτι ἀνέστην ἐκ νεκρῶν; φέρε ὧδε τὴν χεῖρά σου, καί βάλε εἰς τὴν πλευράν μου, καὶ ἴδε· σοῦ γὰρ ἀπιστοῦντος, οἱ πάντες ἔμαθον τὰ πάθη καὶ τὴν Ἀνάστασίν μου, κράζειν μετὰ σοῦ· Ὁ Κύριός μου καὶ ὁ Θεός μου δόξα σοι.
