ltx/gr_gr_cog/me.m02.d13:meDA.commemoration.first	Μνήμη τοῦ Ὁσίου Πατρὸς ἡμῶν Μαρτινιανοῦ
ltx/gr_gr_cog/me.m02.d13:meDA.commemoration.first_name	
ltx/gr_gr_cog/me.m02.d13:meDA.commemoration.first_short	Μνήμη τοῦ Ὁσίου Πατρὸς ἡμῶν Μαρτινιανοῦ
ltx/gr_gr_cog/me.m02.d13:meDA.commemoration.first_title	@ltx/gr_gr_cog/titles:ti.DevoutSaintM
ltx/gr_gr_cog/me.m02.d13:meDA.commemoration.full	Μνήμη τοῦ Ὁσίου Πατρὸς ἡμῶν Μαρτινιανοῦ
ltx/gr_gr_cog/me.m02.d13:meDA.commemoration.second_name	
ltx/gr_gr_cog/me.m02.d13:meDA.commemoration.second_title	
ltx/gr_gr_cog/me.m02.d13:meDA.date	Τῌ ΙΓʹ ΦΕΒΡΟΥΑΡΙΟΥ
ltx/gr_gr_cog/me.m02.d13:meDA.fordate	διὰ τὴν 13ην Φεβρουαρίου
ltx/gr_gr_cog/me.m02.d13:meDA.insert1	καὶ τοῦ Ὁσίου Πατρὸς ἡμῶν Μαρτινιανοῦ,
ltx/gr_gr_cog/me.m02.d13:meDA.insert2	οὗ καὶ τὴν μνήμην ἐπιτελοῦμεν·
ltx/gr_gr_cog/me.m02.d13:meDA.note	
ltx/gr_gr_cog/me.m02.d13:meDA.pdfcoverdate	τῆς 13ης Φεβρουαρίου,
ltx/gr_gr_cog/me.m02.d13:meDA.pdfheaderdate	τῆς 13ης Φεβρουαρίου
ltx/gr_gr_cog/me.m02.d13:meHO.commemorations	
ltx/gr_gr_cog/me.m02.d13:meHO.note1	
ltx/gr_gr_cog/me.m02.d13:meHO.note2	
ltx/gr_gr_cog/me.m02.d13:meHO.number	
ltx/gr_gr_cog/me.m02.d13:meHO.rank	
ltx/gr_gr_cog/me.m02.d13:meLE.commemoration1	Μνήμη τοῦ Ὁσίου Πατρὸς ἡμῶν Μαρτινιανοῦ.
ltx/gr_gr_cog/me.m02.d13:meLE.commemoration2	
ltx/gr_gr_cog/me.m02.d13:meLI.Kontakion1.greekmelody	@ltx/gr_gr_cog/me.m02.d13:meMA.Kontakion1.greekmelody
ltx/gr_gr_cog/me.m02.d13:meLI.Kontakion1.incipit	@ltx/gr_gr_cog/me.m02.d13:meMA.Kontakion1.incipit
ltx/gr_gr_cog/me.m02.d13:meLI.Kontakion1.melody	@ltx/gr_gr_cog/me.m02.d13:meMA.Kontakion1.melody
ltx/gr_gr_cog/me.m02.d13:meLI.Kontakion1.mode	@ltx/gr_gr_cog/me.m02.d13:meMA.Kontakion1.mode
ltx/gr_gr_cog/me.m02.d13:meLI.Kontakion1.text	@ltx/gr_gr_cog/me.m02.d13:meMA.Kontakion1.text
ltx/gr_gr_cog/me.m02.d13:meLI.Megalynarion.text	
ltx/gr_gr_cog/me.m02.d13:meMA.C1.acrostic.notice1	οὗ ἡ Ἀκροστιχίς·
ltx/gr_gr_cog/me.m02.d13:meMA.C1.acrostic.text	Μέλπω Μάκαρ σου τοὺς δρόμους θείοις λόγοις.
ltx/gr_gr_cog/me.m02.d13:meMA.C1.acrostic.title	Κανὼν τοῦ Ὁσίου,
ltx/gr_gr_cog/me.m02.d13:meMA.C1.poet	@ltx/gr_gr_cog/poets:po.Theofanous
ltx/gr_gr_cog/me.m02.d13:meMA.C1.title	@ltx/gr_gr_cog/titles:ti.CanonDevoutM
ltx/gr_gr_cog/me.m02.d13:meMA.C1.verse	@ltx/gr_gr_cog/prayers:pr.verse_DevoutMan.text
ltx/gr_gr_cog/me.m02.d13:meMA.ExapTheotokion.incipit	Χαριστηρίοις σὲ ὕμνοις, ὑμνοῦμεν πόθῳ…
ltx/gr_gr_cog/me.m02.d13:meMA.ExapTheotokion.melody	@ltx/gr_gr_cog/he.a.m3:heAU.OOuranonToisAstrois.name
ltx/gr_gr_cog/me.m02.d13:meMA.ExapTheotokion.mode	@ltx/gr_gr_cog/miscellanea:misc.Mode3
ltx/gr_gr_cog/me.m02.d13:meMA.ExapTheotokion.text	Χαριστηρίοις σὲ ὕμνοις, ὑμνοῦμεν πόθῳ Παρθένε, σὺν τῷ Ἀγγέλῳ τὸ χαῖρε, βοῶντές σοι Θεοτόκε· Χαῖρε ἀνύμφευτε Μήτηρ, τοῦ Βασιλέως τῆς δόξης.
ltx/gr_gr_cog/me.m02.d13:meMA.Exaposteilarion1.greekmelody	@ltx/gr_gr_cog/he.a.m3:heAU.OOuranonToisAstrois.greekname
ltx/gr_gr_cog/me.m02.d13:meMA.Exaposteilarion1.incipit	Τῆς φύσεως βιαστής τε, καὶ…
ltx/gr_gr_cog/me.m02.d13:meMA.Exaposteilarion1.melody	@ltx/gr_gr_cog/he.a.m3:heAU.OOuranonToisAstrois.name
ltx/gr_gr_cog/me.m02.d13:meMA.Exaposteilarion1.mode	@ltx/gr_gr_cog/miscellanea:misc.Mode3
ltx/gr_gr_cog/me.m02.d13:meMA.Exaposteilarion1.text	Τῆς φύσεως βιαστής τε, καὶ Μάρτυς Μαρτινιανέ, σὺ ἐθελουσίως ὤφθης, καὶ ὁδηγὸς ταῖς γυναιξί, μεθʼ ὧν τὸν ἐχθρὸν νικήσας, ὑπὲρ ἡμῶν νῦν πρεσβεύεις.
ltx/gr_gr_cog/me.m02.d13:meMA.Kontakion1.greekmelody	@ltx/gr_gr_cog/he.a.m2:heAU.TousAsfaleis.greekname
ltx/gr_gr_cog/me.m02.d13:meMA.Kontakion1.incipit	Ὡς ἀσκητὴν τῆς εὐσεβείας δόκιμον…
ltx/gr_gr_cog/me.m02.d13:meMA.Kontakion1.melody	@ltx/gr_gr_cog/he.a.m2:heAU.TousAsfaleis.name
ltx/gr_gr_cog/me.m02.d13:meMA.Kontakion1.mode	@ltx/gr_gr_cog/miscellanea:misc.Mode2
ltx/gr_gr_cog/me.m02.d13:meMA.Kontakion1.text	Ὡς ἀσκητὴν τῆς εὐσεβείας δόκιμον, καὶ ἀθλητὴν τῇ προαιρέσει τίμιον, καὶ ἐρήμου καρτερόψυχον, πολίτην ἅμα καὶ συνίστορα, ἐν ὕμνοις ἐπαξίως εὐφημήσωμεν, Μαρτινιανόν τὸν ἀεισέβαστον· αὐτὸς γὰρ τὸν ὄφιν κατεπάτησεν.
ltx/gr_gr_cog/me.m02.d13:meMA.Ode1C11.greekmelody	@ltx/gr_gr_cog/he.h.m4:heHE.ThalassisToErythraion.greekname
ltx/gr_gr_cog/me.m02.d13:meMA.Ode1C11.incipit	Μονάσας, καὶ τὸν σταυρόν σου…
ltx/gr_gr_cog/me.m02.d13:meMA.Ode1C11.melody	@ltx/gr_gr_cog/he.h.m4:heHE.ThalassisToErythraion.name
ltx/gr_gr_cog/me.m02.d13:meMA.Ode1C11.mode	@ltx/gr_gr_cog/miscellanea:misc.Mode4
ltx/gr_gr_cog/me.m02.d13:meMA.Ode1C11.ode	@ltx/gr_gr_cog/miscellanea:misc.Ode1
ltx/gr_gr_cog/me.m02.d13:meMA.Ode1C11.text	Μονάσας, καὶ τὸν σταυρόν σου Ὅσιε, ἀναλαβόμενος, τῷ διὰ σὲ ἑκούσιον Σταυρὸν καὶ ταφὴν ὑπομείναντι, ἀκολουθεῖν ἐπόθησας, πάθη νεκρώσας τὰ τοῦ σώματος.
ltx/gr_gr_cog/me.m02.d13:meMA.Ode1C12.incipit	Ἐν ὄρει, τῆς ἀπαθείας Ὅσιε…
ltx/gr_gr_cog/me.m02.d13:meMA.Ode1C12.melody	@ltx/gr_gr_cog/he.h.m4:heHE.ThalassisToErythraion.name
ltx/gr_gr_cog/me.m02.d13:meMA.Ode1C12.mode	@ltx/gr_gr_cog/miscellanea:misc.Mode4
ltx/gr_gr_cog/me.m02.d13:meMA.Ode1C12.ode	@ltx/gr_gr_cog/miscellanea:misc.Ode1
ltx/gr_gr_cog/me.m02.d13:meMA.Ode1C12.text	Ἐν ὄρει, τῆς ἀπαθείας Ὅσιε, μένειν ἑλόμενος, ταῖς πρὸς τὸ θεῖον νεύσεσι νυκτός, καὶ ἡμέρας ἐσχόλασας, διὰ νηστείας Πάνσοφε, καὶ ἐγκρατείας καὶ δεήσεως.
ltx/gr_gr_cog/me.m02.d13:meMA.Ode1C13.incipit	Λαμπτῆρα, τῆς Ἐκκλησίας ἔνδοξε, Χριστὸς…
ltx/gr_gr_cog/me.m02.d13:meMA.Ode1C13.melody	@ltx/gr_gr_cog/he.h.m4:heHE.ThalassisToErythraion.name
ltx/gr_gr_cog/me.m02.d13:meMA.Ode1C13.mode	@ltx/gr_gr_cog/miscellanea:misc.Mode4
ltx/gr_gr_cog/me.m02.d13:meMA.Ode1C13.ode	@ltx/gr_gr_cog/miscellanea:misc.Ode1
ltx/gr_gr_cog/me.m02.d13:meMA.Ode1C13.text	Λαμπτῆρα, τῆς Ἐκκλησίας ἔνδοξε, Χριστός σε ἔδειξε, φωτοβολοῦντα Πάτερ ἀρεταῖς, τῶν πιστῶν τὰ συστήματα, καὶ τῶν ψυχῶν σκοτόμαιναν, πολυσχιδῆ ἀποδιώκοντα.
ltx/gr_gr_cog/me.m02.d13:meMA.Ode1C1H.greekmelody	@ltx/gr_gr_cog/he.h.m4:heHE.ThalassisToErythraion.greekname
ltx/gr_gr_cog/me.m02.d13:meMA.Ode1C1H.incipit	@ltx/gr_gr_cog/he.h.m4:heHE.ThalassisToErythraion.incipit
ltx/gr_gr_cog/me.m02.d13:meMA.Ode1C1H.melody	@ltx/gr_gr_cog/he.h.m4:heHE.ThalassisToErythraion.melody
ltx/gr_gr_cog/me.m02.d13:meMA.Ode1C1H.mode	@ltx/gr_gr_cog/miscellanea:misc.Mode4
ltx/gr_gr_cog/me.m02.d13:meMA.Ode1C1H.ode	@ltx/gr_gr_cog/miscellanea:misc.Ode1
ltx/gr_gr_cog/me.m02.d13:meMA.Ode1C1H.text	@ltx/gr_gr_cog/he.h.m4:heHE.ThalassisToErythraion.text
ltx/gr_gr_cog/me.m02.d13:meMA.Ode1C1T.incipit	Παρθένον, καὶ μετὰ τόκον μόνην…
ltx/gr_gr_cog/me.m02.d13:meMA.Ode1C1T.melody	@ltx/gr_gr_cog/he.h.m4:heHE.ThalassisToErythraion.name
ltx/gr_gr_cog/me.m02.d13:meMA.Ode1C1T.mode	@ltx/gr_gr_cog/miscellanea:misc.Mode4
ltx/gr_gr_cog/me.m02.d13:meMA.Ode1C1T.ode	@ltx/gr_gr_cog/miscellanea:misc.Ode1
ltx/gr_gr_cog/me.m02.d13:meMA.Ode1C1T.text	Παρθένον, καὶ μετὰ τόκον μόνην σε, μείνασαν ἔγνωμεν· τὸν πλαστουργὸν γὰρ ἔτεκες Θεόν, καὶ σαρκὶ ἐσπαργάνωσας, τὸν θεϊκαῖς δυνάμεσι, τὴν γῆν ὁμίχλῃ σπαργανώσαντα.
ltx/gr_gr_cog/me.m02.d13:meMA.Ode3C11.greekmelody	@ltx/gr_gr_cog/he.h.m4:heHE.EffrainetaiEpiSoi.greekname
ltx/gr_gr_cog/me.m02.d13:meMA.Ode3C11.incipit	Ἀνύστακτον τὸν πυρσόν, τὸν τῆς…
ltx/gr_gr_cog/me.m02.d13:meMA.Ode3C11.melody	@ltx/gr_gr_cog/he.h.m4:heHE.EffrainetaiEpiSoi.name
ltx/gr_gr_cog/me.m02.d13:meMA.Ode3C11.mode	@ltx/gr_gr_cog/miscellanea:misc.Mode4
ltx/gr_gr_cog/me.m02.d13:meMA.Ode3C11.ode	@ltx/gr_gr_cog/miscellanea:misc.Ode3
ltx/gr_gr_cog/me.m02.d13:meMA.Ode3C11.text	Ἀνύστακτον τὸν πυρσόν, τὸν τῆς ψυχῆς διατηρῶν πνεύματι, τῆς νοητῆς ἔνδοθεν, Ὅσιε παστάδος ἐσκήνωσας.
ltx/gr_gr_cog/me.m02.d13:meMA.Ode3C12.incipit	Ῥεόντων παραδραμών, εὐσεβοφρόνως τὰ τερπνὰ…
ltx/gr_gr_cog/me.m02.d13:meMA.Ode3C12.melody	@ltx/gr_gr_cog/he.h.m4:heHE.EffrainetaiEpiSoi.name
ltx/gr_gr_cog/me.m02.d13:meMA.Ode3C12.mode	@ltx/gr_gr_cog/miscellanea:misc.Mode4
ltx/gr_gr_cog/me.m02.d13:meMA.Ode3C12.ode	@ltx/gr_gr_cog/miscellanea:misc.Ode3
ltx/gr_gr_cog/me.m02.d13:meMA.Ode3C12.text	Ῥεόντων παραδραμών, εὐσεβοφρόνως τὰ τερπνὰ ἔσπευσας, τὰ μηδαμῶς ῥέοντα, Μαρτινιανὲ ἐγκολπώσασθαι.
ltx/gr_gr_cog/me.m02.d13:meMA.Ode3C13.incipit	Στενούμενος πλατυσμῷ, ἀσκητικῆς διαγωγῆς Ὅσιε…
ltx/gr_gr_cog/me.m02.d13:meMA.Ode3C13.melody	@ltx/gr_gr_cog/he.h.m4:heHE.EffrainetaiEpiSoi.name
ltx/gr_gr_cog/me.m02.d13:meMA.Ode3C13.mode	@ltx/gr_gr_cog/miscellanea:misc.Mode4
ltx/gr_gr_cog/me.m02.d13:meMA.Ode3C13.ode	@ltx/gr_gr_cog/miscellanea:misc.Ode3
ltx/gr_gr_cog/me.m02.d13:meMA.Ode3C13.text	Στενούμενος πλατυσμῷ, ἀσκητικῆς διαγωγῆς Ὅσιε, πλάτος τερπνὸν ἔφθασας, τὸ τοῦ Παραδείσου γηθόμενος.
ltx/gr_gr_cog/me.m02.d13:meMA.Ode3C1H.greekmelody	@ltx/gr_gr_cog/he.h.m4:heHE.EffrainetaiEpiSoi.greekname
ltx/gr_gr_cog/me.m02.d13:meMA.Ode3C1H.incipit	@ltx/gr_gr_cog/he.h.m4:heHE.EffrainetaiEpiSoi.incipit
ltx/gr_gr_cog/me.m02.d13:meMA.Ode3C1H.melody	@ltx/gr_gr_cog/he.h.m4:heHE.EffrainetaiEpiSoi.melody
ltx/gr_gr_cog/me.m02.d13:meMA.Ode3C1H.mode	@ltx/gr_gr_cog/miscellanea:misc.Mode4
ltx/gr_gr_cog/me.m02.d13:meMA.Ode3C1H.ode	@ltx/gr_gr_cog/miscellanea:misc.Ode3
ltx/gr_gr_cog/me.m02.d13:meMA.Ode3C1H.text	@ltx/gr_gr_cog/he.h.m4:heHE.EffrainetaiEpiSoi.text
ltx/gr_gr_cog/me.m02.d13:meMA.Ode3C1T.incipit	Οἰκήσας σου τὴν νηδύν, ὁ…
ltx/gr_gr_cog/me.m02.d13:meMA.Ode3C1T.melody	@ltx/gr_gr_cog/he.h.m4:heHE.EffrainetaiEpiSoi.name
ltx/gr_gr_cog/me.m02.d13:meMA.Ode3C1T.mode	@ltx/gr_gr_cog/miscellanea:misc.Mode4
ltx/gr_gr_cog/me.m02.d13:meMA.Ode3C1T.ode	@ltx/gr_gr_cog/miscellanea:misc.Ode3
ltx/gr_gr_cog/me.m02.d13:meMA.Ode3C1T.text	Οἰκήσας σου τὴν νηδύν, ὁ κατοικῶν τὸν οὐρανὸν ἄλλον σε, Μήτηρ Θεοῦ ἔμψυχον, ὄντως οὐρανὸν ἀπειργάσατο.
ltx/gr_gr_cog/me.m02.d13:meMA.Ode3Kathisma1.greekmelody	@ltx/gr_gr_cog/he.a.m1:heAU.TouLithouSfragisthentos.greekname
ltx/gr_gr_cog/me.m02.d13:meMA.Ode3Kathisma1.incipit	Ἐν πέτρᾳ εὐσεβείας προσερείσας τὸν…
ltx/gr_gr_cog/me.m02.d13:meMA.Ode3Kathisma1.melody	@ltx/gr_gr_cog/he.a.m1:heAU.TouLithouSfragisthentos.name
ltx/gr_gr_cog/me.m02.d13:meMA.Ode3Kathisma1.mode	@ltx/gr_gr_cog/miscellanea:misc.Mode1
ltx/gr_gr_cog/me.m02.d13:meMA.Ode3Kathisma1.text	Ἐν πέτρᾳ εὐσεβείας προσερείσας τὸν πόδα σου, ἐχθροῦ ταῖς μεθοδείαις ἀπερίτρεπτος ἔμεινας, πυρὶ δὲ θερμανθεὶς τῶν ἡδονῶν, εἰς πῦρ σαυτὸν ἐνέβαλες δειχθείς, ἐθελούσιος Μαρτυς, ἐπισκοπῇ τῇ θείᾳ δροσιζόμενος. Δόξα τῷ δεδωκότι σοι ἰσχύν, δόξα τῷ σὲ στεφανώσαντι, δόξα τῷ ἐνεργοῦντι διὰ σοῦ πᾶσιν ἰάματα.
ltx/gr_gr_cog/me.m02.d13:meMA.Ode3KathismaSt.incipit	Σταυρῷ σου προσπαγέντος ὑπὸ τῶν…
ltx/gr_gr_cog/me.m02.d13:meMA.Ode3KathismaSt.melody	@ltx/gr_gr_cog/he.a.m1:heAU.TouLithouSfragisthentos.name
ltx/gr_gr_cog/me.m02.d13:meMA.Ode3KathismaSt.mode	@ltx/gr_gr_cog/miscellanea:misc.Mode1
ltx/gr_gr_cog/me.m02.d13:meMA.Ode3KathismaSt.text	Σταυρῷ σου προσπαγέντος ὑπὸ τῶν παρανόμων, καὶ στρατιωτῶν Σῶτερ λόγχῃ, τὴν πλευρὰν ὀρυγέντος, ἡ Πάναγνος ὠδύρετο πικρῶς, τὰ σπλάγχνα κοπτομένη μητρικῶς, καὶ τὸ πολύ σου καὶ φρικτὸν τῆς ἀνοχῆς, ἐξίστατο βοῶσα· Δόξα τῇ πρὸς ἀνθρώπους σου στοργῇ, δόξα τῇ σῇ χρηστότητι, δόξα τῷ ἐν τῷ θανάτῳ σου, βροτοὺς ἀθανατίζοντι.
ltx/gr_gr_cog/me.m02.d13:meMA.Ode3KathismaT.incipit	Τὰς χεῖράς σου τὰς θείας…
ltx/gr_gr_cog/me.m02.d13:meMA.Ode3KathismaT.melody	@ltx/gr_gr_cog/he.a.m1:heAU.TouLithouSfragisthentos.name
ltx/gr_gr_cog/me.m02.d13:meMA.Ode3KathismaT.mode	@ltx/gr_gr_cog/miscellanea:misc.Mode1
ltx/gr_gr_cog/me.m02.d13:meMA.Ode3KathismaT.text	Τὰς χεῖράς σου τὰς θείας, αἷς τὸν Κτίστην ἐβάστασας, Παρθένε Παναγία, σαρκωθέντα χρηστότητι, προτείνουσα δυσώπησον αὐτόν, λυτρώσασθαι ἡμᾶς ἐκ πειρασμῶν, καὶ παθῶν καὶ τῶν κινδύνων, τοὺς εὐφημοῦντάς σε πόθῳ καὶ βοῶντάς σοι· Δόξα τῷ ἐνοικήσαντι ἐν σοί· δόξα τῷ προελθόντι ἐκ σοῦ· δόξα τῷ ἐλευθερώσαντι ἡμᾶς διὰ τοῦ τόκου σου.
ltx/gr_gr_cog/me.m02.d13:meMA.Ode4C11.greekmelody	@ltx/gr_gr_cog/he.h.m4:heHE.EparthentaSeIdousa.greekname
ltx/gr_gr_cog/me.m02.d13:meMA.Ode4C11.incipit	Ὑπωπιάσας τὴν σάρκα σκληραγωγίαις, τῇ…
ltx/gr_gr_cog/me.m02.d13:meMA.Ode4C11.melody	@ltx/gr_gr_cog/he.h.m4:heHE.EparthentaSeIdousa.name
ltx/gr_gr_cog/me.m02.d13:meMA.Ode4C11.mode	@ltx/gr_gr_cog/miscellanea:misc.Mode4
ltx/gr_gr_cog/me.m02.d13:meMA.Ode4C11.ode	@ltx/gr_gr_cog/miscellanea:misc.Ode4
ltx/gr_gr_cog/me.m02.d13:meMA.Ode4C11.text	Ὑπωπιάσας τὴν σάρκα σκληραγωγίαις, τῇ καθαρᾷ καρδίᾳ σου, φέγγος ὑπεδέξω Πάτερ τὸ τοῦ Πνεύματος, καὶ χαίρων ἐκραύγαζες· Δόξα τῇ δυνάμει σου Κύριε.
ltx/gr_gr_cog/me.m02.d13:meMA.Ode4C12.incipit	Ταῖς τοῦ πνεύματος λαμπόμενος φωταυγείαις…
ltx/gr_gr_cog/me.m02.d13:meMA.Ode4C12.melody	@ltx/gr_gr_cog/he.h.m4:heHE.EparthentaSeIdousa.name
ltx/gr_gr_cog/me.m02.d13:meMA.Ode4C12.mode	@ltx/gr_gr_cog/miscellanea:misc.Mode4
ltx/gr_gr_cog/me.m02.d13:meMA.Ode4C12.ode	@ltx/gr_gr_cog/miscellanea:misc.Ode4
ltx/gr_gr_cog/me.m02.d13:meMA.Ode4C12.text	Ταῖς τοῦ πνεύματος λαμπόμενος φωταυγείαις, τὸ σκοτεινὸν παρέδραμες, νέφος τῶν δαιμόνων, μέλπων ἐμμελέστατα, τῷ σὲ δυναμώσαντι· Δόξα τῇ δυνάμει σου Κύριε.
ltx/gr_gr_cog/me.m02.d13:meMA.Ode4C13.incipit	Οὐκ ἐσάλευσε τὸν πύργον τῆς…
ltx/gr_gr_cog/me.m02.d13:meMA.Ode4C13.melody	@ltx/gr_gr_cog/he.h.m4:heHE.EparthentaSeIdousa.name
ltx/gr_gr_cog/me.m02.d13:meMA.Ode4C13.mode	@ltx/gr_gr_cog/miscellanea:misc.Mode4
ltx/gr_gr_cog/me.m02.d13:meMA.Ode4C13.ode	@ltx/gr_gr_cog/miscellanea:misc.Ode4
ltx/gr_gr_cog/me.m02.d13:meMA.Ode4C13.text	Οὐκ ἐσάλευσε τὸν πύργον τῆς σῆς καρδίας, ὁ δυσμενὴς προσρήξας σοι, κύματα κακίας· πέτρα γὰρ ἐστήρικτο, Θεοῦ ἀγαπήσεως, Μαρτινιανὲ ἀξιάγαστε.
ltx/gr_gr_cog/me.m02.d13:meMA.Ode4C1H.greekmelody	@ltx/gr_gr_cog/he.h.m4:heHE.EparthentaSeIdousa.greekname
ltx/gr_gr_cog/me.m02.d13:meMA.Ode4C1H.incipit	@ltx/gr_gr_cog/he.h.m4:heHE.EparthentaSeIdousa.incipit
ltx/gr_gr_cog/me.m02.d13:meMA.Ode4C1H.melody	@ltx/gr_gr_cog/he.h.m4:heHE.EparthentaSeIdousa.melody
ltx/gr_gr_cog/me.m02.d13:meMA.Ode4C1H.mode	@ltx/gr_gr_cog/miscellanea:misc.Mode4
ltx/gr_gr_cog/me.m02.d13:meMA.Ode4C1H.ode	@ltx/gr_gr_cog/miscellanea:misc.Ode4
ltx/gr_gr_cog/me.m02.d13:meMA.Ode4C1H.text	@ltx/gr_gr_cog/he.h.m4:heHE.EparthentaSeIdousa.text
ltx/gr_gr_cog/me.m02.d13:meMA.Ode4C1T.incipit	Ὑπερτέρα τῶν Ἀγγέλων ἐδείχθης μόνη…
ltx/gr_gr_cog/me.m02.d13:meMA.Ode4C1T.melody	@ltx/gr_gr_cog/he.h.m4:heHE.EparthentaSeIdousa.name
ltx/gr_gr_cog/me.m02.d13:meMA.Ode4C1T.mode	@ltx/gr_gr_cog/miscellanea:misc.Mode4
ltx/gr_gr_cog/me.m02.d13:meMA.Ode4C1T.ode	@ltx/gr_gr_cog/miscellanea:misc.Ode4
ltx/gr_gr_cog/me.m02.d13:meMA.Ode4C1T.text	Ὑπερτέρα τῶν Ἀγγέλων ἐδείχθης μόνη, βουλῆς μεγάλης Ἀγγελον· τέτοκας γὰρ Λόγον πάντας τὸν φωτίζοντα, Παρθένε τοὺς κραυγάζοντας· Δόξα τῇ δυνάμει σου Κύριε.
ltx/gr_gr_cog/me.m02.d13:meMA.Ode5C11.greekmelody	@ltx/gr_gr_cog/he.h.m4:heHE.SyKyrieMouFos.greekname
ltx/gr_gr_cog/me.m02.d13:meMA.Ode5C11.incipit	Τίς δύναται τὰ σά, ἐξειπεῖν…
ltx/gr_gr_cog/me.m02.d13:meMA.Ode5C11.melody	@ltx/gr_gr_cog/he.h.m4:heHE.SyKyrieMouFos.name
ltx/gr_gr_cog/me.m02.d13:meMA.Ode5C11.mode	@ltx/gr_gr_cog/miscellanea:misc.Mode4
ltx/gr_gr_cog/me.m02.d13:meMA.Ode5C11.ode	@ltx/gr_gr_cog/miscellanea:misc.Ode5
ltx/gr_gr_cog/me.m02.d13:meMA.Ode5C11.text	Τίς δύναται τὰ σά, ἐξειπεῖν κατορθώματα, ἰσάγγελον πολιτείαν· ἐπὶ γῆς γὰρ ἀσκήσας, ὁσίως ὑπερήθλησας.
ltx/gr_gr_cog/me.m02.d13:meMA.Ode5C12.incipit	Ὄργανον τῆς φθορᾶς, χρηματίσας ὁ…
ltx/gr_gr_cog/me.m02.d13:meMA.Ode5C12.melody	@ltx/gr_gr_cog/he.h.m4:heHE.SyKyrieMouFos.name
ltx/gr_gr_cog/me.m02.d13:meMA.Ode5C12.mode	@ltx/gr_gr_cog/miscellanea:misc.Mode4
ltx/gr_gr_cog/me.m02.d13:meMA.Ode5C12.ode	@ltx/gr_gr_cog/miscellanea:misc.Ode5
ltx/gr_gr_cog/me.m02.d13:meMA.Ode5C12.text	Ὄργανον τῆς φθορᾶς, χρηματίσας ὁ τύραννος, προσβάλλει σου δελεάσαι, ἡδονῇ· ἀλλʼ ἡττήθη, ταῖς σαῖς Πάτερ ἐνστάσεσιν.
ltx/gr_gr_cog/me.m02.d13:meMA.Ode5C13.incipit	Ὑπῆρξας σεαυτοῦ, δικαστὴς ἐθελούσιος· τὴν…
ltx/gr_gr_cog/me.m02.d13:meMA.Ode5C13.melody	@ltx/gr_gr_cog/he.h.m4:heHE.SyKyrieMouFos.name
ltx/gr_gr_cog/me.m02.d13:meMA.Ode5C13.mode	@ltx/gr_gr_cog/miscellanea:misc.Mode4
ltx/gr_gr_cog/me.m02.d13:meMA.Ode5C13.ode	@ltx/gr_gr_cog/miscellanea:misc.Ode5
ltx/gr_gr_cog/me.m02.d13:meMA.Ode5C13.text	Ὑπῆρξας σεαυτοῦ, δικαστὴς ἐθελούσιος· τὴν φλόγα γὰρ ὑπεισδύνων, τῶν παθῶν τὰς καμίνους, Μακάριε κατέσβεσας.
ltx/gr_gr_cog/me.m02.d13:meMA.Ode5C1H.greekmelody	@ltx/gr_gr_cog/he.h.m4:heHE.SyKyrieMouFos.greekname
ltx/gr_gr_cog/me.m02.d13:meMA.Ode5C1H.incipit	@ltx/gr_gr_cog/he.h.m4:heHE.SyKyrieMouFos.incipit
ltx/gr_gr_cog/me.m02.d13:meMA.Ode5C1H.melody	@ltx/gr_gr_cog/he.h.m4:heHE.SyKyrieMouFos.melody
ltx/gr_gr_cog/me.m02.d13:meMA.Ode5C1H.mode	@ltx/gr_gr_cog/miscellanea:misc.Mode4
ltx/gr_gr_cog/me.m02.d13:meMA.Ode5C1H.ode	@ltx/gr_gr_cog/miscellanea:misc.Ode5
ltx/gr_gr_cog/me.m02.d13:meMA.Ode5C1H.text	@ltx/gr_gr_cog/he.h.m4:heHE.SyKyrieMouFos.text
ltx/gr_gr_cog/me.m02.d13:meMA.Ode5C1T.incipit	Σὲ ὅπλον ἀῤῥαγές, κατʼ ἐχθρῶν…
ltx/gr_gr_cog/me.m02.d13:meMA.Ode5C1T.melody	@ltx/gr_gr_cog/he.h.m4:heHE.SyKyrieMouFos.name
ltx/gr_gr_cog/me.m02.d13:meMA.Ode5C1T.mode	@ltx/gr_gr_cog/miscellanea:misc.Mode4
ltx/gr_gr_cog/me.m02.d13:meMA.Ode5C1T.ode	@ltx/gr_gr_cog/miscellanea:misc.Ode5
ltx/gr_gr_cog/me.m02.d13:meMA.Ode5C1T.text	Σὲ ὅπλον ἀῤῥαγές, κατʼ ἐχθρῶν προβαλλόμεθα, σὲ ἄγκυραν καὶ ἐλπίδα, τῆς ἡμῶν σωτηρίας, Θεόνυμφε κεκτήμεθα.
ltx/gr_gr_cog/me.m02.d13:meMA.Ode6C11.greekmelody	@ltx/gr_gr_cog/he.h.m4:heHE.ThysoSoiMetaFonis.greekname
ltx/gr_gr_cog/me.m02.d13:meMA.Ode6C11.incipit	Δολίαις, γυναικὸς λαλιαῖς σοι προσέβαλεν…
ltx/gr_gr_cog/me.m02.d13:meMA.Ode6C11.melody	@ltx/gr_gr_cog/he.h.m4:heHE.ThysoSoiMetaFonis.name
ltx/gr_gr_cog/me.m02.d13:meMA.Ode6C11.mode	@ltx/gr_gr_cog/miscellanea:misc.Mode4
ltx/gr_gr_cog/me.m02.d13:meMA.Ode6C11.ode	@ltx/gr_gr_cog/miscellanea:misc.Ode6
ltx/gr_gr_cog/me.m02.d13:meMA.Ode6C11.text	Δολίαις, γυναικὸς λαλιαῖς σοι προσέβαλεν, ὡς τῷ Προπάτορι πάλαι, δυσμενὴς ὁ ὄφις, ἀλλʼ ἐπινοίᾳ, τῇ σοφῇ σου, κατηργήθη αὐτοῦ τὰ σοφίσματα.
ltx/gr_gr_cog/me.m02.d13:meMA.Ode6C12.incipit	Ῥαδίως, διοδεύσας τὴν τρίβον τὴν…
ltx/gr_gr_cog/me.m02.d13:meMA.Ode6C12.melody	@ltx/gr_gr_cog/he.h.m4:heHE.ThysoSoiMetaFonis.name
ltx/gr_gr_cog/me.m02.d13:meMA.Ode6C12.mode	@ltx/gr_gr_cog/miscellanea:misc.Mode4
ltx/gr_gr_cog/me.m02.d13:meMA.Ode6C12.ode	@ltx/gr_gr_cog/miscellanea:misc.Ode6
ltx/gr_gr_cog/me.m02.d13:meMA.Ode6C12.text	Ῥαδίως, διοδεύσας τὴν τρίβον τὴν φέρουσαν, πρὸς τὰς ἐκεῖ καταπαύσεις, οὐκ ἐπαύσω Πάτερ διέρχεσθαι, τὰς ἐρήμους, καὶ τὰς πόλεις πολλοῖς ἀγωνίσμασιν.
ltx/gr_gr_cog/me.m02.d13:meMA.Ode6C13.incipit	Ὄρεσι, καὶ θαλάσσαις σαυτὸν ἀπεμάκρυνας…
ltx/gr_gr_cog/me.m02.d13:meMA.Ode6C13.melody	@ltx/gr_gr_cog/he.h.m4:heHE.ThysoSoiMetaFonis.name
ltx/gr_gr_cog/me.m02.d13:meMA.Ode6C13.mode	@ltx/gr_gr_cog/miscellanea:misc.Mode4
ltx/gr_gr_cog/me.m02.d13:meMA.Ode6C13.ode	@ltx/gr_gr_cog/miscellanea:misc.Ode6
ltx/gr_gr_cog/me.m02.d13:meMA.Ode6C13.text	Ὄρεσι, καὶ θαλάσσαις σαυτὸν ἀπεμάκρυνας, τὸ τῆς ἁγνείας καλόν σου, ἱεραῖς μελέταις καρπούμενος, καὶ στεφάνων, λαμπροτάτων Σοφὲ ἀξιούμενος.
ltx/gr_gr_cog/me.m02.d13:meMA.Ode6C14.incipit	Μέλη σου, τῇ πυρᾷ καταφλέγεσθαι…
ltx/gr_gr_cog/me.m02.d13:meMA.Ode6C14.melody	@ltx/gr_gr_cog/he.h.m4:heHE.ThysoSoiMetaFonis.name
ltx/gr_gr_cog/me.m02.d13:meMA.Ode6C14.mode	@ltx/gr_gr_cog/miscellanea:misc.Mode4
ltx/gr_gr_cog/me.m02.d13:meMA.Ode6C14.ode	@ltx/gr_gr_cog/miscellanea:misc.Ode6
ltx/gr_gr_cog/me.m02.d13:meMA.Ode6C14.text	Μέλη σου, τῇ πυρᾷ καταφλέγεσθαι δέδωκας, τὰς ὑπεκκαύσεις σβεννύων, ἡδονῶν τῇ δρόσῳ τοῦ Πνεύματος, θεοφόρε, μοναστῶν ἀκλινέστατον ἔρεισμα.
ltx/gr_gr_cog/me.m02.d13:meMA.Ode6C1H.greekmelody	@ltx/gr_gr_cog/he.h.m4:heHE.ThysoSoiMetaFonis.greekname
ltx/gr_gr_cog/me.m02.d13:meMA.Ode6C1H.incipit	@ltx/gr_gr_cog/he.h.m4:heHE.ThysoSoiMetaFonis.incipit
ltx/gr_gr_cog/me.m02.d13:meMA.Ode6C1H.melody	@ltx/gr_gr_cog/he.h.m4:heHE.ThysoSoiMetaFonis.melody
ltx/gr_gr_cog/me.m02.d13:meMA.Ode6C1H.mode	@ltx/gr_gr_cog/miscellanea:misc.Mode4
ltx/gr_gr_cog/me.m02.d13:meMA.Ode6C1H.ode	@ltx/gr_gr_cog/miscellanea:misc.Ode6
ltx/gr_gr_cog/me.m02.d13:meMA.Ode6C1H.text	@ltx/gr_gr_cog/he.h.m4:heHE.ThysoSoiMetaFonis.text
ltx/gr_gr_cog/me.m02.d13:meMA.Ode6C1T.incipit	Ὅλην σε, καθηγίασε Λόγος ὁ…
ltx/gr_gr_cog/me.m02.d13:meMA.Ode6C1T.melody	@ltx/gr_gr_cog/he.h.m4:heHE.ThysoSoiMetaFonis.name
ltx/gr_gr_cog/me.m02.d13:meMA.Ode6C1T.mode	@ltx/gr_gr_cog/miscellanea:misc.Mode4
ltx/gr_gr_cog/me.m02.d13:meMA.Ode6C1T.ode	@ltx/gr_gr_cog/miscellanea:misc.Ode6
ltx/gr_gr_cog/me.m02.d13:meMA.Ode6C1T.text	Ὅλην σε, καθηγίασε Λόγος ὁ Ἅγιος, σοῦ κατοικήσας τὴν μήτραν, τὴν ἡγιασμένην ἀῤῥήτῳ λόγῳ, ὃν δυσώπει, ἐκτενῶς τοῦ σωθῆναι τοὺς δούλους σου.
ltx/gr_gr_cog/me.m02.d13:meMA.Ode7C11.greekmelody	@ltx/gr_gr_cog/he.h.m4:heHE.EnTiKaminoAvramiaioi.greekname
ltx/gr_gr_cog/me.m02.d13:meMA.Ode7C11.incipit	Ὑπὸ τῆς θείας, κυβερνώμενος Πάτερ…
ltx/gr_gr_cog/me.m02.d13:meMA.Ode7C11.melody	@ltx/gr_gr_cog/he.h.m4:heHE.EnTiKaminoAvramiaioi.name
ltx/gr_gr_cog/me.m02.d13:meMA.Ode7C11.mode	@ltx/gr_gr_cog/miscellanea:misc.Mode4
ltx/gr_gr_cog/me.m02.d13:meMA.Ode7C11.ode	@ltx/gr_gr_cog/miscellanea:misc.Ode7
ltx/gr_gr_cog/me.m02.d13:meMA.Ode7C11.text	Ὑπὸ τῆς θείας, κυβερνώμενος Πάτερ χειρός, ὥσπερ, Ἰωνᾶς ἀπέῤῥιψας σεαυτόν, εἰς βυθὸν θαλάσσης Ὅσιε, θηρσὶν ὀχούμενος, καὶ τῇ χέρσῳ λαμπρὸς ἐκδιδόμενος.
ltx/gr_gr_cog/me.m02.d13:meMA.Ode7C12.incipit	Συμπαθεστάτῃ, προαιρέσει Πάτερ σῴζεις σαφῶς…
ltx/gr_gr_cog/me.m02.d13:meMA.Ode7C12.melody	@ltx/gr_gr_cog/he.h.m4:heHE.EnTiKaminoAvramiaioi.name
ltx/gr_gr_cog/me.m02.d13:meMA.Ode7C12.mode	@ltx/gr_gr_cog/miscellanea:misc.Mode4
ltx/gr_gr_cog/me.m02.d13:meMA.Ode7C12.ode	@ltx/gr_gr_cog/miscellanea:misc.Ode7
ltx/gr_gr_cog/me.m02.d13:meMA.Ode7C12.text	Συμπαθεστάτῃ, προαιρέσει Πάτερ σῴζεις σαφῶς κόρην πικροτάτης ζάλης καὶ ἀκλινῆ ἐπὶ πέτραν θείας γνώσεως, στηρίζεις ψάλλουσαν, καὶ Θεῷ εὐαρέστως λατρεύουσαν.
ltx/gr_gr_cog/me.m02.d13:meMA.Ode7C13.incipit	Θεοῦ προστάξει, θαλαττίου ῥυσθεὶς ἐκ…
ltx/gr_gr_cog/me.m02.d13:meMA.Ode7C13.melody	@ltx/gr_gr_cog/he.h.m4:heHE.EnTiKaminoAvramiaioi.name
ltx/gr_gr_cog/me.m02.d13:meMA.Ode7C13.mode	@ltx/gr_gr_cog/miscellanea:misc.Mode4
ltx/gr_gr_cog/me.m02.d13:meMA.Ode7C13.ode	@ltx/gr_gr_cog/miscellanea:misc.Ode7
ltx/gr_gr_cog/me.m02.d13:meMA.Ode7C13.text	Θεοῦ προστάξει, θαλαττίου ῥυσθεὶς ἐκ κλύδωνος, ταύτην μακαρίαν δέδωκας ἀμοιβήν, τὴν τοῦ σώματός σου νέκρωσιν, καὶ τὴν ὁλόκληρον, πρὸς τὸν πάντων Δεσπότην διάθεσιν.
ltx/gr_gr_cog/me.m02.d13:meMA.Ode7C1H.greekmelody	@ltx/gr_gr_cog/he.h.m4:heHE.EnTiKaminoAvramiaioi.greekname
ltx/gr_gr_cog/me.m02.d13:meMA.Ode7C1H.incipit	@ltx/gr_gr_cog/he.h.m4:heHE.EnTiKaminoAvramiaioi.incipit
ltx/gr_gr_cog/me.m02.d13:meMA.Ode7C1H.melody	@ltx/gr_gr_cog/he.h.m4:heHE.EnTiKaminoAvramiaioi.melody
ltx/gr_gr_cog/me.m02.d13:meMA.Ode7C1H.mode	@ltx/gr_gr_cog/miscellanea:misc.Mode4
ltx/gr_gr_cog/me.m02.d13:meMA.Ode7C1H.ode	@ltx/gr_gr_cog/miscellanea:misc.Ode7
ltx/gr_gr_cog/me.m02.d13:meMA.Ode7C1H.text	@ltx/gr_gr_cog/he.h.m4:heHE.EnTiKaminoAvramiaioi.text
ltx/gr_gr_cog/me.m02.d13:meMA.Ode7C1T.incipit	Ἐκ σοῦ τῆς δόξης, Θεογεννῆτορ…
ltx/gr_gr_cog/me.m02.d13:meMA.Ode7C1T.melody	@ltx/gr_gr_cog/he.h.m4:heHE.EnTiKaminoAvramiaioi.name
ltx/gr_gr_cog/me.m02.d13:meMA.Ode7C1T.mode	@ltx/gr_gr_cog/miscellanea:misc.Mode4
ltx/gr_gr_cog/me.m02.d13:meMA.Ode7C1T.ode	@ltx/gr_gr_cog/miscellanea:misc.Ode7
ltx/gr_gr_cog/me.m02.d13:meMA.Ode7C1T.text	Ἐκ σοῦ τῆς δόξης, Θεογεννῆτορ λάμψας Ἥλιος, πάντων τῶν πιστῶν ἐφώτισε τὰς ψυχάς, μελῳδούντων θείῳ Πνεύματι· Εὐλογημένος εἶ ἐν τῷ ναῷ τῆς δόξης σου Κύριε.
ltx/gr_gr_cog/me.m02.d13:meMA.Ode8C11.greekmelody	@ltx/gr_gr_cog/he.h.m4:heHE.CheirasEkpetasasDaniil.greekname
ltx/gr_gr_cog/me.m02.d13:meMA.Ode8C11.incipit	Ἰσχύς μου καὶ ὕμνησις αὐτός…
ltx/gr_gr_cog/me.m02.d13:meMA.Ode8C11.melody	@ltx/gr_gr_cog/he.h.m4:heHE.CheirasEkpetasasDaniil.name
ltx/gr_gr_cog/me.m02.d13:meMA.Ode8C11.mode	@ltx/gr_gr_cog/miscellanea:misc.Mode4
ltx/gr_gr_cog/me.m02.d13:meMA.Ode8C11.ode	@ltx/gr_gr_cog/miscellanea:misc.Ode8
ltx/gr_gr_cog/me.m02.d13:meMA.Ode8C11.text	Ἰσχύς μου καὶ ὕμνησις αὐτός, ὑπάρχεις Κύριε, μερὶς καὶ κλῆρός μου, σοῦ τὴν ἑκούσιον νέκρωσιν, περιφέρων περιέρχομαι, πόλεις καὶ χώρας ἐμμελῶς, Πάτερ ἐκραύγαζες· Εὐλογεῖτε, πάντα τὰ ἔργα Κυρίου τὸν Κύριον.
ltx/gr_gr_cog/me.m02.d13:meMA.Ode8C12.incipit	Οὐ ψύχει χαυνούμενος τὸν νοῦν…
ltx/gr_gr_cog/me.m02.d13:meMA.Ode8C12.melody	@ltx/gr_gr_cog/he.h.m4:heHE.CheirasEkpetasasDaniil.name
ltx/gr_gr_cog/me.m02.d13:meMA.Ode8C12.mode	@ltx/gr_gr_cog/miscellanea:misc.Mode4
ltx/gr_gr_cog/me.m02.d13:meMA.Ode8C12.ode	@ltx/gr_gr_cog/miscellanea:misc.Ode8
ltx/gr_gr_cog/me.m02.d13:meMA.Ode8C12.text	Οὐ ψύχει χαυνούμενος τὸν νοῦν, ἀλλʼ οὐδὲ καύσωνι, ψυχὴν φλεγόμενος, ὅλως ἐνέδωκας θλίβων σου, τὸ σαρκίον, ἀλλʼ ὑπέφερες, τὴν τοῖς δικαίοις ἐννοῶν μακαριότητα, καὶ κραυγάζων· Πάντα τὰ ἔργα ὑμνεῖτε τὸν Κύριον.
ltx/gr_gr_cog/me.m02.d13:meMA.Ode8C13.incipit	Ἱστίῳ πτερούμενος σοφέ, τοῦ θείου…
ltx/gr_gr_cog/me.m02.d13:meMA.Ode8C13.melody	@ltx/gr_gr_cog/he.h.m4:heHE.CheirasEkpetasasDaniil.name
ltx/gr_gr_cog/me.m02.d13:meMA.Ode8C13.mode	@ltx/gr_gr_cog/miscellanea:misc.Mode4
ltx/gr_gr_cog/me.m02.d13:meMA.Ode8C13.ode	@ltx/gr_gr_cog/miscellanea:misc.Ode8
ltx/gr_gr_cog/me.m02.d13:meMA.Ode8C13.text	Ἱστίῳ πτερούμενος σοφέ, τοῦ θείου Πνεύματος, κούφως διέπλασας, βίου τὴν θάλασσαν Ὅσιε, καὶ λιμένι προσεπέλασας, τῆς βασιλείας τοῦ Θεοῦ, μέλπων γηθόμενος· Εὐλογεῖτε, πάντα τὰ ἔργα Κυρίου τὸν Κύριον.
ltx/gr_gr_cog/me.m02.d13:meMA.Ode8C14.incipit	Σκηναῖς ἐναυλίζῃ φωτειναῖς, ἀποδυσάμενος, νέφος…
ltx/gr_gr_cog/me.m02.d13:meMA.Ode8C14.melody	@ltx/gr_gr_cog/he.h.m4:heHE.CheirasEkpetasasDaniil.name
ltx/gr_gr_cog/me.m02.d13:meMA.Ode8C14.mode	@ltx/gr_gr_cog/miscellanea:misc.Mode4
ltx/gr_gr_cog/me.m02.d13:meMA.Ode8C14.ode	@ltx/gr_gr_cog/miscellanea:misc.Ode8
ltx/gr_gr_cog/me.m02.d13:meMA.Ode8C14.text	Σκηναῖς ἐναυλίζῃ φωτειναῖς, ἀποδυσάμενος, νέφος τοῦ σώματος, στολαῖς φαιδρύνῃ δὲ Ὅσιε, ἐξ ἱδρώτων ὑφανθείσαις σου, ἀσκητικῶν, καὶ μελῳδεῖς καθαρωτάτῃ ψυχῇ· Εὐλογεῖτε, πάντα τὰ ἔργα Κυρίου τὸν Κύριον.
ltx/gr_gr_cog/me.m02.d13:meMA.Ode8C1H.greekmelody	@ltx/gr_gr_cog/he.h.m4:heHE.CheirasEkpetasasDaniil.greekname
ltx/gr_gr_cog/me.m02.d13:meMA.Ode8C1H.incipit	@ltx/gr_gr_cog/he.h.m4:heHE.CheirasEkpetasasDaniil.incipit
ltx/gr_gr_cog/me.m02.d13:meMA.Ode8C1H.melody	@ltx/gr_gr_cog/he.h.m4:heHE.CheirasEkpetasasDaniil.melody
ltx/gr_gr_cog/me.m02.d13:meMA.Ode8C1H.mode	@ltx/gr_gr_cog/miscellanea:misc.Mode4
ltx/gr_gr_cog/me.m02.d13:meMA.Ode8C1H.ode	@ltx/gr_gr_cog/miscellanea:misc.Ode8
ltx/gr_gr_cog/me.m02.d13:meMA.Ode8C1H.text	@ltx/gr_gr_cog/he.h.m4:heHE.CheirasEkpetasasDaniil.text
ltx/gr_gr_cog/me.m02.d13:meMA.Ode8C1T.incipit	Λυτρούμενος κόσμον τῆς φθορᾶς, ἐκ…
ltx/gr_gr_cog/me.m02.d13:meMA.Ode8C1T.melody	@ltx/gr_gr_cog/he.h.m4:heHE.CheirasEkpetasasDaniil.name
ltx/gr_gr_cog/me.m02.d13:meMA.Ode8C1T.mode	@ltx/gr_gr_cog/miscellanea:misc.Mode4
ltx/gr_gr_cog/me.m02.d13:meMA.Ode8C1T.ode	@ltx/gr_gr_cog/miscellanea:misc.Ode8
ltx/gr_gr_cog/me.m02.d13:meMA.Ode8C1T.text	Λυτρούμενος κόσμον τῆς φθορᾶς, ἐκ σοῦ σεσάρκωται ὁ ὑπερούσιος, θεοχαρίτωτε Δέσποινα, ἐνεργείαις καὶ θελήσεσι, διπλοῦς ὁρώμενος, μιᾷ τῇ ὑποστάσει δέ, ᾧ βοῶμεν· Πάντα τὰ ἔργα ὑμνεῖτε τὸν Κύριον.
ltx/gr_gr_cog/me.m02.d13:meMA.Ode9C11.greekmelody	@ltx/gr_gr_cog/he.h.m4:heHE.LithosAcheirotmitos.greekname
ltx/gr_gr_cog/me.m02.d13:meMA.Ode9C11.incipit	Ὅλην τὴν τοῦ Πνεύματος αἴγλην…
ltx/gr_gr_cog/me.m02.d13:meMA.Ode9C11.melody	@ltx/gr_gr_cog/he.h.m4:heHE.LithosAcheirotmitos.name
ltx/gr_gr_cog/me.m02.d13:meMA.Ode9C11.mode	@ltx/gr_gr_cog/miscellanea:misc.Mode4
ltx/gr_gr_cog/me.m02.d13:meMA.Ode9C11.ode	@ltx/gr_gr_cog/miscellanea:misc.Ode9
ltx/gr_gr_cog/me.m02.d13:meMA.Ode9C11.text	Ὅλην τὴν τοῦ Πνεύματος αἴγλην, καθαρωτάτῃ διανοίᾳ, Μαρτινιανὲ εἰσεδέξω, καὶ φῶς ὡράθης καὶ στῦλος Ὅσιε, ἀπὸ τῆς γῆς αἰρόμενος, καὶ Μοναζόντων προηγούμενος.
ltx/gr_gr_cog/me.m02.d13:meMA.Ode9C12.incipit	Γέρα σοι τῶν πόνων παρέχει…
ltx/gr_gr_cog/me.m02.d13:meMA.Ode9C12.melody	@ltx/gr_gr_cog/he.h.m4:heHE.LithosAcheirotmitos.name
ltx/gr_gr_cog/me.m02.d13:meMA.Ode9C12.mode	@ltx/gr_gr_cog/miscellanea:misc.Mode4
ltx/gr_gr_cog/me.m02.d13:meMA.Ode9C12.ode	@ltx/gr_gr_cog/miscellanea:misc.Ode9
ltx/gr_gr_cog/me.m02.d13:meMA.Ode9C12.text	Γέρα σοι τῶν πόνων παρέχει, ὁ ἀθλοθέτης σου παμμάκαρ, οὗτινος τοὺς νόμους φυλάττων, ἀνεπιστρόφως τῆς συνειδήσεως, τὸ καθαρὸν διήνυσας, Πάτερ ἀοίδιμε μαρτύριον.
ltx/gr_gr_cog/me.m02.d13:meMA.Ode9C13.incipit	Οἰκεῖς ἐν φωτὶ μέτʼ Ἀγγέλων…
ltx/gr_gr_cog/me.m02.d13:meMA.Ode9C13.melody	@ltx/gr_gr_cog/he.h.m4:heHE.LithosAcheirotmitos.name
ltx/gr_gr_cog/me.m02.d13:meMA.Ode9C13.mode	@ltx/gr_gr_cog/miscellanea:misc.Mode4
ltx/gr_gr_cog/me.m02.d13:meMA.Ode9C13.ode	@ltx/gr_gr_cog/miscellanea:misc.Ode9
ltx/gr_gr_cog/me.m02.d13:meMA.Ode9C13.text	Οἰκεῖς ἐν φωτὶ μέτʼ Ἀγγέλων βίον ἰσάγγελον βιώσας, θείας ἡδονῆς ἀπολαύων, καὶ θεωρίας καὶ καθαρότητος, ὡς καθαρὸς τῷ πνεύματι, γεγενημένος, Ἀξιάγαστε.
ltx/gr_gr_cog/me.m02.d13:meMA.Ode9C14.incipit	Ἱέρευσας τὸ σῶμα θεόφρον, τὸν…
ltx/gr_gr_cog/me.m02.d13:meMA.Ode9C14.melody	@ltx/gr_gr_cog/he.h.m4:heHE.LithosAcheirotmitos.name
ltx/gr_gr_cog/me.m02.d13:meMA.Ode9C14.mode	@ltx/gr_gr_cog/miscellanea:misc.Mode4
ltx/gr_gr_cog/me.m02.d13:meMA.Ode9C14.ode	@ltx/gr_gr_cog/miscellanea:misc.Ode9
ltx/gr_gr_cog/me.m02.d13:meMA.Ode9C14.text	Ἱέρευσας τὸ σῶμα θεόφρον, τὸν λογισμὸν καὶ τὴν καρδίαν, Μαρτινιανὲ τῷ Κυρίῳ, καὶ θῦμα ὤφθης πυρὶ ἀσκήσεως, περιφανῶς ὀπτώμενον, καὶ εὐωδίᾳ συντηρούμενον.
ltx/gr_gr_cog/me.m02.d13:meMA.Ode9C1H.greekmelody	@ltx/gr_gr_cog/he.h.m4:heHE.LithosAcheirotmitos.greekname
ltx/gr_gr_cog/me.m02.d13:meMA.Ode9C1H.incipit	@ltx/gr_gr_cog/he.h.m4:heHE.LithosAcheirotmitos.incipit
ltx/gr_gr_cog/me.m02.d13:meMA.Ode9C1H.melody	@ltx/gr_gr_cog/he.h.m4:heHE.LithosAcheirotmitos.melody
ltx/gr_gr_cog/me.m02.d13:meMA.Ode9C1H.mode	@ltx/gr_gr_cog/miscellanea:misc.Mode4
ltx/gr_gr_cog/me.m02.d13:meMA.Ode9C1H.ode	@ltx/gr_gr_cog/miscellanea:misc.Ode9
ltx/gr_gr_cog/me.m02.d13:meMA.Ode9C1H.text	@ltx/gr_gr_cog/he.h.m4:heHE.LithosAcheirotmitos.text
ltx/gr_gr_cog/me.m02.d13:meMA.Ode9C1T.incipit	Σὲ τὴν τοῦ Ἡλίου τῆς…
ltx/gr_gr_cog/me.m02.d13:meMA.Ode9C1T.melody	@ltx/gr_gr_cog/he.h.m4:heHE.LithosAcheirotmitos.name
ltx/gr_gr_cog/me.m02.d13:meMA.Ode9C1T.mode	@ltx/gr_gr_cog/miscellanea:misc.Mode4
ltx/gr_gr_cog/me.m02.d13:meMA.Ode9C1T.ode	@ltx/gr_gr_cog/miscellanea:misc.Ode9
ltx/gr_gr_cog/me.m02.d13:meMA.Ode9C1T.text	Σὲ τὴν τοῦ Ἡλίου τῆς δόξης, κούφην νεφέλην Θεοτόκε, ἐξ ἧς ὑπὲρ νοῦν ἀνατείλας, τὴν κτίσιν πᾶσαν ἐφωταγώγησεν, εὐσεβοφρόνως ᾄσμασι, Παρθενομῆτορ, μεγαλύνομεν.
ltx/gr_gr_cog/me.m02.d13:meMA.Oikos1.text	Ἀπὸ περάτων ἕως περάτων διεξῆλθεν ὁ φθόγγος τῶν τερπνῶν ἀρετῶν, καὶ τῶν ἐνθέων ἀγώνων σου· νέος γὰρ ὑπάρχων τῇ ἡλικίᾳ, ἐρήμοις ἐπόθησας συνδιαιτᾶσθαι, ὕμνους Χριστῷ, ψαλμῳδίας, εὐχὰς ἀναπέμπων ἀεί· ἡμέραν τε καὶ νύκτα συναύξων ἔν τε πόνοις καὶ δάκρυσιν, ἁγνῶς τὸν βίον ἐτέλεσας, καὶ σοφῶς τὸν ἀρχέκακον ᾔσχυνας. Αὐτὸς γὰρ τὸν ὄφιν κατεπάτησας.
ltx/gr_gr_cog/me.m02.d13:meVE.Apolytikion1.incipit	Τὴν φλόγα τῶν πειρασμῶν, δακρύων…
ltx/gr_gr_cog/me.m02.d13:meVE.Apolytikion1.melody	
ltx/gr_gr_cog/me.m02.d13:meVE.Apolytikion1.mode	@ltx/gr_gr_cog/miscellanea:misc.Mode8
ltx/gr_gr_cog/me.m02.d13:meVE.Apolytikion1.text	Τὴν φλόγα τῶν πειρασμῶν, δακρύων τοῖς ὀχετοῖς, ἐναπέσβεσας Μακάριε, καὶ τῆς θαλάσσης τὰ κύματα, καὶ τῶν θηρῶν τὰ ὁρμήματα, χαλινώσας ἐκραύγαζες· Δεδοξασμένος εἶ Παντοδύναμε, πυρὸς καὶ ζάλης ὁ σώσας με.
ltx/gr_gr_cog/me.m02.d13:meVE.AposGlory.incipit	Πεποικιλμένος στολῇ ἁγνείας, καὶ πεπυρσευμένος…
ltx/gr_gr_cog/me.m02.d13:meVE.AposGlory.melody	
ltx/gr_gr_cog/me.m02.d13:meVE.AposGlory.mode	@ltx/gr_gr_cog/miscellanea:misc.Mode2
ltx/gr_gr_cog/me.m02.d13:meVE.AposGlory.poet	@ltx/gr_gr_cog/poets:po.TheodorouTouStouditou
ltx/gr_gr_cog/me.m02.d13:meVE.AposGlory.text	Πεποικιλμένος στολῇ ἁγνείας, καὶ πεπυρσευμένος ἐντεύξει θείᾳ, ἔνοικόν τε ἔχων Χριστὸν τὸν ἐκ Παρθένου τεχθέντα, γυναικείᾳ στολῇ οὐ συνηρπάγης, οὐδὲ ἡδονάς κατεδέξω, ἀλλʼ ἐπέβης προθύμως τῷ ὁμοδούλῳ πυρί, τὸ θεῖον πῦρ ἐγκάρδιον ἔχων· καὶ διὰ τοῦ αἰσθητοῦ καὶ προσκαίρου πυρός, τὸ ἐμπαθὲς πῦρ κατέφλεξας, καὶ τῆς γεέννης τὴν φλόγα κατέσβεσας. Διὸ πρέσβευε, Μαρτινιανὲ τρισόλβιε, καὶ ἡμᾶς τοῦ ὀλεθρίου καὶ αἰωνίου λυτρωθῆναι πυρός.
ltx/gr_gr_cog/me.m02.d13:meVE.AposStavrotheotokion.greekmelody	@ltx/gr_gr_cog/he.a.m2:heAU.OteEkTouXylou.greekname
ltx/gr_gr_cog/me.m02.d13:meVE.AposStavrotheotokion.incipit	Ὢ τῆς ἀγαθότητος τῆς σῆς!…
ltx/gr_gr_cog/me.m02.d13:meVE.AposStavrotheotokion.melody	@ltx/gr_gr_cog/he.a.m2:heAU.OteEkTouXylou.name
ltx/gr_gr_cog/me.m02.d13:meVE.AposStavrotheotokion.mode	@ltx/gr_gr_cog/miscellanea:misc.Mode2
ltx/gr_gr_cog/me.m02.d13:meVE.AposStavrotheotokion.text	Ὢ τῆς ἀγαθότητος τῆς σῆς! ὢ τῆς ὑπὲρ νοῦν εὐσπλαγχνίας! ὢ τῆς πολλῆς ἀνοχῆς, καὶ μακροθυμίας σου, Λόγε προάναρχε! ἡ Παρθένος ἐκραύγαζεν, ὁλοφυρομένη. Πῶς ὁ ὢν ἀθάνατος, θανεῖν ἠγάπησας; Μέγα τὸ μυστήριον βλέπω! ὅμως προσκυνῶ σου τὰ πάθη, ἅπερ ἑκουσίως καθυπέμεινας.
ltx/gr_gr_cog/me.m02.d13:meVE.AposTheotokion.greekmelody	@ltx/gr_gr_cog/he.a.m2:heAU.OteEkTouXylou.greekname
ltx/gr_gr_cog/me.m02.d13:meVE.AposTheotokion.incipit	@ltx/gr_gr_cog/oc.m2.d6:ocVE.Stichera4.incipit
ltx/gr_gr_cog/me.m02.d13:meVE.AposTheotokion.melody	@ltx/gr_gr_cog/he.a.m2:heAU.OteEkTouXylou.name
ltx/gr_gr_cog/me.m02.d13:meVE.AposTheotokion.mode	@ltx/gr_gr_cog/miscellanea:misc.Mode2
ltx/gr_gr_cog/me.m02.d13:meVE.AposTheotokion.text	@ltx/gr_gr_cog/oc.m2.d6:ocVE.Stichera4.text
ltx/gr_gr_cog/me.m02.d13:meVE.SticGlory.incipit	Χαίροις ἔντιμον καὶ πολυθαύμαστον, Παλαιστινῶν…
ltx/gr_gr_cog/me.m02.d13:meVE.SticGlory.melody	
ltx/gr_gr_cog/me.m02.d13:meVE.SticGlory.mode	@ltx/gr_gr_cog/miscellanea:misc.Mode2
ltx/gr_gr_cog/me.m02.d13:meVE.SticGlory.poet	@ltx/gr_gr_cog/poets:po.TheodorouTouStouditou
ltx/gr_gr_cog/me.m02.d13:meVE.SticGlory.text	Χαίροις ἔντιμον καὶ πολυθαύμαστον, Παλαιστινῶν τὸ κῦδος· ἀνέτειλας γὰρ ἡμῖν ὡς φαεινότατος ἥλιος, καὶ τὴν τοῦ ἐχθροῦ καταφλέξας ἅπασαν τὴν δυναστείαν, τῶν μελῶν σου ἥψω πυρὶ μακάριε· ἐν ὄρεσι γὰρ καὶ ἐρήμοις καὶ νήσοις, πάντα πειρασμόν σοι προσήγαγε, τὸ μέν, ἐν ἐρήμῳ γύναιόν σοι παρεστήσατο, τὸ δέ, ἐν βράχει θαλαττίῳ, ὁ πειράζων πειράζειν σε, ἐπειρᾶτο σοφέ. Ἀλλʼ ὦ Μαρτινιανὲ τρισόλβιε, Χριστὸν ἀπαύστως ὑπὲρ ἡμῶν ἱκετεύων μὴ παύσῃ, τῶν ἐκτελούντων σου πιστῶς τὸ μνημόσυνον.
ltx/gr_gr_cog/me.m02.d13:meVE.SticStavrotheotokion.greekmelody	@ltx/gr_gr_cog/he.a.m4:heAU.EdokasSimeiosin.greekname
ltx/gr_gr_cog/me.m02.d13:meVE.SticStavrotheotokion.incipit	@ltx/gr_gr_cog/me.m02.d03:meVE.SticStavrotheotokion.incipit
ltx/gr_gr_cog/me.m02.d13:meVE.SticStavrotheotokion.melody	@ltx/gr_gr_cog/he.a.m4:heAU.EdokasSimeiosin.name
ltx/gr_gr_cog/me.m02.d13:meVE.SticStavrotheotokion.mode	@ltx/gr_gr_cog/miscellanea:misc.Mode4
ltx/gr_gr_cog/me.m02.d13:meVE.SticStavrotheotokion.text	@ltx/gr_gr_cog/me.m02.d03:meVE.SticStavrotheotokion.text
ltx/gr_gr_cog/me.m02.d13:meVE.SticStavrotheotokion2.greekmelody	@ltx/gr_gr_cog/he.a.m2:heAU.OteEkTouXylou.greekname
ltx/gr_gr_cog/me.m02.d13:meVE.SticStavrotheotokion2.incipit	Ὅτε ἐν Σταυρῷ σε ἡ…
ltx/gr_gr_cog/me.m02.d13:meVE.SticStavrotheotokion2.melody	@ltx/gr_gr_cog/he.a.m2:heAU.OteEkTouXylou.name
ltx/gr_gr_cog/me.m02.d13:meVE.SticStavrotheotokion2.mode	@ltx/gr_gr_cog/miscellanea:misc.Mode2
ltx/gr_gr_cog/me.m02.d13:meVE.SticStavrotheotokion2.text	Ὅτε ἐν Σταυρῷ σε ἡ Ἀμνάς, Ἄρνα τὸν οἰκεῖον ἑώρα, κατακεντούμενον, ἥλοις ὠλοφύρετο, ἐκπληττομένη σφοδρῶς, καὶ δακρύουσα ἔλεγε· Πῶς θνῄσκεις Υἱέ μου, θέλων τὸ χειρόγραφον, τοῦ πρωτοπλάστου Ἀδάμ, ῥῆξαι, καὶ θανάτου λυτρῶσαι, ἄπαν τὸ ἀνθρώπινον; Δόξα, τῇ οἰκονομίᾳ σου Μακρόθυμε.
ltx/gr_gr_cog/me.m02.d13:meVE.SticTheotokion.greekmelody	@ltx/gr_gr_cog/he.a.m4:heAU.EdokasSimeiosin.greekname
ltx/gr_gr_cog/me.m02.d13:meVE.SticTheotokion.incipit	@ltx/gr_gr_cog/me.m02.d03:meVE.SticTheotokion.incipit
ltx/gr_gr_cog/me.m02.d13:meVE.SticTheotokion.melody	@ltx/gr_gr_cog/he.a.m4:heAU.EdokasSimeiosin.name
ltx/gr_gr_cog/me.m02.d13:meVE.SticTheotokion.mode	@ltx/gr_gr_cog/miscellanea:misc.Mode4
ltx/gr_gr_cog/me.m02.d13:meVE.SticTheotokion.text	@ltx/gr_gr_cog/me.m02.d03:meVE.SticTheotokion.text
ltx/gr_gr_cog/me.m02.d13:meVE.SticTheotokion2.greekmelody	@ltx/gr_gr_cog/he.a.m2:heAU.OteEkTouXylou.greekname
ltx/gr_gr_cog/me.m02.d13:meVE.SticTheotokion2.incipit	Σὺ εἶ τῶν Ἀγγέλων ἡ…
ltx/gr_gr_cog/me.m02.d13:meVE.SticTheotokion2.melody	@ltx/gr_gr_cog/he.a.m2:heAU.OteEkTouXylou.name
ltx/gr_gr_cog/me.m02.d13:meVE.SticTheotokion2.mode	@ltx/gr_gr_cog/miscellanea:misc.Mode2
ltx/gr_gr_cog/me.m02.d13:meVE.SticTheotokion2.text	Σὺ εἶ τῶν Ἀγγέλων ἡ χαρά, σὺ εἶ τῶν ἀνθρώπων ἡ δόξα, σὺ τῶν πιστῶν ἡ ἐλπίς, Δέσποινα πανάμωμε, καὶ προστασία ἡμῶν· καὶ πρὸς σὲ καταφεύγοντες, ἐν πίστει βοῶμεν· Ὅπως ταῖς πρεσβείαις σου, ἐκ τῶν βελῶν τοῦ ἐχθροῦ, λύπης ψυχοφθόρου καὶ πάσης, θλίψεως ῥυσθείημεν πάντες, οἱ ἀνευφημοῦντές σε Θεόνυμφε.
ltx/gr_gr_cog/me.m02.d13:meVE.Stichera01.greekmelody	@ltx/gr_gr_cog/he.a.m4:heAU.EdokasSimeiosin.greekname
ltx/gr_gr_cog/me.m02.d13:meVE.Stichera01.incipit	Ἄσκησιν ἑλόμενος, καὶ κακουχίαν μακάριε…
ltx/gr_gr_cog/me.m02.d13:meVE.Stichera01.melody	@ltx/gr_gr_cog/he.a.m4:heAU.EdokasSimeiosin.name
ltx/gr_gr_cog/me.m02.d13:meVE.Stichera01.mode	@ltx/gr_gr_cog/miscellanea:misc.Mode4
ltx/gr_gr_cog/me.m02.d13:meVE.Stichera01.text	Ἄσκησιν ἑλόμενος, καὶ κακουχίαν μακάριε, ἐν σπηλαίοις καὶ ὄρεσι, σαυτὸν ἀπεμάκρυνας, φυγαδεύων Πάτερ, καὶ ταῖς θεωρίαις, καὶ ἀναβάσεσι τὸν νοῦν, ἀποκαθαίρων, καὶ καλλυνόμενος, ἐντεῦθεν ἐχρημάτισας, θεῖον δοχεῖον τοῦ Πνεύματος, θεοφόρε πανόλβιε, μοναζόντων τὸ καύχημα.
ltx/gr_gr_cog/me.m02.d13:meVE.Stichera02.incipit	Μάρτυς ἐθελούσιος, καὶ δικαστὴς καὶ…
ltx/gr_gr_cog/me.m02.d13:meVE.Stichera02.melody	@ltx/gr_gr_cog/he.a.m4:heAU.EdokasSimeiosin.name
ltx/gr_gr_cog/me.m02.d13:meVE.Stichera02.mode	@ltx/gr_gr_cog/miscellanea:misc.Mode4
ltx/gr_gr_cog/me.m02.d13:meVE.Stichera02.text	Μάρτυς ἐθελούσιος, καὶ δικαστὴς καὶ κατήγορος, σεαυτοῦ ἐχρημάτισας· πυρὶ γὰρ φλεγόμενος, ἡδονῆς ἀτόπου, πυρὰν λαυροτάτην Πάτερ ἀνάψας σεαυτόν, μέσον εἰσῆξας κατακαιόμενος, ἡ δρόσος δὲ τοῦ Πνεύματος, ἐξ οὐρανοῦ σε ἀνέψυξε, καὶ τὸν σάλον τὸν ἄπειρον, εἰς γαλήνην μετήγαγε.
ltx/gr_gr_cog/me.m02.d13:meVE.Stichera03.incipit	Μέσον κατεσκήνωσας, θαλάσσης Πάτερ τὰ…
ltx/gr_gr_cog/me.m02.d13:meVE.Stichera03.melody	@ltx/gr_gr_cog/he.a.m4:heAU.EdokasSimeiosin.name
ltx/gr_gr_cog/me.m02.d13:meVE.Stichera03.mode	@ltx/gr_gr_cog/miscellanea:misc.Mode4
ltx/gr_gr_cog/me.m02.d13:meVE.Stichera03.text	Μέσον κατεσκήνωσας, θαλάσσης Πάτερ τὰ κύματα, ἀποφεύγων τοῦ ὄφεως, κἀκεῖ δέ σοι θήρατρα ὁ ἐχθρὸς προσάγει τὴν διασωθεῖσαν, ἐκ τρικυμίας χαλεπῆς, θηρσὶ δὲ αὖθις προσεποχούμενος, τῇ χέρσῳ προσεπέλασας, καὶ τὸν ἀγῶνα ἐτέλεσας, ξενιτεύων θλιβόμενος, θεοφόρε πανόλβιε.
