ltx/gr_gr_cog/sy.m09.d19:cl.syMA.commemoration01.text	[saint/com 1]
ltx/gr_gr_cog/sy.m09.d19:cl.syMA.commemoration02.text	[saint/com 2]
ltx/gr_gr_cog/sy.m09.d19:cl.syMA.commemoration03.text	[saint/com 3]
ltx/gr_gr_cog/sy.m09.d19:cl.syMA.commemoration04.text	[saint/com 4]
ltx/gr_gr_cog/sy.m09.d19:cl.syMA.commemoration05.text	[saint/com 5]
ltx/gr_gr_cog/sy.m09.d19:cl.syMA.commemoration06.text	[saint/com list]
ltx/gr_gr_cog/sy.m09.d19:syMA.commemoration01.couplet1.title	@ltx/gr_gr_cog/titles:ti.Verses
ltx/gr_gr_cog/sy.m09.d19:syMA.commemoration01.couplet1.verse1	Πνέοντες ἓν Τρόφιμε καὶ Δορυμέδον,
ltx/gr_gr_cog/sy.m09.d19:syMA.commemoration01.couplet1.verse2	Ἓν ἐκ ξίφους δέχεσθε καὶ βίου τέλος.
ltx/gr_gr_cog/sy.m09.d19:syMA.commemoration01.couplet2.verse1	Ξεσθεὶς σιδηροῖς Σαββάτιος ὀξέσιν,
ltx/gr_gr_cog/sy.m09.d19:syMA.commemoration01.couplet2.verse2	Εἰς σαββατισμὸν θεῖον ὡς Μάρτυς φθάνει.
ltx/gr_gr_cog/sy.m09.d19:syMA.commemoration01.narration.p01	Οὗτοι ὑπῆρχον ἐπὶ τῆς βασιλείας Πρόβου· ὧν ὁ μὲν Σαββάτιος ἐν Ἀντιοχείᾳ παραστὰς τῷ Βικαρίῳ, καὶ σφοδρῶς τυφθεὶς καὶ καθειρχθείς, ἐν ταῖς βασάνοις παρέδωκε τὸ πνεῦμα. Ὁ δὲ Τρόφιμος, κρηπῖσι σιδηραῖς ὑποδεθεὶς καὶ ὑπερόριος ἐν τῇ Συννάδων γενόμενος, πολλάς τε μετὰ Δορυμέδοντος ὑποστὰς τιμωρίας, ἀπετμήθησαν τὰς κεφαλάς.
ltx/gr_gr_cog/sy.m09.d19:syMA.commemoration01.single1	Ἐννεακαιδεκάτῃ Τρόφιμον τάφον, ἠδὲ συνάθλους.
ltx/gr_gr_cog/sy.m09.d19:syMA.commemoration01.text	Τῇ ΙΘʹ τοῦ αὐτοῦ μηνός μνήμη τῶν ἁγίων Μαρτύρων Τροφίμου, Σαββατίου, καὶ Δορυμέδοντος.
ltx/gr_gr_cog/sy.m09.d19:syMA.lastline	Ταῖς αὐτῶν ἁγίαις πρεσβείαις, ὁ Θεός, ἐλέησον ἡμᾶς. Ἀμήν.
