ltx/gr_gr_cog/le.pr.me.r30:leprVE.reading.book_abbr	@ltx/gr_gr_cog/bible:Proverbs.abbr
ltx/gr_gr_cog/le.pr.me.r30:leprVE.reading.book_string	@ltx/gr_gr_cog/bible:Proverbs.text
ltx/gr_gr_cog/le.pr.me.r30:leprVE.reading.chapverse	ιʹ 7
ltx/gr_gr_cog/le.pr.me.r30:leprVE.reading.incipit	Μνήμη δικαίου μετʼ ἐγκωμίων, καὶ εὐλογία Κυρίου ἐπὶ κεφαλὴν…
ltx/gr_gr_cog/le.pr.me.r30:leprVE.reading.text	Μνήμη δικαίου μετʼ ἐγκωμίων, καὶ εὐλογία Κυρίου ἐπὶ κεφαλὴν αὐτοῦ. Μακάριος ἄνθρωπος, ὃς εὗρε σοφίαν, καὶ θνητὸς ὃς εἶδε φρόνησιν. Κρεῖττον γὰρ αὐτὴν ἐμπορεύεσθαι, ἢ χρυσίου καὶ ἀργυρίου θησαυρούς. Τιμιωτέρα δέ ἐστι λίθων πολυτελῶν· (οὐκ ἀντιτάσσεται αὐτῇ οὐδὲν πονηρόν, εὔγνωστός ἐστι πᾶσι τοῖς ἐγγίζουσιν αὐτήν). Πᾶν δὲ τίμιον, οὐκ ἄξιον αὐτῆς ἐστιν. Ἐκ γὰρ τοῦ στόματος αὐτῆς ἐκπορεύεται δικαιοσύνη. Νόμον δὲ καὶ ἔλεον ἐπὶ γλώσσης φορεῖ. Τοιγαροῦν, ἀκούσατέ μου, ὦ τέκνα· σεμνὰ γὰρ ἐρῶ καὶ μακάριος ἄνθρωπος, ὃς τὰς ἐμὰς ὁδοὺς φυλάξει. Αἱ γὰρ ἔξοδοί μου, ἔξοδοι ζωῆς, καὶ ἑτοιμάζεται θέλησις παρὰ Κυρίου. Διὰ τοῦτο παρακαλῶ ὑμᾶς, καὶ προΐεμαι ἐμὴν φωνὴν υἱοῖς ἀνθρώπων. Ὅτι ἐγὼ ἡ Σοφία κατεσκεύασα βουλὴν καὶ γνῶσιν καὶ ἒννοιαν ἐγὼ ἐπεκαλεσάμην. Ἐμὴ βουλὴ καὶ ἀσφάλεια, ἐμὴ φρόνησις, ἐμὴ δὲ ἰσχύς. Ἐγὼ τοὺς ἐμὲ φιλοῦντας ἀγαπῶ, οἱ δὲ ἐμὲ ζητοῦντες εὑρήσουσι χάριν. Νοήσατε τοίνυν ἄκακοι πανουργίαν, οἱ δὲ ἀπαίδευτοι ἔνθεσθε καρδίαν. Εἰσακούσατέ μου καὶ πάλιν· σεμνὰ γὰρ ἐρῶ, καὶ ἀνοίγω ἀπὸ χειλέων ὀρθά. Ὅτι ἀλήθειαν μελετήσει ὁ λάρυγξ μου, ἐβδελυγμένα δὲ ἐναντίον ἐμοῦ χείλη ψευδῆ. Μετὰ δικαιοσύνης πάντα τὰ ῥήματα τοῦ στόματός μου, οὐδὲν ἐν αὐτοῖς σκολιόν, οὐδὲ στραγγαλιῶδες. Πάντα εὐθέα ἐστὶ τοῖς νοοῦσι, καὶ ὀρθὰ τοῖς εὑρίσκουσι γνῶσιν. Διδάσκω γὰρ ὑμῖν ἀληθῆ, ἵνα γένηται ἐν Κυρίῳ ἡ ἐλπὶς ὑμῶν, καὶ πλησθήσεσθε Πνεύματος.
ltx/gr_gr_cog/le.pr.me.r30:leprVE.reading.title	
ltx/gr_gr_cog/le.pr.me.r30:leprVE.reading.title_abbr	
ltx/gr_gr_cog/le.pr.me.r30:leprVE.reading.version	@ltx/gr_gr_cog/properties:version.designation
