ltx/gr_gr_cog/me.m11.d28:meDA.commemoration.first	Μνήμη τοῦ Ὁσίου Στεφάνου τοῦ Νέου
ltx/gr_gr_cog/me.m11.d28:meDA.commemoration.first_name	
ltx/gr_gr_cog/me.m11.d28:meDA.commemoration.first_short	Μνήμη τοῦ Ὁσίου Στεφάνου τοῦ Νέου
ltx/gr_gr_cog/me.m11.d28:meDA.commemoration.first_title	Τοῦ Ἁγ. Στεφάνου.
ltx/gr_gr_cog/me.m11.d28:meDA.commemoration.full	Μνήμη τοῦ Ὁσίου Πατρὸς ἡμῶν Στεφάνου τοῦ Νέου· καὶ τοῦ Ἁγίου Μάρτυρος Εἰρηνάρχου
ltx/gr_gr_cog/me.m11.d28:meDA.commemoration.second_name	
ltx/gr_gr_cog/me.m11.d28:meDA.commemoration.second_title	Τοῦ Ἁγ. Εἰρηνάρχου.
ltx/gr_gr_cog/me.m11.d28:meDA.date	Τῌ ΚΗʹ ΝΟΕΜΒΡΙΟΥ
ltx/gr_gr_cog/me.m11.d28:meDA.fordate	διὰ τὴν 28ην Νοεμβρίου
ltx/gr_gr_cog/me.m11.d28:meDA.insert1	καὶ τοῦ ὁσίου καὶ θεοφόρου Πατρὸς ἡμῶν Στεφάνου τοῦ Νέου,
ltx/gr_gr_cog/me.m11.d28:meDA.insert2	οὗ καὶ τὴν μνήμην ἐπιτελοῦμεν·
ltx/gr_gr_cog/me.m11.d28:meDA.note	
ltx/gr_gr_cog/me.m11.d28:meDA.pdfcoverdate	τῆς 28ης Νοεμβρίου,
ltx/gr_gr_cog/me.m11.d28:meDA.pdfheaderdate	τῆς 28ης Νοεμβρίου
ltx/gr_gr_cog/me.m11.d28:meHO.commemorations	
ltx/gr_gr_cog/me.m11.d28:meHO.note1	
ltx/gr_gr_cog/me.m11.d28:meHO.note2	
ltx/gr_gr_cog/me.m11.d28:meHO.number	
ltx/gr_gr_cog/me.m11.d28:meHO.rank	
ltx/gr_gr_cog/me.m11.d28:meLE.commemoration1	Μνήμη τοῦ Ὁσίου Πατρὸς ἡμῶν Στεφάνου τοῦ Νέου· καὶ τοῦ Ἁγίου Μάρτυρος Εἰρηνάρχου.
ltx/gr_gr_cog/me.m11.d28:meLE.commemoration2	
ltx/gr_gr_cog/me.m11.d28:meLI.Kontakion1.greekmelody	@ltx/gr_gr_cog/me.m11.d28:meMA.Kontakion1.greekmelody
ltx/gr_gr_cog/me.m11.d28:meLI.Kontakion1.incipit	@ltx/gr_gr_cog/me.m11.d28:meMA.Kontakion1.incipit
ltx/gr_gr_cog/me.m11.d28:meLI.Kontakion1.melody	@ltx/gr_gr_cog/me.m11.d28:meMA.Kontakion1.melody
ltx/gr_gr_cog/me.m11.d28:meLI.Kontakion1.mode	@ltx/gr_gr_cog/me.m11.d28:meMA.Kontakion1.mode
ltx/gr_gr_cog/me.m11.d28:meLI.Kontakion1.text	@ltx/gr_gr_cog/me.m11.d28:meMA.Kontakion1.text
ltx/gr_gr_cog/me.m11.d28:meLI.MM.CommunionHymn.text	@ltx/gr_gr_cog/properties:media.key
ltx/gr_gr_cog/me.m11.d28:meLI.Megalynarion.text	
ltx/gr_gr_cog/me.m11.d28:meMA.AposGlory.incipit	Ἀφιερωθεὶς τῷ Θεῷ ἐκ κοιλίας…
ltx/gr_gr_cog/me.m11.d28:meMA.AposGlory.melody	
ltx/gr_gr_cog/me.m11.d28:meMA.AposGlory.mode	@ltx/gr_gr_cog/miscellanea:misc.Mode3
ltx/gr_gr_cog/me.m11.d28:meMA.AposGlory.text	Ἀφιερωθεὶς τῷ Θεῷ ἐκ κοιλίας μητρικῆς, ὡς ἄλλος Σαμουήλ, Ὅσιε Στέφανε, φερωνύμως στέφανος ἀνεδείχθης τῶν πιστῶν, εὐσεβείας βακτηρία καὶ ἑδραίωμα, καὶ τοῦ θείου Πνεύματος καθαρὸν οἰκητήριον. Αἴτησαι ἡμῖν τοῖς τιμῶσί σε τὸ μέγα ἔλεος.
ltx/gr_gr_cog/me.m11.d28:meMA.AposStavrotheotokion.greekmelody	@ltx/gr_gr_cog/he.a.m3:heAU.MegaliTouStavrouSou.greekname
ltx/gr_gr_cog/me.m11.d28:meMA.AposStavrotheotokion.incipit	Ῥομφαία τὴν καρδίαν σου διῆλθε…
ltx/gr_gr_cog/me.m11.d28:meMA.AposStavrotheotokion.melody	@ltx/gr_gr_cog/he.a.m3:heAU.MegaliTouStavrouSou.name
ltx/gr_gr_cog/me.m11.d28:meMA.AposStavrotheotokion.mode	@ltx/gr_gr_cog/miscellanea:misc.Mode3
ltx/gr_gr_cog/me.m11.d28:meMA.AposStavrotheotokion.text	Ῥομφαία τὴν καρδίαν σου διῆλθε Πάναγνε, ἡνίκα τὸν υἱόν σου, ἐπὶ Σταυροῦ προσέβλεψας, καὶ ἐβόας· Μὴ ἄτεκνόν με δείξῃς, Υἱέ μου καὶ Θεέ μου, ὁ συντηρήσας με μετὰ τόκον Παρθένον.
ltx/gr_gr_cog/me.m11.d28:meMA.AposTheotokion.incipit	@ltx/gr_gr_cog/oc.m3.d3:ocMA.AposTheotokion.incipit
ltx/gr_gr_cog/me.m11.d28:meMA.AposTheotokion.melody	
ltx/gr_gr_cog/me.m11.d28:meMA.AposTheotokion.mode	@ltx/gr_gr_cog/miscellanea:misc.Mode3
ltx/gr_gr_cog/me.m11.d28:meMA.AposTheotokion.text	@ltx/gr_gr_cog/oc.m3.d3:ocMA.AposTheotokion.text
ltx/gr_gr_cog/me.m11.d28:meMA.C1.acrostic.notice1	οὗ ἡ Ἀκροστιχίς·
ltx/gr_gr_cog/me.m11.d28:meMA.C1.acrostic.text	Χριστὸς στέφει σε Μαρτύρων στέφει, μάκαρ Ἰωσήφ.
ltx/gr_gr_cog/me.m11.d28:meMA.C1.acrostic.title	Ὁ Κανὼν τοῦ Ὁσίου,
ltx/gr_gr_cog/me.m11.d28:meMA.C1.title	@ltx/gr_gr_cog/titles:ti.CanonDevoutM
ltx/gr_gr_cog/me.m11.d28:meMA.C1.verse	@ltx/gr_gr_cog/prayers:pr.verse_DevoutMan.text
ltx/gr_gr_cog/me.m11.d28:meMA.C2.acrostic.notice1	οὗ ἡ Ἀκροστιχίς·
ltx/gr_gr_cog/me.m11.d28:meMA.C2.acrostic.text	Εἰρηνικήν μοι προσνέμοις Μάρτυς χάριν.
ltx/gr_gr_cog/me.m11.d28:meMA.C2.acrostic.title	Ὁ Κανὼν τοῦ Μάρτυρος,
ltx/gr_gr_cog/me.m11.d28:meMA.C2.poet	@ltx/gr_gr_cog/poets:po.Theofanous
ltx/gr_gr_cog/me.m11.d28:meMA.C2.title	@ltx/gr_gr_cog/titles:ti.CanonMartyrM
ltx/gr_gr_cog/me.m11.d28:meMA.C2.verse	@ltx/gr_gr_cog/prayers:pr.verse_SaintM.text
ltx/gr_gr_cog/me.m11.d28:meMA.ExapTheotokion.incipit	Ἄχραντε Δέσποινα ἁγνή…
ltx/gr_gr_cog/me.m11.d28:meMA.ExapTheotokion.melody	@ltx/gr_gr_cog/he.a.m3:heAU.EpeskepsatoImas.name
ltx/gr_gr_cog/me.m11.d28:meMA.ExapTheotokion.mode	@ltx/gr_gr_cog/miscellanea:misc.Mode3
ltx/gr_gr_cog/me.m11.d28:meMA.ExapTheotokion.text	Ἄχραντε Δέσποινα ἁγνή, καὶ μόνη ἀπειρόγαμε, ἡ Βασιλὶς καὶ Κυρία, σὺ δυσώπει τὸν ἐκ σοῦ τεχθέντα Λυτρωτὴν ἡμῶν, σῶσαι κόσμον ἐκ πάντων, κακῶν τε καὶ θλίψεων.
ltx/gr_gr_cog/me.m11.d28:meMA.Exaposteilarion1.greekmelody	@ltx/gr_gr_cog/he.a.m3:heAU.EpeskepsatoImas.greekname
ltx/gr_gr_cog/me.m11.d28:meMA.Exaposteilarion1.incipit	Ἐκομίσω πρὸς Χριστοῦ…
ltx/gr_gr_cog/me.m11.d28:meMA.Exaposteilarion1.melody	@ltx/gr_gr_cog/he.a.m3:heAU.EpeskepsatoImas.name
ltx/gr_gr_cog/me.m11.d28:meMA.Exaposteilarion1.mode	@ltx/gr_gr_cog/miscellanea:misc.Mode3
ltx/gr_gr_cog/me.m11.d28:meMA.Exaposteilarion1.text	Ἐκομίσω πρὸς Χριστοῦ, διπλοῦν τὸ στέφος Στέφανε, ἀσκήσας ὑπερβαλλόντως, καὶ μαρτυρήσας ὡς αὐτοῦ, εἰκόνα σεβαζόμενος, πάντων τε τῶν Ἁγίων, μεθʼ ὧν ἡμῶν μνήσθητι.
ltx/gr_gr_cog/me.m11.d28:meMA.Exaposteilarion2.greekmelody	@ltx/gr_gr_cog/he.a.m3:heAU.EpeskepsatoImas.greekname
ltx/gr_gr_cog/me.m11.d28:meMA.Exaposteilarion2.incipit	Τοὺς τὴν εἰκόνα τοῦ Χριστοῦ…
ltx/gr_gr_cog/me.m11.d28:meMA.Exaposteilarion2.melody	@ltx/gr_gr_cog/he.a.m3:heAU.EpeskepsatoImas.name
ltx/gr_gr_cog/me.m11.d28:meMA.Exaposteilarion2.mode	@ltx/gr_gr_cog/miscellanea:misc.Mode3
ltx/gr_gr_cog/me.m11.d28:meMA.Exaposteilarion2.text	Τοὺς τὴν εἰκόνα τοῦ Χριστοῦ, μὴ προσκυνοῦντας Στέφανε, κατῄσχυνας ὡς ἀθέους, καὶ μαρτυρίου καλλοναῖς, καὶ στίγμασι κεκόσμησαι· διὰ τοῦτο πιστῶς σε ἀεὶ μακαρίζομεν.
ltx/gr_gr_cog/me.m11.d28:meMA.Kontakion1.greekmelody	@ltx/gr_gr_cog/he.a.m4:heAU.EpefanisSimeron.greekname
ltx/gr_gr_cog/me.m11.d28:meMA.Kontakion1.incipit	Ἑορτάζει σήμερον, ἡ Ἐκκλησία, ἑορτὴν…
ltx/gr_gr_cog/me.m11.d28:meMA.Kontakion1.melody	@ltx/gr_gr_cog/he.a.m4:heAU.EpefanisSimeron.name
ltx/gr_gr_cog/me.m11.d28:meMA.Kontakion1.mode	@ltx/gr_gr_cog/miscellanea:misc.Mode4
ltx/gr_gr_cog/me.m11.d28:meMA.Kontakion1.text	Ἑορτάζει σήμερον, ἡ Ἐκκλησία, ἑορτὴν εὐφρόσυνον, ἐν τῇ σῇ μνήμῃ καὶ πιστῶς, ἀνευφημοῦσα κραυγάζει σοι· Στέφανε θεῖε, ὁσίων τὸ καυχημα.
ltx/gr_gr_cog/me.m11.d28:meMA.Ode1C11.greekmelody	@ltx/gr_gr_cog/he.h.m6:heHE.OsEnIpeiroPezefsas.greekname
ltx/gr_gr_cog/me.m11.d28:meMA.Ode1C11.incipit	Χαρμονικῶς διοδεύσας…
ltx/gr_gr_cog/me.m11.d28:meMA.Ode1C11.melody	@ltx/gr_gr_cog/he.h.m6:heHE.OsEnIpeiroPezefsas.name
ltx/gr_gr_cog/me.m11.d28:meMA.Ode1C11.mode	@ltx/gr_gr_cog/miscellanea:misc.Mode6
ltx/gr_gr_cog/me.m11.d28:meMA.Ode1C11.ode	@ltx/gr_gr_cog/miscellanea:misc.Ode1
ltx/gr_gr_cog/me.m11.d28:meMA.Ode1C11.text	Χαρμονικῶς διοδεύσας σὺ τὴν στενήν, τρίβον τῆς ἀσκήσεως, μαρτυρίου πλατυσμῷ, δυσμενῶν ἐστένωσας ὁρμήν, καὶ εὐρύχωρον ζωὴν Μάκαρ κεκλήρωσαι.
ltx/gr_gr_cog/me.m11.d28:meMA.Ode1C12.incipit	Ῥίζα σε ἄκαρπος…
ltx/gr_gr_cog/me.m11.d28:meMA.Ode1C12.melody	@ltx/gr_gr_cog/he.h.m6:heHE.OsEnIpeiroPezefsas.name
ltx/gr_gr_cog/me.m11.d28:meMA.Ode1C12.mode	@ltx/gr_gr_cog/miscellanea:misc.Mode6
ltx/gr_gr_cog/me.m11.d28:meMA.Ode1C12.ode	@ltx/gr_gr_cog/miscellanea:misc.Ode1
ltx/gr_gr_cog/me.m11.d28:meMA.Ode1C12.text	Ῥίζα σε ἄκαρπος πρώην καρπογονεῖ, Ἄννης ἡ ὁμώνυμος, ὡς τὸν πάλαι Σαμουήλ, καὶ δοτόν σε δίδωσι Θεῷ, τὴν τοῦ βίου σου Σοφὲ χάριν σημαίνουσα.
ltx/gr_gr_cog/me.m11.d28:meMA.Ode1C13.incipit	Ἱερωτάτως τῷ θείῳ…
ltx/gr_gr_cog/me.m11.d28:meMA.Ode1C13.melody	@ltx/gr_gr_cog/he.h.m6:heHE.OsEnIpeiroPezefsas.name
ltx/gr_gr_cog/me.m11.d28:meMA.Ode1C13.mode	@ltx/gr_gr_cog/miscellanea:misc.Mode6
ltx/gr_gr_cog/me.m11.d28:meMA.Ode1C13.ode	@ltx/gr_gr_cog/miscellanea:misc.Ode1
ltx/gr_gr_cog/me.m11.d28:meMA.Ode1C13.text	Ἱερωτάτως τῷ θείῳ τῶν Μοναστῶν, προσχωρήσας τάγματι, ὡς φαιδρότατος ἀστήρ, ἀρεταῖς ἐξέλαμψας πιστούς, καταυγάζων μυστικῶς, Ὅσιε Στέφανε.
ltx/gr_gr_cog/me.m11.d28:meMA.Ode1C14.incipit	Στενοχωρήσας τὸ σῶμα…
ltx/gr_gr_cog/me.m11.d28:meMA.Ode1C14.melody	@ltx/gr_gr_cog/he.h.m6:heHE.OsEnIpeiroPezefsas.name
ltx/gr_gr_cog/me.m11.d28:meMA.Ode1C14.mode	@ltx/gr_gr_cog/miscellanea:misc.Mode6
ltx/gr_gr_cog/me.m11.d28:meMA.Ode1C14.ode	@ltx/gr_gr_cog/miscellanea:misc.Ode1
ltx/gr_gr_cog/me.m11.d28:meMA.Ode1C14.text	Στενοχωρήσας τὸ σῶμα τῷ συγκλεισμῷ, τῆς στενῆς οἰκήσεως, ἀνεπτέρωσας τὸν νοῦν, πρὸς τὰ ἐπουράνια Σοφέ, ἀναβάσει καλῶς προσπλατυνόμενος.
ltx/gr_gr_cog/me.m11.d28:meMA.Ode1C1T.incipit	Τὴν ἀδιόδευτον πύλην…
ltx/gr_gr_cog/me.m11.d28:meMA.Ode1C1T.melody	@ltx/gr_gr_cog/he.h.m6:heHE.OsEnIpeiroPezefsas.name
ltx/gr_gr_cog/me.m11.d28:meMA.Ode1C1T.mode	@ltx/gr_gr_cog/miscellanea:misc.Mode6
ltx/gr_gr_cog/me.m11.d28:meMA.Ode1C1T.ode	@ltx/gr_gr_cog/miscellanea:misc.Ode1
ltx/gr_gr_cog/me.m11.d28:meMA.Ode1C1T.text	Τὴν ἀδιόδευτον πύλην τὸ καθαρόν, τῆς ἁγνείας τέμενος, τὴν καλὴν ἐν γυναιξί, τὴν ἁγίαν Δέσποιναν φωναῖς, ἱεραῖς ὁ Ἱερὸς λαὸς δοξάσωμεν.
ltx/gr_gr_cog/me.m11.d28:meMA.Ode1C21.greekmelody	@ltx/gr_gr_cog/he.h.m6:heHE.OsEnIpeiroPezefsas.greekname
ltx/gr_gr_cog/me.m11.d28:meMA.Ode1C21.incipit	Ἐκ τῶν σκανδάλων τοῦ βίου…
ltx/gr_gr_cog/me.m11.d28:meMA.Ode1C21.melody	@ltx/gr_gr_cog/he.h.m6:heHE.OsEnIpeiroPezefsas.name
ltx/gr_gr_cog/me.m11.d28:meMA.Ode1C21.mode	@ltx/gr_gr_cog/miscellanea:misc.Mode6
ltx/gr_gr_cog/me.m11.d28:meMA.Ode1C21.ode	@ltx/gr_gr_cog/miscellanea:misc.Ode1
ltx/gr_gr_cog/me.m11.d28:meMA.Ode1C21.text	Ἐκ τῶν σκανδάλων τοῦ βίου καὶ τῶν παθῶν, τῶν παρενοχλούντων με, εἰρηνεύσας μου τὸν νοῦν, Ἀθλητὰ Εἰρήναρχε τὴν σήν, εὐφημῆσαι γαληνῶς μνήμην ἀξίωσον.
ltx/gr_gr_cog/me.m11.d28:meMA.Ode1C22.incipit	Ἱερονίκους στεφάνους ὡς Ἀθλητής, εἰληφὼς…
ltx/gr_gr_cog/me.m11.d28:meMA.Ode1C22.melody	@ltx/gr_gr_cog/he.h.m6:heHE.OsEnIpeiroPezefsas.name
ltx/gr_gr_cog/me.m11.d28:meMA.Ode1C22.mode	@ltx/gr_gr_cog/miscellanea:misc.Mode6
ltx/gr_gr_cog/me.m11.d28:meMA.Ode1C22.ode	@ltx/gr_gr_cog/miscellanea:misc.Ode1
ltx/gr_gr_cog/me.m11.d28:meMA.Ode1C22.text	Ἱερονίκους στεφάνους ὡς Ἀθλητής, εἰληφὼς Εἰρήναρχε, μετετέθης ἐκ τῆς γῆς, πρὸς εἰρήνην ἄμαχον καὶ φῶς, καὶ ζωὴν ἀληθινὴν μακαριώτατε.
ltx/gr_gr_cog/me.m11.d28:meMA.Ode1C23.incipit	Ῥείθροις αἱμάτων τὴν φλόγα τῶν…
ltx/gr_gr_cog/me.m11.d28:meMA.Ode1C23.melody	@ltx/gr_gr_cog/he.h.m6:heHE.OsEnIpeiroPezefsas.name
ltx/gr_gr_cog/me.m11.d28:meMA.Ode1C23.mode	@ltx/gr_gr_cog/miscellanea:misc.Mode6
ltx/gr_gr_cog/me.m11.d28:meMA.Ode1C23.ode	@ltx/gr_gr_cog/miscellanea:misc.Ode1
ltx/gr_gr_cog/me.m11.d28:meMA.Ode1C23.text	Ῥείθροις αἱμάτων τὴν φλόγα τῶν διωκτῶν, κατασβέσας ἤρδευσας, διανοίας τῶν πιστῶν, ἀναθάλλειν ἔρωτα ζωῆς, αἰωνίου εὐσεβῶς Μάρτυς Εἰρήναρχε.
ltx/gr_gr_cog/me.m11.d28:meMA.Ode1C2T.incipit	Ἡ τὸν ἀχώρητον Λόγον τῇ…
ltx/gr_gr_cog/me.m11.d28:meMA.Ode1C2T.melody	@ltx/gr_gr_cog/he.h.m6:heHE.OsEnIpeiroPezefsas.name
ltx/gr_gr_cog/me.m11.d28:meMA.Ode1C2T.mode	@ltx/gr_gr_cog/miscellanea:misc.Mode6
ltx/gr_gr_cog/me.m11.d28:meMA.Ode1C2T.ode	@ltx/gr_gr_cog/miscellanea:misc.Ode1
ltx/gr_gr_cog/me.m11.d28:meMA.Ode1C2T.text	Ἡ τὸν ἀχώρητον Λόγον τῇ σῇ γαστρί, χωρηθέντα τέξασα, θεοχώρητε σκηνή, τῆς στενοχωρούσης με δεινῶς, τρικυμίας τῶν κακῶν Ἁγνὴ ἀπάλλαξον.
ltx/gr_gr_cog/me.m11.d28:meMA.Ode3C11.greekmelody	@ltx/gr_gr_cog/he.h.m6:heHE.OukEstinAgios.greekname
ltx/gr_gr_cog/me.m11.d28:meMA.Ode3C11.incipit	Ὁ νοῦς σου νεύσει πρὸς…
ltx/gr_gr_cog/me.m11.d28:meMA.Ode3C11.melody	@ltx/gr_gr_cog/he.h.m6:heHE.OukEstinAgios.name
ltx/gr_gr_cog/me.m11.d28:meMA.Ode3C11.mode	@ltx/gr_gr_cog/miscellanea:misc.Mode6
ltx/gr_gr_cog/me.m11.d28:meMA.Ode3C11.ode	@ltx/gr_gr_cog/miscellanea:misc.Ode3
ltx/gr_gr_cog/me.m11.d28:meMA.Ode3C11.text	Ὁ νοῦς σου νεύσει πρὸς Θεόν, καλλυνόμενος Πάτερ, ὡραιότατος ὤφθη, καὶ χαρίσματος παντός, ἀνάπλεως ἀληθῶς, καὶ τῆς θείας, μέτοχος λαμπρότητος.
ltx/gr_gr_cog/me.m11.d28:meMA.Ode3C12.incipit	Σεπτὴν εἰκόνα τοῦ Χριστοῦ, καὶ…
ltx/gr_gr_cog/me.m11.d28:meMA.Ode3C12.melody	@ltx/gr_gr_cog/he.h.m6:heHE.OukEstinAgios.name
ltx/gr_gr_cog/me.m11.d28:meMA.Ode3C12.mode	@ltx/gr_gr_cog/miscellanea:misc.Mode6
ltx/gr_gr_cog/me.m11.d28:meMA.Ode3C12.ode	@ltx/gr_gr_cog/miscellanea:misc.Ode3
ltx/gr_gr_cog/me.m11.d28:meMA.Ode3C12.text	Σεπτὴν εἰκόνα τοῦ Χριστοῦ, καὶ τῆς τοῦτον Τεκούσης, ἀσπαζόμενος Μάκαρ, βασιλέως δυσσεβοῦς, τὸ δόγμα τὸ δυσσεβές, ἑβδελύξω, σθένει θείου Πνεύματος.
ltx/gr_gr_cog/me.m11.d28:meMA.Ode3C13.incipit	Σιδήρῳ σε τὸν σιδηρᾶν, κεκτημένον…
ltx/gr_gr_cog/me.m11.d28:meMA.Ode3C13.melody	@ltx/gr_gr_cog/he.h.m6:heHE.OukEstinAgios.name
ltx/gr_gr_cog/me.m11.d28:meMA.Ode3C13.mode	@ltx/gr_gr_cog/miscellanea:misc.Mode6
ltx/gr_gr_cog/me.m11.d28:meMA.Ode3C13.ode	@ltx/gr_gr_cog/miscellanea:misc.Ode3
ltx/gr_gr_cog/me.m11.d28:meMA.Ode3C13.text	Σιδήρῳ σε τὸν σιδηρᾶν, κεκτημένον καρδίαν, ὁ παράφρων δεσμεύσας, παραπέμπει φυλακαῖς, ὡς φύλακα τῶν Πιστῶν, διδαγμάτων, Στέφανε πανόλβιε.
ltx/gr_gr_cog/me.m11.d28:meMA.Ode3C14.incipit	Τοὺς σοὺς ὡραίους προφανῶς, ἔσχες…
ltx/gr_gr_cog/me.m11.d28:meMA.Ode3C14.melody	@ltx/gr_gr_cog/he.h.m6:heHE.OukEstinAgios.name
ltx/gr_gr_cog/me.m11.d28:meMA.Ode3C14.mode	@ltx/gr_gr_cog/miscellanea:misc.Mode6
ltx/gr_gr_cog/me.m11.d28:meMA.Ode3C14.ode	@ltx/gr_gr_cog/miscellanea:misc.Ode3
ltx/gr_gr_cog/me.m11.d28:meMA.Ode3C14.text	Τοὺς σοὺς ὡραίους προφανῶς, ἔσχες Ὅσιε πόδας, μαρτυρίου πρὸς τρίβους, βηματίζοντας λαμπρῶς, καὶ κεφαλὰς δυσμενῶν, γενναιόφρον, Στέφανε συνθλάττοντας.
ltx/gr_gr_cog/me.m11.d28:meMA.Ode3C1T.incipit	Ἐκ σοῦ τῆς μόνης καθαρᾶς…
ltx/gr_gr_cog/me.m11.d28:meMA.Ode3C1T.melody	@ltx/gr_gr_cog/he.h.m6:heHE.OukEstinAgios.name
ltx/gr_gr_cog/me.m11.d28:meMA.Ode3C1T.mode	@ltx/gr_gr_cog/miscellanea:misc.Mode6
ltx/gr_gr_cog/me.m11.d28:meMA.Ode3C1T.ode	@ltx/gr_gr_cog/miscellanea:misc.Ode3
ltx/gr_gr_cog/me.m11.d28:meMA.Ode3C1T.text	Ἐκ σοῦ τῆς μόνης καθαρᾶς, ὁ ὑπέρθεος Λόγος, ἐσαρκώθη ὡς οἶδε, καὶ διέσωσεν ἡμᾶς, τοὺς προσκυνοῦντας αὐτοῦ, τὴν διʼ οἶκτον, θείαν συγκατάβασιν.
ltx/gr_gr_cog/me.m11.d28:meMA.Ode3C21.greekmelody	@ltx/gr_gr_cog/he.h.m6:heHE.OukEstinAgios.greekname
ltx/gr_gr_cog/me.m11.d28:meMA.Ode3C21.incipit	Νευροῦσαι σθένει θεϊκῷ, καὶ χωρεῖς…
ltx/gr_gr_cog/me.m11.d28:meMA.Ode3C21.melody	@ltx/gr_gr_cog/he.h.m6:heHE.OukEstinAgios.name
ltx/gr_gr_cog/me.m11.d28:meMA.Ode3C21.mode	@ltx/gr_gr_cog/miscellanea:misc.Mode6
ltx/gr_gr_cog/me.m11.d28:meMA.Ode3C21.ode	@ltx/gr_gr_cog/miscellanea:misc.Ode3
ltx/gr_gr_cog/me.m11.d28:meMA.Ode3C21.text	Νευροῦσαι σθένει θεϊκῷ, καὶ χωρεῖς πρὸς ἀγῶνας, θαρσαλέως παμμάκαρ, ὑπομένων αἰκισμούς, καὶ στρέβλας τῶν δυσμενῶν, ἀθλοφόρε, Μάρτυς γενναιότατε.
ltx/gr_gr_cog/me.m11.d28:meMA.Ode3C22.incipit	Ἰσχύν σοι δίδωσι Χριστός, Ἀθλοθέτης…
ltx/gr_gr_cog/me.m11.d28:meMA.Ode3C22.melody	@ltx/gr_gr_cog/he.h.m6:heHE.OukEstinAgios.name
ltx/gr_gr_cog/me.m11.d28:meMA.Ode3C22.mode	@ltx/gr_gr_cog/miscellanea:misc.Mode6
ltx/gr_gr_cog/me.m11.d28:meMA.Ode3C22.ode	@ltx/gr_gr_cog/miscellanea:misc.Ode3
ltx/gr_gr_cog/me.m11.d28:meMA.Ode3C22.text	Ἰσχύν σοι δίδωσι Χριστός, Ἀθλοθέτης ὁ μέγας, διολέσαι τὴν πλάνην, καὶ αἰσχῦναι τὸν ἐχθρόν, καυχώμενον ἀναιδῶς, καὶ εἰκαίως, Μάρτυς φρυαττόμενον.
ltx/gr_gr_cog/me.m11.d28:meMA.Ode3C23.incipit	Καθεῖλε πόνοις ἀνδρικοῖς, τὸν ἀρχέκακον…
ltx/gr_gr_cog/me.m11.d28:meMA.Ode3C23.melody	@ltx/gr_gr_cog/he.h.m6:heHE.OukEstinAgios.name
ltx/gr_gr_cog/me.m11.d28:meMA.Ode3C23.mode	@ltx/gr_gr_cog/miscellanea:misc.Mode6
ltx/gr_gr_cog/me.m11.d28:meMA.Ode3C23.ode	@ltx/gr_gr_cog/miscellanea:misc.Ode3
ltx/gr_gr_cog/me.m11.d28:meMA.Ode3C23.text	Καθεῖλε πόνοις ἀνδρικοῖς, τὸν ἀρχέκακον ὄφιν, ὁ χορὸς τῶν Ἁγίων, ἐναθλήσας κραταιῶς, καὶ μάστιγας καὶ δεσμά, ὑπομείνας, σθένει θείου Πνεύματος.
ltx/gr_gr_cog/me.m11.d28:meMA.Ode3C2T.incipit	Ἣν εἶδε πάλαι Ἰακώβ, ἀπὸ…
ltx/gr_gr_cog/me.m11.d28:meMA.Ode3C2T.melody	@ltx/gr_gr_cog/he.h.m6:heHE.OukEstinAgios.name
ltx/gr_gr_cog/me.m11.d28:meMA.Ode3C2T.mode	@ltx/gr_gr_cog/miscellanea:misc.Mode6
ltx/gr_gr_cog/me.m11.d28:meMA.Ode3C2T.ode	@ltx/gr_gr_cog/miscellanea:misc.Ode3
ltx/gr_gr_cog/me.m11.d28:meMA.Ode3C2T.text	Ἣν εἶδε πάλαι Ἰακώβ, ἀπὸ γῆς τεταμένην, πρὸς οὐράνιον ὕψος, θείαν κλίμακα σαφῶς, Μαρίαν τὸ καθαρόν, τοῦ Δεσπότου, μέλψωμεν παλάτιον.
ltx/gr_gr_cog/me.m11.d28:meMA.Ode3H.greekmelody	@ltx/gr_gr_cog/he.h.m6:heHE.OukEstinAgios.greekname
ltx/gr_gr_cog/me.m11.d28:meMA.Ode3H.incipit	@ltx/gr_gr_cog/he.h.m6:heHE.OukEstinAgios.incipit
ltx/gr_gr_cog/me.m11.d28:meMA.Ode3H.melody	@ltx/gr_gr_cog/he.h.m6:heHE.OukEstinAgios.melody
ltx/gr_gr_cog/me.m11.d28:meMA.Ode3H.mode	@ltx/gr_gr_cog/miscellanea:misc.Mode6
ltx/gr_gr_cog/me.m11.d28:meMA.Ode3H.ode	@ltx/gr_gr_cog/miscellanea:misc.Ode3
ltx/gr_gr_cog/me.m11.d28:meMA.Ode3H.text	@ltx/gr_gr_cog/he.h.m6:heHE.OukEstinAgios.text
ltx/gr_gr_cog/me.m11.d28:meMA.Ode3Kathisma1.greekmelody	@ltx/gr_gr_cog/he.a.m4:heAU.OYpsotheisEnToStavro.greekname
ltx/gr_gr_cog/me.m11.d28:meMA.Ode3Kathisma1.incipit	Τῶν Μοναστῶν ὑπογραμμὸς…
ltx/gr_gr_cog/me.m11.d28:meMA.Ode3Kathisma1.melody	@ltx/gr_gr_cog/he.a.m4:heAU.OYpsotheisEnToStavro.name
ltx/gr_gr_cog/me.m11.d28:meMA.Ode3Kathisma1.mode	@ltx/gr_gr_cog/miscellanea:misc.Mode4
ltx/gr_gr_cog/me.m11.d28:meMA.Ode3Kathisma1.text	Τῶν Μοναστῶν ὑπογραμμὸς ἀνεδείχθης, τῶν Ἀθλητῶν καλλωπισμὸς ἀνεφάνης, διʼ ἀμφοτέρων Στέφανε κοσμούμενος· ὅθεν ἀξιάγαστε, καὶ διπλοῦς τοὺς στεφάνους, ἔλαβες ἀσκήσεως, καὶ ἀθλήσεως Πάτερ. Ἀλλʼ ἐκτενῶς Χριστὸν ὑπὲρ ἡμῶν, τῶν σὲ ὑμνούντων, ἱκέτευε Στέφανε.
ltx/gr_gr_cog/me.m11.d28:meMA.Ode3Kathisma2.greekmelody	@ltx/gr_gr_cog/he.a.m4:heAU.OYpsotheisEnToStavro.greekname
ltx/gr_gr_cog/me.m11.d28:meMA.Ode3Kathisma2.incipit	Γῆ καὶ ὑγρὰ τοὺς καρτερούς…
ltx/gr_gr_cog/me.m11.d28:meMA.Ode3Kathisma2.melody	@ltx/gr_gr_cog/he.a.m4:heAU.OYpsotheisEnToStavro.name
ltx/gr_gr_cog/me.m11.d28:meMA.Ode3Kathisma2.mode	@ltx/gr_gr_cog/miscellanea:misc.Mode4
ltx/gr_gr_cog/me.m11.d28:meMA.Ode3Kathisma2.text	Γῆ καὶ ὑγρὰ τοὺς καρτερούς σου ἀγῶνας, κατεμερίσθη Ἀθλητὰ γενναιόφρον, διʼ ὧν τῆς πλάνης ἔλυσας τὸ φρύαγμα, καὶ τὴν ὑπερκόσμιον, μετὰ πάντων Μαρτύρων, δόξαν αἰωνίζουσαν, ἐκληρώσω παμμάκαρ. Ἀλλʼ ὑπὲρ πάντων πρέσβευε Χριστῷ, τῶν σὲ τιμώντων, τρισμάκαρ Εἰρήναρχε.
ltx/gr_gr_cog/me.m11.d28:meMA.Ode3KathismaSt.incipit	Ἐν τῷ Σταυρῷ παρισταμένη…
ltx/gr_gr_cog/me.m11.d28:meMA.Ode3KathismaSt.melody	@ltx/gr_gr_cog/he.a.m4:heAU.OYpsotheisEnToStavro.name
ltx/gr_gr_cog/me.m11.d28:meMA.Ode3KathismaSt.mode	@ltx/gr_gr_cog/miscellanea:misc.Mode4
ltx/gr_gr_cog/me.m11.d28:meMA.Ode3KathismaSt.text	Ἐν τῷ Σταυρῷ παρισταμένη Παρθένε, τῷ τοῦ Υἱοῦ σου καὶ Θεοῦ ἀνεβόας, ὀδυνηρῶς στενάζουσα, δακρύουσα θερμῶς· Οἴμοι, ὦ γλυκύτατε! πῶς ἀνδρῶν παρανόμων, φέρεις τὰ λακτίσματα, καὶ τὰς τρώσεις τῶν ἥλων, καὶ τῶν κακούργων θάνατον σαφῶς, σῶσαι τὸ γένος, βροτῶν προμηθούμενος;
ltx/gr_gr_cog/me.m11.d28:meMA.Ode3KathismaT.incipit	Καταφυγὴ τῶν ἐν δεινοῖς…
ltx/gr_gr_cog/me.m11.d28:meMA.Ode3KathismaT.melody	@ltx/gr_gr_cog/he.a.m4:heAU.OYpsotheisEnToStavro.name
ltx/gr_gr_cog/me.m11.d28:meMA.Ode3KathismaT.mode	@ltx/gr_gr_cog/miscellanea:misc.Mode4
ltx/gr_gr_cog/me.m11.d28:meMA.Ode3KathismaT.text	Καταφυγὴ τῶν ἐν δεινοῖς ὑπαρχόντων, καταλλαγὴ πρὸς τὸν Θεὸν τῶν πταιόντων, Ὑπεραγία Δέσποινα περίσῳζε ἡμᾶς, πάσης περιστάσεως, καὶ κακίας ἀνθρώπων, καὶ φρικτῆς κολάσεως, καὶ παθῶν ἀτιμίας, τοὺς ἀδιστάκτῳ πίστει σε ἀεί, προσκαλουμένους, Παρθένε πανύμνητε.
ltx/gr_gr_cog/me.m11.d28:meMA.Ode4C11.greekmelody	@ltx/gr_gr_cog/he.h.m6:heHE.ChristosMouDynamis.greekname
ltx/gr_gr_cog/me.m11.d28:meMA.Ode4C11.incipit	Φωτὶ τοῦ Πνεύματος…
ltx/gr_gr_cog/me.m11.d28:meMA.Ode4C11.melody	@ltx/gr_gr_cog/he.h.m6:heHE.ChristosMouDynamis.name
ltx/gr_gr_cog/me.m11.d28:meMA.Ode4C11.mode	@ltx/gr_gr_cog/miscellanea:misc.Mode6
ltx/gr_gr_cog/me.m11.d28:meMA.Ode4C11.ode	@ltx/gr_gr_cog/miscellanea:misc.Ode4
ltx/gr_gr_cog/me.m11.d28:meMA.Ode4C11.text	Φωτὶ τοῦ Πνεύματος, καταλαμπόμενος, διʼ ἐντεύξεως θείας, τυφλοῖς τὸ φῶς, Πάτερ ἐχορήγησας, τὸν σὸν Δεσπότην καὶ Θεόν, μιμησάμενος Θεόπνευστε.
ltx/gr_gr_cog/me.m11.d28:meMA.Ode4C12.incipit	Ἐφαίνου πόῤῥωθεν…
ltx/gr_gr_cog/me.m11.d28:meMA.Ode4C12.melody	@ltx/gr_gr_cog/he.h.m6:heHE.ChristosMouDynamis.name
ltx/gr_gr_cog/me.m11.d28:meMA.Ode4C12.mode	@ltx/gr_gr_cog/miscellanea:misc.Mode6
ltx/gr_gr_cog/me.m11.d28:meMA.Ode4C12.ode	@ltx/gr_gr_cog/miscellanea:misc.Ode4
ltx/gr_gr_cog/me.m11.d28:meMA.Ode4C12.text	Ἐφαίνου πόῤῥωθεν, τοῖς θαλαττεύουσι, κυβερνῶν τούτους μάκαρ πρὸς γαληνόν, ὅρμον θείᾳ χάριτι, προσκαλουμένους σου πιστῶς, Πάτερ Στέφανε τὸ ὄνομα.
ltx/gr_gr_cog/me.m11.d28:meMA.Ode4C13.incipit	Ἱερουργούμενος…
ltx/gr_gr_cog/me.m11.d28:meMA.Ode4C13.melody	@ltx/gr_gr_cog/he.h.m6:heHE.ChristosMouDynamis.name
ltx/gr_gr_cog/me.m11.d28:meMA.Ode4C13.mode	@ltx/gr_gr_cog/miscellanea:misc.Mode6
ltx/gr_gr_cog/me.m11.d28:meMA.Ode4C13.ode	@ltx/gr_gr_cog/miscellanea:misc.Ode4
ltx/gr_gr_cog/me.m11.d28:meMA.Ode4C13.text	Ἱερουργούμενος, καθάπερ σφάγιον, ἱερὸν προσηνέχθης τῷ διὰ σέ, τεθυμένῳ Στέφανε, καὶ πρωτοτόκων ἐν σκηναῖς, ἀνεπαύσω εὐφραινόμενος.
ltx/gr_gr_cog/me.m11.d28:meMA.Ode4C14.incipit	Σεπτῷ σου ῥήματι…
ltx/gr_gr_cog/me.m11.d28:meMA.Ode4C14.melody	@ltx/gr_gr_cog/he.h.m6:heHE.ChristosMouDynamis.name
ltx/gr_gr_cog/me.m11.d28:meMA.Ode4C14.mode	@ltx/gr_gr_cog/miscellanea:misc.Mode6
ltx/gr_gr_cog/me.m11.d28:meMA.Ode4C14.ode	@ltx/gr_gr_cog/miscellanea:misc.Ode4
ltx/gr_gr_cog/me.m11.d28:meMA.Ode4C14.text	Σεπτῷ σου ῥήματι, ὁ πρὶν ἡμίξηρος, ὑγιὴς ὅλος ὤφθη καταπλαγείς, Μάρτυς τὴν δοθεῖσάν σοι, χάριν ἐξ ὕψους δαψιλῶς, εἰς ἀνθρώπων περιποίησιν.
ltx/gr_gr_cog/me.m11.d28:meMA.Ode4C1T.incipit	Ἐν σοὶ Πανάμωμε…
ltx/gr_gr_cog/me.m11.d28:meMA.Ode4C1T.melody	@ltx/gr_gr_cog/he.h.m6:heHE.ChristosMouDynamis.name
ltx/gr_gr_cog/me.m11.d28:meMA.Ode4C1T.mode	@ltx/gr_gr_cog/miscellanea:misc.Mode6
ltx/gr_gr_cog/me.m11.d28:meMA.Ode4C1T.ode	@ltx/gr_gr_cog/miscellanea:misc.Ode4
ltx/gr_gr_cog/me.m11.d28:meMA.Ode4C1T.text	Ἐν σοὶ Πανάμωμε, τῆς σωτηρίας μου, τὰς ἐλπίδας ἐθέμην, ἐπὶ τὴν σήν, σκέπην καταπέφευγα, γενοῦ μοι Κόρη βοηθός, τῶν δεινῶν ἐξαιρουμένη με.
ltx/gr_gr_cog/me.m11.d28:meMA.Ode4C21.greekmelody	@ltx/gr_gr_cog/he.h.m6:heHE.ChristosMouDynamis.greekname
ltx/gr_gr_cog/me.m11.d28:meMA.Ode4C21.incipit	Νομίμως ἔδραμες, νομίμως ἤθλησας, καὶ…
ltx/gr_gr_cog/me.m11.d28:meMA.Ode4C21.melody	@ltx/gr_gr_cog/he.h.m6:heHE.ChristosMouDynamis.name
ltx/gr_gr_cog/me.m11.d28:meMA.Ode4C21.mode	@ltx/gr_gr_cog/miscellanea:misc.Mode6
ltx/gr_gr_cog/me.m11.d28:meMA.Ode4C21.ode	@ltx/gr_gr_cog/miscellanea:misc.Ode4
ltx/gr_gr_cog/me.m11.d28:meMA.Ode4C21.text	Νομίμως ἔδραμες, νομίμως ἤθλησας, καὶ νομίμως ἐστέφθης τῷ τοῦ Θεοῦ, νόμῳ κρατυνόμενος, καὶ ἀπαράτρωτον σαυτόν, συντηρῶν Μακαριώτατε.
ltx/gr_gr_cog/me.m11.d28:meMA.Ode4C22.incipit	Μὴ στέργων ἔνδοξε, τῇ πλάνῃ…
ltx/gr_gr_cog/me.m11.d28:meMA.Ode4C22.melody	@ltx/gr_gr_cog/he.h.m6:heHE.ChristosMouDynamis.name
ltx/gr_gr_cog/me.m11.d28:meMA.Ode4C22.mode	@ltx/gr_gr_cog/miscellanea:misc.Mode6
ltx/gr_gr_cog/me.m11.d28:meMA.Ode4C22.ode	@ltx/gr_gr_cog/miscellanea:misc.Ode4
ltx/gr_gr_cog/me.m11.d28:meMA.Ode4C22.text	Μὴ στέργων ἔνδοξε, τῇ πλάνῃ νήχεσθαι, τῇ θεογνωσίᾳ ὡς νουνεχής, χαίρων προσκεχώρηκας, φῶς νοερὸν ἀναλαβών, καὶ φωστὴρ ἀποδεικνύμενος.
ltx/gr_gr_cog/me.m11.d28:meMA.Ode4C23.incipit	Οὐδόλως ἔκρυψε, βυθὸς δεξάμενος, σὲ…
ltx/gr_gr_cog/me.m11.d28:meMA.Ode4C23.melody	@ltx/gr_gr_cog/he.h.m6:heHE.ChristosMouDynamis.name
ltx/gr_gr_cog/me.m11.d28:meMA.Ode4C23.mode	@ltx/gr_gr_cog/miscellanea:misc.Mode6
ltx/gr_gr_cog/me.m11.d28:meMA.Ode4C23.ode	@ltx/gr_gr_cog/miscellanea:misc.Ode4
ltx/gr_gr_cog/me.m11.d28:meMA.Ode4C23.text	Οὐδόλως ἔκρυψε, βυθὸς δεξάμενος, σὲ πανόλβιε Μάρτυς ἐπεγνωκώς, θείων παθημάτων σε, παναληθέστατον Χριστοῦ, ὄντα Μάρτυρα Εἰρήναρχε.
ltx/gr_gr_cog/me.m11.d28:meMA.Ode4C24.incipit	Ἱερουργούμεναι, καὶ προθυόμεναι, καὶ ξεόμεναι…
ltx/gr_gr_cog/me.m11.d28:meMA.Ode4C24.melody	@ltx/gr_gr_cog/he.h.m6:heHE.ChristosMouDynamis.name
ltx/gr_gr_cog/me.m11.d28:meMA.Ode4C24.mode	@ltx/gr_gr_cog/miscellanea:misc.Mode6
ltx/gr_gr_cog/me.m11.d28:meMA.Ode4C24.ode	@ltx/gr_gr_cog/miscellanea:misc.Ode4
ltx/gr_gr_cog/me.m11.d28:meMA.Ode4C24.text	Ἱερουργούμεναι, καὶ προθυόμεναι, καὶ ξεόμεναι ἅμα καὶ τῷ πυρί, πάντοθεν φλεγόμεναι, οὐκ ἐξηρνήσασθε Χριστόν, Ἀθλοφόροι ἀξιΰμνητοι.
ltx/gr_gr_cog/me.m11.d28:meMA.Ode4C2T.incipit	Παρθένος ἔμεινας, μετὰ τὴν κύησιν…
ltx/gr_gr_cog/me.m11.d28:meMA.Ode4C2T.melody	@ltx/gr_gr_cog/he.h.m6:heHE.ChristosMouDynamis.name
ltx/gr_gr_cog/me.m11.d28:meMA.Ode4C2T.mode	@ltx/gr_gr_cog/miscellanea:misc.Mode6
ltx/gr_gr_cog/me.m11.d28:meMA.Ode4C2T.ode	@ltx/gr_gr_cog/miscellanea:misc.Ode4
ltx/gr_gr_cog/me.m11.d28:meMA.Ode4C2T.text	Παρθένος ἔμεινας, μετὰ τὴν κύησιν, ὥσπερ ἦς πρὸ τοῦ τόκου, ὅτι Θεόν, Λόγον ἀπεκύησας, τὸν λυτρωσάμενον ἡμᾶς, μεσιτείᾳ σου Πανάμωμε.
ltx/gr_gr_cog/me.m11.d28:meMA.Ode5C11.greekmelody	@ltx/gr_gr_cog/he.h.m6:heHE.ToTheioFengeiSou.greekname
ltx/gr_gr_cog/me.m11.d28:meMA.Ode5C11.incipit	Μαρτυρικαῖς ἔστεψε τιμαῖς…
ltx/gr_gr_cog/me.m11.d28:meMA.Ode5C11.melody	@ltx/gr_gr_cog/he.h.m6:heHE.ToTheioFengeiSou.name
ltx/gr_gr_cog/me.m11.d28:meMA.Ode5C11.mode	@ltx/gr_gr_cog/miscellanea:misc.Mode6
ltx/gr_gr_cog/me.m11.d28:meMA.Ode5C11.ode	@ltx/gr_gr_cog/miscellanea:misc.Ode5
ltx/gr_gr_cog/me.m11.d28:meMA.Ode5C11.text	Μαρτυρικαῖς ἔστεψε τιμαῖς, τοὺς ἀσκητικούς σου ἀληθῶς καμάτους Ὅσιε Στέφανε, ὁ ἀγωνοθέτης μόνος Θεὸς ἡμῶν, κατὰ τῶν παλαμναίων ἐνδυναμώσας σε.
ltx/gr_gr_cog/me.m11.d28:meMA.Ode5C12.incipit	Ἀγωνιζόμενος εὐκλεῶς…
ltx/gr_gr_cog/me.m11.d28:meMA.Ode5C12.melody	@ltx/gr_gr_cog/he.h.m6:heHE.ToTheioFengeiSou.name
ltx/gr_gr_cog/me.m11.d28:meMA.Ode5C12.mode	@ltx/gr_gr_cog/miscellanea:misc.Mode6
ltx/gr_gr_cog/me.m11.d28:meMA.Ode5C12.ode	@ltx/gr_gr_cog/miscellanea:misc.Ode5
ltx/gr_gr_cog/me.m11.d28:meMA.Ode5C12.text	Ἀγωνιζόμενος εὐκλεῶς, δῆμον συμμαρτύρων ταῖς εἱρκταῖς, προσομιλῶν Μάρτυς εὕρηκας· σὲ γὰρ ὡς ἀστέρες ἄδυτον ἥλιον, κυκλοῦντες ἐπὶ πλεῖον κατελαμπρύνοντο.
ltx/gr_gr_cog/me.m11.d28:meMA.Ode5C13.incipit	Ῥήμασι θείοις τοὺς ἱερούς…
ltx/gr_gr_cog/me.m11.d28:meMA.Ode5C13.melody	@ltx/gr_gr_cog/he.h.m6:heHE.ToTheioFengeiSou.name
ltx/gr_gr_cog/me.m11.d28:meMA.Ode5C13.mode	@ltx/gr_gr_cog/miscellanea:misc.Mode6
ltx/gr_gr_cog/me.m11.d28:meMA.Ode5C13.ode	@ltx/gr_gr_cog/miscellanea:misc.Ode5
ltx/gr_gr_cog/me.m11.d28:meMA.Ode5C13.text	Ῥήμασι θείοις τοὺς ἱερούς, Ὁμολογητὰς καὶ μιμητάς, θείων παθῶν μακαρίζομεν, τοὺς τριακοσίους καὶ τεσσαράκοντα, καὶ δύο τοὺς ἀθέους καταπαλαίσαντας.
ltx/gr_gr_cog/me.m11.d28:meMA.Ode5C14.incipit	Τριχῶν ἀφαίρεσιν παικτικῶς…
ltx/gr_gr_cog/me.m11.d28:meMA.Ode5C14.melody	@ltx/gr_gr_cog/he.h.m6:heHE.ToTheioFengeiSou.name
ltx/gr_gr_cog/me.m11.d28:meMA.Ode5C14.mode	@ltx/gr_gr_cog/miscellanea:misc.Mode6
ltx/gr_gr_cog/me.m11.d28:meMA.Ode5C14.ode	@ltx/gr_gr_cog/miscellanea:misc.Ode5
ltx/gr_gr_cog/me.m11.d28:meMA.Ode5C14.text	Τριχῶν ἀφαίρεσιν παικτικῶς, ὤτων ἐκκοπήν τε καὶ χειρῶν, μελῶν τε θείων κατάφλεξιν, ὑπὲρ τῆς εἰκόνος Χριστοῦ ὑπήνεγκεν, ὁ δῆμος τῶν Ὁσίων ὁ εὐκλεέστατος.
ltx/gr_gr_cog/me.m11.d28:meMA.Ode5C1T.incipit	Ὑπεραγία ἡ τὸν Θεόν…
ltx/gr_gr_cog/me.m11.d28:meMA.Ode5C1T.melody	@ltx/gr_gr_cog/he.h.m6:heHE.ToTheioFengeiSou.name
ltx/gr_gr_cog/me.m11.d28:meMA.Ode5C1T.mode	@ltx/gr_gr_cog/miscellanea:misc.Mode6
ltx/gr_gr_cog/me.m11.d28:meMA.Ode5C1T.ode	@ltx/gr_gr_cog/miscellanea:misc.Ode5
ltx/gr_gr_cog/me.m11.d28:meMA.Ode5C1T.text	Ὑπεραγία ἡ τὸν Θεόν, μόνη ἐπὶ γῆς ὡς ἀληθῶς, τὸν ὑπεράγιον τέξασα τοὺς σὲ Θεοτόκον ἀεὶ κηρύττοντας, ἁγίασον καὶ σῶσον τῇ μεσιτείᾳ σου.
ltx/gr_gr_cog/me.m11.d28:meMA.Ode5C21.greekmelody	@ltx/gr_gr_cog/he.h.m6:heHE.ToTheioFengeiSou.greekname
ltx/gr_gr_cog/me.m11.d28:meMA.Ode5C21.incipit	Ῥομφαίᾳ τέτρωται ὁ ἐχθρός, τῆς…
ltx/gr_gr_cog/me.m11.d28:meMA.Ode5C21.melody	@ltx/gr_gr_cog/he.h.m6:heHE.ToTheioFengeiSou.name
ltx/gr_gr_cog/me.m11.d28:meMA.Ode5C21.mode	@ltx/gr_gr_cog/miscellanea:misc.Mode6
ltx/gr_gr_cog/me.m11.d28:meMA.Ode5C21.ode	@ltx/gr_gr_cog/miscellanea:misc.Ode5
ltx/gr_gr_cog/me.m11.d28:meMA.Ode5C21.text	Ῥομφαίᾳ τέτρωται ὁ ἐχθρός, τῆς ὑπομονῆς τῆς καρτερᾶς, τοῦ γενναιόφρονος Μάρτυρος, καὶ ταῖς τούτου πτέρναις καθυποτέτακται, καὶ γέλως καθορᾶται καὶ καταισχύνεται.
ltx/gr_gr_cog/me.m11.d28:meMA.Ode5C22.incipit	Ὁ ποῦς σου ἔστη προφητικῶς…
ltx/gr_gr_cog/me.m11.d28:meMA.Ode5C22.melody	@ltx/gr_gr_cog/he.h.m6:heHE.ToTheioFengeiSou.name
ltx/gr_gr_cog/me.m11.d28:meMA.Ode5C22.mode	@ltx/gr_gr_cog/miscellanea:misc.Mode6
ltx/gr_gr_cog/me.m11.d28:meMA.Ode5C22.ode	@ltx/gr_gr_cog/miscellanea:misc.Ode5
ltx/gr_gr_cog/me.m11.d28:meMA.Ode5C22.text	Ὁ ποῦς σου ἔστη προφητικῶς, Μάρτυς ἐν εὐθύτητι σοφέ, ἀπεριτρέπτῳ φρονήματι, καθυποσκελίζων τὸν πολυμήχανον, ταῖς τρίβοις μαρτυρίου καλλωπιζόμενος.
ltx/gr_gr_cog/me.m11.d28:meMA.Ode5C23.incipit	Σὺ τὴν κακίαν τῶν διωκτῶν…
ltx/gr_gr_cog/me.m11.d28:meMA.Ode5C23.melody	@ltx/gr_gr_cog/he.h.m6:heHE.ToTheioFengeiSou.name
ltx/gr_gr_cog/me.m11.d28:meMA.Ode5C23.mode	@ltx/gr_gr_cog/miscellanea:misc.Mode6
ltx/gr_gr_cog/me.m11.d28:meMA.Ode5C23.ode	@ltx/gr_gr_cog/miscellanea:misc.Ode5
ltx/gr_gr_cog/me.m11.d28:meMA.Ode5C23.text	Σὺ τὴν κακίαν τῶν διωκτῶν, ἄκακος ἀκέραιος ὀφθείς, Μάρτυς ἀπώσω Εἰρήναρχε, καὶ τῇ τελειώσει σου τῇ διʼ αἵματος, στεφάνοις ἀφθαρσίας κατεστεφάνωσαι.
ltx/gr_gr_cog/me.m11.d28:meMA.Ode5C2T.incipit	Νοήσας πόῤῥωθεν μυστικῶς, ὁ τῶν…
ltx/gr_gr_cog/me.m11.d28:meMA.Ode5C2T.melody	@ltx/gr_gr_cog/he.h.m6:heHE.ToTheioFengeiSou.name
ltx/gr_gr_cog/me.m11.d28:meMA.Ode5C2T.mode	@ltx/gr_gr_cog/miscellanea:misc.Mode6
ltx/gr_gr_cog/me.m11.d28:meMA.Ode5C2T.ode	@ltx/gr_gr_cog/miscellanea:misc.Ode5
ltx/gr_gr_cog/me.m11.d28:meMA.Ode5C2T.text	Νοήσας πόῤῥωθεν μυστικῶς, ὁ τῶν Προφητῶν θεολαμπής, χορὸς Παρθένε Θεόνυμφε, θείου τοκετοῦ σου βάθος ἀπόῤῥητον, συμβόλοις ἱεροῖς σε προδιεχάραξε.
ltx/gr_gr_cog/me.m11.d28:meMA.Ode6C11.greekmelody	@ltx/gr_gr_cog/he.h.m6:heHE.TouViouTinThalassan.greekname
ltx/gr_gr_cog/me.m11.d28:meMA.Ode6C11.incipit	Ῥημάτων σου δυνάμιν, ὁ κακίας…
ltx/gr_gr_cog/me.m11.d28:meMA.Ode6C11.melody	@ltx/gr_gr_cog/he.h.m6:heHE.TouViouTinThalassan.name
ltx/gr_gr_cog/me.m11.d28:meMA.Ode6C11.mode	@ltx/gr_gr_cog/miscellanea:misc.Mode6
ltx/gr_gr_cog/me.m11.d28:meMA.Ode6C11.ode	@ltx/gr_gr_cog/miscellanea:misc.Ode6
ltx/gr_gr_cog/me.m11.d28:meMA.Ode6C11.text	Ῥημάτων σου δυνάμιν, ὁ κακίας εὑρετής, ὑπενεγκεῖν οὐκ ἴσχυσεν· ὅθεν δεσμοῖς σε Στέφανε καὶ ποιναῖς, θανάτῳ βιαίῳ τε, ὠμοτάτως ὁ πλάνος παραδέδωκεν.
ltx/gr_gr_cog/me.m11.d28:meMA.Ode6C12.incipit	Ὡς ἄρτος ὀπτώμενος, τῷ πυρὶ…
ltx/gr_gr_cog/me.m11.d28:meMA.Ode6C12.melody	@ltx/gr_gr_cog/he.h.m6:heHE.TouViouTinThalassan.name
ltx/gr_gr_cog/me.m11.d28:meMA.Ode6C12.mode	@ltx/gr_gr_cog/miscellanea:misc.Mode6
ltx/gr_gr_cog/me.m11.d28:meMA.Ode6C12.ode	@ltx/gr_gr_cog/miscellanea:misc.Ode6
ltx/gr_gr_cog/me.m11.d28:meMA.Ode6C12.text	Ὡς ἄρτος ὀπτώμενος, τῷ πυρὶ καὶ ἐκ ποδῶν ἀνηλεῶς κρεμάμενος, ὡλοκαυτώθης Παῦλε καὶ τῷ Θεῷ, θυσία προσήνεξαι, συναυλίας Μαρτύρων ἀξιούμενος.
ltx/gr_gr_cog/me.m11.d28:meMA.Ode6C13.incipit	Νομίμως ἐνήθλησαν, συγκλεισθέντες καὶ πνιγμῷ…
ltx/gr_gr_cog/me.m11.d28:meMA.Ode6C13.melody	@ltx/gr_gr_cog/he.h.m6:heHE.TouViouTinThalassan.name
ltx/gr_gr_cog/me.m11.d28:meMA.Ode6C13.mode	@ltx/gr_gr_cog/miscellanea:misc.Mode6
ltx/gr_gr_cog/me.m11.d28:meMA.Ode6C13.ode	@ltx/gr_gr_cog/miscellanea:misc.Ode6
ltx/gr_gr_cog/me.m11.d28:meMA.Ode6C13.text	Νομίμως ἐνήθλησαν, συγκλεισθέντες καὶ πνιγμῷ, τὸν βίον καταλύσαντες, ἐν τῇ Ἐφέσῳ Ὅσιοι Μονασταί, ὀκτὼ καὶ τριάκοντα, οὓς ἐν πίστει καὶ πόθῳ μακαρίσωμεν.
ltx/gr_gr_cog/me.m11.d28:meMA.Ode6C14.incipit	Στεῤῥῶς τῷ δικάζοντι, ἀντετάξω καὶ…
ltx/gr_gr_cog/me.m11.d28:meMA.Ode6C14.melody	@ltx/gr_gr_cog/he.h.m6:heHE.TouViouTinThalassan.name
ltx/gr_gr_cog/me.m11.d28:meMA.Ode6C14.mode	@ltx/gr_gr_cog/miscellanea:misc.Mode6
ltx/gr_gr_cog/me.m11.d28:meMA.Ode6C14.ode	@ltx/gr_gr_cog/miscellanea:misc.Ode6
ltx/gr_gr_cog/me.m11.d28:meMA.Ode6C14.text	Στεῤῥῶς τῷ δικάζοντι, ἀντετάξω καὶ πληγαῖς, καταξανθεὶς τὸ σῶμά σου, θανατωθῆναι εἵλου διὰ Χριστόν, τὸν μόνον ἀθάνατον, ἀξιάγαστε Πέτρε μεγαλώνυμε.
ltx/gr_gr_cog/me.m11.d28:meMA.Ode6C1T.incipit	Τὴν μόνην πανύμνητον, τὴν καλὴν…
ltx/gr_gr_cog/me.m11.d28:meMA.Ode6C1T.melody	@ltx/gr_gr_cog/he.h.m6:heHE.TouViouTinThalassan.name
ltx/gr_gr_cog/me.m11.d28:meMA.Ode6C1T.mode	@ltx/gr_gr_cog/miscellanea:misc.Mode6
ltx/gr_gr_cog/me.m11.d28:meMA.Ode6C1T.ode	@ltx/gr_gr_cog/miscellanea:misc.Ode6
ltx/gr_gr_cog/me.m11.d28:meMA.Ode6C1T.text	Τὴν μόνην πανύμνητον, τὴν καλὴν ἐν γυναιξί, τὴν τοῦ Θεοῦ λοχεύτριαν, Χριστιανῶν τὸ τεῖχος τὸ ἀῤῥαγές, τὴν ἄχραντον Δέσποιναν, ἀδιστάκτῳ καρδία μακαρίσωμεν.
ltx/gr_gr_cog/me.m11.d28:meMA.Ode6C21.greekmelody	@ltx/gr_gr_cog/he.h.m6:heHE.TouViouTinThalassan.greekname
ltx/gr_gr_cog/me.m11.d28:meMA.Ode6C21.incipit	Ἐπέβης τοῖς ὕδασι, κυβερνώμενος χερσί…
ltx/gr_gr_cog/me.m11.d28:meMA.Ode6C21.melody	@ltx/gr_gr_cog/he.h.m6:heHE.TouViouTinThalassan.name
ltx/gr_gr_cog/me.m11.d28:meMA.Ode6C21.mode	@ltx/gr_gr_cog/miscellanea:misc.Mode6
ltx/gr_gr_cog/me.m11.d28:meMA.Ode6C21.ode	@ltx/gr_gr_cog/miscellanea:misc.Ode6
ltx/gr_gr_cog/me.m11.d28:meMA.Ode6C21.text	Ἐπέβης τοῖς ὕδασι, κυβερνώμενος χερσί, ζωαρχικῇ Εἰρήναρχε, καὶ διεσώθης τούτοις τῶν διωκτῶν, βυθίσας σεβάσματα, προσευχῇ ἐπιμόνῳ Ἱερώτατε.
ltx/gr_gr_cog/me.m11.d28:meMA.Ode6C22.incipit	Μικρῶν ἀντωνούμεναι, τὰ μεγάλα ἑαυτάς…
ltx/gr_gr_cog/me.m11.d28:meMA.Ode6C22.melody	@ltx/gr_gr_cog/he.h.m6:heHE.TouViouTinThalassan.name
ltx/gr_gr_cog/me.m11.d28:meMA.Ode6C22.mode	@ltx/gr_gr_cog/miscellanea:misc.Mode6
ltx/gr_gr_cog/me.m11.d28:meMA.Ode6C22.ode	@ltx/gr_gr_cog/miscellanea:misc.Ode6
ltx/gr_gr_cog/me.m11.d28:meMA.Ode6C22.text	Μικρῶν ἀντωνούμεναι, τὰ μεγάλα ἑαυτάς, τοῖς αἰκισμοῖς ἐξέδωκαν, αἱ ἱεραὶ Γυναῖκες τὸν πτερνιστήν, τῆς Εὔας ἐν πνεύματι, θανατώσασαι ὄφιν τὸν ἀρχέκακον.
ltx/gr_gr_cog/me.m11.d28:meMA.Ode6C23.incipit	Οἱ παῖδες οἱ ἅγιοι, ἱερεῖα…
ltx/gr_gr_cog/me.m11.d28:meMA.Ode6C23.melody	@ltx/gr_gr_cog/he.h.m6:heHE.TouViouTinThalassan.name
ltx/gr_gr_cog/me.m11.d28:meMA.Ode6C23.mode	@ltx/gr_gr_cog/miscellanea:misc.Mode6
ltx/gr_gr_cog/me.m11.d28:meMA.Ode6C23.ode	@ltx/gr_gr_cog/miscellanea:misc.Ode6
ltx/gr_gr_cog/me.m11.d28:meMA.Ode6C23.text	Οἱ παῖδες οἱ ἅγιοι, ἱερεῖα καθαρά, καὶ προσφοραὶ ὁλόκληροι, τῷ τυθέντι ὡς θῦμα ἀληθινῷ, ἀμνῷ προσηνέχθησαν, εἰς ὀσμὴν εὐωδίας ἀγαλλόμενοι.
ltx/gr_gr_cog/me.m11.d28:meMA.Ode6C2T.incipit	Ἰδοὺ νῦν σεσάρκωται, ἐξ αἱμάτων…
ltx/gr_gr_cog/me.m11.d28:meMA.Ode6C2T.melody	@ltx/gr_gr_cog/he.h.m6:heHE.TouViouTinThalassan.name
ltx/gr_gr_cog/me.m11.d28:meMA.Ode6C2T.mode	@ltx/gr_gr_cog/miscellanea:misc.Mode6
ltx/gr_gr_cog/me.m11.d28:meMA.Ode6C2T.ode	@ltx/gr_gr_cog/miscellanea:misc.Ode6
ltx/gr_gr_cog/me.m11.d28:meMA.Ode6C2T.text	Ἰδοὺ νῦν σεσάρκωται, ἐξ αἱμάτων σου ἀγνῶν, Παρθενομῆτορ Κύριος, καὶ τοῖς βροτοῖς ἑνοῦται δίχα τροπῆς, διʼ ἄφατον ἔλεος, τὴν ἡμῶν σωτηρίαν ἐργαζόμενος.
ltx/gr_gr_cog/me.m11.d28:meMA.Ode6H.greekmelody	@ltx/gr_gr_cog/he.h.m6:heHE.TouViouTinThalassan.greekname
ltx/gr_gr_cog/me.m11.d28:meMA.Ode6H.incipit	@ltx/gr_gr_cog/he.h.m6:heHE.TouViouTinThalassan.incipit
ltx/gr_gr_cog/me.m11.d28:meMA.Ode6H.melody	@ltx/gr_gr_cog/he.h.m6:heHE.TouViouTinThalassan.melody
ltx/gr_gr_cog/me.m11.d28:meMA.Ode6H.mode	@ltx/gr_gr_cog/miscellanea:misc.Mode6
ltx/gr_gr_cog/me.m11.d28:meMA.Ode6H.ode	@ltx/gr_gr_cog/miscellanea:misc.Ode6
ltx/gr_gr_cog/me.m11.d28:meMA.Ode6H.text	@ltx/gr_gr_cog/he.h.m6:heHE.TouViouTinThalassan.text
ltx/gr_gr_cog/me.m11.d28:meMA.Ode7C11.greekmelody	@ltx/gr_gr_cog/he.h.m6:heHE.DrosovolonMenTinKaminon.greekname
ltx/gr_gr_cog/me.m11.d28:meMA.Ode7C11.incipit	Ἐμηνύθη σοι τὸ τέλος τὸ…
ltx/gr_gr_cog/me.m11.d28:meMA.Ode7C11.melody	@ltx/gr_gr_cog/he.h.m6:heHE.DrosovolonMenTinKaminon.name
ltx/gr_gr_cog/me.m11.d28:meMA.Ode7C11.mode	@ltx/gr_gr_cog/miscellanea:misc.Mode6
ltx/gr_gr_cog/me.m11.d28:meMA.Ode7C11.ode	@ltx/gr_gr_cog/miscellanea:misc.Ode7
ltx/gr_gr_cog/me.m11.d28:meMA.Ode7C11.text	Ἐμηνύθη σοι τὸ τέλος τὸ μακάριον, παντουργικῷ βουλήματι· ὅθεν πλείονι ἐπιδοὺς ἀσκήσει σεαυτόν, ἐκ δόξης εἰς δόξαν προχωρεῖς, ἀποκτανθεὶς διὰ Χριστόν, τὸν ἐπὶ πάντων Θεόν.
ltx/gr_gr_cog/me.m11.d28:meMA.Ode7C12.incipit	Φερωνύμως τῷ πρωτάθλῳ συνδεδόξασαι· καὶ…
ltx/gr_gr_cog/me.m11.d28:meMA.Ode7C12.melody	@ltx/gr_gr_cog/he.h.m6:heHE.DrosovolonMenTinKaminon.name
ltx/gr_gr_cog/me.m11.d28:meMA.Ode7C12.mode	@ltx/gr_gr_cog/miscellanea:misc.Mode6
ltx/gr_gr_cog/me.m11.d28:meMA.Ode7C12.ode	@ltx/gr_gr_cog/miscellanea:misc.Ode7
ltx/gr_gr_cog/me.m11.d28:meMA.Ode7C12.text	Φερωνύμως τῷ πρωτάθλῳ συνδεδόξασαι· καὶ γὰρ λιθολευστούμενος, καὶ συρόμενος καὶ τυπτόμενος ἀνηλεῶς, αἱμάτων ἐπλήρωσας τὴν γῆν, καὶ τὴν ψυχήν σου τῷ Θεῷ, χαίρων παρέδωκας.
ltx/gr_gr_cog/me.m11.d28:meMA.Ode7C13.incipit	Ἐν πλατείαις μάρτυς Στέφανε συρόμενος…
ltx/gr_gr_cog/me.m11.d28:meMA.Ode7C13.melody	@ltx/gr_gr_cog/he.h.m6:heHE.DrosovolonMenTinKaminon.name
ltx/gr_gr_cog/me.m11.d28:meMA.Ode7C13.mode	@ltx/gr_gr_cog/miscellanea:misc.Mode6
ltx/gr_gr_cog/me.m11.d28:meMA.Ode7C13.ode	@ltx/gr_gr_cog/miscellanea:misc.Ode7
ltx/gr_gr_cog/me.m11.d28:meMA.Ode7C13.text	Ἐν πλατείαις μάρτυς Στέφανε συρόμενος, ἀνηλεῶς τῆς πόλεως, ἐξωμάλισας μαρτυρίου τρίβον τοῖς πιστοῖς, ἐν ᾗ ἐπιβαίνοντες στεῤῥῶς, πρὸς τὴν οὐράνιον σαφῶς, πόλιν κατήντησαν.
ltx/gr_gr_cog/me.m11.d28:meMA.Ode7C1T.incipit	Ἱερώτατοι προφῆται προεδήλωσαν, Ἁγνὴ ἐμφαντικώτατα…
ltx/gr_gr_cog/me.m11.d28:meMA.Ode7C1T.melody	@ltx/gr_gr_cog/he.h.m6:heHE.DrosovolonMenTinKaminon.name
ltx/gr_gr_cog/me.m11.d28:meMA.Ode7C1T.mode	@ltx/gr_gr_cog/miscellanea:misc.Mode6
ltx/gr_gr_cog/me.m11.d28:meMA.Ode7C1T.ode	@ltx/gr_gr_cog/miscellanea:misc.Ode7
ltx/gr_gr_cog/me.m11.d28:meMA.Ode7C1T.text	Ἱερώτατοι προφῆται προεδήλωσαν, Ἁγνὴ ἐμφαντικώτατα, τὸ μυστήριον τῆς σεπτῆς λοχείας σου, καὶ νῦν ἡμῖν τὰς ἐκβάσεις τηλαυγῶς κατανοοῦντες εὐσεβῶς, σὲ μακαρίζομεν.
ltx/gr_gr_cog/me.m11.d28:meMA.Ode7C21.greekmelody	@ltx/gr_gr_cog/he.h.m6:heHE.DrosovolonMenTinKaminon.greekname
ltx/gr_gr_cog/me.m11.d28:meMA.Ode7C21.incipit	Συμπαθείας τῆς πρὸς σάρκα διαζεύξας…
ltx/gr_gr_cog/me.m11.d28:meMA.Ode7C21.melody	@ltx/gr_gr_cog/he.h.m6:heHE.DrosovolonMenTinKaminon.name
ltx/gr_gr_cog/me.m11.d28:meMA.Ode7C21.mode	@ltx/gr_gr_cog/miscellanea:misc.Mode6
ltx/gr_gr_cog/me.m11.d28:meMA.Ode7C21.ode	@ltx/gr_gr_cog/miscellanea:misc.Ode7
ltx/gr_gr_cog/me.m11.d28:meMA.Ode7C21.text	Συμπαθείας τῆς πρὸς σάρκα διαζεύξας σου, τὸν νοῦν Μακαριώτατε, φλογιζόμενος καὶ πυρὶ καιόμενος σοφέ, τῶν Παίδων ἐβόας τὴν ᾠδήν· Εὐλογητὸς εἶ ὁ Θεός, ὁ τῶν Πατέρων ἡμῶν.
ltx/gr_gr_cog/me.m11.d28:meMA.Ode7C22.incipit	Μεμακάρισται τῶν παίδων θεῖος ὅμιλος…
ltx/gr_gr_cog/me.m11.d28:meMA.Ode7C22.melody	@ltx/gr_gr_cog/he.h.m6:heHE.DrosovolonMenTinKaminon.name
ltx/gr_gr_cog/me.m11.d28:meMA.Ode7C22.mode	@ltx/gr_gr_cog/miscellanea:misc.Mode6
ltx/gr_gr_cog/me.m11.d28:meMA.Ode7C22.ode	@ltx/gr_gr_cog/miscellanea:misc.Ode7
ltx/gr_gr_cog/me.m11.d28:meMA.Ode7C22.text	Μεμακάρισται τῶν παίδων θεῖος ὅμιλος, καὶ γυναικῶν ἑπτάριθμος, χορὸς ἅγιος, τοὺς ξεσμούς, τὸ πῦρ, τοὺς αἰκισμούς, στεῤῥῶς ὑπομείναντες ὁμοῦ, καὶ οὐρανίων ἀγαθῶν καταξιούμενοι.
ltx/gr_gr_cog/me.m11.d28:meMA.Ode7C23.incipit	Απελαύνονται ἐκ μόνης σου προσκλήσεως…
ltx/gr_gr_cog/me.m11.d28:meMA.Ode7C23.melody	@ltx/gr_gr_cog/he.h.m6:heHE.DrosovolonMenTinKaminon.name
ltx/gr_gr_cog/me.m11.d28:meMA.Ode7C23.mode	@ltx/gr_gr_cog/miscellanea:misc.Mode6
ltx/gr_gr_cog/me.m11.d28:meMA.Ode7C23.ode	@ltx/gr_gr_cog/miscellanea:misc.Ode7
ltx/gr_gr_cog/me.m11.d28:meMA.Ode7C23.text	Απελαύνονται ἐκ μόνης σου προσκλήσεως, τῆς πονηρίας πνεύματα, ἐγνωκότα σε Αθλητὴν ἀήττητον Χριστοῦ, Εἰρήναρχε μέλποντα θερμῶς· Εὐλογητὸς εἶ ὁ Θεός, ὁ τῶν Πατέρων ἡμῶν.
ltx/gr_gr_cog/me.m11.d28:meMA.Ode7C2T.incipit	Ῥαθυμίᾳ με κρατούμενον διέγειρον, πρὸς…
ltx/gr_gr_cog/me.m11.d28:meMA.Ode7C2T.melody	@ltx/gr_gr_cog/he.h.m6:heHE.DrosovolonMenTinKaminon.name
ltx/gr_gr_cog/me.m11.d28:meMA.Ode7C2T.mode	@ltx/gr_gr_cog/miscellanea:misc.Mode6
ltx/gr_gr_cog/me.m11.d28:meMA.Ode7C2T.ode	@ltx/gr_gr_cog/miscellanea:misc.Ode7
ltx/gr_gr_cog/me.m11.d28:meMA.Ode7C2T.text	Ῥαθυμίᾳ με κρατούμενον διέγειρον, πρὸς ἐργασίαν Ἄχραντε θείων πράξεων, ἐνισχύουσά με κατʼ ἐχθρῶν, ἀεὶ πολεμούντων με δεινῶς, καὶ ἐναντίοις λογισμοῖς, δελεαζόντων με.
ltx/gr_gr_cog/me.m11.d28:meMA.Ode8C11.greekmelody	@ltx/gr_gr_cog/he.h.m6:heHE.EkFlogosToisOsiois.greekname
ltx/gr_gr_cog/me.m11.d28:meMA.Ode8C11.incipit	Μανικώτατοι ὥσπερ θῆρες συνέλαβον…
ltx/gr_gr_cog/me.m11.d28:meMA.Ode8C11.melody	@ltx/gr_gr_cog/he.h.m6:heHE.EkFlogosToisOsiois.name
ltx/gr_gr_cog/me.m11.d28:meMA.Ode8C11.mode	@ltx/gr_gr_cog/miscellanea:misc.Mode6
ltx/gr_gr_cog/me.m11.d28:meMA.Ode8C11.ode	@ltx/gr_gr_cog/miscellanea:misc.Ode8
ltx/gr_gr_cog/me.m11.d28:meMA.Ode8C11.text	Μανικώτατοι ὥσπερ θῆρες συνέλαβον, τοῦ Χριστοῦ τὸ ἀρνίον, παίοντες, κτείνοντες, καὶ μετὰ ἀνδρῶν ἀνομούντων συνθάπτοντες, οἱ παρανομίᾳ, συζῶντες εἰς αἰῶνας.
ltx/gr_gr_cog/me.m11.d28:meMA.Ode8C12.incipit	Ἀπηνῶς σου τὴν κάραν ἐχθρὸς…
ltx/gr_gr_cog/me.m11.d28:meMA.Ode8C12.melody	@ltx/gr_gr_cog/he.h.m6:heHE.EkFlogosToisOsiois.name
ltx/gr_gr_cog/me.m11.d28:meMA.Ode8C12.mode	@ltx/gr_gr_cog/miscellanea:misc.Mode6
ltx/gr_gr_cog/me.m11.d28:meMA.Ode8C12.ode	@ltx/gr_gr_cog/miscellanea:misc.Ode8
ltx/gr_gr_cog/me.m11.d28:meMA.Ode8C12.text	Ἀπηνῶς σου τὴν κάραν ἐχθρὸς συνέτριψεν, ἣν Θεὸς ἐν ὑψίστοις στέφει κατέστεψε, τῷ νικητικῷ, Στεφανῖτα πολύαθλε, κλέος τῶν Μαρτύρων, καὶ πάντων τῶν Ὁσίων.
ltx/gr_gr_cog/me.m11.d28:meMA.Ode8C13.incipit	Καρτερῶς, τῷ διώκτῃ ἀντιταττόμενος…
ltx/gr_gr_cog/me.m11.d28:meMA.Ode8C13.melody	@ltx/gr_gr_cog/he.h.m6:heHE.EkFlogosToisOsiois.name
ltx/gr_gr_cog/me.m11.d28:meMA.Ode8C13.mode	@ltx/gr_gr_cog/miscellanea:misc.Mode6
ltx/gr_gr_cog/me.m11.d28:meMA.Ode8C13.ode	@ltx/gr_gr_cog/miscellanea:misc.Ode8
ltx/gr_gr_cog/me.m11.d28:meMA.Ode8C13.text	Καρτερῶς, τῷ διώκτῃ ἀντιταττόμενος, ὁ θεόφρων Ἀνδρέας πληγαῖς συγκόπτεται, καὶ ἀνηλεῶς, θανατοῦται ὁ δίκαιος, μέλπων τῷ Δεσπότῃ, Χριστῷ εἰς τοὺς αἰῶνας.
ltx/gr_gr_cog/me.m11.d28:meMA.Ode8C14.incipit	Ἁγιώτατος οἶκος ἤδη γενόμενος…
ltx/gr_gr_cog/me.m11.d28:meMA.Ode8C14.melody	@ltx/gr_gr_cog/he.h.m6:heHE.EkFlogosToisOsiois.name
ltx/gr_gr_cog/me.m11.d28:meMA.Ode8C14.mode	@ltx/gr_gr_cog/miscellanea:misc.Mode6
ltx/gr_gr_cog/me.m11.d28:meMA.Ode8C14.ode	@ltx/gr_gr_cog/miscellanea:misc.Ode8
ltx/gr_gr_cog/me.m11.d28:meMA.Ode8C14.text	Ἁγιώτατος οἶκος ἤδη γενόμενος, τὸν ἐν πᾶσιν Ἁγίοις ἀναπαυόμενον, ἔσχες ἐν τῇ σῇ, ἐνοικοῦντα πολύαθλε, Στέφανε καρδίᾳ εἰς πάντας τοὺς αἰῶνας.
ltx/gr_gr_cog/me.m11.d28:meMA.Ode8C1T.incipit	Ῥαντισμῷ θείου λύθρου θεοχαρίτωτε…
ltx/gr_gr_cog/me.m11.d28:meMA.Ode8C1T.melody	@ltx/gr_gr_cog/he.h.m6:heHE.EkFlogosToisOsiois.name
ltx/gr_gr_cog/me.m11.d28:meMA.Ode8C1T.mode	@ltx/gr_gr_cog/miscellanea:misc.Mode6
ltx/gr_gr_cog/me.m11.d28:meMA.Ode8C1T.ode	@ltx/gr_gr_cog/miscellanea:misc.Ode8
ltx/gr_gr_cog/me.m11.d28:meMA.Ode8C1T.text	Ῥαντισμῷ θείου λύθρου θεοχαρίτωτε, ἐκ πλευρᾶς κενωθέντος, τοῦ σοῦ Υἱοῦ καὶ Θεοῦ, τὸν ἐκ πονηρᾶς, ἁμαρτίας προσόντα μοι, ῥύπον δυσωπῶ σε, ἀπόπλυνον Παρθένε.
ltx/gr_gr_cog/me.m11.d28:meMA.Ode8C21.greekmelody	@ltx/gr_gr_cog/he.h.m6:heHE.EkFlogosToisOsiois.greekname
ltx/gr_gr_cog/me.m11.d28:meMA.Ode8C21.incipit	Τῶν αἱμάτων τῷ λύθρῳ ἐπισταζόμενος…
ltx/gr_gr_cog/me.m11.d28:meMA.Ode8C21.melody	@ltx/gr_gr_cog/he.h.m6:heHE.EkFlogosToisOsiois.name
ltx/gr_gr_cog/me.m11.d28:meMA.Ode8C21.mode	@ltx/gr_gr_cog/miscellanea:misc.Mode6
ltx/gr_gr_cog/me.m11.d28:meMA.Ode8C21.ode	@ltx/gr_gr_cog/miscellanea:misc.Ode8
ltx/gr_gr_cog/me.m11.d28:meMA.Ode8C21.text	Τῶν αἱμάτων τῷ λύθρῳ ἐπισταζόμενος, καὶ μαστίγων τῷ κάλλει καλλωπιζόμενος, τῷ Νικοποιῷ, παραστὰς ὦ Εἰρήναρχε, νίκης τὰ βραβεῖα, πρὸς τούτῳ ἐκομίσω.
ltx/gr_gr_cog/me.m11.d28:meMA.Ode8C22.incipit	Ὑψωθεὶς τῇ ἀγάπῃ τοῦ Παντοκράτορος…
ltx/gr_gr_cog/me.m11.d28:meMA.Ode8C22.melody	@ltx/gr_gr_cog/he.h.m6:heHE.EkFlogosToisOsiois.name
ltx/gr_gr_cog/me.m11.d28:meMA.Ode8C22.mode	@ltx/gr_gr_cog/miscellanea:misc.Mode6
ltx/gr_gr_cog/me.m11.d28:meMA.Ode8C22.ode	@ltx/gr_gr_cog/miscellanea:misc.Ode8
ltx/gr_gr_cog/me.m11.d28:meMA.Ode8C22.text	Ὑψωθεὶς τῇ ἀγάπῃ τοῦ Παντοκράτορος, διωκτῶν ἐπηρμένην ὀφρὺν κατέαξας, καὶ εἰδωλικόν, ἐταπείνωσας φρύαγμα, Μάρτυς ἀθλοφόρε, Εἰρήναρχε παμμάκαρ.
ltx/gr_gr_cog/me.m11.d28:meMA.Ode8C23.incipit	Συμπαθείας με θείας Μάρτυς ἀξίωσον…
ltx/gr_gr_cog/me.m11.d28:meMA.Ode8C23.melody	@ltx/gr_gr_cog/he.h.m6:heHE.EkFlogosToisOsiois.name
ltx/gr_gr_cog/me.m11.d28:meMA.Ode8C23.mode	@ltx/gr_gr_cog/miscellanea:misc.Mode6
ltx/gr_gr_cog/me.m11.d28:meMA.Ode8C23.ode	@ltx/gr_gr_cog/miscellanea:misc.Ode8
ltx/gr_gr_cog/me.m11.d28:meMA.Ode8C23.text	Συμπαθείας με θείας Μάρτυς ἀξίωσον, πειρασμῶν καὶ κινδύνων ἀπολυτρούμενος, πίστει σε θερμῇ, τὸν τιμῶντα Εἰρήναρχε, καὶ ὑπὸ τὴν σκέπην, τὴν σὴν προσπεφευγότα.
ltx/gr_gr_cog/me.m11.d28:meMA.Ode8C2T.incipit	Χαῖρε ἅγιον ὄρος καὶ θεοβάδιστον…
ltx/gr_gr_cog/me.m11.d28:meMA.Ode8C2T.melody	@ltx/gr_gr_cog/he.h.m6:heHE.EkFlogosToisOsiois.name
ltx/gr_gr_cog/me.m11.d28:meMA.Ode8C2T.mode	@ltx/gr_gr_cog/miscellanea:misc.Mode6
ltx/gr_gr_cog/me.m11.d28:meMA.Ode8C2T.ode	@ltx/gr_gr_cog/miscellanea:misc.Ode8
ltx/gr_gr_cog/me.m11.d28:meMA.Ode8C2T.text	Χαῖρε ἅγιον ὄρος καὶ θεοβάδιστον, ἀποῤῥήτων πραγμάτων χαῖρε φανέρωσις, ἄκουσμα φρικτόν, δυσθεώρητον ὅραμα, χαῖρε τῶν πεσόντων, ἀνάκλησις Παρθένε.
ltx/gr_gr_cog/me.m11.d28:meMA.Ode8H.greekmelody	@ltx/gr_gr_cog/he.h.m6:heHE.EkFlogosToisOsiois.greekname
ltx/gr_gr_cog/me.m11.d28:meMA.Ode8H.incipit	@ltx/gr_gr_cog/he.h.m6:heHE.EkFlogosToisOsiois.incipit
ltx/gr_gr_cog/me.m11.d28:meMA.Ode8H.melody	@ltx/gr_gr_cog/he.h.m6:heHE.EkFlogosToisOsiois.melody
ltx/gr_gr_cog/me.m11.d28:meMA.Ode8H.mode	@ltx/gr_gr_cog/miscellanea:misc.Mode6
ltx/gr_gr_cog/me.m11.d28:meMA.Ode8H.ode	@ltx/gr_gr_cog/miscellanea:misc.Ode8
ltx/gr_gr_cog/me.m11.d28:meMA.Ode8H.text	@ltx/gr_gr_cog/he.h.m6:heHE.EkFlogosToisOsiois.text
ltx/gr_gr_cog/me.m11.d28:meMA.Ode9C11.greekmelody	@ltx/gr_gr_cog/he.h.m6:heHE.TheonAnthropois.greekname
ltx/gr_gr_cog/me.m11.d28:meMA.Ode9C11.incipit	Ἰδὼν ἀγάλλῃ Ἀγγέλων τάγματα…
ltx/gr_gr_cog/me.m11.d28:meMA.Ode9C11.melody	@ltx/gr_gr_cog/he.h.m6:heHE.TheonAnthropois.name
ltx/gr_gr_cog/me.m11.d28:meMA.Ode9C11.mode	@ltx/gr_gr_cog/miscellanea:misc.Mode6
ltx/gr_gr_cog/me.m11.d28:meMA.Ode9C11.ode	@ltx/gr_gr_cog/miscellanea:misc.Ode9
ltx/gr_gr_cog/me.m11.d28:meMA.Ode9C11.text	Ἰδὼν ἀγάλλῃ Ἀγγέλων τάγματα, Πατριαρχῶν, Ὁσίων, Προφητῶν, Ἀποστόλων τε, καὶ Δικαίων ἁπάντων θεόπνευστε, οἷς συμπεριπολεύων μνήσθητι, πρόστηθι, τῶν εἰλικρινῶς ἐπὶ τῆς γῆς, μακαριζόντων σε.
ltx/gr_gr_cog/me.m11.d28:meMA.Ode9C12.incipit	Ὡς φῶς ὡς ὄρθρος ὡς μέγας ἥλιος…
ltx/gr_gr_cog/me.m11.d28:meMA.Ode9C12.melody	@ltx/gr_gr_cog/he.h.m6:heHE.TheonAnthropois.name
ltx/gr_gr_cog/me.m11.d28:meMA.Ode9C12.mode	@ltx/gr_gr_cog/miscellanea:misc.Mode6
ltx/gr_gr_cog/me.m11.d28:meMA.Ode9C12.ode	@ltx/gr_gr_cog/miscellanea:misc.Ode9
ltx/gr_gr_cog/me.m11.d28:meMA.Ode9C12.text	Ὡς φῶς ὡς ὄρθρος ὡς μέγας ἥλιος, ὡς οὐρανὸς κατάστερος θαυμάτων λαμπρότησι, καὶ στιγμάτων ἁγίων γεγένησαι, πάντων τὰς διανοίας, τῶν εὐφημούντων σε, Στέφανε λαμπρύνων ἀληθῶς, Μάρτυς πολύαθλε.
ltx/gr_gr_cog/me.m11.d28:meMA.Ode9C13.incipit	Στεῤῥοῖς ἀσκήσεως ἀγωνίσματι…
ltx/gr_gr_cog/me.m11.d28:meMA.Ode9C13.melody	@ltx/gr_gr_cog/he.h.m6:heHE.TheonAnthropois.name
ltx/gr_gr_cog/me.m11.d28:meMA.Ode9C13.mode	@ltx/gr_gr_cog/miscellanea:misc.Mode6
ltx/gr_gr_cog/me.m11.d28:meMA.Ode9C13.ode	@ltx/gr_gr_cog/miscellanea:misc.Ode9
ltx/gr_gr_cog/me.m11.d28:meMA.Ode9C13.text	Στεῤῥοῖς ἀσκήσεως ἀγωνίσματι, καταβαλὼν τοῦ σκότους τὰς ἀρχὰς Πάτερ πρότερον, ἐπʼ ἐσχάτων ἀθλήσας στεῤῥότατα, παντελεῖ ἀπωλείᾳ, ταύτας παρέδωκας, Στέφανε μαρτύρων καλλονή, Ὁσίων καύχημα.
ltx/gr_gr_cog/me.m11.d28:meMA.Ode9C14.incipit	Ἡ σὴ περίδοξος μνήμη σήμερον…
ltx/gr_gr_cog/me.m11.d28:meMA.Ode9C14.melody	@ltx/gr_gr_cog/he.h.m6:heHE.TheonAnthropois.name
ltx/gr_gr_cog/me.m11.d28:meMA.Ode9C14.mode	@ltx/gr_gr_cog/miscellanea:misc.Mode6
ltx/gr_gr_cog/me.m11.d28:meMA.Ode9C14.ode	@ltx/gr_gr_cog/miscellanea:misc.Ode9
ltx/gr_gr_cog/me.m11.d28:meMA.Ode9C14.text	Ἡ σὴ περίδοξος μνήμη σήμερον, φωτιστικαῖς ἀκτῖσι χαρισμάτων τοῦ Πνεύματος, καταυγάζει τὰ τῆς γῆς πληρώματα· ἣν ἐν ἀγαλλιάσει, νῦν ἑορτάζοντας, φώτισον, ἁγίασον ἡμᾶς, θεομακάριστε.
ltx/gr_gr_cog/me.m11.d28:meMA.Ode9C1T.incipit	Φωτὸς δοχεῖον θεοχαρίτωτε…
ltx/gr_gr_cog/me.m11.d28:meMA.Ode9C1T.melody	@ltx/gr_gr_cog/he.h.m6:heHE.TheonAnthropois.name
ltx/gr_gr_cog/me.m11.d28:meMA.Ode9C1T.mode	@ltx/gr_gr_cog/miscellanea:misc.Mode6
ltx/gr_gr_cog/me.m11.d28:meMA.Ode9C1T.ode	@ltx/gr_gr_cog/miscellanea:misc.Ode9
ltx/gr_gr_cog/me.m11.d28:meMA.Ode9C1T.text	Φωτὸς δοχεῖον θεοχαρίτωτε, τῶν ἱερῶν Μαρτύρων ἀληθῶς τὸ κραταίωμα, καὶ Ὁσίων ἁπάντων τὸ καύχημα, σῶσον ἡμᾶς κινδύνων, καὶ περιστάσεων, καὶ τῆς τῶν ἐχθρῶν ἐπιδρομῆς, τοὺς ἀνυμνοῦντάς σε.
ltx/gr_gr_cog/me.m11.d28:meMA.Ode9C21.greekmelody	@ltx/gr_gr_cog/he.h.m6:heHE.TheonAnthropois.greekname
ltx/gr_gr_cog/me.m11.d28:meMA.Ode9C21.incipit	Αὐτὸ τὸ ἔσχατον καὶ ἀκρότατον…
ltx/gr_gr_cog/me.m11.d28:meMA.Ode9C21.melody	@ltx/gr_gr_cog/he.h.m6:heHE.TheonAnthropois.name
ltx/gr_gr_cog/me.m11.d28:meMA.Ode9C21.mode	@ltx/gr_gr_cog/miscellanea:misc.Mode6
ltx/gr_gr_cog/me.m11.d28:meMA.Ode9C21.ode	@ltx/gr_gr_cog/miscellanea:misc.Ode9
ltx/gr_gr_cog/me.m11.d28:meMA.Ode9C21.text	Αὐτὸ τὸ ἔσχατον καὶ ἀκρότατον, τῶν ἐφετῶν κατείληφας θεόφρον Εἰρήναρχε, καὶ μεθέξει Θεὸς ἐχρημάτισας, ψάλλων σὺν Ἀσωμάτοις Ἅγιος, ἅγιος, ἅγιος, Τριὰς ἡ παντουργός, καὶ παντοδύναμος.
ltx/gr_gr_cog/me.m11.d28:meMA.Ode9C22.incipit	Ῥυσθεὶς παγίδων τῶν θηρευόντων σε…
ltx/gr_gr_cog/me.m11.d28:meMA.Ode9C22.melody	@ltx/gr_gr_cog/he.h.m6:heHE.TheonAnthropois.name
ltx/gr_gr_cog/me.m11.d28:meMA.Ode9C22.mode	@ltx/gr_gr_cog/miscellanea:misc.Mode6
ltx/gr_gr_cog/me.m11.d28:meMA.Ode9C22.ode	@ltx/gr_gr_cog/miscellanea:misc.Ode9
ltx/gr_gr_cog/me.m11.d28:meMA.Ode9C22.text	Ῥυσθεὶς παγίδων τῶν θηρευόντων σε, καλιὰν οὐράνιον κατέπαυσας Ἔνδοξε, καὶ Μαρτύρων συνήφθης στρατεύμασι, μετὰ τῶν σῶν συνάθλων· ὅθεν γεραίρομεν μνήμην τὴν ὑμῶν περιχαρῶς, πανηγυρίζοντες.
ltx/gr_gr_cog/me.m11.d28:meMA.Ode9C23.incipit	Ἰσχὺν καὶ κράτος Χριστὸν τιθέμενος…
ltx/gr_gr_cog/me.m11.d28:meMA.Ode9C23.melody	@ltx/gr_gr_cog/he.h.m6:heHE.TheonAnthropois.name
ltx/gr_gr_cog/me.m11.d28:meMA.Ode9C23.mode	@ltx/gr_gr_cog/miscellanea:misc.Mode6
ltx/gr_gr_cog/me.m11.d28:meMA.Ode9C23.ode	@ltx/gr_gr_cog/miscellanea:misc.Ode9
ltx/gr_gr_cog/me.m11.d28:meMA.Ode9C23.text	Ἰσχὺν καὶ κράτος Χριστὸν τιθέμενος, τὸ χαλεπὸν βασάνων διεπέρασας πέλαγος, καὶ τοὺς ἄνω λιμένας κατέλαβες, ὅλος ὡραϊσμένος, ὅλος τοῦ Πνεύματος, ταῖς φωτοχυσίαις δαψιλῶς, περιχεόμενος.
ltx/gr_gr_cog/me.m11.d28:meMA.Ode9C2T.incipit	Νοεῖν τὸ θαῦμα τὸ ἀκατάληπτον…
ltx/gr_gr_cog/me.m11.d28:meMA.Ode9C2T.melody	@ltx/gr_gr_cog/he.h.m6:heHE.TheonAnthropois.name
ltx/gr_gr_cog/me.m11.d28:meMA.Ode9C2T.mode	@ltx/gr_gr_cog/miscellanea:misc.Mode6
ltx/gr_gr_cog/me.m11.d28:meMA.Ode9C2T.ode	@ltx/gr_gr_cog/miscellanea:misc.Ode9
ltx/gr_gr_cog/me.m11.d28:meMA.Ode9C2T.text	Νοεῖν τὸ θαῦμα τὸ ἀκατάληπτον, τοῦ τοκετοῦ τοῦ σοῦ Παρθενομῆτορ μὴ σθένοντες, σιωπῇ τοῦτο μᾶλλον δοξάζομεν, καὶ σὲ δοξολογοῦμεν, τὴν παμμακάριστον, μόνην καὶ καλὴν ἐν γυναιξίν, ὦ Παναμώμητε.
ltx/gr_gr_cog/me.m11.d28:meMA.Ode9H.greekmelody	@ltx/gr_gr_cog/he.h.m6:heHE.TheonAnthropois.greekname
ltx/gr_gr_cog/me.m11.d28:meMA.Ode9H.incipit	@ltx/gr_gr_cog/he.h.m6:heHE.TheonAnthropois.incipit
ltx/gr_gr_cog/me.m11.d28:meMA.Ode9H.melody	@ltx/gr_gr_cog/he.h.m6:heHE.TheonAnthropois.melody
ltx/gr_gr_cog/me.m11.d28:meMA.Ode9H.mode	@ltx/gr_gr_cog/miscellanea:misc.Mode6
ltx/gr_gr_cog/me.m11.d28:meMA.Ode9H.ode	@ltx/gr_gr_cog/miscellanea:misc.Ode9
ltx/gr_gr_cog/me.m11.d28:meMA.Ode9H.text	@ltx/gr_gr_cog/he.h.m6:heHE.TheonAnthropois.text
ltx/gr_gr_cog/me.m11.d28:meMA.Oikos1.text	Εἰς πᾶσαν γῆν ὡς ἀληθῶς, διέδραμεν ὁ φθόγγος τῶν σῶν κατορθωμάτων, σοφὲ Ὁσιομάρτυς, ὧν περ εἰργάσω θαυμαστῶς· ὅθεν δυσωπῶ σε, παῤῥησίαν πρὸς Θεὸν ὡς κεκτημένος Ὅσιε, ἱκέτευε τοῦ δοθῆναί μοι λόγον ἐπάξιον, τοῦ ἀνευφημῆσαι τοὺς ἀγῶνας, οὓς ὑπέστης ἐξ ὁρατῶν ἐχθρῶν καὶ νοουμένων· ὃς πρὶν ἀσκητικῶς καθεῖλες, ἀπάσας τὰς κινήσεις τῆς σαρκὸς ἀπονεκρώσας, ἀθλήσει δὲ νῦν τὸν τύραννον ἐτροπώσω, Ὁσίων τὸ καύχημα.
ltx/gr_gr_cog/me.m11.d28:meVE.Apolytikion1ger.greekmelody	@ltx/gr_gr_cog/he.a.m3:heAU.TheiasPisteos.greekname
ltx/gr_gr_cog/me.m11.d28:meVE.Apolytikion1ger.incipit	Θείαν ἄσκησιν, ἐνδεδειγμένος…
ltx/gr_gr_cog/me.m11.d28:meVE.Apolytikion1ger.melody	@ltx/gr_gr_cog/he.a.m3:heAU.TheiasPisteos.name
ltx/gr_gr_cog/me.m11.d28:meVE.Apolytikion1ger.mode	@ltx/gr_gr_cog/miscellanea:misc.Mode3
ltx/gr_gr_cog/me.m11.d28:meVE.Apolytikion1ger.poet	@ltx/gr_gr_cog/poets:po.Gerasimou
ltx/gr_gr_cog/me.m11.d28:meVE.Apolytikion1ger.text	Θείαν ἄσκησιν, ἐνδεδειγμένος, σκεῦος γέγονας, δικαιοσύνης, διαπρέπων ταῖς σεπταῖς ἀναβάσεσι· καὶ σοῦ Χριστοῦ τὴν Εἰκόνα σεβόμενος, μαρτυρικῆς ἠξιώθης φαιδρότητος. Θεῖε Στέφανε, ἐν ὅπλῳ ἡμᾶς στεφάνωσον, τῆς θείας εὐδοκίας τοὺς ἡμνοῦντάς σε.
ltx/gr_gr_cog/me.m11.d28:meVE.Apolytikion2ger.greekmelody	@ltx/gr_gr_cog/he.a.m4:heAU.TachyProkatalave.greekname
ltx/gr_gr_cog/me.m11.d28:meVE.Apolytikion2ger.incipit	Εἰρήνης τὸν πρύτανιν…
ltx/gr_gr_cog/me.m11.d28:meVE.Apolytikion2ger.melody	@ltx/gr_gr_cog/he.a.m4:heAU.TachyProkatalave.name
ltx/gr_gr_cog/me.m11.d28:meVE.Apolytikion2ger.mode	@ltx/gr_gr_cog/miscellanea:misc.Mode4
ltx/gr_gr_cog/me.m11.d28:meVE.Apolytikion2ger.poet	@ltx/gr_gr_cog/poets:po.Gerasimou
ltx/gr_gr_cog/me.m11.d28:meVE.Apolytikion2ger.text	Εἰρήνης τὸν πρύτανιν, ὁμολογήσας πιστῶς, τῆς πλάνης τὸν τάραχον, κατέλιπες νουνεχῶς, θεόφρον Εἰρήναρχε· ὅθεν διʼ ὕδατὸς τε, καὶ πυρὸς ὡς διῆλθες ἔβης τροπαιοφόρος, πρὸς οὐράνιον λῆξιν, εἰρήνην καὶ σωτηρίαν, πᾶσιν αἰτούμενος.
ltx/gr_gr_cog/me.m11.d28:meVE.Apolytikion3.greekmelody	@ltx/gr_gr_cog/he.a.m4:heAU.OYpsotheisEnToStavro.greekname
ltx/gr_gr_cog/me.m11.d28:meVE.Apolytikion3.incipit	Ἀσκητικῶς προγυμνασθεὶς ἐν τῷ ὄρει…
ltx/gr_gr_cog/me.m11.d28:meVE.Apolytikion3.melody	@ltx/gr_gr_cog/he.a.m4:heAU.OYpsotheisEnToStavro.name
ltx/gr_gr_cog/me.m11.d28:meVE.Apolytikion3.mode	@ltx/gr_gr_cog/miscellanea:misc.Mode4
ltx/gr_gr_cog/me.m11.d28:meVE.Apolytikion3.text	Ἀσκητικῶς προγυμνασθεὶς ἐν τῷ ὄρει, τὰς νοητὰς τῶν δυσμενῶν παρατάξεις, τῇ πανοπλίᾳ ὤλεσας παμμάκαρ τοῦ Σταυροῦ· αὖθις δὲ πρὸς ἄθλησιν, ἀνδρικῶς ἀπεδύσω, κτείνας τὸν Κοπρώνυμον, τῷ τῆς Πίστεως ξίφει, καὶ διʼ ἀμφοῖν ἐστέφθης ἐκ Θεοῦ, Ὁσιομάρτυς ἀοίδιμε Στέφανε.
ltx/gr_gr_cog/me.m11.d28:meVE.AposGlory.incipit	Τὸ κατʼ εἰκόνα τηρήσας ἀλώβητον…
ltx/gr_gr_cog/me.m11.d28:meVE.AposGlory.melody	
ltx/gr_gr_cog/me.m11.d28:meVE.AposGlory.mode	@ltx/gr_gr_cog/miscellanea:misc.Mode8
ltx/gr_gr_cog/me.m11.d28:meVE.AposGlory.text	Τὸ κατʼ εἰκόνα τηρήσας ἀλώβητον, Ὅσιε Πάτερ, ὑπὲρ τῆς Χριστοῦ εἰκόνος, ἀντέστης ἀνδρικώτατα, μὴ ὑποπτήξας τοῦ Κοπρωνύμου τὰς ἀπειλάς, ἀλλὰ τῷ τοῦ Πνεύματος ξίφει, τοῦτον ἀπέκτεινας. Διὸ παῤῥησίαν κεκτημένος πρὸς Θεόν, περίσῳζε τὴν ποίμνην σου, ἐξ αἱρέσεων πασῶν, Στέφανε πολύαθλε.
ltx/gr_gr_cog/me.m11.d28:meVE.AposStavrotheotokion.greekmelody	@ltx/gr_gr_cog/he.a.m8:heAU.OTouParadoxou.greekname
ltx/gr_gr_cog/me.m11.d28:meVE.AposStavrotheotokion.incipit	@ltx/gr_gr_cog/me.m01.d15:meMA.AposStavrotheotokion.incipit
ltx/gr_gr_cog/me.m11.d28:meVE.AposStavrotheotokion.melody	@ltx/gr_gr_cog/he.a.m8:heAU.OTouParadoxou.name
ltx/gr_gr_cog/me.m11.d28:meVE.AposStavrotheotokion.mode	@ltx/gr_gr_cog/miscellanea:misc.Mode8
ltx/gr_gr_cog/me.m11.d28:meVE.AposStavrotheotokion.text	@ltx/gr_gr_cog/me.m01.d15:meMA.AposStavrotheotokion.text
ltx/gr_gr_cog/me.m11.d28:meVE.AposTheotokion.incipit	@ltx/gr_gr_cog/oc.m8.d5:ocMA.AposTheotokion.incipit
ltx/gr_gr_cog/me.m11.d28:meVE.AposTheotokion.melody	
ltx/gr_gr_cog/me.m11.d28:meVE.AposTheotokion.mode	@ltx/gr_gr_cog/miscellanea:misc.Mode8
ltx/gr_gr_cog/me.m11.d28:meVE.AposTheotokion.text	@ltx/gr_gr_cog/oc.m8.d5:ocMA.AposTheotokion.text
ltx/gr_gr_cog/me.m11.d28:meVE.SticGlory.incipit	Ἐκ βρέφους τῷ Θεῷ ἀνετέθης…
ltx/gr_gr_cog/me.m11.d28:meVE.SticGlory.melody	
ltx/gr_gr_cog/me.m11.d28:meVE.SticGlory.mode	@ltx/gr_gr_cog/miscellanea:misc.Mode6
ltx/gr_gr_cog/me.m11.d28:meVE.SticGlory.poet	@ltx/gr_gr_cog/poets:po.Stouditou
ltx/gr_gr_cog/me.m11.d28:meVE.SticGlory.text	Ἐκ βρέφους τῷ Θεῷ, ἀνετέθης Ἱερώτατε Στέφανε, ὥς περ ὁ μέγας προφήτης Σαμουήλ, καὶ ἐν τῷ ὄρει ἀνελθών, μοναδικῶς εὐηρέστησας αὐτῷ. Αὖθις δὲ πρὸς ἄθλησιν, ἐπεδύσω ἀνδρικῶς· καὶ ὑπὲρ τῆς εἰκόνος αὐτοῦ, ἐξορίας καὶ θλίψεις ὑπέστης καρτερώτατα, καὶ δεσμοῖς καὶ φυλακαῖς ἐνεκαρτέρησας· συρόμενος δὲ καὶ τυπτόμενος, καὶ λιθαζόμενος, καὶ τὴν κάραν συντριβόμενος, τῶν στεφάνων ἠξιώθης παρὰ Χριστοῦ τοῦ Θεοῦ. Αὐτὸν ἱκέτευε, τοὺς ἐκ πόθου τελοῦντας τὴν ἀεισέβαστον μνήμην σου, λυτρωθῆναι ἐκ παθῶν καὶ πειρασμῶν, καὶ τῆς μελλούσης θλίψεως, καὶ σωθῆναι τὰς ψυχὰς ἡμῶν.
ltx/gr_gr_cog/me.m11.d28:meVE.SticStavrotheotokion.greekmelody	@ltx/gr_gr_cog/he.a.m6:heAU.OlinApothemenoi.greekname
ltx/gr_gr_cog/me.m11.d28:meVE.SticStavrotheotokion.incipit	@ltx/gr_gr_cog/me.m02.d17:meMA.LaudsStavrotheotokion.incipit
ltx/gr_gr_cog/me.m11.d28:meVE.SticStavrotheotokion.melody	@ltx/gr_gr_cog/he.a.m6:heAU.OlinApothemenoi.name
ltx/gr_gr_cog/me.m11.d28:meVE.SticStavrotheotokion.mode	@ltx/gr_gr_cog/miscellanea:misc.Mode6
ltx/gr_gr_cog/me.m11.d28:meVE.SticStavrotheotokion.text	@ltx/gr_gr_cog/me.m02.d17:meMA.LaudsStavrotheotokion.text
ltx/gr_gr_cog/me.m11.d28:meVE.SticTheotokion.incipit	@ltx/gr_gr_cog/oc.m6.d3:ocMA.AposTheotokion.incipit
ltx/gr_gr_cog/me.m11.d28:meVE.SticTheotokion.melody	
ltx/gr_gr_cog/me.m11.d28:meVE.SticTheotokion.mode	@ltx/gr_gr_cog/miscellanea:misc.Mode6
ltx/gr_gr_cog/me.m11.d28:meVE.SticTheotokion.text	@ltx/gr_gr_cog/oc.m6.d3:ocMA.AposTheotokion.text
ltx/gr_gr_cog/me.m11.d28:meVE.Stichera01.greekmelody	@ltx/gr_gr_cog/he.a.m6:heAU.OlinApothemenoi.greekname
ltx/gr_gr_cog/me.m11.d28:meVE.Stichera01.incipit	Ὅλος ἐκ νεότητος, ἀνατεθεὶς τῷ Κυρίῳ…
ltx/gr_gr_cog/me.m11.d28:meVE.Stichera01.melody	@ltx/gr_gr_cog/he.a.m6:heAU.OlinApothemenoi.name
ltx/gr_gr_cog/me.m11.d28:meVE.Stichera01.mode	@ltx/gr_gr_cog/miscellanea:misc.Mode6
ltx/gr_gr_cog/me.m11.d28:meVE.Stichera01.text	Ὅλος ἐκ νεότητος, ἀνατεθεὶς τῷ Κυρίῳ, σαρκὸς ἔξω γέγονας, κοσμικῆς τε σχέσεως ἱερώτατε, μοναστὴς ἄριστος, πεφυκὼς Στέφανε, καὶ δοχεῖον θείου Πνεύματος· καὶ γὰρ συγκλείσας σου, οἴκῳ στενοτάτῳ μακάριε, τὸ σῶμα ἀνεπτέρωσας, νοῦν πρὸς οὐρανὸν ἐνοπτρίζεσθαι, τὸ ἄῤῥητον κάλλος, Χριστοῦ τοῦ Βασιλέως καὶ Θεοῦ, οὗ προσκυνῶν τὸ ὁμοίωμα, ἤθλησας στεῤῥότατα.
ltx/gr_gr_cog/me.m11.d28:meVE.Stichera02.incipit	Τεσσαρακονθήμερον, ὡς ὁ Δεσπότης…
ltx/gr_gr_cog/me.m11.d28:meVE.Stichera02.melody	@ltx/gr_gr_cog/he.a.m6:heAU.OlinApothemenoi.name
ltx/gr_gr_cog/me.m11.d28:meVE.Stichera02.mode	@ltx/gr_gr_cog/miscellanea:misc.Mode6
ltx/gr_gr_cog/me.m11.d28:meVE.Stichera02.text	Τεσσαρακονθήμερον, ὡς ὁ Δεσπότης νηστεύσας, ἐν εἱρκτῇ φρουρούμενος, σεαυτὸν πρὸς ἄθλησιν παρεσκεύασας, Ἱερὲ Στέφανε, Μοναστῶν ἔρεισμα, καὶ Μαρτύρων ἐγκαλλώπισμα· ὅθεν ὡς θῆρές σοι, οἱ ἀνηλεεῖς ἐπιθέμενοι, ἀρνίον ὥς περ ἄκακον, σύραντες ἀδίκως ἐσπάραξαν, καὶ μετὰ ἀνόμων, κατέθεντο ἀθλήσαντα στεῤῥῶς, καὶ παῤῥησίᾳ πρεσβεύοντα, ὑπὲρ τῶν ψυχῶν ἡμῶν.
ltx/gr_gr_cog/me.m11.d28:meVE.Stichera03.incipit	Λαὸς ὁ παράνομος, παρανομίαις ὑπείκων…
ltx/gr_gr_cog/me.m11.d28:meVE.Stichera03.melody	@ltx/gr_gr_cog/he.a.m6:heAU.OlinApothemenoi.name
ltx/gr_gr_cog/me.m11.d28:meVE.Stichera03.mode	@ltx/gr_gr_cog/miscellanea:misc.Mode6
ltx/gr_gr_cog/me.m11.d28:meVE.Stichera03.text	Λαὸς ὁ παράνομος, παρανομίαις ὑπείκων, παρανόμου Ὅσιε, βασιλέως λίθοις σε ὡς τὸν Πρώταθλον, ἀφειδῶς ἔβαλε, καὶ τὴν κάραν Πάτερ, τὴν ἁγίαν σου συνέτριψε, ταῖς λεωφόροις τε, σύρων ὠμοτάτως ἐξέχεε, τὰ σπλάγχνα σου πανόλβιε, μηδὲ μετὰ πότμον οἰκτείρας σε. Ὢ τῆς σῆς ἀνδρείας! ὢ γνώμης! ὢ πολλῆς ὑπομονῆς! διʼ ἧς ἀπείληφας Στέφανε, στέφος ἀμαράντινον.
ltx/gr_gr_cog/me.m11.d28:meVE.Stichera04.greekmelody	@ltx/gr_gr_cog/he.a.m6:heAU.TriimerosAnestis.greekname
ltx/gr_gr_cog/me.m11.d28:meVE.Stichera04.incipit	Ἀγῶνας τοῦ σεπτοῦ Ἀθλητοῦ…
ltx/gr_gr_cog/me.m11.d28:meVE.Stichera04.melody	@ltx/gr_gr_cog/he.a.m6:heAU.TriimerosAnestis.name
ltx/gr_gr_cog/me.m11.d28:meVE.Stichera04.mode	@ltx/gr_gr_cog/miscellanea:misc.Mode6
ltx/gr_gr_cog/me.m11.d28:meVE.Stichera04.text	Ἀγῶνας τοῦ σεπτοῦ Ἀθλητοῦ, τοὺς πόνους τοῦ ὁπλίτου Χριστοῦ, εὐφημοῦντες κατὰ χρέος οἱ πιστοί, βοήσωμεν Κυρίῳ· Αὐτοῦ ταῖς ἱκεσίαις, πάσης ἀνάγκης ἐξελοῦ ἡμᾶς.
ltx/gr_gr_cog/me.m11.d28:meVE.Stichera05.incipit	Εἰρήνη σοι πολλὴ ἐκ Θεοῦ…
ltx/gr_gr_cog/me.m11.d28:meVE.Stichera05.melody	@ltx/gr_gr_cog/he.a.m6:heAU.TriimerosAnestis.name
ltx/gr_gr_cog/me.m11.d28:meVE.Stichera05.mode	@ltx/gr_gr_cog/miscellanea:misc.Mode6
ltx/gr_gr_cog/me.m11.d28:meVE.Stichera05.text	Εἰρήνη σοι πολλὴ ἐκ Θεοῦ, ἀθλήσαντι γεγένηται, καὶ τὸν σάλον, διελθόντι τῶν δεινῶν, Εἰρήναρχε παμμάκαρ, γενναῖε στρατιῶτα, καὶ πρεσβευτὰ τῶν εὐφημούντων σε.
ltx/gr_gr_cog/me.m11.d28:meVE.Stichera06.incipit	Συνήθλει σοι γυναίων χορός…
ltx/gr_gr_cog/me.m11.d28:meVE.Stichera06.melody	@ltx/gr_gr_cog/he.a.m6:heAU.TriimerosAnestis.name
ltx/gr_gr_cog/me.m11.d28:meVE.Stichera06.mode	@ltx/gr_gr_cog/miscellanea:misc.Mode6
ltx/gr_gr_cog/me.m11.d28:meVE.Stichera06.text	Συνήθλει σοι γυναίων χορός, καὶ παίδων θεῖος ὅμιλος, σὺν τῷ θείῳ, Ἀκακίῳ καρτερῶς, τελοῦντι, τὸν ἀγῶνα, καὶ πλάνην ἐκνευροῦντι, Μάρτυς Εἰρήναρχε μακάριε.
