ltx/gr_gr_cog/me.m07.d14:meDA.commemoration.first	Μνήμη τοῦ Ἁγίου Ἀποστόλου Ἀκύλα
ltx/gr_gr_cog/me.m07.d14:meDA.commemoration.first_name	
ltx/gr_gr_cog/me.m07.d14:meDA.commemoration.first_short	Μνήμη τοῦ Ἁγίου Ἀποστόλου Ἀκύλα
ltx/gr_gr_cog/me.m07.d14:meDA.commemoration.first_title	@ltx/gr_gr_cog/titles:ti.Apostle
ltx/gr_gr_cog/me.m07.d14:meDA.commemoration.full	Μνήμη τοῦ Ἁγίου Ἀποστόλου Ἀκύλα, Ἑνὸς τῶν Ἑβδομήκοντα.
ltx/gr_gr_cog/me.m07.d14:meDA.commemoration.second_name	
ltx/gr_gr_cog/me.m07.d14:meDA.commemoration.second_title	
ltx/gr_gr_cog/me.m07.d14:meDA.date	Τῌ ΙΔʹ ΙΟΥΛΙΟΥ
ltx/gr_gr_cog/me.m07.d14:meDA.fordate	διὰ τὴν 14ην Ἰουλίου
ltx/gr_gr_cog/me.m07.d14:meDA.insert1	καὶ τοῦ Ἁγίου Ἀποστόλου Ἀκύλα, ἑνὸς τῶν ἑβδομήκοντα,
ltx/gr_gr_cog/me.m07.d14:meDA.insert2	οὗ καὶ τὴν μνήμην ἐπιτελοῦμεν·
ltx/gr_gr_cog/me.m07.d14:meDA.note	
ltx/gr_gr_cog/me.m07.d14:meDA.pdfcoverdate	τῆς 14ης Ἰουλίου,
ltx/gr_gr_cog/me.m07.d14:meDA.pdfheaderdate	τῆς 14ης Ἰουλίου
ltx/gr_gr_cog/me.m07.d14:meHO.commemorations	
ltx/gr_gr_cog/me.m07.d14:meHO.note1	
ltx/gr_gr_cog/me.m07.d14:meHO.note2	
ltx/gr_gr_cog/me.m07.d14:meHO.number	
ltx/gr_gr_cog/me.m07.d14:meHO.rank	
ltx/gr_gr_cog/me.m07.d14:meLE.commemoration1	Τοῦ Ἁγίου Ἀποστόλου Ἀκύλα.
ltx/gr_gr_cog/me.m07.d14:meLE.commemoration2	
ltx/gr_gr_cog/me.m07.d14:meLI.Kontakion1.greekmelody	@ltx/gr_gr_cog/me.m07.d14:meMA.Kontakion1.greekmelody
ltx/gr_gr_cog/me.m07.d14:meLI.Kontakion1.incipit	@ltx/gr_gr_cog/me.m07.d14:meMA.Kontakion1.incipit
ltx/gr_gr_cog/me.m07.d14:meLI.Kontakion1.melody	@ltx/gr_gr_cog/me.m07.d14:meMA.Kontakion1.melody
ltx/gr_gr_cog/me.m07.d14:meLI.Kontakion1.mode	@ltx/gr_gr_cog/me.m07.d14:meMA.Kontakion1.mode
ltx/gr_gr_cog/me.m07.d14:meLI.Kontakion1.text	@ltx/gr_gr_cog/me.m07.d14:meMA.Kontakion1.text
ltx/gr_gr_cog/me.m07.d14:meLI.Megalynarion.text	
ltx/gr_gr_cog/me.m07.d14:meMA.C1.acrostic.notice1	οὗ ἡ Ἀκροστιχίς·
ltx/gr_gr_cog/me.m07.d14:meMA.C1.acrostic.text	Τὸν κλεινὸν ὑμνήσωμεν Ἀκύλαν πόθῳ Ἰωσήφ.
ltx/gr_gr_cog/me.m07.d14:meMA.C1.acrostic.title	Ὁ Κανὼν τοῦ Ἁγίου,
ltx/gr_gr_cog/me.m07.d14:meMA.C1.title	@ltx/gr_gr_cog/titles:ti.CanonSaintM
ltx/gr_gr_cog/me.m07.d14:meMA.C1.verse	@ltx/gr_gr_cog/prayers:pr.verse_SaintM.text
ltx/gr_gr_cog/me.m07.d14:meMA.Kontakion1.greekmelody	@ltx/gr_gr_cog/he.a.m4:heAU.EpefanisSimeron.greekname
ltx/gr_gr_cog/me.m07.d14:meMA.Kontakion1.incipit	Ἀποστόλων σύνθρονος, καὶ συνοδίτης, γεγονὼς…
ltx/gr_gr_cog/me.m07.d14:meMA.Kontakion1.melody	@ltx/gr_gr_cog/he.a.m4:heAU.EpefanisSimeron.name
ltx/gr_gr_cog/me.m07.d14:meMA.Kontakion1.mode	@ltx/gr_gr_cog/miscellanea:misc.Mode4
ltx/gr_gr_cog/me.m07.d14:meMA.Kontakion1.text	Ἀποστόλων σύνθρονος, καὶ συνοδίτης, γεγονὼς Ἀπόστολε, τὴν οἰκουμένην διδαχαῖς, καὶ θαυμασίοις κατηύγασας, στέφανον δόξης, Ἀκύλα δεξάμενος.
ltx/gr_gr_cog/me.m07.d14:meMA.Ode1C11.greekmelody	@ltx/gr_gr_cog/he.h.m2:heHE.DefteLaoi.greekname
ltx/gr_gr_cog/me.m07.d14:meMA.Ode1C11.incipit	Τὸν ἱερόν, ἱερωτάτοις ὑμνήσωμεν, Ἀκύλαν…
ltx/gr_gr_cog/me.m07.d14:meMA.Ode1C11.melody	@ltx/gr_gr_cog/he.h.m2:heHE.DefteLaoi.name
ltx/gr_gr_cog/me.m07.d14:meMA.Ode1C11.mode	@ltx/gr_gr_cog/miscellanea:misc.Mode2
ltx/gr_gr_cog/me.m07.d14:meMA.Ode1C11.ode	@ltx/gr_gr_cog/miscellanea:misc.Ode1
ltx/gr_gr_cog/me.m07.d14:meMA.Ode1C11.text	Τὸν ἱερόν, ἱερωτάτοις ὑμνήσωμεν, Ἀκύλαν μελῳδήμασι· καὶ ἐκβοήσωμεν, ταῖς αὐτοῦ ἱκεσίαις, οἰκτίρμον πάντας σῶσον, ὡς ὑπεράγαθος.
ltx/gr_gr_cog/me.m07.d14:meMA.Ode1C12.incipit	Ὅλον σαυτόν, Μάκαρ δοχεῖον τοῦ…
ltx/gr_gr_cog/me.m07.d14:meMA.Ode1C12.melody	@ltx/gr_gr_cog/he.h.m2:heHE.DefteLaoi.name
ltx/gr_gr_cog/me.m07.d14:meMA.Ode1C12.mode	@ltx/gr_gr_cog/miscellanea:misc.Mode2
ltx/gr_gr_cog/me.m07.d14:meMA.Ode1C12.ode	@ltx/gr_gr_cog/miscellanea:misc.Ode1
ltx/gr_gr_cog/me.m07.d14:meMA.Ode1C12.text	Ὅλον σαυτόν, Μάκαρ δοχεῖον τοῦ Πνεύματος, φωτοειδὲς ἐτέλεσας, καταστραπτόμενος, ταῖς αὐτοῦ φωταυγίαις· διὸ τοὺς ἐν τῷ σκότει, ἐφωταγώγησας.
ltx/gr_gr_cog/me.m07.d14:meMA.Ode1C13.incipit	Νόμοις Χριστοῦ, ὀχυρωθεὶς τὴν διάνοιαν…
ltx/gr_gr_cog/me.m07.d14:meMA.Ode1C13.melody	@ltx/gr_gr_cog/he.h.m2:heHE.DefteLaoi.name
ltx/gr_gr_cog/me.m07.d14:meMA.Ode1C13.mode	@ltx/gr_gr_cog/miscellanea:misc.Mode2
ltx/gr_gr_cog/me.m07.d14:meMA.Ode1C13.ode	@ltx/gr_gr_cog/miscellanea:misc.Ode1
ltx/gr_gr_cog/me.m07.d14:meMA.Ode1C13.text	Νόμοις Χριστοῦ, ὀχυρωθεὶς τὴν διάνοιαν, τὸ τῶν ἀνόμων φρύαγμα, ὅλον κατέλαβες, καὶ εἰδώλων τεμένη, κατέστρεψας ἀθλήσας θεομακάριστε.
ltx/gr_gr_cog/me.m07.d14:meMA.Ode1C14.incipit	Καθαρτικαῖς, σῶν πρεσβειῶν ἐπιδόσεσι, τὰ…
ltx/gr_gr_cog/me.m07.d14:meMA.Ode1C14.melody	@ltx/gr_gr_cog/he.h.m2:heHE.DefteLaoi.name
ltx/gr_gr_cog/me.m07.d14:meMA.Ode1C14.mode	@ltx/gr_gr_cog/miscellanea:misc.Mode2
ltx/gr_gr_cog/me.m07.d14:meMA.Ode1C14.ode	@ltx/gr_gr_cog/miscellanea:misc.Ode1
ltx/gr_gr_cog/me.m07.d14:meMA.Ode1C14.text	Καθαρτικαῖς, σῶν πρεσβειῶν ἐπιδόσεσι, τὰ τῶν σωμάτων Ἔνδοξε, καὶ τῶν ψυχῶν ἡμῶν, ἀποκάθαρον πάθη, πιστῶς ἐπιτελούντων, τὴν θείαν μνήμην σου.
ltx/gr_gr_cog/me.m07.d14:meMA.Ode1C1T.incipit	Λόγῳ σεμνή, Λόγον ἐν μήτρᾳ…
ltx/gr_gr_cog/me.m07.d14:meMA.Ode1C1T.melody	@ltx/gr_gr_cog/he.h.m2:heHE.DefteLaoi.name
ltx/gr_gr_cog/me.m07.d14:meMA.Ode1C1T.mode	@ltx/gr_gr_cog/miscellanea:misc.Mode2
ltx/gr_gr_cog/me.m07.d14:meMA.Ode1C1T.ode	@ltx/gr_gr_cog/miscellanea:misc.Ode1
ltx/gr_gr_cog/me.m07.d14:meMA.Ode1C1T.text	Λόγῳ σεμνή, Λόγον ἐν μήτρᾳ συνέλαβες, τὸν διὰ λόγου ἅπαντα, δημιουργήσαντα· διὰ τοῦτό σε λόγοις, ἐνθέοις ἀνυμνοῦμεν, θεοχαρίτωτε.
ltx/gr_gr_cog/me.m07.d14:meMA.Ode3C11.greekmelody	@ltx/gr_gr_cog/he.h.m2:heHE.StereosonImasEnSoiKyrie.greekname
ltx/gr_gr_cog/me.m07.d14:meMA.Ode3C11.incipit	Ἐπόθησας Θεὸν ὡς θέμις Ἔνδοξε…
ltx/gr_gr_cog/me.m07.d14:meMA.Ode3C11.melody	@ltx/gr_gr_cog/he.h.m2:heHE.StereosonImasEnSoiKyrie.name
ltx/gr_gr_cog/me.m07.d14:meMA.Ode3C11.mode	@ltx/gr_gr_cog/miscellanea:misc.Mode2
ltx/gr_gr_cog/me.m07.d14:meMA.Ode3C11.ode	@ltx/gr_gr_cog/miscellanea:misc.Ode3
ltx/gr_gr_cog/me.m07.d14:meMA.Ode3C11.text	Ἐπόθησας Θεὸν ὡς θέμις Ἔνδοξε, τὸν μόνον Δεσπότην καὶ Βασιλέα, καὶ αὐτοῦ τὸ θεῖον βούλημα, ἀδιστάκτῳ καρδίᾳ ἐξετέλεσας.
ltx/gr_gr_cog/me.m07.d14:meMA.Ode3C12.incipit	Ἰσχὺϊ τοῦ σεπτοῦ καὶ θείου…
ltx/gr_gr_cog/me.m07.d14:meMA.Ode3C12.melody	@ltx/gr_gr_cog/he.h.m2:heHE.StereosonImasEnSoiKyrie.name
ltx/gr_gr_cog/me.m07.d14:meMA.Ode3C12.mode	@ltx/gr_gr_cog/miscellanea:misc.Mode2
ltx/gr_gr_cog/me.m07.d14:meMA.Ode3C12.ode	@ltx/gr_gr_cog/miscellanea:misc.Ode3
ltx/gr_gr_cog/me.m07.d14:meMA.Ode3C12.text	Ἰσχὺϊ τοῦ σεπτοῦ καὶ θείου Πνεύματος, Ἀκύλα πανεύφημε τοῦ Βελίαρ, τὴν ἰσχὺν πᾶσαν κατέβαλες, ἐναθλήσας γενναίως ἱερώτατε.
ltx/gr_gr_cog/me.m07.d14:meMA.Ode3C13.incipit	Νοῒ σου καθαρῷ ἐνοπτριζόμενος, τὴν…
ltx/gr_gr_cog/me.m07.d14:meMA.Ode3C13.melody	@ltx/gr_gr_cog/he.h.m2:heHE.StereosonImasEnSoiKyrie.name
ltx/gr_gr_cog/me.m07.d14:meMA.Ode3C13.mode	@ltx/gr_gr_cog/miscellanea:misc.Mode2
ltx/gr_gr_cog/me.m07.d14:meMA.Ode3C13.ode	@ltx/gr_gr_cog/miscellanea:misc.Ode3
ltx/gr_gr_cog/me.m07.d14:meMA.Ode3C13.text	Νοῒ σου καθαρῷ ἐνοπτριζόμενος, τὴν δόξαν Κυρίου, ταύτης μετέσχες, τελεώτερον Μακάριε, μεταστὰς τῶν προσκαίρων πρὸς τὰ μένοντα.
ltx/gr_gr_cog/me.m07.d14:meMA.Ode3C1T.incipit	Ὁ μόνος καθαρός, ὁ μόνος…
ltx/gr_gr_cog/me.m07.d14:meMA.Ode3C1T.melody	@ltx/gr_gr_cog/he.h.m2:heHE.StereosonImasEnSoiKyrie.name
ltx/gr_gr_cog/me.m07.d14:meMA.Ode3C1T.mode	@ltx/gr_gr_cog/miscellanea:misc.Mode2
ltx/gr_gr_cog/me.m07.d14:meMA.Ode3C1T.ode	@ltx/gr_gr_cog/miscellanea:misc.Ode3
ltx/gr_gr_cog/me.m07.d14:meMA.Ode3C1T.text	Ὁ μόνος καθαρός, ὁ μόνος Κύριος, σὲ μόνην ὡς ἔγνω καθαρωτέραν, πάσης κτίσεως Πανάμωμε, ἐξ ἁγνῶν σου αἱμάτων σεσωμάτωται.
ltx/gr_gr_cog/me.m07.d14:meMA.Ode3H.greekmelody	@ltx/gr_gr_cog/he.h.m2:heHE.StereosonImasEnSoiKyrie.greekname
ltx/gr_gr_cog/me.m07.d14:meMA.Ode3H.incipit	@ltx/gr_gr_cog/he.h.m2:heHE.StereosonImasEnSoiKyrie.incipit
ltx/gr_gr_cog/me.m07.d14:meMA.Ode3H.melody	@ltx/gr_gr_cog/he.h.m2:heHE.StereosonImasEnSoiKyrie.melody
ltx/gr_gr_cog/me.m07.d14:meMA.Ode3H.mode	@ltx/gr_gr_cog/miscellanea:misc.Mode2
ltx/gr_gr_cog/me.m07.d14:meMA.Ode3H.ode	@ltx/gr_gr_cog/miscellanea:misc.Ode3
ltx/gr_gr_cog/me.m07.d14:meMA.Ode3H.text	@ltx/gr_gr_cog/he.h.m2:heHE.StereosonImasEnSoiKyrie.text
ltx/gr_gr_cog/me.m07.d14:meMA.Ode3Kathisma1.greekmelody	@ltx/gr_gr_cog/he.a.m4:heAU.TachyProkatalave.greekname
ltx/gr_gr_cog/me.m07.d14:meMA.Ode3Kathisma1.incipit	Τοῦ Παύλου τοῖς ῥήμασι, καταυγασθεὶς…
ltx/gr_gr_cog/me.m07.d14:meMA.Ode3Kathisma1.melody	@ltx/gr_gr_cog/he.a.m4:heAU.TachyProkatalave.name
ltx/gr_gr_cog/me.m07.d14:meMA.Ode3Kathisma1.mode	@ltx/gr_gr_cog/miscellanea:misc.Mode4
ltx/gr_gr_cog/me.m07.d14:meMA.Ode3Kathisma1.text	Τοῦ Παύλου τοῖς ῥήμασι, καταυγασθεὶς τὴν ψυχήν, ὡς ἥλιος ἔλαμψας, θεογνωσίας φωτί, Ἀκύλα μακάριε, στέφος δὲ μαρτυρίου, ἀνεπλέξω νομίμως· ὅθεν ἀναπηγάζεις, ποταμοὺς ἰαμάτων, τοῖς πίστει ἑορτάζουσι, μάκαρ τὴν μνήμην σου.
ltx/gr_gr_cog/me.m07.d14:meMA.Ode3KathismaSt.incipit	Σταυρῷ σε ὑψούμενον, ὡς ἐθεάσατο…
ltx/gr_gr_cog/me.m07.d14:meMA.Ode3KathismaSt.melody	@ltx/gr_gr_cog/he.a.m4:heAU.TachyProkatalave.name
ltx/gr_gr_cog/me.m07.d14:meMA.Ode3KathismaSt.mode	@ltx/gr_gr_cog/miscellanea:misc.Mode4
ltx/gr_gr_cog/me.m07.d14:meMA.Ode3KathismaSt.text	Σταυρῷ σε ὑψούμενον, ὡς ἐθεάσατο, ἡ ἄχραντος Μήτηρ σου, Λόγε Θεοῦ μητρικῶς, θρηνοῦσα ἐφθέγγετο· Τί τὸ καινὸν καὶ ξένον, τοῦτο θαῦμα Υἱέ μου; πῶς ἡ ζωὴ τῶν ὅλων, ὁμιλεῖς τῷ θανάτῳ; ζωῶσαι τοὺς τεθνεῶτας, θέλων ὡς εὔσπλαγχνος.
ltx/gr_gr_cog/me.m07.d14:meMA.Ode3KathismaT.incipit	Ταχὺ δέξαι Δέσποινα, τὰς ἱκεσίας…
ltx/gr_gr_cog/me.m07.d14:meMA.Ode3KathismaT.melody	@ltx/gr_gr_cog/he.a.m4:heAU.TachyProkatalave.name
ltx/gr_gr_cog/me.m07.d14:meMA.Ode3KathismaT.mode	@ltx/gr_gr_cog/miscellanea:misc.Mode4
ltx/gr_gr_cog/me.m07.d14:meMA.Ode3KathismaT.text	Ταχὺ δέξαι Δέσποινα, τὰς ἱκεσίας ἡμῶν, καὶ ταύτας προσάγαγε, τῷ σῷ Υἱῷ καὶ Θεῷ, Παρθένε πανάχραντε, ὄλεσον κατὰ κράτος, τῶν βαρβάρων τὰ θράση, γνώτωσαν τὴν ἰσχύν σου, φιλοπόλεμα ἔθνη, τῷ νεύματί σου πάντας ἡμᾶς διαφύλαξον.
ltx/gr_gr_cog/me.m07.d14:meMA.Ode4C11.greekmelody	@ltx/gr_gr_cog/he.h.m2:heHE.EisakikoaKyrieTinAkoin.greekname
ltx/gr_gr_cog/me.m07.d14:meMA.Ode4C11.incipit	Νυσταγμῷ τοὺς καθεύδοντας, τῆς πονηρᾶς,…
ltx/gr_gr_cog/me.m07.d14:meMA.Ode4C11.melody	@ltx/gr_gr_cog/he.h.m2:heHE.EisakikoaKyrieTinAkoin.name
ltx/gr_gr_cog/me.m07.d14:meMA.Ode4C11.mode	@ltx/gr_gr_cog/miscellanea:misc.Mode2
ltx/gr_gr_cog/me.m07.d14:meMA.Ode4C11.ode	@ltx/gr_gr_cog/miscellanea:misc.Ode4
ltx/gr_gr_cog/me.m07.d14:meMA.Ode4C11.text	Νυσταγμῷ τοὺς καθεύδοντας, τῆς πονηρᾶς,, Ἀκύλα δυσσεβείας πρὸς τῆς εὐσεβείας τὸ φῶς ἐξήγειρας.
ltx/gr_gr_cog/me.m07.d14:meMA.Ode4C12.incipit	Ὑπερήφανον φρύαγμα, τοῦ δυσμενοῦς, κατέβαλες…
ltx/gr_gr_cog/me.m07.d14:meMA.Ode4C12.melody	@ltx/gr_gr_cog/he.h.m2:heHE.EisakikoaKyrieTinAkoin.name
ltx/gr_gr_cog/me.m07.d14:meMA.Ode4C12.mode	@ltx/gr_gr_cog/miscellanea:misc.Mode2
ltx/gr_gr_cog/me.m07.d14:meMA.Ode4C12.ode	@ltx/gr_gr_cog/miscellanea:misc.Ode4
ltx/gr_gr_cog/me.m07.d14:meMA.Ode4C12.text	Ὑπερήφανον φρύαγμα, τοῦ δυσμενοῦς, κατέβαλες Ἀκύλα, ταπεινώσει θείᾳ θωρακιζόμενος.
ltx/gr_gr_cog/me.m07.d14:meMA.Ode4C13.incipit	Μακαρίως ἐνήθλησας, ὑπὲρ Χριστοῦ, τὸ…
ltx/gr_gr_cog/me.m07.d14:meMA.Ode4C13.melody	@ltx/gr_gr_cog/he.h.m2:heHE.EisakikoaKyrieTinAkoin.name
ltx/gr_gr_cog/me.m07.d14:meMA.Ode4C13.mode	@ltx/gr_gr_cog/miscellanea:misc.Mode2
ltx/gr_gr_cog/me.m07.d14:meMA.Ode4C13.ode	@ltx/gr_gr_cog/miscellanea:misc.Ode4
ltx/gr_gr_cog/me.m07.d14:meMA.Ode4C13.text	Μακαρίως ἐνήθλησας, ὑπὲρ Χριστοῦ, τὸ αἷμά σου κενώσας, Ἱερεῦ καὶ Μάρτυς τῶν παθημάτων αὐτοῦ.
ltx/gr_gr_cog/me.m07.d14:meMA.Ode4C1T.incipit	Νοητόν σε παλάτιον, καὶ ὑψηλόν…
ltx/gr_gr_cog/me.m07.d14:meMA.Ode4C1T.melody	@ltx/gr_gr_cog/he.h.m2:heHE.EisakikoaKyrieTinAkoin.name
ltx/gr_gr_cog/me.m07.d14:meMA.Ode4C1T.mode	@ltx/gr_gr_cog/miscellanea:misc.Mode2
ltx/gr_gr_cog/me.m07.d14:meMA.Ode4C1T.ode	@ltx/gr_gr_cog/miscellanea:misc.Ode4
ltx/gr_gr_cog/me.m07.d14:meMA.Ode4C1T.text	Νοητόν σε παλάτιον, καὶ ὑψηλόν, τοῦ Βασιλέως θρόνον, Θεοτόκε Δέσποινα ὀνομάζομεν.
ltx/gr_gr_cog/me.m07.d14:meMA.Ode5C11.greekmelody	@ltx/gr_gr_cog/he.h.m2:heHE.OTouFotosChorigos.greekname
ltx/gr_gr_cog/me.m07.d14:meMA.Ode5C11.incipit	Ἥδιστον λόγον ἀεί, ἀναπηγάζων εὐσεβῶς…
ltx/gr_gr_cog/me.m07.d14:meMA.Ode5C11.melody	@ltx/gr_gr_cog/he.h.m2:heHE.OTouFotosChorigos.name
ltx/gr_gr_cog/me.m07.d14:meMA.Ode5C11.mode	@ltx/gr_gr_cog/miscellanea:misc.Mode2
ltx/gr_gr_cog/me.m07.d14:meMA.Ode5C11.ode	@ltx/gr_gr_cog/miscellanea:misc.Ode5
ltx/gr_gr_cog/me.m07.d14:meMA.Ode5C11.text	Ἥδιστον λόγον ἀεί, ἀναπηγάζων εὐσεβῶς πάνσοφε τῶν ἐν πικρᾷ, πλάνῃ ὑπαχθέντων, ἐνήδυνας ψυχάς, ὡς ἱερομύστης, Ἀκύλα πανεύφημε.
ltx/gr_gr_cog/me.m07.d14:meMA.Ode5C12.incipit	Σοὶ τοὺς ἐπαίνους Λουκᾶς, ὁ…
ltx/gr_gr_cog/me.m07.d14:meMA.Ode5C12.melody	@ltx/gr_gr_cog/he.h.m2:heHE.OTouFotosChorigos.name
ltx/gr_gr_cog/me.m07.d14:meMA.Ode5C12.mode	@ltx/gr_gr_cog/miscellanea:misc.Mode2
ltx/gr_gr_cog/me.m07.d14:meMA.Ode5C12.ode	@ltx/gr_gr_cog/miscellanea:misc.Ode5
ltx/gr_gr_cog/me.m07.d14:meMA.Ode5C12.text	Σοὶ τοὺς ἐπαίνους Λουκᾶς, ὁ θεηγόρος ἀληθῶς ἔγραψε· τοῦ ἱεροῦ Παύλου μαθητὴς γάρ, καὶ θεῖος ξεναγός, ἐγένου τὰ θεῖα, σοφῶς παιδευόμενος.
ltx/gr_gr_cog/me.m07.d14:meMA.Ode5C13.incipit	Ὥσπερ ἀστέρα φαιδρόν, φωτοβολοῦντα τὸ…
ltx/gr_gr_cog/me.m07.d14:meMA.Ode5C13.melody	@ltx/gr_gr_cog/he.h.m2:heHE.OTouFotosChorigos.name
ltx/gr_gr_cog/me.m07.d14:meMA.Ode5C13.mode	@ltx/gr_gr_cog/miscellanea:misc.Mode2
ltx/gr_gr_cog/me.m07.d14:meMA.Ode5C13.ode	@ltx/gr_gr_cog/miscellanea:misc.Ode5
ltx/gr_gr_cog/me.m07.d14:meMA.Ode5C13.text	Ὥσπερ ἀστέρα φαιδρόν, φωτοβολοῦντα τὸ σεπτὸν κήρυγμα, τὸν ἱερὸν εὑράμενος Παῦλον, πρὸς τούτου τὰς αὐγάς, ἐδέξω τοῦ Λόγου, στεῤῥῶς λαμπρυνόμενος.
ltx/gr_gr_cog/me.m07.d14:meMA.Ode5C1T.incipit	Μήτηρ καὶ δούλη Χριστοῦ, τοῦ…
ltx/gr_gr_cog/me.m07.d14:meMA.Ode5C1T.melody	@ltx/gr_gr_cog/he.h.m2:heHE.OTouFotosChorigos.name
ltx/gr_gr_cog/me.m07.d14:meMA.Ode5C1T.mode	@ltx/gr_gr_cog/miscellanea:misc.Mode2
ltx/gr_gr_cog/me.m07.d14:meMA.Ode5C1T.ode	@ltx/gr_gr_cog/miscellanea:misc.Ode5
ltx/gr_gr_cog/me.m07.d14:meMA.Ode5C1T.text	Μήτηρ καὶ δούλη Χριστοῦ, τοῦ σαρκωθέντος διʼ ἡμᾶς γέγονας, ὃν ἐκτενῶς, πάντοτε δυσώπει, τοῦ σῴζεσθαι ἡμᾶς, τοὺς σὲ Θεοτόκον ἁγνὴν ὀνομάζοντας.
ltx/gr_gr_cog/me.m07.d14:meMA.Ode6C11.greekmelody	@ltx/gr_gr_cog/he.h.m2:heHE.EnAvyssoPtaismaton.greekname
ltx/gr_gr_cog/me.m07.d14:meMA.Ode6C11.incipit	Ἐξεχύθη σου χάρις τοῖς χείλεσι…
ltx/gr_gr_cog/me.m07.d14:meMA.Ode6C11.melody	@ltx/gr_gr_cog/he.h.m2:heHE.EnAvyssoPtaismaton.name
ltx/gr_gr_cog/me.m07.d14:meMA.Ode6C11.mode	@ltx/gr_gr_cog/miscellanea:misc.Mode2
ltx/gr_gr_cog/me.m07.d14:meMA.Ode6C11.ode	@ltx/gr_gr_cog/miscellanea:misc.Ode6
ltx/gr_gr_cog/me.m07.d14:meMA.Ode6C11.text	Ἐξεχύθη σου χάρις τοῖς χείλεσι, μάκαρ ἱερώτατε καὶ σὲ εὐλόγησεν, ὁ τῶν ἁπάντων Κύριος, εἰς αἰῶνας Ἀκύλα θεόπνευστε.
ltx/gr_gr_cog/me.m07.d14:meMA.Ode6C12.incipit	Νοσημάτων παντοίων ἀλέξημα, καὶ ἁμαρτανόντων…
ltx/gr_gr_cog/me.m07.d14:meMA.Ode6C12.melody	@ltx/gr_gr_cog/he.h.m2:heHE.EnAvyssoPtaismaton.name
ltx/gr_gr_cog/me.m07.d14:meMA.Ode6C12.mode	@ltx/gr_gr_cog/miscellanea:misc.Mode2
ltx/gr_gr_cog/me.m07.d14:meMA.Ode6C12.ode	@ltx/gr_gr_cog/miscellanea:misc.Ode6
ltx/gr_gr_cog/me.m07.d14:meMA.Ode6C12.text	Νοσημάτων παντοίων ἀλέξημα, καὶ ἁμαρτανόντων ψυχῶν ἱλαστήριον, ἡ σὴ πρεσβεία πέφυκε, θεοφόρε Ἀκύλα μακάριε.
ltx/gr_gr_cog/me.m07.d14:meMA.Ode6C13.incipit	Αἱ πορεῖαί σου θείως τελούμεναι…
ltx/gr_gr_cog/me.m07.d14:meMA.Ode6C13.melody	@ltx/gr_gr_cog/he.h.m2:heHE.EnAvyssoPtaismaton.name
ltx/gr_gr_cog/me.m07.d14:meMA.Ode6C13.mode	@ltx/gr_gr_cog/miscellanea:misc.Mode2
ltx/gr_gr_cog/me.m07.d14:meMA.Ode6C13.ode	@ltx/gr_gr_cog/miscellanea:misc.Ode6
ltx/gr_gr_cog/me.m07.d14:meMA.Ode6C13.text	Αἱ πορεῖαί σου θείως τελούμεναι, καὶ πρὸς τὰς ὁδοὺς τοῦ Θεοῦ εὐθυνόμεναι, τοῖς πλανωμένοις ὤφθησαν, ὁδηγία καὶ τρίβος σωτήριος.
ltx/gr_gr_cog/me.m07.d14:meMA.Ode6C1T.incipit	Κυριώνυμε Κόρη πανάμωμε, τὸν ἀγαθοδότην…
ltx/gr_gr_cog/me.m07.d14:meMA.Ode6C1T.melody	@ltx/gr_gr_cog/he.h.m2:heHE.EnAvyssoPtaismaton.name
ltx/gr_gr_cog/me.m07.d14:meMA.Ode6C1T.mode	@ltx/gr_gr_cog/miscellanea:misc.Mode2
ltx/gr_gr_cog/me.m07.d14:meMA.Ode6C1T.ode	@ltx/gr_gr_cog/miscellanea:misc.Ode6
ltx/gr_gr_cog/me.m07.d14:meMA.Ode6C1T.text	Κυριώνυμε Κόρη πανάμωμε, τὸν ἀγαθοδότην Θεὸν ἡ κυήσασα, τοὺς σὲ ὑμνοῦντας πάντοτε, πειρασμῶν πολυτρόπων διάσωσον.
ltx/gr_gr_cog/me.m07.d14:meMA.Ode6H.greekmelody	@ltx/gr_gr_cog/he.h.m2:heHE.EnAvyssoPtaismaton.greekname
ltx/gr_gr_cog/me.m07.d14:meMA.Ode6H.incipit	@ltx/gr_gr_cog/he.h.m2:heHE.EnAvyssoPtaismaton.incipit
ltx/gr_gr_cog/me.m07.d14:meMA.Ode6H.melody	@ltx/gr_gr_cog/he.h.m2:heHE.EnAvyssoPtaismaton.melody
ltx/gr_gr_cog/me.m07.d14:meMA.Ode6H.mode	@ltx/gr_gr_cog/miscellanea:misc.Mode2
ltx/gr_gr_cog/me.m07.d14:meMA.Ode6H.ode	@ltx/gr_gr_cog/miscellanea:misc.Ode6
ltx/gr_gr_cog/me.m07.d14:meMA.Ode6H.text	@ltx/gr_gr_cog/he.h.m2:heHE.EnAvyssoPtaismaton.text
ltx/gr_gr_cog/me.m07.d14:meMA.Ode7C11.greekmelody	@ltx/gr_gr_cog/he.h.m2:heHE.EikonosChrysis.greekname
ltx/gr_gr_cog/me.m07.d14:meMA.Ode7C11.incipit	Ὑφάνας σαυτῷ, ἀφθαρσίας στολισμὸν τῷ…
ltx/gr_gr_cog/me.m07.d14:meMA.Ode7C11.melody	@ltx/gr_gr_cog/he.h.m2:heHE.EikonosChrysis.name
ltx/gr_gr_cog/me.m07.d14:meMA.Ode7C11.mode	@ltx/gr_gr_cog/miscellanea:misc.Mode2
ltx/gr_gr_cog/me.m07.d14:meMA.Ode7C11.ode	@ltx/gr_gr_cog/miscellanea:misc.Ode7
ltx/gr_gr_cog/me.m07.d14:meMA.Ode7C11.text	Ὑφάνας σαυτῷ, ἀφθαρσίας στολισμὸν τῷ θείῳ Πνεύματι, ὅλος ὡραῖος ἐχρημάτισας, καὶ τὸν ἐχθρὸν ἀπεγύμνωσας, καὶ τοὺς ἐπʼ ἐκείνου Ἀκύλα, γυμνωθέντες ἐνέδυσας, καταστολὴν φωτοειδῆ, καὶ φῶς σωτήριον.
ltx/gr_gr_cog/me.m07.d14:meMA.Ode7C12.incipit	Λιμῷ νοητῷ, κρατουμένους τοὺς λαοὺς…
ltx/gr_gr_cog/me.m07.d14:meMA.Ode7C12.melody	@ltx/gr_gr_cog/he.h.m2:heHE.EikonosChrysis.name
ltx/gr_gr_cog/me.m07.d14:meMA.Ode7C12.mode	@ltx/gr_gr_cog/miscellanea:misc.Mode2
ltx/gr_gr_cog/me.m07.d14:meMA.Ode7C12.ode	@ltx/gr_gr_cog/miscellanea:misc.Ode7
ltx/gr_gr_cog/me.m07.d14:meMA.Ode7C12.text	Λιμῷ νοητῷ, κρατουμένους τοὺς λαοὺς καὶ κινδυνεύοντας, ἄρτῳ τῶν λόγων Ἀξιάγαστε, τῆς σῆς σοφίας διέθρεψας, καὶ τῆς οὐρανίου τραπέζης, κοινωνοὺς ἀπετέλεσας, ἱερομύστης πεφυκὼς θεοειδέστατος.
ltx/gr_gr_cog/me.m07.d14:meMA.Ode7C13.incipit	Ἁγίῳ ναῷ οἱ προστρέχοντες τῷ…
ltx/gr_gr_cog/me.m07.d14:meMA.Ode7C13.melody	@ltx/gr_gr_cog/he.h.m2:heHE.EikonosChrysis.name
ltx/gr_gr_cog/me.m07.d14:meMA.Ode7C13.mode	@ltx/gr_gr_cog/miscellanea:misc.Mode2
ltx/gr_gr_cog/me.m07.d14:meMA.Ode7C13.ode	@ltx/gr_gr_cog/miscellanea:misc.Ode7
ltx/gr_gr_cog/me.m07.d14:meMA.Ode7C13.text	Ἁγίῳ ναῷ οἱ προστρέχοντες τῷ σῷ, ῥῶσιν κομίζονται, καὶ παθημάτων ἀπολύονται, καὶ νοσημάτων καθαίρονται, ἀνυμνολογοῦντές σε πόθῳ, καὶ βοῶντες πανεύφημε· Εὐλογητὸς εἶ ὁ Θεὸς ὁ τῶν Πατέρων ἡμῶν.
ltx/gr_gr_cog/me.m07.d14:meMA.Ode7C1T.incipit	Νεκροῦται τὸ πρίν, ὁ Ἀδὰμ…
ltx/gr_gr_cog/me.m07.d14:meMA.Ode7C1T.melody	@ltx/gr_gr_cog/he.h.m2:heHE.EikonosChrysis.name
ltx/gr_gr_cog/me.m07.d14:meMA.Ode7C1T.mode	@ltx/gr_gr_cog/miscellanea:misc.Mode2
ltx/gr_gr_cog/me.m07.d14:meMA.Ode7C1T.ode	@ltx/gr_gr_cog/miscellanea:misc.Ode7
ltx/gr_gr_cog/me.m07.d14:meMA.Ode7C1T.text	Νεκροῦται τὸ πρίν, ὁ Ἀδὰμ φθοροποιῷ βρώσει πανάμωμε, σὺ δὲ τεκοῦσα τὴν ζωὴν ἡμῶν, τοῦτον Παρθένε ἐζώωσας· ὅθεν ὡς καλῶν σε αἰτίαν, ἀνυμνοῦντες κραυγάζομεν· Εὐλογημένη ἡ Θεὸν σαρκὶ κυήσασα.
ltx/gr_gr_cog/me.m07.d14:meMA.Ode8C11.greekmelody	@ltx/gr_gr_cog/he.h.m2:heHE.TonEnKaminoTouPyros.greekname
ltx/gr_gr_cog/me.m07.d14:meMA.Ode8C11.incipit	Περιχαρῶς τοὺς οὐρανούς, σὺν τοῖς…
ltx/gr_gr_cog/me.m07.d14:meMA.Ode8C11.melody	@ltx/gr_gr_cog/he.h.m2:heHE.TonEnKaminoTouPyros.name
ltx/gr_gr_cog/me.m07.d14:meMA.Ode8C11.mode	@ltx/gr_gr_cog/miscellanea:misc.Mode2
ltx/gr_gr_cog/me.m07.d14:meMA.Ode8C11.ode	@ltx/gr_gr_cog/miscellanea:misc.Ode8
ltx/gr_gr_cog/me.m07.d14:meMA.Ode8C11.text	Περιχαρῶς τοὺς οὐρανούς, σὺν τοῖς θείοις μαθηταῖς καὶ ὑπηρέταις, καὶ αὐτόπταις τοῦ Λόγου, χαρμονικῶς κατοικῶν, Ἀκύλα καὶ θέσει θεούμενος, μέμνησο τῶν πίστει, καὶ πόθῳ σε τιμώντων.
ltx/gr_gr_cog/me.m07.d14:meMA.Ode8C12.incipit	Οἱ τῶν ἱδρώτων σου κρουνοί…
ltx/gr_gr_cog/me.m07.d14:meMA.Ode8C12.melody	@ltx/gr_gr_cog/he.h.m2:heHE.TonEnKaminoTouPyros.name
ltx/gr_gr_cog/me.m07.d14:meMA.Ode8C12.mode	@ltx/gr_gr_cog/miscellanea:misc.Mode2
ltx/gr_gr_cog/me.m07.d14:meMA.Ode8C12.ode	@ltx/gr_gr_cog/miscellanea:misc.Ode8
ltx/gr_gr_cog/me.m07.d14:meMA.Ode8C12.text	Οἱ τῶν ἱδρώτων σου κρουνοί, ποταμοὺς πᾶσιν ὑμῖν θείων θαυμάτων, ἀναβλύζουσι Μάκαρ, καὶ ἐπηρείας παθῶν, ἀτόπων ξηραίνουσι πάντοτε, καὶ τὰς παρατάξεις, βυθίζουσι τοῦ πλάνου.
ltx/gr_gr_cog/me.m07.d14:meMA.Ode8C13.incipit	Θέσει θεούμενος ἀεί, ὁ ἐγγίζων…
ltx/gr_gr_cog/me.m07.d14:meMA.Ode8C13.melody	@ltx/gr_gr_cog/he.h.m2:heHE.TonEnKaminoTouPyros.name
ltx/gr_gr_cog/me.m07.d14:meMA.Ode8C13.mode	@ltx/gr_gr_cog/miscellanea:misc.Mode2
ltx/gr_gr_cog/me.m07.d14:meMA.Ode8C13.ode	@ltx/gr_gr_cog/miscellanea:misc.Ode8
ltx/gr_gr_cog/me.m07.d14:meMA.Ode8C13.text	Θέσει θεούμενος ἀεί, ὁ ἐγγίζων τῷ Θεῷ νοῒ ἀΰλῳ, ὅλος φῶς χρηματίζεις, ἀπολυθεὶς τῆς σαρκός, καὶ βλέπεις ἃ βλέπουσιν Ἄγγελοι, ἔνδοξε Ἀκύλα, Χριστοῦ ἱερομύστα.
ltx/gr_gr_cog/me.m07.d14:meMA.Ode8C1T.incipit	Ὡς τὸν παναίτιον Θεόν, ὑπὲρ…
ltx/gr_gr_cog/me.m07.d14:meMA.Ode8C1T.melody	@ltx/gr_gr_cog/he.h.m2:heHE.TonEnKaminoTouPyros.name
ltx/gr_gr_cog/me.m07.d14:meMA.Ode8C1T.mode	@ltx/gr_gr_cog/miscellanea:misc.Mode2
ltx/gr_gr_cog/me.m07.d14:meMA.Ode8C1T.ode	@ltx/gr_gr_cog/miscellanea:misc.Ode8
ltx/gr_gr_cog/me.m07.d14:meMA.Ode8C1T.text	Ὡς τὸν παναίτιον Θεόν, ὑπὲρ πᾶσαν ἀληθῶς Ἁγνὴ αἰτίαν, ἐν γαστρὶ συλλαβοῦσα, καὶ διʼ ἡμᾶς καθʼ ἡμᾶς, ὀφθέντα τεκοῦσα πανάμωμε, τοῦτον ἐκδυσώπει, ὑπὲρ τῶν σὲ ὑμνούντων.
ltx/gr_gr_cog/me.m07.d14:meMA.Ode8H.greekmelody	@ltx/gr_gr_cog/he.h.m2:heHE.TonEnKaminoTouPyros.greekname
ltx/gr_gr_cog/me.m07.d14:meMA.Ode8H.incipit	@ltx/gr_gr_cog/he.h.m2:heHE.TonEnKaminoTouPyros.incipit
ltx/gr_gr_cog/me.m07.d14:meMA.Ode8H.melody	@ltx/gr_gr_cog/he.h.m2:heHE.TonEnKaminoTouPyros.melody
ltx/gr_gr_cog/me.m07.d14:meMA.Ode8H.mode	@ltx/gr_gr_cog/miscellanea:misc.Mode2
ltx/gr_gr_cog/me.m07.d14:meMA.Ode8H.ode	@ltx/gr_gr_cog/miscellanea:misc.Ode8
ltx/gr_gr_cog/me.m07.d14:meMA.Ode8H.text	@ltx/gr_gr_cog/he.h.m2:heHE.TonEnKaminoTouPyros.text
ltx/gr_gr_cog/me.m07.d14:meMA.Ode9C11.greekmelody	@ltx/gr_gr_cog/he.h.m2:heHE.TonEkTheouTheonLogon.greekname
ltx/gr_gr_cog/me.m07.d14:meMA.Ode9C11.incipit	Ἱερωτάτοις σε ὕμνοις, ἱερὸν πεφυκότα…
ltx/gr_gr_cog/me.m07.d14:meMA.Ode9C11.melody	@ltx/gr_gr_cog/he.h.m2:heHE.TonEkTheouTheonLogon.name
ltx/gr_gr_cog/me.m07.d14:meMA.Ode9C11.mode	@ltx/gr_gr_cog/miscellanea:misc.Mode2
ltx/gr_gr_cog/me.m07.d14:meMA.Ode9C11.ode	@ltx/gr_gr_cog/miscellanea:misc.Ode9
ltx/gr_gr_cog/me.m07.d14:meMA.Ode9C11.text	Ἱερωτάτοις σε ὕμνοις, ἱερὸν πεφυκότα, κειμήλιον τοῦ Λόγου καὶ σεπτόν, τούτου τε πάνσοφον κήρυκα, καὶ τοῦ κόσμου φωστῆρα, καὶ στήριγμα τῆς πίστεως ἡμῶν, συνελθόντες Ἀκύλα, συμφώνως μακαρίζομεν.
ltx/gr_gr_cog/me.m07.d14:meMA.Ode9C12.incipit	Ὡς καθαιρέτης τῆς πλάνης, καὶ…
ltx/gr_gr_cog/me.m07.d14:meMA.Ode9C12.melody	@ltx/gr_gr_cog/he.h.m2:heHE.TonEkTheouTheonLogon.name
ltx/gr_gr_cog/me.m07.d14:meMA.Ode9C12.mode	@ltx/gr_gr_cog/miscellanea:misc.Mode2
ltx/gr_gr_cog/me.m07.d14:meMA.Ode9C12.ode	@ltx/gr_gr_cog/miscellanea:misc.Ode9
ltx/gr_gr_cog/me.m07.d14:meMA.Ode9C12.text	Ὡς καθαιρέτης τῆς πλάνης, καὶ ἐθνῶν ποδηγέτης, καὶ θεῖος τοῦ Σωτῆρος ἀθλητής, καὶ συμπολίτης καὶ σύσκηνος, τῶν Ἁγίων Ἀγγέλων, Ἀκύλα θεηγόρε σὺν αὐτοῖς, τὸν Δεσπότην δυσώπει, σωθῆναι τὰς ψυχὰς ἡμῶν.
ltx/gr_gr_cog/me.m07.d14:meMA.Ode9C13.incipit	Σὲ φοιτητὴν μὲν τοῦ Παύλου…
ltx/gr_gr_cog/me.m07.d14:meMA.Ode9C13.melody	@ltx/gr_gr_cog/he.h.m2:heHE.TonEkTheouTheonLogon.name
ltx/gr_gr_cog/me.m07.d14:meMA.Ode9C13.mode	@ltx/gr_gr_cog/miscellanea:misc.Mode2
ltx/gr_gr_cog/me.m07.d14:meMA.Ode9C13.ode	@ltx/gr_gr_cog/miscellanea:misc.Ode9
ltx/gr_gr_cog/me.m07.d14:meMA.Ode9C13.text	Σὲ φοιτητὴν μὲν τοῦ Παύλου, ἐπιγνόντες Ἀκύλα, τοῦ κόσμου δὲ φωστῆρα ἀπλανῆ, καὶ ἱερώτατον Μάρτυρα, καθαιρέτην εἰδώλων, καὶ γνώσεως Θεοῦ εἰσηγητήν, εὐσεβεῖ διανοίᾳ, θεόφρον μακαρίζομεν.
ltx/gr_gr_cog/me.m07.d14:meMA.Ode9C14.incipit	Ἡ παναγία σου μνήμη, ἀνατείλασα…
ltx/gr_gr_cog/me.m07.d14:meMA.Ode9C14.melody	@ltx/gr_gr_cog/he.h.m2:heHE.TonEkTheouTheonLogon.name
ltx/gr_gr_cog/me.m07.d14:meMA.Ode9C14.mode	@ltx/gr_gr_cog/miscellanea:misc.Mode2
ltx/gr_gr_cog/me.m07.d14:meMA.Ode9C14.ode	@ltx/gr_gr_cog/miscellanea:misc.Ode9
ltx/gr_gr_cog/me.m07.d14:meMA.Ode9C14.text	Ἡ παναγία σου μνήμη, ἀνατείλασα κόσμῳ, ὡς ἥλιος φωτίζει τὰς ψυχάς, τῶν εὐσεβῶς εὐφημούντων σε, ἐν ᾗ πρέσβευε Μάκαρ, δοθῆναι ἱλασμὸν ἁμαρτιῶν, καὶ εἰρήνην βαθεῖαν, καὶ μέγα πᾶσιν ἔλεος.
ltx/gr_gr_cog/me.m07.d14:meMA.Ode9C1T.incipit	Φωτιστικήν σε λυχνίαν, προεώρα Προφήτης…
ltx/gr_gr_cog/me.m07.d14:meMA.Ode9C1T.melody	@ltx/gr_gr_cog/he.h.m2:heHE.TonEkTheouTheonLogon.name
ltx/gr_gr_cog/me.m07.d14:meMA.Ode9C1T.mode	@ltx/gr_gr_cog/miscellanea:misc.Mode2
ltx/gr_gr_cog/me.m07.d14:meMA.Ode9C1T.ode	@ltx/gr_gr_cog/miscellanea:misc.Ode9
ltx/gr_gr_cog/me.m07.d14:meMA.Ode9C1T.text	Φωτιστικήν σε λυχνίαν, προεώρα Προφήτης, τὸ φῶς τὸ ἀνατεῖλαν ἐκ φωτός, Παρθενομῆτορ βαστάζουσαν, τὸ φωτίσαν πλουσίως, τὰ πρὶν ἐσκοτισμένα ταῖς αὐγαῖς, τῆς αὐτοῦ ἀνεκφράστου, πανάμωμε Θεότητος.
ltx/gr_gr_cog/me.m07.d14:meMA.Ode9H.greekmelody	@ltx/gr_gr_cog/he.h.m2:heHE.TonEkTheouTheonLogon.greekname
ltx/gr_gr_cog/me.m07.d14:meMA.Ode9H.incipit	@ltx/gr_gr_cog/he.h.m2:heHE.TonEkTheouTheonLogon.incipit
ltx/gr_gr_cog/me.m07.d14:meMA.Ode9H.melody	@ltx/gr_gr_cog/he.h.m2:heHE.TonEkTheouTheonLogon.melody
ltx/gr_gr_cog/me.m07.d14:meMA.Ode9H.mode	@ltx/gr_gr_cog/miscellanea:misc.Mode2
ltx/gr_gr_cog/me.m07.d14:meMA.Ode9H.ode	@ltx/gr_gr_cog/miscellanea:misc.Ode9
ltx/gr_gr_cog/me.m07.d14:meMA.Ode9H.text	@ltx/gr_gr_cog/he.h.m2:heHE.TonEkTheouTheonLogon.text
ltx/gr_gr_cog/me.m07.d14:meVE.Apolytikion1ger.greekmelody	@ltx/gr_gr_cog/he.a.m1:heAU.ChorosAngelikos.greekname
ltx/gr_gr_cog/me.m07.d14:meVE.Apolytikion1ger.incipit	Τοῦ Παύλου μαθητής, καὶ συνέκδημος…
ltx/gr_gr_cog/me.m07.d14:meVE.Apolytikion1ger.melody	@ltx/gr_gr_cog/he.a.m1:heAU.ChorosAngelikos.name
ltx/gr_gr_cog/me.m07.d14:meVE.Apolytikion1ger.mode	@ltx/gr_gr_cog/miscellanea:misc.Mode1
ltx/gr_gr_cog/me.m07.d14:meVE.Apolytikion1ger.poet	@ltx/gr_gr_cog/poets:po.Gerasimou
ltx/gr_gr_cog/me.m07.d14:meVE.Apolytikion1ger.text	Τοῦ Παύλου μαθητής, καὶ συνέκδημος ὤφθης, δεχθεὶς ἐν τῇ ψυχῇ, τὸν τῆς χάριτος λόγον, Ἀκύλα Ἀπόστολε, τοῦ Σωτῆρος δίακονε· ὅθεν ηὔγασας, τοὺς ἐν νυκτὶ τῆς ἀπάτης, καὶ ἠγώνισαι, ὑπὲρ τῆς δόξης Κυρίου· διὸ εὐφημοῦμέν σε.
ltx/gr_gr_cog/me.m07.d14:meVE.GeneralApolytikion1.name	Ἀκύλα,
ltx/gr_gr_cog/me.m07.d14:meVE.SticStavrotheotokion.greekmelody	@ltx/gr_gr_cog/he.a.m1:heAU.TonOuranionTagmaton.greekname
ltx/gr_gr_cog/me.m07.d14:meVE.SticStavrotheotokion.incipit	@ltx/gr_gr_cog/me.m01.d23:meVE.AposStavrotheotokion.incipit
ltx/gr_gr_cog/me.m07.d14:meVE.SticStavrotheotokion.melody	@ltx/gr_gr_cog/he.a.m1:heAU.TonOuranionTagmaton.name
ltx/gr_gr_cog/me.m07.d14:meVE.SticStavrotheotokion.mode	@ltx/gr_gr_cog/miscellanea:misc.Mode1
ltx/gr_gr_cog/me.m07.d14:meVE.SticStavrotheotokion.text	@ltx/gr_gr_cog/me.m01.d23:meVE.AposStavrotheotokion.text
ltx/gr_gr_cog/me.m07.d14:meVE.SticTheotokion.greekmelody	@ltx/gr_gr_cog/he.a.m1:heAU.TonOuranionTagmaton.greekname
ltx/gr_gr_cog/me.m07.d14:meVE.SticTheotokion.incipit	Θεομακάριστε Κόρη τὰς ἱκεσίας ἡμῶν…
ltx/gr_gr_cog/me.m07.d14:meVE.SticTheotokion.melody	@ltx/gr_gr_cog/he.a.m1:heAU.TonOuranionTagmaton.name
ltx/gr_gr_cog/me.m07.d14:meVE.SticTheotokion.mode	@ltx/gr_gr_cog/miscellanea:misc.Mode1
ltx/gr_gr_cog/me.m07.d14:meVE.SticTheotokion.text	Θεομακάριστε Κόρη τὰς ἱκεσίας ἡμῶν, ὡς εὐμενὴς προστάτις, τῶν πιστῶν Θεοτόκε, προσάγουσα τῷ Κτίστῃ τὸν ἱλασμόν, διαμείβου τοῖς δούλοις σου, ὡς παντελὴς σωτηρία καὶ ἱλασμός, τῶν ψυχῶν ἡμῶν πανάμωμε.
ltx/gr_gr_cog/me.m07.d14:meVE.Stichera01.greekmelody	@ltx/gr_gr_cog/he.a.m1:heAU.TonOuranionTagmaton.greekname
ltx/gr_gr_cog/me.m07.d14:meVE.Stichera01.incipit	Παῦλος ὁ μέγας θεόφρον, τοῦ…
ltx/gr_gr_cog/me.m07.d14:meVE.Stichera01.melody	@ltx/gr_gr_cog/he.a.m1:heAU.TonOuranionTagmaton.name
ltx/gr_gr_cog/me.m07.d14:meVE.Stichera01.mode	@ltx/gr_gr_cog/miscellanea:misc.Mode1
ltx/gr_gr_cog/me.m07.d14:meVE.Stichera01.text	Παῦλος ὁ μέγας θεόφρον, τοῦ κόσμου ἥλιος, ὥσπερ φαιδρὰν ἀκτῖνα, εἰς τὴν σύμπασαν κτίσιν, σὲ μάκαρ ἐπαφῆκε, φωτιστικαῖς, σοῦ, τῶν λόγων λαμπρότησι, καταφωτίζειν τοὺς πάλαι ἐν τῇ νυκτί, τῆς ἀγνωσίας κινδυνεύοντας.
ltx/gr_gr_cog/me.m07.d14:meVE.Stichera02.incipit	Ἡ καθαρά σου καρδίας, τοῦ…
ltx/gr_gr_cog/me.m07.d14:meVE.Stichera02.melody	@ltx/gr_gr_cog/he.a.m1:heAU.TonOuranionTagmaton.name
ltx/gr_gr_cog/me.m07.d14:meVE.Stichera02.mode	@ltx/gr_gr_cog/miscellanea:misc.Mode1
ltx/gr_gr_cog/me.m07.d14:meVE.Stichera02.text	Ἡ καθαρά σου καρδίας, τοῦ θείου Πνεύματος, φωτιστικαῖς ἀκτῖσιν, αὐγασθείσης πλουσίως, Ἀκύλα θεηγόρε, φωτοειδής, ἀληθῶς ἐχρημάτισας, καὶ τῶν Ἑλλήνων τὸ σκότος τὸ χαλεπόν, θείᾳ χάριτι διέλυσας.
ltx/gr_gr_cog/me.m07.d14:meVE.Stichera03.incipit	Οἱ τῷ ναῷ σου τῷ…
ltx/gr_gr_cog/me.m07.d14:meVE.Stichera03.melody	@ltx/gr_gr_cog/he.a.m1:heAU.TonOuranionTagmaton.name
ltx/gr_gr_cog/me.m07.d14:meVE.Stichera03.mode	@ltx/gr_gr_cog/miscellanea:misc.Mode1
ltx/gr_gr_cog/me.m07.d14:meVE.Stichera03.text	Οἱ τῷ ναῷ σου τῷ θείῳ πίστει προστρέχοντες, καὶ ἐν αὐτῷ σε μάκαρ, δυσωποῦντες Ἀκύλα, λυτροῦνται νοσημάτων παντοδαπῶν, καὶ κινδύνων καὶ θλίψεων, ταῖς ἱεραῖς σου πρεσβείαις καὶ πρὸς Θεόν, μεσιτείαις ἱερώτατε.
