ltx/gr_gr_cog/le.ep.mc.d167:lemcLI.Epistle.book_abbr	@ltx/gr_gr_cog/bible:Corinthians1.abbr
ltx/gr_gr_cog/le.ep.mc.d167:lemcLI.Epistle.book_string	@ltx/gr_gr_cog/bible:Corinthians1.text
ltx/gr_gr_cog/le.ep.mc.d167:lemcLI.Epistle.chapverse	7:35 – 40; 8:1 – 7
ltx/gr_gr_cog/le.ep.mc.d167:lemcLI.Epistle.incipit	Πρὸς τὸ ὑμῶν αὐτῶν συμφέρον λέγω…
ltx/gr_gr_cog/le.ep.mc.d167:lemcLI.Epistle.text	Ἀδελφοί, πρὸς τὸ ὑμῶν αὐτῶν συμφέρον λέγω, οὐχ ἵνα βρόχον ὑμῖν ἐπιβάλω, ἀλλὰ πρὸς τὸ εὔσχημον καὶ εὐπάρεδρον τῷ Κυρίῳ ἀπερισπάστως. Εἰ δέ τις ἀσχημονεῖν ἐπὶ τὴν παρθένον αὐτοῦ νομίζει, ἐὰν ᾖ ὑπέρακμος, καὶ οὕτως ὀφείλει γίνεσθαι ὃ θέλει ποιείτω· οὐχ ἁμαρτάνει· γαμείτωσαν. ὃς δὲ ἕστηκεν ἑδραῖος ἐν τῇ καρδίᾳ, μὴ ἔχων ἀνάγκην, ἐξουσίαν δὲ ἔχει περὶ τοῦ ἰδίου θελήματος, καὶ τοῦτο κέκρικεν ἐν τῇ καρδίᾳ αὐτοῦ, τοῦ τηρεῖν τὴν ἑαυτοῦ παρθένον, καλῶς ποιεῖ. ὥστε καὶ ὁ ἐκγαμίζων καλῶς ποιεῖ, ὁ δὲ μὴ ἐκγαμίζων κρεῖσσον ποιεῖ. Γυνὴ δέδεται νόμῳ ἐφ᾿ ὅσον χρόνον ζῇ ὁ ἀνὴρ αὐτῆς· ἐὰν δὲ κοιμηθῇ ὁ ἀνὴρ αὐτῆς, ἐλευθέρα ἐστὶν ᾧ θέλει γαμηθῆναι, μόνον ἐν Κυρίῳ. μακαριωτέρα δέ ἐστιν ἐὰν οὕτω μείνῃ, κατὰ τὴν ἐμὴν γνώμην· δοκῶ δὲ κἀγὼ Πνεῦμα Θεοῦ ἔχειν. Περὶ δὲ τῶν εἰδωλοθύτων, οἴδαμεν ὅτι πάντες γνῶσιν ἔχομεν. ἡ γνῶσις φυσιοῖ, ἡ δὲ ἀγάπη οἰκοδομεῖ. εἰ δέ τις δοκεῖ εἰδέναι τι, οὐδέπω οὐδὲν ἔγνωκε καθὼς δεῖ γνῶναι· εἰ δέ τις ἀγαπᾷ τὸν Θεόν, οὗτος ἔγνωσται ὑπ᾿ αὐτοῦ. Περὶ τῆς βρώσεως οὖν τῶν εἰδωλοθύτων οἴδαμεν ὅτι οὐδὲν εἴδωλον ἐν κόσμῳ, καὶ ὅτι οὐδεὶς Θεὸς ἕτερος εἰ μὴ εἷς. καὶ γὰρ εἴπερ εἰσὶ λεγόμενοι θεοὶ εἴτε ἐν οὐρανῷ εἴτε ἐπὶ τῆς γῆς, ὥσπερ εἰσὶ θεοὶ πολλοὶ καὶ κύριοι πολλοί, ἀλλ᾿ ἡμῖν εἷς Θεὸς ὁ πατήρ, ἐξ οὗ τὰ πάντα καὶ ἡμεῖς εἰς αὐτόν, καὶ εἷς Κύριος Ἰησοῦς Χριστός, δι᾿ οὗ τὰ πάντα καὶ ἡμεῖς δι᾿ αὐτοῦ. Ἀλλ᾿ οὐκ ἐν πᾶσιν ἡ γνῶσις· τινὲς δὲ τῇ συνειδήσει τοῦ εἰδώλου ἕως ἄρτι ὡς εἰδωλόθυτον ἐσθίουσι, καὶ ἡ συνείδησις αὐτῶν ἀσθενὴς οὖσα μολύνεται.
ltx/gr_gr_cog/le.ep.mc.d167:lemcLI.Epistle.title	Τῇ Παρασκευῇ τῆς Ζʹ Ἑβδομάδος
ltx/gr_gr_cog/le.ep.mc.d167:lemcLI.Epistle.title_abbr	Παρασκευῇ τῆς Ζʹ Ἑβδομάδος
ltx/gr_gr_cog/le.ep.mc.d167:lemcLI.Epistle.version	@ltx/gr_gr_cog/properties:version.designation
