ltx/gr_gr_cog/le.pr.me.r19:leprVE.reading.book_abbr	@ltx/gr_gr_cog/bible:Exodus.abbr
ltx/gr_gr_cog/le.pr.me.r19:leprVE.reading.book_string	@ltx/gr_gr_cog/bible:Exodus.text
ltx/gr_gr_cog/le.pr.me.r19:leprVE.reading.chapverse	2, 5 – 10
ltx/gr_gr_cog/le.pr.me.r19:leprVE.reading.incipit	Κατέβη ἡ θυγάτηρ Φαραὼ λούσασθαι ἐπὶ τὸν ποταμόν, καὶ…
ltx/gr_gr_cog/le.pr.me.r19:leprVE.reading.text	Κατέβη ἡ θυγάτηρ Φαραὼ λούσασθαι ἐπὶ τὸν ποταμόν, καὶ αἱ ἅβραι παρεπορεύοντο αὐτῇ παρὰ τὸν ποταμόν, καὶ ἰδοῦσα θῖβιν ἐν τῷ ἕλει, ἀποστείλασα τὴν ἅβραν, ἀνείλετο αὐτήν. Ἀνοίξασα δὲ ὁρᾷ παιδίον κλαῖον ἐν τῇ θίβει καὶ ἐφείσατο αὐτοῦ ἡ θυγάτηρ Φαραώ, καὶ εἶπεν• Ἀπὸ τῶν παιδίων τῶν Ἑβραίων τοῦτο. Καὶ εἶπεν ἡ ἀδελφὴ αὐτοῦ τῇ θυγατρὶ Φαραώ· Θέλεις καλέσω σοι γυναῖκα τροφεύουσαν ἐκ τῶν Ἑβραίων, καὶ θηλάσει σοι τὸ παιδίον, καὶ εἶπεν αὐτῇ ἡ θυγάτηρ Φαραώ• Πορεύου. Ἐλθοῦσα δὲ ἡ νεᾶνις, ἐκάλεσε τὴν μητέρα τοῦ παιδίου. Εἶπε δὲ πρὸς αὐτὴν ἡ θυγάτηρ Φαραώ• Διατήρησόν μοι τὸ παιδίον τοῦτο, καὶ θήλασόν μοι αὐτό, ἐγὼ δὲ δώσω σοι τὸν μισθόν. Ἔλαβε δὲ ἡ γυνὴ τὸ παιδίον, καὶ ἐθήλαζεν αὐτό. Ἀνδρυνθέντος δὲ τοῦ παιδίου, εἰσήγαγεν αὐτὸ πρὸς τὴν θυγατέρα Φαραώ, καὶ ἐγενήθη αὐτῇ εἰς υἱόν, ἐπωνόμασε δὲ τὸ ὄνομα αὐτοῦ Μωϋσῆν, λέγουσα· Ἐκ τοῦ ὕδατος αὐτὸν ἀνειλόμην.
ltx/gr_gr_cog/le.pr.me.r19:leprVE.reading.title	
ltx/gr_gr_cog/le.pr.me.r19:leprVE.reading.title_abbr	
ltx/gr_gr_cog/le.pr.me.r19:leprVE.reading.version	@ltx/gr_gr_cog/properties:version.designation
