ltx/gr_gr_cog/le.ep.mc.d183:lemcLI.Epistle.book_abbr	@ltx/gr_gr_cog/bible:Corinthians1.abbr
ltx/gr_gr_cog/le.ep.mc.d183:lemcLI.Epistle.book_string	@ltx/gr_gr_cog/bible:Corinthians1.text
ltx/gr_gr_cog/le.ep.mc.d183:lemcLI.Epistle.chapverse	3:9 – 17
ltx/gr_gr_cog/le.ep.mc.d183:lemcLI.Epistle.incipit	Θεοῦ ἐσμεν συνεργοί.…
ltx/gr_gr_cog/le.ep.mc.d183:lemcLI.Epistle.text	Ἀδελφοί, Θεοῦ ἐσμεν συνεργοί· Θεοῦ γεώργιον, Θεοῦ οἰκοδομή ἐστε.Κατὰ τὴν χάριν τοῦ Θεοῦ τὴν δοθεῖσάν μοι ὡς σοφὸς ἀρχιτέκτων θεμέλιον τέθεικα, ἄλλος δὲ ἐποικοδομεῖ· ἕκαστος δὲ βλεπέτω πῶς ἐποικοδομεῖ· θεμέλιον γὰρ ἄλλον οὐδεὶς δύναται θεῖναι παρὰ τὸν κείμενον, ὅς ἐστιν Ἰησοῦς Χριστός. εἰ δέ τις ἐποικοδομεῖ ἐπὶ τὸν θεμέλιον τοῦτον χρυσόν, ἄργυρον, λίθους τιμίους, ξύλα, χόρτον, καλάμην, ἑκάστου τὸ ἔργον φανερὸν γενήσεται· ἡ γὰρ ἡμέρα δηλώσει· ὅτι ἐν πυρὶ ἀποκαλύπτεται· καὶ ἑκάστου τὸ ἔργον ὁποῖόν ἐστι τὸ πῦρ δοκιμάσει. εἴ τινος τὸ ἔργον μενεῖ ὃ ἐπῳκοδόμησε, μισθὸν λήψεται· εἴ τινος τὸ ἔργον κατακαήσεται, ζημιωθήσεται, αὐτὸς δὲ σωθήσεται, οὕτως δὲ ὡς διὰ πυρός. Οὐκ οἴδατε ὅτι ναὸς Θεοῦ ἐστε καὶ τὸ Πνεῦμα τοῦ Θεοῦ οἰκεῖ ἐν ὑμῖν; εἴ τις τὸν ναὸν τοῦ Θεοῦ φθείρει, φθερεῖ τοῦτον ὁ Θεός· ὁ γὰρ ναὸς τοῦ Θεοῦ ἅγιός ἐστιν, οἵτινές ἐστε ὑμεῖς.
ltx/gr_gr_cog/le.ep.mc.d183:lemcLI.Epistle.title	Κυριακῇ Ἐνάτῃ
ltx/gr_gr_cog/le.ep.mc.d183:lemcLI.Epistle.title_abbr	Κυριακῇ Θʹ
ltx/gr_gr_cog/le.ep.mc.d183:lemcLI.Epistle.version	@ltx/gr_gr_cog/properties:version.designation
