ltx/gr_gr_cog/le.pr.tr.d042:lemcVE.reading1.book_abbr	@ltx/gr_gr_cog/bible:Genesis.abbr
ltx/gr_gr_cog/le.pr.tr.d042:lemcVE.reading1.book_string	@ltx/gr_gr_cog/bible:Genesis.text
ltx/gr_gr_cog/le.pr.tr.d042:lemcVE.reading1.chapverse	Ηʹ, 4 – 21
ltx/gr_gr_cog/le.pr.tr.d042:lemcVE.reading1.incipit	Ἐκάθισεν ἡ κιβωτὸς ἐν μηνὶ τῷ ἑβδόμῳ, ἑβδόμῃ καὶ…
ltx/gr_gr_cog/le.pr.tr.d042:lemcVE.reading1.text	Ἐκάθισεν ἡ κιβωτὸς ἐν μηνὶ τῷ ἑβδόμῳ, ἑβδόμῃ καὶ εἰκάδι τοῦ μηνός, ἐπὶ τὰ ὄρη τὰ Ἀραράτ. Τὸ δὲ ὕδωρ πορευόμενον ἠλαττονοῦτο ἕως τοῦ δεκάτου μηνός. Ἐν δὲ τῷ δεκάτῳ μηνί, τῇ πρώτῃ τοῦ μηνός, ὤφθησαν αἱ κεφαλαὶ τῶν ὀρέων. Καὶ ἐγένετο μετὰ τεσσαράκοντα ἡμέρας, ἠνέῳξε Νῶε τὴν θυρίδα τῆς κιβωτοῦ, ἣν ἐποίησε. Καὶ ἀπέστειλε τὸν κόρακα τοῦ ἰδεῖν, εἰ κεκόπακε τὸ ὕδωρ, καὶ ἐξελθών, οὐκ ἀνέστρεψεν, ἕως τοῦ ξηρανθῆναι τὸ ὕδωρ ἀπὸ τῆς γῆς. Καὶ ἀπέστειλε τὴν περιστερὰν ὀπίσω αὐτοῦ ἰδεῖν, εἰ κεκόπακε τὸ ὕδωρ ἀπὸ τῆς γῆς. Καὶ οὐχ εὑροῦσα ἡ περιστερὰ ἀνάπαυσιν τοῖς ποσὶν αὐτῆς, ὑπέστρεψε πρὸς αὐτὸν εἰς τὴν κιβωτόν, ὅτι ὕδωρ ἦν ἐπὶ πᾶν τὸ πρόσωπον τῆς γῆς, καὶ ἐκτείνας τὴν χεῖρα αὐτοῦ, ἔλαβεν αὐτήν, καὶ εἰσήγαγεν αὐτὴν πρὸς αὐτὸν εἰς τὴν κιβωτόν. Καὶ ἐπισχὼν ἔτι ἡμέρας ἑπτὰ ἑτέρας, πάλιν ἐξαπέστειλε τὴν περιστερὰν ἐκ τῆς κιβωτοῦ. Καὶ ἀνέστρεψε πρὸς αὐτὸν ἡ περιστερὰ τὸ πρὸς ἑσπέραν, καὶ εἶχε φύλλον ἐλαίας, κάρφος ἐν τῷ στόματι αὐτῆς, καὶ ἔγνω Νῶε, ὅτι κεκόπακε τὸ ὕδωρ ἀπὸ τῆς γῆς. Καὶ ἐπισχὼν ἔτι ἡμέρας ἑπτὰ ἑτέρας, πάλιν ἐξαπέστειλε τὴν περιστεράν, καὶ οὐ προσέθετο τοῦ ἐπιστρέψαι πρὸς αὐτὸν ἔτι. Καὶ ἐγένετο ἐν τῷ ἑνὶ καὶ ἑξακοσιοστῷ ἔτει ἐν τῇ ζωῇ τοῦ Νῶε, τοῦ πρώτου μηνὸς μιᾷ τοῦ μηνός, ἐξέλιπε τὸ ὕδωρ ἀπὸ τῆς γῆς. Καὶ ἀπεκάλυψε Νῶε τὴν στέγην τῆς Κιβωτοῦ, ἣν ἐποίησε, καὶ εἶδεν, ὅτι ἐξέλιπε τὸ ὕδωρ ἀπὸ προσώπου τῆς γῆς. Ἐν δὲ τῷ δευτέρῳ μηνί, ἑβδόμῃ καὶ εἰκάδι τοῦ μηνός, ἐξηράνθη ἡ γῆ. Καὶ εἶπε Κύριος ὁ Θεὸς πρὸς Νῶε, λέγων· Ἔξελθε ἐκ τῆς κιβωτοῦ σύ, καὶ ἡ γυνή σου, καὶ οἱ υἱοί σου, καὶ αἱ γυναῖκες τῶν υἱῶν σου μετὰ σοῦ, καὶ πάντα τὰ θηρία, ὅσα ἐστὶ μετὰ σοῦ, καὶ πᾶσα σάρξ, ἀπὸ πετεινῶν ἕως κτηνῶν, καὶ πᾶν ἑρπετὸν κινούμενον ἐπὶ τῆς γῆς ἐξάγαγε μετὰ σεαυτοῦ, καὶ αὐξάνεσθε καὶ πληθύνεσθε ἐπὶ τῆς γῆς. Καὶ ἐξῆλθε Νῶε, καὶ ἡ γυνὴ αὐτοῦ, καὶ οἱ υἱοὶ αὐτοῦ, καὶ αἱ γυναῖκες τῶν υἱῶν αὐτοῦ μετʼ αὐτοῦ, καὶ πάντα τὰ θηρία, καὶ πάντα τὰ κτήνη, καὶ πᾶν πετεινόν, καὶ πᾶν ἑρπετὸν κινούμενον ἐπὶ τῆς γῆς κατὰ γένος αὐτῶν, ἐξῆλθεν ἐκ τῆς κιβωτοῦ, ἐν μιᾷ τοῦ μηνὸς τοῦ τρίτου. Καὶ ᾠκοδόμησε Νῶε θυσιαστήριον τῷ Κυρίῳ, καὶ ἔλαβεν ἀπὸ πάντων τῶν κτηνῶν τῶν καθαρῶν, καὶ ἀπὸ πάντων τῶν πετεινῶν τῶν καθαρῶν, καὶ ἀνήνεγκεν εἰς ὁλοκάρπωσιν ἐπὶ τὸ θυσιαστήριον. Καὶ ὠσφράνθη Κύριος ὁ Θεὸς ὀσμὴν εὐωδίας.
ltx/gr_gr_cog/le.pr.tr.d042:lemcVE.reading1.title	
ltx/gr_gr_cog/le.pr.tr.d042:lemcVE.reading1.title_abbr	
ltx/gr_gr_cog/le.pr.tr.d042:lemcVE.reading1.version	@ltx/gr_gr_cog/properties:version.designation
ltx/gr_gr_cog/le.pr.tr.d042:lemcVE.reading2.book_abbr	@ltx/gr_gr_cog/le.pr.me.r48:leprVE.reading.book_abbr
ltx/gr_gr_cog/le.pr.tr.d042:lemcVE.reading2.book_string	@ltx/gr_gr_cog/le.pr.me.r48:leprVE.reading.book_string
ltx/gr_gr_cog/le.pr.tr.d042:lemcVE.reading2.chapverse	@ltx/gr_gr_cog/le.pr.me.r48:leprVE.reading.chapverse
ltx/gr_gr_cog/le.pr.tr.d042:lemcVE.reading2.text	@ltx/gr_gr_cog/le.pr.me.r48:leprVE.reading.text
ltx/gr_gr_cog/le.pr.tr.d042:lemcVE.reading2.title	
ltx/gr_gr_cog/le.pr.tr.d042:lemcVE.reading2.title_abbr	
ltx/gr_gr_cog/le.pr.tr.d042:lemcVE.reading2.version	@ltx/gr_gr_cog/properties:version.designation
