ltx/gr_gr_cog/sy.m12.dAC:cl.syMA.commemoration01.text	[saint/com 1]
ltx/gr_gr_cog/sy.m12.dAC:cl.syMA.commemoration02.text	[saint/com 2]
ltx/gr_gr_cog/sy.m12.dAC:cl.syMA.commemoration03.text	[saint/com 3]
ltx/gr_gr_cog/sy.m12.dAC:cl.syMA.commemoration04.text	[saint/com 4]
ltx/gr_gr_cog/sy.m12.dAC:cl.syMA.commemoration05.text	[saint/com 5]
ltx/gr_gr_cog/sy.m12.dAC:cl.syMA.commemoration06.text	[saint/com list]
ltx/gr_gr_cog/sy.m12.dAC:syMA.commemoration01.couplet1.title	@ltx/gr_gr_cog/titles:ti.Verses
ltx/gr_gr_cog/sy.m12.dAC:syMA.commemoration01.couplet1.verse1	Τιµῶ Ἰωσήφ, Μνήστορα τῆς Παρθένου,
ltx/gr_gr_cog/sy.m12.dAC:syMA.commemoration01.couplet1.verse2	Ὡς ἐκλεγέντα φύλακα ταύτης µόνον.
ltx/gr_gr_cog/sy.m12.dAC:syMA.commemoration01.couplet2.verse1	Σὺ τέκτονος παῖς, ἀλλʼ ἀδελφὸς Κυρίου,
ltx/gr_gr_cog/sy.m12.dAC:syMA.commemoration01.couplet2.verse2	Τοῦ πάντα τεκτήναντος ἐν λόγῳ, µάκαρ.
ltx/gr_gr_cog/sy.m12.dAC:syMA.commemoration01.couplet3.verse1	Ἐγὼ τί φήσω, µαρτυροῦντος Κυρίου·
ltx/gr_gr_cog/sy.m12.dAC:syMA.commemoration01.couplet3.verse2	Τὸν Δαυῒδ εὗρον, ὡς ἐµαυτοῦ καρδίαν;
ltx/gr_gr_cog/sy.m12.dAC:syMA.commemoration01.narration.p01	Δαυΐδ, ὁ Προφήτης καὶ βασιλεύς, ἦν υἱὸς Ἰεσσαί. Τοῦτον ἐδίδαξεν ὁ Προφήτης Νάθαν τὸν Νόµον Κυρίου, καὶ προεφήτευσεν ἔτη τεσσαράκοντα. Προέλαβε δὲ τὴν Σάρκωσιν τοῦ Χριστοῦ ἔτη ἐννεακόσια ἐνενήκοντα ἐννέα, καὶ ἦν ἐν Γαβαά. Εἶδε δὲ Νάθαν, ὅτι Δαυῒδ ἐν τῇ Βηρσαβεὲ παραβήσεται· καὶ σπεύδων ἐλθεῖν ἀναγγεῖλαι αὐτῷ, ἐνεποδίσθη ὑπὸ τοῦ Βελίαρ· εὗρε γὰρ κατὰ τὴν ὁδὸν νεκρὸν κείµενον, ἐσφαγµένον γυµνόν· καὶ ἐπέµεινεν ἐκεῖ, θέλων θάψαι τὸν νεκρόν· καὶ τῇ νυκτὶ ἐκείνῃ ἐπέγνω, ὅτι ἐποίησε τὴν ἁµαρτίαν Δαυΐδ, καὶ ὑπέστρεψε πενθῶν· ὡς δὲ ἀνεῖλε καὶ τὸν ἄνδρα αὐτῆς ὁ Δαυΐδ, ἔπεµψε Κύριος τὸν Προφήτην Νάθαν ἐλέγξαι αὐτόν. Πολλὰ δὲ πενθήσας ὁ Δαυΐδ, καὶ πάνυ γηράσας, ἀπέθανε καὶ ἐτάφη ἐν τῇ γῇ αὑτοῦ µετὰ τῶν Πατέρων αὐτοῦ. Γίνεται δὲ ἡ αὐτοῦ Σύναξις ἐν τῇ µεγάλῃ Ἐκκλησίᾳ, καὶ ἐν τῷ Ἀποστολείῳ τοῦ ἁγίου Ἀποστόλου Ἰακώβου, τοῦ ἀδελφοῦ τοῦ Κυρίου, ἔνδον τοῦ σεβασµίου Οἴκου τῆς Ὑπεραγίας Θεοτόκου, τῶν Χαλκοπρατείων. Τὰ δὲ περὶ τοῦ Μνήστορος Ἰωσὴφ καὶ τοῦ υἱοῦ αὐτοῦ Ἰακώβου τοῦ Ἀδελφοθέου, πάντες γινώσκουσι, µαθόντες αὐτὰ ἐκ τῶν ἁγίων Γραφῶν.
ltx/gr_gr_cog/sy.m12.dAC:syMA.commemoration01.text	Τῇ Κυριακῇ μετὰ τὴν Χριστοῦ Γέννησιν, μνήμη τῶν ἁγίων καὶ δικαίων Θεοπατόρων, Ἰωσὴφ τοῦ Μνήστορος τῆς ἁγίας Παρθένου Δεσποίνης ἡμῶν Θεοτόκου, Ἰακώβου, τοῦ Ἀδελφοῦ τοῦ Κυρίου, καὶ Δαυΐδ τοῦ Προφήτου καὶ βασιλέως.
ltx/gr_gr_cog/sy.m12.dAC:syMA.commemoration02.text	Μνήμη τῶν ἁγίων καὶ δικαίων Θεοπατόρων, Ἰωσὴφ τοῦ Μνήστορος τῆς ἁγίας Παρθένου Δεσποίνης ἡμῶν Θεοτόκου, Ἰακώβου, τοῦ Ἀδελφοῦ τοῦ Κυρίου, καὶ Δαυΐδ τοῦ Προφήτου καὶ βασιλέως.
ltx/gr_gr_cog/sy.m12.dAC:syMA.lastline	Ταῖς τῶν Ἁγίων σου πρεσβείαις, ὁ Θεός, ἐλέησον καὶ σῶσον ἡμᾶς. Ἀμήν.
ltx/gr_gr_cog/sy.m12.dAC:syMA.note1	Ἀναγινώκομεν πρῶτον τὸ Συναξάριον τῆς ἡμέρας τοῦ μηνός, εἶτα·
