ltx/gr_gr_cog/le.go.me.m06.d29:lemeLI.Gospel.book_abbr	@ltx/gr_gr_cog/bible:Matthew.abbr
ltx/gr_gr_cog/le.go.me.m06.d29:lemeLI.Gospel.book_string	@ltx/gr_gr_cog/bible:Matthew.text
ltx/gr_gr_cog/le.go.me.m06.d29:lemeLI.Gospel.chapverse	16:13 – 19
ltx/gr_gr_cog/le.go.me.m06.d29:lemeLI.Gospel.incipit	Ἐλθὼν ὁ Ἰησοῦς εἰς τὰ μέρη Καισαρείας…
ltx/gr_gr_cog/le.go.me.m06.d29:lemeLI.Gospel.text	Τῷ καιρῷ ἐκείνῳ, ἐλθὼν ὁ Ἰησοῦς εἰς τὰ μέρη Καισαρείας τῆς Φιλίππου ἠρώτα τοὺς μαθητὰς αὐτοῦ λέγων· τίνα με λέγουσιν οἱ ἄνθρωποι εἶναι τὸν υἱὸν τοῦ ἀνθρώπου; οἱ δὲ εἶπον· οἱ μὲν Ἰωάννην τὸν βαπτιστήν, ἄλλοι δὲ Ἠλίαν, ἕτεροι δὲ Ἱερεμίαν ἢ ἕνα τῶν προφητῶν. λέγει αὐτοῖς· ὑμεῖς δὲ τίνα με λέγετε εἶναι; ἀποκριθεὶς δὲ Σίμων Πέτρος εἶπε· σὺ εἶ ὁ Χριστὸς ὁ υἱὸς τοῦ Θεοῦ τοῦ ζῶντος. καὶ ἀποκριθεὶς ὁ Ἰησοῦς εἶπεν αὐτῷ· μακάριος εἶ, Σίμων Βαριωνᾶ, ὅτι σὰρξ καὶ αἷμα οὐκ ἀπεκάλυψέ σοι, ἀλλ᾿ ὁ πατήρ μου ὁ ἐν τοῖς οὐρανοῖς. κἀγὼ δέ σοι λέγω ὅτι σὺ εἶ Πέτρος, καὶ ἐπὶ ταύτῃ τῇ πέτρᾳ οἰκοδομήσω μου τὴν ἐκκλησίαν, καὶ πύλαι ᾅδου οὐ κατισχύσουσιν αὐτῆς. καὶ δώσω σοι τὰς κλεῖς τῆς βασιλείας τῶν οὐρανῶν, καὶ ὃ ἐὰν δήσῃς ἐπὶ τῆς γῆς, ἔσται δεδεμένον ἐν τοῖς οὐρανοῖς, καὶ ὃ ἐὰν λύσῃς ἐπὶ τῆς γῆς, ἔσται λελυμένον ἐν τοῖς οὐρανοῖς.
ltx/gr_gr_cog/le.go.me.m06.d29:lemeLI.Gospel.title	Τῶν Ἀποστόλων
ltx/gr_gr_cog/le.go.me.m06.d29:lemeLI.Gospel.title_abbr	Τῶν Ἀποστόλων
ltx/gr_gr_cog/le.go.me.m06.d29:lemeLI.Gospel.version	@ltx/gr_gr_cog/properties:version.designation
ltx/gr_gr_cog/le.go.me.m06.d29:lemeMA.Gospel.book_abbr	@ltx/gr_gr_cog/le.go.eo.w11:leeoMA.Gospel.book_abbr
ltx/gr_gr_cog/le.go.me.m06.d29:lemeMA.Gospel.book_string	@ltx/gr_gr_cog/le.go.eo.w11:leeoMA.Gospel.book_string
ltx/gr_gr_cog/le.go.me.m06.d29:lemeMA.Gospel.chapverse	@ltx/gr_gr_cog/le.go.eo.w11:leeoMA.Gospel.chapverse
ltx/gr_gr_cog/le.go.me.m06.d29:lemeMA.Gospel.incipit	@ltx/gr_gr_cog/le.go.eo.w11:leeoMA.Gospel.incipit
ltx/gr_gr_cog/le.go.me.m06.d29:lemeMA.Gospel.text	@ltx/gr_gr_cog/le.go.eo.w11:leeoMA.Gospel.text
ltx/gr_gr_cog/le.go.me.m06.d29:lemeMA.Gospel.title	Τῶν Ἀποστόλων
ltx/gr_gr_cog/le.go.me.m06.d29:lemeMA.Gospel.title_abbr	Τῶν Ἀποστόλων
ltx/gr_gr_cog/le.go.me.m06.d29:lemeMA.Gospel.version	@ltx/gr_gr_cog/properties:version.designation
