ltx/gr_gr_cog/le.pr.me.r32:leprVE.reading.book_abbr	@ltx/gr_gr_cog/bible:Exodus.abbr
ltx/gr_gr_cog/le.pr.me.r32:leprVE.reading.book_string	@ltx/gr_gr_cog/bible:Exodus.text
ltx/gr_gr_cog/le.pr.me.r32:leprVE.reading.chapverse	12:51
ltx/gr_gr_cog/le.pr.me.r32:leprVE.reading.incipit	Ἐλάλησε Κύριος πρὸς Μωσῆν τῇ ἡμέρᾳ ἐκείνῃ, ᾗ ἐξήγαγε…
ltx/gr_gr_cog/le.pr.me.r32:leprVE.reading.text	Ἐλάλησε Κύριος πρὸς Μωσῆν τῇ ἡμέρᾳ ἐκείνῃ, ᾗ ἐξήγαγε τοὺς υἱοὺς Ἰσραὴλ ἐκ γῆς Αἰγύπτου, λέγων· ἁγίασόν μοι πᾶν πρωτότοκον πρωτογενές, διανοῖγον πᾶσαν μήτραν ἐν τοῖς υἱοῖς, Ἰσραήλ. Εἶπε δὲ Μωϋσῆς πρὸς τὸν λαόν· Μνημονεύετε τὴν ἡμέραν ταύτην, ἐν ᾗ ἐξήλθετε ἐκ γῆς Αἰγύπτου, ἐξ οἴκου δουλείας· ἐν γὰρ χειρὶ κραταιᾷ ἐξήγαγεν ὑμᾶς Κύριος ἐντεῦθεν. Καὶ φυλάξασθε τὸν νόμον αὐτοῦ. Καὶ ἔσται, ὡς ἂν εἰσαγάγῃ σε Κύριος ὁ Θεὸς εἰς τὴν γῆν τῶν Χαναναίων, ὃν τρόπον ὤμοσε τοῖς πατράσι σου, καὶ ἀφοριεῖς πᾶν διανοῖγον μήτραν τὰ ἀρσενικά τῷ Κυρίῳ. Ἐὰν δὲ ἐρωτήσῃ σε μετὰ ταῦτα ὁ υἱός σου λέγων· Τί τοῦτο; καὶ ἐρεῖς αὐτῷ· Ὅτι ἐν χειρὶ κραταιᾷ ἐξήγαγεν ἡμᾶς Κύριος ἐκ γῆς Αἰγύπτου, ἐξ οἴκου δουλείας. Ἡνίκα δὲ ἐσκλήρυνε Φαραὼ τοῦ ἐξαποστεῖλαι ἡμᾶς, ἀπέκτεινε Κύριος πᾶν πρωτότοκον ἐν γῇ Αἰγύπτου, ἀπὸ πρωτοτόκων ἀνθρώπων ἕως πρωτοτόκων κτηνῶν· διὰ τοῦτο ἐγὼ θύω τῷ Κυρίῳ πᾶν διανοῖγον μήτραν τὰ ἀρσενικά, καὶ πᾶν πρωτότοκον τῶν υἱῶν μου λυτρώσομαι. Καὶ ἔσται εἰς σημεῖον ἐπὶ τῆς χειρός σου, καὶ ἀσάλευτον πρὸ τῶν ὀφθαλμῶν σου, ὅτι οὕτως ἔφη Κύριος ὁ παντοκράτωρ. Ὅτι τὰ πρωτότοκα τῶν υἱῶν σου δώσεις ἐμοί. Καὶ ἔσται πᾶς ὃς ἂν τέξῃ παιδίον ἄρσεν, τῇ ἡμέρᾳ τῇ ὀγδόῃ περιτεμεῖ τὴν σάρκα τῆς ἀκροβυστίας αὐτοῦ. Καὶ τριάκοντα καὶ τρεῖς ἡμέρας οὐκ εἰσελεύσεται εἰς τὸ ἁγιαστήριον τοῦ Θεοῦ πρὸς τὸν ἱερέα, ἕως πληρωθῶσιν αἱ ἡμέραι τῆς καθάρσεως. Καὶ μετὰ ταῦτα προσοίσει τῷ Κυρίῳ ἀμνὸν ἐνιαύσιον ἄμωμον εἰς ὁλοκαύτωμα, καὶ νεοσσὸν περιστερᾶς, ἢ Τρυγόνος, ἐπὶ τὴν θύραν τῆς σκηνῆς τοῦ Μαρτυρίου πρὸς τὸν Ἱερέα· ἢ ἀντὶ τούτων, προσοίσει ἔναντι Κυρίου δύο νεοσσοὺς περιστερῶν, ἢ δύο τρυγόνας. Καὶ ἐξιλάσεται περὶ αὐτοῦ ὁ Ἱερεύς· ὅτι ἀπόδομα ἀποδεδομένοι οὗτοί μοι εἰσιν ἐκ πάντων τῶν υἱῶν Ἰσραήλ, καὶ εἴληφα αὐτούς, καὶ ἡγίασα αὐτούς ἐμοί, ἀντὶ τῶν πρωτοτόκων τῶν Αἰγυπτίων, ᾗ ἡμέρα ἐπάταξα πᾶν πρωτότοκον ἐν γῇ Αἰγύπτου, ἀπὸ ἀνθρώπου ἕως κτήνους, εἶπεν ὁ Θεὸς ὁ ὕψιστος, ὁ ἅγιος Ἰσραήλ.
ltx/gr_gr_cog/le.pr.me.r32:leprVE.reading.title	
ltx/gr_gr_cog/le.pr.me.r32:leprVE.reading.title_abbr	
ltx/gr_gr_cog/le.pr.me.r32:leprVE.reading.version	@ltx/gr_gr_cog/properties:version.designation
