ltx/gr_gr_cog/me.m10.d16:meDA.commemoration.first	Μνήμη τοῦ Ἁγίου Μάρτυρος Λογγίνου τοῦ Ἑκατοντάρχου
ltx/gr_gr_cog/me.m10.d16:meDA.commemoration.first_name	
ltx/gr_gr_cog/me.m10.d16:meDA.commemoration.first_short	Μνήμη τοῦ Ἁγίου Μάρτυρος Λογγίνου τοῦ Ἑκατοντάρχου
ltx/gr_gr_cog/me.m10.d16:meDA.commemoration.first_title	@ltx/gr_gr_cog/titles:ti.SaintM
ltx/gr_gr_cog/me.m10.d16:meDA.commemoration.full	Μνήμη τοῦ Ἁγίου Μάρτυρος Λογγίνου τοῦ Ἑκατοντάρχου, τοῦ ἐπὶ τοῦ Σταυροῦ.
ltx/gr_gr_cog/me.m10.d16:meDA.commemoration.second_name	
ltx/gr_gr_cog/me.m10.d16:meDA.commemoration.second_title	
ltx/gr_gr_cog/me.m10.d16:meDA.date	Τῌ ΙϚʹ ΟΚΤΩΒΡΙΟΥ
ltx/gr_gr_cog/me.m10.d16:meDA.fordate	διὰ τὴν 16ην Ὀκτωβρίου
ltx/gr_gr_cog/me.m10.d16:meDA.insert1	καὶ τοῦ ἁγίου Μάρτυρος Λογγίνου τοῦ Ἑκατοντάρχου,
ltx/gr_gr_cog/me.m10.d16:meDA.insert2	οὗ καὶ τὴν μνήμην ἐπιτελοῦμεν·
ltx/gr_gr_cog/me.m10.d16:meDA.note	
ltx/gr_gr_cog/me.m10.d16:meDA.pdfcoverdate	τῆς 16ης Ὀκτωβρίου,
ltx/gr_gr_cog/me.m10.d16:meDA.pdfheaderdate	τῆς 16ης Ὀκτωβρίου
ltx/gr_gr_cog/me.m10.d16:meHO.commemorations	
ltx/gr_gr_cog/me.m10.d16:meHO.note1	
ltx/gr_gr_cog/me.m10.d16:meHO.note2	
ltx/gr_gr_cog/me.m10.d16:meHO.number	
ltx/gr_gr_cog/me.m10.d16:meHO.rank	
ltx/gr_gr_cog/me.m10.d16:meLE.commemoration1	Μνήμη τοῦ Ἁγίου Μάρτυρος Λογγίνου τοῦ Ἑκατοντάρχου, τοῦ ἐπὶ τοῦ Σταυροῦ.
ltx/gr_gr_cog/me.m10.d16:meLE.commemoration2	
ltx/gr_gr_cog/me.m10.d16:meLI.Kontakion1.greekmelody	@ltx/gr_gr_cog/me.m10.d16:meMA.Kontakion1.greekmelody
ltx/gr_gr_cog/me.m10.d16:meLI.Kontakion1.incipit	@ltx/gr_gr_cog/me.m10.d16:meMA.Kontakion1.incipit
ltx/gr_gr_cog/me.m10.d16:meLI.Kontakion1.melody	@ltx/gr_gr_cog/me.m10.d16:meMA.Kontakion1.melody
ltx/gr_gr_cog/me.m10.d16:meLI.Kontakion1.mode	@ltx/gr_gr_cog/me.m10.d16:meMA.Kontakion1.mode
ltx/gr_gr_cog/me.m10.d16:meLI.Kontakion1.text	@ltx/gr_gr_cog/me.m10.d16:meMA.Kontakion1.text
ltx/gr_gr_cog/me.m10.d16:meLI.Megalynarion.text	
ltx/gr_gr_cog/me.m10.d16:meMA.C1.acrostic.notice1	οὗ ἡ Ἀκροστιχίς·
ltx/gr_gr_cog/me.m10.d16:meMA.C1.acrostic.text	Τὸ Λογγίνου μέγιστον ὑμνήσω κλέος. Ἰωσήφ.
ltx/gr_gr_cog/me.m10.d16:meMA.C1.acrostic.title	Κανὼν τοῦ Ἁγίου,
ltx/gr_gr_cog/me.m10.d16:meMA.C1.title	@ltx/gr_gr_cog/titles:ti.CanonSaintM
ltx/gr_gr_cog/me.m10.d16:meMA.C1.verse	@ltx/gr_gr_cog/prayers:pr.verse_SaintM.text
ltx/gr_gr_cog/me.m10.d16:meMA.ExapTheotokion.incipit	Κενοῦται ἐν τῇ μήτρᾳ σου…
ltx/gr_gr_cog/me.m10.d16:meMA.ExapTheotokion.melody	@ltx/gr_gr_cog/he.a.m2:heAU.ToisMathitaisSynelthomen.name
ltx/gr_gr_cog/me.m10.d16:meMA.ExapTheotokion.mode	@ltx/gr_gr_cog/miscellanea:misc.Mode2
ltx/gr_gr_cog/me.m10.d16:meMA.ExapTheotokion.text	Κενοῦται ἐν τῇ μήτρᾳ σου, ὁ πληρέστατος Λόγος, κόλπων πατρῴων ἄχραντε, οὐκ ἐκστὰς ἀποῤῥήτως, καὶ σάρξ ὁρᾶται καὶ βρέφος, τίκτεται Θεοτόκε. Ὃν ἐκτενῶς ἱκέτευε, λυτρωθῆναι κινδύνων, καὶ πειρασμῶν, καὶ πταισμάτων Δέσποινα καὶ γεέννης, τοὺς εὐσεβῶς κηρύττοντας, τοῦ Θεοῦ σε Μητέρα.
ltx/gr_gr_cog/me.m10.d16:meMA.Exaposteilarion1.greekmelody	@ltx/gr_gr_cog/he.a.m2:heAU.ToisMathitaisSynelthomen.greekname
ltx/gr_gr_cog/me.m10.d16:meMA.Exaposteilarion1.incipit	Ὁρῶν τὸν πάντων Κύριον, καὶ…
ltx/gr_gr_cog/me.m10.d16:meMA.Exaposteilarion1.melody	@ltx/gr_gr_cog/he.a.m2:heAU.ToisMathitaisSynelthomen.name
ltx/gr_gr_cog/me.m10.d16:meMA.Exaposteilarion1.mode	@ltx/gr_gr_cog/miscellanea:misc.Mode2
ltx/gr_gr_cog/me.m10.d16:meMA.Exaposteilarion1.text	Ὁρῶν τὸν πάντων Κύριον, καὶ Θεὸν ἀφυπνοῦντα, ἐπὶ Σταυροῦ θελήματι, κλονουμένην τε πᾶσαν, καιρῷ τοῦ πάθους τὴν κτίσιν, ἀθλοφόρε Λογγῖνε, σὺν τῷ ληστῇ εὐγνώμονι, ὡμολόγησας τοῦτον, Υἱὸν Θεοῦ, ὑπὲρ οὗ καὶ χαίρων ἐσφαγιάσθης· καὶ νῦν ὡς Μάρτυς ἄριστος, ὑπὲρ πάντων πρεσβεύεις.
ltx/gr_gr_cog/me.m10.d16:meMA.Kontakion1.greekmelody	@ltx/gr_gr_cog/he.a.m4:heAU.EpefanisSimeron.greekname
ltx/gr_gr_cog/me.m10.d16:meMA.Kontakion1.incipit	Εὐφροσύνως γέγηθεν ἡ Ἐκκλησία, ἐν…
ltx/gr_gr_cog/me.m10.d16:meMA.Kontakion1.melody	@ltx/gr_gr_cog/he.a.m4:heAU.EpefanisSimeron.name
ltx/gr_gr_cog/me.m10.d16:meMA.Kontakion1.mode	@ltx/gr_gr_cog/miscellanea:misc.Mode4
ltx/gr_gr_cog/me.m10.d16:meMA.Kontakion1.text	Εὐφροσύνως γέγηθεν ἡ Ἐκκλησία, ἐν τῇ μνήμῃ σήμερον, τοῦ ἀοιδίμου ἀθλητοῦ, Λογγίνου ἀνακραυγάζουσα· Σύ μου τὸ κράτος, Χριστὲ καὶ στερέωμα.
ltx/gr_gr_cog/me.m10.d16:meMA.Ode1C11.greekmelody	@ltx/gr_gr_cog/he.h.m4:heHE.ThalassisToErythraion.greekname
ltx/gr_gr_cog/me.m10.d16:meMA.Ode1C11.incipit	Ταῖς θείαις, φωτοχυσίαις Ἔνδοξε, περιλαμπόμενος…
ltx/gr_gr_cog/me.m10.d16:meMA.Ode1C11.melody	@ltx/gr_gr_cog/he.h.m4:heHE.ThalassisToErythraion.name
ltx/gr_gr_cog/me.m10.d16:meMA.Ode1C11.mode	@ltx/gr_gr_cog/miscellanea:misc.Mode4
ltx/gr_gr_cog/me.m10.d16:meMA.Ode1C11.ode	@ltx/gr_gr_cog/miscellanea:misc.Ode1
ltx/gr_gr_cog/me.m10.d16:meMA.Ode1C11.text	Ταῖς θείαις, φωτοχυσίαις Ἔνδοξε, περιλαμπόμενος, καὶ σὺν Ἀγγέλων τάξεσι Χριστῷ, τῷ Θεῷ παριστάμενος, τὴν φωτοφόρον μνήμην σου, τοὺς ἐκτελοῦντας καταφαίδρυνον.
ltx/gr_gr_cog/me.m10.d16:meMA.Ode1C12.incipit	Οὐδέν σε, τῆς πρὸς Θεὸν…
ltx/gr_gr_cog/me.m10.d16:meMA.Ode1C12.melody	@ltx/gr_gr_cog/he.h.m4:heHE.ThalassisToErythraion.name
ltx/gr_gr_cog/me.m10.d16:meMA.Ode1C12.mode	@ltx/gr_gr_cog/miscellanea:misc.Mode4
ltx/gr_gr_cog/me.m10.d16:meMA.Ode1C12.ode	@ltx/gr_gr_cog/miscellanea:misc.Ode1
ltx/gr_gr_cog/me.m10.d16:meMA.Ode1C12.text	Οὐδέν σε, τῆς πρὸς Θεὸν ἑνώσεως, Μάρτυς ἐχώρισε, κεχωρισμένον πάσης σαρκικῆς, ἡδονῆς διὰ πίστεως, καὶ καθαρῶς τῷ ἔρωτι, τῷ ἀκροτάτῳ ἐνηδόμενον.
ltx/gr_gr_cog/me.m10.d16:meMA.Ode1C13.incipit	Λατρεύων, Θεῷ τῷ ζῶντι ἔνδοξε…
ltx/gr_gr_cog/me.m10.d16:meMA.Ode1C13.melody	@ltx/gr_gr_cog/he.h.m4:heHE.ThalassisToErythraion.name
ltx/gr_gr_cog/me.m10.d16:meMA.Ode1C13.mode	@ltx/gr_gr_cog/miscellanea:misc.Mode4
ltx/gr_gr_cog/me.m10.d16:meMA.Ode1C13.ode	@ltx/gr_gr_cog/miscellanea:misc.Ode1
ltx/gr_gr_cog/me.m10.d16:meMA.Ode1C13.text	Λατρεύων, Θεῷ τῷ ζῶντι ἔνδοξε, Λογγῖνε πάνσοφε, νεκροῖς ξοάνοις μάκαρ οὐδαμῶς, σὺ λατρείαν προσένειμας· διὸ πρὸς ἀτελεύτητον, θανατωθεὶς ζωὴν κατήντησας.
ltx/gr_gr_cog/me.m10.d16:meMA.Ode1C1T.incipit	Ὁ Λόγος, ὁ τοῦ Θεοῦ…
ltx/gr_gr_cog/me.m10.d16:meMA.Ode1C1T.melody	@ltx/gr_gr_cog/he.h.m4:heHE.ThalassisToErythraion.name
ltx/gr_gr_cog/me.m10.d16:meMA.Ode1C1T.mode	@ltx/gr_gr_cog/miscellanea:misc.Mode4
ltx/gr_gr_cog/me.m10.d16:meMA.Ode1C1T.ode	@ltx/gr_gr_cog/miscellanea:misc.Ode1
ltx/gr_gr_cog/me.m10.d16:meMA.Ode1C1T.text	Ὁ Λόγος, ὁ τοῦ Θεοῦ ἐν μήτρᾳ σου, λόγῳ συνείληπται, τῆς ἀλογίας ῥύσασθαι βροτούς, βουληθεὶς ἀγαθότητι, Παρθενομῆτορ ἄχραντε, εὐλογημένη παναμώμητε.
ltx/gr_gr_cog/me.m10.d16:meMA.Ode3C11.greekmelody	@ltx/gr_gr_cog/he.h.m4:heHE.EffrainetaiEpiSoi.greekname
ltx/gr_gr_cog/me.m10.d16:meMA.Ode3C11.incipit	Γνωρίσας ἐπὶ Σταυροῦ, Υἱὸν Θεοῦ…
ltx/gr_gr_cog/me.m10.d16:meMA.Ode3C11.melody	@ltx/gr_gr_cog/he.h.m4:heHE.EffrainetaiEpiSoi.name
ltx/gr_gr_cog/me.m10.d16:meMA.Ode3C11.mode	@ltx/gr_gr_cog/miscellanea:misc.Mode4
ltx/gr_gr_cog/me.m10.d16:meMA.Ode3C11.ode	@ltx/gr_gr_cog/miscellanea:misc.Ode3
ltx/gr_gr_cog/me.m10.d16:meMA.Ode3C11.text	Γνωρίσας ἐπὶ Σταυροῦ, Υἱὸν Θεοῦ τὸν ἀληθῆ Κύριον, ὑπὲρ ἡμῶν πάσχοντα, τούτῳ ὁλοψύχως ἐπίστευσας.
ltx/gr_gr_cog/me.m10.d16:meMA.Ode3C12.incipit	Γῆ ὥσπερ πίων ἡ σή…
ltx/gr_gr_cog/me.m10.d16:meMA.Ode3C12.melody	@ltx/gr_gr_cog/he.h.m4:heHE.EffrainetaiEpiSoi.name
ltx/gr_gr_cog/me.m10.d16:meMA.Ode3C12.mode	@ltx/gr_gr_cog/miscellanea:misc.Mode4
ltx/gr_gr_cog/me.m10.d16:meMA.Ode3C12.ode	@ltx/gr_gr_cog/miscellanea:misc.Ode3
ltx/gr_gr_cog/me.m10.d16:meMA.Ode3C12.text	Γῆ ὥσπερ πίων ἡ σή, ψυχὴ λαβοῦσα λογικὰ σπέρματα, στάχυν Σοφὲ ὥριμον, θείας εὐσεβείας ἐβλάστησεν.
ltx/gr_gr_cog/me.m10.d16:meMA.Ode3C13.incipit	Ἱστίῳ τῷ τοῦ Σταυροῦ, τὸ…
ltx/gr_gr_cog/me.m10.d16:meMA.Ode3C13.melody	@ltx/gr_gr_cog/he.h.m4:heHE.EffrainetaiEpiSoi.name
ltx/gr_gr_cog/me.m10.d16:meMA.Ode3C13.mode	@ltx/gr_gr_cog/miscellanea:misc.Mode4
ltx/gr_gr_cog/me.m10.d16:meMA.Ode3C13.ode	@ltx/gr_gr_cog/miscellanea:misc.Ode3
ltx/gr_gr_cog/me.m10.d16:meMA.Ode3C13.text	Ἱστίῳ τῷ τοῦ Σταυροῦ, τὸ τῶν βασάνων διελθὼν πέλαγος, τοὺς γαληνοὺς ἔφθασας, ἔνδοξε λιμένας γηθόμενος.
ltx/gr_gr_cog/me.m10.d16:meMA.Ode3C1T.incipit	Νοσοῦσάν μου τὴν ψυχήν, ταῖς…
ltx/gr_gr_cog/me.m10.d16:meMA.Ode3C1T.melody	@ltx/gr_gr_cog/he.h.m4:heHE.EffrainetaiEpiSoi.name
ltx/gr_gr_cog/me.m10.d16:meMA.Ode3C1T.mode	@ltx/gr_gr_cog/miscellanea:misc.Mode4
ltx/gr_gr_cog/me.m10.d16:meMA.Ode3C1T.ode	@ltx/gr_gr_cog/miscellanea:misc.Ode3
ltx/gr_gr_cog/me.m10.d16:meMA.Ode3C1T.text	Νοσοῦσάν μου τὴν ψυχήν, ταῖς τῶν παθῶν ἐπαγωγαῖς ἴασαι, Μήτηρ Θεοῦ Πάναγνε, καὶ πρὸς σωτηρίαν κατεύθυνον.
ltx/gr_gr_cog/me.m10.d16:meMA.Ode3H.greekmelody	@ltx/gr_gr_cog/he.h.m4:heHE.EffrainetaiEpiSoi.greekname
ltx/gr_gr_cog/me.m10.d16:meMA.Ode3H.incipit	@ltx/gr_gr_cog/he.h.m4:heHE.EffrainetaiEpiSoi.incipit
ltx/gr_gr_cog/me.m10.d16:meMA.Ode3H.melody	@ltx/gr_gr_cog/he.h.m4:heHE.EffrainetaiEpiSoi.melody
ltx/gr_gr_cog/me.m10.d16:meMA.Ode3H.mode	@ltx/gr_gr_cog/miscellanea:misc.Mode4
ltx/gr_gr_cog/me.m10.d16:meMA.Ode3H.ode	@ltx/gr_gr_cog/miscellanea:misc.Ode3
ltx/gr_gr_cog/me.m10.d16:meMA.Ode3H.text	@ltx/gr_gr_cog/he.h.m4:heHE.EffrainetaiEpiSoi.text
ltx/gr_gr_cog/me.m10.d16:meMA.Ode3Kathisma1.greekmelody	@ltx/gr_gr_cog/he.a.m8:heAU.TinSofianKaiLogon.greekname
ltx/gr_gr_cog/me.m10.d16:meMA.Ode3Kathisma1.incipit	Σταυρωθέντα κατεῖδες τὸν Λυτρωτήν, καὶ…
ltx/gr_gr_cog/me.m10.d16:meMA.Ode3Kathisma1.melody	@ltx/gr_gr_cog/he.a.m8:heAU.TinSofianKaiLogon.name
ltx/gr_gr_cog/me.m10.d16:meMA.Ode3Kathisma1.mode	@ltx/gr_gr_cog/miscellanea:misc.Mode8
ltx/gr_gr_cog/me.m10.d16:meMA.Ode3Kathisma1.text	Σταυρωθέντα κατεῖδες τὸν Λυτρωτήν, καὶ αὐτοῦ ταῖς ἀκτῖσι καταυγασθείς, σκότος τὸ βαθύτατον, τῆς ἀγνοίας ἀπέφυγες, καὶ πρὸς θείαν γνῶσιν, σαυτὸν μετεῤῥύθμισας, πιστωθεὶς ὡς ἔστι, Θεὸς ὁ ὁρώμενος· ὅθεν καὶ ἀθλήσας, τοῖς χοροῖς ἠριθμήθης, Λογγῖνε μακάριε, τῶν Μαρτύρων γηθόμενος, μεθʼ ὧν πάντοτε ἔνδοξε, πρέσβευε Χριστῷ τῷ Θεῷ, τῶν πταισμάτων ἄφεσιν δωρήσασθαι, τοῖς ἑορτάζουσι πόθῳ, τὴν ἁγίαν μνήμην σου.
ltx/gr_gr_cog/me.m10.d16:meMA.Ode3KathismaSt.incipit	@ltx/gr_gr_cog/oc.m8.d4:ocMA.Kathisma13.incipit
ltx/gr_gr_cog/me.m10.d16:meMA.Ode3KathismaSt.melody	@ltx/gr_gr_cog/he.a.m8:heAU.TinSofianKaiLogon.name
ltx/gr_gr_cog/me.m10.d16:meMA.Ode3KathismaSt.mode	@ltx/gr_gr_cog/miscellanea:misc.Mode8
ltx/gr_gr_cog/me.m10.d16:meMA.Ode3KathismaSt.text	@ltx/gr_gr_cog/oc.m8.d4:ocMA.Kathisma13.text
ltx/gr_gr_cog/me.m10.d16:meMA.Ode3KathismaT.incipit	Τὴν ψυχήν μου Παρθένε, τὴν…
ltx/gr_gr_cog/me.m10.d16:meMA.Ode3KathismaT.melody	@ltx/gr_gr_cog/he.a.m8:heAU.TinSofianKaiLogon.name
ltx/gr_gr_cog/me.m10.d16:meMA.Ode3KathismaT.mode	@ltx/gr_gr_cog/miscellanea:misc.Mode8
ltx/gr_gr_cog/me.m10.d16:meMA.Ode3KathismaT.text	Τὴν ψυχήν μου Παρθένε, τὴν ταπεινήν, τὴν ἐν ζάλῃ τοῦ βίου τῶν πειρασμῶν, νῦν ὡς ἀκυβέρνητον, ποντουμένην Πανάμωμε, ἁμαρτιῶν τῷ φόρτῳ, φανεῖσαν ὑπέραντλον, καὶ εἰς πυθμένα ᾍδου, πεσεῖν κινδυνεύουσαν· φθάσον Θεοτόκε, τῇ θερμῇ σου πρεσβείᾳ, καὶ σῶσον παρέχουσα, σὸν λιμένα τὸν εὔδιον, ἵνα πίστει κραυγάζω σοι· Πρέσβευε τῷ σῷ Υἱῷ καὶ Θεῷ, τῶν πταισμάτων δοῦναί μοι τὴν ἄφεσιν· σὲ γὰρ ἔχω ἐλπίδα, ὁ δοῦλός σου Δέσποινα.
ltx/gr_gr_cog/me.m10.d16:meMA.Ode4C11.greekmelody	@ltx/gr_gr_cog/he.h.m4:heHE.EparthentaSeIdousa.greekname
ltx/gr_gr_cog/me.m10.d16:meMA.Ode4C11.incipit	Ὀχυρώτατον κτησάμενος ἐν τῇ πίστει…
ltx/gr_gr_cog/me.m10.d16:meMA.Ode4C11.melody	@ltx/gr_gr_cog/he.h.m4:heHE.EparthentaSeIdousa.name
ltx/gr_gr_cog/me.m10.d16:meMA.Ode4C11.mode	@ltx/gr_gr_cog/miscellanea:misc.Mode4
ltx/gr_gr_cog/me.m10.d16:meMA.Ode4C11.ode	@ltx/gr_gr_cog/miscellanea:misc.Ode4
ltx/gr_gr_cog/me.m10.d16:meMA.Ode4C11.text	Ὀχυρώτατον κτησάμενος ἐν τῇ πίστει, τὸν λογισμὸν μακάριε, ἀνίσχυρον πλάνης, ἔλυσας ὀχύρωμα, Λογγῖνε καὶ ἔκραζες· Δόξα τῇ δυνάμει σου Κύριε.
ltx/gr_gr_cog/me.m10.d16:meMA.Ode4C12.incipit	Ὑψωθέντα καὶ τῷ ξύλῳ προσηλωθέντα…
ltx/gr_gr_cog/me.m10.d16:meMA.Ode4C12.melody	@ltx/gr_gr_cog/he.h.m4:heHE.EparthentaSeIdousa.name
ltx/gr_gr_cog/me.m10.d16:meMA.Ode4C12.mode	@ltx/gr_gr_cog/miscellanea:misc.Mode4
ltx/gr_gr_cog/me.m10.d16:meMA.Ode4C12.ode	@ltx/gr_gr_cog/miscellanea:misc.Ode4
ltx/gr_gr_cog/me.m10.d16:meMA.Ode4C12.text	Ὑψωθέντα καὶ τῷ ξύλῳ προσηλωθέντα, τὸν ἀπαθῆ θεώμενος, Κύριον τῆς δόξης, τοῦτον ὡμολόγησας, Υἱὸν Θεοῦ ἔνδοξε, πάσχοντα οἰκείῳ θελήματι.
ltx/gr_gr_cog/me.m10.d16:meMA.Ode4C13.incipit	Μαραινόμενον τὸν θάνατον τῷ θανάτῳ…
ltx/gr_gr_cog/me.m10.d16:meMA.Ode4C13.melody	@ltx/gr_gr_cog/he.h.m4:heHE.EparthentaSeIdousa.name
ltx/gr_gr_cog/me.m10.d16:meMA.Ode4C13.mode	@ltx/gr_gr_cog/miscellanea:misc.Mode4
ltx/gr_gr_cog/me.m10.d16:meMA.Ode4C13.ode	@ltx/gr_gr_cog/miscellanea:misc.Ode4
ltx/gr_gr_cog/me.m10.d16:meMA.Ode4C13.text	Μαραινόμενον τὸν θάνατον τῷ θανάτῳ, τοῦ ἀπαθοῦς θεώμενος, ἔσπευσας Λογγῖνε, διʼ αὐτὸν τεθνήξεσθαι, καὶ ζῆν μετὰ θάνατον, σὺν τοῖς εὐκλεῶς ἐναθλήσασιν.
ltx/gr_gr_cog/me.m10.d16:meMA.Ode4C1T.incipit	Ἑνωθέντα καθʼ ὑπόστασιν ἐν γαστρί…
ltx/gr_gr_cog/me.m10.d16:meMA.Ode4C1T.melody	@ltx/gr_gr_cog/he.h.m4:heHE.EparthentaSeIdousa.name
ltx/gr_gr_cog/me.m10.d16:meMA.Ode4C1T.mode	@ltx/gr_gr_cog/miscellanea:misc.Mode4
ltx/gr_gr_cog/me.m10.d16:meMA.Ode4C1T.ode	@ltx/gr_gr_cog/miscellanea:misc.Ode4
ltx/gr_gr_cog/me.m10.d16:meMA.Ode4C1T.text	Ἑνωθέντα καθʼ ὑπόστασιν ἐν γαστρί σου, καὶ γεγονότα ἄνθρωπον, Ἄχραντε τὸν Λόγον, ὑπὲρ λόγον τέτοκας, διπλοῦν ταῖς θελήσεσι, καὶ ταῖς ἐνεργείαις δεικνύμενον.
ltx/gr_gr_cog/me.m10.d16:meMA.Ode5C11.greekmelody	@ltx/gr_gr_cog/he.h.m4:heHE.SyKyrieMouFos.greekname
ltx/gr_gr_cog/me.m10.d16:meMA.Ode5C11.incipit	Γῆς πάσης ἀληθῶς, γεγονὼς παρεπίδημος…
ltx/gr_gr_cog/me.m10.d16:meMA.Ode5C11.melody	@ltx/gr_gr_cog/he.h.m4:heHE.SyKyrieMouFos.name
ltx/gr_gr_cog/me.m10.d16:meMA.Ode5C11.mode	@ltx/gr_gr_cog/miscellanea:misc.Mode4
ltx/gr_gr_cog/me.m10.d16:meMA.Ode5C11.ode	@ltx/gr_gr_cog/miscellanea:misc.Ode5
ltx/gr_gr_cog/me.m10.d16:meMA.Ode5C11.text	Γῆς πάσης ἀληθῶς, γεγονὼς παρεπίδημος, ἐν στίγμασιν Ἀθλοφόρων, ὡραιώθης Λογγῖνε, καὶ γῆν πραέων ᾤκησας.
ltx/gr_gr_cog/me.m10.d16:meMA.Ode5C12.incipit	Ἴσχυσας τοῦ Σταυροῦ, τῇ δυνάμει…
ltx/gr_gr_cog/me.m10.d16:meMA.Ode5C12.melody	@ltx/gr_gr_cog/he.h.m4:heHE.SyKyrieMouFos.name
ltx/gr_gr_cog/me.m10.d16:meMA.Ode5C12.mode	@ltx/gr_gr_cog/miscellanea:misc.Mode4
ltx/gr_gr_cog/me.m10.d16:meMA.Ode5C12.ode	@ltx/gr_gr_cog/miscellanea:misc.Ode5
ltx/gr_gr_cog/me.m10.d16:meMA.Ode5C12.text	Ἴσχυσας τοῦ Σταυροῦ, τῇ δυνάμει φραξάμενος, ἀνίσχυρον τῶν τυράννων, Ἀθλοφόρε Λογγῖνε, τροπώσασθαι ἀπόνοιαν.
ltx/gr_gr_cog/me.m10.d16:meMA.Ode5C13.incipit	Στήσας ἐν ἀσφαλεῖ, θεμελίῳ καρδίας…
ltx/gr_gr_cog/me.m10.d16:meMA.Ode5C13.melody	@ltx/gr_gr_cog/he.h.m4:heHE.SyKyrieMouFos.name
ltx/gr_gr_cog/me.m10.d16:meMA.Ode5C13.mode	@ltx/gr_gr_cog/miscellanea:misc.Mode4
ltx/gr_gr_cog/me.m10.d16:meMA.Ode5C13.ode	@ltx/gr_gr_cog/miscellanea:misc.Ode5
ltx/gr_gr_cog/me.m10.d16:meMA.Ode5C13.text	Στήσας ἐν ἀσφαλεῖ, θεμελίῳ καρδίας σου, Ἀήττητε τὰς κινήσεις, πειρασμῶν ἐπικλύσει, ἀσάλευτος διέμεινας.
ltx/gr_gr_cog/me.m10.d16:meMA.Ode5C1T.incipit	Τὴν μόνην τὸν Θεόν, ἀπειράνδρως…
ltx/gr_gr_cog/me.m10.d16:meMA.Ode5C1T.melody	@ltx/gr_gr_cog/he.h.m4:heHE.SyKyrieMouFos.name
ltx/gr_gr_cog/me.m10.d16:meMA.Ode5C1T.mode	@ltx/gr_gr_cog/miscellanea:misc.Mode4
ltx/gr_gr_cog/me.m10.d16:meMA.Ode5C1T.ode	@ltx/gr_gr_cog/miscellanea:misc.Ode5
ltx/gr_gr_cog/me.m10.d16:meMA.Ode5C1T.text	Τὴν μόνην τὸν Θεόν, ἀπειράνδρως κυήσασαν, ὑμνήσωμεν Θεοτόκον, διʼ αὐτῆς οἱ σωθέντες, καὶ πόθῳ μακαρίσωμεν.
ltx/gr_gr_cog/me.m10.d16:meMA.Ode6C11.greekmelody	@ltx/gr_gr_cog/he.h.m4:heHE.ThysoSoiMetaFonis.greekname
ltx/gr_gr_cog/me.m10.d16:meMA.Ode6C11.incipit	Ὄρη τε, καὶ τὴν γῆν…
ltx/gr_gr_cog/me.m10.d16:meMA.Ode6C11.melody	@ltx/gr_gr_cog/he.h.m4:heHE.ThysoSoiMetaFonis.name
ltx/gr_gr_cog/me.m10.d16:meMA.Ode6C11.mode	@ltx/gr_gr_cog/miscellanea:misc.Mode4
ltx/gr_gr_cog/me.m10.d16:meMA.Ode6C11.ode	@ltx/gr_gr_cog/miscellanea:misc.Ode6
ltx/gr_gr_cog/me.m10.d16:meMA.Ode6C11.text	Ὄρη τε, καὶ τὴν γῆν σαλευθεῖσαν θεώμενος, ἐν τῇ τοῦ πάθους ἡμέρᾳ, ἀπιστίας στάσεως ἐσαλεύθης, καὶ τῇ πίστει, ἐνιδρύθης Λογγῖνε τοῦ πάσχοντος.
ltx/gr_gr_cog/me.m10.d16:meMA.Ode6C12.incipit	Νόησιν, ἀληθῆ καὶ τελείαν καὶ…
ltx/gr_gr_cog/me.m10.d16:meMA.Ode6C12.melody	@ltx/gr_gr_cog/he.h.m4:heHE.ThysoSoiMetaFonis.name
ltx/gr_gr_cog/me.m10.d16:meMA.Ode6C12.mode	@ltx/gr_gr_cog/miscellanea:misc.Mode4
ltx/gr_gr_cog/me.m10.d16:meMA.Ode6C12.ode	@ltx/gr_gr_cog/miscellanea:misc.Ode6
ltx/gr_gr_cog/me.m10.d16:meMA.Ode6C12.text	Νόησιν, ἀληθῆ καὶ τελείαν καὶ ἔμφρονα, ἀναλαβεῖν ἠδυνήθης, καθορῶν τὴν κτίσιν ἀλλοιουμένην, καὶ πρὸς θεῖαν, ἠλλοιώθης Λογγῖνε ἐπίγνωσιν.
ltx/gr_gr_cog/me.m10.d16:meMA.Ode6C13.incipit	Ὑπέστης, χαλεπὴν τιμωρίαν γηθόμενος, καὶ…
ltx/gr_gr_cog/me.m10.d16:meMA.Ode6C13.melody	@ltx/gr_gr_cog/he.h.m4:heHE.ThysoSoiMetaFonis.name
ltx/gr_gr_cog/me.m10.d16:meMA.Ode6C13.mode	@ltx/gr_gr_cog/miscellanea:misc.Mode4
ltx/gr_gr_cog/me.m10.d16:meMA.Ode6C13.ode	@ltx/gr_gr_cog/miscellanea:misc.Ode6
ltx/gr_gr_cog/me.m10.d16:meMA.Ode6C13.text	Ὑπέστης, χαλεπὴν τιμωρίαν γηθόμενος, καὶ τὸν αὐχένα τῷ ξίφει, ἀδιστάκτῳ γνώμῃ τμηθεὶς Λογγῖνε, διακόπτεις, κεφαλὰς δυσμενῶν διὰ πίστεως.
ltx/gr_gr_cog/me.m10.d16:meMA.Ode6C1T.incipit	Μάρανον, καὶ προῤῥίζους Πανάμωμε ἔκτιλον…
ltx/gr_gr_cog/me.m10.d16:meMA.Ode6C1T.melody	@ltx/gr_gr_cog/he.h.m4:heHE.ThysoSoiMetaFonis.name
ltx/gr_gr_cog/me.m10.d16:meMA.Ode6C1T.mode	@ltx/gr_gr_cog/miscellanea:misc.Mode4
ltx/gr_gr_cog/me.m10.d16:meMA.Ode6C1T.ode	@ltx/gr_gr_cog/miscellanea:misc.Ode6
ltx/gr_gr_cog/me.m10.d16:meMA.Ode6C1T.text	Μάρανον, καὶ προῤῥίζους Πανάμωμε ἔκτιλον, τὰς ἀκανθώδεις ἐννοίας, τῆς ἐμῆς καρδίας, καὶ καρποφόρον, ταύτην δεῖξον, μεσιτείᾳ σου Κόρη πανάμωμε.
ltx/gr_gr_cog/me.m10.d16:meMA.Ode6H.greekmelody	@ltx/gr_gr_cog/he.h.m4:heHE.ThysoSoiMetaFonis.greekname
ltx/gr_gr_cog/me.m10.d16:meMA.Ode6H.incipit	@ltx/gr_gr_cog/he.h.m4:heHE.ThysoSoiMetaFonis.incipit
ltx/gr_gr_cog/me.m10.d16:meMA.Ode6H.melody	@ltx/gr_gr_cog/he.h.m4:heHE.ThysoSoiMetaFonis.melody
ltx/gr_gr_cog/me.m10.d16:meMA.Ode6H.mode	@ltx/gr_gr_cog/miscellanea:misc.Mode4
ltx/gr_gr_cog/me.m10.d16:meMA.Ode6H.ode	@ltx/gr_gr_cog/miscellanea:misc.Ode6
ltx/gr_gr_cog/me.m10.d16:meMA.Ode6H.text	@ltx/gr_gr_cog/he.h.m4:heHE.ThysoSoiMetaFonis.text
ltx/gr_gr_cog/me.m10.d16:meMA.Ode7C11.greekmelody	@ltx/gr_gr_cog/he.h.m4:heHE.EnTiKaminoAvramiaioi.greekname
ltx/gr_gr_cog/me.m10.d16:meMA.Ode7C11.incipit	Νομίμως Μάρτυς, ἐναθλήσας ἀνδρείᾳ γνώμῃ…
ltx/gr_gr_cog/me.m10.d16:meMA.Ode7C11.melody	@ltx/gr_gr_cog/he.h.m4:heHE.EnTiKaminoAvramiaioi.name
ltx/gr_gr_cog/me.m10.d16:meMA.Ode7C11.mode	@ltx/gr_gr_cog/miscellanea:misc.Mode4
ltx/gr_gr_cog/me.m10.d16:meMA.Ode7C11.ode	@ltx/gr_gr_cog/miscellanea:misc.Ode7
ltx/gr_gr_cog/me.m10.d16:meMA.Ode7C11.text	Νομίμως Μάρτυς, ἐναθλήσας ἀνδρείᾳ γνώμῃ ψυχῆς, πάσας ἀνομούντων ᾔσχυνας τὰς βουλάς, καὶ νομίμως ἐστεφάνωσαι· Εὐλογημένος εἶ ἀναβοῶν, τῆς δόξης ὁ Κύριος.
ltx/gr_gr_cog/me.m10.d16:meMA.Ode7C12.incipit	Ἡ θεία χάρις, ἐπιφοιτῶσα τοῖς…
ltx/gr_gr_cog/me.m10.d16:meMA.Ode7C12.melody	@ltx/gr_gr_cog/he.h.m4:heHE.EnTiKaminoAvramiaioi.name
ltx/gr_gr_cog/me.m10.d16:meMA.Ode7C12.mode	@ltx/gr_gr_cog/miscellanea:misc.Mode4
ltx/gr_gr_cog/me.m10.d16:meMA.Ode7C12.ode	@ltx/gr_gr_cog/miscellanea:misc.Ode7
ltx/gr_gr_cog/me.m10.d16:meMA.Ode7C12.text	Ἡ θεία χάρις, ἐπιφοιτῶσα τοῖς λειψάνοις σου, πᾶσαν ἀλγηδόνα λύει τῶν εὐσεβῶς, προσιόντων σοι Μακάριε, καὶ κηρυττόντων σε, ἀληθείας ἀήττητον Μάρτυρα.
ltx/gr_gr_cog/me.m10.d16:meMA.Ode7C13.incipit	Σαρκὸς θνῃσκούσης, οὐκ ἐφείσω Λογγῖνε…
ltx/gr_gr_cog/me.m10.d16:meMA.Ode7C13.melody	@ltx/gr_gr_cog/he.h.m4:heHE.EnTiKaminoAvramiaioi.name
ltx/gr_gr_cog/me.m10.d16:meMA.Ode7C13.mode	@ltx/gr_gr_cog/miscellanea:misc.Mode4
ltx/gr_gr_cog/me.m10.d16:meMA.Ode7C13.ode	@ltx/gr_gr_cog/miscellanea:misc.Ode7
ltx/gr_gr_cog/me.m10.d16:meMA.Ode7C13.text	Σαρκὸς θνῃσκούσης, οὐκ ἐφείσω Λογγῖνε διὰ Χριστόν, θύειν ἀπηρνήσω δαίμοσι καὶ σαυτόν, τῷ Θεῷ θυσίαν ἄμωμον, χαίρων προσήγαγες, διὰ ξίφους τμηθεὶς ἀξιάγαστε.
ltx/gr_gr_cog/me.m10.d16:meMA.Ode7C1T.incipit	Ὡς καθαράν σε, ὁ καθαρὸς…
ltx/gr_gr_cog/me.m10.d16:meMA.Ode7C1T.melody	@ltx/gr_gr_cog/he.h.m4:heHE.EnTiKaminoAvramiaioi.name
ltx/gr_gr_cog/me.m10.d16:meMA.Ode7C1T.mode	@ltx/gr_gr_cog/miscellanea:misc.Mode4
ltx/gr_gr_cog/me.m10.d16:meMA.Ode7C1T.ode	@ltx/gr_gr_cog/miscellanea:misc.Ode7
ltx/gr_gr_cog/me.m10.d16:meMA.Ode7C1T.text	Ὡς καθαράν σε, ὁ καθαρὸς Λόγος κατῴκησε, Κόρη διὰ σοῦ καθάραι τοὺς μολυσμοὺς τῶν ἀνθρώπων προελόμενος· εὐλογημένος γὰρ ὁ καρπός, τῆς κοιλίας σου πέφυκεν.
ltx/gr_gr_cog/me.m10.d16:meMA.Ode8C11.greekmelody	@ltx/gr_gr_cog/he.h.m4:heHE.CheirasEkpetasasDaniil.greekname
ltx/gr_gr_cog/me.m10.d16:meMA.Ode8C11.incipit	Κοιμίσας τὸ πρὶν τὰς τῆς…
ltx/gr_gr_cog/me.m10.d16:meMA.Ode8C11.melody	@ltx/gr_gr_cog/he.h.m4:heHE.CheirasEkpetasasDaniil.name
ltx/gr_gr_cog/me.m10.d16:meMA.Ode8C11.mode	@ltx/gr_gr_cog/miscellanea:misc.Mode4
ltx/gr_gr_cog/me.m10.d16:meMA.Ode8C11.ode	@ltx/gr_gr_cog/miscellanea:misc.Ode8
ltx/gr_gr_cog/me.m10.d16:meMA.Ode8C11.text	Κοιμίσας τὸ πρὶν τὰς τῆς σαρκός, κινήσεις Ἔνδοξε, ταῖς ἐγρηγόρσεσι, ταῖς πρὸς τὸν Κύριον ὕπνωσας, τὸν γλυκὺν ὕπνον ἀοίδιμε, θανατωθεὶς διὰ Χριστόν, τὸν ἐπὶ ξύλου Σταυροῦ, ἀφυπνώσει θείᾳ, νεκροῖς τὴν ζωὴν ἀναβλύσαντα.
ltx/gr_gr_cog/me.m10.d16:meMA.Ode8C12.incipit	Λόγχῃ κεντηθέντα τὴν πλευράν, Μακαριώτατε…
ltx/gr_gr_cog/me.m10.d16:meMA.Ode8C12.melody	@ltx/gr_gr_cog/he.h.m4:heHE.CheirasEkpetasasDaniil.name
ltx/gr_gr_cog/me.m10.d16:meMA.Ode8C12.mode	@ltx/gr_gr_cog/miscellanea:misc.Mode4
ltx/gr_gr_cog/me.m10.d16:meMA.Ode8C12.ode	@ltx/gr_gr_cog/miscellanea:misc.Ode8
ltx/gr_gr_cog/me.m10.d16:meMA.Ode8C12.text	Λόγχῃ κεντηθέντα τὴν πλευράν, Μακαριώτατε, καὶ αἷμα βλύσαντα, Θεὸν ἑώρακας ἄνθρωπον, διὰ σπλάγχνα χρηματίσαντα, καὶ κατετρώθης τῷ αὐτοῦ ἡδίστῳ ἔρωτι, ἀναμέλπων· Πάντα τὰ ἔργα ὑμνεῖτε τὸν Κύριον.
ltx/gr_gr_cog/me.m10.d16:meMA.Ode8C13.incipit	Ἔσβεσας πυρὰν εἰδωλικήν, αἱμάτων ῥεύμασι…
ltx/gr_gr_cog/me.m10.d16:meMA.Ode8C13.melody	@ltx/gr_gr_cog/he.h.m4:heHE.CheirasEkpetasasDaniil.name
ltx/gr_gr_cog/me.m10.d16:meMA.Ode8C13.mode	@ltx/gr_gr_cog/miscellanea:misc.Mode4
ltx/gr_gr_cog/me.m10.d16:meMA.Ode8C13.ode	@ltx/gr_gr_cog/miscellanea:misc.Ode8
ltx/gr_gr_cog/me.m10.d16:meMA.Ode8C13.text	Ἔσβεσας πυρὰν εἰδωλικήν, αἱμάτων ῥεύμασι, Λογγῖνε πάνσοφε, καὶ κατενέπρησας ξόανα, καὶ ἀνίδρυτα σεβάσματα, τῷ θείῳ ζήλῳ τὴν ψυχὴν ἀναφλεγόμενος, καὶ κραυγάζων· Πάντα τὰ ἔργα ὑμνεῖτε τὸν Κύριον.
ltx/gr_gr_cog/me.m10.d16:meMA.Ode8C14.incipit	Ὄμματα καρδίας φωτισθείς, ταῖς θείαις…
ltx/gr_gr_cog/me.m10.d16:meMA.Ode8C14.melody	@ltx/gr_gr_cog/he.h.m4:heHE.CheirasEkpetasasDaniil.name
ltx/gr_gr_cog/me.m10.d16:meMA.Ode8C14.mode	@ltx/gr_gr_cog/miscellanea:misc.Mode4
ltx/gr_gr_cog/me.m10.d16:meMA.Ode8C14.ode	@ltx/gr_gr_cog/miscellanea:misc.Ode8
ltx/gr_gr_cog/me.m10.d16:meMA.Ode8C14.text	Ὄμματα καρδίας φωτισθείς, ταῖς θείαις λάμψεσι, τοῦ ἀμαυρώσαντος ἡλίου πάνσοφε ἔλλαμψιν, τὴν ἀχλὺν Λογγῖνε ἔλιπες, τῆς δυσσεβείας καὶ φωστήρ, ὤφθης φωτίζων ἡμᾶς, τοὺς βοῶντας· Πάντα τὰ ἔργα ὑμνεῖτε τὸν Κύριον.
ltx/gr_gr_cog/me.m10.d16:meMA.Ode8C1T.incipit	Στόματι καὶ γλώσσῃ καὶ ψυχῇ…
ltx/gr_gr_cog/me.m10.d16:meMA.Ode8C1T.melody	@ltx/gr_gr_cog/he.h.m4:heHE.CheirasEkpetasasDaniil.name
ltx/gr_gr_cog/me.m10.d16:meMA.Ode8C1T.mode	@ltx/gr_gr_cog/miscellanea:misc.Mode4
ltx/gr_gr_cog/me.m10.d16:meMA.Ode8C1T.ode	@ltx/gr_gr_cog/miscellanea:misc.Ode8
ltx/gr_gr_cog/me.m10.d16:meMA.Ode8C1T.text	Στόματι καὶ γλώσσῃ καὶ ψυχῇ, ἀνακηρύττω σε θεογεννήτριαν, καὶ ἱκετεύω σε Ἄχραντε· Τὴν καρδίαν μου κατάγαυσον, τῷ φωτισμῷ σου, καὶ δεινοῦ σκότους με λύτρωσαι, ἐκβοῶντα· Πάντα τὰ ἔργα ὑμνεῖτε τὸν Κύριον.
ltx/gr_gr_cog/me.m10.d16:meMA.Ode8H.greekmelody	@ltx/gr_gr_cog/he.h.m4:heHE.CheirasEkpetasasDaniil.greekname
ltx/gr_gr_cog/me.m10.d16:meMA.Ode8H.incipit	@ltx/gr_gr_cog/he.h.m4:heHE.CheirasEkpetasasDaniil.incipit
ltx/gr_gr_cog/me.m10.d16:meMA.Ode8H.melody	@ltx/gr_gr_cog/he.h.m4:heHE.CheirasEkpetasasDaniil.melody
ltx/gr_gr_cog/me.m10.d16:meMA.Ode8H.mode	@ltx/gr_gr_cog/miscellanea:misc.Mode4
ltx/gr_gr_cog/me.m10.d16:meMA.Ode8H.ode	@ltx/gr_gr_cog/miscellanea:misc.Ode8
ltx/gr_gr_cog/me.m10.d16:meMA.Ode8H.text	@ltx/gr_gr_cog/he.h.m4:heHE.CheirasEkpetasasDaniil.text
ltx/gr_gr_cog/me.m10.d16:meMA.Ode9C11.greekmelody	@ltx/gr_gr_cog/he.h.m4:heHE.LithosAcheirotmitos.greekname
ltx/gr_gr_cog/me.m10.d16:meMA.Ode9C11.incipit	Ἰσχύς μου καὶ ὕμνησις Λόγος…
ltx/gr_gr_cog/me.m10.d16:meMA.Ode9C11.melody	@ltx/gr_gr_cog/he.h.m4:heHE.LithosAcheirotmitos.name
ltx/gr_gr_cog/me.m10.d16:meMA.Ode9C11.mode	@ltx/gr_gr_cog/miscellanea:misc.Mode4
ltx/gr_gr_cog/me.m10.d16:meMA.Ode9C11.ode	@ltx/gr_gr_cog/miscellanea:misc.Ode9
ltx/gr_gr_cog/me.m10.d16:meMA.Ode9C11.text	Ἰσχύς μου καὶ ὕμνησις Λόγος, ὁ ἐν Σταυρῷ χεῖρας ἁπλώσας, Μάρτυς τοῖς ἀνόμοις ἐβόας, αὐτοῦ τὸ πάθος τὸ παμμακάριστον, ἐξεικονίζων θάνατον, ἐθελουσίως καθυφίσταμαι.
ltx/gr_gr_cog/me.m10.d16:meMA.Ode9C12.incipit	Ὡς περικαλὴς ἀθλοφόρος, χαριτωθεὶς Μάρτυς…
ltx/gr_gr_cog/me.m10.d16:meMA.Ode9C12.melody	@ltx/gr_gr_cog/he.h.m4:heHE.LithosAcheirotmitos.name
ltx/gr_gr_cog/me.m10.d16:meMA.Ode9C12.mode	@ltx/gr_gr_cog/miscellanea:misc.Mode4
ltx/gr_gr_cog/me.m10.d16:meMA.Ode9C12.ode	@ltx/gr_gr_cog/miscellanea:misc.Ode9
ltx/gr_gr_cog/me.m10.d16:meMA.Ode9C12.text	Ὡς περικαλὴς ἀθλοφόρος, χαριτωθεὶς Μάρτυς Λογγῖνε, ὅλος ὡραιότατος ὤφθης, καὶ τῷ ὡραίῳ Λόγῳ παρίστασαι, τὰς ἀμοιβὰς τῶν πόνων σου, πλουσιωτάτως κομιζόμενος.
ltx/gr_gr_cog/me.m10.d16:meMA.Ode9C13.incipit	Σὲ τὸν διαυγίᾳ φανέντα, ἥλιον…
ltx/gr_gr_cog/me.m10.d16:meMA.Ode9C13.melody	@ltx/gr_gr_cog/he.h.m4:heHE.LithosAcheirotmitos.name
ltx/gr_gr_cog/me.m10.d16:meMA.Ode9C13.mode	@ltx/gr_gr_cog/miscellanea:misc.Mode4
ltx/gr_gr_cog/me.m10.d16:meMA.Ode9C13.ode	@ltx/gr_gr_cog/miscellanea:misc.Ode9
ltx/gr_gr_cog/me.m10.d16:meMA.Ode9C13.text	Σὲ τὸν διαυγίᾳ φανέντα, ἥλιον ἄδυτον Λογγῖνε, καὶ μαρμαρυγαῖς ἰαμάτων, τὴν οἰκουμένην πᾶσαν φωτίζοντα, καὶ τὴν ἀχλὺν σκεδάζοντα, τῆς ἀγνωσίας μακαρίζομεν.
ltx/gr_gr_cog/me.m10.d16:meMA.Ode9C14.incipit	Ἤρθης πρὸς μονὰς οὐρανίους, καὶ…
ltx/gr_gr_cog/me.m10.d16:meMA.Ode9C14.melody	@ltx/gr_gr_cog/he.h.m4:heHE.LithosAcheirotmitos.name
ltx/gr_gr_cog/me.m10.d16:meMA.Ode9C14.mode	@ltx/gr_gr_cog/miscellanea:misc.Mode4
ltx/gr_gr_cog/me.m10.d16:meMA.Ode9C14.ode	@ltx/gr_gr_cog/miscellanea:misc.Ode9
ltx/gr_gr_cog/me.m10.d16:meMA.Ode9C14.text	Ἤρθης πρὸς μονὰς οὐρανίους, καὶ τοῖς χοροῖς συνηριθμήθης, πάντων τῶν ἁγίων Μαρτύρων, μεθʼ ὧν Λογγῖνε Μάρτυς μνημόνευε, τῶν εὐσεβῶς τὴν μνήμην σου, ἑορταζόντων παμμακάριστε.
ltx/gr_gr_cog/me.m10.d16:meMA.Ode9C1T.incipit	Φωτὸς οἰκητήριον ὤφθης, τοῦ ἀνεσπέρου…
ltx/gr_gr_cog/me.m10.d16:meMA.Ode9C1T.melody	@ltx/gr_gr_cog/he.h.m4:heHE.LithosAcheirotmitos.name
ltx/gr_gr_cog/me.m10.d16:meMA.Ode9C1T.mode	@ltx/gr_gr_cog/miscellanea:misc.Mode4
ltx/gr_gr_cog/me.m10.d16:meMA.Ode9C1T.ode	@ltx/gr_gr_cog/miscellanea:misc.Ode9
ltx/gr_gr_cog/me.m10.d16:meMA.Ode9C1T.text	Φωτὸς οἰκητήριον ὤφθης, τοῦ ἀνεσπέρου Θεοτόκε, διʼ οὗ οἱ ἐν σκότει καὶ σκιᾷ, τῆς ἁμαρτίας φῶς ἐθεάσαντο· διό μου φωταγώγησον, τὰ τῆς καρδίας αἰσθητήρια.
ltx/gr_gr_cog/me.m10.d16:meMA.Ode9H.greekmelody	@ltx/gr_gr_cog/he.h.m4:heHE.LithosAcheirotmitos.greekname
ltx/gr_gr_cog/me.m10.d16:meMA.Ode9H.incipit	@ltx/gr_gr_cog/he.h.m4:heHE.LithosAcheirotmitos.incipit
ltx/gr_gr_cog/me.m10.d16:meMA.Ode9H.melody	@ltx/gr_gr_cog/he.h.m4:heHE.LithosAcheirotmitos.melody
ltx/gr_gr_cog/me.m10.d16:meMA.Ode9H.mode	@ltx/gr_gr_cog/miscellanea:misc.Mode4
ltx/gr_gr_cog/me.m10.d16:meMA.Ode9H.ode	@ltx/gr_gr_cog/miscellanea:misc.Ode9
ltx/gr_gr_cog/me.m10.d16:meMA.Ode9H.text	@ltx/gr_gr_cog/he.h.m4:heHE.LithosAcheirotmitos.text
ltx/gr_gr_cog/me.m10.d16:meMA.Oikos1.text	Τὸν οὐρανὸν σκότει πολλῷ, τὴν γῆν τε σειομένην, καὶ πέτρας ῥηγνυμένας, ναοῦ τε τὸ καταπέτασμα σχισθὲν εἰς δύο θεωρῶν ἐν τῷ θείῳ πάθει τοῦ Χριστοῦ ὁ ἀθλητής, Θεοῦ Υἱὸν αὐτὸν ἐγνώρισε, πάσχοντα τῇ οἰκείᾳ εὐσπλαγχνίᾳ, ἀπαθῆ δὲ ὄντα τῇ Θεότητι καὶ δόξῃ, σὺν τῷ Πατρὶ καὶ Πνεύματι Ἁγίῳ συνέχοντα τὸ πᾶν καὶ διακρατοῦντα, ὡς Θεὸν ἀληθινὸν καὶ Βασιλέα· ὅθεν ἐν χαρᾷ Λογγῖνος ἀνακραυγάζει· Σύ μου τὸ κράτος Χριστὲ καὶ στερέωμα.
ltx/gr_gr_cog/me.m10.d16:meVE.Apolytikion1ger.greekmelody	@ltx/gr_gr_cog/he.a.m1:heAU.TouLithouSfragisthentos.greekname
ltx/gr_gr_cog/me.m10.d16:meVE.Apolytikion1ger.incipit	Τὸν Ἥλιον τῆς δόξης Σταυρῷ…
ltx/gr_gr_cog/me.m10.d16:meVE.Apolytikion1ger.melody	@ltx/gr_gr_cog/he.a.m1:heAU.TouLithouSfragisthentos.name
ltx/gr_gr_cog/me.m10.d16:meVE.Apolytikion1ger.mode	@ltx/gr_gr_cog/miscellanea:misc.Mode1
ltx/gr_gr_cog/me.m10.d16:meVE.Apolytikion1ger.poet	@ltx/gr_gr_cog/poets:po.Gerasimou
ltx/gr_gr_cog/me.m10.d16:meVE.Apolytikion1ger.text	Τὸν Ἥλιον τῆς δόξης Σταυρῷ προσηλωθέντα, καὶ τοῖς ἐν σκιᾷ τοῦ θανάτου ἐκλάμποντα ὡς εἶδες, ηὐγάσθης αὐτοῦ ταῖς ἀστραπαῖς, καὶ ἤθλησας Λογγῖνε εὐσεβῶς· διὰ τοῦτο νοσημάτων παντοδαπῶν, λυτροῦσαι τοὺς ἐκβοῶντας· δόξα τῷ δεδωκότι σοι ἰσχύν, δόξα τῷ σὲ στεφανώσαντι, δόξα τῷ ἐνεργοῦντι διὰ σοῦ, πᾶσιν ἰάματα.
ltx/gr_gr_cog/me.m10.d16:meVE.AposGlory.incipit	Ἐν τῷ Σταυρῷ παρεστηκώς, καὶ…
ltx/gr_gr_cog/me.m10.d16:meVE.AposGlory.melody	
ltx/gr_gr_cog/me.m10.d16:meVE.AposGlory.mode	@ltx/gr_gr_cog/miscellanea:misc.Mode6
ltx/gr_gr_cog/me.m10.d16:meVE.AposGlory.poet	@ltx/gr_gr_cog/poets:po.IoannouMonachou
ltx/gr_gr_cog/me.m10.d16:meVE.AposGlory.text	Ἐν τῷ Σταυρῷ παρεστηκώς, καὶ τὰ γενόμενα σκοπῶν, τὸν σταυρωθέντα ἐπὶ ξύλου, Θεὸν καὶ ἄνθρωπον ἑωρακώς, ἐβόας πρὸς αὐτόν· Ἐν τῇ βασιλείᾳ σου μνήσθητί μου Κύριε. Διὸ καὶ ὁ Σωτὴρ ἐφώνει σοι· Μακάριος εἶ Λογγῖνε, καὶ τὸ μνημόσυνόν σου εἰς γενεὰν καὶ γενεάν.
ltx/gr_gr_cog/me.m10.d16:meVE.AposStavrotheotokion.greekmelody	@ltx/gr_gr_cog/he.a.m6:heAU.TriimerosAnestis.greekname
ltx/gr_gr_cog/me.m10.d16:meVE.AposStavrotheotokion.incipit	@ltx/gr_gr_cog/me.m01.d16:meVE.SticStavrotheotokion.incipit
ltx/gr_gr_cog/me.m10.d16:meVE.AposStavrotheotokion.melody	@ltx/gr_gr_cog/he.a.m6:heAU.TriimerosAnestis.name
ltx/gr_gr_cog/me.m10.d16:meVE.AposStavrotheotokion.mode	@ltx/gr_gr_cog/miscellanea:misc.Mode6
ltx/gr_gr_cog/me.m10.d16:meVE.AposStavrotheotokion.text	@ltx/gr_gr_cog/me.m01.d16:meVE.SticStavrotheotokion.text
ltx/gr_gr_cog/me.m10.d16:meVE.AposTheotokion.greekmelody	@ltx/gr_gr_cog/he.a.m6:heAU.TriimerosAnestis.greekname
ltx/gr_gr_cog/me.m10.d16:meVE.AposTheotokion.incipit	@ltx/gr_gr_cog/me.m09.d30:meVE.SticTheotokion.incipit
ltx/gr_gr_cog/me.m10.d16:meVE.AposTheotokion.melody	@ltx/gr_gr_cog/he.a.m6:heAU.TriimerosAnestis.name
ltx/gr_gr_cog/me.m10.d16:meVE.AposTheotokion.mode	@ltx/gr_gr_cog/miscellanea:misc.Mode6
ltx/gr_gr_cog/me.m10.d16:meVE.AposTheotokion.text	@ltx/gr_gr_cog/me.m09.d30:meVE.SticTheotokion.text
ltx/gr_gr_cog/me.m10.d16:meVE.SticGlory.incipit	Ἐν τῷ πάθει σου, Χριστέ…
ltx/gr_gr_cog/me.m10.d16:meVE.SticGlory.melody	
ltx/gr_gr_cog/me.m10.d16:meVE.SticGlory.mode	@ltx/gr_gr_cog/miscellanea:misc.Mode6
ltx/gr_gr_cog/me.m10.d16:meVE.SticGlory.poet	@ltx/gr_gr_cog/poets:po.IoannouMonachou
ltx/gr_gr_cog/me.m10.d16:meVE.SticGlory.text	Ἐν τῷ πάθει σου, Χριστέ, τὸν ναὸν θεωρήσας διαῤῥαγέντα Λογγῖνος ὁ Ἑκατόνταρχος, Υἱὸν Θεοῦ σε εἶναι τοῖς Ἰουδαίοις ἐκήρυττεν. Ὅθεν οἱ δεινοί, τὴν θείαν κάραν αὐτοῦ τεμόντες τῷ ξίφει, ἐν κοπρίᾳ ἔῤῥιψαν· γυνὴ δὲ ταύτην εὑροῦσα, τὰς κεκλεισμένας κόρας αὐτῆς τῶν ὀμμάτων ἀνέῳξε· μεθʼ ἧς καὶ ἡμεῖς βοῶμέν σοι· Ὁ τοῦτον στεφανώσας, ὑπὲρ σοῦ ἀθλήσαντα, ταῖς αὐτοῦ ἱκεσίαις, καὶ ἡμῶν τὰ ὄμματα τῆς καρδίας φώτισον, τοῦ δοξάζειν σε Θεόν, τὸν ἐν Σταυρῷ προσηλωθέντα, εἰς τὸ σῶσαι ἡμᾶς.
ltx/gr_gr_cog/me.m10.d16:meVE.SticStavrotheotokion.greekmelody	@ltx/gr_gr_cog/he.a.m6:heAU.OlinApothemenoi.greekname
ltx/gr_gr_cog/me.m10.d16:meVE.SticStavrotheotokion.incipit	@ltx/gr_gr_cog/me.m01.d15:meVE.AposStavrotheotokion.incipit
ltx/gr_gr_cog/me.m10.d16:meVE.SticStavrotheotokion.melody	@ltx/gr_gr_cog/he.a.m6:heAU.OlinApothemenoi.name
ltx/gr_gr_cog/me.m10.d16:meVE.SticStavrotheotokion.mode	@ltx/gr_gr_cog/miscellanea:misc.Mode6
ltx/gr_gr_cog/me.m10.d16:meVE.SticStavrotheotokion.text	@ltx/gr_gr_cog/me.m01.d15:meVE.AposStavrotheotokion.text
ltx/gr_gr_cog/me.m10.d16:meVE.SticTheotokion.greekmelody	@ltx/gr_gr_cog/he.a.m6:heAU.OlinApothemenoi.greekname
ltx/gr_gr_cog/me.m10.d16:meVE.SticTheotokion.incipit	Μόνος ὑπὲρ ἅπαντας, υἱοὺς ἀνθρώπων…
ltx/gr_gr_cog/me.m10.d16:meVE.SticTheotokion.melody	@ltx/gr_gr_cog/he.a.m6:heAU.OlinApothemenoi.name
ltx/gr_gr_cog/me.m10.d16:meVE.SticTheotokion.mode	@ltx/gr_gr_cog/miscellanea:misc.Mode6
ltx/gr_gr_cog/me.m10.d16:meVE.SticTheotokion.text	Μόνος ὑπὲρ ἅπαντας, υἱοὺς ἀνθρώπων ὁ τάλας, μόνος ἐπλημμέλησα, τὰ καὶ λόγῳ ἄφθεγκτα, καὶ ἀκούσματι, μηδαμῶς Ἄχραντε, φορητὰ πέλοντα· διὰ τοῦτό σου καὶ δέομαι· Σύγγνωθι Δέσποινα, σύγγνωθι καὶ δός μοι μετάνοιαν, δός μοι ἐξομολόγησιν, δός μοι στεναγμούς τε καὶ δάκρυα· ἵνα διὰ τούτων, συντρίβων τὴν καρδίαν μου ἀεί, κράζω τό· Ἥμαρτον Κύριε, ἱλάσθητι σῶσόν με.
ltx/gr_gr_cog/me.m10.d16:meVE.Stichera01.greekmelody	@ltx/gr_gr_cog/he.a.m4:heAU.OsGennaionEnMartysi.greekname
ltx/gr_gr_cog/me.m10.d16:meVE.Stichera01.incipit	Τὸν βροτὸν χρηματίσαντα, καὶ Σταυρῷ…
ltx/gr_gr_cog/me.m10.d16:meVE.Stichera01.melody	@ltx/gr_gr_cog/he.a.m4:heAU.OsGennaionEnMartysi.name
ltx/gr_gr_cog/me.m10.d16:meVE.Stichera01.mode	@ltx/gr_gr_cog/miscellanea:misc.Mode4
ltx/gr_gr_cog/me.m10.d16:meVE.Stichera01.text	Τὸν βροτὸν χρηματίσαντα, καὶ Σταυρῷ ὁμιλήσαντα, καὶ ἡλίου ἔλλαμψιν ἀμαυρώσαντα, καὶ ἐκ πλευρᾶς ἀναβλύσαντα, σωτήριον ἄφεσιν, κατιδὼν μετὰ λῃστοῦ, τοῦ εὐγνώμονος Ἔνδοξε, ὡμολόγησας, καὶ Θεὸν καὶ Δεσπότην ἑκουσίως, ὑπομείναντα τὰ πάθη, διʼ εὐσπλαγχνίαν ἀμέτρητον.
ltx/gr_gr_cog/me.m10.d16:meVE.Stichera02.incipit	Τὴν κατάκαρπον ἄμπελον, ἐπὶ ξύλου…
ltx/gr_gr_cog/me.m10.d16:meVE.Stichera02.melody	@ltx/gr_gr_cog/he.a.m4:heAU.OsGennaionEnMartysi.name
ltx/gr_gr_cog/me.m10.d16:meVE.Stichera02.mode	@ltx/gr_gr_cog/miscellanea:misc.Mode4
ltx/gr_gr_cog/me.m10.d16:meVE.Stichera02.text	Τὴν κατάκαρπον ἄμπελον, ἐπὶ ξύλου θεώμενος, ἠρτημένην Ἔνδοξε καὶ πηγάζουσαν, οἶνον ζωῆς καὶ ἀφέσεως, τὰ χείλη ὑπέθηκας, τῆς καρδίας καὶ πιών, εὐφροσύνης πεπλήρωσαι, τὴν κατάπικρον, ἀπιστίαν ἐμέσας ὡς ἐχέφρων, ὡς τοῦ χείρονος τὸ κρεῖττον, περιφανῶς προελόμενος.
ltx/gr_gr_cog/me.m10.d16:meVE.Stichera03.incipit	Θανατώσας τὸν τύραννον, εὐτολμίᾳ τῶν…
ltx/gr_gr_cog/me.m10.d16:meVE.Stichera03.melody	@ltx/gr_gr_cog/he.a.m4:heAU.OsGennaionEnMartysi.name
ltx/gr_gr_cog/me.m10.d16:meVE.Stichera03.mode	@ltx/gr_gr_cog/miscellanea:misc.Mode4
ltx/gr_gr_cog/me.m10.d16:meVE.Stichera03.text	Θανατώσας τὸν τύραννον, εὐτολμίᾳ τῶν λόγων σου, πρὸς σφαγὴν ἑκούσιον ηὐτομόλησας, οὐ δειλιάσας πανεύφημε, Λογγῖνε τὸν θάνατον, τὴν ἀθάνατον ζωήν, προξενοῦντά σοι χάριτι· ὅθεν πίστει σου, τὴν πανέορτον μνήμην ἐκτελοῦμεν, δυσωποῦντές σε πρεσβεύειν, ὑπὲρ ἡμῶν πρὸς τὸν Κύριον.
