ltx/gr_gr_cog/le.ep.mc.d282:lemcLI.Epistle.book_abbr	@ltx/gr_gr_cog/bible:Thessalonians1.abbr
ltx/gr_gr_cog/le.ep.mc.d282:lemcLI.Epistle.book_string	@ltx/gr_gr_cog/bible:Thessalonians1.text
ltx/gr_gr_cog/le.ep.mc.d282:lemcLI.Epistle.chapverse	2:20 – 3:8
ltx/gr_gr_cog/le.ep.mc.d282:lemcLI.Epistle.incipit	Ὑμεῖς ἐστε ἡ δόξα ἡμῶν καὶ ἡ χαρά…
ltx/gr_gr_cog/le.ep.mc.d282:lemcLI.Epistle.text	Ἀδελφοί, ὑμεῖς ἐστε ἡ δόξα ἡμῶν καὶ ἡ χαρά. Διὸ μηκέτι στέγοντες εὐδοκήσαμεν καταλειφθῆναι ἐν Ἀθήναις μόνοι, καὶ ἐπέμψαμεν Τιμόθεον, τὸν ἀδελφὸν ἡμῶν καὶ διάκονον τοῦ Θεοῦ καὶ συνεργὸν ἡμῶν ἐν τῷ εὐαγγελίῳ τοῦ Χριστοῦ, εἰς τὸ στηρίξαι ὑμᾶς καὶ παρακαλέσαι ὑμᾶς περὶ τῆς πίστεως ὑμῶν, τὸ μηδένα σαίνεσθαι ἐν ταῖς θλίψεσι ταύταις. αὐτοὶ γὰρ οἴδατε ὅτι εἰς τοῦτο κείμεθα· καὶ γὰρ ὅτε πρὸς ὑμᾶς ἦμεν, προελέγομεν ὑμῖν ὅτι μέλλομεν θλίβεσθαι, καθὼς καὶ ἐγένετο καὶ οἴδατε. διὰ τοῦτο κἀγὼ μηκέτι στέγων ἔπεμψα εἰς τὸ γνῶναι τὴν πίστιν ὑμῶν, μή πως ἐπείρασεν ὑμᾶς ὁ πειράζων καὶ εἰς κενὸν γένηται ὁ κόπος ἡμῶν. Ἄρτι δὲ ἐλθόντος Τιμοθέου πρὸς ἡμᾶς ἀφ᾽ ὑμῶν καὶ εὐαγγελισαμένου ἡμῖν τὴν πίστιν καὶ τὴν ἀγάπην ὑμῶν, καὶ ὅτι ἔχετε μνείαν ἡμῶν ἀγαθήν, πάντοτε ἐπιποθοῦντες ἡμᾶς ἰδεῖν καθάπερ καὶ ἡμεῖς ὑμᾶς, διὰ τοῦτο παρεκλήθημεν, ἀδελφοί, ἐφ᾽ ὑμῖν ἐπὶ πάσῃ τῇ θλίψει καὶ ἀνάγκῃ ἡμῶν διὰ τῆς ὑμῶν πίστεως· ὅτι νῦν ζῶμεν, ἐὰν ὑμεῖς στήκητε ἐν Κυρίῳ.
ltx/gr_gr_cog/le.ep.mc.d282:lemcLI.Epistle.title	Τῇ Δευτέρᾳ τῆς ΚΔʹ Ἑβδομάδος
ltx/gr_gr_cog/le.ep.mc.d282:lemcLI.Epistle.title_abbr	Δευτέρᾳ τῆς ΚΔʹ Ἑβδομάδος
ltx/gr_gr_cog/le.ep.mc.d282:lemcLI.Epistle.version	@ltx/gr_gr_cog/properties:version.designation
