ltx/gr_gr_cog/me.m10.d03:meDA.commemoration.first	Μνήμη τοῦ Ἁγίου Διονυσίου τοῦ Ἀρεοπαγίτου
ltx/gr_gr_cog/me.m10.d03:meDA.commemoration.first_name	
ltx/gr_gr_cog/me.m10.d03:meDA.commemoration.first_short	Μνήμη τοῦ Ἁγίου Διονυσίου τοῦ Ἀρεοπαγίτου
ltx/gr_gr_cog/me.m10.d03:meDA.commemoration.first_title	@ltx/gr_gr_cog/titles:ti.SaintM
ltx/gr_gr_cog/me.m10.d03:meDA.commemoration.full	Μνήμη τοῦ Ἁγίου Ἱερομάρτυρος Διονυσίου τοῦ Ἀρεοπαγίτου
ltx/gr_gr_cog/me.m10.d03:meDA.commemoration.second_name	
ltx/gr_gr_cog/me.m10.d03:meDA.commemoration.second_title	
ltx/gr_gr_cog/me.m10.d03:meDA.date	Τῌ Γʹ ΟΚΤΩΒΡΙΟΥ
ltx/gr_gr_cog/me.m10.d03:meDA.fordate	διὰ τὴν 3ην Ὀκτωβρίου
ltx/gr_gr_cog/me.m10.d03:meDA.insert1	καὶ τοῦ ἁγίου ἐνδόξου ἱερομάρτυρος Διονυσίου τοῦ Ἀρεοπαγίτου,
ltx/gr_gr_cog/me.m10.d03:meDA.insert2	οὗ καὶ τὴν μνήμην ἐπιτελοῦμεν·
ltx/gr_gr_cog/me.m10.d03:meDA.note	
ltx/gr_gr_cog/me.m10.d03:meDA.pdfcoverdate	τῆς 3ης Ὀκτωβρίου,
ltx/gr_gr_cog/me.m10.d03:meDA.pdfheaderdate	τῆς 3ης Ὀκτωβρίου
ltx/gr_gr_cog/me.m10.d03:meHO.commemorations	
ltx/gr_gr_cog/me.m10.d03:meHO.note1	
ltx/gr_gr_cog/me.m10.d03:meHO.note2	
ltx/gr_gr_cog/me.m10.d03:meHO.number	
ltx/gr_gr_cog/me.m10.d03:meHO.rank	
ltx/gr_gr_cog/me.m10.d03:meLE.commemoration1	Μνήμη τοῦ Ἁγίου Ἱερομάρτυρος Διονυσίου τοῦ Ἀρεοπαγίτου.
ltx/gr_gr_cog/me.m10.d03:meLE.commemoration2	
ltx/gr_gr_cog/me.m10.d03:meLI.Kontakion1.greekmelody	@ltx/gr_gr_cog/me.m10.d03:meMA.Kontakion1.greekmelody
ltx/gr_gr_cog/me.m10.d03:meLI.Kontakion1.incipit	@ltx/gr_gr_cog/me.m10.d03:meMA.Kontakion1.incipit
ltx/gr_gr_cog/me.m10.d03:meLI.Kontakion1.melody	@ltx/gr_gr_cog/me.m10.d03:meMA.Kontakion1.melody
ltx/gr_gr_cog/me.m10.d03:meLI.Kontakion1.mode	@ltx/gr_gr_cog/me.m10.d03:meMA.Kontakion1.mode
ltx/gr_gr_cog/me.m10.d03:meLI.Kontakion1.text	@ltx/gr_gr_cog/me.m10.d03:meMA.Kontakion1.text
ltx/gr_gr_cog/me.m10.d03:meLI.Megalynarion.text	Τῶν ὑπερκοσμίων θεωριῶν, γεγονὼς ἐπόπτης καὶ ἐκφάντωρ θεοειδής, θεαρχικωτάτων, ἐλλάμψεων τὸ κάλλος, πανσόφως διαγράφεις, ὦ Διονύσιε.
ltx/gr_gr_cog/me.m10.d03:meMA.AposGlory.incipit	Ἐν Ἱερεῦσι καὶ Μάρτυσι διαπρέψας…
ltx/gr_gr_cog/me.m10.d03:meMA.AposGlory.melody	
ltx/gr_gr_cog/me.m10.d03:meMA.AposGlory.mode	@ltx/gr_gr_cog/miscellanea:misc.Mode8
ltx/gr_gr_cog/me.m10.d03:meMA.AposGlory.poet	@ltx/gr_gr_cog/poets:po.Germanou
ltx/gr_gr_cog/me.m10.d03:meMA.AposGlory.text	Ἐν Ἱερεῦσι καὶ Μάρτυσι διαπρέψας Ὅσιε, πιστὸς ἀνεδείχθης Ποιμήν, τοῦ Χριστοῦ πιὼν τὸ ποτήριον· διὸ ἐν ἑκατέροις εὐαρεστήσας αὐτῷ τῷ Χριστῷ, πρέσβευε ὑπέρ πάντων ἡμῶν, σὺν τοῖς ἄνω Λειτουργοῖς, ἐν φωτὶ νῦν αὐλιζόμενος.
ltx/gr_gr_cog/me.m10.d03:meMA.AposStavrotheotokion.greekmelody	@ltx/gr_gr_cog/he.a.m8:heAU.KyrieEiKaiKritirio.greekname
ltx/gr_gr_cog/me.m10.d03:meMA.AposStavrotheotokion.incipit	Ἄναρχε Λόγε τοῦ Πατρὸς ὦ…
ltx/gr_gr_cog/me.m10.d03:meMA.AposStavrotheotokion.melody	@ltx/gr_gr_cog/he.a.m8:heAU.KyrieEiKaiKritirio.name
ltx/gr_gr_cog/me.m10.d03:meMA.AposStavrotheotokion.mode	@ltx/gr_gr_cog/miscellanea:misc.Mode8
ltx/gr_gr_cog/me.m10.d03:meMA.AposStavrotheotokion.text	Ἄναρχε Λόγε τοῦ Πατρὸς ὦ Υἱέ μου, καὶ τῷ Πνεύματι σύνθρονε, πῶς τὰς σὰς ἀχράντους παλάμας, ἐπὶ τοῦ ξύλου ἐξέτεινας; τίς ἡ τοσαύτη σου νῦν, πτωχεία ὑπεράγαθε; παρισταμένη τῇ σῇ σταυρώσει, ἀνεβόα ἡ Πανάμωμος.
ltx/gr_gr_cog/me.m10.d03:meMA.AposTheotokion.greekmelody	@ltx/gr_gr_cog/he.a.m8:heAU.OTouParadoxou.greekname
ltx/gr_gr_cog/me.m10.d03:meMA.AposTheotokion.incipit	Ἄπασαν ἔξωσον Δέσποινα, τῆς ταπεινῆς…
ltx/gr_gr_cog/me.m10.d03:meMA.AposTheotokion.melody	@ltx/gr_gr_cog/he.a.m8:heAU.OTouParadoxou.name
ltx/gr_gr_cog/me.m10.d03:meMA.AposTheotokion.mode	@ltx/gr_gr_cog/miscellanea:misc.Mode8
ltx/gr_gr_cog/me.m10.d03:meMA.AposTheotokion.text	Ἄπασαν ἔξωσον Δέσποινα, τῆς ταπεινῆς μου ψυχῆς, ῥαθυμίαν, ἀτέλειαν, ἀκηδίαν, ἄνοιαν, ἀσωτίαν, ἀσέλγειαν, ἀντιλογίαν, ἀνηκοΐαν δεινήν, τῶν προσταγμάτων τοῦ θείου Πνεύματος· πᾶσαν πρὸς τούτοις δέ, ἀπληστίαν, ἄγνοιαν, ἀσυμπαθῆ, τρόπον ἀσυνείδητον, γνώμην καὶ σῶσόν με.
ltx/gr_gr_cog/me.m10.d03:meMA.C1.acrostic.notice1	οὗ ἡ Ἀκροστιχίς·
ltx/gr_gr_cog/me.m10.d03:meMA.C1.acrostic.text	Τὸν νοῦν γεραίρω τῶν σοφῶν διδαγμάτων.
ltx/gr_gr_cog/me.m10.d03:meMA.C1.acrostic.title	Κανὼν τοῦ Ἁγίου,
ltx/gr_gr_cog/me.m10.d03:meMA.C1.poet	@ltx/gr_gr_cog/poets:po.Theofanous
ltx/gr_gr_cog/me.m10.d03:meMA.C1.title	@ltx/gr_gr_cog/titles:ti.CanonSaintM
ltx/gr_gr_cog/me.m10.d03:meMA.C1.verse	@ltx/gr_gr_cog/prayers:pr.verse_SaintM.text
ltx/gr_gr_cog/me.m10.d03:meMA.ExapTheotokion.incipit	Ἐν τῇ σεπτῇ κοιμήσει σου…
ltx/gr_gr_cog/me.m10.d03:meMA.ExapTheotokion.melody	@ltx/gr_gr_cog/he.a.m2:heAU.ToisMathitaisSynelthomen.name
ltx/gr_gr_cog/me.m10.d03:meMA.ExapTheotokion.mode	@ltx/gr_gr_cog/miscellanea:misc.Mode2
ltx/gr_gr_cog/me.m10.d03:meMA.ExapTheotokion.text	Ἐν τῇ σεπτῇ κοιμήσει σου, Παναγία Παρθένε, παρῆν ὁ Διονύσιος, σὺν τῷ Ἱεροθέῳ, καὶ Τιμοθέῳ τῷ θείῳ, ἅμα τοῖς, Ἀποστόλοις, ἕκαστος ὕμνον ᾄδοντες, πρόσφορον τῇ σῇ μνήμῃ· μεθʼ ὧν καὶ νῦν, πᾶσα γλῶσσα βρότειος ἀνυμνεῖ σε, τὴν τοῦ Θεοῦ λοχεύτριαν, καὶ τοῦ κόσμου προστάτιν.
ltx/gr_gr_cog/me.m10.d03:meMA.Exaposteilarion1.greekmelody	@ltx/gr_gr_cog/he.a.m2:heAU.ToisMathitaisSynelthomen.greekname
ltx/gr_gr_cog/me.m10.d03:meMA.Exaposteilarion1.incipit	Τῷ Παύλῳ Διονύσιε, τῷ κλεινῷ…
ltx/gr_gr_cog/me.m10.d03:meMA.Exaposteilarion1.melody	@ltx/gr_gr_cog/he.a.m2:heAU.ToisMathitaisSynelthomen.name
ltx/gr_gr_cog/me.m10.d03:meMA.Exaposteilarion1.mode	@ltx/gr_gr_cog/miscellanea:misc.Mode2
ltx/gr_gr_cog/me.m10.d03:meMA.Exaposteilarion1.text	Τῷ Παύλῳ Διονύσιε, τῷ κλεινῷ κορυφαίῳ, μαθητευθεὶς πανόλβιε, ὑπʼ αὐτοῦ ἐμυήθης, τῶν ἀποκρύφων τὴν γνῶσιν· ὅθεν σε καὶ λαμπτῆρα, τῇ Ἐκκλησίᾳ τίθησιν, Ἀθηνῶν προχειρίσας, τῆς εὐσεβοῦς, Ἱεράρχην πόλεως, ἣν φυλάττοις, ὀρθοδοξοῦσαν πάνσοφε, σαῖς εὐχαὶς θεοκῆρυξ.
ltx/gr_gr_cog/me.m10.d03:meMA.Kontakion1.greekmelody	@ltx/gr_gr_cog/he.a.m8:heAU.TiYpermacho.greekname
ltx/gr_gr_cog/me.m10.d03:meMA.Kontakion1.incipit	Τὰς οὐρανίους διαβὰς πύλας ἐν…
ltx/gr_gr_cog/me.m10.d03:meMA.Kontakion1.melody	@ltx/gr_gr_cog/he.a.m8:heAU.TiYpermacho.name
ltx/gr_gr_cog/me.m10.d03:meMA.Kontakion1.mode	@ltx/gr_gr_cog/miscellanea:misc.Mode8
ltx/gr_gr_cog/me.m10.d03:meMA.Kontakion1.text	Τὰς οὐρανίους διαβὰς πύλας ἐν πνεύματι, μαθητευθεὶς τῷ ὑπὲρ τρεῖς οὐρανοὺς φθάσαντι, Ἀποστόλῳ Διονύσιε τῶν ἀῤῥήτων, ἐπλουτίσθης πᾶσαν γνῶσιν καὶ κατηύγασας, τοὺς ἐν σκότει ἀγνωσίας πρὶν καθεύδοντας· διὸ κράζομεν· Χαίροις Πάτερ παγκόσμιε.
ltx/gr_gr_cog/me.m10.d03:meMA.MM.Ve1123as5678.text	@ltx/gr_gr_cog/properties:media.key
ltx/gr_gr_cog/me.m10.d03:meMA.Ode1C11.greekmelody	@ltx/gr_gr_cog/he.h.m8:heHE.YgranDiodefsas.greekname
ltx/gr_gr_cog/me.m10.d03:meMA.Ode1C11.incipit	Τῶ Παύλῳ τῷ θείῳ μαθητευθείς…
ltx/gr_gr_cog/me.m10.d03:meMA.Ode1C11.melody	@ltx/gr_gr_cog/he.h.m8:heHE.YgranDiodefsas.name
ltx/gr_gr_cog/me.m10.d03:meMA.Ode1C11.mode	@ltx/gr_gr_cog/miscellanea:misc.Mode8
ltx/gr_gr_cog/me.m10.d03:meMA.Ode1C11.ode	@ltx/gr_gr_cog/miscellanea:misc.Ode1
ltx/gr_gr_cog/me.m10.d03:meMA.Ode1C11.text	Τῶ Παύλῳ τῷ θείῳ μαθητευθείς, τῷ τῶν οὐρανίων, Διονύσιε θεατῇ, οὐράνιος μύστης παραυτίκα, καὶ θεηγόρος ἐχρημάτισας.
ltx/gr_gr_cog/me.m10.d03:meMA.Ode1C12.incipit	Ὁ χάριτι θείᾳ καταυγασθείς, καταύγασον…
ltx/gr_gr_cog/me.m10.d03:meMA.Ode1C12.melody	@ltx/gr_gr_cog/he.h.m8:heHE.YgranDiodefsas.name
ltx/gr_gr_cog/me.m10.d03:meMA.Ode1C12.mode	@ltx/gr_gr_cog/miscellanea:misc.Mode8
ltx/gr_gr_cog/me.m10.d03:meMA.Ode1C12.ode	@ltx/gr_gr_cog/miscellanea:misc.Ode1
ltx/gr_gr_cog/me.m10.d03:meMA.Ode1C12.text	Ὁ χάριτι θείᾳ καταυγασθείς, καταύγασον Μάκαρ, τῶν ὑμνούντων σε τὰς ψυχάς, τὰς σὰς συνιέναι θεοπνεύστους, διδασκαλίας Διονύσιε.
ltx/gr_gr_cog/me.m10.d03:meMA.Ode1C13.incipit	Νοὸς καθαρότητι καὶ ψυχῆς, τῶν…
ltx/gr_gr_cog/me.m10.d03:meMA.Ode1C13.melody	@ltx/gr_gr_cog/he.h.m8:heHE.YgranDiodefsas.name
ltx/gr_gr_cog/me.m10.d03:meMA.Ode1C13.mode	@ltx/gr_gr_cog/miscellanea:misc.Mode8
ltx/gr_gr_cog/me.m10.d03:meMA.Ode1C13.ode	@ltx/gr_gr_cog/miscellanea:misc.Ode1
ltx/gr_gr_cog/me.m10.d03:meMA.Ode1C13.text	Νοὸς καθαρότητι καὶ ψυχῆς, τῶν ἐπουρανίων διακόσμων τὰς ἀστραπάς, μαθεῖν ἠξιώθης καὶ τὰς τούτων, χοροστασίας ἰδεῖν Διονύσιε.
ltx/gr_gr_cog/me.m10.d03:meMA.Ode1C1T.incipit	Νυμφὼν φωτοφόρος τῆς ὑπὲρ νοῦν…
ltx/gr_gr_cog/me.m10.d03:meMA.Ode1C1T.melody	@ltx/gr_gr_cog/he.h.m8:heHE.YgranDiodefsas.name
ltx/gr_gr_cog/me.m10.d03:meMA.Ode1C1T.mode	@ltx/gr_gr_cog/miscellanea:misc.Mode8
ltx/gr_gr_cog/me.m10.d03:meMA.Ode1C1T.ode	@ltx/gr_gr_cog/miscellanea:misc.Ode1
ltx/gr_gr_cog/me.m10.d03:meMA.Ode1C1T.text	Νυμφὼν φωτοφόρος τῆς ὑπὲρ νοῦν, σαρκώσεως ὤφθης, τοῦ τῶν ὅλων Δημιουργοῦ, ἐκ σοῦ τὴν σάρκα Θεομῆτορ, τὴν ἡμετέραν ἠμφιάσατο.
ltx/gr_gr_cog/me.m10.d03:meMA.Ode3C11.greekmelody	@ltx/gr_gr_cog/he.h.m8:heHE.OuraniasApsidos.greekname
ltx/gr_gr_cog/me.m10.d03:meMA.Ode3C11.incipit	Οὐρανίων ἁψίδων, ὑπεραρθεὶς Ὅσιε, τῶν…
ltx/gr_gr_cog/me.m10.d03:meMA.Ode3C11.melody	@ltx/gr_gr_cog/he.h.m8:heHE.OuraniasApsidos.name
ltx/gr_gr_cog/me.m10.d03:meMA.Ode3C11.mode	@ltx/gr_gr_cog/miscellanea:misc.Mode8
ltx/gr_gr_cog/me.m10.d03:meMA.Ode3C11.ode	@ltx/gr_gr_cog/miscellanea:misc.Ode3
ltx/gr_gr_cog/me.m10.d03:meMA.Ode3C11.text	Οὐρανίων ἁψίδων, ὑπεραρθεὶς Ὅσιε, τῶν ὑπερκοσμίων τὰς τάξεις καὶ τὰ στρατεύματα, καὶ τὰς λαμπρότητας, ὑψηγορίαις τῶν λόγων, καὶ πανσόφοις φράσεσι, πᾶσιν ἐτράνωσας.
ltx/gr_gr_cog/me.m10.d03:meMA.Ode3C12.incipit	Ὑψηλῆς θεωρίας, ἐμφορηθεὶς Ἔνδοξε, τὴν…
ltx/gr_gr_cog/me.m10.d03:meMA.Ode3C12.melody	@ltx/gr_gr_cog/he.h.m8:heHE.OuraniasApsidos.name
ltx/gr_gr_cog/me.m10.d03:meMA.Ode3C12.mode	@ltx/gr_gr_cog/miscellanea:misc.Mode8
ltx/gr_gr_cog/me.m10.d03:meMA.Ode3C12.ode	@ltx/gr_gr_cog/miscellanea:misc.Ode3
ltx/gr_gr_cog/me.m10.d03:meMA.Ode3C12.text	Ὑψηλῆς θεωρίας, ἐμφορηθεὶς Ἔνδοξε, τὴν τῶν ὀνομάτων τῶν θείων, πᾶσαν ἀνάπτυξιν, ἐθεολόγησας, Τριαδικὸς θεολόγος, γεγονὼς τῇ χάριτι, θεομακάριστε.
ltx/gr_gr_cog/me.m10.d03:meMA.Ode3C13.incipit	Νεκρωθεὶς τοῖς παροῦσι, τῷ πρὸς…
ltx/gr_gr_cog/me.m10.d03:meMA.Ode3C13.melody	@ltx/gr_gr_cog/he.h.m8:heHE.OuraniasApsidos.name
ltx/gr_gr_cog/me.m10.d03:meMA.Ode3C13.mode	@ltx/gr_gr_cog/miscellanea:misc.Mode8
ltx/gr_gr_cog/me.m10.d03:meMA.Ode3C13.ode	@ltx/gr_gr_cog/miscellanea:misc.Ode3
ltx/gr_gr_cog/me.m10.d03:meMA.Ode3C13.text	Νεκρωθεὶς τοῖς παροῦσι, τῷ πρὸς Θεὸν ἔρωτι, καὶ φιλοσοφία συντόνως ἐγγυμνασάμενος, τῶν ὑπὲρ ἔννοιαν, ζωοποιῶν χαρισμάτων, θεοφόρον ὄργανον, Πάτερ γεγένησαι.
ltx/gr_gr_cog/me.m10.d03:meMA.Ode3C1T.incipit	Γεωργίᾳ Παρθένε, τοῦ παντουργοῦ Πνεύματος…
ltx/gr_gr_cog/me.m10.d03:meMA.Ode3C1T.melody	@ltx/gr_gr_cog/he.h.m8:heHE.OuraniasApsidos.name
ltx/gr_gr_cog/me.m10.d03:meMA.Ode3C1T.mode	@ltx/gr_gr_cog/miscellanea:misc.Mode8
ltx/gr_gr_cog/me.m10.d03:meMA.Ode3C1T.ode	@ltx/gr_gr_cog/miscellanea:misc.Ode3
ltx/gr_gr_cog/me.m10.d03:meMA.Ode3C1T.text	Γεωργίᾳ Παρθένε, τοῦ παντουργοῦ Πνεύματος, σῶμα τῷ Δεσπότῃ τῶν ὅλων ἐκαρποφόρησας, ἐν ᾧ κατέκρινε, τὴν ἁμαρτίαν τοῦ κόσμου, καὶ ζωὴν ἐπήγασε, τὴν αἰωνίζουσαν.
ltx/gr_gr_cog/me.m10.d03:meMA.Ode3H.greekmelody	@ltx/gr_gr_cog/he.h.m8:heHE.OuraniasApsidos.greekname
ltx/gr_gr_cog/me.m10.d03:meMA.Ode3H.incipit	@ltx/gr_gr_cog/he.h.m8:heHE.OuraniasApsidos.incipit
ltx/gr_gr_cog/me.m10.d03:meMA.Ode3H.melody	@ltx/gr_gr_cog/he.h.m8:heHE.OuraniasApsidos.melody
ltx/gr_gr_cog/me.m10.d03:meMA.Ode3H.mode	@ltx/gr_gr_cog/miscellanea:misc.Mode8
ltx/gr_gr_cog/me.m10.d03:meMA.Ode3H.ode	@ltx/gr_gr_cog/miscellanea:misc.Ode3
ltx/gr_gr_cog/me.m10.d03:meMA.Ode3H.text	@ltx/gr_gr_cog/he.h.m8:heHE.OuraniasApsidos.text
ltx/gr_gr_cog/me.m10.d03:meMA.Ode3Kathisma1.greekmelody	@ltx/gr_gr_cog/he.a.m8:heAU.TinSofianKaiLogon.greekname
ltx/gr_gr_cog/me.m10.d03:meMA.Ode3Kathisma1.incipit	Ὡς τοῦ σκεύους ὑπάρχων τῆς…
ltx/gr_gr_cog/me.m10.d03:meMA.Ode3Kathisma1.melody	@ltx/gr_gr_cog/he.a.m8:heAU.TinSofianKaiLogon.name
ltx/gr_gr_cog/me.m10.d03:meMA.Ode3Kathisma1.mode	@ltx/gr_gr_cog/miscellanea:misc.Mode8
ltx/gr_gr_cog/me.m10.d03:meMA.Ode3Kathisma1.text	Ὡς τοῦ σκεύους ὑπάρχων τῆς ἐκλογῆς, ἀπεικόνισμα θεῖον ὡς ἀληθῶς, τὰ θεῖα μυστήρια, ἐκδιδάσκεις τῷ Πνεύματι· Καὶ φωτισθεὶς τῇ χάριτι, τῆς θείας ἐλλάμψεως, τὰς τῶν Ἀγγέλων τάξεις, τρανῶς διεσάφησας· ὅθεν καὶ τῷ κόσμῳ, νοητῶς καταλείψας, τὰ θεῖά σου δόγματα, κατεφώτισας ἅπαντα, Ἱερομύστα Διονύσιε· Πρέσβευε Χριστῷ τῷ Θεῷ, τῶν πταισμάτων ἄφεσιν δωρήσασθαι, τοῖς ἑορτάζουσι πόθῳ, τὴν ἁγίαν μνήμην σου.
ltx/gr_gr_cog/me.m10.d03:meMA.Ode3KathismaSt.incipit	@ltx/gr_gr_cog/oc.m8.d4:ocMA.Kathisma13.incipit
ltx/gr_gr_cog/me.m10.d03:meMA.Ode3KathismaSt.melody	@ltx/gr_gr_cog/he.a.m8:heAU.TinSofianKaiLogon.name
ltx/gr_gr_cog/me.m10.d03:meMA.Ode3KathismaSt.mode	@ltx/gr_gr_cog/miscellanea:misc.Mode8
ltx/gr_gr_cog/me.m10.d03:meMA.Ode3KathismaSt.text	@ltx/gr_gr_cog/oc.m8.d4:ocMA.Kathisma13.text
ltx/gr_gr_cog/me.m10.d03:meMA.Ode3KathismaT.incipit	Τοῦ Ἠλίου νεφέλη τοῦ νοητοῦ…
ltx/gr_gr_cog/me.m10.d03:meMA.Ode3KathismaT.melody	@ltx/gr_gr_cog/he.a.m8:heAU.TinSofianKaiLogon.name
ltx/gr_gr_cog/me.m10.d03:meMA.Ode3KathismaT.mode	@ltx/gr_gr_cog/miscellanea:misc.Mode8
ltx/gr_gr_cog/me.m10.d03:meMA.Ode3KathismaT.text	Τοῦ Ἠλίου νεφέλη τοῦ νοητοῦ, θείου φέγγους λυχνία χρυσοφαής, ἄσπιλε ἀμόλυντε, παναμώμητε Δέσποινα, τὴν σκοτεινὴν ψυχήν μου, τυφλώττουσαν πάθεσι, τῆς ἀπαθείας αἴγλῃ, καταύγασον δέομαι, καὶ μεμολυσμένην, τὴν καρδίαν μου πλῦνον, ῥοαῖς κατανύξεως, μετανοίας τε δάκρυσι, καὶ τοῦ ῥύπου με κάθαρον, πρεσβεύουσα Χριστῷ τῷ Θεῷ, τῶν πταισμάτων δοῦναί μοι τὴν ἄφεσιν, τῷ εὐσεβῶς προσκυνοῦντι, τὸν πανάγιον τόκον σου.
ltx/gr_gr_cog/me.m10.d03:meMA.Ode4C11.greekmelody	@ltx/gr_gr_cog/he.h.m8:heHE.SyMouIschys.greekname
ltx/gr_gr_cog/me.m10.d03:meMA.Ode4C11.incipit	Ἐκκλησιῶν, τὴν εὐκοσμίαν ἐῤῥυθμισας· ἐν…
ltx/gr_gr_cog/me.m10.d03:meMA.Ode4C11.melody	@ltx/gr_gr_cog/he.h.m8:heHE.SyMouIschys.name
ltx/gr_gr_cog/me.m10.d03:meMA.Ode4C11.mode	@ltx/gr_gr_cog/miscellanea:misc.Mode8
ltx/gr_gr_cog/me.m10.d03:meMA.Ode4C11.ode	@ltx/gr_gr_cog/miscellanea:misc.Ode4
ltx/gr_gr_cog/me.m10.d03:meMA.Ode4C11.text	Ἐκκλησιῶν, τὴν εὐκοσμίαν ἐῤῥυθμισας· ἐν αὐταῖς γάρ, Πάτερ ἐζωγράφησας, μορφωτικαῖς, τύπους ἐμφανεῖς, ἱεροπλαστίαις, τῶν ἀμορφώτων Δυνάμεων, διʼ ὧν μυσταγωγεῖται, καὶ φωτίζεται πᾶσα, τῶν πιστῶν ἡ θεόφρων ὁμήγυρις.
ltx/gr_gr_cog/me.m10.d03:meMA.Ode4C12.incipit	Ῥεῖθρα τῆς σῆς, θεολογίας Θεόληπτε…
ltx/gr_gr_cog/me.m10.d03:meMA.Ode4C12.melody	@ltx/gr_gr_cog/he.h.m8:heHE.SyMouIschys.name
ltx/gr_gr_cog/me.m10.d03:meMA.Ode4C12.mode	@ltx/gr_gr_cog/miscellanea:misc.Mode8
ltx/gr_gr_cog/me.m10.d03:meMA.Ode4C12.ode	@ltx/gr_gr_cog/miscellanea:misc.Ode4
ltx/gr_gr_cog/me.m10.d03:meMA.Ode4C12.text	Ῥεῖθρα τῆς σῆς, θεολογίας Θεόληπτε, τοὺς λειμῶνας, ἄγαν καταρδεύουσι, τοὺς λογικοὺς καὶ ἀειθαλεῖς, καὶ πεφυτευμένους, ἐπὶ δογμάτων ὀρθότητι· Μονάδα γάρ οὐσίας, ἐν Τριάδι προσώπων, τὴν σεπτὴν Μοναρχίαν ἐκήρυξας.
ltx/gr_gr_cog/me.m10.d03:meMA.Ode4C13.incipit	Ἀγγελικῆς, ἱεραρχίας τὸν σύντονον, ἱεράρχα…
ltx/gr_gr_cog/me.m10.d03:meMA.Ode4C13.melody	@ltx/gr_gr_cog/he.h.m8:heHE.SyMouIschys.name
ltx/gr_gr_cog/me.m10.d03:meMA.Ode4C13.mode	@ltx/gr_gr_cog/miscellanea:misc.Mode8
ltx/gr_gr_cog/me.m10.d03:meMA.Ode4C13.ode	@ltx/gr_gr_cog/miscellanea:misc.Ode4
ltx/gr_gr_cog/me.m10.d03:meMA.Ode4C13.text	Ἀγγελικῆς, ἱεραρχίας τὸν σύντονον, ἱεράρχα, πόθον καὶ τὸν ἔρωτα, πρὸς τὸν Θεόν, καὶ τὴν ἀκλινῆ, νεῦσιν πρὸς τὸ ὕψος, τὸ θεῖον καὶ ἀκατάληπτον, ἐδίδαξας ἐμφρόνως, τοὺς ἐν πίστει βοῶντας· Τῇ δυνάμει σου δόξα φιλάνθρωπε.
ltx/gr_gr_cog/me.m10.d03:meMA.Ode4C1T.incipit	Ἱερουργός, τῆς σωτηρίας ἐγένετο, ὁ…
ltx/gr_gr_cog/me.m10.d03:meMA.Ode4C1T.melody	@ltx/gr_gr_cog/he.h.m8:heHE.SyMouIschys.name
ltx/gr_gr_cog/me.m10.d03:meMA.Ode4C1T.mode	@ltx/gr_gr_cog/miscellanea:misc.Mode8
ltx/gr_gr_cog/me.m10.d03:meMA.Ode4C1T.ode	@ltx/gr_gr_cog/miscellanea:misc.Ode4
ltx/gr_gr_cog/me.m10.d03:meMA.Ode4C1T.text	Ἱερουργός, τῆς σωτηρίας ἐγένετο, ὁ Υἱός σου, πᾶσι τοῖς ὑμνοῦσί σε, καὶ ποδηγὸς καὶ φωταγωγός, καὶ δικαιοσύνη, Παρθένε καὶ ἀπολύτρωσις· διό σε Θεοτόκον, ἀληθῶς καὶ κυρίως, οἱ πιστοὶ ὁμοφρόνως δοξάζομεν.
ltx/gr_gr_cog/me.m10.d03:meMA.Ode5C11.greekmelody	@ltx/gr_gr_cog/he.h.m8:heHE.InaTiMeAposo.greekname
ltx/gr_gr_cog/me.m10.d03:meMA.Ode5C11.incipit	Ῥημάτων σου ὁ φθόγγος, ὥσπερ…
ltx/gr_gr_cog/me.m10.d03:meMA.Ode5C11.melody	@ltx/gr_gr_cog/he.h.m8:heHE.InaTiMeAposo.name
ltx/gr_gr_cog/me.m10.d03:meMA.Ode5C11.mode	@ltx/gr_gr_cog/miscellanea:misc.Mode8
ltx/gr_gr_cog/me.m10.d03:meMA.Ode5C11.ode	@ltx/gr_gr_cog/miscellanea:misc.Ode5
ltx/gr_gr_cog/me.m10.d03:meMA.Ode5C11.text	Ῥημάτων σου ὁ φθόγγος, ὥσπερ τις οὐράνιος ἦχος φερόμενος, τὰς ἀθέους φρένας, κατεβρόντησε λόγῳ τῆς χάριτος, καὶ δογμάτων θείων, μαρμαρυγαῖς ταῖς φανοτάταις, τῶν πιστῶν τὰς καρδίας ἐλάμπρυνεν.
ltx/gr_gr_cog/me.m10.d03:meMA.Ode5C12.incipit	Ὡμοιώθης ἐμπόρῳ, τῷ τοὺς μαργαρίτας…
ltx/gr_gr_cog/me.m10.d03:meMA.Ode5C12.melody	@ltx/gr_gr_cog/he.h.m8:heHE.InaTiMeAposo.name
ltx/gr_gr_cog/me.m10.d03:meMA.Ode5C12.mode	@ltx/gr_gr_cog/miscellanea:misc.Mode8
ltx/gr_gr_cog/me.m10.d03:meMA.Ode5C12.ode	@ltx/gr_gr_cog/miscellanea:misc.Ode5
ltx/gr_gr_cog/me.m10.d03:meMA.Ode5C12.text	Ὡμοιώθης ἐμπόρῳ, τῷ τοὺς μαργαρίτας ζητοῦντι πανόλβιε, καὶ εὑρὼν τὸν ἕνα, μαργαρίτην τὸν ὄντως πολύτιμον, καὶ θαυμάσας τούτου, τὰς θεουργοὺς φωτοβολίας, Ἱεράρχα Θεὸν ὡμολόγησας.
ltx/gr_gr_cog/me.m10.d03:meMA.Ode5C13.incipit	Τὴν πηγὴν τῆς σοφίας, ἐμφιλοσοφώτατα…
ltx/gr_gr_cog/me.m10.d03:meMA.Ode5C13.melody	@ltx/gr_gr_cog/he.h.m8:heHE.InaTiMeAposo.name
ltx/gr_gr_cog/me.m10.d03:meMA.Ode5C13.mode	@ltx/gr_gr_cog/miscellanea:misc.Mode8
ltx/gr_gr_cog/me.m10.d03:meMA.Ode5C13.ode	@ltx/gr_gr_cog/miscellanea:misc.Ode5
ltx/gr_gr_cog/me.m10.d03:meMA.Ode5C13.text	Τὴν πηγὴν τῆς σοφίας, ἐμφιλοσοφώτατα, Πάτερ ἠγάπησας, καὶ τῷ ταύτης φίλτρῳ, καὶ ἀγάπῃ συμπεριφερόμενος, πολλοστὸς ἐγένου, καὶ ποταμοὺς θείων ναμάτων, ἀενάως πηγάζεις θεόληπτε.
ltx/gr_gr_cog/me.m10.d03:meMA.Ode5C1T.incipit	Ὡς κεχαριτωμένη, τὴν καλλοποιὸν ὑπεδέξω…
ltx/gr_gr_cog/me.m10.d03:meMA.Ode5C1T.melody	@ltx/gr_gr_cog/he.h.m8:heHE.InaTiMeAposo.name
ltx/gr_gr_cog/me.m10.d03:meMA.Ode5C1T.mode	@ltx/gr_gr_cog/miscellanea:misc.Mode8
ltx/gr_gr_cog/me.m10.d03:meMA.Ode5C1T.ode	@ltx/gr_gr_cog/miscellanea:misc.Ode5
ltx/gr_gr_cog/me.m10.d03:meMA.Ode5C1T.text	Ὡς κεχαριτωμένη, τὴν καλλοποιὸν ὑπεδέξω εὐπρέπειαν, τὴν τὰ πάντα μόνῳ, τῷ βουλήματι κατασκευάσασαν, καὶ τῷ θείῳ κάλλει, καὶ φωτισμῷ τῆς εὐσεβείας, Θεομῆτορ ἡμᾶς καλλωπίσασαν.
ltx/gr_gr_cog/me.m10.d03:meMA.Ode6C11.greekmelody	@ltx/gr_gr_cog/he.h.m8:heHE.IlasthitiMoiSotir.greekname
ltx/gr_gr_cog/me.m10.d03:meMA.Ode6C11.incipit	Νομίμως φιλοσοφῶν, σοφίας δώρων ἐπέτυχες…
ltx/gr_gr_cog/me.m10.d03:meMA.Ode6C11.melody	@ltx/gr_gr_cog/he.h.m8:heHE.IlasthitiMoiSotir.name
ltx/gr_gr_cog/me.m10.d03:meMA.Ode6C11.mode	@ltx/gr_gr_cog/miscellanea:misc.Mode8
ltx/gr_gr_cog/me.m10.d03:meMA.Ode6C11.ode	@ltx/gr_gr_cog/miscellanea:misc.Ode6
ltx/gr_gr_cog/me.m10.d03:meMA.Ode6C11.text	Νομίμως φιλοσοφῶν, σοφίας δώρων ἐπέτυχες· ἐνθέως θεολογῶν, ὀρθόδοξα δόγματα, Παμμάκαρ κατέλιπες, ὧν κατατρυφῶντες, οἱ πιστοὶ σὲ μακαρίζομεν.
ltx/gr_gr_cog/me.m10.d03:meMA.Ode6C12.incipit	Συνέσει θεοπρεπεῖ, θεόφρον καλλωπιζόμενος, τῷ…
ltx/gr_gr_cog/me.m10.d03:meMA.Ode6C12.melody	@ltx/gr_gr_cog/he.h.m8:heHE.IlasthitiMoiSotir.name
ltx/gr_gr_cog/me.m10.d03:meMA.Ode6C12.mode	@ltx/gr_gr_cog/miscellanea:misc.Mode8
ltx/gr_gr_cog/me.m10.d03:meMA.Ode6C12.ode	@ltx/gr_gr_cog/miscellanea:misc.Ode6
ltx/gr_gr_cog/me.m10.d03:meMA.Ode6C12.text	Συνέσει θεοπρεπεῖ, θεόφρον καλλωπιζόμενος, τῷ θείῳ μυσταγωγῷ, τὸ οὖς σου ὑπέκλινας, καὶ τὴν ὑπερκόσμιον, ὑπʼ αὐτοῦ σοφίαν, ἐμυήθης Διονύσιε.
ltx/gr_gr_cog/me.m10.d03:meMA.Ode6C13.incipit	Ὁ βίος σου θαυμαστός, ὁ…
ltx/gr_gr_cog/me.m10.d03:meMA.Ode6C13.melody	@ltx/gr_gr_cog/he.h.m8:heHE.IlasthitiMoiSotir.name
ltx/gr_gr_cog/me.m10.d03:meMA.Ode6C13.mode	@ltx/gr_gr_cog/miscellanea:misc.Mode8
ltx/gr_gr_cog/me.m10.d03:meMA.Ode6C13.ode	@ltx/gr_gr_cog/miscellanea:misc.Ode6
ltx/gr_gr_cog/me.m10.d03:meMA.Ode6C13.text	Ὁ βίος σου θαυμαστός, ὁ λόγος θαυμασιώτερος, ἡ γλῶσσά σου φωταυγής, τὸ στόμα πυρίπνοον, μάκαρ Διονύσιε, ὁ δὲ νοῦς σου Πάτερ, ἀκριβῶς θεοειδέστατος.
ltx/gr_gr_cog/me.m10.d03:meMA.Ode6C1T.incipit	Φωνήν σοι τοῦ Γαβριήλ, τὸ…
ltx/gr_gr_cog/me.m10.d03:meMA.Ode6C1T.melody	@ltx/gr_gr_cog/he.h.m8:heHE.IlasthitiMoiSotir.name
ltx/gr_gr_cog/me.m10.d03:meMA.Ode6C1T.mode	@ltx/gr_gr_cog/miscellanea:misc.Mode8
ltx/gr_gr_cog/me.m10.d03:meMA.Ode6C1T.ode	@ltx/gr_gr_cog/miscellanea:misc.Ode6
ltx/gr_gr_cog/me.m10.d03:meMA.Ode6C1T.text	Φωνήν σοι τοῦ Γαβριήλ, τὸ Χαῖρε πίστει κραυγάζομεν, ἐξ ἦς ἀφράστως ἡμῖν, ὁ ζωαρχικώτατος, ἀνὴρ ἐχρημάτισε, καὶ συνανεστράφη, τοῖς ἀνθρώποις ὁ φιλάνθρωπος.
ltx/gr_gr_cog/me.m10.d03:meMA.Ode6H.greekmelody	@ltx/gr_gr_cog/he.h.m8:heHE.IlasthitiMoiSotir.greekname
ltx/gr_gr_cog/me.m10.d03:meMA.Ode6H.incipit	@ltx/gr_gr_cog/he.h.m8:heHE.IlasthitiMoiSotir.incipit
ltx/gr_gr_cog/me.m10.d03:meMA.Ode6H.melody	@ltx/gr_gr_cog/he.h.m8:heHE.IlasthitiMoiSotir.melody
ltx/gr_gr_cog/me.m10.d03:meMA.Ode6H.mode	@ltx/gr_gr_cog/miscellanea:misc.Mode8
ltx/gr_gr_cog/me.m10.d03:meMA.Ode6H.ode	@ltx/gr_gr_cog/miscellanea:misc.Ode6
ltx/gr_gr_cog/me.m10.d03:meMA.Ode6H.text	@ltx/gr_gr_cog/he.h.m8:heHE.IlasthitiMoiSotir.text
ltx/gr_gr_cog/me.m10.d03:meMA.Ode7C11.greekmelody	@ltx/gr_gr_cog/he.h.m8:heHE.TheouSynkatavasin.greekname
ltx/gr_gr_cog/me.m10.d03:meMA.Ode7C11.incipit	Ὡς ὄμβρος οὐράνιος, ἐν γῇ…
ltx/gr_gr_cog/me.m10.d03:meMA.Ode7C11.melody	@ltx/gr_gr_cog/he.h.m8:heHE.TheouSynkatavasin.name
ltx/gr_gr_cog/me.m10.d03:meMA.Ode7C11.mode	@ltx/gr_gr_cog/miscellanea:misc.Mode8
ltx/gr_gr_cog/me.m10.d03:meMA.Ode7C11.ode	@ltx/gr_gr_cog/miscellanea:misc.Ode7
ltx/gr_gr_cog/me.m10.d03:meMA.Ode7C11.text	Ὡς ὄμβρος οὐράνιος, ἐν γῇ διψώσῃ τὰ σὰ διδάγματα, τῶν πιστῶν τὰς καρδίας, ἀεὶ ποθούσας καταπιαίνουσι, καὶ ἀκορέστως βοᾶν ἐκδιδάσκουσιν· Εὐλογητὸς ὁ Θεός, ὁ τῶν Πατέρων ἡμῶν.
ltx/gr_gr_cog/me.m10.d03:meMA.Ode7C12.incipit	Νοήσει θεόφρονι, τοὺς ἀσωμάτους Νόας…
ltx/gr_gr_cog/me.m10.d03:meMA.Ode7C12.melody	@ltx/gr_gr_cog/he.h.m8:heHE.TheouSynkatavasin.name
ltx/gr_gr_cog/me.m10.d03:meMA.Ode7C12.mode	@ltx/gr_gr_cog/miscellanea:misc.Mode8
ltx/gr_gr_cog/me.m10.d03:meMA.Ode7C12.ode	@ltx/gr_gr_cog/miscellanea:misc.Ode7
ltx/gr_gr_cog/me.m10.d03:meMA.Ode7C12.text	Νοήσει θεόφρονι, τοὺς ἀσωμάτους Νόας διέγραψας, καὶ τὰς τούτων Παμμάκαρ, ὑμνολογίας ἔνθους γενόμενος, τὴν Ἐκκλησίαν ὑμνεῖν ἐξεπαίδευσας· Εὐλογητὸς ὁ Θεός, ὁ τῶν Πατέρων ἡμῶν.
ltx/gr_gr_cog/me.m10.d03:meMA.Ode7C13.incipit	Δοχεῖον τοῦ Πνεύματος, τοῦ Παναγίου…
ltx/gr_gr_cog/me.m10.d03:meMA.Ode7C13.melody	@ltx/gr_gr_cog/he.h.m8:heHE.TheouSynkatavasin.name
ltx/gr_gr_cog/me.m10.d03:meMA.Ode7C13.mode	@ltx/gr_gr_cog/miscellanea:misc.Mode8
ltx/gr_gr_cog/me.m10.d03:meMA.Ode7C13.ode	@ltx/gr_gr_cog/miscellanea:misc.Ode7
ltx/gr_gr_cog/me.m10.d03:meMA.Ode7C13.text	Δοχεῖον τοῦ Πνεύματος, τοῦ Παναγίου ὤφθης εὐάρμοστον, καὶ τὰς τούτου ἐμπνεύσεις, καὶ φανερώσεις προφητικώτατα, προαγορεύων, ἐβόας γηθόμενος· Εὐλογητὸς ὁ Θεός, ὁ τῶν Πατέρων ἡμῶν.
ltx/gr_gr_cog/me.m10.d03:meMA.Ode7C1T.incipit	Ἰδοὺ νῦν πεπλήρωται, τοῦ Ἠσαΐου…
ltx/gr_gr_cog/me.m10.d03:meMA.Ode7C1T.melody	@ltx/gr_gr_cog/he.h.m8:heHE.TheouSynkatavasin.name
ltx/gr_gr_cog/me.m10.d03:meMA.Ode7C1T.mode	@ltx/gr_gr_cog/miscellanea:misc.Mode8
ltx/gr_gr_cog/me.m10.d03:meMA.Ode7C1T.ode	@ltx/gr_gr_cog/miscellanea:misc.Ode7
ltx/gr_gr_cog/me.m10.d03:meMA.Ode7C1T.text	Ἰδοὺ νῦν πεπλήρωται, τοῦ Ἠσαΐου ἡ προαγόρευσις· ἐν γαστρὶ γὰρ Παρθένε, τὸν Θεὸν Λόγον ἔσχες, καὶ τέτοκας τὸν Ζωοδότην, ᾧ πάντες κραυγάζομεν· Εὐλογητὸς ὁ Θεός, ὁ τῶν Πατέρων ἡμῶν.
ltx/gr_gr_cog/me.m10.d03:meMA.Ode8C11.greekmelody	@ltx/gr_gr_cog/he.h.m8:heHE.EptaplasiosKaminon.greekname
ltx/gr_gr_cog/me.m10.d03:meMA.Ode8C11.incipit	Διαφανὲς ὡς ἔσοπτρον, γεγονὼς Διονύσιε…
ltx/gr_gr_cog/me.m10.d03:meMA.Ode8C11.melody	@ltx/gr_gr_cog/he.h.m8:heHE.EptaplasiosKaminon.name
ltx/gr_gr_cog/me.m10.d03:meMA.Ode8C11.mode	@ltx/gr_gr_cog/miscellanea:misc.Mode8
ltx/gr_gr_cog/me.m10.d03:meMA.Ode8C11.ode	@ltx/gr_gr_cog/miscellanea:misc.Ode8
ltx/gr_gr_cog/me.m10.d03:meMA.Ode8C11.text	Διαφανὲς ὡς ἔσοπτρον, γεγονὼς Διονύσιε, καὶ χωρητικὸν τῶν καθαρῶν ἐμφάσεων, τὸν νοῦν ἐργασάμενος, διʼ ἀρετῆς πανόλβιε, τὰς μαρμαρυγάς, τῶν ὑπὲρ νοῦν λαμπηδόνων, δεχόμενος ἐβόας· Ἱερεῖς εὐλογεῖτε, λαὸς ὑπερυψοῦτε, Χριστὸν εἰς τοὺς αἰῶνας.
ltx/gr_gr_cog/me.m10.d03:meMA.Ode8C12.incipit	Ἀφθονωτέρα χάρις σου, ἐξεχύθη τοῖς…
ltx/gr_gr_cog/me.m10.d03:meMA.Ode8C12.melody	@ltx/gr_gr_cog/he.h.m8:heHE.EptaplasiosKaminon.name
ltx/gr_gr_cog/me.m10.d03:meMA.Ode8C12.mode	@ltx/gr_gr_cog/miscellanea:misc.Mode8
ltx/gr_gr_cog/me.m10.d03:meMA.Ode8C12.ode	@ltx/gr_gr_cog/miscellanea:misc.Ode8
ltx/gr_gr_cog/me.m10.d03:meMA.Ode8C12.text	Ἀφθονωτέρα χάρις σου, ἐξεχύθη τοῖς χείλεσιν· ὅθεν τὰς ἐνθέους, διδαχὰς παρέθηκας, τὴν τούτων διάνοιαν, ὑπερφυῶς ἡμῖν ἐξαπλῶν, καὶ διατρανῶν, καὶ τηλαυγῶς ἀναπτύσσων, τοῖς πίστει μελῳδοῦσιν· Ἱερεῖς εὐλογεῖτε, λαὸς ὑπερυψοῦτε, Χριστὸν εἰς τοὺς αἰῶνας.
ltx/gr_gr_cog/me.m10.d03:meMA.Ode8C13.incipit	Γνωριμωτέρα γέγονε, διὰ σοῦ Διονύσιε…
ltx/gr_gr_cog/me.m10.d03:meMA.Ode8C13.melody	@ltx/gr_gr_cog/he.h.m8:heHE.EptaplasiosKaminon.name
ltx/gr_gr_cog/me.m10.d03:meMA.Ode8C13.mode	@ltx/gr_gr_cog/miscellanea:misc.Mode8
ltx/gr_gr_cog/me.m10.d03:meMA.Ode8C13.ode	@ltx/gr_gr_cog/miscellanea:misc.Ode8
ltx/gr_gr_cog/me.m10.d03:meMA.Ode8C13.text	Γνωριμωτέρα γέγονε, διὰ σοῦ Διονύσιε, ἡ τῶν Ἀθηνῶν πανευκλεὴς Μητρόπολις, Χριστῷ προσενέγκασα, σὲ ἀπαρχὴν πανίερον, τῷ Παμβασιλεῖ, διηνεκῶς μελῳδοῦντα· Οἱ παῖδες εὐλογεῖτε, Ἱερεῖς ἀνυμνεῖτε, λαὸς ὑπερυψοῦτε, Χριστὸν εἰς τοὺς αἰῶνας.
ltx/gr_gr_cog/me.m10.d03:meMA.Ode8C1T.incipit	Μήτηρ Θεοῦ Πανάμωμε, τῆς ψυχῆς…
ltx/gr_gr_cog/me.m10.d03:meMA.Ode8C1T.melody	@ltx/gr_gr_cog/he.h.m8:heHE.EptaplasiosKaminon.name
ltx/gr_gr_cog/me.m10.d03:meMA.Ode8C1T.mode	@ltx/gr_gr_cog/miscellanea:misc.Mode8
ltx/gr_gr_cog/me.m10.d03:meMA.Ode8C1T.ode	@ltx/gr_gr_cog/miscellanea:misc.Ode8
ltx/gr_gr_cog/me.m10.d03:meMA.Ode8C1T.text	Μήτηρ Θεοῦ Πανάμωμε, τῆς ψυχῆς μου τὰ τραύματα, καὶ τῆς ἁμαρτίας, τὰς οὐλὰς ἐξάλειψον· Υἱὸν γὰρ ἐγέννησας, τὸν ἐξουσίαν ἔχοντα, τοὺς πεπεδημένους ταῖς σειραῖς τῶν πταισμάτων, εὐκόλως ἀνιέναι τῶν δεσμῶν τῶν ἀλύτων, τὸν μόνον εὐεργέτην, καὶ μόνον ζωοδότην.
ltx/gr_gr_cog/me.m10.d03:meMA.Ode8H.greekmelody	@ltx/gr_gr_cog/he.h.m8:heHE.EptaplasiosKaminon.greekname
ltx/gr_gr_cog/me.m10.d03:meMA.Ode8H.incipit	@ltx/gr_gr_cog/he.h.m8:heHE.EptaplasiosKaminon.incipit
ltx/gr_gr_cog/me.m10.d03:meMA.Ode8H.melody	@ltx/gr_gr_cog/he.h.m8:heHE.EptaplasiosKaminon.melody
ltx/gr_gr_cog/me.m10.d03:meMA.Ode8H.mode	@ltx/gr_gr_cog/miscellanea:misc.Mode8
ltx/gr_gr_cog/me.m10.d03:meMA.Ode8H.ode	@ltx/gr_gr_cog/miscellanea:misc.Ode8
ltx/gr_gr_cog/me.m10.d03:meMA.Ode8H.text	@ltx/gr_gr_cog/he.h.m8:heHE.EptaplasiosKaminon.text
ltx/gr_gr_cog/me.m10.d03:meMA.Ode9C11.greekmelody	@ltx/gr_gr_cog/he.h.m8:heHE.ExestiEpiTouto.greekname
ltx/gr_gr_cog/me.m10.d03:meMA.Ode9C11.incipit	Ἁγίων Ἀποστόλων ἀξιωθείς, θεατὴς χρηματίσαι…
ltx/gr_gr_cog/me.m10.d03:meMA.Ode9C11.melody	@ltx/gr_gr_cog/he.h.m8:heHE.ExestiEpiTouto.name
ltx/gr_gr_cog/me.m10.d03:meMA.Ode9C11.mode	@ltx/gr_gr_cog/miscellanea:misc.Mode8
ltx/gr_gr_cog/me.m10.d03:meMA.Ode9C11.ode	@ltx/gr_gr_cog/miscellanea:misc.Ode9
ltx/gr_gr_cog/me.m10.d03:meMA.Ode9C11.text	Ἁγίων Ἀποστόλων ἀξιωθείς, θεατὴς χρηματίσαι καὶ σύμπονος, συγκοινωνός, γέγονας τῆς δόξης καὶ σὺν αὐτοῖς, ἐπὶ τὴν θέαν ἔσπευσας, σώματος τοῦ ὄντως ζωαρχικοῦ, τῆς μόνης Θεοτόκου, καὶ σεβασμιωτάτης· ἣν ἐπαξίως μεγαλύνομεν.
ltx/gr_gr_cog/me.m10.d03:meMA.Ode9C12.incipit	Τῆς θείας βασιλείας ἐν οὐρανοῖς…
ltx/gr_gr_cog/me.m10.d03:meMA.Ode9C12.melody	@ltx/gr_gr_cog/he.h.m8:heHE.ExestiEpiTouto.name
ltx/gr_gr_cog/me.m10.d03:meMA.Ode9C12.mode	@ltx/gr_gr_cog/miscellanea:misc.Mode8
ltx/gr_gr_cog/me.m10.d03:meMA.Ode9C12.ode	@ltx/gr_gr_cog/miscellanea:misc.Ode9
ltx/gr_gr_cog/me.m10.d03:meMA.Ode9C12.text	Τῆς θείας βασιλείας ἐν οὐρανοῖς, κληρονόμος ἐγένου ὡς ἔννομος, Ἀρχιερεύς, Πάτερ ὡς ἀήττητος ἀθλητής, ἱερωσύνης χρίσματι, αἷμα συγκεράσας μαρτυρικόν· διὸ διπλοῦς στεφάνους, ἀπείληφας ἀξίως, ἱερομύστα Διονύσιε.
ltx/gr_gr_cog/me.m10.d03:meMA.Ode9C13.incipit	Ὡς ἔχων παῤῥησίαν πρὸς τὸν…
ltx/gr_gr_cog/me.m10.d03:meMA.Ode9C13.melody	@ltx/gr_gr_cog/he.h.m8:heHE.ExestiEpiTouto.name
ltx/gr_gr_cog/me.m10.d03:meMA.Ode9C13.mode	@ltx/gr_gr_cog/miscellanea:misc.Mode8
ltx/gr_gr_cog/me.m10.d03:meMA.Ode9C13.ode	@ltx/gr_gr_cog/miscellanea:misc.Ode9
ltx/gr_gr_cog/me.m10.d03:meMA.Ode9C13.text	Ὡς ἔχων παῤῥησίαν πρὸς τὸν Θεόν, ἱεράρχα σοφὲ Διονύσιε, διὰ παντός, πρέσβευε ῥυσθῆναι ἐκ πειρασμῶν, τοὺς εὐσεβῶς ὑμνοῦντας σε, μύστα τῶν ἀῤῥήτων θεωριῶν, ὡς τῆς κρυφιομύστου, καὶ θεαρχικωτάτης, ἱεροφάντης ἀγαθότητος.
ltx/gr_gr_cog/me.m10.d03:meMA.Ode9C1T.incipit	Νικῶσαν τὰς αἱρέσεις θριαμβικῶς, τὴν…
ltx/gr_gr_cog/me.m10.d03:meMA.Ode9C1T.melody	@ltx/gr_gr_cog/he.h.m8:heHE.ExestiEpiTouto.name
ltx/gr_gr_cog/me.m10.d03:meMA.Ode9C1T.mode	@ltx/gr_gr_cog/miscellanea:misc.Mode8
ltx/gr_gr_cog/me.m10.d03:meMA.Ode9C1T.ode	@ltx/gr_gr_cog/miscellanea:misc.Ode9
ltx/gr_gr_cog/me.m10.d03:meMA.Ode9C1T.text	Νικῶσαν τὰς αἱρέσεις θριαμβικῶς, τὴν σεπτὴν Ἐκκλησίαν ἀνάδειξον, ἣν ὁ Χριστός, αἵματι τιμίῳ, τῷ ἑαυτοῦ, ὡς ἀγαθὸς ἐκτήσατο, Κεχαριτωμένη ὁ σὸς υἱός, καὶ σῶσον ἐκ κινδύνων, καὶ τῆς ἀμηχανίας, τῆς κατεχούσης ἡμᾶς λύτρωσαι.
ltx/gr_gr_cog/me.m10.d03:meMA.Ode9H.greekmelody	@ltx/gr_gr_cog/he.h.m8:heHE.ExestiEpiTouto.greekname
ltx/gr_gr_cog/me.m10.d03:meMA.Ode9H.incipit	@ltx/gr_gr_cog/he.h.m8:heHE.ExestiEpiTouto.incipit
ltx/gr_gr_cog/me.m10.d03:meMA.Ode9H.melody	@ltx/gr_gr_cog/he.h.m8:heHE.ExestiEpiTouto.melody
ltx/gr_gr_cog/me.m10.d03:meMA.Ode9H.mode	@ltx/gr_gr_cog/miscellanea:misc.Mode8
ltx/gr_gr_cog/me.m10.d03:meMA.Ode9H.ode	@ltx/gr_gr_cog/miscellanea:misc.Ode9
ltx/gr_gr_cog/me.m10.d03:meMA.Ode9H.text	@ltx/gr_gr_cog/he.h.m8:heHE.ExestiEpiTouto.text
ltx/gr_gr_cog/me.m10.d03:meMA.Oikos1.text	Ἄγγελος ἐξ ἀνθρώπων ἀρεταῖς χρηματίσας, ὁ μέγας Διονύσιος πᾶσαν, ὡς ὑπόπτερος, ἐμυήθη τὸν νοῦν τὴν οὐράνιον γνῶσιν· διὸ ᾄσμασιν, ὡς Ἄγγελον τιμήσωμεν, βοῶντες πρὸς αὐτὸν τοιαῦτα.
ltx/gr_gr_cog/me.m10.d03:meMA.Oikos12.text	Χαῖρε, ὁ γνοὺς Χριστὸν διὰ Παύλου, χαῖρε, πολλοὺς πρὸς Χριστὸν ἐπιστρέψας.
ltx/gr_gr_cog/me.m10.d03:meMA.Oikos13.text	Χαῖρε, πολυθέου σκηνῆς ὀλετήριον, χαῖρε, θεογνώστου βουλῆς σκοπευτήριον.
ltx/gr_gr_cog/me.m10.d03:meMA.Oikos14.text	Χαῖρε, βίβλος θεοχάρακτος, μυστηρίων θησαυρέ, χαῖρε πίναξ θεομόρφωτε, καὶ διόπτρα οὐρανοῦ.
ltx/gr_gr_cog/me.m10.d03:meMA.Oikos15.text	Χαῖρε, ὅτι τὸ Πάθος τοῦ Κυρίου κατεῖδες, χαῖρε, ὅτι προθύμως διʼ αὐτὸν σφαγιάζῃ.
ltx/gr_gr_cog/me.m10.d03:meMA.Oikos16.text	Χαῖρε, πηγὴ βλυστάνουσα ἄφεσιν, χαῖρε, ῥανὶς κοιλαίνουσα ἄνοιαν.
ltx/gr_gr_cog/me.m10.d03:meMA.Oikos17.text	Χαῖρε, ὁδὸς ἀπλανὴς σωτηρίας, χαῖρε, φραγμὸς ἀσεβῶν παροδίας.
ltx/gr_gr_cog/me.m10.d03:meMA.Oikos18.text	Χαίροις, Πάτερ παγκόσμιε.
ltx/gr_gr_cog/me.m10.d03:meVE.AposGlory.incipit	Τῆς οὐρανίου γνώσεως, ἀθεώρητον βυθὸν…
ltx/gr_gr_cog/me.m10.d03:meVE.AposGlory.melody	
ltx/gr_gr_cog/me.m10.d03:meVE.AposGlory.mode	@ltx/gr_gr_cog/miscellanea:misc.Mode4
ltx/gr_gr_cog/me.m10.d03:meVE.AposGlory.text	Τῆς οὐρανίου γνώσεως, ἀθεώρητον βυθόν σε καλέσωμεν, λαμπρότατε Μάρτυς τοῦ Χριστοῦ, ὡς γὰρ ὁπλίτην, καὶ στεῤῥὸν ὑπέρμαχον τῆς Ἐκκλησίας, ἀνυμνοῦμέν σε σοφέ· πυρὶ γὰρ ἐλλαμφθεὶς τῷ ἁγνοτάτῳ ἠξιώθης ἅμα ταῖς ἄνω στρατολογίαις, τὸ φωτεινὸν περιβόλαιον, ἐνδύσασθαι Χριστόν, καὶ λαμπρυνθῆναι τῇ αἴγλῃ τοῦ Πνεύματος, τὸν νοῦν Διονύσιε· διό σου τὴν παγκόσμιον μνήμην πανηγυρίζοντες, πιστῶς δοξάζομεν, τὸν δοξάσαντά σε Κύριον.
ltx/gr_gr_cog/me.m10.d03:meVE.AposStavrotheotokion.greekmelody	@ltx/gr_gr_cog/he.a.m4:heAU.OsGennaionEnMartysi.greekname
ltx/gr_gr_cog/me.m10.d03:meVE.AposStavrotheotokion.incipit	@ltx/gr_gr_cog/oc.m4.d6:ocMA.AposTheotokion.incipit
ltx/gr_gr_cog/me.m10.d03:meVE.AposStavrotheotokion.melody	@ltx/gr_gr_cog/he.a.m4:heAU.OsGennaionEnMartysi.name
ltx/gr_gr_cog/me.m10.d03:meVE.AposStavrotheotokion.mode	@ltx/gr_gr_cog/miscellanea:misc.Mode4
ltx/gr_gr_cog/me.m10.d03:meVE.AposStavrotheotokion.text	@ltx/gr_gr_cog/oc.m4.d6:ocMA.AposTheotokion.text
ltx/gr_gr_cog/me.m10.d03:meVE.AposTheotokion.greekmelody	@ltx/gr_gr_cog/he.a.m4:heAU.OsGennaionEnMartysi.greekname
ltx/gr_gr_cog/me.m10.d03:meVE.AposTheotokion.incipit	Ἀπὸ πάσης με θλίψεως, καὶ…
ltx/gr_gr_cog/me.m10.d03:meVE.AposTheotokion.melody	@ltx/gr_gr_cog/he.a.m4:heAU.OsGennaionEnMartysi.name
ltx/gr_gr_cog/me.m10.d03:meVE.AposTheotokion.mode	@ltx/gr_gr_cog/miscellanea:misc.Mode4
ltx/gr_gr_cog/me.m10.d03:meVE.AposTheotokion.text	Ἀπὸ πάσης με θλίψεως, καὶ παντοίας κακώσεως, καὶ δεινῆς ἐκλύτρωσαι περιστάσεως, καὶ πειρασμῶν πολυτρόπων με, ταῖς θείαις πρεσβείαις σου, καὶ σκανδάλων πονηρῶν, ἐξ ἀνθρώπων μισούντων με, καὶ δαιμόνων δέ, τῶν ζητούντων ἑκάστης ἀπολέσαι, τῆς ἡμέρας Θεοτόκε, τὸν προστασίαν σε θέμενον.
ltx/gr_gr_cog/me.m10.d03:meVE.GeneralApolytikion1.melody	
ltx/gr_gr_cog/me.m10.d03:meVE.GeneralApolytikion1.mode	@ltx/gr_gr_cog/miscellanea:misc.Mode4
ltx/gr_gr_cog/me.m10.d03:meVE.GeneralApolytikion1.name	Διονύσιε.
ltx/gr_gr_cog/me.m10.d03:meVE.MM.GeneralApolytikion1.text	@ltx/gr_gr_cog/properties:media.key
ltx/gr_gr_cog/me.m10.d03:meVE.SticGlory.incipit	Δεῦτε συμφώνως οἱ πιστοί, τὴν…
ltx/gr_gr_cog/me.m10.d03:meVE.SticGlory.melody	
ltx/gr_gr_cog/me.m10.d03:meVE.SticGlory.mode	@ltx/gr_gr_cog/miscellanea:misc.Mode2
ltx/gr_gr_cog/me.m10.d03:meVE.SticGlory.poet	@ltx/gr_gr_cog/poets:po.AndreouIerosolymitou
ltx/gr_gr_cog/me.m10.d03:meVE.SticGlory.text	Δεῦτε συμφώνως οἱ πιστοί, τὴν ἐτήσιον μνήμην τῶν ἱεραρχῶν εὐφημήσωμεν, Διονυσίου τε καὶ Κυπριανοῦ· ὁ μὲν γάρ, καταπτύσας τῶν Στωϊκῶν φιλοσόφων, καὶ τῷ σκεύει τῆς ἐκλογῆς μαθητευθείς, τῶν ἀποῤῥήτων μυστηρίων γνώστης ἐγένετο, ὁ δέ, διὰ τῆς καλλίστης παρθένου Ἰουστίνης, τὴν διάνοιαν φωτισθείς, τὴν τῶν δαιμόνων ἀπάτην ἐξέφυγε, καὶ τὰς μαγικὰς βίβλους ἐν πυρὶ ἀναλώσας, τοῦ Εὐαγγελίου κήρυξ γέγονε. Διὸ καὶ ἡμεῖς οἱ ἁμαρτωλοί, τὸν δοξάσαντα τούτους, δοξολογοῦντες Σωτῆρα βοήσωμεν· ὁ τοὺς σοὺς Ἀθλοφόρους στεφανώσας ἐν δόξῃ, Χριστὲ ὁ Θεός, ταῖς αὐτῶν ἱκεσίαις, σῶσον τὰς ψυχὰς ἡμῶν.
ltx/gr_gr_cog/me.m10.d03:meVE.SticStavrotheotokion.greekmelody	@ltx/gr_gr_cog/he.a.m2:heAU.OteEkTouXylou.greekname
ltx/gr_gr_cog/me.m10.d03:meVE.SticStavrotheotokion.incipit	Ὅτε, ἡ Πανάμωμος ἀμνάς, ἄρνα…
ltx/gr_gr_cog/me.m10.d03:meVE.SticStavrotheotokion.melody	@ltx/gr_gr_cog/he.a.m2:heAU.OteEkTouXylou.name
ltx/gr_gr_cog/me.m10.d03:meVE.SticStavrotheotokion.mode	@ltx/gr_gr_cog/miscellanea:misc.Mode2
ltx/gr_gr_cog/me.m10.d03:meVE.SticStavrotheotokion.text	Ὅτε, ἡ Πανάμωμος ἀμνάς, ἄρνα τὸν αὐτῆς ἐθεώρει, ἑλκόμενον πρὸς σφαγήν, θρήνοις ἐνεκόπτετο, ἀναβοῶσα πικρῶς· Τί σοι δῆμος ἀχάριστος, γλυκύτατον τέκνον, πάλαι ἀνταπέδωκεν, ὁ ἀπολαύσας σου, οἴμοι! τῶν πολλῶν δωρημάτων, πῶς δὲ καὶ τὸν πόνον ὑποίσω, ὅτι θέλων ταῦτα νῦν ὑφίστασαι;
ltx/gr_gr_cog/me.m10.d03:meVE.SticTheotokion.greekmelody	@ltx/gr_gr_cog/he.a.m2:heAU.OteEkTouXylou.greekname
ltx/gr_gr_cog/me.m10.d03:meVE.SticTheotokion.incipit	Χαῖρε, πᾶσα κτίσις σοι βοᾷ…
ltx/gr_gr_cog/me.m10.d03:meVE.SticTheotokion.melody	@ltx/gr_gr_cog/he.a.m2:heAU.OteEkTouXylou.name
ltx/gr_gr_cog/me.m10.d03:meVE.SticTheotokion.mode	@ltx/gr_gr_cog/miscellanea:misc.Mode2
ltx/gr_gr_cog/me.m10.d03:meVE.SticTheotokion.text	Χαῖρε, πᾶσα κτίσις σοι βοᾷ, χαῖρε Παναγία Παρθένε, χαῖρε τὸ σκῆπτρον Δαυΐδ, χαῖρε ἡ βλαστήσασα τὸν βότρυν τὸν μυστικόν, χαῖρε πύλη οὐράνιε, καὶ ἄφλεκτε βάτε, χαῖρε φῶς παγκόσμιον, χαῖρε ἡ πάντων χαρά, χαῖρε, Ἀποστόλων τὸ κλέος, χαῖρε ἡ ἀντίληψις, χαῖρε, προστασία πάντων τῶν τιμώντων σε.
ltx/gr_gr_cog/me.m10.d03:meVE.Stichera01.greekmelody	@ltx/gr_gr_cog/he.a.m1:heAU.PaneffimoiMartyres.greekname
ltx/gr_gr_cog/me.m10.d03:meVE.Stichera01.incipit	Ἀγκίστρῳ τῆς χάριτος σοφῶς, ὁ…
ltx/gr_gr_cog/me.m10.d03:meVE.Stichera01.melody	@ltx/gr_gr_cog/he.a.m1:heAU.PaneffimoiMartyres.name
ltx/gr_gr_cog/me.m10.d03:meVE.Stichera01.mode	@ltx/gr_gr_cog/miscellanea:misc.Mode1
ltx/gr_gr_cog/me.m10.d03:meVE.Stichera01.text	Ἀγκίστρῳ τῆς χάριτος σοφῶς, ὁ Παῦλος ὁ ἔνθεος, δημηγορήσας ἐζώγρησεν, Ἱεροφάντορα, καὶ τῶν ἀποῤῥήτων, θεωρὸν εἰργάσατο, σὲ σκεῦος ἐκλογῆς θεασάμενος, μεθʼ οὗ δυσώπησον, θεοῤῥῆμον Διονύσιε, τοῦ σωθῆναι, τοὺς πόθῳ ὑμνοῦντας σε.
ltx/gr_gr_cog/me.m10.d03:meVE.Stichera02.incipit	Ἀγγέλοις ὁμότιμον τὸν νοῦν, Πάτερ…
ltx/gr_gr_cog/me.m10.d03:meVE.Stichera02.melody	@ltx/gr_gr_cog/he.a.m1:heAU.PaneffimoiMartyres.name
ltx/gr_gr_cog/me.m10.d03:meVE.Stichera02.mode	@ltx/gr_gr_cog/miscellanea:misc.Mode1
ltx/gr_gr_cog/me.m10.d03:meVE.Stichera02.text	Ἀγγέλοις ὁμότιμον τὸν νοῦν, Πάτερ Διονύσιε, διʼ ἀρετῆς ἐργασάμενος, τὴν ὑπερκόσμιον, τῆς ἱεραρχίας, εὐταξίαν πάνσοφε, ἐν βίβλοις ἱεροῖς ἀνιστόρησας, καθʼ ἣν ἐῤῥύθμισας, Ἐκκλησίας τὰ συστήματα, οὐρανίων, τὰς τάξεις μιμούμενος.
ltx/gr_gr_cog/me.m10.d03:meVE.Stichera03.incipit	Ἐμφιλοσοφώτατα Θεῷ μάκαρ Διονύσιε, ὡς…
ltx/gr_gr_cog/me.m10.d03:meVE.Stichera03.melody	@ltx/gr_gr_cog/he.a.m1:heAU.PaneffimoiMartyres.name
ltx/gr_gr_cog/me.m10.d03:meVE.Stichera03.mode	@ltx/gr_gr_cog/miscellanea:misc.Mode1
ltx/gr_gr_cog/me.m10.d03:meVE.Stichera03.text	Ἐμφιλοσοφώτατα Θεῷ μάκαρ Διονύσιε, ὡς δυνατὸν ὁμοιούμενος, τῶν ὀνομάτων σύ, μυστικῶς τῶν θείων, εὐσεβῶς ἐξήπλωσας, τὴν ἔνθεον θεόφρον ἀνάπτυξιν, ἑνώσει κρείττονι, μυηθεὶς τὰ ὑπὲρ ἔννοιαν, καὶ μυήσας, τοῦ κόσμου τὰ πέρατα.
