ltx/gr_gr_cog/le.pr.me.r76:leprVE.reading.book_abbr	@ltx/gr_gr_cog/bible:Proverbs.abbr
ltx/gr_gr_cog/le.pr.me.r76:leprVE.reading.book_string	@ltx/gr_gr_cog/bible:Proverbs.text
ltx/gr_gr_cog/le.pr.me.r76:leprVE.reading.chapverse	3, 11 – 18
ltx/gr_gr_cog/le.pr.me.r76:leprVE.reading.incipit	Υἱέ, μὴ ὀλιγώρει παιδείας Κυρίου, μηδὲ ἐκλύου ὑπʼ αὐτοῦ…
ltx/gr_gr_cog/le.pr.me.r76:leprVE.reading.text	Υἱέ, μὴ ὀλιγώρει παιδείας Κυρίου, μηδὲ ἐκλύου ὑπʼ αὐτοῦ ἐλεγχόμενος. Ὃν γὰρ ἀγαπᾷ Κύριος, παιδεύει· μαστιγοῖ δὲ πάντα υἱόν, ὃν παραδέχεται. Μακάριος ἄνθρωπος, ὃς εὗρε σοφίαν, καὶ θνητός, ὃς οἶδε φρόνησιν. Κρεῖσσον γὰρ αὐτὴν ἐμπορεύεσθαι, ἢ χρυσίου καὶ ἀργυρίου θησαυρούς. Τιμιωτέρα δὲ ἐστι λίθων πολυτελῶν, οὐκ ἀντιτάσσεται αὐτῇ οὐδὲν πονηρόν· εὔγνωστὸς ἐστι πᾶσι τοῖς ἀγαπῶσιν αὐτήν· πᾶν δὲ τίμιον, οὐκ ἄξιον αὐτῆς ἐστι. Μῆκος γὰρ βίου, καὶ ἔτη ζωῆς ἐν τῇ δεξιᾷ αὐτῆς, ἐν δὲ τῇ ἀριστερᾷ αὐτῆς πλοῦτος καὶ δόξα· ἐκ τοῦ στόματος αὐτῆς ἐκπορεύεται δικαιοσύνη, νόμον δὲ καὶ ἔλεον ἐπὶ γλώσσης φορεῖ. Αἱ ὁδοὶ αὐτῆς ὁδοὶ καλαί, καὶ πᾶσαι αἱ τρίβοι αὐτῆς μετʼ εἰρήνης· Ξύλον ζωῆς ἐστι πᾶσι τοῖς ἀντεχομένοις αὐτῆς, καὶ τοῖς ἐπερειδομένοις ἐπʼ αὐτήν, ὡς ἐπὶ Κύριον ἀσφαλής.
ltx/gr_gr_cog/le.pr.me.r76:leprVE.reading.title	
ltx/gr_gr_cog/le.pr.me.r76:leprVE.reading.title_abbr	
ltx/gr_gr_cog/le.pr.me.r76:leprVE.reading.version	@ltx/gr_gr_cog/properties:version.designation
