ltx/gr_gr_cog/le.ep.me.m09.d26:lemeLI.Epistle.book_abbr	@ltx/gr_gr_cog/bible:John1.abbr
ltx/gr_gr_cog/le.ep.me.m09.d26:lemeLI.Epistle.book_string	@ltx/gr_gr_cog/bible:John1.text
ltx/gr_gr_cog/le.ep.me.m09.d26:lemeLI.Epistle.chapverse	4:12 – 19
ltx/gr_gr_cog/le.ep.me.m09.d26:lemeLI.Epistle.incipit	Θεὸν οὐδεὶς πώποτε τεθέαται…
ltx/gr_gr_cog/le.ep.me.m09.d26:lemeLI.Epistle.text	Θεὸν οὐδεὶς πώποτε τεθέαται· ἐὰν ἀγαπῶμεν ἀλλήλους, ὁ Θεὸς ἐν ἡμῖν μένει καὶ ἡ ἀγάπη αὐτοῦ τετελειωμένη ἐστὶν ἐν ἡμῖν. ἐν τούτῳ γινώσκομεν ὅτι ἐν αὐτῷ μένομεν καὶ αὐτὸς ἐν ἡμῖν, ὅτι ἐκ τοῦ Πνεύματος αὐτοῦ δέδωκεν ἡμῖν. Καὶ ἡμεῖς τεθεάμεθα καὶ μαρτυροῦμεν ὅτι ὁ πατὴρ ἀπέσταλκε τὸν υἱὸν σωτῆρα τοῦ κόσμου. ὃς ἂν ὁμολογήσῃ ὅτι Ἰησοῦς ἐστιν ὁ υἱὸς τοῦ Θεοῦ, ὁ Θεὸς ἐν αὐτῷ μένει καὶ αὐτὸς ἐν τῷ Θεῷ. καὶ ἡμεῖς ἐγνώκαμεν καὶ πεπιστεύκαμεν τὴν ἀγάπην ἣν ἔχει ὁ Θεὸς ἐν ἡμῖν. Ὁ Θεὸς ἀγάπη ἐστί, καὶ ὁ μένων ἐν τῇ ἀγάπῃ ἐν τῷ Θεῷ μένει καὶ ὁ Θεὸς ἐν αὐτῷ. Ἐν τούτῳ τετελείωται ἡ ἀγάπη μεθ᾿ ἡμῶν, ἵνα παρρησίαν ἔχωμεν ἐν τῇ ἡμέρᾳ τῆς κρίσεως, ὅτι καθὼς ἐκεῖνός ἐστι, καὶ ἡμεῖς ἐσμεν ἐν τῷ κόσμῳ τούτῳ. φόβος οὐκ ἔστιν ἐν τῇ ἀγάπῃ, ἀλλ᾿ ἡ τελεία ἀγάπη ἔξω βάλλει τὸν φόβον, ὅτι ὁ φόβος κόλασιν ἔχει, ὁ δὲ φοβούμενος οὐ τετελείωται ἐν τῇ ἀγάπῃ. Ἡμεῖς ἀγαπῶμεν αὐτόν, ὅτι αὐτὸς πρῶτος ἠγάπησεν ἡμᾶς.
ltx/gr_gr_cog/le.ep.me.m09.d26:lemeLI.Epistle.title	Τοῦ Εὐαγγελιστοῦ
ltx/gr_gr_cog/le.ep.me.m09.d26:lemeLI.Epistle.title_abbr	Τοῦ Εὐαγγελιστοῦ
ltx/gr_gr_cog/le.ep.me.m09.d26:lemeLI.Epistle.version	@ltx/gr_gr_cog/properties:version.designation
ltx/gr_gr_cog/le.ep.me.m09.d26:lemeVE.Reading1.book_string	@ltx/gr_gr_cog/le.ep.me.m05.d08:lemeVE.Reading1.book_string
ltx/gr_gr_cog/le.ep.me.m09.d26:lemeVE.Reading1.chapverse	@ltx/gr_gr_cog/le.ep.me.m05.d08:lemeVE.Reading1.chapverse
ltx/gr_gr_cog/le.ep.me.m09.d26:lemeVE.Reading1.incipit	@ltx/gr_gr_cog/le.ep.me.m05.d08:lemeVE.Reading1.incipit
ltx/gr_gr_cog/le.ep.me.m09.d26:lemeVE.Reading1.text	@ltx/gr_gr_cog/le.ep.me.m05.d08:lemeVE.Reading1.text
ltx/gr_gr_cog/le.ep.me.m09.d26:lemeVE.Reading1.title	@ltx/gr_gr_cog/le.ep.me.m05.d08:lemeVE.Reading1.title
ltx/gr_gr_cog/le.ep.me.m09.d26:lemeVE.Reading1.title_abbr	@ltx/gr_gr_cog/le.ep.me.m05.d08:lemeVE.Reading1.title
ltx/gr_gr_cog/le.ep.me.m09.d26:lemeVE.Reading1.version	@ltx/gr_gr_cog/le.ep.me.m05.d08:lemeVE.Reading1.version
ltx/gr_gr_cog/le.ep.me.m09.d26:lemeVE.Reading2.book_string	@ltx/gr_gr_cog/le.ep.me.m05.d08:lemeVE.Reading2.book_string
ltx/gr_gr_cog/le.ep.me.m09.d26:lemeVE.Reading2.chapverse	@ltx/gr_gr_cog/le.ep.me.m05.d08:lemeVE.Reading2.chapverse
ltx/gr_gr_cog/le.ep.me.m09.d26:lemeVE.Reading2.incipit	@ltx/gr_gr_cog/le.ep.me.m05.d08:lemeVE.Reading2.incipit
ltx/gr_gr_cog/le.ep.me.m09.d26:lemeVE.Reading2.text	@ltx/gr_gr_cog/le.ep.me.m05.d08:lemeVE.Reading2.text
ltx/gr_gr_cog/le.ep.me.m09.d26:lemeVE.Reading2.title	@ltx/gr_gr_cog/le.ep.me.m05.d08:lemeVE.Reading2.title
ltx/gr_gr_cog/le.ep.me.m09.d26:lemeVE.Reading2.title_abbr	@ltx/gr_gr_cog/le.ep.me.m05.d08:lemeVE.Reading2.title
ltx/gr_gr_cog/le.ep.me.m09.d26:lemeVE.Reading2.version	@ltx/gr_gr_cog/le.ep.me.m05.d08:lemeVE.Reading2.version
ltx/gr_gr_cog/le.ep.me.m09.d26:lemeVE.Reading3.book_string	@ltx/gr_gr_cog/le.ep.me.m05.d08:lemeVE.Reading3.book_string
ltx/gr_gr_cog/le.ep.me.m09.d26:lemeVE.Reading3.chapverse	@ltx/gr_gr_cog/le.ep.me.m05.d08:lemeVE.Reading3.chapverse
ltx/gr_gr_cog/le.ep.me.m09.d26:lemeVE.Reading3.incipit	@ltx/gr_gr_cog/le.ep.me.m05.d08:lemeVE.Reading3.incipit
ltx/gr_gr_cog/le.ep.me.m09.d26:lemeVE.Reading3.text	@ltx/gr_gr_cog/le.ep.me.m05.d08:lemeVE.Reading3.text
ltx/gr_gr_cog/le.ep.me.m09.d26:lemeVE.Reading3.title	@ltx/gr_gr_cog/le.ep.me.m05.d08:lemeVE.Reading3.title
ltx/gr_gr_cog/le.ep.me.m09.d26:lemeVE.Reading3.title_abbr	@ltx/gr_gr_cog/le.ep.me.m05.d08:lemeVE.Reading3.title
ltx/gr_gr_cog/le.ep.me.m09.d26:lemeVE.Reading3.version	@ltx/gr_gr_cog/le.ep.me.m05.d08:lemeVE.Reading3.version
