ltx/gr_gr_cog/pe.d118:peDA.commemoration.full	Παρασκευὴ τῆς Ζʹ Ἑβδομάδος - Ἀπόδοσις τῆς Ἀναλήψεως
ltx/gr_gr_cog/pe.d118:peDA.commemoration.short	Ἀπόδοσις τῆς Ἀναλήψεως
ltx/gr_gr_cog/pe.d118:peDA.dismissal	@ltx/gr_gr_cog/dismissals:dis00.ascension
ltx/gr_gr_cog/pe.d118:peDA.insert1	
ltx/gr_gr_cog/pe.d118:peDA.insert2	
ltx/gr_gr_cog/pe.d118:peDA.note	
ltx/gr_gr_cog/pe.d118:peHO.commemorations	
ltx/gr_gr_cog/pe.d118:peHO.daytitle	
ltx/gr_gr_cog/pe.d118:peHO.description1	
ltx/gr_gr_cog/pe.d118:peHO.description2	
ltx/gr_gr_cog/pe.d118:peHO.note1	
ltx/gr_gr_cog/pe.d118:peHO.note2	
