ltx/gr_gr_cog/le.go.mc.d128:lemcLI.Gospel.book_abbr	@ltx/gr_gr_cog/bible:Matthew.abbr
ltx/gr_gr_cog/le.go.mc.d128:lemcLI.Gospel.book_string	@ltx/gr_gr_cog/bible:Matthew.text
ltx/gr_gr_cog/le.go.mc.d128:lemcLI.Gospel.chapverse	6:31 – 34, 7:9 – 11
ltx/gr_gr_cog/le.go.mc.d128:lemcLI.Gospel.incipit	Μὴ μεριμνήσητε λέγοντες, τί φάγωμεν…
ltx/gr_gr_cog/le.go.mc.d128:lemcLI.Gospel.text	Εἶπεν ὁ Κύριος· μὴ μεριμνήσητε λέγοντες, τί φάγωμεν ἢ τί πίωμεν ἢ τί περιβαλώμεθα; πάντα γὰρ ταῦτα τὰ ἔθνη ἐπιζητεῖ· οἶδε γὰρ ὁ πατὴρ ὑμῶν ὁ οὐράνιος ὅτι χρῄζετε τούτων ἁπάντων. ζητεῖτε δὲ πρῶτον τὴν βασιλείαν τοῦ Θεοῦ καὶ τὴν δικαιοσύνην αὐτοῦ, καὶ ταῦτα πάντα προστεθήσεται ὑμῖν. Μὴ οὖν μεριμνήσητε εἰς τὴν αὔριον· ἡ γὰρ αὔριον μεριμνήσει τὰ ἑαυτῆς· ἀρκετὸν τῇ ἡμέρᾳ ἡ κακία αὐτῆς. ἢ τίς ἐστιν ἐξ ὑμῶν ἄνθρωπος, ὃν ἐὰν αἰτήσῃ ὁ υἱὸς αὐτοῦ ἄρτον, μὴ λίθον ἐπιδώσει αὐτῷ; καὶ ἐὰν ἰχθὺν αἰτήσῃ, μὴ ὄφιν ἐπιδώσει αὐτῷ; εἰ οὗν ὑμεῖς, πονηροὶ ὄντες, οἴδατε δόματα ἀγαθὰ διδόναι τοῖς τέκνοις ὑμῶν, πόσῳ μᾶλλον ὁ πατὴρ ὑμῶν ὁ ἐν τοῖς οὐρανοῖς δώσει ἀγαθὰ τοῖς αἰτοῦσιν αὐτόν;
ltx/gr_gr_cog/le.go.mc.d128:lemcLI.Gospel.title	Τῇ Δευτέρᾳ τῆς Βʹ Ἑβδομάδος τοῦ Ματθαίου
ltx/gr_gr_cog/le.go.mc.d128:lemcLI.Gospel.title_abbr	Δευτέρᾳ τῆς Βʹ Ἑβδομάδος
ltx/gr_gr_cog/le.go.mc.d128:lemcLI.Gospel.version	@ltx/gr_gr_cog/properties:version.designation
