ltx/gr_gr_cog/le.go.me.m11.d25:lemeLI.Gospel.book_abbr	@ltx/gr_gr_cog/le.go.mc.d219:lemcLI.Gospel.book_abbr
ltx/gr_gr_cog/le.go.me.m11.d25:lemeLI.Gospel.book_string	@ltx/gr_gr_cog/le.go.mc.d219:lemcLI.Gospel.book_string
ltx/gr_gr_cog/le.go.me.m11.d25:lemeLI.Gospel.chapverse	@ltx/gr_gr_cog/le.go.mc.d219:lemcLI.Gospel.chapverse
ltx/gr_gr_cog/le.go.me.m11.d25:lemeLI.Gospel.incipit	@ltx/gr_gr_cog/le.go.mc.d219:lemcLI.Gospel.incipit
ltx/gr_gr_cog/le.go.me.m11.d25:lemeLI.Gospel.text	@ltx/gr_gr_cog/le.go.mc.d219:lemcLI.Gospel.text
ltx/gr_gr_cog/le.go.me.m11.d25:lemeLI.Gospel.title	Τῆς Ἁγίας
ltx/gr_gr_cog/le.go.me.m11.d25:lemeLI.Gospel.title_abbr	Τῆς Ἁγίας
ltx/gr_gr_cog/le.go.me.m11.d25:lemeLI.Gospel.version	@ltx/gr_gr_cog/le.go.mc.d219:lemcLI.Gospel.version
ltx/gr_gr_cog/le.go.me.m11.d25:lemeMA.Gospel.book_abbr	@ltx/gr_gr_cog/le.go.mc.d238:lemcLI.Gospel.book_abbr
ltx/gr_gr_cog/le.go.me.m11.d25:lemeMA.Gospel.book_string	@ltx/gr_gr_cog/le.go.mc.d238:lemcLI.Gospel.book_string
ltx/gr_gr_cog/le.go.me.m11.d25:lemeMA.Gospel.chapverse	@ltx/gr_gr_cog/le.go.mc.d238:lemcLI.Gospel.chapverse
ltx/gr_gr_cog/le.go.me.m11.d25:lemeMA.Gospel.incipit	@ltx/gr_gr_cog/le.go.mc.d238:lemcLI.Gospel.incipit
ltx/gr_gr_cog/le.go.me.m11.d25:lemeMA.Gospel.text	@ltx/gr_gr_cog/le.go.mc.d238:lemcLI.Gospel.text
ltx/gr_gr_cog/le.go.me.m11.d25:lemeMA.Gospel.title	Τῆς Ἁγίας
ltx/gr_gr_cog/le.go.me.m11.d25:lemeMA.Gospel.title_abbr	Τῆς Ἁγίας
ltx/gr_gr_cog/le.go.me.m11.d25:lemeMA.Gospel.version	@ltx/gr_gr_cog/le.go.mc.d238:lemcLI.Gospel.version
