ltx/gr_gr_cog/ho.ho04:hoH1.LentSungVerses.text	@ltx/gr_gr_cog/properties:media.key
ltx/gr_gr_cog/ho.ho04:hoH1.LentTroparion.incipit	Τὸ πρωῒ εἰσάκουσον τῆς φωνῆς…
ltx/gr_gr_cog/ho.ho04:hoH1.LentTroparion.mode	@ltx/gr_gr_cog/miscellanea:misc.Mode6
ltx/gr_gr_cog/ho.ho04:hoH1.LentTroparion.text	Τὸ πρωῒ εἰσάκουσον τῆς φωνῆς μου, ὁ Βασιλεύς μου καὶ ὁ Θεός μου.
ltx/gr_gr_cog/ho.ho04:hoH1.Prayer.incipit	Χριστέ, τὸ φῶς τὸ ἀληθινόν…
ltx/gr_gr_cog/ho.ho04:hoH1.Prayer.text	Χριστέ, τὸ φῶς τὸ ἀληθινόν, τὸ φωτίζον καὶ ἁγιάζον πάντα ἄνθρωπον ἐρχόμενον εἰς τὸν κόσμον, σημειωθήτω ἐφʼ ἡμᾶς τὸ φῶς τοῦ προσώπου σου, ἵνα ἐν αὐτῷ ὀψώμεθα φῶς τὸ ἀπρόσιτον, καὶ κατεύθυνον τὰ διαβήματα ἡμῶν πρὸς ἐργασίαν τῶν ἐντολῶν σου, πρεσβείαις τῆς παναχράντου σου Μητρός, καὶ πάντων σου τῶν Ἁγίων.
ltx/gr_gr_cog/ho.ho04:hoH1.Theotokion.incipit	Τί σε καλέσωμεν…
ltx/gr_gr_cog/ho.ho04:hoH1.Theotokion.text	Τί σε καλέσωμεν, ὧ Κεχαριτωμένη; Οὐρανόν, ὅτι ἀνέτειλας τὸν Ἥλιον τῆς δικαιοσύνης. Παράδεισον, ὅτι ἐβλάστησας τὸ ἄνθος τῆς ἀφθαρσίας. Παρθένον, ὅτι ἔμεινας ἄφθορος· ἁγνὴν Μητέρα, ὅτι ἔσχες σαῖς ἁγίαις ἀγκάλαις υἱόν, τὸν πάντων Θεόν. Αὐτὸν ἱκέτευε, σωθῆναι τὰς ψυχὰς ἡμῶν.
ltx/gr_gr_cog/ho.ho04:hoH1.title	ΩΡΑ Αʹ.
