ltx/gr_gr_cog/le.ep.me.m06.d08:lemeLI.Epistle.book_abbr	@ltx/gr_gr_cog/le.ep.mc.d281:lemcLI.Epistle.book_abbr
ltx/gr_gr_cog/le.ep.me.m06.d08:lemeLI.Epistle.book_string	@ltx/gr_gr_cog/le.ep.mc.d281:lemcLI.Epistle.book_string
ltx/gr_gr_cog/le.ep.me.m06.d08:lemeLI.Epistle.chapverse	@ltx/gr_gr_cog/le.ep.mc.d281:lemcLI.Epistle.chapverse
ltx/gr_gr_cog/le.ep.me.m06.d08:lemeLI.Epistle.incipit	@ltx/gr_gr_cog/le.ep.mc.d281:lemcLI.Epistle.incipit
ltx/gr_gr_cog/le.ep.me.m06.d08:lemeLI.Epistle.text	@ltx/gr_gr_cog/le.ep.mc.d281:lemcLI.Epistle.text
ltx/gr_gr_cog/le.ep.me.m06.d08:lemeLI.Epistle.title	Τοῦ Ἱεράρχου
ltx/gr_gr_cog/le.ep.me.m06.d08:lemeLI.Epistle.title_abbr	Τοῦ Ἱεράρχου
ltx/gr_gr_cog/le.ep.me.m06.d08:lemeLI.Epistle.version	@ltx/gr_gr_cog/le.ep.mc.d281:lemcLI.Epistle.version
