ltx/gr_gr_cog/theotokarion.m1.d1:thCA.Kathisma11.incipit	Παράδεισον ἐν γῇ…
ltx/gr_gr_cog/theotokarion.m1.d1:thCA.Kathisma11.melody	@ltx/gr_gr_cog/he.a.m1:heAU.TonTafonSouSotir.name
ltx/gr_gr_cog/theotokarion.m1.d1:thCA.Kathisma11.mode	@ltx/gr_gr_cog/miscellanea:misc.Mode1
ltx/gr_gr_cog/theotokarion.m1.d1:thCA.Kathisma11.text	Παράδεισον ἐν γῇ λογικόν σε φυτεύσας Χριστὸς ὁ φυτουργὸς Παραδείσου τοῦ πρώτου ἐν μέσῳ σου, Δέσποινα, ὡς ζωῆς ξύλον ἔφυσεν· ὃν ἱκέτευε τοῦ τῆς τρυφῆς Παραδείσου ἀξιῶσαί με, καὶ ἐφ᾽ ὑδάτων ἐκθρέψαι τερπνῆς ἀναπαύσεως.
ltx/gr_gr_cog/theotokarion.m1.d1:thCA.Ode11.incipit	Δοχεῖον τῆς φύσεως…
ltx/gr_gr_cog/theotokarion.m1.d1:thCA.Ode11.melody	@ltx/gr_gr_cog/he.h.m1:heHE.OdinEpinikion.name
ltx/gr_gr_cog/theotokarion.m1.d1:thCA.Ode11.mode	@ltx/gr_gr_cog/miscellanea:misc.Mode1
ltx/gr_gr_cog/theotokarion.m1.d1:thCA.Ode11.ode	@ltx/gr_gr_cog/miscellanea:misc.Ode1
ltx/gr_gr_cog/theotokarion.m1.d1:thCA.Ode11.text	Δοχεῖον τῆς φύσεως τῆς ἀχωρήτου, Χριστὸν ἐκδυσώπησον, ἵνα πυρὸς ῥύσηται τοῦ ἀφεγγοῦς με, Ἁγνή, καὶ ἀναδείξῃ κοινωνὸν τῆς Βασιλείας αὐτοῦ.
ltx/gr_gr_cog/theotokarion.m1.d1:thCA.Ode12.incipit	…
ltx/gr_gr_cog/theotokarion.m1.d1:thCA.Ode12.melody	@ltx/gr_gr_cog/he.h.m1:heHE.OdinEpinikion.name
ltx/gr_gr_cog/theotokarion.m1.d1:thCA.Ode12.mode	@ltx/gr_gr_cog/miscellanea:misc.Mode1
ltx/gr_gr_cog/theotokarion.m1.d1:thCA.Ode12.ode	@ltx/gr_gr_cog/miscellanea:misc.Ode1
ltx/gr_gr_cog/theotokarion.m1.d1:thCA.Ode12.text	Ἐμὴν δέξαι δέησιν, Υἱὲ καὶ Λόγε, καὶ ῥῦσαι κολάσεως τὸν βοῶντα δοῦλόν σου πρός με ἐκ βάθους ψυχῆς, καὶ καταξίωσον αὐτὸν τῆς βασιλείας σου.
ltx/gr_gr_cog/theotokarion.m1.d1:thCA.Ode13.incipit	…
ltx/gr_gr_cog/theotokarion.m1.d1:thCA.Ode13.melody	@ltx/gr_gr_cog/he.h.m1:heHE.OdinEpinikion.name
ltx/gr_gr_cog/theotokarion.m1.d1:thCA.Ode13.mode	@ltx/gr_gr_cog/miscellanea:misc.Mode1
ltx/gr_gr_cog/theotokarion.m1.d1:thCA.Ode13.ode	@ltx/gr_gr_cog/miscellanea:misc.Ode1
ltx/gr_gr_cog/theotokarion.m1.d1:thCA.Ode13.text	Σὺ, Μῆτερ, ἐλέους με πηγὴν γινώσκεις· καὶ γὰρ τοὺς καθ᾽ ὥραν μοι τῷ Δεσπότῃ πταίοντας ἁμαρτωλοὺς ἐλεῶ· ἀλλ᾽ οὗτος λίαν με αἰσχροῖς παραπικραίνει κακοῖς.
ltx/gr_gr_cog/theotokarion.m1.d1:thCA.Ode14.incipit	…
ltx/gr_gr_cog/theotokarion.m1.d1:thCA.Ode14.melody	@ltx/gr_gr_cog/he.h.m1:heHE.OdinEpinikion.name
ltx/gr_gr_cog/theotokarion.m1.d1:thCA.Ode14.mode	@ltx/gr_gr_cog/miscellanea:misc.Mode1
ltx/gr_gr_cog/theotokarion.m1.d1:thCA.Ode14.ode	@ltx/gr_gr_cog/miscellanea:misc.Ode1
ltx/gr_gr_cog/theotokarion.m1.d1:thCA.Ode14.text	Πολλοῖς παραπτώμασι καὶ ἀτοπίαις αἰσχραῖς, παρεπίκρανας τὸν Υἱόν μου· ὅθεν σοι εἰς ἀγανάκτησιν νῦν κεκίνηται καὶ εἰς ὀργὴν ἡ εὐσπλαγχνία αὐτοῦ.
ltx/gr_gr_cog/theotokarion.m1.d1:thCA.Ode31.incipit	Ὅλον μου τὸν βίον…
ltx/gr_gr_cog/theotokarion.m1.d1:thCA.Ode31.melody	@ltx/gr_gr_cog/he.h.m1:heHE.ToProTonAionon.name
ltx/gr_gr_cog/theotokarion.m1.d1:thCA.Ode31.mode	@ltx/gr_gr_cog/miscellanea:misc.Mode1
ltx/gr_gr_cog/theotokarion.m1.d1:thCA.Ode31.ode	@ltx/gr_gr_cog/miscellanea:misc.Ode3
ltx/gr_gr_cog/theotokarion.m1.d1:thCA.Ode31.text	Ὅλον μου τὸν βίον ἀληθῶς ἐν κακοῖς ἐδαπάνησα· καὶ διὰ τοῦτό σοι κραυγάζω, τὸν Υἱόν σου δυσώπει, Ἁγνή, ἵνα ὡς τὸν ἄσωτον ἀνακαλέσῃ καὶ σώσῃ με νῦν, κείμενον τοῖς πταίσμασι. 
ltx/gr_gr_cog/theotokarion.m1.d1:thCA.Ode32.incipit	…
ltx/gr_gr_cog/theotokarion.m1.d1:thCA.Ode32.melody	@ltx/gr_gr_cog/he.h.m1:heHE.ToProTonAionon.name
ltx/gr_gr_cog/theotokarion.m1.d1:thCA.Ode32.mode	@ltx/gr_gr_cog/miscellanea:misc.Mode1
ltx/gr_gr_cog/theotokarion.m1.d1:thCA.Ode32.ode	@ltx/gr_gr_cog/miscellanea:misc.Ode3
ltx/gr_gr_cog/theotokarion.m1.d1:thCA.Ode32.text	Ἵλαθι, Παντάναξ ὁ τεχθεὶς ἀποῤῥήτως ἐκ μήτρας μου, καὶ κατοικτείρησον σὸν δοῦλον ὡς τὸν ἄσωτον πάλαι υἱόν, καὶ δεῖξον Πανάγαθε τῆς δεξιᾶς παραστάτης τῆς σῆς ἐν ἡμέρᾳ κρίσεως.
ltx/gr_gr_cog/theotokarion.m1.d1:thCA.Ode33.incipit	…
ltx/gr_gr_cog/theotokarion.m1.d1:thCA.Ode33.melody	@ltx/gr_gr_cog/he.h.m1:heHE.ToProTonAionon.name
ltx/gr_gr_cog/theotokarion.m1.d1:thCA.Ode33.mode	@ltx/gr_gr_cog/miscellanea:misc.Mode1
ltx/gr_gr_cog/theotokarion.m1.d1:thCA.Ode33.ode	@ltx/gr_gr_cog/miscellanea:misc.Ode3
ltx/gr_gr_cog/theotokarion.m1.d1:thCA.Ode33.text	Νουνεχῶς, ὦ Μῆτερ, ἐκβοῶ σοι κἀγὼ ἐπακοῦσαί μου· ὁ ἀσωτίαις ἐμβιώσας ἐν θερμῇ μετανοίᾳ ἐλθὼν ἔκραζε τὸ ἥμαρτον· ἀλλ᾽ οὗτος κἄν σοι βοᾷ μεταγνούς, ἐν ὑστέροις ψεύδεται.
ltx/gr_gr_cog/theotokarion.m1.d1:thCA.Ode34.incipit	…
ltx/gr_gr_cog/theotokarion.m1.d1:thCA.Ode34.melody	@ltx/gr_gr_cog/he.h.m1:heHE.ToProTonAionon.name
ltx/gr_gr_cog/theotokarion.m1.d1:thCA.Ode34.mode	@ltx/gr_gr_cog/miscellanea:misc.Mode1
ltx/gr_gr_cog/theotokarion.m1.d1:thCA.Ode34.ode	@ltx/gr_gr_cog/miscellanea:misc.Ode3
ltx/gr_gr_cog/theotokarion.m1.d1:thCA.Ode34.text	Ἅ μοι ἔφης εἶπον τῷ Υἱῷ μου, κραυγάζουσα ἵνα σε καταξιώσῃ Βασιλείας· ἀλλ᾽ αὐτός μοι ἀντέφη· θερμῇ πίστει οὐ προσῆλθέ μοι, καὶ διὰ τοῦτο ἐκπέμπω αὐτὸν ἀπὸ τοῦ προσώπου μου.
ltx/gr_gr_cog/theotokarion.m1.d1:thCA.Ode41.incipit	Νοήσας ὦ Παρθένε…
ltx/gr_gr_cog/theotokarion.m1.d1:thCA.Ode41.melody	@ltx/gr_gr_cog/he.h.m1:heHE.EnPnevmatiProvlepon.name
ltx/gr_gr_cog/theotokarion.m1.d1:thCA.Ode41.mode	@ltx/gr_gr_cog/miscellanea:misc.Mode1
ltx/gr_gr_cog/theotokarion.m1.d1:thCA.Ode41.ode	@ltx/gr_gr_cog/miscellanea:misc.Ode4
ltx/gr_gr_cog/theotokarion.m1.d1:thCA.Ode41.text	Νοήσας ὦ Παρθένε τὴν δύναμιν τὴν σήν, μετὰ δέους κράζω σοι τῇ μόνῃ ἀγαθῇ· εἰ καὶ μετάνοιαν ὅλως θερμὴν οὐκ ἔχω, ἀλλὰ ταῖς σαῖς πρὸς τὸν Δεσπότην ἱκεσίαις, δίδου μοι τελείαν διόρθωσιν.
ltx/gr_gr_cog/theotokarion.m1.d1:thCA.Ode42.incipit	…
ltx/gr_gr_cog/theotokarion.m1.d1:thCA.Ode42.melody	@ltx/gr_gr_cog/he.h.m1:heHE.EnPnevmatiProvlepon.name
ltx/gr_gr_cog/theotokarion.m1.d1:thCA.Ode42.mode	@ltx/gr_gr_cog/miscellanea:misc.Mode1
ltx/gr_gr_cog/theotokarion.m1.d1:thCA.Ode42.ode	@ltx/gr_gr_cog/miscellanea:misc.Ode4
ltx/gr_gr_cog/theotokarion.m1.d1:thCA.Ode42.text	Ἐπάκουσον ὁ φύσει φιλάνθρωπος Θεὸς τῆς μητρός σου Δέσποτα βοώσης ἐκτενῶς, καὶ τὸν σὸν δοῦλον ἐκλύτρωσαι καταδίκης· εἰ δὲ καὶ πίστιν οὐ κέκτηται τὴν τελείαν, ταύτην ὡς Θεὸς αὐτῷ δώρησαι.
ltx/gr_gr_cog/theotokarion.m1.d1:thCA.Ode43.incipit	…
ltx/gr_gr_cog/theotokarion.m1.d1:thCA.Ode43.melody	@ltx/gr_gr_cog/he.h.m1:heHE.EnPnevmatiProvlepon.name
ltx/gr_gr_cog/theotokarion.m1.d1:thCA.Ode43.mode	@ltx/gr_gr_cog/miscellanea:misc.Mode1
ltx/gr_gr_cog/theotokarion.m1.d1:thCA.Ode43.ode	@ltx/gr_gr_cog/miscellanea:misc.Ode4
ltx/gr_gr_cog/theotokarion.m1.d1:thCA.Ode43.text	Ὑπόθεσιν ὦ Μῆτερ αὐτῷ παντοδαπὴν τοῦ σωθῆναι δέδωκα· ἀλλ᾽ οὗτος οὐκ ἐᾷ τὰς ἁμαρτίας, εἰσῆλθε καὶ ἐν θανάτῳ, καὶ διὰ τοῦτο οὐδὲ δύναται σωθῆναι, ἕως οὗ εἰς πῦρ ἀπελεύσεται.
ltx/gr_gr_cog/theotokarion.m1.d1:thCA.Ode44.incipit	…
ltx/gr_gr_cog/theotokarion.m1.d1:thCA.Ode44.melody	@ltx/gr_gr_cog/he.h.m1:heHE.EnPnevmatiProvlepon.name
ltx/gr_gr_cog/theotokarion.m1.d1:thCA.Ode44.mode	@ltx/gr_gr_cog/miscellanea:misc.Mode1
ltx/gr_gr_cog/theotokarion.m1.d1:thCA.Ode44.ode	@ltx/gr_gr_cog/miscellanea:misc.Ode4
ltx/gr_gr_cog/theotokarion.m1.d1:thCA.Ode44.text	Σὲ νῦν ἐπιγινώσκω αἰτίαν τῆς σαυτοῦ ἀπωλείας ὥς φησιν ὁ θεῖός μου Υἱός· σὺ γὰρ κατάκεισαι ὅλως τῇ ἁμαρτίᾳ καὶ παρεδόθης τελείως τῇ ῥαθυμίᾳ· τίς ἐξαναστήσει σε κείμενον;
ltx/gr_gr_cog/theotokarion.m1.d1:thCA.Ode51.incipit	Ὁδοὺς μετανοίας…
ltx/gr_gr_cog/theotokarion.m1.d1:thCA.Ode51.melody	@ltx/gr_gr_cog/he.h.m1:heHE.TheosOnEirinis.name
ltx/gr_gr_cog/theotokarion.m1.d1:thCA.Ode51.mode	@ltx/gr_gr_cog/miscellanea:misc.Mode1
ltx/gr_gr_cog/theotokarion.m1.d1:thCA.Ode51.ode	@ltx/gr_gr_cog/miscellanea:misc.Ode5
ltx/gr_gr_cog/theotokarion.m1.d1:thCA.Ode51.text	Ὁδοὺς μετανοίας, Παρθένε, ποθῶ διατρίβειν ἀεὶ τὰς φερούσας με ζωὴν πρὸς ἀτελεύτητον, ἀλλ᾽ αὖθις τὰ δεινὰ συστήματα δαιμόνων καθέλκουσι κρημνίσαι εἰς βυθὸν ἁμαρτίας καὶ ἀπωλείας δεινὸν βόρβορον.
ltx/gr_gr_cog/theotokarion.m1.d1:thCA.Ode52.incipit	…
ltx/gr_gr_cog/theotokarion.m1.d1:thCA.Ode52.melody	@ltx/gr_gr_cog/he.h.m1:heHE.TheosOnEirinis.name
ltx/gr_gr_cog/theotokarion.m1.d1:thCA.Ode52.mode	@ltx/gr_gr_cog/miscellanea:misc.Mode1
ltx/gr_gr_cog/theotokarion.m1.d1:thCA.Ode52.ode	@ltx/gr_gr_cog/miscellanea:misc.Ode5
ltx/gr_gr_cog/theotokarion.m1.d1:thCA.Ode52.text	Νεκρώσας τὸν θάνατον Σῶτερ τὸ πρὶν τὸν Ἀδὰμ τῶν δεσμῶν ἠλευθέρωσας· διὸ καὶ νῦν τὸν δοῦλόν σου, Υἱέ μου, δυσωπῶ, ἐξάρπασον δαιμόνων τῶν ἐπηρεαζόντων· αὐτοὶ γὰρ οὐκ ἐῶσι μετανοῆσαί τινα πώποτε.
ltx/gr_gr_cog/theotokarion.m1.d1:thCA.Ode53.incipit	…
ltx/gr_gr_cog/theotokarion.m1.d1:thCA.Ode53.melody	@ltx/gr_gr_cog/he.h.m1:heHE.TheosOnEirinis.name
ltx/gr_gr_cog/theotokarion.m1.d1:thCA.Ode53.mode	@ltx/gr_gr_cog/miscellanea:misc.Mode1
ltx/gr_gr_cog/theotokarion.m1.d1:thCA.Ode53.ode	@ltx/gr_gr_cog/miscellanea:misc.Ode5
ltx/gr_gr_cog/theotokarion.m1.d1:thCA.Ode53.text	Πανύμνητε Μῆτερ, βοῶ σοι κἀγώ· προσευχῇ καὶ νηστείᾳ ἐξέρχονται τὰ πλήθη τὰ παμπόνηρα δαιμόνων ἐξ αὐτοῦ· ἀλλ᾽ οὗτος ἐγκρατείᾳ, δεήσει καὶ ἁγνείᾳ μὴ καθάρας τὸ σῶμα, δαιμόνων φεῦ γέγονε σπήλαιον.
ltx/gr_gr_cog/theotokarion.m1.d1:thCA.Ode54.incipit	…
ltx/gr_gr_cog/theotokarion.m1.d1:thCA.Ode54.melody	@ltx/gr_gr_cog/he.h.m1:heHE.TheosOnEirinis.name
ltx/gr_gr_cog/theotokarion.m1.d1:thCA.Ode54.mode	@ltx/gr_gr_cog/miscellanea:misc.Mode1
ltx/gr_gr_cog/theotokarion.m1.d1:thCA.Ode54.ode	@ltx/gr_gr_cog/miscellanea:misc.Ode5
ltx/gr_gr_cog/theotokarion.m1.d1:thCA.Ode54.text	Ῥημάτων τῶν πρὶν τοῦ Υἱοῦ μου καλῶς ἐνωτίζου καὶ γνῶθι τὰ δέοντα· ἡνίκα γὰρ οὐκ ἴσχυσαν οἱ τούτου μαθηταὶ τὸ πνεῦμα ἐκδιῶξαι, ἐβόᾳ τούτοις λέγων· προσευχῇ καὶ νηστείᾳ δαιμόνων γένος ἐκδιώκεται.
ltx/gr_gr_cog/theotokarion.m1.d1:thCA.Ode61.incipit	Οὐ ῥημάτων εὐπορῶ…
ltx/gr_gr_cog/theotokarion.m1.d1:thCA.Ode61.melody	@ltx/gr_gr_cog/he.h.m1:heHE.TonProfitinIonan.name
ltx/gr_gr_cog/theotokarion.m1.d1:thCA.Ode61.mode	@ltx/gr_gr_cog/miscellanea:misc.Mode1
ltx/gr_gr_cog/theotokarion.m1.d1:thCA.Ode61.ode	@ltx/gr_gr_cog/miscellanea:misc.Ode6
ltx/gr_gr_cog/theotokarion.m1.d1:thCA.Ode61.text	Οὐ ῥημάτων εὐπορῶ, ἀρετῶν τε ἀπορῶ· οὐ γὰρ στέργω προσευχὴν καὶ νηστείαν ἐκτελεῖν, Θεόνυμφε· καὶ διὰ τοῦτο πρὸς σὲ κατέφυγον.
ltx/gr_gr_cog/theotokarion.m1.d1:thCA.Ode62.incipit	…
ltx/gr_gr_cog/theotokarion.m1.d1:thCA.Ode62.melody	@ltx/gr_gr_cog/he.h.m1:heHE.TonProfitinIonan.name
ltx/gr_gr_cog/theotokarion.m1.d1:thCA.Ode62.mode	@ltx/gr_gr_cog/miscellanea:misc.Mode1
ltx/gr_gr_cog/theotokarion.m1.d1:thCA.Ode62.ode	@ltx/gr_gr_cog/miscellanea:misc.Ode6
ltx/gr_gr_cog/theotokarion.m1.d1:thCA.Ode62.text	Σύνες εὔσπλαγχνε Υἱὲ σῆς μητρός, ἐκδυσωπῶ, ὁ προστρέχων εἰς ἐμὲ χρηστῶν ἔργων ἀπορεῖ καὶ κράζει μοι· οὐκ ἔχω πλήν σου ἐλπίδα, Δέσποινα.
ltx/gr_gr_cog/theotokarion.m1.d1:thCA.Ode63.incipit	…
ltx/gr_gr_cog/theotokarion.m1.d1:thCA.Ode63.melody	@ltx/gr_gr_cog/he.h.m1:heHE.TonProfitinIonan.name
ltx/gr_gr_cog/theotokarion.m1.d1:thCA.Ode63.mode	@ltx/gr_gr_cog/miscellanea:misc.Mode1
ltx/gr_gr_cog/theotokarion.m1.d1:thCA.Ode63.ode	@ltx/gr_gr_cog/miscellanea:misc.Ode6
ltx/gr_gr_cog/theotokarion.m1.d1:thCA.Ode63.text	Λιτανεύουσα θερμῶς, παῦσαι Μῆτερ τοῦ λαλεῖν· καὶ γὰρ οὗτος ἀφορῶν ὅτι εὔσπλαγχνός εἰμι μολύνεται, μὴ ἐπιβλέπων εἰς τὴν ὀργὴν τὴν ἐμήν.
ltx/gr_gr_cog/theotokarion.m1.d1:thCA.Ode64.incipit	…
ltx/gr_gr_cog/theotokarion.m1.d1:thCA.Ode64.melody	@ltx/gr_gr_cog/he.h.m1:heHE.TonProfitinIonan.name
ltx/gr_gr_cog/theotokarion.m1.d1:thCA.Ode64.mode	@ltx/gr_gr_cog/miscellanea:misc.Mode1
ltx/gr_gr_cog/theotokarion.m1.d1:thCA.Ode64.ode	@ltx/gr_gr_cog/miscellanea:misc.Ode6
ltx/gr_gr_cog/theotokarion.m1.d1:thCA.Ode64.text	Ἱκετεύω ὑπὲρ σοῦ τὸν Υἱόν μου καὶ Θεὸν ἵνα τύχῃς ἱλασμοῦ· ἀλλ᾽ αὐτός μοι ἐκβοᾷ τοῦ παύσασθαι καὶ μὴ πρεσβεύειν εἰς τὸ σωθῆναί σε.
ltx/gr_gr_cog/theotokarion.m1.d1:thCA.Ode71.incipit	Τὴν πᾶσάν μου ἐλπίδα…
ltx/gr_gr_cog/theotokarion.m1.d1:thCA.Ode71.melody	@ltx/gr_gr_cog/he.h.m1:heHE.OiPaidesEfseveia.name
ltx/gr_gr_cog/theotokarion.m1.d1:thCA.Ode71.mode	@ltx/gr_gr_cog/miscellanea:misc.Mode1
ltx/gr_gr_cog/theotokarion.m1.d1:thCA.Ode71.ode	@ltx/gr_gr_cog/miscellanea:misc.Ode7
ltx/gr_gr_cog/theotokarion.m1.d1:thCA.Ode71.text	Τὴν πᾶσάν μου ἐλπίδα ἐπὶ σὲ ἀνατίθημι Δέσποινα, καὶ μὴ ἀπώσῃ εἰς βυθὸν ἀπωλείας με τὸν δείλαιον· ἀλλ᾽ ἀνάστρεψον τῷ σῷ βοῶσα πάλιν Υἱῷ· μὴ ὑπερίδῃς τὸ πλάσμα τῶν χειρῶν σου. 
ltx/gr_gr_cog/theotokarion.m1.d1:thCA.Ode72.incipit	…
ltx/gr_gr_cog/theotokarion.m1.d1:thCA.Ode72.melody	@ltx/gr_gr_cog/he.h.m1:heHE.OiPaidesEfseveia.name
ltx/gr_gr_cog/theotokarion.m1.d1:thCA.Ode72.mode	@ltx/gr_gr_cog/miscellanea:misc.Mode1
ltx/gr_gr_cog/theotokarion.m1.d1:thCA.Ode72.ode	@ltx/gr_gr_cog/miscellanea:misc.Ode7
ltx/gr_gr_cog/theotokarion.m1.d1:thCA.Ode72.text	Ἀμέτρητον ὡς ἔχων εὐσπλαγχνίας τὸ πέλαγος Δέσποτα, δέξαι με πάλιν δυσωπῶ σὲ τὸν μόνον εὐδιάλλακτον καὶ οἰκτείρησον τῶν σῶν χειρῶν τὸ ποίημα ὁ οἰκτειρήσας ποτὲ τὴν Χαναναίαν. 
ltx/gr_gr_cog/theotokarion.m1.d1:thCA.Ode73.incipit	…
ltx/gr_gr_cog/theotokarion.m1.d1:thCA.Ode73.melody	@ltx/gr_gr_cog/he.h.m1:heHE.OiPaidesEfseveia.name
ltx/gr_gr_cog/theotokarion.m1.d1:thCA.Ode73.mode	@ltx/gr_gr_cog/miscellanea:misc.Mode1
ltx/gr_gr_cog/theotokarion.m1.d1:thCA.Ode73.ode	@ltx/gr_gr_cog/miscellanea:misc.Ode7
ltx/gr_gr_cog/theotokarion.m1.d1:thCA.Ode73.text	Ἱλάσκομαι καὶ σώζω τὸν ἐν πόθῳ πολλῷ προσερχόμενον, καὶ γὰρ οὐ θέλω τὸ ἐμὸν ἀπωλέσθαι πλάσμα πώποτε, εἰς τὸ σῶσαι γὰρ αὐτὸ ὅλως ἐτέχθην ἐκ σοῦ· ἀλλ᾽ οὗτος πόῤῥω τῶν ἔργων μου ὑπάρχει. 
ltx/gr_gr_cog/theotokarion.m1.d1:thCA.Ode74.incipit	…
ltx/gr_gr_cog/theotokarion.m1.d1:thCA.Ode74.melody	@ltx/gr_gr_cog/he.h.m1:heHE.OiPaidesEfseveia.name
ltx/gr_gr_cog/theotokarion.m1.d1:thCA.Ode74.mode	@ltx/gr_gr_cog/miscellanea:misc.Mode1
ltx/gr_gr_cog/theotokarion.m1.d1:thCA.Ode74.ode	@ltx/gr_gr_cog/miscellanea:misc.Ode7
ltx/gr_gr_cog/theotokarion.m1.d1:thCA.Ode74.text	Σοφία τοῦ Ὑψίστου προϋπάρχων ὁ Υἱός μου γέγονεν ἄνθρωπος ὅλως ἐξ ἐμοῦ ἵνα σώσῃ τοὺς φυλάσσοντας μετὰ πίστεως θερμῆς τὸ θεῖον βάπτισμα· ἀλλὰ σὺ τούτων ἀμέτοχος ἐδείχθης.
ltx/gr_gr_cog/theotokarion.m1.d1:thCA.Ode81.incipit	Θαῤῥήσας προσῆλθόν…
ltx/gr_gr_cog/theotokarion.m1.d1:thCA.Ode81.melody	@ltx/gr_gr_cog/he.h.m1:heHE.OnFrittousinAngeloi.name
ltx/gr_gr_cog/theotokarion.m1.d1:thCA.Ode81.mode	@ltx/gr_gr_cog/miscellanea:misc.Mode1
ltx/gr_gr_cog/theotokarion.m1.d1:thCA.Ode81.ode	@ltx/gr_gr_cog/miscellanea:misc.Ode8
ltx/gr_gr_cog/theotokarion.m1.d1:thCA.Ode81.text	Θαῤῥήσας προσῆλθόν σοι Παρθένε θεωρῶν τὸν σὸν Υἱὸν σώσαντα τὴν πόρνην καὶ λῃστήν, αὐτοὶ γὰρ νομίμως οὐδὲν ἔργον χρηστὸν ἔπραξαν ἐν βίῳ, ἀλλ᾽ ἔτυχον συγγνώμης.
ltx/gr_gr_cog/theotokarion.m1.d1:thCA.Ode82.incipit	…
ltx/gr_gr_cog/theotokarion.m1.d1:thCA.Ode82.melody	@ltx/gr_gr_cog/he.h.m1:heHE.OnFrittousinAngeloi.name
ltx/gr_gr_cog/theotokarion.m1.d1:thCA.Ode82.mode	@ltx/gr_gr_cog/miscellanea:misc.Mode1
ltx/gr_gr_cog/theotokarion.m1.d1:thCA.Ode82.ode	@ltx/gr_gr_cog/miscellanea:misc.Ode8
ltx/gr_gr_cog/theotokarion.m1.d1:thCA.Ode82.text	Ἐξ ὕψους ἐπίβλεψον, εἰσάκουσον τῆς σῆς μητρὸς δεομένης σου καὶ ῥῦσαι τοῦ πυρὸς τὸν δοῦλόν σου τοῦτον, ὡς τὴν πόρνην τὸ πρὶν καὶ ὡς ἐλυτρώσω λῃστὴν ἐν τῷ Σταυρῷ σου.
ltx/gr_gr_cog/theotokarion.m1.d1:thCA.Ode83.incipit	…
ltx/gr_gr_cog/theotokarion.m1.d1:thCA.Ode83.melody	@ltx/gr_gr_cog/he.h.m1:heHE.OnFrittousinAngeloi.name
ltx/gr_gr_cog/theotokarion.m1.d1:thCA.Ode83.mode	@ltx/gr_gr_cog/miscellanea:misc.Mode1
ltx/gr_gr_cog/theotokarion.m1.d1:thCA.Ode83.ode	@ltx/gr_gr_cog/miscellanea:misc.Ode8
ltx/gr_gr_cog/theotokarion.m1.d1:thCA.Ode83.text	Ὁ πάλαι κρεμάμενος λῃστὴς ἐν τῷ Σταυρῷ ἐν πίστει ἐκραύγαζε το μνήσηθτι κἀμοῦ· ἡ πόρνη δὲ πάλιν τῶν δακρύων πηγὰς ἔβλυζεν, ἀλλ᾽ οὗτος αὐτοῖς οὐχ ὡμοιώθη.
ltx/gr_gr_cog/theotokarion.m1.d1:thCA.Ode84.incipit	…
ltx/gr_gr_cog/theotokarion.m1.d1:thCA.Ode84.melody	@ltx/gr_gr_cog/he.h.m1:heHE.OnFrittousinAngeloi.name
ltx/gr_gr_cog/theotokarion.m1.d1:thCA.Ode84.mode	@ltx/gr_gr_cog/miscellanea:misc.Mode1
ltx/gr_gr_cog/theotokarion.m1.d1:thCA.Ode84.ode	@ltx/gr_gr_cog/miscellanea:misc.Ode8
ltx/gr_gr_cog/theotokarion.m1.d1:thCA.Ode84.text	Δακρύουσαν σέσωκε τὴν πόρνην ὁ Χριστός, ὡσαύτως πιστεύσαντα λῃστὴν ἐν τῷ σταυρῷ· εἰ οὖν θέλεις ἄρτι σωτηρίας τυχεῖν, πρόσδραμε Κυρίῳ σὺν δάκρυσι καὶ πίστει.
ltx/gr_gr_cog/theotokarion.m1.d1:thCA.Ode8H.incipit	@ltx/gr_gr_cog/he.h.m1:heHE.OnFrittousinAngeloi.incipit
ltx/gr_gr_cog/theotokarion.m1.d1:thCA.Ode8H.melody	@ltx/gr_gr_cog/he.h.m1:heHE.OnFrittousinAngeloi.melody
ltx/gr_gr_cog/theotokarion.m1.d1:thCA.Ode8H.mode	@ltx/gr_gr_cog/miscellanea:misc.Mode1
ltx/gr_gr_cog/theotokarion.m1.d1:thCA.Ode8H.ode	@ltx/gr_gr_cog/miscellanea:misc.Ode8
ltx/gr_gr_cog/theotokarion.m1.d1:thCA.Ode8H.text	@ltx/gr_gr_cog/he.h.m1:heHE.OnFrittousinAngeloi.text
ltx/gr_gr_cog/theotokarion.m1.d1:thCA.Ode91.incipit	Ὤφθην ἁπάντων ἀνθρώπων…
ltx/gr_gr_cog/theotokarion.m1.d1:thCA.Ode91.melody	@ltx/gr_gr_cog/he.h.m1:heHE.TinFotoforonNefelin.name
ltx/gr_gr_cog/theotokarion.m1.d1:thCA.Ode91.mode	@ltx/gr_gr_cog/miscellanea:misc.Mode1
ltx/gr_gr_cog/theotokarion.m1.d1:thCA.Ode91.ode	@ltx/gr_gr_cog/miscellanea:misc.Ode9
ltx/gr_gr_cog/theotokarion.m1.d1:thCA.Ode91.text	Ὤφθην ἁπάντων ἀνθρώπων ἁμαρτωλότερος, Κόρη, καὶ διὰ τοῦτο προσελθεῖν τῷ Υἱῷ σου αἰδοῦμαι, ἀλλὰ δυσώπησον αὐτὸν καὶ ἵλεων ποίησον τοῦ δέξασθαι ἐν θερμῇ με τῇ πίστει καὶ ἐν πόθῳ προσερχόμενον αὐτῷ. 
ltx/gr_gr_cog/theotokarion.m1.d1:thCA.Ode92.incipit	…
ltx/gr_gr_cog/theotokarion.m1.d1:thCA.Ode92.melody	@ltx/gr_gr_cog/he.h.m1:heHE.TinFotoforonNefelin.name
ltx/gr_gr_cog/theotokarion.m1.d1:thCA.Ode92.mode	@ltx/gr_gr_cog/miscellanea:misc.Mode1
ltx/gr_gr_cog/theotokarion.m1.d1:thCA.Ode92.ode	@ltx/gr_gr_cog/miscellanea:misc.Ode9
ltx/gr_gr_cog/theotokarion.m1.d1:thCA.Ode92.text	Ῥῦσαι κολάσεως, Λόγε, τὸν προσελθόντα σοι δοῦλον καὶ μὴ μνησθῇς ἀνομιῶν τῶν αὐτοῦ, δυσωπῶ σε· εἰ γὰρ καὶ ἥμαρτε Σωτήρ, ἀλλά μοι προσπέφευγε, καὶ δέομαι· δι᾽ ἐμὲ τοῦτον δέξαι, ὁ τοῖς πᾶσι τὰ αἰτήματα πληρῶν.
ltx/gr_gr_cog/theotokarion.m1.d1:thCA.Ode93.incipit	…
ltx/gr_gr_cog/theotokarion.m1.d1:thCA.Ode93.melody	@ltx/gr_gr_cog/he.h.m1:heHE.TinFotoforonNefelin.name
ltx/gr_gr_cog/theotokarion.m1.d1:thCA.Ode93.mode	@ltx/gr_gr_cog/miscellanea:misc.Mode1
ltx/gr_gr_cog/theotokarion.m1.d1:thCA.Ode93.ode	@ltx/gr_gr_cog/miscellanea:misc.Ode9
ltx/gr_gr_cog/theotokarion.m1.d1:thCA.Ode93.text	Οὐκ ἔστιν ἄξιος, Μῆτερ, ὁ προσφυγών σοι ἐλέους, καὶ γὰρ ἀνθρώπων με οὐδεὶς ὡς αὐτὸς παροργίζει, ἀλλὰ πρεσβείαις σου σεπταῖς αὐτὸν τῆς κολάσεως ἀμέτοχον ἐν τῇ κρίσει ποιήσω εἰ προσάξει μετανοίας μοι καρπούς.
ltx/gr_gr_cog/theotokarion.m1.d1:thCA.Ode94.incipit	…
ltx/gr_gr_cog/theotokarion.m1.d1:thCA.Ode94.melody	@ltx/gr_gr_cog/he.h.m1:heHE.TinFotoforonNefelin.name
ltx/gr_gr_cog/theotokarion.m1.d1:thCA.Ode94.mode	@ltx/gr_gr_cog/miscellanea:misc.Mode1
ltx/gr_gr_cog/theotokarion.m1.d1:thCA.Ode94.ode	@ltx/gr_gr_cog/miscellanea:misc.Ode9
ltx/gr_gr_cog/theotokarion.m1.d1:thCA.Ode94.text	Ὑπὸ τὸν ᾍδην ὑπάρχων ἀνεβιβάσθης πρὸς ὕψος ταῖς πρὸς τὸν θεῖόν μου Υἱὸν ἱκεσίαις, καὶ πρόσχες μὴ τοῖς προτέροις σου δεινοῖς ἐμπέσῃς ἐγκλήμασιν, ἀλλ᾽ ἄπελθε εἰς ὀδοὺς μετανοίας, μήπως πάλιν τῇ γεέννῃ ἐμβληθῇς.
ltx/gr_gr_cog/theotokarion.m1.d1:thCA.Stichera01.incipit	Χαρὰ τοῦ κόσμου…
ltx/gr_gr_cog/theotokarion.m1.d1:thCA.Stichera01.melody	@ltx/gr_gr_cog/he.a.m1:heAU.TonOuranionTagmaton.name
ltx/gr_gr_cog/theotokarion.m1.d1:thCA.Stichera01.mode	@ltx/gr_gr_cog/miscellanea:misc.Mode1
ltx/gr_gr_cog/theotokarion.m1.d1:thCA.Stichera01.text	Χαρὰ τοῦ κόσμου ὑπάρχεις, ἁμαρτωλῶν ὁ λιμήν, χειμαζομένων ῥύστις, Θεοτόκε Παρθένε· δέξαι οὖν βοῶ σοι κἀμοῦ τὴν εὐχὴν καὶ τὴν δέησιν, Ἄχραντε, ἣν καὶ προσάγαγε τάχει τῷ σῷ Υἱῷ ἵνα σώσῃ με τὸν ἄσωτον.
ltx/gr_gr_cog/theotokarion.m1.d1:thCA.Stichera02.incipit	Χαρᾶς αἰτία…
ltx/gr_gr_cog/theotokarion.m1.d1:thCA.Stichera02.melody	@ltx/gr_gr_cog/he.a.m1:heAU.TonOuranionTagmaton.name
ltx/gr_gr_cog/theotokarion.m1.d1:thCA.Stichera02.mode	@ltx/gr_gr_cog/miscellanea:misc.Mode1
ltx/gr_gr_cog/theotokarion.m1.d1:thCA.Stichera02.text	Χαρᾶς αἰτία μοι πάσης, Υἱέ μου φίλτατε, συγχώρησιν πταισμάτων δώρησαι τῷ σῷ δούλῳ, ἵνα γνῶσι πάντες ὅτι πρὸς σὲ παῤῥησίαν ὡς Μήτηρ σου μεγίστην ἔχω, Χριστέ μου, τοῦ δυσωπεῖν, ὑπὲρ πάντας τοὺς ἁγίους σου.
ltx/gr_gr_cog/theotokarion.m1.d1:thCA.Stichera03.incipit	Χαρᾶς δοχεῖον…
ltx/gr_gr_cog/theotokarion.m1.d1:thCA.Stichera03.melody	@ltx/gr_gr_cog/he.a.m1:heAU.TonOuranionTagmaton.name
ltx/gr_gr_cog/theotokarion.m1.d1:thCA.Stichera03.mode	@ltx/gr_gr_cog/miscellanea:misc.Mode1
ltx/gr_gr_cog/theotokarion.m1.d1:thCA.Stichera03.text	Χαρᾶς δοχεῖον, ὦ Μῆτερ, τῇ σῇ δεήσει καμφθείς, τὴν ἄφεσιν πταισμάτων τῷ ἀγνώμονι τούτῳ δίδωμι, καὶ ἄφες τοῦ ἐκβοᾶν· ἀλλ᾽ εἰπὲ τούτῳ παύσασθαι τοῦ ἁμαρτάνειν καὶ ἕλκειν με εἰς ὀργήν, φύσει γὰρ εὔσπλαγχνος πέφυκα.
ltx/gr_gr_cog/theotokarion.m1.d1:thCA.Stichera04.incipit	Ἰδοὺ τὴν ἄφεσιν…
ltx/gr_gr_cog/theotokarion.m1.d1:thCA.Stichera04.melody	@ltx/gr_gr_cog/he.a.m1:heAU.TonOuranionTagmaton.name
ltx/gr_gr_cog/theotokarion.m1.d1:thCA.Stichera04.mode	@ltx/gr_gr_cog/miscellanea:misc.Mode1
ltx/gr_gr_cog/theotokarion.m1.d1:thCA.Stichera04.text	Ἰδοὺ τὴν ἄφεσιν ἔσχες τῶν ἐγκλημάτων σου ἐμοῦ λιταῖς, καὶ πρόσχες τὸν ὑπόλοιπον βίον θεάρεστον τελέσαι, ὅπως τρυφῆς ἀπολάυσῃς τὴν εὔκλειαν ἐν Παραδείσῳ, σὺν πᾶσι τοῖς ἐκλεκτοῖς τὴν οὐδόλως λῆξιν ἔχουσαν.
ltx/gr_gr_cog/theotokarion.m1.d1:thCA.acrostic.notice1	οὗ ἡ ἀκορστιχίς·
ltx/gr_gr_cog/theotokarion.m1.d1:thCA.acrostic.text	Δέσποινα, νεῦσον πρὸς λιταῖς Θεοδώρου.
ltx/gr_gr_cog/theotokarion.m1.d1:thCA.acrostic.title	Ὁ Κανὼν τῆς Θεοτόκου,
ltx/gr_gr_cog/theotokarion.m1.d1:thCA.media.text	@ltx/gr_gr_cog/properties:media.key
ltx/gr_gr_cog/theotokarion.m1.d1:thCA.note1	Οὗ ἡ μὲν μέθοδος τοιαύτη·
ltx/gr_gr_cog/theotokarion.m1.d1:thCA.note2	Ἐν τῷ α´ τροπαρίῳ ἑκάστης ᾠδῆς, δέεται ὁ ἁμαρτωλὸς πρὸς τὴν Θεοτόκον.
ltx/gr_gr_cog/theotokarion.m1.d1:thCA.note3	Ἐν τῷ β´ δέεται ἡ Θεοτόκος πρὸς τὸν Χριστόν.
ltx/gr_gr_cog/theotokarion.m1.d1:thCA.note4	Ἐν τῷ γ´ ἀποκρίνεται ὁ Χριστὸς πρὸς τὴν Θεοτόκον.
ltx/gr_gr_cog/theotokarion.m1.d1:thCA.note5	Καὶ ἐν τῷ δ´ ἀποκρίνεται ἡ Θεοτόκος πρὸς τὸν ἁμαρτωλόν.
ltx/gr_gr_cog/theotokarion.m1.d1:thCA.note6	(Ὁ ἁμαρτωλὸς πρὸς τὴν Θεοτόκον)
ltx/gr_gr_cog/theotokarion.m1.d1:thCA.note7	(Ἡ Θεοτόκος πρὸς τὸν Χριστόν)
ltx/gr_gr_cog/theotokarion.m1.d1:thCA.note8	(Ὁ Χριστὸς πρὸς τὴν Θεοτόκον)
ltx/gr_gr_cog/theotokarion.m1.d1:thCA.note9	(Ἡ Θεοτόκος πρὸς τὸν ἁμαρτωλόν)
ltx/gr_gr_cog/theotokarion.m1.d1:thCA.poet	Ποίημα τοῦ Ἁγίου Θεοδώρου τοῦ Στουδίτου
ltx/gr_gr_cog/theotokarion.m1.d1:thCA.title1	Τῷ Σαββάτῳ Ἑσπέρας
ltx/gr_gr_cog/theotokarion.m1.d1:thCA.title2	Κανὼν εἰς τὴν Ὑπεραγίαν Θεοτόκον
ltx/gr_gr_cog/theotokarion.m1.d1:thCA.translator1	
ltx/gr_gr_cog/theotokarion.m1.d1:thCA.translator2	
ltx/gr_gr_cog/theotokarion.m1.d1:thCA.verse	@ltx/gr_gr_cog/prayers:pr.verse_Theotokos.text
