ltx/gr_gr_cog/me.m01.d28:meDA.commemoration.first	Μνήμη τοῦ Ὁσίου Ἐφραὶμ τοῦ Σύρου
ltx/gr_gr_cog/me.m01.d28:meDA.commemoration.first_name	
ltx/gr_gr_cog/me.m01.d28:meDA.commemoration.first_short	Μνήμη τοῦ Ὁσίου Ἐφραὶμ τοῦ Σύρου
ltx/gr_gr_cog/me.m01.d28:meDA.commemoration.first_title	@ltx/gr_gr_cog/titles:ti.SaintM
ltx/gr_gr_cog/me.m01.d28:meDA.commemoration.full	Μνήμη τοῦ Ὁσίου Πατρὸς ἡμῶν Ἐφραὶμ τοῦ Σύρου
ltx/gr_gr_cog/me.m01.d28:meDA.commemoration.second_name	
ltx/gr_gr_cog/me.m01.d28:meDA.commemoration.second_title	
ltx/gr_gr_cog/me.m01.d28:meDA.date	Τῌ ΚΗʹ ΙΑΝΟΥΑΡΙΟΥ
ltx/gr_gr_cog/me.m01.d28:meDA.fordate	διὰ τὴν 28ην Ἰανουαρίου
ltx/gr_gr_cog/me.m01.d28:meDA.insert1	καὶ τοῦ Ὁσίου Πατρὸς ἡμῶν Ἐφραὶμ τοῦ Σύρου,
ltx/gr_gr_cog/me.m01.d28:meDA.insert2	οὗ καὶ τὴν μνήμην ἐπιτελοῦμεν·
ltx/gr_gr_cog/me.m01.d28:meDA.note	
ltx/gr_gr_cog/me.m01.d28:meDA.pdfcoverdate	τῆς 28ης Ἰανουαρίου,
ltx/gr_gr_cog/me.m01.d28:meDA.pdfheaderdate	τῆς 28ης Ἰανουαρίου
ltx/gr_gr_cog/me.m01.d28:meHO.commemorations	
ltx/gr_gr_cog/me.m01.d28:meHO.note1	
ltx/gr_gr_cog/me.m01.d28:meHO.note2	
ltx/gr_gr_cog/me.m01.d28:meHO.number	28.
ltx/gr_gr_cog/me.m01.d28:meHO.rank	
ltx/gr_gr_cog/me.m01.d28:meLE.commemoration1	Μνήμη τοῦ Ὁσίου Πατρὸς ἡμῶν Ἐφραὶμ τοῦ Σύρου.
ltx/gr_gr_cog/me.m01.d28:meLE.commemoration2	
ltx/gr_gr_cog/me.m01.d28:meLI.Kontakion1.greekmelody	@ltx/gr_gr_cog/me.m01.d28:meMA.Kontakion1.greekmelody
ltx/gr_gr_cog/me.m01.d28:meLI.Kontakion1.incipit	@ltx/gr_gr_cog/me.m01.d28:meMA.Kontakion1.incipit
ltx/gr_gr_cog/me.m01.d28:meLI.Kontakion1.melody	@ltx/gr_gr_cog/me.m01.d28:meMA.Kontakion1.melody
ltx/gr_gr_cog/me.m01.d28:meLI.Kontakion1.mode	@ltx/gr_gr_cog/me.m01.d28:meMA.Kontakion1.mode
ltx/gr_gr_cog/me.m01.d28:meLI.Kontakion1.text	@ltx/gr_gr_cog/me.m01.d28:meMA.Kontakion1.text
ltx/gr_gr_cog/me.m01.d28:meLI.Megalynarion.text	
ltx/gr_gr_cog/me.m01.d28:meMA.AposGlory.incipit	Ὥσπερ φοίνιξ δαυϊτικῶς…
ltx/gr_gr_cog/me.m01.d28:meMA.AposGlory.melody	
ltx/gr_gr_cog/me.m01.d28:meMA.AposGlory.mode	@ltx/gr_gr_cog/miscellanea:misc.Mode2
ltx/gr_gr_cog/me.m01.d28:meMA.AposGlory.poet	@ltx/gr_gr_cog/poets:po.Kyprianou
ltx/gr_gr_cog/me.m01.d28:meMA.AposGlory.text	Ὥσπερ φοίνιξ δαυϊτικῶς ἐξανθήσας Ὅσιε Πάτερ, τὰς γλώσσας τῶν βλασφήμων ἐξέκοψας, ἐν τῇ μαχαίρᾳ τῶν λόγων σου Ἐφραίμ· τὰς ἀβύσσους τῶν παθῶν ἐξήρανας διʼ ἐγκρατείας· ὄργανον ἀνεδείχθης τοῦ Ἁγίου Πνεύματος, τοῦ Σταυροῦ τὸ ὅπλον ἀναλαβών, Χριστὸν ἀπαύστως δυσώπει ὑπὲρ ἡμῶν, τῶν ἐπιτελούντων τὴν πανέορτον μνήμην σου.
ltx/gr_gr_cog/me.m01.d28:meMA.AposStavrotheotokion.greekmelody	@ltx/gr_gr_cog/he.a.m2:heAU.OteEkTouXylou.greekname
ltx/gr_gr_cog/me.m01.d28:meMA.AposStavrotheotokion.incipit	@ltx/gr_gr_cog/me.m01.d22:meVE.AposStavrotheotokion.incipit
ltx/gr_gr_cog/me.m01.d28:meMA.AposStavrotheotokion.melody	@ltx/gr_gr_cog/he.a.m2:heAU.OteEkTouXylou.name
ltx/gr_gr_cog/me.m01.d28:meMA.AposStavrotheotokion.mode	@ltx/gr_gr_cog/miscellanea:misc.Mode2
ltx/gr_gr_cog/me.m01.d28:meMA.AposStavrotheotokion.text	@ltx/gr_gr_cog/me.m01.d22:meVE.AposStavrotheotokion.text
ltx/gr_gr_cog/me.m01.d28:meMA.AposTheotokion.greekmelody	@ltx/gr_gr_cog/he.a.m2:heAU.OteEkTouXylou.greekname
ltx/gr_gr_cog/me.m01.d28:meMA.AposTheotokion.incipit	@ltx/gr_gr_cog/oc.m2.d1:ocSV.Aposticha1.incipit
ltx/gr_gr_cog/me.m01.d28:meMA.AposTheotokion.melody	@ltx/gr_gr_cog/he.a.m2:heAU.OteEkTouXylou.name
ltx/gr_gr_cog/me.m01.d28:meMA.AposTheotokion.mode	@ltx/gr_gr_cog/miscellanea:misc.Mode2
ltx/gr_gr_cog/me.m01.d28:meMA.AposTheotokion.text	@ltx/gr_gr_cog/oc.m2.d1:ocSV.Aposticha1.text
ltx/gr_gr_cog/me.m01.d28:meMA.C1.acrostic.notice1	οὗ ἡ Ἀκροστιχίς·
ltx/gr_gr_cog/me.m01.d28:meMA.C1.acrostic.text	Ἐφραὶμ γεραίρω τὸν νοητὸν Εὐφράτην.
ltx/gr_gr_cog/me.m01.d28:meMA.C1.acrostic.title	Κανὼν τοῦ Ἁγίου,
ltx/gr_gr_cog/me.m01.d28:meMA.C1.poet	@ltx/gr_gr_cog/poets:po.Theofanous
ltx/gr_gr_cog/me.m01.d28:meMA.C1.title	@ltx/gr_gr_cog/titles:ti.CanonDevoutM
ltx/gr_gr_cog/me.m01.d28:meMA.C1.verse	@ltx/gr_gr_cog/prayers:pr.verse_DevoutMan.text
ltx/gr_gr_cog/me.m01.d28:meMA.ExapTheotokion.incipit	Ἐλπὶς τῶν ἀπηλπισμένων, καταφυγὴ Χριστιανῶν…
ltx/gr_gr_cog/me.m01.d28:meMA.ExapTheotokion.melody	@ltx/gr_gr_cog/he.a.m3:heAU.OOuranonToisAstrois.name
ltx/gr_gr_cog/me.m01.d28:meMA.ExapTheotokion.mode	@ltx/gr_gr_cog/miscellanea:misc.Mode3
ltx/gr_gr_cog/me.m01.d28:meMA.ExapTheotokion.text	Ἐλπὶς τῶν ἀπηλπισμένων, καταφυγὴ Χριστιανῶν, πανύμνητε Θεοτόκε, τῶν θλιβομένων ἡ χαρά, ἐκ πάσης θλίψεως ῥῦσαι, τοὺς ἀναξίους σου δούλους.
ltx/gr_gr_cog/me.m01.d28:meMA.Exaposteilarion1.greekmelody	@ltx/gr_gr_cog/he.a.m3:heAU.OOuranonToisAstrois.greekname
ltx/gr_gr_cog/me.m01.d28:meMA.Exaposteilarion1.incipit	Ὡς ποταμὸς ὑπάρχεις…
ltx/gr_gr_cog/me.m01.d28:meMA.Exaposteilarion1.melody	@ltx/gr_gr_cog/he.a.m3:heAU.OOuranonToisAstrois.name
ltx/gr_gr_cog/me.m01.d28:meMA.Exaposteilarion1.mode	@ltx/gr_gr_cog/miscellanea:misc.Mode3
ltx/gr_gr_cog/me.m01.d28:meMA.Exaposteilarion1.text	Ὡς ποταμὸς ὑπάρχεις, ῥεῖθρα χρυσόῤῥυτα βρύων, καὶ τοὺς λαοὺς διεγείρων, τῆς μετανοίας πρὸς τρίβον, Χριστὸν ἱκέτευε Πάτερ, Ἐφραὶμ σωθῆναι τὸν κόσμον.
ltx/gr_gr_cog/me.m01.d28:meMA.Kontakion1.greekmelody	@ltx/gr_gr_cog/he.a.m2:heAU.TaAnoZiton.greekname
ltx/gr_gr_cog/me.m01.d28:meMA.Kontakion1.incipit	Τὴν ὥραν ἀεί…
ltx/gr_gr_cog/me.m01.d28:meMA.Kontakion1.melody	@ltx/gr_gr_cog/he.a.m2:heAU.TaAnoZiton.name
ltx/gr_gr_cog/me.m01.d28:meMA.Kontakion1.mode	@ltx/gr_gr_cog/miscellanea:misc.Mode2
ltx/gr_gr_cog/me.m01.d28:meMA.Kontakion1.text	Τὴν ὥραν ἀεί, προβλέπων τῆς ἐτάσεως, ἐθρήνεις πικρῶς, Ἐφραὶμ ὡς φιλήσυχος· πρακτικὸς δὲ γέγονας, ἐν τοῖς ἔργοις διδάσκαλος Ὅσιε. Ὅθεν Πάτερ παγκόσμιε, ῥαθύμους ἐγείρεις πρὸς μετάνοιαν.
ltx/gr_gr_cog/me.m01.d28:meMA.Ode1C11.greekmelody	@ltx/gr_gr_cog/he.h.m6:heHE.OsEnIpeiroPezefsas.greekname
ltx/gr_gr_cog/me.m01.d28:meMA.Ode1C11.incipit	Εὐφραντικῇ ἐπομβρίᾳ σῶν προσευχῶν, τὴν…
ltx/gr_gr_cog/me.m01.d28:meMA.Ode1C11.melody	@ltx/gr_gr_cog/he.h.m6:heHE.OsEnIpeiroPezefsas.name
ltx/gr_gr_cog/me.m01.d28:meMA.Ode1C11.mode	@ltx/gr_gr_cog/miscellanea:misc.Mode6
ltx/gr_gr_cog/me.m01.d28:meMA.Ode1C11.ode	@ltx/gr_gr_cog/miscellanea:misc.Ode1
ltx/gr_gr_cog/me.m01.d28:meMA.Ode1C11.text	Εὐφραντικῇ ἐπομβρίᾳ σῶν προσευχῶν, τὴν ψυχήν μου ἄρδευσον ξηρανθεῖσαν τῷ αὐχμῷ, τῶν παθῶν, καὶ λόγον μοι τὴν σήν, εὐφημοῦντι ἑορτήν, Παμμάκαρ ἔμπνευσον.
ltx/gr_gr_cog/me.m01.d28:meMA.Ode1C12.incipit	Φῶς νοητὸν ἀπαστράψας φωτιστικός, ἀνεδείχθης…
ltx/gr_gr_cog/me.m01.d28:meMA.Ode1C12.melody	@ltx/gr_gr_cog/he.h.m6:heHE.OsEnIpeiroPezefsas.name
ltx/gr_gr_cog/me.m01.d28:meMA.Ode1C12.mode	@ltx/gr_gr_cog/miscellanea:misc.Mode6
ltx/gr_gr_cog/me.m01.d28:meMA.Ode1C12.ode	@ltx/gr_gr_cog/miscellanea:misc.Ode1
ltx/gr_gr_cog/me.m01.d28:meMA.Ode1C12.text	Φῶς νοητὸν ἀπαστράψας φωτιστικός, ἀνεδείχθης ἥλιος, φεγγοβόλοις ἀρεταῖς, καὶ δογμάτων κάλλεσιν Ἐφραίμ, καταυγάζων τῶν Πιστῶν, ἄπαν τὸ πλήρωμα.
ltx/gr_gr_cog/me.m01.d28:meMA.Ode1C13.incipit	Ῥείθροις δακρύων τὴν φλόγα τὴν…
ltx/gr_gr_cog/me.m01.d28:meMA.Ode1C13.melody	@ltx/gr_gr_cog/he.h.m6:heHE.OsEnIpeiroPezefsas.name
ltx/gr_gr_cog/me.m01.d28:meMA.Ode1C13.mode	@ltx/gr_gr_cog/miscellanea:misc.Mode6
ltx/gr_gr_cog/me.m01.d28:meMA.Ode1C13.ode	@ltx/gr_gr_cog/miscellanea:misc.Ode1
ltx/gr_gr_cog/me.m01.d28:meMA.Ode1C13.text	Ῥείθροις δακρύων τὴν φλόγα τὴν τῶν παθῶν, κατασβέσας γέγονας, σκεῦος τίμιον Ἐφραίμ, τοῦ Ἁγίου Πνεύματος πηγάς, ἀναβλύζων διδαχῶν, θεομακάριστε.
ltx/gr_gr_cog/me.m01.d28:meMA.Ode1C1T.incipit	Ἀδιαφθόρως τὸν Λόγον ἐν σῇ…
ltx/gr_gr_cog/me.m01.d28:meMA.Ode1C1T.melody	@ltx/gr_gr_cog/he.h.m6:heHE.OsEnIpeiroPezefsas.name
ltx/gr_gr_cog/me.m01.d28:meMA.Ode1C1T.mode	@ltx/gr_gr_cog/miscellanea:misc.Mode6
ltx/gr_gr_cog/me.m01.d28:meMA.Ode1C1T.ode	@ltx/gr_gr_cog/miscellanea:misc.Ode1
ltx/gr_gr_cog/me.m01.d28:meMA.Ode1C1T.text	Ἀδιαφθόρως τὸν Λόγον ἐν σῇ γαστρί, δεξαμένη τέτοκας, τὸν λυτρούμενον φθορᾶς, τοὺς αὐτὸν λατρεύοντας ἀεί, Μητροπάρθενε σεμνή, πύλη τῆς ὄντως ζωῆς.
ltx/gr_gr_cog/me.m01.d28:meMA.Ode3C11.greekmelody	@ltx/gr_gr_cog/he.h.m6:heHE.OukEstinAgios.greekname
ltx/gr_gr_cog/me.m01.d28:meMA.Ode3C11.incipit	Ἰλύος πάσης ἐμπαθοῦς, σεαυτὸν ἐκκαθάρας…
ltx/gr_gr_cog/me.m01.d28:meMA.Ode3C11.melody	@ltx/gr_gr_cog/he.h.m6:heHE.OukEstinAgios.name
ltx/gr_gr_cog/me.m01.d28:meMA.Ode3C11.mode	@ltx/gr_gr_cog/miscellanea:misc.Mode6
ltx/gr_gr_cog/me.m01.d28:meMA.Ode3C11.ode	@ltx/gr_gr_cog/miscellanea:misc.Ode3
ltx/gr_gr_cog/me.m01.d28:meMA.Ode3C11.text	Ἰλύος πάσης ἐμπαθοῦς, σεαυτὸν ἐκκαθάρας, ἀνεδείχθης δοχεῖον ἀρετῶν ὡς ἀληθῶς, καὶ σκεῦος χωρητικόν, χαρισμάτων, τοῦ Ἁγίου Πνεύματος.
ltx/gr_gr_cog/me.m01.d28:meMA.Ode3C12.incipit	Μηδόλως ὕπνον ὀφθαλμοῖς, δεδωκὼς οἶκος…
ltx/gr_gr_cog/me.m01.d28:meMA.Ode3C12.melody	@ltx/gr_gr_cog/he.h.m6:heHE.OukEstinAgios.name
ltx/gr_gr_cog/me.m01.d28:meMA.Ode3C12.mode	@ltx/gr_gr_cog/miscellanea:misc.Mode6
ltx/gr_gr_cog/me.m01.d28:meMA.Ode3C12.ode	@ltx/gr_gr_cog/miscellanea:misc.Ode3
ltx/gr_gr_cog/me.m01.d28:meMA.Ode3C12.text	Μηδόλως ὕπνον ὀφθαλμοῖς, δεδωκὼς οἶκος ὤφθης, τῆς Ἁγίας Τριάδος, καὶ σοφίας θησαυρός, τὸν κόσμον καταπλουτῶν, χρυσαυγέσι, δόγμασι Μακάριε.
ltx/gr_gr_cog/me.m01.d28:meMA.Ode3C13.incipit	Γνωρίζει ἄλλον σε Χριστοῦ, ἡ…
ltx/gr_gr_cog/me.m01.d28:meMA.Ode3C13.melody	@ltx/gr_gr_cog/he.h.m6:heHE.OukEstinAgios.name
ltx/gr_gr_cog/me.m01.d28:meMA.Ode3C13.mode	@ltx/gr_gr_cog/miscellanea:misc.Mode6
ltx/gr_gr_cog/me.m01.d28:meMA.Ode3C13.ode	@ltx/gr_gr_cog/miscellanea:misc.Ode3
ltx/gr_gr_cog/me.m01.d28:meMA.Ode3C13.text	Γνωρίζει ἄλλον σε Χριστοῦ, ἡ σεπτὴ Ἐκκλησία, χρυσοῤῥόαν Εὐφράτην, πελαγίζοντα σοφῶν, δογμάτων ἐπιροαῖς, καὶ τὴν κτίσιν, πᾶσαν καταρδεύοντα.
ltx/gr_gr_cog/me.m01.d28:meMA.Ode3C1T.incipit	Ἐν δύω φύσεσιν ὁ εἷς…
ltx/gr_gr_cog/me.m01.d28:meMA.Ode3C1T.melody	@ltx/gr_gr_cog/he.h.m6:heHE.OukEstinAgios.name
ltx/gr_gr_cog/me.m01.d28:meMA.Ode3C1T.mode	@ltx/gr_gr_cog/miscellanea:misc.Mode6
ltx/gr_gr_cog/me.m01.d28:meMA.Ode3C1T.ode	@ltx/gr_gr_cog/miscellanea:misc.Ode3
ltx/gr_gr_cog/me.m01.d28:meMA.Ode3C1T.text	Ἐν δύω φύσεσιν ὁ εἷς, τῆς Ἁγίας Τριάδος, ἐξ ἀγνῶν σου αἱμάτων, σαρκωθεὶς θεοπρεπῶς, προῆλθε τοὺς ἐξ Ἀδάμ, διασῴζων, Πάναγνε χρηστότητι.
ltx/gr_gr_cog/me.m01.d28:meMA.Ode3H.greekmelody	@ltx/gr_gr_cog/he.h.m6:heHE.OukEstinAgios.greekname
ltx/gr_gr_cog/me.m01.d28:meMA.Ode3H.incipit	@ltx/gr_gr_cog/he.h.m6:heHE.OukEstinAgios.incipit
ltx/gr_gr_cog/me.m01.d28:meMA.Ode3H.melody	@ltx/gr_gr_cog/he.h.m6:heHE.OukEstinAgios.melody
ltx/gr_gr_cog/me.m01.d28:meMA.Ode3H.mode	@ltx/gr_gr_cog/miscellanea:misc.Mode6
ltx/gr_gr_cog/me.m01.d28:meMA.Ode3H.ode	@ltx/gr_gr_cog/miscellanea:misc.Ode3
ltx/gr_gr_cog/me.m01.d28:meMA.Ode3H.text	@ltx/gr_gr_cog/he.h.m6:heHE.OukEstinAgios.text
ltx/gr_gr_cog/me.m01.d28:meMA.Ode3Kathisma1.greekmelody	@ltx/gr_gr_cog/he.a.m5:heAU.TonSynanarchonLogon.greekname
ltx/gr_gr_cog/me.m01.d28:meMA.Ode3Kathisma1.incipit	Τὸν θησαυρὸν τῆς σοφίας…
ltx/gr_gr_cog/me.m01.d28:meMA.Ode3Kathisma1.melody	@ltx/gr_gr_cog/he.a.m5:heAU.TonSynanarchonLogon.name
ltx/gr_gr_cog/me.m01.d28:meMA.Ode3Kathisma1.mode	@ltx/gr_gr_cog/miscellanea:misc.Mode5
ltx/gr_gr_cog/me.m01.d28:meMA.Ode3Kathisma1.text	Τὸν θησαυρὸν τῆς σοφίας τῶν μυστηρίων Χριστοῦ, τὸν κρατῆρα τὸν θεῖον τῆς κατανύξεως, ἀνυμνήσωμεν πιστοί, ἐν τῇ μνήμῃ αὐτοῦ· φερωνύμως γὰρ ἀεί, τὰς καρδίας τῶν πιστῶν, εὐφραίνει ἔπεσι θείοις, Ἐφραίμ, ὡς πράκτωρ καὶ μύστης, τῶν τοῦ Κυρίου ἀποκαλύψεων.
ltx/gr_gr_cog/me.m01.d28:meMA.Ode3KathismaSt.incipit	@ltx/gr_gr_cog/oc.m5.d4:ocMA.Kathisma23.incipit
ltx/gr_gr_cog/me.m01.d28:meMA.Ode3KathismaSt.melody	@ltx/gr_gr_cog/he.a.m5:heAU.TonSynanarchonLogon.name
ltx/gr_gr_cog/me.m01.d28:meMA.Ode3KathismaSt.mode	@ltx/gr_gr_cog/miscellanea:misc.Mode5
ltx/gr_gr_cog/me.m01.d28:meMA.Ode3KathismaSt.text	@ltx/gr_gr_cog/oc.m5.d4:ocMA.Kathisma23.text
ltx/gr_gr_cog/me.m01.d28:meMA.Ode3KathismaT.incipit	@ltx/gr_gr_cog/oc.m5.d2:ocMA.Kathisma13.incipit
ltx/gr_gr_cog/me.m01.d28:meMA.Ode3KathismaT.melody	@ltx/gr_gr_cog/he.a.m5:heAU.TonSynanarchonLogon.name
ltx/gr_gr_cog/me.m01.d28:meMA.Ode3KathismaT.mode	@ltx/gr_gr_cog/miscellanea:misc.Mode5
ltx/gr_gr_cog/me.m01.d28:meMA.Ode3KathismaT.text	@ltx/gr_gr_cog/oc.m5.d2:ocMA.Kathisma13.text
ltx/gr_gr_cog/me.m01.d28:meMA.Ode4C11.greekmelody	@ltx/gr_gr_cog/he.h.m6:heHE.ChristosMouDynamis.greekname
ltx/gr_gr_cog/me.m01.d28:meMA.Ode4C11.incipit	Ῥημάτων δύναμις, τῶν σῶν διέδραμεν…
ltx/gr_gr_cog/me.m01.d28:meMA.Ode4C11.melody	@ltx/gr_gr_cog/he.h.m6:heHE.ChristosMouDynamis.name
ltx/gr_gr_cog/me.m01.d28:meMA.Ode4C11.mode	@ltx/gr_gr_cog/miscellanea:misc.Mode6
ltx/gr_gr_cog/me.m01.d28:meMA.Ode4C11.ode	@ltx/gr_gr_cog/miscellanea:misc.Ode4
ltx/gr_gr_cog/me.m01.d28:meMA.Ode4C11.text	Ῥημάτων δύναμις, τῶν σῶν διέδραμεν, ἐπὶ πάντα τὸν κόσμον ὑψοποιῶ, φέγγει ταπεινώσεως, τὴν ἀβλεψίαν τῶν ψυχῶν, ἐκδιώκουσα Μακάριε.
ltx/gr_gr_cog/me.m01.d28:meMA.Ode4C12.incipit	Ἀμέμπτως ἤνυσας, τὸν βίον δάκρυσι…
ltx/gr_gr_cog/me.m01.d28:meMA.Ode4C12.melody	@ltx/gr_gr_cog/he.h.m6:heHE.ChristosMouDynamis.name
ltx/gr_gr_cog/me.m01.d28:meMA.Ode4C12.mode	@ltx/gr_gr_cog/miscellanea:misc.Mode6
ltx/gr_gr_cog/me.m01.d28:meMA.Ode4C12.ode	@ltx/gr_gr_cog/miscellanea:misc.Ode4
ltx/gr_gr_cog/me.m01.d28:meMA.Ode4C12.text	Ἀμέμπτως ἤνυσας, τὸν βίον δάκρυσι, σεαυτὸν ἀποπλύνας, καὶ τοῦ Κριτοῦ, πᾶσι τὴν ἐπέλευσιν, καθιστορῶν λόγοις σοφοῖς, θεοφάντορ ἀξιάγαστε.
ltx/gr_gr_cog/me.m01.d28:meMA.Ode4C13.incipit	Ἰδών σου Κύριος, τῆς ταπεινώσεως…
ltx/gr_gr_cog/me.m01.d28:meMA.Ode4C13.melody	@ltx/gr_gr_cog/he.h.m6:heHE.ChristosMouDynamis.name
ltx/gr_gr_cog/me.m01.d28:meMA.Ode4C13.mode	@ltx/gr_gr_cog/miscellanea:misc.Mode6
ltx/gr_gr_cog/me.m01.d28:meMA.Ode4C13.ode	@ltx/gr_gr_cog/miscellanea:misc.Ode4
ltx/gr_gr_cog/me.m01.d28:meMA.Ode4C13.text	Ἰδών σου Κύριος, τῆς ταπεινώσεως, τὸ περίδοξον ὕψος ὑψοποιόν, λόγον σοι χαρίζεται, δι οὗ αἱρέσεων δεινά, τεταπείνωται ὑψώματα.
ltx/gr_gr_cog/me.m01.d28:meMA.Ode4C14.incipit	Ῥωσθεὶς τῇ χάριτι, τοῦ Παντοκράτορος…
ltx/gr_gr_cog/me.m01.d28:meMA.Ode4C14.melody	@ltx/gr_gr_cog/he.h.m6:heHE.ChristosMouDynamis.name
ltx/gr_gr_cog/me.m01.d28:meMA.Ode4C14.mode	@ltx/gr_gr_cog/miscellanea:misc.Mode6
ltx/gr_gr_cog/me.m01.d28:meMA.Ode4C14.ode	@ltx/gr_gr_cog/miscellanea:misc.Ode4
ltx/gr_gr_cog/me.m01.d28:meMA.Ode4C14.text	Ῥωσθεὶς τῇ χάριτι, τοῦ Παντοκράτορος, πρὸς ἀρχὰς παρετάξω δαιμονικάς, Πάτερ καὶ νενίκηκας, ὑπὲρ ἡμῶν ἐκδυσωπῶν, τῶν θερμῶς ἀνευφημούντων σε.
ltx/gr_gr_cog/me.m01.d28:meMA.Ode4C1T.incipit	Ὡς θεῖον τέμενος, ὡς ὄρος…
ltx/gr_gr_cog/me.m01.d28:meMA.Ode4C1T.melody	@ltx/gr_gr_cog/he.h.m6:heHE.ChristosMouDynamis.name
ltx/gr_gr_cog/me.m01.d28:meMA.Ode4C1T.mode	@ltx/gr_gr_cog/miscellanea:misc.Mode6
ltx/gr_gr_cog/me.m01.d28:meMA.Ode4C1T.ode	@ltx/gr_gr_cog/miscellanea:misc.Ode4
ltx/gr_gr_cog/me.m01.d28:meMA.Ode4C1T.text	Ὡς θεῖον τέμενος, ὡς ὄρος ἅγιον, ὡς πηγὴν ἀφθαρσίας, ὡς ἐκλεκτήν, μόνην χρηματίσασαν, τῷ πλαστουργῷ ἡμῶν Θεῷ, τὴν Παρθένον μακαρίσωμεν.
ltx/gr_gr_cog/me.m01.d28:meMA.Ode5C11.greekmelody	@ltx/gr_gr_cog/he.h.m6:heHE.ToTheioFengeiSou.greekname
ltx/gr_gr_cog/me.m01.d28:meMA.Ode5C11.incipit	Ταῖς τῶν δακρύων ἐπιῤῥοαῖς, τὸ…
ltx/gr_gr_cog/me.m01.d28:meMA.Ode5C11.melody	@ltx/gr_gr_cog/he.h.m6:heHE.ToTheioFengeiSou.name
ltx/gr_gr_cog/me.m01.d28:meMA.Ode5C11.mode	@ltx/gr_gr_cog/miscellanea:misc.Mode6
ltx/gr_gr_cog/me.m01.d28:meMA.Ode5C11.ode	@ltx/gr_gr_cog/miscellanea:misc.Ode5
ltx/gr_gr_cog/me.m01.d28:meMA.Ode5C11.text	Ταῖς τῶν δακρύων ἐπιῤῥοαῖς, τὸ τῶν ἡδονῶν ὁλοσχερῶς, Πάτερ ἐξήρανας πέλαγος· καὶ τῇ ἀναβλύσει τῶν διδαγμάτων σου, αἱρέσεων χειμάῤῥους Μάκαρ κατέκλυσας.
ltx/gr_gr_cog/me.m01.d28:meMA.Ode5C12.incipit	Ὁ νοῦς σου νεύσει τῇ…
ltx/gr_gr_cog/me.m01.d28:meMA.Ode5C12.melody	@ltx/gr_gr_cog/he.h.m6:heHE.ToTheioFengeiSou.name
ltx/gr_gr_cog/me.m01.d28:meMA.Ode5C12.mode	@ltx/gr_gr_cog/miscellanea:misc.Mode6
ltx/gr_gr_cog/me.m01.d28:meMA.Ode5C12.ode	@ltx/gr_gr_cog/miscellanea:misc.Ode5
ltx/gr_gr_cog/me.m01.d28:meMA.Ode5C12.text	Ὁ νοῦς σου νεύσει τῇ πρὸς Θεόν, Πάτερ λαμπρυνόμενος Ἐφραίμ, θεοειδὴς ὅλος γέγονεν, ἔσοπτρον καθάπερ τοῦ θείου Πνεύματος, ἀΰλους τὰς ἐμφάσεις ὑποδεχόμενος.
ltx/gr_gr_cog/me.m01.d28:meMA.Ode5C13.incipit	Ναὸς ἐγένου χωρητικός, Πάτερ τῆς…
ltx/gr_gr_cog/me.m01.d28:meMA.Ode5C13.melody	@ltx/gr_gr_cog/he.h.m6:heHE.ToTheioFengeiSou.name
ltx/gr_gr_cog/me.m01.d28:meMA.Ode5C13.mode	@ltx/gr_gr_cog/miscellanea:misc.Mode6
ltx/gr_gr_cog/me.m01.d28:meMA.Ode5C13.ode	@ltx/gr_gr_cog/miscellanea:misc.Ode5
ltx/gr_gr_cog/me.m01.d28:meMA.Ode5C13.text	Ναὸς ἐγένου χωρητικός, Πάτερ τῆς Τριάδος ἀληθῶς, πεποικιλμένος τῇ χάριτι, καὶ τῇ διαυγίᾳ τῶν καθαρῶν ἀρετῶν, καὶ τῇ τῶν διδαγμάτων ἀκεραιότητι.
ltx/gr_gr_cog/me.m01.d28:meMA.Ode5C1T.incipit	Νεκρόν με ἔδειξεν ἐν Ἐδέμ…
ltx/gr_gr_cog/me.m01.d28:meMA.Ode5C1T.melody	@ltx/gr_gr_cog/he.h.m6:heHE.ToTheioFengeiSou.name
ltx/gr_gr_cog/me.m01.d28:meMA.Ode5C1T.mode	@ltx/gr_gr_cog/miscellanea:misc.Mode6
ltx/gr_gr_cog/me.m01.d28:meMA.Ode5C1T.ode	@ltx/gr_gr_cog/miscellanea:misc.Ode5
ltx/gr_gr_cog/me.m01.d28:meMA.Ode5C1T.text	Νεκρόν με ἔδειξεν ἐν Ἐδέμ, γεῦσις ἡ τοῦ ξύλου πονηρά, ἐπιβουλὴ τῇ τοῦ ὄφεως· σὺ δὲ ζωοδότην Χριστὸν κυήσασα, ἐζώωσάς με μόνη Θεοχαρίτωτε.
ltx/gr_gr_cog/me.m01.d28:meMA.Ode6C11.greekmelody	@ltx/gr_gr_cog/he.h.m6:heHE.TouViouTinThalassan.greekname
ltx/gr_gr_cog/me.m01.d28:meMA.Ode6C11.incipit	Οὐ ψάμμον θεμέλιον, ἀλλὰ πίστιν…
ltx/gr_gr_cog/me.m01.d28:meMA.Ode6C11.melody	@ltx/gr_gr_cog/he.h.m6:heHE.TouViouTinThalassan.name
ltx/gr_gr_cog/me.m01.d28:meMA.Ode6C11.mode	@ltx/gr_gr_cog/miscellanea:misc.Mode6
ltx/gr_gr_cog/me.m01.d28:meMA.Ode6C11.ode	@ltx/gr_gr_cog/miscellanea:misc.Ode6
ltx/gr_gr_cog/me.m01.d28:meMA.Ode6C11.text	Οὐ ψάμμον θεμέλιον, ἀλλὰ πίστιν ἀῤῥαγῆ, ὁ Θεοφόρος θέμενος, ταῖς τοῦ ἐχθροῦ παντοίαις ἐπιβουλαῖς, ἀκλόνητος ἔμεινεν, ἀηττήτῳ δυνάμει κυβερνώμενος.
ltx/gr_gr_cog/me.m01.d28:meMA.Ode6C12.incipit	Ἡ γλῶσσά σου κάλαμος, ὀξυγράφου…
ltx/gr_gr_cog/me.m01.d28:meMA.Ode6C12.melody	@ltx/gr_gr_cog/he.h.m6:heHE.TouViouTinThalassan.name
ltx/gr_gr_cog/me.m01.d28:meMA.Ode6C12.mode	@ltx/gr_gr_cog/miscellanea:misc.Mode6
ltx/gr_gr_cog/me.m01.d28:meMA.Ode6C12.ode	@ltx/gr_gr_cog/miscellanea:misc.Ode6
ltx/gr_gr_cog/me.m01.d28:meMA.Ode6C12.text	Ἡ γλῶσσά σου κάλαμος, ὀξυγράφου ἀληθῶς, ὡς γραμματέως γέγονεν, ὑφηγουμένη γνῶσιν πανευσεβῆ, πλαξὶν ἐγχαράττουσα, καρδιῶν Πάτερ νόμον τὸν τοῦ Πνεύματος.
ltx/gr_gr_cog/me.m01.d28:meMA.Ode6C13.incipit	Τὸ σὸν οἱ ἐκπλέοντες, τῶν…
ltx/gr_gr_cog/me.m01.d28:meMA.Ode6C13.melody	@ltx/gr_gr_cog/he.h.m6:heHE.TouViouTinThalassan.name
ltx/gr_gr_cog/me.m01.d28:meMA.Ode6C13.mode	@ltx/gr_gr_cog/miscellanea:misc.Mode6
ltx/gr_gr_cog/me.m01.d28:meMA.Ode6C13.ode	@ltx/gr_gr_cog/miscellanea:misc.Ode6
ltx/gr_gr_cog/me.m01.d28:meMA.Ode6C13.text	Τὸ σὸν οἱ ἐκπλέοντες, τῶν δογμάτων γαληνόν, Ἐφραὶμ θεόφρον πέλαγος, τρικυμιῶν λυτροῦνται ψυχοβλαβῶν, καὶ ζάλης αἱρέσεων, ἀνανεύοντες πίστει διασῴζονται.
ltx/gr_gr_cog/me.m01.d28:meMA.Ode6C1T.incipit	Ὁ πάσης ἐπέκεινα, νοουμένης ὡς…
ltx/gr_gr_cog/me.m01.d28:meMA.Ode6C1T.melody	@ltx/gr_gr_cog/he.h.m6:heHE.TouViouTinThalassan.name
ltx/gr_gr_cog/me.m01.d28:meMA.Ode6C1T.mode	@ltx/gr_gr_cog/miscellanea:misc.Mode6
ltx/gr_gr_cog/me.m01.d28:meMA.Ode6C1T.ode	@ltx/gr_gr_cog/miscellanea:misc.Ode6
ltx/gr_gr_cog/me.m01.d28:meMA.Ode6C1T.text	Ὁ πάσης ἐπέκεινα, νοουμένης ὡς Θεός, καὶ ὀρωμένης κτίσεως, σωματωθεὶς προῆλθεν ἐκ σῆς γαστρός, τηρήσας σε ἄφθορον, ὥσπερ ἦς πρὸ τοῦ τόκου σου Θεονύμφευτε.
ltx/gr_gr_cog/me.m01.d28:meMA.Ode6H.greekmelody	@ltx/gr_gr_cog/he.h.m6:heHE.TouViouTinThalassan.greekname
ltx/gr_gr_cog/me.m01.d28:meMA.Ode6H.incipit	@ltx/gr_gr_cog/he.h.m6:heHE.TouViouTinThalassan.incipit
ltx/gr_gr_cog/me.m01.d28:meMA.Ode6H.melody	@ltx/gr_gr_cog/he.h.m6:heHE.TouViouTinThalassan.melody
ltx/gr_gr_cog/me.m01.d28:meMA.Ode6H.mode	@ltx/gr_gr_cog/miscellanea:misc.Mode6
ltx/gr_gr_cog/me.m01.d28:meMA.Ode6H.ode	@ltx/gr_gr_cog/miscellanea:misc.Ode6
ltx/gr_gr_cog/me.m01.d28:meMA.Ode6H.text	@ltx/gr_gr_cog/he.h.m6:heHE.TouViouTinThalassan.text
ltx/gr_gr_cog/me.m01.d28:meMA.Ode7C11.greekmelody	@ltx/gr_gr_cog/he.h.m6:heHE.DrosovolonMenTinKaminon.greekname
ltx/gr_gr_cog/me.m01.d28:meMA.Ode7C11.incipit	Νομοθέτης Μοναζόντων ἀκριβέστατος, ὤφθης σεβασμιώτατε…
ltx/gr_gr_cog/me.m01.d28:meMA.Ode7C11.melody	@ltx/gr_gr_cog/he.h.m6:heHE.DrosovolonMenTinKaminon.name
ltx/gr_gr_cog/me.m01.d28:meMA.Ode7C11.mode	@ltx/gr_gr_cog/miscellanea:misc.Mode6
ltx/gr_gr_cog/me.m01.d28:meMA.Ode7C11.ode	@ltx/gr_gr_cog/miscellanea:misc.Ode7
ltx/gr_gr_cog/me.m01.d28:meMA.Ode7C11.text	Νομοθέτης Μοναζόντων ἀκριβέστατος, ὤφθης σεβασμιώτατε, ὑπαλείπτης τε, πρὸς ἐχθρῶν παντοίων συμπλοκάς· διό σου τιμῶμεν τὸ σεπτόν, καὶ ἱερὸν ἐπὶ τῆς γῆς Πάτερ μνημόσυνον.
ltx/gr_gr_cog/me.m01.d28:meMA.Ode7C12.incipit	Ἐναρμόνιον τοῦ Πνεύματος ἀοίδιμε, ὄργανον…
ltx/gr_gr_cog/me.m01.d28:meMA.Ode7C12.melody	@ltx/gr_gr_cog/he.h.m6:heHE.DrosovolonMenTinKaminon.name
ltx/gr_gr_cog/me.m01.d28:meMA.Ode7C12.mode	@ltx/gr_gr_cog/miscellanea:misc.Mode6
ltx/gr_gr_cog/me.m01.d28:meMA.Ode7C12.ode	@ltx/gr_gr_cog/miscellanea:misc.Ode7
ltx/gr_gr_cog/me.m01.d28:meMA.Ode7C12.text	Ἐναρμόνιον τοῦ Πνεύματος ἀοίδιμε, ὄργανον ἐχρημάτισας, ὑπηχούμενος, ταῖς αὐτοῦ ἑκάστοτε πνοαῖς, καὶ μέλος σωτήριον ἡμῖν, τῆς μετανοίας μελῳδοῦν, τοῖς ἀνυμνοῦσί σε.
ltx/gr_gr_cog/me.m01.d28:meMA.Ode7C1T.incipit	Ὑπὲρ λόγον σου ἡ σύλληψις…
ltx/gr_gr_cog/me.m01.d28:meMA.Ode7C1T.melody	@ltx/gr_gr_cog/he.h.m6:heHE.DrosovolonMenTinKaminon.name
ltx/gr_gr_cog/me.m01.d28:meMA.Ode7C1T.mode	@ltx/gr_gr_cog/miscellanea:misc.Mode6
ltx/gr_gr_cog/me.m01.d28:meMA.Ode7C1T.ode	@ltx/gr_gr_cog/miscellanea:misc.Ode7
ltx/gr_gr_cog/me.m01.d28:meMA.Ode7C1T.text	Ὑπὲρ λόγον σου ἡ σύλληψις Θεόνυμφε· Θεὸν γὰρ Λόγον τέτοκας, τὸν ῥυσάμενον, ἀλογίας πάντας τοὺς βροτούς, καὶ λόγον παρέχοντα βοᾶν· Εὐλογητὸς εἶ ὁ Θεός, ὁ τῶν Πατέρων ἡμῶν.
ltx/gr_gr_cog/me.m01.d28:meMA.Ode8C11.greekmelody	@ltx/gr_gr_cog/he.h.m6:heHE.EkFlogosToisOsiois.greekname
ltx/gr_gr_cog/me.m01.d28:meMA.Ode8C11.incipit	Φωτοφόρος ὡς ἄλλος ἐδείχθης ἥλιος…
ltx/gr_gr_cog/me.m01.d28:meMA.Ode8C11.melody	@ltx/gr_gr_cog/he.h.m6:heHE.EkFlogosToisOsiois.name
ltx/gr_gr_cog/me.m01.d28:meMA.Ode8C11.mode	@ltx/gr_gr_cog/miscellanea:misc.Mode6
ltx/gr_gr_cog/me.m01.d28:meMA.Ode8C11.ode	@ltx/gr_gr_cog/miscellanea:misc.Ode8
ltx/gr_gr_cog/me.m01.d28:meMA.Ode8C11.text	Φωτοφόρος ὡς ἄλλος ἐδείχθης ἥλιος, διδαγμάτων ἀκτῖνας πέμπων τοῖς πέρασι, σκότος ἀφεγγές, ἐκμειώσας Μακάριε, πάσης ἁμαρτίας, φωτὶ τῆς μετανοίας.
ltx/gr_gr_cog/me.m01.d28:meMA.Ode8C12.incipit	Ῥείθροις θείων δογμάτων περικυκλούμενος, ποταμὸς…
ltx/gr_gr_cog/me.m01.d28:meMA.Ode8C12.melody	@ltx/gr_gr_cog/he.h.m6:heHE.EkFlogosToisOsiois.name
ltx/gr_gr_cog/me.m01.d28:meMA.Ode8C12.mode	@ltx/gr_gr_cog/miscellanea:misc.Mode6
ltx/gr_gr_cog/me.m01.d28:meMA.Ode8C12.ode	@ltx/gr_gr_cog/miscellanea:misc.Ode8
ltx/gr_gr_cog/me.m01.d28:meMA.Ode8C12.text	Ῥείθροις θείων δογμάτων περικυκλούμενος, ποταμὸς ὡς ἐξ ἄλλης Ἐδὲμ πεπόρευσαι, πρόσωπον τῆς γῆς, καταρδεύων θεσπέσιε, καὶ τῆς ἀσεβείας, ζιζάνια συμπνίγων.
ltx/gr_gr_cog/me.m01.d28:meMA.Ode8C1T.incipit	Ἀληθῆ Θεοτόκον ὁμολογοῦντές σε, τοῦ…
ltx/gr_gr_cog/me.m01.d28:meMA.Ode8C1T.melody	@ltx/gr_gr_cog/he.h.m6:heHE.EkFlogosToisOsiois.name
ltx/gr_gr_cog/me.m01.d28:meMA.Ode8C1T.mode	@ltx/gr_gr_cog/miscellanea:misc.Mode6
ltx/gr_gr_cog/me.m01.d28:meMA.Ode8C1T.ode	@ltx/gr_gr_cog/miscellanea:misc.Ode8
ltx/gr_gr_cog/me.m01.d28:meMA.Ode8C1T.text	Ἀληθῆ Θεοτόκον ὁμολογοῦντές σε, τοῦ Ἀγγέλου τὸ Χαῖρε πίστει βοῶμέν σοι· μόνη τὴν χαράν, ἐπὶ τῆς γῆς ἐκύησας, Κεχαριτωμένη, ἀεὶ εὐλογημένη.
ltx/gr_gr_cog/me.m01.d28:meMA.Ode8H.greekmelody	@ltx/gr_gr_cog/he.h.m6:heHE.EkFlogosToisOsiois.greekname
ltx/gr_gr_cog/me.m01.d28:meMA.Ode8H.incipit	@ltx/gr_gr_cog/he.h.m6:heHE.EkFlogosToisOsiois.incipit
ltx/gr_gr_cog/me.m01.d28:meMA.Ode8H.melody	@ltx/gr_gr_cog/he.h.m6:heHE.EkFlogosToisOsiois.melody
ltx/gr_gr_cog/me.m01.d28:meMA.Ode8H.mode	@ltx/gr_gr_cog/miscellanea:misc.Mode6
ltx/gr_gr_cog/me.m01.d28:meMA.Ode8H.ode	@ltx/gr_gr_cog/miscellanea:misc.Ode8
ltx/gr_gr_cog/me.m01.d28:meMA.Ode8H.text	@ltx/gr_gr_cog/he.h.m6:heHE.EkFlogosToisOsiois.text
ltx/gr_gr_cog/me.m01.d28:meMA.Ode9C11.greekmelody	@ltx/gr_gr_cog/he.h.m6:heHE.TheonAnthropois.greekname
ltx/gr_gr_cog/me.m01.d28:meMA.Ode9C11.incipit	Τρωθεὶς ἀγάπῃ τοῦ Παντοκράτορος, ὅλον…
ltx/gr_gr_cog/me.m01.d28:meMA.Ode9C11.melody	@ltx/gr_gr_cog/he.h.m6:heHE.TheonAnthropois.name
ltx/gr_gr_cog/me.m01.d28:meMA.Ode9C11.mode	@ltx/gr_gr_cog/miscellanea:misc.Mode6
ltx/gr_gr_cog/me.m01.d28:meMA.Ode9C11.ode	@ltx/gr_gr_cog/miscellanea:misc.Ode9
ltx/gr_gr_cog/me.m01.d28:meMA.Ode9C11.text	Τρωθεὶς ἀγάπῃ τοῦ Παντοκράτορος, ὅλον σαυτοῦ τὸν βίον, θρηνῳδῶν διετέλεσας, ἐκβοῶν μετʼ ἐκπλήξεως Ὅσιε· Ἄνες τὰ κύματά σου, Σῶτερ τῆς χάριτος, ταύτην μοι πλουσίως συντηρῶν, ἐν τῇ μελλούσῃ ζωῇ.
ltx/gr_gr_cog/me.m01.d28:meMA.Ode9C12.incipit	Ἡδὺς ὁ λόγος σου κατανύξεως…
ltx/gr_gr_cog/me.m01.d28:meMA.Ode9C12.melody	@ltx/gr_gr_cog/he.h.m6:heHE.TheonAnthropois.name
ltx/gr_gr_cog/me.m01.d28:meMA.Ode9C12.mode	@ltx/gr_gr_cog/miscellanea:misc.Mode6
ltx/gr_gr_cog/me.m01.d28:meMA.Ode9C12.ode	@ltx/gr_gr_cog/miscellanea:misc.Ode9
ltx/gr_gr_cog/me.m01.d28:meMA.Ode9C12.text	Ἡδὺς ὁ λόγος σου κατανύξεως, παρεκτικὸς καὶ πλήρης φωτισμοῦ τοῖς προστρέχουσι, θεοφόρε Ἐφραὶμ ἀξιάγαστε· ἄμεμπτος δὲ ὁ βίος, πάσαις κοσμούμενος, ταῖς θεοφεγγέσιν ἀρεταῖς, καὶ λαμπρυνόμενος.
ltx/gr_gr_cog/me.m01.d28:meMA.Ode9C13.incipit	Ναὸς τοῦ Πνεύματος ἐχρημάτισας, καὶ…
ltx/gr_gr_cog/me.m01.d28:meMA.Ode9C13.melody	@ltx/gr_gr_cog/he.h.m6:heHE.TheonAnthropois.name
ltx/gr_gr_cog/me.m01.d28:meMA.Ode9C13.mode	@ltx/gr_gr_cog/miscellanea:misc.Mode6
ltx/gr_gr_cog/me.m01.d28:meMA.Ode9C13.ode	@ltx/gr_gr_cog/miscellanea:misc.Ode9
ltx/gr_gr_cog/me.m01.d28:meMA.Ode9C13.text	Ναὸς τοῦ Πνεύματος ἐχρημάτισας, καὶ ποταμὸς ναμάτων ζωηρύτων πληρούμενος, Ἐκκλησίας θεμέλιος ἄσειστος, ἔρεισμα μοναζόντων, ῥεῖθρον ἀέναον, θείας κατανύξεως, Ἐφραὶμ ἀξιοθαύμαστε.
ltx/gr_gr_cog/me.m01.d28:meMA.Ode9C1T.incipit	Νοεῖν οὐ δύναται νοῦς ἀνθρώπινος…
ltx/gr_gr_cog/me.m01.d28:meMA.Ode9C1T.melody	@ltx/gr_gr_cog/he.h.m6:heHE.TheonAnthropois.name
ltx/gr_gr_cog/me.m01.d28:meMA.Ode9C1T.mode	@ltx/gr_gr_cog/miscellanea:misc.Mode6
ltx/gr_gr_cog/me.m01.d28:meMA.Ode9C1T.ode	@ltx/gr_gr_cog/miscellanea:misc.Ode9
ltx/gr_gr_cog/me.m01.d28:meMA.Ode9C1T.text	Νοεῖν οὐ δύναται νοῦς ἀνθρώπινος, τὸ ὑπὲρ νοῦν τοῦ τόκου σου Παρθένε μυστήριον·ὁ Θεὸς γὰρ σκηνώσας ἐν μέσῳ σου, κλεῖθρα τῆς παρθενίας, οὐ παρεσάλευσε, μόνος ὡς ἐπίσταται αὐτός, ὁ ἀκατάληπτος.
ltx/gr_gr_cog/me.m01.d28:meMA.Ode9H.greekmelody	@ltx/gr_gr_cog/he.h.m6:heHE.TheonAnthropois.greekname
ltx/gr_gr_cog/me.m01.d28:meMA.Ode9H.incipit	@ltx/gr_gr_cog/he.h.m6:heHE.TheonAnthropois.incipit
ltx/gr_gr_cog/me.m01.d28:meMA.Ode9H.melody	@ltx/gr_gr_cog/he.h.m6:heHE.TheonAnthropois.melody
ltx/gr_gr_cog/me.m01.d28:meMA.Ode9H.mode	@ltx/gr_gr_cog/miscellanea:misc.Mode6
ltx/gr_gr_cog/me.m01.d28:meMA.Ode9H.ode	@ltx/gr_gr_cog/miscellanea:misc.Ode9
ltx/gr_gr_cog/me.m01.d28:meMA.Ode9H.text	@ltx/gr_gr_cog/he.h.m6:heHE.TheonAnthropois.text
ltx/gr_gr_cog/me.m01.d28:meMA.Oikos1.text	Ἰχνηλατεῖν βουλόμενος, Πάτερ, τοῦ Προδρόμου ταῖς τρίβοις, ἐκ τοῦ κόσμου μόνος αὐτὸς ἀπάρας, εἰς ἔρημον κατῴκησας. Βλέπων σε οὖν οὕτω βιοῦντα ὁ ἐχθρὸς τὸν δίκαιον, γύναιον πάνυ ἀναιδὲς κατὰ σοῦ διεγείρει, οἰόμενος διὰ τοῦ ἀρχαίου ὅπλου τὴν σὴν ἀνδρείαν καταβαλεῖν, καὶ τὴν ἁγνείαν μολύνειν σου, ἵνα μὴ ἐν τοῖς λόγοις καὶ ἔργοις σου ῥαθύμους ἐγείρῃς πρὸς μετάνοιαν.
ltx/gr_gr_cog/me.m01.d28:meVE.Apolytikion1.melody	@ltx/gr_gr_cog/he.ga:heGA.TaisTonDakryonSou.name
ltx/gr_gr_cog/me.m01.d28:meVE.Apolytikion1.mode	@ltx/gr_gr_cog/miscellanea:misc.Mode8
ltx/gr_gr_cog/me.m01.d28:meVE.AposGlory.incipit	Προφητικῶς καταβρέχων τὴν στρωμνὴν τοῖς…
ltx/gr_gr_cog/me.m01.d28:meVE.AposGlory.melody	
ltx/gr_gr_cog/me.m01.d28:meVE.AposGlory.mode	@ltx/gr_gr_cog/miscellanea:misc.Mode4
ltx/gr_gr_cog/me.m01.d28:meVE.AposGlory.poet	@ltx/gr_gr_cog/poets:po.Anatoliou
ltx/gr_gr_cog/me.m01.d28:meVE.AposGlory.text	Προφητικῶς καταβρέχων τὴν στρωμνὴν τοῖς δάκρυσι, καὶ μελέτην βίου ποιούμενος τὴν μετάνοιαν, τῆς κρίσεως τὸν φόβον ἔργοις ἡμῖν, καὶ διὰ λόγων ὑπέδειξας. Διὸ τὴν σὴν τιμῶμεν ἅπαντες, συνελθόντες Παμμάκαρ μνήμην, παραδόξων πραγμάτων αὐτουργέ, Ἐφραὶμ ἀοίδιμε· καὶ νῦν δυσωποῦμέν σε· Πρέσβευε Χριστῷ τῷ Θεῷ, ὑπέρ τῶν ψυχῶν ἡμῶν.
ltx/gr_gr_cog/me.m01.d28:meVE.AposStavrotheotokion.greekmelody	@ltx/gr_gr_cog/he.a.m4:heAU.OsGennaionEnMartysi.greekname
ltx/gr_gr_cog/me.m01.d28:meVE.AposStavrotheotokion.incipit	@ltx/gr_gr_cog/me.m01.d16:meMA.LaudsStavrotheotokion.incipit
ltx/gr_gr_cog/me.m01.d28:meVE.AposStavrotheotokion.melody	@ltx/gr_gr_cog/he.a.m4:heAU.OsGennaionEnMartysi.name
ltx/gr_gr_cog/me.m01.d28:meVE.AposStavrotheotokion.mode	@ltx/gr_gr_cog/miscellanea:misc.Mode4
ltx/gr_gr_cog/me.m01.d28:meVE.AposStavrotheotokion.text	@ltx/gr_gr_cog/me.m01.d16:meMA.LaudsStavrotheotokion.text
ltx/gr_gr_cog/me.m01.d28:meVE.AposTheotokion.greekmelody	@ltx/gr_gr_cog/he.a.m4:heAU.OsGennaionEnMartysi.greekname
ltx/gr_gr_cog/me.m01.d28:meVE.AposTheotokion.incipit	Κατακρίσεως ῥῦσαί με…
ltx/gr_gr_cog/me.m01.d28:meVE.AposTheotokion.melody	@ltx/gr_gr_cog/he.a.m4:heAU.OsGennaionEnMartysi.name
ltx/gr_gr_cog/me.m01.d28:meVE.AposTheotokion.mode	@ltx/gr_gr_cog/miscellanea:misc.Mode4
ltx/gr_gr_cog/me.m01.d28:meVE.AposTheotokion.text	Κατακρίσεως ῥῦσαί με, Παναγία Θεόνυμφε· καὶ δεινῶν πταισμάτων, τὴν ταπεινήν μου ψυχήν, καὶ τοῦ θανάτου ἀπάλλαξον, εὐχαῖς σου καὶ δώρησαι, δικαιώσεως τυχεῖν, ἐν ἡμέρᾳ ἐτάσεως, ἧς ἐπέτυχον, τῶν Ἁγίων οἱ δῆμοι μετανοίᾳ, καθαρθέντα με πρὸ τέλους, καὶ τῶν δακρύων ταῖς χύσεσιν.
ltx/gr_gr_cog/me.m01.d28:meVE.GeneralApolytikion1.name	Ἐφραὶμ πατὴρ ἡμῶν ὅσιε,
ltx/gr_gr_cog/me.m01.d28:meVE.MM.GeneralApolytikion1.text	@ltx/gr_gr_cog/properties:media.key
ltx/gr_gr_cog/me.m01.d28:meVE.SticGlory.incipit	Ἐμφρόνως τῶν ὀχληρῶν τοῦ βίου…
ltx/gr_gr_cog/me.m01.d28:meVE.SticGlory.melody	
ltx/gr_gr_cog/me.m01.d28:meVE.SticGlory.mode	@ltx/gr_gr_cog/miscellanea:misc.Mode6
ltx/gr_gr_cog/me.m01.d28:meVE.SticGlory.poet	@ltx/gr_gr_cog/poets:po.Anatoliou
ltx/gr_gr_cog/me.m01.d28:meVE.SticGlory.text	Ἐμφρόνως τῶν ὀχληρῶν τοῦ βίου ἐπαναστάς, Ἐφραὶμ ἀοίδιμε, φιλησυχίᾳ τὴν ἔρημον κατέλαβες· καὶ δι’ αὐτῆς πρὸς Θεὸν πρακτικῶς ἀναγόμενος, τῷ κόσμῳ ἔλαμψας φωστήρ, καὶ ῥήματα ζωῆς τοῖς ἀνθρώποις ἐπήγασας· διὸ μὴ παύσῃ ἐν ταῖς εὐχαῖς σου στηρίζων ἡμᾶς, ἐκ βλάβης τοῦ ἀλλοτρίου, ῥυσθῆναι τὰς ψυχὰς ἡμῶν, Ὅσιε Πάτερ.
ltx/gr_gr_cog/me.m01.d28:meVE.SticStavrotheotokion.greekmelody	@ltx/gr_gr_cog/he.a.m6:heAU.TriimerosAnestis.greekname
ltx/gr_gr_cog/me.m01.d28:meVE.SticStavrotheotokion.incipit	@ltx/gr_gr_cog/oc.m6.d4:ocVE.AposTheotokion.incipit
ltx/gr_gr_cog/me.m01.d28:meVE.SticStavrotheotokion.melody	@ltx/gr_gr_cog/he.a.m6:heAU.TriimerosAnestis.name
ltx/gr_gr_cog/me.m01.d28:meVE.SticStavrotheotokion.mode	@ltx/gr_gr_cog/miscellanea:misc.Mode6
ltx/gr_gr_cog/me.m01.d28:meVE.SticStavrotheotokion.text	@ltx/gr_gr_cog/oc.m6.d4:ocVE.AposTheotokion.text
ltx/gr_gr_cog/me.m01.d28:meVE.SticTheotokion.incipit	Θεὸν ἐκ σοῦ σαρκωθέντα ἔγνωμεν…
ltx/gr_gr_cog/me.m01.d28:meVE.SticTheotokion.melody	
ltx/gr_gr_cog/me.m01.d28:meVE.SticTheotokion.mode	@ltx/gr_gr_cog/miscellanea:misc.Mode6
ltx/gr_gr_cog/me.m01.d28:meVE.SticTheotokion.text	Θεὸν ἐκ σοῦ σαρκωθέντα ἔγνωμεν, Θεοτόκε Παρθένε· αὐτὸν ἱκέτευε, σωθῆναι τὰς ψυχὰς ἡμῶν.
ltx/gr_gr_cog/me.m01.d28:meVE.Stichera01.greekmelody	@ltx/gr_gr_cog/he.a.m1:heAU.TonOuranionTagmaton.greekname
ltx/gr_gr_cog/me.m01.d28:meVE.Stichera01.incipit	Τοῦ Παραδείσου τὰ κάλλη κατοπτρισάμενος…
ltx/gr_gr_cog/me.m01.d28:meVE.Stichera01.melody	@ltx/gr_gr_cog/he.a.m1:heAU.TonOuranionTagmaton.name
ltx/gr_gr_cog/me.m01.d28:meVE.Stichera01.mode	@ltx/gr_gr_cog/miscellanea:misc.Mode1
ltx/gr_gr_cog/me.m01.d28:meVE.Stichera01.text	Τοῦ Παραδείσου τὰ κάλλη κατοπτρισάμενος, καὶ δαψιλῶς τρυφήσας, ἀκηράτους λειμῶνας, ἐξήνθησας τῷ κόσμῳ, γνῶσιν Θεοῦ· ἧς μετέχοντες Ὅσιε, πνευματικῇ διαθέσει τῇ τῶν ψυχῶν, ἀναθάλλομεν ἐν πνεύματι.
ltx/gr_gr_cog/me.m01.d28:meVE.Stichera02.incipit	Τὴν τοῦ Κριτοῦ παρουσίαν ἱστορησάμενος…
ltx/gr_gr_cog/me.m01.d28:meVE.Stichera02.melody	@ltx/gr_gr_cog/he.a.m1:heAU.TonOuranionTagmaton.name
ltx/gr_gr_cog/me.m01.d28:meVE.Stichera02.mode	@ltx/gr_gr_cog/miscellanea:misc.Mode1
ltx/gr_gr_cog/me.m01.d28:meVE.Stichera02.text	Τὴν τοῦ Κριτοῦ παρουσίαν ἱστορησάμενος, τοῖς τῶν δακρύων ῥείθροις, τῶν ψυχῶν τὰς λαμπάδας, ἀνάπτειν ἐκδιδάσκεις, πᾶσι βοῶν, τοῦ Νυμφίου τὴν ἔλευσιν· Περιβαλώμεθα πάντες στολὴν λαμπράν, ὑπαντῆσαι τῷ Νυμφίῳ Χριστῷ.
ltx/gr_gr_cog/me.m01.d28:meVE.Stichera03.incipit	Τῇ ἐγκρατείᾳ τὸ σῶμα περιφραξάμενος…
ltx/gr_gr_cog/me.m01.d28:meVE.Stichera03.melody	@ltx/gr_gr_cog/he.a.m1:heAU.TonOuranionTagmaton.name
ltx/gr_gr_cog/me.m01.d28:meVE.Stichera03.mode	@ltx/gr_gr_cog/miscellanea:misc.Mode1
ltx/gr_gr_cog/me.m01.d28:meVE.Stichera03.text	Τῇ ἐγκρατείᾳ τὸ σῶμα περιφραξάμενος, τὰς τῶν παθῶν κινήσεις, ἀπενέκρωσας Πάτερ, εὐχαῖς καὶ ἀγρυπνίαις· ὅθεν ἐν σοί, ἡ τοῦ Πνεύματος δύναμις, ἐπισκιάσασα ἔδειξε νοητόν, σὲ φωστήρα καὶ παγκόσμιον.
