ltx/gr_gr_cog/me.m01.d27:meDA.commemoration.first	Ἀνακομιδὴ τοῦ Λειψάνου τοῦ Ἁγίου Ἰωάννου τοῦ Χρυσοστόμου
ltx/gr_gr_cog/me.m01.d27:meDA.commemoration.first_name	
ltx/gr_gr_cog/me.m01.d27:meDA.commemoration.first_short	Ἀνακομιδὴ τοῦ Λειψάνου τοῦ Ἁγίου Ἰωάννου τοῦ Χρυσοστόμου
ltx/gr_gr_cog/me.m01.d27:meDA.commemoration.first_title	@ltx/gr_gr_cog/titles:ti.SaintM
ltx/gr_gr_cog/me.m01.d27:meDA.commemoration.full	Ἡ Ἀνακομιδὴ τοῦ Λειψάνου τοῦ ἐν Ἁγίοις Πατρὸς ἡμῶν Ἰωάννου τοῦ Χρυσοστόμου
ltx/gr_gr_cog/me.m01.d27:meDA.commemoration.second_name	
ltx/gr_gr_cog/me.m01.d27:meDA.commemoration.second_title	
ltx/gr_gr_cog/me.m01.d27:meDA.date	Τῌ ΚΖʹ ΙΑΝΟΥΑΡΙΟΥ
ltx/gr_gr_cog/me.m01.d27:meDA.fordate	διὰ τὴν 27ην Ἰανουαρίου
ltx/gr_gr_cog/me.m01.d27:meDA.insert1	τοῦ ἐν ἁγίοις πατρὸς ἡμῶν Ἰωάννου τοῦ Χρυσοστόμου, Ἀρχιεπισκόπου Κωνσταντινουπόλεως,
ltx/gr_gr_cog/me.m01.d27:meDA.insert2	οὗ καὶ τὴν μνήμην τῆς ἀνακομιδῆς τοῦ ἁγίου λειψάνου ἑορτάζομεν·
ltx/gr_gr_cog/me.m01.d27:meDA.note	
ltx/gr_gr_cog/me.m01.d27:meDA.pdfcoverdate	τῆς 27ης Ἰανουαρίου,
ltx/gr_gr_cog/me.m01.d27:meDA.pdfheaderdate	τῆς 27ης Ἰανουαρίου
ltx/gr_gr_cog/me.m01.d27:meHO.commemorations	
ltx/gr_gr_cog/me.m01.d27:meHO.note1	@ltx/gr_gr_cog/rubrical:ru.HolidayWineOil
ltx/gr_gr_cog/me.m01.d27:meHO.note2	
ltx/gr_gr_cog/me.m01.d27:meHO.number	27.
ltx/gr_gr_cog/me.m01.d27:meHO.rank	
ltx/gr_gr_cog/me.m01.d27:meLE.commemoration1	Μνήμη Ἀνακομιδῆς τοῦ ἱεροῦ λειψάνου τοῦ ἐν Ἁγίοις Πατρός ἡμῶν Ἰωάννου, Ἀρχιεπισκόπου Κωνσταντινουπόλεως τοῦ Χρυσοστόμου.
ltx/gr_gr_cog/me.m01.d27:meLE.commemoration2	
ltx/gr_gr_cog/me.m01.d27:meLI.Kontakion1.greekmelody	@ltx/gr_gr_cog/me.m01.d27:meMA.Kontakion1.greekmelody
ltx/gr_gr_cog/me.m01.d27:meLI.Kontakion1.incipit	@ltx/gr_gr_cog/me.m01.d27:meMA.Kontakion1.incipit
ltx/gr_gr_cog/me.m01.d27:meLI.Kontakion1.melody	@ltx/gr_gr_cog/me.m01.d27:meMA.Kontakion1.melody
ltx/gr_gr_cog/me.m01.d27:meLI.Kontakion1.mode	@ltx/gr_gr_cog/me.m01.d27:meMA.Kontakion1.mode
ltx/gr_gr_cog/me.m01.d27:meLI.Kontakion1.text	@ltx/gr_gr_cog/me.m01.d27:meMA.Kontakion1.text
ltx/gr_gr_cog/me.m01.d27:meLI.MM.CommunionHymn.text	@ltx/gr_gr_cog/properties:media.key
ltx/gr_gr_cog/me.m01.d27:meLI.Megalynarion.text	Ἧκεν ἐκ Κομάνων λαμπροφανῶς, τὸ σεπτόν σου σκῆνος, ὡς ἑστία ἁγιασμοῦ, τέρπον καὶ πλουτίζον, χαρίτων χρυσουργίᾳ, τὴν Ἐκκλησίαν πᾶσαν, πάτερ Χρυσόστομε.
ltx/gr_gr_cog/me.m01.d27:meMA.C1.acrostic.notice1	οὗ ἡ Ἀκροστιχίς·
ltx/gr_gr_cog/me.m01.d27:meMA.C1.acrostic.text	Χαίροις χαρᾶς σκήνωμα, τῆς λύπης λύσις. ᾨδὴ Ἰωάννου.
ltx/gr_gr_cog/me.m01.d27:meMA.C1.acrostic.title	Κανὼν τῆς Θεοτόκου,
ltx/gr_gr_cog/me.m01.d27:meMA.C1.title	@ltx/gr_gr_cog/titles:ti.CanonTheotokos
ltx/gr_gr_cog/me.m01.d27:meMA.C1.verse	@ltx/gr_gr_cog/prayers:pr.verse_Theotokos.text
ltx/gr_gr_cog/me.m01.d27:meMA.C2.poet	@ltx/gr_gr_cog/poets:po.Theofanous
ltx/gr_gr_cog/me.m01.d27:meMA.C2.title	@ltx/gr_gr_cog/titles:ti.Canon1SaintM
ltx/gr_gr_cog/me.m01.d27:meMA.C2.verse	@ltx/gr_gr_cog/prayers:pr.verse_SaintM.text
ltx/gr_gr_cog/me.m01.d27:meMA.C3.acrostic.notice1	οὗ ἡ Ἀκροστιχίς·
ltx/gr_gr_cog/me.m01.d27:meMA.C3.acrostic.text	Τῷ χρυσογλώττῳ, τρίτον ἐξᾴδω μέλος. Ἰωσήφ.
ltx/gr_gr_cog/me.m01.d27:meMA.C3.acrostic.title	Ἕτερος Κανὼν τοῦ Ἁγίου,
ltx/gr_gr_cog/me.m01.d27:meMA.C3.title	@ltx/gr_gr_cog/titles:ti.Canon2SaintM
ltx/gr_gr_cog/me.m01.d27:meMA.C3.verse	@ltx/gr_gr_cog/prayers:pr.verse_SaintM.text
ltx/gr_gr_cog/me.m01.d27:meMA.ExapTheotokion.incipit	Φρικτὴ ἡ προστασία σου, Μαρία…
ltx/gr_gr_cog/me.m01.d27:meMA.ExapTheotokion.melody	@ltx/gr_gr_cog/he.a.m2:heAU.GynaikesAkoutisthite.name
ltx/gr_gr_cog/me.m01.d27:meMA.ExapTheotokion.mode	@ltx/gr_gr_cog/miscellanea:misc.Mode2
ltx/gr_gr_cog/me.m01.d27:meMA.ExapTheotokion.text	Φρικτὴ ἡ προστασία σου, Μαρία Θεοκόσμητε, καὶ φοβερά σου ἡ δόξα, πάσῃ τῇ γῇ Θεοτόκε· εἰς σὲ γὰρ νῦν καυχώμεθα, σὲ καὶ μεσίτην ἔχοντες, πρὸς τὸν Υἱὸν καὶ Κτίστην σου, τῇ ἀκοιμήτῳ πρεσβείᾳ, τῇ σῇ σωθείημεν πάντες.
ltx/gr_gr_cog/me.m01.d27:meMA.Exaposteilarion1.greekmelody	@ltx/gr_gr_cog/he.a.m2:heAU.GynaikesAkoutisthite.greekname
ltx/gr_gr_cog/me.m01.d27:meMA.Exaposteilarion1.incipit	Ἀγάλλου πολις πόλεων, πασῶν ἡ…
ltx/gr_gr_cog/me.m01.d27:meMA.Exaposteilarion1.melody	@ltx/gr_gr_cog/he.a.m2:heAU.GynaikesAkoutisthite.name
ltx/gr_gr_cog/me.m01.d27:meMA.Exaposteilarion1.mode	@ltx/gr_gr_cog/miscellanea:misc.Mode2
ltx/gr_gr_cog/me.m01.d27:meMA.Exaposteilarion1.text	Ἀγάλλου πολις πόλεων, πασῶν ἡ Βασιλεύουσα, ὡς τοῦ καλοῦ σου Ποιμένος, τοῦ Ποιμενάρχου τὸ σκῆνος, ἀπολαβοῦσα σήμερον, τοῦ σὲ καὶ κόσμον ἅπαντα, ῥυθμίζοντος καὶ σῴζοντος, μελισταγοῦς Χρυσοστόμου, καὶ ἐπικρότει τοῖς ὕμνοις.
ltx/gr_gr_cog/me.m01.d27:meMA.Kathisma11.greekmelody	@ltx/gr_gr_cog/he.a.m1:heAU.TonTafonSouSotir.greekname
ltx/gr_gr_cog/me.m01.d27:meMA.Kathisma11.incipit	Δογμάτων ἀστραπαῖς, ὥσπερ ἥλιος μέγας…
ltx/gr_gr_cog/me.m01.d27:meMA.Kathisma11.melody	@ltx/gr_gr_cog/he.a.m1:heAU.TonTafonSouSotir.name
ltx/gr_gr_cog/me.m01.d27:meMA.Kathisma11.mode	@ltx/gr_gr_cog/miscellanea:misc.Mode1
ltx/gr_gr_cog/me.m01.d27:meMA.Kathisma11.text	Δογμάτων ἀστραπαῖς, ὥσπερ ἥλιος μέγας, ἐφώτισας τὴν γῆν, καὶ ἀγνοίας τὸ σκότος, μακρὰν ἀπεδίωξας, Ἰωάννη Χρυσόστομε· ὅθεν δέομαι, τοῦ αἰωνίου με σκότους, ἐλευθέρωσον, καὶ φωτισμοῦ σωτηρίας, εὐχαῖς σου ἀξίωσον.
ltx/gr_gr_cog/me.m01.d27:meMA.Kathisma1T.incipit	Ἀσπόρως τὸν Χριστόν, ἀπεκύησας μόνη…
ltx/gr_gr_cog/me.m01.d27:meMA.Kathisma1T.melody	@ltx/gr_gr_cog/he.a.m1:heAU.TonTafonSouSotir.name
ltx/gr_gr_cog/me.m01.d27:meMA.Kathisma1T.mode	@ltx/gr_gr_cog/miscellanea:misc.Mode1
ltx/gr_gr_cog/me.m01.d27:meMA.Kathisma1T.text	Ἀσπόρως τὸν Χριστόν, ἀπεκύησας μόνη, τὸ θαῦμα ὑπὲρ νοῦν, πῶς Παρθένος καὶ Μήτηρ· διὸ Θεοτόκον σε, προσκυνοῦντες δοξάζομεν· σὺ γὰρ ἔτεκες, τὸν Βασιλέα τῆς δόξης· ὃν δυσώπησον, τοῦ εἰρηνεῦσαι τὸν κόσμον, καὶ σῶσαι τὰς ψυχὰς ἡμῶν.
ltx/gr_gr_cog/me.m01.d27:meMA.Kathisma21.greekmelody	@ltx/gr_gr_cog/he.a.m4:heAU.OYpsotheisEnToStavro.greekname
ltx/gr_gr_cog/me.m01.d27:meMA.Kathisma21.incipit	Ὡς χρυσαυγές τε καὶ τερπνὸν…
ltx/gr_gr_cog/me.m01.d27:meMA.Kathisma21.melody	@ltx/gr_gr_cog/he.a.m4:heAU.OYpsotheisEnToStavro.name
ltx/gr_gr_cog/me.m01.d27:meMA.Kathisma21.mode	@ltx/gr_gr_cog/miscellanea:misc.Mode4
ltx/gr_gr_cog/me.m01.d27:meMA.Kathisma21.text	Ὡς χρυσαυγές τε καὶ τερπνὸν θεοῤῥῆμον, ὄργανον θεῖον κελαδοῦν Ἐκκλησία, ὑπὸ Χριστοῦ Χρυσόστομε δεδώρησαι· χελιδὼν ἡ εὔλαλος, χρυσαυγίζουσα Μάκαρ, νοῦς ὁ χρυσοστόλιστος, λύρα τῆς μετανοίας, τοὺς σὲ τιμῶντας ῥῦσαι πειρασμῶν, σαῖς ἱκεσίαις Ποιμὴν ἀξιάγαστε.
ltx/gr_gr_cog/me.m01.d27:meMA.Kathisma2T.incipit	@ltx/gr_gr_cog/me.m01.d21:meMA.Ode3KathismaT.incipit
ltx/gr_gr_cog/me.m01.d27:meMA.Kathisma2T.melody	@ltx/gr_gr_cog/he.a.m4:heAU.OYpsotheisEnToStavro.name
ltx/gr_gr_cog/me.m01.d27:meMA.Kathisma2T.mode	@ltx/gr_gr_cog/miscellanea:misc.Mode4
ltx/gr_gr_cog/me.m01.d27:meMA.Kathisma2T.text	@ltx/gr_gr_cog/me.m01.d21:meMA.Ode3KathismaT.text
ltx/gr_gr_cog/me.m01.d27:meMA.Kathisma31.greekmelody	@ltx/gr_gr_cog/he.a.m4:heAU.KateplagiIosif.greekname
ltx/gr_gr_cog/me.m01.d27:meMA.Kathisma31.incipit	Θείᾳ ψήφῳ τῆς Χριστοῦ, ποίμνης…
ltx/gr_gr_cog/me.m01.d27:meMA.Kathisma31.melody	@ltx/gr_gr_cog/he.a.m4:heAU.KateplagiIosif.name
ltx/gr_gr_cog/me.m01.d27:meMA.Kathisma31.mode	@ltx/gr_gr_cog/miscellanea:misc.Mode4
ltx/gr_gr_cog/me.m01.d27:meMA.Kathisma31.text	Θείᾳ ψήφῳ τῆς Χριστοῦ, ποίμνης ἀξίως γεγονώς, Ἀξιάγαστε ποιμήν, οἵά περ λύκους ἐξ αὐτῆς, ἐν τῇ σφενδόνῃ τῶν λόγων σου ἀπεδίωξας, ἐλέγχων ἀφειδῶς, παρανομοῦντας σοφέ· ὑφʼ ὦν καὶ ἐλαθείς, φθόνῳ Χρυσόστομε, μακρὰν ὁδὸν διήνυσας στεῤῥόφρον, ὑπὲρ αὐτῆς ἐν ᾗ τέθνηκας, ἀλλʼ ἐπανῆλθες πρὸς Βασιλίδα, νέμων θεῖα χαρίσματα.
ltx/gr_gr_cog/me.m01.d27:meMA.Kathisma3T.incipit	@ltx/gr_gr_cog/he.a.m4:heAU.KateplagiIosif.incipit
ltx/gr_gr_cog/me.m01.d27:meMA.Kathisma3T.melody	@ltx/gr_gr_cog/he.a.m4:heAU.KateplagiIosif.melody
ltx/gr_gr_cog/me.m01.d27:meMA.Kathisma3T.mode	@ltx/gr_gr_cog/miscellanea:misc.Mode4
ltx/gr_gr_cog/me.m01.d27:meMA.Kathisma3T.text	@ltx/gr_gr_cog/he.a.m4:heAU.KateplagiIosif.text
ltx/gr_gr_cog/me.m01.d27:meMA.Kontakion1.greekmelody	@ltx/gr_gr_cog/he.a.m1:heAU.ChorosAngelikos.greekname
ltx/gr_gr_cog/me.m01.d27:meMA.Kontakion1.incipit	Ἐφράνθη μυστικῶς, ἡ σεπτὴ Ἐκκλησία…
ltx/gr_gr_cog/me.m01.d27:meMA.Kontakion1.melody	@ltx/gr_gr_cog/he.a.m1:heAU.ChorosAngelikos.name
ltx/gr_gr_cog/me.m01.d27:meMA.Kontakion1.mode	@ltx/gr_gr_cog/miscellanea:misc.Mode1
ltx/gr_gr_cog/me.m01.d27:meMA.Kontakion1.text	Ἐφράνθη μυστικῶς, ἡ σεπτὴ Ἐκκλησία, τῇ ἀνακομιδῇ, τοῦ σεπτοῦ σου λειψάνου· καὶ τοῦτο κατακρύψασα, ὡς χρυσίον πολύτιμον, τοῖς ὑμνοῦσί σε, ἀδιαλείπτως παρέχει, ταῖς πρεσβείαις σου, τῶν ἰαμάτων τὴν χάριν, Ἰωάννη Χρυσόστομε.
ltx/gr_gr_cog/me.m01.d27:meMA.Lauds1.greekmelody	@ltx/gr_gr_cog/he.a.m4:heAU.EdokasSimeiosin.greekname
ltx/gr_gr_cog/me.m01.d27:meMA.Lauds1.incipit	Χρυσοῦ τηλαυγέστερον, τὰ Ἱερά σου…
ltx/gr_gr_cog/me.m01.d27:meMA.Lauds1.melody	@ltx/gr_gr_cog/he.a.m4:heAU.EdokasSimeiosin.name
ltx/gr_gr_cog/me.m01.d27:meMA.Lauds1.mode	@ltx/gr_gr_cog/miscellanea:misc.Mode4
ltx/gr_gr_cog/me.m01.d27:meMA.Lauds1.text	Χρυσοῦ τηλαυγέστερον, τὰ Ἱερά σου διδάγματα, προχεόμενα πάνσοφε, πλουτίζει Χρυσόστομε, πενομένας φρένας, καὶ ἀποδιώκει, τῶν παθημάτων τὴν ἀχλύν, φιλαργυρίας πικρὸν χειμῶνά τε· διό σε μακαρίζομεν, χρεωστικῶς καὶ τὴν κόνιν σου, τῶν λειψάνων σεβόμεθα, ὡς πηγὴν ἁγιάσματος.
ltx/gr_gr_cog/me.m01.d27:meMA.Lauds2.incipit	Ἀδίκως τῆς ποίμνης σου, ἀπελαθεὶς…
ltx/gr_gr_cog/me.m01.d27:meMA.Lauds2.melody	@ltx/gr_gr_cog/he.a.m4:heAU.EdokasSimeiosin.name
ltx/gr_gr_cog/me.m01.d27:meMA.Lauds2.mode	@ltx/gr_gr_cog/miscellanea:misc.Mode4
ltx/gr_gr_cog/me.m01.d27:meMA.Lauds2.text	Ἀδίκως τῆς ποίμνης σου, ἀπελαθεὶς Πάτερ Ὅσιε, προσωμίλησας θλίψεσι, πικραῖς ἐξορίαις τε· ἐν αἷς ἠξιώθης, μακαρίου τέλους, οἷα γενναῖος ἀθλητής, καταπαλαίσας τὸν πολυμήχανον, διὸ τῇ ἐπανόδῳ σου, ἡ Ἐκκλησία ἀγάλλεται, ἣν χρυσῷ κατεκόσμησας, τῶν πανσόφων δογμάτων σου.
ltx/gr_gr_cog/me.m01.d27:meMA.Lauds3.incipit	Ὁ στῦλος ὁ πύρινος, ὁ…
ltx/gr_gr_cog/me.m01.d27:meMA.Lauds3.melody	@ltx/gr_gr_cog/he.a.m4:heAU.EdokasSimeiosin.name
ltx/gr_gr_cog/me.m01.d27:meMA.Lauds3.mode	@ltx/gr_gr_cog/miscellanea:misc.Mode4
ltx/gr_gr_cog/me.m01.d27:meMA.Lauds3.text	Ὁ στῦλος ὁ πύρινος, ὁ ποταμὸς ὁ τοῖς νάμασι, τῶν δογμάτων κατάῤῥυτος, ὁ νοῦς ὁ οὐράνιος, τῆς θεολογίας, τὸ πάγχρυσον στόμα, ἁμαρτωλῶν ἐγγυητής, τῆς μετανοίας κήρυξ ὁ ἔνθεος, φωστὴρ ὁ διαυγέστατος, ὁ ἐπουράνιος ἄνθρωπος, ὁ μακάριος σήμερον, ἀνυμνείσθω Χρυσόστομος.
ltx/gr_gr_cog/me.m01.d27:meMA.Lauds4.greekmelody	@ltx/gr_gr_cog/he.a.m4:heAU.EdokasSimeiosin.greekname
ltx/gr_gr_cog/me.m01.d27:meMA.Lauds4.incipit	Κόσμον ὡς βασίλειον, ἡ Βασιλὶς…
ltx/gr_gr_cog/me.m01.d27:meMA.Lauds4.melody	@ltx/gr_gr_cog/he.a.m4:heAU.EdokasSimeiosin.name
ltx/gr_gr_cog/me.m01.d27:meMA.Lauds4.mode	@ltx/gr_gr_cog/miscellanea:misc.Mode4
ltx/gr_gr_cog/me.m01.d27:meMA.Lauds4.text	Κόσμον ὡς βασίλειον, ἡ Βασιλὶς τὸ σὸν λείψανον, δεξαμένη Χρυσόστομε, ἐν τούτῳ σεμνύνεται· καὶ ἐγκαυχωμένη, ἐπὶ τοῖς σοῖς λόγοις τὴν οἰκουμένην συγκαλεῖ, εἰς εὐφροσύνην καὶ θείαν μέθεξιν, ἀφθόνων τῶν χαρίτων σου, μεγαλοφώνως κραυγάζουσα, Ἰησοῦ ὑπεράγαθε, σὺ εἶ δόξα τῶν δούλων σου.
ltx/gr_gr_cog/me.m01.d27:meMA.LaudsGlory.incipit	Πάτερ Χρυσόστομε, ὡς ποταμὸς θεόβρυτος…
ltx/gr_gr_cog/me.m01.d27:meMA.LaudsGlory.melody	
ltx/gr_gr_cog/me.m01.d27:meMA.LaudsGlory.mode	@ltx/gr_gr_cog/miscellanea:misc.Mode4
ltx/gr_gr_cog/me.m01.d27:meMA.LaudsGlory.poet	@ltx/gr_gr_cog/poets:po.Germanou
ltx/gr_gr_cog/me.m01.d27:meMA.LaudsGlory.text	Πάτερ Χρυσόστομε, ὡς ποταμὸς θεόβρυτος, ἐκ τῆς Ἐδὲμ μυστικῶς ἐξερχόμενος, εἰς ἀρχὰς τέσσαρας διαδραμών, σοῖς λόγοις τῆς γῆς τὰ πέρατα, πάντα πιστὸν κατήρδευσας, τῇ παγχρύσῳ διδασκαλίᾳ σου, διὸ τὴν ἐπάνοδον, σοῦ τῶν θείων λειψάνων, ἡμῖν σαφῶς πολιτογραφήσας, πρεσβεύεις σωθῆναι, τὰς ψυχὰς Ἰωάννη, τῶν ἀνυμνούντων σε.
ltx/gr_gr_cog/me.m01.d27:meMA.LaudsTheotokion.incipit	@ltx/gr_gr_cog/oc.m4.d2:ocMA.AposTheotokion.incipit
ltx/gr_gr_cog/me.m01.d27:meMA.LaudsTheotokion.melody	
ltx/gr_gr_cog/me.m01.d27:meMA.LaudsTheotokion.mode	@ltx/gr_gr_cog/miscellanea:misc.Mode4
ltx/gr_gr_cog/me.m01.d27:meMA.LaudsTheotokion.text	@ltx/gr_gr_cog/oc.m4.d2:ocMA.AposTheotokion.text
ltx/gr_gr_cog/me.m01.d27:meMA.MM.Lauds1234as5678.text	@ltx/gr_gr_cog/properties:media.key
ltx/gr_gr_cog/me.m01.d27:meMA.Ode1C11.greekmelody	@ltx/gr_gr_cog/he.h.m8:heHE.ArmatilatinFarao.greekname
ltx/gr_gr_cog/me.m01.d27:meMA.Ode1C11.incipit	Χαῖρε κατάρας παλαιᾶς ἡ λύτρωσις…
ltx/gr_gr_cog/me.m01.d27:meMA.Ode1C11.melody	@ltx/gr_gr_cog/he.h.m8:heHE.ArmatilatinFarao.name
ltx/gr_gr_cog/me.m01.d27:meMA.Ode1C11.mode	@ltx/gr_gr_cog/miscellanea:misc.Mode8
ltx/gr_gr_cog/me.m01.d27:meMA.Ode1C11.ode	@ltx/gr_gr_cog/miscellanea:misc.Ode1
ltx/gr_gr_cog/me.m01.d27:meMA.Ode1C11.text	Χαῖρε κατάρας παλαιᾶς ἡ λύτρωσις, καὶ εὐλογίας πηγή, χαῖρε ζωῆς Μήτηρ, ᾍδου ἡ καθαίρεσις, θανάτου ἡ ἀναίρεσις, χαῖρε λύσις τῆς λύπης, χαρᾶς χωρίον εὐρύχωρον· χαῖρε Θεοτόκε πανύμνητε.
ltx/gr_gr_cog/me.m01.d27:meMA.Ode1C12.incipit	Ἅρμα τοῦ Λόγου λογικὸν καὶ…
ltx/gr_gr_cog/me.m01.d27:meMA.Ode1C12.melody	@ltx/gr_gr_cog/he.h.m8:heHE.ArmatilatinFarao.name
ltx/gr_gr_cog/me.m01.d27:meMA.Ode1C12.mode	@ltx/gr_gr_cog/miscellanea:misc.Mode8
ltx/gr_gr_cog/me.m01.d27:meMA.Ode1C12.ode	@ltx/gr_gr_cog/miscellanea:misc.Ode1
ltx/gr_gr_cog/me.m01.d27:meMA.Ode1C12.text	Ἅρμα τοῦ Λόγου λογικὸν καὶ ἔμψυχον, χαῖρε πανάμωμε, Δαυϊτικὸν χαῖρε, ἅρμα πολυώνυμον, ἅρμα μυριοπλάσιον· χαῖρε ἡ ἀσυγκρίτως, τῶν Χερουβὶμ ὑπερέχουσα, καὶ τῶν Σεραφὶμ ὑπερφέρουσα.
ltx/gr_gr_cog/me.m01.d27:meMA.Ode1C13.incipit	Ἱερωτέρα νοερῶν Δυνάμεων, χαῖρε Θεόνυμφε…
ltx/gr_gr_cog/me.m01.d27:meMA.Ode1C13.melody	@ltx/gr_gr_cog/he.h.m8:heHE.ArmatilatinFarao.name
ltx/gr_gr_cog/me.m01.d27:meMA.Ode1C13.mode	@ltx/gr_gr_cog/miscellanea:misc.Mode8
ltx/gr_gr_cog/me.m01.d27:meMA.Ode1C13.ode	@ltx/gr_gr_cog/miscellanea:misc.Ode1
ltx/gr_gr_cog/me.m01.d27:meMA.Ode1C13.text	Ἱερωτέρα νοερῶν Δυνάμεων, χαῖρε Θεόνυμφε, χαῖρε κτιστῆς πάσης, ἀνωτέρα φύσεως· χαῖρε Θεοῦ παλάτιον, χαῖρε πύρινε θρόνε, χαῖρε λυχνία πολύφωτε· χαῖρε μυριώνυμε Δέσποινα.
ltx/gr_gr_cog/me.m01.d27:meMA.Ode1C14.incipit	Ῥάβδος ἐκ ῥίζης Ἰεσσαὶ βλαστήσασα…
ltx/gr_gr_cog/me.m01.d27:meMA.Ode1C14.melody	@ltx/gr_gr_cog/he.h.m8:heHE.ArmatilatinFarao.name
ltx/gr_gr_cog/me.m01.d27:meMA.Ode1C14.mode	@ltx/gr_gr_cog/miscellanea:misc.Mode8
ltx/gr_gr_cog/me.m01.d27:meMA.Ode1C14.ode	@ltx/gr_gr_cog/miscellanea:misc.Ode1
ltx/gr_gr_cog/me.m01.d27:meMA.Ode1C14.text	Ῥάβδος ἐκ ῥίζης Ἰεσσαὶ βλαστήσασα, χαῖρε ἀμόλυντε· χαῖρε βλαστῷ ῥάβδου, τῆς Ἀαρωνίτιδος, διαγραφεῖσα πρότερον, μυστικῶς καὶ βαθέως· ὡς γὰρ ἐκείνη τὰ κάρυα, οὕτω τὸν Χριστὸν σὺ ἐξήνθησας.
ltx/gr_gr_cog/me.m01.d27:meMA.Ode1C1H.greekmelody	@ltx/gr_gr_cog/he.h.m8:heHE.ArmatilatinFarao.greekname
ltx/gr_gr_cog/me.m01.d27:meMA.Ode1C1H.incipit	@ltx/gr_gr_cog/he.h.m8:heHE.ArmatilatinFarao.incipit
ltx/gr_gr_cog/me.m01.d27:meMA.Ode1C1H.melody	@ltx/gr_gr_cog/he.h.m8:heHE.ArmatilatinFarao.melody
ltx/gr_gr_cog/me.m01.d27:meMA.Ode1C1H.mode	@ltx/gr_gr_cog/miscellanea:misc.Mode8
ltx/gr_gr_cog/me.m01.d27:meMA.Ode1C1H.ode	@ltx/gr_gr_cog/miscellanea:misc.Ode1
ltx/gr_gr_cog/me.m01.d27:meMA.Ode1C1H.text	@ltx/gr_gr_cog/he.h.m8:heHE.ArmatilatinFarao.text
ltx/gr_gr_cog/me.m01.d27:meMA.Ode1C21.greekmelody	@ltx/gr_gr_cog/he.h.m8:heHE.AsmaAnapempsomen.greekname
ltx/gr_gr_cog/me.m01.d27:meMA.Ode1C21.incipit	Πλοῦτον ἐναπέθου σῇ ψυχῇ, τὸν…
ltx/gr_gr_cog/me.m01.d27:meMA.Ode1C21.melody	@ltx/gr_gr_cog/he.h.m8:heHE.AsmaAnapempsomen.name
ltx/gr_gr_cog/me.m01.d27:meMA.Ode1C21.mode	@ltx/gr_gr_cog/miscellanea:misc.Mode8
ltx/gr_gr_cog/me.m01.d27:meMA.Ode1C21.ode	@ltx/gr_gr_cog/miscellanea:misc.Ode1
ltx/gr_gr_cog/me.m01.d27:meMA.Ode1C21.text	Πλοῦτον ἐναπέθου σῇ ψυχῇ, τὸν θησαυρὸν τοῦ Πνεύματος, Πάτερ Χρυσόστομε· ἐξ οὗ τὴν Ἐκκλησίαν πλουτίζεις τοῖς λόγοις σου, ἥτις σου ἐπαξίως, ἑορτάζει ἐπάνοδον θείαν.
ltx/gr_gr_cog/me.m01.d27:meMA.Ode1C22.incipit	Λόγοις κατεποίκιλας χρυσοῖς, τὴν ἱερὰν…
ltx/gr_gr_cog/me.m01.d27:meMA.Ode1C22.melody	@ltx/gr_gr_cog/he.h.m8:heHE.AsmaAnapempsomen.name
ltx/gr_gr_cog/me.m01.d27:meMA.Ode1C22.mode	@ltx/gr_gr_cog/miscellanea:misc.Mode8
ltx/gr_gr_cog/me.m01.d27:meMA.Ode1C22.ode	@ltx/gr_gr_cog/miscellanea:misc.Ode1
ltx/gr_gr_cog/me.m01.d27:meMA.Ode1C22.text	Λόγοις κατεποίκιλας χρυσοῖς, τὴν ἱερὰν Χρυσόστομε, τῆς Ἐκκλησίας στολήν, ἣν πρώην ἐξ αἱμάτων, Χριστὸς προεξύφανεν· ὅθεν σου ἐπαξίως, ἑορτάζει ἐπάνοδον θείαν.
ltx/gr_gr_cog/me.m01.d27:meMA.Ode1C23.incipit	Πέτρα ἀνεδείχθης ἀκλινής, καὶ στῦλος…
ltx/gr_gr_cog/me.m01.d27:meMA.Ode1C23.melody	@ltx/gr_gr_cog/he.h.m8:heHE.AsmaAnapempsomen.name
ltx/gr_gr_cog/me.m01.d27:meMA.Ode1C23.mode	@ltx/gr_gr_cog/miscellanea:misc.Mode8
ltx/gr_gr_cog/me.m01.d27:meMA.Ode1C23.ode	@ltx/gr_gr_cog/miscellanea:misc.Ode1
ltx/gr_gr_cog/me.m01.d27:meMA.Ode1C23.text	Πέτρα ἀνεδείχθης ἀκλινής, καὶ στῦλος καὶ ἑδραίωμα, τῆς Ἐκκλησίας Χριστοῦ, τοῦ ἀκρογωνιαίου, ἐν ᾧ ᾠκοδόμησας, λόγους θεοσεβείας, ὥσπερ λίθους σοφὲ Ἱεράρχα.
ltx/gr_gr_cog/me.m01.d27:meMA.Ode1C2T.incipit	Μόνη ἀπειρόγαμε σεμνή, Μαρία ἀειπάρθενε…
ltx/gr_gr_cog/me.m01.d27:meMA.Ode1C2T.melody	@ltx/gr_gr_cog/he.h.m8:heHE.AsmaAnapempsomen.name
ltx/gr_gr_cog/me.m01.d27:meMA.Ode1C2T.mode	@ltx/gr_gr_cog/miscellanea:misc.Mode8
ltx/gr_gr_cog/me.m01.d27:meMA.Ode1C2T.ode	@ltx/gr_gr_cog/miscellanea:misc.Ode1
ltx/gr_gr_cog/me.m01.d27:meMA.Ode1C2T.text	Μόνη ἀπειρόγαμε σεμνή, Μαρία ἀειπάρθενε, Θεοτόκε Κυρία, ἁγνὴ ἐκλελεγμένη, ἐξαίρετε Δέσποινα, πάντων τῶν ποιημάτων, σὲ ἐλπίδα κεκτήμεθα πάντες.
ltx/gr_gr_cog/me.m01.d27:meMA.Ode1C31.greekmelody	@ltx/gr_gr_cog/he.h.m3:heHE.OTaYdata.greekname
ltx/gr_gr_cog/me.m01.d27:meMA.Ode1C31.incipit	Τὸ θεόφθογγον στόμα, τὸ χρυσόφωνον…
ltx/gr_gr_cog/me.m01.d27:meMA.Ode1C31.melody	@ltx/gr_gr_cog/he.h.m3:heHE.OTaYdata.name
ltx/gr_gr_cog/me.m01.d27:meMA.Ode1C31.mode	@ltx/gr_gr_cog/miscellanea:misc.Mode3
ltx/gr_gr_cog/me.m01.d27:meMA.Ode1C31.ode	@ltx/gr_gr_cog/miscellanea:misc.Ode1
ltx/gr_gr_cog/me.m01.d27:meMA.Ode1C31.text	Τὸ θεόφθογγον στόμα, τὸ χρυσόφωνον, ἡ τῶν λόγων λαμπρότης, τὸν ἐμὸν λάμπρυνον, ταῖς ἱκεσίαις σου νοῦν· ὅπως ἀνυμνήσω σου, τῆς ἐπανόδου τὴν μνήμην, Ἰωάννη χάριτος, θείας φερώνυμε.
ltx/gr_gr_cog/me.m01.d27:meMA.Ode1C32.incipit	Ὡς ἀστὴρ ἑωσφόρος, ὡς φαεσίμβροτος…
ltx/gr_gr_cog/me.m01.d27:meMA.Ode1C32.melody	@ltx/gr_gr_cog/he.h.m3:heHE.OTaYdata.name
ltx/gr_gr_cog/me.m01.d27:meMA.Ode1C32.mode	@ltx/gr_gr_cog/miscellanea:misc.Mode3
ltx/gr_gr_cog/me.m01.d27:meMA.Ode1C32.ode	@ltx/gr_gr_cog/miscellanea:misc.Ode1
ltx/gr_gr_cog/me.m01.d27:meMA.Ode1C32.text	Ὡς ἀστὴρ ἑωσφόρος, ὡς φαεσίμβροτος ἥλιος, ὡς φωστὴρ εὐσεβείας, ὑπὸ γῆν Ὅσιε, δύνας δεσμοῖς φυσικοῖς, αὖθις ἐξανέτειλας, ἡμῖν τοῖς τέκνοις σου πέμπων, τῶν θαυμάτων ἄφθονα τὰ σελαγήματα.
ltx/gr_gr_cog/me.m01.d27:meMA.Ode1C33.incipit	Χρυσοῤῥήμονι γλώττῃ, τῶν διδαγμάτων ἐνέπλησας…
ltx/gr_gr_cog/me.m01.d27:meMA.Ode1C33.melody	@ltx/gr_gr_cog/he.h.m3:heHE.OTaYdata.name
ltx/gr_gr_cog/me.m01.d27:meMA.Ode1C33.mode	@ltx/gr_gr_cog/miscellanea:misc.Mode3
ltx/gr_gr_cog/me.m01.d27:meMA.Ode1C33.ode	@ltx/gr_gr_cog/miscellanea:misc.Ode1
ltx/gr_gr_cog/me.m01.d27:meMA.Ode1C33.text	Χρυσοῤῥήμονι γλώττῃ, τῶν διδαγμάτων ἐνέπλησας, τὴν ὑφήλιον πᾶσαν, καὶ χρυσοῖς μέλεσι, τῶν ἰαμάτων αὐγάς, πᾶσιν ἐναπήστραψας, τῶν παθημάτων τὸ σκότος, ἀφανίζων Ὅσιε, τῇ ἐπανόδῳ σου.
ltx/gr_gr_cog/me.m01.d27:meMA.Ode1C3T.incipit	Ῥητορεύων τὰ θεῖα, μοναδικὸν τὴν…
ltx/gr_gr_cog/me.m01.d27:meMA.Ode1C3T.melody	@ltx/gr_gr_cog/he.h.m3:heHE.OTaYdata.name
ltx/gr_gr_cog/me.m01.d27:meMA.Ode1C3T.mode	@ltx/gr_gr_cog/miscellanea:misc.Mode3
ltx/gr_gr_cog/me.m01.d27:meMA.Ode1C3T.ode	@ltx/gr_gr_cog/miscellanea:misc.Ode1
ltx/gr_gr_cog/me.m01.d27:meMA.Ode1C3T.text	Ῥητορεύων τὰ θεῖα, μοναδικὸν τὴν ὑπόστασιν, ὑφηγήσω τὸν Λόγον, κἂν διπλοῦς πέφηνεν, ἐκ τῆς Ἁγνῆς προελθών, σάρκα προσλαβόμενος· ἣν εὐλογοῦμεν ἀπαύστως, καὶ πιστῶς δοξάζομεν θεῖε Χρυσόστομε.
ltx/gr_gr_cog/me.m01.d27:meMA.Ode3C11.greekmelody	@ltx/gr_gr_cog/he.h.m8:heHE.OuraniasApsidos.greekname
ltx/gr_gr_cog/me.m01.d27:meMA.Ode3C11.incipit	Ἰσχυρότατον ὅπλον, χαῖρε πιστῶν Δέσποινα…
ltx/gr_gr_cog/me.m01.d27:meMA.Ode3C11.melody	@ltx/gr_gr_cog/he.h.m8:heHE.OuraniasApsidos.name
ltx/gr_gr_cog/me.m01.d27:meMA.Ode3C11.mode	@ltx/gr_gr_cog/miscellanea:misc.Mode8
ltx/gr_gr_cog/me.m01.d27:meMA.Ode3C11.ode	@ltx/gr_gr_cog/miscellanea:misc.Ode3
ltx/gr_gr_cog/me.m01.d27:meMA.Ode3C11.text	Ἰσχυρότατον ὅπλον, χαῖρε πιστῶν Δέσποινα, χαῖρε κραταιὰ προστασία, χαῖρε ἀντίληψις· χαῖρε βοήθεια, ἁμαρτωλῶν· χαῖρε τεῖχος τῶν προσκαλουμένων σε, χαῖρε τοῦ κόσμου χαρά.
ltx/gr_gr_cog/me.m01.d27:meMA.Ode3C12.incipit	Σωτηρίας ἀνθρώπων, χαῖρε στεῤῥὸν ἔρεισμα…
ltx/gr_gr_cog/me.m01.d27:meMA.Ode3C12.melody	@ltx/gr_gr_cog/he.h.m8:heHE.OuraniasApsidos.name
ltx/gr_gr_cog/me.m01.d27:meMA.Ode3C12.mode	@ltx/gr_gr_cog/miscellanea:misc.Mode8
ltx/gr_gr_cog/me.m01.d27:meMA.Ode3C12.ode	@ltx/gr_gr_cog/miscellanea:misc.Ode3
ltx/gr_gr_cog/me.m01.d27:meMA.Ode3C12.text	Σωτηρίας ἀνθρώπων, χαῖρε στεῤῥὸν ἔρεισμα· χαῖρε τοῦ Ἀδὰμ καὶ τῆς Εὔας ἡ ἐπανάκλησις, διʼ ἧς ἀπέλαβον, τὴν παλαιὰν εὐκληρίαν, χαῖρε ἡ ἀνοίξασα, πάλιν Παράδεισον.
ltx/gr_gr_cog/me.m01.d27:meMA.Ode3C13.incipit	Χαῖρε ἄφλεκτε βάτε, χαῖρε φωτὸς…
ltx/gr_gr_cog/me.m01.d27:meMA.Ode3C13.melody	@ltx/gr_gr_cog/he.h.m8:heHE.OuraniasApsidos.name
ltx/gr_gr_cog/me.m01.d27:meMA.Ode3C13.mode	@ltx/gr_gr_cog/miscellanea:misc.Mode8
ltx/gr_gr_cog/me.m01.d27:meMA.Ode3C13.ode	@ltx/gr_gr_cog/miscellanea:misc.Ode3
ltx/gr_gr_cog/me.m01.d27:meMA.Ode3C13.text	Χαῖρε ἄφλεκτε βάτε, χαῖρε φωτὸς ὄχημα, χαῖρε τοῦ Ἡλίου νεφέλη, χαῖρε περίδοξε, καὶ περιλάλητε, τοῦ Βασιλέως καθέδρα· χαῖρε πόλις ἔμψυχε, Χριστοῦ τοῦ ζῶντος Θεοῦ.
ltx/gr_gr_cog/me.m01.d27:meMA.Ode3C14.incipit	Ἀπειρόγαμε Μῆτερ, χαῖρε ἁγνὴ Δέσποινα…
ltx/gr_gr_cog/me.m01.d27:meMA.Ode3C14.melody	@ltx/gr_gr_cog/he.h.m8:heHE.OuraniasApsidos.name
ltx/gr_gr_cog/me.m01.d27:meMA.Ode3C14.mode	@ltx/gr_gr_cog/miscellanea:misc.Mode8
ltx/gr_gr_cog/me.m01.d27:meMA.Ode3C14.ode	@ltx/gr_gr_cog/miscellanea:misc.Ode3
ltx/gr_gr_cog/me.m01.d27:meMA.Ode3C14.text	Ἀπειρόγαμε Μῆτερ, χαῖρε ἁγνὴ Δέσποινα, χαῖρε ἡ ἀνήροτος χώρα καὶ ἀγεώργητος, ἡ γεωργήσασα, τὸν Γεωργὸν τῶν ἁπάντων, χαῖρε γῆ, ἀλήθειαν ἡ ἀνατείλασα.
ltx/gr_gr_cog/me.m01.d27:meMA.Ode3C1H.greekmelody	@ltx/gr_gr_cog/he.h.m8:heHE.OuraniasApsidos.greekname
ltx/gr_gr_cog/me.m01.d27:meMA.Ode3C1H.incipit	@ltx/gr_gr_cog/he.h.m8:heHE.OuraniasApsidos.incipit
ltx/gr_gr_cog/me.m01.d27:meMA.Ode3C1H.melody	@ltx/gr_gr_cog/he.h.m8:heHE.OuraniasApsidos.melody
ltx/gr_gr_cog/me.m01.d27:meMA.Ode3C1H.mode	@ltx/gr_gr_cog/miscellanea:misc.Mode8
ltx/gr_gr_cog/me.m01.d27:meMA.Ode3C1H.ode	@ltx/gr_gr_cog/miscellanea:misc.Ode3
ltx/gr_gr_cog/me.m01.d27:meMA.Ode3C1H.text	@ltx/gr_gr_cog/he.h.m8:heHE.OuraniasApsidos.text
ltx/gr_gr_cog/me.m01.d27:meMA.Ode3C21.greekmelody	@ltx/gr_gr_cog/he.h.m8:heHE.OukEstinAgios.greekname
ltx/gr_gr_cog/me.m01.d27:meMA.Ode3C21.incipit	Χρυσέοις διδάγμασι, κατεχρύσωσας σοφέ, τῆς…
ltx/gr_gr_cog/me.m01.d27:meMA.Ode3C21.melody	@ltx/gr_gr_cog/he.h.m8:heHE.OukEstinAgios.name
ltx/gr_gr_cog/me.m01.d27:meMA.Ode3C21.mode	@ltx/gr_gr_cog/miscellanea:misc.Mode8
ltx/gr_gr_cog/me.m01.d27:meMA.Ode3C21.ode	@ltx/gr_gr_cog/miscellanea:misc.Ode3
ltx/gr_gr_cog/me.m01.d27:meMA.Ode3C21.text	Χρυσέοις διδάγμασι, κατεχρύσωσας σοφέ, τῆς Ἐκκλησίας τὸν στέφανον, καὶ ταύτης ἐποίκιλας, τὴν εὐπρέπειαν Πάτερ, τῷ κάλλει τῶν λόγων σου· διό σε κατʼ ἀξίαν τιμᾷ.
ltx/gr_gr_cog/me.m01.d27:meMA.Ode3C22.incipit	Μυρίζουσιν Ὅσιε, ὥς περ κρίνα…
ltx/gr_gr_cog/me.m01.d27:meMA.Ode3C22.melody	@ltx/gr_gr_cog/he.h.m8:heHE.OukEstinAgios.name
ltx/gr_gr_cog/me.m01.d27:meMA.Ode3C22.mode	@ltx/gr_gr_cog/miscellanea:misc.Mode8
ltx/gr_gr_cog/me.m01.d27:meMA.Ode3C22.ode	@ltx/gr_gr_cog/miscellanea:misc.Ode3
ltx/gr_gr_cog/me.m01.d27:meMA.Ode3C22.text	Μυρίζουσιν Ὅσιε, ὥς περ κρίνα τοῦ ἀγροῦ, οἱ ἀτμοὶ τῶν καμάτων σου, διʼ ὦν εὐηρέστησας, τῷ Θεῷ Ἱεράρχα, κινδύνοις καὶ θλίψεσι, καὶ γῇ προσομιλήσας μακρᾷ.
ltx/gr_gr_cog/me.m01.d27:meMA.Ode3C23.incipit	Ὡς ἄνθη μυρίζουσιν, οἱ τῶν…
ltx/gr_gr_cog/me.m01.d27:meMA.Ode3C23.melody	@ltx/gr_gr_cog/he.h.m8:heHE.OukEstinAgios.name
ltx/gr_gr_cog/me.m01.d27:meMA.Ode3C23.mode	@ltx/gr_gr_cog/miscellanea:misc.Mode8
ltx/gr_gr_cog/me.m01.d27:meMA.Ode3C23.ode	@ltx/gr_gr_cog/miscellanea:misc.Ode3
ltx/gr_gr_cog/me.m01.d27:meMA.Ode3C23.text	Ὡς ἄνθη μυρίζουσιν, οἱ τῶν λόγων σου καρποί, νοητῶς ἀποστάζοντες, τὸν θεῖον Χρυσόστομε, γλυκασμὸν τῆς σοφίας, καὶ νῦν εὐωδιάζοντες, ἡμᾶς ταῖς πρακτικαῖς ἀρεταῖς.
ltx/gr_gr_cog/me.m01.d27:meMA.Ode3C2T.incipit	Ἀμέριστος ἔμεινας, εἰ καὶ σάρκα…
ltx/gr_gr_cog/me.m01.d27:meMA.Ode3C2T.melody	@ltx/gr_gr_cog/he.h.m8:heHE.OukEstinAgios.name
ltx/gr_gr_cog/me.m01.d27:meMA.Ode3C2T.mode	@ltx/gr_gr_cog/miscellanea:misc.Mode8
ltx/gr_gr_cog/me.m01.d27:meMA.Ode3C2T.ode	@ltx/gr_gr_cog/miscellanea:misc.Ode3
ltx/gr_gr_cog/me.m01.d27:meMA.Ode3C2T.text	Ἀμέριστος ἔμεινας, εἰ καὶ σάρκα διʼ ἐμέ, ἐκ Παρθένου ἐφόρεσας· διὸ καὶ ἐν δύω σε, προσκυνῶ ταῖς οὐσίαις, καὶ δύω θελήσεσι, καὶ δύω ἐνεργείαις Χριστέ.
ltx/gr_gr_cog/me.m01.d27:meMA.Ode3C31.greekmelody	@ltx/gr_gr_cog/he.h.m3:heHE.OEkMiOnton.greekname
ltx/gr_gr_cog/me.m01.d27:meMA.Ode3C31.incipit	Ὑπερορίας ὑπέκρυψέ σε μυχοῖς, τὸν…
ltx/gr_gr_cog/me.m01.d27:meMA.Ode3C31.melody	@ltx/gr_gr_cog/he.h.m3:heHE.OEkMiOnton.name
ltx/gr_gr_cog/me.m01.d27:meMA.Ode3C31.mode	@ltx/gr_gr_cog/miscellanea:misc.Mode3
ltx/gr_gr_cog/me.m01.d27:meMA.Ode3C31.ode	@ltx/gr_gr_cog/miscellanea:misc.Ode3
ltx/gr_gr_cog/me.m01.d27:meMA.Ode3C31.text	Ὑπερορίας ὑπέκρυψέ σε μυχοῖς, τὸν λύχνον τὸν πάμφωτον, Βασιλὶς ἡ τυφλώττουσα· Χριστὸς δʼ ὑψηλότερον, ἐν τῇ λυχνίᾳ, καὶ πάλιν ἐπανάγει.
ltx/gr_gr_cog/me.m01.d27:meMA.Ode3C32.incipit	Σταλάζων ῥεῖθρα θαυμάτων καὶ ποταμούς…
ltx/gr_gr_cog/me.m01.d27:meMA.Ode3C32.melody	@ltx/gr_gr_cog/he.h.m3:heHE.OEkMiOnton.name
ltx/gr_gr_cog/me.m01.d27:meMA.Ode3C32.mode	@ltx/gr_gr_cog/miscellanea:misc.Mode3
ltx/gr_gr_cog/me.m01.d27:meMA.Ode3C32.ode	@ltx/gr_gr_cog/miscellanea:misc.Ode3
ltx/gr_gr_cog/me.m01.d27:meMA.Ode3C32.text	Σταλάζων ῥεῖθρα θαυμάτων καὶ ποταμούς, προχέων ἰάσεων, ἐπανῆλθες Χρυσόστομε, τοῖς πιστῶς τιμῶσί σου, τῆς ἐπανόδου τὴν μνήμην Ἰωάννη.
ltx/gr_gr_cog/me.m01.d27:meMA.Ode3C33.incipit	Ὁ χρυσοῤῥόας Νεῖλος ὁ πλημμυρῶν…
ltx/gr_gr_cog/me.m01.d27:meMA.Ode3C33.melody	@ltx/gr_gr_cog/he.h.m3:heHE.OEkMiOnton.name
ltx/gr_gr_cog/me.m01.d27:meMA.Ode3C33.mode	@ltx/gr_gr_cog/miscellanea:misc.Mode3
ltx/gr_gr_cog/me.m01.d27:meMA.Ode3C33.ode	@ltx/gr_gr_cog/miscellanea:misc.Ode3
ltx/gr_gr_cog/me.m01.d27:meMA.Ode3C33.text	Ὁ χρυσοῤῥόας Νεῖλος ὁ πλημμυρῶν, ἐν λόγοις ἐν θαύμασιν, ἐπανῆκε, συνδράμωμεν, πιστῶς ἀπαντλήσωμεν, ἀφθόνως πάντες ἐν πᾶσι κορεσθῶμεν.
ltx/gr_gr_cog/me.m01.d27:meMA.Ode3C3T.incipit	Γεώδης φύσις οὐ σθένει σε…
ltx/gr_gr_cog/me.m01.d27:meMA.Ode3C3T.melody	@ltx/gr_gr_cog/he.h.m3:heHE.OEkMiOnton.name
ltx/gr_gr_cog/me.m01.d27:meMA.Ode3C3T.mode	@ltx/gr_gr_cog/miscellanea:misc.Mode3
ltx/gr_gr_cog/me.m01.d27:meMA.Ode3C3T.ode	@ltx/gr_gr_cog/miscellanea:misc.Ode3
ltx/gr_gr_cog/me.m01.d27:meMA.Ode3C3T.text	Γεώδης φύσις οὐ σθένει σε ἀνυμνεῖν, ἣν Ἄγγελοι μέλπουσιν, ὡς Θεὸν σωματώσασαν· πλὴν πιστῶς οἱ δοῦλοί σου, ἀποτολμῶμεν ὑμνεῖν σε καὶ δοξάζειν.
ltx/gr_gr_cog/me.m01.d27:meMA.Ode3Kathisma1.greekmelody	@ltx/gr_gr_cog/he.a.m8:heAU.TinSofianKaiLogon.greekname
ltx/gr_gr_cog/me.m01.d27:meMA.Ode3Kathisma1.incipit	Τὴν σοφίαν ἐξ ὕψους καταμαθών…
ltx/gr_gr_cog/me.m01.d27:meMA.Ode3Kathisma1.melody	@ltx/gr_gr_cog/he.a.m8:heAU.TinSofianKaiLogon.name
ltx/gr_gr_cog/me.m01.d27:meMA.Ode3Kathisma1.mode	@ltx/gr_gr_cog/miscellanea:misc.Mode8
ltx/gr_gr_cog/me.m01.d27:meMA.Ode3Kathisma1.text	Τὴν σοφίαν ἐξ ὕψους καταμαθών, καὶ τὴν χάριν τῶν λόγων παρὰ Θεοῦ, τοῖς πᾶσιν ἐξέλαμψας, ὡς χρυσὸς ἐν καμίνῳ, καὶ τὴν Ἁγίαν Τριάδα, Μονάδα ἐκήρυξας, τὴν φιλάργυρον πλάνην, τοξεύσας τοῖς λόγοις σου· ὅθεν καὶ πρὸς ζῆλον, βασιλίδα ἐλέγξας, ἀδίκως τῆς ποίμνης σου, ἀπελάθης Μακάριε, Ἰωάννη Χρυσόστομε, πρέσβευε Χριστῷ τῷ Θεῷ, τῶν πταισμάτων ἄφεσιν δωρήσασθαι, τοῖς ἑορτάζουσι πόθω, τὴν ἁγίαν μνήμην σου.
ltx/gr_gr_cog/me.m01.d27:meMA.Ode3KathismaT.incipit	Τῆς Τριάδος τὸν ἕνα ὑπερφυῶς…
ltx/gr_gr_cog/me.m01.d27:meMA.Ode3KathismaT.melody	@ltx/gr_gr_cog/he.a.m8:heAU.TinSofianKaiLogon.name
ltx/gr_gr_cog/me.m01.d27:meMA.Ode3KathismaT.mode	@ltx/gr_gr_cog/miscellanea:misc.Mode8
ltx/gr_gr_cog/me.m01.d27:meMA.Ode3KathismaT.text	Τῆς Τριάδος τὸν ἕνα ὑπερφυῶς, συλλαβοῦσα Παρθένε καὶ θαυμαστῶς, τοῦτον ἀπεκύησας, ὑπὲρ λόγον καὶ ἔννοιαν, καὶ κοινωνὸν τῆς θείας, κατέστησας φύσεως, τὴν τῶν ἀνθρώπων φύσιν, τὴν πάλαι ἐξόριστον· ὅθεν συνελθόντες, οἱ τῷ τόκῳ σου πάντες, σωθέντες, Πανάμωμε, τοῖς σοῖς λόγοις ἑπόμενοι, χρεωστικῶς σε μακαρίζομεν, αἰτούμενοι Χριστὸν τὸν Θεόν, τῶν πταισμάτων ἄφεσιν δωρήσασθαι, τοῖς σὲ δοξάζουσι πίστει, ὡς Μητέρα αὐτοῦ.
ltx/gr_gr_cog/me.m01.d27:meMA.Ode4C11.greekmelody	@ltx/gr_gr_cog/he.h.m8:heHE.SyMouIschys.greekname
ltx/gr_gr_cog/me.m01.d27:meMA.Ode4C11.incipit	Ἀνατολή, τοῦ Πατρικοῦ ἀπαυγάσματος, καὶ…
ltx/gr_gr_cog/me.m01.d27:meMA.Ode4C11.melody	@ltx/gr_gr_cog/he.h.m8:heHE.SyMouIschys.name
ltx/gr_gr_cog/me.m01.d27:meMA.Ode4C11.mode	@ltx/gr_gr_cog/miscellanea:misc.Mode8
ltx/gr_gr_cog/me.m01.d27:meMA.Ode4C11.ode	@ltx/gr_gr_cog/miscellanea:misc.Ode4
ltx/gr_gr_cog/me.m01.d27:meMA.Ode4C11.text	Ἀνατολή, τοῦ Πατρικοῦ ἀπαυγάσματος, καὶ Ἠλίου, τοῦ ἐξανατείλαντος, πρὸ Ἑωσφόρου ἐκ τοῦ Πατρός, χαῖρε Θεοτόκε, νεφέλη κούφη καὶ ἔμψυχε· Παρθένε χαῖρε Μήτηρ, χαῖρε εὐλογημένη· χαῖρε δεδοξασμένη Πανάμωμε.
ltx/gr_gr_cog/me.m01.d27:meMA.Ode4C12.incipit	Σὺ τὸ χρυσοῦν, θυμιατήριον Δέσποινα…
ltx/gr_gr_cog/me.m01.d27:meMA.Ode4C12.melody	@ltx/gr_gr_cog/he.h.m8:heHE.SyMouIschys.name
ltx/gr_gr_cog/me.m01.d27:meMA.Ode4C12.mode	@ltx/gr_gr_cog/miscellanea:misc.Mode8
ltx/gr_gr_cog/me.m01.d27:meMA.Ode4C12.ode	@ltx/gr_gr_cog/miscellanea:misc.Ode4
ltx/gr_gr_cog/me.m01.d27:meMA.Ode4C12.text	Σὺ τὸ χρυσοῦν, θυμιατήριον Δέσποινα, τοῦ ἀστέκτου, καὶ ἀΰλου ἄνθρακος, ἐν ᾧ ἐκαύθη διαῤῥαγέν, τῆς ἀδαμιαίας, παρακοῆς τὸ χειρόγραφον· διό σοι χαῖρε κράζω, δι’ ἧς πάσιν ἐδόθη, ἡ χαρὰ καὶ τρυφὴ καὶ ἀπόλαυσις.
ltx/gr_gr_cog/me.m01.d27:meMA.Ode4C13.incipit	Σὺ τῶν βροτῶν, δόξα καὶ…
ltx/gr_gr_cog/me.m01.d27:meMA.Ode4C13.melody	@ltx/gr_gr_cog/he.h.m8:heHE.SyMouIschys.name
ltx/gr_gr_cog/me.m01.d27:meMA.Ode4C13.mode	@ltx/gr_gr_cog/miscellanea:misc.Mode8
ltx/gr_gr_cog/me.m01.d27:meMA.Ode4C13.ode	@ltx/gr_gr_cog/miscellanea:misc.Ode4
ltx/gr_gr_cog/me.m01.d27:meMA.Ode4C13.text	Σὺ τῶν βροτῶν, δόξα καὶ κλέος καὶ καύχημα, καὶ Ἀγγέλων, στέφος καὶ διάδημα· διὸ ἡ γῆ, καὶ ὁ οὐρανός, μίαν Ἐκκλησίαν, στησάμενοι παναρμόνιον, τό, Χαῖρέ σοι βοῶμεν· χαῖρε Δέσποινα κόσμου, χαῖρε πάντων ἀνθρώπων βοήθεια.
ltx/gr_gr_cog/me.m01.d27:meMA.Ode4C14.incipit	Κλίνη σεπτή, ἣν Σολομὼν προδιέγραψε…
ltx/gr_gr_cog/me.m01.d27:meMA.Ode4C14.melody	@ltx/gr_gr_cog/he.h.m8:heHE.SyMouIschys.name
ltx/gr_gr_cog/me.m01.d27:meMA.Ode4C14.mode	@ltx/gr_gr_cog/miscellanea:misc.Mode8
ltx/gr_gr_cog/me.m01.d27:meMA.Ode4C14.ode	@ltx/gr_gr_cog/miscellanea:misc.Ode4
ltx/gr_gr_cog/me.m01.d27:meMA.Ode4C14.text	Κλίνη σεπτή, ἣν Σολομὼν προδιέγραψε, κυκλουμένην, δυνατοῖς ἑξήκοντα, χαῖρε Παρθένε ἡ κεχρυσωμένη, τοῦ νοητοῦ ἁγιάσματος, λαβὶς ἡ θεία χαῖρε· χαῖρε βάτε πυρφόρε, χαῖρε πύλη καὶ κλῖμαξ καὶ γέφυρα.
ltx/gr_gr_cog/me.m01.d27:meMA.Ode4C1H.greekmelody	@ltx/gr_gr_cog/he.h.m8:heHE.SyMouIschys.greekname
ltx/gr_gr_cog/me.m01.d27:meMA.Ode4C1H.incipit	@ltx/gr_gr_cog/he.h.m8:heHE.SyMouIschys.incipit
ltx/gr_gr_cog/me.m01.d27:meMA.Ode4C1H.melody	@ltx/gr_gr_cog/he.h.m8:heHE.SyMouIschys.melody
ltx/gr_gr_cog/me.m01.d27:meMA.Ode4C1H.mode	@ltx/gr_gr_cog/miscellanea:misc.Mode8
ltx/gr_gr_cog/me.m01.d27:meMA.Ode4C1H.ode	@ltx/gr_gr_cog/miscellanea:misc.Ode4
ltx/gr_gr_cog/me.m01.d27:meMA.Ode4C1H.text	@ltx/gr_gr_cog/he.h.m8:heHE.SyMouIschys.text
ltx/gr_gr_cog/me.m01.d27:meMA.Ode4C21.greekmelody	@ltx/gr_gr_cog/he.h.m8:heHE.ExOrousKataskiou.greekname
ltx/gr_gr_cog/me.m01.d27:meMA.Ode4C21.incipit	Νέος Ἀβραάμ, ἐδείχθης Ἱεράρχα, ἄλλον…
ltx/gr_gr_cog/me.m01.d27:meMA.Ode4C21.melody	@ltx/gr_gr_cog/he.h.m8:heHE.ExOrousKataskiou.name
ltx/gr_gr_cog/me.m01.d27:meMA.Ode4C21.mode	@ltx/gr_gr_cog/miscellanea:misc.Mode8
ltx/gr_gr_cog/me.m01.d27:meMA.Ode4C21.ode	@ltx/gr_gr_cog/miscellanea:misc.Ode4
ltx/gr_gr_cog/me.m01.d27:meMA.Ode4C21.text	Νέος Ἀβραάμ, ἐδείχθης Ἱεράρχα, ἄλλον Ἰσαάκ, τὸν βίον θυσιάσας, καὶ μυστικὴν ὁλοκάρπωσιν ἀνενέγκας, ἐν τῷ πυρὶ τῆς συνειδήσεως.
ltx/gr_gr_cog/me.m01.d27:meMA.Ode4C22.incipit	Σὺ τὸν Ἰακώβ, ζηλώσας θεοφόρε…
ltx/gr_gr_cog/me.m01.d27:meMA.Ode4C22.melody	@ltx/gr_gr_cog/he.h.m8:heHE.ExOrousKataskiou.name
ltx/gr_gr_cog/me.m01.d27:meMA.Ode4C22.mode	@ltx/gr_gr_cog/miscellanea:misc.Mode8
ltx/gr_gr_cog/me.m01.d27:meMA.Ode4C22.ode	@ltx/gr_gr_cog/miscellanea:misc.Ode4
ltx/gr_gr_cog/me.m01.d27:meMA.Ode4C22.text	Σὺ τὸν Ἰακώβ, ζηλώσας θεοφόρε, κλῖμαξ πρακτικῆς, ἐδείχθης πολιτείας, τὰς ἀναβάσεις τῶν θείων σου νοημάτων, ἐν τῇ καρδία σου τιθέμενος.
ltx/gr_gr_cog/me.m01.d27:meMA.Ode4C23.incipit	Ῥάβδῳ μυστικῇ, τῇ γλώττῃ διασχίσας…
ltx/gr_gr_cog/me.m01.d27:meMA.Ode4C23.melody	@ltx/gr_gr_cog/he.h.m8:heHE.ExOrousKataskiou.name
ltx/gr_gr_cog/me.m01.d27:meMA.Ode4C23.mode	@ltx/gr_gr_cog/miscellanea:misc.Mode8
ltx/gr_gr_cog/me.m01.d27:meMA.Ode4C23.ode	@ltx/gr_gr_cog/miscellanea:misc.Ode4
ltx/gr_gr_cog/me.m01.d27:meMA.Ode4C23.text	Ῥάβδῳ μυστικῇ, τῇ γλώττῃ διασχίσας, ὅλην τῆς Γραφῆς, τὴν ἄβυσσον Τρισμάκαρ, ὡς Μωϋσῆς διεβίβασας τοὺς ἀνθρώπους, πρὸς τὴν ἐπίγνωσιν τῆς πίστεως.
ltx/gr_gr_cog/me.m01.d27:meMA.Ode4C2T.incipit	Χαῖρε θησαυρέ, τῆς πάντων σωτηρίας…
ltx/gr_gr_cog/me.m01.d27:meMA.Ode4C2T.melody	@ltx/gr_gr_cog/he.h.m8:heHE.ExOrousKataskiou.name
ltx/gr_gr_cog/me.m01.d27:meMA.Ode4C2T.mode	@ltx/gr_gr_cog/miscellanea:misc.Mode8
ltx/gr_gr_cog/me.m01.d27:meMA.Ode4C2T.ode	@ltx/gr_gr_cog/miscellanea:misc.Ode4
ltx/gr_gr_cog/me.m01.d27:meMA.Ode4C2T.text	Χαῖρε θησαυρέ, τῆς πάντων σωτηρίας, χαῖρε νοερά, πηγὴ τῶν ἰαμάτων· χαῖρε τὸ ἅγιον ὄρος, ὃ ὁ Προφήτης, Θεογεννῆτορ προεώρακεν.
ltx/gr_gr_cog/me.m01.d27:meMA.Ode4C31.greekmelody	@ltx/gr_gr_cog/he.h.m3:heHE.EthouProsImas.greekname
ltx/gr_gr_cog/me.m01.d27:meMA.Ode4C31.incipit	Λόγων ἐρασταί, τὸν τῶν λόγων…
ltx/gr_gr_cog/me.m01.d27:meMA.Ode4C31.melody	@ltx/gr_gr_cog/he.h.m3:heHE.EthouProsImas.name
ltx/gr_gr_cog/me.m01.d27:meMA.Ode4C31.mode	@ltx/gr_gr_cog/miscellanea:misc.Mode3
ltx/gr_gr_cog/me.m01.d27:meMA.Ode4C31.ode	@ltx/gr_gr_cog/miscellanea:misc.Ode4
ltx/gr_gr_cog/me.m01.d27:meMA.Ode4C31.text	Λόγων ἐρασταί, τὸν τῶν λόγων μέγαν Κοσμήτορα, λόγοις ἱεροῖς χαρμονικῶς, ἐπανιόντα δεῦτε τιμήσωμεν, λόγους ματαιόφρονας, σοφίᾳ λόγων λήρους ἀπελέγξαντα.
ltx/gr_gr_cog/me.m01.d27:meMA.Ode4C32.incipit	Ὤλβισας ἡμᾶς, διδαγμάτων πλούτῳ Χρυσόστομε…
ltx/gr_gr_cog/me.m01.d27:meMA.Ode4C32.melody	@ltx/gr_gr_cog/he.h.m3:heHE.EthouProsImas.name
ltx/gr_gr_cog/me.m01.d27:meMA.Ode4C32.mode	@ltx/gr_gr_cog/miscellanea:misc.Mode3
ltx/gr_gr_cog/me.m01.d27:meMA.Ode4C32.ode	@ltx/gr_gr_cog/miscellanea:misc.Ode4
ltx/gr_gr_cog/me.m01.d27:meMA.Ode4C32.text	Ὤλβισας ἡμᾶς, διδαγμάτων πλούτῳ Χρυσόστομε· χεῖρα δʼ ἀναστέλλεις ἐμβριθῶς, πλεονεξίας πλούτῳ τὴν βρίθουσαν, ἐλέγχων τρανότατα, καὶ κατὰ νόμον, πλούτῳ θείας χάριτος.
ltx/gr_gr_cog/me.m01.d27:meMA.Ode4C33.incipit	Τόξον δυνατῶν, ἰταμότης τύραννος τέθλασται…
ltx/gr_gr_cog/me.m01.d27:meMA.Ode4C33.melody	@ltx/gr_gr_cog/he.h.m3:heHE.EthouProsImas.name
ltx/gr_gr_cog/me.m01.d27:meMA.Ode4C33.mode	@ltx/gr_gr_cog/miscellanea:misc.Mode3
ltx/gr_gr_cog/me.m01.d27:meMA.Ode4C33.ode	@ltx/gr_gr_cog/miscellanea:misc.Ode4
ltx/gr_gr_cog/me.m01.d27:meMA.Ode4C33.text	Τόξον δυνατῶν, ἰταμότης τύραννος τέθλασται· σὺ δʼ ἐν ἀσθενείᾳ τῆς σαρκός, ἀγγελικῶς βιοὺς ὑπερίσχυσας, ἱκέτας Χρυσόστομε, τοὺς πρὶν διώκτας, ἔχων ἱερώτατε.
ltx/gr_gr_cog/me.m01.d27:meMA.Ode4C3T.incipit	Τάξεις νοεραί, ὑμνῳδίαις Κόρη σὲ…
ltx/gr_gr_cog/me.m01.d27:meMA.Ode4C3T.melody	@ltx/gr_gr_cog/he.h.m3:heHE.EthouProsImas.name
ltx/gr_gr_cog/me.m01.d27:meMA.Ode4C3T.mode	@ltx/gr_gr_cog/miscellanea:misc.Mode3
ltx/gr_gr_cog/me.m01.d27:meMA.Ode4C3T.ode	@ltx/gr_gr_cog/miscellanea:misc.Ode4
ltx/gr_gr_cog/me.m01.d27:meMA.Ode4C3T.text	Τάξεις νοεραί, ὑμνῳδίαις Κόρη σὲ μέλπουσιν· ὃν γὰρ οὐκ ἰσχύουσιν ὁρᾶν, ἐκ τῆς ἁγνῆς νηδύος σου τέτοκας, σάρκα προσλαβόμενον, ἀναλλοιώτως, πάναγνε Θεόνυμφε.
ltx/gr_gr_cog/me.m01.d27:meMA.Ode5C11.greekmelody	@ltx/gr_gr_cog/he.h.m8:heHE.InaTiMeAposo.greekname
ltx/gr_gr_cog/me.m01.d27:meMA.Ode5C11.incipit	Νοερὰν σατραπείαν, καὶ τυραννικὴν ἐναέριον…
ltx/gr_gr_cog/me.m01.d27:meMA.Ode5C11.melody	@ltx/gr_gr_cog/he.h.m8:heHE.InaTiMeAposo.name
ltx/gr_gr_cog/me.m01.d27:meMA.Ode5C11.mode	@ltx/gr_gr_cog/miscellanea:misc.Mode8
ltx/gr_gr_cog/me.m01.d27:meMA.Ode5C11.ode	@ltx/gr_gr_cog/miscellanea:misc.Ode5
ltx/gr_gr_cog/me.m01.d27:meMA.Ode5C11.text	Νοερὰν σατραπείαν, καὶ τυραννικὴν ἐναέριον φάλαγγα, παρελθεῖν ἀλύπως, ἐν καιρῷ τῆς ἐξόδου μου πάρεχε, ἵνα σοι τό, Χαῖρε, χαρμονικῶς, Δέσποινα κράζω· Χαῖρε πάντων ἐλπὶς ἀκαταίσχυντε.
ltx/gr_gr_cog/me.m01.d27:meMA.Ode5C12.incipit	Ὡς χαρὰν συλλαβοῦσα, χαῖρε ὑπεράμωμε…
ltx/gr_gr_cog/me.m01.d27:meMA.Ode5C12.melody	@ltx/gr_gr_cog/he.h.m8:heHE.InaTiMeAposo.name
ltx/gr_gr_cog/me.m01.d27:meMA.Ode5C12.mode	@ltx/gr_gr_cog/miscellanea:misc.Mode8
ltx/gr_gr_cog/me.m01.d27:meMA.Ode5C12.ode	@ltx/gr_gr_cog/miscellanea:misc.Ode5
ltx/gr_gr_cog/me.m01.d27:meMA.Ode5C12.text	Ὡς χαρὰν συλλαβοῦσα, χαῖρε ὑπεράμωμε· χαῖρε ὑπέραγνε, χαῖρε τῆς Ἁγνείας, πορφυρόχρουν ἄνθος ἡδύπνοον, χαῖρε παρθενίας, κακκοβαφὲς ἐρυθρὸν ῥόδον, καὶ Θεοῦ τὸ εὐῶδες ὀσφράδιον.
ltx/gr_gr_cog/me.m01.d27:meMA.Ode5C13.incipit	Μυστικὴ μυροθήκη, χαῖρε τὸ ἡδύπνοον…
ltx/gr_gr_cog/me.m01.d27:meMA.Ode5C13.melody	@ltx/gr_gr_cog/he.h.m8:heHE.InaTiMeAposo.name
ltx/gr_gr_cog/me.m01.d27:meMA.Ode5C13.mode	@ltx/gr_gr_cog/miscellanea:misc.Mode8
ltx/gr_gr_cog/me.m01.d27:meMA.Ode5C13.ode	@ltx/gr_gr_cog/miscellanea:misc.Ode5
ltx/gr_gr_cog/me.m01.d27:meMA.Ode5C13.text	Μυστικὴ μυροθήκη, χαῖρε τὸ ἡδύπνοον μύρον ἡ βρύουσα· χαῖρε θεία κρήνη, ἡ τὸ ὕδωρ τὸ ζῶν ἀναβλύζουσα, χαῖρε ἡ τὸν βότρυν, τὸν τῆς ζωῆς καρποφοροῦσα, ἀγεώργητος ἄμπελος Δέσποινα.
ltx/gr_gr_cog/me.m01.d27:meMA.Ode5C14.incipit	Ἀδιόδευτε πύλη, χαῖρε ἣν διώδευσε…
ltx/gr_gr_cog/me.m01.d27:meMA.Ode5C14.melody	@ltx/gr_gr_cog/he.h.m8:heHE.InaTiMeAposo.name
ltx/gr_gr_cog/me.m01.d27:meMA.Ode5C14.mode	@ltx/gr_gr_cog/miscellanea:misc.Mode8
ltx/gr_gr_cog/me.m01.d27:meMA.Ode5C14.ode	@ltx/gr_gr_cog/miscellanea:misc.Ode5
ltx/gr_gr_cog/me.m01.d27:meMA.Ode5C14.text	Ἀδιόδευτε πύλη, χαῖρε ἣν διώδευσε Χριστὸς ὁ Κύριος· Παραδείσου πύλας, ἡ ἀνοίξασα χαῖρε τῷ τόκῳ σου, χαῖρε διʼ ἧς χαίρει, ὁ οὐρανὸς καὶ γῆ χορεύει, καὶ τὰ ἄνω τοῖς κάτω συνάπτονται.
ltx/gr_gr_cog/me.m01.d27:meMA.Ode5C1H.greekmelody	@ltx/gr_gr_cog/he.h.m8:heHE.InaTiMeAposo.greekname
ltx/gr_gr_cog/me.m01.d27:meMA.Ode5C1H.incipit	@ltx/gr_gr_cog/he.h.m8:heHE.InaTiMeAposo.incipit
ltx/gr_gr_cog/me.m01.d27:meMA.Ode5C1H.melody	@ltx/gr_gr_cog/he.h.m8:heHE.InaTiMeAposo.melody
ltx/gr_gr_cog/me.m01.d27:meMA.Ode5C1H.mode	@ltx/gr_gr_cog/miscellanea:misc.Mode8
ltx/gr_gr_cog/me.m01.d27:meMA.Ode5C1H.ode	@ltx/gr_gr_cog/miscellanea:misc.Ode5
ltx/gr_gr_cog/me.m01.d27:meMA.Ode5C1H.text	@ltx/gr_gr_cog/he.h.m8:heHE.InaTiMeAposo.text
ltx/gr_gr_cog/me.m01.d27:meMA.Ode5C21.greekmelody	@ltx/gr_gr_cog/he.h.m8:heHE.OEkNyktosAgnoias.greekname
ltx/gr_gr_cog/me.m01.d27:meMA.Ode5C21.incipit	Τὴν ἱερὰν στολήν σου, κατακοσμήσας…
ltx/gr_gr_cog/me.m01.d27:meMA.Ode5C21.melody	@ltx/gr_gr_cog/he.h.m8:heHE.OEkNyktosAgnoias.name
ltx/gr_gr_cog/me.m01.d27:meMA.Ode5C21.mode	@ltx/gr_gr_cog/miscellanea:misc.Mode8
ltx/gr_gr_cog/me.m01.d27:meMA.Ode5C21.ode	@ltx/gr_gr_cog/miscellanea:misc.Ode5
ltx/gr_gr_cog/me.m01.d27:meMA.Ode5C21.text	Τὴν ἱερὰν στολήν σου, κατακοσμήσας τοῖς ἄθλοις τῶν πόνων σου, ἔδειξας λαμπροτέραν, τὴν Ἱεραρχίαν Χρυσόστομε.
ltx/gr_gr_cog/me.m01.d27:meMA.Ode5C22.incipit	Ἀθλητικὸν ἀγῶνα, ἱερομύστα γενναίως διήνυσας…
ltx/gr_gr_cog/me.m01.d27:meMA.Ode5C22.melody	@ltx/gr_gr_cog/he.h.m8:heHE.OEkNyktosAgnoias.name
ltx/gr_gr_cog/me.m01.d27:meMA.Ode5C22.mode	@ltx/gr_gr_cog/miscellanea:misc.Mode8
ltx/gr_gr_cog/me.m01.d27:meMA.Ode5C22.ode	@ltx/gr_gr_cog/miscellanea:misc.Ode5
ltx/gr_gr_cog/me.m01.d27:meMA.Ode5C22.text	Ἀθλητικὸν ἀγῶνα, ἱερομύστα γενναίως διήνυσας, πόλεσιν ἀοικήτοις, καὶ ὑπερορίαις στελλόμενος.
ltx/gr_gr_cog/me.m01.d27:meMA.Ode5C23.incipit	Τῇ ἀστραπῇ τῶν λόγων, τὴν…
ltx/gr_gr_cog/me.m01.d27:meMA.Ode5C23.melody	@ltx/gr_gr_cog/he.h.m8:heHE.OEkNyktosAgnoias.name
ltx/gr_gr_cog/me.m01.d27:meMA.Ode5C23.mode	@ltx/gr_gr_cog/miscellanea:misc.Mode8
ltx/gr_gr_cog/me.m01.d27:meMA.Ode5C23.ode	@ltx/gr_gr_cog/miscellanea:misc.Ode5
ltx/gr_gr_cog/me.m01.d27:meMA.Ode5C23.text	Τῇ ἀστραπῇ τῶν λόγων, τὴν ὑπερκόσμιον γνῶσιν ἑβρόντησας, Μύστα τῶν ἀποῤῥήτων, ὑετοὺς δογμάτων ὀμβρήσας ἡμῖν.
ltx/gr_gr_cog/me.m01.d27:meMA.Ode5C2T.incipit	Ἄνευ φθορᾶς τεκοῦσα, Θεογεννῆτορ τὸν…
ltx/gr_gr_cog/me.m01.d27:meMA.Ode5C2T.melody	@ltx/gr_gr_cog/he.h.m8:heHE.OEkNyktosAgnoias.name
ltx/gr_gr_cog/me.m01.d27:meMA.Ode5C2T.mode	@ltx/gr_gr_cog/miscellanea:misc.Mode8
ltx/gr_gr_cog/me.m01.d27:meMA.Ode5C2T.ode	@ltx/gr_gr_cog/miscellanea:misc.Ode5
ltx/gr_gr_cog/me.m01.d27:meMA.Ode5C2T.text	Ἄνευ φθορᾶς τεκοῦσα, Θεογεννῆτορ τὸν ἄσπορον τόκον σου, μόνη ὤφθης Παρθένος, βρέφος ὑπομάζιον φέρουσα.
ltx/gr_gr_cog/me.m01.d27:meMA.Ode5C31.greekmelody	@ltx/gr_gr_cog/he.h.m3:heHE.ProsSeOrthrizo.greekname
ltx/gr_gr_cog/me.m01.d27:meMA.Ode5C31.incipit	Ὡς ἔαρ ὤφθης, εὐωδιάζον μυστικῶς…
ltx/gr_gr_cog/me.m01.d27:meMA.Ode5C31.melody	@ltx/gr_gr_cog/he.h.m3:heHE.ProsSeOrthrizo.name
ltx/gr_gr_cog/me.m01.d27:meMA.Ode5C31.mode	@ltx/gr_gr_cog/miscellanea:misc.Mode3
ltx/gr_gr_cog/me.m01.d27:meMA.Ode5C31.ode	@ltx/gr_gr_cog/miscellanea:misc.Ode5
ltx/gr_gr_cog/me.m01.d27:meMA.Ode5C31.text	Ὡς ἔαρ ὤφθης, εὐωδιάζον μυστικῶς, χαρίτων ἄνθεσι τῶν πιστῶν τὰ πλήθη, λύων κακῶν τὸν χειμῶνα Πάτερ, ἐν τῇ ἐπανελεύσει σου.
ltx/gr_gr_cog/me.m01.d27:meMA.Ode5C32.incipit	Τὸ θεῖον ῥεῖθρον, τῶν χαρισμάτων…
ltx/gr_gr_cog/me.m01.d27:meMA.Ode5C32.melody	@ltx/gr_gr_cog/he.h.m3:heHE.ProsSeOrthrizo.name
ltx/gr_gr_cog/me.m01.d27:meMA.Ode5C32.mode	@ltx/gr_gr_cog/miscellanea:misc.Mode3
ltx/gr_gr_cog/me.m01.d27:meMA.Ode5C32.ode	@ltx/gr_gr_cog/miscellanea:misc.Ode5
ltx/gr_gr_cog/me.m01.d27:meMA.Ode5C32.text	Τὸ θεῖον ῥεῖθρον, τῶν χαρισμάτων ἡ πηγή, ἐπανελήλυθεν· οἱ διψῶντες δεῦτε ὕδωρ ζωῆς, ἀπαντλεῖτε πίστει, ἐνθέως εὐφραινόμενοι.
ltx/gr_gr_cog/me.m01.d27:meMA.Ode5C33.incipit	Ῥυὲν ἐκρύβης, οἴμοι! τὸ κάλλος…
ltx/gr_gr_cog/me.m01.d27:meMA.Ode5C33.melody	@ltx/gr_gr_cog/he.h.m3:heHE.ProsSeOrthrizo.name
ltx/gr_gr_cog/me.m01.d27:meMA.Ode5C33.mode	@ltx/gr_gr_cog/miscellanea:misc.Mode3
ltx/gr_gr_cog/me.m01.d27:meMA.Ode5C33.ode	@ltx/gr_gr_cog/miscellanea:misc.Ode5
ltx/gr_gr_cog/me.m01.d27:meMA.Ode5C33.text	Ῥυὲν ἐκρύβης, οἴμοι! τὸ κάλλος τὸ ἐμόν· ἀλλʼ ἐπανῆλθές μοι ποθητὸς ἐν χρόνῳ, ἡ τοῦ Χριστοῦ Ἐκκλησία Πάτερ, βοᾷ σοι ἐπανήκοντι.
ltx/gr_gr_cog/me.m01.d27:meMA.Ode5C3T.incipit	Ἰλέωσαί μοι, τὸν προελθόντα ἐκ…
ltx/gr_gr_cog/me.m01.d27:meMA.Ode5C3T.melody	@ltx/gr_gr_cog/he.h.m3:heHE.ProsSeOrthrizo.name
ltx/gr_gr_cog/me.m01.d27:meMA.Ode5C3T.mode	@ltx/gr_gr_cog/miscellanea:misc.Mode3
ltx/gr_gr_cog/me.m01.d27:meMA.Ode5C3T.ode	@ltx/gr_gr_cog/miscellanea:misc.Ode5
ltx/gr_gr_cog/me.m01.d27:meMA.Ode5C3T.text	Ἰλέωσαί μοι, τὸν προελθόντα ἐκ τῆς σῆς, γαστρὸς Πανάμωμε, σαρκοφόρον Λόγον, ὃν ἐν ναῷ Συμεὼν βαστάζων, ὡς Κτίστην ἐμεγάλυνεν.
ltx/gr_gr_cog/me.m01.d27:meMA.Ode6C11.greekmelody	@ltx/gr_gr_cog/he.h.m8:heHE.TinDeisinEkcheo.greekname
ltx/gr_gr_cog/me.m01.d27:meMA.Ode6C11.incipit	Ἡ ἔμψυχος χαῖρε Δέσποινα κόχλος…
ltx/gr_gr_cog/me.m01.d27:meMA.Ode6C11.melody	@ltx/gr_gr_cog/he.h.m8:heHE.TinDeisinEkcheo.name
ltx/gr_gr_cog/me.m01.d27:meMA.Ode6C11.mode	@ltx/gr_gr_cog/miscellanea:misc.Mode8
ltx/gr_gr_cog/me.m01.d27:meMA.Ode6C11.ode	@ltx/gr_gr_cog/miscellanea:misc.Ode6
ltx/gr_gr_cog/me.m01.d27:meMA.Ode6C11.text	Ἡ ἔμψυχος χαῖρε Δέσποινα κόχλος· ἡ κογχύλη, σῶν ἀχράντων αἱμάτων πορφυραυγῆ, ἐρυθρὰν ἁλουργίδα, τῷ τοῦ παντὸς Βασιλεῖ, πορφυρώσασα· τὴν γύμνωσιν τὴν τοῦ Ἀδάμ, ἡ σκεπάσασα χαῖρε Πανύμνητε.
ltx/gr_gr_cog/me.m01.d27:meMA.Ode6C12.incipit	Στηρίζει μέν, τὰς καρδίας ἀνθρώπων…
ltx/gr_gr_cog/me.m01.d27:meMA.Ode6C12.melody	@ltx/gr_gr_cog/he.h.m8:heHE.TinDeisinEkcheo.name
ltx/gr_gr_cog/me.m01.d27:meMA.Ode6C12.mode	@ltx/gr_gr_cog/miscellanea:misc.Mode8
ltx/gr_gr_cog/me.m01.d27:meMA.Ode6C12.ode	@ltx/gr_gr_cog/miscellanea:misc.Ode6
ltx/gr_gr_cog/me.m01.d27:meMA.Ode6C12.text	Στηρίζει μέν, τὰς καρδίας ἀνθρώπων, φυσικῶς ὁ αἰσθητὸς ἄρτος Κόρη· Χριστιανῶν, τὰς ψυχὰς δὲ κρατύνει, τὸ σὸν ᾀδόμενον ἅγιον ὄνομα· ἐντεῦθεν καὶ χαρμονικῶς, πᾶσα γλῶσσα τὸ χαῖρε κραυγάζει σοι.
ltx/gr_gr_cog/me.m01.d27:meMA.Ode6C13.incipit	Λυχνία, ἡ χρυσαυγίζουσα χαῖρε, κιβωτὸς…
ltx/gr_gr_cog/me.m01.d27:meMA.Ode6C13.melody	@ltx/gr_gr_cog/he.h.m8:heHE.TinDeisinEkcheo.name
ltx/gr_gr_cog/me.m01.d27:meMA.Ode6C13.mode	@ltx/gr_gr_cog/miscellanea:misc.Mode8
ltx/gr_gr_cog/me.m01.d27:meMA.Ode6C13.ode	@ltx/gr_gr_cog/miscellanea:misc.Ode6
ltx/gr_gr_cog/me.m01.d27:meMA.Ode6C13.text	Λυχνία, ἡ χρυσαυγίζουσα χαῖρε, κιβωτὸς ἡ θεοχώρητος, χαῖρε σκηνή, χαῖρε ἅγιον ὄρος· χαῖρε τοῦ ζῶντος Θεοῦ πόλις ἔμψυχε· παλάτιον χαῖρε Χριστοῦ· χαῖρε τέμενος θεῖον πολύφωτον.
ltx/gr_gr_cog/me.m01.d27:meMA.Ode6C14.incipit	Ὑπέραγνε, ὑπεράμωμε χαῖρε, τὸ τῆς…
ltx/gr_gr_cog/me.m01.d27:meMA.Ode6C14.melody	@ltx/gr_gr_cog/he.h.m8:heHE.TinDeisinEkcheo.name
ltx/gr_gr_cog/me.m01.d27:meMA.Ode6C14.mode	@ltx/gr_gr_cog/miscellanea:misc.Mode8
ltx/gr_gr_cog/me.m01.d27:meMA.Ode6C14.ode	@ltx/gr_gr_cog/miscellanea:misc.Ode6
ltx/gr_gr_cog/me.m01.d27:meMA.Ode6C14.text	Ὑπέραγνε, ὑπεράμωμε χαῖρε, τὸ τῆς φύσεως ἐξαίρετον ἄνθος· χαῖρε κοινή, τῶν ἀνθρώπων τοῦ γένους, φιλοτιμία καὶ χάρις θεόσδοτος, τὴν ἄτιμον φύσιν τῶν βροτῶν, ἡ τιμήσασα χαῖρε τῷ τόκῳ σου.
ltx/gr_gr_cog/me.m01.d27:meMA.Ode6C1H.greekmelody	@ltx/gr_gr_cog/he.h.m8:heHE.TinDeisinEkcheo.greekname
ltx/gr_gr_cog/me.m01.d27:meMA.Ode6C1H.incipit	@ltx/gr_gr_cog/he.h.m8:heHE.TinDeisinEkcheo.incipit
ltx/gr_gr_cog/me.m01.d27:meMA.Ode6C1H.melody	@ltx/gr_gr_cog/he.h.m8:heHE.TinDeisinEkcheo.melody
ltx/gr_gr_cog/me.m01.d27:meMA.Ode6C1H.mode	@ltx/gr_gr_cog/miscellanea:misc.Mode8
ltx/gr_gr_cog/me.m01.d27:meMA.Ode6C1H.ode	@ltx/gr_gr_cog/miscellanea:misc.Ode6
ltx/gr_gr_cog/me.m01.d27:meMA.Ode6C1H.text	@ltx/gr_gr_cog/he.h.m8:heHE.TinDeisinEkcheo.text
ltx/gr_gr_cog/me.m01.d27:meMA.Ode6C21.greekmelody	@ltx/gr_gr_cog/he.h.m8:heHE.OsTonProfitinErryso.greekname
ltx/gr_gr_cog/me.m01.d27:meMA.Ode6C21.incipit	Ὥσπερ χρυσὸν ἐκ μετάλλων, ἐκ…
ltx/gr_gr_cog/me.m01.d27:meMA.Ode6C21.melody	@ltx/gr_gr_cog/he.h.m8:heHE.OsTonProfitinErryso.name
ltx/gr_gr_cog/me.m01.d27:meMA.Ode6C21.mode	@ltx/gr_gr_cog/miscellanea:misc.Mode8
ltx/gr_gr_cog/me.m01.d27:meMA.Ode6C21.ode	@ltx/gr_gr_cog/miscellanea:misc.Ode6
ltx/gr_gr_cog/me.m01.d27:meMA.Ode6C21.text	Ὥσπερ χρυσὸν ἐκ μετάλλων, ἐκ τοῦ βάθους σοφὲ τῆς καρδίας σου, τὰ πάγχρυσα δόγματα ἡμῖν ἐθησαύρισας, καὶ τὰ σὰ λόγια πλοῦτον κατέλιπες.
ltx/gr_gr_cog/me.m01.d27:meMA.Ode6C22.incipit	Τὴν παναγίαν σου μνήμην, ὁ…
ltx/gr_gr_cog/me.m01.d27:meMA.Ode6C22.melody	@ltx/gr_gr_cog/he.h.m8:heHE.OsTonProfitinErryso.name
ltx/gr_gr_cog/me.m01.d27:meMA.Ode6C22.mode	@ltx/gr_gr_cog/miscellanea:misc.Mode8
ltx/gr_gr_cog/me.m01.d27:meMA.Ode6C22.ode	@ltx/gr_gr_cog/miscellanea:misc.Ode6
ltx/gr_gr_cog/me.m01.d27:meMA.Ode6C22.text	Τὴν παναγίαν σου μνήμην, ὁ λαὸς ἑορτάζων Χρυσόστομε, δοξάζει τὸν Κύριον, τὸν σὲ ἐκλεξάμενον, καὶ καλέσαντα, εἰς τὰς αἰωνίους σκηνάς.
ltx/gr_gr_cog/me.m01.d27:meMA.Ode6C23.incipit	Εἰ καὶ νεκρὸς εἶ ἐν…
ltx/gr_gr_cog/me.m01.d27:meMA.Ode6C23.melody	@ltx/gr_gr_cog/he.h.m8:heHE.OsTonProfitinErryso.name
ltx/gr_gr_cog/me.m01.d27:meMA.Ode6C23.mode	@ltx/gr_gr_cog/miscellanea:misc.Mode8
ltx/gr_gr_cog/me.m01.d27:meMA.Ode6C23.ode	@ltx/gr_gr_cog/miscellanea:misc.Ode6
ltx/gr_gr_cog/me.m01.d27:meMA.Ode6C23.text	Εἰ καὶ νεκρὸς εἶ ἐν τάφῳ, ἀλλὰ ζῶν ἐν τῷ κόσμῳ Χρυσόστομε, κηρύττεις μετάνοιαν, καὶ γράφεις συγχώρησιν, ἐγγυώμενος, τοῖς μετανοοῦσι θερμῶς.
ltx/gr_gr_cog/me.m01.d27:meMA.Ode6C2T.incipit	Τὸν ἐν χερσὶ τῆς Παρθένου…
ltx/gr_gr_cog/me.m01.d27:meMA.Ode6C2T.melody	@ltx/gr_gr_cog/he.h.m8:heHE.OsTonProfitinErryso.name
ltx/gr_gr_cog/me.m01.d27:meMA.Ode6C2T.mode	@ltx/gr_gr_cog/miscellanea:misc.Mode8
ltx/gr_gr_cog/me.m01.d27:meMA.Ode6C2T.ode	@ltx/gr_gr_cog/miscellanea:misc.Ode6
ltx/gr_gr_cog/me.m01.d27:meMA.Ode6C2T.text	Τὸν ἐν χερσὶ τῆς Παρθένου, καὶ ἐν κόλποις Πατρὸς καθεζόμενον, τὸν σάρκα φορέσαντα, καὶ μείναντα ἄτρεπτον, προσκυνήσωμεν, ὡς Θεὸν καὶ Κύριον.
ltx/gr_gr_cog/me.m01.d27:meMA.Ode6C31.greekmelody	@ltx/gr_gr_cog/he.h.m3:heHE.AvyssosEschati.greekname
ltx/gr_gr_cog/me.m01.d27:meMA.Ode6C31.incipit	Τέμνει σε τῆς Ἐκκλησίας Χριστοῦ…
ltx/gr_gr_cog/me.m01.d27:meMA.Ode6C31.melody	@ltx/gr_gr_cog/he.h.m3:heHE.AvyssosEschati.name
ltx/gr_gr_cog/me.m01.d27:meMA.Ode6C31.mode	@ltx/gr_gr_cog/miscellanea:misc.Mode3
ltx/gr_gr_cog/me.m01.d27:meMA.Ode6C31.ode	@ltx/gr_gr_cog/miscellanea:misc.Ode6
ltx/gr_gr_cog/me.m01.d27:meMA.Ode6C31.text	Τέμνει σε τῆς Ἐκκλησίας Χριστοῦ ἡ ἔκφρων βασίλισσα, ἀποτόμως ἐλέγχουσα· ἀλλʼ αὐτίκα τέμνεται, σὺ δὲ ἐλέγχεις ἀθάνατα, τὴν ἐξαίσιον προτομὴν ἐργασάμενος.
ltx/gr_gr_cog/me.m01.d27:meMA.Ode6C32.incipit	Ὄργανον ἐδείχθης τοῦ παντουργοῦ, Χρυσόστομε…
ltx/gr_gr_cog/me.m01.d27:meMA.Ode6C32.melody	@ltx/gr_gr_cog/he.h.m3:heHE.AvyssosEschati.name
ltx/gr_gr_cog/me.m01.d27:meMA.Ode6C32.mode	@ltx/gr_gr_cog/miscellanea:misc.Mode3
ltx/gr_gr_cog/me.m01.d27:meMA.Ode6C32.ode	@ltx/gr_gr_cog/miscellanea:misc.Ode6
ltx/gr_gr_cog/me.m01.d27:meMA.Ode6C32.text	Ὄργανον ἐδείχθης τοῦ παντουργοῦ, Χρυσόστομε Πνεύματος, ὑπηχοῦν ἐμμελέστατα, κωφεύει δʼ ἡ τύραννος, ὡς ἀσπὶς πρὸς ἐπᾴσματα, καὶ οἰκτρότατον, ἀνταλλάττεται θάνατον.
ltx/gr_gr_cog/me.m01.d27:meMA.Ode6C33.incipit	Νέκρωσιν κἂν τέθνηκε μὴ παθεῖν…
ltx/gr_gr_cog/me.m01.d27:meMA.Ode6C33.melody	@ltx/gr_gr_cog/he.h.m3:heHE.AvyssosEschati.name
ltx/gr_gr_cog/me.m01.d27:meMA.Ode6C33.mode	@ltx/gr_gr_cog/miscellanea:misc.Mode3
ltx/gr_gr_cog/me.m01.d27:meMA.Ode6C33.ode	@ltx/gr_gr_cog/miscellanea:misc.Ode6
ltx/gr_gr_cog/me.m01.d27:meMA.Ode6C33.text	Νέκρωσιν κἂν τέθνηκε μὴ παθεῖν, σαφῶς ἀνεδίδαξε, Βασιλεῖς ὁ Χρυσόστομος· αὐτῶν γὰρ προστάγμασιν, ἀπειθήσας τὸ πρότερον, ταῖς δεήσεσιν, ἐπανῆκε τὸ δεύτερον.
ltx/gr_gr_cog/me.m01.d27:meMA.Ode6C3T.incipit	Ἕνα σε τὸν ἐκ Παρθένου…
ltx/gr_gr_cog/me.m01.d27:meMA.Ode6C3T.melody	@ltx/gr_gr_cog/he.h.m3:heHE.AvyssosEschati.name
ltx/gr_gr_cog/me.m01.d27:meMA.Ode6C3T.mode	@ltx/gr_gr_cog/miscellanea:misc.Mode3
ltx/gr_gr_cog/me.m01.d27:meMA.Ode6C3T.ode	@ltx/gr_gr_cog/miscellanea:misc.Ode6
ltx/gr_gr_cog/me.m01.d27:meMA.Ode6C3T.text	Ἕνα σε τὸν ἐκ Παρθένου νοῶν, κἂν σάρκα προσείληφας, καὶ διπλοῦς ἐχρημάτισας, μακρὰν ἀπεῤῥάπισε, καὶ τομὴν καὶ τὴν σύγχυσιν, ὁ Χρυσόστομος, Ἰωάννης Θεάνθρωπε.
ltx/gr_gr_cog/me.m01.d27:meMA.Ode7C11.greekmelody	@ltx/gr_gr_cog/he.h.m8:heHE.TheouSynkatavasin.greekname
ltx/gr_gr_cog/me.m01.d27:meMA.Ode7C11.incipit	Ἡ μόνη ἀπείρανδρος, ἡ μόνη…
ltx/gr_gr_cog/me.m01.d27:meMA.Ode7C11.melody	@ltx/gr_gr_cog/he.h.m8:heHE.TheouSynkatavasin.name
ltx/gr_gr_cog/me.m01.d27:meMA.Ode7C11.mode	@ltx/gr_gr_cog/miscellanea:misc.Mode8
ltx/gr_gr_cog/me.m01.d27:meMA.Ode7C11.ode	@ltx/gr_gr_cog/miscellanea:misc.Ode7
ltx/gr_gr_cog/me.m01.d27:meMA.Ode7C11.text	Ἡ μόνη ἀπείρανδρος, ἡ μόνη ἄφθορος, χαῖρε Δέσποινα, ἡ Παρθένος καὶ Μήτηρ, ἡ παιδοτόκος καὶ ἀπειρόγαμος· τὸ ξένον χαῖρε καὶ φρικτὸν μυστήριον· χαῖρε Ἀγγέλων τρυφή, χαῖρε ἀνθρώπων χαρά.
ltx/gr_gr_cog/me.m01.d27:meMA.Ode7C12.incipit	Σιὼν πόλις ἔμψυχε, τοῦ Βασιλέως…
ltx/gr_gr_cog/me.m01.d27:meMA.Ode7C12.melody	@ltx/gr_gr_cog/he.h.m8:heHE.TheouSynkatavasin.name
ltx/gr_gr_cog/me.m01.d27:meMA.Ode7C12.mode	@ltx/gr_gr_cog/miscellanea:misc.Mode8
ltx/gr_gr_cog/me.m01.d27:meMA.Ode7C12.ode	@ltx/gr_gr_cog/miscellanea:misc.Ode7
ltx/gr_gr_cog/me.m01.d27:meMA.Ode7C12.text	Σιὼν πόλις ἔμψυχε, τοῦ Βασιλέως τῶν Βασιλέων Χριστοῦ, περὶ ἧς ἐλαλήθη, δεδοξασμένα χαῖρε Θεόνυμφε· χαῖρε ἡ κλῖμαξ, διʼ ἧς μεταβαίνομεν, πρὸς οὐρανὸν ἀπὸ γῆς, καὶ ἐκ φθορᾶς εἰς ζωήν.
ltx/gr_gr_cog/me.m01.d27:meMA.Ode7C13.incipit	Λειμὼν θεοφύτευτος, εὐώδης κῆπος θεοβλαστούργητος…
ltx/gr_gr_cog/me.m01.d27:meMA.Ode7C13.melody	@ltx/gr_gr_cog/he.h.m8:heHE.TheouSynkatavasin.name
ltx/gr_gr_cog/me.m01.d27:meMA.Ode7C13.mode	@ltx/gr_gr_cog/miscellanea:misc.Mode8
ltx/gr_gr_cog/me.m01.d27:meMA.Ode7C13.ode	@ltx/gr_gr_cog/miscellanea:misc.Ode7
ltx/gr_gr_cog/me.m01.d27:meMA.Ode7C13.text	Λειμὼν θεοφύτευτος, εὐώδης κῆπος θεοβλαστούργητος, ἀνεδείχθης Παρθένε, ἀθανασίας ἄνθος ἀνθήσασα· διὸ συμφώνως τὸ χαῖρέ σοι κράζομεν. Χαῖρε χαρᾶς χορηγέ, χαῖρε πηγὴ γλυκασμοῦ.
ltx/gr_gr_cog/me.m01.d27:meMA.Ode7C14.incipit	Ὑπέρτιμε Δέσποινα, ἐξ ἀτιμίας παθῶν…
ltx/gr_gr_cog/me.m01.d27:meMA.Ode7C14.melody	@ltx/gr_gr_cog/he.h.m8:heHE.TheouSynkatavasin.name
ltx/gr_gr_cog/me.m01.d27:meMA.Ode7C14.mode	@ltx/gr_gr_cog/miscellanea:misc.Mode8
ltx/gr_gr_cog/me.m01.d27:meMA.Ode7C14.ode	@ltx/gr_gr_cog/miscellanea:misc.Ode7
ltx/gr_gr_cog/me.m01.d27:meMA.Ode7C14.text	Ὑπέρτιμε Δέσποινα, ἐξ ἀτιμίας παθῶν με λύτρωσαι, ἵνα σοι χαρμοσύνως, τὸ χαῖρε κράζω· χαῖρε ἁγνείας πηγή, χαῖρε ταμεῖον πάσης καθαρότητος· χαῖρε δοχεῖον Θεοῦ, χαῖρε χωρίον Χριστοῦ.
ltx/gr_gr_cog/me.m01.d27:meMA.Ode7C1H.greekmelody	@ltx/gr_gr_cog/he.h.m8:heHE.TheouSynkatavasin.greekname
ltx/gr_gr_cog/me.m01.d27:meMA.Ode7C1H.incipit	@ltx/gr_gr_cog/he.h.m8:heHE.TheouSynkatavasin.incipit
ltx/gr_gr_cog/me.m01.d27:meMA.Ode7C1H.melody	@ltx/gr_gr_cog/he.h.m8:heHE.TheouSynkatavasin.melody
ltx/gr_gr_cog/me.m01.d27:meMA.Ode7C1H.mode	@ltx/gr_gr_cog/miscellanea:misc.Mode8
ltx/gr_gr_cog/me.m01.d27:meMA.Ode7C1H.ode	@ltx/gr_gr_cog/miscellanea:misc.Ode7
ltx/gr_gr_cog/me.m01.d27:meMA.Ode7C1H.text	@ltx/gr_gr_cog/he.h.m8:heHE.TheouSynkatavasin.text
ltx/gr_gr_cog/me.m01.d27:meMA.Ode7C21.greekmelody	@ltx/gr_gr_cog/he.h.m8:heHE.OTousPaidasDrosisas.greekname
ltx/gr_gr_cog/me.m01.d27:meMA.Ode7C21.incipit	Ἀκριβὴς ἐπεγνώσθης θεηγόρος, καὶ κοινὸς…
ltx/gr_gr_cog/me.m01.d27:meMA.Ode7C21.melody	@ltx/gr_gr_cog/he.h.m8:heHE.OTousPaidasDrosisas.name
ltx/gr_gr_cog/me.m01.d27:meMA.Ode7C21.mode	@ltx/gr_gr_cog/miscellanea:misc.Mode8
ltx/gr_gr_cog/me.m01.d27:meMA.Ode7C21.ode	@ltx/gr_gr_cog/miscellanea:misc.Ode7
ltx/gr_gr_cog/me.m01.d27:meMA.Ode7C21.text	Ἀκριβὴς ἐπεγνώσθης θεηγόρος, καὶ κοινὸς ἀντιλήπτωρ τῶν ἐν τῷ κόσμῳ, ἡμαρτηκότων, Ὅσιε, παρεγγυῶν τὴν μετάνοιαν.
ltx/gr_gr_cog/me.m01.d27:meMA.Ode7C22.incipit	Ὡς χρυσὸς ἐν καμίνῳ τῶν…
ltx/gr_gr_cog/me.m01.d27:meMA.Ode7C22.melody	@ltx/gr_gr_cog/he.h.m8:heHE.OTousPaidasDrosisas.name
ltx/gr_gr_cog/me.m01.d27:meMA.Ode7C22.mode	@ltx/gr_gr_cog/miscellanea:misc.Mode8
ltx/gr_gr_cog/me.m01.d27:meMA.Ode7C22.ode	@ltx/gr_gr_cog/miscellanea:misc.Ode7
ltx/gr_gr_cog/me.m01.d27:meMA.Ode7C22.text	Ὡς χρυσὸς ἐν καμίνῳ τῶν κινδύνων, πυρωθεὶς Ἱεράρχα οὐκ ἐχωνεύθης, οὐ κατεφλέχθης· δοκιμασθεὶς γὰρ ἔδειξας, ὑπεροβρύζους τοὺς πόνους σου.
ltx/gr_gr_cog/me.m01.d27:meMA.Ode7C23.incipit	Οὐκ ἐνάρκησας Πάτερ πρός ἀγῶνας…
ltx/gr_gr_cog/me.m01.d27:meMA.Ode7C23.melody	@ltx/gr_gr_cog/he.h.m8:heHE.OTousPaidasDrosisas.name
ltx/gr_gr_cog/me.m01.d27:meMA.Ode7C23.mode	@ltx/gr_gr_cog/miscellanea:misc.Mode8
ltx/gr_gr_cog/me.m01.d27:meMA.Ode7C23.ode	@ltx/gr_gr_cog/miscellanea:misc.Ode7
ltx/gr_gr_cog/me.m01.d27:meMA.Ode7C23.text	Οὐκ ἐνάρκησας Πάτερ πρός ἀγῶνας, οὐκ ᾐσχύνθης Δυνάστας, οὐ προέκρινας, ἀδικίαν δικαιοσύνης Ὅσιε, καὶ μαρτυρεῖ ὁ τῆς χήρας ἀγρός.
ltx/gr_gr_cog/me.m01.d27:meMA.Ode7C2T.incipit	Χαῖρε κούφη νεφέλη, χαῖρε πύλη…
ltx/gr_gr_cog/me.m01.d27:meMA.Ode7C2T.melody	@ltx/gr_gr_cog/he.h.m8:heHE.OTousPaidasDrosisas.name
ltx/gr_gr_cog/me.m01.d27:meMA.Ode7C2T.mode	@ltx/gr_gr_cog/miscellanea:misc.Mode8
ltx/gr_gr_cog/me.m01.d27:meMA.Ode7C2T.ode	@ltx/gr_gr_cog/miscellanea:misc.Ode7
ltx/gr_gr_cog/me.m01.d27:meMA.Ode7C2T.text	Χαῖρε κούφη νεφέλη, χαῖρε πύλη, διʼ ἧς μόνος διῆλθεν, ὁ Θεὸς ἡμῶν Θεοτόκε, ἀφθόρῳ τόκῳ ἄσπορος, ἐκ σοῦ Υἱὸς γεννηθεὶς οὐ τραπείς.
ltx/gr_gr_cog/me.m01.d27:meMA.Ode7C31.greekmelody	@ltx/gr_gr_cog/he.h.m3:heHE.OsPalaiTousEfseveis.greekname
ltx/gr_gr_cog/me.m01.d27:meMA.Ode7C31.incipit	Ξενοῦν τὴν χήραν Σοφέ, ἀσύγγνωστον…
ltx/gr_gr_cog/me.m01.d27:meMA.Ode7C31.melody	@ltx/gr_gr_cog/he.h.m3:heHE.OsPalaiTousEfseveis.name
ltx/gr_gr_cog/me.m01.d27:meMA.Ode7C31.mode	@ltx/gr_gr_cog/miscellanea:misc.Mode3
ltx/gr_gr_cog/me.m01.d27:meMA.Ode7C31.ode	@ltx/gr_gr_cog/miscellanea:misc.Ode7
ltx/gr_gr_cog/me.m01.d27:meMA.Ode7C31.text	Ξενοῦν τὴν χήραν Σοφέ, ἀσύγγνωστον φάσκοντα, τῶν ἐξ αὐτῆς ξένον σε ποιεῖ, ἐκ τῆς βασιλίδος ἡ πάντολμος γυνή, ξένη θείας χάριτος, ξενώσει χρηματίσασα, τῶν σοφῶν διδαγμάτων σου.
ltx/gr_gr_cog/me.m01.d27:meMA.Ode7C32.incipit	Ἀλλʼ ἐπανῆλθες ἡδύς, ὡς ἥλιος…
ltx/gr_gr_cog/me.m01.d27:meMA.Ode7C32.melody	@ltx/gr_gr_cog/he.h.m3:heHE.OsPalaiTousEfseveis.name
ltx/gr_gr_cog/me.m01.d27:meMA.Ode7C32.mode	@ltx/gr_gr_cog/miscellanea:misc.Mode3
ltx/gr_gr_cog/me.m01.d27:meMA.Ode7C32.ode	@ltx/gr_gr_cog/miscellanea:misc.Ode7
ltx/gr_gr_cog/me.m01.d27:meMA.Ode7C32.text	Ἀλλʼ ἐπανῆλθες ἡδύς, ὡς ἥλιος νέφεσιν, ἀποκρυβεὶς μέγιστε φωστήρ, καταφωσφορῶν φωταυγίᾳ μυστικῇ, τῶν χρυσῶν δογμάτων σου, τοὺς φωτισθέντας ἅπαντας, Ἰωάννη Χρυσόστομε.
ltx/gr_gr_cog/me.m01.d27:meMA.Ode7C33.incipit	Διαίρω σοι τὰς ἐμάς, παλάμας…
ltx/gr_gr_cog/me.m01.d27:meMA.Ode7C33.melody	@ltx/gr_gr_cog/he.h.m3:heHE.OsPalaiTousEfseveis.name
ltx/gr_gr_cog/me.m01.d27:meMA.Ode7C33.mode	@ltx/gr_gr_cog/miscellanea:misc.Mode3
ltx/gr_gr_cog/me.m01.d27:meMA.Ode7C33.ode	@ltx/gr_gr_cog/miscellanea:misc.Ode7
ltx/gr_gr_cog/me.m01.d27:meMA.Ode7C33.text	Διαίρω σοι τὰς ἐμάς, παλάμας Χρυσόστομε, περιβολαῖς ἔνδον σε λαβεῖν, τὸν νυμφαγωγόν, ἐπανήκοντα λαμπρῶς, φίλτρον ὡς χρόνιον, ἡ Ἐκκλησία κράζει σοι, ἑορτάζουσα σήμερον.
ltx/gr_gr_cog/me.m01.d27:meMA.Ode7C3T.incipit	Ὡς μυστικὴ τις λαβίς, τὸν…
ltx/gr_gr_cog/me.m01.d27:meMA.Ode7C3T.melody	@ltx/gr_gr_cog/he.h.m3:heHE.OsPalaiTousEfseveis.name
ltx/gr_gr_cog/me.m01.d27:meMA.Ode7C3T.mode	@ltx/gr_gr_cog/miscellanea:misc.Mode3
ltx/gr_gr_cog/me.m01.d27:meMA.Ode7C3T.ode	@ltx/gr_gr_cog/miscellanea:misc.Ode7
ltx/gr_gr_cog/me.m01.d27:meMA.Ode7C3T.text	Ὡς μυστικὴ τις λαβίς, τὸν ἄνθρακα φέρουσα, τὸν νοητὸν ἔρχῃ πρός, ναόν, ὃν Συμεὼν λαμπρυνθήσεται χερσί, Πάναγνε δεξάμενος, καὶ τὰ τοῦ πάθους σύμβολα, προφητεύσει σαφέστατα.
ltx/gr_gr_cog/me.m01.d27:meMA.Ode8C11.greekmelody	@ltx/gr_gr_cog/he.h.m8:heHE.EvlogeitePaides.greekname
ltx/gr_gr_cog/me.m01.d27:meMA.Ode8C11.incipit	Ἰεσσαὶ ἐκ ῥίζης, χαῖρε ῥάβδος…
ltx/gr_gr_cog/me.m01.d27:meMA.Ode8C11.melody	@ltx/gr_gr_cog/he.h.m8:heHE.EvlogeitePaides.name
ltx/gr_gr_cog/me.m01.d27:meMA.Ode8C11.mode	@ltx/gr_gr_cog/miscellanea:misc.Mode8
ltx/gr_gr_cog/me.m01.d27:meMA.Ode8C11.ode	@ltx/gr_gr_cog/miscellanea:misc.Ode8
ltx/gr_gr_cog/me.m01.d27:meMA.Ode8C11.text	Ἰεσσαὶ ἐκ ῥίζης, χαῖρε ῥάβδος βλαστήσασα, χαῖρε ἀποτίστως ἀνθηφοροῦσα, ἄνθος τὸν Χριστὸν ὡραῖον, χαῖρε πῖον ὄρος, χαῖρε κατάσκιον· χαῖρε Θεοῦ ὄρος, ἐν ᾧ κατοικεῖν ὁ Λόγος, πάντων ηὐδόκησε πρὸ τῶν αἰώνων.
ltx/gr_gr_cog/me.m01.d27:meMA.Ode8C12.incipit	Σιδηρᾷ σου ῥάβδῳ, κραταιᾶς ἀντιλήψεως…
ltx/gr_gr_cog/me.m01.d27:meMA.Ode8C12.melody	@ltx/gr_gr_cog/he.h.m8:heHE.EvlogeitePaides.name
ltx/gr_gr_cog/me.m01.d27:meMA.Ode8C12.mode	@ltx/gr_gr_cog/miscellanea:misc.Mode8
ltx/gr_gr_cog/me.m01.d27:meMA.Ode8C12.ode	@ltx/gr_gr_cog/miscellanea:misc.Ode8
ltx/gr_gr_cog/me.m01.d27:meMA.Ode8C12.text	Σιδηρᾷ σου ῥάβδῳ, κραταιᾶς ἀντιλήψεως, ὡς ὑλακτοῦντας κύνας, ὡς ὠρυομένους θῆρας, τὰ περικυκλοῦντα τὴν ταπεινήν μου ψυχήν, ἀποσόβει πάθει, δεινῶς με πολιορκοῦντα, ἵνα τὸ χαῖρέ σοι Παρθένε κράζω.
ltx/gr_gr_cog/me.m01.d27:meMA.Ode8C13.incipit	Ὡραιώθης ὅλη, τὸν ὡραῖον ἐν…
ltx/gr_gr_cog/me.m01.d27:meMA.Ode8C13.melody	@ltx/gr_gr_cog/he.h.m8:heHE.EvlogeitePaides.name
ltx/gr_gr_cog/me.m01.d27:meMA.Ode8C13.mode	@ltx/gr_gr_cog/miscellanea:misc.Mode8
ltx/gr_gr_cog/me.m01.d27:meMA.Ode8C13.ode	@ltx/gr_gr_cog/miscellanea:misc.Ode8
ltx/gr_gr_cog/me.m01.d27:meMA.Ode8C13.text	Ὡραιώθης ὅλη, τὸν ὡραῖον ἐν κάλλεσιν, ὑπὲρ υἱοὺς ἀνθρώπων, Χριστὸν τεκοῦσα, ἡ ἐν γυναιξὶν ὡραία· διό σοι τὸ χαῖρε κράζομεν χαίροντες, χαῖρε Θεοτόκε, Ἀγνὴ κεχαριτωμένη, χαῖρε τῆς κτίσεως ἐνδοξοτέρα.
ltx/gr_gr_cog/me.m01.d27:meMA.Ode8C14.incipit	Δανιὴλ ὃ εἶδεν, ὄρος πρὶν…
ltx/gr_gr_cog/me.m01.d27:meMA.Ode8C14.melody	@ltx/gr_gr_cog/he.h.m8:heHE.EvlogeitePaides.name
ltx/gr_gr_cog/me.m01.d27:meMA.Ode8C14.mode	@ltx/gr_gr_cog/miscellanea:misc.Mode8
ltx/gr_gr_cog/me.m01.d27:meMA.Ode8C14.ode	@ltx/gr_gr_cog/miscellanea:misc.Ode8
ltx/gr_gr_cog/me.m01.d27:meMA.Ode8C14.text	Δανιὴλ ὃ εἶδεν, ὄρος πρὶν ἀλατόμημον, Θεογεννῆτορ χαῖρε, ἐξ οὗ ἐτμήθη, ἀκρογωνιαῖος λίθος. Χαῖρε θεοδόχε, ἀνθρακοφόρε λαβίς, χαῖρε τῶν ἀΰλων, Ἀγγέλων ἁγιωτέρα, χαῖρε τῆς κτίσεως τιμιωτέρα.
ltx/gr_gr_cog/me.m01.d27:meMA.Ode8C1H.greekmelody	@ltx/gr_gr_cog/he.h.m8:heHE.EvlogeitePaides.greekname
ltx/gr_gr_cog/me.m01.d27:meMA.Ode8C1H.incipit	@ltx/gr_gr_cog/he.h.m8:heHE.EvlogeitePaides.incipit
ltx/gr_gr_cog/me.m01.d27:meMA.Ode8C1H.melody	@ltx/gr_gr_cog/he.h.m8:heHE.EvlogeitePaides.melody
ltx/gr_gr_cog/me.m01.d27:meMA.Ode8C1H.mode	@ltx/gr_gr_cog/miscellanea:misc.Mode8
ltx/gr_gr_cog/me.m01.d27:meMA.Ode8C1H.ode	@ltx/gr_gr_cog/miscellanea:misc.Ode8
ltx/gr_gr_cog/me.m01.d27:meMA.Ode8C1H.text	@ltx/gr_gr_cog/he.h.m8:heHE.EvlogeitePaides.text
ltx/gr_gr_cog/me.m01.d27:meMA.Ode8C21.greekmelody	@ltx/gr_gr_cog/he.h.m8:heHE.OiTheorrimonesPaides.greekname
ltx/gr_gr_cog/me.m01.d27:meMA.Ode8C21.incipit	Ἡ θεοῤῥήμων σου γλῶσσα ἐν…
ltx/gr_gr_cog/me.m01.d27:meMA.Ode8C21.melody	@ltx/gr_gr_cog/he.h.m8:heHE.OiTheorrimonesPaides.name
ltx/gr_gr_cog/me.m01.d27:meMA.Ode8C21.mode	@ltx/gr_gr_cog/miscellanea:misc.Mode8
ltx/gr_gr_cog/me.m01.d27:meMA.Ode8C21.ode	@ltx/gr_gr_cog/miscellanea:misc.Ode8
ltx/gr_gr_cog/me.m01.d27:meMA.Ode8C21.text	Ἡ θεοῤῥήμων σου γλῶσσα ἐν τῷ κόσμῳ, ὥσπερ χρυσήλατος σάλπιγξ, ἐξ οὐρανοῦ ἀπηχήσασα, Ἱεράρχα Κυρίου, τὴν πλάνην ἀπήλασε.
ltx/gr_gr_cog/me.m01.d27:meMA.Ode8C22.incipit	Ἱερουργὲ τῶν ἀῤῥήτων μυστηρίων, μυστιπόλε…
ltx/gr_gr_cog/me.m01.d27:meMA.Ode8C22.melody	@ltx/gr_gr_cog/he.h.m8:heHE.OiTheorrimonesPaides.name
ltx/gr_gr_cog/me.m01.d27:meMA.Ode8C22.mode	@ltx/gr_gr_cog/miscellanea:misc.Mode8
ltx/gr_gr_cog/me.m01.d27:meMA.Ode8C22.ode	@ltx/gr_gr_cog/miscellanea:misc.Ode8
ltx/gr_gr_cog/me.m01.d27:meMA.Ode8C22.text	Ἱερουργὲ τῶν ἀῤῥήτων μυστηρίων, μυστιπόλε τῶν ἄνω, καὶ τῆς Τριάδος ὑπέρμαχε, ἱκετεύων, μὴ παύσῃ, σωθῆναι τὴν ποίμνην σου.
ltx/gr_gr_cog/me.m01.d27:meMA.Ode8C23.incipit	Ὡς τῇ Τριάδι λατρεύων Ἱεράρχα…
ltx/gr_gr_cog/me.m01.d27:meMA.Ode8C23.melody	@ltx/gr_gr_cog/he.h.m8:heHE.OiTheorrimonesPaides.name
ltx/gr_gr_cog/me.m01.d27:meMA.Ode8C23.mode	@ltx/gr_gr_cog/miscellanea:misc.Mode8
ltx/gr_gr_cog/me.m01.d27:meMA.Ode8C23.ode	@ltx/gr_gr_cog/miscellanea:misc.Ode8
ltx/gr_gr_cog/me.m01.d27:meMA.Ode8C23.text	Ὡς τῇ Τριάδι λατρεύων Ἱεράρχα, καὶ χορῷ τῶν Ἀγγέλων, συναυλιζόμενος Ὅσιε, ἱκετευων μὴ παύσῃ, σωθῆναι τοὺς δούλους σου.
ltx/gr_gr_cog/me.m01.d27:meMA.Ode8C2T.incipit	Ὑπερφυῶς ἐν γαστρί σου συλλαβοῦσα…
ltx/gr_gr_cog/me.m01.d27:meMA.Ode8C2T.melody	@ltx/gr_gr_cog/he.h.m8:heHE.OiTheorrimonesPaides.name
ltx/gr_gr_cog/me.m01.d27:meMA.Ode8C2T.mode	@ltx/gr_gr_cog/miscellanea:misc.Mode8
ltx/gr_gr_cog/me.m01.d27:meMA.Ode8C2T.ode	@ltx/gr_gr_cog/miscellanea:misc.Ode8
ltx/gr_gr_cog/me.m01.d27:meMA.Ode8C2T.text	Ὑπερφυῶς ἐν γαστρί σου συλλαβοῦσα, τὸν ἀγεώργητον βότρυν, Παρθενομῆτορ ἐβλάστησας· ἐπαξίως οὖν πάντες, τὸ χαῖρέ σοι κράζομεν.
ltx/gr_gr_cog/me.m01.d27:meMA.Ode8C31.greekmelody	@ltx/gr_gr_cog/he.h.m3:heHE.AstektoPyri.greekname
ltx/gr_gr_cog/me.m01.d27:meMA.Ode8C31.incipit	Μαστοῖς εὐσεβείας σε Πάτερ Ὅσιε…
ltx/gr_gr_cog/me.m01.d27:meMA.Ode8C31.melody	@ltx/gr_gr_cog/he.h.m3:heHE.AstektoPyri.name
ltx/gr_gr_cog/me.m01.d27:meMA.Ode8C31.mode	@ltx/gr_gr_cog/miscellanea:misc.Mode3
ltx/gr_gr_cog/me.m01.d27:meMA.Ode8C31.ode	@ltx/gr_gr_cog/miscellanea:misc.Ode8
ltx/gr_gr_cog/me.m01.d27:meMA.Ode8C31.text	Μαστοῖς εὐσεβείας σε Πάτερ Ὅσιε, τὴν θρέψασαν ἐκτρέφεις Ἐκκλησίαν, ἀπονέμων ἑπταπλασίῳ, ἄρτῳ θείας χάριτος, ταύτῃ θρέπτρα· γλεῦκος προχέων, ὡς πόμα δέ, τὸ τῶν ἰαμάτων, παμμάκαρ Χρυσόστομε.
ltx/gr_gr_cog/me.m01.d27:meMA.Ode8C32.incipit	Εἰς πᾶσαν τὴν γῆν ἐπεξῆλθε…
ltx/gr_gr_cog/me.m01.d27:meMA.Ode8C32.melody	@ltx/gr_gr_cog/he.h.m3:heHE.AstektoPyri.name
ltx/gr_gr_cog/me.m01.d27:meMA.Ode8C32.mode	@ltx/gr_gr_cog/miscellanea:misc.Mode3
ltx/gr_gr_cog/me.m01.d27:meMA.Ode8C32.ode	@ltx/gr_gr_cog/miscellanea:misc.Ode8
ltx/gr_gr_cog/me.m01.d27:meMA.Ode8C32.text	Εἰς πᾶσαν τὴν γῆν ἐπεξῆλθε, Πάτερ σου ὁ φθόγγος τῶν δογμάτων· ἀλλʼ ἡ ἔκφρων βασιλίς σε περιορίζειν, τοπικῶς ὑπείληφεν, ἀλλʼ ἐψεύσθη· σὺ γὰρ ὡς γίγας ὑψίδρομος, τὸ πᾶν περιλάμπεις, τῶν λόγων ταῖς ἀκτῖσι.
ltx/gr_gr_cog/me.m01.d27:meMA.Ode8C33.incipit	Λαμπρύνθητι σήμερον σύλλογος, Πιστῶν μέτ’…
ltx/gr_gr_cog/me.m01.d27:meMA.Ode8C33.melody	@ltx/gr_gr_cog/he.h.m3:heHE.AstektoPyri.name
ltx/gr_gr_cog/me.m01.d27:meMA.Ode8C33.mode	@ltx/gr_gr_cog/miscellanea:misc.Mode3
ltx/gr_gr_cog/me.m01.d27:meMA.Ode8C33.ode	@ltx/gr_gr_cog/miscellanea:misc.Ode8
ltx/gr_gr_cog/me.m01.d27:meMA.Ode8C33.text	Λαμπρύνθητι σήμερον σύλλογος, Πιστῶν μέτʼ εὐφροσύνης ὑπαντῶντες, τῷ προκρίτῳ τῶν διδασκάλων· ἥκει γὰρ ἐφέστηκε διανέμων, πᾶσι τὴν χάριν τὴν ἄφθονον, ἧς ἐμφορηθῶμεν, γηθόμενοι πλουσίως.
ltx/gr_gr_cog/me.m01.d27:meMA.Ode8C3T.incipit	Ὁρῶ σε Μητρὸς ἐν ἀγκάλαις…
ltx/gr_gr_cog/me.m01.d27:meMA.Ode8C3T.melody	@ltx/gr_gr_cog/he.h.m3:heHE.AstektoPyri.name
ltx/gr_gr_cog/me.m01.d27:meMA.Ode8C3T.mode	@ltx/gr_gr_cog/miscellanea:misc.Mode3
ltx/gr_gr_cog/me.m01.d27:meMA.Ode8C3T.ode	@ltx/gr_gr_cog/miscellanea:misc.Ode8
ltx/gr_gr_cog/me.m01.d27:meMA.Ode8C3T.text	Ὁρῶ σε Μητρὸς ἐν ἀγκάλαις, οἶδά σε δʼ ἀπρόσιτον Θεότητος τῇ φύσει· πῶς οὖν Λόγε χερσὶ κατέχῃ, ὃς χειρὶ τὴν σύμπασαν ἔχεις κτίσιν; ἔφη Συμεὼν Θεάνθρωπε, τὴν ἀπόῤῥητόν σου, δοξάζων δυναστείαν.
ltx/gr_gr_cog/me.m01.d27:meMA.Ode9C11.greekmelody	@ltx/gr_gr_cog/he.h.m8:heHE.EfrixePasaAkoi.greekname
ltx/gr_gr_cog/me.m01.d27:meMA.Ode9C11.incipit	Ἰδού σε πᾶσαι γενεαί, μακαρίζουσι…
ltx/gr_gr_cog/me.m01.d27:meMA.Ode9C11.melody	@ltx/gr_gr_cog/he.h.m8:heHE.EfrixePasaAkoi.name
ltx/gr_gr_cog/me.m01.d27:meMA.Ode9C11.mode	@ltx/gr_gr_cog/miscellanea:misc.Mode8
ltx/gr_gr_cog/me.m01.d27:meMA.Ode9C11.ode	@ltx/gr_gr_cog/miscellanea:misc.Ode9
ltx/gr_gr_cog/me.m01.d27:meMA.Ode9C11.text	Ἰδού σε πᾶσαι γενεαί, μακαρίζουσι, τὴν ἀειμακάριστον, ὡς προεφήτευσας, Θεογεννῆτορ ἐκ θείου Πνεύματος· καὶ ὡς τεκούσῃ τὴν χαράν, τὸ χαῖρε βοῶσί σοι. Χαῖρε ζωῆς θησαυρέ, χαῖρε κρήνη, ψυχικὸν μέλι βρύουσα.
ltx/gr_gr_cog/me.m01.d27:meMA.Ode9C12.incipit	Ὤρθωσας Δέσποινα Ἁγνή, τοῦ προπάτορος…
ltx/gr_gr_cog/me.m01.d27:meMA.Ode9C12.melody	@ltx/gr_gr_cog/he.h.m8:heHE.EfrixePasaAkoi.name
ltx/gr_gr_cog/me.m01.d27:meMA.Ode9C12.mode	@ltx/gr_gr_cog/miscellanea:misc.Mode8
ltx/gr_gr_cog/me.m01.d27:meMA.Ode9C12.ode	@ltx/gr_gr_cog/miscellanea:misc.Ode9
ltx/gr_gr_cog/me.m01.d27:meMA.Ode9C12.text	Ὤρθωσας Δέσποινα Ἁγνή, τοῦ προπάτορος Ἀδὰμ τὸ ὀλίσθημα, καὶ τῆς προμήτορος, Εὔας τὴν λύπην εἰς χαρὰν ἔτρεψας· ὡς οὖν αἰτία τῆς χαρᾶς, τὸ χαῖρε βοῶμέν σοι. Χαῖρε χαρὰ τῶν Πιστῶν. Χαῖρε τῶν Χριστιανῶν ἀγαλλίαμα.
ltx/gr_gr_cog/me.m01.d27:meMA.Ode9C13.incipit	Ἄξιον χαῖρέ σοι βοᾶν· ἐν…
ltx/gr_gr_cog/me.m01.d27:meMA.Ode9C13.melody	@ltx/gr_gr_cog/he.h.m8:heHE.EfrixePasaAkoi.name
ltx/gr_gr_cog/me.m01.d27:meMA.Ode9C13.mode	@ltx/gr_gr_cog/miscellanea:misc.Mode8
ltx/gr_gr_cog/me.m01.d27:meMA.Ode9C13.ode	@ltx/gr_gr_cog/miscellanea:misc.Ode9
ltx/gr_gr_cog/me.m01.d27:meMA.Ode9C13.text	Ἄξιον χαῖρέ σοι βοᾶν· ἐν σοὶ γὰρ οὐσιωδῶς ἡ ἀΐδιος, χαρὰ ἐσκήνωσε, Παρθένε Κόρη Θεογεννήτρια. Χαῖρε Παράδεισε τρυφῆς· χαῖρε ἡ χρυσόῤῥειθρος, ἀθανασίας πηγή, χαῖρε νέκταρ ἀληθὲς ἡ προχέουσα.
ltx/gr_gr_cog/me.m01.d27:meMA.Ode9C14.incipit	Νύσσει μου βέλει γλυκερῷ, τὴν…
ltx/gr_gr_cog/me.m01.d27:meMA.Ode9C14.melody	@ltx/gr_gr_cog/he.h.m8:heHE.EfrixePasaAkoi.name
ltx/gr_gr_cog/me.m01.d27:meMA.Ode9C14.mode	@ltx/gr_gr_cog/miscellanea:misc.Mode8
ltx/gr_gr_cog/me.m01.d27:meMA.Ode9C14.ode	@ltx/gr_gr_cog/miscellanea:misc.Ode9
ltx/gr_gr_cog/me.m01.d27:meMA.Ode9C14.text	Νύσσει μου βέλει γλυκερῷ, τὴν καρδίαν ὁ σὸς πόθος Πανύμνητε, καὶ ἐκβιάζει με· Χαῖρέ σοι κράζειν διὰ παντὸς καὶ βοᾶν· Χαῖρε γαλήνιε λιμήν· χαῖρε ἡ ποντίσασα, τὸν νοητὸν Φαραώ, γλυκυτάτη εὐδιάβατος θάλασσα.
ltx/gr_gr_cog/me.m01.d27:meMA.Ode9C1H.greekmelody	@ltx/gr_gr_cog/he.h.m8:heHE.EfrixePasaAkoi.greekname
ltx/gr_gr_cog/me.m01.d27:meMA.Ode9C1H.incipit	@ltx/gr_gr_cog/he.h.m8:heHE.EfrixePasaAkoi.incipit
ltx/gr_gr_cog/me.m01.d27:meMA.Ode9C1H.melody	@ltx/gr_gr_cog/he.h.m8:heHE.EfrixePasaAkoi.melody
ltx/gr_gr_cog/me.m01.d27:meMA.Ode9C1H.mode	@ltx/gr_gr_cog/miscellanea:misc.Mode8
ltx/gr_gr_cog/me.m01.d27:meMA.Ode9C1H.ode	@ltx/gr_gr_cog/miscellanea:misc.Ode9
ltx/gr_gr_cog/me.m01.d27:meMA.Ode9C1H.text	@ltx/gr_gr_cog/he.h.m8:heHE.EfrixePasaAkoi.text
ltx/gr_gr_cog/me.m01.d27:meMA.Ode9C21.greekmelody	@ltx/gr_gr_cog/he.h.m8:heHE.TonProdilothenta.greekname
ltx/gr_gr_cog/me.m01.d27:meMA.Ode9C21.incipit	Ἄλλος χρυσοῤῥόας, ἐφάνης πάγχρυσε Πάτερ…
ltx/gr_gr_cog/me.m01.d27:meMA.Ode9C21.melody	@ltx/gr_gr_cog/he.h.m8:heHE.TonProdilothenta.name
ltx/gr_gr_cog/me.m01.d27:meMA.Ode9C21.mode	@ltx/gr_gr_cog/miscellanea:misc.Mode8
ltx/gr_gr_cog/me.m01.d27:meMA.Ode9C21.ode	@ltx/gr_gr_cog/miscellanea:misc.Ode9
ltx/gr_gr_cog/me.m01.d27:meMA.Ode9C21.text	Ἄλλος χρυσοῤῥόας, ἐφάνης πάγχρυσε Πάτερ· τὸ χρυσοῦν γὰρ στόμα, καὶ ἡ γλυκεῖά σου γλῶσσα, πλημμυροῦσι τῷ τῶν δογμάτων πελάγει, καὶ ψυχὰς αὐχμώσας καταρδεύουσι.
ltx/gr_gr_cog/me.m01.d27:meMA.Ode9C22.incipit	Θάλασσαν ὑπάρχουσαν, ἀδιάβατον Πάτερ τὴν…
ltx/gr_gr_cog/me.m01.d27:meMA.Ode9C22.melody	@ltx/gr_gr_cog/he.h.m8:heHE.TonProdilothenta.name
ltx/gr_gr_cog/me.m01.d27:meMA.Ode9C22.mode	@ltx/gr_gr_cog/miscellanea:misc.Mode8
ltx/gr_gr_cog/me.m01.d27:meMA.Ode9C22.ode	@ltx/gr_gr_cog/miscellanea:misc.Ode9
ltx/gr_gr_cog/me.m01.d27:meMA.Ode9C22.text	Θάλασσαν ὑπάρχουσαν, ἀδιάβατον Πάτερ τὴν Γραφὴν βατήν, καὶ πλευστὴν ἀπειργάσω τῷ κόσμω, τῷ ἱστίῳ ἀναπετάσας τοῦ λόγου, καὶ πρὸς γνῶσιν ἄκλυστον ἐλάσας τὸν νοῦν.
ltx/gr_gr_cog/me.m01.d27:meMA.Ode9C23.incipit	Σὺ τῆς ἀκενώτου πηγῆς, ἀντλήσας…
ltx/gr_gr_cog/me.m01.d27:meMA.Ode9C23.melody	@ltx/gr_gr_cog/he.h.m8:heHE.TonProdilothenta.name
ltx/gr_gr_cog/me.m01.d27:meMA.Ode9C23.mode	@ltx/gr_gr_cog/miscellanea:misc.Mode8
ltx/gr_gr_cog/me.m01.d27:meMA.Ode9C23.ode	@ltx/gr_gr_cog/miscellanea:misc.Ode9
ltx/gr_gr_cog/me.m01.d27:meMA.Ode9C23.text	Σὺ τῆς ἀκενώτου πηγῆς, ἀντλήσας τὰ ῥεῖθρα, ποταμοὺς δογμάτων, τῇ Ἐκκλησίᾳ προχέεις, ἐξ ὦν ἅπαντες οἱ διψῶντες ἀντλοῦμεν, νάματα χρυσόῤῥειθρα Χρυσόστομε.
ltx/gr_gr_cog/me.m01.d27:meMA.Ode9C2T.incipit	Βάτον καιομένην πυρί, καὶ μὴ…
ltx/gr_gr_cog/me.m01.d27:meMA.Ode9C2T.melody	@ltx/gr_gr_cog/he.h.m8:heHE.TonProdilothenta.name
ltx/gr_gr_cog/me.m01.d27:meMA.Ode9C2T.mode	@ltx/gr_gr_cog/miscellanea:misc.Mode8
ltx/gr_gr_cog/me.m01.d27:meMA.Ode9C2T.ode	@ltx/gr_gr_cog/miscellanea:misc.Ode9
ltx/gr_gr_cog/me.m01.d27:meMA.Ode9C2T.text	Βάτον καιομένην πυρί, καὶ μὴ φλεγομένην, προσεώρα πάλαι, Μωσῆς Θεομῆτορ Παρθένε, τὴν θεόδεκτον προτυπῶν σου γαστέρα, ὑποδεξαμένην τὸ ἀκήρατον πῦρ.
ltx/gr_gr_cog/me.m01.d27:meMA.Ode9C31.greekmelody	@ltx/gr_gr_cog/he.h.m3:heHE.KainonToThavma.greekname
ltx/gr_gr_cog/me.m01.d27:meMA.Ode9C31.incipit	Στρατὸς Ἀγγέλων, δῆμος Προφητῶν, Ἀποστόλων…
ltx/gr_gr_cog/me.m01.d27:meMA.Ode9C31.melody	@ltx/gr_gr_cog/he.h.m3:heHE.KainonToThavma.name
ltx/gr_gr_cog/me.m01.d27:meMA.Ode9C31.mode	@ltx/gr_gr_cog/miscellanea:misc.Mode3
ltx/gr_gr_cog/me.m01.d27:meMA.Ode9C31.ode	@ltx/gr_gr_cog/miscellanea:misc.Ode9
ltx/gr_gr_cog/me.m01.d27:meMA.Ode9C31.text	Στρατὸς Ἀγγέλων, δῆμος Προφητῶν, Ἀποστόλων τε καὶ τῶν Μαρτύρων θεῖος χορός, ἡμῖν συναγάλλονται φαιδρῶς κοινωνοῦντες, τῆς Ἑορτῆς Παμμάκαρ, καὶ τὸν ὕμνον τῶν σῶν, οἰκείαν ἡγούμενοι τὴν χάριν· πάντων γὰρ ἔσχες, ἐν σοὶ τὸν βίον ἀποματτόμενος.
ltx/gr_gr_cog/me.m01.d27:meMA.Ode9C32.incipit	Ἰδοὺ τοῦ κόσμου ἔλαμψε τὸ…
ltx/gr_gr_cog/me.m01.d27:meMA.Ode9C32.melody	@ltx/gr_gr_cog/he.h.m3:heHE.KainonToThavma.name
ltx/gr_gr_cog/me.m01.d27:meMA.Ode9C32.mode	@ltx/gr_gr_cog/miscellanea:misc.Mode3
ltx/gr_gr_cog/me.m01.d27:meMA.Ode9C32.ode	@ltx/gr_gr_cog/miscellanea:misc.Ode9
ltx/gr_gr_cog/me.m01.d27:meMA.Ode9C32.text	Ἰδοὺ τοῦ κόσμου ἔλαμψε τὸ φῶς, ὁ πανύψηλος ἐναπέφηνε θεῖος πυρσός, τὸ γλυκύῤῥουν πέλαγος, τῶν θείων χαρίτων· ἐμφορηθῶμεν δεῦτε τοῦ φωτὸς ἀδελφοί, θαλφθῶμεν, ἀρδεύσωμεν καρδίας, ᾄσμασι πάντες, τὸν χρυσοῤῥήμονα μεγαλύνοντες.
ltx/gr_gr_cog/me.m01.d27:meMA.Ode9C33.incipit	Ὡς ὀβολούς σοι δύω τὴν…
ltx/gr_gr_cog/me.m01.d27:meMA.Ode9C33.melody	@ltx/gr_gr_cog/he.h.m3:heHE.KainonToThavma.name
ltx/gr_gr_cog/me.m01.d27:meMA.Ode9C33.mode	@ltx/gr_gr_cog/miscellanea:misc.Mode3
ltx/gr_gr_cog/me.m01.d27:meMA.Ode9C33.ode	@ltx/gr_gr_cog/miscellanea:misc.Ode9
ltx/gr_gr_cog/me.m01.d27:meMA.Ode9C33.text	Ὡς ὀβολούς σοι δύω τὴν ᾠδήν, ἀπόρου μου καὶ δειλαίας Παμμάκαρ ψυχῆς, ἀγαθῶν παντοίων μέν, οἰκτρῶς χηρευούσης, πόθου δὲ θείου πλούτῳ προσαγαγούσης αὐτήν, χρηστότητος μίμημα τῆς θείας, δέχοιο χάριν, ἀντιβραβεύων μοι πλουσιόδωρον.
ltx/gr_gr_cog/me.m01.d27:meMA.Ode9C3T.incipit	Βαδίζων τρέμω, ἔφη Συμεών· τὸν…
ltx/gr_gr_cog/me.m01.d27:meMA.Ode9C3T.melody	@ltx/gr_gr_cog/he.h.m3:heHE.KainonToThavma.name
ltx/gr_gr_cog/me.m01.d27:meMA.Ode9C3T.mode	@ltx/gr_gr_cog/miscellanea:misc.Mode3
ltx/gr_gr_cog/me.m01.d27:meMA.Ode9C3T.ode	@ltx/gr_gr_cog/miscellanea:misc.Ode9
ltx/gr_gr_cog/me.m01.d27:meMA.Ode9C3T.text	Βαδίζων τρέμω, ἔφη Συμεών· τὸν σαλεύοντα τῇ προσβλέψει δὲ πᾶσαν τὴν γῆν, κατέχων ῥωννύομαι, σὸν τόκον Παρθένε, τῆς τρομερᾶς σαρκὸς δʼ ἀπολυόμενος, χρησμῶν μοι τῶν θείων ἀποβάντων, χαίρων κομίζω καὶ τοῖς ἐν ᾇδῃ, λύτρον τὰ εὐαγγέλια.
ltx/gr_gr_cog/me.m01.d27:meMA.Oikos1.text	Ἡ λαμπάς, ἡ τῶν ἔργων μου στυγνὴ πέφυκεν, Ἰωάννη Χρυσόστομε, καὶ δειλιῶ πρὸς ὑπάντησιν τοῦ ἱεροῦ σου σκήνους· ἀλλʼ αὐτός με ὁδήγησον, καὶ τὰς τρίβους μου εὔθυνον, μετανοίας παρέχων μοι καιρὸν πανάγιε, ὡς αὐτῆς κήρυξ ἔνθεος, καὶ τῶν παθῶν μου τῶν πολυτρόπων κατεύνασον ζάλην· καὶ παγίδων τοῦ Βελίαρ ἀφαρπάσας με, εἰς τέλος σῶσόν με, ὅπως ὑμνῶ σου ἀξίως τὴν θείαν ἐπάνοδον, ὡς πρὶν καὶ τὴν κοίμησιν τολμήσας ἐδόξασα, Ἰωάννη Χρυσοστομε.
ltx/gr_gr_cog/me.m01.d27:meMA.PostGospelBoth.incipit	@ltx/gr_gr_cog/ho.ho03:hoMA.PostGospelTheotokos.incipit
ltx/gr_gr_cog/me.m01.d27:meMA.PostGospelBoth.melody	
ltx/gr_gr_cog/me.m01.d27:meMA.PostGospelBoth.mode	@ltx/gr_gr_cog/miscellanea:misc.Mode2
ltx/gr_gr_cog/me.m01.d27:meMA.PostGospelBoth.text	@ltx/gr_gr_cog/ho.ho03:hoMA.PostGospelTheotokos.text
ltx/gr_gr_cog/me.m01.d27:meMA.PostGospelGlory.incipit	Σήμερον σκιρτῶσιν ἐν Πνεύματι, Ἀρχιερέων…
ltx/gr_gr_cog/me.m01.d27:meMA.PostGospelGlory.melody	
ltx/gr_gr_cog/me.m01.d27:meMA.PostGospelGlory.mode	@ltx/gr_gr_cog/miscellanea:misc.Mode2
ltx/gr_gr_cog/me.m01.d27:meMA.PostGospelGlory.text	Σήμερον σκιρτῶσιν ἐν Πνεύματι, Ἀρχιερέων δῆμοι, σὺν ἡμῖν τελοῦντές σου τὴν μνήμην Ἱεράρχα, Χρυσόστομε Ὅσιε, φωστὴρ τῆς Ἐκκλησίας.
ltx/gr_gr_cog/me.m01.d27:meMA.PostGospelIdiomelon.incipit	Σάλπιγξ χρυσόφωνος ἀνεδείχθης, χρυσοῤῥῆμον Χρυσόστομε…
ltx/gr_gr_cog/me.m01.d27:meMA.PostGospelIdiomelon.melody	
ltx/gr_gr_cog/me.m01.d27:meMA.PostGospelIdiomelon.mode	@ltx/gr_gr_cog/miscellanea:misc.Mode6
ltx/gr_gr_cog/me.m01.d27:meMA.PostGospelIdiomelon.text	Σάλπιγξ χρυσόφωνος ἀνεδείχθης, χρυσοῤῥῆμον Χρυσόστομε, χρυσουργῶν τὰς καρδίας τῶν πιστῶν, τοῖς χρυσεπόνοις σου διδάγμασι· προφητικῶς γὰρ ἐξῆλθεν ὁ φθόγγος τῶν δογμάτων σου, Ὅσιε Πάτερ, καὶ κόσμου παντὸς τὰ πέρατα ἐφώτισεν.
ltx/gr_gr_cog/me.m01.d27:meVE.Apolytikion1.incipit	@ltx/gr_gr_cog/me.m11.d13:meVE.Apolytikion1.incipit
ltx/gr_gr_cog/me.m01.d27:meVE.Apolytikion1.melody	
ltx/gr_gr_cog/me.m01.d27:meVE.Apolytikion1.mode	@ltx/gr_gr_cog/miscellanea:misc.Mode8
ltx/gr_gr_cog/me.m01.d27:meVE.Apolytikion1.text	@ltx/gr_gr_cog/me.m11.d13:meVE.Apolytikion1.text
ltx/gr_gr_cog/me.m01.d27:meVE.AposGlory.incipit	@ltx/gr_gr_cog/me.m11.d13:meVE.SticGlory.incipit
ltx/gr_gr_cog/me.m01.d27:meVE.AposGlory.melody	
ltx/gr_gr_cog/me.m01.d27:meVE.AposGlory.mode	@ltx/gr_gr_cog/miscellanea:misc.Mode6
ltx/gr_gr_cog/me.m01.d27:meVE.AposGlory.text	@ltx/gr_gr_cog/me.m11.d13:meVE.SticGlory.text
ltx/gr_gr_cog/me.m01.d27:meVE.AposTheotokion.incipit	@ltx/gr_gr_cog/he.o:heOT.TheotokeSyEi.incipit
ltx/gr_gr_cog/me.m01.d27:meVE.AposTheotokion.melody	@ltx/gr_gr_cog/he.o:heOT.TheotokeSyEi.name
ltx/gr_gr_cog/me.m01.d27:meVE.AposTheotokion.mode	@ltx/gr_gr_cog/miscellanea:misc.Mode6
ltx/gr_gr_cog/me.m01.d27:meVE.AposTheotokion.text	@ltx/gr_gr_cog/he.o:heOT.TheotokeSyEiIerarchou.text
ltx/gr_gr_cog/me.m01.d27:meVE.Aposticha1.greekmelody	@ltx/gr_gr_cog/he.a.m5:heAU.ChairoisAskitikon.greekname
ltx/gr_gr_cog/me.m01.d27:meVE.Aposticha1.incipit	Χαίρει ἡ Ἐκκλησία Χριστοῦ, ἐπὶ…
ltx/gr_gr_cog/me.m01.d27:meVE.Aposticha1.melody	@ltx/gr_gr_cog/he.a.m5:heAU.ChairoisAskitikon.name
ltx/gr_gr_cog/me.m01.d27:meVE.Aposticha1.mode	@ltx/gr_gr_cog/miscellanea:misc.Mode5
ltx/gr_gr_cog/me.m01.d27:meVE.Aposticha1.text	Χαίρει ἡ Ἐκκλησία Χριστοῦ, ἐπὶ λυχνίας Ἱερὰς κατοπτεύουσα, τὸν λύχνον τὸν φωτοφόρον, ὃν καθελόντες ἐχθροί, τῆς σιγῆς μοδίῳ συγκατέκρυψαν. Τιμᾷ ἐπὶ ὄρους σε, τῶν ἀρετῶν Πάτερ Ὅσιε, πυρσὸν ὡς θεῖον, οἰκουμένης τὰ πέρατα, ὑπὲρ ἥλιον, ἀπαστράπτοντα θαύμασι. Σήμερον ἡ ἀδέκαστος, Θεοῦ κρίσις δείκνυσι, δικαιοσύνην ἐξ ὕψους, ὡς μεσημβρίαν ὑπέρφωτον, τὴν σὴν καὶ παρέχει, τοῖς ἐν κόσμῳ τὴν εἰρήνην, καὶ μέγα ἔλεος.
ltx/gr_gr_cog/me.m01.d27:meVE.Aposticha2.incipit	Βρύει ὡς μυροθήκη τερπνή, τὰ…
ltx/gr_gr_cog/me.m01.d27:meVE.Aposticha2.melody	@ltx/gr_gr_cog/he.a.m5:heAU.ChairoisAskitikon.name
ltx/gr_gr_cog/me.m01.d27:meVE.Aposticha2.mode	@ltx/gr_gr_cog/miscellanea:misc.Mode5
ltx/gr_gr_cog/me.m01.d27:meVE.Aposticha2.text	Βρύει ὡς μυροθήκη τερπνή, τὰ τῶν θαυμάτων θεῖα ῥεῖθρα Χρυσόστομε, ἡ λάρναξ ἡ σὴ ἐν κόσμῳ, καὶ ἰαμάτων ῥοαῖς, τὰς ψυχὰς μυρίζει τῶν τιμώντων σε· Χριστοῦ τῶν χαρίτων γάρ, τοῖς ἀΰλοις ἀρώμασι, καταπλουτήσας, εὐωδίαν δεδώρησαι, τὴν ἀείζωον, τοῖς ἐν πίστει προστρέχουσιν· ὅθεν καταπολαύοντες, χαρίτων σῶν Πάνσοφε, καὶ τῶν ἀχράντων καὶ θείων, κατατρυφῶντες λειψάνων σου, πιστῶς ἐξαιτοῦμεν, ταῖς ψυχαῖς ἡμῶν δοθῆναι, τὸ μέγα ἔλεος.
ltx/gr_gr_cog/me.m01.d27:meVE.Aposticha3.incipit	Κόσμου ὁ σιτομέτρης πιστοί, ὁ…
ltx/gr_gr_cog/me.m01.d27:meVE.Aposticha3.melody	@ltx/gr_gr_cog/he.a.m5:heAU.ChairoisAskitikon.name
ltx/gr_gr_cog/me.m01.d27:meVE.Aposticha3.mode	@ltx/gr_gr_cog/miscellanea:misc.Mode5
ltx/gr_gr_cog/me.m01.d27:meVE.Aposticha3.text	Κόσμου ὁ σιτομέτρης πιστοί, ὁ ἐν τρυφῇ τῇ οὐρανίᾳ τοῦ Πνεύματος, καρδίας ἐκτρέφων πάντων, οὐκ ἐξ Αἰγύπτου χωρεῖ, Ἰωσὴφ δὲ νέος προδεικνύμενος, σεπτοῖς ἐν λειψάνοις, ἀπὸ Κομάνων μετάγεται, δεινῶν τὴν ζάλην, καὶ τὸ πέλαγος σήμερον, τὸ τῶν θλίψεων, διατέμνων ἐντεύξεσι. Τοῦτον οὖν μακαρίσωμεν, καὶ πίστει βοήσωμεν. Πάρεσο Μάκαρ ἐν μέσῳ, τῶν ἐκτελούντων τὴν μνήμην σου, αὐτοῖς σωτηρίαν, παρεχόμενος πλουσίως, καὶ τὸ μέγα ἔλεος.
ltx/gr_gr_cog/me.m01.d27:meVE.SticGlory.incipit	Οὐκ ἔδει σε Χρυσόστομε, τὴν…
ltx/gr_gr_cog/me.m01.d27:meVE.SticGlory.melody	
ltx/gr_gr_cog/me.m01.d27:meVE.SticGlory.mode	@ltx/gr_gr_cog/miscellanea:misc.Mode4
ltx/gr_gr_cog/me.m01.d27:meVE.SticGlory.poet	Κοσμᾶ Μοναχοῦ τοῦ Βεστίτορος.
ltx/gr_gr_cog/me.m01.d27:meVE.SticGlory.text	Οὐκ ἔδει σε Χρυσόστομε, τὴν Βασιλίδα καταλείψαντα, παροικεῖν ἐν Κομάνοις· ὅθεν θεόθεν ἠγμένη, ἡ Ἀνακτορικὴ πανδαισία, πάλιν σε ἐπανήγαγεν ἐν τοῖς βασιλείοις· εὐφράνθη δὲ ἡ Ἐκκλησία ἰδοῦσά σε, ἀνθομολογουμένη καὶ λέγουσα. Μεγαλύνει ἡ δόξα μου τὸν Κύριον, ἀποδόντα μοι τὸν νυμφαγωγόν, καὶ τὸ στήριγμα τῆς πίστεως, τὴν ὑπόληψιν τῶν ἀξιωμάτων μου, καὶ ἀνάπαυσιν τῶν ἐμῶν κροτάφων· τὸ ὕψος τῆς ταπεινοφροσύνης, καὶ βάθος τῆς ἐλεημοσύνης, καὶ πλοῦτον τῆς ἐμῆς πτωχείας, καὶ μῆκος τῆς μετανοίας. Διὸ αἰτοῦμέν σε Ὅσιε Πάτερ, τὴν εἰρήνην αἴτησαι, καὶ ταῖς ψυχαῖς ἡμῶν, τὸ μέγα ἔλεος.
ltx/gr_gr_cog/me.m01.d27:meVE.SticTheotokion.incipit	@ltx/gr_gr_cog/oc.m4.d1:ocVE.SticTheotokion.incipit
ltx/gr_gr_cog/me.m01.d27:meVE.SticTheotokion.melody	
ltx/gr_gr_cog/me.m01.d27:meVE.SticTheotokion.mode	@ltx/gr_gr_cog/miscellanea:misc.Mode4
ltx/gr_gr_cog/me.m01.d27:meVE.SticTheotokion.text	@ltx/gr_gr_cog/oc.m4.d1:ocVE.SticTheotokion.text
ltx/gr_gr_cog/me.m01.d27:meVE.Stichera01.greekmelody	@ltx/gr_gr_cog/he.a.m4:heAU.OsGennaionEnMartysi.greekname
ltx/gr_gr_cog/me.m01.d27:meVE.Stichera01.incipit	Τὴν χρυσήλατον σάλπιγγα…
ltx/gr_gr_cog/me.m01.d27:meVE.Stichera01.melody	@ltx/gr_gr_cog/he.a.m4:heAU.OsGennaionEnMartysi.name
ltx/gr_gr_cog/me.m01.d27:meVE.Stichera01.mode	@ltx/gr_gr_cog/miscellanea:misc.Mode4
ltx/gr_gr_cog/me.m01.d27:meVE.Stichera01.text	Τὴν χρυσήλατον σάλπιγγα, τὸ θεόπνευστον ὄργανον, τῶν δογμάτων πέλαγος ἀνεξάντλητον, τῆς Ἐκκλησίας τὸ στήριγμα, τὸν νοῦν τὸν οὐράνιον, τῆς σοφίας τὸν βυθόν, τὸν κρατῆρα τὸν πάγχρυσον, τὸν προχέοντα, ποταμοὺς διδαγμάτων μελιῤῥύτων, καὶ ἀρδεύοντα τὴν κτίσιν, μελῳδικῶς εὐφημήσωμεν.
ltx/gr_gr_cog/me.m01.d27:meVE.Stichera02.incipit	Τὸν ἀστέρα τὸν ἄδυτον…
ltx/gr_gr_cog/me.m01.d27:meVE.Stichera02.melody	@ltx/gr_gr_cog/he.a.m4:heAU.OsGennaionEnMartysi.name
ltx/gr_gr_cog/me.m01.d27:meVE.Stichera02.mode	@ltx/gr_gr_cog/miscellanea:misc.Mode4
ltx/gr_gr_cog/me.m01.d27:meVE.Stichera02.text	Τὸν ἀστέρα τὸν ἄδυτον, τὸν ἀκτῖσι φωτίζοντα, διδαγμάτων ἅπασαν τὴν ὑφήλιον· τῆς μετανοίας τὸν κήρυκα, τὸν σπόγγον τὸν πάγχρυσον, τὸν ὑγρότητα δεινῆς, ἀπογνώσεως αἴροντα, καὶ δροσίζοντα, ἐκτακείσας καρδίας ἁμαρτίαις, Ἰωάννην ἐπαξίως, τὸν Χρυσολόγον τιμήσωμεν.
ltx/gr_gr_cog/me.m01.d27:meVE.Stichera03.incipit	Ὁ ἐπίγειος ἄγγελος…
ltx/gr_gr_cog/me.m01.d27:meVE.Stichera03.melody	@ltx/gr_gr_cog/he.a.m4:heAU.OsGennaionEnMartysi.name
ltx/gr_gr_cog/me.m01.d27:meVE.Stichera03.mode	@ltx/gr_gr_cog/miscellanea:misc.Mode4
ltx/gr_gr_cog/me.m01.d27:meVE.Stichera03.text	Ὁ ἐπίγειος ἄγγελος, καὶ οὐράνιος ἄνθρωπος, χελιδὼν ἡ εὔλαλος καὶ πολύφωνος, τῶν ἀρετῶν τὸ θησαύρισμα, ἡ πέτρα ἡ ἄῤῥηκτος, τῶν πιστῶν ὑπογραμμός, τῶν Μαρτύρων ἐφάμιλλος, ἰσοστάσιος, τῶν ἁγίων Ἀγγέλων Ἀποστόλων, ὁ ὁμότροπος ἐν ὕμνοις, μεγαλυνέσθω Χρυσόστομος.
ltx/gr_gr_cog/me.m01.d27:meVE.Stichera04.greekmelody	@ltx/gr_gr_cog/he.a.m4:heAU.OExYpsistouKlitheis.greekname
ltx/gr_gr_cog/me.m01.d27:meVE.Stichera04.incipit	Ἱερωτάτην στησώμεθα χορείαν…
ltx/gr_gr_cog/me.m01.d27:meVE.Stichera04.melody	@ltx/gr_gr_cog/he.a.m4:heAU.OExYpsistouKlitheis.name
ltx/gr_gr_cog/me.m01.d27:meVE.Stichera04.mode	@ltx/gr_gr_cog/miscellanea:misc.Mode4
ltx/gr_gr_cog/me.m01.d27:meVE.Stichera04.text	Ἱερωτάτην στησώμεθα χορείαν· στέφος γὰρ χρυσόμορφον, τῆς Ἐκκλησίας Χριστοῦ, βασιλικῇ δόξῃ σήμερον, ἀπὸ Κομάνων, πρὸς πόλιν ἥκει τὴν Βασιλεύουσαν, λάμπει στίλβον ἄνωθεν, τῇ ἐπανόδῳ αὐτοῦ, πρὸς βασιλείαν τὴν ἄϋλον, πιστοὺς εἰσάγει, καὶ τῷ τῶν ὅλων προσοικειοῖ Βασιλεῖ· διὸ βοῶμεν· Χρυσεπώνυμε, Πάτερ θεῖε Χρυσόστομε πάγχρυσε, καθικέτευε σῶσαι, καὶ φωτίσαι τὰς ψυχὰς ἡμῶν.
ltx/gr_gr_cog/me.m01.d27:meVE.Stichera05.incipit	Ὡς οὐρανὸς φαεινὸς τῆς Ἐκκλησίας…
ltx/gr_gr_cog/me.m01.d27:meVE.Stichera05.melody	@ltx/gr_gr_cog/he.a.m4:heAU.OExYpsistouKlitheis.name
ltx/gr_gr_cog/me.m01.d27:meVE.Stichera05.mode	@ltx/gr_gr_cog/miscellanea:misc.Mode4
ltx/gr_gr_cog/me.m01.d27:meVE.Stichera05.text	Ὡς οὐρανὸς φαεινὸς τῆς Ἐκκλησίας, δύσιν ὦ Χρυσόστομε τὴν ὑπερόριον, καθυποστὰς ἀπηνέστατα, ἐπανατέλλεις, σήμερον χαίρων τῇ κτίσει ἄδυτος· θάλπεις ἐγκοσμούμενος, θαυμάτων ἄστροις σοφέ, φέρεις Χριστὸν ὑπερλάμποντα, ἡλίου δίκην, σοῦ δᾳδουχοῦντα νῦν τὴν ἐπάνοδον· διὸ βοῶμεν· Φωταυγέστατε, φωτολόγε Χρυσόστομε πάνσοφε, καθικέτευε σῶσαι, καὶ φωτίσαι τὰς ψυχὰς ἡμῶν.
ltx/gr_gr_cog/me.m01.d27:meVE.Stichera06.incipit	Νῦν οὐρανὸς τοῖς Ἀγγέλοις…
ltx/gr_gr_cog/me.m01.d27:meVE.Stichera06.melody	@ltx/gr_gr_cog/he.a.m4:heAU.OExYpsistouKlitheis.name
ltx/gr_gr_cog/me.m01.d27:meVE.Stichera06.mode	@ltx/gr_gr_cog/miscellanea:misc.Mode4
ltx/gr_gr_cog/me.m01.d27:meVE.Stichera06.text	Νῦν οὐρανὸς τοῖς Ἀγγέλοις συγχορεύει, κτίσει συνευφραίνονται, βροτῶν συστήματα· ὁ γὰρ ἐν γῇ οὐρανόφρονας, δεικνὺς τοὺς πάντας, κλίμακι θείᾳ, σεπτῶν ῥημάτων αὐτοῦ· οὗτος τὴν ἐπάνοδον, τῶν θεοδρόμων βαθμῶν, ὡς, Ἰακὼβ νέος δείκνυσιν, Ἀγγέλων θείων, ἀγαλλομένων τῇ μεταθέσει αὐτοῦ· διὸ βοῶμεν, Παμμακάριστε, τῶν ἀΰλων Ἀγγέλων συνόμιλε, Χρυσολόγε δυσώπει, τοῦ σωθῆναι τὰς ψυχὰς ἡμῶν.
