ltx/gr_gr_cog/le.ep.mc.d192:lemcLI.Epistle.book_abbr	@ltx/gr_gr_cog/bible:Corinthians2.abbr
ltx/gr_gr_cog/le.ep.mc.d192:lemcLI.Epistle.book_string	@ltx/gr_gr_cog/bible:Corinthians2.text
ltx/gr_gr_cog/le.ep.mc.d192:lemcLI.Epistle.chapverse	2:14 – 17; 3:1 – 3
ltx/gr_gr_cog/le.ep.mc.d192:lemcLI.Epistle.incipit	Τῷ Θεῷ χάρις τῷ πάντοτε θριαμβεύοντι…
ltx/gr_gr_cog/le.ep.mc.d192:lemcLI.Epistle.text	Ἀδελφοί, τῷ Θεῷ χάρις τῷ πάντοτε θριαμβεύοντι ἡμᾶς ἐν τῷ Χριστῷ καὶ τὴν ὀσμὴν τῆς γνώσεως αὐτοῦ φανεροῦντι δι᾿ ἡμῶν ἐν παντὶ τόπῳ· ὅτι Χριστοῦ εὐωδία ἐσμὲν τῷ Θεῷ ἐν τοῖς σῳζομένοις καὶ ἐν τοῖς ἀπολλυμένοις, οἷς μὲν ὀσμὴ θανάτου εἰς θάνατον, οἷς δὲ ὀσμὴ ζωῆς εἰς ζωήν. καὶ πρὸς ταῦτα τίς ἱκανός; οὐ γάρ ἐσμεν ὡς οἱ λοιποὶ καπηλεύοντες τὸν λόγον τοῦ Θεοῦ, ἀλλ᾿ ὡς ἐξ εἰλικρινείας, ἀλλ᾿ ὡς ἐκ Θεοῦ κατενώπιον τοῦ Θεοῦ ἐν Χριστῷ λαλοῦμεν. Ἀρχόμεθα πάλιν ἑαυτοὺς συνιστάνειν; εἰ μὴ χρῄζομεν ὥς τινες συστατικῶν ἐπιστολῶν πρὸς ὑμᾶς ἢ ἐξ ὑμῶν συστατικῶν; ἡ ἐπιστολὴ ἡμῶν ὑμεῖς ἐστε, ἐγγεγραμμένη ἐν ταῖς καρδίαις ἡμῶν, γινωσκομένη καὶ ἀναγινωσκομένη ὑπὸ πάντων ἀνθρώπων, φανερούμενοι ὅτι ἐστὲ ἐπιστολὴ Χριστοῦ διακονηθεῖσα ὑφ᾿ ἡμῶν, ἐγγεγραμμένη οὐ μέλανι, ἀλλὰ Πνεύματι Θεοῦ ζῶντος, οὐκ ἐν πλαξὶ λιθίναις, ἀλλὰ ἐν πλαξὶ καρδίαις σαρκίναις.
ltx/gr_gr_cog/le.ep.mc.d192:lemcLI.Epistle.title	Τῇ Τρίτῃ τῆς ΙΑʹ Ἑβδομάδος
ltx/gr_gr_cog/le.ep.mc.d192:lemcLI.Epistle.title_abbr	Τρίτῃ τῆς ΙΑʹ Ἑβδομάδος
ltx/gr_gr_cog/le.ep.mc.d192:lemcLI.Epistle.version	@ltx/gr_gr_cog/properties:version.designation
