ltx/gr_gr_cog/le.pr.me.r77:leprVE.reading.book_abbr	@ltx/gr_gr_cog/bible:Numbers.abbr
ltx/gr_gr_cog/le.pr.me.r77:leprVE.reading.book_string	@ltx/gr_gr_cog/bible:Numbers.text
ltx/gr_gr_cog/le.pr.me.r77:leprVE.reading.chapverse	θʼ 15 – 23
ltx/gr_gr_cog/le.pr.me.r77:leprVE.reading.incipit	Καὶ ἐγένετο τῇ ἡμέρᾳ ᾗ ἐστάθη ἡ σκηνή, ἐκάλυψεν…
ltx/gr_gr_cog/le.pr.me.r77:leprVE.reading.text	Καὶ ἐγένετο τῇ ἡμέρᾳ ᾗ ἐστάθη ἡ σκηνή, ἐκάλυψεν ἡ νεφέλῃ τὴν σκηνήν, τὸν οἶκον τοῦ μαρτυρίου. Καὶ τὸ ἑσπέρας ἦν ἐπὶ τῆς σκηνῆς ὡς εἶδος πυρὸς ἕως πρωί. Οὕτως ἐγίνετο διαπαντός· ἡ νεφέλη ἐκάλυπτεν αὐτὴν ἡμέρας, καὶ εἶδος πυρὸς τὴν νύκτα. Καὶ ἡνίκα ἀνέβη ἡ νεφέλη ἀπὸ τῆς σκηνῆς, καὶ μετὰ ταῦτα ἀπῇραν οἱ υἱοὶ Ἰσραήλ. Καὶ ἐν τῷ τόπῳ οὗ ἂν ἔστη ἡ νεφέλη, ἐκεῖ παρενέβαλον οἱ υἱοὶ Ἰσραήλ. Διὰ προστάγματος Κυρίου παρεμβαλοῦσιν οἱ υἱοὶ Ἰσραήλ, καὶ διὰ προστάγματος Κυρίου ἀπαροῦσι. Πάσας τὰς ἡμέρας, ἐν αἷς σκιάζει ἡ νεφέλη ἐπὶ τῆς σκηνῆς, παρεμβαλοῦσιν οἱ υἱοὶ Ἰσραήλ. Καὶ ὅταν ἐφέλκηται ἡ νεφέλη ἐπὶ τῆς σκηνῆς ἡμέρας πλείους, καὶ φυλάξονται οἱ υἱοὶ Ἰσραὴλ τὴν φυλακὴν τοῦ Θεοῦ. Καὶ οὐ μὴ ἑξάρωσι. Καὶ ἔσται ὅταν σκεπάζῃ ἡ νεφέλη ἡμέρας ἀριθμῷ ἐπὶ τῆς σκηνῆς, διὰ φωνῆς Κυρίου παρεμβαλοῦσι καὶ διὰ προστάγματος Κυρίου ἀπαροῦσι. Καὶ ἔσται ὅταν γένηται ἡ νεφέλη ἀφʼ ἑσπέρας ἕως πρωὶ καὶ ἀναβῇ ἡ νεφέλη τὸ πρωί, καὶ ἀπαροῦσιν ἡμέρας ἡ νυκτός. Μηνὸς ἡμέρας πλεοναζούσης τῆς νεφέλης σκιαζούσης ἐπʼ αὐτῆς, παρεμβαλοῦσιν οἱ υἱοὶ Ἰσραήλ, καὶ οὐ μὴ ἀπάρωσιν. Ὅτι διὰ προστάγματος Κυρίου ἀπαροῦσι. Τὴν φυλακὴν Κυρίου ἐφυλάξαντο διὰ προστάγματος Κυρίου ἐν χειρὶ Μωυσῆ.
ltx/gr_gr_cog/le.pr.me.r77:leprVE.reading.title	
ltx/gr_gr_cog/le.pr.me.r77:leprVE.reading.title_abbr	
ltx/gr_gr_cog/le.pr.me.r77:leprVE.reading.version	@ltx/gr_gr_cog/properties:version.designation
