ltx/gr_gr_cog/le.go.lu.d020:leluLI.Gospel.book_abbr	@ltx/gr_gr_cog/bible:Luke.abbr
ltx/gr_gr_cog/le.go.lu.d020:leluLI.Gospel.book_string	@ltx/gr_gr_cog/bible:Luke.text
ltx/gr_gr_cog/le.go.lu.d020:leluLI.Gospel.chapverse	5:27 – 32
ltx/gr_gr_cog/le.go.lu.d020:leluLI.Gospel.incipit	Παράγων ὁ Ἰησοῦς ἐθεάσατο τελώνην…
ltx/gr_gr_cog/le.go.lu.d020:leluLI.Gospel.text	Τῷ καιρῷ ἐκείνῳ, παράγων ὁ Ἰησοῦς ἐθεάσατο τελώνην ὀνόματι Λευΐν, καθήμενον ἐπὶ τὸ τελώνιον, καὶ εἶπεν αὐτῷ· ἀκολούθει μοι. καὶ καταλιπὼν ἅπαντα ἀναστὰς ἠκολούθησεν αὐτῷ. καὶ ἐποίησε δοχὴν μεγάλην Λευῒς αὐτῷ ἐν τῇ οἰκίᾳ αὐτοῦ, καὶ ἦν ὄχλος τελωνῶν πολὺς καὶ ἄλλων οἳ ἦσαν μετ᾿ αὐτῶν κατακείμενοι. καὶ ἐγόγγυζον οἱ γραμματεῖς αὐτῶν καὶ οἱ Φαρισαῖοι πρὸς τοὺς μαθητὰς αὐτοῦ λέγοντες· διατί μετὰ τῶν τελωνῶν καὶ ἁμαρτωλῶν ἐσθίετε καὶ πίνετε; καὶ ἀποκριθεὶς ὁ Ἰησοῦς εἶπε πρὸς αὐτούς· οὐ χρείαν ἔχουσιν οἱ ὑγιαίνοντες ἰατροῦ, ἀλλ᾿ οἱ κακῶς ἔχοντες· οὐκ ἐλήλυθα καλέσαι δικαίους, ἀλλὰ ἁμαρτωλοὺς εἰς μετάνοιαν.
ltx/gr_gr_cog/le.go.lu.d020:leluLI.Gospel.title	Τῷ Σαββάτῳ τῆς Γʹ Ἑβδομάδος τοῦ Λουκᾶ
ltx/gr_gr_cog/le.go.lu.d020:leluLI.Gospel.title_abbr	Τῷ Σαββάτῳ τῆς Γʹ Ἑβδομάδος τοῦ Λουκᾶ
ltx/gr_gr_cog/le.go.lu.d020:leluLI.Gospel.version	@ltx/gr_gr_cog/properties:version.designation
