ltx/gr_gr_cog/ho.ho22:hoSA.LastHymn.incipit	@ltx/gr_gr_cog/he.a.m3:heAU.TinOraiotita.incipit
ltx/gr_gr_cog/ho.ho22:hoSA.LastHymn.melody	@ltx/gr_gr_cog/he.a.m3:heAU.TinOraiotita.melody
ltx/gr_gr_cog/ho.ho22:hoSA.LastHymn.mode	@ltx/gr_gr_cog/miscellanea:misc.Mode3
ltx/gr_gr_cog/ho.ho22:hoSA.LastHymn.text	@ltx/gr_gr_cog/he.a.m3:heAU.TinOraiotita.text
ltx/gr_gr_cog/ho.ho22:hoSA.R01	
ltx/gr_gr_cog/ho.ho22:hoSA.title1	Ἀκολουθία
ltx/gr_gr_cog/ho.ho22:hoSA.title2	τοῦ Ἀκαθίστου Ὕμνου
ltx/gr_gr_cog/ho.ho22:hoSA.title3	τῶν Χαιρεστισμῶν
ltx/gr_gr_cog/ho.ho22:hoSA.title4	εἰς τὴν Ὑπεραγίαν Θεοτόκον
ltx/gr_gr_cog/ho.ho22:hoSA.title5	Χαιρετισμοὶ εἰς τὴν Ὑπεραγίαν Θεοτόκον
