ltx/gr_gr_cog/le.go.me.m03.d26:lemeLI.Gospel.book_abbr	@ltx/gr_gr_cog/le.go.ge.apostle:legeLI.Gospel.book_abbr
ltx/gr_gr_cog/le.go.me.m03.d26:lemeLI.Gospel.book_string	@ltx/gr_gr_cog/le.go.ge.apostle:legeLI.Gospel.book_string
ltx/gr_gr_cog/le.go.me.m03.d26:lemeLI.Gospel.chapverse	@ltx/gr_gr_cog/le.go.ge.apostle:legeLI.Gospel.chapverse
ltx/gr_gr_cog/le.go.me.m03.d26:lemeLI.Gospel.incipit	@ltx/gr_gr_cog/le.go.ge.apostle:legeLI.Gospel.incipit
ltx/gr_gr_cog/le.go.me.m03.d26:lemeLI.Gospel.text	@ltx/gr_gr_cog/le.go.ge.apostle:legeLI.Gospel.text
ltx/gr_gr_cog/le.go.me.m03.d26:lemeLI.Gospel.title	Τοῦ Ἀρχιστρατήγου
ltx/gr_gr_cog/le.go.me.m03.d26:lemeLI.Gospel.title_abbr	Τοῦ Ἀρχιστρατήγου
ltx/gr_gr_cog/le.go.me.m03.d26:lemeLI.Gospel.version	@ltx/gr_gr_cog/le.go.ge.apostle:legeLI.Gospel.version
