ltx/gr_gr_cog/sy.m07.dHF:cl.syMA.commemoration01.text	[saint/com 1]
ltx/gr_gr_cog/sy.m07.dHF:cl.syMA.commemoration02.text	[saint/com 2]
ltx/gr_gr_cog/sy.m07.dHF:cl.syMA.commemoration03.text	[saint/com 3]
ltx/gr_gr_cog/sy.m07.dHF:cl.syMA.commemoration04.text	[saint/com 4]
ltx/gr_gr_cog/sy.m07.dHF:cl.syMA.commemoration05.text	[saint/com 5]
ltx/gr_gr_cog/sy.m07.dHF:cl.syMA.commemoration06.text	[saint/com list]
ltx/gr_gr_cog/sy.m07.dHF:syMA.commemoration01.couplet1.title	@ltx/gr_gr_cog/titles:ti.Verses
ltx/gr_gr_cog/sy.m07.dHF:syMA.commemoration01.couplet1.verse1	Πόλου νοητοῦ ἀστέρες σελασφόροι,
ltx/gr_gr_cog/sy.m07.dHF:syMA.commemoration01.couplet1.verse2	Ἀκτῖσιν ὑμῶν φωτίσατέ μοι φρένας.
ltx/gr_gr_cog/sy.m07.dHF:syMA.commemoration01.narration.p01	Θεοδοσίου τοῦ υἱοῦ Ἀρκαδίου τὰ σκῆπτρα ἰθύνοντος, γέγονέ τι τοιοῦτον· Εὐτύχιος γάρ τις, Μοναχὸς καὶ Πρεσβύτερος, ἀρχηγὸς αἱρέσεως κατέστη, λέγων τὸν Κύριον ἡμῶν Ἰησοῦν Χριστὸν μιᾶς φύσεως εἶναι καὶ μιᾶς ἐνεργείας· ὃς καὶ καθαιρεῖται ὑπὸ Φλαβιανοῦ τοῦ τῆς Κωνσταντινουπόλεως Προέδρου καὶ τῶν λοιπῶν ὀρθοδόξων. Ὁ δὲ Εὐτύχιος, χρησάμενος βοηθοῖς τοῖς τοῦ βασιλέως ἀθέοις εὐνούχοις, οὐκ ἐπαύσατο στασιάζειν καὶ ἐνέδρας ποιεῖν, μέχρις οὗ ὁ Θεοδόσιος τῶν τῇδε μετέστη. Ἐπεὶ δὲ τὴν βασιλείαν διεδέξαντο ὅ τε Μαρκιανὸς καὶ ἡ Πουλχερία, κελεύουσι γενέσθαι Σύνοδον Οἰκουμενικήν, εἰς ἣν καὶ συνήχθησαν τὸν ἀριθμὸν Ἐπίσκοποι ἑξακόσιοι τριάκοντα. Ἀμφότεροι δέ, ὀρθόδοξοι δηλονότι καὶ ἑτερόδοξοι, ἐγγράψαντες τὰ ἑαυτῶν φρονήματα εἰς δύο Τόμους καὶ διανοίξαντες τὴν λάρνακα τῆς πανευφήμου Μάρτυρος Εὐφημίας, ἐπὶ τοῦ ταύτης στήθους σφραγίσαντες ἔθηκαν· καὶ μετὰ ῥητὰς ἡμέρας, εὐξάμενοι καὶ ὑπανοίξαντες, εὗρον τὸν μὲν τῶν αἱρετικῶν Τόμον ὑπὸ τοὺς πόδας τῆς Ἁγίας ἐῤῥιμμένον, τὸν δὲ τῶν ὀρθοδόξων, ταῖς τιμίαις χερσὶν αὐτῆς κατεχόμενον. Τούτου δὲ γενομένου, ἐξέστησαν ἅπαντες, ἰδόντες τὸ τοιοῦτον θαῦμα· καὶ ἐπὶ πλεῖον στηριχθέντες τῇ πίστει, ἐδόξασαν τὸν Θεόν, τὸν ποιοῦντα καθʼ ἑκάστην παράδοξα καὶ ἐξαίσια πράγματα, πρὸς ἐπιστροφὴν τῶν πολλῶν καὶ ὠφέλειαν. Τελεῖται δὲ ἡ τοιαύτη σύναξις ἐν τῇ Ἁγιωτάτῃ μεγάλῃ Ἐκκλησίᾳ.
ltx/gr_gr_cog/sy.m07.dHF:syMA.commemoration01.text	Τῇ αὐτῇ ἡμέρᾳ, μνήμην ἐπιτελοῦμεν τῶν Ἁγίων ἑξακοσίων τριάκοντα θεοφόρων Πατέρων τῆς ἐν Χαλκηδόνι Ἁγίας καὶ Οἰκουμενικῆς τετάρτης Συνόδου.
ltx/gr_gr_cog/sy.m07.dHF:syMA.lastline	Ταῖς τῶν ἁγίων Πατέρων πρεσβείαις, ὁ Θεός, ἐλέησον ἡμᾶς. Ἀμήν.
ltx/gr_gr_cog/sy.m07.dHF:syMA.note1	Τὸ Συναξάριον τῆς ἡμέαρς, εἶτα·
