ltx/gr_gr_cog/le.ep.me.m05.d24:lemeLI.Epistle.book_abbr	@ltx/gr_gr_cog/le.ep.mc.d330:lemcLI.Epistle.book_abbr
ltx/gr_gr_cog/le.ep.me.m05.d24:lemeLI.Epistle.book_string	@ltx/gr_gr_cog/le.ep.mc.d330:lemcLI.Epistle.book_string
ltx/gr_gr_cog/le.ep.me.m05.d24:lemeLI.Epistle.chapverse	@ltx/gr_gr_cog/le.ep.mc.d330:lemcLI.Epistle.chapverse
ltx/gr_gr_cog/le.ep.me.m05.d24:lemeLI.Epistle.incipit	@ltx/gr_gr_cog/le.ep.mc.d330:lemcLI.Epistle.incipit
ltx/gr_gr_cog/le.ep.me.m05.d24:lemeLI.Epistle.text	@ltx/gr_gr_cog/le.ep.mc.d330:lemcLI.Epistle.text
ltx/gr_gr_cog/le.ep.me.m05.d24:lemeLI.Epistle.title	Τοῦ Ὁσίου
ltx/gr_gr_cog/le.ep.me.m05.d24:lemeLI.Epistle.title_abbr	Τοῦ Ὁσίου
ltx/gr_gr_cog/le.ep.me.m05.d24:lemeLI.Epistle.version	@ltx/gr_gr_cog/le.ep.mc.d330:lemcLI.Epistle.version
