ltx/gr_gr_cog/le.ep.mc.d307:lemcLI.Epistle.book_abbr	@ltx/gr_gr_cog/bible:Timothy2.abbr
ltx/gr_gr_cog/le.ep.mc.d307:lemcLI.Epistle.book_string	@ltx/gr_gr_cog/bible:Timothy2.text
ltx/gr_gr_cog/le.ep.mc.d307:lemcLI.Epistle.chapverse	1:1 – 2; 8 – 18
ltx/gr_gr_cog/le.ep.mc.d307:lemcLI.Epistle.incipit	Παῦλος, ἀπόστολος Χριστοῦ Ἰησοῦ διὰ θελήματος Θεοῦ…
ltx/gr_gr_cog/le.ep.mc.d307:lemcLI.Epistle.text	Παῦλος, ἀπόστολος Χριστοῦ Ἰησοῦ διὰ θελήματος Θεοῦ κατ᾽ ἐπαγγελίαν ζωῆς τῆς ἐν Χριστῷ Ἰησοῦ, Τιμοθέῳ ἀγαπητῷ τέκνῳ· χάρις, ἔλεος, εἰρήνη ἀπὸ Θεοῦ πατρὸς καὶ Χριστοῦ Ἰησοῦ τοῦ Κυρίου ἡμῶν. μὴ ἐπαισχυνθῇς τὸ μαρτύριον τοῦ Κυρίου ἡμῶν μηδὲ ἐμὲ τὸν δέσμιον αὐτοῦ, ἀλλὰ συγκακοπάθησον τῷ εὐαγγελίῳ κατὰ δύναμιν Θεοῦ, τοῦ σώσαντος ἡμᾶς καὶ καλέσαντος κλήσει ἁγίᾳ, οὐ κατὰ τὰ ἔργα ἡμῶν, ἀλλὰ κατ᾽ ἰδίαν πρόθεσιν καὶ χάριν, τὴν δοθεῖσαν ἡμῖν ἐν Χριστῷ Ἰησοῦ πρὸ χρόνων αἰωνίων, φανερωθεῖσαν δὲ νῦν διὰ τῆς ἐπιφανείας τοῦ σωτῆρος ἡμῶν Ἰησοῦ Χριστοῦ, καταργήσαντος μὲν τὸν θάνατον, φωτίσαντος δὲ ζωὴν καὶ ἀφθαρσίαν διὰ τοῦ εὐαγγελίου, εἰς ὃ ἐτέθην ἐγὼ κήρυξ καὶ ἀπόστολος καὶ διδάσκαλος ἐθνῶν. δι᾽ ἣν αἰτίαν καὶ ταῦτα πάσχω, ἀλλ᾽ οὐκ ἐπαισχύνομαι· οἶδα γὰρ ᾧ πεπίστευκα, καὶ πέπεισμαι ὅτι δυνατός ἐστι τὴν παραθήκην μου φυλάξαι εἰς ἐκείνην τὴν ἡμέραν. ὑποτύπωσιν ἔχε ὑγιαινόντων λόγων ὧν παρ᾽ ἐμοῦ ἤκουσας, ἐν πίστει καὶ ἀγάπῃ τῇ ἐν Χριστῷ Ἰησοῦ· τὴν καλὴν παραθήκην φύλαξον διὰ Πνεύματος Ἁγίου τοῦ ἐνοικοῦντος ἐν ἡμῖν. Οἶδας τοῦτο, ὅτι ἀπεστράφησάν με πάντες οἱ ἐν τῇ Ἀσίᾳ, ὧν ἐστι Φύγελλος καὶ Ἑρμογένης. δῴη ἔλεος ὁ Κύριος τῷ Ὀνησιφόρου οἴκῳ, ὅτι πολλάκις με ἀνέψυξε καὶ τὴν ἅλυσίν μου οὐκ ἐπαισχύνθη, ἀλλὰ γενόμενος ἐν Ῥώμῃ σπουδαιότερον ἐζήτησέ με καὶ εὗρε· δῴη αὐτῷ ὁ Κύριος εὑρεῖν ἔλεος παρὰ Κυρίου ἐν ἐκείνῃ τῇ ἡμέρᾳ· καὶ ὅσα ἐν Ἐφέσῳ διηκόνησε, βέλτιον σὺ γινώσκεις.
ltx/gr_gr_cog/le.ep.mc.d307:lemcLI.Epistle.title	Τῇ Παρασκευῇ τῆς ΚΖʹ Ἑβδομάδος
ltx/gr_gr_cog/le.ep.mc.d307:lemcLI.Epistle.title_abbr	Παρασκευῇ τῆς ΚΖʹ Ἑβδομάδος
ltx/gr_gr_cog/le.ep.mc.d307:lemcLI.Epistle.version	@ltx/gr_gr_cog/properties:version.designation
