ltx/gr_gr_cog/le.go.mc.d153:lemcLI.Gospel.book_abbr	@ltx/gr_gr_cog/bible:Matthew.abbr
ltx/gr_gr_cog/le.go.mc.d153:lemcLI.Gospel.book_string	@ltx/gr_gr_cog/bible:Matthew.text
ltx/gr_gr_cog/le.go.mc.d153:lemcLI.Gospel.chapverse	13:3 – 9
ltx/gr_gr_cog/le.go.mc.d153:lemcLI.Gospel.incipit	Ἰδοὺ ἐξῆλθεν ὁ σπείρων τοῦ σπεῖραι…
ltx/gr_gr_cog/le.go.mc.d153:lemcLI.Gospel.text	Εἶπεν ὁ Κύριος τὴν παραβολὴν ταύτην· ἰδοὺ ἐξῆλθεν ὁ σπείρων τοῦ σπεῖραι. καὶ ἐν τῷ σπείρειν αὐτὸν ἃ μὲν ἔπεσε παρὰ τὴν ὁδόν, καὶ ἐλθόντα τὰ πετεινὰ κατέφαγεν αὐτά· ἄλλα δὲ ἔπεσεν ἐπὶ τὰ πετρώδη, ὅπου οὐκ εἶχε γῆν πολλήν, καὶ εὐθέως ἐξανέτειλε διὰ τὸ μὴ ἔχειν βάθος γῆς, ἡλίου δὲ ἀνατείλαντος ἐκαυματίσθη, καὶ διὰ τὸ μὴ ἔχειν ῥίζαν ἐξηράνθη· ἄλλα δὲ ἔπεσεν ἐπὶ τὰς ἀκάνθας, καὶ ἀνέβησαν αἱ ἄκανθαι καὶ ἀπέπνιξαν αὐτά· ἄλλα δὲ ἔπεσεν ἐπὶ τὴν γῆν τὴν καλὴν καὶ ἐδίδου καρπὸν ὃ μὲν ἑκατόν, ὃ δὲ ἐξήκοντα, ὃ δὲ τριάκοντα. ὁ ἔχων ὦτα ἀκούειν ἀκουέτω.
ltx/gr_gr_cog/le.go.mc.d153:lemcLI.Gospel.title	Τῇ Παρασκευῇ τῆς Εʹ Ἑβδομάδος τοῦ Ματθαίου
ltx/gr_gr_cog/le.go.mc.d153:lemcLI.Gospel.title_abbr	Παρασκευῇ τῆς Εʹ Ἑβδομάδος
ltx/gr_gr_cog/le.go.mc.d153:lemcLI.Gospel.version	@ltx/gr_gr_cog/properties:version.designation
