ltx/gr_gr_cog/le.ep.mc.d177:lemcLI.Epistle.book_abbr	@ltx/gr_gr_cog/bible:Corinthians1.abbr
ltx/gr_gr_cog/le.ep.mc.d177:lemcLI.Epistle.book_string	@ltx/gr_gr_cog/bible:Corinthians1.text
ltx/gr_gr_cog/le.ep.mc.d177:lemcLI.Epistle.chapverse	11:31 – 34; 12:1 – 6
ltx/gr_gr_cog/le.ep.mc.d177:lemcLI.Epistle.incipit	Εἰ ἑαυτοὺς διεκρίνομεν, οὐκ ἂν ἐκρινόμεθα…
ltx/gr_gr_cog/le.ep.mc.d177:lemcLI.Epistle.text	Ἀδελφοί, εἰ ἑαυτοὺς διεκρίνομεν, οὐκ ἂν ἐκρινόμεθα· κρινόμενοι δὲ ὑπὸ τοῦ Κυρίου παιδευόμεθα, ἵνα μὴ σὺν τῷ κόσμῳ κατακριθῶμεν. Ὥστε, ἀδελφοί μου, συνερχόμενοι εἰς τὸ φαγεῖν ἀλλήλους ἐκδέχεσθε· εἰ δέ τις πεινᾷ, ἐν οἴκῳ ἐσθιέτω, ἵνα μὴ εἰς κρῖμα συνέρχησθε. Τὰ δὲ λοιπὰ ὡς ἂν ἔλθω διατάξομαι. Περὶ δὲ τῶν πνευματικῶν, ἀδελφοί, οὐ θέλω ὑμᾶς ἀγνοεῖν. οἴδατε ὅτι, ὅτε ἔθνη ἦτε, πρὸς τὰ εἴδωλα τὰ ἄφωνα ὡς ἂν ἤγεσθε ἀπαγόμενοι. διὸ γνωρίζω ὑμῖν ὅτι οὐδεὶς ἐν Πνεύματι Θεοῦ λαλῶν λέγει ἀνάθεμα Ἰησοῦν, καὶ οὐδεὶς δύναται εἰπεῖν Κύριον Ἰησοῦν εἰ μὴ ἐν Πνεύματι Ἁγίῳ. Διαιρέσεις δὲ χαρισμάτων εἰσί, τὸ δὲ αὐτὸ Πνεῦμα· καὶ διαιρέσεις διακονιῶν εἰσι, καὶ ὁ αὐτὸς Κύριος· καὶ διαιρέσεις ἐνεργημάτων εἰσίν, ὁ δὲ αὐτός ἐστι Θεός, ὁ ἐνεργῶν τὰ πάντα ἐν πᾶσιν.
ltx/gr_gr_cog/le.ep.mc.d177:lemcLI.Epistle.title	Τῇ Δευτέρᾳ τῆς Θʹ Ἑβδομάδος
ltx/gr_gr_cog/le.ep.mc.d177:lemcLI.Epistle.title_abbr	Δευτέρᾳ τῆς Θʹ Ἑβδομάδος
ltx/gr_gr_cog/le.ep.mc.d177:lemcLI.Epistle.version	@ltx/gr_gr_cog/properties:version.designation
