ltx/gr_gr_cog/tr.d039:trCO.header	(Μέγα)
ltx/gr_gr_cog/tr.d039:trDA.commemoration.full	
ltx/gr_gr_cog/tr.d039:trDA.commemoration.short	Τετάρτη τῆς Γʹ Ἑβδομάδος
ltx/gr_gr_cog/tr.d039:trDA.insert1	
ltx/gr_gr_cog/tr.d039:trDA.insert2	
ltx/gr_gr_cog/tr.d039:trDA.note	
ltx/gr_gr_cog/tr.d039:trDA.title	
ltx/gr_gr_cog/tr.d039:trHO.commemorations	
ltx/gr_gr_cog/tr.d039:trHO.daytitle	
ltx/gr_gr_cog/tr.d039:trHO.description1	
ltx/gr_gr_cog/tr.d039:trHO.description2	
ltx/gr_gr_cog/tr.d039:trHO.note1	
ltx/gr_gr_cog/tr.d039:trHO.note2	
ltx/gr_gr_cog/tr.d039:trMA.AposIdiomelon1.incipit	Ἐν τιμῇ ὢν υἱότητος, Πατρὸς…
ltx/gr_gr_cog/tr.d039:trMA.AposIdiomelon1.melody	@ltx/gr_gr_cog/miscellanea:misc.Idiomelon
ltx/gr_gr_cog/tr.d039:trMA.AposIdiomelon1.mode	@ltx/gr_gr_cog/miscellanea:misc.Mode2
ltx/gr_gr_cog/tr.d039:trMA.AposIdiomelon1.text	Ἐν τιμῇ ὢν υἱότητος, Πατρὸς ἀγαθοῦ, ὁ ἄνους ἐγὼ οὐ συνῆκα, ἀλλʼ ἐμαυτὸν τῆς δόξης ἐστέρησα, τὸν πλοῦτον κακῶς δαπανήσας τῆς χάριτος, λειπόμενος δὲ θείας τροφῆς, παράσιτος γέγονα μιαρῷ πολίτῃ, ὑπʼ αὐτοῦ δὲ πεμφθεὶς εἰς τὸν αὐτοῦ ψυχοφθόρον ἀγρόν, ζῶν ἀσώτως συνεβοσκόμην τοῖς κτήνεσι, καὶ ταῖς ἡδοναῖς δουλεύων, οὐκ ἐνεπλησκόμην. Ἀλλʼ ὑποστρέψας, βοήσω τῷ εὐσπλάγχνῳ, καὶ οἰκτίρμονι Πατρί. Εἰς τὸν οὐρανόν, καὶ ἐνώπιόν σου, ἥμαρτον, ἐλέησόν με.
ltx/gr_gr_cog/tr.d039:trMA.AposMartyric.incipit	Τῶν Μαρτύρων σου τὰ πλήθη…
ltx/gr_gr_cog/tr.d039:trMA.AposMartyric.melody	
ltx/gr_gr_cog/tr.d039:trMA.AposMartyric.mode	@ltx/gr_gr_cog/miscellanea:misc.Mode2
ltx/gr_gr_cog/tr.d039:trMA.AposMartyric.text	Τῶν Μαρτύρων σου τὰ πλήθη, δυσωποῦσί σε Χριστέ. Ἐλέησον ἡμᾶς ὡς φιλάνθρωπος.
ltx/gr_gr_cog/tr.d039:trMA.AposTheotokion.greekmelody	@ltx/gr_gr_cog/he.a.m2:heAU.OteEkTouXylou.greekname
ltx/gr_gr_cog/tr.d039:trMA.AposTheotokion.incipit	Πόνους ὑπομείνασα πολλούς, ἐν τῇ…
ltx/gr_gr_cog/tr.d039:trMA.AposTheotokion.melody	@ltx/gr_gr_cog/he.a.m2:heAU.OteEkTouXylou.name
ltx/gr_gr_cog/tr.d039:trMA.AposTheotokion.mode	@ltx/gr_gr_cog/miscellanea:misc.Mode2
ltx/gr_gr_cog/tr.d039:trMA.AposTheotokion.text	Πόνους ὑπομείνασα πολλούς, ἐν τῇ τοῦ Υἱοῦ καὶ Θεοῦ σου, σταυρώσει Ἄχραντε, ἔστενες δακρύουσα, καὶ ἀνεβόας πικρῶς· Οἴμοι Τέκνον γλυκύτατον! ἀδίκως πῶς πάσχεις, θέλων ἐκλυτρώσασθαι, τοὺς ἐξ Ἀδὰμ γηγενεῖς; Ὅθεν Παναγία Παρθένε, σὲ παρακαλοῦμεν ἐν πίστει, ἵλεων ἡμῖν τοῦτον ἀπέργασαι.
ltx/gr_gr_cog/tr.d039:trMA.C1.poet	@ltx/gr_gr_cog/poets:po.Iosif
ltx/gr_gr_cog/tr.d039:trMA.C2.poet	@ltx/gr_gr_cog/poets:po.Theodorou
ltx/gr_gr_cog/tr.d039:trMA.Kathisma21.greekmelody	@ltx/gr_gr_cog/he.a.m3:heAU.TinOraiotita.greekname
ltx/gr_gr_cog/tr.d039:trMA.Kathisma21.incipit	Ξύλῳ ἐμάρανας, τὴν φλόγα Δέσποτα…
ltx/gr_gr_cog/tr.d039:trMA.Kathisma21.melody	@ltx/gr_gr_cog/he.a.m3:heAU.TinOraiotita.name
ltx/gr_gr_cog/tr.d039:trMA.Kathisma21.mode	@ltx/gr_gr_cog/miscellanea:misc.Mode3
ltx/gr_gr_cog/tr.d039:trMA.Kathisma21.text	Ξύλῳ ἐμάρανας, τὴν φλόγα Δέσποτα, τῆς παραβάσεως, Σταυρῷ ὑψούμενος καὶ ἀπενέκρωσας ἐχθρόν, νεκρούμενος θελήματι· ὅθεν ἱκετεύω σε, τῆς σαρκός μου θελήματα, νέκρωσον καὶ ζώωσον, τὴν ἀθλίαν καρδίαν μου, νηστείᾳ παθοκτόνῳ καθάρας με πάσης κηλῖδος ὡς εὔσπλαγχνος.
ltx/gr_gr_cog/tr.d039:trMA.Kathisma22.greekmelody	@ltx/gr_gr_cog/he.a.m3:heAU.TinOraiotita.greekname
ltx/gr_gr_cog/tr.d039:trMA.Kathisma22.incipit	@ltx/gr_gr_cog/tr.d032:trMA.Kathisma32.incipit
ltx/gr_gr_cog/tr.d039:trMA.Kathisma22.melody	@ltx/gr_gr_cog/he.a.m3:heAU.TinOraiotita.name
ltx/gr_gr_cog/tr.d039:trMA.Kathisma22.mode	@ltx/gr_gr_cog/miscellanea:misc.Mode3
ltx/gr_gr_cog/tr.d039:trMA.Kathisma22.text	@ltx/gr_gr_cog/tr.d032:trMA.Kathisma32.text
ltx/gr_gr_cog/tr.d039:trMA.Kathisma31.incipit	Τὴν φαιδρὰν διανύοντες, τῶν Νηστειῶν…
ltx/gr_gr_cog/tr.d039:trMA.Kathisma31.melody	Ἀναστὰς ἐκ τοῦ μνήματος.
ltx/gr_gr_cog/tr.d039:trMA.Kathisma31.mode	@ltx/gr_gr_cog/miscellanea:misc.Mode2
ltx/gr_gr_cog/tr.d039:trMA.Kathisma31.text	Τὴν φαιδρὰν διανύοντες, τῶν Νηστειῶν εὐωχίαν βοῶμεν· Ἅπαντας διατήρησον ἐν εἰρήνῃ Κύριε, πάσης τῆς μηχανίας τοῦ ἐχθροῦ ῥυσάμενος, καὶ ἀξίωσον ἡμᾶς ὡς ὑπεράγαθος, τὸν Σταυρόν σου τὸν σεπτόν, φόβῳ ἀσπάσασθαι, ὁ διʼ αὐτοῦ τὰ ἐλέη σου, παρέχων τῇ οἰκουμένῃ, μόνε Πολυέλεε.
ltx/gr_gr_cog/tr.d039:trMA.Kathisma32.incipit	Ἡ Παρθένος καὶ Μήτηρ σου…
ltx/gr_gr_cog/tr.d039:trMA.Kathisma32.melody	Εὐσπλαγχνίας.
ltx/gr_gr_cog/tr.d039:trMA.Kathisma32.mode	@ltx/gr_gr_cog/miscellanea:misc.Mode2
ltx/gr_gr_cog/tr.d039:trMA.Kathisma32.text	Ἡ Παρθένος καὶ Μήτηρ σου Χριστέ, ἐπὶ ξύλου ὁρῶσά σε νεκρόν, ἡπλωμένον, κλαίουσα πικρῶς, βοῶσα ἔλεγε· τί τὸ φοβερὸν τοῦτο μυστήριον; ὁ πᾶσι δωρούμενος ζωήν τὴν αἰώνιον, ἑκουσίως ἐν σταυρῷ πῶς θνῄσκεις, θάνατον ἐπονείδιστον.
ltx/gr_gr_cog/tr.d039:trMA.Ode3C11.greekmelody	@ltx/gr_gr_cog/he.h.m3:heHE.ToStereoma.greekname
ltx/gr_gr_cog/tr.d039:trMA.Ode3C11.incipit	Συσταυρούμενοι, τῷ διʼ ἡμᾶς σταυρωθέντι…
ltx/gr_gr_cog/tr.d039:trMA.Ode3C11.melody	@ltx/gr_gr_cog/he.h.m3:heHE.ToStereoma.name
ltx/gr_gr_cog/tr.d039:trMA.Ode3C11.mode	@ltx/gr_gr_cog/miscellanea:misc.Mode3
ltx/gr_gr_cog/tr.d039:trMA.Ode3C11.ode	@ltx/gr_gr_cog/miscellanea:misc.Ode3
ltx/gr_gr_cog/tr.d039:trMA.Ode3C11.text	Συσταυρούμενοι, τῷ διʼ ἡμᾶς σταυρωθέντι, νεκρώσωμεν ἅπαντα, σαρκὸς τὰ μέλη ἐν νηστείαις καὶ εὐχαῖς καὶ δεήσεσιν.
ltx/gr_gr_cog/tr.d039:trMA.Ode3C12.incipit	Ὁ τὴν ἄκανθαν, τῆς ἁμαρτίας…
ltx/gr_gr_cog/tr.d039:trMA.Ode3C12.melody	@ltx/gr_gr_cog/he.h.m3:heHE.ToStereoma.name
ltx/gr_gr_cog/tr.d039:trMA.Ode3C12.mode	@ltx/gr_gr_cog/miscellanea:misc.Mode3
ltx/gr_gr_cog/tr.d039:trMA.Ode3C12.ode	@ltx/gr_gr_cog/miscellanea:misc.Ode3
ltx/gr_gr_cog/tr.d039:trMA.Ode3C12.text	Ὁ τὴν ἄκανθαν, τῆς ἁμαρτίας ἐκτείλας, σταυρώσει σου Κύριε, τοὺς ἀκανθώδεις, λογισμοὺς τῆς διανοίας μου ἔκτιλον.
ltx/gr_gr_cog/tr.d039:trMA.Ode3C13.incipit	Καθοπλίσαντες, τὰς διανοίας νηστείᾳ τρεψώμεθα…
ltx/gr_gr_cog/tr.d039:trMA.Ode3C13.melody	@ltx/gr_gr_cog/he.h.m3:heHE.ToStereoma.name
ltx/gr_gr_cog/tr.d039:trMA.Ode3C13.mode	@ltx/gr_gr_cog/miscellanea:misc.Mode3
ltx/gr_gr_cog/tr.d039:trMA.Ode3C13.ode	@ltx/gr_gr_cog/miscellanea:misc.Ode3
ltx/gr_gr_cog/tr.d039:trMA.Ode3C13.text	Καθοπλίσαντες, τὰς διανοίας νηστείᾳ τρεψώμεθα ἔκφυλα Δαιμόνων στίφη, τῇ δυνάμει τοῦ Σταυροῦ τειχιζόμενοι.
ltx/gr_gr_cog/tr.d039:trMA.Ode3C1T.incipit	Σωματούμενος ἐκ σοῦ προῆλθεν ὁ…
ltx/gr_gr_cog/tr.d039:trMA.Ode3C1T.melody	@ltx/gr_gr_cog/he.h.m3:heHE.ToStereoma.name
ltx/gr_gr_cog/tr.d039:trMA.Ode3C1T.mode	@ltx/gr_gr_cog/miscellanea:misc.Mode3
ltx/gr_gr_cog/tr.d039:trMA.Ode3C1T.ode	@ltx/gr_gr_cog/miscellanea:misc.Ode3
ltx/gr_gr_cog/tr.d039:trMA.Ode3C1T.text	Σωματούμενος ἐκ σοῦ προῆλθεν ὁ Λόγος, τὴν ἔκπτωσιν Ἄχραντε, τῶν Προπατόρων, διὰ σπλάγχνα οἰκτιρμῶν διορθούμενος.
ltx/gr_gr_cog/tr.d039:trMA.Ode3C21.greekmelody	@ltx/gr_gr_cog/he.h.m2:heHE.StereosonImasEnSoiKyrie.greekname
ltx/gr_gr_cog/tr.d039:trMA.Ode3C21.incipit	Ὁ σὸς ζωοποιὸς Σταυρὸς Κύριε…
ltx/gr_gr_cog/tr.d039:trMA.Ode3C21.melody	@ltx/gr_gr_cog/he.h.m2:heHE.StereosonImasEnSoiKyrie.name
ltx/gr_gr_cog/tr.d039:trMA.Ode3C21.mode	@ltx/gr_gr_cog/miscellanea:misc.Mode2
ltx/gr_gr_cog/tr.d039:trMA.Ode3C21.ode	@ltx/gr_gr_cog/miscellanea:misc.Ode3
ltx/gr_gr_cog/tr.d039:trMA.Ode3C21.text	Ὁ σὸς ζωοποιὸς Σταυρὸς Κύριε, σφραγίς μοι ὑπάρχεις εἰς σωτηρίαν· ἐν αὐτῷ γὰρ τὸν ἀντίπαλον καταργῶν ἀνυμνῶ σε ὡς Θεὸν δυνατόν.
ltx/gr_gr_cog/tr.d039:trMA.Ode3C22.incipit	Τὸ ξύλον τοῦ Σταυροῦ καρπὸν…
ltx/gr_gr_cog/tr.d039:trMA.Ode3C22.melody	@ltx/gr_gr_cog/he.h.m2:heHE.StereosonImasEnSoiKyrie.name
ltx/gr_gr_cog/tr.d039:trMA.Ode3C22.mode	@ltx/gr_gr_cog/miscellanea:misc.Mode2
ltx/gr_gr_cog/tr.d039:trMA.Ode3C22.ode	@ltx/gr_gr_cog/miscellanea:misc.Ode3
ltx/gr_gr_cog/tr.d039:trMA.Ode3C22.text	Τὸ ξύλον τοῦ Σταυροῦ καρπὸν ἤνεγκε, τῷ Κόσμῷ ζωώσεως ἀϊδίου, οὗ ἡμεῖς ἀπογευόμενοι, ἐκ θανάτου Χριστὲ ἀπολυτρούμεθα.
ltx/gr_gr_cog/tr.d039:trMA.Ode3C2A1.incipit	Ἡ χάρις τοῦ Σταυροῦ προεκλάμπουσα…
ltx/gr_gr_cog/tr.d039:trMA.Ode3C2A1.melody	@ltx/gr_gr_cog/he.h.m2:heHE.StereosonImasEnSoiKyrie.name
ltx/gr_gr_cog/tr.d039:trMA.Ode3C2A1.mode	@ltx/gr_gr_cog/miscellanea:misc.Mode2
ltx/gr_gr_cog/tr.d039:trMA.Ode3C2A1.ode	@ltx/gr_gr_cog/miscellanea:misc.Ode3
ltx/gr_gr_cog/tr.d039:trMA.Ode3C2A1.text	Ἡ χάρις τοῦ Σταυροῦ προεκλάμπουσα, τῷ Κόσμῳ πρὸς τὰ θεῖά σου Οἰκτίρμον, συγκαλεῖται Πάθη πάντας ἡμᾶς, ἃ πιστῶς προσκυνῆσαι καταξίωσον.
ltx/gr_gr_cog/tr.d039:trMA.Ode3C2H.greekmelody	@ltx/gr_gr_cog/he.h.m2:heHE.StereosonImasEnSoiKyrie.greekname
ltx/gr_gr_cog/tr.d039:trMA.Ode3C2H.incipit	@ltx/gr_gr_cog/he.h.m2:heHE.StereosonImasEnSoiKyrie.incipit
ltx/gr_gr_cog/tr.d039:trMA.Ode3C2H.melody	@ltx/gr_gr_cog/he.h.m2:heHE.StereosonImasEnSoiKyrie.melody
ltx/gr_gr_cog/tr.d039:trMA.Ode3C2H.mode	@ltx/gr_gr_cog/miscellanea:misc.Mode2
ltx/gr_gr_cog/tr.d039:trMA.Ode3C2H.ode	@ltx/gr_gr_cog/miscellanea:misc.Ode3
ltx/gr_gr_cog/tr.d039:trMA.Ode3C2H.text	@ltx/gr_gr_cog/he.h.m2:heHE.StereosonImasEnSoiKyrie.text
ltx/gr_gr_cog/tr.d039:trMA.Ode3C2T.incipit	Ὁ τόκος σου σεμνὴ φρικτὸς…
ltx/gr_gr_cog/tr.d039:trMA.Ode3C2T.melody	@ltx/gr_gr_cog/he.h.m2:heHE.StereosonImasEnSoiKyrie.name
ltx/gr_gr_cog/tr.d039:trMA.Ode3C2T.mode	@ltx/gr_gr_cog/miscellanea:misc.Mode2
ltx/gr_gr_cog/tr.d039:trMA.Ode3C2T.ode	@ltx/gr_gr_cog/miscellanea:misc.Ode3
ltx/gr_gr_cog/tr.d039:trMA.Ode3C2T.text	Ὁ τόκος σου σεμνὴ φρικτὸς πέφυκε· Θεὸς γὰρ ὑπάρχει ἐνανθρωπήσας, ὁ ἀνάρχως ἐκ Πατρὸς γεννηθείς, καὶ ἐκ σοῦ ἐπʼ ἐσχάτων πλὴν ἀνδρὸς κυηθείς.
ltx/gr_gr_cog/tr.d039:trMA.Ode3C2Tr.incipit	Τὰ τρία τῆς μιᾶς μορφῆς…
ltx/gr_gr_cog/tr.d039:trMA.Ode3C2Tr.melody	@ltx/gr_gr_cog/he.h.m2:heHE.StereosonImasEnSoiKyrie.name
ltx/gr_gr_cog/tr.d039:trMA.Ode3C2Tr.mode	@ltx/gr_gr_cog/miscellanea:misc.Mode2
ltx/gr_gr_cog/tr.d039:trMA.Ode3C2Tr.ode	@ltx/gr_gr_cog/miscellanea:misc.Ode3
ltx/gr_gr_cog/tr.d039:trMA.Ode3C2Tr.text	Τὰ τρία τῆς μιᾶς μορφῆς πρόσωπα δοξάζω Πατέρα, Υἱόν, καὶ Πνεῦμα, Ἓν τὸ κράτος τῆς Θεότητος· βασιλεύει γάρ, καὶ μοναρχεῖ ὡς Θεός.
ltx/gr_gr_cog/tr.d039:trMA.Ode8C11.greekmelody	@ltx/gr_gr_cog/he.h.m3:heHE.AstektoPyri.greekname
ltx/gr_gr_cog/tr.d039:trMA.Ode8C11.incipit	Σταυρῷ τὰς ἀρχὰς θριαμβεύσας, καὶ…
ltx/gr_gr_cog/tr.d039:trMA.Ode8C11.melody	@ltx/gr_gr_cog/he.h.m3:heHE.AstektoPyri.name
ltx/gr_gr_cog/tr.d039:trMA.Ode8C11.mode	@ltx/gr_gr_cog/miscellanea:misc.Mode3
ltx/gr_gr_cog/tr.d039:trMA.Ode8C11.ode	@ltx/gr_gr_cog/miscellanea:misc.Ode8
ltx/gr_gr_cog/tr.d039:trMA.Ode8C11.text	Σταυρῷ τὰς ἀρχὰς θριαμβεύσας, καὶ τὰς ἐξουσίας τοῦ σκότους Φωτοδότα, ὅταν ἔλθῃς μετʼ ἐξουσίας, κρῖναι Κόσμον ἅπαντα, μὴ τὰ ἐμά, Λόγε θριαμβεύσῃς κρύφια, ἵνα τὴν πολλήν σου, δοξάζω εὐσπλαγχνίαν.
ltx/gr_gr_cog/tr.d039:trMA.Ode8C12.incipit	Κριτὸς ὁ κριτὴς πρὸ βημάτων…
ltx/gr_gr_cog/tr.d039:trMA.Ode8C12.melody	@ltx/gr_gr_cog/he.h.m3:heHE.AstektoPyri.name
ltx/gr_gr_cog/tr.d039:trMA.Ode8C12.mode	@ltx/gr_gr_cog/miscellanea:misc.Mode3
ltx/gr_gr_cog/tr.d039:trMA.Ode8C12.ode	@ltx/gr_gr_cog/miscellanea:misc.Ode8
ltx/gr_gr_cog/tr.d039:trMA.Ode8C12.text	Κριτὸς ὁ κριτὴς πρὸ βημάτων, ἔστης κατακρίνων τὴν ἔχθραν τῷ Σταυρῷ σου, μακρόθυμε Δικαιοκρίτα· διὸ κατακρίσεως αἰωνίου ῥῦσαι, τοὺς φόβῳ κραυγάζοντας, καὶ ὑπερυψοῦντας τὴν σὴν φιλανθρωπίαν.
ltx/gr_gr_cog/tr.d039:trMA.Ode8C13.incipit	Νηστείας πυρὶ στομωθέντες, Παῖδες εὐσεβεῖς…
ltx/gr_gr_cog/tr.d039:trMA.Ode8C13.melody	@ltx/gr_gr_cog/he.h.m3:heHE.AstektoPyri.name
ltx/gr_gr_cog/tr.d039:trMA.Ode8C13.mode	@ltx/gr_gr_cog/miscellanea:misc.Mode3
ltx/gr_gr_cog/tr.d039:trMA.Ode8C13.ode	@ltx/gr_gr_cog/miscellanea:misc.Ode8
ltx/gr_gr_cog/tr.d039:trMA.Ode8C13.text	Νηστείας πυρὶ στομωθέντες, Παῖδες εὐσεβεῖς, τὴν ἐπηρμένην πάλαι φλόγα, θείᾳ δρόσῳ ἔσβεσαν ὄντως, καὶ ἡμεῖς νηστεύοντες τὰς καμίνους πάντων, παθῶν κατασβέσωμεν, ὅπως τῆς γεέννης ἐκφύγωμεν τὴν φλόγα.
ltx/gr_gr_cog/tr.d039:trMA.Ode8C1T.incipit	Ἐκ σοῦ τοῦ Θεοῦ ἡ…
ltx/gr_gr_cog/tr.d039:trMA.Ode8C1T.melody	@ltx/gr_gr_cog/he.h.m3:heHE.AstektoPyri.name
ltx/gr_gr_cog/tr.d039:trMA.Ode8C1T.mode	@ltx/gr_gr_cog/miscellanea:misc.Mode3
ltx/gr_gr_cog/tr.d039:trMA.Ode8C1T.ode	@ltx/gr_gr_cog/miscellanea:misc.Ode8
ltx/gr_gr_cog/tr.d039:trMA.Ode8C1T.text	Ἐκ σοῦ τοῦ Θεοῦ ἡ σοφία, οἶκον ἑαυτῇ δομησαμένη ἐσαρκώθη ἀποῤῥήτῳ συγκαταβάσει, Κόρη ἀπειρόγαμε· σὺ γὰρ μόνη, πασῶν γενεῶν ἐκλέλεξαι, ἄφθορος ἀφθάρτου εἰς κατοικίαν Λόγου.
ltx/gr_gr_cog/tr.d039:trMA.Ode8C21.greekmelody	@ltx/gr_gr_cog/he.h.m2:heHE.TonEnTiVatoMosi.greekname
ltx/gr_gr_cog/tr.d039:trMA.Ode8C21.incipit	Ὁ φέρων λόγῳ τὸ πᾶν…
ltx/gr_gr_cog/tr.d039:trMA.Ode8C21.melody	@ltx/gr_gr_cog/he.h.m2:heHE.TonEnTiVatoMosi.name
ltx/gr_gr_cog/tr.d039:trMA.Ode8C21.mode	@ltx/gr_gr_cog/miscellanea:misc.Mode2
ltx/gr_gr_cog/tr.d039:trMA.Ode8C21.ode	@ltx/gr_gr_cog/miscellanea:misc.Ode8
ltx/gr_gr_cog/tr.d039:trMA.Ode8C21.text	Ὁ φέρων λόγῳ τὸ πᾶν, διʼ ἐμὲ πάντα φέρεις, ῥαπισμοὺς ἐμπτυσμούς τε, καὶ τὴν σταύρωσιν Χριστέ, αἰνῶ τὰ μεγαλεῖα, τῆς σῆς φιλανθρωπίας, εἰς πάντας τοὺς αἰῶνας.
ltx/gr_gr_cog/tr.d039:trMA.Ode8C22.incipit	Θύῃ Χριστὲ ὡς ἀμνός, λογχευθεὶς…
ltx/gr_gr_cog/tr.d039:trMA.Ode8C22.melody	@ltx/gr_gr_cog/he.h.m2:heHE.TonEnTiVatoMosi.name
ltx/gr_gr_cog/tr.d039:trMA.Ode8C22.mode	@ltx/gr_gr_cog/miscellanea:misc.Mode2
ltx/gr_gr_cog/tr.d039:trMA.Ode8C22.ode	@ltx/gr_gr_cog/miscellanea:misc.Ode8
ltx/gr_gr_cog/tr.d039:trMA.Ode8C22.text	Θύῃ Χριστὲ ὡς ἀμνός, λογχευθεὶς τὴν πλευράν σου, ἵνα με τὸ πρόβατον σώσῃς, τὸ ἀπολωλός, ἐκ θήρας διαβόλου, καὶ τῇ καλῇ σου μάνδρᾳ, συντάξῃς εἰς αἰῶνας.
ltx/gr_gr_cog/tr.d039:trMA.Ode8C2A1.incipit	Ἐν τῷ Σταυρῷ σου Χριστέ…
ltx/gr_gr_cog/tr.d039:trMA.Ode8C2A1.melody	@ltx/gr_gr_cog/he.h.m2:heHE.TonEnTiVatoMosi.name
ltx/gr_gr_cog/tr.d039:trMA.Ode8C2A1.mode	@ltx/gr_gr_cog/miscellanea:misc.Mode2
ltx/gr_gr_cog/tr.d039:trMA.Ode8C2A1.ode	@ltx/gr_gr_cog/miscellanea:misc.Ode8
ltx/gr_gr_cog/tr.d039:trMA.Ode8C2A1.text	Ἐν τῷ Σταυρῷ σου Χριστέ, Ἱερεῖς ἐγκαυχῶνται, Βασιλεῖς κραταιοῦνται, πᾶς φωτίζεται πιστός, ἀξίωσόν με τοῦτον, ἰδεῖν καὶ προσκυνῆσαι καὶ ἆσαι εἰς αἰῶνας.
ltx/gr_gr_cog/tr.d039:trMA.Ode8C2H.greekmelody	@ltx/gr_gr_cog/he.h.m2:heHE.TonEnTiVatoMosi.greekname
ltx/gr_gr_cog/tr.d039:trMA.Ode8C2H.incipit	@ltx/gr_gr_cog/he.h.m2:heHE.TonEnTiVatoMosi.incipit
ltx/gr_gr_cog/tr.d039:trMA.Ode8C2H.melody	@ltx/gr_gr_cog/he.h.m2:heHE.TonEnTiVatoMosi.melody
ltx/gr_gr_cog/tr.d039:trMA.Ode8C2H.mode	@ltx/gr_gr_cog/miscellanea:misc.Mode2
ltx/gr_gr_cog/tr.d039:trMA.Ode8C2H.ode	@ltx/gr_gr_cog/miscellanea:misc.Ode8
ltx/gr_gr_cog/tr.d039:trMA.Ode8C2H.text	@ltx/gr_gr_cog/he.h.m2:heHE.TonEnTiVatoMosi.text
ltx/gr_gr_cog/tr.d039:trMA.Ode8C2T.incipit	Θεοκυῆτορ Ἁγνή, ἡ οὐράνιος πύλη…
ltx/gr_gr_cog/tr.d039:trMA.Ode8C2T.melody	@ltx/gr_gr_cog/he.h.m2:heHE.TonEnTiVatoMosi.name
ltx/gr_gr_cog/tr.d039:trMA.Ode8C2T.mode	@ltx/gr_gr_cog/miscellanea:misc.Mode2
ltx/gr_gr_cog/tr.d039:trMA.Ode8C2T.ode	@ltx/gr_gr_cog/miscellanea:misc.Ode8
ltx/gr_gr_cog/tr.d039:trMA.Ode8C2T.text	Θεοκυῆτορ Ἁγνή, ἡ οὐράνιος πύλη, ἡ σωτήριος θύρα, πάντων τῶν Χριστιανῶν, τὴν δέησιν προσδέχου, τῶν σὲ μακαριζόντων, εἰς πάντας τοὺς αἰῶνας.
ltx/gr_gr_cog/tr.d039:trMA.Ode8C2Tr.incipit	Θεότης μία Τριάς, ἡ ἀμέριστος…
ltx/gr_gr_cog/tr.d039:trMA.Ode8C2Tr.melody	@ltx/gr_gr_cog/he.h.m2:heHE.TonEnTiVatoMosi.name
ltx/gr_gr_cog/tr.d039:trMA.Ode8C2Tr.mode	@ltx/gr_gr_cog/miscellanea:misc.Mode2
ltx/gr_gr_cog/tr.d039:trMA.Ode8C2Tr.ode	@ltx/gr_gr_cog/miscellanea:misc.Ode8
ltx/gr_gr_cog/tr.d039:trMA.Ode8C2Tr.text	Θεότης μία Τριάς, ἡ ἀμέριστος φύσις μεριστὴ δὲ προσώποις, τὸ ἀΐδιον κράτος, Πάτερ, Υἱέ, καὶ Πνεῦμα, σὲ ἀνυμνολογοῦμεν, εἰς πάντας τοὺς αἰῶνας.
ltx/gr_gr_cog/tr.d039:trMA.Ode9C11.greekmelody	@ltx/gr_gr_cog/he.h.m3:heHE.EnNomoSkia.greekname
ltx/gr_gr_cog/tr.d039:trMA.Ode9C11.incipit	Τὸν ὄφιν Μωσῆς ἐν ξύλῳ…
ltx/gr_gr_cog/tr.d039:trMA.Ode9C11.melody	@ltx/gr_gr_cog/he.h.m3:heHE.EnNomoSkia.name
ltx/gr_gr_cog/tr.d039:trMA.Ode9C11.mode	@ltx/gr_gr_cog/miscellanea:misc.Mode3
ltx/gr_gr_cog/tr.d039:trMA.Ode9C11.ode	@ltx/gr_gr_cog/miscellanea:misc.Ode9
ltx/gr_gr_cog/tr.d039:trMA.Ode9C11.text	Τὸν ὄφιν Μωσῆς ἐν ξύλῳ ἀνυψῶν, σὲ προετύπου Χριστέ, Σταυρῷ ἐθελουσίως ὑψωθέντα,, καὶ τοῦ πονηροῦ τὴν ἰοβόλον κακίαν, ἀποῤῥαπίσαντα, πρὸς σεαυτὸν δὲ τοὺς βροτούς, ἀνελκύσαντα φιλάνθρωπε.
ltx/gr_gr_cog/tr.d039:trMA.Ode9C12.incipit	Πυρί με τοῦ σοῦ καθάρισον…
ltx/gr_gr_cog/tr.d039:trMA.Ode9C12.melody	@ltx/gr_gr_cog/he.h.m3:heHE.EnNomoSkia.name
ltx/gr_gr_cog/tr.d039:trMA.Ode9C12.mode	@ltx/gr_gr_cog/miscellanea:misc.Mode3
ltx/gr_gr_cog/tr.d039:trMA.Ode9C12.ode	@ltx/gr_gr_cog/miscellanea:misc.Ode9
ltx/gr_gr_cog/tr.d039:trMA.Ode9C12.text	Πυρί με τοῦ σοῦ καθάρισον φόβου, ἀνάπτων μου τῇ ψυχῇ, τὴν θείαν σου ἀγάπην, καὶ Σταυρῷ τειχίζων με τῷ σῷ, ἣν ἐξηπάτησε δόλῳ, ὁ παλαιὸς πτερνιστής, ταῖς ἡδοναῖς ἀμαυρώσας, τὴν ἐμὴν Χριστὲ διάνοιαν.
ltx/gr_gr_cog/tr.d039:trMA.Ode9C13.incipit	Αἰσχρῶν λογισμῶν, καὶ πράξεων φαύλων…
ltx/gr_gr_cog/tr.d039:trMA.Ode9C13.melody	@ltx/gr_gr_cog/he.h.m3:heHE.EnNomoSkia.name
ltx/gr_gr_cog/tr.d039:trMA.Ode9C13.mode	@ltx/gr_gr_cog/miscellanea:misc.Mode3
ltx/gr_gr_cog/tr.d039:trMA.Ode9C13.ode	@ltx/gr_gr_cog/miscellanea:misc.Ode9
ltx/gr_gr_cog/tr.d039:trMA.Ode9C13.text	Αἰσχρῶν λογισμῶν, καὶ πράξεων φαύλων, νηστεύσωμεν ἀδελφοί, ἁγνίσωμεν καρδίας, πτερωθῶμεν θείαις ἀρεταῖς, καὶ χαμαιζήλου κακίας, ὁρμὰς ἐκκλίνωμεν, ἵνα τὸ Πάσχα τὸ μέγα, λαμπροφόροι θεασώμεθα.
ltx/gr_gr_cog/tr.d039:trMA.Ode9C1T.incipit	Ἐκ σοῦ τὴν ἡμῶν, πτωχείαν…
ltx/gr_gr_cog/tr.d039:trMA.Ode9C1T.melody	@ltx/gr_gr_cog/he.h.m3:heHE.EnNomoSkia.name
ltx/gr_gr_cog/tr.d039:trMA.Ode9C1T.mode	@ltx/gr_gr_cog/miscellanea:misc.Mode3
ltx/gr_gr_cog/tr.d039:trMA.Ode9C1T.ode	@ltx/gr_gr_cog/miscellanea:misc.Ode9
ltx/gr_gr_cog/tr.d039:trMA.Ode9C1T.text	Ἐκ σοῦ τὴν ἡμῶν, πτωχείαν Παρθένε, θέλων ἐφόρεσεν ὁ πλούσιος τῇ φύσει, ὁρατὸς δὲ γέγονεν ἡμῖν, ὁ ἀοράτως τοῖς ἄνω χοροῖς ὑμνούμενος, τὴν συντριβεῖσαν εἰκόνα, ἀναπλάττων ἀγαθότητι.
ltx/gr_gr_cog/tr.d039:trMA.Ode9C21.greekmelody	@ltx/gr_gr_cog/he.h.m2:heHE.SeTinNoitin.greekname
ltx/gr_gr_cog/tr.d039:trMA.Ode9C21.incipit	Σὲ τὸν ἐν Σταυρῷ, τὰς…
ltx/gr_gr_cog/tr.d039:trMA.Ode9C21.melody	@ltx/gr_gr_cog/he.h.m2:heHE.SeTinNoitin.name
ltx/gr_gr_cog/tr.d039:trMA.Ode9C21.mode	@ltx/gr_gr_cog/miscellanea:misc.Mode2
ltx/gr_gr_cog/tr.d039:trMA.Ode9C21.ode	@ltx/gr_gr_cog/miscellanea:misc.Ode9
ltx/gr_gr_cog/tr.d039:trMA.Ode9C21.text	Σὲ τὸν ἐν Σταυρῷ, τὰς χεῖρας τανύσαντα, καὶ τὰ τετραπέρατα οἰκειούμενον, διʼ οὗ τὴν πρὸς τὸν Πατέρα, εὕρομεν εἴσοδον, Υἱὲ Θεοῦ πάντες μεγαλύνομεν.
ltx/gr_gr_cog/tr.d039:trMA.Ode9C22.incipit	Σὲ ἐξ ἀκανθῶν, Χριστὲ στεφανώσαντες…
ltx/gr_gr_cog/tr.d039:trMA.Ode9C22.melody	@ltx/gr_gr_cog/he.h.m2:heHE.SeTinNoitin.name
ltx/gr_gr_cog/tr.d039:trMA.Ode9C22.mode	@ltx/gr_gr_cog/miscellanea:misc.Mode2
ltx/gr_gr_cog/tr.d039:trMA.Ode9C22.ode	@ltx/gr_gr_cog/miscellanea:misc.Ode9
ltx/gr_gr_cog/tr.d039:trMA.Ode9C22.text	Σὲ ἐξ ἀκανθῶν, Χριστὲ στεφανώσαντες, οἱ ἄνομοι ἔτυπτον, καὶ ἐσταύρωσαν, ἐν οἷς ἡ ὑπʼ οὐρανὸν ἐκλονεῖτο ἅπασα, ἡμεῖς δὲ σωθέντες, σὲ μεγαλύνομεν.
ltx/gr_gr_cog/tr.d039:trMA.Ode9C2A1.incipit	Σὺ ἡμῶν τὸ φῶς, τὸ…
ltx/gr_gr_cog/tr.d039:trMA.Ode9C2A1.melody	@ltx/gr_gr_cog/he.h.m2:heHE.SeTinNoitin.name
ltx/gr_gr_cog/tr.d039:trMA.Ode9C2A1.mode	@ltx/gr_gr_cog/miscellanea:misc.Mode2
ltx/gr_gr_cog/tr.d039:trMA.Ode9C2A1.ode	@ltx/gr_gr_cog/miscellanea:misc.Ode9
ltx/gr_gr_cog/tr.d039:trMA.Ode9C2A1.text	Σὺ ἡμῶν τὸ φῶς, τὸ ἅγιον σύνθημα, τὸ τῆς νίκης τρόπαιον, ὁ Σταυρὸς τοῦ Χριστοῦ, αὐτὸς τὴν ἐγκράτειαν ἡμῖν καταγλύκανον, καὶ σὲ προσκυνῆσαι καταξίωσον.
ltx/gr_gr_cog/tr.d039:trMA.Ode9C2H.greekmelody	@ltx/gr_gr_cog/he.h.m2:heHE.SeTinNoitin.greekname
ltx/gr_gr_cog/tr.d039:trMA.Ode9C2H.incipit	@ltx/gr_gr_cog/he.h.m2:heHE.SeTinNoitin.incipit
ltx/gr_gr_cog/tr.d039:trMA.Ode9C2H.melody	@ltx/gr_gr_cog/he.h.m2:heHE.SeTinNoitin.melody
ltx/gr_gr_cog/tr.d039:trMA.Ode9C2H.mode	@ltx/gr_gr_cog/miscellanea:misc.Mode2
ltx/gr_gr_cog/tr.d039:trMA.Ode9C2H.ode	@ltx/gr_gr_cog/miscellanea:misc.Ode9
ltx/gr_gr_cog/tr.d039:trMA.Ode9C2H.text	@ltx/gr_gr_cog/he.h.m2:heHE.SeTinNoitin.text
ltx/gr_gr_cog/tr.d039:trMA.Ode9C2T.incipit	Σὲ τὴν φωτεινήν, νεφέλην τοῦ…
ltx/gr_gr_cog/tr.d039:trMA.Ode9C2T.melody	@ltx/gr_gr_cog/he.h.m2:heHE.SeTinNoitin.name
ltx/gr_gr_cog/tr.d039:trMA.Ode9C2T.mode	@ltx/gr_gr_cog/miscellanea:misc.Mode2
ltx/gr_gr_cog/tr.d039:trMA.Ode9C2T.ode	@ltx/gr_gr_cog/miscellanea:misc.Ode9
ltx/gr_gr_cog/tr.d039:trMA.Ode9C2T.text	Σὲ τὴν φωτεινήν, νεφέλην τοῦ Πνεύματος, ἐξ ἧς ἡμῖν ἔλαμψε φῶς τὸ ἀπρόσιτον, Χριστὸς τῆς δικαιοσύνης ὁ μέγας Ἥλιος, ὕμνοις Θεοτόκε μεγαλύνομεν.
ltx/gr_gr_cog/tr.d039:trMA.Ode9C2Tr.incipit	Σὲ τὴν τριφεγγῆ, ἁγίαν Θεότητα…
ltx/gr_gr_cog/tr.d039:trMA.Ode9C2Tr.melody	@ltx/gr_gr_cog/he.h.m2:heHE.SeTinNoitin.name
ltx/gr_gr_cog/tr.d039:trMA.Ode9C2Tr.mode	@ltx/gr_gr_cog/miscellanea:misc.Mode2
ltx/gr_gr_cog/tr.d039:trMA.Ode9C2Tr.ode	@ltx/gr_gr_cog/miscellanea:misc.Ode9
ltx/gr_gr_cog/tr.d039:trMA.Ode9C2Tr.text	Σὲ τὴν τριφεγγῆ, ἁγίαν Θεότητα, τὴν τὸ πᾶν συνέχουσαν, καὶ φυλάττουσαν ἀεί, τὸν Πατέρα, Υἱόν τε, καὶ Πνεῦμα τὸ ζῶν, ὕμνοις ἀσιγήτοις μεγαλύνομεν.
ltx/gr_gr_cog/tr.d039:trTE.Troparion.incipit	Ὑπόστασις ἔργων, ἐν ἡμῖν οὐκ…
ltx/gr_gr_cog/tr.d039:trTE.Troparion.melody	
ltx/gr_gr_cog/tr.d039:trTE.Troparion.mode	@ltx/gr_gr_cog/miscellanea:misc.Mode8
ltx/gr_gr_cog/tr.d039:trTE.Troparion.text	Ὑπόστασις ἔργων, ἐν ἡμῖν οὐκ ἔστι Κύριε, ἐλεήμων ὑπάρχεις φιλάνθρωπε, τὰ ἔργα τῶν χειρῶν σου, μὴ παρίδῃς ἀναμάρτητε.
ltx/gr_gr_cog/tr.d039:trTE.Troparion2.incipit	τὰ ἔργα τῶν χειρῶν σου…
ltx/gr_gr_cog/tr.d039:trTE.Troparion2.text	τὰ ἔργα τῶν χειρῶν σου, μὴ παρίδῃς ἀναμάρτητε.
ltx/gr_gr_cog/tr.d039:trVE.AposIdiomelon1.incipit	Πατέρα σε τὸν Κτίστην, ἐπιγράφεσθαι…
ltx/gr_gr_cog/tr.d039:trVE.AposIdiomelon1.melody	@ltx/gr_gr_cog/miscellanea:misc.Idiomelon
ltx/gr_gr_cog/tr.d039:trVE.AposIdiomelon1.mode	@ltx/gr_gr_cog/miscellanea:misc.Mode2
ltx/gr_gr_cog/tr.d039:trVE.AposIdiomelon1.text	Πατέρα σε τὸν Κτίστην, ἐπιγράφεσθαι τολμῶ Κύριε, ζῷον ὑπάρχων γηγενές, τῆς σῆς μετέχων εἰκόνος, κἂν τῆς υἱοθεσίας διήμαρτον, ἀσώτως βιώσας, καὶ τῇ λήθῃ τῶν σῶν δωρεῶν, ἐκδαπανήσας τὴν περιουσίαν. Μὴ οὖν ἀποκηρύξῃς με, ὁ τὸν σὸν εὐδοκήσας Υἱὸν μονογενῆ, Σταυρὸν ὑπὲρ ἐμοῦ σαρκί, καὶ θάνατον ὑπομεῖναι, ἀλλὰ βελτιώσας, οἰκείωσον σαυτῷ Φιλάνθρωπε.
ltx/gr_gr_cog/tr.d039:trVE.AposMartyric.incipit	Χοροὶ Μαρτύρων ἀντέστησαν, τοῖς Τυράννοις…
ltx/gr_gr_cog/tr.d039:trVE.AposMartyric.melody	
ltx/gr_gr_cog/tr.d039:trVE.AposMartyric.mode	@ltx/gr_gr_cog/miscellanea:misc.Mode2
ltx/gr_gr_cog/tr.d039:trVE.AposMartyric.text	Χοροὶ Μαρτύρων ἀντέστησαν, τοῖς Τυράννοις λέγοντες· Ἡμεῖς στρατευόμεθα τῷ Βασιλεῖ τῶν Δυνάμεων, εἰ καὶ πυρί, καὶ βασάνοις παραδώσετε ἡμᾶς, οὐκ ἀρνούμεθα τῆς Τριάδος τὴν δύναμιν.
ltx/gr_gr_cog/tr.d039:trVE.AposTheotokion.greekmelody	@ltx/gr_gr_cog/he.a.m2:heAU.OteEkTouXylou.greekname
ltx/gr_gr_cog/tr.d039:trVE.AposTheotokion.incipit	Ὅτε σε ὁ ἄνομος λαός…
ltx/gr_gr_cog/tr.d039:trVE.AposTheotokion.melody	@ltx/gr_gr_cog/he.a.m2:heAU.OteEkTouXylou.name
ltx/gr_gr_cog/tr.d039:trVE.AposTheotokion.mode	@ltx/gr_gr_cog/miscellanea:misc.Mode2
ltx/gr_gr_cog/tr.d039:trVE.AposTheotokion.text	Ὅτε σε ὁ ἄνομος λαός, Σῶτερ τὴν ζωὴν τῶν ἁπάντων, ξύλῳ ἀνήρτησε, τότε καὶ ἡ πάναγνος, ἁγνὴ καὶ Μήτηρ σου, παρεστῶσα ὠδύρετο, ὁλοφυρομένη· Τέκνον μου γλυκύτατον, φῶς τῶν ἐμῶν ὀφθαλμῶν, οἴμοι! πῶς κακούργων ἐν μέσῳ, ξύλῳ προσπαγῆναι ἠνέσχου, ὁ τὴν γῆν κρεμάσας ἐν τοῖς ὕδασι;
ltx/gr_gr_cog/tr.d039:trVE.Stichera01.incipit	Κύριε ὁ Σταυρῷ κτείνας τὸν…
ltx/gr_gr_cog/tr.d039:trVE.Stichera01.melody	Ἔστησαν τὰ τριάκοντα.
ltx/gr_gr_cog/tr.d039:trVE.Stichera01.mode	@ltx/gr_gr_cog/miscellanea:misc.Mode3
ltx/gr_gr_cog/tr.d039:trVE.Stichera01.poet	@ltx/gr_gr_cog/poets:po.Iosif
ltx/gr_gr_cog/tr.d039:trVE.Stichera01.text	Κύριε ὁ Σταυρῷ κτείνας τὸν δόλιον, τῆς αὐτοῦ ῥῦσαί με ἀπάτης, τὸν ἁμαρτάνοντα καὶ ἐξαπατώμενον, καὶ Νηστείᾳ ἐκκαθάρας με, δίδου μοι τὰ σὰ θελήματα τελεῖν, ὅπως βλέψω Δέσποτα, γεγηθὼς τὰ σεπτὰ Παθήματά σου.
ltx/gr_gr_cog/tr.d039:trVE.Stichera02.incipit	Τέτρωμαι, ἡδονῆς ῥομφαίᾳ Κύριε, καὶ…
ltx/gr_gr_cog/tr.d039:trVE.Stichera02.melody	Ἔστησαν τὰ τριάκοντα.
ltx/gr_gr_cog/tr.d039:trVE.Stichera02.mode	@ltx/gr_gr_cog/miscellanea:misc.Mode3
ltx/gr_gr_cog/tr.d039:trVE.Stichera02.poet	@ltx/gr_gr_cog/poets:po.Theodorou
ltx/gr_gr_cog/tr.d039:trVE.Stichera02.text	Τέτρωμαι, ἡδονῆς ῥομφαίᾳ Κύριε, καὶ δεινῶς ὅλως ἐνεκρώθην, ἴασαι, ζώωσον τὴν ταπεινήν μου ψυχήν, ὁ τῇ λόγχῃ τρωθεὶς Δέσποτα, καὶ τοὺς τετρωμένους βέλει τοῦ ἐχθροῦ, ὡς Σωτὴρ ἰασάμενος, καὶ σεπτῶν σου Παθῶν κοινωνὸν ἀνάδειξόν με.
ltx/gr_gr_cog/tr.d039:trVE.Stichera03.incipit	Τῇ Νηστείᾳ Κύριε, τὰς ψυχὰς…
ltx/gr_gr_cog/tr.d039:trVE.Stichera03.melody	Σταυρωθήτω ἔκραζον.
ltx/gr_gr_cog/tr.d039:trVE.Stichera03.mode	@ltx/gr_gr_cog/miscellanea:misc.Mode2
ltx/gr_gr_cog/tr.d039:trVE.Stichera03.text	Τῇ Νηστείᾳ Κύριε, τὰς ψυχὰς φωτισθέντες, καταξιωθῶμεν, τὸν Σταυρόν σου ἀκατακρίτως ἰδεῖν ἐν χαρᾷ, καὶ προσκυνῆσαι φοβερῶς· διαλάμπει γὰρ αὐτός, Πάθη τὰ σὰ τὰ ἑκούσια, ἃ εὐδόκησον φθάσαι, ἡμᾶς ὡς φιλάνθρωπος.
