ltx/gr_gr_cog/le.ep.mc.d084:lemcLI.Epistle.book_abbr	@ltx/gr_gr_cog/bible:Acts.abbr
ltx/gr_gr_cog/le.ep.mc.d084:lemcLI.Epistle.book_string	@ltx/gr_gr_cog/bible:Acts.text
ltx/gr_gr_cog/le.ep.mc.d084:lemcLI.Epistle.chapverse	5:21 – 32
ltx/gr_gr_cog/le.ep.mc.d084:lemcLI.Epistle.incipit	Εἰσῆλθον οἱ ἀπόστολοι εἰς τὸ ἱερόν…
ltx/gr_gr_cog/le.ep.mc.d084:lemcLI.Epistle.text	Ἐν ταῖς ἡμέραις ἐκείναις, εἰσῆλθον οἱ ἀπόστολοι εἰς τὸ ἱερὸν καὶ ἐδίδασκον. παραγενόμενος δὲ ὁ ἀρχιερεὺς καὶ οἱ σὺν αὐτῷ συνεκάλεσαν τὸ συνέδριον καὶ πᾶσαν τὴν γερουσίαν τῶν υἱῶν Ἰσραήλ, καὶ ἀπέστειλαν εἰς τὸ δεσμωτήριον ἀχθῆναι αὐτούς. οἱ δὲ ὑπηρέται παραγενόμενοι οὐχ εὗρον αὐτοὺς ἐν τῇ φυλακῇ, ἀναστρέψαντες δὲ ἀπήγγειλαν λέγοντες ὅτι τὸ μὲν δεσμωτήριον εὕρομεν κεκλεισμένον ἐν πάσῃ ἀσφαλείᾳ καὶ τοὺς φύλακας ἑστῶτας πρὸ τῶν θυρῶν, ἀνοίξαντες δὲ ἔσω οὐδένα εὕρομεν. ὡς δὲ ἤκουσαν τοὺς λόγους τούτους ὅ τε ἱερεὺς καὶ ὁ στρατηγὸς τοῦ ἱεροῦ καὶ οἱ ἀρχιερεῖς, διηπόρουν περὶ αὐτῶν τί ἂν γένοιτο τοῦτο. παραγενόμενος δέ τις ἀπήγγειλεν αὐτοῖς ὅτι ἰδοὺ οἱ ἄνδρες, οὓς ἔθεσθε ἐν τῇ φυλακῇ, εἰσὶν ἐν τῷ ἱερῷ ἑστῶτες καὶ διδάσκοντες τὸν λαόν. τότε ἀπελθὼν ὁ στρατηγὸς σὺν τοῖς ὑπηρέταις ἤγαγεν αὐτοὺς οὐ μετὰ βίας· ἐφοβοῦντο γὰρ τὸν λαόν, ἵνα μὴ λιθασθῶσιν· ἀγαγόντες δὲ αὐτοὺς ἔστησαν ἐν τῷ συνεδρίῳ. καὶ ἐπηρώτησεν αὐτοὺς ὁ ἀρχιερεὺς λέγων· οὐ παραγγελίᾳ παρηγγείλαμεν ὑμῖν μὴ διδάσκειν ἐπὶ τῷ ὀνόματι τούτῳ; καὶ ἰδοὺ πεπληρώκατε τὴν Ἱερουσαλὴμ τῆς διδαχῆς ὑμῶν, καὶ βούλεσθε ἐπαγαγεῖν ἐφ᾿ ἡμᾶς τὸ αἷμα τοῦ ἀνθρώπου τούτου. ἀποκριθεὶς δὲ Πέτρος καὶ οἱ ἀπόστολοι εἶπον· πειθαρχεῖν δεῖ Θεῷ μᾶλλον ἢ ἀνθρώποις. ὁ Θεὸς τῶν πατέρων ἡμῶν ἤγειρεν Ἰησοῦν, ὃν ὑμεῖς διεχειρίσασθε κρεμάσαντες ἐπὶ ξύλου· τοῦτον ὁ Θεὸς ἀρχηγὸν καὶ σωτῆρα ὕψωσε τῇ δεξιᾷ αὐτοῦ δοῦναι μετάνοιαν τῷ Ἰσραὴλ καὶ ἄφεσιν ἁμαρτιῶν. καὶ ἡμεῖς ἐσμεν αὐτοῦ μάρτυρες τῶν ῥημάτων τούτων, καὶ τὸ Πνεῦμα δὲ τὸ Ἅγιον ὃ ἔδωκεν ὁ Θεὸς τοῖς πειθαρχοῦσιν αὐτῷ.
ltx/gr_gr_cog/le.ep.mc.d084:lemcLI.Epistle.title	Τῷ Σαββάτῳ τῆς Βʹ Ἑβδομάδος
ltx/gr_gr_cog/le.ep.mc.d084:lemcLI.Epistle.title_abbr	Σαββάτῳ τῆς Βʹ Ἑβδομάδος
ltx/gr_gr_cog/le.ep.mc.d084:lemcLI.Epistle.version	@ltx/gr_gr_cog/properties:version.designation
