ltx/gr_gr_cog/le.ep.me.m12.dSatBC:lemeLI.Epistle.book_abbr	@ltx/gr_gr_cog/le.ep.mc.d301:lemcLI.Epistle.book_abbr
ltx/gr_gr_cog/le.ep.me.m12.dSatBC:lemeLI.Epistle.book_string	@ltx/gr_gr_cog/le.ep.mc.d301:lemcLI.Epistle.book_string
ltx/gr_gr_cog/le.ep.me.m12.dSatBC:lemeLI.Epistle.chapverse	@ltx/gr_gr_cog/le.ep.mc.d301:lemcLI.Epistle.chapverse
ltx/gr_gr_cog/le.ep.me.m12.dSatBC:lemeLI.Epistle.incipit	@ltx/gr_gr_cog/le.ep.mc.d301:lemcLI.Epistle.incipit
ltx/gr_gr_cog/le.ep.me.m12.dSatBC:lemeLI.Epistle.text	@ltx/gr_gr_cog/le.ep.mc.d301:lemcLI.Epistle.text
ltx/gr_gr_cog/le.ep.me.m12.dSatBC:lemeLI.Epistle.title	Τό Προεόρτιον
ltx/gr_gr_cog/le.ep.me.m12.dSatBC:lemeLI.Epistle.title_abbr	Τό Προεόρτιον
ltx/gr_gr_cog/le.ep.me.m12.dSatBC:lemeLI.Epistle.version	@ltx/gr_gr_cog/le.ep.mc.d301:lemcLI.Epistle.version
