ltx/gr_gr_cog/le.ep.me.m11.d28:lemeLI.Epistle.book_abbr	@ltx/gr_gr_cog/le.ep.me.m12.d15:lemeLI.Epistle.book_abbr
ltx/gr_gr_cog/le.ep.me.m11.d28:lemeLI.Epistle.book_string	@ltx/gr_gr_cog/le.ep.me.m12.d15:lemeLI.Epistle.book_string
ltx/gr_gr_cog/le.ep.me.m11.d28:lemeLI.Epistle.chapverse	@ltx/gr_gr_cog/le.ep.me.m12.d15:lemeLI.Epistle.chapverse
ltx/gr_gr_cog/le.ep.me.m11.d28:lemeLI.Epistle.incipit	@ltx/gr_gr_cog/le.ep.me.m12.d15:lemeLI.Epistle.incipit
ltx/gr_gr_cog/le.ep.me.m11.d28:lemeLI.Epistle.text	@ltx/gr_gr_cog/le.ep.me.m12.d15:lemeLI.Epistle.text
ltx/gr_gr_cog/le.ep.me.m11.d28:lemeLI.Epistle.title	Τοῦ Μάρτυρος
ltx/gr_gr_cog/le.ep.me.m11.d28:lemeLI.Epistle.title_abbr	Τοῦ Μάρτυρος
ltx/gr_gr_cog/le.ep.me.m11.d28:lemeLI.Epistle.version	@ltx/gr_gr_cog/le.ep.me.m12.d15:lemeLI.Epistle.version
