ltx/gr_gr_cog/le.go.me.m12.d17:lemeLI.Gospel.book_abbr	@ltx/gr_gr_cog/le.go.ge.hierarch:legeLI.Gospel.book_abbr
ltx/gr_gr_cog/le.go.me.m12.d17:lemeLI.Gospel.book_string	@ltx/gr_gr_cog/le.go.ge.hierarch:legeLI.Gospel.book_string
ltx/gr_gr_cog/le.go.me.m12.d17:lemeLI.Gospel.chapverse	@ltx/gr_gr_cog/le.go.ge.hierarch:legeLI.Gospel.chapverse
ltx/gr_gr_cog/le.go.me.m12.d17:lemeLI.Gospel.incipit	@ltx/gr_gr_cog/le.go.ge.hierarch:legeLI.Gospel.incipit
ltx/gr_gr_cog/le.go.me.m12.d17:lemeLI.Gospel.text	@ltx/gr_gr_cog/le.go.ge.hierarch:legeLI.Gospel.text
ltx/gr_gr_cog/le.go.me.m12.d17:lemeLI.Gospel.title	Τοῦ Ἱεράρχου
ltx/gr_gr_cog/le.go.me.m12.d17:lemeLI.Gospel.title_abbr	Τοῦ Ἱεράρχου
ltx/gr_gr_cog/le.go.me.m12.d17:lemeLI.Gospel.version	@ltx/gr_gr_cog/le.go.ge.hierarch:legeLI.Gospel.version
ltx/gr_gr_cog/le.go.me.m12.d17:lemeMA.Gospel.book_abbr	@ltx/gr_gr_cog/le.go.lu.d046:leluLI.Gospel.book_abbr
ltx/gr_gr_cog/le.go.me.m12.d17:lemeMA.Gospel.book_string	@ltx/gr_gr_cog/le.go.lu.d046:leluLI.Gospel.book_string
ltx/gr_gr_cog/le.go.me.m12.d17:lemeMA.Gospel.chapverse	@ltx/gr_gr_cog/le.go.lu.d046:leluLI.Gospel.chapverse
ltx/gr_gr_cog/le.go.me.m12.d17:lemeMA.Gospel.incipit	@ltx/gr_gr_cog/le.go.lu.d046:leluLI.Gospel.incipit
ltx/gr_gr_cog/le.go.me.m12.d17:lemeMA.Gospel.text	@ltx/gr_gr_cog/le.go.lu.d046:leluLI.Gospel.text
ltx/gr_gr_cog/le.go.me.m12.d17:lemeMA.Gospel.title	Τοῦ Προφήτου
ltx/gr_gr_cog/le.go.me.m12.d17:lemeMA.Gospel.title_abbr	Τοῦ Προφήτου
ltx/gr_gr_cog/le.go.me.m12.d17:lemeMA.Gospel.version	@ltx/gr_gr_cog/le.go.lu.d046:leluLI.Gospel.version
