ltx/gr_gr_cog/ho.ho06:hoH6.LentTroparion.incipit	Ὁ ἐν ἕκτῃ ἡμέρᾳ τε…
ltx/gr_gr_cog/ho.ho06:hoH6.LentTroparion.mode	@ltx/gr_gr_cog/miscellanea:misc.Mode6
ltx/gr_gr_cog/ho.ho06:hoH6.LentTroparion.text	Ὁ ἐν ἕκτῃ ἡμέρᾳ τε καὶ ὥρᾳ, τῷ Σταυρῷ προσηλώσας, τὴν ἐν τῷ Παραδείσῳ τολμηθεῖσαν τῷ Ἀδὰμ ἁμαρτίαν, καὶ τῶν πταισμάτων ἡμῶν τὸ χειρόγραφον, διάῤῥηξον Χριστὲ ὁ Θεὸς καὶ σῶσον ἡμᾶς.
ltx/gr_gr_cog/ho.ho06:hoH6.Prayer.incipit	Θεὲ καὶ Κύριε τῶν δυνάμεων…
ltx/gr_gr_cog/ho.ho06:hoH6.Prayer.text	Θεὲ καὶ Κύριε τῶν δυνάμεων, καὶ πάσης κτίσεως δημιουργέ, ὁ διὰ σπλάγχνα ἀνεικάστου ἐλέους σου, τὸν μονογενῆ σου Υἱόν, τὸν Κύριον ἡμῶν Ἰησοῦν Χριστόν, καταπέμψας ἐπὶ σωτηρίᾳ τοῦ γένους ἡμῶν, καὶ διὰ τοῦ τιμίου αὐτοῦ Σταυροῦ, τὸ χειρόγραφον τῶν ἁμαρτιῶν ἡμῶν διαῤῥήξας, καὶ θριαμβεύσας ἐν αὐτῷ τὰς ἀρχὰς καὶ ἐξουσίας τοῦ σκότους, αὐτός, Δέσποτα φιλάνθρωπε, πρόσδεξαι καὶ ἡμῶν τῶν ἁμαρτωλῶν τὰς εὐχαριστηρίους ταύτας καὶ ἱκετηρίους ἐντεύξεις, καὶ ῥῦσαι ἡμᾶς ἀπὸ παντὸς ὀλεθρίου καὶ σκοτεινοῦ παραπτώματος, καὶ πάντων τῶν κακῶσαι ἡμᾶς ζητούντων, ὁρατῶν καὶ ἀοράτων ἐχθρῶν. Καθήλωσον ἐκ τοῦ φόβου σου τὰς σάρκας ἡμῶν, καὶ μὴ ἐκκλίνῃς τὰς καρδίας ἡμῶν εἰς λόγους, ἢ εἰς λογισμοὺς πονηρίας, ἀλλὰ τῷ πόθῳ σου τρῶσον ἡμῶν τὰς ψυχάς, ἵνα πρὸς σὲ διαπαντὸς ἀτενίζοντες, καὶ τῷ παρὰ σοῦ φωτὶ ὁδηγούμενοι, σὲ τὸ ἀπρόσιτον καὶ ἀΐδιον κατοπτεύοντες φῶς, ἀκατάπαυστόν σοι τὴν ἐξομολόγησιν, καὶ εὐχαριστίαν ἀναπέμπομεν, τῷ ἀνάρχῳ Πατρὶ σὺν τῷ μονογενεῖ σου Υἱῷ, καὶ τῷ παναγίῳ, καὶ ἀγαθῷ, καὶ ζωοποιῷ σου Πνεύματι, νῦν, καὶ ἀεί, καὶ εἰς τοὺς αἰῶνας τῶν αἰώνων.
ltx/gr_gr_cog/ho.ho06:hoH6.Theotokion.incipit	Ὅτι οὐκ ἔχομεν παῤῥησίαν…
ltx/gr_gr_cog/ho.ho06:hoH6.Theotokion.text	Ὅτι οὐκ ἔχομεν παῤῥησίαν διὰ τὰ πολλὰ ἡμῶν ἁμαρτήματα, σὺ τὸν ἐκ σοῦ γεννηθέντα δυσώπησον Θεοτόκε Παρθένε· πολλὰ γὰρ ἰσχύει δέησις Μητρὸς πρὸς εὐμένειαν Δεσπότου. Μὴ παρίδῃς ἁμαρτωλῶν ἱκεσίας, ἡ πάνσεμνος, ὅτι ἐλεήμων ἐστί, καὶ σῴζειν δυνάμενος, ὁ καὶ παθεῖν ὑπὲρ ἡμῶν καταδεξάμενος.
ltx/gr_gr_cog/ho.ho06:hoH6.Troparion1.incipit	@ltx/gr_gr_cog/oc.m2.d4:ocMA.Kathisma11.incipit
ltx/gr_gr_cog/ho.ho06:hoH6.Troparion1.text	@ltx/gr_gr_cog/oc.m2.d4:ocMA.Kathisma11.text
ltx/gr_gr_cog/ho.ho06:hoH6.Troparion2.incipit	@ltx/gr_gr_cog/oc.m2.d4:ocMA.Kathisma21.incipit
ltx/gr_gr_cog/ho.ho06:hoH6.Troparion2.text	@ltx/gr_gr_cog/oc.m2.d4:ocMA.Kathisma21.text
ltx/gr_gr_cog/ho.ho06:hoH6.Troparion3.incipit	@ltx/gr_gr_cog/he.a.m2:heAU.EfsplagchniasYparchousa.incipit
ltx/gr_gr_cog/ho.ho06:hoH6.Troparion3.text	@ltx/gr_gr_cog/he.a.m2:heAU.EfsplagchniasYparchousa.text
ltx/gr_gr_cog/ho.ho06:hoH6.Troparion4.incipit	@ltx/gr_gr_cog/oc.m2.d1:ocMA.Kathisma13.incipit
ltx/gr_gr_cog/ho.ho06:hoH6.Troparion4.text	@ltx/gr_gr_cog/oc.m2.d1:ocMA.Kathisma13.text
ltx/gr_gr_cog/ho.ho06:hoH6.title	ΩΡΑ Ϛʹ.
