ltx/gr_gr_cog/octoechos.rubrics:ocEO.R001	ΕΞΑΠΟΣΤΕΙΛΑΡΙΑ
ltx/gr_gr_cog/octoechos.rubrics:ocEO.R002	ΚΑΙ ΤΑ ΕΝΔΕΚΑ ΕΩΘΙΝΑ ΙΔΙΟΜΕΛΑ
ltx/gr_gr_cog/octoechos.rubrics:ocEO.R003	ΤΑ ΑΝΑΣΤΑΣΙΜΑ
ltx/gr_gr_cog/octoechos.rubrics:ocEO.R004	Τὰ μὲν Ἑωθινά, ποιήματα Λέοντος βασιλέως τοῦ Σοφοῦ, τὰ δὲ Ἐξαποστειλάρια, τοῦ υἱοῦ αὐτου Κωνσταντίνου τοῦ βασιλέως.
ltx/gr_gr_cog/octoechos.rubrics:ocEO.R005	ΕΞΑΠΟΣΤΕΙΛΑΡΙΟΝ Αʹ
ltx/gr_gr_cog/octoechos.rubrics:ocEO.R006	ΕΩΘΙΝΟΝ Αʹ
ltx/gr_gr_cog/octoechos.rubrics:ocEO.R007	ΕΞΑΠΟΣΤΕΙΛΑΡΙΟΝ Βʹ
ltx/gr_gr_cog/octoechos.rubrics:ocEO.R008	ΕΩΘΙΝΟΝ Βʹ
ltx/gr_gr_cog/octoechos.rubrics:ocEO.R009	ΕΞΑΠΟΣΤΕΙΛΑΡΙΟΝ Γʹ
ltx/gr_gr_cog/octoechos.rubrics:ocEO.R010	ΕΩΘΙΝΟΝ Γʹ
ltx/gr_gr_cog/octoechos.rubrics:ocEO.R011	ΕΞΑΠΟΣΤΕΙΛΑΡΙΟΝ Δʹ
ltx/gr_gr_cog/octoechos.rubrics:ocEO.R012	ΕΩΘΙΝΟΝ Δʹ
ltx/gr_gr_cog/octoechos.rubrics:ocEO.R013	ΕΞΑΠΟΣΤΕΙΛΑΡΙΟΝ Εʹ
ltx/gr_gr_cog/octoechos.rubrics:ocEO.R014	ΕΩΘΙΝΟΝ Εʹ
ltx/gr_gr_cog/octoechos.rubrics:ocEO.R015	ΕΞΑΠΟΣΤΕΙΛΑΡΙΟΝ Ϛʹ
ltx/gr_gr_cog/octoechos.rubrics:ocEO.R016	ΕΩΘΙΝΟΝ Ϛʹ
ltx/gr_gr_cog/octoechos.rubrics:ocEO.R017	ΕΞΑΠΟΣΤΕΙΛΑΡΙΟΝ Ζʹ
ltx/gr_gr_cog/octoechos.rubrics:ocEO.R018	ΕΩΘΙΝΟΝ Ζʹ
ltx/gr_gr_cog/octoechos.rubrics:ocEO.R019	ΕΞΑΠΟΣΤΕΙΛΑΡΙΟΝ Ηʹ
ltx/gr_gr_cog/octoechos.rubrics:ocEO.R020	ΕΩΘΙΝΟΝ Ηʹ
ltx/gr_gr_cog/octoechos.rubrics:ocEO.R021	ΕΞΑΠΟΣΤΕΙΛΑΡΙΟΝ Θʹ
ltx/gr_gr_cog/octoechos.rubrics:ocEO.R022	ΕΩΘΙΝΟΝ Θʹ
ltx/gr_gr_cog/octoechos.rubrics:ocEO.R023	ΕΞΑΠΟΣΤΕΙΛΑΡΙΟΝ Ιʹ
ltx/gr_gr_cog/octoechos.rubrics:ocEO.R024	ΕΩΘΙΝΟΝ Ιʹ
ltx/gr_gr_cog/octoechos.rubrics:ocEO.R025	ΕΞΑΠΟΣΤΕΙΛΑΡΙΟΝ ΙΑʹ
ltx/gr_gr_cog/octoechos.rubrics:ocEO.R026	ΕΩΘΙΝΟΝ ΙΑʹ
ltx/gr_gr_cog/octoechos.rubrics:ocMA.R001	Μετὰ τὸν Ἑξάψαλμον καὶ τὴν Μεγάλην Συναπτήν, ψάλλομεν τὸ Θεὸς Κύριος, τετράκις, εἰς Ἦχον αʹ, καὶ τὸ Ἀναστάσιμον Ἀπολυτίκιον δίς, τὸ δὲ Θεοτοκίον ἅπαξ.
ltx/gr_gr_cog/octoechos.rubrics:ocMA.R002	Πᾶσα πνοή. Εὐαγγέλιον Ἑωθινόν, τὸ ἐνδιάτακτον. Εἶτα· Ἀνάστασιν Χριστοῦ θεασάμενοι· καὶ μετὰ τὸν Νʹ Ψαλμόν, ψάλλομεν εἰς Ἦχον βʹ.
ltx/gr_gr_cog/octoechos.rubrics:ocMA.R003	Μετὰ δὲ τό, Σῶσον, ὁ Θεός, τὸν λαόν σου…, καὶ τὴν Ἐκφώνησιν, ἀρχόμεθα τῶν Κανόνων, ποιοῦντες τὸν μὲν Ἀναστάσιμον εἰς δʹ, τὸν Σταυροαναστάσιμον εἰς γʹ, τὸν τῆς Θεοτόκου εἰς γʹ καὶ τὸν τοῦ Ἁγίου τῆς ἡμέρας εἰς δʹ. Εἰ δὲ ἑορτάζεται ὁ Ἅγιος εἰς Ϛʹ, καταλιμπάνοντες τὸν Σταυροαναστάσιμον, ποιοῦμεν τῆς Θεοτόκου εἰς δʹ, εἰ δὲ ἑορτάζεται εἰς ηʹ, ποιοῦμεν τῆς Θεοτόκου εἰς βʹ.
ltx/gr_gr_cog/octoechos.rubrics:ocMA.R004	Ἐξαποστειλάριον λέγομεν τὸ ἐνδιάτακτον Ἑωθινὸν καὶ τὸ Θεοτοκίον αὐτοῦ.
ltx/gr_gr_cog/octoechos.rubrics:ocMA.R005	Τό, Πᾶσα πνοή. Ἱστῶμεν δὲ στίχους ηʹ, ψάλλοντες τα δʹ Στιχηρὰ Αναστάσιμα καὶ τὰ ἑξῆς δʹ Ἀνατολικά. Ἐὰν ὅμως τύχῃ ἑορτὴ τῆς Θεοτόκου ἢ δοξολογουμένου Ἁγίου, τότε, μετὰ τὰ δʹ Στιχηρὰ Ἀναστάσιμα, ψάλλομεν δʹ τῆς ἑορτῆς ἢ τοῦ Ἁγίου, καταλιμπάνοντες τὰ δʹ Ἀνατολικά.
ltx/gr_gr_cog/octoechos.rubrics:ocMA.R006	Εἶτα, Δοξολογία μεγάλη, καὶ μετʼ αὐτὴν τὸ ἑπόμενον τροπάριον.
ltx/gr_gr_cog/octoechos.rubrics:ocMA.R007	Μετὰ τὸν Ἑξάψαλμον, ψάλλομεν τὸ Θεὸς Κύριος…, μετὰ τῶν στίχων αὐτοῦ καὶ τὸ τροπάριον τοῦ Ἁγίου τῆς ἡμέρας. Ἐν δὲ ταῖς ἁγίαις Τεσσαρακοσταῖς, τό, Ἀλληλούϊα, μετὰ τῶν στίχων αὐτοῦ, καὶ τοὺς τριαδικοὺς ὕμνους τοῦ οἰκείου ἤχου. Μετὰ δὲ τὴν αʹ Στιχολογίαν τοῦ Ψαλτηρίου ψάλλομεν τὰ παρόντα Καθίσματα.
ltx/gr_gr_cog/octoechos.rubrics:ocMA.R008	Καὶ μετὰ τὸν Νʹ Ψαλμόν, ψάλλομεν τοὺς ἑπομένους δύο Κανόνας.
ltx/gr_gr_cog/octoechos.rubrics:ocMA.R009	Ὅτε δέ ἐστιν Ἀλληλούϊα, λέγομεν τὰ ἀνωτέρω Μαρτυρικὰ εἰς τοὺς Αἴνους, Ἀπόστιχα δὲ τὰ ἑπόμενα Προσόμοια, ποίημα τοῦ κυρίου Θεοφάνους· ὧν, καὶ τῶν ἐν τοῖς ἄλλοις ἤχοις τοιούτων Προσομοίων, ἡ ἀκροστιχίς ἐστι· «Σούς, Χριστέ, δούλους γράψηον ἐν ζώντων βίβλῳ».
ltx/gr_gr_cog/octoechos.rubrics:ocMA.R010	Πᾶσα πνοή. Εὐαγγέλιον Ἑωθινόν, τὸ ἐνδιάτακτον. Εἶτα· Ἀνάστασιν Χριστοῦ θεασάμενοι· τὸν Νʹ Ψαλμόν, καὶ τὰ λοιπὰ (ὅρα ὄπισθεν). Μετὰ ταῦτα ψάλλονται οἱ Κανόνες.
ltx/gr_gr_cog/octoechos.rubrics:ocMA.R011	Ἐξαποστειλάριον, τὸ ἐνδιάτακτον Ἑωθινόν.
ltx/gr_gr_cog/octoechos.rubrics:ocMA.R012	Εἰ δέ ἐστιν, Ἀλληλούϊα, λέγομεν τὰ ἀνωτέρω Μαρτυρικὰ εἰς τοὺς Αἴνους, Ἀπόστιχα δὲ ταῦτα.
ltx/gr_gr_cog/octoechos.rubrics:ocMA.R013	Δοξολογία μεγάλη, καὶ μετʼ αὐτήν, τὸ τροπάριον·
ltx/gr_gr_cog/octoechos.rubrics:ocMA.R014	ἀντὶ τοῦ πάλαι ψαλλομένου εἰς τὸν πλ. α, πλ. β, βαρὺν καὶ πλ. δ ἦχον, ἔχοντος οὕτως·
ltx/gr_gr_cog/octoechos.rubrics:ocMO.R001	Τὸ Ἄξιόν ἐστιν… καὶ τὰ λοιπὰ τοῦ Μεσονυκτικοῦ καὶ Ἀπόλυσις.
ltx/gr_gr_cog/octoechos.rubrics:ocPHOTAGOGIC.R001	ΦΩΤΑΓΩΓΙΚΑ
ltx/gr_gr_cog/octoechos.rubrics:ocPHOTAGOGIC.R002	@ltx/gr_gr_cog/octoechos.rubrics:ocTRIADIC.R002
ltx/gr_gr_cog/octoechos.rubrics:ocPHOTAGOGIC.R003	Ἐκ τρίου ψαλλόμενα
ltx/gr_gr_cog/octoechos.rubrics:ocPHOTAGOGIC.R004	Ἰστέον, ὅτι τὴν συμπλήρωσιν τοῦ φωταγωγικου, ψαλλομένου τρὶς (ἐξαιρέσει τοῦ φωταγωγικοῦ τοῦ πλ. βʹ ἤχου) ποιοῦμεν οὕτω·
ltx/gr_gr_cog/octoechos.rubrics:ocPHOTAGOGIC.R005	Τοῦ αʹ.
ltx/gr_gr_cog/octoechos.rubrics:ocPHOTAGOGIC.R006	Τοῦ βʹ.
ltx/gr_gr_cog/octoechos.rubrics:ocPHOTAGOGIC.R007	@ltx/gr_gr_cog/octoechos.rubrics:ocTRIADIC.R008
ltx/gr_gr_cog/octoechos.rubrics:ocPHOTAGOGIC.R008	πρεσβείαις τῶν Μαρτύρων (ἢ τῶν Ἱεραρχῶν ἢ τοῦ Ὁσίου) καὶ σῶσόν με.
ltx/gr_gr_cog/octoechos.rubrics:ocPHOTAGOGIC.R009	Ἄλλως ὡς τοῦ αʹ, ἐξαιρέσει τῆς Πέμπητες, καθʼ ἣν τὴν συμπλήρωσιν ποιοῦμεν μετὰ τοῦ
ltx/gr_gr_cog/octoechos.rubrics:ocPHOTAGOGIC.R010	@ltx/gr_gr_cog/da.d5:daMA.Photagogic2Ending.text
ltx/gr_gr_cog/octoechos.rubrics:ocPHOTAGOGIC.R011	Τοῦ γ, καὶ ἐν Σαββάτῳ τοῦ β, ὡς ψαλλομένου μόνον δίς, ἀείποτε μετὰ τοῦ
ltx/gr_gr_cog/octoechos.rubrics:ocPHOTAGOGIC.R012	Ἰστέον καὶ τοῦτο, ὅτι τὴν συμπλήρωσιν τοῦ φωταγωγικοῦ τοῦ πλ. βʹ ἤχου ποιοῦμεν ἐν τῇ ἀρχῇ αὐτοῦ, προσθέτοτνες καὶ τό, «Κύριε».
ltx/gr_gr_cog/octoechos.rubrics:ocPHOTAGOGIC.R013	Οὑτωσὶ συμπληροῦμεν καὶ τὸ τέλος τοῦ φωταγωγικοῦ τοῦ δʹ ἤχου, ὡς στερουμένου κλητικῆς προσφωνήσεως.
ltx/gr_gr_cog/octoechos.rubrics:ocSV.R001	Εἰς τό,
ltx/gr_gr_cog/octoechos.rubrics:ocSV.R002	Κύριε, ἐκέκραξα,
ltx/gr_gr_cog/octoechos.rubrics:ocSV.R003	ἱστῶμεν Στίχους δʹ, καὶ ψάλλομεν Στιχηρὰ Ἀναστάσιμα τῆς Ὀκτωήχου γʹ, δευτεροῦντες τὸ αʹ.
ltx/gr_gr_cog/octoechos.rubrics:ocSV.R004	Θεοτοκίον, τὸ Δογματικόν.
ltx/gr_gr_cog/octoechos.rubrics:ocSV.R005	Μετὰ τό,
ltx/gr_gr_cog/octoechos.rubrics:ocSV.R006	Καταξίωσον κ.λ.π.,
ltx/gr_gr_cog/octoechos.rubrics:ocSV.R007	ψάλλομεν τὸ Ἀναστάσιμον Στιχηρόν,
ltx/gr_gr_cog/octoechos.rubrics:ocSV.R008	καὶ εἶτα τὰ παρόντα Προσόμοια.
ltx/gr_gr_cog/octoechos.rubrics:ocTHEOTOKIA.R001	ΘΕΟΤΟΚΙΑ
ltx/gr_gr_cog/octoechos.rubrics:ocTHEOTOKIA.R002	ΕΙΣ ΕΚΑΣΤΟΝ ΗΧΟΝ
ltx/gr_gr_cog/octoechos.rubrics:ocTHEOTOKIA.R003	Ψαλλόμενα ἐν ὅλῳ τῷ ἐνιαυτῷ, μετὰ τὰ Ἀπολυτίκια τῶν μὴ ἑορταζομένων Ἁγίων
ltx/gr_gr_cog/octoechos.rubrics:ocTHEOTOKIA.R004	Εἰς τὸν αʹ ἦχον
ltx/gr_gr_cog/octoechos.rubrics:ocTHEOTOKIA.R005	Εἰς τὸν βʹ ἦχον
ltx/gr_gr_cog/octoechos.rubrics:ocTHEOTOKIA.R006	Εἰς τὸν γʹ ἦχον
ltx/gr_gr_cog/octoechos.rubrics:ocTHEOTOKIA.R007	Εἰς τὸν δʹ ἦχον
ltx/gr_gr_cog/octoechos.rubrics:ocTHEOTOKIA.R008	Εἰς τὸν πλ. αʹ ἦχον
ltx/gr_gr_cog/octoechos.rubrics:ocTHEOTOKIA.R009	Εἰς τὸν πλ. βʹ ἦχον
ltx/gr_gr_cog/octoechos.rubrics:ocTHEOTOKIA.R010	Εἰς τὸν βαρὺν ἦχον
ltx/gr_gr_cog/octoechos.rubrics:ocTHEOTOKIA.R011	Εἰς τὸν πλ. δʹ ἦχον
ltx/gr_gr_cog/octoechos.rubrics:ocTHEOTOKIA.R012	Εἰς τό, Θεός, Κύριος.
ltx/gr_gr_cog/octoechos.rubrics:ocTHEOTOKIA.R013	Εἰς τὸ τέλος τοῦ Ὄρθρου.
ltx/gr_gr_cog/octoechos.rubrics:ocTHEOTOKIA.R014	Τῇ Κυριακῇ ἑσπέρας καὶ τῇ Δευτέρᾳ πρωΐ.
ltx/gr_gr_cog/octoechos.rubrics:ocTHEOTOKIA.R015	Τῇ Δευτέρᾳ ἑσπέρας καὶ τῇ Τρίτῃ πρωΐ.
ltx/gr_gr_cog/octoechos.rubrics:ocTHEOTOKIA.R016	Τῇ Τρίτῃ ἑσπέρας καὶ τῇ Τετάρτῃ πρωΐ.
ltx/gr_gr_cog/octoechos.rubrics:ocTHEOTOKIA.R017	Τῇ Τετάρτῃ ἑσπέρας καὶ τῇ Πέμπτῃ πρωΐ.
ltx/gr_gr_cog/octoechos.rubrics:ocTHEOTOKIA.R018	Τῇ Πέμπτῃ ἑσπέρας καὶ τῇ Παρασκευῇ πρωΐ.
ltx/gr_gr_cog/octoechos.rubrics:ocTHEOTOKIA.R019	Τῇ Παρασκευῇ ἑσπέρας καὶ τῷ Σαββάτῳ πρωΐ.
ltx/gr_gr_cog/octoechos.rubrics:ocTRIADIC.R001	ΥΜΝΟΙ ΤΡΙΑΔΙΚΟΙ
ltx/gr_gr_cog/octoechos.rubrics:ocTRIADIC.R002	ΚΑΤʼ ΗΧΟΝ
ltx/gr_gr_cog/octoechos.rubrics:ocTRIADIC.R003	Ψαλλόμενοι ἐν ταῖς νηστησείμοις ἡμέραις, ὅτε ἐστὶν Ἀλληλούϊα
ltx/gr_gr_cog/octoechos.rubrics:ocTRIADIC.R004	Βλέπε τὰ πρὸς συμπλήρωσιν τῶν τριαδικῶν ὕμνων ἁρμόζοντα ἐν ἑκάστη ἡμέρᾳ Ἀκροστίχια ἐν τῇ σημειώσει.
ltx/gr_gr_cog/octoechos.rubrics:ocTRIADIC.R005	Ἱστέον, ὅτι συμπλήρωσιν τριαδικῶν ὕμνων ποιοῦμεν οὕτω·
ltx/gr_gr_cog/octoechos.rubrics:ocTRIADIC.R006	Τοῦ αʹ ὕμνου.
ltx/gr_gr_cog/octoechos.rubrics:ocTRIADIC.R007	Τοῦ βʹ ὕμνου.
ltx/gr_gr_cog/octoechos.rubrics:ocTRIADIC.R008	Ἐφʼ ὅσον ὁ ναὸς τιμᾶται ἐπʼ ὀνόματι Ἁγίου ἢ Ἁγίας τινός, μετὰ μνείας τῆς τάξεως εἰς ἣν ἀνήκει ὁ Ἅγιος ἢ ἡ Ἁγία,
ltx/gr_gr_cog/octoechos.rubrics:ocTRIADIC.R009	Πρεσβείαις τοῦ Ὁσίου (ἢ τῆς Μάρτυρος ἢ τοῦ Ἱεράρχου κ.λ.π.) σῶσον ἡμᾶς.
ltx/gr_gr_cog/octoechos.rubrics:ocTRIADIC.R010	Ἄλλως ἡ συμπλήρωσις τοῦ βʹ ὕμνου γίνεται ὡς τοῦ αʹ τοιούτου, ἐξαιρέσει τῆς Πέμπτης, καθʼ ἣν τὴν συμπλήρωσιν ποιοῦμεν μετὰ τοῦ
ltx/gr_gr_cog/octoechos.rubrics:ocTRIADIC.R011	@ltx/gr_gr_cog/da.d5:daMA.Triadic2Ending.text
ltx/gr_gr_cog/octoechos.rubrics:ocTRIADIC.R012	Τοῦ γʹ ὕμνου.
ltx/gr_gr_cog/octoechos.rubrics:ocTRIADIC.R013	Ἀείποτε μετὰ τοῦ·
ltx/gr_gr_cog/octoechos.rubrics:ocTRIADIC.R014	@ltx/gr_gr_cog/prayers:pr.triadic_end_Theotokos.text
ltx/gr_gr_cog/octoechos.rubrics:ocVE.R001	Μετὰ τὸν Προοιμιακὸν Ψαλμόν, καἰ τὸ πρῶτον Κάθισμα τοῦ Ψαλτηρίου, εἰς τό,
ltx/gr_gr_cog/octoechos.rubrics:ocVE.R002	ἱστῶμεν Στίχους ιʹ, καὶ ψάλλομεν Στιχηρὰ Ἀναστάσιμα ζʹ ἢ Ϛʹ ἢ δʹ, καὶ τοῦ Ἁγίου τῆς ἡμέρας γʹ ἢ δʹ καὶ Ϛʹ, εἴπερ ἑορτάζεται ὁ Ἅγιος.
ltx/gr_gr_cog/octoechos.rubrics:ocVE.R003	Δόξα,
ltx/gr_gr_cog/octoechos.rubrics:ocVE.R004	τοῦ Ἁγίου, εἴ ἐστιν ἑορταζόμενος.
ltx/gr_gr_cog/octoechos.rubrics:ocVE.R005	Καὶ νῦν,
ltx/gr_gr_cog/octoechos.rubrics:ocVE.R006	τὸ ἑπόμενον Θεοτοκίον· εἰδὲ μή,
ltx/gr_gr_cog/octoechos.rubrics:ocVE.R007	Μετὰ δὲ τὴν Εἴσοδον καὶ τό, Φῶς ἱλαρόν, βαλὼν ὁ ταχθεὶς Μοναχὸς τὴν συνήθη μετάνοιαν τῷ Προεστῶτι, ψάλλει τὸ τῆς ἡμέρας
ltx/gr_gr_cog/octoechos.rubrics:ocVE.R008	Εἶτα ἡ συνήθης Ἐκτενής, τό,
ltx/gr_gr_cog/octoechos.rubrics:ocVE.R009	καὶ μετὰ τὴν Ἐκφώνησιν, ψάλλομεν τὸ ἰδιόμελον Στιχηρὸν τοῦ Ἁγίου τῆς Μονῆς, λιτανεύοντες ἐν τῷ Νάρθηκι. Μετὰ δὲ τὰς συνήθεις εὐχὰς εἰσερχόμεθα ὲν τῷ Ναῷ, καὶ ψάλλομεν τὸ Ὰναστάσιμον Στιχηρὸν τῶν Ἀποστίχων.
ltx/gr_gr_cog/octoechos.rubrics:ocVE.R010	Ἕτερα Στιχηρὰ τοῦ Δαμασκηνοῦ, ὧν ἡ ἀκροστιχὶς ἀλφάβητον, ἐν δὲ τοῖς Θεοτοκίοις, Ἰωάννου Ἀμήν, τὸ δὲ Ἀμήν ἐστι μέσον τοῦ Ἀνύμφευτε Παρθένε.
ltx/gr_gr_cog/octoechos.rubrics:ocVE.R011	τοῦ Ἁγίου, εἴ ἐστιν· εἰδὲ μή,
ltx/gr_gr_cog/octoechos.rubrics:ocVE.R012	Καὶ ἡ λοιπὴ Ἀκολουθία τῆς ἀγρυπνίας.
ltx/gr_gr_cog/octoechos.rubrics:ocVE.R013	Καὶ Ἀπόλυσις.
ltx/gr_gr_cog/octoechos.rubrics:ocVE.R014	Μαρτυρικά, ὅταν ἔνι Ἀλληλούϊα, εἰς τὸ «Κύριε ἐκέκραξα», ψάλλονται. Εἰς δὲ τὸν Στίχον λέγομεν τὸ αʹ Μαρτυρικόν, καὶ δύο Νεκρώσιμα ἰδιόμελα τοῦ Δαμασκηνοῦ. Εἰς Στίχον τὸν δεύτερον·
ltx/gr_gr_cog/octoechos.rubrics:ocVE.R015	Τὰ κατʼ Ἀλφάβητον. Ἰωάννου τοῦ Δαμασκηνοῦ.
