ltx/gr_gr_cog/le.ep.mc.d247:lemcLI.Epistle.book_abbr	@ltx/gr_gr_cog/bible:Philippians.abbr
ltx/gr_gr_cog/le.ep.mc.d247:lemcLI.Epistle.book_string	@ltx/gr_gr_cog/bible:Philippians.text
ltx/gr_gr_cog/le.ep.mc.d247:lemcLI.Epistle.chapverse	1:1 – 7
ltx/gr_gr_cog/le.ep.mc.d247:lemcLI.Epistle.incipit	Παῦλος καὶ Τιμόθεος, δοῦλοι Ἰησοῦ Χριστοῦ…
ltx/gr_gr_cog/le.ep.mc.d247:lemcLI.Epistle.text	Παῦλος καὶ Τιμόθεος, δοῦλοι Ἰησοῦ Χριστοῦ, πᾶσι τοῖς ἁγίοις ἐν Χριστῷ Ἰησοῦ τοῖς οὖσιν ἐν Φιλίπποις σὺν ἐπισκόποις καὶ διακόνοις· χάρις ὑμῖν καὶ εἰρήνη ἀπὸ Θεοῦ πατρὸς ἡμῶν καὶ Κυρίου Ἰησοῦ Χριστοῦ. Εὐχαριστῶ τῷ Θεῷ μου ἐπὶ πάσῃ τῇ μνείᾳ ὑμῶν, πάντοτε ἐν πάσῃ δεήσει μου ὑπὲρ πάντων ὑμῶν μετὰ χαρᾶς τὴν δέησιν ποιούμενος ἐπὶ τῇ κοινωνίᾳ ὑμῶν εἰς τὸ εὐαγγέλιον ἀπὸ πρώτης ἡμέρας ἄχρι τοῦ νῦν, πεποιθὼς αὐτὸ τοῦτο, ὅτι ὁ ἐναρξάμενος ἐν ὑμῖν ἔργον ἀγαθὸν ἐπιτελέσει ἄχρις ἡμέρας Ἰησοῦ Χριστοῦ, καθώς ἐστι δίκαιον ἐμοὶ τοῦτο φρονεῖν ὑπὲρ πάντων ὑμῶν διὰ τὸ ἔχειν με ἐν τῇ καρδίᾳ ὑμᾶς, ἔν τε τοῖς δεσμοῖς μου καὶ ἐν τῇ ἀπολογίᾳ καὶ βεβαιώσει τοῦ εὐαγγελίου συγκοινωνούς μου τῆς χάριτος πάντας ὑμᾶς ὄντας.
ltx/gr_gr_cog/le.ep.mc.d247:lemcLI.Epistle.title	Τῇ Δευτέρᾳ τῆς ΙΘʹ Ἑβδομάδος
ltx/gr_gr_cog/le.ep.mc.d247:lemcLI.Epistle.title_abbr	Δευτέρᾳ τῆς ΙΘʹ Ἑβδομάδος
ltx/gr_gr_cog/le.ep.mc.d247:lemcLI.Epistle.version	@ltx/gr_gr_cog/properties:version.designation
