ltx/gr_gr_cog/me.m02.d27:meDA.commemoration.first	Μνήμη τοῦ Ὁσίου Προκοπίου τοῦ Δεκαπολίτου
ltx/gr_gr_cog/me.m02.d27:meDA.commemoration.first_name	
ltx/gr_gr_cog/me.m02.d27:meDA.commemoration.first_short	Μνήμη τοῦ Ὁσίου Προκοπίου τοῦ Δεκαπολίτου
ltx/gr_gr_cog/me.m02.d27:meDA.commemoration.first_title	@ltx/gr_gr_cog/titles:ti.DevoutSaintM
ltx/gr_gr_cog/me.m02.d27:meDA.commemoration.full	Μνήμη τοῦ Ὁσίου Πατρὸς ἡμῶν Προκοπίου τοῦ Δεκαπολίτου
ltx/gr_gr_cog/me.m02.d27:meDA.commemoration.second_name	
ltx/gr_gr_cog/me.m02.d27:meDA.commemoration.second_title	
ltx/gr_gr_cog/me.m02.d27:meDA.date	Τῌ ΚΖʹ ΦΕΒΡΟΥΑΡΙΟΥ
ltx/gr_gr_cog/me.m02.d27:meDA.fordate	διὰ τὴν 27ην Φεβρουαρίου
ltx/gr_gr_cog/me.m02.d27:meDA.insert1	καὶ τοῦ Ὁσίου Πατρὸς ἡμῶν Προκοπίου τοῦ Δεκαπολίτου,
ltx/gr_gr_cog/me.m02.d27:meDA.insert2	οὗ καὶ τὴν μνήμην ἐπιτελοῦμεν·
ltx/gr_gr_cog/me.m02.d27:meDA.note	
ltx/gr_gr_cog/me.m02.d27:meDA.pdfcoverdate	τῆς 27ης Φεβρουαρίου,
ltx/gr_gr_cog/me.m02.d27:meDA.pdfheaderdate	τῆς 27ης Φεβρουαρίου
ltx/gr_gr_cog/me.m02.d27:meHO.commemorations	
ltx/gr_gr_cog/me.m02.d27:meHO.note1	
ltx/gr_gr_cog/me.m02.d27:meHO.note2	
ltx/gr_gr_cog/me.m02.d27:meHO.number	
ltx/gr_gr_cog/me.m02.d27:meHO.rank	
ltx/gr_gr_cog/me.m02.d27:meLE.commemoration1	Μνήμη τοῦ Ὁσίου Πατρὸς ἡμῶν Προκοπίου τοῦ Δεκαπολίτου.
ltx/gr_gr_cog/me.m02.d27:meLE.commemoration2	
ltx/gr_gr_cog/me.m02.d27:meLI.Kontakion1.greekmelody	@ltx/gr_gr_cog/me.m02.d27:meMA.Kontakion1.greekmelody
ltx/gr_gr_cog/me.m02.d27:meLI.Kontakion1.incipit	@ltx/gr_gr_cog/me.m02.d27:meMA.Kontakion1.incipit
ltx/gr_gr_cog/me.m02.d27:meLI.Kontakion1.melody	@ltx/gr_gr_cog/me.m02.d27:meMA.Kontakion1.melody
ltx/gr_gr_cog/me.m02.d27:meLI.Kontakion1.mode	@ltx/gr_gr_cog/me.m02.d27:meMA.Kontakion1.mode
ltx/gr_gr_cog/me.m02.d27:meLI.Kontakion1.text	@ltx/gr_gr_cog/me.m02.d27:meMA.Kontakion1.text
ltx/gr_gr_cog/me.m02.d27:meLI.Megalynarion.text	
ltx/gr_gr_cog/me.m02.d27:meMA.C1.acrostic.notice1	ἔχων Ἀκροστιχίδα·
ltx/gr_gr_cog/me.m02.d27:meMA.C1.acrostic.text	Τοὺς σοὺς ἀγῶνας εὐπρεπῶς μέλπω μάκαρ.
ltx/gr_gr_cog/me.m02.d27:meMA.C1.acrostic.title	Κανὼν τοῦ Ὁσίου,
ltx/gr_gr_cog/me.m02.d27:meMA.C1.poet	@ltx/gr_gr_cog/poets:po.Theofanous
ltx/gr_gr_cog/me.m02.d27:meMA.C1.title	@ltx/gr_gr_cog/titles:ti.CanonDevoutM
ltx/gr_gr_cog/me.m02.d27:meMA.C1.verse	@ltx/gr_gr_cog/prayers:pr.verse_DevoutMan.text
ltx/gr_gr_cog/me.m02.d27:meMA.ExapTheotokion.incipit	Τὸ μέγα καταφύγιον, καὶ σκέπη…
ltx/gr_gr_cog/me.m02.d27:meMA.ExapTheotokion.melody	@ltx/gr_gr_cog/he.a.m2:heAU.GynaikesAkoutisthite.name
ltx/gr_gr_cog/me.m02.d27:meMA.ExapTheotokion.mode	@ltx/gr_gr_cog/miscellanea:misc.Mode2
ltx/gr_gr_cog/me.m02.d27:meMA.ExapTheotokion.text	Τὸ μέγα καταφύγιον, καὶ σκέπη τῶν ψυχῶν ἡμῶν, ἡ οὐρανῶν πλατυτέρα, καὶ Χερουβὶμ ὑπερτέρα, τὸν σὸν Υἱὸν δυσώπησον, ὑπὲρ οἰκείων δούλων σου, Θεοκυῆτορ πάναγνε, ὅπως ῥυσθείημεν πάντες, ἁμαρτιῶν καὶ κινδύνων.
ltx/gr_gr_cog/me.m02.d27:meMA.Exaposteilarion1.greekmelody	@ltx/gr_gr_cog/he.a.m2:heAU.GynaikesAkoutisthite.greekname
ltx/gr_gr_cog/me.m02.d27:meMA.Exaposteilarion1.incipit	Σαρκίου τοῦ τιμίου σου, ἀπολυθεὶς…
ltx/gr_gr_cog/me.m02.d27:meMA.Exaposteilarion1.melody	@ltx/gr_gr_cog/he.a.m2:heAU.GynaikesAkoutisthite.name
ltx/gr_gr_cog/me.m02.d27:meMA.Exaposteilarion1.mode	@ltx/gr_gr_cog/miscellanea:misc.Mode2
ltx/gr_gr_cog/me.m02.d27:meMA.Exaposteilarion1.text	Σαρκίου τοῦ τιμίου σου, ἀπολυθεὶς Προκόπιε, παρέστης νῦν σὺν Ἀγγέλοις, τῇ ἀπροσίτῳ Τριάδι· πρὸς ἣν ἡμῶν μνημόνευε, τῶν ἐκτελούντων ἔνδοξε, τὴν παναγίαν μνήμην σου, καὶ σὲ τιμώντων ἐκ πόθου, Πάτερ σοφὲ Ἱεράρχα.
ltx/gr_gr_cog/me.m02.d27:meMA.Kontakion1.greekmelody	@ltx/gr_gr_cog/he.a.m4:heAU.EpefanisSimeron.greekname
ltx/gr_gr_cog/me.m02.d27:meMA.Kontakion1.incipit	Ἑωσφόρον σήμερον ἡ Ἐκκλησία, κεκτημένη…
ltx/gr_gr_cog/me.m02.d27:meMA.Kontakion1.melody	@ltx/gr_gr_cog/he.a.m4:heAU.EpefanisSimeron.name
ltx/gr_gr_cog/me.m02.d27:meMA.Kontakion1.mode	@ltx/gr_gr_cog/miscellanea:misc.Mode4
ltx/gr_gr_cog/me.m02.d27:meMA.Kontakion1.text	Ἑωσφόρον σήμερον ἡ Ἐκκλησία, κεκτημένη ἅπασαν, κακοδοξίας τὴν ἀχλύν, διασκεδάζει τιμῶσά σε, οὐρανομύστα Προκόπιε ἔνδοξε.
ltx/gr_gr_cog/me.m02.d27:meMA.Ode1C11.greekmelody	@ltx/gr_gr_cog/he.h.m6:heHE.OsEnIpeiroPezefsas.greekname
ltx/gr_gr_cog/me.m02.d27:meMA.Ode1C11.incipit	Τῆς εὐσεβείας τῷ φίλτρῳ…
ltx/gr_gr_cog/me.m02.d27:meMA.Ode1C11.melody	@ltx/gr_gr_cog/he.h.m6:heHE.OsEnIpeiroPezefsas.name
ltx/gr_gr_cog/me.m02.d27:meMA.Ode1C11.mode	@ltx/gr_gr_cog/miscellanea:misc.Mode6
ltx/gr_gr_cog/me.m02.d27:meMA.Ode1C11.ode	@ltx/gr_gr_cog/miscellanea:misc.Ode1
ltx/gr_gr_cog/me.m02.d27:meMA.Ode1C11.text	Τῆς εὐσεβείας τῷ φίλτρῳ κατασχεθείς, καὶ τῷ θείῳ ἔρωτι, τρικυμίας κοσμικάς, ἀπεκρούσω Ὅσιε Θεῷ, ἐπινίκιον ᾠδὴν ἀνακρουόμενος.
ltx/gr_gr_cog/me.m02.d27:meMA.Ode1C12.incipit	Ὁ φωτοφόρος σου βίος…
ltx/gr_gr_cog/me.m02.d27:meMA.Ode1C12.melody	@ltx/gr_gr_cog/he.h.m6:heHE.OsEnIpeiroPezefsas.name
ltx/gr_gr_cog/me.m02.d27:meMA.Ode1C12.mode	@ltx/gr_gr_cog/miscellanea:misc.Mode6
ltx/gr_gr_cog/me.m02.d27:meMA.Ode1C12.ode	@ltx/gr_gr_cog/miscellanea:misc.Ode1
ltx/gr_gr_cog/me.m02.d27:meMA.Ode1C12.text	Ὁ φωτοφόρος σου βίος καὶ τὸ φαιδρόν, τῆς ψυχῆς καὶ σύντονον, εὐσεβείᾳ συγκραθέν, ἀρετῆς εἰκόνισμα λαμπρόν, ἐν σοὶ Ὅσιε τρανῶς ἀπηκριβώσατο.
ltx/gr_gr_cog/me.m02.d27:meMA.Ode1C13.incipit	Ὑπερφυεῖ δᾳδουχίᾳ…
ltx/gr_gr_cog/me.m02.d27:meMA.Ode1C13.melody	@ltx/gr_gr_cog/he.h.m6:heHE.OsEnIpeiroPezefsas.name
ltx/gr_gr_cog/me.m02.d27:meMA.Ode1C13.mode	@ltx/gr_gr_cog/miscellanea:misc.Mode6
ltx/gr_gr_cog/me.m02.d27:meMA.Ode1C13.ode	@ltx/gr_gr_cog/miscellanea:misc.Ode1
ltx/gr_gr_cog/me.m02.d27:meMA.Ode1C13.text	Ὑπερφυεῖ δᾳδουχίᾳ καὶ φωταυγεῖ, τοῦ Χριστοῦ λαμπόμενος, τῶν παθῶν τὰς προσβολάς, ἐγκρατῶς ἐμάρανας βοῶν, ἐπινίκιον ᾠδὴν τῷ Παντοκράτορι.
ltx/gr_gr_cog/me.m02.d27:meMA.Ode1C1H.greekmelody	@ltx/gr_gr_cog/he.h.m6:heHE.OsEnIpeiroPezefsas.greekname
ltx/gr_gr_cog/me.m02.d27:meMA.Ode1C1H.incipit	@ltx/gr_gr_cog/he.h.m6:heHE.OsEnIpeiroPezefsas.incipit
ltx/gr_gr_cog/me.m02.d27:meMA.Ode1C1H.melody	@ltx/gr_gr_cog/he.h.m6:heHE.OsEnIpeiroPezefsas.melody
ltx/gr_gr_cog/me.m02.d27:meMA.Ode1C1H.mode	@ltx/gr_gr_cog/miscellanea:misc.Mode6
ltx/gr_gr_cog/me.m02.d27:meMA.Ode1C1H.ode	@ltx/gr_gr_cog/miscellanea:misc.Ode1
ltx/gr_gr_cog/me.m02.d27:meMA.Ode1C1H.text	@ltx/gr_gr_cog/he.h.m6:heHE.OsEnIpeiroPezefsas.text
ltx/gr_gr_cog/me.m02.d27:meMA.Ode1C1T.incipit	Σεσαρκωμένον τὸν Λόγον θεοπρεπῶς, συλλαβοῦσα…
ltx/gr_gr_cog/me.m02.d27:meMA.Ode1C1T.melody	@ltx/gr_gr_cog/he.h.m6:heHE.OsEnIpeiroPezefsas.name
ltx/gr_gr_cog/me.m02.d27:meMA.Ode1C1T.mode	@ltx/gr_gr_cog/miscellanea:misc.Mode6
ltx/gr_gr_cog/me.m02.d27:meMA.Ode1C1T.ode	@ltx/gr_gr_cog/miscellanea:misc.Ode1
ltx/gr_gr_cog/me.m02.d27:meMA.Ode1C1T.text	Σεσαρκωμένον τὸν Λόγον θεοπρεπῶς, συλλαβοῦσα Πάναγνε, τὸν πρὶν ἄσαρκον ἡμῖν, ὑπὲρ φύσιν τέτοκας Ἁγνή, μετὰ γέννησιν Παρθένος διαμείνασα.
ltx/gr_gr_cog/me.m02.d27:meMA.Ode3C11.greekmelody	@ltx/gr_gr_cog/he.h.m6:heHE.OukEstinAgios.greekname
ltx/gr_gr_cog/me.m02.d27:meMA.Ode3C11.incipit	Σοῦ ἡ θεόληπτος ψυχή, τῷ…
ltx/gr_gr_cog/me.m02.d27:meMA.Ode3C11.melody	@ltx/gr_gr_cog/he.h.m6:heHE.OukEstinAgios.name
ltx/gr_gr_cog/me.m02.d27:meMA.Ode3C11.mode	@ltx/gr_gr_cog/miscellanea:misc.Mode6
ltx/gr_gr_cog/me.m02.d27:meMA.Ode3C11.ode	@ltx/gr_gr_cog/miscellanea:misc.Ode3
ltx/gr_gr_cog/me.m02.d27:meMA.Ode3C11.text	Σοῦ ἡ θεόληπτος ψυχὴ τῷ τῆς πίστεως ζήλῳ, πυρπολουμένη μάκαρ, τῶν ἀνόμων τὴν πικράν, μανίαν καὶ τὸν θυμόν, Θεοφόρε κραταιῶς διέλυσεν.
ltx/gr_gr_cog/me.m02.d27:meMA.Ode3C12.incipit	Οἰκείοις αἵμασι βαφείς, τῶν Μαρτύρων…
ltx/gr_gr_cog/me.m02.d27:meMA.Ode3C12.melody	@ltx/gr_gr_cog/he.h.m6:heHE.OukEstinAgios.name
ltx/gr_gr_cog/me.m02.d27:meMA.Ode3C12.mode	@ltx/gr_gr_cog/miscellanea:misc.Mode6
ltx/gr_gr_cog/me.m02.d27:meMA.Ode3C12.ode	@ltx/gr_gr_cog/miscellanea:misc.Ode3
ltx/gr_gr_cog/me.m02.d27:meMA.Ode3C12.text	Οἰκείοις αἵμασι βαφεὶς τῶν Μαρτύρων τοὺς ἄθλους, ἐμιμήσω τρισμάκαρ, αἰκισμοὺς τῶν ἀσεβῶν, ἀνδρειοτάτῃ ψυχῇ, ὑπομείνας καρτερικῶς Προκόπιε.
ltx/gr_gr_cog/me.m02.d27:meMA.Ode3C13.incipit	Ὑπέστης Ὅσιε διπλοῦς, τοὺς ἀγῶνας…
ltx/gr_gr_cog/me.m02.d27:meMA.Ode3C13.melody	@ltx/gr_gr_cog/he.h.m6:heHE.OukEstinAgios.name
ltx/gr_gr_cog/me.m02.d27:meMA.Ode3C13.mode	@ltx/gr_gr_cog/miscellanea:misc.Mode6
ltx/gr_gr_cog/me.m02.d27:meMA.Ode3C13.ode	@ltx/gr_gr_cog/miscellanea:misc.Ode3
ltx/gr_gr_cog/me.m02.d27:meMA.Ode3C13.text	Ὑπέστης Ὅσιε διπλοῦς τοὺς ἀγῶνας ἐμφρόνως, τὰς αἱρέσεις ἐλέγχων, καὶ λεόντων τὰς ὁρμάς, ἀνδρείως ὑπενεγκών, θεοφρόνως πάνσοφε Προκόπιε.
ltx/gr_gr_cog/me.m02.d27:meMA.Ode3C1H.greekmelody	@ltx/gr_gr_cog/he.h.m6:heHE.OukEstinAgios.greekname
ltx/gr_gr_cog/me.m02.d27:meMA.Ode3C1H.incipit	@ltx/gr_gr_cog/he.h.m6:heHE.OukEstinAgios.incipit
ltx/gr_gr_cog/me.m02.d27:meMA.Ode3C1H.melody	@ltx/gr_gr_cog/he.h.m6:heHE.OukEstinAgios.melody
ltx/gr_gr_cog/me.m02.d27:meMA.Ode3C1H.mode	@ltx/gr_gr_cog/miscellanea:misc.Mode6
ltx/gr_gr_cog/me.m02.d27:meMA.Ode3C1H.ode	@ltx/gr_gr_cog/miscellanea:misc.Ode3
ltx/gr_gr_cog/me.m02.d27:meMA.Ode3C1H.text	@ltx/gr_gr_cog/he.h.m6:heHE.OukEstinAgios.text
ltx/gr_gr_cog/me.m02.d27:meMA.Ode3C1T.incipit	Σοφία Λόγος τοῦ Πατρός, ὁ…
ltx/gr_gr_cog/me.m02.d27:meMA.Ode3C1T.melody	@ltx/gr_gr_cog/he.h.m6:heHE.OukEstinAgios.name
ltx/gr_gr_cog/me.m02.d27:meMA.Ode3C1T.mode	@ltx/gr_gr_cog/miscellanea:misc.Mode6
ltx/gr_gr_cog/me.m02.d27:meMA.Ode3C1T.ode	@ltx/gr_gr_cog/miscellanea:misc.Ode3
ltx/gr_gr_cog/me.m02.d27:meMA.Ode3C1T.text	Σοφία Λόγος τοῦ Πατρὸς ὁ πρὸ πάντων αἰώνων, ἐπʼ ἐσχάτων τῶν χρόνων, ἀποῤῥήτως σαρκωθείς, ἐξ ἀπειράνδρου Μητρός, Θεοτόκον ταύτην ἀπειργάσατο.
ltx/gr_gr_cog/me.m02.d27:meMA.Ode3Kathisma1.greekmelody	@ltx/gr_gr_cog/he.a.m1:heAU.TouLithouSfragisthentos.greekname
ltx/gr_gr_cog/me.m02.d27:meMA.Ode3Kathisma1.incipit	Ἀσώματος ἐν βίῳ ἐγνωρίσθης Πατὴρ…
ltx/gr_gr_cog/me.m02.d27:meMA.Ode3Kathisma1.melody	@ltx/gr_gr_cog/he.a.m1:heAU.TouLithouSfragisthentos.name
ltx/gr_gr_cog/me.m02.d27:meMA.Ode3Kathisma1.mode	@ltx/gr_gr_cog/miscellanea:misc.Mode1
ltx/gr_gr_cog/me.m02.d27:meMA.Ode3Kathisma1.text	Ἀσώματος ἐν βίῳ, ἐγνωρίσθης Πατὴρ ἡμῶν, καὶ ἔνσαρκος Ἀγγέλοις, ἀνεδείχθης συνδίαιτος, τῷ κόσμῳ κατὰ Παῦλον σταυρωθείς, τῷ σοὶ ἐσταυρωμένῳ ἀληθῶς, καὶ εἰς οὐράνιον οἰκῶν, τῇ διανοίᾳ χῶρον ὁ γήϊνος. Δόξα τῷ εὐδοκήσαντι ἐν σοί· δόξα τῷ γνωρισθέντι σοι· δόξα τῷ ἐνεργοῦντι διὰ σοῦ πᾶσιν ἰάματα.
ltx/gr_gr_cog/me.m02.d27:meMA.Ode3KathismaSt.incipit	Σταυρῷ σου προσπαγέντος, ὑπὸ τῶν…
ltx/gr_gr_cog/me.m02.d27:meMA.Ode3KathismaSt.melody	@ltx/gr_gr_cog/he.a.m1:heAU.TouLithouSfragisthentos.name
ltx/gr_gr_cog/me.m02.d27:meMA.Ode3KathismaSt.mode	@ltx/gr_gr_cog/miscellanea:misc.Mode1
ltx/gr_gr_cog/me.m02.d27:meMA.Ode3KathismaSt.text	Σταυρῷ σου προσπαγέντος, ὑπὸ τῶν παρανόμων, καὶ στρατιωτῶν Σῶτερ λόγχῃ, τὴν πλευρὰν ὀρυγέντος, ἡ Πάναγνος ὠδύρετο πικρῶς, τὰ σπλάγχνα κοπτομένη μητρικῶς, καὶ τὸ πολύ σου καὶ φρικτόν, τῆς ἀνοχῆς ἐξίστατο βοῶσα· Δόξα τῇ πρὸς ἀνθρώπους σου στοργῇ· δόξα σου τῇ χρηστότητι· δόξα τῷ ἐν τῷ θανάτω σου βροτοὺς ἀθανατίζοντι.
ltx/gr_gr_cog/me.m02.d27:meMA.Ode3KathismaT.incipit	@ltx/gr_gr_cog/me.m02.d13:meMA.Ode3KathismaT.incipit
ltx/gr_gr_cog/me.m02.d27:meMA.Ode3KathismaT.melody	@ltx/gr_gr_cog/he.a.m1:heAU.TouLithouSfragisthentos.name
ltx/gr_gr_cog/me.m02.d27:meMA.Ode3KathismaT.mode	@ltx/gr_gr_cog/miscellanea:misc.Mode1
ltx/gr_gr_cog/me.m02.d27:meMA.Ode3KathismaT.text	@ltx/gr_gr_cog/me.m02.d13:meMA.Ode3KathismaT.text
ltx/gr_gr_cog/me.m02.d27:meMA.Ode4C11.greekmelody	@ltx/gr_gr_cog/he.h.m6:heHE.ChristosMouDynamis.greekname
ltx/gr_gr_cog/me.m02.d27:meMA.Ode4C11.incipit	Ἀρδεύων Ὅσιε, δακρύων χεύμασι, τὴν…
ltx/gr_gr_cog/me.m02.d27:meMA.Ode4C11.melody	@ltx/gr_gr_cog/he.h.m6:heHE.ChristosMouDynamis.name
ltx/gr_gr_cog/me.m02.d27:meMA.Ode4C11.mode	@ltx/gr_gr_cog/miscellanea:misc.Mode6
ltx/gr_gr_cog/me.m02.d27:meMA.Ode4C11.ode	@ltx/gr_gr_cog/miscellanea:misc.Ode4
ltx/gr_gr_cog/me.m02.d27:meMA.Ode4C11.text	Ἀρδεύων Ὅσιε δακρύων χεύμασι, τὴν καρδίαν σου μάκαρ τῶν ἀρετῶν, σπόρον ἐγεώργησας, ἐκ διανοίας καθαρᾶς, ὁσιώτατε Προκόπιε.
ltx/gr_gr_cog/me.m02.d27:meMA.Ode4C12.incipit	Γεῶδες φρόνημα, τῷ θείῳ Πνεύματι…
ltx/gr_gr_cog/me.m02.d27:meMA.Ode4C12.melody	@ltx/gr_gr_cog/he.h.m6:heHE.ChristosMouDynamis.name
ltx/gr_gr_cog/me.m02.d27:meMA.Ode4C12.mode	@ltx/gr_gr_cog/miscellanea:misc.Mode6
ltx/gr_gr_cog/me.m02.d27:meMA.Ode4C12.ode	@ltx/gr_gr_cog/miscellanea:misc.Ode4
ltx/gr_gr_cog/me.m02.d27:meMA.Ode4C12.text	Γεῶδες φρόνημα τῷ θείῳ Πνεύματι, καθυπέταξας Πάτερ ἀσκητικόν, βίον ἀνελόμενος καὶ συνταττόμενος χοροῖς, τῶν Μαρτύρων παμμακάριστε.
ltx/gr_gr_cog/me.m02.d27:meMA.Ode4C13.incipit	Ὡς μάρτυς ἔνθεος, καὶ ἀληθέστατος…
ltx/gr_gr_cog/me.m02.d27:meMA.Ode4C13.melody	@ltx/gr_gr_cog/he.h.m6:heHE.ChristosMouDynamis.name
ltx/gr_gr_cog/me.m02.d27:meMA.Ode4C13.mode	@ltx/gr_gr_cog/miscellanea:misc.Mode6
ltx/gr_gr_cog/me.m02.d27:meMA.Ode4C13.ode	@ltx/gr_gr_cog/miscellanea:misc.Ode4
ltx/gr_gr_cog/me.m02.d27:meMA.Ode4C13.text	Ὡς μάρτυς ἔνθεος καὶ ἀληθέστατος, ὑπὲρ τῆς εὐσεβείας αἱρετικήν, ἤλεγξας ἀπόνοιαν· τῆς γὰρ μανίας ἀληθῶς, τῶν ἀθέων κατεφρόνησας.
ltx/gr_gr_cog/me.m02.d27:meMA.Ode4C1H.greekmelody	@ltx/gr_gr_cog/he.h.m6:heHE.ChristosMouDynamis.greekname
ltx/gr_gr_cog/me.m02.d27:meMA.Ode4C1H.incipit	@ltx/gr_gr_cog/he.h.m6:heHE.ChristosMouDynamis.incipit
ltx/gr_gr_cog/me.m02.d27:meMA.Ode4C1H.melody	@ltx/gr_gr_cog/he.h.m6:heHE.ChristosMouDynamis.melody
ltx/gr_gr_cog/me.m02.d27:meMA.Ode4C1H.mode	@ltx/gr_gr_cog/miscellanea:misc.Mode6
ltx/gr_gr_cog/me.m02.d27:meMA.Ode4C1H.ode	@ltx/gr_gr_cog/miscellanea:misc.Ode4
ltx/gr_gr_cog/me.m02.d27:meMA.Ode4C1H.text	@ltx/gr_gr_cog/he.h.m6:heHE.ChristosMouDynamis.text
ltx/gr_gr_cog/me.m02.d27:meMA.Ode4C1T.incipit	Νομίμων ἄνευθεν…
ltx/gr_gr_cog/me.m02.d27:meMA.Ode4C1T.melody	@ltx/gr_gr_cog/he.h.m6:heHE.ChristosMouDynamis.name
ltx/gr_gr_cog/me.m02.d27:meMA.Ode4C1T.mode	@ltx/gr_gr_cog/miscellanea:misc.Mode6
ltx/gr_gr_cog/me.m02.d27:meMA.Ode4C1T.ode	@ltx/gr_gr_cog/miscellanea:misc.Ode4
ltx/gr_gr_cog/me.m02.d27:meMA.Ode4C1T.text	Νομίμων ἄνευθεν θεσμῶν Πανάμωμε, συλλαβοῦσα τὸν Κτίστην δίχα φθορᾶς, τοῦτον ἀπεγέννησας καὶ Θεοτόκος ἀληθῶς, καὶ κυρίως ἐχρημάτισας.
ltx/gr_gr_cog/me.m02.d27:meMA.Ode5C11.greekmelody	@ltx/gr_gr_cog/he.h.m6:heHE.ToTheioFengeiSou.greekname
ltx/gr_gr_cog/me.m02.d27:meMA.Ode5C11.incipit	Ἁγιασθέντα ἀσκητικῶς, καὶ τελειωθέντα σε…
ltx/gr_gr_cog/me.m02.d27:meMA.Ode5C11.melody	@ltx/gr_gr_cog/he.h.m6:heHE.ToTheioFengeiSou.name
ltx/gr_gr_cog/me.m02.d27:meMA.Ode5C11.mode	@ltx/gr_gr_cog/miscellanea:misc.Mode6
ltx/gr_gr_cog/me.m02.d27:meMA.Ode5C11.ode	@ltx/gr_gr_cog/miscellanea:misc.Ode5
ltx/gr_gr_cog/me.m02.d27:meMA.Ode5C11.text	Ἁγιασθέντα ἀσκητικῶς, καὶ τελειωθέντα σε διʼ αἵματος, γεραίρομεν Ὅσιε· μνήμη γὰρ δικαίων μετʼ ἐγκωμίων ἀεί, πιστῶς ἐπιτελεῖται, καὶ μνημονεύεται.
ltx/gr_gr_cog/me.m02.d27:meMA.Ode5C12.incipit	Σοφῶς ὁ πάντα μεταποιῶν, καὶ…
ltx/gr_gr_cog/me.m02.d27:meMA.Ode5C12.melody	@ltx/gr_gr_cog/he.h.m6:heHE.ToTheioFengeiSou.name
ltx/gr_gr_cog/me.m02.d27:meMA.Ode5C12.mode	@ltx/gr_gr_cog/miscellanea:misc.Mode6
ltx/gr_gr_cog/me.m02.d27:meMA.Ode5C12.ode	@ltx/gr_gr_cog/miscellanea:misc.Ode5
ltx/gr_gr_cog/me.m02.d27:meMA.Ode5C12.text	Σοφῶς ὁ πάντα μεταποιῶν, καὶ μετασκευάζων πρὸς τὸ κρεῖττον, ὡς βούλεται Κύριος, τῇ τῶν δυσσεβούντων μιαιφονίᾳ τῇ σῇ, ἀσκήσει μαρτυρίου κλέος προσέθετο.
ltx/gr_gr_cog/me.m02.d27:meMA.Ode5C13.incipit	Ἐπὶ τῶν ὤμων ἀναλαβών, τὴν…
ltx/gr_gr_cog/me.m02.d27:meMA.Ode5C13.melody	@ltx/gr_gr_cog/he.h.m6:heHE.ToTheioFengeiSou.name
ltx/gr_gr_cog/me.m02.d27:meMA.Ode5C13.mode	@ltx/gr_gr_cog/miscellanea:misc.Mode6
ltx/gr_gr_cog/me.m02.d27:meMA.Ode5C13.ode	@ltx/gr_gr_cog/miscellanea:misc.Ode5
ltx/gr_gr_cog/me.m02.d27:meMA.Ode5C13.text	Ἐπὶ τῶν ὤμων ἀναλαβών, τὴν διὰ Σταυροῦ πανοπλίαν, σὺ τῷ Χριστῷ ἠκολούθησας, τῶν ὀπίσω Πάτερ λήθην ποιούμενος, καὶ τοῖς ἔμπροσθεν δρόμοις ἐπεκτεινόμενος.
ltx/gr_gr_cog/me.m02.d27:meMA.Ode5C1H.greekmelody	@ltx/gr_gr_cog/he.h.m6:heHE.ToTheioFengeiSou.greekname
ltx/gr_gr_cog/me.m02.d27:meMA.Ode5C1H.incipit	@ltx/gr_gr_cog/he.h.m6:heHE.ToTheioFengeiSou.incipit
ltx/gr_gr_cog/me.m02.d27:meMA.Ode5C1H.melody	@ltx/gr_gr_cog/he.h.m6:heHE.ToTheioFengeiSou.melody
ltx/gr_gr_cog/me.m02.d27:meMA.Ode5C1H.mode	@ltx/gr_gr_cog/miscellanea:misc.Mode6
ltx/gr_gr_cog/me.m02.d27:meMA.Ode5C1H.ode	@ltx/gr_gr_cog/miscellanea:misc.Ode5
ltx/gr_gr_cog/me.m02.d27:meMA.Ode5C1H.text	@ltx/gr_gr_cog/he.h.m6:heHE.ToTheioFengeiSou.text
ltx/gr_gr_cog/me.m02.d27:meMA.Ode5C1T.incipit	Ὑμνοῦμεν Πάναγνε τὸν ἐκ σοῦ…
ltx/gr_gr_cog/me.m02.d27:meMA.Ode5C1T.melody	@ltx/gr_gr_cog/he.h.m6:heHE.ToTheioFengeiSou.name
ltx/gr_gr_cog/me.m02.d27:meMA.Ode5C1T.mode	@ltx/gr_gr_cog/miscellanea:misc.Mode6
ltx/gr_gr_cog/me.m02.d27:meMA.Ode5C1T.ode	@ltx/gr_gr_cog/miscellanea:misc.Ode5
ltx/gr_gr_cog/me.m02.d27:meMA.Ode5C1T.text	Ὑμνοῦμεν Πάναγνε τὸν ἐκ σοῦ, σάρκα παθητήν τε καὶ θνητήν, περιβαλλόμενον Κύριον, καὶ τεθεωμένην ἀπεργασάμενον, ἑνώσει ἀσυγχύτῳ τῇ καθʼ ὑπόστασιν.
ltx/gr_gr_cog/me.m02.d27:meMA.Ode6C11.greekmelody	@ltx/gr_gr_cog/he.h.m6:heHE.TouViouTinThalassan.greekname
ltx/gr_gr_cog/me.m02.d27:meMA.Ode6C11.incipit	Προβαίνων ἀείμνηστε, ἀπὸ δόξης ἀληθῶς…
ltx/gr_gr_cog/me.m02.d27:meMA.Ode6C11.melody	@ltx/gr_gr_cog/he.h.m6:heHE.TouViouTinThalassan.name
ltx/gr_gr_cog/me.m02.d27:meMA.Ode6C11.mode	@ltx/gr_gr_cog/miscellanea:misc.Mode6
ltx/gr_gr_cog/me.m02.d27:meMA.Ode6C11.ode	@ltx/gr_gr_cog/miscellanea:misc.Ode6
ltx/gr_gr_cog/me.m02.d27:meMA.Ode6C11.text	Προβαίνων ἀείμνηστε, ἀπὸ δόξης ἀληθῶς, ἀσκητικῆς ἀνέδραμες, πρὸς Μαρτύρων ἀνδρείαν τε καὶ τιμήν, οἰκείου ἐξ αἵματος, ἐρυθρὰν πορφυρίδα περικείμενος.
ltx/gr_gr_cog/me.m02.d27:meMA.Ode6C12.incipit	Ῥεόντων τὸ ἄστατον, λογισάμενος ψυχῇ…
ltx/gr_gr_cog/me.m02.d27:meMA.Ode6C12.melody	@ltx/gr_gr_cog/he.h.m6:heHE.TouViouTinThalassan.name
ltx/gr_gr_cog/me.m02.d27:meMA.Ode6C12.mode	@ltx/gr_gr_cog/miscellanea:misc.Mode6
ltx/gr_gr_cog/me.m02.d27:meMA.Ode6C12.ode	@ltx/gr_gr_cog/miscellanea:misc.Ode6
ltx/gr_gr_cog/me.m02.d27:meMA.Ode6C12.text	Ῥεόντων τὸ ἄστατον, λογισάμενος ψυχῇ, καὶ λογισμῷ θεόφρονι, τοῖς ἀεὶ διαμένουσιν ἀγαθοῖς, καὶ πέρας οὐκ ἔχουσιν, εὐσεβῶς ἑπτερώθης παμμακάριστε.
ltx/gr_gr_cog/me.m02.d27:meMA.Ode6C13.incipit	Ἐγκράτειαν σύντονον, καὶ πραότητα Χριστός…
ltx/gr_gr_cog/me.m02.d27:meMA.Ode6C13.melody	@ltx/gr_gr_cog/he.h.m6:heHE.TouViouTinThalassan.name
ltx/gr_gr_cog/me.m02.d27:meMA.Ode6C13.mode	@ltx/gr_gr_cog/miscellanea:misc.Mode6
ltx/gr_gr_cog/me.m02.d27:meMA.Ode6C13.ode	@ltx/gr_gr_cog/miscellanea:misc.Ode6
ltx/gr_gr_cog/me.m02.d27:meMA.Ode6C13.text	Ἐγκράτειαν σύντονον, καὶ πραότητα Χριστός, σὲ καθορῶν πλουτήσαντα, φιλανθρώπως ἐπέβλεψεν ἐπὶ σέ, καὶ δόξης ἀνέδειξε, κοινωνὸν Θεοφόρε παναοίδιμε.
ltx/gr_gr_cog/me.m02.d27:meMA.Ode6C1H.greekmelody	@ltx/gr_gr_cog/he.h.m6:heHE.TouViouTinThalassan.greekname
ltx/gr_gr_cog/me.m02.d27:meMA.Ode6C1H.incipit	@ltx/gr_gr_cog/he.h.m6:heHE.TouViouTinThalassan.incipit
ltx/gr_gr_cog/me.m02.d27:meMA.Ode6C1H.melody	@ltx/gr_gr_cog/he.h.m6:heHE.TouViouTinThalassan.melody
ltx/gr_gr_cog/me.m02.d27:meMA.Ode6C1H.mode	@ltx/gr_gr_cog/miscellanea:misc.Mode6
ltx/gr_gr_cog/me.m02.d27:meMA.Ode6C1H.ode	@ltx/gr_gr_cog/miscellanea:misc.Ode6
ltx/gr_gr_cog/me.m02.d27:meMA.Ode6C1H.text	@ltx/gr_gr_cog/he.h.m6:heHE.TouViouTinThalassan.text
ltx/gr_gr_cog/me.m02.d27:meMA.Ode6C1T.incipit	Πανάμωμε Δέσποινα, τῆς ψυχῆς μου…
ltx/gr_gr_cog/me.m02.d27:meMA.Ode6C1T.melody	@ltx/gr_gr_cog/he.h.m6:heHE.TouViouTinThalassan.name
ltx/gr_gr_cog/me.m02.d27:meMA.Ode6C1T.mode	@ltx/gr_gr_cog/miscellanea:misc.Mode6
ltx/gr_gr_cog/me.m02.d27:meMA.Ode6C1T.ode	@ltx/gr_gr_cog/miscellanea:misc.Ode6
ltx/gr_gr_cog/me.m02.d27:meMA.Ode6C1T.text	Πανάμωμε Δέσποινα, τῆς ψυχῆς μου τὰ δεινά, καὶ χαλεπὰ συντρίμματα, χειρουργίαις ἰάτρευσον μυστικαῖς, δραστήρια φάρμακα, τοῦ Υἱοῦ σου βαλοῦσα τὰ παθήματα.
ltx/gr_gr_cog/me.m02.d27:meMA.Ode7C11.greekmelody	@ltx/gr_gr_cog/he.h.m6:heHE.DrosovolonMenTinKaminon.greekname
ltx/gr_gr_cog/me.m02.d27:meMA.Ode7C11.incipit	Ὡς ὑπέρλαμπρος ὁ βίος σου…
ltx/gr_gr_cog/me.m02.d27:meMA.Ode7C11.melody	@ltx/gr_gr_cog/he.h.m6:heHE.DrosovolonMenTinKaminon.name
ltx/gr_gr_cog/me.m02.d27:meMA.Ode7C11.mode	@ltx/gr_gr_cog/miscellanea:misc.Mode6
ltx/gr_gr_cog/me.m02.d27:meMA.Ode7C11.ode	@ltx/gr_gr_cog/miscellanea:misc.Ode7
ltx/gr_gr_cog/me.m02.d27:meMA.Ode7C11.text	Ὡς ὑπέρλαμπρος ὁ βίος σου θεόσοφε, γέγονε διʼ ἀσκήσεως, οὕτως ὤφθη σου προφανῶς, ἡ ἄθλησις στεῤῥά. Χριστὸν γὰρ ἐδόξασας βοῶν· Εὐλογητὸς εἶ ὁ Θεός, ὁ τῶν Πατέρων ἡμῶν.
ltx/gr_gr_cog/me.m02.d27:meMA.Ode7C12.incipit	Σωφροσύνῃ καθαρότητα…
ltx/gr_gr_cog/me.m02.d27:meMA.Ode7C12.melody	@ltx/gr_gr_cog/he.h.m6:heHE.DrosovolonMenTinKaminon.name
ltx/gr_gr_cog/me.m02.d27:meMA.Ode7C12.mode	@ltx/gr_gr_cog/miscellanea:misc.Mode6
ltx/gr_gr_cog/me.m02.d27:meMA.Ode7C12.ode	@ltx/gr_gr_cog/miscellanea:misc.Ode7
ltx/gr_gr_cog/me.m02.d27:meMA.Ode7C12.text	Σωφροσύνῃ καθαρότητα θεσπέσιε, Πάτερ περιζωσάμενος, ἐν ἀνδρείᾳ δὲ μαρτυρίου, στέφανον λαμπρόν, δεξάμενος χάριτι βοᾷς· Εὐλογητὸς εἶ ὁ Θεός, ὁ τῶν Πατέρων ἡμῶν.
ltx/gr_gr_cog/me.m02.d27:meMA.Ode7C13.incipit	Μὴ τὴν ἄχραντον εἰκόνα προσκυνοῦντές…
ltx/gr_gr_cog/me.m02.d27:meMA.Ode7C13.melody	@ltx/gr_gr_cog/he.h.m6:heHE.DrosovolonMenTinKaminon.name
ltx/gr_gr_cog/me.m02.d27:meMA.Ode7C13.mode	@ltx/gr_gr_cog/miscellanea:misc.Mode6
ltx/gr_gr_cog/me.m02.d27:meMA.Ode7C13.ode	@ltx/gr_gr_cog/miscellanea:misc.Ode7
ltx/gr_gr_cog/me.m02.d27:meMA.Ode7C13.text	Μὴ τὴν ἄχραντον εἰκόνα προσκυνοῦντές σου, Σῶτερ οἱ ἀσεβέστατοι, τὸν οἰκέτην σου μαστιγοῦντες, ἔξεον δεινῶς, ὑμνοῦντα καὶ κράζοντα πρὸς σέ· Εὐλογητὸς εἶ ὁ Θεός, ὁ τῶν Πατέρων ἡμῶν.
ltx/gr_gr_cog/me.m02.d27:meMA.Ode7C1H.greekmelody	@ltx/gr_gr_cog/he.h.m6:heHE.DrosovolonMenTinKaminon.greekname
ltx/gr_gr_cog/me.m02.d27:meMA.Ode7C1H.incipit	@ltx/gr_gr_cog/he.h.m6:heHE.DrosovolonMenTinKaminon.incipit
ltx/gr_gr_cog/me.m02.d27:meMA.Ode7C1H.melody	@ltx/gr_gr_cog/he.h.m6:heHE.DrosovolonMenTinKaminon.melody
ltx/gr_gr_cog/me.m02.d27:meMA.Ode7C1H.mode	@ltx/gr_gr_cog/miscellanea:misc.Mode6
ltx/gr_gr_cog/me.m02.d27:meMA.Ode7C1H.ode	@ltx/gr_gr_cog/miscellanea:misc.Ode7
ltx/gr_gr_cog/me.m02.d27:meMA.Ode7C1H.text	@ltx/gr_gr_cog/he.h.m6:heHE.DrosovolonMenTinKaminon.text
ltx/gr_gr_cog/me.m02.d27:meMA.Ode7C1T.incipit	Εὐφραινόμενοι τῷ τόκῳ σου Πανάμωμε…
ltx/gr_gr_cog/me.m02.d27:meMA.Ode7C1T.melody	@ltx/gr_gr_cog/he.h.m6:heHE.DrosovolonMenTinKaminon.name
ltx/gr_gr_cog/me.m02.d27:meMA.Ode7C1T.mode	@ltx/gr_gr_cog/miscellanea:misc.Mode6
ltx/gr_gr_cog/me.m02.d27:meMA.Ode7C1T.ode	@ltx/gr_gr_cog/miscellanea:misc.Ode7
ltx/gr_gr_cog/me.m02.d27:meMA.Ode7C1T.text	Εὐφραινόμενοι τῷ τόκῳ σου Πανάμωμε, πάντες σε μακαρίζομεν· διʼ αὐτοῦ γὰρ νῦν σαρκικῆς, γεννήσεως ἡμεῖς, ῥυσθέντες κραυγάζομεν αὐτῷ· Εὐλογητὸς εἶ ὁ Θεός, ὁ τῶν Πατέρων ἡμῶν.
ltx/gr_gr_cog/me.m02.d27:meMA.Ode8C11.greekmelody	@ltx/gr_gr_cog/he.h.m6:heHE.EkFlogosToisOsiois.greekname
ltx/gr_gr_cog/me.m02.d27:meMA.Ode8C11.incipit	Λελυμένος τῆς ϋλης καὶ πρὸ…
ltx/gr_gr_cog/me.m02.d27:meMA.Ode8C11.melody	@ltx/gr_gr_cog/he.h.m6:heHE.EkFlogosToisOsiois.name
ltx/gr_gr_cog/me.m02.d27:meMA.Ode8C11.mode	@ltx/gr_gr_cog/miscellanea:misc.Mode6
ltx/gr_gr_cog/me.m02.d27:meMA.Ode8C11.ode	@ltx/gr_gr_cog/miscellanea:misc.Ode8
ltx/gr_gr_cog/me.m02.d27:meMA.Ode8C11.text	Λελυμένος τῆς ϋλης καὶ πρὸ θανάτου ὀφθείς, μετετέθης ἐντεῦθεν πρὸς τὴν ἀκήρατον, Ὅσιε ζωήν, τῷ θανάτῳ χρησάμενος, κλίμακι προσφόρῳ, Προκόπιε θεόφρον.
ltx/gr_gr_cog/me.m02.d27:meMA.Ode8C12.incipit	Πεπλησμένος ἐφάνης φωτὸς τῆς πίστεως…
ltx/gr_gr_cog/me.m02.d27:meMA.Ode8C12.melody	@ltx/gr_gr_cog/he.h.m6:heHE.EkFlogosToisOsiois.name
ltx/gr_gr_cog/me.m02.d27:meMA.Ode8C12.mode	@ltx/gr_gr_cog/miscellanea:misc.Mode6
ltx/gr_gr_cog/me.m02.d27:meMA.Ode8C12.ode	@ltx/gr_gr_cog/miscellanea:misc.Ode8
ltx/gr_gr_cog/me.m02.d27:meMA.Ode8C12.text	Πεπλησμένος ἐφάνης φωτὸς τῆς πίστεως, καὶ πρὸς ἄδυτον φέγγος Πάτερ ἐφοίτησας, πᾶσαν ὑλικήν, ἀποθέμενος ἔφεσιν· ὅθεν σε τιμῶμεν, Προκόπιε θεόφρον.
ltx/gr_gr_cog/me.m02.d27:meMA.Ode8C13.incipit	Ὡπλισμένος δυνάμει τοῦ θείου Πνεύματος…
ltx/gr_gr_cog/me.m02.d27:meMA.Ode8C13.melody	@ltx/gr_gr_cog/he.h.m6:heHE.EkFlogosToisOsiois.name
ltx/gr_gr_cog/me.m02.d27:meMA.Ode8C13.mode	@ltx/gr_gr_cog/miscellanea:misc.Mode6
ltx/gr_gr_cog/me.m02.d27:meMA.Ode8C13.ode	@ltx/gr_gr_cog/miscellanea:misc.Ode8
ltx/gr_gr_cog/me.m02.d27:meMA.Ode8C13.text	Ὡπλισμένος δυνάμει τοῦ θείου Πνεύματος, πονηρίας πνευμάτων ἐτρέψω φάλαγγας· ὅθεν οὐρανῶν, πύλαι σοι ἠνεῴχθησαν, μάκαρ ἀνυμνοῦντι, Χριστὸν εἰς τοὺς αἰῶνας.
ltx/gr_gr_cog/me.m02.d27:meMA.Ode8C1H.greekmelody	@ltx/gr_gr_cog/he.h.m6:heHE.EkFlogosToisOsiois.greekname
ltx/gr_gr_cog/me.m02.d27:meMA.Ode8C1H.incipit	@ltx/gr_gr_cog/he.h.m6:heHE.EkFlogosToisOsiois.incipit
ltx/gr_gr_cog/me.m02.d27:meMA.Ode8C1H.melody	@ltx/gr_gr_cog/he.h.m6:heHE.EkFlogosToisOsiois.melody
ltx/gr_gr_cog/me.m02.d27:meMA.Ode8C1H.mode	@ltx/gr_gr_cog/miscellanea:misc.Mode6
ltx/gr_gr_cog/me.m02.d27:meMA.Ode8C1H.ode	@ltx/gr_gr_cog/miscellanea:misc.Ode8
ltx/gr_gr_cog/me.m02.d27:meMA.Ode8C1H.text	@ltx/gr_gr_cog/he.h.m6:heHE.EkFlogosToisOsiois.text
ltx/gr_gr_cog/me.m02.d27:meMA.Ode8C1T.incipit	Μακαρίζουσι πᾶσαι γενεαὶ Δέσποινα, ὡς…
ltx/gr_gr_cog/me.m02.d27:meMA.Ode8C1T.melody	@ltx/gr_gr_cog/he.h.m6:heHE.EkFlogosToisOsiois.name
ltx/gr_gr_cog/me.m02.d27:meMA.Ode8C1T.mode	@ltx/gr_gr_cog/miscellanea:misc.Mode6
ltx/gr_gr_cog/me.m02.d27:meMA.Ode8C1T.ode	@ltx/gr_gr_cog/miscellanea:misc.Ode8
ltx/gr_gr_cog/me.m02.d27:meMA.Ode8C1T.text	Μακαρίζουσι πᾶσαι γενεαὶ Δέσποινα, ὡς προέφης ἡ μόνη θεομακάριστος, σὲ τὴν ἀληθῆ, Θεοτόκον καὶ πάναγνον· ἣν ὑπερυψοῦμεν, εἰς πάντας τοὺς αἰῶνας.
ltx/gr_gr_cog/me.m02.d27:meMA.Ode9C11.greekmelody	@ltx/gr_gr_cog/he.h.m6:heHE.TheonAnthropois.greekname
ltx/gr_gr_cog/me.m02.d27:meMA.Ode9C11.incipit	Ἀθλεῖν νομίμως Σοφὲ ἑλόμενος, τῶν…
ltx/gr_gr_cog/me.m02.d27:meMA.Ode9C11.melody	@ltx/gr_gr_cog/he.h.m6:heHE.TheonAnthropois.name
ltx/gr_gr_cog/me.m02.d27:meMA.Ode9C11.mode	@ltx/gr_gr_cog/miscellanea:misc.Mode6
ltx/gr_gr_cog/me.m02.d27:meMA.Ode9C11.ode	@ltx/gr_gr_cog/miscellanea:misc.Ode9
ltx/gr_gr_cog/me.m02.d27:meMA.Ode9C11.text	Ἀθλεῖν νομίμως σοφὲ ἑλόμενος, τῶν παθῶν ὁρμὰς διʼ ἐγκρατείας ἐνέκρωσας, καὶ σαρκὸς σκιρτήματα θεράπον Χριστοῦ· ὅθεν τῆς ἀπαθείας, νῦν τὴν ἀνώλεθρον, σύν ταῖς ἀσωμάτοις Στρατιαῖς εὗρες ἀπόλαυσιν.
ltx/gr_gr_cog/me.m02.d27:meMA.Ode9C12.incipit	Κριτῇ δικαίῳ φαιδρῶς παρίστασαι, ὡς…
ltx/gr_gr_cog/me.m02.d27:meMA.Ode9C12.melody	@ltx/gr_gr_cog/he.h.m6:heHE.TheonAnthropois.name
ltx/gr_gr_cog/me.m02.d27:meMA.Ode9C12.mode	@ltx/gr_gr_cog/miscellanea:misc.Mode6
ltx/gr_gr_cog/me.m02.d27:meMA.Ode9C12.ode	@ltx/gr_gr_cog/miscellanea:misc.Ode9
ltx/gr_gr_cog/me.m02.d27:meMA.Ode9C12.text	Κριτῇ δικαίῳ φαιδρῶς παρίστασαι, ὡς νικητὴς στεφάνους ἀμαράντους δεξάμενος, ἐκτενῶς Προκόπιε δεόμενος, ὑπὲρ τῶν ἐκτελούντων, σοῦ τὴν πανίερον, μνήμην καὶ τὴν θείαν ἑορτὴν τῆς μεταστάσεως.
ltx/gr_gr_cog/me.m02.d27:meMA.Ode9C13.incipit	Αὐγαῖς τρισὶ νῦν καταλαμπόμενος, ταῖς…
ltx/gr_gr_cog/me.m02.d27:meMA.Ode9C13.melody	@ltx/gr_gr_cog/he.h.m6:heHE.TheonAnthropois.name
ltx/gr_gr_cog/me.m02.d27:meMA.Ode9C13.mode	@ltx/gr_gr_cog/miscellanea:misc.Mode6
ltx/gr_gr_cog/me.m02.d27:meMA.Ode9C13.ode	@ltx/gr_gr_cog/miscellanea:misc.Ode9
ltx/gr_gr_cog/me.m02.d27:meMA.Ode9C13.text	Αὐγαῖς τρισὶ νῦν καταλαμπόμενος, ταῖς ἐκ μιᾶς ἀφράστως προϊούσαις Θεότητος, πανολβίου λήξεως ἠξίωσαι, καὶ τερπνῆς θυμηδίας, συναγαλλόμενος, ταῖς ὑπερκοσμίαις Στρατιαῖς, Πάτερ Προκόπιε.
ltx/gr_gr_cog/me.m02.d27:meMA.Ode9C1H.greekmelody	@ltx/gr_gr_cog/he.h.m6:heHE.TheonAnthropois.greekname
ltx/gr_gr_cog/me.m02.d27:meMA.Ode9C1H.incipit	@ltx/gr_gr_cog/he.h.m6:heHE.TheonAnthropois.incipit
ltx/gr_gr_cog/me.m02.d27:meMA.Ode9C1H.melody	@ltx/gr_gr_cog/he.h.m6:heHE.TheonAnthropois.melody
ltx/gr_gr_cog/me.m02.d27:meMA.Ode9C1H.mode	@ltx/gr_gr_cog/miscellanea:misc.Mode6
ltx/gr_gr_cog/me.m02.d27:meMA.Ode9C1H.ode	@ltx/gr_gr_cog/miscellanea:misc.Ode9
ltx/gr_gr_cog/me.m02.d27:meMA.Ode9C1H.text	@ltx/gr_gr_cog/he.h.m6:heHE.TheonAnthropois.text
ltx/gr_gr_cog/me.m02.d27:meMA.Ode9C1T.incipit	Ῥευστὴν ὁ Λόγος Θεοῦ ὁ…
ltx/gr_gr_cog/me.m02.d27:meMA.Ode9C1T.melody	@ltx/gr_gr_cog/he.h.m6:heHE.TheonAnthropois.name
ltx/gr_gr_cog/me.m02.d27:meMA.Ode9C1T.mode	@ltx/gr_gr_cog/miscellanea:misc.Mode6
ltx/gr_gr_cog/me.m02.d27:meMA.Ode9C1T.ode	@ltx/gr_gr_cog/miscellanea:misc.Ode9
ltx/gr_gr_cog/me.m02.d27:meMA.Ode9C1T.text	Ῥευστὴν ὁ Λόγος Θεοῦ ὁ ἄῤῥευστος, μορφὴν λαβὼν ἀνθρώπους ἀφθαρσίαν ἐνέδυσεν, εὐδοκίᾳ Πατρικῇ σκηνώσας ἐν σοί, τῇ κεχαριτωμένῃ· ὅθεν Πανάχραντε, σὺν ταῖς οὐρανίαις Στρατιαῖς σὲ μεγαλύνομεν.
ltx/gr_gr_cog/me.m02.d27:meVE.Apolytikion1ger.greekmelody	@ltx/gr_gr_cog/he.a.m1:heAU.TisErimouPolitis.greekname
ltx/gr_gr_cog/me.m02.d27:meVE.Apolytikion1ger.incipit	Φερωνύμως προκόπτων ἐν ἀσκήσει Προκόπιε…
ltx/gr_gr_cog/me.m02.d27:meVE.Apolytikion1ger.melody	@ltx/gr_gr_cog/he.a.m1:heAU.TisErimouPolitis.name
ltx/gr_gr_cog/me.m02.d27:meVE.Apolytikion1ger.mode	@ltx/gr_gr_cog/miscellanea:misc.Mode1
ltx/gr_gr_cog/me.m02.d27:meVE.Apolytikion1ger.poet	@ltx/gr_gr_cog/poets:po.Gerasimou
ltx/gr_gr_cog/me.m02.d27:meVE.Apolytikion1ger.text	Φερωνύμως προκόπτων ἐν ἀσκήσει Προκόπιε, ἤρθης ἐκ δυνάμεως Πάτερ, πρὸς ἀθλήσεως ἔλλαμψιν· Χριστοῦ γὰρ τὴν Εἰκόνα προσκυνῶν, Μαρτύρων ἀνεδείχθης κοινωνός· μεθʼ ὧν πρέσβευε παμμάκαρ διαπαντός, ὑπὲρ τῶν ἐκβοώντων σοι· δόξα τῷ δεδωκότι σοι ἰσχύν, δόξα τῷ σὲ στεφανώσαντι, δόξα τῷ ἐνεργοῦντι διὰ σοῦ, πᾶσιν ἰάματα.
ltx/gr_gr_cog/me.m02.d27:meVE.SticStavrotheotokion.greekmelody	@ltx/gr_gr_cog/he.a.m4:heAU.OsGennaionEnMartysi.greekname
ltx/gr_gr_cog/me.m02.d27:meVE.SticStavrotheotokion.incipit	Ἐν Σταυρῷ ὡς ἑώρακε, καθηλούμενον…
ltx/gr_gr_cog/me.m02.d27:meVE.SticStavrotheotokion.melody	@ltx/gr_gr_cog/he.a.m4:heAU.OsGennaionEnMartysi.name
ltx/gr_gr_cog/me.m02.d27:meVE.SticStavrotheotokion.mode	@ltx/gr_gr_cog/miscellanea:misc.Mode4
ltx/gr_gr_cog/me.m02.d27:meVE.SticStavrotheotokion.text	Ἐν Σταυρῷ ὡς ἑώρακε, καθηλούμενον Κύριε, ἡ ἀμνὰς καὶ Μήτηρ σου ἐξεπλήττετο, καί, Τί τὸ ὅραμα, ἔκραζεν· Υἱὲ ποθεινότατε; ταῦτά σοι ὁ ἀπειθής, δῆμος ἀνταποδίδωσιν, ὁ παράνομος, ὁ πολλῶν σου θαυμάτων ἀπολαύσας; Ἀλλὰ δόξα τῇ ἀῤῥήτῳ, συγκαταβάσει σου Δέσποτα.
ltx/gr_gr_cog/me.m02.d27:meVE.SticTheotokion.greekmelody	@ltx/gr_gr_cog/he.a.m4:heAU.OsGennaionEnMartysi.greekname
ltx/gr_gr_cog/me.m02.d27:meVE.SticTheotokion.incipit	@ltx/gr_gr_cog/oc.m4.d5:ocVE.SticTheotokion.incipit
ltx/gr_gr_cog/me.m02.d27:meVE.SticTheotokion.melody	@ltx/gr_gr_cog/he.a.m4:heAU.OsGennaionEnMartysi.name
ltx/gr_gr_cog/me.m02.d27:meVE.SticTheotokion.mode	@ltx/gr_gr_cog/miscellanea:misc.Mode4
ltx/gr_gr_cog/me.m02.d27:meVE.SticTheotokion.text	@ltx/gr_gr_cog/oc.m4.d5:ocVE.SticTheotokion.text
ltx/gr_gr_cog/me.m02.d27:meVE.Stichera01.greekmelody	@ltx/gr_gr_cog/he.a.m4:heAU.OsGennaionEnMartysi.greekname
ltx/gr_gr_cog/me.m02.d27:meVE.Stichera01.incipit	Κατʼ εἰκόνα γενόμενος, τοῦ Θεοῦ…
ltx/gr_gr_cog/me.m02.d27:meVE.Stichera01.melody	@ltx/gr_gr_cog/he.a.m4:heAU.OsGennaionEnMartysi.name
ltx/gr_gr_cog/me.m02.d27:meVE.Stichera01.mode	@ltx/gr_gr_cog/miscellanea:misc.Mode4
ltx/gr_gr_cog/me.m02.d27:meVE.Stichera01.text	Κατʼ εἰκόνα γενόμενος, τοῦ Θεοῦ καὶ ὁμοίωσιν, κατʼ ἀρχὴν τῆς πλάσεως Παμμακάριστε, τὸ τῆς εἰκόνος ἀξίωμα, τηρεῖν διεσπούδασας, λογισμῷ πανευσεβεῖ, καὶ νοός καθαρότητι, καὶ ἁγνότητι, καὶ παθῶν ἐγκρατείᾳ καὶ τηρήσει, τῶν Χριστοῦ διαταγμάτων, καὶ εὐσεβείᾳ Πανόλβιε.
ltx/gr_gr_cog/me.m02.d27:meVE.Stichera02.incipit	Τῇ ἀσκήσει τὸ πρότερον, προσλαβὼν…
ltx/gr_gr_cog/me.m02.d27:meVE.Stichera02.melody	@ltx/gr_gr_cog/he.a.m4:heAU.OsGennaionEnMartysi.name
ltx/gr_gr_cog/me.m02.d27:meVE.Stichera02.mode	@ltx/gr_gr_cog/miscellanea:misc.Mode4
ltx/gr_gr_cog/me.m02.d27:meVE.Stichera02.text	Τῇ ἀσκήσει τὸ πρότερον, προσλαβὼν καὶ τὴν ἄθλησιν, θεοφρόνως ὕστερον, εὐηρέστησας, διʼ ἀμφοτέρων τῷ Κτίσαντι, τῷ μόνῳ τὴν κάθαρσιν, ἀπαιτοῦντι παρʼ ἡμῶν, καὶ ψυχῆς τὴν εὐγένειαν· οὗ τὴν ἔνσαρκον, παρουσίαν δοξάζων προσεκύνεις, τὴν εἰκόνα τὴν ἁγίαν, τῆς κατʼ αὐτὸν ἀνθρωπότητος.
ltx/gr_gr_cog/me.m02.d27:meVE.Stichera03.incipit	Τοὺς τοῦ Λόγου τὴν σάρκωσιν…
ltx/gr_gr_cog/me.m02.d27:meVE.Stichera03.melody	@ltx/gr_gr_cog/he.a.m4:heAU.OsGennaionEnMartysi.name
ltx/gr_gr_cog/me.m02.d27:meVE.Stichera03.mode	@ltx/gr_gr_cog/miscellanea:misc.Mode4
ltx/gr_gr_cog/me.m02.d27:meVE.Stichera03.text	Τοὺς τοῦ Λόγου τὴν σάρκωσιν, δυσσεβῶς ἀθετήσαντας, διελέγχων ὅσιε, διετέλεσας, διὰ μαστίγων ἐτάσεως, πάσης τε κακώσεως, καὶ δεσμῶν καὶ φυλακῆς, βεβαιῶν τὴν ἀλήθειαν· ὅθεν γέγονας, τῆς Χριστοῦ βασιλείας κληρονόμος, καὶ χαρᾶς ἀνεκλαλήτου, καὶ ἀϊδίου ἐλλάμψεως.
