ltx/gr_gr_cog/le.ep.mc.d248:lemcLI.Epistle.book_abbr	@ltx/gr_gr_cog/bible:Philippians.abbr
ltx/gr_gr_cog/le.ep.mc.d248:lemcLI.Epistle.book_string	@ltx/gr_gr_cog/bible:Philippians.text
ltx/gr_gr_cog/le.ep.mc.d248:lemcLI.Epistle.chapverse	1:8 – 14
ltx/gr_gr_cog/le.ep.mc.d248:lemcLI.Epistle.incipit	Μάρτυς μού ἐστιν ὁ Θεός, ὡς ἐπιποθῶ πάντας ὑμᾶς…
ltx/gr_gr_cog/le.ep.mc.d248:lemcLI.Epistle.text	Ἀδελφοί, μάρτυς μού ἐστιν ὁ Θεός, ὡς ἐπιποθῶ πάντας ὑμᾶς ἐν σπλάγχνοις Ἰησοῦ Χριστοῦ. καὶ τοῦτο προσεύχομαι, ἵνα ἡ ἀγάπη ὑμῶν ἔτι μᾶλλον καὶ μᾶλλον περισσεύῃ ἐν ἐπιγνώσει καὶ πάσῃ αἰσθήσει, εἰς τὸ δοκιμάζειν ὑμᾶς τὰ διαφέροντα, ἵνα ἦτε εἰλικρινεῖς καὶ ἀπρόσκοποι εἰς ἡμέραν Χριστοῦ, πεπληρωμένοι καρπῶν δικαιοσύνης τῶν διὰ Ἰησοῦ Χριστοῦ εἰς δόξαν καὶ ἔπαινον Θεοῦ. Γινώσκειν δὲ ὑμᾶς βούλομαι, ἀδελφοί, ὅτι τὰ κατ᾽ ἐμὲ μᾶλλον εἰς προκοπὴν τοῦ εὐαγγελίου ἐλήλυθεν, ὥστε τοὺς δεσμούς μου φανεροὺς ἐν Χριστῷ γενέσθαι ἐν ὅλῳ τῷ πραιτωρίῳ καὶ τοῖς λοιποῖς πᾶσι, καὶ τοὺς πλείονας τῶν ἀδελφῶν ἐν Κυρίῳ πεποιθότας τοῖς δεσμοῖς μου περισσοτέρως τολμᾶν ἀφόβως τὸν λόγον λαλεῖν.
ltx/gr_gr_cog/le.ep.mc.d248:lemcLI.Epistle.title	Τῇ Τρίτῃ τῆς ΙΘʹ Ἑβδομάδος
ltx/gr_gr_cog/le.ep.mc.d248:lemcLI.Epistle.title_abbr	Τρίτῃ τῆς ΙΘʹ Ἑβδομάδος
ltx/gr_gr_cog/le.ep.mc.d248:lemcLI.Epistle.version	@ltx/gr_gr_cog/properties:version.designation
