ltx/gr_gr_cog/le.go.eo.w10:leeoMA.Gospel.book_abbr	@ltx/gr_gr_cog/bible:John.abbr
ltx/gr_gr_cog/le.go.eo.w10:leeoMA.Gospel.book_string	@ltx/gr_gr_cog/bible:John.text
ltx/gr_gr_cog/le.go.eo.w10:leeoMA.Gospel.chapverse	21:1 – 14
ltx/gr_gr_cog/le.go.eo.w10:leeoMA.Gospel.incipit	Ἐφανέρωσεν ἑαυτὸν ὁ Ἰησοῦς… ἐπὶ τῆς θαλάσσης τῆς Τιβεριάδος…
ltx/gr_gr_cog/le.go.eo.w10:leeoMA.Gospel.text	Τῷ καιρῷ ἐκείνῳ, ἐφανέρωσεν ἑαυτὸν ὁ Ἰησοῦς τοῖς μαθηταῖς αὐτοῦ, ἐγερθεὶς ἐκ νεκρῶν, ἐπὶ τῆς θαλάσσης τῆς Τιβεριάδος· ἐφανέρωσε δὲ οὕτως. ἦσαν ὁμοῦ Σίμων Πέτρος, καὶ Θωμᾶς ὁ λεγόμενος Δίδυμος, καὶ Ναθαναὴλ ὁ ἀπὸ Κανᾶ τῆς Γαλιλαίας, καὶ οἱ τοῦ Ζεβεδαίου, καὶ ἄλλοι ἐκ τῶν μαθητῶν αὐτοῦ δύο. λέγει αὐτοῖς Σίμων Πέτρος· ὑπάγω ἁλιεύειν. λέγουσιν αὐτῷ· ἐρχόμεθα καὶ ἡμεῖς σὺν σοί. ἐξῆλθον καὶ ἐνέβησαν εἰς τὸ πλοῖον εὐθύς, καὶ ἐν ἐκείνῃ τῇ νυκτὶ ἐπίασαν οὐδέν. πρωΐας δὲ ἤδη γενομένης ἔστη ὁ Ἰησοῦς εἰς τὸν αἰγιαλόν· οὐ μέντοι ᾔδεισαν οἱ μαθηταὶ ὅτι Ἰησοῦς ἐστι. λέγει οὖν αὐτοῖς ὁ Ἰησοῦς· παιδία, μή τι προσφάγιον ἔχετε; ἀπεκρίθησαν αὐτῷ· οὔ. ὁ δὲ εἶπεν αὐτοῖς· βάλετε εἰς τὰ δεξιὰ μέρη τοῦ πλοίου τὸ δίκτυον, καὶ εὑρήσετε. ἔβαλον οὖν, καὶ οὐκέτι αὐτὸ ἑλκύσαι ἴσχυσαν ἀπὸ τοῦ πλήθους τῶν ἰχθύων. λέγει οὖν ὁ μαθητὴς ἐκεῖνος, ὃν ἠγάπα ὁ Ἰησοῦς, τῷ Πέτρῳ· ὁ Κύριός ἐστι. Σίμων οὖν Πέτρος ἀκούσας ὅτι ὁ Κύριός ἐστι, τὸν ἐπενδύτην διεζώσατο· ἦν γὰρ γυμνός· καὶ ἔβαλεν ἑαυτὸν εἰς τὴν θάλασσαν· οἱ δὲ ἄλλοι μαθηταὶ τῷ πλοιαρίῳ ἦλθον· οὐ γὰρ ἦσαν μακρὰν ἀπὸ τῆς γῆς, ἀλλ᾽ ὡς ἀπὸ πηχῶν διακοσίων, σύροντες τὸ δίκτυον τῶν ἰχθύων. ὡς οὖν ἀπέβησαν εἰς τὴν γῆν, βλέπουσιν ἀνθρακιὰν κειμένην καὶ ὀψάριον ἐπικείμενον καὶ ἄρτον. λέγει αὐτοῖς ὁ Ἰησοῦς· ἐνέγκατε ἀπὸ τῶν ὀψαρίων ὧν ἐπιάσατε νῦν. ἀνέβη Σίμων Πέτρος καὶ εἵλκυσε τὸ δίκτυον ἐπὶ τῆς γῆς, μεστὸν ἰχθύων μεγάλων ἑκατὸν πεντήκοντα τριῶν· καὶ τοσούτων ὄντων οὐκ ἐσχίσθη τὸ δίκτυον. λέγει αὐτοῖς ὁ Ἰησοῦς· δεῦτε ἀριστήσατε. οὐδεὶς δὲ ἐτόλμα τῶν μαθητῶν ἐξετάσαι αὐτὸν σὺ τίς εἶ, εἰδότες ὅτι ὁ Κύριός ἐστιν. ἔρχεται οὖν ὁ Ἰησοῦς καὶ λαμβάνει τὸν ἄρτον καὶ δίδωσιν αὐτοῖς, καὶ τὸ ὀψάριον ὁμοίως. Τοῦτο ἤδη τρίτον ἐφανερώθη ὁ Ἰησοῦς τοῖς μαθηταῖς αὐτοῦ ἐγερθεὶς ἐκ νεκρῶν.
ltx/gr_gr_cog/le.go.eo.w10:leeoMA.Gospel.title	Ἑωθινὸν Ιʹ
ltx/gr_gr_cog/le.go.eo.w10:leeoMA.Gospel.title_abbr	Ἑωθινὸν Ιʹ
ltx/gr_gr_cog/le.go.eo.w10:leeoMA.Gospel.version	@ltx/gr_gr_cog/properties:version.designation
