ltx/gr_gr_cog/pe.d080:peDA.commemoration.full	
ltx/gr_gr_cog/pe.d080:peDA.commemoration.short	Τρίτη τῆς Βʹ Ἑβδομάδος
ltx/gr_gr_cog/pe.d080:peDA.dismissal	@ltx/gr_gr_cog/dismissals:dis00.resurrection
ltx/gr_gr_cog/pe.d080:peDA.insert1	
ltx/gr_gr_cog/pe.d080:peDA.insert2	
ltx/gr_gr_cog/pe.d080:peDA.note	
ltx/gr_gr_cog/pe.d080:peHO.commemorations	
ltx/gr_gr_cog/pe.d080:peHO.daytitle	
ltx/gr_gr_cog/pe.d080:peHO.description1	
ltx/gr_gr_cog/pe.d080:peHO.description2	
ltx/gr_gr_cog/pe.d080:peHO.note1	
ltx/gr_gr_cog/pe.d080:peHO.note2	
ltx/gr_gr_cog/pe.d080:peMA.AposGlory.incipit	@ltx/gr_gr_cog/pe.d078:peVE.SticGlory.incipit
ltx/gr_gr_cog/pe.d080:peMA.AposGlory.melody	@ltx/gr_gr_cog/miscellanea:misc.Idiomelon
ltx/gr_gr_cog/pe.d080:peMA.AposGlory.mode	@ltx/gr_gr_cog/miscellanea:misc.Mode6
ltx/gr_gr_cog/pe.d080:peMA.AposGlory.text	@ltx/gr_gr_cog/pe.d078:peVE.SticGlory.text
ltx/gr_gr_cog/pe.d080:peMA.Aposticha1.greekmelody	@ltx/gr_gr_cog/he.a.m2:heAU.OikosTouEfratha.greekname
ltx/gr_gr_cog/pe.d080:peMA.Aposticha1.incipit	Ὑμνήσωμεν πιστοί, ἀπαύστως σὺν Ἀγγέλοις…
ltx/gr_gr_cog/pe.d080:peMA.Aposticha1.melody	@ltx/gr_gr_cog/he.a.m2:heAU.OikosTouEfratha.name
ltx/gr_gr_cog/pe.d080:peMA.Aposticha1.mode	@ltx/gr_gr_cog/miscellanea:misc.Mode2
ltx/gr_gr_cog/pe.d080:peMA.Aposticha1.text	Ὑμνήσωμεν πιστοί, ἀπαύστως σὺν Ἀγγέλοις, Χριστὸν τὸν ἀναστάντα, τριήμερον ἐκ τάφου, καὶ κόσμον συνεγείραντα.
ltx/gr_gr_cog/pe.d080:peMA.Aposticha2.incipit	Θωμᾶς σου τὴν πλευράν, Εὔσπλαγχνε…
ltx/gr_gr_cog/pe.d080:peMA.Aposticha2.melody	@ltx/gr_gr_cog/he.a.m2:heAU.OikosTouEfratha.name
ltx/gr_gr_cog/pe.d080:peMA.Aposticha2.mode	@ltx/gr_gr_cog/miscellanea:misc.Mode2
ltx/gr_gr_cog/pe.d080:peMA.Aposticha2.text	Θωμᾶς σου τὴν πλευράν, Εὔσπλαγχνε ψηλαφήσας, πρὸς πίστιν ἐπανῆλθε· καὶ ἡμεῖς διʼ αὐτοῦ σε, Θεὸν λοιπὸν ἐπέγνωμεν.
ltx/gr_gr_cog/pe.d080:peMA.Aposticha3.incipit	Νέμεις ὦ Λυτρωτά, εἰρήνην τῷ…
ltx/gr_gr_cog/pe.d080:peMA.Aposticha3.melody	@ltx/gr_gr_cog/he.a.m2:heAU.OikosTouEfratha.name
ltx/gr_gr_cog/pe.d080:peMA.Aposticha3.mode	@ltx/gr_gr_cog/miscellanea:misc.Mode2
ltx/gr_gr_cog/pe.d080:peMA.Aposticha3.text	Νέμεις ὦ Λυτρωτά, εἰρήνην τῷ λαῷ σου, ἐξαναστὰς τοῦ τάφου, καὶ κόσμον συνεγείρας, ἐξ ᾍδου Παντοδύναμε.
ltx/gr_gr_cog/pe.d080:peMA.Kathisma11.greekmelody	@ltx/gr_gr_cog/oc.m1.d1:ocMA.Kathisma21.greekmelody
ltx/gr_gr_cog/pe.d080:peMA.Kathisma11.incipit	@ltx/gr_gr_cog/oc.m1.d1:ocMA.Kathisma21.incipit
ltx/gr_gr_cog/pe.d080:peMA.Kathisma11.melody	@ltx/gr_gr_cog/oc.m1.d1:ocMA.Kathisma21.melody
ltx/gr_gr_cog/pe.d080:peMA.Kathisma11.mode	@ltx/gr_gr_cog/miscellanea:misc.Mode1
ltx/gr_gr_cog/pe.d080:peMA.Kathisma11.text	@ltx/gr_gr_cog/oc.m1.d1:ocMA.Kathisma21.text
ltx/gr_gr_cog/pe.d080:peMA.Kathisma12.incipit	@ltx/gr_gr_cog/oc.m1.d3:ocMA.Kathisma12.incipit
ltx/gr_gr_cog/pe.d080:peMA.Kathisma12.melody	
ltx/gr_gr_cog/pe.d080:peMA.Kathisma12.mode	@ltx/gr_gr_cog/miscellanea:misc.Mode1
ltx/gr_gr_cog/pe.d080:peMA.Kathisma12.text	@ltx/gr_gr_cog/oc.m1.d3:ocMA.Kathisma12.text
ltx/gr_gr_cog/pe.d080:peMA.Kathisma13.greekmelody	@ltx/gr_gr_cog/oc.m1.d3:ocMA.Kathisma32.greekmelody
ltx/gr_gr_cog/pe.d080:peMA.Kathisma13.incipit	@ltx/gr_gr_cog/oc.m1.d3:ocMA.Kathisma32.incipit
ltx/gr_gr_cog/pe.d080:peMA.Kathisma13.melody	@ltx/gr_gr_cog/oc.m1.d3:ocMA.Kathisma32.melody
ltx/gr_gr_cog/pe.d080:peMA.Kathisma13.mode	@ltx/gr_gr_cog/miscellanea:misc.Mode1
ltx/gr_gr_cog/pe.d080:peMA.Kathisma13.text	@ltx/gr_gr_cog/oc.m1.d3:ocMA.Kathisma32.text
ltx/gr_gr_cog/pe.d080:peMA.Kathisma1T.incipit	@ltx/gr_gr_cog/oc.m1.d3:ocMA.Kathisma13.incipit
ltx/gr_gr_cog/pe.d080:peMA.Kathisma1T.melody	
ltx/gr_gr_cog/pe.d080:peMA.Kathisma1T.mode	@ltx/gr_gr_cog/miscellanea:misc.Mode1
ltx/gr_gr_cog/pe.d080:peMA.Kathisma1T.text	@ltx/gr_gr_cog/oc.m1.d3:ocMA.Kathisma13.text
ltx/gr_gr_cog/pe.d080:peMA.Kathisma21.greekmelody	@ltx/gr_gr_cog/he.a.m5:heAU.TonSynanarchonLogon.greekname
ltx/gr_gr_cog/pe.d080:peMA.Kathisma21.incipit	Τὸν Ἀπόστολον πάντες καὶ μαθητὴν…
ltx/gr_gr_cog/pe.d080:peMA.Kathisma21.melody	@ltx/gr_gr_cog/he.a.m5:heAU.TonSynanarchonLogon.name
ltx/gr_gr_cog/pe.d080:peMA.Kathisma21.mode	@ltx/gr_gr_cog/miscellanea:misc.Mode5
ltx/gr_gr_cog/pe.d080:peMA.Kathisma21.text	Τὸν Ἀπόστολον πάντες καὶ μαθητὴν τοῦ Χριστοῦ, εὐφημήσωμεν ὕμνοις ἐπὶ τῇ μνήμῃ αὐτοῦ· θεοπρεπῶς γὰρ τὰς ἡμῶν διανοίας αὐτός, τύπους τῶν ἥλων ψηλαφῶν, βεβαίαν πίστιν ἐκζητῶν, ἐστήριξεν ἐν τῷ κόσμῳ, καὶ δυσωπεῖ τὸν Σωτῆρα, ἐλεηθῆναι τὰς ψυχὰς ἡμῶν.
ltx/gr_gr_cog/pe.d080:peMA.Lauds1.incipit	@ltx/gr_gr_cog/oc.m1.d1:ocMA.Lauds2.incipit
ltx/gr_gr_cog/pe.d080:peMA.Lauds1.melody	
ltx/gr_gr_cog/pe.d080:peMA.Lauds1.mode	@ltx/gr_gr_cog/miscellanea:misc.Mode1
ltx/gr_gr_cog/pe.d080:peMA.Lauds1.text	@ltx/gr_gr_cog/oc.m1.d1:ocMA.Lauds2.text
ltx/gr_gr_cog/pe.d080:peMA.Lauds2.incipit	@ltx/gr_gr_cog/oc.m1.d3:ocMA.Aposticha2.incipit
ltx/gr_gr_cog/pe.d080:peMA.Lauds2.melody	
ltx/gr_gr_cog/pe.d080:peMA.Lauds2.mode	@ltx/gr_gr_cog/miscellanea:misc.Mode1
ltx/gr_gr_cog/pe.d080:peMA.Lauds2.text	@ltx/gr_gr_cog/oc.m1.d3:ocMA.Aposticha2.text
ltx/gr_gr_cog/pe.d080:peMA.Lauds3.incipit	@ltx/gr_gr_cog/oc.m1.d3:ocMA.Aposticha3.incipit
ltx/gr_gr_cog/pe.d080:peMA.Lauds3.melody	
ltx/gr_gr_cog/pe.d080:peMA.Lauds3.mode	@ltx/gr_gr_cog/miscellanea:misc.Mode1
ltx/gr_gr_cog/pe.d080:peMA.Lauds3.text	@ltx/gr_gr_cog/oc.m1.d3:ocMA.Aposticha3.text
ltx/gr_gr_cog/pe.d080:peMA.LaudsGlory.incipit	@ltx/gr_gr_cog/pe.d078:peVE.Stichera06.incipit
ltx/gr_gr_cog/pe.d080:peMA.LaudsGlory.melody	@ltx/gr_gr_cog/miscellanea:misc.Idiomelon
ltx/gr_gr_cog/pe.d080:peMA.LaudsGlory.mode	@ltx/gr_gr_cog/miscellanea:misc.Mode2
ltx/gr_gr_cog/pe.d080:peMA.LaudsGlory.text	@ltx/gr_gr_cog/pe.d078:peVE.Stichera06.text
ltx/gr_gr_cog/pe.d080:peVE.AposGlory.incipit	@ltx/gr_gr_cog/pe.d078:peVE.Stichera05.incipit
ltx/gr_gr_cog/pe.d080:peVE.AposGlory.melody	
ltx/gr_gr_cog/pe.d080:peVE.AposGlory.mode	@ltx/gr_gr_cog/miscellanea:misc.Mode2
ltx/gr_gr_cog/pe.d080:peVE.AposGlory.text	@ltx/gr_gr_cog/pe.d078:peVE.Stichera05.text
ltx/gr_gr_cog/pe.d080:peVE.Aposticha1.incipit	@ltx/gr_gr_cog/oc.m1.d1:ocVE.Stichera2.incipit
ltx/gr_gr_cog/pe.d080:peVE.Aposticha1.melody	
ltx/gr_gr_cog/pe.d080:peVE.Aposticha1.mode	@ltx/gr_gr_cog/miscellanea:misc.Mode1
ltx/gr_gr_cog/pe.d080:peVE.Aposticha1.text	@ltx/gr_gr_cog/oc.m1.d1:ocVE.Stichera2.text
ltx/gr_gr_cog/pe.d080:peVE.Aposticha2.incipit	@ltx/gr_gr_cog/oc.m1.d3:ocVE.Aposticha2.incipit
ltx/gr_gr_cog/pe.d080:peVE.Aposticha2.melody	
ltx/gr_gr_cog/pe.d080:peVE.Aposticha2.mode	@ltx/gr_gr_cog/miscellanea:misc.Mode1
ltx/gr_gr_cog/pe.d080:peVE.Aposticha2.text	@ltx/gr_gr_cog/oc.m1.d3:ocVE.Aposticha2.text
ltx/gr_gr_cog/pe.d080:peVE.Aposticha3.incipit	@ltx/gr_gr_cog/oc.m1.d3:ocVE.Aposticha3.incipit
ltx/gr_gr_cog/pe.d080:peVE.Aposticha3.melody	
ltx/gr_gr_cog/pe.d080:peVE.Aposticha3.mode	@ltx/gr_gr_cog/miscellanea:misc.Mode1
ltx/gr_gr_cog/pe.d080:peVE.Aposticha3.text	@ltx/gr_gr_cog/oc.m1.d3:ocVE.Aposticha3.text
ltx/gr_gr_cog/pe.d080:peVE.SticGlory.incipit	@ltx/gr_gr_cog/pe.d078:peVE.Stichera04.incipit
ltx/gr_gr_cog/pe.d080:peVE.SticGlory.melody	
ltx/gr_gr_cog/pe.d080:peVE.SticGlory.mode	@ltx/gr_gr_cog/miscellanea:misc.Mode1
ltx/gr_gr_cog/pe.d080:peVE.SticGlory.text	@ltx/gr_gr_cog/pe.d078:peVE.Stichera04.text
ltx/gr_gr_cog/pe.d080:peVE.Stichera01.greekmelody	@ltx/gr_gr_cog/he.a.m4:heAU.OsGennaionEnMartysi.greekname
ltx/gr_gr_cog/pe.d080:peVE.Stichera01.incipit	Ἀναστὰς ἐκ τοῦ μνήματος, κεκλεισμένων…
ltx/gr_gr_cog/pe.d080:peVE.Stichera01.melody	@ltx/gr_gr_cog/he.a.m4:heAU.OsGennaionEnMartysi.name
ltx/gr_gr_cog/pe.d080:peVE.Stichera01.mode	@ltx/gr_gr_cog/miscellanea:misc.Mode4
ltx/gr_gr_cog/pe.d080:peVE.Stichera01.text	Ἀναστὰς ἐκ τοῦ μνήματος, κεκλεισμένων ἐφίστασαι, τῶν θυρῶν τοῖς φίλοις σου, παντοδύναμε, καὶ τῷ Θωμᾷ ἀπιστήσαντι, τῶν ἥλων ὑπέδειξας, διατρήσεις καὶ πλευρᾶς, τὴν ἐκ λόγχης ἐκκέντησιν, βεβαιῶν αὐτόν, καὶ πιστούμενος Λόγε, ὡς αὐτὸς εἶ ὁ διʼ οἶκτον ὑπομείνας, σωτηριώδη παθήματα.
ltx/gr_gr_cog/pe.d080:peVE.Stichera02.incipit	Τὴν πολλὴν συγκατάβασιν, καὶ δι’…
ltx/gr_gr_cog/pe.d080:peVE.Stichera02.melody	@ltx/gr_gr_cog/he.a.m4:heAU.OsGennaionEnMartysi.name
ltx/gr_gr_cog/pe.d080:peVE.Stichera02.mode	@ltx/gr_gr_cog/miscellanea:misc.Mode4
ltx/gr_gr_cog/pe.d080:peVE.Stichera02.text	Τὴν πολλὴν συγκατάβασιν, καὶ διʼ οἶκτον ἀμέτρητον, καθορῶν μου κένωσιν, μὴ ἀμφίβαλε, ἀλλὰ πιστώθητι Δίδυμε, ὁ Κύριος ἔφησεν, ὡς αὐτὸς ἐγώ εἰμι, ὁ παθὼν καὶ τριήμερος, ἐκ τοῦ μνήματος, ἀναστάς, καὶ τοῦ ᾍδου τὰ ταμεῖα, ἐκκενώσας καὶ ζωώσας, τοὺς ἀπʼ αἰῶνος τεθνήξαντας.
ltx/gr_gr_cog/pe.d080:peVE.Stichera03.incipit	Ἐκπλαγεὶς ὡς ἑώρακεν, ὁ Θωμᾶς…
ltx/gr_gr_cog/pe.d080:peVE.Stichera03.melody	@ltx/gr_gr_cog/he.a.m4:heAU.OsGennaionEnMartysi.name
ltx/gr_gr_cog/pe.d080:peVE.Stichera03.mode	@ltx/gr_gr_cog/miscellanea:misc.Mode4
ltx/gr_gr_cog/pe.d080:peVE.Stichera03.text	Ἐκπλαγεὶς ὡς ἑώρακεν, ὁ Θωμᾶς ἀνεβόησεν, ὁπηνίκα εἶδέ σε, Παντοδύναμε· Σὺ εἶ Θεός μου καὶ Κύριος, πιστεύω φιλάνθρωπε, ὡς αὐτὸς εἶ ὁ παθών, καὶ τὰ πάθη ἰώμενος, τῶν ψυχῶν ἡμῶν· προσκυνῶ σου τὸ κράτος, καὶ τῷ κόσμῳ, διαγγέλλω τὴν φρικτήν σου, καὶ παντοδύναμον Ἔγερσιν.
