ltx/gr_gr_cog/le.ep.mc.d253:lemcLI.Epistle.book_abbr	@ltx/gr_gr_cog/bible:Corinthians2.abbr
ltx/gr_gr_cog/le.ep.mc.d253:lemcLI.Epistle.book_string	@ltx/gr_gr_cog/bible:Corinthians2.text
ltx/gr_gr_cog/le.ep.mc.d253:lemcLI.Epistle.chapverse	11:31 – 12:9
ltx/gr_gr_cog/le.ep.mc.d253:lemcLI.Epistle.incipit	Ὁ Θεὸς καὶ Πατὴρ τοῦ Κυρίου ἡμῶν Ἰησοῦ…
ltx/gr_gr_cog/le.ep.mc.d253:lemcLI.Epistle.text	Ἀδελφοί, ὁ Θεὸς καὶ πατὴρ τοῦ Κυρίου ἡμῶν Ἰησοῦ Χριστοῦ οἶδεν, ὁ ὢν εὐλογητὸς εἰς τοὺς αἰῶνας, ὅτι οὐ ψεύδομαι. ἐν Δαμασκῷ ὁ ἐθνάρχης Ἀρέτα τοῦ βασιλέως ἐφρούρει τὴν Δαμασκηνῶν πόλιν πιάσαι με θέλων, καὶ διὰ θυρίδος ἐν σαργάνῃ ἐχαλάσθην διὰ τοῦ τείχους καὶ ἐξέφυγον τὰς χεῖρας αὐτοῦ. Καυχᾶσθαι δὴ οὐ συμφέρει μοι· ἐλεύσομαι γὰρ εἰς ὀπτασίας καὶ ἀποκαλύψεις Κυρίου. οἶδα ἄνθρωπον ἐν Χριστῷ πρὸ ἐτῶν δεκατεσσάρων· εἴτε ἐν σώματι οὐκ οἶδα, εἴτε ἐκτὸς τοῦ σώματος οὐκ οἶδα, ὁ Θεὸς οἶδεν· ἁρπαγέντα τὸν τοιοῦτον ἕως τρίτου οὐρανοῦ. καὶ οἶδα τὸν τοιοῦτον ἄνθρωπον· εἴτε ἐν σώματι εἴτε ἐκτὸς τοῦ σώματος οὐκ οἶδα, ὁ Θεὸς οἶδεν· ὅτι ἡρπάγη εἰς τὸν παράδεισον καὶ ἤκουσεν ἄρρητα ῥήματα, ἃ οὐκ ἐξὸν ἀνθρώπῳ λαλῆσαι. ὑπὲρ τοῦ τοιούτου καυχήσομαι, ὑπὲρ δὲ ἐμαυτοῦ οὐ καυχήσομαι εἰ μὴ ἐν ταῖς ἀσθενείαις μου. ἐὰν γὰρ θελήσω καυχήσασθαι, οὐκ ἔσομαι ἄφρων· ἀλήθειαν γὰρ ἐρῶ· φείδομαι δὲ μή τις εἰς ἐμὲ λογίσηται ὑπὲρ ὃ βλέπει με ἢ ἀκούει τι ἐξ ἐμοῦ. Καὶ τῇ ὑπερβολῇ τῶν ἀποκαλύψεων ἵνα μὴ ὑπεραίρωμαι, ἐδόθη μοι σκόλοψ τῇ σαρκί, ἄγγελος σατᾶν, ἵνα με κολαφίζῃ ἵνα μὴ ὑπεραίρωμαι. ὑπὲρ τούτου τρὶς τὸν Κύριον παρεκάλεσα ἵνα ἀποστῇ ἀπ᾿ ἐμοῦ· καὶ εἴρηκέ μοι· ἀρκεῖ σοι ἡ χάρις μου· ἡ γὰρ δύναμίς μου ἐν ἀσθενείᾳ τελειοῦται. ἥδιστα οὖν μᾶλλον καυχήσομαι ἐν ταῖς ἀσθενείαις μου, ἵνα ἐπισκηνώσῃ ἐπ᾿ ἐμὲ ἡ δύναμις τοῦ Χριστοῦ.
ltx/gr_gr_cog/le.ep.mc.d253:lemcLI.Epistle.title	Κυριακῇ Δεκάτῃ Ἐνάτῃ
ltx/gr_gr_cog/le.ep.mc.d253:lemcLI.Epistle.title_abbr	Κυριακῇ ΙΘʹ
ltx/gr_gr_cog/le.ep.mc.d253:lemcLI.Epistle.version	@ltx/gr_gr_cog/properties:version.designation
