ltx/gr_gr_cog/le.go.mc.d117:lemcLI.Gospel.book_abbr	@ltx/gr_gr_cog/bible:John.abbr
ltx/gr_gr_cog/le.go.mc.d117:lemcLI.Gospel.book_string	@ltx/gr_gr_cog/bible:John.text
ltx/gr_gr_cog/le.go.mc.d117:lemcLI.Gospel.chapverse	16:23 – 33
ltx/gr_gr_cog/le.go.mc.d117:lemcLI.Gospel.incipit	Ἀμὴν ἀμὴν λέγω ὑμῖν ὅτι ὅσα ἂν αἰτήσητε…
ltx/gr_gr_cog/le.go.mc.d117:lemcLI.Gospel.text	Εἶπεν ὁ Κύριος τοῖς ἑαυτοῦ μαθηταῖς· ἀμὴν ἀμὴν λέγω ὑμῖν ὅτι ὅσα ἂν αἰτήσητε τὸν πατέρα ἐν τῷ ὀνόματί μου, δώσει ὑμῖν. ἕως ἄρτι οὐκ ᾐτήσατε οὐδὲν ἐν τῷ ὀνόματί μου· αἰτεῖτε καὶ λήψεσθε, ἵνα ἡ χαρὰ ὑμῶν ᾖ πεπληρωμένη. Ταῦτα ἐν παροιμίαις λελάληκα ὑμῖν· ἀλλ᾽ ἔρχεται ὥρα ὅτε οὐκέτι ἐν παροιμίαις λαλήσω ὑμῖν, ἀλλὰ παρρησίᾳ περὶ τοῦ πατρὸς ἀναγγελῶ ὑμῖν. ἐν ἐκείνῃ τῇ ἡμέρᾳ ἐν τῷ ὀνόματί μου αἰτήσεσθε· καὶ οὐ λέγω ὑμῖν ὅτι ἐγὼ ἐρωτήσω τὸν πατέρα περὶ ὑμῶν· αὐτὸς γὰρ ὁ πατὴρ φιλεῖ ὑμᾶς, ὅτι ὑμεῖς ἐμὲ πεφιλήκατε, καὶ πεπιστεύκατε ὅτι ἐγὼ παρὰ τοῦ Θεοῦ ἐξῆλθον. ἐξῆλθον παρὰ τοῦ πατρὸς καὶ ἐλήλυθα εἰς τὸν κόσμον· πάλιν ἀφίημι τὸν κόσμον καὶ πορεύομαι πρὸς τὸν πατέρα. Λέγουσιν αὐτῷ οἱ μαθηταὶ αὐτοῦ· ἴδε νῦν παρρησίᾳ λαλεῖς, καὶ παροιμίαν οὐδεμίαν λέγεις. νῦν οἴδαμεν ὅτι οἶδας πάντα καὶ οὐ χρείαν ἔχεις ἵνα τίς σε ἐρωτᾷ. ἐν τούτῳ πιστεύομεν ὅτι ἀπὸ Θεοῦ ἐξῆλθες. ἀπεκρίθη αὐτοῖς ὁ Ἰησοῦς· ἄρτι πιστεύετε· ἰδοὺ ἔρχεται ὥρα, καὶ νῦν ἐλήλυθεν, ἵνα σκορπισθῆτε ἕκαστος εἰς τὰ ἴδια καὶ ἐμὲ μόνον ἀφῆτε· καὶ οὐκ εἰμὶ μόνος, ὅτι ὁ πατὴρ μετ᾽ ἐμοῦ ἐστι. ταῦτα λελάληκα ὑμῖν ἵνα ἐν ἐμοὶ εἰρήνην ἔχητε.
ltx/gr_gr_cog/le.go.mc.d117:lemcLI.Gospel.title	Τῇ Πέμπτῃ τῆς Ζ ʹ Ἑβδομάδος
ltx/gr_gr_cog/le.go.mc.d117:lemcLI.Gospel.title_abbr	Πέμπτῃ τῆς Ζ ʹ Ἑβδομάδος
ltx/gr_gr_cog/le.go.mc.d117:lemcLI.Gospel.version	@ltx/gr_gr_cog/properties:version.designation
