ltx/gr_gr_cog/sy.m05.d08:cl.syMA.commemoration01.text	[saint/com 1]
ltx/gr_gr_cog/sy.m05.d08:cl.syMA.commemoration02.text	[saint/com 2]
ltx/gr_gr_cog/sy.m05.d08:cl.syMA.commemoration03.text	[saint/com 3]
ltx/gr_gr_cog/sy.m05.d08:cl.syMA.commemoration04.text	[saint/com 4]
ltx/gr_gr_cog/sy.m05.d08:cl.syMA.commemoration05.text	[saint/com 5]
ltx/gr_gr_cog/sy.m05.d08:cl.syMA.commemoration06.text	[saint/com list]
ltx/gr_gr_cog/sy.m05.d08:syMA.commemoration01.couplet1.title	@ltx/gr_gr_cog/titles:ti.Verses
ltx/gr_gr_cog/sy.m05.d08:syMA.commemoration01.couplet1.verse1	Οὐ βρῶσιν, ἀλλὰ ῥῶσιν ἀνθρώποις νέμει
ltx/gr_gr_cog/sy.m05.d08:syMA.commemoration01.couplet1.verse2	Τὸ τοῦ τάφου σου μάννα, μύστα Κυρίου.
ltx/gr_gr_cog/sy.m05.d08:syMA.commemoration01.narration.p01	Ὁ πανάγαθος Θεὸς καὶ φιλάνθρωπος Κύριος ἡμῶν, τοὺς ὑπὲρ αὐτοῦ προθύμως ἀγωνισαμένους Ἁγίους αὑτοῦ Μαθητὰς καὶ Ἀποστόλους, Προφήτας καὶ Μάρτυρας καὶ πάντας τοὺς εὐαρεστήσαντας αὐτῷ, οὐ μόνον βασιλείας οὐρανῶν καὶ τῶν αἰωνίων ἠξίωσεν ἀγαθῶν, ἀλλὰ καὶ τοὺς τόπους, ἐν οἷς διέπρεψαν καὶ ἐτάφησαν, πλήρεις χαρίτων ὑποδείξας, πολλοῖς ἐλάμπρυνε θαύμασι. Καὶ γὰρ ὁ τάφος, ἐν ᾧ ὁ μέγας Ἀπόστολος καὶ Εὐαγγελιστὴς Ἰωάννης ὁ Θεολόγος, μέλλων μετατεθῆναι, ἐτάφη, κόνιν ἁγίαν, ἣν οἱ ἐγχώριοι «Μάννα» μετονομάζουσιν, ἐπιπνεύσει Πνεύματος Ἁγίου, κατὰ τὴν ὀγδόην τοῦ Μαΐου μηνός, ἐτησίως ἐξαίφνης ἀναβρύει καὶ ἀναδίδωσιν· ἣν οἱ προσερχόμενοι λαμβάνοντες, χρῶνται εἰς παντοίων παθῶν ἀπολύτρωσιν, εἰς θεραπείαν ψυχῶν, εἰς ῥῶσιν σώματος, Θεὸν δοξολογοῦντες καὶ τὸν αὐτοῦ θεράποντα Ἰωάννην γεραίροντες.
ltx/gr_gr_cog/sy.m05.d08:syMA.commemoration01.narration.p02	Σωφρονίου
ltx/gr_gr_cog/sy.m05.d08:syMA.commemoration01.narration.p03	Ἰστέον, ὅτι πατὴρ τοῦ Θεολόγου ὁ Ζεβεδαῖος ἦν, ἡ δὲ μήτηρ Σαλώμη, θυγάτηρ Ἰωσήφ, τοῦ μνηστευσαμένου τὴν Θεοτόκον. Ὁ γὰρ Ἰωσὴφ υἱοὺς ἔσχε τέσσαρας, Ἰάκωβον, Συμεών, Ἰούδαν καὶ Ἰωσῆν· καὶ θυγατέρας τρεῖς, τήν τε Ἐσθήρ, τὴν Μάρθαν καὶ τὴν Σαλώμην, ἥτις ἦν γυνὴ Ζεβεδαίου, μήτηρ δὲ Ἰωάννου τοῦ Θεολόγου. Ἐντεῦθεν ὁ Σωτὴρ θεῖος ἦν Ἰωάννου, ὡς ἀδελφὸς Σαλώμης τῆς θυγατρὸς Ἰωσήφ.
ltx/gr_gr_cog/sy.m05.d08:syMA.commemoration01.narration.p04	Δεῖ δὲ εἰδέναι, ὅτι ἐπὶ τοῦ πάθους τοῦ Σωτῆρος, τῶν μαθητῶν αὐτοῦ πάντων φυγόντων, μόνος Ἰωάννης, ὡς ἀγαπητός, ἐν τῇ παραδόσει καὶ ἐν τῷ σταυρῷ παρῆν, καὶ εἰς τὸν τάφον μετὰ τοῦ Πέτρου ἦλθεν, ἔλαβε δὲ καὶ τὴν Θεοτόκον εἰς τὰ ἴδια. Μητέρας δὲ ἔσχε τρεῖς ἐπὶ τῆς γῆς· πρώτην τὴν Σαλώμην, ἐξ ἧς ἐγεννήθη· δευτέραν τὴν Βροντήν, ὅτι βροντῆς υἱὸς ἐχρημάτισε, τρίτην δὲ τὴν Παναγίαν Θεοτόκον, κατὰ τὸ ῥηθὲν αὐτῷ ὑπὸ τοῦ Κυρίου· «Ἰδοὺ ἡ Μήτηρ σου». Συνῆν δὲ τῇ Θεοτόκῳ ὁ Ἰωάννης μέχρι τῆς κοιμήσεως αὐτῆς· καὶ μετὰ ταῦτα ἦλθεν εἰς Ἔφεσον καὶ κατέβαλε διὰ προσευχῆς τὸν ναὸν τῆς Ἀρτέμιδος, καὶ τεσσαράκοντα μυριάδας ἀνδρῶν τε καὶ γυναικῶν, λατρευόντων τῇ Ἀρτέμιδι, τῆς πλάνης ἀπήλλαξε καὶ πρὸς τὸ φῶς μετήγαγε. Καλεῖται δὲ Ἡλίβατον τὸ ὄρος, ἐν ᾧ ἵσταται ὁ ναὸς τοῦ Ἁγίου Ἰωάννου τοῦ Θεολόγου. Ἐκ δὲ Δύσεως κεῖται ὁ Ἅγιος Τιμόθεος. Μαρία δὲ ἡ Μαγδαληνὴ καὶ οἱ ἑπτὰ Παῖδες ἐν τῷ πλησίον ὄρει, Χειλεὼν καλουμένῳ. Ἡ δὲ Ἁγία Ἑρμιόνη, θυγάτηρ οὖσα Φιλίππου, ἑνὸς τῶν ἑπτὰ Διακόνων, ἐκ τῶν τεσσάρων Προφητίδων θυγατέρων αὐτοῦ, κεῖται εἰς τὸ πλησίον ὄρος. Καὶ Αὔδακτος ὁ Μάρτυς, καὶ ἡ τούτου θυγάτηρ Καλλισθένη, καὶ ἕτεροι Μάρτυρες, Ἐπίσκοποι γεγονότες, Ἀρίστων, Τύραννος, καὶ Ἀριστόβουλος καὶ Παῦλος ὁ τῆς ἐρήμου πολίτης, ἐκεῖσε κατάκεινται. Τελεῖται δὲ ἡ αὐτοῦ σύναξις ἐν τῷ σεπτῷ Ἀποστολείῳ αὐτοῦ, τῷ ὄντι ἐν τῷ Ἑβδόμῳ.
ltx/gr_gr_cog/sy.m05.d08:syMA.commemoration01.single1	Ὀγδοάτῃ τελέουσι ῥοδισμὸν βροντογόνοιο.
ltx/gr_gr_cog/sy.m05.d08:syMA.commemoration01.text	Τῇ Ηʹ τοῦ αὐτοῦ μηνὸς μνήμη τοῦ Ἁγίου ἐνδόξου Ἀποστόλου καὶ Εὐαγγελιστοῦ, ἐπιστηθίου φίλου, ἠγαπημένου καὶ παρθένου, Ἰωάννου τοῦ Θεολόγου, ἤτοι ἡ σύναξις τῆς Ἁγίας κόνεως τῆς ἐκπεμπομένης ἐκ τοῦ τάφου αὐτοῦ, ἤγουν τοῦ μάννα.
ltx/gr_gr_cog/sy.m05.d08:syMA.commemoration02.couplet1.title	@ltx/gr_gr_cog/titles:ti.Verses
ltx/gr_gr_cog/sy.m05.d08:syMA.commemoration02.couplet1.verse1	Λαθεῖν βιώσας Ἀρσένιος ἠγάπα,
ltx/gr_gr_cog/sy.m05.d08:syMA.commemoration02.couplet1.verse2	Ὃς οὐδὲ πάντως ἐκβιώσας λανθάνει.
ltx/gr_gr_cog/sy.m05.d08:syMA.commemoration02.narration.p01	Ὃς ἦν τῆς μεγαλοπόλεως Ῥώμης γέννημα καὶ θρέμμα, ἐξ ἁπαλῶν τῶν ὀνύχων καθαρὸν τηρηθεὶς τῷ Θεῷ ἐνδιαίτημα καὶ πάσης ἀρετῆς καὶ σοφίας θείας τε καὶ ἀνθρωπίνης πλήρης ὑπάρχων· ὅθεν καὶ τὴν τοῦ διακόνου χειροτονίαν ἐδέξατο, τοῦ μεγάλου Θεοδοσίου τὴν τῶν Ῥωμαίων βασιλείαν τότε ἰθύνοντος. Πολλὴν δὲ ποιουμένου σπουδὴν καὶ ἐπιζητοῦντος ἄνδρα πνευματικὸν καὶ λόγιον, ἱκανοποιῆσαι καὶ διδάξαι τὰ τέκνα αὐτοῦ ἐν τοῖς μαθήμασι, καὶ μάλιστα οἷς θεραπεύεται Θεός, μαθὼν περὶ τούτου, γράφει τῷ βασιλεῖ Γρατιανῷ καὶ τῷ Πάπᾳ Ἰννοκεντίῳ, καὶ μόλις ἴσχυσε τοῦ ποθουμένου τυχεῖν.
ltx/gr_gr_cog/sy.m05.d08:syMA.commemoration02.narration.p02	Ἐπεὶ δὲ ἀπάρας τῆς Ῥωμαίων Ἀρσένιος, τὴν Κωνσταντίνου πόλιν κατέλαβεν, ἔστη κατὰ πρόσωπον Θεοδοσίου. Εἶδε δὲ αὐτὸν σεμνὸν μὲν ἔχοντα πρόσωπον καὶ τὸ χρῶμα, εὔτακτον δὲ τὸ βλέμμα, ταπεινὸν τὸ φρόνημα, πάσῃ ἀρετῇ κεκοσμημένον, πολλῆς χαρᾶς καὶ θυμηδίας ἐμπλησθείς, ἔκτοτε ὡς πατέρα ὑπερετίμα καὶ ὡς διδάσκαλον ἐσέβετο. Οἱ δὲ τῆς Συγκλήτου, ὡς μέγα τι κειμήλιον βλέποντες, ἐθαύμαζον.
ltx/gr_gr_cog/sy.m05.d08:syMA.commemoration02.narration.p03	Αὐτὸς δὲ μισόδοξος ὢν καὶ φιλόθεος καὶ τὴν δόξαν ὡς σκύβαλα ἡγούμενος καὶ ἐπιποθῶν τὸν μονήρη βίον, καθʼ ἑκάστην κατελιπάρει τὸ Θεῖον πληρῶσαι αὐτοῦ τὴν αἴτησιν· καὶ παραυτίκα φωνῆς ἐνωτίσθη θείας, «Ἀρσένιε», λεγούσης, «φεῦγε τοὺς ἀνθρώπους καὶ σῴζου».Ὁ δέ, μηδὲν μελήσας, ἀλλὰ τὴν ἐσθῆτα μεταλλάξας, τὴν Ἀλεξάνδρειαν καταλαμβάνει· καὶ τὴν κόμην κειράμενος, ἐν τῇ Σκήτῃ γέγονε, πάσῃ σκληραγωγίᾳ καὶ ταλαιπωρίᾳ ἑαυτὸν ὑποβάλλων καὶ τοῦ Θεοῦ δεόμενος. Καὶ πάλιν θεία φωνὴ πρὸς αὐτόν· «Ἀρσένιε, φεῦγε, σιώπα, ἡσύχαζε καὶ σῴζου».
ltx/gr_gr_cog/sy.m05.d08:syMA.commemoration02.narration.p04	Τοῦτον τὸν μέγαν ἠρώτησέ ποτε Θεόφιλος ὁ Πάπας Ἀλεξανδρείας, ἀνελθὼν σὺν ἑτέροις· «Εἰπὲ ἡμῖν, Πάτερ, λόγον ὠφελείας». Ὁ δὲ ἔφη· «Ἐὰν εἴπω, φυλάττεις;». Οἱ δὲ εἶπον· «Ἐκ παντός». Καὶ εἶπεν· «Ὅπου ἐὰν ἀκούσητε Ἀρσένιον, μὴ πλησιάσητε».
ltx/gr_gr_cog/sy.m05.d08:syMA.commemoration02.narration.p05	Περὶ τούτου λέγεται, ὅτι παρʼ ὅλον τὸν χρόνον τῆς ζωῆς αὐτοῦ ἐργαζόμενος, ῥάκος εἶχεν ἐν τῷ κόλπῳ αὐτοῦ, ἐν ᾧ ὑπεδέχετο τὰ δάκρυα. Ἦν δὲ ἀστεῖος τῷ σώματι, ὁλοπόλιος, ξηρὸς καὶ μακρός, εἰ καὶ μερικῶς ὑπὸ τοῦ γήρως κεκύρωτο, τὴν ὑπήνην ἔχων μέχρι τῆς κοιλίας, τὸ εἶδος ἀγγελικόν, ὡς Ἰακώβ· διὸ οὐδὲ φαίνεσθαί τινι ἤθελε κατὰ πρόσωπον· ἠγρύπνει τε πολλά, ὄρθιος ἱστάμενος καὶ εὐχόμενος καὶ μηδόλως κλίνων τὰ γόνατα, μέχρις ἂν ὁ ἥλιος τὴν ὁλόνυκτον αὐτοῦ ἔλυσε στάσιν· ὅθεν τὴν ψυχόλεθρον πύρωσιν τοῖς τῶν δακρύων χεύμασι κατέσβεσε. Μέλλοντος δὲ αὐτοῦ ἐκδημεῖν ἐκ τοῦ σώματος, πρὸς βαθὺ γῆρας ἐληλακότος (ἦν γὰρ ἐγγύς που τῶν ἑκατὸν ἐτῶν), ἠρώτησαν αὐτὸν οἱ μαθηταὶ αὐτοῦ, τὸ ποῦ, καὶ ὅπως δεῖ καταθέσθαι αὐτόν. Ὁ δέ· «Οὐκ οἴδατε βαλεῖν σχοινίον ἐν τοῖς ποσί μου καὶ ἆραι πρὸς τὸ ὄρος;». Καὶ αὖθις λέγει πρὸς αὐτούς· «Ἴδετε πόσος φόβος ἐστὶν ἐν ἐμοί, μέλλοντι ἐκδημεῖν ἀπὸ τοῦ σώματος;». Οἱ δέ· «Ἴδομεν». Ὁ δέ· «Ἀφʼ οὗ ἐγενόμην Μοναχός, οὗτος ὁ φόβος οὐδόλως ἀπέστη ἀπʼ ἐμοῦ». Καὶ αὐτίκα τὸ πνεῦμα αὐτοῦ τῷ Θεῷ ἐν εἰρήνῃ παρέδωκε.
ltx/gr_gr_cog/sy.m05.d08:syMA.commemoration02.text	Τῇ αὐτῇ ἡμέρᾳ μνήμη τοῦ Ὁσίου Πατρὸς ἡμῶν Ἀρσενίου τοῦ Μεγἀλου.
ltx/gr_gr_cog/sy.m05.d08:syMA.commemoration03.couplet1.title	@ltx/gr_gr_cog/titles:ti.Verses
ltx/gr_gr_cog/sy.m05.d08:syMA.commemoration03.couplet1.verse1	Ἐκστάντα Μήλην ὑμνοποιὸν ἐκ βίου,
ltx/gr_gr_cog/sy.m05.d08:syMA.commemoration03.couplet1.verse2	Ὑμνεῖν λόγοις δίκαιον, ὡς ἐμὸς λόγος.
ltx/gr_gr_cog/sy.m05.d08:syMA.commemoration03.text	Τῇ αὐτῇ ἡμέρᾳ ὁ Ὅσιος Μήλης, ὁ ὑμνῳδός, ἐν είρήνῃ τελειοῦται.
ltx/gr_gr_cog/sy.m05.d08:syMA.commemoration04.couplet1.title	@ltx/gr_gr_cog/titles:ti.Verses
ltx/gr_gr_cog/sy.m05.d08:syMA.commemoration04.couplet1.verse1	Χριστοφρονοῦσα σπεῖρα τέμνεται κάρας,
ltx/gr_gr_cog/sy.m05.d08:syMA.commemoration04.couplet1.verse2	Χριστοκτονοῦσαν σπεῖραν οὐ μιμουμένη.
ltx/gr_gr_cog/sy.m05.d08:syMA.commemoration04.text	Τῇ αὐτῇ ἡμέρᾳ σπεῖρα (τάγμα) στρατιωτῶν ξίφει τελειοῦται.
ltx/gr_gr_cog/sy.m05.d08:syMA.commemorationDD.couplet1.title	@ltx/gr_gr_cog/titles:ti.Verses
ltx/gr_gr_cog/sy.m05.d08:syMA.commemorationDD.couplet1.verse1	
ltx/gr_gr_cog/sy.m05.d08:syMA.commemorationDD.couplet1.verse2	
ltx/gr_gr_cog/sy.m05.d08:syMA.commemorationDD.single1	
ltx/gr_gr_cog/sy.m05.d08:syMA.commemorationDD.text	Τῇ αὐτῇ ἡμέρᾳ, μνήμην ἑορτάζομεν τοῦ Ἁγίου ἐνδόξου Ἀποστόλου καὶ Εὐαγγελιστοῦ, ἐπιστηθίου φίλου, ἠγαπημένου καὶ παρθένου, Ἰωάννου τοῦ Θεολόγου, ἤτοι τὴν σύναξιν τῆς Ἁγίας κόνεως τῆς ἐκπεμπομένης ἐκ τοῦ τάφου αὐτοῦ, ἤγουν τοῦ μάννα.
ltx/gr_gr_cog/sy.m05.d08:syMA.lastline	Ταῖς αὐτῶν ἁγίαις πρεσβείαις, Χριστὲ ὁ Θεός, ἐλέησον ἡμᾶς. Ἀμήν.
