ltx/gr_gr_cog/le.go.lu.d047:leluLI.Gospel.book_abbr	@ltx/gr_gr_cog/bible:Luke.abbr
ltx/gr_gr_cog/le.go.lu.d047:leluLI.Gospel.book_string	@ltx/gr_gr_cog/bible:Luke.text
ltx/gr_gr_cog/le.go.lu.d047:leluLI.Gospel.chapverse	12:2 – 12
ltx/gr_gr_cog/le.go.lu.d047:leluLI.Gospel.incipit	Οὐδὲν συγκεκαλυμμένον ἐστὶν ὃ οὐκ ἀποκαλυφθήσεται…
ltx/gr_gr_cog/le.go.lu.d047:leluLI.Gospel.text	Εἶπεν ὁ Κύριος τοῖς ἑαυτοῦ μαθηταῖς· οὐδὲν συγκεκαλυμμένον ἐστὶν ὃ οὐκ ἀποκαλυφθήσεται, καὶ κρυπτὸν ὃ οὐ γνωσθήσεται· ἀνθ᾿ ὧν ὅσα ἐν τῇ σκοτίᾳ εἴπατε, ἐν τῷ φωτὶ ἀκουσθήσεται, καὶ ὃ πρὸς τὸ οὖς ἐλαλήσατε ἐν τοῖς ταμείοις, κηρυχθήσεται ἐπὶ τῶν δωμάτων. Λέγω δὲ ὑμῖν τοῖς φίλοις μου· μὴ φοβηθῆτε ἀπὸ τῶν ἀποκτεννόντων τὸ σῶμα, καὶ μετὰ ταῦτα μὴ ἐχόντων περισσότερόν τι ποιῆσαι. ὑποδείξω δὲ ὑμῖν τίνα φοβηθῆτε· φοβήθητε τὸν μετὰ τὸ ἀποκτεῖναι ἔχοντα ἐξουσίαν ἐμβαλεῖν εἰς τὴν γέενναν· ναί, λέγω ὑμῖν, τοῦτον φοβήθητε. οὐχὶ πέντε στρουθία πωλεῖται ἀσσαρίων δύο; καὶ ἓν ἐξ αὐτῶν οὐκ ἔστιν ἐπιλελησμένον ἐνώπιον τοῦ Θεοῦ· ἀλλὰ καὶ αἱ τρίχες τῆς κεφαλῆς ὑμῶν πᾶσαι ἠρίθμηνται. μὴ οὖν φοβεῖσθε· πολλῶν στρουθίων διαφέρετε. Λέγω δὲ ὑμῖν· πᾶς ὃς ἂν ὁμολογήσῃ ἐν ἐμοὶ ἔμπροσθεν τῶν ἀνθρώπων, καὶ ὁ υἱὸς τοῦ ἀνθρώπου ὁμολογήσει ἐν αὐτῷ ἔμπροσθεν τῶν ἀγγέλων τοῦ Θεοῦ· ὁ δὲ ἀρνησάμενός με ἐνώπιον τῶν ἀνθρώπων ἀπαρνηθήσεται ἐνώπιον τῶν ἀγγέλων τοῦ Θεοῦ. καὶ πᾶς ὃς ἐρεῖ λόγον εἰς τὸν υἱὸν τοῦ ἀνθρώπου, ἀφεθήσεται αὐτῷ· τῷ δὲ εἰς τὸ Ἅγιον Πνεῦμα βλασφημήσαντι οὐκ ἀφεθήσεται. ὅταν δὲ προσφέρωσιν ὑμᾶς ἐπὶ τὰς συναγωγὰς καὶ τὰς ἀρχὰς καὶ τὰς ἐξουσίας, μὴ μεριμνᾶτε πῶς ἢ τί ἀπολογήσησθε, ἢ τί εἴπητε· τὸ γὰρ Ἅγιον Πνεῦμα διδάξει ὑμᾶς ἐν αὐτῇ τῇ ὥρᾳ ἃ δεῖ εἰπεῖν.
ltx/gr_gr_cog/le.go.lu.d047:leluLI.Gospel.title	Τῇ Παρασκευῇ τῆς Ζʹ Ἑβδομάδος τοῦ Λουκᾶ
ltx/gr_gr_cog/le.go.lu.d047:leluLI.Gospel.title_abbr	Τῇ Παρασκευῇ τῆς Ζʹ Ἑβδομάδος τοῦ Λουκᾶ
ltx/gr_gr_cog/le.go.lu.d047:leluLI.Gospel.version	@ltx/gr_gr_cog/properties:version.designation
