ltx/gr_gr_cog/le.ep.mc.d206:lemcLI.Epistle.book_abbr	@ltx/gr_gr_cog/bible:Corinthians2.abbr
ltx/gr_gr_cog/le.ep.mc.d206:lemcLI.Epistle.book_string	@ltx/gr_gr_cog/bible:Corinthians2.text
ltx/gr_gr_cog/le.ep.mc.d206:lemcLI.Epistle.chapverse	8:16 – 24; 9:1 – 5
ltx/gr_gr_cog/le.ep.mc.d206:lemcLI.Epistle.incipit	Χάρις τῷ Θεῷ, τῷ διδόντι τὴν αὐτὴν σπουδήν…
ltx/gr_gr_cog/le.ep.mc.d206:lemcLI.Epistle.text	Ἀδελφοί, χάρις τῷ Θεῷ τῷ διδόντι τὴν αὐτὴν σπουδὴν ὑπὲρ ὑμῶν ἐν τῇ καρδίᾳ Τίτου, ὅτι τὴν μὲν παράκλησιν ἐδέξατο, σπουδαιότερος δὲ ὑπάρχων αὐθαίρετος ἐξῆλθε πρὸς ὑμᾶς. συνεπέμψαμεν δὲ μετ᾿ αὐτοῦ τὸν ἀδελφὸν οὗ ὁ ἔπαινος ἐν τῷ εὐαγγελίῳ διὰ πασῶν τῶν ἐκκλησιῶν· — οὐ μόνον δέ, ἀλλὰ καὶ χειροτονηθεὶς ὑπὸ τῶν ἐκκλησιῶν συνέκδημος ἡμῶν σὺν τῇ χάριτι ταύτῃ τῇ διακονουμένῃ ὑφ᾿ ἡμῶν πρὸς τὴν αὐτοῦ τοῦ Κυρίου δόξαν καὶ προθυμίαν ἡμῶν· — στελλόμενοι τοῦτο, μή τις ἡμᾶς μωμήσηται ἐν τῇ ἁδρότητι ταύτῃ τῇ διακονουμένῃ ὑφ᾿ ἡμῶν, προνοούμενοι καλὰ οὐ μόνον ἐνώπιον Κυρίου, ἀλλὰ καὶ ἐνώπιον ἀνθρώπων. συνεπέμψαμεν δὲ αὐτοῖς τὸν ἀδελφὸν ἡμῶν, ὃν ἐδοκιμάσαμεν ἐν πολλοῖς πολλάκις σπουδαῖον ὄντα, νυνὶ δὲ πολὺ σπουδαιότερον πεποιθήσει πολλῇ τῇ εἰς ὑμᾶς. εἴτε ὑπὲρ Τίτου, κοινωνὸς ἐμὸς καὶ εἰς ὑμᾶς συνεργός· εἴτε ἀδελφοὶ ἡμῶν, ἀπόστολοι ἐκκλησιῶν, δόξα Χριστοῦ. Τὴν οὖν ἔνδειξιν τῆς ἀγάπης ὑμῶν καὶ ἡμῶν καυχήσεως ὑπὲρ ὑμῶν εἰς αὐτοὺς ἐνδείξασθε εἰς πρόσωπον τῶν ἐκκλησιῶν. Περὶ μὲν γὰρ τῆς διακονίας τῆς εἰς τοὺς ἁγίους περισσὸν μοί ἐστι τὸ γράφειν ὑμῖν· οἶδα γὰρ τὴν προθυμίαν ὑμῶν ἣν ὑπὲρ ἡμῶν καυχῶμαι Μακεδόσιν, ὅτι Ἀχαΐα παρεσκεύασται ἀπὸ πέρυσι· καὶ ὁ ἐξ ὑμῶν ζῆλος ἠρέθισε τοὺς πλείονας. ἔπεμψα δὲ τοὺς ἀδελφούς, ἵνα μὴ τὸ καύχημα ἡμῶν τὸ ὑπὲρ ὑμῶν κενωθῇ ἐν τῷ μέρει τούτῳ, ἵνα, καθὼς ἔλεγον, παρεσκευασμένοι ἦτε, μήπως ἐὰν ἔλθωσι σὺν ἐμοὶ Μακεδόνες καὶ εὕρωσιν ὑμᾶς ἀπαρασκευάστους, καταισχυνθῶμεν ἡμεῖς, ἵνα μὴ λέγωμεν ὑμεῖς, ἐν τῇ ὑποστάσει ταύτῃ τῆς καυχήσεως. ἀναγκαῖον οὖν ἡγησάμην παρακαλέσαι τοὺς ἀδελφοὺς ἵνα προέλθωσιν εἰς ὑμᾶς καὶ προκαταρτίσωσι τὴν προκατηγγελμένην εὐλογίαν ὑμῶν, ταύτην ἑτοίμην εἶναι, οὕτως ὡς εὐλογίαν καὶ μὴ ὡς πλεονεξίαν.
ltx/gr_gr_cog/le.ep.mc.d206:lemcLI.Epistle.title	Τῇ Τρίτῃ τῆς ΙΓʹ Ἑβδομάδος
ltx/gr_gr_cog/le.ep.mc.d206:lemcLI.Epistle.title_abbr	Τρίτῃ τῆς ΙΓʹ Ἑβδομάδος
ltx/gr_gr_cog/le.ep.mc.d206:lemcLI.Epistle.version	@ltx/gr_gr_cog/properties:version.designation
