ltx/gr_gr_cog/le.go.eo.w05:leeoMA.Gospel.book_abbr	@ltx/gr_gr_cog/le.go.mc.d073:lemcLI.Gospel.book_abbr
ltx/gr_gr_cog/le.go.eo.w05:leeoMA.Gospel.book_string	@ltx/gr_gr_cog/le.go.mc.d073:lemcLI.Gospel.book_string
ltx/gr_gr_cog/le.go.eo.w05:leeoMA.Gospel.chapverse	@ltx/gr_gr_cog/le.go.mc.d073:lemcLI.Gospel.chapverse
ltx/gr_gr_cog/le.go.eo.w05:leeoMA.Gospel.incipit	@ltx/gr_gr_cog/le.go.mc.d073:lemcLI.Gospel.incipit
ltx/gr_gr_cog/le.go.eo.w05:leeoMA.Gospel.text	@ltx/gr_gr_cog/le.go.mc.d073:lemcLI.Gospel.text
ltx/gr_gr_cog/le.go.eo.w05:leeoMA.Gospel.title	Ἑωθινὸν Εʹ
ltx/gr_gr_cog/le.go.eo.w05:leeoMA.Gospel.title_abbr	Ἑωθινὸν Εʹ
ltx/gr_gr_cog/le.go.eo.w05:leeoMA.Gospel.version	@ltx/gr_gr_cog/le.go.mc.d073:lemcLI.Gospel.version
