ltx/gr_gr_cog/le.go.mc.d140:lemcLI.Gospel.book_abbr	@ltx/gr_gr_cog/bible:Matthew.abbr
ltx/gr_gr_cog/le.go.mc.d140:lemcLI.Gospel.book_string	@ltx/gr_gr_cog/bible:Matthew.text
ltx/gr_gr_cog/le.go.mc.d140:lemcLI.Gospel.chapverse	7:24 – 29, 8:1 – 4
ltx/gr_gr_cog/le.go.mc.d140:lemcLI.Gospel.incipit	Πᾶς ὅστις ἀκούει μου τοὺς λόγους…
ltx/gr_gr_cog/le.go.mc.d140:lemcLI.Gospel.text	Εἶπεν ὁ Κύριος· Πᾶς ὅστις ἀκούει μου τοὺς λόγους τούτους καὶ ποιεῖ αὐτούς, ὁμοιώσω αὐτὸν ἀνδρὶ φρονίμῳ, ὅστις ᾠκοδόμησε τὴν οἰκίαν αὐτοῦ ἐπὶ τὴν πέτραν· καὶ κατέβη ἡ βροχὴ καὶ ἦλθον οἱ ποταμοὶ καὶ ἔπνευσαν οἱ ἄνεμοι καὶ προσέπεσον τῇ οἰκίᾳ ἐκείνῃ, καὶ οὐκ ἔπεσε· τεθεμελίωτο γὰρ ἐπὶ τὴν πέτραν. καὶ πᾶς ὁ ἀκούων μου τοὺς λόγους τούτους καὶ μὴ ποιῶν αὐτοὺς ὁμοιωθήσεται ἀνδρὶ μωρῷ, ὅστις ᾠκοδόμησε τὴν οἰκίαν αὐτοῦ ἐπὶ τὴν ἄμμον· καὶ κατέβη ἡ βροχὴ καὶ ἦλθον οἱ ποταμοὶ καὶ ἔπνευσαν οἱ ἄνεμοι καὶ προσέκοψαν τῇ οἰκίᾳ ἐκείνῃ, καὶ ἔπεσε, καὶ ἦν ἡ πτῶσις αὐτῆς μεγάλη. Καὶ ἐγένετο ὅτε συνετέλεσεν ὁ Ἰησοῦς τοὺς λόγους τούτους, ἐξεπλήσσοντο οἱ ὄχλοι ἐπὶ τῇ διδαχῇ αὐτοῦ· ἦν γὰρ διδάσκων αὐτοὺς ὡς ἐξουσίαν ἔχων, καὶ οὐχ ὡς οἱ γραμματεῖς. Καταβάντι δὲ αὐτῷ ἀπὸ τοῦ ὄρους ἠκολούθησαν αὐτῷ ὄχλοι πολλοί. Καὶ ἰδοὺ λεπρὸς ἐλθὼν προσεκύνει αὐτῷ λέγων· Κύριε, ἐὰν θέλῃς, δύνασαί με καθαρίσαι. καὶ ἐκτείνας τὴν χεῖρα ἥψατο αὐτοῦ ὁ Ἰησοῦς λέγων· θέλω, καθαρίσθητι. καὶ εὐθέως ἐκαθαρίσθη αὐτοῦ ἡ λέπρα. καὶ λέγει αὐτῷ ὁ Ἰησοῦς· ὅρα μηδενὶ εἴπῃς, ἀλλὰ ὕπαγε σεαυτὸν δεῖξον τῷ ἱερεῖ καὶ προσένεγκε τὸ δῶρον ὃ προσέταξε Μωσῆς εἰς μαρτύριον αὐτοῖς.
ltx/gr_gr_cog/le.go.mc.d140:lemcLI.Gospel.title	Τῷ Σαββάτῳ τῆς Γʹ Ἑβδομάδος τοῦ Ματθαίου
ltx/gr_gr_cog/le.go.mc.d140:lemcLI.Gospel.title_abbr	Σαββάτῳ τῆς Γʹ Ἑβδομάδος
ltx/gr_gr_cog/le.go.mc.d140:lemcLI.Gospel.version	@ltx/gr_gr_cog/properties:version.designation
