ltx/gr_gr_cog/sy.m07.d17:cl.syMA.commemoration01.text	[saint/com 1]
ltx/gr_gr_cog/sy.m07.d17:cl.syMA.commemoration02.text	[saint/com 2]
ltx/gr_gr_cog/sy.m07.d17:cl.syMA.commemoration03.text	[saint/com 3]
ltx/gr_gr_cog/sy.m07.d17:cl.syMA.commemoration04.text	[saint/com 4]
ltx/gr_gr_cog/sy.m07.d17:cl.syMA.commemoration05.text	[saint/com 5]
ltx/gr_gr_cog/sy.m07.d17:cl.syMA.commemoration06.text	[saint/com list]
ltx/gr_gr_cog/sy.m07.d17:syMA.commemoration01.couplet1.title	@ltx/gr_gr_cog/titles:ti.Verses
ltx/gr_gr_cog/sy.m07.d17:syMA.commemoration01.couplet1.verse1	Χεὶρ δημίου τέμνει σε Μαρίνα ξίφει,
ltx/gr_gr_cog/sy.m07.d17:syMA.commemoration01.couplet1.verse2	Χεὶρ Κυρίου χάριτι θείᾳ δὲ στέφει.
ltx/gr_gr_cog/sy.m07.d17:syMA.commemoration01.narration.p01	Αὕτη ὑπῆρχεν ἐκ κώμης τινὸς τῆς Πισσιδείας, ἐν τοῖς μέρεσιν Ἀντιοχείας, Αἰδεσίου τινός, ἱερέως τῶν εἰδώλων, ὑπάρχουσα θυγάτηρ μονογενής. Παραδοθεῖσα δὲ ὑπʼ αὐτοῦ γυναικί τινι, δωδεκαέτις τυγχάνουσα, τῆς μητρὸς αὐτῆς τὸν βίον ἀπολιπούσης, ἐδέετο τοῦ Θεοῦ τῆς τῶν Χριστιανῶν ἀξιωθῆναι πίστεως, ἣν ἐδιδάσκετο ὑπό τινων τῶν ἐν αὐτῇ τῇ κώμῃ. Καὶ ἤδη πεντεκαιδεκάτου ἀγομένου αὐτῇ ἔτους, τὸν τοῦ μαρτυρίου ἀγῶνα ἐπεπόθει ἀνύσασθαι.
ltx/gr_gr_cog/sy.m07.d17:syMA.commemoration01.narration.p02	Ὀλύμβριος οὖν ὁ ἡγεμών, μαθὼν περὶ αὐτῆς, ἀποστείλας συνελάβετο αὐτὴν καὶ ἔβαλεν εἰς φυλακήν. Μεθʼ ἡμέρας δὲ ἐξαγαγὼν αὐτὴν τῆς φυλακῆς, παρέστησε τῷ βήματι αὐτοῦ· καὶ ἰδὼν αὐτήν, ὅλος ἐξέστη ἐπὶ τῇ ὡραιότητι αὐτῆς. Ἐρωτηθεῖσα οὖν παρʼ αὐτοῦ τὴν τύχην καὶ τὸ ὄνομα, Μαρίνα, ἔφη, καλοῦμαι, τῆς Πισσιδείας γέννημα καὶ θρέμμα καὶ τὸ τοῦ Κυρίου μου ὄνομα ἐπικαλουμένη. Μὴ ἀνασχομένης δὲ αὐτῆς τὸν Χριστὸν ἐξομώσασθαι, ἐκέλευσεν ὁ ἡγεμὼν ταθῆναι αὐτὴν καὶ ῥάβδοις ἀπηνῶς καταξαίνεσθαι, καὶ τῷ αἵματι αὐτῆς ἡ γῆ ἐφοινίσσετο. Εἶθʼ οὕτως ἀναρτηθῆναι ταύτην προστάττει καὶ τὸ σῶμα αὐτῆς ξέεσθαι ἐπὶ πολύ· μετὰ τοῦτο δὲ ἔβαλεν αὐτὴν εἰς φυλακήν.
ltx/gr_gr_cog/sy.m07.d17:syMA.commemoration01.narration.p03	Ἐγένετο δὲ σεισμὸς μέγας, ὥς τε σαλευθῆναι τὸ δεσμωτήριον· καὶ ἰδού, δράκων ποθὲν ἑρπύσας, δεινῶς τὴν ἠχὴν ἐποιεῖτο ἐν τῷ ἕρπειν αὐτόν, καὶ κύκλῳ αὐτῆς πῦρ ἔδοξεν ἐμβαλεῖν. Φοβηθείσης δὲ αὐτῆς ἐπὶ πολὺ καὶ συντρόμου γενομένης, ἐδέετο πρὸς τὸν Θεόν· καὶ οὕτως ὁ φοβερώτατος ἐκεῖνος δράκων ὡς κυνὸς μέλανος μορφὴν διεδείκνυτο. Ἡ δὲ Ἁγία τῶν τριχῶν τούτου δραξαμένη καὶ σφῦραν εὑροῦσα, κατὰ τῆς κεφαλῆς καὶ τοῦ νώτου τοῦτον τύπτουσα, εἰς τέλος αὐτὸν ἐταπείνωσεν. Μετὰ δὲ τοῦτο, εἰς ἑτέραν ἐξέτασιν ἀχθεῖσα, λαμπάσι πυρὸς κατακαίεται καὶ ἐπὶ σκεύους ὕδατος πλήρους κατὰ κεφαλῆς ἐμβάλλεται. Ἀβλαβὴς δὲ φυλαχθεῖσα ἐκ τούτου, εἵλκυσε πολλοὺς εἰς τὴν τοῦ Χριστοῦ πίστιν, οἳ καὶ τὰς κεφαλὰς ἐτμήθησαν. Ἐπὶ τούτῳ θυμωθεὶς ὁ ἡγεμών, ξίφει τὴν κεφαλὴν αὐτῆς ἀπέτεμεν.
ltx/gr_gr_cog/sy.m07.d17:syMA.commemoration01.single1	Ἑβδομάτῃ δεκάτῃ Μαρίνα δειροτομήθη.
ltx/gr_gr_cog/sy.m07.d17:syMA.commemoration01.text	Τῇ ΙΖʹ τοῦ αὐτοῦ μηνός, μνήμη τῆς Ἁγίας Μεγαλομάρτυρος Μαρίνης
ltx/gr_gr_cog/sy.m07.d17:syMA.commemoration02.couplet1.title	@ltx/gr_gr_cog/titles:ti.Verses
ltx/gr_gr_cog/sy.m07.d17:syMA.commemoration02.couplet1.verse1	Σοῖς αἵμασι, Σπεράτε, τοῖς ἐξ αὐχένος
ltx/gr_gr_cog/sy.m07.d17:syMA.commemoration02.couplet1.verse2	Αἷμα τραχήλου μιγνύει Βερονίκη.
ltx/gr_gr_cog/sy.m07.d17:syMA.commemoration02.text	Μνήμη τῶν Ἁγίων Μαρτύρων Σπεράτου καὶ Βηρονίκης.
ltx/gr_gr_cog/sy.m07.d17:syMA.lastline	Ταῖς αὐτῶν ἁγίαις πρεσβείαις, ὁ Θεός, ἐλέησον ἡμᾶς. Ἀμήν.
