ltx/gr_gr_cog/le.ep.me.m10.d22:lemeLI.Epistle.book_abbr	@ltx/gr_gr_cog/le.ep.ge.hierarch:legeLI.Epistle.book_abbr
ltx/gr_gr_cog/le.ep.me.m10.d22:lemeLI.Epistle.book_string	@ltx/gr_gr_cog/le.ep.ge.hierarch:legeLI.Epistle.book_string
ltx/gr_gr_cog/le.ep.me.m10.d22:lemeLI.Epistle.chapverse	@ltx/gr_gr_cog/le.ep.ge.hierarch:legeLI.Epistle.chapverse
ltx/gr_gr_cog/le.ep.me.m10.d22:lemeLI.Epistle.incipit	@ltx/gr_gr_cog/le.ep.ge.hierarch:legeLI.Epistle.incipit
ltx/gr_gr_cog/le.ep.me.m10.d22:lemeLI.Epistle.text	@ltx/gr_gr_cog/le.ep.ge.hierarch:legeLI.Epistle.text
ltx/gr_gr_cog/le.ep.me.m10.d22:lemeLI.Epistle.title	Τοῦ Ἱεράρχου
ltx/gr_gr_cog/le.ep.me.m10.d22:lemeLI.Epistle.title_abbr	Τοῦ Ἱεράρχου
ltx/gr_gr_cog/le.ep.me.m10.d22:lemeLI.Epistle.version	@ltx/gr_gr_cog/le.ep.ge.hierarch:legeLI.Epistle.version
ltx/gr_gr_cog/le.ep.me.m10.d22:lemeLI.Epistle2.book_abbr	@ltx/gr_gr_cog/le.ep.mc.d127:lemcLI.Epistle.book_abbr
ltx/gr_gr_cog/le.ep.me.m10.d22:lemeLI.Epistle2.book_string	@ltx/gr_gr_cog/le.ep.mc.d127:lemcLI.Epistle.book_string
ltx/gr_gr_cog/le.ep.me.m10.d22:lemeLI.Epistle2.chapverse	@ltx/gr_gr_cog/le.ep.mc.d127:lemcLI.Epistle.chapverse
ltx/gr_gr_cog/le.ep.me.m10.d22:lemeLI.Epistle2.incipit	@ltx/gr_gr_cog/le.ep.mc.d127:lemcLI.Epistle.incipit
ltx/gr_gr_cog/le.ep.me.m10.d22:lemeLI.Epistle2.text	@ltx/gr_gr_cog/le.ep.mc.d127:lemcLI.Epistle.text
ltx/gr_gr_cog/le.ep.me.m10.d22:lemeLI.Epistle2.title	Τῶν Ἁγίων Παίδων
ltx/gr_gr_cog/le.ep.me.m10.d22:lemeLI.Epistle2.title_abbr	Τῶν Ἁγίων Παίδων
ltx/gr_gr_cog/le.ep.me.m10.d22:lemeLI.Epistle2.version	@ltx/gr_gr_cog/le.ep.mc.d127:lemcLI.Epistle.version
