ltx/gr_gr_cog/me.m07.d31:meDA.commemoration.first	Μνήμη τοῦ Ἁγίου καὶ δικαίου Εὐδοκίμου
ltx/gr_gr_cog/me.m07.d31:meDA.commemoration.first_name	
ltx/gr_gr_cog/me.m07.d31:meDA.commemoration.first_short	Μνήμη τοῦ Ἁγίου καὶ δικαίου Εὐδοκίμου
ltx/gr_gr_cog/me.m07.d31:meDA.commemoration.first_title	@ltx/gr_gr_cog/titles:ti.SaintM
ltx/gr_gr_cog/me.m07.d31:meDA.commemoration.full	Μνήμη τοῦ Ἁγίου καὶ δικαίου Εὐδοκίμου, καὶ Προεόρτια τῆς Προελεύσεως τοῦ Τιμίου Σταυροῦ
ltx/gr_gr_cog/me.m07.d31:meDA.commemoration.second_name	
ltx/gr_gr_cog/me.m07.d31:meDA.commemoration.second_title	@ltx/gr_gr_cog/titles:ti.Cross
ltx/gr_gr_cog/me.m07.d31:meDA.date	Τῌ ΛΑʹ ΙΟΥΛΙΟΥ
ltx/gr_gr_cog/me.m07.d31:meDA.fordate	διὰ τὴν 31ην Ἰουλίου
ltx/gr_gr_cog/me.m07.d31:meDA.insert1	καὶ τοῦ Ἁγίου καὶ δικαίου Εὐδοκίμου
ltx/gr_gr_cog/me.m07.d31:meDA.insert2	οὗ καὶ τὴν μνήμην ἐπιτελοῦμεν·
ltx/gr_gr_cog/me.m07.d31:meDA.note	
ltx/gr_gr_cog/me.m07.d31:meDA.pdfcoverdate	τῆς 31ης Ἰουλίου,
ltx/gr_gr_cog/me.m07.d31:meDA.pdfheaderdate	τῆς 31ης Ἰουλίου
ltx/gr_gr_cog/me.m07.d31:meHO.commemorations	
ltx/gr_gr_cog/me.m07.d31:meHO.note1	
ltx/gr_gr_cog/me.m07.d31:meHO.note2	
ltx/gr_gr_cog/me.m07.d31:meHO.number	
ltx/gr_gr_cog/me.m07.d31:meHO.rank	
ltx/gr_gr_cog/me.m07.d31:meLE.commemoration1	Τοῦ Ἁγίου καὶ Δικαίου Εὐδοκίμου.
ltx/gr_gr_cog/me.m07.d31:meLE.commemoration2	
ltx/gr_gr_cog/me.m07.d31:meLI.Kontakion1.incipit	…
ltx/gr_gr_cog/me.m07.d31:meLI.Kontakion1.melody	
ltx/gr_gr_cog/me.m07.d31:meLI.Kontakion1.mode	
ltx/gr_gr_cog/me.m07.d31:meLI.Kontakion1.text	
ltx/gr_gr_cog/me.m07.d31:meLI.Megalynarion.text	
ltx/gr_gr_cog/me.m07.d31:meMA.C1.acrostic.notice1	οὗ ἡ Ἀκροστιχίς·
ltx/gr_gr_cog/me.m07.d31:meMA.C1.acrostic.text	Ὑμνῶ μάκαρ, σοῦ τοὺς πανευσεβεὶς τρόπους. Ὁ Ἰωσήφ.
ltx/gr_gr_cog/me.m07.d31:meMA.C1.acrostic.title	Ὁ Κανὼν τοῦ Ἁγίου,
ltx/gr_gr_cog/me.m07.d31:meMA.C1.title	@ltx/gr_gr_cog/titles:ti.CanonSaintM
ltx/gr_gr_cog/me.m07.d31:meMA.C1.verse	@ltx/gr_gr_cog/prayers:pr.verse_SaintM.text
ltx/gr_gr_cog/me.m07.d31:meMA.Exaposteilarion1.greekmelody	@ltx/gr_gr_cog/he.a.m3:heAU.OOuranonToisAstrois.greekname
ltx/gr_gr_cog/me.m07.d31:meMA.Exaposteilarion1.incipit	Καὶ ζῶν Εὐδόκιμος ὤφθης, κατὰ…
ltx/gr_gr_cog/me.m07.d31:meMA.Exaposteilarion1.melody	@ltx/gr_gr_cog/he.a.m3:heAU.OOuranonToisAstrois.name
ltx/gr_gr_cog/me.m07.d31:meMA.Exaposteilarion1.mode	@ltx/gr_gr_cog/miscellanea:misc.Mode3
ltx/gr_gr_cog/me.m07.d31:meMA.Exaposteilarion1.text	Καὶ ζῶν Εὐδόκιμος ὤφθης, κατὰ παθῶν παντοδαπῶν, καὶ νῦν εἰσέτι ὑπάρχεις, πηγὴ θαυμάτων τηλαυγής, ἐξ ἧς καθαίρονται πάθη, ψυχῶν ὁμοῦ καὶ σωμάτων.
ltx/gr_gr_cog/me.m07.d31:meMA.Exaposteilarion2.greekmelody	@ltx/gr_gr_cog/he.a.m2:heAU.GynaikesAkoutisthite.greekname
ltx/gr_gr_cog/me.m07.d31:meMA.Exaposteilarion2.incipit	Σταυρὸς προεορτάζεται, καὶ κόσμος ἁγιάζεται…
ltx/gr_gr_cog/me.m07.d31:meMA.Exaposteilarion2.melody	@ltx/gr_gr_cog/he.a.m2:heAU.GynaikesAkoutisthite.name
ltx/gr_gr_cog/me.m07.d31:meMA.Exaposteilarion2.mode	@ltx/gr_gr_cog/miscellanea:misc.Mode2
ltx/gr_gr_cog/me.m07.d31:meMA.Exaposteilarion2.text	Σταυρὸς προεορτάζεται, καὶ κόσμος ἁγιάζεται, τάξεις Ἀγγέλων ὑμνοῦσι, τὸν διʼ ἡμᾶς σταυρωθέντα, καὶ συμπανηγυρίζουσιν, ἡμῖν καὶ συναγάλλονται, δαυϊτικῶς κραυγάζοντες· Εἰργάσατο σωτηρίαν, ἐν μέσῳ γῆς ὁ Δεσπότης.
ltx/gr_gr_cog/me.m07.d31:meMA.Ode1C11.greekmelody	@ltx/gr_gr_cog/he.h.m2:heHE.EnVythoKatestrose.greekname
ltx/gr_gr_cog/me.m07.d31:meMA.Ode1C11.incipit	Ὑψηλον τὸν βίον ἐσχηκώς, καὶ…
ltx/gr_gr_cog/me.m07.d31:meMA.Ode1C11.melody	@ltx/gr_gr_cog/he.h.m2:heHE.EnVythoKatestrose.name
ltx/gr_gr_cog/me.m07.d31:meMA.Ode1C11.mode	@ltx/gr_gr_cog/miscellanea:misc.Mode2
ltx/gr_gr_cog/me.m07.d31:meMA.Ode1C11.ode	@ltx/gr_gr_cog/miscellanea:misc.Ode1
ltx/gr_gr_cog/me.m07.d31:meMA.Ode1C11.text	Ὑψηλον τὸν βίον ἐσχηκώς, καὶ ταῖς ἀναβάσεσι, ταῖς θεϊκαῖς ὁλολαμπὴς γενόμενος, φωτισμόν μοι αἴτησαι, εὐφημοῦντί σου, τὰ σεπτὰ προτερήματα, οἷς εὐδοκιμήσας, ἔτυχες ὧν ἤλπισας Εὐδόκιμε.
ltx/gr_gr_cog/me.m07.d31:meMA.Ode1C12.incipit	Μυριπνόους στέργων διδαχάς, καὶ ταῖς…
ltx/gr_gr_cog/me.m07.d31:meMA.Ode1C12.melody	@ltx/gr_gr_cog/he.h.m2:heHE.EnVythoKatestrose.name
ltx/gr_gr_cog/me.m07.d31:meMA.Ode1C12.mode	@ltx/gr_gr_cog/miscellanea:misc.Mode2
ltx/gr_gr_cog/me.m07.d31:meMA.Ode1C12.ode	@ltx/gr_gr_cog/miscellanea:misc.Ode1
ltx/gr_gr_cog/me.m07.d31:meMA.Ode1C12.text	Μυριπνόους στέργων διδαχάς, καὶ ταῖς ἀναπτύξεσι, τῶν ἱερῶν, Γραφῶν ἐνασχολούμενος, ἡδονῶν ἐξέκλινας, Παμμακάριστε, τὸ δυσῶδες καὶ ἄτιμον, καὶ εὐωδιάσθης, θείαις ἀρεταῖς καλλωπιζόμενος.
ltx/gr_gr_cog/me.m07.d31:meMA.Ode1C13.incipit	Νυσταγμὸν βλεφάρων ἐκ ψυχῆς, Μάκαρ…
ltx/gr_gr_cog/me.m07.d31:meMA.Ode1C13.melody	@ltx/gr_gr_cog/he.h.m2:heHE.EnVythoKatestrose.name
ltx/gr_gr_cog/me.m07.d31:meMA.Ode1C13.mode	@ltx/gr_gr_cog/miscellanea:misc.Mode2
ltx/gr_gr_cog/me.m07.d31:meMA.Ode1C13.ode	@ltx/gr_gr_cog/miscellanea:misc.Ode1
ltx/gr_gr_cog/me.m07.d31:meMA.Ode1C13.text	Νυσταγμὸν βλεφάρων ἐκ ψυχῆς, Μάκαρ ἀπεδίωξας, ἐπαγρυπνῶν καὶ Θεῷ συγγινόμενος, ταῖς παννύχοις στάσεσι, μὴ καμπτόμενος ταῖς ἀνάγκαις τῆς φύσεως· ὅθεν πρός ἡμέραν, ὄντως τὴν ἀνέσπερον κατήντησας.
ltx/gr_gr_cog/me.m07.d31:meMA.Ode1C1T.incipit	Ὡς παστάδα ἔμψυχον Θεοῦ, καὶ…
ltx/gr_gr_cog/me.m07.d31:meMA.Ode1C1T.melody	@ltx/gr_gr_cog/he.h.m2:heHE.EnVythoKatestrose.name
ltx/gr_gr_cog/me.m07.d31:meMA.Ode1C1T.mode	@ltx/gr_gr_cog/miscellanea:misc.Mode2
ltx/gr_gr_cog/me.m07.d31:meMA.Ode1C1T.ode	@ltx/gr_gr_cog/miscellanea:misc.Ode1
ltx/gr_gr_cog/me.m07.d31:meMA.Ode1C1T.text	Ὡς παστάδα ἔμψυχον Θεοῦ, καὶ θυμιατήριον, τοῦ νοητοῦ καὶ φωτοφόρου ἄνθρακος, τὴν ἀειμακάριστον, ἀνυμνήσωμεν, Θεοτόκον κραυγάζοντες· Χαῖρε ἡ αἰτία, τῆς σωτηριώδους ἀναπλάσεως.
ltx/gr_gr_cog/me.m07.d31:meMA.Ode3C11.greekmelody	@ltx/gr_gr_cog/he.h.m2:heHE.EnPetraMeTisPisteos.greekname
ltx/gr_gr_cog/me.m07.d31:meMA.Ode3C11.incipit	Ῥημάτων ζωηρύτων πηγαῖς προσέχων, ἐξέπιες…
ltx/gr_gr_cog/me.m07.d31:meMA.Ode3C11.melody	@ltx/gr_gr_cog/he.h.m2:heHE.EnPetraMeTisPisteos.name
ltx/gr_gr_cog/me.m07.d31:meMA.Ode3C11.mode	@ltx/gr_gr_cog/miscellanea:misc.Mode2
ltx/gr_gr_cog/me.m07.d31:meMA.Ode3C11.ode	@ltx/gr_gr_cog/miscellanea:misc.Ode3
ltx/gr_gr_cog/me.m07.d31:meMA.Ode3C11.text	Ῥημάτων ζωηρύτων πηγαῖς προσέχων, ἐξέπιες τὸ νᾶμα τῆς σωτηρίας, ἐμέσας τὴν κατάπικρον ἁμαρτίαν, καὶ ψάλλων ἔλεγες, Θεῷ Εὐδόκιμε· Ὡς οὐκ ἔστιν, Ἅγιος πλήν σου Κύριε.
ltx/gr_gr_cog/me.m07.d31:meMA.Ode3C12.incipit	Συμπάθειαν ἐκτήσω χριστομιμήτως, διένειμας τὸν…
ltx/gr_gr_cog/me.m07.d31:meMA.Ode3C12.melody	@ltx/gr_gr_cog/he.h.m2:heHE.EnPetraMeTisPisteos.name
ltx/gr_gr_cog/me.m07.d31:meMA.Ode3C12.mode	@ltx/gr_gr_cog/miscellanea:misc.Mode2
ltx/gr_gr_cog/me.m07.d31:meMA.Ode3C12.ode	@ltx/gr_gr_cog/miscellanea:misc.Ode3
ltx/gr_gr_cog/me.m07.d31:meMA.Ode3C12.text	Συμπάθειαν ἐκτήσω χριστομιμήτως, διένειμας τὸν πλοῦτον τοῖς δεομένοις, οὐράνιον τὸν ὄλβον σοι προξενοῦντα, οὗπερ καὶ ἔτυχες, βοῶν Εὐδόκιμε· Ὡς οὐκ ἔστιν Ἅγιος πλήν σου Κύριε.
ltx/gr_gr_cog/me.m07.d31:meMA.Ode3C13.incipit	Οἰκειωθεὶς τῷ Κτίστῃ ἀγάπῃ θείᾳ…
ltx/gr_gr_cog/me.m07.d31:meMA.Ode3C13.melody	@ltx/gr_gr_cog/he.h.m2:heHE.EnPetraMeTisPisteos.name
ltx/gr_gr_cog/me.m07.d31:meMA.Ode3C13.mode	@ltx/gr_gr_cog/miscellanea:misc.Mode2
ltx/gr_gr_cog/me.m07.d31:meMA.Ode3C13.ode	@ltx/gr_gr_cog/miscellanea:misc.Ode3
ltx/gr_gr_cog/me.m07.d31:meMA.Ode3C13.text	Οἰκειωθεὶς τῷ Κτίστῃ ἀγάπῃ θείᾳ, ἐδέξω τὴν οὐράνιον κληρουχίαν, τοῦ ξύλου τῆς ζωῆς δὲ Μάκαρ μετέχεις, θέσει θεούμενος, καὶ μέλπων ἔνδοξε· Ὡς οὐκ ἔστιν Ἅγιος πλήν σου Κύριε.
ltx/gr_gr_cog/me.m07.d31:meMA.Ode3C1T.incipit	Ὑπάρχουσα Ἀγγέλων τιμιωτέρα, τὸν Κτίστην…
ltx/gr_gr_cog/me.m07.d31:meMA.Ode3C1T.melody	@ltx/gr_gr_cog/he.h.m2:heHE.EnPetraMeTisPisteos.name
ltx/gr_gr_cog/me.m07.d31:meMA.Ode3C1T.mode	@ltx/gr_gr_cog/miscellanea:misc.Mode2
ltx/gr_gr_cog/me.m07.d31:meMA.Ode3C1T.ode	@ltx/gr_gr_cog/miscellanea:misc.Ode3
ltx/gr_gr_cog/me.m07.d31:meMA.Ode3C1T.text	Ὑπάρχουσα Ἀγγέλων τιμιωτέρα, τὸν Κτίστην τῶν Ἀγγέλων τῇ σῇ νηδύϊ, ἐβάστασας καὶ τέτοκας Θεομῆτορ, βροτῶν εἰς λύτρωσιν, τῶν μελῳδούντων σοι· ὡς οὐκ ἔστιν ἄχραντος πλήν σου Δέσποινα.
ltx/gr_gr_cog/me.m07.d31:meMA.Ode3H.greekmelody	@ltx/gr_gr_cog/he.h.m2:heHE.EnPetraMeTisPisteos.greekname
ltx/gr_gr_cog/me.m07.d31:meMA.Ode3H.incipit	@ltx/gr_gr_cog/he.h.m2:heHE.EnPetraMeTisPisteos.incipit
ltx/gr_gr_cog/me.m07.d31:meMA.Ode3H.melody	@ltx/gr_gr_cog/he.h.m2:heHE.EnPetraMeTisPisteos.melody
ltx/gr_gr_cog/me.m07.d31:meMA.Ode3H.mode	@ltx/gr_gr_cog/miscellanea:misc.Mode2
ltx/gr_gr_cog/me.m07.d31:meMA.Ode3H.ode	@ltx/gr_gr_cog/miscellanea:misc.Ode3
ltx/gr_gr_cog/me.m07.d31:meMA.Ode3H.text	@ltx/gr_gr_cog/he.h.m2:heHE.EnPetraMeTisPisteos.text
ltx/gr_gr_cog/me.m07.d31:meMA.Ode3Kathisma1.greekmelody	@ltx/gr_gr_cog/he.a.m4:heAU.OYpsotheisEnToStavro.greekname
ltx/gr_gr_cog/me.m07.d31:meMA.Ode3Kathisma1.incipit	Εὐδοκιμήσας ἀγαθαῖς ἐργασίαις, ἐδοκιμάσθης ὡς…
ltx/gr_gr_cog/me.m07.d31:meMA.Ode3Kathisma1.melody	@ltx/gr_gr_cog/he.a.m4:heAU.OYpsotheisEnToStavro.name
ltx/gr_gr_cog/me.m07.d31:meMA.Ode3Kathisma1.mode	@ltx/gr_gr_cog/miscellanea:misc.Mode4
ltx/gr_gr_cog/me.m07.d31:meMA.Ode3Kathisma1.text	Εὐδοκιμήσας ἀγαθαῖς ἐργασίαις, ἐδοκιμάσθης ὡς χρυσὸς ἐν καμίνῳ, τοῖς πειρασμοῖς Εὐδόκιμε ἀοίδιμε· ὅθεν μετὰ θάνατον, ἀναβλύζεις πλουσίως, θαύματα ὡς νάματα, καὶ νοσήματα παύεις, ὑπὲρ ἡμῶν ἀεὶ ἐκδυσωπῶν, ὅπως πταισμάτων συγχώρησιν λάβωμεν.
ltx/gr_gr_cog/me.m07.d31:meMA.Ode3KathismaT.incipit	Ὁ ἐπὶ θρόνου Χερουβὶμ καθεζόμενος…
ltx/gr_gr_cog/me.m07.d31:meMA.Ode3KathismaT.melody	@ltx/gr_gr_cog/he.a.m4:heAU.OYpsotheisEnToStavro.name
ltx/gr_gr_cog/me.m07.d31:meMA.Ode3KathismaT.mode	@ltx/gr_gr_cog/miscellanea:misc.Mode4
ltx/gr_gr_cog/me.m07.d31:meMA.Ode3KathismaT.text	Ὁ ἐπὶ θρόνου Χερουβὶμ καθεζόμενος, καὶ ἐν τοῖς κόλποις τοῦ Πατρὸς αὐλιζόμενος, ὡς ἐπὶ θρόνου κάθηται ἁγίου αὐτοῦ, Δέσποινα ἐν κόλποις σου σαρκικῶς, ὁ Θεός γάρ· ὄντως ἐβασίλευσεν, ἐπὶ πάντα τὰ ἔθνη, καὶ συνετῶς νῦν ψάλλομεν αὐτῷ, ὃν ἐκδυσώπει σωθῆναι τοὺς δούλους σου.
ltx/gr_gr_cog/me.m07.d31:meMA.Ode4C11.greekmelody	@ltx/gr_gr_cog/he.h.m2:heHE.ElilythasEkParthenou.greekname
ltx/gr_gr_cog/me.m07.d31:meMA.Ode4C11.incipit	Τὰ δόγματα τῶν Πατέρων φυλάττων…
ltx/gr_gr_cog/me.m07.d31:meMA.Ode4C11.melody	@ltx/gr_gr_cog/he.h.m2:heHE.ElilythasEkParthenou.name
ltx/gr_gr_cog/me.m07.d31:meMA.Ode4C11.mode	@ltx/gr_gr_cog/miscellanea:misc.Mode2
ltx/gr_gr_cog/me.m07.d31:meMA.Ode4C11.ode	@ltx/gr_gr_cog/miscellanea:misc.Ode4
ltx/gr_gr_cog/me.m07.d31:meMA.Ode4C11.text	Τὰ δόγματα τῶν Πατέρων φυλάττων ἀλώβητα, ὀρθόδοξον φρόνημα, σὺ ἐκ νεότητος ἔσχηκας, βίον ἀκηλίδωτον, καὶ εὐσυμπάθητον γνώμην Ἀξιάγαστε.
ltx/gr_gr_cog/me.m07.d31:meMA.Ode4C12.incipit	Οὐ σύγχυσις κοσμικὴ οὐκ ἀρχῆς…
ltx/gr_gr_cog/me.m07.d31:meMA.Ode4C12.melody	@ltx/gr_gr_cog/he.h.m2:heHE.ElilythasEkParthenou.name
ltx/gr_gr_cog/me.m07.d31:meMA.Ode4C12.mode	@ltx/gr_gr_cog/miscellanea:misc.Mode2
ltx/gr_gr_cog/me.m07.d31:meMA.Ode4C12.ode	@ltx/gr_gr_cog/miscellanea:misc.Ode4
ltx/gr_gr_cog/me.m07.d31:meMA.Ode4C12.text	Οὐ σύγχυσις κοσμικὴ οὐκ ἀρχῆς ἐπικράτεια, οὐ δόξα ἐπίκηρος, σοῦ τὸν πρὸς Κύριον ἔρωτα, ἤμβλυνεν Εὐδόκιμε, ἀλλʼ εὐδοκίμησας ὄντως θείαις πράξεσιν.
ltx/gr_gr_cog/me.m07.d31:meMA.Ode4C13.incipit	Ὑψούμενος ταῖς ἐνθέοις μελέταις ἑκάστοτε…
ltx/gr_gr_cog/me.m07.d31:meMA.Ode4C13.melody	@ltx/gr_gr_cog/he.h.m2:heHE.ElilythasEkParthenou.name
ltx/gr_gr_cog/me.m07.d31:meMA.Ode4C13.mode	@ltx/gr_gr_cog/miscellanea:misc.Mode2
ltx/gr_gr_cog/me.m07.d31:meMA.Ode4C13.ode	@ltx/gr_gr_cog/miscellanea:misc.Ode4
ltx/gr_gr_cog/me.m07.d31:meMA.Ode4C13.text	Ὑψούμενος ταῖς ἐνθέοις μελέταις ἑκάστοτε, ἐχθρὸν ἐταπείνωσας, καὶ ἰαμάτων ἐνέργειαν, εἴληφας Εὐδόκιμε, κρίσει δικαίᾳ τοῦ πάντα διευθύνοντος.
ltx/gr_gr_cog/me.m07.d31:meMA.Ode4C14.incipit	Σταλάζουσα γλυκασμὸν ἡ σορός, τῶν…
ltx/gr_gr_cog/me.m07.d31:meMA.Ode4C14.melody	@ltx/gr_gr_cog/he.h.m2:heHE.ElilythasEkParthenou.name
ltx/gr_gr_cog/me.m07.d31:meMA.Ode4C14.mode	@ltx/gr_gr_cog/miscellanea:misc.Mode2
ltx/gr_gr_cog/me.m07.d31:meMA.Ode4C14.ode	@ltx/gr_gr_cog/miscellanea:misc.Ode4
ltx/gr_gr_cog/me.m07.d31:meMA.Ode4C14.text	Σταλάζουσα γλυκασμὸν ἡ σορός, τῶν λειψάνων σου, πλουσίων ἰάσεων, πάθη καθαίρει Εὐδόκιμε, πίστει τῶν τιμώντων σε, καὶ καταφλέγει δαιμόνων πάσας φάλαγγας.
ltx/gr_gr_cog/me.m07.d31:meMA.Ode4C1T.incipit	Πανύμνητε στρατηγίαις τὸν ἄνω ὑμνούμενον…
ltx/gr_gr_cog/me.m07.d31:meMA.Ode4C1T.melody	@ltx/gr_gr_cog/he.h.m2:heHE.ElilythasEkParthenou.name
ltx/gr_gr_cog/me.m07.d31:meMA.Ode4C1T.mode	@ltx/gr_gr_cog/miscellanea:misc.Mode2
ltx/gr_gr_cog/me.m07.d31:meMA.Ode4C1T.ode	@ltx/gr_gr_cog/miscellanea:misc.Ode4
ltx/gr_gr_cog/me.m07.d31:meMA.Ode4C1T.text	Πανύμνητε στρατηγίαις τὸν ἄνω ὑμνούμενον, Θεὸν ἀπεκύησας, ἄνθρωπον ὄντως γενόμενον, ὃν ὑπὲρ τῶν δούλων σου, ἐκδυσωποῦσα μὴ παύσῃ ἀειπάρθενε.
ltx/gr_gr_cog/me.m07.d31:meMA.Ode5C11.greekmelody	@ltx/gr_gr_cog/he.h.m2:heHE.OFotismos.greekname
ltx/gr_gr_cog/me.m07.d31:meMA.Ode5C11.incipit	Αἴγλῃ σεπτῇ, τῆς ἁγνείας θεόφρον…
ltx/gr_gr_cog/me.m07.d31:meMA.Ode5C11.melody	@ltx/gr_gr_cog/he.h.m2:heHE.OFotismos.name
ltx/gr_gr_cog/me.m07.d31:meMA.Ode5C11.mode	@ltx/gr_gr_cog/miscellanea:misc.Mode2
ltx/gr_gr_cog/me.m07.d31:meMA.Ode5C11.ode	@ltx/gr_gr_cog/miscellanea:misc.Ode5
ltx/gr_gr_cog/me.m07.d31:meMA.Ode5C11.text	Αἴγλῃ σεπτῇ, τῆς ἁγνείας θεόφρον λελαμπρυσμένος, νόμῳ, τε τῷ ταύτης συμπεφραγμένος, νύκτα τοῦ βίου ἀπροσκόπτως διέβης, θεωρίαις θείαις πτερούμενος, Μάκαρ καὶ πρὸς θείαν, ζωὴν κατεσκήνωσας.
ltx/gr_gr_cog/me.m07.d31:meMA.Ode5C12.incipit	Νῦν ἐπὶ σοί, θαῦμα μέγα…
ltx/gr_gr_cog/me.m07.d31:meMA.Ode5C12.melody	@ltx/gr_gr_cog/he.h.m2:heHE.OFotismos.name
ltx/gr_gr_cog/me.m07.d31:meMA.Ode5C12.mode	@ltx/gr_gr_cog/miscellanea:misc.Mode2
ltx/gr_gr_cog/me.m07.d31:meMA.Ode5C12.ode	@ltx/gr_gr_cog/miscellanea:misc.Ode5
ltx/gr_gr_cog/me.m07.d31:meMA.Ode5C12.text	Νῦν ἐπὶ σοί, θαῦμα μέγα ὁρᾶται, καὶ θάμβους πλῆρες, πῶς μετὰ κηδείαν ὄντως χρονίαν, διατηρεῖται ἀδιάλυτον Μακαρ, σοῦ τὸ σῶμα ἐν τάφῳ κείμενον, κρίμασιν οἷς οἶδε, Θεὸς ὁ δοξάζων σε.
ltx/gr_gr_cog/me.m07.d31:meMA.Ode5C13.incipit	Εὖγε τῆς σῆς, πρὸς Θεὸν…
ltx/gr_gr_cog/me.m07.d31:meMA.Ode5C13.melody	@ltx/gr_gr_cog/he.h.m2:heHE.OFotismos.name
ltx/gr_gr_cog/me.m07.d31:meMA.Ode5C13.mode	@ltx/gr_gr_cog/miscellanea:misc.Mode2
ltx/gr_gr_cog/me.m07.d31:meMA.Ode5C13.ode	@ltx/gr_gr_cog/miscellanea:misc.Ode5
ltx/gr_gr_cog/me.m07.d31:meMA.Ode5C13.text	Εὖγε τῆς σῆς, πρὸς Θεὸν παῤῥησίας, εὖγε τοῦ πόθου, οὗπερ ἐκ καρδίας πρὸς τοῦτον ἔσχες, εὐδοκιμήσας φερωνύμως, καὶ λάμψας παραδόξως θείαις λαμπρότησι, καὶ καταφαιδρύνας, πιστῶν τὰ συστήματα.
ltx/gr_gr_cog/me.m07.d31:meMA.Ode5C1T.incipit	Ὑπὲρ ἡμῶν, τὸν ἐκ σοῦ…
ltx/gr_gr_cog/me.m07.d31:meMA.Ode5C1T.melody	@ltx/gr_gr_cog/he.h.m2:heHE.OFotismos.name
ltx/gr_gr_cog/me.m07.d31:meMA.Ode5C1T.mode	@ltx/gr_gr_cog/miscellanea:misc.Mode2
ltx/gr_gr_cog/me.m07.d31:meMA.Ode5C1T.ode	@ltx/gr_gr_cog/miscellanea:misc.Ode5
ltx/gr_gr_cog/me.m07.d31:meMA.Ode5C1T.text	Ὑπὲρ ἡμῶν, τὸν ἐκ σοῦ σαρκωθέντα Παρθενομῆτορ, πάντοτε δυσώπει τῶν σὲ ὑμνούντων, τοῦ λυτρωθῆναι ἐκ παθῶν, καὶ κινδύνων, ψυχοφθόρων κακῶν καὶ θλίψεων, καὶ αἰωνιζούσης, φλογὸς καὶ κολάσεως.
ltx/gr_gr_cog/me.m07.d31:meMA.Ode6C11.greekmelody	@ltx/gr_gr_cog/he.h.m2:heHE.EnAvyssoPtaismaton.greekname
ltx/gr_gr_cog/me.m07.d31:meMA.Ode6C11.incipit	Σταλαγμοὺς γλυκυτάτους ἐστάλαξαν, Μάκαρ οἱ…
ltx/gr_gr_cog/me.m07.d31:meMA.Ode6C11.melody	@ltx/gr_gr_cog/he.h.m2:heHE.EnAvyssoPtaismaton.name
ltx/gr_gr_cog/me.m07.d31:meMA.Ode6C11.mode	@ltx/gr_gr_cog/miscellanea:misc.Mode2
ltx/gr_gr_cog/me.m07.d31:meMA.Ode6C11.ode	@ltx/gr_gr_cog/miscellanea:misc.Ode6
ltx/gr_gr_cog/me.m07.d31:meMA.Ode6C11.text	Σταλαγμοὺς γλυκυτάτους ἐστάλαξαν, Μάκαρ οἱ ἱδρῶτές σου, καὶ ἀγαλλίασιν, καὶ ἰαμάτων ἔλλαμψιν, εἰς Χριστοῦ τοῦ Θεοῦ ἡμῶν αἴνεσιν.
ltx/gr_gr_cog/me.m07.d31:meMA.Ode6C12.incipit	Ἐν αὐλαῖς τοῦ Θεοῦ ἀνεβλάστησας…
ltx/gr_gr_cog/me.m07.d31:meMA.Ode6C12.melody	@ltx/gr_gr_cog/he.h.m2:heHE.EnAvyssoPtaismaton.name
ltx/gr_gr_cog/me.m07.d31:meMA.Ode6C12.mode	@ltx/gr_gr_cog/miscellanea:misc.Mode2
ltx/gr_gr_cog/me.m07.d31:meMA.Ode6C12.ode	@ltx/gr_gr_cog/miscellanea:misc.Ode6
ltx/gr_gr_cog/me.m07.d31:meMA.Ode6C12.text	Ἐν αὐλαῖς τοῦ Θεοῦ ἀνεβλάστησας, ἄμπελος πολύφορος, εὐκληματήσασα, καὶ ἀρετῶν τοὺς βότρυας, γεωργῷ τῶν ψυχῶν ἐθησαύρισας.
ltx/gr_gr_cog/me.m07.d31:meMA.Ode6C13.incipit	Βασιλείαν Θεοῦ ἐπεπόθησας, καὶ κατὰ…
ltx/gr_gr_cog/me.m07.d31:meMA.Ode6C13.melody	@ltx/gr_gr_cog/he.h.m2:heHE.EnAvyssoPtaismaton.name
ltx/gr_gr_cog/me.m07.d31:meMA.Ode6C13.mode	@ltx/gr_gr_cog/miscellanea:misc.Mode2
ltx/gr_gr_cog/me.m07.d31:meMA.Ode6C13.ode	@ltx/gr_gr_cog/miscellanea:misc.Ode6
ltx/gr_gr_cog/me.m07.d31:meMA.Ode6C13.text	Βασιλείαν Θεοῦ ἐπεπόθησας, καὶ κατὰ παθῶν βασιλεύσας Ἀοίδιμε, κατʼ εὐδοκίαν κρείττονα, τῆς χαρᾶς τῶν Δικαίων ἐπέτυχες.
ltx/gr_gr_cog/me.m07.d31:meMA.Ode6C1T.incipit	Ἐκλεκτὴ τῷ Θεῷ ἐχρημάτισας, ὡς…
ltx/gr_gr_cog/me.m07.d31:meMA.Ode6C1T.melody	@ltx/gr_gr_cog/he.h.m2:heHE.EnAvyssoPtaismaton.name
ltx/gr_gr_cog/me.m07.d31:meMA.Ode6C1T.mode	@ltx/gr_gr_cog/miscellanea:misc.Mode2
ltx/gr_gr_cog/me.m07.d31:meMA.Ode6C1T.ode	@ltx/gr_gr_cog/miscellanea:misc.Ode6
ltx/gr_gr_cog/me.m07.d31:meMA.Ode6C1T.text	Ἐκλεκτὴ τῷ Θεῷ ἐχρημάτισας, ὡς ὡραιοτάτη χωρίον εὐρύχωρον, τούτου Παρθένε γέγονας, καὶ παστὰς καὶ λυχνία καὶ τράπεζα.
ltx/gr_gr_cog/me.m07.d31:meMA.Ode6H.greekmelody	@ltx/gr_gr_cog/he.h.m2:heHE.EnAvyssoPtaismaton.greekname
ltx/gr_gr_cog/me.m07.d31:meMA.Ode6H.incipit	@ltx/gr_gr_cog/he.h.m2:heHE.EnAvyssoPtaismaton.incipit
ltx/gr_gr_cog/me.m07.d31:meMA.Ode6H.melody	@ltx/gr_gr_cog/he.h.m2:heHE.EnAvyssoPtaismaton.melody
ltx/gr_gr_cog/me.m07.d31:meMA.Ode6H.mode	@ltx/gr_gr_cog/miscellanea:misc.Mode2
ltx/gr_gr_cog/me.m07.d31:meMA.Ode6H.ode	@ltx/gr_gr_cog/miscellanea:misc.Ode6
ltx/gr_gr_cog/me.m07.d31:meMA.Ode6H.text	@ltx/gr_gr_cog/he.h.m2:heHE.EnAvyssoPtaismaton.text
ltx/gr_gr_cog/me.m07.d31:meMA.Ode7C11.greekmelody	@ltx/gr_gr_cog/he.h.m2:heHE.AntitheonProstagma.greekname
ltx/gr_gr_cog/me.m07.d31:meMA.Ode7C11.incipit	Ἰσχύϊ ῥωννύμενος, τοῦ Ζωοδότου, σαρκὸς…
ltx/gr_gr_cog/me.m07.d31:meMA.Ode7C11.melody	@ltx/gr_gr_cog/he.h.m2:heHE.AntitheonProstagma.name
ltx/gr_gr_cog/me.m07.d31:meMA.Ode7C11.mode	@ltx/gr_gr_cog/miscellanea:misc.Mode2
ltx/gr_gr_cog/me.m07.d31:meMA.Ode7C11.ode	@ltx/gr_gr_cog/miscellanea:misc.Ode7
ltx/gr_gr_cog/me.m07.d31:meMA.Ode7C11.text	Ἰσχύϊ ῥωννύμενος, τοῦ Ζωοδότου, σαρκὸς κατεκράτησας, ὀρέξεων Πανόλβιε, καὶ νοῦν ἀνεπτέρωσας πρὸς τὰ οὐράνια, μέλπων συντονώτατα, ὁ ὢν εὐλογημένος καὶ ὑπερένδοξος.
ltx/gr_gr_cog/me.m07.d31:meMA.Ode7C12.incipit	Σαυτὸν ἐξευγένισας, εὐγενεστάτους, τοὺς τρόπους…
ltx/gr_gr_cog/me.m07.d31:meMA.Ode7C12.melody	@ltx/gr_gr_cog/he.h.m2:heHE.AntitheonProstagma.name
ltx/gr_gr_cog/me.m07.d31:meMA.Ode7C12.mode	@ltx/gr_gr_cog/miscellanea:misc.Mode2
ltx/gr_gr_cog/me.m07.d31:meMA.Ode7C12.ode	@ltx/gr_gr_cog/miscellanea:misc.Ode7
ltx/gr_gr_cog/me.m07.d31:meMA.Ode7C12.text	Σαυτὸν ἐξευγένισας, εὐγενεστάτους, τοὺς τρόπους κτησάμενος, νοὸς ἀκεραιότητι, μελέτῃ σχολάζων δέ, τῶν θεοπνεύστων Γραφῶν, ὅλην σου τὴν ἔφεσιν Θεῷ, τῷ παντεπόπτῃ Μάκαρ ἀνέτεινας.
ltx/gr_gr_cog/me.m07.d31:meMA.Ode7C13.incipit	Τὰ ἄνω βασίλεια, τὴν ἄνω…
ltx/gr_gr_cog/me.m07.d31:meMA.Ode7C13.melody	@ltx/gr_gr_cog/he.h.m2:heHE.AntitheonProstagma.name
ltx/gr_gr_cog/me.m07.d31:meMA.Ode7C13.mode	@ltx/gr_gr_cog/miscellanea:misc.Mode2
ltx/gr_gr_cog/me.m07.d31:meMA.Ode7C13.ode	@ltx/gr_gr_cog/miscellanea:misc.Ode7
ltx/gr_gr_cog/me.m07.d31:meMA.Ode7C13.text	Τὰ ἄνω βασίλεια, τὴν ἄνω πόλιν, Θεοῦ τὸν Παράδεισον, Δικαίων τὴν ἀπόλαυσιν, τρυφὴν τὴν ἀνόθευτον, ὄλβον τὸν ἄσυλον, φέγγος τὸ ἀνέσπερον εὑρεῖν, κατηξιώθης Μάκαρ Εὐδόκιμε.
ltx/gr_gr_cog/me.m07.d31:meMA.Ode7C14.incipit	Ῥεόντων τὸ ἄστατον κατανοήσας, ψυχῆς…
ltx/gr_gr_cog/me.m07.d31:meMA.Ode7C14.melody	@ltx/gr_gr_cog/he.h.m2:heHE.AntitheonProstagma.name
ltx/gr_gr_cog/me.m07.d31:meMA.Ode7C14.mode	@ltx/gr_gr_cog/miscellanea:misc.Mode2
ltx/gr_gr_cog/me.m07.d31:meMA.Ode7C14.ode	@ltx/gr_gr_cog/miscellanea:misc.Ode7
ltx/gr_gr_cog/me.m07.d31:meMA.Ode7C14.text	Ῥεόντων τὸ ἄστατον κατανοήσας, ψυχῆς τὰ κινήματα, Θεὸν πρὸς μόνον ἴθυνας, ἐξ οὗ ἐλλαμπόμενος θείαις λαμπρότησι, βίου τὰ προσκόμματα Σοφέ, ἀνεμποδίστως ὄντως παρέδραμες.
ltx/gr_gr_cog/me.m07.d31:meMA.Ode7C1T.incipit	Ὂν ἔτεκες Δέσποινα ἀεὶ δυσώπει…
ltx/gr_gr_cog/me.m07.d31:meMA.Ode7C1T.melody	@ltx/gr_gr_cog/he.h.m2:heHE.AntitheonProstagma.name
ltx/gr_gr_cog/me.m07.d31:meMA.Ode7C1T.mode	@ltx/gr_gr_cog/miscellanea:misc.Mode2
ltx/gr_gr_cog/me.m07.d31:meMA.Ode7C1T.ode	@ltx/gr_gr_cog/miscellanea:misc.Ode7
ltx/gr_gr_cog/me.m07.d31:meMA.Ode7C1T.text	Ὂν ἔτεκες Δέσποινα ἀεὶ δυσώπει, δουλείας ῥυσθῆναί με, παθῶν, καὶ κατακρίσεως, καὶ τῆς συνεχούσης με δεινῆς πωρώσεως, καὶ τῆς τῶν θλιβόντων με ἀεί, ἐπικρατείας θεοχαρίτωτε.
ltx/gr_gr_cog/me.m07.d31:meMA.Ode8C11.greekmelody	@ltx/gr_gr_cog/he.h.m2:heHE.TonEnKaminoTouPyros.greekname
ltx/gr_gr_cog/me.m07.d31:meMA.Ode8C11.incipit	Πῦρ ἐννοῶν τὸ φοβερόν, πρὸ…
ltx/gr_gr_cog/me.m07.d31:meMA.Ode8C11.melody	@ltx/gr_gr_cog/he.h.m2:heHE.TonEnKaminoTouPyros.name
ltx/gr_gr_cog/me.m07.d31:meMA.Ode8C11.mode	@ltx/gr_gr_cog/miscellanea:misc.Mode2
ltx/gr_gr_cog/me.m07.d31:meMA.Ode8C11.ode	@ltx/gr_gr_cog/miscellanea:misc.Ode8
ltx/gr_gr_cog/me.m07.d31:meMA.Ode8C11.text	Πῦρ ἐννοῶν τὸ φοβερόν, πρὸ τοῦ θρόνου τοῦ Θεοῦ μέλλον ἐκχεῖσθαι, κατανύξει καρδίας, θερμοὺς ἐκχέεις κρουνούς, δακρύων ἐναποτεφροῦντάς σοι, τῶν παθῶν καμίνους, Εὐδόκιμε θεόφρον.
ltx/gr_gr_cog/me.m07.d31:meMA.Ode8C12.incipit	Ὅλον μετέθηκας σαυτοῦ, πρὸς τὸν…
ltx/gr_gr_cog/me.m07.d31:meMA.Ode8C12.melody	@ltx/gr_gr_cog/he.h.m2:heHE.TonEnKaminoTouPyros.name
ltx/gr_gr_cog/me.m07.d31:meMA.Ode8C12.mode	@ltx/gr_gr_cog/miscellanea:misc.Mode2
ltx/gr_gr_cog/me.m07.d31:meMA.Ode8C12.ode	@ltx/gr_gr_cog/miscellanea:misc.Ode8
ltx/gr_gr_cog/me.m07.d31:meMA.Ode8C12.text	Ὅλον μετέθηκας σαυτοῦ, πρὸς τὸν Κύριον Σοφὲ ψυχῆς τὸν πόθον, καὶ αὐτῷ ἐκολλήθης ἀναβοῶν ψαλμικῶς· Χριστέ μου, ἰλύος με λύτρωσαι, τῶν θανατηφόρων παθῶν εἰς τοὺς αἰῶνας.
ltx/gr_gr_cog/me.m07.d31:meMA.Ode8C13.incipit	Ὑπομονῇ καρτερικός, καὶ καρδίᾳ ταπεινός…
ltx/gr_gr_cog/me.m07.d31:meMA.Ode8C13.melody	@ltx/gr_gr_cog/he.h.m2:heHE.TonEnKaminoTouPyros.name
ltx/gr_gr_cog/me.m07.d31:meMA.Ode8C13.mode	@ltx/gr_gr_cog/miscellanea:misc.Mode2
ltx/gr_gr_cog/me.m07.d31:meMA.Ode8C13.ode	@ltx/gr_gr_cog/miscellanea:misc.Ode8
ltx/gr_gr_cog/me.m07.d31:meMA.Ode8C13.text	Ὑπομονῇ καρτερικός, καὶ καρδίᾳ ταπεινός, σὺ καθωράθης, συμπαθὴς δεομένοις, ἦθος προσφέρων χρηστόν, καὶ τρόπους ἐναρέτους Πάντιμε, οἷς εὐδοκιμήσας, θαυμάτων βρύεις χάριν.
ltx/gr_gr_cog/me.m07.d31:meMA.Ode8C14.incipit	Σύνεσιν ἔχων θεϊκήν, πληρωτὴς Δεσποτικῶν…
ltx/gr_gr_cog/me.m07.d31:meMA.Ode8C14.melody	@ltx/gr_gr_cog/he.h.m2:heHE.TonEnKaminoTouPyros.name
ltx/gr_gr_cog/me.m07.d31:meMA.Ode8C14.mode	@ltx/gr_gr_cog/miscellanea:misc.Mode2
ltx/gr_gr_cog/me.m07.d31:meMA.Ode8C14.ode	@ltx/gr_gr_cog/miscellanea:misc.Ode8
ltx/gr_gr_cog/me.m07.d31:meMA.Ode8C14.text	Σύνεσιν ἔχων θεϊκήν, πληρωτὴς Δεσποτικῶν ὤφθης λογίων, δεξιὰς στέργων τρίβους, τὰς εὐωνύμους σαφῶς, ἐκκλίνας ὡς ἔννους καὶ φρόνιμος, ὑπερευλογῶν τὸν Χριστόν εἰς τοὺς αἰῶνας.
ltx/gr_gr_cog/me.m07.d31:meMA.Ode8C1T.incipit	Ὁ τοῦ Ἀδὰμ Δημιουργός, ἐξ…
ltx/gr_gr_cog/me.m07.d31:meMA.Ode8C1T.melody	@ltx/gr_gr_cog/he.h.m2:heHE.TonEnKaminoTouPyros.name
ltx/gr_gr_cog/me.m07.d31:meMA.Ode8C1T.mode	@ltx/gr_gr_cog/miscellanea:misc.Mode2
ltx/gr_gr_cog/me.m07.d31:meMA.Ode8C1T.ode	@ltx/gr_gr_cog/miscellanea:misc.Ode8
ltx/gr_gr_cog/me.m07.d31:meMA.Ode8C1T.text	Ὁ τοῦ Ἀδὰμ Δημιουργός, ἐξ αἱμάτων σου ἁγνῶν δημιουργεῖται, καὶ γαλακτοτροφεῖται ὁ διατρέφων πνοήν, Παρθένε Θεοτόκε ἅπασαν· ὅθεν ὡς Θεοῦ σε δοξάζομεν Μητέρα.
ltx/gr_gr_cog/me.m07.d31:meMA.Ode8H.greekmelody	@ltx/gr_gr_cog/he.h.m2:heHE.TonEnKaminoTouPyros.greekname
ltx/gr_gr_cog/me.m07.d31:meMA.Ode8H.incipit	@ltx/gr_gr_cog/he.h.m2:heHE.TonEnKaminoTouPyros.incipit
ltx/gr_gr_cog/me.m07.d31:meMA.Ode8H.melody	@ltx/gr_gr_cog/he.h.m2:heHE.TonEnKaminoTouPyros.melody
ltx/gr_gr_cog/me.m07.d31:meMA.Ode8H.mode	@ltx/gr_gr_cog/miscellanea:misc.Mode2
ltx/gr_gr_cog/me.m07.d31:meMA.Ode8H.ode	@ltx/gr_gr_cog/miscellanea:misc.Ode8
ltx/gr_gr_cog/me.m07.d31:meMA.Ode8H.text	@ltx/gr_gr_cog/he.h.m2:heHE.TonEnKaminoTouPyros.text
ltx/gr_gr_cog/me.m07.d31:meMA.Ode9C11.greekmelody	@ltx/gr_gr_cog/he.h.m2:heHE.AnarchouGennitoros.greekname
ltx/gr_gr_cog/me.m07.d31:meMA.Ode9C11.incipit	Ἰδεῖν ἐφιέμενος, τὴν δόξαν τοῦ…
ltx/gr_gr_cog/me.m07.d31:meMA.Ode9C11.melody	@ltx/gr_gr_cog/he.h.m2:heHE.AnarchouGennitoros.name
ltx/gr_gr_cog/me.m07.d31:meMA.Ode9C11.mode	@ltx/gr_gr_cog/miscellanea:misc.Mode2
ltx/gr_gr_cog/me.m07.d31:meMA.Ode9C11.ode	@ltx/gr_gr_cog/miscellanea:misc.Ode9
ltx/gr_gr_cog/me.m07.d31:meMA.Ode9C11.text	Ἰδεῖν ἐφιέμενος, τὴν δόξαν τοῦ Θεοῦ ἡμῶν, ἀρετῶν εὐμορφίᾳ σαυτὸν ἐκάλλυνας, καὶ λαμπαδηφόρος εἰσῆλθες εἰς φωτεινούς, νυμφῶνας Ἀγγέλων, συνὼν τῷ Δεσπότῃ σου, ἀπολαύων τῆς θεώσεως.
ltx/gr_gr_cog/me.m07.d31:meMA.Ode9C12.incipit	Ὡς ὄρθρος ὡς ἥλιος, ἀνέτειλεν…
ltx/gr_gr_cog/me.m07.d31:meMA.Ode9C12.melody	@ltx/gr_gr_cog/he.h.m2:heHE.AnarchouGennitoros.name
ltx/gr_gr_cog/me.m07.d31:meMA.Ode9C12.mode	@ltx/gr_gr_cog/miscellanea:misc.Mode2
ltx/gr_gr_cog/me.m07.d31:meMA.Ode9C12.ode	@ltx/gr_gr_cog/miscellanea:misc.Ode9
ltx/gr_gr_cog/me.m07.d31:meMA.Ode9C12.text	Ὡς ὄρθρος ὡς ἥλιος, ἀνέτειλεν ἡ μνήμη σου, τὰς ἐν ζόφῳ καρδίας καταφωτίζουσα· σὺ γὰρ καὶ φωτὸς καὶ ἡμέρας, ὡς ἀληθῶς υἱὸς ἐγνωρίσθης, θεόφρον Εὐδόκιμε· διὰ τοῦτό σε γεραίρομεν.
ltx/gr_gr_cog/me.m07.d31:meMA.Ode9C13.incipit	Σοφίᾳ κοσμούμενος, καὶ γνώσει λαμπρυνόμενος…
ltx/gr_gr_cog/me.m07.d31:meMA.Ode9C13.melody	@ltx/gr_gr_cog/he.h.m2:heHE.AnarchouGennitoros.name
ltx/gr_gr_cog/me.m07.d31:meMA.Ode9C13.mode	@ltx/gr_gr_cog/miscellanea:misc.Mode2
ltx/gr_gr_cog/me.m07.d31:meMA.Ode9C13.ode	@ltx/gr_gr_cog/miscellanea:misc.Ode9
ltx/gr_gr_cog/me.m07.d31:meMA.Ode9C13.text	Σοφίᾳ κοσμούμενος, καὶ γνώσει λαμπρυνόμενος, ταπεινώσει καρδίας ὡραϊζόμενος, ὕψει πολιτείας ἐμπρέπων, πρὸς νοητάς, ἐπέβης ἐπαύλεις, μεθʼ ὧν ἡμῶν μνήσθητι, τῶν τιμώντων σε Εὐδόκιμε.
ltx/gr_gr_cog/me.m07.d31:meMA.Ode9C14.incipit	Ἡμέραν ἑόρτιον, καὶ ὠφελείας πρόξενον…
ltx/gr_gr_cog/me.m07.d31:meMA.Ode9C14.melody	@ltx/gr_gr_cog/he.h.m2:heHE.AnarchouGennitoros.name
ltx/gr_gr_cog/me.m07.d31:meMA.Ode9C14.mode	@ltx/gr_gr_cog/miscellanea:misc.Mode2
ltx/gr_gr_cog/me.m07.d31:meMA.Ode9C14.ode	@ltx/gr_gr_cog/miscellanea:misc.Ode9
ltx/gr_gr_cog/me.m07.d31:meMA.Ode9C14.text	Ἡμέραν ἑόρτιον, καὶ ὠφελείας πρόξενον, τὴν σεπτήν σου τελοῦμεν ἐκ γῆς μετάστασιν· σὺ γὰρ τοῦ Κυρίου θεράπων, καὶ τῶν αὐτοῦ, ἐντολῶν ἐργάτης, ὤφθης ἀνεπαίσχυντος, ἀξιάγαστε Εὐδόκιμε.
ltx/gr_gr_cog/me.m07.d31:meMA.Ode9C1T.incipit	Φωτὸς ἐνδιαίτημα, τοῦ πάντας καταυγάσαντος…
ltx/gr_gr_cog/me.m07.d31:meMA.Ode9C1T.melody	@ltx/gr_gr_cog/he.h.m2:heHE.AnarchouGennitoros.name
ltx/gr_gr_cog/me.m07.d31:meMA.Ode9C1T.mode	@ltx/gr_gr_cog/miscellanea:misc.Mode2
ltx/gr_gr_cog/me.m07.d31:meMA.Ode9C1T.ode	@ltx/gr_gr_cog/miscellanea:misc.Ode9
ltx/gr_gr_cog/me.m07.d31:meMA.Ode9C1T.text	Φωτὸς ἐνδιαίτημα, τοῦ πάντας καταυγάσαντος, καὶ σκηνὴ καθωράθης θεοχαρίτωτε· γέφυρα καὶ κλῖμαξ πρὸς ὕψος τοὺς γηγενεῖς, ἀνάγουσα Κόρη· διό σε γεραίρομεν, καὶ πιστῶς σε μακαρίζομεν.
ltx/gr_gr_cog/me.m07.d31:meMA.Ode9H.greekmelody	@ltx/gr_gr_cog/he.h.m2:heHE.AnarchouGennitoros.greekname
ltx/gr_gr_cog/me.m07.d31:meMA.Ode9H.incipit	@ltx/gr_gr_cog/he.h.m2:heHE.AnarchouGennitoros.incipit
ltx/gr_gr_cog/me.m07.d31:meMA.Ode9H.melody	@ltx/gr_gr_cog/he.h.m2:heHE.AnarchouGennitoros.melody
ltx/gr_gr_cog/me.m07.d31:meMA.Ode9H.mode	@ltx/gr_gr_cog/miscellanea:misc.Mode2
ltx/gr_gr_cog/me.m07.d31:meMA.Ode9H.ode	@ltx/gr_gr_cog/miscellanea:misc.Ode9
ltx/gr_gr_cog/me.m07.d31:meMA.Ode9H.text	@ltx/gr_gr_cog/he.h.m2:heHE.AnarchouGennitoros.text
ltx/gr_gr_cog/me.m07.d31:meVE.Apolytikion1.greekmelody	@ltx/gr_gr_cog/he.a.m4:heAU.TachyProkatalave.greekname
ltx/gr_gr_cog/me.m07.d31:meVE.Apolytikion1.incipit	Ἐκ γῆς ὁ καλέσας σε…
ltx/gr_gr_cog/me.m07.d31:meVE.Apolytikion1.melody	@ltx/gr_gr_cog/he.a.m4:heAU.TachyProkatalave.name
ltx/gr_gr_cog/me.m07.d31:meVE.Apolytikion1.mode	@ltx/gr_gr_cog/miscellanea:misc.Mode4
ltx/gr_gr_cog/me.m07.d31:meVE.Apolytikion1.text	Ἐκ γῆς ὁ καλέσας σε, πρὸς αἰωνίους μονάς, τηρεῖ καὶ μετὰ θάνατον ἀδιαλώβητον, τὸ σῶμά σου, Ἅγιε· σὺ γὰρ ἐν σωφροσύνῃ, καὶ σεμνῇ πολιτείᾳ, μάκαρ ἐπολιτεύσω, μὴ μολύνας τὴν σάρκα· διὸ ἐν παῤῥησίᾳ Χριστῷ, πρέσβευε σωθῆναι ἡμᾶς.
ltx/gr_gr_cog/me.m07.d31:meVE.Apolytikion2ger.greekmelody	@ltx/gr_gr_cog/he.a.m1:heAU.ChorosAngelikos.greekname
ltx/gr_gr_cog/me.m07.d31:meVE.Apolytikion2ger.incipit	Τὸν τίμιον Σταυρόν, τὸ σωτήριον…
ltx/gr_gr_cog/me.m07.d31:meVE.Apolytikion2ger.melody	@ltx/gr_gr_cog/he.a.m1:heAU.ChorosAngelikos.name
ltx/gr_gr_cog/me.m07.d31:meVE.Apolytikion2ger.mode	@ltx/gr_gr_cog/miscellanea:misc.Mode1
ltx/gr_gr_cog/me.m07.d31:meVE.Apolytikion2ger.poet	@ltx/gr_gr_cog/poets:po.Gerasimou
ltx/gr_gr_cog/me.m07.d31:meVE.Apolytikion2ger.text	Τὸν τίμιον Σταυρόν, τὸ σωτήριον ὅπλον, δεξώμεθα πιστοί, καθαρᾷ διανοίᾳ· προέρχεσθαι μέλλει γάρ, θείαν χάριν δωρούμενος, καὶ ἰώμενος, ψυχῶν ὁμοῦ καὶ σωμάτων, τὰ νοσήματα, διʼ ἐνεργείας ἀῤῥήτου, Χριστοῦ τοῦ Θεοῦ ἡμῶν.
ltx/gr_gr_cog/me.m07.d31:meVE.AposGlory.incipit	@ltx/gr_gr_cog/me.m09.d14:meMA.PostGospelIdiomelon.incipit
ltx/gr_gr_cog/me.m07.d31:meVE.AposGlory.melody	
ltx/gr_gr_cog/me.m07.d31:meVE.AposGlory.mode	@ltx/gr_gr_cog/miscellanea:misc.Mode6
ltx/gr_gr_cog/me.m07.d31:meVE.AposGlory.text	@ltx/gr_gr_cog/me.m09.d14:meMA.PostGospelIdiomelon.text
ltx/gr_gr_cog/me.m07.d31:meVE.SticBoth.incipit	@ltx/gr_gr_cog/me.m09.d14:meSV.SticGlory.incipit
ltx/gr_gr_cog/me.m07.d31:meVE.SticBoth.melody	
ltx/gr_gr_cog/me.m07.d31:meVE.SticBoth.mode	@ltx/gr_gr_cog/miscellanea:misc.Mode2
ltx/gr_gr_cog/me.m07.d31:meVE.SticBoth.text	@ltx/gr_gr_cog/me.m09.d14:meSV.SticGlory.text
ltx/gr_gr_cog/me.m07.d31:meVE.SticGlory.incipit	Παντὸς Δικαίου μνήμη μέτʼ ἐγκωμίων…
ltx/gr_gr_cog/me.m07.d31:meVE.SticGlory.melody	
ltx/gr_gr_cog/me.m07.d31:meVE.SticGlory.mode	@ltx/gr_gr_cog/miscellanea:misc.Mode2
ltx/gr_gr_cog/me.m07.d31:meVE.SticGlory.text	Παντὸς Δικαίου μνήμη μέτʼ ἐγκωμίων γίνεται, μεθʼ ὧν καὶ ἡ σή, θεράπον Χριστοῦ Εὐδόκιμε· ὅπλον γὰρ ἔσχες Σταυρόν, καὶ κράτος ἀήττητον, Τριάδος ὁμοουσίου πίστιν· διὰ τοῦτο μετʼ Ἀγγέλων, συναναπαύῃ ἀείμνηστε.
ltx/gr_gr_cog/me.m07.d31:meVE.Stichera01.greekmelody	@ltx/gr_gr_cog/he.a.m1:heAU.TonOuranionTagmaton.greekname
ltx/gr_gr_cog/me.m07.d31:meVE.Stichera01.incipit	Σύμπασα φύσις ἀνθρώπων νῦν προεόρταζε…
ltx/gr_gr_cog/me.m07.d31:meVE.Stichera01.melody	@ltx/gr_gr_cog/he.a.m1:heAU.TonOuranionTagmaton.name
ltx/gr_gr_cog/me.m07.d31:meVE.Stichera01.mode	@ltx/gr_gr_cog/miscellanea:misc.Mode1
ltx/gr_gr_cog/me.m07.d31:meVE.Stichera01.text	Σύμπασα φύσις ἀνθρώπων νῦν προεόρταζε, χαρμονικῶς καὶ σκίρτα· τοῦ Σταυροῦ γὰρ τὸ ξύλον, μέλλει προτεθῆναι πᾶσι πιστοῖς, ἰατρεῖον ἀδάπανον, καὶ νοσημάτων λυτήριον καὶ παθῶν, καὶ παντοίων περιστάσεων.
ltx/gr_gr_cog/me.m07.d31:meVE.Stichera02.incipit	Δεῦτε κατίδωμεν ξένον πιστοὶ τεράστιον…
ltx/gr_gr_cog/me.m07.d31:meVE.Stichera02.melody	@ltx/gr_gr_cog/he.a.m1:heAU.TonOuranionTagmaton.name
ltx/gr_gr_cog/me.m07.d31:meVE.Stichera02.mode	@ltx/gr_gr_cog/miscellanea:misc.Mode1
ltx/gr_gr_cog/me.m07.d31:meVE.Stichera02.text	Δεῦτε κατίδωμεν ξένον πιστοὶ τεράστιον· πῶς τοῦ Σταυροῦ τὸ ξύλον, καταπαύει φλογώσεις, κοιμίζει ἀλγηδόνας πάθους παντός, ἀπαλλάττει τοὺς κάμνοντας. Προεορτάσωμεν τοίνυν καὶ τῇ αὐτοῦ, προελεύσει νῦν σκιρτήσωμεν.
ltx/gr_gr_cog/me.m07.d31:meVE.Stichera03.incipit	Ζῶντες ὁμοῦ καὶ θανόντες προευτρεπίσθητε…
ltx/gr_gr_cog/me.m07.d31:meVE.Stichera03.melody	@ltx/gr_gr_cog/he.a.m1:heAU.TonOuranionTagmaton.name
ltx/gr_gr_cog/me.m07.d31:meVE.Stichera03.mode	@ltx/gr_gr_cog/miscellanea:misc.Mode1
ltx/gr_gr_cog/me.m07.d31:meVE.Stichera03.text	Ζῶντες ὁμοῦ καὶ θανόντες προευτρεπίσθητε· τῆς γὰρ ζωῆς τὸ ξύλον, τὸ τὸν ᾍδην νεκρῶσαν, ὁ φύλαξ τῶν ἀνθρώπων ἡ τῶν νεκρῶν ἐξανάστασις ἔρχεται, πᾶσι τὴν ἄφθονον χάριν νῦν παρασχεῖν, τοῖς αἰτοῦσι μετὰ πίστεως.
ltx/gr_gr_cog/me.m07.d31:meVE.Stichera04.greekmelody	@ltx/gr_gr_cog/he.a.m1:heAU.TonOuranionTagmaton.greekname
ltx/gr_gr_cog/me.m07.d31:meVE.Stichera04.incipit	Μακαριώτατον τέλος εὗρες Εὐδόκιμε, εὐδοκιμήσας…
ltx/gr_gr_cog/me.m07.d31:meVE.Stichera04.melody	@ltx/gr_gr_cog/he.a.m1:heAU.TonOuranionTagmaton.name
ltx/gr_gr_cog/me.m07.d31:meVE.Stichera04.mode	@ltx/gr_gr_cog/miscellanea:misc.Mode1
ltx/gr_gr_cog/me.m07.d31:meVE.Stichera04.text	Μακαριώτατον τέλος εὗρες Εὐδόκιμε, εὐδοκιμήσας θείαις, ἀρεταῖς φερωνύμως, καὶ κόσμου ταῖς ἀπάταις μὴ συγχωσθείς, ἀλλὰ λάμψας φαιδρότερον, τῶν τοῦ ἡλίου ἀκτίνων καὶ τῶν πιστῶν, καταυγάσας τὰ συστήματα.
ltx/gr_gr_cog/me.m07.d31:meVE.Stichera05.incipit	Ἡ ἐλεήμων καρδία καὶ εὐσυμπάθητος…
ltx/gr_gr_cog/me.m07.d31:meVE.Stichera05.melody	@ltx/gr_gr_cog/he.a.m1:heAU.TonOuranionTagmaton.name
ltx/gr_gr_cog/me.m07.d31:meVE.Stichera05.mode	@ltx/gr_gr_cog/miscellanea:misc.Mode1
ltx/gr_gr_cog/me.m07.d31:meVE.Stichera05.text	Ἡ ἐλεήμων καρδία καὶ εὐσυμπάθητος, ὁ τῆς ἀγάπης λύχνος, ὀρφανῶν ὁ προστάτης, γυμνῶν καὶ πενομένων ὁ σκεπαστής, σωφροσύνης τὸ ἄγαλμα, τῶν ἐντολῶν τοῦ Κυρίου ὁ πληρωτής, εὐφημείσθω νῦν Εὐδόκιμος.
ltx/gr_gr_cog/me.m07.d31:meVE.Stichera06.incipit	Τῇ καθαρᾷ σου καρδίᾳ Θεὸν…
ltx/gr_gr_cog/me.m07.d31:meVE.Stichera06.melody	@ltx/gr_gr_cog/he.a.m1:heAU.TonOuranionTagmaton.name
ltx/gr_gr_cog/me.m07.d31:meVE.Stichera06.mode	@ltx/gr_gr_cog/miscellanea:misc.Mode1
ltx/gr_gr_cog/me.m07.d31:meVE.Stichera06.text	Τῇ καθαρᾷ σου καρδίᾳ Θεὸν ἐζήτησας, καὶ τὰ τοῦ κόσμου πάντα, ἑβδελύξω ἡδέα, Εὐδόκιμε θεόφρον· ὅθεν πιστῶς, καὶ τῶν κόπων ἀντάμειψιν, παρὰ Θεοῦ ἐκομίσω παναληθῶς, ὡς ἐν τέλει πεφανέρωται.
