ltx/gr_gr_cog/eu.privateendeavor:euKey003.title	Ἀκολουθία ἐπὶ τῇ Ἐνάρξει Παντὸς Ἰδιωτικοῦ Ἔργου
ltx/gr_gr_cog/eu.privateendeavor:euKey004.rubric	(καθʼ ἑκάστην δέησιν)·
ltx/gr_gr_cog/eu.privateendeavor:euKey005.text	Ὑπὲρ τοῦ καταπεμφθῆναι ἡμῖν πλουσίαν τὴν θείαν Χάριν ἐν τοῖς ἔργοις ἡμῶν, τοῦ Κυρίου δεηθῶμεν.
ltx/gr_gr_cog/eu.privateendeavor:euKey006.text	Ὑπὲρ τοῦ γενέσθαι τὸν Θεὸν ἡμῶν συνεργὸν καὶ ἀντιλήπτορα, ἐν οἷς κατὰ τὸν θεῖον αὐτοῦ φωτισμὸν πράττομεν ἀγαθοῖς, τοῦ Κυρίου δεηθῶμεν.
ltx/gr_gr_cog/eu.privateendeavor:euKey007.rubric	Ὁ Ἱερεὺς λέγει τὴν εὐχὴν ταύτην·
ltx/gr_gr_cog/eu.privateendeavor:euKey008.rubric	Ὁ Ἱερεύς, βαπτίζων τὸν τίμιον Σταυρὸν ἐν τῷ ὕδατι ψάλλει ἐκ γʹ.
ltx/gr_gr_cog/eu.privateendeavor:euKey009.rubric	Εἶτα ῥαντίζων σταυροειδῶς ψάλλει.
ltx/gr_gr_cog/eu.privateendeavor:euKey010.rubric	Ὁ Ἱερεὺς τὴν Εὐχήν·
ltx/gr_gr_cog/eu.privateendeavor:euKey011.text	Δέσποτα Κύριε Ἰησοῦ Χριστὲ ὁ Θεὸς ἡμῶν, ὁ ἀῤῥήτῳ φιλανθρωπίᾳ τὸ γένος τῶν ἀνθρώπων ἐπισκεψάμεονς καὶ πᾶσι τοῖς δεομένοις σου τὴν σὴν εὐλογίαν ἐπιχορηγήσας, σοῦ δεόμεθα καὶ σὲ παρακαλοῦμεν, ἔπιδε καὶ νῦν ἐπὶ τὸν δοῦλόν σου (τόνδε), τὸν ἑλόμενον ἐν τῷ κράτει τῆς ἰσχύος σου τραπῆναι εἰς ἐργασίαν πρὸς πορισμὸν καὶ εὐλόγησον αὐτόν τε καὶ τὰ ἔργα αὐτοῦ. Τήρησον αὐτὸν ἀνεπηρέαστον παντὸς κακοῦ, ἐπιδαψιλεύων αὐτῷ τε καὶ τοῖς ἐνταῦθα ἐργζομένοις εἰρήνην, ἀγάπην, ὁμόνοιαν καὶ δικαιοσύνην. Πάρεχε τῷ δούλῳ σου τούτῳ πλούσια τὰ ἐλέη σου καὶ κατεύθυνον τὰ διαβήματα αὐτοῦ εἰς πᾶν ἔργον ἀγαθόν. Ὅτι Θεὸς ἐλέους, οἰκτιρμῶν καὶ φιλανθρωπίας ὑπάρχεις καὶ σοὶ τὴν δόξαν ἀναπέμπομεν σὺν τῷ ἀνάρχῳ σου Πατρὶ καὶ τῷ παναγίῳ καὶ ἀγαθῷ καὶ ζωοποιῷ σου Πνεύματι, νῦν καὶ ἀεὶ καὶ εἰς τοὺς αἰῶνας τῶν αἰώνων.
