ltx/gr_gr_cog/le.ep.me.m12.dSunAC:lemeLI.Epistle.book_abbr	@ltx/gr_gr_cog/le.ep.mc.d260:lemcLI.Epistle.book_abbr
ltx/gr_gr_cog/le.ep.me.m12.dSunAC:lemeLI.Epistle.book_string	@ltx/gr_gr_cog/le.ep.mc.d260:lemcLI.Epistle.book_string
ltx/gr_gr_cog/le.ep.me.m12.dSunAC:lemeLI.Epistle.chapverse	@ltx/gr_gr_cog/le.ep.mc.d260:lemcLI.Epistle.chapverse
ltx/gr_gr_cog/le.ep.me.m12.dSunAC:lemeLI.Epistle.incipit	@ltx/gr_gr_cog/le.ep.mc.d260:lemcLI.Epistle.incipit
ltx/gr_gr_cog/le.ep.me.m12.dSunAC:lemeLI.Epistle.text	@ltx/gr_gr_cog/le.ep.mc.d260:lemcLI.Epistle.text
ltx/gr_gr_cog/le.ep.me.m12.dSunAC:lemeLI.Epistle.title	ΚΥΡΙΑΚΗ ΜΕΤΑ ΤΗΝ ΧΡΙΣΤΟΥ ΓΕΝΝΗΣΙΝ
ltx/gr_gr_cog/le.ep.me.m12.dSunAC:lemeLI.Epistle.title_abbr	Κυρ. μετὰ Χριστούγεν
ltx/gr_gr_cog/le.ep.me.m12.dSunAC:lemeLI.Epistle.version	@ltx/gr_gr_cog/le.ep.mc.d260:lemcLI.Epistle.version
