ltx/gr_gr_cog/me.m04.d23:meDA.commemoration.first	Μνήμη τοῦ Ἁγίου Μεγαλομάρτυρος Γεωργίου
ltx/gr_gr_cog/me.m04.d23:meDA.commemoration.first_name	Ἅγιος Γεώργιος
ltx/gr_gr_cog/me.m04.d23:meDA.commemoration.first_short	Μνήμη τοῦ Ἁγίου Μεγαλομάρτυρος Γεωργίου
ltx/gr_gr_cog/me.m04.d23:meDA.commemoration.first_title	Τοῦ Ἁγίου Γεωργίου.
ltx/gr_gr_cog/me.m04.d23:meDA.commemoration.full	Μνήμη τοῦ Ἁγίου ἐνδόξου Μεγαλομάρτυρος Γεωργίου τοῦ Τροπαιοφόρου.
ltx/gr_gr_cog/me.m04.d23:meDA.commemoration.second_name	
ltx/gr_gr_cog/me.m04.d23:meDA.commemoration.second_title	
ltx/gr_gr_cog/me.m04.d23:meDA.date	Τῌ ΚΓʹ ΑΠΡΙΛΙΟΥ
ltx/gr_gr_cog/me.m04.d23:meDA.fordate	διὰ τὴν 23ην Ἀπριλίου
ltx/gr_gr_cog/me.m04.d23:meDA.insert1	καὶ τοῦ Ἁγίου ἐνδόξου Μεγαλομάρτυρος Γεωργίου τοῦ Τροπαιοφόρου,
ltx/gr_gr_cog/me.m04.d23:meDA.insert2	οὗ καὶ τὴν μνήμην ἐπιτελοῦμεν·
ltx/gr_gr_cog/me.m04.d23:meDA.note	
ltx/gr_gr_cog/me.m04.d23:meDA.pdfcoverdate	τῆς 23ης Ἀπριλίου,
ltx/gr_gr_cog/me.m04.d23:meDA.pdfheaderdate	τῆς 23ης Ἀπριλίου
ltx/gr_gr_cog/me.m04.d23:meHO.commemorations	
ltx/gr_gr_cog/me.m04.d23:meHO.note1	@ltx/gr_gr_cog/rubrical:ru.HolidayWineOil
ltx/gr_gr_cog/me.m04.d23:meHO.note2	
ltx/gr_gr_cog/me.m04.d23:meHO.number	
ltx/gr_gr_cog/me.m04.d23:meHO.rank	
ltx/gr_gr_cog/me.m04.d23:meLE.commemoration1	Μνήμη τοῦ Ἁγίου ἐνδόξου Μεγαλομάρτυρος Γεωργίου τοῦ Τροπαιοφόρου.
ltx/gr_gr_cog/me.m04.d23:meLE.commemoration2	
ltx/gr_gr_cog/me.m04.d23:meLI.Kontakion1.greekmelody	@ltx/gr_gr_cog/me.m04.d23:meMA.Kontakion1.greekmelody
ltx/gr_gr_cog/me.m04.d23:meLI.Kontakion1.incipit	@ltx/gr_gr_cog/me.m04.d23:meMA.Kontakion1.incipit
ltx/gr_gr_cog/me.m04.d23:meLI.Kontakion1.melody	@ltx/gr_gr_cog/me.m04.d23:meMA.Kontakion1.melody
ltx/gr_gr_cog/me.m04.d23:meLI.Kontakion1.mode	@ltx/gr_gr_cog/me.m04.d23:meMA.Kontakion1.mode
ltx/gr_gr_cog/me.m04.d23:meLI.Kontakion1.text	@ltx/gr_gr_cog/me.m04.d23:meMA.Kontakion1.text
ltx/gr_gr_cog/me.m04.d23:meLI.MM.CommunionHymn.text	@ltx/gr_gr_cog/properties:media.key
ltx/gr_gr_cog/me.m04.d23:meLI.Megalynarion.text	Μέγας ἐν ἀθλήσει ἀναδειχθείς, ὡς τροπαιοφόρος, καὶ ἐν θαύμασιν εὐκλεής, μέγας ἀντιλήπτωρ, τῆς Ἐκκλησίας ὤφθης, Γεώργιε παμμάκαρ, Μαρύρων καύχημα.
ltx/gr_gr_cog/me.m04.d23:meMA.C1.acrostic.notice1	οὗ ἡ Ἀκροστιχίς·
ltx/gr_gr_cog/me.m04.d23:meMA.C1.acrostic.text	Ὑμνῶ σε Γεώργιε Δαυῒδ ἐκ πόθου· δεῖ γὰρ δή.
ltx/gr_gr_cog/me.m04.d23:meMA.C1.acrostic.title	Κανὼν πρῶτος τοῦ Ἁγίου,
ltx/gr_gr_cog/me.m04.d23:meMA.C1.title	@ltx/gr_gr_cog/titles:ti.Canon1SaintM
ltx/gr_gr_cog/me.m04.d23:meMA.C1.verse	@ltx/gr_gr_cog/prayers:pr.verse_SaintM.text
ltx/gr_gr_cog/me.m04.d23:meMA.C2.acrostic.notice1	οὗ ἡ Ἀκροστιχίς·
ltx/gr_gr_cog/me.m04.d23:meMA.C2.acrostic.text	Θερμὸς πέφυκας Μάρτυς ὄντως προστάτης.
ltx/gr_gr_cog/me.m04.d23:meMA.C2.acrostic.title	Ἕτερος Κανὼν τοῦ Ἁγίου,
ltx/gr_gr_cog/me.m04.d23:meMA.C2.poet	@ltx/gr_gr_cog/poets:po.Theofanous
ltx/gr_gr_cog/me.m04.d23:meMA.C2.title	@ltx/gr_gr_cog/titles:ti.Canon2SaintM
ltx/gr_gr_cog/me.m04.d23:meMA.C2.verse	@ltx/gr_gr_cog/prayers:pr.verse_SaintM.text
ltx/gr_gr_cog/me.m04.d23:meMA.Exaposteilarion1.greekmelody	@ltx/gr_gr_cog/he.a.m2:heAU.ToisMathitaisSynelthomen.greekname
ltx/gr_gr_cog/me.m04.d23:meMA.Exaposteilarion1.incipit	Ἔαρ ἡμῖν ἐξέλαμψεν, ἡ λαμπρὰ…
ltx/gr_gr_cog/me.m04.d23:meMA.Exaposteilarion1.melody	@ltx/gr_gr_cog/he.a.m2:heAU.ToisMathitaisSynelthomen.name
ltx/gr_gr_cog/me.m04.d23:meMA.Exaposteilarion1.mode	@ltx/gr_gr_cog/miscellanea:misc.Mode2
ltx/gr_gr_cog/me.m04.d23:meMA.Exaposteilarion1.text	Ἔαρ ἡμῖν ἐξέλαμψεν, ἡ λαμπρὰ τοῦ Δεσπότου, καὶ θεία ἐξανάστασις, πρὸς οὐράνιον Πάσχα, ἐκ γῆς ἡμᾶς παραπέμπον, ταύτῃ δὲ συνεκλάμπει, τοῦ πανενδόξου Μάρτυρος, Γεωργίου ἡ μνήμη, ἡ φωταυγής, ἣν φαιδρῶς τελέσωμεν, ἵνα θείας, ἀξιωθῶμεν χάριτος, πρὸς Χριστοῦ τοῦ Σωτῆρος.
ltx/gr_gr_cog/me.m04.d23:meMA.Kathisma11.greekmelody	@ltx/gr_gr_cog/he.a.m1:heAU.TonTafonSouSotir.greekname
ltx/gr_gr_cog/me.m04.d23:meMA.Kathisma11.incipit	Ἀνέτειλεν ἰδού, τὸ τῆς χάριτος…
ltx/gr_gr_cog/me.m04.d23:meMA.Kathisma11.melody	@ltx/gr_gr_cog/he.a.m1:heAU.TonTafonSouSotir.name
ltx/gr_gr_cog/me.m04.d23:meMA.Kathisma11.mode	@ltx/gr_gr_cog/miscellanea:misc.Mode1
ltx/gr_gr_cog/me.m04.d23:meMA.Kathisma11.text	Ἀνέτειλεν ἰδού, τὸ τῆς χάριτος ἔαρ, ἐπέλαμψε Χριστοῦ, ἡ Ἀνάστασις πᾶσι, καὶ ταύτῃ συνεκλάμπει νῦν, Γεωργίου τοῦ Μάρτυρος, ἡ πανέορτος, καὶ φωτοφόρος ἡμέρα, δεῦτε ἅπαντες, λαμπροφοροῦντες ἐνθέως, φαιδρῶς ἑορτάσωμεν.
ltx/gr_gr_cog/me.m04.d23:meMA.Kathisma21.greekmelody	@ltx/gr_gr_cog/he.a.m3:heAU.TheiasPisteos.greekname
ltx/gr_gr_cog/me.m04.d23:meMA.Kathisma21.incipit	Πόθῳ ζέοντι, τῷ τοῦ Δεσπότου…
ltx/gr_gr_cog/me.m04.d23:meMA.Kathisma21.melody	@ltx/gr_gr_cog/he.a.m3:heAU.TheiasPisteos.name
ltx/gr_gr_cog/me.m04.d23:meMA.Kathisma21.mode	@ltx/gr_gr_cog/miscellanea:misc.Mode3
ltx/gr_gr_cog/me.m04.d23:meMA.Kathisma21.text	Πόθῳ ζέοντι, τῷ τοῦ Δεσπότου, πυρπολούμενος, ἀνδρειοφρόνως, τὰ τῆς πλάνης ταμεῖα κατέβαλες, καὶ ἐν σταδίῳ Χριστὸν ὡμολόγησας, τροπαιοφόρε παμμάκαρ Γεώργιε, Μάρτυς ἔνδοξε, Χριστὸν τὸν Θεὸν ἱκέτευε, δωρήσασθαι ἡμῖν τὸ μέγα ἔλεος.
ltx/gr_gr_cog/me.m04.d23:meMA.Kathisma31.greekmelody	@ltx/gr_gr_cog/he.a.m4:heAU.KateplagiIosif.greekname
ltx/gr_gr_cog/me.m04.d23:meMA.Kathisma31.incipit	Γεωργήσας ἐμμελῶς, σπόρον τῶν θείων…
ltx/gr_gr_cog/me.m04.d23:meMA.Kathisma31.melody	@ltx/gr_gr_cog/he.a.m4:heAU.KateplagiIosif.name
ltx/gr_gr_cog/me.m04.d23:meMA.Kathisma31.mode	@ltx/gr_gr_cog/miscellanea:misc.Mode4
ltx/gr_gr_cog/me.m04.d23:meMA.Kathisma31.text	Γεωργήσας ἐμμελῶς, σπόρον τῶν θείων ἐντολῶν, διεσκόρπισας πτωχοῖς, πάντα τὸν πλοῦτον εὐσεβῶς, ἀντικτησάμενος ἔνδοξε Χριστοῦ τὴν δόξαν· ὅθεν πεποιθώς, πρός ἀγῶνας χωρεῖς, καὶ πόνους τοὺς μακρούς, Μάρτυς Γεώργιε, καὶ κοινωνὸς γενόμενος τοῦ πάθους, τοῦ ἀπαθοῦς καὶ ἐγέρσεως, τῆς βασιλείας, αὐτοῦ μετέσχες, ὑπέρ ἡμῶν νῦν δεόμενος.
ltx/gr_gr_cog/me.m04.d23:meMA.Kontakion1.greekmelody	@ltx/gr_gr_cog/he.a.m4:heAU.OYpsotheisEnToStavro.greekname
ltx/gr_gr_cog/me.m04.d23:meMA.Kontakion1.incipit	Γεωργηθεὶς ὑπὸ Θεοῦ ἀνεδείχθης, τῆς…
ltx/gr_gr_cog/me.m04.d23:meMA.Kontakion1.melody	@ltx/gr_gr_cog/he.a.m4:heAU.OYpsotheisEnToStavro.name
ltx/gr_gr_cog/me.m04.d23:meMA.Kontakion1.mode	@ltx/gr_gr_cog/miscellanea:misc.Mode4
ltx/gr_gr_cog/me.m04.d23:meMA.Kontakion1.text	Γεωργηθεὶς ὑπὸ Θεοῦ ἀνεδείχθης, τῆς εὐσεβείας γεωργὸς τιμιώτατος, τῶν ἀρετῶν τὰ δράγματα συλλέξας σεαυτῷ· σπείρας γὰρ ἐν δάκρυσιν, εὐφροσύνῃ θερίζεις· ἀθλήσας δὲ διʼ αἵματος, τὸν Χριστὸν ἐκομίσω, καὶ ταῖς πρεσβείαις Ἅγιε ταῖς σαῖς, πᾶσι παρέχεις πταισμάτων συγχώρησιν.
ltx/gr_gr_cog/me.m04.d23:meMA.Lauds1.greekmelody	@ltx/gr_gr_cog/he.a.m2:heAU.OteEkTouXylou.greekname
ltx/gr_gr_cog/me.m04.d23:meMA.Lauds1.incipit	Δεῦτε, τὴν πανέορτον φαιδράν, ἔνδοξον…
ltx/gr_gr_cog/me.m04.d23:meMA.Lauds1.melody	@ltx/gr_gr_cog/he.a.m2:heAU.OteEkTouXylou.name
ltx/gr_gr_cog/me.m04.d23:meMA.Lauds1.mode	@ltx/gr_gr_cog/miscellanea:misc.Mode2
ltx/gr_gr_cog/me.m04.d23:meMA.Lauds1.text	Δεῦτε, τὴν πανέορτον φαιδράν, ἔνδοξον Ἀνάστασιν πάντες, πανηγυρίσαντες, πάλιν ἑορτάσωμεν, φαιδρὰν πανήγυριν, Γεωργίου τοῦ Μάρτυρος, καὶ στέψωμεν τοῦτον, ἐαρινοὶς ἄνθεσιν, ὄντα ἀήττητον, ὅπως ταῖς αὐτοῦ ἱκεσίαις, λάβωμεν τῶν θλίψεων ἅμα, καὶ πλημμελημάτων ἀπολύτρωσιν.
ltx/gr_gr_cog/me.m04.d23:meMA.Lauds2.incipit	Ὅλον, προσενήνοχας σαυτόν, τῷ σοὶ…
ltx/gr_gr_cog/me.m04.d23:meMA.Lauds2.melody	@ltx/gr_gr_cog/he.a.m2:heAU.OteEkTouXylou.name
ltx/gr_gr_cog/me.m04.d23:meMA.Lauds2.mode	@ltx/gr_gr_cog/miscellanea:misc.Mode2
ltx/gr_gr_cog/me.m04.d23:meMA.Lauds2.text	Ὅλον, προσενήνοχας σαυτόν, τῷ σοὶ δεδωκότι παμμάκαρ, ζωὴν ὁλόκληρον, ὥσπερ ὁλοκάρπωσιν, ζῶσαν καὶ ἔμψυχον, καὶ θυσίαν εὐπρόσδεκτον, καὶ καθαρωτάτην· ὅθεν ἐχρημάτισας, πρέσβυς θερμότατος, ζάλης ἐξαιρούμενος πάντας, πίστει τοὺς ὑμνοῦντάς σε Μάρτυς, καὶ προσκαλουμένους σε Γεώργιε.
ltx/gr_gr_cog/me.m04.d23:meMA.Lauds3.incipit	Σπόρον, γεωργήσας ἐμμελῶς, τὸν καταβληθέντα…
ltx/gr_gr_cog/me.m04.d23:meMA.Lauds3.melody	@ltx/gr_gr_cog/he.a.m2:heAU.OteEkTouXylou.name
ltx/gr_gr_cog/me.m04.d23:meMA.Lauds3.mode	@ltx/gr_gr_cog/miscellanea:misc.Mode2
ltx/gr_gr_cog/me.m04.d23:meMA.Lauds3.text	Σπόρον, γεωργήσας ἐμμελῶς, τὸν καταβληθέντα τοῦ λόγου, τῇ καθαρᾷ σου ψυχῇ, τοῦτον ἐπλεόνασας, πόνοις ἀθλήσεως, καὶ σοφῶς ἀποθέμενος, ἐν ἐπουρανίαις, θήκαις τὴν ἀκήρατον, εὗρες ἀπόλαυσιν, ἧς νῦν, ἐμφορούμενος Μάκαρ, ταῖς πρὸς τὸν Θεόν σου πρεσβείαις, τοὺς πιστῶς ὑμνοῦντάς σε περίσῳζε.
ltx/gr_gr_cog/me.m04.d23:meMA.Lauds4.greekmelody	@ltx/gr_gr_cog/he.a.m2:heAU.OteEkTouXylou.greekname
ltx/gr_gr_cog/me.m04.d23:meMA.Lauds4.incipit	Μάρτυς, ἀθλοφόρε τοῦ Χριστοῦ, τοὺς…
ltx/gr_gr_cog/me.m04.d23:meMA.Lauds4.melody	@ltx/gr_gr_cog/he.a.m2:heAU.OteEkTouXylou.name
ltx/gr_gr_cog/me.m04.d23:meMA.Lauds4.mode	@ltx/gr_gr_cog/miscellanea:misc.Mode2
ltx/gr_gr_cog/me.m04.d23:meMA.Lauds4.text	Μάρτυς, ἀθλοφόρε τοῦ Χριστοῦ, τοὺς ἐν διαφόροις ἀνάγκαις, σῷζε πρεσβείαις σου, πάσης περιστάσεως, ἀπολυτρούμενος, καὶ διώκων ψυχόλεθρον, δεινὴν ἀθυμίαν, χάριν δὲ καὶ ἔλεος, ἡμῖν αἰτούμενος, ὅπως, ταῖς λιταῖς σου σωθέντες, χαίροντες γεραίρωμεν πάντες, τοὺς σεπτοὺς ἀγῶνάς σου Γεώργιε.
ltx/gr_gr_cog/me.m04.d23:meMA.LaudsGlory.incipit	Ἀνέτειλε τὸ ἔαρ, δεῦτε εὐωχηθῶμεν…
ltx/gr_gr_cog/me.m04.d23:meMA.LaudsGlory.melody	
ltx/gr_gr_cog/me.m04.d23:meMA.LaudsGlory.mode	@ltx/gr_gr_cog/miscellanea:misc.Mode5
ltx/gr_gr_cog/me.m04.d23:meMA.LaudsGlory.poet	@ltx/gr_gr_cog/poets:po.Theofanous
ltx/gr_gr_cog/me.m04.d23:meMA.LaudsGlory.text	Ἀνέτειλε τὸ ἔαρ, δεῦτε εὐωχηθῶμεν, ἐξέλαμψεν ἡ Ἀνάστασις Χριστοῦ, δεῦτε εὐφρανθῶμεν ἡ τοῦ Ἀθλοφόρου μνήμη, τοὺς πιστοὺς φαιδρύνουσα ἀνεδείχθη· διὸ φιλέορτοι, δεῦτε μυστικῶς αὐτὴν πανηγυρίσωμεν· οὗτος γὰρ ὡς καλὸς στρατιώτης, ἠνδρίσατο κατὰ τῶν τυράννων, καὶ τούτους κατῄσχυνε, μιμητὴς γενόμενος τοῦ πάθους τοῦ Σωτῆρος Χριστοῦ, οὐκ ἠλέησε τὸ σκεῦος τὸ πήλινον τὸ ἑαυτοῦ, ἀλλὰ γυμνὸν ἀνεχάλκευσεν, ἐν βασάνοις αὐτὸ προσαμειβόμενος, αὐτῷ βοήσωμεν· Ἀθλοφόρε ἱκέτευε, εἰς τὸ σωθῆναι τὰς ψυχὰς ἡμῶν.
ltx/gr_gr_cog/me.m04.d23:meMA.MM.Lauds1234as5678.text	@ltx/gr_gr_cog/properties:media.key
ltx/gr_gr_cog/me.m04.d23:meMA.MM.Lauds123as456.text	@ltx/gr_gr_cog/properties:media.key
ltx/gr_gr_cog/me.m04.d23:meMA.MM.PostGospelIdiomelon.text	@ltx/gr_gr_cog/properties:media.key
ltx/gr_gr_cog/me.m04.d23:meMA.Ode1C11.greekmelody	@ltx/gr_gr_cog/he.h.m1:heHE.AnastaseosImera.greekname
ltx/gr_gr_cog/me.m04.d23:meMA.Ode1C11.incipit	Ὑπὲρ ἥλιον ἐξήστραψεν ἡ μνήμη…
ltx/gr_gr_cog/me.m04.d23:meMA.Ode1C11.melody	@ltx/gr_gr_cog/he.h.m1:heHE.AnastaseosImera.name
ltx/gr_gr_cog/me.m04.d23:meMA.Ode1C11.mode	@ltx/gr_gr_cog/miscellanea:misc.Mode1
ltx/gr_gr_cog/me.m04.d23:meMA.Ode1C11.ode	@ltx/gr_gr_cog/miscellanea:misc.Ode1
ltx/gr_gr_cog/me.m04.d23:meMA.Ode1C11.text	Ὑπὲρ ἥλιον ἐξήστραψεν ἡ μνήμη σου νῦν, Μάρτυς Χριστοῦ ὁπλῖτα· τὰς γὰρ ἀκτῖνας παμφαεῖς, τῶν θαυμάτων τὰς αὐγάς, εἰς πᾶσαν τὴν γῆν, λαμπρῶς ἐξεδίσκευσε, φωτοφόρε Γεώργιε.
ltx/gr_gr_cog/me.m04.d23:meMA.Ode1C12.incipit	Μονομάχε μυριόνικε Χριστοῦ Ἀθλητά, δὸς…
ltx/gr_gr_cog/me.m04.d23:meMA.Ode1C12.melody	@ltx/gr_gr_cog/he.h.m1:heHE.AnastaseosImera.name
ltx/gr_gr_cog/me.m04.d23:meMA.Ode1C12.mode	@ltx/gr_gr_cog/miscellanea:misc.Mode1
ltx/gr_gr_cog/me.m04.d23:meMA.Ode1C12.ode	@ltx/gr_gr_cog/miscellanea:misc.Ode1
ltx/gr_gr_cog/me.m04.d23:meMA.Ode1C12.text	Μονομάχε μυριόνικε Χριστοῦ Ἀθλητά, δός μοι τοὺς ἄθλους μέλψαι, καὶ ἀγωνίσματα τὰ σά, ἅπερ ἔτλης ἀνδρικῶς, τῷ πόθῳ Χριστοῦ, σοφὲ ἐκπυρούμενος, ᾧ καὶ ἔζης γηθόμενος.
ltx/gr_gr_cog/me.m04.d23:meMA.Ode1C13.incipit	Νέος ὤφθης ἐν πολέμοις ἱκανὸς…
ltx/gr_gr_cog/me.m04.d23:meMA.Ode1C13.melody	@ltx/gr_gr_cog/he.h.m1:heHE.AnastaseosImera.name
ltx/gr_gr_cog/me.m04.d23:meMA.Ode1C13.mode	@ltx/gr_gr_cog/miscellanea:misc.Mode1
ltx/gr_gr_cog/me.m04.d23:meMA.Ode1C13.ode	@ltx/gr_gr_cog/miscellanea:misc.Ode1
ltx/gr_gr_cog/me.m04.d23:meMA.Ode1C13.text	Νέος ὤφθης ἐν πολέμοις ἱκανὸς τῇ χειρί, ἄλλος Δαυῒδ ἀνδρεῖος· ὡς γὰρ αὐτὸς τὸν Γολιάθ, τὸν ἀντίπαλον καὶ σύ, νικᾷς καθελών, βολαῖς ταῖς τῶν λόγων σου, στεφανῖτα Γεώργιε.
ltx/gr_gr_cog/me.m04.d23:meMA.Ode1C1T.incipit	Ὡς ἀνέκφραστος ὡραῖος, φρικαλαῖος ὁ…
ltx/gr_gr_cog/me.m04.d23:meMA.Ode1C1T.melody	@ltx/gr_gr_cog/he.h.m1:heHE.AnastaseosImera.name
ltx/gr_gr_cog/me.m04.d23:meMA.Ode1C1T.mode	@ltx/gr_gr_cog/miscellanea:misc.Mode1
ltx/gr_gr_cog/me.m04.d23:meMA.Ode1C1T.ode	@ltx/gr_gr_cog/miscellanea:misc.Ode1
ltx/gr_gr_cog/me.m04.d23:meMA.Ode1C1T.text	Ὡς ἀνέκφραστος ὡραῖος, φρικαλαῖος ὁ σός, ξένος ὁ τόκος Κόρη· ὡς ὑπομάζιον καὶ γάρ, τὸν παντέλειον Θεόν, θηλάζεις σαρκί, παράδοξον ἄκουσμα, βρεφοτρόφε Μητράνανδρε.
ltx/gr_gr_cog/me.m04.d23:meMA.Ode1C21.greekmelody	@ltx/gr_gr_cog/he.h.m2:heHE.EnVythoKatestrose.greekname
ltx/gr_gr_cog/me.m04.d23:meMA.Ode1C21.incipit	Θερμοτάτῃ πίστει καὶ στοργῇ, τοὺς…
ltx/gr_gr_cog/me.m04.d23:meMA.Ode1C21.melody	@ltx/gr_gr_cog/he.h.m2:heHE.EnVythoKatestrose.name
ltx/gr_gr_cog/me.m04.d23:meMA.Ode1C21.mode	@ltx/gr_gr_cog/miscellanea:misc.Mode2
ltx/gr_gr_cog/me.m04.d23:meMA.Ode1C21.ode	@ltx/gr_gr_cog/miscellanea:misc.Ode1
ltx/gr_gr_cog/me.m04.d23:meMA.Ode1C21.text	Θερμοτάτῃ πίστει καὶ στοργῇ, τοὺς προσκαλουμένους σε, Μάρτυς Χριστοῦ στεφηφόρε Γεώργιε, παρεστὼς ὁλόφωτος, σεπτῷ βήματι, τοῦ τῶν ὅλων δεσπόζοντος, σοῦ ταῖς ἱκεσίαις, καὶ ταῖς προστασίαις διαφύλαξον.
ltx/gr_gr_cog/me.m04.d23:meMA.Ode1C22.incipit	Εὐγενὲς γεώργιον Θεοῦ, γέγονας Γεώργιε…
ltx/gr_gr_cog/me.m04.d23:meMA.Ode1C22.melody	@ltx/gr_gr_cog/he.h.m2:heHE.EnVythoKatestrose.name
ltx/gr_gr_cog/me.m04.d23:meMA.Ode1C22.mode	@ltx/gr_gr_cog/miscellanea:misc.Mode2
ltx/gr_gr_cog/me.m04.d23:meMA.Ode1C22.ode	@ltx/gr_gr_cog/miscellanea:misc.Ode1
ltx/gr_gr_cog/me.m04.d23:meMA.Ode1C22.text	Εὐγενὲς γεώργιον Θεοῦ, γέγονας Γεώργιε, μαρτυρικαῖς γεωργούμενον πράξεσι, καὶ ὡς πλοῦτον ἔμψυχον, οὐρανίοις σε, θησαυροῖς ἐναπέθετο, ὁ ἀγωνοθέτης, ὡς διαφερόντως ἀριστεύσαντα.
ltx/gr_gr_cog/me.m04.d23:meMA.Ode1C23.incipit	Ῥωμαλέως καὶ καρτερικῶς, ὥρμησας αὐτόκλητος…
ltx/gr_gr_cog/me.m04.d23:meMA.Ode1C23.melody	@ltx/gr_gr_cog/he.h.m2:heHE.EnVythoKatestrose.name
ltx/gr_gr_cog/me.m04.d23:meMA.Ode1C23.mode	@ltx/gr_gr_cog/miscellanea:misc.Mode2
ltx/gr_gr_cog/me.m04.d23:meMA.Ode1C23.ode	@ltx/gr_gr_cog/miscellanea:misc.Ode1
ltx/gr_gr_cog/me.m04.d23:meMA.Ode1C23.text	Ῥωμαλέως καὶ καρτερικῶς, ὥρμησας αὐτόκλητος, πρὸς τοὺς ἀγῶνας παμμάκαρ Γεώργιε, καὶ καταστρεψάμενος, τὴν ἀτίθασον τῶν τυράννων παράταξιν, πρέσβυς ὑπὲρ πάντων, τῶν προσκαλουμένων σε γεγένησαι.
ltx/gr_gr_cog/me.m04.d23:meMA.Ode1C24.incipit	Μακαρίας ἔνδοξε ζωῆς, νῦν ἐπιλαβόμενος…
ltx/gr_gr_cog/me.m04.d23:meMA.Ode1C24.melody	@ltx/gr_gr_cog/he.h.m2:heHE.EnVythoKatestrose.name
ltx/gr_gr_cog/me.m04.d23:meMA.Ode1C24.mode	@ltx/gr_gr_cog/miscellanea:misc.Mode2
ltx/gr_gr_cog/me.m04.d23:meMA.Ode1C24.ode	@ltx/gr_gr_cog/miscellanea:misc.Ode1
ltx/gr_gr_cog/me.m04.d23:meMA.Ode1C24.text	Μακαρίας ἔνδοξε ζωῆς, νῦν ἐπιλαβόμενος, τῆς ἐν Χριστῷ κρυπτομένης Γεώργιε, ὑπὲρ ἧς ἠγώνισαι, μέχρις αἵματος, τοὺς ἐν πίστει ὑμνοῦντάς σε, αἴτησαι σωθῆναι, πάσης ἀθλοφόρε περιστάσεως.
ltx/gr_gr_cog/me.m04.d23:meMA.Ode1C2H.greekmelody	@ltx/gr_gr_cog/he.h.m2:heHE.EnVythoKatestrose.greekname
ltx/gr_gr_cog/me.m04.d23:meMA.Ode1C2H.incipit	@ltx/gr_gr_cog/he.h.m2:heHE.EnVythoKatestrose.incipit
ltx/gr_gr_cog/me.m04.d23:meMA.Ode1C2H.melody	@ltx/gr_gr_cog/he.h.m2:heHE.EnVythoKatestrose.melody
ltx/gr_gr_cog/me.m04.d23:meMA.Ode1C2H.mode	@ltx/gr_gr_cog/miscellanea:misc.Mode2
ltx/gr_gr_cog/me.m04.d23:meMA.Ode1C2H.ode	@ltx/gr_gr_cog/miscellanea:misc.Ode1
ltx/gr_gr_cog/me.m04.d23:meMA.Ode1C2H.text	@ltx/gr_gr_cog/he.h.m2:heHE.EnVythoKatestrose.text
ltx/gr_gr_cog/me.m04.d23:meMA.Ode1C2T.incipit	Οὐρανὸς ἐγένου λογικός, Λόγον τὸν…
ltx/gr_gr_cog/me.m04.d23:meMA.Ode1C2T.melody	@ltx/gr_gr_cog/he.h.m2:heHE.EnVythoKatestrose.name
ltx/gr_gr_cog/me.m04.d23:meMA.Ode1C2T.mode	@ltx/gr_gr_cog/miscellanea:misc.Mode2
ltx/gr_gr_cog/me.m04.d23:meMA.Ode1C2T.ode	@ltx/gr_gr_cog/miscellanea:misc.Ode1
ltx/gr_gr_cog/me.m04.d23:meMA.Ode1C2T.text	Οὐρανὸς ἐγένου λογικός, Λόγον τὸν οὐράνιον, τῇ σῇ γαστρὶ Θεομῆτορ χωρήσασα, διʼ οὗ πάντα γέγονεν, οὐρανός τε καὶ γῆ, καὶ τὰ τούτων ἐπέκεινα· ὅθεν παῤῥησίᾳ, πρέσβευε σωθῆναι τοὺς ὑμνοῦντάς σε.
ltx/gr_gr_cog/me.m04.d23:meMA.Ode3C11.greekmelody	@ltx/gr_gr_cog/he.h.m1:heHE.DeftePomaPiomen.greekname
ltx/gr_gr_cog/me.m04.d23:meMA.Ode3C11.incipit	Σύνδρομος ἐξέλαμψεν ἡμῖν, ἡ πανένδοξος…
ltx/gr_gr_cog/me.m04.d23:meMA.Ode3C11.melody	@ltx/gr_gr_cog/he.h.m1:heHE.DeftePomaPiomen.name
ltx/gr_gr_cog/me.m04.d23:meMA.Ode3C11.mode	@ltx/gr_gr_cog/miscellanea:misc.Mode1
ltx/gr_gr_cog/me.m04.d23:meMA.Ode3C11.ode	@ltx/gr_gr_cog/miscellanea:misc.Ode3
ltx/gr_gr_cog/me.m04.d23:meMA.Ode3C11.text	Σύνδρομος ἐξέλαμψεν ἡμῖν, ἡ πανένδοξος μνήμη ἡ τοῦ θεράποντος, τῇ Ἀναστάσει Χριστοῦ, ἐν ᾗ συνελθόντες οἱ πιστοί, φαιδρῶς ἑορτάσωμεν.
ltx/gr_gr_cog/me.m04.d23:meMA.Ode3C12.incipit	Εὐφράνθητε γῆ καὶ οὐρανοί, τά…
ltx/gr_gr_cog/me.m04.d23:meMA.Ode3C12.melody	@ltx/gr_gr_cog/he.h.m1:heHE.DeftePomaPiomen.name
ltx/gr_gr_cog/me.m04.d23:meMA.Ode3C12.mode	@ltx/gr_gr_cog/miscellanea:misc.Mode1
ltx/gr_gr_cog/me.m04.d23:meMA.Ode3C12.ode	@ltx/gr_gr_cog/miscellanea:misc.Ode3
ltx/gr_gr_cog/me.m04.d23:meMA.Ode3C12.text	Εὐφράνθητε γῆ καὶ οὐρανοί, τά τε ὄρη καὶ πάντες βουνοὶ σκιρτήσατε· ῥεῖθρα θαυμάτων καὶ γάρ, ὑψόθεν ἡμῖν ὀμβροβλυτεῖ, ὁ Μάρτυς Γεώργιος.
ltx/gr_gr_cog/me.m04.d23:meMA.Ode3C13.incipit	Γῆ πᾶσα καὶ βρότειος φυλή…
ltx/gr_gr_cog/me.m04.d23:meMA.Ode3C13.melody	@ltx/gr_gr_cog/he.h.m1:heHE.DeftePomaPiomen.name
ltx/gr_gr_cog/me.m04.d23:meMA.Ode3C13.mode	@ltx/gr_gr_cog/miscellanea:misc.Mode1
ltx/gr_gr_cog/me.m04.d23:meMA.Ode3C13.ode	@ltx/gr_gr_cog/miscellanea:misc.Ode3
ltx/gr_gr_cog/me.m04.d23:meMA.Ode3C13.text	Γῆ πᾶσα καὶ βρότειος φυλή, οὐρανός τε συγχαίρει, στρατὸς Ἀγγέλων τε· ὁ πρωτοστράτηγος γάρ, Χριστοῦ νῦν Γεώργιος ἐκ γῆς, βαίνει πρὸς οὐράνια.
ltx/gr_gr_cog/me.m04.d23:meMA.Ode3C1T.incipit	Εὐφράνθητι, τέρπνου Μαριάμ· εἰ καὶ…
ltx/gr_gr_cog/me.m04.d23:meMA.Ode3C1T.melody	@ltx/gr_gr_cog/he.h.m1:heHE.DeftePomaPiomen.name
ltx/gr_gr_cog/me.m04.d23:meMA.Ode3C1T.mode	@ltx/gr_gr_cog/miscellanea:misc.Mode1
ltx/gr_gr_cog/me.m04.d23:meMA.Ode3C1T.ode	@ltx/gr_gr_cog/miscellanea:misc.Ode3
ltx/gr_gr_cog/me.m04.d23:meMA.Ode3C1T.text	Εὐφράνθητι, τέρπνου Μαριάμ· εἰ καὶ χθὲς ὡς ῥομφαία γὰρ τὴν καρδίαν σου, ὁ τοῦ Υἱοῦ σου Σταυρὸς διῆλθεν, ἀλλʼ οὖν ὡς ἐκ παστοῦ, τοῦ τάφου ἀνέτειλεν.
ltx/gr_gr_cog/me.m04.d23:meMA.Ode3C21.greekmelody	@ltx/gr_gr_cog/he.h.m2:heHE.ExinthisenIErimos.greekname
ltx/gr_gr_cog/me.m04.d23:meMA.Ode3C21.incipit	Στεφάνῳ τῆς ἀθλήσεως, διαλάμπων Ἔνδοξε…
ltx/gr_gr_cog/me.m04.d23:meMA.Ode3C21.melody	@ltx/gr_gr_cog/he.h.m2:heHE.ExinthisenIErimos.name
ltx/gr_gr_cog/me.m04.d23:meMA.Ode3C21.mode	@ltx/gr_gr_cog/miscellanea:misc.Mode2
ltx/gr_gr_cog/me.m04.d23:meMA.Ode3C21.ode	@ltx/gr_gr_cog/miscellanea:misc.Ode3
ltx/gr_gr_cog/me.m04.d23:meMA.Ode3C21.text	Στεφάνῳ τῆς ἀθλήσεως, διαλάμπων Ἔνδοξε, τοὺς εὐσεβῶς καλοῦντάς σε, λιτανεύων τῷ λυτρωτῇ καὶ Θεῷ, ἀπὸ πάσης ἀνάγκης μάκαρ λύτρωσαι.
ltx/gr_gr_cog/me.m04.d23:meMA.Ode3C22.incipit	Πλουσίαις φωτιζόμενος, λαμπηδόσι Πάνσοφε, τὴν…
ltx/gr_gr_cog/me.m04.d23:meMA.Ode3C22.melody	@ltx/gr_gr_cog/he.h.m2:heHE.ExinthisenIErimos.name
ltx/gr_gr_cog/me.m04.d23:meMA.Ode3C22.mode	@ltx/gr_gr_cog/miscellanea:misc.Mode2
ltx/gr_gr_cog/me.m04.d23:meMA.Ode3C22.ode	@ltx/gr_gr_cog/miscellanea:misc.Ode3
ltx/gr_gr_cog/me.m04.d23:meMA.Ode3C22.text	Πλουσίαις φωτιζόμενος, λαμπηδόσι Πάνσοφε, τὴν ζοφερὰν ἀπέλασον, ἀθυμίαν καὶ τὴν ἀχλὺν τῶν παθῶν, ἀφʼ ἡμῶν τῶν ἐν πίστει εὐφημούντων σε.
ltx/gr_gr_cog/me.m04.d23:meMA.Ode3C23.incipit	Ἐλπίδι στηριζόμενος, καὶ ἀγάπῃ πίστει…
ltx/gr_gr_cog/me.m04.d23:meMA.Ode3C23.melody	@ltx/gr_gr_cog/he.h.m2:heHE.ExinthisenIErimos.name
ltx/gr_gr_cog/me.m04.d23:meMA.Ode3C23.mode	@ltx/gr_gr_cog/miscellanea:misc.Mode2
ltx/gr_gr_cog/me.m04.d23:meMA.Ode3C23.ode	@ltx/gr_gr_cog/miscellanea:misc.Ode3
ltx/gr_gr_cog/me.m04.d23:meMA.Ode3C23.text	Ἐλπίδι στηριζόμενος, καὶ ἀγάπῃ πίστει τε, περιφραχθεὶς Γεώργιε, καὶ δυνάμει Χριστοῦ ῥωννύμενος, τῶν εἰδώλων τὴν πλάνην καταβέβληκας.
ltx/gr_gr_cog/me.m04.d23:meMA.Ode3C2H.greekmelody	@ltx/gr_gr_cog/he.h.m2:heHE.ExinthisenIErimos.greekname
ltx/gr_gr_cog/me.m04.d23:meMA.Ode3C2H.incipit	@ltx/gr_gr_cog/he.h.m2:heHE.ExinthisenIErimos.incipit
ltx/gr_gr_cog/me.m04.d23:meMA.Ode3C2H.melody	@ltx/gr_gr_cog/he.h.m2:heHE.ExinthisenIErimos.melody
ltx/gr_gr_cog/me.m04.d23:meMA.Ode3C2H.mode	@ltx/gr_gr_cog/miscellanea:misc.Mode2
ltx/gr_gr_cog/me.m04.d23:meMA.Ode3C2H.ode	@ltx/gr_gr_cog/miscellanea:misc.Ode3
ltx/gr_gr_cog/me.m04.d23:meMA.Ode3C2H.text	@ltx/gr_gr_cog/he.h.m2:heHE.ExinthisenIErimos.text
ltx/gr_gr_cog/me.m04.d23:meMA.Ode3C2T.incipit	Φωτίζοντα τὰ πέρατα, Παναγία τέτοκας…
ltx/gr_gr_cog/me.m04.d23:meMA.Ode3C2T.melody	@ltx/gr_gr_cog/he.h.m2:heHE.ExinthisenIErimos.name
ltx/gr_gr_cog/me.m04.d23:meMA.Ode3C2T.mode	@ltx/gr_gr_cog/miscellanea:misc.Mode2
ltx/gr_gr_cog/me.m04.d23:meMA.Ode3C2T.ode	@ltx/gr_gr_cog/miscellanea:misc.Ode3
ltx/gr_gr_cog/me.m04.d23:meMA.Ode3C2T.text	Φωτίζοντα τὰ πέρατα, Παναγία τέτοκας, μετὰ σαρκὸς τὸν ἄσαρκον, καὶ πρὸ πάντων Πατρὶ συνάναρχον, Θεοτόκον· διό σε πίστει σέβομεν.
ltx/gr_gr_cog/me.m04.d23:meMA.Ode3Kathisma1.greekmelody	@ltx/gr_gr_cog/he.a.m8:heAU.TinSofianKaiLogon.greekname
ltx/gr_gr_cog/me.m04.d23:meMA.Ode3Kathisma1.incipit	Εὐσεβείας τοῖς τρόποις ἀνδραγαθῶν, ἀσεβείας…
ltx/gr_gr_cog/me.m04.d23:meMA.Ode3Kathisma1.melody	@ltx/gr_gr_cog/he.a.m8:heAU.TinSofianKaiLogon.name
ltx/gr_gr_cog/me.m04.d23:meMA.Ode3Kathisma1.mode	@ltx/gr_gr_cog/miscellanea:misc.Mode8
ltx/gr_gr_cog/me.m04.d23:meMA.Ode3Kathisma1.text	Εὐσεβείας τοῖς τρόποις ἀνδραγαθῶν, ἀσεβείας τὴν πλάνην καταβαλών, Μάρτυς κατεπάτησας, τοῦ ἐχθροῦ τὰ φρυάγματα· τῷ γὰρ θείῳ ζήλῳ, τὸν νοῦν πυρπολούμενος, τῶν τυράννων ἔσβεσας, τὸ ἄθεον φρύαγμα· ὅθεν ἐπαξίως, ἀμοιβὴν τῶν βασάνων, ἐδέξω τὸν στέφανον, καὶ παρέχεις ἰάματα, ἀθλοφόρε Γεώργιε. Πρέσβευε Χριστῷ τῷ Θεῷ, τῶν πταισμάτων ἄφεσιν δωρήσασθαι, τοῖς ἑορτάζουσι πόθῳ, τὴν ἁγίαν μνήμην σου.
ltx/gr_gr_cog/me.m04.d23:meMA.Ode3Kathisma2.greekmelody	@ltx/gr_gr_cog/he.a.m8:heAU.TinSofianKaiLogon.greekname
ltx/gr_gr_cog/me.m04.d23:meMA.Ode3Kathisma2.incipit	Τὸν ἐπίγειον πλοῦτον τὸν ἐπὶ…
ltx/gr_gr_cog/me.m04.d23:meMA.Ode3Kathisma2.melody	@ltx/gr_gr_cog/he.a.m8:heAU.TinSofianKaiLogon.name
ltx/gr_gr_cog/me.m04.d23:meMA.Ode3Kathisma2.mode	@ltx/gr_gr_cog/miscellanea:misc.Mode8
ltx/gr_gr_cog/me.m04.d23:meMA.Ode3Kathisma2.text	Τὸν ἐπίγειον πλοῦτον τὸν ἐπὶ γῆς, διανέμων τοῖς πᾶσι Μάρτυς σοφέ, πλοῦτον τὸν οὐράνιον, ἐκληρώσω τοῖς πόνοις σου· τὸν γὰρ Σταυρὸν τόν, Ἄχραντον, ἐν σοὶ τεθωράκισαι, καὶ ἐν τούτῳ ᾔσχυνας, τυράννων τὸ φρύαγμα· ὅθεν τῇ πρεσβεία, τοῖς αἰτοῦσί σε νέμεις, τὰ θεῖα δωρήματα, ἰαμάτων χαρίσματα, ἀθλοφόρε Γεώργιε. Πρέσβευε Χριστῷ τῷ Θεῷ, τῶν πταισμάτων ἄφεσιν δωρήσασθαι, τοῖς ἑορτάζουσι πόθῳ, τὴν ἁγίαν μνήμην σου.
ltx/gr_gr_cog/me.m04.d23:meMA.Ode3KathismaSt.incipit	@ltx/gr_gr_cog/oc.m8.d4:ocMA.Kathisma13.incipit
ltx/gr_gr_cog/me.m04.d23:meMA.Ode3KathismaSt.melody	@ltx/gr_gr_cog/he.a.m8:heAU.TinSofianKaiLogon.name
ltx/gr_gr_cog/me.m04.d23:meMA.Ode3KathismaSt.mode	@ltx/gr_gr_cog/miscellanea:misc.Mode8
ltx/gr_gr_cog/me.m04.d23:meMA.Ode3KathismaSt.text	@ltx/gr_gr_cog/oc.m8.d4:ocMA.Kathisma13.text
ltx/gr_gr_cog/me.m04.d23:meMA.Ode3KathismaT.incipit	@ltx/gr_gr_cog/he.a.m8:heAU.TinSofianKaiLogon.incipit
ltx/gr_gr_cog/me.m04.d23:meMA.Ode3KathismaT.melody	@ltx/gr_gr_cog/he.a.m8:heAU.TinSofianKaiLogon.name
ltx/gr_gr_cog/me.m04.d23:meMA.Ode3KathismaT.mode	@ltx/gr_gr_cog/miscellanea:misc.Mode8
ltx/gr_gr_cog/me.m04.d23:meMA.Ode3KathismaT.text	@ltx/gr_gr_cog/he.a.m8:heAU.TinSofianKaiLogon.text
ltx/gr_gr_cog/me.m04.d23:meMA.Ode4C11.greekmelody	@ltx/gr_gr_cog/he.h.m1:heHE.EpiTisTheiasFylakis.greekname
ltx/gr_gr_cog/me.m04.d23:meMA.Ode4C11.incipit	Ὡς ὑπερήλασε τὴν πρίν, Νότου…
ltx/gr_gr_cog/me.m04.d23:meMA.Ode4C11.melody	@ltx/gr_gr_cog/he.h.m1:heHE.EpiTisTheiasFylakis.name
ltx/gr_gr_cog/me.m04.d23:meMA.Ode4C11.mode	@ltx/gr_gr_cog/miscellanea:misc.Mode1
ltx/gr_gr_cog/me.m04.d23:meMA.Ode4C11.ode	@ltx/gr_gr_cog/miscellanea:misc.Ode4
ltx/gr_gr_cog/me.m04.d23:meMA.Ode4C11.text	Ὡς ὑπερήλασε τὴν πρίν, Νότου βασίλισσαν σοφέ, νῦν ἡ βασιλίς, Ἀλεξάνδρα· εἰς τὴν σὴν γὰρ σύνεσιν, ἐκθαμβηθεῖσα ἔδραμεν· ὅθεν σοι συμπαρίστασαι Μάρτυς, ἐκ δεξιῶν τοῦ Θεοῦ ὥσπερ βασίλισσα.
ltx/gr_gr_cog/me.m04.d23:meMA.Ode4C12.incipit	Ῥημάτων σου οὐκ ἐνεγκών, τοὺς…
ltx/gr_gr_cog/me.m04.d23:meMA.Ode4C12.melody	@ltx/gr_gr_cog/he.h.m1:heHE.EpiTisTheiasFylakis.name
ltx/gr_gr_cog/me.m04.d23:meMA.Ode4C12.mode	@ltx/gr_gr_cog/miscellanea:misc.Mode1
ltx/gr_gr_cog/me.m04.d23:meMA.Ode4C12.ode	@ltx/gr_gr_cog/miscellanea:misc.Ode4
ltx/gr_gr_cog/me.m04.d23:meMA.Ode4C12.text	Ῥημάτων σου οὐκ ἐνεγκών, τοὺς ἐλεγμοὺς ὁ δυσσεβής, τύπτεσθαι κελεύει τὸ στόμα, φεῦ! τὸ σὸν Γεώργιε, τὸ δὲ καίτοι κρουόμενον, κύμβαλον ὡς ἀντήχει, κραυγάζον· Μόνος Θεὸς ἀψευδής, ὁ Χριστὸς ἐστιν.
ltx/gr_gr_cog/me.m04.d23:meMA.Ode4C13.incipit	Γνήσιε φίλε τοῦ Χριστοῦ, πρωταθλητάρχα…
ltx/gr_gr_cog/me.m04.d23:meMA.Ode4C13.melody	@ltx/gr_gr_cog/he.h.m1:heHE.EpiTisTheiasFylakis.name
ltx/gr_gr_cog/me.m04.d23:meMA.Ode4C13.mode	@ltx/gr_gr_cog/miscellanea:misc.Mode1
ltx/gr_gr_cog/me.m04.d23:meMA.Ode4C13.ode	@ltx/gr_gr_cog/miscellanea:misc.Ode4
ltx/gr_gr_cog/me.m04.d23:meMA.Ode4C13.text	Γνήσιε φίλε τοῦ Χριστοῦ, πρωταθλητάρχα τε αὐτοῦ, πάμφωτε λαμπτὴρ οἰκουμένης, ἀστὴρ φαεινότατε, λυχνία τιμαλφέστατε, ἄγρυπνε τῶν τιμώντων σε φύλαξ, φύλαττε ἡμᾶς, Μάρτυς Γεώργιε.
ltx/gr_gr_cog/me.m04.d23:meMA.Ode4C1T.incipit	Ἰδοὺ καὶ τέτοκας Ἁγνή, καὶ…
ltx/gr_gr_cog/me.m04.d23:meMA.Ode4C1T.melody	@ltx/gr_gr_cog/he.h.m1:heHE.EpiTisTheiasFylakis.name
ltx/gr_gr_cog/me.m04.d23:meMA.Ode4C1T.mode	@ltx/gr_gr_cog/miscellanea:misc.Mode1
ltx/gr_gr_cog/me.m04.d23:meMA.Ode4C1T.ode	@ltx/gr_gr_cog/miscellanea:misc.Ode4
ltx/gr_gr_cog/me.m04.d23:meMA.Ode4C1T.text	Ἰδοὺ καὶ τέτοκας Ἁγνή, καὶ παρθενεύεις ἐν ταυτῷ, θαῦμα πολυθαύμαστον ὄντως, φοβερὸν ξενήκουστον! Θεὸν γὰρ τὸν παντάνακτα, φέρουσα σαῖς ἀγκάλαις θηλάζεις, τὸν τροφοδότην Χριστὸν Κόρη νήπιον.
ltx/gr_gr_cog/me.m04.d23:meMA.Ode4C21.greekmelody	@ltx/gr_gr_cog/he.h.m2:heHE.ElilythasEkParthenou.greekname
ltx/gr_gr_cog/me.m04.d23:meMA.Ode4C21.incipit	Ὑμνοῦμέν σου, τοὺς ἀγῶνας Παμμάκαρ…
ltx/gr_gr_cog/me.m04.d23:meMA.Ode4C21.melody	@ltx/gr_gr_cog/he.h.m2:heHE.ElilythasEkParthenou.name
ltx/gr_gr_cog/me.m04.d23:meMA.Ode4C21.mode	@ltx/gr_gr_cog/miscellanea:misc.Mode2
ltx/gr_gr_cog/me.m04.d23:meMA.Ode4C21.ode	@ltx/gr_gr_cog/miscellanea:misc.Ode4
ltx/gr_gr_cog/me.m04.d23:meMA.Ode4C21.text	Ὑμνοῦμέν σου, τοὺς ἀγῶνας Παμμάκαρ Γεώργιε, διʼ ὧν καταβέβληκας, τὰ τῶν εἰδώλων σεβάσματα· πᾶσαν δὲ κατήργησας, την τῶν δαιμόνων ἀπάτην παναοίδιμε.
ltx/gr_gr_cog/me.m04.d23:meMA.Ode4C22.incipit	Κατεύνασον, πειρασμῶν καὶ κινδύνων τὸν…
ltx/gr_gr_cog/me.m04.d23:meMA.Ode4C22.melody	@ltx/gr_gr_cog/he.h.m2:heHE.ElilythasEkParthenou.name
ltx/gr_gr_cog/me.m04.d23:meMA.Ode4C22.mode	@ltx/gr_gr_cog/miscellanea:misc.Mode2
ltx/gr_gr_cog/me.m04.d23:meMA.Ode4C22.ode	@ltx/gr_gr_cog/miscellanea:misc.Ode4
ltx/gr_gr_cog/me.m04.d23:meMA.Ode4C22.text	Κατεύνασον, πειρασμῶν καὶ κινδύνων τὸν τάραχον, καὶ πᾶσαν ἐπήρειαν, τὴν τῶν δαιμόνων ἀπέλασον, ἀπὸ τῶν ὑμνούντων σε, ὡς τοῦ Χριστοῦ στρατιώτης Ἀξιάγαστε.
ltx/gr_gr_cog/me.m04.d23:meMA.Ode4C23.incipit	Ἀνέτειλας, ὡς ἀστὴρ ἑωσφόρος Γεώργιε…
ltx/gr_gr_cog/me.m04.d23:meMA.Ode4C23.melody	@ltx/gr_gr_cog/he.h.m2:heHE.ElilythasEkParthenou.name
ltx/gr_gr_cog/me.m04.d23:meMA.Ode4C23.mode	@ltx/gr_gr_cog/miscellanea:misc.Mode2
ltx/gr_gr_cog/me.m04.d23:meMA.Ode4C23.ode	@ltx/gr_gr_cog/miscellanea:misc.Ode4
ltx/gr_gr_cog/me.m04.d23:meMA.Ode4C23.text	Ἀνέτειλας, ὡς ἀστὴρ ἑωσφόρος Γεώργιε, ψυχῆς γενναιότητι, καὶ στηριγμῷ τῷ τῆς πίστεως, πλάνης τὴν σκοτόμαιναν, ἀποδιώκων καὶ σῴζων τοὺς ὑμνοῦντάς σε.
ltx/gr_gr_cog/me.m04.d23:meMA.Ode4C2H.greekmelody	@ltx/gr_gr_cog/he.h.m2:heHE.ElilythasEkParthenou.greekname
ltx/gr_gr_cog/me.m04.d23:meMA.Ode4C2H.incipit	@ltx/gr_gr_cog/he.h.m2:heHE.ElilythasEkParthenou.incipit
ltx/gr_gr_cog/me.m04.d23:meMA.Ode4C2H.melody	@ltx/gr_gr_cog/he.h.m2:heHE.ElilythasEkParthenou.melody
ltx/gr_gr_cog/me.m04.d23:meMA.Ode4C2H.mode	@ltx/gr_gr_cog/miscellanea:misc.Mode2
ltx/gr_gr_cog/me.m04.d23:meMA.Ode4C2H.ode	@ltx/gr_gr_cog/miscellanea:misc.Ode4
ltx/gr_gr_cog/me.m04.d23:meMA.Ode4C2H.text	@ltx/gr_gr_cog/he.h.m2:heHE.ElilythasEkParthenou.text
ltx/gr_gr_cog/me.m04.d23:meMA.Ode4C2T.incipit	Σωτηρίαν, οὐσιώδη Παρθένε γεγέννηκας, πλουσίᾳ…
ltx/gr_gr_cog/me.m04.d23:meMA.Ode4C2T.melody	@ltx/gr_gr_cog/he.h.m2:heHE.ElilythasEkParthenou.name
ltx/gr_gr_cog/me.m04.d23:meMA.Ode4C2T.mode	@ltx/gr_gr_cog/miscellanea:misc.Mode2
ltx/gr_gr_cog/me.m04.d23:meMA.Ode4C2T.ode	@ltx/gr_gr_cog/miscellanea:misc.Ode4
ltx/gr_gr_cog/me.m04.d23:meMA.Ode4C2T.text	Σωτηρίαν, οὐσιώδη Παρθένε γεγέννηκας, πλουσίᾳ χρηστότητι, καὶ φυσικῇ ἀγαθότητι, σῴζουσαν τὸν ἄνθρωπον, καὶ τὴν φθαρεῖσαν, εἰκόνα ἀναπλάττουσαν.
ltx/gr_gr_cog/me.m04.d23:meMA.Ode5C11.greekmelody	@ltx/gr_gr_cog/he.h.m1:heHE.OrthrisomenOrthrouVatheos.greekname
ltx/gr_gr_cog/me.m04.d23:meMA.Ode5C11.incipit	Ἑόρτιον κρότει σκιρτῶσα ἡ Ἐκκλησία…
ltx/gr_gr_cog/me.m04.d23:meMA.Ode5C11.melody	@ltx/gr_gr_cog/he.h.m1:heHE.OrthrisomenOrthrouVatheos.name
ltx/gr_gr_cog/me.m04.d23:meMA.Ode5C11.mode	@ltx/gr_gr_cog/miscellanea:misc.Mode1
ltx/gr_gr_cog/me.m04.d23:meMA.Ode5C11.ode	@ltx/gr_gr_cog/miscellanea:misc.Ode5
ltx/gr_gr_cog/me.m04.d23:meMA.Ode5C11.text	Ἑόρτιον κρότει σκιρτῶσα ἡ Ἐκκλησία, τὴν σεπτὴν Ἀνάστασιν τοῦ Σωτῆρος, καὶ τὴν νῦν μετάθεσιν τοῦ Ἀθλοφόρου ψάλλουσα· δύο τὰ καλὰ γὰρ συνέδραμον.
ltx/gr_gr_cog/me.m04.d23:meMA.Ode5C12.incipit	Δοξάζει σου τέρας τὸ ξένον…
ltx/gr_gr_cog/me.m04.d23:meMA.Ode5C12.melody	@ltx/gr_gr_cog/he.h.m1:heHE.OrthrisomenOrthrouVatheos.name
ltx/gr_gr_cog/me.m04.d23:meMA.Ode5C12.mode	@ltx/gr_gr_cog/miscellanea:misc.Mode1
ltx/gr_gr_cog/me.m04.d23:meMA.Ode5C12.ode	@ltx/gr_gr_cog/miscellanea:misc.Ode5
ltx/gr_gr_cog/me.m04.d23:meMA.Ode5C12.text	Δοξάζει σου τέρας τὸ ξένον θαυματοβρύτα, ὁ καλὸς Γλυκέριος, τὸν βοῦν οὗ περ θαυμαστῶς ἐζώωσας· αὐτὸν δὲ τῷ Κυρίῳ σου, ζῶσαν θυσίαν προσήνεγκας.
ltx/gr_gr_cog/me.m04.d23:meMA.Ode5C13.incipit	Αἰνέσεως ὅπως τὴν δόξαν τὴν…
ltx/gr_gr_cog/me.m04.d23:meMA.Ode5C13.melody	@ltx/gr_gr_cog/he.h.m1:heHE.OrthrisomenOrthrouVatheos.name
ltx/gr_gr_cog/me.m04.d23:meMA.Ode5C13.mode	@ltx/gr_gr_cog/miscellanea:misc.Mode1
ltx/gr_gr_cog/me.m04.d23:meMA.Ode5C13.ode	@ltx/gr_gr_cog/miscellanea:misc.Ode5
ltx/gr_gr_cog/me.m04.d23:meMA.Ode5C13.text	Αἰνέσεως ὅπως τὴν δόξαν τὴν σὴν ὑμνήσω, πλήρωσον τὸ στόμα μου χαριτώσας, καὶ τὸν νοῦν Γεώργιε· καὶ γὰρ ἀγαλλιάσεται, ὅταν σοι ψάλλῃ τὸ πνεῦμά μου.
ltx/gr_gr_cog/me.m04.d23:meMA.Ode5C1T.incipit	Ὑπέραγνε, πῶς ὑπὲρ λόγον γαλακτοτρόφος…
ltx/gr_gr_cog/me.m04.d23:meMA.Ode5C1T.melody	@ltx/gr_gr_cog/he.h.m1:heHE.OrthrisomenOrthrouVatheos.name
ltx/gr_gr_cog/me.m04.d23:meMA.Ode5C1T.mode	@ltx/gr_gr_cog/miscellanea:misc.Mode1
ltx/gr_gr_cog/me.m04.d23:meMA.Ode5C1T.ode	@ltx/gr_gr_cog/miscellanea:misc.Ode5
ltx/gr_gr_cog/me.m04.d23:meMA.Ode5C1T.text	Ὑπέραγνε, πῶς ὑπὲρ λόγον γαλακτοτρόφος, καὶ Παρθένος πέφυκας; ἀπορῶ σου, τὸ φρικτὸν μυστήριον! Τιμῶν λοιπὸν τὸν τόκον σου, σὲ προσκυνῶ Παναγία μου.
ltx/gr_gr_cog/me.m04.d23:meMA.Ode5C21.greekmelody	@ltx/gr_gr_cog/he.h.m2:heHE.OFotismos.greekname
ltx/gr_gr_cog/me.m04.d23:meMA.Ode5C21.incipit	Μαρτυρικήν, παῤῥησίαν ὡς ἔχων πρὸς…
ltx/gr_gr_cog/me.m04.d23:meMA.Ode5C21.melody	@ltx/gr_gr_cog/he.h.m2:heHE.OFotismos.name
ltx/gr_gr_cog/me.m04.d23:meMA.Ode5C21.mode	@ltx/gr_gr_cog/miscellanea:misc.Mode2
ltx/gr_gr_cog/me.m04.d23:meMA.Ode5C21.ode	@ltx/gr_gr_cog/miscellanea:misc.Ode5
ltx/gr_gr_cog/me.m04.d23:meMA.Ode5C21.text	Μαρτυρικήν, παῤῥησίαν ὡς ἔχων πρὸς τὸν Δεσπότην, αἴτησαι προθύμως τὴν σωτηρίαν, τοῖς σὲ ὑμνοῦσι, ψυχικῶν νοσημάτων, ἀπαλλάττων ταῖς σαῖς δεήσεσι, Μάρτυς ἀθλοφόρε, παμμάκαρ Γεώργιε.
ltx/gr_gr_cog/me.m04.d23:meMA.Ode5C22.incipit	Ἀγγελικαῖς, συγχορεύων ὡς Μάρτυς χοροστασίαις…
ltx/gr_gr_cog/me.m04.d23:meMA.Ode5C22.melody	@ltx/gr_gr_cog/he.h.m2:heHE.OFotismos.name
ltx/gr_gr_cog/me.m04.d23:meMA.Ode5C22.mode	@ltx/gr_gr_cog/miscellanea:misc.Mode2
ltx/gr_gr_cog/me.m04.d23:meMA.Ode5C22.ode	@ltx/gr_gr_cog/miscellanea:misc.Ode5
ltx/gr_gr_cog/me.m04.d23:meMA.Ode5C22.text	Ἀγγελικαῖς, συγχορεύων ὡς Μάρτυς χοροστασίαις, καὶ τῆς ἀθανάτου καὶ μακαρίας, Στεφανηφόρε, ἐμφορούμενος δόξης, τοὺς τῇ σκέπῃ τῇ σῇ προστρέχοντας, πάσης τρικυμίας, καὶ ζάλης ἐξάρπασον.
ltx/gr_gr_cog/me.m04.d23:meMA.Ode5C23.incipit	Ῥῦσαι ἡμᾶς, ἀπὸ πάσης ἀνάγκης…
ltx/gr_gr_cog/me.m04.d23:meMA.Ode5C23.melody	@ltx/gr_gr_cog/he.h.m2:heHE.OFotismos.name
ltx/gr_gr_cog/me.m04.d23:meMA.Ode5C23.mode	@ltx/gr_gr_cog/miscellanea:misc.Mode2
ltx/gr_gr_cog/me.m04.d23:meMA.Ode5C23.ode	@ltx/gr_gr_cog/miscellanea:misc.Ode5
ltx/gr_gr_cog/me.m04.d23:meMA.Ode5C23.text	Ῥῦσαι ἡμᾶς, ἀπὸ πάσης ἀνάγκης ὡς ἐλεήμων, τὸν τῆς ἁμαρτίας καὶ τῶν κινδύνων, ἐξαφανίζων, πολυποίκιλον κλόνον, Γεωργίου τοῦ σοῦ θεράποντος, τὰς ἱκετηρίας, Χριστὲ προσδεχόμενος.
ltx/gr_gr_cog/me.m04.d23:meMA.Ode5C2H.greekmelody	@ltx/gr_gr_cog/he.h.m2:heHE.OFotismos.greekname
ltx/gr_gr_cog/me.m04.d23:meMA.Ode5C2H.incipit	@ltx/gr_gr_cog/he.h.m2:heHE.OFotismos.incipit
ltx/gr_gr_cog/me.m04.d23:meMA.Ode5C2H.melody	@ltx/gr_gr_cog/he.h.m2:heHE.OFotismos.melody
ltx/gr_gr_cog/me.m04.d23:meMA.Ode5C2H.mode	@ltx/gr_gr_cog/miscellanea:misc.Mode2
ltx/gr_gr_cog/me.m04.d23:meMA.Ode5C2H.ode	@ltx/gr_gr_cog/miscellanea:misc.Ode5
ltx/gr_gr_cog/me.m04.d23:meMA.Ode5C2H.text	@ltx/gr_gr_cog/he.h.m2:heHE.OFotismos.text
ltx/gr_gr_cog/me.m04.d23:meMA.Ode5C2T.incipit	Τὴν ὀφειλήν, τῆς προμήτορος Εὔας…
ltx/gr_gr_cog/me.m04.d23:meMA.Ode5C2T.melody	@ltx/gr_gr_cog/he.h.m2:heHE.OFotismos.name
ltx/gr_gr_cog/me.m04.d23:meMA.Ode5C2T.mode	@ltx/gr_gr_cog/miscellanea:misc.Mode2
ltx/gr_gr_cog/me.m04.d23:meMA.Ode5C2T.ode	@ltx/gr_gr_cog/miscellanea:misc.Ode5
ltx/gr_gr_cog/me.m04.d23:meMA.Ode5C2T.text	Τὴν ὀφειλήν, τῆς προμήτορος Εὔας σὺ Θεομῆτορ, ἀπέτισας σάρκα ἠμφιεσμένον, ἐκ σοῦ τεκοῦσα, τὸν Σωτῆρα τοῦ κόσμου· ὅθεν πάντες σε μακαρίζομεν, κεχαριτωμένη Παρθένε πανάμωμε.
ltx/gr_gr_cog/me.m04.d23:meMA.Ode6C11.greekmelody	@ltx/gr_gr_cog/he.h.m1:heHE.KatilthesEnToisKatotatois.greekname
ltx/gr_gr_cog/me.m04.d23:meMA.Ode6C11.incipit	Ἰδοὺ σοι καὶ μία τερπνὴ…
ltx/gr_gr_cog/me.m04.d23:meMA.Ode6C11.melody	@ltx/gr_gr_cog/he.h.m1:heHE.KatilthesEnToisKatotatois.name
ltx/gr_gr_cog/me.m04.d23:meMA.Ode6C11.mode	@ltx/gr_gr_cog/miscellanea:misc.Mode1
ltx/gr_gr_cog/me.m04.d23:meMA.Ode6C11.ode	@ltx/gr_gr_cog/miscellanea:misc.Ode6
ltx/gr_gr_cog/me.m04.d23:meMA.Ode6C11.text	Ἰδοὺ σοι καὶ μία τερπνὴ χελιδών, θεοσύλλεκτε λαέ, τὴν τοῦ ἔαρος χάριν, ἀναπληροῖ θαυμαστῶς, ὁ Γεώργιος, καὶ συγχάρητε λοιπόν, τῇ χαρᾷ τούτου πάντες.
ltx/gr_gr_cog/me.m04.d23:meMA.Ode6C12.incipit	Δριμείας βασάνους δεινῶν ἐνεγκών, ὡς…
ltx/gr_gr_cog/me.m04.d23:meMA.Ode6C12.melody	@ltx/gr_gr_cog/he.h.m1:heHE.KatilthesEnToisKatotatois.name
ltx/gr_gr_cog/me.m04.d23:meMA.Ode6C12.mode	@ltx/gr_gr_cog/miscellanea:misc.Mode1
ltx/gr_gr_cog/me.m04.d23:meMA.Ode6C12.ode	@ltx/gr_gr_cog/miscellanea:misc.Ode6
ltx/gr_gr_cog/me.m04.d23:meMA.Ode6C12.text	Δριμείας βασάνους δεινῶν ἐνεγκών, ὡς τρυφὰς ταύτας ἡγοῦ, ὑπομένων Κυρίῳ, καὶ ψάλλων Ἔνδοξε· ἡ φωνὴ δέ σου, τῆς βροντῆς ἐν τῷ τροχῷ, τῶν εὐχῶν ἐξηχεῖτο.
ltx/gr_gr_cog/me.m04.d23:meMA.Ode6C13.incipit	Εὐφραίνου καὶ σκίρτα χορὸς Ἀθλητῶν…
ltx/gr_gr_cog/me.m04.d23:meMA.Ode6C13.melody	@ltx/gr_gr_cog/he.h.m1:heHE.KatilthesEnToisKatotatois.name
ltx/gr_gr_cog/me.m04.d23:meMA.Ode6C13.mode	@ltx/gr_gr_cog/miscellanea:misc.Mode1
ltx/gr_gr_cog/me.m04.d23:meMA.Ode6C13.ode	@ltx/gr_gr_cog/miscellanea:misc.Ode6
ltx/gr_gr_cog/me.m04.d23:meMA.Ode6C13.text	Εὐφραίνου καὶ σκίρτα χορὸς Ἀθλητῶν, πανηγύρεως τῆς νῦν, εὑρηκότες ἐξάρχοντα τὸν Γεώργιον, καὶ ἀγάλλεσθε, σὺν αὐτῷ Δαυϊτικῶς· ἡμέρα γὰρ Κυρίου.
ltx/gr_gr_cog/me.m04.d23:meMA.Ode6C1T.incipit	Καὶ τίκτεις, καὶ πάλιν ἁγνεύεις…
ltx/gr_gr_cog/me.m04.d23:meMA.Ode6C1T.melody	@ltx/gr_gr_cog/he.h.m1:heHE.KatilthesEnToisKatotatois.name
ltx/gr_gr_cog/me.m04.d23:meMA.Ode6C1T.mode	@ltx/gr_gr_cog/miscellanea:misc.Mode1
ltx/gr_gr_cog/me.m04.d23:meMA.Ode6C1T.ode	@ltx/gr_gr_cog/miscellanea:misc.Ode6
ltx/gr_gr_cog/me.m04.d23:meMA.Ode6C1T.text	Καὶ τίκτεις, καὶ πάλιν ἁγνεύεις ὡς πρίν, φοβερὸς ὁ τοκετός, μητρανύμφευτε Κόρη, καὶ ἀνεκλάλητος, τὸν ὑπέρχρονον, βρεφωθέντα καθʼ ἡμᾶς, ὑπὲρ ἔννοιαν τίκτεις.
ltx/gr_gr_cog/me.m04.d23:meMA.Ode6C21.greekmelody	@ltx/gr_gr_cog/he.h.m2:heHE.EnAvyssoPtaismaton.greekname
ltx/gr_gr_cog/me.m04.d23:meMA.Ode6C21.incipit	Ὑπὲρ φύσιν καὶ λόγον καὶ…
ltx/gr_gr_cog/me.m04.d23:meMA.Ode6C21.melody	@ltx/gr_gr_cog/he.h.m2:heHE.EnAvyssoPtaismaton.name
ltx/gr_gr_cog/me.m04.d23:meMA.Ode6C21.mode	@ltx/gr_gr_cog/miscellanea:misc.Mode2
ltx/gr_gr_cog/me.m04.d23:meMA.Ode6C21.ode	@ltx/gr_gr_cog/miscellanea:misc.Ode6
ltx/gr_gr_cog/me.m04.d23:meMA.Ode6C21.text	Ὑπὲρ φύσιν καὶ λόγον καὶ ἔννοιαν, τὰ τῆς ἀριστείας σου ἀνδραγαθήματα, διηνεκῶς ᾀδόμενα, παμμακάριστε Μάρτυς Γεώργιε.
ltx/gr_gr_cog/me.m04.d23:meMA.Ode6C22.incipit	Στρατιᾶς οὐρανίου συνόμιλος, μάκαρ γεγονώς…
ltx/gr_gr_cog/me.m04.d23:meMA.Ode6C22.melody	@ltx/gr_gr_cog/he.h.m2:heHE.EnAvyssoPtaismaton.name
ltx/gr_gr_cog/me.m04.d23:meMA.Ode6C22.mode	@ltx/gr_gr_cog/miscellanea:misc.Mode2
ltx/gr_gr_cog/me.m04.d23:meMA.Ode6C22.ode	@ltx/gr_gr_cog/miscellanea:misc.Ode6
ltx/gr_gr_cog/me.m04.d23:meMA.Ode6C22.text	Στρατιᾶς οὐρανίου συνόμιλος, μάκαρ γεγονώς, καὶ τὴν θείαν ἐμφάνειαν, ὡς ἐφικτὸν θεώμενος, τοὺς τιμῶντάς σε πίστει διάσωσον.
ltx/gr_gr_cog/me.m04.d23:meMA.Ode6C23.incipit	Ὁλοτρόπως Θεῷ ἀνακείμενος, καὶ τὰς…
ltx/gr_gr_cog/me.m04.d23:meMA.Ode6C23.melody	@ltx/gr_gr_cog/he.h.m2:heHE.EnAvyssoPtaismaton.name
ltx/gr_gr_cog/me.m04.d23:meMA.Ode6C23.mode	@ltx/gr_gr_cog/miscellanea:misc.Mode2
ltx/gr_gr_cog/me.m04.d23:meMA.Ode6C23.ode	@ltx/gr_gr_cog/miscellanea:misc.Ode6
ltx/gr_gr_cog/me.m04.d23:meMA.Ode6C23.text	Ὁλοτρόπως Θεῷ ἀνακείμενος, καὶ τὰς ἀστραπὰς τῶν θαυμάτων δεχόμενος, τὰς δωρεὰς τοῖς χρῄζουσι, διανέμεις παμμάκαρ Γεώργιε.
ltx/gr_gr_cog/me.m04.d23:meMA.Ode6C2H.greekmelody	@ltx/gr_gr_cog/he.h.m2:heHE.EnAvyssoPtaismaton.greekname
ltx/gr_gr_cog/me.m04.d23:meMA.Ode6C2H.incipit	@ltx/gr_gr_cog/he.h.m2:heHE.EnAvyssoPtaismaton.incipit
ltx/gr_gr_cog/me.m04.d23:meMA.Ode6C2H.melody	@ltx/gr_gr_cog/he.h.m2:heHE.EnAvyssoPtaismaton.melody
ltx/gr_gr_cog/me.m04.d23:meMA.Ode6C2H.mode	@ltx/gr_gr_cog/miscellanea:misc.Mode2
ltx/gr_gr_cog/me.m04.d23:meMA.Ode6C2H.ode	@ltx/gr_gr_cog/miscellanea:misc.Ode6
ltx/gr_gr_cog/me.m04.d23:meMA.Ode6C2H.text	@ltx/gr_gr_cog/he.h.m2:heHE.EnAvyssoPtaismaton.text
ltx/gr_gr_cog/me.m04.d23:meMA.Ode6C2T.incipit	Νῦν πρὸς σὲ καταφεύγω Πανάχραντε…
ltx/gr_gr_cog/me.m04.d23:meMA.Ode6C2T.melody	@ltx/gr_gr_cog/he.h.m2:heHE.EnAvyssoPtaismaton.name
ltx/gr_gr_cog/me.m04.d23:meMA.Ode6C2T.mode	@ltx/gr_gr_cog/miscellanea:misc.Mode2
ltx/gr_gr_cog/me.m04.d23:meMA.Ode6C2T.ode	@ltx/gr_gr_cog/miscellanea:misc.Ode6
ltx/gr_gr_cog/me.m04.d23:meMA.Ode6C2T.text	Νῦν πρὸς σὲ καταφεύγω Πανάχραντε· Σῶσόν με πρεσβείαις σου, καὶ διαφύλαξον· ὅσα γὰρ θέλεις δύνασαι, οἷα Μήτηρ τοῦ πάντα ἰσχύοντος.
ltx/gr_gr_cog/me.m04.d23:meMA.Ode7C11.greekmelody	@ltx/gr_gr_cog/he.h.m1:heHE.OPaidasEkKaminou.greekname
ltx/gr_gr_cog/me.m04.d23:meMA.Ode7C11.incipit	Ποθῶ σου ἐξυμνεῖν τὰ θαυμάσια…
ltx/gr_gr_cog/me.m04.d23:meMA.Ode7C11.melody	@ltx/gr_gr_cog/he.h.m1:heHE.OPaidasEkKaminou.name
ltx/gr_gr_cog/me.m04.d23:meMA.Ode7C11.mode	@ltx/gr_gr_cog/miscellanea:misc.Mode1
ltx/gr_gr_cog/me.m04.d23:meMA.Ode7C11.ode	@ltx/gr_gr_cog/miscellanea:misc.Ode7
ltx/gr_gr_cog/me.m04.d23:meMA.Ode7C11.text	Ποθῶ σου ἐξυμνεῖν τὰ θαυμάσια, καὶ πάλιν συστέλλομαι· ὅταν γὰρ αὐτὰ ἐξαριθμῆσαι βουληθῶ, ὑπὲρ ἄμμον εὑρίσκονται πληθυνόμενα, καὶ δέξαι μου τὸ λοιπὸν Ἀθλητά, τὸ βραχὺ τοῦτο ἐφύμνιον.
ltx/gr_gr_cog/me.m04.d23:meMA.Ode7C12.incipit	Οὐκ ἔστιν οὐδὲ γῆ οὐδὲ…
ltx/gr_gr_cog/me.m04.d23:meMA.Ode7C12.melody	@ltx/gr_gr_cog/he.h.m1:heHE.OPaidasEkKaminou.name
ltx/gr_gr_cog/me.m04.d23:meMA.Ode7C12.mode	@ltx/gr_gr_cog/miscellanea:misc.Mode1
ltx/gr_gr_cog/me.m04.d23:meMA.Ode7C12.ode	@ltx/gr_gr_cog/miscellanea:misc.Ode7
ltx/gr_gr_cog/me.m04.d23:meMA.Ode7C12.text	Οὐκ ἔστιν οὐδὲ γῆ οὐδὲ θάλασσα, οὐ πόλις οὐκ ἔρημος, ἔνθα ἀληθῶς, τῶν σῶν θαυμάτων οἱ κρουνοί, πελαγίζοντες Μάρτυς οὐχ ὑπερβλύζουσι· τὸ σὸν γὰρ θαυμαστόν, ἐν πάσῃ τῇ γῇ ᾄδεται ὄνομα.
ltx/gr_gr_cog/me.m04.d23:meMA.Ode7C13.incipit	Θαμβεῖταί σου στρατάρχα τὴν ἄθλησιν…
ltx/gr_gr_cog/me.m04.d23:meMA.Ode7C13.melody	@ltx/gr_gr_cog/he.h.m1:heHE.OPaidasEkKaminou.name
ltx/gr_gr_cog/me.m04.d23:meMA.Ode7C13.mode	@ltx/gr_gr_cog/miscellanea:misc.Mode1
ltx/gr_gr_cog/me.m04.d23:meMA.Ode7C13.ode	@ltx/gr_gr_cog/miscellanea:misc.Ode7
ltx/gr_gr_cog/me.m04.d23:meMA.Ode7C13.text	Θαμβεῖταί σου στρατάρχα τὴν ἄθλησιν, Ἀγγέλων τὸ στράτευμα, σὲ δʼ ὁ τῶν Ἀγγέλων Βασιλεὺς καταπλαγείς, ἐπεθύμησε Μάρτυς τοῦ κάλλους σου· διὸ περ καὶ σὺν αὐτῷ βασιλεύειν ἀεί σε κατηξίωσε.
ltx/gr_gr_cog/me.m04.d23:meMA.Ode7C1T.incipit	Ὁλόφωτε σκηνὴ θεοδόμητε, λυχνία κατάχρυσε…
ltx/gr_gr_cog/me.m04.d23:meMA.Ode7C1T.melody	@ltx/gr_gr_cog/he.h.m1:heHE.OPaidasEkKaminou.name
ltx/gr_gr_cog/me.m04.d23:meMA.Ode7C1T.mode	@ltx/gr_gr_cog/miscellanea:misc.Mode1
ltx/gr_gr_cog/me.m04.d23:meMA.Ode7C1T.ode	@ltx/gr_gr_cog/miscellanea:misc.Ode7
ltx/gr_gr_cog/me.m04.d23:meMA.Ode7C1T.text	Ὁλόφωτε σκηνὴ θεοδόμητε, λυχνία κατάχρυσε, στάμνε κιβωτέ, θεοκατοίκητε ναέ, ξενοβλάστητε ῥάβδε, Μητράναδρε, τοὺς σοὺς ἱκέτας ἡμᾶς, πολυώνυμε Κόρη διαφύλαττε.
ltx/gr_gr_cog/me.m04.d23:meMA.Ode7C21.greekmelody	@ltx/gr_gr_cog/he.h.m2:heHE.AntitheonProstagma.greekname
ltx/gr_gr_cog/me.m04.d23:meMA.Ode7C21.incipit	Τὸν σὸν ἐκμιμούμενος Μάρτυς Δεσπότην…
ltx/gr_gr_cog/me.m04.d23:meMA.Ode7C21.melody	@ltx/gr_gr_cog/he.h.m2:heHE.AntitheonProstagma.name
ltx/gr_gr_cog/me.m04.d23:meMA.Ode7C21.mode	@ltx/gr_gr_cog/miscellanea:misc.Mode2
ltx/gr_gr_cog/me.m04.d23:meMA.Ode7C21.ode	@ltx/gr_gr_cog/miscellanea:misc.Ode7
ltx/gr_gr_cog/me.m04.d23:meMA.Ode7C21.text	Τὸν σὸν ἐκμιμούμενος Μάρτυς Δεσπότην, ἑκὼν ηὐτομόλησας, πρὸς τοὺς ἀγῶνας Ἔνδοξε, καὶ νίκην ἀράμενος, τῆς Ἐκκλησίας Χριστοῦ, φύλαξ ἐχρημάτισας, αὐτήν, ἀεὶ φυλάττων ταῖς προστασίαις σου.
ltx/gr_gr_cog/me.m04.d23:meMA.Ode7C22.incipit	Ὡς Μάρτυς ἀήττητος, ὡς ἀθλοφόρος…
ltx/gr_gr_cog/me.m04.d23:meMA.Ode7C22.melody	@ltx/gr_gr_cog/he.h.m2:heHE.AntitheonProstagma.name
ltx/gr_gr_cog/me.m04.d23:meMA.Ode7C22.mode	@ltx/gr_gr_cog/miscellanea:misc.Mode2
ltx/gr_gr_cog/me.m04.d23:meMA.Ode7C22.ode	@ltx/gr_gr_cog/miscellanea:misc.Ode7
ltx/gr_gr_cog/me.m04.d23:meMA.Ode7C22.text	Ὡς Μάρτυς ἀήττητος, ὡς ἀθλοφόρος, ὡς ἀκαταγώνιστος τῆς πίστεως ὑπέρμαχος, νῦν πύργος ἀκράδαντος, τοῖς εὐφημοῦσί σε, πάνσοφε Γεώργιε γενοῦ, περιτειχίζων ταῖς ἱκεσίαις σου.
ltx/gr_gr_cog/me.m04.d23:meMA.Ode7C23.incipit	Σοφῶς ἐγεώργησας τὸν θεῖον σπόρον…
ltx/gr_gr_cog/me.m04.d23:meMA.Ode7C23.melody	@ltx/gr_gr_cog/he.h.m2:heHE.AntitheonProstagma.name
ltx/gr_gr_cog/me.m04.d23:meMA.Ode7C23.mode	@ltx/gr_gr_cog/miscellanea:misc.Mode2
ltx/gr_gr_cog/me.m04.d23:meMA.Ode7C23.ode	@ltx/gr_gr_cog/miscellanea:misc.Ode7
ltx/gr_gr_cog/me.m04.d23:meMA.Ode7C23.text	Σοφῶς ἐγεώργησας τὸν θεῖον σπόρον, καὶ τοῦτον ἐπλήθυνας, αἱμάτων σου τοῖς ῥεύμασιν, ἀρδεύων μακάριε, καὶ τῇ τῶν πόνων σπουδῇ, καὶ τοῖς ἐπαλλήλοις αἰκισμοῖς, διʼ ὧν τυράννων τὸ θράσος ἔσβεσας.
ltx/gr_gr_cog/me.m04.d23:meMA.Ode7C2H.greekmelody	@ltx/gr_gr_cog/he.h.m2:heHE.AntitheonProstagma.greekname
ltx/gr_gr_cog/me.m04.d23:meMA.Ode7C2H.incipit	@ltx/gr_gr_cog/he.h.m2:heHE.AntitheonProstagma.incipit
ltx/gr_gr_cog/me.m04.d23:meMA.Ode7C2H.melody	@ltx/gr_gr_cog/he.h.m2:heHE.AntitheonProstagma.melody
ltx/gr_gr_cog/me.m04.d23:meMA.Ode7C2H.mode	@ltx/gr_gr_cog/miscellanea:misc.Mode2
ltx/gr_gr_cog/me.m04.d23:meMA.Ode7C2H.ode	@ltx/gr_gr_cog/miscellanea:misc.Ode7
ltx/gr_gr_cog/me.m04.d23:meMA.Ode7C2H.text	@ltx/gr_gr_cog/he.h.m2:heHE.AntitheonProstagma.text
ltx/gr_gr_cog/me.m04.d23:meMA.Ode7C2T.incipit	Παρθένος διέμεινας καὶ μετὰ τόκον…
ltx/gr_gr_cog/me.m04.d23:meMA.Ode7C2T.melody	@ltx/gr_gr_cog/he.h.m2:heHE.AntitheonProstagma.name
ltx/gr_gr_cog/me.m04.d23:meMA.Ode7C2T.mode	@ltx/gr_gr_cog/miscellanea:misc.Mode2
ltx/gr_gr_cog/me.m04.d23:meMA.Ode7C2T.ode	@ltx/gr_gr_cog/miscellanea:misc.Ode7
ltx/gr_gr_cog/me.m04.d23:meMA.Ode7C2T.text	Παρθένος διέμεινας καὶ μετὰ τόκον· Θεὸν γὰρ ἐγέννησας, τὸν πάντας διατρέφοντα διʼ ἄφαντον ἔλεος, καὶ εὐσπλαγχνίαν πολλήν, ἄνθρωπον γενόμενον Ἁγνή, ὃν νῦν δυσώπει σωθῆναι πάντας ἡμᾶς.
ltx/gr_gr_cog/me.m04.d23:meMA.Ode8C11.greekmelody	@ltx/gr_gr_cog/he.h.m1:heHE.AftiIKliti.greekname
ltx/gr_gr_cog/me.m04.d23:meMA.Ode8C11.incipit	Ὕμνους ὡς εὐώδη, συλλέξαντες ἄνθη…
ltx/gr_gr_cog/me.m04.d23:meMA.Ode8C11.melody	@ltx/gr_gr_cog/he.h.m1:heHE.AftiIKliti.name
ltx/gr_gr_cog/me.m04.d23:meMA.Ode8C11.mode	@ltx/gr_gr_cog/miscellanea:misc.Mode1
ltx/gr_gr_cog/me.m04.d23:meMA.Ode8C11.ode	@ltx/gr_gr_cog/miscellanea:misc.Ode8
ltx/gr_gr_cog/me.m04.d23:meMA.Ode8C11.text	Ὕμνους ὡς εὐώδη, συλλέξαντες ἄνθη, ἄλλου Παραδείσου, τοῦ θεοπνεύστου Ψαλτῆρος, δεῦτε στέφος λαμπρόν, ᾀσματόπλοκον, τῷ Μάρτυρι πλέξωμεν· ἠρίστευσε γάρ, καθελὼν Σατὰν τὸ κράτος.
ltx/gr_gr_cog/me.m04.d23:meMA.Ode8C12.incipit	Δεῦρο Μελουργέ, προφητόπρωτε φράσον, ὁ…
ltx/gr_gr_cog/me.m04.d23:meMA.Ode8C12.melody	@ltx/gr_gr_cog/he.h.m1:heHE.AftiIKliti.name
ltx/gr_gr_cog/me.m04.d23:meMA.Ode8C12.mode	@ltx/gr_gr_cog/miscellanea:misc.Mode1
ltx/gr_gr_cog/me.m04.d23:meMA.Ode8C12.ode	@ltx/gr_gr_cog/miscellanea:misc.Ode8
ltx/gr_gr_cog/me.m04.d23:meMA.Ode8C12.text	Δεῦρο Μελουργέ, προφητόπρωτε φράσον, ὁ δίκαιος ἐκεῖνος, ὁ ἐξανθήσας ὡς φοίνιξ, τίς καὶ ποῖος ἐστίν; ὁ μεγάλαυχος ὑπάρχει Γεώργιος, γλυκύκαρπον ὄντως, φυτόν καρδιοτρόφον.
ltx/gr_gr_cog/me.m04.d23:meMA.Ode8C13.incipit	Ἔρχου ἐπιφάνηθι, τάχυνον φθάσον, ἡμᾶς…
ltx/gr_gr_cog/me.m04.d23:meMA.Ode8C13.melody	@ltx/gr_gr_cog/he.h.m1:heHE.AftiIKliti.name
ltx/gr_gr_cog/me.m04.d23:meMA.Ode8C13.mode	@ltx/gr_gr_cog/miscellanea:misc.Mode1
ltx/gr_gr_cog/me.m04.d23:meMA.Ode8C13.ode	@ltx/gr_gr_cog/miscellanea:misc.Ode8
ltx/gr_gr_cog/me.m04.d23:meMA.Ode8C13.text	Ἔρχου ἐπιφάνηθι, τάχυνον φθάσον, ἡμᾶς τὴν νοσσιάν σου, ὡς ἀετὸς χρυσοπτέρυξ, περιθάλπων ἀεὶ καθυπόδεξαι, διεὶς τὰς πτέρυγάς σου· σκιὰν ὑπὸ σὴν γάρ, καλόν ἀναπεπαῦθαι.
ltx/gr_gr_cog/me.m04.d23:meMA.Ode8C1T.incipit	Ἴδε ἣν προέφης, Προφῆτα Παρθένον…
ltx/gr_gr_cog/me.m04.d23:meMA.Ode8C1T.melody	@ltx/gr_gr_cog/he.h.m1:heHE.AftiIKliti.name
ltx/gr_gr_cog/me.m04.d23:meMA.Ode8C1T.mode	@ltx/gr_gr_cog/miscellanea:misc.Mode1
ltx/gr_gr_cog/me.m04.d23:meMA.Ode8C1T.ode	@ltx/gr_gr_cog/miscellanea:misc.Ode8
ltx/gr_gr_cog/me.m04.d23:meMA.Ode8C1T.text	Ἴδε ἣν προέφης, Προφῆτα Παρθένον, συνέλαβεν ἀσπόρως, ἡ Βασιλὶς καὶ Κυρία, καὶ ὡς Μήτηρ γεννᾷ, τὸν Παντάνακτα, πανάφθορος μείνασα, Μυστήριον ξένον, ὁ τοκετός σου Κόρη!
ltx/gr_gr_cog/me.m04.d23:meMA.Ode8C21.greekmelody	@ltx/gr_gr_cog/he.h.m2:heHE.KaminosPote.greekname
ltx/gr_gr_cog/me.m04.d23:meMA.Ode8C21.incipit	Ῥύμην τῶν δεινῶν, παθῶν τε…
ltx/gr_gr_cog/me.m04.d23:meMA.Ode8C21.melody	@ltx/gr_gr_cog/he.h.m2:heHE.KaminosPote.name
ltx/gr_gr_cog/me.m04.d23:meMA.Ode8C21.mode	@ltx/gr_gr_cog/miscellanea:misc.Mode2
ltx/gr_gr_cog/me.m04.d23:meMA.Ode8C21.ode	@ltx/gr_gr_cog/miscellanea:misc.Ode8
ltx/gr_gr_cog/me.m04.d23:meMA.Ode8C21.text	Ῥύμην τῶν δεινῶν, παθῶν τε καὶ κινδύνων, καὶ ταραχώδους περιστάσεως, καὶ νόσων συμπτώματα, καὶ δαιμόνων μηχανήματα, καὶ δυσμενῶν ὁρμήματα, παῦσον ταῖς σαῖς πρεσβείαις, στεφανηφόρε Γεώργιε.
ltx/gr_gr_cog/me.m04.d23:meMA.Ode8C22.incipit	Ὅλῳ τῷ φωτί, παμμάκαρ τῆς…
ltx/gr_gr_cog/me.m04.d23:meMA.Ode8C22.melody	@ltx/gr_gr_cog/he.h.m2:heHE.KaminosPote.name
ltx/gr_gr_cog/me.m04.d23:meMA.Ode8C22.mode	@ltx/gr_gr_cog/miscellanea:misc.Mode2
ltx/gr_gr_cog/me.m04.d23:meMA.Ode8C22.ode	@ltx/gr_gr_cog/miscellanea:misc.Ode8
ltx/gr_gr_cog/me.m04.d23:meMA.Ode8C22.text	Ὅλῳ τῷ φωτί, παμμάκαρ τῆς Τριάδος, εἰλικρινῶς καταλαμπόμενος, ὡς Μάρτυς ἀήττητος, εὐσεβείας ὡς ὑπέρμαχος, ὡς νικητὴς θεόστεπτος, σῶσον Οὐρανοφοῖτα, τοὺς σὲ τιμῶντας πρεσβείαις σου.
ltx/gr_gr_cog/me.m04.d23:meMA.Ode8C23.incipit	Στέφει νοητῷ, ποικίλως διαπρέπων, καὶ…
ltx/gr_gr_cog/me.m04.d23:meMA.Ode8C23.melody	@ltx/gr_gr_cog/he.h.m2:heHE.KaminosPote.name
ltx/gr_gr_cog/me.m04.d23:meMA.Ode8C23.mode	@ltx/gr_gr_cog/miscellanea:misc.Mode2
ltx/gr_gr_cog/me.m04.d23:meMA.Ode8C23.ode	@ltx/gr_gr_cog/miscellanea:misc.Ode8
ltx/gr_gr_cog/me.m04.d23:meMA.Ode8C23.text	Στέφει νοητῷ, ποικίλως διαπρέπων, καὶ βασιλείας διαδήματι, καὶ σκήπτρῳ κοσμούμενος, καὶ πορφύραν περιθέμενος, σῷ φοινιχθεῖσαν αἵματι, μάκαρ συμβασιλεύεις, τῷ βασιλεῖ τῶν Δυνάμεων.
ltx/gr_gr_cog/me.m04.d23:meMA.Ode8C2H.greekmelody	@ltx/gr_gr_cog/he.h.m2:heHE.KaminosPote.greekname
ltx/gr_gr_cog/me.m04.d23:meMA.Ode8C2H.incipit	@ltx/gr_gr_cog/he.h.m2:heHE.KaminosPote.incipit
ltx/gr_gr_cog/me.m04.d23:meMA.Ode8C2H.melody	@ltx/gr_gr_cog/he.h.m2:heHE.KaminosPote.melody
ltx/gr_gr_cog/me.m04.d23:meMA.Ode8C2H.mode	@ltx/gr_gr_cog/miscellanea:misc.Mode2
ltx/gr_gr_cog/me.m04.d23:meMA.Ode8C2H.ode	@ltx/gr_gr_cog/miscellanea:misc.Ode8
ltx/gr_gr_cog/me.m04.d23:meMA.Ode8C2H.text	@ltx/gr_gr_cog/he.h.m2:heHE.KaminosPote.text
ltx/gr_gr_cog/me.m04.d23:meMA.Ode8C2T.incipit	Τὸν ἐκ τοῦ Πατρός, ἀχρόνως…
ltx/gr_gr_cog/me.m04.d23:meMA.Ode8C2T.melody	@ltx/gr_gr_cog/he.h.m2:heHE.KaminosPote.name
ltx/gr_gr_cog/me.m04.d23:meMA.Ode8C2T.mode	@ltx/gr_gr_cog/miscellanea:misc.Mode2
ltx/gr_gr_cog/me.m04.d23:meMA.Ode8C2T.ode	@ltx/gr_gr_cog/miscellanea:misc.Ode8
ltx/gr_gr_cog/me.m04.d23:meMA.Ode8C2T.text	Τὸν ἐκ τοῦ Πατρός, ἀχρόνως γεννηθέντα, καὶ πρὸ αἰώνων ἀναλάμψαντα, τὸν πάντα ποιήσαντα, ὁρατά τε καὶ ἀόρατα, Παρθενομῆτορ τέτοκας· ὅθεν σε Θεοτόκον, πάντα τὰ ἔθνη δοξάζομεν.
ltx/gr_gr_cog/me.m04.d23:meMA.Ode9C11.greekmelody	@ltx/gr_gr_cog/he.h.m1:heHE.FotizouFotizou.greekname
ltx/gr_gr_cog/me.m04.d23:meMA.Ode9C11.incipit	Γλυκύτατον δρόσον, ὄρη σταλάξατε, καὶ…
ltx/gr_gr_cog/me.m04.d23:meMA.Ode9C11.melody	@ltx/gr_gr_cog/he.h.m1:heHE.FotizouFotizou.name
ltx/gr_gr_cog/me.m04.d23:meMA.Ode9C11.mode	@ltx/gr_gr_cog/miscellanea:misc.Mode1
ltx/gr_gr_cog/me.m04.d23:meMA.Ode9C11.ode	@ltx/gr_gr_cog/miscellanea:misc.Ode9
ltx/gr_gr_cog/me.m04.d23:meMA.Ode9C11.text	Γλυκύτατον δρόσον, ὄρη σταλάξατε, καὶ σύ, κατʼ ἐξαίρετον σκίρτα, τὸ ὄρος τὸ Ἅγιον, χόρευε νῦν, καὶ ἀγάλλου φαιδρῶς· εὗρες καὶ γάρ, κράτιστον τὸν μέγαν, Γεώργιον ὀροφύλακα.
ltx/gr_gr_cog/me.m04.d23:meMA.Ode9C12.incipit	Αἰνοῦσι αἱ σύμπασαι, νῦν πατριαὶ…
ltx/gr_gr_cog/me.m04.d23:meMA.Ode9C12.melody	@ltx/gr_gr_cog/he.h.m1:heHE.FotizouFotizou.name
ltx/gr_gr_cog/me.m04.d23:meMA.Ode9C12.mode	@ltx/gr_gr_cog/miscellanea:misc.Mode1
ltx/gr_gr_cog/me.m04.d23:meMA.Ode9C12.ode	@ltx/gr_gr_cog/miscellanea:misc.Ode9
ltx/gr_gr_cog/me.m04.d23:meMA.Ode9C12.text	Αἰνοῦσι αἱ σύμπασαι, νῦν πατριαὶ τῶν ἐθνῶν, εὐλογοῦσιν ὑμνοῦσι, καὶ συμφώνως κράζουσι· Χαῖρε Σωτήρ, τῶν πιστῶν ἡ χαρά, χαίροις καὶ σύ, εὖχος, Ἀθλοφόρων, Γεώργιε ὑπερθαύμαστε.
ltx/gr_gr_cog/me.m04.d23:meMA.Ode9C13.incipit	Ῥαβδίσματα, ξέσεις, καὶ τῶν βουνεύρων…
ltx/gr_gr_cog/me.m04.d23:meMA.Ode9C13.melody	@ltx/gr_gr_cog/he.h.m1:heHE.FotizouFotizou.name
ltx/gr_gr_cog/me.m04.d23:meMA.Ode9C13.mode	@ltx/gr_gr_cog/miscellanea:misc.Mode1
ltx/gr_gr_cog/me.m04.d23:meMA.Ode9C13.ode	@ltx/gr_gr_cog/miscellanea:misc.Ode9
ltx/gr_gr_cog/me.m04.d23:meMA.Ode9C13.text	Ῥαβδίσματα, ξέσεις, καὶ τῶν βουνεύρων τοὺς δαρμούς, τὰς κρηπῖδας, τὸν λάκκον τῆς ἀσβέστου σέβομαι, τἆλλά τε ὅσα ὑπέστης ἀθλῶν, Μάρτυς Χριστοῦ, πάντα μακαρίζω, καὶ τὸν τροχὸν κατασπάζομαι.
ltx/gr_gr_cog/me.m04.d23:meMA.Ode9C14.incipit	Δημήτριε Μάρτυς, σὺν Γεωργίῳ τῷ…
ltx/gr_gr_cog/me.m04.d23:meMA.Ode9C14.melody	@ltx/gr_gr_cog/he.h.m1:heHE.FotizouFotizou.name
ltx/gr_gr_cog/me.m04.d23:meMA.Ode9C14.mode	@ltx/gr_gr_cog/miscellanea:misc.Mode1
ltx/gr_gr_cog/me.m04.d23:meMA.Ode9C14.ode	@ltx/gr_gr_cog/miscellanea:misc.Ode9
ltx/gr_gr_cog/me.m04.d23:meMA.Ode9C14.text	Δημήτριε Μάρτυς, σὺν Γεωργίῳ τῷ κλεινῷ· ἀγαθοὶ γὰρ οἱ δύο, μηδαμῶς ἐλλίπητε, τόνδε τὸν χῶρον φρουροῦντες ἀεί, καὶ πειρασμῶν, ὅλας μυριάδας, μετακινοῦντες ἀμφότεροι.
ltx/gr_gr_cog/me.m04.d23:meMA.Ode9C1M01.incipit	…
ltx/gr_gr_cog/me.m04.d23:meMA.Ode9C1M01.text	Μεγάλυνον, ψυχή μου, τὸν ἐν ἀθλοφόροις πρώτιστον σταδιάρχην, Γεώργιον τὸν μέγαν.
ltx/gr_gr_cog/me.m04.d23:meMA.Ode9C1M02.incipit	…
ltx/gr_gr_cog/me.m04.d23:meMA.Ode9C1M02.text	Μεγάλυνον, ψυχή μου, τὸ Παλαιστίνης κλέοω, καὶ Καππαδόκων κῦδος, Γεώργιον τὸν μέγαν.
ltx/gr_gr_cog/me.m04.d23:meMA.Ode9C1MTh.incipit	@ltx/gr_gr_cog/pe.d071:peMA.Ode9C1MTh.incipit
ltx/gr_gr_cog/me.m04.d23:meMA.Ode9C1MTh.text	@ltx/gr_gr_cog/pe.d071:peMA.Ode9C1MTh.text
ltx/gr_gr_cog/me.m04.d23:meMA.Ode9C1MTr.incipit	@ltx/gr_gr_cog/pe.d071:peMA.Ode9C1MTr.incipit
ltx/gr_gr_cog/me.m04.d23:meMA.Ode9C1MTr.text	@ltx/gr_gr_cog/pe.d071:peMA.Ode9C1MTr.text
ltx/gr_gr_cog/me.m04.d23:meMA.Ode9C1T.incipit	Ἡ δόξα τὸ κάλλος, ἡ…
ltx/gr_gr_cog/me.m04.d23:meMA.Ode9C1T.melody	@ltx/gr_gr_cog/he.h.m1:heHE.FotizouFotizou.name
ltx/gr_gr_cog/me.m04.d23:meMA.Ode9C1T.mode	@ltx/gr_gr_cog/miscellanea:misc.Mode1
ltx/gr_gr_cog/me.m04.d23:meMA.Ode9C1T.ode	@ltx/gr_gr_cog/miscellanea:misc.Ode9
ltx/gr_gr_cog/me.m04.d23:meMA.Ode9C1T.text	Ἡ δόξα τὸ κάλλος, ἡ ὡραιότης τῶν πιστῶν, ἡ τρυφὴ τῶν Ἀγγέλων, κόσμου τὸ διάσωσμα, πάναγνε Μήτηρ Χριστοῦ τοῦ Θεοῦ, τοὺς εἰς τὴν σήν, σκέπην προσδραμόντας, συντήρησον Παναγία μου.
ltx/gr_gr_cog/me.m04.d23:meMA.Ode9C21.greekmelody	@ltx/gr_gr_cog/he.h.m2:heHE.AnarchouGennitoros.greekname
ltx/gr_gr_cog/me.m04.d23:meMA.Ode9C21.incipit	Ἀπαύστως τὸν Κύριον, ὑπὲρ ἡμῶν…
ltx/gr_gr_cog/me.m04.d23:meMA.Ode9C21.melody	@ltx/gr_gr_cog/he.h.m2:heHE.AnarchouGennitoros.name
ltx/gr_gr_cog/me.m04.d23:meMA.Ode9C21.mode	@ltx/gr_gr_cog/miscellanea:misc.Mode2
ltx/gr_gr_cog/me.m04.d23:meMA.Ode9C21.ode	@ltx/gr_gr_cog/miscellanea:misc.Ode9
ltx/gr_gr_cog/me.m04.d23:meMA.Ode9C21.text	Ἀπαύστως τὸν Κύριον, ὑπὲρ ἡμῶν δυσώπησον, τῶν ὑμνούντων σε μάκαρ, ὡς Χριστομάρτυρα, ὡς νενικηκότα τυράννους, ὡς πονηρῶν, πνευμάτων διώκτην, ὡς ἄγρυπνον φύλακα, ὡς προστάτην ἀκαταίσχυντον.
ltx/gr_gr_cog/me.m04.d23:meMA.Ode9C22.incipit	Τῶν ἄθλων τὰ ἔπαθλα, πλουσίως…
ltx/gr_gr_cog/me.m04.d23:meMA.Ode9C22.melody	@ltx/gr_gr_cog/he.h.m2:heHE.AnarchouGennitoros.name
ltx/gr_gr_cog/me.m04.d23:meMA.Ode9C22.mode	@ltx/gr_gr_cog/miscellanea:misc.Mode2
ltx/gr_gr_cog/me.m04.d23:meMA.Ode9C22.ode	@ltx/gr_gr_cog/miscellanea:misc.Ode9
ltx/gr_gr_cog/me.m04.d23:meMA.Ode9C22.text	Τῶν ἄθλων τὰ ἔπαθλα, πλουσίως σοι δεδώρηται, ὁ τῶν ὅλων Δεσπότης, ᾧ παριστάμενος, μετὰ παῤῥησίας Τρισμάκαρ, μαρτυρικῆς, καὶ μέτʼ εὐφροσύνης, τοὺς προσκαλουμένους σε, περιέπων διαφύλαττε.
ltx/gr_gr_cog/me.m04.d23:meMA.Ode9C23.incipit	Ἡ γῆ σε κατέκρυψε, καὶ…
ltx/gr_gr_cog/me.m04.d23:meMA.Ode9C23.melody	@ltx/gr_gr_cog/he.h.m2:heHE.AnarchouGennitoros.name
ltx/gr_gr_cog/me.m04.d23:meMA.Ode9C23.mode	@ltx/gr_gr_cog/miscellanea:misc.Mode2
ltx/gr_gr_cog/me.m04.d23:meMA.Ode9C23.ode	@ltx/gr_gr_cog/miscellanea:misc.Ode9
ltx/gr_gr_cog/me.m04.d23:meMA.Ode9C23.text	Ἡ γῆ σε κατέκρυψε, καὶ οὐρανὸς ἐδέξατο, καὶ ἠνοίγη σοι Πύλη, τοῦ Παραδείσου σαφῶς, ὅν περιχαρῶς Ἀθλοφόρε, χοροβατῶν, καὶ περιπολεύων, τοὺς πίστει ὑμνοῦντάς σε, σαῖς πρεσβείαις περιφρούρησον.
ltx/gr_gr_cog/me.m04.d23:meMA.Ode9C2H.greekmelody	@ltx/gr_gr_cog/he.h.m2:heHE.AnarchouGennitoros.greekname
ltx/gr_gr_cog/me.m04.d23:meMA.Ode9C2H.incipit	@ltx/gr_gr_cog/he.h.m2:heHE.AnarchouGennitoros.incipit
ltx/gr_gr_cog/me.m04.d23:meMA.Ode9C2H.melody	@ltx/gr_gr_cog/he.h.m2:heHE.AnarchouGennitoros.melody
ltx/gr_gr_cog/me.m04.d23:meMA.Ode9C2H.mode	@ltx/gr_gr_cog/miscellanea:misc.Mode2
ltx/gr_gr_cog/me.m04.d23:meMA.Ode9C2H.ode	@ltx/gr_gr_cog/miscellanea:misc.Ode9
ltx/gr_gr_cog/me.m04.d23:meMA.Ode9C2H.text	@ltx/gr_gr_cog/he.h.m2:heHE.AnarchouGennitoros.text
ltx/gr_gr_cog/me.m04.d23:meMA.Ode9C2T.incipit	Σκηνὴ προετύπου σε, τοῦ Μαρτυρίου…
ltx/gr_gr_cog/me.m04.d23:meMA.Ode9C2T.melody	@ltx/gr_gr_cog/he.h.m2:heHE.AnarchouGennitoros.name
ltx/gr_gr_cog/me.m04.d23:meMA.Ode9C2T.mode	@ltx/gr_gr_cog/miscellanea:misc.Mode2
ltx/gr_gr_cog/me.m04.d23:meMA.Ode9C2T.ode	@ltx/gr_gr_cog/miscellanea:misc.Ode9
ltx/gr_gr_cog/me.m04.d23:meMA.Ode9C2T.text	Σκηνὴ προετύπου σε, τοῦ Μαρτυρίου Πάναγνε, ἐν ᾗ πλάκες καὶ στάμνος, καὶ ἡ χρυσῆ κιβωτός· ὥσπερ γὰρ ἐκείνη ἐκεῖνα, οὕτω καὶ σύ, τὸν ἄναρχον Λόγον, ἐν γαστρὶ ἐχώρησας, Θεοτόκε σωματούμενον.
ltx/gr_gr_cog/me.m04.d23:meMA.Oikos1.text	Τὸν ὑπὲρ κόσμου τῆς ζωῆς τὴν ψυχὴν αὐτοῦ θέντα, Χριστὸν τὸν Βασιλέα, ποθῶν ὁ στρατιώτης, ὁ μέγας Γεώργιος, σπεύδει θανεῖν ὑπὲρ αὐτοῦ· ζῆλον γὰρ θεῖον ἐν καρδίᾳ ἐσχηκώς, αὐτὸς ἑαυτὸν προσήγαγε. Τοῦτον οὖν καὶ ἡμεῖς ἀνυμνήσωμεν πίστει, ὡς θερμὸν προστάτην ἡμῶν, ὡς ἔνδοξον ὄντα Χριστοῦ δοῦλον, μιμούμενον σαφῶς τὸν ἴδιον Δεσπότην, καὶ αἰτοῦντα αὐτόν, πᾶσι παρέχειν πταισμάτων συγχώρησιν.
ltx/gr_gr_cog/me.m04.d23:meMA.PostGospelBoth.incipit	@ltx/gr_gr_cog/ho.ho03:hoMA.PostGospelTheotokos.incipit
ltx/gr_gr_cog/me.m04.d23:meMA.PostGospelBoth.melody	
ltx/gr_gr_cog/me.m04.d23:meMA.PostGospelBoth.mode	@ltx/gr_gr_cog/miscellanea:misc.Mode2
ltx/gr_gr_cog/me.m04.d23:meMA.PostGospelBoth.text	@ltx/gr_gr_cog/ho.ho03:hoMA.PostGospelTheotokos.text
ltx/gr_gr_cog/me.m04.d23:meMA.PostGospelGlory.incipit	@ltx/gr_gr_cog/ho.ho03:hoMA.PostGospelMaleMartyr.incipit
ltx/gr_gr_cog/me.m04.d23:meMA.PostGospelGlory.melody	
ltx/gr_gr_cog/me.m04.d23:meMA.PostGospelGlory.mode	@ltx/gr_gr_cog/miscellanea:misc.Mode2
ltx/gr_gr_cog/me.m04.d23:meMA.PostGospelGlory.text	@ltx/gr_gr_cog/ho.ho03:hoMA.PostGospelMaleMartyr.text
ltx/gr_gr_cog/me.m04.d23:meMA.PostGospelIdiomelon.incipit	Σήμερον ἡ οἰκουμένη πᾶσα, ταῖς…
ltx/gr_gr_cog/me.m04.d23:meMA.PostGospelIdiomelon.melody	@ltx/gr_gr_cog/miscellanea:misc.Idiomelon
ltx/gr_gr_cog/me.m04.d23:meMA.PostGospelIdiomelon.mode	@ltx/gr_gr_cog/miscellanea:misc.Mode6
ltx/gr_gr_cog/me.m04.d23:meMA.PostGospelIdiomelon.text	Σήμερον ἡ οἰκουμένη πᾶσα, ταῖς τοῦ Ἀθλοφόρου αὐγάζεται ἀκτῖσι, καὶ ἡ τοῦ Χριστοῦ Ἐκκλησία, τοῖς ἄνθεσιν ὡραϊζομένη, Γεώργιε βοᾷ σοι· θεράπον Χριστοῦ, καὶ προστάτα θερμότατε, μὴ ἐλλίπῃς πρεσβεύειν ὑπὲρ ἡμῶν πρὸς Κύριον.
ltx/gr_gr_cog/me.m04.d23:meSV.AposGlory.incipit	@ltx/gr_gr_cog/me.m04.d23:meVE.Lity5.incipit
ltx/gr_gr_cog/me.m04.d23:meSV.AposGlory.melody	
ltx/gr_gr_cog/me.m04.d23:meSV.AposGlory.mode	@ltx/gr_gr_cog/miscellanea:misc.Mode4
ltx/gr_gr_cog/me.m04.d23:meSV.AposGlory.poet	@ltx/gr_gr_cog/poets:po.Anatoliou
ltx/gr_gr_cog/me.m04.d23:meSV.AposGlory.text	@ltx/gr_gr_cog/me.m04.d23:meVE.Lity5.text
ltx/gr_gr_cog/me.m04.d23:meSV.Aposticha1.incipit	Εὖγε τῆς ὑπὲρ νοῦν, χαρᾶς…
ltx/gr_gr_cog/me.m04.d23:meSV.Aposticha1.melody	@ltx/gr_gr_cog/he.a.m2:heAU.OikosTouEfratha.name
ltx/gr_gr_cog/me.m04.d23:meSV.Aposticha1.mode	@ltx/gr_gr_cog/miscellanea:misc.Mode2
ltx/gr_gr_cog/me.m04.d23:meSV.Aposticha1.text	Εὖγε τῆς ὑπὲρ νοῦν, χαρᾶς ἧς ἠξιώθης, Γεώργιε τρισμάκαρ, παρὰ Χριστοῦ τοῦ Κτίστου, ὡς Μάρτυς ἀπαράγραπτος.
ltx/gr_gr_cog/me.m04.d23:meSV.Aposticha2.incipit	Χαίροις τῶν Ἀθλητῶν, ὁ μέγας…
ltx/gr_gr_cog/me.m04.d23:meSV.Aposticha2.melody	@ltx/gr_gr_cog/he.a.m2:heAU.OikosTouEfratha.name
ltx/gr_gr_cog/me.m04.d23:meSV.Aposticha2.mode	@ltx/gr_gr_cog/miscellanea:misc.Mode2
ltx/gr_gr_cog/me.m04.d23:meSV.Aposticha2.text	Χαίροις τῶν Ἀθλητῶν, ὁ μέγας ταξιάρχης, καὶ τῶν πιστῶν ἁπάντων, προσφύγιον καὶ τεῖχος, καλλίνικε Γεώργιε.
ltx/gr_gr_cog/me.m04.d23:meSV.Aposticha3.incipit	Λύτρωσαι τῶν δεινῶν, τῶν νῦν…
ltx/gr_gr_cog/me.m04.d23:meSV.Aposticha3.melody	@ltx/gr_gr_cog/he.a.m2:heAU.OikosTouEfratha.name
ltx/gr_gr_cog/me.m04.d23:meSV.Aposticha3.mode	@ltx/gr_gr_cog/miscellanea:misc.Mode2
ltx/gr_gr_cog/me.m04.d23:meSV.Aposticha3.text	Λύτρωσαι τῶν δεινῶν, τῶν νῦν παρενοχλούντων, τὴν ταπεινὴν ψυχήν μου, ὡς ἄριστος προστάτης, Μάρτυς Χριστοῦ Γεώργιε.
ltx/gr_gr_cog/me.m04.d23:meSV.SticGlory.incipit	@ltx/gr_gr_cog/me.m04.d23:meVE.Lity3.incipit
ltx/gr_gr_cog/me.m04.d23:meSV.SticGlory.melody	
ltx/gr_gr_cog/me.m04.d23:meSV.SticGlory.mode	@ltx/gr_gr_cog/miscellanea:misc.Mode1
ltx/gr_gr_cog/me.m04.d23:meSV.SticGlory.text	@ltx/gr_gr_cog/me.m04.d23:meVE.Lity3.text
ltx/gr_gr_cog/me.m04.d23:meSV.Stichera1.incipit	Τῆς ἀληθείας τὸ ἔαρ, λαμπρῶς…
ltx/gr_gr_cog/me.m04.d23:meSV.Stichera1.melody	@ltx/gr_gr_cog/he.a.m1:heAU.TonOuranionTagmaton.name
ltx/gr_gr_cog/me.m04.d23:meSV.Stichera1.mode	@ltx/gr_gr_cog/miscellanea:misc.Mode1
ltx/gr_gr_cog/me.m04.d23:meSV.Stichera1.text	Τῆς ἀληθείας τὸ ἔαρ, λαμπρῶς ἐφέστηκε, καὶ νεουργεῖ τὴν κτίσιν, εὐσεβεῖ ἐπιγνώσει, Χριστοῦ τοῦ ζωοδότου· ὅθεν σαφῶς, φωτισθεὶς τὴν διάνοιαν, ὁ ἀθλητὴς τοῦ Κυρίου, τὴν τῶν ἐχθρῶν, κατεπάτησεν ἀπόνοιαν.
ltx/gr_gr_cog/me.m04.d23:meSV.Stichera2.incipit	Τῷ Βασιλεῖ τῶν αἰώνων, σὺ…
ltx/gr_gr_cog/me.m04.d23:meSV.Stichera2.melody	@ltx/gr_gr_cog/he.a.m1:heAU.TonOuranionTagmaton.name
ltx/gr_gr_cog/me.m04.d23:meSV.Stichera2.mode	@ltx/gr_gr_cog/miscellanea:misc.Mode1
ltx/gr_gr_cog/me.m04.d23:meSV.Stichera2.text	Τῷ Βασιλεῖ τῶν αἰώνων, σὺ ἐστρατεύσω σοφέ, καὶ παρατάξεις πάσας, καθελὼν τῶν ἀνόμων, Γεώργιε τρισμάκαρ, στεῤῥὸς ἀθλητής, ἀνεδείχθης τῇ χάριτι, τῇ ἐκ Θεοῦ σοι δοθείσῃ θαυματουργέ· διὸ πρέσβευε σωθῆναι ἡμᾶς.
ltx/gr_gr_cog/me.m04.d23:meSV.Stichera3.incipit	Ῥεῖθρα ἰάσεων νέμεις, τοῖς σοὶ…
ltx/gr_gr_cog/me.m04.d23:meSV.Stichera3.melody	@ltx/gr_gr_cog/he.a.m1:heAU.TonOuranionTagmaton.name
ltx/gr_gr_cog/me.m04.d23:meSV.Stichera3.mode	@ltx/gr_gr_cog/miscellanea:misc.Mode1
ltx/gr_gr_cog/me.m04.d23:meSV.Stichera3.text	Ῥεῖθρα ἰάσεων νέμεις, τοῖς σοὶ προστρέχουσι, Γεώργιε τρισμάκαρ, καὶ ψυχῶν καὶ σωμάτων, ἀρωγὸς σὺ ὑπάρχεις, τοῖς πίστει θερμῇ, προσιοῦσι τῇ σκέπῃ σου, ἀξιοθαύμαστε Μάρτυς τοῦ Ἰησοῦ, Ἀθλοφόρων ἐγκαλλώπισμα.
ltx/gr_gr_cog/me.m04.d23:meVE.Apolytikion1.incipit	Ὡς τῶν αἰχμαλώτων…
ltx/gr_gr_cog/me.m04.d23:meVE.Apolytikion1.melody	
ltx/gr_gr_cog/me.m04.d23:meVE.Apolytikion1.mode	@ltx/gr_gr_cog/miscellanea:misc.Mode4
ltx/gr_gr_cog/me.m04.d23:meVE.Apolytikion1.text	Ὡς τῶν αἰχμαλώτων ἐλευθερωτής, καὶ τῶν πτωχῶν ὑπερασπιστής, ἀσθενούντων ἰατρός, βασιλέων ὑπέρμαχος, Τροπαιοφόρε Μεγαλομάρτυς Γεώργιε, πρέσβευε Χριστῷ τῷ Θεῷ, σωθῆναι τὰς ψυχὰς ἡμῶν.
ltx/gr_gr_cog/me.m04.d23:meVE.AposGlory.incipit	Τὸν νοερὸν ἀδάμαντα, τῆς καρτερίας…
ltx/gr_gr_cog/me.m04.d23:meVE.AposGlory.melody	
ltx/gr_gr_cog/me.m04.d23:meVE.AposGlory.mode	@ltx/gr_gr_cog/miscellanea:misc.Mode4
ltx/gr_gr_cog/me.m04.d23:meVE.AposGlory.poet	@ltx/gr_gr_cog/poets:po.Stouditou
ltx/gr_gr_cog/me.m04.d23:meVE.AposGlory.text	Τὸν νοερὸν ἀδάμαντα, τῆς καρτερίας ἀδελφοί, πνευματικῶς εὐφημήσωμεν, Γεώργιον τὸν ἀοίδιμον Μάρτυρα, ὃν ὑπὲρ Χριστοῦ πυρούμενον, ἐχάλκευσαν κίνδυνοι, καὶ ἐστόμωσαν βάσανοι, καὶ ποικίλαι κολάσεις ἀνήλωσαν, σῶμα τὸ φύσει φθειρόμενον· ἐνίκα γὰρ ὁ πόθος τὴν φύσιν, διὰ θανάτου πείθων τὸν ἐραστήν, διαβῆναι πρός τὸν ποθούμενον, Χριστὸν τὸν Θεόν, καὶ Σωτῆρα τῶν ψυχῶν ἡμῶν.
ltx/gr_gr_cog/me.m04.d23:meVE.Aposticha1.greekmelody	@ltx/gr_gr_cog/he.a.m4:heAU.OExYpsistouKlitheis.greekname
ltx/gr_gr_cog/me.m04.d23:meVE.Aposticha1.incipit	Ἀνευφημοῦσι λαοὶ ψαλμοῖς καὶ ὕμνοις…
ltx/gr_gr_cog/me.m04.d23:meVE.Aposticha1.melody	@ltx/gr_gr_cog/he.a.m4:heAU.OExYpsistouKlitheis.name
ltx/gr_gr_cog/me.m04.d23:meVE.Aposticha1.mode	@ltx/gr_gr_cog/miscellanea:misc.Mode4
ltx/gr_gr_cog/me.m04.d23:meVE.Aposticha1.text	Ἀνευφημοῦσι λαοὶ ψαλμοῖς καὶ ὕμνοις, σοῦ τὴν παναοίδιμον, μνήμην Γεώργιε· ὡς εὐπρεπὴς γὰρ ἐξέλαμψε, καὶ φωτοφόρος, πεποικιλμένῃ δόξῃ καὶ χάριτι· ὅθεν καὶ σκιρτῶσι νῦν, Ἀγγέλων τάγματα· ἐπικροτοῦσι δὲ Μάρτυρες, σὺν Ἀποστόλοις, τῶν σῶν ἀγώνων Μάρτυς τὰ ἔπαθλα, καὶ ἀνυμνοῦσι, τὸν δοξάσαντα, σὲ Σωτῆρα Χριστόν τὸν Θεὸν ἡμῶν, ὃν ἱκέτευε σῶσαι, καὶ φωτίσαι τὰς ψυχὰς ἡμῶν.
ltx/gr_gr_cog/me.m04.d23:meVE.Aposticha2.incipit	Ἐνδεδυμένος Χριστοῦ τὴν πανοπλίαν, εὑρέθης…
ltx/gr_gr_cog/me.m04.d23:meVE.Aposticha2.melody	@ltx/gr_gr_cog/he.a.m4:heAU.OExYpsistouKlitheis.name
ltx/gr_gr_cog/me.m04.d23:meVE.Aposticha2.mode	@ltx/gr_gr_cog/miscellanea:misc.Mode4
ltx/gr_gr_cog/me.m04.d23:meVE.Aposticha2.text	Ἐνδεδυμένος Χριστοῦ τὴν πανοπλίαν, εὑρέθης Γεώργιε, τοῖς μὴ ζητοῦσί σε, ὑπὲρ Χριστοῦ πυρπολούμενος, καὶ μυκτηρίζων, θεῶν ματαίων πλάνην ψυχόλεθρον, τότε καί, στρατεύομαι, τῷ Βασιλεῖ μου Χριστῷ, τοῖς παρανόμοις ἐκραύγαζες· οὐδὲ γὰρ θῆρες, οὐδὲ τροχοί, οὐ πῦρ, οὐδὲ μάχαιρα, ἐμὲ χωρίσαι κατισχύσουσι, τῆς ἀγάπης Χριστοῦ τοῦ Θεοῦ ἡμῶν, ὃν ἱκέτευε σῶσαι, καὶ φωτίσαι τὰς ψυχὰς ἡμῶν.
ltx/gr_gr_cog/me.m04.d23:meVE.Aposticha3.incipit	Καταφρονήσας ὀργάνων πολυμόρφων, ποικίλων βασάνων…
ltx/gr_gr_cog/me.m04.d23:meVE.Aposticha3.melody	@ltx/gr_gr_cog/he.a.m4:heAU.OExYpsistouKlitheis.name
ltx/gr_gr_cog/me.m04.d23:meVE.Aposticha3.mode	@ltx/gr_gr_cog/miscellanea:misc.Mode4
ltx/gr_gr_cog/me.m04.d23:meVE.Aposticha3.text	Καταφρονήσας ὀργάνων πολυμόρφων, ποικίλων βασάνων τε, καὶ καταπέλτου φρικτοῦ, στεφανηφόρε Γεώργιε, τῆς εὐσεβείας, μαρτυρικῶς τὸν δρόμον τετέλεκας· ὅθεν τὴν ὑπέρλαμπρον, μνήμην σου ἄνθεσιν, ᾀσματικοῖς περιστέφομεν, καὶ τὰ σεπτά σου, περιπτυσσόμεθα πίστει λείψανα· ἀλλʼ ὡς τῷ θρόνῳ παριστάμενος, λαμπροφόρος Χριστοῦ τοῦ Θεοῦ ἡμῶν, καθικέτευε σῶσαι, καὶ φωτίσαι τὰς ψυχὰς ἡμῶν.
ltx/gr_gr_cog/me.m04.d23:meVE.Lity1.incipit	Ὁ λαμπρὸς ἀριστεὺς Γεώργιος, ἐν…
ltx/gr_gr_cog/me.m04.d23:meVE.Lity1.melody	
ltx/gr_gr_cog/me.m04.d23:meVE.Lity1.mode	@ltx/gr_gr_cog/miscellanea:misc.Mode1
ltx/gr_gr_cog/me.m04.d23:meVE.Lity1.poet	@ltx/gr_gr_cog/poets:po.Anatoliou
ltx/gr_gr_cog/me.m04.d23:meVE.Lity1.text	Ὁ λαμπρὸς ἀριστεὺς Γεώργιος, ἐν τῇ ἐνδόξῳ ἀθλήσει αὐτοῦ, τὰς ἄνω Δυνάμεις εὐφραίνει, καὶ σὺν αὐταῖς ἀγαλλόμενος νῦν, ἐπίγειον τοῖς πιστοῖς πανήγυριν ἤγειρε, καὶ συνεορτάζειν ἡμῖν τοῖς διʼ αὐτὸν ἠθροισμένοις, ὡς Χριστοῦ δοῦλος παραγέγονε. Διόπερ αὐτὸν ἀξίως τιμήσωμεν, ἀπαύστως πρεσβεύοντα τῷ τῶν ὅλων Θεῷ, δωρηθῆναι ἡμῖν τὸ μέγα ἔλεος.
ltx/gr_gr_cog/me.m04.d23:meVE.Lity2.incipit	Ἀριστείαις ἄθλων γεωργῶν τὰ κρείττονα…
ltx/gr_gr_cog/me.m04.d23:meVE.Lity2.melody	
ltx/gr_gr_cog/me.m04.d23:meVE.Lity2.mode	@ltx/gr_gr_cog/miscellanea:misc.Mode1
ltx/gr_gr_cog/me.m04.d23:meVE.Lity2.text	Ἀριστείαις ἄθλων γεωργῶν τὰ κρείττονα, τοὺς πόνους τῶν καρπῶν σου, τῷ Χριστῷ προσήνεγκας, παμμακάριστε Μάρτυς Γεώργιε, πίστει πόθον ἐνστησάμενος, ἐλπίδι φόβον ἀπωσάμενος, ἀγάπῃ ἐκτήσω τὰ οὐράνια πανεύφημε. Παῤῥησίαν οὖν ἔχων, εὐπροσδέκτοις δεήσεσιν, αἴτησαι ταῖς ψυχαῖς ἡμῶν τὴν εἰρήνην, ἱλασμόν τε ἁμαρτιῶν, καὶ τὸ μέγα ἔλεος.
ltx/gr_gr_cog/me.m04.d23:meVE.Lity3.incipit	Τοῦ μεγάλου Βασιλέως στρατιῶτα Γεώργιε…
ltx/gr_gr_cog/me.m04.d23:meVE.Lity3.melody	
ltx/gr_gr_cog/me.m04.d23:meVE.Lity3.mode	@ltx/gr_gr_cog/miscellanea:misc.Mode1
ltx/gr_gr_cog/me.m04.d23:meVE.Lity3.text	Τοῦ μεγάλου Βασιλέως στρατιῶτα Γεώργιε, χαῖρε καὶ εὐφραίνου· Θεῷ γὰρ εὐηρέστησας, πάντων καταφρονήσας, ζωὴν τὴν αἰώνιον εὗρες ἐν οὐρανοῖς· τὸ γὰρ σῶμά σου πᾶσαν νόσον ἐξ ἀνθρώπων ἀπελαύνει· Χριστὸς γὰρ ὃν ἐπόθησας, αὐτός σε δοξάζει μακάριε.
ltx/gr_gr_cog/me.m04.d23:meVE.Lity4.incipit	Δεῦτε φιλομάρτυρες, ᾀσματικὴν ὑμνῳδίαν, τῷ…
ltx/gr_gr_cog/me.m04.d23:meVE.Lity4.melody	
ltx/gr_gr_cog/me.m04.d23:meVE.Lity4.mode	@ltx/gr_gr_cog/miscellanea:misc.Mode4
ltx/gr_gr_cog/me.m04.d23:meVE.Lity4.text	Δεῦτε φιλομάρτυρες, ᾀσματικὴν ὑμνῳδίαν, τῷ ἀναστάντι ἐκ τάφου Χριστῷ προσάξωμεν. Σήμερον γὰρ ἔαρ νοητὸν ἀνέτειλεν ἡμῖν, περκάζον ἄνθη τὰ λογικά, ἡ παγκόσμιος μνήμη Γεωργίου τοῦ σοφοῦ Μεγαλομάρτυρος, οὗ τινος τὰ στίγματα ἀνανεοῦντες, κομιζόμεθα ἰαμάτων πηγάς. Αὐτὸν καὶ νῦν ἱκετεύσωμεν, τοῦ πρεσβεύειν ἀπαύστως τῷ Σωτῆρι Χριστῷ, εἰρήνην τῇ οἰκουμένῃ δωρήσασθαι, καὶ ταῖς ψυχαῖς ἡμῶν τὸ μέγα ἔλεος.
ltx/gr_gr_cog/me.m04.d23:meVE.Lity5.incipit	Πάντα τὰ ἔθνη κροτήσατε χεῖρας…
ltx/gr_gr_cog/me.m04.d23:meVE.Lity5.melody	
ltx/gr_gr_cog/me.m04.d23:meVE.Lity5.mode	@ltx/gr_gr_cog/miscellanea:misc.Mode4
ltx/gr_gr_cog/me.m04.d23:meVE.Lity5.poet	@ltx/gr_gr_cog/poets:po.Anatoliou
ltx/gr_gr_cog/me.m04.d23:meVE.Lity5.text	Πάντα τὰ ἔθνη κροτήσατε χεῖρας, ἀλαλάξωμεν τῷ Θεῷ τῷ Σωτῆρι ἡμῶν, ὅτι ἐν ξύλῳ ὑψωθείς, καὶ ἐν τάφῳ κατελθών, τὸν ᾍδην ἐσκύλευσε, καὶ νεκροὺς συνήγειρε, βοῶντας αὐτῷ· Ἀλληλούϊα, Ἀλληλούϊα, Ἀλληλούϊα Χριστῷ τῷ ἀναστάντι.
ltx/gr_gr_cog/me.m04.d23:meVE.Lity6.incipit	Στέφανον δόξης ἐπὶ κεφαλῆς σου…
ltx/gr_gr_cog/me.m04.d23:meVE.Lity6.melody	
ltx/gr_gr_cog/me.m04.d23:meVE.Lity6.mode	@ltx/gr_gr_cog/miscellanea:misc.Mode4
ltx/gr_gr_cog/me.m04.d23:meVE.Lity6.text	Στέφανον δόξης ἐπὶ κεφαλῆς σου ἀνεδήσω, στεφανηφόρε Γεώργιε· τὸν γὰρ ἀόρατον ἐχθρόν, ὡς ὁ Παῦλος ἐκβοᾷ, ὁρῶν ἐκαρτέρησας, νικητὴς γενόμενος τῆς πλάνης αὐτοῦ. Ἀλληλούϊα, Ἀλληλούϊα, Ἀλληλούϊα Χριστῷ τῷ ἀναστάντι.
ltx/gr_gr_cog/me.m04.d23:meVE.Lity7.incipit	ᾎσμα ᾀσμάτων χορεύοντες ἅμα, προσενέγκωμεν…
ltx/gr_gr_cog/me.m04.d23:meVE.Lity7.melody	
ltx/gr_gr_cog/me.m04.d23:meVE.Lity7.mode	@ltx/gr_gr_cog/miscellanea:misc.Mode4
ltx/gr_gr_cog/me.m04.d23:meVE.Lity7.text	ᾎσμα ᾀσμάτων χορεύοντες ἅμα, προσενέγκωμεν τῷ Χριστῷ φιλομάρτυρες, ὅτι τὸν τύραννον ἐχθρόν, ὁ γενναῖος Ἀθλητής, πτερνίσας κατέβαλε· διὸ πάντες ᾄσωμεν ἀπαύστοις φωναῖς· Δόξα Σῶτερ τῇ φρικτῇ σου ἀναστάσει, διʼ ἧς ἔσωσας τὸν κόσμον.
ltx/gr_gr_cog/me.m04.d23:meVE.LityGlory.incipit	Νευέτω δίκαια, ἔφησεν ὁ Σολομών…
ltx/gr_gr_cog/me.m04.d23:meVE.LityGlory.melody	
ltx/gr_gr_cog/me.m04.d23:meVE.LityGlory.mode	@ltx/gr_gr_cog/miscellanea:misc.Mode2
ltx/gr_gr_cog/me.m04.d23:meVE.LityGlory.poet	@ltx/gr_gr_cog/poets:po.IoannouMonachou
ltx/gr_gr_cog/me.m04.d23:meVE.LityGlory.text	Νευέτω δίκαια, ἔφησεν ὁ Σολομών, τοῖς βροτοῖς τὰ βλέφαρα· ἐλεηθήσεται γὰρ παρὰ Χριστοῦ τοῦ Θεοῦ ὁ βλέπων λεῖα, προηγόρευσεν. Εὐμαρῶς δὲ ταῦτα ἐνωτισθείς, ὦ πολύτλα Γεώργιε, τοῦ Δεσπότου ταῖς διδαχαῖς ἠκολούθησας, καὶ ἀνόμοις ἐκδοθεὶς ἐκαρτέρησας, τῆς πλάνης τὰ ὄργια καταπτύσας ὡς βέβηλα· τὸ σῶμα γὰρ ὃ παρέδωκας, ὑπὲρ ἀγάπης τοῦ πλάσαντος, ὅλον μεληδὸν κατετέμνετο· καὶ ὁ Βελίαρ μᾶλλον, ὅλος αἰσχυνθεὶς ἐτιτρώσκετο, στεφηφόρον σε ὁρῶν ἀκμαιότατον. Ὅθεν ἐν αὐλαῖς οἰκῶν τοῦ Κυρίου σου, σὺν ταῖς ἄνω Δυνάμεσι, πρέσβευε ἀθλοφόρε Χριστῷ, σωθῆναι τὰς ψυχὰς ἡμῶν.
ltx/gr_gr_cog/me.m04.d23:meVE.MM.Stichera1234as5678.text	@ltx/gr_gr_cog/properties:media.key
ltx/gr_gr_cog/me.m04.d23:meVE.MM.Stichera1234as78910.text	@ltx/gr_gr_cog/properties:media.key
ltx/gr_gr_cog/me.m04.d23:meVE.SticGlory.incipit	Ἀξίως τοῦ ὀνόματος, ἐπολιτεύσω στρατιῶτα…
ltx/gr_gr_cog/me.m04.d23:meVE.SticGlory.melody	
ltx/gr_gr_cog/me.m04.d23:meVE.SticGlory.mode	@ltx/gr_gr_cog/miscellanea:misc.Mode6
ltx/gr_gr_cog/me.m04.d23:meVE.SticGlory.text	Ἀξίως τοῦ ὀνόματος, ἐπολιτεύσω στρατιῶτα Γεώργιε· τὸν σταυρὸν γὰρ τοῦ Χριστοῦ, ἐπʼ ὤμων ἀράμενος, τὴν ἐκ διαβολικῆς πλάνης χερσωθεῖσαν γῆν ἐκαλλιέργησας, καὶ τὴν ἀκανθώδη θρησκείαν τῶν εἰδώλων ἐκριζώσας, τῆς Ὀρθοδόξου Πίστεως κλῆμα κατεφύτευσας· ὅθεν βλυστάνεις ἰάματα, τοῖς ἐν πάσῃ τῇ οἰκουμένῃ πιστοῖς, καὶ Τριάδος γεωργός, δίκαιος ἀνεδείχθης· Πρέσβευε δεόμεθα, ὑπὲρ εἰρήνης τοῦ κόσμου, καὶ σωτηρίας τῶν ψυχῶν ἡμῶν.
ltx/gr_gr_cog/me.m04.d23:meVE.Stichera01.greekmelody	@ltx/gr_gr_cog/he.a.m4:heAU.OsGennaionEnMartysi.greekname
ltx/gr_gr_cog/me.m04.d23:meVE.Stichera01.incipit	@ltx/gr_gr_cog/he.a.m4:heAU.OsGennaionEnMartysi.incipit
ltx/gr_gr_cog/me.m04.d23:meVE.Stichera01.melody	@ltx/gr_gr_cog/he.a.m4:heAU.OsGennaionEnMartysi.melody
ltx/gr_gr_cog/me.m04.d23:meVE.Stichera01.mode	@ltx/gr_gr_cog/miscellanea:misc.Mode4
ltx/gr_gr_cog/me.m04.d23:meVE.Stichera01.text	@ltx/gr_gr_cog/he.a.m4:heAU.OsGennaionEnMartysi.text
ltx/gr_gr_cog/me.m04.d23:meVE.Stichera02.incipit	Ῥωμαλέῳ φρονήματι, πεποιθὼς ηὐτομόλησας, ὥσπερ…
ltx/gr_gr_cog/me.m04.d23:meVE.Stichera02.melody	@ltx/gr_gr_cog/he.a.m4:heAU.OsGennaionEnMartysi.name
ltx/gr_gr_cog/me.m04.d23:meVE.Stichera02.mode	@ltx/gr_gr_cog/miscellanea:misc.Mode4
ltx/gr_gr_cog/me.m04.d23:meVE.Stichera02.text	Ῥωμαλέῳ φρονήματι, πεποιθὼς ηὐτομόλησας, ὥσπερ λέων ἔνδοξε, πρὸς τὴν ἄθλησιν, ὑπερορῶν μὲν τοῦ σώματος, ὡς φθείρεσθαι μέλλοντος, τῆς ἀφθάρτου δὲ ψυχῆς, σοφῶς ἐπιμελούμενος, καὶ κολάσεων, πολυτρόποις ἰδέαις ἐπυρώθης, ὡς χρυσὸς κεκαθαρμένος, ἑπταπλασίως Γεώργιε.
ltx/gr_gr_cog/me.m04.d23:meVE.Stichera03.incipit	Τῷ Σωτῆρι συνέπαθες, καὶ θανάτῳ…
ltx/gr_gr_cog/me.m04.d23:meVE.Stichera03.melody	@ltx/gr_gr_cog/he.a.m4:heAU.OsGennaionEnMartysi.name
ltx/gr_gr_cog/me.m04.d23:meVE.Stichera03.mode	@ltx/gr_gr_cog/miscellanea:misc.Mode4
ltx/gr_gr_cog/me.m04.d23:meVE.Stichera03.text	Τῷ Σωτῆρι συνέπαθες, καὶ θανάτῳ τὸν θάνατον, ἑκουσίως ἔνδοξε μιμησάμενος, συμβασιλεύεις λαμπρότατα, πορφύραν ἐξ αἵματος, ἐνδυσάμενος φαιδράν, καὶ τῷ σκήπτρῳ τῶν ἄθλων σου, ἐγκοσμούμενος, καὶ στεφάνῳ τῆς νίκης διαπρέπων, ἀπεράντους εἰς αἰῶνας, Μεγαλομάρτυς Γεώργιε.
ltx/gr_gr_cog/me.m04.d23:meVE.Stichera04.greekmelody	@ltx/gr_gr_cog/he.a.m4:heAU.OsGennaionEnMartysi.greekname
ltx/gr_gr_cog/me.m04.d23:meVE.Stichera04.incipit	Τῷ τῆς πίστεως θώρακι, καὶ…
ltx/gr_gr_cog/me.m04.d23:meVE.Stichera04.melody	@ltx/gr_gr_cog/he.a.m4:heAU.OsGennaionEnMartysi.name
ltx/gr_gr_cog/me.m04.d23:meVE.Stichera04.mode	@ltx/gr_gr_cog/miscellanea:misc.Mode4
ltx/gr_gr_cog/me.m04.d23:meVE.Stichera04.text	Τῷ τῆς πίστεως θώρακι, καὶ ἀσπίδι τῆς χάριτος, καὶ Σταυροῦ τῷ δόρατι, συμφραξάμενος, τοῖς ἐναντίοις ἀνάλωτος, ἐγένου Γεώργιε, καὶ ὡς θεῖος ἀριστεύς, τῶν δαιμόνων τὰς φάλαγγας, τροπωσάμενος, σὺν Ἀγγέλοις χορεύεις, τοὺς πιστοὺς δέ, περιέπων ἁγιάζεις, καὶ διασῴζεις καλούμενος.
ltx/gr_gr_cog/me.m04.d23:meVE.Stichera05.incipit	Ὡς ἀστέρα πολύφωτον, ὥσπερ ἥλιον…
ltx/gr_gr_cog/me.m04.d23:meVE.Stichera05.melody	@ltx/gr_gr_cog/he.a.m4:heAU.OsGennaionEnMartysi.name
ltx/gr_gr_cog/me.m04.d23:meVE.Stichera05.mode	@ltx/gr_gr_cog/miscellanea:misc.Mode4
ltx/gr_gr_cog/me.m04.d23:meVE.Stichera05.text	Ὡς ἀστέρα πολύφωτον, ὥσπερ ἥλιον λάμποντα, ἐν τῷ στερεώματι, σὲ γινώσκομεν. Ὡς μαργαρίτην πολύτιμον, ὡς λίθον αὐγάζοντα, ὡς ἡμέρας σε υἱόν, ὡς γενναῖον ἐν Μάρτυσιν, ὡς ὑπέρμαχον, τῶν πιστῶν ἐν κινδύνοις εὐφημοῦμεν, ἐκτελοῦντές σου τὴν μνήμην, τροπαιοφόρε Γεώργιε.
ltx/gr_gr_cog/me.m04.d23:meVE.Stichera06.incipit	Ἐν θαλάσσῃ με πλέοντα, ἐν…
ltx/gr_gr_cog/me.m04.d23:meVE.Stichera06.melody	@ltx/gr_gr_cog/he.a.m4:heAU.OsGennaionEnMartysi.name
ltx/gr_gr_cog/me.m04.d23:meVE.Stichera06.mode	@ltx/gr_gr_cog/miscellanea:misc.Mode4
ltx/gr_gr_cog/me.m04.d23:meVE.Stichera06.text	Ἐν θαλάσσῃ με πλέοντα, ἐν ὁδῷ με βαδίζοντα, ἐν νυκτὶ καθεύδοντα περιφρούρησον· ἐπαγρυπνοῦντα διάσωσον, παμμάκαρ Γεώργιε· καὶ ἀξίωσον ποιεῖν, τοῦ Κυρίου τὸ θέλημα, ὅπως εὕροιμι, ἐν ἡμέρᾳ τῆς δίκης τῶν ἐν βίῳ, πεπραγμένων μοι τὴν λύσιν, ὁ προσδραμὼν ἐν τῇ σκέπῃ σου.
