ltx/gr_gr_cog/ty.m01.d14:tyCommemoration.text	
ltx/gr_gr_cog/ty.m01.d14:tyDate.text	
ltx/gr_gr_cog/ty.m01.d14:tyLI.AfterCommunion.text	
ltx/gr_gr_cog/ty.m01.d14:tyLI.AmboPrayer.text	
ltx/gr_gr_cog/ty.m01.d14:tyLI.Antiphons.text	
ltx/gr_gr_cog/ty.m01.d14:tyLI.Apolytikia.text	
ltx/gr_gr_cog/ty.m01.d14:tyLI.CommunionHymn.text	
ltx/gr_gr_cog/ty.m01.d14:tyLI.Dismissal.text	
ltx/gr_gr_cog/ty.m01.d14:tyLI.EntranceHymn.text	
ltx/gr_gr_cog/ty.m01.d14:tyLI.Epistle.text	
ltx/gr_gr_cog/ty.m01.d14:tyLI.Gospel.text	
ltx/gr_gr_cog/ty.m01.d14:tyLI.Kontakion.text	
ltx/gr_gr_cog/ty.m01.d14:tyLI.Megalynarion.text	
ltx/gr_gr_cog/ty.m01.d14:tyLI.TheotokosHymn.text	
ltx/gr_gr_cog/ty.m01.d14:tyMA.Anavathmoi.text	
ltx/gr_gr_cog/ty.m01.d14:tyMA.Apolytikia.text	
ltx/gr_gr_cog/ty.m01.d14:tyMA.Canons.text	
ltx/gr_gr_cog/ty.m01.d14:tyMA.Doxology.text	
ltx/gr_gr_cog/ty.m01.d14:tyMA.EndApolytikion.text	
ltx/gr_gr_cog/ty.m01.d14:tyMA.Exaposteilaria.text	
ltx/gr_gr_cog/ty.m01.d14:tyMA.Katavasias.text	
ltx/gr_gr_cog/ty.m01.d14:tyMA.Kathismata.text	
ltx/gr_gr_cog/ty.m01.d14:tyMA.KontakionOikos.text	
ltx/gr_gr_cog/ty.m01.d14:tyMA.Lauds.text	
ltx/gr_gr_cog/ty.m01.d14:tyMA.LaudsBoth.text	
ltx/gr_gr_cog/ty.m01.d14:tyMA.LaudsGlory.text	
ltx/gr_gr_cog/ty.m01.d14:tyMA.LaudsVerses.text	
ltx/gr_gr_cog/ty.m01.d14:tyMA.Magnificat.text	
ltx/gr_gr_cog/ty.m01.d14:tyMA.MatinsGospel.text	
ltx/gr_gr_cog/ty.m01.d14:tyMA.MidodeKath.text	
ltx/gr_gr_cog/ty.m01.d14:tyMA.MidodeKontakion.text	
ltx/gr_gr_cog/ty.m01.d14:tyMA.Ode9_1.text	
ltx/gr_gr_cog/ty.m01.d14:tyMA.Ode9_2.text	
ltx/gr_gr_cog/ty.m01.d14:tyMA.Ode9_3.text	
ltx/gr_gr_cog/ty.m01.d14:tyMA.Ode9_4.text	
ltx/gr_gr_cog/ty.m01.d14:tyMA.Ode9_5.text	
ltx/gr_gr_cog/ty.m01.d14:tyMA.Ode9_6.text	
ltx/gr_gr_cog/ty.m01.d14:tyMA.Ode9_7.text	
ltx/gr_gr_cog/ty.m01.d14:tyMA.Ode9_8.text	
ltx/gr_gr_cog/ty.m01.d14:tyMA.Ode9_Katavasia1.text	
ltx/gr_gr_cog/ty.m01.d14:tyMA.Ode9_Katavasia2.text	
ltx/gr_gr_cog/ty.m01.d14:tyMA.ProkVerse.text	
ltx/gr_gr_cog/ty.m01.d14:tyMA.Prokeimenon.text	
ltx/gr_gr_cog/ty.m01.d14:tyMA.Psalm50.text	
ltx/gr_gr_cog/ty.m01.d14:tyMA.Synaxarion.text	
ltx/gr_gr_cog/ty.m01.d14:tyMO.Rubric1.text	
ltx/gr_gr_cog/ty.m01.d14:tyNote1.text	
ltx/gr_gr_cog/ty.m01.d14:tyVE.Apolytikia.text	
ltx/gr_gr_cog/ty.m01.d14:tyVE.AposBoth.text	
ltx/gr_gr_cog/ty.m01.d14:tyVE.AposGlory.text	
ltx/gr_gr_cog/ty.m01.d14:tyVE.AposGloryBoth.text	
ltx/gr_gr_cog/ty.m01.d14:tyVE.Aposticha.text	
ltx/gr_gr_cog/ty.m01.d14:tyVE.Dismissal.text	
ltx/gr_gr_cog/ty.m01.d14:tyVE.Entrance.text	
ltx/gr_gr_cog/ty.m01.d14:tyVE.Intro.text	
ltx/gr_gr_cog/ty.m01.d14:tyVE.LIHC.text	
ltx/gr_gr_cog/ty.m01.d14:tyVE.Note1.text	
ltx/gr_gr_cog/ty.m01.d14:tyVE.Note2.text	
ltx/gr_gr_cog/ty.m01.d14:tyVE.SticBoth.text	
ltx/gr_gr_cog/ty.m01.d14:tyVE.SticGlory.text	
ltx/gr_gr_cog/ty.m01.d14:tyVE.SticGloryBoth.text	
ltx/gr_gr_cog/ty.m01.d14:tyVE.Stichera.text	
