ltx/gr_gr_cog/le.ep.me.m08.d20:lemeLI.Epistle.book_abbr	@ltx/gr_gr_cog/le.ep.mc.d238:lemcLI.Epistle.book_abbr
ltx/gr_gr_cog/le.ep.me.m08.d20:lemeLI.Epistle.book_string	@ltx/gr_gr_cog/le.ep.mc.d238:lemcLI.Epistle.book_string
ltx/gr_gr_cog/le.ep.me.m08.d20:lemeLI.Epistle.chapverse	@ltx/gr_gr_cog/le.ep.mc.d238:lemcLI.Epistle.chapverse
ltx/gr_gr_cog/le.ep.me.m08.d20:lemeLI.Epistle.incipit	@ltx/gr_gr_cog/le.ep.mc.d238:lemcLI.Epistle.incipit
ltx/gr_gr_cog/le.ep.me.m08.d20:lemeLI.Epistle.text	@ltx/gr_gr_cog/le.ep.mc.d238:lemcLI.Epistle.text
ltx/gr_gr_cog/le.ep.me.m08.d20:lemeLI.Epistle.title	Τοῦ Προφήτου
ltx/gr_gr_cog/le.ep.me.m08.d20:lemeLI.Epistle.title_abbr	Τοῦ Προφήτου
ltx/gr_gr_cog/le.ep.me.m08.d20:lemeLI.Epistle.version	@ltx/gr_gr_cog/le.ep.mc.d238:lemcLI.Epistle.version
