ltx/gr_gr_cog/le.ep.mc.d230:lemcLI.Epistle.book_abbr	@ltx/gr_gr_cog/bible:Ephesians.abbr
ltx/gr_gr_cog/le.ep.mc.d230:lemcLI.Epistle.book_string	@ltx/gr_gr_cog/bible:Ephesians.text
ltx/gr_gr_cog/le.ep.mc.d230:lemcLI.Epistle.chapverse	1:7 – 17
ltx/gr_gr_cog/le.ep.mc.d230:lemcLI.Epistle.incipit	Ἔχομεν τὴν ἀπολύτρωσιν διὰ τοῦ αἵματος τοῦ Χριστοῦ…
ltx/gr_gr_cog/le.ep.mc.d230:lemcLI.Epistle.text	Ἀδελφοί, ἔχομεν τὴν ἀπολύτρωσιν διὰ τοῦ αἵματος τοῦ Χριστοῦ, τὴν ἄφεσιν τῶν παραπτωμάτων, κατὰ τὸν πλοῦτον τῆς χάριτος αὐτοῦ, ἧς ἐπερίσσευσεν εἰς ἡμᾶς ἐν πάσῃ σοφίᾳ καὶ φρονήσει, γνωρίσας ἡμῖν τὸ μυστήριον τοῦ θελήματος αὐτοῦ κατὰ τὴν εὐδοκίαν αὐτοῦ, ἣν προέθετο ἐν αὐτῷ εἰς οἰκονομίαν τοῦ πληρώματος τῶν καιρῶν, ἀνακεφαλαιώσασθαι τὰ πάντα ἐν τῷ Χριστῷ, τὰ ἐπὶ τοῖς οὐρανοῖς καὶ τὰ ἐπὶ τῆς γῆς, ἐν αὐτῷ, ἐν ᾧ καὶ ἐκληρώθημεν προορισθέντες κατὰ πρόθεσιν τοῦ τὰ πάντα ἐνεργοῦντος κατὰ τὴν βουλὴν τοῦ θελήματος αὐτοῦ, εἰς τὸ εἶναι ἡμᾶς εἰς ἔπαινον δόξης αὐτοῦ, τοὺς προηλπικότας ἐν τῷ Χριστῷ· ἐν ᾧ καὶ ὑμεῖς ἀκούσαντες τὸν λόγον τῆς ἀληθείας, τὸ εὐαγγέλιον τῆς σωτηρίας ὑμῶν, ἐν ᾧ καὶ πιστεύσαντες ἐσφραγίσθητε τῷ Πνεύματι τῆς ἐπαγγελίας τῷ Ἁγίῳ, ὅς ἐστιν ἀρραβὼν τῆς κληρονομίας ἡμῶν, εἰς ἀπολύτρωσιν τῆς περιποιήσεως, εἰς ἔπαινον τῆς δόξης αὐτοῦ. Διὰ τοῦτο κἀγώ, ἀκούσας τὴν καθ᾽ ὑμᾶς πίστιν ἐν τῷ Κυρίῳ Ἰησοῦ καὶ τὴν ἀγάπην τὴν εἰς πάντας τοὺς ἁγίους, οὐ παύομαι εὐχαριστῶν ὑπὲρ ὑμῶν μνείαν ὑμῶν ποιούμενος ἐπὶ τῶν προσευχῶν μου, ἵνα ὁ Θεὸς τοῦ Κυρίου ἡμῶν Ἰησοῦ Χριστοῦ, ὁ πατὴρ τῆς δόξης, δῴη ὑμῖν πνεῦμα σοφίας καὶ ἀποκαλύψεως ἐν ἐπιγνώσει αὐτοῦ.
ltx/gr_gr_cog/le.ep.mc.d230:lemcLI.Epistle.title	Τῇ Παρασκευῇ τῆς ΙϚʹ Ἑβδομάδος
ltx/gr_gr_cog/le.ep.mc.d230:lemcLI.Epistle.title_abbr	Παρασκευῇ τῆς ΙϚʹ Ἑβδομάδος
ltx/gr_gr_cog/le.ep.mc.d230:lemcLI.Epistle.version	@ltx/gr_gr_cog/properties:version.designation
