ltx/gr_gr_cog/le.go.mc.d152:lemcLI.Gospel.book_abbr	@ltx/gr_gr_cog/bible:Matthew.abbr
ltx/gr_gr_cog/le.go.mc.d152:lemcLI.Gospel.book_string	@ltx/gr_gr_cog/bible:Matthew.text
ltx/gr_gr_cog/le.go.mc.d152:lemcLI.Gospel.chapverse	12:46 – 50, 13:1 – 3
ltx/gr_gr_cog/le.go.mc.d152:lemcLI.Gospel.incipit	Λαλοῦντος τοῦ Ἰησοῦ τοῖς ὄχλοις…
ltx/gr_gr_cog/le.go.mc.d152:lemcLI.Gospel.text	Τῷ καιρῷ ἐκείνῳ λαλοῦντος τοῦ Ἰησοῦ τοῖς ὄχλοις ἰδοὺ ἡ μήτηρ καὶ οἱ ἀδελφοὶ αὐτοῦ εἱστήκεισαν ἔξω, ζητοῦντες λαλῆσαι αὐτῷ. εἶπε δέ τις αὐτῷ· ἰδοὺ ἡ μήτηρ σου καὶ οἱ ἀδελφοί σου ἑστήκασιν ἔξω ζητοῦντές σε ἰδεῖν. ὁ δὲ ἀποκριθεὶς εἶπε τῷ λέγοντι αὐτῷ· τίς ἐστιν ἡ μήτηρ μου καὶ τίνες εἰσὶν οἱ ἀδελφοί μου; καὶ ἐκτείνας τὴν χεῖρα αὐτοῦ ἐπὶ τοὺς μαθητὰς αὐτοῦ ἔφη· ἰδοὺ ἡ μήτηρ μου καὶ οἱ ἀδελφοί μου· ὅστις γὰρ ἂν ποιήσῃ τὸ θέλημα τοῦ πατρός μου τοῦ ἐν οὐρανοῖς, αὐτός μου ἀδελφὸς καὶ ἀδελφὴ καὶ μήτηρ ἐστίν. Ἐν δὲ τῇ ἡμέρᾳ ἐκείνῃ ἐξελθὼν ὁ Ἰησοῦς τῆς οἰκίας ἐκάθητο παρὰ τὴν θάλασσαν· καὶ συνήχθησαν πρὸς αὐτὸν ὄχλοι πολλοί, ὥστε αὐτὸν εἰς πλοῖον ἐμβάντα καθῆσθαι, καὶ πᾶς ὁ ὄχλος ἐπὶ τὸν αἰγιαλὸν εἱστήκει. καὶ ἐλάλησεν αὐτοῖς πολλὰ ἐν παραβολαῖς.
ltx/gr_gr_cog/le.go.mc.d152:lemcLI.Gospel.title	Τῇ Πέμπτῃ τῆς Εʹ Ἑβδομάδος τοῦ Ματθαίου
ltx/gr_gr_cog/le.go.mc.d152:lemcLI.Gospel.title_abbr	Πέμπτῃ τῆς Εʹ Ἑβδομάδος
ltx/gr_gr_cog/le.go.mc.d152:lemcLI.Gospel.version	@ltx/gr_gr_cog/properties:version.designation
