ltx/gr_gr_cog/le.ep.mc.d096:lemcLI.Epistle.book_abbr	@ltx/gr_gr_cog/bible:Acts.abbr
ltx/gr_gr_cog/le.ep.mc.d096:lemcLI.Epistle.book_string	@ltx/gr_gr_cog/bible:Acts.text
ltx/gr_gr_cog/le.ep.mc.d096:lemcLI.Epistle.chapverse	10:34 – 43
ltx/gr_gr_cog/le.ep.mc.d096:lemcLI.Epistle.incipit	Ἀνοίξας Πέτρος τὸ στόμα αὐτοῦ…
ltx/gr_gr_cog/le.ep.mc.d096:lemcLI.Epistle.text	Ἐν ταῖς ἡμέραις ἐκείναις, ἀνοίξας Πέτρος τὸ στόμα αὐτοῦ εἶπεν· ἐπ᾿ ἀληθείας καταλαμβάνομαι ὅτι οὐκ ἔστι προσωπολήπτης ὁ Θεός, ἀλλ᾿ ἐν παντὶ ἔθνει ὁ φοβούμενος αὐτὸν καὶ ἐργαζόμενος δικαιοσύνην δεκτὸς αὐτῷ ἐστι. τὸν λόγον ὃν ἀπέστειλε τοῖς υἱοῖς Ἰσραὴλ εὐαγγελιζόμενος εἰρήνην διὰ Ἰησοῦ Χριστοῦ· οὗτός ἐστι πάντων Κύριος· ὑμεῖς οἴδατε τὸ γενόμενον ῥῆμα καθ᾿ ὅλης τῆς Ἰουδαίας, ἀρξάμενον ἀπὸ τῆς Γαλιλαίας μετὰ τὸ βάπτισμα ὃ ἐκήρυξεν Ἰωάννης, Ἰησοῦν τὸν ἀπὸ Ναζαρέτ, ὡς ἔχρισεν αὐτὸν ὁ Θεὸς Πνεύματι Ἁγίῳ καὶ δυνάμει, ὃς διῆλθεν εὐεργετῶν καὶ ἰώμενος πάντας τοὺς καταδυναστευομένους ὑπὸ τοῦ διαβόλου, ὅτι ὁ Θεὸς ἦν μετ᾿ αὐτοῦ· καὶ ἡμεῖς ἐσμεν μάρτυρες πάντων ὧν ἐποίησεν ἔν τε τῇ χώρᾳ τῶν Ἰουδαίων καὶ ἐν Ἱερουσαλήμ· ὃν καὶ ἀνεῖλον κρεμάσαντες ἐπὶ ξύλου. τοῦτον ὁ Θεὸς ἤγειρε τῇ τρίτῃ ἡμέρᾳ καὶ ἔδωκεν αὐτὸν ἐμφανῆ γενέσθαι, οὐ παντὶ τῷ λαῷ, ἀλλὰ μάρτυσι τοῖς προκεχειροτονημένοις ὑπὸ τοῦ Θεοῦ, ἡμῖν, οἵτινες συνεφάγομεν καὶ συνεπίομεν αὐτῷ μετὰ τὸ ἀναστῆναι αὐτὸν ἐκ νεκρῶν· καὶ παρήγγειλεν ἡμῖν κηρῦξαι τῷ λαῷ καὶ διαμαρτύρασθαι ὅτι αὐτός ἐστιν ὁ ὡρισμένος ὑπὸ τοῦ Θεοῦ κριτὴς ζώντων καὶ νεκρῶν. τούτῳ πάντες οἱ προφῆται μαρτυροῦσιν, ἄφεσιν ἁμαρτιῶν λαβεῖν διὰ τοῦ ὀνόματος αὐτοῦ πάντα τὸν πιστεύοντα εἰς αὐτόν.
ltx/gr_gr_cog/le.ep.mc.d096:lemcLI.Epistle.title	Τῇ Πέμτῃ τῆς Δʹ Ἑβδομάδος
ltx/gr_gr_cog/le.ep.mc.d096:lemcLI.Epistle.title_abbr	Πέμτῃ τῆς Δʹ Ἑβδομάδος
ltx/gr_gr_cog/le.ep.mc.d096:lemcLI.Epistle.version	@ltx/gr_gr_cog/properties:version.designation
