ltx/gr_gr_cog/pe.d087:peDA.commemoration.full	
ltx/gr_gr_cog/pe.d087:peDA.commemoration.short	Τρίτη τῆς Γʹ Ἑβδομάδος
ltx/gr_gr_cog/pe.d087:peDA.dismissal	@ltx/gr_gr_cog/dismissals:dis00.resurrection
ltx/gr_gr_cog/pe.d087:peDA.insert1	
ltx/gr_gr_cog/pe.d087:peDA.insert2	
ltx/gr_gr_cog/pe.d087:peDA.note	
ltx/gr_gr_cog/pe.d087:peHO.commemorations	
ltx/gr_gr_cog/pe.d087:peHO.daytitle	
ltx/gr_gr_cog/pe.d087:peHO.description1	
ltx/gr_gr_cog/pe.d087:peHO.description2	
ltx/gr_gr_cog/pe.d087:peHO.note1	
ltx/gr_gr_cog/pe.d087:peHO.note2	
ltx/gr_gr_cog/pe.d087:peMA.AposGlory.incipit	@ltx/gr_gr_cog/pe.d085:peVE.Lity2.incipit
ltx/gr_gr_cog/pe.d087:peMA.AposGlory.melody	@ltx/gr_gr_cog/miscellanea:misc.Idiomelon
ltx/gr_gr_cog/pe.d087:peMA.AposGlory.mode	@ltx/gr_gr_cog/miscellanea:misc.Mode1
ltx/gr_gr_cog/pe.d087:peMA.AposGlory.text	@ltx/gr_gr_cog/pe.d085:peVE.Lity2.text
ltx/gr_gr_cog/pe.d087:peMA.Aposticha1.greekmelody	@ltx/gr_gr_cog/he.a.m2:heAU.OteEkTouXylou.greekname
ltx/gr_gr_cog/pe.d087:peMA.Aposticha1.incipit	Σέλας τὸ τρισήλιον ἐν γῇ…
ltx/gr_gr_cog/pe.d087:peMA.Aposticha1.melody	@ltx/gr_gr_cog/he.a.m2:heAU.OteEkTouXylou.name
ltx/gr_gr_cog/pe.d087:peMA.Aposticha1.mode	@ltx/gr_gr_cog/miscellanea:misc.Mode2
ltx/gr_gr_cog/pe.d087:peMA.Aposticha1.text	Σέλας τὸ τρισήλιον ἐν γῇ, σήμερον φαιδρῶς ἐξαστράπτει καὶ ζόφον αἴρει παθῶν· φαίνει ἡ Ἀνάστασις, Χριστοῦ, φρουροῦσα πιστούς· Ἀποστόλων χορεύουσι, τὰ τάγματα πόθῳ· Ἰωσὴφ εὐφραίνεται· καὶ Μυροφόρων σεπτῶν, μνήμη ἡ φαιδρὰ καταστέφει, τοὺς αὐτὰς πιστῶς εὐφημοῦντας, καὶ τὴν θείαν Ἔγερσιν δοξάζοντας.
ltx/gr_gr_cog/pe.d087:peMA.Aposticha2.incipit	Ἄρας ἐπὶ ὤμων Ἰωσήφ, τὸν…
ltx/gr_gr_cog/pe.d087:peMA.Aposticha2.melody	@ltx/gr_gr_cog/he.a.m2:heAU.OteEkTouXylou.name
ltx/gr_gr_cog/pe.d087:peMA.Aposticha2.mode	@ltx/gr_gr_cog/miscellanea:misc.Mode2
ltx/gr_gr_cog/pe.d087:peMA.Aposticha2.text	Ἄρας ἐπὶ ὤμων Ἰωσήφ, τὸν ἐν δεξιᾷ τῇ πατρῴᾳ, Υἱὸν καθήμενον, μύρον τὸ ἀκένωτον, μύροις ἐκήδευσας· τὴν τοῦ κόσμου ἀνάστασιν, προτέθεικας τάφῳ· τὸν ἀναβαλλόμενον φῶς ὡς ἱμάτιον, λίθῳ συγκαλύπτεις ἀφράστως· Ὅθεν τούτου μέλπωμεν ὕμνοις, τὰ φωσφόρα Πάθη καὶ τὴν Ἔγερσιν.
ltx/gr_gr_cog/pe.d087:peMA.Aposticha3.incipit	Φρίττει τῶν Ἀγγέλων ἡ πληθύς…
ltx/gr_gr_cog/pe.d087:peMA.Aposticha3.melody	@ltx/gr_gr_cog/he.a.m2:heAU.OteEkTouXylou.name
ltx/gr_gr_cog/pe.d087:peMA.Aposticha3.mode	@ltx/gr_gr_cog/miscellanea:misc.Mode2
ltx/gr_gr_cog/pe.d087:peMA.Aposticha3.text	Φρίττει τῶν Ἀγγέλων ἡ πληθύς, σὲ ὦ Ἰωσὴφ καθορῶσα, Χριστὸν κηδεύοντα· κόσμος μακαρίζει σε· πιστοὶ θαυμάζομεν· τὴν σεπτήν τε Ἀνάστασιν, τιμῶντες ἐνθέως, σὺν ταῖς Μυροφόροις σε, θερμῶς γεραίρομεν· ὅθεν, καὶ βοῶμεν ἀπαύστως· Πρέσβευε σὺν ταύταις σωθῆναι, καὶ ἡμᾶς κινδύνων τε καὶ θλίψεων.
ltx/gr_gr_cog/pe.d087:peMA.Kathisma11.incipit	@ltx/gr_gr_cog/pe.d085:peMA.Kathisma12.incipit
ltx/gr_gr_cog/pe.d087:peMA.Kathisma11.melody	@ltx/gr_gr_cog/oc.m2.d1:ocMA.Kathisma21.melody
ltx/gr_gr_cog/pe.d087:peMA.Kathisma11.mode	@ltx/gr_gr_cog/miscellanea:misc.Mode2
ltx/gr_gr_cog/pe.d087:peMA.Kathisma11.text	@ltx/gr_gr_cog/pe.d085:peMA.Kathisma12.text
ltx/gr_gr_cog/pe.d087:peMA.Kathisma12.incipit	@ltx/gr_gr_cog/oc.m2.d2:ocMA.Kathisma12.incipit
ltx/gr_gr_cog/pe.d087:peMA.Kathisma12.melody	
ltx/gr_gr_cog/pe.d087:peMA.Kathisma12.mode	@ltx/gr_gr_cog/miscellanea:misc.Mode2
ltx/gr_gr_cog/pe.d087:peMA.Kathisma12.text	@ltx/gr_gr_cog/oc.m2.d2:ocMA.Kathisma12.text
ltx/gr_gr_cog/pe.d087:peMA.Kathisma13.incipit	@ltx/gr_gr_cog/oc.m2.d3:ocMA.Kathisma32.incipit
ltx/gr_gr_cog/pe.d087:peMA.Kathisma13.melody	
ltx/gr_gr_cog/pe.d087:peMA.Kathisma13.mode	@ltx/gr_gr_cog/miscellanea:misc.Mode2
ltx/gr_gr_cog/pe.d087:peMA.Kathisma13.text	@ltx/gr_gr_cog/oc.m2.d3:ocMA.Kathisma32.text
ltx/gr_gr_cog/pe.d087:peMA.Kathisma1T.incipit	Τοὺς νόμους λαθοῦσα τῆς φύσεως…
ltx/gr_gr_cog/pe.d087:peMA.Kathisma1T.melody	
ltx/gr_gr_cog/pe.d087:peMA.Kathisma1T.mode	@ltx/gr_gr_cog/miscellanea:misc.Mode2
ltx/gr_gr_cog/pe.d087:peMA.Kathisma1T.text	Τοὺς νόμους λαθοῦσα τῆς φύσεως, τῷ θείῳ τόκῳ τὴν παρθενίαν συνήρμοσας· μόνη γὰρ ἔτεκες τὸν πρὸ σοῦ γεννηθέντα ἀχρόνως· διό σε Θεοτόκε μεγαλύνομεν.
ltx/gr_gr_cog/pe.d087:peMA.Kathisma21.incipit	@ltx/gr_gr_cog/pe.d085:peMA.Kathisma21.incipit
ltx/gr_gr_cog/pe.d087:peMA.Kathisma21.melody	
ltx/gr_gr_cog/pe.d087:peMA.Kathisma21.mode	@ltx/gr_gr_cog/miscellanea:misc.Mode2
ltx/gr_gr_cog/pe.d087:peMA.Kathisma21.text	@ltx/gr_gr_cog/pe.d085:peMA.Kathisma21.text
ltx/gr_gr_cog/pe.d087:peMA.Lauds1.incipit	@ltx/gr_gr_cog/oc.m2.d1:ocMA.Lauds2.incipit
ltx/gr_gr_cog/pe.d087:peMA.Lauds1.melody	
ltx/gr_gr_cog/pe.d087:peMA.Lauds1.mode	@ltx/gr_gr_cog/miscellanea:misc.Mode2
ltx/gr_gr_cog/pe.d087:peMA.Lauds1.text	@ltx/gr_gr_cog/oc.m2.d1:ocMA.Lauds2.text
ltx/gr_gr_cog/pe.d087:peMA.Lauds2.incipit	@ltx/gr_gr_cog/oc.m2.d3:ocMA.Aposticha2.incipit
ltx/gr_gr_cog/pe.d087:peMA.Lauds2.melody	
ltx/gr_gr_cog/pe.d087:peMA.Lauds2.mode	@ltx/gr_gr_cog/miscellanea:misc.Mode2
ltx/gr_gr_cog/pe.d087:peMA.Lauds2.text	@ltx/gr_gr_cog/oc.m2.d3:ocMA.Aposticha2.text
ltx/gr_gr_cog/pe.d087:peMA.Lauds3.incipit	@ltx/gr_gr_cog/oc.m2.d3:ocMA.Aposticha3.incipit
ltx/gr_gr_cog/pe.d087:peMA.Lauds3.melody	
ltx/gr_gr_cog/pe.d087:peMA.Lauds3.mode	@ltx/gr_gr_cog/miscellanea:misc.Mode2
ltx/gr_gr_cog/pe.d087:peMA.Lauds3.text	@ltx/gr_gr_cog/oc.m2.d3:ocMA.Aposticha3.text
ltx/gr_gr_cog/pe.d087:peMA.LaudsGlory.incipit	@ltx/gr_gr_cog/pe.d085:peVE.Stichera08.incipit
ltx/gr_gr_cog/pe.d087:peMA.LaudsGlory.melody	@ltx/gr_gr_cog/miscellanea:misc.Idiomelon
ltx/gr_gr_cog/pe.d087:peMA.LaudsGlory.mode	@ltx/gr_gr_cog/miscellanea:misc.Mode2
ltx/gr_gr_cog/pe.d087:peMA.LaudsGlory.text	@ltx/gr_gr_cog/pe.d085:peVE.Stichera08.text
ltx/gr_gr_cog/pe.d087:peVE.AposGlory.incipit	@ltx/gr_gr_cog/pe.d085:peVE.Stichera09.incipit
ltx/gr_gr_cog/pe.d087:peVE.AposGlory.melody	
ltx/gr_gr_cog/pe.d087:peVE.AposGlory.mode	@ltx/gr_gr_cog/miscellanea:misc.Mode2
ltx/gr_gr_cog/pe.d087:peVE.AposGlory.text	@ltx/gr_gr_cog/pe.d085:peVE.Stichera09.text
ltx/gr_gr_cog/pe.d087:peVE.Aposticha1.incipit	@ltx/gr_gr_cog/oc.m2.d1:ocVE.Stichera2.incipit
ltx/gr_gr_cog/pe.d087:peVE.Aposticha1.melody	
ltx/gr_gr_cog/pe.d087:peVE.Aposticha1.mode	@ltx/gr_gr_cog/miscellanea:misc.Mode2
ltx/gr_gr_cog/pe.d087:peVE.Aposticha1.text	@ltx/gr_gr_cog/oc.m2.d1:ocVE.Stichera2.text
ltx/gr_gr_cog/pe.d087:peVE.Aposticha2.incipit	@ltx/gr_gr_cog/oc.m2.d3:ocVE.Aposticha2.incipit
ltx/gr_gr_cog/pe.d087:peVE.Aposticha2.melody	
ltx/gr_gr_cog/pe.d087:peVE.Aposticha2.mode	@ltx/gr_gr_cog/miscellanea:misc.Mode2
ltx/gr_gr_cog/pe.d087:peVE.Aposticha2.text	@ltx/gr_gr_cog/oc.m2.d3:ocVE.Aposticha2.text
ltx/gr_gr_cog/pe.d087:peVE.Aposticha3.incipit	@ltx/gr_gr_cog/oc.m2.d3:ocVE.Aposticha3.incipit
ltx/gr_gr_cog/pe.d087:peVE.Aposticha3.melody	
ltx/gr_gr_cog/pe.d087:peVE.Aposticha3.mode	@ltx/gr_gr_cog/miscellanea:misc.Mode2
ltx/gr_gr_cog/pe.d087:peVE.Aposticha3.text	@ltx/gr_gr_cog/oc.m2.d3:ocVE.Aposticha3.text
ltx/gr_gr_cog/pe.d087:peVE.SticGlory.incipit	@ltx/gr_gr_cog/pe.d085:peVE.Stichera10.incipit
ltx/gr_gr_cog/pe.d087:peVE.SticGlory.melody	@ltx/gr_gr_cog/miscellanea:misc.Idiomelon
ltx/gr_gr_cog/pe.d087:peVE.SticGlory.mode	@ltx/gr_gr_cog/miscellanea:misc.Mode2
ltx/gr_gr_cog/pe.d087:peVE.SticGlory.text	@ltx/gr_gr_cog/pe.d085:peVE.Stichera10.text
ltx/gr_gr_cog/pe.d087:peVE.Stichera01.greekmelody	@ltx/gr_gr_cog/he.a.m2:heAU.OteEkTouXylou.greekname
ltx/gr_gr_cog/pe.d087:peVE.Stichera01.incipit	Ὅτε, Μυροφόροι σε Χριστέ, λίαν…
ltx/gr_gr_cog/pe.d087:peVE.Stichera01.melody	@ltx/gr_gr_cog/he.a.m2:heAU.OteEkTouXylou.name
ltx/gr_gr_cog/pe.d087:peVE.Stichera01.mode	@ltx/gr_gr_cog/miscellanea:misc.Mode2
ltx/gr_gr_cog/pe.d087:peVE.Stichera01.text	Ὅτε, Μυροφόροι σε Χριστέ, λίαν τὸ πρωῒ ἐπεζήτουν, τὴν τῶν ἁπάντων ζωήν, μύρα καὶ ἀρώματα, ἔχουσαι ἤρχοντο, καὶ τῷ πόθῳ δακρύουσαι, ἤκουον ἐκ τάφου, νεανίου λέγοντος· Παύσασθε κλαίουσαι, ὅμως, τῇ ὑμῶν σωτηρίᾳ, χαίρουσαι βοήσατε πᾶσιν· Ὅτι ἐξεγήγερται ὁ Κύριος.
ltx/gr_gr_cog/pe.d087:peVE.Stichera02.incipit	Ἴσμεν, ὦ εὐσχήμων Ἰωσήφ, σὲ…
ltx/gr_gr_cog/pe.d087:peVE.Stichera02.melody	@ltx/gr_gr_cog/he.a.m2:heAU.OteEkTouXylou.name
ltx/gr_gr_cog/pe.d087:peVE.Stichera02.mode	@ltx/gr_gr_cog/miscellanea:misc.Mode2
ltx/gr_gr_cog/pe.d087:peVE.Stichera02.text	Ἴσμεν, ὦ εὐσχήμων Ἰωσήφ, σὲ Χερουβικὸν καθὼς ἅρμα, τὸν Βασιλέα Χριστόν, ὤμοις σου βαστάζοντα, Σταυροῦ κατάγοντα. Μακαρίζομεν χεῖράς σου, καὶ ὄμματα θεῖα, σέβομεν παλάμας σου, διʼ ὧν τὸν Ἥλιον, Λόγον καί Θεὸν ἐπὶ τάφου, φέρων κατατέθεικας· ὅθεν, καὶ τὴν θείαν μνήμην σου γεραίρομεν.
ltx/gr_gr_cog/pe.d087:peVE.Stichera03.incipit	Ὤφθη ἡ πανήγυρις ἡμῖν, τῶν…
ltx/gr_gr_cog/pe.d087:peVE.Stichera03.melody	@ltx/gr_gr_cog/he.a.m2:heAU.OteEkTouXylou.name
ltx/gr_gr_cog/pe.d087:peVE.Stichera03.mode	@ltx/gr_gr_cog/miscellanea:misc.Mode2
ltx/gr_gr_cog/pe.d087:peVE.Stichera03.text	Ὤφθη ἡ πανήγυρις ἡμῖν, τῶν θεοπρεπῶν Μυροφόρων, καὶ Ἰωσὴφ τοῦ σεπτοῦ, ἄλλος ὡς Παράδεισος, πηγὴν παρέχων ζωῆς, τὰ τῆς χάριτος νάματα ὀμβρίζει τῷ κόσμῳ, βρύει τῆς Ἐγέρσεως Χριστοῦ τὰ ῥεῖθρα θερμῶς, στίφη τῶν πιστῶν ἑορτάζει, καὶ κραυγάζει· Δόξα τῷ δόντι, τὴν αὐτοῦ Ἀνάστασιν τοῖς πέρασι.
