ltx/gr_gr_cog/tr.d049:trCO.header	Μικρὸν καὶ Χαιρετισμοί
ltx/gr_gr_cog/tr.d049:trDA.commemoration.full	Τῼ ΣΑΒΒΑΤῼ ΤΗΣ Δʹ ΕΒΔΟΜΑΔΟΣ
ltx/gr_gr_cog/tr.d049:trDA.commemoration.short	Σάββατον τῆς Δʹ Ἑβδομάδος
ltx/gr_gr_cog/tr.d049:trDA.dismissal	
ltx/gr_gr_cog/tr.d049:trDA.insert1	
ltx/gr_gr_cog/tr.d049:trDA.insert2	
ltx/gr_gr_cog/tr.d049:trDA.note	
ltx/gr_gr_cog/tr.d049:trDA.title	
ltx/gr_gr_cog/tr.d049:trHO.commemorations	
ltx/gr_gr_cog/tr.d049:trHO.daytitle	
ltx/gr_gr_cog/tr.d049:trHO.description1	
ltx/gr_gr_cog/tr.d049:trHO.description2	
ltx/gr_gr_cog/tr.d049:trHO.note1	
ltx/gr_gr_cog/tr.d049:trHO.note2	
ltx/gr_gr_cog/tr.d049:trLI.MM.CommunionHymn.text	@ltx/gr_gr_cog/properties:media.key
ltx/gr_gr_cog/tr.d049:trMA.C1.acrostic.notice1	οὗ ἡ Ἀκροστιχίς·
ltx/gr_gr_cog/tr.d049:trMA.C1.acrostic.text	Ὕμνος εἰς Μάρτυρας.
ltx/gr_gr_cog/tr.d049:trMA.C1.acrostic.title	Τὸ Τετραῴδιον,
ltx/gr_gr_cog/tr.d049:trMA.C1.poet	@ltx/gr_gr_cog/poets:po.KyriouIosif
ltx/gr_gr_cog/tr.d049:trMA.C1.title	@ltx/gr_gr_cog/titles:ti.Canon1Triodion
ltx/gr_gr_cog/tr.d049:trMA.C1.verse	
ltx/gr_gr_cog/tr.d049:trMA.C2.poet	@ltx/gr_gr_cog/poets:po.KyriouTheodorou
ltx/gr_gr_cog/tr.d049:trMA.C2.title	@ltx/gr_gr_cog/titles:ti.Another_canon_heirmos
ltx/gr_gr_cog/tr.d049:trMA.C2.verse	
ltx/gr_gr_cog/tr.d049:trMA.Exaposteilarion1.greekmelody	@ltx/gr_gr_cog/he.a.m3:heAU.OOuranonToisAstrois.greekname
ltx/gr_gr_cog/tr.d049:trMA.Exaposteilarion1.incipit	@ltx/gr_gr_cog/tr.d014:trMA.Exaposteilarion1.incipit
ltx/gr_gr_cog/tr.d049:trMA.Exaposteilarion1.melody	@ltx/gr_gr_cog/he.a.m3:heAU.OOuranonToisAstrois.name
ltx/gr_gr_cog/tr.d049:trMA.Exaposteilarion1.mode	@ltx/gr_gr_cog/miscellanea:misc.Mode3
ltx/gr_gr_cog/tr.d049:trMA.Exaposteilarion1.text	@ltx/gr_gr_cog/tr.d014:trMA.Exaposteilarion1.text
ltx/gr_gr_cog/tr.d049:trMA.Kathisma21.incipit	@ltx/gr_gr_cog/tr.d014:trMA.Kathisma21.incipit
ltx/gr_gr_cog/tr.d049:trMA.Kathisma21.melody	
ltx/gr_gr_cog/tr.d049:trMA.Kathisma21.mode	@ltx/gr_gr_cog/miscellanea:misc.Mode5
ltx/gr_gr_cog/tr.d049:trMA.Kathisma21.text	@ltx/gr_gr_cog/tr.d014:trMA.Kathisma21.text
ltx/gr_gr_cog/tr.d049:trMA.Kathisma21b.incipit	@ltx/gr_gr_cog/tr.d014:trMA.Kathisma21b.incipit
ltx/gr_gr_cog/tr.d049:trMA.Kathisma21b.melody	
ltx/gr_gr_cog/tr.d049:trMA.Kathisma21b.mode	@ltx/gr_gr_cog/miscellanea:misc.Mode5
ltx/gr_gr_cog/tr.d049:trMA.Kathisma21b.text	@ltx/gr_gr_cog/tr.d014:trMA.Kathisma21b.text
ltx/gr_gr_cog/tr.d049:trMA.Kathisma22.incipit	@ltx/gr_gr_cog/tr.d014:trMA.Kathisma22.incipit
ltx/gr_gr_cog/tr.d049:trMA.Kathisma22.melody	
ltx/gr_gr_cog/tr.d049:trMA.Kathisma22.mode	@ltx/gr_gr_cog/miscellanea:misc.Mode5
ltx/gr_gr_cog/tr.d049:trMA.Kathisma22.text	@ltx/gr_gr_cog/tr.d014:trMA.Kathisma22.text
ltx/gr_gr_cog/tr.d049:trMA.Ode6C11.incipit	Ὑπερέβητε ὅρους, σαρκὸς Ἀθληταί, πολλῇ…
ltx/gr_gr_cog/tr.d049:trMA.Ode6C11.melody	Ἐν πελάγει τοῦ βίου.
ltx/gr_gr_cog/tr.d049:trMA.Ode6C11.mode	@ltx/gr_gr_cog/miscellanea:misc.Mode4
ltx/gr_gr_cog/tr.d049:trMA.Ode6C11.ode	@ltx/gr_gr_cog/miscellanea:misc.Ode6
ltx/gr_gr_cog/tr.d049:trMA.Ode6C11.text	Ὑπερέβητε ὅρους, σαρκὸς Ἀθληταί, πολλῇ ὑπομονῇ, ὑπενεγκόντες τιμωρίας πόνους, διὸ ἅπαντα πόνον, καὶ θλῖψιν κουφίζετε, τῶν ὑμᾶς ἀνυμνολογούντων.
ltx/gr_gr_cog/tr.d049:trMA.Ode6C12.incipit	Μυριάσιν Ἀγγέλων, στρατὸς ἡνώθη, ἁγίων…
ltx/gr_gr_cog/tr.d049:trMA.Ode6C12.melody	Ἐν πελάγει τοῦ βίου.
ltx/gr_gr_cog/tr.d049:trMA.Ode6C12.mode	@ltx/gr_gr_cog/miscellanea:misc.Mode4
ltx/gr_gr_cog/tr.d049:trMA.Ode6C12.ode	@ltx/gr_gr_cog/miscellanea:misc.Ode6
ltx/gr_gr_cog/tr.d049:trMA.Ode6C12.text	Μυριάσιν Ἀγγέλων, στρατὸς ἡνώθη, ἁγίων Ἀθλητῶν, καὶ ἱκετεύει τὸν πανάγιον Θεόν, ἐγκλημάτων μυρίων, ἡμᾶς ἐκλυτρώσασθαι, ὡς Χριστῷ εὐηρεστηκότες.
ltx/gr_gr_cog/tr.d049:trMA.Ode6C13.incipit	Νεκρωθεὶς καὶ ἐν τάφῳ, Χριστὲ…
ltx/gr_gr_cog/tr.d049:trMA.Ode6C13.melody	Ἐν πελάγει τοῦ βίου.
ltx/gr_gr_cog/tr.d049:trMA.Ode6C13.mode	@ltx/gr_gr_cog/miscellanea:misc.Mode4
ltx/gr_gr_cog/tr.d049:trMA.Ode6C13.ode	@ltx/gr_gr_cog/miscellanea:misc.Ode6
ltx/gr_gr_cog/tr.d049:trMA.Ode6C13.text	Νεκρωθεὶς καὶ ἐν τάφῳ, Χριστὲ ὑπνώσας, ἀνέστησας νεκρούς, καὶ τοῖς πίστει τεθνεῶσι νέμεις, ἀγαθότητος πλοῦτον, Χριστὲ τὴν ἀνάπαυσιν, μετὰ πάντων τῶν Ἁγίων.
ltx/gr_gr_cog/tr.d049:trMA.Ode6C1T.incipit	Ὁ Θεοῦ Θεὸς Λόγος, ζητῶν…
ltx/gr_gr_cog/tr.d049:trMA.Ode6C1T.melody	Ἐν πελάγει τοῦ βίου.
ltx/gr_gr_cog/tr.d049:trMA.Ode6C1T.mode	@ltx/gr_gr_cog/miscellanea:misc.Mode4
ltx/gr_gr_cog/tr.d049:trMA.Ode6C1T.ode	@ltx/gr_gr_cog/miscellanea:misc.Ode6
ltx/gr_gr_cog/tr.d049:trMA.Ode6C1T.text	Ὁ Θεοῦ Θεὸς Λόγος, ζητῶν Θεῶσαι τὸν ἄνθρωπον Ἁγνή, ἐκ σοῦ σαρκοῦται, καὶ βροτὸς ὁρᾶται ὃν ἀπαύστως δυσώπει, εὑρεῖν ἡμᾶς ἔλεος, ἐν καιρῷ τῆς ἀπολογίας.
ltx/gr_gr_cog/tr.d049:trMA.Ode6C21.greekmelody	@ltx/gr_gr_cog/he.h.m4:heHE.TonPtaismatonTiZali.greekname
ltx/gr_gr_cog/tr.d049:trMA.Ode6C21.incipit	Σαρκὸς καὶ αἵματος Ἅγιοι μὴ…
ltx/gr_gr_cog/tr.d049:trMA.Ode6C21.melody	@ltx/gr_gr_cog/he.h.m4:heHE.TonPtaismatonTiZali.name
ltx/gr_gr_cog/tr.d049:trMA.Ode6C21.mode	@ltx/gr_gr_cog/miscellanea:misc.Mode4
ltx/gr_gr_cog/tr.d049:trMA.Ode6C21.ode	@ltx/gr_gr_cog/miscellanea:misc.Ode6
ltx/gr_gr_cog/tr.d049:trMA.Ode6C21.text	Σαρκὸς καὶ αἵματος Ἅγιοι μὴ φεισάμενοι, πρὸς πᾶσαν βάσανον ἔστητε, ἀκατάπληκτοι, Χριστὸν μὴ ἐξαρνούμενοι, διὸ ἐκ τῶν οὐρανῶν κατέπεμψε Χριστός, τοὺς στεφάνους ἡμῖν.
ltx/gr_gr_cog/tr.d049:trMA.Ode6C22.incipit	Τῇ τῶν Μαρτύρων πανηγύρει ὑπαντήσωμεν…
ltx/gr_gr_cog/tr.d049:trMA.Ode6C22.melody	@ltx/gr_gr_cog/he.h.m4:heHE.TonPtaismatonTiZali.name
ltx/gr_gr_cog/tr.d049:trMA.Ode6C22.mode	@ltx/gr_gr_cog/miscellanea:misc.Mode4
ltx/gr_gr_cog/tr.d049:trMA.Ode6C22.ode	@ltx/gr_gr_cog/miscellanea:misc.Ode6
ltx/gr_gr_cog/tr.d049:trMA.Ode6C22.text	Τῇ τῶν Μαρτύρων πανηγύρει ὑπαντήσωμεν, λαμπροφοροῦντες ταῖς πράξεσι, καὶ βοήσωμεν ἐν θεοπνεύστοις ᾄσμασιν. Ὑμεῖς ἐστε ἀληθῶς ἑωσφόροι, ἐπὶ γῆς Χριστομάρτυρες.
ltx/gr_gr_cog/tr.d049:trMA.Ode6C2A1.incipit	Τὰς συγκοπὰς τῶν μελῶν ὑμῶν…
ltx/gr_gr_cog/tr.d049:trMA.Ode6C2A1.melody	@ltx/gr_gr_cog/he.h.m4:heHE.TonPtaismatonTiZali.name
ltx/gr_gr_cog/tr.d049:trMA.Ode6C2A1.mode	@ltx/gr_gr_cog/miscellanea:misc.Mode4
ltx/gr_gr_cog/tr.d049:trMA.Ode6C2A1.ode	@ltx/gr_gr_cog/miscellanea:misc.Ode6
ltx/gr_gr_cog/tr.d049:trMA.Ode6C2A1.text	Τὰς συγκοπὰς τῶν μελῶν ὑμῶν διαβλέποντες, ἐνετρυφᾶτε τοῖς αἵμασιν ἀγαλλόμενοι, ἀλλὰ καθικετεύσατε, ὑπὲρ ἡμῶν ἐκτενῶς τῷ Κυρίῳ Μάρτυρες ἀεισέβαστοι.
ltx/gr_gr_cog/tr.d049:trMA.Ode6C2A2.incipit	Ὁ ἐκ γῆς πλαστουργήσας με…
ltx/gr_gr_cog/tr.d049:trMA.Ode6C2A2.melody	@ltx/gr_gr_cog/he.h.m4:heHE.TonPtaismatonTiZali.name
ltx/gr_gr_cog/tr.d049:trMA.Ode6C2A2.mode	@ltx/gr_gr_cog/miscellanea:misc.Mode4
ltx/gr_gr_cog/tr.d049:trMA.Ode6C2A2.ode	@ltx/gr_gr_cog/miscellanea:misc.Ode6
ltx/gr_gr_cog/tr.d049:trMA.Ode6C2A2.text	Ὁ ἐκ γῆς πλαστουργήσας με καὶ ζωώσας με, καὶ εἰς γῆν ἐπιστρέφειν με πάλιν φάμενος, οὓς προσελάβου δούλους σου ἀνάπαυσον, καὶ ἐκ φθορᾶς τοῦ θανάτου ἀνάγαγε Κύριε.
ltx/gr_gr_cog/tr.d049:trMA.Ode6C2H.greekmelody	@ltx/gr_gr_cog/he.h.m4:heHE.TonPtaismatonTiZali.greekname
ltx/gr_gr_cog/tr.d049:trMA.Ode6C2H.incipit	@ltx/gr_gr_cog/he.h.m4:heHE.TonPtaismatonTiZali.incipit
ltx/gr_gr_cog/tr.d049:trMA.Ode6C2H.melody	@ltx/gr_gr_cog/he.h.m4:heHE.TonPtaismatonTiZali.melody
ltx/gr_gr_cog/tr.d049:trMA.Ode6C2H.mode	@ltx/gr_gr_cog/miscellanea:misc.Mode4
ltx/gr_gr_cog/tr.d049:trMA.Ode6C2H.ode	@ltx/gr_gr_cog/miscellanea:misc.Ode6
ltx/gr_gr_cog/tr.d049:trMA.Ode6C2H.text	@ltx/gr_gr_cog/he.h.m4:heHE.TonPtaismatonTiZali.text
ltx/gr_gr_cog/tr.d049:trMA.Ode6C2T.incipit	Ὦ μακαρία Θεόνυμφε, πῶς γεγέννηκας…
ltx/gr_gr_cog/tr.d049:trMA.Ode6C2T.melody	@ltx/gr_gr_cog/he.h.m4:heHE.TonPtaismatonTiZali.name
ltx/gr_gr_cog/tr.d049:trMA.Ode6C2T.mode	@ltx/gr_gr_cog/miscellanea:misc.Mode4
ltx/gr_gr_cog/tr.d049:trMA.Ode6C2T.ode	@ltx/gr_gr_cog/miscellanea:misc.Ode6
ltx/gr_gr_cog/tr.d049:trMA.Ode6C2T.text	Ὦ μακαρία Θεόνυμφε, πῶς γεγέννηκας ἄνευ ἀνδρός, καὶ μεμένηκας ὡς τὸ πρότερον; Θεὸν γὰρ ἀπεκύησας, τεράστιον φοβερόν, ἀλλʼ αἴτησαι σῴζεσθαι, τοὺς ὑμνοῦντάς σε.
ltx/gr_gr_cog/tr.d049:trMA.Ode6C2Tr.incipit	Τριὰς ἁγία δοξάζω σε, φύσιν…
ltx/gr_gr_cog/tr.d049:trMA.Ode6C2Tr.melody	@ltx/gr_gr_cog/he.h.m4:heHE.TonPtaismatonTiZali.name
ltx/gr_gr_cog/tr.d049:trMA.Ode6C2Tr.mode	@ltx/gr_gr_cog/miscellanea:misc.Mode4
ltx/gr_gr_cog/tr.d049:trMA.Ode6C2Tr.ode	@ltx/gr_gr_cog/miscellanea:misc.Ode6
ltx/gr_gr_cog/tr.d049:trMA.Ode6C2Tr.text	Τριὰς ἁγία δοξάζω σε, φύσιν ἄναρχον, ἕνα Θεὸν ἕνα Κύριον, τρία πρόσωπα, Πατρὸς Υἱοῦ καὶ Πνεύματος, ἀγέννητον γεννητὸν ἐκπορευτόν, τὸν αὐτὸν καὶ ἀΐδιον.
ltx/gr_gr_cog/tr.d049:trMA.Ode7C11.greekmelody	@ltx/gr_gr_cog/he.h.m4:heHE.TiEikoniTiChrysi.greekname
ltx/gr_gr_cog/tr.d049:trMA.Ode7C11.incipit	Στολισθέντες Ἀθληταί, τὴν ἀφθαρσίαν ἐνθέως…
ltx/gr_gr_cog/tr.d049:trMA.Ode7C11.melody	@ltx/gr_gr_cog/he.h.m4:heHE.TiEikoniTiChrysi.name
ltx/gr_gr_cog/tr.d049:trMA.Ode7C11.mode	@ltx/gr_gr_cog/miscellanea:misc.Mode4
ltx/gr_gr_cog/tr.d049:trMA.Ode7C11.ode	@ltx/gr_gr_cog/miscellanea:misc.Ode7
ltx/gr_gr_cog/tr.d049:trMA.Ode7C11.text	Στολισθέντες Ἀθληταί, τὴν ἀφθαρσίαν ἐνθέως τῇ ἀπεκδύσει τῆς φθειρομένης σαρκός, τῷ διʼ ἡμᾶς σάρκα ἐξ ἀφθόρου, προσλαβόντι Γυναικός, νῦν παρίστασθε φαιδροί· διό με ἐνδύσατε, περιβολὴν Ἱεράν, γεγυμνωμένον κακῶς.
ltx/gr_gr_cog/tr.d049:trMA.Ode7C12.incipit	Ἐγκρατῶς πολιτευθείς, τῶν Ἀθλοφόρων ὁ…
ltx/gr_gr_cog/tr.d049:trMA.Ode7C12.melody	@ltx/gr_gr_cog/he.h.m4:heHE.TiEikoniTiChrysi.name
ltx/gr_gr_cog/tr.d049:trMA.Ode7C12.mode	@ltx/gr_gr_cog/miscellanea:misc.Mode4
ltx/gr_gr_cog/tr.d049:trMA.Ode7C12.ode	@ltx/gr_gr_cog/miscellanea:misc.Ode7
ltx/gr_gr_cog/tr.d049:trMA.Ode7C12.text	Ἐγκρατῶς πολιτευθείς, τῶν Ἀθλοφόρων ὁ δῆμος, τῆς ἐγκρατείας ἡμᾶς τὸ στάδιον, ἐνδυναμοῖ τρέχειν ἀκωλύτως, ὡς κηρύξας τὸν Χριστόν, ἐν σταδίῳ ἀνδρικῶς, καὶ παρεστὼς βήματι, στεφηφορῶν ἐντρυφᾷ, μετʼ Ἀγγέλων νοητῶς.
ltx/gr_gr_cog/tr.d049:trMA.Ode7C13.incipit	Ἱκεσίαις ὁ Θεός, τῶν σῶν…
ltx/gr_gr_cog/tr.d049:trMA.Ode7C13.melody	@ltx/gr_gr_cog/he.h.m4:heHE.TiEikoniTiChrysi.name
ltx/gr_gr_cog/tr.d049:trMA.Ode7C13.mode	@ltx/gr_gr_cog/miscellanea:misc.Mode4
ltx/gr_gr_cog/tr.d049:trMA.Ode7C13.ode	@ltx/gr_gr_cog/miscellanea:misc.Ode7
ltx/gr_gr_cog/tr.d049:trMA.Ode7C13.text	Ἱκεσίαις ὁ Θεός, τῶν σῶν ἁγίων Μαρτύρων, τοὺς κοιμηθέντας πιστοὺς οἰκέτας σου, τοῦ Παραδείσου πολίτας δεῖξον, καὶ φωτὸς τοῦ νοητοῦ, καταξίωσον αὐτούς, ἀπαύστως βοῶντάς σοι· Εὐλογητὸς ὁ Θεός, ὁ τῶν Πατέρων ἡμῶν.
ltx/gr_gr_cog/tr.d049:trMA.Ode7C1T.incipit	Σε τὴν μόνην ἀγαθήν, ἐκδυσωποῦμεν…
ltx/gr_gr_cog/tr.d049:trMA.Ode7C1T.melody	@ltx/gr_gr_cog/he.h.m4:heHE.TiEikoniTiChrysi.name
ltx/gr_gr_cog/tr.d049:trMA.Ode7C1T.mode	@ltx/gr_gr_cog/miscellanea:misc.Mode4
ltx/gr_gr_cog/tr.d049:trMA.Ode7C1T.ode	@ltx/gr_gr_cog/miscellanea:misc.Ode7
ltx/gr_gr_cog/tr.d049:trMA.Ode7C1T.text	Σε τὴν μόνην ἀγαθήν, ἐκδυσωποῦμεν Παρθένον, κεκακωμένους ἡμᾶς ἀγάθυνον, καὶ ἐκτενῶς τὸν Χριστὸν δυσώπει, φύσει ὄντα ἀγαθόν, ἐγκρατείας τὸν καιρόν, τὰ ἀγαθὰ πράττοντας, ἀποπληρῶσαι ἡμᾶς, ὑμνολογοῦντας αὐτόν.
ltx/gr_gr_cog/tr.d049:trMA.Ode7C21.greekmelody	@ltx/gr_gr_cog/he.h.m4:heHE.OEnToOreiToMosei.greekname
ltx/gr_gr_cog/tr.d049:trMA.Ode7C21.incipit	Ὁ μεγαλύνας, τοὺς Ἁγίους σου…
ltx/gr_gr_cog/tr.d049:trMA.Ode7C21.melody	@ltx/gr_gr_cog/he.h.m4:heHE.OEnToOreiToMosei.name
ltx/gr_gr_cog/tr.d049:trMA.Ode7C21.mode	@ltx/gr_gr_cog/miscellanea:misc.Mode4
ltx/gr_gr_cog/tr.d049:trMA.Ode7C21.ode	@ltx/gr_gr_cog/miscellanea:misc.Ode7
ltx/gr_gr_cog/tr.d049:trMA.Ode7C21.text	Ὁ μεγαλύνας, τοὺς Ἁγίους σου πάντας, καὶ σημείοις, θαυμαστώσας αὐτοὺς ἐν Κόσμῳ, εὐλογητὸς εἶ εἰς τοὺς αἰῶνας Κύριε, ὁ Θεὸς τῶν Πατέρων ἡμῶν.
ltx/gr_gr_cog/tr.d049:trMA.Ode7C22.incipit	Πᾶσαν ἰδέαν, αἰκισμῶν διελθόντες, καὶ…
ltx/gr_gr_cog/tr.d049:trMA.Ode7C22.melody	@ltx/gr_gr_cog/he.h.m4:heHE.OEnToOreiToMosei.name
ltx/gr_gr_cog/tr.d049:trMA.Ode7C22.mode	@ltx/gr_gr_cog/miscellanea:misc.Mode4
ltx/gr_gr_cog/tr.d049:trMA.Ode7C22.ode	@ltx/gr_gr_cog/miscellanea:misc.Ode7
ltx/gr_gr_cog/tr.d049:trMA.Ode7C22.text	Πᾶσαν ἰδέαν, αἰκισμῶν διελθόντες, καὶ γόνυ τῷ Βάαλ, μὴ πεισθέντες κλῖναι, στεφάνους δόξης ᾔρασθε, ἐκ Θεοῦ Χριστομάρτυρες.
ltx/gr_gr_cog/tr.d049:trMA.Ode7C2A1.incipit	Τῷ ἀθανάτῳ, Βασιλεῖ στρατευθέντες, καὶ…
ltx/gr_gr_cog/tr.d049:trMA.Ode7C2A1.melody	@ltx/gr_gr_cog/he.h.m4:heHE.OEnToOreiToMosei.name
ltx/gr_gr_cog/tr.d049:trMA.Ode7C2A1.mode	@ltx/gr_gr_cog/miscellanea:misc.Mode4
ltx/gr_gr_cog/tr.d049:trMA.Ode7C2A1.ode	@ltx/gr_gr_cog/miscellanea:misc.Ode7
ltx/gr_gr_cog/tr.d049:trMA.Ode7C2A1.text	Τῷ ἀθανάτῳ, Βασιλεῖ στρατευθέντες, καὶ πίστιν, πρὸς αὐτὸν δεικνύντες τελείαν, τὸ αἷμα ὑμῶν Μάρτυρες, ὑπὲρ αὐτοῦ ἐκενώσατε.
ltx/gr_gr_cog/tr.d049:trMA.Ode7C2A2.incipit	Ὅπου τὸ φῶς σου, τῆς…
ltx/gr_gr_cog/tr.d049:trMA.Ode7C2A2.melody	@ltx/gr_gr_cog/he.h.m4:heHE.OEnToOreiToMosei.name
ltx/gr_gr_cog/tr.d049:trMA.Ode7C2A2.mode	@ltx/gr_gr_cog/miscellanea:misc.Mode4
ltx/gr_gr_cog/tr.d049:trMA.Ode7C2A2.ode	@ltx/gr_gr_cog/miscellanea:misc.Ode7
ltx/gr_gr_cog/tr.d049:trMA.Ode7C2A2.text	Ὅπου τὸ φῶς σου, τῆς ζωῆς ἀναβλύζει, παράθου, οὓς μετέστησας ἐκ τῶν προσκαίρων, πιστούς σου δούλους, Κύριε ὁ Θεὸς ὁ τῶν Πατέρων ἡμῶν.
ltx/gr_gr_cog/tr.d049:trMA.Ode7C2H.greekmelody	@ltx/gr_gr_cog/he.h.m4:heHE.OEnToOreiToMosei.greekname
ltx/gr_gr_cog/tr.d049:trMA.Ode7C2H.incipit	@ltx/gr_gr_cog/he.h.m4:heHE.OEnToOreiToMosei.incipit
ltx/gr_gr_cog/tr.d049:trMA.Ode7C2H.melody	@ltx/gr_gr_cog/he.h.m4:heHE.OEnToOreiToMosei.melody
ltx/gr_gr_cog/tr.d049:trMA.Ode7C2H.mode	@ltx/gr_gr_cog/miscellanea:misc.Mode4
ltx/gr_gr_cog/tr.d049:trMA.Ode7C2H.ode	@ltx/gr_gr_cog/miscellanea:misc.Ode7
ltx/gr_gr_cog/tr.d049:trMA.Ode7C2H.text	@ltx/gr_gr_cog/he.h.m4:heHE.OEnToOreiToMosei.text
ltx/gr_gr_cog/tr.d049:trMA.Ode7C2T.incipit	Παρθενομῆτορ, ἡ ὁλόφωτος Κόρη, ἡ…
ltx/gr_gr_cog/tr.d049:trMA.Ode7C2T.melody	@ltx/gr_gr_cog/he.h.m4:heHE.OEnToOreiToMosei.name
ltx/gr_gr_cog/tr.d049:trMA.Ode7C2T.mode	@ltx/gr_gr_cog/miscellanea:misc.Mode4
ltx/gr_gr_cog/tr.d049:trMA.Ode7C2T.ode	@ltx/gr_gr_cog/miscellanea:misc.Ode7
ltx/gr_gr_cog/tr.d049:trMA.Ode7C2T.text	Παρθενομῆτορ, ἡ ὁλόφωτος Κόρη, ἡ μόνη πρὸς Θεὸν μεσιτεία, μὴ διαλίπῃς Δέσποινα, δυσωπεῖν τοῦ σωθῆναι ἡμᾶς.
ltx/gr_gr_cog/tr.d049:trMA.Ode7C2Tr.incipit	Ἡ ἓν Μονάδι, Τριὰς προσκυνουμένη…
ltx/gr_gr_cog/tr.d049:trMA.Ode7C2Tr.melody	@ltx/gr_gr_cog/he.h.m4:heHE.OEnToOreiToMosei.name
ltx/gr_gr_cog/tr.d049:trMA.Ode7C2Tr.mode	@ltx/gr_gr_cog/miscellanea:misc.Mode4
ltx/gr_gr_cog/tr.d049:trMA.Ode7C2Tr.ode	@ltx/gr_gr_cog/miscellanea:misc.Ode7
ltx/gr_gr_cog/tr.d049:trMA.Ode7C2Tr.text	Ἡ ἓν Μονάδι, Τριὰς προσκυνουμένη οὐσία, ὁ Πατὴρ ὁ Υἱὸς καὶ τὸ Πνεῦμα, τοὺς σὲ ὑμνοῦντας φύλαττε, ὁ Θεὸς τῶν Πατέρων ἡμῶν.
ltx/gr_gr_cog/tr.d049:trMA.Ode8C11.incipit	Μεγαλώνυμοι Χριστοῦ Ἀθληταί, καὶ σεπτοὶ…
ltx/gr_gr_cog/tr.d049:trMA.Ode8C11.melody	Ἐν πυρὶ φλογός.
ltx/gr_gr_cog/tr.d049:trMA.Ode8C11.mode	@ltx/gr_gr_cog/miscellanea:misc.Mode4
ltx/gr_gr_cog/tr.d049:trMA.Ode8C11.ode	@ltx/gr_gr_cog/miscellanea:misc.Ode8
ltx/gr_gr_cog/tr.d049:trMA.Ode8C11.text	Μεγαλώνυμοι Χριστοῦ Ἀθληταί, καὶ σεπτοὶ ἐν Θεῷ, ἅπαντας τοὺς ἀνυμνοῦντας τὰ μνημόσυνα ὑμῶν, μεγάλων ἐγκλημάτων, καὶ τῶν ἐκεῖ βασάνων, λυτρώσατε ὑμῶν πρός αὐτόν, μεγίσταις ἱκεσίαις.
ltx/gr_gr_cog/tr.d049:trMA.Ode8C12.incipit	Ἁγιόλεκτον Χριστοῦ τοῦ Θεοῦ, καὶ…
ltx/gr_gr_cog/tr.d049:trMA.Ode8C12.melody	Ἐν πυρὶ φλογός.
ltx/gr_gr_cog/tr.d049:trMA.Ode8C12.mode	@ltx/gr_gr_cog/miscellanea:misc.Mode4
ltx/gr_gr_cog/tr.d049:trMA.Ode8C12.ode	@ltx/gr_gr_cog/miscellanea:misc.Ode8
ltx/gr_gr_cog/tr.d049:trMA.Ode8C12.text	Ἁγιόλεκτον Χριστοῦ τοῦ Θεοῦ, καὶ στεῤῥὸν ἀληθῶς, στράτευμα Μαρτύρων δῆμοι, ἁγιάσατε ἡμῶν, τὸν νοῦν καὶ τὴν καρδίαν, ἐν ταύταις ταῖς ἁγίαις ἡμέραις τῆς Νηστείας, ὑμῶν ἁγίαις ἱκεσίαις.
ltx/gr_gr_cog/tr.d049:trMA.Ode8C13.incipit	Ῥῦσαι σκώληκος κολάζοντος, καὶ ὀδόντων…
ltx/gr_gr_cog/tr.d049:trMA.Ode8C13.melody	Ἐν πυρὶ φλογός.
ltx/gr_gr_cog/tr.d049:trMA.Ode8C13.mode	@ltx/gr_gr_cog/miscellanea:misc.Mode4
ltx/gr_gr_cog/tr.d049:trMA.Ode8C13.ode	@ltx/gr_gr_cog/miscellanea:misc.Ode8
ltx/gr_gr_cog/tr.d049:trMA.Ode8C13.text	Ῥῦσαι σκώληκος κολάζοντος, καὶ ὀδόντων βρυγμοῦ Κύριε, καὶ ἐξωτέρου σκότους πάντας ἀφεγγοῦς, οὓς πίστει προσελάβου, καὶ τάξον τούτους, ἔνθα τὸ φῶς τοῦ σοῦ προσώπου Χριστέ, ἐκλάμπει εἰς αἰῶνας.
ltx/gr_gr_cog/tr.d049:trMA.Ode8C1T.incipit	Τὸν Σταυρὸν Χριστοῦ τὸν τίμιον…
ltx/gr_gr_cog/tr.d049:trMA.Ode8C1T.melody	Ἐν πυρὶ φλογός.
ltx/gr_gr_cog/tr.d049:trMA.Ode8C1T.mode	@ltx/gr_gr_cog/miscellanea:misc.Mode4
ltx/gr_gr_cog/tr.d049:trMA.Ode8C1T.ode	@ltx/gr_gr_cog/miscellanea:misc.Ode8
ltx/gr_gr_cog/tr.d049:trMA.Ode8C1T.text	Τὸν Σταυρὸν Χριστοῦ τὸν τίμιον Θεοτόκε ἁγνή, βλέψαντας, καὶ ἐκ καρδίας προσκυνήσαντας ἡμᾶς, ταῖς σαῖς πρὸς τὸν Δεσπότην, ἀξίωσον πρεσβείαις, ἰδεῖν καὶ τὰ Πάθη τὰ σεπτά, παθῶν κεκαθαρμένους.
ltx/gr_gr_cog/tr.d049:trMA.Ode8C21.greekmelody	@ltx/gr_gr_cog/he.h.m4:heHE.GiKaiPantaTaEnAfti.greekname
ltx/gr_gr_cog/tr.d049:trMA.Ode8C21.incipit	Ὢ καλλίστης συναλλαγῆς! ἧς εὕρατε…
ltx/gr_gr_cog/tr.d049:trMA.Ode8C21.melody	@ltx/gr_gr_cog/he.h.m4:heHE.GiKaiPantaTaEnAfti.name
ltx/gr_gr_cog/tr.d049:trMA.Ode8C21.mode	@ltx/gr_gr_cog/miscellanea:misc.Mode4
ltx/gr_gr_cog/tr.d049:trMA.Ode8C21.ode	@ltx/gr_gr_cog/miscellanea:misc.Ode8
ltx/gr_gr_cog/tr.d049:trMA.Ode8C21.text	Ὢ καλλίστης συναλλαγῆς! ἧς εὕρατε θανάτῳ τὴν ζωήν, Ἱερομάρτυρες Χριστοῦ, πῦρ καὶ ξίφος, κρύη καὶ θῆρας, μηδαμῶς πτοηθέντες, καὶ βοῶντες· ὑμνεῖτε τὸν Κύριον, καὶ ὑπερυψοῦτε, εἰς πάντας τοὺς αἰῶνας.
ltx/gr_gr_cog/tr.d049:trMA.Ode8C22.incipit	Ἄνω χορὸς ἀγγελικός, κάτω δὲ…
ltx/gr_gr_cog/tr.d049:trMA.Ode8C22.melody	@ltx/gr_gr_cog/he.h.m4:heHE.GiKaiPantaTaEnAfti.name
ltx/gr_gr_cog/tr.d049:trMA.Ode8C22.mode	@ltx/gr_gr_cog/miscellanea:misc.Mode4
ltx/gr_gr_cog/tr.d049:trMA.Ode8C22.ode	@ltx/gr_gr_cog/miscellanea:misc.Ode8
ltx/gr_gr_cog/tr.d049:trMA.Ode8C22.text	Ἄνω χορὸς ἀγγελικός, κάτω δὲ ἡμεῖς οἱ ἐπὶ γῆς, αἰνοῦμεν Μάρτυρες Χριστοῦ, τὰ ξένα ἆθλα καὶ τοὺς ἀγῶνας, τῆς ὑμῶν εὐανδρείας, εὐλογοῦντες ὑμνοῦντες τὸν Κύριον, καὶ ὑπερυψοῦντες εἰς πάντας τοὺς αἰῶνας.
ltx/gr_gr_cog/tr.d049:trMA.Ode8C2A1.incipit	Τοὺς ἀγῶνας τοὺς θαυμαστούς, Μάρτυρες…
ltx/gr_gr_cog/tr.d049:trMA.Ode8C2A1.melody	@ltx/gr_gr_cog/he.h.m4:heHE.GiKaiPantaTaEnAfti.name
ltx/gr_gr_cog/tr.d049:trMA.Ode8C2A1.mode	@ltx/gr_gr_cog/miscellanea:misc.Mode4
ltx/gr_gr_cog/tr.d049:trMA.Ode8C2A1.ode	@ltx/gr_gr_cog/miscellanea:misc.Ode8
ltx/gr_gr_cog/tr.d049:trMA.Ode8C2A1.text	Τοὺς ἀγῶνας τοὺς θαυμαστούς, Μάρτυρες δοξάζοντες ὑμῶν, τὸν εὐεργέτην καὶ Θεόν, εὐλογοῦμεν καὶ προσκυνοῦμεν, τὸν ἐν τῷ σταδίῳ, τῶν ἀγώνων ὑμᾶς ἐνισχύσαντα, ὃν ὑπερυψοῦμεν εἰς πάντας τοὺς αἰῶνας.
ltx/gr_gr_cog/tr.d049:trMA.Ode8C2A2.incipit	Σὺ θανάτου καὶ τῆς ζωῆς…
ltx/gr_gr_cog/tr.d049:trMA.Ode8C2A2.melody	@ltx/gr_gr_cog/he.h.m4:heHE.GiKaiPantaTaEnAfti.name
ltx/gr_gr_cog/tr.d049:trMA.Ode8C2A2.mode	@ltx/gr_gr_cog/miscellanea:misc.Mode4
ltx/gr_gr_cog/tr.d049:trMA.Ode8C2A2.ode	@ltx/gr_gr_cog/miscellanea:misc.Ode8
ltx/gr_gr_cog/tr.d049:trMA.Ode8C2A2.text	Σὺ θανάτου καὶ τῆς ζωῆς, Κύριος ὑπάρχων καὶ Θεός, τοὺς μεταστάντας εὐσεβῶς ἐξεγείρων, ἐκεῖ παράθου ἐν σκηναῖς τῶν Δικαίων, εὐλογοῦντας ὑμνοῦντάς σε Κύριε, καὶ ὑπερυψοῦντας, εἰς πάντας τοὺς αἰῶνας.
ltx/gr_gr_cog/tr.d049:trMA.Ode8C2H.greekmelody	@ltx/gr_gr_cog/he.h.m4:heHE.GiKaiPantaTaEnAfti.greekname
ltx/gr_gr_cog/tr.d049:trMA.Ode8C2H.incipit	@ltx/gr_gr_cog/he.h.m4:heHE.GiKaiPantaTaEnAfti.incipit
ltx/gr_gr_cog/tr.d049:trMA.Ode8C2H.melody	@ltx/gr_gr_cog/he.h.m4:heHE.GiKaiPantaTaEnAfti.melody
ltx/gr_gr_cog/tr.d049:trMA.Ode8C2H.mode	@ltx/gr_gr_cog/miscellanea:misc.Mode4
ltx/gr_gr_cog/tr.d049:trMA.Ode8C2H.ode	@ltx/gr_gr_cog/miscellanea:misc.Ode8
ltx/gr_gr_cog/tr.d049:trMA.Ode8C2H.text	@ltx/gr_gr_cog/he.h.m4:heHE.GiKaiPantaTaEnAfti.text
ltx/gr_gr_cog/tr.d049:trMA.Ode8C2T.incipit	Τίς ὑμνήσει σε γηγενῶν, ἄσπιλε…
ltx/gr_gr_cog/tr.d049:trMA.Ode8C2T.melody	@ltx/gr_gr_cog/he.h.m4:heHE.GiKaiPantaTaEnAfti.name
ltx/gr_gr_cog/tr.d049:trMA.Ode8C2T.mode	@ltx/gr_gr_cog/miscellanea:misc.Mode4
ltx/gr_gr_cog/tr.d049:trMA.Ode8C2T.ode	@ltx/gr_gr_cog/miscellanea:misc.Ode8
ltx/gr_gr_cog/tr.d049:trMA.Ode8C2T.text	Τίς ὑμνήσει σε γηγενῶν, ἄσπιλε ἁγνὴ Περιστερὰ; σὺ γὰρ ἐκύησας ἡμῖν, φῶς τὸ μέγα ζωῆς τὸν πλοῦτον, Ἰησοῦν τὸν Σωτῆρα, ὃν ὑμνοῦμεν αἰνοῦντες ὡς Κύριον, καὶ ὑπερυψοῦμεν, εἰς πάντας τοὺς αἰῶνας.
ltx/gr_gr_cog/tr.d049:trMA.Ode8C2Tr.incipit	Φῶς ζωήν τε καὶ ζωάς…
ltx/gr_gr_cog/tr.d049:trMA.Ode8C2Tr.melody	@ltx/gr_gr_cog/he.h.m4:heHE.GiKaiPantaTaEnAfti.name
ltx/gr_gr_cog/tr.d049:trMA.Ode8C2Tr.mode	@ltx/gr_gr_cog/miscellanea:misc.Mode4
ltx/gr_gr_cog/tr.d049:trMA.Ode8C2Tr.ode	@ltx/gr_gr_cog/miscellanea:misc.Ode8
ltx/gr_gr_cog/tr.d049:trMA.Ode8C2Tr.text	Φῶς ζωήν τε καὶ ζωάς, σέβω σὲ Πατέρα, καὶ Υἱόν, καὶ Πνεῦμα τὸ ἐκπορευτόν, φύσιν μίαν, τρεῖς ὑποστάσεις, Θεὸν ἕνα μέλπων. Εὐλογῶ σε ὑμνῶ σε τὸν Κύριον, καὶ ὑπερυψῶ σε, εἰς πάντας τοὺς αἰῶνας.
ltx/gr_gr_cog/tr.d049:trMA.Ode9C11.greekmelody	@ltx/gr_gr_cog/he.h.m4:heHE.OtiEpoiiseMoiMegaleia.greekname
ltx/gr_gr_cog/tr.d049:trMA.Ode9C11.incipit	Ὑπάρχοντες φωστῆρες, ἀπλανεῖς Χριστοῦ Ἀθληταί…
ltx/gr_gr_cog/tr.d049:trMA.Ode9C11.melody	@ltx/gr_gr_cog/he.h.m4:heHE.OtiEpoiiseMoiMegaleia.name
ltx/gr_gr_cog/tr.d049:trMA.Ode9C11.mode	@ltx/gr_gr_cog/miscellanea:misc.Mode4
ltx/gr_gr_cog/tr.d049:trMA.Ode9C11.ode	@ltx/gr_gr_cog/miscellanea:misc.Ode9
ltx/gr_gr_cog/tr.d049:trMA.Ode9C11.text	Ὑπάρχοντες φωστῆρες, ἀπλανεῖς Χριστοῦ Ἀθληταί, φωτίσατε ἡμῶν τοὺς λογισμούς, καὶ νευρώσατε ποιεῖν, τὰ φωταυγῆ καὶ καθαρά, Θεοῦ θελήματα.
ltx/gr_gr_cog/tr.d049:trMA.Ode9C12.incipit	Ῥομφαῖαι καθορᾶσθε, κατασφάττουσαι δυσμενεῖς, γενναῖοι…
ltx/gr_gr_cog/tr.d049:trMA.Ode9C12.melody	@ltx/gr_gr_cog/he.h.m4:heHE.OtiEpoiiseMoiMegaleia.name
ltx/gr_gr_cog/tr.d049:trMA.Ode9C12.mode	@ltx/gr_gr_cog/miscellanea:misc.Mode4
ltx/gr_gr_cog/tr.d049:trMA.Ode9C12.ode	@ltx/gr_gr_cog/miscellanea:misc.Ode9
ltx/gr_gr_cog/tr.d049:trMA.Ode9C12.text	Ῥομφαῖαι καθορᾶσθε, κατασφάττουσαι δυσμενεῖς, γενναῖοι τοῦ Κυρίου Ἀθληταί, ἀλλὰ ῥύσατε ἡμᾶς, ἐκ τῶν βελῶν τοῦ πονηροῦ ταῖς προστασίαις ὑμῶν.
ltx/gr_gr_cog/tr.d049:trMA.Ode9C13.incipit	Ἀνάπαυσον Οἰκτίρμον, ἐν τοῖς κόλποις…
ltx/gr_gr_cog/tr.d049:trMA.Ode9C13.melody	@ltx/gr_gr_cog/he.h.m4:heHE.OtiEpoiiseMoiMegaleia.name
ltx/gr_gr_cog/tr.d049:trMA.Ode9C13.mode	@ltx/gr_gr_cog/miscellanea:misc.Mode4
ltx/gr_gr_cog/tr.d049:trMA.Ode9C13.ode	@ltx/gr_gr_cog/miscellanea:misc.Ode9
ltx/gr_gr_cog/tr.d049:trMA.Ode9C13.text	Ἀνάπαυσον Οἰκτίρμον, ἐν τοῖς κόλποις τοῦ Ἀβραάμ, τοὺς δούλους σου τοὺς πίστει ἐξ ἡμῶν, ἐκδημήσαντας πρὸς σέ, τὸν τοῦ παντὸς δημιουργὸν καὶ ὑπεράγαθον.
ltx/gr_gr_cog/tr.d049:trMA.Ode9C1T.incipit	Σαρκός μου τὰς κινήσεις, ἀπονέκρωσον…
ltx/gr_gr_cog/tr.d049:trMA.Ode9C1T.melody	@ltx/gr_gr_cog/he.h.m4:heHE.OtiEpoiiseMoiMegaleia.name
ltx/gr_gr_cog/tr.d049:trMA.Ode9C1T.mode	@ltx/gr_gr_cog/miscellanea:misc.Mode4
ltx/gr_gr_cog/tr.d049:trMA.Ode9C1T.ode	@ltx/gr_gr_cog/miscellanea:misc.Ode9
ltx/gr_gr_cog/tr.d049:trMA.Ode9C1T.text	Σαρκός μου τὰς κινήσεις, ἀπονέκρωσον ἡ Θεόν, σαρκὶ ἀποτεκοῦσα ὑπὲρ νοῦν, καὶ παράσχου φωτισμόν, τῇ διανοίᾳ μου Ἁγνή, νεφέλη οὖσα φωτός.
ltx/gr_gr_cog/tr.d049:trMA.Ode9C21.greekmelody	@ltx/gr_gr_cog/he.h.m4:heHE.MegalynomenPantes.greekname
ltx/gr_gr_cog/tr.d049:trMA.Ode9C21.incipit	Ἀναμέλπομεν πάντες, τὰ μνημόσυνα ὑμῶν…
ltx/gr_gr_cog/tr.d049:trMA.Ode9C21.melody	@ltx/gr_gr_cog/he.h.m4:heHE.MegalynomenPantes.name
ltx/gr_gr_cog/tr.d049:trMA.Ode9C21.mode	@ltx/gr_gr_cog/miscellanea:misc.Mode4
ltx/gr_gr_cog/tr.d049:trMA.Ode9C21.ode	@ltx/gr_gr_cog/miscellanea:misc.Ode9
ltx/gr_gr_cog/tr.d049:trMA.Ode9C21.text	Ἀναμέλπομεν πάντες, τὰ μνημόσυνα ὑμῶν, Μάρτυρες πανεύφημοι, βλέποντες τὰ σκάμματα, τῶν Ἱερῶν ὑμῶν ἄθλων, καὶ ἐκπλαγέντες, τὸν Χριστὸν μεγαλύνομεν.
ltx/gr_gr_cog/tr.d049:trMA.Ode9C22.incipit	Πρὸς ἀλλήλους ἀθλοῦντες, φασὶν οἱ…
ltx/gr_gr_cog/tr.d049:trMA.Ode9C22.melody	@ltx/gr_gr_cog/he.h.m4:heHE.MegalynomenPantes.name
ltx/gr_gr_cog/tr.d049:trMA.Ode9C22.mode	@ltx/gr_gr_cog/miscellanea:misc.Mode4
ltx/gr_gr_cog/tr.d049:trMA.Ode9C22.ode	@ltx/gr_gr_cog/miscellanea:misc.Ode9
ltx/gr_gr_cog/tr.d049:trMA.Ode9C22.text	Πρὸς ἀλλήλους ἀθλοῦντες, φασὶν οἱ Ἀθλοφόροι. Σαρκὸς μὴ φεισώμεθα, δεῦτε ἀποθάνωμεν ὑπὲρ Χριστοῦ, ἵνα ὅλον αἰῶνα ζήσωμεν, χορεύοντες ἄληκτα.
ltx/gr_gr_cog/tr.d049:trMA.Ode9C2A1.incipit	Ὁ χορὸς τῶν Ἁγίων, δέξαι…
ltx/gr_gr_cog/tr.d049:trMA.Ode9C2A1.melody	@ltx/gr_gr_cog/he.h.m4:heHE.MegalynomenPantes.name
ltx/gr_gr_cog/tr.d049:trMA.Ode9C2A1.mode	@ltx/gr_gr_cog/miscellanea:misc.Mode4
ltx/gr_gr_cog/tr.d049:trMA.Ode9C2A1.ode	@ltx/gr_gr_cog/miscellanea:misc.Ode9
ltx/gr_gr_cog/tr.d049:trMA.Ode9C2A1.text	Ὁ χορὸς τῶν Ἁγίων, δέξαι τὴν προσευχήν μου, καὶ ὡς κατηξίωμαι τὸν Σταυρὸν ἀσπάσασθαι, καὶ τὸ σωτήριον Πάθος συμπροσκυνῆσαί με, τὸν Χριστὸν αἰτήσατε.
ltx/gr_gr_cog/tr.d049:trMA.Ode9C2A2.incipit	Ἄνες ἄφες Οἰκτίρμον, τοῖς μεταστᾶσι…
ltx/gr_gr_cog/tr.d049:trMA.Ode9C2A2.melody	@ltx/gr_gr_cog/he.h.m4:heHE.MegalynomenPantes.name
ltx/gr_gr_cog/tr.d049:trMA.Ode9C2A2.mode	@ltx/gr_gr_cog/miscellanea:misc.Mode4
ltx/gr_gr_cog/tr.d049:trMA.Ode9C2A2.ode	@ltx/gr_gr_cog/miscellanea:misc.Ode9
ltx/gr_gr_cog/tr.d049:trMA.Ode9C2A2.text	Ἄνες ἄφες Οἰκτίρμον, τοῖς μεταστᾶσι πρὸς σὲ τὸν φιλάνθρωπον, καὶ τούτους ἀνάπαυσον ἐν σκηναῖς τῶν ἐκλεκτῶν· σὺ γὰρ ὑπάρχεις ζωὴ καὶ ἀνάστασις.
ltx/gr_gr_cog/tr.d049:trMA.Ode9C2H.greekmelody	@ltx/gr_gr_cog/he.h.m4:heHE.MegalynomenPantes.greekname
ltx/gr_gr_cog/tr.d049:trMA.Ode9C2H.incipit	@ltx/gr_gr_cog/he.h.m4:heHE.MegalynomenPantes.incipit
ltx/gr_gr_cog/tr.d049:trMA.Ode9C2H.melody	@ltx/gr_gr_cog/he.h.m4:heHE.MegalynomenPantes.melody
ltx/gr_gr_cog/tr.d049:trMA.Ode9C2H.mode	@ltx/gr_gr_cog/miscellanea:misc.Mode4
ltx/gr_gr_cog/tr.d049:trMA.Ode9C2H.ode	@ltx/gr_gr_cog/miscellanea:misc.Ode9
ltx/gr_gr_cog/tr.d049:trMA.Ode9C2H.text	@ltx/gr_gr_cog/he.h.m4:heHE.MegalynomenPantes.text
ltx/gr_gr_cog/tr.d049:trMA.Ode9C2T.incipit	Χαῖρε πάνσεμνε Ἁγνή, παρθενίας καύχημα…
ltx/gr_gr_cog/tr.d049:trMA.Ode9C2T.melody	@ltx/gr_gr_cog/he.h.m4:heHE.MegalynomenPantes.name
ltx/gr_gr_cog/tr.d049:trMA.Ode9C2T.mode	@ltx/gr_gr_cog/miscellanea:misc.Mode4
ltx/gr_gr_cog/tr.d049:trMA.Ode9C2T.ode	@ltx/gr_gr_cog/miscellanea:misc.Ode9
ltx/gr_gr_cog/tr.d049:trMA.Ode9C2T.text	Χαῖρε πάνσεμνε Ἁγνή, παρθενίας καύχημα, μητέρων τὸ στήριγμα, ἀνθρώπων βοήθεια, καὶ τοῦ Κόσμου ἡ χαρά, Μαρία Μήτηρ, καὶ δούλη τοῦ Θεοῦ ἡμῶν.
ltx/gr_gr_cog/tr.d049:trMA.Ode9C2Tr.incipit	Ἡ Τριὰς τοὺς ἐν μιᾷ…
ltx/gr_gr_cog/tr.d049:trMA.Ode9C2Tr.melody	@ltx/gr_gr_cog/he.h.m4:heHE.MegalynomenPantes.name
ltx/gr_gr_cog/tr.d049:trMA.Ode9C2Tr.mode	@ltx/gr_gr_cog/miscellanea:misc.Mode4
ltx/gr_gr_cog/tr.d049:trMA.Ode9C2Tr.ode	@ltx/gr_gr_cog/miscellanea:misc.Ode9
ltx/gr_gr_cog/tr.d049:trMA.Ode9C2Tr.text	Ἡ Τριὰς τοὺς ἐν μιᾷ, φύσει σε ἀνυμνοῦντας, Πατὴρ ὁ ἀγέννητος, καὶ ὁ γεννηθεὶς Υἱός, καὶ Πνεῦμα τὸ ἐκπορευτόν, τῷ σῷ ἐλέει ἀβλαβεῖς συντήρησον.
ltx/gr_gr_cog/tr.d049:trVE.ApolTheotokion.incipit	@ltx/gr_gr_cog/da.d7:daVE.ApolTheotokion.incipit
ltx/gr_gr_cog/tr.d049:trVE.ApolTheotokion.melody	
ltx/gr_gr_cog/tr.d049:trVE.ApolTheotokion.mode	@ltx/gr_gr_cog/miscellanea:misc.Mode2
ltx/gr_gr_cog/tr.d049:trVE.ApolTheotokion.text	@ltx/gr_gr_cog/da.d7:daVE.ApolTheotokion.text
ltx/gr_gr_cog/tr.d049:trVE.Apolytikion1.incipit	@ltx/gr_gr_cog/da.d7:daVE.Apolytikion1.incipit
ltx/gr_gr_cog/tr.d049:trVE.Apolytikion1.melody	
ltx/gr_gr_cog/tr.d049:trVE.Apolytikion1.mode	@ltx/gr_gr_cog/miscellanea:misc.Mode2
ltx/gr_gr_cog/tr.d049:trVE.Apolytikion1.text	@ltx/gr_gr_cog/da.d7:daVE.Apolytikion1.text
ltx/gr_gr_cog/tr.d049:trVE.Apolytikion2.incipit	@ltx/gr_gr_cog/da.d7:daVE.Apolytikion2.incipit
ltx/gr_gr_cog/tr.d049:trVE.Apolytikion2.melody	
ltx/gr_gr_cog/tr.d049:trVE.Apolytikion2.mode	@ltx/gr_gr_cog/miscellanea:misc.Mode2
ltx/gr_gr_cog/tr.d049:trVE.Apolytikion2.text	@ltx/gr_gr_cog/da.d7:daVE.Apolytikion2.text
ltx/gr_gr_cog/tr.d049:trVE.AposIdiomelon1.incipit	Τοῖς πάθεσι δουλώσας, τῆς ψυχῆς…
ltx/gr_gr_cog/tr.d049:trVE.AposIdiomelon1.melody	@ltx/gr_gr_cog/miscellanea:misc.Idiomelon
ltx/gr_gr_cog/tr.d049:trVE.AposIdiomelon1.mode	@ltx/gr_gr_cog/miscellanea:misc.Mode7
ltx/gr_gr_cog/tr.d049:trVE.AposIdiomelon1.text	Τοῖς πάθεσι δουλώσας, τῆς ψυχῆς μου τὸ ἀξίωμα, κτηνώδης ἐγενόμην, καὶ οὐκ ἰσχύω ἀτενίσαι πρὸς σὲ Ὕψιστε· ἀλλὰ κάτω νενευκὼς Χριστέ, ὡς ὁ Τελώνης, δέομαι κραυγάζων σοι· Ὁ Θεός, ἱλάσθητί μοι καὶ σῶσόν με.
ltx/gr_gr_cog/tr.d049:trVL.header	Προηγιασμένη Λειτουργία τῇ Παρασκευῇ τῆς Δʹ Ἑβδομάδος
