ltx/gr_gr_cog/ho.ho07:R01	
ltx/gr_gr_cog/ho.ho07:hoLI.Antiphon1.text	Ταῖς πρεσβείαις τῆς Θεοτόκου, Σῶτερ, σῶσον ἡμᾶς.
ltx/gr_gr_cog/ho.ho07:hoLI.Antiphon21.text	Σῶσον ἡμᾶς Υἱὲ Θεοῦ,
ltx/gr_gr_cog/ho.ho07:hoLI.Antiphon22.text	ψάλλοντάς σοι, Ἀλληλούϊα.
ltx/gr_gr_cog/ho.ho07:hoLI.Antiphon2s.incipit	@ltx/gr_gr_cog/properties:deprecated.key
ltx/gr_gr_cog/ho.ho07:hoLI.Antiphon2s.text	@ltx/gr_gr_cog/properties:deprecated.key
ltx/gr_gr_cog/ho.ho07:hoLI.Antiphon2w.incipit	@ltx/gr_gr_cog/properties:deprecated.key
ltx/gr_gr_cog/ho.ho07:hoLI.Antiphon2w.text	@ltx/gr_gr_cog/properties:deprecated.key
ltx/gr_gr_cog/ho.ho07:hoLI.EntranceHymn.incipit	Δεῦτε προσκυνήσωμεν…
ltx/gr_gr_cog/ho.ho07:hoLI.EntranceHymn.text	Δεῦτε προσκυνήσωμεν καὶ προσπέσωμεν Χριστῷ.
ltx/gr_gr_cog/ho.ho07:hoLI.EntranceHymn2s.incipit	@ltx/gr_gr_cog/properties:deprecated.key
ltx/gr_gr_cog/ho.ho07:hoLI.EntranceHymn2s.text	@ltx/gr_gr_cog/properties:deprecated.key
ltx/gr_gr_cog/ho.ho07:hoLI.EntranceHymn2w.incipit	@ltx/gr_gr_cog/properties:deprecated.key
ltx/gr_gr_cog/ho.ho07:hoLI.EntranceHymn2w.text	@ltx/gr_gr_cog/properties:deprecated.key
ltx/gr_gr_cog/ho.ho07:hoLI.MM.Antiphon2s.text	@ltx/gr_gr_cog/properties:media.key
ltx/gr_gr_cog/ho.ho07:hoLI.MM.Antiphon2w.text	@ltx/gr_gr_cog/properties:media.key
ltx/gr_gr_cog/ho.ho07:hoLI.MM.EntranceHymn2s.text	@ltx/gr_gr_cog/properties:media.key
ltx/gr_gr_cog/ho.ho07:hoLI.MM.EntranceHymn2w.text	@ltx/gr_gr_cog/properties:media.key
ltx/gr_gr_cog/ho.ho07:hoLI.MM.GospelAlleluia.text	@ltx/gr_gr_cog/properties:media.key
ltx/gr_gr_cog/ho.ho07:hoLI.MM.GospelAlleluiaMode1.text	@ltx/gr_gr_cog/properties:media.key
ltx/gr_gr_cog/ho.ho07:hoLI.MM.GospelAlleluiaMode2.text	@ltx/gr_gr_cog/properties:media.key
ltx/gr_gr_cog/ho.ho07:hoLI.MM.GospelAlleluiaMode3.text	@ltx/gr_gr_cog/properties:media.key
ltx/gr_gr_cog/ho.ho07:hoLI.MM.GospelAlleluiaMode4.text	@ltx/gr_gr_cog/properties:media.key
ltx/gr_gr_cog/ho.ho07:hoLI.MM.GospelAlleluiaMode5.text	@ltx/gr_gr_cog/properties:media.key
ltx/gr_gr_cog/ho.ho07:hoLI.MM.GospelAlleluiaMode6.text	@ltx/gr_gr_cog/properties:media.key
ltx/gr_gr_cog/ho.ho07:hoLI.MM.GospelAlleluiaMode7.text	@ltx/gr_gr_cog/properties:media.key
ltx/gr_gr_cog/ho.ho07:hoLI.MM.GospelAlleluiaMode8.text	@ltx/gr_gr_cog/prayers:pr.Alleluia3.text
ltx/gr_gr_cog/ho.ho07:hoLI.MM.OsoiEisChriston.text	@ltx/gr_gr_cog/properties:media.key
ltx/gr_gr_cog/ho.ho07:hoLI.MM.OsoiEisChristonBimatos.text	@ltx/gr_gr_cog/properties:media.key
ltx/gr_gr_cog/ho.ho07:hoLI.MM.Psalm102.text	
ltx/gr_gr_cog/ho.ho07:hoLI.MM.Psalm145.text	
ltx/gr_gr_cog/ho.ho07:hoLI.MM.TonStavronSouBimatos.text	@ltx/gr_gr_cog/properties:media.key
ltx/gr_gr_cog/ho.ho07:hoLI.MM.TrisagiosHymnBimatos.text	@ltx/gr_gr_cog/properties:media.key
ltx/gr_gr_cog/ho.ho07:hoLI.OnlyBegotten.incipit	Ὁ Μονογενὴς Υἱὸς…
ltx/gr_gr_cog/ho.ho07:hoLI.OnlyBegotten.text	Ὁ Μονογενὴς Υἱὸς καὶ Λόγος τοῦ Θεοῦ, ἀθάνατος ὑπάρχων καὶ καταδεξάμενος διὰ τὴν ἡμετέραν σωτηρίαν σαρκωθῆναι ἐκ τῆς ἁγίας Θεοτόκου καὶ ἀειπαρθένου Μαρίας, ἀτρέπτως ἐνανθρωπήσας, σταυρωθείς τε, Χριστὲ ὁ Θεός, θανάτῳ θάνατον πατήσας, εἷς ὢν τῆς Ἁγίας Τριάδος, συνδοξαζόμενος τῷ Πατρὶ καὶ τῷ Ἁγίῳ Πνεύματι, σῶσον ἡμᾶς.
ltx/gr_gr_cog/ho.ho07:hoLI.OnlyBegotten.title	Ὁ Μονογενής.
ltx/gr_gr_cog/ho.ho07:hoLI.OsoiEisChriston.title	Ἀντὶ τοῦ Τρισαγίου
ltx/gr_gr_cog/ho.ho07:hoLI.TonStavronSou.incipit	Τὸν Σταυρόν σου…
ltx/gr_gr_cog/ho.ho07:hoLI.TonStavronSou.text	Τὸν Σταυρόν σου προσκυνοῦμεν, Δέσποτα, καὶ τὴν ἁγίαν σου ἀνάστασιν δοξάζομεν.
ltx/gr_gr_cog/ho.ho07:hoLI.TonStavronSou.title	Ἀντὶ τοῦ Τρισαγίου
ltx/gr_gr_cog/ho.ho07:hoLI.TonStavronSou1.text	Τὸν Σταυρόν σου προσκυνοῦμεν,
ltx/gr_gr_cog/ho.ho07:hoLI.TonStavronSou2.text	Δέσποτα,
ltx/gr_gr_cog/ho.ho07:hoLI.TonStavronSou3.text	καὶ τὴν ἁγίαν σου ἀνάστασιν
ltx/gr_gr_cog/ho.ho07:hoLI.TonStavronSou4.text	δοξάζομεν.
ltx/gr_gr_cog/ho.ho07:hoLI.TonStavronSouDynamis.text	Τὸν Σταυρόν σου προσκυνοῦμεν, Δέσποτα, καὶ τὴν ἁγίαν σου ἀνάστασιν δοξάζομεν.
ltx/gr_gr_cog/ho.ho07:hoLI.TrisagiosHymn.incipit	Ἅγιος ὁ Θεός…
ltx/gr_gr_cog/ho.ho07:hoLI.TrisagiosHymn.text	Ἅγιος ὁ Θεός, ἅγιος Ἰσχυρός, ἅγιος Ἀθάνατος, ἐλέησον ἡμᾶς.
ltx/gr_gr_cog/ho.ho07:hoLI.TrisagiosHymn.title	Ὁ Τρισάγιος Ὗμνος
ltx/gr_gr_cog/ho.ho07:hoLI.TrisagiosHymn1.text	Ἅγιος ὁ Θεός,
ltx/gr_gr_cog/ho.ho07:hoLI.TrisagiosHymn2.text	Ἅγιος Ἰσχυρός,
ltx/gr_gr_cog/ho.ho07:hoLI.TrisagiosHymn3.text	Ἅγιος Ἀθάνατος,
ltx/gr_gr_cog/ho.ho07:hoLI.TrisagiosHymn34.text	Ἅγιος Ἀθάνατος, ἐλέησον ἡμᾶς.
ltx/gr_gr_cog/ho.ho07:hoLI.TrisagiosHymn4.text	Ἐλέησον ἡμᾶς.
ltx/gr_gr_cog/ho.ho07:hoLI.TrisagiosHymnDynamis.text	Ἅγιος ὁ Θεός, ἅγιος Ἰσχυρός, ἅγιος Ἀθάνατος, ἐλέησον ἡμᾶς.
ltx/gr_gr_cog/ho.ho07:hoLI.TrisagiosHymnJames3.text	Ἁγία Τριάς.
ltx/gr_gr_cog/ho.ho07:hoLI.TrisagiosHymnJames34.text	Ἁγία Τριάς, ἐλέησον ἡμᾶς.
ltx/gr_gr_cog/ho.ho07:hoTY.Key0200.text	
ltx/gr_gr_cog/ho.ho07:hoTY.Key0212.text	Μνήσθητι ἡμῶν, Κύριε, ὅταν ἔλθῃς ἐν τῇ Βασιλείᾳ σου.
ltx/gr_gr_cog/ho.ho07:hoTY.Key0213.text	Μνήσθητι ἡμῶν, Δέσποτα, ὅταν ἔλθῃς ἐν τῇ Βασιλείᾳ σου.
ltx/gr_gr_cog/ho.ho07:hoTY.Key0214.text	Μνήσθητι ἡμῶν, Ἅγιε, ὅταν ἔλθῃς ἐν τῇ Βασιλείᾳ σου.
ltx/gr_gr_cog/ho.ho07:hoTY.Key0215.text	Χορὸς ὁ ἐπουράνιος ὑμνεῖ σε καὶ λέγει· Ἅγιος, Ἅγιος, Ἅγιος, Κύριος Σαβαώθ, πλήρης ὁ οὐρανὸς καὶ ἡ γῆ τῆς δόξης σου.
ltx/gr_gr_cog/ho.ho07:hoTY.Key0216.text	Χορὸς ἁγίων Ἀγγέλων καὶ Ἀρχαγγέλων, μετὰ πασῶν τῶν ἐπουρανίων Δυνάμεων, ὑμνεῖ σε καὶ λέγει· Ἅγιος, Ἅγιος, Ἅγιος, Κύριος Σαβαώθ, πλήρης ὁ οὐρανὸς καὶ ἡ γῆ τῆς δόξης σου.
ltx/gr_gr_cog/ho.ho07:hoTY.Key0217.text	Ἄνες, ἄφες, συγχώρησον, ὁ Θεός, τὰ παραπτώματα ἡμῶν, τὰ ἑκούσια καὶ τὰ ἀκούσια, τὰ ἐν ἔργῳ καὶ λόγῳ, τὰ ἐν γνώσει καὶ ἀγνοίᾳ, τὰ ἐν νυκτὶ καὶ ἡμέρα, τὰ κατὰ νοῦν καὶ διάνοιαν, τὰ πάντα ἡμῖν συγχώρησον, ὡς ἀγαθὸς καὶ φιλάνθρωπος.
ltx/gr_gr_cog/ho.ho07:hoTY.Key0408.incipit	Προστασία…
ltx/gr_gr_cog/ho.ho07:hoTY.Key0408.mode	@ltx/gr_gr_cog/miscellanea:misc.Mode2
ltx/gr_gr_cog/ho.ho07:hoTY.Key0408.text	Προστασία τῶν Χριστιανῶν ἀκαταίσχυντε, μεσιτεία, πρὸς τὸν Ποιητὴν ἀμετάθετε, μὴ παρίδῃς, ἁμαρτωλῶν δεήσεων φωνάς, ἀλλὰ πρόφθασον, ὡς ἀγαθή, εἰς τὴν βοήθειαν ἡμῶν, τῶν πιστῶς κραυγαζόντων σοι· Τάχυνον εἰς πρεσβείαν, καὶ σπεῦσον εἰς ἱκεσίαν, ἡ προστατεύουσα ἀεί, Θεοτόκε, τῶν τιμώντων σε.
ltx/gr_gr_cog/ho.ho07:hoTY.Key0501.incipit	Παναγία Τριάς, τὸ Ὁμοούσιον κράτος…
ltx/gr_gr_cog/ho.ho07:hoTY.Key0501.text	Παναγία Τριάς, τὸ Ὁμοούσιον κράτος, ἡ ἀδιαίρετος βασιλεία, ἡ πάντων τῶν ἀγαθῶν αἰτία, εὐδόκησον δὴ καὶ ἐπʼ ἐμοὶ τῷ ἁμαρτωλῷ· στήριξον, συνέτισον τὴν καρδίαν μου, καὶ πᾶσαν περίελέ μου τὴν βεβηλότητα· φώτισόν μου τὴν διάνοιαν, ἵνα διὰ παντὸς δοξάζω, ὑμνῶ, προσκυνῶ καὶ λέγω· Εἷς Ἅγιος, εἷς Κύριος, Ἰησοῦς Χριστός, εἰς δόξαν Θεοῦ Πατρός.
ltx/gr_gr_cog/ho.ho07:hoTY.title	ΑΚΟΛΟΥΘΙΑ ΤΩΝ ΤΥΠΙΚΩΝ
