ltx/gr_gr_cog/le.go.me.m03.d30:lemeLI.Gospel.book_abbr	@ltx/gr_gr_cog/le.go.mc.d145:lemcLI.Gospel.book_abbr
ltx/gr_gr_cog/le.go.me.m03.d30:lemeLI.Gospel.book_string	@ltx/gr_gr_cog/le.go.mc.d145:lemcLI.Gospel.book_string
ltx/gr_gr_cog/le.go.me.m03.d30:lemeLI.Gospel.chapverse	@ltx/gr_gr_cog/le.go.mc.d145:lemcLI.Gospel.chapverse
ltx/gr_gr_cog/le.go.me.m03.d30:lemeLI.Gospel.incipit	@ltx/gr_gr_cog/le.go.mc.d145:lemcLI.Gospel.incipit
ltx/gr_gr_cog/le.go.me.m03.d30:lemeLI.Gospel.text	@ltx/gr_gr_cog/le.go.mc.d145:lemcLI.Gospel.text
ltx/gr_gr_cog/le.go.me.m03.d30:lemeLI.Gospel.title	Τοῦ Ὁσίου
ltx/gr_gr_cog/le.go.me.m03.d30:lemeLI.Gospel.title_abbr	Τοῦ Ὁσίου
ltx/gr_gr_cog/le.go.me.m03.d30:lemeLI.Gospel.version	@ltx/gr_gr_cog/le.go.mc.d145:lemcLI.Gospel.version
