ltx/gr_gr_cog/le.go.me.m05.d10:lemeLI.Gospel.book_abbr	@ltx/gr_gr_cog/le.go.lu.d011:leluLI.Gospel.book_abbr
ltx/gr_gr_cog/le.go.me.m05.d10:lemeLI.Gospel.book_string	@ltx/gr_gr_cog/le.go.lu.d011:leluLI.Gospel.book_string
ltx/gr_gr_cog/le.go.me.m05.d10:lemeLI.Gospel.chapverse	@ltx/gr_gr_cog/le.go.lu.d011:leluLI.Gospel.chapverse
ltx/gr_gr_cog/le.go.me.m05.d10:lemeLI.Gospel.incipit	@ltx/gr_gr_cog/le.go.lu.d011:leluLI.Gospel.incipit
ltx/gr_gr_cog/le.go.me.m05.d10:lemeLI.Gospel.text	@ltx/gr_gr_cog/le.go.lu.d011:leluLI.Gospel.text
ltx/gr_gr_cog/le.go.me.m05.d10:lemeLI.Gospel.title	Τοῦ Ἀποστόλου
ltx/gr_gr_cog/le.go.me.m05.d10:lemeLI.Gospel.title_abbr	Τοῦ Ἀποστόλου
ltx/gr_gr_cog/le.go.me.m05.d10:lemeLI.Gospel.version	@ltx/gr_gr_cog/le.go.lu.d011:leluLI.Gospel.version
