ltx/gr_gr_cog/me.m05.d01:meDA.commemoration.first	Μνήμη τοῦ Ἁγίου Προφήτου Ἱερεμίου
ltx/gr_gr_cog/me.m05.d01:meDA.commemoration.first_name	
ltx/gr_gr_cog/me.m05.d01:meDA.commemoration.first_short	Μνήμη τοῦ Ἁγίου Προφήτου Ἱερεμίου
ltx/gr_gr_cog/me.m05.d01:meDA.commemoration.first_title	@ltx/gr_gr_cog/titles:ti.Prophet
ltx/gr_gr_cog/me.m05.d01:meDA.commemoration.full	Μνήμη τοῦ Ἁγίου Προφήτου Ἱερεμίου
ltx/gr_gr_cog/me.m05.d01:meDA.commemoration.second_name	
ltx/gr_gr_cog/me.m05.d01:meDA.commemoration.second_title	
ltx/gr_gr_cog/me.m05.d01:meDA.date	Τῌ Αʹ ΜΑΪΟΥ
ltx/gr_gr_cog/me.m05.d01:meDA.fordate	διὰ τὴν 1ην Μαΐου
ltx/gr_gr_cog/me.m05.d01:meDA.insert1	καὶ τοῦ ἁγίου ἐνδόξου Προφήτου Ἱερεμίου,
ltx/gr_gr_cog/me.m05.d01:meDA.insert2	οὗ καὶ τὴν μνήμην ἐπιτελοῦμεν·
ltx/gr_gr_cog/me.m05.d01:meDA.note	
ltx/gr_gr_cog/me.m05.d01:meDA.pdfcoverdate	τῆς 1ης Μαΐου,
ltx/gr_gr_cog/me.m05.d01:meDA.pdfheaderdate	τῆς 1ης Μαΐου
ltx/gr_gr_cog/me.m05.d01:meHO.commemorations	
ltx/gr_gr_cog/me.m05.d01:meHO.note1	
ltx/gr_gr_cog/me.m05.d01:meHO.note2	
ltx/gr_gr_cog/me.m05.d01:meHO.number	
ltx/gr_gr_cog/me.m05.d01:meHO.rank	
ltx/gr_gr_cog/me.m05.d01:meLE.commemoration1	Μνήμη τοῦ Ἁγίου Προφήτου Ἱερεμίου.
ltx/gr_gr_cog/me.m05.d01:meLE.commemoration2	
ltx/gr_gr_cog/me.m05.d01:meLI.Kontakion1.incipit	@ltx/gr_gr_cog/me.m05.d01:meMA.Kontakion1ger.incipit
ltx/gr_gr_cog/me.m05.d01:meLI.Kontakion1.melody	@ltx/gr_gr_cog/me.m05.d01:meMA.Kontakion1ger.melody
ltx/gr_gr_cog/me.m05.d01:meLI.Kontakion1.mode	@ltx/gr_gr_cog/me.m05.d01:meMA.Kontakion1ger.mode
ltx/gr_gr_cog/me.m05.d01:meLI.Kontakion1.text	@ltx/gr_gr_cog/me.m05.d01:meMA.Kontakion1ger.text
ltx/gr_gr_cog/me.m05.d01:meLI.MM.CommunionHymn.text	@ltx/gr_gr_cog/properties:media.key
ltx/gr_gr_cog/me.m05.d01:meLI.Megalynarion.text	
ltx/gr_gr_cog/me.m05.d01:meMA.C1.title	@ltx/gr_gr_cog/titles:ti.CanonSaintM
ltx/gr_gr_cog/me.m05.d01:meMA.C1.verse	@ltx/gr_gr_cog/prayers:pr.verse_Prophet.text
ltx/gr_gr_cog/me.m05.d01:meMA.Kontakion1ger.incipit	Ὡς ἐκ γαστρὸς θεόληπτος, καὶ…
ltx/gr_gr_cog/me.m05.d01:meMA.Kontakion1ger.melody	@ltx/gr_gr_cog/he.a.m8:heAU.OsAparchas.name
ltx/gr_gr_cog/me.m05.d01:meMA.Kontakion1ger.mode	@ltx/gr_gr_cog/miscellanea:misc.Mode8
ltx/gr_gr_cog/me.m05.d01:meMA.Kontakion1ger.poet	@ltx/gr_gr_cog/poets:po.Gerasimou
ltx/gr_gr_cog/me.m05.d01:meMA.Kontakion1ger.text	Ὡς ἐκ γαστρὸς θεόληπτος, καὶ συμπαθείας ἔμπλεως, τὴν τοῦ λαοῦ σου ἐθρήνησας ἔκπτωσιν, Ἱερεμία ἔνδοξε· διὰ τοῦτό σε λίθοις, ἐν Αίγύπτῳ Προφῆτα φόνῳ παρέδωκαν, οἱ μὴ εἰδότες ψάλλειν, σὺν σοὶ Θεῷ· Ἀλληλούϊα.
ltx/gr_gr_cog/me.m05.d01:meMA.Ode1C11.greekmelody	@ltx/gr_gr_cog/he.h.m8:heHE.YgranDiodefsas.greekname
ltx/gr_gr_cog/me.m05.d01:meMA.Ode1C11.incipit	Πρὸ τοῦ σε πλασθῆναι προγνωστικῶς…
ltx/gr_gr_cog/me.m05.d01:meMA.Ode1C11.melody	@ltx/gr_gr_cog/he.h.m8:heHE.YgranDiodefsas.name
ltx/gr_gr_cog/me.m05.d01:meMA.Ode1C11.mode	@ltx/gr_gr_cog/miscellanea:misc.Mode8
ltx/gr_gr_cog/me.m05.d01:meMA.Ode1C11.ode	@ltx/gr_gr_cog/miscellanea:misc.Ode1
ltx/gr_gr_cog/me.m05.d01:meMA.Ode1C11.text	Πρὸ τοῦ σε πλασθῆναι προγνωστικῶς, μητρὸς ἐκ κοιλίας, ἡγιάσθης καὶ τῶν ἐθνῶν, Προφήτης ἐχρίσθης ἀνακράζων, τῷ Λυτρωτῇ καὶ Θεῷ ἡμῶν ᾄσωμεν.
ltx/gr_gr_cog/me.m05.d01:meMA.Ode1C12.incipit	Ὁ πάντων τὴν γνῶσιν προειληφώς…
ltx/gr_gr_cog/me.m05.d01:meMA.Ode1C12.melody	@ltx/gr_gr_cog/he.h.m8:heHE.YgranDiodefsas.name
ltx/gr_gr_cog/me.m05.d01:meMA.Ode1C12.mode	@ltx/gr_gr_cog/miscellanea:misc.Mode8
ltx/gr_gr_cog/me.m05.d01:meMA.Ode1C12.ode	@ltx/gr_gr_cog/miscellanea:misc.Ode1
ltx/gr_gr_cog/me.m05.d01:meMA.Ode1C12.text	Ὁ πάντων τὴν γνῶσιν προειληφώς, σοῦ τῆς διανοίας, τὰς κινήσεις προθεωρῶν, ὦ Ἱερεμία θεοφάντορ, καθηγητήν σε λαοῦ προχειρίζεται.
ltx/gr_gr_cog/me.m05.d01:meMA.Ode1C13.incipit	Σοῦ τῆς διανοίας τὸ ὀπτικόν…
ltx/gr_gr_cog/me.m05.d01:meMA.Ode1C13.melody	@ltx/gr_gr_cog/he.h.m8:heHE.YgranDiodefsas.name
ltx/gr_gr_cog/me.m05.d01:meMA.Ode1C13.mode	@ltx/gr_gr_cog/miscellanea:misc.Mode8
ltx/gr_gr_cog/me.m05.d01:meMA.Ode1C13.ode	@ltx/gr_gr_cog/miscellanea:misc.Ode1
ltx/gr_gr_cog/me.m05.d01:meMA.Ode1C13.text	Σοῦ τῆς διανοίας τὸ ὀπτικόν, σαφῶς ἐκκαθάρας, μολυσμάτων τῶν τῆς σαρκός, ἀληθείας μάρτυς ἀνεδείχθης, τῷ Ποιητῇ σου ποθεινότατος.
ltx/gr_gr_cog/me.m05.d01:meMA.Ode1C1T.incipit	Σκηνώσαντα Λόγον τὸν τοῦ Πατρός…
ltx/gr_gr_cog/me.m05.d01:meMA.Ode1C1T.melody	@ltx/gr_gr_cog/he.h.m8:heHE.YgranDiodefsas.name
ltx/gr_gr_cog/me.m05.d01:meMA.Ode1C1T.mode	@ltx/gr_gr_cog/miscellanea:misc.Mode8
ltx/gr_gr_cog/me.m05.d01:meMA.Ode1C1T.ode	@ltx/gr_gr_cog/miscellanea:misc.Ode1
ltx/gr_gr_cog/me.m05.d01:meMA.Ode1C1T.text	Σκηνώσαντα Λόγον τὸν τοῦ Πατρός, ἐπὶ σοὶ Παρθένε, Θεοτόκε, ὑπερφυῶς, ἐν σαρκὶ τεκοῦσα ἀνεφάνης, τῶν ποιημάτων ἁπάντων δεσπόζουσα.
ltx/gr_gr_cog/me.m05.d01:meMA.Ode3C11.greekmelody	@ltx/gr_gr_cog/he.h.m8:heHE.SyEiToStereoma.greekname
ltx/gr_gr_cog/me.m05.d01:meMA.Ode3C11.incipit	Σὺ προκαθηγίασας, τὸν ὑποφήτην σου…
ltx/gr_gr_cog/me.m05.d01:meMA.Ode3C11.melody	@ltx/gr_gr_cog/he.h.m8:heHE.SyEiToStereoma.name
ltx/gr_gr_cog/me.m05.d01:meMA.Ode3C11.mode	@ltx/gr_gr_cog/miscellanea:misc.Mode8
ltx/gr_gr_cog/me.m05.d01:meMA.Ode3C11.ode	@ltx/gr_gr_cog/miscellanea:misc.Ode3
ltx/gr_gr_cog/me.m05.d01:meMA.Ode3C11.text	Σὺ προκαθηγίασας, τὸν ὑποφήτην σου Δέσποτα, πρὸ τοκετοῦ, καὶ τοῖς πλανωμένοις, ὁδηγὸν ἐξαπέστειλας.
ltx/gr_gr_cog/me.m05.d01:meMA.Ode3C12.incipit	Χάρις σοῦ τοῖς χείλεσιν, ἐγκατοικήσασα…
ltx/gr_gr_cog/me.m05.d01:meMA.Ode3C12.melody	@ltx/gr_gr_cog/he.h.m8:heHE.SyEiToStereoma.name
ltx/gr_gr_cog/me.m05.d01:meMA.Ode3C12.mode	@ltx/gr_gr_cog/miscellanea:misc.Mode8
ltx/gr_gr_cog/me.m05.d01:meMA.Ode3C12.ode	@ltx/gr_gr_cog/miscellanea:misc.Ode3
ltx/gr_gr_cog/me.m05.d01:meMA.Ode3C12.text	Χάρις σοῦ τοῖς χείλεσιν, ἐγκατοικήσασα Πνεύματος, φωτιστικήν, οἷά περ λαμπάδα, τοῖς ἐν σκότει σε ἀνέδειξε.
ltx/gr_gr_cog/me.m05.d01:meMA.Ode3C13.incipit	Μύρον εὐωδίας σου, μὴ ὑποφέροντες…
ltx/gr_gr_cog/me.m05.d01:meMA.Ode3C13.melody	@ltx/gr_gr_cog/he.h.m8:heHE.SyEiToStereoma.name
ltx/gr_gr_cog/me.m05.d01:meMA.Ode3C13.mode	@ltx/gr_gr_cog/miscellanea:misc.Mode8
ltx/gr_gr_cog/me.m05.d01:meMA.Ode3C13.ode	@ltx/gr_gr_cog/miscellanea:misc.Ode3
ltx/gr_gr_cog/me.m05.d01:meMA.Ode3C13.text	Μύρον εὐωδίας σου, μὴ ὑποφέροντες δῆμός σε, τοῦ Ἰσραήλ, βεβορβορωμένος, ἐν τῷ λάκκῳ καθείργνυσι.
ltx/gr_gr_cog/me.m05.d01:meMA.Ode3C1T.incipit	Διὰ σοῦ Πανάχραντε, ὁ ὑπερούσιος…
ltx/gr_gr_cog/me.m05.d01:meMA.Ode3C1T.melody	@ltx/gr_gr_cog/he.h.m8:heHE.SyEiToStereoma.name
ltx/gr_gr_cog/me.m05.d01:meMA.Ode3C1T.mode	@ltx/gr_gr_cog/miscellanea:misc.Mode8
ltx/gr_gr_cog/me.m05.d01:meMA.Ode3C1T.ode	@ltx/gr_gr_cog/miscellanea:misc.Ode3
ltx/gr_gr_cog/me.m05.d01:meMA.Ode3C1T.text	Διὰ σοῦ Πανάχραντε, ὁ ὑπερούσιος ἄναρχος, Υἱὸς Θεοῦ, συναναστραφῆναι, τοῖς ἀνθρώποις εὐδόκησε.
ltx/gr_gr_cog/me.m05.d01:meMA.Ode3H.greekmelody	@ltx/gr_gr_cog/he.h.m8:heHE.SyEiToStereoma.greekname
ltx/gr_gr_cog/me.m05.d01:meMA.Ode3H.incipit	@ltx/gr_gr_cog/he.h.m8:heHE.SyEiToStereoma.incipit
ltx/gr_gr_cog/me.m05.d01:meMA.Ode3H.melody	@ltx/gr_gr_cog/he.h.m8:heHE.SyEiToStereoma.melody
ltx/gr_gr_cog/me.m05.d01:meMA.Ode3H.mode	@ltx/gr_gr_cog/miscellanea:misc.Mode8
ltx/gr_gr_cog/me.m05.d01:meMA.Ode3H.ode	@ltx/gr_gr_cog/miscellanea:misc.Ode3
ltx/gr_gr_cog/me.m05.d01:meMA.Ode3H.text	@ltx/gr_gr_cog/he.h.m8:heHE.SyEiToStereoma.text
ltx/gr_gr_cog/me.m05.d01:meMA.Ode3Kathisma1.greekmelody	@ltx/gr_gr_cog/he.a.m1:heAU.TonTafonSouSotir.greekname
ltx/gr_gr_cog/me.m05.d01:meMA.Ode3Kathisma1.incipit	Ὁ ἄνομος λαός, σὲ τὸν…
ltx/gr_gr_cog/me.m05.d01:meMA.Ode3Kathisma1.melody	@ltx/gr_gr_cog/he.a.m1:heAU.TonTafonSouSotir.name
ltx/gr_gr_cog/me.m05.d01:meMA.Ode3Kathisma1.mode	@ltx/gr_gr_cog/miscellanea:misc.Mode1
ltx/gr_gr_cog/me.m05.d01:meMA.Ode3Kathisma1.text	Ὁ ἄνομος λαός, σὲ τὸν νόμους δικαίους, κρατύνοντα σοφέ, ὑποβάλλει βορβόρῳ, ὀσμὴν θείας γνώσεως, μὴ βουλόμενος δέξασθαι, ὃν ἐθρήνησας, ὑπὸ βαρβάρων ἀθέων, ἀπαγόμενον, αἰχμαλωσίᾳ βιαίᾳ, Προφῆτα μακάριε.
ltx/gr_gr_cog/me.m05.d01:meMA.Ode4C11.greekmelody	@ltx/gr_gr_cog/he.h.m8:heHE.EisakikoaKyrie.greekname
ltx/gr_gr_cog/me.m05.d01:meMA.Ode4C11.incipit	Ἡ ὑπέρφωτος ἔλλαμψις, ἡ τοῦ…
ltx/gr_gr_cog/me.m05.d01:meMA.Ode4C11.melody	@ltx/gr_gr_cog/he.h.m8:heHE.EisakikoaKyrie.name
ltx/gr_gr_cog/me.m05.d01:meMA.Ode4C11.mode	@ltx/gr_gr_cog/miscellanea:misc.Mode8
ltx/gr_gr_cog/me.m05.d01:meMA.Ode4C11.ode	@ltx/gr_gr_cog/miscellanea:misc.Ode4
ltx/gr_gr_cog/me.m05.d01:meMA.Ode4C11.text	Ἡ ὑπέρφωτος ἔλλαμψις, ἡ τοῦ παναγίου καὶ θείου Πνεύματος, τῇ καρδίᾳ σου ἀστράψασα, τοῖς ἐν σκότει φαίνειν ἀπειργάσατο.
ltx/gr_gr_cog/me.m05.d01:meMA.Ode4C12.incipit	Προφητῶν συμπαθέστατος, πάντων πεφηνὼς παμμάκαρ…
ltx/gr_gr_cog/me.m05.d01:meMA.Ode4C12.melody	@ltx/gr_gr_cog/he.h.m8:heHE.EisakikoaKyrie.name
ltx/gr_gr_cog/me.m05.d01:meMA.Ode4C12.mode	@ltx/gr_gr_cog/miscellanea:misc.Mode8
ltx/gr_gr_cog/me.m05.d01:meMA.Ode4C12.ode	@ltx/gr_gr_cog/miscellanea:misc.Ode4
ltx/gr_gr_cog/me.m05.d01:meMA.Ode4C12.text	Προφητῶν συμπαθέστατος, πάντων πεφηνὼς παμμάκαρ θεόληπτε, συμπαθείας με ἀξίωσον, τὸν ἀπεγνωσμένον πολλοῖς πάθεσιν.
ltx/gr_gr_cog/me.m05.d01:meMA.Ode4C13.incipit	Ὡς μεσίτης γενόμενος, ἐκφαντορικῆς καὶ…
ltx/gr_gr_cog/me.m05.d01:meMA.Ode4C13.melody	@ltx/gr_gr_cog/he.h.m8:heHE.EisakikoaKyrie.name
ltx/gr_gr_cog/me.m05.d01:meMA.Ode4C13.mode	@ltx/gr_gr_cog/miscellanea:misc.Mode8
ltx/gr_gr_cog/me.m05.d01:meMA.Ode4C13.ode	@ltx/gr_gr_cog/miscellanea:misc.Ode4
ltx/gr_gr_cog/me.m05.d01:meMA.Ode4C13.text	Ὡς μεσίτης γενόμενος, ἐκφαντορικῆς καὶ θείας ἐλλάμψεως, μεσιτείαις σου εἰρήνευσον, πολυτάραχόν μου βίου κλύδωνα.
ltx/gr_gr_cog/me.m05.d01:meMA.Ode4C1T.incipit	Ἰσραὴλ εὑρὼν δέδωκε, τῷ ἠγαπημένῳ…
ltx/gr_gr_cog/me.m05.d01:meMA.Ode4C1T.melody	@ltx/gr_gr_cog/he.h.m8:heHE.EisakikoaKyrie.name
ltx/gr_gr_cog/me.m05.d01:meMA.Ode4C1T.mode	@ltx/gr_gr_cog/miscellanea:misc.Mode8
ltx/gr_gr_cog/me.m05.d01:meMA.Ode4C1T.ode	@ltx/gr_gr_cog/miscellanea:misc.Ode4
ltx/gr_gr_cog/me.m05.d01:meMA.Ode4C1T.text	Ἰσραὴλ εὑρὼν δέδωκε, τῷ ἠγαπημένῳ Θεὸς νῦν ἅπασαν, ἐπιστήμης τὴν ἐπίγνωσιν, καὶ ἐκ σοῦ Παρθένε ἡμῖν ἔλαμψεν.
ltx/gr_gr_cog/me.m05.d01:meMA.Ode5C11.greekmelody	@ltx/gr_gr_cog/he.h.m8:heHE.FotisonImas.greekname
ltx/gr_gr_cog/me.m05.d01:meMA.Ode5C11.incipit	Ὥσπερ ἀστραπήν, τὸν Προφήτην σου…
ltx/gr_gr_cog/me.m05.d01:meMA.Ode5C11.melody	@ltx/gr_gr_cog/he.h.m8:heHE.FotisonImas.name
ltx/gr_gr_cog/me.m05.d01:meMA.Ode5C11.mode	@ltx/gr_gr_cog/miscellanea:misc.Mode8
ltx/gr_gr_cog/me.m05.d01:meMA.Ode5C11.ode	@ltx/gr_gr_cog/miscellanea:misc.Ode5
ltx/gr_gr_cog/me.m05.d01:meMA.Ode5C11.text	Ὥσπερ ἀστραπήν, τὸν Προφήτην σου ἀπέστειλας, Ἱερεμίαν τὸν ἱερώτατον, τοῖς ἐν τῷ σκότει, τὸ φῶς σε Χριστὲ μηνύοντα.
ltx/gr_gr_cog/me.m05.d01:meMA.Ode5C12.incipit	Βέλος ἐκλεκτόν, ἐν φαρέτρᾳ σε…
ltx/gr_gr_cog/me.m05.d01:meMA.Ode5C12.melody	@ltx/gr_gr_cog/he.h.m8:heHE.FotisonImas.name
ltx/gr_gr_cog/me.m05.d01:meMA.Ode5C12.mode	@ltx/gr_gr_cog/miscellanea:misc.Mode8
ltx/gr_gr_cog/me.m05.d01:meMA.Ode5C12.ode	@ltx/gr_gr_cog/miscellanea:misc.Ode5
ltx/gr_gr_cog/me.m05.d01:meMA.Ode5C12.text	Βέλος ἐκλεκτόν, ἐν φαρέτρᾳ σε κρυπτόμενον, Ἱερεμία τῇ προγνώσει αὐτοῦ, ὁ σὸς Δεσπότης, οἷς ἔδει καιροῖς ἀνέδειξεν.
ltx/gr_gr_cog/me.m05.d01:meMA.Ode5C13.incipit	Ὦτα καθαρά, διανοίας ἔχων ἔνδοξε…
ltx/gr_gr_cog/me.m05.d01:meMA.Ode5C13.melody	@ltx/gr_gr_cog/he.h.m8:heHE.FotisonImas.name
ltx/gr_gr_cog/me.m05.d01:meMA.Ode5C13.mode	@ltx/gr_gr_cog/miscellanea:misc.Mode8
ltx/gr_gr_cog/me.m05.d01:meMA.Ode5C13.ode	@ltx/gr_gr_cog/miscellanea:misc.Ode5
ltx/gr_gr_cog/me.m05.d01:meMA.Ode5C13.text	Ὦτα καθαρά, διανοίας ἔχων ἔνδοξε, προσομιλοῦντός σοι τοῦ Πνεύματος, κατηξιώθης, Προφῆτα ἐπακροάσασθαι.
ltx/gr_gr_cog/me.m05.d01:meMA.Ode5C1T.incipit	Μέγα καὶ φρικτόν, τῆς Παρθένου…
ltx/gr_gr_cog/me.m05.d01:meMA.Ode5C1T.melody	@ltx/gr_gr_cog/he.h.m8:heHE.FotisonImas.name
ltx/gr_gr_cog/me.m05.d01:meMA.Ode5C1T.mode	@ltx/gr_gr_cog/miscellanea:misc.Mode8
ltx/gr_gr_cog/me.m05.d01:meMA.Ode5C1T.ode	@ltx/gr_gr_cog/miscellanea:misc.Ode5
ltx/gr_gr_cog/me.m05.d01:meMA.Ode5C1T.text	Μέγα καὶ φρικτόν, τῆς Παρθένου τὸ μυστήριον· τὸν γὰρ ὀφθέντα ἐπὶ γῆς διʼ αὐτῆς, Θεὸν ἀνθρώποις, μητρικῶς ἐτιθηνήσατο.
ltx/gr_gr_cog/me.m05.d01:meMA.Ode6C11.greekmelody	@ltx/gr_gr_cog/he.h.m8:heHE.AvyssosAmartion.greekname
ltx/gr_gr_cog/me.m05.d01:meMA.Ode6C11.incipit	Εἵλκυσας τὸν φωτισμόν, καὶ τὴν…
ltx/gr_gr_cog/me.m05.d01:meMA.Ode6C11.melody	@ltx/gr_gr_cog/he.h.m8:heHE.AvyssosAmartion.name
ltx/gr_gr_cog/me.m05.d01:meMA.Ode6C11.mode	@ltx/gr_gr_cog/miscellanea:misc.Mode8
ltx/gr_gr_cog/me.m05.d01:meMA.Ode6C11.ode	@ltx/gr_gr_cog/miscellanea:misc.Ode6
ltx/gr_gr_cog/me.m05.d01:meMA.Ode6C11.text	Εἵλκυσας τὸν φωτισμόν, καὶ τὴν χάριν δαψιλῶς θεοφόρε, πνευματικῶς τὸ στόμα, τῆς ψυχῆς ὡς ἐπλάτυνας, καὶ πλησθεὶς κοινωνικῶς, πᾶσι μετέδωσας, ὦ Προφῆτα, τοῖς βουλομένοις τῆς ἐλλάμψεως.
ltx/gr_gr_cog/me.m05.d01:meMA.Ode6C12.incipit	Θάλασσαν τὴν κοσμικήν, ὑψουμένην πειρασμῶν…
ltx/gr_gr_cog/me.m05.d01:meMA.Ode6C12.melody	@ltx/gr_gr_cog/he.h.m8:heHE.AvyssosAmartion.name
ltx/gr_gr_cog/me.m05.d01:meMA.Ode6C12.mode	@ltx/gr_gr_cog/miscellanea:misc.Mode8
ltx/gr_gr_cog/me.m05.d01:meMA.Ode6C12.ode	@ltx/gr_gr_cog/miscellanea:misc.Ode6
ltx/gr_gr_cog/me.m05.d01:meMA.Ode6C12.text	Θάλασσαν τὴν κοσμικήν, ὑψουμένην πειρασμῶν τρικυμίαις, ἑωρακὼς ἐσχάτους, τοὺς σταθμοὺς ἐπεπόθησας, καὶ πηγὴν ποταμηδόν, βρύουσαν δάκρυα, τὸν λαόν σου, τὸν δυσμενῆ πικρῶς ὀδύρεσθαι.
ltx/gr_gr_cog/me.m05.d01:meMA.Ode6C13.incipit	Θάνατον τοῦ Λυτρωτοῦ, προεδήλους μυστικῶς…
ltx/gr_gr_cog/me.m05.d01:meMA.Ode6C13.melody	@ltx/gr_gr_cog/he.h.m8:heHE.AvyssosAmartion.name
ltx/gr_gr_cog/me.m05.d01:meMA.Ode6C13.mode	@ltx/gr_gr_cog/miscellanea:misc.Mode8
ltx/gr_gr_cog/me.m05.d01:meMA.Ode6C13.ode	@ltx/gr_gr_cog/miscellanea:misc.Ode6
ltx/gr_gr_cog/me.m05.d01:meMA.Ode6C13.text	Θάνατον τοῦ Λυτρωτοῦ, προεδήλους μυστικῶς Θεηγόρε· ὡς γὰρ ἀμνὸν τῷ ξύλῳ, τὸν Χριστὸν ἀπῃώρησε, τῆς ζωῆς τὸν ἀρχηγόν, δῆμος ὁ ἄνομος Ἰουδαίων, τὸν εὐεργέτην πάσης κτίσεως.
ltx/gr_gr_cog/me.m05.d01:meMA.Ode6C1T.incipit	Λόγος ὁ ἐκ τοῦ Πατρός…
ltx/gr_gr_cog/me.m05.d01:meMA.Ode6C1T.melody	@ltx/gr_gr_cog/he.h.m8:heHE.AvyssosAmartion.name
ltx/gr_gr_cog/me.m05.d01:meMA.Ode6C1T.mode	@ltx/gr_gr_cog/miscellanea:misc.Mode8
ltx/gr_gr_cog/me.m05.d01:meMA.Ode6C1T.ode	@ltx/gr_gr_cog/miscellanea:misc.Ode6
ltx/gr_gr_cog/me.m05.d01:meMA.Ode6C1T.text	Λόγος ὁ ἐκ τοῦ Πατρός, πρὸ αἰώνων γεννηθεὶς ἀσωμάτως, ἐκ σοῦ Ἁγνὴ ἐν χρόνῳ, σαρκικῶς ἀποτίκτεται, καὶ αὐτοῦ ἐν τῇ σκιᾷ, πάντως ζησόμεθα, ὥσπερ πάλαι, Ἱερεμίας προεφήτευσεν.
ltx/gr_gr_cog/me.m05.d01:meMA.Ode6H.greekmelody	@ltx/gr_gr_cog/he.h.m8:heHE.AvyssosAmartion.greekname
ltx/gr_gr_cog/me.m05.d01:meMA.Ode6H.incipit	@ltx/gr_gr_cog/he.h.m8:heHE.AvyssosAmartion.incipit
ltx/gr_gr_cog/me.m05.d01:meMA.Ode6H.melody	@ltx/gr_gr_cog/he.h.m8:heHE.AvyssosAmartion.melody
ltx/gr_gr_cog/me.m05.d01:meMA.Ode6H.mode	@ltx/gr_gr_cog/miscellanea:misc.Mode8
ltx/gr_gr_cog/me.m05.d01:meMA.Ode6H.ode	@ltx/gr_gr_cog/miscellanea:misc.Ode6
ltx/gr_gr_cog/me.m05.d01:meMA.Ode6H.text	@ltx/gr_gr_cog/he.h.m8:heHE.AvyssosAmartion.text
ltx/gr_gr_cog/me.m05.d01:meMA.Ode7C11.greekmelody	@ltx/gr_gr_cog/he.h.m8:heHE.PaidesEvraion.greekname
ltx/gr_gr_cog/me.m05.d01:meMA.Ode7C11.incipit	Σὺ νῦν οὐκέτι ἐν ἐλπίσιν…
ltx/gr_gr_cog/me.m05.d01:meMA.Ode7C11.melody	@ltx/gr_gr_cog/he.h.m8:heHE.PaidesEvraion.name
ltx/gr_gr_cog/me.m05.d01:meMA.Ode7C11.mode	@ltx/gr_gr_cog/miscellanea:misc.Mode8
ltx/gr_gr_cog/me.m05.d01:meMA.Ode7C11.ode	@ltx/gr_gr_cog/miscellanea:misc.Ode7
ltx/gr_gr_cog/me.m05.d01:meMA.Ode7C11.text	Σὺ νῦν οὐκέτι ἐν ἐλπίσιν, ἀλλὰ πράγματι, Προφῆτα τὰς προῤῥήσεις, πληρουμένας τὰς σάς, θεώμενος κραυγάζεις· Εὐλογητὸς εἶ Κύριε, ὁ Θεὸς εἰς τοὺς αἰῶνας.
ltx/gr_gr_cog/me.m05.d01:meMA.Ode7C12.incipit	Ὄργανον θεῖον ἀνεδείχθης, κυβερνώμενον, χειρὶ…
ltx/gr_gr_cog/me.m05.d01:meMA.Ode7C12.melody	@ltx/gr_gr_cog/he.h.m8:heHE.PaidesEvraion.name
ltx/gr_gr_cog/me.m05.d01:meMA.Ode7C12.mode	@ltx/gr_gr_cog/miscellanea:misc.Mode8
ltx/gr_gr_cog/me.m05.d01:meMA.Ode7C12.ode	@ltx/gr_gr_cog/miscellanea:misc.Ode7
ltx/gr_gr_cog/me.m05.d01:meMA.Ode7C12.text	Ὄργανον θεῖον ἀνεδείχθης, κυβερνώμενον, χειρὶ τοῦ Παρακλήτου, οὐρανίους φωνάς, φθεγγόμενος καὶ μέλπων· Εὐλογητὸς εἶ Κύριε, ὁ Θεὸς εἰς τοὺς αἰῶνας.
ltx/gr_gr_cog/me.m05.d01:meMA.Ode7C13.incipit	Θρήνους συγγράφων ὦ Προφῆτα, οὐκ…
ltx/gr_gr_cog/me.m05.d01:meMA.Ode7C13.melody	@ltx/gr_gr_cog/he.h.m8:heHE.PaidesEvraion.name
ltx/gr_gr_cog/me.m05.d01:meMA.Ode7C13.mode	@ltx/gr_gr_cog/miscellanea:misc.Mode8
ltx/gr_gr_cog/me.m05.d01:meMA.Ode7C13.ode	@ltx/gr_gr_cog/miscellanea:misc.Ode7
ltx/gr_gr_cog/me.m05.d01:meMA.Ode7C13.text	Θρήνους συγγράφων ὦ Προφῆτα, οὐκ ἠμαύρωσας, τὴν θείαν εὐφροσύνην, ᾗ ἐκ βρέφους τρανῶς, συνήκμασας κραυγάζων· Εὐλογητὸς εἶ Κύριε, ὁ Θεὸς εἰς τοὺς αἰῶνας.
ltx/gr_gr_cog/me.m05.d01:meMA.Ode7C1T.incipit	Μήτραν Παρθένου ὑπεισδῦναι, ὡς εὐδόκησας…
ltx/gr_gr_cog/me.m05.d01:meMA.Ode7C1T.melody	@ltx/gr_gr_cog/he.h.m8:heHE.PaidesEvraion.name
ltx/gr_gr_cog/me.m05.d01:meMA.Ode7C1T.mode	@ltx/gr_gr_cog/miscellanea:misc.Mode8
ltx/gr_gr_cog/me.m05.d01:meMA.Ode7C1T.ode	@ltx/gr_gr_cog/miscellanea:misc.Ode7
ltx/gr_gr_cog/me.m05.d01:meMA.Ode7C1T.text	Μήτραν Παρθένου ὑπεισδῦναι, ὡς εὐδόκησας, ἀνθρώπους θέλων σῶσαι, τοὺς Προφήτας σαφῶς, ἐδίδαξας τὸ θαῦμα· Εὐλογητὸς εἶ κράζοντας, ὁ Θεὸς εἰς τοὺς αἰῶνας.
ltx/gr_gr_cog/me.m05.d01:meMA.Ode8C11.greekmelody	@ltx/gr_gr_cog/he.h.m8:heHE.NikitaiTyrannou.greekname
ltx/gr_gr_cog/me.m05.d01:meMA.Ode8C11.incipit	Οὐρανοὺς ἐπέβης, γεγηθὼς θεόπνευστε Ἱερεμία…
ltx/gr_gr_cog/me.m05.d01:meMA.Ode8C11.melody	@ltx/gr_gr_cog/he.h.m8:heHE.NikitaiTyrannou.name
ltx/gr_gr_cog/me.m05.d01:meMA.Ode8C11.mode	@ltx/gr_gr_cog/miscellanea:misc.Mode8
ltx/gr_gr_cog/me.m05.d01:meMA.Ode8C11.ode	@ltx/gr_gr_cog/miscellanea:misc.Ode8
ltx/gr_gr_cog/me.m05.d01:meMA.Ode8C11.text	Οὐρανοὺς ἐπέβης, γεγηθὼς θεόπνευστε Ἱερεμία, καὶ σὺν ἀσωμάτοις, θρόνον τοῦ Παντάνακτος περιπολεύεις· Εὐλογεῖτε μέλπων, τὰ ἔργα τὸν Κύριον, καὶ ὑπερυψοῦτε, αὐτὸν εἰς τοὺς αἰῶνας.
ltx/gr_gr_cog/me.m05.d01:meMA.Ode8C12.incipit	Θεϊκῆς ἀκτῖνος, τῷ πυρσῶ λαμπόμενος…
ltx/gr_gr_cog/me.m05.d01:meMA.Ode8C12.melody	@ltx/gr_gr_cog/he.h.m8:heHE.NikitaiTyrannou.name
ltx/gr_gr_cog/me.m05.d01:meMA.Ode8C12.mode	@ltx/gr_gr_cog/miscellanea:misc.Mode8
ltx/gr_gr_cog/me.m05.d01:meMA.Ode8C12.ode	@ltx/gr_gr_cog/miscellanea:misc.Ode8
ltx/gr_gr_cog/me.m05.d01:meMA.Ode8C12.text	Θεϊκῆς ἀκτῖνος, τῷ πυρσῶ λαμπόμενος ἀντανακλάσεις, τοῖς ποθοῦσι πέμπεις, ἔσοπτρον πολύφωτον ὡς δεδειγμένος· Εὐλογεῖτε μέλπων, τὰ ἔργα τὸν Κύριον, καὶ ὑπερυψοῦτε, αὐτὸν εἰς τοὺς αἰῶνας.
ltx/gr_gr_cog/me.m05.d01:meMA.Ode8C13.incipit	Εὐσεβείας κήρυξ, ὁραθεὶς πανεύφημε ἱερωμένος…
ltx/gr_gr_cog/me.m05.d01:meMA.Ode8C13.melody	@ltx/gr_gr_cog/he.h.m8:heHE.NikitaiTyrannou.name
ltx/gr_gr_cog/me.m05.d01:meMA.Ode8C13.mode	@ltx/gr_gr_cog/miscellanea:misc.Mode8
ltx/gr_gr_cog/me.m05.d01:meMA.Ode8C13.ode	@ltx/gr_gr_cog/miscellanea:misc.Ode8
ltx/gr_gr_cog/me.m05.d01:meMA.Ode8C13.text	Εὐσεβείας κήρυξ, ὁραθεὶς πανεύφημε ἱερωμένος, τὴν τῆς ἀθεΐας, ἤλεγξας ἀσθένειαν Ἱερεμία· Εὐλογεῖτε μέλπων, τὰ ἔργα τὸν Κύριον, καὶ ὑπερυψοῦτε, εἰς πάντας τοὺς αἰῶνας.
ltx/gr_gr_cog/me.m05.d01:meMA.Ode8C1T.incipit	Τὴν ἐμὴν οὐσίαν, ἐκ σοῦ…
ltx/gr_gr_cog/me.m05.d01:meMA.Ode8C1T.melody	@ltx/gr_gr_cog/he.h.m8:heHE.NikitaiTyrannou.name
ltx/gr_gr_cog/me.m05.d01:meMA.Ode8C1T.mode	@ltx/gr_gr_cog/miscellanea:misc.Mode8
ltx/gr_gr_cog/me.m05.d01:meMA.Ode8C1T.ode	@ltx/gr_gr_cog/miscellanea:misc.Ode8
ltx/gr_gr_cog/me.m05.d01:meMA.Ode8C1T.text	Τὴν ἐμὴν οὐσίαν, ἐκ σοῦ ἀνεδέξατο ὁ Ζωοδότης, καὶ τῶν πρὶν κηλίδων, ταύτην ἐξεκάθηρεν ὦ Θεομῆτορ· Εὐλογοῦμεν τοίνυν, τὰ ἔργα τὸν Κύριον, καὶ ὑπερυψοῦμεν, αὐτὸν εἰς τοὺς αἰῶνας.
ltx/gr_gr_cog/me.m05.d01:meMA.Ode8H.greekmelody	@ltx/gr_gr_cog/he.h.m8:heHE.NikitaiTyrannou.greekname
ltx/gr_gr_cog/me.m05.d01:meMA.Ode8H.incipit	@ltx/gr_gr_cog/he.h.m8:heHE.NikitaiTyrannou.incipit
ltx/gr_gr_cog/me.m05.d01:meMA.Ode8H.melody	@ltx/gr_gr_cog/he.h.m8:heHE.NikitaiTyrannou.melody
ltx/gr_gr_cog/me.m05.d01:meMA.Ode8H.mode	@ltx/gr_gr_cog/miscellanea:misc.Mode8
ltx/gr_gr_cog/me.m05.d01:meMA.Ode8H.ode	@ltx/gr_gr_cog/miscellanea:misc.Ode8
ltx/gr_gr_cog/me.m05.d01:meMA.Ode8H.text	@ltx/gr_gr_cog/he.h.m8:heHE.NikitaiTyrannou.text
ltx/gr_gr_cog/me.m05.d01:meMA.Ode9C11.greekmelody	@ltx/gr_gr_cog/he.h.m8:heHE.KyriosTheotokon.greekname
ltx/gr_gr_cog/me.m05.d01:meMA.Ode9C11.incipit	Φωτὶ συνανεκράθης, τῷ ἀκραιφνεστάτῳ, τῇ…
ltx/gr_gr_cog/me.m05.d01:meMA.Ode9C11.melody	@ltx/gr_gr_cog/he.h.m8:heHE.KyriosTheotokon.name
ltx/gr_gr_cog/me.m05.d01:meMA.Ode9C11.mode	@ltx/gr_gr_cog/miscellanea:misc.Mode8
ltx/gr_gr_cog/me.m05.d01:meMA.Ode9C11.ode	@ltx/gr_gr_cog/miscellanea:misc.Ode9
ltx/gr_gr_cog/me.m05.d01:meMA.Ode9C11.text	Φωτὶ συνανεκράθης, τῷ ἀκραιφνεστάτῳ, τῇ τῆς Θεότητος αἴγλῃ Μακάριε, ἧς ἐπὶ γῆς τὰς ἐμφάσεις τρανῶς ἐκέκτησο.
ltx/gr_gr_cog/me.m05.d01:meMA.Ode9C12.incipit	Πηγῆς τῆς ἀκηράτου, μέχρι καταντήσας…
ltx/gr_gr_cog/me.m05.d01:meMA.Ode9C12.melody	@ltx/gr_gr_cog/he.h.m8:heHE.KyriosTheotokon.name
ltx/gr_gr_cog/me.m05.d01:meMA.Ode9C12.mode	@ltx/gr_gr_cog/miscellanea:misc.Mode8
ltx/gr_gr_cog/me.m05.d01:meMA.Ode9C12.ode	@ltx/gr_gr_cog/miscellanea:misc.Ode9
ltx/gr_gr_cog/me.m05.d01:meMA.Ode9C12.text	Πηγῆς τῆς ἀκηράτου, μέχρι καταντήσας, ἀπαυγασμάτων τῶν τῇδε Θεόπνευστε, τοῦ ποθουμένου σοι τέλους σαφῶς ἐπέτυχες.
ltx/gr_gr_cog/me.m05.d01:meMA.Ode9C13.incipit	Τῇ αἴγλῃ τῇ φωσφόρῳ, ἧς…
ltx/gr_gr_cog/me.m05.d01:meMA.Ode9C13.melody	@ltx/gr_gr_cog/he.h.m8:heHE.KyriosTheotokon.name
ltx/gr_gr_cog/me.m05.d01:meMA.Ode9C13.mode	@ltx/gr_gr_cog/miscellanea:misc.Mode8
ltx/gr_gr_cog/me.m05.d01:meMA.Ode9C13.ode	@ltx/gr_gr_cog/miscellanea:misc.Ode9
ltx/gr_gr_cog/me.m05.d01:meMA.Ode9C13.text	Τῇ αἴγλῃ τῇ φωσφόρῳ, ἧς νῦν ἀπολαύεις, τοὺς ἀνυμνοῦντας σὴν μνήμην φαιδρύνεσθαι, Ἱερεμία παμμάκαρ πάντας ἀξίωσον.
ltx/gr_gr_cog/me.m05.d01:meMA.Ode9C1T.incipit	Λιμένα σωτηρίας, οἱ πεπιστευκότες, τῷ…
ltx/gr_gr_cog/me.m05.d01:meMA.Ode9C1T.melody	@ltx/gr_gr_cog/he.h.m8:heHE.KyriosTheotokon.name
ltx/gr_gr_cog/me.m05.d01:meMA.Ode9C1T.mode	@ltx/gr_gr_cog/miscellanea:misc.Mode8
ltx/gr_gr_cog/me.m05.d01:meMA.Ode9C1T.ode	@ltx/gr_gr_cog/miscellanea:misc.Ode9
ltx/gr_gr_cog/me.m05.d01:meMA.Ode9C1T.text	Λιμένα σωτηρίας, οἱ πεπιστευκότες, τῷ παναχράντῳ σου τόκῳ γινώσκοντες, ἐκ τῶν κινδύνων ῥυσθῆναι σὲ ἱκετεύομεν.
ltx/gr_gr_cog/me.m05.d01:meMA.Ode9H.greekmelody	@ltx/gr_gr_cog/he.h.m8:heHE.KyriosTheotokon.greekname
ltx/gr_gr_cog/me.m05.d01:meMA.Ode9H.incipit	@ltx/gr_gr_cog/he.h.m8:heHE.KyriosTheotokon.incipit
ltx/gr_gr_cog/me.m05.d01:meMA.Ode9H.melody	@ltx/gr_gr_cog/he.h.m8:heHE.KyriosTheotokon.melody
ltx/gr_gr_cog/me.m05.d01:meMA.Ode9H.mode	@ltx/gr_gr_cog/miscellanea:misc.Mode8
ltx/gr_gr_cog/me.m05.d01:meMA.Ode9H.ode	@ltx/gr_gr_cog/miscellanea:misc.Ode9
ltx/gr_gr_cog/me.m05.d01:meMA.Ode9H.text	@ltx/gr_gr_cog/he.h.m8:heHE.KyriosTheotokon.text
ltx/gr_gr_cog/me.m05.d01:meVE.Apolytikion1.melody	@ltx/gr_gr_cog/he.ga:heGA.TouProfitouSou.name
ltx/gr_gr_cog/me.m05.d01:meVE.Apolytikion1.mode	@ltx/gr_gr_cog/miscellanea:misc.Mode2
ltx/gr_gr_cog/me.m05.d01:meVE.GeneralApolytikion1.name	Ἱερεμίου
ltx/gr_gr_cog/me.m05.d01:meVE.Stichera01.greekmelody	@ltx/gr_gr_cog/he.a.m8:heAU.KyrieEiKaiKritirio.greekname
ltx/gr_gr_cog/me.m05.d01:meVE.Stichera01.incipit	Κύριε, σὺ πρὸ τοῦ πλασθῆναι…
ltx/gr_gr_cog/me.m05.d01:meVE.Stichera01.melody	@ltx/gr_gr_cog/he.a.m8:heAU.KyrieEiKaiKritirio.name
ltx/gr_gr_cog/me.m05.d01:meVE.Stichera01.mode	@ltx/gr_gr_cog/miscellanea:misc.Mode8
ltx/gr_gr_cog/me.m05.d01:meVE.Stichera01.text	Κύριε, σὺ πρὸ τοῦ πλασθῆναι προέγνως, Ἱερεμίαν τὸν ἔνδοξον, καὶ πρὸ τοῦ τεχθῆναι ἐκ μήτρας, ὑποφήτην καθηγίασας, ὡς προειδὼς ἀληθῶς, τῆς γνώμης τὸ ἐλεύθερον, οὗ ταῖς πρεσβείαις ἡμᾶς σῶσον, ὡς ἀγαθὸς καὶ φιλάνθρωπος.
ltx/gr_gr_cog/me.m05.d01:meVE.Stichera02.incipit	Κύριε, εἰ καὶ ἐν βορβόρῳ…
ltx/gr_gr_cog/me.m05.d01:meVE.Stichera02.melody	@ltx/gr_gr_cog/he.a.m8:heAU.KyrieEiKaiKritirio.name
ltx/gr_gr_cog/me.m05.d01:meVE.Stichera02.mode	@ltx/gr_gr_cog/miscellanea:misc.Mode8
ltx/gr_gr_cog/me.m05.d01:meVE.Stichera02.text	Κύριε, εἰ καὶ ἐν βορβόρῳ ἐβλήθη, Ἱερεμίας ὁ ἔνδοξος, ἀλλὰ τῆς τερπνῆς εὐωδίας, νοητῶς ἀντελαμβάνετο, ἐν Παραδείσου σκηναῖς, οἷά περ αὐλιζόμενος, οὗ ταῖς πρεσβείαις ἡμᾶς σῶσον, ὡς ἀγαθὸς καὶ φιλάνθρωπος.
ltx/gr_gr_cog/me.m05.d01:meVE.Stichera03.incipit	Κύριε, εἰ καὶ θρηνῳδίας ἐλάλει…
ltx/gr_gr_cog/me.m05.d01:meVE.Stichera03.melody	@ltx/gr_gr_cog/he.a.m8:heAU.KyrieEiKaiKritirio.name
ltx/gr_gr_cog/me.m05.d01:meVE.Stichera03.mode	@ltx/gr_gr_cog/miscellanea:misc.Mode8
ltx/gr_gr_cog/me.m05.d01:meVE.Stichera03.text	Κύριε, εἰ καὶ θρηνῳδίας ἐλάλει, Ἱερεμίας ὁ δοῦλός σου, ἀλλὰ τὴν πρὸς σὲ εὐφροσύνην, ὡς Προφήτης οὐκ ἠμαύρωσε· τὴν γὰρ Ψυχήν σοι Χριστέ, τῷ πόθῳ συνηρμόσατο, καὶ θυμηδίας τῆς ἀνεκφράστου, διαπαντὸς ἐνεπίμπλατο.
