ltx/gr_gr_cog/oc.m6.d5:ocBK.ModeNaked	@ltx/gr_gr_cog/miscellanea:misc.Mode6.naked
ltx/gr_gr_cog/oc.m6.d5:ocLI.Beatitudes1.incipit	@ltx/gr_gr_cog/oc.m6.d1:ocLI.Beatitudes1.incipit
ltx/gr_gr_cog/oc.m6.d5:ocLI.Beatitudes1.melody	@ltx/gr_gr_cog/he.h.m6:heHE.IToChaireDiAngelou.name
ltx/gr_gr_cog/oc.m6.d5:ocLI.Beatitudes1.mode	@ltx/gr_gr_cog/miscellanea:misc.Mode6
ltx/gr_gr_cog/oc.m6.d5:ocLI.Beatitudes1.text	@ltx/gr_gr_cog/oc.m6.d1:ocLI.Beatitudes1.text
ltx/gr_gr_cog/oc.m6.d5:ocLI.Beatitudes2.incipit	Ὡς νεφέλαι, ἐπωμβρίσατε τὸ ὕδωρ…
ltx/gr_gr_cog/oc.m6.d5:ocLI.Beatitudes2.melody	@ltx/gr_gr_cog/he.h.m6:heHE.IToChaireDiAngelou.name
ltx/gr_gr_cog/oc.m6.d5:ocLI.Beatitudes2.mode	@ltx/gr_gr_cog/miscellanea:misc.Mode6
ltx/gr_gr_cog/oc.m6.d5:ocLI.Beatitudes2.text	Ὡς νεφέλαι, ἐπωμβρίσατε τὸ ὕδωρ, ἐν τῷ κόσμῳ, τῆς ἐνθέου γνώσεως, πεφωτισμένοι, Κυρίου Ἀπόστολοι.
ltx/gr_gr_cog/oc.m6.d5:ocLI.Beatitudes3.incipit	Ὡς ἀκτῖνες, μυστικαὶ διαδραμόντες, εἰς…
ltx/gr_gr_cog/oc.m6.d5:ocLI.Beatitudes3.melody	@ltx/gr_gr_cog/he.h.m6:heHE.IToChaireDiAngelou.name
ltx/gr_gr_cog/oc.m6.d5:ocLI.Beatitudes3.mode	@ltx/gr_gr_cog/miscellanea:misc.Mode6
ltx/gr_gr_cog/oc.m6.d5:ocLI.Beatitudes3.text	Ὡς ἀκτῖνες, μυστικαὶ διαδραμόντες, εἰς τὸν κόσμον Ἀπόστολοι ἔνδοξοι, ἀνθρώπων γένος, πίστει ἐφωτίσατε.
ltx/gr_gr_cog/oc.m6.d5:ocLI.Beatitudes4.incipit	Τῶν βασάνων, τῷ πυρὶ προσομιλοῦντες…
ltx/gr_gr_cog/oc.m6.d5:ocLI.Beatitudes4.melody	@ltx/gr_gr_cog/he.h.m6:heHE.IToChaireDiAngelou.name
ltx/gr_gr_cog/oc.m6.d5:ocLI.Beatitudes4.mode	@ltx/gr_gr_cog/miscellanea:misc.Mode6
ltx/gr_gr_cog/oc.m6.d5:ocLI.Beatitudes4.text	Τῶν βασάνων, τῷ πυρὶ προσομιλοῦντες, θείαν δρόσον ὑμᾶς ἀναψύχουσαν, παρὰ Κυρίου, ἐδέξασθε Μάρτυρες.
ltx/gr_gr_cog/oc.m6.d5:ocLI.BeatitudesT.incipit	Ἡ τεκοῦσα, διὰ λόγου ὑπὲρ…
ltx/gr_gr_cog/oc.m6.d5:ocLI.BeatitudesT.melody	@ltx/gr_gr_cog/he.h.m6:heHE.IToChaireDiAngelou.name
ltx/gr_gr_cog/oc.m6.d5:ocLI.BeatitudesT.mode	@ltx/gr_gr_cog/miscellanea:misc.Mode6
ltx/gr_gr_cog/oc.m6.d5:ocLI.BeatitudesT.text	Ἡ τεκοῦσα, διὰ λόγου ὑπὲρ λόγον, Θεοτόκε Πατρὶ τὸν συνάναρχον, αὐτὸν δυσώπει, σῶσαι τὰς ψυχὰς ἡμῶν.
ltx/gr_gr_cog/oc.m6.d5:ocLI.BeatitudesTr.incipit	Τὴν ἁγίαν, καὶ σεπτὴν πιστοὶ…
ltx/gr_gr_cog/oc.m6.d5:ocLI.BeatitudesTr.melody	@ltx/gr_gr_cog/he.h.m6:heHE.IToChaireDiAngelou.name
ltx/gr_gr_cog/oc.m6.d5:ocLI.BeatitudesTr.mode	@ltx/gr_gr_cog/miscellanea:misc.Mode6
ltx/gr_gr_cog/oc.m6.d5:ocLI.BeatitudesTr.text	Τὴν ἁγίαν, καὶ σεπτὴν πιστοὶ Τριάδα, προσκυνοῦντες συμφώνως βοήσωμεν· Τῶν Ἀποστόλων, λιταῖς σῶσον πάντας ἡμᾶς.
ltx/gr_gr_cog/oc.m6.d5:ocLI.MM.Beatitudes1234TrTas78910GB.text	@ltx/gr_gr_cog/properties:media.key
ltx/gr_gr_cog/oc.m6.d5:ocMA.ApolTheotokion.incipit	@ltx/gr_gr_cog/oc.m6.d5:ocMA.AposTheotokion.incipit
ltx/gr_gr_cog/oc.m6.d5:ocMA.ApolTheotokion.melody	
ltx/gr_gr_cog/oc.m6.d5:ocMA.ApolTheotokion.mode	@ltx/gr_gr_cog/miscellanea:misc.Mode6
ltx/gr_gr_cog/oc.m6.d5:ocMA.ApolTheotokion.text	@ltx/gr_gr_cog/oc.m6.d5:ocMA.AposTheotokion.text
ltx/gr_gr_cog/oc.m6.d5:ocMA.AposTheotokion.greekmelody	@ltx/gr_gr_cog/he.a.m6:heAU.TriimerosAnestis.greekname
ltx/gr_gr_cog/oc.m6.d5:ocMA.AposTheotokion.incipit	Μεγάλων χαρισμάτων ἁγνή, Παρθένε Θεομῆτορ…
ltx/gr_gr_cog/oc.m6.d5:ocMA.AposTheotokion.melody	@ltx/gr_gr_cog/he.a.m6:heAU.TriimerosAnestis.name
ltx/gr_gr_cog/oc.m6.d5:ocMA.AposTheotokion.mode	@ltx/gr_gr_cog/miscellanea:misc.Mode6
ltx/gr_gr_cog/oc.m6.d5:ocMA.AposTheotokion.text	Μεγάλων χαρισμάτων ἁγνή, Παρθένε Θεομῆτορ σεμνή, ἠξιώθης, ὅτι ἔτεκες σαρκί, τὸν ἕνα τῆς Τριάδος, Χριστὸν τὸν ζωοδότην, εἰς σωτηρίαν τῶν ψυχῶν ἡμῶν.
ltx/gr_gr_cog/oc.m6.d5:ocMA.Aposticha1.incipit	@ltx/gr_gr_cog/oc.m6.d5:ocVE.Aposticha1.incipit
ltx/gr_gr_cog/oc.m6.d5:ocMA.Aposticha1.melody	
ltx/gr_gr_cog/oc.m6.d5:ocMA.Aposticha1.mode	@ltx/gr_gr_cog/miscellanea:misc.Mode6
ltx/gr_gr_cog/oc.m6.d5:ocMA.Aposticha1.text	@ltx/gr_gr_cog/oc.m6.d5:ocVE.Aposticha1.text
ltx/gr_gr_cog/oc.m6.d5:ocMA.Aposticha2.incipit	@ltx/gr_gr_cog/oc.m6.d5:ocVE.Aposticha2.incipit
ltx/gr_gr_cog/oc.m6.d5:ocMA.Aposticha2.melody	
ltx/gr_gr_cog/oc.m6.d5:ocMA.Aposticha2.mode	@ltx/gr_gr_cog/miscellanea:misc.Mode6
ltx/gr_gr_cog/oc.m6.d5:ocMA.Aposticha2.text	@ltx/gr_gr_cog/oc.m6.d5:ocVE.Aposticha2.text
ltx/gr_gr_cog/oc.m6.d5:ocMA.Aposticha3.incipit	Τοὺς ἐκλεκτοὺς ἐθαυμάστωσε…
ltx/gr_gr_cog/oc.m6.d5:ocMA.Aposticha3.melody	
ltx/gr_gr_cog/oc.m6.d5:ocMA.Aposticha3.mode	@ltx/gr_gr_cog/miscellanea:misc.Mode6
ltx/gr_gr_cog/oc.m6.d5:ocMA.Aposticha3.text	Τοὺς ἐκλεκτοὺς ἐθαυμάστωσε, καὶ Ἁγίους ὁ Θεὸς ἡμῶν. Ἀγαλλιᾶσθε καὶ εὐφραίνεσθε, πάντες οἱ δοῦλοι αὐτοῦ· ὑμῖν γὰρ ἡτοίμασε τὸν στέφανον, καὶ τὴν Βασιλείαν αὐτοῦ. Ἀλλʼ αἰτοῦμεν, καὶ ἡμῶν μὴ ἐπιλάθησθε.
ltx/gr_gr_cog/oc.m6.d5:ocMA.C2.acrostic.notice1	οὗ ἡ ἀκροστιχὶς μετὰ τῶν Θεοτοκίων·
ltx/gr_gr_cog/oc.m6.d5:ocMA.C2.acrostic.text	Ἕκτον μέλισμα, Νικόλαε, προσδέχου. Ἰωσήφ.
ltx/gr_gr_cog/oc.m6.d5:ocMA.C2.acrostic.title	Κανὼν τοῦ ἁγίου Νικολάου,
ltx/gr_gr_cog/oc.m6.d5:ocMA.CA.notice	@ltx/gr_gr_cog/rubrical:ru.unavailable.octoechos
ltx/gr_gr_cog/oc.m6.d5:ocMA.Kathisma11.incipit	Ὡς ἐν μέσῳ τῶν Μαθητῶν…
ltx/gr_gr_cog/oc.m6.d5:ocMA.Kathisma11.melody	
ltx/gr_gr_cog/oc.m6.d5:ocMA.Kathisma11.mode	@ltx/gr_gr_cog/miscellanea:misc.Mode6
ltx/gr_gr_cog/oc.m6.d5:ocMA.Kathisma11.text	Ὡς ἐν μέσῳ τῶν Μαθητῶν σου, παρεγένου Σωτήρ, τὴν εἰρήνην διδοὺς αὐτοῖς, ἐλθὲ καὶ μεθʼ ἡμῶν καὶ σῶσον ἡμᾶς.
ltx/gr_gr_cog/oc.m6.d5:ocMA.Kathisma12.greekmelody	@ltx/gr_gr_cog/he.a.m6:heAU.ElpisTouKosmouAgathi.greekname
ltx/gr_gr_cog/oc.m6.d5:ocMA.Kathisma12.incipit	Ὡς φῶς σταλέντες ἐπὶ γῆς…
ltx/gr_gr_cog/oc.m6.d5:ocMA.Kathisma12.melody	@ltx/gr_gr_cog/he.a.m6:heAU.ElpisTouKosmouAgathi.name
ltx/gr_gr_cog/oc.m6.d5:ocMA.Kathisma12.mode	@ltx/gr_gr_cog/miscellanea:misc.Mode6
ltx/gr_gr_cog/oc.m6.d5:ocMA.Kathisma12.text	Ὡς φῶς σταλέντες ἐπὶ γῆς, ἐφωτίσατε πάντας, σοφοῖς διδάγμασιν ὑμῶν, καὶ ἐν δόγμασι θείοις διώξαντες, πολυθεΐας σκοτασμόν, καὶ λάμψαντες τὸν τῆς Τριάδος φωτισμόν, καὶ σώσαντες λαοὺς πολλούς, ἐκ πλάνης ἀφεγγοῦς, Ἀπόστολοι τοῦ Σωτῆρος.
ltx/gr_gr_cog/oc.m6.d5:ocMA.Kathisma13.incipit	Τῆς εὐσπλαγχνίας τὴν πύλην ἄνοιξον…
ltx/gr_gr_cog/oc.m6.d5:ocMA.Kathisma13.melody	
ltx/gr_gr_cog/oc.m6.d5:ocMA.Kathisma13.mode	@ltx/gr_gr_cog/miscellanea:misc.Mode6
ltx/gr_gr_cog/oc.m6.d5:ocMA.Kathisma13.text	Τῆς εὐσπλαγχνίας τὴν πύλην ἄνοιξον ἡμῖν, εὐλογημένη Θεοτόκε· ἐλπίζοντες εἰς σέ, μὴ ἀστοχήσωμεν· ῥυσθείημεν διὰ σοῦ τῶν περιστάσεων· σὺ γὰρ εἶ ἡ σωτηρία τοῦ γένους τῶν Χριστιανῶν.
ltx/gr_gr_cog/oc.m6.d5:ocMA.Kathisma21.incipit	Τῶν Ἀποστόλων σου ἡ μνήμη…
ltx/gr_gr_cog/oc.m6.d5:ocMA.Kathisma21.melody	
ltx/gr_gr_cog/oc.m6.d5:ocMA.Kathisma21.mode	@ltx/gr_gr_cog/miscellanea:misc.Mode6
ltx/gr_gr_cog/oc.m6.d5:ocMA.Kathisma21.text	Τῶν Ἀποστόλων σου ἡ μνήμη Κύριε, ἀνεδείχθη ὡς Παράδεισος ὁ ἐν Ἐδέμ· ἐν αὐτῇ γὰρ ἀγάλλεται ἡ Οἰκουμένη· διὸ δίδου ἡμῖν ταῖς αὐτῶν ἱκεσίαις, εἰρήνην καὶ τὸ μέγα ἔλεος.
ltx/gr_gr_cog/oc.m6.d5:ocMA.Kathisma22.incipit	Ἡ δωδεκὰς τῶν Ἀποστόλων Κύριε…
ltx/gr_gr_cog/oc.m6.d5:ocMA.Kathisma22.melody	
ltx/gr_gr_cog/oc.m6.d5:ocMA.Kathisma22.mode	@ltx/gr_gr_cog/miscellanea:misc.Mode6
ltx/gr_gr_cog/oc.m6.d5:ocMA.Kathisma22.text	Ἡ δωδεκὰς τῶν Ἀποστόλων Κύριε, δωδεκάπυρσος ὡς ἥλιος, ὤφθη τῇ γῇ· διʼ αὐτῶν γὰρ ἐμάρανας, πλάνης τὴν βλάβην, διʼ αὐτῶν καταυγάζεις ψυχάς, τῶν σῶν δούλων, διʼ ὧν καὶ ἡμᾶς, σῶσον εὔσπλαγχνε.
ltx/gr_gr_cog/oc.m6.d5:ocMA.Kathisma23.greekmelody	@ltx/gr_gr_cog/he.a.m6:heAU.ElpisTouKosmouAgathi.greekname
ltx/gr_gr_cog/oc.m6.d5:ocMA.Kathisma23.incipit	Ἁγία Δέσποινα Ἁγνή, τοῦ Θεοῦ…
ltx/gr_gr_cog/oc.m6.d5:ocMA.Kathisma23.melody	@ltx/gr_gr_cog/he.a.m6:heAU.ElpisTouKosmouAgathi.name
ltx/gr_gr_cog/oc.m6.d5:ocMA.Kathisma23.mode	@ltx/gr_gr_cog/miscellanea:misc.Mode6
ltx/gr_gr_cog/oc.m6.d5:ocMA.Kathisma23.text	Ἁγία Δέσποινα Ἁγνή, τοῦ Θεοῦ ἡμῶν Μήτηρ, ἡ τῶν ἁπάντων ποιητήν, ἀποῤῥήτως τεκοῦσα, ἱκέτευε σὺν Ἀποστόλοις ἱεροῖς, ἑκάστοτε τὴν ἀγαθότητα αὐτοῦ, παθῶν ἡμᾶς λυτρώσασθαι, καὶ ἄφεσιν ἡμῖν, δοῦναι ἁμαρτημάτων.
ltx/gr_gr_cog/oc.m6.d5:ocMA.Kathisma31.incipit	Τῇ σαγήνῃ τῆς ἐνθέου πίστεως…
ltx/gr_gr_cog/oc.m6.d5:ocMA.Kathisma31.melody	
ltx/gr_gr_cog/oc.m6.d5:ocMA.Kathisma31.mode	@ltx/gr_gr_cog/miscellanea:misc.Mode6
ltx/gr_gr_cog/oc.m6.d5:ocMA.Kathisma31.text	Τῇ σαγήνῃ τῆς ἐνθέου πίστεως, τὰς διπλόας ἀνατρέψαντες οἱ ἁλιεῖς, ἐκ βυθοῦ ματαιότητος εἵλκυσαν πάντας, καὶ παρέσχον αὐτοὺς τῷ Θεῷ εὐσεβοῦντας, καὶ τοῦτον ἀεὶ μεγαλύνοντας.
ltx/gr_gr_cog/oc.m6.d5:ocMA.Kathisma32.incipit	Τῶν Ἁγίων σου ἡ μνήμη…
ltx/gr_gr_cog/oc.m6.d5:ocMA.Kathisma32.melody	
ltx/gr_gr_cog/oc.m6.d5:ocMA.Kathisma32.mode	@ltx/gr_gr_cog/miscellanea:misc.Mode6
ltx/gr_gr_cog/oc.m6.d5:ocMA.Kathisma32.text	Τῶν Ἁγίων σου ἡ μνήμη Κύριε, ἀνεδείχθη ὡς παράδεισος ὁ ἐν Ἐδέμ· ἐν αὐτῇ γὰρ ἀγάλλεται πᾶσα ἡ κτίσις. Διὸ παράσχου ἡμῖν, τῇ αὐτῶν παρακλήσει, εἰρήνην καὶ τὸ μέγα ἔλεος.
ltx/gr_gr_cog/oc.m6.d5:ocMA.Kathisma33.incipit	Ἐν τῷ Ναῷ ἑστῶτες τῆς…
ltx/gr_gr_cog/oc.m6.d5:ocMA.Kathisma33.melody	
ltx/gr_gr_cog/oc.m6.d5:ocMA.Kathisma33.mode	@ltx/gr_gr_cog/miscellanea:misc.Mode6
ltx/gr_gr_cog/oc.m6.d5:ocMA.Kathisma33.text	Ἐν τῷ Ναῷ ἑστῶτες τῆς δόξης σου, ἐν οὐρανῷ ἑστάναι νομίζομεν· Θεοτόκε, πύλη ἐπουράνιε, ἄνοιξον ἡμῖν τὴν θύραν τοῦ ἐλέους σου.
ltx/gr_gr_cog/oc.m6.d5:ocMA.OdeW1C11.incipit	Φῶς πεφυκότες τοῦ κόσμου φωτιστικαῖς…
ltx/gr_gr_cog/oc.m6.d5:ocMA.OdeW1C11.melody	@ltx/gr_gr_cog/he.h.m6:heHE.OsEnIpeiroPezefsas.name
ltx/gr_gr_cog/oc.m6.d5:ocMA.OdeW1C11.mode	@ltx/gr_gr_cog/miscellanea:misc.Mode6
ltx/gr_gr_cog/oc.m6.d5:ocMA.OdeW1C11.ode	@ltx/gr_gr_cog/miscellanea:misc.Ode1
ltx/gr_gr_cog/oc.m6.d5:ocMA.OdeW1C11.text	Φῶς πεφυκότες τοῦ κόσμου φωτιστικαῖς, θεηγόροι λάμψεσι, καταυγάσατε ἡμᾶς, καὶ παθῶν λυτρώσατε νυκτός, καὶ ὁμίχλης πειρασμῶν, θεομακάριστοι.
ltx/gr_gr_cog/oc.m6.d5:ocMA.OdeW1C12.incipit	Ἄρχοντας γῆν ἐπὶ πᾶσαν Πνεῦμα…
ltx/gr_gr_cog/oc.m6.d5:ocMA.OdeW1C12.melody	@ltx/gr_gr_cog/he.h.m6:heHE.OsEnIpeiroPezefsas.name
ltx/gr_gr_cog/oc.m6.d5:ocMA.OdeW1C12.mode	@ltx/gr_gr_cog/miscellanea:misc.Mode6
ltx/gr_gr_cog/oc.m6.d5:ocMA.OdeW1C12.ode	@ltx/gr_gr_cog/miscellanea:misc.Ode1
ltx/gr_gr_cog/oc.m6.d5:ocMA.OdeW1C12.text	Ἄρχοντας γῆν ἐπὶ πᾶσαν Πνεῦμα ὑμᾶς, τὸ σεπτὸν κατέστησε, τοῦ Κυρίου Μαθηταί, τοῦ ἀέρος ἄρχοντας· διό, ἐτροπώσασθε πιστούς, ἐκλυτρωσάμενοι.
ltx/gr_gr_cog/oc.m6.d5:ocMA.OdeW1C13.incipit	Ἐκ τοῦ πυρὸς τοῦ ἀΰλου…
ltx/gr_gr_cog/oc.m6.d5:ocMA.OdeW1C13.melody	@ltx/gr_gr_cog/he.h.m6:heHE.OsEnIpeiroPezefsas.name
ltx/gr_gr_cog/oc.m6.d5:ocMA.OdeW1C13.mode	@ltx/gr_gr_cog/miscellanea:misc.Mode6
ltx/gr_gr_cog/oc.m6.d5:ocMA.OdeW1C13.ode	@ltx/gr_gr_cog/miscellanea:misc.Ode1
ltx/gr_gr_cog/oc.m6.d5:ocMA.OdeW1C13.text	Ἐκ τοῦ πυρὸς τοῦ ἀΰλου ὡς φωταυγεῖς, ἀναφθέντες ἄνθρακες, τὰ ὑλώδη μου σοφοί, πάθη καταφλέξατε πρὸς φῶς, ἀπαθείας καὶ ζωῆς, καθοδηγοῦντές με.
ltx/gr_gr_cog/oc.m6.d5:ocMA.OdeW1C1H.greekmelody	@ltx/gr_gr_cog/he.h.m6:heHE.OsEnIpeiroPezefsas.greekname
ltx/gr_gr_cog/oc.m6.d5:ocMA.OdeW1C1H.incipit	@ltx/gr_gr_cog/he.h.m6:heHE.OsEnIpeiroPezefsas.incipit
ltx/gr_gr_cog/oc.m6.d5:ocMA.OdeW1C1H.melody	@ltx/gr_gr_cog/he.h.m6:heHE.OsEnIpeiroPezefsas.melody
ltx/gr_gr_cog/oc.m6.d5:ocMA.OdeW1C1H.mode	@ltx/gr_gr_cog/miscellanea:misc.Mode6
ltx/gr_gr_cog/oc.m6.d5:ocMA.OdeW1C1H.ode	@ltx/gr_gr_cog/miscellanea:misc.Ode1
ltx/gr_gr_cog/oc.m6.d5:ocMA.OdeW1C1H.text	@ltx/gr_gr_cog/he.h.m6:heHE.OsEnIpeiroPezefsas.text
ltx/gr_gr_cog/oc.m6.d5:ocMA.OdeW1C1T.incipit	Τῶν Ἀποστόλων πρεσβείαις καὶ Προφητῶν…
ltx/gr_gr_cog/oc.m6.d5:ocMA.OdeW1C1T.melody	@ltx/gr_gr_cog/he.h.m6:heHE.OsEnIpeiroPezefsas.name
ltx/gr_gr_cog/oc.m6.d5:ocMA.OdeW1C1T.mode	@ltx/gr_gr_cog/miscellanea:misc.Mode6
ltx/gr_gr_cog/oc.m6.d5:ocMA.OdeW1C1T.ode	@ltx/gr_gr_cog/miscellanea:misc.Ode1
ltx/gr_gr_cog/oc.m6.d5:ocMA.OdeW1C1T.text	Τῶν Ἀποστόλων πρεσβείαις καὶ Προφητῶν, καὶ Μαρτύρων Κύριε, Ἰησοῦ παμβασιλεῦ, καὶ τῆς κυησάσης σε Ἁγνῆς, κατοικτείρησον λαόν, ἡμαρτηκότα σοι.
ltx/gr_gr_cog/oc.m6.d5:ocMA.OdeW1C21.greekmelody	@ltx/gr_gr_cog/he.h.m6:heHE.OAisthitosFarao.greekname
ltx/gr_gr_cog/oc.m6.d5:ocMA.OdeW1C21.incipit	Ἐν οὐρανοῖς κατοικῶν, χαρμονικῶς Πάτερ…
ltx/gr_gr_cog/oc.m6.d5:ocMA.OdeW1C21.melody	@ltx/gr_gr_cog/he.h.m6:heHE.OAisthitosFarao.name
ltx/gr_gr_cog/oc.m6.d5:ocMA.OdeW1C21.mode	@ltx/gr_gr_cog/miscellanea:misc.Mode6
ltx/gr_gr_cog/oc.m6.d5:ocMA.OdeW1C21.ode	@ltx/gr_gr_cog/miscellanea:misc.Ode1
ltx/gr_gr_cog/oc.m6.d5:ocMA.OdeW1C21.text	Ἐν οὐρανοῖς κατοικῶν, χαρμονικῶς Πάτερ σοφέ, ἐπὶ γῆς τῶν ἐν πίστει, συμφώνως ἀνυμνούντων σε, πᾶσαν λύπην καρδίας, πονηρὰν διασκέδασον, τῇ μεσιτείᾳ σου.
ltx/gr_gr_cog/oc.m6.d5:ocMA.OdeW1C22.incipit	Κατὰ παθῶν βλαβερῶν, κατὰ ἐχθρῶν…
ltx/gr_gr_cog/oc.m6.d5:ocMA.OdeW1C22.melody	@ltx/gr_gr_cog/he.h.m6:heHE.OAisthitosFarao.name
ltx/gr_gr_cog/oc.m6.d5:ocMA.OdeW1C22.mode	@ltx/gr_gr_cog/miscellanea:misc.Mode6
ltx/gr_gr_cog/oc.m6.d5:ocMA.OdeW1C22.ode	@ltx/gr_gr_cog/miscellanea:misc.Ode1
ltx/gr_gr_cog/oc.m6.d5:ocMA.OdeW1C22.text	Κατὰ παθῶν βλαβερῶν, κατὰ ἐχθρῶν φθοροποιῶν, κατὰ πάσης τοῦ πλάνου, κακίας νῦν ἐνίσχυσον, τοὺς τῇ σκέπῃ σου Πάτερ τῇ ἁγίᾳ Νικόλαε, πίστει προστρέχοντας.
ltx/gr_gr_cog/oc.m6.d5:ocMA.OdeW1C23.incipit	Τραυματισθέντας ἡμᾶς, ὑπʼ ἀοράτων τοξευτῶν…
ltx/gr_gr_cog/oc.m6.d5:ocMA.OdeW1C23.melody	@ltx/gr_gr_cog/he.h.m6:heHE.OAisthitosFarao.name
ltx/gr_gr_cog/oc.m6.d5:ocMA.OdeW1C23.mode	@ltx/gr_gr_cog/miscellanea:misc.Mode6
ltx/gr_gr_cog/oc.m6.d5:ocMA.OdeW1C23.ode	@ltx/gr_gr_cog/miscellanea:misc.Ode1
ltx/gr_gr_cog/oc.m6.d5:ocMA.OdeW1C23.text	Τραυματισθέντας ἡμᾶς, ὑπʼ ἀοράτων τοξευτῶν, τῇ μοτώσει τῆς σῆς Νικόλαε πρεσβείας, περιποίησαι, ὅπως ὑγιῶς βηματίζωμεν, τὰς τοῦ Κυρίου ὁδούς.
ltx/gr_gr_cog/oc.m6.d5:ocMA.OdeW1C2T.incipit	Ὁ συνυπάρχων Πατρί, ὁ συναΐδιος…
ltx/gr_gr_cog/oc.m6.d5:ocMA.OdeW1C2T.melody	@ltx/gr_gr_cog/he.h.m6:heHE.OAisthitosFarao.name
ltx/gr_gr_cog/oc.m6.d5:ocMA.OdeW1C2T.mode	@ltx/gr_gr_cog/miscellanea:misc.Mode6
ltx/gr_gr_cog/oc.m6.d5:ocMA.OdeW1C2T.ode	@ltx/gr_gr_cog/miscellanea:misc.Ode1
ltx/gr_gr_cog/oc.m6.d5:ocMA.OdeW1C2T.text	Ὁ συνυπάρχων Πατρί, ὁ συναΐδιος Υἱός, ἐπʼ ἐσχάτων βουληθείς, κατῴκησε τὴν μήτραν σου, εἰς ἡμῶν Θεοτόκε, τῶν πιστῶν ἀναγέννησιν· ὅθεν ὑμνοῦμέν σε.
ltx/gr_gr_cog/oc.m6.d5:ocMA.OdeW3C11.incipit	Τὸ θεῖον Πνεῦμα ταῖς ὑμῶν…
ltx/gr_gr_cog/oc.m6.d5:ocMA.OdeW3C11.melody	@ltx/gr_gr_cog/he.h.m6:heHE.OukEstinAgios.name
ltx/gr_gr_cog/oc.m6.d5:ocMA.OdeW3C11.mode	@ltx/gr_gr_cog/miscellanea:misc.Mode6
ltx/gr_gr_cog/oc.m6.d5:ocMA.OdeW3C11.ode	@ltx/gr_gr_cog/miscellanea:misc.Ode3
ltx/gr_gr_cog/oc.m6.d5:ocMA.OdeW3C11.text	Τὸ θεῖον Πνεῦμα ταῖς ὑμῶν, γλώσσαις ἀναχωνεῦσαν, ἐπελεύσει φρικώδει, συντριβέντας πρὸς ζωήν, καινοποιεῖ διʼ ὑμῶν, τοὺς ἀνθρώπους ἔνδοξοι Ἀπόστολοι.
ltx/gr_gr_cog/oc.m6.d5:ocMA.OdeW3C12.incipit	Ἐν γνώσει Λόγε πλημμελῶν, ποίαν…
ltx/gr_gr_cog/oc.m6.d5:ocMA.OdeW3C12.melody	@ltx/gr_gr_cog/he.h.m6:heHE.OukEstinAgios.name
ltx/gr_gr_cog/oc.m6.d5:ocMA.OdeW3C12.mode	@ltx/gr_gr_cog/miscellanea:misc.Mode6
ltx/gr_gr_cog/oc.m6.d5:ocMA.OdeW3C12.ode	@ltx/gr_gr_cog/miscellanea:misc.Ode3
ltx/gr_gr_cog/oc.m6.d5:ocMA.OdeW3C12.text	Ἐν γνώσει Λόγε πλημμελῶν, ποίαν ἔξω συγγνώμην, ἐν ἡμέρᾳ τῆς δίκης; διὰ τοῦτό σοι βοῶ· Διὰ τῶν σῶν Μαθητῶν, οἴκτειρόν με τὸν αὐτοκατάκριτον.
ltx/gr_gr_cog/oc.m6.d5:ocMA.OdeW3C13.incipit	Οἱ μιμησάμενοι Χριστοῦ, τὰ σωτήρια…
ltx/gr_gr_cog/oc.m6.d5:ocMA.OdeW3C13.melody	@ltx/gr_gr_cog/he.h.m6:heHE.OukEstinAgios.name
ltx/gr_gr_cog/oc.m6.d5:ocMA.OdeW3C13.mode	@ltx/gr_gr_cog/miscellanea:misc.Mode6
ltx/gr_gr_cog/oc.m6.d5:ocMA.OdeW3C13.ode	@ltx/gr_gr_cog/miscellanea:misc.Ode3
ltx/gr_gr_cog/oc.m6.d5:ocMA.OdeW3C13.text	Οἱ μιμησάμενοι Χριστοῦ, τὰ σωτήρια πάθη, τῆς ψυχῆς μου τὰ πάθη, τὰ χρόνια καὶ δεινά, ἰάσασθε ἰατροί, πεφυκότες ἔνδοξοι Ἀπόστολοι.
ltx/gr_gr_cog/oc.m6.d5:ocMA.OdeW3C1H.greekmelody	@ltx/gr_gr_cog/he.h.m6:heHE.OukEstinAgios.greekname
ltx/gr_gr_cog/oc.m6.d5:ocMA.OdeW3C1H.incipit	@ltx/gr_gr_cog/he.h.m6:heHE.OukEstinAgios.incipit
ltx/gr_gr_cog/oc.m6.d5:ocMA.OdeW3C1H.melody	@ltx/gr_gr_cog/he.h.m6:heHE.OukEstinAgios.melody
ltx/gr_gr_cog/oc.m6.d5:ocMA.OdeW3C1H.mode	@ltx/gr_gr_cog/miscellanea:misc.Mode6
ltx/gr_gr_cog/oc.m6.d5:ocMA.OdeW3C1H.ode	@ltx/gr_gr_cog/miscellanea:misc.Ode3
ltx/gr_gr_cog/oc.m6.d5:ocMA.OdeW3C1H.text	@ltx/gr_gr_cog/he.h.m6:heHE.OukEstinAgios.text
ltx/gr_gr_cog/oc.m6.d5:ocMA.OdeW3C1T.incipit	Ἡμαρτηκότα με Χριστέ, διὰ τῶν…
ltx/gr_gr_cog/oc.m6.d5:ocMA.OdeW3C1T.melody	@ltx/gr_gr_cog/he.h.m6:heHE.OukEstinAgios.name
ltx/gr_gr_cog/oc.m6.d5:ocMA.OdeW3C1T.mode	@ltx/gr_gr_cog/miscellanea:misc.Mode6
ltx/gr_gr_cog/oc.m6.d5:ocMA.OdeW3C1T.ode	@ltx/gr_gr_cog/miscellanea:misc.Ode3
ltx/gr_gr_cog/oc.m6.d5:ocMA.OdeW3C1T.text	Ἡμαρτηκότα με Χριστέ, διὰ τῶν Ἀποστόλων, καὶ τῆς σὲ κυησάσης, ἐπιστρέψας ὡς Θεός, ἐλέησον καὶ πυρός, αἰωνίου Σῶτερ ἐλευθέρωσον.
ltx/gr_gr_cog/oc.m6.d5:ocMA.OdeW3C21.greekmelody	@ltx/gr_gr_cog/he.h.m6:heHE.EnTiSterraTisPisteos.greekname
ltx/gr_gr_cog/oc.m6.d5:ocMA.OdeW3C21.incipit	Νίκην σαφῶς, κατὰ τῶν ψυχοφθόρων…
ltx/gr_gr_cog/oc.m6.d5:ocMA.OdeW3C21.melody	@ltx/gr_gr_cog/he.h.m6:heHE.EnTiSterraTisPisteos.name
ltx/gr_gr_cog/oc.m6.d5:ocMA.OdeW3C21.mode	@ltx/gr_gr_cog/miscellanea:misc.Mode6
ltx/gr_gr_cog/oc.m6.d5:ocMA.OdeW3C21.ode	@ltx/gr_gr_cog/miscellanea:misc.Ode3
ltx/gr_gr_cog/oc.m6.d5:ocMA.OdeW3C21.text	Νίκην σαφῶς, κατὰ τῶν ψυχοφθόρων ᾖρας παθῶν ἡμῶν Νικόλαε παμμάκαρ· ὑφʼ ὧν ἡμᾶς πάντοτε, πορθουμένους χαλεπῶς, σαῖς προσευχαῖς ἀπολύτρωσαι.
ltx/gr_gr_cog/oc.m6.d5:ocMA.OdeW3C22.incipit	Μέλη σαρκός, νεκρώσας ἐγκρατείᾳ, πρὸς…
ltx/gr_gr_cog/oc.m6.d5:ocMA.OdeW3C22.melody	@ltx/gr_gr_cog/he.h.m6:heHE.EnTiSterraTisPisteos.name
ltx/gr_gr_cog/oc.m6.d5:ocMA.OdeW3C22.mode	@ltx/gr_gr_cog/miscellanea:misc.Mode6
ltx/gr_gr_cog/oc.m6.d5:ocMA.OdeW3C22.ode	@ltx/gr_gr_cog/miscellanea:misc.Ode3
ltx/gr_gr_cog/oc.m6.d5:ocMA.OdeW3C22.text	Μέλη σαρκός, νεκρώσας ἐγκρατείᾳ, πρὸς τὴν ζωήν, μετέβης τὴν ἀγήρω, ἣν καὶ ἡμᾶς πρέσβευε, ἀπολήψεσθαι σοφέ, χαρμονικῶς εὐφημοῦντάς σε.
ltx/gr_gr_cog/oc.m6.d5:ocMA.OdeW3C23.incipit	Ἐπισκοπῶν, ἡμᾶς ἐξ οὐρανίου περιωπῆς…
ltx/gr_gr_cog/oc.m6.d5:ocMA.OdeW3C23.melody	@ltx/gr_gr_cog/he.h.m6:heHE.EnTiSterraTisPisteos.name
ltx/gr_gr_cog/oc.m6.d5:ocMA.OdeW3C23.mode	@ltx/gr_gr_cog/miscellanea:misc.Mode6
ltx/gr_gr_cog/oc.m6.d5:ocMA.OdeW3C23.ode	@ltx/gr_gr_cog/miscellanea:misc.Ode3
ltx/gr_gr_cog/oc.m6.d5:ocMA.OdeW3C23.text	Ἐπισκοπῶν, ἡμᾶς ἐξ οὐρανίου περιωπῆς, μὴ παύσῃ Ἱεράρχα, ἀποσοβῶν ἅπαντα, τὰ τοῦ βίου δυσχερῆ, σαῖς πρὸς Θεὸν παρακλήσεσι.
ltx/gr_gr_cog/oc.m6.d5:ocMA.OdeW3C2T.incipit	Λύσιν ἡμῖν, Ἁγνὴ ἁμαρτημάτων, τὸν…
ltx/gr_gr_cog/oc.m6.d5:ocMA.OdeW3C2T.melody	@ltx/gr_gr_cog/he.h.m6:heHE.EnTiSterraTisPisteos.name
ltx/gr_gr_cog/oc.m6.d5:ocMA.OdeW3C2T.mode	@ltx/gr_gr_cog/miscellanea:misc.Mode6
ltx/gr_gr_cog/oc.m6.d5:ocMA.OdeW3C2T.ode	@ltx/gr_gr_cog/miscellanea:misc.Ode3
ltx/gr_gr_cog/oc.m6.d5:ocMA.OdeW3C2T.text	Λύσιν ἡμῖν, Ἁγνὴ ἁμαρτημάτων, τὸν Λυτρωτήν, δοθῆναι ἐκδυσώπει, τὸν σκοτασμὸν Ἄχραντε, τῶν ψυχῶν ἡμῶν ἀεί, ταῖς σαῖς πρεσβείαις σκεδάζουσα.
ltx/gr_gr_cog/oc.m6.d5:ocMA.OdeW4C11.incipit	Λιμένες εὔδιοι, λιμένες ἄκλυστοι, γαληνόν…
ltx/gr_gr_cog/oc.m6.d5:ocMA.OdeW4C11.melody	@ltx/gr_gr_cog/he.h.m6:heHE.ChristosMouDynamis.name
ltx/gr_gr_cog/oc.m6.d5:ocMA.OdeW4C11.mode	@ltx/gr_gr_cog/miscellanea:misc.Mode6
ltx/gr_gr_cog/oc.m6.d5:ocMA.OdeW4C11.ode	@ltx/gr_gr_cog/miscellanea:misc.Ode4
ltx/gr_gr_cog/oc.m6.d5:ocMA.OdeW4C11.text	Λιμένες εὔδιοι, λιμένες ἄκλυστοι, γαληνόν με, πρὸς ὅρμον ἀληθινῆς, μετανοίας σώσατε, ἁμαρτημάτων χαλεπῶν, τρικυμίᾳ χειμαζόμενον.
ltx/gr_gr_cog/oc.m6.d5:ocMA.OdeW4C12.incipit	Ψυχή μου στέναξον, ψυχή μου…
ltx/gr_gr_cog/oc.m6.d5:ocMA.OdeW4C12.melody	@ltx/gr_gr_cog/he.h.m6:heHE.ChristosMouDynamis.name
ltx/gr_gr_cog/oc.m6.d5:ocMA.OdeW4C12.mode	@ltx/gr_gr_cog/miscellanea:misc.Mode6
ltx/gr_gr_cog/oc.m6.d5:ocMA.OdeW4C12.ode	@ltx/gr_gr_cog/miscellanea:misc.Ode4
ltx/gr_gr_cog/oc.m6.d5:ocMA.OdeW4C12.text	Ψυχή μου στέναξον, ψυχή μου δάκρυσον, ταπεινή μου καρδία, τῷ Ἀγαθῷ, ὁλικῶς κολλήθητι, ὅπως μελλούσης σε φλογός, καὶ κολάσεως λυτρώσηται.
ltx/gr_gr_cog/oc.m6.d5:ocMA.OdeW4C13.incipit	Σωτῆρα Κύριον, σωτῆρες πέλοντες, τῶν…
ltx/gr_gr_cog/oc.m6.d5:ocMA.OdeW4C13.melody	@ltx/gr_gr_cog/he.h.m6:heHE.ChristosMouDynamis.name
ltx/gr_gr_cog/oc.m6.d5:ocMA.OdeW4C13.mode	@ltx/gr_gr_cog/miscellanea:misc.Mode6
ltx/gr_gr_cog/oc.m6.d5:ocMA.OdeW4C13.ode	@ltx/gr_gr_cog/miscellanea:misc.Ode4
ltx/gr_gr_cog/oc.m6.d5:ocMA.OdeW4C13.text	Σωτῆρα Κύριον, σωτῆρες πέλοντες, τῶν βροτῶν, δυσωπεῖτε, ὅπως ἡμᾶς, σώσῃ ὡς φιλάνθρωπος, πειρατηρίων χαλεπῶν, παμμακάριστοι Ἀπόστολοι.
ltx/gr_gr_cog/oc.m6.d5:ocMA.OdeW4C1H.greekmelody	@ltx/gr_gr_cog/he.h.m6:heHE.ChristosMouDynamis.greekname
ltx/gr_gr_cog/oc.m6.d5:ocMA.OdeW4C1H.incipit	@ltx/gr_gr_cog/he.h.m6:heHE.ChristosMouDynamis.incipit
ltx/gr_gr_cog/oc.m6.d5:ocMA.OdeW4C1H.melody	@ltx/gr_gr_cog/he.h.m6:heHE.ChristosMouDynamis.melody
ltx/gr_gr_cog/oc.m6.d5:ocMA.OdeW4C1H.mode	@ltx/gr_gr_cog/miscellanea:misc.Mode6
ltx/gr_gr_cog/oc.m6.d5:ocMA.OdeW4C1H.ode	@ltx/gr_gr_cog/miscellanea:misc.Ode4
ltx/gr_gr_cog/oc.m6.d5:ocMA.OdeW4C1H.text	@ltx/gr_gr_cog/he.h.m6:heHE.ChristosMouDynamis.text
ltx/gr_gr_cog/oc.m6.d5:ocMA.OdeW4C1T.incipit	Παρθένε ἄχραντε, Παρθένε ἄμωμε, μετὰ…
ltx/gr_gr_cog/oc.m6.d5:ocMA.OdeW4C1T.melody	@ltx/gr_gr_cog/he.h.m6:heHE.ChristosMouDynamis.name
ltx/gr_gr_cog/oc.m6.d5:ocMA.OdeW4C1T.mode	@ltx/gr_gr_cog/miscellanea:misc.Mode6
ltx/gr_gr_cog/oc.m6.d5:ocMA.OdeW4C1T.ode	@ltx/gr_gr_cog/miscellanea:misc.Ode4
ltx/gr_gr_cog/oc.m6.d5:ocMA.OdeW4C1T.text	Παρθένε ἄχραντε, Παρθένε ἄμωμε, μετὰ τῶν Ἀποστόλων ὑπὲρ ἡμῶν, ἱκεσίαν ποίησον, ὅπως ῥυσθείη μὲν δεινῶν, πειρασμῶν καὶ περιστάσεων.
ltx/gr_gr_cog/oc.m6.d5:ocMA.OdeW4C21.greekmelody	@ltx/gr_gr_cog/he.h.m6:heHE.AkikoaKyrieTinAkoin.greekname
ltx/gr_gr_cog/oc.m6.d5:ocMA.OdeW4C21.incipit	Ἰάτρευσον Ἅγιε, τὴν πληγωθεῖσαν ὑπὸ…
ltx/gr_gr_cog/oc.m6.d5:ocMA.OdeW4C21.melody	@ltx/gr_gr_cog/he.h.m6:heHE.AkikoaKyrieTinAkoin.name
ltx/gr_gr_cog/oc.m6.d5:ocMA.OdeW4C21.mode	@ltx/gr_gr_cog/miscellanea:misc.Mode6
ltx/gr_gr_cog/oc.m6.d5:ocMA.OdeW4C21.ode	@ltx/gr_gr_cog/miscellanea:misc.Ode4
ltx/gr_gr_cog/oc.m6.d5:ocMA.OdeW4C21.text	Ἰάτρευσον Ἅγιε, τὴν πληγωθεῖσαν ὑπὸ τοῦ πλάνου, ἀδιόρθωτον καρδίαν μου, ἱκετεύων, τὸν ἀγαθοδότην Θεὸν ἡμῶν.
ltx/gr_gr_cog/oc.m6.d5:ocMA.OdeW4C22.incipit	Συνέτριψας ξόανα, τῆς ἀπωλείας, Χριστοῦ…
ltx/gr_gr_cog/oc.m6.d5:ocMA.OdeW4C22.melody	@ltx/gr_gr_cog/he.h.m6:heHE.AkikoaKyrieTinAkoin.name
ltx/gr_gr_cog/oc.m6.d5:ocMA.OdeW4C22.mode	@ltx/gr_gr_cog/miscellanea:misc.Mode6
ltx/gr_gr_cog/oc.m6.d5:ocMA.OdeW4C22.ode	@ltx/gr_gr_cog/miscellanea:misc.Ode4
ltx/gr_gr_cog/oc.m6.d5:ocMA.OdeW4C22.text	Συνέτριψας ξόανα, τῆς ἀπωλείας, Χριστοῦ θεράπον· ὅθεν πίστει ἱκετεύω σε, τοῦ νοός μου κάκιστα, ἰνδάλματα μείωσον.
ltx/gr_gr_cog/oc.m6.d5:ocMA.OdeW4C23.incipit	Μυρίπνοος γέγονας, δικαιοσύνης ἔργοις θεόφρον…
ltx/gr_gr_cog/oc.m6.d5:ocMA.OdeW4C23.melody	@ltx/gr_gr_cog/he.h.m6:heHE.AkikoaKyrieTinAkoin.name
ltx/gr_gr_cog/oc.m6.d5:ocMA.OdeW4C23.mode	@ltx/gr_gr_cog/miscellanea:misc.Mode6
ltx/gr_gr_cog/oc.m6.d5:ocMA.OdeW4C23.ode	@ltx/gr_gr_cog/miscellanea:misc.Ode4
ltx/gr_gr_cog/oc.m6.d5:ocMA.OdeW4C23.text	Μυρίπνοος γέγονας, δικαιοσύνης ἔργοις θεόφρον, καὶ τῶν Μύρων κατεκόσμησας, τὴν καθέδραν, Πάτερ Ἱεράρχα Νικόλαε.
ltx/gr_gr_cog/oc.m6.d5:ocMA.OdeW4C2T.incipit	Ἀνύμφευτε Δέσποινα, εὐλογημένη Θεοκυῆτορ, τοὺς…
ltx/gr_gr_cog/oc.m6.d5:ocMA.OdeW4C2T.melody	@ltx/gr_gr_cog/he.h.m6:heHE.AkikoaKyrieTinAkoin.name
ltx/gr_gr_cog/oc.m6.d5:ocMA.OdeW4C2T.mode	@ltx/gr_gr_cog/miscellanea:misc.Mode6
ltx/gr_gr_cog/oc.m6.d5:ocMA.OdeW4C2T.ode	@ltx/gr_gr_cog/miscellanea:misc.Ode4
ltx/gr_gr_cog/oc.m6.d5:ocMA.OdeW4C2T.text	Ἀνύμφευτε Δέσποινα, εὐλογημένη Θεοκυῆτορ, τοὺς ὑμνοῦντάς σε περίσῳζε, πάσης βλάβης, μόνη τῶν ἀνθρώπων βοήθεια.
ltx/gr_gr_cog/oc.m6.d5:ocMA.OdeW5C11.incipit	Ὁδὸν τὴν φέρουσαν εἰς ζωήν…
ltx/gr_gr_cog/oc.m6.d5:ocMA.OdeW5C11.melody	@ltx/gr_gr_cog/he.h.m6:heHE.ToTheioFengeiSou.name
ltx/gr_gr_cog/oc.m6.d5:ocMA.OdeW5C11.mode	@ltx/gr_gr_cog/miscellanea:misc.Mode6
ltx/gr_gr_cog/oc.m6.d5:ocMA.OdeW5C11.ode	@ltx/gr_gr_cog/miscellanea:misc.Ode5
ltx/gr_gr_cog/oc.m6.d5:ocMA.OdeW5C11.text	Ὁδὸν τὴν φέρουσαν εἰς ζωήν, διὰ στενωτάτης ἀγωγῆς, καὶ πειρασμῶν τε καὶ θλίψεων, Μαθηταὶ τοῦ Λόγου, σαφῶς ὁδεύσαντες, τὰς τρίβους τῆς ψυχῆς μου ἐξομαλίσατε.
ltx/gr_gr_cog/oc.m6.d5:ocMA.OdeW5C12.incipit	Λύχνοι τῆς θείας ἀνατολῆς, ῥύσασθε…
ltx/gr_gr_cog/oc.m6.d5:ocMA.OdeW5C12.melody	@ltx/gr_gr_cog/he.h.m6:heHE.ToTheioFengeiSou.name
ltx/gr_gr_cog/oc.m6.d5:ocMA.OdeW5C12.mode	@ltx/gr_gr_cog/miscellanea:misc.Mode6
ltx/gr_gr_cog/oc.m6.d5:ocMA.OdeW5C12.ode	@ltx/gr_gr_cog/miscellanea:misc.Ode5
ltx/gr_gr_cog/oc.m6.d5:ocMA.OdeW5C12.text	Λύχνοι τῆς θείας ἀνατολῆς, ῥύσασθε ἐκ σκότους με παθῶν, καὶ ἡδονῶν ἀμαυρότητος, καὶ πειρατηρίων καὶ περιστάσεων, καὶ ζάλης καὶ κινδύνων, Χριστοῦ Ἀπόστολοι.
ltx/gr_gr_cog/oc.m6.d5:ocMA.OdeW5C13.incipit	Τόμοι τοῦ Λόγου θεοειδεῖς, βίβλῳ…
ltx/gr_gr_cog/oc.m6.d5:ocMA.OdeW5C13.melody	@ltx/gr_gr_cog/he.h.m6:heHE.ToTheioFengeiSou.name
ltx/gr_gr_cog/oc.m6.d5:ocMA.OdeW5C13.mode	@ltx/gr_gr_cog/miscellanea:misc.Mode6
ltx/gr_gr_cog/oc.m6.d5:ocMA.OdeW5C13.ode	@ltx/gr_gr_cog/miscellanea:misc.Ode5
ltx/gr_gr_cog/oc.m6.d5:ocMA.OdeW5C13.text	Τόμοι τοῦ Λόγου θεοειδεῖς, βίβλῳ με γραφῆναι τῆς ζωῆς, ἐκδυσωπεῖτε Ἀπόστολοι, τῶν ἁμαρτιῶν μου τὸ χαλεπώτατον, ῥηγνύντες γραμματεῖον, ταῖς προσευχαῖς ὑμῶν.
ltx/gr_gr_cog/oc.m6.d5:ocMA.OdeW5C1H.greekmelody	@ltx/gr_gr_cog/he.h.m6:heHE.ToTheioFengeiSou.greekname
ltx/gr_gr_cog/oc.m6.d5:ocMA.OdeW5C1H.incipit	@ltx/gr_gr_cog/he.h.m6:heHE.ToTheioFengeiSou.incipit
ltx/gr_gr_cog/oc.m6.d5:ocMA.OdeW5C1H.melody	@ltx/gr_gr_cog/he.h.m6:heHE.ToTheioFengeiSou.melody
ltx/gr_gr_cog/oc.m6.d5:ocMA.OdeW5C1H.mode	@ltx/gr_gr_cog/miscellanea:misc.Mode6
ltx/gr_gr_cog/oc.m6.d5:ocMA.OdeW5C1H.ode	@ltx/gr_gr_cog/miscellanea:misc.Ode5
ltx/gr_gr_cog/oc.m6.d5:ocMA.OdeW5C1H.text	@ltx/gr_gr_cog/he.h.m6:heHE.ToTheioFengeiSou.text
ltx/gr_gr_cog/oc.m6.d5:ocMA.OdeW5C1T.incipit	Ἡ σωτηρία μου καὶ ἐλπίς…
ltx/gr_gr_cog/oc.m6.d5:ocMA.OdeW5C1T.melody	@ltx/gr_gr_cog/he.h.m6:heHE.ToTheioFengeiSou.name
ltx/gr_gr_cog/oc.m6.d5:ocMA.OdeW5C1T.mode	@ltx/gr_gr_cog/miscellanea:misc.Mode6
ltx/gr_gr_cog/oc.m6.d5:ocMA.OdeW5C1T.ode	@ltx/gr_gr_cog/miscellanea:misc.Ode5
ltx/gr_gr_cog/oc.m6.d5:ocMA.OdeW5C1T.text	Ἡ σωτηρία μου καὶ ἐλπίς, σῶσόν με ἐλπίζοντα εἰς σέ, πάντων ἐλπὶς ἀκαταίσχυντε, ταῖς πρὸς τὸν Δεσπότην σου παρακλήσεσι, τῶν θείων Μαθητῶν τε, μόνη Πανύμνητε.
ltx/gr_gr_cog/oc.m6.d5:ocMA.OdeW5C21.greekmelody	@ltx/gr_gr_cog/he.h.m6:heHE.OToFosAnatellon.greekname
ltx/gr_gr_cog/oc.m6.d5:ocMA.OdeW5C21.incipit	Νυσταγμῷ ἀμελείας κρατούμενον, πρόθυμόν με…
ltx/gr_gr_cog/oc.m6.d5:ocMA.OdeW5C21.melody	@ltx/gr_gr_cog/he.h.m6:heHE.OToFosAnatellon.name
ltx/gr_gr_cog/oc.m6.d5:ocMA.OdeW5C21.mode	@ltx/gr_gr_cog/miscellanea:misc.Mode6
ltx/gr_gr_cog/oc.m6.d5:ocMA.OdeW5C21.ode	@ltx/gr_gr_cog/miscellanea:misc.Ode5
ltx/gr_gr_cog/oc.m6.d5:ocMA.OdeW5C21.text	Νυσταγμῷ ἀμελείας κρατούμενον, πρόθυμόν με ἀπέργασαι, ἱεραῖς μεσιτείαις σου Νικόλαε.
ltx/gr_gr_cog/oc.m6.d5:ocMA.OdeW5C22.incipit	Ἰησοῦν τὸν Σωτῆρα ἱκέτευε, Ἱεράρχα…
ltx/gr_gr_cog/oc.m6.d5:ocMA.OdeW5C22.melody	@ltx/gr_gr_cog/he.h.m6:heHE.OToFosAnatellon.name
ltx/gr_gr_cog/oc.m6.d5:ocMA.OdeW5C22.mode	@ltx/gr_gr_cog/miscellanea:misc.Mode6
ltx/gr_gr_cog/oc.m6.d5:ocMA.OdeW5C22.ode	@ltx/gr_gr_cog/miscellanea:misc.Ode5
ltx/gr_gr_cog/oc.m6.d5:ocMA.OdeW5C22.text	Ἰησοῦν τὸν Σωτῆρα ἱκέτευε, Ἱεράρχα Νικόλαε, αἰωνίου κολάσεώς με ῥύσασθαι.
ltx/gr_gr_cog/oc.m6.d5:ocMA.OdeW5C23.incipit	Κοσμικῶν με σκανδάλων διάσωσον, καὶ…
ltx/gr_gr_cog/oc.m6.d5:ocMA.OdeW5C23.melody	@ltx/gr_gr_cog/he.h.m6:heHE.OToFosAnatellon.name
ltx/gr_gr_cog/oc.m6.d5:ocMA.OdeW5C23.mode	@ltx/gr_gr_cog/miscellanea:misc.Mode6
ltx/gr_gr_cog/oc.m6.d5:ocMA.OdeW5C23.ode	@ltx/gr_gr_cog/miscellanea:misc.Ode5
ltx/gr_gr_cog/oc.m6.d5:ocMA.OdeW5C23.text	Κοσμικῶν με σκανδάλων διάσωσον, καὶ δαιμόνων κακώσεως, Ἱεράρχα Νικόλαε πρεσβείαις σου.
ltx/gr_gr_cog/oc.m6.d5:ocMA.OdeW5C2T.incipit	Ὁ τὸ εἶναι ἡμῖν παρεχόμενος…
ltx/gr_gr_cog/oc.m6.d5:ocMA.OdeW5C2T.melody	@ltx/gr_gr_cog/he.h.m6:heHE.OToFosAnatellon.name
ltx/gr_gr_cog/oc.m6.d5:ocMA.OdeW5C2T.mode	@ltx/gr_gr_cog/miscellanea:misc.Mode6
ltx/gr_gr_cog/oc.m6.d5:ocMA.OdeW5C2T.ode	@ltx/gr_gr_cog/miscellanea:misc.Ode5
ltx/gr_gr_cog/oc.m6.d5:ocMA.OdeW5C2T.text	Ὁ τὸ εἶναι ἡμῖν παρεχόμενος, σοῦ τὴν μήτραν κατῴκησε Θεοτόκε, ὃν αἴτησαι σωθῆναι ἡμᾶς.
ltx/gr_gr_cog/oc.m6.d5:ocMA.OdeW6C11.incipit	Ὡς πλάκες θεόγραφοι, τὰς τοῦ…
ltx/gr_gr_cog/oc.m6.d5:ocMA.OdeW6C11.melody	@ltx/gr_gr_cog/he.h.m6:heHE.TouViouTinThalassan.name
ltx/gr_gr_cog/oc.m6.d5:ocMA.OdeW6C11.mode	@ltx/gr_gr_cog/miscellanea:misc.Mode6
ltx/gr_gr_cog/oc.m6.d5:ocMA.OdeW6C11.ode	@ltx/gr_gr_cog/miscellanea:misc.Ode6
ltx/gr_gr_cog/oc.m6.d5:ocMA.OdeW6C11.text	Ὡς πλάκες θεόγραφοι, τὰς τοῦ Πνεύματος σαφῶς, νομοθεσίας ἔνδοξοι, ἐν ταῖς ψυχαῖς ἐσχήκατε ἀψευδῶς, διʼ ὧν τὸν ἐν γράμματι, κατηργήσατε νόμον, κόσμον σώσαντες.
ltx/gr_gr_cog/oc.m6.d5:ocMA.OdeW6C12.incipit	Ψυχὴ ἁμαρτάνουσα, συνηθείᾳ τε κακῇ…
ltx/gr_gr_cog/oc.m6.d5:ocMA.OdeW6C12.melody	@ltx/gr_gr_cog/he.h.m6:heHE.TouViouTinThalassan.name
ltx/gr_gr_cog/oc.m6.d5:ocMA.OdeW6C12.mode	@ltx/gr_gr_cog/miscellanea:misc.Mode6
ltx/gr_gr_cog/oc.m6.d5:ocMA.OdeW6C12.ode	@ltx/gr_gr_cog/miscellanea:misc.Ode6
ltx/gr_gr_cog/oc.m6.d5:ocMA.OdeW6C12.text	Ψυχὴ ἁμαρτάνουσα, συνηθείᾳ τε κακῇ, φρενοβλαβῶς δουλεύουσα, ἐπιστροφῇ ἐπίστρεψον καὶ Θεῷ, οἰκτίρμονι βόησον· Διὰ τῶν Ἀποστόλων, Λόγε σῶσόν με.
ltx/gr_gr_cog/oc.m6.d5:ocMA.OdeW6C13.incipit	Προβάτοις με σύνταξον, δεξιοῖς ἐν…
ltx/gr_gr_cog/oc.m6.d5:ocMA.OdeW6C13.melody	@ltx/gr_gr_cog/he.h.m6:heHE.TouViouTinThalassan.name
ltx/gr_gr_cog/oc.m6.d5:ocMA.OdeW6C13.mode	@ltx/gr_gr_cog/miscellanea:misc.Mode6
ltx/gr_gr_cog/oc.m6.d5:ocMA.OdeW6C13.ode	@ltx/gr_gr_cog/miscellanea:misc.Ode6
ltx/gr_gr_cog/oc.m6.d5:ocMA.OdeW6C13.text	Προβάτοις με σύνταξον, δεξιοῖς ἐν τῇ φρικτῇ, καὶ φοβερᾷ ἐλεύσει σου, τῶν ἐκλεκτῶν προβάτων σου προσευχαῖς, τῶν θείων Κηρύκων σου, ὁ τυθείς, ὑπὲρ πάντων Ἀμνὸς ἄκακος.
ltx/gr_gr_cog/oc.m6.d5:ocMA.OdeW6C1H.greekmelody	@ltx/gr_gr_cog/he.h.m6:heHE.TouViouTinThalassan.greekname
ltx/gr_gr_cog/oc.m6.d5:ocMA.OdeW6C1H.incipit	@ltx/gr_gr_cog/he.h.m6:heHE.TouViouTinThalassan.incipit
ltx/gr_gr_cog/oc.m6.d5:ocMA.OdeW6C1H.melody	@ltx/gr_gr_cog/he.h.m6:heHE.TouViouTinThalassan.melody
ltx/gr_gr_cog/oc.m6.d5:ocMA.OdeW6C1H.mode	@ltx/gr_gr_cog/miscellanea:misc.Mode6
ltx/gr_gr_cog/oc.m6.d5:ocMA.OdeW6C1H.ode	@ltx/gr_gr_cog/miscellanea:misc.Ode6
ltx/gr_gr_cog/oc.m6.d5:ocMA.OdeW6C1H.text	@ltx/gr_gr_cog/he.h.m6:heHE.TouViouTinThalassan.text
ltx/gr_gr_cog/oc.m6.d5:ocMA.OdeW6C1T.incipit	Χορὸς ἱκετεύει σε, Ἀσωμάτων λειτουργῶν…
ltx/gr_gr_cog/oc.m6.d5:ocMA.OdeW6C1T.melody	@ltx/gr_gr_cog/he.h.m6:heHE.TouViouTinThalassan.name
ltx/gr_gr_cog/oc.m6.d5:ocMA.OdeW6C1T.mode	@ltx/gr_gr_cog/miscellanea:misc.Mode6
ltx/gr_gr_cog/oc.m6.d5:ocMA.OdeW6C1T.ode	@ltx/gr_gr_cog/miscellanea:misc.Ode6
ltx/gr_gr_cog/oc.m6.d5:ocMA.OdeW6C1T.text	Χορὸς ἱκετεύει σε, Ἀσωμάτων λειτουργῶν, Υἱὲ Θεοῦ προάναρχε, ἐκδυσωπεῖ σε δῆμος τῶν Μαθητῶν, διὰ τῆς Τεκούσης σε, τῷ λαῷ σου παράσχου, τὰ ἐλέη σου.
ltx/gr_gr_cog/oc.m6.d5:ocMA.OdeW6C21.greekmelody	@ltx/gr_gr_cog/he.h.m6:heHE.ToKiteiKatapotheis.greekname
ltx/gr_gr_cog/oc.m6.d5:ocMA.OdeW6C21.incipit	Λαμπτῆρά σε νοητόν, ἔχουσα ἡ…
ltx/gr_gr_cog/oc.m6.d5:ocMA.OdeW6C21.melody	@ltx/gr_gr_cog/he.h.m6:heHE.ToKiteiKatapotheis.name
ltx/gr_gr_cog/oc.m6.d5:ocMA.OdeW6C21.mode	@ltx/gr_gr_cog/miscellanea:misc.Mode6
ltx/gr_gr_cog/oc.m6.d5:ocMA.OdeW6C21.ode	@ltx/gr_gr_cog/miscellanea:misc.Ode6
ltx/gr_gr_cog/oc.m6.d5:ocMA.OdeW6C21.text	Λαμπτῆρά σε νοητόν, ἔχουσα ἡ κτίσις Νικόλαε, φωτίζεται ἀκτῖσι, τῶν ἀπείρων θαυμασίων σου.
ltx/gr_gr_cog/oc.m6.d5:ocMA.OdeW6C22.incipit	Ἀνύστακτε πρεσβευτά, τῶν σοὶ προστρεχόντων…
ltx/gr_gr_cog/oc.m6.d5:ocMA.OdeW6C22.melody	@ltx/gr_gr_cog/he.h.m6:heHE.ToKiteiKatapotheis.name
ltx/gr_gr_cog/oc.m6.d5:ocMA.OdeW6C22.mode	@ltx/gr_gr_cog/miscellanea:misc.Mode6
ltx/gr_gr_cog/oc.m6.d5:ocMA.OdeW6C22.ode	@ltx/gr_gr_cog/miscellanea:misc.Ode6
ltx/gr_gr_cog/oc.m6.d5:ocMA.OdeW6C22.text	Ἀνύστακτε πρεσβευτά, τῶν σοὶ προστρεχόντων Νικόλαε, ὕπνου χαλεπωτάτου, ῥαθυμίας με ἀπάλλαξον.
ltx/gr_gr_cog/oc.m6.d5:ocMA.OdeW6C23.incipit	Ἐῤῥύσω πάλαι σοφέ, μέλλοντας ἀδίκως…
ltx/gr_gr_cog/oc.m6.d5:ocMA.OdeW6C23.melody	@ltx/gr_gr_cog/he.h.m6:heHE.ToKiteiKatapotheis.name
ltx/gr_gr_cog/oc.m6.d5:ocMA.OdeW6C23.mode	@ltx/gr_gr_cog/miscellanea:misc.Mode6
ltx/gr_gr_cog/oc.m6.d5:ocMA.OdeW6C23.ode	@ltx/gr_gr_cog/miscellanea:misc.Ode6
ltx/gr_gr_cog/oc.m6.d5:ocMA.OdeW6C23.text	Ἐῤῥύσω πάλαι σοφέ, μέλλοντας ἀδίκως τεθνήξεσθαι· ὡσαύτως οὖν με ῥῦσαι, συμβαινουσῶν παραπτώσεων.
ltx/gr_gr_cog/oc.m6.d5:ocMA.OdeW6C2T.incipit	Παρθένε μόνη ἁγνή, κεχαριτωμένη βοήθει…
ltx/gr_gr_cog/oc.m6.d5:ocMA.OdeW6C2T.melody	@ltx/gr_gr_cog/he.h.m6:heHE.ToKiteiKatapotheis.name
ltx/gr_gr_cog/oc.m6.d5:ocMA.OdeW6C2T.mode	@ltx/gr_gr_cog/miscellanea:misc.Mode6
ltx/gr_gr_cog/oc.m6.d5:ocMA.OdeW6C2T.ode	@ltx/gr_gr_cog/miscellanea:misc.Ode6
ltx/gr_gr_cog/oc.m6.d5:ocMA.OdeW6C2T.text	Παρθένε μόνη ἁγνή, κεχαριτωμένη βοήθει μοι, ἀεὶ χειμαζομένῳ, ταῖς τοῦ βίου περιστάσεσι.
ltx/gr_gr_cog/oc.m6.d5:ocMA.OdeW7C11.incipit	Τῷ ἀγκίστρῳ τῷ τοῦ λόγου…
ltx/gr_gr_cog/oc.m6.d5:ocMA.OdeW7C11.melody	@ltx/gr_gr_cog/he.h.m6:heHE.DrosovolonMenTinKaminon.name
ltx/gr_gr_cog/oc.m6.d5:ocMA.OdeW7C11.mode	@ltx/gr_gr_cog/miscellanea:misc.Mode6
ltx/gr_gr_cog/oc.m6.d5:ocMA.OdeW7C11.ode	@ltx/gr_gr_cog/miscellanea:misc.Ode7
ltx/gr_gr_cog/oc.m6.d5:ocMA.OdeW7C11.text	Τῷ ἀγκίστρῳ τῷ τοῦ λόγου ἀνελκύσαντες, βυθοῦ τῆς πλάνης ἅπαντας, προσηγάγετε τῷ τυθέντι, Λόγῳ διʼ ἡμᾶς, Ἀπόστολοι μέλποντες αὐτῷ· Εὐλογητὸς εἶ ὁ Θεός, ὁ τῶν πατέρων ἡμῶν.
ltx/gr_gr_cog/oc.m6.d5:ocMA.OdeW7C12.incipit	Τῷ φανέντι ὕλῃ σώματος Ἀπόστολοι…
ltx/gr_gr_cog/oc.m6.d5:ocMA.OdeW7C12.melody	@ltx/gr_gr_cog/he.h.m6:heHE.DrosovolonMenTinKaminon.name
ltx/gr_gr_cog/oc.m6.d5:ocMA.OdeW7C12.mode	@ltx/gr_gr_cog/miscellanea:misc.Mode6
ltx/gr_gr_cog/oc.m6.d5:ocMA.OdeW7C12.ode	@ltx/gr_gr_cog/miscellanea:misc.Ode7
ltx/gr_gr_cog/oc.m6.d5:ocMA.OdeW7C12.text	Τῷ φανέντι ὕλῃ σώματος Ἀπόστολοι, ἀμέσως ὁμιλήσαντες, ἐφωτίσθητε φωτοδότοις, λάμψεσιν αὐτοῦ· διό με φωτίσατε βοᾶν· Εὐλογητὸς εἶ ὁ Θεός, ὁ τῶν πατέρων ἡμῶν.
ltx/gr_gr_cog/oc.m6.d5:ocMA.OdeW7C13.incipit	Τὸν ποιμένα τὸν καλὸν ἐκδυσωπήσατε…
ltx/gr_gr_cog/oc.m6.d5:ocMA.OdeW7C13.melody	@ltx/gr_gr_cog/he.h.m6:heHE.DrosovolonMenTinKaminon.name
ltx/gr_gr_cog/oc.m6.d5:ocMA.OdeW7C13.mode	@ltx/gr_gr_cog/miscellanea:misc.Mode6
ltx/gr_gr_cog/oc.m6.d5:ocMA.OdeW7C13.ode	@ltx/gr_gr_cog/miscellanea:misc.Ode7
ltx/gr_gr_cog/oc.m6.d5:ocMA.OdeW7C13.text	Τὸν ποιμένα τὸν καλὸν ἐκδυσωπήσατε, εἰς ὄρη με πλανώμενον, παραβάσεως ἐκζητῆσαι, θεῖοι Μαθηταί, καὶ σῶσαι βοῶντα ἐμμελῶς· Εὐλογητὸς εἶ ὁ Θεός, ὁ τῶν πατέρων ἡμῶν.
ltx/gr_gr_cog/oc.m6.d5:ocMA.OdeW7C1H.greekmelody	@ltx/gr_gr_cog/he.h.m6:heHE.DrosovolonMenTinKaminon.greekname
ltx/gr_gr_cog/oc.m6.d5:ocMA.OdeW7C1H.incipit	@ltx/gr_gr_cog/he.h.m6:heHE.DrosovolonMenTinKaminon.incipit
ltx/gr_gr_cog/oc.m6.d5:ocMA.OdeW7C1H.melody	@ltx/gr_gr_cog/he.h.m6:heHE.DrosovolonMenTinKaminon.melody
ltx/gr_gr_cog/oc.m6.d5:ocMA.OdeW7C1H.mode	@ltx/gr_gr_cog/miscellanea:misc.Mode6
ltx/gr_gr_cog/oc.m6.d5:ocMA.OdeW7C1H.ode	@ltx/gr_gr_cog/miscellanea:misc.Ode7
ltx/gr_gr_cog/oc.m6.d5:ocMA.OdeW7C1H.text	@ltx/gr_gr_cog/he.h.m6:heHE.DrosovolonMenTinKaminon.text
ltx/gr_gr_cog/oc.m6.d5:ocMA.OdeW7C1T.incipit	Σὺν Προφήταις Ἀποστόλοις τε καὶ…
ltx/gr_gr_cog/oc.m6.d5:ocMA.OdeW7C1T.melody	@ltx/gr_gr_cog/he.h.m6:heHE.DrosovolonMenTinKaminon.name
ltx/gr_gr_cog/oc.m6.d5:ocMA.OdeW7C1T.mode	@ltx/gr_gr_cog/miscellanea:misc.Mode6
ltx/gr_gr_cog/oc.m6.d5:ocMA.OdeW7C1T.ode	@ltx/gr_gr_cog/miscellanea:misc.Ode7
ltx/gr_gr_cog/oc.m6.d5:ocMA.OdeW7C1T.text	Σὺν Προφήταις Ἀποστόλοις τε καὶ Μάρτυσι, Παρθένε, ὃν ἐκύησας, καθικέτευε λυτρωθῆναι, πάντας τῶν δεινῶν, τοὺς φόβῳ κραυγάζοντας αὐτῷ· Εὐλογητὸς εἶ ὁ Θεος, ὁ τῶν πατέρων ἡμῶν.
ltx/gr_gr_cog/oc.m6.d5:ocMA.OdeW7C21.greekmelody	@ltx/gr_gr_cog/he.h.m6:heHE.OTonOsionSouPaidon.greekname
ltx/gr_gr_cog/oc.m6.d5:ocMA.OdeW7C21.incipit	Ῥώμῃ τοῦ Θεοῦ παμμάκαρ, αἱρετιζόντων…
ltx/gr_gr_cog/oc.m6.d5:ocMA.OdeW7C21.melody	@ltx/gr_gr_cog/he.h.m6:heHE.OTonOsionSouPaidon.name
ltx/gr_gr_cog/oc.m6.d5:ocMA.OdeW7C21.mode	@ltx/gr_gr_cog/miscellanea:misc.Mode6
ltx/gr_gr_cog/oc.m6.d5:ocMA.OdeW7C21.ode	@ltx/gr_gr_cog/miscellanea:misc.Ode7
ltx/gr_gr_cog/oc.m6.d5:ocMA.OdeW7C21.text	Ῥώμῃ τοῦ Θεοῦ παμμάκαρ, αἱρετιζόντων στῖφος, κατεπάτησας, καὶ τῆς τούτων ἀπάτης, τὸ ποίμνιον διέσωσας.
ltx/gr_gr_cog/oc.m6.d5:ocMA.OdeW7C22.incipit	Ὁ ἐποφθεὶς τοῖς πλωτῆρσι, καὶ…
ltx/gr_gr_cog/oc.m6.d5:ocMA.OdeW7C22.melody	@ltx/gr_gr_cog/he.h.m6:heHE.OTonOsionSouPaidon.name
ltx/gr_gr_cog/oc.m6.d5:ocMA.OdeW7C22.mode	@ltx/gr_gr_cog/miscellanea:misc.Mode6
ltx/gr_gr_cog/oc.m6.d5:ocMA.OdeW7C22.ode	@ltx/gr_gr_cog/miscellanea:misc.Ode7
ltx/gr_gr_cog/oc.m6.d5:ocMA.OdeW7C22.text	Ὁ ἐποφθεὶς τοῖς πλωτῆρσι, καὶ τὴν πόλιν σου θρέψας, κινδυνεύουσαν, ψυχοφθόρου λιμοῦ με, εὐχαῖς σου Πάτερ λύτρωσαι.
ltx/gr_gr_cog/oc.m6.d5:ocMA.OdeW7C23.incipit	Στήριξον Πάτερ εὐχαῖς σου, τοὺς…
ltx/gr_gr_cog/oc.m6.d5:ocMA.OdeW7C23.melody	@ltx/gr_gr_cog/he.h.m6:heHE.OTonOsionSouPaidon.name
ltx/gr_gr_cog/oc.m6.d5:ocMA.OdeW7C23.mode	@ltx/gr_gr_cog/miscellanea:misc.Mode6
ltx/gr_gr_cog/oc.m6.d5:ocMA.OdeW7C23.ode	@ltx/gr_gr_cog/miscellanea:misc.Ode7
ltx/gr_gr_cog/oc.m6.d5:ocMA.OdeW7C23.text	Στήριξον Πάτερ εὐχαῖς σου, τοὺς σὲ προσκαλουμένους εἰς βοήθειαν, κατευνάζων δαιμόνων, τὸ πονηρὸν κλυδώνιον.
ltx/gr_gr_cog/oc.m6.d5:ocMA.OdeW7C2T.incipit	Δέσποινα πάντων ἀνθρώπων, ἁγία Θεοτόκε…
ltx/gr_gr_cog/oc.m6.d5:ocMA.OdeW7C2T.melody	@ltx/gr_gr_cog/he.h.m6:heHE.OTonOsionSouPaidon.name
ltx/gr_gr_cog/oc.m6.d5:ocMA.OdeW7C2T.mode	@ltx/gr_gr_cog/miscellanea:misc.Mode6
ltx/gr_gr_cog/oc.m6.d5:ocMA.OdeW7C2T.ode	@ltx/gr_gr_cog/miscellanea:misc.Ode7
ltx/gr_gr_cog/oc.m6.d5:ocMA.OdeW7C2T.text	Δέσποινα πάντων ἀνθρώπων, ἁγία Θεοτόκε, τῆς δουλείας με τῶν παθῶν, σαῖς πρεσβείαις, τελείως ἐλευθέρωσον.
ltx/gr_gr_cog/oc.m6.d5:ocMA.OdeW8C11.incipit	Χερσωθείσας καρδίας κατενεώσατε, τῷ ἀρότρῳ…
ltx/gr_gr_cog/oc.m6.d5:ocMA.OdeW8C11.melody	@ltx/gr_gr_cog/he.h.m6:heHE.EkFlogosToisOsiois.name
ltx/gr_gr_cog/oc.m6.d5:ocMA.OdeW8C11.mode	@ltx/gr_gr_cog/miscellanea:misc.Mode6
ltx/gr_gr_cog/oc.m6.d5:ocMA.OdeW8C11.ode	@ltx/gr_gr_cog/miscellanea:misc.Ode8
ltx/gr_gr_cog/oc.m6.d5:ocMA.OdeW8C11.text	Χερσωθείσας καρδίας κατενεώσατε, τῷ ἀρότρῳ τοῦ λόγου, ἐγκατασπείραντες, δόγμα τὸ σεπτόν, στάχυν ἑκατοστεύοντα, τοὺς διασωθέντας, ἐδρέψασθε θεόπται.
ltx/gr_gr_cog/oc.m6.d5:ocMA.OdeW8C12.incipit	Πρεσβειῶν τῇ δρεπάνῃ ἐπικαθάρατε, τὰ…
ltx/gr_gr_cog/oc.m6.d5:ocMA.OdeW8C12.melody	@ltx/gr_gr_cog/he.h.m6:heHE.EkFlogosToisOsiois.name
ltx/gr_gr_cog/oc.m6.d5:ocMA.OdeW8C12.mode	@ltx/gr_gr_cog/miscellanea:misc.Mode6
ltx/gr_gr_cog/oc.m6.d5:ocMA.OdeW8C12.ode	@ltx/gr_gr_cog/miscellanea:misc.Ode8
ltx/gr_gr_cog/oc.m6.d5:ocMA.OdeW8C12.text	Πρεσβειῶν τῇ δρεπάνῃ ἐπικαθάρατε, τὰ ζιζάνια πάντα τῆς διανοίας μου, θεῖοι γεωργοί, τοῦ Σωτῆρος Ἀπόστολοι, ὅπως σωτηρίας, καρποφορήσω στάχυν.
ltx/gr_gr_cog/oc.m6.d5:ocMA.OdeW8C13.incipit	Τοῦ ἐχθροῦ τὴν κακίαν κατακοιμίσαντες…
ltx/gr_gr_cog/oc.m6.d5:ocMA.OdeW8C13.melody	@ltx/gr_gr_cog/he.h.m6:heHE.EkFlogosToisOsiois.name
ltx/gr_gr_cog/oc.m6.d5:ocMA.OdeW8C13.mode	@ltx/gr_gr_cog/miscellanea:misc.Mode6
ltx/gr_gr_cog/oc.m6.d5:ocMA.OdeW8C13.ode	@ltx/gr_gr_cog/miscellanea:misc.Ode8
ltx/gr_gr_cog/oc.m6.d5:ocMA.OdeW8C13.text	Τοῦ ἐχθροῦ τὴν κακίαν κατακοιμίσαντες, ἐκοιμήθητε ὕπνον δικαίοις πρέποντα, ἄγρυπνοι ἡμῶν, πρεσβευταὶ χρηματίσαντες, Μαθηταὶ τοῦ Λόγου, εἰς πάντας τοὺς αἰῶνας.
ltx/gr_gr_cog/oc.m6.d5:ocMA.OdeW8C1H.greekmelody	@ltx/gr_gr_cog/he.h.m6:heHE.EkFlogosToisOsiois.greekname
ltx/gr_gr_cog/oc.m6.d5:ocMA.OdeW8C1H.incipit	@ltx/gr_gr_cog/he.h.m6:heHE.EkFlogosToisOsiois.incipit
ltx/gr_gr_cog/oc.m6.d5:ocMA.OdeW8C1H.melody	@ltx/gr_gr_cog/he.h.m6:heHE.EkFlogosToisOsiois.melody
ltx/gr_gr_cog/oc.m6.d5:ocMA.OdeW8C1H.mode	@ltx/gr_gr_cog/miscellanea:misc.Mode6
ltx/gr_gr_cog/oc.m6.d5:ocMA.OdeW8C1H.ode	@ltx/gr_gr_cog/miscellanea:misc.Ode8
ltx/gr_gr_cog/oc.m6.d5:ocMA.OdeW8C1H.text	@ltx/gr_gr_cog/he.h.m6:heHE.EkFlogosToisOsiois.text
ltx/gr_gr_cog/oc.m6.d5:ocMA.OdeW8C1T.incipit	Τοῦ πυρὸς τοῦ ἀσβέστου ῥῦσαί…
ltx/gr_gr_cog/oc.m6.d5:ocMA.OdeW8C1T.melody	@ltx/gr_gr_cog/he.h.m6:heHE.EkFlogosToisOsiois.name
ltx/gr_gr_cog/oc.m6.d5:ocMA.OdeW8C1T.mode	@ltx/gr_gr_cog/miscellanea:misc.Mode6
ltx/gr_gr_cog/oc.m6.d5:ocMA.OdeW8C1T.ode	@ltx/gr_gr_cog/miscellanea:misc.Ode8
ltx/gr_gr_cog/oc.m6.d5:ocMA.OdeW8C1T.text	Τοῦ πυρὸς τοῦ ἀσβέστου ῥῦσαί με Κύριε, Προφητῶν καὶ Μαρτύρων καὶ Ἀποστόλων σου, καὶ τῆς ἐν γαστρί, χωρησάσης ἀῤῥήτως σε, Κόρης ἀπειράνδρου, πρεσβείαις εὐπροσδέκτοις.
ltx/gr_gr_cog/oc.m6.d5:ocMA.OdeW8C21.greekmelody	@ltx/gr_gr_cog/he.h.m6:heHE.OiOsioiSouPaides.greekname
ltx/gr_gr_cog/oc.m6.d5:ocMA.OdeW8C21.incipit	Ἐν ὕψει πολιτείας φαεινοτάτης, ἀναδραμὼν…
ltx/gr_gr_cog/oc.m6.d5:ocMA.OdeW8C21.melody	@ltx/gr_gr_cog/he.h.m6:heHE.OiOsioiSouPaides.name
ltx/gr_gr_cog/oc.m6.d5:ocMA.OdeW8C21.mode	@ltx/gr_gr_cog/miscellanea:misc.Mode6
ltx/gr_gr_cog/oc.m6.d5:ocMA.OdeW8C21.ode	@ltx/gr_gr_cog/miscellanea:misc.Ode8
ltx/gr_gr_cog/oc.m6.d5:ocMA.OdeW8C21.text	Ἐν ὕψει πολιτείας φαεινοτάτης, ἀναδραμὼν ὥσπερ γνώριμος, πάσῃ τῇ οἰκουμένῃ θαυματουργίαις, θεοφόρε ποικίλαις, φωτίζεις τοὺς ἐν σκότει Νικόλαε.
ltx/gr_gr_cog/oc.m6.d5:ocMA.OdeW8C22.incipit	Χαρίτωσον ἐνθέως ἐπαγρυπνοῦντας, τοὺς σὲ…
ltx/gr_gr_cog/oc.m6.d5:ocMA.OdeW8C22.melody	@ltx/gr_gr_cog/he.h.m6:heHE.OiOsioiSouPaides.name
ltx/gr_gr_cog/oc.m6.d5:ocMA.OdeW8C22.mode	@ltx/gr_gr_cog/miscellanea:misc.Mode6
ltx/gr_gr_cog/oc.m6.d5:ocMA.OdeW8C22.ode	@ltx/gr_gr_cog/miscellanea:misc.Ode8
ltx/gr_gr_cog/oc.m6.d5:ocMA.OdeW8C22.text	Χαρίτωσον ἐνθέως ἐπαγρυπνοῦντας, τοὺς σὲ τιμῶντας Νικόλαε, κατακοίμισον τὴν κακίαν, ἐχθραινόντων ἀνθρώπων, ἡμῖν ἐπεμβαινόντων Νικόλαε.
ltx/gr_gr_cog/oc.m6.d5:ocMA.OdeW8C23.incipit	Ὁ πάσας τὰς παγίδας τοῦ…
ltx/gr_gr_cog/oc.m6.d5:ocMA.OdeW8C23.melody	@ltx/gr_gr_cog/he.h.m6:heHE.OiOsioiSouPaides.name
ltx/gr_gr_cog/oc.m6.d5:ocMA.OdeW8C23.mode	@ltx/gr_gr_cog/miscellanea:misc.Mode6
ltx/gr_gr_cog/oc.m6.d5:ocMA.OdeW8C23.ode	@ltx/gr_gr_cog/miscellanea:misc.Ode8
ltx/gr_gr_cog/oc.m6.d5:ocMA.OdeW8C23.text	Ὁ πάσας τὰς παγίδας τοῦ διαβόλου, σθένει συντρίψας τοῦ Πνεύματος, ἐκ τούτων ῥῦσαί με σαῖς πρεσβείαις, κυβερνῶν τὴν ζωήν μου, θεόφρον Ἱεράρχα Νικόλαε.
ltx/gr_gr_cog/oc.m6.d5:ocMA.OdeW8C2T.incipit	Ὑμνοῦμέν σε Παρθένε Θεοκυῆτορ, δι’…
ltx/gr_gr_cog/oc.m6.d5:ocMA.OdeW8C2T.melody	@ltx/gr_gr_cog/he.h.m6:heHE.OiOsioiSouPaides.name
ltx/gr_gr_cog/oc.m6.d5:ocMA.OdeW8C2T.mode	@ltx/gr_gr_cog/miscellanea:misc.Mode6
ltx/gr_gr_cog/oc.m6.d5:ocMA.OdeW8C2T.ode	@ltx/gr_gr_cog/miscellanea:misc.Ode8
ltx/gr_gr_cog/oc.m6.d5:ocMA.OdeW8C2T.text	Ὑμνοῦμέν σε Παρθένε Θεοκυῆτορ, διʼ ἧς ἀρὰ ἀπεστείρωται, καὶ εὐλογία πᾶσιν ἐπῆλθε, τοῖς εἰδόσι σε μόνην, Μητέρα τοῦ Θεοῦ ἡμῶν ἄνανδρον.
ltx/gr_gr_cog/oc.m6.d5:ocMA.OdeW9C11.incipit	Θεὸν ἀνθρώποις προσομιλήσαντα, καὶ τὸ…
ltx/gr_gr_cog/oc.m6.d5:ocMA.OdeW9C11.melody	@ltx/gr_gr_cog/he.h.m6:heHE.TheonAnthropois.name
ltx/gr_gr_cog/oc.m6.d5:ocMA.OdeW9C11.mode	@ltx/gr_gr_cog/miscellanea:misc.Mode6
ltx/gr_gr_cog/oc.m6.d5:ocMA.OdeW9C11.ode	@ltx/gr_gr_cog/miscellanea:misc.Ode9
ltx/gr_gr_cog/oc.m6.d5:ocMA.OdeW9C11.text	Θεὸν ἀνθρώποις προσομιλήσαντα, καὶ τὸ θνητὸν ἑνώσει ἀσυγκρίτῳ θεώσαντα, εἰς τὸν σύμπαντα κόσμον κηρύξαντες, πάντας ἀθέου πλάνης, ἠλευθερώσατε· ὅθεν μακαρίζεσθε ἀεί, θεῖοι Ἀπόστολοι.
ltx/gr_gr_cog/oc.m6.d5:ocMA.OdeW9C12.incipit	Χριστοῦ τὸ πάθος ἐξεικονίζοντες, διὰ…
ltx/gr_gr_cog/oc.m6.d5:ocMA.OdeW9C12.melody	@ltx/gr_gr_cog/he.h.m6:heHE.TheonAnthropois.name
ltx/gr_gr_cog/oc.m6.d5:ocMA.OdeW9C12.mode	@ltx/gr_gr_cog/miscellanea:misc.Mode6
ltx/gr_gr_cog/oc.m6.d5:ocMA.OdeW9C12.ode	@ltx/gr_gr_cog/miscellanea:misc.Ode9
ltx/gr_gr_cog/oc.m6.d5:ocMA.OdeW9C12.text	Χριστοῦ τὸ πάθος ἐξεικονίζοντες, διὰ παθῶν τοῦ σώματος ποικίλων Ἀπόστολοι, τῆς σαρκός μου τὰ πάθη νεκρώσατε, καὶ τὴν ἐξασθενοῦσαν, καὶ κινδυνεύουσαν, καὶ νενεκρωμένην μου ψυχὴν ζωοποιήσατε.
ltx/gr_gr_cog/oc.m6.d5:ocMA.OdeW9C13.incipit	Ὁδὸς γενοῦ μοι καθοδηγοῦσά με…
ltx/gr_gr_cog/oc.m6.d5:ocMA.OdeW9C13.melody	@ltx/gr_gr_cog/he.h.m6:heHE.TheonAnthropois.name
ltx/gr_gr_cog/oc.m6.d5:ocMA.OdeW9C13.mode	@ltx/gr_gr_cog/miscellanea:misc.Mode6
ltx/gr_gr_cog/oc.m6.d5:ocMA.OdeW9C13.ode	@ltx/gr_gr_cog/miscellanea:misc.Ode9
ltx/gr_gr_cog/oc.m6.d5:ocMA.OdeW9C13.text	Ὁδὸς γενοῦ μοι καθοδηγοῦσά με, πρὸς ἀπλανῆ ὁδὸν τῶν ἐντολῶν σου Φιλάνθρωπε, ἁμαρτίας πεσόντι εἰς βάραθρα, καὶ περιπλανωμένῳ, καὶ ἀποκλίναντι, ἐπὶ τὰς ὁδούς τὰς πονηράς, καὶ κινδυνεύοντι.
ltx/gr_gr_cog/oc.m6.d5:ocMA.OdeW9C1H.greekmelody	@ltx/gr_gr_cog/he.h.m6:heHE.TheonAnthropois.greekname
ltx/gr_gr_cog/oc.m6.d5:ocMA.OdeW9C1H.incipit	@ltx/gr_gr_cog/he.h.m6:heHE.TheonAnthropois.incipit
ltx/gr_gr_cog/oc.m6.d5:ocMA.OdeW9C1H.melody	@ltx/gr_gr_cog/he.h.m6:heHE.TheonAnthropois.melody
ltx/gr_gr_cog/oc.m6.d5:ocMA.OdeW9C1H.mode	@ltx/gr_gr_cog/miscellanea:misc.Mode6
ltx/gr_gr_cog/oc.m6.d5:ocMA.OdeW9C1H.ode	@ltx/gr_gr_cog/miscellanea:misc.Ode9
ltx/gr_gr_cog/oc.m6.d5:ocMA.OdeW9C1H.text	@ltx/gr_gr_cog/he.h.m6:heHE.TheonAnthropois.text
ltx/gr_gr_cog/oc.m6.d5:ocMA.OdeW9C1T.incipit	Χοροὶ Ἀγγέλων καὶ Ἀρχαγγέλων τε…
ltx/gr_gr_cog/oc.m6.d5:ocMA.OdeW9C1T.melody	@ltx/gr_gr_cog/he.h.m6:heHE.TheonAnthropois.name
ltx/gr_gr_cog/oc.m6.d5:ocMA.OdeW9C1T.mode	@ltx/gr_gr_cog/miscellanea:misc.Mode6
ltx/gr_gr_cog/oc.m6.d5:ocMA.OdeW9C1T.ode	@ltx/gr_gr_cog/miscellanea:misc.Ode9
ltx/gr_gr_cog/oc.m6.d5:ocMA.OdeW9C1T.text	Χοροὶ Ἀγγέλων καὶ Ἀρχαγγέλων τε, Ἐξουσιών, Δυνάμεις, καὶ Ἀρχαί, Κυριότητες, Χερουβεὶμ καὶ Σεραφείμ, καὶ θρόνοι Χριστέ, δῆμος τῶν Ἀποστόλων, σὺν τῇ Τεκούσῃ σε, μόνε δυσωποῦσι Βασιλεῦ. Σῶσον τοὺς δούλους σου.
ltx/gr_gr_cog/oc.m6.d5:ocMA.OdeW9C21.greekmelody	@ltx/gr_gr_cog/he.h.m6:heHE.IToChaireDiAngelou.greekname
ltx/gr_gr_cog/oc.m6.d5:ocMA.OdeW9C21.incipit	Ἱερέων, καλλονὴ θαυμάτων βρύσις, ἐκδυσώπει…
ltx/gr_gr_cog/oc.m6.d5:ocMA.OdeW9C21.melody	@ltx/gr_gr_cog/he.h.m6:heHE.IToChaireDiAngelou.name
ltx/gr_gr_cog/oc.m6.d5:ocMA.OdeW9C21.mode	@ltx/gr_gr_cog/miscellanea:misc.Mode6
ltx/gr_gr_cog/oc.m6.d5:ocMA.OdeW9C21.ode	@ltx/gr_gr_cog/miscellanea:misc.Ode9
ltx/gr_gr_cog/oc.m6.d5:ocMA.OdeW9C21.text	Ἱερέων, καλλονὴ θαυμάτων βρύσις, ἐκδυσώπει, Θεὸν τὸν φιλάνθρωπον, ἁμαρτημάτων, εὑρεῖν ἡμᾶς ἄφεσιν.
ltx/gr_gr_cog/oc.m6.d5:ocMA.OdeW9C22.incipit	Ὥσπερ πάλαι, τοὺς δεσμώτας ἐλυτρώσω…
ltx/gr_gr_cog/oc.m6.d5:ocMA.OdeW9C22.melody	@ltx/gr_gr_cog/he.h.m6:heHE.IToChaireDiAngelou.name
ltx/gr_gr_cog/oc.m6.d5:ocMA.OdeW9C22.mode	@ltx/gr_gr_cog/miscellanea:misc.Mode6
ltx/gr_gr_cog/oc.m6.d5:ocMA.OdeW9C22.ode	@ltx/gr_gr_cog/miscellanea:misc.Ode9
ltx/gr_gr_cog/oc.m6.d5:ocMA.OdeW9C22.text	Ὥσπερ πάλαι, τοὺς δεσμώτας ἐλυτρώσω, τοῦ θανάτου, ἡμᾶς οὕτω λύτρωσαι, πειρατηρίων, τοῦ βίου Νικόλαε.
ltx/gr_gr_cog/oc.m6.d5:ocMA.OdeW9C23.incipit	Σὺ ἐν Μύροις, τῆς Λυκίας…
ltx/gr_gr_cog/oc.m6.d5:ocMA.OdeW9C23.melody	@ltx/gr_gr_cog/he.h.m6:heHE.IToChaireDiAngelou.name
ltx/gr_gr_cog/oc.m6.d5:ocMA.OdeW9C23.mode	@ltx/gr_gr_cog/miscellanea:misc.Mode6
ltx/gr_gr_cog/oc.m6.d5:ocMA.OdeW9C23.ode	@ltx/gr_gr_cog/miscellanea:misc.Ode9
ltx/gr_gr_cog/oc.m6.d5:ocMA.OdeW9C23.text	Σὺ ἐν Μύροις, τῆς Λυκίας τεθαμμένος, μύρα βρύεις, πάντοτε Νικόλαε, τὴν δυσωδίαν, τῶν παθῶν διώκοντα.
ltx/gr_gr_cog/oc.m6.d5:ocMA.OdeW9C24.incipit	Ἡ τοῦ Κτίστου, παρουσία ἐπὶ…
ltx/gr_gr_cog/oc.m6.d5:ocMA.OdeW9C24.melody	@ltx/gr_gr_cog/he.h.m6:heHE.IToChaireDiAngelou.name
ltx/gr_gr_cog/oc.m6.d5:ocMA.OdeW9C24.mode	@ltx/gr_gr_cog/miscellanea:misc.Mode6
ltx/gr_gr_cog/oc.m6.d5:ocMA.OdeW9C24.ode	@ltx/gr_gr_cog/miscellanea:misc.Ode9
ltx/gr_gr_cog/oc.m6.d5:ocMA.OdeW9C24.text	Ἡ τοῦ Κτίστου, παρουσία ἐπὶ θύραις, μὴ ἀμέλει, ψυχὴ ἀλλὰ βόησον· Ταῖς Νικολάου, Χριστὲ εὐχαῖς σῶσόν με.
ltx/gr_gr_cog/oc.m6.d5:ocMA.OdeW9C2T.incipit	Φῶς τεκοῦσα, τῆς καρδίας μου…
ltx/gr_gr_cog/oc.m6.d5:ocMA.OdeW9C2T.melody	@ltx/gr_gr_cog/he.h.m6:heHE.IToChaireDiAngelou.name
ltx/gr_gr_cog/oc.m6.d5:ocMA.OdeW9C2T.mode	@ltx/gr_gr_cog/miscellanea:misc.Mode6
ltx/gr_gr_cog/oc.m6.d5:ocMA.OdeW9C2T.ode	@ltx/gr_gr_cog/miscellanea:misc.Ode9
ltx/gr_gr_cog/oc.m6.d5:ocMA.OdeW9C2T.text	Φῶς τεκοῦσα, τῆς καρδίας μου τὰς κόρας, ἀβλεπτούσας, Πανύμνητε φώτισον, ἵνα ὑμνῶ σε, διὰ σοῦ σῳζόμενος.
ltx/gr_gr_cog/oc.m6.d5:ocVE.ApolTheotokionVM.greekmelody	@ltx/gr_gr_cog/he.a.m6:heAU.ElpisTouKosmouAgathi.greekname
ltx/gr_gr_cog/oc.m6.d5:ocVE.ApolTheotokionVM.incipit	@ltx/gr_gr_cog/oc.m6.d5:ocMA.Kathisma23.incipit
ltx/gr_gr_cog/oc.m6.d5:ocVE.ApolTheotokionVM.melody	@ltx/gr_gr_cog/he.a.m6:heAU.ElpisTouKosmouAgathi.name
ltx/gr_gr_cog/oc.m6.d5:ocVE.ApolTheotokionVM.mode	@ltx/gr_gr_cog/miscellanea:misc.Mode6
ltx/gr_gr_cog/oc.m6.d5:ocVE.ApolTheotokionVM.text	@ltx/gr_gr_cog/oc.m6.d5:ocMA.Kathisma23.text
ltx/gr_gr_cog/oc.m6.d5:ocVE.AposTheotokion.incipit	Θεοτόκε, σὺ εἶ ἡ ἄμπελος…
ltx/gr_gr_cog/oc.m6.d5:ocVE.AposTheotokion.melody	
ltx/gr_gr_cog/oc.m6.d5:ocVE.AposTheotokion.mode	@ltx/gr_gr_cog/miscellanea:misc.Mode6
ltx/gr_gr_cog/oc.m6.d5:ocVE.AposTheotokion.text	Θεοτόκε, σὺ εἶ ἡ ἄμπελος ἡ ἀληθινή, ἡ βλαστήσασα τὸν καρπὸν τῆς ζωῆς, σὲ ἱκετεύομεν, πρέσβευε Δέσποινα, μετὰ τῶν Ἀποστόλων, καὶ πάντων τῶν Ἁγίων, ἐλεηθῆναι τὰς ψυχὰς ἡμῶν.
ltx/gr_gr_cog/oc.m6.d5:ocVE.Aposticha1.incipit	Ποτὲ οἱ Μαθηταί σου Χριστέ…
ltx/gr_gr_cog/oc.m6.d5:ocVE.Aposticha1.melody	
ltx/gr_gr_cog/oc.m6.d5:ocVE.Aposticha1.mode	@ltx/gr_gr_cog/miscellanea:misc.Mode6
ltx/gr_gr_cog/oc.m6.d5:ocVE.Aposticha1.text	Ποτὲ οἱ Μαθηταί σου Χριστέ, ἐν πλοίῳ χειμαζόμενοι, ἀνεβόων· Διδάσκαλε, σῶσον ἡμᾶς, ἀπολλύμεθα, καὶ νῦν ἡμεῖς κραυγάζομεν, Φιλάνθρωπε Σωτὴρ ἡμῶν, ῥῦσαι ἡμᾶς ἐκ τῶν ἀναγκῶν ἡμῶν δεόμεθα.
ltx/gr_gr_cog/oc.m6.d5:ocVE.Aposticha2.incipit	Κύριε, οἱ Ἀπόστολοι κατέλαβον, ποτὲ…
ltx/gr_gr_cog/oc.m6.d5:ocVE.Aposticha2.melody	
ltx/gr_gr_cog/oc.m6.d5:ocVE.Aposticha2.mode	@ltx/gr_gr_cog/miscellanea:misc.Mode6
ltx/gr_gr_cog/oc.m6.d5:ocVE.Aposticha2.text	Κύριε, οἱ Ἀπόστολοι κατέλαβον, ποτὲ μὲν τὸ βάθος τῆς θαλάσσης διὰ δικτύων, ποτὲ δὲ τὸ ὕψος τῆς Βασιλείας διὰ δογμάτων, καὶ τῇ μὲν τέχνῃ, τὸν ἀκατάληπτον βυθὸν ἠρεύνησαν, τῇ δὲ πίστει, τὸν ἀπερίγραπτόν σου κόλπον ἔφθασαν, καὶ τῷ κόσμῳ ἐκήρυξαν τὸν ἄχρονον Υἱόν σου, ὧν ταῖς πρεσβείαις, καὶ πάντων τῶν Ἁγίων, ἐλέησον ἡμᾶς.
ltx/gr_gr_cog/oc.m6.d5:ocVE.Aposticha3.incipit	Ὁ Σταυρός σου Κύριε, τοῖς…
ltx/gr_gr_cog/oc.m6.d5:ocVE.Aposticha3.melody	
ltx/gr_gr_cog/oc.m6.d5:ocVE.Aposticha3.mode	@ltx/gr_gr_cog/miscellanea:misc.Mode6
ltx/gr_gr_cog/oc.m6.d5:ocVE.Aposticha3.text	Ὁ Σταυρός σου Κύριε, τοῖς Μάρτυσι γέγονεν, ὅπλον ἀήττητον· ἔβλεπον γὰρ τὸν προκείμενον θάνατον, καὶ προβλέποντες τὴν μέλλουσαν ζωήν, τῇ ἐλπίδι τῇ εἰς σὲ ἐνεδυναμοῦντο. Αὐτῶν ταῖς παρακλήσεσιν, ἐλέησον ἡμᾶς.
ltx/gr_gr_cog/oc.m6.d5:ocVE.SticTheotokion.greekmelody	@ltx/gr_gr_cog/he.a.m6:heAU.TriimerosAnestis.greekname
ltx/gr_gr_cog/oc.m6.d5:ocVE.SticTheotokion.incipit	Μεγίστων δωρημάτων ἡμῖν, ὁ τόκος…
ltx/gr_gr_cog/oc.m6.d5:ocVE.SticTheotokion.melody	@ltx/gr_gr_cog/he.a.m6:heAU.TriimerosAnestis.name
ltx/gr_gr_cog/oc.m6.d5:ocVE.SticTheotokion.mode	@ltx/gr_gr_cog/miscellanea:misc.Mode6
ltx/gr_gr_cog/oc.m6.d5:ocVE.SticTheotokion.text	Μεγίστων δωρημάτων ἡμῖν, ὁ τόκος ὁ ἀλόχευτος, τῆς Παρθένου, πᾶσι γέγονε σαφῶς· Θεὸς γὰρ τὴν φθαρεῖσαν, καινίζει πάλιν φύσιν, καὶ ἀναπλάττει τὸ ἀνθρώπινον.
ltx/gr_gr_cog/oc.m6.d5:ocVE.Stichera1.greekmelody	@ltx/gr_gr_cog/he.a.m6:heAU.OlinApothemenoi.greekname
ltx/gr_gr_cog/oc.m6.d5:ocVE.Stichera1.incipit	Δύναμιν οὐράνιον, τοῦ Παρακλήτου λαβόντες…
ltx/gr_gr_cog/oc.m6.d5:ocVE.Stichera1.melody	@ltx/gr_gr_cog/he.a.m6:heAU.OlinApothemenoi.name
ltx/gr_gr_cog/oc.m6.d5:ocVE.Stichera1.mode	@ltx/gr_gr_cog/miscellanea:misc.Mode6
ltx/gr_gr_cog/oc.m6.d5:ocVE.Stichera1.text	Δύναμιν οὐράνιον, τοῦ Παρακλήτου λαβόντες, τῶν ἐχθρῶν τὰς φάλαγγας, οἱ Χριστοῦ Ἀπόστολοι, ἐτροπώσαντο. Βασιλεῖς ἤλεγξαν, καὶ σοφοὺς ᾔσχυναν, ἰδιῶται καὶ ἀγράμματοι, γυμνοὶ καὶ ἄοπλοι, εὐαγγελικῶς παρετάξαντο, τῷ λόγῳ δὲ τῆς χάριτος, τὰς τερατουργίας εἰργάσαντο, καὶ οὕτω τὰ ἔθνη, ὑπήκοα ποιούμενοι Χριστῷ, ἐν παῤῥησίᾳ πρεσβεύουσιν, ὑπὲρ τῶν ψυχῶν ἡμῶν.
ltx/gr_gr_cog/oc.m6.d5:ocVE.Stichera2.incipit	Σὲ ἐπιποθήσαντες, οἱ εὐκλεεῖς Μαθηταί…
ltx/gr_gr_cog/oc.m6.d5:ocVE.Stichera2.melody	@ltx/gr_gr_cog/he.a.m6:heAU.OlinApothemenoi.name
ltx/gr_gr_cog/oc.m6.d5:ocVE.Stichera2.mode	@ltx/gr_gr_cog/miscellanea:misc.Mode6
ltx/gr_gr_cog/oc.m6.d5:ocVE.Stichera2.text	Σὲ ἐπιποθήσαντες, οἱ εὐκλεεῖς Μαθηταί σου, καὶ ἀπαρνησάμενοι, ἑαυτοὺς προθύμως σοι, ἠκολούθησαν, καὶ Σταυρὸν ἄραντες, σοῦ αὐτοῦ ὀπίσω, πειθαρχοῦντες τῇ προστάξει σου, τὴν γῆν κατέλιπον, καὶ τοὺς οὐρανοὺς ἐκληρώσαντο, τὰ ἔθνη ἐπιστρέφοντες, εἰς τὴν ἀληθῆ σου ἐπίγνωσιν, καὶ νῦν διὰ πάντων, ὑπήκοοι γενόμενοι ἀεί, ἐν παῤῥησίᾳ πρεσβεύουσιν, ὑπὲρ τῶν ψυχῶν ἡμῶν.
ltx/gr_gr_cog/oc.m6.d5:ocVE.Stichera3.incipit	Ἅπαντα τὸν βίον μου, ἐν…
ltx/gr_gr_cog/oc.m6.d5:ocVE.Stichera3.melody	@ltx/gr_gr_cog/he.a.m6:heAU.OlinApothemenoi.name
ltx/gr_gr_cog/oc.m6.d5:ocVE.Stichera3.mode	@ltx/gr_gr_cog/miscellanea:misc.Mode6
ltx/gr_gr_cog/oc.m6.d5:ocVE.Stichera3.text	Ἅπαντα τὸν βίον μου, ἐν ἀμελείᾳ διάγων, πρὸς τὸ τέλος ἔφθασα, ἄκαρπος ὁ δείλαιος, Ὑπεράγαθε, πονηρῶν πράξεων, ἐπιφέρων μόνον, νῦν φορτία τὰ δυσβάστακτα, ἅπερ φιλάνθρωπε, σκόρπισον ῥοπῇ τοῦ ἐλέους σου, καὶ δίδου μοι κατάνυξιν, καὶ ἐπιστροφὴν τὴν σωτήριον, θείαις Ἀποστόλων, πρεσβείαις εὐπροσδέκτοις ὁ Θεός, οὓς εἰς πρεσβείαν προσάγω σοι, καὶ τὴν σὲ κυήσασαν.
ltx/gr_gr_cog/oc.m6.d5:ocVE.Stichera4.greekmelody	@ltx/gr_gr_cog/he.a.m6:heAU.TriimerosAnestis.greekname
ltx/gr_gr_cog/oc.m6.d5:ocVE.Stichera4.incipit	Νικόλαε μακάριε, προσπίπτοντά με οἴκτειρον…
ltx/gr_gr_cog/oc.m6.d5:ocVE.Stichera4.melody	@ltx/gr_gr_cog/he.a.m6:heAU.TriimerosAnestis.name
ltx/gr_gr_cog/oc.m6.d5:ocVE.Stichera4.mode	@ltx/gr_gr_cog/miscellanea:misc.Mode6
ltx/gr_gr_cog/oc.m6.d5:ocVE.Stichera4.text	Νικόλαε μακάριε, προσπίπτοντά με οἴκτειρον, δέομαί σου, καὶ τὰ ὄμματα σοφέ, φώτισον τῆς ψυχῆς μου, ἵνα καθαρῶς βλέψω, τὸν φωτοδότην καὶ οἰκτίρμονα.
ltx/gr_gr_cog/oc.m6.d5:ocVE.Stichera5.incipit	Ἐχθρῶν ἐπιζητούντων με, κακοποιῆσαι Ἅγιε…
ltx/gr_gr_cog/oc.m6.d5:ocVE.Stichera5.melody	@ltx/gr_gr_cog/he.a.m6:heAU.TriimerosAnestis.name
ltx/gr_gr_cog/oc.m6.d5:ocVE.Stichera5.mode	@ltx/gr_gr_cog/miscellanea:misc.Mode6
ltx/gr_gr_cog/oc.m6.d5:ocVE.Stichera5.text	Ἐχθρῶν ἐπιζητούντων με, κακοποιῆσαι Ἅγιε, λύτρωσαί με, παῤῥησίαν πρὸς Θεόν, ὡς ἔχων Ἱεράρχα, καὶ σῶσόν με ἐκ βλάβης, καὶ ἐξ ἀνδρῶν αἱμάτων ῥῦσαί με.
ltx/gr_gr_cog/oc.m6.d5:ocVE.Stichera6.incipit	Λιμένα σε ἀχείμαστον, καὶ τεῖχος…
ltx/gr_gr_cog/oc.m6.d5:ocVE.Stichera6.melody	@ltx/gr_gr_cog/he.a.m6:heAU.TriimerosAnestis.name
ltx/gr_gr_cog/oc.m6.d5:ocVE.Stichera6.mode	@ltx/gr_gr_cog/miscellanea:misc.Mode6
ltx/gr_gr_cog/oc.m6.d5:ocVE.Stichera6.text	Λιμένα σε ἀχείμαστον, καὶ τεῖχος ἀπροσμάχητον, Ἱεράρχα, νῦν κεκτήμεθα πιστῶς, καὶ πύργον ἀσφαλείας, καὶ θύραν μετανοίας, καὶ ὁδηγὸν πιστόν, καὶ πρόμαχον.
ltx/gr_gr_cog/oc.m6.d5:octrMA.Kathisma11.incipit	@ltx/gr_gr_cog/oc.m6.d5:ocMA.Kathisma11.incipit
ltx/gr_gr_cog/oc.m6.d5:octrMA.Kathisma11.melody	
ltx/gr_gr_cog/oc.m6.d5:octrMA.Kathisma11.mode	@ltx/gr_gr_cog/miscellanea:misc.Mode6
ltx/gr_gr_cog/oc.m6.d5:octrMA.Kathisma11.text	@ltx/gr_gr_cog/oc.m6.d5:ocMA.Kathisma11.text
ltx/gr_gr_cog/oc.m6.d5:octrMA.Kathisma12.incipit	Οἱ Μαθηταί σου Ἰησοῦ, ἐπὶ…
ltx/gr_gr_cog/oc.m6.d5:octrMA.Kathisma12.melody	
ltx/gr_gr_cog/oc.m6.d5:octrMA.Kathisma12.mode	@ltx/gr_gr_cog/miscellanea:misc.Mode6
ltx/gr_gr_cog/oc.m6.d5:octrMA.Kathisma12.text	Οἱ Μαθηταί σου Ἰησοῦ, ἐπὶ τὰ πέρατα τῆς γῆς στελλόμενοι, τὰ ἔθνη εὐσεβῶς, ὡς ἰχθύας ζωγρήσαντες, προσήνεγκαν τῇ σῇ ἀγαθότητι Κύριε, καὶ διʼ αὐτῶν βοῶμέν σοι φιλάνθρωπε, τῷ λαῷ σου παράσχου, τὸ μέγα ἔλεος.
ltx/gr_gr_cog/oc.m6.d5:octrMA.Kathisma1T.greekmelody	@ltx/gr_gr_cog/oc.m6.d5:ocMA.Kathisma23.greekmelody
ltx/gr_gr_cog/oc.m6.d5:octrMA.Kathisma1T.incipit	@ltx/gr_gr_cog/oc.m6.d5:ocMA.Kathisma23.incipit
ltx/gr_gr_cog/oc.m6.d5:octrMA.Kathisma1T.melody	@ltx/gr_gr_cog/oc.m6.d5:ocMA.Kathisma23.melody
ltx/gr_gr_cog/oc.m6.d5:octrMA.Kathisma1T.mode	@ltx/gr_gr_cog/miscellanea:misc.Mode6
ltx/gr_gr_cog/oc.m6.d5:octrMA.Kathisma1T.text	@ltx/gr_gr_cog/oc.m6.d5:ocMA.Kathisma23.text
ltx/gr_gr_cog/oc.m6.d5:octrMA.Ode7Martyricon.incipit	Τῶν Ἀθλοφόρων σου ἡ μνήμη…
ltx/gr_gr_cog/oc.m6.d5:octrMA.Ode7Martyricon.melody	
ltx/gr_gr_cog/oc.m6.d5:octrMA.Ode7Martyricon.mode	@ltx/gr_gr_cog/miscellanea:misc.Mode6
ltx/gr_gr_cog/oc.m6.d5:octrMA.Ode7Martyricon.text	Τῶν Ἀθλοφόρων σου ἡ μνήμη Κύριε, ἀνεδείχθη ὡς Παράδεισος ὁ ἐν Ἐδέμ· ἐν αὐτῇ γὰρ ἀγάλλεται πᾶσα ἡ Κτίσις. Διὸ παράσχου ἡμῖν, τῇ αὐτῶν παρακλήσει, εἰρήνην καὶ τὸ μέγα ἔλεος.
ltx/gr_gr_cog/oc.m6.d5:octrMA.Photogogic.incipit	@ltx/gr_gr_cog/oc.m6.d2:octrMA.Photagogic.incipit
ltx/gr_gr_cog/oc.m6.d5:octrMA.Photogogic.mode	@ltx/gr_gr_cog/miscellanea:misc.Mode6
ltx/gr_gr_cog/oc.m6.d5:octrMA.Photogogic.text	@ltx/gr_gr_cog/oc.m6.d2:octrMA.Photagogic.text
ltx/gr_gr_cog/oc.m6.d5:octrMA.Triadic1.incipit	@ltx/gr_gr_cog/oc.m6.d2:octrMA.Triadic1.incipit
ltx/gr_gr_cog/oc.m6.d5:octrMA.Triadic1.mode	@ltx/gr_gr_cog/miscellanea:misc.Mode6
ltx/gr_gr_cog/oc.m6.d5:octrMA.Triadic1.text	@ltx/gr_gr_cog/oc.m6.d2:octrMA.Triadic1.text
ltx/gr_gr_cog/oc.m6.d5:octrMA.Triadic2.incipit	@ltx/gr_gr_cog/oc.m6.d2:octrMA.Triadic2.incipit
ltx/gr_gr_cog/oc.m6.d5:octrMA.Triadic2.mode	@ltx/gr_gr_cog/miscellanea:misc.Mode6
ltx/gr_gr_cog/oc.m6.d5:octrMA.Triadic2.text	@ltx/gr_gr_cog/oc.m6.d2:octrMA.Triadic2.text
ltx/gr_gr_cog/oc.m6.d5:octrMA.Triadic3.incipit	@ltx/gr_gr_cog/oc.m6.d2:octrMA.Triadic3.incipit
ltx/gr_gr_cog/oc.m6.d5:octrMA.Triadic3.mode	@ltx/gr_gr_cog/miscellanea:misc.Mode6
ltx/gr_gr_cog/oc.m6.d5:octrMA.Triadic3.text	@ltx/gr_gr_cog/oc.m6.d2:octrMA.Triadic3.text
