ltx/gr_gr_cog/me.m12.d11:meDA.commemoration.first	Μνήμη τοῦ Ὁσίου Δανιὴλ τοῦ Στυλίτου
ltx/gr_gr_cog/me.m12.d11:meDA.commemoration.first_name	
ltx/gr_gr_cog/me.m12.d11:meDA.commemoration.first_short	Μνήμη τοῦ Ὁσίου Δανιὴλ τοῦ Στυλίτου
ltx/gr_gr_cog/me.m12.d11:meDA.commemoration.first_title	@ltx/gr_gr_cog/titles:ti.SaintM
ltx/gr_gr_cog/me.m12.d11:meDA.commemoration.full	Μνήμη τοῦ Ὁσίου Πατρὸς ἡμῶν Δανιὴλ τοῦ Στυλίτου
ltx/gr_gr_cog/me.m12.d11:meDA.commemoration.second_name	
ltx/gr_gr_cog/me.m12.d11:meDA.commemoration.second_title	
ltx/gr_gr_cog/me.m12.d11:meDA.date	Τῌ ΙΑʹ ΔΕΚΕΜΒΡΙΟΥ
ltx/gr_gr_cog/me.m12.d11:meDA.fordate	διὰ τὴν 11ην Δεκεμβρίου
ltx/gr_gr_cog/me.m12.d11:meDA.insert1	καὶ τοῦ ὁσίου Πατρὸς ἡμῶν Δανιὴλ τοῦ Στυλίτου,
ltx/gr_gr_cog/me.m12.d11:meDA.insert2	οὗ καὶ τὴν μνήμην ἐπιτελοῦμεν·
ltx/gr_gr_cog/me.m12.d11:meDA.note	
ltx/gr_gr_cog/me.m12.d11:meDA.pdfcoverdate	τῆς 11ης Δεκεμβρίου,
ltx/gr_gr_cog/me.m12.d11:meDA.pdfheaderdate	τῆς 11ης Δεκεμβρίου
ltx/gr_gr_cog/me.m12.d11:meHO.commemorations	
ltx/gr_gr_cog/me.m12.d11:meHO.note1	
ltx/gr_gr_cog/me.m12.d11:meHO.note2	
ltx/gr_gr_cog/me.m12.d11:meHO.number	
ltx/gr_gr_cog/me.m12.d11:meHO.rank	
ltx/gr_gr_cog/me.m12.d11:meLE.commemoration1	Μνήμη τοῦ Ὁσίου Πατρὸς ἡμῶν Δανιὴλ τοῦ Στυλίτου.
ltx/gr_gr_cog/me.m12.d11:meLE.commemoration2	
ltx/gr_gr_cog/me.m12.d11:meLI.Kontakion1.greekmelody	@ltx/gr_gr_cog/me.m12.d11:meMA.Kontakion1.greekmelody
ltx/gr_gr_cog/me.m12.d11:meLI.Kontakion1.incipit	@ltx/gr_gr_cog/me.m12.d11:meMA.Kontakion1.incipit
ltx/gr_gr_cog/me.m12.d11:meLI.Kontakion1.melody	@ltx/gr_gr_cog/me.m12.d11:meMA.Kontakion1.melody
ltx/gr_gr_cog/me.m12.d11:meLI.Kontakion1.mode	@ltx/gr_gr_cog/me.m12.d11:meMA.Kontakion1.mode
ltx/gr_gr_cog/me.m12.d11:meLI.Kontakion1.text	@ltx/gr_gr_cog/me.m12.d11:meMA.Kontakion1.text
ltx/gr_gr_cog/me.m12.d11:meLI.Megalynarion.text	
ltx/gr_gr_cog/me.m12.d11:meMA.C1.acrostic.notice1	οὗ ἡ Ἀκροστιχίς·
ltx/gr_gr_cog/me.m12.d11:meMA.C1.acrostic.text	Ὕμνοις γεραίρω Δανιὴλ τὸν Στυλίτην. Ὁ Ἰωσήφ.
ltx/gr_gr_cog/me.m12.d11:meMA.C1.acrostic.title	Κανὼν τοῦ Ἁγίου,
ltx/gr_gr_cog/me.m12.d11:meMA.C1.title	@ltx/gr_gr_cog/titles:ti.CanonDevoutM
ltx/gr_gr_cog/me.m12.d11:meMA.C1.verse	@ltx/gr_gr_cog/prayers:pr.verse_DevoutMan.text
ltx/gr_gr_cog/me.m12.d11:meMA.ExapTheotokion.incipit	Ἐκύησας πανάχραντε, τὸν Θεοῦ Θεὸν…
ltx/gr_gr_cog/me.m12.d11:meMA.ExapTheotokion.melody	@ltx/gr_gr_cog/he.a.m3:heAU.EnPnevmatiToIero.name
ltx/gr_gr_cog/me.m12.d11:meMA.ExapTheotokion.mode	@ltx/gr_gr_cog/miscellanea:misc.Mode3
ltx/gr_gr_cog/me.m12.d11:meMA.ExapTheotokion.text	Ἐκύησας πανάχραντε, τὸν Θεοῦ Θεὸν Λόγον, τῷ κόσμῳ τὴν σωτήριον, ἐκτελοῦντα πανσόφως, οἰκονομίαν ἀρίστην· διὰ τοῦτό σε πάντες, ὑμνολογοῦμεν ἀξίως, ὡς πρεσβεύουσαν τούτῳ, λυτρωθῆναι ἡμᾶς νόσων, καὶ παντοίων κινδύνων.
ltx/gr_gr_cog/me.m12.d11:meMA.Exaposteilarion1.greekmelody	@ltx/gr_gr_cog/he.a.m3:heAU.EnPnevmatiToIero.greekname
ltx/gr_gr_cog/me.m12.d11:meMA.Exaposteilarion1.incipit	Τῷ κρύει καὶ τῷ καύσωνι…
ltx/gr_gr_cog/me.m12.d11:meMA.Exaposteilarion1.melody	@ltx/gr_gr_cog/he.a.m3:heAU.EnPnevmatiToIero.name
ltx/gr_gr_cog/me.m12.d11:meMA.Exaposteilarion1.mode	@ltx/gr_gr_cog/miscellanea:misc.Mode3
ltx/gr_gr_cog/me.m12.d11:meMA.Exaposteilarion1.text	Τῷ κρύει καὶ τῷ καύσωνι, πιεζόμενος Πάτερ, τῷ σώματι μετέωρος, διετέλεσας ὥσπερ, ἀδάμας μὴ καμπτόμενος, Δανιὴλ πανθαύμαστε, τῆς φύσεως ταῖς ἀνάγκαις· διὰ τοῦτο καὶ δόξης, ἀθανάτου σε υἱόν, ἠξίωσεν ἀπολαύειν.
ltx/gr_gr_cog/me.m12.d11:meMA.Kontakion1.greekmelody	@ltx/gr_gr_cog/he.a.m8:heAU.OsAparchas.greekname
ltx/gr_gr_cog/me.m12.d11:meMA.Kontakion1.incipit	Ὥσπερ ἀστὴρ πολύφωτος, σὺ ἀναβὰς…
ltx/gr_gr_cog/me.m12.d11:meMA.Kontakion1.melody	@ltx/gr_gr_cog/he.a.m8:heAU.OsAparchas.name
ltx/gr_gr_cog/me.m12.d11:meMA.Kontakion1.mode	@ltx/gr_gr_cog/miscellanea:misc.Mode8
ltx/gr_gr_cog/me.m12.d11:meMA.Kontakion1.text	Ὥσπερ ἀστὴρ πολύφωτος, σὺ ἀναβὰς μακάριε, ἐπὶ τοῦ στύλου τὸν κόσμον ἐφώτισας, ἐν τοῖς ὁσίοις ἔργοις σου, καὶ τὸ σκότος τῆς πλάνης, ἀπεδιώξας Πάτερ· διὸ δεόμεθα, καὶ νῦν ἐπίλαμψον, ἐν ταῖς καρδίαις τῶν δούλων σου, τὸ ἄδυτον φῶς τῆς γνώσεως.
ltx/gr_gr_cog/me.m12.d11:meMA.Ode1C11.greekmelody	@ltx/gr_gr_cog/he.h.m8:heHE.AsomenToKyrio.greekname
ltx/gr_gr_cog/me.m12.d11:meMA.Ode1C11.incipit	Ὕμνοις ἀνευφημῆσαι, μέλλοντι τὴν μνήμην…
ltx/gr_gr_cog/me.m12.d11:meMA.Ode1C11.melody	@ltx/gr_gr_cog/he.h.m8:heHE.AsomenToKyrio.name
ltx/gr_gr_cog/me.m12.d11:meMA.Ode1C11.mode	@ltx/gr_gr_cog/miscellanea:misc.Mode8
ltx/gr_gr_cog/me.m12.d11:meMA.Ode1C11.ode	@ltx/gr_gr_cog/miscellanea:misc.Ode1
ltx/gr_gr_cog/me.m12.d11:meMA.Ode1C11.text	Ὕμνοις ἀνευφημῆσαι, μέλλοντι τὴν μνήμην σου μακάριε, φωτοφόρον μοι αἴγλην, Δανιὴλ οὐρανόθεν κατάπεμψον.
ltx/gr_gr_cog/me.m12.d11:meMA.Ode1C12.incipit	Μέγας ἥλιος ὄντως, Πάτερ ἐξανέτειλας…
ltx/gr_gr_cog/me.m12.d11:meMA.Ode1C12.melody	@ltx/gr_gr_cog/he.h.m8:heHE.AsomenToKyrio.name
ltx/gr_gr_cog/me.m12.d11:meMA.Ode1C12.mode	@ltx/gr_gr_cog/miscellanea:misc.Mode8
ltx/gr_gr_cog/me.m12.d11:meMA.Ode1C12.ode	@ltx/gr_gr_cog/miscellanea:misc.Ode1
ltx/gr_gr_cog/me.m12.d11:meMA.Ode1C12.text	Μέγας ἥλιος ὄντως, Πάτερ ἐξανέτειλας τοῖς πέρασιν, ἀρετῶν δᾳδουχίᾳ, καταυγάζων πιστῶν τὰ συστήματα.
ltx/gr_gr_cog/me.m12.d11:meMA.Ode1C13.incipit	Νόμοις τοῖς τοῦ Δεσπότου, Πάτερ…
ltx/gr_gr_cog/me.m12.d11:meMA.Ode1C13.melody	@ltx/gr_gr_cog/he.h.m8:heHE.AsomenToKyrio.name
ltx/gr_gr_cog/me.m12.d11:meMA.Ode1C13.mode	@ltx/gr_gr_cog/miscellanea:misc.Mode8
ltx/gr_gr_cog/me.m12.d11:meMA.Ode1C13.ode	@ltx/gr_gr_cog/miscellanea:misc.Ode1
ltx/gr_gr_cog/me.m12.d11:meMA.Ode1C13.text	Νόμοις τοῖς τοῦ Δεσπότου, Πάτερ καθυπείκων ἀπενέκρωσας, ἐγκρατείᾳ τὴν σάρκα, καὶ ὑπέταξας ταύτην τῷ Πνεύματι.
ltx/gr_gr_cog/me.m12.d11:meMA.Ode1C1T.incipit	Ὅλος ἄνθρωπος ὤφθη, μείνας ὅπερ…
ltx/gr_gr_cog/me.m12.d11:meMA.Ode1C1T.melody	@ltx/gr_gr_cog/he.h.m8:heHE.AsomenToKyrio.name
ltx/gr_gr_cog/me.m12.d11:meMA.Ode1C1T.mode	@ltx/gr_gr_cog/miscellanea:misc.Mode8
ltx/gr_gr_cog/me.m12.d11:meMA.Ode1C1T.ode	@ltx/gr_gr_cog/miscellanea:misc.Ode1
ltx/gr_gr_cog/me.m12.d11:meMA.Ode1C1T.text	Ὅλος ἄνθρωπος ὤφθη, μείνας ὅπερ ἦν καὶ μετὰ σάρκωσιν, ὁ ἐκ σοῦ Θεοτόκε, γεννηθεὶς ἀναλλοίωτος Κύριος.
ltx/gr_gr_cog/me.m12.d11:meMA.Ode3C11.greekmelody	@ltx/gr_gr_cog/he.h.m8:heHE.OuraniasApsidos.greekname
ltx/gr_gr_cog/me.m12.d11:meMA.Ode3C11.incipit	Ῥάβδῳ τῆς ἐγκρατείας, τὴν τῶν…
ltx/gr_gr_cog/me.m12.d11:meMA.Ode3C11.melody	@ltx/gr_gr_cog/he.h.m8:heHE.OuraniasApsidos.name
ltx/gr_gr_cog/me.m12.d11:meMA.Ode3C11.mode	@ltx/gr_gr_cog/miscellanea:misc.Mode8
ltx/gr_gr_cog/me.m12.d11:meMA.Ode3C11.ode	@ltx/gr_gr_cog/miscellanea:misc.Ode3
ltx/gr_gr_cog/me.m12.d11:meMA.Ode3C11.text	Ῥάβδῳ τῆς ἐγκρατείας, τὴν τῶν παθῶν θάλασσαν, Πάτερ διαῤῥήξας, διέβης ἀκαταπόντιστος, καὶ ὄρος ἔφθασας, τῆς ἀληθοῦς ἀπαθείας, καὶ Θεῷ ὡμίλησας νοῦ καθαρότητι.
ltx/gr_gr_cog/me.m12.d11:meMA.Ode3C12.incipit	Ἀνελθὼν εἰς τὸ ὕψος, τῶν…
ltx/gr_gr_cog/me.m12.d11:meMA.Ode3C12.melody	@ltx/gr_gr_cog/he.h.m8:heHE.OuraniasApsidos.name
ltx/gr_gr_cog/me.m12.d11:meMA.Ode3C12.mode	@ltx/gr_gr_cog/miscellanea:misc.Mode8
ltx/gr_gr_cog/me.m12.d11:meMA.Ode3C12.ode	@ltx/gr_gr_cog/miscellanea:misc.Ode3
ltx/gr_gr_cog/me.m12.d11:meMA.Ode3C12.text	Ἀνελθὼν εἰς τὸ ὕψος, τῶν ἀρετῶν γνώριμος, γέγονας τῷ κόσμῳ ἐν στύλῳ, μένων μετέωρος, καὶ τῇ λαμπρότητι, τῶν παραδόξων θαυμάτων, καταυγάζων πίστει σοι, τοὺς προσανέχοντας.
ltx/gr_gr_cog/me.m12.d11:meMA.Ode3C13.incipit	Ἱδρυμένος ἐν πέτρᾳ, τῆς τοῦ…
ltx/gr_gr_cog/me.m12.d11:meMA.Ode3C13.melody	@ltx/gr_gr_cog/he.h.m8:heHE.OuraniasApsidos.name
ltx/gr_gr_cog/me.m12.d11:meMA.Ode3C13.mode	@ltx/gr_gr_cog/miscellanea:misc.Mode8
ltx/gr_gr_cog/me.m12.d11:meMA.Ode3C13.ode	@ltx/gr_gr_cog/miscellanea:misc.Ode3
ltx/gr_gr_cog/me.m12.d11:meMA.Ode3C13.text	Ἱδρυμένος ἐν πέτρᾳ, τῆς τοῦ Θεοῦ γνώσεως, πάσαις μεθοδείαις δαιμόνων, ὤφθης ἀκλόνητος, στύλῳ τὸ σῶμα δέ, ἐπὶ τῆς γῆς ἀνυψώσας, τὴν ψυχὴν ἐπτέρωσας, πρός τὰ οὐράνια.
ltx/gr_gr_cog/me.m12.d11:meMA.Ode3C1T.incipit	Ῥῦσαι τῆς τῶν παθῶν με…
ltx/gr_gr_cog/me.m12.d11:meMA.Ode3C1T.melody	@ltx/gr_gr_cog/he.h.m8:heHE.OuraniasApsidos.name
ltx/gr_gr_cog/me.m12.d11:meMA.Ode3C1T.mode	@ltx/gr_gr_cog/miscellanea:misc.Mode8
ltx/gr_gr_cog/me.m12.d11:meMA.Ode3C1T.ode	@ltx/gr_gr_cog/miscellanea:misc.Ode3
ltx/gr_gr_cog/me.m12.d11:meMA.Ode3C1T.text	Ῥῦσαι τῆς τῶν παθῶν με, ἐπαγωγῆς Δέσποινα, καὶ τοὺς πολεμοῦντας ἐχθρούς μοι, νῦν ἐκπολέμησον, στήριξον πέτρᾳ με, τῶν τοῦ Θεοῦ θελημάτων, τὴν ψυχήν μου φώτισον, Πύλη τοῦ θείου φωτός.
ltx/gr_gr_cog/me.m12.d11:meMA.Ode3H.greekmelody	@ltx/gr_gr_cog/he.h.m8:heHE.OuraniasApsidos.greekname
ltx/gr_gr_cog/me.m12.d11:meMA.Ode3H.incipit	@ltx/gr_gr_cog/he.h.m8:heHE.OuraniasApsidos.incipit
ltx/gr_gr_cog/me.m12.d11:meMA.Ode3H.melody	@ltx/gr_gr_cog/he.h.m8:heHE.OuraniasApsidos.melody
ltx/gr_gr_cog/me.m12.d11:meMA.Ode3H.mode	@ltx/gr_gr_cog/miscellanea:misc.Mode8
ltx/gr_gr_cog/me.m12.d11:meMA.Ode3H.ode	@ltx/gr_gr_cog/miscellanea:misc.Ode3
ltx/gr_gr_cog/me.m12.d11:meMA.Ode3H.text	@ltx/gr_gr_cog/he.h.m8:heHE.OuraniasApsidos.text
ltx/gr_gr_cog/me.m12.d11:meMA.Ode3Kathisma1.greekmelody	@ltx/gr_gr_cog/he.a.m8:heAU.TinSofianKaiLogon.greekname
ltx/gr_gr_cog/me.m12.d11:meMA.Ode3Kathisma1.incipit	Ἐγκρατείᾳ καὶ πόνοις καὶ προσευχαῖς…
ltx/gr_gr_cog/me.m12.d11:meMA.Ode3Kathisma1.melody	@ltx/gr_gr_cog/he.a.m8:heAU.TinSofianKaiLogon.name
ltx/gr_gr_cog/me.m12.d11:meMA.Ode3Kathisma1.mode	@ltx/gr_gr_cog/miscellanea:misc.Mode8
ltx/gr_gr_cog/me.m12.d11:meMA.Ode3Kathisma1.text	Ἐγκρατείᾳ καὶ πόνοις καὶ προσευχαῖς, τὴν ψυχήν σου κοσμήσας θεοπρεπῶς, γέγονας συμμέτοχος, τῶν Ἀγγέλων μακάριε, καὶ τῶν θαυμάτων ὄντως, χαρίσματα ἔλαβες, τοῦ ἰᾶσθαι τὰς νόσους, τῶν πίστει τιμώντων σε· ὅθεν καὶ δαιμόνων, ἀπελαύνων τὰ πλήθη, παρέχεις ἰάματα, τοῖς ἀνθρώποις μακάριε, Δανιὴλ ἀξιάγαστε. Πρέσβευε Χριστῷ τῷ Θεῷ, τῶν πταισμάτων ἄφεσιν δωρήσασθαι, τοῖς ἑορτάζουσι πόθῳ, τὴν ἁγίαν μνήμην σου.
ltx/gr_gr_cog/me.m12.d11:meMA.Ode3KathismaSt.incipit	Σταυρικὸν καθορῶσα πάθος σεμνή, τοῦ…
ltx/gr_gr_cog/me.m12.d11:meMA.Ode3KathismaSt.melody	@ltx/gr_gr_cog/he.a.m8:heAU.TinSofianKaiLogon.name
ltx/gr_gr_cog/me.m12.d11:meMA.Ode3KathismaSt.mode	@ltx/gr_gr_cog/miscellanea:misc.Mode8
ltx/gr_gr_cog/me.m12.d11:meMA.Ode3KathismaSt.text	Σταυρικὸν καθορῶσα πάθος σεμνή, τοῦ Υἱοῦ καὶ Θεοῦ σου σπλάγχνα πικρῶς, σπαράττουσα ἔκραζες, ὀλολύζουσα πάναγνε· Πῶς ἑκὼν ἐτάθης, καὶ θάνατον Δέσποτα, σαρκικόν ἐδέξω, φρικτὸν ὄντως ἄκουσμα! ὅθεν ἀνυμνῶ σου, τὸ ἀπόῤῥητον Σῶτερ, καὶ ἄφραστον βούλημα, ὅτι σῶσαι ἐλήλυθας, τὸ πλανώμενον πλάσμα σου. Ἀνάστηθι ἀλλʼ ὅμως Υἱέ, καὶ χαρᾶς τὴν καρδίαν πλήρωσον, ὁ εὐφροσύνης τὰ πάντα, πληρώσας τῷ πάθει σου.
ltx/gr_gr_cog/me.m12.d11:meMA.Ode3KathismaT.incipit	Τὴν Βασίλισσαν πάντες δεῦτε πιστοί…
ltx/gr_gr_cog/me.m12.d11:meMA.Ode3KathismaT.melody	@ltx/gr_gr_cog/he.a.m8:heAU.TinSofianKaiLogon.name
ltx/gr_gr_cog/me.m12.d11:meMA.Ode3KathismaT.mode	@ltx/gr_gr_cog/miscellanea:misc.Mode8
ltx/gr_gr_cog/me.m12.d11:meMA.Ode3KathismaT.text	Τὴν Βασίλισσαν πάντες δεῦτε πιστοί, τὴν Μητέρα τοῦ πάντων Δημιουργοῦ, φωναῖς μεγαλύνωμεν, καὶ ὑμνοῦντες βοήσωμεν· Ἡ τῆς χαρᾶς αἰτία, Παρθένε πανύμνητε, τοὺς τιμῶντάς σε σῷζε, καὶ σκέπε πρεσβείαις σου· ἔχεις γὰρ ὡς Μήτηρ, τοῦ Θεοῦ παῤῥησίαν, λυτροῦσθαι ἐκ θλίψεων, καὶ πληροῦν τὰ αἰτήματα, τῶν πιστῶς ἐκβοώντων σοι· Πρέσβευε τῷ σῷ Υἱῷ καὶ Θεῷ τῶν πταισμάτων δοῦναι τὴν συγχώρησιν, τοῖς εὐσεβῶς προσκυνοῦσι, τὸν ἄχραντον τόκον σου.
ltx/gr_gr_cog/me.m12.d11:meMA.Ode4C11.greekmelody	@ltx/gr_gr_cog/he.h.m8:heHE.SyMouIschys.greekname
ltx/gr_gr_cog/me.m12.d11:meMA.Ode4C11.incipit	Ὡς φωταυγῆ ἥλιον, Πάτερ ἀοίδιμε…
ltx/gr_gr_cog/me.m12.d11:meMA.Ode4C11.melody	@ltx/gr_gr_cog/he.h.m8:heHE.SyMouIschys.name
ltx/gr_gr_cog/me.m12.d11:meMA.Ode4C11.mode	@ltx/gr_gr_cog/miscellanea:misc.Mode8
ltx/gr_gr_cog/me.m12.d11:meMA.Ode4C11.ode	@ltx/gr_gr_cog/miscellanea:misc.Ode4
ltx/gr_gr_cog/me.m12.d11:meMA.Ode4C11.text	Ὡς φωταυγῆ ἥλιον, Πάτερ ἀοίδιμε, ἐπὶ στύλου, λάμποντα τεθέασαι, τὸν τοῦ Θεοῦ, δοῦλον Συμεών, καὶ ταῖς πηγαζούσαις, ἐκ τούτου θείαις λαμπρότησιν, ἐνθέως κατηυγάσθης, Δανιὴλ καὶ κατʼ ἴχνος, τῆς αὐτοῦ πολιτείας ἐβάδισας.
ltx/gr_gr_cog/me.m12.d11:meMA.Ode4C12.incipit	Δαιμονικὰς φάλαγγας, ὅπλῳ τῆς πίστεως…
ltx/gr_gr_cog/me.m12.d11:meMA.Ode4C12.melody	@ltx/gr_gr_cog/he.h.m8:heHE.SyMouIschys.name
ltx/gr_gr_cog/me.m12.d11:meMA.Ode4C12.mode	@ltx/gr_gr_cog/miscellanea:misc.Mode8
ltx/gr_gr_cog/me.m12.d11:meMA.Ode4C12.ode	@ltx/gr_gr_cog/miscellanea:misc.Ode4
ltx/gr_gr_cog/me.m12.d11:meMA.Ode4C12.text	Δαιμονικὰς φάλαγγας, ὅπλῳ τῆς πίστεως, ἐτροπώσω, ῥείθροις τε κατέκλυσας, τῶν προσευχῶν, λύμην τὴν αὐτῶν, Πάτερ ἀναστείλας, ἣν ἐνεποίουν τοῖς πλέουσι, καὶ ἔσωσας τοὺς πίστει, τῷ Χριστῷ μελῳδοῦντας· τῇ δυνάμει σου δόξα Φιλάνθρωπε.
ltx/gr_gr_cog/me.m12.d11:meMA.Ode4C13.incipit	Ἀναστηλῶν, Πάτερ σαυτὸν παμμακάριστε, ὁλονύκτως…
ltx/gr_gr_cog/me.m12.d11:meMA.Ode4C13.melody	@ltx/gr_gr_cog/he.h.m8:heHE.SyMouIschys.name
ltx/gr_gr_cog/me.m12.d11:meMA.Ode4C13.mode	@ltx/gr_gr_cog/miscellanea:misc.Mode8
ltx/gr_gr_cog/me.m12.d11:meMA.Ode4C13.ode	@ltx/gr_gr_cog/miscellanea:misc.Ode4
ltx/gr_gr_cog/me.m12.d11:meMA.Ode4C13.text	Ἀναστηλῶν, Πάτερ σαυτὸν παμμακάριστε, ὁλονύκτως, ἵστασο ὡς ἄσαρκος, ἀμετεώριστον τῆς ψυχῆς, ὄμμα κεκτημένος, καὶ καθαρὸν ὥσπερ ἔσοπτρον, τοῦ Πνεύματος τὴν αἴγλην, καὶ τὰς θείας ἐμφάσεις, καθαρᾷ διανοίᾳ δεχόμενος.
ltx/gr_gr_cog/me.m12.d11:meMA.Ode4C1T.incipit	Νόμοι ἐν σοί, φύσεως κεκαινοτόμηνται…
ltx/gr_gr_cog/me.m12.d11:meMA.Ode4C1T.melody	@ltx/gr_gr_cog/he.h.m8:heHE.SyMouIschys.name
ltx/gr_gr_cog/me.m12.d11:meMA.Ode4C1T.mode	@ltx/gr_gr_cog/miscellanea:misc.Mode8
ltx/gr_gr_cog/me.m12.d11:meMA.Ode4C1T.ode	@ltx/gr_gr_cog/miscellanea:misc.Ode4
ltx/gr_gr_cog/me.m12.d11:meMA.Ode4C1T.text	Νόμοι ἐν σοί, φύσεως κεκαινοτόμηνται· νομοδότην, Λόγον γὰρ ἐγέννησας, ὑπὲρ αἰτίων ὡς ἀληθῶς, Πάναγνε καὶ λόγον, τῆς ἀλογίας ῥυσάμενον, τὸ γένος τῶν ἀνθρώπων, τῶν πιστῶς μελῳδούντων· τῇ δυνάμει σου δόξα Φιλάνθρωπε.
ltx/gr_gr_cog/me.m12.d11:meMA.Ode5C11.greekmelody	@ltx/gr_gr_cog/he.h.m8:heHE.InaTiMeAposo.greekname
ltx/gr_gr_cog/me.m12.d11:meMA.Ode5C11.incipit	Ἵνα τῆς ἀθανάτου, δόξης ἐπιτύχῃς…
ltx/gr_gr_cog/me.m12.d11:meMA.Ode5C11.melody	@ltx/gr_gr_cog/he.h.m8:heHE.InaTiMeAposo.name
ltx/gr_gr_cog/me.m12.d11:meMA.Ode5C11.mode	@ltx/gr_gr_cog/miscellanea:misc.Mode8
ltx/gr_gr_cog/me.m12.d11:meMA.Ode5C11.ode	@ltx/gr_gr_cog/miscellanea:misc.Ode5
ltx/gr_gr_cog/me.m12.d11:meMA.Ode5C11.text	Ἵνα τῆς ἀθανάτου, δόξης ἐπιτύχῃς, σαρκὸς ἐθανάτωσας, τὰς ὀρέξεις Πάτερ, καὶ παθῶν τὰς ὁρμὰς ἐχαλίνωσας, ἐγκρατείας πόνοις, καὶ ποταμὸς θαυμάτων ὤφθης, καὶ πηγὴ ἰαμάτων ἀοίδιμε.
ltx/gr_gr_cog/me.m12.d11:meMA.Ode5C12.incipit	Ἣν διώδευσε τρίβον, Πάτερ ἐπὶ…
ltx/gr_gr_cog/me.m12.d11:meMA.Ode5C12.melody	@ltx/gr_gr_cog/he.h.m8:heHE.InaTiMeAposo.name
ltx/gr_gr_cog/me.m12.d11:meMA.Ode5C12.mode	@ltx/gr_gr_cog/miscellanea:misc.Mode8
ltx/gr_gr_cog/me.m12.d11:meMA.Ode5C12.ode	@ltx/gr_gr_cog/miscellanea:misc.Ode5
ltx/gr_gr_cog/me.m12.d11:meMA.Ode5C12.text	Ἣν διώδευσε τρίβον, Πάτερ ἐπὶ γῆς Συμεὼν ὁ θαυμάσιος, ἐν ἐκτάσει μάκαρ, γεγονότι σοι ὤφθη δεικνύων σοι, σὺν δυσὶν Ἀγγέλοις· Δεῦρο βοῶν, καὶ στῆθι πρός με, πρὸς Θεὸν ἀνυψούμενος χάριτι.
ltx/gr_gr_cog/me.m12.d11:meMA.Ode5C13.incipit	Λαμπρυνόμενος αἴγλῃ, Πάτερ ἀνεσπέρου, καὶ…
ltx/gr_gr_cog/me.m12.d11:meMA.Ode5C13.melody	@ltx/gr_gr_cog/he.h.m8:heHE.InaTiMeAposo.name
ltx/gr_gr_cog/me.m12.d11:meMA.Ode5C13.mode	@ltx/gr_gr_cog/miscellanea:misc.Mode8
ltx/gr_gr_cog/me.m12.d11:meMA.Ode5C13.ode	@ltx/gr_gr_cog/miscellanea:misc.Ode5
ltx/gr_gr_cog/me.m12.d11:meMA.Ode5C13.text	Λαμπρυνόμενος αἴγλῃ, Πάτερ ἀνεσπέρου, καὶ θείας ἐλλάμψεως, τῶν δαιμόνων ζόφον, καὶ παθῶν τὴν ὁμίχλην ἐδίωξας, καὶ ὡράθης στῦλος, φωτοειδὴς καὶ κλῖμαξ ὄντως, πρὸς Θεόν τους πιστοὺς ἐπανάγουσα.
ltx/gr_gr_cog/me.m12.d11:meMA.Ode5C1T.incipit	Τὸν Δεσπότην τεκοῦσα, ὤφθης ὑπερτέρα…
ltx/gr_gr_cog/me.m12.d11:meMA.Ode5C1T.melody	@ltx/gr_gr_cog/he.h.m8:heHE.InaTiMeAposo.name
ltx/gr_gr_cog/me.m12.d11:meMA.Ode5C1T.mode	@ltx/gr_gr_cog/miscellanea:misc.Mode8
ltx/gr_gr_cog/me.m12.d11:meMA.Ode5C1T.ode	@ltx/gr_gr_cog/miscellanea:misc.Ode5
ltx/gr_gr_cog/me.m12.d11:meMA.Ode5C1T.text	Τὸν Δεσπότην τεκοῦσα, ὤφθης ὑπερτέρα, τῶν ἄνω Δυνάμεων, καὶ βροτῶν τὴν φύσιν, ἐθεούργησας μόνη Πανύμνητε, Θεοτόκον· ὅθεν, παναληθῆ ψυχῇ καὶ γλώσσῃ, οἱ πιστοί σε Παρθένε δοξάζομεν.
ltx/gr_gr_cog/me.m12.d11:meMA.Ode6C11.greekmelody	@ltx/gr_gr_cog/he.h.m8:heHE.IlasthitiMoiSotir.greekname
ltx/gr_gr_cog/me.m12.d11:meMA.Ode6C11.incipit	Ὁ νοῦς σου τῇ πρὸς…
ltx/gr_gr_cog/me.m12.d11:meMA.Ode6C11.melody	@ltx/gr_gr_cog/he.h.m8:heHE.IlasthitiMoiSotir.name
ltx/gr_gr_cog/me.m12.d11:meMA.Ode6C11.mode	@ltx/gr_gr_cog/miscellanea:misc.Mode8
ltx/gr_gr_cog/me.m12.d11:meMA.Ode6C11.ode	@ltx/gr_gr_cog/miscellanea:misc.Ode6
ltx/gr_gr_cog/me.m12.d11:meMA.Ode6C11.text	Ὁ νοῦς σου τῇ πρὸς Θεόν, ἐγγύτητι λαμπρυνόμενος, ἀνάλωτος ἡδονῶν, πυρὶ Πάτερ ἔμεινε, καὶ παθῶν ἀνώτερος, καὶ τῆς πρὸς τὸ σῶμα, προσπαθείας ὑψηλότερος.
ltx/gr_gr_cog/me.m12.d11:meMA.Ode6C12.incipit	Ναμάτων ζωοποιῶν, τῶν χαρισμάτων τοῦ…
ltx/gr_gr_cog/me.m12.d11:meMA.Ode6C12.melody	@ltx/gr_gr_cog/he.h.m8:heHE.IlasthitiMoiSotir.name
ltx/gr_gr_cog/me.m12.d11:meMA.Ode6C12.mode	@ltx/gr_gr_cog/miscellanea:misc.Mode8
ltx/gr_gr_cog/me.m12.d11:meMA.Ode6C12.ode	@ltx/gr_gr_cog/miscellanea:misc.Ode6
ltx/gr_gr_cog/me.m12.d11:meMA.Ode6C12.text	Ναμάτων ζωοποιῶν, τῶν χαρισμάτων τοῦ Πνεύματος, πλησθεῖσά σου ἡ ψυχή, θεόφρον πανόλβιε, ποταμοὺς ἀνέβλυσεν, ἰαμάτων ὄντως, ὀχετοὺς παθῶν ξηραίνοντας.
ltx/gr_gr_cog/me.m12.d11:meMA.Ode6C1T.incipit	Σὲ προστασίαν πιστοί, καὶ τεῖχος…
ltx/gr_gr_cog/me.m12.d11:meMA.Ode6C1T.melody	@ltx/gr_gr_cog/he.h.m8:heHE.IlasthitiMoiSotir.name
ltx/gr_gr_cog/me.m12.d11:meMA.Ode6C1T.mode	@ltx/gr_gr_cog/miscellanea:misc.Mode8
ltx/gr_gr_cog/me.m12.d11:meMA.Ode6C1T.ode	@ltx/gr_gr_cog/miscellanea:misc.Ode6
ltx/gr_gr_cog/me.m12.d11:meMA.Ode6C1T.text	Σὲ προστασίαν πιστοί, καὶ τεῖχος κεκτήμεθα, οἱ ἐν βυθῷ τῶν κακῶν, καὶ σάλῳ τῶν θλίψεων, ἀεὶ κινδυνεύοντες, Θεοτόκε μόνη, τῶν βροτῶν τὸ καταφύγιον.
ltx/gr_gr_cog/me.m12.d11:meMA.Ode6H.greekmelody	@ltx/gr_gr_cog/he.h.m8:heHE.IlasthitiMoiSotir.greekname
ltx/gr_gr_cog/me.m12.d11:meMA.Ode6H.incipit	@ltx/gr_gr_cog/he.h.m8:heHE.IlasthitiMoiSotir.incipit
ltx/gr_gr_cog/me.m12.d11:meMA.Ode6H.melody	@ltx/gr_gr_cog/he.h.m8:heHE.IlasthitiMoiSotir.melody
ltx/gr_gr_cog/me.m12.d11:meMA.Ode6H.mode	@ltx/gr_gr_cog/miscellanea:misc.Mode8
ltx/gr_gr_cog/me.m12.d11:meMA.Ode6H.ode	@ltx/gr_gr_cog/miscellanea:misc.Ode6
ltx/gr_gr_cog/me.m12.d11:meMA.Ode6H.text	@ltx/gr_gr_cog/he.h.m8:heHE.IlasthitiMoiSotir.text
ltx/gr_gr_cog/me.m12.d11:meMA.Ode7C11.greekmelody	@ltx/gr_gr_cog/he.h.m8:heHE.PaidesEvraion.greekname
ltx/gr_gr_cog/me.m12.d11:meMA.Ode7C11.incipit	Τάξεις Ἀγγέλων σου τὴν στάσιν…
ltx/gr_gr_cog/me.m12.d11:meMA.Ode7C11.melody	@ltx/gr_gr_cog/he.h.m8:heHE.PaidesEvraion.name
ltx/gr_gr_cog/me.m12.d11:meMA.Ode7C11.mode	@ltx/gr_gr_cog/miscellanea:misc.Mode8
ltx/gr_gr_cog/me.m12.d11:meMA.Ode7C11.ode	@ltx/gr_gr_cog/miscellanea:misc.Ode7
ltx/gr_gr_cog/me.m12.d11:meMA.Ode7C11.text	Τάξεις Ἀγγέλων σου τὴν στάσιν, κατεπλάγησαν παμμάκαρ θεοφόρε· μετὰ σώματος γάρ, τὴν τούτων πολιτείαν, ἀναλαβὼν ἐκραύγαζεν· ὁ Θεὸς εὐλογητὸς εἶ.
ltx/gr_gr_cog/me.m12.d11:meMA.Ode7C12.incipit	Ὕψει ἀΰλου πολιτείας, προφητείας τε…
ltx/gr_gr_cog/me.m12.d11:meMA.Ode7C12.melody	@ltx/gr_gr_cog/he.h.m8:heHE.PaidesEvraion.name
ltx/gr_gr_cog/me.m12.d11:meMA.Ode7C12.mode	@ltx/gr_gr_cog/miscellanea:misc.Mode8
ltx/gr_gr_cog/me.m12.d11:meMA.Ode7C12.ode	@ltx/gr_gr_cog/miscellanea:misc.Ode7
ltx/gr_gr_cog/me.m12.d11:meMA.Ode7C12.text	Ὕψει ἀΰλου πολιτείας, προφητείας τε ἐκλάμπων φωταυγείᾳ, ἰαμάτων ἡμῖν, ἀπήστραψας ἀκτῖνας, τοῖς εὐσεβῶς τιμῶσί σε, Δανιὴλ θαυματοφόρε.
ltx/gr_gr_cog/me.m12.d11:meMA.Ode7C13.incipit	Λῦσον παθῶν μου τὴν ὁμίχλην…
ltx/gr_gr_cog/me.m12.d11:meMA.Ode7C13.melody	@ltx/gr_gr_cog/he.h.m8:heHE.PaidesEvraion.name
ltx/gr_gr_cog/me.m12.d11:meMA.Ode7C13.mode	@ltx/gr_gr_cog/miscellanea:misc.Mode8
ltx/gr_gr_cog/me.m12.d11:meMA.Ode7C13.ode	@ltx/gr_gr_cog/miscellanea:misc.Ode7
ltx/gr_gr_cog/me.m12.d11:meMA.Ode7C13.text	Λῦσον παθῶν μου τὴν ὁμίχλην, τῇ λαμπρότητι, παμμάκαρ σῆς πρεσβείας, καὶ πρὸς τρίβους ζωῆς, ὁδήγησον βοῶντα· Εὐλογητὸς εἶ Κύριε, ὁ Θεὸς εἰς τοὺς αἰῶνας.
ltx/gr_gr_cog/me.m12.d11:meMA.Ode7C1T.incipit	Ἵλεως ἔσο μοι Παρθένε, καὶ…
ltx/gr_gr_cog/me.m12.d11:meMA.Ode7C1T.melody	@ltx/gr_gr_cog/he.h.m8:heHE.PaidesEvraion.name
ltx/gr_gr_cog/me.m12.d11:meMA.Ode7C1T.mode	@ltx/gr_gr_cog/miscellanea:misc.Mode8
ltx/gr_gr_cog/me.m12.d11:meMA.Ode7C1T.ode	@ltx/gr_gr_cog/miscellanea:misc.Ode7
ltx/gr_gr_cog/me.m12.d11:meMA.Ode7C1T.text	Ἵλεως ἔσο μοι Παρθένε, καὶ πληγέντα με ῥομφαίᾳ ἁμαρτίας, ἐν μοτώσει τῆς σῆς, θεράπευσον πρεσβείας· Εὐλογημένος κράζοντα, ὁ καρπὸς τῆς σῆς κοιλίας.
ltx/gr_gr_cog/me.m12.d11:meMA.Ode8C11.greekmelody	@ltx/gr_gr_cog/he.h.m8:heHE.EptaplasiosKaminon.greekname
ltx/gr_gr_cog/me.m12.d11:meMA.Ode8C11.incipit	Τῶν ὀρεκτῶν τὸ ἔσχατον, τῶν…
ltx/gr_gr_cog/me.m12.d11:meMA.Ode8C11.melody	@ltx/gr_gr_cog/he.h.m8:heHE.EptaplasiosKaminon.name
ltx/gr_gr_cog/me.m12.d11:meMA.Ode8C11.mode	@ltx/gr_gr_cog/miscellanea:misc.Mode8
ltx/gr_gr_cog/me.m12.d11:meMA.Ode8C11.ode	@ltx/gr_gr_cog/miscellanea:misc.Ode8
ltx/gr_gr_cog/me.m12.d11:meMA.Ode8C11.text	Τῶν ὀρεκτῶν τὸ ἔσχατον, τῶν καλῶν τὸ ἀκρότατον, Πάτερ θεοφόρε, ἀκριβῶς κατέλαβες, πτεροῖς κουφιζόμενος, τῶν ἐναρέτων πράξεων, καὶ σὺν ἀσωμάτοις, Δανιήλ ἀνακράζεις· οἱ Παῖδες εὐλογεῖτε, ἱερεῖς ἀνυμνεῖτε, λαὸς ὑπερυψοῦτε, Χριστὸν εἰς τοὺς αἰῶνας.
ltx/gr_gr_cog/me.m12.d11:meMA.Ode8C12.incipit	Ἡ τοῦ Θεοῦ σε δύναμις…
ltx/gr_gr_cog/me.m12.d11:meMA.Ode8C12.melody	@ltx/gr_gr_cog/he.h.m8:heHE.EptaplasiosKaminon.name
ltx/gr_gr_cog/me.m12.d11:meMA.Ode8C12.mode	@ltx/gr_gr_cog/miscellanea:misc.Mode8
ltx/gr_gr_cog/me.m12.d11:meMA.Ode8C12.ode	@ltx/gr_gr_cog/miscellanea:misc.Ode8
ltx/gr_gr_cog/me.m12.d11:meMA.Ode8C12.text	Ἡ τοῦ Θεοῦ σε δύναμις, προφανῶς ἐνισχύσασα, φέρειν τοῦ κρυμοῦ, τὸ δυσχερὲς ἐποίησεν, ἡλίου τὸν καύσωνα, τὰς σηπεδόνας τὰς τῆς σαρκός, καὶ τῶν ἐξ αὐτῆς, γεγενημένων σκωλήκων, τὴν κάκωσιν βοῶντα· Ἱερεῖς εὐλογεῖτε, λαὸς ὑπερυψοῦτε, Χριστὸν εἰς τοὺς αἰῶνας.
ltx/gr_gr_cog/me.m12.d11:meMA.Ode8C13.incipit	Νέος Ἰὼβ σὺ πέφηνας, Δανιὴλ…
ltx/gr_gr_cog/me.m12.d11:meMA.Ode8C13.melody	@ltx/gr_gr_cog/he.h.m8:heHE.EptaplasiosKaminon.name
ltx/gr_gr_cog/me.m12.d11:meMA.Ode8C13.mode	@ltx/gr_gr_cog/miscellanea:misc.Mode8
ltx/gr_gr_cog/me.m12.d11:meMA.Ode8C13.ode	@ltx/gr_gr_cog/miscellanea:misc.Ode8
ltx/gr_gr_cog/me.m12.d11:meMA.Ode8C13.text	Νέος Ἰὼβ σὺ πέφηνας, Δανιὴλ ἀξιάγαστε, πλήθει πειρασμῶν, περισχεθεὶς καὶ θλίψεων, Δαυΐδ τὴν πραότητα, καὶ Ἰακὼβ τὸ ἄπλαστον, καὶ τὴν σωφροσύνην, Ἰωσὴφ ἐμιμήσω, κραυγάζων, τὸν Δεσπότην· Ἱερεῖς εὐλογεῖτε, λαὸς ὑπερυψοῦτε, εἰς πάντας τοὺς αἰῶνας.
ltx/gr_gr_cog/me.m12.d11:meMA.Ode8C1T.incipit	Οἱ Θεοτόκον Δέσποινα, Παναγία φρονοῦντές…
ltx/gr_gr_cog/me.m12.d11:meMA.Ode8C1T.melody	@ltx/gr_gr_cog/he.h.m8:heHE.EptaplasiosKaminon.name
ltx/gr_gr_cog/me.m12.d11:meMA.Ode8C1T.mode	@ltx/gr_gr_cog/miscellanea:misc.Mode8
ltx/gr_gr_cog/me.m12.d11:meMA.Ode8C1T.ode	@ltx/gr_gr_cog/miscellanea:misc.Ode8
ltx/gr_gr_cog/me.m12.d11:meMA.Ode8C1T.text	Οἱ Θεοτόκον Δέσποινα, Παναγία φρονοῦντές σε, ῥήμασιν ἑπόμενοι, τοῖς σοῖς πανύμνητε· σὲ νῦν μακαρίζομεν, ὅτι Θεὸν μακάριον, ἔτεκες ἡμῖν, ὃν ἐν δυσὶ ταῖς οὐσίαις, μιᾷ δὲ ὑποστάσει, ἀνυμνοῦντες βοῶμεν· Λαὸς ὑπερυψοῦτε, εἰς πάντας τοὺς αἰῶνας.
ltx/gr_gr_cog/me.m12.d11:meMA.Ode8H.greekmelody	@ltx/gr_gr_cog/he.h.m8:heHE.EptaplasiosKaminon.greekname
ltx/gr_gr_cog/me.m12.d11:meMA.Ode8H.incipit	@ltx/gr_gr_cog/he.h.m8:heHE.EptaplasiosKaminon.incipit
ltx/gr_gr_cog/me.m12.d11:meMA.Ode8H.melody	@ltx/gr_gr_cog/he.h.m8:heHE.EptaplasiosKaminon.melody
ltx/gr_gr_cog/me.m12.d11:meMA.Ode8H.mode	@ltx/gr_gr_cog/miscellanea:misc.Mode8
ltx/gr_gr_cog/me.m12.d11:meMA.Ode8H.ode	@ltx/gr_gr_cog/miscellanea:misc.Ode8
ltx/gr_gr_cog/me.m12.d11:meMA.Ode8H.text	@ltx/gr_gr_cog/he.h.m8:heHE.EptaplasiosKaminon.text
ltx/gr_gr_cog/me.m12.d11:meMA.Ode9C11.greekmelody	@ltx/gr_gr_cog/he.h.m8:heHE.EfrixePasaAkoi.greekname
ltx/gr_gr_cog/me.m12.d11:meMA.Ode9C11.incipit	Ἰδοὺ σοι πύλαι οὐρανῶν, μεταστάντι…
ltx/gr_gr_cog/me.m12.d11:meMA.Ode9C11.melody	@ltx/gr_gr_cog/he.h.m8:heHE.EfrixePasaAkoi.name
ltx/gr_gr_cog/me.m12.d11:meMA.Ode9C11.mode	@ltx/gr_gr_cog/miscellanea:misc.Mode8
ltx/gr_gr_cog/me.m12.d11:meMA.Ode9C11.ode	@ltx/gr_gr_cog/miscellanea:misc.Ode9
ltx/gr_gr_cog/me.m12.d11:meMA.Ode9C11.text	Ἰδοὺ σοι πύλαι οὐρανῶν, μεταστάντι καὶ τὸν δρόμον τελέσαντι, Πάτερ ἠνοίχθησαν, καὶ τῶν Ἀγγέλων τάξεις ἐδέξαντο· ὁ στεφοδότης δὲ Χριστός, δόξῃ ἐστεφάνωσε, δικαιοσύνης σε· ὃν ὑμνοῦντες οἱ πιστοὶ μεγαλύνομεν.
ltx/gr_gr_cog/me.m12.d11:meMA.Ode9C12.incipit	Ὡς κρίνον Πάτερ τοῦ ἀγροῦ…
ltx/gr_gr_cog/me.m12.d11:meMA.Ode9C12.melody	@ltx/gr_gr_cog/he.h.m8:heHE.EfrixePasaAkoi.name
ltx/gr_gr_cog/me.m12.d11:meMA.Ode9C12.mode	@ltx/gr_gr_cog/miscellanea:misc.Mode8
ltx/gr_gr_cog/me.m12.d11:meMA.Ode9C12.ode	@ltx/gr_gr_cog/miscellanea:misc.Ode9
ltx/gr_gr_cog/me.m12.d11:meMA.Ode9C12.text	Ὡς κρίνον Πάτερ τοῦ ἀγροῦ, ἐν λειμῶνι τῆς ἀθλήσεως ἤνθησας, καὶ ὡς κυπάρισσος, εἰς ὕψος ἤρθης τῆς τελειότητος, ὡσεὶ ἐλαία ψαλμικῶς ἐφάνης τὰ πρόσωπα, καὶ τὰς καρδίας ἡμῶν, ἱλαρύνων τῷ ἐλαίῳ τῶν πόνων σου.
ltx/gr_gr_cog/me.m12.d11:meMA.Ode9C13.incipit	Στῦλόν σε βάσει ἀρετῶν, στηριζόμενον…
ltx/gr_gr_cog/me.m12.d11:meMA.Ode9C13.melody	@ltx/gr_gr_cog/he.h.m8:heHE.EfrixePasaAkoi.name
ltx/gr_gr_cog/me.m12.d11:meMA.Ode9C13.mode	@ltx/gr_gr_cog/miscellanea:misc.Mode8
ltx/gr_gr_cog/me.m12.d11:meMA.Ode9C13.ode	@ltx/gr_gr_cog/miscellanea:misc.Ode9
ltx/gr_gr_cog/me.m12.d11:meMA.Ode9C13.text	Στῦλόν σε βάσει ἀρετῶν, στηριζόμενον ἡ κτίσις ἐγνώρισε, πύργον ἀκλόνητον, θαυμάτων βρύσιν, λιμένα εὔδιον, τῶν ἰαμάτων θησαυρόν, δοχεῖον τοῦ Πνεύματος· διό σου σήμερον, Δανιὴλ ἐπιτελεῖ τὸ μνημόσυνον.
ltx/gr_gr_cog/me.m12.d11:meMA.Ode9C14.incipit	Ἡλίου σήμερον ἡμῖν, ἐξανέτειλε φαιδρότερον…
ltx/gr_gr_cog/me.m12.d11:meMA.Ode9C14.melody	@ltx/gr_gr_cog/he.h.m8:heHE.EfrixePasaAkoi.name
ltx/gr_gr_cog/me.m12.d11:meMA.Ode9C14.mode	@ltx/gr_gr_cog/miscellanea:misc.Mode8
ltx/gr_gr_cog/me.m12.d11:meMA.Ode9C14.ode	@ltx/gr_gr_cog/miscellanea:misc.Ode9
ltx/gr_gr_cog/me.m12.d11:meMA.Ode9C14.text	Ἡλίου σήμερον ἡμῖν, ἐξανέτειλε φαιδρότερον Ὅσιε, ἡ θεία μνήμη σου, πιστῶν καρδίας καταφωτίζουσα, δικαιοσύνης τῷ φωτὶ ζόφον δὲ διώκουσα, τῶν ψυχοφθόρων παθῶν, ἣν τελοῦντες εὐσεβῶς ἀνυμνοῦμέν σε.
ltx/gr_gr_cog/me.m12.d11:meMA.Ode9C1T.incipit	Φεῖσαί μου Σῶτερ ὁ τεχθείς…
ltx/gr_gr_cog/me.m12.d11:meMA.Ode9C1T.melody	@ltx/gr_gr_cog/he.h.m8:heHE.EfrixePasaAkoi.name
ltx/gr_gr_cog/me.m12.d11:meMA.Ode9C1T.mode	@ltx/gr_gr_cog/miscellanea:misc.Mode8
ltx/gr_gr_cog/me.m12.d11:meMA.Ode9C1T.ode	@ltx/gr_gr_cog/miscellanea:misc.Ode9
ltx/gr_gr_cog/me.m12.d11:meMA.Ode9C1T.text	Φεῖσαί μου Σῶτερ ὁ τεχθείς, καὶ φυλάξας τὴν τεκοῦσάν σε ἄφθορον, μετὰ τὴν κύησιν, ὅταν καθίσῃς κρῖναι τὰ ἔργα μου, τὰς ἀνομίας παρορῶν, καὶ τὰς ἁμαρτίας μου, ὡς ἀναμάρτητος, ἐλεήμων ὡς Θεὸς καὶ φιλάνθρωπος.
ltx/gr_gr_cog/me.m12.d11:meMA.Ode9H.greekmelody	@ltx/gr_gr_cog/he.h.m8:heHE.EfrixePasaAkoi.greekname
ltx/gr_gr_cog/me.m12.d11:meMA.Ode9H.incipit	@ltx/gr_gr_cog/he.h.m8:heHE.EfrixePasaAkoi.incipit
ltx/gr_gr_cog/me.m12.d11:meMA.Ode9H.melody	@ltx/gr_gr_cog/he.h.m8:heHE.EfrixePasaAkoi.melody
ltx/gr_gr_cog/me.m12.d11:meMA.Ode9H.mode	@ltx/gr_gr_cog/miscellanea:misc.Mode8
ltx/gr_gr_cog/me.m12.d11:meMA.Ode9H.ode	@ltx/gr_gr_cog/miscellanea:misc.Ode9
ltx/gr_gr_cog/me.m12.d11:meMA.Ode9H.text	@ltx/gr_gr_cog/he.h.m8:heHE.EfrixePasaAkoi.text
ltx/gr_gr_cog/me.m12.d11:meMA.Oikos1.text	Ἡ ᾠδὴ ῥυπαρὰ πρὸς τὴν αἴνεσιν, τῶν ἀγώνων σου Πάτερ πέφυκεν· οὐ γὰρ ἔχω ἁγνὴν τὴν καρδίαν μου· καὶ γὰρ ταύτην αἰσχρῶς κατεμόλυνα, ἀλλά μοι δίδου λόγον Ἅγιε, καθαρῶς ἀνυμνῆσαι τὴν σὴν πολιτείαν, ἣν ἐθαύμασαν ὄντως καὶ Ἄγγελοι· καὶ γὰρ γέγονας ὥσπερ ἀσώματος, εἰληφὼς τὸ ἄδυτον φῶς τῆς γνώσεως.
ltx/gr_gr_cog/me.m12.d11:meVE.GeneralApolytikion1.melody	@ltx/gr_gr_cog/he.ga:heGA.YpomonisStylos.name
ltx/gr_gr_cog/me.m12.d11:meVE.GeneralApolytikion1.mode	@ltx/gr_gr_cog/miscellanea:misc.Mode1
ltx/gr_gr_cog/me.m12.d11:meVE.GeneralApolytikion1.name	Δανιὴλ
ltx/gr_gr_cog/me.m12.d11:meVE.MM.GeneralApolytikion1.text	
ltx/gr_gr_cog/me.m12.d11:meVE.SticGlory.incipit	Τὸ ἐμπιστευθέν σοι τάλαντον παρὰ…
ltx/gr_gr_cog/me.m12.d11:meVE.SticGlory.melody	
ltx/gr_gr_cog/me.m12.d11:meVE.SticGlory.mode	@ltx/gr_gr_cog/miscellanea:misc.Mode5
ltx/gr_gr_cog/me.m12.d11:meVE.SticGlory.poet	@ltx/gr_gr_cog/poets:po.Stouditou
ltx/gr_gr_cog/me.m12.d11:meVE.SticGlory.text	Τὸ ἐμπιστευθέν σοι τάλαντον παρὰ Χριστοῦ, καλῶς ἐργασάμενος Ὅσιε Πάτερ, ἀνεδείχθης καὶ μετὰ θάνατον, δαιμόνων φυγαδευτής, καὶ ἰατὴρ ποικίλων ἀῤῥωστημάτων, στῦλος καὶ ἑδραίωμα, καὶ ὄρος Ἅγιον, τῆς Ἐκκλησίας τοῦ Χριστοῦ· διό σε ἱκετεύομεν, Δανιὴλ θαυματουργέ, τὴν εἰρήνην αἴτησαι, καὶ ταῖς ψυχαῖς ἡμῶν, τὸ μέγα ἔλεος.
ltx/gr_gr_cog/me.m12.d11:meVE.SticStavrotheotokion.greekmelody	@ltx/gr_gr_cog/he.a.m5:heAU.ChairoisAskitikon.greekname
ltx/gr_gr_cog/me.m12.d11:meVE.SticStavrotheotokion.incipit	Πάθος σου τὸ σεπτὸν ἡ…
ltx/gr_gr_cog/me.m12.d11:meVE.SticStavrotheotokion.melody	@ltx/gr_gr_cog/he.a.m5:heAU.ChairoisAskitikon.name
ltx/gr_gr_cog/me.m12.d11:meVE.SticStavrotheotokion.mode	@ltx/gr_gr_cog/miscellanea:misc.Mode5
ltx/gr_gr_cog/me.m12.d11:meVE.SticStavrotheotokion.text	Πάθος σου τὸ σεπτὸν ἡ σεμνή, καὶ πανυπέραγνός σου Μήτηρ Μακρόθυμε, παντάναξ ἑωρακυῖα, δακρυῤῥοοῦσα πικρῶς, καὶ τὰ στήθη τύπτουσα ἐκραύγαζεν· Ἰησοῦ μου γλυκύτατε, πρόσφθεγμά μοι σωτήριον, φῶς παντὸς κόσμου, θεῖε Ἥλιε ἄδυτε, πῶς ἐν ξύλῳ σε, σταυρικῷ νῦν κρεμάμενον· οἷα κακοῦργον βλέπουσα, καὶ λόγχῃ τὴν ἄχραντον, φεῦ μοι! πλευρὰν τετρωμένον, καθυπομείνω καὶ ζήσομαι, Υἱὲ καὶ Θεέ μου, εἰμὴ λάμψει μοι τὸ φῶς σου τῆς ἀναστάσεως;
ltx/gr_gr_cog/me.m12.d11:meVE.SticTheotokion.incipit	Ἡ Κεχαριτωμένη…
ltx/gr_gr_cog/me.m12.d11:meVE.SticTheotokion.melody	Ἡ Κεχαριτωμένη
ltx/gr_gr_cog/me.m12.d11:meVE.SticTheotokion.mode	@ltx/gr_gr_cog/miscellanea:misc.Mode5
ltx/gr_gr_cog/me.m12.d11:meVE.SticTheotokion.text	Ἡ Κεχαριτωμένη, μεσίτευσον σαῖς δεήσεσι, καὶ αἴτησαι ταῖς ψυχαῖς ἡμῶν, πλῆθος οἰκτιρμῶν, καὶ τὸν ἱλασμόν, τῶν πολλῶν παραπτωμάτων δεόμεθα.
ltx/gr_gr_cog/me.m12.d11:meVE.Stichera01.greekmelody	@ltx/gr_gr_cog/he.a.m8:heAU.TiYmasKalesomen.greekname
ltx/gr_gr_cog/me.m12.d11:meVE.Stichera01.incipit	Τί σε Δανιὴλ ὀνομάσωμεν; ἀσκητήν…
ltx/gr_gr_cog/me.m12.d11:meVE.Stichera01.melody	@ltx/gr_gr_cog/he.a.m8:heAU.TiYmasKalesomen.name
ltx/gr_gr_cog/me.m12.d11:meVE.Stichera01.mode	@ltx/gr_gr_cog/miscellanea:misc.Mode8
ltx/gr_gr_cog/me.m12.d11:meVE.Stichera01.text	Τί σε Δανιὴλ ὀνομάσωμεν; ἀσκητήν, ὅτι τὰ πάθη καθυπέταξας τῷ νῷ, Ἀθλητήν, ὅτι πρὸς πᾶσαν ἐκαρτέρησας ποινήν, πρὸς ὕψος, ἀπὸ γῆς στῦλον αἰρόμενον, ἐν πέτρᾳ ἀληθείας ἐρειδόμενον, ἀγωνιστὴν προθυμότατον, καὶ ἰατρὸν ἐμπειρότατον, ἱκέτευε, τοῦ σωθῆναι τὰς ψυχὰς ἡμῶν.
ltx/gr_gr_cog/me.m12.d11:meVE.Stichera02.incipit	Τί σε Δανιὴλ προσφθεγξώμεθα; τῶν…
ltx/gr_gr_cog/me.m12.d11:meVE.Stichera02.melody	@ltx/gr_gr_cog/he.a.m8:heAU.TiYmasKalesomen.name
ltx/gr_gr_cog/me.m12.d11:meVE.Stichera02.mode	@ltx/gr_gr_cog/miscellanea:misc.Mode8
ltx/gr_gr_cog/me.m12.d11:meVE.Stichera02.text	Τί σε Δανιὴλ προσφθεγξώμεθα; τῶν παθῶν ἐκριζωτήν, καὶ φυτοκόμον ἀρετῶν, ἀληθῆ θαυματουργόν, καὶ πρεσβευτὴν ἁμαρτωλῶν, πνευμάτων ἐλατῆρα γενναιότατον, φωστῆρα εὐσεβείᾳ διαλάμποντα, τοῦ Πνεύματος καταγώγιον· τῆς Ἐκκλησίας ὑπέρμαχον, ἱκέτευε, τοῦ σωθῆναι τὰς ψυχὰς ἡμῶν.
ltx/gr_gr_cog/me.m12.d11:meVE.Stichera03.incipit	Τί σε Δανιὴλ νῦν καλέσωμεν…
ltx/gr_gr_cog/me.m12.d11:meVE.Stichera03.melody	@ltx/gr_gr_cog/he.a.m8:heAU.TiYmasKalesomen.name
ltx/gr_gr_cog/me.m12.d11:meVE.Stichera03.mode	@ltx/gr_gr_cog/miscellanea:misc.Mode8
ltx/gr_gr_cog/me.m12.d11:meVE.Stichera03.text	Τί σε Δανιὴλ νῦν καλέσωμεν; Μοναστῶν ὑπογραμμόν, καὶ ἐγκρατείας παιδευτήν, ἐγκαλλώπισμα πιστῶν, καὶ ἰαμάτων αὐτουργόν, λυχνίαν, τοῖς ἐν σκότει φῶς αὐγάζουσαν, Ἀγγέλων συμπολίτην καὶ ἰσότιμον, τοῦ Παραδείσου οἰκήτορα, καὶ ἐπουράνιον ἄνθρωπον, ἱκέτευε, τοῦ σωθῆναι τὰς ψυχὰς ἡμῶν.
