ltx/gr_gr_cog/le.ep.mc.d273:lemcLI.Epistle.book_abbr	@ltx/gr_gr_cog/bible:Corinthians2.abbr
ltx/gr_gr_cog/le.ep.mc.d273:lemcLI.Epistle.book_string	@ltx/gr_gr_cog/bible:Corinthians2.text
ltx/gr_gr_cog/le.ep.mc.d273:lemcLI.Epistle.chapverse	5:1 – 10
ltx/gr_gr_cog/le.ep.mc.d273:lemcLI.Epistle.incipit	Οἴδαμεν ὅτι ἐὰν ἡ ἐπίγειος ἡμῶν οἰκία…
ltx/gr_gr_cog/le.ep.mc.d273:lemcLI.Epistle.text	Ἀδελφοί, οἴδαμεν ὅτι ἐὰν ἡ ἐπίγειος ἡμῶν οἰκία τοῦ σκήνους καταλυθῇ, οἰκοδομὴν ἐκ Θεοῦ ἔχομεν, οἰκίαν ἀχειροποίητον αἰώνιον ἐν τοῖς οὐρανοῖς. καὶ γὰρ ἐν τούτῳ στενάζομεν, τὸ οἰκητήριον ἡμῶν τὸ ἐξ οὐρανοῦ ἐπενδύσασθαι ἐπιποθοῦντες, εἴ γε καὶ ἐνδυσάμενοι οὐ γυμνοὶ εὑρεθησόμεθα. καὶ γὰρ οἱ ὄντες ἐν τῷ σκήνει στενάζομεν, βαρούμενοι ἐφ᾽ ᾧ οὐ θέλομεν ἐκδύσασθαι, ἀλλ᾿ ἐπενδύσασθαι, ἵνα καταποθῇ τὸ θνητὸν ὑπὸ τῆς ζωῆς. ὁ δὲ κατεργασάμενος ἡμᾶς εἰς αὐτὸ τοῦτο Θεός, ὁ καὶ δοὺς ἡμῖν τὸν ἀρραβῶνα τοῦ Πνεύματος. Θαρροῦντες οὖν πάντοτε καὶ εἰδότες ὅτι ἐνδημοῦντες ἐν τῷ σώματι ἐκδημοῦμεν ἀπὸ τοῦ Κυρίου· διὰ πίστεως γὰρ περιπατοῦμεν, οὐ διὰ εἴδους· — θαρροῦμεν δὲ καὶ εὐδοκοῦμεν μᾶλλον ἐκδημῆσαι ἐκ τοῦ σώματος καὶ ἐνδημῆσαι πρὸς τὸν Κύριον. διὸ καὶ φιλοτιμούμεθα, εἴτε ἐνδημοῦντες εἴτε ἐκδημοῦντες, εὐάρεστοι αὐτῷ εἶναι. τοὺς γὰρ πάντας ἡμᾶς φανερωθῆναι δεῖ ἔμπροσθεν τοῦ βήματος τοῦ Χριστοῦ.
ltx/gr_gr_cog/le.ep.mc.d273:lemcLI.Epistle.title	Τῷ Σαββάτῳ τῆς ΚΒʹ Ἑβδομάδος
ltx/gr_gr_cog/le.ep.mc.d273:lemcLI.Epistle.title_abbr	Σαββάτῳ τῆς ΚΒʹ Ἑβδομάδος
ltx/gr_gr_cog/le.ep.mc.d273:lemcLI.Epistle.version	@ltx/gr_gr_cog/properties:version.designation
