ltx/gr_gr_cog/sy.m03.d01:cl.syMA.commemoration01.text	[saint/com 1]
ltx/gr_gr_cog/sy.m03.d01:cl.syMA.commemoration02.text	[saint/com 2]
ltx/gr_gr_cog/sy.m03.d01:cl.syMA.commemoration03.text	[saint/com 3]
ltx/gr_gr_cog/sy.m03.d01:cl.syMA.commemoration04.text	[saint/com 4]
ltx/gr_gr_cog/sy.m03.d01:cl.syMA.commemoration05.text	[saint/com 5]
ltx/gr_gr_cog/sy.m03.d01:cl.syMA.commemoration06.text	[saint/com list]
ltx/gr_gr_cog/sy.m03.d01:syMA.commemoration01.couplet1.title	@ltx/gr_gr_cog/titles:ti.Verses
ltx/gr_gr_cog/sy.m03.d01:syMA.commemoration01.couplet1.verse1	Ἡ Σαμαρεῖτις οὐχ ὕδωρ Εὐδοκία,
ltx/gr_gr_cog/sy.m03.d01:syMA.commemoration01.couplet1.verse2	Ἀλλʼ αἷμα, Σῶτερ, ἐκ τραχήλου σοι φέρει.
ltx/gr_gr_cog/sy.m03.d01:syMA.commemoration01.narration.p01	Αὕτη ἦν ἐξ Ἡλιουπόλεως τῆς ἐπαρχίας Λιβανησίας τῆς Φοινίκης, κατὰ τοὺς καιροὺς τῆς βασιλείας Τραϊανοῦ, ἐν ἀκολασίᾳ τὸ πρῶτον βιοῦσα, καὶ πολλοὺς ἐραστὰς τῇ εὐπρεπείᾳ τῆς ὄψεως ἐπισυρομένη, καὶ πλοῦτον πολὺν συναθροίσασα. Ὕστερον δὲ προσῆλθε τῷ Χριστῷ, Γερμανοῦ τινος Μοναχοῦ, τοὺς περὶ εὐσεβείας καὶ μετανοίας λόγους διεξιόντος, ἀκούσασα. Βαπτίζεται οὗν ὑπὸ Ἐπισκόπου Θεοδότου, ἀποκαλύψεσι θείαις πεισθεῖσα· καὶ γὰρ ἔδοξεν ἐκστᾶσα ἑαυτὴν ὑπὸ Ἀγγέλου χειραγωγουμένην, εἰς οὐρανοὺς ἀνελθεῖν, καὶ τοὺς Ἀγγέλους συγχαίρειν αὐτῇ τῆς ἐπιστροφῆς, καὶ μέλανά τινα, καὶ τῇ ὄψει δεινόν, βρύχειν καὶ καταβοᾶν, ὡς ἀδικούμενον, εἰ ταύτην ἀφαιρεθείη.
ltx/gr_gr_cog/sy.m03.d01:syMA.commemoration01.narration.p02	Διανείμασα δὲ τὸν πλοῦτον αὑτῆς, καὶ διαδοῦσα πτωχοῖς, ἄπεισιν ἐν μοναστηρίῳ· καὶ καλῶς τὸν δρόμον τῆς ἀσκήσεως διερχομένη, προσάγεται Αὐρηλιανῷ τῆς βασιλείας κρατήσαντι, ὑπὸ τῶν πρώην αὐτῆς ἐραστῶν. Θαυματουργήσασα δέ, καὶ τὸν τοῦ Βασιλέως παῖδα τεθνηκότα ἐγείρασα, πρὸς τὴν εἰς Χριστὸν πίστιν ἐπισπᾶται τὸν Βασιλέα. Χρόνοις δὲ ὕστερον ἐξετάζεται παρὰ Διογένους τοῦ Ἡγεμόνος Ἡλιουπόλεως, καὶ θαυματουργήσασα πάλιν, ἀφίεται. Ὑπὸ δὲ Βικεντίου, τοῦ διαδεξαμένου τὸν Διογένην, ξίφει τὴν κεφαλὴν ἀφαιρεῖται.
ltx/gr_gr_cog/sy.m03.d01:syMA.commemoration01.single1	Μαρτίου ἀμφὶ πρώτῃ ἡ Εὐδοκία ξίφος ἔτλη.
ltx/gr_gr_cog/sy.m03.d01:syMA.commemoration01.text	Τῇ Αʹ τοῦ αὐτοῦ μηνός, μνήμη τῆς Ἁγίας Ὁσιομάρτυρος Εὐδοκίας τῆς ἀπὸ Σαμαρειτῶν.
ltx/gr_gr_cog/sy.m03.d01:syMA.commemoration02.couplet1.title	@ltx/gr_gr_cog/titles:ti.Verses
ltx/gr_gr_cog/sy.m03.d01:syMA.commemoration02.couplet1.verse1	Τῶν ἀρετῶν φέρουσα φόρτους Δομνίνα,
ltx/gr_gr_cog/sy.m03.d01:syMA.commemoration02.couplet1.verse2	Θεῷ προσῆλθεν ἔμπορος πανολβία.
ltx/gr_gr_cog/sy.m03.d01:syMA.commemoration02.narration.p01	Αὕτη ἔφυ γονέων εὐσεβῶν καὶ πλουσίων. Ἐκ βρέφους δὲ τῷ Θεῷ ἑαυτὴν ἀναθεῖσα, ἀσκήσει καὶ λοιπῇ κακουχίᾳ τοῦ σώματος ἑαυτὴν ἐκδέδωκε. Καλύβην γὰρ πηξαμένη παρὰ τῷ τῆς μητρὸς κήπῳ, ἐν ἐκείνῃ διημέρευε, δάκρυσι διηνεκέσιν οὐ μόνον τὰς παρειὰς καταβρέχουσα, ἀλλὰ καὶ τὰ ἐκ τριχῶν περιβλήματα· τοιοῖς δὲ γὰρ ἐσθήμασιν ἐχρῆτο. Περὶ δὲ ἀλεκτρυόνων ᾠδὰς εἰς τὸν θεῖον ναὸν εἰσιοῦσα μετὰ τοῦ πλήθους παντός, τῷ Δεσπότῃ τῶν ὅλων προσέφερε τὴν ὑμνωδίαν. Τροφὴν δὲ εἶχε φακόν, βρεχόμενον ὕδατι· καὶ τοῦτον ἅπαντα τὸν πόνον ὑπέμενε, σώματι λεπτῷ καὶ ἡμιθνήτῳ χρωμένη. Ἀκριβῶς δὲ τῷ περιβολαίῳ κρυπτομένη, οὔτε τινὸς ἐθεάσατο πρόσωπον, οὔτε τις τὸ ἑαυτῆς, ἀλλὰ καὶ μέχρι τῶν γονάτων καλυπτομένη, λεπτὰ καὶ ἄσημα τοῖς προστυχοῦσι διελέγετο. Ἐν τούτοις διημερεύουσα καὶ διανυκτερεύουσα, πρὸς τὸν ἑαυτῆς ἐραστὴν καὶ νυμφίον Χριστόν, μετὰ τῶν θεαρέστων αὑτῆς κατορθωμάτων, ἀναφέρεται.
ltx/gr_gr_cog/sy.m03.d01:syMA.commemoration02.text	Τῇ αὐτῇ ἡμέρᾳ, μνήμη τῆς Ἁγίας Δομνίνης, καὶ τῶν σὺν αὐτῇ.
ltx/gr_gr_cog/sy.m03.d01:syMA.commemoration03.couplet1.title	@ltx/gr_gr_cog/titles:ti.Verses
ltx/gr_gr_cog/sy.m03.d01:syMA.commemoration03.couplet1.verse1	Θάλαμος ἡ θάλασσα νυμφικὸς γίνῃ,
ltx/gr_gr_cog/sy.m03.d01:syMA.commemoration03.couplet1.verse2	Ἀντωνίναν κρύπτουσα νύμφην Κυρίου.
ltx/gr_gr_cog/sy.m03.d01:syMA.commemoration03.text	Τῇ αὐτῇ ἡμέρᾳ, μνήμη τῆς Ἁγίας Αντωνίνης.
ltx/gr_gr_cog/sy.m03.d01:syMA.commemoration04.couplet1.title	@ltx/gr_gr_cog/titles:ti.Verses
ltx/gr_gr_cog/sy.m03.d01:syMA.commemoration04.couplet1.verse1	Χώνη τις ἡ κάμινος Ἀθληταῖς δύο,
ltx/gr_gr_cog/sy.m03.d01:syMA.commemoration04.couplet1.verse2	Οἳ χρυσίου λάμπουσιν ἐν ταύτῃ πλέον.
ltx/gr_gr_cog/sy.m03.d01:syMA.commemoration04.text	Τῇ αὐτῇ ἡμέρᾳ, οἱ Ἅγιοι Μάρκελλος καὶ Ἀντώνιος πυρὶ τελειοῦνται.
ltx/gr_gr_cog/sy.m03.d01:syMA.commemoration05.couplet1.title	@ltx/gr_gr_cog/titles:ti.Verses
ltx/gr_gr_cog/sy.m03.d01:syMA.commemoration05.couplet1.verse1	Οὐ καρτερῶν, Σίλβεστρε, θρησκεύειν πλάνην,
ltx/gr_gr_cog/sy.m03.d01:syMA.commemoration05.couplet1.verse2	Σωφρονίῳ τὴν τομὴν ἐκαρτέρεις.
ltx/gr_gr_cog/sy.m03.d01:syMA.commemoration05.text	Τῇ αὐτῇ ἡμέρᾳ, οἱ Ἅγιοι Μάρτυρες Σίλβεστρος καὶ Σωφρόνιος ξίφει τελειοῦνται.
ltx/gr_gr_cog/sy.m03.d01:syMA.commemoration06.couplet1.title	@ltx/gr_gr_cog/titles:ti.Verses
ltx/gr_gr_cog/sy.m03.d01:syMA.commemoration06.couplet1.verse1	Εἰς τοὐπίσω τράχηλον ἐξειλκυσμένος,
ltx/gr_gr_cog/sy.m03.d01:syMA.commemoration06.couplet1.verse2	Νεστοριανὸς τὴν σφαγὴν πρόσω φέρει.
ltx/gr_gr_cog/sy.m03.d01:syMA.commemoration06.text	Τῇ αὐτῇ ἡμέρᾳ, ὁ Ἅγιος Νεστοριανὸς ξίφει τελειοῦται.
ltx/gr_gr_cog/sy.m03.d01:syMA.lastline	Ταῖς τῶν Ἁγίων σου πρεσβείαις, ὁ Θεὸς ἐλέησον ἡμᾶς. Ἀμήν.
