ltx/gr_gr_cog/me.m06.d16:meDA.commemoration.first	Μνήμη τοῦ Ἁγίου Τύχωνος, Ἐπισκόπου Ἀμαθοῦντος
ltx/gr_gr_cog/me.m06.d16:meDA.commemoration.first_name	
ltx/gr_gr_cog/me.m06.d16:meDA.commemoration.first_short	Μνήμη τοῦ Ἁγίου Τύχωνος, Ἐπισκόπου Ἀμαθοῦντος
ltx/gr_gr_cog/me.m06.d16:meDA.commemoration.first_title	@ltx/gr_gr_cog/titles:ti.SaintM
ltx/gr_gr_cog/me.m06.d16:meDA.commemoration.full	Μνήμη τοῦ Ἁγίου Πατρὸς ἡμῶν Τύχωνος, Ἐπισκόπου Ἀμαθοῦντος τῆς Κύπρου
ltx/gr_gr_cog/me.m06.d16:meDA.commemoration.second_name	
ltx/gr_gr_cog/me.m06.d16:meDA.commemoration.second_title	
ltx/gr_gr_cog/me.m06.d16:meDA.date	Τῌ ΙϚʹ ΙΟΥΝΙΟΥ
ltx/gr_gr_cog/me.m06.d16:meDA.dismissal	
ltx/gr_gr_cog/me.m06.d16:meDA.fordate	διὰ τὴν 16ην Ἰουνίου
ltx/gr_gr_cog/me.m06.d16:meDA.insert1	καὶ τοῦ Ἁγίου Πατρὸς ἡμῶν Τύχωνος, Ἐπισκόπου Ἀμαθοῦντος τῆς Κύπρου,
ltx/gr_gr_cog/me.m06.d16:meDA.insert2	οὗ καὶ τὴν μνήμην ἐπιτελοῦμεν·
ltx/gr_gr_cog/me.m06.d16:meDA.note	
ltx/gr_gr_cog/me.m06.d16:meDA.pdfcoverdate	τῆς 16ης Ἰουνίου,
ltx/gr_gr_cog/me.m06.d16:meDA.pdfheaderdate	τῆς 16ης Ἰουνίου
ltx/gr_gr_cog/me.m06.d16:meHO.commemorations	
ltx/gr_gr_cog/me.m06.d16:meHO.note1	
ltx/gr_gr_cog/me.m06.d16:meHO.note2	
ltx/gr_gr_cog/me.m06.d16:meHO.number	
ltx/gr_gr_cog/me.m06.d16:meHO.rank	
ltx/gr_gr_cog/me.m06.d16:meLE.commemoration1	Μνήμη τοῦ Ἁγίου Πατρὸς ἡμῶν Τύχωνος, Ἐπισκόπου Ἀμαθοῦντος τῆς Κύπρου.
ltx/gr_gr_cog/me.m06.d16:meLE.commemoration2	
ltx/gr_gr_cog/me.m06.d16:meLI.Kontakion1.incipit	…
ltx/gr_gr_cog/me.m06.d16:meLI.Kontakion1.melody	
ltx/gr_gr_cog/me.m06.d16:meLI.Kontakion1.mode	
ltx/gr_gr_cog/me.m06.d16:meLI.Kontakion1.text	
ltx/gr_gr_cog/me.m06.d16:meLI.MM.CommunionHymn.text	@ltx/gr_gr_cog/properties:media.key
ltx/gr_gr_cog/me.m06.d16:meLI.Megalynarion.text	
ltx/gr_gr_cog/me.m06.d16:meMA.C1.acrostic.notice1	οὗ ἡ Ἀκροστιχίς·
ltx/gr_gr_cog/me.m06.d16:meMA.C1.acrostic.text	Τῷ θαυματουργῷ προσλαλήσω ποιμένι. Ἰωσήφ.
ltx/gr_gr_cog/me.m06.d16:meMA.C1.acrostic.title	Ὁ Κανὼν τοῦ Ἁγίου,
ltx/gr_gr_cog/me.m06.d16:meMA.C1.title	@ltx/gr_gr_cog/titles:ti.CanonSaintM
ltx/gr_gr_cog/me.m06.d16:meMA.C1.verse	@ltx/gr_gr_cog/prayers:pr.verse_SaintM.text
ltx/gr_gr_cog/me.m06.d16:meMA.Ode1C11.greekmelody	@ltx/gr_gr_cog/he.h.m4:heHE.TristatasKrataious.greekname
ltx/gr_gr_cog/me.m06.d16:meMA.Ode1C11.incipit	Τῷ θρόνῳ τοῦ Θεοῦ, παρεστὼς…
ltx/gr_gr_cog/me.m06.d16:meMA.Ode1C11.melody	@ltx/gr_gr_cog/he.h.m4:heHE.TristatasKrataious.name
ltx/gr_gr_cog/me.m06.d16:meMA.Ode1C11.mode	@ltx/gr_gr_cog/miscellanea:misc.Mode4
ltx/gr_gr_cog/me.m06.d16:meMA.Ode1C11.ode	@ltx/gr_gr_cog/miscellanea:misc.Ode1
ltx/gr_gr_cog/me.m06.d16:meMA.Ode1C11.text	Τῷ θρόνῳ τοῦ Θεοῦ, παρεστὼς στεφηφόρος, ὡς βιώσας ἐπὶ γῆς, ὁσίως καὶ φωτί, ἀνεσπέρῳ λαμπόμενος, φώτισόν μου τὴν καρδίαν, καὶ τὸν νοῦν ἀνυμνῆσαί σου, τὸν ἰσάγγελον βίον Μακάριε.
ltx/gr_gr_cog/me.m06.d16:meMA.Ode1C12.incipit	Ὡράθης εὐκλεοῦς, μακαρίας τε ῥίζης…
ltx/gr_gr_cog/me.m06.d16:meMA.Ode1C12.melody	@ltx/gr_gr_cog/he.h.m4:heHE.TristatasKrataious.name
ltx/gr_gr_cog/me.m06.d16:meMA.Ode1C12.mode	@ltx/gr_gr_cog/miscellanea:misc.Mode4
ltx/gr_gr_cog/me.m06.d16:meMA.Ode1C12.ode	@ltx/gr_gr_cog/miscellanea:misc.Ode1
ltx/gr_gr_cog/me.m06.d16:meMA.Ode1C12.text	Ὡράθης εὐκλεοῦς, μακαρίας τε ῥίζης, ἐκβλαστάνων ἱερῶς, ὡς κλάδος ἀληθῶς, εὐκαρπίας πληρούμενος, πίστεώς τε καὶ ἐλπίδος, καὶ ἀγάπης καὶ χάριτος, παραδόξων θαυμάτων θεόπνευστε.
ltx/gr_gr_cog/me.m06.d16:meMA.Ode1C13.incipit	Θυσίαν σεαυτόν, καθαρὰν καὶ τελείαν…
ltx/gr_gr_cog/me.m06.d16:meMA.Ode1C13.melody	@ltx/gr_gr_cog/he.h.m4:heHE.TristatasKrataious.name
ltx/gr_gr_cog/me.m06.d16:meMA.Ode1C13.mode	@ltx/gr_gr_cog/miscellanea:misc.Mode4
ltx/gr_gr_cog/me.m06.d16:meMA.Ode1C13.ode	@ltx/gr_gr_cog/miscellanea:misc.Ode1
ltx/gr_gr_cog/me.m06.d16:meMA.Ode1C13.text	Θυσίαν σεαυτόν, καθαρὰν καὶ τελείαν, τῷ τυθέντι διʼ ἡμᾶς, προσήγαγες Χριστῷ, τὰ ψυχὴν ἀποκτείνοντα, πάθη ἐναπονεκρώσας, διὰ πόνων ἀσκήσεως, ἐπιμόνου τε Πάτερ δεήσεως.
ltx/gr_gr_cog/me.m06.d16:meMA.Ode1C1T.incipit	Ἀνώρθωσας ἡμᾶς, ἀπωλείας εἰς βάθη…
ltx/gr_gr_cog/me.m06.d16:meMA.Ode1C1T.melody	@ltx/gr_gr_cog/he.h.m4:heHE.TristatasKrataious.name
ltx/gr_gr_cog/me.m06.d16:meMA.Ode1C1T.mode	@ltx/gr_gr_cog/miscellanea:misc.Mode4
ltx/gr_gr_cog/me.m06.d16:meMA.Ode1C1T.ode	@ltx/gr_gr_cog/miscellanea:misc.Ode1
ltx/gr_gr_cog/me.m06.d16:meMA.Ode1C1T.text	Ἀνώρθωσας ἡμᾶς, ἀπωλείας εἰς βάθη, πεπτωκότας τὸν Χριστόν, κυήσασα Ἁγνή, ἐξ ἀχράντων λαγόνων σου, τοῦτον οὖν ὡς παῤῥησίαν, κεκτημένη ἱκέτευε, λυτρωθῆναι κινδύνων τοὺς δούλους σου.
ltx/gr_gr_cog/me.m06.d16:meMA.Ode3C11.greekmelody	@ltx/gr_gr_cog/he.h.m4:heHE.OukEnSofia.greekname
ltx/gr_gr_cog/me.m06.d16:meMA.Ode3C11.incipit	Ὕλην κακίας, ἐκτεμὼν τῆς καρδίας…
ltx/gr_gr_cog/me.m06.d16:meMA.Ode3C11.melody	@ltx/gr_gr_cog/he.h.m4:heHE.OukEnSofia.name
ltx/gr_gr_cog/me.m06.d16:meMA.Ode3C11.mode	@ltx/gr_gr_cog/miscellanea:misc.Mode4
ltx/gr_gr_cog/me.m06.d16:meMA.Ode3C11.ode	@ltx/gr_gr_cog/miscellanea:misc.Ode3
ltx/gr_gr_cog/me.m06.d16:meMA.Ode3C11.text	Ὕλην κακίας, ἐκτεμὼν τῆς καρδίας σου πρόῤῥιζον, τῇ δρεπάνῃ τῶν εὐχῶν, ὡς γῆ κατάκαρπος Ὅσιε, στάχυν ἐγεώργησας, ἑκατοστεύοντα.
ltx/gr_gr_cog/me.m06.d16:meMA.Ode3C12.incipit	Μόνα ποθήσας, τὰ πρὸς θείαν…
ltx/gr_gr_cog/me.m06.d16:meMA.Ode3C12.melody	@ltx/gr_gr_cog/he.h.m4:heHE.OukEnSofia.name
ltx/gr_gr_cog/me.m06.d16:meMA.Ode3C12.mode	@ltx/gr_gr_cog/miscellanea:misc.Mode4
ltx/gr_gr_cog/me.m06.d16:meMA.Ode3C12.ode	@ltx/gr_gr_cog/miscellanea:misc.Ode3
ltx/gr_gr_cog/me.m06.d16:meMA.Ode3C12.text	Μόνα ποθήσας, τὰ πρὸς θείαν ζωὴν ὁδηγοῦντά σε, τρίβους Πάτερ δεξιάς, ἀνεπιστρόφως διώδευσας, ἔχων ὁδηγοῦσάν σε, χάριν τοῦ Πνεύματος.
ltx/gr_gr_cog/me.m06.d16:meMA.Ode3C13.incipit	Ἁγίων βίους, ἐμιμήσω θεόφρον ὡς…
ltx/gr_gr_cog/me.m06.d16:meMA.Ode3C13.melody	@ltx/gr_gr_cog/he.h.m4:heHE.OukEnSofia.name
ltx/gr_gr_cog/me.m06.d16:meMA.Ode3C13.mode	@ltx/gr_gr_cog/miscellanea:misc.Mode4
ltx/gr_gr_cog/me.m06.d16:meMA.Ode3C13.ode	@ltx/gr_gr_cog/miscellanea:misc.Ode3
ltx/gr_gr_cog/me.m06.d16:meMA.Ode3C13.text	Ἁγίων βίους, ἐμιμήσω θεόφρον ὡς Ἅγιος, καὶ ἀπάθειαν ψυχῆς, ἐκτήσω Τύχων θεόπνευστε, οἶκος θείου Πνεύματος, ἀποδεικνύμενος.
ltx/gr_gr_cog/me.m06.d16:meMA.Ode3C1T.incipit	Τὸν τῆς Τριάδος, ἀπεκύησας ἕνα…
ltx/gr_gr_cog/me.m06.d16:meMA.Ode3C1T.melody	@ltx/gr_gr_cog/he.h.m4:heHE.OukEnSofia.name
ltx/gr_gr_cog/me.m06.d16:meMA.Ode3C1T.mode	@ltx/gr_gr_cog/miscellanea:misc.Mode4
ltx/gr_gr_cog/me.m06.d16:meMA.Ode3C1T.ode	@ltx/gr_gr_cog/miscellanea:misc.Ode3
ltx/gr_gr_cog/me.m06.d16:meMA.Ode3C1T.text	Τὸν τῆς Τριάδος, ἀπεκύησας ἕνα Πανάμωμε, ἀναπλάττοντα ἡμᾶς, τοὺς συντριβέντας τὸ πρότερον, κακίᾳ τοῦ ὄφεως, τοῦ πολεμήτορος.
ltx/gr_gr_cog/me.m06.d16:meMA.Ode3H.greekmelody	@ltx/gr_gr_cog/he.h.m4:heHE.OukEnSofia.greekname
ltx/gr_gr_cog/me.m06.d16:meMA.Ode3H.incipit	@ltx/gr_gr_cog/he.h.m4:heHE.OukEnSofia.incipit
ltx/gr_gr_cog/me.m06.d16:meMA.Ode3H.melody	@ltx/gr_gr_cog/he.h.m4:heHE.OukEnSofia.melody
ltx/gr_gr_cog/me.m06.d16:meMA.Ode3H.mode	@ltx/gr_gr_cog/miscellanea:misc.Mode4
ltx/gr_gr_cog/me.m06.d16:meMA.Ode3H.ode	@ltx/gr_gr_cog/miscellanea:misc.Ode3
ltx/gr_gr_cog/me.m06.d16:meMA.Ode3H.text	@ltx/gr_gr_cog/he.h.m4:heHE.OukEnSofia.text
ltx/gr_gr_cog/me.m06.d16:meMA.Ode3Kathisma1.greekmelody	@ltx/gr_gr_cog/he.a.m3:heAU.TinOraiotita.greekname
ltx/gr_gr_cog/me.m06.d16:meMA.Ode3Kathisma1.incipit	Τῷ θείῳ μύρῳ σε, ἔχρισεν…
ltx/gr_gr_cog/me.m06.d16:meMA.Ode3Kathisma1.melody	@ltx/gr_gr_cog/he.a.m3:heAU.TinOraiotita.name
ltx/gr_gr_cog/me.m06.d16:meMA.Ode3Kathisma1.mode	@ltx/gr_gr_cog/miscellanea:misc.Mode3
ltx/gr_gr_cog/me.m06.d16:meMA.Ode3Kathisma1.text	Τῷ θείῳ μύρῳ σε, ἔχρισεν Ὅσιε, Πνεῦμα τὸ Ἅγιον, Ἀρχιερέα σαφῶς, λαὸν ποιμάναντα καλῶς, ἐν πάσῃ ὁσιότητι· ὅθεν σε καὶ θαύμασιν, ἱερῶς κατεκόσμησε· νόσους γὰρ ἑκάστοτε, θεραπεύεις τῶν πίστει σου, τοῦ ζῶντος προσιόντων λειψάνοις, Τύχων ἀειμακάριστε.
ltx/gr_gr_cog/me.m06.d16:meMA.Ode3KathismaSt.incipit	Τὸν ἐπονείδιστον, Οἰκτίρμον θάνατον, διὰ…
ltx/gr_gr_cog/me.m06.d16:meMA.Ode3KathismaSt.melody	@ltx/gr_gr_cog/he.a.m3:heAU.TinOraiotita.name
ltx/gr_gr_cog/me.m06.d16:meMA.Ode3KathismaSt.mode	@ltx/gr_gr_cog/miscellanea:misc.Mode3
ltx/gr_gr_cog/me.m06.d16:meMA.Ode3KathismaSt.text	Τὸν ἐπονείδιστον, Οἰκτίρμον θάνατον, διὰ σταυρώσεως, ἑκὼν ὑπέμεινας, ὃν ἡ Τεκοῦσά σε Χριστέ, ὁρῶσα ἐτιτρώσκετο· σπλάγχνα κοπτομένη γάρ, μητρικῶς ἐπωδύρετο· ἧς ταῖς παρακλήσεσι, διὰ σπλάγχνα ἐλέους σου, οἰκτείρησον, καὶ σῶσον τὸν Κόσμον, ὁ αἴρων τὴν τούτου ἁμαρτίαν.
ltx/gr_gr_cog/me.m06.d16:meMA.Ode3KathismaT.incipit	Τὴν νεκρωθεῖσάν μου, ψυχὴν τοῖς…
ltx/gr_gr_cog/me.m06.d16:meMA.Ode3KathismaT.melody	@ltx/gr_gr_cog/he.a.m3:heAU.TinOraiotita.name
ltx/gr_gr_cog/me.m06.d16:meMA.Ode3KathismaT.mode	@ltx/gr_gr_cog/miscellanea:misc.Mode3
ltx/gr_gr_cog/me.m06.d16:meMA.Ode3KathismaT.text	Τὴν νεκρωθεῖσάν μου, ψυχὴν τοῖς πάθεσι, ζώωσον Πάναγνε, μόνη πανάμωμε, ὡς παῤῥησίαν μητρικήν, πρὸς τὸν Υἱόν σου ἔχουσα· σὺ γὰρ μόνη ἔτεκες, ὑπὲρ νοῦν καὶ διάνοιαν, Λόγον τὸν συνάναρχον, τῷ Πατρὶ καὶ τῷ Πνεύματι, ζωὴν καὶ ἀφθαρσίαν τῷ κόσμῳ, διδόντα ἀεὶ καὶ μέγα ἔλεος.
ltx/gr_gr_cog/me.m06.d16:meMA.Ode4C11.greekmelody	@ltx/gr_gr_cog/he.h.m4:heHE.OKathimenosEnDoxi.greekname
ltx/gr_gr_cog/me.m06.d16:meMA.Ode4C11.incipit	Τὸν ἐνάρετόν σου βίον, τὰ…
ltx/gr_gr_cog/me.m06.d16:meMA.Ode4C11.melody	@ltx/gr_gr_cog/he.h.m4:heHE.OKathimenosEnDoxi.name
ltx/gr_gr_cog/me.m06.d16:meMA.Ode4C11.mode	@ltx/gr_gr_cog/miscellanea:misc.Mode4
ltx/gr_gr_cog/me.m06.d16:meMA.Ode4C11.ode	@ltx/gr_gr_cog/miscellanea:misc.Ode4
ltx/gr_gr_cog/me.m06.d16:meMA.Ode4C11.text	Τὸν ἐνάρετόν σου βίον, τὰ περίδοξα θαύματα, τὴν βεβαίαν πίστιν, τὴν ὑπομονὴν τὴν πραότητα, οἱ εὐσεβεῖς καθορῶντες Ἱερέα σε, καὶ ποιμένα σαφῶς προχειρίζονται Ὅσιε.
ltx/gr_gr_cog/me.m06.d16:meMA.Ode4C12.incipit	Οὐκ ἠλάττωται ὁ σῖτος, ἐνδεέσι…
ltx/gr_gr_cog/me.m06.d16:meMA.Ode4C12.melody	@ltx/gr_gr_cog/he.h.m4:heHE.OKathimenosEnDoxi.name
ltx/gr_gr_cog/me.m06.d16:meMA.Ode4C12.mode	@ltx/gr_gr_cog/miscellanea:misc.Mode4
ltx/gr_gr_cog/me.m06.d16:meMA.Ode4C12.ode	@ltx/gr_gr_cog/miscellanea:misc.Ode4
ltx/gr_gr_cog/me.m06.d16:meMA.Ode4C12.text	Οὐκ ἠλάττωται ὁ σῖτος, ἐνδεέσι διδόμενος, τῇ χειρί σου Μάκαρ, μᾶλλον δὲ πλειόνως ηὐλόγηται, τῶν κενωθέντων δοχείων θείᾳ χάριτι, πληρουμένων σαφῶς παναοίδιμε.
ltx/gr_gr_cog/me.m06.d16:meMA.Ode4C13.incipit	Ὑπανοίγων τὴν καρδίαν, συμπαθῶς Τύχων…
ltx/gr_gr_cog/me.m06.d16:meMA.Ode4C13.melody	@ltx/gr_gr_cog/he.h.m4:heHE.OKathimenosEnDoxi.name
ltx/gr_gr_cog/me.m06.d16:meMA.Ode4C13.mode	@ltx/gr_gr_cog/miscellanea:misc.Mode4
ltx/gr_gr_cog/me.m06.d16:meMA.Ode4C13.ode	@ltx/gr_gr_cog/miscellanea:misc.Ode4
ltx/gr_gr_cog/me.m06.d16:meMA.Ode4C13.text	Ὑπανοίγων τὴν καρδίαν, συμπαθῶς Τύχων ἔνδοξε, πενομένοις πλοῦτος, καὶ περιβολῇ γυμνητεύουσι, τῶν ὀρφανῶν τε προστάτης ἐχρημάτισας, θεραπεύων ἐν τούτοις Χριστὸν τὸν Θεὸν ἡμῶν.
ltx/gr_gr_cog/me.m06.d16:meMA.Ode4C1T.incipit	Ῥαθυμίᾳ συσχεθέντα, καὶ παθῶν ἀμαυρότητι…
ltx/gr_gr_cog/me.m06.d16:meMA.Ode4C1T.melody	@ltx/gr_gr_cog/he.h.m4:heHE.OKathimenosEnDoxi.name
ltx/gr_gr_cog/me.m06.d16:meMA.Ode4C1T.mode	@ltx/gr_gr_cog/miscellanea:misc.Mode4
ltx/gr_gr_cog/me.m06.d16:meMA.Ode4C1T.ode	@ltx/gr_gr_cog/miscellanea:misc.Ode4
ltx/gr_gr_cog/me.m06.d16:meMA.Ode4C1T.text	Ῥαθυμίᾳ συσχεθέντα, καὶ παθῶν ἀμαυρότητι, ὅλον σκοτισθέντα, καὶ τῇ ἁμαρτίᾳ δουλεύσαντα, τὸν ἀναμάρτητον Λόγον ἡ κυήσασα, φωταγώγησον, καὶ πρὸς ζωὴν χειραγώγησον.
ltx/gr_gr_cog/me.m06.d16:meMA.Ode5C11.greekmelody	@ltx/gr_gr_cog/he.h.m4:heHE.AseveisOukOpsontai.greekname
ltx/gr_gr_cog/me.m06.d16:meMA.Ode5C11.incipit	Γεωργὸς ὡς ἄριστος, ἐνέωσας ψυχάς…
ltx/gr_gr_cog/me.m06.d16:meMA.Ode5C11.melody	@ltx/gr_gr_cog/he.h.m4:heHE.AseveisOukOpsontai.name
ltx/gr_gr_cog/me.m06.d16:meMA.Ode5C11.mode	@ltx/gr_gr_cog/miscellanea:misc.Mode4
ltx/gr_gr_cog/me.m06.d16:meMA.Ode5C11.ode	@ltx/gr_gr_cog/miscellanea:misc.Ode5
ltx/gr_gr_cog/me.m06.d16:meMA.Ode5C11.text	Γεωργὸς ὡς ἄριστος, ἐνέωσας ψυχάς, χερσωθείσας Πάτερ σοφέ, καὶ ὡς σπόρον ἄριστον, ἐνθεὶς τὸν λόγον σου, γεωργεῖν οὐράνια, παρεσκεύασας νοήματα.
ltx/gr_gr_cog/me.m06.d16:meMA.Ode5C12.incipit	Ὡς τοῦ θείου Πνεύματος, δοχεῖον…
ltx/gr_gr_cog/me.m06.d16:meMA.Ode5C12.melody	@ltx/gr_gr_cog/he.h.m4:heHE.AseveisOukOpsontai.name
ltx/gr_gr_cog/me.m06.d16:meMA.Ode5C12.mode	@ltx/gr_gr_cog/miscellanea:misc.Mode4
ltx/gr_gr_cog/me.m06.d16:meMA.Ode5C12.ode	@ltx/gr_gr_cog/miscellanea:misc.Ode5
ltx/gr_gr_cog/me.m06.d16:meMA.Ode5C12.text	Ὡς τοῦ θείου Πνεύματος, δοχεῖον γεγονώς, τῶν πνευμάτων τῶν πονηρῶν, Ἱεράρχα πέφυκας φυγαδευτήριον, καὶ παθῶν καθάρσιον, καὶ νοσούντων ἰατήριον.
ltx/gr_gr_cog/me.m06.d16:meMA.Ode5C13.incipit	Ποταμὸς πληρούμενος, ναμάτων μυστικῶν, ἐγνωρίσθης…
ltx/gr_gr_cog/me.m06.d16:meMA.Ode5C13.melody	@ltx/gr_gr_cog/he.h.m4:heHE.AseveisOukOpsontai.name
ltx/gr_gr_cog/me.m06.d16:meMA.Ode5C13.mode	@ltx/gr_gr_cog/miscellanea:misc.Mode4
ltx/gr_gr_cog/me.m06.d16:meMA.Ode5C13.ode	@ltx/gr_gr_cog/miscellanea:misc.Ode5
ltx/gr_gr_cog/me.m06.d16:meMA.Ode5C13.text	Ποταμὸς πληρούμενος, ναμάτων μυστικῶν, ἐγνωρίσθης ἱερουργέ, καὶ πηγὰς ἐξήρανας, παθῶν ἐν χάριτι, καὶ ψυχὰς κατήρδευσας, βλαστανούσας τὴν εὐσέβειαν.
ltx/gr_gr_cog/me.m06.d16:meMA.Ode5C1T.incipit	Ῥυομένη φάνηθι, ἐχθρῶν ἐπαγωγῆς, καὶ…
ltx/gr_gr_cog/me.m06.d16:meMA.Ode5C1T.melody	@ltx/gr_gr_cog/he.h.m4:heHE.AseveisOukOpsontai.name
ltx/gr_gr_cog/me.m06.d16:meMA.Ode5C1T.mode	@ltx/gr_gr_cog/miscellanea:misc.Mode4
ltx/gr_gr_cog/me.m06.d16:meMA.Ode5C1T.ode	@ltx/gr_gr_cog/miscellanea:misc.Ode5
ltx/gr_gr_cog/me.m06.d16:meMA.Ode5C1T.text	Ῥυομένη φάνηθι, ἐχθρῶν ἐπαγωγῆς, καὶ βαρβάρων ἐπιδρομῆς, τοὺς σοὺς δούλους Ἄχραντε, τοὺς κεκτημένους σε, κραταιὰν ἀντίληψιν, καὶ πρεσβείαν ἀκαταίσχυντον.
ltx/gr_gr_cog/me.m06.d16:meMA.Ode6C11.greekmelody	@ltx/gr_gr_cog/he.h.m4:heHE.IlthonEisTaVathi.greekname
ltx/gr_gr_cog/me.m06.d16:meMA.Ode6C11.incipit	Οὐκ ἔσεισε Πάτερ τῆς ψυχῆς…
ltx/gr_gr_cog/me.m06.d16:meMA.Ode6C11.melody	@ltx/gr_gr_cog/he.h.m4:heHE.IlthonEisTaVathi.name
ltx/gr_gr_cog/me.m06.d16:meMA.Ode6C11.mode	@ltx/gr_gr_cog/miscellanea:misc.Mode4
ltx/gr_gr_cog/me.m06.d16:meMA.Ode6C11.ode	@ltx/gr_gr_cog/miscellanea:misc.Ode6
ltx/gr_gr_cog/me.m06.d16:meMA.Ode6C11.text	Οὐκ ἔσεισε Πάτερ τῆς ψυχῆς σου, ὁ πονηρὸς τὸν οἶκον· ἐν τῇ πέτρᾳ γὰρ τῆς ἀληθείας, ὡς ἀληθῶς ἵστασο θεόπνευστε, θείῳ σθένει κρατυνόμενος.
ltx/gr_gr_cog/me.m06.d16:meMA.Ode6C12.incipit	Σοφίᾳ Θεοῦ κεκοσμημένος, καὶ ἀρετῶν…
ltx/gr_gr_cog/me.m06.d16:meMA.Ode6C12.melody	@ltx/gr_gr_cog/he.h.m4:heHE.IlthonEisTaVathi.name
ltx/gr_gr_cog/me.m06.d16:meMA.Ode6C12.mode	@ltx/gr_gr_cog/miscellanea:misc.Mode4
ltx/gr_gr_cog/me.m06.d16:meMA.Ode6C12.ode	@ltx/gr_gr_cog/miscellanea:misc.Ode6
ltx/gr_gr_cog/me.m06.d16:meMA.Ode6C12.text	Σοφίᾳ Θεοῦ κεκοσμημένος, καὶ ἀρετῶν εἰς ὕψος, Ἱερώτατε φθάσας καθεῖλες, τοῦ πονηροῦ τὰς ἐπάρσεις χάριτι, τὴν καρδίαν ταπεινούμενος.
ltx/gr_gr_cog/me.m06.d16:meMA.Ode6C13.incipit	Λειμὼν εὐανθὴς Τύχων ὡράθης, τῶν…
ltx/gr_gr_cog/me.m06.d16:meMA.Ode6C13.melody	@ltx/gr_gr_cog/he.h.m4:heHE.IlthonEisTaVathi.name
ltx/gr_gr_cog/me.m06.d16:meMA.Ode6C13.mode	@ltx/gr_gr_cog/miscellanea:misc.Mode4
ltx/gr_gr_cog/me.m06.d16:meMA.Ode6C13.ode	@ltx/gr_gr_cog/miscellanea:misc.Ode6
ltx/gr_gr_cog/me.m06.d16:meMA.Ode6C13.text	Λειμὼν εὐανθὴς Τύχων ὡράθης, τῶν ἀρετῶν τὰ ἄνθη, τῶν θαυμάτων τε τὴν εὐωδίαν, πᾶσι πιστοῖς Ἱεράρχα ὅσιε, θεοκρίτως προβαλλόμενος.
ltx/gr_gr_cog/me.m06.d16:meMA.Ode6C1T.incipit	Ἁγία Παρθένε τὴν ψυχήν μου…
ltx/gr_gr_cog/me.m06.d16:meMA.Ode6C1T.melody	@ltx/gr_gr_cog/he.h.m4:heHE.IlthonEisTaVathi.name
ltx/gr_gr_cog/me.m06.d16:meMA.Ode6C1T.mode	@ltx/gr_gr_cog/miscellanea:misc.Mode4
ltx/gr_gr_cog/me.m06.d16:meMA.Ode6C1T.ode	@ltx/gr_gr_cog/miscellanea:misc.Ode6
ltx/gr_gr_cog/me.m06.d16:meMA.Ode6C1T.text	Ἁγία Παρθένε τὴν ψυχήν μου, ἣν ὁ ἐχθρὸς δολίως, κατεσπίλωσε τῇ ἁμαρτίᾳ, ὡς ἀγαθή, δυσωπῶ ἀγάθυνον, καὶ φωτί σου καταλάμπρυνον.
ltx/gr_gr_cog/me.m06.d16:meMA.Ode6H.greekmelody	@ltx/gr_gr_cog/he.h.m4:heHE.IlthonEisTaVathi.greekname
ltx/gr_gr_cog/me.m06.d16:meMA.Ode6H.incipit	@ltx/gr_gr_cog/he.h.m4:heHE.IlthonEisTaVathi.incipit
ltx/gr_gr_cog/me.m06.d16:meMA.Ode6H.melody	@ltx/gr_gr_cog/he.h.m4:heHE.IlthonEisTaVathi.melody
ltx/gr_gr_cog/me.m06.d16:meMA.Ode6H.mode	@ltx/gr_gr_cog/miscellanea:misc.Mode4
ltx/gr_gr_cog/me.m06.d16:meMA.Ode6H.ode	@ltx/gr_gr_cog/miscellanea:misc.Ode6
ltx/gr_gr_cog/me.m06.d16:meMA.Ode6H.text	@ltx/gr_gr_cog/he.h.m4:heHE.IlthonEisTaVathi.text
ltx/gr_gr_cog/me.m06.d16:meMA.Ode7C11.greekmelody	@ltx/gr_gr_cog/he.h.m4:heHE.NeoiTreisEnVavyloni.greekname
ltx/gr_gr_cog/me.m06.d16:meMA.Ode7C11.incipit	Λόγοις θείοις κατηρδεύθη, ἄμπελος ὡς…
ltx/gr_gr_cog/me.m06.d16:meMA.Ode7C11.melody	@ltx/gr_gr_cog/he.h.m4:heHE.NeoiTreisEnVavyloni.name
ltx/gr_gr_cog/me.m06.d16:meMA.Ode7C11.mode	@ltx/gr_gr_cog/miscellanea:misc.Mode4
ltx/gr_gr_cog/me.m06.d16:meMA.Ode7C11.ode	@ltx/gr_gr_cog/miscellanea:misc.Ode7
ltx/gr_gr_cog/me.m06.d16:meMA.Ode7C11.text	Λόγοις θείοις κατηρδεύθη, ἄμπελος ὡς ἀληθής, Τύχων ἡ καρδία σου, καὶ καρποφορήσασα βότρυν, θεογνωσίας ἔβλυσε, γλυκασμὸν ἰαμάτων ἡμῖν.
ltx/gr_gr_cog/me.m06.d16:meMA.Ode7C12.incipit	Ἤνθησας καθάπερ ῥόδον, ἔλαμψας ὥσπερ…
ltx/gr_gr_cog/me.m06.d16:meMA.Ode7C12.melody	@ltx/gr_gr_cog/he.h.m4:heHE.NeoiTreisEnVavyloni.name
ltx/gr_gr_cog/me.m06.d16:meMA.Ode7C12.mode	@ltx/gr_gr_cog/miscellanea:misc.Mode4
ltx/gr_gr_cog/me.m06.d16:meMA.Ode7C12.ode	@ltx/gr_gr_cog/miscellanea:misc.Ode7
ltx/gr_gr_cog/me.m06.d16:meMA.Ode7C12.text	Ἤνθησας καθάπερ ῥόδον, ἔλαμψας ὥσπερ ἀστήρ, ἔφανας ὡς ἥλιος Πάτερ, τοὺς βοῶντας φωτίζων· Εὐλογητὸς εἶ Κύριε, ὁ Θεὸς ὁ τῶν Πατέρων ἡμῶν.
ltx/gr_gr_cog/me.m06.d16:meMA.Ode7C13.incipit	Στέφανος χαρίτων Πάτερ, σοῦ τῇ…
ltx/gr_gr_cog/me.m06.d16:meMA.Ode7C13.melody	@ltx/gr_gr_cog/he.h.m4:heHE.NeoiTreisEnVavyloni.name
ltx/gr_gr_cog/me.m06.d16:meMA.Ode7C13.mode	@ltx/gr_gr_cog/miscellanea:misc.Mode4
ltx/gr_gr_cog/me.m06.d16:meMA.Ode7C13.ode	@ltx/gr_gr_cog/miscellanea:misc.Ode7
ltx/gr_gr_cog/me.m06.d16:meMA.Ode7C13.text	Στέφανος χαρίτων Πάτερ, σοῦ τῇ θείᾳ κορυφῇ, ἐτέθη ὡς γέγραπται, νίκην κατʼ εχθρῶν ἀραμένου, καὶ μελῳδοῦντος· Κύριε, ὁ Θεὸς ὁ τῶν Πατέρων ἡμῶν.
ltx/gr_gr_cog/me.m06.d16:meMA.Ode7C14.incipit	Ὤφθη σου τὸ θαῦμα μέγα…
ltx/gr_gr_cog/me.m06.d16:meMA.Ode7C14.melody	@ltx/gr_gr_cog/he.h.m4:heHE.NeoiTreisEnVavyloni.name
ltx/gr_gr_cog/me.m06.d16:meMA.Ode7C14.mode	@ltx/gr_gr_cog/miscellanea:misc.Mode4
ltx/gr_gr_cog/me.m06.d16:meMA.Ode7C14.ode	@ltx/gr_gr_cog/miscellanea:misc.Ode7
ltx/gr_gr_cog/me.m06.d16:meMA.Ode7C14.text	Ὤφθη σου τὸ θαῦμα μέγα, Τύχων πάτερ θαυμαστέ, χρόνοις λαμπρυνόμενον· ἄμπελος γὰρ σοῦ ἐν τῇ μνήμῃ, περκάζει βότρυν φέροντα, γλυκασμὸν εὐφροσύνης πιστοῖς.
ltx/gr_gr_cog/me.m06.d16:meMA.Ode7C1T.incipit	Πάντων ὤφθης ἀσωμάτων, οἷα Μήτηρ…
ltx/gr_gr_cog/me.m06.d16:meMA.Ode7C1T.melody	@ltx/gr_gr_cog/he.h.m4:heHE.NeoiTreisEnVavyloni.name
ltx/gr_gr_cog/me.m06.d16:meMA.Ode7C1T.mode	@ltx/gr_gr_cog/miscellanea:misc.Mode4
ltx/gr_gr_cog/me.m06.d16:meMA.Ode7C1T.ode	@ltx/gr_gr_cog/miscellanea:misc.Ode7
ltx/gr_gr_cog/me.m06.d16:meMA.Ode7C1T.text	Πάντων ὤφθης ἀσωμάτων, οἷα Μήτηρ τοῦ Θεοῦ, ὄντως ὑπερέχουσα, ὃν ἐκδυσωποῦσα Παρθένε, ὑπέρτερόν μου δεῖξον, τὸν λογισμὸν σαρκικῶν ἡδονῶν.
ltx/gr_gr_cog/me.m06.d16:meMA.Ode8C11.greekmelody	@ltx/gr_gr_cog/he.h.m4:heHE.LytrotaTouPantos.greekname
ltx/gr_gr_cog/me.m06.d16:meMA.Ode8C11.incipit	Οὐδαμῶς ἡδοναῖς ἀπενύσταξας, ἐγρηγόρως δὲ…
ltx/gr_gr_cog/me.m06.d16:meMA.Ode8C11.melody	@ltx/gr_gr_cog/he.h.m4:heHE.LytrotaTouPantos.name
ltx/gr_gr_cog/me.m06.d16:meMA.Ode8C11.mode	@ltx/gr_gr_cog/miscellanea:misc.Mode4
ltx/gr_gr_cog/me.m06.d16:meMA.Ode8C11.ode	@ltx/gr_gr_cog/miscellanea:misc.Ode8
ltx/gr_gr_cog/me.m06.d16:meMA.Ode8C11.text	Οὐδαμῶς ἡδοναῖς ἀπενύσταξας, ἐγρηγόρως δὲ μᾶλλον παρέδραμες, νύκτα τοῦ βίου Ὅσιε, καὶ κοιμίσας τὰ πάθη σαρκός, πρὸς φέγγος, ἀπαθείας, ἐνθέως κατήντησας.
ltx/gr_gr_cog/me.m06.d16:meMA.Ode8C12.incipit	Ἰατρεῖον παθῶν ἀναδέδεικται, ἡ σορὸς…
ltx/gr_gr_cog/me.m06.d16:meMA.Ode8C12.melody	@ltx/gr_gr_cog/he.h.m4:heHE.LytrotaTouPantos.name
ltx/gr_gr_cog/me.m06.d16:meMA.Ode8C12.mode	@ltx/gr_gr_cog/miscellanea:misc.Mode4
ltx/gr_gr_cog/me.m06.d16:meMA.Ode8C12.ode	@ltx/gr_gr_cog/miscellanea:misc.Ode8
ltx/gr_gr_cog/me.m06.d16:meMA.Ode8C12.text	Ἰατρεῖον παθῶν ἀναδέδεικται, ἡ σορὸς τῶν ἁγίων λειψάνων σου, ἣν περ κυκλοῦντες μέλπομεν, ἱερώτατε Τύχων. Πάντα τὰ ἔργα, εὐλογεῖτε ὑμνεῖτε τὸν Κύριον.
ltx/gr_gr_cog/me.m06.d16:meMA.Ode8C13.incipit	Μεγαλύνεις Χριστὸν τὸν Θεὸν ἡμῶν…
ltx/gr_gr_cog/me.m06.d16:meMA.Ode8C13.melody	@ltx/gr_gr_cog/he.h.m4:heHE.LytrotaTouPantos.name
ltx/gr_gr_cog/me.m06.d16:meMA.Ode8C13.mode	@ltx/gr_gr_cog/miscellanea:misc.Mode4
ltx/gr_gr_cog/me.m06.d16:meMA.Ode8C13.ode	@ltx/gr_gr_cog/miscellanea:misc.Ode8
ltx/gr_gr_cog/me.m06.d16:meMA.Ode8C13.text	Μεγαλύνεις Χριστὸν τὸν Θεὸν ἡμῶν, ἐπακούσας φωνῆς πρὸς τὰ ἄνω σε, περιφανῶς βασίλεια, παναοίδιμε Πάτερ προσκαλουμένης, ὡς καλῶς καὶ ὁσίως βιώσαντα.
ltx/gr_gr_cog/me.m06.d16:meMA.Ode8C14.incipit	Ἐγνωρίσθη σοι Πάτερ ἡ ἔξοδος…
ltx/gr_gr_cog/me.m06.d16:meMA.Ode8C14.melody	@ltx/gr_gr_cog/he.h.m4:heHE.LytrotaTouPantos.name
ltx/gr_gr_cog/me.m06.d16:meMA.Ode8C14.mode	@ltx/gr_gr_cog/miscellanea:misc.Mode4
ltx/gr_gr_cog/me.m06.d16:meMA.Ode8C14.ode	@ltx/gr_gr_cog/miscellanea:misc.Ode8
ltx/gr_gr_cog/me.m06.d16:meMA.Ode8C14.text	Ἐγνωρίσθη σοι Πάτερ ἡ ἔξοδος, ἡ τοῦ βίου· Θεὸς γὰρ ὁ δίκαιος, δικαιοσύνῃ λάμποντα, τοῖς δικαίοις σε πᾶσι, Τύχων συνάπτει, ὑπὲρ πάντων αὐτὸν ἱκετεύοντα.
ltx/gr_gr_cog/me.m06.d16:meMA.Ode8C15.incipit	Νηπιῶδες ἐξέκλινας φρόνημα, ἐκ παιδός…
ltx/gr_gr_cog/me.m06.d16:meMA.Ode8C15.melody	@ltx/gr_gr_cog/he.h.m4:heHE.LytrotaTouPantos.name
ltx/gr_gr_cog/me.m06.d16:meMA.Ode8C15.mode	@ltx/gr_gr_cog/miscellanea:misc.Mode4
ltx/gr_gr_cog/me.m06.d16:meMA.Ode8C15.ode	@ltx/gr_gr_cog/miscellanea:misc.Ode8
ltx/gr_gr_cog/me.m06.d16:meMA.Ode8C15.text	Νηπιῶδες ἐξέκλινας φρόνημα, ἐκ παιδός, καὶ τελείοις νοήμασι, τὸν παλαιὸν κατέβαλες εὑρετὴν τῆς κακίας, Τύχων κραυγάζων· Εὐλογεῖτε τὰ ἔργα τὸν Κύριον.
ltx/gr_gr_cog/me.m06.d16:meMA.Ode8C1T.incipit	Ἱερεῖς καὶ λαοὶ εὐφημοῦσί σε…
ltx/gr_gr_cog/me.m06.d16:meMA.Ode8C1T.melody	@ltx/gr_gr_cog/he.h.m4:heHE.LytrotaTouPantos.name
ltx/gr_gr_cog/me.m06.d16:meMA.Ode8C1T.mode	@ltx/gr_gr_cog/miscellanea:misc.Mode4
ltx/gr_gr_cog/me.m06.d16:meMA.Ode8C1T.ode	@ltx/gr_gr_cog/miscellanea:misc.Ode8
ltx/gr_gr_cog/me.m06.d16:meMA.Ode8C1T.text	Ἱερεῖς καὶ λαοὶ εὐφημοῦσί σε, παντευλόγητε Κόρη πανάμωμε, τὴν εὐλογίαις ἅπαντας, στεφανώσασαν πίστει τοὺς μελῳδοῦντας· Εὐλογεῖτε ὑμνεῖτε τὸν Κύριον.
ltx/gr_gr_cog/me.m06.d16:meMA.Ode8H.greekmelody	@ltx/gr_gr_cog/he.h.m4:heHE.LytrotaTouPantos.greekname
ltx/gr_gr_cog/me.m06.d16:meMA.Ode8H.incipit	@ltx/gr_gr_cog/he.h.m4:heHE.LytrotaTouPantos.incipit
ltx/gr_gr_cog/me.m06.d16:meMA.Ode8H.melody	@ltx/gr_gr_cog/he.h.m4:heHE.LytrotaTouPantos.melody
ltx/gr_gr_cog/me.m06.d16:meMA.Ode8H.mode	@ltx/gr_gr_cog/miscellanea:misc.Mode4
ltx/gr_gr_cog/me.m06.d16:meMA.Ode8H.ode	@ltx/gr_gr_cog/miscellanea:misc.Ode8
ltx/gr_gr_cog/me.m06.d16:meMA.Ode8H.text	@ltx/gr_gr_cog/he.h.m4:heHE.LytrotaTouPantos.text
ltx/gr_gr_cog/me.m06.d16:meMA.Ode9C11.greekmelody	@ltx/gr_gr_cog/he.h.m4:heHE.EvaMenToTisParakois.greekname
ltx/gr_gr_cog/me.m06.d16:meMA.Ode9C11.incipit	Ἰδοὺ σοι τὸν δρόμον τὸν…
ltx/gr_gr_cog/me.m06.d16:meMA.Ode9C11.melody	@ltx/gr_gr_cog/he.h.m4:heHE.EvaMenToTisParakois.name
ltx/gr_gr_cog/me.m06.d16:meMA.Ode9C11.mode	@ltx/gr_gr_cog/miscellanea:misc.Mode4
ltx/gr_gr_cog/me.m06.d16:meMA.Ode9C11.ode	@ltx/gr_gr_cog/miscellanea:misc.Ode9
ltx/gr_gr_cog/me.m06.d16:meMA.Ode9C11.text	Ἰδοὺ σοι τὸν δρόμον τὸν καλὸν τελέσαντι, καὶ τὴν πίστιν νῦν τηρήσαντι, Πάτερ θεόφρον ἱεράρχα, οὐράνια ἠνοίχθη σκηνώματα, καὶ τόπος φωταυγής σε ἐδέξατο, ἁγιωσύνη διαλάμποντα.
ltx/gr_gr_cog/me.m06.d16:meMA.Ode9C12.incipit	Ὡς μύστης ὡς θεῖος Ἱερεὺς…
ltx/gr_gr_cog/me.m06.d16:meMA.Ode9C12.melody	@ltx/gr_gr_cog/he.h.m4:heHE.EvaMenToTisParakois.name
ltx/gr_gr_cog/me.m06.d16:meMA.Ode9C12.mode	@ltx/gr_gr_cog/miscellanea:misc.Mode4
ltx/gr_gr_cog/me.m06.d16:meMA.Ode9C12.ode	@ltx/gr_gr_cog/miscellanea:misc.Ode9
ltx/gr_gr_cog/me.m06.d16:meMA.Ode9C12.text	Ὡς μύστης ὡς θεῖος Ἱερεὺς ὡς ἄριστος, ποιμενάρχης ὡς ἑδραίωμα, τῆς Ἐκκλησίας ὡς θαυμάτων, Παμμάκαρ αὐτουργὸς μεμακάρισαι, καὶ δήμοις ἱεροῖς συνηρίθμησαι, πάντων ἁγίων ἀγαλλόμενος.
ltx/gr_gr_cog/me.m06.d16:meMA.Ode9C13.incipit	Σήμερον ἡ μνήμη σου ἡμῖν…
ltx/gr_gr_cog/me.m06.d16:meMA.Ode9C13.melody	@ltx/gr_gr_cog/he.h.m4:heHE.EvaMenToTisParakois.name
ltx/gr_gr_cog/me.m06.d16:meMA.Ode9C13.mode	@ltx/gr_gr_cog/miscellanea:misc.Mode4
ltx/gr_gr_cog/me.m06.d16:meMA.Ode9C13.ode	@ltx/gr_gr_cog/miscellanea:misc.Ode9
ltx/gr_gr_cog/me.m06.d16:meMA.Ode9C13.text	Σήμερον ἡ μνήμη σου ἡμῖν ἀνέτειλε, τοῦ ἡλίου τηλαυγέστερον, φέγγει ἐνθέων χαρισμάτων, φωτίζουσα πιστῶν τὴν διάνοιαν, καὶ σκότος τῶν παθῶν ἐκδιώκουσα, Τύχων θεόφρον Ἱερώτατε.
ltx/gr_gr_cog/me.m06.d16:meMA.Ode9C14.incipit	Ἡ Κύπρος τὸ σῶμά σου…
ltx/gr_gr_cog/me.m06.d16:meMA.Ode9C14.melody	@ltx/gr_gr_cog/he.h.m4:heHE.EvaMenToTisParakois.name
ltx/gr_gr_cog/me.m06.d16:meMA.Ode9C14.mode	@ltx/gr_gr_cog/miscellanea:misc.Mode4
ltx/gr_gr_cog/me.m06.d16:meMA.Ode9C14.ode	@ltx/gr_gr_cog/miscellanea:misc.Ode9
ltx/gr_gr_cog/me.m06.d16:meMA.Ode9C14.text	Ἡ Κύπρος τὸ σῶμά σου σοφὲ τὸ ἅγιον, ἰαμάτων κρήνην κέκτηται, πᾶσα δὲ πόλις τε καὶ χώρα, κηρύττει σου τὸν βίον, τὰ θαύματα, καὶ τὴν πρὸς τὸν Δεσπότην οἰκείωσιν, Τύχων παμμάκαρ ἀξιάγαστε.
ltx/gr_gr_cog/me.m06.d16:meMA.Ode9C1T.incipit	Φωτὸς οἰκητήριον ἡ σὴ πανάμωμε…
ltx/gr_gr_cog/me.m06.d16:meMA.Ode9C1T.melody	@ltx/gr_gr_cog/he.h.m4:heHE.EvaMenToTisParakois.name
ltx/gr_gr_cog/me.m06.d16:meMA.Ode9C1T.mode	@ltx/gr_gr_cog/miscellanea:misc.Mode4
ltx/gr_gr_cog/me.m06.d16:meMA.Ode9C1T.ode	@ltx/gr_gr_cog/miscellanea:misc.Ode9
ltx/gr_gr_cog/me.m06.d16:meMA.Ode9C1T.text	Φωτὸς οἰκητήριον ἡ σὴ πανάμωμε, Παναγία μήτρα γέγονεν, ᾧ φωτιζόμενοι τοῦ σκότους, λυτρούμεθα τῆς πλάνης ὑμνοῦντές σε, καὶ πόθῳ ἀληθεῖ μακαρίζοντες, μόνη ἀνθρώπων ἐπανόρθωσις.
ltx/gr_gr_cog/me.m06.d16:meMA.Ode9H.greekmelody	@ltx/gr_gr_cog/he.h.m4:heHE.EvaMenToTisParakois.greekname
ltx/gr_gr_cog/me.m06.d16:meMA.Ode9H.incipit	@ltx/gr_gr_cog/he.h.m4:heHE.EvaMenToTisParakois.incipit
ltx/gr_gr_cog/me.m06.d16:meMA.Ode9H.melody	@ltx/gr_gr_cog/he.h.m4:heHE.EvaMenToTisParakois.melody
ltx/gr_gr_cog/me.m06.d16:meMA.Ode9H.mode	@ltx/gr_gr_cog/miscellanea:misc.Mode4
ltx/gr_gr_cog/me.m06.d16:meMA.Ode9H.ode	@ltx/gr_gr_cog/miscellanea:misc.Ode9
ltx/gr_gr_cog/me.m06.d16:meMA.Ode9H.text	@ltx/gr_gr_cog/he.h.m4:heHE.EvaMenToTisParakois.text
ltx/gr_gr_cog/me.m06.d16:meVE.Apolytikion1ger.greekmelody	@ltx/gr_gr_cog/he.a.m3:heAU.TheiasPisteos.greekname
ltx/gr_gr_cog/me.m06.d16:meVE.Apolytikion1ger.incipit	Θείας ἔτυχες, ἱερατείας, νεύσει κρείττονι…
ltx/gr_gr_cog/me.m06.d16:meVE.Apolytikion1ger.melody	@ltx/gr_gr_cog/he.a.m3:heAU.TheiasPisteos.name
ltx/gr_gr_cog/me.m06.d16:meVE.Apolytikion1ger.mode	@ltx/gr_gr_cog/miscellanea:misc.Mode3
ltx/gr_gr_cog/me.m06.d16:meVE.Apolytikion1ger.poet	@ltx/gr_gr_cog/poets:po.Gerasimou
ltx/gr_gr_cog/me.m06.d16:meVE.Apolytikion1ger.text	Θείας ἔτυχες, ἱερατείας, νεύσει κρείττονι, ἐκλελεγμένος, ὡς θεράπων τῆς Τριάδος ἐπάξιος· σὺ γὰρ τῶν ἔργων ἐκλάμπων ταῖς χάρισι, τὴν Ἐκκλησίαν ἐστήριξας θαύμασι. Τύχων Ὅσιε, Χριστὸν τὸν Θεὸν ἱκέτευε, δωρήσασθαι ἡμῖν τὸ μέγα ἔλεος.
ltx/gr_gr_cog/me.m06.d16:meVE.SticStavrotheotokion.greekmelody	@ltx/gr_gr_cog/he.a.m8:heAU.TiYmasKalesomen.greekname
ltx/gr_gr_cog/me.m06.d16:meVE.SticStavrotheotokion.incipit	Ἄρνα ἡ ἀμνὰς ὡς ἑώρακε…
ltx/gr_gr_cog/me.m06.d16:meVE.SticStavrotheotokion.melody	@ltx/gr_gr_cog/he.a.m8:heAU.TiYmasKalesomen.name
ltx/gr_gr_cog/me.m06.d16:meVE.SticStavrotheotokion.mode	@ltx/gr_gr_cog/miscellanea:misc.Mode8
ltx/gr_gr_cog/me.m06.d16:meVE.SticStavrotheotokion.text	Ἄρνα ἡ ἀμνὰς ὡς ἑώρακε, τὸν Υἱὸν τὸν ἑαυτῆς, καθηλωμένον ἐν Σταυρῷ, ἐτιτρώσκετο τῆς λύπης, τῇ ῥομφαίᾳ τὴν ψυχήν, τὰ σπλάγχνα ἐδονεῖτο θρήνους πλέκουσα, καὶ λύπης τὴν καρδίαν ἐνεπίμπλατο. Οἴμοι! Υἱέ μου γλυκύτατε, πῶς ταῦτα πάσχεις μακρόθυμε; Δοξάζω σου τὸ μακρόθυμον φιλάνθρωπε.
ltx/gr_gr_cog/me.m06.d16:meVE.SticTheotokion.greekmelody	@ltx/gr_gr_cog/he.a.m8:heAU.TiYmasKalesomen.greekname
ltx/gr_gr_cog/me.m06.d16:meVE.SticTheotokion.incipit	Τίς ὁ προσφυγὼν ἐν τῇ…
ltx/gr_gr_cog/me.m06.d16:meVE.SticTheotokion.melody	@ltx/gr_gr_cog/he.a.m8:heAU.TiYmasKalesomen.name
ltx/gr_gr_cog/me.m06.d16:meVE.SticTheotokion.mode	@ltx/gr_gr_cog/miscellanea:misc.Mode8
ltx/gr_gr_cog/me.m06.d16:meVE.SticTheotokion.text	Τίς ὁ προσφυγὼν ἐν τῇ σκέπῃ σου, Θεοτόκε ἀειπάρθενε ἀνύμφευτε ἁγνή, οὐ λαμβάνει τὴν ταχεῖαν, τῶν κακῶν ἀπαλλαγήν; εὑρίσκει βοηθόν σε ἀκαταίσχυντον, προστάτιν τε καὶ πύργον ἀῤῥαγέστατον. Θεογεννῆτορ πανάμωμε, Χριστιανῶν ἡ ἀντίληψις, μεσίτευσον, τοῦ σωθῆναι τοὺς τιμῶντάς σε.
ltx/gr_gr_cog/me.m06.d16:meVE.Stichera01.greekmelody	@ltx/gr_gr_cog/he.a.m8:heAU.TiYmasKalesomen.greekname
ltx/gr_gr_cog/me.m06.d16:meVE.Stichera01.incipit	Ἔχων πολιτείαν ἰσάγγελον, ἀποχῇ τῶν…
ltx/gr_gr_cog/me.m06.d16:meVE.Stichera01.melody	@ltx/gr_gr_cog/he.a.m8:heAU.TiYmasKalesomen.name
ltx/gr_gr_cog/me.m06.d16:meVE.Stichera01.mode	@ltx/gr_gr_cog/miscellanea:misc.Mode8
ltx/gr_gr_cog/me.m06.d16:meVE.Stichera01.text	Ἔχων πολιτείαν ἰσάγγελον, ἀποχῇ τῶν ἡδονῶν, σκεῦος ἐδείχθης τοῦ Θεοῦ· διὰ τοῦτό σε σοφέ, Ἀρχιερέα τοῦ λαοῦ, τὸ θεῖον ἁρμοζόντως προχειρίζεται, καὶ στῦλον, καὶ ἑδραίωμα τῆς πίστεως, Τύχων δεικνύει θεόπνευστε, ὀρθοδοξίας ἐφʼ ὕδατα, ποιμαίνοντα, σοῦ τὴν ποίμνην ἱερώτατε.
ltx/gr_gr_cog/me.m06.d16:meVE.Stichera02.incipit	Θείας πεπλησμένος συνέσεως, ποίμνης ὤφθης…
ltx/gr_gr_cog/me.m06.d16:meVE.Stichera02.melody	@ltx/gr_gr_cog/he.a.m8:heAU.TiYmasKalesomen.name
ltx/gr_gr_cog/me.m06.d16:meVE.Stichera02.mode	@ltx/gr_gr_cog/miscellanea:misc.Mode8
ltx/gr_gr_cog/me.m06.d16:meVE.Stichera02.text	Θείας πεπλησμένος συνέσεως, ποίμνης ὤφθης λογικῆς, ταύτην ἐκτρέφων λογικῶς, ἐπὶ χλόην ἀληθῶν, δογμάτων πάνσοφε ποιμήν· διό σου, τὴν ἁγίαν νῦν πανήγυριν, τιμῶμεν, τὸν δοξάσαντά σε Κύριον, μεγαλοφώνως δοξάζοντες, Τύχων θεόφρον πανόλβιε, ἱκέτευε, τοῦ σωθῆναι τὰς ψυχὰς ἡμῶν.
ltx/gr_gr_cog/me.m06.d16:meVE.Stichera03.incipit	Θαύμασι Θεός σε ἐδόξασεν, ὁ…
ltx/gr_gr_cog/me.m06.d16:meVE.Stichera03.melody	@ltx/gr_gr_cog/he.a.m8:heAU.TiYmasKalesomen.name
ltx/gr_gr_cog/me.m06.d16:meVE.Stichera03.mode	@ltx/gr_gr_cog/miscellanea:misc.Mode8
ltx/gr_gr_cog/me.m06.d16:meVE.Stichera03.text	Θαύμασι Θεός σε ἐδόξασεν, ὁ δοξάζων τοὺς αὐτόν, Πάτερ δοξάζοντας πιστῶς· ἐν καιρῷ γὰρ τῆς σεπτῆς, καὶ θείας μνήμης σου σοφέ, ὁρᾶται, βότρυς πέπειρος γενόμενος, ὑμνούντων, τῶν παρόντων τὰ παράδοξα, ἐξ οὗ οἱ πιστοὶ μετέχοντες, ἁγιασμὸν καὶ ὠφέλειαν, εἰσδέχονται, ἐπαξίως σε γεραίροντες.
