ltx/gr_gr_cog/le.ep.mc.d151:lemcLI.Epistle.book_abbr	@ltx/gr_gr_cog/bible:Romans.abbr
ltx/gr_gr_cog/le.ep.mc.d151:lemcLI.Epistle.book_string	@ltx/gr_gr_cog/bible:Romans.text
ltx/gr_gr_cog/le.ep.mc.d151:lemcLI.Epistle.chapverse	15:7 – 16
ltx/gr_gr_cog/le.ep.mc.d151:lemcLI.Epistle.incipit	Προσλαμβάνεσθε ἀλλήλους͵ καθὼς καὶ ὁ Χριστὸς προσελάβετο ὑμᾶς…
ltx/gr_gr_cog/le.ep.mc.d151:lemcLI.Epistle.text	Ἀδελφοί, προσλαμβάνεσθε ἀλλήλους, καθὼς καὶ ὁ Χριστὸς προσελάβετο ὑμᾶς εἰς δόξαν Θεοῦ. Λέγω δὲ Χριστὸν Ἰησοῦν διάκονον γεγενῆσθαι περιτομῆς ὑπὲρ ἀληθείας Θεοῦ, εἰς τὸ βεβαιῶσαι τὰς ἐπαγγελίας τῶν πατέρων, τὰ δὲ ἔθνη ὑπὲρ ἐλέους δοξάσαι τὸν Θεόν, καθὼς γέγραπται· διὰ τοῦτο ἐξομολογήσομαί σοι ἐν ἔθνεσι, Κύριε, καὶ τῷ ὀνόματί σου ψαλῶ. καὶ πάλιν λέγει· εὐφράνθητε ἔθνη μετὰ τοῦ λαοῦ αὐτοῦ. καὶ πάλιν· αἰνεῖτε τὸν Κύριον πάντα τὰ ἔθνη, καὶ ἐπαινέσατε αὐτὸν πάντες οἱ λαοί. καὶ πάλιν Ἡσαΐας λέγει· ἔσται ἡ ῥίζα τοῦ Ἰεσσαί, καὶ ὁ ἀνιστάμενος ἄρχειν ἐθνῶν· ἐπ᾿ αὐτῷ ἔθνη ἐλπιοῦσιν. Ὁ δὲ Θεὸς τῆς ἐλπίδος πληρώσαι ὑμᾶς πάσης χαρᾶς καὶ εἰρήνης ἐν τῷ πιστεύειν, εἰς τὸ περισσεύειν ὑμᾶς ἐν τῇ ἐλπίδι ἐν δυνάμει Πνεύματος Ἁγίου. Πέπεισμαι δέ, ἀδελφοί μου, καὶ αὐτὸς ἐγὼ περὶ ὑμῶν, ὅτι καὶ αὐτοὶ μεστοί ἐστε ἀγαθωσύνης, πεπληρωμένοι πάσης γνώσεως, δυνάμενοι καὶ ἀλλήλους νουθετεῖν. τολμηρότερον δὲ ἔγραψα ὑμῖν, ἀδελφοί, ἀπὸ μέρους, ὡς ἐπαναμιμνήσκων ὑμᾶς, διὰ τὴν χάριν τὴν δοθεῖσάν μοι ὑπὸ τοῦ Θεοῦ εἰς τὸ εἶναί με λειτουργὸν Ἰησοῦ Χριστοῦ εἰς τὰ ἔθνη, ἱερουργοῦντα τὸ εὐαγγέλιον τοῦ Θεοῦ, ἵνα γένηται ἡ προσφορὰ τῶν ἐθνῶν εὐπρόσδεκτος, ἡγιασμένη ἐν Πνεύματι Ἁγίῳ.
ltx/gr_gr_cog/le.ep.mc.d151:lemcLI.Epistle.title	Τῇ Τετάρτῃ τῆς Εʹ Ἑβδομάδος
ltx/gr_gr_cog/le.ep.mc.d151:lemcLI.Epistle.title_abbr	Τετάρτῃ τῆς Εʹ Ἑβδομάδος
ltx/gr_gr_cog/le.ep.mc.d151:lemcLI.Epistle.version	@ltx/gr_gr_cog/properties:version.designation
