ltx/gr_gr_cog/me.m04.d03:meDA.commemoration.first	Μνήμη τοῦ Ὁσίου Πατρὸς ἡμῶν καὶ Ὁμολογητοῦ Νικήτα
ltx/gr_gr_cog/me.m04.d03:meDA.commemoration.first_name	
ltx/gr_gr_cog/me.m04.d03:meDA.commemoration.first_short	Μνήμη τοῦ Ὁσίου Πατρὸς ἡμῶν καὶ Ὁμολογητοῦ Νικήτα
ltx/gr_gr_cog/me.m04.d03:meDA.commemoration.first_title	@ltx/gr_gr_cog/titles:ti.DevoutSaintM
ltx/gr_gr_cog/me.m04.d03:meDA.commemoration.full	Μνήμη τοῦ Ὁσίου Πατρὸς ἡμῶν καὶ Ὁμολογητοῦ Νικήτα, Ἡγουμένου τῆς Μονῆς τοῦ Μηδικίου, καὶ Ἰωσὴφ τοῦ Ὑμνογράφου.
ltx/gr_gr_cog/me.m04.d03:meDA.commemoration.second_name	
ltx/gr_gr_cog/me.m04.d03:meDA.commemoration.second_title	
ltx/gr_gr_cog/me.m04.d03:meDA.date	Τῌ Γʹ ΑΠΡΙΛΙΟΥ
ltx/gr_gr_cog/me.m04.d03:meDA.fordate	διὰ τὴν 3ην Ἀπριλίου
ltx/gr_gr_cog/me.m04.d03:meDA.insert1	
ltx/gr_gr_cog/me.m04.d03:meDA.insert2	
ltx/gr_gr_cog/me.m04.d03:meDA.note	
ltx/gr_gr_cog/me.m04.d03:meDA.pdfcoverdate	τῆς 3ης Ἀπριλίου,
ltx/gr_gr_cog/me.m04.d03:meDA.pdfheaderdate	τῆς 3ης Ἀπριλίου
ltx/gr_gr_cog/me.m04.d03:meHO.commemorations	
ltx/gr_gr_cog/me.m04.d03:meHO.note1	
ltx/gr_gr_cog/me.m04.d03:meHO.note2	
ltx/gr_gr_cog/me.m04.d03:meHO.number	
ltx/gr_gr_cog/me.m04.d03:meHO.rank	
ltx/gr_gr_cog/me.m04.d03:meLE.commemoration1	Μνήμη τοῦ Ὁσίου Πατρὸς ἡμῶν καὶ Ὁμολογητοῦ Νικήτα, Ἡγουμένου τῆς Μονῆς τοῦ Μηδικίου, καὶ Ἰωσὴφ τοῦ Ὑμνογράφου.
ltx/gr_gr_cog/me.m04.d03:meLE.commemoration2	
ltx/gr_gr_cog/me.m04.d03:meLI.Kontakion1.incipit	@ltx/gr_gr_cog/me.m04.d03:meMA.Kontakion1ger.incipit
ltx/gr_gr_cog/me.m04.d03:meLI.Kontakion1.melody	@ltx/gr_gr_cog/me.m04.d03:meMA.Kontakion1ger.melody
ltx/gr_gr_cog/me.m04.d03:meLI.Kontakion1.mode	@ltx/gr_gr_cog/me.m04.d03:meMA.Kontakion1ger.mode
ltx/gr_gr_cog/me.m04.d03:meLI.Kontakion1.text	@ltx/gr_gr_cog/me.m04.d03:meMA.Kontakion1ger.text
ltx/gr_gr_cog/me.m04.d03:meLI.MM.CommunionHymn.text	@ltx/gr_gr_cog/properties:media.key
ltx/gr_gr_cog/me.m04.d03:meLI.Megalynarion.text	
ltx/gr_gr_cog/me.m04.d03:meMA.C1.acrostic.notice1	οὗ ἡ Ἀκροστιχὶς (ἄνευ τῶν Θεοτοκίων)·
ltx/gr_gr_cog/me.m04.d03:meMA.C1.acrostic.text	Τὸν σὸν γεραίρω παμφαῆ βίον Πάτερ.
ltx/gr_gr_cog/me.m04.d03:meMA.C1.acrostic.title	Ὁ Κανὼν τοῦ Ἁγίου,
ltx/gr_gr_cog/me.m04.d03:meMA.C1.poet	@ltx/gr_gr_cog/poets:po.Theofanous
ltx/gr_gr_cog/me.m04.d03:meMA.C1.title	@ltx/gr_gr_cog/titles:ti.CanonSaintM
ltx/gr_gr_cog/me.m04.d03:meMA.C1.verse	@ltx/gr_gr_cog/prayers:pr.verse_DevoutMan.text
ltx/gr_gr_cog/me.m04.d03:meMA.Kontakion1ger.incipit	Ὡς ἡσυχίας ὑποφήτης πρακτικώτατος, τῆς…
ltx/gr_gr_cog/me.m04.d03:meMA.Kontakion1ger.melody	@ltx/gr_gr_cog/he.a.m8:heAU.TiYpermacho.name
ltx/gr_gr_cog/me.m04.d03:meMA.Kontakion1ger.mode	@ltx/gr_gr_cog/miscellanea:misc.Mode8
ltx/gr_gr_cog/me.m04.d03:meMA.Kontakion1ger.poet	@ltx/gr_gr_cog/poets:po.Gerasimou
ltx/gr_gr_cog/me.m04.d03:meMA.Kontakion1ger.text	Ὡς ἡσυχίας ὑποφήτης πρακτικώτατος, τῆς ποιμανσίας ὀφθαλμὸς ὤφθης ἀκοίμητος τῆς Μονῆς καθηγησάμενος Μηδικίου· Ἀλλʼ ὡς φύλαξ τῶν ἐνθέων παραδόσεων διαῤῥύθμισον Νικήτα θείῳ Πνεύματι τοὺς βοῶντάς σοι, χαίροις Πάτερ τρισόλβιε.
ltx/gr_gr_cog/me.m04.d03:meMA.Kontakion2ger.incipit	Ἡ θεόπνους γλῶσσά σου, δαβιτικῶς…
ltx/gr_gr_cog/me.m04.d03:meMA.Kontakion2ger.melody	@ltx/gr_gr_cog/he.a.m3:heAU.IParthenosSimeron.name
ltx/gr_gr_cog/me.m04.d03:meMA.Kontakion2ger.mode	@ltx/gr_gr_cog/miscellanea:misc.Mode3
ltx/gr_gr_cog/me.m04.d03:meMA.Kontakion2ger.poet	@ltx/gr_gr_cog/poets:po.Gerasimou
ltx/gr_gr_cog/me.m04.d03:meMA.Kontakion2ger.text	Ἡ θεόπνους γλῶσσά σου, δαβιτικῶς ἀνεδείχθη, ὀξυγράφου κάλαμος, τῇ θεϊκῇ ἐπιπνοίᾳ, ἅθλους μέν, τοὺς τῶν Ἁγίων ὑμνολογοῦσα, χάριν δέ, τὴν ἐξ ἀγώνων καλλιγραφοῦσα, Ἰωσὴφ τοῖς ἐκβοῶσι· Χαίροις κιθάρα ὑπερκοσμίων ᾠδῶν.
ltx/gr_gr_cog/me.m04.d03:meMA.Ode1C11.greekmelody	@ltx/gr_gr_cog/he.h.m2:heHE.EnVythoKatestrose.greekname
ltx/gr_gr_cog/me.m04.d03:meMA.Ode1C11.incipit	Τῷ φωτὶ τῆς θείας ἀστραπῆς…
ltx/gr_gr_cog/me.m04.d03:meMA.Ode1C11.melody	@ltx/gr_gr_cog/he.h.m2:heHE.EnVythoKatestrose.name
ltx/gr_gr_cog/me.m04.d03:meMA.Ode1C11.mode	@ltx/gr_gr_cog/miscellanea:misc.Mode2
ltx/gr_gr_cog/me.m04.d03:meMA.Ode1C11.ode	@ltx/gr_gr_cog/miscellanea:misc.Ode1
ltx/gr_gr_cog/me.m04.d03:meMA.Ode1C11.text	Τῷ φωτὶ τῆς θείας ἀστραπῆς, Πάτερ αὐγαζόμενος, σοῦ τὴν ζωὴν τῷ Θεῷ καθιέρωσας, ἐκ παιδὸς ἑλόμενος, παρθενίας τὴν φωσφόρον λαμπρότητα, διʼ ἧς ὡμοιώθης, τῇ τῶν Ἀσωμάτων καθαρότητι.
ltx/gr_gr_cog/me.m04.d03:meMA.Ode1C12.incipit	Ὁδηγῷ τῷ θείῳ καὶ σεπτῷ…
ltx/gr_gr_cog/me.m04.d03:meMA.Ode1C12.melody	@ltx/gr_gr_cog/he.h.m2:heHE.EnVythoKatestrose.name
ltx/gr_gr_cog/me.m04.d03:meMA.Ode1C12.mode	@ltx/gr_gr_cog/miscellanea:misc.Mode2
ltx/gr_gr_cog/me.m04.d03:meMA.Ode1C12.ode	@ltx/gr_gr_cog/miscellanea:misc.Ode1
ltx/gr_gr_cog/me.m04.d03:meMA.Ode1C12.text	Ὁδηγῷ τῷ θείῳ καὶ σεπτῷ, Πνεύματι χρησάμενος, θεοειδεῖ τῶν μοναζόντων σχήματι, καθαρῶς ὡμίλησας, καὶ διέμεινας πολυφώτῳ πυρσούμενος, αἴγλῃ θεοφόρε, βίον καθαρώτατον κτησάμενος.
ltx/gr_gr_cog/me.m04.d03:meMA.Ode1C13.incipit	Νευρωθεὶς δυνάμει τοῦ Σταυροῦ, πάθη…
ltx/gr_gr_cog/me.m04.d03:meMA.Ode1C13.melody	@ltx/gr_gr_cog/he.h.m2:heHE.EnVythoKatestrose.name
ltx/gr_gr_cog/me.m04.d03:meMA.Ode1C13.mode	@ltx/gr_gr_cog/miscellanea:misc.Mode2
ltx/gr_gr_cog/me.m04.d03:meMA.Ode1C13.ode	@ltx/gr_gr_cog/miscellanea:misc.Ode1
ltx/gr_gr_cog/me.m04.d03:meMA.Ode1C13.text	Νευρωθεὶς δυνάμει τοῦ Σταυροῦ, πάθη κατεμάρανας, τὰ τῆς σαρκός, καὶ τὸν νοῦν κατελάμπρυνας, ὦ Νικήτα πάνσοφε, τῇ μελέτῃ τῶν διδαγμάτων τοῦ Πνεύματος, θείας θεωρίας, πλοῦτον ἀδαπάνητον καρπούμενος.
ltx/gr_gr_cog/me.m04.d03:meMA.Ode1C14.incipit	Σωφροσύνῃ μάκαρ λαμπρυνθείς, καὶ τῇ…
ltx/gr_gr_cog/me.m04.d03:meMA.Ode1C14.melody	@ltx/gr_gr_cog/he.h.m2:heHE.EnVythoKatestrose.name
ltx/gr_gr_cog/me.m04.d03:meMA.Ode1C14.mode	@ltx/gr_gr_cog/miscellanea:misc.Mode2
ltx/gr_gr_cog/me.m04.d03:meMA.Ode1C14.ode	@ltx/gr_gr_cog/miscellanea:misc.Ode1
ltx/gr_gr_cog/me.m04.d03:meMA.Ode1C14.text	Σωφροσύνῃ μάκαρ λαμπρυνθείς, καὶ τῇ καθαρότητι, πρὸς ἱερὰν ἀνηνέχθης ἀκρότητα· τῆς ἱερωσύνης γάρ, λαμπροτάτῳ κατεκοσμήθης ἐνδύματι, θείων μυστηρίων, Ὅσιε μεσίτης γνωριζόμενος.
ltx/gr_gr_cog/me.m04.d03:meMA.Ode1C1H.greekmelody	@ltx/gr_gr_cog/he.h.m2:heHE.EnVythoKatestrose.greekname
ltx/gr_gr_cog/me.m04.d03:meMA.Ode1C1H.incipit	@ltx/gr_gr_cog/he.h.m2:heHE.EnVythoKatestrose.incipit
ltx/gr_gr_cog/me.m04.d03:meMA.Ode1C1H.melody	@ltx/gr_gr_cog/he.h.m2:heHE.EnVythoKatestrose.melody
ltx/gr_gr_cog/me.m04.d03:meMA.Ode1C1H.mode	@ltx/gr_gr_cog/miscellanea:misc.Mode2
ltx/gr_gr_cog/me.m04.d03:meMA.Ode1C1H.ode	@ltx/gr_gr_cog/miscellanea:misc.Ode1
ltx/gr_gr_cog/me.m04.d03:meMA.Ode1C1H.text	@ltx/gr_gr_cog/he.h.m2:heHE.EnVythoKatestrose.text
ltx/gr_gr_cog/me.m04.d03:meMA.Ode1C1T.incipit	@ltx/gr_gr_cog/oc.m2.d1:ocMA.OdeS1C1T.incipit
ltx/gr_gr_cog/me.m04.d03:meMA.Ode1C1T.melody	@ltx/gr_gr_cog/he.h.m2:heHE.EnVythoKatestrose.name
ltx/gr_gr_cog/me.m04.d03:meMA.Ode1C1T.mode	@ltx/gr_gr_cog/miscellanea:misc.Mode2
ltx/gr_gr_cog/me.m04.d03:meMA.Ode1C1T.ode	@ltx/gr_gr_cog/miscellanea:misc.Ode1
ltx/gr_gr_cog/me.m04.d03:meMA.Ode1C1T.text	@ltx/gr_gr_cog/oc.m2.d1:ocMA.OdeS1C1T.text
ltx/gr_gr_cog/me.m04.d03:meMA.Ode3C11.greekmelody	@ltx/gr_gr_cog/he.h.m2:heHE.ExinthisenIErimos.greekname
ltx/gr_gr_cog/me.m04.d03:meMA.Ode3C11.incipit	Οὐράνιον κτησάμενος, πολιτείαν ἔνδοξε, φωτοειδὴς…
ltx/gr_gr_cog/me.m04.d03:meMA.Ode3C11.melody	@ltx/gr_gr_cog/he.h.m2:heHE.ExinthisenIErimos.name
ltx/gr_gr_cog/me.m04.d03:meMA.Ode3C11.mode	@ltx/gr_gr_cog/miscellanea:misc.Mode2
ltx/gr_gr_cog/me.m04.d03:meMA.Ode3C11.ode	@ltx/gr_gr_cog/miscellanea:misc.Ode3
ltx/gr_gr_cog/me.m04.d03:meMA.Ode3C11.text	Οὐράνιον κτησάμενος, πολιτείαν ἔνδοξε, φωτοειδὴς καὶ ἔκλαμπρος, εὐσεβείας φωστὴρ γεγένησαι, διαπρέπων ἐνθέοις σου χαρίσμασι.
ltx/gr_gr_cog/me.m04.d03:meMA.Ode3C12.incipit	Νεκρώσας τὰ φρονήματα, τῆς σαρκός…
ltx/gr_gr_cog/me.m04.d03:meMA.Ode3C12.melody	@ltx/gr_gr_cog/he.h.m2:heHE.ExinthisenIErimos.name
ltx/gr_gr_cog/me.m04.d03:meMA.Ode3C12.mode	@ltx/gr_gr_cog/miscellanea:misc.Mode2
ltx/gr_gr_cog/me.m04.d03:meMA.Ode3C12.ode	@ltx/gr_gr_cog/miscellanea:misc.Ode3
ltx/gr_gr_cog/me.m04.d03:meMA.Ode3C12.text	Νεκρώσας τὰ φρονήματα, τῆς σαρκός σου πάνσοφε, διʼ ἀρετῆς ἐζώωσας, θεοφρόνως ψυχῆς τὸ ἔνθεον, καὶ ζωῆς τῆς ἀφθάρτου κατηξίωσαι.
ltx/gr_gr_cog/me.m04.d03:meMA.Ode3C13.incipit	Γηθόμενος διήνυσας, σοῦ τὸν βίον…
ltx/gr_gr_cog/me.m04.d03:meMA.Ode3C13.melody	@ltx/gr_gr_cog/he.h.m2:heHE.ExinthisenIErimos.name
ltx/gr_gr_cog/me.m04.d03:meMA.Ode3C13.mode	@ltx/gr_gr_cog/miscellanea:misc.Mode2
ltx/gr_gr_cog/me.m04.d03:meMA.Ode3C13.ode	@ltx/gr_gr_cog/miscellanea:misc.Ode3
ltx/gr_gr_cog/me.m04.d03:meMA.Ode3C13.text	Γηθόμενος διήνυσας, σοῦ τὸν βίον Ὅσιε, πεποικιλμένος κάλλεσι, καὶ ὡραίοις πλουτῶν χαρίσμασιν, ἐν οἷς ἐστερεώθη ἡ καρδία σου.
ltx/gr_gr_cog/me.m04.d03:meMA.Ode3C14.incipit	Ἐξέλαμψας ὡς ἥλιος, μοναζόντων τάγμασι…
ltx/gr_gr_cog/me.m04.d03:meMA.Ode3C14.melody	@ltx/gr_gr_cog/he.h.m2:heHE.ExinthisenIErimos.name
ltx/gr_gr_cog/me.m04.d03:meMA.Ode3C14.mode	@ltx/gr_gr_cog/miscellanea:misc.Mode2
ltx/gr_gr_cog/me.m04.d03:meMA.Ode3C14.ode	@ltx/gr_gr_cog/miscellanea:misc.Ode3
ltx/gr_gr_cog/me.m04.d03:meMA.Ode3C14.text	Ἐξέλαμψας ὡς ἥλιος, μοναζόντων τάγμασι, ταῖς ἀρεταῖς κοσμούμενος, ὦ Νικήτα θεόφρον Ὅσιε· διό σε γεγηθότες μακαρίζομεν.
ltx/gr_gr_cog/me.m04.d03:meMA.Ode3C1H.greekmelody	@ltx/gr_gr_cog/he.h.m2:heHE.ExinthisenIErimos.greekname
ltx/gr_gr_cog/me.m04.d03:meMA.Ode3C1H.incipit	@ltx/gr_gr_cog/he.h.m2:heHE.ExinthisenIErimos.incipit
ltx/gr_gr_cog/me.m04.d03:meMA.Ode3C1H.melody	@ltx/gr_gr_cog/he.h.m2:heHE.ExinthisenIErimos.melody
ltx/gr_gr_cog/me.m04.d03:meMA.Ode3C1H.mode	@ltx/gr_gr_cog/miscellanea:misc.Mode2
ltx/gr_gr_cog/me.m04.d03:meMA.Ode3C1H.ode	@ltx/gr_gr_cog/miscellanea:misc.Ode3
ltx/gr_gr_cog/me.m04.d03:meMA.Ode3C1H.text	@ltx/gr_gr_cog/he.h.m2:heHE.ExinthisenIErimos.text
ltx/gr_gr_cog/me.m04.d03:meMA.Ode3C1T.incipit	Ὡς μήτηρ κεκτημένη σύ, παῤῥησίαν…
ltx/gr_gr_cog/me.m04.d03:meMA.Ode3C1T.melody	@ltx/gr_gr_cog/he.h.m2:heHE.ExinthisenIErimos.name
ltx/gr_gr_cog/me.m04.d03:meMA.Ode3C1T.mode	@ltx/gr_gr_cog/miscellanea:misc.Mode2
ltx/gr_gr_cog/me.m04.d03:meMA.Ode3C1T.ode	@ltx/gr_gr_cog/miscellanea:misc.Ode3
ltx/gr_gr_cog/me.m04.d03:meMA.Ode3C1T.text	Ὡς μήτηρ κεκτημένη σύ, παῤῥησίαν Δέσποινα, πρὸς τὸν Υἱόν σου αἴτησαι, ἐπαμῦναι λαῷ καὶ ποίμνῃ σου, τῶν ἀνόμων δὲ θραῦσαι τὰ φρυάγματα.
ltx/gr_gr_cog/me.m04.d03:meMA.Ode3Kathisma1.greekmelody	@ltx/gr_gr_cog/he.a.m4:heAU.TachyProkatalave.greekname
ltx/gr_gr_cog/me.m04.d03:meMA.Ode3Kathisma1.incipit	Ηὐλίσθης ἐν ὄρεσι, τῆς ἡσυχίας…
ltx/gr_gr_cog/me.m04.d03:meMA.Ode3Kathisma1.melody	@ltx/gr_gr_cog/he.a.m4:heAU.TachyProkatalave.name
ltx/gr_gr_cog/me.m04.d03:meMA.Ode3Kathisma1.mode	@ltx/gr_gr_cog/miscellanea:misc.Mode4
ltx/gr_gr_cog/me.m04.d03:meMA.Ode3Kathisma1.text	Ηὐλίσθης ἐν ὄρεσι, τῆς ἡσυχίας σοφέ, ἐτράφης ἐν πόλεσι, τῆς ἐγκρατείας σαφῶς, ὑψώθης ἀμφοτέρωθεν, ἔλιπες χαμαιζήλου, ἡδονῆς πολιτείαν, ἔφθασας οὐρανίου, τὴν μονὴν κατοικίας, ἐν ᾗ καθικετεύεις ὑπὲρ ἡμῶν τὸν Θεόν.
ltx/gr_gr_cog/me.m04.d03:meMA.Ode3KathismaSt.incipit	Σταυρῷ σε ὑψούμενον, ὡς ἐθεάσατο…
ltx/gr_gr_cog/me.m04.d03:meMA.Ode3KathismaSt.melody	@ltx/gr_gr_cog/he.a.m4:heAU.TachyProkatalave.name
ltx/gr_gr_cog/me.m04.d03:meMA.Ode3KathismaSt.mode	@ltx/gr_gr_cog/miscellanea:misc.Mode4
ltx/gr_gr_cog/me.m04.d03:meMA.Ode3KathismaSt.text	Σταυρῷ σε ὑψούμενον, ὡς ἐθεάσατο, ἡ ἄμωμος Μήτηρ σου, Λόγε Θεοῦ μητρικῶς, θρηνοῦσα ἐφθέγγετο· Τί τὸ καινὸν καὶ ξένον, τοῦτο θαῦμα Υἱέ μου; πῶς ἡ ζωὴ τῶν ὅλων, ὁμιλεῖς τῷ θανάτῳ; ζωῶσαι τοὺς τεθνεῶτας θέλων ὡς εὔσπλαγχνος.
ltx/gr_gr_cog/me.m04.d03:meMA.Ode3KathismaT.incipit	Πολλοῖς πλημμελήμασιν, ἐγὼ ὁ ἄσωτος…
ltx/gr_gr_cog/me.m04.d03:meMA.Ode3KathismaT.melody	@ltx/gr_gr_cog/he.a.m4:heAU.TachyProkatalave.name
ltx/gr_gr_cog/me.m04.d03:meMA.Ode3KathismaT.mode	@ltx/gr_gr_cog/miscellanea:misc.Mode4
ltx/gr_gr_cog/me.m04.d03:meMA.Ode3KathismaT.text	Πολλοῖς πλημμελήμασιν, ἐγὼ ὁ ἄσωτος, τὸν νοῦν σκοτιζόμενος, ἐπιβοῶμαι τὴν σήν, βεβαίαν ἀντίληψιν. Φώτισον Θεοτόκε, τῆς ψυχῆς μου τὰς κόρας, λάμψον μοι μετανοίας, τὸ λαμπρότατον φέγγος, καὶ ἔνδυσόν με ὅπλα τοῦ φωτὸς Πανάμωμε.
ltx/gr_gr_cog/me.m04.d03:meMA.Ode4C11.greekmelody	@ltx/gr_gr_cog/he.h.m2:heHE.ElilythasEkParthenou.greekname
ltx/gr_gr_cog/me.m04.d03:meMA.Ode4C11.incipit	Ῥιζοτόμος, τῶν παθῶν θεοφόρε δεικνύμενος…
ltx/gr_gr_cog/me.m04.d03:meMA.Ode4C11.melody	@ltx/gr_gr_cog/he.h.m2:heHE.ElilythasEkParthenou.name
ltx/gr_gr_cog/me.m04.d03:meMA.Ode4C11.mode	@ltx/gr_gr_cog/miscellanea:misc.Mode2
ltx/gr_gr_cog/me.m04.d03:meMA.Ode4C11.ode	@ltx/gr_gr_cog/miscellanea:misc.Ode4
ltx/gr_gr_cog/me.m04.d03:meMA.Ode4C11.text	Ῥιζοτόμος, τῶν παθῶν θεοφόρε δεικνύμενος, ψυχῆς καθαρότητι, τῶν θεομάχων ἀνέσπασας, ἅπασαν ψυχόλεθρον, Ἱερομύστα ἀπάτην πανσεβάσμιε.
ltx/gr_gr_cog/me.m04.d03:meMA.Ode4C12.incipit	Ἀράμενος, τὸν τῆς νίκης πανόλβιε…
ltx/gr_gr_cog/me.m04.d03:meMA.Ode4C12.melody	@ltx/gr_gr_cog/he.h.m2:heHE.ElilythasEkParthenou.name
ltx/gr_gr_cog/me.m04.d03:meMA.Ode4C12.mode	@ltx/gr_gr_cog/miscellanea:misc.Mode2
ltx/gr_gr_cog/me.m04.d03:meMA.Ode4C12.ode	@ltx/gr_gr_cog/miscellanea:misc.Ode4
ltx/gr_gr_cog/me.m04.d03:meMA.Ode4C12.text	Ἀράμενος, τὸν τῆς νίκης πανόλβιε στέφανον, σκηναῖς οὐρανίοις νῦν, ἐπαναπαύῃ μακάριε, πάθη τιναξάμενος, καὶ τὴν ἀπάθειαν Πάτερ ἐνδυσάμενος.
ltx/gr_gr_cog/me.m04.d03:meMA.Ode4C13.incipit	Ἱερεῖον, ὥσπερ ἄμωμον Πάτερ τὸν…
ltx/gr_gr_cog/me.m04.d03:meMA.Ode4C13.melody	@ltx/gr_gr_cog/he.h.m2:heHE.ElilythasEkParthenou.name
ltx/gr_gr_cog/me.m04.d03:meMA.Ode4C13.mode	@ltx/gr_gr_cog/miscellanea:misc.Mode2
ltx/gr_gr_cog/me.m04.d03:meMA.Ode4C13.ode	@ltx/gr_gr_cog/miscellanea:misc.Ode4
ltx/gr_gr_cog/me.m04.d03:meMA.Ode4C13.text	Ἱερεῖον, ὥσπερ ἄμωμον Πάτερ τὸν βίον σου, Χριστῷ προσενήνοχας, θείας ἀγάπης ἀνάπλεων, καὶ τῷ τῆς ἀσκήσεως, ὡραϊζόμενον κάλλει παμμακάριστε.
ltx/gr_gr_cog/me.m04.d03:meMA.Ode4C14.incipit	Ῥητορείας, ψυχοφθόρου Παμμάκαρ αἱρέσεως, τρανῶς…
ltx/gr_gr_cog/me.m04.d03:meMA.Ode4C14.melody	@ltx/gr_gr_cog/he.h.m2:heHE.ElilythasEkParthenou.name
ltx/gr_gr_cog/me.m04.d03:meMA.Ode4C14.mode	@ltx/gr_gr_cog/miscellanea:misc.Mode2
ltx/gr_gr_cog/me.m04.d03:meMA.Ode4C14.ode	@ltx/gr_gr_cog/miscellanea:misc.Ode4
ltx/gr_gr_cog/me.m04.d03:meMA.Ode4C14.text	Ῥητορείας, ψυχοφθόρου Παμμάκαρ αἱρέσεως, τρανῶς ἐξεφαύλισας, Χριστοῦ τιμῶν θείαν μόρφωσιν, καὶ τῆς Θεομήτορος, καὶ τῶν Ἁγίων ἁπάντων ἱερώτατε.
ltx/gr_gr_cog/me.m04.d03:meMA.Ode4C1H.greekmelody	@ltx/gr_gr_cog/he.h.m2:heHE.ElilythasEkParthenou.greekname
ltx/gr_gr_cog/me.m04.d03:meMA.Ode4C1H.incipit	@ltx/gr_gr_cog/he.h.m2:heHE.ElilythasEkParthenou.incipit
ltx/gr_gr_cog/me.m04.d03:meMA.Ode4C1H.melody	@ltx/gr_gr_cog/he.h.m2:heHE.ElilythasEkParthenou.melody
ltx/gr_gr_cog/me.m04.d03:meMA.Ode4C1H.mode	@ltx/gr_gr_cog/miscellanea:misc.Mode2
ltx/gr_gr_cog/me.m04.d03:meMA.Ode4C1H.ode	@ltx/gr_gr_cog/miscellanea:misc.Ode4
ltx/gr_gr_cog/me.m04.d03:meMA.Ode4C1H.text	@ltx/gr_gr_cog/he.h.m2:heHE.ElilythasEkParthenou.text
ltx/gr_gr_cog/me.m04.d03:meMA.Ode4C1T.incipit	Σὲ λιμένα, σωτηρίας καὶ τεῖχος…
ltx/gr_gr_cog/me.m04.d03:meMA.Ode4C1T.melody	@ltx/gr_gr_cog/he.h.m2:heHE.ElilythasEkParthenou.name
ltx/gr_gr_cog/me.m04.d03:meMA.Ode4C1T.mode	@ltx/gr_gr_cog/miscellanea:misc.Mode2
ltx/gr_gr_cog/me.m04.d03:meMA.Ode4C1T.ode	@ltx/gr_gr_cog/miscellanea:misc.Ode4
ltx/gr_gr_cog/me.m04.d03:meMA.Ode4C1T.text	Σὲ λιμένα, σωτηρίας καὶ τεῖχος ἀκράδαντον, Θεοτόκε Δέσποινα, πάντες πιστοὶ ἐπιστάμεθα· σὺ γὰρ ταῖς πρεσβείαις σου, ἐκ τῶν κινδύνων λυτροῦσαι τὰς ψυχὰς ἡμῶν.
ltx/gr_gr_cog/me.m04.d03:meMA.Ode5C11.greekmelody	@ltx/gr_gr_cog/he.h.m2:heHE.MesitisTheou.greekname
ltx/gr_gr_cog/me.m04.d03:meMA.Ode5C11.incipit	Ὡς πρᾶος ἐν γῇ, τῶν…
ltx/gr_gr_cog/me.m04.d03:meMA.Ode5C11.melody	@ltx/gr_gr_cog/he.h.m2:heHE.MesitisTheou.name
ltx/gr_gr_cog/me.m04.d03:meMA.Ode5C11.mode	@ltx/gr_gr_cog/miscellanea:misc.Mode2
ltx/gr_gr_cog/me.m04.d03:meMA.Ode5C11.ode	@ltx/gr_gr_cog/miscellanea:misc.Ode5
ltx/gr_gr_cog/me.m04.d03:meMA.Ode5C11.text	Ὡς πρᾶος ἐν γῇ, τῶν πραέων ᾤκησας, Νικήτα σοφέ, μαχητὴς γενόμενος, ὑπὲρ ἀληθείας παναοίδιμε, καὶ τῆς ὁμολογίας, στέφει λαμπρῶς κοσμούμενος.
ltx/gr_gr_cog/me.m04.d03:meMA.Ode5C12.incipit	Πρὸς ἔνθεον φῶς, νῦν μετέστης…
ltx/gr_gr_cog/me.m04.d03:meMA.Ode5C12.melody	@ltx/gr_gr_cog/he.h.m2:heHE.MesitisTheou.name
ltx/gr_gr_cog/me.m04.d03:meMA.Ode5C12.mode	@ltx/gr_gr_cog/miscellanea:misc.Mode2
ltx/gr_gr_cog/me.m04.d03:meMA.Ode5C12.ode	@ltx/gr_gr_cog/miscellanea:misc.Ode5
ltx/gr_gr_cog/me.m04.d03:meMA.Ode5C12.text	Πρὸς ἔνθεον φῶς, νῦν μετέστης Ὅσιε, φωτὸς γεγονώς, υἱὸς ἐνδιάθετος, ἐν ἀγαλλιάσει καὶ τερπνότητι, σὺν χοροῖς τῶν Ἀγγέλων, χαρμονικῶς γηθόμενος.
ltx/gr_gr_cog/me.m04.d03:meMA.Ode5C13.incipit	Ἀφράστου τρυφῆς, Παραδείσου γέγονας νῦν…
ltx/gr_gr_cog/me.m04.d03:meMA.Ode5C13.melody	@ltx/gr_gr_cog/he.h.m2:heHE.MesitisTheou.name
ltx/gr_gr_cog/me.m04.d03:meMA.Ode5C13.mode	@ltx/gr_gr_cog/miscellanea:misc.Mode2
ltx/gr_gr_cog/me.m04.d03:meMA.Ode5C13.ode	@ltx/gr_gr_cog/miscellanea:misc.Ode5
ltx/gr_gr_cog/me.m04.d03:meMA.Ode5C13.text	Ἀφράστου τρυφῆς, Παραδείσου γέγονας νῦν μέτοχος· λιμὴν γὰρ πανεύδιος, τοῖς χειμαζομένοις ἀναδέδειξαι, καὶ λιμώττουσι μάκαρ, διατροφεὺς γεγένησαι.
ltx/gr_gr_cog/me.m04.d03:meMA.Ode5C1H.greekmelody	@ltx/gr_gr_cog/he.h.m2:heHE.MesitisTheou.greekname
ltx/gr_gr_cog/me.m04.d03:meMA.Ode5C1H.incipit	@ltx/gr_gr_cog/he.h.m2:heHE.MesitisTheou.incipit
ltx/gr_gr_cog/me.m04.d03:meMA.Ode5C1H.melody	@ltx/gr_gr_cog/he.h.m2:heHE.MesitisTheou.melody
ltx/gr_gr_cog/me.m04.d03:meMA.Ode5C1H.mode	@ltx/gr_gr_cog/miscellanea:misc.Mode2
ltx/gr_gr_cog/me.m04.d03:meMA.Ode5C1H.ode	@ltx/gr_gr_cog/miscellanea:misc.Ode5
ltx/gr_gr_cog/me.m04.d03:meMA.Ode5C1H.text	@ltx/gr_gr_cog/he.h.m2:heHE.MesitisTheou.text
ltx/gr_gr_cog/me.m04.d03:meMA.Ode5C1T.incipit	Δυσώπει τὸν σόν, Υἱὸν καὶ…
ltx/gr_gr_cog/me.m04.d03:meMA.Ode5C1T.melody	@ltx/gr_gr_cog/he.h.m2:heHE.MesitisTheou.name
ltx/gr_gr_cog/me.m04.d03:meMA.Ode5C1T.mode	@ltx/gr_gr_cog/miscellanea:misc.Mode2
ltx/gr_gr_cog/me.m04.d03:meMA.Ode5C1T.ode	@ltx/gr_gr_cog/miscellanea:misc.Ode5
ltx/gr_gr_cog/me.m04.d03:meMA.Ode5C1T.text	Δυσώπει τὸν σόν, Υἱὸν καὶ Κύριον Παρθένε ἁγνή, αἰχμαλώτοις λύτρωσιν, τοῖς ἐξ ἐναντίας περιστάσεως, ἐπὶ σοὶ πεποιθόσιν, εἰρηνικὴν δωρήσασθαι.
ltx/gr_gr_cog/me.m04.d03:meMA.Ode6C11.greekmelody	@ltx/gr_gr_cog/he.h.m2:heHE.EnAvyssoPtaismaton.greekname
ltx/gr_gr_cog/me.m04.d03:meMA.Ode6C11.incipit	Μακαρίων ἐλπίδων ἐπέτυχες, Πάτερ παμμακάριστε…
ltx/gr_gr_cog/me.m04.d03:meMA.Ode6C11.melody	@ltx/gr_gr_cog/he.h.m2:heHE.EnAvyssoPtaismaton.name
ltx/gr_gr_cog/me.m04.d03:meMA.Ode6C11.mode	@ltx/gr_gr_cog/miscellanea:misc.Mode2
ltx/gr_gr_cog/me.m04.d03:meMA.Ode6C11.ode	@ltx/gr_gr_cog/miscellanea:misc.Ode6
ltx/gr_gr_cog/me.m04.d03:meMA.Ode6C11.text	Μακαρίων ἐλπίδων ἐπέτυχες, Πάτερ παμμακάριστε, μακαριότητος, δεσποτικῆς γενόμενος, κληρονόμος καὶ θείας ἐλλάμψεως.
ltx/gr_gr_cog/me.m04.d03:meMA.Ode6C12.incipit	Φωτοφόρους λαμπάδας κατέχων διπλᾶς, τῆς…
ltx/gr_gr_cog/me.m04.d03:meMA.Ode6C12.melody	@ltx/gr_gr_cog/he.h.m2:heHE.EnAvyssoPtaismaton.name
ltx/gr_gr_cog/me.m04.d03:meMA.Ode6C12.mode	@ltx/gr_gr_cog/miscellanea:misc.Mode2
ltx/gr_gr_cog/me.m04.d03:meMA.Ode6C12.ode	@ltx/gr_gr_cog/miscellanea:misc.Ode6
ltx/gr_gr_cog/me.m04.d03:meMA.Ode6C12.text	Φωτοφόρους λαμπάδας κατέχων διπλᾶς, τῆς ὁμολογίας σου, καὶ τῆς ἀσκήσεως, εἰς οὐρανοὺς ἐχώρησας, θεοφόρε Νικήτα πανάριστε.
ltx/gr_gr_cog/me.m04.d03:meMA.Ode6C13.incipit	Ἀπολαύων ἀλήκτου καὶ θείας τρυφῆς…
ltx/gr_gr_cog/me.m04.d03:meMA.Ode6C13.melody	@ltx/gr_gr_cog/he.h.m2:heHE.EnAvyssoPtaismaton.name
ltx/gr_gr_cog/me.m04.d03:meMA.Ode6C13.mode	@ltx/gr_gr_cog/miscellanea:misc.Mode2
ltx/gr_gr_cog/me.m04.d03:meMA.Ode6C13.ode	@ltx/gr_gr_cog/miscellanea:misc.Ode6
ltx/gr_gr_cog/me.m04.d03:meMA.Ode6C13.text	Ἀπολαύων ἀλήκτου καὶ θείας τρυφῆς, ἐν ἐπουρανίοις νῦν Πάτερ σκηνώμασιν, ὑπὲρ ἡμῶν δυσώπησον, τὸν τῶν ὅλων Δεσπότην καὶ Κύριον.
ltx/gr_gr_cog/me.m04.d03:meMA.Ode6C1H.greekmelody	@ltx/gr_gr_cog/he.h.m2:heHE.EnAvyssoPtaismaton.greekname
ltx/gr_gr_cog/me.m04.d03:meMA.Ode6C1H.incipit	@ltx/gr_gr_cog/he.h.m2:heHE.EnAvyssoPtaismaton.incipit
ltx/gr_gr_cog/me.m04.d03:meMA.Ode6C1H.melody	@ltx/gr_gr_cog/he.h.m2:heHE.EnAvyssoPtaismaton.melody
ltx/gr_gr_cog/me.m04.d03:meMA.Ode6C1H.mode	@ltx/gr_gr_cog/miscellanea:misc.Mode2
ltx/gr_gr_cog/me.m04.d03:meMA.Ode6C1H.ode	@ltx/gr_gr_cog/miscellanea:misc.Ode6
ltx/gr_gr_cog/me.m04.d03:meMA.Ode6C1H.text	@ltx/gr_gr_cog/he.h.m2:heHE.EnAvyssoPtaismaton.text
ltx/gr_gr_cog/me.m04.d03:meMA.Ode6C1T.incipit	Ἀπειράνδρως Παρθένε ἐκύησας, καὶ διαιωνίζεις…
ltx/gr_gr_cog/me.m04.d03:meMA.Ode6C1T.melody	@ltx/gr_gr_cog/he.h.m2:heHE.EnAvyssoPtaismaton.name
ltx/gr_gr_cog/me.m04.d03:meMA.Ode6C1T.mode	@ltx/gr_gr_cog/miscellanea:misc.Mode2
ltx/gr_gr_cog/me.m04.d03:meMA.Ode6C1T.ode	@ltx/gr_gr_cog/miscellanea:misc.Ode6
ltx/gr_gr_cog/me.m04.d03:meMA.Ode6C1T.text	Ἀπειράνδρως Παρθένε ἐκύησας, καὶ διαιωνίζεις παρθένος ἐμφαίνουσα, τῆς ἀληθοῦς Θεότητος, τοῦ Υἱοῦ καὶ Θεοῦ σου τὰ σύμβολα.
ltx/gr_gr_cog/me.m04.d03:meMA.Ode7C11.greekmelody	@ltx/gr_gr_cog/he.h.m2:heHE.AntitheonProstagma.greekname
ltx/gr_gr_cog/me.m04.d03:meMA.Ode7C11.incipit	Ἡ σὴ ἐπιείκεια διαφερόντως, εἰς…
ltx/gr_gr_cog/me.m04.d03:meMA.Ode7C11.melody	@ltx/gr_gr_cog/he.h.m2:heHE.AntitheonProstagma.name
ltx/gr_gr_cog/me.m04.d03:meMA.Ode7C11.mode	@ltx/gr_gr_cog/miscellanea:misc.Mode2
ltx/gr_gr_cog/me.m04.d03:meMA.Ode7C11.ode	@ltx/gr_gr_cog/miscellanea:misc.Ode7
ltx/gr_gr_cog/me.m04.d03:meMA.Ode7C11.text	Ἡ σὴ ἐπιείκεια διαφερόντως, εἰς χοῦν ἐταπείνωσε τυράννου τὴν ὠμότητα, συντόνοις δεήσεσι τοῦτον νεκρώσασα· οἶδε γὰρ τὸ θέλημα ποιεῖν τῶν φοβουμένων αὐτόν ὁ Κύριος.
ltx/gr_gr_cog/me.m04.d03:meMA.Ode7C12.incipit	Βροντὴ τῶν δογμάτων σου, καὶ…
ltx/gr_gr_cog/me.m04.d03:meMA.Ode7C12.melody	@ltx/gr_gr_cog/he.h.m2:heHE.AntitheonProstagma.name
ltx/gr_gr_cog/me.m04.d03:meMA.Ode7C12.mode	@ltx/gr_gr_cog/miscellanea:misc.Mode2
ltx/gr_gr_cog/me.m04.d03:meMA.Ode7C12.ode	@ltx/gr_gr_cog/miscellanea:misc.Ode7
ltx/gr_gr_cog/me.m04.d03:meMA.Ode7C12.text	Βροντὴ τῶν δογμάτων σου, καὶ ἡ φωσφόρος, ἀστραπὴ τοῦ βίου σου, τὸν κόσμον κατεφαίδρυνε, πιστοὺς καταυγάζουσα θεοφεγγέσι πυρσοῖς, λόγοις τε καὶ πράξεσι φαιδραῖς, Ἱερομύστα θεομακάριστε.
ltx/gr_gr_cog/me.m04.d03:meMA.Ode7C13.incipit	Ἰσχύι νευρούμενος τοῦ Παρακλήτου, δαιμόνων…
ltx/gr_gr_cog/me.m04.d03:meMA.Ode7C13.melody	@ltx/gr_gr_cog/he.h.m2:heHE.AntitheonProstagma.name
ltx/gr_gr_cog/me.m04.d03:meMA.Ode7C13.mode	@ltx/gr_gr_cog/miscellanea:misc.Mode2
ltx/gr_gr_cog/me.m04.d03:meMA.Ode7C13.ode	@ltx/gr_gr_cog/miscellanea:misc.Ode7
ltx/gr_gr_cog/me.m04.d03:meMA.Ode7C13.text	Ἰσχύι νευρούμενος τοῦ Παρακλήτου, δαιμόνων τὰς φάλαγγας καὶ βρόχους τῶν αἱρέσεων, θεόφρον διέφυγες καὶ πρὸς οὐράνιον, ὕψος ἀνελήλυθας, χοροῖς τῶν Ἀσωμάτων νῦν αὐλιζόμενος.
ltx/gr_gr_cog/me.m04.d03:meMA.Ode7C1H.greekmelody	@ltx/gr_gr_cog/he.h.m2:heHE.AntitheonProstagma.greekname
ltx/gr_gr_cog/me.m04.d03:meMA.Ode7C1H.incipit	@ltx/gr_gr_cog/he.h.m2:heHE.AntitheonProstagma.incipit
ltx/gr_gr_cog/me.m04.d03:meMA.Ode7C1H.melody	@ltx/gr_gr_cog/he.h.m2:heHE.AntitheonProstagma.melody
ltx/gr_gr_cog/me.m04.d03:meMA.Ode7C1H.mode	@ltx/gr_gr_cog/miscellanea:misc.Mode2
ltx/gr_gr_cog/me.m04.d03:meMA.Ode7C1H.ode	@ltx/gr_gr_cog/miscellanea:misc.Ode7
ltx/gr_gr_cog/me.m04.d03:meMA.Ode7C1H.text	@ltx/gr_gr_cog/he.h.m2:heHE.AntitheonProstagma.text
ltx/gr_gr_cog/me.m04.d03:meMA.Ode7C1T.incipit	Ἁγίων Ἁγίαν σε κατανοοῦμεν, ὡς…
ltx/gr_gr_cog/me.m04.d03:meMA.Ode7C1T.melody	@ltx/gr_gr_cog/he.h.m2:heHE.AntitheonProstagma.name
ltx/gr_gr_cog/me.m04.d03:meMA.Ode7C1T.mode	@ltx/gr_gr_cog/miscellanea:misc.Mode2
ltx/gr_gr_cog/me.m04.d03:meMA.Ode7C1T.ode	@ltx/gr_gr_cog/miscellanea:misc.Ode7
ltx/gr_gr_cog/me.m04.d03:meMA.Ode7C1T.text	Ἁγίων Ἁγίαν σε κατανοοῦμεν, ὡς μόνην κυήσασαν, Θεὸν τὸν ἀναλλοίωτον, Παρθένε ἀμόλυντε, Μήτηρ ἀνύμφευτε· πᾶσι γὰρ ἐπήγασας πιστοῖς, τὴν ἀφθαρσίαν τῷ θείῳ τόκῳ σου.
ltx/gr_gr_cog/me.m04.d03:meMA.Ode8C11.greekmelody	@ltx/gr_gr_cog/he.h.m2:heHE.KaminosPote.greekname
ltx/gr_gr_cog/me.m04.d03:meMA.Ode8C11.incipit	Ὅλην ὑπερβάς, τὴν αἴσθησιν Τρισμάκαρ…
ltx/gr_gr_cog/me.m04.d03:meMA.Ode8C11.melody	@ltx/gr_gr_cog/he.h.m2:heHE.KaminosPote.name
ltx/gr_gr_cog/me.m04.d03:meMA.Ode8C11.mode	@ltx/gr_gr_cog/miscellanea:misc.Mode2
ltx/gr_gr_cog/me.m04.d03:meMA.Ode8C11.ode	@ltx/gr_gr_cog/miscellanea:misc.Ode8
ltx/gr_gr_cog/me.m04.d03:meMA.Ode8C11.text	Ὅλην ὑπερβάς, τὴν αἴσθησιν Τρισμάκαρ, τῷ νοητῷ νῦν προσωμίλησας, φωτὶ πανσεβάσμιε, θεοπτίας ἀξιούμενος, καὶ φωτισμοῦ πληρούμενος, κράζων· Ὑπερυψοῦτε, πάντα τὰ ἔργα τὸν Κύριον.
ltx/gr_gr_cog/me.m04.d03:meMA.Ode8C12.incipit	Νέκρωσιν παθῶν, σαφῶς ἐνδεδυμένος, πρὸς…
ltx/gr_gr_cog/me.m04.d03:meMA.Ode8C12.melody	@ltx/gr_gr_cog/he.h.m2:heHE.KaminosPote.name
ltx/gr_gr_cog/me.m04.d03:meMA.Ode8C12.mode	@ltx/gr_gr_cog/miscellanea:misc.Mode2
ltx/gr_gr_cog/me.m04.d03:meMA.Ode8C12.ode	@ltx/gr_gr_cog/miscellanea:misc.Ode8
ltx/gr_gr_cog/me.m04.d03:meMA.Ode8C12.text	Νέκρωσιν παθῶν, σαφῶς ἐνδεδυμένος, πρὸς ζωηφόρον ἐπεδήμησας, χορείαν Πανόλβιε, εὐσεβείᾳ πυρπολούμενος, καὶ ἀρεταῖς λαμπόμενος, κράζων· Ὑπερυψοῦτε, πάντα τὰ ἔργα τὸν Κύριον.
ltx/gr_gr_cog/me.m04.d03:meMA.Ode8C13.incipit	Πᾶσαν ἀρετήν, ἐκ βρέφους ἐξασκήσας…
ltx/gr_gr_cog/me.m04.d03:meMA.Ode8C13.melody	@ltx/gr_gr_cog/he.h.m2:heHE.KaminosPote.name
ltx/gr_gr_cog/me.m04.d03:meMA.Ode8C13.mode	@ltx/gr_gr_cog/miscellanea:misc.Mode2
ltx/gr_gr_cog/me.m04.d03:meMA.Ode8C13.ode	@ltx/gr_gr_cog/miscellanea:misc.Ode8
ltx/gr_gr_cog/me.m04.d03:meMA.Ode8C13.text	Πᾶσαν ἀρετήν, ἐκ βρέφους ἐξασκήσας, ἐπὶ τῷ τέλει τῶν ἀγώνων σου, στεφάνῳ κοσμούμενος, τῶν χαρίτων ἀναδέδειξαι, καὶ τὸ βραβεῖον εἴληφας, ψάλλων· Ὑπερυψοῦτε, πάντα τὰ ἔργα τὸν Κύριον.
ltx/gr_gr_cog/me.m04.d03:meMA.Ode8C14.incipit	Ἀνωθεν ἡμᾶς, νῦν ἐποπτεύεις Πάτερ…
ltx/gr_gr_cog/me.m04.d03:meMA.Ode8C14.melody	@ltx/gr_gr_cog/he.h.m2:heHE.KaminosPote.name
ltx/gr_gr_cog/me.m04.d03:meMA.Ode8C14.mode	@ltx/gr_gr_cog/miscellanea:misc.Mode2
ltx/gr_gr_cog/me.m04.d03:meMA.Ode8C14.ode	@ltx/gr_gr_cog/miscellanea:misc.Ode8
ltx/gr_gr_cog/me.m04.d03:meMA.Ode8C14.text	Ἀνωθεν ἡμᾶς, νῦν ἐποπτεύεις Πάτερ, τῷ σῷ Δεσπότῃ παριστάμενος, Νικήτα φερώνυμε, παῤῥησίᾳ πολλῇ χρώμενος, καὶ ψυχικὴν αἰτούμενος, ἔνδοξε σωτηρίαν, ἱεροφάντορ τῇ Ποίμνῃ σου.
ltx/gr_gr_cog/me.m04.d03:meMA.Ode8C1H.greekmelody	@ltx/gr_gr_cog/he.h.m2:heHE.KaminosPote.greekname
ltx/gr_gr_cog/me.m04.d03:meMA.Ode8C1H.incipit	@ltx/gr_gr_cog/he.h.m2:heHE.KaminosPote.incipit
ltx/gr_gr_cog/me.m04.d03:meMA.Ode8C1H.melody	@ltx/gr_gr_cog/he.h.m2:heHE.KaminosPote.melody
ltx/gr_gr_cog/me.m04.d03:meMA.Ode8C1H.mode	@ltx/gr_gr_cog/miscellanea:misc.Mode2
ltx/gr_gr_cog/me.m04.d03:meMA.Ode8C1H.ode	@ltx/gr_gr_cog/miscellanea:misc.Ode8
ltx/gr_gr_cog/me.m04.d03:meMA.Ode8C1H.text	@ltx/gr_gr_cog/he.h.m2:heHE.KaminosPote.text
ltx/gr_gr_cog/me.m04.d03:meMA.Ode8C1T.incipit	Σὺ τὸν τοῦ Πατρός, ἀχώριστον…
ltx/gr_gr_cog/me.m04.d03:meMA.Ode8C1T.melody	@ltx/gr_gr_cog/he.h.m2:heHE.KaminosPote.name
ltx/gr_gr_cog/me.m04.d03:meMA.Ode8C1T.mode	@ltx/gr_gr_cog/miscellanea:misc.Mode2
ltx/gr_gr_cog/me.m04.d03:meMA.Ode8C1T.ode	@ltx/gr_gr_cog/miscellanea:misc.Ode8
ltx/gr_gr_cog/me.m04.d03:meMA.Ode8C1T.text	Σὺ τὸν τοῦ Πατρός, ἀχώριστον ἐν μήτρᾳ, θεανδρικῶς πολιτευσάμενον, ἀσπόρως συνέλαβες, καὶ ἀφράστως ἀπεκύησας, Θεογεννῆτορ ἄχραντε· ὅθεν σε σωτηρίαν, πάντων ἡμῶν ἐπιστάμεθα.
ltx/gr_gr_cog/me.m04.d03:meMA.Ode9C11.greekmelody	@ltx/gr_gr_cog/he.h.m2:heHE.AnarchouGennitoros.greekname
ltx/gr_gr_cog/me.m04.d03:meMA.Ode9C11.incipit	Τῆς θείας λαμπρότητος, ὡς καθαρὸς…
ltx/gr_gr_cog/me.m04.d03:meMA.Ode9C11.melody	@ltx/gr_gr_cog/he.h.m2:heHE.AnarchouGennitoros.name
ltx/gr_gr_cog/me.m04.d03:meMA.Ode9C11.mode	@ltx/gr_gr_cog/miscellanea:misc.Mode2
ltx/gr_gr_cog/me.m04.d03:meMA.Ode9C11.ode	@ltx/gr_gr_cog/miscellanea:misc.Ode9
ltx/gr_gr_cog/me.m04.d03:meMA.Ode9C11.text	Τῆς θείας λαμπρότητος, ὡς καθαρὸς ἠξίωσαι, ἀρετῶν ταῖς ἰδέαις ἐξαστραπτόμενος, καὶ ὁμολογίας στεφάνῳ, διαπαντὸς ἐκλελαμπρυσμένος· διὸ τὴν πανένδοξον, ἑορτήν σου νῦν γεραίρομεν.
ltx/gr_gr_cog/me.m04.d03:meMA.Ode9C12.incipit	Ἐμφρόνως μακάριε, σοῦ τὴν ζωὴν…
ltx/gr_gr_cog/me.m04.d03:meMA.Ode9C12.melody	@ltx/gr_gr_cog/he.h.m2:heHE.AnarchouGennitoros.name
ltx/gr_gr_cog/me.m04.d03:meMA.Ode9C12.mode	@ltx/gr_gr_cog/miscellanea:misc.Mode2
ltx/gr_gr_cog/me.m04.d03:meMA.Ode9C12.ode	@ltx/gr_gr_cog/miscellanea:misc.Ode9
ltx/gr_gr_cog/me.m04.d03:meMA.Ode9C12.text	Ἐμφρόνως μακάριε, σοῦ τὴν ζωὴν διήνυσας, προσταγαῖς τοῦ Σωτῆρος διευθυνόμενος, νῦν δὲ τῆς σκιᾶς παρηγμένης, περιχαρῶς ζωῆς αἰωνίου, ἀξίως τετύχηκας, θεοῤῥῆμον ἱερώτατε.
ltx/gr_gr_cog/me.m04.d03:meMA.Ode9C13.incipit	Ῥεόντων ὀξύτατα, παρέδραμες τὸν τάραχον…
ltx/gr_gr_cog/me.m04.d03:meMA.Ode9C13.melody	@ltx/gr_gr_cog/he.h.m2:heHE.AnarchouGennitoros.name
ltx/gr_gr_cog/me.m04.d03:meMA.Ode9C13.mode	@ltx/gr_gr_cog/miscellanea:misc.Mode2
ltx/gr_gr_cog/me.m04.d03:meMA.Ode9C13.ode	@ltx/gr_gr_cog/miscellanea:misc.Ode9
ltx/gr_gr_cog/me.m04.d03:meMA.Ode9C13.text	Ῥεόντων ὀξύτατα, παρέδραμες τὸν τάραχον, γαληνῷ δὲ Νικήτα τῆς βασιλείας Χριστοῦ, χαίρων προσωρμίσθης λιμένι, πρὸς ὃν ἡμᾶς ὁδήγησον Πάτερ, τοὺς σὲ μακαρίζοντας, καὶ τὴν μνήμην σου γεραίροντας.
ltx/gr_gr_cog/me.m04.d03:meMA.Ode9C1H.greekmelody	@ltx/gr_gr_cog/he.h.m2:heHE.AnarchouGennitoros.greekname
ltx/gr_gr_cog/me.m04.d03:meMA.Ode9C1H.incipit	@ltx/gr_gr_cog/he.h.m2:heHE.AnarchouGennitoros.incipit
ltx/gr_gr_cog/me.m04.d03:meMA.Ode9C1H.melody	@ltx/gr_gr_cog/he.h.m2:heHE.AnarchouGennitoros.melody
ltx/gr_gr_cog/me.m04.d03:meMA.Ode9C1H.mode	@ltx/gr_gr_cog/miscellanea:misc.Mode2
ltx/gr_gr_cog/me.m04.d03:meMA.Ode9C1H.ode	@ltx/gr_gr_cog/miscellanea:misc.Ode9
ltx/gr_gr_cog/me.m04.d03:meMA.Ode9C1H.text	@ltx/gr_gr_cog/he.h.m2:heHE.AnarchouGennitoros.text
ltx/gr_gr_cog/me.m04.d03:meMA.Ode9C1T.incipit	Ὡς πόκος Πανάμωμε, τὸν ὄμβρον…
ltx/gr_gr_cog/me.m04.d03:meMA.Ode9C1T.melody	@ltx/gr_gr_cog/he.h.m2:heHE.AnarchouGennitoros.name
ltx/gr_gr_cog/me.m04.d03:meMA.Ode9C1T.mode	@ltx/gr_gr_cog/miscellanea:misc.Mode2
ltx/gr_gr_cog/me.m04.d03:meMA.Ode9C1T.ode	@ltx/gr_gr_cog/miscellanea:misc.Ode9
ltx/gr_gr_cog/me.m04.d03:meMA.Ode9C1T.text	Ὡς πόκος Πανάμωμε, τὸν ὄμβρον τὸν οὐράνιον, ἐν γαστρὶ δεξαμένη, ἡμῖν ἐκτέτοκας, τὸν τὴν ἀμβροσίαν διδοῦντα, πᾶσι βροτοῖς αὐτὸν προσκυνοῦσι, καὶ σὲ τὴν πανύμνητον, Θεοτόκον μεγαλύνουσι.
ltx/gr_gr_cog/me.m04.d03:meVE.Apolytikion1ger.greekmelody	@ltx/gr_gr_cog/he.a.m4:heAU.TachyProkatalave.greekname
ltx/gr_gr_cog/me.m04.d03:meVE.Apolytikion1ger.incipit	Ὡς νίκης ἐπώνυμος, τῶν θεοσδότων…
ltx/gr_gr_cog/me.m04.d03:meVE.Apolytikion1ger.melody	@ltx/gr_gr_cog/he.a.m4:heAU.TachyProkatalave.name
ltx/gr_gr_cog/me.m04.d03:meVE.Apolytikion1ger.mode	@ltx/gr_gr_cog/miscellanea:misc.Mode4
ltx/gr_gr_cog/me.m04.d03:meVE.Apolytikion1ger.poet	@ltx/gr_gr_cog/poets:po.Gerasimou
ltx/gr_gr_cog/me.m04.d03:meVE.Apolytikion1ger.text	Ὡς νίκης ἐπώνυμος, τῶν θεοσδότων θεσμῶν, φρουρὸς ἀπερίτρεπτος καὶ στῦλος ὤφθης στεῤῥός, Νικήτα μακάριε· σὺ γὰρ τῆς ἀπαθείας, κοσμηθεὶς ταῖς ἀκτῖσιν, αἴγλη ὁμολογίας, τὸν σὸν βίον φαιδρύνεις. Καὶ νῦν τῶν σοὶ προσιόντων, δέχουν τὴν αἴνεσιν.
ltx/gr_gr_cog/me.m04.d03:meVE.Apolytikion2ger.greekmelody	@ltx/gr_gr_cog/he.a.m3:heAU.TinOraiotita.greekname
ltx/gr_gr_cog/me.m04.d03:meVE.Apolytikion2ger.incipit	Τὸ δωδεκάχορδον τοῦ Λόγου ὄργανον…
ltx/gr_gr_cog/me.m04.d03:meVE.Apolytikion2ger.melody	@ltx/gr_gr_cog/he.a.m3:heAU.TinOraiotita.name
ltx/gr_gr_cog/me.m04.d03:meVE.Apolytikion2ger.mode	@ltx/gr_gr_cog/miscellanea:misc.Mode3
ltx/gr_gr_cog/me.m04.d03:meVE.Apolytikion2ger.poet	@ltx/gr_gr_cog/poets:po.Gerasimou
ltx/gr_gr_cog/me.m04.d03:meVE.Apolytikion2ger.text	Τὸ δωδεκάχορδον τοῦ Λόγου ὄργανον, τὴν παναρμόνιον λύραν τῆς χάριτος, τὸν Ὑμνογράφον Ἰωσὴφ τιμήσωμεν ἐπαξίως· οὗτος γὰρ ἀνύμνησε, μελιχροῖς μελῳδήμασι, Πνεύματι κινούμενος, τῶν Ἁγίων πᾶν σύστημα. Μεθʼ ὧν καὶ ἱκετεύει ἀπαύστως, δοῦναι ἡμῖν πταισμάτων λύσιν.
ltx/gr_gr_cog/me.m04.d03:meVE.SticStavrotheotokion.greekmelody	@ltx/gr_gr_cog/he.a.m2:heAU.OteEkTouXylou.greekname
ltx/gr_gr_cog/me.m04.d03:meVE.SticStavrotheotokion.incipit	Σκότος, ἐνεδύσατο ποτέ, ἥλιος ὁρῶν…
ltx/gr_gr_cog/me.m04.d03:meVE.SticStavrotheotokion.melody	@ltx/gr_gr_cog/he.a.m2:heAU.OteEkTouXylou.name
ltx/gr_gr_cog/me.m04.d03:meVE.SticStavrotheotokion.mode	@ltx/gr_gr_cog/miscellanea:misc.Mode2
ltx/gr_gr_cog/me.m04.d03:meVE.SticStavrotheotokion.text	Σκότος, ἐνεδύσατο ποτέ, ἥλιος ὁρῶν σε ἐν ξύλῳ, Σῶτερ κρεμάμενον, ἔφριξαν δὲ κάτωθι τὰ καταχθόνια, καὶ νεκροὶ ἐξανέστησαν, ἐῤῥάγησαν πέτραι, καὶ τὰ ἐπουράνια πάντα ἐξέστησαν, σοῦ δὲ τῷ Σταυρῷ παρεστῶσα, ἔκλαιεν ἡ ἄχραντος Κόρη, ἀνυμνολογοῦσά σε φιλάνθρωπε.
ltx/gr_gr_cog/me.m04.d03:meVE.SticTheotokion.greekmelody	@ltx/gr_gr_cog/he.a.m2:heAU.OteEkTouXylou.greekname
ltx/gr_gr_cog/me.m04.d03:meVE.SticTheotokion.incipit	Στένω ἐκ βαθέων τῆς ψυχῆς…
ltx/gr_gr_cog/me.m04.d03:meVE.SticTheotokion.melody	@ltx/gr_gr_cog/he.a.m2:heAU.OteEkTouXylou.name
ltx/gr_gr_cog/me.m04.d03:meVE.SticTheotokion.mode	@ltx/gr_gr_cog/miscellanea:misc.Mode2
ltx/gr_gr_cog/me.m04.d03:meVE.SticTheotokion.text	Στένω ἐκ βαθέων τῆς ψυχῆς, ὅταν ἐννοήσω μου Κόρη, τὰ πλημμελήματα, τύπτω δὲ τὸ στῆθός μου, κράζων τό, Ἥμαρτον, καὶ προσπίπτω σοι Δέσποινα, ζητῶν μεταγνῶναι, πάλιν δὲ ἠλίθιος ὢν, περιπείρομαι· Οἴμοι τῇ κακῇ συνηθείᾳ. Ταύτης οὖν με λύτρωσαι τάχει, καὶ πρὸς σωτηρίαν καθοδήγησον.
ltx/gr_gr_cog/me.m04.d03:meVE.Stichera01.greekmelody	@ltx/gr_gr_cog/he.a.m2:heAU.OteEkTouXylou.greekname
ltx/gr_gr_cog/me.m04.d03:meVE.Stichera01.incipit	Λόγῳ κυβερνώμενος ψυχῶν, θεῖος οἰκονόμος…
ltx/gr_gr_cog/me.m04.d03:meVE.Stichera01.melody	@ltx/gr_gr_cog/he.a.m2:heAU.OteEkTouXylou.name
ltx/gr_gr_cog/me.m04.d03:meVE.Stichera01.mode	@ltx/gr_gr_cog/miscellanea:misc.Mode2
ltx/gr_gr_cog/me.m04.d03:meVE.Stichera01.text	Λόγῳ κυβερνώμενος ψυχῶν, θεῖος οἰκονόμος ἐδείχθης, μυσταγωγός τε πιστός, σπέρματα σωτήρια καταβαλλόμενος, καὶ θερίζων τὸν ἄσταχυν, πολύχουν θεόφρον, τοῦτον τῷ Δεσπότῃ σου, φέρεις γηθόμενος, ᾧ νῦν παριστάμενος μάκαρ, μέμνησο τῆς ποίμνης σου ταύτης, τῆς ἀεὶ τιμώσης σε θεόπνευστε.
ltx/gr_gr_cog/me.m04.d03:meVE.Stichera02.incipit	Πρᾶος, πεφυκὼς καὶ προσηνής, τῆς…
ltx/gr_gr_cog/me.m04.d03:meVE.Stichera02.melody	@ltx/gr_gr_cog/he.a.m2:heAU.OteEkTouXylou.name
ltx/gr_gr_cog/me.m04.d03:meVE.Stichera02.mode	@ltx/gr_gr_cog/miscellanea:misc.Mode2
ltx/gr_gr_cog/me.m04.d03:meVE.Stichera02.text	Πρᾶος, πεφυκὼς καὶ προσηνής, τῆς Ὀρθοδοξίας τῷ ζήλῳ, ὤφθης μαχόμενος· πίστιν γὰρ ὡς θώρακα περιβαλλόμενος, καὶ ὡς δόρυ ἐγκράτειαν, Νικήτα θεόφρον, ἅπασαν τὴν βλάσφημον, αἵρεσιν ἤλεγξας, θείαν, τοῦ Σωτῆρος εἰκόνα, σέβων καὶ τιμῶν θεοφόρε, ὅροις πατρικοῖς σαφῶς ἑπόμενος.
ltx/gr_gr_cog/me.m04.d03:meVE.Stichera03.incipit	Ὅτε ἐξορίαις σε πικραῖς, καὶ…
ltx/gr_gr_cog/me.m04.d03:meVE.Stichera03.melody	@ltx/gr_gr_cog/he.a.m2:heAU.OteEkTouXylou.name
ltx/gr_gr_cog/me.m04.d03:meVE.Stichera03.mode	@ltx/gr_gr_cog/miscellanea:misc.Mode2
ltx/gr_gr_cog/me.m04.d03:meVE.Stichera03.text	Ὅτε ἐξορίαις σε πικραῖς, καὶ σκοτεινοτάτοις ἐν τόποις, ὁ σκοτεινότατος, τύραννος κατέκλεισε θηρῶν ὠμότητι, Παραδείσου τὴν οἴκησιν, ἐν νῷ περιφέρων, χαίρων τε τῷ πνεύματι, Πάτερ ὑπέμεινας, οὗ νῦν, τὴν εὐπρέπειαν βλέπειν, ὄντως κατηξίωσαι μάκαρ, τὰ τῶν πόνων ἔπαθλα δρεπόμενος.
