ltx/gr_gr_cog/le.pr.me.r10:leprVE.reading.book_abbr	@ltx/gr_gr_cog/bible:Isaiah.abbr
ltx/gr_gr_cog/le.pr.me.r10:leprVE.reading.book_string	@ltx/gr_gr_cog/bible:Isaiah.text
ltx/gr_gr_cog/le.pr.me.r10:leprVE.reading.chapverse	49, 8 – 15
ltx/gr_gr_cog/le.pr.me.r10:leprVE.reading.incipit	Τάδε λέγει Κύριος· Καιρῷ δεκτῷ ἐπήκουσά σου, καὶ ἐν…
ltx/gr_gr_cog/le.pr.me.r10:leprVE.reading.text	Τάδε λέγει Κύριος· Καιρῷ δεκτῷ ἐπήκουσά σου, καὶ ἐν ἡμέρᾳ σωτηρίας ἐβοήθησά σοι, καὶ ἔπλασά σε, καὶ ἔδωκά σε, καὶ ἔθηκά σε εἰς Διαθήκην Ἐθνῶν, τοῦ κατακτῆσαι τὴν γῆν, καὶ κατακληρονομῆσαι κληρονομίας ἐρήμους, λέγοντα τοῖς ἐν δεσμοῖς· Ἐξέλθετε, καὶ τοῖς ἐν τῷ σκότει, Ἀνακαλύπτεσθε· ἐν πάσαις ταῖς ὁδοῖς βοσκηθήσονται, καὶ ἐν πάσαις ταῖς τρίβοις ἡ νομὴ αὐτῶν, οὐ πεινάσουσιν, οὐδὲ διψήσουσιν, οὐδὲ πατάξει αὐτοὺς ὁ καύσων, οὐδὲ ὁ ἥλιος, ἀλλ᾽ ὁ ἐλεῶν αὐτούς, παρακαλέσει αὐτούς, καὶ διὰ πηγῶν ὑδάτων ἄξει αὐτούς. Καὶ θήσω πᾶν ὄρος εἰς ὁδόν, καὶ πᾶσαν τρίβον εἰς βόσκημα αὐτοῖς. Ἰδοὺ οὗτοι πόῤῥωθεν ἥξουσιν, οὗτοι ἀπὸ Βοῤῥᾶ καὶ θαλάσσης, ἄλλοι δὲ ἐκ γῆς Περσῶν. Εὐφραινέσθωσαν οἱ οὐρανοί, καὶ ἀγαλλιάσθω ἡ γῆ, ῥηξάτω τὰ ὅρη εὐφροσύνην, καὶ οἱ βουνοὶ δικαιοσύνην, ὅτι ἠλέησεν ὁ Θεὸς τὸν λαὸν αὐτοῦ, καὶ τοὺς ταπεινοὺς τοῦ λαοῦ αὐτοῦ παρεκάλεσεν. Εἶπε δὲ Σιών· Ἐγκατέλιπέ με Κύριος, καὶ ὁ Κύριος ἐπελάθετό μου. Μὴ ἐπιλήσεται γυνὴ τοῦ παιδίου αὐτῆς, ἢ τοῦ μὴ ἐλεῆσαι τὰ ἔγγονα τῆς κοιλίας αὐτῆς; Εἰ δὲ καὶ ταῦτα ἐπιλάθοιτο γυνή, ἀλλʼ ἐγὼ οὐκ ἐπιλήσομαί σου, λέγει Κύριος Παντοκράτωρ.
ltx/gr_gr_cog/le.pr.me.r10:leprVE.reading.title	
ltx/gr_gr_cog/le.pr.me.r10:leprVE.reading.title_abbr	
ltx/gr_gr_cog/le.pr.me.r10:leprVE.reading.version	@ltx/gr_gr_cog/properties:version.designation
