ltx/gr_gr_cog/le.go.lu.d044:leluLI.Gospel.book_abbr	@ltx/gr_gr_cog/bible:Luke.abbr
ltx/gr_gr_cog/le.go.lu.d044:leluLI.Gospel.book_string	@ltx/gr_gr_cog/bible:Luke.text
ltx/gr_gr_cog/le.go.lu.d044:leluLI.Gospel.chapverse	11:34 – 41
ltx/gr_gr_cog/le.go.lu.d044:leluLI.Gospel.incipit	Ὁ λύχνος τοῦ σώματός ἐστιν ὁ ὀφθαλμός…
ltx/gr_gr_cog/le.go.lu.d044:leluLI.Gospel.text	Εἶπεν ὁ Κύριος· ὁ λύχνος τοῦ σώματός ἐστιν ὁ ὀφθαλμός· ὅταν οὖν ὁ ὀφθαλμός σου ἁπλοῦς ᾖ, καὶ ὅλον τὸ σῶμά σου φωτεινόν ἐστιν· ἐπὰν δὲ πονηρὸς ᾖ, καὶ τὸ σῶμά σου σκοτεινόν. σκόπει οὖν μὴ τὸ φῶς τὸ ἐν σοὶ σκότος ἐστίν. εἰ οὖν τὸ σῶμά σου ὅλον φωτεινόν, μὴ ἔχον τι μέρος σκοτεινόν, ἔσται φωτεινὸν ὅλον ὡς ὅταν ὁ λύχνος τῇ ἀστραπῇ φωτίζῃ σε. Ἐν δὲ τῷ λαλῆσαι αὐτὸν ταῦτα ἠρώτα αὐτὸν Φαρισαῖός τις ὅπως ἀριστήσῃ παρ᾿ αὐτῷ· εἰσελθὼν δὲ ἀνέπεσεν. ὁ δὲ Φαρισαῖος ἰδὼν ἐθαύμασεν ὅτι οὐ πρῶτον ἐβαπτίσθη πρὸ τοῦ ἀρίστου. εἶπε δὲ ὁ Κύριος πρὸς αὐτόν· νῦν ὑμεῖς οἱ Φαρισαῖοι τὸ ἔξωθεν τοῦ ποτηρίου καὶ τοῦ πίνακος καθαρίζετε, τὸ δὲ ἔσωθεν ὑμῶν γέμει ἁρπαγῆς καὶ πονηρίας. ἄφρονες! οὐχ ὁ ποιήσας τὸ ἔξωθεν καὶ τὸ ἔσωθεν ἐποίησε; πλὴν τὰ ἐνόντα δότε ἐλεημοσύνην, καὶ ἰδοὺ ἅπαντα καθαρὰ ὑμῖν ἔσται.
ltx/gr_gr_cog/le.go.lu.d044:leluLI.Gospel.title	Τῇ Τρίτῃ τῆς Ζʹ Ἑβδομάδος τοῦ Λουκᾶ
ltx/gr_gr_cog/le.go.lu.d044:leluLI.Gospel.title_abbr	Τῇ Τρίτῃ τῆς Ζʹ Ἑβδομάδος τοῦ Λουκᾶ
ltx/gr_gr_cog/le.go.lu.d044:leluLI.Gospel.version	@ltx/gr_gr_cog/properties:version.designation
