ltx/gr_gr_cog/ho.ho03:R01	
ltx/gr_gr_cog/ho.ho03:R02	
ltx/gr_gr_cog/ho.ho03:R10	Καὶ μετὰ τό, Ἀλληλούϊα, ψάλλομεν τοὺς Τριαδικοὺς Ὕμνους τοῦ τυχόντος Ἤχου.
ltx/gr_gr_cog/ho.ho03:R11	
ltx/gr_gr_cog/ho.ho03:R12a	
ltx/gr_gr_cog/ho.ho03:R12b	
ltx/gr_gr_cog/ho.ho03:R13	Ἐν ἑκάστῳ δὲ Τροπαρίῳ λέγομεν, τό·
ltx/gr_gr_cog/ho.ho03:R14	
ltx/gr_gr_cog/ho.ho03:R15	
ltx/gr_gr_cog/ho.ho03:R16	
ltx/gr_gr_cog/ho.ho03:R19	
ltx/gr_gr_cog/ho.ho03:R20	
ltx/gr_gr_cog/ho.ho03:R21	
ltx/gr_gr_cog/ho.ho03:R22	
ltx/gr_gr_cog/ho.ho03:R23	
ltx/gr_gr_cog/ho.ho03:R24	
ltx/gr_gr_cog/ho.ho03:R25	
ltx/gr_gr_cog/ho.ho03:R26	
ltx/gr_gr_cog/ho.ho03:R27	Εἶτα τό· «Δεῦτε προσκυνήσωμεν…» καὶ τὴν Πρώτην Ὥραν.
ltx/gr_gr_cog/ho.ho03:R28	Εἰ δέ ἐστι Τεσσαρακοστή…
ltx/gr_gr_cog/ho.ho03:R29	
ltx/gr_gr_cog/ho.ho03:R3	
ltx/gr_gr_cog/ho.ho03:R30	
ltx/gr_gr_cog/ho.ho03:R31	
ltx/gr_gr_cog/ho.ho03:R32	
ltx/gr_gr_cog/ho.ho03:R33	
ltx/gr_gr_cog/ho.ho03:R34	
ltx/gr_gr_cog/ho.ho03:R35	Ἀναστάντες δέ ἀρχόμεθα· «Δεῦτε προσκυνήσωμεν…» καὶ ψάλλομεν τὴν Αʹ Ὥραν.
ltx/gr_gr_cog/ho.ho03:R36	Μετὰ τὸ τέλος τῆς Δοξολογίας λέγομεν Τροπάριον Ἀναστάσιμον.
ltx/gr_gr_cog/ho.ho03:R37	
ltx/gr_gr_cog/ho.ho03:R38	
ltx/gr_gr_cog/ho.ho03:R39	Καὶ εὐθὺς ἡ Δοξολογία. Μετὰ τὸ τέλος τῆς Δοξολογίας λέγομεν τὸ Ἀπολυτίκιον·
ltx/gr_gr_cog/ho.ho03:R4	
ltx/gr_gr_cog/ho.ho03:R6	
ltx/gr_gr_cog/ho.ho03:R7	
ltx/gr_gr_cog/ho.ho03:R8	
ltx/gr_gr_cog/ho.ho03:R9	
ltx/gr_gr_cog/ho.ho03:R_Lauds_Hierarchical	Ὁ ἀρχιερεὺς κατέρχεται τοῦ θρόνου καὶ λαμβάνει καιρόν, τῶν χορῶν ψαλλόντων·
ltx/gr_gr_cog/ho.ho03:SixPsalms.title	Ὁ Ἐξάψαλμος.
ltx/gr_gr_cog/ho.ho03:hoMA.Antiphon11.text	@ltx/gr_gr_cog/properties:media.key
ltx/gr_gr_cog/ho.ho03:hoMA.Antiphon11.title	Οἱ Ἀναβαθμοί, τὸ αʹ Αντίφωνον τοῦ δʹ Ἤχου.
ltx/gr_gr_cog/ho.ho03:hoMA.Apolytikion	@ltx/gr_gr_cog/oc.m6.d5:ocMA.Kathisma33.text
ltx/gr_gr_cog/ho.ho03:hoMA.DoxologyGreat.title	Ἡ Μεγάλη Δοξολογία
ltx/gr_gr_cog/ho.ho03:hoMA.DoxologyGreatIntro.text	Δόξα σοι τῷ δείξαντι τὸ φῶς.
ltx/gr_gr_cog/ho.ho03:hoMA.DoxologySmallEnd.text	Σοὶ πρέπει αἶνος, σοὶ πρέπει ὕμνος, σοὶ δόξα πρέπει, τῷ Πατρί, καὶ τῷ Υἱῷ, καὶ τῷ Ἁγίῳ Πνεύματι, νῦν, καὶ ἀεί, καὶ εἰς τοὺς αἰῶνας τῶν αἰώνων. Ἀμήν.
ltx/gr_gr_cog/ho.ho03:hoMA.DoxologySmallIntro.text	Σοὶ δόξα πρέπει, Κύριε, ὁ Θεὸς ἡμῶν, καὶ σοὶ τὴν δόξαν ἀναπέμπομεν, τῷ Πατρί, καὶ τῷ Υἱῷ, καὶ τῷ Ἁγίῳ Πνεύματι, νῦν, καὶ ἀεί, καὶ εἰς τοὺς αἰῶνας τῶν αἰώνων.
ltx/gr_gr_cog/ho.ho03:hoMA.DoxologyVerse01.text	Δόξα ἐν ὑψίστοις Θεῷ καὶ ἐπὶ γῆς εἰρήνη, ἐν ἀνθρώποις εὐδοκία.
ltx/gr_gr_cog/ho.ho03:hoMA.DoxologyVerse02.text	Ὑμνοῦμέν σε, εὐλογοῦμέν σε, προσκυνοῦμέν σε, δοξολογοῦμέν σε, εὐχαριστοῦμέν σοι, διὰ τὴν μεγάλην σου δόξαν.
ltx/gr_gr_cog/ho.ho03:hoMA.DoxologyVerse03.text	Κύριε βασιλεῦ, ἐπουράνιε Θεέ, Πάτερ παντοκράτορ· Κύριε Υἱὲ μονογενές, Ἰησοῦ Χριστέ, καὶ Ἅγιον Πνεῦμα.
ltx/gr_gr_cog/ho.ho03:hoMA.DoxologyVerse04.text	Κύριε ὁ Θεός, ὁ ἀμνὸς τοῦ Θεοῦ, ὁ Υἱὸς τοῦ Πατρός, ὁ αἴρων τὴν ἁμαρτίαν τοῦ κόσμου, ἐλέησον ἡμᾶς, ὁ αἴρων τὰς ἁμαρτίας τοῦ κόσμου.
ltx/gr_gr_cog/ho.ho03:hoMA.DoxologyVerse05.text	Πρόσδεξαι τὴν δέησιν ἡμῶν, ὁ καθήμενος ἐν δεξιᾷ τοῦ Πατρός, καὶ ἐλέησον ἡμᾶς.
ltx/gr_gr_cog/ho.ho03:hoMA.DoxologyVerse06.text	Ὅτι σὺ εἶ μόνος Ἅγιος, σὺ εἶ μόνος Κύριος, Ἰησοῦς Χριστός, εἰς δόξαν Θεοῦ Πατρός. Ἀμήν.
ltx/gr_gr_cog/ho.ho03:hoMA.DoxologyVerse07.text	Καθʼ ἑκάστην ἡμέραν εὐλογήσω σε καὶ αἰνέσω τὸ ὄνομά σου εἰς τὸν αἰῶνα καὶ εἰς τὸν αἰῶνα τοῦ αἰῶνος.
ltx/gr_gr_cog/ho.ho03:hoMA.DoxologyVerse07e.text	Καθʼ ἑκάστην ἑσπέραν εὐλογήσω σε, καὶ αἰνέσω τὸ ὄνομά σου εἰς τὸν αἰῶνα, καὶ εἰς τὸν αἰῶνα τοῦ αἰῶνος.
ltx/gr_gr_cog/ho.ho03:hoMA.DoxologyVerse08.text	Καταξίωσον, Κύριε, ἐν τῇ ἡμέρᾳ ταύτῃ, ἀναμαρτήτους φυλαχθῆναι ἡμᾶς.
ltx/gr_gr_cog/ho.ho03:hoMA.DoxologyVerse08e.text	Καταξίωσον, Κύριε, ἐν τῇ ἑσπέρᾳ ταύτῃ, ἀναμαρτήτους φυλαχθῆναι ἡμᾶς.
ltx/gr_gr_cog/ho.ho03:hoMA.DoxologyVerse08n.text	Καταξίωσον, Κύριε, ἐν τῇ νυκτὶ ταύτῃ, ἀναμαρτήτους φυλαχθῆναι ἡμᾶς.
ltx/gr_gr_cog/ho.ho03:hoMA.DoxologyVerse09.text	Εὐλογητὸς εἶ, Κύριε, ὁ Θεὸς τῶν Πατέρων ἡμῶν, καὶ αἰνετὸν καὶ δεδοξασμένον τὸ ὄνομά σου εἰς τοὺς αἰῶνας. Ἀμήν.
ltx/gr_gr_cog/ho.ho03:hoMA.DoxologyVerse10.text	Γένοιτο, Κύριε, τὸ ἔλεός σου ἐφʼ ἡμᾶς, καθάπερ ἠλπίσαμεν ἐπὶ σέ.
ltx/gr_gr_cog/ho.ho03:hoMA.DoxologyVerse11a.text	Εὐλογητὸς εἶ Κύριε, δίδαξόν με τὰ δικαιώματά σου.
ltx/gr_gr_cog/ho.ho03:hoMA.DoxologyVerse11b.text	Εὐλογητὸς εἶ, Δέσποτα· συνέτισόν με τὰ δικαιώματά σου.
ltx/gr_gr_cog/ho.ho03:hoMA.DoxologyVerse11c.text	Εὐλογητὸς εἶ, Ἅγιε· φώτισόν με τοῖς δικαιώμασί σου.
ltx/gr_gr_cog/ho.ho03:hoMA.DoxologyVerse12a.text	Κύριε, καταφυγὴ ἐγενήθης ἡμῖν ἐν γενεᾷ καὶ γενεᾷ.
ltx/gr_gr_cog/ho.ho03:hoMA.DoxologyVerse12b.text	Ἐγὼ εἶπα· Κύριε, ἐλέησόν με, ἴασαι τὴν ψυχήν μου, ὅτι ἥμαρτόν σοι.
ltx/gr_gr_cog/ho.ho03:hoMA.DoxologyVerse13.text	Κύριε, πρὸς σὲ κατέφυγον. Δίδαξόν με τοῦ ποιεῖν τὸ θέλημά σου, ὅτι σὺ εἶ ὁ Θεός μου.
ltx/gr_gr_cog/ho.ho03:hoMA.DoxologyVerse14.text	Ὅτι παρὰ σοὶ πηγὴ ζωῆς, ἐν τῷ φωτί σου ὀψόμεθα φῶς.
ltx/gr_gr_cog/ho.ho03:hoMA.DoxologyVerse15.text	Παράτεινον τὸ ἔλεός σου τοῖς γινώσκουσί σε.
ltx/gr_gr_cog/ho.ho03:hoMA.DoxologyVerse16.text	Ἅγιος ὁ Θεός, Ἅγιος Ἰσχυρός, Ἅγιος Ἀθάνατος, ἐλέησον ἡμᾶς.
ltx/gr_gr_cog/ho.ho03:hoMA.DoxologyVerse17.text	Δόξα Πατρὶ καὶ Υἱῷ καὶ Ἁγίῳ Πνεύματι.
ltx/gr_gr_cog/ho.ho03:hoMA.DoxologyVerse18.text	Καὶ νῦν καὶ ἀεί, καὶ εἰς τοὺς αἰῶνας τῶν αἰώνων. Ἀμήν.
ltx/gr_gr_cog/ho.ho03:hoMA.DoxologyVerse19.text	Ἅγιος Ἀθάνατος, ἐλέησον ἡμᾶς.
ltx/gr_gr_cog/ho.ho03:hoMA.DoxologyVerse20.text	Ἅγιος ὁ Θεός, Ἅγιος Ἰσχυρός, Ἅγιος Ἀθάνατος, ἐλέησον ἡμᾶς.
ltx/gr_gr_cog/ho.ho03:hoMA.EclogeTheotokionWeekday.text	Τὴν Μητέρα σου προσάγει σοι, εἰς ἱκεσίαν ὁ λαός σου Χριστέ· ταῖς παρακλήσεσιν αὐτῆς, τοὺς οἰκτιρμούς σου δὸς ἡμῖν Ἀγαθέ, ἵνα σε δοξάζωμεν, τὴν ἐλπίδα τῶν ψυχῶν ἡμῶν.
ltx/gr_gr_cog/ho.ho03:hoMA.ExapMon1.incipit	@ltx/gr_gr_cog/he.a.m3:heAU.OOuranonToisAstrois.incipit
ltx/gr_gr_cog/ho.ho03:hoMA.ExapMon1.melody	@ltx/gr_gr_cog/he.a.m3:heAU.OOuranonToisAstrois.melody
ltx/gr_gr_cog/ho.ho03:hoMA.ExapMon1.mode	@ltx/gr_gr_cog/miscellanea:misc.Mode3
ltx/gr_gr_cog/ho.ho03:hoMA.ExapMon1.text	@ltx/gr_gr_cog/he.a.m3:heAU.OOuranonToisAstrois.text
ltx/gr_gr_cog/ho.ho03:hoMA.ExapMonTh.incipit	@ltx/gr_gr_cog/da.d7:daMA.ExapTheotokion1.incipit
ltx/gr_gr_cog/ho.ho03:hoMA.ExapMonTh.melody	@ltx/gr_gr_cog/he.a.m3:heAU.OOuranonToisAstrois.name
ltx/gr_gr_cog/ho.ho03:hoMA.ExapMonTh.mode	@ltx/gr_gr_cog/miscellanea:misc.Mode3
ltx/gr_gr_cog/ho.ho03:hoMA.ExapMonTh.text	@ltx/gr_gr_cog/da.d7:daMA.ExapTheotokion1.text
ltx/gr_gr_cog/ho.ho03:hoMA.ExapMonTitle	Τῇ Δευτέρᾳ
ltx/gr_gr_cog/ho.ho03:hoMA.ExapSat1.incipit	@ltx/gr_gr_cog/da.d7:daMA.Exaposteilarion2.incipit
ltx/gr_gr_cog/ho.ho03:hoMA.ExapSat1.melody	@ltx/gr_gr_cog/he.a.m3:heAU.OOuranonToisAstrois.name
ltx/gr_gr_cog/ho.ho03:hoMA.ExapSat1.mode	@ltx/gr_gr_cog/miscellanea:misc.Mode3
ltx/gr_gr_cog/ho.ho03:hoMA.ExapSat1.text	@ltx/gr_gr_cog/da.d7:daMA.Exaposteilarion2.text
ltx/gr_gr_cog/ho.ho03:hoMA.ExapSatTh.incipit	@ltx/gr_gr_cog/da.d7:daMA.ExapTheotokion2.incipit
ltx/gr_gr_cog/ho.ho03:hoMA.ExapSatTh.melody	@ltx/gr_gr_cog/he.a.m2:heAU.TonMathitonOrontonSe.name
ltx/gr_gr_cog/ho.ho03:hoMA.ExapSatTh.mode	@ltx/gr_gr_cog/miscellanea:misc.Mode2
ltx/gr_gr_cog/ho.ho03:hoMA.ExapSatTh.text	@ltx/gr_gr_cog/da.d7:daMA.ExapTheotokion2.text
ltx/gr_gr_cog/ho.ho03:hoMA.ExapSatTitle	Τῷ Σαββάτῳ
ltx/gr_gr_cog/ho.ho03:hoMA.ExapThu1.incipit	Εἰς πᾶσαν τὴν ὑφήλιον…
ltx/gr_gr_cog/ho.ho03:hoMA.ExapThu1.melody	@ltx/gr_gr_cog/he.a.m2:heAU.GynaikesAkoutisthite.name
ltx/gr_gr_cog/ho.ho03:hoMA.ExapThu1.mode	@ltx/gr_gr_cog/miscellanea:misc.Mode2
ltx/gr_gr_cog/ho.ho03:hoMA.ExapThu1.text	Εἰς πᾶσαν τὴν ὑφήλιον, δραμόντες ἐκηρύξατε, τὴν τοῦ Χριστοῦ ἐκ Παρθένου, ἁγίαν σάρκωσιν ὄντως, ἐκ πλάνης ἐπιστρέφοντες, τὰ ἔθνη καὶ φωτίζοντες, καὶ πάντας ἐκδιδάσκοντες, Τριάδα σέβειν ἁγίαν, Ἀπόστολοι τοῦ Σωτῆρος.
ltx/gr_gr_cog/ho.ho03:hoMA.ExapThu2.incipit	@ltx/gr_gr_cog/me.m12.d06:meMA.Exaposteilarion1.incipit
ltx/gr_gr_cog/ho.ho03:hoMA.ExapThu2.melody	@ltx/gr_gr_cog/he.a.m2:heAU.GynaikesAkoutisthite.name
ltx/gr_gr_cog/ho.ho03:hoMA.ExapThu2.mode	@ltx/gr_gr_cog/miscellanea:misc.Mode2
ltx/gr_gr_cog/ho.ho03:hoMA.ExapThu2.text	@ltx/gr_gr_cog/me.m12.d06:meMA.Exaposteilarion1.text
ltx/gr_gr_cog/ho.ho03:hoMA.ExapThuTh.incipit	Μαρία καθαρώτατον…
ltx/gr_gr_cog/ho.ho03:hoMA.ExapThuTh.melody	@ltx/gr_gr_cog/he.a.m2:heAU.GynaikesAkoutisthite.name
ltx/gr_gr_cog/ho.ho03:hoMA.ExapThuTh.mode	@ltx/gr_gr_cog/miscellanea:misc.Mode2
ltx/gr_gr_cog/ho.ho03:hoMA.ExapThuTh.text	Μαρία καθαρώτατον, χρυσοῦν θυμιατήριον, τῆς ἀχωρήτου Τριάδος, δοχεῖον γεγενημένη· ἐν ᾧ Πατὴρ ηὐδόκησεν, ὁ δὲ Υἱὸς ἐσκήνωσε, καὶ Πνεῦμα τὸ πανάγιον, ἐπισκιάσαν σοι Κόρη, ἀνέδειξε Θεοτόκον.
ltx/gr_gr_cog/ho.ho03:hoMA.ExapThuTitle	Τῇ Πέμπτῃ
ltx/gr_gr_cog/ho.ho03:hoMA.ExapTue1.incipit	@ltx/gr_gr_cog/da.d3:daMA.Exaposteilarion1.incipit
ltx/gr_gr_cog/ho.ho03:hoMA.ExapTue1.melody	@ltx/gr_gr_cog/he.a.m3:heAU.OOuranonToisAstrois.name
ltx/gr_gr_cog/ho.ho03:hoMA.ExapTue1.mode	@ltx/gr_gr_cog/miscellanea:misc.Mode3
ltx/gr_gr_cog/ho.ho03:hoMA.ExapTue1.text	@ltx/gr_gr_cog/da.d3:daMA.Exaposteilarion1.text
ltx/gr_gr_cog/ho.ho03:hoMA.ExapTueTh.incipit	@ltx/gr_gr_cog/da.d7:daMA.ExapTheotokion1.incipit
ltx/gr_gr_cog/ho.ho03:hoMA.ExapTueTh.melody	@ltx/gr_gr_cog/he.a.m3:heAU.OOuranonToisAstrois.name
ltx/gr_gr_cog/ho.ho03:hoMA.ExapTueTh.mode	@ltx/gr_gr_cog/miscellanea:misc.Mode3
ltx/gr_gr_cog/ho.ho03:hoMA.ExapTueTh.text	@ltx/gr_gr_cog/da.d7:daMA.ExapTheotokion1.text
ltx/gr_gr_cog/ho.ho03:hoMA.ExapTueTitle	Τῇ Τρίτῃ
ltx/gr_gr_cog/ho.ho03:hoMA.ExapWedFri1.incipit	@ltx/gr_gr_cog/me.m09.d14:meMA.Exaposteilarion1.incipit
ltx/gr_gr_cog/ho.ho03:hoMA.ExapWedFri1.melody	@ltx/gr_gr_cog/he.a.m2:heAU.TonMathitonOrontonSe.name
ltx/gr_gr_cog/ho.ho03:hoMA.ExapWedFri1.mode	@ltx/gr_gr_cog/miscellanea:misc.Mode2
ltx/gr_gr_cog/ho.ho03:hoMA.ExapWedFri1.text	@ltx/gr_gr_cog/me.m09.d14:meMA.Exaposteilarion1.text
ltx/gr_gr_cog/ho.ho03:hoMA.ExapWedFriTh.incipit	@ltx/gr_gr_cog/da.d6:daMA.ExapTheotokion2.incipit
ltx/gr_gr_cog/ho.ho03:hoMA.ExapWedFriTh.melody	@ltx/gr_gr_cog/he.a.m3:heAU.OOuranonToisAstrois.name
ltx/gr_gr_cog/ho.ho03:hoMA.ExapWedFriTh.mode	@ltx/gr_gr_cog/miscellanea:misc.Mode3
ltx/gr_gr_cog/ho.ho03:hoMA.ExapWedFriTh.text	@ltx/gr_gr_cog/da.d6:daMA.ExapTheotokion2.text
ltx/gr_gr_cog/ho.ho03:hoMA.ExapWedFriTitle	Τῇ Τετάρτῃ καὶ Παρασκευῇ
ltx/gr_gr_cog/ho.ho03:hoMA.Exaposteilaria.title	Ἐξαποστειλάρια
ltx/gr_gr_cog/ho.ho03:hoMA.Exaposteilaria.title2	τῆς ὅλης ἑβδομάδος
ltx/gr_gr_cog/ho.ho03:hoMA.FestalMagnification.rubric	Here may be inserted the Festal Magnification.
ltx/gr_gr_cog/ho.ho03:hoMA.FestalMagnification.title	The Magnification
ltx/gr_gr_cog/ho.ho03:hoMA.FuneralEvlog.title1	Νεκρώσιμα Εὐλογητάρια.
ltx/gr_gr_cog/ho.ho03:hoMA.FuneralEvlog.title2	
ltx/gr_gr_cog/ho.ho03:hoMA.FuneralEvlog1.incipit	Τῶν ἁγίων ὁ χορός, εὗρε…
ltx/gr_gr_cog/ho.ho03:hoMA.FuneralEvlog1.mode	@ltx/gr_gr_cog/miscellanea:misc.Mode5
ltx/gr_gr_cog/ho.ho03:hoMA.FuneralEvlog1.text	Τῶν ἁγίων ὁ χορός, εὗρε πηγὴν τῆς ζωῆς καὶ θύραν παραδείσου· εὕρω κἀγώ, τὴν ὁδὸν διὰ τῆς μετανοίας· τὸ ἀπολωλὸς πρόβατον ἐγώ εἰμι· ἀνακάλεσαί με, Σωτήρ, καὶ σῶσόν με.
ltx/gr_gr_cog/ho.ho03:hoMA.FuneralEvlog2.incipit	Οἱ τὸν Ἀμνὸν τοῦ Θεοῦ…
ltx/gr_gr_cog/ho.ho03:hoMA.FuneralEvlog2.mode	@ltx/gr_gr_cog/miscellanea:misc.Mode5
ltx/gr_gr_cog/ho.ho03:hoMA.FuneralEvlog2.text	Οἱ τὸν Ἀμνὸν τοῦ Θεοῦ κηρύξαντες, καὶ σφαγιασθέντες ὥσπερ ἄρνες, καὶ πρὸς ζωὴν τὴν ἀγήρῳ, ἅγιοι, καὶ ἀΐδιον μετατεθέντες, τοῦτον ἐκτενῶς, μάρτυρες, αἰτήσασθε, ὀφλημάτων λύσιν ἡμῖν δωρήσασθει.
ltx/gr_gr_cog/ho.ho03:hoMA.FuneralEvlog3.incipit	Οἱ τὴν ὁδὸν τὴν στενὴν…
ltx/gr_gr_cog/ho.ho03:hoMA.FuneralEvlog3.mode	@ltx/gr_gr_cog/miscellanea:misc.Mode5
ltx/gr_gr_cog/ho.ho03:hoMA.FuneralEvlog3.text	Οἱ τὴν ὁδὸν τὴν στενὴν βαδίσαντες, τεθλιμμένην πάντες οἱ ἐν βίῳ, οἱ τὸν σταυρόν, ὡς ζυγὸν ἀράμενοι, καὶ ἐμοὶ ἀκολουθήσαντες ἐν πίστει, δεῦτε ἀπολάβετε, ἃ ἡτοίμασα ὑμῖν βραβεῖα, καὶ στέφη τὰ οὐράνια.
ltx/gr_gr_cog/ho.ho03:hoMA.FuneralEvlog4.incipit	Ὁ πάλαι μέν, ἐκ μὴ…
ltx/gr_gr_cog/ho.ho03:hoMA.FuneralEvlog4.mode	@ltx/gr_gr_cog/miscellanea:misc.Mode5
ltx/gr_gr_cog/ho.ho03:hoMA.FuneralEvlog4.text	Ὁ πάλαι μέν, ἐκ μὴ ὄντων πλάσας με, καὶ εἰκόνι σου θείᾳ τιμήσας, παραβάσει ἐντολῆς δὲ πάλιν με ἐπιστρέψας εἰς γῆν ἐξ ἧς ἐλήφθην, εἰς τὸ καθʼ ὁμοίωσιν ἐπανάγαγε, τὸ ἀρχαῖον κάλλος ἀναμορφώσασθαι.
ltx/gr_gr_cog/ho.ho03:hoMA.FuneralEvlog5.incipit	Εἰκών εἰμι, τῆς ἀῤῥήτου δόξης…
ltx/gr_gr_cog/ho.ho03:hoMA.FuneralEvlog5.mode	@ltx/gr_gr_cog/miscellanea:misc.Mode5
ltx/gr_gr_cog/ho.ho03:hoMA.FuneralEvlog5.text	Εἰκών εἰμι, τῆς ἀῤῥήτου δόξης σου, εἰ καὶ στίγματα φέρω πταισμάτων· οἰκτείρησον τὸ σὸν πλάσμα, Δέσποτα, καὶ καθάρισον σῇ εὐσπλαγχνίᾳ· καὶ τὴν ποθεινὴν πατρίδα παράσχου μοι, παραδείσου πάλιν ποιῶν πολίτην με.
ltx/gr_gr_cog/ho.ho03:hoMA.FuneralEvlog6.incipit	Ἀνάπαυσον, ὁ Θεὸς τοὺς δούλους…
ltx/gr_gr_cog/ho.ho03:hoMA.FuneralEvlog6.mode	@ltx/gr_gr_cog/miscellanea:misc.Mode5
ltx/gr_gr_cog/ho.ho03:hoMA.FuneralEvlog6.text	Ἀνάπαυσον, ὁ Θεὸς τοὺς δούλους σου, καὶ κατάταξον αὐτοὺς ἐν παραδείσῳ, ὅπου χοροὶ τῶν ἁγίων, Κύριε, καὶ οἱ δίκαιοι ἐκλάμψουσιν ὡς φωστῆρες· τοὺς κεκοιμημένους δούλους σου ἀνάπαυσον, παρορῶν αὐτῶν πάντα τὰ ἐγκλήματα.
ltx/gr_gr_cog/ho.ho03:hoMA.FuneralEvlog7.incipit	Τὸ τριλαμπὲς τῆς μιᾶς Θεότητος…
ltx/gr_gr_cog/ho.ho03:hoMA.FuneralEvlog7.mode	@ltx/gr_gr_cog/miscellanea:misc.Mode5
ltx/gr_gr_cog/ho.ho03:hoMA.FuneralEvlog7.text	Τὸ τριλαμπὲς τῆς μιᾶς Θεότητος, εὐσεβῶς ὑμνήσωμεν βοῶντες· Ἅγιος εἶ, ὁ Πατὴρ ὁ ἄναρχος, ὁ συνάναρχος Υἱὸς καὶ τὸ θεῖον Πνεῦμα. Φώτισον ἡμᾶς πίστει σοι λατρεύοντας, καὶ τοῦ αἰωνίου πυρὸς ἐξάρπασον.
ltx/gr_gr_cog/ho.ho03:hoMA.FuneralEvlog8.incipit	Χαῖρε σεμνή, ἡ Θεὸν σαρκὶ…
ltx/gr_gr_cog/ho.ho03:hoMA.FuneralEvlog8.mode	@ltx/gr_gr_cog/miscellanea:misc.Mode5
ltx/gr_gr_cog/ho.ho03:hoMA.FuneralEvlog8.text	Χαῖρε σεμνή, ἡ Θεὸν σαρκὶ τεκοῦσα, εἰς πάντων σωτηρίαν, διʼ ἧς γένος τῶν ἀνθρώπων εὕρατο τὴν σωτηρίαν· διὰ σοῦ εὕροιμεν παράδεισον, Θεοτόκε ἁγνὴ εὐλογημένη.
ltx/gr_gr_cog/ho.ho03:hoMA.FuneralEvlog9.mode	@ltx/gr_gr_cog/miscellanea:misc.Mode5
ltx/gr_gr_cog/ho.ho03:hoMA.FuneralEvlog9.text	@ltx/gr_gr_cog/prayers:pr.Alleluia3Glory.text
ltx/gr_gr_cog/ho.ho03:hoMA.FuneralEvlogVerse.text	Εὐλογητὸς εἶ, Κύριε, δίδαξόν με τὰ δικαιώματά σου.
ltx/gr_gr_cog/ho.ho03:hoMA.LaudsSunTheotokion.incipit	@ltx/gr_gr_cog/oc.m2.d1:ocMA.Kathisma23.incipit
ltx/gr_gr_cog/ho.ho03:hoMA.LaudsSunTheotokion.text	@ltx/gr_gr_cog/oc.m2.d1:ocMA.Kathisma23.text
ltx/gr_gr_cog/ho.ho03:hoMA.MM.DoxologyGreat.text	@ltx/gr_gr_cog/properties:media.key
ltx/gr_gr_cog/ho.ho03:hoMA.MM.DoxologyGreatAsmatic.text	@ltx/gr_gr_cog/properties:media.key
ltx/gr_gr_cog/ho.ho03:hoMA.MM.Magnificat.text	@ltx/gr_gr_cog/properties:media.key
ltx/gr_gr_cog/ho.ho03:hoMA.MM.PolyeleosPsalm134.text	@ltx/gr_gr_cog/properties:media.key
ltx/gr_gr_cog/ho.ho03:hoMA.MM.PolyeleosPsalm135.text	@ltx/gr_gr_cog/properties:media.key
ltx/gr_gr_cog/ho.ho03:hoMA.MatinsOrdinary.text	@ltx/gr_gr_cog/properties:media.key
ltx/gr_gr_cog/ho.ho03:hoMA.MatinsOrdinary.title	Ἀρχὴ τοῦ Ὄρθρου
ltx/gr_gr_cog/ho.ho03:hoMA.Ode9.Meg00.incipit	Ἄξιόν ἐστιν…
ltx/gr_gr_cog/ho.ho03:hoMA.Ode9.Meg00.text	Ἄξιόν ἐστιν ὦς ἀληθῶς, μακαρίζειν σὲ τὴν Θεοτόκον, τὴν ἀειμακάριστον καὶ παναμώμητον, καὶ Μητέρα τοῦ Θεοῦ ἡμῶν.
ltx/gr_gr_cog/ho.ho03:hoMA.PostGospelAllPureLady.incipit	Ταῖς τῆς Παναχράντου…
ltx/gr_gr_cog/ho.ho03:hoMA.PostGospelAllPureLady.text	Ταῖς τῆς Παναχράντου πρεσβείαις, Ἐλεῆμον, ἐξάλειψον τὰ πλήθη τῶν ἐμῶν ἐγκλημάτων.
ltx/gr_gr_cog/ho.ho03:hoMA.PostGospelAngels.incipit	Ταῖς τῶν Ἀσωμάτων, Οἰκτίρμον, προστασίαις…
ltx/gr_gr_cog/ho.ho03:hoMA.PostGospelAngels.text	Ταῖς τῶν Ἀσωμάτων, Οἰκτίρμον, προστασίαις, ἐξάλειψον τὰ πλήθη τῶν ἐμῶν ἐγκλημάτων.
ltx/gr_gr_cog/ho.ho03:hoMA.PostGospelApostle.incipit	Ταῖς τοῦ Ἀποστόλου…
ltx/gr_gr_cog/ho.ho03:hoMA.PostGospelApostle.text	Ταῖς τοῦ Ἀποστόλου πρεσβείαις, Ἐλεῆμον, ἐξάλειψον τὰ πλήθη τῶν ἐμῶν ἐγκλημάτων.
ltx/gr_gr_cog/ho.ho03:hoMA.PostGospelApostles.incipit	Ταῖς τῶν Ἀποστόλων…
ltx/gr_gr_cog/ho.ho03:hoMA.PostGospelApostles.text	Ταῖς τῶν Ἀποστόλων πρεσβείαις, Ἐλεῆμον, ἐξάλειψον τὰ πλήθη τῶν ἐμῶν ἐγκλημάτων.
ltx/gr_gr_cog/ho.ho03:hoMA.PostGospelForerunner.incipit	Ταῖς τοῦ σοῦ Προδρόμου…
ltx/gr_gr_cog/ho.ho03:hoMA.PostGospelForerunner.text	Ταῖς τοῦ σοῦ Προδρόμου πρεσβείαις, Ἐλεῆμον, ἐξάλειψον τὰ πλήθη τῶν ἐμῶν ἐγκλημάτων.
ltx/gr_gr_cog/ho.ho03:hoMA.PostGospelHierarch.incipit	Ταῖς τοῦ Ἱεράρχου…
ltx/gr_gr_cog/ho.ho03:hoMA.PostGospelHierarch.text	Ταῖς τοῦ Ἱεράρχου πρεσβείαις, Ἐλεῆμον, ἐξάλειψον τὰ πλήθη τῶν ἐμῶν ἐγκλημάτων.
ltx/gr_gr_cog/ho.ho03:hoMA.PostGospelMaleMartyr.incipit	Ταῖς τοῦ Ἀθλοφόρου…
ltx/gr_gr_cog/ho.ho03:hoMA.PostGospelMaleMartyr.text	Ταῖς τοῦ Ἀθλοφόρου πρεσβείαις, Ἐλεῆμον, ἐξάλειψον τὰ πλήθη τῶν ἐμῶν ἐγκλημάτων.
ltx/gr_gr_cog/ho.ho03:hoMA.PostGospelMaleSaint.incipit	Ταῖς τοῦ σοῦ Ἁγίου…
ltx/gr_gr_cog/ho.ho03:hoMA.PostGospelMaleSaint.text	Ταῖς τοῦ σοῦ Ἁγίου πρεσβείαις, Ἐλεῆμον, ἐξάλειψον τὰ πλήθη τῶν ἐμῶν ἐγκλημάτων.
ltx/gr_gr_cog/ho.ho03:hoMA.PostGospelMartyrs.incipit	Ταῖς τῶν Ἀθλοφόρων…
ltx/gr_gr_cog/ho.ho03:hoMA.PostGospelMartyrs.text	Ταῖς τῶν Ἀθλοφόρων πρεσβείαις, Ἐλεῆμον, ἐξάλειψον τὰ πλήθη τῶν ἐμῶν ἐγκλημάτων.
ltx/gr_gr_cog/ho.ho03:hoMA.PostGospelMonastic.incipit	Ταῖς τοῦ σοῦ Ὁσίου…
ltx/gr_gr_cog/ho.ho03:hoMA.PostGospelMonastic.text	Ταῖς τοῦ σοῦ Ὁσίου πρεσβείαις, Ἐλεῆμον, ἐξάλειψον τὰ πλήθη τῶν ἐμῶν ἐγκλημάτων.
ltx/gr_gr_cog/ho.ho03:hoMA.PostGospelMonastics.incipit	Ταῖς τῶν σῶν Ὁσίων…
ltx/gr_gr_cog/ho.ho03:hoMA.PostGospelMonastics.text	Ταῖς τῶν σῶν Ὁσίων πρεσβείαις, Ἐλεῆμον, ἐξάλειψον τὰ πλήθη τῶν ἐμῶν ἐγκλημάτων.
ltx/gr_gr_cog/ho.ho03:hoMA.PostGospelProphet.incipit	Ταῖς τοῦ σοῦ Προφήτου…
ltx/gr_gr_cog/ho.ho03:hoMA.PostGospelProphet.text	Ταῖς τοῦ σοῦ Προφήτου πρεσβείαις, Ἐλεῆμον, ἐξάλειψον τὰ πλήθη τῶν ἐμῶν ἐγκλημάτων.
ltx/gr_gr_cog/ho.ho03:hoMA.PostGospelTeacher.incipit	Ταῖς τοῦ Διδασκάλου…
ltx/gr_gr_cog/ho.ho03:hoMA.PostGospelTeacher.text	Ταῖς τοῦ Διδασκάλου πρεσβείαις, Ἐλεῆμον, ἐξάλειψον τὰ πλήθη τῶν ἐμῶν ἐγκλημάτων.
ltx/gr_gr_cog/ho.ho03:hoMA.PostGospelTeachers.incipit	Ταῖς τῶν Διδασκάλων…
ltx/gr_gr_cog/ho.ho03:hoMA.PostGospelTeachers.text	Ταῖς τῶν Διδασκάλων πρεσβείαις, Ἐλεῆμον, ἐξάλειψον τὰ πλήθη τῶν ἐμῶν ἐγκλημάτων.
ltx/gr_gr_cog/ho.ho03:hoMA.PostGospelTheotokos.incipit	Ταῖς τῆς Θεοτόκου …
ltx/gr_gr_cog/ho.ho03:hoMA.PostGospelTheotokos.text	Ταῖς τῆς Θεοτόκου πρεσβείαις, Ἐλεῆμον, ἐξάλειψον τὰ πλήθη τῶν ἐμῶν ἐγκλημάτων.
ltx/gr_gr_cog/ho.ho03:hoMA.PostGospelTrinity.incipit	Πάτερ, Λόγε, Πνεῦμα…
ltx/gr_gr_cog/ho.ho03:hoMA.PostGospelTrinity.text	Πάτερ, Λόγε, Πνεῦμα, Τριὰς ἡ ἐν Μονάδι, ἐξάλειψον τὰ πλήθη, τῶν ἐμῶν ἐγκλημάτων.
ltx/gr_gr_cog/ho.ho03:hoMA.PostGospelWomanMartyr.incipit	Ταῖς τῆς Ἀθληφόρου…
ltx/gr_gr_cog/ho.ho03:hoMA.PostGospelWomanMartyr.text	Ταῖς τῆς Ἀθληφόρου πρεσβείαις, Ἐλεῆμον, ἐξάλειψον τὰ πλήθη τῶν ἐμῶν ἐγκλημάτων.
ltx/gr_gr_cog/ho.ho03:hoMA.PostGospelWomanMonastic.incipit	Ταῖς τῆς σῆς Ὁσίας…
ltx/gr_gr_cog/ho.ho03:hoMA.PostGospelWomanMonastic.text	Ταῖς τῆς σῆς Ὁσίας πρεσβείαις, Ἐλεῆμον, ἐξάλειψον τὰ πλήθη τῶν ἐμῶν ἐγκλημάτων.
ltx/gr_gr_cog/ho.ho03:hoMA.PostGospelWomenMartyrs.incipit	Ταῖς τῶν Ἀθληφόρων…
ltx/gr_gr_cog/ho.ho03:hoMA.PostGospelWomenMartyrs.text	Ταῖς τῶν Ἀθληφόρων πρεσβείαις, Ἐλεῆμον, ἐξάλειψον τὰ πλήθη τῶν ἐμῶν ἐγκλημάτων.
ltx/gr_gr_cog/ho.ho03:hoMA.PreGospelHymn.text	
ltx/gr_gr_cog/ho.ho03:hoMA.Psalm50.text	@ltx/gr_gr_cog/properties:media.key
ltx/gr_gr_cog/ho.ho03:hoMA.ResEvlog.title1	Εὐλογητάρια Ἀναστάσιμα.
ltx/gr_gr_cog/ho.ho03:hoMA.ResEvlog.title2	ΨΑΛΛΟΜΕΝΑ ΕΝ ΤΑΙΣ ΚΥΡΙΑΚΑΙΣ ΤΟΥ ΟΛΟΥ ΕΝΙΑΥΤΟΥ
ltx/gr_gr_cog/ho.ho03:hoMA.ResEvlog1.incipit	Τῶν Ἀγγέλων ὁ δῆμος, κατεπλάγη…
ltx/gr_gr_cog/ho.ho03:hoMA.ResEvlog1.mode	@ltx/gr_gr_cog/miscellanea:misc.Mode5
ltx/gr_gr_cog/ho.ho03:hoMA.ResEvlog1.text	Τῶν Ἀγγέλων ὁ δῆμος, κατεπλάγη ὁρῶν σε, ἐν νεκροῖς λογισθέντα, τοῦ θανάτου δὲ Σωτήρ, τὴν ἰσχὺν καθελόντα, καὶ σὺν ἑαυτῷ τὸν Ἀδὰμ ἐγείραντα, καὶ ἐξ ᾍδου πάντας ἐλευθερώσαντα.
ltx/gr_gr_cog/ho.ho03:hoMA.ResEvlog2.incipit	Τί τὰ μύρα, συμπαθῶς τοῖς…
ltx/gr_gr_cog/ho.ho03:hoMA.ResEvlog2.mode	@ltx/gr_gr_cog/miscellanea:misc.Mode5
ltx/gr_gr_cog/ho.ho03:hoMA.ResEvlog2.text	Τί τὰ μύρα, συμπαθῶς τοῖς δάκρυσιν, ὦ Μαθήτριαι κιρνᾶτε; ὁ ἀστράπτων ἐν τῷ τάφῳ Ἄγγελος, προσεφθέγγετο ταῖς Μυροφόροις· Ἴδετε ὑμεῖς τὸν τάφον καὶ ᾔσθητε· ὁ Σωτὴρ γὰρ ἐξανέστη τοῦ μνήματος.
ltx/gr_gr_cog/ho.ho03:hoMA.ResEvlog3.incipit	Λίαν πρωΐ, Μυροφόροι ἔδραμον, πρὸς…
ltx/gr_gr_cog/ho.ho03:hoMA.ResEvlog3.mode	@ltx/gr_gr_cog/miscellanea:misc.Mode5
ltx/gr_gr_cog/ho.ho03:hoMA.ResEvlog3.text	Λίαν πρωΐ, Μυροφόροι ἔδραμον, πρὸς τὸ μνῆμά σου θρηνολογοῦσαι· ἀλλʼ ἐπέστη, πρὸς αὐτὰς ὁ Ἄγγελος, καὶ εἶπε· θρήνου ὁ καιρὸς πέπαυται, μὴ κλαίετε, τὴν Ἀνάστασιν δέ, Ἀποστόλοις εἴπατε.
ltx/gr_gr_cog/ho.ho03:hoMA.ResEvlog4.incipit	Μυροφόροι γυναῖκες, μετὰ μύρων ἐλθοῦσαι…
ltx/gr_gr_cog/ho.ho03:hoMA.ResEvlog4.mode	@ltx/gr_gr_cog/miscellanea:misc.Mode5
ltx/gr_gr_cog/ho.ho03:hoMA.ResEvlog4.text	Μυροφόροι γυναῖκες, μετὰ μύρων ἐλθοῦσαι, πρὸς τὸ μνῆμά σου, Σῶτερ ἐνηχοῦντο. Ἀγγέλου τρανῶς, πρὸς αὐτὰς φθεγγομένου· Τί μετὰ νεκρῶν, τὸν ζώντα λογίζεσθε; ὡς Θεὸς γάρ, ἐξανέστη τοῦ μνήματος.
ltx/gr_gr_cog/ho.ho03:hoMA.ResEvlog5.incipit	Προσκυνοῦμεν Πατέρα, καὶ τὸν τούτου…
ltx/gr_gr_cog/ho.ho03:hoMA.ResEvlog5.mode	@ltx/gr_gr_cog/miscellanea:misc.Mode5
ltx/gr_gr_cog/ho.ho03:hoMA.ResEvlog5.text	Προσκυνοῦμεν Πατέρα, καὶ τὸν τούτου Υἱόν τε, καὶ τὸ Ἅγιον Πνεῦμα, τὴν Ἁγίαν Τριάδα, ἐν μιᾷ τῇ οὐσίᾳ, σὺν τοῖς Σεραφείμ, κράζοντες τό· Ἅγιος, Ἅγιος, Ἅγιος εἶ, Κύριε.
ltx/gr_gr_cog/ho.ho03:hoMA.ResEvlog6.incipit	Ζωοδότην τεκοῦσα, ἐλυτρώσω Παρθένε, τὸν…
ltx/gr_gr_cog/ho.ho03:hoMA.ResEvlog6.mode	@ltx/gr_gr_cog/miscellanea:misc.Mode5
ltx/gr_gr_cog/ho.ho03:hoMA.ResEvlog6.text	Ζωοδότην τεκοῦσα, ἐλυτρώσω Παρθένε, τὸν Ἀδὰμ ἁμαρτίας, χαρμονὴν δὲ τῇ Εὔᾳ, ἀντὶ λύπης παρέσχες, ῥεύσαντα ζωῆς, ἴθυνε πρὸς ταύτην δέ, ὁ ἐκ σοῦ σαρκωθείς Θεὸς καὶ ἄνθρωπος.
ltx/gr_gr_cog/ho.ho03:hoMA.ResEvlog7.mode	@ltx/gr_gr_cog/miscellanea:misc.Mode5
ltx/gr_gr_cog/ho.ho03:hoMA.ResEvlog7.text	@ltx/gr_gr_cog/prayers:pr.Alleluia3Glory.text
ltx/gr_gr_cog/ho.ho03:hoMA.ResEvlogVerse.text	Εὐλογητὸς εἶ, Κύριε, δίδαξόν με τὰ δικαιώματά σου.
ltx/gr_gr_cog/ho.ho03:hoMA.RtrSoS01	Ὁ Ἱερεύς ἐξερχόμενος εἰς τά Βημόθυρα καί ἱστάμενος πρό τῆς εἰκόνος τοῦ Χριστοῦ, ἐκφωνεῖ τό μνημόσυνον τῶν κεκοιμημένων.
ltx/gr_gr_cog/ho.ho03:hoMA.SmallDoxology.title	Δοξολογία
ltx/gr_gr_cog/ho.ho03:hoMA.SmallDoxology1.text	Δόξα ἐν ὑψίστοις Θεῷ, καὶ ἐπὶ γῆς εἰρήνη ἐν ἀνθρώποις εὐδοκία. Ὑμνοῦμέν σε, εὐλογοῦμέν σε, προσκυνοῦμέν σε, δοξολογοῦμέν σε, εὐχαριστοῦμέν σοι, διὰ τὴν μεγάλην σου δόξαν. Κύριε Βασιλεῦ, ἐπουράνιε Θεέ, Πάτερ παντοκράτορ· Κύριε Υἱὲ μονογενές, Ἰησοῦ Χριστέ, καὶ Ἅγιον Πνεῦμα. Κύριε ὁ Θεός, ὁ Ἀμνὸς τοῦ Θεοῦ, ὁ Υἱὸς τοῦ Πατρός, ὁ αἴρων τὴν ἁμαρτίαν τοῦ κόσμου, ἐλέησον ἡμᾶς, ὁ αἴρων τὰς ἁμαρτίας τοῦ κόσμου. Πρόσδεξαι τὴν δέησιν ἡμῶν, ὁ καθήμενος ἐν δεξιᾷ τοῦ Πατρός, καὶ ἐλέησον ἡμᾶς. Ὅτι σὺ εἶ μόνος Ἅγιος, σὺ εἶ μόνος Κύριος, Ἰησοῦς Χριστός, εἰς δόξαν Θεοῦ Πατρός. Ἀμήν. Καθʼ ἑκάστην
ltx/gr_gr_cog/ho.ho03:hoMA.SmallDoxology1d	ἡμέραν
ltx/gr_gr_cog/ho.ho03:hoMA.SmallDoxology1e	ἑσπέραν
ltx/gr_gr_cog/ho.ho03:hoMA.SmallDoxology2.text	εὐλογήσω σε, καὶ αἰνέσω τὸ ὄνομά σου εἰς τὸν αἰῶνα, καὶ εἰς τὸν αἰῶνα τοῦ αἰῶνος. Κύριε, καταφυγὴ ἐγενήθης ἡμῖν ἐν γενεᾷ καὶ γενεᾷ. Ἐγὼ εἶπα· Κύριε, ἐλέησόν με· ἴασαι τὴν ψυχήν μου, ὅτι ἥμαρτόν σοι. Κύριε, πρὸς σὲ κατέφυγον· δίδαξόν με τοῦ ποιεῖν τὸ θέλημά σου, ὅτι σὺ εἶ ὁ Θεός μου. Ὅτι παρὰ σοὶ πηγὴ ζωῆς· ἐν τῷ φωτί σου ὀψόμεθα φῶς. Παράτεινον τὸ ἔλεός σου τοῖς γινώσκουσί σε. Καταξίωσον, Κύριε, ἐν τῇ
ltx/gr_gr_cog/ho.ho03:hoMA.SmallDoxology2d	ἡμέρᾳ
ltx/gr_gr_cog/ho.ho03:hoMA.SmallDoxology2e	ἑσπέρᾳ
ltx/gr_gr_cog/ho.ho03:hoMA.SmallDoxology2n	νυκτὶ
ltx/gr_gr_cog/ho.ho03:hoMA.SmallDoxology3.text	ταύτῃ ἀναμαρτήτους φυλαχθῆναι ἡμᾶς. Εὐλογητὸς εἶ, Κύριε, ὁ Θεὸς τῶν Πατέρων ἡμῶν, καὶ αἰνετὸν καὶ δεδοξασμένον τὸ ὄνομά σου εἰς τοὺς αἰῶνας. Ἀμήν. Γένοιτο, Κύριε, τὸ ἔλεός σου ἐφʼ ἡμᾶς, καθάπερ ἠλπίσαμεν ἐπὶ σέ. Εὐλογητὸς εἶ, Κύριε· δίδαξόν με τὰ δικαιώματά σου. Εὐλογητὸς εἶ, Δέσποτα· συνέτισόν με τὰ δικαιώματά σου. Εὐλογητός εἶ, Ἅγιε· φώτισόν με τοῖς δικαιώμασί σου. Κύριε, τὸ ἔλεός σου εἰς τὸν αἰῶνα· τὰ ἔργα τῶν χειρῶν σου μὴ παρίδῃς. Σοὶ πρέπει αἶνος, σοὶ πρέπει ὕμνος, σοὶ δόξα πρέπει, τῷ Πατρί, καὶ τῷ Υἱῷ, καὶ τῷ Ἁγίῳ Πνεύματι, νῦν, καὶ ἀεί, καὶ εἰς τοὺς αἰῶνας τῶν αἰώνων. Ἀμήν.
ltx/gr_gr_cog/ho.ho03:hoMA.SunExapVerse1.text	
ltx/gr_gr_cog/ho.ho03:hoMA.SunPostGospel.incipit	Ἀνάστασιν Χριστοῦ θεασάμενοι…
ltx/gr_gr_cog/ho.ho03:hoMA.SunPostGospel.text	Ἀνάστασιν Χριστοῦ θεασάμενοι, προσκυνήσωμεν Ἅγιον Κύριον Ἰησοῦν, τὸν μόνον ἀναμάρτητον. Τὸν Σταυρόν σου, Χριστέ, προσκυνοῦμεν καὶ τὴν ἁγίαν σου ἀνάστασιν ὑμνοῦμεν καὶ δοξάζομεν· σὺ γὰρ εἶ Θεὸς ἡμῶν, ἐκτός σου ἄλλον οὐκ οἴδαμεν, τὸ ὄνομά σου ὀνομάζομεν. Δεῦτε πάντες οἱ πιστοί, προσκυνήσωμεν τὴν τοῦ Χριστοῦ ἁγίαν ἀνάστασιν· ἰδοὺ γὰρ ἦλθε διὰ τοῦ Σταυροῦ χαρὰ ἐν ὅλῳ τῷ κόσμῳ. Διὰ παντὸς εὐλογοῦντες τὸν Κύριον, ὑμνοῦμεν τὴν ἀνάστασιν αὐτοῦ· Σταυρὸν γὰρ ὑπομείνας διʼ ἡμᾶς, θανάτῳ θάνατον ὤλεσεν.
ltx/gr_gr_cog/ho.ho03:hoMA.SunPostGospelIdiomelon.incipit	Ἀναστὰς ὁ Ἰησοῦς…
ltx/gr_gr_cog/ho.ho03:hoMA.SunPostGospelIdiomelon.text	Ἀναστὰς ὁ Ἰησοῦς ἀπὸ τοῦ τάφου, καθὼς προεῖπεν, ἔδωκεν ἡμῖν τὴν αἰώνιον ζωήν, καὶ μέγα ἔλεος.
ltx/gr_gr_cog/ho.ho03:hoMA.SunTroparion1.incipit	Σήμερον σωτηρία…
ltx/gr_gr_cog/ho.ho03:hoMA.SunTroparion1.mode	@ltx/gr_gr_cog/miscellanea:misc.Mode4
ltx/gr_gr_cog/ho.ho03:hoMA.SunTroparion1.text	Σήμερον σωτηρία τῷ κόσμῳ γέγονεν. ᾌσωμεν τῷ ἀναστάντι ἐκ τάφου καὶ ἀρχηγῷ τῆς ζωῆς ἡμῶν· καθελὼν γὰρ τῷ θανάτῳ τὸν θάνατον, τὸ νῖκος ἔδωκεν ἡμῖν, καὶ τὸ μέγα ἔλεος.
ltx/gr_gr_cog/ho.ho03:hoMA.SunTroparion2.incipit	Ἀναστὰς ἐκ τοῦ μνήματος…
ltx/gr_gr_cog/ho.ho03:hoMA.SunTroparion2.mode	@ltx/gr_gr_cog/miscellanea:misc.Mode8
ltx/gr_gr_cog/ho.ho03:hoMA.SunTroparion2.text	Ἀναστὰς ἐκ τοῦ μνήματος, καὶ τὰ δεσμὰ διαῤῥήξας τοῦ ᾍδου, ἔλυσας τὸ κατάκριμα, τοῦ θανάτου Κύριε, πάντας ἐκ τῶν παγίδων τοῦ ἐχθροῦ ῥυσάμενος, ἐμφανίσας σεαυτὸν τοῖς, Ἀποστόλοις σου, ἐξαπέστειλας αὐτοὺς ἐπὶ τὸ κήρυγμα, καὶ διʼ αὐτῶν τὴν εἰρήνην παρέσχες τῇ οἰκουμένῃ, μόνε πολυέλεε.
ltx/gr_gr_cog/ho.ho03:hoMA.Triadics.title	@ltx/gr_gr_cog/titles:ti.TriadicHymns
ltx/gr_gr_cog/ho.ho03:hoMA.Troparion3.text	Προστασία φοβερὰ καὶ ἀκαταίσχυντε, μὴ παρίδῃς, Ἀγαθή, τὰς ἱκεσίας ἡμῶν, πανύμνητε Θεοτόκε· στήριξον Ὀρθοδόξων πολιτείαν, σῷζε οὓς ἐκέλευσας βασιλεύειν, καὶ χορήγει αὐτοῖς οὐρανόθεν τὴν νίκην· διότι ἔτεκες τὸν Θεόν, μόνη εὐλογημένη.
ltx/gr_gr_cog/ho.ho03:hoMA.title	ΑΚΟΛΟΥΘΙΑ ΤΟΥ ΟΡΘΡΟΥ
