ltx/gr_gr_cog/le.go.me.m06.d08:lemeLI.Gospel.book_abbr	@ltx/gr_gr_cog/le.go.mc.d137:lemcLI.Gospel.book_abbr
ltx/gr_gr_cog/le.go.me.m06.d08:lemeLI.Gospel.book_string	@ltx/gr_gr_cog/le.go.mc.d137:lemcLI.Gospel.book_string
ltx/gr_gr_cog/le.go.me.m06.d08:lemeLI.Gospel.chapverse	@ltx/gr_gr_cog/le.go.mc.d137:lemcLI.Gospel.chapverse
ltx/gr_gr_cog/le.go.me.m06.d08:lemeLI.Gospel.incipit	@ltx/gr_gr_cog/le.go.mc.d137:lemcLI.Gospel.incipit
ltx/gr_gr_cog/le.go.me.m06.d08:lemeLI.Gospel.text	@ltx/gr_gr_cog/le.go.mc.d137:lemcLI.Gospel.text
ltx/gr_gr_cog/le.go.me.m06.d08:lemeLI.Gospel.title	Τοῦ Ἱεράρχου
ltx/gr_gr_cog/le.go.me.m06.d08:lemeLI.Gospel.title_abbr	Τοῦ Ἱεράρχου
ltx/gr_gr_cog/le.go.me.m06.d08:lemeLI.Gospel.version	@ltx/gr_gr_cog/le.go.mc.d137:lemcLI.Gospel.version
