ltx/gr_gr_cog/le.go.me.m05.d15:lemeLI.Gospel.book_abbr	@ltx/gr_gr_cog/le.go.mc.d122:lemcLI.Gospel.book_abbr
ltx/gr_gr_cog/le.go.me.m05.d15:lemeLI.Gospel.book_string	@ltx/gr_gr_cog/le.go.mc.d122:lemcLI.Gospel.book_string
ltx/gr_gr_cog/le.go.me.m05.d15:lemeLI.Gospel.chapverse	@ltx/gr_gr_cog/le.go.mc.d122:lemcLI.Gospel.chapverse
ltx/gr_gr_cog/le.go.me.m05.d15:lemeLI.Gospel.incipit	@ltx/gr_gr_cog/le.go.mc.d122:lemcLI.Gospel.incipit
ltx/gr_gr_cog/le.go.me.m05.d15:lemeLI.Gospel.text	@ltx/gr_gr_cog/le.go.mc.d122:lemcLI.Gospel.text
ltx/gr_gr_cog/le.go.me.m05.d15:lemeLI.Gospel.title	Τῶν Ὁσίων
ltx/gr_gr_cog/le.go.me.m05.d15:lemeLI.Gospel.title_abbr	Τῶν Ὁσίων
ltx/gr_gr_cog/le.go.me.m05.d15:lemeLI.Gospel.version	@ltx/gr_gr_cog/le.go.mc.d122:lemcLI.Gospel.version
