ltx/gr_gr_cog/me.m04.d18:meDA.commemoration.first	Μνήμη τοῦ Ὁσίου Ἰωάννου, μαθητοῦ τοῦ Ἁγίου Γρηγορίου τοῦ Δεκαπολίτου
ltx/gr_gr_cog/me.m04.d18:meDA.commemoration.first_name	
ltx/gr_gr_cog/me.m04.d18:meDA.commemoration.first_short	Μνήμη τοῦ Ὁσίου Ἰωάννου, μαθητοῦ τοῦ Ἁγίου Γρηγορίου τοῦ Δεκαπολίτου
ltx/gr_gr_cog/me.m04.d18:meDA.commemoration.first_title	@ltx/gr_gr_cog/titles:ti.DevoutSaintM
ltx/gr_gr_cog/me.m04.d18:meDA.commemoration.full	Μνήμη τοῦ Ὁσίου Πατρὸς ἡμῶν Ἰωάννου, μαθητοῦ τοῦ Ἁγίου Γρηγορίου τοῦ Δεκαπολίτου
ltx/gr_gr_cog/me.m04.d18:meDA.commemoration.second_name	
ltx/gr_gr_cog/me.m04.d18:meDA.commemoration.second_title	
ltx/gr_gr_cog/me.m04.d18:meDA.date	Τῌ ΙΗʹ ΑΠΡΙΛΙΟΥ
ltx/gr_gr_cog/me.m04.d18:meDA.fordate	διὰ τὴν 18ην Ἀπριλίου
ltx/gr_gr_cog/me.m04.d18:meDA.insert1	καὶ τοῦ Ὁσίου Πατρὸς ἡμῶν Ἰωάννου, μαθητοῦ τοῦ Ἁγίου Γρηγορίου τοῦ Δεκαπολίτου,
ltx/gr_gr_cog/me.m04.d18:meDA.insert2	οὗ καὶ τὴν μνήμην ἐπιτελοῦμεν·
ltx/gr_gr_cog/me.m04.d18:meDA.note	
ltx/gr_gr_cog/me.m04.d18:meDA.pdfcoverdate	τῆς 18ης Ἀπριλίου,
ltx/gr_gr_cog/me.m04.d18:meDA.pdfheaderdate	τῆς 18ης Ἀπριλίου
ltx/gr_gr_cog/me.m04.d18:meHO.commemorations	
ltx/gr_gr_cog/me.m04.d18:meHO.note1	
ltx/gr_gr_cog/me.m04.d18:meHO.note2	
ltx/gr_gr_cog/me.m04.d18:meHO.number	
ltx/gr_gr_cog/me.m04.d18:meHO.rank	
ltx/gr_gr_cog/me.m04.d18:meLE.commemoration1	Μνήμη τοῦ Ὁσίου Πατρὸς ἡμῶν Ἰωάννου, μαθητοῦ τοῦ Ἁγίου Γρηγορίου τοῦ Δεκαπολίτου.
ltx/gr_gr_cog/me.m04.d18:meLE.commemoration2	
ltx/gr_gr_cog/me.m04.d18:meLI.Kontakion1.incipit	@ltx/gr_gr_cog/me.m04.d18:meMA.Kontakion1ger.incipit
ltx/gr_gr_cog/me.m04.d18:meLI.Kontakion1.melody	@ltx/gr_gr_cog/me.m04.d18:meMA.Kontakion1ger.melody
ltx/gr_gr_cog/me.m04.d18:meLI.Kontakion1.mode	@ltx/gr_gr_cog/me.m04.d18:meMA.Kontakion1ger.mode
ltx/gr_gr_cog/me.m04.d18:meLI.Kontakion1.text	@ltx/gr_gr_cog/me.m04.d18:meMA.Kontakion1ger.text
ltx/gr_gr_cog/me.m04.d18:meLI.MM.CommunionHymn.text	@ltx/gr_gr_cog/properties:media.key
ltx/gr_gr_cog/me.m04.d18:meLI.Megalynarion.text	
ltx/gr_gr_cog/me.m04.d18:meMA.C1.poet	@ltx/gr_gr_cog/poets:po.Theofanous
ltx/gr_gr_cog/me.m04.d18:meMA.C1.title	@ltx/gr_gr_cog/titles:ti.CanonSaintM
ltx/gr_gr_cog/me.m04.d18:meMA.C1.verse	@ltx/gr_gr_cog/prayers:pr.verse_SaintM.text
ltx/gr_gr_cog/me.m04.d18:meMA.Kontakion1ger.incipit	Ὡς Ἀσκητῶν, ὑπογραμμὸν καὶ σέμνωμα…
ltx/gr_gr_cog/me.m04.d18:meMA.Kontakion1ger.melody	@ltx/gr_gr_cog/he.a.m2:heAU.TousAsfaleis.name
ltx/gr_gr_cog/me.m04.d18:meMA.Kontakion1ger.mode	@ltx/gr_gr_cog/miscellanea:misc.Mode2
ltx/gr_gr_cog/me.m04.d18:meMA.Kontakion1ger.poet	@ltx/gr_gr_cog/poets:po.Gerasimou
ltx/gr_gr_cog/me.m04.d18:meMA.Kontakion1ger.text	Ὡς Ἀσκητῶν, ὑπογραμμὸν καὶ σέμνωμα, καὶ ἀγαθῶν, τῶν οὐρανίων μέτοχον, κατὰ χρέος εὐφημοῦμέν σε, ὦ Ἰωάννη παμμακάριστε· ὁσίως γὰρ τὸν βίον διεήλυθας, καὶ χάριτος ἐνθέου κατετρύφησας, ἐξ ἧς Πάτερ δώρησαι τοῖς δούλοις σου.
ltx/gr_gr_cog/me.m04.d18:meMA.Ode1C11.greekmelody	@ltx/gr_gr_cog/he.h.m8:heHE.ArmatilatinFarao.greekname
ltx/gr_gr_cog/me.m04.d18:meMA.Ode1C11.incipit	Τῇ τῶν παθῶν με τρικυμίᾳ…
ltx/gr_gr_cog/me.m04.d18:meMA.Ode1C11.melody	@ltx/gr_gr_cog/he.h.m8:heHE.ArmatilatinFarao.name
ltx/gr_gr_cog/me.m04.d18:meMA.Ode1C11.mode	@ltx/gr_gr_cog/miscellanea:misc.Mode8
ltx/gr_gr_cog/me.m04.d18:meMA.Ode1C11.ode	@ltx/gr_gr_cog/miscellanea:misc.Ode1
ltx/gr_gr_cog/me.m04.d18:meMA.Ode1C11.text	Τῇ τῶν παθῶν με τρικυμίᾳ πάντοτε, περιδονούμενον, καὶ λογισμῶν σάλῳ, νῦν περικυκλούμενον, τῇ σῇ πρεσβείᾳ Ὅσιε, ἀπαθείας πρὸς ὅρμον, πρὸς σωτηρίας λιμένα τε, μάκαρ, Ἰωάννη κυβέρνησον.
ltx/gr_gr_cog/me.m04.d18:meMA.Ode1C12.incipit	Μετατεθεὶς τῇ προαιρέσει Ὅσιε, πρὸς…
ltx/gr_gr_cog/me.m04.d18:meMA.Ode1C12.melody	@ltx/gr_gr_cog/he.h.m8:heHE.ArmatilatinFarao.name
ltx/gr_gr_cog/me.m04.d18:meMA.Ode1C12.mode	@ltx/gr_gr_cog/miscellanea:misc.Mode8
ltx/gr_gr_cog/me.m04.d18:meMA.Ode1C12.ode	@ltx/gr_gr_cog/miscellanea:misc.Ode1
ltx/gr_gr_cog/me.m04.d18:meMA.Ode1C12.text	Μετατεθεὶς τῇ προαιρέσει Ὅσιε, πρὸς οὐρανὸν ἀληθῶς, ἀγγελικῶς Πάτερ, ἐπὶ γῆς ἐβίωσας, νεκρώσας σου τὸ φρόνημα, τῆς σαρκὸς ἐγκρατείᾳ, διʼ ἧς Θεοῦ οἰκητήριον, ὤφθης Ἰωάννη θεσπέσιε.
ltx/gr_gr_cog/me.m04.d18:meMA.Ode1C13.incipit	Ὑπακοὴν τὴν εὐπειθῆ κτησάμενος, καὶ…
ltx/gr_gr_cog/me.m04.d18:meMA.Ode1C13.melody	@ltx/gr_gr_cog/he.h.m8:heHE.ArmatilatinFarao.name
ltx/gr_gr_cog/me.m04.d18:meMA.Ode1C13.mode	@ltx/gr_gr_cog/miscellanea:misc.Mode8
ltx/gr_gr_cog/me.m04.d18:meMA.Ode1C13.ode	@ltx/gr_gr_cog/miscellanea:misc.Ode1
ltx/gr_gr_cog/me.m04.d18:meMA.Ode1C13.text	Ὑπακοὴν τὴν εὐπειθῆ κτησάμενος, καὶ τὴν ταπείνωσιν, ὥσπερ χρυσᾶς ταύτας, πτέρυγας ἐκέκτησο· διʼ ὧν Πάτερ ἐπέτασας, κοσμικῶν ἐκ σκανδάλων, πρὸς τὸν Θεόν, ὃν ἐζήτησας, τὸν ἀπὸ τῆς ζάλης σε σώσαντα.
ltx/gr_gr_cog/me.m04.d18:meMA.Ode1C1H.greekmelody	@ltx/gr_gr_cog/he.h.m8:heHE.ArmatilatinFarao.greekname
ltx/gr_gr_cog/me.m04.d18:meMA.Ode1C1H.incipit	@ltx/gr_gr_cog/he.h.m8:heHE.ArmatilatinFarao.incipit
ltx/gr_gr_cog/me.m04.d18:meMA.Ode1C1H.melody	@ltx/gr_gr_cog/he.h.m8:heHE.ArmatilatinFarao.melody
ltx/gr_gr_cog/me.m04.d18:meMA.Ode1C1H.mode	@ltx/gr_gr_cog/miscellanea:misc.Mode8
ltx/gr_gr_cog/me.m04.d18:meMA.Ode1C1H.ode	@ltx/gr_gr_cog/miscellanea:misc.Ode1
ltx/gr_gr_cog/me.m04.d18:meMA.Ode1C1H.text	@ltx/gr_gr_cog/he.h.m8:heHE.ArmatilatinFarao.text
ltx/gr_gr_cog/me.m04.d18:meMA.Ode1C1T.incipit	Ὁ συνυπάρχων τῷ Πατρὶ καὶ…
ltx/gr_gr_cog/me.m04.d18:meMA.Ode1C1T.melody	@ltx/gr_gr_cog/he.h.m8:heHE.ArmatilatinFarao.name
ltx/gr_gr_cog/me.m04.d18:meMA.Ode1C1T.mode	@ltx/gr_gr_cog/miscellanea:misc.Mode8
ltx/gr_gr_cog/me.m04.d18:meMA.Ode1C1T.ode	@ltx/gr_gr_cog/miscellanea:misc.Ode1
ltx/gr_gr_cog/me.m04.d18:meMA.Ode1C1T.text	Ὁ συνυπάρχων τῷ Πατρὶ καὶ Πνεύματι, καὶ συναΐδιος, μονογενὴς Λόγος, ἐκ σοῦ πεφανέρωται, ἐπὶ τῆς γῆς ὡς ἄνθρωπος, Θεοτόκε Μαρία, καὶ κόσμον ὅλον διέσωσεν, αἴνεσιν αὐτῷ ἀναπέμποντα.
ltx/gr_gr_cog/me.m04.d18:meMA.Ode3C11.greekmelody	@ltx/gr_gr_cog/he.h.m8:heHE.OStereosasKatArchas.greekname
ltx/gr_gr_cog/me.m04.d18:meMA.Ode3C11.incipit	Νηφαλεότητι νοός, τῶν οὐρανίων τὰ…
ltx/gr_gr_cog/me.m04.d18:meMA.Ode3C11.melody	@ltx/gr_gr_cog/he.h.m8:heHE.OStereosasKatArchas.name
ltx/gr_gr_cog/me.m04.d18:meMA.Ode3C11.mode	@ltx/gr_gr_cog/miscellanea:misc.Mode8
ltx/gr_gr_cog/me.m04.d18:meMA.Ode3C11.ode	@ltx/gr_gr_cog/miscellanea:misc.Ode3
ltx/gr_gr_cog/me.m04.d18:meMA.Ode3C11.text	Νηφαλεότητι νοός, τῶν οὐρανίων τὰ κάλλη, φανταζόμενος οὐδόλως φροντίσιν, ἐνεπάρης ὑλικαῖς· πτεροῖς δὲ κουφιζόμενος, ἀκτημοσύνης Πάτερ, ὅλος μετάρσιος γέγονας.
ltx/gr_gr_cog/me.m04.d18:meMA.Ode3C12.incipit	Τῆς ἡσυχίας ἐρασθείς, τοῦ φιλησύχου…
ltx/gr_gr_cog/me.m04.d18:meMA.Ode3C12.melody	@ltx/gr_gr_cog/he.h.m8:heHE.OStereosasKatArchas.name
ltx/gr_gr_cog/me.m04.d18:meMA.Ode3C12.mode	@ltx/gr_gr_cog/miscellanea:misc.Mode8
ltx/gr_gr_cog/me.m04.d18:meMA.Ode3C12.ode	@ltx/gr_gr_cog/miscellanea:misc.Ode3
ltx/gr_gr_cog/me.m04.d18:meMA.Ode3C12.text	Τῆς ἡσυχίας ἐρασθείς, τοῦ φιλησύχου ποιμένος, Γρηγορίου, Ἰωάννη τρισμάκαρ, τὰς ἐν βίῳ ταραχάς, προθύμως καταλέλοιπας, καὶ προσευχαῖς ἀπαύστοις, θείας γαλήνης τετύχηκας.
ltx/gr_gr_cog/me.m04.d18:meMA.Ode3C13.incipit	Ἐν ἡσυχίᾳ λογισμῶν, καταστορέσας τὴν…
ltx/gr_gr_cog/me.m04.d18:meMA.Ode3C13.melody	@ltx/gr_gr_cog/he.h.m8:heHE.OStereosasKatArchas.name
ltx/gr_gr_cog/me.m04.d18:meMA.Ode3C13.mode	@ltx/gr_gr_cog/miscellanea:misc.Mode8
ltx/gr_gr_cog/me.m04.d18:meMA.Ode3C13.ode	@ltx/gr_gr_cog/miscellanea:misc.Ode3
ltx/gr_gr_cog/me.m04.d18:meMA.Ode3C13.text	Ἐν ἡσυχίᾳ λογισμῶν, καταστορέσας τὴν ζάλην, ἀταράχως σου τὸν βίον διῆλθες, κυβερνώμενος σοφέ, τῇ χάριτι τοῦ Πνεύματος βεβιωκὼς ὁσίως, ὦ Ἰωάννη θεόπνευστε.
ltx/gr_gr_cog/me.m04.d18:meMA.Ode3C1H.greekmelody	@ltx/gr_gr_cog/he.h.m8:heHE.OStereosasKatArchas.greekname
ltx/gr_gr_cog/me.m04.d18:meMA.Ode3C1H.incipit	@ltx/gr_gr_cog/he.h.m8:heHE.OStereosasKatArchas.incipit
ltx/gr_gr_cog/me.m04.d18:meMA.Ode3C1H.melody	@ltx/gr_gr_cog/he.h.m8:heHE.OStereosasKatArchas.melody
ltx/gr_gr_cog/me.m04.d18:meMA.Ode3C1H.mode	@ltx/gr_gr_cog/miscellanea:misc.Mode8
ltx/gr_gr_cog/me.m04.d18:meMA.Ode3C1H.ode	@ltx/gr_gr_cog/miscellanea:misc.Ode3
ltx/gr_gr_cog/me.m04.d18:meMA.Ode3C1H.text	@ltx/gr_gr_cog/he.h.m8:heHE.OStereosasKatArchas.text
ltx/gr_gr_cog/me.m04.d18:meMA.Ode3C1T.incipit	Ἡ πρὸς ἡμᾶς φωτιστική, τοῦ…
ltx/gr_gr_cog/me.m04.d18:meMA.Ode3C1T.melody	@ltx/gr_gr_cog/he.h.m8:heHE.OStereosasKatArchas.name
ltx/gr_gr_cog/me.m04.d18:meMA.Ode3C1T.mode	@ltx/gr_gr_cog/miscellanea:misc.Mode8
ltx/gr_gr_cog/me.m04.d18:meMA.Ode3C1T.ode	@ltx/gr_gr_cog/miscellanea:misc.Ode3
ltx/gr_gr_cog/me.m04.d18:meMA.Ode3C1T.text	Ἡ πρὸς ἡμᾶς φωτιστική, τοῦ βασιλεύοντος πάντων, τῶν αἰώνων ἀδιόδευτος πύλη, σὺ ἐδείχθης ἀληθῶς, διʼ ἧς αὐτὸς διώδευσεν, ἐσφραγισμένην πάλιν, καταλιπών σε Πανάμωμε.
ltx/gr_gr_cog/me.m04.d18:meMA.Ode3Kathisma1.greekmelody	@ltx/gr_gr_cog/he.a.m1:heAU.TonTafonSouSotir.greekname
ltx/gr_gr_cog/me.m04.d18:meMA.Ode3Kathisma1.incipit	Ἐνθάψας πονηράς, τῶν δαιμόνων ἐνέδρας…
ltx/gr_gr_cog/me.m04.d18:meMA.Ode3Kathisma1.melody	@ltx/gr_gr_cog/he.a.m1:heAU.TonTafonSouSotir.name
ltx/gr_gr_cog/me.m04.d18:meMA.Ode3Kathisma1.mode	@ltx/gr_gr_cog/miscellanea:misc.Mode1
ltx/gr_gr_cog/me.m04.d18:meMA.Ode3Kathisma1.text	Ἐνθάψας πονηράς, τῶν δαιμόνων ἐνέδρας, ἀσκήσεσι πολλαῖς, καὶ δεήσεσι Πάτερ, νεκρὸς τάφῳ κείμενος, ἀδιάλυτος ἔμεινας· ὅθεν χαίροντες, τὴν παναγίαν σου μνήμην, ἑορτάζομεν, ἐν εὐφροσύνῃ καρδίας, Χριστὸν μεγαλύνοντες.
ltx/gr_gr_cog/me.m04.d18:meMA.Ode3KathismaSt.incipit	Ἡ ἄσπιλος Ἀμνάς, τὸν Ἀμνὸν…
ltx/gr_gr_cog/me.m04.d18:meMA.Ode3KathismaSt.melody	@ltx/gr_gr_cog/he.a.m1:heAU.TonTafonSouSotir.name
ltx/gr_gr_cog/me.m04.d18:meMA.Ode3KathismaSt.mode	@ltx/gr_gr_cog/miscellanea:misc.Mode1
ltx/gr_gr_cog/me.m04.d18:meMA.Ode3KathismaSt.text	Ἡ ἄσπιλος Ἀμνάς, τὸν Ἀμνὸν καθορῶσα, νεκρὸν ἐπὶ Σταυροῦ, ἡπλωμένον ἐβόα· Υἱέ μου συνάναρχε, τῷ Πατρὶ καὶ τῷ Πνεύματι, τίς ἡ ἄφατος, οἰκονομία σου αὕτη; διʼ ἧς ἔσωσας, τὸ τῶν ἀχράντων χειρῶν σου, σοφὸν δημιούργημα.
ltx/gr_gr_cog/me.m04.d18:meMA.Ode3KathismaT.incipit	@ltx/gr_gr_cog/me.m04.d12:meMA.Ode3KathismaT.incipit
ltx/gr_gr_cog/me.m04.d18:meMA.Ode3KathismaT.melody	@ltx/gr_gr_cog/he.a.m1:heAU.TonTafonSouSotir.name
ltx/gr_gr_cog/me.m04.d18:meMA.Ode3KathismaT.mode	@ltx/gr_gr_cog/miscellanea:misc.Mode1
ltx/gr_gr_cog/me.m04.d18:meMA.Ode3KathismaT.text	@ltx/gr_gr_cog/me.m04.d12:meMA.Ode3KathismaT.text
ltx/gr_gr_cog/me.m04.d18:meMA.Ode4C11.greekmelody	@ltx/gr_gr_cog/he.h.m8:heHE.SyMouIschys.greekname
ltx/gr_gr_cog/me.m04.d18:meMA.Ode4C11.incipit	Ὑπομονῆς, πέτρα ἐδείχθης Μακάριε, ἐναντίοις…
ltx/gr_gr_cog/me.m04.d18:meMA.Ode4C11.melody	@ltx/gr_gr_cog/he.h.m8:heHE.SyMouIschys.name
ltx/gr_gr_cog/me.m04.d18:meMA.Ode4C11.mode	@ltx/gr_gr_cog/miscellanea:misc.Mode8
ltx/gr_gr_cog/me.m04.d18:meMA.Ode4C11.ode	@ltx/gr_gr_cog/miscellanea:misc.Ode4
ltx/gr_gr_cog/me.m04.d18:meMA.Ode4C11.text	Ὑπομονῆς, πέτρα ἐδείχθης Μακάριε, ἐναντίοις, κύμασιν ἑκάστοτε, προσρησσομένη καὶ μηδαμῶς, τοῦ τῆς εὐσεβείας, σαλευομένη φρονήματος· διό σε ὁ Δεσπότης, ὡς ὑπέρτιμον λίθον, θησαυροῖς αἰωνίοις ἀπέθετο.
ltx/gr_gr_cog/me.m04.d18:meMA.Ode4C12.incipit	Σὲ ὁ Πατήρ, τῶν οἰκτιρμῶν…
ltx/gr_gr_cog/me.m04.d18:meMA.Ode4C12.melody	@ltx/gr_gr_cog/he.h.m8:heHE.SyMouIschys.name
ltx/gr_gr_cog/me.m04.d18:meMA.Ode4C12.mode	@ltx/gr_gr_cog/miscellanea:misc.Mode8
ltx/gr_gr_cog/me.m04.d18:meMA.Ode4C12.ode	@ltx/gr_gr_cog/miscellanea:misc.Ode4
ltx/gr_gr_cog/me.m04.d18:meMA.Ode4C12.text	Σὲ ὁ Πατήρ, τῶν οἰκτιρμῶν προσελάβετο, ὡς γνησίως, τοῦτον ἀγαπήσαντα, καὶ ταῖς αὐτοῦ, Πάτερ ἐντολαῖς, ἐπηγρυπνηκότα, καὶ τοῖς υἱοῖς συναρίθμιον, τῆς χάριτος ποιήσας, ἀϊδίου σε δόξης, Ἰωάννη θεόφρον ἠξίωσεν.
ltx/gr_gr_cog/me.m04.d18:meMA.Ode4C13.incipit	Τῶν ἀρετῶν, σὺ ἀναβὰς ἐπὶ…
ltx/gr_gr_cog/me.m04.d18:meMA.Ode4C13.melody	@ltx/gr_gr_cog/he.h.m8:heHE.SyMouIschys.name
ltx/gr_gr_cog/me.m04.d18:meMA.Ode4C13.mode	@ltx/gr_gr_cog/miscellanea:misc.Mode8
ltx/gr_gr_cog/me.m04.d18:meMA.Ode4C13.ode	@ltx/gr_gr_cog/miscellanea:misc.Ode4
ltx/gr_gr_cog/me.m04.d18:meMA.Ode4C13.text	Τῶν ἀρετῶν, σὺ ἀναβὰς ἐπὶ κλίμακος, εἶδες ὄντως, τὴν ἀκατανόητον, δόξαν Θεοῦ, καὶ καταυγασθείς, νοῦν καὶ τὴν καρδίαν, τῇ θείᾳ αἴγλῃ τοῦ Πνεύματος, ὁλόφωτος ἐδείχθης, ὥσπερ ἥλιος Πάτερ, καταλάμπων πολλοὺς ἐν τῷ βίῳ σου.
ltx/gr_gr_cog/me.m04.d18:meMA.Ode4C1H.greekmelody	@ltx/gr_gr_cog/he.h.m8:heHE.SyMouIschys.greekname
ltx/gr_gr_cog/me.m04.d18:meMA.Ode4C1H.incipit	@ltx/gr_gr_cog/he.h.m8:heHE.SyMouIschys.incipit
ltx/gr_gr_cog/me.m04.d18:meMA.Ode4C1H.melody	@ltx/gr_gr_cog/he.h.m8:heHE.SyMouIschys.melody
ltx/gr_gr_cog/me.m04.d18:meMA.Ode4C1H.mode	@ltx/gr_gr_cog/miscellanea:misc.Mode8
ltx/gr_gr_cog/me.m04.d18:meMA.Ode4C1H.ode	@ltx/gr_gr_cog/miscellanea:misc.Ode4
ltx/gr_gr_cog/me.m04.d18:meMA.Ode4C1H.text	@ltx/gr_gr_cog/he.h.m8:heHE.SyMouIschys.text
ltx/gr_gr_cog/me.m04.d18:meMA.Ode4C1T.incipit	Σὺ ἀληθῶς, τῆς σωτηρίας ὑπόθεσις…
ltx/gr_gr_cog/me.m04.d18:meMA.Ode4C1T.melody	@ltx/gr_gr_cog/he.h.m8:heHE.SyMouIschys.name
ltx/gr_gr_cog/me.m04.d18:meMA.Ode4C1T.mode	@ltx/gr_gr_cog/miscellanea:misc.Mode8
ltx/gr_gr_cog/me.m04.d18:meMA.Ode4C1T.ode	@ltx/gr_gr_cog/miscellanea:misc.Ode4
ltx/gr_gr_cog/me.m04.d18:meMA.Ode4C1T.text	Σὺ ἀληθῶς, τῆς σωτηρίας ὑπόθεσις, Θεομῆτορ, μόνη ἐχρημάτισας, τῷ Ποιητῇ καὶ Δημιουργῷ, ἐκ τῶν σῶν ἀχράντων, αἱμάτων σάρκα δανείσασα, διʼ ἧς αἱ τοῦ θανάτου, συνετρίβησαν πύλαι, καὶ ζωὴ τοῖς ἀνθρώποις δεδώρηται.
ltx/gr_gr_cog/me.m04.d18:meMA.Ode5C11.greekmelody	@ltx/gr_gr_cog/he.h.m8:heHE.InaTiMeAposo.greekname
ltx/gr_gr_cog/me.m04.d18:meMA.Ode5C11.incipit	Ὥσπερ ἄκακον ἄρνα, χλόῃ τῆς…
ltx/gr_gr_cog/me.m04.d18:meMA.Ode5C11.melody	@ltx/gr_gr_cog/he.h.m8:heHE.InaTiMeAposo.name
ltx/gr_gr_cog/me.m04.d18:meMA.Ode5C11.mode	@ltx/gr_gr_cog/miscellanea:misc.Mode8
ltx/gr_gr_cog/me.m04.d18:meMA.Ode5C11.ode	@ltx/gr_gr_cog/miscellanea:misc.Ode5
ltx/gr_gr_cog/me.m04.d18:meMA.Ode5C11.text	Ὥσπερ ἄκακον ἄρνα, χλόῃ τῆς ἀσκήσεως ἐντεθραμμένον σε, ὁ ποιμὴν ὁ μέγας, ἐν αὐλαῖς αἰωνίοις προσήκατο, Ἰωάννη Μάκαρ, καὶ δεξιοῖς αὐτοῦ προβάτοις, συναρίθμιον Ὅσιε ἔδειξεν.
ltx/gr_gr_cog/me.m04.d18:meMA.Ode5C12.incipit	Τῆς ἡμέρας τὸ βάρος, Πάτερ…
ltx/gr_gr_cog/me.m04.d18:meMA.Ode5C12.melody	@ltx/gr_gr_cog/he.h.m8:heHE.InaTiMeAposo.name
ltx/gr_gr_cog/me.m04.d18:meMA.Ode5C12.mode	@ltx/gr_gr_cog/miscellanea:misc.Mode8
ltx/gr_gr_cog/me.m04.d18:meMA.Ode5C12.ode	@ltx/gr_gr_cog/miscellanea:misc.Ode5
ltx/gr_gr_cog/me.m04.d18:meMA.Ode5C12.text	Τῆς ἡμέρας τὸ βάρος, Πάτερ καί τὸν καύσωνα στεῤῥῶς ἐβάστασας, ἀρετῶν τὸν θεῖον, ἀμπελῶνα καλῶς ἐργασάμενος· ὅθεν τῇ ἑσπέρᾳ, τῆς ἐκ τοῦ βίου ἐκδημίας, τὸν μισθὸν ἐκομίσω ἐπάξιον.
ltx/gr_gr_cog/me.m04.d18:meMA.Ode5C13.incipit	Ἐντολῶν θεμελίῳ, Πάτερ ᾠκοδόμησας, πύργον…
ltx/gr_gr_cog/me.m04.d18:meMA.Ode5C13.melody	@ltx/gr_gr_cog/he.h.m8:heHE.InaTiMeAposo.name
ltx/gr_gr_cog/me.m04.d18:meMA.Ode5C13.mode	@ltx/gr_gr_cog/miscellanea:misc.Mode8
ltx/gr_gr_cog/me.m04.d18:meMA.Ode5C13.ode	@ltx/gr_gr_cog/miscellanea:misc.Ode5
ltx/gr_gr_cog/me.m04.d18:meMA.Ode5C13.text	Ἐντολῶν θεμελίῳ, Πάτερ ᾠκοδόμησας, πύργον ὑψίκομον, διʼ οὗ καὶ ἀνέπτης, πρὸς αὐτὸ τῶν καλῶν τὸ ἀκρότατον, καὶ τὸν ὄντως ὄντα, ψυχεραστὴν ἰδὼν ὡς θέμις, ὁλοψύχως αὐτῷ ἠκολούθησας.
ltx/gr_gr_cog/me.m04.d18:meMA.Ode5C1H.greekmelody	@ltx/gr_gr_cog/he.h.m8:heHE.InaTiMeAposo.greekname
ltx/gr_gr_cog/me.m04.d18:meMA.Ode5C1H.incipit	@ltx/gr_gr_cog/he.h.m8:heHE.InaTiMeAposo.incipit
ltx/gr_gr_cog/me.m04.d18:meMA.Ode5C1H.melody	@ltx/gr_gr_cog/he.h.m8:heHE.InaTiMeAposo.melody
ltx/gr_gr_cog/me.m04.d18:meMA.Ode5C1H.mode	@ltx/gr_gr_cog/miscellanea:misc.Mode8
ltx/gr_gr_cog/me.m04.d18:meMA.Ode5C1H.ode	@ltx/gr_gr_cog/miscellanea:misc.Ode5
ltx/gr_gr_cog/me.m04.d18:meMA.Ode5C1H.text	@ltx/gr_gr_cog/he.h.m8:heHE.InaTiMeAposo.text
ltx/gr_gr_cog/me.m04.d18:meMA.Ode5C1T.incipit	Νεκρωθέντα Παρθένε, κέντρῳ παραβάσεως καὶ…
ltx/gr_gr_cog/me.m04.d18:meMA.Ode5C1T.melody	@ltx/gr_gr_cog/he.h.m8:heHE.InaTiMeAposo.name
ltx/gr_gr_cog/me.m04.d18:meMA.Ode5C1T.mode	@ltx/gr_gr_cog/miscellanea:misc.Mode8
ltx/gr_gr_cog/me.m04.d18:meMA.Ode5C1T.ode	@ltx/gr_gr_cog/miscellanea:misc.Ode5
ltx/gr_gr_cog/me.m04.d18:meMA.Ode5C1T.text	Νεκρωθέντα Παρθένε, κέντρῳ παραβάσεως καὶ κατακείμενον, ἐξανάστησόν με, ἡ ζωὴν τὴν ἀθάνατον τέξασα, τὸν Σωτῆρα τοῦ κόσμου, καὶ Λυτρωτὴν καὶ βασιλέα, καὶ πρὸς φῶς καθοδήγησον ἄχραντε.
ltx/gr_gr_cog/me.m04.d18:meMA.Ode6C11.greekmelody	@ltx/gr_gr_cog/he.h.m8:heHE.IlasthitiMoiSotir.greekname
ltx/gr_gr_cog/me.m04.d18:meMA.Ode6C11.incipit	Δακρύων σου σταλαγμοῖς, παθῶν ἐξήρανας…
ltx/gr_gr_cog/me.m04.d18:meMA.Ode6C11.melody	@ltx/gr_gr_cog/he.h.m8:heHE.IlasthitiMoiSotir.name
ltx/gr_gr_cog/me.m04.d18:meMA.Ode6C11.mode	@ltx/gr_gr_cog/miscellanea:misc.Mode8
ltx/gr_gr_cog/me.m04.d18:meMA.Ode6C11.ode	@ltx/gr_gr_cog/miscellanea:misc.Ode6
ltx/gr_gr_cog/me.m04.d18:meMA.Ode6C11.text	Δακρύων σου σταλαγμοῖς, παθῶν ἐξήρανας πέλαγος, καὶ πᾶσαν τοῦ νοητοῦ, ἐχθροῦ κατεπόντισας, ἀνίσχυρον δύναμιν, Ἰωάννη Μάκαρ, τοῦ Χριστοῦ ἐνδυναμοῦντός σε.
ltx/gr_gr_cog/me.m04.d18:meMA.Ode6C12.incipit	Ὡς ὄβρυζόν σε χρουσόν, δοκιμασθέντα…
ltx/gr_gr_cog/me.m04.d18:meMA.Ode6C12.melody	@ltx/gr_gr_cog/he.h.m8:heHE.IlasthitiMoiSotir.name
ltx/gr_gr_cog/me.m04.d18:meMA.Ode6C12.mode	@ltx/gr_gr_cog/miscellanea:misc.Mode8
ltx/gr_gr_cog/me.m04.d18:meMA.Ode6C12.ode	@ltx/gr_gr_cog/miscellanea:misc.Ode6
ltx/gr_gr_cog/me.m04.d18:meMA.Ode6C12.text	Ὡς ὄβρυζόν σε χρουσόν, δοκιμασθέντα ἀοίδιμε, ἀσκήσεως τῷ πυρί, Χριστὸς ἐναπέθετο, Βασιλεὺς ὁ ἄφθαρτος, ἐν ἀφθάρτοις Πάτερ, θησαυροῖς τῆς αἰωνίου ζωῆς.
ltx/gr_gr_cog/me.m04.d18:meMA.Ode6C13.incipit	Ὡς κῆπος πανευθαλής, ἐδείχθης ὄντως…
ltx/gr_gr_cog/me.m04.d18:meMA.Ode6C13.melody	@ltx/gr_gr_cog/he.h.m8:heHE.IlasthitiMoiSotir.name
ltx/gr_gr_cog/me.m04.d18:meMA.Ode6C13.mode	@ltx/gr_gr_cog/miscellanea:misc.Mode8
ltx/gr_gr_cog/me.m04.d18:meMA.Ode6C13.ode	@ltx/gr_gr_cog/miscellanea:misc.Ode6
ltx/gr_gr_cog/me.m04.d18:meMA.Ode6C13.text	Ὡς κῆπος πανευθαλής, ἐδείχθης ὄντως καὶ εὔκαρπος, δακρύων τοῖς ὀχετοῖς, καλῶς ἀρδευόμενος, καὶ μυρίπνουν Ὅσιε, τὸν καρπὸν τῷ Κτίστῃ, Ἰωάννη προσενήνοχας.
ltx/gr_gr_cog/me.m04.d18:meMA.Ode6C1H.greekmelody	@ltx/gr_gr_cog/he.h.m8:heHE.IlasthitiMoiSotir.greekname
ltx/gr_gr_cog/me.m04.d18:meMA.Ode6C1H.incipit	@ltx/gr_gr_cog/he.h.m8:heHE.IlasthitiMoiSotir.incipit
ltx/gr_gr_cog/me.m04.d18:meMA.Ode6C1H.melody	@ltx/gr_gr_cog/he.h.m8:heHE.IlasthitiMoiSotir.melody
ltx/gr_gr_cog/me.m04.d18:meMA.Ode6C1H.mode	@ltx/gr_gr_cog/miscellanea:misc.Mode8
ltx/gr_gr_cog/me.m04.d18:meMA.Ode6C1H.ode	@ltx/gr_gr_cog/miscellanea:misc.Ode6
ltx/gr_gr_cog/me.m04.d18:meMA.Ode6C1H.text	@ltx/gr_gr_cog/he.h.m8:heHE.IlasthitiMoiSotir.text
ltx/gr_gr_cog/me.m04.d18:meMA.Ode6C1T.incipit	Τὸ σκήνωμα τοῦ Θεοῦ, τὸ…
ltx/gr_gr_cog/me.m04.d18:meMA.Ode6C1T.melody	@ltx/gr_gr_cog/he.h.m8:heHE.IlasthitiMoiSotir.name
ltx/gr_gr_cog/me.m04.d18:meMA.Ode6C1T.mode	@ltx/gr_gr_cog/miscellanea:misc.Mode8
ltx/gr_gr_cog/me.m04.d18:meMA.Ode6C1T.ode	@ltx/gr_gr_cog/miscellanea:misc.Ode6
ltx/gr_gr_cog/me.m04.d18:meMA.Ode6C1T.text	Τὸ σκήνωμα τοῦ Θεοῦ, τὸ θεῖον ὄντως καὶ πάνσεπτον, ὑμνήσωμεν εὐσεβῶς, Μαρίαν τὴν ἄχραντον· Θεὸν γὰρ ἐχώρησεν, ὑποδεξαμένη, τὸν ἀχώρητον καὶ ἄληπτον.
ltx/gr_gr_cog/me.m04.d18:meMA.Ode7C11.greekmelody	@ltx/gr_gr_cog/he.h.m8:heHE.OiEkTisIoudaias.greekname
ltx/gr_gr_cog/me.m04.d18:meMA.Ode7C11.incipit	Τὴν δευτέραν Κυρίου, ἐννοῶν παρουσίαν…
ltx/gr_gr_cog/me.m04.d18:meMA.Ode7C11.melody	@ltx/gr_gr_cog/he.h.m8:heHE.OiEkTisIoudaias.name
ltx/gr_gr_cog/me.m04.d18:meMA.Ode7C11.mode	@ltx/gr_gr_cog/miscellanea:misc.Mode8
ltx/gr_gr_cog/me.m04.d18:meMA.Ode7C11.ode	@ltx/gr_gr_cog/miscellanea:misc.Ode7
ltx/gr_gr_cog/me.m04.d18:meMA.Ode7C11.text	Τὴν δευτέραν Κυρίου, ἐννοῶν παρουσίαν, ἀπὸ βλεφάρων ψυχῆς, τὸν ὕπνον ἀπεβάλου, Σοφὲ τῆς ἀμελείας, καὶ ἀγρύπνως ἐκραύγαζες· ὁ τῶν Πατέρων ἡμῶν, Θεὸς εὐλογητός εἶ.
ltx/gr_gr_cog/me.m04.d18:meMA.Ode7C12.incipit	Ἁπαλῶν ἐξ ὀνύχων, ἀγαθὴν ἐξελέξω…
ltx/gr_gr_cog/me.m04.d18:meMA.Ode7C12.melody	@ltx/gr_gr_cog/he.h.m8:heHE.OiEkTisIoudaias.name
ltx/gr_gr_cog/me.m04.d18:meMA.Ode7C12.mode	@ltx/gr_gr_cog/miscellanea:misc.Mode8
ltx/gr_gr_cog/me.m04.d18:meMA.Ode7C12.ode	@ltx/gr_gr_cog/miscellanea:misc.Ode7
ltx/gr_gr_cog/me.m04.d18:meMA.Ode7C12.text	Ἁπαλῶν ἐξ ὀνύχων, ἀγαθὴν ἐξελέξω μερίδα Πάνσοφε, δουλεύειν τῷ Κυρίῳ, ἐν φόβῳ τε τὰ τούτου, ἐκτελεῖν δικαιώματα, ὁ τῶν Πατέρων βοῶν· Θεὸς εὐλογητὸς εἶ.
ltx/gr_gr_cog/me.m04.d18:meMA.Ode7C13.incipit	Μακρυνθεὶς τοῦ σαρκίου, τῶν δεσμῶν…
ltx/gr_gr_cog/me.m04.d18:meMA.Ode7C13.melody	@ltx/gr_gr_cog/he.h.m8:heHE.OiEkTisIoudaias.name
ltx/gr_gr_cog/me.m04.d18:meMA.Ode7C13.mode	@ltx/gr_gr_cog/miscellanea:misc.Mode8
ltx/gr_gr_cog/me.m04.d18:meMA.Ode7C13.ode	@ltx/gr_gr_cog/miscellanea:misc.Ode7
ltx/gr_gr_cog/me.m04.d18:meMA.Ode7C13.text	Μακρυνθεὶς τοῦ σαρκίου, τῶν δεσμῶν Ἰωάννη, ψυχῆς ἐφρόντισας, Κυρίῳ ἐλευθέρᾳ, τῇ γνώμῃ ἐκδουλεύων, καὶ κραυγάζων ἑκάστοτε· ὁ τῶν Πατέρων ἡμῶν, Θεὸς εὐλογητός εἶ.
ltx/gr_gr_cog/me.m04.d18:meMA.Ode7C1H.greekmelody	@ltx/gr_gr_cog/he.h.m8:heHE.OiEkTisIoudaias.greekname
ltx/gr_gr_cog/me.m04.d18:meMA.Ode7C1H.incipit	@ltx/gr_gr_cog/he.h.m8:heHE.OiEkTisIoudaias.incipit
ltx/gr_gr_cog/me.m04.d18:meMA.Ode7C1H.melody	@ltx/gr_gr_cog/he.h.m8:heHE.OiEkTisIoudaias.melody
ltx/gr_gr_cog/me.m04.d18:meMA.Ode7C1H.mode	@ltx/gr_gr_cog/miscellanea:misc.Mode8
ltx/gr_gr_cog/me.m04.d18:meMA.Ode7C1H.ode	@ltx/gr_gr_cog/miscellanea:misc.Ode7
ltx/gr_gr_cog/me.m04.d18:meMA.Ode7C1H.text	@ltx/gr_gr_cog/he.h.m8:heHE.OiEkTisIoudaias.text
ltx/gr_gr_cog/me.m04.d18:meMA.Ode7C1T.incipit	Ἡ τοῦ κόσμου Κυρία, ἡ…
ltx/gr_gr_cog/me.m04.d18:meMA.Ode7C1T.melody	@ltx/gr_gr_cog/he.h.m8:heHE.OiEkTisIoudaias.name
ltx/gr_gr_cog/me.m04.d18:meMA.Ode7C1T.mode	@ltx/gr_gr_cog/miscellanea:misc.Mode8
ltx/gr_gr_cog/me.m04.d18:meMA.Ode7C1T.ode	@ltx/gr_gr_cog/miscellanea:misc.Ode7
ltx/gr_gr_cog/me.m04.d18:meMA.Ode7C1T.text	Ἡ τοῦ κόσμου Κυρία, ἡ Θεὸν σαρκωθέντα, ἡμῖν κυήσασα, πολλαῖς κυριευθεῖσαν, ἀτόποις ἁμαρτίαις, τὴν ψυχήν μου διάσωσον· εὐλογημένη Ἁγνή, ἵνα σε μακαρίζω.
ltx/gr_gr_cog/me.m04.d18:meMA.Ode8C11.greekmelody	@ltx/gr_gr_cog/he.h.m8:heHE.EptaplasiosKaminon.greekname
ltx/gr_gr_cog/me.m04.d18:meMA.Ode8C11.incipit	Ὡς μηλωτὴν τὸ χάρισμα, εὐφυῶς…
ltx/gr_gr_cog/me.m04.d18:meMA.Ode8C11.melody	@ltx/gr_gr_cog/he.h.m8:heHE.EptaplasiosKaminon.name
ltx/gr_gr_cog/me.m04.d18:meMA.Ode8C11.mode	@ltx/gr_gr_cog/miscellanea:misc.Mode8
ltx/gr_gr_cog/me.m04.d18:meMA.Ode8C11.ode	@ltx/gr_gr_cog/miscellanea:misc.Ode8
ltx/gr_gr_cog/me.m04.d18:meMA.Ode8C11.text	Ὡς μηλωτὴν τὸ χάρισμα, εὐφυῶς κληρωσάμενος, Πάτερ, Ἰωάννη, τοῦ κλεινοῦ ποιμένος σου, ἐν τούτῳ διέῤῥηξας, τῶν ἡδονῶν τὸ πέλαγος, καὶ διασωθείς, ἀκαταπόντιστος ὤφθης, Ἀγγέλων συμπολίτης, σὺν αὐτοῖς ἀνακράζων· Λαὸς ὑπερυψοῦτε, Χριστὸν εἰς τοὺς αἰῶνας.
ltx/gr_gr_cog/me.m04.d18:meMA.Ode8C12.incipit	Τὸν διʼ ἡμᾶς πτωχεύσαντα, ὑπεράγαθον…
ltx/gr_gr_cog/me.m04.d18:meMA.Ode8C12.melody	@ltx/gr_gr_cog/he.h.m8:heHE.EptaplasiosKaminon.name
ltx/gr_gr_cog/me.m04.d18:meMA.Ode8C12.mode	@ltx/gr_gr_cog/miscellanea:misc.Mode8
ltx/gr_gr_cog/me.m04.d18:meMA.Ode8C12.ode	@ltx/gr_gr_cog/miscellanea:misc.Ode8
ltx/gr_gr_cog/me.m04.d18:meMA.Ode8C12.text	Τὸν διʼ ἡμᾶς πτωχεύσαντα, ὑπεράγαθον Κύριον, Πάτερ Ἰωάννη, εὐσεβῶς μιμούμενος, πτηνῶν ἐν ἰσότητι, ἀκτημοσύνην ἤσκησας, καὶ τῶν ἀγαθῶν, τῶν αἰωνίων τὸν πλοῦτον, ἐκτήσω ἀναμέλπων· Ἱερεῖς εὐλογεῖτε, λαὸς ὑπερυψοῦτε, Χριστὸν εἰς τοὺς αἰῶνας.
ltx/gr_gr_cog/me.m04.d18:meMA.Ode8C13.incipit	Ἡ καθαρὰ τοῦ Πνεύματος, τῇ…
ltx/gr_gr_cog/me.m04.d18:meMA.Ode8C13.melody	@ltx/gr_gr_cog/he.h.m8:heHE.EptaplasiosKaminon.name
ltx/gr_gr_cog/me.m04.d18:meMA.Ode8C13.mode	@ltx/gr_gr_cog/miscellanea:misc.Mode8
ltx/gr_gr_cog/me.m04.d18:meMA.Ode8C13.ode	@ltx/gr_gr_cog/miscellanea:misc.Ode8
ltx/gr_gr_cog/me.m04.d18:meMA.Ode8C13.text	Ἡ καθαρὰ τοῦ Πνεύματος, τῇ ψυχῇ σου σκηνώσασα, χάρις καθαράν σοι, τὴν καρδίαν ἔκτισε, καὶ πνεῦμα ἐκαίνισεν, εὐθὲς ἐν τοῖς ἐγκάτοις σου· ὅθεν καὶ βιώσας, καθαρᾷ πολιτείᾳ, ἐβόας Ἰωάννη· Ἱερεῖς εὐλογεῖτε, λαὸς ὑπερυψοῦτε, Χριστὸν εἰς τοὺς αἰῶνας.
ltx/gr_gr_cog/me.m04.d18:meMA.Ode8C1H.greekmelody	@ltx/gr_gr_cog/he.h.m8:heHE.EptaplasiosKaminon.greekname
ltx/gr_gr_cog/me.m04.d18:meMA.Ode8C1H.incipit	@ltx/gr_gr_cog/he.h.m8:heHE.EptaplasiosKaminon.incipit
ltx/gr_gr_cog/me.m04.d18:meMA.Ode8C1H.melody	@ltx/gr_gr_cog/he.h.m8:heHE.EptaplasiosKaminon.melody
ltx/gr_gr_cog/me.m04.d18:meMA.Ode8C1H.mode	@ltx/gr_gr_cog/miscellanea:misc.Mode8
ltx/gr_gr_cog/me.m04.d18:meMA.Ode8C1H.ode	@ltx/gr_gr_cog/miscellanea:misc.Ode8
ltx/gr_gr_cog/me.m04.d18:meMA.Ode8C1H.text	@ltx/gr_gr_cog/he.h.m8:heHE.EptaplasiosKaminon.text
ltx/gr_gr_cog/me.m04.d18:meMA.Ode8C1T.incipit	Ἁγιασθεῖσα Πνεύματι, Θεοτόκε πανάμωμε, ὄντως…
ltx/gr_gr_cog/me.m04.d18:meMA.Ode8C1T.melody	@ltx/gr_gr_cog/he.h.m8:heHE.EptaplasiosKaminon.name
ltx/gr_gr_cog/me.m04.d18:meMA.Ode8C1T.mode	@ltx/gr_gr_cog/miscellanea:misc.Mode8
ltx/gr_gr_cog/me.m04.d18:meMA.Ode8C1T.ode	@ltx/gr_gr_cog/miscellanea:misc.Ode8
ltx/gr_gr_cog/me.m04.d18:meMA.Ode8C1T.text	Ἁγιασθεῖσα Πνεύματι, Θεοτόκε πανάμωμε, ὄντως ὑπεδέξω, ἐν γαστρὶ τὸν ἄναρχον, Υἱὸν καὶ ἀΐδιον, ἐν σοὶ ἁγνὴ σαρκούμενον, ἐπʼ εὐεργεσία, τῶν ἐν πίστει βοώντων· Οἱ Παῖδες εὐλογεῖτε, Ἱερεῖς ἀνυμνεῖτε, λαὸς ὑπερυψοῦτε, Χριστὸν εἰς τοὺς αἰῶνας.
ltx/gr_gr_cog/me.m04.d18:meMA.Ode9C11.greekmelody	@ltx/gr_gr_cog/he.h.m8:heHE.ExestiEpiTouto.greekname
ltx/gr_gr_cog/me.m04.d18:meMA.Ode9C11.incipit	Νεώσας τῷ ἀρότρῳ τῶν προσευχῶν…
ltx/gr_gr_cog/me.m04.d18:meMA.Ode9C11.melody	@ltx/gr_gr_cog/he.h.m8:heHE.ExestiEpiTouto.name
ltx/gr_gr_cog/me.m04.d18:meMA.Ode9C11.mode	@ltx/gr_gr_cog/miscellanea:misc.Mode8
ltx/gr_gr_cog/me.m04.d18:meMA.Ode9C11.ode	@ltx/gr_gr_cog/miscellanea:misc.Ode9
ltx/gr_gr_cog/me.m04.d18:meMA.Ode9C11.text	Νεώσας τῷ ἀρότρῳ τῶν προσευχῶν, Ἰωάννη ψυχῆς σου τὴν αὔλακα, τῶν ἀρετῶν, ταύτῃ κατεβάλου τὰ εὐσεβῆ, καὶ ζωηφόρα σπέρματα· ὅθεν ἰαμάτων θεοπρεπῶν, ἐθέρισας τὸν στάχυν, πολύχουν θεοφόρε, διʼ οὗ ἐκτρέφεις τους ὑμνοῦντάς σε.
ltx/gr_gr_cog/me.m04.d18:meMA.Ode9C12.incipit	Τὸν δρόμον ἐκτελέσας ἀσκητικῶς, καὶ…
ltx/gr_gr_cog/me.m04.d18:meMA.Ode9C12.melody	@ltx/gr_gr_cog/he.h.m8:heHE.ExestiEpiTouto.name
ltx/gr_gr_cog/me.m04.d18:meMA.Ode9C12.mode	@ltx/gr_gr_cog/miscellanea:misc.Mode8
ltx/gr_gr_cog/me.m04.d18:meMA.Ode9C12.ode	@ltx/gr_gr_cog/miscellanea:misc.Ode9
ltx/gr_gr_cog/me.m04.d18:meMA.Ode9C12.text	Τὸν δρόμον ἐκτελέσας ἀσκητικῶς, καὶ τὴν πίστιν τηρήσας Μακάριε, ὡς ἀληθῶς, πλήρης ἡλικίας πνευματικῆς, δικαιοσύνης στέφανον, εἴληφας θεόφρον παρὰ Χριστοῦ, καὶ νῦν ἐπαναπαύῃ, σκηναῖς φωτεινοτάταις, μετὰ Δικαίων παναοίδιμε.
ltx/gr_gr_cog/me.m04.d18:meMA.Ode9C13.incipit	Ἐπέβης ὡς ἐν ἅρματι ἀρετῶν…
ltx/gr_gr_cog/me.m04.d18:meMA.Ode9C13.melody	@ltx/gr_gr_cog/he.h.m8:heHE.ExestiEpiTouto.name
ltx/gr_gr_cog/me.m04.d18:meMA.Ode9C13.mode	@ltx/gr_gr_cog/miscellanea:misc.Mode8
ltx/gr_gr_cog/me.m04.d18:meMA.Ode9C13.ode	@ltx/gr_gr_cog/miscellanea:misc.Ode9
ltx/gr_gr_cog/me.m04.d18:meMA.Ode9C13.text	Ἐπέβης ὡς ἐν ἅρματι ἀρετῶν, τῷ τεθρίππῳ παμμάκαρ αἰθέριος, εἰς οὐρανούς, ἄλλος ὡς Ἠλίας Πάτερ σοφέ, καὶ σὺν Ὁσίοις ᾤκησας, σῶμα τὸ πολύαθλον ἐπὶ γῆς, λιπὼν τοῖς σὲ ποθοῦσι, ταμεῖον ἰαμάτων, καὶ τῶν δαιμόνων ἐλατήριον.
ltx/gr_gr_cog/me.m04.d18:meMA.Ode9C1H.greekmelody	@ltx/gr_gr_cog/he.h.m8:heHE.ExestiEpiTouto.greekname
ltx/gr_gr_cog/me.m04.d18:meMA.Ode9C1H.incipit	@ltx/gr_gr_cog/he.h.m8:heHE.ExestiEpiTouto.incipit
ltx/gr_gr_cog/me.m04.d18:meMA.Ode9C1H.melody	@ltx/gr_gr_cog/he.h.m8:heHE.ExestiEpiTouto.melody
ltx/gr_gr_cog/me.m04.d18:meMA.Ode9C1H.mode	@ltx/gr_gr_cog/miscellanea:misc.Mode8
ltx/gr_gr_cog/me.m04.d18:meMA.Ode9C1H.ode	@ltx/gr_gr_cog/miscellanea:misc.Ode9
ltx/gr_gr_cog/me.m04.d18:meMA.Ode9C1H.text	@ltx/gr_gr_cog/he.h.m8:heHE.ExestiEpiTouto.text
ltx/gr_gr_cog/me.m04.d18:meMA.Ode9C1T.incipit	Ῥιφθέντας οὐρανίου διαγωγῆς, καὶ πεσόντας…
ltx/gr_gr_cog/me.m04.d18:meMA.Ode9C1T.melody	@ltx/gr_gr_cog/he.h.m8:heHE.ExestiEpiTouto.name
ltx/gr_gr_cog/me.m04.d18:meMA.Ode9C1T.mode	@ltx/gr_gr_cog/miscellanea:misc.Mode8
ltx/gr_gr_cog/me.m04.d18:meMA.Ode9C1T.ode	@ltx/gr_gr_cog/miscellanea:misc.Ode9
ltx/gr_gr_cog/me.m04.d18:meMA.Ode9C1T.text	Ῥιφθέντας οὐρανίου διαγωγῆς, καὶ πεσόντας ἀθλίως εἰς θάνατον, πάλιν ἡμᾶς, Μήτηρ γενομένη τοῦ Λυτρωτοῦ, ἀνεκαλέσω Πάναγνε, καὶ πρὸς τὴν ἀρχαίαν παλινδρομεῖν, ἠξίωσας πατρίδα· διό σε Θεομῆτορ, ἀκαταπαύστως μεγαλύνομεν.
ltx/gr_gr_cog/me.m04.d18:meVE.Apolytikion1ger.greekmelody	@ltx/gr_gr_cog/he.a.m5:heAU.TonSynanarchonLogon.greekname
ltx/gr_gr_cog/me.m04.d18:meVE.Apolytikion1ger.incipit	Ἁπαλῶν ἐξ ὀνύχων Χριστὸν ἠγάπησας…
ltx/gr_gr_cog/me.m04.d18:meVE.Apolytikion1ger.melody	@ltx/gr_gr_cog/he.a.m5:heAU.TonSynanarchonLogon.name
ltx/gr_gr_cog/me.m04.d18:meVE.Apolytikion1ger.mode	@ltx/gr_gr_cog/miscellanea:misc.Mode5
ltx/gr_gr_cog/me.m04.d18:meVE.Apolytikion1ger.poet	@ltx/gr_gr_cog/poets:po.Gerasimou
ltx/gr_gr_cog/me.m04.d18:meVE.Apolytikion1ger.text	Ἁπαλῶν ἐξ ὀνύχων Χριστὸν ἠγάπησας, καὶ τὴν σὴν κλῆσιν θεόφρον καταλαμπρύνεις σαφῶς, πλήρης χάριτος ὀφθεὶς τοῦ θείου Πνεύματος· ἐκκαθάρας γὰρ τὸν νοῦν, τῶν Ἀγγέλων μιμητής, ἐν σώματι ἀνεδείχθης. Πατὴρ ἡμῶν Ἰωάννη, μεθʼ ὧν ἱκέτευε σωθῆναι ἡμᾶς.
ltx/gr_gr_cog/me.m04.d18:meVE.SticStavrotheotokion.greekmelody	@ltx/gr_gr_cog/he.a.m6:heAU.OlinApothemenoi.greekname
ltx/gr_gr_cog/me.m04.d18:meVE.SticStavrotheotokion.incipit	Πάθος τὸ ἑκούσιον, τοῦ ἀπαθοῦς…
ltx/gr_gr_cog/me.m04.d18:meVE.SticStavrotheotokion.melody	@ltx/gr_gr_cog/he.a.m6:heAU.OlinApothemenoi.name
ltx/gr_gr_cog/me.m04.d18:meVE.SticStavrotheotokion.mode	@ltx/gr_gr_cog/miscellanea:misc.Mode6
ltx/gr_gr_cog/me.m04.d18:meVE.SticStavrotheotokion.text	Πάθος τὸ ἑκούσιον, τοῦ ἀπαθοῦς καθορῶσα, ἡ ἁγνὴ καὶ ἄμωμος, μητρικῶς ὠδύρετο, καὶ ἐκραύγαζεν· Ὦ φρικτὸν θέαμα! πῶς ὁ κτίσας πάντα, ὁρατὰ καὶ τὰ ἀόρατα, ὁ δόξης Κύριος, νῦν καὶ Βασιλεὺς προαιώνιος, ἀδίκως κατακέκριται, καὶ μετὰ κακούργων λελόγισται; Τὰ ὄρη καὶ νάπαι, σταλάξατέ μοι δάκρυον πικρόν, καὶ μονωθεῖσαν θρηνήσατε, τὴν τὸν Κτίστην τέξασαν.
ltx/gr_gr_cog/me.m04.d18:meVE.SticTheotokion.greekmelody	@ltx/gr_gr_cog/he.a.m6:heAU.OlinApothemenoi.greekname
ltx/gr_gr_cog/me.m04.d18:meVE.SticTheotokion.incipit	Ἄσπιλε ἀμόλυντε, Μήτηρ Θεοῦ Παναγία…
ltx/gr_gr_cog/me.m04.d18:meVE.SticTheotokion.melody	@ltx/gr_gr_cog/he.a.m6:heAU.OlinApothemenoi.name
ltx/gr_gr_cog/me.m04.d18:meVE.SticTheotokion.mode	@ltx/gr_gr_cog/miscellanea:misc.Mode6
ltx/gr_gr_cog/me.m04.d18:meVE.SticTheotokion.text	Ἄσπιλε ἀμόλυντε, Μήτηρ Θεοῦ Παναγία, Κόρη ἀειπάρθενε, Θεοτόκε Δέσποινα, πῶς ὑμνήσω σε, τὸ Θεοῦ σκήνωμα, ὁ μεμολυσμένος, τὴν ψυχὴν καὶ τὴν διάνοιαν, πῶς δὲ τὸ μέγεθος σοῦ τῶν θαυμασίων ἐξείποιμι, τὴν χάριν καὶ τὸ ἔλεος, ὅπερ ἐπιχέεις μοι πάντοτε; Φρίττων οὖν προσπίπτω, καὶ κράζω σοι τό, Χαῖρε εὐλαβῶς, χαῖρε πιστῶν παραμύθιον, τῶν παρακαλούντων σε.
ltx/gr_gr_cog/me.m04.d18:meVE.Stichera01.greekmelody	@ltx/gr_gr_cog/he.a.m6:heAU.OlinApothemenoi.greekname
ltx/gr_gr_cog/me.m04.d18:meVE.Stichera01.incipit	Ὁρμάς τὰς τοῦ σώματος, καὶ…
ltx/gr_gr_cog/me.m04.d18:meVE.Stichera01.melody	@ltx/gr_gr_cog/he.a.m6:heAU.OlinApothemenoi.name
ltx/gr_gr_cog/me.m04.d18:meVE.Stichera01.mode	@ltx/gr_gr_cog/miscellanea:misc.Mode6
ltx/gr_gr_cog/me.m04.d18:meVE.Stichera01.text	Ὁρμάς τὰς τοῦ σώματος, καὶ τὴν πικρὰν τυραννίδα, τῶν παθῶν ἐξέκλινας, θείῳ φόβῳ Ὅσιε, κυβερνώμενος, καὶ Θεὸν εὔφρανας, ἀρετῶν κάλλεσιν, ὡραΐσας τὴν καρδίαν σου, καὶ νῦν ἐσκήνωσας, ἔνθα τῶν Ὁσίων τὰ τάγματα, κατάλληλον τοῦ πόθου σου, Πάτερ εὑρηκὼς τὴν κατάπαυσιν, ἔνθα μνημονεύειν, ἡμῶν μὴ διαλίπῃς τῶν πιστῶς, ἐπιτελούντων τὴν μνήμην σου, Ἰωάννη Ὅσιε.
ltx/gr_gr_cog/me.m04.d18:meVE.Stichera02.incipit	Θεὸν ἐξεζήτησας, ἀνεπιστρόφῳ καρδίᾳ, μελέταις…
ltx/gr_gr_cog/me.m04.d18:meVE.Stichera02.melody	@ltx/gr_gr_cog/he.a.m6:heAU.OlinApothemenoi.name
ltx/gr_gr_cog/me.m04.d18:meVE.Stichera02.mode	@ltx/gr_gr_cog/miscellanea:misc.Mode6
ltx/gr_gr_cog/me.m04.d18:meVE.Stichera02.text	Θεὸν ἐξεζήτησας, ἀνεπιστρόφῳ καρδίᾳ, μελέταις πτερούμενος, ἱεραῖς θεόπνευστε, καὶ ταῖς νεύσεσι, πρὸς αὐτὸν πάντοτε, ὁλικῶς κείμενος, πρὸς δὲ τοῦτο ἐπαλείφοντα, καὶ παρορμῶντά σε, ἔσχες τὸν ἐν κλήσει καὶ πράξεσι, Γρηγόριον τὸν θαύμασι, καὶ τερατουργίαις ἐκλάμψαντα, οὗ ταῖς φρυκτωρίαις, λαμπόμενος διῆλθες ἀβλαβῶς, τοῦ ταπεινοῦ τούτου σώματος, μάκαρ τὸ κλυδώνιον.
ltx/gr_gr_cog/me.m04.d18:meVE.Stichera03.incipit	Ὁσίως ἐβίωσας, μὴ ἐσχηκὼς τὰς…
ltx/gr_gr_cog/me.m04.d18:meVE.Stichera03.melody	@ltx/gr_gr_cog/he.a.m6:heAU.OlinApothemenoi.name
ltx/gr_gr_cog/me.m04.d18:meVE.Stichera03.mode	@ltx/gr_gr_cog/miscellanea:misc.Mode6
ltx/gr_gr_cog/me.m04.d18:meVE.Stichera03.text	Ὁσίως ἐβίωσας, μὴ ἐσχηκὼς τὰς φροντίδας, τοῦ βίου ταῖς κρείττοσιν, ἐργασίαις Ὅσιε καλλυνόμενος· ἀλλὰ πῦρ ἄϋλον, ἐν καρδίᾳ φέρων, ἡσυχίαν ἐκαρτέρησας, παννύχοις στάσεσι, καὶ ταῖς ἀγρυπνίαις προσκείμενος, εὐτόνως καθαιρόμενος καὶ θεοειδὴς ἐνδεικνύμενος· ὅθεν μετὰ πόνους, τὴν ἄπονον ἀπείληφας τρυφήν, τοῖς σὲ τιμῶσιν αἰτούμενος, θείαν ἀγαλλίασιν.
