ltx/gr_gr_cog/me.m12.d18:meDA.commemoration.first	Μνήμη τοῦ Ἁγίου Μάρτυρος Σεβαστιανοῦ καὶ τῶν σὺν αὐτῷ
ltx/gr_gr_cog/me.m12.d18:meDA.commemoration.first_name	
ltx/gr_gr_cog/me.m12.d18:meDA.commemoration.first_short	Μνήμη τοῦ Ἁγίου Μάρτυρος Σεβαστιανοῦ καὶ τῶν σὺν αὐτῷ
ltx/gr_gr_cog/me.m12.d18:meDA.commemoration.first_title	@ltx/gr_gr_cog/titles:ti.Martyrs
ltx/gr_gr_cog/me.m12.d18:meDA.commemoration.full	Μνήμη τοῦ Ἁγίου Μάρτυρος Σεβαστιανοῦ, καὶ τῶν σὺν αὐτῷ
ltx/gr_gr_cog/me.m12.d18:meDA.commemoration.second_name	
ltx/gr_gr_cog/me.m12.d18:meDA.commemoration.second_title	
ltx/gr_gr_cog/me.m12.d18:meDA.date	Τῌ ΙΗʹ ΔΕΚΕΜΒΡΙΟΥ
ltx/gr_gr_cog/me.m12.d18:meDA.fordate	διὰ τὴν 18ην Δεκεμβρίου
ltx/gr_gr_cog/me.m12.d18:meDA.insert1	καὶ τοῦ Ἁγίου Μάρτυρος Σεβαστιανοῦ, καὶ τῶν σὺν αὐτῷ,
ltx/gr_gr_cog/me.m12.d18:meDA.insert2	ὧν καὶ τὴν μνήμην ἐπιτελοῦμεν·
ltx/gr_gr_cog/me.m12.d18:meDA.note	
ltx/gr_gr_cog/me.m12.d18:meDA.pdfcoverdate	τῆς 18ης Δεκεμβρίου,
ltx/gr_gr_cog/me.m12.d18:meDA.pdfheaderdate	τῆς 18ης Δεκεμβρίου
ltx/gr_gr_cog/me.m12.d18:meHO.commemorations	
ltx/gr_gr_cog/me.m12.d18:meHO.note1	
ltx/gr_gr_cog/me.m12.d18:meHO.note2	
ltx/gr_gr_cog/me.m12.d18:meHO.number	
ltx/gr_gr_cog/me.m12.d18:meHO.rank	
ltx/gr_gr_cog/me.m12.d18:meLE.commemoration1	Μνήμη τοῦ Ἁγίου Μάρτυρος Σεβαστιανοῦ, καὶ τῶν σὺν αὐτῷ.
ltx/gr_gr_cog/me.m12.d18:meLE.commemoration2	
ltx/gr_gr_cog/me.m12.d18:meLI.Kontakion1.incipit	…
ltx/gr_gr_cog/me.m12.d18:meLI.Kontakion1.melody	
ltx/gr_gr_cog/me.m12.d18:meLI.Kontakion1.mode	
ltx/gr_gr_cog/me.m12.d18:meLI.Kontakion1.text	
ltx/gr_gr_cog/me.m12.d18:meLI.Megalynarion.text	Χαίροις Ἐκκλησίας ἄστρον λαμπρόν, καὶ Σιὼν τῆς θείας, ὁ κοσμήτωρ ὁ ἱερός· χαίροις ἱεράρχα, Μόδεστε θεοφόρε, ἡμῶν πρὸς τὸν Δεσπότην, πρέσβυς θερμότατος.
ltx/gr_gr_cog/me.m12.d18:meMA.C1.acrostic.notice1	οὗ ἡ Ἀκροστιχίς·
ltx/gr_gr_cog/me.m12.d18:meMA.C1.acrostic.text	Θεῖον σέβας σοι Μάρτυς ἐμφρόνως νέμω. Ἰωσήφ.
ltx/gr_gr_cog/me.m12.d18:meMA.C1.acrostic.title	Κανὼν τοῦ Μάρτυρος,
ltx/gr_gr_cog/me.m12.d18:meMA.C1.title	@ltx/gr_gr_cog/titles:ti.CanonMartyrM
ltx/gr_gr_cog/me.m12.d18:meMA.C1.verse	@ltx/gr_gr_cog/prayers:pr.verse_SaintM.text
ltx/gr_gr_cog/me.m12.d18:meMA.Ode1C11.greekmelody	@ltx/gr_gr_cog/he.h.m1:heHE.SouITropaiouchos.greekname
ltx/gr_gr_cog/me.m12.d18:meMA.Ode1C11.incipit	Θείαις φαιδρυνόμενος αὐγαῖς, τῆς σεβασμίου…
ltx/gr_gr_cog/me.m12.d18:meMA.Ode1C11.melody	@ltx/gr_gr_cog/he.h.m1:heHE.SouITropaiouchos.name
ltx/gr_gr_cog/me.m12.d18:meMA.Ode1C11.mode	@ltx/gr_gr_cog/miscellanea:misc.Mode1
ltx/gr_gr_cog/me.m12.d18:meMA.Ode1C11.ode	@ltx/gr_gr_cog/miscellanea:misc.Ode1
ltx/gr_gr_cog/me.m12.d18:meMA.Ode1C11.text	Θείαις φαιδρυνόμενος αὐγαῖς, τῆς σεβασμίου Τριάδος Ἀοίδιμε, πίστει τοὺς τιμῶντάς σου, τὴν φωταυγῆ καὶ ἱερὰν πανήγυριν, σοῦ ταῖς ἱκεσίαις, φωτὸς μετόχους ἀνάδειξον.
ltx/gr_gr_cog/me.m12.d18:meMA.Ode1C12.incipit	Ἔχων λογισμὸν φωτοειδῆ, καὶ δεκτικὸν…
ltx/gr_gr_cog/me.m12.d18:meMA.Ode1C12.melody	@ltx/gr_gr_cog/he.h.m1:heHE.SouITropaiouchos.name
ltx/gr_gr_cog/me.m12.d18:meMA.Ode1C12.mode	@ltx/gr_gr_cog/miscellanea:misc.Mode1
ltx/gr_gr_cog/me.m12.d18:meMA.Ode1C12.ode	@ltx/gr_gr_cog/miscellanea:misc.Ode1
ltx/gr_gr_cog/me.m12.d18:meMA.Ode1C12.text	Ἔχων λογισμὸν φωτοειδῆ, καὶ δεκτικὸν καθαρῶν ἐπιλάμψεων, μόνον ἐπεπόθησας, τὸ ὄντως Ὄν, ὡς νουνεχὴς καὶ φρόνιμος, Μάρτυς ἀθλοφόρε, καὶ τούτου πίστει τετύχηκας.
ltx/gr_gr_cog/me.m12.d18:meMA.Ode1C13.incipit	Ἱδρῶσιν ἐνθέοις ἀληθῶς, τὰ τῆς…
ltx/gr_gr_cog/me.m12.d18:meMA.Ode1C13.melody	@ltx/gr_gr_cog/he.h.m1:heHE.SouITropaiouchos.name
ltx/gr_gr_cog/me.m12.d18:meMA.Ode1C13.mode	@ltx/gr_gr_cog/miscellanea:misc.Mode1
ltx/gr_gr_cog/me.m12.d18:meMA.Ode1C13.ode	@ltx/gr_gr_cog/miscellanea:misc.Ode1
ltx/gr_gr_cog/me.m12.d18:meMA.Ode1C13.text	Ἱδρῶσιν ἐνθέοις ἀληθῶς, τὰ τῆς σαρκὸς ἀμαυρώσας φρονήματα, αἵμασιν ἀθλήσεως, τοὺς θολεροὺς χειμάῤῥους ἀπεξήρανας, τῆς πολυθεΐας, θεόφρον Μάρτυς πολύαθλε.
ltx/gr_gr_cog/me.m12.d18:meMA.Ode1C14.incipit	Ὅμιλον προσῆξας Ἀθλητῶν, διδασκαλίαις σου…
ltx/gr_gr_cog/me.m12.d18:meMA.Ode1C14.melody	@ltx/gr_gr_cog/he.h.m1:heHE.SouITropaiouchos.name
ltx/gr_gr_cog/me.m12.d18:meMA.Ode1C14.mode	@ltx/gr_gr_cog/miscellanea:misc.Mode1
ltx/gr_gr_cog/me.m12.d18:meMA.Ode1C14.ode	@ltx/gr_gr_cog/miscellanea:misc.Ode1
ltx/gr_gr_cog/me.m12.d18:meMA.Ode1C14.text	Ὅμιλον προσῆξας Ἀθλητῶν, διδασκαλίαις σου θείαις τῷ Κτίσαντι, πᾶσαν τὴν διάνοιαν, τῶν διωκτῶν καταβαλὼν τῇ χάριτι, Πνεύματος Ἁγίου, μεθʼ ὧν πρεσβεύεις σωθῆναι ἡμᾶς.
ltx/gr_gr_cog/me.m12.d18:meMA.Ode1C1T.incipit	Νέον ἀπεκύησας Υἱόν, τὸν πρὸ…
ltx/gr_gr_cog/me.m12.d18:meMA.Ode1C1T.melody	@ltx/gr_gr_cog/he.h.m1:heHE.SouITropaiouchos.name
ltx/gr_gr_cog/me.m12.d18:meMA.Ode1C1T.mode	@ltx/gr_gr_cog/miscellanea:misc.Mode1
ltx/gr_gr_cog/me.m12.d18:meMA.Ode1C1T.ode	@ltx/gr_gr_cog/miscellanea:misc.Ode1
ltx/gr_gr_cog/me.m12.d18:meMA.Ode1C1T.text	Νέον ἀπεκύησας Υἱόν, τὸν πρὸ αἰώνων Πατρὶ συννοούμενον, φύσεως καινίσασα, νόμους ἁγνή, Παρθενομῆτορ ἄχραντε, ἐν τῇ ὑπὲρ φύσιν, σεπτῇ καὶ θείᾳ γεννήσει σου.
ltx/gr_gr_cog/me.m12.d18:meMA.Ode3C11.greekmelody	@ltx/gr_gr_cog/he.h.m1:heHE.OMonosEidos.greekname
ltx/gr_gr_cog/me.m12.d18:meMA.Ode3C11.incipit	Στρατὸν ἐπαγόμενος σεπτόν, τῆς θείας…
ltx/gr_gr_cog/me.m12.d18:meMA.Ode3C11.melody	@ltx/gr_gr_cog/he.h.m1:heHE.OMonosEidos.name
ltx/gr_gr_cog/me.m12.d18:meMA.Ode3C11.mode	@ltx/gr_gr_cog/miscellanea:misc.Mode1
ltx/gr_gr_cog/me.m12.d18:meMA.Ode3C11.ode	@ltx/gr_gr_cog/miscellanea:misc.Ode3
ltx/gr_gr_cog/me.m12.d18:meMA.Ode3C11.text	Στρατὸν ἐπαγόμενος σεπτόν, τῆς θείας ὅπλοις πίστεως, ὠχυρωμένον Μάρτυς ἀήττητε, τὰς παρατάξεις τοῦ πολεμήτορος, καὶ τὰ πανουργεύματα τῶν Τυράννων ἅπαντα, καταβάλλεις τῷ σθένει τοῦ Πνεύματος.
ltx/gr_gr_cog/me.m12.d18:meMA.Ode3C12.incipit	Ἐρείσας ἐν πέτρᾳ νοητή, τὰς…
ltx/gr_gr_cog/me.m12.d18:meMA.Ode3C12.melody	@ltx/gr_gr_cog/he.h.m1:heHE.OMonosEidos.name
ltx/gr_gr_cog/me.m12.d18:meMA.Ode3C12.mode	@ltx/gr_gr_cog/miscellanea:misc.Mode1
ltx/gr_gr_cog/me.m12.d18:meMA.Ode3C12.ode	@ltx/gr_gr_cog/miscellanea:misc.Ode3
ltx/gr_gr_cog/me.m12.d18:meMA.Ode3C12.text	Ἐρείσας ἐν πέτρᾳ νοητή, τὰς βάσεις τῆς καρδίας σου, εὐσεβοφρόνως Μάρτυς πολύαθλε, οὐ παρετράπης τοῖς μηχανήμασι, τοῦ δολίου δράκοντος, ἀλλὰ πᾶσιν ἔρεισμα, εὐσεβείας ἐν Πνεύματι γέγονας.
ltx/gr_gr_cog/me.m12.d18:meMA.Ode3C13.incipit	Βελῶν ἐκκεντήσεις χαλεπάς, ὑπέφερες δεσμούμενος…
ltx/gr_gr_cog/me.m12.d18:meMA.Ode3C13.melody	@ltx/gr_gr_cog/he.h.m1:heHE.OMonosEidos.name
ltx/gr_gr_cog/me.m12.d18:meMA.Ode3C13.mode	@ltx/gr_gr_cog/miscellanea:misc.Mode1
ltx/gr_gr_cog/me.m12.d18:meMA.Ode3C13.ode	@ltx/gr_gr_cog/miscellanea:misc.Ode3
ltx/gr_gr_cog/me.m12.d18:meMA.Ode3C13.text	Βελῶν ἐκκεντήσεις χαλεπάς, ὑπέφερες δεσμούμενος, καὶ ἐπὶ ξύλου Μάρτυς τεινόμενος, Θεοῦ δὲ θείᾳ δυνάμει ἔνδοξε, ἀσινὴς ὁλόκληρος, αὖθις ἀπεδείκνυσο, καταισχύνων ἐχθροῦ μηχανήματα.
ltx/gr_gr_cog/me.m12.d18:meMA.Ode3C1T.incipit	Ἁγίασμα ὤφθης νοητόν, τοῦ πάντας…
ltx/gr_gr_cog/me.m12.d18:meMA.Ode3C1T.melody	@ltx/gr_gr_cog/he.h.m1:heHE.OMonosEidos.name
ltx/gr_gr_cog/me.m12.d18:meMA.Ode3C1T.mode	@ltx/gr_gr_cog/miscellanea:misc.Mode1
ltx/gr_gr_cog/me.m12.d18:meMA.Ode3C1T.ode	@ltx/gr_gr_cog/miscellanea:misc.Ode3
ltx/gr_gr_cog/me.m12.d18:meMA.Ode3C1T.text	Ἁγίασμα ὤφθης νοητόν, τοῦ πάντας ἁγιάζοντος, καὶ καθαρὸν Πανάμωμε σκήνωμα· ἐκ σοῦ γὰρ ὤφθη Θεὸς σαρκούμενος, καὶ διπλοῦς ταῖς φύσεσι, κόσμῳ γνωριζόμενος, ἐν μιᾷ ὑποστάσει Θεόνυμφε.
ltx/gr_gr_cog/me.m12.d18:meMA.Ode3H.greekmelody	@ltx/gr_gr_cog/he.h.m1:heHE.OMonosEidos.greekname
ltx/gr_gr_cog/me.m12.d18:meMA.Ode3H.incipit	@ltx/gr_gr_cog/he.h.m1:heHE.OMonosEidos.incipit
ltx/gr_gr_cog/me.m12.d18:meMA.Ode3H.melody	@ltx/gr_gr_cog/he.h.m1:heHE.OMonosEidos.melody
ltx/gr_gr_cog/me.m12.d18:meMA.Ode3H.mode	@ltx/gr_gr_cog/miscellanea:misc.Mode1
ltx/gr_gr_cog/me.m12.d18:meMA.Ode3H.ode	@ltx/gr_gr_cog/miscellanea:misc.Ode3
ltx/gr_gr_cog/me.m12.d18:meMA.Ode3H.text	@ltx/gr_gr_cog/he.h.m1:heHE.OMonosEidos.text
ltx/gr_gr_cog/me.m12.d18:meMA.Ode3Kathisma1.greekmelody	@ltx/gr_gr_cog/he.a.m1:heAU.TonTafonSouSotir.greekname
ltx/gr_gr_cog/me.m12.d18:meMA.Ode3Kathisma1.incipit	Τῷ βίῳ τῷ φαιδρῷ, συναστράπτοντα…
ltx/gr_gr_cog/me.m12.d18:meMA.Ode3Kathisma1.melody	@ltx/gr_gr_cog/he.a.m1:heAU.TonTafonSouSotir.name
ltx/gr_gr_cog/me.m12.d18:meMA.Ode3Kathisma1.mode	@ltx/gr_gr_cog/miscellanea:misc.Mode1
ltx/gr_gr_cog/me.m12.d18:meMA.Ode3Kathisma1.text	Τῷ βίῳ τῷ φαιδρῷ, συναστράπτοντα ἔχων τὸν λόγον ἱερῶς, ἐφειλκύσω ἀγέλας, πιστῶν πρὸς εὐσέβειαν, μεθʼ ὧν χαίρων ἐνήθλησας, πᾶσαν κάκωσιν, ὑπενεγκὼν τῶν Τυράννων· ὅθεν σήμερον τὴν παναγίαν σου μνήμην, τελοῦντες ὑμνοῦμέν σε.
ltx/gr_gr_cog/me.m12.d18:meMA.Ode3KathismaSt.incipit	Ὢ θαύματος φρικτοῦ! ὢ καινοῦ…
ltx/gr_gr_cog/me.m12.d18:meMA.Ode3KathismaSt.melody	@ltx/gr_gr_cog/he.a.m1:heAU.TonTafonSouSotir.name
ltx/gr_gr_cog/me.m12.d18:meMA.Ode3KathismaSt.mode	@ltx/gr_gr_cog/miscellanea:misc.Mode1
ltx/gr_gr_cog/me.m12.d18:meMA.Ode3KathismaSt.text	Ὢ θαύματος φρικτοῦ! ὢ καινοῦ μυστηρίου! ἐβόα ἡ ἁγνή, καὶ πανάμωμος Κόρη, ἐν ξύλῳ ὡς ἔβλεψε, τανυσθέντα σε Κύριε, πῶς ἀδέκαστε, Κριτὰ ἁπάντων καὶ Λόγε, ὡς κατάκριτος, ὑπὸ κριτῶν παρανόμων, Σταυρῷ κατακέκρισαι;
ltx/gr_gr_cog/me.m12.d18:meMA.Ode3KathismaT.incipit	Μαρία τὸ σεπτόν, τοῦ Δεσπότου…
ltx/gr_gr_cog/me.m12.d18:meMA.Ode3KathismaT.melody	@ltx/gr_gr_cog/he.a.m1:heAU.TonTafonSouSotir.name
ltx/gr_gr_cog/me.m12.d18:meMA.Ode3KathismaT.mode	@ltx/gr_gr_cog/miscellanea:misc.Mode1
ltx/gr_gr_cog/me.m12.d18:meMA.Ode3KathismaT.text	Μαρία τὸ σεπτόν, τοῦ Δεσπότου δοχεῖον, ἀνάστησον ἡμᾶς, πεπτωκότας εἰς βάθος, δεινῆς ἀπογνώσεως, καὶ πταισμάτων καὶ θλίψεων· σὺ γὰρ πέφυκας, ἁμαρτωλῶν σωτηρία, καὶ βοήθεια, καὶ κραταιὰ προστασία, καὶ σῴζεις τοὺς δούλους σου.
ltx/gr_gr_cog/me.m12.d18:meMA.Ode4C11.greekmelody	@ltx/gr_gr_cog/he.h.m1:heHE.OrosSeTiChariti.greekname
ltx/gr_gr_cog/me.m12.d18:meMA.Ode4C11.incipit	Σθένοις σοι Τιβούρτιε, δωρεῖται ὁ…
ltx/gr_gr_cog/me.m12.d18:meMA.Ode4C11.melody	@ltx/gr_gr_cog/he.h.m1:heHE.OrosSeTiChariti.name
ltx/gr_gr_cog/me.m12.d18:meMA.Ode4C11.mode	@ltx/gr_gr_cog/miscellanea:misc.Mode1
ltx/gr_gr_cog/me.m12.d18:meMA.Ode4C11.ode	@ltx/gr_gr_cog/miscellanea:misc.Ode4
ltx/gr_gr_cog/me.m12.d18:meMA.Ode4C11.text	Σθένοις σοι Τιβούρτιε, δωρεῖται ὁ Κύριος, διʼ ἀσθενείας τῆς σαρκός, καταπαλαῖσαι τὸν ἐχθρόν· πυρὶ γὰρ φλογίζοντι, νεανικῶς, ἐπέβης Μάρτυς στεῤῥότατα, καὶ τὴν οὐράνιον δρόσον ἀντέλαβες.
ltx/gr_gr_cog/me.m12.d18:meMA.Ode4C12.incipit	Συνήφθης τοῖς ἄνω, λειτουργοῖς ὦ…
ltx/gr_gr_cog/me.m12.d18:meMA.Ode4C12.melody	@ltx/gr_gr_cog/he.h.m1:heHE.OrosSeTiChariti.name
ltx/gr_gr_cog/me.m12.d18:meMA.Ode4C12.mode	@ltx/gr_gr_cog/miscellanea:misc.Mode1
ltx/gr_gr_cog/me.m12.d18:meMA.Ode4C12.ode	@ltx/gr_gr_cog/miscellanea:misc.Ode4
ltx/gr_gr_cog/me.m12.d18:meMA.Ode4C12.text	Συνήφθης τοῖς ἄνω, λειτουργοῖς ὦ Τιβούρτιε, ὡς λειτουργήσας τῷ Χριστῷ, καὶ ἀνενέγκας καθαράς, θυσίας ἐν πνεύματι, Ἱερουργέ, Μαρτύρων κλέος καὶ καύχημα, χαρμονικῶς· διὰ τοῦτο τιμῶμέν σε.
ltx/gr_gr_cog/me.m12.d18:meMA.Ode4C13.incipit	Ὄρθιος κρεμάμενος, καὶ πλήκτροις ξεόμενος…
ltx/gr_gr_cog/me.m12.d18:meMA.Ode4C13.melody	@ltx/gr_gr_cog/he.h.m1:heHE.OrosSeTiChariti.name
ltx/gr_gr_cog/me.m12.d18:meMA.Ode4C13.mode	@ltx/gr_gr_cog/miscellanea:misc.Mode1
ltx/gr_gr_cog/me.m12.d18:meMA.Ode4C13.ode	@ltx/gr_gr_cog/miscellanea:misc.Ode4
ltx/gr_gr_cog/me.m12.d18:meMA.Ode4C13.text	Ὄρθιος κρεμάμενος, καὶ πλήκτροις ξεόμενος, καὶ ταῖςσφοδραῖς τῶν αἰκισμῶν, περικυκλούμενος φοραῖς, καὶ βόθρῳ χωννύμενος, καὶ ἐν αὐτῷ τὸ θεῖον τέλος δεχόμενος, ὁ γενναιόφρων ἠγάλλετο Κάστουλος.
ltx/gr_gr_cog/me.m12.d18:meMA.Ode4C14.incipit	Ἰάσεις ἐν Πνεύματι Ἁγίῳ μακάριε…
ltx/gr_gr_cog/me.m12.d18:meMA.Ode4C14.melody	@ltx/gr_gr_cog/he.h.m1:heHE.OrosSeTiChariti.name
ltx/gr_gr_cog/me.m12.d18:meMA.Ode4C14.mode	@ltx/gr_gr_cog/miscellanea:misc.Mode1
ltx/gr_gr_cog/me.m12.d18:meMA.Ode4C14.ode	@ltx/gr_gr_cog/miscellanea:misc.Ode4
ltx/gr_gr_cog/me.m12.d18:meMA.Ode4C14.text	Ἰάσεις ἐν Πνεύματι Ἁγίῳ μακάριε, ἐπιτελῶν πρὸς φωτισμόν, τῶν καθορώντων εὐσεβῶς, λαοῖς τὸ σωτήριον, θεοπρεπῶς Σεβαστιανὲ κατήγγειλας, μαρτυρικῶς δὲ τὸν δρόμον ἐτέλεσας.
ltx/gr_gr_cog/me.m12.d18:meMA.Ode4C1T.incipit	Μόνην σε πασῶν, ἐκ γενεῶν…
ltx/gr_gr_cog/me.m12.d18:meMA.Ode4C1T.melody	@ltx/gr_gr_cog/he.h.m1:heHE.OrosSeTiChariti.name
ltx/gr_gr_cog/me.m12.d18:meMA.Ode4C1T.mode	@ltx/gr_gr_cog/miscellanea:misc.Mode1
ltx/gr_gr_cog/me.m12.d18:meMA.Ode4C1T.ode	@ltx/gr_gr_cog/miscellanea:misc.Ode4
ltx/gr_gr_cog/me.m12.d18:meMA.Ode4C1T.text	Μόνην σε πασῶν, ἐκ γενεῶν ἐξελέξατο, ὁ ὑπερούσιος Θεός, καὶ οὐσιώθη καθʼ ἡμᾶς γενόμενος ἄνθρωπος, ὁ πλαστουργός, τῆς ἀνθρωπίνης ὑπάρξεως, Θεογεννῆτορ πανάμωμε Δέσποινα.
ltx/gr_gr_cog/me.m12.d18:meMA.Ode5C11.greekmelody	@ltx/gr_gr_cog/he.h.m1:heHE.OFotisasTiEllampsei.greekname
ltx/gr_gr_cog/me.m12.d18:meMA.Ode5C11.incipit	Αἱ τρίβοι σου, καὶ πορεῖαι…
ltx/gr_gr_cog/me.m12.d18:meMA.Ode5C11.melody	@ltx/gr_gr_cog/he.h.m1:heHE.OFotisasTiEllampsei.name
ltx/gr_gr_cog/me.m12.d18:meMA.Ode5C11.mode	@ltx/gr_gr_cog/miscellanea:misc.Mode1
ltx/gr_gr_cog/me.m12.d18:meMA.Ode5C11.ode	@ltx/gr_gr_cog/miscellanea:misc.Ode5
ltx/gr_gr_cog/me.m12.d18:meMA.Ode5C11.text	Αἱ τρίβοι σου, καὶ πορεῖαι πρὸς μόνον φερόμεναι, τὸν Κύριον, ἀνοδίας ἐχθρῶν ὑπεξέκλιναν, καὶ πολλοῖς γεγόνασιν, ὁδὸς εὐθεῖα καὶ πραεῖα, Μάρτυς Χριστοῦ πανσεβάσμιε.
ltx/gr_gr_cog/me.m12.d18:meMA.Ode5C12.incipit	Ῥητορεύει, Μαρκελλῖνος καὶ Μᾶρκος σοφώτατα…
ltx/gr_gr_cog/me.m12.d18:meMA.Ode5C12.melody	@ltx/gr_gr_cog/he.h.m1:heHE.OFotisasTiEllampsei.name
ltx/gr_gr_cog/me.m12.d18:meMA.Ode5C12.mode	@ltx/gr_gr_cog/miscellanea:misc.Mode1
ltx/gr_gr_cog/me.m12.d18:meMA.Ode5C12.ode	@ltx/gr_gr_cog/miscellanea:misc.Ode5
ltx/gr_gr_cog/me.m12.d18:meMA.Ode5C12.text	Ῥητορεύει, Μαρκελλῖνος καὶ Μᾶρκος σοφώτατα, πρὸ βημάτων, τοῦ Χριστοῦ τὴν σωτήριον ἔλευσιν, προσδεθέντες ἄμφω δέ, κέντροις τοὺς πόδας καθηλοῦνται, μαρτυρικῶς κλεϊζόμενοι.
ltx/gr_gr_cog/me.m12.d18:meMA.Ode5C13.incipit	Τὸ πάθημα, τοῦ τὰ πάθη…
ltx/gr_gr_cog/me.m12.d18:meMA.Ode5C13.melody	@ltx/gr_gr_cog/he.h.m1:heHE.OFotisasTiEllampsei.name
ltx/gr_gr_cog/me.m12.d18:meMA.Ode5C13.mode	@ltx/gr_gr_cog/miscellanea:misc.Mode1
ltx/gr_gr_cog/me.m12.d18:meMA.Ode5C13.ode	@ltx/gr_gr_cog/miscellanea:misc.Ode5
ltx/gr_gr_cog/me.m12.d18:meMA.Ode5C13.text	Τὸ πάθημα, τοῦ τὰ πάθη ἡμῶν θανατώσαντος, Μαρκελλῖνος, καὶ ὁ Μᾶρκος στεῤῥῶς εἰκονίζοντες, λόγχῃ σφαγιάζονται, καὶ στεφηφόροι ταῖς χορείαις, τῶν ἀθλοφόρων συνάπτονται.
ltx/gr_gr_cog/me.m12.d18:meMA.Ode5C1T.incipit	Ὑπέρφωτε, τοῦ Ἡλίου Νεφέλη πανάμωμε…
ltx/gr_gr_cog/me.m12.d18:meMA.Ode5C1T.melody	@ltx/gr_gr_cog/he.h.m1:heHE.OFotisasTiEllampsei.name
ltx/gr_gr_cog/me.m12.d18:meMA.Ode5C1T.mode	@ltx/gr_gr_cog/miscellanea:misc.Mode1
ltx/gr_gr_cog/me.m12.d18:meMA.Ode5C1T.ode	@ltx/gr_gr_cog/miscellanea:misc.Ode5
ltx/gr_gr_cog/me.m12.d18:meMA.Ode5C1T.text	Ὑπέρφωτε, τοῦ Ἡλίου Νεφέλη πανάμωμε, ἀπέλασον, τῆς ψυχῆς μου τὰ νέφη πρεσβείαις σου, καὶ τὸν νοῦν μου φώτισον, τῇ ἀμελείᾳ σκοτισθέντα, ὅπως ὑμνῶ σε Πανύμνητε.
ltx/gr_gr_cog/me.m12.d18:meMA.Ode6C11.greekmelody	@ltx/gr_gr_cog/he.h.m1:heHE.EkyklosenImas.greekname
ltx/gr_gr_cog/me.m12.d18:meMA.Ode6C11.incipit	Στεῤῥότητι νοὸς σεβασμιώτατε, ἐδείχθης ἀταπείνωτος…
ltx/gr_gr_cog/me.m12.d18:meMA.Ode6C11.melody	@ltx/gr_gr_cog/he.h.m1:heHE.EkyklosenImas.name
ltx/gr_gr_cog/me.m12.d18:meMA.Ode6C11.mode	@ltx/gr_gr_cog/miscellanea:misc.Mode1
ltx/gr_gr_cog/me.m12.d18:meMA.Ode6C11.ode	@ltx/gr_gr_cog/miscellanea:misc.Ode6
ltx/gr_gr_cog/me.m12.d18:meMA.Ode6C11.text	Στεῤῥότητι νοὸς σεβασμιώτατε, ἐδείχθης ἀταπείνωτος, ἐν τῷ τύπτεσθαι ταῖς ῥάβδοις ἀφειδῶς, καὶ κατακεντᾶσθαι πολλοῖς τοῖς βέλεσιν· ὅθεν πρὸς φῶς, μετέβης χαίρων Μάρτυς ἀνέσπερον.
ltx/gr_gr_cog/me.m12.d18:meMA.Ode6C12.incipit	Ἐνεύρου σε Χριστὸς ἀγωνιζόμενον, καὶ…
ltx/gr_gr_cog/me.m12.d18:meMA.Ode6C12.melody	@ltx/gr_gr_cog/he.h.m1:heHE.EkyklosenImas.name
ltx/gr_gr_cog/me.m12.d18:meMA.Ode6C12.mode	@ltx/gr_gr_cog/miscellanea:misc.Mode1
ltx/gr_gr_cog/me.m12.d18:meMA.Ode6C12.ode	@ltx/gr_gr_cog/miscellanea:misc.Ode6
ltx/gr_gr_cog/me.m12.d18:meMA.Ode6C12.text	Ἐνεύρου σε Χριστὸς ἀγωνιζόμενον, καὶ δαίμοσι μαχόμενον, καὶ αἰκίαις ὁμιλοῦντα χαλεπαῖς, Σεβαστιανὲ Μάρτυς ἀήττητε, καὶ πρὸς αὐτὸν ἀποσκοποῦντα καρδίας ὄμμασι.
ltx/gr_gr_cog/me.m12.d18:meMA.Ode6C13.incipit	Μοχλεύσεσι στεῤῥαῖς πανσόφως λόγων σου…
ltx/gr_gr_cog/me.m12.d18:meMA.Ode6C13.melody	@ltx/gr_gr_cog/he.h.m1:heHE.EkyklosenImas.name
ltx/gr_gr_cog/me.m12.d18:meMA.Ode6C13.mode	@ltx/gr_gr_cog/miscellanea:misc.Mode1
ltx/gr_gr_cog/me.m12.d18:meMA.Ode6C13.ode	@ltx/gr_gr_cog/miscellanea:misc.Ode6
ltx/gr_gr_cog/me.m12.d18:meMA.Ode6C13.text	Μοχλεύσεσι στεῤῥαῖς πανσόφως λόγων σου, τὴν πλάνην ἀνεμόχλευσας, καὶ σεβάσματα κατέαξας ἐχθρῶν, καὶ εἰδωλικοὺς ναοὺς ἠδάφισας, καὶ σεαυτὸν ναὸν τοῦ θείου ἤγειρας Πνεύματος.
ltx/gr_gr_cog/me.m12.d18:meMA.Ode6C1T.incipit	Φθαρεῖσαν τὴν ἡμῶν ἐκ παραβάσεως…
ltx/gr_gr_cog/me.m12.d18:meMA.Ode6C1T.melody	@ltx/gr_gr_cog/he.h.m1:heHE.EkyklosenImas.name
ltx/gr_gr_cog/me.m12.d18:meMA.Ode6C1T.mode	@ltx/gr_gr_cog/miscellanea:misc.Mode1
ltx/gr_gr_cog/me.m12.d18:meMA.Ode6C1T.ode	@ltx/gr_gr_cog/miscellanea:misc.Ode6
ltx/gr_gr_cog/me.m12.d18:meMA.Ode6C1T.text	Φθαρεῖσαν τὴν ἡμῶν ἐκ παραβάσεως, οὐσίαν ἀνεκαίνισας, τὸν καινίζοντα τὰ πάντα θεϊκῷ, μόνῳ τῷ βουλήματι κυήσασα, ἐν γυναιξὶν εὐλογημένη θεοχαρίτωτε.
ltx/gr_gr_cog/me.m12.d18:meMA.Ode6H.greekmelody	@ltx/gr_gr_cog/he.h.m1:heHE.EkyklosenImas.greekname
ltx/gr_gr_cog/me.m12.d18:meMA.Ode6H.incipit	@ltx/gr_gr_cog/he.h.m1:heHE.EkyklosenImas.incipit
ltx/gr_gr_cog/me.m12.d18:meMA.Ode6H.melody	@ltx/gr_gr_cog/he.h.m1:heHE.EkyklosenImas.melody
ltx/gr_gr_cog/me.m12.d18:meMA.Ode6H.mode	@ltx/gr_gr_cog/miscellanea:misc.Mode1
ltx/gr_gr_cog/me.m12.d18:meMA.Ode6H.ode	@ltx/gr_gr_cog/miscellanea:misc.Ode6
ltx/gr_gr_cog/me.m12.d18:meMA.Ode6H.text	@ltx/gr_gr_cog/he.h.m1:heHE.EkyklosenImas.text
ltx/gr_gr_cog/me.m12.d18:meMA.Ode7C11.greekmelody	@ltx/gr_gr_cog/he.h.m1:heHE.SeNoitin.greekname
ltx/gr_gr_cog/me.m12.d18:meMA.Ode7C11.incipit	Ῥώμῃ τῇ σῇ, κραταιᾷ σθενούμενοι…
ltx/gr_gr_cog/me.m12.d18:meMA.Ode7C11.melody	@ltx/gr_gr_cog/he.h.m1:heHE.SeNoitin.name
ltx/gr_gr_cog/me.m12.d18:meMA.Ode7C11.mode	@ltx/gr_gr_cog/miscellanea:misc.Mode1
ltx/gr_gr_cog/me.m12.d18:meMA.Ode7C11.ode	@ltx/gr_gr_cog/miscellanea:misc.Ode7
ltx/gr_gr_cog/me.m12.d18:meMA.Ode7C11.text	Ῥώμῃ τῇ σῇ, κραταιᾷ σθενούμενοι, οἱ Ἀθλοφόροι σου Χριστέ, ἐτροπώσαντο τὸν ἐχθρόν, πλάνην κατεπάτησαν, σώματα παρέδωκαν, τοῖς αἰκισμοῖς ἀναμέλποντες, ὁ αἰνετός τῶν Πατέρων, Θεὸς καὶ ὑπερένδοξος.
ltx/gr_gr_cog/me.m12.d18:meMA.Ode7C12.incipit	Οἱ θεαυγεῖς, Ἀθλοφόροι Μάρτυρες, ἀγωνισάμενοι…
ltx/gr_gr_cog/me.m12.d18:meMA.Ode7C12.melody	@ltx/gr_gr_cog/he.h.m1:heHE.SeNoitin.name
ltx/gr_gr_cog/me.m12.d18:meMA.Ode7C12.mode	@ltx/gr_gr_cog/miscellanea:misc.Mode1
ltx/gr_gr_cog/me.m12.d18:meMA.Ode7C12.ode	@ltx/gr_gr_cog/miscellanea:misc.Ode7
ltx/gr_gr_cog/me.m12.d18:meMA.Ode7C12.text	Οἱ θεαυγεῖς, Ἀθλοφόροι Μάρτυρες, ἀγωνισάμενοι καλῶς, Μαρκελλῖνος καὶ ὁ κλεινός, Μᾶρκος καὶ Τιβούρτιος, Κάστουλος ὁ πάνσοφος, πρὸς οὐρανὸν μετετέθησαν, τὸν αἰνετὸν ἀνυμνοῦντες, Θεὸν τὸν ὑπερένδοξον.
ltx/gr_gr_cog/me.m12.d18:meMA.Ode7C13.incipit	Νεανικῶς, ἀθλητὰ Τιβούρτιε, ὥσπερ οἱ…
ltx/gr_gr_cog/me.m12.d18:meMA.Ode7C13.melody	@ltx/gr_gr_cog/he.h.m1:heHE.SeNoitin.name
ltx/gr_gr_cog/me.m12.d18:meMA.Ode7C13.mode	@ltx/gr_gr_cog/miscellanea:misc.Mode1
ltx/gr_gr_cog/me.m12.d18:meMA.Ode7C13.ode	@ltx/gr_gr_cog/miscellanea:misc.Ode7
ltx/gr_gr_cog/me.m12.d18:meMA.Ode7C13.text	Νεανικῶς, ἀθλητὰ Τιβούρτιε, ὥσπερ οἱ Παῖδες τῇ πυρᾷ, ἐπιβέβηκας νοητῶς, δρόσον τὴν τοῦ Πνεύματος, ἄνωθεν δεχόμενος, καὶ μελῳδῶν ἐμμελέστατα· ὁ αἰνετὸς τῶν Πατέρων, Θεὸς καὶ ὑπερένδοξος.
ltx/gr_gr_cog/me.m12.d18:meMA.Ode7C14.incipit	Ὥσπερ ἀμνάς, κρεμαμένη ἔνδοξε, ἐναπηγχόνισας…
ltx/gr_gr_cog/me.m12.d18:meMA.Ode7C14.melody	@ltx/gr_gr_cog/he.h.m1:heHE.SeNoitin.name
ltx/gr_gr_cog/me.m12.d18:meMA.Ode7C14.mode	@ltx/gr_gr_cog/miscellanea:misc.Mode1
ltx/gr_gr_cog/me.m12.d18:meMA.Ode7C14.ode	@ltx/gr_gr_cog/miscellanea:misc.Ode7
ltx/gr_gr_cog/me.m12.d18:meMA.Ode7C14.text	Ὥσπερ ἀμνάς, κρεμαμένη ἔνδοξε, ἐναπηγχόνισας ἐχθρόν, ταῖς νευραῖς τῶν μαρτυρικῶν, πόνων σου πανεύφημε, ζῇς δὲ μετὰ θάνατον, Μάρτυς Ζωὴ ἀναμέλπουσα· ὁ αἰνετός τῶν Πατέρων, Θεὸς καὶ ὑπερένδοξος.
ltx/gr_gr_cog/me.m12.d18:meMA.Ode7C1T.incipit	Στάμνον χρυσῆν, παναγίαν τράπεζαν, τοῦ…
ltx/gr_gr_cog/me.m12.d18:meMA.Ode7C1T.melody	@ltx/gr_gr_cog/he.h.m1:heHE.SeNoitin.name
ltx/gr_gr_cog/me.m12.d18:meMA.Ode7C1T.mode	@ltx/gr_gr_cog/miscellanea:misc.Mode1
ltx/gr_gr_cog/me.m12.d18:meMA.Ode7C1T.ode	@ltx/gr_gr_cog/miscellanea:misc.Ode7
ltx/gr_gr_cog/me.m12.d18:meMA.Ode7C1T.text	Στάμνον χρυσῆν, παναγίαν τράπεζαν, τοῦ θείου Ἄρτου τῆς ζωῆς, ὀνομάζομέν σε Ἁγνή. Τόπον ἁγιάσματος, θρόνον ὑψηλότατον, ἐν ᾧ Θεὸς ἀνεπαύσατο· ὁ αἰνετὸς τῶν Πατέρων, Θεὸς καὶ ὑπερένδοξος.
ltx/gr_gr_cog/me.m12.d18:meMA.Ode8C11.greekmelody	@ltx/gr_gr_cog/he.h.m1:heHE.EnKaminoPaides.greekname
ltx/gr_gr_cog/me.m12.d18:meMA.Ode8C11.incipit	Νεκρωθῆναι κόσμῳ βουληθείς, καὶ τοῖς…
ltx/gr_gr_cog/me.m12.d18:meMA.Ode8C11.melody	@ltx/gr_gr_cog/he.h.m1:heHE.EnKaminoPaides.name
ltx/gr_gr_cog/me.m12.d18:meMA.Ode8C11.mode	@ltx/gr_gr_cog/miscellanea:misc.Mode1
ltx/gr_gr_cog/me.m12.d18:meMA.Ode8C11.ode	@ltx/gr_gr_cog/miscellanea:misc.Ode8
ltx/gr_gr_cog/me.m12.d18:meMA.Ode8C11.text	Νεκρωθῆναι κόσμῳ βουληθείς, καὶ τοῖς ἐν κόσμῳ πᾶσι, τῆς ὄντως κατηξιώθης, Ἀεισέβαστε ζωῆς, βοῶν προθυμότατα· Εὐλογεῖτε πάντα τὰ ἔργα Κυρίου, τὸν Κύριον ὑμνεῖτε, καὶ ὑπερυψοῦτε, εἰς πάντας τοὺς αἰῶνας.
ltx/gr_gr_cog/me.m12.d18:meMA.Ode8C12.incipit	Ἔθεντό σε ἄνομοι δεινῶς, ἐν…
ltx/gr_gr_cog/me.m12.d18:meMA.Ode8C12.melody	@ltx/gr_gr_cog/he.h.m1:heHE.EnKaminoPaides.name
ltx/gr_gr_cog/me.m12.d18:meMA.Ode8C12.mode	@ltx/gr_gr_cog/miscellanea:misc.Mode1
ltx/gr_gr_cog/me.m12.d18:meMA.Ode8C12.ode	@ltx/gr_gr_cog/miscellanea:misc.Ode8
ltx/gr_gr_cog/me.m12.d18:meMA.Ode8C12.text	Ἔθεντό σε ἄνομοι δεινῶς, ἐν λάκκῳ κατωτάτῳ, χωννύντες καὶ θανατοῦντες, ἀναμέλποντα τρανῶς, ἀοίδιμε Κάστουλε· Εὐλογεῖτε πάντα τὰ ἔργα Κυρίου, τὸν Κύριον ὑμνεῖτε, καὶ ὑπερυψοῦτε, εἰς πάντας τοὺς αἰῶνας.
ltx/gr_gr_cog/me.m12.d18:meMA.Ode8C13.incipit	Μακαρίας ἔτυχες ζωῆς, ὡς ἐπώνυμος…
ltx/gr_gr_cog/me.m12.d18:meMA.Ode8C13.melody	@ltx/gr_gr_cog/he.h.m1:heHE.EnKaminoPaides.name
ltx/gr_gr_cog/me.m12.d18:meMA.Ode8C13.mode	@ltx/gr_gr_cog/miscellanea:misc.Mode1
ltx/gr_gr_cog/me.m12.d18:meMA.Ode8C13.ode	@ltx/gr_gr_cog/miscellanea:misc.Ode8
ltx/gr_gr_cog/me.m12.d18:meMA.Ode8C13.text	Μακαρίας ἔτυχες ζωῆς, ὡς ἐπώνυμος ταύτης· πνιγμῷ γὰρ βιαιοτάτῳ, τὴν ἐπίκηρον ζωήν, κατέλιπες μέλπουσα· Εὐλογεῖτε πάντα τὰ ἔργα Κυρίου, τὸν Κύριον ὑμνεῖτε, καὶ ὑπερυψοῦτε, εἰς πάντας τοὺς αἰῶνας.
ltx/gr_gr_cog/me.m12.d18:meMA.Ode8C1T.incipit	Ὡραιώθης τέξασα Θεόν, ὡραῖον καὶ…
ltx/gr_gr_cog/me.m12.d18:meMA.Ode8C1T.melody	@ltx/gr_gr_cog/he.h.m1:heHE.EnKaminoPaides.name
ltx/gr_gr_cog/me.m12.d18:meMA.Ode8C1T.mode	@ltx/gr_gr_cog/miscellanea:misc.Mode1
ltx/gr_gr_cog/me.m12.d18:meMA.Ode8C1T.ode	@ltx/gr_gr_cog/miscellanea:misc.Ode8
ltx/gr_gr_cog/me.m12.d18:meMA.Ode8C1T.text	Ὡραιώθης τέξασα Θεόν, ὡραῖον καὶ Δεσπότην, τὸν θείαις καταφαιδρύναντα, ἀκτῖσι τοὺς βροτούς· διὸ ἀναμέλπομεν· Εὐλογεῖτε πάντα τὰ ἔργα Κυρίου, τὸν Κύριον ὑμνεῖτε, καὶ ὑπερυψοῦτε, εἰς πάντας τοὺς αἰῶνας.
ltx/gr_gr_cog/me.m12.d18:meMA.Ode8H.greekmelody	@ltx/gr_gr_cog/he.h.m1:heHE.EnKaminoPaides.greekname
ltx/gr_gr_cog/me.m12.d18:meMA.Ode8H.incipit	@ltx/gr_gr_cog/he.h.m1:heHE.EnKaminoPaides.incipit
ltx/gr_gr_cog/me.m12.d18:meMA.Ode8H.melody	@ltx/gr_gr_cog/he.h.m1:heHE.EnKaminoPaides.melody
ltx/gr_gr_cog/me.m12.d18:meMA.Ode8H.mode	@ltx/gr_gr_cog/miscellanea:misc.Mode1
ltx/gr_gr_cog/me.m12.d18:meMA.Ode8H.ode	@ltx/gr_gr_cog/miscellanea:misc.Ode8
ltx/gr_gr_cog/me.m12.d18:meMA.Ode8H.text	@ltx/gr_gr_cog/he.h.m1:heHE.EnKaminoPaides.text
ltx/gr_gr_cog/me.m12.d18:meMA.Ode9C11.greekmelody	@ltx/gr_gr_cog/he.h.m1:heHE.TyponTisAgnis.greekname
ltx/gr_gr_cog/me.m12.d18:meMA.Ode9C11.incipit	Ἵνα θεϊκῆς λαμπρότητος, καὶ αἰωνίου…
ltx/gr_gr_cog/me.m12.d18:meMA.Ode9C11.melody	@ltx/gr_gr_cog/he.h.m1:heHE.TyponTisAgnis.name
ltx/gr_gr_cog/me.m12.d18:meMA.Ode9C11.mode	@ltx/gr_gr_cog/miscellanea:misc.Mode1
ltx/gr_gr_cog/me.m12.d18:meMA.Ode9C11.ode	@ltx/gr_gr_cog/miscellanea:misc.Ode9
ltx/gr_gr_cog/me.m12.d18:meMA.Ode9C11.text	Ἵνα θεϊκῆς λαμπρότητος, καὶ αἰωνίου δόξης καὶ ὡραιότητος, Σεβαστιανέ, ἀξιωθῇς ἀξιάγαστε, τὰς βασάνους, τοὺς πόνους, τὸν θάνατον, ὑπέμεινας ἀνδρείως· διό σε πάντες μακαρίζομεν.
ltx/gr_gr_cog/me.m12.d18:meMA.Ode9C12.incipit	Ὤφθης μέσον ἄστρων ἥλιος, τῶν…
ltx/gr_gr_cog/me.m12.d18:meMA.Ode9C12.melody	@ltx/gr_gr_cog/he.h.m1:heHE.TyponTisAgnis.name
ltx/gr_gr_cog/me.m12.d18:meMA.Ode9C12.mode	@ltx/gr_gr_cog/miscellanea:misc.Mode1
ltx/gr_gr_cog/me.m12.d18:meMA.Ode9C12.ode	@ltx/gr_gr_cog/miscellanea:misc.Ode9
ltx/gr_gr_cog/me.m12.d18:meMA.Ode9C12.text	Ὤφθης μέσον ἄστρων ἥλιος, τῶν συναθλούντων Μάρτυς καὶ νῦν φωτίζεται, ἄθλων ἱερῶν, ἱερωτάταις λαμπρότησιν, Ἐκκλησίας τὸ θεῖον στερέωμα, καὶ πᾶσα διαβόλου, διασκεδάζεται ἀπόνοια.
ltx/gr_gr_cog/me.m12.d18:meMA.Ode9C13.incipit	Στέργοντες Χριστὸν Τιβούρτιος, καὶ Μαρκελλῖνος…
ltx/gr_gr_cog/me.m12.d18:meMA.Ode9C13.melody	@ltx/gr_gr_cog/he.h.m1:heHE.TyponTisAgnis.name
ltx/gr_gr_cog/me.m12.d18:meMA.Ode9C13.mode	@ltx/gr_gr_cog/miscellanea:misc.Mode1
ltx/gr_gr_cog/me.m12.d18:meMA.Ode9C13.ode	@ltx/gr_gr_cog/miscellanea:misc.Ode9
ltx/gr_gr_cog/me.m12.d18:meMA.Ode9C13.text	Στέργοντες Χριστὸν Τιβούρτιος, καὶ Μαρκελλῖνος, Μᾶρκος, Ζωὴ καὶ Κάστουλος, Σεβαστιανῷ, καθηγητῇ καὶ θεόφρονι, συναθλοῦσι, καὶ ἴσους κομίζονται, τῆς νίκης τοὺς στεφανους, ὑπὲρ ἡμῶν ἀεὶ πρεσβεύοντες.
ltx/gr_gr_cog/me.m12.d18:meMA.Ode9C14.incipit	Ἤρθη πρὸς μονὰς σκηνούμενος, φωτοειδὴς…
ltx/gr_gr_cog/me.m12.d18:meMA.Ode9C14.melody	@ltx/gr_gr_cog/he.h.m1:heHE.TyponTisAgnis.name
ltx/gr_gr_cog/me.m12.d18:meMA.Ode9C14.mode	@ltx/gr_gr_cog/miscellanea:misc.Mode1
ltx/gr_gr_cog/me.m12.d18:meMA.Ode9C14.ode	@ltx/gr_gr_cog/miscellanea:misc.Ode9
ltx/gr_gr_cog/me.m12.d18:meMA.Ode9C14.text	Ἤρθη πρὸς μονὰς σκηνούμενος, φωτοειδὴς Μαρτύρων χορὸς ὁ ἔνθεος, καὶ τοὺς οὐρανούς, περιπολεῖ ἀγαλλόμενος, ὑπὲρ πάντων ἡμῶν τὸν φιλάνθρωπον, ἀεὶ παρακαλοῦντες, μακαριζόντων αὐτοὺς πάντοτε.
ltx/gr_gr_cog/me.m12.d18:meMA.Ode9C1T.incipit	Φρίττει νοερὰ Στρατεύματα, τὸ τοῦ…
ltx/gr_gr_cog/me.m12.d18:meMA.Ode9C1T.melody	@ltx/gr_gr_cog/he.h.m1:heHE.TyponTisAgnis.name
ltx/gr_gr_cog/me.m12.d18:meMA.Ode9C1T.mode	@ltx/gr_gr_cog/miscellanea:misc.Mode1
ltx/gr_gr_cog/me.m12.d18:meMA.Ode9C1T.ode	@ltx/gr_gr_cog/miscellanea:misc.Ode9
ltx/gr_gr_cog/me.m12.d18:meMA.Ode9C1T.text	Φρίττει νοερὰ Στρατεύματα, τὸ τοῦ Πατρὸς ὁρῶντα θεῖον ἀπαύγασμα, σοῦ ἐν ταῖς χερσίν, ἀνερμηνεύτως κρατούμενον, καὶ τὸ σὸν κεκτημένον ὁμοίωμα, ἵνα βροτούς θεώσῃ, Παρθενομῆτορ ἀπειρόγαμε.
ltx/gr_gr_cog/me.m12.d18:meMA.Ode9H.greekmelody	@ltx/gr_gr_cog/he.h.m1:heHE.TyponTisAgnis.greekname
ltx/gr_gr_cog/me.m12.d18:meMA.Ode9H.incipit	@ltx/gr_gr_cog/he.h.m1:heHE.TyponTisAgnis.incipit
ltx/gr_gr_cog/me.m12.d18:meMA.Ode9H.melody	@ltx/gr_gr_cog/he.h.m1:heHE.TyponTisAgnis.melody
ltx/gr_gr_cog/me.m12.d18:meMA.Ode9H.mode	@ltx/gr_gr_cog/miscellanea:misc.Mode1
ltx/gr_gr_cog/me.m12.d18:meMA.Ode9H.ode	@ltx/gr_gr_cog/miscellanea:misc.Ode9
ltx/gr_gr_cog/me.m12.d18:meMA.Ode9H.text	@ltx/gr_gr_cog/he.h.m1:heHE.TyponTisAgnis.text
ltx/gr_gr_cog/me.m12.d18:meVE.Apolytikion1ger.greekmelody	@ltx/gr_gr_cog/he.a.m1:heAU.TisErimouPolitis.greekname
ltx/gr_gr_cog/me.m12.d18:meVE.Apolytikion1ger.incipit	Συγκλήτου σφαλλομένης παριδὼν τὰ συνέδρια…
ltx/gr_gr_cog/me.m12.d18:meVE.Apolytikion1ger.melody	@ltx/gr_gr_cog/he.a.m1:heAU.TisErimouPolitis.name
ltx/gr_gr_cog/me.m12.d18:meVE.Apolytikion1ger.mode	@ltx/gr_gr_cog/miscellanea:misc.Mode1
ltx/gr_gr_cog/me.m12.d18:meVE.Apolytikion1ger.poet	@ltx/gr_gr_cog/poets:po.Gerasimou
ltx/gr_gr_cog/me.m12.d18:meVE.Apolytikion1ger.text	Συγκλήτου σφαλλομένης παριδὼν τὰ συνέδρια, Σεβαστιανὲ πονολβίαν, συναγείρεις συνέλευσιν, Μαρτύρων ἀληθῶς πανευκλεῶν, σὺν σοὶ καταβαλόντν τὸν ἐχθρόν, μεθʼ ὧν θείας συναυλίας ἀξιωθείς, φαιδρύνεις τοὺς βοῶντάς σοι· δόξα τῷ δεδωκότι σοι ἰσχύν, δόξα τῷ σὲ στεφανώσαντι, δόξα τῷ ἐνεργοῦντι διὰ σοῦ, πᾶσιν ἰάματα.
ltx/gr_gr_cog/me.m12.d18:meVE.SticStavrotheotokion.greekmelody	@ltx/gr_gr_cog/he.a.m1:heAU.PaneffimoiMartyres.greekname
ltx/gr_gr_cog/me.m12.d18:meVE.SticStavrotheotokion.incipit	@ltx/gr_gr_cog/oc.m1.d4:ocVE.SticTheotokion.incipit
ltx/gr_gr_cog/me.m12.d18:meVE.SticStavrotheotokion.melody	@ltx/gr_gr_cog/he.a.m1:heAU.PaneffimoiMartyres.name
ltx/gr_gr_cog/me.m12.d18:meVE.SticStavrotheotokion.mode	@ltx/gr_gr_cog/miscellanea:misc.Mode1
ltx/gr_gr_cog/me.m12.d18:meVE.SticStavrotheotokion.text	@ltx/gr_gr_cog/oc.m1.d4:ocVE.SticTheotokion.text
ltx/gr_gr_cog/me.m12.d18:meVE.SticTheotokion.greekmelody	@ltx/gr_gr_cog/he.a.m1:heAU.PaneffimoiMartyres.greekname
ltx/gr_gr_cog/me.m12.d18:meVE.SticTheotokion.incipit	Παρθένε πανύμνητε Μωσῆς, τὸ ἐν…
ltx/gr_gr_cog/me.m12.d18:meVE.SticTheotokion.melody	@ltx/gr_gr_cog/he.a.m1:heAU.PaneffimoiMartyres.name
ltx/gr_gr_cog/me.m12.d18:meVE.SticTheotokion.mode	@ltx/gr_gr_cog/miscellanea:misc.Mode1
ltx/gr_gr_cog/me.m12.d18:meVE.SticTheotokion.text	Παρθένε πανύμνητε Μωσῆς, τὸ ἐν σοὶ Μυστήριον, προφητικοῖς εἶδεν ὄμμασι, Βάτον μὴ φλέγεσθαι, καὶ περ καιομένην· πῦρ γὰρ τῆς θεότητος, τὴν μήτραν σου Ἁγνὴ οὐ κατέφλεξε· διὸ αἰτοῦμέν σε, ὡς Μητέρα τοῦ Θεοῦ ἡμῶν, τὴν εἰρήνην, τῷ κόσμῳ σου δώρησαι.
ltx/gr_gr_cog/me.m12.d18:meVE.Stichera01.greekmelody	@ltx/gr_gr_cog/he.a.m1:heAU.PaneffimoiMartyres.greekname
ltx/gr_gr_cog/me.m12.d18:meVE.Stichera01.incipit	Αἱμάτων τιμίων σου βαφαῖς, Μάρτυς…
ltx/gr_gr_cog/me.m12.d18:meVE.Stichera01.melody	@ltx/gr_gr_cog/he.a.m1:heAU.PaneffimoiMartyres.name
ltx/gr_gr_cog/me.m12.d18:meVE.Stichera01.mode	@ltx/gr_gr_cog/miscellanea:misc.Mode1
ltx/gr_gr_cog/me.m12.d18:meVE.Stichera01.text	Αἱμάτων τιμίων σου βαφαῖς, Μάρτυς κατεσκεύασας, σαυτῷ πορφύραν πολύτιμον, ἣν στολισάμενος, κατοικεῖς τὰ ἄνω, ἀληθῶς βασίλεια, Θεῷ παμβασιλεῖ παριστάμενος· διὸ ἱκέτευε, δωρηθῆναι ταῖς ψυχαῖς ἡμῶν, τὴν εἰρήνην, καὶ τὸ μέγα ἔλεος.
ltx/gr_gr_cog/me.m12.d18:meVE.Stichera02.incipit	Σεβαστιανός τε καὶ Ζωή, Μᾶρκος…
ltx/gr_gr_cog/me.m12.d18:meVE.Stichera02.melody	@ltx/gr_gr_cog/he.a.m1:heAU.PaneffimoiMartyres.name
ltx/gr_gr_cog/me.m12.d18:meVE.Stichera02.mode	@ltx/gr_gr_cog/miscellanea:misc.Mode1
ltx/gr_gr_cog/me.m12.d18:meVE.Stichera02.text	Σεβαστιανός τε καὶ Ζωή, Μᾶρκος Μαρκελλῖνός τε, σὺν Τιβουρτίῳ συνήθλησαν, καθυπομείναντες, τρικυμίας πόνων, καὶ νῦν κατεσκήνωσαν, πρὸς ἄπονον καὶ θείαν κατάπαυσιν, ἐν ᾗ πρεσβεύουσι, δωρηθῆναι ταῖς ψυχαῖς ἡμῶν, τὴν εἰρήνην, καὶ τὸ μέγα ἔλεος.
ltx/gr_gr_cog/me.m12.d18:meVE.Stichera03.incipit	Ἀήττητοι Μάρτυρες τῇ γῇ, τὰ…
ltx/gr_gr_cog/me.m12.d18:meVE.Stichera03.melody	@ltx/gr_gr_cog/he.a.m1:heAU.PaneffimoiMartyres.name
ltx/gr_gr_cog/me.m12.d18:meVE.Stichera03.mode	@ltx/gr_gr_cog/miscellanea:misc.Mode1
ltx/gr_gr_cog/me.m12.d18:meVE.Stichera03.text	Ἀήττητοι Μάρτυρες τῇ γῇ, τὰ τῆς γῆς ἐάσαντες, πρὸς οὐρανοὺς ἀνεδράμετε, ὑμῶν τοῖς στίγμασι, καθωραϊσμένοι, καὶ σεπτοῖς παθήμασι, λαμπρῶς πεποικιλμένοι μακάριοι· διὸ πρεσβεύσατε, δωρηθῆναι ταῖς ψυχαῖς ἡμῶν, τὴν εἰρήνην, καὶ τὸ μέγα ἔλεος.
