ltx/gr_gr_cog/le.go.va.deceased:levaLI.Gospel1.book_abbr	@ltx/gr_gr_cog/le.go.mc.d082:lemcLI.Gospel.book_abbr
ltx/gr_gr_cog/le.go.va.deceased:levaLI.Gospel1.book_string	@ltx/gr_gr_cog/le.go.mc.d082:lemcLI.Gospel.book_string
ltx/gr_gr_cog/le.go.va.deceased:levaLI.Gospel1.chapverse	@ltx/gr_gr_cog/le.go.mc.d082:lemcLI.Gospel.chapverse
ltx/gr_gr_cog/le.go.va.deceased:levaLI.Gospel1.incipit	@ltx/gr_gr_cog/le.go.mc.d082:lemcLI.Gospel.incipit
ltx/gr_gr_cog/le.go.va.deceased:levaLI.Gospel1.text	@ltx/gr_gr_cog/le.go.mc.d082:lemcLI.Gospel.text
ltx/gr_gr_cog/le.go.va.deceased:levaLI.Gospel1.title	Εἰς Κοιμηθέντας
ltx/gr_gr_cog/le.go.va.deceased:levaLI.Gospel1.title_abbr	Εἰς Κοιμηθέντας
ltx/gr_gr_cog/le.go.va.deceased:levaLI.Gospel1.version	@ltx/gr_gr_cog/le.go.mc.d082:lemcLI.Gospel.version
