ltx/gr_gr_cog/le.ep.mc.d338:lemcLI.Epistle.book_abbr	@ltx/gr_gr_cog/bible:James.abbr
ltx/gr_gr_cog/le.ep.mc.d338:lemcLI.Epistle.book_string	@ltx/gr_gr_cog/bible:James.text
ltx/gr_gr_cog/le.ep.mc.d338:lemcLI.Epistle.chapverse	2:14 – 26
ltx/gr_gr_cog/le.ep.mc.d338:lemcLI.Epistle.incipit	Τί τὸ ὄφελος ἐὰν πίστιν λέγῃ τις ἔχειν…
ltx/gr_gr_cog/le.ep.mc.d338:lemcLI.Epistle.text	Ἀδελφοί, τί τὸ ὄφελος ἐὰν πίστιν λέγῃ τις ἔχειν, ἔργα δὲ μὴ ἔχῃ; μὴ δύναται ἡ πίστις σῶσαι αὐτόν; ἐὰν δὲ ἀδελφὸς ἢ ἀδελφὴ γυμνοὶ ὑπάρχωσι καὶ λειπόμενοι ὦσι τῆς ἐφημέρου τροφῆς, εἴπῃ δέ τις αὐτοῖς ἐξ ὑμῶν, ὑπάγετε ἐν εἰρήνῃ, θερμαίνεσθε καὶ χορτάζεσθε, μὴ δῶτε δὲ αὐτοῖς τὰ ἐπιτήδεια τοῦ σώματος, τί τὸ ὄφελος; οὕτω καὶ ἡ πίστις, ἐὰν μὴ ἔργα ἔχῃ, νεκρά ἐστι καθ᾽ ἑαυτήν. ἀλλ᾽ ἐρεῖ τις· σὺ πίστιν ἔχεις, κἀγὼ ἔργα ἔχω· δεῖξόν μοι τὴν πίστιν σου ἐκ τῶν ἔργων σου, κἀγὼ δείξω σοι ἐκ τῶν ἔργων μου τὴν πίστιν μου. σὺ πιστεύεις ὅτι ὁ Θεὸς εἷς ἐστι· καλῶς ποιεῖς· καὶ τὰ δαιμόνια πιστεύουσι καὶ φρίσσουσι. θέλεις δὲ γνῶναι, ὦ ἄνθρωπε κενέ, ὅτι ἡ πίστις χωρὶς τῶν ἔργων νεκρά ἐστιν; Ἀβραὰμ ὁ πατὴρ ἡμῶν οὐκ ἐξ ἔργων ἐδικαιώθη, ἀνενέγκας Ἰσαὰκ τὸν υἱὸν αὐτοῦ ἐπὶ τὸ θυσιαστήριον; βλέπεις ὅτι ἡ πίστις συνήργει τοῖς ἔργοις αὐτοῦ, καὶ ἐκ τῶν ἔργων ἡ πίστις ἐτελειώθη, καὶ ἐπληρώθη ἡ γραφὴ ἡ λέγουσα· ἐπίστευσε δὲ Ἀβραὰμ τῷ Θεῷ, καὶ ἐλογίσθη αὐτῷ εἰς δικαιοσύνην, καὶ φίλος Θεοῦ ἐκλήθη. ὁρᾶτε τοίνυν ὅτι ἐξ ἔργων δικαιοῦται ἄνθρωπος καὶ οὐκ ἐκ πίστεως μόνον. ὁμοίως δὲ καὶ Ῥαὰβ ἡ πόρνη οὐκ ἐξ ἔργων ἐδικαιώθη, ὑποδεξαμένη τοὺς ἀγγέλους καὶ ἑτέρᾳ ὁδῷ ἐκβαλοῦσα; ὥσπερ γὰρ τὸ σῶμα χωρὶς πνεύματος νεκρόν ἐστιν, οὕτω καὶ ἡ πίστις χωρὶς τῶν ἔργων νεκρά ἐστι.
ltx/gr_gr_cog/le.ep.mc.d338:lemcLI.Epistle.title	Τῇ Δευτέρᾳ τῆς ΛΒʹ Ἑβδομάδος
ltx/gr_gr_cog/le.ep.mc.d338:lemcLI.Epistle.title_abbr	Δευτέρᾳ τῆς ΛΒʹ Ἑβδομάδος
ltx/gr_gr_cog/le.ep.mc.d338:lemcLI.Epistle.version	@ltx/gr_gr_cog/properties:version.designation
