ltx/gr_gr_cog/me.m04.d09:meDA.commemoration.first	Μνήμη τοῦ Ἁγίου Μάρτυρος Εὐψυχίου
ltx/gr_gr_cog/me.m04.d09:meDA.commemoration.first_name	
ltx/gr_gr_cog/me.m04.d09:meDA.commemoration.first_short	Μνήμη τοῦ Ἁγίου Μάρτυρος Εὐψυχίου
ltx/gr_gr_cog/me.m04.d09:meDA.commemoration.first_title	@ltx/gr_gr_cog/titles:ti.SaintM
ltx/gr_gr_cog/me.m04.d09:meDA.commemoration.full	Μνήμη τοῦ Ἁγίου Μάρτυρος Εὐψυχίου, τοῦ ἐν Καισαρείᾳ, καὶ τῶν Ἁγίων Ὁσιομαρτύρων Ραφαήλ, Νικολάου καὶ τῆς Ἁγίας Ὁσιοπαρθενομάρτυρος Εἰρήνης.
ltx/gr_gr_cog/me.m04.d09:meDA.commemoration.second_name	
ltx/gr_gr_cog/me.m04.d09:meDA.commemoration.second_title	
ltx/gr_gr_cog/me.m04.d09:meDA.date	Τῌ Θʹ ΑΠΡΙΛΙΟΥ
ltx/gr_gr_cog/me.m04.d09:meDA.fordate	διὰ τὴν 9ην Ἀπριλίου
ltx/gr_gr_cog/me.m04.d09:meDA.insert1	
ltx/gr_gr_cog/me.m04.d09:meDA.insert2	
ltx/gr_gr_cog/me.m04.d09:meDA.note	
ltx/gr_gr_cog/me.m04.d09:meDA.pdfcoverdate	τῆς 9ης Ἀπριλίου,
ltx/gr_gr_cog/me.m04.d09:meDA.pdfheaderdate	τῆς 9ης Ἀπριλίου
ltx/gr_gr_cog/me.m04.d09:meHO.commemorations	
ltx/gr_gr_cog/me.m04.d09:meHO.note1	
ltx/gr_gr_cog/me.m04.d09:meHO.note2	
ltx/gr_gr_cog/me.m04.d09:meHO.number	
ltx/gr_gr_cog/me.m04.d09:meHO.rank	
ltx/gr_gr_cog/me.m04.d09:meLE.commemoration1	Μνήμη τοῦ Ἁγίου Μάρτυρος Εὐψυχίου, τοῦ ἐν Καισαρείᾳ, καὶ τῶν Ἁγίων Ὁσιομαρτύρων Ραφαήλ, Νικολάου καὶ τῆς Ἁγίας Ὁσιοπαρθενομάρτυρος Εἰρήνης.
ltx/gr_gr_cog/me.m04.d09:meLE.commemoration2	
ltx/gr_gr_cog/me.m04.d09:meLI.Kontakion1.incipit	@ltx/gr_gr_cog/me.m04.d09:meMA.Kontakion1ger.incipit
ltx/gr_gr_cog/me.m04.d09:meLI.Kontakion1.melody	@ltx/gr_gr_cog/me.m04.d09:meMA.Kontakion1ger.melody
ltx/gr_gr_cog/me.m04.d09:meLI.Kontakion1.mode	@ltx/gr_gr_cog/me.m04.d09:meMA.Kontakion1ger.mode
ltx/gr_gr_cog/me.m04.d09:meLI.Kontakion1.text	@ltx/gr_gr_cog/me.m04.d09:meMA.Kontakion1ger.text
ltx/gr_gr_cog/me.m04.d09:meLI.MM.CommunionHymn.text	@ltx/gr_gr_cog/properties:media.key
ltx/gr_gr_cog/me.m04.d09:meLI.Megalynarion.text	
ltx/gr_gr_cog/me.m04.d09:meMA.C1.acrostic.notice1	οὗ ἡ Ἀκροστιχίς·
ltx/gr_gr_cog/me.m04.d09:meMA.C1.acrostic.text	Τοὺς Εὐψυχίου εὐψύχως ᾄδω πόνους. Ἰωσήφ.
ltx/gr_gr_cog/me.m04.d09:meMA.C1.acrostic.title	Ὁ Κανὼν τοῦ Ἁγίου,
ltx/gr_gr_cog/me.m04.d09:meMA.C1.title	@ltx/gr_gr_cog/titles:ti.CanonSaintM
ltx/gr_gr_cog/me.m04.d09:meMA.C1.verse	@ltx/gr_gr_cog/prayers:pr.verse_SaintM.text
ltx/gr_gr_cog/me.m04.d09:meMA.Kontakion1ger.incipit	Ὡς εὐσεβείας θεόδμητον ἄγαλμα, τῆς…
ltx/gr_gr_cog/me.m04.d09:meMA.Kontakion1ger.melody	@ltx/gr_gr_cog/he.a.m2:heAU.ToisTonAimatonSou.name
ltx/gr_gr_cog/me.m04.d09:meMA.Kontakion1ger.mode	@ltx/gr_gr_cog/miscellanea:misc.Mode2
ltx/gr_gr_cog/me.m04.d09:meMA.Kontakion1ger.poet	@ltx/gr_gr_cog/poets:po.Gerasimou
ltx/gr_gr_cog/me.m04.d09:meMA.Kontakion1ger.text	Ὡς εὐσεβείας θεόδμητον ἄγαλμα, τῆς ἀσεβείας καθεῖλες τὸ ἵδρυμα, καὶ εὔψυχος ὤφθης πρὸς ἄθλησιν, ἐν εὐψυχίᾳ τμηθεὶς τὸν αὐχένα σου· διό σε ἡμνοῦμεν Εὐψύχιε.
ltx/gr_gr_cog/me.m04.d09:meMA.Ode1C11.greekmelody	@ltx/gr_gr_cog/he.h.m8:heHE.YgranDiodefsas.greekname
ltx/gr_gr_cog/me.m04.d09:meMA.Ode1C11.incipit	Τοὺς ἄθλους εὐψύχως μάκαρ τοὺς…
ltx/gr_gr_cog/me.m04.d09:meMA.Ode1C11.melody	@ltx/gr_gr_cog/he.h.m8:heHE.YgranDiodefsas.name
ltx/gr_gr_cog/me.m04.d09:meMA.Ode1C11.mode	@ltx/gr_gr_cog/miscellanea:misc.Mode8
ltx/gr_gr_cog/me.m04.d09:meMA.Ode1C11.ode	@ltx/gr_gr_cog/miscellanea:misc.Ode1
ltx/gr_gr_cog/me.m04.d09:meMA.Ode1C11.text	Τοὺς ἄθλους εὐψύχως μάκαρ τοὺς σούς, Εὐψύχιε Μάρτυς, ἀναμέλπων σε δυσωπῶ, ἔχων παῤῥησίαν τὴν ψυχήν μου, τῆς τῶν παθῶν τυραννίδος ἐξάρπασον.
ltx/gr_gr_cog/me.m04.d09:meMA.Ode1C12.incipit	Ὁ νοῦς σου τῇ νεύσει…
ltx/gr_gr_cog/me.m04.d09:meMA.Ode1C12.melody	@ltx/gr_gr_cog/he.h.m8:heHE.YgranDiodefsas.name
ltx/gr_gr_cog/me.m04.d09:meMA.Ode1C12.mode	@ltx/gr_gr_cog/miscellanea:misc.Mode8
ltx/gr_gr_cog/me.m04.d09:meMA.Ode1C12.ode	@ltx/gr_gr_cog/miscellanea:misc.Ode1
ltx/gr_gr_cog/me.m04.d09:meMA.Ode1C12.text	Ὁ νοῦς σου τῇ νεύσει τῇ πρὸς Θεόν, ἀνένευσε πάντων, τῶν τοῦ βίου μάκαρ τερπνῶν, καὶ ὅλος ὡραῖος ἀπεφάνθη, κατὰ παθῶν βασιλεύσας Εὐψύχιε.
ltx/gr_gr_cog/me.m04.d09:meMA.Ode1C13.incipit	Ὑφάνας ἱμάτιον σεαυτῷ, ἐξ ἔργων…
ltx/gr_gr_cog/me.m04.d09:meMA.Ode1C13.melody	@ltx/gr_gr_cog/he.h.m8:heHE.YgranDiodefsas.name
ltx/gr_gr_cog/me.m04.d09:meMA.Ode1C13.mode	@ltx/gr_gr_cog/miscellanea:misc.Mode8
ltx/gr_gr_cog/me.m04.d09:meMA.Ode1C13.ode	@ltx/gr_gr_cog/miscellanea:misc.Ode1
ltx/gr_gr_cog/me.m04.d09:meMA.Ode1C13.text	Ὑφάνας ἱμάτιον σεαυτῷ, ἐξ ἔργων ἀρίστων, καὶ φοινίξας μαρτυρικῶς, ἐστόλισαι τούτῳ καὶ παρέστης, ὡραϊσμένος Κυρίῳ Εὐτύχιε.
ltx/gr_gr_cog/me.m04.d09:meMA.Ode1C1H.greekmelody	@ltx/gr_gr_cog/he.h.m8:heHE.YgranDiodefsas.greekname
ltx/gr_gr_cog/me.m04.d09:meMA.Ode1C1H.incipit	@ltx/gr_gr_cog/he.h.m8:heHE.YgranDiodefsas.incipit
ltx/gr_gr_cog/me.m04.d09:meMA.Ode1C1H.melody	@ltx/gr_gr_cog/he.h.m8:heHE.YgranDiodefsas.melody
ltx/gr_gr_cog/me.m04.d09:meMA.Ode1C1H.mode	@ltx/gr_gr_cog/miscellanea:misc.Mode8
ltx/gr_gr_cog/me.m04.d09:meMA.Ode1C1H.ode	@ltx/gr_gr_cog/miscellanea:misc.Ode1
ltx/gr_gr_cog/me.m04.d09:meMA.Ode1C1H.text	@ltx/gr_gr_cog/he.h.m8:heHE.YgranDiodefsas.text
ltx/gr_gr_cog/me.m04.d09:meMA.Ode1C1T.incipit	Σαρκὸς ὁμοιώματι γεννηθείς, ἐκ σοῦ…
ltx/gr_gr_cog/me.m04.d09:meMA.Ode1C1T.melody	@ltx/gr_gr_cog/he.h.m8:heHE.YgranDiodefsas.name
ltx/gr_gr_cog/me.m04.d09:meMA.Ode1C1T.mode	@ltx/gr_gr_cog/miscellanea:misc.Mode8
ltx/gr_gr_cog/me.m04.d09:meMA.Ode1C1T.ode	@ltx/gr_gr_cog/miscellanea:misc.Ode1
ltx/gr_gr_cog/me.m04.d09:meMA.Ode1C1T.text	Σαρκὸς ὁμοιώματι γεννηθείς, ἐκ σοῦ ὁ Δεσπότης, ἐκαινούργησε τὴν ἡμῶν, πεπαλαιωμένην Κόρη φύσιν, καὶ τοὺς θνητοὺς οὐρανίους εἰργάσατο.
ltx/gr_gr_cog/me.m04.d09:meMA.Ode3C11.greekmelody	@ltx/gr_gr_cog/he.h.m8:heHE.SyEiToStereoma.greekname
ltx/gr_gr_cog/me.m04.d09:meMA.Ode3C11.incipit	Ἔμφρονα ὑπάρχοντα, καταμηνύουσιν ἄφρονες, σὲ…
ltx/gr_gr_cog/me.m04.d09:meMA.Ode3C11.melody	@ltx/gr_gr_cog/he.h.m8:heHE.SyEiToStereoma.name
ltx/gr_gr_cog/me.m04.d09:meMA.Ode3C11.mode	@ltx/gr_gr_cog/miscellanea:misc.Mode8
ltx/gr_gr_cog/me.m04.d09:meMA.Ode3C11.ode	@ltx/gr_gr_cog/miscellanea:misc.Ode3
ltx/gr_gr_cog/me.m04.d09:meMA.Ode3C11.text	Ἔμφρονα ὑπάρχοντα, καταμηνύουσιν ἄφρονες, σὲ δυσμενεῖ, Ἄρχοντι ἀφρόνως, δαιμονίοις λατρεύοντι.
ltx/gr_gr_cog/me.m04.d09:meMA.Ode3C12.incipit	Ὕψει μαρτυρίου σοι, προσομιλήσαντι Ἄγγελος…
ltx/gr_gr_cog/me.m04.d09:meMA.Ode3C12.melody	@ltx/gr_gr_cog/he.h.m8:heHE.SyEiToStereoma.name
ltx/gr_gr_cog/me.m04.d09:meMA.Ode3C12.mode	@ltx/gr_gr_cog/miscellanea:misc.Mode8
ltx/gr_gr_cog/me.m04.d09:meMA.Ode3C12.ode	@ltx/gr_gr_cog/miscellanea:misc.Ode3
ltx/gr_gr_cog/me.m04.d09:meMA.Ode3C12.text	Ὕψει μαρτυρίου σοι, προσομιλήσαντι Ἄγγελος, ἐπιφανείς, σὲ παραθαῤῥύνει, ἀθλοφόρε Εὐψύχιε.
ltx/gr_gr_cog/me.m04.d09:meMA.Ode3C13.incipit	Ψάλλων τῷ Κυρίῳ σου, πάσης…
ltx/gr_gr_cog/me.m04.d09:meMA.Ode3C13.melody	@ltx/gr_gr_cog/he.h.m8:heHE.SyEiToStereoma.name
ltx/gr_gr_cog/me.m04.d09:meMA.Ode3C13.mode	@ltx/gr_gr_cog/miscellanea:misc.Mode8
ltx/gr_gr_cog/me.m04.d09:meMA.Ode3C13.ode	@ltx/gr_gr_cog/miscellanea:misc.Ode3
ltx/gr_gr_cog/me.m04.d09:meMA.Ode3C13.text	Ψάλλων τῷ Κυρίῳ σου, πάσης χαρᾶς ὄντως πέπλησαι, Μάρτυς σοφέ· ὅθεν καὶ εὐψύχως, τὸ μαρτύριον ἤνυσας.
ltx/gr_gr_cog/me.m04.d09:meMA.Ode3C1H.greekmelody	@ltx/gr_gr_cog/he.h.m8:heHE.SyEiToStereoma.greekname
ltx/gr_gr_cog/me.m04.d09:meMA.Ode3C1H.incipit	@ltx/gr_gr_cog/he.h.m8:heHE.SyEiToStereoma.incipit
ltx/gr_gr_cog/me.m04.d09:meMA.Ode3C1H.melody	@ltx/gr_gr_cog/he.h.m8:heHE.SyEiToStereoma.melody
ltx/gr_gr_cog/me.m04.d09:meMA.Ode3C1H.mode	@ltx/gr_gr_cog/miscellanea:misc.Mode8
ltx/gr_gr_cog/me.m04.d09:meMA.Ode3C1H.ode	@ltx/gr_gr_cog/miscellanea:misc.Ode3
ltx/gr_gr_cog/me.m04.d09:meMA.Ode3C1H.text	@ltx/gr_gr_cog/he.h.m8:heHE.SyEiToStereoma.text
ltx/gr_gr_cog/me.m04.d09:meMA.Ode3C1T.incipit	Ὕμνον χαριστήριον, τῶν ἀθλητῶν χορὸς…
ltx/gr_gr_cog/me.m04.d09:meMA.Ode3C1T.melody	@ltx/gr_gr_cog/he.h.m8:heHE.SyEiToStereoma.name
ltx/gr_gr_cog/me.m04.d09:meMA.Ode3C1T.mode	@ltx/gr_gr_cog/miscellanea:misc.Mode8
ltx/gr_gr_cog/me.m04.d09:meMA.Ode3C1T.ode	@ltx/gr_gr_cog/miscellanea:misc.Ode3
ltx/gr_gr_cog/me.m04.d09:meMA.Ode3C1T.text	Ὕμνον χαριστήριον, τῶν ἀθλητῶν χορὸς ᾄδει σοι, Κόρη σεμνή, σοῦ ταῖς ὁδηγίαις, νικηφόρος γενόμενος.
ltx/gr_gr_cog/me.m04.d09:meMA.Ode3Kathisma1.greekmelody	@ltx/gr_gr_cog/he.a.m1:heAU.TonTafonSouSotir.greekname
ltx/gr_gr_cog/me.m04.d09:meMA.Ode3Kathisma1.incipit	Εὐψύχως τὸν καλόν, διανύσας ἀγῶνα…
ltx/gr_gr_cog/me.m04.d09:meMA.Ode3Kathisma1.melody	@ltx/gr_gr_cog/he.a.m1:heAU.TonTafonSouSotir.name
ltx/gr_gr_cog/me.m04.d09:meMA.Ode3Kathisma1.mode	@ltx/gr_gr_cog/miscellanea:misc.Mode1
ltx/gr_gr_cog/me.m04.d09:meMA.Ode3Kathisma1.text	Εὐψύχως τὸν καλόν, διανύσας ἀγῶνα, ἐνίκησας ἐχθρόν, τὸν πολέμιον Μάρτυς, βραβεῖον τὰ θαύματα, ἐκ Θεοῦ κομισάμενος· ὅθεν ἅπασα, ἡ τῶν Πιστῶν ἐκκλησία, μακαρίζει σε, ἐν τῇ παρούσῃ ἡμέρᾳ, συμφώνως Εὐψύχιε.
ltx/gr_gr_cog/me.m04.d09:meMA.Ode3KathismaSt.incipit	@ltx/gr_gr_cog/oc.m1.d4:ocMA.Kathisma23.incipit
ltx/gr_gr_cog/me.m04.d09:meMA.Ode3KathismaSt.melody	@ltx/gr_gr_cog/he.a.m1:heAU.TonTafonSouSotir.name
ltx/gr_gr_cog/me.m04.d09:meMA.Ode3KathismaSt.mode	@ltx/gr_gr_cog/miscellanea:misc.Mode1
ltx/gr_gr_cog/me.m04.d09:meMA.Ode3KathismaSt.text	@ltx/gr_gr_cog/oc.m1.d4:ocMA.Kathisma23.text
ltx/gr_gr_cog/me.m04.d09:meMA.Ode3KathismaT.incipit	Συγχάρητε βροτοί, τῇ Μητρὶ τοῦ…
ltx/gr_gr_cog/me.m04.d09:meMA.Ode3KathismaT.melody	@ltx/gr_gr_cog/he.a.m1:heAU.TonTafonSouSotir.name
ltx/gr_gr_cog/me.m04.d09:meMA.Ode3KathismaT.mode	@ltx/gr_gr_cog/miscellanea:misc.Mode1
ltx/gr_gr_cog/me.m04.d09:meMA.Ode3KathismaT.text	Συγχάρητε βροτοί, τῇ Μητρὶ τοῦ Κυρίου, αἰνέσατε αὐτήν, οὐρανῶν αἱ Δυνάμεις, δοξάσατε τὴν ἄχραντον, οἱ τῆς γῆς βασιλεύοντες, δεῦτε ἅπαντες, τῶν φιλεόρτων οἱ δῆμοι· Χαίροις εἴπωμεν, τῇ Θεοτόκῳ συμφώνως, πιστῶς εὐφραινόμενοι.
ltx/gr_gr_cog/me.m04.d09:meMA.Ode4C11.greekmelody	@ltx/gr_gr_cog/he.h.m8:heHE.EisakikoaKyrie.greekname
ltx/gr_gr_cog/me.m04.d09:meMA.Ode4C11.incipit	Χαίρων Μάρτυς διένειμας, πάντα τὰ…
ltx/gr_gr_cog/me.m04.d09:meMA.Ode4C11.melody	@ltx/gr_gr_cog/he.h.m8:heHE.EisakikoaKyrie.name
ltx/gr_gr_cog/me.m04.d09:meMA.Ode4C11.mode	@ltx/gr_gr_cog/miscellanea:misc.Mode8
ltx/gr_gr_cog/me.m04.d09:meMA.Ode4C11.ode	@ltx/gr_gr_cog/miscellanea:misc.Ode4
ltx/gr_gr_cog/me.m04.d09:meMA.Ode4C11.text	Χαίρων Μάρτυς διένειμας, πάντα τὰ ὑπάρχοντα πενητεύουσι, μαρτυρίου ὄλβον ἄσυλον, καὶ χαρὰν ἀγήρω ἀντικτώμενος.
ltx/gr_gr_cog/me.m04.d09:meMA.Ode4C12.incipit	Ἱερῶς φωτιζόμενος, σκότος ἀνιέρων σὺ…
ltx/gr_gr_cog/me.m04.d09:meMA.Ode4C12.melody	@ltx/gr_gr_cog/he.h.m8:heHE.EisakikoaKyrie.name
ltx/gr_gr_cog/me.m04.d09:meMA.Ode4C12.mode	@ltx/gr_gr_cog/miscellanea:misc.Mode8
ltx/gr_gr_cog/me.m04.d09:meMA.Ode4C12.ode	@ltx/gr_gr_cog/miscellanea:misc.Ode4
ltx/gr_gr_cog/me.m04.d09:meMA.Ode4C12.text	Ἱερῶς φωτιζόμενος, σκότος ἀνιέρων σὺ ἐστηλίτευσας, ἀναγκάζειν πειρωμένων σε, ὑπαχθῆναι πλάνῃ δεισιδαίμονι.
ltx/gr_gr_cog/me.m04.d09:meMA.Ode4C13.incipit	Οὐ λιμὸς οὐδὲ θάνατος, οὐδὲ…
ltx/gr_gr_cog/me.m04.d09:meMA.Ode4C13.melody	@ltx/gr_gr_cog/he.h.m8:heHE.EisakikoaKyrie.name
ltx/gr_gr_cog/me.m04.d09:meMA.Ode4C13.mode	@ltx/gr_gr_cog/miscellanea:misc.Mode8
ltx/gr_gr_cog/me.m04.d09:meMA.Ode4C13.ode	@ltx/gr_gr_cog/miscellanea:misc.Ode4
ltx/gr_gr_cog/me.m04.d09:meMA.Ode4C13.text	Οὐ λιμὸς οὐδὲ θάνατος, οὐδὲ τῆς παρούσης τρυφῆς ἀπόλαυσις, τῆς ἀγάπης σε τοῦ κτίσαντος, διαστῆσαι Μάρτυς ὑπερίσχυσαν.
ltx/gr_gr_cog/me.m04.d09:meMA.Ode4C1H.greekmelody	@ltx/gr_gr_cog/he.h.m8:heHE.EisakikoaKyrie.greekname
ltx/gr_gr_cog/me.m04.d09:meMA.Ode4C1H.incipit	@ltx/gr_gr_cog/he.h.m8:heHE.EisakikoaKyrie.incipit
ltx/gr_gr_cog/me.m04.d09:meMA.Ode4C1H.melody	@ltx/gr_gr_cog/he.h.m8:heHE.EisakikoaKyrie.melody
ltx/gr_gr_cog/me.m04.d09:meMA.Ode4C1H.mode	@ltx/gr_gr_cog/miscellanea:misc.Mode8
ltx/gr_gr_cog/me.m04.d09:meMA.Ode4C1H.ode	@ltx/gr_gr_cog/miscellanea:misc.Ode4
ltx/gr_gr_cog/me.m04.d09:meMA.Ode4C1H.text	@ltx/gr_gr_cog/he.h.m8:heHE.EisakikoaKyrie.text
ltx/gr_gr_cog/me.m04.d09:meMA.Ode4C1T.incipit	Ὑπερτέρα δυνάμεων, τῶν ἐπουρανίων σὺ…
ltx/gr_gr_cog/me.m04.d09:meMA.Ode4C1T.melody	@ltx/gr_gr_cog/he.h.m8:heHE.EisakikoaKyrie.name
ltx/gr_gr_cog/me.m04.d09:meMA.Ode4C1T.mode	@ltx/gr_gr_cog/miscellanea:misc.Mode8
ltx/gr_gr_cog/me.m04.d09:meMA.Ode4C1T.ode	@ltx/gr_gr_cog/miscellanea:misc.Ode4
ltx/gr_gr_cog/me.m04.d09:meMA.Ode4C1T.text	Ὑπερτέρα δυνάμεων, τῶν ἐπουρανίων σὺ χρηματίσασα, σαρκικῶν παθῶν ὑπέρτερον, τὸν ἐμὸν Παρθένε νοῦν ἀνάδειξον.
ltx/gr_gr_cog/me.m04.d09:meMA.Ode5C11.greekmelody	@ltx/gr_gr_cog/he.h.m8:heHE.FotisonImas.greekname
ltx/gr_gr_cog/me.m04.d09:meMA.Ode5C11.incipit	Ἔφερες σαρκός, τὰς αἰκίσεις καρτερώτατα…
ltx/gr_gr_cog/me.m04.d09:meMA.Ode5C11.melody	@ltx/gr_gr_cog/he.h.m8:heHE.FotisonImas.name
ltx/gr_gr_cog/me.m04.d09:meMA.Ode5C11.mode	@ltx/gr_gr_cog/miscellanea:misc.Mode8
ltx/gr_gr_cog/me.m04.d09:meMA.Ode5C11.ode	@ltx/gr_gr_cog/miscellanea:misc.Ode5
ltx/gr_gr_cog/me.m04.d09:meMA.Ode5C11.text	Ἔφερες σαρκός, τὰς αἰκίσεις καρτερώτατα, ἀναρτηθεὶς Μάρτυς Εὐψύχιε, παραπλησίως, τῷ Δεσπότῃ πάσης κτίσεως.
ltx/gr_gr_cog/me.m04.d09:meMA.Ode5C12.incipit	Ὕμνεις τὸν Χριστόν, τὰς πλευρὰς…
ltx/gr_gr_cog/me.m04.d09:meMA.Ode5C12.melody	@ltx/gr_gr_cog/he.h.m8:heHE.FotisonImas.name
ltx/gr_gr_cog/me.m04.d09:meMA.Ode5C12.mode	@ltx/gr_gr_cog/miscellanea:misc.Mode8
ltx/gr_gr_cog/me.m04.d09:meMA.Ode5C12.ode	@ltx/gr_gr_cog/miscellanea:misc.Ode5
ltx/gr_gr_cog/me.m04.d09:meMA.Ode5C12.text	Ὕμνεις τὸν Χριστόν, τὰς πλευρὰς Μάρτυς ξεόμενος, καὶ τὴν δορὰν προσαφαιρούμενος, ἀνδρειοτάτης, διανοίας καρτερότητι.
ltx/gr_gr_cog/me.m04.d09:meMA.Ode5C13.incipit	Ψεύδους τὴν ἀχλύν, ἀληθείᾳ Μάρτυς…
ltx/gr_gr_cog/me.m04.d09:meMA.Ode5C13.melody	@ltx/gr_gr_cog/he.h.m8:heHE.FotisonImas.name
ltx/gr_gr_cog/me.m04.d09:meMA.Ode5C13.mode	@ltx/gr_gr_cog/miscellanea:misc.Mode8
ltx/gr_gr_cog/me.m04.d09:meMA.Ode5C13.ode	@ltx/gr_gr_cog/miscellanea:misc.Ode5
ltx/gr_gr_cog/me.m04.d09:meMA.Ode5C13.text	Ψεύδους τὴν ἀχλύν, ἀληθείᾳ Μάρτυς ἔλυσας, ἐν τῇ σοφίᾳ τῇ τῶν λόγων σου, δείξας ἀσόφους, τοὺς τῇ πλάνῃ ῥητορεύοντας.
ltx/gr_gr_cog/me.m04.d09:meMA.Ode5C1H.greekmelody	@ltx/gr_gr_cog/he.h.m8:heHE.FotisonImas.greekname
ltx/gr_gr_cog/me.m04.d09:meMA.Ode5C1H.incipit	@ltx/gr_gr_cog/he.h.m8:heHE.FotisonImas.incipit
ltx/gr_gr_cog/me.m04.d09:meMA.Ode5C1H.melody	@ltx/gr_gr_cog/he.h.m8:heHE.FotisonImas.melody
ltx/gr_gr_cog/me.m04.d09:meMA.Ode5C1H.mode	@ltx/gr_gr_cog/miscellanea:misc.Mode8
ltx/gr_gr_cog/me.m04.d09:meMA.Ode5C1H.ode	@ltx/gr_gr_cog/miscellanea:misc.Ode5
ltx/gr_gr_cog/me.m04.d09:meMA.Ode5C1H.text	@ltx/gr_gr_cog/he.h.m8:heHE.FotisonImas.text
ltx/gr_gr_cog/me.m04.d09:meMA.Ode5C1T.incipit	Ὑπὲρ τῶν εἰς σέ, τὰς…
ltx/gr_gr_cog/me.m04.d09:meMA.Ode5C1T.melody	@ltx/gr_gr_cog/he.h.m8:heHE.FotisonImas.name
ltx/gr_gr_cog/me.m04.d09:meMA.Ode5C1T.mode	@ltx/gr_gr_cog/miscellanea:misc.Mode8
ltx/gr_gr_cog/me.m04.d09:meMA.Ode5C1T.ode	@ltx/gr_gr_cog/miscellanea:misc.Ode5
ltx/gr_gr_cog/me.m04.d09:meMA.Ode5C1T.text	Ὑπὲρ τῶν εἰς σέ, τὰς ἐλπίδας πάντων Δέσποινα, κεκτημένων ἀπαύστως πρέσβευε, ὅπως μελλούσης λυτρωθῶμεν κατακρίσεως.
ltx/gr_gr_cog/me.m04.d09:meMA.Ode6C11.greekmelody	@ltx/gr_gr_cog/he.h.m8:heHE.TinDeisinEkcheo.greekname
ltx/gr_gr_cog/me.m04.d09:meMA.Ode6C11.incipit	Χειμάζει μὲν τῶν βασάνων ὁ…
ltx/gr_gr_cog/me.m04.d09:meMA.Ode6C11.melody	@ltx/gr_gr_cog/he.h.m8:heHE.TinDeisinEkcheo.name
ltx/gr_gr_cog/me.m04.d09:meMA.Ode6C11.mode	@ltx/gr_gr_cog/miscellanea:misc.Mode8
ltx/gr_gr_cog/me.m04.d09:meMA.Ode6C11.ode	@ltx/gr_gr_cog/miscellanea:misc.Ode6
ltx/gr_gr_cog/me.m04.d09:meMA.Ode6C11.text	Χειμάζει μὲν τῶν βασάνων ὁ ὄγκος, οὐκ ἰσχύει δὲ βυθίσαι σε μάκαρ· τὸν γὰρ Χριστόν, καὶ Θεὸν κυβερνήτην, καὶ ἀρωγὸν ἐπιφέρεις ἰθύνοντα, λιμένα σε πρὸς γαληνόν, τῆς αὐτοῦ βασιλείας Εὐψύχιε.
ltx/gr_gr_cog/me.m04.d09:meMA.Ode6C12.incipit	Ὡραῖόν σου τὸ ἀνάστημα Μάρτυς…
ltx/gr_gr_cog/me.m04.d09:meMA.Ode6C12.melody	@ltx/gr_gr_cog/he.h.m8:heHE.TinDeisinEkcheo.name
ltx/gr_gr_cog/me.m04.d09:meMA.Ode6C12.mode	@ltx/gr_gr_cog/miscellanea:misc.Mode8
ltx/gr_gr_cog/me.m04.d09:meMA.Ode6C12.ode	@ltx/gr_gr_cog/miscellanea:misc.Ode6
ltx/gr_gr_cog/me.m04.d09:meMA.Ode6C12.text	Ὡραῖόν σου τὸ ἀνάστημα Μάρτυς, τῆς ψυχῆς τοῖς ἐναντίοις δεικνύων, ὤφθης αὐτοῖς, φοβερὸς καταπλήττων, ὑπομονῇ τὴν ἐκείνων κακόνοιαν, καὶ εἴληφας παρὰ Χριστοῦ, τῶν ἀγώνων τῆς νίκης τὰ ἔπαθλα.
ltx/gr_gr_cog/me.m04.d09:meMA.Ode6C13.incipit	Συλῆσαι τὸν θησαυρὸν οἰόμενος, τῆς…
ltx/gr_gr_cog/me.m04.d09:meMA.Ode6C13.melody	@ltx/gr_gr_cog/he.h.m8:heHE.TinDeisinEkcheo.name
ltx/gr_gr_cog/me.m04.d09:meMA.Ode6C13.mode	@ltx/gr_gr_cog/miscellanea:misc.Mode8
ltx/gr_gr_cog/me.m04.d09:meMA.Ode6C13.ode	@ltx/gr_gr_cog/miscellanea:misc.Ode6
ltx/gr_gr_cog/me.m04.d09:meMA.Ode6C13.text	Συλῆσαι τὸν θησαυρὸν οἰόμενος, τῆς ψυχῆς σου ὑπελθών σε ἐντέχνως, ἐν δωρεαῖς, καὶ βασάνων ἰδέαις, ἀπεπειρᾶτο τὸ εὔτονον λύειν σου, ὁ τύραννος, ἀλλὰ στεῤῥῶς, ὑπομείνας νενίκηκας Ἔνδοξε.
ltx/gr_gr_cog/me.m04.d09:meMA.Ode6C1H.greekmelody	@ltx/gr_gr_cog/he.h.m8:heHE.TinDeisinEkcheo.greekname
ltx/gr_gr_cog/me.m04.d09:meMA.Ode6C1H.incipit	@ltx/gr_gr_cog/he.h.m8:heHE.TinDeisinEkcheo.incipit
ltx/gr_gr_cog/me.m04.d09:meMA.Ode6C1H.melody	@ltx/gr_gr_cog/he.h.m8:heHE.TinDeisinEkcheo.melody
ltx/gr_gr_cog/me.m04.d09:meMA.Ode6C1H.mode	@ltx/gr_gr_cog/miscellanea:misc.Mode8
ltx/gr_gr_cog/me.m04.d09:meMA.Ode6C1H.ode	@ltx/gr_gr_cog/miscellanea:misc.Ode6
ltx/gr_gr_cog/me.m04.d09:meMA.Ode6C1H.text	@ltx/gr_gr_cog/he.h.m8:heHE.TinDeisinEkcheo.text
ltx/gr_gr_cog/me.m04.d09:meMA.Ode6C1T.incipit	Ἀνόρθωσον συμπτωθέντα με ὅλον, ὡς…
ltx/gr_gr_cog/me.m04.d09:meMA.Ode6C1T.melody	@ltx/gr_gr_cog/he.h.m8:heHE.TinDeisinEkcheo.name
ltx/gr_gr_cog/me.m04.d09:meMA.Ode6C1T.mode	@ltx/gr_gr_cog/miscellanea:misc.Mode8
ltx/gr_gr_cog/me.m04.d09:meMA.Ode6C1T.ode	@ltx/gr_gr_cog/miscellanea:misc.Ode6
ltx/gr_gr_cog/me.m04.d09:meMA.Ode6C1T.text	Ἀνόρθωσον συμπτωθέντα με ὅλον, ὡς τοῖς πάθεσιν ἀνοίξαντα θύραν, καὶ ἐν τῇ σῇ, ἀγαθῇ μεσιτείᾳ πρὸς μετανοίας εἰσόδους εἰσάγαγε, καὶ σῶσόν με ἡ τοῦ παντός, τὸν Σωτῆρα τεκοῦσα καὶ Κύριον.
ltx/gr_gr_cog/me.m04.d09:meMA.Ode7C11.greekmelody	@ltx/gr_gr_cog/he.h.m8:heHE.PaidesEvraion.greekname
ltx/gr_gr_cog/me.m04.d09:meMA.Ode7C11.incipit	Δήμοις Μαρτύρων ἠριθμήθης, ταῖς χορείαις…
ltx/gr_gr_cog/me.m04.d09:meMA.Ode7C11.melody	@ltx/gr_gr_cog/he.h.m8:heHE.PaidesEvraion.name
ltx/gr_gr_cog/me.m04.d09:meMA.Ode7C11.mode	@ltx/gr_gr_cog/miscellanea:misc.Mode8
ltx/gr_gr_cog/me.m04.d09:meMA.Ode7C11.ode	@ltx/gr_gr_cog/miscellanea:misc.Ode7
ltx/gr_gr_cog/me.m04.d09:meMA.Ode7C11.text	Δήμοις Μαρτύρων ἠριθμήθης, ταῖς χορείαις τε τῶν θείων Ἀσωμάτων, ἀλογήσας παθῶν, τοῦ σώματος τρισμάκαρ, καὶ ἀριστεύσας χάριτι, ἀθλητὰ Χριστοῦ μεγάλως.
ltx/gr_gr_cog/me.m04.d09:meMA.Ode7C12.incipit	Ὢ τῆς καλῆς σου πραγματείας!…
ltx/gr_gr_cog/me.m04.d09:meMA.Ode7C12.melody	@ltx/gr_gr_cog/he.h.m8:heHE.PaidesEvraion.name
ltx/gr_gr_cog/me.m04.d09:meMA.Ode7C12.mode	@ltx/gr_gr_cog/miscellanea:misc.Mode8
ltx/gr_gr_cog/me.m04.d09:meMA.Ode7C12.ode	@ltx/gr_gr_cog/miscellanea:misc.Ode7
ltx/gr_gr_cog/me.m04.d09:meMA.Ode7C12.text	Ὢ τῆς καλῆς σου πραγματείας! δρακὸς αἵματος ἠλλάξω γὰρ τὴν ἄνω, βασιλείαν σοφέ, ἐν ᾗ καὶ ἀναμέλπεις· Εὐλογητὸς εἶ Κύριε, ὁ Θεὸς εἰς τοὺς αἰῶνας.
ltx/gr_gr_cog/me.m04.d09:meMA.Ode7C13.incipit	Πύλαι ἠνοίγησάν σοι πόλου, τετμημένῳ…
ltx/gr_gr_cog/me.m04.d09:meMA.Ode7C13.melody	@ltx/gr_gr_cog/he.h.m8:heHE.PaidesEvraion.name
ltx/gr_gr_cog/me.m04.d09:meMA.Ode7C13.mode	@ltx/gr_gr_cog/miscellanea:misc.Mode8
ltx/gr_gr_cog/me.m04.d09:meMA.Ode7C13.ode	@ltx/gr_gr_cog/miscellanea:misc.Ode7
ltx/gr_gr_cog/me.m04.d09:meMA.Ode7C13.text	Πύλαι ἠνοίγησάν σοι πόλου, τετμημένῳ διὰ ξίφους ἀνιόντι, καὶ Ἀγγέλων χοροὶ ὑπήντων σοι Τρισμάκαρ, ἀναβοῶντες· Κύριε, ὁ Θεὸς εὐλογητὸς εἶ.
ltx/gr_gr_cog/me.m04.d09:meMA.Ode7C1H.greekmelody	@ltx/gr_gr_cog/he.h.m8:heHE.PaidesEvraion.greekname
ltx/gr_gr_cog/me.m04.d09:meMA.Ode7C1H.incipit	@ltx/gr_gr_cog/he.h.m8:heHE.PaidesEvraion.incipit
ltx/gr_gr_cog/me.m04.d09:meMA.Ode7C1H.melody	@ltx/gr_gr_cog/he.h.m8:heHE.PaidesEvraion.melody
ltx/gr_gr_cog/me.m04.d09:meMA.Ode7C1H.mode	@ltx/gr_gr_cog/miscellanea:misc.Mode8
ltx/gr_gr_cog/me.m04.d09:meMA.Ode7C1H.ode	@ltx/gr_gr_cog/miscellanea:misc.Ode7
ltx/gr_gr_cog/me.m04.d09:meMA.Ode7C1H.text	@ltx/gr_gr_cog/he.h.m8:heHE.PaidesEvraion.text
ltx/gr_gr_cog/me.m04.d09:meMA.Ode7C1T.incipit	Ὄρος Προφήτης Δανιὴλ σε, θείῳ…
ltx/gr_gr_cog/me.m04.d09:meMA.Ode7C1T.melody	@ltx/gr_gr_cog/he.h.m8:heHE.PaidesEvraion.name
ltx/gr_gr_cog/me.m04.d09:meMA.Ode7C1T.mode	@ltx/gr_gr_cog/miscellanea:misc.Mode8
ltx/gr_gr_cog/me.m04.d09:meMA.Ode7C1T.ode	@ltx/gr_gr_cog/miscellanea:misc.Ode7
ltx/gr_gr_cog/me.m04.d09:meMA.Ode7C1T.text	Ὄρος Προφήτης Δανιὴλ σε, θείῳ Πνεύματι ἐκάλεσε Παρθένε, ἐξ οὗ ὁ λίθος Χριστός, ἄνευ χειρὸς ἐτμήθη, καὶ συντριβὴν εἰργάσατο, τῶν ξοάνων τῆς ἀπάτης.
ltx/gr_gr_cog/me.m04.d09:meMA.Ode8C11.greekmelody	@ltx/gr_gr_cog/he.h.m8:heHE.NikitaiTyrannou.greekname
ltx/gr_gr_cog/me.m04.d09:meMA.Ode8C11.incipit	Νικητὴς τυράννων, καὶ πνευμάτων γέγονας…
ltx/gr_gr_cog/me.m04.d09:meMA.Ode8C11.melody	@ltx/gr_gr_cog/he.h.m8:heHE.NikitaiTyrannou.name
ltx/gr_gr_cog/me.m04.d09:meMA.Ode8C11.mode	@ltx/gr_gr_cog/miscellanea:misc.Mode8
ltx/gr_gr_cog/me.m04.d09:meMA.Ode8C11.ode	@ltx/gr_gr_cog/miscellanea:misc.Ode8
ltx/gr_gr_cog/me.m04.d09:meMA.Ode8C11.text	Νικητὴς τυράννων, καὶ πνευμάτων γέγονας τῶν ἀκαθάρτων, καὶ πιστῶν ἀνθρώπων, τὰς καρδίας πάντοτε καταφωτίζεις· ὅθεν εὐχαρίστως, σὲ ὑμνοῦντες Ἔνδοξε, πάντες εὐλογοῦμεν, Χριστὸν εἰς τοὺς αἰῶνας.
ltx/gr_gr_cog/me.m04.d09:meMA.Ode8C12.incipit	Οἱ τῶν σῶν θαυμάτων, ποταμοὶ…
ltx/gr_gr_cog/me.m04.d09:meMA.Ode8C12.melody	@ltx/gr_gr_cog/he.h.m8:heHE.NikitaiTyrannou.name
ltx/gr_gr_cog/me.m04.d09:meMA.Ode8C12.mode	@ltx/gr_gr_cog/miscellanea:misc.Mode8
ltx/gr_gr_cog/me.m04.d09:meMA.Ode8C12.ode	@ltx/gr_gr_cog/miscellanea:misc.Ode8
ltx/gr_gr_cog/me.m04.d09:meMA.Ode8C12.text	Οἱ τῶν σῶν θαυμάτων, ποταμοὶ χεόμενοι νοσούντων πάθη, καὶ ψυχῶν τὰς νόσους ἐξιῶνται χάριτι θεόφρον Μάρτυς· ὅθεν σου τὴν μνήμην, οἱ πιστοὶ δοξάζοντες, ἀνυμνολογοῦμεν, Χριστὸν εἰς τοὺς αἰῶνας.
ltx/gr_gr_cog/me.m04.d09:meMA.Ode8C13.incipit	Ὑπελθὼν ἀνδρείως, τὸ ἀγώνων στάδιον…
ltx/gr_gr_cog/me.m04.d09:meMA.Ode8C13.melody	@ltx/gr_gr_cog/he.h.m8:heHE.NikitaiTyrannou.name
ltx/gr_gr_cog/me.m04.d09:meMA.Ode8C13.mode	@ltx/gr_gr_cog/miscellanea:misc.Mode8
ltx/gr_gr_cog/me.m04.d09:meMA.Ode8C13.ode	@ltx/gr_gr_cog/miscellanea:misc.Ode8
ltx/gr_gr_cog/me.m04.d09:meMA.Ode8C13.text	Ὑπελθὼν ἀνδρείως, τὸ ἀγώνων στάδιον Μάρτυς ἐξέσθης, μέχρις ἁρμονίας, καὶ αὐτῆς τῆς ἔνδοθεν οἰκονομίας· ἀλλʼ ἐφάνης ὅλος, ἀκλινὴς ἀκράδαντος· ὅθεν τοὺς στεφάνους, ἀπέλαβες τῆς νίκης.
ltx/gr_gr_cog/me.m04.d09:meMA.Ode8C1H.greekmelody	@ltx/gr_gr_cog/he.h.m8:heHE.NikitaiTyrannou.greekname
ltx/gr_gr_cog/me.m04.d09:meMA.Ode8C1H.incipit	@ltx/gr_gr_cog/he.h.m8:heHE.NikitaiTyrannou.incipit
ltx/gr_gr_cog/me.m04.d09:meMA.Ode8C1H.melody	@ltx/gr_gr_cog/he.h.m8:heHE.NikitaiTyrannou.melody
ltx/gr_gr_cog/me.m04.d09:meMA.Ode8C1H.mode	@ltx/gr_gr_cog/miscellanea:misc.Mode8
ltx/gr_gr_cog/me.m04.d09:meMA.Ode8C1H.ode	@ltx/gr_gr_cog/miscellanea:misc.Ode8
ltx/gr_gr_cog/me.m04.d09:meMA.Ode8C1H.text	@ltx/gr_gr_cog/he.h.m8:heHE.NikitaiTyrannou.text
ltx/gr_gr_cog/me.m04.d09:meMA.Ode8C1T.incipit	Συμπαθὴς Παρθένε, ἡ τὸν συμπαθέστατον…
ltx/gr_gr_cog/me.m04.d09:meMA.Ode8C1T.melody	@ltx/gr_gr_cog/he.h.m8:heHE.NikitaiTyrannou.name
ltx/gr_gr_cog/me.m04.d09:meMA.Ode8C1T.mode	@ltx/gr_gr_cog/miscellanea:misc.Mode8
ltx/gr_gr_cog/me.m04.d09:meMA.Ode8C1T.ode	@ltx/gr_gr_cog/miscellanea:misc.Ode8
ltx/gr_gr_cog/me.m04.d09:meMA.Ode8C1T.text	Συμπαθὴς Παρθένε, ἡ τὸν συμπαθέστατον τεκοῦσα Λόγον, τὸν ἀσυμπαθῆ με, δωρεὰν οἰκτείρησον ἀπεγνωσμένον, πταίσμασιν ἀμέτροις, καὶ μὴ ἐπιστρέφοντα, ἀλλʼ ἐν ῥαθυμίᾳ, τὸν βίον δαπανῶντα.
ltx/gr_gr_cog/me.m04.d09:meMA.Ode9C11.greekmelody	@ltx/gr_gr_cog/he.h.m8:heHE.KyriosTheotokon.greekname
ltx/gr_gr_cog/me.m04.d09:meMA.Ode9C11.incipit	Ἰκρίῳ ἀνηρτήθης, πάθος εἰκονίζων, τοῦ…
ltx/gr_gr_cog/me.m04.d09:meMA.Ode9C11.melody	@ltx/gr_gr_cog/he.h.m8:heHE.KyriosTheotokon.name
ltx/gr_gr_cog/me.m04.d09:meMA.Ode9C11.mode	@ltx/gr_gr_cog/miscellanea:misc.Mode8
ltx/gr_gr_cog/me.m04.d09:meMA.Ode9C11.ode	@ltx/gr_gr_cog/miscellanea:misc.Ode9
ltx/gr_gr_cog/me.m04.d09:meMA.Ode9C11.text	Ἰκρίῳ ἀνηρτήθης, πάθος εἰκονίζων, τοῦ ἀπαθοῦς καὶ τὰ πάθη μειώσαντος, τῶν εὐσεβῶν εὐσπλαγχνίᾳ, Μάρτυς Εὐψύχιε.
ltx/gr_gr_cog/me.m04.d09:meMA.Ode9C12.incipit	Ὡράθη θαῦμα μέγα, σοῦ τῇ…
ltx/gr_gr_cog/me.m04.d09:meMA.Ode9C12.melody	@ltx/gr_gr_cog/he.h.m8:heHE.KyriosTheotokon.name
ltx/gr_gr_cog/me.m04.d09:meMA.Ode9C12.mode	@ltx/gr_gr_cog/miscellanea:misc.Mode8
ltx/gr_gr_cog/me.m04.d09:meMA.Ode9C12.ode	@ltx/gr_gr_cog/miscellanea:misc.Ode9
ltx/gr_gr_cog/me.m04.d09:meMA.Ode9C12.text	Ὡράθη θαῦμα μέγα, σοῦ τῇ τελειώσει· ἀντὶ γὰρ αἵματος γάλα σὺν ὕδατι, τῆς κεφαλῆς σου τμηθείσης, Μάρτυς συνέῤῥευσεν.
ltx/gr_gr_cog/me.m04.d09:meMA.Ode9C13.incipit	Συνήφθης οὐρανίαις, Μάκαρ στρατηγίαις, καὶ…
ltx/gr_gr_cog/me.m04.d09:meMA.Ode9C13.melody	@ltx/gr_gr_cog/he.h.m8:heHE.KyriosTheotokon.name
ltx/gr_gr_cog/me.m04.d09:meMA.Ode9C13.mode	@ltx/gr_gr_cog/miscellanea:misc.Mode8
ltx/gr_gr_cog/me.m04.d09:meMA.Ode9C13.ode	@ltx/gr_gr_cog/miscellanea:misc.Ode9
ltx/gr_gr_cog/me.m04.d09:meMA.Ode9C13.text	Συνήφθης οὐρανίαις, Μάκαρ στρατηγίαις, καὶ συναγάλλῃ Μαρτύρων τοῖς τάγμασι, στεφανηφόρος, καὶ νῦν ἡμῶν πρόστηθι.
ltx/gr_gr_cog/me.m04.d09:meMA.Ode9C14.incipit	Ἡμῶν τῶν μεμνημένων, καὶ ἐπιτελούντων…
ltx/gr_gr_cog/me.m04.d09:meMA.Ode9C14.melody	@ltx/gr_gr_cog/he.h.m8:heHE.KyriosTheotokon.name
ltx/gr_gr_cog/me.m04.d09:meMA.Ode9C14.mode	@ltx/gr_gr_cog/miscellanea:misc.Mode8
ltx/gr_gr_cog/me.m04.d09:meMA.Ode9C14.ode	@ltx/gr_gr_cog/miscellanea:misc.Ode9
ltx/gr_gr_cog/me.m04.d09:meMA.Ode9C14.text	Ἡμῶν τῶν μεμνημένων, καὶ ἐπιτελούντων, τὴν ἱεράν σου πανήγυριν μέμνησο, ταῖς πρὸς Θεόν σου πρεσβείαις, Μάρτυς Εὐψύχιε.
ltx/gr_gr_cog/me.m04.d09:meMA.Ode9C1H.greekmelody	@ltx/gr_gr_cog/he.h.m8:heHE.KyriosTheotokon.greekname
ltx/gr_gr_cog/me.m04.d09:meMA.Ode9C1H.incipit	@ltx/gr_gr_cog/he.h.m8:heHE.KyriosTheotokon.incipit
ltx/gr_gr_cog/me.m04.d09:meMA.Ode9C1H.melody	@ltx/gr_gr_cog/he.h.m8:heHE.KyriosTheotokon.melody
ltx/gr_gr_cog/me.m04.d09:meMA.Ode9C1H.mode	@ltx/gr_gr_cog/miscellanea:misc.Mode8
ltx/gr_gr_cog/me.m04.d09:meMA.Ode9C1H.ode	@ltx/gr_gr_cog/miscellanea:misc.Ode9
ltx/gr_gr_cog/me.m04.d09:meMA.Ode9C1H.text	@ltx/gr_gr_cog/he.h.m8:heHE.KyriosTheotokon.text
ltx/gr_gr_cog/me.m04.d09:meMA.Ode9C1T.incipit	Φωτὶ τῆς μετανοίας, αὔγασον Παρθένε…
ltx/gr_gr_cog/me.m04.d09:meMA.Ode9C1T.melody	@ltx/gr_gr_cog/he.h.m8:heHE.KyriosTheotokon.name
ltx/gr_gr_cog/me.m04.d09:meMA.Ode9C1T.mode	@ltx/gr_gr_cog/miscellanea:misc.Mode8
ltx/gr_gr_cog/me.m04.d09:meMA.Ode9C1T.ode	@ltx/gr_gr_cog/miscellanea:misc.Ode9
ltx/gr_gr_cog/me.m04.d09:meMA.Ode9C1T.text	Φωτὶ τῆς μετανοίας, αὔγασον Παρθένε, τῆς ἁμαρτίας νυκτί με σκοτούμενον, καὶ ῥαθυμίας ὁμίχλῃ συγκαλυπτόμενον.
ltx/gr_gr_cog/me.m04.d09:meVE.Apolytikion1ger.greekmelody	@ltx/gr_gr_cog/he.a.m3:heAU.TinOraiotita.greekname
ltx/gr_gr_cog/me.m04.d09:meVE.Apolytikion1ger.incipit	Εὐψύχως ἤνυσας, δρόμον τὸν ἔνθεον…
ltx/gr_gr_cog/me.m04.d09:meVE.Apolytikion1ger.melody	@ltx/gr_gr_cog/he.a.m3:heAU.TinOraiotita.name
ltx/gr_gr_cog/me.m04.d09:meVE.Apolytikion1ger.mode	@ltx/gr_gr_cog/miscellanea:misc.Mode3
ltx/gr_gr_cog/me.m04.d09:meVE.Apolytikion1ger.poet	@ltx/gr_gr_cog/poets:po.Gerasimou
ltx/gr_gr_cog/me.m04.d09:meVE.Apolytikion1ger.text	Εὐψύχως ἤνυσας, δρόμον τὸν ἔνθεον, καὶ καταβέβληκας, ἐχθρόν τὸν δόλιον, τὴν πανοπλίαν τοῦ Σταυροῦ, παμμάκαρ ἐνδεδυμένος· ὅθεν συνηρίθμησαι, τῶν Μαρτύρων ταῖς τάξεσι, δόξαν αἰωνίζουσαν, κεκτημένος Εὐψύχιε. Ἀλλὰ μὴ διαλείπῃς πρεσβεύων, σῶσαι ἡμᾶς τοὺς σὲ τιμῶντας.
ltx/gr_gr_cog/me.m04.d09:meVE.SticStavrotheotokion.greekmelody	@ltx/gr_gr_cog/he.a.m8:heAU.OiMartyresSouKyrie.greekname
ltx/gr_gr_cog/me.m04.d09:meVE.SticStavrotheotokion.incipit	@ltx/gr_gr_cog/oc.m8.d4:ocVE.AposTheotokion.incipit
ltx/gr_gr_cog/me.m04.d09:meVE.SticStavrotheotokion.melody	@ltx/gr_gr_cog/he.a.m8:heAU.OiMartyresSouKyrie.name
ltx/gr_gr_cog/me.m04.d09:meVE.SticStavrotheotokion.mode	@ltx/gr_gr_cog/miscellanea:misc.Mode8
ltx/gr_gr_cog/me.m04.d09:meVE.SticStavrotheotokion.text	@ltx/gr_gr_cog/oc.m8.d4:ocVE.AposTheotokion.text
ltx/gr_gr_cog/me.m04.d09:meVE.SticTheotokion.greekmelody	@ltx/gr_gr_cog/he.a.m8:heAU.OiMartyresSouKyrie.greekname
ltx/gr_gr_cog/me.m04.d09:meVE.SticTheotokion.incipit	Ἁγνὴ Θεογεννήτρια, ἡ τὸν σωτήριον…
ltx/gr_gr_cog/me.m04.d09:meVE.SticTheotokion.melody	@ltx/gr_gr_cog/he.a.m8:heAU.OiMartyresSouKyrie.name
ltx/gr_gr_cog/me.m04.d09:meVE.SticTheotokion.mode	@ltx/gr_gr_cog/miscellanea:misc.Mode8
ltx/gr_gr_cog/me.m04.d09:meVE.SticTheotokion.text	Ἁγνὴ Θεογεννήτρια, ἡ τὸν σωτήριον τεκοῦσα Λόγον, ῥῦσαι τοὺς δούλους σου πειρατηρίων, τοῦ πολεμήτορος ἐχθροῦ, φώτισον ἡμῶν τὰ αἰσθητήρια, ἴθυνον ἡμῶν τὰ διαβήματα, πρὸς τρίβους σωτηρίας, ὅπως σε πίστει Κόρη πάντες δοξάζωμεν.
ltx/gr_gr_cog/me.m04.d09:meVE.Stichera01.greekmelody	@ltx/gr_gr_cog/he.a.m8:heAU.OiMartyresSouKyrie.greekname
ltx/gr_gr_cog/me.m04.d09:meVE.Stichera01.incipit	Ὁ πάνσοφος Εὐψύχιος, κατεπαιρόμενον ἀλαζονείᾳ…
ltx/gr_gr_cog/me.m04.d09:meVE.Stichera01.melody	@ltx/gr_gr_cog/he.a.m8:heAU.OiMartyresSouKyrie.name
ltx/gr_gr_cog/me.m04.d09:meVE.Stichera01.mode	@ltx/gr_gr_cog/miscellanea:misc.Mode8
ltx/gr_gr_cog/me.m04.d09:meVE.Stichera01.text	Ὁ πάνσοφος Εὐψύχιος, κατεπαιρόμενον ἀλαζονείᾳ, τὸν ματαιόφρονα πληγεὶς τῷ ξίφει, αἰσχύνης ἔπλησε πολλῆς, καὶ συνηριθμήθη τοῖς στρατεύμασι, τοῖς ἐπουρανίοις ἀγαλλόμενος. Αὐτοῦ ταῖς ἱκεσίαις, δώρησαι πᾶσι Σῶτερ τὸ μέγα ἔλεος.
ltx/gr_gr_cog/me.m04.d09:meVE.Stichera02.incipit	Εὐψύχιος ὁ ἔνδοξος, στῦλος γεγένηται…
ltx/gr_gr_cog/me.m04.d09:meVE.Stichera02.melody	@ltx/gr_gr_cog/he.a.m8:heAU.OiMartyresSouKyrie.name
ltx/gr_gr_cog/me.m04.d09:meVE.Stichera02.mode	@ltx/gr_gr_cog/miscellanea:misc.Mode8
ltx/gr_gr_cog/me.m04.d09:meVE.Stichera02.text	Εὐψύχιος ὁ ἔνδοξος, στῦλος γεγένηται τῆς Ἐκκλησίας, καὶ πύργος ἄσειστος τῆς εὐσεβείας, καὶ καθαιρέτης τοῦ ἐχθροῦ, πᾶσι τοῖς νοσοῦσι καὶ προστρέχουσι, βλύζων ὡς ἐκ κρήνης τὰ ἰάματα, Αὐτοῦ ταῖς ἱκεσίαις, εὔσπλαγχνε πᾶσι δίδου τὸ μέγα ἔλεος.
ltx/gr_gr_cog/me.m04.d09:meVE.Stichera03.incipit	Ὡς κρίνον εὐωδίασας, πᾶσαν διάνοιαν…
ltx/gr_gr_cog/me.m04.d09:meVE.Stichera03.melody	@ltx/gr_gr_cog/he.a.m8:heAU.OiMartyresSouKyrie.name
ltx/gr_gr_cog/me.m04.d09:meVE.Stichera03.mode	@ltx/gr_gr_cog/miscellanea:misc.Mode8
ltx/gr_gr_cog/me.m04.d09:meVE.Stichera03.text	Ὡς κρίνον εὐωδίασας, πᾶσαν διάνοιαν ταῖς ἡδυπνόοις, ὀσμαῖς τῶν ἄθλων σου, γενναῖε Μάρτυς, καὶ ἀπεμείωσας σοφέ, πλάνης τὸ δυσῶδες καὶ ἀνέλαμψας, ἥλιος καθάπερ ἐν τοῖς πέρασι, πρεσβεύων δωρηθῆναι, ἅπασι σωτηρίαν καὶ μέγα ἔλεος.
