ltx/gr_gr_cog/le.ep.mc.d184:lemcLI.Epistle.book_abbr	@ltx/gr_gr_cog/bible:Corinthians1.abbr
ltx/gr_gr_cog/le.ep.mc.d184:lemcLI.Epistle.book_string	@ltx/gr_gr_cog/bible:Corinthians1.text
ltx/gr_gr_cog/le.ep.mc.d184:lemcLI.Epistle.chapverse	15:12 – 19
ltx/gr_gr_cog/le.ep.mc.d184:lemcLI.Epistle.incipit	Εἰ Χριστὸς κηρύσσεται ὅτι ἐκ νεκρῶν ἐγήγερται…
ltx/gr_gr_cog/le.ep.mc.d184:lemcLI.Epistle.text	Ἀδελφοί, εἰ Χριστὸς κηρύσσεται ὅτι ἐκ νεκρῶν ἐγήγερται, πῶς λέγουσί τινες ἐν ὑμῖν ὅτι ἀνάστασις νεκρῶν οὐκ ἔστιν; εἰ δὲ ἀνάστασις νεκρῶν οὐκ ἔστιν, οὐδὲ Χριστὸς ἐγήγερται· εἰ δὲ Χριστὸς οὐκ ἐγήγερται, κενὸν ἄρα τὸ κήρυγμα ἡμῶν, κενὴ δὲ καὶ ἡ πίστις ὑμῶν. εὑρισκόμεθα δὲ καὶ ψευδομάρτυρες τοῦ Θεοῦ, ὅτι ἐμαρτυρήσαμεν κατὰ τοῦ Θεοῦ ὅτι ἤγειρε τὸν Χριστόν, ὃν οὐκ ἤγειρεν, εἴπερ ἄρα νεκροὶ οὐκ ἐγείρονται· εἰ γὰρ νεκροὶ οὐκ ἐγείρονται, οὐδὲ Χριστὸς ἐγήγερται. εἰ δὲ Χριστὸς οὐκ ἐγήγερται, ματαία ἡ πίστις ὑμῶν· ἔτι ἐστὲ ἐν ταῖς ἁμαρτίαις ὑμῶν. ἄρα καὶ οἱ κοιμηθέντες ἐν Χριστῷ ἀπώλοντο. εἰ ἐν τῇ ζωῇ ταύτῃ ἠλπικότες ἐσμὲν ἐν Χριστῷ μόνον, ἐλεεινότεροι πάντων ἀνθρώπων ἐσμέν.
ltx/gr_gr_cog/le.ep.mc.d184:lemcLI.Epistle.title	Τῇ Δευτέρᾳ τῆς Ιʹ Ἑβδομάδος
ltx/gr_gr_cog/le.ep.mc.d184:lemcLI.Epistle.title_abbr	Δευτέρᾳ τῆς Ιʹ Ἑβδομάδος
ltx/gr_gr_cog/le.ep.mc.d184:lemcLI.Epistle.version	@ltx/gr_gr_cog/properties:version.designation
