ltx/gr_gr_cog/eo.e11:eo.Doxasticon.incipit	Φανερῶν σεαυτόν…
ltx/gr_gr_cog/eo.e11:eo.Doxasticon.mode	@ltx/gr_gr_cog/miscellanea:misc.Mode8
ltx/gr_gr_cog/eo.e11:eo.Doxasticon.text	Φανερῶν σεαυτόν, τοῖς Μαθηταῖς σου Σωτήρ, μετὰ τὴν ἀνάστασιν, Σίμωνι δέδωκας τὴν τῶν προβάτων νομήν, εἰς ἀγάπης ἀντέκτισιν, τὴν τοῦ ποιμένειν φροντίδα αἰτῶν· διὸ καὶ ἔλεγες· Εἰ φιλεῖς με Πέτρε, ποίμαινε τὰ ἀρνία μου, ποίμαινε τὰ πρόβατά μου. Ὁ δὲ εὐθέως ἐνδεικνύμενος τὸ φιλόστοργον, περὶ τοῦ ἄλλου μαθητοῦ ἐπυνθάνετο. Ὧν ταῖς πρεσβείαις Χριστέ, τὴν ποίμνην σου διαφύλαττε, ἐκ λύκων λυμαινομένων αὐτήν.
ltx/gr_gr_cog/eo.e11:eo.Exaposteilarion.greekmelody	@ltx/gr_gr_cog/he.a.m2:heAU.ToisMathitaisSynelthomen.greekname
ltx/gr_gr_cog/eo.e11:eo.Exaposteilarion.incipit	Μετὰ τὴν θείαν ἔγερσιν…
ltx/gr_gr_cog/eo.e11:eo.Exaposteilarion.melody	@ltx/gr_gr_cog/he.a.m2:heAU.ToisMathitaisSynelthomen.name
ltx/gr_gr_cog/eo.e11:eo.Exaposteilarion.mode	@ltx/gr_gr_cog/miscellanea:misc.Mode2
ltx/gr_gr_cog/eo.e11:eo.Exaposteilarion.text	Μετὰ τὴν θείαν ἔγερσιν, τρὶς τῷ Πέτρῳ· Φιλεῖς με; πυθόμενος ὁ Κύριος, τῶν ἰδίων προβάτων, προβάλλεται ποιμενάρχην· ὃς ἰδών, ὃν ἠγάπα, ὁ Ἰησοῦς ἑπόμενον, ἤρετο τὸν Δεσπότην· Οὗτος δὲ τί; Ἐὰν θέλω, ἔφησε, μένειν τοῦτον, ἕως καὶ πάλιν ἔρχομαι, τί πρὸς σὲ φίλε Πέτρε;
ltx/gr_gr_cog/eo.e11:eo.Theotokion.incipit	Ὢ φοβερὸν μυστήριον…
ltx/gr_gr_cog/eo.e11:eo.Theotokion.melody	@ltx/gr_gr_cog/he.a.m2:heAU.ToisMathitaisSynelthomen.name
ltx/gr_gr_cog/eo.e11:eo.Theotokion.mode	@ltx/gr_gr_cog/miscellanea:misc.Mode2
ltx/gr_gr_cog/eo.e11:eo.Theotokion.text	Ὢ φοβερὸν μυστήριον! ὢ παράδοξον θαῦμα! διὰ θανάτου θάνατος, παντελῶς ἠφανίσθη· Τίς οὖν μὴ ἀνυμνήσει σου, καὶ τίς μὴ προσκυνήσει σου, τὴν ἀνάστασιν Λόγε, καὶ τὴν ἁγνῶς, ἐν σαρκὶ τεκοῦσάν σε Θεοτόκον; Ἧς ταῖς πρεσβείαις ἅπαντας, λύτρωσαι τῆς γεέννης.
ltx/gr_gr_cog/eo.e11:eo.title	Τὸ ΙΑʹ Ἑωθινόν.
