ltx/gr_gr_cog/le.ep.mc.d354:lemcLI.Epistle.book_abbr	@ltx/gr_gr_cog/bible:Peter2.abbr
ltx/gr_gr_cog/le.ep.mc.d354:lemcLI.Epistle.book_string	@ltx/gr_gr_cog/bible:Peter2.text
ltx/gr_gr_cog/le.ep.mc.d354:lemcLI.Epistle.chapverse	3:1 – 18
ltx/gr_gr_cog/le.ep.mc.d354:lemcLI.Epistle.incipit	Ταύτην ἤδη, δευτέραν ὑμῖν γράφω ἐπιστολήν…
ltx/gr_gr_cog/le.ep.mc.d354:lemcLI.Epistle.text	Ἀγαπητοί, ταύτην ἤδη δευτέραν ὑμῖν γράφω ἐπιστολήν, ἐν αἷς διεγείρω ὑμῶν ἐν ὑπομνήσει τὴν εἰλικρινῆ διάνοιαν, μνησθῆναι τῶν προειρημένων ῥημάτων ὑπὸ τῶν ἁγίων προφητῶν καὶ τῆς τῶν ἀποστόλων ὑμῶν ἐντολῆς τοῦ Κυρίου καὶ σωτῆρος, τοῦτο πρῶτον γινώσκοντες, ὅτι ἐλεύσονται ἐπ᾿ ἐσχάτων τῶν ἡμερῶν ἐμπαῖκται, κατὰ τὰς ἰδίας ἐπιθυμίας αὐτῶν πορευόμενοι καὶ λέγοντες· ποῦ ἐστιν ἡ ἐπαγγελία τῆς παρουσίας αὐτοῦ; ἀφ᾿ ἧς γὰρ οἱ πατέρες ἐκοιμήθησαν, πάντα οὕτω διαμένει ἀπ᾿ ἀρχῆς κτίσεως. λανθάνει γὰρ αὐτοὺς τοῦτο θέλοντας ὅτι οὐρανοὶ ἦσαν ἔκπαλαι καὶ γῆ ἐξ ὕδατος καὶ δι᾿ ὕδατος συνεστῶσα τῷ τοῦ Θεοῦ λόγῳ, δι᾿ ὧν ὁ τότε κόσμος ὕδατι κατακλυσθεὶς ἀπώλετο· οἱ δὲ νῦν οὐρανοὶ καὶ ἡ γῆ τῷ αὐτοῦ λόγῳ τεθησαυρισμένοι εἰσὶ πυρὶ τηρούμενοι εἰς ἡμέραν κρίσεως καὶ ἀπωλείας τῶν ἀσεβῶν ἀνθρώπων. Ἓν δὲ τοῦτο μὴ λανθανέτω ὑμᾶς, ἀγαπητοί, ὅτι μία ἡμέρα παρὰ Κυρίῳ ὡς χίλια ἔτη, καὶ χίλια ἔτη ὡς ἡμέρα μία. οὐ βραδύνει ὁ Κύριος τῆς ἐπαγγελίας, ὥς τινες βραδυτῆτα ἡγοῦνται, ἀλλὰ μακροθυμεῖ εἰς ἡμᾶς, μὴ βουλόμενός τινας ἀπολέσθαι, ἀλλὰ πάντας εἰς μετάνοιαν χωρῆσαι. Ἥξει δὲ ἡ ἡμέρα Κυρίου ὡς κλέπτης ἐν νυκτί, ἐν ᾗ οὐρανοὶ ῥοιζηδὸν παρελεύσονται, στοιχεῖα δὲ καυσούμενα λυθήσονται, καὶ γῆ καὶ τὰ ἐν αὐτῇ ἔργα κατακαήσεται. Τούτων οὖν πάντων λυομένων ποταποὺς δεῖ ὑπάρχειν ὑμᾶς ἐν ἁγίαις ἀναστροφαῖς καὶ εὐσεβείαις, προσδοκῶντας καὶ σπεύδοντας τὴν παρουσίαν τῆς τοῦ Θεοῦ ἡμέρας, δι᾿ ἣν οὐρανοὶ πυρούμενοι λυθήσονται καὶ στοιχεῖα καυσούμενα τήκεται! καινοὺς δὲ οὐρανοὺς καὶ γῆν καινὴν κατὰ τὸ ἐπάγγελμα αὐτοῦ προσδοκῶμεν, ἐν οἷς δικαιοσύνη κατοικεῖ. Διό, ἀγαπητοί, ταῦτα προσδοκῶντες σπουδάσατε ἄσπιλοι καὶ ἀμώμητοι αὐτῷ εὑρεθῆναι ἐν εἰρήνῃ, καὶ τὴν τοῦ Κυρίου ἡμῶν μακροθυμίαν σωτηρίαν ἡγεῖσθε, καθὼς καὶ ὁ ἀγαπητὸς ἡμῶν ἀδελφὸς Παῦλος κατὰ τὴν αὐτῷ δοθεῖσαν σοφίαν ἔγραψεν ὑμῖν, ὡς καὶ ἐν πάσαις ταῖς ἐπιστολαῖς λαλῶν ἐν αὐταῖς περὶ τούτων, ἐν οἷς ἐστι δυσνόητά τινα, ἃ οἱ ἀμαθεῖς καὶ ἀστήρικτοι στρεβλοῦσιν ὡς καὶ τὰς λοιπὰς γραφὰς πρὸς τὴν ἰδίαν αὐτῶν ἀπώλειαν. Ὑμεῖς οὖν, ἀγαπητοί, προγινώσκοντες φυλάσσεσθε, ἵνα μὴ τῇ τῶν ἀθέσμων πλάνῃ συναπαχθέντες ἐκπέσητε τοῦ ἰδίου στηριγμοῦ, αὐξάνετε δὲ ἐν χάριτι καὶ γνώσει τοῦ Κυρίου ἡμῶν καὶ σωτῆρος Ἰησοῦ Χριστοῦ. αὐτῷ ἡ δόξα καὶ νῦν καὶ εἰς ἡμέραν αἰῶνος· ἀμήν.
ltx/gr_gr_cog/le.ep.mc.d354:lemcLI.Epistle.title	Τῇ Τετάρτῃ τῆς ΛΔʹ Ἑβδομάδος
ltx/gr_gr_cog/le.ep.mc.d354:lemcLI.Epistle.title_abbr	Τετάρτῃ τῆς ΛΔʹ Ἑβδομάδος
ltx/gr_gr_cog/le.ep.mc.d354:lemcLI.Epistle.version	@ltx/gr_gr_cog/properties:version.designation
