ltx/gr_gr_cog/tr.d037:trCO.header	
ltx/gr_gr_cog/tr.d037:trDA.commemoration.full	Τῌ ΔΕΥΤΕΡᾼ ΤΗΣ Γʹ ΕΒΔΟΜΑΔΟΣ
ltx/gr_gr_cog/tr.d037:trDA.commemoration.short	Δευτέρα τῆς Γʹ Ἑβδομάδος
ltx/gr_gr_cog/tr.d037:trDA.insert1	
ltx/gr_gr_cog/tr.d037:trDA.insert2	
ltx/gr_gr_cog/tr.d037:trDA.note	
ltx/gr_gr_cog/tr.d037:trDA.title	
ltx/gr_gr_cog/tr.d037:trHO.commemorations	
ltx/gr_gr_cog/tr.d037:trHO.daytitle	
ltx/gr_gr_cog/tr.d037:trHO.description1	
ltx/gr_gr_cog/tr.d037:trHO.description2	
ltx/gr_gr_cog/tr.d037:trHO.note1	
ltx/gr_gr_cog/tr.d037:trHO.note2	
ltx/gr_gr_cog/tr.d037:trMA.AposIdiomelon1.incipit	Τὸν χαλεπὸν τῶν πταισμάτων μου…
ltx/gr_gr_cog/tr.d037:trMA.AposIdiomelon1.melody	@ltx/gr_gr_cog/miscellanea:misc.Idiomelon
ltx/gr_gr_cog/tr.d037:trMA.AposIdiomelon1.mode	@ltx/gr_gr_cog/miscellanea:misc.Mode4
ltx/gr_gr_cog/tr.d037:trMA.AposIdiomelon1.text	Τὸν χαλεπὸν τῶν πταισμάτων μου, ῥύπον ἐνδέδυμαι, καὶ τῆς χαρᾶς τοῦ νυμφῶνος ἐκβέβλημαι οἴκτειρόν με τῇ ἀφάτῳ σου εὐσπλαγχνίᾳ, ὡς τὸν Ἄσωτον παῖδα ὁ Θεός, καὶ ἐλέησόν με.
ltx/gr_gr_cog/tr.d037:trMA.AposMartyric.incipit	Τίς οὐκ ἐξίσταται ὁρῶν, ἅγιοι…
ltx/gr_gr_cog/tr.d037:trMA.AposMartyric.melody	
ltx/gr_gr_cog/tr.d037:trMA.AposMartyric.mode	@ltx/gr_gr_cog/miscellanea:misc.Mode4
ltx/gr_gr_cog/tr.d037:trMA.AposMartyric.text	Τίς οὐκ ἐξίσταται ὁρῶν, ἅγιοι Μάρτυρες, τὸν ἀγῶνα τὸν καλόν, ὃν ἠγωνίσασθε; πῶς ἐν σώματι ὄντες, τὸν ἀσώματον ἐχθρὸν ἑνικήσατε, Χριστὸν ὁμολογήσαντες, καὶ Σταυρῷ ὁπλισάμενοι; ὅθεν ἐπαξίως ἀνεδείχθητε, δαιμόνων φυγαδευταί, καὶ βαρβάρων πολέμιοι, ἀπαύστως πρεσβεύσατε, σωθῆναι τὰς ψυχας ἡμῶν.
ltx/gr_gr_cog/tr.d037:trMA.AposTheotokion.incipit	Ἡ λαμπὰς ἡ ἄσβεστος, ὁ…
ltx/gr_gr_cog/tr.d037:trMA.AposTheotokion.melody	
ltx/gr_gr_cog/tr.d037:trMA.AposTheotokion.mode	@ltx/gr_gr_cog/miscellanea:misc.Mode4
ltx/gr_gr_cog/tr.d037:trMA.AposTheotokion.text	Ἡ λαμπὰς ἡ ἄσβεστος, ὁ θρόνος τῆς δικαιοσύνης, ἄχραντε Δέσποινα πρέσβευε, τοῦ σωθῆναι τὰς ψυχὰς ἡμῶν.
ltx/gr_gr_cog/tr.d037:trMA.C1.poet	@ltx/gr_gr_cog/poets:po.Iosif
ltx/gr_gr_cog/tr.d037:trMA.C1.title	
ltx/gr_gr_cog/tr.d037:trMA.C1.verse	
ltx/gr_gr_cog/tr.d037:trMA.C2.poet	@ltx/gr_gr_cog/poets:po.Theodorou
ltx/gr_gr_cog/tr.d037:trMA.C2.title	
ltx/gr_gr_cog/tr.d037:trMA.C2.verse	
ltx/gr_gr_cog/tr.d037:trMA.Kathisma21.greekmelody	@ltx/gr_gr_cog/he.a.m8:heAU.ToProstachthen.greekname
ltx/gr_gr_cog/tr.d037:trMA.Kathisma21.incipit	Τῆς ἐγκρατείας τῷ πυρὶ φλέξωμεν…
ltx/gr_gr_cog/tr.d037:trMA.Kathisma21.melody	@ltx/gr_gr_cog/he.a.m8:heAU.ToProstachthen.name
ltx/gr_gr_cog/tr.d037:trMA.Kathisma21.mode	@ltx/gr_gr_cog/miscellanea:misc.Mode8
ltx/gr_gr_cog/tr.d037:trMA.Kathisma21.text	Τῆς ἐγκρατείας τῷ πυρὶ φλέξωμεν πάντες, τὰς φρυγανώδεις τῶν παθῶν ἐπαναστάσεις, καὶ τὴν φλόγα ἐκείνην τὴν μὴ σβεννυμένην, δακρύων νῦν κατασβέσωμεν ὀχετοῖς, βοῶντες τῷ κρῖναι μέλλοντι πᾶσαν τὴν γῆν. Σῶτερ εὔσπλαγχνε Κύριε, ἀκατακρίτους ἡμᾶς, συντήρησον, διδοὺς ἡμῖν, τῶν πταισμάτων τὴν συγχώρησιν.
ltx/gr_gr_cog/tr.d037:trMA.Kathisma22.greekmelody	@ltx/gr_gr_cog/he.a.m8:heAU.ToProstachthen.greekname
ltx/gr_gr_cog/tr.d037:trMA.Kathisma22.incipit	@ltx/gr_gr_cog/me.m11.d08:meMA.Kathisma3T.incipit
ltx/gr_gr_cog/tr.d037:trMA.Kathisma22.melody	@ltx/gr_gr_cog/he.a.m8:heAU.ToProstachthen.name
ltx/gr_gr_cog/tr.d037:trMA.Kathisma22.mode	@ltx/gr_gr_cog/miscellanea:misc.Mode8
ltx/gr_gr_cog/tr.d037:trMA.Kathisma22.text	@ltx/gr_gr_cog/me.m11.d08:meMA.Kathisma3T.text
ltx/gr_gr_cog/tr.d037:trMA.Kathisma31.greekmelody	@ltx/gr_gr_cog/he.a.m8:heAU.ToProstachthen.greekname
ltx/gr_gr_cog/tr.d037:trMA.Kathisma31.incipit	Τριὰς ἁγία καὶ σεπτὴ τοὺς…
ltx/gr_gr_cog/tr.d037:trMA.Kathisma31.melody	@ltx/gr_gr_cog/he.a.m8:heAU.ToProstachthen.name
ltx/gr_gr_cog/tr.d037:trMA.Kathisma31.mode	@ltx/gr_gr_cog/miscellanea:misc.Mode8
ltx/gr_gr_cog/tr.d037:trMA.Kathisma31.text	Τριὰς ἁγία καὶ σεπτὴ τοὺς τὴν Νηστείαν, ἐν ἑβδομάδεσι τρισὶ διανύοντας, διαφύλαξον σῴους καὶ ἀκατακρίτους, ἀξίως διευδρομῆσαι πρὸς τὸ ἑξῆς, καὶ πάσας τὰς ἐντολάς σου διατελεῖν, ἵνα οὕτω προφθάσωμεν, ἀκατακρίτως ἰδεῖν, τὴν ἔνδοξον Ἀνάστασιν, ὕμνον αἶνον προσάγοντες.
ltx/gr_gr_cog/tr.d037:trMA.Kathisma32.greekmelody	@ltx/gr_gr_cog/he.a.m8:heAU.ToProstachthen.greekname
ltx/gr_gr_cog/tr.d037:trMA.Kathisma32.incipit	Ἡ προστασία τῶν πιστῶν Θεοκυῆτορ…
ltx/gr_gr_cog/tr.d037:trMA.Kathisma32.melody	@ltx/gr_gr_cog/he.a.m8:heAU.ToProstachthen.name
ltx/gr_gr_cog/tr.d037:trMA.Kathisma32.mode	@ltx/gr_gr_cog/miscellanea:misc.Mode8
ltx/gr_gr_cog/tr.d037:trMA.Kathisma32.text	Ἡ προστασία τῶν πιστῶν Θεοκυῆτορ, τῶν θλιβομένων ἡ χαρὰ καὶ τῶν πενθούντων, ἡ μεγίστη παράκλησις, τὸν ἐκ τῆς γαστρός σου, Παρθένε τῆς παναγίας ὑπερφυῶς, τεχθέντα ἀδιαλείπτως ὑπὲρ ἡμῶν, σὺν Ἀγγέλοις καὶ ἄρχουσι, δυσώπει ῥύσασθαι ἡμᾶς, ἐν ὥρᾳ τῆς ἐτάσεως, τῆς δεινῆς κατακρίσεως.
ltx/gr_gr_cog/tr.d037:trMA.Ode1C11.greekmelody	@ltx/gr_gr_cog/he.h.m8:heHE.AsmaAnapempsomen.greekname
ltx/gr_gr_cog/tr.d037:trMA.Ode1C11.incipit	Ἔχων ὡς Θεὸς τὸ συμπαθές…
ltx/gr_gr_cog/tr.d037:trMA.Ode1C11.melody	@ltx/gr_gr_cog/he.h.m8:heHE.AsmaAnapempsomen.name
ltx/gr_gr_cog/tr.d037:trMA.Ode1C11.mode	@ltx/gr_gr_cog/miscellanea:misc.Mode8
ltx/gr_gr_cog/tr.d037:trMA.Ode1C11.ode	@ltx/gr_gr_cog/miscellanea:misc.Ode1
ltx/gr_gr_cog/tr.d037:trMA.Ode1C11.text	Ἔχων ὡς Θεὸς τὸ συμπαθές, μετανοοῦντα δέξαι με, τὸν δαπανήσαντα, τὸν βίον μου ἀσώτως, βοῶ σοι τό· Ἥμαρτον, κατηγόρων οὐ χρῄζω, τὴν αἰσχύνην τῶν ἔργων προσφέρων.
ltx/gr_gr_cog/tr.d037:trMA.Ode1C12.incipit	Βρῶσιν λελοιπὼς Ἀγγελικήν, παρωμοιώθην κτήνεσιν…
ltx/gr_gr_cog/tr.d037:trMA.Ode1C12.melody	@ltx/gr_gr_cog/he.h.m8:heHE.AsmaAnapempsomen.name
ltx/gr_gr_cog/tr.d037:trMA.Ode1C12.mode	@ltx/gr_gr_cog/miscellanea:misc.Mode8
ltx/gr_gr_cog/tr.d037:trMA.Ode1C12.ode	@ltx/gr_gr_cog/miscellanea:misc.Ode1
ltx/gr_gr_cog/tr.d037:trMA.Ode1C12.text	Βρῶσιν λελοιπὼς Ἀγγελικήν, παρωμοιώθην κτήνεσιν, ἐν τῷ σιτίζεσθαι τὴν μοχθηρὰν κακίαν, ἀλλʼ οὖν ἐπιστρέφοντα, δέξαι με ὥσπερ ἕνα τῶν μισθίων, οὐράνιε Πάτερ.
ltx/gr_gr_cog/tr.d037:trMA.Ode1C13.incipit	Νύκτα ἡδονῶν τὴν ἐκ τρυφῆς…
ltx/gr_gr_cog/tr.d037:trMA.Ode1C13.melody	@ltx/gr_gr_cog/he.h.m8:heHE.AsmaAnapempsomen.name
ltx/gr_gr_cog/tr.d037:trMA.Ode1C13.mode	@ltx/gr_gr_cog/miscellanea:misc.Mode8
ltx/gr_gr_cog/tr.d037:trMA.Ode1C13.ode	@ltx/gr_gr_cog/miscellanea:misc.Ode1
ltx/gr_gr_cog/tr.d037:trMA.Ode1C13.text	Νύκτα ἡδονῶν τὴν ἐκ τρυφῆς, προσγινομένην ἅπαντες, πιστοὶ ἀφέμενοι, φωτὶ τῆς ἀληθείας, σπουδαίως προσέλθωμεν, ἵνα τῆς φωτοφόρου εὐωχίας, καταξιωθῶμεν.
ltx/gr_gr_cog/tr.d037:trMA.Ode1C1T.incipit	Χαίροις ὁ πανάγιος ναός, ὁ…
ltx/gr_gr_cog/tr.d037:trMA.Ode1C1T.melody	@ltx/gr_gr_cog/he.h.m8:heHE.AsmaAnapempsomen.name
ltx/gr_gr_cog/tr.d037:trMA.Ode1C1T.mode	@ltx/gr_gr_cog/miscellanea:misc.Mode8
ltx/gr_gr_cog/tr.d037:trMA.Ode1C1T.ode	@ltx/gr_gr_cog/miscellanea:misc.Ode1
ltx/gr_gr_cog/tr.d037:trMA.Ode1C1T.text	Χαίροις ὁ πανάγιος ναός, ὁ πόκος ὁ θεόδροσος, ἐσφραγισμένη πηγὴ τοῦ ἀθανάτου ῥείθρου, τὴν ποίμνην σου, Δέσποινα, φύλαττε ἐκ παντοίων πολεμίων, ἀπολιορκήτως.
ltx/gr_gr_cog/tr.d037:trMA.Ode1C21.greekmelody	@ltx/gr_gr_cog/he.h.m8:heHE.AsomenOdinToTheo.greekname
ltx/gr_gr_cog/tr.d037:trMA.Ode1C21.incipit	Νῦν ἐν ἑβδομάσι τρισίν, ὡς…
ltx/gr_gr_cog/tr.d037:trMA.Ode1C21.melody	@ltx/gr_gr_cog/he.h.m8:heHE.AsomenOdinToTheo.name
ltx/gr_gr_cog/tr.d037:trMA.Ode1C21.mode	@ltx/gr_gr_cog/miscellanea:misc.Mode8
ltx/gr_gr_cog/tr.d037:trMA.Ode1C21.ode	@ltx/gr_gr_cog/miscellanea:misc.Ode1
ltx/gr_gr_cog/tr.d037:trMA.Ode1C21.text	Νῦν ἐν ἑβδομάσι τρισίν, ὡς πάλαι τριήμερος ὁ Ἰσραήλ, ἁγνισθέντες ἀδελφοί, ὄρει εὐχῶν φθάσωμεν, καὶ ἐκεῖθεν θείων φωνῶν ἀκούσαντες, Χριστὸν ὑμνήσωμεν.
ltx/gr_gr_cog/tr.d037:trMA.Ode1C22.incipit	Ὥσπερ Σαμψὼν νηστείᾳ, δυναμωθέντες δεῦτε…
ltx/gr_gr_cog/tr.d037:trMA.Ode1C22.melody	@ltx/gr_gr_cog/he.h.m8:heHE.AsomenOdinToTheo.name
ltx/gr_gr_cog/tr.d037:trMA.Ode1C22.mode	@ltx/gr_gr_cog/miscellanea:misc.Mode8
ltx/gr_gr_cog/tr.d037:trMA.Ode1C22.ode	@ltx/gr_gr_cog/miscellanea:misc.Ode1
ltx/gr_gr_cog/tr.d037:trMA.Ode1C22.text	Ὥσπερ Σαμψὼν νηστείᾳ, δυναμωθέντες δεῦτε, ὡς ἄλλον θῆρα πατάξωμεν λαοί, τὸν τῆς γαστρὸς δαίμονα, καὶ οὐ μὴ γελάσῃ ἡ Δαλιδὰ τῶν παθῶν, ἐξαπατῶσα ἡμᾶς.
ltx/gr_gr_cog/tr.d037:trMA.Ode1C2A1.incipit	Πίστει ὡς Δαυῒδ καὶ ἡμεῖς…
ltx/gr_gr_cog/tr.d037:trMA.Ode1C2A1.melody	@ltx/gr_gr_cog/he.h.m8:heHE.AsomenOdinToTheo.name
ltx/gr_gr_cog/tr.d037:trMA.Ode1C2A1.mode	@ltx/gr_gr_cog/miscellanea:misc.Mode8
ltx/gr_gr_cog/tr.d037:trMA.Ode1C2A1.ode	@ltx/gr_gr_cog/miscellanea:misc.Ode1
ltx/gr_gr_cog/tr.d037:trMA.Ode1C2A1.text	Πίστει ὡς Δαυῒδ καὶ ἡμεῖς, τῇ ταπεινοφροσύνῃ, καθοπλισθέντες, ὡς ἄλλον Γολιάθ, τὸν ὑπερήφανον νοῦν, καταβεβληκότες, συνδιακόψωμεν καὶ μυριάδας παθῶν.
ltx/gr_gr_cog/tr.d037:trMA.Ode1C2H.greekmelody	@ltx/gr_gr_cog/he.h.m8:heHE.AsomenOdinToTheo.greekname
ltx/gr_gr_cog/tr.d037:trMA.Ode1C2H.incipit	@ltx/gr_gr_cog/he.h.m8:heHE.AsomenOdinToTheo.incipit
ltx/gr_gr_cog/tr.d037:trMA.Ode1C2H.melody	@ltx/gr_gr_cog/he.h.m8:heHE.AsomenOdinToTheo.melody
ltx/gr_gr_cog/tr.d037:trMA.Ode1C2H.mode	@ltx/gr_gr_cog/miscellanea:misc.Mode8
ltx/gr_gr_cog/tr.d037:trMA.Ode1C2H.ode	@ltx/gr_gr_cog/miscellanea:misc.Ode1
ltx/gr_gr_cog/tr.d037:trMA.Ode1C2H.text	@ltx/gr_gr_cog/he.h.m8:heHE.AsomenOdinToTheo.text
ltx/gr_gr_cog/tr.d037:trMA.Ode1C2T.incipit	Χαῖρε ἡ τῆς Εὔας χαρά…
ltx/gr_gr_cog/tr.d037:trMA.Ode1C2T.melody	@ltx/gr_gr_cog/he.h.m8:heHE.AsomenOdinToTheo.name
ltx/gr_gr_cog/tr.d037:trMA.Ode1C2T.mode	@ltx/gr_gr_cog/miscellanea:misc.Mode8
ltx/gr_gr_cog/tr.d037:trMA.Ode1C2T.ode	@ltx/gr_gr_cog/miscellanea:misc.Ode1
ltx/gr_gr_cog/tr.d037:trMA.Ode1C2T.text	Χαῖρε ἡ τῆς Εὔας χαρά· ἡ γὰρ ἐκείνης λύπη, διὰ τοῦ τόκου σου, πέπαυται Ἁγνή, χαῖρε ἀδύτου φωτός, φωτεινὴ νεφέλη, ἐξ ἧς ἀνέτειλε Χριστὸς ὁ Θεός.
ltx/gr_gr_cog/tr.d037:trMA.Ode1C2Tr.incipit	Τρία μέλπω χερουβικῶς, ἁγία σε…
ltx/gr_gr_cog/tr.d037:trMA.Ode1C2Tr.melody	@ltx/gr_gr_cog/he.h.m8:heHE.AsomenOdinToTheo.name
ltx/gr_gr_cog/tr.d037:trMA.Ode1C2Tr.mode	@ltx/gr_gr_cog/miscellanea:misc.Mode8
ltx/gr_gr_cog/tr.d037:trMA.Ode1C2Tr.ode	@ltx/gr_gr_cog/miscellanea:misc.Ode1
ltx/gr_gr_cog/tr.d037:trMA.Ode1C2Tr.text	Τρία μέλπω χερουβικῶς, ἁγία σε Θεότης, φῶτα καὶ φῶς, καὶ ζωήν τε καὶ ζωάς, Θεὸν τὸν γεννήσαντα, Θεὸν τὸν γεννηθέντα, Θεὸν καὶ τὸ ἐκ Πατρὸς ἐκπορευθέν, Πνεῦμα τὸ ζῶν.
ltx/gr_gr_cog/tr.d037:trMA.Ode8C11.greekmelody	@ltx/gr_gr_cog/he.h.m8:heHE.OiTheorrimonesPaides.greekname
ltx/gr_gr_cog/tr.d037:trMA.Ode8C11.incipit	Ἐκδαπανήσας οὐσίαν τὴν πατρῴαν, μετὰ…
ltx/gr_gr_cog/tr.d037:trMA.Ode8C11.melody	@ltx/gr_gr_cog/he.h.m8:heHE.OiTheorrimonesPaides.name
ltx/gr_gr_cog/tr.d037:trMA.Ode8C11.mode	@ltx/gr_gr_cog/miscellanea:misc.Mode8
ltx/gr_gr_cog/tr.d037:trMA.Ode8C11.ode	@ltx/gr_gr_cog/miscellanea:misc.Ode8
ltx/gr_gr_cog/tr.d037:trMA.Ode8C11.text	Ἐκδαπανήσας οὐσίαν τὴν πατρῴαν, μετὰ πορνῶν ἐξεβλήθην, τῶν προαυλίων τῆς χάριτος, ἀλλὰ δέξαι με Πάτερ, διʼ ἄμετρον ἔλεος.
ltx/gr_gr_cog/tr.d037:trMA.Ode8C12.incipit	Ἐν φαιδροτάτῃ νηστείας φωταυγείᾳ, τῶν…
ltx/gr_gr_cog/tr.d037:trMA.Ode8C12.melody	@ltx/gr_gr_cog/he.h.m8:heHE.OiTheorrimonesPaides.name
ltx/gr_gr_cog/tr.d037:trMA.Ode8C12.mode	@ltx/gr_gr_cog/miscellanea:misc.Mode8
ltx/gr_gr_cog/tr.d037:trMA.Ode8C12.ode	@ltx/gr_gr_cog/miscellanea:misc.Ode8
ltx/gr_gr_cog/tr.d037:trMA.Ode8C12.text	Ἐν φαιδροτάτῃ νηστείας φωταυγείᾳ, τῶν προσευχῶν λαμπρυνθέντες χρηματίσωμεν, ὅπως τῆς ἁμαρτίας, τὸ σκότος ἐκφύγωμεν.
ltx/gr_gr_cog/tr.d037:trMA.Ode8C13.incipit	Ἐκδυσωπεῖ σε χορὸς τῶν Ἀσωμάτων…
ltx/gr_gr_cog/tr.d037:trMA.Ode8C13.melody	@ltx/gr_gr_cog/he.h.m8:heHE.OiTheorrimonesPaides.name
ltx/gr_gr_cog/tr.d037:trMA.Ode8C13.mode	@ltx/gr_gr_cog/miscellanea:misc.Mode8
ltx/gr_gr_cog/tr.d037:trMA.Ode8C13.ode	@ltx/gr_gr_cog/miscellanea:misc.Ode8
ltx/gr_gr_cog/tr.d037:trMA.Ode8C13.text	Ἐκδυσωπεῖ σε χορὸς τῶν Ἀσωμάτων, τὰ Χερουβὶμ ἱκετεύει, καὶ τῶν Ἁγίων τὰ τάγματα, τὰς ψυχὰς ἡμῶν σῶσον, Χριστὲ πολυέλεε.
ltx/gr_gr_cog/tr.d037:trMA.Ode8C1T.incipit	Τὸν ἀγεώργητον βότρυν συλλαβοῦσα, ἐσκοτισμένον…
ltx/gr_gr_cog/tr.d037:trMA.Ode8C1T.melody	@ltx/gr_gr_cog/he.h.m8:heHE.OiTheorrimonesPaides.name
ltx/gr_gr_cog/tr.d037:trMA.Ode8C1T.mode	@ltx/gr_gr_cog/miscellanea:misc.Mode8
ltx/gr_gr_cog/tr.d037:trMA.Ode8C1T.ode	@ltx/gr_gr_cog/miscellanea:misc.Ode8
ltx/gr_gr_cog/tr.d037:trMA.Ode8C1T.text	Τὸν ἀγεώργητον βότρυν συλλαβοῦσα, ἐσκοτισμένον με μέθῃ, τῆς ἁμαρτίας σωφρόνισον, Θεοτόκε Παρθένε, ἐλπὶς τῶν ψυχῶν ἡμῶν.
ltx/gr_gr_cog/tr.d037:trMA.Ode8C21.greekmelody	@ltx/gr_gr_cog/he.h.m8:heHE.OStegazonEnYdasi.greekname
ltx/gr_gr_cog/tr.d037:trMA.Ode8C21.incipit	Τὸ πατρῷον κειμήλιον, τὸ χρῆμα…
ltx/gr_gr_cog/tr.d037:trMA.Ode8C21.melody	@ltx/gr_gr_cog/he.h.m8:heHE.OStegazonEnYdasi.name
ltx/gr_gr_cog/tr.d037:trMA.Ode8C21.mode	@ltx/gr_gr_cog/miscellanea:misc.Mode8
ltx/gr_gr_cog/tr.d037:trMA.Ode8C21.ode	@ltx/gr_gr_cog/miscellanea:misc.Ode8
ltx/gr_gr_cog/tr.d037:trMA.Ode8C21.text	Τὸ πατρῷον κειμήλιον, τὸ χρῆμα τὸ θαυμαστόν, τὴν μητέρα πάντων τῶν λατρευσάντων τῷ Δεσπότῃ Χριστῷ, δεῦτε τρυφήσωμεν, ἀδελφοὶ τὴν Νηστείαν· καὶ γὰρ αὕτη ῥώννυσι τὸ σῶμα, καὶ καταφωτίζει τὸν νοῦν, καὶ τὴν καρδίαν.
ltx/gr_gr_cog/tr.d037:trMA.Ode8C22.incipit	Γεδεὼν τὸν θαυμάσιον, ἐκμιμουμένη ψυχή…
ltx/gr_gr_cog/tr.d037:trMA.Ode8C22.melody	@ltx/gr_gr_cog/he.h.m8:heHE.OStegazonEnYdasi.name
ltx/gr_gr_cog/tr.d037:trMA.Ode8C22.mode	@ltx/gr_gr_cog/miscellanea:misc.Mode8
ltx/gr_gr_cog/tr.d037:trMA.Ode8C22.ode	@ltx/gr_gr_cog/miscellanea:misc.Ode8
ltx/gr_gr_cog/tr.d037:trMA.Ode8C22.text	Γεδεὼν τὸν θαυμάσιον, ἐκμιμουμένη ψυχή, ἀρετὰς φέρουσα, πίστιν ἐλπίδα, καὶ ἀγάπην Χριστοῦ, ἔξελθε κτείνουσα, τὰ ἀλλόφυλα πάθη, ὡς ἐκεῖνος, σὺν τριακοσίοις, τὸ Μαδινιαῖον ἔθνος ἀποκαθαίρων.
ltx/gr_gr_cog/tr.d037:trMA.Ode8C2A1.incipit	Ὅταν ἔλθῃς ἐν τῇ δόξῃ…
ltx/gr_gr_cog/tr.d037:trMA.Ode8C2A1.melody	@ltx/gr_gr_cog/he.h.m8:heHE.OStegazonEnYdasi.name
ltx/gr_gr_cog/tr.d037:trMA.Ode8C2A1.mode	@ltx/gr_gr_cog/miscellanea:misc.Mode8
ltx/gr_gr_cog/tr.d037:trMA.Ode8C2A1.ode	@ltx/gr_gr_cog/miscellanea:misc.Ode8
ltx/gr_gr_cog/tr.d037:trMA.Ode8C2A1.text	Ὅταν ἔλθῃς ἐν τῇ δόξῃ σου, τοῦ κρῖναι πᾶσαν τὴν γῆν, σὺν ταῖς χιλιάσι, καὶ μυριάσι τῶν Δυνάμεων, τότε μου Κύριε φεῖσαι ἄνες, καὶ ῥῦσαι καταδίκης, μή με κατασχύνῃς, μή με κατακρίνῃς, πυρὶ τῷ αἰωνίῳ.
ltx/gr_gr_cog/tr.d037:trMA.Ode8C2H.greekmelody	@ltx/gr_gr_cog/he.h.m8:heHE.OStegazonEnYdasi.greekname
ltx/gr_gr_cog/tr.d037:trMA.Ode8C2H.incipit	@ltx/gr_gr_cog/he.h.m8:heHE.OStegazonEnYdasi.incipit
ltx/gr_gr_cog/tr.d037:trMA.Ode8C2H.melody	@ltx/gr_gr_cog/he.h.m8:heHE.OStegazonEnYdasi.melody
ltx/gr_gr_cog/tr.d037:trMA.Ode8C2H.mode	@ltx/gr_gr_cog/miscellanea:misc.Mode8
ltx/gr_gr_cog/tr.d037:trMA.Ode8C2H.ode	@ltx/gr_gr_cog/miscellanea:misc.Ode8
ltx/gr_gr_cog/tr.d037:trMA.Ode8C2H.text	@ltx/gr_gr_cog/he.h.m8:heHE.OStegazonEnYdasi.text
ltx/gr_gr_cog/tr.d037:trMA.Ode8C2T.incipit	Ἂς ἐν τόκῳ διέφυγεν, ὠδῖνας…
ltx/gr_gr_cog/tr.d037:trMA.Ode8C2T.melody	@ltx/gr_gr_cog/he.h.m8:heHE.OStegazonEnYdasi.name
ltx/gr_gr_cog/tr.d037:trMA.Ode8C2T.mode	@ltx/gr_gr_cog/miscellanea:misc.Mode8
ltx/gr_gr_cog/tr.d037:trMA.Ode8C2T.ode	@ltx/gr_gr_cog/miscellanea:misc.Ode8
ltx/gr_gr_cog/tr.d037:trMA.Ode8C2T.text	Ἂς ἐν τόκῳ διέφυγεν, ὠδῖνας ὑπερφυῶς ἐν τῷ σῷ τιμίῳ Πάθει, ἐπέγνω ἡ τεκοῦσά σε· ἤλγει γὰρ βλέπουσα, ἐν σταυρῷ σε παγέντα ἑκουσίως, ὑπὸ Ἰουδαίων, τὸν ἐπὶ ὑδάτων, τὴν γῆν θεμελιοῦντα.
ltx/gr_gr_cog/tr.d037:trMA.Ode8C2Tr.incipit	Καὶ Τριάδα δοξάζω σε, καὶ…
ltx/gr_gr_cog/tr.d037:trMA.Ode8C2Tr.melody	@ltx/gr_gr_cog/he.h.m8:heHE.OStegazonEnYdasi.name
ltx/gr_gr_cog/tr.d037:trMA.Ode8C2Tr.mode	@ltx/gr_gr_cog/miscellanea:misc.Mode8
ltx/gr_gr_cog/tr.d037:trMA.Ode8C2Tr.ode	@ltx/gr_gr_cog/miscellanea:misc.Ode8
ltx/gr_gr_cog/tr.d037:trMA.Ode8C2Tr.text	Καὶ Τριάδα δοξάζω σε, καὶ ὡς Μονάδα ὑμνῶ, σὲ Θεότης μία, Πάτερ παντοκράτορ, καὶ μονάρχα Υἱέ, Πνεῦμα τὸ ἅγιον, καὶ πανδέσποτον κράτος, μία φύσις, μία βασιλεία, ἐν δὲ χαρακτῆρσι, τρισὶ προσκυνουμένη.
ltx/gr_gr_cog/tr.d037:trMA.Ode9C11.greekmelody	@ltx/gr_gr_cog/he.h.m8:heHE.TonProdilothenta.greekname
ltx/gr_gr_cog/tr.d037:trMA.Ode9C11.incipit	Τὸν ἀπὸ τῆς σῆς μακρυνθέντα…
ltx/gr_gr_cog/tr.d037:trMA.Ode9C11.melody	@ltx/gr_gr_cog/he.h.m8:heHE.TonProdilothenta.name
ltx/gr_gr_cog/tr.d037:trMA.Ode9C11.mode	@ltx/gr_gr_cog/miscellanea:misc.Mode8
ltx/gr_gr_cog/tr.d037:trMA.Ode9C11.ode	@ltx/gr_gr_cog/miscellanea:misc.Ode9
ltx/gr_gr_cog/tr.d037:trMA.Ode9C11.text	Τὸν ἀπὸ τῆς σῆς μακρυνθέντα, Πάτερ ἀγάπης, καὶ ἐθελουσίοις ὁρμαῖς, ἡδονῶν δουλωθέντα, ἐπιστρέφοντα ὡς τὸν Ἄσωτον δέξαι· μόνος γὰρ ὑπάρχεις πολυέλεος.
ltx/gr_gr_cog/tr.d037:trMA.Ode9C12.incipit	Ἄκαρπος ἐδείχθην συκῇ, μόνην τὴν…
ltx/gr_gr_cog/tr.d037:trMA.Ode9C12.melody	@ltx/gr_gr_cog/he.h.m8:heHE.TonProdilothenta.name
ltx/gr_gr_cog/tr.d037:trMA.Ode9C12.mode	@ltx/gr_gr_cog/miscellanea:misc.Mode8
ltx/gr_gr_cog/tr.d037:trMA.Ode9C12.ode	@ltx/gr_gr_cog/miscellanea:misc.Ode9
ltx/gr_gr_cog/tr.d037:trMA.Ode9C12.text	Ἄκαρπος ἐδείχθην συκῇ, μόνην τὴν κακίαν γεωργῶν ὁ ἄθλιος, τὸ πῦρ μοι προξενοῦσαν. Σὺ οὖν Κύριε καρποφόρον με δεῖξον, πράξεις ἀγαθὰς καρποφοροῦντά σοι.
ltx/gr_gr_cog/tr.d037:trMA.Ode9C13.incipit	Νήστευσον ψυχή μου, κακίας καὶ…
ltx/gr_gr_cog/tr.d037:trMA.Ode9C13.melody	@ltx/gr_gr_cog/he.h.m8:heHE.TonProdilothenta.name
ltx/gr_gr_cog/tr.d037:trMA.Ode9C13.mode	@ltx/gr_gr_cog/miscellanea:misc.Mode8
ltx/gr_gr_cog/tr.d037:trMA.Ode9C13.ode	@ltx/gr_gr_cog/miscellanea:misc.Ode9
ltx/gr_gr_cog/tr.d037:trMA.Ode9C13.text	Νήστευσον ψυχή μου, κακίας καὶ πονηρίας, κράτησον ὀργῆς, καὶ θυμοῦ καὶ πάσης ἁμαρτίας. Ἰησοῦς γὰρ τοιαύτην θέλει νηστείαν, ὁ φιλανθρωπότατος Θεὸς ἡμῶν.
ltx/gr_gr_cog/tr.d037:trMA.Ode9C1T.incipit	Σὺ εἶ Θεοτόκε, τὰ ὅπλα…
ltx/gr_gr_cog/tr.d037:trMA.Ode9C1T.melody	@ltx/gr_gr_cog/he.h.m8:heHE.TonProdilothenta.name
ltx/gr_gr_cog/tr.d037:trMA.Ode9C1T.mode	@ltx/gr_gr_cog/miscellanea:misc.Mode8
ltx/gr_gr_cog/tr.d037:trMA.Ode9C1T.ode	@ltx/gr_gr_cog/miscellanea:misc.Ode9
ltx/gr_gr_cog/tr.d037:trMA.Ode9C1T.text	Σὺ εἶ Θεοτόκε, τὰ ὅπλα ἡμῶν καὶ τεῖχος, σὺ εἶ ἡ ἀντίληψις, τῶν εἰς σὲ προστρεχόντων, σὲ καὶ νῦν εἰς πρεσβείαν κινοῦμεν, ἵνα λυτρωθῶμεν τῶν ἐχθρῶν ἡμῶν.
ltx/gr_gr_cog/tr.d037:trMA.Ode9C21.greekmelody	@ltx/gr_gr_cog/he.h.m8:heHE.MegalynomenSeTinPanamomon.greekname
ltx/gr_gr_cog/tr.d037:trMA.Ode9C21.incipit	Καθαρὰν νηστείαν, τῶν κακῶν τὴν…
ltx/gr_gr_cog/tr.d037:trMA.Ode9C21.melody	@ltx/gr_gr_cog/he.h.m8:heHE.MegalynomenSeTinPanamomon.name
ltx/gr_gr_cog/tr.d037:trMA.Ode9C21.mode	@ltx/gr_gr_cog/miscellanea:misc.Mode8
ltx/gr_gr_cog/tr.d037:trMA.Ode9C21.ode	@ltx/gr_gr_cog/miscellanea:misc.Ode9
ltx/gr_gr_cog/tr.d037:trMA.Ode9C21.text	Καθαρὰν νηστείαν, τῶν κακῶν τὴν ἀποχήν, προσενέγκωμεν, ὡς δῶρα εὐπρόσδεκτα, Χριστῷ τῷ Θεῷ ἡμῶν.
ltx/gr_gr_cog/tr.d037:trMA.Ode9C22.incipit	Ἐλισσαῖος πάλαι, πῶς διέτρεφε Προφήτας…
ltx/gr_gr_cog/tr.d037:trMA.Ode9C22.melody	@ltx/gr_gr_cog/he.h.m8:heHE.MegalynomenSeTinPanamomon.name
ltx/gr_gr_cog/tr.d037:trMA.Ode9C22.mode	@ltx/gr_gr_cog/miscellanea:misc.Mode8
ltx/gr_gr_cog/tr.d037:trMA.Ode9C22.ode	@ltx/gr_gr_cog/miscellanea:misc.Ode9
ltx/gr_gr_cog/tr.d037:trMA.Ode9C22.text	Ἐλισσαῖος πάλαι, πῶς διέτρεφε Προφήτας, μαθοῦσα ψυχή, σχεδίως ἐκτράφηθι, ἀπευχαριστοῦσα Χριστῷ.
ltx/gr_gr_cog/tr.d037:trMA.Ode9C2A1.incipit	Δανιὴλ τοὺς θῆρας, ἐν τῷ…
ltx/gr_gr_cog/tr.d037:trMA.Ode9C2A1.melody	@ltx/gr_gr_cog/he.h.m8:heHE.MegalynomenSeTinPanamomon.name
ltx/gr_gr_cog/tr.d037:trMA.Ode9C2A1.mode	@ltx/gr_gr_cog/miscellanea:misc.Mode8
ltx/gr_gr_cog/tr.d037:trMA.Ode9C2A1.ode	@ltx/gr_gr_cog/miscellanea:misc.Ode9
ltx/gr_gr_cog/tr.d037:trMA.Ode9C2A1.text	Δανιὴλ τοὺς θῆρας, ἐν τῷ λάκκῳ ἡμεροῖ, ἐγκρατείας κημῷ· καὶ ἡμεῖς δαμάσωμεν, τὰ πάθη νηστεύοντες.
ltx/gr_gr_cog/tr.d037:trMA.Ode9C2H.greekmelody	@ltx/gr_gr_cog/he.h.m8:heHE.MegalynomenSeTinPanamomon.greekname
ltx/gr_gr_cog/tr.d037:trMA.Ode9C2H.incipit	@ltx/gr_gr_cog/he.h.m8:heHE.MegalynomenSeTinPanamomon.incipit
ltx/gr_gr_cog/tr.d037:trMA.Ode9C2H.melody	@ltx/gr_gr_cog/he.h.m8:heHE.MegalynomenSeTinPanamomon.melody
ltx/gr_gr_cog/tr.d037:trMA.Ode9C2H.mode	@ltx/gr_gr_cog/miscellanea:misc.Mode8
ltx/gr_gr_cog/tr.d037:trMA.Ode9C2H.ode	@ltx/gr_gr_cog/miscellanea:misc.Ode9
ltx/gr_gr_cog/tr.d037:trMA.Ode9C2H.text	@ltx/gr_gr_cog/he.h.m8:heHE.MegalynomenSeTinPanamomon.text
ltx/gr_gr_cog/tr.d037:trMA.Ode9C2T.incipit	Θεομῆτορ Κόρη, ἡ παστὰς τοῦ…
ltx/gr_gr_cog/tr.d037:trMA.Ode9C2T.melody	@ltx/gr_gr_cog/he.h.m8:heHE.MegalynomenSeTinPanamomon.name
ltx/gr_gr_cog/tr.d037:trMA.Ode9C2T.mode	@ltx/gr_gr_cog/miscellanea:misc.Mode8
ltx/gr_gr_cog/tr.d037:trMA.Ode9C2T.ode	@ltx/gr_gr_cog/miscellanea:misc.Ode9
ltx/gr_gr_cog/tr.d037:trMA.Ode9C2T.text	Θεομῆτορ Κόρη, ἡ παστὰς τοῦ οὐρανίου, Βασιλέως Χριστοῦ, σῷζε τῇ πρεσβείᾳ σου, τοὺς πόθῳ ὑμνοῦντάς σε.
ltx/gr_gr_cog/tr.d037:trMA.Ode9C2Tr.incipit	Τρισσουμένην μίαν, σὲ Θεότης ἀνυμνῶ…
ltx/gr_gr_cog/tr.d037:trMA.Ode9C2Tr.melody	@ltx/gr_gr_cog/he.h.m8:heHE.MegalynomenSeTinPanamomon.name
ltx/gr_gr_cog/tr.d037:trMA.Ode9C2Tr.mode	@ltx/gr_gr_cog/miscellanea:misc.Mode8
ltx/gr_gr_cog/tr.d037:trMA.Ode9C2Tr.ode	@ltx/gr_gr_cog/miscellanea:misc.Ode9
ltx/gr_gr_cog/tr.d037:trMA.Ode9C2Tr.text	Τρισσουμένην μίαν, σὲ Θεότης ἀνυμνῶ, τοῖς προσώποις μορφήν, Πατέρα τὸν ἄναρχον, Υἱόν, καὶ Πνεῦμα τὸ ζῶν.
ltx/gr_gr_cog/tr.d037:trTE.Troparion.incipit	Ὅτι ἀσθενεῖς ἡμεῖς, καὶ παρειμένοι…
ltx/gr_gr_cog/tr.d037:trTE.Troparion.melody	
ltx/gr_gr_cog/tr.d037:trTE.Troparion.mode	@ltx/gr_gr_cog/miscellanea:misc.Mode4
ltx/gr_gr_cog/tr.d037:trTE.Troparion.text	Ὅτι ἀσθενεῖς ἡμεῖς, καὶ παρειμένοι ταῖς ἁμαρτίαις, ἴασαι τὰ συντρίμματα ἡμῶν, ὁ ἰατρὸς τῶν ψυχῶν ἡμῶν, ὁ ἐπιστάμενος τὸν νοῦν τῶν ἀνθρώπων, Φιλάνθρωπε.
ltx/gr_gr_cog/tr.d037:trTE.Troparion2.incipit	ὁ ἐπιστάμενος τὸν νοῦν τῶν…
ltx/gr_gr_cog/tr.d037:trTE.Troparion2.text	ὁ ἐπιστάμενος τὸν νοῦν τῶν ἀνθρώπων, Φιλάνθρωπε.
ltx/gr_gr_cog/tr.d037:trVE.AposIdiomelon1.incipit	Χαλινοὺς ἀποπτύσας…
ltx/gr_gr_cog/tr.d037:trVE.AposIdiomelon1.melody	@ltx/gr_gr_cog/miscellanea:misc.Idiomelon
ltx/gr_gr_cog/tr.d037:trVE.AposIdiomelon1.mode	@ltx/gr_gr_cog/miscellanea:misc.Mode8
ltx/gr_gr_cog/tr.d037:trVE.AposIdiomelon1.text	Χαλινοὺς ἀποπτύσας τοὺς πατρικούς, ἀστάτῳ φρενί, τοῖς κτηνώδεσι τῆς ἁμαρτίας, λογισμοῖς συνέζησα, ὅλον μου τὸν βίον δαπανήσας ἀσώτως, ὁ τάλας ἐγώ· τροφῆς δὲ λειπόμενος, βεβαιούσης καρδίαν, πρὸς καιρὸν λιπαίνουσαν, ἡδονὴν ἐσιτούμην. Ἀλλὰ Πάτερ ἀγαθέ, μὴ κλείσῃς μοι τὰ φιλάνθρωπα σπλάγχνα, ἀλλʼ ἀνοίξας δέξαι με, ὡς τὸν Ἄσωτον Υἱόν, καὶ σῶσόν με.
ltx/gr_gr_cog/tr.d037:trVE.AposMartyric.incipit	@ltx/gr_gr_cog/oc.m8.d2:ocVE.Aposticha3.incipit
ltx/gr_gr_cog/tr.d037:trVE.AposMartyric.melody	
ltx/gr_gr_cog/tr.d037:trVE.AposMartyric.mode	@ltx/gr_gr_cog/miscellanea:misc.Mode8
ltx/gr_gr_cog/tr.d037:trVE.AposMartyric.text	@ltx/gr_gr_cog/oc.m8.d2:ocVE.Aposticha3.text
ltx/gr_gr_cog/tr.d037:trVE.AposTheotokion.incipit	Τὰ οὐράνια ὑμνεῖ σε…
ltx/gr_gr_cog/tr.d037:trVE.AposTheotokion.melody	
ltx/gr_gr_cog/tr.d037:trVE.AposTheotokion.mode	@ltx/gr_gr_cog/miscellanea:misc.Mode8
ltx/gr_gr_cog/tr.d037:trVE.AposTheotokion.text	Τὰ οὐράνια ὑμνεῖ σε, κεχαριτωμένη Μῆτερ ἀνύμφευτε, καὶ ἡμεῖς δοξολογοῦμεν, τὴν ἀνεξιχνίαστόν σου γέννησιν. Θεοτόκε πρέσβευε, σωθῆναι τὰς ψυχὰς ἡμῶν.
ltx/gr_gr_cog/tr.d037:trVE.Stichera01.incipit	Ἀμέτρητά σοι πταίσας…
ltx/gr_gr_cog/tr.d037:trVE.Stichera01.melody	Ἀμέτρητος ὑπάρχει.
ltx/gr_gr_cog/tr.d037:trVE.Stichera01.mode	@ltx/gr_gr_cog/miscellanea:misc.Mode8
ltx/gr_gr_cog/tr.d037:trVE.Stichera01.poet	@ltx/gr_gr_cog/poets:po.Iosif
ltx/gr_gr_cog/tr.d037:trVE.Stichera01.text	Ἀμέτρητά σοι πταίσας, ἀμετρήτους κολάσεις ἐκδέχομαι, βρυγμὸν ὀδόντων, καὶ κλαυθμὸν ἀπαράκλητον, γέενναν πυρός, καὶ σκότος καὶ τάρταρον. Κριτὰ δικαιότατε, δάκρυα οὖν μοι δώρησαι, διʼ ὧν εὕρω τὴν ἄφεσιν, καὶ κακῶν μου τὴν λύσιν, νηστεύων καὶ κράζων σοι· Δέσποτα Χριστέ, οἰκτείρησόν με, διὰ μέγα καὶ πλούσιον ἔλεος.
ltx/gr_gr_cog/tr.d037:trVE.Stichera02.incipit	Ἐμὲ τὸν πλανηθέντα…
ltx/gr_gr_cog/tr.d037:trVE.Stichera02.melody	Ἀμέτρητος ὑπάρχει.
ltx/gr_gr_cog/tr.d037:trVE.Stichera02.mode	@ltx/gr_gr_cog/miscellanea:misc.Mode8
ltx/gr_gr_cog/tr.d037:trVE.Stichera02.text	Ἐμὲ τὸν πλανηθέντα, ἐπὶ ὄρη δεινῶν παραβάσεων, ζήτησον Λόγε, καὶ πρὸς σὲ ἀνακάλεσαι, ἤθη πονηρὰ ἐκ τῆς διανοίας μου, μακρὰν ἀπωθούμενος, θνήξαντα πάλιν ζώωσον, καὶ νηστείᾳ καθάρισον, ἐν κλαυθμῷ διηνεκεῖ, βοῶντα καὶ λέγοντα· Δέσποτα Χριστέ, οἰκτείρησόν με, διὰ μέγα καὶ πλούσιον ἔλεος.
ltx/gr_gr_cog/tr.d037:trVE.Stichera03.incipit	Νηστείας ἐναρξάμενοι…
ltx/gr_gr_cog/tr.d037:trVE.Stichera03.melody	Τὴν ἔνδοξον.
ltx/gr_gr_cog/tr.d037:trVE.Stichera03.mode	@ltx/gr_gr_cog/miscellanea:misc.Mode8
ltx/gr_gr_cog/tr.d037:trVE.Stichera03.poet	@ltx/gr_gr_cog/poets:po.Theodorou
ltx/gr_gr_cog/tr.d037:trVE.Stichera03.text	Νηστείας ἐναρξάμενοι, Ἑβδομάδος τῆς τρίτης, τὴν Τριάδα τὴν σεπτήν, εὐφημήσωμεν οἱ πιστοί, τὸ ἑξῆς περιχαρῶς διανύοντες, τῆς σαρκὸς δὲ τὰ πάθη ἀπομαράναντες, ἐκ ψυχῆς ἡμῶν, ἄνθη θεῖα δρεψώμεθα, στεφάνους πλεξάμενοι τῆς κυρίας τῶν ἡμερῶν, ἵνα πάντες τὸν Χριστόν, ὡς νικητήν, στεφανηφοροῦντες ἀνυμνήσωμεν.
