ltx/gr_gr_cog/sy.m07.d20:cl.syMA.commemoration01.text	[saint/com 1]
ltx/gr_gr_cog/sy.m07.d20:cl.syMA.commemoration02.text	[saint/com 2]
ltx/gr_gr_cog/sy.m07.d20:cl.syMA.commemoration03.text	[saint/com 3]
ltx/gr_gr_cog/sy.m07.d20:cl.syMA.commemoration04.text	[saint/com 4]
ltx/gr_gr_cog/sy.m07.d20:cl.syMA.commemoration05.text	[saint/com 5]
ltx/gr_gr_cog/sy.m07.d20:cl.syMA.commemoration06.text	[saint/com list]
ltx/gr_gr_cog/sy.m07.d20:syMA.commemoration01.couplet1.title	@ltx/gr_gr_cog/titles:ti.Verses
ltx/gr_gr_cog/sy.m07.d20:syMA.commemoration01.couplet1.verse1	Ἐπέσχεν ὄμβρον, πῦρ τρίτον φέρων κάτω·
ltx/gr_gr_cog/sy.m07.d20:syMA.commemoration01.couplet1.verse2	Σχίζει δὲ ῥεῖθρον Ἠλίας τρέχων ἄνω.
ltx/gr_gr_cog/sy.m07.d20:syMA.commemoration01.narration.p01	Ὃς ἦν υἱὸς Σωβάκ, ἐκ Θέσβης, ἐκ γῆς Ἀράβων, ἐκ φυλῆς Ἀαρών, οἰκῶν ἐν Γαλαάδ· ὅτι ἡ Θέσβη δόμα ἦν τοῖς Ἱερεῦσι δεδομένη. Καὶ ὅτε ἔτεκεν αὐτὸν ἡ μήτηρ αὐτοῦ, εἶδε Σωβὰκ ὁ πατὴρ αὐτοῦ, ὅτι ἄνδρες λευκοφανεῖς αὐτὸν προσηγόρευον καὶ ὅτι ἐν πυρὶ αὐτὸν ἐσπαργάνουν καὶ φλόγα πυρὸς ἐδίδουν αὐτῷ φαγεῖν. Καὶ ἐλθὼν εἰς Ἱερουσαλήμ, ἀπήγγειλε τοῖς Ἱερεῦσι καὶ εἶπεν αὐτῷ ὁ χρηματισμός· Μὴ δειλιάσῃς ἄνθρωπε· ἔσται γὰρ ἡ οἴκησις τοῦ παιδίου φῶς, καὶ ὁ λόγος αὐτοῦ ἀπόφασις καὶ ἡ ζωὴ αὐτοῦ κατὰ Κύριον καὶ ὁ ζῆλος αὐτοῦ εὐάρεστος τῷ Κυρίῳ· καὶ κρινεῖ τὸν Ἰσραὴλ ἐν ῥομφαίᾳ καὶ πυρί.
ltx/gr_gr_cog/sy.m07.d20:syMA.commemoration01.narration.p02	Οὗτος οὖν προεφήτευσεν ἔτη εἰκοσιπέντε· προέλαβε δὲ τὴν ἔλευσιν τοῦ Χριστοῦ ἔτη ὀκτακόσια ἓξ καὶ δέκα. Οὗτός ἐστιν Ἠλίας, ὁ πῦρ ἐξ οὐρανοῦ τρίτον κατενέγκας καὶ τὸν ὑετὸν τῇ ἰδίᾳ γλώττῃ βαστάσας καὶ νεκροὺς ἐγείρας καὶ πεντήκοντα δισσοὺς καταφλέξας καὶ ἐν τῷ Χωρὴβ ὄρει τὸν Θεὸν ἰδών, ὡς ἀνθρώπῳ δυνατὸν ἦν ἰδεῖν· καὶ τὸν Ἰορδάνην τῇ μηλωτῇ σχίσας καὶ εἰς οὐρανοὺς ἐν ἅρματι πυρὸς ἀναληφθεὶς καὶ ἐν τῇ Μεταμορφώσει μετὰ Μωσέως τῷ Χριστῷ παραστάς.
ltx/gr_gr_cog/sy.m07.d20:syMA.commemoration01.single1	Δίφρῳ ἀνηρπάγης περὶ εἰκάδα Ἠλία ἱππεῦ.
ltx/gr_gr_cog/sy.m07.d20:syMA.commemoration01.text	Τῇ Κʹ τοῦ αὐτοῦ μηνός, μνήμη τῆς εἰς οὐρανοὺς πυρφόρου ἀναβάσεως τοῦ Ἁγίου ἐνδόξου Προφήτου Ἠλιοὺ τοῦ Θεσβίτου.
ltx/gr_gr_cog/sy.m07.d20:syMA.lastline	Ταῖς αὐτοῦ ἁγίαις πρεσβείαις, ὁ Θεός, ἐλέησον ἡμᾶς. Ἀμήν.
