ltx/gr_gr_cog/le.ep.me.m05.d07:lemeLI.Epistle.book_abbr	@ltx/gr_gr_cog/le.ep.me.m05.d21:lemeLI.Epistle.book_abbr
ltx/gr_gr_cog/le.ep.me.m05.d07:lemeLI.Epistle.book_string	@ltx/gr_gr_cog/le.ep.me.m05.d21:lemeLI.Epistle.book_string
ltx/gr_gr_cog/le.ep.me.m05.d07:lemeLI.Epistle.chapverse	@ltx/gr_gr_cog/le.ep.me.m05.d21:lemeLI.Epistle.chapverse
ltx/gr_gr_cog/le.ep.me.m05.d07:lemeLI.Epistle.incipit	@ltx/gr_gr_cog/le.ep.me.m05.d21:lemeLI.Epistle.incipit
ltx/gr_gr_cog/le.ep.me.m05.d07:lemeLI.Epistle.text	@ltx/gr_gr_cog/le.ep.me.m05.d21:lemeLI.Epistle.text
ltx/gr_gr_cog/le.ep.me.m05.d07:lemeLI.Epistle.title	Τοῦ Σταυροῦ
ltx/gr_gr_cog/le.ep.me.m05.d07:lemeLI.Epistle.title_abbr	Τοῦ Σταυροῦ
ltx/gr_gr_cog/le.ep.me.m05.d07:lemeLI.Epistle.version	@ltx/gr_gr_cog/le.ep.me.m05.d21:lemeLI.Epistle.version
