ltx/gr_gr_cog/da.d4:daCommemoration.text	Τῆς Θεοτόκου.
ltx/gr_gr_cog/da.d4:daDay.text	Τετάρτη.
ltx/gr_gr_cog/da.d4:daForDay.text	διὰ τὴν Τετάρτην,
ltx/gr_gr_cog/da.d4:daLI.MM.CommunionHymn.text	@ltx/gr_gr_cog/properties:media.key
ltx/gr_gr_cog/da.d4:daMA.ExapTheotokion1.greekmelody	@ltx/gr_gr_cog/he.a.m2:heAU.GynaikesAkoutisthite.greekname
ltx/gr_gr_cog/da.d4:daMA.ExapTheotokion1.incipit	Παρισταμένη Πάναγνε…
ltx/gr_gr_cog/da.d4:daMA.ExapTheotokion1.melody	@ltx/gr_gr_cog/he.a.m2:heAU.GynaikesAkoutisthite.name
ltx/gr_gr_cog/da.d4:daMA.ExapTheotokion1.mode	@ltx/gr_gr_cog/miscellanea:misc.Mode2
ltx/gr_gr_cog/da.d4:daMA.ExapTheotokion1.text	Παρισταμένη Πάναγνε, ἐν τῷ Σταυρῷ καὶ βλέπουσα, τὸν σὸν Υἱὸν ἐπὶ ξύλου, ταθέντα καὶ νεκρωθέντα, ὥς περ μήτηρ ὠλόλυζες, δακρύουσα καὶ λέγουσα· Τί τοῦτο τὸ παράδοξον, ὅτι ὁ Κτίστης τοῦ κόσμου, σταυρῷ ταθῆναι ἠνέσχου;
ltx/gr_gr_cog/da.d4:daMA.ExapTheotokion2.greekmelody	@ltx/gr_gr_cog/he.a.m3:heAU.OOuranonToisAstrois.greekname
ltx/gr_gr_cog/da.d4:daMA.ExapTheotokion2.incipit	Τοὺς τὸν Σταυρὸν καὶ τὰ…
ltx/gr_gr_cog/da.d4:daMA.ExapTheotokion2.melody	@ltx/gr_gr_cog/he.a.m3:heAU.OOuranonToisAstrois.name
ltx/gr_gr_cog/da.d4:daMA.ExapTheotokion2.mode	@ltx/gr_gr_cog/miscellanea:misc.Mode3
ltx/gr_gr_cog/da.d4:daMA.ExapTheotokion2.text	Τοὺς τὸν Σταυρὸν καὶ τὰ πάθη, τοῦ σοῦ Υἱοῦ Θεοτόκε, ἐν ἀδιστάκτῳ καρδίᾳ, πανευλαβῶς προσκυνοῦντας, τοῦ Παραδείσου πολίτας, καὶ δόξης μετόχους δεῖξον.
ltx/gr_gr_cog/da.d4:daMA.Exaposteilarion1.greekmelody	@ltx/gr_gr_cog/he.a.m2:heAU.GynaikesAkoutisthite.greekname
ltx/gr_gr_cog/da.d4:daMA.Exaposteilarion1.incipit	Τὸ ὅπλον τὸ ἀήττητον, τὸ…
ltx/gr_gr_cog/da.d4:daMA.Exaposteilarion1.melody	@ltx/gr_gr_cog/he.a.m2:heAU.GynaikesAkoutisthite.name
ltx/gr_gr_cog/da.d4:daMA.Exaposteilarion1.mode	@ltx/gr_gr_cog/miscellanea:misc.Mode2
ltx/gr_gr_cog/da.d4:daMA.Exaposteilarion1.text	Τὸ ὅπλον τὸ ἀήττητον, τὸ στήριγμα τῆς πίστεως, Σταυρὸν τὸν θεῖον ὑμνοῦμεν, καὶ προσκυνοῦμεν ἐν πίστει, τὸ μέγα καταφύγιον, Χριστιανῶν τὸ καύχημα, τῶν Ὀρθοδόξων φύλακα, τῶν Ἀθλοφόρων τὸ κλέος, ἀξίως σε εὐφημοῦμεν.
ltx/gr_gr_cog/da.d4:daMA.Exaposteilarion2.greekmelody	@ltx/gr_gr_cog/he.a.m3:heAU.OOuranonToisAstrois.greekname
ltx/gr_gr_cog/da.d4:daMA.Exaposteilarion2.incipit	Σταυρὲ Χριστοῦ μου τὸ ὅπλον…
ltx/gr_gr_cog/da.d4:daMA.Exaposteilarion2.melody	@ltx/gr_gr_cog/he.a.m3:heAU.OOuranonToisAstrois.name
ltx/gr_gr_cog/da.d4:daMA.Exaposteilarion2.mode	@ltx/gr_gr_cog/miscellanea:misc.Mode3
ltx/gr_gr_cog/da.d4:daMA.Exaposteilarion2.text	Σταυρὲ Χριστοῦ μου τὸ ὅπλον, τὸ μέγα τῶν ὀρθοδόξων, τῶν βασιλέων τὸ νῖκος, καὶ τῶν δαιμόνων ἡ πτῶσις, τοὺς προσκυνοῦντάς σε πόθῳ, φρούρει καὶ δίδου σὴν χάριν.
ltx/gr_gr_cog/da.d4:daMA.Photagogic1Beginning.text	Δυνάμει τοῦ Σταυροῦ σου, Κύριε,
ltx/gr_gr_cog/da.d4:daMA.Photagogic1Ending.text	δυνάμει τοῦ Σταυροῦ σου, καὶ σῶσόν με.
ltx/gr_gr_cog/da.d4:daMA.Photagogic2Beginning.text	@ltx/gr_gr_cog/prayers:pr.photagogic_begin_Saints.text
ltx/gr_gr_cog/da.d4:daMA.Photagogic2Ending.text	@ltx/gr_gr_cog/prayers:pr.photagogic_end_Saints.text
ltx/gr_gr_cog/da.d4:daMA.Photagogic3Beginning.text	@ltx/gr_gr_cog/prayers:pr.photagogic_begin_Theotokos.text
ltx/gr_gr_cog/da.d4:daMA.Photagogic3Ending.text	@ltx/gr_gr_cog/prayers:pr.photagogic_end_Theotokos.text
ltx/gr_gr_cog/da.d4:daMA.Triadic1Ending.text	Δυνάμει τοῦ Σταυροῦ σου σῶσον ἡμᾶς.
ltx/gr_gr_cog/da.d4:daMA.Triadic2Ending.text	@ltx/gr_gr_cog/prayers:pr.triadic_end_Saints.text
ltx/gr_gr_cog/da.d4:daMA.Triadic3Ending.text	@ltx/gr_gr_cog/prayers:pr.triadic_end_Theotokos.text
ltx/gr_gr_cog/da.d4:daOnDay.text	τῇ Τετάρτῃ
ltx/gr_gr_cog/da.d4:daVE.ApolTheotokion.incipit	@ltx/gr_gr_cog/oc.m1.d4:ocVE.ApolTheotokionVM.incipit
ltx/gr_gr_cog/da.d4:daVE.ApolTheotokion.melody	
ltx/gr_gr_cog/da.d4:daVE.ApolTheotokion.mode	@ltx/gr_gr_cog/miscellanea:misc.Mode1
ltx/gr_gr_cog/da.d4:daVE.ApolTheotokion.text	@ltx/gr_gr_cog/oc.m1.d4:ocVE.ApolTheotokionVM.text
ltx/gr_gr_cog/da.d4:daVE.Apolytikion1.incipit	@ltx/gr_gr_cog/me.m09.d14:meVE.Apolytikion1.incipit
ltx/gr_gr_cog/da.d4:daVE.Apolytikion1.melody	
ltx/gr_gr_cog/da.d4:daVE.Apolytikion1.mode	@ltx/gr_gr_cog/miscellanea:misc.Mode1
ltx/gr_gr_cog/da.d4:daVE.Apolytikion1.text	@ltx/gr_gr_cog/me.m09.d14:meVE.Apolytikion1.text
ltx/gr_gr_cog/da.d4:daVE.OnTheDayBefore.text	τῇ Τρίτῃ,
ltx/gr_gr_cog/da.d4:daVE.OnTheEveningBefore.text	@ltx/gr_gr_cog/template.titles:d.onTuesdayEvening
