ltx/gr_gr_cog/le.ep.mc.d239:lemcLI.Epistle.book_abbr	@ltx/gr_gr_cog/bible:Corinthians2.abbr
ltx/gr_gr_cog/le.ep.mc.d239:lemcLI.Epistle.book_string	@ltx/gr_gr_cog/bible:Corinthians2.text
ltx/gr_gr_cog/le.ep.mc.d239:lemcLI.Epistle.chapverse	6:16 – 7:1
ltx/gr_gr_cog/le.ep.mc.d239:lemcLI.Epistle.incipit	Ὑμεῖς ἐστε ναὸς Θεοῦ ζῶντος…
ltx/gr_gr_cog/le.ep.mc.d239:lemcLI.Epistle.text	Ἀδελφοί, ὑμεῖς ἐστε ναὸς Θεοῦ ζῶντος, καθὼς εἶπεν ὁ Θεὸς ὅτι ἐνοικήσω ἐν αὐτοῖς καὶ ἐμπεριπατήσω, καὶ ἔσομαι αὐτῶν Θεός, καὶ αὐτοὶ ἔσονταί μοι λαός. διὸ ἐξέλθατε ἐκ μέσου αὐτῶν καὶ ἀφορίσθητε, λέγει Κύριος, καὶ ἀκαθάρτου μὴ ἅπτεσθε, κἀγὼ εἰσδέξομαι ὑμᾶς, καὶ ἔσομαι ὑμῖν εἰς πατέρα, καὶ ὑμεῖς ἔσεσθέ μοι εἰς υἱοὺς καὶ θυγατέρας, λέγει Κύριος παντοκράτωρ. Ταύτας οὖν ἔχοντες τὰς ἐπαγγελίας, ἀγαπητοί, καθαρίσωμεν ἑαυτοὺς ἀπὸ παντὸς μολυσμοῦ σαρκὸς καὶ πνεύματος, ἐπιτελοῦντες ἁγιωσύνην ἐν φόβῳ Θεοῦ.
ltx/gr_gr_cog/le.ep.mc.d239:lemcLI.Epistle.title	Κυριακῇ Δεκάτῃ Ἑβδόμῃ
ltx/gr_gr_cog/le.ep.mc.d239:lemcLI.Epistle.title_abbr	Κυριακῇ ΙΖʹ
ltx/gr_gr_cog/le.ep.mc.d239:lemcLI.Epistle.version	@ltx/gr_gr_cog/properties:version.designation
