ltx/gr_gr_cog/le.go.lu.d072:leluLI.Gospel.book_abbr	@ltx/gr_gr_cog/bible:Luke.abbr
ltx/gr_gr_cog/le.go.lu.d072:leluLI.Gospel.book_string	@ltx/gr_gr_cog/bible:Luke.text
ltx/gr_gr_cog/le.go.lu.d072:leluLI.Gospel.chapverse	19:45 – 48
ltx/gr_gr_cog/le.go.lu.d072:leluLI.Gospel.incipit	Εἰσελθὼν ὁ Ἰησοῦς εἰς τὸ ἱερὸν ἤρξατο ἐκβάλλειν…
ltx/gr_gr_cog/le.go.lu.d072:leluLI.Gospel.text	Τῷ καιρῷ ἐκείνῳ, εἰσελθὼν ὁ Ἰησοῦς εἰς τὸ ἱερὸν ἤρξατο ἐκβάλλειν τοὺς πωλοῦντας ἐν αὐτῷ καὶ ἀγοράζοντας λέγων αὐτοῖς· γέγραπται ὅτι ὁ οἶκός μου οἶκος προσευχῆς ἐστιν· ὑμεῖς δὲ αὐτὸν ἐποιήσατε σπήλαιον λῃστῶν. Καὶ ἦν διδάσκων τὸ καθ᾿ ἡμέραν ἐν τῷ ἱερῷ· οἱ δὲ ἀρχιερεῖς καὶ οἱ γραμματεῖς ἐζήτουν αὐτὸν ἀπολέσαι καὶ οἱ πρῶτοι τοῦ λαοῦ, καὶ οὐχ εὕρισκον τὸ τί ποιήσουσιν· ὁ λαὸς γὰρ ἅπας ἐξεκρέματο αὐτοῦ ἀκούων.
ltx/gr_gr_cog/le.go.lu.d072:leluLI.Gospel.title	Τῇ Τρίτῃ τῆς ΙΑʹ Ἑβδομάδος τοῦ Λουκᾶ
ltx/gr_gr_cog/le.go.lu.d072:leluLI.Gospel.title_abbr	Τῇ Τρίτῃ τῆς ΙΑʹ Ἑβδομάδος τοῦ Λουκᾶ
ltx/gr_gr_cog/le.go.lu.d072:leluLI.Gospel.version	@ltx/gr_gr_cog/properties:version.designation
