ltx/gr_gr_cog/le.ep.mc.d296:lemcLI.Epistle.book_abbr	@ltx/gr_gr_cog/bible:Timothy1.abbr
ltx/gr_gr_cog/le.ep.mc.d296:lemcLI.Epistle.book_string	@ltx/gr_gr_cog/bible:Timothy1.text
ltx/gr_gr_cog/le.ep.mc.d296:lemcLI.Epistle.chapverse	1:1 – 7
ltx/gr_gr_cog/le.ep.mc.d296:lemcLI.Epistle.incipit	Παῦλος, ἀπόστολος Ἰησοῦ Χριστοῦ κατ᾽ ἐπιταγὴν Θεοῦ…
ltx/gr_gr_cog/le.ep.mc.d296:lemcLI.Epistle.text	Παῦλος, ἀπόστολος Ἰησοῦ Χριστοῦ κατ᾽ ἐπιταγὴν Θεοῦ σωτῆρος ἡμῶν καὶ Κυρίου Ἰησοῦ Χριστοῦ τῆς ἐλπίδος ἡμῶν, Τιμοθέῳ γνησίῳ τέκνῳ ἐν πίστει· χάρις, ἔλεος, εἰρήνη ἀπὸ Θεοῦ πατρὸς ἡμῶν καὶ Χριστοῦ Ἰησοῦ τοῦ Κυρίου ἡμῶν. Καθὼς παρεκάλεσά σε προσμεῖναι ἐν Ἐφέσῳ, πορευόμενος εἰς Μακεδονίαν, ἵνα παραγγείλῃς τισὶ μὴ ἑτεροδιδασκαλεῖν μηδὲ προσέχειν μύθοις καὶ γενεαλογίαις ἀπεράντοις, αἵτινες ζητήσεις παρέχουσι μᾶλλον ἢ οἰκονομίαν Θεοῦ τὴν ἐν πίστει· τὸ δὲ τέλος τῆς παραγγελίας ἐστὶν ἀγάπη ἐκ καθαρᾶς καρδίας καὶ συνειδήσεως ἀγαθῆς καὶ πίστεως ἀνυποκρίτου, ὧν τινες ἀστοχήσαντες ἐξετράπησαν εἰς ματαιολογίαν, θέλοντες εἶναι νομοδιδάσκαλοι, μὴ νοοῦντες μήτε ἃ λέγουσι μήτε περὶ τίνων διαβεβαιοῦνται.
ltx/gr_gr_cog/le.ep.mc.d296:lemcLI.Epistle.title	Τῇ Δευτέρᾳ τῆς ΚϚʹ Ἑβδομάδος
ltx/gr_gr_cog/le.ep.mc.d296:lemcLI.Epistle.title_abbr	Δευτέρᾳ τῆς ΚϚʹ Ἑβδομάδος
ltx/gr_gr_cog/le.ep.mc.d296:lemcLI.Epistle.version	@ltx/gr_gr_cog/properties:version.designation
