ltx/gr_gr_cog/le.ep.mc.d271:lemcLI.Epistle.book_abbr	@ltx/gr_gr_cog/bible:Colossians.abbr
ltx/gr_gr_cog/le.ep.mc.d271:lemcLI.Epistle.book_string	@ltx/gr_gr_cog/bible:Colossians.text
ltx/gr_gr_cog/le.ep.mc.d271:lemcLI.Epistle.chapverse	4:2 – 9
ltx/gr_gr_cog/le.ep.mc.d271:lemcLI.Epistle.incipit	Τῇ προσευχῇ προσκαρτερεῖτε…
ltx/gr_gr_cog/le.ep.mc.d271:lemcLI.Epistle.text	Ἀδελφοί, τῇ προσευχῇ προσκαρτερεῖτε, γρηγοροῦντες ἐν αὐτῇ ἐν εὐχαριστίᾳ, προσευχόμενοι ἅμα καὶ περὶ ἡμῶν, ἵνα ὁ Θεὸς ἀνοίξῃ ἡμῖν θύραν τοῦ λόγου, λαλῆσαι τὸ μυστήριον τοῦ Χριστοῦ, δι᾽ ὃ καὶ δέδεμαι, ἵνα φανερώσω αὐτὸ ὡς δεῖ με λαλῆσαι. Ἐν σοφίᾳ περιπατεῖτε πρὸς τοὺς ἔξω, τὸν καιρὸν ἐξαγοραζόμενοι. ὁ λόγος ὑμῶν πάντοτε ἐν χάριτι, ἅλατι ἠρτυμένος, εἰδέναι πῶς δεῖ ὑμᾶς ἑνὶ ἑκάστῳ ἀποκρίνεσθαι. Τὰ κατ᾽ ἐμὲ πάντα γνωρίσει ὑμῖν Τυχικὸς ὁ ἀγαπητὸς ἀδελφὸς καὶ πιστὸς διάκονος καὶ σύνδουλος ἐν Κυρίῳ, ὃν ἔπεμψα πρὸς ὑμᾶς εἰς αὐτὸ τοῦτο, ἵνα γνῷ τὰ περὶ ὑμῶν καὶ παρακαλέσῃ τὰς καρδίας ὑμῶν, σὺν Ὀνησίμῳ τῷ πιστῷ καὶ ἀγαπητῷ ἀδελφῷ, ὅς ἐστιν ἐξ ὑμῶν· πάντα ὑμῖν γνωριοῦσι τὰ ᾧδε.
ltx/gr_gr_cog/le.ep.mc.d271:lemcLI.Epistle.title	Τῇ Πέμτῃ τῆς ΚΒʹ Ἑβδομάδος
ltx/gr_gr_cog/le.ep.mc.d271:lemcLI.Epistle.title_abbr	Πέμτῃ τῆς ΚΒʹ Ἑβδομάδος
ltx/gr_gr_cog/le.ep.mc.d271:lemcLI.Epistle.version	@ltx/gr_gr_cog/properties:version.designation
