ltx/gr_gr_cog/le.go.me.m09.d14:lemeLI.Gospel.book_abbr	@ltx/gr_gr_cog/bible:John.abbr
ltx/gr_gr_cog/le.go.me.m09.d14:lemeLI.Gospel.book_string	@ltx/gr_gr_cog/bible:John.text
ltx/gr_gr_cog/le.go.me.m09.d14:lemeLI.Gospel.chapverse	19:6 – 11, 13 – 20, 25 – 28, 30
ltx/gr_gr_cog/le.go.me.m09.d14:lemeLI.Gospel.incipit	Συμβούλιον ἐποίησαν οἱ ἀρχιερεῖς καὶ οἱ πρεσβύτεροι κατὰ τοῦ Ἰησοῦ…
ltx/gr_gr_cog/le.go.me.m09.d14:lemeLI.Gospel.text	Τῷ καιρῷ ἐκείνῳ, συμβούλιον ἐποίησαν οἱ ἀρχιερεῖς καὶ οἱ πρεσβύτεροι κατὰ τοῦ Ἰησοῦ ὅπως αὐτὸν ἀπολέσωσι. Καὶ παρεγένοντο πρὸς Πιλᾶτον λέγοντες· σταύρωσον σταύρωσον αὐτόν. λέγει αὐτοῖς ὁ Πιλᾶτος· λάβετε αὐτὸν ὑμεῖς καὶ σταυρώσατε· ἐγὼ γὰρ οὐχ εὑρίσκω ἐν αὐτῷ αἰτίαν. ἀπεκρίθησαν αὐτῷ οἱ Ἰουδαῖοι· ἡμεῖς νόμον ἔχομεν, καὶ κατὰ τὸν νόμον ἡμῶν ὀφείλει ἀποθανεῖν, ὅτι ἑαυτὸν Θεοῦ υἱὸν ἐποίησεν. Ὅτε οὖν ἤκουσεν ὁ Πιλᾶτος τοῦτον τὸν λόγον, μᾶλλον ἐφοβήθη, καὶ εἰσῆλθεν εἰς τὸ πραιτώριον πάλιν καὶ λέγει τῷ Ἰησοῦ· πόθεν εἶ σύ; ὁ δὲ Ἰησοῦς ἀπόκρισιν οὐκ ἔδωκεν αὐτῷ. λέγει οὖν αὐτῷ ὁ Πιλᾶτος· ἐμοὶ οὐ λαλεῖς; οὐκ οἶδας ὅτι ἐξουσίαν ἔχω σταυρῶσαί σε καὶ ἐξουσίαν ἔχω ἀπολῦσαί σε; ἀπεκρίθη Ἰησοῦς· οὐκ εἶχες ἐξουσίαν οὐδεμίαν κατ᾽ ἐμοῦ, εἰ μὴ ἦν σοι δεδομένον ἄνωθεν· διὰ τοῦτο ὁ παραδιδούς μέ σοι μείζονα ἁμαρτίαν ἔχει. ὁ οὖν Πιλᾶτος ἀκούσας τοῦτον τὸν λόγον ἤγαγεν ἔξω τὸν Ἰησοῦν, καὶ ἐκάθισεν ἐπὶ τοῦ βήματος εἰς τόπον λεγόμενον Λιθόστρωτον, ἑβραϊστὶ δὲ Γαββαθᾶ· ἦν δὲ παρασκευὴ τοῦ πάσχα, ὥρα δὲ ὡσεὶ ἕκτη· καὶ λέγει τοῖς Ἰουδαίοις· ἴδε ὁ βασιλεὺς ὑμῶν. οἱ δὲ ἐκραύγασαν· ἆρον ἆρον, σταύρωσον αὐτόν. λέγει αὐτοῖς ὁ Πιλᾶτος· τὸν βασιλέα ὑμῶν σταυρώσω; ἀπεκρίθησαν οἱ ἀρχιερεῖς· οὐκ ἔχομεν βασιλέα εἰ μὴ Καίσαρα. τότε οὖν παρέδωκεν αὐτὸν αὐτοῖς ἵνα σταυρωθῇ. Παρέλαβον δὲ τὸν Ἰησοῦν καὶ ἤγαγον· καὶ βαστάζων τὸν σταυρὸν αὐτοῦ ἐξῆλθεν εἰς τὸν λεγόμενον κρανίου τόπον, ὃς λέγεται ἑβραϊστὶ Γολγοθᾶ, ὅπου αὐτὸν ἐσταύρωσαν, καὶ μετ᾽ αὐτοῦ ἄλλους δύο ἐντεῦθεν καὶ ἐντεῦθεν, μέσον δὲ τὸν Ἰησοῦν. ἔγραψε δὲ καὶ τίτλον ὁ Πιλᾶτος καὶ ἔθηκεν ἐπὶ τοῦ σταυροῦ· ἦν δὲ γεγραμμένον· Ἰησοῦς ὁ Ναζωραῖος ὁ βασιλεὺς τῶν Ἰουδαίων. τοῦτον οὖν τὸν τίτλον πολλοὶ ἀνέγνωσαν τῶν Ἰουδαίων, ὅτι ἐγγὺς ἦν τῆς πόλεως ὁ τόπος ὅπου ἐσταυρώθη ὁ Ἰησοῦς· καὶ ἦν γεγραμμένον Ἑβραϊστί, Ἑλληνιστί, Ῥωμαϊστί. Οἱ μὲν οὖν στρατιῶται ταῦτα ἐποίησαν. εἱστήκεισαν δὲ παρὰ τῷ σταυρῷ τοῦ Ἰησοῦ ἡ μήτηρ αὐτοῦ καὶ ἡ ἀδελφὴ τῆς μητρὸς αὐτοῦ, Μαρία ἡ τοῦ Κλωπᾶ καὶ Μαρία ἡ Μαγδαληνή. Ἰησοῦς οὖν ἰδὼν τὴν μητέρα καὶ τὸν μαθητὴν παρεστῶτα ὃν ἠγάπα, λέγει τῇ μητρὶ αὐτοῦ· γύναι, ἴδε ὁ υἱός σου. εἶτα λέγει τῷ μαθητῇ· ἰδοὺ ἡ μήτηρ σου. καὶ ἀπ᾽ ἐκείνης τῆς ὥρας ἔλαβεν ὁ μαθητὴς αὐτὴν εἰς τὰ ἴδια. Μετὰ τοῦτο εἰδὼς ὁ Ἰησοῦς ὅτι πάντα ἤδη τετέλεσται, ἵνα τελειωθῇ ἡ γραφή, λέγει· διψῶ. ὅτε οὖν ἔλαβε τὸ ὄξος ὁ Ἰησοῦς εἶπε, τετέλεσται, καὶ κλίνας τὴν κεφαλὴν παρέδωκε τὸ πνεῦμα.
ltx/gr_gr_cog/le.go.me.m09.d14:lemeLI.Gospel.title	Τοῦ Σταυροῦ
ltx/gr_gr_cog/le.go.me.m09.d14:lemeLI.Gospel.title_abbr	Τοῦ Σταυροῦ
ltx/gr_gr_cog/le.go.me.m09.d14:lemeLI.Gospel.version	@ltx/gr_gr_cog/properties:version.designation
ltx/gr_gr_cog/le.go.me.m09.d14:lemeMA.Gospel.book_abbr	@ltx/gr_gr_cog/bible:John.abbr
ltx/gr_gr_cog/le.go.me.m09.d14:lemeMA.Gospel.book_string	@ltx/gr_gr_cog/bible:John.text
ltx/gr_gr_cog/le.go.me.m09.d14:lemeMA.Gospel.chapverse	12:28 – 36
ltx/gr_gr_cog/le.go.me.m09.d14:lemeMA.Gospel.incipit	Πάτερ, δόξασόν σου τὸ ὄνομα…
ltx/gr_gr_cog/le.go.me.m09.d14:lemeMA.Gospel.text	Εἶπεν ὁ Κύριος· πάτερ, δόξασόν σου τὸ ὄνομα. ἦλθεν οὖν φωνὴ ἐκ τοῦ οὐρανοῦ· καὶ ἐδόξασα καὶ πάλιν δοξάσω. ὁ οὖν ὄχλος ὁ ἑστὼς καὶ ἀκούσας ἔλεγε βροντὴν γεγονέναι· ἄλλοι ἔλεγον· ἄγγελος αὐτῷ λελάληκεν. ἀπεκρίθη ὁ Ἰησοῦς καὶ εἶπεν· οὐ δι᾽ ἐμὲ αὕτη ἡ φωνὴ γέγονεν, ἀλλὰ δι᾽ ὑμᾶς. νῦν κρίσις ἐστὶ τοῦ κόσμου τούτου, νῦν ὁ ἄρχων τοῦ κόσμου τούτου ἐκβληθήσεται ἔξω· κἀγὼ ἐὰν ὑψωθῶ ἐκ τῆς γῆς, πάντας ἑλκύσω πρὸς ἐμαυτόν. τοῦτο δὲ ἔλεγε σημαίνων ποίῳ θανάτῳ ἤμελλεν ἀποθνήσκειν. ἀπεκρίθη αὐτῷ ὁ ὄχλος· ἡμεῖς ἠκούσαμεν ἐκ τοῦ νόμου ὅτι ὁ Χριστὸς μένει εἰς τὸν αἰῶνα, καὶ πῶς σὺ λέγεις, δεῖ ὑψωθῆναι τὸν υἱὸν τοῦ ἀνθρώπου; τίς ἐστιν οὗτος ὁ υἱὸς τοῦ ἀνθρώπου; εἶπεν οὖν αὐτοῖς ὁ Ἰησοῦς· ἔτι μικρὸν χρόνον τὸ φῶς μεθ᾽ ὑμῶν ἐστι· περιπατεῖτε ἕως τὸ φῶς ἔχετε, ἵνα μὴ σκοτία ὑμᾶς καταλάβῃ· καὶ ὁ περιπατῶν ἐν τῇ σκοτίᾳ οὐκ οἶδε ποῦ ὑπάγει. ἕως τὸ φῶς ἔχετε, πιστεύετε εἰς τὸ φῶς, ἵνα υἱοὶ φωτὸς γένησθε.
ltx/gr_gr_cog/le.go.me.m09.d14:lemeMA.Gospel.title	Τοῦ Σταυροῦ
ltx/gr_gr_cog/le.go.me.m09.d14:lemeMA.Gospel.title_abbr	Τοῦ Σταυροῦ
ltx/gr_gr_cog/le.go.me.m09.d14:lemeMA.Gospel.version	@ltx/gr_gr_cog/properties:version.designation
