ltx/gr_gr_cog/le.ep.mc.d136:lemcLI.Epistle.book_abbr	@ltx/gr_gr_cog/bible:Romans.abbr
ltx/gr_gr_cog/le.ep.mc.d136:lemcLI.Epistle.book_string	@ltx/gr_gr_cog/bible:Romans.text
ltx/gr_gr_cog/le.ep.mc.d136:lemcLI.Epistle.chapverse	7:14 – 25, 8:1 – 2
ltx/gr_gr_cog/le.ep.mc.d136:lemcLI.Epistle.incipit	Οἴδαμεν ὅτι ὁ νόμος πνευματικός ἐστιν…
ltx/gr_gr_cog/le.ep.mc.d136:lemcLI.Epistle.text	Ἀδελφοί, οἴδαμεν ὅτι ὁ νόμος πνευματικός ἐστιν· ἐγὼ δὲ σαρκικός εἰμι, πεπραμένος ὑπὸ τὴν ἁμαρτίαν. ὃ γὰρ κατεργάζομαι οὐ γινώσκω· οὐ γὰρ ὃ θέλω τοῦτο πράσσω, ἀλλ᾿ ὃ μισῶ τοῦτο ποιῶ. εἰ δὲ ὃ οὐ θέλω τοῦτο ποιῶ, σύμφημι τῷ νόμῳ ὅτι καλός. νυνὶ δὲ οὐκέτι ἐγὼ κατεργάζομαι αὐτό, ἀλλ᾿ ἡ οἰκοῦσα ἐν ἐμοὶ ἁμαρτία. οἶδα γὰρ ὅτι οὐκ οἰκεῖ ἐν ἐμοί, τοῦτ᾿ ἔστιν ἐν τῇ σαρκί μου, ἀγαθόν· τὸ γὰρ θέλειν παράκειταί μοι, τὸ δὲ κατεργάζεσθαι τὸ καλὸν οὐχ εὑρίσκω· οὐ γὰρ ὃ θέλω ποιῶ ἀγαθόν, ἀλλ᾿ ὃ οὐ θέλω κακὸν τοῦτο πράσσω. εἰ δὲ ὃ οὐ θέλω ἐγὼ τοῦτο ποιῶ, οὐκέτι ἐγὼ κατεργάζομαι αὐτό, ἀλλ᾿ ἡ οἰκοῦσα ἐν ἐμοὶ ἁμαρτία. εὑρίσκω ἄρα τὸν νόμον τῷ θέλοντι ἐμοὶ ποιεῖν τὸ καλόν, ὅτι ἐμοὶ τὸ κακὸν παράκειται· συνήδομαι γὰρ τῷ νόμῳ τοῦ Θεοῦ κατὰ τὸν ἔσω ἄνθρωπον, βλέπω δὲ ἕτερον νόμον ἐν τοῖς μέλεσί μου ἀντιστρατευόμενον τῷ νόμῳ τοῦ νοός μου καὶ αἰχμαλωτίζοντά με ἐν τῷ νόμῳ τῆς ἁμαρτίας τῷ ὄντι ἐν τοῖς μέλεσί μου. Ταλαίπωρος ἐγὼ ἄνθρωπος! τίς με ῥύσεται ἐκ τοῦ σώματος τοῦ θανάτου τούτου; εὐχαριστῷ τῷ Θεῷ διὰ Ἰησοῦ Χριστοῦ τοῦ Κυρίου ἡμῶν. ἄρα οὖν αὐτὸς ἐγὼ τῷ μὲν νοῒ δουλεύω νόμῳ Θεοῦ, τῇ δὲ σαρκὶ νόμῳ ἁμαρτίας. Οὐδὲν ἄρα νῦν κατάκριμα τοῖς ἐν Χριστῷ Ἰησοῦ μὴ κατὰ σάρκα περιπατοῦσιν, ἀλλὰ κατὰ πνεῦμα. ὁ γὰρ νόμος τοῦ πνεύματος τῆς ζωῆς ἐν Χριστῷ Ἰησοῦ ἠλευθέρωσέ με ἀπὸ τοῦ νόμου τῆς ἁμαρτίας καὶ τοῦ θανάτου.
ltx/gr_gr_cog/le.ep.mc.d136:lemcLI.Epistle.title	Τῇ Τρίτῃ τῆς Γʹ Ἑβδομάδος
ltx/gr_gr_cog/le.ep.mc.d136:lemcLI.Epistle.title_abbr	Τρίτῃ τῆς Γʹ Ἑβδομάδος
ltx/gr_gr_cog/le.ep.mc.d136:lemcLI.Epistle.version	@ltx/gr_gr_cog/properties:version.designation
