ltx/gr_gr_cog/le.go.me.m11.d01:lemeLI.Gospel.book_abbr	@ltx/gr_gr_cog/le.go.ge.unmercenary:legeLI.Gospel.book_abbr
ltx/gr_gr_cog/le.go.me.m11.d01:lemeLI.Gospel.book_string	@ltx/gr_gr_cog/le.go.ge.unmercenary:legeLI.Gospel.book_string
ltx/gr_gr_cog/le.go.me.m11.d01:lemeLI.Gospel.chapverse	@ltx/gr_gr_cog/le.go.ge.unmercenary:legeLI.Gospel.chapverse
ltx/gr_gr_cog/le.go.me.m11.d01:lemeLI.Gospel.incipit	@ltx/gr_gr_cog/le.go.ge.unmercenary:legeLI.Gospel.incipit
ltx/gr_gr_cog/le.go.me.m11.d01:lemeLI.Gospel.text	@ltx/gr_gr_cog/le.go.ge.unmercenary:legeLI.Gospel.text
ltx/gr_gr_cog/le.go.me.m11.d01:lemeLI.Gospel.title	Τῶν Ἁγίων
ltx/gr_gr_cog/le.go.me.m11.d01:lemeLI.Gospel.title_abbr	Τῶν Ἁγίων
ltx/gr_gr_cog/le.go.me.m11.d01:lemeLI.Gospel.version	@ltx/gr_gr_cog/le.go.ge.unmercenary:legeLI.Gospel.version
