ltx/gr_gr_cog/le.ep.mc.d070:lemcLI.Epistle.book_abbr	@ltx/gr_gr_cog/bible:Corinthians1.abbr
ltx/gr_gr_cog/le.ep.mc.d070:lemcLI.Epistle.book_string	@ltx/gr_gr_cog/bible:Corinthians1.text
ltx/gr_gr_cog/le.ep.mc.d070:lemcLI.Epistle.chapverse	Αʹ Κορ. 5:6 – 8, Γαλ. 3:13 – 14
ltx/gr_gr_cog/le.ep.mc.d070:lemcLI.Epistle.incipit	Μικρὰ ζύμη ὅλον τὸ φύραμα ζυμοῖ…
ltx/gr_gr_cog/le.ep.mc.d070:lemcLI.Epistle.text	Ἀδελφοί, μικρὰ ζύμη ὅλον τὸ φύραμα ζυμοῖ. ἐκκαθάρατε οὖν τὴν παλαιὰν ζύμην, ἵνα ἦτε νέον φύραμα, καθώς ἐστε ἄζυμοι. καὶ γὰρ τὸ πάσχα ἡμῶν ὑπὲρ ἡμῶν ἐτύθη Χριστός· ὥστε ἑορτάζωμεν μὴ ἐν ζύμῃ παλαιᾷ, μηδὲ ἐν ζύμῃ κακίας καὶ πονηρίας, ἀλλ᾿ ἐν ἀζύμοις εἰλικρινείας καὶ ἀληθείας. Χριστὸς ἡμᾶς ἐξηγόρασεν ἐκ τῆς κατάρας τοῦ νόμου γενόμενος ὑπὲρ ἡμῶν κατάρα· γέγραπται γάρ· ἐπικατάρατος πᾶς ὁ κρεμάμενος ἐπὶ ξύλου· ἵνα εἰς τὰ ἔθνη ἡ εὐλογία τοῦ Ἀβραὰμ γένηται ἐν Χριστῷ Ἰησοῦ, ἵνα τὴν ἐπαγγελίαν τοῦ Πνεύματος λάβωμεν διὰ τῆς πίστεως.
ltx/gr_gr_cog/le.ep.mc.d070:lemcLI.Epistle.title	Τῷ Ἁγίῳ καὶ Μεγάλῳ Σαββάτῳ ἐν τῷ Ὄρθρῳ
ltx/gr_gr_cog/le.ep.mc.d070:lemcLI.Epistle.title_abbr	Μεγάλῳ Σαββάτῳ ἐν τῷ Ὄρθρῳ
ltx/gr_gr_cog/le.ep.mc.d070:lemcLI.Epistle.version	@ltx/gr_gr_cog/properties:version.designation
ltx/gr_gr_cog/le.ep.mc.d070:lemcVE.Epistle.book_abbr	@ltx/gr_gr_cog/bible:Corinthians1.abbr
ltx/gr_gr_cog/le.ep.mc.d070:lemcVE.Epistle.book_string	@ltx/gr_gr_cog/bible:Corinthians1.text
ltx/gr_gr_cog/le.ep.mc.d070:lemcVE.Epistle.chapverse	1:18 – 31, 2:1 – 2
ltx/gr_gr_cog/le.ep.mc.d070:lemcVE.Epistle.incipit	Ὁ λόγος ὁ τοῦ Σταυροῦ…
ltx/gr_gr_cog/le.ep.mc.d070:lemcVE.Epistle.text	Ἀδελφοί, ὁ λόγος ὁ τοῦ σταυροῦ τοῖς μὲν ἀπολλυμένοις μωρία ἐστί, τοῖς δὲ σῳζομένοις ἡμῖν δύναμις Θεοῦ ἐστι. γέγραπται γάρ· ἀπολῶ τὴν σοφίαν τῶν σοφῶν, καὶ τὴν σύνεσιν τῶν συνετῶν ἀθετήσω. ποῦ σοφός; ποῦ γραμματεύς; ποῦ συζητητὴς τοῦ αἰῶνος τούτου; οὐχὶ ἐμώρανεν ὁ Θεὸς τὴν σοφίαν τοῦ κόσμου τούτου; ἐπειδὴ γὰρ ἐν τῇ σοφίᾳ τοῦ Θεοῦ οὐκ ἔγνω ὁ κόσμος διὰ τῆς σοφίας τὸν Θεόν, εὐδόκησεν ὁ Θεὸς διὰ τῆς μωρίας τοῦ κηρύγματος σῶσαι τοὺς πιστεύοντας. ἐπειδὴ καὶ Ἰουδαῖοι σημεῖον αἰτοῦσι καὶ Ἕλληνες σοφίαν ζητοῦσιν, ἡμεῖς δὲ κηρύσσομεν Χριστὸν ἐσταυρωμένον, Ἰουδαίοις μὲν σκάνδαλον, Ἕλλησι δὲ μωρίαν, αὐτοῖς δὲ τοῖς κλητοῖς, Ἰουδαίοις τε καὶ Ἕλλησι, Χριστὸν Θεοῦ δύναμιν καὶ Θεοῦ σοφίαν· ὅτι τὸ μωρὸν τοῦ Θεοῦ σοφώτερον τῶν ἀνθρώπων ἐστί, καὶ τὸ ἀσθενὲς τοῦ Θεοῦ ἰσχυρότερον τῶν ἀνθρώπων ἐστί. Βλέπετε γὰρ τὴν κλῆσιν ὑμῶν, ἀδελφοί, ὅτι οὐ πολλοὶ σοφοὶ κατὰ σάρκα, οὐ πολλοὶ δυνατοί, οὐ πολλοὶ εὐγενεῖς, ἀλλὰ τὰ μωρὰ τοῦ κόσμου ἐξελέξατο ὁ Θεὸς ἵνα τοὺς σοφοὺς καταισχύνῃ, καὶ τὰ ἀσθενῆ τοῦ κόσμου ἐξελέξατο ὁ Θεὸς ἵνα καταισχύνῃ τὰ ἰσχυρά, καὶ τὰ ἀγενῆ τοῦ κόσμου καὶ τὰ ἐξουθενημένα ἐξελέξατο ὁ Θεός, καὶ τὰ μὴ ὄντα, ἵνα τὰ ὄντα καταργήσῃ, ὅπως μὴ καυχήσηται πᾶσα σὰρξ ἐνώπιον τοῦ Θεοῦ. ἐξ αὐτοῦ δὲ ὑμεῖς ἐστε ἐν Χριστῷ Ἰησοῦ, ὃς ἐγενήθη ἡμῖν σοφία ἀπὸ Θεοῦ, δικαιοσύνη τε καὶ ἁγιασμὸς καὶ ἀπολύτρωσις, ἵνα, καθὼς γέγραπται, ὁ καυχώμενος ἐν Κυρίῳ καυχάσθω. Κἀγὼ ἐλθὼν πρὸς ὑμᾶς, ἀδελφοί, ἦλθον οὐ καθ᾿ ὑπεροχὴν λόγου ἢ σοφίας καταγγέλλων ὑμῖν τὸ μαρτύριον τοῦ Θεοῦ. οὐ γὰρ ἔκρινα τοῦ εἰδέναι τι ἐν ὑμῖν εἰ μὴ Ἰησοῦν Χριστόν, καὶ τοῦτον ἐσταυρωμένον.
ltx/gr_gr_cog/le.ep.mc.d070:lemcVE.Epistle.title	Τῇ Μεγάλῃ Παρασκευῇ ἐν τῷ Ἑσπερινῷ
ltx/gr_gr_cog/le.ep.mc.d070:lemcVE.Epistle.title_abbr	Ἐν τῷ Ἑσπερινῷ
ltx/gr_gr_cog/le.ep.mc.d070:lemcVE.Epistle.version	@ltx/gr_gr_cog/properties:version.designation
