ltx/gr_gr_cog/le.pr.me.r81:leprVE.reading.book_abbr	@ltx/gr_gr_cog/bible:Isaiah.abbr
ltx/gr_gr_cog/le.pr.me.r81:leprVE.reading.book_string	@ltx/gr_gr_cog/bible:Isaiah.text
ltx/gr_gr_cog/le.pr.me.r81:leprVE.reading.chapverse	63, 15 – 19 καὶ 64, 1 – 5 καὶ ἐκλογή
ltx/gr_gr_cog/le.pr.me.r81:leprVE.reading.incipit	Ἐπίβλεψον ἐκ τοῦ οὐρανοῦ Κύριε, καὶ ἴδε ἐκ τοῦ…
ltx/gr_gr_cog/le.pr.me.r81:leprVE.reading.text	Ἐπίβλεψον ἐκ τοῦ οὐρανοῦ Κύριε, καὶ ἴδε ἐκ τοῦ οἴκου τοῦ Ἁγίου σου καὶ δόξης σου. Ποῦ ἐστι τὸ πλῆθος τοῦ ἐλέους σου καὶ τῶν οἰκτιρμῶν σου, ὅτι ἠνέσχου ἡμῶν Κύριε; Σὺ γὰρ εἶ Πατὴρ ἡμῶν, ὅτι Ἀβραὰμ οὐκ ἔγνω ἡμᾶς, καί, Ἰσραὴλ οὐκ ἐπέγνω ἡμᾶς, ἀλλὰ σὺ Κύριε, Πατὴρ ἡμῶν, ῥῦσαι ἡμᾶς, ἀπʼ ἀρχῆς τὸ ὄνομά σου ἐφʼ ἡμᾶς ἐστι. Τί ἐπλάνησας ἡμᾶς, Κύριε, ἀπὸ τῆς ὁδοῦ σου; ἐσκλήρυνας τὰς καρδίας ἡμῶν, τοῦ μὴ φοβεῖσθαί σε; Ἐπίστρεψον διὰ τοὺς δούλους σου, διὰ τὰς φυλὰς τῆς κληρονομίας σου, ἵνα μικρὸν κληρονομήσωμεν τοῦ ὄρους τοῦ ἁγίου σου, οἱ ὑπεναντίοι ἡμῶν κατεπάτησαν τὸ ἁγίασμά σου, ἐγενόμεθα ὡς τὸ ἀπαρχῆς, ὅτε οὐκ ἦρξας ἡμῶν, οὐδὲ ἐπεκλήθη τὸ ὄνομά σου ἐφʼ ἡμᾶς. Ἐὰν ἀνοίξῃς τὸν οὐρανόν, τρόμος λήψεται ἀπὸ σοῦ ὄρη, καὶ τακήσονται, ὡσεὶ κηρὸς τήκεται ἀπὸ πυρός, καὶ κατακαύσει πῦρ τοὺς ὑπεναντίους σου, καὶ φανερὸν ἔσται τὸ ὄνομά σου τοῖς ὑπεναντίοις σου, ἀπὸ προσώπου σου ἔθνη ταραχθήσονται. Ὅταν ποιῇς τὰ ἔνδοξα, τρόμος λήψεται ἀπὸ σοῦ ὄρη. Ἀπὸ τοῦ αἰῶνος οὐκ ἠκούσαμεν οὐδὲ οἱ ὀφθαλμοὶ ἡμῶν εἶδον Θεὸν πλήν σου, καὶ τὰ ἔργα σου ἀληθινά, καὶ ποιήσεις τοῖς ὑπομένουσί σε ἔλεος. Συναντήσεται γὰρ ἔλεος τοῖς ποιοῦσι τὸ δίκαιον, καὶ τῶν ὁδῶν σου μνησθήσονται. Καὶ νῦν, Κύριε, Πατὴρ ἡμῶν σὺ εἶ, ἡμεῖς δὲ πηλὸς καὶ σὺ ὁ Πλάστης ἡμῶν· ἔργα χειρῶν σου πάντες ἡμεῖς. Μὴ ὀργίζου ἡμῖν, Κύριε, ἕως σφόδρα, καὶ μὴ ἐν καιρῷ μνησθῇς ἁμαρτιῶν ἡμῶν. Καὶ νῦν ἐπίβλεψον, Κύριε, ὅτι λαός σου πάντες ἡμεῖς.
ltx/gr_gr_cog/le.pr.me.r81:leprVE.reading.title	
ltx/gr_gr_cog/le.pr.me.r81:leprVE.reading.title_abbr	
ltx/gr_gr_cog/le.pr.me.r81:leprVE.reading.version	@ltx/gr_gr_cog/properties:version.designation
