ltx/gr_gr_cog/ho.ho15.m01:ho.Days	ἔχων ἡμέρας 31.
ltx/gr_gr_cog/ho.ho15.m01:ho.Hours	Ἡ ἡμέρα ἔχει ὥρας 10, καὶ ἡ νὺξ ὥρας 14.
ltx/gr_gr_cog/ho.ho15.m01:ho.Month	ΜΗΝ ΙΑΝΟΥΑΡΙΟΣ
ltx/gr_gr_cog/ho.ho15.m01:hoD02.Apolytikion1.greekmelody	@ltx/gr_gr_cog/he.a.m4:heAU.TachyProkatalave.greekname
ltx/gr_gr_cog/ho.ho15.m01:hoD02.Apolytikion1.melody	@ltx/gr_gr_cog/he.a.m4:heAU.TachyProkatalave.name
ltx/gr_gr_cog/ho.ho15.m01:hoD02.Apolytikion1.mode	@ltx/gr_gr_cog/miscellanea:misc.Mode4
ltx/gr_gr_cog/ho.ho15.m01:hoD02.Apolytikion1.poet	
ltx/gr_gr_cog/ho.ho15.m01:hoD02.Apolytikion1.text	Στολὴν ἐνδυδάμενος,…
ltx/gr_gr_cog/ho.ho15.m01:hoD02.Apolytikion1.title	@ltx/gr_gr_cog/titles:ti.SaintM
ltx/gr_gr_cog/ho.ho15.m01:hoD02.GeneralApolytikion1.name	Πάτερ Ἱεράρχα Σίλβεστρε·
ltx/gr_gr_cog/ho.ho15.m01:hoD02.Kontakion1.greekmelody	@ltx/gr_gr_cog/he.a.m4:heAU.OYpsotheisEnToStavro.greekname
ltx/gr_gr_cog/ho.ho15.m01:hoD02.Kontakion1.melody	@ltx/gr_gr_cog/he.a.m4:heAU.OYpsotheisEnToStavro.name
ltx/gr_gr_cog/ho.ho15.m01:hoD02.Kontakion1.mode	@ltx/gr_gr_cog/miscellanea:misc.Mode4
ltx/gr_gr_cog/ho.ho15.m01:hoD02.Kontakion1.poet	
ltx/gr_gr_cog/ho.ho15.m01:hoD02.Kontakion1.text	Ἐν ἱερεῦσιν ἱερεὺς ἀνεδείχθης,…
ltx/gr_gr_cog/ho.ho15.m01:hoD02.Kontakion1.title	@ltx/gr_gr_cog/titles:ti.SaintM
ltx/gr_gr_cog/ho.ho15.m01:hoD03.Kontakion1.greekmelody	@ltx/gr_gr_cog/he.a.m8:heAU.OsAparchas.greekname
ltx/gr_gr_cog/ho.ho15.m01:hoD03.Kontakion1.melody	@ltx/gr_gr_cog/he.a.m8:heAU.OsAparchas.name
ltx/gr_gr_cog/ho.ho15.m01:hoD03.Kontakion1.mode	@ltx/gr_gr_cog/miscellanea:misc.Mode8
ltx/gr_gr_cog/ho.ho15.m01:hoD03.Kontakion1.poet	
ltx/gr_gr_cog/ho.ho15.m01:hoD03.Kontakion1.text	Οἱ σοὶ ἱδρῶτες, ἔνδοξε,…
ltx/gr_gr_cog/ho.ho15.m01:hoD03.Kontakion1.title	@ltx/gr_gr_cog/titles:ti.Martyr
ltx/gr_gr_cog/ho.ho15.m01:hoD03.Kontakion2.greekmelody	@ltx/gr_gr_cog/he.a.m4:heAU.EpefanisSimeron.greekname
ltx/gr_gr_cog/ho.ho15.m01:hoD03.Kontakion2.melody	@ltx/gr_gr_cog/he.a.m4:heAU.EpefanisSimeron.name
ltx/gr_gr_cog/ho.ho15.m01:hoD03.Kontakion2.mode	@ltx/gr_gr_cog/miscellanea:misc.Mode4
ltx/gr_gr_cog/ho.ho15.m01:hoD03.Kontakion2.poet	
ltx/gr_gr_cog/ho.ho15.m01:hoD03.Kontakion2.text	Προφητείας χάρισμα,…
ltx/gr_gr_cog/ho.ho15.m01:hoD03.Kontakion2.title	@ltx/gr_gr_cog/titles:ti.Prophet
ltx/gr_gr_cog/ho.ho15.m01:hoD08.Apolytikion1.greekmelody	@ltx/gr_gr_cog/he.a.m5:heAU.TonSynanarchonLogon.greekname
ltx/gr_gr_cog/ho.ho15.m01:hoD08.Apolytikion1.incipit	Γεωργήσας τὸν λόγον Πάτερ τῆς…
ltx/gr_gr_cog/ho.ho15.m01:hoD08.Apolytikion1.melody	@ltx/gr_gr_cog/he.a.m5:heAU.TonSynanarchonLogon.name
ltx/gr_gr_cog/ho.ho15.m01:hoD08.Apolytikion1.mode	@ltx/gr_gr_cog/miscellanea:misc.Mode5
ltx/gr_gr_cog/ho.ho15.m01:hoD08.Apolytikion1.poet	
ltx/gr_gr_cog/ho.ho15.m01:hoD08.Apolytikion1.text	Γεωργήσας τὸν λόγον Πάτερ τῆς χάριτος, δικαιοσύνης ἐδρέψω καρποφορίαν λαμπράν, ὡς τὴν ἔνθεον ζωὴν αἱρετισάμενος· ὅθεν τῆς δόξης κοινωνός, ἀνεδείχθης τοῦ Χριστοῦ, Γεώργιε θεοφόρε. ᾯ καὶ πρεσβεύεις ἀπαύστως, ἐλεηθῆναι τὰς ψυχὰς ἡμῶν.
ltx/gr_gr_cog/ho.ho15.m01:hoD08.Apolytikion1.title	@ltx/gr_gr_cog/titles:ti.DevoutSaintM
ltx/gr_gr_cog/ho.ho15.m01:hoD08.Apolytikion2.greekmelody	@ltx/gr_gr_cog/he.a.m4:heAU.TachyProkatalave.greekname
ltx/gr_gr_cog/ho.ho15.m01:hoD08.Apolytikion2.incipit	Ὰγάπῃ τῇ κρείττονι, καταυγασθεῖσα τὸν…
ltx/gr_gr_cog/ho.ho15.m01:hoD08.Apolytikion2.melody	@ltx/gr_gr_cog/he.a.m4:heAU.TachyProkatalave.name
ltx/gr_gr_cog/ho.ho15.m01:hoD08.Apolytikion2.mode	@ltx/gr_gr_cog/miscellanea:misc.Mode4
ltx/gr_gr_cog/ho.ho15.m01:hoD08.Apolytikion2.poet	
ltx/gr_gr_cog/ho.ho15.m01:hoD08.Apolytikion2.text	Ὰγάπῃ τῇ κρείττονι, καταυγασθεῖσα τὸν νοῦν, ἀσκήσει ἐξέλαμψας, ὥσπερ λαμπὰς φαεινή, Δομνίκα πανεύφημε· ὅθεν μοναζουσῶν σε, ὁδηγὸν φωτοφόρον, ἔδειξεν ὁ Δεσπότης, διὰ βίου καὶ λόγου· ᾯ πρέσβευε θεοφόρε, σώζεσθαι ἅπαντας.
ltx/gr_gr_cog/ho.ho15.m01:hoD08.Apolytikion2.title	@ltx/gr_gr_cog/titles:ti.DevoutW
ltx/gr_gr_cog/ho.ho15.m01:hoD09.Apolytikion1.greekmelody	@ltx/gr_gr_cog/he.ga:heGA.TisErimouPolitis.greekmelody
ltx/gr_gr_cog/ho.ho15.m01:hoD09.Apolytikion1.melody	@ltx/gr_gr_cog/he.ga:heGA.TisErimouPolitis.name
ltx/gr_gr_cog/ho.ho15.m01:hoD09.Apolytikion1.mode	@ltx/gr_gr_cog/miscellanea:misc.Mode1
ltx/gr_gr_cog/ho.ho15.m01:hoD09.Apolytikion1.poet	
ltx/gr_gr_cog/ho.ho15.m01:hoD09.Apolytikion1.text	Μυηθεὶς οὐρανόθεν εὐσεβείας τὴν ἔλλαμψιν,…
ltx/gr_gr_cog/ho.ho15.m01:hoD09.Apolytikion1.title	@ltx/gr_gr_cog/titles:ti.Martyr
ltx/gr_gr_cog/ho.ho15.m01:hoD09.Kontakion1.greekmelody	@ltx/gr_gr_cog/he.a.m4:heAU.EpefanisSimeron.greekname
ltx/gr_gr_cog/ho.ho15.m01:hoD09.Kontakion1.incipit	Τοῦ Σωτῆρος κλίναντος, ἐν Ἰορδάνῃ…
ltx/gr_gr_cog/ho.ho15.m01:hoD09.Kontakion1.melody	@ltx/gr_gr_cog/he.a.m4:heAU.EpefanisSimeron.name
ltx/gr_gr_cog/ho.ho15.m01:hoD09.Kontakion1.mode	@ltx/gr_gr_cog/miscellanea:misc.Mode4
ltx/gr_gr_cog/ho.ho15.m01:hoD09.Kontakion1.poet	
ltx/gr_gr_cog/ho.ho15.m01:hoD09.Kontakion1.text	Τοῦ Σωτῆρος κλίναντος, ἐν Ἰορδάνῃ, κεφαλὴν ἐθλάσθησαν, αἱ τῶν δρακόντων κεφαλαί· τοῦ Πολυεύκτου ἡ κάρα δέ, ἀποτμηθεῖσα, τὸν δόλιον ᾔσχυνεν.
ltx/gr_gr_cog/ho.ho15.m01:hoD09.Kontakion1.title	@ltx/gr_gr_cog/titles:ti.Martyr
ltx/gr_gr_cog/ho.ho15.m01:hoD15.Apolytikion1.greekmelody	@ltx/gr_gr_cog/he.a.m3:heAU.TheiasPisteos.greekname
ltx/gr_gr_cog/ho.ho15.m01:hoD15.Apolytikion1.incipit	Θείου Πνεύματος, τῇ ἐπινεύσει, πρῶτος…
ltx/gr_gr_cog/ho.ho15.m01:hoD15.Apolytikion1.melody	@ltx/gr_gr_cog/he.a.m3:heAU.TheiasPisteos.name
ltx/gr_gr_cog/ho.ho15.m01:hoD15.Apolytikion1.mode	@ltx/gr_gr_cog/miscellanea:misc.Mode3
ltx/gr_gr_cog/ho.ho15.m01:hoD15.Apolytikion1.poet	
ltx/gr_gr_cog/ho.ho15.m01:hoD15.Apolytikion1.text	Θείου Πνεύματος, τῇ ἐπινεύσει, πρῶτος ᾤκησας, ἐν τῇ ἐρήμῳ, Ἠλιοὺ τὸν ζηλωτὴν μιμησάμενος· καὶ διʼ ὀρνέου τραφεὶς ὡς ἰσάγγελος, ὑπʼ Ἀντωνίου τῷ κόσμῳ ἐγνώρισαι. Παῦλε Ὅσιε, Χριστὸν τὸν Θεὸν ἱκέτευε, δωρήσασθαι ἡμῖν τὸ μέγα ἔλεος.
ltx/gr_gr_cog/ho.ho15.m01:hoD15.Apolytikion1.title	Τοῦ Ὁσίου Παύλου.
ltx/gr_gr_cog/ho.ho15.m01:hoD15.Apolytikion2.title	Τοῦ Ὁσίου Ἰωάννου.
ltx/gr_gr_cog/ho.ho15.m01:hoD15.Kontakion1.title	Κοντάκιον τοῦ ὁσίου Καλυβίτου.
ltx/gr_gr_cog/ho.ho15.m01:hoD15.Kontakion2.greekmelody	@ltx/gr_gr_cog/he.a.m4:heAU.EpefanisSimeron.greekname
ltx/gr_gr_cog/ho.ho15.m01:hoD15.Kontakion2.incipit	Τὸν φωστῆρ ἅπαντες τὸν ἐν…
ltx/gr_gr_cog/ho.ho15.m01:hoD15.Kontakion2.melody	@ltx/gr_gr_cog/he.a.m4:heAU.EpefanisSimeron.name
ltx/gr_gr_cog/ho.ho15.m01:hoD15.Kontakion2.mode	@ltx/gr_gr_cog/miscellanea:misc.Mode4
ltx/gr_gr_cog/ho.ho15.m01:hoD15.Kontakion2.poet	
ltx/gr_gr_cog/ho.ho15.m01:hoD15.Kontakion2.text	Τὸν φωστῆρ ἅπαντες τὸν ἐν τῷ ὕψει,…
ltx/gr_gr_cog/ho.ho15.m01:hoD15.Kontakion2.title	Κοντάκιον τοῦ Θηβαίου.
ltx/gr_gr_cog/ho.ho15.m01:hoD16.Kontakion1.greekmelody	@ltx/gr_gr_cog/he.a.m2:heAU.TaAnoZiton.greekname
ltx/gr_gr_cog/ho.ho15.m01:hoD16.Kontakion1.incipit	Ἡ πέτρα Χριστός, τὴν πέτραν…
ltx/gr_gr_cog/ho.ho15.m01:hoD16.Kontakion1.melody	@ltx/gr_gr_cog/he.a.m2:heAU.TaAnoZiton.name
ltx/gr_gr_cog/ho.ho15.m01:hoD16.Kontakion1.mode	@ltx/gr_gr_cog/miscellanea:misc.Mode2
ltx/gr_gr_cog/ho.ho15.m01:hoD16.Kontakion1.poet	
ltx/gr_gr_cog/ho.ho15.m01:hoD16.Kontakion1.text	Ἡ πέτρα Χριστός, τὴν πέτραν τῆς πίστεως,
ltx/gr_gr_cog/ho.ho15.m01:hoD16.Kontakion1.title	@ltx/gr_gr_cog/titles:ti.Apostle
ltx/gr_gr_cog/ho.ho15.m01:hoD17.Apolytikion1.greekmelody	@ltx/gr_gr_cog/he.a.m5:heAU.TonSynanarchonLogon.greekname
ltx/gr_gr_cog/ho.ho15.m01:hoD17.Apolytikion1.melody	@ltx/gr_gr_cog/he.a.m5:heAU.TonSynanarchonLogon.name
ltx/gr_gr_cog/ho.ho15.m01:hoD17.Apolytikion1.mode	@ltx/gr_gr_cog/miscellanea:misc.Mode5
ltx/gr_gr_cog/ho.ho15.m01:hoD17.Apolytikion1.poet	
ltx/gr_gr_cog/ho.ho15.m01:hoD17.Apolytikion1.text	Τὸν πανεύφημον Μάρτυν Χριστοῦ Γεώργιον,…
ltx/gr_gr_cog/ho.ho15.m01:hoD17.Apolytikion1.title	@ltx/gr_gr_cog/titles:ti.Martyr
ltx/gr_gr_cog/ho.ho15.m01:hoD19.Apolytikion2.greekmelody	@ltx/gr_gr_cog/he.a.m1:heAU.TisErimouPolitis.greekname
ltx/gr_gr_cog/ho.ho15.m01:hoD19.Apolytikion2.melody	@ltx/gr_gr_cog/he.a.m1:heAU.TisErimouPolitis.name
ltx/gr_gr_cog/ho.ho15.m01:hoD19.Apolytikion2.mode	@ltx/gr_gr_cog/miscellanea:misc.Mode1
ltx/gr_gr_cog/ho.ho15.m01:hoD19.Apolytikion2.poet	
ltx/gr_gr_cog/ho.ho15.m01:hoD19.Apolytikion2.text	Ζωῆς τῆς μακαρίας φερωνύμως ἐτύχετε,…
ltx/gr_gr_cog/ho.ho15.m01:hoD19.Apolytikion2.title	@ltx/gr_gr_cog/titles:ti.DevoutSaints
ltx/gr_gr_cog/ho.ho15.m01:hoD19.Apolytikion3.title	Τοῦ Ἁγ. Ἀρσενίου.
ltx/gr_gr_cog/ho.ho15.m01:hoD19.Apolytikion4.greekmelody	@ltx/gr_gr_cog/he.a.m4:heAU.TachyProkatalave.greekname
ltx/gr_gr_cog/ho.ho15.m01:hoD19.Apolytikion4.melody	@ltx/gr_gr_cog/he.a.m4:heAU.TachyProkatalave.name
ltx/gr_gr_cog/ho.ho15.m01:hoD19.Apolytikion4.mode	@ltx/gr_gr_cog/miscellanea:misc.Mode4
ltx/gr_gr_cog/ho.ho15.m01:hoD19.Apolytikion4.poet	
ltx/gr_gr_cog/ho.ho15.m01:hoD19.Apolytikion4.text	Σοφίας τὰς χάριτας,…
ltx/gr_gr_cog/ho.ho15.m01:hoD19.Apolytikion4.title	Τοῦ Ἁγ. Ἀρσενίου.
ltx/gr_gr_cog/ho.ho15.m01:hoD19.Apolytikion5.greekmelody	@ltx/gr_gr_cog/he.a.m3:heAU.TheiasPisteos.greekname
ltx/gr_gr_cog/ho.ho15.m01:hoD19.Apolytikion5.melody	@ltx/gr_gr_cog/he.a.m3:heAU.TheiasPisteos.name
ltx/gr_gr_cog/ho.ho15.m01:hoD19.Apolytikion5.mode	@ltx/gr_gr_cog/miscellanea:misc.Mode3
ltx/gr_gr_cog/ho.ho15.m01:hoD19.Apolytikion5.poet	
ltx/gr_gr_cog/ho.ho15.m01:hoD19.Apolytikion5.text	Θείας πίστεως ὁμολογίᾳ,…
ltx/gr_gr_cog/ho.ho15.m01:hoD19.Apolytikion5.title	Τοῦ Ἁγ. Μάρκου.
ltx/gr_gr_cog/ho.ho15.m01:hoD19.GeneralApolytikion1.title	Τοῦ Ὁσίου Μακαρίου.
ltx/gr_gr_cog/ho.ho15.m01:hoD19.GeneralApolytikion3.name	Πάτερ Ἱεράρχα Ἀρσένιε·
ltx/gr_gr_cog/ho.ho15.m01:hoD19.Kontakion1.title	Τοῦ Ὁσίου Μακαρίου.
ltx/gr_gr_cog/ho.ho15.m01:hoD19.Kontakion2.greekmelody	@ltx/gr_gr_cog/he.a.m3:heAU.IParthenosSimeron.greekname
ltx/gr_gr_cog/ho.ho15.m01:hoD19.Kontakion2.melody	@ltx/gr_gr_cog/he.a.m3:heAU.IParthenosSimeron.name
ltx/gr_gr_cog/ho.ho15.m01:hoD19.Kontakion2.mode	@ltx/gr_gr_cog/miscellanea:misc.Mode3
ltx/gr_gr_cog/ho.ho15.m01:hoD19.Kontakion2.poet	
ltx/gr_gr_cog/ho.ho15.m01:hoD19.Kontakion2.text	Πανοπλίαν ἄμαχον ἐνδεδυμένος θεόφρον,…
ltx/gr_gr_cog/ho.ho15.m01:hoD19.Kontakion2.title	Τοῦ Ἁγ. Μάρκου.
ltx/gr_gr_cog/ho.ho15.m01:hoD22.Apolytikion1.greekmelody	@ltx/gr_gr_cog/he.a.m4:heAU.TachyProkatalave.greekname
ltx/gr_gr_cog/ho.ho15.m01:hoD22.Apolytikion1.incipit	Τὴν πλάνην ἀφέμενος, τὴν τῶν…
ltx/gr_gr_cog/ho.ho15.m01:hoD22.Apolytikion1.melody	@ltx/gr_gr_cog/he.a.m4:heAU.TachyProkatalave.name
ltx/gr_gr_cog/ho.ho15.m01:hoD22.Apolytikion1.mode	@ltx/gr_gr_cog/miscellanea:misc.Mode4
ltx/gr_gr_cog/ho.ho15.m01:hoD22.Apolytikion1.poet	
ltx/gr_gr_cog/ho.ho15.m01:hoD22.Apolytikion1.text	Τὴν πλάνην ἀφέμενος, τὴν τῶν Περσῶν νουνεχῶς,…
ltx/gr_gr_cog/ho.ho15.m01:hoD22.Apolytikion1.title	@ltx/gr_gr_cog/titles:ti.DevoutMartyrM
ltx/gr_gr_cog/ho.ho15.m01:hoD24.Apolytikion1.greekmelody	@ltx/gr_gr_cog/he.a.m3:heAU.TheiasPisteos.greekname
ltx/gr_gr_cog/ho.ho15.m01:hoD24.Apolytikion1.melody	@ltx/gr_gr_cog/he.a.m3:heAU.TheiasPisteos.name
ltx/gr_gr_cog/ho.ho15.m01:hoD24.Apolytikion1.mode	@ltx/gr_gr_cog/miscellanea:misc.Mode3
ltx/gr_gr_cog/ho.ho15.m01:hoD24.Apolytikion1.poet	
ltx/gr_gr_cog/ho.ho15.m01:hoD24.Apolytikion1.text	Ξένην ἤνησας, ζωὴν ἐν κόσμῳ,…
ltx/gr_gr_cog/ho.ho15.m01:hoD24.Apolytikion1.title	@ltx/gr_gr_cog/titles:ti.DevoutW
ltx/gr_gr_cog/ho.ho15.m01:hoD26.Kontakion1.greekmelody	@ltx/gr_gr_cog/he.a.m4:heAU.EpefanisSimeron.greekname
ltx/gr_gr_cog/ho.ho15.m01:hoD26.Kontakion1.melody	@ltx/gr_gr_cog/he.a.m4:heAU.EpefanisSimeron.name
ltx/gr_gr_cog/ho.ho15.m01:hoD26.Kontakion1.mode	@ltx/gr_gr_cog/miscellanea:misc.Mode4
ltx/gr_gr_cog/ho.ho15.m01:hoD26.Kontakion1.poet	
ltx/gr_gr_cog/ho.ho15.m01:hoD26.Kontakion1.text	Ἐν αὐλαῖς ἠγρύπνησας,…
ltx/gr_gr_cog/ho.ho15.m01:hoD26.Kontakion1.title	@ltx/gr_gr_cog/titles:ti.DevoutSaintM
