ltx/gr_gr_cog/me.m01.d31:meDA.commemoration.first	Μνήμη τῶν Ἁγίων Ἀναργύρων Κύρου καὶ Ἰωάννου
ltx/gr_gr_cog/me.m01.d31:meDA.commemoration.first_name	
ltx/gr_gr_cog/me.m01.d31:meDA.commemoration.first_short	Μνήμη τῶν Ἁγίων Ἀναργύρων Κύρου καὶ Ἰωάννου
ltx/gr_gr_cog/me.m01.d31:meDA.commemoration.first_title	@ltx/gr_gr_cog/titles:ti.Saints
ltx/gr_gr_cog/me.m01.d31:meDA.commemoration.full	Μνήμη τῶν Ἁγίων καὶ Θαυματουργῶν Ἀναργύρων Κύρου καὶ Ἰωάννου
ltx/gr_gr_cog/me.m01.d31:meDA.commemoration.second_name	
ltx/gr_gr_cog/me.m01.d31:meDA.commemoration.second_title	
ltx/gr_gr_cog/me.m01.d31:meDA.date	Τῌ ΛΑʹ ΙΑΝΟΥΑΡΙΟΥ
ltx/gr_gr_cog/me.m01.d31:meDA.fordate	διὰ τὴν 31ην Ἰανουαρίου
ltx/gr_gr_cog/me.m01.d31:meDA.insert1	καὶ τῶν Ἁγίων καὶ Θαυματουργῶν Ἀναργύρων Κύρου καὶ Ἰωάννου,
ltx/gr_gr_cog/me.m01.d31:meDA.insert2	ὧν καὶ τὴν μνήμην ἐπιτελοῦμεν·
ltx/gr_gr_cog/me.m01.d31:meDA.note	
ltx/gr_gr_cog/me.m01.d31:meDA.pdfcoverdate	τῆς 31ης Ἰανουαρίου,
ltx/gr_gr_cog/me.m01.d31:meDA.pdfheaderdate	τῆς 31ης Ἰανουαρίου
ltx/gr_gr_cog/me.m01.d31:meHO.commemorations	
ltx/gr_gr_cog/me.m01.d31:meHO.note1	
ltx/gr_gr_cog/me.m01.d31:meHO.note2	
ltx/gr_gr_cog/me.m01.d31:meHO.number	31.
ltx/gr_gr_cog/me.m01.d31:meHO.rank	
ltx/gr_gr_cog/me.m01.d31:meLE.commemoration1	Τῶν Ἁγίων καὶ Θαυματουργῶν Ἀναργύρων Κύρου καὶ Ἰωάννου.
ltx/gr_gr_cog/me.m01.d31:meLE.commemoration2	
ltx/gr_gr_cog/me.m01.d31:meLI.Kontakion1.greekmelody	@ltx/gr_gr_cog/me.m01.d31:meMA.Kontakion1.greekmelody
ltx/gr_gr_cog/me.m01.d31:meLI.Kontakion1.incipit	@ltx/gr_gr_cog/me.m01.d31:meMA.Kontakion1.incipit
ltx/gr_gr_cog/me.m01.d31:meLI.Kontakion1.melody	@ltx/gr_gr_cog/me.m01.d31:meMA.Kontakion1.melody
ltx/gr_gr_cog/me.m01.d31:meLI.Kontakion1.mode	@ltx/gr_gr_cog/me.m01.d31:meMA.Kontakion1.mode
ltx/gr_gr_cog/me.m01.d31:meLI.Kontakion1.text	@ltx/gr_gr_cog/me.m01.d31:meMA.Kontakion1.text
ltx/gr_gr_cog/me.m01.d31:meLI.MM.CommunionHymn.text	@ltx/gr_gr_cog/properties:media.key
ltx/gr_gr_cog/me.m01.d31:meLI.Megalynarion.text	
ltx/gr_gr_cog/me.m01.d31:meMA.C1.title	@ltx/gr_gr_cog/titles:ti.CanonSaints
ltx/gr_gr_cog/me.m01.d31:meMA.C1.verse	@ltx/gr_gr_cog/prayers:pr.verse_SaintsM.text
ltx/gr_gr_cog/me.m01.d31:meMA.ExapTheotokion.incipit	Σὲ προστασίαν πάντες, ἔχομεν οἱ…
ltx/gr_gr_cog/me.m01.d31:meMA.ExapTheotokion.melody	@ltx/gr_gr_cog/he.a.m3:heAU.OOuranonToisAstrois.name
ltx/gr_gr_cog/me.m01.d31:meMA.ExapTheotokion.mode	@ltx/gr_gr_cog/miscellanea:misc.Mode3
ltx/gr_gr_cog/me.m01.d31:meMA.ExapTheotokion.text	Σὲ προστασίαν πάντες, ἔχομεν οἱ ἁμαρτωλοί, πανύμνητε Θεοτόκε, σὺ εὐδιάλλακτον ἡμῖν, ἀπέργασαι τὸν Υἱόν σου, Θεοχαρίτωτε Κόρη.
ltx/gr_gr_cog/me.m01.d31:meMA.Exaposteilarion1.greekmelody	@ltx/gr_gr_cog/he.a.m2:heAU.ToisMathitaisSynelthomen.greekname
ltx/gr_gr_cog/me.m01.d31:meMA.Exaposteilarion1.incipit	Τῶν Ἀναργύρων ἔξαρχοι, καὶ ἀστέρες…
ltx/gr_gr_cog/me.m01.d31:meMA.Exaposteilarion1.melody	@ltx/gr_gr_cog/he.a.m2:heAU.ToisMathitaisSynelthomen.name
ltx/gr_gr_cog/me.m01.d31:meMA.Exaposteilarion1.mode	@ltx/gr_gr_cog/miscellanea:misc.Mode2
ltx/gr_gr_cog/me.m01.d31:meMA.Exaposteilarion1.text	Τῶν Ἀναργύρων ἔξαρχοι, καὶ ἀστέρες οἱ θεῖοι, τῆς οἰκουμένης ὤφθητε, Μάρτυρες θεοφόροι ὡς πρόμαχοι ἀληθείας· ἐκ Θεοῦ γὰρ λαβόντες, τὸ συμπαθὲς πανεύφημοι, μυστικῶς χειρουργεῖτε, πάθη ψυχῶν, καὶ σωμάτων· ὅθεν τὴν φωτοφόρον, μνήμην ἡμῶν γεραίρομεν, Κῦρε καὶ Ἰωάννη.
ltx/gr_gr_cog/me.m01.d31:meMA.Exaposteilarion2.greekmelody	@ltx/gr_gr_cog/he.a.m3:heAU.OOuranonToisAstrois.greekname
ltx/gr_gr_cog/me.m01.d31:meMA.Exaposteilarion2.incipit	Θαυματουργοὶ φωστῆρες, Κῦρε σὺν τῷ…
ltx/gr_gr_cog/me.m01.d31:meMA.Exaposteilarion2.melody	@ltx/gr_gr_cog/he.a.m3:heAU.OOuranonToisAstrois.name
ltx/gr_gr_cog/me.m01.d31:meMA.Exaposteilarion2.mode	@ltx/gr_gr_cog/miscellanea:misc.Mode3
ltx/gr_gr_cog/me.m01.d31:meMA.Exaposteilarion2.text	Θαυματουργοὶ φωστῆρες, Κῦρε σὺν τῷ Ἰωάννῃ, τὰς ψυχικὰς ἡμῶν νόσους, καὶ τῶν σωμάτων ἰᾶσθε, παρὰ Κυρίου λαβόντες, τὴν χάριν τῶν ἰαμάτων.
ltx/gr_gr_cog/me.m01.d31:meMA.Kontakion1.greekmelody	@ltx/gr_gr_cog/he.a.m3:heAU.IParthenosSimeron.greekname
ltx/gr_gr_cog/me.m01.d31:meMA.Kontakion1.incipit	Ἐκ τῆς θείας χάριτος, τὴν…
ltx/gr_gr_cog/me.m01.d31:meMA.Kontakion1.melody	@ltx/gr_gr_cog/he.a.m3:heAU.IParthenosSimeron.name
ltx/gr_gr_cog/me.m01.d31:meMA.Kontakion1.mode	@ltx/gr_gr_cog/miscellanea:misc.Mode3
ltx/gr_gr_cog/me.m01.d31:meMA.Kontakion1.text	Ἐκ τῆς θείας χάριτος, τὴν δωρεὰν τῶν θαυμάτων, εἰληφότες Ἅγιοι, θαυματουργεῖτε ἀπαύστως, ἅπαντα ἡμῶν τὰ πάθη, τῇ χειρουργίᾳ, τέμνοντες τῇ ἀοράτῳ, Κῦρε θεόφρον, σὺν τῷ θείῳ Ἰωάννῃ· ὑμεῖς γὰρ θεῖοι ἰατροὶ ὑπάρχετε.
ltx/gr_gr_cog/me.m01.d31:meMA.Lauds1.greekmelody	@ltx/gr_gr_cog/he.a.m4:heAU.OsGennaionEnMartysi.greekname
ltx/gr_gr_cog/me.m01.d31:meMA.Lauds1.incipit	Τὴν δυάδα τιμήσωμεν…
ltx/gr_gr_cog/me.m01.d31:meMA.Lauds1.melody	@ltx/gr_gr_cog/he.a.m4:heAU.OsGennaionEnMartysi.name
ltx/gr_gr_cog/me.m01.d31:meMA.Lauds1.mode	@ltx/gr_gr_cog/miscellanea:misc.Mode4
ltx/gr_gr_cog/me.m01.d31:meMA.Lauds1.text	Τὴν δυάδα τιμήσωμεν, τῶν Μαρτύρων ἐν ᾄσμασι, τῆς Τριάδος ἔχουσαν τὴν λαμπρότητα, τοὺς θεμελίους τῆς Πίστεως, τὰ ἄνθη τὰ πνέοντα, τὴν ὀσμὴν τὴν ἀληθῆ, τῆς Θεοῦ ἐπιγνώσεως, Κῦρον ἅπαντες, καὶ σὺν τούτῳ τὸν μέγαν Ἰωάννην, ὡς πρεσβεύοντας ἀπαύστως, ὑπὲρ ἡμῶν τὸν Φιλάνθρωπον.
ltx/gr_gr_cog/me.m01.d31:meMA.Lauds2.incipit	Ἰατροὶ ἀνεδείχθητε…
ltx/gr_gr_cog/me.m01.d31:meMA.Lauds2.melody	@ltx/gr_gr_cog/he.a.m4:heAU.OsGennaionEnMartysi.name
ltx/gr_gr_cog/me.m01.d31:meMA.Lauds2.mode	@ltx/gr_gr_cog/miscellanea:misc.Mode4
ltx/gr_gr_cog/me.m01.d31:meMA.Lauds2.text	Ἰατροὶ ἀνεδείχθητε, ἀσθενούντων Μακάριοι, καὶ φωστῆρες ἄδυτοι διὰ Πίστεως, ὁμολογίας συνήγοροι, Μαρτύρων συμμέτοχοι, τοὺς στεφάνους ἀληθῶς, τοὺς τῆς νίκης δεξάμενοι, Κῦρε ἔνδοξε, καὶ σοφὲ Ἰωάννη ἀσιγήτως, δυσωπεῖτε τὸν Σωτῆρα, ὑπὲρ ἡμῶν Παμμακάριστοι.
ltx/gr_gr_cog/me.m01.d31:meMA.Lauds3.incipit	Συγχορεύουσι σήμερον…
ltx/gr_gr_cog/me.m01.d31:meMA.Lauds3.melody	@ltx/gr_gr_cog/he.a.m4:heAU.OsGennaionEnMartysi.name
ltx/gr_gr_cog/me.m01.d31:meMA.Lauds3.mode	@ltx/gr_gr_cog/miscellanea:misc.Mode4
ltx/gr_gr_cog/me.m01.d31:meMA.Lauds3.text	Συγχορεύουσι σήμερον, αἱ Χριστοῦ καλλιπάρθενοι, τοῖς δυσὶ θεόφροσι θείοις Μάρτυσι, καὶ τῆς αὐτῶν ὡς μετέχουσαι, δόξης καὶ λαμπρότητος, τὸν κρατύναντα αὐτάς, σὺν αὐτοῖς μεγαλύνουσι, καὶ πρεσβεύουσιν, ἐκ φθορᾶς καὶ κινδύνων λυτρωθῆναι, τοὺς ἐν πίστει ἐκτελοῦντας, τὴν ἀεισέβαστον μνήμην αὐτῶν.
ltx/gr_gr_cog/me.m01.d31:meMA.LaudsGlory.incipit	Ἀξιεπαίνοις ᾄσμασι, πιστοὶ μεγαλύνωμεν, Κῦρον…
ltx/gr_gr_cog/me.m01.d31:meMA.LaudsGlory.melody	
ltx/gr_gr_cog/me.m01.d31:meMA.LaudsGlory.mode	@ltx/gr_gr_cog/miscellanea:misc.Mode4
ltx/gr_gr_cog/me.m01.d31:meMA.LaudsGlory.text	Ἀξιεπαίνοις ᾄσμασι, πιστοὶ μεγαλύνωμεν, Κῦρον καὶ Ἰωάννην, τοὺς ἐν πνεύματι ὁμαίμονας, καὶ κατὰ σάρκα ἀδελφόφρονας, σὺν αὐτοῖς καὶ τὴν γενναίαν Ἀθανασίαν ἐγκωμιάζοντες, καὶ τὰ βλαστήματα αὐτῆς, Θεοδότην Εὐδοξίαν καὶ Θεοκτίστην, τὰς ἀθληφόρους καὶ καλλιπαρθένους, αἰτοῦντας Χριστόν, ὑπὲρ τῶν ψυχῶν ἡμῶν.
ltx/gr_gr_cog/me.m01.d31:meMA.LaudsStavrotheotokion.greekmelody	@ltx/gr_gr_cog/he.a.m4:heAU.OExYpsistouKlitheis.greekname
ltx/gr_gr_cog/me.m01.d31:meMA.LaudsStavrotheotokion.incipit	@ltx/gr_gr_cog/oc.m4.d6:ocVE.AposTheotokion.incipit
ltx/gr_gr_cog/me.m01.d31:meMA.LaudsStavrotheotokion.melody	@ltx/gr_gr_cog/he.a.m4:heAU.OExYpsistouKlitheis.name
ltx/gr_gr_cog/me.m01.d31:meMA.LaudsStavrotheotokion.mode	@ltx/gr_gr_cog/miscellanea:misc.Mode4
ltx/gr_gr_cog/me.m01.d31:meMA.LaudsStavrotheotokion.text	@ltx/gr_gr_cog/oc.m4.d6:ocVE.AposTheotokion.text
ltx/gr_gr_cog/me.m01.d31:meMA.LaudsTheotokion.greekmelody	@ltx/gr_gr_cog/he.a.m4:heAU.OExYpsistouKlitheis.greekname
ltx/gr_gr_cog/me.m01.d31:meMA.LaudsTheotokion.incipit	Οὐκ ἀποκρύπτω ὁ τάλας…
ltx/gr_gr_cog/me.m01.d31:meMA.LaudsTheotokion.melody	@ltx/gr_gr_cog/he.a.m4:heAU.OExYpsistouKlitheis.name
ltx/gr_gr_cog/me.m01.d31:meMA.LaudsTheotokion.mode	@ltx/gr_gr_cog/miscellanea:misc.Mode4
ltx/gr_gr_cog/me.m01.d31:meMA.LaudsTheotokion.text	Οὐκ ἀποκρύπτω ὁ τάλας τὰ δεινά μου, ὅτι πάντα κέκτημαι, ἅπερ μισεῖ ὁ Θεός, σάρκα μολύνας καὶ πνεῦμά μου, καὶ νοῦν ἐννοίαις, τοῖς ἀθεμίτοις ἔργοις καὶ λόγοις αἰσχροῖς, γλώσσῃ κατακρίνων τε τοὺς ἁμαρτάνοντας, αὐτὸς τὰ χείρω ἐργάζομαι, Θεογεννῆτορ, τούτων μοι δίδου πάντων διόρθωσιν, ἵνα ἐκνήψας τῆς κακίστης μου, συνηθείας προσπέσω καὶ κλαύσωμαι, ἃ δεινὰ εἰργασάμην, τῆς ζωῆς μου τὸ ὑπόλοιπον.
ltx/gr_gr_cog/me.m01.d31:meMA.MM.Lauds1123as5678.text	@ltx/gr_gr_cog/properties:media.key
ltx/gr_gr_cog/me.m01.d31:meMA.Ode1C11.greekmelody	@ltx/gr_gr_cog/he.h.m4:heHE.ThalassisToErythraion.greekname
ltx/gr_gr_cog/me.m01.d31:meMA.Ode1C11.incipit	Τὸ κῦρος κατὰ τῆς πλάνης…
ltx/gr_gr_cog/me.m01.d31:meMA.Ode1C11.melody	@ltx/gr_gr_cog/he.h.m4:heHE.ThalassisToErythraion.name
ltx/gr_gr_cog/me.m01.d31:meMA.Ode1C11.mode	@ltx/gr_gr_cog/miscellanea:misc.Mode4
ltx/gr_gr_cog/me.m01.d31:meMA.Ode1C11.ode	@ltx/gr_gr_cog/miscellanea:misc.Ode1
ltx/gr_gr_cog/me.m01.d31:meMA.Ode1C11.text	Τὸ κῦρος κατὰ τῆς πλάνης εἴληφας, Κῦρε μακάριε συναθλητὴν τῶν πόνων ἐσχηκώς, Ἰωάννην τὸν ἔνδοξον· διὸ τρυφῆς τῆς κρείττονος, ἐν οὐρανοῖς συναπολαύετε.
ltx/gr_gr_cog/me.m01.d31:meMA.Ode1C12.incipit	Στρατείαν πνευματικὴν ζωσάμενος, Κῦρε πανέντιμε…
ltx/gr_gr_cog/me.m01.d31:meMA.Ode1C12.melody	@ltx/gr_gr_cog/he.h.m4:heHE.ThalassisToErythraion.name
ltx/gr_gr_cog/me.m01.d31:meMA.Ode1C12.mode	@ltx/gr_gr_cog/miscellanea:misc.Mode4
ltx/gr_gr_cog/me.m01.d31:meMA.Ode1C12.ode	@ltx/gr_gr_cog/miscellanea:misc.Ode1
ltx/gr_gr_cog/me.m01.d31:meMA.Ode1C12.text	Στρατείαν πνευματικὴν ζωσάμενος, Κῦρε πανέντιμε, τὴν ἐπὶ γῆς στρατείαν τε λιπών, Ἰωάννη πανεύφημε, κατὰ Δαιμόνων ἤρασθε, παρὰ Χριστοῦ τὰ νικητήρια.
ltx/gr_gr_cog/me.m01.d31:meMA.Ode1C13.incipit	Τῆς Θέκλης τὴν ἀρετὴν ζηλώσασαι…
ltx/gr_gr_cog/me.m01.d31:meMA.Ode1C13.melody	@ltx/gr_gr_cog/he.h.m4:heHE.ThalassisToErythraion.name
ltx/gr_gr_cog/me.m01.d31:meMA.Ode1C13.mode	@ltx/gr_gr_cog/miscellanea:misc.Mode4
ltx/gr_gr_cog/me.m01.d31:meMA.Ode1C13.ode	@ltx/gr_gr_cog/miscellanea:misc.Ode1
ltx/gr_gr_cog/me.m01.d31:meMA.Ode1C13.text	Τῆς Θέκλης τὴν ἀρετὴν ζηλώσασαι, γυναῖκες ἔνθεοι, παρθενικὴν ἰσάγγελον στολήν, εὐσεβῶς ἠμφιάσαντο, μαρτυρικῷ δὲ ἔρωτι, πρὸς τοὺς ἀγῶνας ἀπεδύσαντο.
ltx/gr_gr_cog/me.m01.d31:meMA.Ode1C1T.incipit	Ἐκ σοῦ κεχαριτωμένη Πάναγνε, ἡμῖν…
ltx/gr_gr_cog/me.m01.d31:meMA.Ode1C1T.melody	@ltx/gr_gr_cog/he.h.m4:heHE.ThalassisToErythraion.name
ltx/gr_gr_cog/me.m01.d31:meMA.Ode1C1T.mode	@ltx/gr_gr_cog/miscellanea:misc.Mode4
ltx/gr_gr_cog/me.m01.d31:meMA.Ode1C1T.ode	@ltx/gr_gr_cog/miscellanea:misc.Ode1
ltx/gr_gr_cog/me.m01.d31:meMA.Ode1C1T.text	Ἐκ σοῦ κεχαριτωμένη Πάναγνε, ἡμῖν ἀνέτειλε, δικαιοσύνης Ἥλιος Χριστός, καὶ φωτὶ κατελάμπρυνε, τοὺς καθημένους πρότερον, ἐν τοῖς τοῦ σκότους ὀχυρώμασιν.
ltx/gr_gr_cog/me.m01.d31:meMA.Ode3C11.greekmelody	@ltx/gr_gr_cog/he.h.m4:heHE.EffrainetaiEpiSoi.greekname
ltx/gr_gr_cog/me.m01.d31:meMA.Ode3C11.incipit	Σαρκίῳ τῷ ἀσθενεῖ, δυναμουμένῳ τοῖς…
ltx/gr_gr_cog/me.m01.d31:meMA.Ode3C11.melody	@ltx/gr_gr_cog/he.h.m4:heHE.EffrainetaiEpiSoi.name
ltx/gr_gr_cog/me.m01.d31:meMA.Ode3C11.mode	@ltx/gr_gr_cog/miscellanea:misc.Mode4
ltx/gr_gr_cog/me.m01.d31:meMA.Ode3C11.ode	@ltx/gr_gr_cog/miscellanea:misc.Ode3
ltx/gr_gr_cog/me.m01.d31:meMA.Ode3C11.text	Σαρκίῳ τῷ ἀσθενεῖ, δυναμουμένῳ τοῖς Χριστοῦ πάθεσιν, οἱ εὐκλεεῖς Μάρτυρες, τὸν ἀνθρωποκτόνον κατέβαλον.
ltx/gr_gr_cog/me.m01.d31:meMA.Ode3C12.incipit	Τῶν πόνων σωματικῶς, τῆς ἀκηράτου…
ltx/gr_gr_cog/me.m01.d31:meMA.Ode3C12.melody	@ltx/gr_gr_cog/he.h.m4:heHE.EffrainetaiEpiSoi.name
ltx/gr_gr_cog/me.m01.d31:meMA.Ode3C12.mode	@ltx/gr_gr_cog/miscellanea:misc.Mode4
ltx/gr_gr_cog/me.m01.d31:meMA.Ode3C12.ode	@ltx/gr_gr_cog/miscellanea:misc.Ode3
ltx/gr_gr_cog/me.m01.d31:meMA.Ode3C12.text	Τῶν πόνων σωματικῶς, τῆς ἀκηράτου δὲ τρυφῆς πνεύματι, οἱ τοῦ Χριστοῦ Μάρτυρες, ἀντιλαβανόμενοι ἔχαιρον.
ltx/gr_gr_cog/me.m01.d31:meMA.Ode3C13.incipit	Ἐῤῥώσθη τὸ ἀσθενές, τῆς γυναικείας…
ltx/gr_gr_cog/me.m01.d31:meMA.Ode3C13.melody	@ltx/gr_gr_cog/he.h.m4:heHE.EffrainetaiEpiSoi.name
ltx/gr_gr_cog/me.m01.d31:meMA.Ode3C13.mode	@ltx/gr_gr_cog/miscellanea:misc.Mode4
ltx/gr_gr_cog/me.m01.d31:meMA.Ode3C13.ode	@ltx/gr_gr_cog/miscellanea:misc.Ode3
ltx/gr_gr_cog/me.m01.d31:meMA.Ode3C13.text	Ἐῤῥώσθη τὸ ἀσθενές, τῆς γυναικείας τῷ Σταυρῷ φύσεως, τὸν δυσμενῆ δράκοντα· ὅθεν ἀνδρικῶς ἐτροπώσαντο.
ltx/gr_gr_cog/me.m01.d31:meMA.Ode3C1T.incipit	Σὺ μόνη τοῖς ἐπὶ γῆς…
ltx/gr_gr_cog/me.m01.d31:meMA.Ode3C1T.melody	@ltx/gr_gr_cog/he.h.m4:heHE.EffrainetaiEpiSoi.name
ltx/gr_gr_cog/me.m01.d31:meMA.Ode3C1T.mode	@ltx/gr_gr_cog/miscellanea:misc.Mode4
ltx/gr_gr_cog/me.m01.d31:meMA.Ode3C1T.ode	@ltx/gr_gr_cog/miscellanea:misc.Ode3
ltx/gr_gr_cog/me.m01.d31:meMA.Ode3C1T.text	Σὺ μόνη τοῖς ἐπὶ γῆς, τῶν ὑπὲρ φύσιν ἀγαθῶν πρόξενος, Μήτηρ Θεοῦ γέγονας· ὅθεν σοι τὸ Χαῖρε κραυγάζομεν.
ltx/gr_gr_cog/me.m01.d31:meMA.Ode3H.greekmelody	@ltx/gr_gr_cog/he.h.m4:heHE.EffrainetaiEpiSoi.greekname
ltx/gr_gr_cog/me.m01.d31:meMA.Ode3H.incipit	@ltx/gr_gr_cog/he.h.m4:heHE.EffrainetaiEpiSoi.incipit
ltx/gr_gr_cog/me.m01.d31:meMA.Ode3H.melody	@ltx/gr_gr_cog/he.h.m4:heHE.EffrainetaiEpiSoi.melody
ltx/gr_gr_cog/me.m01.d31:meMA.Ode3H.mode	@ltx/gr_gr_cog/miscellanea:misc.Mode4
ltx/gr_gr_cog/me.m01.d31:meMA.Ode3H.ode	@ltx/gr_gr_cog/miscellanea:misc.Ode3
ltx/gr_gr_cog/me.m01.d31:meMA.Ode3H.text	@ltx/gr_gr_cog/he.h.m4:heHE.EffrainetaiEpiSoi.text
ltx/gr_gr_cog/me.m01.d31:meMA.Ode3Kathisma1.greekmelody	@ltx/gr_gr_cog/he.a.m4:heAU.OYpsotheisEnToStavro.greekname
ltx/gr_gr_cog/me.m01.d31:meMA.Ode3Kathisma1.incipit	Τὰς χαμαιζήλους ἡδονὰς συμπατοῦντες, πρὸς…
ltx/gr_gr_cog/me.m01.d31:meMA.Ode3Kathisma1.melody	@ltx/gr_gr_cog/he.a.m4:heAU.OYpsotheisEnToStavro.name
ltx/gr_gr_cog/me.m01.d31:meMA.Ode3Kathisma1.mode	@ltx/gr_gr_cog/miscellanea:misc.Mode4
ltx/gr_gr_cog/me.m01.d31:meMA.Ode3Kathisma1.text	Τὰς χαμαιζήλους ἡδονὰς συμπατοῦντες, πρὸς μαρτυρίου Ἀθληταὶ θεῖον ὕψος, περιφανῶς ἐπήρθητε ἐν χάριτι, Κῦρε Ἰωάννη τε, οἰκουμένης φωστῆρες· ὅθεν ἱκετεύομεν, σκοτασμοῦ ἁμαρτίας, καὶ νοσημάτων ῥύσασθαι ἡμᾶς, τὸν ἐπὶ πάντων Θεὸν ἱκετεύοντες
ltx/gr_gr_cog/me.m01.d31:meMA.Ode3KathismaSt.incipit	Τὸν ἐξ ἀνάρχου τοῦ Πατρὸς…
ltx/gr_gr_cog/me.m01.d31:meMA.Ode3KathismaSt.melody	@ltx/gr_gr_cog/he.a.m4:heAU.OYpsotheisEnToStavro.name
ltx/gr_gr_cog/me.m01.d31:meMA.Ode3KathismaSt.mode	@ltx/gr_gr_cog/miscellanea:misc.Mode4
ltx/gr_gr_cog/me.m01.d31:meMA.Ode3KathismaSt.text	Τὸν ἐξ ἀνάρχου τοῦ Πατρὸς γεννηθέντα, ἡ ἐπʼ ἐσχάτων σε σαρκὶ τετοκυῖα, ἐπὶ Σταυροῦ κρεμάμενον ὁρῶσά σε Χριστέ, Οἴμοι! ποθεινότατε Ἰησοῦ ἀνεβόα, πῶς ὁ δοξαζόμενος, ὡς Θεὸς ὑπʼ Ἀγγέλων, ὑπὸ ἀνόμων νῦν βροτῶν Υἱέ, θέλων σταυροῦσαι; Ὑμνῶ σε Μακρόθυμε.
ltx/gr_gr_cog/me.m01.d31:meMA.Ode3KathismaT.incipit	@ltx/gr_gr_cog/me.m01.d21:meMA.Ode3KathismaT.incipit
ltx/gr_gr_cog/me.m01.d31:meMA.Ode3KathismaT.melody	@ltx/gr_gr_cog/he.a.m4:heAU.OYpsotheisEnToStavro.name
ltx/gr_gr_cog/me.m01.d31:meMA.Ode3KathismaT.mode	@ltx/gr_gr_cog/miscellanea:misc.Mode4
ltx/gr_gr_cog/me.m01.d31:meMA.Ode3KathismaT.text	@ltx/gr_gr_cog/me.m01.d21:meMA.Ode3KathismaT.text
ltx/gr_gr_cog/me.m01.d31:meMA.Ode4C11.greekmelody	@ltx/gr_gr_cog/he.h.m4:heHE.EparthentaSeIdousa.greekname
ltx/gr_gr_cog/me.m01.d31:meMA.Ode4C11.incipit	Ἡ ἀνέσπερος τῆς χάριτος φωταυγία…
ltx/gr_gr_cog/me.m01.d31:meMA.Ode4C11.melody	@ltx/gr_gr_cog/he.h.m4:heHE.EparthentaSeIdousa.name
ltx/gr_gr_cog/me.m01.d31:meMA.Ode4C11.mode	@ltx/gr_gr_cog/miscellanea:misc.Mode4
ltx/gr_gr_cog/me.m01.d31:meMA.Ode4C11.ode	@ltx/gr_gr_cog/miscellanea:misc.Ode4
ltx/gr_gr_cog/me.m01.d31:meMA.Ode4C11.text	Ἡ ἀνέσπερος τῆς χάριτος φωταυγία, τοῦ δυσμενοῦς κατέλυσε, φιλέσπερον πλάνην, ταύτης πολεμήτορας, φωστῆρας ἐκλάμποντας, Κῦρον Ἰωάννην τε δείξασα.
ltx/gr_gr_cog/me.m01.d31:meMA.Ode4C12.incipit	Κατεθέλχησαν τῷ ἔρωτι τῆς Τριάδος…
ltx/gr_gr_cog/me.m01.d31:meMA.Ode4C12.melody	@ltx/gr_gr_cog/he.h.m4:heHE.EparthentaSeIdousa.name
ltx/gr_gr_cog/me.m01.d31:meMA.Ode4C12.mode	@ltx/gr_gr_cog/miscellanea:misc.Mode4
ltx/gr_gr_cog/me.m01.d31:meMA.Ode4C12.ode	@ltx/gr_gr_cog/miscellanea:misc.Ode4
ltx/gr_gr_cog/me.m01.d31:meMA.Ode4C12.text	Κατεθέλχησαν τῷ ἔρωτι τῆς Τριάδος, καὶ ὑπʼ αὐτῆς οἱ Μάρτυρες σφοδρῶς ἐῤῥωσθέντες, Κῦρος Ἰωάννης τε, ἑνώσει τῇ κρείττονι, ὄργανα Θεοῦ ἀνεδείχθησαν.
ltx/gr_gr_cog/me.m01.d31:meMA.Ode4C13.incipit	Ὡς σεπτὸν ὑμῶν τὸ τέμενος…
ltx/gr_gr_cog/me.m01.d31:meMA.Ode4C13.melody	@ltx/gr_gr_cog/he.h.m4:heHE.EparthentaSeIdousa.name
ltx/gr_gr_cog/me.m01.d31:meMA.Ode4C13.mode	@ltx/gr_gr_cog/miscellanea:misc.Mode4
ltx/gr_gr_cog/me.m01.d31:meMA.Ode4C13.ode	@ltx/gr_gr_cog/miscellanea:misc.Ode4
ltx/gr_gr_cog/me.m01.d31:meMA.Ode4C13.text	Ὡς σεπτὸν ὑμῶν τὸ τέμενος θεραπεῖον, τῶν πονηρῶν πνευμάτων ἀπελαύνει τὴν λώβην, πᾶσί τε τοῖς κάμνουσιν, ἀήττητοι Μάρτυρες, χάριν ἀλεξίκακον δίδωσιν.
ltx/gr_gr_cog/me.m01.d31:meMA.Ode4C1T.incipit	Ἀπειρογάμως ἐκύησας ὦ Παρθένε, καὶ…
ltx/gr_gr_cog/me.m01.d31:meMA.Ode4C1T.melody	@ltx/gr_gr_cog/he.h.m4:heHE.EparthentaSeIdousa.name
ltx/gr_gr_cog/me.m01.d31:meMA.Ode4C1T.mode	@ltx/gr_gr_cog/miscellanea:misc.Mode4
ltx/gr_gr_cog/me.m01.d31:meMA.Ode4C1T.ode	@ltx/gr_gr_cog/miscellanea:misc.Ode4
ltx/gr_gr_cog/me.m01.d31:meMA.Ode4C1T.text	Ἀπειρογάμως ἐκύησας ὦ Παρθένε, καὶ μετὰ τόκον ὤφθης παρθενεύουσα πάλιν· ὅθεν ἀσιγήτοις φωναῖς, τὸ Χαῖρέ σοι Δέσποινα, πίστει ἀδιστάκτῳ κραυγάζομεν.
ltx/gr_gr_cog/me.m01.d31:meMA.Ode5C11.greekmelody	@ltx/gr_gr_cog/he.h.m4:heHE.SyKyrieMouFos.greekname
ltx/gr_gr_cog/me.m01.d31:meMA.Ode5C11.incipit	Σὲ Σῶτερ ἡ δυὰς τῶν…
ltx/gr_gr_cog/me.m01.d31:meMA.Ode5C11.melody	@ltx/gr_gr_cog/he.h.m4:heHE.SyKyrieMouFos.name
ltx/gr_gr_cog/me.m01.d31:meMA.Ode5C11.mode	@ltx/gr_gr_cog/miscellanea:misc.Mode4
ltx/gr_gr_cog/me.m01.d31:meMA.Ode5C11.ode	@ltx/gr_gr_cog/miscellanea:misc.Ode5
ltx/gr_gr_cog/me.m01.d31:meMA.Ode5C11.text	Σὲ Σῶτερ ἡ δυὰς τῶν Μαρτύρων ἐπόθησε, σὺ Ἅγιε ἐν Ἁγίοις, Κύρῳ καὶ Ἰωάννῃ, ἀξίως ἀναπέπαυσαι.
ltx/gr_gr_cog/me.m01.d31:meMA.Ode5C12.incipit	Σὸν ἔργον Ἀγαθέ, τοῦ ἐχθροῦ…
ltx/gr_gr_cog/me.m01.d31:meMA.Ode5C12.melody	@ltx/gr_gr_cog/he.h.m4:heHE.SyKyrieMouFos.name
ltx/gr_gr_cog/me.m01.d31:meMA.Ode5C12.mode	@ltx/gr_gr_cog/miscellanea:misc.Mode4
ltx/gr_gr_cog/me.m01.d31:meMA.Ode5C12.ode	@ltx/gr_gr_cog/miscellanea:misc.Ode5
ltx/gr_gr_cog/me.m01.d31:meMA.Ode5C12.text	Σὸν ἔργον Ἀγαθέ, τοῦ ἐχθροῦ ἡ καθαίρεσις, σὺ Μάρτυρας εὐσεβείας, τῷ Σταυρῷ ἀπειργάσω, καὶ δόξῃ ἐστεφάνωσας.
ltx/gr_gr_cog/me.m01.d31:meMA.Ode5C13.incipit	Σὲ μόνον ἀγαπᾶν, ἀπτοήτῳ φρονήματι…
ltx/gr_gr_cog/me.m01.d31:meMA.Ode5C13.melody	@ltx/gr_gr_cog/he.h.m4:heHE.SyKyrieMouFos.name
ltx/gr_gr_cog/me.m01.d31:meMA.Ode5C13.mode	@ltx/gr_gr_cog/miscellanea:misc.Mode4
ltx/gr_gr_cog/me.m01.d31:meMA.Ode5C13.ode	@ltx/gr_gr_cog/miscellanea:misc.Ode5
ltx/gr_gr_cog/me.m01.d31:meMA.Ode5C13.text	Σὲ μόνον ἀγαπᾶν, ἀπτοήτῳ φρονήματι, ἀλείψαντες τὰς Παρθένους, Ἰωάννης καὶ Κῦρος, ἀνδρείας ἀπειργάσαντο.
ltx/gr_gr_cog/me.m01.d31:meMA.Ode5C1T.incipit	Σὲ ὅπλον ἀῤῥαγές, κατʼ ἐχθρῶν…
ltx/gr_gr_cog/me.m01.d31:meMA.Ode5C1T.melody	@ltx/gr_gr_cog/he.h.m4:heHE.SyKyrieMouFos.name
ltx/gr_gr_cog/me.m01.d31:meMA.Ode5C1T.mode	@ltx/gr_gr_cog/miscellanea:misc.Mode4
ltx/gr_gr_cog/me.m01.d31:meMA.Ode5C1T.ode	@ltx/gr_gr_cog/miscellanea:misc.Ode5
ltx/gr_gr_cog/me.m01.d31:meMA.Ode5C1T.text	Σὲ ὅπλον ἀῤῥαγές, κατʼ ἐχθρῶν προβαλλόμεθα, σὲ ἄγκυραν καὶ ἐλπίδα, τῆς ἡμῶν σωτηρίας, Θεόνυμφε κεκτήμεθα.
ltx/gr_gr_cog/me.m01.d31:meMA.Ode6C11.greekmelody	@ltx/gr_gr_cog/he.h.m4:heHE.ThysoSoiMetaFonis.greekname
ltx/gr_gr_cog/me.m01.d31:meMA.Ode6C11.incipit	Θύεσθαι, ὑπὲρ Χριστοῦ οἱ Μάρτυρες…
ltx/gr_gr_cog/me.m01.d31:meMA.Ode6C11.melody	@ltx/gr_gr_cog/he.h.m4:heHE.ThysoSoiMetaFonis.name
ltx/gr_gr_cog/me.m01.d31:meMA.Ode6C11.mode	@ltx/gr_gr_cog/miscellanea:misc.Mode4
ltx/gr_gr_cog/me.m01.d31:meMA.Ode6C11.ode	@ltx/gr_gr_cog/miscellanea:misc.Ode6
ltx/gr_gr_cog/me.m01.d31:meMA.Ode6C11.text	Θύεσθαι, ὑπὲρ Χριστοῦ οἱ Μάρτυρες εἵλοντο, ἤπερ ἀλάστορι θύειν, πονηρόν τε τύραννον ἀνθαιρεῖσθαι, τοῦ δι οἶκτον, ὑπὲρ ἡμῶν τυθέντος ὡς πρόβατον.
ltx/gr_gr_cog/me.m01.d31:meMA.Ode6C12.incipit	Ἤλγησαν, οἱ ἀφειδῶς τοὺς Μάρτυρας…
ltx/gr_gr_cog/me.m01.d31:meMA.Ode6C12.melody	@ltx/gr_gr_cog/he.h.m4:heHE.ThysoSoiMetaFonis.name
ltx/gr_gr_cog/me.m01.d31:meMA.Ode6C12.mode	@ltx/gr_gr_cog/miscellanea:misc.Mode4
ltx/gr_gr_cog/me.m01.d31:meMA.Ode6C12.ode	@ltx/gr_gr_cog/miscellanea:misc.Ode6
ltx/gr_gr_cog/me.m01.d31:meMA.Ode6C12.text	Ἤλγησαν, οἱ ἀφειδῶς τοὺς Μάρτυρας ξέοντες, τοῖς ξεομένοις δὲ βέλη, αἱ πληγαὶ νηπίων ἀπετελοῦντο, παραδόξως· ἐνευροῦντο τῷ θείῳ γὰρ Πνεύματι.
ltx/gr_gr_cog/me.m01.d31:meMA.Ode6C13.incipit	Κύριον, καὶ Βασιλέα πάσης τῆς…
ltx/gr_gr_cog/me.m01.d31:meMA.Ode6C13.melody	@ltx/gr_gr_cog/he.h.m4:heHE.ThysoSoiMetaFonis.name
ltx/gr_gr_cog/me.m01.d31:meMA.Ode6C13.mode	@ltx/gr_gr_cog/miscellanea:misc.Mode4
ltx/gr_gr_cog/me.m01.d31:meMA.Ode6C13.ode	@ltx/gr_gr_cog/miscellanea:misc.Ode6
ltx/gr_gr_cog/me.m01.d31:meMA.Ode6C13.text	Κύριον, καὶ Βασιλέα πάσης τῆς κτίσεως, σὲ ὡμολόγησε πίστει, δυὰς ἡ ὁμόφρων καὶ εὐαθλήτως τοῖς ἀνόμοις, ἀντικατέστη μέχρι καὶ αἵματος.
ltx/gr_gr_cog/me.m01.d31:meMA.Ode6C14.incipit	Θανάτῳ, τὴν ἀθανασίαν εὔκλειαν ἤραντο…
ltx/gr_gr_cog/me.m01.d31:meMA.Ode6C14.melody	@ltx/gr_gr_cog/he.h.m4:heHE.ThysoSoiMetaFonis.name
ltx/gr_gr_cog/me.m01.d31:meMA.Ode6C14.mode	@ltx/gr_gr_cog/miscellanea:misc.Mode4
ltx/gr_gr_cog/me.m01.d31:meMA.Ode6C14.ode	@ltx/gr_gr_cog/miscellanea:misc.Ode6
ltx/gr_gr_cog/me.m01.d31:meMA.Ode6C14.text	Θανάτῳ, τὴν ἀθανασίαν εὔκλειαν ἤραντο, Ἀθανασία ἡ Μάρτυς, σὺν τῇ Εὐδοξίᾳ καὶ Θεοδότῃ, καὶ τῇ θείᾳ, Θεοκτίστῃ τοῖς ταύτης βλαστήμασι.
ltx/gr_gr_cog/me.m01.d31:meMA.Ode6C1T.incipit	Κατάρας, τῆς προμήτορος Εὔας τῷ…
ltx/gr_gr_cog/me.m01.d31:meMA.Ode6C1T.melody	@ltx/gr_gr_cog/he.h.m4:heHE.ThysoSoiMetaFonis.name
ltx/gr_gr_cog/me.m01.d31:meMA.Ode6C1T.mode	@ltx/gr_gr_cog/miscellanea:misc.Mode4
ltx/gr_gr_cog/me.m01.d31:meMA.Ode6C1T.ode	@ltx/gr_gr_cog/miscellanea:misc.Ode6
ltx/gr_gr_cog/me.m01.d31:meMA.Ode6C1T.text	Κατάρας, τῆς προμήτορος Εὔας τῷ τόκῳ σου, ἐλευθερούμεθα· σὺ γάρ, τὸν Χριστὸν τεκοῦσα Παρθενομῆτορ, ἀντὶ ταύτης, τὴν εὐλογίαν πᾶσιν ἐπήγασας.
ltx/gr_gr_cog/me.m01.d31:meMA.Ode6H.greekmelody	@ltx/gr_gr_cog/he.h.m4:heHE.ThysoSoiMetaFonis.greekname
ltx/gr_gr_cog/me.m01.d31:meMA.Ode6H.incipit	@ltx/gr_gr_cog/he.h.m4:heHE.ThysoSoiMetaFonis.incipit
ltx/gr_gr_cog/me.m01.d31:meMA.Ode6H.melody	@ltx/gr_gr_cog/he.h.m4:heHE.ThysoSoiMetaFonis.melody
ltx/gr_gr_cog/me.m01.d31:meMA.Ode6H.mode	@ltx/gr_gr_cog/miscellanea:misc.Mode4
ltx/gr_gr_cog/me.m01.d31:meMA.Ode6H.ode	@ltx/gr_gr_cog/miscellanea:misc.Ode6
ltx/gr_gr_cog/me.m01.d31:meMA.Ode6H.text	@ltx/gr_gr_cog/he.h.m4:heHE.ThysoSoiMetaFonis.text
ltx/gr_gr_cog/me.m01.d31:meMA.Ode7C11.greekmelody	@ltx/gr_gr_cog/he.h.m4:heHE.EnTiKaminoAvramiaioi.greekname
ltx/gr_gr_cog/me.m01.d31:meMA.Ode7C11.incipit	Ταλαντεύσαντες ὡς ἐν ῥοπῇ ζυγοῦ…
ltx/gr_gr_cog/me.m01.d31:meMA.Ode7C11.melody	@ltx/gr_gr_cog/he.h.m4:heHE.EnTiKaminoAvramiaioi.name
ltx/gr_gr_cog/me.m01.d31:meMA.Ode7C11.mode	@ltx/gr_gr_cog/miscellanea:misc.Mode4
ltx/gr_gr_cog/me.m01.d31:meMA.Ode7C11.ode	@ltx/gr_gr_cog/miscellanea:misc.Ode7
ltx/gr_gr_cog/me.m01.d31:meMA.Ode7C11.text	Ταλαντεύσαντες ὡς ἐν ῥοπῇ ζυγοῦ τὸ φρόνημα, βάρει τῆς ἀχράντου δόξης οἱ Ἀθληταί, ἀνυψούμενοι ἐκραύγαζον· Εὐλογημένος εἶ, ἐν τῷ ναῷ τῆς δόξης σου Κύριε.
ltx/gr_gr_cog/me.m01.d31:meMA.Ode7C12.incipit	Οὐκ ἀγνοοῦντες, τοῦ ἀντιπάλου τὰ…
ltx/gr_gr_cog/me.m01.d31:meMA.Ode7C12.melody	@ltx/gr_gr_cog/he.h.m4:heHE.EnTiKaminoAvramiaioi.name
ltx/gr_gr_cog/me.m01.d31:meMA.Ode7C12.mode	@ltx/gr_gr_cog/miscellanea:misc.Mode4
ltx/gr_gr_cog/me.m01.d31:meMA.Ode7C12.ode	@ltx/gr_gr_cog/miscellanea:misc.Ode7
ltx/gr_gr_cog/me.m01.d31:meMA.Ode7C12.text	Οὐκ ἀγνοοῦντες, τοῦ ἀντιπάλου τὰ νοήματα, πᾶσαν αἰκισμῶν ἰδέαν καὶ θωπειῶν, ἀποπτύσαντες οἱ Μάρτυρες· Εὐλογημένος εἶ, ἀνεβόων τῆς δόξης ὁ Κύριος.
ltx/gr_gr_cog/me.m01.d31:meMA.Ode7C13.incipit	Τῇ καρτερίᾳ, τῶν ἀλγηδόνων στεφανούμενοι…
ltx/gr_gr_cog/me.m01.d31:meMA.Ode7C13.melody	@ltx/gr_gr_cog/he.h.m4:heHE.EnTiKaminoAvramiaioi.name
ltx/gr_gr_cog/me.m01.d31:meMA.Ode7C13.mode	@ltx/gr_gr_cog/miscellanea:misc.Mode4
ltx/gr_gr_cog/me.m01.d31:meMA.Ode7C13.ode	@ltx/gr_gr_cog/miscellanea:misc.Ode7
ltx/gr_gr_cog/me.m01.d31:meMA.Ode7C13.text	Τῇ καρτερίᾳ, τῶν ἀλγηδόνων στεφανούμενοι, Κῦρος, Ἰωάννης ὄντως οἱ λατρευταί, τῆς Τριάδος ἀνεκραύγαζον· Εὐλογημένος εἶ, ἐν τῷ ναῷ τῆς δόξης σου Κύριε.
ltx/gr_gr_cog/me.m01.d31:meMA.Ode7C1T.incipit	@ltx/gr_gr_cog/oc.m4.d1:ocMA.OdeS7C1T.incipit
ltx/gr_gr_cog/me.m01.d31:meMA.Ode7C1T.melody	@ltx/gr_gr_cog/he.h.m4:heHE.EnTiKaminoAvramiaioi.name
ltx/gr_gr_cog/me.m01.d31:meMA.Ode7C1T.mode	@ltx/gr_gr_cog/miscellanea:misc.Mode4
ltx/gr_gr_cog/me.m01.d31:meMA.Ode7C1T.ode	@ltx/gr_gr_cog/miscellanea:misc.Ode7
ltx/gr_gr_cog/me.m01.d31:meMA.Ode7C1T.text	@ltx/gr_gr_cog/oc.m4.d1:ocMA.OdeS7C1T.text
ltx/gr_gr_cog/me.m01.d31:meMA.Ode8C11.greekmelody	@ltx/gr_gr_cog/he.h.m4:heHE.CheirasEkpetasasDaniil.greekname
ltx/gr_gr_cog/me.m01.d31:meMA.Ode8C11.incipit	Πρὸς ἄρνησιν μὲν οἱ ἀσεβεῖς…
ltx/gr_gr_cog/me.m01.d31:meMA.Ode8C11.melody	@ltx/gr_gr_cog/he.h.m4:heHE.CheirasEkpetasasDaniil.name
ltx/gr_gr_cog/me.m01.d31:meMA.Ode8C11.mode	@ltx/gr_gr_cog/miscellanea:misc.Mode4
ltx/gr_gr_cog/me.m01.d31:meMA.Ode8C11.ode	@ltx/gr_gr_cog/miscellanea:misc.Ode8
ltx/gr_gr_cog/me.m01.d31:meMA.Ode8C11.text	Πρὸς ἄρνησιν μὲν οἱ ἀσεβεῖς, τοῦ φύσει ὄντος Θεοῦ, ἐξεκαλοῦντο δεινῶς, ἀλλʼ οἱ ἀήττητοι Μάρτυρες, διὰ κτίσεως ὑπέφαινον, τὸν τοῦ παντὸς Δημιουργὸν ὄντα κραυγάζοντες· Εὐλογεῖτε, πάντα τὰ ἔργα Κυρίου τὸν Κύριον.
ltx/gr_gr_cog/me.m01.d31:meMA.Ode8C12.incipit	Λυσσῶντες τῇ πλάνῃ ἐμφανῶς, οἱ…
ltx/gr_gr_cog/me.m01.d31:meMA.Ode8C12.melody	@ltx/gr_gr_cog/he.h.m4:heHE.CheirasEkpetasasDaniil.name
ltx/gr_gr_cog/me.m01.d31:meMA.Ode8C12.mode	@ltx/gr_gr_cog/miscellanea:misc.Mode4
ltx/gr_gr_cog/me.m01.d31:meMA.Ode8C12.ode	@ltx/gr_gr_cog/miscellanea:misc.Ode8
ltx/gr_gr_cog/me.m01.d31:meMA.Ode8C12.text	Λυσσῶντες τῇ πλάνῃ ἐμφανῶς, οἱ τὰ ἐπίγεια, φρονοῦντες Τύραννοι, τοὺς τὸ πολίτευμα ἔχοντας, ἐν ὑψίστοις ἀκατάλυτον, διὰ θανάτου πρὸς ζωὴν ὤθουν κραυγάζοντας· Εὐλογεῖτε, πάντα τὰ ἔργα Κυρίου τὸν Κύριον.
ltx/gr_gr_cog/me.m01.d31:meMA.Ode8C13.incipit	Λείψανα Μαρτύρων ἀστραπάς, θαυμάτων ἔφαναν…
ltx/gr_gr_cog/me.m01.d31:meMA.Ode8C13.melody	@ltx/gr_gr_cog/he.h.m4:heHE.CheirasEkpetasasDaniil.name
ltx/gr_gr_cog/me.m01.d31:meMA.Ode8C13.mode	@ltx/gr_gr_cog/miscellanea:misc.Mode4
ltx/gr_gr_cog/me.m01.d31:meMA.Ode8C13.ode	@ltx/gr_gr_cog/miscellanea:misc.Ode8
ltx/gr_gr_cog/me.m01.d31:meMA.Ode8C13.text	Λείψανα Μαρτύρων ἀστραπάς, θαυμάτων ἔφαναν, τῇ οἰκουμένῃ Χριστέ, τοῦ κακοδαίμονος φάσματος, τὴν ἀπάτην θριαμβεύοντα, τοῖς δὲ βοῶσιν εὐπρεπῶς, ἰάσεις νέμοντα· Εὐλογεῖτε, πάντα τὰ ἔργα Κυρίου τὸν Κύριον.
ltx/gr_gr_cog/me.m01.d31:meMA.Ode8C1T.incipit	Ἀμήτωρ ὁ Λόγος ἐκ Πατρός…
ltx/gr_gr_cog/me.m01.d31:meMA.Ode8C1T.melody	@ltx/gr_gr_cog/he.h.m4:heHE.CheirasEkpetasasDaniil.name
ltx/gr_gr_cog/me.m01.d31:meMA.Ode8C1T.mode	@ltx/gr_gr_cog/miscellanea:misc.Mode4
ltx/gr_gr_cog/me.m01.d31:meMA.Ode8C1T.ode	@ltx/gr_gr_cog/miscellanea:misc.Ode8
ltx/gr_gr_cog/me.m01.d31:meMA.Ode8C1T.text	Ἀμήτωρ ὁ Λόγος ἐκ Πατρός, ὑπάρχων πρότερον, ἀπάτωρ γέγονεν, ἐκ σοῦ τὸ δεύτερον Πάναγνε, σαρκωθεὶς ὁ πρὶν ἀσώματος, διʼ εὐσπλαγχνίαν βουληθείς, σῶσαι τοὺς ψάλλοντας· Εὐλογεῖτε, πάντα τὰ ἔργα Κυρίου τὸν Κύριον.
ltx/gr_gr_cog/me.m01.d31:meMA.Ode8H.greekmelody	@ltx/gr_gr_cog/he.h.m4:heHE.CheirasEkpetasasDaniil.greekname
ltx/gr_gr_cog/me.m01.d31:meMA.Ode8H.incipit	@ltx/gr_gr_cog/he.h.m4:heHE.CheirasEkpetasasDaniil.incipit
ltx/gr_gr_cog/me.m01.d31:meMA.Ode8H.melody	@ltx/gr_gr_cog/he.h.m4:heHE.CheirasEkpetasasDaniil.melody
ltx/gr_gr_cog/me.m01.d31:meMA.Ode8H.mode	@ltx/gr_gr_cog/miscellanea:misc.Mode4
ltx/gr_gr_cog/me.m01.d31:meMA.Ode8H.ode	@ltx/gr_gr_cog/miscellanea:misc.Ode8
ltx/gr_gr_cog/me.m01.d31:meMA.Ode8H.text	@ltx/gr_gr_cog/he.h.m4:heHE.CheirasEkpetasasDaniil.text
ltx/gr_gr_cog/me.m01.d31:meMA.Ode9C11.greekmelody	@ltx/gr_gr_cog/he.h.m4:heHE.LithosAcheirotmitos.greekname
ltx/gr_gr_cog/me.m01.d31:meMA.Ode9C11.incipit	Ὑπήκοος μέχρι θανάτου, ἡ ξυνωρὶς…
ltx/gr_gr_cog/me.m01.d31:meMA.Ode9C11.melody	@ltx/gr_gr_cog/he.h.m4:heHE.LithosAcheirotmitos.name
ltx/gr_gr_cog/me.m01.d31:meMA.Ode9C11.mode	@ltx/gr_gr_cog/miscellanea:misc.Mode4
ltx/gr_gr_cog/me.m01.d31:meMA.Ode9C11.ode	@ltx/gr_gr_cog/miscellanea:misc.Ode9
ltx/gr_gr_cog/me.m01.d31:meMA.Ode9C11.text	Ὑπήκοος μέχρι θανάτου, ἡ ξυνωρὶς τῶν ἀηττήτων, ὤφθη Ἰωάννου καὶ Κύρου, τοῖς τοῦ Δεσπότου θείοις προστάγμασι· διὸ χερσὶ τοῦ Κτίσαντος, τὰς ἑαυτῶν ψυχὰς παρέθεντο.
ltx/gr_gr_cog/me.m01.d31:meMA.Ode9C12.incipit	Φωστῆρες ἐκλάμπουσι δύω, τὰς τῶν…
ltx/gr_gr_cog/me.m01.d31:meMA.Ode9C12.melody	@ltx/gr_gr_cog/he.h.m4:heHE.LithosAcheirotmitos.name
ltx/gr_gr_cog/me.m01.d31:meMA.Ode9C12.mode	@ltx/gr_gr_cog/miscellanea:misc.Mode4
ltx/gr_gr_cog/me.m01.d31:meMA.Ode9C12.ode	@ltx/gr_gr_cog/miscellanea:misc.Ode9
ltx/gr_gr_cog/me.m01.d31:meMA.Ode9C12.text	Φωστῆρες ἐκλάμπουσι δύω, τὰς τῶν θαυμάτων λαμπηδόνας, κρήνης ἐκ μιᾶς φωτοφόρου, τοῖς ἀσθενοῦσιν ἀπαρυόμενοι, τῆς ἀκηράτου χάριτος, οὓς ἐπαξίως μεγαλύνομεν.
ltx/gr_gr_cog/me.m01.d31:meMA.Ode9C1T.incipit	Φεῖσαί μου Χριστὲ ὅταν ἔλθῃς…
ltx/gr_gr_cog/me.m01.d31:meMA.Ode9C1T.melody	@ltx/gr_gr_cog/he.h.m4:heHE.LithosAcheirotmitos.name
ltx/gr_gr_cog/me.m01.d31:meMA.Ode9C1T.mode	@ltx/gr_gr_cog/miscellanea:misc.Mode4
ltx/gr_gr_cog/me.m01.d31:meMA.Ode9C1T.ode	@ltx/gr_gr_cog/miscellanea:misc.Ode9
ltx/gr_gr_cog/me.m01.d31:meMA.Ode9C1T.text	Φεῖσαί μου Χριστὲ ὅταν ἔλθῃς, κρῖναι τὸν κόσμον μετὰ δόξης· λῦσον τὴν ἀχλὺν τῶν παθῶν μου, ταῖς ἱκεσίαις τῆς κυησάσης σε, καὶ τῶν σεπτῶν Μαρτύρων σου, ὡς ἀγαθὸς καὶ πολυέλεος.
ltx/gr_gr_cog/me.m01.d31:meMA.Ode9C1Tr.incipit	Μονάδα μὲν θείας οὐσίας, ἀλλ’…
ltx/gr_gr_cog/me.m01.d31:meMA.Ode9C1Tr.melody	@ltx/gr_gr_cog/he.h.m4:heHE.LithosAcheirotmitos.name
ltx/gr_gr_cog/me.m01.d31:meMA.Ode9C1Tr.mode	@ltx/gr_gr_cog/miscellanea:misc.Mode4
ltx/gr_gr_cog/me.m01.d31:meMA.Ode9C1Tr.ode	@ltx/gr_gr_cog/miscellanea:misc.Ode9
ltx/gr_gr_cog/me.m01.d31:meMA.Ode9C1Tr.text	Μονάδα μὲν θείας οὐσίας, ἀλλʼ ὑποστάσεων Τριάδα, ἡ τῶν ἀηττήτων Μαρτύρων, δυὰς ἀνδρείως ἐθεολόγησε, τὸν σαρκωθέντα Λόγον δὲ ἕνα Χριστὸν ἐν δύω φύσεσι.
ltx/gr_gr_cog/me.m01.d31:meMA.Ode9H.greekmelody	@ltx/gr_gr_cog/he.h.m4:heHE.LithosAcheirotmitos.greekname
ltx/gr_gr_cog/me.m01.d31:meMA.Ode9H.incipit	@ltx/gr_gr_cog/he.h.m4:heHE.LithosAcheirotmitos.incipit
ltx/gr_gr_cog/me.m01.d31:meMA.Ode9H.melody	@ltx/gr_gr_cog/he.h.m4:heHE.LithosAcheirotmitos.melody
ltx/gr_gr_cog/me.m01.d31:meMA.Ode9H.mode	@ltx/gr_gr_cog/miscellanea:misc.Mode4
ltx/gr_gr_cog/me.m01.d31:meMA.Ode9H.ode	@ltx/gr_gr_cog/miscellanea:misc.Ode9
ltx/gr_gr_cog/me.m01.d31:meMA.Ode9H.text	@ltx/gr_gr_cog/he.h.m4:heHE.LithosAcheirotmitos.text
ltx/gr_gr_cog/me.m01.d31:meMA.Oikos1.text	Ἑαυτοὺς τῷ Θεῷ ἀναθέμενοι Ἅγιοι, πᾶσαν πεῖραν δεινῶν διʼ αὐτὸν ὑπεμείνατε, θανόντες προθύμως Μάρτυρες γενναῖοι, καὶ μετὰ τέλος, πᾶσι πηγάζετε τὰ θεῖα χαρίσματα, τοῖς ἐν ποικίλαις νόσοις ὑπάρχουσι, καὶ ὑπὸ πολλῶν ἐταζομένοις κακῶν, ὧν εἷς καὶ πρῶτος εἰμὶ ἐγὼ ὁ τάλας· τὸ σῶμα γὰρ καὶ τὴν ψυχὴν ὑπὸ τραυμάτων χαλεπῶν ὀδυνῶμαι, καὶ πίστει ὑμῖν βοῶ, ἰάσασθέ με· ὑμεῖς γὰρ θεῖοι ἰατροὶ ὑπάρχετε.
ltx/gr_gr_cog/me.m01.d31:meVE.Apolytikion1.incipit	@ltx/gr_gr_cog/oc.m5.d4:ocMA.Kathisma32.incipit
ltx/gr_gr_cog/me.m01.d31:meVE.Apolytikion1.melody	
ltx/gr_gr_cog/me.m01.d31:meVE.Apolytikion1.mode	@ltx/gr_gr_cog/miscellanea:misc.Mode5
ltx/gr_gr_cog/me.m01.d31:meVE.Apolytikion1.text	@ltx/gr_gr_cog/oc.m5.d4:ocMA.Kathisma32.text
ltx/gr_gr_cog/me.m01.d31:meVE.AposGlory.incipit	Δεῦτε τῶν Πιστῶν ὁ σύλλογος…
ltx/gr_gr_cog/me.m01.d31:meVE.AposGlory.melody	
ltx/gr_gr_cog/me.m01.d31:meVE.AposGlory.mode	@ltx/gr_gr_cog/miscellanea:misc.Mode2
ltx/gr_gr_cog/me.m01.d31:meVE.AposGlory.poet	@ltx/gr_gr_cog/poets:po.Anatoliou
ltx/gr_gr_cog/me.m01.d31:meVE.AposGlory.text	Δεῦτε τῶν Πιστῶν ὁ σύλλογος σήμερον, ὕμνοις στέψωμεν, Κῦρον σὺν τῷ Ἰωάννῃ, τοὺς ἀροτῆρας τῆς χάριτος, καὶ δοτῆρας τῶν αἰτούντων ἀφθονωτάτους· ποικιλοτρόπως γὰρ πᾶσιν, ἀνεδείχθησαν ἰατροὶ παμφαεῖς· ὅθεν καὶ πρεσβεύουσιν, ὑπὲρ τῶν ψυχῶν ἡμῶν.
ltx/gr_gr_cog/me.m01.d31:meVE.AposStavrotheotokion.greekmelody	@ltx/gr_gr_cog/he.a.m2:heAU.OteEkTouXylou.greekname
ltx/gr_gr_cog/me.m01.d31:meVE.AposStavrotheotokion.incipit	@ltx/gr_gr_cog/oc.m2.d4:ocVE.SticTheotokion.incipit
ltx/gr_gr_cog/me.m01.d31:meVE.AposStavrotheotokion.melody	@ltx/gr_gr_cog/he.a.m2:heAU.OteEkTouXylou.name
ltx/gr_gr_cog/me.m01.d31:meVE.AposStavrotheotokion.mode	@ltx/gr_gr_cog/miscellanea:misc.Mode2
ltx/gr_gr_cog/me.m01.d31:meVE.AposStavrotheotokion.text	@ltx/gr_gr_cog/oc.m2.d4:ocVE.SticTheotokion.text
ltx/gr_gr_cog/me.m01.d31:meVE.AposTheotokion.greekmelody	@ltx/gr_gr_cog/he.a.m2:heAU.OteEkTouXylou.greekname
ltx/gr_gr_cog/me.m01.d31:meVE.AposTheotokion.incipit	Σκέπη, καὶ ἀντίληψις ἡμῶν, τῶν…
ltx/gr_gr_cog/me.m01.d31:meVE.AposTheotokion.melody	@ltx/gr_gr_cog/he.a.m2:heAU.OteEkTouXylou.name
ltx/gr_gr_cog/me.m01.d31:meVE.AposTheotokion.mode	@ltx/gr_gr_cog/miscellanea:misc.Mode2
ltx/gr_gr_cog/me.m01.d31:meVE.AposTheotokion.text	Σκέπη, καὶ ἀντίληψις ἡμῶν, τῶν Χριστιανῶν σὺ ὑπάρχεις, καὶ προσφυγὴ κραταιά, Μήτηρ τοῦ Θεοῦ ἡμῶν· ἀλλὰ καὶ νῦν ὡς ἀεί, τῇ ἀγρύπνῳ δεήσει σου, μὴ παύσῃ πρεσβεύειν, σῴζεσθαι τοὺς δούλους σου ἐκ περιστάσεων, πάντων· σὲ γὰρ ἔχομεν σκέπην, θείαν μετὰ τὸν Θεὸν πάντες, οἱ Χριστιανοὶ καὶ καταφύγιον.
ltx/gr_gr_cog/me.m01.d31:meVE.SticGlory.incipit	Δυὰς μαρτύρων σήμερον ἀνέτειλεν ἡμῖν…
ltx/gr_gr_cog/me.m01.d31:meVE.SticGlory.melody	
ltx/gr_gr_cog/me.m01.d31:meVE.SticGlory.mode	@ltx/gr_gr_cog/miscellanea:misc.Mode8
ltx/gr_gr_cog/me.m01.d31:meVE.SticGlory.poet	@ltx/gr_gr_cog/poets:po.Anatoliou
ltx/gr_gr_cog/me.m01.d31:meVE.SticGlory.text	Δυὰς μαρτύρων σήμερον ἀνέτειλεν ἡμῖν, τὰς ψυχικὰς ἀλγηδόνας ἡμῶν θεραπεύουσα, Κῦρος καὶ Ἰωάννης οἱ θαυματουργοί· ὁ μὲν γὰρ ἰσάγγελον ἀσπασάμενος ἅμιλλαν, τῷ μονήρει βίῳ, μέχρι τέλους ἐνδιαπρέψας, αἵματι τοῦ Μαρτυρίου οἰκειοῦται τῷ Χριστῷ, ὁ δέ, στρατιωτικοῖς ἐνδιαπρέψας καταλόγοις, ταῖς οὐρανίαις στρατολογίαις συγκαταριθμεῖται. Διὸ ἰάσεις νέμουσι τοῖς ἐν πίστει τελοῦσι τὴν μνήμην αὐτῶν, πρεσβεύοντες ὑπὲρ τῶν ψυχῶν ἡμῶν.
ltx/gr_gr_cog/me.m01.d31:meVE.SticStavrotheotokion.greekmelody	@ltx/gr_gr_cog/he.a.m8:heAU.OiMartyresSouKyrie.greekname
ltx/gr_gr_cog/me.m01.d31:meVE.SticStavrotheotokion.incipit	@ltx/gr_gr_cog/me.m01.d23:meVE.SticStavrotheotokion.incipit
ltx/gr_gr_cog/me.m01.d31:meVE.SticStavrotheotokion.melody	@ltx/gr_gr_cog/he.a.m8:heAU.OiMartyresSouKyrie.name
ltx/gr_gr_cog/me.m01.d31:meVE.SticStavrotheotokion.mode	@ltx/gr_gr_cog/miscellanea:misc.Mode8
ltx/gr_gr_cog/me.m01.d31:meVE.SticStavrotheotokion.text	@ltx/gr_gr_cog/me.m01.d23:meVE.SticStavrotheotokion.text
ltx/gr_gr_cog/me.m01.d31:meVE.SticTheotokion.greekmelody	@ltx/gr_gr_cog/he.a.m8:heAU.OiMartyresSouKyrie.greekname
ltx/gr_gr_cog/me.m01.d31:meVE.SticTheotokion.incipit	Ἐγὼ εἰμι Πανάμωμε…
ltx/gr_gr_cog/me.m01.d31:meVE.SticTheotokion.melody	@ltx/gr_gr_cog/he.a.m8:heAU.OiMartyresSouKyrie.name
ltx/gr_gr_cog/me.m01.d31:meVE.SticTheotokion.mode	@ltx/gr_gr_cog/miscellanea:misc.Mode8
ltx/gr_gr_cog/me.m01.d31:meVE.SticTheotokion.text	Ἐγὼ εἰμι Πανάμωμε, δένδρον τὸ ἄκαρπον τοῦ θείου λόγου, καρπὸν σωτήριον μηδόλως φέρον, καὶ δειλιῶ τὴν ἐκκοπήν, μήπως εἰς τὸ πῦρ βληθῶ τὸ ἄσβεστον· ὅθεν δυσωπῶ σε. Τούτου ῥῦσαί με, δείξασα καρποφόρον, Ἄχραντε, τῷ Υἱῷ σου τῇ μεσιτείᾳ σου.
ltx/gr_gr_cog/me.m01.d31:meVE.Stichera01.greekmelody	@ltx/gr_gr_cog/he.a.m4:heAU.OsGennaionEnMartysi.greekname
ltx/gr_gr_cog/me.m01.d31:meVE.Stichera01.incipit	Ἀθληταὶ γενναιότατοι, ἰατροὶ θεοπρόβλητοι, Κῦρε…
ltx/gr_gr_cog/me.m01.d31:meVE.Stichera01.melody	@ltx/gr_gr_cog/he.a.m4:heAU.OsGennaionEnMartysi.name
ltx/gr_gr_cog/me.m01.d31:meVE.Stichera01.mode	@ltx/gr_gr_cog/miscellanea:misc.Mode4
ltx/gr_gr_cog/me.m01.d31:meVE.Stichera01.text	Ἀθληταὶ γενναιότατοι, ἰατροὶ θεοπρόβλητοι, Κῦρε Ἰωάννη τε μεγαλώνυμοι, ὡς τῶν τυράννων ὠλέσατε, τὸ θράσος τὸ ἄθεον, τοῦ νοός μου ἐκτροπάς, τυραννούσας με θραύσατε, καὶ ἰάσασθε, τῆς ψυχῆς μου τὰ πάθη, καὶ μελλούσης, ἐκλυτρώσασθέ με δίκης, τὸν Λυτρωτὴν ἱκετεύοντες.
ltx/gr_gr_cog/me.m01.d31:meVE.Stichera02.incipit	Τοῦ συνέχοντος κλύδωνος, καὶ τῆς…
ltx/gr_gr_cog/me.m01.d31:meVE.Stichera02.melody	@ltx/gr_gr_cog/he.a.m4:heAU.OsGennaionEnMartysi.name
ltx/gr_gr_cog/me.m01.d31:meVE.Stichera02.mode	@ltx/gr_gr_cog/miscellanea:misc.Mode4
ltx/gr_gr_cog/me.m01.d31:meVE.Stichera02.text	Τοῦ συνέχοντος κλύδωνος, καὶ τῆς ζάλης τῶν θλίψεων, τῆς ἐπερχομένης μοι καὶ τοῦ σώματος, τῶν ὀδυνῶν με λυτρώσασθε, κουφίζοντες Ἅγιοι, πάντα πόνον τῆς ψυχῆς, ὁρατῶς ἀοράτως τε, προσγινόμενον, ὅπως πίστει καὶ πόθῳ μακαρίζω, τὴν ὑμῶν σεπτὴν δυάδα, ὑπὲρ Τριάδος ἀθλήσασαν.
ltx/gr_gr_cog/me.m01.d31:meVE.Stichera03.incipit	Ὡς ναοὶ χρηματίσαντες, τοῦ Θεοῦ…
ltx/gr_gr_cog/me.m01.d31:meVE.Stichera03.melody	@ltx/gr_gr_cog/he.a.m4:heAU.OsGennaionEnMartysi.name
ltx/gr_gr_cog/me.m01.d31:meVE.Stichera03.mode	@ltx/gr_gr_cog/miscellanea:misc.Mode4
ltx/gr_gr_cog/me.m01.d31:meVE.Stichera03.text	Ὡς ναοὶ χρηματίσαντες, τοῦ Θεοῦ ὡραιότατοι, Κῦρε Ἰωάννη τε τὸν ναὸν ὑμῶν, πηγὴν ἰάσεων δείκνυσθε, ἐν ᾧ με προστρέχοντᾳ, ἀῤῥωστήματος παντός, ἀπαλλάξατε Ἅγιοι, εἰρηνεύοντες, τὴν ἀθλίαν ψυχήν μου ἐπηρείαις, τοῦ ἐχθροῦ ταραττομένην, καὶ τῇ κακίᾳ δουλεύουσαν.
