ltx/gr_gr_cog/sy.m10.d28:alt1.syMA.commemoration01.couplet1.title	@ltx/gr_gr_cog/titles:ti.Verses
ltx/gr_gr_cog/sy.m10.d28:alt1.syMA.commemoration01.couplet1.verse1	Σκέπη σου, Ἁγνή, σκέπεις καὶ περιθάλπεις,
ltx/gr_gr_cog/sy.m10.d28:alt1.syMA.commemoration01.couplet1.verse2	Τοὺς πίστει ἀφορῶντας πρὸς σέ, Παρθένε.
ltx/gr_gr_cog/sy.m10.d28:alt1.syMA.commemoration01.narration.p01	Ἀύπνου δοξολογίας ποτὲ ἐπιτελουμένης ἐν τῇ ἁγίᾳ σορῷ, τῇ οὔσῃ ἐν Βλαχέρναις, ἀπῄει ὁ μακάριος Ἀνδρέας ἐκεῖσε τὰ ἐξ ἔθους ποιῶν· παρῆν δὲ Ἐπιφάνιος καὶ εἷς τῶν παίδων αὐτοῦ μετʼ αὐτοῦ· καὶ ἔχων ἦθος, ἵστατο, ὡς ἡ προθυμία τόνον ἐδίδου, ποτὲ μὲν μέχρι μεσονυκτίου, ποτὲ δὲ ἕως πρωί. Τετάρτης οὖν ὥρας ἤδη οὔσης τῆς νυκτός, ὁρᾷ ὁ μακάριος Ἀνδρέας ὀφθαλμοφανῶς μεγεθεστάτην σφόδρα, παραγενομένην ἐν γυναικείῳ τῷ σχήματι ἀπὸ τῶν βασιλικῶν μετὰ φοβεροῦ ὀψικίου, ἐν οἷς ἦν καὶ ὁ τίμιος Πρόδρομος, καὶ ὁ τῆς βροντῆς υἱός, ἑκατέρωθεν χειροκρατοῦντες αὐτῆς, καὶ ἅγιοι πολλοὶ λευκοφόροι προεπορεύοντο αὐτῆς· οἱ δὲ ἐπηκολούθουν μετὰ ὑμνῳδίας καὶ ἆσμάτων πνευματικῶν. Ὡς οὖν ἦλθε πλησίον τοῦ ἄμβωνος, ἀπῄει ὁ Ὅσιος πρὸς τὸν Ἐπιφάνιον λέγων· Ὁρᾷς τὴν Κυρίαν καὶ Δέσποιναν τοῦ κόσμου; Ὁ δὲ φησίν· Ναί, Πάτερ μου πνευματικέ.
ltx/gr_gr_cog/sy.m10.d28:alt1.syMA.commemoration01.narration.p02	Καὶ τούτων ὁρώντων, κλίνασα τὰ γόνατα αὐτῆς ἐπὶ πολλὴν ὥραν προσηύχετο, δάκρυσι ῥαίνουσα τὸ θεοειδὲς αὐτῆς καὶ ἄχραντον πρόσωπον. Μετὰ δὲ τὸ προσεύξασθαι, προσῆν ἐπὶ τὸ θυσιαστήριον, δεομένη ἐκεῖσε ὑπὲρ τοῦ περιεστῶτος λαοῦ. Ὅτε οὖν ἀπηύξατο, τὸ μαφόριον αὐτῆς, ὅπερ ἐπὶ τῆς παναχράντου αὐτῆς κορυφῆς ἔφερεν, ὡς εἶδος ἀστραπῆς ὑπάρχον, καὶ ἀποτυλίξασα ἐξ αὐτῆς, τῇ ὡραίᾳ σεμνότητι ταῖς παναχράντοις χερσὶν αὐτῆς λαβοῦσα, μέγα καὶ φοβερὸν ὑπάρχον, ἐπάνω παντὸς τοῦ ἐκεῖσε ἑστῶτος λαοῦ διεπέτασεν· ὅπερ ἐπὶ ἱκανὰς ὥρας ἑώρων οἱ θαυμάσιοι ὑπεράνω τοῦ λαοῦ ἐκτεταμένον καὶ αὐγάζον δόξαν Κυρίου ὡς ἤλεκτρον. Μέχρις οὖν ἦν ἐκεῖ ἡ ὑπεραγία Θεοτόκος, ἐβλέπετο κἀκεῖνο· μετὰ δὲ τὸ ἀναχωρῆσαι αὐτήν, οὐκέτι τεθέατο· πάντως γὰρ ἦρεν αὐτὸ μεθʼ ἑαυτῆς, τὴν δὲ χάριν ἀφῆκεν τοῖς οὖσιν ἐκεῖ.
ltx/gr_gr_cog/sy.m10.d28:alt1.syMA.commemoration01.single1	Μητρὸς Θεοῖο Σκέπη Ἑλλάδα θειόφρονα καλύπτει.
ltx/gr_gr_cog/sy.m10.d28:alt1.syMA.commemoration01.text	Τῇ ΚΗʹ τοῦ αὐτοῦ μηνὸς τὴν ἀνάμνησιν ἑορτάζομεν τῆς Σκέπης τῆς Ὑπεραγίας Δεσποίνης ἡμῶν Θεοτόκου καὶ Ἀειπαρθένου Μαρίας, τῆς πάντοτε καὶ κατʼ ἐξαίρετον τρόπον σκεπούσης τὸ εὐσεβὲς ἡμῶν Ἔθνος, ὡς πάλαι ἔσκεπε τὴν Βασιλίδα τῶν πόλεων.
ltx/gr_gr_cog/sy.m10.d28:alt1.syMA.lastline	Ταῖς τῆς ἀχράντου Μητρός σου πρεσβείαις, Χριστὲ ὁ Θεός, ἐλέησον καὶ διαφύλαξον ἡμᾶς ἐξ ὁρατῶν καὶ ἀοράτων ἐχθρῶν καὶ σῶσον τὰς ψυχὰς ἡμῶν. Ἀμήν.
ltx/gr_gr_cog/sy.m10.d28:cl.syMA.commemoration01.text	[saint/com 1]
ltx/gr_gr_cog/sy.m10.d28:cl.syMA.commemoration02.text	[saint/com 2]
ltx/gr_gr_cog/sy.m10.d28:cl.syMA.commemoration03.text	[saint/com 3]
ltx/gr_gr_cog/sy.m10.d28:cl.syMA.commemoration04.text	[saint/com 4]
ltx/gr_gr_cog/sy.m10.d28:cl.syMA.commemoration05.text	[saint/com 5]
ltx/gr_gr_cog/sy.m10.d28:cl.syMA.commemoration06.text	[saint/com list]
ltx/gr_gr_cog/sy.m10.d28:syMA.commemoration01.couplet1.title	@ltx/gr_gr_cog/titles:ti.Verses
ltx/gr_gr_cog/sy.m10.d28:syMA.commemoration01.couplet1.verse1	Σὺν ἑπτὰ τέκνοις ἡ δυὰς τῶν συζύγων
ltx/gr_gr_cog/sy.m10.d28:syMA.commemoration01.couplet1.verse2	Τιμὴν τομὴν ἡγεῖτο τὴν ἐκ τοῦ ξίφους.
ltx/gr_gr_cog/sy.m10.d28:syMA.commemoration01.narration.p01	Οὗτοι οἱ Ἅγιοι, ἐν ἑνὶ οἴκῳ διάγοντες καὶ τῷ Θεῷ ἀεὶ ἐν κρυπτῷ λατρεύοντες, διεβλήθησαν καὶ παρέστησαν τῷ δικαστηρίῳ. Καὶ ἐπειδὴ τὸν μὲν Χριστὸν ὡμολόγουν, τὰ δὲ εἴδωλα ἐκωμῴδουν, κρεμασθέντες ἐξέοντο· εἶτα ὄξει δριμυτάτῳ ταῖς πληγαῖς κατεῤῥαντίζοντο καὶ πυρκαϊᾶς κάτωθεν φλογιζομένης, προσηύχοντο σιωπηρῶς ἀλλήλους ἐπαλείφοντες. Οὐ παρεῖδεν οὖν ὁ Θεὸς τὴν δέησιν αὐτῶν· Ἄγγελοι γὰρ ἀοράτως τοὺς Ἁγίους τῶν δεσμῶν ἠλευθέρουν καὶ τὴν θεραπείαν παρεῖχον· τοὺς δὲ ἀσεβεῖς ἔκπληξις καὶ φόβος κατεῖχε, καὶ ἡ φυλακὴ τοὺς Ἁγίους εἶχε. Τῇ δὲ ἑξῆς, ῥοπάλοις τύπτονται· εἶτα ἐν τροχῷ δεθέντες, τῷ δοκεῖν ἐμαστίζοντο· καὶ ἐν μηδενὶ δεινὸν πεπονθότες, βορὰ τοῖς θηρσὶ παραδίδονται. Οὕτως οἱ ἅγιοι Μάρτυρες ἀβλαβεῖς ἐκ πάντων διατηρηθέντες, λέβησιν ἐκ πίσσης παφλάζουσιν ἐμβάλλονται καὶ ὁ βρασμὸς τῆς πίσσης εἰς ὕδωρ μετεβλήθη. Ἰδόντες οὖν οἱ δυσσεβεῖς, ὅτι αἱ κολάσεις τοῖς Ἁγίοις ἀντʼ οὐδενὸς ἐλογίσθησαν, ξίφει τὰς κεφαλὰς αὐτῶν ἔτεμον.
ltx/gr_gr_cog/sy.m10.d28:syMA.commemoration01.single1	Δειρὴν ὀγδοάτῃ γε Τερέντιος εἰκάδι κάρθη.
ltx/gr_gr_cog/sy.m10.d28:syMA.commemoration01.text	Τῇ ΚΗʹ τοῦ αὐτοῦ μηνὸς μνήμη τῶν ἁγίων Μαρτύρων Τερεντίου καὶ Νεονίλλης, καὶ τῶν τέκνων αὐτῶν Νιτᾶ, Σαρβίλου, Ἱέρακος, Θεοδούλου, Φωκᾶ, Βήλης καὶ Εὐνίκης.
ltx/gr_gr_cog/sy.m10.d28:syMA.commemoration01as02.text	Τῇ αὐτῇ ἡμέρᾳ μνήμη τῶν ἁγίων Μαρτύρων Τερεντίου καὶ Νεονίλλης, καὶ τῶν τέκνων αὐτῶν Νιτᾶ, Σαρβίλου, Ἱέρακος, Θεοδούλου, Φωκᾶ, Βήλης καὶ Εὐνίκης.
ltx/gr_gr_cog/sy.m10.d28:syMA.commemoration02.couplet1.title	@ltx/gr_gr_cog/titles:ti.Verses
ltx/gr_gr_cog/sy.m10.d28:syMA.commemoration02.couplet1.verse1	Ἐπώνυμος Στέφανος οὗ φορεῖ στέφους,
ltx/gr_gr_cog/sy.m10.d28:syMA.commemoration02.couplet1.verse2	Ὃ πρακτικὴ χεὶρ ἀρετῆς οἶδε πλέκειν.
ltx/gr_gr_cog/sy.m10.d28:syMA.commemoration02.narration.p01	Οὗτος ὁ Ὅσιος, περὶ τὰ τέλη τοῦ ὀγδόου αἰῶνος ἀκμάσας, ἠγωνίσατο κατὰ τῶν αἱρέσεων· καὶ ποιητὴς ἐγένετο ἆσματικῶν Τροπαρίων, ὡς τοῦτο ἀναφέρει ὁ Γραπτὸς Θεοφάνης ἐν τῷ εἰς τὸν Ὅσιον τοῦτον μελουργηθέντι παρʼ αὐτοῦ Κανόνι.
ltx/gr_gr_cog/sy.m10.d28:syMA.commemoration02.text	Τῇ αὐτῇ ἡμέρᾳ μνήμη τοῦ ὁσίου Πατρὸς ἡμῶν Στεφάνου τοῦ Σαββαΐτου, τοῦ καὶ Ἐπισκόπου γενομένου.
ltx/gr_gr_cog/sy.m10.d28:syMA.commemoration03.couplet1.title	@ltx/gr_gr_cog/titles:ti.Verses
ltx/gr_gr_cog/sy.m10.d28:syMA.commemoration03.couplet1.verse1	Τέμνουσι Τερέντιον, ὃς βλύσας γάλα,
ltx/gr_gr_cog/sy.m10.d28:syMA.commemoration03.couplet1.verse2	Ἔδειξε καινὸν καὶ τετμημένος τέρας.
ltx/gr_gr_cog/sy.m10.d28:syMA.commemoration03.narration.p01	Οὗτοι οἱ ἅγιοι Μάρτυρες ἤθλησαν ἐπὶ Δεκίου βασιλέως καὶ Φουρτουνάτου ἡγεμόνος, ἐν Ἀφρικῇ γεννηθέντες καὶ ἀγωνισάμενοι. Τύπτονται οὖν νεύροις ὠμοῖς, εἶτα ῥάβδοις· καὶ πυρωθεῖσιν ὀβελίσκοις τὰ νῶτα καίονται· καὶ ἐπιχεομένου ὄξους σὺν ἅλμῃ, τριχίνοις ὑφάσμασιν ἀνατρίβονται· καὶ δεσμῷ μετὰ τὴν ἐρώτησιν βάλλονται καὶ γυμνοὶ σύρονται ἐπάνω πυρός. Εἶτα ξέονται καὶ εἰς βόθρον ἀποῤῥίπτονται, ὄφεων καὶ σκορπίων μεστόν· καὶ ἀβλαβεῖς διαμείναντες, ξίφει ἐτελειώθησαν.
ltx/gr_gr_cog/sy.m10.d28:syMA.commemoration03.text	Τῇ αὐτῇ ἡμέρᾳ μνήμη τῶν ἁγίων Μαρτύρων Τερεντίου, Ἀφρικανοῦ, Μαξίμου, Πομπηίου, καὶ ἑτέρων τριάκοντα ἕξ.
ltx/gr_gr_cog/sy.m10.d28:syMA.commemoration04.couplet1.title	@ltx/gr_gr_cog/titles:ti.Verses
ltx/gr_gr_cog/sy.m10.d28:syMA.commemoration04.couplet1.verse1	Εἰρηνικῶς θνῄσκουσιν εἰρήνης τέκνα,
ltx/gr_gr_cog/sy.m10.d28:syMA.commemoration04.couplet1.verse2	Φιρμιλιανὸς καὶ σὺν αὐτῷ Μελχίων.
ltx/gr_gr_cog/sy.m10.d28:syMA.commemoration04.text	Τῇ αὐτῇ ἡμέρᾳ μνήμη τοῦ ὁσίου Πατρὸς ἡμῶν Φιρμιλιανοῦ, Ἐπισκόπου Καισαρείας, καὶ Μελχίωνος σοφιστοῦ, πρεσβυτέρου Ἀντιοχείας, οἵτινες καθεῖλον Παῦλον τὸν Σαμωσατέα.
ltx/gr_gr_cog/sy.m10.d28:syMA.commemoration05.couplet1.title	@ltx/gr_gr_cog/titles:ti.Verses
ltx/gr_gr_cog/sy.m10.d28:syMA.commemoration05.couplet1.verse1	Τὴν βασιλείαν οὐρανῶν, Φεβρωνία,
ltx/gr_gr_cog/sy.m10.d28:syMA.commemoration05.couplet1.verse2	Τῆς πατρικῆς σου προκρίνεις ὡς ἀγχίνους.
ltx/gr_gr_cog/sy.m10.d28:syMA.commemoration05.couplet2.verse1	Μίξας ἐλαίῳ, Κυριακὲ παμμάκαρ,
ltx/gr_gr_cog/sy.m10.d28:syMA.commemoration05.couplet2.verse2	Σὸν αἷμα σεπτόν, μῖγμα καινὸν εἰργάσω.
ltx/gr_gr_cog/sy.m10.d28:syMA.commemoration05.narration.p01	Οὗτος μετὰ τὸ φανερῶσαι τὸν τίμιον Σταυρὸν καὶ πιστεῦσαι καὶ βαπτισθῆναι, γέγονεν Ἐπίσκοπος Ἱεροσολύμων μετὰ Μακάριον καὶ παρέτεινεν ἡ ζωὴ αὐτοῦ μέχρι τῆς βασιλείας Ἰουλιανοῦ τοῦ παραβάτου· ὃς κατὰ τῶν Περσῶν ἐκστρατεύσας, ἀπῆλθε καὶ εἰς Ἱερουσαλὴμ καὶ μαθὼν περὶ τοῦ Ἁγίου καὶ κρατήσας αὐτόν, ἑαυτῷ παρέστησε· καὶ ἀναγκάσας θῦσαι τοῖς εἰδώλοις, ἠλέγχθη παρʼ αὐτοῦ. Ὅθεν καὶ ἐκέλευσε κοπῆναι τὴν δεξιὰν αὐτοῦ χεῖρα, εἰπών· Ὅτι ἐπιστολὰς πολλὰς γράψας μετὰ τῆς χειρὸς ταύτης, πολλοὺς ἀπέστρεψας ἀπὸ τῶν θεῶν. Εἶτα ἐξέχεε μόλυβδον ἐν τῷ στόματι αὐτοῦ, καὶ μετὰ ταῦτα ἔθηκαν αὐτὸν ἐπὶ κραββάτου πεπυρακτωμένου, κατὰ πρόσωπον. Ἐλθοῦσα δὲ πρὸς αὐτὸν ἡ μήτηρ αὐτοῦ, καὶ αὐτὴ ἐκρατήθη, καὶ κρεμασθῆναι ταύτην προστάττει ἐκ τῶν τριχῶν· καὶ ξεομένη, τὸ πνεῦμα τῷ Κυρίῳ παρέθετο. Εἶτα ἐμβληθεὶς καὶ αὐτὸς εἰς λέβητα, ἐπλήγη μετὰ ξίφους, καὶ ἐτελειώθη.
ltx/gr_gr_cog/sy.m10.d28:syMA.commemoration05.text	Τῇ αὐτῇ ἡμέρᾳ μνήμη τῆς ἁγίας Φεβρωνίας, θυγατρὸς Ἡρακλείου βασιλέως· καὶ τοῦ ἁγίου Ἱερομάρτυρος Κυριακοῦ, τοῦ φανερώσαντος τὸν τίμιον Σταυρὸν ἐπὶ τῆς βασιλείας Κωνσταντίνου τοῦ Μεγάλου, καὶ Ἑλένης τῆς αὐτοῦ μητρός.
ltx/gr_gr_cog/sy.m10.d28:syMA.commemoration06.couplet1.title	@ltx/gr_gr_cog/titles:ti.Verses
ltx/gr_gr_cog/sy.m10.d28:syMA.commemoration06.couplet1.verse1	Φλεχθεῖσα σάρκα Μάρτυς Ἄννα λαμπάσιν,
ltx/gr_gr_cog/sy.m10.d28:syMA.commemoration06.couplet1.verse2	Ἀειφανὴς ὑπῆρξε λαμπὰς Κυρίου.
ltx/gr_gr_cog/sy.m10.d28:syMA.commemoration06.text	Τῇ αὐτῇ ἡμέρᾳ ἡ μήτηρ τοῦ ἁγίου Κυριακοῦ Ἄννα, λαμπάσι φλεχθεῖσα καὶ ξεσθεῖσα, ἐτελειώθη.
ltx/gr_gr_cog/sy.m10.d28:syMA.commemoration07.couplet1.title	@ltx/gr_gr_cog/titles:ti.Verses
ltx/gr_gr_cog/sy.m10.d28:syMA.commemoration07.couplet1.verse1	Ἀθανάσιε, τίς σε οὐ μὴ δοξάσει
ltx/gr_gr_cog/sy.m10.d28:syMA.commemoration07.couplet1.verse2	Ὃν Τριὰς αὐτὴν πανταχοῦ ἐδόξασεν;
ltx/gr_gr_cog/sy.m10.d28:syMA.commemoration07.text	Μνήμη τοῦ ὁσίου Πατρὸς ἡμῶν Ἀθανασίου Πατριάρχου Κωνσταντινουπόλεως, τοῦ ἐν τῷ Ἄθῳ ἀσκήσαντος.
ltx/gr_gr_cog/sy.m10.d28:syMA.commemoration08.couplet1.title	@ltx/gr_gr_cog/titles:ti.Verses
ltx/gr_gr_cog/sy.m10.d28:syMA.commemoration08.couplet1.verse1	Δὶς δύο οὐράνιοι ὁπλῖται,
ltx/gr_gr_cog/sy.m10.d28:syMA.commemoration08.couplet1.verse2	Ἐχθρὸν καταβαλόντες, εἰς οὐρανοὺς ἀνῆλθον.
ltx/gr_gr_cog/sy.m10.d28:syMA.commemoration08.text	Μνήμη τῶν ἁγίων τεσσάρων Νεομαρτύρων Ἀγγελῆ, Μανουήλ, Γεωργίου καὶ Νικολάου, τῶν ἐκ τῆς Λάμπης καὶ ἐν Ῥεθύμῃ τῆς Κρήτης μαρτυρησάντων.
ltx/gr_gr_cog/sy.m10.d28:syMA.lastline	Ταῖς τῶν Ἁγίων σου πρεσβείαις, ὁ Θεός, ἐλέησον ἡμᾶς. Ἀμήν.
