ltx/gr_gr_cog/pe.d124:peDA.commemoration.full	
ltx/gr_gr_cog/pe.d124:peDA.commemoration.short	Πέμπτη μετὰ τὴν Πεντηκοστήν
ltx/gr_gr_cog/pe.d124:peDA.dismissal	@ltx/gr_gr_cog/dismissals:dis00.pentecost
ltx/gr_gr_cog/pe.d124:peDA.insert1	
ltx/gr_gr_cog/pe.d124:peDA.insert2	
ltx/gr_gr_cog/pe.d124:peDA.note	
ltx/gr_gr_cog/pe.d124:peHO.commemorations	
ltx/gr_gr_cog/pe.d124:peHO.daytitle	
ltx/gr_gr_cog/pe.d124:peHO.description1	
ltx/gr_gr_cog/pe.d124:peHO.description2	
ltx/gr_gr_cog/pe.d124:peHO.note1	
ltx/gr_gr_cog/pe.d124:peHO.note2	
ltx/gr_gr_cog/pe.d124:peMA.AposGlory.incipit	@ltx/gr_gr_cog/pe.d120:peVE.Stichera05.incipit
ltx/gr_gr_cog/pe.d124:peMA.AposGlory.melody	@ltx/gr_gr_cog/miscellanea:misc.Idiomelon
ltx/gr_gr_cog/pe.d124:peMA.AposGlory.mode	@ltx/gr_gr_cog/miscellanea:misc.Mode2
ltx/gr_gr_cog/pe.d124:peMA.AposGlory.text	@ltx/gr_gr_cog/pe.d120:peVE.Stichera05.text
ltx/gr_gr_cog/pe.d124:peMA.Aposticha1.greekmelody	@ltx/gr_gr_cog/he.a.m4:heAU.OsGennaionEnMartysi.greekname
ltx/gr_gr_cog/pe.d124:peMA.Aposticha1.incipit	Ἡ τοῦ Πνεύματος κάθοδος…
ltx/gr_gr_cog/pe.d124:peMA.Aposticha1.melody	@ltx/gr_gr_cog/he.a.m4:heAU.OsGennaionEnMartysi.name
ltx/gr_gr_cog/pe.d124:peMA.Aposticha1.mode	@ltx/gr_gr_cog/miscellanea:misc.Mode4
ltx/gr_gr_cog/pe.d124:peMA.Aposticha1.text	Ἡ τοῦ Πνεύματος κάθοδος, Ἀποστόλους ἐφώτισεν, ἐν πυρίναις γλώσσαις νῦν, ἐποφθεῖσα αὐτοῖς· καὶ τούτους ῥήτορας ἔδειξε, τοῖς πᾶσι κηρύττοντας, τῆς Τριάδος ἀληθῆ, ὁμοφυῆ τε τὴν ἕνωσιν· ὅθεν ἅπαντα, ἐξεπλήττοντο ἔθνη, καθορῶντα, τοὺς ποτὲ ἀγροικοτάτους, τρανῶς λαλοῦντας ἀπόῤῥητα.
ltx/gr_gr_cog/pe.d124:peMA.Aposticha2.incipit	Ὑπερῴῳ καθήμενοι…
ltx/gr_gr_cog/pe.d124:peMA.Aposticha2.melody	@ltx/gr_gr_cog/he.a.m4:heAU.OsGennaionEnMartysi.name
ltx/gr_gr_cog/pe.d124:peMA.Aposticha2.mode	@ltx/gr_gr_cog/miscellanea:misc.Mode4
ltx/gr_gr_cog/pe.d124:peMA.Aposticha2.text	Ὑπερῴῳ καθήμενοι οἱ Ἀπόστολοι ἔλαβον, τοῦ ἁγίου Πνεύματος τὴν ἐνέργειαν, πνοὴν βιαίαν φοιτήσασαν, ἐν πυρίναις γλώσσαισι, καὶ ἐλάλουν ἐμφανῶς, διαφόροις διδάγμασι, προσφθεγγόμενοι, τὸν τῆς χάριτος λόγον βεβαιοῦντες, τὸν παθόντα ἑκουσίως, Χριστὸν ὑπάρχειν Θεὸν ἀληθῆ.
ltx/gr_gr_cog/pe.d124:peMA.Aposticha3.incipit	Ὡς κατέπεμψας Κύριε…
ltx/gr_gr_cog/pe.d124:peMA.Aposticha3.melody	@ltx/gr_gr_cog/he.a.m4:heAU.OsGennaionEnMartysi.name
ltx/gr_gr_cog/pe.d124:peMA.Aposticha3.mode	@ltx/gr_gr_cog/miscellanea:misc.Mode4
ltx/gr_gr_cog/pe.d124:peMA.Aposticha3.text	Ὡς κατέπεμψας Κύριε, τοῦ ἁγίου σου Πνεύματος, Ἀποστόλοις σήμερον, θείαν χάριν, καὶ νῦν, ἡμῖν παράσχου δεόμεθα, αὐγάσαι καρδίας φωτί, ἀενάως τῆς αὐτοῦ, ἐπελεύσεως, ὅπως σαφῶς, τὸν τρισάγιον, ἐν φωναῖς ἀσιγήτοις, αἶνον πάντες, ἀναπὲμψωμεν ὑμνοῦντες, Τριάδα φύσει ἀχώριστον.
ltx/gr_gr_cog/pe.d124:peMA.Kathisma11.greekmelody	@ltx/gr_gr_cog/he.a.m1:heAU.TonTafonSouSotir.greekname
ltx/gr_gr_cog/pe.d124:peMA.Kathisma11.incipit	Ἰδοὺ προφητικαί…
ltx/gr_gr_cog/pe.d124:peMA.Kathisma11.melody	@ltx/gr_gr_cog/he.a.m1:heAU.TonTafonSouSotir.name
ltx/gr_gr_cog/pe.d124:peMA.Kathisma11.mode	@ltx/gr_gr_cog/miscellanea:misc.Mode1
ltx/gr_gr_cog/pe.d124:peMA.Kathisma11.text	Ἰδοὺ προφητικαί, περαιοῦνται προῤῥήσεις· ὁ τούτους γὰρ αὐγαῖς, ἀμυδραῖς ἐκκαλύψας, μελλόντων τὴν δήλωσιν, ὡς Θεὸς ὁ Παράκλητος, νῦν ἐκκέχυται, τοῖς Ἀποστόλοις πλουσίως· διὰ τούτων δέ, καὶ τοῖς πιστῶς προσκυνοῦσι, Τριάδα τὴν ἄκτιστον.
ltx/gr_gr_cog/pe.d124:peMA.Kathisma21.greekmelody	@ltx/gr_gr_cog/he.a.m5:heAU.TonSynanarchonLogon.greekname
ltx/gr_gr_cog/pe.d124:peMA.Kathisma21.incipit	Ἡ τοῦ Πνεύματος αἴγλη…
ltx/gr_gr_cog/pe.d124:peMA.Kathisma21.melody	@ltx/gr_gr_cog/he.a.m5:heAU.TonSynanarchonLogon.name
ltx/gr_gr_cog/pe.d124:peMA.Kathisma21.mode	@ltx/gr_gr_cog/miscellanea:misc.Mode5
ltx/gr_gr_cog/pe.d124:peMA.Kathisma21.text	Ἡ τοῦ Πνεύματος αἴγλη τοὺς Ἀποστόλους σου, ἐμφορήσασα Σῶτερ, φωστῆρας ἔδειξε, τὴν τῶν αἱρέσεων ἀχλύν, ἀποδιώκοντας, ἀπὸ τῆς γῆς, καὶ τῶν πιστῶν, καταφωτίζοντας ψυχάς, λατρεύειν σου τὸν Πατέρα, καὶ τὸ πανάγιον Πνεῦμα, τὸ ἁγιάζον τοὺς προσκυνοῦντάς σε.
ltx/gr_gr_cog/pe.d124:peVE.AposGlory.incipit	@ltx/gr_gr_cog/pe.d120:peVE.Stichera08.incipit
ltx/gr_gr_cog/pe.d124:peVE.AposGlory.melody	@ltx/gr_gr_cog/pe.d120:peVE.Stichera08.melody
ltx/gr_gr_cog/pe.d124:peVE.AposGlory.mode	@ltx/gr_gr_cog/pe.d120:peVE.Stichera08.mode
ltx/gr_gr_cog/pe.d124:peVE.AposGlory.text	@ltx/gr_gr_cog/pe.d120:peVE.Stichera08.text
ltx/gr_gr_cog/pe.d124:peVE.Aposticha1.greekmelody	@ltx/gr_gr_cog/he.a.m4:heAU.OsGennaionEnMartysi.greekname
ltx/gr_gr_cog/pe.d124:peVE.Aposticha1.incipit	Ὁμοδύναμον, σύνθρονον…
ltx/gr_gr_cog/pe.d124:peVE.Aposticha1.melody	@ltx/gr_gr_cog/he.a.m4:heAU.OsGennaionEnMartysi.name
ltx/gr_gr_cog/pe.d124:peVE.Aposticha1.mode	@ltx/gr_gr_cog/miscellanea:misc.Mode4
ltx/gr_gr_cog/pe.d124:peVE.Aposticha1.text	Ὁμοδύναμον, σύνθρονον, συμφυὲς καὶ συνάναρχον, τῷ Πατρί, τῷ Λόγῳ τε, Πνεῦμα ἅγιον, συμπαντουργόν, συναΐδιον, πανάγαθον, πάνταρχον, τοὺς τοῦ Λόγου Μαθητάς, ἐμφορῆσαν ἐσόφισεν, ἐν τοῖς ἔθνεσιν, ἐν φωναῖς πολυγλώσσοις καταγγέλλειν, τοῦ Θεοῦ τὰ μεγαλεῖα, καὶ τῆς Τριάδος τὰ δόγματα.
ltx/gr_gr_cog/pe.d124:peVE.Aposticha2.incipit	Τὰ τῇ μέθῃ σκοτούμενα…
ltx/gr_gr_cog/pe.d124:peVE.Aposticha2.melody	@ltx/gr_gr_cog/he.a.m4:heAU.OsGennaionEnMartysi.name
ltx/gr_gr_cog/pe.d124:peVE.Aposticha2.mode	@ltx/gr_gr_cog/miscellanea:misc.Mode4
ltx/gr_gr_cog/pe.d124:peVE.Aposticha2.text	Τὰ τῇ μέθῃ σκοτούμενα, τῆς ἀγνοίας Θεάνθρωπε, τῶν ἐθνῶν συστήματα, τὰ πολύσπορα, ὑψηγοροῦντας ἐν πνεύματι, τὰ θεῖα τοὺς Μύστας σου, πολυγλώσσοις λαλιαῖς, ἀπεκάλουν μεθύοντας, τοὺς ἐλάσαντας, τῆς ἀπάτης τὴν μέθην· ἀλλʼ ἡμεῖς σε, διʼ αὐτῶν ἐπεγνωκότες, θεολογοῦμεν σῳζόμενοι.
ltx/gr_gr_cog/pe.d124:peVE.Aposticha3.incipit	Ἡ πηγὴ ἡ ἀΐδιος…
ltx/gr_gr_cog/pe.d124:peVE.Aposticha3.melody	@ltx/gr_gr_cog/he.a.m4:heAU.OsGennaionEnMartysi.name
ltx/gr_gr_cog/pe.d124:peVE.Aposticha3.mode	@ltx/gr_gr_cog/miscellanea:misc.Mode4
ltx/gr_gr_cog/pe.d124:peVE.Aposticha3.text	Ἡ πηγὴ ἡ ἀΐδιος, ἀενάως ἡ βρύουσα, ποταμὸν ἀνέκφραστον ἀγαθότητος, ὕδωρ τὸ ζῶν ἀεὶ βλύζουσα, συμφύτως προχέουσα, ταῖς αὐτοῦ ἐπιῤῥοαῖς, τὴν ψυχήν μου κατάρδευσον, λυτρουμένη με, τῶν παθῶν τῆς καμίνου, τοῦ φλογμοῦ τε, τῶν δεινῶν πειρατηρίων, καὶ τοῦ πυρὸς τῆς κολάσεως.
ltx/gr_gr_cog/pe.d124:peVE.SticGlory.incipit	@ltx/gr_gr_cog/pe.d120:peVE.Stichera07.incipit
ltx/gr_gr_cog/pe.d124:peVE.SticGlory.melody	@ltx/gr_gr_cog/pe.d120:peVE.Stichera07.melody
ltx/gr_gr_cog/pe.d124:peVE.SticGlory.mode	@ltx/gr_gr_cog/pe.d120:peVE.Stichera07.mode
ltx/gr_gr_cog/pe.d124:peVE.SticGlory.text	@ltx/gr_gr_cog/pe.d120:peVE.Stichera07.text
ltx/gr_gr_cog/pe.d124:peVE.Stichera01.greekmelody	@ltx/gr_gr_cog/he.a.m1:heAU.TonOuranionTagmaton.greekname
ltx/gr_gr_cog/pe.d124:peVE.Stichera01.incipit	Μωσῆς ἐν ὄρει…
ltx/gr_gr_cog/pe.d124:peVE.Stichera01.melody	@ltx/gr_gr_cog/he.a.m1:heAU.TonOuranionTagmaton.name
ltx/gr_gr_cog/pe.d124:peVE.Stichera01.mode	@ltx/gr_gr_cog/miscellanea:misc.Mode1
ltx/gr_gr_cog/pe.d124:peVE.Stichera01.text	Μωσῆς ἐν ὄρει τὸν Ὄντα, πυρὶ τεθέαται· ἀλλὰ καὶ τοῖς θεόπταις, καὶ σοφοῖς Ἀποστόλοις, τὸ Πνεῦμα πυριμόρφως κάτεισι νῦν, ὡς σαφῶς ὑπεμφήνειεν, ὡς εἷς Θεὸς ὁ λαλήσας, τότε καὶ νῦν, ἐν ταυτότητι τῆς φύσεως.
ltx/gr_gr_cog/pe.d124:peVE.Stichera02.incipit	Ἐν πυριμόρφοις…
ltx/gr_gr_cog/pe.d124:peVE.Stichera02.melody	@ltx/gr_gr_cog/he.a.m1:heAU.TonOuranionTagmaton.name
ltx/gr_gr_cog/pe.d124:peVE.Stichera02.mode	@ltx/gr_gr_cog/miscellanea:misc.Mode1
ltx/gr_gr_cog/pe.d124:peVE.Stichera02.text	Ἐν πυριμόρφοις ταῖς γλώσσαις, οἱ θεοῤῥήτορες, βαπτίσματος τοῦ θείου, οἱ πρὸς ὕδωρ καλοῦντες, ῥητόρων φληναφίας, ἀθέων πυρί, τῷ τοῦ Πνεύματος ἔφλεξαν· ἀλλὰ φωτίσαις Παράκλητε καὶ ἡμᾶς, τοὺς πιστῶς θεολογοῦντάς σε.
ltx/gr_gr_cog/pe.d124:peVE.Stichera03.incipit	Καὶ τοὺς ἐν ὕλῃ Θεέ μου…
ltx/gr_gr_cog/pe.d124:peVE.Stichera03.melody	@ltx/gr_gr_cog/he.a.m1:heAU.TonOuranionTagmaton.name
ltx/gr_gr_cog/pe.d124:peVE.Stichera03.mode	@ltx/gr_gr_cog/miscellanea:misc.Mode1
ltx/gr_gr_cog/pe.d124:peVE.Stichera03.text	Καὶ τοὺς ἐν ὕλῃ Θεέ μου, σοὶ λειτουργήσαντας, προσλαβομένῳ πάχος, τὸ τῆς ὕλης ἀῤῥήτως, ὡς πάλαι τοὺς ἀΰλους, πυρὶ καινουργεῖς, φλογεροὺς τῷ τοῦ Πνεύματος. Ὡς πολυΰμνητος πέλεις, ὡς θαυμαστός, ἐν τοῖς ἔργοις σου Φιλάνθρωπε.
