ltx/gr_gr_cog/le.go.mc.d096:lemcLI.Gospel.book_abbr	@ltx/gr_gr_cog/bible:John.abbr
ltx/gr_gr_cog/le.go.mc.d096:lemcLI.Gospel.book_string	@ltx/gr_gr_cog/bible:John.text
ltx/gr_gr_cog/le.go.mc.d096:lemcLI.Gospel.chapverse	8:12 – 20
ltx/gr_gr_cog/le.go.mc.d096:lemcLI.Gospel.incipit	Ἐγώ εἰμι τὸ φῶς τοῦ κόσμου…
ltx/gr_gr_cog/le.go.mc.d096:lemcLI.Gospel.text	Εἶπεν ὁ Κύριος πρὸς τοὺς ἐληλυθότας πρὸς αὐτὸν Ἰουδαίους· ἐγώ εἰμι τὸ φῶς τοῦ κόσμου· ὁ ἀκολουθῶν ἐμοὶ οὐ μὴ περιπατήσῃ ἐν τῇ σκοτίᾳ, ἀλλ᾽ ἕξει τὸ φῶς τῆς ζωῆς. εἶπον οὖν αὐτῷ οἱ Φαρισαῖοι· σὺ περὶ σεαυτοῦ μαρτυρεῖς· ἡ μαρτυρία σου οὐκ ἔστιν ἀληθής. ἀπεκρίθη Ἰησοῦς καὶ εἶπεν αὐτοῖς· κἂν ἐγὼ μαρτυρῶ περὶ ἐμαυτοῦ, ἀληθής ἐστιν ἡ μαρτυρία μου, ὅτι οἶδα πόθεν ἦλθον καὶ ποῦ ὑπάγω· ὑμεῖς δὲ οὐκ οἴδατε πόθεν ἔρχομαι ἢ ποῦ ὑπάγω. ὑμεῖς κατὰ τὴν σάρκα κρίνετε· ἐγὼ οὐ κρίνω οὐδένα. καὶ ἐὰν κρίνω δὲ ἐγώ, ἡ κρίσις ἡ ἐμὴ ἀληθής ἐστιν, ὅτι μόνος οὐκ εἰμί, ἀλλ᾽ ἐγὼ καὶ ὁ πέμψας με πατήρ. καὶ ἐν τῷ νόμῳ δὲ τῷ ὑμετέρῳ γέγραπται ὅτι δύο ἀνθρώπων ἡ μαρτυρία ἀληθής ἐστιν. ἐγώ εἰμι ὁ μαρτυρῶν περὶ ἐμαυτοῦ, καὶ μαρτυρεῖ περὶ ἐμοῦ ὁ πέμψας με πατήρ. ἔλεγον οὖν αὐτῷ· ποῦ ἐστιν ὁ πατήρ σου; ἀπεκρίθη Ἰησοῦς· οὔτε ἐμὲ οἴδατε οὔτε τὸν πατέρα μου· εἰ ἐμὲ ᾔδειτε, καὶ τὸν πατέρα μου ᾔδειτε ἄν. Ταῦτα τὰ ῥήματα ἐλάλησεν ὁ Ἰησοῦς ἐν τῷ γαζοφυλακίῳ, διδάσκων ἐν τῷ ἱερῷ, καὶ οὐδεὶς ἐπίασεν αὐτόν, ὅτι οὔπω ἐληλύθει ἡ ὥρα αὐτοῦ.
ltx/gr_gr_cog/le.go.mc.d096:lemcLI.Gospel.title	Τῇ Πέμπτῃ τῆς Δʹ Ἑβδομάδος
ltx/gr_gr_cog/le.go.mc.d096:lemcLI.Gospel.title_abbr	Πέμπτῃ τῆς Δʹ Ἑβδομάδος
ltx/gr_gr_cog/le.go.mc.d096:lemcLI.Gospel.version	@ltx/gr_gr_cog/properties:version.designation
