ltx/gr_gr_cog/le.go.lu.d042:leluLI.Gospel.book_abbr	@ltx/gr_gr_cog/bible:Luke.abbr
ltx/gr_gr_cog/le.go.lu.d042:leluLI.Gospel.book_string	@ltx/gr_gr_cog/bible:Luke.text
ltx/gr_gr_cog/le.go.lu.d042:leluLI.Gospel.chapverse	8:27 – 39
ltx/gr_gr_cog/le.go.lu.d042:leluLI.Gospel.incipit	Ἐλθόντι τῷ Ἰησοῦ εἰς τὴν χώραν τῶν Γαδαρηνῶν…
ltx/gr_gr_cog/le.go.lu.d042:leluLI.Gospel.text	Τῷ καιρῷ ἐκείνῳ, ἐλθόντι τῷ Ἰησοῦ εἰς τὴν χώραν τῶν Γαδαρηνῶν ὑπήντησεν αὐτῷ ἀνήρ τις ἐκ τῆς πόλεως, ὃς εἶχε δαιμόνια ἐκ χρόνων ἱκανῶν, καὶ ἱμάτιον οὐκ ἐνεδιδύσκετο καὶ ἐν οἰκίᾳ οὐκ ἔμενεν, ἀλλ᾿ ἐν τοῖς μνήμασιν. ἰδὼν δὲ τὸν Ἰησοῦν καὶ ἀνακράξας προσέπεσεν αὐτῷ καὶ φωνῇ μεγάλῃ εἶπε· τί ἐμοὶ καὶ σοί, Ἰησοῦ, υἱὲ τοῦ Θεοῦ τοῦ ὑψίστου; δέομαί σου, μή με βασανίσῃς. παρήγγειλε γὰρ τῷ πνεύματι τῷ ἀκαθάρτῳ ἐξελθεῖν ἀπὸ τοῦ ἀνθρώπου. πολλοῖς γὰρ χρόνοις συνηρπάκει αὐτόν, καὶ ἐδεσμεῖτο ἁλύσεσι καὶ πέδαις φυλασσόμενος, καὶ διαρρήσσων τὰ δεσμὰ ἠλαύνετο ὑπὸ τοῦ δαίμονος εἰς τὰς ἐρήμους. ἐπηρώτησε δὲ αὐτὸν ὁ Ἰησοῦς λέγων· τί σοί ἐστιν ὄνομα; ὁ δὲ εἶπε· λεγεών· ὅτι δαιμόνια πολλὰ εἰσῆλθεν εἰς αὐτόν· καὶ παρεκάλει αὐτὸν ἵνα μὴ ἐπιτάξῃ αὐτοῖς εἰς τὴν ἄβυσσον ἀπελθεῖν. ἦν δὲ ἐκεῖ ἀγέλη χοίρων ἱκανῶν βοσκομένων ἐν τῷ ὄρει· καὶ παρεκάλουν αὐτὸν ἵνα ἐπιτρέψῃ αὐτοῖς εἰς ἐκείνους εἰσελθεῖν· καὶ ἐπέτρεψεν αὐτοῖς. ἐξελθόντα δὲ τὰ δαιμόνια ἀπὸ τοῦ ἀνθρώπου εἰσῆλθον εἰς τοὺς χοίρους, καὶ ὥρμησεν ἡ ἀγέλη κατὰ τοῦ κρημνοῦ εἰς τὴν λίμνην καὶ ἀπεπνίγη. ἰδόντες δὲ οἱ βόσκοντες τὸ γεγενημένον ἔφυγον, καὶ ἀπήγγειλαν εἰς τὴν πόλιν καὶ εἰς τοὺς ἀγρούς. ἐξῆλθον δὲ ἰδεῖν τὸ γεγονός, καὶ ἦλθον πρὸς τὸν Ἰησοῦν καὶ εὗρον καθήμενον τὸν ἄνθρωπον, ἀφ᾿ οὗ τὰ δαιμόνια ἐξεληλύθει, ἱματισμένον καὶ σωφρονοῦντα παρὰ τοὺς πόδας τοῦ Ἰησοῦ, καὶ ἐφοβήθησαν. ἀπήγγειλαν δὲ αὐτοῖς οἱ ἰδόντες πῶς ἐσώθη ὁ δαιμονισθείς. καὶ ἠρώτησαν αὐτὸν ἅπαν τὸ πλῆθος τῆς περιχώρου τῶν Γαδαρηνῶν ἀπελθεῖν ἀπ᾿ αὐτῶν, ὅτι φόβῳ μεγάλῳ συνείχοντο. αὐτὸς δὲ ἐμβὰς εἰς τὸ πλοῖον ὑπέστρεψεν. ἐδέετο δὲ αὐτοῦ ὁ ἀνήρ, ἀφ᾿ οὗ ἐξεληλύθει τὰ δαιμόνια, εἶναι σὺν αὐτῷ· ἀπέλυσε δὲ αὐτὸν ὁ Ἰησοῦς λέγων· ὑπόστρεφε εἰς τὸν οἶκόν σου καὶ διηγοῦ ὅσα ἐποίησέ σοι ὁ Θεός. καὶ ἀπῆλθε καθ᾿ ὅλην τὴν πόλιν κηρύσσων ὅσα ἐποίησεν αὐτῷ ὁ Ἰησοῦς.
ltx/gr_gr_cog/le.go.lu.d042:leluLI.Gospel.title	Κυριακῇ Ἕκτῃ τοῦ Λουκᾶ
ltx/gr_gr_cog/le.go.lu.d042:leluLI.Gospel.title_abbr	Κυριακῇ Ϛʹ Λουκᾶ
ltx/gr_gr_cog/le.go.lu.d042:leluLI.Gospel.version	@ltx/gr_gr_cog/properties:version.designation
