ltx/gr_gr_cog/le.go.mc.d156:lemcLI.Gospel.book_abbr	@ltx/gr_gr_cog/bible:Matthew.abbr
ltx/gr_gr_cog/le.go.mc.d156:lemcLI.Gospel.book_string	@ltx/gr_gr_cog/bible:Matthew.text
ltx/gr_gr_cog/le.go.mc.d156:lemcLI.Gospel.chapverse	13:10 – 23
ltx/gr_gr_cog/le.go.mc.d156:lemcLI.Gospel.incipit	Προσελθόντες οἱ μαθηταὶ τοῦ Ἰησοῦ εἶπον…
ltx/gr_gr_cog/le.go.mc.d156:lemcLI.Gospel.text	Τῷ καιρῷ ἐκείνῳ προσελθόντες οἱ μαθηταὶ τοῦ Ἰησοῦ εἶπον αὐτῷ· διατί ἐν παραβολαῖς λαλεῖς αὐτοῖς; ὁ δὲ ἀποκριθεὶς εἶπεν αὐτοῖς· ὅτι ὑμῖν δέδοται γνῶναι τὰ μυστήρια τῆς βασιλείας τῶν οὐρανῶν, ἐκείνοις δὲ οὐ δέδοται. ὅστις γὰρ ἔχει, δοθήσεται αὐτῷ καὶ περισσευθήσεται· ὅστις δὲ οὐκ ἔχει, καὶ ὃ ἔχει ἀρθήσεται ἀπ᾿ αὐτοῦ. διὰ τοῦτο ἐν παραβολαῖς αὐτοῖς λαλῶ, ἵνα βλέποντες μὴ βλέπωσι καὶ ἀκούοντες μὴ ἀκούωσι μηδὲ συνῶσι, μήποτε ἐπιστρέψωσι· καὶ τότε πληρωθήσεται αὐτοῖς ἡ προφητεία Ἡσαΐου ἡ λέγουσα· ἀκοῇ ἀκούσετε καὶ οὐ μὴ συνῆτε, καὶ βλέποντες βλέψετε καὶ οὐ μὴ ἴδητε· ἐπαχύνθη γὰρ ἡ καρδία τοῦ λαοῦ τούτου, καὶ τοῖς ὠσὶ βαρέως ἤκουσαν, καὶ τοὺς ὀφθαλμοὺς αὐτῶν ἐκάμμυσαν, μήποτε ἴδωσι τοῖς ὀφθαλμοῖς καὶ τοῖς ὠσὶν ἀκούσωσι καὶ τῇ καρδίᾳ συνῶσι καὶ ἐπιστρέψωσι, καὶ ἰάσομαι αὐτούς. Ὑμῶν δὲ μακάριοι οἱ ὀφθαλμοί, ὅτι βλέπουσι, καὶ τὰ ὦτα ὑμῶν, ὅτι ἀκούουσιν. ἀμὴν γὰρ λέγω ὑμῖν ὅτι πολλοὶ προφῆται καὶ δίκαιοι ἐπεθύμησαν ἰδεῖν ἃ βλέπετε, καὶ οὐκ εἶδον, καὶ ἀκοῦσαι ἃ ἀκούετε, καὶ οὐκ ἤκουσαν. Ὑμεῖς οὖν ἀκούσατε τὴν παραβολὴν τοῦ σπείραντος. παντὸς ἀκούοντος τὸν λόγον τῆς βασιλείας καὶ μὴ συνιέντος, ἔρχεται ὁ πονηρὸς καὶ αἴρει τὸ ἐσπαρμένον ἐν τῇ καρδίᾳ αὐτοῦ· οὗτός ἐστιν ὁ παρὰ τὴν ὁδὸν σπαρείς. ὁ δὲ ἐπὶ τὰ πετρώδη σπαρείς, οὗτός ἐστιν ὁ τὸν λόγον ἀκούων καὶ εὐθέως μετὰ χαρᾶς δεχόμενος καὶ λαμβάνων αὐτόν· οὐκ ἔχει δὲ ῥίζαν ἐν ἑαυτῷ, ἀλλὰ πρόσκαιρός ἐστι, γενομένης δὲ θλίψεως ἢ διωγμοῦ διὰ τὸν λόγον εὐθὺς σκανδαλίζεται. ὁ δὲ εἰς τὰς ἀκάνθας σπαρείς, οὗτός ἐστιν ὁ τὸν λόγον ἀκούων, καὶ ἡ μέριμνα τοῦ αἰῶνος τούτου καὶ ἡ ἀπάτη τοῦ πλούτου συμπνίγει τὸν λόγον, καὶ ἄκαρπος γίνεται. ὁ δὲ ἐπὶ τὴν γῆν τὴν καλὴν σπαρείς, οὗτός ἐστιν ὁ τὸν λόγον ἀκούων καὶ συνιῶν· ὃς δὴ καρποφορεῖ καὶ ποιεῖ ὃ μὲν ἑκατόν, ὃ δὲ ἑξήκοντα, ὃ δὲ τριάκοντα. Ὁ ἔχων ὦτα ἀκούειν ἀκουέτω.
ltx/gr_gr_cog/le.go.mc.d156:lemcLI.Gospel.title	Τῇ Δευτέρᾳ τῆς Ϛʹ Ἑβδομάδος τοῦ Ματθαίου
ltx/gr_gr_cog/le.go.mc.d156:lemcLI.Gospel.title_abbr	Δευτέρᾳ τῆς Ϛʹ Ἑβδομάδος
ltx/gr_gr_cog/le.go.mc.d156:lemcLI.Gospel.version	@ltx/gr_gr_cog/properties:version.designation
