ltx/gr_gr_cog/me.m09.d09:meDA.commemoration.first	Μνήμη τῶν Ἁγίων καὶ Δικαίων Θεοπατόρων Ἰωακεὶμ καὶ Ἄννης
ltx/gr_gr_cog/me.m09.d09:meDA.commemoration.first_name	
ltx/gr_gr_cog/me.m09.d09:meDA.commemoration.first_short	Μνήμη τῶν Ἁγίων καὶ Δικαίων Θεοπατόρων Ἰωακεὶμ καὶ Ἄννης
ltx/gr_gr_cog/me.m09.d09:meDA.commemoration.first_title	@ltx/gr_gr_cog/titles:ti.AncestorsOfGod
ltx/gr_gr_cog/me.m09.d09:meDA.commemoration.full	Μνήμη τῶν Ἁγίων καὶ Δικαίων Θεοπατόρων Ἰωακεὶμ καὶ Ἄννης, καὶ τοῦ Ἁγίου Μάρτυρος Σεβηριανοῦ
ltx/gr_gr_cog/me.m09.d09:meDA.commemoration.second_name	
ltx/gr_gr_cog/me.m09.d09:meDA.commemoration.second_title	@ltx/gr_gr_cog/titles:ti.SaintM
ltx/gr_gr_cog/me.m09.d09:meDA.date	Τῌ Θʹ ΣΕΠΤΕΜΒΡΙΟΥ
ltx/gr_gr_cog/me.m09.d09:meDA.fordate	διὰ τὴν 9ην Σεπτεμβρίου
ltx/gr_gr_cog/me.m09.d09:meDA.insert1	
ltx/gr_gr_cog/me.m09.d09:meDA.insert2	ὧν καὶ τὴν μνήμην ἐπιτελοῦμεν·
ltx/gr_gr_cog/me.m09.d09:meDA.note	
ltx/gr_gr_cog/me.m09.d09:meDA.pdfcoverdate	τῆς 9ης Σεπτεμβρίου,
ltx/gr_gr_cog/me.m09.d09:meDA.pdfheaderdate	τῆς 9ης Σεπτεμβρίου
ltx/gr_gr_cog/me.m09.d09:meHO.commemorations	
ltx/gr_gr_cog/me.m09.d09:meHO.note1	
ltx/gr_gr_cog/me.m09.d09:meHO.note2	
ltx/gr_gr_cog/me.m09.d09:meHO.number	
ltx/gr_gr_cog/me.m09.d09:meHO.rank	
ltx/gr_gr_cog/me.m09.d09:meLE.commemoration1	Μνήμη τῶν Ἁγίων καὶ Δικαίων Θεοπατόρων Ἰωακεὶμ καὶ Ἄννης.
ltx/gr_gr_cog/me.m09.d09:meLE.commemoration2	
ltx/gr_gr_cog/me.m09.d09:meLI.Kontakion1.greekmelody	@ltx/gr_gr_cog/me.m09.d09:meMA.Kontakion1.greekmelody
ltx/gr_gr_cog/me.m09.d09:meLI.Kontakion1.incipit	@ltx/gr_gr_cog/me.m09.d09:meMA.Kontakion1.incipit
ltx/gr_gr_cog/me.m09.d09:meLI.Kontakion1.melody	@ltx/gr_gr_cog/me.m09.d09:meMA.Kontakion1.melody
ltx/gr_gr_cog/me.m09.d09:meLI.Kontakion1.mode	@ltx/gr_gr_cog/me.m09.d09:meMA.Kontakion1.mode
ltx/gr_gr_cog/me.m09.d09:meLI.Kontakion1.text	@ltx/gr_gr_cog/me.m09.d09:meMA.Kontakion1.text
ltx/gr_gr_cog/me.m09.d09:meLI.MM.CommunionHymn.text	@ltx/gr_gr_cog/properties:media.key
ltx/gr_gr_cog/me.m09.d09:meLI.Megalynarion.text	
ltx/gr_gr_cog/me.m09.d09:meMA.AposGlory.incipit	Σήμερον ἡ πανάμωμος Ἁγνή, προῆλθεν…
ltx/gr_gr_cog/me.m09.d09:meMA.AposGlory.melody	Πρός τό, Σήμερον ὁ Χριστὸς ἐν Βηθλεέμ.
ltx/gr_gr_cog/me.m09.d09:meMA.AposGlory.mode	@ltx/gr_gr_cog/miscellanea:misc.Mode2
ltx/gr_gr_cog/me.m09.d09:meMA.AposGlory.text	Σήμερον ἡ πανάμωμος Ἁγνή, προῆλθεν ἐκ τῆς στείρας· σήμερον τὰ πάντα εὐφραίνονται ἐν τῇ αὐτῆς γεννήσει. Ὁ Ἀδὰμ τῶν δεσμῶν ἀπολύεται, καὶ ἡ Εὔα τῆς ἀρᾶς ἠλευθέρωται. Τὰ οὐράνια πάντα ἀγάλλονται, καὶ εἰρήνη τοῖς ἀνθρώποις βραβεύεται. Ἡμεῖς δὲ δοξολογοῦντες βοῶμεν· Δόξα ἐν ὑψίστοις Θεῷ, καὶ ἐπὶ γῆς εἰρήνη, ἐν ἀνθρώποις εὐδοκίᾳ.
ltx/gr_gr_cog/me.m09.d09:meMA.Aposticha1.greekmelody	@ltx/gr_gr_cog/he.a.m2:heAU.OikosTouEfratha.greekname
ltx/gr_gr_cog/me.m09.d09:meMA.Aposticha1.incipit	Χάρις τῷ λυτρωτῇ, καὶ πάντων…
ltx/gr_gr_cog/me.m09.d09:meMA.Aposticha1.melody	@ltx/gr_gr_cog/he.a.m2:heAU.OikosTouEfratha.name
ltx/gr_gr_cog/me.m09.d09:meMA.Aposticha1.mode	@ltx/gr_gr_cog/miscellanea:misc.Mode2
ltx/gr_gr_cog/me.m09.d09:meMA.Aposticha1.text	Χάρις τῷ λυτρωτῇ, καὶ πάντων κηδεμόνι, τῷ στεῖραν παρʼ ἐλπίδα, τεκεῖν τὴν Θεοτόκον, ἀῤῥήτως εὐδοκήσαντι.
ltx/gr_gr_cog/me.m09.d09:meMA.Aposticha2.incipit	Δεῦτε τὴν ἐκ Δαυΐδ, καὶ…
ltx/gr_gr_cog/me.m09.d09:meMA.Aposticha2.melody	@ltx/gr_gr_cog/he.a.m2:heAU.OikosTouEfratha.name
ltx/gr_gr_cog/me.m09.d09:meMA.Aposticha2.mode	@ltx/gr_gr_cog/miscellanea:misc.Mode2
ltx/gr_gr_cog/me.m09.d09:meMA.Aposticha2.text	Δεῦτε τὴν ἐκ Δαυΐδ, καὶ Ἰούδα φυεῖσαν, Θεοτόκον Μαρίαν, ἐξ ἧς ἡ σωτηρία, ἀπαύστως μεγαλύνωμεν.
ltx/gr_gr_cog/me.m09.d09:meMA.Aposticha3.incipit	Σήμερον εὐκλεῶς, ἐξʼ Ἄννης ἡ…
ltx/gr_gr_cog/me.m09.d09:meMA.Aposticha3.melody	@ltx/gr_gr_cog/he.a.m2:heAU.OikosTouEfratha.name
ltx/gr_gr_cog/me.m09.d09:meMA.Aposticha3.mode	@ltx/gr_gr_cog/miscellanea:misc.Mode2
ltx/gr_gr_cog/me.m09.d09:meMA.Aposticha3.text	Σήμερον εὐκλεῶς, ἐξʼ Ἄννης ἡ Παρθένος, ἡ φωτοφόρος πύλη, γεννᾶται παραδόξως, λαοὶ φυλαὶ σκιρτήσατε.
ltx/gr_gr_cog/me.m09.d09:meMA.C1.acrostic.notice1	οὗ ἡ Ἀκροστιχίς·
ltx/gr_gr_cog/me.m09.d09:meMA.C1.acrostic.text	Τοὺς σοὺς γονεῖς Πάναγνε μέλπω προφρόνως.
ltx/gr_gr_cog/me.m09.d09:meMA.C1.acrostic.title	Ὁ Κανὼν τῶν Ἁγίων,
ltx/gr_gr_cog/me.m09.d09:meMA.C1.title	@ltx/gr_gr_cog/titles:ti.CanonAncestorsOfGod
ltx/gr_gr_cog/me.m09.d09:meMA.C1.verse	@ltx/gr_gr_cog/prayers:pr.verse_SaintsM.text
ltx/gr_gr_cog/me.m09.d09:meMA.C2.title	@ltx/gr_gr_cog/titles:ti.CanonMartyrM
ltx/gr_gr_cog/me.m09.d09:meMA.C2.verse	@ltx/gr_gr_cog/prayers:pr.verse_SaintM.text
ltx/gr_gr_cog/me.m09.d09:meMA.Exaposteilarion1.greekmelody	@ltx/gr_gr_cog/he.a.m3:heAU.EpeskepsatoImas.greekname
ltx/gr_gr_cog/me.m09.d09:meMA.Exaposteilarion1.incipit	Ἡ τῆς Εὔας τὴν ἀράν…
ltx/gr_gr_cog/me.m09.d09:meMA.Exaposteilarion1.melody	@ltx/gr_gr_cog/he.a.m3:heAU.EpeskepsatoImas.name
ltx/gr_gr_cog/me.m09.d09:meMA.Exaposteilarion1.mode	@ltx/gr_gr_cog/miscellanea:misc.Mode3
ltx/gr_gr_cog/me.m09.d09:meMA.Exaposteilarion1.text	Ἡ τῆς Εὔας τὴν ἀράν, ἐξάρασα νῦν τίκτεται, ἐκ γηραλέων ἀκάρπων, τῆς Ἄννης καὶ Ἰωακείμ, ἣν σὺν Ἀγγέλοις ἅπαντες, κατὰ χρέος ἐν ὕμνοις, πιστοὶ εὐφημήσωμεν.
ltx/gr_gr_cog/me.m09.d09:meMA.Exaposteilarion2.greekmelody	@ltx/gr_gr_cog/he.a.m2:heAU.GynaikesAkoutisthite.greekname
ltx/gr_gr_cog/me.m09.d09:meMA.Exaposteilarion2.incipit	Ἀλείπτης ἐχρημάτισας, Μαρτύρων τεσσαράκοντα, ἀριστευσάντων…
ltx/gr_gr_cog/me.m09.d09:meMA.Exaposteilarion2.melody	@ltx/gr_gr_cog/he.a.m2:heAU.GynaikesAkoutisthite.name
ltx/gr_gr_cog/me.m09.d09:meMA.Exaposteilarion2.mode	@ltx/gr_gr_cog/miscellanea:misc.Mode2
ltx/gr_gr_cog/me.m09.d09:meMA.Exaposteilarion2.text	Ἀλείπτης ἐχρημάτισας, Μαρτύρων τεσσαράκοντα, ἀριστευσάντων ἐν λίμνῃ, παμμάκαρ Σεβηριανέ, μεθ’ ὧν ἀεὶ μνημόνευε, τῶν ἐκτελούντων ἔνδοξε, τὴν φωτοφόρον σου μνήμην, καὶ σὲ τιμώντων ἐκ πόθου, Μάρτυς Χριστοῦ ἀθλοφόρε.
ltx/gr_gr_cog/me.m09.d09:meMA.Exaposteilarion3.greekmelody	@ltx/gr_gr_cog/he.a.m2:heAU.GynaikesAkoutisthite.greekname
ltx/gr_gr_cog/me.m09.d09:meMA.Exaposteilarion3.incipit	@ltx/gr_gr_cog/me.m09.d08:meMA.Exaposteilarion2.incipit
ltx/gr_gr_cog/me.m09.d09:meMA.Exaposteilarion3.melody	@ltx/gr_gr_cog/he.a.m2:heAU.GynaikesAkoutisthite.name
ltx/gr_gr_cog/me.m09.d09:meMA.Exaposteilarion3.mode	@ltx/gr_gr_cog/miscellanea:misc.Mode2
ltx/gr_gr_cog/me.m09.d09:meMA.Exaposteilarion3.text	@ltx/gr_gr_cog/me.m09.d08:meMA.Exaposteilarion2.text
ltx/gr_gr_cog/me.m09.d09:meMA.Kathisma11.greekmelody	@ltx/gr_gr_cog/he.a.m1:heAU.TouLithouSfragisthentos.greekname
ltx/gr_gr_cog/me.m09.d09:meMA.Kathisma11.incipit	@ltx/gr_gr_cog/me.m09.d07:meMA.Kathisma11.incipit
ltx/gr_gr_cog/me.m09.d09:meMA.Kathisma11.melody	@ltx/gr_gr_cog/he.a.m1:heAU.TouLithouSfragisthentos.name
ltx/gr_gr_cog/me.m09.d09:meMA.Kathisma11.mode	@ltx/gr_gr_cog/miscellanea:misc.Mode1
ltx/gr_gr_cog/me.m09.d09:meMA.Kathisma11.text	@ltx/gr_gr_cog/me.m09.d07:meMA.Kathisma11.text
ltx/gr_gr_cog/me.m09.d09:meMA.Kathisma21.greekmelody	@ltx/gr_gr_cog/he.a.m5:heAU.TonSynanarchonLogon.greekname
ltx/gr_gr_cog/me.m09.d09:meMA.Kathisma21.incipit	@ltx/gr_gr_cog/me.m09.d07:meMA.Kathisma21.incipit
ltx/gr_gr_cog/me.m09.d09:meMA.Kathisma21.melody	@ltx/gr_gr_cog/he.a.m5:heAU.TonSynanarchonLogon.name
ltx/gr_gr_cog/me.m09.d09:meMA.Kathisma21.mode	@ltx/gr_gr_cog/miscellanea:misc.Mode5
ltx/gr_gr_cog/me.m09.d09:meMA.Kathisma21.text	@ltx/gr_gr_cog/me.m09.d07:meMA.Kathisma21.text
ltx/gr_gr_cog/me.m09.d09:meMA.Kontakion1.greekmelody	@ltx/gr_gr_cog/he.a.m2:heAU.TaAnoZiton.greekname
ltx/gr_gr_cog/me.m09.d09:meMA.Kontakion1.incipit	Εὐφραίνεται νῦν, ἡ Ἄννα τῆς…
ltx/gr_gr_cog/me.m09.d09:meMA.Kontakion1.melody	@ltx/gr_gr_cog/he.a.m2:heAU.TaAnoZiton.name
ltx/gr_gr_cog/me.m09.d09:meMA.Kontakion1.mode	@ltx/gr_gr_cog/miscellanea:misc.Mode2
ltx/gr_gr_cog/me.m09.d09:meMA.Kontakion1.text	Εὐφραίνεται νῦν, ἡ Ἄννα τῆς στειρώσεως, λυθεῖσα δεσμῶν, καὶ τρέφει τὴν πανάχραντον, συγκαλοῦσα ἅπαντας ἀνυμνῆσαι τὸν δωρησάμενον, ἐκ νηδύος αὐτῆς τοιῖς βροτοῖς, τὴν μόνην Μητέρα καὶ ἀπείρανδρον.
ltx/gr_gr_cog/me.m09.d09:meMA.Ode1C11.greekmelody	@ltx/gr_gr_cog/he.h.m2:heHE.EnVythoKatestrose.greekname
ltx/gr_gr_cog/me.m09.d09:meMA.Ode1C11.incipit	Τὴν λαμπάδα τὴν τὸν νοητόν…
ltx/gr_gr_cog/me.m09.d09:meMA.Ode1C11.melody	@ltx/gr_gr_cog/he.h.m2:heHE.EnVythoKatestrose.name
ltx/gr_gr_cog/me.m09.d09:meMA.Ode1C11.mode	@ltx/gr_gr_cog/miscellanea:misc.Mode2
ltx/gr_gr_cog/me.m09.d09:meMA.Ode1C11.ode	@ltx/gr_gr_cog/miscellanea:misc.Ode1
ltx/gr_gr_cog/me.m09.d09:meMA.Ode1C11.text	Τὴν λαμπάδα τὴν τὸν νοητόν, ἥλιον ἀστράψασαν, σωματικῶς ἐξ αὐτῆς ἀνατείλαντα, ἀρετῆς λαμπρότησι, διαπρέποντες ἐκτεκεῖν ἠξιώθησαν, Ἄννα ἡ θεόφρων, καὶ Ἰωακείμ ὁ παναοίδιμος.
ltx/gr_gr_cog/me.m09.d09:meMA.Ode1C12.incipit	Ὁλοτρόπῳ νεύσει πρὸς Θεόν, ὄντως…
ltx/gr_gr_cog/me.m09.d09:meMA.Ode1C12.melody	@ltx/gr_gr_cog/he.h.m2:heHE.EnVythoKatestrose.name
ltx/gr_gr_cog/me.m09.d09:meMA.Ode1C12.mode	@ltx/gr_gr_cog/miscellanea:misc.Mode2
ltx/gr_gr_cog/me.m09.d09:meMA.Ode1C12.ode	@ltx/gr_gr_cog/miscellanea:misc.Ode1
ltx/gr_gr_cog/me.m09.d09:meMA.Ode1C12.text	Ὁλοτρόπῳ νεύσει πρὸς Θεόν, ὄντως ὁ θεόληπτος, Ἰωακεὶμ καὶ ἡ Ἄννα ἡ ἔνθεος, ἀκλινῶς προσέχοντες, τὴν πανάχραντον Θεοτόκον ἐκύησαν, τὴν ὑπερκειμένην, κτίσεως ἀπάσης ἁγιότητι.
ltx/gr_gr_cog/me.m09.d09:meMA.Ode1C13.incipit	Ὑπερτέραν ἔχοντες ζωήν, βίου τε…
ltx/gr_gr_cog/me.m09.d09:meMA.Ode1C13.melody	@ltx/gr_gr_cog/he.h.m2:heHE.EnVythoKatestrose.name
ltx/gr_gr_cog/me.m09.d09:meMA.Ode1C13.mode	@ltx/gr_gr_cog/miscellanea:misc.Mode2
ltx/gr_gr_cog/me.m09.d09:meMA.Ode1C13.ode	@ltx/gr_gr_cog/miscellanea:misc.Ode1
ltx/gr_gr_cog/me.m09.d09:meMA.Ode1C13.text	Ὑπερτέραν ἔχοντες ζωήν, βίου τε λαμπρότητα, πάντων ὁμοῦ γεννητόρων γεγόνατε, γηγενῶν ὑπέρτεροι, τὴν ἀκήρατον Παρθένον ὡς γεννήσαντες, καὶ Θεοῦ πατέρες, ὄντως διὰ ταύτης χρηματίσαντες.
ltx/gr_gr_cog/me.m09.d09:meMA.Ode1C14.incipit	Σωτηρίας πάσης ἀρχηγοί, ὁ μακαριώτατος…
ltx/gr_gr_cog/me.m09.d09:meMA.Ode1C14.melody	@ltx/gr_gr_cog/he.h.m2:heHE.EnVythoKatestrose.name
ltx/gr_gr_cog/me.m09.d09:meMA.Ode1C14.mode	@ltx/gr_gr_cog/miscellanea:misc.Mode2
ltx/gr_gr_cog/me.m09.d09:meMA.Ode1C14.ode	@ltx/gr_gr_cog/miscellanea:misc.Ode1
ltx/gr_gr_cog/me.m09.d09:meMA.Ode1C14.text	Σωτηρίας πάσης ἀρχηγοί, ὁ μακαριώτατος, Ἰωακεὶμ καὶ ἡ Ἄννα ἡ ἔνδοξος, τὴν ἁγνὴν καὶ ἄμωμον, καὶ πανάχραντον Θεοτόκον ἐγέννησαν, τῆς θεοσεβείας, ταύτην εἰληφότες τὴν ἀντίδοσιν.
ltx/gr_gr_cog/me.m09.d09:meMA.Ode1C21.greekmelody	@ltx/gr_gr_cog/he.h.m8:heHE.YgranDiodefsas.greekname
ltx/gr_gr_cog/me.m09.d09:meMA.Ode1C21.incipit	Ἐκράτει τὸ δόγμα τὸ δυσσεβές…
ltx/gr_gr_cog/me.m09.d09:meMA.Ode1C21.melody	@ltx/gr_gr_cog/he.h.m8:heHE.YgranDiodefsas.name
ltx/gr_gr_cog/me.m09.d09:meMA.Ode1C21.mode	@ltx/gr_gr_cog/miscellanea:misc.Mode8
ltx/gr_gr_cog/me.m09.d09:meMA.Ode1C21.ode	@ltx/gr_gr_cog/miscellanea:misc.Ode1
ltx/gr_gr_cog/me.m09.d09:meMA.Ode1C21.text	Ἐκράτει τὸ δόγμα τὸ δυσσεβές, τὸ θύειν εἰδώλοις, τοῖς ἀψύχοις τε καὶ κωφοῖς· ἐνίκα Χριστὸς δέ, τῶν Μαρτύρων, ταῖς καρτεραῖς καὶ γενναίαις ἐνστάσεσιν.
ltx/gr_gr_cog/me.m09.d09:meMA.Ode1C22.incipit	Ἐλύττα Λυσίας κατὰ Χριστοῦ, καὶ…
ltx/gr_gr_cog/me.m09.d09:meMA.Ode1C22.melody	@ltx/gr_gr_cog/he.h.m8:heHE.YgranDiodefsas.name
ltx/gr_gr_cog/me.m09.d09:meMA.Ode1C22.mode	@ltx/gr_gr_cog/miscellanea:misc.Mode8
ltx/gr_gr_cog/me.m09.d09:meMA.Ode1C22.ode	@ltx/gr_gr_cog/miscellanea:misc.Ode1
ltx/gr_gr_cog/me.m09.d09:meMA.Ode1C22.text	Ἐλύττα Λυσίας κατὰ Χριστοῦ, καὶ πάντας οὓς εὗρε, σεβομένους αὐτὸν Θεόν, παντοίως κολάζειν ἐπεχείρει· ἀλλʼ ἐντυχών σοι θεόφρον ᾐσχύνετο.
ltx/gr_gr_cog/me.m09.d09:meMA.Ode1C23.incipit	Ἐξέπληξας Μάκαρ τὸν δυσσεβῆ, γενναίως…
ltx/gr_gr_cog/me.m09.d09:meMA.Ode1C23.melody	@ltx/gr_gr_cog/he.h.m8:heHE.YgranDiodefsas.name
ltx/gr_gr_cog/me.m09.d09:meMA.Ode1C23.mode	@ltx/gr_gr_cog/miscellanea:misc.Mode8
ltx/gr_gr_cog/me.m09.d09:meMA.Ode1C23.ode	@ltx/gr_gr_cog/miscellanea:misc.Ode1
ltx/gr_gr_cog/me.m09.d09:meMA.Ode1C23.text	Ἐξέπληξας Μάκαρ τὸν δυσσεβῆ, γενναίως χωρήσας, εἰς τὸ στάδιον τῶν θεῶν, ἀπήλεγξας τούτου παῤῥησίᾳ, τὸ ἀσθενὲς καὶ σαθρὸν καὶ ἀνίσχυρον.
ltx/gr_gr_cog/me.m09.d09:meMA.Ode1C2T.incipit	Ἐχώρησας μόνη τὸν οὐρανοῖς, ἀχώρητον…
ltx/gr_gr_cog/me.m09.d09:meMA.Ode1C2T.melody	@ltx/gr_gr_cog/he.h.m8:heHE.YgranDiodefsas.name
ltx/gr_gr_cog/me.m09.d09:meMA.Ode1C2T.mode	@ltx/gr_gr_cog/miscellanea:misc.Mode8
ltx/gr_gr_cog/me.m09.d09:meMA.Ode1C2T.ode	@ltx/gr_gr_cog/miscellanea:misc.Ode1
ltx/gr_gr_cog/me.m09.d09:meMA.Ode1C2T.text	Ἐχώρησας μόνη τὸν οὐρανοῖς, ἀχώρητον Κόρη, ἐν γαστρί σου θεοπρεπῶς, οἰκήσαντα ταύτην καὶ τὴν φύσιν, τὴν τῶν βροτῶν ἐξ αὐτῆς προσλαβόμενον.
ltx/gr_gr_cog/me.m09.d09:meMA.Ode3C11.greekmelody	@ltx/gr_gr_cog/he.h.m2:heHE.EnPetraMeTisPisteos.greekname
ltx/gr_gr_cog/me.m09.d09:meMA.Ode3C11.incipit	Στειρεύουσα καὶ παίδων ἀπορουμένη, καὶ…
ltx/gr_gr_cog/me.m09.d09:meMA.Ode3C11.melody	@ltx/gr_gr_cog/he.h.m2:heHE.EnPetraMeTisPisteos.name
ltx/gr_gr_cog/me.m09.d09:meMA.Ode3C11.mode	@ltx/gr_gr_cog/miscellanea:misc.Mode2
ltx/gr_gr_cog/me.m09.d09:meMA.Ode3C11.ode	@ltx/gr_gr_cog/miscellanea:misc.Ode3
ltx/gr_gr_cog/me.m09.d09:meMA.Ode3C11.text	Στειρεύουσα καὶ παίδων ἀπορουμένη, καὶ δάκρυσι τὸν Κτίστην ἐκδυσωποῦσα, τὴν μόνην ἠξιώθης εὐλογημένην, τεκεῖν θεόληπτε, Ἄννα κραυγάζουσα· Ὡς οὐκ ἔστιν ἅγιος πλήν σου Κύριε.
ltx/gr_gr_cog/me.m09.d09:meMA.Ode3C12.incipit	Ὁ σύνοικον πλουτήσας τὴν θείαν…
ltx/gr_gr_cog/me.m09.d09:meMA.Ode3C12.melody	@ltx/gr_gr_cog/he.h.m2:heHE.EnPetraMeTisPisteos.name
ltx/gr_gr_cog/me.m09.d09:meMA.Ode3C12.mode	@ltx/gr_gr_cog/miscellanea:misc.Mode2
ltx/gr_gr_cog/me.m09.d09:meMA.Ode3C12.ode	@ltx/gr_gr_cog/miscellanea:misc.Ode3
ltx/gr_gr_cog/me.m09.d09:meMA.Ode3C12.text	Ὁ σύνοικον πλουτήσας τὴν θείαν χάριν, Ἰωακεὶμ ὁ θεῖος καὶ θεηγόρος, τὴν πρόξενον ἀνθρώποις τῆς σωτηρίας, τεκεῖν ἠξίωται, πρὸς ἣν κραυγάζομεν· Ὡς οὐκ ἔστιν ἄμεμπτος πλήν σου Δέσποινα.
ltx/gr_gr_cog/me.m09.d09:meMA.Ode3C13.incipit	Ὑμνήσωμεν τὴν πάνσεπτον ξυνωρίδα, δι’…
ltx/gr_gr_cog/me.m09.d09:meMA.Ode3C13.melody	@ltx/gr_gr_cog/he.h.m2:heHE.EnPetraMeTisPisteos.name
ltx/gr_gr_cog/me.m09.d09:meMA.Ode3C13.mode	@ltx/gr_gr_cog/miscellanea:misc.Mode2
ltx/gr_gr_cog/me.m09.d09:meMA.Ode3C13.ode	@ltx/gr_gr_cog/miscellanea:misc.Ode3
ltx/gr_gr_cog/me.m09.d09:meMA.Ode3C13.text	Ὑμνήσωμεν τὴν πάνσεπτον ξυνωρίδα, διʼ ἧς ἡμῖν ἐξέλαμψεν ἡ Παρθένος, ἡ πάντων ποιημάτων ἁγιωτέρα· Θεὸν γὰρ τέτοκε, πρὸς ὃν κραυγάζομεν· Ὡς οὐκ ἔστιν ἅγιος πλήν σου Κύριε.
ltx/gr_gr_cog/me.m09.d09:meMA.Ode3C14.incipit	Στειρώσεως τὸ ὄνειδος ἐκφυγοῦσα, γεγέννηκεν…
ltx/gr_gr_cog/me.m09.d09:meMA.Ode3C14.melody	@ltx/gr_gr_cog/he.h.m2:heHE.EnPetraMeTisPisteos.name
ltx/gr_gr_cog/me.m09.d09:meMA.Ode3C14.mode	@ltx/gr_gr_cog/miscellanea:misc.Mode2
ltx/gr_gr_cog/me.m09.d09:meMA.Ode3C14.ode	@ltx/gr_gr_cog/miscellanea:misc.Ode3
ltx/gr_gr_cog/me.m09.d09:meMA.Ode3C14.text	Στειρώσεως τὸ ὄνειδος ἐκφυγοῦσα, γεγέννηκεν ἡ Ἄννα τὴν Θεοτόκον, τὸ ὄνειδος τῆς Εὔας νῦν παραδόξως ἐξαφανίζουσαν, πρὸς ἣν κραυγάζομεν· Ὡς οὐκ ἔστιν ἄμεμπτος πλήν σου Δέσποινα.
ltx/gr_gr_cog/me.m09.d09:meMA.Ode3C21.greekmelody	@ltx/gr_gr_cog/he.h.m8:heHE.SyEiToStereoma.greekname
ltx/gr_gr_cog/me.m09.d09:meMA.Ode3C21.incipit	Ἔχαιρες τυπτόμενος, ὑπὲρ Χριστοῦ σοφὲ…
ltx/gr_gr_cog/me.m09.d09:meMA.Ode3C21.melody	@ltx/gr_gr_cog/he.h.m8:heHE.SyEiToStereoma.name
ltx/gr_gr_cog/me.m09.d09:meMA.Ode3C21.mode	@ltx/gr_gr_cog/miscellanea:misc.Mode8
ltx/gr_gr_cog/me.m09.d09:meMA.Ode3C21.ode	@ltx/gr_gr_cog/miscellanea:misc.Ode3
ltx/gr_gr_cog/me.m09.d09:meMA.Ode3C21.text	Ἔχαιρες τυπτόμενος, ὑπὲρ Χριστοῦ σοφὲ μάστιξιν, ἀνηλεῶς· εἶχες γὰρ βεβαίαν, τὴν τῶν πόνων ἀντίδοσιν.
ltx/gr_gr_cog/me.m09.d09:meMA.Ode3C22.incipit	Νεύροις συγκοπτόμενος, ὑπαλλαγῇ συχνῇ Ἔνδοξε…
ltx/gr_gr_cog/me.m09.d09:meMA.Ode3C22.melody	@ltx/gr_gr_cog/he.h.m8:heHE.SyEiToStereoma.name
ltx/gr_gr_cog/me.m09.d09:meMA.Ode3C22.mode	@ltx/gr_gr_cog/miscellanea:misc.Mode8
ltx/gr_gr_cog/me.m09.d09:meMA.Ode3C22.ode	@ltx/gr_gr_cog/miscellanea:misc.Ode3
ltx/gr_gr_cog/me.m09.d09:meMA.Ode3C22.text	Νεύροις συγκοπτόμενος, ὑπαλλαγῇ συχνῇ Ἔνδοξε, τῶν δημίων, ὥς περ ἀλλοτρίῳ, οὐκ ᾐσθάνου ἐν σώματι.
ltx/gr_gr_cog/me.m09.d09:meMA.Ode3C23.incipit	Εὗρες τὴν ἀντάμειψιν, παρὰ Χριστοῦ…
ltx/gr_gr_cog/me.m09.d09:meMA.Ode3C23.melody	@ltx/gr_gr_cog/he.h.m8:heHE.SyEiToStereoma.name
ltx/gr_gr_cog/me.m09.d09:meMA.Ode3C23.mode	@ltx/gr_gr_cog/miscellanea:misc.Mode8
ltx/gr_gr_cog/me.m09.d09:meMA.Ode3C23.ode	@ltx/gr_gr_cog/miscellanea:misc.Ode3
ltx/gr_gr_cog/me.m09.d09:meMA.Ode3C23.text	Εὗρες τὴν ἀντάμειψιν, παρὰ Χριστοῦ Σοφὲ στέφανον, ἀπολαβὼν τῆς δικαιοσύνης, καὶ χαρὰν τὴν μὴ λήγουσαν.
ltx/gr_gr_cog/me.m09.d09:meMA.Ode3C2T.incipit	Ὅλη ἡ πλησίον μου, καλὴ…
ltx/gr_gr_cog/me.m09.d09:meMA.Ode3C2T.melody	@ltx/gr_gr_cog/he.h.m8:heHE.SyEiToStereoma.name
ltx/gr_gr_cog/me.m09.d09:meMA.Ode3C2T.mode	@ltx/gr_gr_cog/miscellanea:misc.Mode8
ltx/gr_gr_cog/me.m09.d09:meMA.Ode3C2T.ode	@ltx/gr_gr_cog/miscellanea:misc.Ode3
ltx/gr_gr_cog/me.m09.d09:meMA.Ode3C2T.text	Ὅλη ἡ πλησίον μου, καλὴ καὶ ἄμωμος πέφυκε, σὲ προορῶν, ἔφη Θεοτόκε, Σολομὼν ἐν τοῖς ᾌσμασιν.
ltx/gr_gr_cog/me.m09.d09:meMA.Ode3H.greekmelody	@ltx/gr_gr_cog/he.h.m8:heHE.SyEiToStereoma.greekname
ltx/gr_gr_cog/me.m09.d09:meMA.Ode3H.incipit	@ltx/gr_gr_cog/he.h.m8:heHE.SyEiToStereoma.incipit
ltx/gr_gr_cog/me.m09.d09:meMA.Ode3H.melody	@ltx/gr_gr_cog/he.h.m8:heHE.SyEiToStereoma.melody
ltx/gr_gr_cog/me.m09.d09:meMA.Ode3H.mode	@ltx/gr_gr_cog/miscellanea:misc.Mode8
ltx/gr_gr_cog/me.m09.d09:meMA.Ode3H.ode	@ltx/gr_gr_cog/miscellanea:misc.Ode3
ltx/gr_gr_cog/me.m09.d09:meMA.Ode3H.text	@ltx/gr_gr_cog/he.h.m8:heHE.SyEiToStereoma.text
ltx/gr_gr_cog/me.m09.d09:meMA.Ode3Kathisma1.greekmelody	@ltx/gr_gr_cog/he.a.m1:heAU.TonTafonSouSotir.greekname
ltx/gr_gr_cog/me.m09.d09:meMA.Ode3Kathisma1.incipit	Ἀνδρείᾳ τὴν ψυχήν, ὡπλισμένος θεόφρον…
ltx/gr_gr_cog/me.m09.d09:meMA.Ode3Kathisma1.melody	@ltx/gr_gr_cog/he.a.m1:heAU.TonTafonSouSotir.name
ltx/gr_gr_cog/me.m09.d09:meMA.Ode3Kathisma1.mode	@ltx/gr_gr_cog/miscellanea:misc.Mode1
ltx/gr_gr_cog/me.m09.d09:meMA.Ode3Kathisma1.text	Ἀνδρείᾳ τὴν ψυχήν, ὡπλισμένος θεόφρον, ἐξέδωκας σαυτόν, εἰς ποικίλας βασάνους, τῷ πόθῳ φλεγόμενος, τοῦ Δεσπότου πανόλβιε· ὅθεν ἤλεγξας, τὴν τῶν τυράννων μανίαν, καὶ τὸν στέφανον, παρὰ Θεοῦ ἐκομίσω, τῆς νίκης τὸν ἄφθαρτον.
ltx/gr_gr_cog/me.m09.d09:meMA.Ode3Kathisma2.greekmelody	@ltx/gr_gr_cog/he.a.m5:heAU.TonSynanarchonLogon.greekname
ltx/gr_gr_cog/me.m09.d09:meMA.Ode3Kathisma2.incipit	Ἰωακεὶμ καὶ ἡ Ἄννα πανηγυρίζουσιν…
ltx/gr_gr_cog/me.m09.d09:meMA.Ode3Kathisma2.melody	@ltx/gr_gr_cog/he.a.m5:heAU.TonSynanarchonLogon.name
ltx/gr_gr_cog/me.m09.d09:meMA.Ode3Kathisma2.mode	@ltx/gr_gr_cog/miscellanea:misc.Mode5
ltx/gr_gr_cog/me.m09.d09:meMA.Ode3Kathisma2.text	Ἰωακεὶμ καὶ ἡ Ἄννα πανηγυρίζουσιν· ἐν Θεῷ γὰρ ἀξίως χάριν ἐφεύραντο, καὶ ἐγέννησαν καρπὸν τὸν θεοδόχον ναόν, τὴν Παρθένον καὶ ἁγνήν, τὴν Μητέρα τοῦ Θεοῦ, τὴν μόνην εὐλογημένην, πρεσβεύουσαν ἀενάως, εἰς τὸ σωθῆναι τὰς ψυχὰς ἡμῶν.
ltx/gr_gr_cog/me.m09.d09:meMA.Ode4C11.greekmelody	@ltx/gr_gr_cog/he.h.m2:heHE.ElilythasEkParthenou.greekname
ltx/gr_gr_cog/me.m09.d09:meMA.Ode4C11.incipit	Γηθόμενος, τὴν Παρθένον ἐκ στείρας…
ltx/gr_gr_cog/me.m09.d09:meMA.Ode4C11.melody	@ltx/gr_gr_cog/he.h.m2:heHE.ElilythasEkParthenou.name
ltx/gr_gr_cog/me.m09.d09:meMA.Ode4C11.mode	@ltx/gr_gr_cog/miscellanea:misc.Mode2
ltx/gr_gr_cog/me.m09.d09:meMA.Ode4C11.ode	@ltx/gr_gr_cog/miscellanea:misc.Ode4
ltx/gr_gr_cog/me.m09.d09:meMA.Ode4C11.text	Γηθόμενος, τὴν Παρθένον ἐκ στείρας κομίζεται, διʼ ἧς περ ἡ στείρωσις ἡ κοσμικὴ διαλέλυται, τόκῳ παρθενεύοντι, Ἰωακεὶμ ὁ θεόφρον καὶ θεόληπτος.
ltx/gr_gr_cog/me.m09.d09:meMA.Ode4C12.incipit	Ὁ προπάτωρ, τοῦ Χριστοῦ Ἰωακεὶμ…
ltx/gr_gr_cog/me.m09.d09:meMA.Ode4C12.melody	@ltx/gr_gr_cog/he.h.m2:heHE.ElilythasEkParthenou.name
ltx/gr_gr_cog/me.m09.d09:meMA.Ode4C12.mode	@ltx/gr_gr_cog/miscellanea:misc.Mode2
ltx/gr_gr_cog/me.m09.d09:meMA.Ode4C12.ode	@ltx/gr_gr_cog/miscellanea:misc.Ode4
ltx/gr_gr_cog/me.m09.d09:meMA.Ode4C12.text	Ὁ προπάτωρ, τοῦ Χριστοῦ Ἰωακεὶμ νῦν πρόκειται, ἡμῖν εἰς ἑστίασιν, πνευματικὴν ὁ πανόλβιος, ὃς τὴν Θεομήτορα, καὶ πανακήρατον Κόρην ἀπεγέννησε.
ltx/gr_gr_cog/me.m09.d09:meMA.Ode4C13.incipit	Νεκρώσεως, καὶ φθορᾶς τοὺς ἀνθρώπους…
ltx/gr_gr_cog/me.m09.d09:meMA.Ode4C13.melody	@ltx/gr_gr_cog/he.h.m2:heHE.ElilythasEkParthenou.name
ltx/gr_gr_cog/me.m09.d09:meMA.Ode4C13.mode	@ltx/gr_gr_cog/miscellanea:misc.Mode2
ltx/gr_gr_cog/me.m09.d09:meMA.Ode4C13.ode	@ltx/gr_gr_cog/miscellanea:misc.Ode4
ltx/gr_gr_cog/me.m09.d09:meMA.Ode4C13.text	Νεκρώσεως, καὶ φθορᾶς τοὺς ἀνθρώπους τὴν σῴζουσαν, ἡ χάρις προβάλλεται, τὴν ἐσομένην Μητέρα Θεοῦ, Λόγον τὸν ἀΐδιον, τὴν δεξομένην ἀφράστως σωματούμενον.
ltx/gr_gr_cog/me.m09.d09:meMA.Ode4C14.incipit	Ἐκ τῆς ῥίζης, Ἰεσσαὶ ξυνωρὶς…
ltx/gr_gr_cog/me.m09.d09:meMA.Ode4C14.melody	@ltx/gr_gr_cog/he.h.m2:heHE.ElilythasEkParthenou.name
ltx/gr_gr_cog/me.m09.d09:meMA.Ode4C14.mode	@ltx/gr_gr_cog/miscellanea:misc.Mode2
ltx/gr_gr_cog/me.m09.d09:meMA.Ode4C14.ode	@ltx/gr_gr_cog/miscellanea:misc.Ode4
ltx/gr_gr_cog/me.m09.d09:meMA.Ode4C14.text	Ἐκ τῆς ῥίζης, Ἰεσσαὶ ξυνωρὶς ἀνατέταλκεν, ἐξ ἧς ἀνεβλάστησε ῥάβδος τὸ ἄνθος ἡ φέρουσα, ὅλον με τὸν ἄνθρωπον, εὐωδιάζον τῷ μύρῳ τῆς θεότητος.
ltx/gr_gr_cog/me.m09.d09:meMA.Ode4C15.incipit	Ἴθυνόν μου, Θεοτόκε τὸν βίον…
ltx/gr_gr_cog/me.m09.d09:meMA.Ode4C15.melody	@ltx/gr_gr_cog/he.h.m2:heHE.ElilythasEkParthenou.name
ltx/gr_gr_cog/me.m09.d09:meMA.Ode4C15.mode	@ltx/gr_gr_cog/miscellanea:misc.Mode2
ltx/gr_gr_cog/me.m09.d09:meMA.Ode4C15.ode	@ltx/gr_gr_cog/miscellanea:misc.Ode4
ltx/gr_gr_cog/me.m09.d09:meMA.Ode4C15.text	Ἴθυνόν μου, Θεοτόκε τὸν βίον προστάγμασιν, ἐνθέως ῥυθμίζουσα, τοῦ σαρκωθέντος Λόγου ἐκ σοῦ, καὶ πρὸς φῶς ὁδήγησον, Παρθενομῆτορ Μαρία Θεονύμφευτε.
ltx/gr_gr_cog/me.m09.d09:meMA.Ode4C21.greekmelody	@ltx/gr_gr_cog/he.h.m8:heHE.EisakikoaKyrie.greekname
ltx/gr_gr_cog/me.m09.d09:meMA.Ode4C21.incipit	Ταῖς θωπείαις ὁ τύραννος, σοῦ…
ltx/gr_gr_cog/me.m09.d09:meMA.Ode4C21.melody	@ltx/gr_gr_cog/he.h.m8:heHE.EisakikoaKyrie.name
ltx/gr_gr_cog/me.m09.d09:meMA.Ode4C21.mode	@ltx/gr_gr_cog/miscellanea:misc.Mode8
ltx/gr_gr_cog/me.m09.d09:meMA.Ode4C21.ode	@ltx/gr_gr_cog/miscellanea:misc.Ode4
ltx/gr_gr_cog/me.m09.d09:meMA.Ode4C21.text	Ταῖς θωπείαις ὁ τύραννος, σοῦ καταμαλάττειν Μάρτυς τὸ εὔτονον, καὶ νικῆσαί σε οἰόμενος, οὐρανὸν τοξεύειν ἐνομίζετο.
ltx/gr_gr_cog/me.m09.d09:meMA.Ode4C22.incipit	Οὐκ αἰσθάνῃ παράφορε, τοῦ Χριστοῦ…
ltx/gr_gr_cog/me.m09.d09:meMA.Ode4C22.melody	@ltx/gr_gr_cog/he.h.m8:heHE.EisakikoaKyrie.name
ltx/gr_gr_cog/me.m09.d09:meMA.Ode4C22.mode	@ltx/gr_gr_cog/miscellanea:misc.Mode8
ltx/gr_gr_cog/me.m09.d09:meMA.Ode4C22.ode	@ltx/gr_gr_cog/miscellanea:misc.Ode4
ltx/gr_gr_cog/me.m09.d09:meMA.Ode4C22.text	Οὐκ αἰσθάνῃ παράφορε, τοῦ Χριστοῦ τὴν δύναμιν στερεοῦσάν με, πρὸς τοὺς πόνους καὶ τὰ σκάμματα; τῷ τυράννῳ ἔκραζες Παναοίδιμε.
ltx/gr_gr_cog/me.m09.d09:meMA.Ode4C23.incipit	Εἰ μὴ δύναμις ἄνωθεν, ἣν…
ltx/gr_gr_cog/me.m09.d09:meMA.Ode4C23.melody	@ltx/gr_gr_cog/he.h.m8:heHE.EisakikoaKyrie.name
ltx/gr_gr_cog/me.m09.d09:meMA.Ode4C23.mode	@ltx/gr_gr_cog/miscellanea:misc.Mode8
ltx/gr_gr_cog/me.m09.d09:meMA.Ode4C23.ode	@ltx/gr_gr_cog/miscellanea:misc.Ode4
ltx/gr_gr_cog/me.m09.d09:meMA.Ode4C23.text	Εἰ μὴ δύναμις ἄνωθεν, ἣν μοι δεδομένη τύραννε ἔκραζε, Σεβηριανός, πῶς ἴσχυον, σάρξ ὢν ὑπενέγκαι, ἐκτομὰς τῶν μελῶν;
ltx/gr_gr_cog/me.m09.d09:meMA.Ode4C2T.incipit	Παναγία Θεόνυμφε, δίδου μοι βοήθειαν…
ltx/gr_gr_cog/me.m09.d09:meMA.Ode4C2T.melody	@ltx/gr_gr_cog/he.h.m8:heHE.EisakikoaKyrie.name
ltx/gr_gr_cog/me.m09.d09:meMA.Ode4C2T.mode	@ltx/gr_gr_cog/miscellanea:misc.Mode8
ltx/gr_gr_cog/me.m09.d09:meMA.Ode4C2T.ode	@ltx/gr_gr_cog/miscellanea:misc.Ode4
ltx/gr_gr_cog/me.m09.d09:meMA.Ode4C2T.text	Παναγία Θεόνυμφε, δίδου μοι βοήθειαν ταῖς πρεσβείαις σου, λυτρωθῆναι τοῦ ἀλάστορος, ἵνα σε δοξάζω τὴν ἐλπίδα μου.
ltx/gr_gr_cog/me.m09.d09:meMA.Ode5C11.greekmelody	@ltx/gr_gr_cog/he.h.m2:heHE.OFotismos.greekname
ltx/gr_gr_cog/me.m09.d09:meMA.Ode5C11.incipit	Σώφρων δυάς, καθαρότητος αἴγλῃ λελαμπρυσμένη…
ltx/gr_gr_cog/me.m09.d09:meMA.Ode5C11.melody	@ltx/gr_gr_cog/he.h.m2:heHE.OFotismos.name
ltx/gr_gr_cog/me.m09.d09:meMA.Ode5C11.mode	@ltx/gr_gr_cog/miscellanea:misc.Mode2
ltx/gr_gr_cog/me.m09.d09:meMA.Ode5C11.ode	@ltx/gr_gr_cog/miscellanea:misc.Ode5
ltx/gr_gr_cog/me.m09.d09:meMA.Ode5C11.text	Σώφρων δυάς, καθαρότητος αἴγλῃ λελαμπρυσμένη, τὴν τῆς παρθενίας τῷ θείῳ φέγγει, κατακοσμοῦσαν, τὴν στειρεύουσαν φύσιν, τῶν ἀνθρώπων ἡμῖν ἐκτέτοκεν, Ἄννα καὶ Ἰωακεὶμ οἱ θεόληπτοι.
ltx/gr_gr_cog/me.m09.d09:meMA.Ode5C12.incipit	Παρθενικόν, θεοκόσμητον θρόνον τῷ τῶν…
ltx/gr_gr_cog/me.m09.d09:meMA.Ode5C12.melody	@ltx/gr_gr_cog/he.h.m2:heHE.OFotismos.name
ltx/gr_gr_cog/me.m09.d09:meMA.Ode5C12.mode	@ltx/gr_gr_cog/miscellanea:misc.Mode2
ltx/gr_gr_cog/me.m09.d09:meMA.Ode5C12.ode	@ltx/gr_gr_cog/miscellanea:misc.Ode5
ltx/gr_gr_cog/me.m09.d09:meMA.Ode5C12.text	Παρθενικόν, θεοκόσμητον θρόνον τῷ τῶν ἁπάντων, περιδεδραγμένῳ παλάμῃ θείᾳ, τῆς σωφροσύνης ἡ σεπτὴ συζυγία, καὶ θεόφρων δυὰς ἐκτέτοκεν, Ἄννα καὶ Ἰωακείμ οἱ πανεύφημοι.
ltx/gr_gr_cog/me.m09.d09:meMA.Ode5C13.incipit	Ἀνατολῆς, τῆς ἐξ ὕψους φανείσης…
ltx/gr_gr_cog/me.m09.d09:meMA.Ode5C13.melody	@ltx/gr_gr_cog/he.h.m2:heHE.OFotismos.name
ltx/gr_gr_cog/me.m09.d09:meMA.Ode5C13.mode	@ltx/gr_gr_cog/miscellanea:misc.Mode2
ltx/gr_gr_cog/me.m09.d09:meMA.Ode5C13.ode	@ltx/gr_gr_cog/miscellanea:misc.Ode5
ltx/gr_gr_cog/me.m09.d09:meMA.Ode5C13.text	Ἀνατολῆς, τῆς ἐξ ὕψους φανείσης εἰς ὁδηγίαν, τῶν πεπλανημένων τὴν φωτοφόρον, πύλην ὁ θεῖος, Ἰωακεὶμ καὶ Ἄννα, θεοφρόνως πολιτευσάμενοι, τεκεῖν οἱ θεόπται σαφῶς ἠξιώθησαν.
ltx/gr_gr_cog/me.m09.d09:meMA.Ode5C14.incipit	Νόμου καινοῦ, τὴν θεόγραφον πλάκα…
ltx/gr_gr_cog/me.m09.d09:meMA.Ode5C14.melody	@ltx/gr_gr_cog/he.h.m2:heHE.OFotismos.name
ltx/gr_gr_cog/me.m09.d09:meMA.Ode5C14.mode	@ltx/gr_gr_cog/miscellanea:misc.Mode2
ltx/gr_gr_cog/me.m09.d09:meMA.Ode5C14.ode	@ltx/gr_gr_cog/miscellanea:misc.Ode5
ltx/gr_gr_cog/me.m09.d09:meMA.Ode5C14.text	Νόμου καινοῦ, τὴν θεόγραφον πλάκα ἐν ᾗ τὴν λύσιν, τῶν ἁμαρτημάτων τοῦ πάλαι νόμου, ὁ θεῖος Λόγος προετύπωσε πρώην, ὡς ἐκ πέτρας νῦν ἐλατόμησε, νεύματι ὁ πάντων κρατῶν ἐκ στειρώσεως.
ltx/gr_gr_cog/me.m09.d09:meMA.Ode5C15.incipit	Αἴγλῃ τῇ σῇ, Θεομῆτορ τὸν…
ltx/gr_gr_cog/me.m09.d09:meMA.Ode5C15.melody	@ltx/gr_gr_cog/he.h.m2:heHE.OFotismos.name
ltx/gr_gr_cog/me.m09.d09:meMA.Ode5C15.mode	@ltx/gr_gr_cog/miscellanea:misc.Mode2
ltx/gr_gr_cog/me.m09.d09:meMA.Ode5C15.ode	@ltx/gr_gr_cog/miscellanea:misc.Ode5
ltx/gr_gr_cog/me.m09.d09:meMA.Ode5C15.text	Αἴγλῃ τῇ σῇ, Θεομῆτορ τὸν νοῦν μου καταυγασθῆναι, τὸν ἐσκοτισμένον τῇ ἁμαρτίᾳ νεῦσον Παρθένε, τῆς ἀγνοίας τὸν ζόφον, καὶ πταισμάτων ἐξαφανίζουσα· ἄλλην γὰρ ἐκτός σου φρουρὸν οὐκ ἐπίσταμαι.
ltx/gr_gr_cog/me.m09.d09:meMA.Ode5C21.greekmelody	@ltx/gr_gr_cog/he.h.m8:heHE.OrthrizontesVoomenSoi.greekname
ltx/gr_gr_cog/me.m09.d09:meMA.Ode5C21.incipit	Ἰκρίῳ ἀνηρτήθης Ἀοίδιμε, καὶ τὸ…
ltx/gr_gr_cog/me.m09.d09:meMA.Ode5C21.melody	@ltx/gr_gr_cog/he.h.m8:heHE.OrthrizontesVoomenSoi.name
ltx/gr_gr_cog/me.m09.d09:meMA.Ode5C21.mode	@ltx/gr_gr_cog/miscellanea:misc.Mode8
ltx/gr_gr_cog/me.m09.d09:meMA.Ode5C21.ode	@ltx/gr_gr_cog/miscellanea:misc.Ode5
ltx/gr_gr_cog/me.m09.d09:meMA.Ode5C21.text	Ἰκρίῳ ἀνηρτήθης Ἀοίδιμε, καὶ τὸ σῶμα κατεξάνθης ὄνυξιν, ὑπὲρ τοῦ πάντων δεσπόζοντος.
ltx/gr_gr_cog/me.m09.d09:meMA.Ode5C22.incipit	Θεέ μου ἀνεβόας ἐνίσχυσον, τὸν…
ltx/gr_gr_cog/me.m09.d09:meMA.Ode5C22.melody	@ltx/gr_gr_cog/he.h.m8:heHE.OrthrizontesVoomenSoi.name
ltx/gr_gr_cog/me.m09.d09:meMA.Ode5C22.mode	@ltx/gr_gr_cog/miscellanea:misc.Mode8
ltx/gr_gr_cog/me.m09.d09:meMA.Ode5C22.ode	@ltx/gr_gr_cog/miscellanea:misc.Ode5
ltx/gr_gr_cog/me.m09.d09:meMA.Ode5C22.text	Θεέ μου ἀνεβόας ἐνίσχυσον, τὸν ἀγῶνα τοῦτον ἐκτελέσαι με, τοῦ μαρτυρίου ξεόμενος.
ltx/gr_gr_cog/me.m09.d09:meMA.Ode5C23.incipit	Ὡς εἶδέ σε ὁ τύραννος…
ltx/gr_gr_cog/me.m09.d09:meMA.Ode5C23.melody	@ltx/gr_gr_cog/he.h.m8:heHE.OrthrizontesVoomenSoi.name
ltx/gr_gr_cog/me.m09.d09:meMA.Ode5C23.mode	@ltx/gr_gr_cog/miscellanea:misc.Mode8
ltx/gr_gr_cog/me.m09.d09:meMA.Ode5C23.ode	@ltx/gr_gr_cog/miscellanea:misc.Ode5
ltx/gr_gr_cog/me.m09.d09:meMA.Ode5C23.text	Ὡς εἶδέ σε ὁ τύραννος Ἔνδοξε, ἀνενδότως, τὰς βασάνους φέροντα, κατεβροντήθη ὁ δείλαιος.
ltx/gr_gr_cog/me.m09.d09:meMA.Ode5C2T.incipit	Ἐλπὶς καὶ προστασία καὶ σκέπη…
ltx/gr_gr_cog/me.m09.d09:meMA.Ode5C2T.melody	@ltx/gr_gr_cog/he.h.m8:heHE.OrthrizontesVoomenSoi.name
ltx/gr_gr_cog/me.m09.d09:meMA.Ode5C2T.mode	@ltx/gr_gr_cog/miscellanea:misc.Mode8
ltx/gr_gr_cog/me.m09.d09:meMA.Ode5C2T.ode	@ltx/gr_gr_cog/miscellanea:misc.Ode5
ltx/gr_gr_cog/me.m09.d09:meMA.Ode5C2T.text	Ἐλπὶς καὶ προστασία καὶ σκέπη μου, Θεοτόκε σῶσόν με πρεσβείαις σου, ἐκ τῶν σκανδάλων τοῦ ὄφεως.
ltx/gr_gr_cog/me.m09.d09:meMA.Ode6C11.greekmelody	@ltx/gr_gr_cog/he.h.m2:heHE.EnAvyssoPtaismaton.greekname
ltx/gr_gr_cog/me.m09.d09:meMA.Ode6C11.incipit	Γονιμώτατον σπόρον ἡ στεῖρα τὸ…
ltx/gr_gr_cog/me.m09.d09:meMA.Ode6C11.melody	@ltx/gr_gr_cog/he.h.m2:heHE.EnAvyssoPtaismaton.name
ltx/gr_gr_cog/me.m09.d09:meMA.Ode6C11.mode	@ltx/gr_gr_cog/miscellanea:misc.Mode2
ltx/gr_gr_cog/me.m09.d09:meMA.Ode6C11.ode	@ltx/gr_gr_cog/miscellanea:misc.Ode6
ltx/gr_gr_cog/me.m09.d09:meMA.Ode6C11.text	Γονιμώτατον σπόρον ἡ στεῖρα τὸ πρίν, Ἄννα δεξαμένη ἐκ θείας ἐλλάμψεως, παῖδα τεκεῖν ἠξίωται, τὴν τῶν πάντων κτισμάτων δεσποζουσαν.
ltx/gr_gr_cog/me.m09.d09:meMA.Ode6C12.incipit	Νῦν ἡ στεῖρα γεννῶσα βουλήσει…
ltx/gr_gr_cog/me.m09.d09:meMA.Ode6C12.melody	@ltx/gr_gr_cog/he.h.m2:heHE.EnAvyssoPtaismaton.name
ltx/gr_gr_cog/me.m09.d09:meMA.Ode6C12.mode	@ltx/gr_gr_cog/miscellanea:misc.Mode2
ltx/gr_gr_cog/me.m09.d09:meMA.Ode6C12.ode	@ltx/gr_gr_cog/miscellanea:misc.Ode6
ltx/gr_gr_cog/me.m09.d09:meMA.Ode6C12.text	Νῦν ἡ στεῖρα γεννῶσα βουλήσει Θεοῦ, πείθει παραδέχεσθαι Παρθένον τίκτουσαν, ἄνευ σαρκὸς θελήματος, τοῦ αὐτοῦ βουληθέντος Θεοῦ προφανῶς.
ltx/gr_gr_cog/me.m09.d09:meMA.Ode6C13.incipit	Ἐλλαμφθεὶς Ἠσαΐας τῷ Πνεύματι, τοῦ…
ltx/gr_gr_cog/me.m09.d09:meMA.Ode6C13.melody	@ltx/gr_gr_cog/he.h.m2:heHE.EnAvyssoPtaismaton.name
ltx/gr_gr_cog/me.m09.d09:meMA.Ode6C13.mode	@ltx/gr_gr_cog/miscellanea:misc.Mode2
ltx/gr_gr_cog/me.m09.d09:meMA.Ode6C13.ode	@ltx/gr_gr_cog/miscellanea:misc.Ode6
ltx/gr_gr_cog/me.m09.d09:meMA.Ode6C13.text	Ἐλλαμφθεὶς Ἠσαΐας τῷ Πνεύματι, τοῦ Ἰωακεὶμ καὶ τῆς Ἄννης τὸ κύημα, τόμον καινὸν ἑώρακεν, ᾧ ἐγράφη ὁ Λόγος σαρκούμενος.
ltx/gr_gr_cog/me.m09.d09:meMA.Ode6C14.incipit	Μυστηρίου προτρέχει μυστήριον· πρὶν γὰρ…
ltx/gr_gr_cog/me.m09.d09:meMA.Ode6C14.melody	@ltx/gr_gr_cog/he.h.m2:heHE.EnAvyssoPtaismaton.name
ltx/gr_gr_cog/me.m09.d09:meMA.Ode6C14.mode	@ltx/gr_gr_cog/miscellanea:misc.Mode2
ltx/gr_gr_cog/me.m09.d09:meMA.Ode6C14.ode	@ltx/gr_gr_cog/miscellanea:misc.Ode6
ltx/gr_gr_cog/me.m09.d09:meMA.Ode6C14.text	Μυστηρίου προτρέχει μυστήριον· πρὶν γὰρ ἡ στειρεύουσα, χάρις γεγέννηκε, τῆς σωτηρίας πρόξενον, παρθενίας γεννήσει φανεῖσαν ἡμῖν.
ltx/gr_gr_cog/me.m09.d09:meMA.Ode6C21.greekmelody	@ltx/gr_gr_cog/he.h.m8:heHE.ChitonaMoiParaschou.greekname
ltx/gr_gr_cog/me.m09.d09:meMA.Ode6C21.incipit	Φρουρᾷ σε καθειργνύει ὁ δεινός…
ltx/gr_gr_cog/me.m09.d09:meMA.Ode6C21.melody	@ltx/gr_gr_cog/he.h.m8:heHE.ChitonaMoiParaschou.name
ltx/gr_gr_cog/me.m09.d09:meMA.Ode6C21.mode	@ltx/gr_gr_cog/miscellanea:misc.Mode8
ltx/gr_gr_cog/me.m09.d09:meMA.Ode6C21.ode	@ltx/gr_gr_cog/miscellanea:misc.Ode6
ltx/gr_gr_cog/me.m09.d09:meMA.Ode6C21.text	Φρουρᾷ σε καθειργνύει ὁ δεινός, καὶ λιμῷ βιάζει σε ἀρνήσασθαι Κύριον, ὃν Παμμάκαρ ἐκ νεότητος ἔστερξας.
ltx/gr_gr_cog/me.m09.d09:meMA.Ode6C22.incipit	Ἀγόμενος Σοφὲ εἰς φυλακήν, πάντας…
ltx/gr_gr_cog/me.m09.d09:meMA.Ode6C22.melody	@ltx/gr_gr_cog/he.h.m8:heHE.ChitonaMoiParaschou.name
ltx/gr_gr_cog/me.m09.d09:meMA.Ode6C22.mode	@ltx/gr_gr_cog/miscellanea:misc.Mode8
ltx/gr_gr_cog/me.m09.d09:meMA.Ode6C22.ode	@ltx/gr_gr_cog/miscellanea:misc.Ode6
ltx/gr_gr_cog/me.m09.d09:meMA.Ode6C22.text	Ἀγόμενος Σοφὲ εἰς φυλακήν, πάντας τοὺς ὁρῶντάς σε, Χριστοῦ μὴ ἀφίστασθαι, παῤῥησίᾳ νουθετῶν ἐξεπαίδευσας.
ltx/gr_gr_cog/me.m09.d09:meMA.Ode6C23.incipit	Σπαθίζεσθαί σε Μάρτυς ὁ δεινός…
ltx/gr_gr_cog/me.m09.d09:meMA.Ode6C23.melody	@ltx/gr_gr_cog/he.h.m8:heHE.ChitonaMoiParaschou.name
ltx/gr_gr_cog/me.m09.d09:meMA.Ode6C23.mode	@ltx/gr_gr_cog/miscellanea:misc.Mode8
ltx/gr_gr_cog/me.m09.d09:meMA.Ode6C23.ode	@ltx/gr_gr_cog/miscellanea:misc.Ode6
ltx/gr_gr_cog/me.m09.d09:meMA.Ode6C23.text	Σπαθίζεσθαί σε Μάρτυς ὁ δεινός, καὶ παράφρων τύραννος, κελεύει μὴ θύοντα, τοῖς εἰδώλοις, ἀλλὰ σὺ οὐκ ἐφρόντισας.
ltx/gr_gr_cog/me.m09.d09:meMA.Ode6C2T.incipit	Χιτῶνά με ἐνδύσασθαι φωτός, σαῖς…
ltx/gr_gr_cog/me.m09.d09:meMA.Ode6C2T.melody	@ltx/gr_gr_cog/he.h.m8:heHE.ChitonaMoiParaschou.name
ltx/gr_gr_cog/me.m09.d09:meMA.Ode6C2T.mode	@ltx/gr_gr_cog/miscellanea:misc.Mode8
ltx/gr_gr_cog/me.m09.d09:meMA.Ode6C2T.ode	@ltx/gr_gr_cog/miscellanea:misc.Ode6
ltx/gr_gr_cog/me.m09.d09:meMA.Ode6C2T.text	Χιτῶνά με ἐνδύσασθαι φωτός, σαῖς πρεσβείαις ποίησον, Ἁγνὴ τὸν ὑμνοῦντά σε, ἐν ἡμέρᾳ τὸν δυσείμονα κρίσεως.
ltx/gr_gr_cog/me.m09.d09:meMA.Ode6H.greekmelody	@ltx/gr_gr_cog/he.h.m8:heHE.ChitonaMoiParaschou.greekname
ltx/gr_gr_cog/me.m09.d09:meMA.Ode6H.incipit	@ltx/gr_gr_cog/he.h.m8:heHE.ChitonaMoiParaschou.incipit
ltx/gr_gr_cog/me.m09.d09:meMA.Ode6H.melody	@ltx/gr_gr_cog/he.h.m8:heHE.ChitonaMoiParaschou.melody
ltx/gr_gr_cog/me.m09.d09:meMA.Ode6H.mode	@ltx/gr_gr_cog/miscellanea:misc.Mode8
ltx/gr_gr_cog/me.m09.d09:meMA.Ode6H.ode	@ltx/gr_gr_cog/miscellanea:misc.Ode6
ltx/gr_gr_cog/me.m09.d09:meMA.Ode6H.text	@ltx/gr_gr_cog/he.h.m8:heHE.ChitonaMoiParaschou.text
ltx/gr_gr_cog/me.m09.d09:meMA.Ode7C11.greekmelody	@ltx/gr_gr_cog/he.h.m2:heHE.AntitheonProstagma.greekname
ltx/gr_gr_cog/me.m09.d09:meMA.Ode7C11.incipit	Ἐκ ῥίζης βλαστήσασα δυὰς ἁγία…
ltx/gr_gr_cog/me.m09.d09:meMA.Ode7C11.melody	@ltx/gr_gr_cog/he.h.m2:heHE.AntitheonProstagma.name
ltx/gr_gr_cog/me.m09.d09:meMA.Ode7C11.mode	@ltx/gr_gr_cog/miscellanea:misc.Mode2
ltx/gr_gr_cog/me.m09.d09:meMA.Ode7C11.ode	@ltx/gr_gr_cog/miscellanea:misc.Ode7
ltx/gr_gr_cog/me.m09.d09:meMA.Ode7C11.text	Ἐκ ῥίζης βλαστήσασα δυὰς ἁγία, Δαυῒδ τοῦ θεόφρονος, τὴν ῥάβδον τὴν πανίερον, Παρθένον τὴν ἄχραντον, τῷ κόσμῳ τέτοκεν, ἄνθος ἱερώτατον ἡμῖν, Χριστὸν ἀσπόρως ἐξανατέλλουσαν.
ltx/gr_gr_cog/me.m09.d09:meMA.Ode7C12.incipit	Λαμπάδα πολύφωτον τὴν Θεοτόκον, ἡ…
ltx/gr_gr_cog/me.m09.d09:meMA.Ode7C12.melody	@ltx/gr_gr_cog/he.h.m2:heHE.AntitheonProstagma.name
ltx/gr_gr_cog/me.m09.d09:meMA.Ode7C12.mode	@ltx/gr_gr_cog/miscellanea:misc.Mode2
ltx/gr_gr_cog/me.m09.d09:meMA.Ode7C12.ode	@ltx/gr_gr_cog/miscellanea:misc.Ode7
ltx/gr_gr_cog/me.m09.d09:meMA.Ode7C12.text	Λαμπάδα πολύφωτον τὴν Θεοτόκον, ἡ Ἄννα ἡ ἔνθεος, καθάπερ χρυσαυγίζουσα, λυχνία βαστάζουσα τὸν κόσμον ἅπαντα, θείῳ κατελάμπρυνε φωτί, καὶ παρθενίας λαμπροῖς πυρσεύμασι.
ltx/gr_gr_cog/me.m09.d09:meMA.Ode7C13.incipit	Προπάτορες ἔνδοξοι τοῦ σαρκωθέντος, δι’…
ltx/gr_gr_cog/me.m09.d09:meMA.Ode7C13.melody	@ltx/gr_gr_cog/he.h.m2:heHE.AntitheonProstagma.name
ltx/gr_gr_cog/me.m09.d09:meMA.Ode7C13.mode	@ltx/gr_gr_cog/miscellanea:misc.Mode2
ltx/gr_gr_cog/me.m09.d09:meMA.Ode7C13.ode	@ltx/gr_gr_cog/miscellanea:misc.Ode7
ltx/gr_gr_cog/me.m09.d09:meMA.Ode7C13.text	Προπάτορες ἔνδοξοι τοῦ σαρκωθέντος, διʼ ἄφατον ἔλεος, Θεοῦ τοῦ παντοκράτορος, παιδὸς ἐκ θεόφρονος ὑμῶν πανόλβιοι, νῦν μοι τῷ προσφεύγοντι ὑμῖν, πλημμελημάτων λύσιν βραβεύσατε.
ltx/gr_gr_cog/me.m09.d09:meMA.Ode7C14.incipit	Ὡς ὄντες ὑπέρτεροι τῶν γεννητόρων…
ltx/gr_gr_cog/me.m09.d09:meMA.Ode7C14.melody	@ltx/gr_gr_cog/he.h.m2:heHE.AntitheonProstagma.name
ltx/gr_gr_cog/me.m09.d09:meMA.Ode7C14.mode	@ltx/gr_gr_cog/miscellanea:misc.Mode2
ltx/gr_gr_cog/me.m09.d09:meMA.Ode7C14.ode	@ltx/gr_gr_cog/miscellanea:misc.Ode7
ltx/gr_gr_cog/me.m09.d09:meMA.Ode7C14.text	Ὡς ὄντες ὑπέρτεροι τῶν γεννητόρων, τὴν πάντων δεσπόζουσαν, κτισμάτων ἐκτετόκατε, Μαρίαν τὴν ἄχραντον, τὴν τετοκυῖαν Θεόν, σάρκα περιθέμενον ἡμῖν, ὁμοίαν πάντῃ, διʼ εὐσπλαγχνίαν πολλήν.
ltx/gr_gr_cog/me.m09.d09:meMA.Ode7C21.greekmelody	@ltx/gr_gr_cog/he.h.m8:heHE.OEnArchiTinGin.greekname
ltx/gr_gr_cog/me.m09.d09:meMA.Ode7C21.incipit	Λίθοις ἁδροῖς συντρίβει σου τὸ…
ltx/gr_gr_cog/me.m09.d09:meMA.Ode7C21.melody	@ltx/gr_gr_cog/he.h.m8:heHE.OEnArchiTinGin.name
ltx/gr_gr_cog/me.m09.d09:meMA.Ode7C21.mode	@ltx/gr_gr_cog/miscellanea:misc.Mode8
ltx/gr_gr_cog/me.m09.d09:meMA.Ode7C21.ode	@ltx/gr_gr_cog/miscellanea:misc.Ode7
ltx/gr_gr_cog/me.m09.d09:meMA.Ode7C21.text	Λίθοις ἁδροῖς συντρίβει σου τὸ σῶμα ὁ ἀσεβής, ὑμνοῦντος παῤῥησίᾳ, Χριστὸν ἐν μέσῳ τῶν παρανόμων, οὗ τῆς δόξης τυχών, νῦν χορεύεις λαμπρῶς.
ltx/gr_gr_cog/me.m09.d09:meMA.Ode7C22.incipit	Αἰωρηθεὶς τοῦ τείχους Ἀθλοφόρε, τοῦ…
ltx/gr_gr_cog/me.m09.d09:meMA.Ode7C22.melody	@ltx/gr_gr_cog/he.h.m8:heHE.OEnArchiTinGin.name
ltx/gr_gr_cog/me.m09.d09:meMA.Ode7C22.mode	@ltx/gr_gr_cog/miscellanea:misc.Mode8
ltx/gr_gr_cog/me.m09.d09:meMA.Ode7C22.ode	@ltx/gr_gr_cog/miscellanea:misc.Ode7
ltx/gr_gr_cog/me.m09.d09:meMA.Ode7C22.text	Αἰωρηθεὶς τοῦ τείχους Ἀθλοφόρε, τοῦ δικαστοῦ, πολλῇ παραπληξίᾳ, ἐν βάρει λίθων πεπεδημένος οὐκ ἠρνήσω, Θεὸν τὸν τῶν Πατέρων ἡμῶν.
ltx/gr_gr_cog/me.m09.d09:meMA.Ode7C23.incipit	Ὢ τῆς στεῤῥᾶς ἐνστάσεώς σου…
ltx/gr_gr_cog/me.m09.d09:meMA.Ode7C23.melody	@ltx/gr_gr_cog/he.h.m8:heHE.OEnArchiTinGin.name
ltx/gr_gr_cog/me.m09.d09:meMA.Ode7C23.mode	@ltx/gr_gr_cog/miscellanea:misc.Mode8
ltx/gr_gr_cog/me.m09.d09:meMA.Ode7C23.ode	@ltx/gr_gr_cog/miscellanea:misc.Ode7
ltx/gr_gr_cog/me.m09.d09:meMA.Ode7C23.text	Ὢ τῆς στεῤῥᾶς ἐνστάσεώς σου Μάκαρ! ὢ τῆς θερμῆς ἀγάπης πρὸς τὸν Κτίστην! διʼ ἣν στεφάνῳ κατακοσμεῖ σε τῷ ἀφθάρτῳ, καλῶς ὑπεραθλήσαντα.
ltx/gr_gr_cog/me.m09.d09:meMA.Ode7C2T.incipit	Σὺ εἶ μου φῶς Παρθένε…
ltx/gr_gr_cog/me.m09.d09:meMA.Ode7C2T.melody	@ltx/gr_gr_cog/he.h.m8:heHE.OEnArchiTinGin.name
ltx/gr_gr_cog/me.m09.d09:meMA.Ode7C2T.mode	@ltx/gr_gr_cog/miscellanea:misc.Mode8
ltx/gr_gr_cog/me.m09.d09:meMA.Ode7C2T.ode	@ltx/gr_gr_cog/miscellanea:misc.Ode7
ltx/gr_gr_cog/me.m09.d09:meMA.Ode7C2T.text	Σὺ εἶ μου φῶς Παρθένε Θεοτόκε, σὺ εἶ χαρὰ καὶ σκέπη καὶ λιμήν μου, εὐλογημένη, καὶ σὲ δοξάζω ὡς τεκοῦσαν, Θεὸν τὸν τῶν Πατέρων ἡμῶν.
ltx/gr_gr_cog/me.m09.d09:meMA.Ode8C11.greekmelody	@ltx/gr_gr_cog/he.h.m2:heHE.TonEnKaminoTouPyros.greekname
ltx/gr_gr_cog/me.m09.d09:meMA.Ode8C11.incipit	Πλούτῳ κομῶντες ἀρετῶν, τὴν ἐν…
ltx/gr_gr_cog/me.m09.d09:meMA.Ode8C11.melody	@ltx/gr_gr_cog/he.h.m2:heHE.TonEnKaminoTouPyros.name
ltx/gr_gr_cog/me.m09.d09:meMA.Ode8C11.mode	@ltx/gr_gr_cog/miscellanea:misc.Mode2
ltx/gr_gr_cog/me.m09.d09:meMA.Ode8C11.ode	@ltx/gr_gr_cog/miscellanea:misc.Ode8
ltx/gr_gr_cog/me.m09.d09:meMA.Ode8C11.text	Πλούτῳ κομῶντες ἀρετῶν, τὴν ἐν δόξῃ θεϊκῇ πεποικιλμένην, Βασιλίδα Παρθένον, Ἰωακεὶμ ὁ σεπτός, καὶ Ἄννα ἡ σώφρων τετόκασιν, ἣν πᾶσα ἡ κτίσις, ὑμνεῖ ὡς Θεοτόκον.
ltx/gr_gr_cog/me.m09.d09:meMA.Ode8C12.incipit	Ῥάβδος δυνάμεως ἡμῖν, διʼ ὑμῶν…
ltx/gr_gr_cog/me.m09.d09:meMA.Ode8C12.melody	@ltx/gr_gr_cog/he.h.m2:heHE.TonEnKaminoTouPyros.name
ltx/gr_gr_cog/me.m09.d09:meMA.Ode8C12.mode	@ltx/gr_gr_cog/miscellanea:misc.Mode2
ltx/gr_gr_cog/me.m09.d09:meMA.Ode8C12.ode	@ltx/gr_gr_cog/miscellanea:misc.Ode8
ltx/gr_gr_cog/me.m09.d09:meMA.Ode8C12.text	Ῥάβδος δυνάμεως ἡμῖν, διʼ ὑμῶν φίλοι Θεοῦ ἐξαπεστάλη, ἡ πανάμωμος νύμφη, διʼ ἧς ἐν μέσῳ ἐχθρῶν, ἀθέων κατακυριεύομεν, τὰς μηχανουργίας αὐτῶν καταπατοῦντες.
ltx/gr_gr_cog/me.m09.d09:meMA.Ode8C13.incipit	Ὅπλον ἡμῖν παρὰ Θεοῦ, εὐδοκίας…
ltx/gr_gr_cog/me.m09.d09:meMA.Ode8C13.melody	@ltx/gr_gr_cog/he.h.m2:heHE.TonEnKaminoTouPyros.name
ltx/gr_gr_cog/me.m09.d09:meMA.Ode8C13.mode	@ltx/gr_gr_cog/miscellanea:misc.Mode2
ltx/gr_gr_cog/me.m09.d09:meMA.Ode8C13.ode	@ltx/gr_gr_cog/miscellanea:misc.Ode8
ltx/gr_gr_cog/me.m09.d09:meMA.Ode8C13.text	Ὅπλον ἡμῖν παρὰ Θεοῦ, εὐδοκίας διὰ σοῦ ἱερωτάτη, ξυνωρὶς ἐδωρήθη, ᾧ νῦν ἡμεῖς οἱ πιστοὶ ὡραίως ἀεί, στεφανούμεθα, ἡ Θεὸν τεκοῦσα, ἁγνὴ Παρθενομήτωρ.
ltx/gr_gr_cog/me.m09.d09:meMA.Ode8C14.incipit	Φωτοχυσίαις τοῦ ἐκ σοῦ, σαρκωθέντος…
ltx/gr_gr_cog/me.m09.d09:meMA.Ode8C14.melody	@ltx/gr_gr_cog/he.h.m2:heHE.TonEnKaminoTouPyros.name
ltx/gr_gr_cog/me.m09.d09:meMA.Ode8C14.mode	@ltx/gr_gr_cog/miscellanea:misc.Mode2
ltx/gr_gr_cog/me.m09.d09:meMA.Ode8C14.ode	@ltx/gr_gr_cog/miscellanea:misc.Ode8
ltx/gr_gr_cog/me.m09.d09:meMA.Ode8C14.text	Φωτοχυσίαις τοῦ ἐκ σοῦ, σαρκωθέντος διʼ ἡμᾶς λελαμπρυσμένη, ἡ δυὰς ἡ ἀρίστη, τῶν γεννητόρων τῶν σῶν, γεννῶσί σε πάναγνε Δέσποινα, πρόξενον ἡμῖν, ἀγαθῶν ἐπουρανίων.
ltx/gr_gr_cog/me.m09.d09:meMA.Ode8C15.incipit	Ῥώμῃ Θεοῦ καρπογονεῖ, ἡ στειρεύουσα…
ltx/gr_gr_cog/me.m09.d09:meMA.Ode8C15.melody	@ltx/gr_gr_cog/he.h.m2:heHE.TonEnKaminoTouPyros.name
ltx/gr_gr_cog/me.m09.d09:meMA.Ode8C15.mode	@ltx/gr_gr_cog/miscellanea:misc.Mode2
ltx/gr_gr_cog/me.m09.d09:meMA.Ode8C15.ode	@ltx/gr_gr_cog/miscellanea:misc.Ode8
ltx/gr_gr_cog/me.m09.d09:meMA.Ode8C15.text	Ῥώμῃ Θεοῦ καρπογονεῖ, ἡ στειρεύουσα γαστὴρ ἀνοιγομένη, καὶ προέρχεται πύλη, παρθενικὴ παμφαής, ὁ Λόγος διʼ ἧς ἐπεδήμησεν, τοῖς ἐπὶ τῆς γῆς, σαρκωθεὶς ἀφράστῳ λόγῳ.
ltx/gr_gr_cog/me.m09.d09:meMA.Ode8C21.greekmelody	@ltx/gr_gr_cog/he.h.m8:heHE.TonVasileaTonOuranon.greekname
ltx/gr_gr_cog/me.m09.d09:meMA.Ode8C21.incipit	Ἐγκαρτερήσας, τοῖς αἰκισμοῖς ἕως τέλους…
ltx/gr_gr_cog/me.m09.d09:meMA.Ode8C21.melody	@ltx/gr_gr_cog/he.h.m8:heHE.TonVasileaTonOuranon.name
ltx/gr_gr_cog/me.m09.d09:meMA.Ode8C21.mode	@ltx/gr_gr_cog/miscellanea:misc.Mode8
ltx/gr_gr_cog/me.m09.d09:meMA.Ode8C21.ode	@ltx/gr_gr_cog/miscellanea:misc.Ode8
ltx/gr_gr_cog/me.m09.d09:meMA.Ode8C21.text	Ἐγκαρτερήσας, τοῖς αἰκισμοῖς ἕως τέλους, Στρατιῶτα Κυρίου μετέστης, χαίρων πρὸς τὴν ἄνω, παμμάκαρ βασιλείαν.
ltx/gr_gr_cog/me.m09.d09:meMA.Ode8C22.incipit	Οὐ κατῃσχύνθης, διὰ Χριστὸν Γενναιόφρον…
ltx/gr_gr_cog/me.m09.d09:meMA.Ode8C22.melody	@ltx/gr_gr_cog/he.h.m8:heHE.TonVasileaTonOuranon.name
ltx/gr_gr_cog/me.m09.d09:meMA.Ode8C22.mode	@ltx/gr_gr_cog/miscellanea:misc.Mode8
ltx/gr_gr_cog/me.m09.d09:meMA.Ode8C22.ode	@ltx/gr_gr_cog/miscellanea:misc.Ode8
ltx/gr_gr_cog/me.m09.d09:meMA.Ode8C22.text	Οὐ κατῃσχύνθης, διὰ Χριστὸν Γενναιόφρον, ὑπομεῖναι βάσανα ποικίλα· ὅθεν συνδοξάζῃ, αὐτῷ εἰς τοὺς αἰῶνας.
ltx/gr_gr_cog/me.m09.d09:meMA.Ode8C23.incipit	Στεφανηφόρος, σὺν ἀθληταῖς νῦν χορεύων…
ltx/gr_gr_cog/me.m09.d09:meMA.Ode8C23.melody	@ltx/gr_gr_cog/he.h.m8:heHE.TonVasileaTonOuranon.name
ltx/gr_gr_cog/me.m09.d09:meMA.Ode8C23.mode	@ltx/gr_gr_cog/miscellanea:misc.Mode8
ltx/gr_gr_cog/me.m09.d09:meMA.Ode8C23.ode	@ltx/gr_gr_cog/miscellanea:misc.Ode8
ltx/gr_gr_cog/me.m09.d09:meMA.Ode8C23.text	Στεφανηφόρος, σὺν ἀθληταῖς νῦν χορεύων, ἀληθῶς περὶ τὸν Βασιλέα, μέμνησο τῶν πίστει τελούντων σου τὴν μνήμην.
ltx/gr_gr_cog/me.m09.d09:meMA.Ode8C2T.incipit	Ὦ Θεομῆτορ Χριστιανῶν ἡ προστάτις…
ltx/gr_gr_cog/me.m09.d09:meMA.Ode8C2T.melody	@ltx/gr_gr_cog/he.h.m8:heHE.TonVasileaTonOuranon.name
ltx/gr_gr_cog/me.m09.d09:meMA.Ode8C2T.mode	@ltx/gr_gr_cog/miscellanea:misc.Mode8
ltx/gr_gr_cog/me.m09.d09:meMA.Ode8C2T.ode	@ltx/gr_gr_cog/miscellanea:misc.Ode8
ltx/gr_gr_cog/me.m09.d09:meMA.Ode8C2T.text	Ὦ Θεομῆτορ Χριστιανῶν ἡ προστάτις, ἐξελοῦ ἡμᾶς πάσης ἀνάγκης, ἵνα σε ὑμνῶμεν, εἰς πάντας τοὺς αἰῶνας.
ltx/gr_gr_cog/me.m09.d09:meMA.Ode8H.greekmelody	@ltx/gr_gr_cog/he.h.m8:heHE.TonVasileaTonOuranon.greekname
ltx/gr_gr_cog/me.m09.d09:meMA.Ode8H.incipit	@ltx/gr_gr_cog/he.h.m8:heHE.TonVasileaTonOuranon.incipit
ltx/gr_gr_cog/me.m09.d09:meMA.Ode8H.melody	@ltx/gr_gr_cog/he.h.m8:heHE.TonVasileaTonOuranon.melody
ltx/gr_gr_cog/me.m09.d09:meMA.Ode8H.mode	@ltx/gr_gr_cog/miscellanea:misc.Mode8
ltx/gr_gr_cog/me.m09.d09:meMA.Ode8H.ode	@ltx/gr_gr_cog/miscellanea:misc.Ode8
ltx/gr_gr_cog/me.m09.d09:meMA.Ode8H.text	@ltx/gr_gr_cog/he.h.m8:heHE.TonVasileaTonOuranon.text
ltx/gr_gr_cog/me.m09.d09:meMA.Ode9C11.greekmelody	@ltx/gr_gr_cog/he.h.m2:heHE.AnarchouGennitoros.greekname
ltx/gr_gr_cog/me.m09.d09:meMA.Ode9C11.incipit	Ὁμόφρονες σύμψυχοι, τὴν ἀρετὴν ὑπάρχοντες…
ltx/gr_gr_cog/me.m09.d09:meMA.Ode9C11.melody	@ltx/gr_gr_cog/he.h.m2:heHE.AnarchouGennitoros.name
ltx/gr_gr_cog/me.m09.d09:meMA.Ode9C11.mode	@ltx/gr_gr_cog/miscellanea:misc.Mode2
ltx/gr_gr_cog/me.m09.d09:meMA.Ode9C11.ode	@ltx/gr_gr_cog/miscellanea:misc.Ode9
ltx/gr_gr_cog/me.m09.d09:meMA.Ode9C11.text	Ὁμόφρονες σύμψυχοι, τὴν ἀρετὴν ὑπάρχοντες, τῆς πανάγνου Παρθένου σεπτοὶ γεννήτορες, τοὺς ἐπιτελοῦντας προθύμως, τὴν εὐκλεῆ καὶ ἔνδοξον μνήμην, ὑμῶν ἱερώτατοι, τοῦ σωθῆναι δυσωπήσατε.
ltx/gr_gr_cog/me.m09.d09:meMA.Ode9C12.incipit	Νομὴν κατεπαύσατε, τὴν τοῦ θανάτου…
ltx/gr_gr_cog/me.m09.d09:meMA.Ode9C12.melody	@ltx/gr_gr_cog/he.h.m2:heHE.AnarchouGennitoros.name
ltx/gr_gr_cog/me.m09.d09:meMA.Ode9C12.mode	@ltx/gr_gr_cog/miscellanea:misc.Mode2
ltx/gr_gr_cog/me.m09.d09:meMA.Ode9C12.ode	@ltx/gr_gr_cog/miscellanea:misc.Ode9
ltx/gr_gr_cog/me.m09.d09:meMA.Ode9C12.text	Νομὴν κατεπαύσατε, τὴν τοῦ θανάτου Ἔνδοξοι, τῆς ζωῆς τὴν Μητέρα, λαμπρῶς γεννήσαντες, τὴν ἐξαφανήσασαν τούτου, τὴν προσβολήν, καὶ τῆς ἀθανάτου, ζωῆς προξενήσασαν, τὴν ἐλπίδα διὰ πίστεως.
ltx/gr_gr_cog/me.m09.d09:meMA.Ode9C13.incipit	Ὡραῖος ὡς ἥλιος, Ἰωακεὶμ ἑνούμενος…
ltx/gr_gr_cog/me.m09.d09:meMA.Ode9C13.melody	@ltx/gr_gr_cog/he.h.m2:heHE.AnarchouGennitoros.name
ltx/gr_gr_cog/me.m09.d09:meMA.Ode9C13.mode	@ltx/gr_gr_cog/miscellanea:misc.Mode2
ltx/gr_gr_cog/me.m09.d09:meMA.Ode9C13.ode	@ltx/gr_gr_cog/miscellanea:misc.Ode9
ltx/gr_gr_cog/me.m09.d09:meMA.Ode9C13.text	Ὡραῖος ὡς ἥλιος, Ἰωακεὶμ ἑνούμενος, τῇ φωσφόρῳ σελήνῃ, τῇ Ἄννῃ τέτοκε, τὴν τῆς παρθενίας ἀκτῖνα, διʼ ἧς αὐγὴ τῆς θείας οὐσίας, σαρκὶ καθʼ ὑπόστασιν, ἑνωθεῖσα ἡμῖν ἔλαμψε.
ltx/gr_gr_cog/me.m09.d09:meMA.Ode9C14.incipit	Σωφρόνως βιώσαντες, καὶ εὐσεβῶς Μακάριοι…
ltx/gr_gr_cog/me.m09.d09:meMA.Ode9C14.melody	@ltx/gr_gr_cog/he.h.m2:heHE.AnarchouGennitoros.name
ltx/gr_gr_cog/me.m09.d09:meMA.Ode9C14.mode	@ltx/gr_gr_cog/miscellanea:misc.Mode2
ltx/gr_gr_cog/me.m09.d09:meMA.Ode9C14.ode	@ltx/gr_gr_cog/miscellanea:misc.Ode9
ltx/gr_gr_cog/me.m09.d09:meMA.Ode9C14.text	Σωφρόνως βιώσαντες, καὶ εὐσεβῶς Μακάριοι, νῦν τρυφῆς τῆς ἀφράστου, κατηξιώθητε, τῆς θεοφανείας τυχόντες, τοῦ ἐξ ὑμῶν τῷ κόσμῳ φανέντος· ὅν περ δυσωπήσατε, τοῦ σωθῆναι τὰς ψυχὰς ἡμῶν.
ltx/gr_gr_cog/me.m09.d09:meMA.Ode9C21.greekmelody	@ltx/gr_gr_cog/he.h.m8:heHE.KyriosTheotokon.greekname
ltx/gr_gr_cog/me.m09.d09:meMA.Ode9C21.incipit	Χερσὶ τῶν σὲ ποθούντων, Μάκαρ…
ltx/gr_gr_cog/me.m09.d09:meMA.Ode9C21.melody	@ltx/gr_gr_cog/he.h.m8:heHE.KyriosTheotokon.name
ltx/gr_gr_cog/me.m09.d09:meMA.Ode9C21.mode	@ltx/gr_gr_cog/miscellanea:misc.Mode8
ltx/gr_gr_cog/me.m09.d09:meMA.Ode9C21.ode	@ltx/gr_gr_cog/miscellanea:misc.Ode9
ltx/gr_gr_cog/me.m09.d09:meMA.Ode9C21.text	Χερσὶ τῶν σὲ ποθούντων, Μάκαρ σου τὸ σῶμα, περισταλὲν κατετάφη ὡς ἅγιον, καὶ ἰαμάτων ἐκβλύζει, κρουνοὺς εἰς δόξαν Θεοῦ.
ltx/gr_gr_cog/me.m09.d09:meMA.Ode9C22.incipit	Ὧ θαῦμα! πῶς ἀνέστη, ὁ…
ltx/gr_gr_cog/me.m09.d09:meMA.Ode9C22.melody	@ltx/gr_gr_cog/he.h.m8:heHE.KyriosTheotokon.name
ltx/gr_gr_cog/me.m09.d09:meMA.Ode9C22.mode	@ltx/gr_gr_cog/miscellanea:misc.Mode8
ltx/gr_gr_cog/me.m09.d09:meMA.Ode9C22.ode	@ltx/gr_gr_cog/miscellanea:misc.Ode9
ltx/gr_gr_cog/me.m09.d09:meMA.Ode9C22.text	Ὧ θαῦμα! πῶς ἀνέστη, ὁ θανὼν οἰκέτης, καὶ προσηπήντα σου δρόμῳ τῷ σώματι, πρὸς τὴν ταφὴν ἀγομένῳ, Μάρτυς πανάριστε.
ltx/gr_gr_cog/me.m09.d09:meMA.Ode9C23.incipit	Τυχὼν τῆς αἰωνίου, Μάκαρ βασιλείας…
ltx/gr_gr_cog/me.m09.d09:meMA.Ode9C23.melody	@ltx/gr_gr_cog/he.h.m8:heHE.KyriosTheotokon.name
ltx/gr_gr_cog/me.m09.d09:meMA.Ode9C23.mode	@ltx/gr_gr_cog/miscellanea:misc.Mode8
ltx/gr_gr_cog/me.m09.d09:meMA.Ode9C23.ode	@ltx/gr_gr_cog/miscellanea:misc.Ode9
ltx/gr_gr_cog/me.m09.d09:meMA.Ode9C23.text	Τυχὼν τῆς αἰωνίου, Μάκαρ βασιλείας, καὶ τῷ Δεσπότῃ Χριστῷ παριστάμενος, ὑπὲρ τῶν σὲ ἀνυμνούντων θερμῶς ἱκέτευε.
ltx/gr_gr_cog/me.m09.d09:meMA.Ode9C2T.incipit	Ἐξίσταντο Ἀγγέλων, αἱ ταξιαρχίαι, σεσαρκωμένον…
ltx/gr_gr_cog/me.m09.d09:meMA.Ode9C2T.melody	@ltx/gr_gr_cog/he.h.m8:heHE.KyriosTheotokon.name
ltx/gr_gr_cog/me.m09.d09:meMA.Ode9C2T.mode	@ltx/gr_gr_cog/miscellanea:misc.Mode8
ltx/gr_gr_cog/me.m09.d09:meMA.Ode9C2T.ode	@ltx/gr_gr_cog/miscellanea:misc.Ode9
ltx/gr_gr_cog/me.m09.d09:meMA.Ode9C2T.text	Ἐξίσταντο Ἀγγέλων, αἱ ταξιαρχίαι, σεσαρκωμένον ὁρῶσαι σε φέρουσαν, τὸν Ποιητὴν τῶν αἰώνων καὶ σὲ ἐδόξαζον.
ltx/gr_gr_cog/me.m09.d09:meMA.Ode9H.greekmelody	@ltx/gr_gr_cog/he.h.m8:heHE.KyriosTheotokon.greekname
ltx/gr_gr_cog/me.m09.d09:meMA.Ode9H.incipit	@ltx/gr_gr_cog/he.h.m8:heHE.KyriosTheotokon.incipit
ltx/gr_gr_cog/me.m09.d09:meMA.Ode9H.melody	@ltx/gr_gr_cog/he.h.m8:heHE.KyriosTheotokon.melody
ltx/gr_gr_cog/me.m09.d09:meMA.Ode9H.mode	@ltx/gr_gr_cog/miscellanea:misc.Mode8
ltx/gr_gr_cog/me.m09.d09:meMA.Ode9H.ode	@ltx/gr_gr_cog/miscellanea:misc.Ode9
ltx/gr_gr_cog/me.m09.d09:meMA.Ode9H.text	@ltx/gr_gr_cog/he.h.m8:heHE.KyriosTheotokon.text
ltx/gr_gr_cog/me.m09.d09:meMA.Oikos1.text	Ἡ τῶν δεσμῶν τῆς πρὶν ἀτεκνίας διʼ εὐχῆς λυθεῖσα, προσκαλεῖται ἡμᾶς συνεορτάσαι τῷ θαύματι, καὶ δῶρα προσάξαι τῇ γεννηθείσῃ, λιτανεύοντας ἔμπροσθεν μετὰ πόθου, ἧς περ ποτὲ αἱ παρθένοι ἐν τάχει προέτρεχον, χορεύουσαι καὶ βοῶσαι· Ἰδοὺ ἦλθεν ἡ πάντων ἀνάκλησις, ἰδοὺ Ἀδὰμ ἠλευθέρωται, ὅτι Ἄννα καρπὸν ἀνεβλάστησε, τὴν μόνην Μητέρα καὶ ἀπείρανδρον.
ltx/gr_gr_cog/me.m09.d09:meVE.Apolytikion1.incipit	Τῶν δικαίων Θεοπατόρων σου Κύριε…
ltx/gr_gr_cog/me.m09.d09:meVE.Apolytikion1.melody	
ltx/gr_gr_cog/me.m09.d09:meVE.Apolytikion1.mode	@ltx/gr_gr_cog/miscellanea:misc.Mode2
ltx/gr_gr_cog/me.m09.d09:meVE.Apolytikion1.text	Τῶν δικαίων Θεοπατόρων σου Κύριε, τὴν μνήμην ἑορτάζοντες, διʼ αὐτῶν σὲ δυσωποῦμεν· Σῶσον τὰς ψυχὰς ἡμῶν.
ltx/gr_gr_cog/me.m09.d09:meVE.Apolytikion2ger.greekmelody	@ltx/gr_gr_cog/he.a.m4:heAU.TachyProkatalave.greekname
ltx/gr_gr_cog/me.m09.d09:meVE.Apolytikion2ger.incipit	Σοφίᾳ τῶν λόγων σου, παρεμβολὴ…
ltx/gr_gr_cog/me.m09.d09:meVE.Apolytikion2ger.melody	@ltx/gr_gr_cog/he.a.m4:heAU.TachyProkatalave.name
ltx/gr_gr_cog/me.m09.d09:meVE.Apolytikion2ger.mode	@ltx/gr_gr_cog/miscellanea:misc.Mode4
ltx/gr_gr_cog/me.m09.d09:meVE.Apolytikion2ger.poet	@ltx/gr_gr_cog/poets:po.Gerasimou
ltx/gr_gr_cog/me.m09.d09:meVE.Apolytikion2ger.text	Σοφίᾳ τῶν λόγων σου, παρεμβολὴ ἱεράν, ἐνθέως ἐπήλειψας, παευκλεῶν Ἀθλητῶν, πρὸς ἄθλησιν ἔνθεον· ὅθεν τὰς φθειρομένας, παριδὼν ὑπολήψεις, ἄφθαρτον ἐκομίσω, διʼ ἀθλήσεως δόξαν· διὸ Σεβηριανέ σε, ὕμνοις γεραίρομεν.
ltx/gr_gr_cog/me.m09.d09:meVE.AposGlory.incipit	@ltx/gr_gr_cog/me.m07.d25:meVE.SticGlory.incipit
ltx/gr_gr_cog/me.m09.d09:meVE.AposGlory.melody	
ltx/gr_gr_cog/me.m09.d09:meVE.AposGlory.mode	@ltx/gr_gr_cog/miscellanea:misc.Mode8
ltx/gr_gr_cog/me.m09.d09:meVE.AposGlory.text	@ltx/gr_gr_cog/me.m07.d25:meVE.SticGlory.text
ltx/gr_gr_cog/me.m09.d09:meVE.Aposticha1.greekmelody	@ltx/gr_gr_cog/he.a.m1:heAU.TonOuranionTagmaton.greekname
ltx/gr_gr_cog/me.m09.d09:meVE.Aposticha1.incipit	@ltx/gr_gr_cog/me.m09.d08:meSV.Stichera1.incipit
ltx/gr_gr_cog/me.m09.d09:meVE.Aposticha1.melody	@ltx/gr_gr_cog/he.a.m1:heAU.TonOuranionTagmaton.name
ltx/gr_gr_cog/me.m09.d09:meVE.Aposticha1.mode	@ltx/gr_gr_cog/miscellanea:misc.Mode1
ltx/gr_gr_cog/me.m09.d09:meVE.Aposticha1.text	@ltx/gr_gr_cog/me.m09.d08:meSV.Stichera1.text
ltx/gr_gr_cog/me.m09.d09:meVE.Aposticha2.incipit	@ltx/gr_gr_cog/me.m09.d08:meSV.Stichera3.incipit
ltx/gr_gr_cog/me.m09.d09:meVE.Aposticha2.melody	@ltx/gr_gr_cog/he.a.m1:heAU.TonOuranionTagmaton.name
ltx/gr_gr_cog/me.m09.d09:meVE.Aposticha2.mode	@ltx/gr_gr_cog/miscellanea:misc.Mode1
ltx/gr_gr_cog/me.m09.d09:meVE.Aposticha2.text	@ltx/gr_gr_cog/me.m09.d08:meSV.Stichera3.text
ltx/gr_gr_cog/me.m09.d09:meVE.Aposticha3.incipit	@ltx/gr_gr_cog/me.m09.d08:meSV.Stichera4.incipit
ltx/gr_gr_cog/me.m09.d09:meVE.Aposticha3.melody	@ltx/gr_gr_cog/he.a.m1:heAU.TonOuranionTagmaton.name
ltx/gr_gr_cog/me.m09.d09:meVE.Aposticha3.mode	@ltx/gr_gr_cog/miscellanea:misc.Mode1
ltx/gr_gr_cog/me.m09.d09:meVE.Aposticha3.text	@ltx/gr_gr_cog/me.m09.d08:meSV.Stichera4.text
ltx/gr_gr_cog/me.m09.d09:meVE.SticGlory.incipit	@ltx/gr_gr_cog/me.m07.d25:meVE.LityGlory.incipit
ltx/gr_gr_cog/me.m09.d09:meVE.SticGlory.melody	
ltx/gr_gr_cog/me.m09.d09:meVE.SticGlory.mode	@ltx/gr_gr_cog/miscellanea:misc.Mode5
ltx/gr_gr_cog/me.m09.d09:meVE.SticGlory.poet	@ltx/gr_gr_cog/poets:po.EfraimKarias
ltx/gr_gr_cog/me.m09.d09:meVE.SticGlory.text	@ltx/gr_gr_cog/me.m07.d25:meVE.LityGlory.text
ltx/gr_gr_cog/me.m09.d09:meVE.Stichera01.greekmelody	@ltx/gr_gr_cog/he.a.m4:heAU.EdokasSimeiosin.greekname
ltx/gr_gr_cog/me.m09.d09:meVE.Stichera01.incipit	Δεῦτε νῦν χορεύσωμεν, ἀσματικῶς ὧ…
ltx/gr_gr_cog/me.m09.d09:meVE.Stichera01.melody	@ltx/gr_gr_cog/he.a.m4:heAU.EdokasSimeiosin.name
ltx/gr_gr_cog/me.m09.d09:meVE.Stichera01.mode	@ltx/gr_gr_cog/miscellanea:misc.Mode4
ltx/gr_gr_cog/me.m09.d09:meVE.Stichera01.text	Δεῦτε νῦν χορεύσωμεν, ἀσματικῶς ὧ φιλέορτοι, καὶ πιστῶς ἑορτάσωμεν, τὴν μνήμην γεραίροντες, Ἰωακεὶμ καὶ Ἄννης, τῆς σεπτῆς δυάδος· αὐτοὶ γὰρ ἔτεκον ἡμῖν, τὴν Θεομήτορα καὶ Παρθένον ἁγνήν· διὸ περ καὶ μετέστησαν, ἐκ τῶν προσκαίρων πρὸς ἄληκτον, καὶ ἀείζωον οἴκησιν, δυσωποῦντες σωθῆναι ἡμᾶς.
ltx/gr_gr_cog/me.m09.d09:meVE.Stichera02.incipit	Εὐφρόσυνον τέρπεται, σήμερον κτίσις ἡ…
ltx/gr_gr_cog/me.m09.d09:meVE.Stichera02.melody	@ltx/gr_gr_cog/he.a.m4:heAU.EdokasSimeiosin.name
ltx/gr_gr_cog/me.m09.d09:meVE.Stichera02.mode	@ltx/gr_gr_cog/miscellanea:misc.Mode4
ltx/gr_gr_cog/me.m09.d09:meVE.Stichera02.text	Εὐφρόσυνον τέρπεται, σήμερον κτίσις ἡ σύμπασα, Θεοτόκε πανύμνητε, ἐτήσιον ἄγουσα, μνήμην ὁμοφρόνως, τῶν σῶν γεννητόρων, Ἰωακεὶμ τοῦ θαυμαστοῦ, ὁμοῦ καὶ Ἄννης πανηγυρίζουσα· χαρὰν γὰρ προεξένησαν, σὲ παρʼ ἐλπίδα βλαστήσαντες, τὴν τὸ φῶς ἀπαστράψασαν, καὶ τροφὸν τῆς ζωῆς ἡμῶν.
ltx/gr_gr_cog/me.m09.d09:meVE.Stichera03.incipit	Ἀγάλλεται σήμερον, Ἄννα σκιρτῶσα ἐν…
ltx/gr_gr_cog/me.m09.d09:meVE.Stichera03.melody	@ltx/gr_gr_cog/he.a.m4:heAU.EdokasSimeiosin.name
ltx/gr_gr_cog/me.m09.d09:meVE.Stichera03.mode	@ltx/gr_gr_cog/miscellanea:misc.Mode4
ltx/gr_gr_cog/me.m09.d09:meVE.Stichera03.text	Ἀγάλλεται σήμερον, Ἄννα σκιρτῶσα ἐν πνεύματι, καὶ εὐφραίνεται χαίρουσα, τυχοῦσα ἐφέσεως, ἧς περ ἐπεπόθει, πάλαι εὐτεκνίας, ἐπαγγελίας γὰρ καρπόν, καὶ εὐλογίας θεῖον ἐβλάστησε, Μαρίαν τὴν πανάμωμον, τὴν τὸν Θεὸν ἡμῶν τέξασαν, καὶ τὸν ἥλιον λάμψασαν, τοῖς ἐν σκότει καθεύδουσι.
ltx/gr_gr_cog/me.m09.d09:meVE.Stichera04.greekmelody	@ltx/gr_gr_cog/he.a.m4:heAU.EdokasSimeiosin.greekname
ltx/gr_gr_cog/me.m09.d09:meVE.Stichera04.incipit	Νεύροις συγκοπτόμενος, διὰ Χριστὸν παναοίδιμε…
ltx/gr_gr_cog/me.m09.d09:meVE.Stichera04.melody	@ltx/gr_gr_cog/he.a.m4:heAU.EdokasSimeiosin.name
ltx/gr_gr_cog/me.m09.d09:meVE.Stichera04.mode	@ltx/gr_gr_cog/miscellanea:misc.Mode4
ltx/gr_gr_cog/me.m09.d09:meVE.Stichera04.text	Νεύροις συγκοπτόμενος, διὰ Χριστὸν παναοίδιμε, καὶ ἰκρίῳ κρεμάμενος, καὶ σάρκας ξεόμενος, ἀπηνῶς ξυστῆρσι, θύειν τε εἰδώλοις, ἐγκελευόμενος σοφέ, οὐκ ἐξηρνήσω τὸν πάντων Κύριον· ἀλλʼ ἤλεγξας τοῖς πόνοις σου, τὸ ἀσθενὲς καὶ ἐξίτηλον, τῶν εἰδώλων καὶ γέγονας τῶν Ἀγγέλων συνόμιλος.
ltx/gr_gr_cog/me.m09.d09:meVE.Stichera05.incipit	Δέσμιος ἀγόμενος, καὶ ταῖς πληγαῖς…
ltx/gr_gr_cog/me.m09.d09:meVE.Stichera05.melody	@ltx/gr_gr_cog/he.a.m4:heAU.EdokasSimeiosin.name
ltx/gr_gr_cog/me.m09.d09:meVE.Stichera05.mode	@ltx/gr_gr_cog/miscellanea:misc.Mode4
ltx/gr_gr_cog/me.m09.d09:meVE.Stichera05.text	Δέσμιος ἀγόμενος, καὶ ταῖς πληγαῖς σεμνυνόμενος, τοὺς ὁρῶντας προέτρεπες, μιμεῖσθαι τὸν δρόμον σου, πρὸς τὰς οὐρανίους, μάκαρ ἀντιδόσεις, ἀποσκοποῦντας, αἳ πολλήν, τὴν εὐφροσύνην καὶ τὴν τερπνότητα, παρέχουσιν ὡς ἄφθαρτοι· καὶ εἰς ἀεὶ παραμένουσαι, τοὺς Χριστὸν θεραπεύοντας, κληρονόμους λαμβάνουσιν.
ltx/gr_gr_cog/me.m09.d09:meVE.Stichera06.incipit	Λίθοις συνθλαττόμενος, τὰς σιαγόνας, ἀοίδιμε…
ltx/gr_gr_cog/me.m09.d09:meVE.Stichera06.melody	@ltx/gr_gr_cog/he.a.m4:heAU.EdokasSimeiosin.name
ltx/gr_gr_cog/me.m09.d09:meVE.Stichera06.mode	@ltx/gr_gr_cog/miscellanea:misc.Mode4
ltx/gr_gr_cog/me.m09.d09:meVE.Stichera06.text	Λίθοις συνθλαττόμενος, τὰς σιαγόνας, ἀοίδιμε, καὶ πλευρὰς σπαθιζόμενος, λίθῳ παμμεγίστῳ τε, τράχηλον καὶ πόδας, συνθλώμενος μάκαρ, καὶ ἁρμονίας ἀπηνῶς, παραλυόμενος ὄντως ἔθλασας, τὴν κεφαλὴν τοῦ δράκοντος, ὑπομονῆς γενναιότητι, ἣν ἡττῆσαι οὐκ ἴσχυσε, τῶν βασάνων ἡ κάκωσις.
