ltx/gr_gr_cog/other.stsraphaelnicholasireneparaklesis:hoCA.Apolytikion1.incipit	Τῇ τῶν μαρτύρων θαυμαστῇ προστασίᾳ…
ltx/gr_gr_cog/other.stsraphaelnicholasireneparaklesis:hoCA.Apolytikion1.melody	@ltx/gr_gr_cog/he.a.m4:heAU.OYpsotheisEnToStavro.name
ltx/gr_gr_cog/other.stsraphaelnicholasireneparaklesis:hoCA.Apolytikion1.mode	@ltx/gr_gr_cog/miscellanea:misc.Mode4
ltx/gr_gr_cog/other.stsraphaelnicholasireneparaklesis:hoCA.Apolytikion1.text	Τῇ τῶν μαρτύρων θαυμαστῇ προστασίᾳ, τῶν ἐν Θερμῇ ἡμῖν ἀρτίως φανέντων, ἀπὸ ψυχῆς προσπέσωμεν κραυγάζοντες· Ραφαὴλ μακάριε, καὶ Νικόλαε θεῖε, καὶ Εἰρήνη πάνσεμνε, πάσης ρύσασθε βλάβης, καὶ ἀναγκῶν καὶ πάσης ἀπειλῆς, τοὺς τῇ πρεσβείᾳ ὑμῶν καταφεύγοντας.
ltx/gr_gr_cog/other.stsraphaelnicholasireneparaklesis:hoCA.Apolytikion2.incipit	@ltx/gr_gr_cog/ho.ho23:hoCA.Apolytikion2.incipit
ltx/gr_gr_cog/other.stsraphaelnicholasireneparaklesis:hoCA.Apolytikion2.melody	@ltx/gr_gr_cog/ho.ho23:hoCA.Apolytikion2.melody
ltx/gr_gr_cog/other.stsraphaelnicholasireneparaklesis:hoCA.Apolytikion2.mode	@ltx/gr_gr_cog/ho.ho23:hoCA.Apolytikion2.mode
ltx/gr_gr_cog/other.stsraphaelnicholasireneparaklesis:hoCA.Apolytikion2.text	@ltx/gr_gr_cog/ho.ho23:hoCA.Apolytikion2.text
ltx/gr_gr_cog/other.stsraphaelnicholasireneparaklesis:hoCA.Insert1	τῶν ἁγίων ἐνδόξων Ὁσιομαρτύρων Ραφαὴλ καὶ Νικολάου, καὶ Εἰρήνης τῆς Παρθενομάρτυρος,
ltx/gr_gr_cog/other.stsraphaelnicholasireneparaklesis:hoCA.Kathisma11.incipit	Προστάται ἡμῶν, ἀρτίως ἀνεδείχθητε, καὶ…
ltx/gr_gr_cog/other.stsraphaelnicholasireneparaklesis:hoCA.Kathisma11.melody	Πρεσβεία θερμή.
ltx/gr_gr_cog/other.stsraphaelnicholasireneparaklesis:hoCA.Kathisma11.mode	@ltx/gr_gr_cog/miscellanea:misc.Mode2
ltx/gr_gr_cog/other.stsraphaelnicholasireneparaklesis:hoCA.Kathisma11.text	Προστάται ἡμῶν, ἀρτίως ἀνεδείχθητε, καὶ πᾶσι πιστοῖς, φαινόμενοι παρέχετε, παραδόξοις ὄψεσι, τὰ αἰτήματα Ἅγιοι πάντοτε· διὰ τοῦτο ὑμνοῦμεν ὑμᾶς, σοφὲ Ραφαὴλ τε καὶ Νικόλαε.
ltx/gr_gr_cog/other.stsraphaelnicholasireneparaklesis:hoCA.Kontakion.incipit	Ὡς ἀντιλήπτορες πάντων θερμότατοι, ὦ…
ltx/gr_gr_cog/other.stsraphaelnicholasireneparaklesis:hoCA.Kontakion.melody	@ltx/gr_gr_cog/he.a.m2:heAU.ToisTonAimatonSou.name
ltx/gr_gr_cog/other.stsraphaelnicholasireneparaklesis:hoCA.Kontakion.mode	@ltx/gr_gr_cog/miscellanea:misc.Mode2
ltx/gr_gr_cog/other.stsraphaelnicholasireneparaklesis:hoCA.Kontakion.text	Ὡς ἀντιλήπτορες πάντων θερμότατοι, ὦ Ραφαὴλ καὶ θεόφρον Νικόλαε, ἀεὶ βοηθεῖτε τοῖς πάσχουσι, καὶ τῶν παθῶν τὰς ὀδύνας κουφίζετε, ὑμῶν ταχιναῖς ἀντιλήψεσι.
ltx/gr_gr_cog/other.stsraphaelnicholasireneparaklesis:hoCA.Meg00.incipit	@ltx/gr_gr_cog/ho.ho03:hoMA.Ode9.Meg00.incipit
ltx/gr_gr_cog/other.stsraphaelnicholasireneparaklesis:hoCA.Meg00.text	@ltx/gr_gr_cog/ho.ho03:hoMA.Ode9.Meg00.text
ltx/gr_gr_cog/other.stsraphaelnicholasireneparaklesis:hoCA.Meg01.incipit	@ltx/gr_gr_cog/he.h.m6:heHE.TinTimioteran.incipit
ltx/gr_gr_cog/other.stsraphaelnicholasireneparaklesis:hoCA.Meg01.melody	@ltx/gr_gr_cog/he.h.m6:heHE.TinTimioteran.melody
ltx/gr_gr_cog/other.stsraphaelnicholasireneparaklesis:hoCA.Meg01.text	@ltx/gr_gr_cog/he.h.m6:heHE.TinTimioteran.text
ltx/gr_gr_cog/other.stsraphaelnicholasireneparaklesis:hoCA.Meg02.incipit	Χαίροις τῆς Ἰθάκης θεῖος βλαστός…
ltx/gr_gr_cog/other.stsraphaelnicholasireneparaklesis:hoCA.Meg02.melody	@ltx/gr_gr_cog/he.h.m6:heHE.TinTimioteran.name
ltx/gr_gr_cog/other.stsraphaelnicholasireneparaklesis:hoCA.Meg02.text	Χαίροις τῆς Ἰθάκης θεῖος βλαστός, Ραφαὴλ τρισμάκαρ, καὶ Σουλίου ὁ ἀρωγός· χαίροις Διακόνων, Νικόλαε λαμπρότης· χαῖρε σεμνὴ Εἰρήνη, Χριστοῦ ὀσφράδιον.
ltx/gr_gr_cog/other.stsraphaelnicholasireneparaklesis:hoCA.Meg03.incipit	Πάλαι ἐναθλήσαντες καρτερῶς, καὶ ἄρτι…
ltx/gr_gr_cog/other.stsraphaelnicholasireneparaklesis:hoCA.Meg03.melody	@ltx/gr_gr_cog/he.h.m6:heHE.TinTimioteran.name
ltx/gr_gr_cog/other.stsraphaelnicholasireneparaklesis:hoCA.Meg03.text	Πάλαι ἐναθλήσαντες καρτερῶς, καὶ ἄρτι γνωσθέντες, ἐν Σουλίῳ περιφανῶς, λάμπετε ἐν κόσμῳ, θαυμάτων ἐνεργείαις, εἰς δόξαν τοῦ Κυρίου, Ἅγιοι Μάρτυρες.
ltx/gr_gr_cog/other.stsraphaelnicholasireneparaklesis:hoCA.Meg04.incipit	Δόξῃ λαμπρυνόμενοι θεϊκῇ, ὁράσεσι πλείσταις…
ltx/gr_gr_cog/other.stsraphaelnicholasireneparaklesis:hoCA.Meg04.melody	@ltx/gr_gr_cog/he.h.m6:heHE.TinTimioteran.name
ltx/gr_gr_cog/other.stsraphaelnicholasireneparaklesis:hoCA.Meg04.text	Δόξῃ λαμπρυνόμενοι θεϊκῇ, ὁράσεσι πλείσταις, ἐκκαλύπτετε τοῖς πιστοῖς, ἀγνώστων πραγμάτων, σαφέστατα τὴν γνῶσιν, ὡς θεῖοι τοῦ Σωτῆρος, Ὁσιομάρτυρες.
ltx/gr_gr_cog/other.stsraphaelnicholasireneparaklesis:hoCA.Meg05.incipit	Χαίρετε Σουλίου κλέος καινόν, τῆς…
ltx/gr_gr_cog/other.stsraphaelnicholasireneparaklesis:hoCA.Meg05.melody	@ltx/gr_gr_cog/he.h.m6:heHE.TinTimioteran.name
ltx/gr_gr_cog/other.stsraphaelnicholasireneparaklesis:hoCA.Meg05.text	Χαίρετε Σουλίου κλέος καινόν, τῆς Μονῆς πολιοῦχοι, καὶ προστᾶται τῶν Μοναχῶν, Ραφαὴλ παμμάκαρ, ὁμοῦ σὺν Νικολάῳ, καὶ τῇ σεμνῇ Εἰρήνῃ, πυρσοὶ θεόφωτοι.
ltx/gr_gr_cog/other.stsraphaelnicholasireneparaklesis:hoCA.Meg06.incipit	Χαίρετε κτηθέντες ὡς θησαυροί, πλουτίζοντες…
ltx/gr_gr_cog/other.stsraphaelnicholasireneparaklesis:hoCA.Meg06.melody	@ltx/gr_gr_cog/he.h.m6:heHE.TinTimioteran.name
ltx/gr_gr_cog/other.stsraphaelnicholasireneparaklesis:hoCA.Meg06.text	Χαίρετε κτηθέντες ὡς θησαυροί, πλουτίζοντες πάντας, ἰαμάτων ταῖς δωρεαῖς, Ραφαὴλ θεόφρον, σὺν θείῳ Νικολάῳ, τὸν τόπον τοῦ Σουλίου καθηγιάσαντες.
ltx/gr_gr_cog/other.stsraphaelnicholasireneparaklesis:hoCA.Meg07.incipit	Πάντας τοὺς προστρέχοντας εὐλαβῶς, ὑμῶν…
ltx/gr_gr_cog/other.stsraphaelnicholasireneparaklesis:hoCA.Meg07.melody	@ltx/gr_gr_cog/he.h.m6:heHE.TinTimioteran.name
ltx/gr_gr_cog/other.stsraphaelnicholasireneparaklesis:hoCA.Meg07.text	Πάντας τοὺς προστρέχοντας εὐλαβῶς, ὑμῶν τῇ πρεσβείᾳ, πάσης ρύσασθε συμφορᾶς, Ραφαήλ, Εἰρήνη, ὁμοῦ σὺν Νικολάῳ, τὴν τῶν πταισμάτων λύσιν, ἡμῖν αἰτούμενοι.
ltx/gr_gr_cog/other.stsraphaelnicholasireneparaklesis:hoCA.Meg0F.incipit	@ltx/gr_gr_cog/ho.ho23:hoCA.Meg0F.incipit
ltx/gr_gr_cog/other.stsraphaelnicholasireneparaklesis:hoCA.Meg0F.melody	@ltx/gr_gr_cog/he.h.m6:heHE.TinTimioteran.name
ltx/gr_gr_cog/other.stsraphaelnicholasireneparaklesis:hoCA.Meg0F.text	@ltx/gr_gr_cog/ho.ho23:hoCA.Meg0F.text
ltx/gr_gr_cog/other.stsraphaelnicholasireneparaklesis:hoCA.Ode11.incipit	Συνόντες Μαρτύρων θείοις χοροῖς, Ραφαὴλ…
ltx/gr_gr_cog/other.stsraphaelnicholasireneparaklesis:hoCA.Ode11.melody	@ltx/gr_gr_cog/he.h.m8:heHE.YgranDiodefsas.name
ltx/gr_gr_cog/other.stsraphaelnicholasireneparaklesis:hoCA.Ode11.mode	@ltx/gr_gr_cog/miscellanea:misc.Mode8
ltx/gr_gr_cog/other.stsraphaelnicholasireneparaklesis:hoCA.Ode11.ode	@ltx/gr_gr_cog/miscellanea:misc.Ode1
ltx/gr_gr_cog/other.stsraphaelnicholasireneparaklesis:hoCA.Ode11.text	Συνόντες Μαρτύρων θείοις χοροῖς, Ραφαὴλ παμμάκαρ, καὶ Νικόλαε ἱερέ, ἅμα σὺν Εἰρήνῃ δυσωπεῖτε, πολυειδῶν ἡμᾶς ρύεσθαι θλίψεων.
ltx/gr_gr_cog/other.stsraphaelnicholasireneparaklesis:hoCA.Ode12.incipit	Κευθμώνων ὡς ὤφθη ἀπὸ τῆς…
ltx/gr_gr_cog/other.stsraphaelnicholasireneparaklesis:hoCA.Ode12.melody	@ltx/gr_gr_cog/he.h.m8:heHE.YgranDiodefsas.name
ltx/gr_gr_cog/other.stsraphaelnicholasireneparaklesis:hoCA.Ode12.mode	@ltx/gr_gr_cog/miscellanea:misc.Mode8
ltx/gr_gr_cog/other.stsraphaelnicholasireneparaklesis:hoCA.Ode12.ode	@ltx/gr_gr_cog/miscellanea:misc.Ode1
ltx/gr_gr_cog/other.stsraphaelnicholasireneparaklesis:hoCA.Ode12.text	Κευθμώνων ὡς ὤφθη ἀπὸ τῆς γῆς, τὸ θεῖόν σου σκῆνος, ἁγιάζει τοὺς εὐσεβεῖς· ἀλλ’ ὦ Ραφαὴλ θαυματοφόρε, ἁγιασμὸν ἡμῖν δίδου καὶ λύτρωσιν.
ltx/gr_gr_cog/other.stsraphaelnicholasireneparaklesis:hoCA.Ode13.incipit	Ἐφάνησαν ἄνθη ὡς νοητά, ὑμῶν…
ltx/gr_gr_cog/other.stsraphaelnicholasireneparaklesis:hoCA.Ode13.melody	@ltx/gr_gr_cog/he.h.m8:heHE.YgranDiodefsas.name
ltx/gr_gr_cog/other.stsraphaelnicholasireneparaklesis:hoCA.Ode13.mode	@ltx/gr_gr_cog/miscellanea:misc.Mode8
ltx/gr_gr_cog/other.stsraphaelnicholasireneparaklesis:hoCA.Ode13.ode	@ltx/gr_gr_cog/miscellanea:misc.Ode1
ltx/gr_gr_cog/other.stsraphaelnicholasireneparaklesis:hoCA.Ode13.text	Ἐφάνησαν ἄνθη ὡς νοητά, ὑμῶν τὰ ὀστέα, ὧν ἡ χάρις ἡ μυστική, Νικόλαε ἅμα καὶ Εἰρήνη, τὴν δυσωδίαν διώκει τῶν θλίψεων.
ltx/gr_gr_cog/other.stsraphaelnicholasireneparaklesis:hoCA.Ode1T.incipit	Πηγὴ εὐσπλαγχνίας τῆς θεϊκῆς, βλῦσόν…
ltx/gr_gr_cog/other.stsraphaelnicholasireneparaklesis:hoCA.Ode1T.melody	@ltx/gr_gr_cog/he.h.m8:heHE.YgranDiodefsas.name
ltx/gr_gr_cog/other.stsraphaelnicholasireneparaklesis:hoCA.Ode1T.mode	@ltx/gr_gr_cog/miscellanea:misc.Mode8
ltx/gr_gr_cog/other.stsraphaelnicholasireneparaklesis:hoCA.Ode1T.ode	@ltx/gr_gr_cog/miscellanea:misc.Ode1
ltx/gr_gr_cog/other.stsraphaelnicholasireneparaklesis:hoCA.Ode1T.text	Πηγὴ εὐσπλαγχνίας τῆς θεϊκῆς, βλῦσόν μοι Παρθένε, σωτηρίας τὸν γλυκασμόν, καὶ λῦσον πικρίαν τῆς ψυχῆς μου, ἣν τῶν παθῶν μου τὸ πλῆθος ἐνέσταξε.
ltx/gr_gr_cog/other.stsraphaelnicholasireneparaklesis:hoCA.Ode31.incipit	Ἡ πλουσία σου χάρις, παρὰ…
ltx/gr_gr_cog/other.stsraphaelnicholasireneparaklesis:hoCA.Ode31.melody	@ltx/gr_gr_cog/he.h.m8:heHE.OuraniasApsidos.name
ltx/gr_gr_cog/other.stsraphaelnicholasireneparaklesis:hoCA.Ode31.mode	@ltx/gr_gr_cog/miscellanea:misc.Mode8
ltx/gr_gr_cog/other.stsraphaelnicholasireneparaklesis:hoCA.Ode31.ode	@ltx/gr_gr_cog/miscellanea:misc.Ode3
ltx/gr_gr_cog/other.stsraphaelnicholasireneparaklesis:hoCA.Ode31.text	Ἡ πλουσία σου χάρις, παρὰ Θεοῦ Ἅγιε, πᾶσι θαυμαστῶς ἐνεργοῦσα, νέμει τὰ κρείττονα· διὸ τοῖς σπεύδουσιν, ὦ Ραφαὴλ τῇ σῇ σκέπῃ, δίδου τὰ ἰάματα, ψυχῆς καὶ σώματος.
ltx/gr_gr_cog/other.stsraphaelnicholasireneparaklesis:hoCA.Ode32.incipit	Ἠθληκότες νομίμως, ὑπὲρ Χριστοῦ Μάρτυρες…
ltx/gr_gr_cog/other.stsraphaelnicholasireneparaklesis:hoCA.Ode32.melody	@ltx/gr_gr_cog/he.h.m8:heHE.OuraniasApsidos.name
ltx/gr_gr_cog/other.stsraphaelnicholasireneparaklesis:hoCA.Ode32.mode	@ltx/gr_gr_cog/miscellanea:misc.Mode8
ltx/gr_gr_cog/other.stsraphaelnicholasireneparaklesis:hoCA.Ode32.ode	@ltx/gr_gr_cog/miscellanea:misc.Ode3
ltx/gr_gr_cog/other.stsraphaelnicholasireneparaklesis:hoCA.Ode32.text	Ἠθληκότες νομίμως, ὑπὲρ Χριστοῦ Μάρτυρες, πάσης ἀνομίας καὶ βλάβης, τοῦ πολεμήτορος, ἡμᾶς λυτρώσασθε, σὺν Νικολάῳ, Εἰρήνῃ, ταῖς πρὸς τὸν Οἰκτίρμονα, ὑμῶν δεήσεσι.
ltx/gr_gr_cog/other.stsraphaelnicholasireneparaklesis:hoCA.Ode33.incipit	Μυστηρίων ἐνθέων, ὡς ἀληθῶς ἔκβασις…
ltx/gr_gr_cog/other.stsraphaelnicholasireneparaklesis:hoCA.Ode33.melody	@ltx/gr_gr_cog/he.h.m8:heHE.OuraniasApsidos.name
ltx/gr_gr_cog/other.stsraphaelnicholasireneparaklesis:hoCA.Ode33.mode	@ltx/gr_gr_cog/miscellanea:misc.Mode8
ltx/gr_gr_cog/other.stsraphaelnicholasireneparaklesis:hoCA.Ode33.ode	@ltx/gr_gr_cog/miscellanea:misc.Ode3
ltx/gr_gr_cog/other.stsraphaelnicholasireneparaklesis:hoCA.Ode33.text	Μυστηρίων ἐνθέων, ὡς ἀληθῶς ἔκβασις, γέγονεν ὑμῶν ἐν τῷ κόσμῳ, ἡ ἀποκάλυψις, ὦ Ραφαὴλ ἱερέ, σὺν Νικολάῳ Εἰρήνῃ· ὅθεν ἡμῖν νείματε, φόβον τὸν ἔνθεον.
ltx/gr_gr_cog/other.stsraphaelnicholasireneparaklesis:hoCA.Ode3T.incipit	Ὡς περίδοξος θρόνος, καὶ φωταυγὲς…
ltx/gr_gr_cog/other.stsraphaelnicholasireneparaklesis:hoCA.Ode3T.melody	@ltx/gr_gr_cog/he.h.m8:heHE.OuraniasApsidos.name
ltx/gr_gr_cog/other.stsraphaelnicholasireneparaklesis:hoCA.Ode3T.mode	@ltx/gr_gr_cog/miscellanea:misc.Mode8
ltx/gr_gr_cog/other.stsraphaelnicholasireneparaklesis:hoCA.Ode3T.ode	@ltx/gr_gr_cog/miscellanea:misc.Ode3
ltx/gr_gr_cog/other.stsraphaelnicholasireneparaklesis:hoCA.Ode3T.text	Ὡς περίδοξος θρόνος, καὶ φωταυγὲς σκήνωμα, τοῦ παμβασιλέως τῆς δόξης, καὶ Παντοκράτορος, κόρη πανάμωμε, σκεῦος φωτὸς ἁγνοῦ βίου, τὴν ψυχήν μου ποίησον, ὡς ἂν σωθήσωμαι.
ltx/gr_gr_cog/other.stsraphaelnicholasireneparaklesis:hoCA.Ode41.incipit	Νοσημάτων ἀπάλλαξον, Πάτερ Ραφαήλ, καὶ…
ltx/gr_gr_cog/other.stsraphaelnicholasireneparaklesis:hoCA.Ode41.melody	@ltx/gr_gr_cog/he.h.m8:heHE.EisakikoaKyrie.name
ltx/gr_gr_cog/other.stsraphaelnicholasireneparaklesis:hoCA.Ode41.mode	@ltx/gr_gr_cog/miscellanea:misc.Mode8
ltx/gr_gr_cog/other.stsraphaelnicholasireneparaklesis:hoCA.Ode41.ode	@ltx/gr_gr_cog/miscellanea:misc.Ode4
ltx/gr_gr_cog/other.stsraphaelnicholasireneparaklesis:hoCA.Ode41.text	Νοσημάτων ἀπάλλαξον, Πάτερ Ραφαήλ, καὶ πάσης κακώσεως, ἀοράτῳ ἐπισκέψει σου, τοὺς τὸ σὸν φωνοῦντας μέγα ὄνομα.
ltx/gr_gr_cog/other.stsraphaelnicholasireneparaklesis:hoCA.Ode42.incipit	Ἐκλυτρούμενοι φάνητε, τῆς τοῦ ἀοράτου…
ltx/gr_gr_cog/other.stsraphaelnicholasireneparaklesis:hoCA.Ode42.melody	@ltx/gr_gr_cog/he.h.m8:heHE.EisakikoaKyrie.name
ltx/gr_gr_cog/other.stsraphaelnicholasireneparaklesis:hoCA.Ode42.mode	@ltx/gr_gr_cog/miscellanea:misc.Mode8
ltx/gr_gr_cog/other.stsraphaelnicholasireneparaklesis:hoCA.Ode42.ode	@ltx/gr_gr_cog/miscellanea:misc.Ode4
ltx/gr_gr_cog/other.stsraphaelnicholasireneparaklesis:hoCA.Ode42.text	Ἐκλυτρούμενοι φάνητε, τῆς τοῦ ἀοράτου ἐχθροῦ ἐπιθέσεως, ὦ Εἰρήνη καὶ Νικόλαε, τοὺς εἰλικρινῶς ὑμῖν προστρέχοντας.
ltx/gr_gr_cog/other.stsraphaelnicholasireneparaklesis:hoCA.Ode43.incipit	Σωτηρίαν αἰτήσασθε, τὴν κατὰ ψυχὴν…
ltx/gr_gr_cog/other.stsraphaelnicholasireneparaklesis:hoCA.Ode43.melody	@ltx/gr_gr_cog/he.h.m8:heHE.EisakikoaKyrie.name
ltx/gr_gr_cog/other.stsraphaelnicholasireneparaklesis:hoCA.Ode43.mode	@ltx/gr_gr_cog/miscellanea:misc.Mode8
ltx/gr_gr_cog/other.stsraphaelnicholasireneparaklesis:hoCA.Ode43.ode	@ltx/gr_gr_cog/miscellanea:misc.Ode4
ltx/gr_gr_cog/other.stsraphaelnicholasireneparaklesis:hoCA.Ode43.text	Σωτηρίαν αἰτήσασθε, τὴν κατὰ ψυχὴν καὶ σῶμα τοῖς σπεύδουσι, Ραφαὴλ τὲ καὶ Νικόλαε, καὶ Εἰρήνη πᾶσιν ὑμῖν Ἅγιοι.
ltx/gr_gr_cog/other.stsraphaelnicholasireneparaklesis:hoCA.Ode4T.incipit	Τῆς ψυχῆς μου τὰ τραύματα…
ltx/gr_gr_cog/other.stsraphaelnicholasireneparaklesis:hoCA.Ode4T.melody	@ltx/gr_gr_cog/he.h.m8:heHE.EisakikoaKyrie.name
ltx/gr_gr_cog/other.stsraphaelnicholasireneparaklesis:hoCA.Ode4T.mode	@ltx/gr_gr_cog/miscellanea:misc.Mode8
ltx/gr_gr_cog/other.stsraphaelnicholasireneparaklesis:hoCA.Ode4T.ode	@ltx/gr_gr_cog/miscellanea:misc.Ode4
ltx/gr_gr_cog/other.stsraphaelnicholasireneparaklesis:hoCA.Ode4T.text	Τῆς ψυχῆς μου τὰ τραύματα, ἴασαι Παρθένε τῇ σῇ χρηστότητι, καὶ ὑγείαν τὴν κατ’ ἄμφω μοι, καὶ πταισμάτων αἴτει τὴν συγχώρησιν.
ltx/gr_gr_cog/other.stsraphaelnicholasireneparaklesis:hoCA.Ode51.incipit	Εἰδόν σε πολλοί, καὶ χαρᾶς…
ltx/gr_gr_cog/other.stsraphaelnicholasireneparaklesis:hoCA.Ode51.melody	@ltx/gr_gr_cog/he.h.m8:heHE.FotisonImas.name
ltx/gr_gr_cog/other.stsraphaelnicholasireneparaklesis:hoCA.Ode51.mode	@ltx/gr_gr_cog/miscellanea:misc.Mode8
ltx/gr_gr_cog/other.stsraphaelnicholasireneparaklesis:hoCA.Ode51.ode	@ltx/gr_gr_cog/miscellanea:misc.Ode5
ltx/gr_gr_cog/other.stsraphaelnicholasireneparaklesis:hoCA.Ode51.text	Εἰδόν σε πολλοί, καὶ χαρᾶς πολλῆς ἐπλήσθησαν· χαροποίησον οὖν Πάτερ καὶ ἡμῶν, τὴν ζωὴν λελυπημένην πικραῖς θλίψεσι.
ltx/gr_gr_cog/other.stsraphaelnicholasireneparaklesis:hoCA.Ode52.incipit	Ἄκουσον ἡμῶν, τῆς φωνῆς θεῖε…
ltx/gr_gr_cog/other.stsraphaelnicholasireneparaklesis:hoCA.Ode52.melody	@ltx/gr_gr_cog/he.h.m8:heHE.FotisonImas.name
ltx/gr_gr_cog/other.stsraphaelnicholasireneparaklesis:hoCA.Ode52.mode	@ltx/gr_gr_cog/miscellanea:misc.Mode8
ltx/gr_gr_cog/other.stsraphaelnicholasireneparaklesis:hoCA.Ode52.ode	@ltx/gr_gr_cog/miscellanea:misc.Ode5
ltx/gr_gr_cog/other.stsraphaelnicholasireneparaklesis:hoCA.Ode52.text	Ἄκουσον ἡμῶν, τῆς φωνῆς θεῖε Νικόλαε, καὶ παράσχου ὦ Εἰρήνη θαυμαστή, τῇ ζωῇ ἡμῶν εἰρήνην ἀστασίαστον.
ltx/gr_gr_cog/other.stsraphaelnicholasireneparaklesis:hoCA.Ode53.incipit	Θεῖοι Ἀθληταί, Ραφαήλ τε καὶ…
ltx/gr_gr_cog/other.stsraphaelnicholasireneparaklesis:hoCA.Ode53.melody	@ltx/gr_gr_cog/he.h.m8:heHE.FotisonImas.name
ltx/gr_gr_cog/other.stsraphaelnicholasireneparaklesis:hoCA.Ode53.mode	@ltx/gr_gr_cog/miscellanea:misc.Mode8
ltx/gr_gr_cog/other.stsraphaelnicholasireneparaklesis:hoCA.Ode53.ode	@ltx/gr_gr_cog/miscellanea:misc.Ode5
ltx/gr_gr_cog/other.stsraphaelnicholasireneparaklesis:hoCA.Ode53.text	Θεῖοι Ἀθληταί, Ραφαήλ τε καὶ Νικόλαε, καὶ Εἰρήνη τῶν Λεσβίων ἡ χαρά, λυπηρῶν ἡμῶν λυτροῦσθε περιστάσεων.
ltx/gr_gr_cog/other.stsraphaelnicholasireneparaklesis:hoCA.Ode5T.incipit	Λύτρωσαι ἡμᾶς, Θεοτόκε Ἀειπάρθενε, μανιώδους…
ltx/gr_gr_cog/other.stsraphaelnicholasireneparaklesis:hoCA.Ode5T.melody	@ltx/gr_gr_cog/he.h.m8:heHE.FotisonImas.name
ltx/gr_gr_cog/other.stsraphaelnicholasireneparaklesis:hoCA.Ode5T.mode	@ltx/gr_gr_cog/miscellanea:misc.Mode8
ltx/gr_gr_cog/other.stsraphaelnicholasireneparaklesis:hoCA.Ode5T.ode	@ltx/gr_gr_cog/miscellanea:misc.Ode5
ltx/gr_gr_cog/other.stsraphaelnicholasireneparaklesis:hoCA.Ode5T.text	Λύτρωσαι ἡμᾶς, Θεοτόκε Ἀειπάρθενε, μανιώδους τοῦ ἐχθροῦ ἐπιφορᾶς, καθ’ ἡμῶν ἀεὶ ὡς λέοντος σφαδάζοντος.
ltx/gr_gr_cog/other.stsraphaelnicholasireneparaklesis:hoCA.Ode61.incipit	Ὁράσεσι, καὶ πολλαῖς θεωρίαις, τοῖς…
ltx/gr_gr_cog/other.stsraphaelnicholasireneparaklesis:hoCA.Ode61.melody	@ltx/gr_gr_cog/he.h.m8:heHE.TinDeisinEkcheo.name
ltx/gr_gr_cog/other.stsraphaelnicholasireneparaklesis:hoCA.Ode61.mode	@ltx/gr_gr_cog/miscellanea:misc.Mode8
ltx/gr_gr_cog/other.stsraphaelnicholasireneparaklesis:hoCA.Ode61.ode	@ltx/gr_gr_cog/miscellanea:misc.Ode6
ltx/gr_gr_cog/other.stsraphaelnicholasireneparaklesis:hoCA.Ode61.text	Ὁράσεσι, καὶ πολλαῖς θεωρίαις, τοῖς πιστοῖς ἐμφανιζόμενος μάκαρ, τῶν κεκρυμμένων τὴν γνῶσιν ἐκφαίνεις, ἀλλὰ καὶ νῦν μυστικῶς ἐπιφάνηθι, Ὁσιομάρτυς Ραφαήλ, καὶ παράσχου ἡμῖν τὰ αἰτήματα.
ltx/gr_gr_cog/other.stsraphaelnicholasireneparaklesis:hoCA.Ode62.incipit	Φανέντες, ὡς ἐξ ἀδύτων τῷ…
ltx/gr_gr_cog/other.stsraphaelnicholasireneparaklesis:hoCA.Ode62.melody	@ltx/gr_gr_cog/he.h.m8:heHE.TinDeisinEkcheo.name
ltx/gr_gr_cog/other.stsraphaelnicholasireneparaklesis:hoCA.Ode62.mode	@ltx/gr_gr_cog/miscellanea:misc.Mode8
ltx/gr_gr_cog/other.stsraphaelnicholasireneparaklesis:hoCA.Ode62.ode	@ltx/gr_gr_cog/miscellanea:misc.Ode6
ltx/gr_gr_cog/other.stsraphaelnicholasireneparaklesis:hoCA.Ode62.text	Φανέντες, ὡς ἐξ ἀδύτων τῷ κόσμῳ, ὑπὸ γῆν χρόνοις πολλοῖς κεκρυμμένοι, τῆς τοῦ Θεοῦ εὐσπλαγχνίας τὸν πλοῦτον, πρεσβευτικῶς τοῖς ἀνθρώποις παρέχετε, Νικόλαε μάρτυς στεῤῥέ, καὶ Εἰρήνη σεμνὴ καλλιπάρθενε.
ltx/gr_gr_cog/other.stsraphaelnicholasireneparaklesis:hoCA.Ode63.incipit	Οἱ νέοι, τῆς Ἐκκλησίας φωστῆρες…
ltx/gr_gr_cog/other.stsraphaelnicholasireneparaklesis:hoCA.Ode63.melody	@ltx/gr_gr_cog/he.h.m8:heHE.TinDeisinEkcheo.name
ltx/gr_gr_cog/other.stsraphaelnicholasireneparaklesis:hoCA.Ode63.mode	@ltx/gr_gr_cog/miscellanea:misc.Mode8
ltx/gr_gr_cog/other.stsraphaelnicholasireneparaklesis:hoCA.Ode63.ode	@ltx/gr_gr_cog/miscellanea:misc.Ode6
ltx/gr_gr_cog/other.stsraphaelnicholasireneparaklesis:hoCA.Ode63.text	Οἱ νέοι, τῆς Ἐκκλησίας φωστῆρες, οἱ ἀθλήσει ἀριστεύσαντες πάλαι, ὁ Ραφαὴλ ὁ σοφὸς θεηγόρος, καὶ σὺν Εἰρήνῃ ὁ θεῖος Νικόλαος, ἐπιστασίαις ταῖς ὑμῶν, τῶν ἐν βίῳ δεινῶν ἡμᾶς ρύσασθε.
ltx/gr_gr_cog/other.stsraphaelnicholasireneparaklesis:hoCA.Ode6T.incipit	Ρυσθῆναί με, τῶν παθῶν τῆς…
ltx/gr_gr_cog/other.stsraphaelnicholasireneparaklesis:hoCA.Ode6T.melody	@ltx/gr_gr_cog/he.h.m8:heHE.TinDeisinEkcheo.name
ltx/gr_gr_cog/other.stsraphaelnicholasireneparaklesis:hoCA.Ode6T.mode	@ltx/gr_gr_cog/miscellanea:misc.Mode8
ltx/gr_gr_cog/other.stsraphaelnicholasireneparaklesis:hoCA.Ode6T.ode	@ltx/gr_gr_cog/miscellanea:misc.Ode6
ltx/gr_gr_cog/other.stsraphaelnicholasireneparaklesis:hoCA.Ode6T.text	Ρυσθῆναί με, τῶν παθῶν τῆς κακίας, καὶ ἁπάσης τοῦ ἐχθροῦ κακουργίας, τῇ σῇ εὐδόκησον Κόρη πρεσβείᾳ, πρὸς τὸν Υἱὸν καὶ Θεόν σου καὶ Κύριον, καὶ δίδου μοι ὡς ἀγαθή, μετανοίας σωτήριον δάκρυον.
ltx/gr_gr_cog/other.stsraphaelnicholasireneparaklesis:hoCA.Ode71.incipit	Οἱ τὴν σὴν κατιδόντες, Ραφαὴλ…
ltx/gr_gr_cog/other.stsraphaelnicholasireneparaklesis:hoCA.Ode71.melody	@ltx/gr_gr_cog/he.h.m8:heHE.OiEkTisIoudaias.name
ltx/gr_gr_cog/other.stsraphaelnicholasireneparaklesis:hoCA.Ode71.mode	@ltx/gr_gr_cog/miscellanea:misc.Mode8
ltx/gr_gr_cog/other.stsraphaelnicholasireneparaklesis:hoCA.Ode71.ode	@ltx/gr_gr_cog/miscellanea:misc.Ode7
ltx/gr_gr_cog/other.stsraphaelnicholasireneparaklesis:hoCA.Ode71.text	Οἱ τὴν σὴν κατιδόντες, Ραφαὴλ θεοφόρε θέαν οὐράνιον, ἐδέξαντο ἐκ ταύτης, φῶς θείας εὐφροσύνης· δὸς κἀμοὶ οὖν μακάριε, τῆς βοηθείας τῆς σῆς, τὰς σωτηρίους δόσεις.
ltx/gr_gr_cog/other.stsraphaelnicholasireneparaklesis:hoCA.Ode72.incipit	Ἰατρεύειν τὰ πάθη, τῶν ψυχῶν…
ltx/gr_gr_cog/other.stsraphaelnicholasireneparaklesis:hoCA.Ode72.melody	@ltx/gr_gr_cog/he.h.m8:heHE.OiEkTisIoudaias.name
ltx/gr_gr_cog/other.stsraphaelnicholasireneparaklesis:hoCA.Ode72.mode	@ltx/gr_gr_cog/miscellanea:misc.Mode8
ltx/gr_gr_cog/other.stsraphaelnicholasireneparaklesis:hoCA.Ode72.ode	@ltx/gr_gr_cog/miscellanea:misc.Ode7
ltx/gr_gr_cog/other.stsraphaelnicholasireneparaklesis:hoCA.Ode72.text	Ἰατρεύειν τὰ πάθη, τῶν ψυχῶν καὶ σωμάτων ἡμῶν μὴ παύσησθε, Νικόλαε τρισμάκαρ, καὶ πάνσεμνε Εἰρήνη, καὶ διδόναι ἑκάστοτε, ἀπαλλαγὴν τῶν δεινῶν, καὶ ἀναγκῶν τὴν λύσιν.
ltx/gr_gr_cog/other.stsraphaelnicholasireneparaklesis:hoCA.Ode73.incipit	Γνωρισθέντες τῷ κόσμῳ, ὡς γνωστοὶ…
ltx/gr_gr_cog/other.stsraphaelnicholasireneparaklesis:hoCA.Ode73.melody	@ltx/gr_gr_cog/he.h.m8:heHE.OiEkTisIoudaias.name
ltx/gr_gr_cog/other.stsraphaelnicholasireneparaklesis:hoCA.Ode73.mode	@ltx/gr_gr_cog/miscellanea:misc.Mode8
ltx/gr_gr_cog/other.stsraphaelnicholasireneparaklesis:hoCA.Ode73.ode	@ltx/gr_gr_cog/miscellanea:misc.Ode7
ltx/gr_gr_cog/other.stsraphaelnicholasireneparaklesis:hoCA.Ode73.text	Γνωρισθέντες τῷ κόσμῳ, ὡς γνωστοὶ τῷ Κυρίῳ πάλαι τυγχάνοντες, λαμπρῶς θαυματουργεῖτε, προφθάνοντες ταχέως, Ραφαὴλ καὶ Νικόλαε, τοὺς προσιόντας θερμῶς, ὑμῶν τῇ προστασίᾳ.
ltx/gr_gr_cog/other.stsraphaelnicholasireneparaklesis:hoCA.Ode7T.incipit	Ἐξ ἀχράντου γαστρός σου, προελθὼν…
ltx/gr_gr_cog/other.stsraphaelnicholasireneparaklesis:hoCA.Ode7T.melody	@ltx/gr_gr_cog/he.h.m8:heHE.OiEkTisIoudaias.name
ltx/gr_gr_cog/other.stsraphaelnicholasireneparaklesis:hoCA.Ode7T.mode	@ltx/gr_gr_cog/miscellanea:misc.Mode8
ltx/gr_gr_cog/other.stsraphaelnicholasireneparaklesis:hoCA.Ode7T.ode	@ltx/gr_gr_cog/miscellanea:misc.Ode7
ltx/gr_gr_cog/other.stsraphaelnicholasireneparaklesis:hoCA.Ode7T.text	Ἐξ ἀχράντου γαστρός σου, προελθὼν ὁ τῶν ὅλων Θεὸς καὶ Κύριος, μορφῇ τῇ ἀνθρωπίνῃ, προστάτιν σὲ δεικνύει, παντὸς κόσμου Πανάμωμε· ὅθεν ἐκ πάσης ἡμᾶς, ἀπάλλαξον ἀνάγκης.
ltx/gr_gr_cog/other.stsraphaelnicholasireneparaklesis:hoCA.Ode81.incipit	Ρῶσιν παράσχου, καὶ τὴν κατ’…
ltx/gr_gr_cog/other.stsraphaelnicholasireneparaklesis:hoCA.Ode81.melody	@ltx/gr_gr_cog/he.h.m8:heHE.TonVasileaTonOuranon.name
ltx/gr_gr_cog/other.stsraphaelnicholasireneparaklesis:hoCA.Ode81.mode	@ltx/gr_gr_cog/miscellanea:misc.Mode8
ltx/gr_gr_cog/other.stsraphaelnicholasireneparaklesis:hoCA.Ode81.ode	@ltx/gr_gr_cog/miscellanea:misc.Ode8
ltx/gr_gr_cog/other.stsraphaelnicholasireneparaklesis:hoCA.Ode81.text	Ρῶσιν παράσχου, καὶ τὴν κατ’ ἄμφω ὑγείαν, τοῖς προστρέχουσι τοῖς θείοις σου λειψάνοις, Ραφαὴλ παμμάκαρ, καὶ σὲ ὑμνολογοῦσι.
ltx/gr_gr_cog/other.stsraphaelnicholasireneparaklesis:hoCA.Ode82.incipit	Ἄλυπον βίον, ἐν ἀληθεῖ εὐπραγίᾳ…
ltx/gr_gr_cog/other.stsraphaelnicholasireneparaklesis:hoCA.Ode82.melody	@ltx/gr_gr_cog/he.h.m8:heHE.TonVasileaTonOuranon.name
ltx/gr_gr_cog/other.stsraphaelnicholasireneparaklesis:hoCA.Ode82.mode	@ltx/gr_gr_cog/miscellanea:misc.Mode8
ltx/gr_gr_cog/other.stsraphaelnicholasireneparaklesis:hoCA.Ode82.ode	@ltx/gr_gr_cog/miscellanea:misc.Ode8
ltx/gr_gr_cog/other.stsraphaelnicholasireneparaklesis:hoCA.Ode82.text	Ἄλυπον βίον, ἐν ἀληθεῖ εὐπραγίᾳ, καταξίωσον ἡμᾶς πιστῶς ἀνύειν, ταῖς σαῖς ἱκεσίαις, Νικόλαε θεόφρον.
ltx/gr_gr_cog/other.stsraphaelnicholasireneparaklesis:hoCA.Ode83.incipit	Σθένος μοι δίδου, ἐν ταῖς…
ltx/gr_gr_cog/other.stsraphaelnicholasireneparaklesis:hoCA.Ode83.melody	@ltx/gr_gr_cog/he.h.m8:heHE.TonVasileaTonOuranon.name
ltx/gr_gr_cog/other.stsraphaelnicholasireneparaklesis:hoCA.Ode83.mode	@ltx/gr_gr_cog/miscellanea:misc.Mode8
ltx/gr_gr_cog/other.stsraphaelnicholasireneparaklesis:hoCA.Ode83.ode	@ltx/gr_gr_cog/miscellanea:misc.Ode8
ltx/gr_gr_cog/other.stsraphaelnicholasireneparaklesis:hoCA.Ode83.text	Σθένος μοι δίδου, ἐν ταῖς τοῦ βίου ἀνάγκαις, καὶ παράκλησιν ἐν πάσαις ἀθυμίαις, ὦ τριὰς ἁγία, νεοφανῶν Μαρτύρων.
ltx/gr_gr_cog/other.stsraphaelnicholasireneparaklesis:hoCA.Ode8T.incipit	Ἴασαι Κόρη, τὴν θλιβομένην ψυχήν…
ltx/gr_gr_cog/other.stsraphaelnicholasireneparaklesis:hoCA.Ode8T.melody	@ltx/gr_gr_cog/he.h.m8:heHE.TonVasileaTonOuranon.name
ltx/gr_gr_cog/other.stsraphaelnicholasireneparaklesis:hoCA.Ode8T.mode	@ltx/gr_gr_cog/miscellanea:misc.Mode8
ltx/gr_gr_cog/other.stsraphaelnicholasireneparaklesis:hoCA.Ode8T.ode	@ltx/gr_gr_cog/miscellanea:misc.Ode8
ltx/gr_gr_cog/other.stsraphaelnicholasireneparaklesis:hoCA.Ode8T.text	Ἴασαι Κόρη, τὴν θλιβομένην ψυχήν μου, καὶ θεράπευσον τοῦ σώματος τὸ ἄλγος, τῇ συμπαθεστάτῃ, προνοίᾳ σου Παρθένε.
ltx/gr_gr_cog/other.stsraphaelnicholasireneparaklesis:hoCA.Ode91.incipit	Μεγάλων χαρισμάτων, κατηξιωμένος, παρὰ Χριστοῦ…
ltx/gr_gr_cog/other.stsraphaelnicholasireneparaklesis:hoCA.Ode91.melody	@ltx/gr_gr_cog/he.h.m8:heHE.KyriosTheotokon.name
ltx/gr_gr_cog/other.stsraphaelnicholasireneparaklesis:hoCA.Ode91.mode	@ltx/gr_gr_cog/miscellanea:misc.Mode8
ltx/gr_gr_cog/other.stsraphaelnicholasireneparaklesis:hoCA.Ode91.ode	@ltx/gr_gr_cog/miscellanea:misc.Ode9
ltx/gr_gr_cog/other.stsraphaelnicholasireneparaklesis:hoCA.Ode91.text	Μεγάλων χαρισμάτων, κατηξιωμένος, παρὰ Χριστοῦ Ραφαὴλ ἱερώτατε, μέγας προστάτης ἐδείχθης ἡμῶν καὶ στήριγμα.
ltx/gr_gr_cog/other.stsraphaelnicholasireneparaklesis:hoCA.Ode92.incipit	Οἱ Μάρτυρες Κυρίου, οἱ δεδοξασμένοι…
ltx/gr_gr_cog/other.stsraphaelnicholasireneparaklesis:hoCA.Ode92.melody	@ltx/gr_gr_cog/he.h.m8:heHE.KyriosTheotokon.name
ltx/gr_gr_cog/other.stsraphaelnicholasireneparaklesis:hoCA.Ode92.mode	@ltx/gr_gr_cog/miscellanea:misc.Mode8
ltx/gr_gr_cog/other.stsraphaelnicholasireneparaklesis:hoCA.Ode92.ode	@ltx/gr_gr_cog/miscellanea:misc.Ode9
ltx/gr_gr_cog/other.stsraphaelnicholasireneparaklesis:hoCA.Ode92.text	Οἱ Μάρτυρες Κυρίου, οἱ δεδοξασμένοι, σὺν Νικολάῳ Εἰρήνη θεόνυμφε, τῆς τῶν παθῶν ἀδοξίας ἡμᾶς λυτρώσασθε.
ltx/gr_gr_cog/other.stsraphaelnicholasireneparaklesis:hoCA.Ode93.incipit	Ὑψόθεν ἀοράτως, σκέπετε ἀπαύστως, ὦ…
ltx/gr_gr_cog/other.stsraphaelnicholasireneparaklesis:hoCA.Ode93.melody	@ltx/gr_gr_cog/he.h.m8:heHE.KyriosTheotokon.name
ltx/gr_gr_cog/other.stsraphaelnicholasireneparaklesis:hoCA.Ode93.mode	@ltx/gr_gr_cog/miscellanea:misc.Mode8
ltx/gr_gr_cog/other.stsraphaelnicholasireneparaklesis:hoCA.Ode93.ode	@ltx/gr_gr_cog/miscellanea:misc.Ode9
ltx/gr_gr_cog/other.stsraphaelnicholasireneparaklesis:hoCA.Ode93.text	Ὑψόθεν ἀοράτως, σκέπετε ἀπαύστως, ὦ Ραφαὴλ ἱερὲ καὶ Νικόλαε, σὺν τῇ Εἰρήνῃ τοὺς πίστει ὑμᾶς γεραίροντας.
ltx/gr_gr_cog/other.stsraphaelnicholasireneparaklesis:hoCA.Ode9T.incipit	Ὑμνοῦμέν σου τὴν χάριν, Κεχαριτωμένη·…
ltx/gr_gr_cog/other.stsraphaelnicholasireneparaklesis:hoCA.Ode9T.melody	@ltx/gr_gr_cog/he.h.m8:heHE.KyriosTheotokon.name
ltx/gr_gr_cog/other.stsraphaelnicholasireneparaklesis:hoCA.Ode9T.mode	@ltx/gr_gr_cog/miscellanea:misc.Mode8
ltx/gr_gr_cog/other.stsraphaelnicholasireneparaklesis:hoCA.Ode9T.ode	@ltx/gr_gr_cog/miscellanea:misc.Ode9
ltx/gr_gr_cog/other.stsraphaelnicholasireneparaklesis:hoCA.Ode9T.text	Ὑμνοῦμέν σου τὴν χάριν, Κεχαριτωμένη· ὅτι ἡμᾶς διασώζεις ἑκάστοτε, καὶ ἀσφαλῶς κατευθύνεις πρὸς θεῖον θέλημα.
ltx/gr_gr_cog/other.stsraphaelnicholasireneparaklesis:hoCA.PostGospelBoth.incipit	@ltx/gr_gr_cog/ho.ho03:hoMA.PostGospelTheotokos.incipit
ltx/gr_gr_cog/other.stsraphaelnicholasireneparaklesis:hoCA.PostGospelBoth.melody	
ltx/gr_gr_cog/other.stsraphaelnicholasireneparaklesis:hoCA.PostGospelBoth.mode	@ltx/gr_gr_cog/miscellanea:misc.Mode2
ltx/gr_gr_cog/other.stsraphaelnicholasireneparaklesis:hoCA.PostGospelBoth.text	@ltx/gr_gr_cog/ho.ho03:hoMA.PostGospelTheotokos.text
ltx/gr_gr_cog/other.stsraphaelnicholasireneparaklesis:hoCA.PostGospelGlory.incipit	@ltx/gr_gr_cog/ho.ho03:hoMA.PostGospelMartyrs.incipit
ltx/gr_gr_cog/other.stsraphaelnicholasireneparaklesis:hoCA.PostGospelGlory.melody	
ltx/gr_gr_cog/other.stsraphaelnicholasireneparaklesis:hoCA.PostGospelGlory.mode	@ltx/gr_gr_cog/miscellanea:misc.Mode2
ltx/gr_gr_cog/other.stsraphaelnicholasireneparaklesis:hoCA.PostGospelGlory.text	@ltx/gr_gr_cog/ho.ho03:hoMA.PostGospelMartyrs.text
ltx/gr_gr_cog/other.stsraphaelnicholasireneparaklesis:hoCA.PostGospelHymn1.incipit	Ἄστρα ὡς νεόφωτα, τῇ τοῦ…
ltx/gr_gr_cog/other.stsraphaelnicholasireneparaklesis:hoCA.PostGospelHymn1.melody	@ltx/gr_gr_cog/he.a.m6:heAU.OlinApothemenoi.name
ltx/gr_gr_cog/other.stsraphaelnicholasireneparaklesis:hoCA.PostGospelHymn1.mode	@ltx/gr_gr_cog/miscellanea:misc.Mode6
ltx/gr_gr_cog/other.stsraphaelnicholasireneparaklesis:hoCA.PostGospelHymn1.text	Ἄστρα ὡς νεόφωτα, τῇ τοῦ Χριστοῦ Ἐκκλησίᾳ, ἐκ τῆς Λέσβου λάμψαντες, πάντας καταυγάζετε ἐν τοῖς θαύμασι, Ραφαὴλ μέγιστε, σὺν τῷ Νικολάῳ, καὶ Εἰρήνη καλλιπάρθενε, καὶ διαλύετε, τὴν τῶν παθημάτων σκοτόμαιναν, πιστοῖς ἐπιφαινόμενοι, πλήρεις συμπαθείας καὶ χάριτος· ὅθεν ἐκβοῶμεν, ἐν πάσῃ τῇ ζωῇ ἡμῶν σοφοί, μὴ διαλίπῃτε σκέποντες, πάσης περιστάσεως.
ltx/gr_gr_cog/other.stsraphaelnicholasireneparaklesis:hoCA.Troparion1.incipit	Πάντας τοὺς ἐν πίστει ἀκλινεῖ…
ltx/gr_gr_cog/other.stsraphaelnicholasireneparaklesis:hoCA.Troparion1.melody	@ltx/gr_gr_cog/he.a.m2:heAU.OteEkTouXylou.name
ltx/gr_gr_cog/other.stsraphaelnicholasireneparaklesis:hoCA.Troparion1.mode	@ltx/gr_gr_cog/miscellanea:misc.Mode2
ltx/gr_gr_cog/other.stsraphaelnicholasireneparaklesis:hoCA.Troparion1.text	Πάντας τοὺς ἐν πίστει ἀκλινεῖ, τοῖς ὑμῶν ἁγίοις λειψάνοις, φοιτῶντας Ἅγιοι, καὶ πρὸς τὴν ἀντίληψιν, τὴν ὀξυτάτην ὑμῶν, ἀφορῶντας ἑκάστοτε, Ραφαὴλ τρισμάκαρ, Εἰρήνη καὶ Νικόλαε, Θαυματουργοὶ Θαυμαστοί, πάσης ἐπηρείας καὶ βλάβης, λύπης καὶ πικρῶν νοσημάτων, ρύσασθε ὑμῶν τῇ θείᾳ χάριτι.
ltx/gr_gr_cog/other.stsraphaelnicholasireneparaklesis:hoCA.Troparion2.incipit	@ltx/gr_gr_cog/ho.ho23:hoCA.Troparion6.incipit
ltx/gr_gr_cog/other.stsraphaelnicholasireneparaklesis:hoCA.Troparion2.melody	
ltx/gr_gr_cog/other.stsraphaelnicholasireneparaklesis:hoCA.Troparion2.mode	@ltx/gr_gr_cog/miscellanea:misc.Mode2
ltx/gr_gr_cog/other.stsraphaelnicholasireneparaklesis:hoCA.Troparion2.text	@ltx/gr_gr_cog/ho.ho23:hoCA.Troparion6.text
ltx/gr_gr_cog/other.stsraphaelnicholasireneparaklesis:hoCA.Troparion3.incipit	@ltx/gr_gr_cog/ho.ho23:hoCA.Troparion7.incipit
ltx/gr_gr_cog/other.stsraphaelnicholasireneparaklesis:hoCA.Troparion3.melody	
ltx/gr_gr_cog/other.stsraphaelnicholasireneparaklesis:hoCA.Troparion3.mode	@ltx/gr_gr_cog/miscellanea:misc.Mode2
ltx/gr_gr_cog/other.stsraphaelnicholasireneparaklesis:hoCA.Troparion3.text	@ltx/gr_gr_cog/ho.ho23:hoCA.Troparion7.text
ltx/gr_gr_cog/other.stsraphaelnicholasireneparaklesis:hoCA.Troparion31.incipit	Διάσωσον, ὦ Ραφαὴλ καὶ Νικόλαε…
ltx/gr_gr_cog/other.stsraphaelnicholasireneparaklesis:hoCA.Troparion31.melody	Διάσωσον.
ltx/gr_gr_cog/other.stsraphaelnicholasireneparaklesis:hoCA.Troparion31.mode	@ltx/gr_gr_cog/miscellanea:misc.Mode8
ltx/gr_gr_cog/other.stsraphaelnicholasireneparaklesis:hoCA.Troparion31.text	Διάσωσον, ὦ Ραφαὴλ καὶ Νικόλαε καὶ Εἰρήνη, τοὺς ἐν πίστει ὑμῖν προστρέχοντας Ἅγιοι, ἀπὸ παντοίων κινδύνων καὶ νοσημάτων.
ltx/gr_gr_cog/other.stsraphaelnicholasireneparaklesis:hoCA.Troparion32.incipit	@ltx/gr_gr_cog/ho.ho23:hoCA.Troparion32.incipit
ltx/gr_gr_cog/other.stsraphaelnicholasireneparaklesis:hoCA.Troparion32.melody	Ἐπίβλεψον.
ltx/gr_gr_cog/other.stsraphaelnicholasireneparaklesis:hoCA.Troparion32.mode	@ltx/gr_gr_cog/miscellanea:misc.Mode8
ltx/gr_gr_cog/other.stsraphaelnicholasireneparaklesis:hoCA.Troparion32.text	@ltx/gr_gr_cog/ho.ho23:hoCA.Troparion32.text
ltx/gr_gr_cog/other.stsraphaelnicholasireneparaklesis:hoCA.Troparion61.incipit	@ltx/gr_gr_cog/other.stsraphaelnicholasireneparaklesis:hoCA.Troparion31.incipit
ltx/gr_gr_cog/other.stsraphaelnicholasireneparaklesis:hoCA.Troparion61.melody	Διάσωσον.
ltx/gr_gr_cog/other.stsraphaelnicholasireneparaklesis:hoCA.Troparion61.mode	@ltx/gr_gr_cog/miscellanea:misc.Mode8
ltx/gr_gr_cog/other.stsraphaelnicholasireneparaklesis:hoCA.Troparion61.text	@ltx/gr_gr_cog/other.stsraphaelnicholasireneparaklesis:hoCA.Troparion31.text
ltx/gr_gr_cog/other.stsraphaelnicholasireneparaklesis:hoCA.Troparion62.incipit	@ltx/gr_gr_cog/ho.ho23:hoCA.Troparion62.incipit
ltx/gr_gr_cog/other.stsraphaelnicholasireneparaklesis:hoCA.Troparion62.melody	Ἄχραντε.
ltx/gr_gr_cog/other.stsraphaelnicholasireneparaklesis:hoCA.Troparion62.mode	@ltx/gr_gr_cog/miscellanea:misc.Mode8
ltx/gr_gr_cog/other.stsraphaelnicholasireneparaklesis:hoCA.Troparion62.text	@ltx/gr_gr_cog/ho.ho23:hoCA.Troparion62.text
ltx/gr_gr_cog/other.stsraphaelnicholasireneparaklesis:hoCA.acrostic	Σκέπη ἡμῶν ἐστὲ Ἀθλοφόροι. Γερασίμου.
ltx/gr_gr_cog/other.stsraphaelnicholasireneparaklesis:hoCA.couplet1.title	@ltx/gr_gr_cog/titles:ti.Couplet
ltx/gr_gr_cog/other.stsraphaelnicholasireneparaklesis:hoCA.couplet1.verse1	Ραφαήλ, Νικόλαε σὺν τῇ Εἰρήνῃ,
ltx/gr_gr_cog/other.stsraphaelnicholasireneparaklesis:hoCA.couplet1.verse2	Γερασίμου δέξασθε νῦν τὰς δεήσεις.
ltx/gr_gr_cog/other.stsraphaelnicholasireneparaklesis:hoCA.media.text	
ltx/gr_gr_cog/other.stsraphaelnicholasireneparaklesis:hoCA.poet	@ltx/gr_gr_cog/poets:po.GerasimouMonachouMikragiannanitou
ltx/gr_gr_cog/other.stsraphaelnicholasireneparaklesis:hoCA.title	Παρακλητικὸς Κανὼν
ltx/gr_gr_cog/other.stsraphaelnicholasireneparaklesis:hoCA.title2	εἰς τοὺς Ἁγίους Ὁσιομάρτυρας Ραφαὴλ καὶ Νικόλαον, καὶ Εἰρήνην τὴν Παρθενομάρτυρα
ltx/gr_gr_cog/other.stsraphaelnicholasireneparaklesis:hoCA.translator	
