ltx/gr_gr_cog/me.m02.d08:meDA.commemoration.first	Μνήμη τοῦ Ἁγίου Μεγαλομάρτυρος Θεοδώρου τοῦ Στρατηλάτου
ltx/gr_gr_cog/me.m02.d08:meDA.commemoration.first_name	Ἅγ. Θεόδωρος Στρατηλάτης
ltx/gr_gr_cog/me.m02.d08:meDA.commemoration.first_short	Μνήμη τοῦ Ἁγίου Μεγαλομάρτυρος Θεοδώρου τοῦ Στρατηλάτου
ltx/gr_gr_cog/me.m02.d08:meDA.commemoration.first_title	@ltx/gr_gr_cog/titles:ti.Martyr
ltx/gr_gr_cog/me.m02.d08:meDA.commemoration.full	Μνήμη τοῦ Ἁγίου Μεγαλομάρτυρος Θεοδώρου τοῦ Στρατηλάτου, καὶ τοῦ Ἁγίου Προφήτου Ζαχαρίου.
ltx/gr_gr_cog/me.m02.d08:meDA.commemoration.second_name	
ltx/gr_gr_cog/me.m02.d08:meDA.commemoration.second_title	@ltx/gr_gr_cog/titles:ti.Prophet
ltx/gr_gr_cog/me.m02.d08:meDA.date	Τῌ Ηʹ ΦΕΒΡΟΥΑΡΙΟΥ
ltx/gr_gr_cog/me.m02.d08:meDA.dismissal	@ltx/gr_gr_cog/dismissals:dis00.meeting
ltx/gr_gr_cog/me.m02.d08:meDA.fordate	διὰ τὴν 8ην Φεβρουαρίου
ltx/gr_gr_cog/me.m02.d08:meDA.insert1	καὶ τοῦ Ἁγίου Μεγαλομάρτυρος Θεοδώρου τοῦ στρατηλάτου,
ltx/gr_gr_cog/me.m02.d08:meDA.insert2	οὗ καὶ τὴν μνήμην ἐπιτελοῦμεν·
ltx/gr_gr_cog/me.m02.d08:meDA.note	
ltx/gr_gr_cog/me.m02.d08:meDA.pdfcoverdate	τῆς 8ης Φεβρουαρίου,
ltx/gr_gr_cog/me.m02.d08:meDA.pdfheaderdate	τῆς 8ης Φεβρουαρίου
ltx/gr_gr_cog/me.m02.d08:meHO.commemorations	
ltx/gr_gr_cog/me.m02.d08:meHO.note1	@ltx/gr_gr_cog/rubrical:ru.HolidayWineOil
ltx/gr_gr_cog/me.m02.d08:meHO.note2	
ltx/gr_gr_cog/me.m02.d08:meHO.number	
ltx/gr_gr_cog/me.m02.d08:meHO.rank	
ltx/gr_gr_cog/me.m02.d08:meLE.commemoration1	Τοῦ Ἁγίου Μεγαλομάρτυρος Θεοδώρου τοῦ Στρατηλάτου.
ltx/gr_gr_cog/me.m02.d08:meLE.commemoration2	
ltx/gr_gr_cog/me.m02.d08:meLI.Kontakion1.greekmelody	@ltx/gr_gr_cog/me.m02.d08:meMA.Kontakion1.greekmelody
ltx/gr_gr_cog/me.m02.d08:meLI.Kontakion1.incipit	@ltx/gr_gr_cog/me.m02.d08:meMA.Kontakion1.incipit
ltx/gr_gr_cog/me.m02.d08:meLI.Kontakion1.melody	@ltx/gr_gr_cog/me.m02.d08:meMA.Kontakion1.melody
ltx/gr_gr_cog/me.m02.d08:meLI.Kontakion1.mode	@ltx/gr_gr_cog/me.m02.d08:meMA.Kontakion1.mode
ltx/gr_gr_cog/me.m02.d08:meLI.Kontakion1.text	@ltx/gr_gr_cog/me.m02.d08:meMA.Kontakion1.text
ltx/gr_gr_cog/me.m02.d08:meLI.Megalynarion.text	Χαίροις τῶν Μαρτύρων ἡ καλλονή, καὶ τῆς Ἐκκλησίας, ἀπροσμάχητος βοηθός, χαίροις δωρημάτων, θησαύρισμα τῶν θείων, Θεόδωρε τρισμάκαρ, ἡμῶν ἀντίληψις.
ltx/gr_gr_cog/me.m02.d08:meMA.AposBoth.incipit	Φῶς, εἰς ἀποκάλυψιν ἐθνῶν ἦλθες…
ltx/gr_gr_cog/me.m02.d08:meMA.AposBoth.melody	
ltx/gr_gr_cog/me.m02.d08:meMA.AposBoth.mode	@ltx/gr_gr_cog/miscellanea:misc.Mode7
ltx/gr_gr_cog/me.m02.d08:meMA.AposBoth.text	Φῶς, εἰς ἀποκάλυψιν ἐθνῶν ἦλθες ἐξ οὐρανοῦ Σωτὴρ ἡμῶν, καὶ προελθὼν ἐκ τῆς Παρθένου, ἐπανεπαύσω ἐν ἀγκάλαις τοῦ δικαίου Συμεών· ἔδει γὰρ σε Ζωοδότα τῶν ἁπάντων, ὑπὸ τοῦ Πρεσβύτου γνωρισθῆναι, ὅτι παρεγένου ἀπολῦσαι αὐτόν, κατὰ τὸ ῥῆμά σου, ὁ ἔχων τὸ μέγα ἔλεος.
ltx/gr_gr_cog/me.m02.d08:meMA.AposGlory.incipit	Ἀθλητικὸν συστησάμενος στάδιον κατὰ τῆς…
ltx/gr_gr_cog/me.m02.d08:meMA.AposGlory.melody	
ltx/gr_gr_cog/me.m02.d08:meMA.AposGlory.mode	@ltx/gr_gr_cog/miscellanea:misc.Mode8
ltx/gr_gr_cog/me.m02.d08:meMA.AposGlory.text	Ἀθλητικὸν συστησάμενος στάδιον κατὰ τῆς πλάνης, ἠνδραγάθησας Θεόδωρε, τῇ πυριφθόγγῳ γλώττῃ σου, καταισχύνας Λικινίου τὸ ἀπάνθρωπον· διὸ καὶ σὺν Ἀγγέλοις χορεύων μακάριε, αἴτησαι Χριστῷ τῷ Θεῷ, ὅπως ἵλεως γενήσεται ἡμῖν, ἐν τῇ ἡμέρᾳ τῆς κρίσεως.
ltx/gr_gr_cog/me.m02.d08:meMA.Aposticha1.greekmelody	@ltx/gr_gr_cog/he.a.m2:heAU.OikosTouEfratha.greekname
ltx/gr_gr_cog/me.m02.d08:meMA.Aposticha1.incipit	Ὁ πάντα τῇ χειρί, περιέχων…
ltx/gr_gr_cog/me.m02.d08:meMA.Aposticha1.melody	@ltx/gr_gr_cog/he.a.m2:heAU.OikosTouEfratha.name
ltx/gr_gr_cog/me.m02.d08:meMA.Aposticha1.mode	@ltx/gr_gr_cog/miscellanea:misc.Mode2
ltx/gr_gr_cog/me.m02.d08:meMA.Aposticha1.text	Ὁ πάντα τῇ χειρί, περιέχων ὡς Κτίστης, καὶ δεσπόζων ἁπάντων, ὑπὸ χειρῶν Πρεσβύτου, ἐν τῷ ναῷ προσάγεται.
ltx/gr_gr_cog/me.m02.d08:meMA.Aposticha2.incipit	Ἀγάλλου Συμεών, καὶ ἡ Ἄννα…
ltx/gr_gr_cog/me.m02.d08:meMA.Aposticha2.melody	@ltx/gr_gr_cog/he.a.m2:heAU.OikosTouEfratha.name
ltx/gr_gr_cog/me.m02.d08:meMA.Aposticha2.mode	@ltx/gr_gr_cog/miscellanea:misc.Mode2
ltx/gr_gr_cog/me.m02.d08:meMA.Aposticha2.text	Ἀγάλλου Συμεών, καὶ ἡ Ἄννα εὐφραίνου· ἰδοὺ γὰρ ἐπεφάνη, ὁ Λυτρωτὴς τοῦ κόσμου, ὡς βρέφος προσαγόμενος.
ltx/gr_gr_cog/me.m02.d08:meMA.Aposticha3.incipit	Λέλυσαι τῆς φθορᾶς, Συμεὼν θεοφόρε…
ltx/gr_gr_cog/me.m02.d08:meMA.Aposticha3.melody	@ltx/gr_gr_cog/he.a.m2:heAU.OikosTouEfratha.name
ltx/gr_gr_cog/me.m02.d08:meMA.Aposticha3.mode	@ltx/gr_gr_cog/miscellanea:misc.Mode2
ltx/gr_gr_cog/me.m02.d08:meMA.Aposticha3.text	Λέλυσαι τῆς φθορᾶς, Συμεὼν θεοφόρε, ἐν χερσὶ τὸν πάντα, κατέχοντα βαστάζων· εἶδες γὰρ τὸ σωτήριον.
ltx/gr_gr_cog/me.m02.d08:meMA.C1.acrostic.notice1	οὗ ἡ Ἀκροστιχίς·
ltx/gr_gr_cog/me.m02.d08:meMA.C1.acrostic.notice2	Ἐν δὲ τοῖς Θεοτοκίοις· Νικολάου.
ltx/gr_gr_cog/me.m02.d08:meMA.C1.acrostic.text	Φερώνυμον δῶρόν σε τοῦ Θεοῦ σέβω.
ltx/gr_gr_cog/me.m02.d08:meMA.C1.acrostic.title	Ὁ Κανὼν τοῦ Μάρτυρος,
ltx/gr_gr_cog/me.m02.d08:meMA.C1.title	@ltx/gr_gr_cog/titles:ti.CanonMartyrM
ltx/gr_gr_cog/me.m02.d08:meMA.C1.verse	@ltx/gr_gr_cog/prayers:pr.verse_SaintM.text
ltx/gr_gr_cog/me.m02.d08:meMA.C2.acrostic.notice1	οὗ ἡ Ἀκροστιχίς·
ltx/gr_gr_cog/me.m02.d08:meMA.C2.acrostic.text	Ἐκπλήττομαί σου τοὺς λόγους Ζαχαρία.
ltx/gr_gr_cog/me.m02.d08:meMA.C2.acrostic.title	Ὁ Κανὼν τοῦ Προφήτου,
ltx/gr_gr_cog/me.m02.d08:meMA.C2.poet	@ltx/gr_gr_cog/poets:po.Theofanous
ltx/gr_gr_cog/me.m02.d08:meMA.C2.title	@ltx/gr_gr_cog/titles:ti.CanonProphet
ltx/gr_gr_cog/me.m02.d08:meMA.C2.verse	@ltx/gr_gr_cog/prayers:pr.verse_SaintM.text
ltx/gr_gr_cog/me.m02.d08:meMA.Exaposteilarion1.greekmelody	@ltx/gr_gr_cog/he.a.m2:heAU.ToisMathitaisSynelthomen.greekname
ltx/gr_gr_cog/me.m02.d08:meMA.Exaposteilarion1.incipit	Μεγαλομάρτυς ἔνδοξε, τοῦ Χριστοῦ Στρατηλάτα…
ltx/gr_gr_cog/me.m02.d08:meMA.Exaposteilarion1.melody	@ltx/gr_gr_cog/he.a.m2:heAU.ToisMathitaisSynelthomen.name
ltx/gr_gr_cog/me.m02.d08:meMA.Exaposteilarion1.mode	@ltx/gr_gr_cog/miscellanea:misc.Mode2
ltx/gr_gr_cog/me.m02.d08:meMA.Exaposteilarion1.text	Μεγαλομάρτυς ἔνδοξε, τοῦ Χριστοῦ Στρατηλάτα, καὶ θεῖον ἐγκαλλώπισμα, τῶν σεπτῶν ἀθλοφόρων, Θεόδωρε γενναιόφρον, μὴ ἐλλίπῃς αἰτεῖσθαι, τῷ Βασιλεῖ τὰ τρόπαια, καὶ εἰρήνην τῷ κόσμω, καὶ ἱλασμόν, τῶν ἁμαρτημάτων καὶ σωτηρίαν, τοῖς ἐκτελοῦσι πάνσοφε, τὴν φωσφόρον σου μνήμην.
ltx/gr_gr_cog/me.m02.d08:meMA.Exaposteilarion2.greekmelody	@ltx/gr_gr_cog/me.m02.d02:meMA.Exaposteilarion1.greekmelody
ltx/gr_gr_cog/me.m02.d08:meMA.Exaposteilarion2.incipit	@ltx/gr_gr_cog/me.m02.d02:meMA.Exaposteilarion1.incipit
ltx/gr_gr_cog/me.m02.d08:meMA.Exaposteilarion2.melody	@ltx/gr_gr_cog/me.m02.d02:meMA.Exaposteilarion1.melody
ltx/gr_gr_cog/me.m02.d08:meMA.Exaposteilarion2.mode	@ltx/gr_gr_cog/miscellanea:misc.Mode3
ltx/gr_gr_cog/me.m02.d08:meMA.Exaposteilarion2.text	@ltx/gr_gr_cog/me.m02.d02:meMA.Exaposteilarion1.text
ltx/gr_gr_cog/me.m02.d08:meMA.Kathisma11.greekmelody	@ltx/gr_gr_cog/he.a.m4:heAU.OYpsotheisEnToStavro.greekname
ltx/gr_gr_cog/me.m02.d08:meMA.Kathisma11.incipit	Ὁ μεγαλώνυμος Χριστοῦ ἀθλοφόρος, ὁ…
ltx/gr_gr_cog/me.m02.d08:meMA.Kathisma11.melody	@ltx/gr_gr_cog/he.a.m4:heAU.OYpsotheisEnToStavro.name
ltx/gr_gr_cog/me.m02.d08:meMA.Kathisma11.mode	@ltx/gr_gr_cog/miscellanea:misc.Mode4
ltx/gr_gr_cog/me.m02.d08:meMA.Kathisma11.text	Ὁ μεγαλώνυμος Χριστοῦ ἀθλοφόρος, ὁ ἐπιπόθητος Θεῷ καὶ Ἀγγέλοις, ὁ θαυμαστὸς καὶ ἔνδοξος Θεόδωρος, πάσας τὰς ὑφήλιον, ἱερὰς Ἐκκλησίας, σήμερον τῷ Πνεύματι, τῷ ἁγίῳ εὐφραίνει, καὶ ἑορτάζειν πάντας ἐν χαρᾷ, παρασκευάζει αὐτοῦ τὸ μνημόσυνον.
ltx/gr_gr_cog/me.m02.d08:meMA.Kathisma12.greekmelody	@ltx/gr_gr_cog/he.a.m4:heAU.KateplagiIosif.greekname
ltx/gr_gr_cog/me.m02.d08:meMA.Kathisma12.incipit	@ltx/gr_gr_cog/me.m02.d02:meMA.Ode3Kathisma1.incipit
ltx/gr_gr_cog/me.m02.d08:meMA.Kathisma12.melody	@ltx/gr_gr_cog/he.a.m4:heAU.KateplagiIosif.name
ltx/gr_gr_cog/me.m02.d08:meMA.Kathisma12.mode	@ltx/gr_gr_cog/miscellanea:misc.Mode4
ltx/gr_gr_cog/me.m02.d08:meMA.Kathisma12.text	@ltx/gr_gr_cog/me.m02.d02:meMA.Ode3Kathisma1.text
ltx/gr_gr_cog/me.m02.d08:meMA.Kathisma21.greekmelody	@ltx/gr_gr_cog/he.a.m1:heAU.TouLithouSfragisthentos.greekname
ltx/gr_gr_cog/me.m02.d08:meMA.Kathisma21.incipit	Θησαυρὲ τῶν αἰώνων, ἡ ζωὴ…
ltx/gr_gr_cog/me.m02.d08:meMA.Kathisma21.melody	@ltx/gr_gr_cog/he.a.m1:heAU.TouLithouSfragisthentos.name
ltx/gr_gr_cog/me.m02.d08:meMA.Kathisma21.mode	@ltx/gr_gr_cog/miscellanea:misc.Mode1
ltx/gr_gr_cog/me.m02.d08:meMA.Kathisma21.text	Θησαυρὲ τῶν αἰώνων, ἡ ζωὴ τῶν ἁπάντων, διʼ ἐμὲ νηπιάσας ὑπὸ νόμον ἐγένου, ὁ πάλαι χαράξας ἐν πλαξί, τὸν νόμον ἐν τῷ ὄρει τῷ Σινᾷ, ἵνα πάντας ἀπαλλάξῃς, ἐκ τῆς τοῦ νόμου πάλαι δουλείας. Δόξα τῇ εὐσπλαγχνίᾳ σου Σωτήρ, δόξα τῇ βασιλείᾳ σου, δόξα τῇ οἰκονομίᾳ σου, μόνε φιλάνθρωπε.
ltx/gr_gr_cog/me.m02.d08:meMA.Kontakion1.greekmelody	@ltx/gr_gr_cog/he.a.m2:heAU.TaAnoZiton.greekname
ltx/gr_gr_cog/me.m02.d08:meMA.Kontakion1.incipit	Ἀνδρείᾳ ψυχῆς, τὴν πίστιν ὁπλισάμενος…
ltx/gr_gr_cog/me.m02.d08:meMA.Kontakion1.melody	@ltx/gr_gr_cog/he.a.m2:heAU.TaAnoZiton.name
ltx/gr_gr_cog/me.m02.d08:meMA.Kontakion1.mode	@ltx/gr_gr_cog/miscellanea:misc.Mode2
ltx/gr_gr_cog/me.m02.d08:meMA.Kontakion1.text	Ἀνδρείᾳ ψυχῆς, τὴν πίστιν ὁπλισάμενος, καὶ ῥῆμα Θεοῦ, ὡς λόγχην χειρισάμενος, τὸν ἐχθρὸν κατέτρωσας τῶν Μαρτύρων κλέος Θεόδωρε, σὺν αὐτοῖς Χριστῷ τῷ Θεῷ, πρεσβεύων μὴ παύσῃ ὑπὲρ πάντων ἡμῶν.
ltx/gr_gr_cog/me.m02.d08:meMA.Lauds1.greekmelody	@ltx/gr_gr_cog/he.a.m4:heAU.OsGennaionEnMartysi.greekname
ltx/gr_gr_cog/me.m02.d08:meMA.Lauds1.incipit	Ἀθλητὴς γενναιότατος, στρατιώτης ἀήττητος, ἐν…
ltx/gr_gr_cog/me.m02.d08:meMA.Lauds1.melody	@ltx/gr_gr_cog/he.a.m4:heAU.OsGennaionEnMartysi.name
ltx/gr_gr_cog/me.m02.d08:meMA.Lauds1.mode	@ltx/gr_gr_cog/miscellanea:misc.Mode4
ltx/gr_gr_cog/me.m02.d08:meMA.Lauds1.text	Ἀθλητὴς γενναιότατος, στρατιώτης ἀήττητος, ἐν Ἁγίῳ Πνεύματι ἀναδέδειξαι, καταβαλὼν τὸν πολέμιον, σοφίᾳ τῶν λόγων σου, καὶ τῶν ἔργων σου σοφέ, καρτεραῖς ἐπιδείξεσιν· ὅθεν εἴληφας, τοὺς στεφάνους τῆς νίκης, καὶ ταῖς ἄνω, ὁμηγύρεσι συνήφθης, κλέος Μαρτύρων Θεόδωρε.
ltx/gr_gr_cog/me.m02.d08:meMA.Lauds2.incipit	Καὶ σταυρῷ ἀναρτώμενος, καὶ τὰς…
ltx/gr_gr_cog/me.m02.d08:meMA.Lauds2.melody	@ltx/gr_gr_cog/he.a.m4:heAU.OsGennaionEnMartysi.name
ltx/gr_gr_cog/me.m02.d08:meMA.Lauds2.mode	@ltx/gr_gr_cog/miscellanea:misc.Mode4
ltx/gr_gr_cog/me.m02.d08:meMA.Lauds2.text	Καὶ σταυρῷ ἀναρτώμενος, καὶ τὰς σάρκας τυπτόμενος, ὀξυτάτοις βέλεσι τιτρωσκόμενος, καὶ ἐπὶ ξύλου τεινόμενος, καὶ πλευρὰς ξεόμενος, καὶ παντοίαις χαλεπαῖς, ἀλγηδόσι κυκλούμενος, ἀπαράτρωτος, καὶ ἀήττητος ὤφθης τῇ δυνάμει, τοῦ Σταυρῷ προσηλωθέντος, κλέος Μαρτύρων Θεόδωρε.
ltx/gr_gr_cog/me.m02.d08:meMA.Lauds3.incipit	Θεῖον ἄγαλμα γέγονας, εὐσεβείας πανόλβιε…
ltx/gr_gr_cog/me.m02.d08:meMA.Lauds3.melody	@ltx/gr_gr_cog/he.a.m4:heAU.OsGennaionEnMartysi.name
ltx/gr_gr_cog/me.m02.d08:meMA.Lauds3.mode	@ltx/gr_gr_cog/miscellanea:misc.Mode4
ltx/gr_gr_cog/me.m02.d08:meMA.Lauds3.text	Θεῖον ἄγαλμα γέγονας, εὐσεβείας πανόλβιε, δυσσεβῶν ἀγάλματα βδελυξάμενος, καὶ Ἱερεῖον ὁλόκληρον, καὶ θῦμα εὐπρόσδεκτον τῷ τυθέντι διὰ σέ, καθαρῶς, προσαγόμενος, τῷ δοξάσαντι, τὴν ἁγίαν σου μνήμην καὶ θαυμάτων, θησαυρόν σε τοῖς ἐν κόσμῳ, δωρησαμένῳ Θεόδωρε.
ltx/gr_gr_cog/me.m02.d08:meMA.LaudsBoth.incipit	@ltx/gr_gr_cog/me.m02.d02:meVE.Lity6.incipit
ltx/gr_gr_cog/me.m02.d08:meMA.LaudsBoth.melody	
ltx/gr_gr_cog/me.m02.d08:meMA.LaudsBoth.mode	@ltx/gr_gr_cog/miscellanea:misc.Mode2
ltx/gr_gr_cog/me.m02.d08:meMA.LaudsBoth.poet	@ltx/gr_gr_cog/poets:po.Germanou
ltx/gr_gr_cog/me.m02.d08:meMA.LaudsBoth.text	@ltx/gr_gr_cog/me.m02.d02:meVE.Lity6.text
ltx/gr_gr_cog/me.m02.d08:meMA.LaudsGlory.incipit	Ἀθλητικὴν ἀνδρείαν, καὶ λογικὴν λατρείαν…
ltx/gr_gr_cog/me.m02.d08:meMA.LaudsGlory.melody	
ltx/gr_gr_cog/me.m02.d08:meMA.LaudsGlory.mode	@ltx/gr_gr_cog/miscellanea:misc.Mode8
ltx/gr_gr_cog/me.m02.d08:meMA.LaudsGlory.text	Ἀθλητικὴν ἀνδρείαν, καὶ λογικὴν λατρείαν εὐσεβῶς καθοπλισθείς, Ἀθλοφόρε Χριστοῦ, καὶ στεῤῥῶς παραταχθεὶς τῇ δυνάμει αὐτοῦ, τῶν εἰδώλων τὸ ἀσεβές, καὶ τῶν Τυράννων τὸ ἀπηνές, ἀσθενὲς ἀπέδειξας, καταφρονῶν τῶν βασάνων, καὶ τοῦ προσκαίρου πυρός. Ἀλλʼ ὦ θείων δωρεῶν καὶ πρᾶγμα καὶ ὄνομα, ἀπὸ πάσης περιστάσεως, τῇ πρεσβείᾳ σου σῷζε, τοὺς τελοῦντας τὴν μνήμην σου.
ltx/gr_gr_cog/me.m02.d08:meMA.Ode1C11.greekmelody	@ltx/gr_gr_cog/he.h.m8:heHE.ArmatilatinFarao.greekname
ltx/gr_gr_cog/me.m02.d08:meMA.Ode1C11.incipit	Φερωνυμίᾳ θεολήπτου κλήσεως καλλωπιζόμενος, καὶ…
ltx/gr_gr_cog/me.m02.d08:meMA.Ode1C11.melody	@ltx/gr_gr_cog/he.h.m8:heHE.ArmatilatinFarao.name
ltx/gr_gr_cog/me.m02.d08:meMA.Ode1C11.mode	@ltx/gr_gr_cog/miscellanea:misc.Mode8
ltx/gr_gr_cog/me.m02.d08:meMA.Ode1C11.ode	@ltx/gr_gr_cog/miscellanea:misc.Ode1
ltx/gr_gr_cog/me.m02.d08:meMA.Ode1C11.text	Φερωνυμίᾳ θεολήπτου κλήσεως καλλωπιζόμενος, καὶ δωρεῶν θείων, θησαυρὸς δεικνύμενος, καὶ μαρτυρίου χάριτι, Μάκαρ κεκοσμημένος, τοὺς ὑμνητάς σου χαρίτωσον, ὕμνοις σε τιμῶντας Θεόδωρε.
ltx/gr_gr_cog/me.m02.d08:meMA.Ode1C12.incipit	Ἔργῳ καὶ λόγῳ σοῦ τὴν…
ltx/gr_gr_cog/me.m02.d08:meMA.Ode1C12.melody	@ltx/gr_gr_cog/he.h.m8:heHE.ArmatilatinFarao.name
ltx/gr_gr_cog/me.m02.d08:meMA.Ode1C12.mode	@ltx/gr_gr_cog/miscellanea:misc.Mode8
ltx/gr_gr_cog/me.m02.d08:meMA.Ode1C12.ode	@ltx/gr_gr_cog/miscellanea:misc.Ode1
ltx/gr_gr_cog/me.m02.d08:meMA.Ode1C12.text	Ἔργῳ καὶ λόγῳ σοῦ τὴν θεοδώρητον, κλῆσιν πιστούμενος, τὰς δωρεὰς νέμεις, δωρεὰν τοῖς χρῄζουσι· δώρημα γὰρ πᾶν τέλειον, ἄνωθεν καταβαῖνον, ἐκ τοῦ Πατρός προσδεχόμενος, ἅπαντας πλουτίζεις τιμῶντάς σε,
ltx/gr_gr_cog/me.m02.d08:meMA.Ode1C13.incipit	Ῥώμην θεόθεν νηπιόθεν πάνσοφε, λαβὼν…
ltx/gr_gr_cog/me.m02.d08:meMA.Ode1C13.melody	@ltx/gr_gr_cog/he.h.m8:heHE.ArmatilatinFarao.name
ltx/gr_gr_cog/me.m02.d08:meMA.Ode1C13.mode	@ltx/gr_gr_cog/miscellanea:misc.Mode8
ltx/gr_gr_cog/me.m02.d08:meMA.Ode1C13.ode	@ltx/gr_gr_cog/miscellanea:misc.Ode1
ltx/gr_gr_cog/me.m02.d08:meMA.Ode1C13.text	Ῥώμην θεόθεν νηπιόθεν πάνσοφε, λαβὼν καὶ σύνεσιν, πάθη σαρκός, πάντα, πρότερον καὶ δαίμονας, ἀνδρείως καταβέβληκας, ὕστερον δὲ καθεῖλες, ἐχθρῶν τυράννων τὸ φρύαγμα, Μάκαρ συμμαχίᾳ τοῦ Πνεύματος.
ltx/gr_gr_cog/me.m02.d08:meMA.Ode1C14.incipit	Ὡς ἐντρεχὴς καὶ νουνεχὴς καὶ…
ltx/gr_gr_cog/me.m02.d08:meMA.Ode1C14.melody	@ltx/gr_gr_cog/he.h.m8:heHE.ArmatilatinFarao.name
ltx/gr_gr_cog/me.m02.d08:meMA.Ode1C14.mode	@ltx/gr_gr_cog/miscellanea:misc.Mode8
ltx/gr_gr_cog/me.m02.d08:meMA.Ode1C14.ode	@ltx/gr_gr_cog/miscellanea:misc.Ode1
ltx/gr_gr_cog/me.m02.d08:meMA.Ode1C14.text	Ὡς ἐντρεχὴς καὶ νουνεχὴς καὶ φρόνιμος, κατεσοφίσω σοφῶς, τὸν σοφιστὴν Μάκαρ, τῆς κακίας ῥήμασι, καὶ πράγμασι Λικίνιον, ἐδελέασας δείξας, νεκροῖς ξοάνοις λατρεύοντα, καὶ κεναῖς ἐλπίσι τρεφόμενον.
ltx/gr_gr_cog/me.m02.d08:meMA.Ode1C1H.greekmelody	@ltx/gr_gr_cog/he.h.m8:heHE.ArmatilatinFarao.greekname
ltx/gr_gr_cog/me.m02.d08:meMA.Ode1C1H.incipit	@ltx/gr_gr_cog/he.h.m8:heHE.ArmatilatinFarao.incipit
ltx/gr_gr_cog/me.m02.d08:meMA.Ode1C1H.melody	@ltx/gr_gr_cog/he.h.m8:heHE.ArmatilatinFarao.melody
ltx/gr_gr_cog/me.m02.d08:meMA.Ode1C1H.mode	@ltx/gr_gr_cog/miscellanea:misc.Mode8
ltx/gr_gr_cog/me.m02.d08:meMA.Ode1C1H.ode	@ltx/gr_gr_cog/miscellanea:misc.Ode1
ltx/gr_gr_cog/me.m02.d08:meMA.Ode1C1H.text	@ltx/gr_gr_cog/he.h.m8:heHE.ArmatilatinFarao.text
ltx/gr_gr_cog/me.m02.d08:meMA.Ode1C1T.incipit	Νῖκός μοι δίδου Παναγία ἄχραντε…
ltx/gr_gr_cog/me.m02.d08:meMA.Ode1C1T.melody	@ltx/gr_gr_cog/he.h.m8:heHE.ArmatilatinFarao.name
ltx/gr_gr_cog/me.m02.d08:meMA.Ode1C1T.mode	@ltx/gr_gr_cog/miscellanea:misc.Mode8
ltx/gr_gr_cog/me.m02.d08:meMA.Ode1C1T.ode	@ltx/gr_gr_cog/miscellanea:misc.Ode1
ltx/gr_gr_cog/me.m02.d08:meMA.Ode1C1T.text	Νῖκός μοι δίδου Παναγία ἄχραντε, τῷ καταφεύγοντι, ὑπὸ τὴν σὴν σκέπην, τῶν δεινῶν ἐξαίρουσα, ἀεί με ταῖς πρεσβείαις σου· καὶ γὰρ τέτοκας Λόγον, τὸν τῷ Πατρὶ συναΐδιον, ὁμοῦ τε τῷ Πνεύματι σύνθρονον.
ltx/gr_gr_cog/me.m02.d08:meMA.Ode1C21.greekmelody	@ltx/gr_gr_cog/he.h.m8:heHE.AsomenToKyrio.greekname
ltx/gr_gr_cog/me.m02.d08:meMA.Ode1C21.incipit	Ἔχων τὸν φωτοδότην, ταῖς σαῖς…
ltx/gr_gr_cog/me.m02.d08:meMA.Ode1C21.melody	@ltx/gr_gr_cog/he.h.m8:heHE.AsomenToKyrio.name
ltx/gr_gr_cog/me.m02.d08:meMA.Ode1C21.mode	@ltx/gr_gr_cog/miscellanea:misc.Mode8
ltx/gr_gr_cog/me.m02.d08:meMA.Ode1C21.ode	@ltx/gr_gr_cog/miscellanea:misc.Ode1
ltx/gr_gr_cog/me.m02.d08:meMA.Ode1C21.text	Ἔχων τὸν φωτοδότην, ταῖς σαῖς ὑπακούοντα δεήσεσι, φωτισμόν μοι παράσχου, Ζαχαρία Προφῆτα θεσπέσιε.
ltx/gr_gr_cog/me.m02.d08:meMA.Ode1C22.incipit	Κατακεκοσμημένος, κάλλεσι τῆς θείας ὡραιότητος…
ltx/gr_gr_cog/me.m02.d08:meMA.Ode1C22.melody	@ltx/gr_gr_cog/he.h.m8:heHE.AsomenToKyrio.name
ltx/gr_gr_cog/me.m02.d08:meMA.Ode1C22.mode	@ltx/gr_gr_cog/miscellanea:misc.Mode8
ltx/gr_gr_cog/me.m02.d08:meMA.Ode1C22.ode	@ltx/gr_gr_cog/miscellanea:misc.Ode1
ltx/gr_gr_cog/me.m02.d08:meMA.Ode1C22.text	Κατακεκοσμημένος, κάλλεσι τῆς θείας ὡραιότητος, τῶν Ἀγγέλων τὸ κάλλος, ἐθεώρεις ψυχῆς ὡραιότητι.
ltx/gr_gr_cog/me.m02.d08:meMA.Ode1C23.incipit	Πλήρης ἁγιωσύνης, ἀγγελομιμήτου καὶ φαιδρότητος…
ltx/gr_gr_cog/me.m02.d08:meMA.Ode1C23.melody	@ltx/gr_gr_cog/he.h.m8:heHE.AsomenToKyrio.name
ltx/gr_gr_cog/me.m02.d08:meMA.Ode1C23.mode	@ltx/gr_gr_cog/miscellanea:misc.Mode8
ltx/gr_gr_cog/me.m02.d08:meMA.Ode1C23.ode	@ltx/gr_gr_cog/miscellanea:misc.Ode1
ltx/gr_gr_cog/me.m02.d08:meMA.Ode1C23.text	Πλήρης ἁγιωσύνης, ἀγγελομιμήτου καὶ φαιδρότητος, συλλαλοῦντας Ἀγγέλους, καὶ φωτίζοντας ἔσχες θεόληπτε.
ltx/gr_gr_cog/me.m02.d08:meMA.Ode1C2H.greekmelody	@ltx/gr_gr_cog/he.h.m8:heHE.AsomenToKyrio.greekname
ltx/gr_gr_cog/me.m02.d08:meMA.Ode1C2H.incipit	@ltx/gr_gr_cog/he.h.m8:heHE.AsomenToKyrio.incipit
ltx/gr_gr_cog/me.m02.d08:meMA.Ode1C2H.melody	@ltx/gr_gr_cog/he.h.m8:heHE.AsomenToKyrio.melody
ltx/gr_gr_cog/me.m02.d08:meMA.Ode1C2H.mode	@ltx/gr_gr_cog/miscellanea:misc.Mode8
ltx/gr_gr_cog/me.m02.d08:meMA.Ode1C2H.ode	@ltx/gr_gr_cog/miscellanea:misc.Ode1
ltx/gr_gr_cog/me.m02.d08:meMA.Ode1C2H.text	@ltx/gr_gr_cog/he.h.m8:heHE.AsomenToKyrio.text
ltx/gr_gr_cog/me.m02.d08:meMA.Ode1C2T.incipit	Λέλυται ἡ κατάρα, Εὔας τῆς…
ltx/gr_gr_cog/me.m02.d08:meMA.Ode1C2T.melody	@ltx/gr_gr_cog/he.h.m8:heHE.AsomenToKyrio.name
ltx/gr_gr_cog/me.m02.d08:meMA.Ode1C2T.mode	@ltx/gr_gr_cog/miscellanea:misc.Mode8
ltx/gr_gr_cog/me.m02.d08:meMA.Ode1C2T.ode	@ltx/gr_gr_cog/miscellanea:misc.Ode1
ltx/gr_gr_cog/me.m02.d08:meMA.Ode1C2T.text	Λέλυται ἡ κατάρα, Εὔας τῆς Προμήτορος Πανάμωμε· τὸν Χριστὸν γὰρ τεκοῦσα, εὐλογίαις τὸν κόσμον ἐπλούτισας.
ltx/gr_gr_cog/me.m02.d08:meMA.Ode3C11.greekmelody	@ltx/gr_gr_cog/he.h.m8:heHE.OuraniasApsidos.greekname
ltx/gr_gr_cog/me.m02.d08:meMA.Ode3C11.incipit	Νεανίας ὡραῖος, πανευπρεπὴς δέδειξαι, κάλλει…
ltx/gr_gr_cog/me.m02.d08:meMA.Ode3C11.melody	@ltx/gr_gr_cog/he.h.m8:heHE.OuraniasApsidos.name
ltx/gr_gr_cog/me.m02.d08:meMA.Ode3C11.mode	@ltx/gr_gr_cog/miscellanea:misc.Mode8
ltx/gr_gr_cog/me.m02.d08:meMA.Ode3C11.ode	@ltx/gr_gr_cog/miscellanea:misc.Ode3
ltx/gr_gr_cog/me.m02.d08:meMA.Ode3C11.text	Νεανίας ὡραῖος, πανευπρεπὴς δέδειξαι, κάλλει καταλλήλως ἐμπρέπων, ψυχῆς καὶ σώματος, ὡραϊζόμενος, τῶν ἀρετῶν εὐμορφίᾳ καὶ μαρτύρων στίγμασι, καλλωπιζόμενος.
ltx/gr_gr_cog/me.m02.d08:meMA.Ode3C12.incipit	Ὑπὸ θείας προνοίας, ὁδηγηθεὶς ὥδευσας…
ltx/gr_gr_cog/me.m02.d08:meMA.Ode3C12.melody	@ltx/gr_gr_cog/he.h.m8:heHE.OuraniasApsidos.name
ltx/gr_gr_cog/me.m02.d08:meMA.Ode3C12.mode	@ltx/gr_gr_cog/miscellanea:misc.Mode8
ltx/gr_gr_cog/me.m02.d08:meMA.Ode3C12.ode	@ltx/gr_gr_cog/miscellanea:misc.Ode3
ltx/gr_gr_cog/me.m02.d08:meMA.Ode3C12.text	Ὑπὸ θείας προνοίας, ὁδηγηθεὶς ὥδευσας, τρίβον μαρτυρίου Δεσπότου, τοῦ τὴν καρδίαν σου, Μάκαρ πλατύναντος, ταῖς δωρεαῖς τῶν χαρίτων, καὶ πρὸς τὴν οὐράνιον κλίσιν ἰθύναντος.
ltx/gr_gr_cog/me.m02.d08:meMA.Ode3C13.incipit	Μεγαλόφρονι γνώμῃ, περιφρονῶν Πάνσοφε, τῶν…
ltx/gr_gr_cog/me.m02.d08:meMA.Ode3C13.melody	@ltx/gr_gr_cog/he.h.m8:heHE.OuraniasApsidos.name
ltx/gr_gr_cog/me.m02.d08:meMA.Ode3C13.mode	@ltx/gr_gr_cog/miscellanea:misc.Mode8
ltx/gr_gr_cog/me.m02.d08:meMA.Ode3C13.ode	@ltx/gr_gr_cog/miscellanea:misc.Ode3
ltx/gr_gr_cog/me.m02.d08:meMA.Ode3C13.text	Μεγαλόφρονι γνώμῃ, περιφρονῶν Πάνσοφε, τῶν ἡδέων τοῦ κόσμου, καὶ τῶν τοῦ βίου τερπνῶν, οὐδὲν προέκρινας, τῆς τοῦ Σωτῆρος ἀγάπης, ἀλλʼ αὐτὸν ἐπόθησας, ψυχῆς εὐθύτητι.
ltx/gr_gr_cog/me.m02.d08:meMA.Ode3C1H.greekmelody	@ltx/gr_gr_cog/he.h.m8:heHE.OuraniasApsidos.greekname
ltx/gr_gr_cog/me.m02.d08:meMA.Ode3C1H.incipit	@ltx/gr_gr_cog/he.h.m8:heHE.OuraniasApsidos.incipit
ltx/gr_gr_cog/me.m02.d08:meMA.Ode3C1H.melody	@ltx/gr_gr_cog/he.h.m8:heHE.OuraniasApsidos.melody
ltx/gr_gr_cog/me.m02.d08:meMA.Ode3C1H.mode	@ltx/gr_gr_cog/miscellanea:misc.Mode8
ltx/gr_gr_cog/me.m02.d08:meMA.Ode3C1H.ode	@ltx/gr_gr_cog/miscellanea:misc.Ode3
ltx/gr_gr_cog/me.m02.d08:meMA.Ode3C1H.text	@ltx/gr_gr_cog/he.h.m8:heHE.OuraniasApsidos.text
ltx/gr_gr_cog/me.m02.d08:meMA.Ode3C1T.incipit	Ἱκετεύω σε μόνην, τὴν τὸν…
ltx/gr_gr_cog/me.m02.d08:meMA.Ode3C1T.melody	@ltx/gr_gr_cog/he.h.m8:heHE.OuraniasApsidos.name
ltx/gr_gr_cog/me.m02.d08:meMA.Ode3C1T.mode	@ltx/gr_gr_cog/miscellanea:misc.Mode8
ltx/gr_gr_cog/me.m02.d08:meMA.Ode3C1T.ode	@ltx/gr_gr_cog/miscellanea:misc.Ode3
ltx/gr_gr_cog/me.m02.d08:meMA.Ode3C1T.text	Ἱκετεύω σε μόνην, τὴν τὸν Θεὸν τέξασαν, τὸν εἰς εὐλογίαν κατάραν, τὴν πρὶν ἀμείψαντα, καὶ χρηματίσαντα, ὑπὲρ ἀνθρώπων κατάρα, Κόρη παντευλόγητε, καὶ κόσμον σώσαντα.
ltx/gr_gr_cog/me.m02.d08:meMA.Ode3C21.greekmelody	@ltx/gr_gr_cog/he.h.m8:heHE.OukEstinAgios.greekname
ltx/gr_gr_cog/me.m02.d08:meMA.Ode3C21.incipit	Ἡ ἄνωθεν χάρις σοι ἐπεσκίασε…
ltx/gr_gr_cog/me.m02.d08:meMA.Ode3C21.melody	@ltx/gr_gr_cog/he.h.m8:heHE.OukEstinAgios.name
ltx/gr_gr_cog/me.m02.d08:meMA.Ode3C21.mode	@ltx/gr_gr_cog/miscellanea:misc.Mode8
ltx/gr_gr_cog/me.m02.d08:meMA.Ode3C21.ode	@ltx/gr_gr_cog/miscellanea:misc.Ode3
ltx/gr_gr_cog/me.m02.d08:meMA.Ode3C21.text	Ἡ ἄνωθεν χάρις σοι ἐπεσκίασε τῆς προνοίας τὴν ἄφραστον, θείαν κυβέρνησιν, διʼ Ἁγίων Ἀγγέλων διδάσκουσα Πάνσοφε, Μάκαρ καὶ φωτίζουσα.
ltx/gr_gr_cog/me.m02.d08:meMA.Ode3C22.incipit	Τὴν θείαν χρηστότητα παιδευόμενος, ἐμυήθης…
ltx/gr_gr_cog/me.m02.d08:meMA.Ode3C22.melody	@ltx/gr_gr_cog/he.h.m8:heHE.OukEstinAgios.name
ltx/gr_gr_cog/me.m02.d08:meMA.Ode3C22.mode	@ltx/gr_gr_cog/miscellanea:misc.Mode8
ltx/gr_gr_cog/me.m02.d08:meMA.Ode3C22.ode	@ltx/gr_gr_cog/miscellanea:misc.Ode3
ltx/gr_gr_cog/me.m02.d08:meMA.Ode3C22.text	Τὴν θείαν χρηστότητα παιδευόμενος, ἐμυήθης Πανόλβιε, ὡς καθαρώτατος κατακάρπως οἰκεῖσθαι, τὸ θεῖον ἁγίασμα, τὴν πόλιν τὴν πανίερον.
ltx/gr_gr_cog/me.m02.d08:meMA.Ode3C23.incipit	Τὸ τεῖχος τὸ ἄῤῥηκτον, ἡ…
ltx/gr_gr_cog/me.m02.d08:meMA.Ode3C23.melody	@ltx/gr_gr_cog/he.h.m8:heHE.OukEstinAgios.name
ltx/gr_gr_cog/me.m02.d08:meMA.Ode3C23.mode	@ltx/gr_gr_cog/miscellanea:misc.Mode8
ltx/gr_gr_cog/me.m02.d08:meMA.Ode3C23.ode	@ltx/gr_gr_cog/miscellanea:misc.Ode3
ltx/gr_gr_cog/me.m02.d08:meMA.Ode3C23.text	Τὸ τεῖχος τὸ ἄῤῥηκτον, ἡ ἀσφάλεια τοῦ λαοῦ τοῦ θεόφρονος, γέγονας Κύριε, καὶ ψυχῶν σωτηρία, ὡς πάλαι προήγγειλε, Προφήτης ὁ θεσπέσιος.
ltx/gr_gr_cog/me.m02.d08:meMA.Ode3C2H.greekmelody	@ltx/gr_gr_cog/he.h.m8:heHE.OukEstinAgios.greekname
ltx/gr_gr_cog/me.m02.d08:meMA.Ode3C2H.incipit	@ltx/gr_gr_cog/he.h.m8:heHE.OukEstinAgios.incipit
ltx/gr_gr_cog/me.m02.d08:meMA.Ode3C2H.melody	@ltx/gr_gr_cog/he.h.m8:heHE.OukEstinAgios.melody
ltx/gr_gr_cog/me.m02.d08:meMA.Ode3C2H.mode	@ltx/gr_gr_cog/miscellanea:misc.Mode8
ltx/gr_gr_cog/me.m02.d08:meMA.Ode3C2H.ode	@ltx/gr_gr_cog/miscellanea:misc.Ode3
ltx/gr_gr_cog/me.m02.d08:meMA.Ode3C2H.text	@ltx/gr_gr_cog/he.h.m8:heHE.OukEstinAgios.text
ltx/gr_gr_cog/me.m02.d08:meMA.Ode3C2T.incipit	Ὁ τόκος ὁ ἄφθορος, καὶ…
ltx/gr_gr_cog/me.m02.d08:meMA.Ode3C2T.melody	@ltx/gr_gr_cog/he.h.m8:heHE.OukEstinAgios.name
ltx/gr_gr_cog/me.m02.d08:meMA.Ode3C2T.mode	@ltx/gr_gr_cog/miscellanea:misc.Mode8
ltx/gr_gr_cog/me.m02.d08:meMA.Ode3C2T.ode	@ltx/gr_gr_cog/miscellanea:misc.Ode3
ltx/gr_gr_cog/me.m02.d08:meMA.Ode3C2T.text	Ὁ τόκος ὁ ἄφθορος, καὶ ἡ ἄχραντος Θεοτόκε σου κύησις, τὸν κόσμον ἐῤῥύσατο, ἐκ φθορᾶς καὶ θανάτου· Σωτῆρα γὰρ ἔτεκες, Λόγον τὸν ἀΐδιον.
ltx/gr_gr_cog/me.m02.d08:meMA.Ode3Kathisma1.greekmelody	@ltx/gr_gr_cog/he.a.m8:heAU.TinSofianKaiLogon.greekname
ltx/gr_gr_cog/me.m02.d08:meMA.Ode3Kathisma1.incipit	Θεϊκὴν παντευχίαν ἀναλαβών, καὶ εἰδώλων…
ltx/gr_gr_cog/me.m02.d08:meMA.Ode3Kathisma1.melody	@ltx/gr_gr_cog/he.a.m8:heAU.TinSofianKaiLogon.name
ltx/gr_gr_cog/me.m02.d08:meMA.Ode3Kathisma1.mode	@ltx/gr_gr_cog/miscellanea:misc.Mode8
ltx/gr_gr_cog/me.m02.d08:meMA.Ode3Kathisma1.text	Θεϊκὴν παντευχίαν ἀναλαβών, καὶ εἰδώλων τὴν πλάνην καταλαβών, Ἀγγέλους διήγειρας, εὐφημεῖν τοὺς ἀγῶνάς σου· τῷ γὰρ θείῳ πόθῳ, τὸν νοῦν πυρπολούμενος, τοῦ ἐν πυρὶ θανάτου, γενναίως κατετόλμησας· ὅθεν φερωνύμως, τοῖς αἰτοῦσί σε νέμεις, τὰ θεῖα δωρήματα, ἀθλοφόρε Θεόδωρε· διὰ τοῦτο βοῶμέν σοι· Πρέσβευε Χριστῷ τῷ Θεῷ, τῶν πταισμάτων ἄφεσιν δωρήσασθαι, τοῖς ἑορτάζουσι πόθῳ, τὴν ἁγίαν μνήμην σου.
ltx/gr_gr_cog/me.m02.d08:meMA.Ode3Kathisma2.greekmelody	@ltx/gr_gr_cog/he.a.m3:heAU.TinOraiotita.greekname
ltx/gr_gr_cog/me.m02.d08:meMA.Ode3Kathisma2.incipit	Διϊππευόμενα ἅρματα ἔβλεψας, ἡνιοχούμενα χειρὶ…
ltx/gr_gr_cog/me.m02.d08:meMA.Ode3Kathisma2.melody	@ltx/gr_gr_cog/he.a.m3:heAU.TinOraiotita.name
ltx/gr_gr_cog/me.m02.d08:meMA.Ode3Kathisma2.mode	@ltx/gr_gr_cog/miscellanea:misc.Mode3
ltx/gr_gr_cog/me.m02.d08:meMA.Ode3Kathisma2.text	Διϊππευόμενα ἅρματα ἔβλεψας, ἡνιοχούμενα χειρὶ τοῦ πάντων Θεοῦ, τοὺς ἀσωμάτους λειτουργούς, Ζαχαρία θεσπέσιε, οἷς συναγαλλόμενος, ὡς προφήτης ἀοίδιμε, αἴτησαι ἰθύνεσθαι, πρὸς ὁδὸν θείας γνώσεως, τοὺς πίστει ἀδιστάκτῳ τελοῦντάς σου, μνήμην Προφῆτα τὴν πανίερον.
ltx/gr_gr_cog/me.m02.d08:meMA.Ode3Kathisma3.greekmelody	@ltx/gr_gr_cog/he.a.m3:heAU.TinOraiotita.greekname
ltx/gr_gr_cog/me.m02.d08:meMA.Ode3Kathisma3.incipit	Ἐκ τῆς Παρθένου σε σωματωθέντα…
ltx/gr_gr_cog/me.m02.d08:meMA.Ode3Kathisma3.melody	@ltx/gr_gr_cog/he.a.m3:heAU.TinOraiotita.name
ltx/gr_gr_cog/me.m02.d08:meMA.Ode3Kathisma3.mode	@ltx/gr_gr_cog/miscellanea:misc.Mode3
ltx/gr_gr_cog/me.m02.d08:meMA.Ode3Kathisma3.text	Ἐκ τῆς Παρθένου σε σωματωθέντα Χριστέ, χαίρων ἐδέξατο ὁ Ἱερὸς Συμεών· Νῦν ἀπολύεις ἐκβοῶν, τὸν δοῦλόν σου ὦ Δέσποτα, Ἄννα δὲ ἡ ἄμεμπτος, Προφῆτις καὶ ἔνδοξος, τὴν ἀνθομολόγησιν, καὶ τὸν ὕμνον προσῆγέ σοι. Ἡμεῖς δὲ Ζωοδότα βοῶμέν σοι· Δόξα τῷ οὕτως εὐδοκήσαντι.
ltx/gr_gr_cog/me.m02.d08:meMA.Ode3KathismaSt.incipit	@ltx/gr_gr_cog/me.m02.d03:meMA.Ode3KathismaSt.incipit
ltx/gr_gr_cog/me.m02.d08:meMA.Ode3KathismaSt.melody	@ltx/gr_gr_cog/he.a.m3:heAU.TinOraiotita.name
ltx/gr_gr_cog/me.m02.d08:meMA.Ode3KathismaSt.mode	@ltx/gr_gr_cog/miscellanea:misc.Mode3
ltx/gr_gr_cog/me.m02.d08:meMA.Ode3KathismaSt.text	@ltx/gr_gr_cog/me.m02.d03:meMA.Ode3KathismaSt.text
ltx/gr_gr_cog/me.m02.d08:meMA.Ode3KathismaT.incipit	@ltx/gr_gr_cog/me.m02.d03:meMA.Ode3KathismaT.incipit
ltx/gr_gr_cog/me.m02.d08:meMA.Ode3KathismaT.melody	@ltx/gr_gr_cog/he.a.m3:heAU.TinOraiotita.name
ltx/gr_gr_cog/me.m02.d08:meMA.Ode3KathismaT.mode	@ltx/gr_gr_cog/miscellanea:misc.Mode3
ltx/gr_gr_cog/me.m02.d08:meMA.Ode3KathismaT.text	@ltx/gr_gr_cog/me.m02.d03:meMA.Ode3KathismaT.text
ltx/gr_gr_cog/me.m02.d08:meMA.Ode4C11.greekmelody	@ltx/gr_gr_cog/he.h.m8:heHE.SyMouIschys.greekname
ltx/gr_gr_cog/me.m02.d08:meMA.Ode4C11.incipit	Ὁ πρὸς Θεόν, πόθος σου…
ltx/gr_gr_cog/me.m02.d08:meMA.Ode4C11.melody	@ltx/gr_gr_cog/he.h.m8:heHE.SyMouIschys.name
ltx/gr_gr_cog/me.m02.d08:meMA.Ode4C11.mode	@ltx/gr_gr_cog/miscellanea:misc.Mode8
ltx/gr_gr_cog/me.m02.d08:meMA.Ode4C11.ode	@ltx/gr_gr_cog/miscellanea:misc.Ode4
ltx/gr_gr_cog/me.m02.d08:meMA.Ode4C11.text	Ὁ πρὸς Θεόν, πόθος σου πᾶσαν ἠμαύρωσε, προσπαθείας, ϋλην Παμμακάριστε, δόξαν τερπνήν, πλοῦτον καὶ τρυφήν, καὶ περιφανείας τὸ περιβόητον ὕψωμα· ἐντεῦθεν ἀνυψώθης, πρὸς περίβλεπον ὕψος, μαρτυρίου πρὸς δόξαν ἀμάραντον.
ltx/gr_gr_cog/me.m02.d08:meMA.Ode4C12.incipit	Νόμῳ καινῷ, ζωοποιοῦντι τῷ Πνεύματι…
ltx/gr_gr_cog/me.m02.d08:meMA.Ode4C12.melody	@ltx/gr_gr_cog/he.h.m8:heHE.SyMouIschys.name
ltx/gr_gr_cog/me.m02.d08:meMA.Ode4C12.mode	@ltx/gr_gr_cog/miscellanea:misc.Mode8
ltx/gr_gr_cog/me.m02.d08:meMA.Ode4C12.ode	@ltx/gr_gr_cog/miscellanea:misc.Ode4
ltx/gr_gr_cog/me.m02.d08:meMA.Ode4C12.text	Νόμῳ καινῷ, ζωοποιοῦντι τῷ Πνεύματι, πεφραγμένος, νόμον ἀνομώτατον, παρανομούντων νεανικῶς, ἀνέτρεψας μάκαρ· διὸ νομίμως ἐνήθλησας, καὶ στέφος ἀνεδήσω, τὸ τῆς δικαιοσύνης, ἐκ χειρὸς τοῦ Δεσπότου Θεόδωρε.
ltx/gr_gr_cog/me.m02.d08:meMA.Ode4C13.incipit	Δῶρον Θεοῦ, δέδοσαι κόσμῳ φερώνυμον…
ltx/gr_gr_cog/me.m02.d08:meMA.Ode4C13.melody	@ltx/gr_gr_cog/he.h.m8:heHE.SyMouIschys.name
ltx/gr_gr_cog/me.m02.d08:meMA.Ode4C13.mode	@ltx/gr_gr_cog/miscellanea:misc.Mode8
ltx/gr_gr_cog/me.m02.d08:meMA.Ode4C13.ode	@ltx/gr_gr_cog/miscellanea:misc.Ode4
ltx/gr_gr_cog/me.m02.d08:meMA.Ode4C13.text	Δῶρον Θεοῦ, δέδοσαι κόσμῳ φερώνυμον, δῶρον θεῖον, δῶρον ἀξιέραστον, δῶρον πλουτίζον πάντα πιστόν, δῶρον δεχομένοις, γλυκὺ καὶ πρᾶγμα καὶ ὄνομα, τὸ πᾶσι καταπέμπον, καταλλήλως τὰς δόσεις, καὶ πληροῦν τὰς αἰτήσεις τῶν δούλων σου.
ltx/gr_gr_cog/me.m02.d08:meMA.Ode4C14.incipit	Ὡς μιμητής, τοῦ προσπαγέντος ἐν…
ltx/gr_gr_cog/me.m02.d08:meMA.Ode4C14.melody	@ltx/gr_gr_cog/he.h.m8:heHE.SyMouIschys.name
ltx/gr_gr_cog/me.m02.d08:meMA.Ode4C14.mode	@ltx/gr_gr_cog/miscellanea:misc.Mode8
ltx/gr_gr_cog/me.m02.d08:meMA.Ode4C14.ode	@ltx/gr_gr_cog/miscellanea:misc.Ode4
ltx/gr_gr_cog/me.m02.d08:meMA.Ode4C14.text	Ὡς μιμητής, τοῦ προσπαγέντος ἐν ξύλῳ Χριστοῦ, μετὰ πᾶσαν, αἰκίαν τοῦ σώματος, μετὰ πολλὰς στρέβλας πονηράς, τὰς τῶν μιαιφόνων, χριστομιμήτως ἐτάθης σταυρῷ, καὶ βέλεσιν ἐτρώθης, καὶ δεινῶς συνεκόπης, ἀλλʼ ἐῤῥύσθης ἐκ τούτων δυνάμει Χριστοῦ.
ltx/gr_gr_cog/me.m02.d08:meMA.Ode4C1H.greekmelody	@ltx/gr_gr_cog/he.h.m8:heHE.SyMouIschys.greekname
ltx/gr_gr_cog/me.m02.d08:meMA.Ode4C1H.incipit	@ltx/gr_gr_cog/he.h.m8:heHE.SyMouIschys.incipit
ltx/gr_gr_cog/me.m02.d08:meMA.Ode4C1H.melody	@ltx/gr_gr_cog/he.h.m8:heHE.SyMouIschys.melody
ltx/gr_gr_cog/me.m02.d08:meMA.Ode4C1H.mode	@ltx/gr_gr_cog/miscellanea:misc.Mode8
ltx/gr_gr_cog/me.m02.d08:meMA.Ode4C1H.ode	@ltx/gr_gr_cog/miscellanea:misc.Ode4
ltx/gr_gr_cog/me.m02.d08:meMA.Ode4C1H.text	@ltx/gr_gr_cog/he.h.m8:heHE.SyMouIschys.text
ltx/gr_gr_cog/me.m02.d08:meMA.Ode4C1T.incipit	Καλλοποιόν, καὶ γῆς Δεσπότην κυήσασαν…
ltx/gr_gr_cog/me.m02.d08:meMA.Ode4C1T.melody	@ltx/gr_gr_cog/he.h.m8:heHE.SyMouIschys.name
ltx/gr_gr_cog/me.m02.d08:meMA.Ode4C1T.mode	@ltx/gr_gr_cog/miscellanea:misc.Mode8
ltx/gr_gr_cog/me.m02.d08:meMA.Ode4C1T.ode	@ltx/gr_gr_cog/miscellanea:misc.Ode4
ltx/gr_gr_cog/me.m02.d08:meMA.Ode4C1T.text	Καλλοποιόν, καὶ γῆς Δεσπότην κυήσασαν, ἀποῤῥήτῳ τόκῳ κατὰ χρέος σε, πάντες πιστοί, γλώσσῃ καὶ ψυχῇ, κόσμου Βασιλίδα, καὶ Δέσποιναν ὀνομάζομεν· διὸ τῆς τυραννούσης, πονηρᾶς συνηθείας, ἐλευθέρωσον τοὺς σὲ γεραίροντας.
ltx/gr_gr_cog/me.m02.d08:meMA.Ode4C21.greekmelody	@ltx/gr_gr_cog/he.h.m8:heHE.ExOrousKataskiou.greekname
ltx/gr_gr_cog/me.m02.d08:meMA.Ode4C21.incipit	Μίαν μὲν φωτιστικήν, οὐσίαν σέβειν…
ltx/gr_gr_cog/me.m02.d08:meMA.Ode4C21.melody	@ltx/gr_gr_cog/he.h.m8:heHE.ExOrousKataskiou.name
ltx/gr_gr_cog/me.m02.d08:meMA.Ode4C21.mode	@ltx/gr_gr_cog/miscellanea:misc.Mode8
ltx/gr_gr_cog/me.m02.d08:meMA.Ode4C21.ode	@ltx/gr_gr_cog/miscellanea:misc.Ode4
ltx/gr_gr_cog/me.m02.d08:meMA.Ode4C21.text	Μίαν μὲν φωτιστικήν, οὐσίαν σέβειν, ἐν Ἡλίοις δέ, τρισὶν ὁριζομένην, ταῖς εἰς τὰ ὄντα προόδοις πληθυνομένην, σαφῶς διδάσκεις Παμμακάριστε.
ltx/gr_gr_cog/me.m02.d08:meMA.Ode4C22.incipit	Ἅρμα τοῦ Θεοῦ, γενόμενος Προφῆτα…
ltx/gr_gr_cog/me.m02.d08:meMA.Ode4C22.melody	@ltx/gr_gr_cog/he.h.m8:heHE.ExOrousKataskiou.name
ltx/gr_gr_cog/me.m02.d08:meMA.Ode4C22.mode	@ltx/gr_gr_cog/miscellanea:misc.Mode8
ltx/gr_gr_cog/me.m02.d08:meMA.Ode4C22.ode	@ltx/gr_gr_cog/miscellanea:misc.Ode4
ltx/gr_gr_cog/me.m02.d08:meMA.Ode4C22.text	Ἅρμα τοῦ Θεοῦ, γενόμενος Προφῆτα, ἅρματα ὁρᾶν, ποικίλα τῶν Ἀγγέλων, περιοδεῦσαι τὰ πάντα κατηξιώθης, μετὰ εὐταξίας πορευόμενα.
ltx/gr_gr_cog/me.m02.d08:meMA.Ode4C23.incipit	Ἱεροπρεπῆ πολύφωτον λυχνίαν, σύμβολον ὁρᾷς…
ltx/gr_gr_cog/me.m02.d08:meMA.Ode4C23.melody	@ltx/gr_gr_cog/he.h.m8:heHE.ExOrousKataskiou.name
ltx/gr_gr_cog/me.m02.d08:meMA.Ode4C23.mode	@ltx/gr_gr_cog/miscellanea:misc.Mode8
ltx/gr_gr_cog/me.m02.d08:meMA.Ode4C23.ode	@ltx/gr_gr_cog/miscellanea:misc.Ode4
ltx/gr_gr_cog/me.m02.d08:meMA.Ode4C23.text	Ἱεροπρεπῆ πολύφωτον λυχνίαν, σύμβολον ὁρᾷς, τῆς θείας φωταυγείας, ἐπισκοπῆς τε Παμμάκαρ τῆς παντεπόπτου, διʼ ἧς τὰ πάντα περισώζεται.
ltx/gr_gr_cog/me.m02.d08:meMA.Ode4C2H.greekmelody	@ltx/gr_gr_cog/he.h.m8:heHE.ExOrousKataskiou.greekname
ltx/gr_gr_cog/me.m02.d08:meMA.Ode4C2H.incipit	@ltx/gr_gr_cog/he.h.m8:heHE.ExOrousKataskiou.incipit
ltx/gr_gr_cog/me.m02.d08:meMA.Ode4C2H.melody	@ltx/gr_gr_cog/he.h.m8:heHE.ExOrousKataskiou.melody
ltx/gr_gr_cog/me.m02.d08:meMA.Ode4C2H.mode	@ltx/gr_gr_cog/miscellanea:misc.Mode8
ltx/gr_gr_cog/me.m02.d08:meMA.Ode4C2H.ode	@ltx/gr_gr_cog/miscellanea:misc.Ode4
ltx/gr_gr_cog/me.m02.d08:meMA.Ode4C2H.text	@ltx/gr_gr_cog/he.h.m8:heHE.ExOrousKataskiou.text
ltx/gr_gr_cog/me.m02.d08:meMA.Ode4C2T.incipit	Σύμβολα τῆς σῆς, Ἁγνή, κυοφορίας…
ltx/gr_gr_cog/me.m02.d08:meMA.Ode4C2T.melody	@ltx/gr_gr_cog/he.h.m8:heHE.ExOrousKataskiou.name
ltx/gr_gr_cog/me.m02.d08:meMA.Ode4C2T.mode	@ltx/gr_gr_cog/miscellanea:misc.Mode8
ltx/gr_gr_cog/me.m02.d08:meMA.Ode4C2T.ode	@ltx/gr_gr_cog/miscellanea:misc.Ode4
ltx/gr_gr_cog/me.m02.d08:meMA.Ode4C2T.text	Σύμβολα τῆς σῆς, Ἁγνή, κυοφορίας, οἱ θεοειδεῖς, Προφῆται προτυποῦσι, πολυειδῶς προχαράττοντες, καὶ ποικίλως, διʼ αἰνιγμάτων οἱ θεόφρονες.
ltx/gr_gr_cog/me.m02.d08:meMA.Ode5C11.greekmelody	@ltx/gr_gr_cog/he.h.m8:heHE.InaTiMeAposo.greekname
ltx/gr_gr_cog/me.m02.d08:meMA.Ode5C11.incipit	Ῥητορεύεις τὴν δόξαν, ἔνδοξε Θεόδωρε…
ltx/gr_gr_cog/me.m02.d08:meMA.Ode5C11.melody	@ltx/gr_gr_cog/he.h.m8:heHE.InaTiMeAposo.name
ltx/gr_gr_cog/me.m02.d08:meMA.Ode5C11.mode	@ltx/gr_gr_cog/miscellanea:misc.Mode8
ltx/gr_gr_cog/me.m02.d08:meMA.Ode5C11.ode	@ltx/gr_gr_cog/miscellanea:misc.Ode5
ltx/gr_gr_cog/me.m02.d08:meMA.Ode5C11.text	Ῥητορεύεις τὴν δόξαν, ἔνδοξε Θεόδωρε σὺν παῤῥησίᾳ πολλῇ, τοῦ σαρκὶ παθόντος, καὶ θανάτῳ τὸν θάνατον λύσαντος, καὶ μαστίγων πεῖραν, πολλῶν λαβὼν λύσσῃ τυράννου, σταυρικὴν καταδίκην ὑπήνεγκας.
ltx/gr_gr_cog/me.m02.d08:meMA.Ode5C12.incipit	Ὁλοτρόπῳ προθέσει, σταύρωσιν ἑκούσιον Χριστοῦ…
ltx/gr_gr_cog/me.m02.d08:meMA.Ode5C12.melody	@ltx/gr_gr_cog/he.h.m8:heHE.InaTiMeAposo.name
ltx/gr_gr_cog/me.m02.d08:meMA.Ode5C12.mode	@ltx/gr_gr_cog/miscellanea:misc.Mode8
ltx/gr_gr_cog/me.m02.d08:meMA.Ode5C12.ode	@ltx/gr_gr_cog/miscellanea:misc.Ode5
ltx/gr_gr_cog/me.m02.d08:meMA.Ode5C12.text	Ὁλοτρόπῳ προθέσει, σταύρωσιν ἑκούσιον Χριστοῦ μιμούμενος, τὴν αὐτὴν ὑπέστης, τιμωρίαν σταυρῷ προσηλούμενος, ἀντὶ δὲ τῆς λόγχης, βελῶν πολλῶν πληγὰς ἐδέξω, ὀφθαλμῶν κόρας τε ἐξορυττόμενος.
ltx/gr_gr_cog/me.m02.d08:meMA.Ode5C13.incipit	Νικηφόρος ὡράθης, ἄρτιος ὁλόκληρος μετὰ…
ltx/gr_gr_cog/me.m02.d08:meMA.Ode5C13.melody	@ltx/gr_gr_cog/he.h.m8:heHE.InaTiMeAposo.name
ltx/gr_gr_cog/me.m02.d08:meMA.Ode5C13.mode	@ltx/gr_gr_cog/miscellanea:misc.Mode8
ltx/gr_gr_cog/me.m02.d08:meMA.Ode5C13.ode	@ltx/gr_gr_cog/miscellanea:misc.Ode5
ltx/gr_gr_cog/me.m02.d08:meMA.Ode5C13.text	Νικηφόρος ὡράθης, ἄρτιος ὁλόκληρος μετὰ τὴν σταύρωσιν, καὶ τὴν ἄλλην πᾶσαν, τῶν μελῶν συγκοπήν τε καὶ νέκρωσιν, ὁ νικήσας κόσμον· σὲ γὰρ Χριστὸς χειρὶ Ἀγγέλου, ὡς ζωῆς ἀρχηγὸς ἀνεζώωσεν.
ltx/gr_gr_cog/me.m02.d08:meMA.Ode5C14.incipit	Συνιδόντα τὰ πλήθη, τὸ ἐν…
ltx/gr_gr_cog/me.m02.d08:meMA.Ode5C14.melody	@ltx/gr_gr_cog/he.h.m8:heHE.InaTiMeAposo.name
ltx/gr_gr_cog/me.m02.d08:meMA.Ode5C14.mode	@ltx/gr_gr_cog/miscellanea:misc.Mode8
ltx/gr_gr_cog/me.m02.d08:meMA.Ode5C14.ode	@ltx/gr_gr_cog/miscellanea:misc.Ode5
ltx/gr_gr_cog/me.m02.d08:meMA.Ode5C14.text	Συνιδόντα τὰ πλήθη, τὸ ἐν σοὶ γενόμενον θαῦμα Θεόδωρε, τὴν φωνὴν ἐπῆραν, μεγαλύνοντα Χριστοῦ τὴν δύναμιν, τοῦ δὲ λυμεῶνος, καὶ ἀλαζόνος Λικινίου, στηλιτεύοντα λύσσαν τὴν ἄλογον.
ltx/gr_gr_cog/me.m02.d08:meMA.Ode5C1H.greekmelody	@ltx/gr_gr_cog/he.h.m8:heHE.InaTiMeAposo.greekname
ltx/gr_gr_cog/me.m02.d08:meMA.Ode5C1H.incipit	@ltx/gr_gr_cog/he.h.m8:heHE.InaTiMeAposo.incipit
ltx/gr_gr_cog/me.m02.d08:meMA.Ode5C1H.melody	@ltx/gr_gr_cog/he.h.m8:heHE.InaTiMeAposo.melody
ltx/gr_gr_cog/me.m02.d08:meMA.Ode5C1H.mode	@ltx/gr_gr_cog/miscellanea:misc.Mode8
ltx/gr_gr_cog/me.m02.d08:meMA.Ode5C1H.ode	@ltx/gr_gr_cog/miscellanea:misc.Ode5
ltx/gr_gr_cog/me.m02.d08:meMA.Ode5C1H.text	@ltx/gr_gr_cog/he.h.m8:heHE.InaTiMeAposo.text
ltx/gr_gr_cog/me.m02.d08:meMA.Ode5C1T.incipit	Ὅλον τέτοκας Κόρη, τὸ φῶς…
ltx/gr_gr_cog/me.m02.d08:meMA.Ode5C1T.melody	@ltx/gr_gr_cog/he.h.m8:heHE.InaTiMeAposo.name
ltx/gr_gr_cog/me.m02.d08:meMA.Ode5C1T.mode	@ltx/gr_gr_cog/miscellanea:misc.Mode8
ltx/gr_gr_cog/me.m02.d08:meMA.Ode5C1T.ode	@ltx/gr_gr_cog/miscellanea:misc.Ode5
ltx/gr_gr_cog/me.m02.d08:meMA.Ode5C1T.text	Ὅλον τέτοκας Κόρη, τὸ φῶς τὸ αἰώνιον τοῖς ἀνυμνοῦσί σε, τὸν Χριστὸν ἀσπόρως, σωματώσασα, ὃν ἐξιλέωσαι, τοῦ σωθῆναι πάντας, ἐκ πειρασμῶν τοῦ ἀλλοτρίου, Παναγία Παρθένε Θεόνυμφε.
ltx/gr_gr_cog/me.m02.d08:meMA.Ode5C21.greekmelody	@ltx/gr_gr_cog/he.h.m8:heHE.OEkNyktosAgnoias.greekname
ltx/gr_gr_cog/me.m02.d08:meMA.Ode5C21.incipit	Ὁ καθαρὸς καρδίᾳ, καὶ διανοίας…
ltx/gr_gr_cog/me.m02.d08:meMA.Ode5C21.melody	@ltx/gr_gr_cog/he.h.m8:heHE.OEkNyktosAgnoias.name
ltx/gr_gr_cog/me.m02.d08:meMA.Ode5C21.mode	@ltx/gr_gr_cog/miscellanea:misc.Mode8
ltx/gr_gr_cog/me.m02.d08:meMA.Ode5C21.ode	@ltx/gr_gr_cog/miscellanea:misc.Ode5
ltx/gr_gr_cog/me.m02.d08:meMA.Ode5C21.text	Ὁ καθαρὸς καρδίᾳ, καὶ διανοίας προβλέπων ὀξύτητι, πάθος τὸ τοῦ Σωτῆρος, ἀξιοπρεπῶς μακαρίζεται.
ltx/gr_gr_cog/me.m02.d08:meMA.Ode5C22.incipit	Ὑπερφυῶς ἁγία, χαῖρε Σιών, ὁ…
ltx/gr_gr_cog/me.m02.d08:meMA.Ode5C22.melody	@ltx/gr_gr_cog/he.h.m8:heHE.OEkNyktosAgnoias.name
ltx/gr_gr_cog/me.m02.d08:meMA.Ode5C22.mode	@ltx/gr_gr_cog/miscellanea:misc.Mode8
ltx/gr_gr_cog/me.m02.d08:meMA.Ode5C22.ode	@ltx/gr_gr_cog/miscellanea:misc.Ode5
ltx/gr_gr_cog/me.m02.d08:meMA.Ode5C22.text	Ὑπερφυῶς ἁγία, χαῖρε Σιών, ὁ Προφήτης προτρέπεται, ἥξει ὁ Βασιλεύς σου δίκαιος καὶ σῴζων πρᾳότητι.
ltx/gr_gr_cog/me.m02.d08:meMA.Ode5C23.incipit	Τῶν Προφητῶν ἡ δόξα, τῶν…
ltx/gr_gr_cog/me.m02.d08:meMA.Ode5C23.melody	@ltx/gr_gr_cog/he.h.m8:heHE.OEkNyktosAgnoias.name
ltx/gr_gr_cog/me.m02.d08:meMA.Ode5C23.mode	@ltx/gr_gr_cog/miscellanea:misc.Mode8
ltx/gr_gr_cog/me.m02.d08:meMA.Ode5C23.ode	@ltx/gr_gr_cog/miscellanea:misc.Ode5
ltx/gr_gr_cog/me.m02.d08:meMA.Ode5C23.text	Τῶν Προφητῶν ἡ δόξα, τῶν θεηγόρων ἀνδρῶν ἡ εὐπρέπεια, κόσμον περιαυγάζει, τῇ τῆς προφητείας λαμπρότητι.
ltx/gr_gr_cog/me.m02.d08:meMA.Ode5C2H.greekmelody	@ltx/gr_gr_cog/he.h.m8:heHE.OEkNyktosAgnoias.greekname
ltx/gr_gr_cog/me.m02.d08:meMA.Ode5C2H.incipit	@ltx/gr_gr_cog/he.h.m8:heHE.OEkNyktosAgnoias.incipit
ltx/gr_gr_cog/me.m02.d08:meMA.Ode5C2H.melody	@ltx/gr_gr_cog/he.h.m8:heHE.OEkNyktosAgnoias.melody
ltx/gr_gr_cog/me.m02.d08:meMA.Ode5C2H.mode	@ltx/gr_gr_cog/miscellanea:misc.Mode8
ltx/gr_gr_cog/me.m02.d08:meMA.Ode5C2H.ode	@ltx/gr_gr_cog/miscellanea:misc.Ode5
ltx/gr_gr_cog/me.m02.d08:meMA.Ode5C2H.text	@ltx/gr_gr_cog/he.h.m8:heHE.OEkNyktosAgnoias.text
ltx/gr_gr_cog/me.m02.d08:meMA.Ode5C2T.incipit	Ὁ τῆς Παρθένου τόκος, ἀναγεννήσας…
ltx/gr_gr_cog/me.m02.d08:meMA.Ode5C2T.melody	@ltx/gr_gr_cog/he.h.m8:heHE.OEkNyktosAgnoias.name
ltx/gr_gr_cog/me.m02.d08:meMA.Ode5C2T.mode	@ltx/gr_gr_cog/miscellanea:misc.Mode8
ltx/gr_gr_cog/me.m02.d08:meMA.Ode5C2T.ode	@ltx/gr_gr_cog/miscellanea:misc.Ode5
ltx/gr_gr_cog/me.m02.d08:meMA.Ode5C2T.text	Ὁ τῆς Παρθένου τόκος, ἀναγεννήσας ἡμᾶς ἠλευθέρωσε, τῶν πρὶν ἁμαρτημάτων, διʼ ἡμᾶς ἁμαρτίᾳ γενόμενος.
ltx/gr_gr_cog/me.m02.d08:meMA.Ode6C11.greekmelody	@ltx/gr_gr_cog/he.h.m8:heHE.IlasthitiMoiSotir.greekname
ltx/gr_gr_cog/me.m02.d08:meMA.Ode6C11.incipit	Ἐξέλαμψας ἀρεταῖς, καὶ διδαχαῖς διὰ…
ltx/gr_gr_cog/me.m02.d08:meMA.Ode6C11.melody	@ltx/gr_gr_cog/he.h.m8:heHE.IlasthitiMoiSotir.name
ltx/gr_gr_cog/me.m02.d08:meMA.Ode6C11.mode	@ltx/gr_gr_cog/miscellanea:misc.Mode8
ltx/gr_gr_cog/me.m02.d08:meMA.Ode6C11.ode	@ltx/gr_gr_cog/miscellanea:misc.Ode6
ltx/gr_gr_cog/me.m02.d08:meMA.Ode6C11.text	Ἐξέλαμψας ἀρεταῖς, καὶ διδαχαῖς διὰ βίου σου, ἐξήστραψας δὲ λαμπροῖς, ἀγῶσι Θεόδωρε, καὶ νῦν περιβόητος, ἐν θαυματουργίαις, καὶ θερμὸς προστάτης πέφηνας.
ltx/gr_gr_cog/me.m02.d08:meMA.Ode6C12.incipit	Τοῖς κάμνουσιν ἰατρός, τοῖς αἰχμαλώτοις…
ltx/gr_gr_cog/me.m02.d08:meMA.Ode6C12.melody	@ltx/gr_gr_cog/he.h.m8:heHE.IlasthitiMoiSotir.name
ltx/gr_gr_cog/me.m02.d08:meMA.Ode6C12.mode	@ltx/gr_gr_cog/miscellanea:misc.Mode8
ltx/gr_gr_cog/me.m02.d08:meMA.Ode6C12.ode	@ltx/gr_gr_cog/miscellanea:misc.Ode6
ltx/gr_gr_cog/me.m02.d08:meMA.Ode6C12.text	Τοῖς κάμνουσιν ἰατρός, τοῖς αἰχμαλώτοις ἀνάῤῥυσις, μεσίτης ἁμαρτωλοῖς, ὑπευθύνων ἄφεσις, πενθοῦσι παράκλησις, πρὸς Θεοῦ ἐδόθης συμπαθέστατε Θεόδωρε.
ltx/gr_gr_cog/me.m02.d08:meMA.Ode6C13.incipit	Οὐκ ἔστι κόρος τῶν σῶν…
ltx/gr_gr_cog/me.m02.d08:meMA.Ode6C13.melody	@ltx/gr_gr_cog/he.h.m8:heHE.IlasthitiMoiSotir.name
ltx/gr_gr_cog/me.m02.d08:meMA.Ode6C13.mode	@ltx/gr_gr_cog/miscellanea:misc.Mode8
ltx/gr_gr_cog/me.m02.d08:meMA.Ode6C13.ode	@ltx/gr_gr_cog/miscellanea:misc.Ode6
ltx/gr_gr_cog/me.m02.d08:meMA.Ode6C13.text	Οὐκ ἔστι κόρος τῶν σῶν, καλῶν ἀπείρων Θεόδωρε, οὐδὲ τῆς σῆς καλλονῆς, σταθμὸς ἰσοστάσιος· διὸ τὸν διάπυρον, πόθον μου προσδέχου, χορηγῶν μοι χάριν ἄφθονον.
ltx/gr_gr_cog/me.m02.d08:meMA.Ode6C1H.greekmelody	@ltx/gr_gr_cog/he.h.m8:heHE.IlasthitiMoiSotir.greekname
ltx/gr_gr_cog/me.m02.d08:meMA.Ode6C1H.incipit	@ltx/gr_gr_cog/he.h.m8:heHE.IlasthitiMoiSotir.incipit
ltx/gr_gr_cog/me.m02.d08:meMA.Ode6C1H.melody	@ltx/gr_gr_cog/he.h.m8:heHE.IlasthitiMoiSotir.melody
ltx/gr_gr_cog/me.m02.d08:meMA.Ode6C1H.mode	@ltx/gr_gr_cog/miscellanea:misc.Mode8
ltx/gr_gr_cog/me.m02.d08:meMA.Ode6C1H.ode	@ltx/gr_gr_cog/miscellanea:misc.Ode6
ltx/gr_gr_cog/me.m02.d08:meMA.Ode6C1H.text	@ltx/gr_gr_cog/he.h.m8:heHE.IlasthitiMoiSotir.text
ltx/gr_gr_cog/me.m02.d08:meMA.Ode6C1T.incipit	Λαμψάτω νῦν ἐπ ἐμέ, ἡ…
ltx/gr_gr_cog/me.m02.d08:meMA.Ode6C1T.melody	@ltx/gr_gr_cog/he.h.m8:heHE.IlasthitiMoiSotir.name
ltx/gr_gr_cog/me.m02.d08:meMA.Ode6C1T.mode	@ltx/gr_gr_cog/miscellanea:misc.Mode8
ltx/gr_gr_cog/me.m02.d08:meMA.Ode6C1T.ode	@ltx/gr_gr_cog/miscellanea:misc.Ode6
ltx/gr_gr_cog/me.m02.d08:meMA.Ode6C1T.text	Λαμψάτω νῦν ἐπ ἐμέ, ἡ ἄφατος εὐσπλαγχνία σου, βυθοῦ με ἁμαρτιῶν, καὶ τῆς ἀπογνώσεως, Κόρη ἀπαλλάττουσα, καὶ πρὸς μετανοίας, τοὺς λιμένας ἐμβιβάζουσα.
ltx/gr_gr_cog/me.m02.d08:meMA.Ode6C21.greekmelody	@ltx/gr_gr_cog/he.h.m8:heHE.TinDeisinEkcheo.greekname
ltx/gr_gr_cog/me.m02.d08:meMA.Ode6C21.incipit	Ὑπάρχων προφητικῆς ἀνάπλεως, ἐπιπνοίας ἐσομένων…
ltx/gr_gr_cog/me.m02.d08:meMA.Ode6C21.melody	@ltx/gr_gr_cog/he.h.m8:heHE.TinDeisinEkcheo.name
ltx/gr_gr_cog/me.m02.d08:meMA.Ode6C21.mode	@ltx/gr_gr_cog/miscellanea:misc.Mode8
ltx/gr_gr_cog/me.m02.d08:meMA.Ode6C21.ode	@ltx/gr_gr_cog/miscellanea:misc.Ode6
ltx/gr_gr_cog/me.m02.d08:meMA.Ode6C21.text	Ὑπάρχων προφητικῆς ἀνάπλεως, ἐπιπνοίας ἐσομένων τὴν γνῶσιν, ὑπερφυῶς, μυηθεὶς ἀπεστάλης, ἀνακηρύττειν τὴν χάριν τὴν μέλλουσαν, ἡμέραν τε τὴν τοῦ σταυροῦ, τὴν γνωστὴν τῷ Κυρίῳ θεόληπτε.
ltx/gr_gr_cog/me.m02.d08:meMA.Ode6C22.incipit	Συνέσει πνευματικῇ κοσμούμενος, δωρεῶν τῶν…
ltx/gr_gr_cog/me.m02.d08:meMA.Ode6C22.melody	@ltx/gr_gr_cog/he.h.m8:heHE.TinDeisinEkcheo.name
ltx/gr_gr_cog/me.m02.d08:meMA.Ode6C22.mode	@ltx/gr_gr_cog/miscellanea:misc.Mode8
ltx/gr_gr_cog/me.m02.d08:meMA.Ode6C22.ode	@ltx/gr_gr_cog/miscellanea:misc.Ode6
ltx/gr_gr_cog/me.m02.d08:meMA.Ode6C22.text	Συνέσει πνευματικῇ κοσμούμενος, δωρεῶν τῶν ὑπὲρ νοῦν ἠξιώθης, ἀγγελικάς, ἐμφανείας καὶ τάξεις, καὶ ὁμιλίας καὶ δόξαν θεώμενος, Πανόλβιε τὰ θαυμαστά, διδασκούσας καὶ θεῖα Μυστήρια.
ltx/gr_gr_cog/me.m02.d08:meMA.Ode6C23.incipit	Λαμπάδιον ἀρετῶν κτησάμενος, φωτισμὸν θεογνωσίας…
ltx/gr_gr_cog/me.m02.d08:meMA.Ode6C23.melody	@ltx/gr_gr_cog/he.h.m8:heHE.TinDeisinEkcheo.name
ltx/gr_gr_cog/me.m02.d08:meMA.Ode6C23.mode	@ltx/gr_gr_cog/miscellanea:misc.Mode8
ltx/gr_gr_cog/me.m02.d08:meMA.Ode6C23.ode	@ltx/gr_gr_cog/miscellanea:misc.Ode6
ltx/gr_gr_cog/me.m02.d08:meMA.Ode6C23.text	Λαμπάδιον ἀρετῶν κτησάμενος, φωτισμὸν θεογνωσίας πυρσεύεις, τὴν μυστικήν, προμηνύων λαμπάδα, τῆς ὑπὲρ λόγον τοῦ Λόγου σαρκώσεως, φανήσεσθαι θεοπρεπῶς, ἐκ Σιὼν Ζαχαρία θεόληπτε.
ltx/gr_gr_cog/me.m02.d08:meMA.Ode6C2H.greekmelody	@ltx/gr_gr_cog/he.h.m8:heHE.TinDeisinEkcheo.greekname
ltx/gr_gr_cog/me.m02.d08:meMA.Ode6C2H.incipit	@ltx/gr_gr_cog/he.h.m8:heHE.TinDeisinEkcheo.incipit
ltx/gr_gr_cog/me.m02.d08:meMA.Ode6C2H.melody	@ltx/gr_gr_cog/he.h.m8:heHE.TinDeisinEkcheo.melody
ltx/gr_gr_cog/me.m02.d08:meMA.Ode6C2H.mode	@ltx/gr_gr_cog/miscellanea:misc.Mode8
ltx/gr_gr_cog/me.m02.d08:meMA.Ode6C2H.ode	@ltx/gr_gr_cog/miscellanea:misc.Ode6
ltx/gr_gr_cog/me.m02.d08:meMA.Ode6C2H.text	@ltx/gr_gr_cog/he.h.m8:heHE.TinDeisinEkcheo.text
ltx/gr_gr_cog/me.m02.d08:meMA.Ode6C2T.incipit	Ὁ στήσας τὸν οὐρανὸν ἀνέδειξεν…
ltx/gr_gr_cog/me.m02.d08:meMA.Ode6C2T.melody	@ltx/gr_gr_cog/he.h.m8:heHE.TinDeisinEkcheo.name
ltx/gr_gr_cog/me.m02.d08:meMA.Ode6C2T.mode	@ltx/gr_gr_cog/miscellanea:misc.Mode8
ltx/gr_gr_cog/me.m02.d08:meMA.Ode6C2T.ode	@ltx/gr_gr_cog/miscellanea:misc.Ode6
ltx/gr_gr_cog/me.m02.d08:meMA.Ode6C2T.text	Ὁ στήσας τὸν οὐρανὸν ἀνέδειξεν, οὐρανόν σε λογικὸν Θεοτόκε, τὴν καλλονήν, Ἰακὼβ ἀγαπήσας, καὶ ἐκ γαστρός σου Θεότητος Ἥλιος, ἀνέτειλε σωματικῶς, καὶ τὸν κόσμον ἐφαίδρυνε χάριτι.
ltx/gr_gr_cog/me.m02.d08:meMA.Ode7C11.greekmelody	@ltx/gr_gr_cog/he.h.m8:heHE.TheouSynkatavasin.greekname
ltx/gr_gr_cog/me.m02.d08:meMA.Ode7C11.incipit	Ὑψούμενον Κύριον, ἐπὶ τοῦ ξύλου…
ltx/gr_gr_cog/me.m02.d08:meMA.Ode7C11.melody	@ltx/gr_gr_cog/he.h.m8:heHE.TheouSynkatavasin.name
ltx/gr_gr_cog/me.m02.d08:meMA.Ode7C11.mode	@ltx/gr_gr_cog/miscellanea:misc.Mode8
ltx/gr_gr_cog/me.m02.d08:meMA.Ode7C11.ode	@ltx/gr_gr_cog/miscellanea:misc.Ode7
ltx/gr_gr_cog/me.m02.d08:meMA.Ode7C11.text	Ὑψούμενον Κύριον, ἐπὶ τοῦ ξύλου καὶ καταράξαντα, τὸν μεγάλαυχον ὄφιν, κατανοήσας συνανυψώθης αὐτῷ, χριστομιμήτως ἐν σταυρῷ καὶ θάνατον, ὑπενεγκὼν Ἀθλητά, συνεξανέστης αὐτῷ.
ltx/gr_gr_cog/me.m02.d08:meMA.Ode7C12.incipit	Θεοῦ σε Θεόδωρε, τῆς ἀκηράτου…
ltx/gr_gr_cog/me.m02.d08:meMA.Ode7C12.melody	@ltx/gr_gr_cog/he.h.m8:heHE.TheouSynkatavasin.name
ltx/gr_gr_cog/me.m02.d08:meMA.Ode7C12.mode	@ltx/gr_gr_cog/miscellanea:misc.Mode8
ltx/gr_gr_cog/me.m02.d08:meMA.Ode7C12.ode	@ltx/gr_gr_cog/miscellanea:misc.Ode7
ltx/gr_gr_cog/me.m02.d08:meMA.Ode7C12.text	Θεοῦ σε Θεόδωρε, τῆς ἀκηράτου δόξης θερμὸν ἐραστήν, ἐγνωκὼς τῷ σῷ πόθῳ, ὁλοκαρδίως ψυχὴν προσέδησα, τὴν προσδοκίαν πᾶσαν τῆς ἐλπίδος μου, ἀνατεθεὶς ἐπὶ σοί, μὴ ὑπερίδῃς με.
ltx/gr_gr_cog/me.m02.d08:meMA.Ode7C13.incipit	Ἐδόξασας Κύριον, τοῖς μέλεσί σου…
ltx/gr_gr_cog/me.m02.d08:meMA.Ode7C13.melody	@ltx/gr_gr_cog/he.h.m8:heHE.TheouSynkatavasin.name
ltx/gr_gr_cog/me.m02.d08:meMA.Ode7C13.mode	@ltx/gr_gr_cog/miscellanea:misc.Mode8
ltx/gr_gr_cog/me.m02.d08:meMA.Ode7C13.ode	@ltx/gr_gr_cog/miscellanea:misc.Ode7
ltx/gr_gr_cog/me.m02.d08:meMA.Ode7C13.text	Ἐδόξασας Κύριον, τοῖς μέλεσί σου ἐνδοξαζόμενον, ἐν βουλαῖς τῶν Ἁγίων, τὸν σὲ μεγάλως ἀντιδοξάσαντα, τερατουργίαις καὶ ποικίλοις θαύμασι, καὶ περιόντα τῇ γῇ, καὶ μετὰ τέλος Σοφέ.
ltx/gr_gr_cog/me.m02.d08:meMA.Ode7C1H.greekmelody	@ltx/gr_gr_cog/he.h.m8:heHE.TheouSynkatavasin.greekname
ltx/gr_gr_cog/me.m02.d08:meMA.Ode7C1H.incipit	@ltx/gr_gr_cog/he.h.m8:heHE.TheouSynkatavasin.incipit
ltx/gr_gr_cog/me.m02.d08:meMA.Ode7C1H.melody	@ltx/gr_gr_cog/he.h.m8:heHE.TheouSynkatavasin.melody
ltx/gr_gr_cog/me.m02.d08:meMA.Ode7C1H.mode	@ltx/gr_gr_cog/miscellanea:misc.Mode8
ltx/gr_gr_cog/me.m02.d08:meMA.Ode7C1H.ode	@ltx/gr_gr_cog/miscellanea:misc.Ode7
ltx/gr_gr_cog/me.m02.d08:meMA.Ode7C1H.text	@ltx/gr_gr_cog/he.h.m8:heHE.TheouSynkatavasin.text
ltx/gr_gr_cog/me.m02.d08:meMA.Ode7C1T.incipit	Ἁγίων τὸν ἅγιον, τέτοκας μόνη…
ltx/gr_gr_cog/me.m02.d08:meMA.Ode7C1T.melody	@ltx/gr_gr_cog/he.h.m8:heHE.TheouSynkatavasin.name
ltx/gr_gr_cog/me.m02.d08:meMA.Ode7C1T.mode	@ltx/gr_gr_cog/miscellanea:misc.Mode8
ltx/gr_gr_cog/me.m02.d08:meMA.Ode7C1T.ode	@ltx/gr_gr_cog/miscellanea:misc.Ode7
ltx/gr_gr_cog/me.m02.d08:meMA.Ode7C1T.text	Ἁγίων τὸν ἅγιον, τέτοκας μόνη θεοχαρίτωτε, ἀποῤῥήτῳ κυήσει· καὶ γὰρ Παρθένος ἔμεινας ἄχραντε, ὡς πρὸ τοῦ τόκου· διό σοι κραυγάζομεν τὴν τοῦ Ἀγγέλου φωνήν· Εὐλογημένη Ἁγνή.
ltx/gr_gr_cog/me.m02.d08:meMA.Ode7C21.greekmelody	@ltx/gr_gr_cog/he.h.m8:heHE.PaidesEvraion.greekname
ltx/gr_gr_cog/me.m02.d08:meMA.Ode7C21.incipit	Γῆν ἐπὶ πᾶσαν σοῦ Προφῆτα…
ltx/gr_gr_cog/me.m02.d08:meMA.Ode7C21.melody	@ltx/gr_gr_cog/he.h.m8:heHE.PaidesEvraion.name
ltx/gr_gr_cog/me.m02.d08:meMA.Ode7C21.mode	@ltx/gr_gr_cog/miscellanea:misc.Mode8
ltx/gr_gr_cog/me.m02.d08:meMA.Ode7C21.ode	@ltx/gr_gr_cog/miscellanea:misc.Ode7
ltx/gr_gr_cog/me.m02.d08:meMA.Ode7C21.text	Γῆν ἐπὶ πᾶσαν σοῦ Προφῆτα, διελήλυθεν ὁ φθόγγος ὁ θεόπνους, καὶ ῥημάτων τῶν σῶν, ἡ δύναμις βοῶσα· Εὐλογητὸς εἶ Κύριε, ὁ Θεὸς εἰς τοὺς αἰῶνας.
ltx/gr_gr_cog/me.m02.d08:meMA.Ode7C22.incipit	Ὅλος ταῖς ἄνω λαμπηδόσι, φωτιζόμενος…
ltx/gr_gr_cog/me.m02.d08:meMA.Ode7C22.melody	@ltx/gr_gr_cog/he.h.m8:heHE.PaidesEvraion.name
ltx/gr_gr_cog/me.m02.d08:meMA.Ode7C22.mode	@ltx/gr_gr_cog/miscellanea:misc.Mode8
ltx/gr_gr_cog/me.m02.d08:meMA.Ode7C22.ode	@ltx/gr_gr_cog/miscellanea:misc.Ode7
ltx/gr_gr_cog/me.m02.d08:meMA.Ode7C22.text	Ὅλος ταῖς ἄνω λαμπηδόσι, φωτιζόμενος τὰ μέλλοντα ἑώρας, ὡς παρόντα· διό, Πανόλβιε ἐβόας· Εὐλογητὸς εἶ Κύριε, ὁ Θεὸς εἰς τοὺς αἰῶνας.
ltx/gr_gr_cog/me.m02.d08:meMA.Ode7C2H.greekmelody	@ltx/gr_gr_cog/he.h.m8:heHE.PaidesEvraion.greekname
ltx/gr_gr_cog/me.m02.d08:meMA.Ode7C2H.incipit	@ltx/gr_gr_cog/he.h.m8:heHE.PaidesEvraion.incipit
ltx/gr_gr_cog/me.m02.d08:meMA.Ode7C2H.melody	@ltx/gr_gr_cog/he.h.m8:heHE.PaidesEvraion.melody
ltx/gr_gr_cog/me.m02.d08:meMA.Ode7C2H.mode	@ltx/gr_gr_cog/miscellanea:misc.Mode8
ltx/gr_gr_cog/me.m02.d08:meMA.Ode7C2H.ode	@ltx/gr_gr_cog/miscellanea:misc.Ode7
ltx/gr_gr_cog/me.m02.d08:meMA.Ode7C2H.text	@ltx/gr_gr_cog/he.h.m8:heHE.PaidesEvraion.text
ltx/gr_gr_cog/me.m02.d08:meMA.Ode7C2T.incipit	Ὕμνοις γεραίρω σε Παρθένε, τὴν…
ltx/gr_gr_cog/me.m02.d08:meMA.Ode7C2T.melody	@ltx/gr_gr_cog/he.h.m8:heHE.PaidesEvraion.name
ltx/gr_gr_cog/me.m02.d08:meMA.Ode7C2T.mode	@ltx/gr_gr_cog/miscellanea:misc.Mode8
ltx/gr_gr_cog/me.m02.d08:meMA.Ode7C2T.ode	@ltx/gr_gr_cog/miscellanea:misc.Ode7
ltx/gr_gr_cog/me.m02.d08:meMA.Ode7C2T.text	Ὕμνοις γεραίρω σε Παρθένε, τὴν τιμήσασαν τὴν φύσιν τῶν ἀνθρώπων, ἀτιμίᾳ δεινῇ, τὸ πρὶν κατακριθεῖσαν· Εὐλογημένος πάναγνε, ὁ καρπὸς τῆς σῆς κοιλίας.
ltx/gr_gr_cog/me.m02.d08:meMA.Ode8C11.greekmelody	@ltx/gr_gr_cog/he.h.m8:heHE.EptaplasiosKaminon.greekname
ltx/gr_gr_cog/me.m02.d08:meMA.Ode8C11.incipit	Ὁ λυμεὼν Λικίνιος, ὁ λυσσώδης…
ltx/gr_gr_cog/me.m02.d08:meMA.Ode8C11.melody	@ltx/gr_gr_cog/he.h.m8:heHE.EptaplasiosKaminon.name
ltx/gr_gr_cog/me.m02.d08:meMA.Ode8C11.mode	@ltx/gr_gr_cog/miscellanea:misc.Mode8
ltx/gr_gr_cog/me.m02.d08:meMA.Ode8C11.ode	@ltx/gr_gr_cog/miscellanea:misc.Ode8
ltx/gr_gr_cog/me.m02.d08:meMA.Ode8C11.text	Ὁ λυμεὼν Λικίνιος, ὁ λυσσώδης καὶ βέβηλος, ὅλον ἑαυτὸν ὁλοτελῶς τοῖς δαίμοσιν, ἐκδοὺς ὑποβάλλει σε, τιμωριῶν ποικίλων ποιναῖς, νῶτον καὶ τὸ στῆθος, τοῖς βουνεύροις συγκόπτων, ἐν σφαίραις μολυβδίναις, τὸν αὐχένα συντρίβων, πλευρὰς ὄνυξι ξαίνων, καὶ φλέγων ταῖς λαμπάσιν.
ltx/gr_gr_cog/me.m02.d08:meMA.Ode8C12.incipit	Ὑπομονὴν ἀνένδοτον, καρτερίαν ἀνάλωτον, καὶ…
ltx/gr_gr_cog/me.m02.d08:meMA.Ode8C12.melody	@ltx/gr_gr_cog/he.h.m8:heHE.EptaplasiosKaminon.name
ltx/gr_gr_cog/me.m02.d08:meMA.Ode8C12.mode	@ltx/gr_gr_cog/miscellanea:misc.Mode8
ltx/gr_gr_cog/me.m02.d08:meMA.Ode8C12.ode	@ltx/gr_gr_cog/miscellanea:misc.Ode8
ltx/gr_gr_cog/me.m02.d08:meMA.Ode8C12.text	Ὑπομονὴν ἀνένδοτον, καρτερίαν ἀνάλωτον, καὶ ὑπερφυῆ ἀνδρείαν ἐνδειξάμενος, ποικίλαις κολάσεσι, καὶ χαλεπαῖς στρεβλώσεσι, πάντων τῶν Μαρτύρων, ὑπερέβης τοὺς ἄθλους, παθῶν Δεσποτικῶν δέ, τῷ σταυρῷ κοινωνήσας, καὶ πλέον ὑπομείνας, μειζόνως ἐδοξάσθης.
ltx/gr_gr_cog/me.m02.d08:meMA.Ode8C13.incipit	Σταυρῷ ταθεὶς Θεόδωρε, τὰ Χριστοῦ…
ltx/gr_gr_cog/me.m02.d08:meMA.Ode8C13.melody	@ltx/gr_gr_cog/he.h.m8:heHE.EptaplasiosKaminon.name
ltx/gr_gr_cog/me.m02.d08:meMA.Ode8C13.mode	@ltx/gr_gr_cog/miscellanea:misc.Mode8
ltx/gr_gr_cog/me.m02.d08:meMA.Ode8C13.ode	@ltx/gr_gr_cog/miscellanea:misc.Ode8
ltx/gr_gr_cog/me.m02.d08:meMA.Ode8C13.text	Σταυρῷ ταθεὶς Θεόδωρε, τὰ Χριστοῦ ὑστερήματα, ἐν σαρκὶ οἰκείᾳ ἐκπληροῖς τῶν θλίψεων· οὐ χεῖρας καὶ πόδας γάρ, μόνον προσηλωθεὶς καρτερεῖς, ἀλλὰ καὶ περόνῃ, σιδηρᾶ διεπάρης, τὸ κρύφιόν σου μέλος, ἐκτμηθεὶς τοὺς διδύμους, καὶ βέλεσιν ὀμμάτων, ἐξορυχθεὶς τὰς κόρας.
ltx/gr_gr_cog/me.m02.d08:meMA.Ode8C1H.greekmelody	@ltx/gr_gr_cog/he.h.m8:heHE.EptaplasiosKaminon.greekname
ltx/gr_gr_cog/me.m02.d08:meMA.Ode8C1H.incipit	@ltx/gr_gr_cog/he.h.m8:heHE.EptaplasiosKaminon.incipit
ltx/gr_gr_cog/me.m02.d08:meMA.Ode8C1H.melody	@ltx/gr_gr_cog/he.h.m8:heHE.EptaplasiosKaminon.melody
ltx/gr_gr_cog/me.m02.d08:meMA.Ode8C1H.mode	@ltx/gr_gr_cog/miscellanea:misc.Mode8
ltx/gr_gr_cog/me.m02.d08:meMA.Ode8C1H.ode	@ltx/gr_gr_cog/miscellanea:misc.Ode8
ltx/gr_gr_cog/me.m02.d08:meMA.Ode8C1H.text	@ltx/gr_gr_cog/he.h.m8:heHE.EptaplasiosKaminon.text
ltx/gr_gr_cog/me.m02.d08:meMA.Ode8C1T.incipit	Οὐρανομήκη κλίμακα, νοητήν σε γινώσκομεν…
ltx/gr_gr_cog/me.m02.d08:meMA.Ode8C1T.melody	@ltx/gr_gr_cog/he.h.m8:heHE.EptaplasiosKaminon.name
ltx/gr_gr_cog/me.m02.d08:meMA.Ode8C1T.mode	@ltx/gr_gr_cog/miscellanea:misc.Mode8
ltx/gr_gr_cog/me.m02.d08:meMA.Ode8C1T.ode	@ltx/gr_gr_cog/miscellanea:misc.Ode8
ltx/gr_gr_cog/me.m02.d08:meMA.Ode8C1T.text	Οὐρανομήκη κλίμακα, νοητήν σε γινώσκομεν, διʼ ἧς καταβάς, μετὰ σαρκὸς ὁ Ὕψιστος, ἀνθρώποις ὡμίλησε, καὶ ταπεινοὺς ἀνύψωσε, πρὸς τὴν ὑψηλήν, τῶν οὐρανῶν πολιτείαν· ἐντεῦθεν ἀνωτέραν, οὐρανῶν καὶ Ἀγγέλων, καὶ πάντων ποιημάτων, τιμῶμέν σε Παρθένε.
ltx/gr_gr_cog/me.m02.d08:meMA.Ode8C21.greekmelody	@ltx/gr_gr_cog/he.h.m8:heHE.TonEnOreiAgio.greekname
ltx/gr_gr_cog/me.m02.d08:meMA.Ode8C21.incipit	Σιὼν ὄρος ἡ πόλις ἡ…
ltx/gr_gr_cog/me.m02.d08:meMA.Ode8C21.melody	@ltx/gr_gr_cog/he.h.m8:heHE.TonEnOreiAgio.name
ltx/gr_gr_cog/me.m02.d08:meMA.Ode8C21.mode	@ltx/gr_gr_cog/miscellanea:misc.Mode8
ltx/gr_gr_cog/me.m02.d08:meMA.Ode8C21.ode	@ltx/gr_gr_cog/miscellanea:misc.Ode8
ltx/gr_gr_cog/me.m02.d08:meMA.Ode8C21.text	Σιὼν ὄρος ἡ πόλις ἡ ἁγία, χαῖρε σφόδρα ὁ θεῖος Ζαχαρίας, Ἀγγέλων ὁ συνόμιλος προτρέπεται, καὶ σὺ δὲ ἀγάλλου, Ἱερουσαλήμ, εἰς πάντας τοὺς αἰῶνας.
ltx/gr_gr_cog/me.m02.d08:meMA.Ode8C22.incipit	Ζαχαρία Προφῆτα κατατέρπου, πληρωθέντας θεώμενος…
ltx/gr_gr_cog/me.m02.d08:meMA.Ode8C22.melody	@ltx/gr_gr_cog/he.h.m8:heHE.TonEnOreiAgio.name
ltx/gr_gr_cog/me.m02.d08:meMA.Ode8C22.mode	@ltx/gr_gr_cog/miscellanea:misc.Mode8
ltx/gr_gr_cog/me.m02.d08:meMA.Ode8C22.ode	@ltx/gr_gr_cog/miscellanea:misc.Ode8
ltx/gr_gr_cog/me.m02.d08:meMA.Ode8C22.text	Ζαχαρία Προφῆτα κατατέρπου, πληρωθέντας θεώμενος τοὺς λόγους, οὓς προηγόρευσας τῷ Πνεύματι λαμπόμενος· Κύριον ὑμνεῖτε, καὶ ὑπερυψοῦτε, βοῶν εἰς τοὺς αἰῶνας.
ltx/gr_gr_cog/me.m02.d08:meMA.Ode8C23.incipit	Ἀναμέσον ὀρέων κατασκίων, ἐθεώρεις ἑστῶτας…
ltx/gr_gr_cog/me.m02.d08:meMA.Ode8C23.melody	@ltx/gr_gr_cog/he.h.m8:heHE.TonEnOreiAgio.name
ltx/gr_gr_cog/me.m02.d08:meMA.Ode8C23.mode	@ltx/gr_gr_cog/miscellanea:misc.Mode8
ltx/gr_gr_cog/me.m02.d08:meMA.Ode8C23.ode	@ltx/gr_gr_cog/miscellanea:misc.Ode8
ltx/gr_gr_cog/me.m02.d08:meMA.Ode8C23.text	Ἀναμέσον ὀρέων κατασκίων, ἐθεώρεις ἑστῶτας τοὺς Ἀγγέλους, τὴν ἐπὶ πάντων πρόνοιαν μυοῦντάς σε, ἔνδοξε Προφῆτα, καὶ ὑμνολογοῦντας, Χριστὸν εἰς τοὺς αἰῶνας.
ltx/gr_gr_cog/me.m02.d08:meMA.Ode8C2H.greekmelody	@ltx/gr_gr_cog/he.h.m8:heHE.TonEnOreiAgio.greekname
ltx/gr_gr_cog/me.m02.d08:meMA.Ode8C2H.incipit	@ltx/gr_gr_cog/he.h.m8:heHE.TonEnOreiAgio.incipit
ltx/gr_gr_cog/me.m02.d08:meMA.Ode8C2H.melody	@ltx/gr_gr_cog/he.h.m8:heHE.TonEnOreiAgio.melody
ltx/gr_gr_cog/me.m02.d08:meMA.Ode8C2H.mode	@ltx/gr_gr_cog/miscellanea:misc.Mode8
ltx/gr_gr_cog/me.m02.d08:meMA.Ode8C2H.ode	@ltx/gr_gr_cog/miscellanea:misc.Ode8
ltx/gr_gr_cog/me.m02.d08:meMA.Ode8C2H.text	@ltx/gr_gr_cog/he.h.m8:heHE.TonEnOreiAgio.text
ltx/gr_gr_cog/me.m02.d08:meMA.Ode8C2T.incipit	Χαῖρε θρόνε πυρίμορφε Κυρίου, χαῖρε…
ltx/gr_gr_cog/me.m02.d08:meMA.Ode8C2T.melody	@ltx/gr_gr_cog/he.h.m8:heHE.TonEnOreiAgio.name
ltx/gr_gr_cog/me.m02.d08:meMA.Ode8C2T.mode	@ltx/gr_gr_cog/miscellanea:misc.Mode8
ltx/gr_gr_cog/me.m02.d08:meMA.Ode8C2T.ode	@ltx/gr_gr_cog/miscellanea:misc.Ode8
ltx/gr_gr_cog/me.m02.d08:meMA.Ode8C2T.text	Χαῖρε θρόνε πυρίμορφε Κυρίου, χαῖρε πύλη ἀΰλου φρυκτωρίας, χαῖρε νεφέλη κούφη ἡ τὸν Ἥλιον, τῆς δικαιοσύνης, λάμψασα τῷ κόσμῳ ἁγνὴ Θεοκυῆτορ.
ltx/gr_gr_cog/me.m02.d08:meMA.Ode9C11.greekmelody	@ltx/gr_gr_cog/he.h.m8:heHE.ExestiEpiTouto.greekname
ltx/gr_gr_cog/me.m02.d08:meMA.Ode9C11.incipit	Ἐξέστη τῶν Ἀγγέλων δῆμος τὴν…
ltx/gr_gr_cog/me.m02.d08:meMA.Ode9C11.melody	@ltx/gr_gr_cog/he.h.m8:heHE.ExestiEpiTouto.name
ltx/gr_gr_cog/me.m02.d08:meMA.Ode9C11.mode	@ltx/gr_gr_cog/miscellanea:misc.Mode8
ltx/gr_gr_cog/me.m02.d08:meMA.Ode9C11.ode	@ltx/gr_gr_cog/miscellanea:misc.Ode9
ltx/gr_gr_cog/me.m02.d08:meMA.Ode9C11.text	Ἐξέστη τῶν Ἀγγέλων δῆμος τὴν σήν, Στρατηλάτα τηρῶν γενναιότητα, πᾶς ὁ παρών, ὄχλος κατεπλάγη τότε τὰς σάς, ἀνδραγαθίας ἔνδοξε, ἔφριξε δαιμόνων ἡ στρατιά, τὰ σὰ τρόπαια, νῦν δέ, κροτεῖ κόσμος τὰ γέρα, καὶ πᾶς πιστὸς ὑμνεῖ τὰ θαύματα.
ltx/gr_gr_cog/me.m02.d08:meMA.Ode9C12.incipit	Βοᾶται παρὰ πάσης σχεδὸν πνοῆς…
ltx/gr_gr_cog/me.m02.d08:meMA.Ode9C12.melody	@ltx/gr_gr_cog/he.h.m8:heHE.ExestiEpiTouto.name
ltx/gr_gr_cog/me.m02.d08:meMA.Ode9C12.mode	@ltx/gr_gr_cog/miscellanea:misc.Mode8
ltx/gr_gr_cog/me.m02.d08:meMA.Ode9C12.ode	@ltx/gr_gr_cog/miscellanea:misc.Ode9
ltx/gr_gr_cog/me.m02.d08:meMA.Ode9C12.text	Βοᾶται παρὰ πάσης σχεδὸν πνοῆς, τὰ πολλά σου καὶ μέγιστα τρόπαια, τὰ ἐπὶ σοί, τέρατα δειχθέντα καὶ διὰ σοῦ, ἡ ἐκ νεκρῶν ἀνέγερσις, ἡ ὁλοκληρία ἐκ συντριβῆς, ἡ ῥῶσις τῶν νοσούντων, ἡ λύσις τῶν δεσμίων, καὶ τῶν ἐν θλίψει ἡ παράκλησις.
ltx/gr_gr_cog/me.m02.d08:meMA.Ode9C13.incipit	Ὡς ἔχων παῤῥησίαν πρὸς Χριστόν…
ltx/gr_gr_cog/me.m02.d08:meMA.Ode9C13.melody	@ltx/gr_gr_cog/he.h.m8:heHE.ExestiEpiTouto.name
ltx/gr_gr_cog/me.m02.d08:meMA.Ode9C13.mode	@ltx/gr_gr_cog/miscellanea:misc.Mode8
ltx/gr_gr_cog/me.m02.d08:meMA.Ode9C13.ode	@ltx/gr_gr_cog/miscellanea:misc.Ode9
ltx/gr_gr_cog/me.m02.d08:meMA.Ode9C13.text	Ὡς ἔχων παῤῥησίαν πρὸς Χριστόν, ὑπὲρ οὗ πάσας ὑπήνεγκας, μέχρι τομῆς, καύσεως θανάτου τε καὶ σταυροῦ, ἐγκαρτερῶν Θεόδωρε, αἴτησαι συγγνώμην ἡμῖν κακῶν, τῷ κόσμῳ τὴν εἰρήνην, νίκας τοῖς Βασιλεῦσι, καὶ σωτηρίαν τοῖς τιμῶσί σε.
ltx/gr_gr_cog/me.m02.d08:meMA.Ode9C1H.greekmelody	@ltx/gr_gr_cog/he.h.m8:heHE.ExestiEpiTouto.greekname
ltx/gr_gr_cog/me.m02.d08:meMA.Ode9C1H.incipit	@ltx/gr_gr_cog/he.h.m8:heHE.ExestiEpiTouto.incipit
ltx/gr_gr_cog/me.m02.d08:meMA.Ode9C1H.melody	@ltx/gr_gr_cog/he.h.m8:heHE.ExestiEpiTouto.melody
ltx/gr_gr_cog/me.m02.d08:meMA.Ode9C1H.mode	@ltx/gr_gr_cog/miscellanea:misc.Mode8
ltx/gr_gr_cog/me.m02.d08:meMA.Ode9C1H.ode	@ltx/gr_gr_cog/miscellanea:misc.Ode9
ltx/gr_gr_cog/me.m02.d08:meMA.Ode9C1H.text	@ltx/gr_gr_cog/he.h.m8:heHE.ExestiEpiTouto.text
ltx/gr_gr_cog/me.m02.d08:meMA.Ode9C1T.incipit	Ὑψώθη ἐδοξάσθη γένος βροτῶν, καὶ…
ltx/gr_gr_cog/me.m02.d08:meMA.Ode9C1T.melody	@ltx/gr_gr_cog/he.h.m8:heHE.ExestiEpiTouto.name
ltx/gr_gr_cog/me.m02.d08:meMA.Ode9C1T.mode	@ltx/gr_gr_cog/miscellanea:misc.Mode8
ltx/gr_gr_cog/me.m02.d08:meMA.Ode9C1T.ode	@ltx/gr_gr_cog/miscellanea:misc.Ode9
ltx/gr_gr_cog/me.m02.d08:meMA.Ode9C1T.text	Ὑψώθη ἐδοξάσθη γένος βροτῶν, καὶ τιμῆς ἠξιώθη τῆς κρείττονος, διὰ τῆς σῆς, Κόρη συγγενείας καὶ θεϊκῆς, υἱοθεσίας ἔτυχε, τῇ σῇ μεσιτείᾳ· καὶ γὰρ Θεός, ὡράθη σαρκοφόρος, ἐκ σοῦ ἀῤῥήτῳ τρόπῳ, ἄτρεπτος μείνας τῇ Θεότητι.
ltx/gr_gr_cog/me.m02.d08:meMA.Ode9C21.greekmelody	@ltx/gr_gr_cog/he.h.m8:heHE.SeTinApeirogamon.greekname
ltx/gr_gr_cog/me.m02.d08:meMA.Ode9C21.incipit	Ἄπασαν τὴν αἴσθησιν, καταλιπὼν νοῒ…
ltx/gr_gr_cog/me.m02.d08:meMA.Ode9C21.melody	@ltx/gr_gr_cog/he.h.m8:heHE.SeTinApeirogamon.name
ltx/gr_gr_cog/me.m02.d08:meMA.Ode9C21.mode	@ltx/gr_gr_cog/miscellanea:misc.Mode8
ltx/gr_gr_cog/me.m02.d08:meMA.Ode9C21.ode	@ltx/gr_gr_cog/miscellanea:misc.Ode9
ltx/gr_gr_cog/me.m02.d08:meMA.Ode9C21.text	Ἄπασαν τὴν αἴσθησιν, καταλιπὼν νοῒ τῷ θείῳ, καὶ καθαρωτάτῳ πάνσοφε, φωτοφόρος παρίστασαι, τὰς ὑπὲρ τοῦ κόσμου ἱκεσίας ποιούμενος· ὅθεν πάντες σε Ζαχαρία μεγαλύνομεν
ltx/gr_gr_cog/me.m02.d08:meMA.Ode9C22.incipit	Ῥήσεσιν ἑπόμενοι, τῶν σῶν χειλέων…
ltx/gr_gr_cog/me.m02.d08:meMA.Ode9C22.melody	@ltx/gr_gr_cog/he.h.m8:heHE.SeTinApeirogamon.name
ltx/gr_gr_cog/me.m02.d08:meMA.Ode9C22.mode	@ltx/gr_gr_cog/miscellanea:misc.Mode8
ltx/gr_gr_cog/me.m02.d08:meMA.Ode9C22.ode	@ltx/gr_gr_cog/miscellanea:misc.Ode9
ltx/gr_gr_cog/me.m02.d08:meMA.Ode9C22.text	Ῥήσεσιν ἑπόμενοι, τῶν σῶν χειλέων θεοφάντορ, Κύριον ἐπικαλούμεθα, διʼ αὐτοῦ τε σω ζόμενοι, ὡς τῆς ἀληθείας σε Προφήτην καὶ κήρυκα, Ζαχαρία τῆς εὐσεβείας μακαρίζομεν.
ltx/gr_gr_cog/me.m02.d08:meMA.Ode9C23.incipit	Ἵλεων ἀπέργασαι, ταῖς σαῖς πρεσβείαις…
ltx/gr_gr_cog/me.m02.d08:meMA.Ode9C23.melody	@ltx/gr_gr_cog/he.h.m8:heHE.SeTinApeirogamon.name
ltx/gr_gr_cog/me.m02.d08:meMA.Ode9C23.mode	@ltx/gr_gr_cog/miscellanea:misc.Mode8
ltx/gr_gr_cog/me.m02.d08:meMA.Ode9C23.ode	@ltx/gr_gr_cog/miscellanea:misc.Ode9
ltx/gr_gr_cog/me.m02.d08:meMA.Ode9C23.text	Ἵλεων ἀπέργασαι, ταῖς σαῖς πρεσβείαις τὸν Δεσπότην, τοῖς τὴν Ἱερὰν καὶ εὔσημον, ἑορτήν σου θεόπνευστε, πίστει ἐκτελοῦσι, καὶ σὲ πόθω γεραίρουσιν, ὡς Προφήτην καὶ θεηγόρον ἀληθέστατον.
ltx/gr_gr_cog/me.m02.d08:meMA.Ode9C2H.greekmelody	@ltx/gr_gr_cog/he.h.m8:heHE.SeTinApeirogamon.greekname
ltx/gr_gr_cog/me.m02.d08:meMA.Ode9C2H.incipit	@ltx/gr_gr_cog/he.h.m8:heHE.SeTinApeirogamon.incipit
ltx/gr_gr_cog/me.m02.d08:meMA.Ode9C2H.melody	@ltx/gr_gr_cog/he.h.m8:heHE.SeTinApeirogamon.melody
ltx/gr_gr_cog/me.m02.d08:meMA.Ode9C2H.mode	@ltx/gr_gr_cog/miscellanea:misc.Mode8
ltx/gr_gr_cog/me.m02.d08:meMA.Ode9C2H.ode	@ltx/gr_gr_cog/miscellanea:misc.Ode9
ltx/gr_gr_cog/me.m02.d08:meMA.Ode9C2H.text	@ltx/gr_gr_cog/he.h.m8:heHE.SeTinApeirogamon.text
ltx/gr_gr_cog/me.m02.d08:meMA.Ode9C2T.incipit	Ἄβυσσον θαυμάτων σε, καὶ χαρισμάτων…
ltx/gr_gr_cog/me.m02.d08:meMA.Ode9C2T.melody	@ltx/gr_gr_cog/he.h.m8:heHE.SeTinApeirogamon.name
ltx/gr_gr_cog/me.m02.d08:meMA.Ode9C2T.mode	@ltx/gr_gr_cog/miscellanea:misc.Mode8
ltx/gr_gr_cog/me.m02.d08:meMA.Ode9C2T.ode	@ltx/gr_gr_cog/miscellanea:misc.Ode9
ltx/gr_gr_cog/me.m02.d08:meMA.Ode9C2T.text	Ἄβυσσον θαυμάτων σε, καὶ χαρισμάτων Θεοτόκε, πέλαγος Ἁγνὴ γινώσκοντες, καὶ σαφῶς ἐπιστάμενοι, τῇ σῇ προστασίᾳ πεπειθότες προστρέχομεν, καὶ συντόνως πρός τὴν σὴν σκέπην καταφεύγομεν.
ltx/gr_gr_cog/me.m02.d08:meMA.Oikos1.text	Τῶν ἀθλητῶν τὸ ἔκλαμπρον κάλλος δεῦτε πάντες, τοῖς ὕμνοις τῶν στεφάνων, πιστοὶ Θεόδωρον καταστέψωμεν· δῶρον Θεοῦ γὰρ μέγα τῷ κόσμῳ ἀναδέδεικται, λάμψεσι ταῖς τῶν θαυμάτων· τὸν γὰρ ἐχθρὸν ἐκνικήσας Βελίαρ ἄθλοις σεπτοῖς, ὀμβρίζει ἀντὶ αἱμάτων, κρουνηδὸν ἰαμάτων τὰ ῥεύματα. Ἐν τούτοις οὖν πᾶσι χαίρει Χριστῷ, καὶ δίδωσιν εἰρήνην ἀνέκλειπτον· διὸ βοῶμεν αὐτῷ· Πρεσβεύων μὴ παύσῃ ὑπὲρ πάντων ἡμῶν.
ltx/gr_gr_cog/me.m02.d08:meVE.Apolytikion1.greekmelody	@ltx/gr_gr_cog/he.a.m4:heAU.OYpsotheisEnToStavro.greekname
ltx/gr_gr_cog/me.m02.d08:meVE.Apolytikion1.incipit	Στρατολογίᾳ ἀληθεῖ Ἀθλοφόρε, τοῦ οὐρανίου…
ltx/gr_gr_cog/me.m02.d08:meVE.Apolytikion1.melody	@ltx/gr_gr_cog/he.a.m4:heAU.OYpsotheisEnToStavro.name
ltx/gr_gr_cog/me.m02.d08:meVE.Apolytikion1.mode	@ltx/gr_gr_cog/miscellanea:misc.Mode4
ltx/gr_gr_cog/me.m02.d08:meVE.Apolytikion1.text	Στρατολογίᾳ ἀληθεῖ Ἀθλοφόρε, τοῦ οὐρανίου στρατηγὸς Βασιλέως, περικαλὴς γεγένησαι Θεόδωρε· ὅπλοις γὰρ τῆς πίστεως, παρετάξω ἐμφρόνως, καὶ κατεξωλόθρευσας, τῶν δαιμόνων τὰ στίφη, καὶ νικηφόρος ὤφθης ἀθλητής· ὅθεν σε πίστει ἀεὶ μακαρίζομεν.
ltx/gr_gr_cog/me.m02.d08:meVE.Apolytikion2ger.greekmelody	@ltx/gr_gr_cog/he.a.m4:heAU.TachyProkatalave.greekname
ltx/gr_gr_cog/me.m02.d08:meVE.Apolytikion2ger.incipit	Τὴν κλῆσιν κατάλληλον, δείξας τοῖς…
ltx/gr_gr_cog/me.m02.d08:meVE.Apolytikion2ger.melody	@ltx/gr_gr_cog/he.a.m4:heAU.TachyProkatalave.name
ltx/gr_gr_cog/me.m02.d08:meVE.Apolytikion2ger.mode	@ltx/gr_gr_cog/miscellanea:misc.Mode4
ltx/gr_gr_cog/me.m02.d08:meVE.Apolytikion2ger.poet	@ltx/gr_gr_cog/poets:po.Gerasimou
ltx/gr_gr_cog/me.m02.d08:meVE.Apolytikion2ger.text	Τὴν κλῆσιν κατάλληλον, δείξας τοῖς ἔργοις σοφέ, ταμεῖον ἐπάξιον, τῆς ἐπιπνοίας Θεοῦ, Ζαχαρία γεγένησαι· ἔχων γὰρ ἐν τῷ βίῳ, συλλαλοῦντας Ἀγγέλους, ὤφθης τῶν ἐσομένων, θεηγόρος Προφήτης. Καί νῦν ἡμῶν τὰς αἰτήσεις, ἄνωθεν πλήρωσον.
ltx/gr_gr_cog/me.m02.d08:meVE.AposBoth.incipit	@ltx/gr_gr_cog/me.m02.d02:meVE.AposGlory.incipit
ltx/gr_gr_cog/me.m02.d08:meVE.AposBoth.melody	
ltx/gr_gr_cog/me.m02.d08:meVE.AposBoth.mode	@ltx/gr_gr_cog/miscellanea:misc.Mode8
ltx/gr_gr_cog/me.m02.d08:meVE.AposBoth.poet	@ltx/gr_gr_cog/poets:po.AndreouKritis
ltx/gr_gr_cog/me.m02.d08:meVE.AposBoth.text	@ltx/gr_gr_cog/me.m02.d02:meVE.AposGlory.text
ltx/gr_gr_cog/me.m02.d08:meVE.AposGlory.incipit	Τῶν τοῦ Θεοῦ δωρεῶν ὡς…
ltx/gr_gr_cog/me.m02.d08:meVE.AposGlory.melody	
ltx/gr_gr_cog/me.m02.d08:meVE.AposGlory.mode	@ltx/gr_gr_cog/miscellanea:misc.Mode8
ltx/gr_gr_cog/me.m02.d08:meVE.AposGlory.text	Τῶν τοῦ Θεοῦ δωρεῶν ὡς ἐπώνυμον, καὶ τῆς αὐτοῦ κληρονόμον μακαριότητος, πάντες εὐφημήσωμεν πιστοί, καὶ μακαρίσωμεν ἐπαξίως, Θεόδωρον τὸν γενναῖον μεγαλομάρτυρα, τῆς οἰκουμένης τὸν ὑπέρμαχον· πρεσβεύει γὰρ Χριστῷ τῷ Θεῷ, ὑπὲρ τῶν ψυχῶν ἡμῶν.
ltx/gr_gr_cog/me.m02.d08:meVE.Aposticha1.greekmelody	@ltx/gr_gr_cog/he.a.m6:heAU.TriimerosAnestis.greekname
ltx/gr_gr_cog/me.m02.d08:meVE.Aposticha1.incipit	@ltx/gr_gr_cog/me.m02.d03:meMA.Aposticha1.incipit
ltx/gr_gr_cog/me.m02.d08:meVE.Aposticha1.melody	@ltx/gr_gr_cog/he.a.m6:heAU.TriimerosAnestis.name
ltx/gr_gr_cog/me.m02.d08:meVE.Aposticha1.mode	@ltx/gr_gr_cog/miscellanea:misc.Mode5
ltx/gr_gr_cog/me.m02.d08:meVE.Aposticha1.text	@ltx/gr_gr_cog/me.m02.d03:meMA.Aposticha1.text
ltx/gr_gr_cog/me.m02.d08:meVE.Aposticha2.incipit	@ltx/gr_gr_cog/me.m02.d03:meMA.Aposticha2.incipit
ltx/gr_gr_cog/me.m02.d08:meVE.Aposticha2.melody	@ltx/gr_gr_cog/he.a.m6:heAU.TriimerosAnestis.name
ltx/gr_gr_cog/me.m02.d08:meVE.Aposticha2.mode	@ltx/gr_gr_cog/miscellanea:misc.Mode5
ltx/gr_gr_cog/me.m02.d08:meVE.Aposticha2.text	@ltx/gr_gr_cog/me.m02.d03:meMA.Aposticha2.text
ltx/gr_gr_cog/me.m02.d08:meVE.Aposticha3.incipit	@ltx/gr_gr_cog/me.m02.d03:meMA.Aposticha3.incipit
ltx/gr_gr_cog/me.m02.d08:meVE.Aposticha3.melody	@ltx/gr_gr_cog/he.a.m6:heAU.TriimerosAnestis.name
ltx/gr_gr_cog/me.m02.d08:meVE.Aposticha3.mode	@ltx/gr_gr_cog/miscellanea:misc.Mode5
ltx/gr_gr_cog/me.m02.d08:meVE.Aposticha3.text	@ltx/gr_gr_cog/me.m02.d03:meMA.Aposticha3.text
ltx/gr_gr_cog/me.m02.d08:meVE.SticBoth.incipit	@ltx/gr_gr_cog/me.m02.d02:meVE.LityBoth.incipit
ltx/gr_gr_cog/me.m02.d08:meVE.SticBoth.melody	
ltx/gr_gr_cog/me.m02.d08:meVE.SticBoth.mode	@ltx/gr_gr_cog/miscellanea:misc.Mode5
ltx/gr_gr_cog/me.m02.d08:meVE.SticBoth.poet	@ltx/gr_gr_cog/poets:po.GermanouOiDeAnatoliou
ltx/gr_gr_cog/me.m02.d08:meVE.SticBoth.text	@ltx/gr_gr_cog/me.m02.d02:meVE.LityBoth.text
ltx/gr_gr_cog/me.m02.d08:meVE.SticGlory.incipit	Σήμερον ἀνέτειλεν ὑπὲρ τὸν Ἑωσφόρον…
ltx/gr_gr_cog/me.m02.d08:meVE.SticGlory.melody	
ltx/gr_gr_cog/me.m02.d08:meVE.SticGlory.mode	@ltx/gr_gr_cog/miscellanea:misc.Mode5
ltx/gr_gr_cog/me.m02.d08:meVE.SticGlory.text	Σήμερον ἀνέτειλεν ὑπὲρ τὸν Ἑωσφόρον, ἡ σεβάσμιος μνήμη τοῦ Ἀθλοφόρου Χριστοῦ, τῶν Πιστῶν τὰς καρδίας ἀνενδότως φωτίζουσα, καὶ τὰ νέφη τῶν ψυχῶν ἀποδιώκουσα, τῇ ἐνεργείᾳ καὶ χάριτι τοῦ Πνεύματος· πρὸς ὃν φιλομάρτυρες ἀνακράξωμεν· Χαίροις, ὁ τοῖς Πιστοῖς ἀναδειχθεὶς θεοδώρητος χάρις, καὶ τῶν θαυμάτων τὰ πλήθη ἐφαπλῶν, τοῖς εἰς σὲ προστρέχουσι, Θεόδωρε μακάριε. Χριστὸν ἀπαύστως πρεσβεύων μὴ ἐλλίπῃς, τῶν αἰωνίων ἀγαθῶν ἐπιτυχεῖν, τοὺς ἐν πίστει ἐκτελοῦντας, τὴν πάνσεπτον μνήμην σου.
ltx/gr_gr_cog/me.m02.d08:meVE.SticStavrotheotokion.incipit	Ὡς ἀμνόν σε Λόγε, ἡ…
ltx/gr_gr_cog/me.m02.d08:meVE.SticStavrotheotokion.melody	
ltx/gr_gr_cog/me.m02.d08:meVE.SticStavrotheotokion.mode	@ltx/gr_gr_cog/miscellanea:misc.Mode5
ltx/gr_gr_cog/me.m02.d08:meVE.SticStavrotheotokion.text	Ὡς ἀμνόν σε Λόγε, ἡ ἀμνὰς καὶ Παρθένος, πρὸς σφαγὴν χωροῦντα, καθορῶσα ἐβόα· Ὢ ξένου τολμήματος! πῶς ἄνομοι σφάττουσι, τὸν τοὺς ἀνθρώπους ζωοῦντα; Μέγα σου Υἱέ μου τὸ ἔλεος!
ltx/gr_gr_cog/me.m02.d08:meVE.SticStavrotheotokion2.greekmelody	@ltx/gr_gr_cog/he.a.m8:heAU.TiYmasKalesomen.greekname
ltx/gr_gr_cog/me.m02.d08:meVE.SticStavrotheotokion2.incipit	Ξύλῳ προσπηγνύμενον Κύριε, ὡς ἑώρακεν…
ltx/gr_gr_cog/me.m02.d08:meVE.SticStavrotheotokion2.melody	@ltx/gr_gr_cog/he.a.m8:heAU.TiYmasKalesomen.name
ltx/gr_gr_cog/me.m02.d08:meVE.SticStavrotheotokion2.mode	@ltx/gr_gr_cog/miscellanea:misc.Mode8
ltx/gr_gr_cog/me.m02.d08:meVE.SticStavrotheotokion2.text	Ξύλῳ προσπηγνύμενον Κύριε, ὡς ἑώρακεν ἀσπόρως, ἡ τεκοῦσά σε Ἀμνάς, κατεξαίνετο τὰς ὄψεις, καὶ ἐβόα ἐν κλαυθμῷ· Υἱέ μου πῶς σφαγὴν φέρεις τὴν ἄδικον, πῶς θνῄσκεις, ὁ ἀθάνατος ὡς ἄνθρωπος; Λόγον μοι δὸς φῶς γλυκύτατον, βλέψον Μητέρα θρηνοῦσάν σε, καὶ δόξασον, ταύτην Λόγε τῇ ἐγέρσει σου.
ltx/gr_gr_cog/me.m02.d08:meVE.SticTheotokion.incipit	@ltx/gr_gr_cog/oc.m5.d3:ocVE.AposTheotokion.incipit
ltx/gr_gr_cog/me.m02.d08:meVE.SticTheotokion.melody	
ltx/gr_gr_cog/me.m02.d08:meVE.SticTheotokion.mode	@ltx/gr_gr_cog/miscellanea:misc.Mode5
ltx/gr_gr_cog/me.m02.d08:meVE.SticTheotokion.text	@ltx/gr_gr_cog/oc.m5.d3:ocVE.AposTheotokion.text
ltx/gr_gr_cog/me.m02.d08:meVE.SticTheotokion2.greekmelody	@ltx/gr_gr_cog/he.a.m8:heAU.TiYmasKalesomen.greekname
ltx/gr_gr_cog/me.m02.d08:meVE.SticTheotokion2.incipit	Νύμφην σε Παρθένον ἐκήρυξαν, τῆς…
ltx/gr_gr_cog/me.m02.d08:meVE.SticTheotokion2.melody	@ltx/gr_gr_cog/he.a.m8:heAU.TiYmasKalesomen.name
ltx/gr_gr_cog/me.m02.d08:meVE.SticTheotokion2.mode	@ltx/gr_gr_cog/miscellanea:misc.Mode8
ltx/gr_gr_cog/me.m02.d08:meVE.SticTheotokion2.text	Νύμφην σε Παρθένον ἐκήρυξαν, τῆς ἀξίας τοῦ Πατρός, καὶ τῆς Θεότητος αὐτοῦ, οἱ Θεὸν ἀξιωθέντες, κατιδεῖν σωματικῶς, καὶ Λόγου καὶ Θεοῦ Κόρη Γεννήτριαν, καὶ Πνεύματος Ἁγίου οἰκητήριον· ἐν σοὶ γὰρ πᾶν τῆς Θεότητος, σωματικῶς κατεσκήνωσε, τὸ πλήρωμα, πληρεστάτης οὔσης χάριτος.
ltx/gr_gr_cog/me.m02.d08:meVE.Stichera01.greekmelody	@ltx/gr_gr_cog/he.a.m5:heAU.ChairoisAskitikon.greekname
ltx/gr_gr_cog/me.m02.d08:meVE.Stichera01.incipit	Χαίροις ὁ στρατιώτης Χριστοῦ· ὁ…
ltx/gr_gr_cog/me.m02.d08:meVE.Stichera01.melody	@ltx/gr_gr_cog/he.a.m5:heAU.ChairoisAskitikon.name
ltx/gr_gr_cog/me.m02.d08:meVE.Stichera01.mode	@ltx/gr_gr_cog/miscellanea:misc.Mode5
ltx/gr_gr_cog/me.m02.d08:meVE.Stichera01.text	Χαίροις ὁ στρατιώτης Χριστοῦ· ὁ τροπωσάμενος ἐχθροῦ τὴν παράταξιν, τῷ ὅπλῳ τῆς εὐσεβείας· ὁ τῶν πιστῶν στηριγμός· ὁ πολλαῖς βασάνοις ὠνησάμενος, Θεοῦ τὴν οὐράνιον, βασιλείαν Θεόδωρε· ἐν ᾗ χορεύων, καὶ μεθέξει θεούμενος, καὶ λαμπόμενος, καθαραῖς διαδόσεσι, μέμνησο τῶν τιμώντων σου, τὴν μνήμην τὴν ἔνδοξον, καὶ προσκυνούντων ἐν πίστει, τὴν τῶν λειψάνων σου λάρνακα, ἀφʼ ἧς ἀναβλύζει, τοῖς αἰτοῦσιν εὐρωστία, καὶ μέγα ἔλεος.
ltx/gr_gr_cog/me.m02.d08:meVE.Stichera02.incipit	Χαίροις ἡ ἱερὰ κεφαλή, τῶν…
ltx/gr_gr_cog/me.m02.d08:meVE.Stichera02.melody	@ltx/gr_gr_cog/he.a.m5:heAU.ChairoisAskitikon.name
ltx/gr_gr_cog/me.m02.d08:meVE.Stichera02.mode	@ltx/gr_gr_cog/miscellanea:misc.Mode5
ltx/gr_gr_cog/me.m02.d08:meVE.Stichera02.text	Χαίροις ἡ ἱερὰ κεφαλή, τῶν Ἀθλοφόρων τὸ σεπτὸν ἀκροθίνιον· ὁ κόσμος τῆς Ἐκκλησίας· ὁ καθαιρέτης ἐχθροῦ· δωρεῶν ἐνθέων ὁ ἐπώνυμος· λαμπτὴρ τὴν ὑφήλιον, καταυγάζων τοῖς θαύμασι· στῦλος ὁ μέγας, διαμείνας ἀσάλευτος, ταῖς προσρήξεσι, τῶν ἀπείρων κολάσεων· λόγχῃ τῆς καρτερίας σου, ὁ κτείνας τὸν δράκοντα· ὁ ἀριστεύσας μεγάλως, ὡς στρατιώτης ἀήττητος. Χριστὸν ἐκδυσώπει, ταῖς ψυχαῖς ἡμῶν δοθῆναι, τὸ μέγα ἔλεος.
ltx/gr_gr_cog/me.m02.d08:meVE.Stichera03.incipit	Ὅπλῳ τοῦ ζωηφόρου Σταυροῦ, τὴν…
ltx/gr_gr_cog/me.m02.d08:meVE.Stichera03.melody	@ltx/gr_gr_cog/he.a.m5:heAU.ChairoisAskitikon.name
ltx/gr_gr_cog/me.m02.d08:meVE.Stichera03.mode	@ltx/gr_gr_cog/miscellanea:misc.Mode5
ltx/gr_gr_cog/me.m02.d08:meVE.Stichera03.text	Ὅπλῳ τοῦ ζωηφόρου Σταυροῦ, τὴν τῶν εἰδώλων συντριβὴν ἐργασάμενος, μαστίγων ὑπέστης πεῖραν, καὶ ἐπὶ ξύλου ταθείς, σπαραγμοὺς παμμάκαρ ἐκαρτέρησας· ὑφʼ ὧν συντριβόμενος, καὶ λαμπάσι φλεγόμενος, σταυρῷ ὑψώθης, τιτρωσκόμενος βέλεσι, καὶ τὰ ὄμματα, ὑπʼ αὐτῶν ἐκτυφλούμενος· ὅθεν σε μακαρίζομεν, καλῶς ἐναθλήσαντα, καὶ οὐρανίων στεφάνων, ἐπιτυχόντα Θεόδωρε. Χριστὸν ἐκδυσώπει, ταῖς ψυχαῖς ἡμῶν δοθῆναι, τὸ μέγα ἔλεος.
ltx/gr_gr_cog/me.m02.d08:meVE.Stichera04.greekmelody	@ltx/gr_gr_cog/he.a.m8:heAU.TiYmasKalesomen.greekname
ltx/gr_gr_cog/me.m02.d08:meVE.Stichera04.incipit	Ἔχων πολιτείαν ἰσάγγελον, τοῖς Ἀγγέλοις…
ltx/gr_gr_cog/me.m02.d08:meVE.Stichera04.melody	@ltx/gr_gr_cog/he.a.m8:heAU.TiYmasKalesomen.name
ltx/gr_gr_cog/me.m02.d08:meVE.Stichera04.mode	@ltx/gr_gr_cog/miscellanea:misc.Mode8
ltx/gr_gr_cog/me.m02.d08:meVE.Stichera04.text	Ἔχων πολιτείαν ἰσάγγελον, τοῖς Ἀγγέλοις θεοφάντορ, συνωμίλεις προφανῶς, διʼ αὐτῶν τὰ ὑπὲρ νοῦν καταλαμπόμενος τὸν νοῦν, συμβόλων, θαυμασίων ἀνακάθαρσιν, μεγάλων, Μυστηρίων ἀποκάλυψιν, προφητικὴν προαγόρευσιν, πνευματικὴν ἀνακαίνισιν. Ἱκέτευε, τοῦ σωθῆναι τὰς ψυχὰς ἡμῶν.
ltx/gr_gr_cog/me.m02.d08:meVE.Stichera05.incipit	Ἄγγελος ἐφάνης ἐπίγειος, ἐπὶ γῆς…
ltx/gr_gr_cog/me.m02.d08:meVE.Stichera05.melody	@ltx/gr_gr_cog/he.a.m8:heAU.TiYmasKalesomen.name
ltx/gr_gr_cog/me.m02.d08:meVE.Stichera05.mode	@ltx/gr_gr_cog/miscellanea:misc.Mode8
ltx/gr_gr_cog/me.m02.d08:meVE.Stichera05.text	Ἄγγελος ἐφάνης ἐπίγειος, ἐπὶ γῆς τοὺς οὐρανίους, συλλαλοῦντας ἐσχηκώς, θεωρὸς ὑπερκοσμίων, θεαμάτων γεγονώς. Λυχνία, νοητὸν φῶς ἀπαστράπτουσα. Ἐλαία, ψαλμικῶς εἰπεῖν κατάκαρπος, θεουργικὴν ἀποστάζουσα, τοῖς εὐσεβέσι πιότητα· Ἱκέτευε, τοῦ σωθῆναι τὰς ψυχὰς ἡμῶν.
ltx/gr_gr_cog/me.m02.d08:meVE.Stichera06.incipit	Τῆς ἐλπιζομένης θεώσεως, ἀπολαύων ὡς…
ltx/gr_gr_cog/me.m02.d08:meVE.Stichera06.melody	@ltx/gr_gr_cog/he.a.m8:heAU.TiYmasKalesomen.name
ltx/gr_gr_cog/me.m02.d08:meVE.Stichera06.mode	@ltx/gr_gr_cog/miscellanea:misc.Mode8
ltx/gr_gr_cog/me.m02.d08:meVE.Stichera06.text	Τῆς ἐλπιζομένης θεώσεως, ἀπολαύων ὡς Προφήτης, ἀληθέστατος Θεοῦ, καὶ τρανῶς τῆς ἀϊδίου, ἐμπιπλάμενος τρυφῆς, καὶ δόξαν ἀνεκλάλητον θεώμενος, καὶ κάλλους διαδήματι κοσμούμενος, ὑπὲρ ἡμῶν τῶν ὑμνούντων σε, δυσώπησον ἐκτενέστερον, θεόληπτε, τοῦ σωθῆναι τὰς ψυχὰς ἡμῶν.
