ltx/gr_gr_cog/le.ep.mc.d254:lemcLI.Epistle.book_abbr	@ltx/gr_gr_cog/bible:Philippians.abbr
ltx/gr_gr_cog/le.ep.mc.d254:lemcLI.Epistle.book_string	@ltx/gr_gr_cog/bible:Philippians.text
ltx/gr_gr_cog/le.ep.mc.d254:lemcLI.Epistle.chapverse	2:12 – 16
ltx/gr_gr_cog/le.ep.mc.d254:lemcLI.Epistle.incipit	Καθὼς πάντοτε ὑπηκούσατε…
ltx/gr_gr_cog/le.ep.mc.d254:lemcLI.Epistle.text	Ἀδελφοί, καθὼς πάντοτε ὑπηκούσατε, μὴ ὡς ἐν τῇ παρουσίᾳ μου μόνον, ἀλλὰ νῦν πολλῷ μᾶλλον ἐν τῇ ἀπουσίᾳ μου, μετὰ φόβου καὶ τρόμου τὴν ἑαυτῶν σωτηρίαν κατεργάζεσθε· ὁ Θεὸς γάρ ἐστιν ὁ ἐνεργῶν ἐν ὑμῖν καὶ τὸ θέλειν καὶ τὸ ἐνεργεῖν ὑπὲρ τῆς εὐδοκίας. πάντα ποιεῖτε χωρὶς γογγυσμῶν καὶ διαλογισμῶν, ἵνα γένησθε ἄμεμπτοι καὶ ἀκέραιοι, τέκνα Θεοῦ ἀμώμητα ἐν μέσῳ γενεᾶς σκολιᾶς καὶ διεστραμμένης, ἐν οἷς φαίνεσθε ὡς φωστῆρες ἐν κόσμῳ, λόγον ζωῆς ἐπέχοντες, εἰς καύχημα ἐμοὶ εἰς ἡμέραν Χριστοῦ.
ltx/gr_gr_cog/le.ep.mc.d254:lemcLI.Epistle.title	Τῇ Δευτέρᾳ τῆς Κʹ Ἑβδομάδος
ltx/gr_gr_cog/le.ep.mc.d254:lemcLI.Epistle.title_abbr	Δευτέρᾳ τῆς Κʹ Ἑβδομάδος
ltx/gr_gr_cog/le.ep.mc.d254:lemcLI.Epistle.version	@ltx/gr_gr_cog/properties:version.designation
