ltx/gr_gr_cog/sy.m04.d26:cl.syMA.commemoration01.text	[saint/com 1]
ltx/gr_gr_cog/sy.m04.d26:cl.syMA.commemoration02.text	[saint/com 2]
ltx/gr_gr_cog/sy.m04.d26:cl.syMA.commemoration03.text	[saint/com 3]
ltx/gr_gr_cog/sy.m04.d26:cl.syMA.commemoration04.text	[saint/com 4]
ltx/gr_gr_cog/sy.m04.d26:cl.syMA.commemoration05.text	[saint/com 5]
ltx/gr_gr_cog/sy.m04.d26:cl.syMA.commemoration06.text	[saint/com list]
ltx/gr_gr_cog/sy.m04.d26:syMA.commemoration01.couplet1.title	@ltx/gr_gr_cog/titles:ti.Verses
ltx/gr_gr_cog/sy.m04.d26:syMA.commemoration01.couplet1.verse1	Τμηθείς, Βασιλεῦ, βασιλεὺς πόλου γίνῃ,
ltx/gr_gr_cog/sy.m04.d26:syMA.commemoration01.couplet1.verse2	Ἐξ αἱμάτων σῶν βάμμα κόκκινον φέρων.
ltx/gr_gr_cog/sy.m04.d26:syMA.commemoration01.narration.p01	Ὁ ἔνδοξος Μάρτυς τοῦ Χριστοῦ Βασιλεύς, Ἐπίσκοπος ἦν τῆς ἐν Ἀμασείᾳ Μητροπόλεως, κατὰ τοὺς χρόνους Λικινίου, ὃς δὴ τοῦ μεγάλου Κωνσταντίνου ἐπὶ Κωνσταντίνῃ τῇ ἀδελφῇ αὐτοῦ γαμβρὸς ὤν, ἐξεπέμφθη παρʼ αὐτοῦ κατὰ Μαξιμίνου ἐπαναστάντος, καί τινα μέρη τῶν κατὰ τὴν Ἀνατολὴν κατασχόντος καὶ τυραννήσαντος. Κατὰ τὴν Νικομήδειαν οὖν γενόμενος ὁ Λικίνιος, ἐπεὶ τὰ τῆς ἐπαναστάσεως λέλυτο, τοῦ τυράννου ἀπογνόντος τὴν διὰ μάχης ἀντίστασιν καὶ τὸν κατὰ χεῖρα κίνδυνον ἐκφυγόντος, αὐτὸς ἐν Νικομηδείᾳ τοῖς εἰδώλοις προσῆγε θυσίας, καὶ τὸν Ἅγιον Βασιλέα ἐξ Ἀμασείας, μετὰ κόρης τινός, Γλαφύρας προσαγορευομένης, ἀχθῆναι προσέταξεν. Ἡ δὲ Γλαφύρα αὕτη, θεράπαινα οὖσα Κωνσταντίνης τῆς γαμετῆς Λικινίου, ἐπεὶ τὸν Λικίνιον ἐπιμανέντα αὐτῇ καὶ ἐπιλυττήσαντα ᾔσθετο, τοῦτο ἀναθεμένη τῇ κυρίᾳ αὐτῆς, μετὰ χρημάτων παρʼ αὐτῆς εἰς Ἀνατολὴν πέμπεται· καὶ τόπους ἐκ τόπων ἀμείψασα, εἰς τὴν Ἀμάσειαν καταντᾷ.
ltx/gr_gr_cog/sy.m04.d26:syMA.commemoration01.narration.p02	Τοῦτο οὖν πυθόμενος ὁ Λικίνιος καὶ ὅτι τὸ ἐπιφερόμενον παρʼ αὐτῆς χρυσίον εἰς οἰκοδομὴν Ἐκκλησίας τῷ Ἐπισκόπῳ δέδωκε, ἀμφοτέρους συλληφθῆναι καὶ πρὸς αὐτὸν ἀχθῆναι ἐκέλευσεν. Ἀλλʼ ἡ μὲν Γλαφύρα τὸν βίον ἔφθη λιποῦσα· ὁ δὲ μακάριος ἐπίσκοπος Βασιλεὺς ἐν Νικομηδείᾳ πρὸς τὸν βασιλέα ἤχθη, καὶ τὴν διὰ ξίφους ἀπόφασιν δέχεται, ἀντειπὼναὐτῷ ἱκανῶς καὶ τῆς ταλαιπωρίας τῶν νομιζομένων θεῶν καὶ τῆς αὐτῶν ματαιότητος καταπτύσας. Τέμνεται οὖν τὸν αὐχένα· καὶ ἐν πλοίῳ βληθείς, τῇ θαλάσσῃ ἐκδίδοται, τῆς μὲν κεφαλῆς ῥιφείσης ἐν αὐτῇ ἐκ τοῦ ἑνὸς μέρους τοῦ πλοίου, τοῦ δὲ σώματος ἐκ τοῦ ἑτέρου, ἃ καὶ συνῆλθον αὖθις, κατὰ τὴν φυσικὴν ἁρμονίαν· καὶ εὑρέθη σῶος ὁ Ἅγιος ἐν τῷ κατὰ Σινώπην κόλπῳ, ἁλιευόντων τινῶν καὶ σαγήνην καθιέντων καὶ πρὸς τὴν χέρσον ἑλκυσάντων αὐτόν, καθὼς ἐπιστὰς Ἄγγελος Ἐλπιδοφόρῳ, τῷ πρώτῳ ὑποδεξαμένῳ τὸν Ἅγιον ἐν Νικομηδείᾳ, εἶπεν· ὃς καὶ παραγενόμενος ἅμα Θεοτίμῳ καὶ Παρθενίῳ τοῖς Διακόνοις, οἳ ἐξ Ἀμασείας σὺν τῷ Ἁγίῳ παρεγένοντο, ἑλκυσθέντα αὐτὸν ἀπὸ τῆς σαγήνης ἔλαβον· καὶ μύροις καὶ ᾠδαῖς τιμήσαντες, εἰς τὴν Ἀμάσειαν παρέπεμψαν.
ltx/gr_gr_cog/sy.m04.d26:syMA.commemoration01.single1	Εἰκάδα ἀμφʼ ἕκτην Βασιλεὺς ξίφει αὐχένα κάρθη.
ltx/gr_gr_cog/sy.m04.d26:syMA.commemoration01.text	Τῇ ΚϚʹ τοῦ αὐτοῦ μηνός, μνήμη τοῦ Ἁγίου Ἱερομάρτυρος Βασιλέως, Ἐπισκόπου Ἀμασείας.
ltx/gr_gr_cog/sy.m04.d26:syMA.commemoration02.couplet1.title	@ltx/gr_gr_cog/titles:ti.Verses
ltx/gr_gr_cog/sy.m04.d26:syMA.commemoration02.couplet1.verse1	Θεὸν Γλαφύρα ψυχικῶν διʼ ὀμμάτων,
ltx/gr_gr_cog/sy.m04.d26:syMA.commemoration02.couplet1.verse2	οὐ γλαφυρῶς νῦν, ἀλλὰ τηλαυγῶς βλέπει.
ltx/gr_gr_cog/sy.m04.d26:syMA.commemoration02.text	Τῇ αὐτῇ ἡμέρᾳ, ἡ Ἁγία Γλαφύρα ἐν εἰρήνῃ τελειοῦται.
ltx/gr_gr_cog/sy.m04.d26:syMA.commemoration03.couplet1.title	@ltx/gr_gr_cog/titles:ti.Verses
ltx/gr_gr_cog/sy.m04.d26:syMA.commemoration03.couplet1.verse1	Τρόπον σελήνης πλησιφαοῦς Ἰοῦσταν,
ltx/gr_gr_cog/sy.m04.d26:syMA.commemoration03.couplet1.verse2	Λάμψασαν ἔργοις, μνήματος κρύπτει νέφος.
ltx/gr_gr_cog/sy.m04.d26:syMA.commemoration03.text	Τῇ αὐτῇ ἡμέρᾳ, ἡ Ὁσία Ἰοῦστα ἐν εἰρήνῃ τελειοῦται.
ltx/gr_gr_cog/sy.m04.d26:syMA.commemoration04.couplet1.title	@ltx/gr_gr_cog/titles:ti.Verses
ltx/gr_gr_cog/sy.m04.d26:syMA.commemoration04.couplet1.verse1	Τοὺς οὐρανοὺς ἱδρῶσι Νέστωρ ἐπρίω,
ltx/gr_gr_cog/sy.m04.d26:syMA.commemoration04.couplet1.verse2	Διʼ οὓς φύσιν τύραννον ἠρνήσω θέσει.
ltx/gr_gr_cog/sy.m04.d26:syMA.commemoration04.text	Τῇ αὐτῇ ἡμέρᾳ, ὁ Ὅσιος Νέστωρ, τοὺς γονεῖς καταλιπὼν καὶ μονάσας, ἐν εἰρήνῃ τελειοῦται.
ltx/gr_gr_cog/sy.m04.d26:syMA.lastline	Ταῖς τῶν σῶν Ἁγίων πρεσβείαις, ὁ Θεός, ἐλέησον ἡμᾶς. Ἀμήν.
