ltx/gr_gr_cog/le.go.mc.d223:lemcLI.Gospel.book_abbr	@ltx/gr_gr_cog/bible:Mark.abbr
ltx/gr_gr_cog/le.go.mc.d223:lemcLI.Gospel.book_string	@ltx/gr_gr_cog/bible:Mark.text
ltx/gr_gr_cog/le.go.mc.d223:lemcLI.Gospel.chapverse	6:45 – 53
ltx/gr_gr_cog/le.go.mc.d223:lemcLI.Gospel.incipit	Ἠνάγκασεν ὁ Ἰησοῦς τοὺς μαθητὰς αὐτοῦ…
ltx/gr_gr_cog/le.go.mc.d223:lemcLI.Gospel.text	Τῷ καιρῷ ἐκείνῳ, ἠνάγκασεν ὁ Ἰησοῦς τοὺς μαθητὰς αὐτοῦ ἐμβῆναι εἰς τὸ πλοῖον καὶ προάγειν εἰς τὸ πέραν πρὸς Βηθσαϊδάν, ἕως αὐτὸς ἀπολύσῃ τὸν ὄχλον· καὶ ἀποταξάμενος αὐτοῖς ἀπῆλθεν εἰς τὸ ὄρος προσεύξασθαι. καὶ ὀψίας γενομένης ἦν τὸ πλοῖον ἐν μέσῳ τῆς θαλάσσης, καὶ αὐτὸς μόνος ἐπὶ τῆς γῆς. καὶ ἰδὼν αὐτοὺς βασανιζομένους ἐν τῷ ἐλαύνειν· ἦν γὰρ ὁ ἄνεμος ἐναντίος αὐτοῖς· καὶ περὶ τετάρτην φυλακὴν τῆς νυκτὸς ἔρχεται πρὸς αὐτοὺς περιπατῶν ἐπὶ τῆς θαλάσσης, καὶ ἤθελε παρελθεῖν αὐτούς. οἱ δὲ ἰδόντες αὐτὸν περιπατοῦντα ἐπὶ τῆς θαλάσσης ἔδοξαν φάντασμα εἶναι, καὶ ἀνέκραξαν· πάντες γὰρ αὐτὸν εἶδον καὶ ἐταράχθησαν. καὶ εὐθέως ἐλάλησε μετ᾿ αὐτῶν καὶ λέγει αὐτοῖς· θαρσεῖτε, ἐγώ εἰμι, μὴ φοβεῖσθε. καὶ ἀνέβη εἰς τὸ πλοῖον πρὸς αὐτούς, καὶ ἐκόπασεν ὁ ἄνεμος· καὶ λίαν ἐκ περισσοῦ ἐν ἑαυτοῖς ἐξίσταντο καὶ ἐθαύμαζον. οὐ γὰρ συνῆκαν ἐπὶ τοῖς ἄρτοις, ἀλλ᾿ ἦν αὐτῶν ἡ καρδία πεπωρωμένη. Καὶ διαπεράσαντες ἀπῆλθον ἐπὶ τὴν γῆν Γεννησαρέτ.
ltx/gr_gr_cog/le.go.mc.d223:lemcLI.Gospel.title	Τῇ Παρασκευῇ τῆς ΙΕʹ Ἑβδομάδος τοῦ Ματθαίου
ltx/gr_gr_cog/le.go.mc.d223:lemcLI.Gospel.title_abbr	Παρασκευῇ τῆς ΙΕʹ Ἑβδομάδος
ltx/gr_gr_cog/le.go.mc.d223:lemcLI.Gospel.version	@ltx/gr_gr_cog/properties:version.designation
