ltx/gr_gr_cog/le.ep.mc.d010:lemcLI.Epistle.book_abbr	@ltx/gr_gr_cog/bible:John1.abbr
ltx/gr_gr_cog/le.ep.mc.d010:lemcLI.Epistle.book_string	@ltx/gr_gr_cog/bible:John1.text
ltx/gr_gr_cog/le.ep.mc.d010:lemcLI.Epistle.chapverse	3:9 – 22
ltx/gr_gr_cog/le.ep.mc.d010:lemcLI.Epistle.incipit	Πᾶς ὁ γεγεννημένος ἐκ τοῦ Θεοῦ…
ltx/gr_gr_cog/le.ep.mc.d010:lemcLI.Epistle.text	Ἀδελφοί, πᾶς ὁ γεγεννημένος ἐκ τοῦ Θεοῦ ἁμαρτίαν οὐ ποιεῖ, ὅτι σπέρμα αὐτοῦ ἐν αὐτῷ μένει· καὶ οὐ δύναται ἁμαρτάνειν, ὅτι ἐκ τοῦ Θεοῦ γεγέννηται. ἐν τούτῳ φανερά ἐστι τὰ τέκνα τοῦ Θεοῦ καὶ τὰ τέκνα τοῦ διαβόλου. πᾶς ὁ μὴ ποιῶν δικαιοσύνην οὐκ ἔστιν ἐκ τοῦ Θεοῦ, καὶ ὁ μὴ ἀγαπῶν τὸν ἀδελφόν αὐτοῦ. ὅτι αὕτη ἐστὶν ἡ ἀγγελία ἣν ἠκούσατε ἀπ᾿ ἀρχῆς, ἵνα ἀγαπῶμεν ἀλλήλους, οὐ καθὼς Κάϊν ἐκ τοῦ πονηροῦ ἦν καὶ ἔσφαξε τὸν ἀδελφὸν αὐτοῦ· καὶ χάριν τίνος ἔσφαξεν αὐτόν; ὅτι τὰ ἔργα αὐτοῦ πονηρὰ ἦν, τὰ δὲ τοῦ ἀδελφοῦ αὐτοῦ δίκαια. Μὴ θαυμάζετε, ἀδελφοί μου, εἰ μισεῖ ὑμᾶς ὁ κόσμος. ἡμεῖς οἴδαμεν ὅτι μεταβεβήκαμεν ἐκ τοῦ θανάτου εἰς τὴν ζωήν, ὅτι ἀγαπῶμεν τοὺς ἀδελφούς· ὁ μὴ ἀγαπῶν τὸν ἀδελφὸν μένει ἐν τῷ θανάτῳ. πᾶς ὁ μισῶν τὸν ἀδελφὸν αὐτοῦ ἀνθρωποκτόνος ἐστί, καὶ οἴδατε ὅτι πᾶς ἀνθρωποκτόνος οὐκ ἔχει ζωὴν αἰώνιον ἐν ἑαυτῷ μένουσαν. ἐν τούτῳ ἐγνώκαμεν τὴν ἀγάπην, ὅτι ἐκεῖνος ὑπὲρ ἡμῶν τὴν ψυχὴν αὐτοῦ ἔθηκε· καὶ ἡμεῖς ὀφείλομεν ὑπὲρ τῶν ἀδελφῶν τὰς ψυχὰς τιθέναι. ὃς δ᾿ ἂν ἔχῃ τὸν βίον τοῦ κόσμου καὶ θεωρῇ τὸν ἀδελφὸν αὐτοῦ χρείαν ἔχοντα καὶ κλείσῃ τὰ σπλάγχνα αὐτοῦ ἀπ᾿ αὐτοῦ, πῶς ἡ ἀγάπη τοῦ Θεοῦ μένει ἐν αὐτῷ; Τεκνία μου, μὴ ἀγαπῶμεν λόγῳ μηδὲ τῇ γλώσσῃ, ἀλλ᾿ ἐν ἔργῳ καὶ ἀληθείᾳ. καὶ ἐν τούτῳ γινώσκομεν ὅτι ἐκ τῆς ἀληθείας ἐσμέν, καὶ ἔμπροσθεν αὐτοῦ πείσομεν τὰς καρδίας ἡμῶν, ὅτι ἐὰν καταγινώσκῃ ἡμῶν ἡ καρδία, ὅτι μείζων ἐστὶν ὁ Θεὸς τῆς καρδίας ἡμῶν καὶ γινώσκει πάντα. ἀγαπητοί, ἐὰν ἡ καρδία ἡμῶν μὴ καταγινώσκῃ ἡμῶν, παρρησίαν ἔχομεν πρὸς τὸν Θεόν, καὶ ὃ ἐὰν αἰτῶμεν λαμβάνομεν παρ᾿ αὐτοῦ.
ltx/gr_gr_cog/le.ep.mc.d010:lemcLI.Epistle.title	Τῇ Τρίτῃ τῆς ΛΕʹ Ἑβδομάδος
ltx/gr_gr_cog/le.ep.mc.d010:lemcLI.Epistle.title_abbr	Τρίτῃ ΛΕʹ Ἑβδομάδος
ltx/gr_gr_cog/le.ep.mc.d010:lemcLI.Epistle.version	@ltx/gr_gr_cog/properties:version.designation
