ltx/gr_gr_cog/le.go.me.m07.d08:lemeLI.Gospel.book_abbr	@ltx/gr_gr_cog/bible:Luke.abbr
ltx/gr_gr_cog/le.go.me.m07.d08:lemeLI.Gospel.book_string	@ltx/gr_gr_cog/bible:Luke.text
ltx/gr_gr_cog/le.go.me.m07.d08:lemeLI.Gospel.chapverse	6:17 – 19, 9:1 – 2, 10:16 – 22
ltx/gr_gr_cog/le.go.me.m07.d08:lemeLI.Gospel.incipit	Ἦλθε πρὸς τὸν Ἰησοῦν ὄχλος μαθητῶν αὐτοῦ…
ltx/gr_gr_cog/le.go.me.m07.d08:lemeLI.Gospel.text	Τῷ καιρῷ ἐκείνῳ, ἦλθε πρὸς τὸν Ἰησοῦν ὄχλος μαθητῶν αὐτοῦ, καὶ πλῆθος πολὺ τοῦ λαοῦ ἀπὸ πάσης τῆς Ἰουδαίας καὶ Ἱερουσαλὴμ καὶ τῆς παραλίου Τύρου καὶ Σιδῶνος, οἳ ἦλθον ἀκοῦσαι αὐτοῦ καὶ ἰαθῆναι ἀπὸ τῶν νόσων αὐτῶν, καὶ οἱ ὀχλούμενοι ἀπὸ πνευμάτων ἀκαθάρτων, καὶ ἐθεραπεύοντο· καὶ πᾶς ὁ ὄχλος ἐζήτει ἅπτεσθαι αὐτοῦ, ὅτι δύναμις παρ᾿ αὐτοῦ ἐξήρχετο καὶ ἰᾶτο πάντας. Συγκαλεσάμενος δὲ τοὺς δώδεκα μαθητὰς αὐτοῦ ἔδωκεν αὐτοῖς δύναμιν καὶ ἐξουσίαν ἐπὶ πάντα τὰ δαιμόνια καὶ νόσους θεραπεύειν· καὶ ἀπέστειλεν αὐτοὺς κηρύσσειν τὴν βασιλείαν τοῦ Θεοῦ καὶ ἰᾶσθαι τοὺς ἀσθενοῦντας. Καὶ ἔλεγεν αὐτοῖς· Ὁ ἀκούων ὑμῶν ἐμοῦ ἀκούει, καὶ ὁ ἀθετῶν ὑμᾶς ἐμὲ ἀθετεῖ· ὁ δὲ ἐμὲ ἀθετῶν ἀθετεῖ τὸν ἀποστείλαντά με. Ὑπέστρεψαν δὲ οἱ ἑβδομήκοντα μετὰ χαρᾶς λέγοντες· Κύριε, καὶ τὰ δαιμόνια ὑποτάσσεται ἡμῖν ἐν τῷ ὀνόματί σου. Εἶπε δὲ αὐτοῖς· ἐθεώρουν τὸν σατανᾶν ὡς ἀστραπὴν ἐκ τοῦ οὐρανοῦ πεσόντα. ἰδοὺ δίδωμι ὑμῖν τὴν ἐξουσίαν τοῦ πατεῖν ἐπάνω ὄφεων καὶ σκορπίων καὶ ἐπὶ πᾶσαν τὴν δύναμιν τοῦ ἐχθροῦ, καὶ οὐδὲν ὑμᾶς οὐ μὴ ἀδικήσῃ. πλὴν ἐν τούτῳ μὴ χαίρετε, ὅτι τὰ πνεύματα ὑμῖν ὑποτάσσεται· χαίρετε δὲ ὅτι τὰ ὀνόματα ὑμῶν ἐγράφη ἐν τοῖς οὐρανοῖς. Ἐν αὐτῇ τῇ ὥρᾳ ἠγαλλιάσατο τῷ πνεύματι ὁ Ἰησοῦς καὶ εἶπεν· ἐξομολογοῦμαί σοι, πάτερ, κύριε τοῦ οὐρανοῦ καὶ τῆς γῆς, ὅτι ἀπέκρυψας ταῦτα ἀπὸ σοφῶν καὶ συνετῶν, καὶ ἀπεκάλυψας αὐτὰ νηπίοις· ναί, ὁ πατήρ, ὅτι οὕτως ἐγένετο εὐδοκία ἔμπροσθέν σου. καὶ στραφεὶς πρὸς τοὺς μαθητὰς εἶπε· πάντα μοι παρεδόθη ὑπὸ τοῦ πατρός μου· καὶ οὐδεὶς ἐπιγινώσκει τίς ἐστιν ὁ υἱός, εἰ μὴ ὁ πατήρ, καὶ τίς ἐστιν ὁ πατήρ, εἰ μὴ ὁ υἱὸς καὶ ᾧ ἐὰν βούληται ὁ υἱὸς ἀποκαλύψαι.
ltx/gr_gr_cog/le.go.me.m07.d08:lemeLI.Gospel.title	Τοῦ Ἁγίου
ltx/gr_gr_cog/le.go.me.m07.d08:lemeLI.Gospel.title_abbr	Τοῦ Ἁγίου
ltx/gr_gr_cog/le.go.me.m07.d08:lemeLI.Gospel.version	@ltx/gr_gr_cog/properties:version.designation
