ltx/gr_gr_cog/le.go.me.m01.d01:lemeLI.Gospel.book_abbr	@ltx/gr_gr_cog/bible:Luke.abbr
ltx/gr_gr_cog/le.go.me.m01.d01:lemeLI.Gospel.book_string	@ltx/gr_gr_cog/bible:Luke.text
ltx/gr_gr_cog/le.go.me.m01.d01:lemeLI.Gospel.chapverse	2:20 – 21, 40 – 52
ltx/gr_gr_cog/le.go.me.m01.d01:lemeLI.Gospel.incipit	Ὑπέστρεψαν οἱ ποιμένες δοξάζοντες καὶ αἰνοῦντες…
ltx/gr_gr_cog/le.go.me.m01.d01:lemeLI.Gospel.text	Τῷ καιρῷ ἐκείνῳ, ὑπέστρεψαν οἱ ποιμένες δοξάζοντες καὶ αἰνοῦντες τὸν Θεὸν ἐπὶ πᾶσιν οἷς ἤκουσαν καὶ εἶδον καθὼς ἐλαλήθη πρὸς αὐτούς. Καὶ ὅτε ἐπλήσθησαν αἱ ἡμέραι ὀκτὼ τοῦ περιτεμεῖν τὸ παιδίον, καὶ ἐκλήθη τὸ ὄνομα αὐτοῦ Ἰησοῦς, τὸ κληθὲν ὑπὸ τοῦ ἀγγέλου πρὸ τοῦ συλληφθῆναι αὐτὸν ἐν τῇ κοιλίᾳ. Τὸ δὲ παιδίον ηὔξανε καὶ ἐκραταιοῦτο πνεύματι πληρούμενον σοφίας, καὶ χάρις Θεοῦ ἦν ἐπ᾿ αὐτό. Καὶ ἐπορεύοντο οἱ γονεῖς αὐτοῦ κατ᾿ ἔτος εἰς Ἱερουσαλὴμ τῇ ἑορτῇ τοῦ πάσχα. καὶ ὅτε ἐγένετο ἐτῶν δώδεκα, ἀναβάντων αὐτῶν εἰς Ἱεροσόλυμα κατὰ τὸ ἔθος τῆς ἑορτῆς καὶ τελειωσάντων τὰς ἡμέρας, ἐν τῷ ὑποστρέφειν αὐτοὺς ὑπέμεινεν Ἰησοῦς ὁ παῖς ἐν Ἱερουσαλήμ, καὶ οὐκ ἔγνω Ἰωσὴφ καὶ ἡ μήτηρ αὐτοῦ. νομίσαντες δὲ αὐτὸν ἐν τῇ συνοδίᾳ εἶναι ἦλθον ἡμέρας ὁδὸν καὶ ἀνεζήτουν αὐτὸν ἐν τοῖς συγγενέσι καὶ ἐν τοῖς γνωστοῖς· καὶ μὴ εὑρόντες αὐτὸν ὑπέστρεψαν εἰς Ἱερουσαλὴμ ζητοῦντες αὐτόν. καὶ ἐγένετο μεθ᾿ ἡμέρας τρεῖς εὗρον αὐτὸν ἐν τῷ ἱερῷ καθεζόμενον ἐν μέσῳ τῶν διδασκάλων καὶ ἀκούοντα αὐτῶν καὶ ἐπερωτῶντα αὐτούς· ἐξίσταντο δὲ πάντες οἱ ἀκούοντες αὐτοῦ ἐπὶ τῇ συνέσει καὶ ταῖς ἀποκρίσεσιν αὐτοῦ. καὶ ἰδόντες αὐτὸν ἐξεπλάγησαν, καὶ πρὸς αὐτὸν ἡ μήτηρ αὐτοῦ εἶπε· τέκνον, τί ἐποίησας ἡμῖν οὕτως; ἰδοὺ ὁ πατήρ σου κἀγὼ ὀδυνώμενοι ἐζητοῦμέν σε. καὶ εἶπε πρὸς αὐτούς· τί ὅτι ἐζητεῖτέ με; οὐκ ᾔδειτε ὅτι ἐν τοῖς τοῦ πατρός μου δεῖ εἶναί με; καὶ αὐτοὶ οὐ συνῆκαν τὸ ῥῆμα ὃ ἐλάλησεν αὐτοῖς. καὶ κατέβη μετ᾿ αὐτῶν καὶ ἦλθεν εἰς Ναζαρέτ, καὶ ἦν ὑποτασσόμενος αὐτοῖς. καὶ ἡ μήτηρ αὐτοῦ διετήρει πάντα τὰ ῥήματα ταῦτα ἐν τῇ καρδίᾳ αὐτῆς. Καὶ Ἰησοῦς προέκοπτε σοφίᾳ καὶ ἡλικίᾳ καὶ χάριτι παρὰ Θεῷ καὶ ἀνθρώποις.
ltx/gr_gr_cog/le.go.me.m01.d01:lemeLI.Gospel.title	Τῆς Ἑορτῆς
ltx/gr_gr_cog/le.go.me.m01.d01:lemeLI.Gospel.title_abbr	Τῆς Ἑορτῆς
ltx/gr_gr_cog/le.go.me.m01.d01:lemeLI.Gospel.version	@ltx/gr_gr_cog/properties:version.designation
ltx/gr_gr_cog/le.go.me.m01.d01:lemeMA.Gospel.book_abbr	@ltx/gr_gr_cog/le.go.ge.hierarch:legeMA.Gospel.book_abbr
ltx/gr_gr_cog/le.go.me.m01.d01:lemeMA.Gospel.book_string	@ltx/gr_gr_cog/le.go.ge.hierarch:legeMA.Gospel.book_string
ltx/gr_gr_cog/le.go.me.m01.d01:lemeMA.Gospel.chapverse	@ltx/gr_gr_cog/le.go.ge.hierarch:legeMA.Gospel.chapverse
ltx/gr_gr_cog/le.go.me.m01.d01:lemeMA.Gospel.incipit	@ltx/gr_gr_cog/le.go.ge.hierarch:legeMA.Gospel.incipit
ltx/gr_gr_cog/le.go.me.m01.d01:lemeMA.Gospel.text	@ltx/gr_gr_cog/le.go.ge.hierarch:legeMA.Gospel.text
ltx/gr_gr_cog/le.go.me.m01.d01:lemeMA.Gospel.title	Τοῦ Ἁγίου
ltx/gr_gr_cog/le.go.me.m01.d01:lemeMA.Gospel.title_abbr	Τοῦ Ἁγίου
ltx/gr_gr_cog/le.go.me.m01.d01:lemeMA.Gospel.version	@ltx/gr_gr_cog/le.go.ge.hierarch:legeMA.Gospel.version
