ltx/gr_gr_cog/me.m06.d28:meDA.commemoration.first	Ἀνακομιδὴ τῶν Λειψάνων τῶν Ἁγίων Ἀναργύρων Κύρου καὶ Ἰωάννου
ltx/gr_gr_cog/me.m06.d28:meDA.commemoration.first_name	
ltx/gr_gr_cog/me.m06.d28:meDA.commemoration.first_short	Ἀνακομιδὴ τῶν Λειψάνων τῶν Ἁγίων Ἀναργύρων Κύρου καὶ Ἰωάννου
ltx/gr_gr_cog/me.m06.d28:meDA.commemoration.first_title	@ltx/gr_gr_cog/titles:ti.Saints
ltx/gr_gr_cog/me.m06.d28:meDA.commemoration.full	Μνήμη τῆς Ἀνακομιδῆς τῶν Λειψάνων τῶν Ἁγίων καὶ Θαυματουργῶν Ἀναργύρων, Κύρου καὶ Ἰωάννου
ltx/gr_gr_cog/me.m06.d28:meDA.commemoration.second_name	
ltx/gr_gr_cog/me.m06.d28:meDA.commemoration.second_title	
ltx/gr_gr_cog/me.m06.d28:meDA.date	Τῌ ΚΗʹ ΙΟΥΝΙΟΥ
ltx/gr_gr_cog/me.m06.d28:meDA.dismissal	
ltx/gr_gr_cog/me.m06.d28:meDA.fordate	διὰ τὴν 28ην Ἰουνίου
ltx/gr_gr_cog/me.m06.d28:meDA.insert1	καὶ τῆς Ἀνακομιδῆς τῶν Λειψάνων τῶν Ἁγίων καὶ θαυματουργῶν Ἀναργύρων, Κύρου καὶ Ἰωάννου,
ltx/gr_gr_cog/me.m06.d28:meDA.insert2	ὧν καὶ τὴν μνήμην ἐπιτελοῦμεν·
ltx/gr_gr_cog/me.m06.d28:meDA.note	
ltx/gr_gr_cog/me.m06.d28:meDA.pdfcoverdate	τῆς 28ης Ἰουνίου,
ltx/gr_gr_cog/me.m06.d28:meDA.pdfheaderdate	τῆς 28ης Ἰουνίου
ltx/gr_gr_cog/me.m06.d28:meHO.commemorations	
ltx/gr_gr_cog/me.m06.d28:meHO.note1	
ltx/gr_gr_cog/me.m06.d28:meHO.note2	
ltx/gr_gr_cog/me.m06.d28:meHO.number	
ltx/gr_gr_cog/me.m06.d28:meHO.rank	
ltx/gr_gr_cog/me.m06.d28:meLE.commemoration1	Ἀνακομιδὴ τῶν Λειψάνων τῶν Ἁγίων καὶ Θαυματουργῶν Ἀναργύρων Κύρου καὶ Ἰωάννου.
ltx/gr_gr_cog/me.m06.d28:meLE.commemoration2	
ltx/gr_gr_cog/me.m06.d28:meLI.Kontakion1.greekmelody	@ltx/gr_gr_cog/me.m06.d28:meMA.Kontakion1.greekmelody
ltx/gr_gr_cog/me.m06.d28:meLI.Kontakion1.incipit	@ltx/gr_gr_cog/me.m06.d28:meMA.Kontakion1.incipit
ltx/gr_gr_cog/me.m06.d28:meLI.Kontakion1.melody	@ltx/gr_gr_cog/me.m06.d28:meMA.Kontakion1.melody
ltx/gr_gr_cog/me.m06.d28:meLI.Kontakion1.mode	@ltx/gr_gr_cog/me.m06.d28:meMA.Kontakion1.mode
ltx/gr_gr_cog/me.m06.d28:meLI.Kontakion1.text	@ltx/gr_gr_cog/me.m06.d28:meMA.Kontakion1.text
ltx/gr_gr_cog/me.m06.d28:meLI.MM.CommunionHymn.text	@ltx/gr_gr_cog/properties:media.key
ltx/gr_gr_cog/me.m06.d28:meLI.Megalynarion.text	
ltx/gr_gr_cog/me.m06.d28:meMA.C1.acrostic.notice1	οὗ ἡ Ἀκροστιχίς·
ltx/gr_gr_cog/me.m06.d28:meMA.C1.acrostic.text	Καλῶν δοτῆρες, τῶν κακῶν ῥύσασθέ με. Ἰωσήφ.
ltx/gr_gr_cog/me.m06.d28:meMA.C1.acrostic.title	Ὁ Κανὼν τῶν Ἁγίων,
ltx/gr_gr_cog/me.m06.d28:meMA.C1.title	@ltx/gr_gr_cog/titles:ti.CanonSaints
ltx/gr_gr_cog/me.m06.d28:meMA.C1.verse	@ltx/gr_gr_cog/prayers:pr.verse_SaintsM.text
ltx/gr_gr_cog/me.m06.d28:meMA.Kontakion1.greekmelody	@ltx/gr_gr_cog/he.a.m3:heAU.IParthenosSimeron.greekname
ltx/gr_gr_cog/me.m06.d28:meMA.Kontakion1.incipit	Ἐκ τῆς θείας χάριτος, τὴν…
ltx/gr_gr_cog/me.m06.d28:meMA.Kontakion1.melody	@ltx/gr_gr_cog/he.a.m3:heAU.IParthenosSimeron.name
ltx/gr_gr_cog/me.m06.d28:meMA.Kontakion1.mode	@ltx/gr_gr_cog/miscellanea:misc.Mode3
ltx/gr_gr_cog/me.m06.d28:meMA.Kontakion1.text	Ἐκ τῆς θείας χάριτος, τὴν δωρεὰν τῶν θαυμάτων, εἰληφότες, Ἅγιοι, θαυματουργεῖτε ἐν κόσμῳ· ἅπαντα, ἡμῶν τὰ πάθη τῇ χειρουργίᾳ, τέμνετε, τῇ ἀοράτῳ Κῦρε θεόφρον, σὺν τῷ θείῳ Ἰωάννῃ· ὑμεῖς γὰρ θεῖοι, ἰατροὶ ὑπάρχετε.
ltx/gr_gr_cog/me.m06.d28:meMA.Ode1C11.greekmelody	@ltx/gr_gr_cog/he.h.m2:heHE.DefteLaoi.greekname
ltx/gr_gr_cog/me.m06.d28:meMA.Ode1C11.incipit	Κράτος ἐχθροῦ, τῇ κραταιᾷ διαλύσαντες…
ltx/gr_gr_cog/me.m06.d28:meMA.Ode1C11.melody	@ltx/gr_gr_cog/he.h.m2:heHE.DefteLaoi.name
ltx/gr_gr_cog/me.m06.d28:meMA.Ode1C11.mode	@ltx/gr_gr_cog/miscellanea:misc.Mode2
ltx/gr_gr_cog/me.m06.d28:meMA.Ode1C11.ode	@ltx/gr_gr_cog/miscellanea:misc.Ode1
ltx/gr_gr_cog/me.m06.d28:meMA.Ode1C11.text	Κράτος ἐχθροῦ, τῇ κραταιᾷ διαλύσαντες, τοῦ Παρακλήτου χάριτι, θεομακάριστοι, κραταιώσατε πάντας, κατὰ τῶν τυραννούντων παθῶν δεόμεθα.
ltx/gr_gr_cog/me.m06.d28:meMA.Ode1C12.incipit	Ἀθλητικῶς, τὸν δυσμενῆ διωλέσατε, χάριν…
ltx/gr_gr_cog/me.m06.d28:meMA.Ode1C12.melody	@ltx/gr_gr_cog/he.h.m2:heHE.DefteLaoi.name
ltx/gr_gr_cog/me.m06.d28:meMA.Ode1C12.mode	@ltx/gr_gr_cog/miscellanea:misc.Mode2
ltx/gr_gr_cog/me.m06.d28:meMA.Ode1C12.ode	@ltx/gr_gr_cog/miscellanea:misc.Ode1
ltx/gr_gr_cog/me.m06.d28:meMA.Ode1C12.text	Ἀθλητικῶς, τὸν δυσμενῆ διωλέσατε, χάριν Σοφοὶ δεξάμενοι, πάθη ἀνίατα, θεραπεύειν· διό μου, τὰ πάθη τῆς καρδίας νῦν ἰατρεύσατε.
ltx/gr_gr_cog/me.m06.d28:meMA.Ode1C13.incipit	Λόγοις ὑμᾶς, τοὺς ἐπὶ γῆς…
ltx/gr_gr_cog/me.m06.d28:meMA.Ode1C13.melody	@ltx/gr_gr_cog/he.h.m2:heHE.DefteLaoi.name
ltx/gr_gr_cog/me.m06.d28:meMA.Ode1C13.mode	@ltx/gr_gr_cog/miscellanea:misc.Mode2
ltx/gr_gr_cog/me.m06.d28:meMA.Ode1C13.ode	@ltx/gr_gr_cog/miscellanea:misc.Ode1
ltx/gr_gr_cog/me.m06.d28:meMA.Ode1C13.text	Λόγοις ὑμᾶς, τοὺς ἐπὶ γῆς μακαρίζοντας, παθῶν ἀλόγων ῥύσασθε, ταῖς προσευχαῖς ὑμῶν, Κῦρε καὶ Ἰωάννη, τοῦ προανάρχου Λόγου θεῖοι θεράποντες.
ltx/gr_gr_cog/me.m06.d28:meMA.Ode1C1T.incipit	Ὡς τὰ ἡμῶν, ὑπερβολῇ ἀγαθότητος…
ltx/gr_gr_cog/me.m06.d28:meMA.Ode1C1T.melody	@ltx/gr_gr_cog/he.h.m2:heHE.DefteLaoi.name
ltx/gr_gr_cog/me.m06.d28:meMA.Ode1C1T.mode	@ltx/gr_gr_cog/miscellanea:misc.Mode2
ltx/gr_gr_cog/me.m06.d28:meMA.Ode1C1T.ode	@ltx/gr_gr_cog/miscellanea:misc.Ode1
ltx/gr_gr_cog/me.m06.d28:meMA.Ode1C1T.text	Ὡς τὰ ἡμῶν, ὑπερβολῇ ἀγαθότητος, οἰκειουμένη Πάναγνε, θεοχαρίτωτε, ἀμαυρώσεως πάσης, καὶ ζάλης καὶ κινδύνων πάντας διάσωσον.
ltx/gr_gr_cog/me.m06.d28:meMA.Ode3C11.greekmelody	@ltx/gr_gr_cog/he.h.m2:heHE.StereosonImasEnSoiKyrie.greekname
ltx/gr_gr_cog/me.m06.d28:meMA.Ode3C11.incipit	Νομίμως τῷ Χριστῷ ὡς στρατευσάμενοι…
ltx/gr_gr_cog/me.m06.d28:meMA.Ode3C11.melody	@ltx/gr_gr_cog/he.h.m2:heHE.StereosonImasEnSoiKyrie.name
ltx/gr_gr_cog/me.m06.d28:meMA.Ode3C11.mode	@ltx/gr_gr_cog/miscellanea:misc.Mode2
ltx/gr_gr_cog/me.m06.d28:meMA.Ode3C11.ode	@ltx/gr_gr_cog/miscellanea:misc.Ode3
ltx/gr_gr_cog/me.m06.d28:meMA.Ode3C11.text	Νομίμως τῷ Χριστῷ ὡς στρατευσάμενοι, ἀνόμους ᾐσχύνατε Ἀθλοφόροι, ἀλλʼ αἰτοῦμαι Παμμακάριστοι, αἰωνίου αἰσχύνης με λυτρώσασθε.
ltx/gr_gr_cog/me.m06.d28:meMA.Ode3C12.incipit	Δοτῆρες ἀγαθῶν, σωτῆρες πάντοτε, τῶν…
ltx/gr_gr_cog/me.m06.d28:meMA.Ode3C12.melody	@ltx/gr_gr_cog/he.h.m2:heHE.StereosonImasEnSoiKyrie.name
ltx/gr_gr_cog/me.m06.d28:meMA.Ode3C12.mode	@ltx/gr_gr_cog/miscellanea:misc.Mode2
ltx/gr_gr_cog/me.m06.d28:meMA.Ode3C12.ode	@ltx/gr_gr_cog/miscellanea:misc.Ode3
ltx/gr_gr_cog/me.m06.d28:meMA.Ode3C12.text	Δοτῆρες ἀγαθῶν, σωτῆρες πάντοτε, τῶν πίστει πρὸς ὑμᾶς καταφευγόντων, τὴν ψυχήν μου διασώσατε, καὶ τοῦ σώματος πάθη θεραπεύσατε.
ltx/gr_gr_cog/me.m06.d28:meMA.Ode3C13.incipit	Ὁδοὺς τὰς πρὸς ζωὴν φερούσας…
ltx/gr_gr_cog/me.m06.d28:meMA.Ode3C13.melody	@ltx/gr_gr_cog/he.h.m2:heHE.StereosonImasEnSoiKyrie.name
ltx/gr_gr_cog/me.m06.d28:meMA.Ode3C13.mode	@ltx/gr_gr_cog/miscellanea:misc.Mode2
ltx/gr_gr_cog/me.m06.d28:meMA.Ode3C13.ode	@ltx/gr_gr_cog/miscellanea:misc.Ode3
ltx/gr_gr_cog/me.m06.d28:meMA.Ode3C13.text	Ὁδοὺς τὰς πρὸς ζωὴν φερούσας Ἅγιοι, ὁδεύειν σθενώσατέ με καὶ πάσης, τῶν ἐχθρῶν ἀποπλανήσεως, προσευχαῖς ὑμῶν θείαις ἐκλυτρώσασθε.
ltx/gr_gr_cog/me.m06.d28:meMA.Ode3C1T.incipit	Τὰς νόσους τῶν βροτῶν τὸν…
ltx/gr_gr_cog/me.m06.d28:meMA.Ode3C1T.melody	@ltx/gr_gr_cog/he.h.m2:heHE.StereosonImasEnSoiKyrie.name
ltx/gr_gr_cog/me.m06.d28:meMA.Ode3C1T.mode	@ltx/gr_gr_cog/miscellanea:misc.Mode2
ltx/gr_gr_cog/me.m06.d28:meMA.Ode3C1T.ode	@ltx/gr_gr_cog/miscellanea:misc.Ode3
ltx/gr_gr_cog/me.m06.d28:meMA.Ode3C1T.text	Τὰς νόσους τῶν βροτῶν τὸν ἀφαιρούμενον, τεκοῦσα πανύμνητε Παναγία, τῆς ψυχῆς μου τὰ συντρίμματα, καὶ σαρκὸς τὰ νοσήματα θεράπευσον.
ltx/gr_gr_cog/me.m06.d28:meMA.Ode3H.greekmelody	@ltx/gr_gr_cog/he.h.m2:heHE.StereosonImasEnSoiKyrie.greekname
ltx/gr_gr_cog/me.m06.d28:meMA.Ode3H.incipit	@ltx/gr_gr_cog/he.h.m2:heHE.StereosonImasEnSoiKyrie.incipit
ltx/gr_gr_cog/me.m06.d28:meMA.Ode3H.melody	@ltx/gr_gr_cog/he.h.m2:heHE.StereosonImasEnSoiKyrie.melody
ltx/gr_gr_cog/me.m06.d28:meMA.Ode3H.mode	@ltx/gr_gr_cog/miscellanea:misc.Mode2
ltx/gr_gr_cog/me.m06.d28:meMA.Ode3H.ode	@ltx/gr_gr_cog/miscellanea:misc.Ode3
ltx/gr_gr_cog/me.m06.d28:meMA.Ode3H.text	@ltx/gr_gr_cog/he.h.m2:heHE.StereosonImasEnSoiKyrie.text
ltx/gr_gr_cog/me.m06.d28:meMA.Ode3Kathisma1.greekmelody	@ltx/gr_gr_cog/he.a.m4:heAU.OYpsotheisEnToStavro.greekname
ltx/gr_gr_cog/me.m06.d28:meMA.Ode3Kathisma1.incipit	Τὰς χαμαιζήλους ἡδονὰς συμπατοῦντες, πρὸς…
ltx/gr_gr_cog/me.m06.d28:meMA.Ode3Kathisma1.melody	@ltx/gr_gr_cog/he.a.m4:heAU.OYpsotheisEnToStavro.name
ltx/gr_gr_cog/me.m06.d28:meMA.Ode3Kathisma1.mode	@ltx/gr_gr_cog/miscellanea:misc.Mode4
ltx/gr_gr_cog/me.m06.d28:meMA.Ode3Kathisma1.text	Τὰς χαμαιζήλους ἡδονὰς συμπατοῦντες, πρὸς μαρτυρίου ἀθληταὶ θεῖον ὕψος, περιφανῶς ἐπήρθητε ἐν χάριτι, Κῦρε Ἰωάννη τε, οἰκουμένης φωστῆρες· ὅθεν ἱκετεύομεν, σκοτασμοῦ ἁμαρτίας, καὶ νοσημάτων ῥύσασθε ἡμᾶς, τὸν ἐπὶ πάντων Θεὸν ἱκετεύοντες.
ltx/gr_gr_cog/me.m06.d28:meMA.Ode3KathismaSt.incipit	Τὸν ἐξ ἀνάρχου τοῦ Πατρὸς…
ltx/gr_gr_cog/me.m06.d28:meMA.Ode3KathismaSt.melody	@ltx/gr_gr_cog/he.a.m4:heAU.OYpsotheisEnToStavro.name
ltx/gr_gr_cog/me.m06.d28:meMA.Ode3KathismaSt.mode	@ltx/gr_gr_cog/miscellanea:misc.Mode4
ltx/gr_gr_cog/me.m06.d28:meMA.Ode3KathismaSt.text	Τὸν ἐξ ἀνάρχου τοῦ Πατρὸς γεννηθέντα, ἡ ἐπʼ ἐσχάτων σε σαρκὶ τετοκυῖα, ἐπὶ Σταυροῦ κρεμάμενον ὁρῶσά σε Χριστέ· Οἴμοι! ποθεινότατε, Ἰησοῦ ἀνεβόα· πῶς ὁ δοξαζόμενος, ὡς Θεὸς ὑπʼ Ἀγγέλων, ὑπὸ ἀνόμων νῦν βροτῶν Υἱέ, θέλων σταυροῦσαι; Ὑμνῶ σε μακρόθυμε.
ltx/gr_gr_cog/me.m06.d28:meMA.Ode3KathismaT.incipit	Τῶν ἀκαθάρτων λογισμῶν μου τὰ…
ltx/gr_gr_cog/me.m06.d28:meMA.Ode3KathismaT.melody	@ltx/gr_gr_cog/he.a.m4:heAU.OYpsotheisEnToStavro.name
ltx/gr_gr_cog/me.m06.d28:meMA.Ode3KathismaT.mode	@ltx/gr_gr_cog/miscellanea:misc.Mode4
ltx/gr_gr_cog/me.m06.d28:meMA.Ode3KathismaT.text	Τῶν ἀκαθάρτων λογισμῶν μου τὰ πλήθη, καὶ τῶν ἀτόπων ἐννοιῶν τὰς νιφάδας, τίς ἐξειπεῖν δυνήσεται Πανάμωμε; τὰς ἐπαναστάσεις δέ, τῶν ἀσάρκων ἐχθρῶν μου, τίς ἐκδιηγήσεται, καὶ τὴν τούτων κακίαν; Ἀλλὰ τῇ σῇ πρεσβείᾳ ἀγαθή, τούτων μοι πάντων, τὴν λύτρωσιν δώρησαι.
ltx/gr_gr_cog/me.m06.d28:meMA.Ode4C11.greekmelody	@ltx/gr_gr_cog/he.h.m2:heHE.YmnoSeAkoi.greekname
ltx/gr_gr_cog/me.m06.d28:meMA.Ode4C11.incipit	Ἡλίου, νοητοῦ λαμπρότησιν, αὐγαζόμενοι Ἀθλοφόροι…
ltx/gr_gr_cog/me.m06.d28:meMA.Ode4C11.melody	@ltx/gr_gr_cog/he.h.m2:heHE.YmnoSeAkoi.name
ltx/gr_gr_cog/me.m06.d28:meMA.Ode4C11.mode	@ltx/gr_gr_cog/miscellanea:misc.Mode2
ltx/gr_gr_cog/me.m06.d28:meMA.Ode4C11.ode	@ltx/gr_gr_cog/miscellanea:misc.Ode4
ltx/gr_gr_cog/me.m06.d28:meMA.Ode4C11.text	Ἡλίου, νοητοῦ λαμπρότησιν, αὐγαζόμενοι Ἀθλοφόροι τοῦ σκότους τὸν ἄρχοντα ὠλέσατε, ἐξ οὗ τῆς βλάβης ἡμᾶς, δυσωποῦμεν ἐκλυτρώσασθε, φωταγωγοῦντες πάντων τὰ νοήματα.
ltx/gr_gr_cog/me.m06.d28:meMA.Ode4C12.incipit	Ῥομφαῖαι, ἀσεβεῖς σαφῶς συγκόπτουσαι, ἐγνωρίσθητε…
ltx/gr_gr_cog/me.m06.d28:meMA.Ode4C12.melody	@ltx/gr_gr_cog/he.h.m2:heHE.YmnoSeAkoi.name
ltx/gr_gr_cog/me.m06.d28:meMA.Ode4C12.mode	@ltx/gr_gr_cog/miscellanea:misc.Mode2
ltx/gr_gr_cog/me.m06.d28:meMA.Ode4C12.ode	@ltx/gr_gr_cog/miscellanea:misc.Ode4
ltx/gr_gr_cog/me.m06.d28:meMA.Ode4C12.text	Ῥομφαῖαι, ἀσεβεῖς σαφῶς συγκόπτουσαι, ἐγνωρίσθητε Ἀθλοφοροι, συντρίψαντες χάριτι, τὰς τοῦ ἐχθροῦ δεινὰς ῥομφαίας· διὸ τῶν βελῶν ἀτρώτους ῥύσασθε, τῶν ἐναντίων πάντων προσευχαῖς ὑμῶν.
ltx/gr_gr_cog/me.m06.d28:meMA.Ode4C13.incipit	Ἐκ πλήθους, χαλεπῶν συμπτώσεων, νοσημάτων…
ltx/gr_gr_cog/me.m06.d28:meMA.Ode4C13.melody	@ltx/gr_gr_cog/he.h.m2:heHE.YmnoSeAkoi.name
ltx/gr_gr_cog/me.m06.d28:meMA.Ode4C13.mode	@ltx/gr_gr_cog/miscellanea:misc.Mode2
ltx/gr_gr_cog/me.m06.d28:meMA.Ode4C13.ode	@ltx/gr_gr_cog/miscellanea:misc.Ode4
ltx/gr_gr_cog/me.m06.d28:meMA.Ode4C13.text	Ἐκ πλήθους, χαλεπῶν συμπτώσεων, νοσημάτων εἰς πλῆθος ἦλθον, καὶ δέομαι Ἅγιοι, ὑμῶν τοῦ πλήθους τοῦ ἐλέους τυχεῖν, διὰ τάχους τῆς ἰάσεως· διὸ τῆς προσευχῆς μου ἐπακούσατε.
ltx/gr_gr_cog/me.m06.d28:meMA.Ode4C1T.incipit	Συνήθως, ἐφʼ ἡμᾶς τὰ πλούσια…
ltx/gr_gr_cog/me.m06.d28:meMA.Ode4C1T.melody	@ltx/gr_gr_cog/he.h.m2:heHE.YmnoSeAkoi.name
ltx/gr_gr_cog/me.m06.d28:meMA.Ode4C1T.mode	@ltx/gr_gr_cog/miscellanea:misc.Mode2
ltx/gr_gr_cog/me.m06.d28:meMA.Ode4C1T.ode	@ltx/gr_gr_cog/miscellanea:misc.Ode4
ltx/gr_gr_cog/me.m06.d28:meMA.Ode4C1T.text	Συνήθως, ἐφʼ ἡμᾶς τὰ πλούσια, σοῦ ἐλέη Παρθένε ῥᾶνον, νοσήματα παύουσα, καὶ πάθη λύουσα ποικίλα ψυχῶν, τῶν ἐν πίστει προσιόντων σοι, τῇ τῶν καλῶν αἰτίᾳ πολυΰμνητε.
ltx/gr_gr_cog/me.m06.d28:meMA.Ode5C11.greekmelody	@ltx/gr_gr_cog/he.h.m2:heHE.OTouFotosChorigos.greekname
ltx/gr_gr_cog/me.m06.d28:meMA.Ode5C11.incipit	Τοῖς σπαραγμοῖς τῶν μελῶν, κατασπαράξαντες…
ltx/gr_gr_cog/me.m06.d28:meMA.Ode5C11.melody	@ltx/gr_gr_cog/he.h.m2:heHE.OTouFotosChorigos.name
ltx/gr_gr_cog/me.m06.d28:meMA.Ode5C11.mode	@ltx/gr_gr_cog/miscellanea:misc.Mode2
ltx/gr_gr_cog/me.m06.d28:meMA.Ode5C11.ode	@ltx/gr_gr_cog/miscellanea:misc.Ode5
ltx/gr_gr_cog/me.m06.d28:meMA.Ode5C11.text	Τοῖς σπαραγμοῖς τῶν μελῶν, κατασπαράξαντες ἐχθρῶν ἄνοιαν, θεοειδεῖς Μάρτυρες Κυρίου, τὴν σπαραττομένην ὑπὸ τῆς κακίας, ψυχήν μου ἰάσασθε.
ltx/gr_gr_cog/me.m06.d28:meMA.Ode5C12.incipit	Ὦ μακαρία δυάς, ἱερονίκων Ἀθλητῶν…
ltx/gr_gr_cog/me.m06.d28:meMA.Ode5C12.melody	@ltx/gr_gr_cog/he.h.m2:heHE.OTouFotosChorigos.name
ltx/gr_gr_cog/me.m06.d28:meMA.Ode5C12.mode	@ltx/gr_gr_cog/miscellanea:misc.Mode2
ltx/gr_gr_cog/me.m06.d28:meMA.Ode5C12.ode	@ltx/gr_gr_cog/miscellanea:misc.Ode5
ltx/gr_gr_cog/me.m06.d28:meMA.Ode5C12.text	Ὦ μακαρία δυάς, ἱερονίκων Ἀθλητῶν αἴτησαι, ἁμαρτιῶν πολλῶν ἡμῖν λύσιν, καὶ τῶν ἀσθενειῶν, ἴασιν τελείαν, πιστῶς δυσωποῦμέν σε.
ltx/gr_gr_cog/me.m06.d28:meMA.Ode5C13.incipit	Νόσῳ συνέχομαι, ἁμαρτημάτων χαλεπῶν Ἅγιοι…
ltx/gr_gr_cog/me.m06.d28:meMA.Ode5C13.melody	@ltx/gr_gr_cog/he.h.m2:heHE.OTouFotosChorigos.name
ltx/gr_gr_cog/me.m06.d28:meMA.Ode5C13.mode	@ltx/gr_gr_cog/miscellanea:misc.Mode2
ltx/gr_gr_cog/me.m06.d28:meMA.Ode5C13.ode	@ltx/gr_gr_cog/miscellanea:misc.Ode5
ltx/gr_gr_cog/me.m06.d28:meMA.Ode5C13.text	Νόσῳ συνέχομαι, ἁμαρτημάτων χαλεπῶν Ἅγιοι, καὶ τῆς σαρκὸς χειμάζομαι πόνοις, ἐξ ὧν ῥύσασθέ με, τὸν ἀγαθοδότην Χριστὸν ἱκετεύοντες.
ltx/gr_gr_cog/me.m06.d28:meMA.Ode5C1T.incipit	Κύματα πράϋνον, τῆς παναθλίας μου…
ltx/gr_gr_cog/me.m06.d28:meMA.Ode5C1T.melody	@ltx/gr_gr_cog/he.h.m2:heHE.OTouFotosChorigos.name
ltx/gr_gr_cog/me.m06.d28:meMA.Ode5C1T.mode	@ltx/gr_gr_cog/miscellanea:misc.Mode2
ltx/gr_gr_cog/me.m06.d28:meMA.Ode5C1T.ode	@ltx/gr_gr_cog/miscellanea:misc.Ode5
ltx/gr_gr_cog/me.m06.d28:meMA.Ode5C1T.text	Κύματα πράϋνον, τῆς παναθλίας μου ψυχῆς δέομαι, καὶ τῆς σαρκὸς παῦσον τὰς ὀδύνας, ἡ μόνη τεκοῦσα, ἄνευθεν ὠδίνων Θεὸν σωματούμενον.
ltx/gr_gr_cog/me.m06.d28:meMA.Ode6C11.greekmelody	@ltx/gr_gr_cog/he.h.m2:heHE.EnAvyssoPtaismaton.greekname
ltx/gr_gr_cog/me.m06.d28:meMA.Ode6C11.incipit	Ἀῤῥαγεῖς Ἐκκλησίας θεμέλιοι, πάσαις μεθοδείαις…
ltx/gr_gr_cog/me.m06.d28:meMA.Ode6C11.melody	@ltx/gr_gr_cog/he.h.m2:heHE.EnAvyssoPtaismaton.name
ltx/gr_gr_cog/me.m06.d28:meMA.Ode6C11.mode	@ltx/gr_gr_cog/miscellanea:misc.Mode2
ltx/gr_gr_cog/me.m06.d28:meMA.Ode6C11.ode	@ltx/gr_gr_cog/miscellanea:misc.Ode6
ltx/gr_gr_cog/me.m06.d28:meMA.Ode6C11.text	Ἀῤῥαγεῖς Ἐκκλησίας θεμέλιοι, πάσαις μεθοδείαις ἐχθροῦ σαλευόμενον, τὸ τῆς ψυχῆς μου οἴκημα, ταῖς ὑμῶν ἱκεσίαις στηρίξατε.
ltx/gr_gr_cog/me.m06.d28:meMA.Ode6C12.incipit	Καὶ ψυχῶν καὶ σωμάτων θεράποντες…
ltx/gr_gr_cog/me.m06.d28:meMA.Ode6C12.melody	@ltx/gr_gr_cog/he.h.m2:heHE.EnAvyssoPtaismaton.name
ltx/gr_gr_cog/me.m06.d28:meMA.Ode6C12.mode	@ltx/gr_gr_cog/miscellanea:misc.Mode2
ltx/gr_gr_cog/me.m06.d28:meMA.Ode6C12.ode	@ltx/gr_gr_cog/miscellanea:misc.Ode6
ltx/gr_gr_cog/me.m06.d28:meMA.Ode6C12.text	Καὶ ψυχῶν καὶ σωμάτων θεράποντες, θεῖοι χρηματίζοντες, Μάρτυρες ἔνδοξοι, τὰς τῆς ψυχῆς καὶ σώματος, ἀσθενείας ἡμῶν θεραπεύσατε.
ltx/gr_gr_cog/me.m06.d28:meMA.Ode6C13.incipit	Ὡς λιμένι τῷ οἴκῳ προσέδραμον…
ltx/gr_gr_cog/me.m06.d28:meMA.Ode6C13.melody	@ltx/gr_gr_cog/he.h.m2:heHE.EnAvyssoPtaismaton.name
ltx/gr_gr_cog/me.m06.d28:meMA.Ode6C13.mode	@ltx/gr_gr_cog/miscellanea:misc.Mode2
ltx/gr_gr_cog/me.m06.d28:meMA.Ode6C13.ode	@ltx/gr_gr_cog/miscellanea:misc.Ode6
ltx/gr_gr_cog/me.m06.d28:meMA.Ode6C13.text	Ὡς λιμένι τῷ οἴκῳ προσέδραμον, Μάρτυρες ὑμῶν τῷ ἁγίῳ καὶ δέομαι, τρικυμιῶν με ῥύσασθε, ἀσθενείας καὶ θλίψεως Ἅγιοι.
ltx/gr_gr_cog/me.m06.d28:meMA.Ode6C1T.incipit	Νοερῶν ἀνωτέρα Δυνάμεων, πάσης με…
ltx/gr_gr_cog/me.m06.d28:meMA.Ode6C1T.melody	@ltx/gr_gr_cog/he.h.m2:heHE.EnAvyssoPtaismaton.name
ltx/gr_gr_cog/me.m06.d28:meMA.Ode6C1T.mode	@ltx/gr_gr_cog/miscellanea:misc.Mode2
ltx/gr_gr_cog/me.m06.d28:meMA.Ode6C1T.ode	@ltx/gr_gr_cog/miscellanea:misc.Ode6
ltx/gr_gr_cog/me.m06.d28:meMA.Ode6C1T.text	Νοερῶν ἀνωτέρα Δυνάμεων, πάσης με κακίας τοῦ πλάνου ἀνώτερον, ταῖς σαῖς πρεσβείαις ποίησον, εὐχαρίστως ἀεί σε δοξάζοντα.
ltx/gr_gr_cog/me.m06.d28:meMA.Ode6H.greekmelody	@ltx/gr_gr_cog/he.h.m2:heHE.EnAvyssoPtaismaton.greekname
ltx/gr_gr_cog/me.m06.d28:meMA.Ode6H.incipit	@ltx/gr_gr_cog/he.h.m2:heHE.EnAvyssoPtaismaton.incipit
ltx/gr_gr_cog/me.m06.d28:meMA.Ode6H.melody	@ltx/gr_gr_cog/he.h.m2:heHE.EnAvyssoPtaismaton.melody
ltx/gr_gr_cog/me.m06.d28:meMA.Ode6H.mode	@ltx/gr_gr_cog/miscellanea:misc.Mode2
ltx/gr_gr_cog/me.m06.d28:meMA.Ode6H.ode	@ltx/gr_gr_cog/miscellanea:misc.Ode6
ltx/gr_gr_cog/me.m06.d28:meMA.Ode6H.text	@ltx/gr_gr_cog/he.h.m2:heHE.EnAvyssoPtaismaton.text
ltx/gr_gr_cog/me.m06.d28:meMA.Ode7C11.greekmelody	@ltx/gr_gr_cog/he.h.m2:heHE.EikonosChrysis.greekname
ltx/gr_gr_cog/me.m06.d28:meMA.Ode7C11.incipit	Ῥεόντων φοράν, παρωσάμενοι νοῒ τελείῳ…
ltx/gr_gr_cog/me.m06.d28:meMA.Ode7C11.melody	@ltx/gr_gr_cog/he.h.m2:heHE.EikonosChrysis.name
ltx/gr_gr_cog/me.m06.d28:meMA.Ode7C11.mode	@ltx/gr_gr_cog/miscellanea:misc.Mode2
ltx/gr_gr_cog/me.m06.d28:meMA.Ode7C11.ode	@ltx/gr_gr_cog/miscellanea:misc.Ode7
ltx/gr_gr_cog/me.m06.d28:meMA.Ode7C11.text	Ῥεόντων φοράν, παρωσάμενοι νοῒ τελείῳ Μάρτυρες, πρὸς τοὺς ἀγῶνας ἀπεδύσασθε, καὶ καθελόντες τὸν τύραννον, χάριν ἰαμάτων ἐξ ὕψους, ἀναβοῶντες ἐδέξασθε· Εὐλογητός εἶ ὁ Θεός, ὁ τῶν Πατέρων ἡμῶν.
ltx/gr_gr_cog/me.m06.d28:meMA.Ode7C12.incipit	Ὑμῶν τῇ θερμῇ προστασίᾳ Ἀθληταὶ…
ltx/gr_gr_cog/me.m06.d28:meMA.Ode7C12.melody	@ltx/gr_gr_cog/he.h.m2:heHE.EikonosChrysis.name
ltx/gr_gr_cog/me.m06.d28:meMA.Ode7C12.mode	@ltx/gr_gr_cog/miscellanea:misc.Mode2
ltx/gr_gr_cog/me.m06.d28:meMA.Ode7C12.ode	@ltx/gr_gr_cog/miscellanea:misc.Ode7
ltx/gr_gr_cog/me.m06.d28:meMA.Ode7C12.text	Ὑμῶν τῇ θερμῇ προστασίᾳ Ἀθληταὶ πολλοῖς πυρούμενος νῦν καταφεύγω ἀῤῥωστήμασι, καὶ ἐν ὀδύνῃ καρδίας μου δέομαι. Ταχεῖαν μοι δότε, μελῳδοῦντι τὴν ἴασιν· Εὐλογητός εἶ ὁ Θεός, ὁ τῶν Πατέρων ἡμῶν.
ltx/gr_gr_cog/me.m06.d28:meMA.Ode7C13.incipit	Σαρκὸς βλαβεραῖς, ἀῤῥωστίαις ὁμιλῶν τὴν…
ltx/gr_gr_cog/me.m06.d28:meMA.Ode7C13.melody	@ltx/gr_gr_cog/he.h.m2:heHE.EikonosChrysis.name
ltx/gr_gr_cog/me.m06.d28:meMA.Ode7C13.mode	@ltx/gr_gr_cog/miscellanea:misc.Mode2
ltx/gr_gr_cog/me.m06.d28:meMA.Ode7C13.ode	@ltx/gr_gr_cog/miscellanea:misc.Ode7
ltx/gr_gr_cog/me.m06.d28:meMA.Ode7C13.text	Σαρκὸς βλαβεραῖς, ἀῤῥωστίαις ὁμιλῶν τὴν ψυχὴν ἔχων, σκοτιζομένην ἐνθυμήσεσι, καὶ ἁμαρτίαις καὶ πάθεσι, Κῦρε ἀθλητῶν ὡραιότης καὶ Ἰωάννη πανεύφημε, σπεύσατε τάχος δυσωπῶ, τοῦ ἐξελέσθαι με.
ltx/gr_gr_cog/me.m06.d28:meMA.Ode7C1T.incipit	Ἀνθρώπων δεινῶν, καὶ δαιμόνων πονηρῶν…
ltx/gr_gr_cog/me.m06.d28:meMA.Ode7C1T.melody	@ltx/gr_gr_cog/he.h.m2:heHE.EikonosChrysis.name
ltx/gr_gr_cog/me.m06.d28:meMA.Ode7C1T.mode	@ltx/gr_gr_cog/miscellanea:misc.Mode2
ltx/gr_gr_cog/me.m06.d28:meMA.Ode7C1T.ode	@ltx/gr_gr_cog/miscellanea:misc.Ode7
ltx/gr_gr_cog/me.m06.d28:meMA.Ode7C1T.text	Ἀνθρώπων δεινῶν, καὶ δαιμόνων πονηρῶν καὶ τῆς τοῦ βίου, κακοπραγίας καὶ συμπτώσεως, καὶ πάσης ἄλλης κακώσεως, ῥῦσαί με Ἁγία Παρθένε, καὶ συντήρησον ψάλλοντα· Εὐλογητὸς εἶ ὁ Θεός, ὁ τῶν Πατέρων ἡμῶν.
ltx/gr_gr_cog/me.m06.d28:meMA.Ode8C11.greekmelody	@ltx/gr_gr_cog/he.h.m2:heHE.TonEnKaminoTouPyros.greekname
ltx/gr_gr_cog/me.m06.d28:meMA.Ode8C11.incipit	Σῶν ἐπιδόσει πρεσβειῶν, παμμακάριστε δυὰς…
ltx/gr_gr_cog/me.m06.d28:meMA.Ode8C11.melody	@ltx/gr_gr_cog/he.h.m2:heHE.TonEnKaminoTouPyros.name
ltx/gr_gr_cog/me.m06.d28:meMA.Ode8C11.mode	@ltx/gr_gr_cog/miscellanea:misc.Mode2
ltx/gr_gr_cog/me.m06.d28:meMA.Ode8C11.ode	@ltx/gr_gr_cog/miscellanea:misc.Ode8
ltx/gr_gr_cog/me.m06.d28:meMA.Ode8C11.text	Σῶν ἐπιδόσει πρεσβειῶν, παμμακάριστε δυὰς εὐλογημένη, ἀφʼ ἡμῶν πᾶσαν νόσον, καὶ μαλακίαν ψυχῆς, βοῶμεν καὶ σώματος δίωξον, ὅπως σε τιμῶμεν, εἰς πάντας τοὺς αἰῶνας.
ltx/gr_gr_cog/me.m06.d28:meMA.Ode8C12.incipit	Θαυματουργοὶ καὶ ἰατροί, ἰατρεύσατε ἡμῶν…
ltx/gr_gr_cog/me.m06.d28:meMA.Ode8C12.melody	@ltx/gr_gr_cog/he.h.m2:heHE.TonEnKaminoTouPyros.name
ltx/gr_gr_cog/me.m06.d28:meMA.Ode8C12.mode	@ltx/gr_gr_cog/miscellanea:misc.Mode2
ltx/gr_gr_cog/me.m06.d28:meMA.Ode8C12.ode	@ltx/gr_gr_cog/miscellanea:misc.Ode8
ltx/gr_gr_cog/me.m06.d28:meMA.Ode8C12.text	Θαυματουργοὶ καὶ ἰατροί, ἰατρεύσατε ἡμῶν τὰς ἀαθενείας, Κῦρε καὶ Ἰωάννη, καὶ τὰς ὁρμὰς τῶν παθῶν, εἰς τρίβους ἐνθέους ἰθύνατε, ὅπως κατὰ χρέος, ἡμᾶς ἀνευφημῶμεν.
ltx/gr_gr_cog/me.m06.d28:meMA.Ode8C13.incipit	Ἐν ἀμελείᾳ τὴν ζωήν, δαπανῶν…
ltx/gr_gr_cog/me.m06.d28:meMA.Ode8C13.melody	@ltx/gr_gr_cog/he.h.m2:heHE.TonEnKaminoTouPyros.name
ltx/gr_gr_cog/me.m06.d28:meMA.Ode8C13.mode	@ltx/gr_gr_cog/miscellanea:misc.Mode2
ltx/gr_gr_cog/me.m06.d28:meMA.Ode8C13.ode	@ltx/gr_gr_cog/miscellanea:misc.Ode8
ltx/gr_gr_cog/me.m06.d28:meMA.Ode8C13.text	Ἐν ἀμελείᾳ τὴν ζωήν, δαπανῶν τὴν φοβερὰν πτοοῦμαι δίκην, ἐν ᾗ λυτρώσασθέ με, τῆς καταδίκης θερμοὶ προστάται, μάρτυρες γενόμενοι, τῆς ἀμαυρωθείσης τοῖς πάθεσι ψυχῆς μου.
ltx/gr_gr_cog/me.m06.d28:meMA.Ode8C1T.incipit	Ἐν ὁμοιώματι σαρκός, ὁ ὑπέρθεος…
ltx/gr_gr_cog/me.m06.d28:meMA.Ode8C1T.melody	@ltx/gr_gr_cog/he.h.m2:heHE.TonEnKaminoTouPyros.name
ltx/gr_gr_cog/me.m06.d28:meMA.Ode8C1T.mode	@ltx/gr_gr_cog/miscellanea:misc.Mode2
ltx/gr_gr_cog/me.m06.d28:meMA.Ode8C1T.ode	@ltx/gr_gr_cog/miscellanea:misc.Ode8
ltx/gr_gr_cog/me.m06.d28:meMA.Ode8C1T.text	Ἐν ὁμοιώματι σαρκός, ὁ ὑπέρθεος Ἁγνὴ ἐκ σοῦ ὡράθη, ὃν ἀπαύστως δυσώπει, ἐλεηθῆναι ἡμᾶς, κακίᾳ συζῶντας καὶ τρέμοντας, τὰς αἰωνιζούσας, Παρθένε τιμωρίας.
ltx/gr_gr_cog/me.m06.d28:meMA.Ode8C1Tr.incipit	Μονάδα φύσει σε ὑμνῶ, καὶ…
ltx/gr_gr_cog/me.m06.d28:meMA.Ode8C1Tr.melody	@ltx/gr_gr_cog/he.h.m2:heHE.TonEnKaminoTouPyros.name
ltx/gr_gr_cog/me.m06.d28:meMA.Ode8C1Tr.mode	@ltx/gr_gr_cog/miscellanea:misc.Mode2
ltx/gr_gr_cog/me.m06.d28:meMA.Ode8C1Tr.ode	@ltx/gr_gr_cog/miscellanea:misc.Ode8
ltx/gr_gr_cog/me.m06.d28:meMA.Ode8C1Tr.text	Μονάδα φύσει σε ὑμνῶ, καὶ Τριάδα προσκυνῶ τοῖς χαρακτῆρσι, Πάτερ Λόγε καὶ Πνεῦμα, τῶν Ἀθλητῶν ἡ χαρά, καὶ πάντων ἀνθρώπων κραταίωμα, τῶν ἀκαταπαύστοις, φωναῖς σε ἀνυμνούντων.
ltx/gr_gr_cog/me.m06.d28:meMA.Ode8H.greekmelody	@ltx/gr_gr_cog/he.h.m2:heHE.TonEnKaminoTouPyros.greekname
ltx/gr_gr_cog/me.m06.d28:meMA.Ode8H.incipit	@ltx/gr_gr_cog/he.h.m2:heHE.TonEnKaminoTouPyros.incipit
ltx/gr_gr_cog/me.m06.d28:meMA.Ode8H.melody	@ltx/gr_gr_cog/he.h.m2:heHE.TonEnKaminoTouPyros.melody
ltx/gr_gr_cog/me.m06.d28:meMA.Ode8H.mode	@ltx/gr_gr_cog/miscellanea:misc.Mode2
ltx/gr_gr_cog/me.m06.d28:meMA.Ode8H.ode	@ltx/gr_gr_cog/miscellanea:misc.Ode8
ltx/gr_gr_cog/me.m06.d28:meMA.Ode8H.text	@ltx/gr_gr_cog/he.h.m2:heHE.TonEnKaminoTouPyros.text
ltx/gr_gr_cog/me.m06.d28:meMA.Ode9C11.greekmelody	@ltx/gr_gr_cog/he.h.m2:heHE.TonEkTheouTheonLogon.greekname
ltx/gr_gr_cog/me.m06.d28:meMA.Ode9C11.incipit	Ἱερωτάταις χορείαις, ἱερῶν Ἀθλοφόρων, συνόντες…
ltx/gr_gr_cog/me.m06.d28:meMA.Ode9C11.melody	@ltx/gr_gr_cog/he.h.m2:heHE.TonEkTheouTheonLogon.name
ltx/gr_gr_cog/me.m06.d28:meMA.Ode9C11.mode	@ltx/gr_gr_cog/miscellanea:misc.Mode2
ltx/gr_gr_cog/me.m06.d28:meMA.Ode9C11.ode	@ltx/gr_gr_cog/miscellanea:misc.Ode9
ltx/gr_gr_cog/me.m06.d28:meMA.Ode9C11.text	Ἱερωτάταις χορείαις, ἱερῶν Ἀθλοφόρων, συνόντες καὶ ταῖς θείαις καλλοναῖς, ὡραϊζόμενοι Ἅγιοι, τὸν ὡραῖον ἐν κάλλει, αἰτεῖσθε Ἰησοῦν διαπαντός, ὡραιῶσαι καρδίας, ἡμῶν Μάρτυρες ἔνδοξοι.
ltx/gr_gr_cog/me.m06.d28:meMA.Ode9C12.incipit	Ὡς εὐωδέστατα κρίνα, νοητοῦ Παραδείσου…
ltx/gr_gr_cog/me.m06.d28:meMA.Ode9C12.melody	@ltx/gr_gr_cog/he.h.m2:heHE.TonEkTheouTheonLogon.name
ltx/gr_gr_cog/me.m06.d28:meMA.Ode9C12.mode	@ltx/gr_gr_cog/miscellanea:misc.Mode2
ltx/gr_gr_cog/me.m06.d28:meMA.Ode9C12.ode	@ltx/gr_gr_cog/miscellanea:misc.Ode9
ltx/gr_gr_cog/me.m06.d28:meMA.Ode9C12.text	Ὡς εὐωδέστατα κρίνα, νοητοῦ Παραδείσου, ὑπάρχοντες Κυρίου Ἀθληταί, πᾶσαν ψυχὴν κατοσφραίνετε, ἱεραῖς εὐωδίαις· διό μου τὸ δυσῶδες τῶν παθῶν, ἀπελάσατε ῥῶσιν, καὶ χάριν μοι δωρούμενοι.
ltx/gr_gr_cog/me.m06.d28:meMA.Ode9C13.incipit	Στήσατε Μάρτυρες θεῖοι, τῶν παθῶν…
ltx/gr_gr_cog/me.m06.d28:meMA.Ode9C13.melody	@ltx/gr_gr_cog/he.h.m2:heHE.TonEkTheouTheonLogon.name
ltx/gr_gr_cog/me.m06.d28:meMA.Ode9C13.mode	@ltx/gr_gr_cog/miscellanea:misc.Mode2
ltx/gr_gr_cog/me.m06.d28:meMA.Ode9C13.ode	@ltx/gr_gr_cog/miscellanea:misc.Ode9
ltx/gr_gr_cog/me.m06.d28:meMA.Ode9C13.text	Στήσατε Μάρτυρες θεῖοι, τῶν παθῶν μου τὴν ῥῶσιν, ὡς πάλαι τῶν αἱμάτων ὀχετοῖς, πλάνης πλημμύραν ἀλλόκοτον, καὶ αἰτήσασθε χύσιν, δοθῆναί μου δακρύων ψυχικῶν, διʼ ἧς ῥύπου παντοίου ἁμαρτιῶν πλυθήσομαι.
ltx/gr_gr_cog/me.m06.d28:meMA.Ode9C14.incipit	Ἡλιακῶν λαμπηδόνων, ὁ ναὸς ὑμῶν…
ltx/gr_gr_cog/me.m06.d28:meMA.Ode9C14.melody	@ltx/gr_gr_cog/he.h.m2:heHE.TonEkTheouTheonLogon.name
ltx/gr_gr_cog/me.m06.d28:meMA.Ode9C14.mode	@ltx/gr_gr_cog/miscellanea:misc.Mode2
ltx/gr_gr_cog/me.m06.d28:meMA.Ode9C14.ode	@ltx/gr_gr_cog/miscellanea:misc.Ode9
ltx/gr_gr_cog/me.m06.d28:meMA.Ode9C14.text	Ἡλιακῶν λαμπηδόνων, ὁ ναὸς ὑμῶν πλέον, ἰάσεων ἐκπέμπων τὰς αὐγάς, σκότος παθῶν πονηρότατον, ἐκδιώκει, ἐν ᾧ με, φωτίσατε προστρέχοντα πιστῶς, Κῦρε καὶ Ἰωάννη, θαυματουργοὶ πανθαύμαστοι.
ltx/gr_gr_cog/me.m06.d28:meMA.Ode9C1T.incipit	Φωτοειδὴς ὡς νεφέλη, τὸν τῆς…
ltx/gr_gr_cog/me.m06.d28:meMA.Ode9C1T.melody	@ltx/gr_gr_cog/he.h.m2:heHE.TonEkTheouTheonLogon.name
ltx/gr_gr_cog/me.m06.d28:meMA.Ode9C1T.mode	@ltx/gr_gr_cog/miscellanea:misc.Mode2
ltx/gr_gr_cog/me.m06.d28:meMA.Ode9C1T.ode	@ltx/gr_gr_cog/miscellanea:misc.Ode9
ltx/gr_gr_cog/me.m06.d28:meMA.Ode9C1T.text	Φωτοειδὴς ὡς νεφέλη, τὸν τῆς δικαιοσύνης, κατέχουσα ἀγκάλαις σου Ἁγνή, ἥλιον ἄδυτον πέφυκας· διὰ τοῦτο βοῶ σοι· Πολλοῖς ἐσκοτισμένον με κακοῖς, φωταγώγησον Κόρη, ἀπαύστως σε γεραίροντα.
ltx/gr_gr_cog/me.m06.d28:meMA.Ode9H.greekmelody	@ltx/gr_gr_cog/he.h.m2:heHE.TonEkTheouTheonLogon.greekname
ltx/gr_gr_cog/me.m06.d28:meMA.Ode9H.incipit	@ltx/gr_gr_cog/he.h.m2:heHE.TonEkTheouTheonLogon.incipit
ltx/gr_gr_cog/me.m06.d28:meMA.Ode9H.melody	@ltx/gr_gr_cog/he.h.m2:heHE.TonEkTheouTheonLogon.melody
ltx/gr_gr_cog/me.m06.d28:meMA.Ode9H.mode	@ltx/gr_gr_cog/miscellanea:misc.Mode2
ltx/gr_gr_cog/me.m06.d28:meMA.Ode9H.ode	@ltx/gr_gr_cog/miscellanea:misc.Ode9
ltx/gr_gr_cog/me.m06.d28:meMA.Ode9H.text	@ltx/gr_gr_cog/he.h.m2:heHE.TonEkTheouTheonLogon.text
ltx/gr_gr_cog/me.m06.d28:meMA.Oikos1.text	Ἑαυτοὺς τῷ Θεῷ ἀναθέμενοι Ἅγιοι, πᾶσαν πεῖραν δεινῶν διʼ αὐτὸν ὑπεμείνατε, θανόντες προθύμως Μάρτυρες γενναῖοι, καὶ μετὰ τέλος πᾶσι πηγάζετε τὰ θεῖα χαρίσματα, τοῖς ἐν ποικίλαις νόσοις ὑπάρχουσι, καὶ ὑπὸ πολλῶν ἐταζομένοις κακῶν, ὧν εἷς καὶ πρῶτός εἰμι ὁ τάλας· τὸ σῶμα γὰρ καὶ τὴν ψυχὴν ὑπὸ τραυμάτων χαλεπῶν ὀδυνῶμαι, καὶ πίστει βοῶ, Ἰάσασθέ με· ὑμεῖς γὰρ θεῖοι ἰατροὶ ὑπάρχετε.
ltx/gr_gr_cog/me.m06.d28:meVE.Apolytikion1ger.greekmelody	@ltx/gr_gr_cog/he.a.m3:heAU.TheiasPisteos.greekname
ltx/gr_gr_cog/me.m06.d28:meVE.Apolytikion1ger.incipit	Θείας χάριτος, τῇ ἐνεργείᾳ, ἀναβλύζοντα…
ltx/gr_gr_cog/me.m06.d28:meVE.Apolytikion1ger.melody	@ltx/gr_gr_cog/he.a.m3:heAU.TheiasPisteos.name
ltx/gr_gr_cog/me.m06.d28:meVE.Apolytikion1ger.mode	@ltx/gr_gr_cog/miscellanea:misc.Mode3
ltx/gr_gr_cog/me.m06.d28:meVE.Apolytikion1ger.poet	@ltx/gr_gr_cog/poets:po.Gerasimou
ltx/gr_gr_cog/me.m06.d28:meVE.Apolytikion1ger.text	Θείας χάριτος, τῇ ἐνεργείᾳ, ἀναβλύζοντα, θαυμάτων ῥεῖθρα, ἀναργύρως τὰ σεπτὰ ὑμῶν λείψανα, ἐκ τῶν λαγόνων τῆς γῆς κόσμῳ ἔλαμψαν, Κῦρε θεόφρον, Ἰωάννη τε ἔνδοξε· ὅθεν ἅπαντες, τὴν τούτων τιμῶντες εὕρεσιν, αἰτοῦμεν διʼ ὑμῶν τὸ μέγα ἔλεος.
ltx/gr_gr_cog/me.m06.d28:meVE.SticStavrotheotokion.greekmelody	@ltx/gr_gr_cog/he.a.m4:heAU.OsGennaionEnMartysi.greekname
ltx/gr_gr_cog/me.m06.d28:meVE.SticStavrotheotokion.incipit	@ltx/gr_gr_cog/me.m02.d11:meVE.AposStavrotheotokion.incipit
ltx/gr_gr_cog/me.m06.d28:meVE.SticStavrotheotokion.melody	@ltx/gr_gr_cog/he.a.m4:heAU.OsGennaionEnMartysi.name
ltx/gr_gr_cog/me.m06.d28:meVE.SticStavrotheotokion.mode	@ltx/gr_gr_cog/miscellanea:misc.Mode4
ltx/gr_gr_cog/me.m06.d28:meVE.SticStavrotheotokion.text	@ltx/gr_gr_cog/me.m02.d11:meVE.AposStavrotheotokion.text
ltx/gr_gr_cog/me.m06.d28:meVE.SticTheotokion.greekmelody	@ltx/gr_gr_cog/he.a.m4:heAU.OsGennaionEnMartysi.greekname
ltx/gr_gr_cog/me.m06.d28:meVE.SticTheotokion.incipit	@ltx/gr_gr_cog/me.m06.d09:meVE.SticTheotokion.incipit
ltx/gr_gr_cog/me.m06.d28:meVE.SticTheotokion.melody	@ltx/gr_gr_cog/he.a.m4:heAU.OsGennaionEnMartysi.name
ltx/gr_gr_cog/me.m06.d28:meVE.SticTheotokion.mode	@ltx/gr_gr_cog/miscellanea:misc.Mode4
ltx/gr_gr_cog/me.m06.d28:meVE.SticTheotokion.text	@ltx/gr_gr_cog/me.m06.d09:meVE.SticTheotokion.text
ltx/gr_gr_cog/me.m06.d28:meVE.Stichera01.greekmelody	@ltx/gr_gr_cog/he.a.m4:heAU.OsGennaionEnMartysi.greekname
ltx/gr_gr_cog/me.m06.d28:meVE.Stichera01.incipit	Τὴν δυάδα τιμήσωμεν, τῶν Μαρτύρων…
ltx/gr_gr_cog/me.m06.d28:meVE.Stichera01.melody	@ltx/gr_gr_cog/he.a.m4:heAU.OsGennaionEnMartysi.name
ltx/gr_gr_cog/me.m06.d28:meVE.Stichera01.mode	@ltx/gr_gr_cog/miscellanea:misc.Mode4
ltx/gr_gr_cog/me.m06.d28:meVE.Stichera01.text	Τὴν δυάδα τιμήσωμεν, τῶν Μαρτύρων ἐν ᾄσμασι, τῆς Τριάδος ἔχουσαν τὴν λαμπρότητα, τοὺς θεμελίους τῆς πίστεως, τὰ ἄνθη τὰ πνέοντα, τὴν ὀσμὴν τὴν ἀληθῆ, τῆς Θεοῦ ἐπιγνώσεως, Κῦρον ἅπαντες, καὶ σὺν τούτῳ τὸν μέγαν Ἰωάννην, ὡς πρεσβεύοντας ἀπαύστως, ὑπὲρ ἡμῶν τὸν φιλάνθρωπον.
ltx/gr_gr_cog/me.m06.d28:meVE.Stichera02.incipit	Διὰ βίου λαμπρότητος, καὶ ἀσκήσεως…
ltx/gr_gr_cog/me.m06.d28:meVE.Stichera02.melody	@ltx/gr_gr_cog/he.a.m4:heAU.OsGennaionEnMartysi.name
ltx/gr_gr_cog/me.m06.d28:meVE.Stichera02.mode	@ltx/gr_gr_cog/miscellanea:misc.Mode4
ltx/gr_gr_cog/me.m06.d28:meVE.Stichera02.text	Διὰ βίου λαμπρότητος, καὶ ἀσκήσεως ἔλαμψας, καὶ ἀθλήσει ὕστερον κατεκόσμησας, τὴν σὴν ψυχὴν Κῦρε ἔνδοξε, στρατείαν δὲ ἔλιπες, τὴν ἐπίγειον σοφέ, Ἰωάννη καὶ εὕρηκας, τὴν οὐράνιον, ἱκετεύσατε ἄμφω τὸν Σωτῆρα, ὑπὲρ τῶν ἐπιτελούντων, ὑμῶν τὴν μνήμην μακάριοι.
ltx/gr_gr_cog/me.m06.d28:meVE.Stichera03.incipit	Ἰατροὶ ἀνεδείχθητε, ἀσθενούντων μακάριοι, καὶ…
ltx/gr_gr_cog/me.m06.d28:meVE.Stichera03.melody	@ltx/gr_gr_cog/he.a.m4:heAU.OsGennaionEnMartysi.name
ltx/gr_gr_cog/me.m06.d28:meVE.Stichera03.mode	@ltx/gr_gr_cog/miscellanea:misc.Mode4
ltx/gr_gr_cog/me.m06.d28:meVE.Stichera03.text	Ἰατροὶ ἀνεδείχθητε, ἀσθενούντων μακάριοι, καὶ φωστῆρες ἄδυτοι θείας πίστεως, ὁμολογίας συνήγοροι, Μαρτύρων συμμέτοχοι, τοὺς στεφάνους ἀληθῶς, ἐκ Θεοῦ ἀνεδήσασθε, Κῦρε ἔνδοξε, καὶ σοφὲ Ἰωάννη ἐν αἰνέσει, δυσωπεῖτε τὸν Σωτῆρα, ὑπὲρ τῶν πίστει ὑμνούντων ὑμᾶς.
