ltx/gr_gr_cog/le.pr.tr.d044:lemcTE.reading1.book_abbr	@ltx/gr_gr_cog/bible:Isaiah.abbr
ltx/gr_gr_cog/le.pr.tr.d044:lemcTE.reading1.book_string	@ltx/gr_gr_cog/bible:Isaiah.text
ltx/gr_gr_cog/le.pr.tr.d044:lemcTE.reading1.chapverse	ΙΔʹ 24 – 32
ltx/gr_gr_cog/le.pr.tr.d044:lemcTE.reading1.incipit	Τάδε λέγει Κύριος Σαβαώθ· Ὃν τρόπον εἴρηκα, οὕτως ἔσται,…
ltx/gr_gr_cog/le.pr.tr.d044:lemcTE.reading1.text	Τάδε λέγει Κύριος Σαβαώθ· Ὃν τρόπον εἴρηκα, οὕτως ἔσται, καὶ ὃν τρόπον βεβούλευμαι, οὕτω μενεῖ, τοῦ ἀπολέσαι τοὺς Ἀσσυρίους ἐπὶ τῆς γῆς τῆς ἐμῆς, καὶ ἐπὶ τῶν ὀρέων μου, καὶ ἔσονται εἰς καταπάτημα, καὶ ἀφαιρεθήσεται ἀπʼ αὐτῶν ὁ ζυγὸς αὐτῶν, καὶ τὸ κῦδος αὐτῶν ἀπὸ τῶν ὤμων ἀφαιρεθήσεται. Αὕτη ἡ βουλή, ἣν βεβούλευται Κύριος ἐφ ὅλην τὴν Οἰκουμένην, καὶ αὕτη ἡ χεὶρ ἡ ὑψηλή, ἐπὶ πάντα τὰ ἔθνη· ἃ γὰρ ὁ Θεὸς ὁ ἅγιος βεβούλευται, τίς διασκεδάσει; καὶ τὴν χεῖρα αὐτοῦ τὴν ὑψηλὴν τίς ἀποστρέψει; Τοῦ ἔτους, οὗ ἀπέθανεν Ἄχαζ ὁ βασιλεύς, ἐγενήθη τὸ ῥῆμα τοῦτο. Μὴ εὐφρανθείητε πάντες οἱ ἀλλόφυλοι· συνετρίβη γὰρ ὁ ζυγὸς τοῦ παίοντος ὑμᾶς· ἐκ γὰρ σπέρματος ὄφεως ἐξελεύσεται ἔγγονα ἀσπίδων, καὶ τὰ ἔγγονα αὐτῶν ἐξελεύσονται ὄφεις πετώμενοι. Καὶ βοσκηθήσονται πτωχοὶ διʹ αὐτοῦ, πένητες δὲ ἄνθρωποι ἐπὶ εἰρήνης ἀναπαύσονται, ἀνελεῖ δὲ τὸ σπέρμα σου ἐν λιμῷ, καὶ τὸ κατάλειμμά σου ἀνελεῖ. Ὀλολύξατε πύλαι πόλεων, κεκραγέτωσαν πόλεις τεταραγμέναι, οἱ ἀλλόφυλοι πάντες, ὅτι ἀπὸ Βοῤῥᾶ καπνὸς ἔρχεται, καὶ οὐκ ἔστι τοῦ εἶναι. Καὶ τί ἀποκριθήσονται βασιλεῖς ἐθνῶν; ὅτι Κύριος ἐθεμελίωσε τὴν Σιών, καὶ διʹ αὐτοῦ σωθήσονται οἱ ταπεινοὶ τοῦ λαοῦ.
ltx/gr_gr_cog/le.pr.tr.d044:lemcTE.reading1.title	
ltx/gr_gr_cog/le.pr.tr.d044:lemcTE.reading1.title_abbr	
ltx/gr_gr_cog/le.pr.tr.d044:lemcTE.reading1.version	@ltx/gr_gr_cog/properties:version.designation
