ltx/gr_gr_cog/le.go.me.m01.d18:lemeLI.Gospel.book_abbr	@ltx/gr_gr_cog/le.go.ge.hierarch:legeLI.Gospel2.book_abbr
ltx/gr_gr_cog/le.go.me.m01.d18:lemeLI.Gospel.book_string	@ltx/gr_gr_cog/le.go.ge.hierarch:legeLI.Gospel2.book_string
ltx/gr_gr_cog/le.go.me.m01.d18:lemeLI.Gospel.chapverse	@ltx/gr_gr_cog/le.go.ge.hierarch:legeLI.Gospel2.chapverse
ltx/gr_gr_cog/le.go.me.m01.d18:lemeLI.Gospel.incipit	@ltx/gr_gr_cog/le.go.ge.hierarch:legeLI.Gospel2.incipit
ltx/gr_gr_cog/le.go.me.m01.d18:lemeLI.Gospel.text	@ltx/gr_gr_cog/le.go.ge.hierarch:legeLI.Gospel2.text
ltx/gr_gr_cog/le.go.me.m01.d18:lemeLI.Gospel.title	Τῶν Ἁγίων
ltx/gr_gr_cog/le.go.me.m01.d18:lemeLI.Gospel.title_abbr	Τῶν Ἁγίων
ltx/gr_gr_cog/le.go.me.m01.d18:lemeLI.Gospel.version	@ltx/gr_gr_cog/le.go.ge.hierarch:legeLI.Gospel2.version
ltx/gr_gr_cog/le.go.me.m01.d18:lemeMA.Gospel.book_abbr	@ltx/gr_gr_cog/le.go.ge.hierarch:legeMA.Gospel.book_abbr
ltx/gr_gr_cog/le.go.me.m01.d18:lemeMA.Gospel.book_string	@ltx/gr_gr_cog/le.go.ge.hierarch:legeMA.Gospel.book_string
ltx/gr_gr_cog/le.go.me.m01.d18:lemeMA.Gospel.chapverse	@ltx/gr_gr_cog/le.go.ge.hierarch:legeMA.Gospel.chapverse
ltx/gr_gr_cog/le.go.me.m01.d18:lemeMA.Gospel.incipit	@ltx/gr_gr_cog/le.go.ge.hierarch:legeMA.Gospel.incipit
ltx/gr_gr_cog/le.go.me.m01.d18:lemeMA.Gospel.text	@ltx/gr_gr_cog/le.go.ge.hierarch:legeMA.Gospel.text
ltx/gr_gr_cog/le.go.me.m01.d18:lemeMA.Gospel.title	Τῶν Ἁγίων
ltx/gr_gr_cog/le.go.me.m01.d18:lemeMA.Gospel.title_abbr	Τῶν Ἁγίων
ltx/gr_gr_cog/le.go.me.m01.d18:lemeMA.Gospel.version	@ltx/gr_gr_cog/le.go.ge.hierarch:legeMA.Gospel.version
