ltx/gr_gr_cog/le.go.mc.d195:lemcLI.Gospel.book_abbr	@ltx/gr_gr_cog/bible:Matthew.abbr
ltx/gr_gr_cog/le.go.mc.d195:lemcLI.Gospel.book_string	@ltx/gr_gr_cog/bible:Matthew.text
ltx/gr_gr_cog/le.go.mc.d195:lemcLI.Gospel.chapverse	24:27 – 33, 42 – 51
ltx/gr_gr_cog/le.go.mc.d195:lemcLI.Gospel.incipit	Ὥσπερ ἡ ἀστραπὴ ἐξέρχεται ἀπὸ ἀνατολῶν…
ltx/gr_gr_cog/le.go.mc.d195:lemcLI.Gospel.text	Εἶπεν ὁ Κύριος τοῖς ἑαυτοῦ μαθηταῖς· ὥσπερ ἡ ἀστραπὴ ἐξέρχεται ἀπὸ ἀνατολῶν καὶ φαίνεται ἕως δυσμῶν, οὕτως ἔσται καὶ ἡ παρουσία τοῦ υἱοῦ τοῦ ἀνθρώπου· ὅπου γὰρ ἐὰν ᾖ τὸ πτῶμα, ἐκεῖ συναχθήσονται οἱ ἀετοί. Εὐθέως δὲ μετὰ τὴν θλῖψιν τῶν ἡμερῶν ἐκείνων ὁ ἥλιος σκοτισθήσεται καὶ ἡ σελήνη οὐ δώσει τὸ φέγγος αὐτῆς, καὶ οἱ ἀστέρες πεσοῦνται ἀπὸ τοῦ οὐρανοῦ, καὶ αἱ δυνάμεις τῶν οὐρανῶν σαλευθήσονται. καὶ τότε φανήσεται τὸ σημεῖον τοῦ υἱοῦ τοῦ ἀνθρώπου ἐν τῷ οὐρανῷ, καὶ τότε κόψονται πᾶσαι αἱ φυλαὶ τῆς γῆς καὶ ὄψονται τὸν υἱὸν τοῦ ἀνθρώπου ἐρχόμενον ἐπὶ τῶν νεφελῶν τοῦ οὐρανοῦ μετὰ δυνάμεως καὶ δόξης πολλῆς. καὶ ἀποστελεῖ τοὺς ἀγγέλους αὐτοῦ μετὰ σάλπιγγος φωνῆς μεγάλης, καὶ ἐπισυνάξουσι τοὺς ἐκλεκτοὺς αὐτοῦ ἐκ τῶν τεσσάρων ἀνέμων ἀπ᾿ ἄκρων οὐρανῶν ἕως ἄκρων αὐτῶν. Ἀπὸ δὲ τῆς συκῆς μάθετε τὴν παραβολήν. ὅταν ἤδη ὁ κλάδος αὐτῆς γένηται ἁπαλὸς καὶ τὰ φύλλα ἐκφύῃ, γινώσκετε ὅτι ἐγγὺς τὸ θέρος· οὕτω καὶ ὑμεῖς ὅταν ἴδητε ταῦτα πάντα, γινώσκετε ὅτι ἐγγύς ἐστιν ἐπὶ θύραις. γρηγορεῖτε οὖν, ὅτι οὐκ οἴδατε ποίᾳ ὥρᾳ ὁ Κύριος ὑμῶν ἔρχεται. Ἐκεῖνο δὲ γινώσκετε ὅτι εἰ ᾔδει ὁ οἰκοδεσπότης ποίᾳ φυλακῇ ὁ κλέπτης ἔρχεται, ἐγρηγόρησεν ἂν καὶ οὐκ ἂν εἴασε διορυγῆναι τὴν οἰκίαν αὐτοῦ. διὰ τοῦτο καὶ ὑμεῖς γίνεσθε ἕτοιμοι, ὅτι ᾗ ὥρᾳ οὐ δοκεῖτε ὁ υἱὸς τοῦ ἀνθρώπου ἔρχεται. Τίς ἄρα ἐστὶν ὁ πιστὸς δοῦλος καὶ φρόνιμος, ὃν κατέστησεν ὁ κύριος αὐτοῦ ἐπὶ τῆς θεραπείας αὐτοῦ τοῦ διδόναι αὐτοῖς τὴν τροφὴν ἐν καιρῷ; μακάριος ὁ δοῦλος ἐκεῖνος ὃν ἐλθὼν ὁ κύριος αὐτοῦ εὑρήσει ποιοῦντα οὕτως. ἀμὴν λέγω ὑμῖν ὅτι ἐπὶ πᾶσι τοῖς ὑπάρχουσιν αὐτοῦ καταστήσει αὐτόν. ἐὰν δὲ εἴπῃ ὁ κακὸς δοῦλος ἐκεῖνος ἐν τῇ καρδίᾳ αὐτοῦ, χρονίζει ὁ κύριός μου ἐλθεῖν, καὶ ἄρξηται τύπτειν τοὺς συνδούλους αὐτοῦ, ἐσθίῃ δὲ καὶ πίνῃ μετὰ τῶν μεθυόντων, ἥξει ὁ κύριος τοῦ δούλου ἐκείνου ἐν ἡμέρᾳ ᾗ οὐ προσδοκᾷ καὶ ἐν ὥρᾳ ᾗ οὐ γινώσκει, καὶ διχοτομήσει αὐτόν, καὶ τὸ μέρος αὐτοῦ μετὰ τῶν ὑποκριτῶν θήσει· ἐκεῖ ἔσται ὁ κλαυθμὸς καὶ ὁ βρυγμὸς τῶν ὀδόντων.
ltx/gr_gr_cog/le.go.mc.d195:lemcLI.Gospel.title	Τῇ Παρασκευῇ τῆς ΙΑʹ Ἑβδομάδος τοῦ Ματθαίου
ltx/gr_gr_cog/le.go.mc.d195:lemcLI.Gospel.title_abbr	Παρασκευῇ τῆς ΙΑʹ Ἑβδομάδος
ltx/gr_gr_cog/le.go.mc.d195:lemcLI.Gospel.version	@ltx/gr_gr_cog/properties:version.designation
