ltx/gr_gr_cog/le.go.va.publicoffice:levaLI.Gospel.book_abbr	@ltx/gr_gr_cog/bible:Matthew.abbr
ltx/gr_gr_cog/le.go.va.publicoffice:levaLI.Gospel.book_string	@ltx/gr_gr_cog/bible:Matthew.text
ltx/gr_gr_cog/le.go.va.publicoffice:levaLI.Gospel.chapverse	20:25 – 28
ltx/gr_gr_cog/le.go.va.publicoffice:levaLI.Gospel.incipit	Προσκαλεσάμενος ὁ Ἰησοῦς τοὺς μαθητὰς αὐτοῦ…
ltx/gr_gr_cog/le.go.va.publicoffice:levaLI.Gospel.text	Τῷ καιρῷ ἐκείνῳ, προσκαλεσάμενος ὁ Ἰησοῦς τοὺς μαθητὰς αὐτοῦ εἶπεν· Οἴδατε ὅτι οἱ ἄρχοντες τῶν ἐθνῶν κατακυριεύουσιν αὐτῶν καὶ οἱ μεγάλοι κατεξουσιάζουσιν αὐτῶν. οὐχ οὕτως ἔσται ἐν ὑμῖν, ἀλλ᾿ ὃς ἐὰν θέλῃ ἐν ὑμῖν μέγας γενέσθαι, ἔσται ὑμῶν διάκονος, καὶ ὃς ἐὰν θέλῃ ἐν ὑμῖν εἶναι πρῶτος, ἔσται ὑμῶν δοῦλος· ὥσπερ ὁ υἱὸς τοῦ ἀνθρώπου οὐκ ἦλθε διακονηθῆναι, ἀλλὰ διακονῆσαι καὶ δοῦναι τὴν ψυχὴν αὐτοῦ λύτρον ἀντὶ πολλῶν.
ltx/gr_gr_cog/le.go.va.publicoffice:levaLI.Gospel.title	Ἐπὶ Ἐγκαταστάσει Δημοτικῆς ἢ Κοινοτικῆς Ἀρχῆς
ltx/gr_gr_cog/le.go.va.publicoffice:levaLI.Gospel.title_abbr	Ἐπὶ Ἐγκαταστάσει Δημοτικῆς ἢ Κοινοτικῆς Ἀρχῆς
ltx/gr_gr_cog/le.go.va.publicoffice:levaLI.Gospel.version	@ltx/gr_gr_cog/properties:version.designation
