ltx/gr_gr_cog/tr.d070:trCO.header	
ltx/gr_gr_cog/tr.d070:trDA.commemoration.full	
ltx/gr_gr_cog/tr.d070:trDA.commemoration.short	Τὸ Μέγα Σάββατον
ltx/gr_gr_cog/tr.d070:trDA.dismissal	@ltx/gr_gr_cog/dismissals:dis00.holyfriday
ltx/gr_gr_cog/tr.d070:trDA.insert1	
ltx/gr_gr_cog/tr.d070:trDA.insert2	
ltx/gr_gr_cog/tr.d070:trDA.note	
ltx/gr_gr_cog/tr.d070:trDA.title	
ltx/gr_gr_cog/tr.d070:trEM.header	Ὁ Ἐπιτάφιος Θρῆνος τῇ Παρασκευῇ τὸ Βράδυ
ltx/gr_gr_cog/tr.d070:trHO.commemorations	
ltx/gr_gr_cog/tr.d070:trHO.daytitle	
ltx/gr_gr_cog/tr.d070:trHO.description1	
ltx/gr_gr_cog/tr.d070:trHO.description2	
ltx/gr_gr_cog/tr.d070:trHO.note1	
ltx/gr_gr_cog/tr.d070:trHO.note2	
ltx/gr_gr_cog/tr.d070:trMA.C1.acrostic.notice1	Ὅλος δὲ ὁ Κανὼν φέρει ἀκροστιχίδα, ἄνευ τῶν Εἱρμῶν·
ltx/gr_gr_cog/tr.d070:trMA.C1.acrostic.text	Καὶ σήμερον δὲ Σάββατον μέλπω μέγα.
ltx/gr_gr_cog/tr.d070:trMA.C1.acrostic.title	Ὁ Κανών.
ltx/gr_gr_cog/tr.d070:trMA.C1.poet	Ἔστι δὲ οὗτος ὁ Κανών, ἡ μὲν αʹ, γʹ, δʹ καὶ εʹ ᾨδὴ, ποίημα Μάρκου Μοναχοῦ ἐπισκόπου Ὑδροῦντος. ἡ δὲ Ϛʹ, ζʹ, ἡ καὶ θʹ ᾨδὴ, Κοσμᾶ τοῦ Ἁγιοπολίτου. Οἱ δὲ Εἱρμοί εἰσι ποίημα γυναικός τινος Κασσίας.
ltx/gr_gr_cog/tr.d070:trMA.C1.verse	@ltx/gr_gr_cog/prayers:pr.verse_God.text
ltx/gr_gr_cog/tr.d070:trMA.Encomia.title	Τὰ Ἐγκώμια
ltx/gr_gr_cog/tr.d070:trMA.Encomia100.mode	@ltx/gr_gr_cog/miscellanea:misc.Mode5
ltx/gr_gr_cog/tr.d070:trMA.Encomia100.title	Στάσις Αʹ.
ltx/gr_gr_cog/tr.d070:trMA.Encomia101.text	Ἡ ζωὴ ἐν τάφῳ, κατετέθης Χριστέ, καὶ Ἀγγέλων στρατιαὶ ἐξεπλήττοντο, συγκατάβασιν δοξάζουσαι τὴν σήν.
ltx/gr_gr_cog/tr.d070:trMA.Encomia102.text	Ἡ ζωὴ πῶς θνῄσκεις; πῶς καὶ τάφῳ οἰκεῖς; τοῦ θανάτου τὸ βασίλειον λύεις δέ, καὶ τοῦ ᾍδου τοὺς νεκροὺς ἐξανιστᾷς.
ltx/gr_gr_cog/tr.d070:trMA.Encomia103.text	Μεγαλύνομέν σε, Ἰησοῦ Βασιλεῦ, καὶ τιμῶμεν τὴν Ταφὴν καὶ τὰ Πάθη σου, διʼ ὧν ἔσωσας ἡμᾶς ἐκ τῆς φθορᾶς.
ltx/gr_gr_cog/tr.d070:trMA.Encomia104.text	Μέτρα γῆς ὁ στήσας, ἐν σμικρῷ κατοικεῖς, Ἰησοῦ παμβασιλεῦ τάφῳ σήμερον, ἐκ μνημάτων τοὺς θανέντας ἀνιστῶν.
ltx/gr_gr_cog/tr.d070:trMA.Encomia105.text	Ἰησοῦ Χριστέ μου, Βασιλεῦ τοῦ παντός, τί ζητῶν τοῖς ἐν τῷ ᾍδῃ ἐλήλυθας; ἢ τὸ γένος ἀπολῦσαι τῶν βροτῶν;
ltx/gr_gr_cog/tr.d070:trMA.Encomia106.text	Ὁ Δεσπότης πάντων, καθορᾶται νεκρός, καὶ ἐν μνήματι καινῷ κατατίθεται, ὁ κενώσας τὰ μνημεῖα τῶν νεκρῶν.
ltx/gr_gr_cog/tr.d070:trMA.Encomia107.text	Ἡ ζωὴ ἐν τάφῳ κατετέθης Χριστέ, καὶ θανάτῳ σου τὸν θάνατον ὤλεσας, καὶ ἐπήγασας τῷ Κόσμῳ, τὴν ζωήν.
ltx/gr_gr_cog/tr.d070:trMA.Encomia108.text	Μετὰ τῶν κακούργων, ὡς κακοῦργος Χριστέ, ἑλογίσθης δικαιῶν ἡμᾶς ἅπαντας, κακουργίας τοῦ ἀρχαίου πτερνιστοῦ.
ltx/gr_gr_cog/tr.d070:trMA.Encomia109.text	Ὁ ὡραῖος κάλλει, παρὰ πάντας βροτούς, ὡς ἀνείδεος νεκρὸς καταφαίνεται, ὁ τὴν φύσιν ὡραΐσας τοῦ παντός.
ltx/gr_gr_cog/tr.d070:trMA.Encomia110.text	ᾍδης πῶς ὑποίσει, παρουσίαν τὴν σήν, καὶ μὴ θᾶττον συνθλασθείη σκοτούμενος, ἀστραπῆς φωτός σου αἴγλῃ τυφλωθείς;
ltx/gr_gr_cog/tr.d070:trMA.Encomia111.text	Ἰησοῦ γλυκύ μοι, καὶ σωτήριον φῶς, τάφῳ πῶς ἐν σκοτεινῷ κατακέκρυψαι; ὢ ἀφάτου καὶ ἀῤῥήτου ἀνοχῆς!
ltx/gr_gr_cog/tr.d070:trMA.Encomia112.text	Ἀπορεῖ καὶ φύσις, νοερὰ καὶ πληθύς, ἡ ἀσώματος Χριστὲ τὸ μυστήριον, τῆς ἀφράστου καὶ ἀῤῥήτου σου ταφῆς.
ltx/gr_gr_cog/tr.d070:trMA.Encomia113.text	Ὢ θαυμάτων ξένων! ὢ πραγμάτων καινῶν! Ὁ πνοῆς μοι χορηγὸς ἄπνους φέρεται, κηδευόμενος χερσὶ τοῦ Ἰωσήφ.
ltx/gr_gr_cog/tr.d070:trMA.Encomia114.text	Καὶ ἐν τάφῳ ἔδυς, καὶ τῶν κόλπων Χριστέ τῶν πατρῴων οὐδαμῶς ἀπεφοίτησας· τοῦτο ξένον καὶ παράδοξον ὁμοῦ.
ltx/gr_gr_cog/tr.d070:trMA.Encomia115.text	Ἀληθὴς καὶ πόλου, καὶ τῆς γῆς Βασιλεύς, εἰ καὶ τάφῳ σμικροτάτῳ συγκέκλεισαι, ἐπεγνώσθης πάσῃ κτίσει Ἰησοῦ.
ltx/gr_gr_cog/tr.d070:trMA.Encomia116.text	Σοῦ τεθέντος τάφῳ, πλαστουργέτα Χριστέ, τὰ τοῦ Ἄδου ἐσαλεύθη θεμέλια, καὶ μνημεῖα ἠνεῴχθη τῶν βροτῶν.
ltx/gr_gr_cog/tr.d070:trMA.Encomia117.text	Ὁ τὴν γῆν κατέχων, τῇ δρακὶ νεκρωθείς, σαρκικῶς ὑπὸ τῆς γῆς νῦν συνέχεται, τοὺς νεκροὺς λυτρῶν τῆς Ἄδου συνοχῆς.
ltx/gr_gr_cog/tr.d070:trMA.Encomia118.text	Ἐκ φθορᾶς ἀνέβης, ἡ ζωή μου Σωτήρ, σοῦ θανόντος καὶ νεκροῖς προσφοιτήσαντος, καὶ συνθλάσαντος τοῦ ᾍδου τοὺς μοχλούς.
ltx/gr_gr_cog/tr.d070:trMA.Encomia119.text	Ὡς φωτὸς λυχνία, νῦν ἡ σάρξ τοῦ Θεοῦ, ὑπὸ γῆν ὡς ὑπὸ μόδιον κρύπτεται, καὶ διώκει τὸν ἐν ᾍδη σκοτασμόν.
ltx/gr_gr_cog/tr.d070:trMA.Encomia120.text	Νοερῶν συντρέχει, στρατιῶν ἡ πληθύς, Ἰωσὴφ καὶ Νικοδήμῳ συστεῖλαί σε, τὸν ἀχώρητον ἐν μνήματι σμικρῷ.
ltx/gr_gr_cog/tr.d070:trMA.Encomia121.text	Νεκρωθεὶς βουλήσει, καὶ τεθεὶς ὑπὸ γῆν, ζωοβρύτα Ἰησοῦ μου ἐζώωσας, νεκρωθέντα παραβάσει με πικρᾷ.
ltx/gr_gr_cog/tr.d070:trMA.Encomia122.text	Ἠλλοιοῦτο πᾶσα, κτίσις πάθει τῷ σῷ· πάντα γάρ σοι Λόγε συνέπασχον, συνοχέα σε γινώσκοντα παντός.
ltx/gr_gr_cog/tr.d070:trMA.Encomia123.text	Τῆς ζωῆς τὴν πέτραν ἐν κοιλίᾳ λαβών, ᾍδης ὁ παμφάγος ἐξήμεσεν, ἐξ αἰῶνος οὓς κατέπιε νεκρούς.
ltx/gr_gr_cog/tr.d070:trMA.Encomia124.text	Ἐν καινῷ μνημείῳ, κατετέθης Χριστέ, καὶ τὴν φύσιν τῶν βροτῶν ἀνεκαίνισας, ἀναστὰς θεοπρεπῶς ἐκ τῶν νεκρῶν.
ltx/gr_gr_cog/tr.d070:trMA.Encomia125.text	Ἐπὶ γῆς κατῆλθες, ἵνα σώσῃς Ἀδάμ, καὶ ἐν γῆ μὴ εὑρηκὼς τοῦτον Δέσποτα, μέχρις ᾍδου κατελήλυθας ζητῶν.
ltx/gr_gr_cog/tr.d070:trMA.Encomia126.text	Συγκλονεῖται φόβῳ, πᾶσα Λόγε ἡ γῆ, καὶ Φωσφόρος τὰς ἀκτῖνας ἀπέκρυψε, τοῦ μεγίστου γῇ κρυβέντος σου φωτός.
ltx/gr_gr_cog/tr.d070:trMA.Encomia127.text	Ὡς βροτὸς μὲν θνῄσκεις, ἑκουσίως Σωτήρ, ὡς Θεὸς δὲ τοὺς θνητοὺς ἐξανέστησας, ἐκ μνημάτων καὶ βυθοῦ ἁμαρτιῶν.
ltx/gr_gr_cog/tr.d070:trMA.Encomia128.text	Δακρυῤῥόους θρήνους, ἐπὶ σὲ ἡ Ἁγνή, μητρικῶς ὦ Ἰησοῦ ἐπιῤῥαίνουσα, ἀνεβόα· Πῶς κηδεύσω σε Υἱέ;
ltx/gr_gr_cog/tr.d070:trMA.Encomia129.text	Ὥσπερ σίτου κόκκος, ὑποδὺς κόλπους γῆς, τὸν πολύχουν ἀποδέδωκας ἄσταχυν, ἀναστήσας τοὺς βροτοὺς τοὺς ἐξ Ἀδάμ.
ltx/gr_gr_cog/tr.d070:trMA.Encomia130.text	Ὑπὸ γῆν ἐκρύβης, ὥσπερ ἥλιος νῦν, καὶ νυκτὶ τῇ τοῦ θανάτου κεκάλυψαι· ἀλλʼ ἀνάτειλον φαιδρότερον Σωτήρ.
ltx/gr_gr_cog/tr.d070:trMA.Encomia131.text	Ὡς ἡλίου δίσκον, ἡ σελήνη Σωτήρ, ἀποκρύπτει, καὶ σὲ τάφος νῦν ἔκρυψεν, ἐκλιπόντα τοῦ θανάτου σαρκικῶς.
ltx/gr_gr_cog/tr.d070:trMA.Encomia132.text	Ἡ ζωὴ θανάτου, γευσαμένη Χριστός, ἐκ θανάτου τοὺς βροτοὺς ἠλευθέρωσε, καὶ τοῖς πᾶσι νῦν δωρεῖται τὴν ζωήν.
ltx/gr_gr_cog/tr.d070:trMA.Encomia133.text	Νεκρωθέντα πάλαι, τὸν Ἀδὰμ φθονερῶς, ἐπανάγεις πρὸς ζωὴν τῇ νεκρώσει σου, νέος Σῶτερ ἐν σαρκὶ φανεὶς Ἀδάμ.
ltx/gr_gr_cog/tr.d070:trMA.Encomia134.text	Νοεραί σε τάξεις, ἡπλωμένον νεκρόν, καθορῶσαι διʼ ἡμᾶς ἐξεπλήττοντο, καλυπτόμεναι ταῖς πτέρυξι Σωτήρ.
ltx/gr_gr_cog/tr.d070:trMA.Encomia135.text	Καθελών σε Λόγε, ἀπὸ ξύλου νεκρόν, ἐν μνημείῳ Ἰωσὴφ νῦν κατέθετο. Ἀλλʼ ἀνάστα σῴζων πάντας ὡς Θεός.
ltx/gr_gr_cog/tr.d070:trMA.Encomia136.text	Τῶν Ἀγγέλων Σῶτερ, χαρμονὴ πεφυκώς, νῦν καὶ λύπης τούτοις γέγονας αἴτιος, καθορώμενος σαρκὶ ἄπνους νεκρός.
ltx/gr_gr_cog/tr.d070:trMA.Encomia137.text	Ὑψωθεὶς ἐν ξύλῳ, καὶ τοὺς ζῶντας βροτούς, συνυψοῖς· ὑπὸ τὴν γῆν δὲ γενόμενος, τοὺς κειμένους δʼ ὑπʼ αὐτὴν ἐξανιστᾷς.
ltx/gr_gr_cog/tr.d070:trMA.Encomia138.text	Ὥσπερ λέων Σῶτερ, ἀφυπνώσας σαρκί, ὥς τις σκύμνος ὁ νεκρὸς ἐξανίστασαι, ἀποθέμενος τὸ γῆρας της σαρκός.
ltx/gr_gr_cog/tr.d070:trMA.Encomia139.text	Τὴν πλευρὰν ἐνύγης, ὁ πλευρὰν εἰληφώς, τοῦ Ἀδὰμ ἐξ ἧς τὴν Εὔαν διέπλασας, καὶ ἐξέβλυσας κρουνοὺς καθαρτικούς.
ltx/gr_gr_cog/tr.d070:trMA.Encomia140.text	Ἐν κρυπτῷ μὲν πάλαι, θύεται ὁ ἀμνός· σὺ δʼ ὑπαίθριος τυθεὶς ἀνεξίκακε, πᾶσαν κτίσιν ἀπεκάθηρας Σωτήρ.
ltx/gr_gr_cog/tr.d070:trMA.Encomia141.text	Τίς ἐξείποι τρόπον, φρικτὸν ὄντως καινόν; ὁ δεσπόζων γὰρ τῆς Κτίσεως σήμερον, πάθος δέχεται, καὶ θνῄσκει διʼ ἡμᾶς.
ltx/gr_gr_cog/tr.d070:trMA.Encomia142.text	Ὁ ζωῆς ταμίας, πῶς ὁρᾶται νεκρός; ἐκπληττόμενοι οἱ Ἄγγελοι ἔκραζον· πῶς δʼ ἐν μνήματι συγκλείεται Θεός;
ltx/gr_gr_cog/tr.d070:trMA.Encomia143.text	Λογχονύκτου Σῶτερ, ἐκ πλευρᾶς σου ζωήν, τῇ ζωῇ τῇ ἐκ ζωῆς ἐξωσάσῃ με, ἐπιστάζεις καὶ ζωοῖς με σὺν αὐτῇ.
ltx/gr_gr_cog/tr.d070:trMA.Encomia144.text	Ἁπλωθεὶς ἐν ξύλῳ, συνηγάγω βροτούς· τὴν πλευράν σου δὲ νυγεὶς τὴν ζωήῤῥυτον, πᾶσιν ἄφεσιν πηγάζεις Ἰησοῦ.
ltx/gr_gr_cog/tr.d070:trMA.Encomia145.text	Ὁ εὐσχήμων Σῶτερ, σχηματίζει φρικτῶς, καὶ κηδεύει ὡς νεκρὸν εὐσχημόνως σε, καὶ θαμβεῖταί σου τὸ σχῆμα τὸ φρικτόν.
ltx/gr_gr_cog/tr.d070:trMA.Encomia146.text	Ὑπὸ γῆν βουλήσει, κατελθὼν ὡς θνητός, ἐπανάγεις ἀπὸ γῆς πρὸς οὐράνια, τοὺς ἐκεῖθεν πεπτωκότας Ἰησοῦ.
ltx/gr_gr_cog/tr.d070:trMA.Encomia147.text	Κἂν νεκρὸς ὡράθης, ἀλλὰ ζῶν ὡς Θεός, νεκρωθέντας τοὺς βροτοὺς ἀνεζώωσας, τὸν ἐμὸν ἀπονεκρώσας νεκρωτήν.
ltx/gr_gr_cog/tr.d070:trMA.Encomia148.text	Ὢ χαρὰς ἐκείνης! ὢ πολλῆς ἡδονῆς! Ἰησοῦ ἧς τοὺς ἐν ᾍδῃ πεπλήρωκας, ἐν πυθμέσι φῶς ἀστράψας ζοφεροῖς.
ltx/gr_gr_cog/tr.d070:trMA.Encomia149.text	Προσκυνῶ τὸ Πάθος, ἀνυμνῶ τὴν Ταφήν, μεγαλύνω σου τὸ κράτος Φιλάνθρωπε, διʼ ὧν λέλυμαι παθῶν φθοροποιῶν.
ltx/gr_gr_cog/tr.d070:trMA.Encomia150.text	Κατὰ σοῦ ῥομφαία, ἑστιλβοῦτο Χριστέ, καὶ ῥομφαία ἰσχυροῦ μὲν ἀμβλύνεται, καὶ ῥομφαία δὲ τροποῦται τῆς Ἐδέμ.
ltx/gr_gr_cog/tr.d070:trMA.Encomia151.text	Ἡ Ἀμνὰς τὸν Ἄρνα, βλέπουσα ἐν σφαγῇ, ταῖς αἰκίσι βαλλομένη ἠλάλαζε, συγκινοῦσα καὶ τὸ ποίμνιον βοᾶν.
ltx/gr_gr_cog/tr.d070:trMA.Encomia152.text	Κἂν ἐνθάπτῃ τάφῳ, κἂν εἰς ᾍδου μολῇς, ἀλλὰ Σῶτερ καὶ τοὺς τάφους ἐκένωσας, καὶ τὸν ᾍδην ἀπεγύμνωσας Χριστέ.
ltx/gr_gr_cog/tr.d070:trMA.Encomia153.text	Ἑκουσίως Σῶτερ, κατελθὼν ὑπὸ γῆν, νεκρωθέντας τοὺς βροτοὺς ἀνεζώωσας, καὶ ἀνήγαγες ἐν δόξῃ πατρικῇ.
ltx/gr_gr_cog/tr.d070:trMA.Encomia154.text	Τῆς Τριάδος ὁ εἷς, ἐν σαρκὶ διʼ ἡμᾶς, ἐπονείδιστον ὑπέμεινε θάνατον· φρίττει ἥλιος, καὶ τρέμει δὲ ἡ γῆ.
ltx/gr_gr_cog/tr.d070:trMA.Encomia155.text	Ὡς πικρᾶς ἐκ κρήνης, τῆς Ἰούδα φυλῆς, οἱ ἀπόγονοι ἐν λάκκῳ κατέθεντο, τὸν τροφέα μανναδότην Ἰησοῦν.
ltx/gr_gr_cog/tr.d070:trMA.Encomia156.text	Ὁ Κριτὴς ὡς κριτός, πρὸ Πιλάτου κριτοῦ, καὶ παρίστατο καὶ θάνατον ἄδικον, κατεκρίθη διὰ ξύλου σταυρικοῦ.
ltx/gr_gr_cog/tr.d070:trMA.Encomia157.text	Ἀλαζὼν Ἰσραήλ, μιαιφόνε λαέ, τί παθῶν τὸν Βαραββᾶν ἠλευθέρωσας; τὸν Σωτῆρα δὲ παρέδωκας Σταυρῷ;
ltx/gr_gr_cog/tr.d070:trMA.Encomia158.text	Ὁ χειρί σου πλάσας, τὸν Ἀδὰμ ἐκ τῆς γῆς, διʼ αὐτὸν τῇ φύσει γέγονας ἄνθρωπος, καὶ ἐσταύρωσαι βουλήματι τῷ σῷ.
ltx/gr_gr_cog/tr.d070:trMA.Encomia159.text	Ὑπακούσας Λόγε, τῷ ἰδίῳ Πατρί, μέχρις ᾍδου τοῦ δεινοῦ καταβέβηκας, καὶ ἀνέστησας τὸ γένος τῶν βροτῶν.
ltx/gr_gr_cog/tr.d070:trMA.Encomia160.text	Οἴμοι φῶς τοῦ Κόσμου! οἴμοι φῶς τὸ ἐμόν! Ἰησοῦ μου ποθεινότατε ἔκραζεν, ἡ Παρθένος θρηνῳδοῦσα γοερῶς.
ltx/gr_gr_cog/tr.d070:trMA.Encomia161.text	Φθονουργέ, φονουργέ, καὶ ἀλάστορ λαέ, κἂν σινδόνας καὶ αὐτὸ τὸ σουδάριον, αἰσχύνθητι, ἀναστάντος τοῦ Χριστοῦ.
ltx/gr_gr_cog/tr.d070:trMA.Encomia162.text	Δεῦρο δὴ μιαρέ, φονευτὰ μαθητά, καὶ τὸν τρόπον τῆς κακίας σου δεῖξόν μοι, διʼ ὃν γέγονας προδότης τοῦ Χριστοῦ.
ltx/gr_gr_cog/tr.d070:trMA.Encomia163.text	Ὡς φιλάνθρωπός τις, ὑποκρίνῃ μωρέ, καὶ τυφλὲ πανωλεθρότατε ἄσπονδε, ὁ τὸ μύρον πεπρακὼς διὰ τιμῆς.
ltx/gr_gr_cog/tr.d070:trMA.Encomia164.text	Οὐρανίου μύρου, ποίαν ἔσχες τιμήν; τοῦ τιμίου τί ἐδέξω ἀντάξιον; λύσσαν εὗρες καταρώτατε Σατάν.
ltx/gr_gr_cog/tr.d070:trMA.Encomia165.text	Εἰ φιλόπτωχος εἶ, καὶ τὸ μύρον λυπῇ, κενουμένου εἰς ψυχῆς ἱλαστήριον, πῶς χρυσῷ ἀπεμπολεῖς τὸν Φωταυγῆ;
ltx/gr_gr_cog/tr.d070:trMA.Encomia166.text	Ὦ Θεὲ καὶ Λόγε, ὦ χαρὰ ἡ ἐμή, πῶς ἐνέγκω σου ταφὴν τὴν τριήμερον; νῦν σπαράττομαι τὰ σπλάγχνα μητρικῶς.
ltx/gr_gr_cog/tr.d070:trMA.Encomia167.text	Τίς μοι δώσει ὕδωρ, καὶ δακρύων πηγάς, ἡ Θεόνυμφος Παρθένος ἐκραύγαζεν, ἵνα κλαύσω τὸν γλυκύν μου Ἰησοῦν;
ltx/gr_gr_cog/tr.d070:trMA.Encomia168.text	Ὢ βουνοὶ καὶ νάπαι, καὶ ἀνθρώπων πληθύς, [οἴμοι!] κλαύσατε καὶ πάντα θρηνήσατε, σὺν ἐμοὶ τῇ τοῦ Θεοῦ ἡμῶν Μητρί.
ltx/gr_gr_cog/tr.d070:trMA.Encomia169.text	Πότε ἴδω Σῶτερ, σὲ τὸ ἄχρονον φῶς, τὴν χαρὰν καὶ ἡδονὴν τῆς καρδίας μου; ἡ Παρθένος ἀνεβόα γοερῶς.
ltx/gr_gr_cog/tr.d070:trMA.Encomia170.text	Κἂν ὡς πέτρα Σῶτερ, ἡ ἀκρότομος σύ, κατεδέξω τὴν τομήν, ἀλλʼ ἐπήγασας, ζῶν τὸ ῥείθρον, ὡς πηγὴ ὢν τῆς ζωῆς.
ltx/gr_gr_cog/tr.d070:trMA.Encomia171.text	Ὡς ἐκ κρήνης μιᾶς, τὸν διπλοῦν ποταμόν, τῆς πλευρᾶς σου προχεούσης ἀρδόμενοι, τὴν ἀθάνατον καρπούμεθα ζωήν.
ltx/gr_gr_cog/tr.d070:trMA.Encomia172.text	Θέλων ὤφθης Λόγε, ἐν τῷ τάφῳ νεκρός, ἀλλὰ ζῇς, καὶ τοὺς βροτοὺς ὡς προείρηκας, ἀναστάσει σου Σωτήρ μου ἐγερεῖς.
ltx/gr_gr_cog/tr.d070:trMA.Encomia1F.text	@ltx/gr_gr_cog/tr.d070:trMA.Encomia101.text
ltx/gr_gr_cog/tr.d070:trMA.Encomia1T.text	Μακαρίζομέν σε, Θεοτόκε ἁγνή, καὶ τιμῶμεν τὴν Ταφὴν τὴν τριήμερον, τοῦ Υἱοῦ σου καὶ Θεοῦ ἡμῶν πιστῶς.
ltx/gr_gr_cog/tr.d070:trMA.Encomia1Tr.text	Ἀνυμνοῦμεν Λόγε σὲ τὸν πάντων Θεόν, σὺν Πατρὶ καὶ τῷ Ἁγίῳ σου Πνεύματι, καὶ δοξάζομεν τὴν θείαν σου Ταφήν.
ltx/gr_gr_cog/tr.d070:trMA.Encomia200.mode	@ltx/gr_gr_cog/miscellanea:misc.Mode5
ltx/gr_gr_cog/tr.d070:trMA.Encomia200.title	Στάσις Βʹ.
ltx/gr_gr_cog/tr.d070:trMA.Encomia201.text	Ἄξιόν ἐστι, μεγαλύνειν σε τὸν Ζωοδότην, τὸν ἐν τῷ Σταυρῷ τὰς χεῖρας ἐκτείναντα, καὶ συντρίψαντα τὸ κράτος τοῦ ἐχθροῦ.
ltx/gr_gr_cog/tr.d070:trMA.Encomia202.text	Ἄξιόν ἐστι, μεγαλύνειν σε τὸν πάντων Κτίστην· τοῖς σοῖς γὰρ παθήμασιν ἔχομεν, τὴν ἀπάθειαν ῥυσθέντες τῆς φθορᾶς.
ltx/gr_gr_cog/tr.d070:trMA.Encomia203.text	Ἔφριξεν ἡ γῆ, καὶ ὁ ἥλιος Σῶτερ ἐκρύβη, σοῦ τοῦ ἀνεσπέρου φέγγους Χριστέ, δύναντος ἐν τάφῳ σωματικῶς.
ltx/gr_gr_cog/tr.d070:trMA.Encomia204.text	Ὕπνωσας Χριστέ, τὸν φυσίζωον ὕπνον ἐν τάφῳ, καὶ βαρέως ὕπνου ἐξήγειρας, τοῦ τῆς ἁμαρτίας, τὸ τῶν ἀνθρώπων γένος.
ltx/gr_gr_cog/tr.d070:trMA.Encomia205.text	Μόνη γυναικῶν, χωρὶς πόνον ἔτεκόν σε Τέκνον, πόνους δὲ νῦν φέρω πάθει τῷ σῷ, ἀφορήτους, ἔλεγεν ἡ Σεμνή.
ltx/gr_gr_cog/tr.d070:trMA.Encomia206.text	Ἄνω σε Σωτήρ, ἀχωρίστως τῷ Πατρὶ συνόντα, κάτω δὲ νεκρὸν ἡπλωμένον γῇ, φρίττουσιν ὁρῶντα τὰ Σεραφίμ.
ltx/gr_gr_cog/tr.d070:trMA.Encomia207.text	Ῥήγνυται ναοῦ, καταπέτασμα τῇ σῇ σταυρώσει, κρύπτουσι φωστῆρες Λόγε τὸ φῶς, σοῦ κρυβέντος Ἥλιε ὑπὸ γῆν.
ltx/gr_gr_cog/tr.d070:trMA.Encomia208.text	Γῆς ὁ καταρχάς, μόνῳ νεύματι πήξας τὸν γῦρον, ἄπνους ὡς βροτὸς καθυπέδυ γῆν· φρῖξον τῷ θεάματι Οὐρανέ.
ltx/gr_gr_cog/tr.d070:trMA.Encomia209.text	Ἔδυς ὑπὸ γῆν, ὁ τὸν ἄνθρωπον χειρί σου πλάσας, ἵνʼ ἐξαναστήσῃς τοῦ πτώματος, τῶν βροτῶν τὰ στίφη, πανσθενεστάτῳ κράτει.
ltx/gr_gr_cog/tr.d070:trMA.Encomia210.text	Θρῆνον ἱερόν, δεῦτε ᾄσωμεν Χριστῷ θανόντι, ὡς αἱ Μυροφόροι γυναῖκες πρίν, ἵνα καὶ τὸ Χαῖρε ἀκουσώμεθα σὺν αὐταῖς.
ltx/gr_gr_cog/tr.d070:trMA.Encomia211.text	Μύρον ἀληθῶς, σὺ ἀκένωτον ὑπάρχεις Λόγε· ὅθεν σοι καὶ μύρα προσέφερον, ὡς νεκρῷ τῷ ζῶντι, γυναῖκες Μυροφόροι.
ltx/gr_gr_cog/tr.d070:trMA.Encomia212.text	ᾍδου μὲν ταφείς, τὰ βασίλεια Χριστὲ συντρίβεις, θάνατον θανάτῳ δὲ θανατοῖς, καὶ φθορᾶς λυτροῦσαι τοὺς γηγενεῖς.
ltx/gr_gr_cog/tr.d070:trMA.Encomia213.text	Ῥεῖθρα τῆς ζωῆς, ἡ προχέουσα Θεοῦ σοφία, τάφον ὑπεισδῦσα ζωοποιεῖ, τοὺς ἐν τοῖς ἀδύτοις ᾍδου μυχοῖς.
ltx/gr_gr_cog/tr.d070:trMA.Encomia214.text	Ἵνα τὴν βροτῶν, καινουργήσω συντριβεῖσαν φύσιν, πέπληγμαι θανάτῳ θέλων σαρκί. Μῆτερ οὖν μὴ κόπτου τοῖς ὀδυρμοῖς.
ltx/gr_gr_cog/tr.d070:trMA.Encomia215.text	Ἔδυς ὑπὸ γῆν, ὁ φωσφόρος τῆς δικαιοσύνης, καὶ νεκροὺς ὥσπερ ἐξ ὕπνου ἐξήγειρας, ἐκδιώξας ἅπαν, τὸ ἐν τῷ ᾍδῃ σκότος.
ltx/gr_gr_cog/tr.d070:trMA.Encomia216.text	Κόκκος διφυής, ὁ φυσίζωος ἐν γῆς λαγόσι, σπείρεται σὺν δάκρυσι σήμερον, ἀλλʼ ἀναβλαστήσας, Κόσμον χαροποιήσει.
ltx/gr_gr_cog/tr.d070:trMA.Encomia217.text	Ἕπτηξεν Ἀδάμ, Θεοῦ βαίνοντος ἐν Παραδείσῳ, χαίρει δὲ πρὸς ᾍδην φοιτήσαντος, πεπτωκὸς τὸ πρῴην, καὶ νῦν ἐγηγερμένος.
ltx/gr_gr_cog/tr.d070:trMA.Encomia218.text	Σπένδει σοι χοάς, ἡ τεκοῦσά σε Χριστὲ δακρύων, σαρκικῶς κατατεθέντι ἐν μνήματι, ἐκβοῶσα· Τέκνον, ἀνάστα ὡς προέφης.
ltx/gr_gr_cog/tr.d070:trMA.Encomia219.text	Τάφῳ Ἰωσήφ, εὐλαβῶς σε τῷ καινῷ συγκρύπτων, ὕμνους ἐξοδίους θεοπρεπεῖς, τοῖς συμμίκτοις θρήνοις μέλπει σοι Σωτήρ.
ltx/gr_gr_cog/tr.d070:trMA.Encomia220.text	Ἥλοις σε Σταυρῷ, πεπαρμένον ἡ σὴ Μήτηρ Λόγε, βλέψασα τοῖς ἥλοις λύπης πικρᾶς, βέβληται καὶ βέλεσι τὴν ψυχήν.
ltx/gr_gr_cog/tr.d070:trMA.Encomia221.text	Σὲ τὸν τοῦ παντός, γλυκασμὸν ἡ Μήτηρ καθορῶσα, πόμα ποτιζόμενον τὸ πικρόν, δάκρυσι τὰς ὄψεις βρέχει πικρῶς.
ltx/gr_gr_cog/tr.d070:trMA.Encomia222.text	Τέτρωμαι δεινῶς, καὶ σπαράττομαι τὰ σπλάγχνα Λόγε, βλέπουσα τὴν ἄδικόν σου σφαγήν, ἔλεγεν ἡ Πάναγνος ἐν κλαυθμῷ.
ltx/gr_gr_cog/tr.d070:trMA.Encomia223.text	Ὄμμα τὸ γλυκύ, καὶ τὰ χείλη σου πῶς μύσω Λόγε; πῶς νεκροπρεπῶς δὲ κηδεύσω σε; φρίττων ἀνεβόα ὁ Ἰωσήφ.
ltx/gr_gr_cog/tr.d070:trMA.Encomia224.text	Ὕμνους Ἰωσήφ, καὶ Νικόδημος ἐπιταφίους, ᾄδουσι Χριστῷ νεκρωθέντι νῦν· ᾄδει δὲ σὺν τούτοις καὶ Σεραφίμ.
ltx/gr_gr_cog/tr.d070:trMA.Encomia225.text	Δύνεις ὑπὸ γῆν, Σῶτερ Ἥλιε δικαιοσύνης· ὅθεν ἡ τεκοῦσα Σελήνη σε, ταῖς λύπαις ἐκλείπει, σῆς θέας στερουμένη.
ltx/gr_gr_cog/tr.d070:trMA.Encomia226.text	Ἔφριξεν ὁρῶν, Σῶτερ, ᾍδης σε τὸν ζωοδότην, πλοῦτον τὸν ἐκείνου σκυλεύοντα, καὶ τοὺς ἀπʼ αἰῶνας, νεκροὺς ἐξανιστῶντα.
ltx/gr_gr_cog/tr.d070:trMA.Encomia227.text	Ἥλιος φαιδρόν, ἀπαστράπτει μετὰ νύκτα Λόγε· καὶ σὺ δʼ ἀναστὰς ἐξαστράψειας, μετὰ θάνατον φαιδρῶς ὡς ἐκ παστοῦ.
ltx/gr_gr_cog/tr.d070:trMA.Encomia228.text	Γῆ σε πλαστουργέ, ὑπὸ κόλπους δεξαμένη τρόμῳ, συσχεθεῖσα Σῶτερ τινάσσεται, ἀφυπνώσασα νεκροὺς τῷ τιναγμῷ.
ltx/gr_gr_cog/tr.d070:trMA.Encomia229.text	Μύροις σε Χριστέ, ὁ Νικόδημος καὶ ὁ Εὐσχήμων, νῦν καινοπρεπῶς περιστείλαντες· Φρῖξον, ἀνεβόων, πᾶσα ἡ γῆ.
ltx/gr_gr_cog/tr.d070:trMA.Encomia230.text	Ἔδυς Φωτουργέ, καὶ συνέδυ σοι τὸ φῶς ἡλίου· τρόμῳ δὲ ἡ Κτίσις συνεχεται, πάντων σε κηρύττουσα Ποιητήν.
ltx/gr_gr_cog/tr.d070:trMA.Encomia231.text	Λίθος λαξευτός, τὸν ἀκρόγωνον καλύπτει λίθον· ἄνθρωπος θνητὸς δʼ ὡς θνητὸν Θεόν, κρύπτει νῦν τῷ τάφῳ· φρίξον ἡ γῆ!
ltx/gr_gr_cog/tr.d070:trMA.Encomia232.text	Ἴδε Μαθητήν, ὃν ἠγάπησας καὶ σὴν Μητέρα, Τέκνον, καὶ φθογγὴν δὸς γλυκύτατον, ἔκραζε δακρύουσα ἡ Ἁγνή.
ltx/gr_gr_cog/tr.d070:trMA.Encomia233.text	Σὺ ὡς ὢν ζωῆς, χορηγὸς Λόγε τοὺς Ἰουδαίους, ἐν Σταυρῷ ταθεὶς οὐκ ἐνέκρωσας· ἀλλʼ ἀνέστησας καὶ τούτων τοὺς νεκρούς.
ltx/gr_gr_cog/tr.d070:trMA.Encomia234.text	Κάλλος Λόγε πρίν, οὐδὲ εἶδος ἐν τῷ πάσχειν ἔσχες, ἀλλʼ ἐξαναστὰς ὑπερέλαμψας, καλλωπίσας τους βροτοὺς θείαις αὐγαῖς.
ltx/gr_gr_cog/tr.d070:trMA.Encomia235.text	Ἔδυς τῇ σαρκί, ὁ ἀνέσπερος εἰς γῆν φωσφόρος· καὶ μὴ φέρων βλέπειν ὁ ἥλιος, ἐσκοτίσθη μεσημβρίας ἐν ἀκμῇ.
ltx/gr_gr_cog/tr.d070:trMA.Encomia236.text	Ἥλιος ὁμοῦ, καὶ σελήνη σκοτισθέντες Σῶτερ, δούλους εὐνοοῦντας εἰκόνιζον, οἳ μελαίνας ἀμφιέννυνται στολάς.
ltx/gr_gr_cog/tr.d070:trMA.Encomia237.text	Οἶδέ σε Θεόν, Ἑκατόνταρχος κἂν ἐνεκρώθης· πῶς σὲ οὖν Θεέ μου ψαύσω χερσί; φρίττω, ἀνεβόα ὁ Ἰωσήφ.
ltx/gr_gr_cog/tr.d070:trMA.Encomia238.text	Ὕπνωσεν Ἀδάμ, ἀλλὰ θάνατον πλευρᾶς ἐξάγει· σὺ δὲ νῦν ὑπνώσας Λόγε Θεοῦ, βρύεις ἐκ πλευρᾶς σου Κόσμῳ ζωήν.
ltx/gr_gr_cog/tr.d070:trMA.Encomia239.text	Ὕπνωσας μικρόν, καὶ ἐζώωσας τοὺς τεθνεῶτας, καὶ ἐξαναστὰς ἐξανέστησας, τοὺς ὑπνοῦντας ἐξ αἰῶνος Ἀγαθέ.
ltx/gr_gr_cog/tr.d070:trMA.Encomia240.text	Ἤρθης ἀπὸ γῆς, ἀλλʼ ἀνέβλυσας τῆς σωτηρίας, τὸν οἶνον ζωήῤῥυτε ἄμπελε· Δοξάζω τὸ Πάθος καὶ τὸν Σταυρόν.
ltx/gr_gr_cog/tr.d070:trMA.Encomia241.text	Πῶς οἱ νοεροί, Ταγματάρχαι σε Σωτὴρ ὁρῶντες, γυμνὸν ᾑμαγμένον κατάκριτον, ἔφερον τὴν τόλμαν τῶν σταυρωτῶν;
ltx/gr_gr_cog/tr.d070:trMA.Encomia242.text	Ἀραβιανόν, σκολιώτατον γένος Ἑβραίων, ἔγνως τὴν ἀνέγερσιν τοῦ ναοῦ· διὰ τί κατέκρινας τὸν Χριστόν;
ltx/gr_gr_cog/tr.d070:trMA.Encomia243.text	Χλαῖναν ἐμπαιγμοῦ, τὸν Κοσμήτορα πάντων ἐνδύεις, ὃς τὸν οὐρανὸν κατεστέρωσε, καὶ τὴν γῆν ἐκόσμησε θαυμαστῶς.
ltx/gr_gr_cog/tr.d070:trMA.Encomia244.text	Ὥσπερ πελεκάν, τετρωμένος τὴν πλευράν σου Λόγε, σοὺς θανέντας παῖδας ἐζώωσας, ἐπιστάξας ζωτικοὺς αὐτοῖς κρουνούς.
ltx/gr_gr_cog/tr.d070:trMA.Encomia245.text	Ἥλιον τὸ πρίν, Ἰησοῦς τοὺς ἀλλοφύλους κόπτων, ἔστησεν· αὐτὸς δὲ ἀπέκρυψας, καταβάλλων τὸν τοῦ σκότους ἀρχηγόν.
ltx/gr_gr_cog/tr.d070:trMA.Encomia246.text	Κόλπων πατρικῶν, ἀνεκφοίτητος μείνας Οἰκτίρμον, καὶ βροτὸς γενέσθαι εὐδόκησας, καὶ εἰς ᾍδην καταβέβηκας Χριστέ.
ltx/gr_gr_cog/tr.d070:trMA.Encomia247.text	Ἤρθη σταυρωθείς, ὁ ἐν ὕδασι τὴν γῆν κρεμάσας, καὶ ὡς ἄπνους ἐν αὐτῇ νῦν προσκλίνεται, ὃ μὴ φέρουσα ἐσείετο δεινῶς.
ltx/gr_gr_cog/tr.d070:trMA.Encomia248.text	Οἴμοι ὦ Υἱέ! ἡ Ἀπείρανδρος θρηνεῖ καὶ λέγει· ὃν ὡς Βασιλέα γὰρ ἤλπιζον, κατάκριτον νῦν βλέπω ἐν Σταυρῷ.
ltx/gr_gr_cog/tr.d070:trMA.Encomia249.text	Ταῦτα Γαβριήλ, μοὶ ἀπήγγειλεν ὅτε κατέπτη, ὃς τὴν Βασιλείαν αἰώνιον, ἔφη τοῦ Υἱοῦ μου τοῦ Ἰησοῦ.
ltx/gr_gr_cog/tr.d070:trMA.Encomia250.text	Φεῦ! τοῦ Συμεών, ἐκτετέλεσται ἡ προφητεία· ἡ γὰρ σὴ ῥομφαία διέδραμε, τὴν ἐμὴν καρδίαν Ἐμμανουήλ.
ltx/gr_gr_cog/tr.d070:trMA.Encomia251.text	Κἂν τοὺς ἐκ νεκρῶν, ἐπαισχύνθητε ὦ Ἰουδαῖοι, οὓς ὁ ζωοδότης ἀνέστησεν, ὃν ὑμεῖς ἐκτείνατε φθονερῶς
ltx/gr_gr_cog/tr.d070:trMA.Encomia252.text	Ἔφριξεν ἰδών, τὸ ἀόρατον φῶς σὲ Χριστέ μου, μνήματι κρυπτόμενον ἄπνουν τε, καὶ ἐσκότασεν ὁ ἥλιος τὸ φῶς.
ltx/gr_gr_cog/tr.d070:trMA.Encomia253.text	Ἔκλαιε πικρῶς, ἡ πανάμωμος Μήτηρ σου Λόγε, ὅτε ἐν τῷ τάφῳ ἑώρακε, σὲ τὸν ἄφραστον καὶ ἄναρχον Θεόν.
ltx/gr_gr_cog/tr.d070:trMA.Encomia254.text	Νέκρωσιν τὴν σήν, ἡ πανάφθορος Χριστέ σου Μήτηρ, βλέπουσα πικρῶς σοι ἐφθέγγετο· Μὴ βραδύνῃς ἡ ζωὴ ἐν τοῖς νεκροῖς.
ltx/gr_gr_cog/tr.d070:trMA.Encomia255.text	ᾍδης ὁ δεινός, συνετρόμαξεν ὅτε σε εἶδεν, Ἤλιε τῆς δόξης ἀθάνατε, καὶ ἐδίδου τοὺς δεσμίους ἐν σπουδῇ.
ltx/gr_gr_cog/tr.d070:trMA.Encomia256.text	Μέγα καὶ φρικτόν, Σῶτερ θέαμα νῦν καθορᾶται! ὁ ζωῆς γὰρ θέλων παραίτιος, θάνατον ὑπέστη, ζωῶσαι θέλων πάντας.
ltx/gr_gr_cog/tr.d070:trMA.Encomia257.text	Νύττῃ τὴν πλευράν, καὶ ἡλοῦσαι Δέσποτα τὰς χεῖρας, πληγὴν ἐκ πλευρᾶς σου ἰώμενος, καὶ τὴν ἀκρασίαν, χειρῶν τῶν Προπατόρων.
ltx/gr_gr_cog/tr.d070:trMA.Encomia258.text	Πρὶν τὸν τῆς Ῥαχήλ, υἱὸν ἔκλαυσεν ἅπας κατʼ οἶκον· νῦν τὸν τῆς Παρθένου ἐκόψατο, Μαθητῶν χορεία σὺν τῇ Μητρί.
ltx/gr_gr_cog/tr.d070:trMA.Encomia259.text	Ῥάπισμα χειρῶν, Χριστοῦ δέδωκαν ἐν σιαγόνι, τοῦ χειρὶ τὸν ἄνθρωπον πλάσαντος, καὶ τὰς μύλας θλάσαντος τοῦ θηρός.
ltx/gr_gr_cog/tr.d070:trMA.Encomia260.text	Ὕμνοις σου Χριστέ, νῦν τὴν Σταύρωσιν καὶ τὴν Ταφήν τε, ἅπαντες πιστοὶ ἐκθειάζομεν, οἱ θανάτου λυτρωθέντες σῇ ταφῇ.
ltx/gr_gr_cog/tr.d070:trMA.Encomia2F.text	@ltx/gr_gr_cog/tr.d070:trMA.Encomia201.text
ltx/gr_gr_cog/tr.d070:trMA.Encomia2T.text	Τέξασα ζωήν, Παναμώμητε ἁγνὴ Παρθένε, παῦσον Ἐκκλησίας τὰ σκάνδαλα, καὶ βράβευσον εἰρήνην ὡς ἀγαθή.
ltx/gr_gr_cog/tr.d070:trMA.Encomia2Tr.text	Ἄναρχε Θεέ, συναΐδιε Λόγε καὶ Πνεῦμα, σκῆπτρα τῶν Ἀνάκτων κραταίωσον, κατὰ πολεμίων ὡς ἀγαθός.
ltx/gr_gr_cog/tr.d070:trMA.Encomia300.mode	@ltx/gr_gr_cog/miscellanea:misc.Mode3
ltx/gr_gr_cog/tr.d070:trMA.Encomia300.title	Στάσις Γʹ.
ltx/gr_gr_cog/tr.d070:trMA.Encomia301.text	Αἱ γενεαὶ πᾶσαι, ὕμνον τῇ Ταφῇ σου, προσφέρουσι Χριστέ μου.
ltx/gr_gr_cog/tr.d070:trMA.Encomia302.text	Καθελὼν τοῦ ξύλου, ὁ Ἀριμαθαίας, ἐν τάφῳ σε κηδεύει.
ltx/gr_gr_cog/tr.d070:trMA.Encomia303.text	Μυροφόροι ἦλθον, μύρα σοι Χριστέ μου, κομίζουσαι προφρόνως.
ltx/gr_gr_cog/tr.d070:trMA.Encomia304.text	Δεῦρο πᾶσα κτίσις, ὕμνους ἐξοδίους, προσοίσωμεν τῷ Κτίστῃ.
ltx/gr_gr_cog/tr.d070:trMA.Encomia305.text	Ὡς νεκρὸν τὸν ζῶντα, σὺν Μυροφόροις πάντες, μυρίσωμεν ἐμφρόνως.
ltx/gr_gr_cog/tr.d070:trMA.Encomia306.text	Ἰωσὴφ τρισμάκαρ, κήδευσον τὸ σῶμα, Χριστοῦ τοῦ ζωοδότου.
ltx/gr_gr_cog/tr.d070:trMA.Encomia307.text	Οὓς ἔθρεψε τὸ μάννα, ἐκίνησαν τὴν πτέρναν, κατὰ τοῦ Εὐεργέτου.
ltx/gr_gr_cog/tr.d070:trMA.Encomia308.text	Οὓς ἔθρεψε τὸ μάννα, φέρουσι τῷ Σωτῆρι, χολὴν ἅμα καὶ ὄξος.
ltx/gr_gr_cog/tr.d070:trMA.Encomia309.text	Ὢ τῆς παραφροσύνης, καὶ τῆς Χριστοκτονίας, τῆς τῶν προφητοκτόνων!
ltx/gr_gr_cog/tr.d070:trMA.Encomia310.text	Ὡς ἄφρων ὑπηρέτης, προδέδωκεν ὁ μύστης, τὴν ἄβυσσον σοφίας.
ltx/gr_gr_cog/tr.d070:trMA.Encomia311.text	Τὸν Ῥύστην ὁ πωλήσας, αἰχμάλωτος κατέστη, ὁ δόλιος Ἰούδας.
ltx/gr_gr_cog/tr.d070:trMA.Encomia312.text	Κατὰ τὸν Σολομῶντα, βόθρος βαθὺς τὸ στόμα, Ἑβραίων παρανόμων.
ltx/gr_gr_cog/tr.d070:trMA.Encomia313.text	Ἑβραίων παρανόμων, ἐν σκολιαῖς πορείαις, τρίβολοι καὶ παγίδες.
ltx/gr_gr_cog/tr.d070:trMA.Encomia314.text	Ἰωσὴφ κηδεύει, σὺν τῷ Νικοδήμῳ, νεκροπρεπῶς τὸν Κτίστην.
ltx/gr_gr_cog/tr.d070:trMA.Encomia315.text	Ζωοδότα Σῶτερ, δόξα σου τῷ κράτει, τὸν ᾍδην καθελόντι.
ltx/gr_gr_cog/tr.d070:trMA.Encomia316.text	Ὕπτιον ὁρῶσα, ἡ Πάναγνός σε Λόγε, μητροπρεπῶς ἐθρήνει.
ltx/gr_gr_cog/tr.d070:trMA.Encomia317.text	Ὧ γλυκύ μου ἔαρ, γλυκύτατόν μου Τέκνον, ποῦ ἔδυ σου τὸ κάλλος;
ltx/gr_gr_cog/tr.d070:trMA.Encomia318.text	Θρῆνον συνεκίνει, ἡ πάναγνός σου Μήτηρ, σοῦ Λόγε νεκρωθέντος.
ltx/gr_gr_cog/tr.d070:trMA.Encomia319.text	Γύναια σὺν μύροις, ἥκουσι μυρίσαι, Χριστὸν τὸ θεῖον μύρον.
ltx/gr_gr_cog/tr.d070:trMA.Encomia320.text	Θάνατον θανάτῳ, σὺ θανατοῖς Θεέ μου, θείᾳ σου δυναστείᾳ.
ltx/gr_gr_cog/tr.d070:trMA.Encomia321.text	Πεπλάνηται ὁ πλάνος, ὁ πλανηθεὶς λυτροῦται, σοφίᾳ σῇ Θεέ μου.
ltx/gr_gr_cog/tr.d070:trMA.Encomia322.text	Πρὸς τὸν πυθμένα ᾍδου, κατήχθη ὁ προδότης, διαφθορᾶς εἰς φρέαρ.
ltx/gr_gr_cog/tr.d070:trMA.Encomia323.text	Τρίβολοι καὶ παγίδες, ὁδοὶ τοῦ τρισαθλίου, παράφρονος Ἰούδα.
ltx/gr_gr_cog/tr.d070:trMA.Encomia324.text	Συναπολοῦνται πάντες, οἱ σταυρωταί σου Λόγε, Υἱὲ Θεοῦ παντάναξ.
ltx/gr_gr_cog/tr.d070:trMA.Encomia325.text	Διαφθορᾶς εἰς φρέαρ, συναπολοῦνται πάντες, οἱ ἄνδρες τῶν αἱμάτων.
ltx/gr_gr_cog/tr.d070:trMA.Encomia326.text	Υἱὲ Θεοῦ παντάναξ, Θεέ μου πλαστουργέ μου, πῶς πάθος κατεδέξω;
ltx/gr_gr_cog/tr.d070:trMA.Encomia327.text	Ἡ δάμαλις τὸν μόσχον, ἐν Ξύλῳ κρεμασθέντα, ἠλάλαζεν ὁρῶσα.
ltx/gr_gr_cog/tr.d070:trMA.Encomia328.text	Σῶμα τὸ ζωηφόρον, ὁ Ἰωσὴφ κηδεύει, μετὰ τοῦ Νικοδήμου.
ltx/gr_gr_cog/tr.d070:trMA.Encomia329.text	Ἀνέκραζεν ἡ Κόρη, θερμῶς δακρυῤῥοοῦσα, τὰ σπλάγχνα κεντουμένη.
ltx/gr_gr_cog/tr.d070:trMA.Encomia330.text	Ὦ φῶς τῶν ὀφθαλμῶν μου, γλυκύτατόν μου Τέκνον, πῶς τάφῳ νῦν καλύπτῃ;
ltx/gr_gr_cog/tr.d070:trMA.Encomia331.text	Τὸν Ἀδὰμ καὶ Εὔαν, ἐλευθερῶσαι Μῆτερ, μὴ θρήνει, ταῦτα πάσχω.
ltx/gr_gr_cog/tr.d070:trMA.Encomia332.text	Δοξάζω σου Υἱέ μου, τὴν ἄκραν εὐσπλαγχνίαν, ἧς χάριν ταῦτα πάσχεις.
ltx/gr_gr_cog/tr.d070:trMA.Encomia333.text	Ὄξος ἐποτίσθης, καὶ χολὴν Οἰκτίρμον, τὴν πάλαι λύων γεῦσιν.
ltx/gr_gr_cog/tr.d070:trMA.Encomia334.text	Ἰκρίῳ προσεπάγης, ὁ πάλαι τὸν λαόν σου, στύλῳ νεφέλης σκέπων.
ltx/gr_gr_cog/tr.d070:trMA.Encomia335.text	Αἱ Μυροφόροι Σῶτερ, τῷ τάφῳ προσελθοῦσαι, προσέφερόν σοι μύρα.
ltx/gr_gr_cog/tr.d070:trMA.Encomia336.text	Ἀνάστηθι Οἰκτίρμον, ἡμᾶς ἐκ τῶν βαράθρων, ἐξανιστῶν τοῦ ᾍδου.
ltx/gr_gr_cog/tr.d070:trMA.Encomia337.text	Ἀνάστα Ζωοδότα, ἡ σὲ τεκοῦσα Μήτηρ, δακρυῤῥοοῦσα λέγει.
ltx/gr_gr_cog/tr.d070:trMA.Encomia338.text	Σπεῦσον ἐξαναστῆναι, τὴν λύπην λύων Λόγε, τῆς σὲ ἁγνῶς Τεκούσης.
ltx/gr_gr_cog/tr.d070:trMA.Encomia339.text	Οὐράνιοι Δυνάμεις, ἐξέστησαν τῷ φόβῳ, νεκρόν σε καθορῶσαι.
ltx/gr_gr_cog/tr.d070:trMA.Encomia340.text	Τοῖς πόθῳ τε καὶ φόβῳ, τὰ πάθη σου τιμῶσι, δίδου πταισμάτων λύσιν.
ltx/gr_gr_cog/tr.d070:trMA.Encomia341.text	Ὢ φρικτὸν καὶ ξένον, θέαμα Θεοῦ Λόγε! πῶς γῆ σε συγκαλύπτει;
ltx/gr_gr_cog/tr.d070:trMA.Encomia342.text	Φέρων πάλαι φεύγει, Σῶτερ Ἰωσὴφ σε, καὶ νῦν σε ἄλλος θάπτει.
ltx/gr_gr_cog/tr.d070:trMA.Encomia343.text	Κλαίει καὶ θρηνεῖ σε, ἡ πάναγνός σου Μήτηρ, Σωτήρ μου νεκρωθέντα.
ltx/gr_gr_cog/tr.d070:trMA.Encomia344.text	Φρίττουσιν οἱ νόες, τὴν ξένην καὶ φρικτήν σου, Ταφὴν τοῦ πάντων Κτίστου.
ltx/gr_gr_cog/tr.d070:trMA.Encomia345.text	Ἔῤῥαναν τὸν τάφον, αἱ Μυροφόροι μύρα, λίαν πρωῒ ἐλθοῦσαι.
ltx/gr_gr_cog/tr.d070:trMA.Encomia346.text	Εἰρήνην Ἐκκλησίᾳ, λαῷ σου σωτηρίαν, δώρησαι σῇ Ἐγέρσει.
ltx/gr_gr_cog/tr.d070:trMA.Encomia3F.text	@ltx/gr_gr_cog/tr.d070:trMA.Encomia301.text
ltx/gr_gr_cog/tr.d070:trMA.Encomia3T.text	Ἰδεῖν τὴν τοῦ Υἱοῦ σου, Ἀνάστασιν Παρθένε, ἀξίωσον σοὺς δούλους.
ltx/gr_gr_cog/tr.d070:trMA.Encomia3Tr.text	Ὢ Τριὰς Θεέ μου, Πατὴρ Υἱὸς καὶ Πνεῦμα, ἐλέησον τὸν Κόσμον.
ltx/gr_gr_cog/tr.d070:trMA.Exaposteilarion1.melody	
ltx/gr_gr_cog/tr.d070:trMA.Exaposteilarion1.mode	@ltx/gr_gr_cog/miscellanea:misc.Mode2
ltx/gr_gr_cog/tr.d070:trMA.Exaposteilarion1.text	@ltx/gr_gr_cog/ho.ho03:hoMA.SunExapVerse1.text
ltx/gr_gr_cog/tr.d070:trMA.Kathisma11.greekmelody	@ltx/gr_gr_cog/he.a.m1:heAU.TonTafonSouSotir.greekname
ltx/gr_gr_cog/tr.d070:trMA.Kathisma11.incipit	Σινδόνι καθαρᾷ καὶ ἀρώμασι θείοις…
ltx/gr_gr_cog/tr.d070:trMA.Kathisma11.melody	@ltx/gr_gr_cog/he.a.m1:heAU.TonTafonSouSotir.name
ltx/gr_gr_cog/tr.d070:trMA.Kathisma11.mode	@ltx/gr_gr_cog/miscellanea:misc.Mode1
ltx/gr_gr_cog/tr.d070:trMA.Kathisma11.text	Σινδόνι καθαρᾷ καὶ ἀρώμασι θείοις, τὸ Σῶμα τὸ σεπτόν, ἐξαιτήσας Πιλάτῳ, μυρίζει καὶ τίθησιν, Ἰωσὴφ καινῷ μνήματι· ὅθεν ὄρθριαι, αἱ μυροφόροι γυναῖκες, ἀνεβόησαν· Δεῖξον ἡμῖν ὡς προεῖπας, Χριστὲ τὴν Ἀνάστασιν.
ltx/gr_gr_cog/tr.d070:trMA.Kathisma12.greekmelody	@ltx/gr_gr_cog/he.a.m1:heAU.TonTafonSouSotir.greekname
ltx/gr_gr_cog/tr.d070:trMA.Kathisma12.incipit	Δεῖξον ἡμῖν ὡς προεῖπας, Χριστὲ…
ltx/gr_gr_cog/tr.d070:trMA.Kathisma12.melody	@ltx/gr_gr_cog/he.a.m1:heAU.TonTafonSouSotir.name
ltx/gr_gr_cog/tr.d070:trMA.Kathisma12.mode	@ltx/gr_gr_cog/miscellanea:misc.Mode1
ltx/gr_gr_cog/tr.d070:trMA.Kathisma12.text	Δεῖξον ἡμῖν ὡς προεῖπας, Χριστὲ τὴν Ἀνάστασιν.
ltx/gr_gr_cog/tr.d070:trMA.Kathisma13.greekmelody	@ltx/gr_gr_cog/he.a.m1:heAU.TonTafonSouSotir.greekname
ltx/gr_gr_cog/tr.d070:trMA.Kathisma13.incipit	Ἐξέστησαν χοροί, τῶν Ἀγγέλων ὁρῶντες…
ltx/gr_gr_cog/tr.d070:trMA.Kathisma13.melody	@ltx/gr_gr_cog/he.a.m1:heAU.TonTafonSouSotir.name
ltx/gr_gr_cog/tr.d070:trMA.Kathisma13.mode	@ltx/gr_gr_cog/miscellanea:misc.Mode1
ltx/gr_gr_cog/tr.d070:trMA.Kathisma13.text	Ἐξέστησαν χοροί, τῶν Ἀγγέλων ὁρῶντες, τὸν ἐν τοῖς τοῦ Πατρός, καθεζόμενον κόλποις, πῶς τάφῳ κατατίθεται, ὡς νεκρὸς ὁ ἀθάνατος, ὃν τὰ τάγματα, τὰ τῶν Ἀγγέλων κυκλοῦσι, καὶ δοξάζουσι, σὺν τοῖς νεκροῖς ἐν τῷ ᾍδῃ, ὡς Κτίστην καὶ Κύριον.
ltx/gr_gr_cog/tr.d070:trMA.Kontakion1.incipit	Τὴν ἄβυσσον ὁ κλείσας, νεκρὸς…
ltx/gr_gr_cog/tr.d070:trMA.Kontakion1.melody	
ltx/gr_gr_cog/tr.d070:trMA.Kontakion1.mode	@ltx/gr_gr_cog/miscellanea:misc.Mode2
ltx/gr_gr_cog/tr.d070:trMA.Kontakion1.text	Τὴν ἄβυσσον ὁ κλείσας, νεκρὸς ὁρᾶται, καὶ σμύρνῃ καὶ σινδόνι ἐνειλημμένος, ἐν μνημείῳ κατατίθεται, ὡς θνητὸς ὁ ἀθάνατος. Γυναῖκες δὲ αὐτὸν ἦλθον μυρίσαι, κλαίουσαι πικρῶς καὶ ἐκβοῶσαι· Τοῦτο Σάββατόν ἐστι τὸ ὑπερευλογημένον, ἐν ᾧ, Χριστὸς ἀφυπνώσας, ἀναστήσεται τριήμερος.
ltx/gr_gr_cog/tr.d070:trMA.Lauds1.incipit	Σήμερον συνέχει τάφος, τὸν συνέχοντα…
ltx/gr_gr_cog/tr.d070:trMA.Lauds1.melody	@ltx/gr_gr_cog/miscellanea:misc.Idiomelon
ltx/gr_gr_cog/tr.d070:trMA.Lauds1.mode	@ltx/gr_gr_cog/miscellanea:misc.Mode2
ltx/gr_gr_cog/tr.d070:trMA.Lauds1.text	Σήμερον συνέχει τάφος, τὸν συνέχοντα παλάμῃ τὴν Κτίσιν, καλύπτει λίθος, τὸν καλύψαντα ἀρετῇ τοὺς οὐρανούς· ὑπνοῖ ἡ ζωή, καὶ ᾍδης τρέμει, καὶ Ἀδὰμ τῶν δεσμῶν ἀπολύεται. Δόξα τῇ σῇ οἰκονομίᾳ, διʼ ἧς τελέσας πάντα σαββατισμὸν αἰώνιον, ἐδωρήσω ἡμῖν, τὴν παναγίαν ἐκ νεκρῶν σου Ἀνάστασιν.
ltx/gr_gr_cog/tr.d070:trMA.Lauds2.incipit	Τί τὸ ὁρώμενον θέαμα; τίς…
ltx/gr_gr_cog/tr.d070:trMA.Lauds2.melody	@ltx/gr_gr_cog/miscellanea:misc.Idiomelon
ltx/gr_gr_cog/tr.d070:trMA.Lauds2.mode	@ltx/gr_gr_cog/miscellanea:misc.Mode2
ltx/gr_gr_cog/tr.d070:trMA.Lauds2.text	Τί τὸ ὁρώμενον θέαμα; τίς ἡ παροῦσα κατάπαυσις; Ὁ Βασιλεὺς τῶν αἰώνων, τὴν διὰ πάθους τελέσας οἰκονομίαν, ἐν τάφῳ σαββατίζει, καινὸν ἡμῖν παρέχων σαββατισμόν. Αὐτῷ βοήσωμεν· Ἀνάστα ὁ Θεὸς κρίνων τὴν γῆν, ὅτι σὺ βασιλεύεις εἰς τοὺς αἰῶνας, ὁ ἀμέτρητον ἔχων τὸ μέγα ἔλεος.
ltx/gr_gr_cog/tr.d070:trMA.Lauds3.incipit	Δεῦτε ἴδωμεν τὴν ζωὴν ἡμῶν…
ltx/gr_gr_cog/tr.d070:trMA.Lauds3.melody	@ltx/gr_gr_cog/miscellanea:misc.Idiomelon
ltx/gr_gr_cog/tr.d070:trMA.Lauds3.mode	@ltx/gr_gr_cog/miscellanea:misc.Mode2
ltx/gr_gr_cog/tr.d070:trMA.Lauds3.text	Δεῦτε ἴδωμεν τὴν ζωὴν ἡμῶν, ἐν τάφῳ κειμένην, ἵνα τοὺς ἐν τάφοις κειμένους ζωοποιήσῃ· δεῦτε σήμερον, τὸν ἐξ Ἰούδα ὑπνοῦντα θεώμενοι, προφητικῶς αὐτῷ ἐκβοήσωμεν· Ἀναπεσὼν κεκοίμησαι ὡς λέων, τίς ἐγερεῖ σε Βασιλεῦ; ἀλλʼ ἀνάστηθι αὐτεξουσίως, ὁ δοὺς ἑαυτὸν ὑπὲρ ἡμῶν ἑκουσίως· Κύριε δόξα σοι.
ltx/gr_gr_cog/tr.d070:trMA.Lauds4.incipit	ᾘτήσατο Ἰωσήφ, τὸ σῶμα τοῦ…
ltx/gr_gr_cog/tr.d070:trMA.Lauds4.melody	@ltx/gr_gr_cog/miscellanea:misc.Idiomelon
ltx/gr_gr_cog/tr.d070:trMA.Lauds4.mode	@ltx/gr_gr_cog/miscellanea:misc.Mode6
ltx/gr_gr_cog/tr.d070:trMA.Lauds4.text	ᾘτήσατο Ἰωσήφ, τὸ σῶμα τοῦ Ἰησοῦ, καὶ ἀπέθετο ἐν τῷ καινῷ αὐτοῦ μνημείῳ· ἔδει γὰρ αὐτὸν ἐκ τάφου, ὡς ἐκ παστάδος προελθεῖν. Ὁ συντρίψας κράτος θανάτου, καὶ ἀνοίξας πύλας Παραδείσου ἀνθρώποις, δόξα σοι.
ltx/gr_gr_cog/tr.d070:trMA.LaudsGlory.incipit	Τὴν σήμερον μυστικῶς, ὁ μέγας…
ltx/gr_gr_cog/tr.d070:trMA.LaudsGlory.melody	@ltx/gr_gr_cog/miscellanea:misc.Idiomelon
ltx/gr_gr_cog/tr.d070:trMA.LaudsGlory.mode	@ltx/gr_gr_cog/miscellanea:misc.Mode6
ltx/gr_gr_cog/tr.d070:trMA.LaudsGlory.text	Τὴν σήμερον μυστικῶς, ὁ μέγας Μωϋσῆς προδιετυποῦτο λέγων· Καὶ εὐλόγησεν ὁ Θεός, τὴν ἡμέραν τὴν ἑβδόμην· τοῦτο γάρ ἐστι τὸ εὐλογημένον Σάββατον, αὕτη ἐστίν ἡ τῆς καταπαύσεως ἡμέρα, ἐν ᾗ κατέπαυσεν ἀπὸ πάντων τῶν ἔργων αὐτοῦ, ὁ Μονογενὴς Υἱὸς τοῦ Θεοῦ, διὰ τῆς κατὰ τὸν θάνατον οἰκονομίας, τῇ σαρκὶ σαββατίσας, καὶ εἰς ὃ ἦν, πάλιν ἐπανελθών, διὰ τῆς Ἀναστάσεως, ἐδωρήσατο ἡμῖν ζωὴν τὴν αἰώνιον, ὡς μόνος ἀγαθὸς καὶ φιλάνθρωπος.
ltx/gr_gr_cog/tr.d070:trMA.LaudsTheotokion.incipit	@ltx/gr_gr_cog/oc.m2.d1:ocMA.Kathisma23.incipit
ltx/gr_gr_cog/tr.d070:trMA.LaudsTheotokion.melody	
ltx/gr_gr_cog/tr.d070:trMA.LaudsTheotokion.mode	@ltx/gr_gr_cog/miscellanea:misc.Mode2
ltx/gr_gr_cog/tr.d070:trMA.LaudsTheotokion.text	@ltx/gr_gr_cog/oc.m2.d1:ocMA.Kathisma23.text
ltx/gr_gr_cog/tr.d070:trMA.MM.Evlogetaria1.text	@ltx/gr_gr_cog/properties:media.key
ltx/gr_gr_cog/tr.d070:trMA.MM.Evlogetaria2.text	@ltx/gr_gr_cog/properties:media.key
ltx/gr_gr_cog/tr.d070:trMA.MM.Evlogetaria3.text	@ltx/gr_gr_cog/properties:media.key
ltx/gr_gr_cog/tr.d070:trMA.MM.Evlogetaria4.text	@ltx/gr_gr_cog/properties:media.key
ltx/gr_gr_cog/tr.d070:trMA.MM.Evlogetaria5.text	@ltx/gr_gr_cog/properties:media.key
ltx/gr_gr_cog/tr.d070:trMA.MM.Evlogetaria6.text	@ltx/gr_gr_cog/properties:media.key
ltx/gr_gr_cog/tr.d070:trMA.MM.Evlogetaria7.text	@ltx/gr_gr_cog/properties:media.key
ltx/gr_gr_cog/tr.d070:trMA.Ode1C11.greekmelody	@ltx/gr_gr_cog/he.h.m6:heHE.KymatiThalassis.greekname
ltx/gr_gr_cog/tr.d070:trMA.Ode1C11.incipit	Κύριε Θεέ μου, ἐξόδιον ὕμνον…
ltx/gr_gr_cog/tr.d070:trMA.Ode1C11.melody	@ltx/gr_gr_cog/he.h.m6:heHE.KymatiThalassis.name
ltx/gr_gr_cog/tr.d070:trMA.Ode1C11.mode	@ltx/gr_gr_cog/miscellanea:misc.Mode6
ltx/gr_gr_cog/tr.d070:trMA.Ode1C11.ode	@ltx/gr_gr_cog/miscellanea:misc.Ode1
ltx/gr_gr_cog/tr.d070:trMA.Ode1C11.text	Κύριε Θεέ μου, ἐξόδιον ὕμνον, καὶ ἐπιτάφιον, ᾠδήν σοι ᾄσομαι, τῷ τῇ ταφῇ σου ζωῆς μοι, τὰς εἰσόδους διανοίξαντι, καὶ θανάτῳ θάνατον, καὶ ᾍδην θανατώσαντι.
ltx/gr_gr_cog/tr.d070:trMA.Ode1C12.incipit	Ἄνω σε ἐν θρόνῳ, καὶ…
ltx/gr_gr_cog/tr.d070:trMA.Ode1C12.melody	@ltx/gr_gr_cog/he.h.m6:heHE.KymatiThalassis.name
ltx/gr_gr_cog/tr.d070:trMA.Ode1C12.mode	@ltx/gr_gr_cog/miscellanea:misc.Mode6
ltx/gr_gr_cog/tr.d070:trMA.Ode1C12.ode	@ltx/gr_gr_cog/miscellanea:misc.Ode1
ltx/gr_gr_cog/tr.d070:trMA.Ode1C12.text	Ἄνω σε ἐν θρόνῳ, καὶ κάτω ἐν τάφῳ, τὰ ὑπερκόσμια, καὶ ὑποχθόνια, κατανοοῦντα Σωτήρ μου, ἐδονεῖτο τῇ νεκρώσει σου· ὑπὲρ νοῦν ὡράθης γάρ, νεκρὸς ζωαρχικώτατος.
ltx/gr_gr_cog/tr.d070:trMA.Ode1C13.incipit	Ἵνα σου τῆς δόξης, τὰ…
ltx/gr_gr_cog/tr.d070:trMA.Ode1C13.melody	@ltx/gr_gr_cog/he.h.m6:heHE.KymatiThalassis.name
ltx/gr_gr_cog/tr.d070:trMA.Ode1C13.mode	@ltx/gr_gr_cog/miscellanea:misc.Mode6
ltx/gr_gr_cog/tr.d070:trMA.Ode1C13.ode	@ltx/gr_gr_cog/miscellanea:misc.Ode1
ltx/gr_gr_cog/tr.d070:trMA.Ode1C13.text	Ἵνα σου τῆς δόξης, τὰ πάντα πληρώσῃς, καταπεφοίτηκας, ἐν κατωτάτοις τῆς γῆς· ἀπὸ γὰρ σοῦ οὐκ ἐκρύβη, ἡ ὑπόστασίς μου ἡ ἐν Ἀδάμ, καὶ ταφεὶς φθαρέντα με, καινοποιεῖς, Φιλάνθρωπε.
ltx/gr_gr_cog/tr.d070:trMA.Ode1C1H.greekmelody	@ltx/gr_gr_cog/he.h.m6:heHE.KymatiThalassis.greekname
ltx/gr_gr_cog/tr.d070:trMA.Ode1C1H.incipit	@ltx/gr_gr_cog/he.h.m6:heHE.KymatiThalassis.incipit
ltx/gr_gr_cog/tr.d070:trMA.Ode1C1H.melody	@ltx/gr_gr_cog/he.h.m6:heHE.KymatiThalassis.melody
ltx/gr_gr_cog/tr.d070:trMA.Ode1C1H.mode	@ltx/gr_gr_cog/miscellanea:misc.Mode6
ltx/gr_gr_cog/tr.d070:trMA.Ode1C1H.ode	@ltx/gr_gr_cog/miscellanea:misc.Ode1
ltx/gr_gr_cog/tr.d070:trMA.Ode1C1H.text	@ltx/gr_gr_cog/he.h.m6:heHE.KymatiThalassis.text
ltx/gr_gr_cog/tr.d070:trMA.Ode1K.incipit	@ltx/gr_gr_cog/he.h.m6:heHE.KymatiThalassis.incipit
ltx/gr_gr_cog/tr.d070:trMA.Ode1K.melody	@ltx/gr_gr_cog/he.h.m6:heHE.KymatiThalassis.melody
ltx/gr_gr_cog/tr.d070:trMA.Ode1K.mode	@ltx/gr_gr_cog/miscellanea:misc.Mode6
ltx/gr_gr_cog/tr.d070:trMA.Ode1K.ode	@ltx/gr_gr_cog/miscellanea:misc.Ode1
ltx/gr_gr_cog/tr.d070:trMA.Ode1K.text	@ltx/gr_gr_cog/he.h.m6:heHE.KymatiThalassis.text
ltx/gr_gr_cog/tr.d070:trMA.Ode3C11.greekmelody	@ltx/gr_gr_cog/he.h.m6:heHE.SeTonEpiYdaton.greekname
ltx/gr_gr_cog/tr.d070:trMA.Ode3C11.incipit	Σύμβολα τῆς ταφῆς σου, παρέδειξας…
ltx/gr_gr_cog/tr.d070:trMA.Ode3C11.melody	@ltx/gr_gr_cog/he.h.m6:heHE.SeTonEpiYdaton.name
ltx/gr_gr_cog/tr.d070:trMA.Ode3C11.mode	@ltx/gr_gr_cog/miscellanea:misc.Mode6
ltx/gr_gr_cog/tr.d070:trMA.Ode3C11.ode	@ltx/gr_gr_cog/miscellanea:misc.Ode3
ltx/gr_gr_cog/tr.d070:trMA.Ode3C11.text	Σύμβολα τῆς ταφῆς σου, παρέδειξας τὰς ὁράσεις πληθύνας, νῦν δὲ τὰ κρύφιά σου, θεανδρικῶς διετράνωσας, καὶ τοῖς ἐν ᾍδῃ Δέσποτα· οὐκ ἔστιν ἅγιος, πλήν σου Κύριε, κραυγάζουσιν.
ltx/gr_gr_cog/tr.d070:trMA.Ode3C12.incipit	Ἥπλωσας τὰς παλάμας, καὶ ἥνωσας…
ltx/gr_gr_cog/tr.d070:trMA.Ode3C12.melody	@ltx/gr_gr_cog/he.h.m6:heHE.SeTonEpiYdaton.name
ltx/gr_gr_cog/tr.d070:trMA.Ode3C12.mode	@ltx/gr_gr_cog/miscellanea:misc.Mode6
ltx/gr_gr_cog/tr.d070:trMA.Ode3C12.ode	@ltx/gr_gr_cog/miscellanea:misc.Ode3
ltx/gr_gr_cog/tr.d070:trMA.Ode3C12.text	Ἥπλωσας τὰς παλάμας, καὶ ἥνωσας τὰ τὸ πρὶν διεστῶτα, καταστολῇ δὲ Σῶτερ, τῇ ἐν σινδόνι καὶ μνήματι, πεπεδημένους ἔλυσας. Οὐκ ἔστιν ἅγιος, πλήν σου Κύριε, κραυγάζοντας.
ltx/gr_gr_cog/tr.d070:trMA.Ode3C13.incipit	Μνήματι καὶ σφραγίσιν, ἀχώρητε συνεσχέθης…
ltx/gr_gr_cog/tr.d070:trMA.Ode3C13.melody	@ltx/gr_gr_cog/he.h.m6:heHE.SeTonEpiYdaton.name
ltx/gr_gr_cog/tr.d070:trMA.Ode3C13.mode	@ltx/gr_gr_cog/miscellanea:misc.Mode6
ltx/gr_gr_cog/tr.d070:trMA.Ode3C13.ode	@ltx/gr_gr_cog/miscellanea:misc.Ode3
ltx/gr_gr_cog/tr.d070:trMA.Ode3C13.text	Μνήματι καὶ σφραγίσιν, ἀχώρητε συνεσχέθης βουλήσει· καὶ γὰρ τὴν δύναμίν σου, ταῖς ἐνεργείαις ἐγνώρισας, θεουργικῶς τοῖς μέλπουσιν· οὐκ ἔστιν ἅγιος, πλήν σου Κύριε φιλάνθρωπε.
ltx/gr_gr_cog/tr.d070:trMA.Ode3C1H.greekmelody	@ltx/gr_gr_cog/he.h.m6:heHE.SeTonEpiYdaton.greekname
ltx/gr_gr_cog/tr.d070:trMA.Ode3C1H.incipit	@ltx/gr_gr_cog/he.h.m6:heHE.SeTonEpiYdaton.incipit
ltx/gr_gr_cog/tr.d070:trMA.Ode3C1H.melody	@ltx/gr_gr_cog/he.h.m6:heHE.SeTonEpiYdaton.melody
ltx/gr_gr_cog/tr.d070:trMA.Ode3C1H.mode	@ltx/gr_gr_cog/miscellanea:misc.Mode6
ltx/gr_gr_cog/tr.d070:trMA.Ode3C1H.ode	@ltx/gr_gr_cog/miscellanea:misc.Ode3
ltx/gr_gr_cog/tr.d070:trMA.Ode3C1H.text	@ltx/gr_gr_cog/he.h.m6:heHE.SeTonEpiYdaton.text
ltx/gr_gr_cog/tr.d070:trMA.Ode3K.incipit	@ltx/gr_gr_cog/he.h.m6:heHE.SeTonEpiYdaton.incipit
ltx/gr_gr_cog/tr.d070:trMA.Ode3K.melody	@ltx/gr_gr_cog/he.h.m6:heHE.SeTonEpiYdaton.melody
ltx/gr_gr_cog/tr.d070:trMA.Ode3K.mode	@ltx/gr_gr_cog/miscellanea:misc.Mode6
ltx/gr_gr_cog/tr.d070:trMA.Ode3K.ode	@ltx/gr_gr_cog/miscellanea:misc.Ode3
ltx/gr_gr_cog/tr.d070:trMA.Ode3K.text	@ltx/gr_gr_cog/he.h.m6:heHE.SeTonEpiYdaton.text
ltx/gr_gr_cog/tr.d070:trMA.Ode3Kathisma1.greekmelody	@ltx/gr_gr_cog/he.a.m1:heAU.TonTafonSouSotir.greekname
ltx/gr_gr_cog/tr.d070:trMA.Ode3Kathisma1.incipit	@ltx/gr_gr_cog/he.a.m1:heAU.TonTafonSouSotir.incipit
ltx/gr_gr_cog/tr.d070:trMA.Ode3Kathisma1.melody	@ltx/gr_gr_cog/he.a.m1:heAU.TonTafonSouSotir.melody
ltx/gr_gr_cog/tr.d070:trMA.Ode3Kathisma1.mode	@ltx/gr_gr_cog/miscellanea:misc.Mode1
ltx/gr_gr_cog/tr.d070:trMA.Ode3Kathisma1.text	@ltx/gr_gr_cog/he.a.m1:heAU.TonTafonSouSotir.text
ltx/gr_gr_cog/tr.d070:trMA.Ode4C11.greekmelody	@ltx/gr_gr_cog/he.h.m6:heHE.TinEnStavroSou.greekname
ltx/gr_gr_cog/tr.d070:trMA.Ode4C11.incipit	Ἑβδόμην σήμερον ἡγίασας, ἣν εὐλόγησας…
ltx/gr_gr_cog/tr.d070:trMA.Ode4C11.melody	@ltx/gr_gr_cog/he.h.m6:heHE.TinEnStavroSou.name
ltx/gr_gr_cog/tr.d070:trMA.Ode4C11.mode	@ltx/gr_gr_cog/miscellanea:misc.Mode6
ltx/gr_gr_cog/tr.d070:trMA.Ode4C11.ode	@ltx/gr_gr_cog/miscellanea:misc.Ode4
ltx/gr_gr_cog/tr.d070:trMA.Ode4C11.text	Ἑβδόμην σήμερον ἡγίασας, ἣν εὐλόγησας πρίν, καταπαύσει τῶν ἔργων· παράγεις γὰρ τὰ σύμπαντα, καὶ καινοποιεῖς, σαββατίζων Σωτήρ μου, καὶ ἀνακτώμενος.
ltx/gr_gr_cog/tr.d070:trMA.Ode4C12.incipit	Ῥωμαλαιότητι τοῦ κρείττονος, ἐκνικήσαντός σου…
ltx/gr_gr_cog/tr.d070:trMA.Ode4C12.melody	@ltx/gr_gr_cog/he.h.m6:heHE.TinEnStavroSou.name
ltx/gr_gr_cog/tr.d070:trMA.Ode4C12.mode	@ltx/gr_gr_cog/miscellanea:misc.Mode6
ltx/gr_gr_cog/tr.d070:trMA.Ode4C12.ode	@ltx/gr_gr_cog/miscellanea:misc.Ode4
ltx/gr_gr_cog/tr.d070:trMA.Ode4C12.text	Ῥωμαλαιότητι τοῦ κρείττονος, ἐκνικήσαντός σου, τῆς σαρκὸς ἡ ψυχή σου, διῄρηται σπαράττουσα· ἄμφω γὰρ δεσμούς, τοῦ θανάτου καὶ ᾍδου, Λόγε τῷ κράτει σου.
ltx/gr_gr_cog/tr.d070:trMA.Ode4C13.incipit	Ὁ ᾍδης Λόγε συναντήσας σοι…
ltx/gr_gr_cog/tr.d070:trMA.Ode4C13.melody	@ltx/gr_gr_cog/he.h.m6:heHE.TinEnStavroSou.name
ltx/gr_gr_cog/tr.d070:trMA.Ode4C13.mode	@ltx/gr_gr_cog/miscellanea:misc.Mode6
ltx/gr_gr_cog/tr.d070:trMA.Ode4C13.ode	@ltx/gr_gr_cog/miscellanea:misc.Ode4
ltx/gr_gr_cog/tr.d070:trMA.Ode4C13.text	Ὁ ᾍδης Λόγε συναντήσας σοι, ἐπικράνθη, βροτὸν ὁρῶν τεθεωμένον, κατάστικτον τοῖς μώλωψι, καὶ πανσθενουργόν, τῷ φρικτῷ τῆς μορφῆς δέ, διαπεφώνηκεν.
ltx/gr_gr_cog/tr.d070:trMA.Ode4C1H.greekmelody	@ltx/gr_gr_cog/he.h.m6:heHE.TinEnStavroSou.greekname
ltx/gr_gr_cog/tr.d070:trMA.Ode4C1H.incipit	@ltx/gr_gr_cog/he.h.m6:heHE.TinEnStavroSou.incipit
ltx/gr_gr_cog/tr.d070:trMA.Ode4C1H.melody	@ltx/gr_gr_cog/he.h.m6:heHE.TinEnStavroSou.melody
ltx/gr_gr_cog/tr.d070:trMA.Ode4C1H.mode	@ltx/gr_gr_cog/miscellanea:misc.Mode6
ltx/gr_gr_cog/tr.d070:trMA.Ode4C1H.ode	@ltx/gr_gr_cog/miscellanea:misc.Ode4
ltx/gr_gr_cog/tr.d070:trMA.Ode4C1H.text	@ltx/gr_gr_cog/he.h.m6:heHE.TinEnStavroSou.text
ltx/gr_gr_cog/tr.d070:trMA.Ode4K.incipit	@ltx/gr_gr_cog/he.h.m6:heHE.TinEnStavroSou.incipit
ltx/gr_gr_cog/tr.d070:trMA.Ode4K.melody	@ltx/gr_gr_cog/he.h.m6:heHE.TinEnStavroSou.melody
ltx/gr_gr_cog/tr.d070:trMA.Ode4K.mode	@ltx/gr_gr_cog/miscellanea:misc.Mode6
ltx/gr_gr_cog/tr.d070:trMA.Ode4K.ode	@ltx/gr_gr_cog/miscellanea:misc.Ode4
ltx/gr_gr_cog/tr.d070:trMA.Ode4K.text	@ltx/gr_gr_cog/he.h.m6:heHE.TinEnStavroSou.text
ltx/gr_gr_cog/tr.d070:trMA.Ode5C11.greekmelody	@ltx/gr_gr_cog/he.h.m6:heHE.TheofaneiasSouChriste.greekname
ltx/gr_gr_cog/tr.d070:trMA.Ode5C11.incipit	Νεοποιεῖς τοὺς γηγενεῖς, ὁ πλαστουργὸς…
ltx/gr_gr_cog/tr.d070:trMA.Ode5C11.melody	@ltx/gr_gr_cog/he.h.m6:heHE.TheofaneiasSouChriste.name
ltx/gr_gr_cog/tr.d070:trMA.Ode5C11.mode	@ltx/gr_gr_cog/miscellanea:misc.Mode6
ltx/gr_gr_cog/tr.d070:trMA.Ode5C11.ode	@ltx/gr_gr_cog/miscellanea:misc.Ode5
ltx/gr_gr_cog/tr.d070:trMA.Ode5C11.text	Νεοποιεῖς τοὺς γηγενεῖς, ὁ πλαστουργὸς χοϊκὸς χρηματίσας, καὶ σινδὼν καὶ τάφος ὑπεμφαίνουσι, τὸ συνόν σοι Λόγε μυστήριον· ὁ εὐσχήμων γὰρ βουλευτής, τὴν τοῦ σὲ φύσαντος βουλὴν σχηματίζει· ἐν σοὶ μεγαλοπρεπῶς καινοποιοῦντός με.
ltx/gr_gr_cog/tr.d070:trMA.Ode5C12.incipit	Διὰ θανάτου τὸ θνητόν, διὰ…
ltx/gr_gr_cog/tr.d070:trMA.Ode5C12.melody	@ltx/gr_gr_cog/he.h.m6:heHE.TheofaneiasSouChriste.name
ltx/gr_gr_cog/tr.d070:trMA.Ode5C12.mode	@ltx/gr_gr_cog/miscellanea:misc.Mode6
ltx/gr_gr_cog/tr.d070:trMA.Ode5C12.ode	@ltx/gr_gr_cog/miscellanea:misc.Ode5
ltx/gr_gr_cog/tr.d070:trMA.Ode5C12.text	Διὰ θανάτου τὸ θνητόν, διὰ ταφῆς τὸ φθαρτὸν μεταβάλλεις· ἀφθαρτίζεις γὰρ θεοπρεπέστατα, ἀπαθανατίζων τὸ πρόσλημμα· ἡ γὰρ σάρξ σου διαφθορὰν οὐκ εἶδε Δέσποτα, οὐδὲ ἡ ψυχή σου εἰς ᾍδου, ξενοπρεπῶς ἐγκαταλέλειπται.
ltx/gr_gr_cog/tr.d070:trMA.Ode5C13.incipit	Ἐξ ἀλοχεύτου προελθών, καὶ λογχευθεὶς…
ltx/gr_gr_cog/tr.d070:trMA.Ode5C13.melody	@ltx/gr_gr_cog/he.h.m6:heHE.TheofaneiasSouChriste.name
ltx/gr_gr_cog/tr.d070:trMA.Ode5C13.mode	@ltx/gr_gr_cog/miscellanea:misc.Mode6
ltx/gr_gr_cog/tr.d070:trMA.Ode5C13.ode	@ltx/gr_gr_cog/miscellanea:misc.Ode5
ltx/gr_gr_cog/tr.d070:trMA.Ode5C13.text	Ἐξ ἀλοχεύτου προελθών, καὶ λογχευθεὶς τὴν πλευρὰν Πλαστουργέ μου, ἐξ αὐτῆς εἰργάσω τὴν ἀνάπλασιν, τὴν τῆς Εὔας Ἀδὰμ γενόμενος, ἀφυπνώσας ὑπερφυῶς, ὕπνον φυσίζωον, καὶ ζωὴν ἐγείρας ἐξ ὕπνου, καὶ τῆς φθορᾶς ὡς παντοδύναμος.
ltx/gr_gr_cog/tr.d070:trMA.Ode5C1H.greekmelody	@ltx/gr_gr_cog/he.h.m6:heHE.TheofaneiasSouChriste.greekname
ltx/gr_gr_cog/tr.d070:trMA.Ode5C1H.incipit	@ltx/gr_gr_cog/he.h.m6:heHE.TheofaneiasSouChriste.incipit
ltx/gr_gr_cog/tr.d070:trMA.Ode5C1H.melody	@ltx/gr_gr_cog/he.h.m6:heHE.TheofaneiasSouChriste.melody
ltx/gr_gr_cog/tr.d070:trMA.Ode5C1H.mode	@ltx/gr_gr_cog/miscellanea:misc.Mode6
ltx/gr_gr_cog/tr.d070:trMA.Ode5C1H.ode	@ltx/gr_gr_cog/miscellanea:misc.Ode5
ltx/gr_gr_cog/tr.d070:trMA.Ode5C1H.text	@ltx/gr_gr_cog/he.h.m6:heHE.TheofaneiasSouChriste.text
ltx/gr_gr_cog/tr.d070:trMA.Ode5K.incipit	@ltx/gr_gr_cog/he.h.m6:heHE.TheofaneiasSouChriste.incipit
ltx/gr_gr_cog/tr.d070:trMA.Ode5K.melody	@ltx/gr_gr_cog/he.h.m6:heHE.TheofaneiasSouChriste.melody
ltx/gr_gr_cog/tr.d070:trMA.Ode5K.mode	@ltx/gr_gr_cog/miscellanea:misc.Mode6
ltx/gr_gr_cog/tr.d070:trMA.Ode5K.ode	@ltx/gr_gr_cog/miscellanea:misc.Ode5
ltx/gr_gr_cog/tr.d070:trMA.Ode5K.text	@ltx/gr_gr_cog/he.h.m6:heHE.TheofaneiasSouChriste.text
ltx/gr_gr_cog/tr.d070:trMA.Ode6C11.greekmelody	@ltx/gr_gr_cog/he.h.m6:heHE.SyneschethiAllOuKateschethi.greekname
ltx/gr_gr_cog/tr.d070:trMA.Ode6C11.incipit	Ἀνῃρέθης, ἀλλʼ οὐ διῃρέθης, Λόγε…
ltx/gr_gr_cog/tr.d070:trMA.Ode6C11.melody	@ltx/gr_gr_cog/he.h.m6:heHE.SyneschethiAllOuKateschethi.name
ltx/gr_gr_cog/tr.d070:trMA.Ode6C11.mode	@ltx/gr_gr_cog/miscellanea:misc.Mode6
ltx/gr_gr_cog/tr.d070:trMA.Ode6C11.ode	@ltx/gr_gr_cog/miscellanea:misc.Ode6
ltx/gr_gr_cog/tr.d070:trMA.Ode6C11.text	Ἀνῃρέθης, ἀλλʼ οὐ διῃρέθης, Λόγε ἧς μετέσχες σαρκός· εἰ γὰρ καὶ λέλυταί σου, ὁ ναὸς ἐν τῷ καιρῷ τοῦ πάθους· ἀλλὰ καὶ οὕτω μία ἦν ὑπόστασις, τῆς Θεότητος καὶ τῆς σαρκός σου· ἐν ἀμφοτέροις γάρ, εἷς ὑπάρχεις Υἱός, Λόγος τοῦ Θεοῦ, Θεὸς καὶ ἄνθρωπος.
ltx/gr_gr_cog/tr.d070:trMA.Ode6C12.incipit	Βροτοκτόνον, ἀλλʼ οὐ θεοκτόνον, ἔφυ…
ltx/gr_gr_cog/tr.d070:trMA.Ode6C12.melody	@ltx/gr_gr_cog/he.h.m6:heHE.SyneschethiAllOuKateschethi.name
ltx/gr_gr_cog/tr.d070:trMA.Ode6C12.mode	@ltx/gr_gr_cog/miscellanea:misc.Mode6
ltx/gr_gr_cog/tr.d070:trMA.Ode6C12.ode	@ltx/gr_gr_cog/miscellanea:misc.Ode6
ltx/gr_gr_cog/tr.d070:trMA.Ode6C12.text	Βροτοκτόνον, ἀλλʼ οὐ θεοκτόνον, ἔφυ τὸ πταῖσμα τοῦ Ἀδάμ· εἰ γὰρ καὶ πέπονθέ σου, τῆς σαρκὸς ἡ χοϊκὴ οὐσία, ἀλλʼ ἡ Θεότης ἀπαθὴς διέμεινε, τὸ φθαρτὸν δέ σου πρὸς ἀφθαρσίαν μετεστοιχείωσας, καὶ ἀφθάρτου ζωῆς, ἔδειξας πηγὴν ἐξ ἀναστάσεως.
ltx/gr_gr_cog/tr.d070:trMA.Ode6C13.incipit	Βασιλεύει, ἀλλʼ οὐκ αἰωνίζει, Ἄδης…
ltx/gr_gr_cog/tr.d070:trMA.Ode6C13.melody	@ltx/gr_gr_cog/he.h.m6:heHE.SyneschethiAllOuKateschethi.name
ltx/gr_gr_cog/tr.d070:trMA.Ode6C13.mode	@ltx/gr_gr_cog/miscellanea:misc.Mode6
ltx/gr_gr_cog/tr.d070:trMA.Ode6C13.ode	@ltx/gr_gr_cog/miscellanea:misc.Ode6
ltx/gr_gr_cog/tr.d070:trMA.Ode6C13.text	Βασιλεύει, ἀλλʼ οὐκ αἰωνίζει, Ἄδης τοῦ γένους τῶν βροτῶν· σὺ γὰρ τεθεὶς ἐν τάφῳ, Κραταιὲ ζωαρχικῇ παλάμῃ, τὰ τοῦ θανάτου, κλεῖθρα διεσπάραξας, καὶ ἐκήρυξας τοῖς ἀπʼ αἰῶνος ἐκεῖ καθεύδουσι λύτρωσιν ἀψευδῆ, Σῶτερ γεγονὼς νεκρῶν πρωτότοκος.
ltx/gr_gr_cog/tr.d070:trMA.Ode6C1H.greekmelody	@ltx/gr_gr_cog/he.h.m6:heHE.SyneschethiAllOuKateschethi.greekname
ltx/gr_gr_cog/tr.d070:trMA.Ode6C1H.incipit	@ltx/gr_gr_cog/he.h.m6:heHE.SyneschethiAllOuKateschethi.incipit
ltx/gr_gr_cog/tr.d070:trMA.Ode6C1H.melody	@ltx/gr_gr_cog/he.h.m6:heHE.SyneschethiAllOuKateschethi.melody
ltx/gr_gr_cog/tr.d070:trMA.Ode6C1H.mode	@ltx/gr_gr_cog/miscellanea:misc.Mode6
ltx/gr_gr_cog/tr.d070:trMA.Ode6C1H.ode	@ltx/gr_gr_cog/miscellanea:misc.Ode6
ltx/gr_gr_cog/tr.d070:trMA.Ode6C1H.text	@ltx/gr_gr_cog/he.h.m6:heHE.SyneschethiAllOuKateschethi.text
ltx/gr_gr_cog/tr.d070:trMA.Ode6K.incipit	@ltx/gr_gr_cog/he.h.m6:heHE.SyneschethiAllOuKateschethi.incipit
ltx/gr_gr_cog/tr.d070:trMA.Ode6K.melody	@ltx/gr_gr_cog/he.h.m6:heHE.SyneschethiAllOuKateschethi.melody
ltx/gr_gr_cog/tr.d070:trMA.Ode6K.mode	@ltx/gr_gr_cog/miscellanea:misc.Mode6
ltx/gr_gr_cog/tr.d070:trMA.Ode6K.ode	@ltx/gr_gr_cog/miscellanea:misc.Ode6
ltx/gr_gr_cog/tr.d070:trMA.Ode6K.text	@ltx/gr_gr_cog/he.h.m6:heHE.SyneschethiAllOuKateschethi.text
ltx/gr_gr_cog/tr.d070:trMA.Ode7C11.greekmelody	@ltx/gr_gr_cog/he.h.m6:heHE.AfrastonThavma.greekname
ltx/gr_gr_cog/tr.d070:trMA.Ode7C11.incipit	Τετρωται ᾍδης, ἐν τῇ καρδίᾳ…
ltx/gr_gr_cog/tr.d070:trMA.Ode7C11.melody	@ltx/gr_gr_cog/he.h.m6:heHE.AfrastonThavma.name
ltx/gr_gr_cog/tr.d070:trMA.Ode7C11.mode	@ltx/gr_gr_cog/miscellanea:misc.Mode6
ltx/gr_gr_cog/tr.d070:trMA.Ode7C11.ode	@ltx/gr_gr_cog/miscellanea:misc.Ode7
ltx/gr_gr_cog/tr.d070:trMA.Ode7C11.text	Τετρωται ᾍδης, ἐν τῇ καρδίᾳ δεξάμενος τὸν τρωθέντα λόγχῃ τὴν πλευράν, καὶ σθένει πυρὶ θείῳ δαπανώμενος, εἰς σωτηρίαν ἡμῶν τῶν μελῳδούντων· Λυτρωτά, ὁ Θεὸς εὐλογητὸς εἶ.
ltx/gr_gr_cog/tr.d070:trMA.Ode7C12.incipit	Ὄλβιος τάφος! ἐν ἑαυτῷ γὰρ…
ltx/gr_gr_cog/tr.d070:trMA.Ode7C12.melody	@ltx/gr_gr_cog/he.h.m6:heHE.AfrastonThavma.name
ltx/gr_gr_cog/tr.d070:trMA.Ode7C12.mode	@ltx/gr_gr_cog/miscellanea:misc.Mode6
ltx/gr_gr_cog/tr.d070:trMA.Ode7C12.ode	@ltx/gr_gr_cog/miscellanea:misc.Ode7
ltx/gr_gr_cog/tr.d070:trMA.Ode7C12.text	Ὄλβιος τάφος! ἐν ἑαυτῷ γὰρ δεξάμενος, ὡς ὑπνοῦντα τὸν Δημιουργόν, ζωῆς θησαυρός, θεῖος ἀναδέδεικται, εἰς σωτηρίαν ἡμῶν τῶν μελῳδούντων· Λυτρωτά, ὁ Θεὸς εὐλογητὸς εἶ.
ltx/gr_gr_cog/tr.d070:trMA.Ode7C13.incipit	Νόμῳ θανόντων, τὴν ἐν τῷ…
ltx/gr_gr_cog/tr.d070:trMA.Ode7C13.melody	@ltx/gr_gr_cog/he.h.m6:heHE.AfrastonThavma.name
ltx/gr_gr_cog/tr.d070:trMA.Ode7C13.mode	@ltx/gr_gr_cog/miscellanea:misc.Mode6
ltx/gr_gr_cog/tr.d070:trMA.Ode7C13.ode	@ltx/gr_gr_cog/miscellanea:misc.Ode7
ltx/gr_gr_cog/tr.d070:trMA.Ode7C13.text	Νόμῳ θανόντων, τὴν ἐν τῷ τάφῳ κατάθεσιν, ἡ τῶν ὅλων δέχεται ζωή, καὶ τοῦτον πηγήν, δείκνυσιν ἐγέρσεως, εἰς σωτηρίαν ἡμῶν τῶν μελῳδούντων· Λυτρωτά, ὁ Θεὸς εὐλογητὸς εἶ.
ltx/gr_gr_cog/tr.d070:trMA.Ode7C14.incipit	Μία ὑπῆρχεν, ἡ ἐν τῷ…
ltx/gr_gr_cog/tr.d070:trMA.Ode7C14.melody	@ltx/gr_gr_cog/he.h.m6:heHE.AfrastonThavma.name
ltx/gr_gr_cog/tr.d070:trMA.Ode7C14.mode	@ltx/gr_gr_cog/miscellanea:misc.Mode6
ltx/gr_gr_cog/tr.d070:trMA.Ode7C14.ode	@ltx/gr_gr_cog/miscellanea:misc.Ode7
ltx/gr_gr_cog/tr.d070:trMA.Ode7C14.text	Μία ὑπῆρχεν, ἡ ἐν τῷ ᾍδῃ ἀχώριστος, καὶ ἐν τάφῳ, καὶ ἐν τῇ Ἐδέμ, Θεότης Χριστοῦ, σὺν Πατρὶ καὶ Πνεύματι, εἰς σωτηρίαν ἡμῶν τῶν μελωδούντων· Λυτρωτά, ὁ Θεὸς εὐλογητὸς εἶ.
ltx/gr_gr_cog/tr.d070:trMA.Ode7C1H.greekmelody	@ltx/gr_gr_cog/he.h.m6:heHE.AfrastonThavma.greekname
ltx/gr_gr_cog/tr.d070:trMA.Ode7C1H.incipit	@ltx/gr_gr_cog/he.h.m6:heHE.AfrastonThavma.incipit
ltx/gr_gr_cog/tr.d070:trMA.Ode7C1H.melody	@ltx/gr_gr_cog/he.h.m6:heHE.AfrastonThavma.melody
ltx/gr_gr_cog/tr.d070:trMA.Ode7C1H.mode	@ltx/gr_gr_cog/miscellanea:misc.Mode6
ltx/gr_gr_cog/tr.d070:trMA.Ode7C1H.ode	@ltx/gr_gr_cog/miscellanea:misc.Ode7
ltx/gr_gr_cog/tr.d070:trMA.Ode7C1H.text	@ltx/gr_gr_cog/he.h.m6:heHE.AfrastonThavma.text
ltx/gr_gr_cog/tr.d070:trMA.Ode7K.incipit	@ltx/gr_gr_cog/he.h.m6:heHE.AfrastonThavma.incipit
ltx/gr_gr_cog/tr.d070:trMA.Ode7K.melody	@ltx/gr_gr_cog/he.h.m6:heHE.AfrastonThavma.melody
ltx/gr_gr_cog/tr.d070:trMA.Ode7K.mode	@ltx/gr_gr_cog/miscellanea:misc.Mode6
ltx/gr_gr_cog/tr.d070:trMA.Ode7K.ode	@ltx/gr_gr_cog/miscellanea:misc.Ode7
ltx/gr_gr_cog/tr.d070:trMA.Ode7K.text	@ltx/gr_gr_cog/he.h.m6:heHE.AfrastonThavma.text
ltx/gr_gr_cog/tr.d070:trMA.Ode8C11.greekmelody	@ltx/gr_gr_cog/he.h.m6:heHE.EkstithiFrittonOurane.greekname
ltx/gr_gr_cog/tr.d070:trMA.Ode8C11.incipit	Λέλυται ἄχραντος ναός, τὴν πεπτωκυῖαν…
ltx/gr_gr_cog/tr.d070:trMA.Ode8C11.melody	@ltx/gr_gr_cog/he.h.m6:heHE.EkstithiFrittonOurane.name
ltx/gr_gr_cog/tr.d070:trMA.Ode8C11.mode	@ltx/gr_gr_cog/miscellanea:misc.Mode6
ltx/gr_gr_cog/tr.d070:trMA.Ode8C11.ode	@ltx/gr_gr_cog/miscellanea:misc.Ode8
ltx/gr_gr_cog/tr.d070:trMA.Ode8C11.text	Λέλυται ἄχραντος ναός, τὴν πεπτωκυῖαν δὲ συνανίστησι σκηνήν. Ἀδὰμ γὰρ τῷ προτέρῳ δεύτερος, ὁ ἐν ὑψίστοις οἰκῶν, κατῆλθεν μέχρις ᾍδου ταμείων· ὃν Παῖδες εὐλογεῖτε, Ἱερεῖς ἀνυμνεῖτε, λαὸς ὑπερυψοῦτε, εἰς πάντας τοὺς αἰῶνας.
ltx/gr_gr_cog/tr.d070:trMA.Ode8C12.incipit	Πέπαυται τόλμα Μαθητῶν, Ἀριμαθαίας δὲ…
ltx/gr_gr_cog/tr.d070:trMA.Ode8C12.melody	@ltx/gr_gr_cog/he.h.m6:heHE.EkstithiFrittonOurane.name
ltx/gr_gr_cog/tr.d070:trMA.Ode8C12.mode	@ltx/gr_gr_cog/miscellanea:misc.Mode6
ltx/gr_gr_cog/tr.d070:trMA.Ode8C12.ode	@ltx/gr_gr_cog/miscellanea:misc.Ode8
ltx/gr_gr_cog/tr.d070:trMA.Ode8C12.text	Πέπαυται τόλμα Μαθητῶν, Ἀριμαθαίας δὲ ἀριστεύει Ἰωσήφ· νεκρὸν γὰρ καὶ γυμνὸν Θεώμενος, τὸν ἐπὶ πάντων Θεόν, αἰτεῖται, καὶ κηδεύει κραυγάζων· οἱ Παῖδες εὐλογεῖτε, Ἱερεῖς ἀνυμνεῖτε, λαὸς ὑπερυψοῦτε, εἰς πάντας τοὺς αἰῶνας.
ltx/gr_gr_cog/tr.d070:trMA.Ode8C13.incipit	Ὢ τῶν θαυμάτων τῶν καινῶν!…
ltx/gr_gr_cog/tr.d070:trMA.Ode8C13.melody	@ltx/gr_gr_cog/he.h.m6:heHE.EkstithiFrittonOurane.name
ltx/gr_gr_cog/tr.d070:trMA.Ode8C13.mode	@ltx/gr_gr_cog/miscellanea:misc.Mode6
ltx/gr_gr_cog/tr.d070:trMA.Ode8C13.ode	@ltx/gr_gr_cog/miscellanea:misc.Ode8
ltx/gr_gr_cog/tr.d070:trMA.Ode8C13.text	Ὢ τῶν θαυμάτων τῶν καινῶν! ὢ ἀγαθότητος! ὢ ἀφράστου ἀνοχῆς! ἑκὼν γὰρ ὑπὸ γῆς σφραγίζεται, ὁ ἐν ὑψίστοις οἰκῶν, καὶ πλάνος Θεὸς συκοφαντεῖται· ὃν Παῖδες εὐλογεῖτε, Ἱερεῖς ἀνυμνεῖτε, λαὸς ὑπερυψοῦτε, εἰς πάντας τοὺς αἰῶνας.
ltx/gr_gr_cog/tr.d070:trMA.Ode8C1H.greekmelody	@ltx/gr_gr_cog/he.h.m6:heHE.EkstithiFrittonOurane.greekname
ltx/gr_gr_cog/tr.d070:trMA.Ode8C1H.incipit	@ltx/gr_gr_cog/he.h.m6:heHE.EkstithiFrittonOurane.incipit
ltx/gr_gr_cog/tr.d070:trMA.Ode8C1H.melody	@ltx/gr_gr_cog/he.h.m6:heHE.EkstithiFrittonOurane.melody
ltx/gr_gr_cog/tr.d070:trMA.Ode8C1H.mode	@ltx/gr_gr_cog/miscellanea:misc.Mode6
ltx/gr_gr_cog/tr.d070:trMA.Ode8C1H.ode	@ltx/gr_gr_cog/miscellanea:misc.Ode8
ltx/gr_gr_cog/tr.d070:trMA.Ode8C1H.text	@ltx/gr_gr_cog/he.h.m6:heHE.EkstithiFrittonOurane.text
ltx/gr_gr_cog/tr.d070:trMA.Ode8K.incipit	@ltx/gr_gr_cog/he.h.m6:heHE.EkstithiFrittonOurane.incipit
ltx/gr_gr_cog/tr.d070:trMA.Ode8K.melody	@ltx/gr_gr_cog/he.h.m6:heHE.EkstithiFrittonOurane.melody
ltx/gr_gr_cog/tr.d070:trMA.Ode8K.mode	@ltx/gr_gr_cog/miscellanea:misc.Mode6
ltx/gr_gr_cog/tr.d070:trMA.Ode8K.ode	@ltx/gr_gr_cog/miscellanea:misc.Ode8
ltx/gr_gr_cog/tr.d070:trMA.Ode8K.text	@ltx/gr_gr_cog/he.h.m6:heHE.EkstithiFrittonOurane.text
ltx/gr_gr_cog/tr.d070:trMA.Ode9C11.greekmelody	@ltx/gr_gr_cog/he.h.m6:heHE.MiEpodyrouMouMiter.greekname
ltx/gr_gr_cog/tr.d070:trMA.Ode9C11.incipit	Ἐπὶ τῷ ξένῳ σου τόκῳ…
ltx/gr_gr_cog/tr.d070:trMA.Ode9C11.melody	@ltx/gr_gr_cog/he.h.m6:heHE.MiEpodyrouMouMiter.name
ltx/gr_gr_cog/tr.d070:trMA.Ode9C11.mode	@ltx/gr_gr_cog/miscellanea:misc.Mode6
ltx/gr_gr_cog/tr.d070:trMA.Ode9C11.ode	@ltx/gr_gr_cog/miscellanea:misc.Ode9
ltx/gr_gr_cog/tr.d070:trMA.Ode9C11.text	Ἐπὶ τῷ ξένῳ σου τόκῳ, τὰς ὀδύνας φυγοῦσα, ὑπερφυῶς ἐμακαρίσθην, ἄναρχε Υἱέ· νῦν δὲ σὲ Θεέ μου, ἄπνουν ὁρῶσα νεκρόν, τῇ ῥομφαίᾳ τῆς λύπης, σπαράττομαι δεινῶς, ἀλλʼ ἀνάστηθι, ὅπως μεγαλυνθήσωμαι.
ltx/gr_gr_cog/tr.d070:trMA.Ode9C12.incipit	Γῆ με καλύπτει ἐκόντα, ἀλλά…
ltx/gr_gr_cog/tr.d070:trMA.Ode9C12.melody	@ltx/gr_gr_cog/he.h.m6:heHE.MiEpodyrouMouMiter.name
ltx/gr_gr_cog/tr.d070:trMA.Ode9C12.mode	@ltx/gr_gr_cog/miscellanea:misc.Mode6
ltx/gr_gr_cog/tr.d070:trMA.Ode9C12.ode	@ltx/gr_gr_cog/miscellanea:misc.Ode9
ltx/gr_gr_cog/tr.d070:trMA.Ode9C12.text	Γῆ με καλύπτει ἐκόντα, ἀλλὰ φρίττουσιν Ἄδου, οἱ πυλωροί, ἠμφιεσμένον, βλέποντες στολήν, ᾑμαγμένην Μῆτερ, τῆς ἐκδικήσεως· τοὺς ἐχθροὺς ἐν Σταυρῷ γάρ, πατάξας ὡς Θεός, ἀναστήσομαι αὖθις καὶ μεγαλύνω σε.
ltx/gr_gr_cog/tr.d070:trMA.Ode9C13.incipit	Ἀγαλλιάσθω ἡ Κτίσις, εὐφραινέσθωσαν πάντες…
ltx/gr_gr_cog/tr.d070:trMA.Ode9C13.melody	@ltx/gr_gr_cog/he.h.m6:heHE.MiEpodyrouMouMiter.name
ltx/gr_gr_cog/tr.d070:trMA.Ode9C13.mode	@ltx/gr_gr_cog/miscellanea:misc.Mode6
ltx/gr_gr_cog/tr.d070:trMA.Ode9C13.ode	@ltx/gr_gr_cog/miscellanea:misc.Ode9
ltx/gr_gr_cog/tr.d070:trMA.Ode9C13.text	Ἀγαλλιάσθω ἡ Κτίσις, εὐφραινέσθωσαν πάντες οἱ γηγενεῖς· ὁ γὰρ ἐχθρὸς ἐσκύλευται Ἄδης, μετὰ μύρων Γυναῖκες προσυπαντάτωσαν, τὸν Ἀδὰμ σὺν τῇ Εὔᾳ, λυτροῦμαι παγγενῆ, καὶ τῇ τρίτῃ ἡμέρᾳ ἐξαναστήσομαι.
ltx/gr_gr_cog/tr.d070:trMA.Ode9C1H.greekmelody	@ltx/gr_gr_cog/he.h.m6:heHE.MiEpodyrouMouMiter.greekname
ltx/gr_gr_cog/tr.d070:trMA.Ode9C1H.incipit	@ltx/gr_gr_cog/he.h.m6:heHE.MiEpodyrouMouMiter.incipit
ltx/gr_gr_cog/tr.d070:trMA.Ode9C1H.melody	@ltx/gr_gr_cog/he.h.m6:heHE.MiEpodyrouMouMiter.melody
ltx/gr_gr_cog/tr.d070:trMA.Ode9C1H.mode	@ltx/gr_gr_cog/miscellanea:misc.Mode6
ltx/gr_gr_cog/tr.d070:trMA.Ode9C1H.ode	@ltx/gr_gr_cog/miscellanea:misc.Ode9
ltx/gr_gr_cog/tr.d070:trMA.Ode9C1H.text	@ltx/gr_gr_cog/he.h.m6:heHE.MiEpodyrouMouMiter.text
ltx/gr_gr_cog/tr.d070:trMA.Ode9K.incipit	@ltx/gr_gr_cog/he.h.m6:heHE.MiEpodyrouMouMiter.incipit
ltx/gr_gr_cog/tr.d070:trMA.Ode9K.melody	@ltx/gr_gr_cog/he.h.m6:heHE.MiEpodyrouMouMiter.melody
ltx/gr_gr_cog/tr.d070:trMA.Ode9K.mode	@ltx/gr_gr_cog/miscellanea:misc.Mode6
ltx/gr_gr_cog/tr.d070:trMA.Ode9K.ode	@ltx/gr_gr_cog/miscellanea:misc.Ode9
ltx/gr_gr_cog/tr.d070:trMA.Ode9K.text	@ltx/gr_gr_cog/he.h.m6:heHE.MiEpodyrouMouMiter.text
ltx/gr_gr_cog/tr.d070:trMA.Oikos1.text	Ὁ συνέχων τὰ πάντα ἐπὶ σταυροῦ ἀνυψώθη, καὶ θρηνεῖ πᾶσα ἡ Κτίσις, τοῦτον βλέπουσα κρεμάμενον γυμνὸν ἐπὶ τοῦ ξύλου, ὁ ἥλιος τὰς ἀκτῖνας ἀπέκρυψε, καὶ τὸ φέγγος οἱ ἀστέρες ἀπεβάλλοντο, ἡ γῆ δὲ σὺν πολλῷ τῷ φόβῳ συνεκλονεῖτο, ἡ θάλασσα ἔφυγε, καὶ αἱ πέτραι διεῤῥήγνυντο, μνημεῖα δὲ πολλὰ ἠνεῴχθησαν, καὶ σώματα ἡγέρθησαν ἁγίων Ἀνδρῶν. ᾍδης κάτω στενάζει, καὶ Ἰουδαῖοι σκέπτονται συκοφαντῆσαι Χριστοῦ τὴν Ἀνάστασιν, τὰ δὲ Γύναια κράζουσι· Τοῦτο Σάββατόν ἐστι τὸ ὑπερευλογημένον, ἐν ᾧ Χριστὸς ἀφυπνώσας, ἀναστήσεται τριήμερος.
ltx/gr_gr_cog/tr.d070:trSY.commemoration.couplet1.title	@ltx/gr_gr_cog/titles:ti.Verses
ltx/gr_gr_cog/tr.d070:trSY.commemoration.couplet1.verse1	Μάτην φυλάττεις τὸν τάφον, κουστωδία·
ltx/gr_gr_cog/tr.d070:trSY.commemoration.couplet1.verse2	Οὐ γὰρ καθέξει τύμβος αὐτοζωΐαν.
ltx/gr_gr_cog/tr.d070:trSY.commemoration.narration.p01	[paragraph 01]
ltx/gr_gr_cog/tr.d070:trSY.commemoration.narration.p02	[paragraph 02]
ltx/gr_gr_cog/tr.d070:trSY.commemoration.narration.p03	[paragraph 03]
ltx/gr_gr_cog/tr.d070:trSY.commemoration.narration.p04	[paragraph 04]
ltx/gr_gr_cog/tr.d070:trSY.commemoration.narration.p05	[paragraph 05]
ltx/gr_gr_cog/tr.d070:trSY.commemoration.narration.p06	[paragraph 06]
ltx/gr_gr_cog/tr.d070:trSY.commemoration.narration.p07	[paragraph 07]
ltx/gr_gr_cog/tr.d070:trSY.commemoration.text	Τῷ ἁγίῳ καὶ μεγάλῳ Σαββάτῳ, τὴν θεόσωμον Ταφήν, καὶ τὴν εἰς ᾍδου Κάθοδον τοῦ Κυρίου καὶ Σωτῆρος ἡμῶν Ἰησοῦ Χριστοῦ ἑορτάζομεν, διʼ ὧν τῆς φθορᾶς τὸ ἡμέτερον γένος ἀνακληθέν, πρὸς αἰωνίαν ζωὴν μεταβέβηκε.
ltx/gr_gr_cog/tr.d070:trSY.lastline	Τῇ ἀνεκφράστῳ σου συγκαταβάσει, Χριστὲ ὁ Θεὸς ἡμῶν, ἐλέησον ἡμᾶς. Ἀμήν.
ltx/gr_gr_cog/tr.d070:trTE.Troparion.incipit	Ὁ συνέχων τὰ πέρατα, τάφῳ…
ltx/gr_gr_cog/tr.d070:trTE.Troparion.melody	
ltx/gr_gr_cog/tr.d070:trTE.Troparion.mode	@ltx/gr_gr_cog/miscellanea:misc.Mode2
ltx/gr_gr_cog/tr.d070:trTE.Troparion.text	Ὁ συνέχων τὰ πέρατα, τάφῳ συσχεθῆναι κατεδέξω Χριστέ, ἵνα τῆς τοῦ ᾍδου καταπτώσεως, λυτρώσῃς τὸ ἀνθρώπινον, καὶ ἀθανατίσας, ζωώσῃς ἡμᾶς, ὡς Θεὸς ἀθάνατος.
ltx/gr_gr_cog/tr.d070:trTE.Troparion2.incipit	Καὶ ἀθανατίσας, ζωώσῃς ἡμᾶς, ὡς…
ltx/gr_gr_cog/tr.d070:trTE.Troparion2.text	Καὶ ἀθανατίσας, ζωώσῃς ἡμᾶς, ὡς Θεὸς ἀθάνατος.
ltx/gr_gr_cog/tr.d070:trVE.Apolytikion1.incipit	Ὁ εὐσχήμων Ἰωσήφ, ἀπὸ τοῦ…
ltx/gr_gr_cog/tr.d070:trVE.Apolytikion1.melody	
ltx/gr_gr_cog/tr.d070:trVE.Apolytikion1.mode	@ltx/gr_gr_cog/miscellanea:misc.Mode2
ltx/gr_gr_cog/tr.d070:trVE.Apolytikion1.text	Ὁ εὐσχήμων Ἰωσήφ, ἀπὸ τοῦ ξύλου καθελὼν τὸ ἄχραντόν σου Σῶμα, σινδόνι καθαρᾷ, εἱλήσας καὶ ἀρώμασιν, ἐν μνήματι καινῷ κηδεύσας ἀπέθετο.
ltx/gr_gr_cog/tr.d070:trVE.Apolytikion2.incipit	@ltx/gr_gr_cog/oc.m2.d1:ocVE.Apolytikion.incipit
ltx/gr_gr_cog/tr.d070:trVE.Apolytikion2.melody	
ltx/gr_gr_cog/tr.d070:trVE.Apolytikion2.mode	@ltx/gr_gr_cog/miscellanea:misc.Mode2
ltx/gr_gr_cog/tr.d070:trVE.Apolytikion2.text	@ltx/gr_gr_cog/oc.m2.d1:ocVE.Apolytikion.text
ltx/gr_gr_cog/tr.d070:trVE.Apolytikion3.incipit	Ταῖς Μυροφόροις Γυναιξί, παρὰ τὸ…
ltx/gr_gr_cog/tr.d070:trVE.Apolytikion3.melody	
ltx/gr_gr_cog/tr.d070:trVE.Apolytikion3.mode	@ltx/gr_gr_cog/miscellanea:misc.Mode2
ltx/gr_gr_cog/tr.d070:trVE.Apolytikion3.text	Ταῖς Μυροφόροις Γυναιξί, παρὰ τὸ μνῆμα ἐπιστάς, ὁ Ἄγγελος ἐβόα·Τὰ μύρα τοῖς θνητοὶς ὑπάρχει ἁρμόδια, Χριστός, δὲ διαφθορᾶς ἐδείχθη ἀλλότριος.
ltx/gr_gr_cog/tr.d070:trVE.AposGlory.incipit	Σὲ τὸν ἀναβαλλόμενον, τὸ φῶς…
ltx/gr_gr_cog/tr.d070:trVE.AposGlory.melody	
ltx/gr_gr_cog/tr.d070:trVE.AposGlory.mode	@ltx/gr_gr_cog/miscellanea:misc.Mode5
ltx/gr_gr_cog/tr.d070:trVE.AposGlory.text	Σὲ τὸν ἀναβαλλόμενον, τὸ φῶς ὥσπερ ἱμάτιον, καθελὼν Ἰωσὴφ ἀπὸ τοῦ ξύλου, σὺν Νικοδήμῳ, καὶ θεωρήσας νεκρὸν γυμνὸν ἄταφον, εὐσυμπάθητον θρῆνον ἀναλαβών, ὀδυρόμενος ἔλεγεν· Οἴμοι, γλυκύτατε Ἰησοῦ! ὃν πρὸ μικροῦ ὁ ἥλιος ἐν Σταυρῷ κρεμάμενον θεασάμενος, ζόφον περιεβάλλετο, καὶ ἡ γῆ τῷ φόβῳ ἐκυμαίνετο, καὶ διεῤῥήγνυτο ναοῦ τὸ καταπέτασμα· ἀλλʼ ἰδοὺ νῦν βλέπω σε, διʼ ἐμὲ ἑκουσίως ὑπελθόντα θάνατον· πῶς σε κηδεύσω Θεέ μου; ἢ πῶς σινδόσιν εἱλήσω; ποίαις χερσὶ δὲ προσψαύσω, τὸ σὸν ἀκήρατον σῶμα; ἢ ποῖα ᾄσματα μέλψω, τῇ σῇ ἐξόδῳ Οἰκτίρμον; Μεγαλύνω τὰ Πάθη σου, ὑμνολογῶ καὶ τὴν Ταφήν σου, σὺν τῇ Ἀναστάσει, κραυγάζων· Κύριε δόξα σοι.
ltx/gr_gr_cog/tr.d070:trVE.Aposticha1.greekmelody	@ltx/gr_gr_cog/he.a.m2:heAU.OteEkTouXylou.greekname
ltx/gr_gr_cog/tr.d070:trVE.Aposticha1.incipit	@ltx/gr_gr_cog/he.a.m2:heAU.OteEkTouXylou.incipit
ltx/gr_gr_cog/tr.d070:trVE.Aposticha1.melody	@ltx/gr_gr_cog/he.a.m2:heAU.OteEkTouXylou.melody
ltx/gr_gr_cog/tr.d070:trVE.Aposticha1.mode	@ltx/gr_gr_cog/miscellanea:misc.Mode2
ltx/gr_gr_cog/tr.d070:trVE.Aposticha1.text	@ltx/gr_gr_cog/he.a.m2:heAU.OteEkTouXylou.text
ltx/gr_gr_cog/tr.d070:trVE.Aposticha2.incipit	Ὅτε ἐν τῷ τάφῳ τῷ…
ltx/gr_gr_cog/tr.d070:trVE.Aposticha2.melody	@ltx/gr_gr_cog/he.a.m2:heAU.OteEkTouXylou.name
ltx/gr_gr_cog/tr.d070:trVE.Aposticha2.mode	@ltx/gr_gr_cog/miscellanea:misc.Mode2
ltx/gr_gr_cog/tr.d070:trVE.Aposticha2.text	Ὅτε ἐν τῷ τάφῳ τῷ καινῷ, ὑπὲρ τοῦ παντὸς κατετέθης, ὁ Λυτρωτὴς τοῦ παντός, ᾍδης ὁ παγγέλαστος, ἰδών σε ἔπτηξεν, οἱ μοχλοὶ συνετρίβησαν, ἐθλάσθησαν πύλαι, μνήματα ἠνοίχθησαν, νεκροὶ ἀνίσταντο· τότε ὁ Ἀδὰμ εὐχαρίστως, χαίρων ἀνεβόα σοι· Δόξα, τῇ συγκαταβάσει σου Φιλάνθρωπε.
ltx/gr_gr_cog/tr.d070:trVE.Aposticha3.incipit	Ὅτε ἐν τῷ τάφῳ σαρκικῶς…
ltx/gr_gr_cog/tr.d070:trVE.Aposticha3.melody	@ltx/gr_gr_cog/he.a.m2:heAU.OteEkTouXylou.name
ltx/gr_gr_cog/tr.d070:trVE.Aposticha3.mode	@ltx/gr_gr_cog/miscellanea:misc.Mode2
ltx/gr_gr_cog/tr.d070:trVE.Aposticha3.text	Ὅτε ἐν τῷ τάφῳ σαρκικῶς, θέλων συνεκλείσθης ὁ φύσει, τῇ τῆς Θεότητος, μένων ἀπερίγραπτος, καὶ ἀδιόριστος, τὰ θανάτου ἀπέκλεισας, ταμεῖα καὶ ᾍδου, ἅπαντα ἐκένωσας, Χριστὲ βασίλεια, τότε καὶ τὸ Σάββατον τοῦτο, θείας εὐλογίας καὶ δόξης, καὶ τῆς σῆς λαμπρότητος ἠξίωσας.
ltx/gr_gr_cog/tr.d070:trVE.Aposticha4.incipit	Ὅτε αἱ δυνάμεις σε Χριστέ…
ltx/gr_gr_cog/tr.d070:trVE.Aposticha4.melody	@ltx/gr_gr_cog/he.a.m2:heAU.OteEkTouXylou.name
ltx/gr_gr_cog/tr.d070:trVE.Aposticha4.mode	@ltx/gr_gr_cog/miscellanea:misc.Mode2
ltx/gr_gr_cog/tr.d070:trVE.Aposticha4.text	Ὅτε αἱ δυνάμεις σε Χριστέ, πλάνον ὑπʼ ἀνόμων ἑώρων, συκοφαντούμενον, ἔφριττον τὴν ἄφατον, μακροθυμίαν σου, καὶ τὸν λίθον τοῦ μνήματος, χερσὶ σφραγισθέντα, αἷς σου τὴν ἀκήρατον, πλευρὰν ἑλόγχευσαν, ὅμως τῇ ἡμῶν σωτηρίᾳ, χαίρουσαι ἐβόων σοι· Δόξα, τῇ συγκαταβάσει σου, Φιλάνθρωπε.
ltx/gr_gr_cog/tr.d070:trVE.SticBoth.incipit	Φοβερὸν καὶ παράδοξον Μυστήριον, σήμερον…
ltx/gr_gr_cog/tr.d070:trVE.SticBoth.melody	@ltx/gr_gr_cog/miscellanea:misc.Idiomelon
ltx/gr_gr_cog/tr.d070:trVE.SticBoth.mode	@ltx/gr_gr_cog/miscellanea:misc.Mode6
ltx/gr_gr_cog/tr.d070:trVE.SticBoth.text	Φοβερὸν καὶ παράδοξον Μυστήριον, σήμερον ἐνεργούμενον καθορᾶται. Ὁ ἀναφὴς κρατεῖται, δεσμεῖται, ὁ λύων τὸν Ἀδὰμ τῆς κατάρας. Ὁ ἐτάζων καρδίας καὶ νεφρούς, ἀδίκως ἐτάζεται, εἱρκτῇ κατακλείεται, ὁ τὴν ἄβυσσον κλείσας, πιλάτῳ παρίσταται, ᾧ τρόμῳ παρίστανται οὐρανῶν αἱ Δυνάμεις, ῥαπίζεται χειρὶ τοῦ πλάσματος, ὁ Πλάστης, ξύλῳ κατακρίνεται, ὁ κρίνων ζῶντας καὶ νεκρούς, τάφῳ κατακλείεται, ὁ καθαιρέτης τοῦ ᾍδου. Ὁ πάντα φέρων συμπαθῶς, καὶ πάντας σώσας τῆς ἀρᾶς, ἀνεξίκακε Κύριε δόξα σοι.
ltx/gr_gr_cog/tr.d070:trVE.SticGlory.incipit	Ὢ! πῶς ἡ παράνομος συναγωγή…
ltx/gr_gr_cog/tr.d070:trVE.SticGlory.melody	@ltx/gr_gr_cog/miscellanea:misc.Idiomelon
ltx/gr_gr_cog/tr.d070:trVE.SticGlory.mode	@ltx/gr_gr_cog/miscellanea:misc.Mode6
ltx/gr_gr_cog/tr.d070:trVE.SticGlory.text	Ὢ! πῶς ἡ παράνομος συναγωγή, τὸν Βασιλέα τῆς Κτίσεως κατεδίκασε θανάτῳ, μὴ αἰδεσθεῖσα τὰς εὐεργεσίας, ἃς ἀναμιμνήσκων, προησφαλίζετο λέγων πρὸς αὐτούς· Λαός μου τί ἐποίησα ὑμῖν; οὐ θαυμάτων ἐνέπλησα τὴν Ἰουδαίαν, οὐ νεκροὺς ἐξανέστησα μόνω τῷ λόγῳ; οὐ πᾶσαν μαλακίαν ἐθεράπευσα καὶ νόσον· τί οὖν μοι ἀνταποδίδοτε; εἰς τί ἀμνημονεῖτέ μου; ἀντὶ τῶν ἰαμάτων πληγάς μοι ἐπιθέντες, ἀντὶ ζωῆς νεκροῦντες, κρεμῶντες ἐπὶ ξύλου, ὡς κακοῦργον, τὸν εὐεργέτην, ὡς παράνομον, τὸν νομοδότην, ὡς κατάκριτον, τὸν πάντων βασιλέα. Μακρόθυμε Κύριε δόξα σοι.
ltx/gr_gr_cog/tr.d070:trVE.Stichera01.incipit	@ltx/gr_gr_cog/tr.d069:trMA.Aposticha1.incipit
ltx/gr_gr_cog/tr.d070:trVE.Stichera01.melody	@ltx/gr_gr_cog/miscellanea:misc.Idiomelon
ltx/gr_gr_cog/tr.d070:trVE.Stichera01.mode	@ltx/gr_gr_cog/miscellanea:misc.Mode1
ltx/gr_gr_cog/tr.d070:trVE.Stichera01.text	@ltx/gr_gr_cog/tr.d069:trMA.Aposticha1.text
ltx/gr_gr_cog/tr.d070:trVE.Stichera02.incipit	@ltx/gr_gr_cog/tr.d069:trMA.Aposticha2.incipit
ltx/gr_gr_cog/tr.d070:trVE.Stichera02.melody	@ltx/gr_gr_cog/miscellanea:misc.Idiomelon
ltx/gr_gr_cog/tr.d070:trVE.Stichera02.mode	@ltx/gr_gr_cog/miscellanea:misc.Mode2
ltx/gr_gr_cog/tr.d070:trVE.Stichera02.text	@ltx/gr_gr_cog/tr.d069:trMA.Aposticha2.text
ltx/gr_gr_cog/tr.d070:trVE.Stichera03.incipit	@ltx/gr_gr_cog/tr.d069:trMA.Aposticha3.incipit
ltx/gr_gr_cog/tr.d070:trVE.Stichera03.melody	@ltx/gr_gr_cog/miscellanea:misc.Idiomelon
ltx/gr_gr_cog/tr.d070:trVE.Stichera03.mode	@ltx/gr_gr_cog/miscellanea:misc.Mode2
ltx/gr_gr_cog/tr.d070:trVE.Stichera03.text	@ltx/gr_gr_cog/tr.d069:trMA.Aposticha3.text
ltx/gr_gr_cog/tr.d070:trVE.Stichera04.incipit	@ltx/gr_gr_cog/tr.d069:trMA.Aposticha4.incipit
ltx/gr_gr_cog/tr.d070:trVE.Stichera04.melody	@ltx/gr_gr_cog/miscellanea:misc.Idiomelon
ltx/gr_gr_cog/tr.d070:trVE.Stichera04.mode	@ltx/gr_gr_cog/miscellanea:misc.Mode2
ltx/gr_gr_cog/tr.d070:trVE.Stichera04.text	@ltx/gr_gr_cog/tr.d069:trMA.Aposticha4.text
ltx/gr_gr_cog/tr.d070:trVE.Stichera05.incipit	Σήμερον ὁ Δεσπότης τῆς κτίσεως…
ltx/gr_gr_cog/tr.d070:trVE.Stichera05.melody	@ltx/gr_gr_cog/miscellanea:misc.Idiomelon
ltx/gr_gr_cog/tr.d070:trVE.Stichera05.mode	@ltx/gr_gr_cog/miscellanea:misc.Mode6
ltx/gr_gr_cog/tr.d070:trVE.Stichera05.text	Σήμερον ὁ Δεσπότης τῆς κτίσεως, παρίσταται Πιλάτῳ, καὶ σταυρῷ παραδίδοται ὁ Κτίστης τῶν ἁπάντων, ὡς ἀμνὸς προσαγόμενος τῇ ἰδίᾳ βουλήσει· τοῖς ἥλοις προσπήγνυται, καὶ τὴν πλευρὰν κεντᾶται, καὶ τῷ σπόγγῳ προσψαύεται, ὁ μάννα ἑπομβρήσας· τὰς σιαγόνας ῥαπίζεται, ὁ Λυτρωτὴς τοῦ Κόσμου, καὶ ὑπὸ τῶν ἰδίων δούλων ἐμπαίζεται, ὁ Πλάστης τῶν ἁπάντων. Ὢ Δεσπότου φιλανθρωπίας! ὑπὲρ τῶν σταυρούντων παρεκάλει τὸν ἴδιον Πατέρα, λέγων· Ἄφες αὐτοῖς τὴν ἁμαρτίαν ταύτην· οὐ γὰρ οἴδασιν οἱ ἄνομοι, τί ἀδίκως πράττουσιν.
ltx/gr_gr_cog/tr.d070:trVE.header	Ἡ Ἀποκαθήλωσις τῇ Παρασκευῇ τὸ Ἀπόγευμα
