ltx/gr_gr_cog/sy.m03.d03:cl.syMA.commemoration01.text	[saint/com 1]
ltx/gr_gr_cog/sy.m03.d03:cl.syMA.commemoration02.text	[saint/com 2]
ltx/gr_gr_cog/sy.m03.d03:cl.syMA.commemoration03.text	[saint/com 3]
ltx/gr_gr_cog/sy.m03.d03:cl.syMA.commemoration04.text	[saint/com 4]
ltx/gr_gr_cog/sy.m03.d03:cl.syMA.commemoration05.text	[saint/com 5]
ltx/gr_gr_cog/sy.m03.d03:cl.syMA.commemoration06.text	[saint/com list]
ltx/gr_gr_cog/sy.m03.d03:syMA.commemoration01.couplet1.title	@ltx/gr_gr_cog/titles:ti.Verses
ltx/gr_gr_cog/sy.m03.d03:syMA.commemoration01.couplet1.verse1	Ὁ χρηστὸς ἡμῖν Εὐτρόπιος τοὺς τρόπους
ltx/gr_gr_cog/sy.m03.d03:syMA.commemoration01.couplet1.verse2	Ἐφεῦρε Χριστὸν καὶ τέλος διὰ ξίφους.
ltx/gr_gr_cog/sy.m03.d03:syMA.commemoration01.couplet2.verse1	Καὶ Κλεόνικος εὐκλεᾶ νίκην ἔχει,
ltx/gr_gr_cog/sy.m03.d03:syMA.commemoration01.couplet2.verse2	Σταυρῷ κρεμασθείς, ὡς ὁ Χριστός μου πάλαι.
ltx/gr_gr_cog/sy.m03.d03:syMA.commemoration01.couplet3.verse1	Εἱρκτὴν τὸ σῶμα καὶ πρὸ τῆς εἱρκτῆς ἔχων,
ltx/gr_gr_cog/sy.m03.d03:syMA.commemoration01.couplet3.verse2	Εἱρκτῶν λυτροῦται Βασιλίσκος ἐκ δύο.
ltx/gr_gr_cog/sy.m03.d03:syMA.commemoration01.narration.p01	Οὗτοι ὑπῆρχον κατὰ τοὺς καιροὺς Μαξιμιανοῦ, συστρατιῶται καὶ συγγενεῖς τοῦ Ἁγίου Μάρτυρος Θεοδώρου τοῦ Τήρωνος, ἐκ τῆς Καππαδοκῶν ὄντες χώρας. Παρίστανται οὖν Ἀσκληπιοδότῃ τῷ Ἡγεμόνι καὶ τύπτονται σφοδρῶς. Ὁ δὲ Ἅγιος Εὐτρόπιος κατὰ τοῦ στόματος λαμβάνει πληγάς, ὅτι τὸν Ἡγεμόνα ἐξύβρισεν. Ἔνθα οἱ μὲν τύπτοντες ἐξημβλύνθησαν διὰ τὸ σύντομον τῆς βασάνου· οἱ δὲ Μάρτυρες, ἐπιφανέντος αὐτοῖς τοῦ Κυρίου καὶ τοῦ ἐνδόξου Μάρτυρος Θεοδώρου, γεγόνασιν ὑγιεῖς. Ἐπὶ οὗν τῇ παραδοξοποιίᾳ ταύτῃ πολλοὶ ἐπίστευσαν τῷ Χριστῷ, τὴν διὰ ξίφους δέχονται τελευτήν. Μεταβαλλομένου οὖν τοῦ Ἡγεμόνος, καὶ κολακείαις ἐπιχειροῦντος τὸν Ἅγιον Κλεόνικον μεταθέσθαι ἀπὸ τῆς εἰς Χριστὸν πίστεως, καὶ τὰ μὲν ὑπισχνουμένου, τὰ δὲ καὶ διδόντος, οὐδέν τι μᾶλλον ὁ Ἅγιος μαλακισθείς, ἀλλὰ καὶ παροξυνθείς, κατεγέλασε μὲν τῆς ἀνοίας τοῦ Ἡγεμόνος, κατεχλεύασε δὲ τὴν τῶν εἰδώλων ἀσθένειαν. Ὅθεν, θυσίας αὐτοῖς ἐπιτελουμένης, διὰ προσευχῆς τὸ ξόανον κατέβαλε τῆς Ἀρτέμιδος. Ἐκκαεῖσαν οὖν πίσσαν καὶ ἄσφαλτον, ἐν τρισὶ λέβησι, κατέχεον ἐπʼ αὐτούς· καὶ αὐτοὶ μὲν ἀλώβητοι διεφυλάχθησαν, οἱ δὲ ὑπουργοὶ καὶ ὑπηρέται τῶν τοιούτων κατεφλέχθησαν. Εἶτα σταυροῦνται Κλεόνικος καὶ Εὐτρόπιος, καὶ τελειοῦνται· ὁ δὲ Ἅγιος Βασιλίσκος ἐν τῇ φρουρᾷ τεθείς, μετὰ χρόνον τινὰ καὶ αὐτὸς τελειοῦται.
ltx/gr_gr_cog/sy.m03.d03:syMA.commemoration01.single1	Ἐν ξύλῳ Εὐτρόπιος σταυροῖο τρίτῃ προσεπήχθη.
ltx/gr_gr_cog/sy.m03.d03:syMA.commemoration01.text	Τῇ Γʹ τοῦ αὐτοῦ μηνός, μνήμη τῶν Ἁγίων Μαρτύρων Εὐτροπίου, Κλεονίκου καὶ Βασιλίσκου.
ltx/gr_gr_cog/sy.m03.d03:syMA.commemoration02.couplet1.title	@ltx/gr_gr_cog/titles:ti.Verses
ltx/gr_gr_cog/sy.m03.d03:syMA.commemoration02.couplet1.verse1	Χωρεῖν ἔχει που τῆς Ἐδὲμ τὸ χωρίον
ltx/gr_gr_cog/sy.m03.d03:syMA.commemoration02.couplet1.verse2	Καὶ τὸν Θεοδώρητον ἔνδον τὸν μέγαν.
ltx/gr_gr_cog/sy.m03.d03:syMA.commemoration02.text	Τῇ αὐτῆ ἡμέρᾳ, μνήμη τοῦ Ἁγίου Ἱερομάρτυρος Θεοδωρήτου, Πρεσβυτέρου Ἀντιοχείας.
ltx/gr_gr_cog/sy.m03.d03:syMA.commemoration03.couplet1.title	@ltx/gr_gr_cog/titles:ti.Verses
ltx/gr_gr_cog/sy.m03.d03:syMA.commemoration03.couplet1.verse1	Ζωῆς λύσις Ζήνωνι καὶ τῷ Ζωΐλῳ
ltx/gr_gr_cog/sy.m03.d03:syMA.commemoration03.couplet1.verse2	Ζωῆς ὑπῆρξε κρείττονος παραιτία.
ltx/gr_gr_cog/sy.m03.d03:syMA.commemoration03.text	Τῇ αὐτῆ ἡμέρᾳ, οἱ Ἅγιοι Ζήνων καὶ Ζωῒλος ἐν εἰρήνῃ τελειοῦνται.
ltx/gr_gr_cog/sy.m03.d03:syMA.commemoration04.couplet1.title	@ltx/gr_gr_cog/titles:ti.Verses
ltx/gr_gr_cog/sy.m03.d03:syMA.commemoration04.couplet1.verse1	Κροσσωτὰ χρυσᾶ Πιαμοῦν μελαμφόρος,
ltx/gr_gr_cog/sy.m03.d03:syMA.commemoration04.couplet1.verse2	Τὰς ἀρετὰς ἄπεισιν ἠμφιεσμένη.
ltx/gr_gr_cog/sy.m03.d03:syMA.commemoration04.text	Τῇ αὐτῆ ἡμέρᾳ, ἡ Ὁσία Πιαμοῦν ἡ παρθένος ἐν εἰρήνῃ τελειοῦται.
ltx/gr_gr_cog/sy.m03.d03:syMA.lastline	Ταῖς αὐτῶν ἁγίαις πρεσβείαις, ὁ Θεὸς ἐλέησον ἡμᾶς. Ἀμήν.
