ltx/gr_gr_cog/me.m08.d07:alt1.meDA.commemoration.first_short	Μνήμη τοῦ Ὁσίου Θεοδοσίου τοῦ Νέου
ltx/gr_gr_cog/me.m08.d07:alt1.meLI.Megalynarion.text	Χαίροις θεῖον βλάστημα Ἀθηνῶν, καὶ τῆς Ἀργολίδος ἀντιλήπτωρ καὶ ἀρωγός· χαίροις ὁ βλυστάνων, ἰάματα ποικίλα, τοῖς σὲ ὑμνολογοῦσιν, ὦ Θεοδόσιε.
ltx/gr_gr_cog/me.m08.d07:meDA.commemoration.first	Μνήμη τοῦ Ἁγίου Ὁσιομάρτυρος Δομετίου
ltx/gr_gr_cog/me.m08.d07:meDA.commemoration.first_name	
ltx/gr_gr_cog/me.m08.d07:meDA.commemoration.first_short	Μνήμη τοῦ Ἁγίου Ὁσιομάρτυρος Δομετίου
ltx/gr_gr_cog/me.m08.d07:meDA.commemoration.first_title	@ltx/gr_gr_cog/titles:ti.SaintM
ltx/gr_gr_cog/me.m08.d07:meDA.commemoration.full	Μνήμη τοῦ Ἁγίου Ὁσιομάρτυρος Δομετίου
ltx/gr_gr_cog/me.m08.d07:meDA.commemoration.second_name	
ltx/gr_gr_cog/me.m08.d07:meDA.commemoration.second_title	
ltx/gr_gr_cog/me.m08.d07:meDA.date	Τῌ Ζʹ ΑΥΓΟΥΣΤΟΥ
ltx/gr_gr_cog/me.m08.d07:meDA.dismissal	@ltx/gr_gr_cog/dismissals:dis00.transfiguration
ltx/gr_gr_cog/me.m08.d07:meDA.fordate	διὰ τὴν 7ην Αὐγούστου
ltx/gr_gr_cog/me.m08.d07:meDA.insert1	καὶ τοῦ Ἁγίου Ὁσιομάρτυρος Δομετίου,
ltx/gr_gr_cog/me.m08.d07:meDA.insert2	οὗ καὶ τὴν μνήμην ἐπιτελοῦμεν·
ltx/gr_gr_cog/me.m08.d07:meDA.note	
ltx/gr_gr_cog/me.m08.d07:meDA.pdfcoverdate	τῆς 7ης Αὐγούστου,
ltx/gr_gr_cog/me.m08.d07:meDA.pdfheaderdate	τῆς 7ης Αὐγούστου
ltx/gr_gr_cog/me.m08.d07:meHO.commemorations	
ltx/gr_gr_cog/me.m08.d07:meHO.note1	
ltx/gr_gr_cog/me.m08.d07:meHO.note2	
ltx/gr_gr_cog/me.m08.d07:meHO.number	
ltx/gr_gr_cog/me.m08.d07:meHO.rank	
ltx/gr_gr_cog/me.m08.d07:meLE.commemoration1	Τοῦ Ἁγίου Ὁσιομάρτυρος Δομετίου τοῦ Πέρσου.
ltx/gr_gr_cog/me.m08.d07:meLE.commemoration2	
ltx/gr_gr_cog/me.m08.d07:meLI.Kontakion1.incipit	@ltx/gr_gr_cog/me.m08.d07:meMA.Kontakion1.incipit
ltx/gr_gr_cog/me.m08.d07:meLI.Kontakion1.melody	@ltx/gr_gr_cog/me.m08.d07:meMA.Kontakion1.melody
ltx/gr_gr_cog/me.m08.d07:meLI.Kontakion1.mode	@ltx/gr_gr_cog/me.m08.d07:meMA.Kontakion1.mode
ltx/gr_gr_cog/me.m08.d07:meLI.Kontakion1.text	@ltx/gr_gr_cog/me.m08.d07:meMA.Kontakion1.text
ltx/gr_gr_cog/me.m08.d07:meLI.Megalynarion.text	
ltx/gr_gr_cog/me.m08.d07:meMA.AposGlory.incipit	@ltx/gr_gr_cog/me.m08.d05:meMA.AposGlory.incipit
ltx/gr_gr_cog/me.m08.d07:meMA.AposGlory.melody	
ltx/gr_gr_cog/me.m08.d07:meMA.AposGlory.mode	@ltx/gr_gr_cog/miscellanea:misc.Mode5
ltx/gr_gr_cog/me.m08.d07:meMA.AposGlory.text	@ltx/gr_gr_cog/me.m08.d05:meMA.AposGlory.text
ltx/gr_gr_cog/me.m08.d07:meMA.Aposticha1.greekmelody	@ltx/gr_gr_cog/he.a.m2:heAU.OikosTouEfratha.greekname
ltx/gr_gr_cog/me.m08.d07:meMA.Aposticha1.incipit	@ltx/gr_gr_cog/me.m08.d05:meVE.Aposticha3.incipit
ltx/gr_gr_cog/me.m08.d07:meMA.Aposticha1.melody	@ltx/gr_gr_cog/he.a.m2:heAU.OikosTouEfratha.name
ltx/gr_gr_cog/me.m08.d07:meMA.Aposticha1.mode	@ltx/gr_gr_cog/miscellanea:misc.Mode2
ltx/gr_gr_cog/me.m08.d07:meMA.Aposticha1.text	@ltx/gr_gr_cog/me.m08.d05:meVE.Aposticha3.text
ltx/gr_gr_cog/me.m08.d07:meMA.Aposticha2.incipit	Ὤφθης τὸ πρὶν Χριστέ, Μωσεῖ…
ltx/gr_gr_cog/me.m08.d07:meMA.Aposticha2.melody	@ltx/gr_gr_cog/he.a.m2:heAU.OikosTouEfratha.name
ltx/gr_gr_cog/me.m08.d07:meMA.Aposticha2.mode	@ltx/gr_gr_cog/miscellanea:misc.Mode2
ltx/gr_gr_cog/me.m08.d07:meMA.Aposticha2.text	Ὤφθης τὸ πρὶν Χριστέ, Μωσεῖ τε καὶ Ἠλίᾳ, ἐν γνόφῳ καὶ θυέλλῃ, καὶ αὔρᾳ λεπτοτάτῃ· νῦν δὲ φωτὶ τῆς δόξης σου.
ltx/gr_gr_cog/me.m08.d07:meMA.Aposticha3.incipit	Σέλας τὸ τριλαμπές, ἀστράψας ἀποῤῥήτως…
ltx/gr_gr_cog/me.m08.d07:meMA.Aposticha3.melody	@ltx/gr_gr_cog/he.a.m2:heAU.OikosTouEfratha.name
ltx/gr_gr_cog/me.m08.d07:meMA.Aposticha3.mode	@ltx/gr_gr_cog/miscellanea:misc.Mode2
ltx/gr_gr_cog/me.m08.d07:meMA.Aposticha3.text	Σέλας τὸ τριλαμπές, ἀστράψας ἀποῤῥήτως, τῆς θεϊκῆς σου δόξης, Θαβὼρ ἐν ὄρει Σῶτερ, τὴν σύμπασαν ἐφαίδρυνας.
ltx/gr_gr_cog/me.m08.d07:meMA.C1.acrostic.notice1	οὗ ἡ Ἀκροστιχίς·
ltx/gr_gr_cog/me.m08.d07:meMA.C1.acrostic.text	Πρέσβιν σε Χριστῷ προσφέρω στεφηφόρε.
ltx/gr_gr_cog/me.m08.d07:meMA.C1.acrostic.title	Ὁ Κανὼν τοῦ Ἁγίου,
ltx/gr_gr_cog/me.m08.d07:meMA.C1.poet	@ltx/gr_gr_cog/poets:po.Theofanous
ltx/gr_gr_cog/me.m08.d07:meMA.C1.title	@ltx/gr_gr_cog/titles:ti.CanonSaintM
ltx/gr_gr_cog/me.m08.d07:meMA.C1.verse	@ltx/gr_gr_cog/prayers:pr.verse_SaintM.text
ltx/gr_gr_cog/me.m08.d07:meMA.Exaposteilarion1.greekmelody	@ltx/gr_gr_cog/he.a.m2:heAU.ToisMathitaisSynelthomen.greekname
ltx/gr_gr_cog/me.m08.d07:meMA.Exaposteilarion1.incipit	Ἐκ περσικῆς ὁρμώμενος, χώρας τῆς…
ltx/gr_gr_cog/me.m08.d07:meMA.Exaposteilarion1.melody	@ltx/gr_gr_cog/he.a.m2:heAU.ToisMathitaisSynelthomen.name
ltx/gr_gr_cog/me.m08.d07:meMA.Exaposteilarion1.mode	@ltx/gr_gr_cog/miscellanea:misc.Mode2
ltx/gr_gr_cog/me.m08.d07:meMA.Exaposteilarion1.text	Ἐκ περσικῆς ὁρμώμενος, χώρας τῆς πυρσολάτρου, τῇ τοῦ Χριστοῦ προσέδραμες, ἐκ παιδὸς θείᾳ πίστει, Δομέτιε θεοκήρυξ· ὅθεν Πάτερ ἐν ὕμνοις, ὡς ἀσκητὴν τιμῶμέν σε, καὶ ὡς Μάρτυρα θεῖον καὶ τῶν φρικτῶν, μυστηρίων ἔνθεον ἱερέα, καὶ πρέσβυν τῶν τελούντων σου, τὴν σεβάσμιον μνήμην.
ltx/gr_gr_cog/me.m08.d07:meMA.Exaposteilarion2.greekmelody	@ltx/gr_gr_cog/he.a.m2:heAU.ToisMathitaisSynelthomen.greekname
ltx/gr_gr_cog/me.m08.d07:meMA.Exaposteilarion2.incipit	Πρὸ τοῦ Σταυροῦ σου Κύριε…
ltx/gr_gr_cog/me.m08.d07:meMA.Exaposteilarion2.melody	@ltx/gr_gr_cog/he.a.m2:heAU.ToisMathitaisSynelthomen.name
ltx/gr_gr_cog/me.m08.d07:meMA.Exaposteilarion2.mode	@ltx/gr_gr_cog/miscellanea:misc.Mode2
ltx/gr_gr_cog/me.m08.d07:meMA.Exaposteilarion2.text	Πρὸ τοῦ Σταυροῦ σου Κύριε, Μαθητῶν τοὺς προκρίτους, λαβὼν μετεμορφώθης νῦν, ἐν Θαβὼρ τῷ ἁγίῳ· ἐν ᾧ Μωσῆς καὶ Ἠλίας, παρειστήκεισαν τρόμῳ, δουλοπρεπῶς σοι Δέσποτα, συλλαλοῦντες· μεθʼ ὧν σε Χριστὲ Σωτήρ, σὺν Πατρὶ καὶ Πνεύματι προσκυνοῦμεν, τὸν ἐκ Παρθένου λάμψαντα, εἰς βροτῶν σωτηρίαν.
ltx/gr_gr_cog/me.m08.d07:meMA.Kathisma11.greekmelody	@ltx/gr_gr_cog/he.a.m4:heAU.EpefanisSimeron.greekname
ltx/gr_gr_cog/me.m08.d07:meMA.Kathisma11.incipit	Ἑορτὴ ὑπέρλαμπρος ἡ τοῦ Δεσπότου…
ltx/gr_gr_cog/me.m08.d07:meMA.Kathisma11.melody	@ltx/gr_gr_cog/he.a.m4:heAU.EpefanisSimeron.name
ltx/gr_gr_cog/me.m08.d07:meMA.Kathisma11.mode	@ltx/gr_gr_cog/miscellanea:misc.Mode4
ltx/gr_gr_cog/me.m08.d07:meMA.Kathisma11.text	Ἑορτὴ ὑπέρλαμπρος ἡ τοῦ Δεσπότου, ἦλθε· δεῦτε ἅπαντες, ἐπὶ τῷ ὄρει νοερῶς, προκαθαρθέντες ἀνέλθωμεν, τῷ Θαβωρίῳ, Χριστὸν ἐποψόμενοι.
ltx/gr_gr_cog/me.m08.d07:meMA.Kathisma21.greekmelody	@ltx/gr_gr_cog/he.a.m4:heAU.KateplagiIosif.greekname
ltx/gr_gr_cog/me.m08.d07:meMA.Kathisma21.incipit	Τὴν μεθέορτον πιστοί, ἡμέραν σήμερον…
ltx/gr_gr_cog/me.m08.d07:meMA.Kathisma21.melody	@ltx/gr_gr_cog/he.a.m4:heAU.KateplagiIosif.name
ltx/gr_gr_cog/me.m08.d07:meMA.Kathisma21.mode	@ltx/gr_gr_cog/miscellanea:misc.Mode4
ltx/gr_gr_cog/me.m08.d07:meMA.Kathisma21.text	Τὴν μεθέορτον πιστοί, ἡμέραν σήμερον φαιδρῶς, τῆς ἐνδόξου καὶ φρικτῆς, Μεταμορφώσεως Χριστοῦ, ἐπιτελοῦντες βοήσωμεν ὁμοφρόνως· Τὸ φύραμα ἡμῶν, ἀνεμορφώσω Σωτήρ, τῇ θείᾳ σου σαρκί, συναπαστράψας αὐτῷ, καὶ ἀποδοὺς τὸ πρώτιστον ἀξίωμα, τῆς ἀφθαρσίας ὡς εὔσπλαγχνος. Διό σε πάντες, δοξολογοῦμεν, τὸν μόνον Θεόν ἡμῶν.
ltx/gr_gr_cog/me.m08.d07:meMA.Kontakion1.incipit	@ltx/gr_gr_cog/me.m08.d06:meMA.Kontakion1.incipit
ltx/gr_gr_cog/me.m08.d07:meMA.Kontakion1.melody	
ltx/gr_gr_cog/me.m08.d07:meMA.Kontakion1.mode	@ltx/gr_gr_cog/miscellanea:misc.Mode7
ltx/gr_gr_cog/me.m08.d07:meMA.Kontakion1.text	@ltx/gr_gr_cog/me.m08.d06:meMA.Kontakion1.text
ltx/gr_gr_cog/me.m08.d07:meMA.Ode1C11.greekmelody	@ltx/gr_gr_cog/he.h.m6:heHE.OsEnIpeiroPezefsas.greekname
ltx/gr_gr_cog/me.m08.d07:meMA.Ode1C11.incipit	Πρὸς τὸν Θεὸν ἐκδημήσας μαρτυρικῇ…
ltx/gr_gr_cog/me.m08.d07:meMA.Ode1C11.melody	@ltx/gr_gr_cog/he.h.m6:heHE.OsEnIpeiroPezefsas.name
ltx/gr_gr_cog/me.m08.d07:meMA.Ode1C11.mode	@ltx/gr_gr_cog/miscellanea:misc.Mode6
ltx/gr_gr_cog/me.m08.d07:meMA.Ode1C11.ode	@ltx/gr_gr_cog/miscellanea:misc.Ode1
ltx/gr_gr_cog/me.m08.d07:meMA.Ode1C11.text	Πρὸς τὸν Θεὸν ἐκδημήσας μαρτυρικῇ, διαλάμπων χάριτι, τοῖς ὑμνοῦσί σε πιστῶς, φωτοφόρον ἔμπνευσον αὐγήν, ἱκετεύων τὸν Χριστὸν θεομακάριστε.
ltx/gr_gr_cog/me.m08.d07:meMA.Ode1C12.incipit	Ῥήξας τοὺς βρόχους τῆς πλάνης…
ltx/gr_gr_cog/me.m08.d07:meMA.Ode1C12.melody	@ltx/gr_gr_cog/he.h.m6:heHE.OsEnIpeiroPezefsas.name
ltx/gr_gr_cog/me.m08.d07:meMA.Ode1C12.mode	@ltx/gr_gr_cog/miscellanea:misc.Mode6
ltx/gr_gr_cog/me.m08.d07:meMA.Ode1C12.ode	@ltx/gr_gr_cog/miscellanea:misc.Ode1
ltx/gr_gr_cog/me.m08.d07:meMA.Ode1C12.text	Ῥήξας τοὺς βρόχους τῆς πλάνης εἰλικρινῶς, τῷ Χριστῷ προσέδραμες, διανοίᾳ καθαρᾷ, τὰ Περσῶν σεβάσματα λιπών, καὶ τῶν Μάγων ἐκφυγὼν τὴν ἀθεότητα.
ltx/gr_gr_cog/me.m08.d07:meMA.Ode1C13.incipit	Ἐπιστημόνως σκοπήσας ὡς οὐ Θεός…
ltx/gr_gr_cog/me.m08.d07:meMA.Ode1C13.melody	@ltx/gr_gr_cog/he.h.m6:heHE.OsEnIpeiroPezefsas.name
ltx/gr_gr_cog/me.m08.d07:meMA.Ode1C13.mode	@ltx/gr_gr_cog/miscellanea:misc.Mode6
ltx/gr_gr_cog/me.m08.d07:meMA.Ode1C13.ode	@ltx/gr_gr_cog/miscellanea:misc.Ode1
ltx/gr_gr_cog/me.m08.d07:meMA.Ode1C13.text	Ἐπιστημόνως σκοπήσας ὡς οὐ Θεός, ὡς κτιστὸς ὁ ἥλιος, ὡς οὐδὲν τῶν ὁρατῶν, ἐπὶ τὸν ἀόρατον Θεόν, ὡδηγήθης λογισμῷ σοφῷ χρησάμενος.
ltx/gr_gr_cog/me.m08.d07:meMA.Ode1C1T.incipit	Σὲ Παναγία Παρθένε τὴν τὸν…
ltx/gr_gr_cog/me.m08.d07:meMA.Ode1C1T.melody	@ltx/gr_gr_cog/he.h.m6:heHE.OsEnIpeiroPezefsas.name
ltx/gr_gr_cog/me.m08.d07:meMA.Ode1C1T.mode	@ltx/gr_gr_cog/miscellanea:misc.Mode6
ltx/gr_gr_cog/me.m08.d07:meMA.Ode1C1T.ode	@ltx/gr_gr_cog/miscellanea:misc.Ode1
ltx/gr_gr_cog/me.m08.d07:meMA.Ode1C1T.text	Σὲ Παναγία Παρθένε τὴν τὸν Υἱὸν τοῦ Θεοῦ γεννήσασαν, γεγονότα καθʼ ἡμᾶς, διʼ ἡμᾶς κηρύττομεν ἁγνή, Θεομήτορα πιστοὶ καὶ μακαρίζομεν.
ltx/gr_gr_cog/me.m08.d07:meMA.Ode3C11.greekmelody	@ltx/gr_gr_cog/he.h.m6:heHE.OukEstinAgios.greekname
ltx/gr_gr_cog/me.m08.d07:meMA.Ode3C11.incipit	Βεβαίᾳ πίστει στηριχθείς, ὡς ἀκλόνητος…
ltx/gr_gr_cog/me.m08.d07:meMA.Ode3C11.melody	@ltx/gr_gr_cog/he.h.m6:heHE.OukEstinAgios.name
ltx/gr_gr_cog/me.m08.d07:meMA.Ode3C11.mode	@ltx/gr_gr_cog/miscellanea:misc.Mode6
ltx/gr_gr_cog/me.m08.d07:meMA.Ode3C11.ode	@ltx/gr_gr_cog/miscellanea:misc.Ode3
ltx/gr_gr_cog/me.m08.d07:meMA.Ode3C11.text	Βεβαίᾳ πίστει στηριχθείς, ὡς ἀκλόνητος πύργος, ἀπερίτρεπτος ὤφθης, οὐ λόγοις τοῖς μαγικοῖς, οὐ γνώσεως Περσικῆς, γοητείαις περιεργαζόμενος.
ltx/gr_gr_cog/me.m08.d07:meMA.Ode3C12.incipit	Ἰὸν ψυχόλεθρον φυγών, τοῦ τῇ…
ltx/gr_gr_cog/me.m08.d07:meMA.Ode3C12.melody	@ltx/gr_gr_cog/he.h.m6:heHE.OukEstinAgios.name
ltx/gr_gr_cog/me.m08.d07:meMA.Ode3C12.mode	@ltx/gr_gr_cog/miscellanea:misc.Mode6
ltx/gr_gr_cog/me.m08.d07:meMA.Ode3C12.ode	@ltx/gr_gr_cog/miscellanea:misc.Ode3
ltx/gr_gr_cog/me.m08.d07:meMA.Ode3C12.text	Ἰὸν ψυχόλεθρον φυγών, τοῦ τῇ κτίσει λατρεύειν, καὶ τὸν ἥλιον σέβειν, τὸν ὄντως ὄντα Θεόν, ὡς πάντων Δημιουργόν, εὐσεβείας πόθῳ ἐξεζήτησας.
ltx/gr_gr_cog/me.m08.d07:meMA.Ode3C13.incipit	Ναμάτων θείων μετασχών, τῆς παλιγγενεσίας…
ltx/gr_gr_cog/me.m08.d07:meMA.Ode3C13.melody	@ltx/gr_gr_cog/he.h.m6:heHE.OukEstinAgios.name
ltx/gr_gr_cog/me.m08.d07:meMA.Ode3C13.mode	@ltx/gr_gr_cog/miscellanea:misc.Mode6
ltx/gr_gr_cog/me.m08.d07:meMA.Ode3C13.ode	@ltx/gr_gr_cog/miscellanea:misc.Ode3
ltx/gr_gr_cog/me.m08.d07:meMA.Ode3C13.text	Ναμάτων θείων μετασχών, τῆς παλιγγενεσίας, τὴν ψυχὴν κατηυγάσθης, καὶ γέγονας ἀληθῶς, υἱὸς χάριτι Θεοῦ, κληρονόμος θείων ἀπολαύσεων.
ltx/gr_gr_cog/me.m08.d07:meMA.Ode3C1T.incipit	Σοφία οἶκον ἑαυτῇ, ᾠκοδόμησε θεῖον…
ltx/gr_gr_cog/me.m08.d07:meMA.Ode3C1T.melody	@ltx/gr_gr_cog/he.h.m6:heHE.OukEstinAgios.name
ltx/gr_gr_cog/me.m08.d07:meMA.Ode3C1T.mode	@ltx/gr_gr_cog/miscellanea:misc.Mode6
ltx/gr_gr_cog/me.m08.d07:meMA.Ode3C1T.ode	@ltx/gr_gr_cog/miscellanea:misc.Ode3
ltx/gr_gr_cog/me.m08.d07:meMA.Ode3C1T.text	Σοφία οἶκον ἑαυτῇ, ᾠκοδόμησε θεῖον, ὑπὲρ νοῦν τε καὶ λόγον, σκηνώσασα τὴν ἁγνήν, γαστέρα σου τὴν σεπτήν, καθαρθεῖσαν Πνεύματι Πανύμνητε.
ltx/gr_gr_cog/me.m08.d07:meMA.Ode3H.greekmelody	@ltx/gr_gr_cog/he.h.m6:heHE.OukEstinAgios.greekname
ltx/gr_gr_cog/me.m08.d07:meMA.Ode3H.incipit	@ltx/gr_gr_cog/he.h.m6:heHE.OukEstinAgios.incipit
ltx/gr_gr_cog/me.m08.d07:meMA.Ode3H.melody	@ltx/gr_gr_cog/he.h.m6:heHE.OukEstinAgios.melody
ltx/gr_gr_cog/me.m08.d07:meMA.Ode3H.mode	@ltx/gr_gr_cog/miscellanea:misc.Mode6
ltx/gr_gr_cog/me.m08.d07:meMA.Ode3H.ode	@ltx/gr_gr_cog/miscellanea:misc.Ode3
ltx/gr_gr_cog/me.m08.d07:meMA.Ode3H.text	@ltx/gr_gr_cog/he.h.m6:heHE.OukEstinAgios.text
ltx/gr_gr_cog/me.m08.d07:meMA.Ode3Kathisma1.greekmelody	@ltx/gr_gr_cog/he.a.m3:heAU.TinOraiotita.greekname
ltx/gr_gr_cog/me.m08.d07:meMA.Ode3Kathisma1.incipit	Τὴν ὡραιότητα Χριστοῦ ἐπόθησας, καὶ…
ltx/gr_gr_cog/me.m08.d07:meMA.Ode3Kathisma1.melody	@ltx/gr_gr_cog/he.a.m3:heAU.TinOraiotita.name
ltx/gr_gr_cog/me.m08.d07:meMA.Ode3Kathisma1.mode	@ltx/gr_gr_cog/miscellanea:misc.Mode3
ltx/gr_gr_cog/me.m08.d07:meMA.Ode3Kathisma1.text	Τὴν ὡραιότητα Χριστοῦ ἐπόθησας, καὶ διʼ ἀσκήσεως πάθη ἐνέκρωσας, καὶ ἐναθλήσας καρτερῶς, τὴν πλάνην ἀπετέφρωσας, Ἔνδοξε Δομέτιε, τῶν Ἀγγέλων συνόμιλε· ὅθεν καὶ ἰάσεων, ῥεῖθρα βρύεις τοῖς πίστει σου, τὴν μνήμην ἐπιτελοῦσι τὴν θείαν, Μάρτυς ἀξιοθαύμαστε.
ltx/gr_gr_cog/me.m08.d07:meMA.Ode3Kathisma2.greekmelody	@ltx/gr_gr_cog/he.a.m3:heAU.TinOraiotita.greekname
ltx/gr_gr_cog/me.m08.d07:meMA.Ode3Kathisma2.incipit	Τῆς θείας δόξης σου, ὄντως…
ltx/gr_gr_cog/me.m08.d07:meMA.Ode3Kathisma2.melody	@ltx/gr_gr_cog/he.a.m3:heAU.TinOraiotita.name
ltx/gr_gr_cog/me.m08.d07:meMA.Ode3Kathisma2.mode	@ltx/gr_gr_cog/miscellanea:misc.Mode3
ltx/gr_gr_cog/me.m08.d07:meMA.Ode3Kathisma2.text	Τῆς θείας δόξης σου, ὄντως ἀπαύγασμα, καθὼς ἠδύναντο, ἔδειξας Λόγε Θεοῦ, τοῖς μαθηταῖς σου ἐν Θαβώρ, ὄρει μεταμορφούμενος, οἷς συνελλαμφθείημεν, καὶ ἡμεῖς οἱ ὑμνοῦντές σε, μόνε ἀναλλοίωτε, Ἰησοῦ παντοδύναμε, ἐν πίστει σοι συμφώνως βοῶντες· Δόξα Χριστὲ τῇ βασιλείᾳ σου.
ltx/gr_gr_cog/me.m08.d07:meMA.Ode4C11.greekmelody	@ltx/gr_gr_cog/he.h.m6:heHE.ChristosMouDynamis.greekname
ltx/gr_gr_cog/me.m08.d07:meMA.Ode4C11.incipit	Ἐπέγνως ἔνδοξε, τὸ φύσει ἄγνωστον…
ltx/gr_gr_cog/me.m08.d07:meMA.Ode4C11.melody	@ltx/gr_gr_cog/he.h.m6:heHE.ChristosMouDynamis.name
ltx/gr_gr_cog/me.m08.d07:meMA.Ode4C11.mode	@ltx/gr_gr_cog/miscellanea:misc.Mode6
ltx/gr_gr_cog/me.m08.d07:meMA.Ode4C11.ode	@ltx/gr_gr_cog/miscellanea:misc.Ode4
ltx/gr_gr_cog/me.m08.d07:meMA.Ode4C11.text	Ἐπέγνως ἔνδοξε, τὸ φύσει ἄγνωστον, λογικῶς ἐκζητήσας καὶ εὐρηκώς, τοῦτον ἐπεπόθησας, καὶ προσεκύνησας χαρᾷ, τὴν αὐτοῦ μεγαλειότητα.
ltx/gr_gr_cog/me.m08.d07:meMA.Ode4C12.incipit	Χορείᾳ σώφρονι, θερμῶς προσέδραμες, μοναζόντων…
ltx/gr_gr_cog/me.m08.d07:meMA.Ode4C12.melody	@ltx/gr_gr_cog/he.h.m6:heHE.ChristosMouDynamis.name
ltx/gr_gr_cog/me.m08.d07:meMA.Ode4C12.mode	@ltx/gr_gr_cog/miscellanea:misc.Mode6
ltx/gr_gr_cog/me.m08.d07:meMA.Ode4C12.ode	@ltx/gr_gr_cog/miscellanea:misc.Ode4
ltx/gr_gr_cog/me.m08.d07:meMA.Ode4C12.text	Χορείᾳ σώφρονι, θερμῶς προσέδραμες, μοναζόντων Ἁγίων καὶ ἀρετῆς, ζήλῳ πυρπολούμενος, ἐπολιτεύσω καθαρῶς, ἐν νηστείαις καὶ δεήσεσιν.
ltx/gr_gr_cog/me.m08.d07:meMA.Ode4C13.incipit	Ῥαδίως ἔλυσε, δεσμὰ τῆς φύσεως…
ltx/gr_gr_cog/me.m08.d07:meMA.Ode4C13.melody	@ltx/gr_gr_cog/he.h.m6:heHE.ChristosMouDynamis.name
ltx/gr_gr_cog/me.m08.d07:meMA.Ode4C13.mode	@ltx/gr_gr_cog/miscellanea:misc.Mode6
ltx/gr_gr_cog/me.m08.d07:meMA.Ode4C13.ode	@ltx/gr_gr_cog/miscellanea:misc.Ode4
ltx/gr_gr_cog/me.m08.d07:meMA.Ode4C13.text	Ῥαδίως ἔλυσε, δεσμὰ τῆς φύσεως, ὁ θεόφρων σου πόθος καὶ τῶν παθῶν, ἔσβεσε τὴν κάμινον, τῷ δροσοβόλῳ φωτισμῷ, τοῦ Ἁγίου Πάτερ Πνεύματος.
ltx/gr_gr_cog/me.m08.d07:meMA.Ode4C1T.incipit	Ἰσχύς μου πέφυκε, Θεὸς καὶ…
ltx/gr_gr_cog/me.m08.d07:meMA.Ode4C1T.melody	@ltx/gr_gr_cog/he.h.m6:heHE.ChristosMouDynamis.name
ltx/gr_gr_cog/me.m08.d07:meMA.Ode4C1T.mode	@ltx/gr_gr_cog/miscellanea:misc.Mode6
ltx/gr_gr_cog/me.m08.d07:meMA.Ode4C1T.ode	@ltx/gr_gr_cog/miscellanea:misc.Ode4
ltx/gr_gr_cog/me.m08.d07:meMA.Ode4C1T.text	Ἰσχύς μου πέφυκε, Θεὸς καὶ Κύριος, Θεοτόκε Παρθένε ὁ σαρκωθείς, Λόγος ὁ ὑπέρθεος, ἀκηράτου σου γαστρός, τὴν ζωὴν ἡμῖν δωρούμενος.
ltx/gr_gr_cog/me.m08.d07:meMA.Ode5C11.greekmelody	@ltx/gr_gr_cog/he.h.m6:heHE.ToTheioFengeiSou.greekname
ltx/gr_gr_cog/me.m08.d07:meMA.Ode5C11.incipit	Συνέσει θείᾳ διαπρεπής, Μάκαρ πεφυκώς…
ltx/gr_gr_cog/me.m08.d07:meMA.Ode5C11.melody	@ltx/gr_gr_cog/he.h.m6:heHE.ToTheioFengeiSou.name
ltx/gr_gr_cog/me.m08.d07:meMA.Ode5C11.mode	@ltx/gr_gr_cog/miscellanea:misc.Mode6
ltx/gr_gr_cog/me.m08.d07:meMA.Ode5C11.ode	@ltx/gr_gr_cog/miscellanea:misc.Ode5
ltx/gr_gr_cog/me.m08.d07:meMA.Ode5C11.text	Συνέσει θείᾳ διαπρεπής, Μάκαρ πεφυκώς, τῶν ὁρωμένων ἁπάντων προέκρινας, τὴν τῶν ἀοράτων ἀϊδιότητα, τῷ φέγγει τῆς ἁγνείας καταλαμπόμενος.
ltx/gr_gr_cog/me.m08.d07:meMA.Ode5C12.incipit	Τῆς θείας γευσάμενος ἀρετῆς, τὸ…
ltx/gr_gr_cog/me.m08.d07:meMA.Ode5C12.melody	@ltx/gr_gr_cog/he.h.m6:heHE.ToTheioFengeiSou.name
ltx/gr_gr_cog/me.m08.d07:meMA.Ode5C12.mode	@ltx/gr_gr_cog/miscellanea:misc.Mode6
ltx/gr_gr_cog/me.m08.d07:meMA.Ode5C12.ode	@ltx/gr_gr_cog/miscellanea:misc.Ode5
ltx/gr_gr_cog/me.m08.d07:meMA.Ode5C12.text	Τῆς θείας γευσάμενος ἀρετῆς, τὸ τῆς ἡσυχίας καὶ ἀναχωρήσεως ἔστερξας, τὴν τῆς διανοίας ἀνεπιθόλωτον, κατάστασιν φυλάττων, Πάτερ Δομέτιε.
ltx/gr_gr_cog/me.m08.d07:meMA.Ode5C13.incipit	Ὡς ὄντως μέγα καὶ θαυμαστόν…
ltx/gr_gr_cog/me.m08.d07:meMA.Ode5C13.melody	@ltx/gr_gr_cog/he.h.m6:heHE.ToTheioFengeiSou.name
ltx/gr_gr_cog/me.m08.d07:meMA.Ode5C13.mode	@ltx/gr_gr_cog/miscellanea:misc.Mode6
ltx/gr_gr_cog/me.m08.d07:meMA.Ode5C13.ode	@ltx/gr_gr_cog/miscellanea:misc.Ode5
ltx/gr_gr_cog/me.m08.d07:meMA.Ode5C13.text	Ὡς ὄντως μέγα καὶ θαυμαστόν, τῆς ἐπὶ τὸ κρεῖττον μεταβολῆς σου, τὸ πάνσοφον φρόνημα· τῆς γὰρ τοῦ Ὑψίστου χειρὸς ἀλλοίωσις, καὶ χάριτος τῆς θείας ἔργον ἐγένετο.
ltx/gr_gr_cog/me.m08.d07:meMA.Ode5C1T.incipit	Παρθένος ἔμεινας ἀσινής, καὶ τὰ…
ltx/gr_gr_cog/me.m08.d07:meMA.Ode5C1T.melody	@ltx/gr_gr_cog/he.h.m6:heHE.ToTheioFengeiSou.name
ltx/gr_gr_cog/me.m08.d07:meMA.Ode5C1T.mode	@ltx/gr_gr_cog/miscellanea:misc.Mode6
ltx/gr_gr_cog/me.m08.d07:meMA.Ode5C1T.ode	@ltx/gr_gr_cog/miscellanea:misc.Ode5
ltx/gr_gr_cog/me.m08.d07:meMA.Ode5C1T.text	Παρθένος ἔμεινας ἀσινής, καὶ τὰ τῶν μητέρων, ἐπιδεικνύεις πανάμωμε Δέσποινα· τῇ γὰρ παρθενίᾳ τόκον συνήρμοσας, καὶ φέρεις ἀμφοτέρων τὰ ἰδιώματα.
ltx/gr_gr_cog/me.m08.d07:meMA.Ode6C11.greekmelody	@ltx/gr_gr_cog/he.h.m6:heHE.TouViouTinThalassan.greekname
ltx/gr_gr_cog/me.m08.d07:meMA.Ode6C11.incipit	Ῥαγδαίως φερόμενον, τοῦ ἐχθροῦ καὶ…
ltx/gr_gr_cog/me.m08.d07:meMA.Ode6C11.melody	@ltx/gr_gr_cog/he.h.m6:heHE.TouViouTinThalassan.name
ltx/gr_gr_cog/me.m08.d07:meMA.Ode6C11.mode	@ltx/gr_gr_cog/miscellanea:misc.Mode6
ltx/gr_gr_cog/me.m08.d07:meMA.Ode6C11.ode	@ltx/gr_gr_cog/miscellanea:misc.Ode6
ltx/gr_gr_cog/me.m08.d07:meMA.Ode6C11.text	Ῥαγδαίως φερόμενον, τοῦ ἐχθροῦ καὶ δυσμενοῦς, τὸν πειρασμὸν ὑπέμεινας, καὶ ποικίλως Παμμάκαρ δοκιμασθείς, τῷ φθόνῳ μαχόμενος, νικητὴς ἀνεδείχθης ἀξιάγαστε.
ltx/gr_gr_cog/me.m08.d07:meMA.Ode6C12.incipit	Ὁ βίος σου ἔνθεος, ἡ…
ltx/gr_gr_cog/me.m08.d07:meMA.Ode6C12.melody	@ltx/gr_gr_cog/he.h.m6:heHE.TouViouTinThalassan.name
ltx/gr_gr_cog/me.m08.d07:meMA.Ode6C12.mode	@ltx/gr_gr_cog/miscellanea:misc.Mode6
ltx/gr_gr_cog/me.m08.d07:meMA.Ode6C12.ode	@ltx/gr_gr_cog/miscellanea:misc.Ode6
ltx/gr_gr_cog/me.m08.d07:meMA.Ode6C12.text	Ὁ βίος σου ἔνθεος, ἡ ζωὴ θεοειδής, καὶ φωτοφόρος γέγονε· τὰ τοῦ κόσμου τερπνὰ γὰρ καταλιπών, τὴν θείαν εὐπρέπειαν, ἐκαρπώσω θεόφρον καὶ τερπνότητα.
ltx/gr_gr_cog/me.m08.d07:meMA.Ode6C13.incipit	Σημεῖα καὶ τέρατα, ἠξιώθης ἐκτελεῖν…
ltx/gr_gr_cog/me.m08.d07:meMA.Ode6C13.melody	@ltx/gr_gr_cog/he.h.m6:heHE.TouViouTinThalassan.name
ltx/gr_gr_cog/me.m08.d07:meMA.Ode6C13.mode	@ltx/gr_gr_cog/miscellanea:misc.Mode6
ltx/gr_gr_cog/me.m08.d07:meMA.Ode6C13.ode	@ltx/gr_gr_cog/miscellanea:misc.Ode6
ltx/gr_gr_cog/me.m08.d07:meMA.Ode6C13.text	Σημεῖα καὶ τέρατα, ἠξιώθης ἐκτελεῖν, ὑπερφυῶς ἀοίδιμε, τῇ δυνάμει τῇ θείᾳ καθοπλισθείς, καὶ ἔχων τὴν ἄνωθεν, συνεργοῦσάν σοι χάριν ἀξιάγαστε.
ltx/gr_gr_cog/me.m08.d07:meMA.Ode6C1T.incipit	Φωτὸς οἰκητήριον, καὶ νυμφὼν θεοπρεπής…
ltx/gr_gr_cog/me.m08.d07:meMA.Ode6C1T.melody	@ltx/gr_gr_cog/he.h.m6:heHE.TouViouTinThalassan.name
ltx/gr_gr_cog/me.m08.d07:meMA.Ode6C1T.mode	@ltx/gr_gr_cog/miscellanea:misc.Mode6
ltx/gr_gr_cog/me.m08.d07:meMA.Ode6C1T.ode	@ltx/gr_gr_cog/miscellanea:misc.Ode6
ltx/gr_gr_cog/me.m08.d07:meMA.Ode6C1T.text	Φωτὸς οἰκητήριον, καὶ νυμφὼν θεοπρεπής, τῆς ὑπὲρ νοῦν σαρκώσεως, τοῦ τῶν ὅλων Παρθένε Δημιουργοῦ· σὺ γὰρ μόνη πέφυκας, ἀξιόθεον τούτου ἐνδιαίτημα.
ltx/gr_gr_cog/me.m08.d07:meMA.Ode6H.greekmelody	@ltx/gr_gr_cog/he.h.m6:heHE.TouViouTinThalassan.greekname
ltx/gr_gr_cog/me.m08.d07:meMA.Ode6H.incipit	@ltx/gr_gr_cog/he.h.m6:heHE.TouViouTinThalassan.incipit
ltx/gr_gr_cog/me.m08.d07:meMA.Ode6H.melody	@ltx/gr_gr_cog/he.h.m6:heHE.TouViouTinThalassan.melody
ltx/gr_gr_cog/me.m08.d07:meMA.Ode6H.mode	@ltx/gr_gr_cog/miscellanea:misc.Mode6
ltx/gr_gr_cog/me.m08.d07:meMA.Ode6H.ode	@ltx/gr_gr_cog/miscellanea:misc.Ode6
ltx/gr_gr_cog/me.m08.d07:meMA.Ode6H.text	@ltx/gr_gr_cog/he.h.m6:heHE.TouViouTinThalassan.text
ltx/gr_gr_cog/me.m08.d07:meMA.Ode7C11.greekmelody	@ltx/gr_gr_cog/he.h.m6:heHE.DrosovolonMenTinKaminon.greekname
ltx/gr_gr_cog/me.m08.d07:meMA.Ode7C11.incipit	Ἐπὶ σὲ Πάτερ ἡ παμφωτος…
ltx/gr_gr_cog/me.m08.d07:meMA.Ode7C11.melody	@ltx/gr_gr_cog/he.h.m6:heHE.DrosovolonMenTinKaminon.name
ltx/gr_gr_cog/me.m08.d07:meMA.Ode7C11.mode	@ltx/gr_gr_cog/miscellanea:misc.Mode6
ltx/gr_gr_cog/me.m08.d07:meMA.Ode7C11.ode	@ltx/gr_gr_cog/miscellanea:misc.Ode7
ltx/gr_gr_cog/me.m08.d07:meMA.Ode7C11.text	Ἐπὶ σὲ Πάτερ ἡ παμφωτος τοῦ Πνεύματος, χάρις ἐπανεπαύσατο, καὶ ἐνεργείας παραδόξους ἔδειξεν ἐν σοί, βοῶντι καὶ ψάλλοντι πιστῶς· Εὐλογητὸς εἶ ὁ Θεός, ὁ τῶν Πατέρων ἡμῶν.
ltx/gr_gr_cog/me.m08.d07:meMA.Ode7C12.incipit	Ῥωμαλέῳ τῷ φρονήματι διήνυσας, τὸν…
ltx/gr_gr_cog/me.m08.d07:meMA.Ode7C12.melody	@ltx/gr_gr_cog/he.h.m6:heHE.DrosovolonMenTinKaminon.name
ltx/gr_gr_cog/me.m08.d07:meMA.Ode7C12.mode	@ltx/gr_gr_cog/miscellanea:misc.Mode6
ltx/gr_gr_cog/me.m08.d07:meMA.Ode7C12.ode	@ltx/gr_gr_cog/miscellanea:misc.Ode7
ltx/gr_gr_cog/me.m08.d07:meMA.Ode7C12.text	Ῥωμαλέῳ τῷ φρονήματι διήνυσας, τὸν δρόμον τῆς ἀσκήσεως, καὶ ἐπὶ τέλει τῶν ἀγώνων, Μάρτυς ἀληθῶς, ἐγένου κραυγάζων τῷ Χριστῷ· Εὐλογητὸς εἶ ὁ Θεός, ὁ τῶν Πατέρων ἡμῶν.
ltx/gr_gr_cog/me.m08.d07:meMA.Ode7C13.incipit	Ὥσπερ παῖδές σοι οἱ μύσται…
ltx/gr_gr_cog/me.m08.d07:meMA.Ode7C13.melody	@ltx/gr_gr_cog/he.h.m6:heHE.DrosovolonMenTinKaminon.name
ltx/gr_gr_cog/me.m08.d07:meMA.Ode7C13.mode	@ltx/gr_gr_cog/miscellanea:misc.Mode6
ltx/gr_gr_cog/me.m08.d07:meMA.Ode7C13.ode	@ltx/gr_gr_cog/miscellanea:misc.Ode7
ltx/gr_gr_cog/me.m08.d07:meMA.Ode7C13.text	Ὥσπερ παῖδές σοι οἱ μύσται χρηματίσαντες, πατρὶ συνηγωνίζοντο, καὶ ἐν σπηλαίῳ καρτεροῦντες, ἤθλησαν σὺν σοί, συμφώνως κραυγάζοντες Χριστῷ· Εὐλογητὸς εἶ ὁ Θεός, ὁ τῶν Πατέρων ἡμῶν.
ltx/gr_gr_cog/me.m08.d07:meMA.Ode7C1T.incipit	Σωτηρίας ὡς λιμένα σε πλουτήσαντες…
ltx/gr_gr_cog/me.m08.d07:meMA.Ode7C1T.melody	@ltx/gr_gr_cog/he.h.m6:heHE.DrosovolonMenTinKaminon.name
ltx/gr_gr_cog/me.m08.d07:meMA.Ode7C1T.mode	@ltx/gr_gr_cog/miscellanea:misc.Mode6
ltx/gr_gr_cog/me.m08.d07:meMA.Ode7C1T.ode	@ltx/gr_gr_cog/miscellanea:misc.Ode7
ltx/gr_gr_cog/me.m08.d07:meMA.Ode7C1T.text	Σωτηρίας ὡς λιμένα σε πλουτήσαντες, ζάλης διασῳζόμεθα, καὶ τὴν ἐλπίδα τὴν εἰς σὲ ὡς ἄγκυραν ψυχῶν, κατέχοντες κράζομεν Χριστῷ· Εὐλογητὸς εἶ ὁ Θεός, ὁ τῶν Πατέρων ἡμῶν.
ltx/gr_gr_cog/me.m08.d07:meMA.Ode8C11.greekmelody	@ltx/gr_gr_cog/he.h.m6:heHE.EkFlogosToisOsiois.greekname
ltx/gr_gr_cog/me.m08.d07:meMA.Ode8C11.incipit	Τετρωμένος ἀγάπῃ Πάτερ τοῦ κτίσαντος…
ltx/gr_gr_cog/me.m08.d07:meMA.Ode8C11.melody	@ltx/gr_gr_cog/he.h.m6:heHE.EkFlogosToisOsiois.name
ltx/gr_gr_cog/me.m08.d07:meMA.Ode8C11.mode	@ltx/gr_gr_cog/miscellanea:misc.Mode6
ltx/gr_gr_cog/me.m08.d07:meMA.Ode8C11.ode	@ltx/gr_gr_cog/miscellanea:misc.Ode8
ltx/gr_gr_cog/me.m08.d07:meMA.Ode8C11.text	Τετρωμένος ἀγάπῃ Πάτερ τοῦ κτίσαντος, τῶν κτισμάτων ἀπώσω πᾶσαν προσπάθειαν, Πνεύματι Θεοῦ, σαφῶς κατευθυνόμενος, ὃν ὑπερυψοῦμεν εἰς πάντας τοὺς αἰῶνας.
ltx/gr_gr_cog/me.m08.d07:meMA.Ode8C12.incipit	Ἐπιγείους φροντίδας ἀποσεισάμενος, οὐρανίους ἐλπίδας…
ltx/gr_gr_cog/me.m08.d07:meMA.Ode8C12.melody	@ltx/gr_gr_cog/he.h.m6:heHE.EkFlogosToisOsiois.name
ltx/gr_gr_cog/me.m08.d07:meMA.Ode8C12.mode	@ltx/gr_gr_cog/miscellanea:misc.Mode6
ltx/gr_gr_cog/me.m08.d07:meMA.Ode8C12.ode	@ltx/gr_gr_cog/miscellanea:misc.Ode8
ltx/gr_gr_cog/me.m08.d07:meMA.Ode8C12.text	Ἐπιγείους φροντίδας ἀποσεισάμενος, οὐρανίους ἐλπίδας Πάτερ ἐπλούτησας, τὴν ἐν τῷ Χριστῷ, μακαριότητα Ὅσιε, ἧς νῦν ἀπολαύεις εἰς πάντας τοὺς αἰῶνας.
ltx/gr_gr_cog/me.m08.d07:meMA.Ode8C13.incipit	Φωτοβόλους ἀκτῖνας Πάτερ δεξάμενος, τοῦ…
ltx/gr_gr_cog/me.m08.d07:meMA.Ode8C13.melody	@ltx/gr_gr_cog/he.h.m6:heHE.EkFlogosToisOsiois.name
ltx/gr_gr_cog/me.m08.d07:meMA.Ode8C13.mode	@ltx/gr_gr_cog/miscellanea:misc.Mode6
ltx/gr_gr_cog/me.m08.d07:meMA.Ode8C13.ode	@ltx/gr_gr_cog/miscellanea:misc.Ode8
ltx/gr_gr_cog/me.m08.d07:meMA.Ode8C13.text	Φωτοβόλους ἀκτῖνας Πάτερ δεξάμενος, τοῦ Ἁγίου καὶ θείου πάνσοφε Πνεύματος, ὀφθαλμοφανῶς, τοῦτο Μάκαρ τεθέασαι, θείοις μυστηρίοις φρικτῶς ἐπιφοιτῆσαν.
ltx/gr_gr_cog/me.m08.d07:meMA.Ode8C1T.incipit	Ἡ θεόφθογγος λύρα τοῦ σοῦ…
ltx/gr_gr_cog/me.m08.d07:meMA.Ode8C1T.melody	@ltx/gr_gr_cog/he.h.m6:heHE.EkFlogosToisOsiois.name
ltx/gr_gr_cog/me.m08.d07:meMA.Ode8C1T.mode	@ltx/gr_gr_cog/miscellanea:misc.Mode6
ltx/gr_gr_cog/me.m08.d07:meMA.Ode8C1T.ode	@ltx/gr_gr_cog/miscellanea:misc.Ode8
ltx/gr_gr_cog/me.m08.d07:meMA.Ode8C1T.text	Ἡ θεόφθογγος λύρα τοῦ σοῦ Προπάτορος, κιβωτόν σε ἁγίαν προδιετύπωσε, φέρουσαν Θεόν, σάρκα Ἁγνὴ φορέσαντα, ὃν ὑπερυψοῦμεν εἰς πάντας τοὺς αἰῶνας.
ltx/gr_gr_cog/me.m08.d07:meMA.Ode8H.greekmelody	@ltx/gr_gr_cog/he.h.m6:heHE.EkFlogosToisOsiois.greekname
ltx/gr_gr_cog/me.m08.d07:meMA.Ode8H.incipit	@ltx/gr_gr_cog/he.h.m6:heHE.EkFlogosToisOsiois.incipit
ltx/gr_gr_cog/me.m08.d07:meMA.Ode8H.melody	@ltx/gr_gr_cog/he.h.m6:heHE.EkFlogosToisOsiois.melody
ltx/gr_gr_cog/me.m08.d07:meMA.Ode8H.mode	@ltx/gr_gr_cog/miscellanea:misc.Mode6
ltx/gr_gr_cog/me.m08.d07:meMA.Ode8H.ode	@ltx/gr_gr_cog/miscellanea:misc.Ode8
ltx/gr_gr_cog/me.m08.d07:meMA.Ode8H.text	@ltx/gr_gr_cog/he.h.m6:heHE.EkFlogosToisOsiois.text
ltx/gr_gr_cog/me.m08.d07:meMA.Ode9C11.greekmelody	@ltx/gr_gr_cog/he.h.m6:heHE.TheonAnthropois.greekname
ltx/gr_gr_cog/me.m08.d07:meMA.Ode9C11.incipit	Φωτὶ ἀϋλῳ καταυγαζόμενος, φωτοειδὴς ἀξίως…
ltx/gr_gr_cog/me.m08.d07:meMA.Ode9C11.melody	@ltx/gr_gr_cog/he.h.m6:heHE.TheonAnthropois.name
ltx/gr_gr_cog/me.m08.d07:meMA.Ode9C11.mode	@ltx/gr_gr_cog/miscellanea:misc.Mode6
ltx/gr_gr_cog/me.m08.d07:meMA.Ode9C11.ode	@ltx/gr_gr_cog/miscellanea:misc.Ode9
ltx/gr_gr_cog/me.m08.d07:meMA.Ode9C11.text	Φωτὶ ἀϋλῳ καταυγαζόμενος, φωτοειδὴς ἀξίως φωτοφόρε γεγένησαι, πολιτείαν ἄμεμπτον κτησάμενος, Πάτερ καὶ παναγίαν, νῦν δὲ παρίστασαι, πρέσβυς τῷ Δεσπότῃ, καὶ Θεῷ ὑπὲρ τῆς ποίμνης σου.
ltx/gr_gr_cog/me.m08.d07:meMA.Ode9C12.incipit	Οἱ σοὶ ἀγῶνες οἱ τῆς…
ltx/gr_gr_cog/me.m08.d07:meMA.Ode9C12.melody	@ltx/gr_gr_cog/he.h.m6:heHE.TheonAnthropois.name
ltx/gr_gr_cog/me.m08.d07:meMA.Ode9C12.mode	@ltx/gr_gr_cog/miscellanea:misc.Mode6
ltx/gr_gr_cog/me.m08.d07:meMA.Ode9C12.ode	@ltx/gr_gr_cog/miscellanea:misc.Ode9
ltx/gr_gr_cog/me.m08.d07:meMA.Ode9C12.text	Οἱ σοὶ ἀγῶνες οἱ τῆς ἀσκήσεως, μαρτυρικοῖς ἀγῶσιν ἐπαξίως ἐστέφθησαν, καὶ διπλοῦν τὸ ἔπαθλον ἀπείληφας, τῶν ἀνδραγαθημάτων, ὧν ἐπιδέδειξαι, καὶ τῶν αἰωνίων, ἀγαθῶν εὗρες ἀπόλαυσιν.
ltx/gr_gr_cog/me.m08.d07:meMA.Ode9C13.incipit	Ῥωσθεὶς δυνάμει θείᾳ καὶ χάριτι…
ltx/gr_gr_cog/me.m08.d07:meMA.Ode9C13.melody	@ltx/gr_gr_cog/he.h.m6:heHE.TheonAnthropois.name
ltx/gr_gr_cog/me.m08.d07:meMA.Ode9C13.mode	@ltx/gr_gr_cog/miscellanea:misc.Mode6
ltx/gr_gr_cog/me.m08.d07:meMA.Ode9C13.ode	@ltx/gr_gr_cog/miscellanea:misc.Ode9
ltx/gr_gr_cog/me.m08.d07:meMA.Ode9C13.text	Ῥωσθεὶς δυνάμει θείᾳ καὶ χάριτι, διαφανὴς τοῖς πάσιν ἀνεδείχθης διδάσκαλος, εὐσεβείας θαύμασι κοσμούμενος, πάντας ὑποστηρίζων, πάντας ἰώμενος, τοὺς προσερχομένους, σοὶ πιστῶς θεομακάριστε.
ltx/gr_gr_cog/me.m08.d07:meMA.Ode9C1T.incipit	Ἐν σοὶ ἐπράχθη τὰ ὑπὲρ…
ltx/gr_gr_cog/me.m08.d07:meMA.Ode9C1T.melody	@ltx/gr_gr_cog/he.h.m6:heHE.TheonAnthropois.name
ltx/gr_gr_cog/me.m08.d07:meMA.Ode9C1T.mode	@ltx/gr_gr_cog/miscellanea:misc.Mode6
ltx/gr_gr_cog/me.m08.d07:meMA.Ode9C1T.ode	@ltx/gr_gr_cog/miscellanea:misc.Ode9
ltx/gr_gr_cog/me.m08.d07:meMA.Ode9C1T.text	Ἐν σοὶ ἐπράχθη τὰ ὑπὲρ ἄνθρωπον, ὑπερφυῆ Παρθένε Θεότοκε μυστήρια· τοῦ Θεοῦ γὰρ γέγονας λοχεύτρια, φέρουσα ἐν ἀγκάλαις, καὶ διατρέφουσα, τὸν ταῖς οὐρανίαις, στρατιαῖς ὑμνολογούμενον.
ltx/gr_gr_cog/me.m08.d07:meMA.Ode9H.greekmelody	@ltx/gr_gr_cog/he.h.m6:heHE.TheonAnthropois.greekname
ltx/gr_gr_cog/me.m08.d07:meMA.Ode9H.incipit	@ltx/gr_gr_cog/he.h.m6:heHE.TheonAnthropois.incipit
ltx/gr_gr_cog/me.m08.d07:meMA.Ode9H.melody	@ltx/gr_gr_cog/he.h.m6:heHE.TheonAnthropois.melody
ltx/gr_gr_cog/me.m08.d07:meMA.Ode9H.mode	@ltx/gr_gr_cog/miscellanea:misc.Mode6
ltx/gr_gr_cog/me.m08.d07:meMA.Ode9H.ode	@ltx/gr_gr_cog/miscellanea:misc.Ode9
ltx/gr_gr_cog/me.m08.d07:meMA.Ode9H.text	@ltx/gr_gr_cog/he.h.m6:heHE.TheonAnthropois.text
ltx/gr_gr_cog/me.m08.d07:meVE.Apolytikion1.incipit	@ltx/gr_gr_cog/me.m08.d06:meVE.Apolytikion1.incipit
ltx/gr_gr_cog/me.m08.d07:meVE.Apolytikion1.melody	
ltx/gr_gr_cog/me.m08.d07:meVE.Apolytikion1.mode	@ltx/gr_gr_cog/miscellanea:misc.Mode7
ltx/gr_gr_cog/me.m08.d07:meVE.Apolytikion1.text	@ltx/gr_gr_cog/me.m08.d06:meVE.Apolytikion1.text
ltx/gr_gr_cog/me.m08.d07:meVE.AposGlory.incipit	Τῆς θεότητός σου Χριστέ, ἀμυδρὰν…
ltx/gr_gr_cog/me.m08.d07:meVE.AposGlory.melody	
ltx/gr_gr_cog/me.m08.d07:meVE.AposGlory.mode	@ltx/gr_gr_cog/miscellanea:misc.Mode8
ltx/gr_gr_cog/me.m08.d07:meVE.AposGlory.text	Τῆς θεότητός σου Χριστέ, ἀμυδρὰν αὐγὴν παραγυμνώσας, τοῖς συναναβᾶσί σοι ἐπὶ τοῦ ὄρους, τῆς ὑπερκοσμίου σου δόξης, ἐποίησας κοινωνούς· ὅθεν θεαστικῶς ἐκραύγαζον· Καλόν ἐστιν ἡμᾶς ὧδε εἶναι. Μεθʼ ὧν καὶ ἡμεῖς, σὲ τὸν μεταμορφωθέντα Σωτῆρα Χριστόν, ἀνυμνοῦμεν εἰς τοὺς αἰῶνας.
ltx/gr_gr_cog/me.m08.d07:meVE.Aposticha1.greekmelody	@ltx/gr_gr_cog/he.a.m2:heAU.OikosTouEfratha.greekname
ltx/gr_gr_cog/me.m08.d07:meVE.Aposticha1.incipit	@ltx/gr_gr_cog/me.m08.d06:meSV.Aposticha1.incipit
ltx/gr_gr_cog/me.m08.d07:meVE.Aposticha1.melody	@ltx/gr_gr_cog/he.a.m2:heAU.OikosTouEfratha.name
ltx/gr_gr_cog/me.m08.d07:meVE.Aposticha1.mode	@ltx/gr_gr_cog/miscellanea:misc.Mode2
ltx/gr_gr_cog/me.m08.d07:meVE.Aposticha1.text	@ltx/gr_gr_cog/me.m08.d06:meSV.Aposticha1.text
ltx/gr_gr_cog/me.m08.d07:meVE.Aposticha2.incipit	@ltx/gr_gr_cog/me.m08.d06:meSV.AposGlory.incipit
ltx/gr_gr_cog/me.m08.d07:meVE.Aposticha2.melody	@ltx/gr_gr_cog/he.a.m2:heAU.OikosTouEfratha.name
ltx/gr_gr_cog/me.m08.d07:meVE.Aposticha2.mode	@ltx/gr_gr_cog/miscellanea:misc.Mode2
ltx/gr_gr_cog/me.m08.d07:meVE.Aposticha2.text	@ltx/gr_gr_cog/me.m08.d06:meSV.AposGlory.text
ltx/gr_gr_cog/me.m08.d07:meVE.Aposticha3.incipit	@ltx/gr_gr_cog/me.m08.d05:meVE.Aposticha2.incipit
ltx/gr_gr_cog/me.m08.d07:meVE.Aposticha3.melody	@ltx/gr_gr_cog/he.a.m2:heAU.OikosTouEfratha.name
ltx/gr_gr_cog/me.m08.d07:meVE.Aposticha3.mode	@ltx/gr_gr_cog/miscellanea:misc.Mode2
ltx/gr_gr_cog/me.m08.d07:meVE.Aposticha3.text	@ltx/gr_gr_cog/me.m08.d05:meVE.Aposticha2.text
ltx/gr_gr_cog/me.m08.d07:meVE.SticGlory.incipit	@ltx/gr_gr_cog/me.m08.d06:meVE.SticGlory.incipit
ltx/gr_gr_cog/me.m08.d07:meVE.SticGlory.melody	
ltx/gr_gr_cog/me.m08.d07:meVE.SticGlory.mode	@ltx/gr_gr_cog/miscellanea:misc.Mode6
ltx/gr_gr_cog/me.m08.d07:meVE.SticGlory.text	@ltx/gr_gr_cog/me.m08.d06:meVE.SticGlory.text
ltx/gr_gr_cog/me.m08.d07:meVE.Stichera01.greekmelody	@ltx/gr_gr_cog/he.a.m4:heAU.OExYpsistouKlitheis.greekname
ltx/gr_gr_cog/me.m08.d07:meVE.Stichera01.incipit	@ltx/gr_gr_cog/me.m08.d06:meMA.Lauds1.incipit
ltx/gr_gr_cog/me.m08.d07:meVE.Stichera01.melody	@ltx/gr_gr_cog/he.a.m4:heAU.OExYpsistouKlitheis.name
ltx/gr_gr_cog/me.m08.d07:meVE.Stichera01.mode	@ltx/gr_gr_cog/miscellanea:misc.Mode4
ltx/gr_gr_cog/me.m08.d07:meVE.Stichera01.text	@ltx/gr_gr_cog/me.m08.d06:meMA.Lauds1.text
ltx/gr_gr_cog/me.m08.d07:meVE.Stichera02.incipit	@ltx/gr_gr_cog/me.m08.d06:meMA.Lauds2.incipit
ltx/gr_gr_cog/me.m08.d07:meVE.Stichera02.melody	@ltx/gr_gr_cog/he.a.m4:heAU.OExYpsistouKlitheis.name
ltx/gr_gr_cog/me.m08.d07:meVE.Stichera02.mode	@ltx/gr_gr_cog/miscellanea:misc.Mode4
ltx/gr_gr_cog/me.m08.d07:meVE.Stichera02.text	@ltx/gr_gr_cog/me.m08.d06:meMA.Lauds2.text
ltx/gr_gr_cog/me.m08.d07:meVE.Stichera03.incipit	@ltx/gr_gr_cog/me.m08.d06:meMA.Lauds3.incipit
ltx/gr_gr_cog/me.m08.d07:meVE.Stichera03.melody	@ltx/gr_gr_cog/he.a.m4:heAU.OExYpsistouKlitheis.name
ltx/gr_gr_cog/me.m08.d07:meVE.Stichera03.mode	@ltx/gr_gr_cog/miscellanea:misc.Mode4
ltx/gr_gr_cog/me.m08.d07:meVE.Stichera03.text	@ltx/gr_gr_cog/me.m08.d06:meMA.Lauds3.text
ltx/gr_gr_cog/me.m08.d07:meVE.Stichera04.greekmelody	@ltx/gr_gr_cog/he.a.m6:heAU.OlinApothemenoi.greekname
ltx/gr_gr_cog/me.m08.d07:meVE.Stichera04.incipit	Ὅλην ἀποθέμενος, τὴν μαγικὴν γοητείαν…
ltx/gr_gr_cog/me.m08.d07:meVE.Stichera04.melody	@ltx/gr_gr_cog/he.a.m6:heAU.OlinApothemenoi.name
ltx/gr_gr_cog/me.m08.d07:meVE.Stichera04.mode	@ltx/gr_gr_cog/miscellanea:misc.Mode6
ltx/gr_gr_cog/me.m08.d07:meVE.Stichera04.text	Ὅλην ἀποθέμενος, τὴν μαγικὴν γοητείαν, καὶ Περσῶν μιάσματα, καὶ τὰ μυσαρώτατα τερατεύματα, τῷ Θεῷ προσέδραμες, τῇ σοφῇ προνοίᾳ, κυβερνῶντι τὰ οὐράνια· οὗ τῷ ὀνόματι, ἀποστολικῶς ἐθεράπευσας, ἀλόγων ἀῤῥωστήματα, καὶ τὰ τῶν ἀνθρώπων νοσήματα, τῶν προσερχομένων, προθύμως σοι θεράπον τοῦ Χριστοῦ· ὃν παῤῥησίᾳ δυσώπησον, ὑπὲρ τῶν ψυχῶν ἡμῶν.
ltx/gr_gr_cog/me.m08.d07:meVE.Stichera05.incipit	Ὅλην ἀνατέθεικας, τὴν σὴν ζωὴν…
ltx/gr_gr_cog/me.m08.d07:meVE.Stichera05.melody	@ltx/gr_gr_cog/he.a.m6:heAU.OlinApothemenoi.name
ltx/gr_gr_cog/me.m08.d07:meVE.Stichera05.mode	@ltx/gr_gr_cog/miscellanea:misc.Mode6
ltx/gr_gr_cog/me.m08.d07:meVE.Stichera05.text	Ὅλην ἀνατέθεικας, τὴν σὴν ζωὴν τῷ Κυρίῳ, καὶ θερμῶς ἐχώρησας, πρὸς τὸν τῆς ἀσκήσεως δρόμον Ὅσιε· προσευχὴν ἀθόλωτον, ἀγρυπνίαν πάννυχον, ὑμνῳδίαν ἀκατάπαυστον, καὶ βίον ἄμεμπτον, καὶ ἀγγελικὸν ἐνδεικνύμενος· ἐντεῦθεν τὴν ἐνέργειαν, τὴν τῶν θαυμασίων ἐπλούτησας· οἶδε γὰρ δοξάζειν, ὁ Κύριος τοὺς δούλους ἑαυτοῦ· ὃν παῤῥησίᾳ δυσώπησον, ὑπὲρ τῶν ψυχῶν ἡμῶν.
ltx/gr_gr_cog/me.m08.d07:meVE.Stichera06.incipit	Ὅλην ἐνδυσάμενος, τὴν τοῦ Σταυροῦ…
ltx/gr_gr_cog/me.m08.d07:meVE.Stichera06.melody	@ltx/gr_gr_cog/he.a.m6:heAU.OlinApothemenoi.name
ltx/gr_gr_cog/me.m08.d07:meVE.Stichera06.mode	@ltx/gr_gr_cog/miscellanea:misc.Mode6
ltx/gr_gr_cog/me.m08.d07:meVE.Stichera06.text	Ὅλην ἐνδυσάμενος, τὴν τοῦ Σταυροῦ πανοπλίαν, καὶ τὸν ἀδιάῤῥηκτον, θυρεὸν τῆς πίστεως περιθέμενος, φοβερὸς γέγονας, ταῖς ἀντικειμέναις, τῶν Δαιμόνων παρατάξεσιν, οὓς καὶ ἐδίωξας, μάστιγι τῇ πίστει χρησάμενος, καὶ θείαις ἐπικλήσεσι· καὶ τοὺς ὁδοιπόρους διέσωσας, βλάβης τῆς ἐκείνων, Δομέτιε θεράπον τοῦ Χριστοῦ· ὃν παῤῥησίᾳ δυσώπησον, ὑπὲρ τῶν ψυχῶν ἡμῶν.
