ltx/gr_gr_cog/le.go.ge.hierarch:legeLI.Gospel.book_abbr	@ltx/gr_gr_cog/bible:John.abbr
ltx/gr_gr_cog/le.go.ge.hierarch:legeLI.Gospel.book_string	@ltx/gr_gr_cog/bible:John.text
ltx/gr_gr_cog/le.go.ge.hierarch:legeLI.Gospel.chapverse	10:9 – 16
ltx/gr_gr_cog/le.go.ge.hierarch:legeLI.Gospel.incipit	Ἐγώ εἰμι ἡ θύρα…
ltx/gr_gr_cog/le.go.ge.hierarch:legeLI.Gospel.text	Εἶπεν ὁ Κύριος· ἐγώ εἰμι ἡ θύρα· δι᾽ ἐμοῦ ἐάν τις εἰσέλθῃ, σωθήσεται, καὶ εἰσελεύσεται καὶ ἐξελεύσεται, καὶ νομὴν εὑρήσει. ὁ κλέπτης οὐκ ἔρχεται εἰ μὴ ἵνα κλέψῃ καὶ θύσῃ καὶ ἀπολέσῃ· ἐγὼ ἦλθον ἵνα ζωὴν ἔχωσι καὶ περισσὸν ἔχωσιν. ἐγώ εἰμι ὁ ποιμὴν ὁ καλός. ὁ ποιμὴν ὁ καλὸς τὴν ψυχὴν αὐτοῦ τίθησιν ὑπὲρ τῶν προβάτων· ὁ μισθωτὸς δὲ καὶ οὐκ ὢν ποιμήν, οὗ οὐκ εἰσὶ τὰ πρόβατα ἴδια, θεωρεῖ τὸν λύκον ἐρχόμενον καὶ ἀφίησι τὰ πρόβατα καὶ φεύγει· καὶ ὁ λύκος ἁρπάζει αὐτὰ καὶ σκορπίζει τὰ πρόβατα. ὁ δὲ μισθωτὸς φεύγει, ὅτι μισθωτός ἐστι καὶ οὐ μέλει αὐτῷ περὶ τῶν προβάτων. ἐγώ εἰμι ὁ ποιμὴν ὁ καλός, καὶ γινώσκω τὰ ἐμὰ καὶ γινώσκομαι ὑπὸ τῶν ἐμῶν, καθὼς γινώσκει με ὁ πατὴρ κἀγὼ γινώσκω τὸν πατέρα, καὶ τὴν ψυχήν μου τίθημι ὑπὲρ τῶν προβάτων. καὶ ἄλλα πρόβατα ἔχω, ἃ οὐκ ἔστιν ἐκ τῆς αὐλῆς ταύτης· κἀκεῖνά με δεῖ ἀγαγεῖν, καὶ τῆς φωνῆς μου ἀκούσουσι, καὶ γενήσεται μία ποίμνη, εἷς ποιμήν.
ltx/gr_gr_cog/le.go.ge.hierarch:legeLI.Gospel.title	Εἰς Ἱεράρχην
ltx/gr_gr_cog/le.go.ge.hierarch:legeLI.Gospel.title_abbr	Εἰς Ἱεράρχην
ltx/gr_gr_cog/le.go.ge.hierarch:legeLI.Gospel.version	@ltx/gr_gr_cog/properties:version.designation
ltx/gr_gr_cog/le.go.ge.hierarch:legeLI.Gospel2.book_abbr	@ltx/gr_gr_cog/bible:Matthew.abbr
ltx/gr_gr_cog/le.go.ge.hierarch:legeLI.Gospel2.book_string	@ltx/gr_gr_cog/bible:Matthew.text
ltx/gr_gr_cog/le.go.ge.hierarch:legeLI.Gospel2.chapverse	5:14 – 19
ltx/gr_gr_cog/le.go.ge.hierarch:legeLI.Gospel2.incipit	 Ὑμεῖς ἐστε τὸ φῶς τοῦ κόσμου…
ltx/gr_gr_cog/le.go.ge.hierarch:legeLI.Gospel2.text	Εἶπεν ὁ Κύριος τοῖς ἑαυτοῦ μαθηταῖς· Ὑμεῖς ἐστε τὸ φῶς τοῦ κόσμου. οὐ δύναται πόλις κρυβῆναι ἐπάνω ὄρους κειμένη· οὐδὲ καίουσι λύχνον καὶ τιθέασι αὐτὸν ὑπὸ τὸν μόδιον, ἀλλ᾿ ἐπὶ τὴν λυχνίαν, καὶ λάμπει πᾶσι τοῖς ἐν τῇ οἰκίᾳ. οὕτω λαμψάτω τὸ φῶς ὑμῶν ἔμπροσθεν τῶν ἀνθρώπων, ὅπως ἴδωσιν ὑμῶν τὰ καλὰ ἔργα καὶ δοξάσωσι τὸν πατέρα ὑμῶν τὸν ἐν τοῖς οὐρανοῖς. Μὴ νομίσητε ὅτι ἦλθον καταλῦσαι τὸν νόμον ἢ τοὺς προφήτας· οὐκ ἦλθον καταλῦσαι, ἀλλὰ πληρῶσαι. ἀμὴν γὰρ λέγω ὑμῖν, ἕως ἂν παρέλθῃ ὁ οὐρανὸς καὶ ἡ γῆ, ἰῶτα ἓν ἢ μία κεραία οὐ μὴ παρέλθῃ ἀπὸ τοῦ νόμου ἕως ἂν πάντα γένηται. ὃς ἐὰν οὖν λύσῃ μίαν τῶν ἐντολῶν τούτων τῶν ἐλαχίστων καὶ διδάξῃ οὕτω τοὺς ἀνθρώπους, ἐλάχιστος κληθήσεται ἐν τῇ βασιλείᾳ τῶν οὐρανῶν· ὃς δ᾿ ἂν ποιήσῃ καὶ διδάξῃ, οὗτος μέγας κληθήσεται ἐν τῇ βασιλείᾳ τῶν οὐρανῶν.
ltx/gr_gr_cog/le.go.ge.hierarch:legeLI.Gospel2.title	Εἰς Ἱεράρχας
ltx/gr_gr_cog/le.go.ge.hierarch:legeLI.Gospel2.title_abbr	Εἰς Ἱεράρχας
ltx/gr_gr_cog/le.go.ge.hierarch:legeLI.Gospel2.version	@ltx/gr_gr_cog/properties:version.designation
ltx/gr_gr_cog/le.go.ge.hierarch:legeMA.Gospel.book_abbr	@ltx/gr_gr_cog/bible:John.abbr
ltx/gr_gr_cog/le.go.ge.hierarch:legeMA.Gospel.book_string	@ltx/gr_gr_cog/bible:John.text
ltx/gr_gr_cog/le.go.ge.hierarch:legeMA.Gospel.chapverse	10:1 – 9
ltx/gr_gr_cog/le.go.ge.hierarch:legeMA.Gospel.incipit	Ἀμὴν ἀμὴν λέγω ὑμῖν, ὁ μὴ εἰσερχόμενος…
ltx/gr_gr_cog/le.go.ge.hierarch:legeMA.Gospel.text	Εἶπεν ὁ Κύριος πρὸς τοὺς ἐληλυθότας πρὸς αὐτὸν Ἰουδαίους· Ἀμὴν ἀμὴν λέγω ὑμῖν, ὁ μὴ εἰσερχόμενος διὰ τῆς θύρας εἰς τὴν αὐλὴν τῶν προβάτων, ἀλλὰ ἀναβαίνων ἀλλαχόθεν, ἐκεῖνος κλέπτης ἐστὶ καὶ λῃστής· ὁ δὲ εἰσερχόμενος διὰ τῆς θύρας ποιμήν ἐστι τῶν προβάτων. τούτῳ ὁ θυρωρὸς ἀνοίγει, καὶ τὰ πρόβατα τῆς φωνῆς αὐτοῦ ἀκούει, καὶ τὰ ἴδια πρόβατα καλεῖ κατ᾽ ὄνομα καὶ ἐξάγει αὐτά. καὶ ὅταν τὰ ἴδια πρόβατα ἐκβάλῃ, ἔμπροσθεν αὐτῶν πορεύεται, καὶ τὰ πρόβατα αὐτῷ ἀκολουθεῖ, ὅτι οἴδασι τὴν φωνὴν αὐτοῦ· ἀλλοτρίῳ δὲ οὐ μὴ ἀκολουθήσωσιν, ἀλλὰ φεύξονται ἀπ᾽ αὐτοῦ, ὅτι οὐκ οἴδασι τῶν ἀλλοτρίων τὴν φωνήν. Ταύτην τὴν παροιμίαν εἶπεν αὐτοῖς ὁ Ἰησοῦς· ἐκεῖνοι δὲ οὐκ ἔγνωσαν τίνα ἦν ἃ ἐλάλει αὐτοῖς. Εἶπεν οὖν πάλιν αὐτοῖς ὁ Ἰησοῦς· ἀμὴν ἀμὴν λέγω ὑμῖν ὅτι ἐγώ εἰμι ἡ θύρα τῶν προβάτων. πάντες ὅσοι ἦλθον πρὸ ἐμοῦ, κλέπται εἰσὶ καὶ λῃσταί· ἀλλ᾽ οὐκ ἤκουσαν αὐτῶν τὰ πρόβατα. ἐγώ εἰμι ἡ θύρα· δι᾽ ἐμοῦ ἐάν τις εἰσέλθῃ, σωθήσεται, καὶ εἰσελεύσεται καὶ ἐξελεύσεται, καὶ νομὴν εὑρήσει.
ltx/gr_gr_cog/le.go.ge.hierarch:legeMA.Gospel.title	Εἰς Ἱεράρχην
ltx/gr_gr_cog/le.go.ge.hierarch:legeMA.Gospel.title_abbr	Εἰς Ἱεράρχην
ltx/gr_gr_cog/le.go.ge.hierarch:legeMA.Gospel.version	@ltx/gr_gr_cog/properties:version.designation
