ltx/gr_gr_cog/le.ep.mc.d207:lemcLI.Epistle.book_abbr	@ltx/gr_gr_cog/bible:Corinthians2.abbr
ltx/gr_gr_cog/le.ep.mc.d207:lemcLI.Epistle.book_string	@ltx/gr_gr_cog/bible:Corinthians2.text
ltx/gr_gr_cog/le.ep.mc.d207:lemcLI.Epistle.chapverse	9:12 – 15; 10:1 – 7
ltx/gr_gr_cog/le.ep.mc.d207:lemcLI.Epistle.incipit	Ἡ διακονία τῆς λειτουργίας ταύτης…
ltx/gr_gr_cog/le.ep.mc.d207:lemcLI.Epistle.text	Ἀδελφοί, ἡ διακονία τῆς λειτουργίας ταύτης οὐ μόνον ἐστὶ προσαναπληροῦσα τὰ ὑστερήματα τῶν ἁγίων, ἀλλὰ καὶ περισσεύουσα διὰ πολλῶν εὐχαριστιῶν τῷ Θεῷ· — διὰ τῆς δοκιμῆς τῆς διακονίας ταύτης δοξάζοντες τὸν Θεὸν ἐπὶ τῇ ὑποταγῇ τῆς ὁμολογίας ὑμῶν εἰς τὸ εὐαγγέλιον τοῦ Χριστοῦ καὶ ἁπλότητι τῆς κοινωνίας εἰς αὐτοὺς καὶ εἰς πάντας, καὶ αὐτῶν δεήσει ὑπὲρ ὑμῶν, ἐπιποθούντων ὑμᾶς διὰ τὴν ὑπερβάλλουσαν χάριν τοῦ Θεοῦ ἐφ᾿ ὑμῖν. χάρις δὲ τῷ Θεῷ ἐπὶ τῇ ἀνεκδιηγήτῳ αὐτοῦ δωρεᾷ. Αὐτὸς δὲ ἐγὼ Παῦλος παρακαλῶ ὑμᾶς διὰ τῆς πρᾳότητος καὶ ἐπιεικείας τοῦ Χριστοῦ, ὃς κατὰ πρόσωπον μὲν ταπεινὸς ἐν ὑμῖν, ἀπὼν δὲ θαρρῶ εἰς ὑμᾶς· δέομαι δὲ τὸ μὴ παρὼν θαρρῆσαι τῇ πεποιθήσει ᾗ λογίζομαι τολμῆσαι ἐπί τινας τοὺς λογιζομένους ἡμᾶς ὡς κατὰ σάρκα περιπατοῦντας. Ἐν σαρκὶ γὰρ περιπατοῦντες οὐ κατὰ σάρκα στρατευόμεθα· τὰ γὰρ ὅπλα τῆς στρατείας ἡμῶν οὐ σαρκικά, ἀλλὰ δυνατὰ τῷ Θεῷ πρὸς καθαίρεσιν ὀχυρωμάτων· — λογισμοὺς καθαιροῦντες καὶ πᾶν ὕψωμα ἐπαιρόμενον κατὰ τῆς γνώσεως τοῦ Θεοῦ, καὶ αἰχμαλωτίζοντες πᾶν νόημα εἰς τὴν ὑπακοὴν τοῦ Χριστοῦ, καὶ ἐν ἑτοίμῳ ἔχοντες ἐκδικῆσαι πᾶσαν παρακοήν, ὅταν πληρωθῇ ὑμῶν ἡ ὑπακοή. Τὰ κατὰ πρόσωπον βλέπετε! εἴ τις πέποιθεν ἑαυτῷ Χριστοῦ εἶναι, τοῦτο λογιζέσθω πάλιν ἀφ᾿ ἑαυτοῦ, ὅτι καθὼς αὐτὸς Χριστοῦ, οὕτω καὶ ἡμεῖς Χριστοῦ.
ltx/gr_gr_cog/le.ep.mc.d207:lemcLI.Epistle.title	Τῇ Τετάρτῃ τῆς ΙΓʹ Ἑβδομάδος
ltx/gr_gr_cog/le.ep.mc.d207:lemcLI.Epistle.title_abbr	Τετάρτῃ τῆς ΙΓʹ Ἑβδομάδος
ltx/gr_gr_cog/le.ep.mc.d207:lemcLI.Epistle.version	@ltx/gr_gr_cog/properties:version.designation
