ltx/gr_gr_cog/le.go.lu.d053:leluLI.Gospel.book_abbr	@ltx/gr_gr_cog/bible:Luke.abbr
ltx/gr_gr_cog/le.go.lu.d053:leluLI.Gospel.book_string	@ltx/gr_gr_cog/bible:Luke.text
ltx/gr_gr_cog/le.go.lu.d053:leluLI.Gospel.chapverse	13:1 – 9
ltx/gr_gr_cog/le.go.lu.d053:leluLI.Gospel.incipit	Παρῆσάν τινες ἀπαγγέλλοντες τῷ Ἰησοῦ…
ltx/gr_gr_cog/le.go.lu.d053:leluLI.Gospel.text	Τῷ καιρῷ ἐκείνῳ, παρῆσάν τινες ἀπαγγέλλοντες τῷ Ἰησοῦ περὶ τῶν Γαλιλαίων, ὧν τὸ αἷμα Πιλᾶτος ἔμιξε μετὰ τῶν θυσιῶν αὐτῶν. καὶ ἀποκριθεὶς ὁ Ἰησοῦς εἶπεν αὐτοῖς· δοκεῖτε ὅτι οἱ Γαλιλαῖοι οὗτοι ἁμαρτωλοὶ παρὰ πάντας τοὺς Γαλιλαίους ἐγένοντο, ὅτι τοιαῦτα πεπόνθασιν; οὐχί, λέγω ὑμῖν, ἀλλ᾿ ἐὰν μὴ μετανοῆτε, πάντες ὡσαύτως ἀπολεῖσθε. ἢ ἐκεῖνοι οἱ δέκα καὶ ὀκτώ, ἐφ᾿ οὓς ἔπεσεν ὁ πύργος ἐν τῷ Σιλωὰμ καὶ ἀπέκτεινεν αὐτούς, δοκεῖτε ὅτι οὗτοι ὀφειλέται ἐγένοντο παρὰ πάντας τοὺς ἀνθρώπους τοὺς κατοικοῦντας ἐν Ἱερουσαλήμ; οὐχί, λέγω ὑμῖν, ἀλλ᾿ ἐὰν μὴ μετανοήσητε, πάντες ὁμοίως ἀπολεῖσθε. Ἔλεγε δὲ ταύτην τὴν παραβολήν· συκῆν εἶχέ τις ἐν τῷ ἀμπελῶνι αὐτοῦ πεφυτευμένην, καὶ ἦλθε ζητῶν καρπὸν ἐν αὐτῇ, καὶ οὐχ εὗρεν. εἶπε δὲ πρὸς τὸν ἀμπελουργόν· ἰδοὺ τρία ἔτη ἔρχομαι ζητῶν καρπὸν ἐν τῇ συκῇ ταύτῃ, καὶ οὐχ εὑρίσκω· ἔκκοψον αὐτήν· ἱνατί καὶ τὴν γῆν καταργεῖ; ὁ δὲ ἀποκριθεὶς εἶπεν αὐτῷ· κύριε, ἄφες αὐτὴν καὶ τοῦτο τὸ ἔτος, ἕως ὅτου σκάψω περὶ αὐτὴν καὶ βάλω κόπρια. κἂν μὲν ποιήσῃ καρπόν· εἰ δὲ μήγε, εἰς τὸ μέλλον ἐκκόψεις αὐτήν.
ltx/gr_gr_cog/le.go.lu.d053:leluLI.Gospel.title	Τῇ Πέμπτῃ τῆς Ηʹ Ἑβδομάδος τοῦ Λουκᾶ
ltx/gr_gr_cog/le.go.lu.d053:leluLI.Gospel.title_abbr	Τῇ Πέμπτῃ τῆς Ηʹ Ἑβδομάδος τοῦ Λουκᾶ
ltx/gr_gr_cog/le.go.lu.d053:leluLI.Gospel.version	@ltx/gr_gr_cog/properties:version.designation
