ltx/gr_gr_cog/tr.d062:trCO.header	(Μέγα)
ltx/gr_gr_cog/tr.d062:trDA.commemoration.full	
ltx/gr_gr_cog/tr.d062:trDA.commemoration.short	Παρασκευὴ πρὸ τῶν Βαΐων
ltx/gr_gr_cog/tr.d062:trDA.insert1	
ltx/gr_gr_cog/tr.d062:trDA.insert2	
ltx/gr_gr_cog/tr.d062:trDA.note	
ltx/gr_gr_cog/tr.d062:trDA.title	
ltx/gr_gr_cog/tr.d062:trHO.commemorations	
ltx/gr_gr_cog/tr.d062:trHO.daytitle	
ltx/gr_gr_cog/tr.d062:trHO.description1	
ltx/gr_gr_cog/tr.d062:trHO.description2	
ltx/gr_gr_cog/tr.d062:trHO.note1	
ltx/gr_gr_cog/tr.d062:trHO.note2	
ltx/gr_gr_cog/tr.d062:trMA.AposGlory.incipit	Τὴν ψυχωφελῆ, πληρώσαντες Τεσσαρακοστήν, καὶ…
ltx/gr_gr_cog/tr.d062:trMA.AposGlory.melody	@ltx/gr_gr_cog/miscellanea:misc.Idiomelon
ltx/gr_gr_cog/tr.d062:trMA.AposGlory.mode	@ltx/gr_gr_cog/miscellanea:misc.Mode8
ltx/gr_gr_cog/tr.d062:trMA.AposGlory.text	Τὴν ψυχωφελῆ, πληρώσαντες Τεσσαρακοστήν, καὶ τὴν ἁγίαν Ἑβδομάδα τοῦ Πάθους σου, αἰτοῦμεν κατιδεῖν Φιλάνθρωπε, τοῦ δοξάσαι ἐν αὐτῇ τὰ μεγαλεῖά σου, καὶ τὴν ἄφατον διʹ ἡμᾶς οἰκονομίαν σου, ὁμοφρόνως μελῳδοῦντες, Κύριε δόξα σοι.
ltx/gr_gr_cog/tr.d062:trMA.AposIdiomelon1.incipit	Περιφρονήσασα ψυχή μου τῶν θείων…
ltx/gr_gr_cog/tr.d062:trMA.AposIdiomelon1.melody	@ltx/gr_gr_cog/miscellanea:misc.Idiomelon
ltx/gr_gr_cog/tr.d062:trMA.AposIdiomelon1.mode	@ltx/gr_gr_cog/miscellanea:misc.Mode4
ltx/gr_gr_cog/tr.d062:trMA.AposIdiomelon1.poet	@ltx/gr_gr_cog/poets:po.LeontosTouVasileos
ltx/gr_gr_cog/tr.d062:trMA.AposIdiomelon1.text	Περιφρονήσασα ψυχή μου τῶν θείων χρησμῶν, εὐάλωτος γέγονας, ταῖς μηχαναῖς τοῦ ἐχθροῦ· οἰκείᾳ ῥοπῇ, παραδοθεῖσα τῇ φθορᾷ, καὶ καρωθεῖσα ὑπὸ ἁμαρτίας πολλῆς, τὸ θεότευκτον ἄμφιον ἐῤῥύπωσας, καὶ ἀνευτρέπιστον τοῦ βασιλικοῦ γάμου πεποίηκας, ἀλλʹ ἵνα μὴ σὺν τῇ ἁμαρτίᾳ ἑλκυσθῇς, καὶ ὑποκεκρυμμένη τῶν παθῶν τῷ ἐνδύματι, ἀνακλιθεῖσα, τὰς εὐθύνας τῆς εἰσόδου εἰσπραχθῇς, καὶ τοῦ νυμφῶνος ἐκβληθῇς, τῷ Σωτῆρι κράξον. Τὸ φοβερὸν ὄμμα, ὁ λαβὼν ὅπερ εἰμί, καὶ ὃς ἧς μὴ ἐάσας, καὶ πρὸ σταυροῦ, χλαμύδα ἐμπαιγμοῦ διʹ ἐμὲ φορέσας, τὸν σάκκον μου διάῤῥηξον, καὶ εὐφροσύνην ἀμφίασον, καὶ ἐκ σκότους ἐξωτέρου, καὶ κλαυθμοῦ αἰωνίου ῥῦσαί με, καὶ ἐλέησόν με.
ltx/gr_gr_cog/tr.d062:trMA.AposMartyric.incipit	Τοὺς Ἀθλοφόρους τοῦ Χριστοῦ δεῦτε…
ltx/gr_gr_cog/tr.d062:trMA.AposMartyric.melody	
ltx/gr_gr_cog/tr.d062:trMA.AposMartyric.mode	@ltx/gr_gr_cog/miscellanea:misc.Mode4
ltx/gr_gr_cog/tr.d062:trMA.AposMartyric.text	Τοὺς Ἀθλοφόρους τοῦ Χριστοῦ δεῦτε λαοὶ ἅπαντες τιμήσωμεν, ὕμνοις καὶ ᾠδαῖς πνευματικαῖς, τοὺς φωστῆρας τοῦ Κόσμου, καὶ κήρυκας τῆς Πίστεως, τὴν πηγὴν τὴν ἀένναον, ἐξ ἧς ἀναβλύζει, τοῖς πιστοῖς τὰ ἰάματα, αὐτῶν ταῖς ἱκεσίαις Χριστὲ ὁ Θεὸς ἡμῶν, τὴν εἰρήνην δώρησαι τῷ Κόσμῳ σου, καὶ ταῖς ψυχαῖς ἡμῶν τὸ μέγα ἔλεος.
ltx/gr_gr_cog/tr.d062:trMA.C1.poet	@ltx/gr_gr_cog/poets:po.Iosif
ltx/gr_gr_cog/tr.d062:trMA.C2.poet	@ltx/gr_gr_cog/poets:po.Theodorou
ltx/gr_gr_cog/tr.d062:trMA.Kathisma21.greekmelody	@ltx/gr_gr_cog/he.a.m4:heAU.TachyProkatalave.greekname
ltx/gr_gr_cog/tr.d062:trMA.Kathisma21.incipit	Δυὰς ἀποστέλλεται, τῶν Μαθητῶν ἀγαγεῖν…
ltx/gr_gr_cog/tr.d062:trMA.Kathisma21.melody	@ltx/gr_gr_cog/he.a.m4:heAU.TachyProkatalave.name
ltx/gr_gr_cog/tr.d062:trMA.Kathisma21.mode	@ltx/gr_gr_cog/miscellanea:misc.Mode4
ltx/gr_gr_cog/tr.d062:trMA.Kathisma21.text	Δυὰς ἀποστέλλεται, τῶν Μαθητῶν ἀγαγεῖν, τὸν πῶλον ὡς γέγραπται, ἐν ᾧ Χριστὸς ἐπιβάς, ὡραῖος ἐλεύσεται, αἴνεσιν ἐκ νηπίων, καταρτίσασθαι θείαν. Τοῦτον οὖν ὑπαντῆσαι, ἐπειχθῶμεν σπουδαίως, Βαΐα ἐναρέτων, αὐτῷ φέροντες πράξεων.
ltx/gr_gr_cog/tr.d062:trMA.Kathisma22.greekmelody	@ltx/gr_gr_cog/he.a.m4:heAU.TachyProkatalave.greekname
ltx/gr_gr_cog/tr.d062:trMA.Kathisma22.incipit	@ltx/gr_gr_cog/oc.m4.d6:ocMA.Kathisma23.incipit
ltx/gr_gr_cog/tr.d062:trMA.Kathisma22.melody	@ltx/gr_gr_cog/he.a.m4:heAU.TachyProkatalave.name
ltx/gr_gr_cog/tr.d062:trMA.Kathisma22.mode	@ltx/gr_gr_cog/miscellanea:misc.Mode4
ltx/gr_gr_cog/tr.d062:trMA.Kathisma22.text	@ltx/gr_gr_cog/oc.m4.d6:ocMA.Kathisma23.text
ltx/gr_gr_cog/tr.d062:trMA.Kathisma31.greekmelody	@ltx/gr_gr_cog/he.a.m8:heAU.AnestisEkNekron.greekname
ltx/gr_gr_cog/tr.d062:trMA.Kathisma31.incipit	Δυὰς τῶν Μαθητῶν, ἀποστέλλεται σήμερον…
ltx/gr_gr_cog/tr.d062:trMA.Kathisma31.melody	@ltx/gr_gr_cog/he.a.m8:heAU.AnestisEkNekron.name
ltx/gr_gr_cog/tr.d062:trMA.Kathisma31.mode	@ltx/gr_gr_cog/miscellanea:misc.Mode8
ltx/gr_gr_cog/tr.d062:trMA.Kathisma31.text	Δυὰς τῶν Μαθητῶν, ἀποστέλλεται σήμερον, τὸν πῶλον ἀγαγεῖν, τῷ Δεσπότῃ τῶν ἁπάντων, ἔρχεται ἐπιβῆναι, ὁ ὀχούμενος Σεραφὶμ πλήθεσιν, ἄρχεται δειματοῦσθαι, ὁ κοσμοκράτωρ παμφάγος θάνατος, διὰ Λαζάρου πρῶτον σκυλευθείς, τὸ γένος τῶν ἀνθρώπων.
ltx/gr_gr_cog/tr.d062:trMA.Kathisma32.greekmelody	@ltx/gr_gr_cog/he.a.m8:heAU.AnestisEkNekron.greekname
ltx/gr_gr_cog/tr.d062:trMA.Kathisma32.incipit	Τῷ πάθει τοῦ Υἱοῦ, ἡ…
ltx/gr_gr_cog/tr.d062:trMA.Kathisma32.melody	@ltx/gr_gr_cog/he.a.m8:heAU.AnestisEkNekron.name
ltx/gr_gr_cog/tr.d062:trMA.Kathisma32.mode	@ltx/gr_gr_cog/miscellanea:misc.Mode8
ltx/gr_gr_cog/tr.d062:trMA.Kathisma32.text	Τῷ πάθει τοῦ Υἱοῦ, ἡ Ἁγνὴ ἐφεστῶσα, θρηνοῦσα γοερῶς, κατηλάλαζε μέλος. Πῶς σε τὸν ἀσιγήτως, Ἀγγέλων ὕμνοις δοξολογούμενον, παῖδες Ἑβραίων φεῦ μοι! Πιλάτου κρίσει Υἱὲ παρέστησαν! Ὑμνολογῶ σου Λόγε τὴν πολλήν, καὶ ἄῤῥητον εὐσπλαγχνίαν.
ltx/gr_gr_cog/tr.d062:trMA.Ode5C11.greekmelody	@ltx/gr_gr_cog/he.h.m4:heHE.AnateilonMoiKyrie.greekname
ltx/gr_gr_cog/tr.d062:trMA.Ode5C11.incipit	Ἐπὶ Σταυροῦ σὺ Κύριε, ὑπνώσας…
ltx/gr_gr_cog/tr.d062:trMA.Ode5C11.melody	@ltx/gr_gr_cog/he.h.m4:heHE.AnateilonMoiKyrie.name
ltx/gr_gr_cog/tr.d062:trMA.Ode5C11.mode	@ltx/gr_gr_cog/miscellanea:misc.Mode4
ltx/gr_gr_cog/tr.d062:trMA.Ode5C11.ode	@ltx/gr_gr_cog/miscellanea:misc.Ode5
ltx/gr_gr_cog/tr.d062:trMA.Ode5C11.text	Ἐπὶ Σταυροῦ σὺ Κύριε, ὑπνώσας μεταβέβληκας, εἰς ὕπνον Δέσποτα τὸν θάνατον· Λάζαρος γὰρ ἐβόας, ὁ φίλος κεκοίμηται, ἀλλὰ ἀπελεύσομαι, ἐξυπνῆσαι νῦν αὐτόν.
ltx/gr_gr_cog/tr.d062:trMA.Ode5C12.incipit	Τῶν Προφητῶν κηρύγματα, πληρῶν προφητευόμενα…
ltx/gr_gr_cog/tr.d062:trMA.Ode5C12.melody	@ltx/gr_gr_cog/he.h.m4:heHE.AnateilonMoiKyrie.name
ltx/gr_gr_cog/tr.d062:trMA.Ode5C12.mode	@ltx/gr_gr_cog/miscellanea:misc.Mode4
ltx/gr_gr_cog/tr.d062:trMA.Ode5C12.ode	@ltx/gr_gr_cog/miscellanea:misc.Ode5
ltx/gr_gr_cog/tr.d062:trMA.Ode5C12.text	Τῶν Προφητῶν κηρύγματα, πληρῶν προφητευόμενα, προφητοκτόνον πρὸς τὴν πόλιν Χριστέ, οἰκτίρμον παρεγένου, κτανθῆναι θελήματι, τὸν ἀποκτανθέντα με, διασῴζων τῆς φθορᾶς.
ltx/gr_gr_cog/tr.d062:trMA.Ode5C13.incipit	Οἱ σῶμα τὸ δυσήνιον, τῷ…
ltx/gr_gr_cog/tr.d062:trMA.Ode5C13.melody	@ltx/gr_gr_cog/he.h.m4:heHE.AnateilonMoiKyrie.name
ltx/gr_gr_cog/tr.d062:trMA.Ode5C13.mode	@ltx/gr_gr_cog/miscellanea:misc.Mode4
ltx/gr_gr_cog/tr.d062:trMA.Ode5C13.ode	@ltx/gr_gr_cog/miscellanea:misc.Ode5
ltx/gr_gr_cog/tr.d062:trMA.Ode5C13.text	Οἱ σῶμα τὸ δυσήνιον, τῷ λόγῳ ὑποτάξαντες, διʹ ἐγκρατείας καὶ δεήσεως, μονασταὶ καὶ μιγάδες, Χριστῷ ὑπαντήσατε, πώλῳ ἐπιβαίνοντι, ἐρχομένῳ τε παθεῖν.
ltx/gr_gr_cog/tr.d062:trMA.Ode5C1T.incipit	Ῥανίσι τοῦ ἐλέους σου, κατάρδευσον…
ltx/gr_gr_cog/tr.d062:trMA.Ode5C1T.melody	@ltx/gr_gr_cog/he.h.m4:heHE.AnateilonMoiKyrie.name
ltx/gr_gr_cog/tr.d062:trMA.Ode5C1T.mode	@ltx/gr_gr_cog/miscellanea:misc.Mode4
ltx/gr_gr_cog/tr.d062:trMA.Ode5C1T.ode	@ltx/gr_gr_cog/miscellanea:misc.Ode5
ltx/gr_gr_cog/tr.d062:trMA.Ode5C1T.text	Ῥανίσι τοῦ ἐλέους σου, κατάρδευσον Πανάχραντε, τὴν ἐκτακεῖσάν μου καρδίαν, φλογμῷ τῆς ἁμαρτίας, καὶ τὸν ἐσβεσμένον μου, τῆς καρδίας ἄναψον, λύχνον πύλη τοῦ φωτός.
ltx/gr_gr_cog/tr.d062:trMA.Ode5C21.greekmelody	@ltx/gr_gr_cog/he.h.m8:heHE.TonZofonTisPsychisMou.greekname
ltx/gr_gr_cog/tr.d062:trMA.Ode5C21.incipit	Δυάδα Μαθητῶν σου, ἐν τῷ…
ltx/gr_gr_cog/tr.d062:trMA.Ode5C21.melody	@ltx/gr_gr_cog/he.h.m8:heHE.TonZofonTisPsychisMou.name
ltx/gr_gr_cog/tr.d062:trMA.Ode5C21.mode	@ltx/gr_gr_cog/miscellanea:misc.Mode8
ltx/gr_gr_cog/tr.d062:trMA.Ode5C21.ode	@ltx/gr_gr_cog/miscellanea:misc.Ode5
ltx/gr_gr_cog/tr.d062:trMA.Ode5C21.text	Δυάδα Μαθητῶν σου, ἐν τῷ μέλλειν σε φθάνειν εἰς Βηθανίαν Χριστέ, στέλλεις ἀγάγαι σοι πῶλον, ἐφʼ ὃν οὐδεὶς ἀνθρώπων ἐκάθισε· πλὴν γάρ σου, οὐδεὶς τὰ ἄλογα ἔθνη, Σωτὴρ καθυπέταξε.
ltx/gr_gr_cog/tr.d062:trMA.Ode5C22.incipit	Συνῆλθεν Ἰουδαίων, ἐξ Ἱεροσολύμων εἰς…
ltx/gr_gr_cog/tr.d062:trMA.Ode5C22.melody	@ltx/gr_gr_cog/he.h.m8:heHE.TonZofonTisPsychisMou.name
ltx/gr_gr_cog/tr.d062:trMA.Ode5C22.mode	@ltx/gr_gr_cog/miscellanea:misc.Mode8
ltx/gr_gr_cog/tr.d062:trMA.Ode5C22.ode	@ltx/gr_gr_cog/miscellanea:misc.Ode5
ltx/gr_gr_cog/tr.d062:trMA.Ode5C22.text	Συνῆλθεν Ἰουδαίων, ἐξ Ἱεροσολύμων εἰς Βηθανίαν πληθύς, καὶ ταῖς συγγόνοις Λαζάρου, σήμερον μὲν συμπάσχει, ἐπὰν δὲ αὔριον γνῷ, τοῦτον ἐκ τάφου πηδῶντα, κινεῖται πρὸς φόνον Χριστοῦ.
ltx/gr_gr_cog/tr.d062:trMA.Ode5C2A1.incipit	Ἰδοὺ παρεσκευάσθη, ὁ Χριστὸς ἐπιστῆναι…
ltx/gr_gr_cog/tr.d062:trMA.Ode5C2A1.melody	@ltx/gr_gr_cog/he.h.m8:heHE.TonZofonTisPsychisMou.name
ltx/gr_gr_cog/tr.d062:trMA.Ode5C2A1.mode	@ltx/gr_gr_cog/miscellanea:misc.Mode8
ltx/gr_gr_cog/tr.d062:trMA.Ode5C2A1.ode	@ltx/gr_gr_cog/miscellanea:misc.Ode5
ltx/gr_gr_cog/tr.d062:trMA.Ode5C2A1.text	Ἰδοὺ παρεσκευάσθη, ὁ Χριστὸς ἐπιστῆναι, πρὸς τὴν Ἱερουσαλήμ, οἱ ἐν τοῖς ὄρεσι πάντες, καὶ ἐν ταῖς ἐρημίαις, συνέλθετε μονασταί, αὐτῷ χαρὰ ὑπαντῆσαι, σύν πάσῃ τῇ ὑπʼ οὐρανῷ.
ltx/gr_gr_cog/tr.d062:trMA.Ode5C2H.greekmelody	@ltx/gr_gr_cog/he.h.m8:heHE.TonZofonTisPsychisMou.greekname
ltx/gr_gr_cog/tr.d062:trMA.Ode5C2H.incipit	@ltx/gr_gr_cog/he.h.m8:heHE.TonZofonTisPsychisMou.incipit
ltx/gr_gr_cog/tr.d062:trMA.Ode5C2H.melody	@ltx/gr_gr_cog/he.h.m8:heHE.TonZofonTisPsychisMou.melody
ltx/gr_gr_cog/tr.d062:trMA.Ode5C2H.mode	@ltx/gr_gr_cog/miscellanea:misc.Mode8
ltx/gr_gr_cog/tr.d062:trMA.Ode5C2H.ode	@ltx/gr_gr_cog/miscellanea:misc.Ode5
ltx/gr_gr_cog/tr.d062:trMA.Ode5C2H.text	@ltx/gr_gr_cog/he.h.m8:heHE.TonZofonTisPsychisMou.text
ltx/gr_gr_cog/tr.d062:trMA.Ode5C2T.incipit	Σταυρῷ σε κατιδοῦσα, ἐμπεπαρμένον τοῖς…
ltx/gr_gr_cog/tr.d062:trMA.Ode5C2T.melody	@ltx/gr_gr_cog/he.h.m8:heHE.TonZofonTisPsychisMou.name
ltx/gr_gr_cog/tr.d062:trMA.Ode5C2T.mode	@ltx/gr_gr_cog/miscellanea:misc.Mode8
ltx/gr_gr_cog/tr.d062:trMA.Ode5C2T.ode	@ltx/gr_gr_cog/miscellanea:misc.Ode5
ltx/gr_gr_cog/tr.d062:trMA.Ode5C2T.text	Σταυρῷ σε κατιδοῦσα, ἐμπεπαρμένον τοῖς ἥλοις, Χριστὲ ἡ Μήτηρ σου, καὶ ἐκ πλευρᾶς ζωηρᾶς σου, ῥυὲν Αἷμα καὶ ὕδωρ, κατετιτρώσκετο, τῇ μητρικῇ συμπαθείᾳ· Υἱόν γάρ σε ἔγνω αὐτῆς.
ltx/gr_gr_cog/tr.d062:trMA.Ode5C2Tr.incipit	Τριὰς ἡ παναγία, ὁ Πατήρ…
ltx/gr_gr_cog/tr.d062:trMA.Ode5C2Tr.melody	@ltx/gr_gr_cog/he.h.m8:heHE.TonZofonTisPsychisMou.name
ltx/gr_gr_cog/tr.d062:trMA.Ode5C2Tr.mode	@ltx/gr_gr_cog/miscellanea:misc.Mode8
ltx/gr_gr_cog/tr.d062:trMA.Ode5C2Tr.ode	@ltx/gr_gr_cog/miscellanea:misc.Ode5
ltx/gr_gr_cog/tr.d062:trMA.Ode5C2Tr.text	Τριὰς ἡ παναγία, ὁ Πατήρ, ὁ Υἱός, καὶ Πνεῦμα τὸ παντουργόν, ἡ μακαρία Θεότης, ἡ ἄναρχος οὐσία, τὸ τριλαμπέστατον φῶς, τὸ πανδερκέστατον κράτος, τοὺς δούλους σου φύλαττε.
ltx/gr_gr_cog/tr.d062:trMA.Ode8C11.greekmelody	@ltx/gr_gr_cog/he.h.m4:heHE.GiKaiPantaTaEnAfti.greekname
ltx/gr_gr_cog/tr.d062:trMA.Ode8C11.incipit	Τὴν ἀνάστασιν καὶ ζωήν, ἔχουσαι…
ltx/gr_gr_cog/tr.d062:trMA.Ode8C11.melody	@ltx/gr_gr_cog/he.h.m4:heHE.GiKaiPantaTaEnAfti.name
ltx/gr_gr_cog/tr.d062:trMA.Ode8C11.mode	@ltx/gr_gr_cog/miscellanea:misc.Mode4
ltx/gr_gr_cog/tr.d062:trMA.Ode8C11.ode	@ltx/gr_gr_cog/miscellanea:misc.Ode8
ltx/gr_gr_cog/tr.d062:trMA.Ode8C11.text	Τὴν ἀνάστασιν καὶ ζωήν, ἔχουσαι Γυναῖκες προσφιλῆ, τί ἀποδύρεσθε πικρῶς; παραγίνεται καὶ ζωώσει, τὸν γνήσιον φίλον, τῇ αὐτοῦ ἀναστάσει τὴν ἔγερσιν, πάντων προμηνύων, ὁ πάντων εὐεργέτης.
ltx/gr_gr_cog/tr.d062:trMA.Ode8C12.incipit	Καταγώγια μοναστῶν, ἀθροίσθητε ὡς ἄρνες…
ltx/gr_gr_cog/tr.d062:trMA.Ode8C12.melody	@ltx/gr_gr_cog/he.h.m4:heHE.GiKaiPantaTaEnAfti.name
ltx/gr_gr_cog/tr.d062:trMA.Ode8C12.mode	@ltx/gr_gr_cog/miscellanea:misc.Mode4
ltx/gr_gr_cog/tr.d062:trMA.Ode8C12.ode	@ltx/gr_gr_cog/miscellanea:misc.Ode8
ltx/gr_gr_cog/tr.d062:trMA.Ode8C12.text	Καταγώγια μοναστῶν, ἀθροίσθητε ὡς ἄρνες λογικοί, τῷ ἀρχιποίμενι Χριστῷ, ὑπαντῆσαι νῦν κλαδηφόροι, προέρχεται θέλων, ὡς ἀρνίον σφαγῆναι ὁ Κύριος, ὅπως τὴν τοῦ λύκου, ἐξάρῃ τυραννίδα.
ltx/gr_gr_cog/tr.d062:trMA.Ode8C13.incipit	Ἐρχομένου πρὸς Βηθσφαγῆ, κρότου σου…
ltx/gr_gr_cog/tr.d062:trMA.Ode8C13.melody	@ltx/gr_gr_cog/he.h.m4:heHE.GiKaiPantaTaEnAfti.name
ltx/gr_gr_cog/tr.d062:trMA.Ode8C13.mode	@ltx/gr_gr_cog/miscellanea:misc.Mode4
ltx/gr_gr_cog/tr.d062:trMA.Ode8C13.ode	@ltx/gr_gr_cog/miscellanea:misc.Ode8
ltx/gr_gr_cog/tr.d062:trMA.Ode8C13.text	Ἐρχομένου πρὸς Βηθσφαγῆ, κρότου σου ποδῶν ὁ δυσμενής, ᾔσθετο ᾍδης, καὶ ποδῶν τοῦ Λαζάρου ἥπτετο λέγων· Εἰ μέλλει φωνεῖν σε ἡ ζωή, μὴ μελήσῃς, ἀλλʹ ἔξελθε· ἔγνων τὴν ἐμὴν γάρ, κατάλυσιν ἐν τάχει.
ltx/gr_gr_cog/tr.d062:trMA.Ode8C1T.incipit	Ἱεραί σε τῶν Προφητῶν, κηρύττουσι…
ltx/gr_gr_cog/tr.d062:trMA.Ode8C1T.melody	@ltx/gr_gr_cog/he.h.m4:heHE.GiKaiPantaTaEnAfti.name
ltx/gr_gr_cog/tr.d062:trMA.Ode8C1T.mode	@ltx/gr_gr_cog/miscellanea:misc.Mode4
ltx/gr_gr_cog/tr.d062:trMA.Ode8C1T.ode	@ltx/gr_gr_cog/miscellanea:misc.Ode8
ltx/gr_gr_cog/tr.d062:trMA.Ode8C1T.text	Ἱεραί σε τῶν Προφητῶν, κηρύττουσι φωναὶ συμβολικῶς, πύλην καὶ ὄρος καὶ σκηνὴν τὴν ἁγίαν, φωτὸς νεφέλην, ἐξ ἧς τοῖς ἐν σκότει, καὶ σκιᾷ καθημένοις ἀνέτειλεν, Ἥλιος Παρθένε, ὁ μόνος φωτοδότης.
ltx/gr_gr_cog/tr.d062:trMA.Ode8C21.greekmelody	@ltx/gr_gr_cog/he.h.m8:heHE.AngeloiKaiOuranoi.greekname
ltx/gr_gr_cog/tr.d062:trMA.Ode8C21.incipit	Ἡ δυὰς τῶν Μαθητῶν, ἀποσταλεῖσα…
ltx/gr_gr_cog/tr.d062:trMA.Ode8C21.melody	@ltx/gr_gr_cog/he.h.m8:heHE.AngeloiKaiOuranoi.name
ltx/gr_gr_cog/tr.d062:trMA.Ode8C21.mode	@ltx/gr_gr_cog/miscellanea:misc.Mode8
ltx/gr_gr_cog/tr.d062:trMA.Ode8C21.ode	@ltx/gr_gr_cog/miscellanea:misc.Ode8
ltx/gr_gr_cog/tr.d062:trMA.Ode8C21.text	Ἡ δυὰς τῶν Μαθητῶν, ἀποσταλεῖσα φέρει ὑποζύγιον, τῷ ἐπὶ ταῖς νεφέλαις ἐπιβαίνοντι, ὃν τὰ πάντα ὑμνοῦσι, καὶ ὑπερυψοῦσιν, εἰς πάντας τοὺς αἰῶνας.
ltx/gr_gr_cog/tr.d062:trMA.Ode8C22.incipit	Ἐπὶ θύραις ὁ Χριστός, λοιπὸν…
ltx/gr_gr_cog/tr.d062:trMA.Ode8C22.melody	@ltx/gr_gr_cog/he.h.m8:heHE.AngeloiKaiOuranoi.name
ltx/gr_gr_cog/tr.d062:trMA.Ode8C22.mode	@ltx/gr_gr_cog/miscellanea:misc.Mode8
ltx/gr_gr_cog/tr.d062:trMA.Ode8C22.ode	@ltx/gr_gr_cog/miscellanea:misc.Ode8
ltx/gr_gr_cog/tr.d062:trMA.Ode8C22.text	Ἐπὶ θύραις ὁ Χριστός, λοιπὸν ἡ Βηθανία μὴ σκυθρώπαζε· εἰς γὰρ χαρὰν τὸ πένθος μεταβάλλει σου, τὸ σὸν θρέμμα ἐγείρων, Λάζαρον ἐκ τάφου, αὐτὸν ὑμνολογοῦντα.
ltx/gr_gr_cog/tr.d062:trMA.Ode8C2A1.incipit	Τοῖς φυτοῖς τῶν ἀρετῶν, καὶ…
ltx/gr_gr_cog/tr.d062:trMA.Ode8C2A1.melody	@ltx/gr_gr_cog/he.h.m8:heHE.AngeloiKaiOuranoi.name
ltx/gr_gr_cog/tr.d062:trMA.Ode8C2A1.mode	@ltx/gr_gr_cog/miscellanea:misc.Mode8
ltx/gr_gr_cog/tr.d062:trMA.Ode8C2A1.ode	@ltx/gr_gr_cog/miscellanea:misc.Ode8
ltx/gr_gr_cog/tr.d062:trMA.Ode8C2A1.text	Τοῖς φυτοῖς τῶν ἀρετῶν, καὶ αἰσθητῶς τοῖς κλάδοις, ὡς διπλοῦν Χριστόν, ἑτοιμασθῶμεν πάντες ὑποδέξασθαι, ὀχούμενον ἐν πώλῳ, ὃν ὑπερυψοῦμεν, εἰς πάντας τοὺς αἰῶνας.
ltx/gr_gr_cog/tr.d062:trMA.Ode8C2H.greekmelody	@ltx/gr_gr_cog/he.h.m8:heHE.AngeloiKaiOuranoi.greekname
ltx/gr_gr_cog/tr.d062:trMA.Ode8C2H.incipit	@ltx/gr_gr_cog/he.h.m8:heHE.AngeloiKaiOuranoi.incipit
ltx/gr_gr_cog/tr.d062:trMA.Ode8C2H.melody	@ltx/gr_gr_cog/he.h.m8:heHE.AngeloiKaiOuranoi.melody
ltx/gr_gr_cog/tr.d062:trMA.Ode8C2H.mode	@ltx/gr_gr_cog/miscellanea:misc.Mode8
ltx/gr_gr_cog/tr.d062:trMA.Ode8C2H.ode	@ltx/gr_gr_cog/miscellanea:misc.Ode8
ltx/gr_gr_cog/tr.d062:trMA.Ode8C2H.text	@ltx/gr_gr_cog/he.h.m8:heHE.AngeloiKaiOuranoi.text
ltx/gr_gr_cog/tr.d062:trMA.Ode8C2T.incipit	Μόνη ἄφθορος κύεις, μόνη θηλάζεις…
ltx/gr_gr_cog/tr.d062:trMA.Ode8C2T.melody	@ltx/gr_gr_cog/he.h.m8:heHE.AngeloiKaiOuranoi.name
ltx/gr_gr_cog/tr.d062:trMA.Ode8C2T.mode	@ltx/gr_gr_cog/miscellanea:misc.Mode8
ltx/gr_gr_cog/tr.d062:trMA.Ode8C2T.ode	@ltx/gr_gr_cog/miscellanea:misc.Ode8
ltx/gr_gr_cog/tr.d062:trMA.Ode8C2T.text	Μόνη ἄφθορος κύεις, μόνη θηλάζεις βρέφος μὴ λοχεύουσα, μόνη τὸν κτίστην τίκτεις, καὶ Δεσπότην σου, εἰ καὶ Μήτηρ καὶ δούλη, Σὲ Παρθενομῆτορ, ὑμνοῦμεν εἰς αἰῶνας.
ltx/gr_gr_cog/tr.d062:trMA.Ode8C2Tr.incipit	Εἷς Θεὸς οὖν ἡ Τριάς…
ltx/gr_gr_cog/tr.d062:trMA.Ode8C2Tr.melody	@ltx/gr_gr_cog/he.h.m8:heHE.AngeloiKaiOuranoi.name
ltx/gr_gr_cog/tr.d062:trMA.Ode8C2Tr.mode	@ltx/gr_gr_cog/miscellanea:misc.Mode8
ltx/gr_gr_cog/tr.d062:trMA.Ode8C2Tr.ode	@ltx/gr_gr_cog/miscellanea:misc.Ode8
ltx/gr_gr_cog/tr.d062:trMA.Ode8C2Tr.text	Εἷς Θεὸς οὖν ἡ Τριάς, οὐ τοῦ Πατρὸς ἐκστάντος εἰς υἱότητα, οὐδὲ Υἱοῦ τραπέντος εἰς ἐκπόρευσιν, ἀλλʹ ἰδίᾳ καὶ ἄμφω, φῶς Θεὸν τὰ τρία, δοξάζω εἰς αἰῶνας.
ltx/gr_gr_cog/tr.d062:trMA.Ode9C11.greekmelody	@ltx/gr_gr_cog/he.h.m4:heHE.OtiEpoiiseMoiMegaleia.greekname
ltx/gr_gr_cog/tr.d062:trMA.Ode9C11.incipit	Ἰδοὺ προανεφώνεις, ἀναβαίνομεν Ἰησοῦ, πρὸς…
ltx/gr_gr_cog/tr.d062:trMA.Ode9C11.melody	@ltx/gr_gr_cog/he.h.m4:heHE.OtiEpoiiseMoiMegaleia.name
ltx/gr_gr_cog/tr.d062:trMA.Ode9C11.mode	@ltx/gr_gr_cog/miscellanea:misc.Mode4
ltx/gr_gr_cog/tr.d062:trMA.Ode9C11.ode	@ltx/gr_gr_cog/miscellanea:misc.Ode9
ltx/gr_gr_cog/tr.d062:trMA.Ode9C11.text	Ἰδοὺ προανεφώνεις, ἀναβαίνομεν Ἰησοῦ, πρὸς Πόλιν, τὴν ἁγίαν, καὶ χερσὶν μιαιφόνων ἀληθῶς, παραδοθήσομαι σταυρῷ, ἀποκτανθῆναι σαρκί.
ltx/gr_gr_cog/tr.d062:trMA.Ode9C12.incipit	Θανάτου θέλων Λόγε, ἐξαρπάσαι φίλον…
ltx/gr_gr_cog/tr.d062:trMA.Ode9C12.melody	@ltx/gr_gr_cog/he.h.m4:heHE.OtiEpoiiseMoiMegaleia.name
ltx/gr_gr_cog/tr.d062:trMA.Ode9C12.mode	@ltx/gr_gr_cog/miscellanea:misc.Mode4
ltx/gr_gr_cog/tr.d062:trMA.Ode9C12.ode	@ltx/gr_gr_cog/miscellanea:misc.Ode9
ltx/gr_gr_cog/tr.d062:trMA.Ode9C12.text	Θανάτου θέλων Λόγε, ἐξαρπάσαι φίλον τὸν σόν, σαρκὶ θανατωθῆναι διʹ ἡμᾶς, κατεπείγῃ τοὺς βροτούς, ἀθανατίζων τοὺς πιστούς, μόνε ἀθάνατε.
ltx/gr_gr_cog/tr.d062:trMA.Ode9C13.incipit	Βαΐα σωφροσύνης, ἐπεισοίσωμεν τῷ Χριστῷ…
ltx/gr_gr_cog/tr.d062:trMA.Ode9C13.melody	@ltx/gr_gr_cog/he.h.m4:heHE.OtiEpoiiseMoiMegaleia.name
ltx/gr_gr_cog/tr.d062:trMA.Ode9C13.mode	@ltx/gr_gr_cog/miscellanea:misc.Mode4
ltx/gr_gr_cog/tr.d062:trMA.Ode9C13.ode	@ltx/gr_gr_cog/miscellanea:misc.Ode9
ltx/gr_gr_cog/tr.d062:trMA.Ode9C13.text	Βαΐα σωφροσύνης, ἐπεισοίσωμεν τῷ Χριστῷ, ἐν πώλῳ μετριάζοντι σαρκί, καὶ προσείπωμεν αὐτῷ· Ἐπὶ τὸ πάθος ὁ ἐλθών, εὐλογητὸς εἶ Σωτήρ.
ltx/gr_gr_cog/tr.d062:trMA.Ode9C1T.incipit	Φρικτή σου ἡ λοχεία, Θεοτόκε…
ltx/gr_gr_cog/tr.d062:trMA.Ode9C1T.melody	@ltx/gr_gr_cog/he.h.m4:heHE.OtiEpoiiseMoiMegaleia.name
ltx/gr_gr_cog/tr.d062:trMA.Ode9C1T.mode	@ltx/gr_gr_cog/miscellanea:misc.Mode4
ltx/gr_gr_cog/tr.d062:trMA.Ode9C1T.ode	@ltx/gr_gr_cog/miscellanea:misc.Ode9
ltx/gr_gr_cog/tr.d062:trMA.Ode9C1T.text	Φρικτή σου ἡ λοχεία, Θεοτόκε Μήτηρ Χριστοῦ· διό σε μακαρίζομεν πιστῶς, καὶ δοξάζομεν σεπτῶς, αἱ γενεαὶ τῶν γενεῶν, εἰς τοὺς αἰῶνας, Ἀμήν.
ltx/gr_gr_cog/tr.d062:trMA.Ode9C21.greekmelody	@ltx/gr_gr_cog/he.h.m8:heHE.TonProdilothenta.greekname
ltx/gr_gr_cog/tr.d062:trMA.Ode9C21.incipit	Ἄρτι ἀποστέλλων, τοὺς Μαθητὰς Χριστὸς…
ltx/gr_gr_cog/tr.d062:trMA.Ode9C21.melody	@ltx/gr_gr_cog/he.h.m8:heHE.TonProdilothenta.name
ltx/gr_gr_cog/tr.d062:trMA.Ode9C21.mode	@ltx/gr_gr_cog/miscellanea:misc.Mode8
ltx/gr_gr_cog/tr.d062:trMA.Ode9C21.ode	@ltx/gr_gr_cog/miscellanea:misc.Ode9
ltx/gr_gr_cog/tr.d062:trMA.Ode9C21.text	Ἄρτι ἀποστέλλων, τοὺς Μαθητὰς Χριστὸς ἔφη· Λύσαντές μοι πῶλον, ἀγάγετε ἐπιβῆναι, ἵνα λύσω τῆς ἀλογίας τὰ ἔθνη, καὶ καθυποτάξω, ὡς Υἱὸς τῷ Πατρί.
ltx/gr_gr_cog/tr.d062:trMA.Ode9C22.incipit	Ἔρχεται ὁ Κύριος, ἄνοιξόν σου…
ltx/gr_gr_cog/tr.d062:trMA.Ode9C22.melody	@ltx/gr_gr_cog/he.h.m8:heHE.TonProdilothenta.name
ltx/gr_gr_cog/tr.d062:trMA.Ode9C22.mode	@ltx/gr_gr_cog/miscellanea:misc.Mode8
ltx/gr_gr_cog/tr.d062:trMA.Ode9C22.ode	@ltx/gr_gr_cog/miscellanea:misc.Ode9
ltx/gr_gr_cog/tr.d062:trMA.Ode9C22.text	Ἔρχεται ὁ Κύριος, ἄνοιξόν σου τὰς πύλας, Βηθανία πρόσδεξαι, ἐν πίστει τὸν Δεσπότην· καὶ γὰρ ἥκει ἐξαναστῆσαι ἐκ τάφου, Λάζαρον ὡς μόνος παντοδύναμος.
ltx/gr_gr_cog/tr.d062:trMA.Ode9C2A1.incipit	Οἱ ἐν ταῖς ἐρήμοις, καὶ…
ltx/gr_gr_cog/tr.d062:trMA.Ode9C2A1.melody	@ltx/gr_gr_cog/he.h.m8:heHE.TonProdilothenta.name
ltx/gr_gr_cog/tr.d062:trMA.Ode9C2A1.mode	@ltx/gr_gr_cog/miscellanea:misc.Mode8
ltx/gr_gr_cog/tr.d062:trMA.Ode9C2A1.ode	@ltx/gr_gr_cog/miscellanea:misc.Ode9
ltx/gr_gr_cog/tr.d062:trMA.Ode9C2A1.text	Οἱ ἐν ταῖς ἐρήμοις, καὶ ὄρεσι καὶ σπηλαίοις, ἥκατε ἀθροίσθητε, σὺν ἡμῖν βαϊοφόροι, ὑπαντῆσαι τῷ Βασιλεῖ καὶ Δεσπότῃ· ἔρχεται γὰρ σῶσαι τὰς ψυχὰς ἡμῶν.
ltx/gr_gr_cog/tr.d062:trMA.Ode9C2H.greekmelody	@ltx/gr_gr_cog/he.h.m8:heHE.TonProdilothenta.greekname
ltx/gr_gr_cog/tr.d062:trMA.Ode9C2H.incipit	@ltx/gr_gr_cog/he.h.m8:heHE.TonProdilothenta.incipit
ltx/gr_gr_cog/tr.d062:trMA.Ode9C2H.melody	@ltx/gr_gr_cog/he.h.m8:heHE.TonProdilothenta.melody
ltx/gr_gr_cog/tr.d062:trMA.Ode9C2H.mode	@ltx/gr_gr_cog/miscellanea:misc.Mode8
ltx/gr_gr_cog/tr.d062:trMA.Ode9C2H.ode	@ltx/gr_gr_cog/miscellanea:misc.Ode9
ltx/gr_gr_cog/tr.d062:trMA.Ode9C2H.text	@ltx/gr_gr_cog/he.h.m8:heHE.TonProdilothenta.text
ltx/gr_gr_cog/tr.d062:trMA.Ode9C2T.incipit	Χαίροις τὸ παλάτιον, τοῦ πάντων…
ltx/gr_gr_cog/tr.d062:trMA.Ode9C2T.melody	@ltx/gr_gr_cog/he.h.m8:heHE.TonProdilothenta.name
ltx/gr_gr_cog/tr.d062:trMA.Ode9C2T.mode	@ltx/gr_gr_cog/miscellanea:misc.Mode8
ltx/gr_gr_cog/tr.d062:trMA.Ode9C2T.ode	@ltx/gr_gr_cog/miscellanea:misc.Ode9
ltx/gr_gr_cog/tr.d062:trMA.Ode9C2T.text	Χαίροις τὸ παλάτιον, τοῦ πάντων Βασιλέως, διʹ ἧς τὰ βασίλεια οὐρανῶν ἠνεῴχθη, τοῖς ἐπὶ γῆς Θεοτόκε Παρθένε, καὶ ἡ μετὰ Ἀγγέλων συγκατοίκησις.
ltx/gr_gr_cog/tr.d062:trMA.Ode9C2Tr.incipit	Τὸ τρισσοφαὲς Κύριε, τῆς σῆς…
ltx/gr_gr_cog/tr.d062:trMA.Ode9C2Tr.melody	@ltx/gr_gr_cog/he.h.m8:heHE.TonProdilothenta.name
ltx/gr_gr_cog/tr.d062:trMA.Ode9C2Tr.mode	@ltx/gr_gr_cog/miscellanea:misc.Mode8
ltx/gr_gr_cog/tr.d062:trMA.Ode9C2Tr.ode	@ltx/gr_gr_cog/miscellanea:misc.Ode9
ltx/gr_gr_cog/tr.d062:trMA.Ode9C2Tr.text	Τὸ τρισσοφαὲς Κύριε, τῆς σῆς μοναρχίας, ἐκφαντορικαῖς λάμψεσιν, εἰς νοῦν ἡμῶν ἀστράπτον, ἀπὸ πλάνης πολυσχιδοῦς ἐπιστρέφει, πρὸς ἑνωτικὴν ἡμᾶς ἐνθέωσιν.
ltx/gr_gr_cog/tr.d062:trTE.Troparion.incipit	Ἀνυπόστατος Κύριε ἡ ὀργή, τῆς…
ltx/gr_gr_cog/tr.d062:trTE.Troparion.melody	
ltx/gr_gr_cog/tr.d062:trTE.Troparion.mode	@ltx/gr_gr_cog/miscellanea:misc.Mode3
ltx/gr_gr_cog/tr.d062:trTE.Troparion.text	Ἀνυπόστατος Κύριε ἡ ὀργή, τῆς ἐπὶ ἁμαρτωλοὺς ἀπειλῆς σου· καὶ οὐκ ἐσμὲν ἄξιοι ατενίσαι, καὶ αἰτῆσαι παρὰ σοῦ ἔλεος, μὴ τῷ θυμῷ σου, μηδὲ τῇ ὀργῇ σου ἀπολέσῃς ἡμᾶς, οὓς ἐκ γῆς τῇ χειρί σου ἔπλασας.
ltx/gr_gr_cog/tr.d062:trTE.Troparion2.incipit	οὓς ἐκ γῆς τῇ χειρί…
ltx/gr_gr_cog/tr.d062:trTE.Troparion2.text	οὓς ἐκ γῆς τῇ χειρί σου ἔπλασας.
ltx/gr_gr_cog/tr.d062:trVE.AposIdiomelon1.incipit	Τοῦ Πλουσίου τῆς ἀσυμπαθοῦς ὁμοιώσεως…
ltx/gr_gr_cog/tr.d062:trVE.AposIdiomelon1.melody	@ltx/gr_gr_cog/miscellanea:misc.Idiomelon
ltx/gr_gr_cog/tr.d062:trVE.AposIdiomelon1.mode	@ltx/gr_gr_cog/miscellanea:misc.Mode8
ltx/gr_gr_cog/tr.d062:trVE.AposIdiomelon1.text	Τοῦ Πλουσίου τῆς ἀσυμπαθοῦς ὁμοιώσεως, καὶ ἀμεταδότσυ γνώμης, ῥῦσαί με Χριστὲ ὁ Θεός, ὁ διὰ Σταυροῦ σου, καθαρισμὸν τῶν ἁμαρτιῶν ἡμῶν ποιησάμενος, Λαζάρου δὲ τοῦ πτωχοῦ, τῆς εὐχαρίστου ὑπομονῆς, ζηλωτὴν ἀνάδειξον, καὶ τῶν κόλπων τοῦ Πατριάρχου Ἀβραάμ, μὴ ἀποξενώσῃς με, διὰ τὸ μέγα σου ἔλεος.
ltx/gr_gr_cog/tr.d062:trVE.AposMartyric.incipit	Μάρτυρες Κυρίου, πάντα τόπον ἁγιάζετε…
ltx/gr_gr_cog/tr.d062:trVE.AposMartyric.melody	
ltx/gr_gr_cog/tr.d062:trVE.AposMartyric.mode	@ltx/gr_gr_cog/miscellanea:misc.Mode8
ltx/gr_gr_cog/tr.d062:trVE.AposMartyric.text	Μάρτυρες Κυρίου, πάντα τόπον ἁγιάζετε, καὶ πᾶσαν νόσον θεραπεύετε, καὶ νῦν πρεσβεύσατε, ῥυσθῆναι τῶν παγίδων τοῦ ἐχθροῦ, τὰς ψυχὰς ἡμῶν δεόμεθα.
ltx/gr_gr_cog/tr.d062:trVE.AposTheotokion.greekmelody	@ltx/gr_gr_cog/he.a.m8:heAU.OTouParadoxou.greekname
ltx/gr_gr_cog/tr.d062:trVE.AposTheotokion.incipit	@ltx/gr_gr_cog/me.m11.d05:meVE.SticStavrotheotokion.incipit
ltx/gr_gr_cog/tr.d062:trVE.AposTheotokion.melody	@ltx/gr_gr_cog/he.a.m8:heAU.OTouParadoxou.name
ltx/gr_gr_cog/tr.d062:trVE.AposTheotokion.mode	@ltx/gr_gr_cog/miscellanea:misc.Mode8
ltx/gr_gr_cog/tr.d062:trVE.AposTheotokion.text	@ltx/gr_gr_cog/me.m11.d05:meVE.SticStavrotheotokion.text
ltx/gr_gr_cog/tr.d062:trVE.Stichera01.greekmelody	@ltx/gr_gr_cog/he.a.m4:heAU.OExYpsistouKlitheis.greekname
ltx/gr_gr_cog/tr.d062:trVE.Stichera01.incipit	Τῶν Ἀποστόλων δυὰς ἱερωτάτη, ἕνα…
ltx/gr_gr_cog/tr.d062:trVE.Stichera01.melody	@ltx/gr_gr_cog/he.a.m4:heAU.OExYpsistouKlitheis.name
ltx/gr_gr_cog/tr.d062:trVE.Stichera01.mode	@ltx/gr_gr_cog/miscellanea:misc.Mode4
ltx/gr_gr_cog/tr.d062:trVE.Stichera01.text	Τῶν Ἀποστόλων δυὰς ἱερωτάτη, ἕνα τῆς Τριάδος σε, ἐπισταμένη Χριστέ, νῦν παρὰ σοῦ ἀποστέλλεται, ἀγάγαι πῶλον, ὑποζυγίου υἱὸν ὡς γέγραπται, ἐφ΄ ᾧ ταπεινούμενος, καθίσεις εὔσπλαγχνε, τὴν ἐν ὑψίστοις θελήματι, καθέδραν πᾶσι, τοῖς σὲ ποθοῦσιν ἑτοιμαζόμενος, καὶ τοὺς ἀλόγοις ὑποκύψαντας, φρενοβλαβῶς Λόγε πάθεσι λογισμούς ἀπεργάσω. Ὡσαννά σοι ἀνακράζοντας.
ltx/gr_gr_cog/tr.d062:trVE.Stichera02.greekmelody	@ltx/gr_gr_cog/he.a.m4:heAU.OExYpsistouKlitheis.greekname
ltx/gr_gr_cog/tr.d062:trVE.Stichera02.incipit	Καθυποδέχου Σιὼν τὸν Βασιλέα, ἰδού…
ltx/gr_gr_cog/tr.d062:trVE.Stichera02.melody	@ltx/gr_gr_cog/he.a.m4:heAU.OExYpsistouKlitheis.name
ltx/gr_gr_cog/tr.d062:trVE.Stichera02.mode	@ltx/gr_gr_cog/miscellanea:misc.Mode4
ltx/gr_gr_cog/tr.d062:trVE.Stichera02.text	Καθυποδέχου Σιὼν τὸν Βασιλέα, ἰδού σοι πρᾳότατος, ἤδη ἐφίσταται, ἐξαναστῆσαι τὸν Λάζαρον, καὶ καταλῦσαι, τὸ τοῦ θανάτου πικρὸν βασίλειον. Πληθὺς θεοσύλλεκτε, τῶν ἱερῶν Μοναστῶν, μετὰ Μιγάδων ἀθροίσθητε, καθυπαντῆσαι, μετὰ Βαΐων Χριστῷ κραυγάζοντες· Εὐλογημένος ὁ ἐρχόμενος, σῶσαι γένος βροτῶν διὰ πάθους Σταυροῦ, καὶ ἀπάθειαν πᾶσι, παρασχεῖν διʹ ἀγαθότητα.
ltx/gr_gr_cog/tr.d062:trVE.Stichera03.greekmelody	@ltx/gr_gr_cog/he.a.m8:heAU.OEnEdemParadeisos.greekname
ltx/gr_gr_cog/tr.d062:trVE.Stichera03.incipit	Ὁ Σεραφὶμ τοῖς ἄνω φοβερός…
ltx/gr_gr_cog/tr.d062:trVE.Stichera03.melody	@ltx/gr_gr_cog/he.a.m8:heAU.OEnEdemParadeisos.name
ltx/gr_gr_cog/tr.d062:trVE.Stichera03.mode	@ltx/gr_gr_cog/miscellanea:misc.Mode8
ltx/gr_gr_cog/tr.d062:trVE.Stichera03.text	Ὁ Σεραφὶμ τοῖς ἄνω φοβερός, Χριστὲ ἐποχούμενος, ὡς Θεός τε καὶ τῶν ὅλων ποιητής, αὐτὸς ἐν πώλῳ ἐπὶ γῆς, καθεσθῆναι ἐπείγεσαι, ὡς ὑπάρχων καθʹ ἡμᾶς ἀνθρωπικῶς, ἡ Βηθανία ἀγάλλεται, ὡς δεχομένη σε Σωτήρ, Ἱεροσόλυμα χαίρει δέ, ὡς προσδοκῶντά σε λαβεῖν, θάνατος τέθνηκε, προαισθόμενος τὸν Λάζαρον, φοιτᾶν ἐκ τῶν νεκρῶν, καὶ ἡμεῖς τοῖς Βαΐοις, προϋπαντὴν τελοῦντες ἐν χαρᾷ, ἀνυμνοῦμεν τὸ κράτος, τῆς ἀγαθότητός σου Κύριε.
