ltx/gr_gr_cog/le.go.ge.theotokos:legeLI.Gospel.book_abbr	@ltx/gr_gr_cog/bible:Luke.abbr
ltx/gr_gr_cog/le.go.ge.theotokos:legeLI.Gospel.book_string	@ltx/gr_gr_cog/bible:Luke.text
ltx/gr_gr_cog/le.go.ge.theotokos:legeLI.Gospel.chapverse	10:38 – 42, 11:27 – 28
ltx/gr_gr_cog/le.go.ge.theotokos:legeLI.Gospel.incipit	Εἰσῆλθεν ὁ Ἰησοῦς εἰς κώμην τινά…
ltx/gr_gr_cog/le.go.ge.theotokos:legeLI.Gospel.text	Τῷ καιρῷ ἐκείνῳ, εἰσῆλθεν ὁ Ἰησοῦς εἰς κώμην τινά. γυνὴ δέ τις ὀνόματι Μάρθα ὑπεδέξατο αὐτὸν εἰς τὸν οἶκον αὐτῆς. καὶ τῇδε ἦν ἀδελφὴ καλουμένη Μαρία, ἣ καὶ παρακαθίσασα παρὰ τοὺς πόδας τοῦ Ἰησοῦ ἤκουε τὸν λόγον αὐτοῦ. ἡ δὲ Μάρθα περιεσπᾶτο περὶ πολλὴν διακονίαν· ἐπιστᾶσα δὲ εἶπε· Κύριε, οὐ μέλει σοι ὅτι ἡ ἀδελφή μου μόνην με κατέλιπε διακονεῖν; εἰπὲ οὖν αὐτῇ ἵνα μοι συναντιλάβηται. ἀποκριθεὶς δὲ εἶπεν αὐτῇ ὁ Ἰησοῦς· Μάρθα Μάρθα, μεριμνᾷς καὶ τυρβάζῃ περὶ πολλά· ἑνὸς δέ ἐστι χρεία· Μαρία δὲ τὴν ἀγαθὴν μερίδα ἐξελέξατο, ἥτις οὐκ ἀφαιρεθήσεται ἀπ᾿ αὐτῆς. Ἐγένετο δὲ ἐν τῷ λέγειν αὐτὸν ταῦτα ἐπάρασά τις γυνὴ φωνὴν ἐκ τοῦ ὄχλου εἶπεν αὐτῷ· μακαρία ἡ κοιλία ἡ βαστάσασά σε καὶ μαστοὶ οὓς ἐθήλασας. αὐτὸς δὲ εἶπε· μενοῦνγε μακάριοι οἱ ἀκούοντες τὸν λόγον τοῦ Θεοῦ καὶ φυλάσσοντες αὐτόν.
ltx/gr_gr_cog/le.go.ge.theotokos:legeLI.Gospel.title	Τῆς Θεοτόκου
ltx/gr_gr_cog/le.go.ge.theotokos:legeLI.Gospel.title_abbr	Τῆς Θεοτόκου
ltx/gr_gr_cog/le.go.ge.theotokos:legeLI.Gospel.version	@ltx/gr_gr_cog/properties:version.designation
ltx/gr_gr_cog/le.go.ge.theotokos:legeMA.Gospel.book_abbr	@ltx/gr_gr_cog/bible:Luke.abbr
ltx/gr_gr_cog/le.go.ge.theotokos:legeMA.Gospel.book_string	@ltx/gr_gr_cog/bible:Luke.text
ltx/gr_gr_cog/le.go.ge.theotokos:legeMA.Gospel.chapverse	1:39 – 49, 56
ltx/gr_gr_cog/le.go.ge.theotokos:legeMA.Gospel.incipit	Ἐν ταῖς ἡμέραις ἐκείναις ἀναστᾶσα Μαριάμ…
ltx/gr_gr_cog/le.go.ge.theotokos:legeMA.Gospel.text	Ἐν ταῖς ἡμέραις ἐκείναις ἀναστᾶσα δὲ Μαριὰμ ἐπορεύθη εἰς τὴν ὀρεινὴν μετὰ σπουδῆς εἰς πόλιν Ἰούδα, καὶ εἰσῆλθεν εἰς τὸν οἶκον Ζαχαρίου καὶ ἠσπάσατο τὴν Ἐλισάβετ. καὶ ἐγένετο ὡς ἤκουσεν ἡ Ἐλισάβετ τὸν ἀσπασμὸν τῆς Μαρίας, ἐσκίρτησε τὸ βρέφος ἐν τῇ κοιλίᾳ αὐτῆς· καὶ ἐπλήσθη Πνεύματος Ἁγίου ἡ Ἐλισάβετ καὶ ἀνεφώνησε φωνῇ μεγάλῃ καὶ εἶπεν· εὐλογημένη σὺ ἐν γυναιξὶ καὶ εὐλογημένος ὁ καρπὸς τῆς κοιλίας σου. καὶ πόθεν μοι τοῦτο ἵνα ἔλθῃ ἡ μήτηρ τοῦ Κυρίου μου πρός με; ἰδοὺ γὰρ ὡς ἐγένετο ἡ φωνὴ τοῦ ἀσπασμοῦ σου εἰς τὰ ὦτά μου, ἐσκίρτησε τὸ βρέφος ἐν ἀγαλλιάσει ἐν τῇ κοιλίᾳ μου. καὶ μακαρία ἡ πιστεύσασα ὅτι ἔσται τελείωσις τοῖς λελαλημένοις αὐτῇ παρὰ Κυρίου. Καὶ εἶπε Μαριάμ· Μεγαλύνει ἡ ψυχή μου τὸν Κύριον καὶ ἠγαλλίασε τὸ πνεῦμά μου ἐπὶ τῷ Θεῷ τῷ σωτῆρί μου, ὅτι ἐπέβλεψεν ἐπὶ τὴν ταπείνωσιν τῆς δούλης αὐτοῦ. ἰδοὺ γὰρ ἀπὸ τοῦ νῦν μακαριοῦσί με πᾶσαι αἱ γενεαί· ὅτι ἐποίησέ μοι μεγαλεῖα ὁ δυνατὸς καὶ ἅγιον τὸ ὄνομα αὐτοῦ. Ἔμεινε δὲ Μαριὰμ σὺν αὐτῇ ὡσεὶ μῆνας τρεῖς καὶ ὑπέστρεψεν εἰς τὸν οἶκον αὐτῆς.
ltx/gr_gr_cog/le.go.ge.theotokos:legeMA.Gospel.title	Τῆς Θεοτόκου
ltx/gr_gr_cog/le.go.ge.theotokos:legeMA.Gospel.title_abbr	Τῆς Θεοτόκου
ltx/gr_gr_cog/le.go.ge.theotokos:legeMA.Gospel.version	@ltx/gr_gr_cog/properties:version.designation
