ltx/gr_gr_cog/pe.d126:peDA.commemoration.full	Σάββατον μετὰ τὴν Πεντηκοστήν - Ἀπόδοσις τῆς Πεντηκοστῆς
ltx/gr_gr_cog/pe.d126:peDA.commemoration.short	Ἀπόδοσις τῆς Πεντηκοστῆς
ltx/gr_gr_cog/pe.d126:peDA.dismissal	@ltx/gr_gr_cog/dismissals:dis00.pentecost
ltx/gr_gr_cog/pe.d126:peDA.insert1	
ltx/gr_gr_cog/pe.d126:peDA.insert2	
ltx/gr_gr_cog/pe.d126:peDA.note	
ltx/gr_gr_cog/pe.d126:peHO.commemorations	
ltx/gr_gr_cog/pe.d126:peHO.daytitle	
ltx/gr_gr_cog/pe.d126:peHO.description1	
ltx/gr_gr_cog/pe.d126:peHO.description2	
ltx/gr_gr_cog/pe.d126:peHO.note1	
ltx/gr_gr_cog/pe.d126:peHO.note2	
ltx/gr_gr_cog/pe.d126:peMA.MM.Lauds123as123.text	@ltx/gr_gr_cog/properties:media.key
ltx/gr_gr_cog/pe.d126:peVE.MM.Stichera123456as123456.text	@ltx/gr_gr_cog/properties:media.key
