ltx/gr_gr_cog/le.go.me.m01.d10:lemeLI.Gospel.book_abbr	@ltx/gr_gr_cog/le.go.lu.d001:leluLI.Gospel.book_abbr
ltx/gr_gr_cog/le.go.me.m01.d10:lemeLI.Gospel.book_string	@ltx/gr_gr_cog/le.go.lu.d001:leluLI.Gospel.book_string
ltx/gr_gr_cog/le.go.me.m01.d10:lemeLI.Gospel.chapverse	@ltx/gr_gr_cog/le.go.lu.d001:leluLI.Gospel.chapverse
ltx/gr_gr_cog/le.go.me.m01.d10:lemeLI.Gospel.incipit	@ltx/gr_gr_cog/le.go.lu.d001:leluLI.Gospel.incipit
ltx/gr_gr_cog/le.go.me.m01.d10:lemeLI.Gospel.text	@ltx/gr_gr_cog/le.go.lu.d001:leluLI.Gospel.text
ltx/gr_gr_cog/le.go.me.m01.d10:lemeLI.Gospel.title	Μεθέορτον
ltx/gr_gr_cog/le.go.me.m01.d10:lemeLI.Gospel.title_abbr	Μεθέορτον
ltx/gr_gr_cog/le.go.me.m01.d10:lemeLI.Gospel.version	@ltx/gr_gr_cog/le.go.lu.d001:leluLI.Gospel.version
ltx/gr_gr_cog/le.go.me.m01.d10:lemeLI.Gospel2.book_abbr	@ltx/gr_gr_cog/bible:Matthew.abbr
ltx/gr_gr_cog/le.go.me.m01.d10:lemeLI.Gospel2.book_string	@ltx/gr_gr_cog/bible:Matthew.text
ltx/gr_gr_cog/le.go.me.m01.d10:lemeLI.Gospel2.chapverse	4:25 – 5:12
ltx/gr_gr_cog/le.go.me.m01.d10:lemeLI.Gospel2.incipit	Ἠκολούθησαν τῷ Ἰησοῦ ὄχλοι πολλοί…
ltx/gr_gr_cog/le.go.me.m01.d10:lemeLI.Gospel2.text	Τῷ καιρῷ ἐκείνῳ, ἠκολούθησαν τῷ Ἰησοῦ ὄχλοι πολλοὶ ἀπὸ τῆς Γαλιλαίας καὶ Δεκαπόλεως καὶ Ἱεροσολύμων καὶ Ἰουδαίας καὶ πέραν τοῦ Ἰορδάνου. Ἰδὼν δὲ τοὺς ὄχλους ἀνέβη εἰς τὸ ὄρος, καὶ καθίσαντος αὐτοῦ προσῆλθον αὐτῷ οἱ μαθηταὶ αὐτοῦ, καὶ ἀνοίξας τὸ στόμα αὐτοῦ ἐδίδασκεν αὐτοὺς λέγων· Mακάριοι οἱ πτωχοὶ τῷ πνεύματι, ὅτι αὐτῶν ἐστιν ἡ βασιλεία τῶν οὐρανῶν. μακάριοι οἱ πενθοῦντες, ὅτι αὐτοὶ παρακληθήσονται. μακάριοι οἱ πραεῖς, ὅτι αὐτοὶ κληρονομήσουσι τὴν γῆν. μακάριοι οἱ πεινῶντες καὶ διψῶντες τὴν δικαιοσύνην, ὅτι αὐτοὶ χορτασθήσονται. μακάριοι οἱ ἐλεήμονες, ὅτι αὐτοὶ ἐλεηθήσονται. μακάριοι οἱ καθαροὶ τῇ καρδίᾳ, ὅτι αὐτοὶ τὸν Θεὸν ὄψονται. μακάριοι οἱ εἰρηνοποιοί, ὅτι αὐτοὶ υἱοὶ Θεοῦ κληθήσονται. μακάριοι οἱ δεδιωγμένοι ἕνεκεν δικαιοσύνης, ὅτι αὐτῶν ἐστιν ἡ βασιλεία τῶν οὐρανῶν. μακάριοί ἐστε ὅταν ὀνειδίσωσιν ὑμᾶς καὶ διώξωσι καὶ εἴπωσι πᾶν πονηρὸν ῥῆμα καθ᾿ ὑμῶν ψευδόμενοι ἕνεκεν ἐμοῦ. χαίρετε καὶ ἀγαλλιᾶσθε, ὅτι ὁ μισθὸς ὑμῶν πολὺς ἐν τοῖς οὐρανοῖς.
ltx/gr_gr_cog/le.go.me.m01.d10:lemeLI.Gospel2.title	Τοῦ Ἁγίου
ltx/gr_gr_cog/le.go.me.m01.d10:lemeLI.Gospel2.title_abbr	Τοῦ Ἁγίου
ltx/gr_gr_cog/le.go.me.m01.d10:lemeLI.Gospel2.version	@ltx/gr_gr_cog/properties:version.designation
