ltx/gr_gr_cog/le.ep.mc.d204:lemcLI.Epistle.book_abbr	@ltx/gr_gr_cog/bible:Corinthians1.abbr
ltx/gr_gr_cog/le.ep.mc.d204:lemcLI.Epistle.book_string	@ltx/gr_gr_cog/bible:Corinthians1.text
ltx/gr_gr_cog/le.ep.mc.d204:lemcLI.Epistle.chapverse	15:1 – 11
ltx/gr_gr_cog/le.ep.mc.d204:lemcLI.Epistle.incipit	Ἀδελφοί, γνωρίζω ὑμῖν τὸ εὐαγγέλιον…
ltx/gr_gr_cog/le.ep.mc.d204:lemcLI.Epistle.text	Ἀδελφοί, γνωρίζω ὑμῖν τὸ εὐαγγέλιον ὃ εὐηγγελισάμην ὑμῖν, ὃ καὶ παρελάβετε, ἐν ᾧ καὶ ἑστήκατε, δι᾿ οὗ καὶ σῴζεσθε, τίνι λόγῳ εὐηγγελισάμην ὑμῖν εἰ κατέχετε, ἐκτὸς εἰ μὴ εἰκῆ ἐπιστεύσατε. παρέδωκα γὰρ ὑμῖν ἐν πρώτοις ὃ καὶ παρέλαβον, ὅτι Χριστὸς ἀπέθανεν ὑπὲρ τῶν ἁμαρτιῶν ἡμῶν κατὰ τὰς γραφάς, καὶ ὅτι ἐτάφη, καὶ ὅτι ἐγήγερται τῇ τρίτη ἡμέρᾳ κατὰ τὰς γραφάς, καὶ ὅτι ὤφθη Κηφᾷ, εἶτα τοῖς δώδεκα· ἔπειτα ὤφθη ἐπάνω πεντακοσίοις ἀδελφοῖς ἐφάπαξ, ἐξ ὧν οἱ πλείους μένουσιν ἕως ἄρτι, τινὲς δὲ καὶ ἐκοιμήθησαν· ἔπειτα ὤφθη Ἰακώβῳ, εἶτα τοῖς ἀποστόλοις πᾶσιν· ἔσχατον δὲ πάντων ὡσπερεὶ τῷ ἐκτρώματι ὤφθη κἀμοί. ἐγὼ γάρ εἰμι ὁ ἐλάχιστος τῶν ἀποστόλων, ὃς οὐκ εἰμὶ ἱκανὸς καλεῖσθαι ἀπόστολος, διότι ἐδίωξα τὴν ἐκκλησίαν τοῦ Θεοῦ· χάριτι δὲ Θεοῦ εἰμι ὅ εἰμι· καὶ ἡ χάρις αὐτοῦ ἡ εἰς ἐμὲ οὐ κενὴ ἐγενήθη, ἀλλὰ περισσότερον αὐτῶν πάντων ἐκοπίασα, οὐκ ἐγὼ δέ, ἀλλ᾿ ἡ χάρις τοῦ Θεοῦ ἡ σὺν ἐμοί. εἴτε οὖν ἐγὼ εἴτε ἐκεῖνοι, οὕτω κηρύσσομεν καὶ οὕτως ἐπιστεύσατε.
ltx/gr_gr_cog/le.ep.mc.d204:lemcLI.Epistle.title	Κυριακῇ Δωδεκάτῃ
ltx/gr_gr_cog/le.ep.mc.d204:lemcLI.Epistle.title_abbr	Κυριακῇ ΙΒʹ
ltx/gr_gr_cog/le.ep.mc.d204:lemcLI.Epistle.version	@ltx/gr_gr_cog/properties:version.designation
