ltx/gr_gr_cog/sy.m07.d07:cl.syMA.commemoration01.text	[saint/com 1]
ltx/gr_gr_cog/sy.m07.d07:cl.syMA.commemoration02.text	[saint/com 2]
ltx/gr_gr_cog/sy.m07.d07:cl.syMA.commemoration03.text	[saint/com 3]
ltx/gr_gr_cog/sy.m07.d07:cl.syMA.commemoration04.text	[saint/com 4]
ltx/gr_gr_cog/sy.m07.d07:cl.syMA.commemoration05.text	[saint/com 5]
ltx/gr_gr_cog/sy.m07.d07:cl.syMA.commemoration06.text	[saint/com list]
ltx/gr_gr_cog/sy.m07.d07:syMA.commemoration01.couplet1.title	@ltx/gr_gr_cog/titles:ti.Verses
ltx/gr_gr_cog/sy.m07.d07:syMA.commemoration01.couplet1.verse1	Διεὶς πτέρυγας, εἶπεν ἂν Μωσῆς, Πάτερ,
ltx/gr_gr_cog/sy.m07.d07:syMA.commemoration01.couplet1.verse2	Ὡς ἀετὸς τις ἐξανέπτης πρὸς πόλον.
ltx/gr_gr_cog/sy.m07.d07:syMA.commemoration01.narration.p01	Οὗτος ἐν περιφανεῖ καὶ περιβλέπτῳ καὶ στρατιωτικῷ βίῳ πρότερον ἐνδιαπρέψας καὶ πολλὰ καὶ μέγιστα κατὰ βαρβάρων στήσας τρόπαια, ὕστερον τὸν Χριστὸν ποθήσας καὶ ἅπαντα ὡς οὐδὲν λογισάμενος, τὸν ζυγὸν Κυρίου ὑπέδυ τὸν ἐλαφρότατον. Τοσοῦτον δὲ τῷ φερεπόνῳ τῆς ἀρετῆς τοὺς πολλοὺς ὑπερήλασεν, ὡς στῦλος πυρὸς ἐν τῷ προσεύχεσθαι τοῖς πέλας, καὶ τούτων τοῖς εὐδοκιμωτάτοις, διαδείκνυσθαι. Ὅθεν δαίμονας ἐξ ἀνθρώπων ἀποδιώξας καὶ τυφλοὺς ὀμματώσας καὶ χωλοὺς ἀνορθώσας καὶ πηγὴν ὕδατος προσευξάμενος ἀναβλύσαι ποιήσας καὶ ἕτερα θαύματα κατεργασάμενος, ἀνεπαύσατο ἐν Κυρίῳ.
ltx/gr_gr_cog/sy.m07.d07:syMA.commemoration01.single1	Ἑβδομάτῃ Θωμᾶν θάνατος μέλας ἔμφρονα εἷλεν.
ltx/gr_gr_cog/sy.m07.d07:syMA.commemoration01.text	Τῇ Ζʹ τοῦ αὐτοῦ μηνός, Μνήμη τοῦ Ὁσίου Πατρὸς ἡμῶν Θωμᾶ τοῦ ἐν τῷ Μαλεῷ.
ltx/gr_gr_cog/sy.m07.d07:syMA.commemoration02.couplet1.title	@ltx/gr_gr_cog/titles:ti.Verses
ltx/gr_gr_cog/sy.m07.d07:syMA.commemoration02.couplet1.verse1	Κυριακὴ θανοῦσα τὴν τομὴν φθάνει
ltx/gr_gr_cog/sy.m07.d07:syMA.commemoration02.couplet1.verse2	Προαιρέσει, πλὴν καὶ τελειοῦται ξίφει.
ltx/gr_gr_cog/sy.m07.d07:syMA.commemoration02.text	Τῇ αὐτῇ ἡμέρᾳ, Μνήμη τῆς Ἁγίας Μάρτυρος Κυριακῆς.
ltx/gr_gr_cog/sy.m07.d07:syMA.commemoration03.couplet1.title	@ltx/gr_gr_cog/titles:ti.Verses
ltx/gr_gr_cog/sy.m07.d07:syMA.commemoration03.couplet1.verse1	Σὺν ἓξ κατῆλθεν εἰς βυθὸν Περεγρῖνος,
ltx/gr_gr_cog/sy.m07.d07:syMA.commemoration03.couplet1.verse2	Ἀθλήσεως ἐκεῖθεν ἀγρεύσων στέφος.
ltx/gr_gr_cog/sy.m07.d07:syMA.commemoration03.narration.p01	Οὗτοι ὑπῆρχον ἐξ Ἰταλίας· διὰ δὲ τὸν ὑπὸ Τραϊανοῦ γεγονότα διωγμόν, ἐν τῷ Δυῤῥαχίῳ ἔρχονται. Ἐν ᾧ, τὸν Ἅγιον Ἄστειον τὸν Ἐπίσκοπον ἐπὶ σταυροῦ κρεμάμενον ἰδόντες καὶ τοῦτον μακαρίσαντες, συλλαμβάνονται ὑπὸ τῶν ταξιωτῶν· καὶ χριστιανοὺς ἑαυτοὺς ἀνακηρύξαντες, προστάξει τοῦ ἀνθυπάτου Ἀγρικολάου, ἐν τῷ τοῦ Ἀδρία πελάγει ἐῤῥίφησαν· καὶ οὕτω τὸν τοῦ Μαρτυρίου στέφανον ἐκομίσαντο.
ltx/gr_gr_cog/sy.m07.d07:syMA.commemoration03.text	Τῇ αὐτῇ ἡμέρᾳ, Μνήμη τῶν Ἁγίων Μαρτύρων Περεγρίνου καὶ τῶν σὺν αὐτῷ, Λουκιανοῦ, Πομπηΐου, Ἡσυχίου, Παππίου, Σατορνίνου καὶ Γερμανοῦ.
ltx/gr_gr_cog/sy.m07.d07:syMA.commemoration04.couplet1.title	@ltx/gr_gr_cog/titles:ti.Verses
ltx/gr_gr_cog/sy.m07.d07:syMA.commemoration04.couplet1.verse1	Πρὸς εὐστάθειαν καρδίας Εὐσταθίου
ltx/gr_gr_cog/sy.m07.d07:syMA.commemoration04.couplet1.verse2	Καὶ πῦρ συρῖζον ἠρεμοῦν ὤφθη ὕδωρ.
ltx/gr_gr_cog/sy.m07.d07:syMA.commemoration04.couplet2.verse1	Οὕτως ὄναιο σῶν, σφαγεῦ, θελημάτων
ltx/gr_gr_cog/sy.m07.d07:syMA.commemoration04.couplet2.verse2	Σφάττειν τάχει με τὸν Πολύκαρπον θέλων.
ltx/gr_gr_cog/sy.m07.d07:syMA.commemoration04.couplet3.verse1	Εὐάγγελος τὸ θεῖον ἐκ ξίφους τέλος
ltx/gr_gr_cog/sy.m07.d07:syMA.commemoration04.couplet3.verse2	Εὐαγγελισμὸν εἶχε τοῦ θείου στέφους.
ltx/gr_gr_cog/sy.m07.d07:syMA.commemoration04.text	Τῇ αὐτῇ ἡμέρᾳ, Μνήμη τῶν Ἁγίων Μαρτύρων Εὐσταθίου, Πολυκάρπου καὶ Εὐαγγέλου.
ltx/gr_gr_cog/sy.m07.d07:syMA.lastline	Ταῖς αὐτῶν ἁγίαις πρεσβείαις, ὁ Θεός, ἐλέησον ἡμᾶς. Ἀμήν.
