ltx/gr_gr_cog/sy.m01.d28:cl.syMA.commemoration01.narration.p01	
ltx/gr_gr_cog/sy.m01.d28:cl.syMA.commemoration01.narration.p02	
ltx/gr_gr_cog/sy.m01.d28:cl.syMA.commemoration01.narration.p03	
ltx/gr_gr_cog/sy.m01.d28:cl.syMA.commemoration01.narration.p04	
ltx/gr_gr_cog/sy.m01.d28:cl.syMA.commemoration01.narration.p05	
ltx/gr_gr_cog/sy.m01.d28:cl.syMA.commemoration01.narration.p06	
ltx/gr_gr_cog/sy.m01.d28:cl.syMA.commemoration01.narration.p07	
ltx/gr_gr_cog/sy.m01.d28:cl.syMA.commemoration01.text	[saint/com 1]
ltx/gr_gr_cog/sy.m01.d28:cl.syMA.commemoration02.narration.p01	
ltx/gr_gr_cog/sy.m01.d28:cl.syMA.commemoration02.narration.p02	
ltx/gr_gr_cog/sy.m01.d28:cl.syMA.commemoration02.narration.p03	
ltx/gr_gr_cog/sy.m01.d28:cl.syMA.commemoration02.narration.p04	
ltx/gr_gr_cog/sy.m01.d28:cl.syMA.commemoration02.narration.p05	
ltx/gr_gr_cog/sy.m01.d28:cl.syMA.commemoration02.narration.p06	
ltx/gr_gr_cog/sy.m01.d28:cl.syMA.commemoration02.narration.p07	
ltx/gr_gr_cog/sy.m01.d28:cl.syMA.commemoration02.text	[saint/com 2]
ltx/gr_gr_cog/sy.m01.d28:cl.syMA.commemoration03.narration.p01	
ltx/gr_gr_cog/sy.m01.d28:cl.syMA.commemoration03.narration.p02	
ltx/gr_gr_cog/sy.m01.d28:cl.syMA.commemoration03.narration.p03	
ltx/gr_gr_cog/sy.m01.d28:cl.syMA.commemoration03.narration.p04	
ltx/gr_gr_cog/sy.m01.d28:cl.syMA.commemoration03.narration.p05	
ltx/gr_gr_cog/sy.m01.d28:cl.syMA.commemoration03.narration.p06	
ltx/gr_gr_cog/sy.m01.d28:cl.syMA.commemoration03.narration.p07	
ltx/gr_gr_cog/sy.m01.d28:cl.syMA.commemoration03.text	[saint/com 3]
ltx/gr_gr_cog/sy.m01.d28:cl.syMA.commemoration04.narration.p01	
ltx/gr_gr_cog/sy.m01.d28:cl.syMA.commemoration04.narration.p02	
ltx/gr_gr_cog/sy.m01.d28:cl.syMA.commemoration04.narration.p03	
ltx/gr_gr_cog/sy.m01.d28:cl.syMA.commemoration04.narration.p04	
ltx/gr_gr_cog/sy.m01.d28:cl.syMA.commemoration04.narration.p05	
ltx/gr_gr_cog/sy.m01.d28:cl.syMA.commemoration04.narration.p06	
ltx/gr_gr_cog/sy.m01.d28:cl.syMA.commemoration04.narration.p07	
ltx/gr_gr_cog/sy.m01.d28:cl.syMA.commemoration04.text	[saint/com 4]
ltx/gr_gr_cog/sy.m01.d28:cl.syMA.commemoration05.narration.p01	
ltx/gr_gr_cog/sy.m01.d28:cl.syMA.commemoration05.narration.p02	
ltx/gr_gr_cog/sy.m01.d28:cl.syMA.commemoration05.narration.p03	
ltx/gr_gr_cog/sy.m01.d28:cl.syMA.commemoration05.narration.p04	
ltx/gr_gr_cog/sy.m01.d28:cl.syMA.commemoration05.narration.p05	
ltx/gr_gr_cog/sy.m01.d28:cl.syMA.commemoration05.narration.p06	
ltx/gr_gr_cog/sy.m01.d28:cl.syMA.commemoration05.narration.p07	
ltx/gr_gr_cog/sy.m01.d28:cl.syMA.commemoration05.text	[saint/com 5]
ltx/gr_gr_cog/sy.m01.d28:cl.syMA.commemoration06.text	[saint/com list]
ltx/gr_gr_cog/sy.m01.d28:syMA.commemoration01.couplet1.title	@ltx/gr_gr_cog/titles:ti.Verses
ltx/gr_gr_cog/sy.m01.d28:syMA.commemoration01.couplet1.verse1	Ἤκουσε γλῶτταν ψαλμικῶς, ἣν οὐκ ἔγνω,
ltx/gr_gr_cog/sy.m01.d28:syMA.commemoration01.couplet1.verse2	Ἐφραίμ, ἄνω καλοῦσαν, ὁ γλῶσσαν Σῦρος.
ltx/gr_gr_cog/sy.m01.d28:syMA.commemoration01.narration.p01	Οὗτος γέγονεν ἐξ Ἀνατολῶν, Σύρος τὸ γένος, ἐκ προγόνων τὴν εὐσέβειαν διδαχθείς, ἐν τοῖς χρόνοις Θεοδοσίου τοῦ µεγάλου. Ἠσπάσατο δὲ ἐξ ἀρχῆς τὸν µοναχικὸν βίον· ᾧ λέγεται θεόθεν ἐκχυθῆναι χάρις, διʼ ἧς πάσης κατανύξεως πλεῖστα συγγράµµατα ἐκτεθεικώς, πολλοὺς πρὸς ἀρετὴν καθωδήγησε, καὶ τύπος τοῖς ἐφεξῆς ἀσκητικῆς γέγονεν ἀρετῆς. Τελεῖται δὲ ἡ αὐτοῦ Σύναξις ἐν τῷ Μαρτυρίῳ τῆς Ἁγίας Ἀκυλίνης, ἐν τῷ Φιλοξένῳ, πλησίον τοῦ φόρου.
ltx/gr_gr_cog/sy.m01.d28:syMA.commemoration01.single1	Εἰκάδι ὀγδοάτῃ Νόες Ἐφραὶμ θυμὸν ἀπηῦρον.
ltx/gr_gr_cog/sy.m01.d28:syMA.commemoration01.text	Τῇ ΚΗʹ τοῦ αὐτοῦ μηνός, μνήμη τοῦ Ὁσίου Πατρὸς ἡμῶν Ἐφραὶμ τοῦ Σύρου.
ltx/gr_gr_cog/sy.m01.d28:syMA.commemoration02.couplet1.title	@ltx/gr_gr_cog/titles:ti.Verses
ltx/gr_gr_cog/sy.m01.d28:syMA.commemoration02.couplet1.verse1	Κρείττων ὑπάρξας σαρκικῶν σκιρτημάτων,
ltx/gr_gr_cog/sy.m01.d28:syMA.commemoration02.couplet1.verse2	Σκιρτᾷ παρʼ αὐτῷ Παλλάδιος τῷ πόλῳ.
ltx/gr_gr_cog/sy.m01.d28:syMA.commemoration02.narration.p01	Οὗτος ὁ µακάριος, ἐν ὄρει τινὶ οἰκίσκον βραχὺν δειµάµενος, ἐν τούτῳ ἑαυτὸν καθεῖρξεν. Ἀγρυπνίᾳ δὲ καὶ διηνεκεῖ προσευχῇ καὶ νηστείᾳ τὸν ἑαυτοῦ βίον κατακοσµήσας, θαυµάτων χάριν θεόθεν ἔλαβεν. Ἐµπόρου γάρ τινος, χρυσίον ἐπιφεροµένου πολύ, καὶ ὑπὸ ἀνδροφόνου τινὸς ἀναιρεθέντος, παρὰ τὴν θύραν τοῦ Ἁγίου τῆς κέλλης ὁ νεκρὸς προσεῤῥίφη. Ὡς δὲ ἡµέρα ἐγένετο, καὶ φανερὸν τὸ πραχθέν ἦν, πάντες εὐθύνας τὸν Ὅσιον τῆς τοῦ ἐµπόρου σφαγῆς εἰσέπραττον. Περιστοιχηθεὶς οὖν ὑπὸ τῆς τοσαύτης πληθύος, προσηύξατο, καὶ τὸν νεκρὸν ἀνέστησεν. Ὁ δέ, ἀναστάς, τὸν φονέα ὑπέδειξε, καὶ τὸν Ὅσιον τοῦ µίσους ἀµέτοχον εἶπεν εἶναι. Οὐ τοῦτο δὲ µόνον, ἀλλὰ καὶ ἕτερα πλεῖστα ὁ Ὅσιος πεποιηκὼς καὶ ἐπὶ πλεῖον θαυµαστωθεὶς ἐπὶ τῶν τῆς ἀρετῆς ἔργων, ἐν εἰρήνῃ πρὸς τὸν Θεὸν µεταβέβηκεν, ἀξιοµνηµόνευτα συγγράµµατα τῇ Ἐκκλησίᾳ καταλελοιπώς, εἰς τὴν τῶν ἐντυγχανόντων ὠφέλειαν.
ltx/gr_gr_cog/sy.m01.d28:syMA.commemoration02.text	Τῇ αὐτῇ ἡμέρᾳ, μνήμη τοῦ Ὁσίου Πατρὸς ἡμῶν Παλλαδίου.
ltx/gr_gr_cog/sy.m01.d28:syMA.commemoration03.couplet1.title	@ltx/gr_gr_cog/titles:ti.Verses
ltx/gr_gr_cog/sy.m01.d28:syMA.commemoration03.couplet1.verse1	Ἀπῆλθε σαρκός, ὥσπερ ἒκ τινος πάγης,
ltx/gr_gr_cog/sy.m01.d28:syMA.commemoration03.couplet1.verse2	Ὁ σαρκός, Ἰάκωβος οὐχ ἁλοὺς πάγαις.
ltx/gr_gr_cog/sy.m01.d28:syMA.commemoration03.narration.p01	Οὗτος ὁ Ὅσιος, τοῖς πᾶσιν ἀποταξάµενος βιωτικοῖς, ᾤκησεν ἔν τινι σπηλαίῳ ἔτη πεντεκαίδεκα, πλησίον κωµοπόλεώς τινος, καλουµένης Πορφυριώνης, πᾶσαν ἄσκησιν µετερχόµενος. Τούτῳ ποτὲ τῷ Ὁσίῳ, γύναιον ἑταιρικὸν ὑπό τινων ἀκολάστων ὑποβληθέν, αἰσχρῶς τε ἐπιπηδῆσαν, εἰς ἀσέλγειαν ἐξεκαλεῖτο. Ὅς, τούτῳ τῷ γυναίῳ τοῦ µέλλοντος πυρὸς ὑποµνήσας τὴν τιµωρίαν, τῷ Χριστῷ προσάγει µεταγνοῦν. Ἐπεὶ δὲ οὐδεὶς διαφεύγει τοῦ πονηροῦ τὰς ἐνέδρας, συνέβη καὶ τοῦτον µεγάλῳ πτώµατι, περιπεσεῖν, ἵνα ὑποτύπωσις γένηται πᾶσι τοῖς ἁµαρτάνουσι, καὶ ὁδηγὸς πρὸς µετάνοιαν.
ltx/gr_gr_cog/sy.m01.d28:syMA.commemoration03.narration.p02	Ἀνὴρ γάρ τις τῶν ἐνδόξων, θυγάτριον ὑπὸ δαίµονος ἐνοχλούµενον ἔχων, τῷ Ὁσίῳ πρὸς αὐτοῦ θεραπευθησόµενον προσάγει. Ὃς εὐξάµενος, παραχρῆµα τοῦ δαίµονος ἐλευθεροῖ τοῦτο. Φοβηθέντος δὲ τοῦ πατρός, µήποτε πάλιν ὁ δαίµων ἐνοχλήσῃ τῇ κόρῃ, αὐτὴν σὺν ἀδελφῷ κοµιδῇ νέῳ, πρὸς τῷ σπηλαίῳ τοῦ Μοναχοῦ καταλιµπάνει. Ἥττων δὲ ὁ Μοναχὸς ἐπιθυµίας γενόµενος, φεῦ τοῦ πτώµατος! διαφθείρει τὴν κόρην. Εἶτα τί γίνεται· ἵνα µὴ ἔκφορος ἡ µυσαρὰ πρᾶξις γένηται, κτείνει µὲν τὴν γυναῖκα, κτείνει δὲ καὶ τὸν ἀδελφόν· τὰ δὲ σώµατα ἐν τῷ παραῤῥέοντι ποταµῷ προσεπιῤῥίπτει.
ltx/gr_gr_cog/sy.m01.d28:syMA.commemoration03.narration.p03	Ὡς δὲ παντελῶς τῆς ἑαυτοῦ σωτηρίας ἀπέγνω, ὥρµησεν εἰς τὸν κόσµον ἀπελθεῖν. Ὅθεν, ἀπιόντος αὐτοῦ κατὰ τὴν ὁδόν, συνήντησεν αὐτῷ Μοναχός τις τῶν εὐλαβῶν· οὗ ταῖς παραινέσεσιν ὁ Ὅσιος εἴξας, ἑαυτὸν εἰς τάφον ἐνέβαλε, πᾶσαν σκληραγωγίαν ὑποµένων. Αὐχµοῦ δέ ποτε κατὰ τὴν χώραν γενοµένου, τῷ Ἐπισκόπῳ τῆς πόλεως ὁ Θεὸς ἐπισκήπτει, ὡς εἰµὴ Ἰάκωβος, ὁ εἰς τὸν τάφον ὤν, προσεύξηται, ὁ αὐχµὸς οὐ λυθήσεται. Τότε δὴ πρὸς αὐτὸν πανδηµεὶ παραγενόµενος ὁ Ἐπίσκοπος, καὶ πολλὰ παρακαλέσας, ἐπεὶ πεισθεὶς προσηύξατο ὁ µακάριος, ὄµβρος κατεῤῥύη πολύς, καὶ τὴν γῆν ἐµέθυσεν. Ἐντεῦθεν χρηστὰς λαβὼν τὰς ἐλπίδας ὁ Ὅσιος, τεκµήριον µέγιστον τὴν τῶν ὄµβρων φορὰν ἐσχηκώς, προσέθηκε τῇ σκληραγωγίᾳ σκληραγωγίαν, καὶ τοῖς δάκρυσι δάκρυα· καὶ οὕτως ἐν πολιτείᾳ καλῇ τὸ πνεῦµα αὐτοῦ τῷ Θεῷ παρέθετο.
ltx/gr_gr_cog/sy.m01.d28:syMA.commemoration03.text	Τῇ αὐτῇ ἡμέρᾳ, μνήμη τοῦ Ὁσίου Πατρὸς ἡμῶν Ἰακώβου τοῦ Ἀσκητοῦ.
ltx/gr_gr_cog/sy.m01.d28:syMA.commemoration04.couplet1.title	@ltx/gr_gr_cog/titles:ti.Verses
ltx/gr_gr_cog/sy.m01.d28:syMA.commemoration04.couplet1.verse1	Τῇ παιδὶ συγκλίνασα μήτηρ τὴν κάραν,
ltx/gr_gr_cog/sy.m01.d28:syMA.commemoration04.couplet1.verse2	Ξίφει συνεξέπνευσε τῷ θυγατρίῳ.
ltx/gr_gr_cog/sy.m01.d28:syMA.commemoration04.text	Τῇ αὐτῇ ἡμέρᾳ, αἱ Ἅγιαι δύο Μάρτυρες, μήτηρ καὶ θυγάτηρ, ξίφει τελειοῦνται.
ltx/gr_gr_cog/sy.m01.d28:syMA.commemoration05.couplet1.title	@ltx/gr_gr_cog/titles:ti.Verses
ltx/gr_gr_cog/sy.m01.d28:syMA.commemoration05.couplet1.verse1	Πόδας Χάρις τμηθεῖσα, πρὸς Θεὸν τρέχει∙
ltx/gr_gr_cog/sy.m01.d28:syMA.commemoration05.couplet1.verse2	Τοὺς ψυχικοὺς γὰρ οὐ συνετμήθη πόδας.
ltx/gr_gr_cog/sy.m01.d28:syMA.commemoration05.text	Τῇ αὐτῇ ἡμέρᾳ, ἡ Ἁγία Μάρτυς Χάρις, τοὺς πόδας ἐκκοπεῖσα, τελειοῦται.
ltx/gr_gr_cog/sy.m01.d28:syMA.lastline	Ταῖς τῶν Ἁγίων σου πρεσβείαις, ὁ Θεὸς ἐλεήσον ἡμᾶς. Ἀμήν.
