ltx/gr_gr_cog/me.m06.d07:meDA.commemoration.first	Μνήμη τοῦ Ἁγίου Ἱερομάρτυρος Θεοδότου Ἀγκύρας
ltx/gr_gr_cog/me.m06.d07:meDA.commemoration.first_name	
ltx/gr_gr_cog/me.m06.d07:meDA.commemoration.first_short	Μνήμη τοῦ Ἁγίου Ἱερομάρτυρος Θεοδότου Ἀγκύρας
ltx/gr_gr_cog/me.m06.d07:meDA.commemoration.first_title	@ltx/gr_gr_cog/titles:ti.SaintM
ltx/gr_gr_cog/me.m06.d07:meDA.commemoration.full	Μνήμη τοῦ Ἁγίου Ἱερομάρτυρος Θεοδότου Ἀγκύρας
ltx/gr_gr_cog/me.m06.d07:meDA.commemoration.second_name	
ltx/gr_gr_cog/me.m06.d07:meDA.commemoration.second_title	
ltx/gr_gr_cog/me.m06.d07:meDA.date	Τῌ Ζʹ ΙΟΥΝΙΟΥ
ltx/gr_gr_cog/me.m06.d07:meDA.dismissal	
ltx/gr_gr_cog/me.m06.d07:meDA.fordate	διὰ τὴν 7ην Ἰουνίου
ltx/gr_gr_cog/me.m06.d07:meDA.insert1	καὶ τοῦ Ἁγίου Ἱερομάρτυρος Θεοδότου Ἀγκύρας,
ltx/gr_gr_cog/me.m06.d07:meDA.insert2	οὗ καὶ τὴν μνήμην ἐπιτελοῦμεν·
ltx/gr_gr_cog/me.m06.d07:meDA.note	
ltx/gr_gr_cog/me.m06.d07:meDA.pdfcoverdate	τῆς 7ης Ἰουνίου,
ltx/gr_gr_cog/me.m06.d07:meDA.pdfheaderdate	τῆς 7ης Ἰουνίου
ltx/gr_gr_cog/me.m06.d07:meHO.commemorations	
ltx/gr_gr_cog/me.m06.d07:meHO.note1	
ltx/gr_gr_cog/me.m06.d07:meHO.note2	
ltx/gr_gr_cog/me.m06.d07:meHO.number	
ltx/gr_gr_cog/me.m06.d07:meHO.rank	
ltx/gr_gr_cog/me.m06.d07:meLE.commemoration1	Μνήμη τοῦ Ἁγίου Ἱερομάρτυρος Θεοδότου Ἀγκύρας.
ltx/gr_gr_cog/me.m06.d07:meLE.commemoration2	
ltx/gr_gr_cog/me.m06.d07:meLI.Kontakion1.incipit	…
ltx/gr_gr_cog/me.m06.d07:meLI.Kontakion1.melody	
ltx/gr_gr_cog/me.m06.d07:meLI.Kontakion1.mode	
ltx/gr_gr_cog/me.m06.d07:meLI.Kontakion1.text	
ltx/gr_gr_cog/me.m06.d07:meLI.MM.CommunionHymn.text	@ltx/gr_gr_cog/properties:media.key
ltx/gr_gr_cog/me.m06.d07:meLI.Megalynarion.text	
ltx/gr_gr_cog/me.m06.d07:meMA.C1.acrostic.notice1	οὗ ἡ Ἀκροστιχίς·
ltx/gr_gr_cog/me.m06.d07:meMA.C1.acrostic.text	Θεοῦ δόσις πέφυκας εἰκότως μάκαρ. Ἰωσ(ή)φ.
ltx/gr_gr_cog/me.m06.d07:meMA.C1.acrostic.title	Κανὼν τοῦ Ἁγίου,
ltx/gr_gr_cog/me.m06.d07:meMA.C1.title	@ltx/gr_gr_cog/titles:ti.CanonSaintM
ltx/gr_gr_cog/me.m06.d07:meMA.C1.verse	@ltx/gr_gr_cog/prayers:pr.verse_SaintM.text
ltx/gr_gr_cog/me.m06.d07:meMA.Ode1C11.greekmelody	@ltx/gr_gr_cog/he.h.m6:heHE.OsEnIpeiroPezefsas.greekname
ltx/gr_gr_cog/me.m06.d07:meMA.Ode1C11.incipit	Θεολαμπῆ σε ἀστέρα ὁ νοητός…
ltx/gr_gr_cog/me.m06.d07:meMA.Ode1C11.melody	@ltx/gr_gr_cog/he.h.m6:heHE.OsEnIpeiroPezefsas.name
ltx/gr_gr_cog/me.m06.d07:meMA.Ode1C11.mode	@ltx/gr_gr_cog/miscellanea:misc.Mode6
ltx/gr_gr_cog/me.m06.d07:meMA.Ode1C11.ode	@ltx/gr_gr_cog/miscellanea:misc.Ode1
ltx/gr_gr_cog/me.m06.d07:meMA.Ode1C11.text	Θεολαμπῆ σε ἀστέρα ὁ νοητός, ἀναδείξας ἥλιος, ἐν τῷ ὕψει τῆς αὐτοῦ, Ἐκκλησίας ἅπασαν τὴν γῆν, ἀστραπαῖς Μάκαρ τῶν σῶν ἄθλων ἐφαίδρυνεν.
ltx/gr_gr_cog/me.m06.d07:meMA.Ode1C12.incipit	Ἐκ νεαρᾶς ἡλικίας ἀνατεθείς, τῷ…
ltx/gr_gr_cog/me.m06.d07:meMA.Ode1C12.melody	@ltx/gr_gr_cog/he.h.m6:heHE.OsEnIpeiroPezefsas.name
ltx/gr_gr_cog/me.m06.d07:meMA.Ode1C12.mode	@ltx/gr_gr_cog/miscellanea:misc.Mode6
ltx/gr_gr_cog/me.m06.d07:meMA.Ode1C12.ode	@ltx/gr_gr_cog/miscellanea:misc.Ode1
ltx/gr_gr_cog/me.m06.d07:meMA.Ode1C12.text	Ἐκ νεαρᾶς ἡλικίας ἀνατεθείς, τῷ Θεῷ Θεόδοτε, θεοδότοις ἀρεταῖς, τὴν ψυχὴν ἐλάμπρυνας σαφῶς, καὶ τὸν κόσμον τοῖς σεπτοῖς ἄθλοις ἐφαίδρυνας.
ltx/gr_gr_cog/me.m06.d07:meMA.Ode1C13.incipit	Ὁ περιώνυμος Μάρτυς κατανοῶν, τὰ…
ltx/gr_gr_cog/me.m06.d07:meMA.Ode1C13.melody	@ltx/gr_gr_cog/he.h.m6:heHE.OsEnIpeiroPezefsas.name
ltx/gr_gr_cog/me.m06.d07:meMA.Ode1C13.mode	@ltx/gr_gr_cog/miscellanea:misc.Mode6
ltx/gr_gr_cog/me.m06.d07:meMA.Ode1C13.ode	@ltx/gr_gr_cog/miscellanea:misc.Ode1
ltx/gr_gr_cog/me.m06.d07:meMA.Ode1C13.text	Ὁ περιώνυμος Μάρτυς κατανοῶν, τὰ τῆς πλάνης δίκτυα, ἐφαπλούμενα ἐν γῇ, πανταχοῦ διήρχετο ψυχάς, διδαχαῖς τῶν εὐσεβῶν στηρίζων χάριτι.
ltx/gr_gr_cog/me.m06.d07:meMA.Ode1C1T.incipit	Ὑπερβολῇ εὐσπλαγχνίας τοὺς οὐρανούς, κλίνας…
ltx/gr_gr_cog/me.m06.d07:meMA.Ode1C1T.melody	@ltx/gr_gr_cog/he.h.m6:heHE.OsEnIpeiroPezefsas.name
ltx/gr_gr_cog/me.m06.d07:meMA.Ode1C1T.mode	@ltx/gr_gr_cog/miscellanea:misc.Mode6
ltx/gr_gr_cog/me.m06.d07:meMA.Ode1C1T.ode	@ltx/gr_gr_cog/miscellanea:misc.Ode1
ltx/gr_gr_cog/me.m06.d07:meMA.Ode1C1T.text	Ὑπερβολῇ εὐσπλαγχνίας τοὺς οὐρανούς, κλίνας καταβέβηκεν, ὁ Υἱὸς ὁ τοῦ Θεοῦ, καὶ ἐκ σοῦ σεσάρκωται Ἁγνή, διασῴζων τοὺς βροτοὺς πλάνης τοῦ ὄφεως.
ltx/gr_gr_cog/me.m06.d07:meMA.Ode3C11.greekmelody	@ltx/gr_gr_cog/he.h.m6:heHE.OukEstinAgios.greekname
ltx/gr_gr_cog/me.m06.d07:meMA.Ode3C11.incipit	Διόλου νεύων πρὸς Θεόν, ὀφθαλμοῖς…
ltx/gr_gr_cog/me.m06.d07:meMA.Ode3C11.melody	@ltx/gr_gr_cog/he.h.m6:heHE.OukEstinAgios.name
ltx/gr_gr_cog/me.m06.d07:meMA.Ode3C11.mode	@ltx/gr_gr_cog/miscellanea:misc.Mode6
ltx/gr_gr_cog/me.m06.d07:meMA.Ode3C11.ode	@ltx/gr_gr_cog/miscellanea:misc.Ode3
ltx/gr_gr_cog/me.m06.d07:meMA.Ode3C11.text	Διόλου νεύων πρὸς Θεόν, ὀφθαλμοῖς διανοίας, παναοίδιμε Μάρτυς, οὐκ ᾐσθάνου ταῖς πληγαῖς τοῦ σώματος ὁμιλῶν, καὶ βασάνοις, πάντοθεν κυκλούμενος.
ltx/gr_gr_cog/me.m06.d07:meMA.Ode3C12.incipit	Οὐδόλως Μάρτυς προσβολαῖς, ἀλγεινῶν ἐσαλεύθης…
ltx/gr_gr_cog/me.m06.d07:meMA.Ode3C12.melody	@ltx/gr_gr_cog/he.h.m6:heHE.OukEstinAgios.name
ltx/gr_gr_cog/me.m06.d07:meMA.Ode3C12.mode	@ltx/gr_gr_cog/miscellanea:misc.Mode6
ltx/gr_gr_cog/me.m06.d07:meMA.Ode3C12.ode	@ltx/gr_gr_cog/miscellanea:misc.Ode3
ltx/gr_gr_cog/me.m06.d07:meMA.Ode3C12.text	Οὐδόλως Μάρτυς προσβολαῖς, ἀλγεινῶν ἐσαλεύθης, οὐ θωπείαις ἀνόμων, ἐπὶ πέτραν ἀσφαλῆ, τῆς πίστεως τοῦ Χριστοῦ, ἡδρασμένος, ἔνδοξε Θεόδοτε.
ltx/gr_gr_cog/me.m06.d07:meMA.Ode3C13.incipit	Συντρίβει σῶμα ταῖς πολλαῖς, ὁ…
ltx/gr_gr_cog/me.m06.d07:meMA.Ode3C13.melody	@ltx/gr_gr_cog/he.h.m6:heHE.OukEstinAgios.name
ltx/gr_gr_cog/me.m06.d07:meMA.Ode3C13.mode	@ltx/gr_gr_cog/miscellanea:misc.Mode6
ltx/gr_gr_cog/me.m06.d07:meMA.Ode3C13.ode	@ltx/gr_gr_cog/miscellanea:misc.Ode3
ltx/gr_gr_cog/me.m06.d07:meMA.Ode3C13.text	Συντρίβει σῶμα ταῖς πολλαῖς, ὁ διώκτης αἰκίαις, οὐκ ἰσχύει δὲ ὅλως, σοῦ τὸν τόνον τῆς ψυχῆς, χαυνῶσαι θείᾳ στοργῇ, τοῦ Σωτῆρος, Μάκαρ κρατυνόμενον.
ltx/gr_gr_cog/me.m06.d07:meMA.Ode3C1T.incipit	Ἰδών σου πόῤῥωθεν χορός, Προφητῶν…
ltx/gr_gr_cog/me.m06.d07:meMA.Ode3C1T.melody	@ltx/gr_gr_cog/he.h.m6:heHE.OukEstinAgios.name
ltx/gr_gr_cog/me.m06.d07:meMA.Ode3C1T.mode	@ltx/gr_gr_cog/miscellanea:misc.Mode6
ltx/gr_gr_cog/me.m06.d07:meMA.Ode3C1T.ode	@ltx/gr_gr_cog/miscellanea:misc.Ode3
ltx/gr_gr_cog/me.m06.d07:meMA.Ode3C1T.text	Ἰδών σου πόῤῥωθεν χορός, Προφητῶν θεηγόρων, μυστηρίου τὸ βάθος, πολυτρόποις ἐν φωναῖς, Θεοῦ Μητέρα ἁγνή, σὲ κηρύττει, πάναγνε Θεόνυμφε.
ltx/gr_gr_cog/me.m06.d07:meMA.Ode3H.greekmelody	@ltx/gr_gr_cog/he.h.m6:heHE.OukEstinAgios.greekname
ltx/gr_gr_cog/me.m06.d07:meMA.Ode3H.incipit	@ltx/gr_gr_cog/he.h.m6:heHE.OukEstinAgios.incipit
ltx/gr_gr_cog/me.m06.d07:meMA.Ode3H.melody	@ltx/gr_gr_cog/he.h.m6:heHE.OukEstinAgios.melody
ltx/gr_gr_cog/me.m06.d07:meMA.Ode3H.mode	@ltx/gr_gr_cog/miscellanea:misc.Mode6
ltx/gr_gr_cog/me.m06.d07:meMA.Ode3H.ode	@ltx/gr_gr_cog/miscellanea:misc.Ode3
ltx/gr_gr_cog/me.m06.d07:meMA.Ode3H.text	@ltx/gr_gr_cog/he.h.m6:heHE.OukEstinAgios.text
ltx/gr_gr_cog/me.m06.d07:meMA.Ode3Kathisma1.greekmelody	@ltx/gr_gr_cog/he.a.m1:heAU.TonTafonSouSotir.greekname
ltx/gr_gr_cog/me.m06.d07:meMA.Ode3Kathisma1.incipit	Πολύφωτος ἀστήρ, δᾳδουχίαις θαυμάτων, καὶ…
ltx/gr_gr_cog/me.m06.d07:meMA.Ode3Kathisma1.melody	@ltx/gr_gr_cog/he.a.m1:heAU.TonTafonSouSotir.name
ltx/gr_gr_cog/me.m06.d07:meMA.Ode3Kathisma1.mode	@ltx/gr_gr_cog/miscellanea:misc.Mode1
ltx/gr_gr_cog/me.m06.d07:meMA.Ode3Kathisma1.text	Πολύφωτος ἀστήρ, δᾳδουχίαις θαυμάτων, καὶ ἄθλων ἱερῶν, καταυγάζων τὴν κτίσιν, Θεόδοτε μακάριε, ἀληθῶς ἐχρημάτισας· ὅθεν σήμερον, τὴν φωτοφόρον σου μνήμην, ἑορτάζομεν, ἐν κατανύξει καρδίας, Χριστὸν μεγαλύνοντες.
ltx/gr_gr_cog/me.m06.d07:meMA.Ode3KathismaSt.incipit	@ltx/gr_gr_cog/me.m03.d18:meMA.Ode3KathismaSt.incipit
ltx/gr_gr_cog/me.m06.d07:meMA.Ode3KathismaSt.melody	@ltx/gr_gr_cog/he.a.m1:heAU.TonTafonSouSotir.name
ltx/gr_gr_cog/me.m06.d07:meMA.Ode3KathismaSt.mode	@ltx/gr_gr_cog/miscellanea:misc.Mode1
ltx/gr_gr_cog/me.m06.d07:meMA.Ode3KathismaSt.text	@ltx/gr_gr_cog/me.m03.d18:meMA.Ode3KathismaSt.text
ltx/gr_gr_cog/me.m06.d07:meMA.Ode3KathismaT.incipit	Μητέρα σε Θεοῦ, ἐπιστάμεθα πάντες…
ltx/gr_gr_cog/me.m06.d07:meMA.Ode3KathismaT.melody	@ltx/gr_gr_cog/he.a.m1:heAU.TonTafonSouSotir.name
ltx/gr_gr_cog/me.m06.d07:meMA.Ode3KathismaT.mode	@ltx/gr_gr_cog/miscellanea:misc.Mode1
ltx/gr_gr_cog/me.m06.d07:meMA.Ode3KathismaT.text	Μητέρα σε Θεοῦ, ἐπιστάμεθα πάντες, Παρθένον ἀληθῶς, καὶ μετὰ τόκον φανεῖσαν, οἱ πόθῳ καταφεύγοντες, πρὸς τὴν σὴν ἀγαθότητα· σὲ γὰρ ἔχομεν, ἁμαρτωλοὶ προστασίαν, σὲ κεκτήμεθα, ἐν πειρασμοῖς σωτηρίαν, τὴν μόνην πανάμωμον.
ltx/gr_gr_cog/me.m06.d07:meMA.Ode4C11.greekmelody	@ltx/gr_gr_cog/he.h.m6:heHE.ChristosMouDynamis.greekname
ltx/gr_gr_cog/me.m06.d07:meMA.Ode4C11.incipit	Σοφίᾳ λόγων σου, καὶ ἔργων…
ltx/gr_gr_cog/me.m06.d07:meMA.Ode4C11.melody	@ltx/gr_gr_cog/he.h.m6:heHE.ChristosMouDynamis.name
ltx/gr_gr_cog/me.m06.d07:meMA.Ode4C11.mode	@ltx/gr_gr_cog/miscellanea:misc.Mode6
ltx/gr_gr_cog/me.m06.d07:meMA.Ode4C11.ode	@ltx/gr_gr_cog/miscellanea:misc.Ode4
ltx/gr_gr_cog/me.m06.d07:meMA.Ode4C11.text	Σοφίᾳ λόγων σου, καὶ ἔργων χάριτι, τὸν τοῦ σκότους προστάτην περιφανῶς, ᾔσχυνας Θεόδοτε, καὶ νίκην ἦρας κατʼ αὐτοῦ, εὐκλεῶς ἀγωνισάμενος.
ltx/gr_gr_cog/me.m06.d07:meMA.Ode4C12.incipit	Πυρὶ τῶν ἄθλων σου, σαφῶς…
ltx/gr_gr_cog/me.m06.d07:meMA.Ode4C12.melody	@ltx/gr_gr_cog/he.h.m6:heHE.ChristosMouDynamis.name
ltx/gr_gr_cog/me.m06.d07:meMA.Ode4C12.mode	@ltx/gr_gr_cog/miscellanea:misc.Mode6
ltx/gr_gr_cog/me.m06.d07:meMA.Ode4C12.ode	@ltx/gr_gr_cog/miscellanea:misc.Ode4
ltx/gr_gr_cog/me.m06.d07:meMA.Ode4C12.text	Πυρὶ τῶν ἄθλων σου, σαφῶς ἐνέπρησας, τὴν πολύθεον πλάνην καὶ ὡς λαμπάς, ἐν Ἁγίῳ Πνεύματι, Μάρτυς ἀνάψας μυστικῶς, τὴν ὑφήλιον ἐφώτισας.
ltx/gr_gr_cog/me.m06.d07:meMA.Ode4C13.incipit	Εὐτόνως ἔνδοξε, πλευρὰς ξεόμενος, καὶ…
ltx/gr_gr_cog/me.m06.d07:meMA.Ode4C13.melody	@ltx/gr_gr_cog/he.h.m6:heHE.ChristosMouDynamis.name
ltx/gr_gr_cog/me.m06.d07:meMA.Ode4C13.mode	@ltx/gr_gr_cog/miscellanea:misc.Mode6
ltx/gr_gr_cog/me.m06.d07:meMA.Ode4C13.ode	@ltx/gr_gr_cog/miscellanea:misc.Ode4
ltx/gr_gr_cog/me.m06.d07:meMA.Ode4C13.text	Εὐτόνως ἔνδοξε, πλευρὰς ξεόμενος, καὶ σφοδραῖς ἀλγηδόσιν ὡς ἀληθῶς, πάντοθεν κυκλούμενος, ἀπαρασάλευτος τὸν νοῦν, ἐγνωρίσθης διὰ πίστεως.
ltx/gr_gr_cog/me.m06.d07:meMA.Ode4C1T.incipit	Φυλάξας ἄφθορον, σὲ μετὰ κύησιν…
ltx/gr_gr_cog/me.m06.d07:meMA.Ode4C1T.melody	@ltx/gr_gr_cog/he.h.m6:heHE.ChristosMouDynamis.name
ltx/gr_gr_cog/me.m06.d07:meMA.Ode4C1T.mode	@ltx/gr_gr_cog/miscellanea:misc.Mode6
ltx/gr_gr_cog/me.m06.d07:meMA.Ode4C1T.ode	@ltx/gr_gr_cog/miscellanea:misc.Ode4
ltx/gr_gr_cog/me.m06.d07:meMA.Ode4C1T.text	Φυλάξας ἄφθορον, σὲ μετὰ κύησιν, ὡς πρὸ τόκου Παρθένον ὁ πλαστουργός, ᾤκησεν ἐν μήτρᾳ σου, καὶ τοὺς φθαρέντας τῇ πλάνῃ, ἐκαινούργησεν ὡς εὔσπλαγχνος.
ltx/gr_gr_cog/me.m06.d07:meMA.Ode5C11.greekmelody	@ltx/gr_gr_cog/he.h.m6:heHE.ToTheioFengeiSou.greekname
ltx/gr_gr_cog/me.m06.d07:meMA.Ode5C11.incipit	Ὑπομονῇ σου Μάρτυς σοφέ, τῶν…
ltx/gr_gr_cog/me.m06.d07:meMA.Ode5C11.melody	@ltx/gr_gr_cog/he.h.m6:heHE.ToTheioFengeiSou.name
ltx/gr_gr_cog/me.m06.d07:meMA.Ode5C11.mode	@ltx/gr_gr_cog/miscellanea:misc.Mode6
ltx/gr_gr_cog/me.m06.d07:meMA.Ode5C11.ode	@ltx/gr_gr_cog/miscellanea:misc.Ode5
ltx/gr_gr_cog/me.m06.d07:meMA.Ode5C11.text	Ὑπομονῇ σου Μάρτυς σοφέ, τῶν παρανομούντων τὰς ὁρμάς, καὶ τῶν βασάνων τὴν κάκωσιν, καὶ τὰς πυρακτώσεις σαφῶς ὑπήνεγκας, τῇ θείᾳ συμμαχίᾳ περιφραττόμενος.
ltx/gr_gr_cog/me.m06.d07:meMA.Ode5C12.incipit	Κηρύττων λόγον τὸν εὐσεβῆ, τὰς…
ltx/gr_gr_cog/me.m06.d07:meMA.Ode5C12.melody	@ltx/gr_gr_cog/he.h.m6:heHE.ToTheioFengeiSou.name
ltx/gr_gr_cog/me.m06.d07:meMA.Ode5C12.mode	@ltx/gr_gr_cog/miscellanea:misc.Mode6
ltx/gr_gr_cog/me.m06.d07:meMA.Ode5C12.ode	@ltx/gr_gr_cog/miscellanea:misc.Ode5
ltx/gr_gr_cog/me.m06.d07:meMA.Ode5C12.text	Κηρύττων λόγον τὸν εὐσεβῆ, τὰς ὁδοιπορίας τὰς μακράς, Μάρτυς θεόφρον διώδευσας, καὶ τοὺς πλανωμένους πρὸς φῶς ἐπέστρεψας, τὸ σκότος ἀφεμένους τῆς ματαιότητος.
ltx/gr_gr_cog/me.m06.d07:meMA.Ode5C13.incipit	Ἀναρτηθεὶς οἷά περ ἀμνός, Μάρτυς…
ltx/gr_gr_cog/me.m06.d07:meMA.Ode5C13.melody	@ltx/gr_gr_cog/he.h.m6:heHE.ToTheioFengeiSou.name
ltx/gr_gr_cog/me.m06.d07:meMA.Ode5C13.mode	@ltx/gr_gr_cog/miscellanea:misc.Mode6
ltx/gr_gr_cog/me.m06.d07:meMA.Ode5C13.ode	@ltx/gr_gr_cog/miscellanea:misc.Ode5
ltx/gr_gr_cog/me.m06.d07:meMA.Ode5C13.text	Ἀναρτηθεὶς οἷά περ ἀμνός, Μάρτυς ἐπὶ ξύλου σιδηρῶν, ὀνύχων φέρεις σπαράγματα, ἄσαρκος καθάπερ μακαριώτατε, νεκρώσεως τὸ πάχος ἀποδυσάμενος.
ltx/gr_gr_cog/me.m06.d07:meMA.Ode5C1T.incipit	Σωματωθέντα τὸν ἀληθῆ Λόγον, τοῦ…
ltx/gr_gr_cog/me.m06.d07:meMA.Ode5C1T.melody	@ltx/gr_gr_cog/he.h.m6:heHE.ToTheioFengeiSou.name
ltx/gr_gr_cog/me.m06.d07:meMA.Ode5C1T.mode	@ltx/gr_gr_cog/miscellanea:misc.Mode6
ltx/gr_gr_cog/me.m06.d07:meMA.Ode5C1T.ode	@ltx/gr_gr_cog/miscellanea:misc.Ode5
ltx/gr_gr_cog/me.m06.d07:meMA.Ode5C1T.text	Σωματωθέντα τὸν ἀληθῆ Λόγον, τοῦ Πατρὸς ἐκ τῶν σεπτῶν, ἁγνὴ Παρθένε αἱμάτων σου, τέτοκας ἐν δύο τελείαις φύσεσι, μιᾷ δὲ ὑποστάσει θεοχαρίτωτε.
ltx/gr_gr_cog/me.m06.d07:meMA.Ode6C11.greekmelody	@ltx/gr_gr_cog/he.h.m6:heHE.TouViouTinThalassan.greekname
ltx/gr_gr_cog/me.m06.d07:meMA.Ode6C11.incipit	Ἐπήλειψας λόγοις σου, ἱεροῖς τὰ…
ltx/gr_gr_cog/me.m06.d07:meMA.Ode6C11.melody	@ltx/gr_gr_cog/he.h.m6:heHE.TouViouTinThalassan.name
ltx/gr_gr_cog/me.m06.d07:meMA.Ode6C11.mode	@ltx/gr_gr_cog/miscellanea:misc.Mode6
ltx/gr_gr_cog/me.m06.d07:meMA.Ode6C11.ode	@ltx/gr_gr_cog/miscellanea:misc.Ode6
ltx/gr_gr_cog/me.m06.d07:meMA.Ode6C11.text	Ἐπήλειψας λόγοις σου, ἱεροῖς τὰ Ἱερά, πρὸς τοὺς ἀγῶνας γύναια, καὶ καθελόντα Μάρτυς τὸν δυσμενῆ, ἀνδρείοις παλαίσμασιν, ἀφθαρσίας στεφάνους ἀνεπλέξαντο.
ltx/gr_gr_cog/me.m06.d07:meMA.Ode6C12.incipit	Ἰσχύϊ τοῦ Πνεύματος, τὴν ψυχὴν…
ltx/gr_gr_cog/me.m06.d07:meMA.Ode6C12.melody	@ltx/gr_gr_cog/he.h.m6:heHE.TouViouTinThalassan.name
ltx/gr_gr_cog/me.m06.d07:meMA.Ode6C12.mode	@ltx/gr_gr_cog/miscellanea:misc.Mode6
ltx/gr_gr_cog/me.m06.d07:meMA.Ode6C12.ode	@ltx/gr_gr_cog/miscellanea:misc.Ode6
ltx/gr_gr_cog/me.m06.d07:meMA.Ode6C12.text	Ἰσχύϊ τοῦ Πνεύματος, τὴν ψυχὴν περιφραχθείς, τῆς πονηρίας πνεύματα, ὑπομονῇ κατέβαλες αἰκισμῶν, καὶ νίκης διάδημα, ἐκ Θεοῦ ἐκομίσω Ἀξιάγαστε.
ltx/gr_gr_cog/me.m06.d07:meMA.Ode6C13.incipit	Κρουνοῖς τῶν αἱμάτων σου, τῶν…
ltx/gr_gr_cog/me.m06.d07:meMA.Ode6C13.melody	@ltx/gr_gr_cog/he.h.m6:heHE.TouViouTinThalassan.name
ltx/gr_gr_cog/me.m06.d07:meMA.Ode6C13.mode	@ltx/gr_gr_cog/miscellanea:misc.Mode6
ltx/gr_gr_cog/me.m06.d07:meMA.Ode6C13.ode	@ltx/gr_gr_cog/miscellanea:misc.Ode6
ltx/gr_gr_cog/me.m06.d07:meMA.Ode6C13.text	Κρουνοῖς τῶν αἱμάτων σου, τῶν εἰδώλων τὴν πυράν, Μάρτυς Χριστοῦ κατέσβεσας, καὶ δροσισμῷ τῶν πόνων σου εὐσεβῶς, ψυχὰς κατεδρόσισας, ἐκ φλογὸς τῆς ἀπάτης λυτρωσάμενος.
ltx/gr_gr_cog/me.m06.d07:meMA.Ode6C1T.incipit	Ὁ πάσης ἐπέκεινα, νοουμένης ἀληθῶς…
ltx/gr_gr_cog/me.m06.d07:meMA.Ode6C1T.melody	@ltx/gr_gr_cog/he.h.m6:heHE.TouViouTinThalassan.name
ltx/gr_gr_cog/me.m06.d07:meMA.Ode6C1T.mode	@ltx/gr_gr_cog/miscellanea:misc.Mode6
ltx/gr_gr_cog/me.m06.d07:meMA.Ode6C1T.ode	@ltx/gr_gr_cog/miscellanea:misc.Ode6
ltx/gr_gr_cog/me.m06.d07:meMA.Ode6C1T.text	Ὁ πάσης ἐπέκεινα, νοουμένης ἀληθῶς, καὶ ὁρωμένης κτίσεως, μήτραν τὴν σὴν ὑπέδυ παναληθῶς, καὶ σάρξ ἐχρημάτισε, τοὺς βροτοὺς ἀναπλάττων Ἀειπάρθενε.
ltx/gr_gr_cog/me.m06.d07:meMA.Ode6H.greekmelody	@ltx/gr_gr_cog/he.h.m6:heHE.TouViouTinThalassan.greekname
ltx/gr_gr_cog/me.m06.d07:meMA.Ode6H.incipit	@ltx/gr_gr_cog/he.h.m6:heHE.TouViouTinThalassan.incipit
ltx/gr_gr_cog/me.m06.d07:meMA.Ode6H.melody	@ltx/gr_gr_cog/he.h.m6:heHE.TouViouTinThalassan.melody
ltx/gr_gr_cog/me.m06.d07:meMA.Ode6H.mode	@ltx/gr_gr_cog/miscellanea:misc.Mode6
ltx/gr_gr_cog/me.m06.d07:meMA.Ode6H.ode	@ltx/gr_gr_cog/miscellanea:misc.Ode6
ltx/gr_gr_cog/me.m06.d07:meMA.Ode6H.text	@ltx/gr_gr_cog/he.h.m6:heHE.TouViouTinThalassan.text
ltx/gr_gr_cog/me.m06.d07:meMA.Ode7C11.greekmelody	@ltx/gr_gr_cog/he.h.m6:heHE.DrosovolonMenTinKaminon.greekname
ltx/gr_gr_cog/me.m06.d07:meMA.Ode7C11.incipit	Τῷ πυρὶ θεομακάριστε τῶν πόνων…
ltx/gr_gr_cog/me.m06.d07:meMA.Ode7C11.melody	@ltx/gr_gr_cog/he.h.m6:heHE.DrosovolonMenTinKaminon.name
ltx/gr_gr_cog/me.m06.d07:meMA.Ode7C11.mode	@ltx/gr_gr_cog/miscellanea:misc.Mode6
ltx/gr_gr_cog/me.m06.d07:meMA.Ode7C11.ode	@ltx/gr_gr_cog/miscellanea:misc.Ode7
ltx/gr_gr_cog/me.m06.d07:meMA.Ode7C11.text	Τῷ πυρὶ θεομακάριστε τῶν πόνων σου, πυρὰν εἰδώλων ἔσβεσας, τῶν αἱμάτων δέ, τοῖς κρουνοῖς ἐβύθισας ἐχθρούς, ἀσάρκους Θεόδοτε βοῶν· εὐλογητὸς ὁ Θεός, ὁ τῶν Πατέρων ἡμῶν.
ltx/gr_gr_cog/me.m06.d07:meMA.Ode7C12.incipit	Ὡς θυμίαμα εὐῶδες προσενήνεξαι, Σοφὲ…
ltx/gr_gr_cog/me.m06.d07:meMA.Ode7C12.melody	@ltx/gr_gr_cog/he.h.m6:heHE.DrosovolonMenTinKaminon.name
ltx/gr_gr_cog/me.m06.d07:meMA.Ode7C12.mode	@ltx/gr_gr_cog/miscellanea:misc.Mode6
ltx/gr_gr_cog/me.m06.d07:meMA.Ode7C12.ode	@ltx/gr_gr_cog/miscellanea:misc.Ode7
ltx/gr_gr_cog/me.m06.d07:meMA.Ode7C12.text	Ὡς θυμίαμα εὐῶδες προσενήνεξαι, Σοφὲ τῷ ἀθλοθέτῃ σου, θείᾳ χάριτι, τὴν δυσώδη πλάνην καθελών· διὸ μελῳδεῖς περιχαρῶς· Εὐλογητὸς εἶ ὁ Θεός, ὁ τῶν Πατέρων ἡμῶν.
ltx/gr_gr_cog/me.m06.d07:meMA.Ode7C13.incipit	Συντηρήσας σου τοὺς λόγους φόρτος…
ltx/gr_gr_cog/me.m06.d07:meMA.Ode7C13.melody	@ltx/gr_gr_cog/he.h.m6:heHE.DrosovolonMenTinKaminon.name
ltx/gr_gr_cog/me.m06.d07:meMA.Ode7C13.mode	@ltx/gr_gr_cog/miscellanea:misc.Mode6
ltx/gr_gr_cog/me.m06.d07:meMA.Ode7C13.ode	@ltx/gr_gr_cog/miscellanea:misc.Ode7
ltx/gr_gr_cog/me.m06.d07:meMA.Ode7C13.text	Συντηρήσας σου τοὺς λόγους φόρτος Ἅγιος, τῷ θεοφόρῳ Φρόντωνι ἀποδέδοσαι, εἰς ναοῦ ἀνέγερσιν σεπτοῦ, εἰς κάθαρσιν πάντων εὐσεβῶν, εἰς περιποίησιν ψυχῶν, Μάρτυς Θεόδοτε.
ltx/gr_gr_cog/me.m06.d07:meMA.Ode7C1T.incipit	Μίαν φέροντα ὑπόστασιν ἐκύησας, τὸν…
ltx/gr_gr_cog/me.m06.d07:meMA.Ode7C1T.melody	@ltx/gr_gr_cog/he.h.m6:heHE.DrosovolonMenTinKaminon.name
ltx/gr_gr_cog/me.m06.d07:meMA.Ode7C1T.mode	@ltx/gr_gr_cog/miscellanea:misc.Mode6
ltx/gr_gr_cog/me.m06.d07:meMA.Ode7C1T.ode	@ltx/gr_gr_cog/miscellanea:misc.Ode7
ltx/gr_gr_cog/me.m06.d07:meMA.Ode7C1T.text	Μίαν φέροντα ὑπόστασιν ἐκύησας, τὸν Λόγον Μητροπάρθενε, διπλᾶς ἔχοντα, τὰς θελήσεις καὶ τὰ φυσικά, αὐτοῦ ἰδιώματα σαφῶς· Θεὸς γὰρ ἐστι καὶ βροτός, ὁ διʼ ἡμᾶς σαρκωθείς.
ltx/gr_gr_cog/me.m06.d07:meMA.Ode8C11.greekmelody	@ltx/gr_gr_cog/he.h.m6:heHE.EkFlogosToisOsiois.greekname
ltx/gr_gr_cog/me.m06.d07:meMA.Ode8C11.incipit	Ἀδιάσειστος στῦλος πύργος ἀκλόνητος, ἀπερίτρεπτον…
ltx/gr_gr_cog/me.m06.d07:meMA.Ode8C11.melody	@ltx/gr_gr_cog/he.h.m6:heHE.EkFlogosToisOsiois.name
ltx/gr_gr_cog/me.m06.d07:meMA.Ode8C11.mode	@ltx/gr_gr_cog/miscellanea:misc.Mode6
ltx/gr_gr_cog/me.m06.d07:meMA.Ode8C11.ode	@ltx/gr_gr_cog/miscellanea:misc.Ode8
ltx/gr_gr_cog/me.m06.d07:meMA.Ode8C11.text	Ἀδιάσειστος στῦλος πύργος ἀκλόνητος, ἀπερίτρεπτον τεῖχος βάσις τῆς πίστεως, δόσις θεϊκή, εὐσεβείας ὑπέρμαχος πλάνης καθαιρέτης, ἐδείχθης Ἀθλοφόρε.
ltx/gr_gr_cog/me.m06.d07:meMA.Ode8C12.incipit	Κυβερνήσει τῆς θείας χάριτος Πάνσοφε…
ltx/gr_gr_cog/me.m06.d07:meMA.Ode8C12.melody	@ltx/gr_gr_cog/he.h.m6:heHE.EkFlogosToisOsiois.name
ltx/gr_gr_cog/me.m06.d07:meMA.Ode8C12.mode	@ltx/gr_gr_cog/miscellanea:misc.Mode6
ltx/gr_gr_cog/me.m06.d07:meMA.Ode8C12.ode	@ltx/gr_gr_cog/miscellanea:misc.Ode8
ltx/gr_gr_cog/me.m06.d07:meMA.Ode8C12.text	Κυβερνήσει τῆς θείας χάριτος Πάνσοφε, τῶν βασάνων παρῆλθες τὸ μέγα πέλαγος, καὶ τοὺς γαληνούς, ἀγαλλόμενος ἔφθασας, ἔνδοξε λιμένας, τῆς ἄνω βασιλείας.
ltx/gr_gr_cog/me.m06.d07:meMA.Ode8C13.incipit	Αἱ πορεῖαι καὶ τρίβοι σου…
ltx/gr_gr_cog/me.m06.d07:meMA.Ode8C13.melody	@ltx/gr_gr_cog/he.h.m6:heHE.EkFlogosToisOsiois.name
ltx/gr_gr_cog/me.m06.d07:meMA.Ode8C13.mode	@ltx/gr_gr_cog/miscellanea:misc.Mode6
ltx/gr_gr_cog/me.m06.d07:meMA.Ode8C13.ode	@ltx/gr_gr_cog/miscellanea:misc.Ode8
ltx/gr_gr_cog/me.m06.d07:meMA.Ode8C13.text	Αἱ πορεῖαι καὶ τρίβοι σου κατευθύνθησαν, πρὸς Χριστὸν τὸν τῶν ὅλων Θεὸν καὶ Κύριον, οὗ ἐν ταῖς χερσί, σοῦ τὸ πνεῦμα παρέδωκας, Μάρτυς ἀθλοφόρε, Θεόδοτε τρισμάκαρ.
ltx/gr_gr_cog/me.m06.d07:meMA.Ode8C1T.incipit	Ῥητορεύουσα γλῶσσα τοῦ μυστηρίου σου…
ltx/gr_gr_cog/me.m06.d07:meMA.Ode8C1T.melody	@ltx/gr_gr_cog/he.h.m6:heHE.EkFlogosToisOsiois.name
ltx/gr_gr_cog/me.m06.d07:meMA.Ode8C1T.mode	@ltx/gr_gr_cog/miscellanea:misc.Mode6
ltx/gr_gr_cog/me.m06.d07:meMA.Ode8C1T.ode	@ltx/gr_gr_cog/miscellanea:misc.Ode8
ltx/gr_gr_cog/me.m06.d07:meMA.Ode8C1T.text	Ῥητορεύουσα γλῶσσα τοῦ μυστηρίου σου, τὸ ἀπόῤῥητον βάθος εἰπεῖν οὐ δύναται· Λόγον γὰρ Θεοῦ, ὑπὲρ λόγον ἐκύησας, πάναγνε Παρθένε, εἰς πάντων σωτηρίαν.
ltx/gr_gr_cog/me.m06.d07:meMA.Ode8H.greekmelody	@ltx/gr_gr_cog/he.h.m6:heHE.EkFlogosToisOsiois.greekname
ltx/gr_gr_cog/me.m06.d07:meMA.Ode8H.incipit	@ltx/gr_gr_cog/he.h.m6:heHE.EkFlogosToisOsiois.incipit
ltx/gr_gr_cog/me.m06.d07:meMA.Ode8H.melody	@ltx/gr_gr_cog/he.h.m6:heHE.EkFlogosToisOsiois.melody
ltx/gr_gr_cog/me.m06.d07:meMA.Ode8H.mode	@ltx/gr_gr_cog/miscellanea:misc.Mode6
ltx/gr_gr_cog/me.m06.d07:meMA.Ode8H.ode	@ltx/gr_gr_cog/miscellanea:misc.Ode8
ltx/gr_gr_cog/me.m06.d07:meMA.Ode8H.text	@ltx/gr_gr_cog/he.h.m6:heHE.EkFlogosToisOsiois.text
ltx/gr_gr_cog/me.m06.d07:meMA.Ode9C11.greekmelody	@ltx/gr_gr_cog/he.h.m2:heHE.AporeiPasaGlossa.greekname
ltx/gr_gr_cog/me.m06.d07:meMA.Ode9C11.incipit	Ἵνα τῆς δόξης τύχης, τῆς…
ltx/gr_gr_cog/me.m06.d07:meMA.Ode9C11.melody	@ltx/gr_gr_cog/he.h.m2:heHE.AporeiPasaGlossa.name
ltx/gr_gr_cog/me.m06.d07:meMA.Ode9C11.mode	@ltx/gr_gr_cog/miscellanea:misc.Mode6
ltx/gr_gr_cog/me.m06.d07:meMA.Ode9C11.ode	@ltx/gr_gr_cog/miscellanea:misc.Ode9
ltx/gr_gr_cog/me.m06.d07:meMA.Ode9C11.text	Ἵνα τῆς δόξης τύχης, τῆς ἐκεῖ Ἀθλοφόρε, τῆς ὁρωμένης χαίρων κατεφρόνησας, καὶ θείᾳ ἐπινεύσει, πρὸς τοὺς αἰκισμοὺς ἐχώρησας μὴ δειλιάσας, κολαστηρίων εἴδη καὶ θάνατον πικρόν· ὅθεν μετὰ Μαρτύρων ἐστέφθης ἀγωνισάμενος.
ltx/gr_gr_cog/me.m06.d07:meMA.Ode9C12.incipit	Ὡράθης οἶκος Μάρτυς, καθαρὸς τῆς…
ltx/gr_gr_cog/me.m06.d07:meMA.Ode9C12.melody	@ltx/gr_gr_cog/he.h.m2:heHE.AporeiPasaGlossa.name
ltx/gr_gr_cog/me.m06.d07:meMA.Ode9C12.mode	@ltx/gr_gr_cog/miscellanea:misc.Mode6
ltx/gr_gr_cog/me.m06.d07:meMA.Ode9C12.ode	@ltx/gr_gr_cog/miscellanea:misc.Ode9
ltx/gr_gr_cog/me.m06.d07:meMA.Ode9C12.text	Ὡράθης οἶκος Μάρτυς, καθαρὸς τῆς Τριάδος, οἰκοδομία πράξεων Θεόδοτε, πανόλβιε ἐνθέων, ἄθλων τε λαμπρῶν φαιδρότησι κεκοσμημένος, διʼ ὧν ναοὺς δαιμόνων, καὶ ξόανα σοφέ, θείᾳ τοῦ Παρακλήτου δυνάμει, σαφῶς κατέστρεψας.
ltx/gr_gr_cog/me.m06.d07:meMA.Ode9C13.incipit	Σταλάζον ὄρος θεῖον, γλυκασμὸν ἀνεφάνης…
ltx/gr_gr_cog/me.m06.d07:meMA.Ode9C13.melody	@ltx/gr_gr_cog/he.h.m2:heHE.AporeiPasaGlossa.name
ltx/gr_gr_cog/me.m06.d07:meMA.Ode9C13.mode	@ltx/gr_gr_cog/miscellanea:misc.Mode6
ltx/gr_gr_cog/me.m06.d07:meMA.Ode9C13.ode	@ltx/gr_gr_cog/miscellanea:misc.Ode9
ltx/gr_gr_cog/me.m06.d07:meMA.Ode9C13.text	Σταλάζον ὄρος θεῖον, γλυκασμὸν ἀνεφάνης, πηγὴ θαυμάτων πέλαγός τε ἔνδοξε, ἐνθέων χαρισμάτων, ῥεῖθρον διαυγὲς τοῦ Πνεύματος, ψυχὰς ἀρδεῦον, καὶ κατακλύζον πάθη, καὶ πᾶσι προξενοῦν, Μάρτυς τοῖς σὲ ὑμνοῦσι τὴν ἀγαλλίασιν.
ltx/gr_gr_cog/me.m06.d07:meMA.Ode9C1T.incipit	Φωνῇ Ἀγγέλου τέτοκας, τὸν ἄναρχον…
ltx/gr_gr_cog/me.m06.d07:meMA.Ode9C1T.melody	@ltx/gr_gr_cog/he.h.m2:heHE.AporeiPasaGlossa.name
ltx/gr_gr_cog/me.m06.d07:meMA.Ode9C1T.mode	@ltx/gr_gr_cog/miscellanea:misc.Mode6
ltx/gr_gr_cog/me.m06.d07:meMA.Ode9C1T.ode	@ltx/gr_gr_cog/miscellanea:misc.Ode9
ltx/gr_gr_cog/me.m06.d07:meMA.Ode9C1T.text	Φωνῇ Ἀγγέλου τέτοκας, τὸν ἄναρχον Λόγον, λαβόντα σάρκα ἔννουν τε καὶ ἔμψυχον, Παρθένε Παναγία, ἐκ τῶν καθαρῶν αἱμάτων σου, καὶ τοὺς ἀσάρκους ἐχθροὺς καταβαλόντα, καὶ σώσαντα ἡμᾶς, πάντας τοὺς ἀληθῆ Θεοτόκον ὁμολογοῦντάς σε.
ltx/gr_gr_cog/me.m06.d07:meMA.Ode9H.greekmelody	@ltx/gr_gr_cog/he.h.m2:heHE.AporeiPasaGlossa.greekname
ltx/gr_gr_cog/me.m06.d07:meMA.Ode9H.incipit	@ltx/gr_gr_cog/he.h.m2:heHE.AporeiPasaGlossa.incipit
ltx/gr_gr_cog/me.m06.d07:meMA.Ode9H.melody	@ltx/gr_gr_cog/he.h.m2:heHE.AporeiPasaGlossa.melody
ltx/gr_gr_cog/me.m06.d07:meMA.Ode9H.mode	@ltx/gr_gr_cog/miscellanea:misc.Mode6
ltx/gr_gr_cog/me.m06.d07:meMA.Ode9H.ode	@ltx/gr_gr_cog/miscellanea:misc.Ode9
ltx/gr_gr_cog/me.m06.d07:meMA.Ode9H.text	@ltx/gr_gr_cog/he.h.m2:heHE.AporeiPasaGlossa.text
ltx/gr_gr_cog/me.m06.d07:meVE.Apolytikion1ger.greekmelody	@ltx/gr_gr_cog/he.a.m3:heAU.TheiasPisteos.greekname
ltx/gr_gr_cog/me.m06.d07:meVE.Apolytikion1ger.incipit	Δόσιν ἔνθεον, καταπλουτήσας, τὴν τῆς…
ltx/gr_gr_cog/me.m06.d07:meVE.Apolytikion1ger.melody	@ltx/gr_gr_cog/he.a.m3:heAU.TheiasPisteos.name
ltx/gr_gr_cog/me.m06.d07:meVE.Apolytikion1ger.mode	@ltx/gr_gr_cog/miscellanea:misc.Mode3
ltx/gr_gr_cog/me.m06.d07:meVE.Apolytikion1ger.poet	@ltx/gr_gr_cog/poets:po.Gerasimou
ltx/gr_gr_cog/me.m06.d07:meVE.Apolytikion1ger.text	Δόσιν ἔνθεον, καταπλουτήσας, τὴν τῆς χάριτος ἱερουργίαν, Ἱερομάρτυς τρισμάκαρ Θεόδοτε, καθάπερ δῶρα Θεῷ προσενήνοχας, τὰς ἀριστείας τῶν θείων ἀγώνων σου. Πάτερ Ὅσιε, Χριστὸν τὸν Θεὸν ἱκέτευε, δωρήσασθαι ἡμῖν τὸ μέγα ἔλεος.
ltx/gr_gr_cog/me.m06.d07:meVE.SticStavrotheotokion.greekmelody	@ltx/gr_gr_cog/he.a.m1:heAU.TonOuranionTagmaton.greekname
ltx/gr_gr_cog/me.m06.d07:meVE.SticStavrotheotokion.incipit	Σὲ τὸν ἀμνὸν καὶ ποιμένα…
ltx/gr_gr_cog/me.m06.d07:meVE.SticStavrotheotokion.melody	@ltx/gr_gr_cog/he.a.m1:heAU.TonOuranionTagmaton.name
ltx/gr_gr_cog/me.m06.d07:meVE.SticStavrotheotokion.mode	@ltx/gr_gr_cog/miscellanea:misc.Mode1
ltx/gr_gr_cog/me.m06.d07:meVE.SticStavrotheotokion.text	Σὲ τὸν ἀμνὸν καὶ ποιμένα ἐπὶ τοῦ ξύλου Σωτήρ, ἡ σὲ ἁγνῶς τεκοῦσα, ὡς ἑώρα Θεέ μου, θρηνοῦσα ἀνεβόα· Τέκνον ἐμόν, φῶς τοῦ κόσμου γλυκύτατον, πῶς ἐπὶ ξύλου ὁρῶ σε τοῦ σταυρικοῦ, ὡς κακοῦργον ἀναρτώμενον;
ltx/gr_gr_cog/me.m06.d07:meVE.SticTheotokion.greekmelody	@ltx/gr_gr_cog/he.a.m1:heAU.TonOuranionTagmaton.greekname
ltx/gr_gr_cog/me.m06.d07:meVE.SticTheotokion.incipit	@ltx/gr_gr_cog/he.a.m1:heAU.TonOuranionTagmaton.incipit
ltx/gr_gr_cog/me.m06.d07:meVE.SticTheotokion.melody	@ltx/gr_gr_cog/he.a.m1:heAU.TonOuranionTagmaton.melody
ltx/gr_gr_cog/me.m06.d07:meVE.SticTheotokion.mode	@ltx/gr_gr_cog/miscellanea:misc.Mode1
ltx/gr_gr_cog/me.m06.d07:meVE.SticTheotokion.text	@ltx/gr_gr_cog/he.a.m1:heAU.TonOuranionTagmaton.text
ltx/gr_gr_cog/me.m06.d07:meVE.Stichera01.greekmelody	@ltx/gr_gr_cog/he.a.m1:heAU.TonOuranionTagmaton.greekname
ltx/gr_gr_cog/me.m06.d07:meVE.Stichera01.incipit	Ἀγαλλομένῃ καρδίᾳ καὶ σταθερῷ λογισμῷ…
ltx/gr_gr_cog/me.m06.d07:meVE.Stichera01.melody	@ltx/gr_gr_cog/he.a.m1:heAU.TonOuranionTagmaton.name
ltx/gr_gr_cog/me.m06.d07:meVE.Stichera01.mode	@ltx/gr_gr_cog/miscellanea:misc.Mode1
ltx/gr_gr_cog/me.m06.d07:meVE.Stichera01.text	Ἀγαλλομένῃ καρδίᾳ καὶ σταθερῷ λογισμῷ, πρὸς τοὺς ἀγῶνας Μάρτυς, ηὐτομόλησας ὄντως, μὴ πτήξας τῶν βασάνων τὰ ἀλγεινά, οὐ τὸν βίαιον θάνατον· ὅθεν νομίμως ἀθλήσας περιφανῶς, ἐστεφάνωσαι Θεόδοτε.
ltx/gr_gr_cog/me.m06.d07:meVE.Stichera02.incipit	Τοῖς σπαραγμοῖς τῆς σαρκός σου…
ltx/gr_gr_cog/me.m06.d07:meVE.Stichera02.melody	@ltx/gr_gr_cog/he.a.m1:heAU.TonOuranionTagmaton.name
ltx/gr_gr_cog/me.m06.d07:meVE.Stichera02.mode	@ltx/gr_gr_cog/miscellanea:misc.Mode1
ltx/gr_gr_cog/me.m06.d07:meVE.Stichera02.text	Τοῖς σπαραγμοῖς τῆς σαρκός σου κατετραυμάτισας, τοὺς πολεμίους μάκαρ, καὶ κατέξανας τούτων, ἐλέγχοις τὰς καρδίας· τοῖς δὲ κρουνοῖς, τῶν χυθέντων αἱμάτων σου, τὰς διεκχύσεις ἐξήρανας παντελῶς, τῆς ἀθεΐας παμμακάριστε.
ltx/gr_gr_cog/me.m06.d07:meVE.Stichera03.incipit	Καρτερικῶς ταῖς λαμπάσι περικαιόμενος, καὶ…
ltx/gr_gr_cog/me.m06.d07:meVE.Stichera03.melody	@ltx/gr_gr_cog/he.a.m1:heAU.TonOuranionTagmaton.name
ltx/gr_gr_cog/me.m06.d07:meVE.Stichera03.mode	@ltx/gr_gr_cog/miscellanea:misc.Mode1
ltx/gr_gr_cog/me.m06.d07:meVE.Stichera03.text	Καρτερικῶς ταῖς λαμπάσι περικαιόμενος, καὶ ταῖς πληγαῖς τὸν νῶτον, συντριβόμενος Μάρτυς, ὑπέμεινας κραυγάζων· Τῆς τοῦ Χριστοῦ, ἀγαπήσεως ὅλως με, οὐδέν χωρίσει οὐ θάνατος, οὐ ζωή, οὐδὲ πᾶσα ἄλλη βάσανος.
