ltx/gr_gr_cog/le.go.mc.d057:lemcLI.Gospel.book_abbr	@ltx/gr_gr_cog/bible:Mark.abbr
ltx/gr_gr_cog/le.go.mc.d057:lemcLI.Gospel.book_string	@ltx/gr_gr_cog/bible:Mark.text
ltx/gr_gr_cog/le.go.mc.d057:lemcLI.Gospel.chapverse	10:32 – 45
ltx/gr_gr_cog/le.go.mc.d057:lemcLI.Gospel.incipit	Παραλαβὼν τοὺς δώδεκα…
ltx/gr_gr_cog/le.go.mc.d057:lemcLI.Gospel.text	Τῷ καιρῷ ἐκείνῳ, παραλαβὼν ὁ Ἰησοῦς τοὺς δώδεκα μαθητὰς αὐτοῦ ἤρξατο αὐτοῖς λέγειν τὰ μέλλοντα αὐτῷ συμβαίνειν, ὅτι ἰδοὺ ἀναβαίνομεν εἰς Ἱεροσόλυμα καὶ ὁ υἱὸς τοῦ ἀνθρώπου παραδοθήσεται τοῖς ἀρχιερεῦσι καὶ γραμματεῦσι, καὶ κατακρινοῦσιν αὐτὸν θανάτῳ καὶ παραδώσουσιν αὐτὸν τοῖς ἔθνεσι, καὶ ἐμπαίξουσιν αὐτῷ καὶ μαστιγώσουσιν αὐτὸν καὶ ἐμπτύσουσιν αὐτῷ καὶ ἀποκτενοῦσιν αὐτόν, καὶ τῇ τρίτῃ ἡμέρᾳ ἀναστήσεται. Καὶ προσπορεύονται αὐτῷ Ἰάκωβος καὶ Ἰωάννης υἱοὶ Ζεβεδαίου λέγοντες· διδάσκαλε, θέλομεν ἵνα ὃ ἐὰν αἰτήσωμεν ποιήσῃς ἡμῖν. ὁ δὲ εἶπεν αὐτοῖς· τί θέλετε ποιῆσαί με ὑμῖν; οἱ δὲ εἶπον αὐτῷ· δὸς ἡμῖν ἵνα εἷς ἐκ δεξιῶν σου καὶ εἷς ἐξ εὐωνύμων σου καθίσωμεν ἐν τῇ δόξῃ σου. ὁ δὲ Ἰησοῦς εἶπεν αὐτοῖς· οὐκ οἴδατε τί αἰτεῖσθε. δύνασθε πιεῖν τὸ ποτήριον ὃ ἐγὼ πίνω, καὶ τὸ βάπτισμα ὃ ἐγὼ βαπτίζομαι βαπτισθῆναι; οἱ δὲ εἶπον αὐτῷ· δυνάμεθα. ὁ δὲ Ἰησοῦς εἶπεν αὐτοῖς· τὸ μὲν ποτήριον ὃ ἐγὼ πίνω πίεσθε, καὶ τὸ βάπτισμα ὃ ἐγὼ βαπτίζομαι βαπτισθήσεσθε· τὸ δὲ καθίσαι ἐκ δεξιῶν μου καὶ ἐξ εὐωνύμων οὐκ ἔστιν ἐμὸν δοῦναι, ἀλλ᾿ οἷς ἡτοίμασται. Καὶ ἀκούσαντες οἱ δέκα ἤρξαντο ἀγανακτεῖν περὶ Ἰακώβου καὶ Ἰωάννου. ὁ δὲ Ἰησοῦς προσκαλεσάμενος αὐτοὺς λέγει αὐτοῖς· οἴδατε ὅτι οἱ δοκοῦντες ἄρχειν τῶν ἐθνῶν κατακυριεύουσιν αὐτῶν καὶ οἱ μεγάλοι αὐτῶν κατεξουσιάζουσιν αὐτῶν· οὐχ οὕτω δὲ ἔσται ἐν ὑμῖν, ἀλλ᾿ ὃς ἐὰν θέλῃ γενέσθαι μέγας ἐν ὑμῖν, ἔσται ὑμῶν διάκονος, καὶ ὃς ἐὰν θέλῃ ὑμῶν γενέσθαι πρῶτος, ἔσται πάντων δοῦλος· καὶ γὰρ ὁ υἱὸς τοῦ ἀνθρώπου οὐκ ἦλθε διακονηθῆναι, ἀλλὰ διακονῆσαι, καὶ δοῦναι τὴν ψυχὴν αὐτοῦ λύτρον ἀντὶ πολλῶν.
ltx/gr_gr_cog/le.go.mc.d057:lemcLI.Gospel.title	Τῇ Πέμπτῃ Κυριακῇ τῶν Νηστειῶν
ltx/gr_gr_cog/le.go.mc.d057:lemcLI.Gospel.title_abbr	Τῇ Εʹ Κυριακῇ τῶν Νηστειῶν
ltx/gr_gr_cog/le.go.mc.d057:lemcLI.Gospel.version	@ltx/gr_gr_cog/properties:version.designation
