ltx/gr_gr_cog/le.go.mc.d170:lemcLI.Gospel.book_abbr	@ltx/gr_gr_cog/bible:Matthew.abbr
ltx/gr_gr_cog/le.go.mc.d170:lemcLI.Gospel.book_string	@ltx/gr_gr_cog/bible:Matthew.text
ltx/gr_gr_cog/le.go.mc.d170:lemcLI.Gospel.chapverse	16:1 – 6
ltx/gr_gr_cog/le.go.mc.d170:lemcLI.Gospel.incipit	Προσελθόντες τῷ Ἰησοῦ οἱ Φαρισαῖοι …
ltx/gr_gr_cog/le.go.mc.d170:lemcLI.Gospel.text	Τῷ καιρῷ ἐκείνῳ, προσελθόντες τῷ Ἰησοῦ οἱ Φαρισαῖοι καὶ Σαδδουκαῖοι πειράζοντες ἐπηρώτησαν αὐτὸν σημεῖον ἐκ τοῦ οὐρανοῦ ἐπιδεῖξαι αὐτοῖς. ὁ δὲ ἀποκριθεὶς εἶπεν αὐτοῖς· ὀψίας γενομένης λέγετε· εὐδία· πυρράζει γὰρ ὁ οὐρανός· καὶ πρωΐ· σήμερον χειμών· πυρράζει γὰρ στυγνάζων ὁ οὐρανός. ὑποκριταί, τὸ μὲν πρόσωπον τοῦ οὐρανοῦ γινώσκετε διακρίνειν, τὰ δὲ σημεῖα τῶν καιρῶν οὐ δύνασθε γνῶναι; γενεὰ πονηρὰ καὶ μοιχαλὶς σημεῖον ἐπιζητεῖ, καὶ σημεῖον οὐ δοθήσεται αὐτῇ εἰ μὴ τὸ σημεῖον Ἰωνᾶ τοῦ προφήτου. καὶ καταλιπὼν αὐτοὺς ἀπῆλθεν. Καὶ ἐλθόντες οἱ μαθηταὶ αὐτοῦ εἰς τὸ πέραν ἐπελάθοντο ἄρτους λαβεῖν. ὁ δὲ Ἰησοῦς εἶπεν αὐτοῖς· ὁρᾶτε καὶ προσέχετε ἀπὸ τῆς ζύμης τῶν Φαρισαίων καὶ Σαδδουκαίων.
ltx/gr_gr_cog/le.go.mc.d170:lemcLI.Gospel.title	Τῇ Δευτέρᾳ τῆς Ηʹ Ἑβδομάδος τοῦ Ματθαίου
ltx/gr_gr_cog/le.go.mc.d170:lemcLI.Gospel.title_abbr	Δευτέρᾳ τῆς Ηʹ Ἑβδομάδος
ltx/gr_gr_cog/le.go.mc.d170:lemcLI.Gospel.version	@ltx/gr_gr_cog/properties:version.designation
