ltx/gr_gr_cog/le.go.lu.d046:leluLI.Gospel.book_abbr	@ltx/gr_gr_cog/bible:Luke.abbr
ltx/gr_gr_cog/le.go.lu.d046:leluLI.Gospel.book_string	@ltx/gr_gr_cog/bible:Luke.text
ltx/gr_gr_cog/le.go.lu.d046:leluLI.Gospel.chapverse	11:47 – 54, 12:1
ltx/gr_gr_cog/le.go.lu.d046:leluLI.Gospel.incipit	Οὐαὶ ὑμῖν, ὅτι οἰκοδομεῖτε τὰ μνημεῖα…
ltx/gr_gr_cog/le.go.lu.d046:leluLI.Gospel.text	Εἶπεν ὁ Κύριος πρὸς τοὺς ἐληλυθότας πρὸς αὐτὸν Ἰουδαίους· οὐαὶ ὑμῖν, ὅτι οἰκοδομεῖτε τὰ μνημεῖα τῶν προφητῶν, οἱ δὲ πατέρες ὑμῶν ἀπέκτειναν αὐτούς. ἄρα μαρτυρεῖτε καὶ συνευδοκεῖτε τοῖς ἔργοις τῶν πατέρων ὑμῶν, ὅτι αὐτοὶ μὲν ἀπέκτειναν αὐτούς, ὑμεῖς δὲ οἰκοδομεῖτε αὐτῶν τὰ μνημεῖα. διὰ τοῦτο καὶ ἡ σοφία τοῦ Θεοῦ εἶπεν· ἀποστελῶ εἰς αὐτοὺς προφήτας καὶ ἀποστόλους, καὶ ἐξ αὐτῶν ἀποκτενοῦσι καὶ ἐκδιώξουσιν, ἵνα ἐκζητηθῇ τὸ αἷμα πάντων τῶν προφητῶν τὸ ἐκχυνόμενον ἀπὸ καταβολῆς κόσμου ἀπὸ τῆς γενεᾶς ταύτης, ἀπὸ τοῦ αἵματος Ἄβελ ἕως τοῦ αἵματος Ζαχαρίου τοῦ ἀπολομένου μεταξὺ τοῦ θυσιαστηρίου καὶ τοῦ οἴκου· ναί, λέγω ὑμῖν, ἐκζητηθήσεται ἀπὸ τῆς γενεᾶς ταύτης. οὐαὶ ὑμῖν τοῖς νομικοῖς, ὅτι ἤρατε τὴν κλεῖδα τῆς γνώσεως· αὐτοὶ οὐκ εἰσήλθετε, καὶ τοὺς εἰσερχομένους ἐκωλύσατε. λέγοντος δὲ αὐτοῦ πρὸς αὐτοὺς ταῦτα ἤρξαντο οἱ γραμματεῖς καὶ οἱ Φαρισαῖοι δεινῶς ἐνέχειν καὶ ἀποστοματίζειν αὐτὸν περὶ πλειόνων, ἐνεδρεύοντες αὐτόν, ζητοῦντες θηρεῦσαί τι ἐκ τοῦ στόματος αὐτοῦ, ἵνα κατηγορήσωσιν αὐτοῦ. Ἐν οἷς ἐπισυναχθεισῶν τῶν μυριάδων τοῦ ὄχλου ὡς καταπατεῖν ἀλλήλους, ἤρξατο λέγειν πρὸς τοὺς μαθητὰς αὐτοῦ πρῶτον· προσέχετε ἑαυτοῖς ἀπὸ τῆς ζύμης τῶν Φαρισαίων, ἥτις ἐστὶν ὑπόκρισις.
ltx/gr_gr_cog/le.go.lu.d046:leluLI.Gospel.title	Τῇ Πέμπτῃ τῆς Ζʹ Ἑβδομάδος τοῦ Λουκᾶ
ltx/gr_gr_cog/le.go.lu.d046:leluLI.Gospel.title_abbr	Τῇ Πέμπτῃ τῆς Ζʹ Ἑβδομάδος τοῦ Λουκᾶ
ltx/gr_gr_cog/le.go.lu.d046:leluLI.Gospel.version	@ltx/gr_gr_cog/properties:version.designation
