ltx/gr_gr_cog/me.m02.d16:meDA.commemoration.first	Μνήμη τοῦ Ἁγίου Μάρτυρος Παμφίλου, καὶ τῶν σὺν αὐτῷ
ltx/gr_gr_cog/me.m02.d16:meDA.commemoration.first_name	
ltx/gr_gr_cog/me.m02.d16:meDA.commemoration.first_short	Μνήμη τοῦ Ἁγίου Μάρτυρος Παμφίλου, καὶ τῶν σὺν αὐτῷ
ltx/gr_gr_cog/me.m02.d16:meDA.commemoration.first_title	@ltx/gr_gr_cog/titles:ti.Saints
ltx/gr_gr_cog/me.m02.d16:meDA.commemoration.full	Μνήμη τοῦ Ἁγίου Μάρτυρος Παμφίλου, καὶ τῶν σὺν αὐτῷ
ltx/gr_gr_cog/me.m02.d16:meDA.commemoration.second_name	
ltx/gr_gr_cog/me.m02.d16:meDA.commemoration.second_title	
ltx/gr_gr_cog/me.m02.d16:meDA.date	Τῌ ΙϚʹ ΦΕΒΡΟΥΑΡΙΟΥ
ltx/gr_gr_cog/me.m02.d16:meDA.fordate	διὰ τὴν 16ην Φεβρουαρίου
ltx/gr_gr_cog/me.m02.d16:meDA.insert1	καὶ τοῦ Ἁγίου Μάρτυρος Παμφίλου, καὶ τῶν σὺν αὐτῷ,
ltx/gr_gr_cog/me.m02.d16:meDA.insert2	οὗ καὶ τὴν μνήμην ἐπιτελοῦμεν·
ltx/gr_gr_cog/me.m02.d16:meDA.note	
ltx/gr_gr_cog/me.m02.d16:meDA.pdfcoverdate	τῆς 16ης Φεβρουαρίου,
ltx/gr_gr_cog/me.m02.d16:meDA.pdfheaderdate	τῆς 16ης Φεβρουαρίου
ltx/gr_gr_cog/me.m02.d16:meHO.commemorations	
ltx/gr_gr_cog/me.m02.d16:meHO.note1	
ltx/gr_gr_cog/me.m02.d16:meHO.note2	
ltx/gr_gr_cog/me.m02.d16:meHO.number	
ltx/gr_gr_cog/me.m02.d16:meHO.rank	
ltx/gr_gr_cog/me.m02.d16:meLE.commemoration1	Μνήμη τοῦ Ἁγίου Μάρτυρος Παμφίλου, καὶ τῶν σὺν αὐτῷ.
ltx/gr_gr_cog/me.m02.d16:meLE.commemoration2	
ltx/gr_gr_cog/me.m02.d16:meLI.Kontakion1.greekmelody	@ltx/gr_gr_cog/me.m02.d16:meMA.Kontakion1.greekmelody
ltx/gr_gr_cog/me.m02.d16:meLI.Kontakion1.incipit	@ltx/gr_gr_cog/me.m02.d16:meMA.Kontakion1.incipit
ltx/gr_gr_cog/me.m02.d16:meLI.Kontakion1.melody	@ltx/gr_gr_cog/me.m02.d16:meMA.Kontakion1.melody
ltx/gr_gr_cog/me.m02.d16:meLI.Kontakion1.mode	@ltx/gr_gr_cog/me.m02.d16:meMA.Kontakion1.mode
ltx/gr_gr_cog/me.m02.d16:meLI.Kontakion1.text	@ltx/gr_gr_cog/me.m02.d16:meMA.Kontakion1.text
ltx/gr_gr_cog/me.m02.d16:meLI.Megalynarion.text	
ltx/gr_gr_cog/me.m02.d16:meMA.C1.acrostic.notice1	οὗ ἡ Ἀκροστιχίς·
ltx/gr_gr_cog/me.m02.d16:meMA.C1.acrostic.text	Δῆμον δωδεκάριθμον Ἀθλοφόρων ἀναμέλπω.
ltx/gr_gr_cog/me.m02.d16:meMA.C1.acrostic.title	Κανὼν τῶν Ἁγίων,
ltx/gr_gr_cog/me.m02.d16:meMA.C1.poet	@ltx/gr_gr_cog/poets:po.Theofanous
ltx/gr_gr_cog/me.m02.d16:meMA.C1.title	@ltx/gr_gr_cog/titles:ti.CanonSaints
ltx/gr_gr_cog/me.m02.d16:meMA.C1.verse	@ltx/gr_gr_cog/prayers:pr.verse_SaintsM.text
ltx/gr_gr_cog/me.m02.d16:meMA.Kontakion1.greekmelody	@ltx/gr_gr_cog/he.a.m2:heAU.TaAnoZiton.greekname
ltx/gr_gr_cog/me.m02.d16:meMA.Kontakion1.incipit	Φιλήσας Χριστοῦ, τὰ θεῖα θελήματα…
ltx/gr_gr_cog/me.m02.d16:meMA.Kontakion1.melody	@ltx/gr_gr_cog/he.a.m2:heAU.TaAnoZiton.name
ltx/gr_gr_cog/me.m02.d16:meMA.Kontakion1.mode	@ltx/gr_gr_cog/miscellanea:misc.Mode2
ltx/gr_gr_cog/me.m02.d16:meMA.Kontakion1.text	Φιλήσας Χριστοῦ, τὰ θεῖα θελήματα, ἐδείχθης Πιστῶν, ἀκέστωρ φιλόχριστος, γενναιόφρον Πάμφιλε, διὰ τοῦτο καὶ μακαρίζομεν, τὴν σεπτήν σου πανήγυριν. Πρεσβεύων μὴ παύσῃ ὑπὲρ πάντων ἡμῶν.
ltx/gr_gr_cog/me.m02.d16:meMA.Ode1C11.greekmelody	@ltx/gr_gr_cog/he.h.m4:heHE.ThalassisToErythraion.greekname
ltx/gr_gr_cog/me.m02.d16:meMA.Ode1C11.incipit	Δυνάμει, τοῦ Παναγίου Πνεύματος, ἡ…
ltx/gr_gr_cog/me.m02.d16:meMA.Ode1C11.melody	@ltx/gr_gr_cog/he.h.m4:heHE.ThalassisToErythraion.name
ltx/gr_gr_cog/me.m02.d16:meMA.Ode1C11.mode	@ltx/gr_gr_cog/miscellanea:misc.Mode4
ltx/gr_gr_cog/me.m02.d16:meMA.Ode1C11.ode	@ltx/gr_gr_cog/miscellanea:misc.Ode1
ltx/gr_gr_cog/me.m02.d16:meMA.Ode1C11.text	Δυνάμει, τοῦ Παναγίου Πνεύματος, ἡ δωδεκάριθμος, συγκροτηθεῖσα φάλαγξ καρτερῶς, δυσσεβούντων τὴν ἄθεον, καὶ πονηρὰν παράταξιν, ὡς νικηφόρος ἐτροπώσατο.
ltx/gr_gr_cog/me.m02.d16:meMA.Ode1C12.incipit	ᾘσχύνθη, τοῖς ἀθλοφόροις Μάρτυσιν, ὁ…
ltx/gr_gr_cog/me.m02.d16:meMA.Ode1C12.melody	@ltx/gr_gr_cog/he.h.m4:heHE.ThalassisToErythraion.name
ltx/gr_gr_cog/me.m02.d16:meMA.Ode1C12.mode	@ltx/gr_gr_cog/miscellanea:misc.Mode4
ltx/gr_gr_cog/me.m02.d16:meMA.Ode1C12.ode	@ltx/gr_gr_cog/miscellanea:misc.Ode1
ltx/gr_gr_cog/me.m02.d16:meMA.Ode1C12.text	ᾘσχύνθη, τοῖς ἀθλοφόροις Μάρτυσιν, ὁ δυσμενὴς προσβαλών· τὴν γὰρ αὐτοῦ φαρέτραν ὁ δεινός, ἐκκενώσας πικρότατα, καταβαλεῖν οὐκ ἴσχυσε, τῶν ἀριστέων τὴν στεῤῥότητα.
ltx/gr_gr_cog/me.m02.d16:meMA.Ode1C13.incipit	Μανίας, ἑλληνικῆς τὸ φρύαγμα, κατεπατήσατε…
ltx/gr_gr_cog/me.m02.d16:meMA.Ode1C13.melody	@ltx/gr_gr_cog/he.h.m4:heHE.ThalassisToErythraion.name
ltx/gr_gr_cog/me.m02.d16:meMA.Ode1C13.mode	@ltx/gr_gr_cog/miscellanea:misc.Mode4
ltx/gr_gr_cog/me.m02.d16:meMA.Ode1C13.ode	@ltx/gr_gr_cog/miscellanea:misc.Ode1
ltx/gr_gr_cog/me.m02.d16:meMA.Ode1C13.text	Μανίας, ἑλληνικῆς τὸ φρύαγμα, κατεπατήσατε, θείᾳ συνέσει Μάρτυρες Χριστοῦ, καὶ σοφίᾳ κοσμούμενοι, ᾗ ἀντιπεῖν οὐκ, ἴσχυσαν, οἱ εὐσεβέσιν ἀντικείμενοι.
ltx/gr_gr_cog/me.m02.d16:meMA.Ode1C14.incipit	Ὁ θεῖος, καὶ θεηγόρος Πάμφιλος…
ltx/gr_gr_cog/me.m02.d16:meMA.Ode1C14.melody	@ltx/gr_gr_cog/he.h.m4:heHE.ThalassisToErythraion.name
ltx/gr_gr_cog/me.m02.d16:meMA.Ode1C14.mode	@ltx/gr_gr_cog/miscellanea:misc.Mode4
ltx/gr_gr_cog/me.m02.d16:meMA.Ode1C14.ode	@ltx/gr_gr_cog/miscellanea:misc.Ode1
ltx/gr_gr_cog/me.m02.d16:meMA.Ode1C14.text	Ὁ θεῖος, καὶ θεηγόρος Πάμφιλος, ἐπαληθεύουσαν, πεπλουτηκὼς τὴν κλῆσιν ἀληθῶς, τῆς φιλίας τὸν σύνδεσμον, πρὸς τὸν Χριστὸν ἐτήρησε, μέχρι θανάτου ἀδιάῤῥηκτον.
ltx/gr_gr_cog/me.m02.d16:meMA.Ode1C1H.greekmelody	@ltx/gr_gr_cog/he.h.m4:heHE.ThalassisToErythraion.greekname
ltx/gr_gr_cog/me.m02.d16:meMA.Ode1C1H.incipit	@ltx/gr_gr_cog/he.h.m4:heHE.ThalassisToErythraion.incipit
ltx/gr_gr_cog/me.m02.d16:meMA.Ode1C1H.melody	@ltx/gr_gr_cog/he.h.m4:heHE.ThalassisToErythraion.melody
ltx/gr_gr_cog/me.m02.d16:meMA.Ode1C1H.mode	@ltx/gr_gr_cog/miscellanea:misc.Mode4
ltx/gr_gr_cog/me.m02.d16:meMA.Ode1C1H.ode	@ltx/gr_gr_cog/miscellanea:misc.Ode1
ltx/gr_gr_cog/me.m02.d16:meMA.Ode1C1H.text	@ltx/gr_gr_cog/he.h.m4:heHE.ThalassisToErythraion.text
ltx/gr_gr_cog/me.m02.d16:meMA.Ode1C1T.incipit	Νεφέλην, δικαιοσύνης Ἥλιον, ἡμῖν ἐκλάμψασαν…
ltx/gr_gr_cog/me.m02.d16:meMA.Ode1C1T.melody	@ltx/gr_gr_cog/he.h.m4:heHE.ThalassisToErythraion.name
ltx/gr_gr_cog/me.m02.d16:meMA.Ode1C1T.mode	@ltx/gr_gr_cog/miscellanea:misc.Mode4
ltx/gr_gr_cog/me.m02.d16:meMA.Ode1C1T.ode	@ltx/gr_gr_cog/miscellanea:misc.Ode1
ltx/gr_gr_cog/me.m02.d16:meMA.Ode1C1T.text	Νεφέλην, δικαιοσύνης Ἥλιον, ἡμῖν ἐκλάμψασαν τὸν τοῦ Πατρὸς Υἱὸν μονογενῆ, Θεοτόκε πανύμνητε, πανευσεβῶς δοξάζοντες, διαπαντός σε μακαρίζομεν.
ltx/gr_gr_cog/me.m02.d16:meMA.Ode3C11.greekmelody	@ltx/gr_gr_cog/he.h.m4:heHE.EffrainetaiEpiSoi.greekname
ltx/gr_gr_cog/me.m02.d16:meMA.Ode3C11.incipit	Διέπρεψας εὐσεβῶς, ἔργῳ καὶ λόγῳ…
ltx/gr_gr_cog/me.m02.d16:meMA.Ode3C11.melody	@ltx/gr_gr_cog/he.h.m4:heHE.EffrainetaiEpiSoi.name
ltx/gr_gr_cog/me.m02.d16:meMA.Ode3C11.mode	@ltx/gr_gr_cog/miscellanea:misc.Mode4
ltx/gr_gr_cog/me.m02.d16:meMA.Ode3C11.ode	@ltx/gr_gr_cog/miscellanea:misc.Ode3
ltx/gr_gr_cog/me.m02.d16:meMA.Ode3C11.text	Διέπρεψας εὐσεβῶς, ἔργῳ καὶ λόγῳ καὶ σεπτῷ χρίσματι, Μάρτυς Χριστοῦ Πάμφιλε, τῆς ἱερωσύνης θεόσοφε.
ltx/gr_gr_cog/me.m02.d16:meMA.Ode3C12.incipit	Ὡς λύρα πανευπρεπής, ὁμολογίας ἐμμελῶς…
ltx/gr_gr_cog/me.m02.d16:meMA.Ode3C12.melody	@ltx/gr_gr_cog/he.h.m4:heHE.EffrainetaiEpiSoi.name
ltx/gr_gr_cog/me.m02.d16:meMA.Ode3C12.mode	@ltx/gr_gr_cog/miscellanea:misc.Mode4
ltx/gr_gr_cog/me.m02.d16:meMA.Ode3C12.ode	@ltx/gr_gr_cog/miscellanea:misc.Ode3
ltx/gr_gr_cog/me.m02.d16:meMA.Ode3C12.text	Ὡς λύρα πανευπρεπής, ὁμολογίας ἐμμελῶς ᾄδουσα, φθόγγους Χριστοῦ Μάρτυρες, συγκεκροτημένοι γεγόνατε.
ltx/gr_gr_cog/me.m02.d16:meMA.Ode3C13.incipit	Δραμόντες πρὸς τὸν σκοπόν, τῆς…
ltx/gr_gr_cog/me.m02.d16:meMA.Ode3C13.melody	@ltx/gr_gr_cog/he.h.m4:heHE.EffrainetaiEpiSoi.name
ltx/gr_gr_cog/me.m02.d16:meMA.Ode3C13.mode	@ltx/gr_gr_cog/miscellanea:misc.Mode4
ltx/gr_gr_cog/me.m02.d16:meMA.Ode3C13.ode	@ltx/gr_gr_cog/miscellanea:misc.Ode3
ltx/gr_gr_cog/me.m02.d16:meMA.Ode3C13.text	Δραμόντες πρὸς τὸν σκοπόν, τῆς οὐρανίου καὶ σεπτῆς κλήσεως, ὡς νικηταὶ στέφανον, παρὰ τοῦ Δεσπότου εἰλήφατε.
ltx/gr_gr_cog/me.m02.d16:meMA.Ode3C1H.greekmelody	@ltx/gr_gr_cog/he.h.m4:heHE.EffrainetaiEpiSoi.greekname
ltx/gr_gr_cog/me.m02.d16:meMA.Ode3C1H.incipit	@ltx/gr_gr_cog/he.h.m4:heHE.EffrainetaiEpiSoi.incipit
ltx/gr_gr_cog/me.m02.d16:meMA.Ode3C1H.melody	@ltx/gr_gr_cog/he.h.m4:heHE.EffrainetaiEpiSoi.melody
ltx/gr_gr_cog/me.m02.d16:meMA.Ode3C1H.mode	@ltx/gr_gr_cog/miscellanea:misc.Mode4
ltx/gr_gr_cog/me.m02.d16:meMA.Ode3C1H.ode	@ltx/gr_gr_cog/miscellanea:misc.Ode3
ltx/gr_gr_cog/me.m02.d16:meMA.Ode3C1H.text	@ltx/gr_gr_cog/he.h.m4:heHE.EffrainetaiEpiSoi.text
ltx/gr_gr_cog/me.m02.d16:meMA.Ode3C1T.incipit	Ἐσκήνωσεν ἐν ἡμῖν, ὁ ἐν…
ltx/gr_gr_cog/me.m02.d16:meMA.Ode3C1T.melody	@ltx/gr_gr_cog/he.h.m4:heHE.EffrainetaiEpiSoi.name
ltx/gr_gr_cog/me.m02.d16:meMA.Ode3C1T.mode	@ltx/gr_gr_cog/miscellanea:misc.Mode4
ltx/gr_gr_cog/me.m02.d16:meMA.Ode3C1T.ode	@ltx/gr_gr_cog/miscellanea:misc.Ode3
ltx/gr_gr_cog/me.m02.d16:meMA.Ode3C1T.text	Ἐσκήνωσεν ἐν ἡμῖν, ὁ ἐν ὑψίστοις κατοικῶν Πάναγνε· ὑπερφυῶς σάρκα γάρ, ἐκ σοῦ προσλαβὼν ἠμφιάσατο.
ltx/gr_gr_cog/me.m02.d16:meMA.Ode3Kathisma1.greekmelody	@ltx/gr_gr_cog/he.a.m4:heAU.OYpsotheisEnToStavro.greekname
ltx/gr_gr_cog/me.m02.d16:meMA.Ode3Kathisma1.incipit	Κολαστηρίων φοβερῶν προκειμένων, οἱ τοῦ…
ltx/gr_gr_cog/me.m02.d16:meMA.Ode3Kathisma1.melody	@ltx/gr_gr_cog/he.a.m4:heAU.OYpsotheisEnToStavro.name
ltx/gr_gr_cog/me.m02.d16:meMA.Ode3Kathisma1.mode	@ltx/gr_gr_cog/miscellanea:misc.Mode4
ltx/gr_gr_cog/me.m02.d16:meMA.Ode3Kathisma1.text	Κολαστηρίων φοβερῶν προκειμένων, οἱ τοῦ Κυρίου Ἀθληταὶ οἱ γενναῖοι, ἐν ἀπτοήτῳ χαίροντες φρονήματι, τούτοις προσωμίλησαν, τῆς σαρκὸς ἀλογοῦντες· ὅθεν ἐκληρώσαντο, αἰωνίζουσαν δόξαν, ὑπὲρ ἡμῶν πρεσβεύοντες ἀεί, τῶν εὐφημούντων αὐτῶν τὰ παλαίσματα.
ltx/gr_gr_cog/me.m02.d16:meMA.Ode3KathismaSt.incipit	Τὸν ἐξ ἀνάρχου τοῦ Πατρὸς…
ltx/gr_gr_cog/me.m02.d16:meMA.Ode3KathismaSt.melody	@ltx/gr_gr_cog/he.a.m4:heAU.OYpsotheisEnToStavro.name
ltx/gr_gr_cog/me.m02.d16:meMA.Ode3KathismaSt.mode	@ltx/gr_gr_cog/miscellanea:misc.Mode4
ltx/gr_gr_cog/me.m02.d16:meMA.Ode3KathismaSt.text	Τὸν ἐξ ἀνάρχου τοῦ Πατρὸς γεννηθέντα, ἡ ἐπ ἐσχάτων σὲ σαρκὶ τετοκυῖα, ἐπὶ Σταυροῦ κρεμάμενον ὁρῶσά σε Χριστέ, οἴμοι! ποθεινότατε, Ἰησοῦ ἀνεβόα, πῶς ὁ δοξαζόμενος, ὡς Θεὸς ὑπʼ Ἀγγέλων, ὑπὸ ἀνόμων νῦν βροτῶν Υἱέ, θέλων σταυροῦσαι; Ὑμνῶ σε μακρόθυμε.
ltx/gr_gr_cog/me.m02.d16:meMA.Ode3KathismaT.incipit	Οὐ σιωπήσομεν ποτὲ Θεοτόκε, τοῦ…
ltx/gr_gr_cog/me.m02.d16:meMA.Ode3KathismaT.melody	@ltx/gr_gr_cog/he.a.m4:heAU.OYpsotheisEnToStavro.name
ltx/gr_gr_cog/me.m02.d16:meMA.Ode3KathismaT.mode	@ltx/gr_gr_cog/miscellanea:misc.Mode4
ltx/gr_gr_cog/me.m02.d16:meMA.Ode3KathismaT.text	Οὐ σιωπήσομεν ποτὲ Θεοτόκε, τοῦ εὐχαρίστως ἀνυμνεῖν ἐκ καρδίας, τὰ σὰ ἐλέη Δέσποινα οἱ δοῦλοί σου, κράζοντες καὶ λέγοντες, Παναγία Παρθένε, πρόφθασον καὶ λύτρωσαι, ἐξ ἐχθρῶν ἀοράτων, καὶ ἀναγκῶν καὶ πάσης ἀπειλῆς· σὺ γὰρ ὑπάρχεις, ἡμῶν ἡ ἀντίληψις.
ltx/gr_gr_cog/me.m02.d16:meMA.Ode4C11.greekmelody	@ltx/gr_gr_cog/he.h.m4:heHE.EparthentaSeIdousa.greekname
ltx/gr_gr_cog/me.m02.d16:meMA.Ode4C11.incipit	Κεκοσμημένη τοῖς θείοις τῶν Ἀποστόλων…
ltx/gr_gr_cog/me.m02.d16:meMA.Ode4C11.melody	@ltx/gr_gr_cog/he.h.m4:heHE.EparthentaSeIdousa.name
ltx/gr_gr_cog/me.m02.d16:meMA.Ode4C11.mode	@ltx/gr_gr_cog/miscellanea:misc.Mode4
ltx/gr_gr_cog/me.m02.d16:meMA.Ode4C11.ode	@ltx/gr_gr_cog/miscellanea:misc.Ode4
ltx/gr_gr_cog/me.m02.d16:meMA.Ode4C11.text	Κεκοσμημένη τοῖς θείοις τῶν Ἀποστόλων, καὶ Προφητῶν χαρίσμασιν ἡ χοροστασία, ὤφθη τῶν Μαρτύρων σου, ἡ τούτων ἰσάριθμος, Δέσποτα φανεῖσα προνοίᾳ σου.
ltx/gr_gr_cog/me.m02.d16:meMA.Ode4C12.incipit	Ἀπὸ ποικίλων ἀχθέντες πολιτευμάτων, ὡς…
ltx/gr_gr_cog/me.m02.d16:meMA.Ode4C12.melody	@ltx/gr_gr_cog/he.h.m4:heHE.EparthentaSeIdousa.name
ltx/gr_gr_cog/me.m02.d16:meMA.Ode4C12.mode	@ltx/gr_gr_cog/miscellanea:misc.Mode4
ltx/gr_gr_cog/me.m02.d16:meMA.Ode4C12.ode	@ltx/gr_gr_cog/miscellanea:misc.Ode4
ltx/gr_gr_cog/me.m02.d16:meMA.Ode4C12.text	Ἀπὸ ποικίλων ἀχθέντες πολιτευμάτων, ὡς ἐν βραχεῖ ὁλόκληρον τύπον ἐκκλησίας, σῴζειν ἠξιώθητε, συμφώνως κραυγάζοντες· Δόξα τῇ δυνάμει σου Κύριε.
ltx/gr_gr_cog/me.m02.d16:meMA.Ode4C13.incipit	Ῥαδιουργίαι τυράννων καὶ μεθοδεῖαι, τοὺς…
ltx/gr_gr_cog/me.m02.d16:meMA.Ode4C13.melody	@ltx/gr_gr_cog/he.h.m4:heHE.EparthentaSeIdousa.name
ltx/gr_gr_cog/me.m02.d16:meMA.Ode4C13.mode	@ltx/gr_gr_cog/miscellanea:misc.Mode4
ltx/gr_gr_cog/me.m02.d16:meMA.Ode4C13.ode	@ltx/gr_gr_cog/miscellanea:misc.Ode4
ltx/gr_gr_cog/me.m02.d16:meMA.Ode4C13.text	Ῥαδιουργίαι τυράννων καὶ μεθοδεῖαι, τοὺς Ἀθλητὰς οὐκ ἔκαμψαν οὐδὲ τῶν βασάνων, πόνοι ἐμαλάκισαν, προθύμως κραυγάζοντας· Δόξα τῇ δυνάμει σου Κύριε.
ltx/gr_gr_cog/me.m02.d16:meMA.Ode4C14.incipit	Ἰθυνόμενος παλάμῃ τῇ τοῦ Δεσπότου…
ltx/gr_gr_cog/me.m02.d16:meMA.Ode4C14.melody	@ltx/gr_gr_cog/he.h.m4:heHE.EparthentaSeIdousa.name
ltx/gr_gr_cog/me.m02.d16:meMA.Ode4C14.mode	@ltx/gr_gr_cog/miscellanea:misc.Mode4
ltx/gr_gr_cog/me.m02.d16:meMA.Ode4C14.ode	@ltx/gr_gr_cog/miscellanea:misc.Ode4
ltx/gr_gr_cog/me.m02.d16:meMA.Ode4C14.text	Ἰθυνόμενος παλάμῃ τῇ τοῦ Δεσπότου, τὸν διʼ αὐτὸν ἑκούσιον θάνατον ὑπέστη, δῆμος ὁ πανεύφημος, Μαρτύρων κραυγάζοντες· Δόξα τῇ δυνάμει σου Κύριε.
ltx/gr_gr_cog/me.m02.d16:meMA.Ode4C1H.greekmelody	@ltx/gr_gr_cog/he.h.m4:heHE.EparthentaSeIdousa.greekname
ltx/gr_gr_cog/me.m02.d16:meMA.Ode4C1H.incipit	@ltx/gr_gr_cog/he.h.m4:heHE.EparthentaSeIdousa.incipit
ltx/gr_gr_cog/me.m02.d16:meMA.Ode4C1H.melody	@ltx/gr_gr_cog/he.h.m4:heHE.EparthentaSeIdousa.melody
ltx/gr_gr_cog/me.m02.d16:meMA.Ode4C1H.mode	@ltx/gr_gr_cog/miscellanea:misc.Mode4
ltx/gr_gr_cog/me.m02.d16:meMA.Ode4C1H.ode	@ltx/gr_gr_cog/miscellanea:misc.Ode4
ltx/gr_gr_cog/me.m02.d16:meMA.Ode4C1H.text	@ltx/gr_gr_cog/he.h.m4:heHE.EparthentaSeIdousa.text
ltx/gr_gr_cog/me.m02.d16:meMA.Ode4C1T.incipit	Θεηγορίαις ἐνηχούμενοι Θεοτόκε, ταῖς περὶ…
ltx/gr_gr_cog/me.m02.d16:meMA.Ode4C1T.melody	@ltx/gr_gr_cog/he.h.m4:heHE.EparthentaSeIdousa.name
ltx/gr_gr_cog/me.m02.d16:meMA.Ode4C1T.mode	@ltx/gr_gr_cog/miscellanea:misc.Mode4
ltx/gr_gr_cog/me.m02.d16:meMA.Ode4C1T.ode	@ltx/gr_gr_cog/miscellanea:misc.Ode4
ltx/gr_gr_cog/me.m02.d16:meMA.Ode4C1T.text	Θεηγορίαις ἐνηχούμενοι Θεοτόκε, ταῖς περὶ σοῦ καὶ βλέποντες, τούτων τὰς ἐκβάσεις· Χαῖρέ σοι κραυγάζομεν, Παρθένε Πανάμωμε, οἱ λελυτρωμένοι τῷ τόκῳ σου.
ltx/gr_gr_cog/me.m02.d16:meMA.Ode5C11.greekmelody	@ltx/gr_gr_cog/he.h.m4:heHE.SyKyrieMouFos.greekname
ltx/gr_gr_cog/me.m02.d16:meMA.Ode5C11.incipit	Μὴ φέρων τοῖς ἐν γῇ…
ltx/gr_gr_cog/me.m02.d16:meMA.Ode5C11.melody	@ltx/gr_gr_cog/he.h.m4:heHE.SyKyrieMouFos.name
ltx/gr_gr_cog/me.m02.d16:meMA.Ode5C11.mode	@ltx/gr_gr_cog/miscellanea:misc.Mode4
ltx/gr_gr_cog/me.m02.d16:meMA.Ode5C11.ode	@ltx/gr_gr_cog/miscellanea:misc.Ode5
ltx/gr_gr_cog/me.m02.d16:meMA.Ode5C11.text	Μὴ φέρων τοῖς ἐν γῇ, προσανέχειν ὦ Πάμφιλε, τὴν ἔνθεον πολιτείαν, ἣν ἐκ βρέφους μετῆλθες, ἀθλήσει κατελάμπρυνας.
ltx/gr_gr_cog/me.m02.d16:meMA.Ode5C12.incipit	Ὁ θείᾳ πολιᾷ, καὶ συνέσει…
ltx/gr_gr_cog/me.m02.d16:meMA.Ode5C12.melody	@ltx/gr_gr_cog/he.h.m4:heHE.SyKyrieMouFos.name
ltx/gr_gr_cog/me.m02.d16:meMA.Ode5C12.mode	@ltx/gr_gr_cog/miscellanea:misc.Mode4
ltx/gr_gr_cog/me.m02.d16:meMA.Ode5C12.ode	@ltx/gr_gr_cog/miscellanea:misc.Ode5
ltx/gr_gr_cog/me.m02.d16:meMA.Ode5C12.text	Ὁ θείᾳ πολιᾷ, καὶ συνέσει κοσμούμενος, τῆς πόλεως τῆς Ἁγίας, ὡρμημένος Οὐάλης, ὡς Μάρτυς ἐστεφάνωται.
ltx/gr_gr_cog/me.m02.d16:meMA.Ode5C13.incipit	Νοῦν ἔχων τοῦ Χριστοῦ, ὡς…
ltx/gr_gr_cog/me.m02.d16:meMA.Ode5C13.melody	@ltx/gr_gr_cog/he.h.m4:heHE.SyKyrieMouFos.name
ltx/gr_gr_cog/me.m02.d16:meMA.Ode5C13.mode	@ltx/gr_gr_cog/miscellanea:misc.Mode4
ltx/gr_gr_cog/me.m02.d16:meMA.Ode5C13.ode	@ltx/gr_gr_cog/miscellanea:misc.Ode5
ltx/gr_gr_cog/me.m02.d16:meMA.Ode5C13.text	Νοῦν ἔχων τοῦ Χριστοῦ, ὡς τοῦ Παύλου ὁμώνυμος, πανεύφημε τῶν Μαρτύρων, τῷ στεφάνω νομίμως, ἀθλήσας κατηγλάϊσαι.
ltx/gr_gr_cog/me.m02.d16:meMA.Ode5C1H.greekmelody	@ltx/gr_gr_cog/he.h.m4:heHE.SyKyrieMouFos.greekname
ltx/gr_gr_cog/me.m02.d16:meMA.Ode5C1H.incipit	@ltx/gr_gr_cog/he.h.m4:heHE.SyKyrieMouFos.incipit
ltx/gr_gr_cog/me.m02.d16:meMA.Ode5C1H.melody	@ltx/gr_gr_cog/he.h.m4:heHE.SyKyrieMouFos.melody
ltx/gr_gr_cog/me.m02.d16:meMA.Ode5C1H.mode	@ltx/gr_gr_cog/miscellanea:misc.Mode4
ltx/gr_gr_cog/me.m02.d16:meMA.Ode5C1H.ode	@ltx/gr_gr_cog/miscellanea:misc.Ode5
ltx/gr_gr_cog/me.m02.d16:meMA.Ode5C1H.text	@ltx/gr_gr_cog/he.h.m4:heHE.SyKyrieMouFos.text
ltx/gr_gr_cog/me.m02.d16:meMA.Ode5C1T.incipit	Ἀνώρθωσας Ἁγνή, τὸ τῆς Εὔας…
ltx/gr_gr_cog/me.m02.d16:meMA.Ode5C1T.melody	@ltx/gr_gr_cog/he.h.m4:heHE.SyKyrieMouFos.name
ltx/gr_gr_cog/me.m02.d16:meMA.Ode5C1T.mode	@ltx/gr_gr_cog/miscellanea:misc.Mode4
ltx/gr_gr_cog/me.m02.d16:meMA.Ode5C1T.ode	@ltx/gr_gr_cog/miscellanea:misc.Ode5
ltx/gr_gr_cog/me.m02.d16:meMA.Ode5C1T.text	Ἀνώρθωσας Ἁγνή, τὸ τῆς Εὔας ὀλίσθημα, κυήσασα Θεὸν Λόγον, τὸν τῶν κατεῤῥαγμένων, τὴν πτῶσιν ἀνορθώσαντα.
ltx/gr_gr_cog/me.m02.d16:meMA.Ode6C11.greekmelody	@ltx/gr_gr_cog/he.h.m4:heHE.ThysoSoiMetaFonis.greekname
ltx/gr_gr_cog/me.m02.d16:meMA.Ode6C11.incipit	Ἐλπίσιν, αἰωνίου ζωῆς στηριζόμενοι, τὰς…
ltx/gr_gr_cog/me.m02.d16:meMA.Ode6C11.melody	@ltx/gr_gr_cog/he.h.m4:heHE.ThysoSoiMetaFonis.name
ltx/gr_gr_cog/me.m02.d16:meMA.Ode6C11.mode	@ltx/gr_gr_cog/miscellanea:misc.Mode4
ltx/gr_gr_cog/me.m02.d16:meMA.Ode6C11.ode	@ltx/gr_gr_cog/miscellanea:misc.Ode6
ltx/gr_gr_cog/me.m02.d16:meMA.Ode6C11.text	Ἐλπίσιν, αἰωνίου ζωῆς στηριζόμενοι, τὰς τῶν σωμάτων στρεβλώσεις, γεγηθότες ἔφερον οἱ γενναῖοι, οἱ τῶν θείων, ὑποφητῶν σου Σῶτερ ὁμώνυμοι.
ltx/gr_gr_cog/me.m02.d16:meMA.Ode6C12.incipit	Θανάτῳ, τὴν ζωὴν τὴν ἀμείνω…
ltx/gr_gr_cog/me.m02.d16:meMA.Ode6C12.melody	@ltx/gr_gr_cog/he.h.m4:heHE.ThysoSoiMetaFonis.name
ltx/gr_gr_cog/me.m02.d16:meMA.Ode6C12.mode	@ltx/gr_gr_cog/miscellanea:misc.Mode4
ltx/gr_gr_cog/me.m02.d16:meMA.Ode6C12.ode	@ltx/gr_gr_cog/miscellanea:misc.Ode6
ltx/gr_gr_cog/me.m02.d16:meMA.Ode6C12.text	Θανάτῳ, τὴν ζωὴν τὴν ἀμείνω ὠνήσαντο, ὁ Σαμουὴλ καὶ Ἠλίας, Δανιὴλ καὶ θεῖος Ἱερεμίας, καὶ πρὸς τούτοις, ὁ Ἡσαϊας ὁ μεγαλώνυμος.
ltx/gr_gr_cog/me.m02.d16:meMA.Ode6C13.incipit	Λαμπτῆρας, τῷ Θεῷ φαεινούς, νῦν…
ltx/gr_gr_cog/me.m02.d16:meMA.Ode6C13.melody	@ltx/gr_gr_cog/he.h.m4:heHE.ThysoSoiMetaFonis.name
ltx/gr_gr_cog/me.m02.d16:meMA.Ode6C13.mode	@ltx/gr_gr_cog/miscellanea:misc.Mode4
ltx/gr_gr_cog/me.m02.d16:meMA.Ode6C13.ode	@ltx/gr_gr_cog/miscellanea:misc.Ode6
ltx/gr_gr_cog/me.m02.d16:meMA.Ode6C13.text	Λαμπτῆρας, τῷ Θεῷ φαεινούς, νῦν ἡ Αἴγυπτος, ἐξανατέλλει ἡ πάλαι, βαθυτάτῳ σκότει καλυπτομένη, τῆς ἀγνοίας, θεογνωσίας φέγγος πλουτήσασα.
ltx/gr_gr_cog/me.m02.d16:meMA.Ode6C1H.greekmelody	@ltx/gr_gr_cog/he.h.m4:heHE.ThysoSoiMetaFonis.greekname
ltx/gr_gr_cog/me.m02.d16:meMA.Ode6C1H.incipit	@ltx/gr_gr_cog/he.h.m4:heHE.ThysoSoiMetaFonis.incipit
ltx/gr_gr_cog/me.m02.d16:meMA.Ode6C1H.melody	@ltx/gr_gr_cog/he.h.m4:heHE.ThysoSoiMetaFonis.melody
ltx/gr_gr_cog/me.m02.d16:meMA.Ode6C1H.mode	@ltx/gr_gr_cog/miscellanea:misc.Mode4
ltx/gr_gr_cog/me.m02.d16:meMA.Ode6C1H.ode	@ltx/gr_gr_cog/miscellanea:misc.Ode6
ltx/gr_gr_cog/me.m02.d16:meMA.Ode6C1H.text	@ltx/gr_gr_cog/he.h.m4:heHE.ThysoSoiMetaFonis.text
ltx/gr_gr_cog/me.m02.d16:meMA.Ode6C1T.incipit	Ὄρος σε, Δανιὴλ ἐθεώρει Πανάμωμε…
ltx/gr_gr_cog/me.m02.d16:meMA.Ode6C1T.melody	@ltx/gr_gr_cog/he.h.m4:heHE.ThysoSoiMetaFonis.name
ltx/gr_gr_cog/me.m02.d16:meMA.Ode6C1T.mode	@ltx/gr_gr_cog/miscellanea:misc.Mode4
ltx/gr_gr_cog/me.m02.d16:meMA.Ode6C1T.ode	@ltx/gr_gr_cog/miscellanea:misc.Ode6
ltx/gr_gr_cog/me.m02.d16:meMA.Ode6C1T.text	Ὄρος σε, Δανιὴλ ἐθεώρει Πανάμωμε, ἐξ οὗ ἐτμήθη ὁ λίθος, ὁ συντρίψας πᾶσαν πλάνης εἰκόνα, καὶ πληρώσας, θεογνωσίας πάντα τὰ πέρατα.
ltx/gr_gr_cog/me.m02.d16:meMA.Ode7C11.greekmelody	@ltx/gr_gr_cog/he.h.m4:heHE.EnTiKaminoAvramiaioi.greekname
ltx/gr_gr_cog/me.m02.d16:meMA.Ode7C11.incipit	Φαιδρῷ προσώπῳ, καὶ διανοίας καθαρότητι…
ltx/gr_gr_cog/me.m02.d16:meMA.Ode7C11.melody	@ltx/gr_gr_cog/he.h.m4:heHE.EnTiKaminoAvramiaioi.name
ltx/gr_gr_cog/me.m02.d16:meMA.Ode7C11.mode	@ltx/gr_gr_cog/miscellanea:misc.Mode4
ltx/gr_gr_cog/me.m02.d16:meMA.Ode7C11.ode	@ltx/gr_gr_cog/miscellanea:misc.Ode7
ltx/gr_gr_cog/me.m02.d16:meMA.Ode7C11.text	Φαιδρῷ προσώπῳ, καὶ διανοίας καθαρότητι, μάρτυς προορῶν τὴν μένουσάν σε χαράν, τῶν βασάνων κατεφρόνησας, καταξεόμενος ἀνηλεῶς, Παμμάκαρ Πορφύριε.
ltx/gr_gr_cog/me.m02.d16:meMA.Ode7C12.incipit	Ὁ Νεανίας, τρεῖς ἐν καμίνῳ…
ltx/gr_gr_cog/me.m02.d16:meMA.Ode7C12.melody	@ltx/gr_gr_cog/he.h.m4:heHE.EnTiKaminoAvramiaioi.name
ltx/gr_gr_cog/me.m02.d16:meMA.Ode7C12.mode	@ltx/gr_gr_cog/miscellanea:misc.Mode4
ltx/gr_gr_cog/me.m02.d16:meMA.Ode7C12.ode	@ltx/gr_gr_cog/miscellanea:misc.Ode7
ltx/gr_gr_cog/me.m02.d16:meMA.Ode7C12.text	Ὁ Νεανίας, τρεῖς ἐν καμίνῳ σώσας Θεός, οὗτος ἀθλοφόρε Μάκαρ σε διʼ αὐτόν, ἐν πυρὶ ὁλοκαυτούμενον, σαφῶς προσδέχεται, ὡς εὐωδέστατον θῦμα Πορφύριε.
ltx/gr_gr_cog/me.m02.d16:meMA.Ode7C13.incipit	Ῥώμῃ ψυχῆς τε, κεκοσμημένος καὶ…
ltx/gr_gr_cog/me.m02.d16:meMA.Ode7C13.melody	@ltx/gr_gr_cog/he.h.m4:heHE.EnTiKaminoAvramiaioi.name
ltx/gr_gr_cog/me.m02.d16:meMA.Ode7C13.mode	@ltx/gr_gr_cog/miscellanea:misc.Mode4
ltx/gr_gr_cog/me.m02.d16:meMA.Ode7C13.ode	@ltx/gr_gr_cog/miscellanea:misc.Ode7
ltx/gr_gr_cog/me.m02.d16:meMA.Ode7C13.text	Ῥώμῃ ψυχῆς τε, κεκοσμημένος καὶ τοῦ σώματος, πᾶσαν τοῦ τυράννου Σέλευκε τὴν ἰσχύν, καταβέβληκας πανεύφημε· Εὐλογημένος εἶ, ὁ Θεός, μου κραυγάζων καὶ Κύριος.
ltx/gr_gr_cog/me.m02.d16:meMA.Ode7C1H.greekmelody	@ltx/gr_gr_cog/he.h.m4:heHE.EnTiKaminoAvramiaioi.greekname
ltx/gr_gr_cog/me.m02.d16:meMA.Ode7C1H.incipit	@ltx/gr_gr_cog/he.h.m4:heHE.EnTiKaminoAvramiaioi.incipit
ltx/gr_gr_cog/me.m02.d16:meMA.Ode7C1H.melody	@ltx/gr_gr_cog/he.h.m4:heHE.EnTiKaminoAvramiaioi.melody
ltx/gr_gr_cog/me.m02.d16:meMA.Ode7C1H.mode	@ltx/gr_gr_cog/miscellanea:misc.Mode4
ltx/gr_gr_cog/me.m02.d16:meMA.Ode7C1H.ode	@ltx/gr_gr_cog/miscellanea:misc.Ode7
ltx/gr_gr_cog/me.m02.d16:meMA.Ode7C1H.text	@ltx/gr_gr_cog/he.h.m4:heHE.EnTiKaminoAvramiaioi.text
ltx/gr_gr_cog/me.m02.d16:meMA.Ode7C1T.incipit	Ὡς Θεοτόκος, ὡραιοτέρα πάσης κτίσεως…
ltx/gr_gr_cog/me.m02.d16:meMA.Ode7C1T.melody	@ltx/gr_gr_cog/he.h.m4:heHE.EnTiKaminoAvramiaioi.name
ltx/gr_gr_cog/me.m02.d16:meMA.Ode7C1T.mode	@ltx/gr_gr_cog/miscellanea:misc.Mode4
ltx/gr_gr_cog/me.m02.d16:meMA.Ode7C1T.ode	@ltx/gr_gr_cog/miscellanea:misc.Ode7
ltx/gr_gr_cog/me.m02.d16:meMA.Ode7C1T.text	Ὡς Θεοτόκος, ὡραιοτέρα πάσης κτίσεως ἔφυς· τοῦ Θεοῦ γὰρ γέγονας ἀληθῶς, ἐνδιαίτημα πανάγιον. Εὐλογημένη σύ, ἐν γυναιξὶ Πανάμωμε Δέσποινα.
ltx/gr_gr_cog/me.m02.d16:meMA.Ode8C11.greekmelody	@ltx/gr_gr_cog/he.h.m4:heHE.CheirasEkpetasasDaniil.greekname
ltx/gr_gr_cog/me.m02.d16:meMA.Ode8C11.incipit	Νόμοις σὺ πειθόμενος Χριστοῦ, ἀπέθου…
ltx/gr_gr_cog/me.m02.d16:meMA.Ode8C11.melody	@ltx/gr_gr_cog/he.h.m4:heHE.CheirasEkpetasasDaniil.name
ltx/gr_gr_cog/me.m02.d16:meMA.Ode8C11.mode	@ltx/gr_gr_cog/miscellanea:misc.Mode4
ltx/gr_gr_cog/me.m02.d16:meMA.Ode8C11.ode	@ltx/gr_gr_cog/miscellanea:misc.Ode8
ltx/gr_gr_cog/me.m02.d16:meMA.Ode8C11.text	Νόμοις σὺ πειθόμενος Χριστοῦ, ἀπέθου ἅπαντα Πάνσοφε Σέλευκε, ὡς στρατιώτης δὲ γέγονας, εὐσεβείας καὶ διδάσκαλος, καὶ τῶν χηρῶν καὶ ὀρφανῶν ἐπιμελούμενος, καὶ κραυγάζων· Πάντα τὰ ἔργα ὑμνεῖτε τὸν Κύριον.
ltx/gr_gr_cog/me.m02.d16:meMA.Ode8C12.incipit	Αἴγλῃ ἀναλάμπων νοητῇ, Πρεσβύτα ἔνδοξε…
ltx/gr_gr_cog/me.m02.d16:meMA.Ode8C12.melody	@ltx/gr_gr_cog/he.h.m4:heHE.CheirasEkpetasasDaniil.name
ltx/gr_gr_cog/me.m02.d16:meMA.Ode8C12.mode	@ltx/gr_gr_cog/miscellanea:misc.Mode4
ltx/gr_gr_cog/me.m02.d16:meMA.Ode8C12.ode	@ltx/gr_gr_cog/miscellanea:misc.Ode8
ltx/gr_gr_cog/me.m02.d16:meMA.Ode8C12.text	Αἴγλῃ ἀναλάμπων νοητῇ, Πρεσβύτα ἔνδοξε, Μάρτυς Θεόδουλε, καὶ δοῦλος γνήσιος γέγονας, τὸν Δεσπότην ἐκμιμούμενος, οὗ τὸν σταυρὸν ἐπιποθῶν, σταυρὸν ὑπέμεινας· Εὐλογεῖτε, πάντα τὰ ἔργα κραυγάζων τὸν Κύριον.
ltx/gr_gr_cog/me.m02.d16:meMA.Ode8C13.incipit	Ναὸς φανείς, Ἰουλιανέ, τοῦ θείου…
ltx/gr_gr_cog/me.m02.d16:meMA.Ode8C13.melody	@ltx/gr_gr_cog/he.h.m4:heHE.CheirasEkpetasasDaniil.name
ltx/gr_gr_cog/me.m02.d16:meMA.Ode8C13.mode	@ltx/gr_gr_cog/miscellanea:misc.Mode4
ltx/gr_gr_cog/me.m02.d16:meMA.Ode8C13.ode	@ltx/gr_gr_cog/miscellanea:misc.Ode8
ltx/gr_gr_cog/me.m02.d16:meMA.Ode8C13.text	Ναὸς φανείς, Ἰουλιανέ, τοῦ θείου Πνεύματος, τρόπων χρηστότητι, κατακεκόσμησαι, πλήρης μέν, εὐσεβείας καὶ πραότητος, πλήρης δὲ πίστεως ὀφθείς, ὁλοκαυτούμενος· Εὐλογεῖτε, πάντα τὰ ἔργα κραυγάζων τὸν Κύριον.
ltx/gr_gr_cog/me.m02.d16:meMA.Ode8C1H.greekmelody	@ltx/gr_gr_cog/he.h.m4:heHE.CheirasEkpetasasDaniil.greekname
ltx/gr_gr_cog/me.m02.d16:meMA.Ode8C1H.incipit	@ltx/gr_gr_cog/he.h.m4:heHE.CheirasEkpetasasDaniil.incipit
ltx/gr_gr_cog/me.m02.d16:meMA.Ode8C1H.melody	@ltx/gr_gr_cog/he.h.m4:heHE.CheirasEkpetasasDaniil.melody
ltx/gr_gr_cog/me.m02.d16:meMA.Ode8C1H.mode	@ltx/gr_gr_cog/miscellanea:misc.Mode4
ltx/gr_gr_cog/me.m02.d16:meMA.Ode8C1H.ode	@ltx/gr_gr_cog/miscellanea:misc.Ode8
ltx/gr_gr_cog/me.m02.d16:meMA.Ode8C1H.text	@ltx/gr_gr_cog/he.h.m4:heHE.CheirasEkpetasasDaniil.text
ltx/gr_gr_cog/me.m02.d16:meMA.Ode8C1T.incipit	Ἀμήτωρ ὁ Λόγος ἐκ Πατρὸς…
ltx/gr_gr_cog/me.m02.d16:meMA.Ode8C1T.melody	@ltx/gr_gr_cog/he.h.m4:heHE.CheirasEkpetasasDaniil.name
ltx/gr_gr_cog/me.m02.d16:meMA.Ode8C1T.mode	@ltx/gr_gr_cog/miscellanea:misc.Mode4
ltx/gr_gr_cog/me.m02.d16:meMA.Ode8C1T.ode	@ltx/gr_gr_cog/miscellanea:misc.Ode8
ltx/gr_gr_cog/me.m02.d16:meMA.Ode8C1T.text	Ἀμήτωρ ὁ Λόγος ἐκ Πατρὸς ὑπάρχων πρότερον, ἀπάτωρ γέγονεν, ἐκ σοῦ τὸ δεύτερον Πάναγνε, σαρκωθεὶς ὁ πρὶν ἀσώματος, διʼ εὐσπλαγχνίαν βουληθείς, σῶσαι τοὺς ψάλλοντας· Εὐλογεῖτε, πάντα τὰ ἔργα Κυρίου τὸν Κύριον.
ltx/gr_gr_cog/me.m02.d16:meMA.Ode9C11.greekmelody	@ltx/gr_gr_cog/he.h.m4:heHE.LithosAcheirotmitos.greekname
ltx/gr_gr_cog/me.m02.d16:meMA.Ode9C11.incipit	Μόνην τὴν οὐράνιον ἔχειν ζωὴν…
ltx/gr_gr_cog/me.m02.d16:meMA.Ode9C11.melody	@ltx/gr_gr_cog/he.h.m4:heHE.LithosAcheirotmitos.name
ltx/gr_gr_cog/me.m02.d16:meMA.Ode9C11.mode	@ltx/gr_gr_cog/miscellanea:misc.Mode4
ltx/gr_gr_cog/me.m02.d16:meMA.Ode9C11.ode	@ltx/gr_gr_cog/miscellanea:misc.Ode9
ltx/gr_gr_cog/me.m02.d16:meMA.Ode9C11.text	Μόνην τὴν οὐράνιον ἔχειν ζωὴν ποθοῦντες, Ἀθλοφόροι, τῶν τῆς ἐπικήρου καὶ φθαρτῆς, μεγαλοφρόνως κατεφρονήσατε, καὶ νῦν τροφῆς τῆς κρείττονος, καὶ τῆς μακαρίας ἀπολαύετε.
ltx/gr_gr_cog/me.m02.d16:meMA.Ode9C12.incipit	Ἔνδον νῦν τοῦ θείου λειμῶνος…
ltx/gr_gr_cog/me.m02.d16:meMA.Ode9C12.melody	@ltx/gr_gr_cog/he.h.m4:heHE.LithosAcheirotmitos.name
ltx/gr_gr_cog/me.m02.d16:meMA.Ode9C12.mode	@ltx/gr_gr_cog/miscellanea:misc.Mode4
ltx/gr_gr_cog/me.m02.d16:meMA.Ode9C12.ode	@ltx/gr_gr_cog/miscellanea:misc.Ode9
ltx/gr_gr_cog/me.m02.d16:meMA.Ode9C12.text	Ἔνδον νῦν τοῦ θείου λειμῶνος, περιχορεύετε προθύμως, τῶν ἀπαυγασμάτων τῇ πηγῇ, παρεστηκότες Μάρτυρες ἔνδοξοι, ἀφʼ ἧς ἀπαρυόμενοι, τὰς λαμπηδόνας καταλάμπεσθε.
ltx/gr_gr_cog/me.m02.d16:meMA.Ode9C13.incipit	Λόγῳ καθηράμενοι θείῳ, τὰς τῶν…
ltx/gr_gr_cog/me.m02.d16:meMA.Ode9C13.melody	@ltx/gr_gr_cog/he.h.m4:heHE.LithosAcheirotmitos.name
ltx/gr_gr_cog/me.m02.d16:meMA.Ode9C13.mode	@ltx/gr_gr_cog/miscellanea:misc.Mode4
ltx/gr_gr_cog/me.m02.d16:meMA.Ode9C13.ode	@ltx/gr_gr_cog/miscellanea:misc.Ode9
ltx/gr_gr_cog/me.m02.d16:meMA.Ode9C13.text	Λόγῳ καθηράμενοι θείῳ, τὰς τῶν ψυχῶν ὑμῶν κηλῖδας, καὶ τοὺς δερματίνους χιτῶνας, διὰ βασάνων ἀποδυσάμενοι, πανευπρεπὲς ἱμάτιον, τοῦ σωτηρίου ἠμφιάσασθε.
ltx/gr_gr_cog/me.m02.d16:meMA.Ode9C14.incipit	Πάντων τῶν ἐν πίστει τελούντων…
ltx/gr_gr_cog/me.m02.d16:meMA.Ode9C14.melody	@ltx/gr_gr_cog/he.h.m4:heHE.LithosAcheirotmitos.name
ltx/gr_gr_cog/me.m02.d16:meMA.Ode9C14.mode	@ltx/gr_gr_cog/miscellanea:misc.Mode4
ltx/gr_gr_cog/me.m02.d16:meMA.Ode9C14.ode	@ltx/gr_gr_cog/miscellanea:misc.Ode9
ltx/gr_gr_cog/me.m02.d16:meMA.Ode9C14.text	Πάντων τῶν ἐν πίστει τελούντων, τὴν παναοίδιμόν σου μνήμην, τῆς δωδεκαρίθμου χορείας, νῦν μεμνημένη, πρὸς τὸν Δεσπότην Χριστόν, τῆς μετὰ σοῦ σκηνώσεως ἀξιωθῆναι καθικέτευσον.
ltx/gr_gr_cog/me.m02.d16:meMA.Ode9C1H.greekmelody	@ltx/gr_gr_cog/he.h.m4:heHE.LithosAcheirotmitos.greekname
ltx/gr_gr_cog/me.m02.d16:meMA.Ode9C1H.incipit	@ltx/gr_gr_cog/he.h.m4:heHE.LithosAcheirotmitos.incipit
ltx/gr_gr_cog/me.m02.d16:meMA.Ode9C1H.melody	@ltx/gr_gr_cog/he.h.m4:heHE.LithosAcheirotmitos.melody
ltx/gr_gr_cog/me.m02.d16:meMA.Ode9C1H.mode	@ltx/gr_gr_cog/miscellanea:misc.Mode4
ltx/gr_gr_cog/me.m02.d16:meMA.Ode9C1H.ode	@ltx/gr_gr_cog/miscellanea:misc.Ode9
ltx/gr_gr_cog/me.m02.d16:meMA.Ode9C1H.text	@ltx/gr_gr_cog/he.h.m4:heHE.LithosAcheirotmitos.text
ltx/gr_gr_cog/me.m02.d16:meMA.Ode9C1T.incipit	Ὡς Μήτηρ τοῦ μόνου Δεσπότου…
ltx/gr_gr_cog/me.m02.d16:meMA.Ode9C1T.melody	@ltx/gr_gr_cog/he.h.m4:heHE.LithosAcheirotmitos.name
ltx/gr_gr_cog/me.m02.d16:meMA.Ode9C1T.mode	@ltx/gr_gr_cog/miscellanea:misc.Mode4
ltx/gr_gr_cog/me.m02.d16:meMA.Ode9C1T.ode	@ltx/gr_gr_cog/miscellanea:misc.Ode9
ltx/gr_gr_cog/me.m02.d16:meMA.Ode9C1T.text	Ὡς Μήτηρ τοῦ μόνου Δεσπότου, πάντων κτισμάτων ὑπερτέρα, πέφηνας Παρθένε Μαρία· διὸ πιστοί σε, πάντες Πανάμωμε, ἀεὶ ἐπαγαλλόμενοι, ἐν ὑμνῳδίαις μεγαλύνομεν.
ltx/gr_gr_cog/me.m02.d16:meMA.Oikos1.text	Ἰδοὺ ἐξέλαμψεν ἡ φωσφόρος, καὶ φωταυγὴς θεία μνήμη τοῦ στεῤῥοῦ ἀθλητοῦ, Παμφίλου τοῦ θεοκήρυκος, πάντων τὰς ὄψεις καὶ τὰς καρδίας καταυγάζουσα φέγγει τῷ ἀνεσπέρῳ. Περιχαρῶς, ὦ φιλέορτοι, δεῦτε συνδράμωμεν, καὶ τὴν τούτου θείαν ἡμέραν, ὡς καλὴν ἑορτὴν ἐνιαύσιον, τοῖς ᾄσμασι καταστέψωμεν, εὐλογοῦντες ὑμνοῦντες τὸν Κύριον, τὸν τοῦτον ἀξίως στεφανώσαντα· Πρεσβεύει γὰρ ἀπαύστως ὑπὲρ πάντων ἡμῶν.
ltx/gr_gr_cog/me.m02.d16:meVE.Apolytikion1ger.greekmelody	@ltx/gr_gr_cog/he.a.m3:heAU.TinOraiotita.greekname
ltx/gr_gr_cog/me.m02.d16:meVE.Apolytikion1ger.incipit	Τὴν δωδεάριθμον, Μαρτύρων φάλαγγα, ἀνευφημήσωμεν…
ltx/gr_gr_cog/me.m02.d16:meVE.Apolytikion1ger.melody	@ltx/gr_gr_cog/he.a.m3:heAU.TinOraiotita.name
ltx/gr_gr_cog/me.m02.d16:meVE.Apolytikion1ger.mode	@ltx/gr_gr_cog/miscellanea:misc.Mode3
ltx/gr_gr_cog/me.m02.d16:meVE.Apolytikion1ger.poet	@ltx/gr_gr_cog/poets:po.Gerasimou
ltx/gr_gr_cog/me.m02.d16:meVE.Apolytikion1ger.text	Τὴν δωδεάριθμον, Μαρτύρων φάλαγγα, ἀνευφημήσωμεν, ἐνθέοις ᾄσμασι, Πάμφιλον Παῦλον Σαμουήλ, Οὐάλεντα καὶ Ἠλίαν, Ἱερεμίαν Σέλευκον, Δανιὴλ καὶ Πορφύριον, Ἰουλιανὸν ὁμοῦ Ἠσαΐαν Θεόδουλον· αὐτοὶ γὰρ τὸν Δεσπότην τῶν ὅλων, πᾶσιν ἡμῖν ἐξιλεοῦνται.
ltx/gr_gr_cog/me.m02.d16:meVE.SticStavrotheotokion.greekmelody	@ltx/gr_gr_cog/he.a.m4:heAU.OsGennaionEnMartysi.greekname
ltx/gr_gr_cog/me.m02.d16:meVE.SticStavrotheotokion.incipit	@ltx/gr_gr_cog/me.m01.d19:meMA.AposStavrotheotokion.incipit
ltx/gr_gr_cog/me.m02.d16:meVE.SticStavrotheotokion.melody	@ltx/gr_gr_cog/he.a.m4:heAU.OsGennaionEnMartysi.name
ltx/gr_gr_cog/me.m02.d16:meVE.SticStavrotheotokion.mode	@ltx/gr_gr_cog/miscellanea:misc.Mode4
ltx/gr_gr_cog/me.m02.d16:meVE.SticStavrotheotokion.text	@ltx/gr_gr_cog/me.m01.d19:meMA.AposStavrotheotokion.text
ltx/gr_gr_cog/me.m02.d16:meVE.SticTheotokion.greekmelody	@ltx/gr_gr_cog/he.a.m4:heAU.OsGennaionEnMartysi.greekname
ltx/gr_gr_cog/me.m02.d16:meVE.SticTheotokion.incipit	@ltx/gr_gr_cog/me.m02.d04:meVE.SticTheotokion.incipit
ltx/gr_gr_cog/me.m02.d16:meVE.SticTheotokion.melody	@ltx/gr_gr_cog/he.a.m4:heAU.OsGennaionEnMartysi.name
ltx/gr_gr_cog/me.m02.d16:meVE.SticTheotokion.mode	@ltx/gr_gr_cog/miscellanea:misc.Mode4
ltx/gr_gr_cog/me.m02.d16:meVE.SticTheotokion.text	@ltx/gr_gr_cog/me.m02.d04:meVE.SticTheotokion.text
ltx/gr_gr_cog/me.m02.d16:meVE.Stichera01.greekmelody	@ltx/gr_gr_cog/he.a.m4:heAU.OsGennaionEnMartysi.greekname
ltx/gr_gr_cog/me.m02.d16:meVE.Stichera01.incipit	Ἀποστόλων ἰσάριθμοι, Ἀθλοφόροι γενόμενοι, λογισμὸν…
ltx/gr_gr_cog/me.m02.d16:meVE.Stichera01.melody	@ltx/gr_gr_cog/he.a.m4:heAU.OsGennaionEnMartysi.name
ltx/gr_gr_cog/me.m02.d16:meVE.Stichera01.mode	@ltx/gr_gr_cog/miscellanea:misc.Mode4
ltx/gr_gr_cog/me.m02.d16:meVE.Stichera01.text	Ἀποστόλων ἰσάριθμοι, Ἀθλοφόροι γενόμενοι, λογισμὸν ὁμόζηλον ἀνελάβετε, μὴ πτοηθέντες τὴν ἄθεον, τυράννων ὠμότητα, ἀλλʼ ἀνδρείως καὶ στεῤῥῶς, τὸν Σωτῆρα κηρύξαντες, ὑπεμείνατε, τῶν μελῶν τὰς στρεβλώσεις, τῇ ἐλπίδι τὰς μελλούσας ἀπολαύσεις, ἤδη καρπούμενοι Πάνσοφοι.
ltx/gr_gr_cog/me.m02.d16:meVE.Stichera02.incipit	Καρτερίᾳ νικήσαντες, τῶν ἀθέων τὴν…
ltx/gr_gr_cog/me.m02.d16:meVE.Stichera02.melody	@ltx/gr_gr_cog/he.a.m4:heAU.OsGennaionEnMartysi.name
ltx/gr_gr_cog/me.m02.d16:meVE.Stichera02.mode	@ltx/gr_gr_cog/miscellanea:misc.Mode4
ltx/gr_gr_cog/me.m02.d16:meVE.Stichera02.text	Καρτερίᾳ νικήσαντες, τῶν ἀθέων τὴν ἔνστασιν, καὶ ποικίλοις εἴδεσι προσπαλαίσαντες, κολαστηρίων τὸν στέφανον, ἀξίως ἐδέξασθε, ἐκ χειρὸς ζωαρχικῆς, κληρουχίαν ἀνώλεθρον, νῦν πλουτήσαντες, ἐν σκηναῖς αἰωνίοις τῷ Σωτῆρι, καὶ Δεσπότῃ τῶν ἁπάντων, συμβασιλεύοντες Ἔνδοξοι.
ltx/gr_gr_cog/me.m02.d16:meVE.Stichera03.incipit	Σὺν Παμφίλῳ θεόφρονι, καὶ Οὐάλεντι…
ltx/gr_gr_cog/me.m02.d16:meVE.Stichera03.melody	@ltx/gr_gr_cog/he.a.m4:heAU.OsGennaionEnMartysi.name
ltx/gr_gr_cog/me.m02.d16:meVE.Stichera03.mode	@ltx/gr_gr_cog/miscellanea:misc.Mode4
ltx/gr_gr_cog/me.m02.d16:meVE.Stichera03.text	Σὺν Παμφίλῳ θεόφρονι, καὶ Οὐάλεντι Σέλευκος, Δανιήλ, Θεόδουλος, Ἠσαΐας τε, Ἱερεμίας Ἠλίας τε, καὶ θεῖος Πορφύριος, Παῦλος, Ἰουλιανός, Σαμουὴλ ὁ θαυμάσιος, νῦν τιμάσθωσαν, ὑμνωδίαις ᾀσμάτων καὶ ποικίλοις, ἐγκωμίοις οἱ γενναῖοι, καὶ ἀεισέβαστοι Μάρτυρες.
