ltx/gr_gr_cog/le.go.mc.d215:lemcLI.Gospel.book_abbr	@ltx/gr_gr_cog/bible:Mark.abbr
ltx/gr_gr_cog/le.go.mc.d215:lemcLI.Gospel.book_string	@ltx/gr_gr_cog/bible:Mark.text
ltx/gr_gr_cog/le.go.mc.d215:lemcLI.Gospel.chapverse	5:1 – 20
ltx/gr_gr_cog/le.go.mc.d215:lemcLI.Gospel.incipit	Ἦλθεν ὁ Ἰησοῦς εἰς τὸ πέραν τῆς θαλάσσης…
ltx/gr_gr_cog/le.go.mc.d215:lemcLI.Gospel.text	Τῷ καιρῷ ἐκείνῳ ἦλθεν ὁ Ἰησοῦς εἰς τὸ πέραν τῆς θαλάσσης εἰς τὴν χώραν τῶν Γεργεσηνῶν. καὶ ἐξελθόντος αὐτοῦ ἐκ τοῦ πλοίου εὐθέως ἀπήντησεν αὐτῷ ἐκ τῶν μνημείων ἄνθρωπος ἐν πνεύματι ἀκαθάρτῳ, ὃς τὴν κατοίκησιν εἶχεν ἐν τοῖς μνήμασι, καὶ οὔτε ἁλύσεσιν οὐδεὶς ἠδύνατο αὐτὸν δῆσαι, διὰ τὸ αὐτὸν πολλάκις πέδαις καὶ ἁλύσεσι δεδέσθαι, καὶ διεσπάσθαι ὑπ᾿ αὐτοῦ τὰς ἁλύσεις καὶ τὰς πέδας συντετρῖφθαι, καὶ οὐδεὶς ἴσχυεν αὐτὸν δαμάσαι· καὶ διὰ παντὸς νυκτὸς καὶ ἡμέρας ἐν τοῖς μνήμασι καὶ ἐν τοῖς ὄρεσιν ἦν κράζων καὶ κατακόπτων ἑαυτὸν λίθοις. ἰδὼν δὲ τὸν Ἰησοῦν ἀπὸ μακρόθεν ἔδραμε καὶ προσεκύνησεν αὐτόν, καὶ κράξας φωνῇ μεγάλῃ λέγει· τί ἐμοὶ καὶ σοί, Ἰησοῦ, υἱὲ τοῦ Θεοῦ τοῦ ὑψίστου; ὁρκίζω σε τὸν Θεόν, μή με βασανίσῃς. ἔλεγε γὰρ αὐτῷ· ἔξελθε τὸ πνεῦμα τὸ ἀκάθαρτον ἐκ τοῦ ἀνθρώπου. καὶ ἐπηρώτα αὐτόν· τί ὄνομά σοι; καὶ ἀπεκρίθη λέγων· λεγεὼν ὄνομά μοι, ὅτι πολλοί ἐσμεν. καὶ παρεκάλει αὐτὸν πολλὰ ἵνα μὴ ἀποστείλῃ αὐτοὺς ἔξω τῆς χώρας. ἦν δὲ ἐκεῖ ἀγέλη χοίρων μεγάλη βοσκομένη πρὸς τῷ ὄρει· καὶ παρεκάλεσαν αὐτὸν πάντες οἱ δαίμονες λέγοντες· πέμψον ἡμᾶς εἰς τοὺς χοίρους, ἵνα εἰς αὐτοὺς εἰσέλθωμεν. καὶ ἐπέτρεψεν αὐτοῖς εὐθέως ὁ Ἰησοῦς. καὶ ἐξελθόντα τὰ πνεύματα τὰ ἀκάθαρτα εἰσῆλθον εἰς τοὺς χοίρους· καὶ ὥρμησεν ἡ ἀγέλη κατὰ τοῦ κρημνοῦ εἰς τὴν θάλασσαν· ἦσαν δὲ ὡς δισχίλιοι· καὶ ἐπνίγοντο ἐν τῇ θαλάσσῃ. καὶ οἱ βόσκοντες τοὺς χοίρους ἔφυγον καὶ ἀπήγγειλαν εἰς τὴν πόλιν καὶ εἰς τοὺς ἀγρούς· καὶ ἐξῆλθον ἰδεῖν τί ἐστι τὸ γεγονός. καὶ ἔρχονται πρὸς τὸν Ἰησοῦν, καὶ θεωροῦσι τὸν δαιμονιζόμενον καθήμενον καὶ ἱματισμένον καὶ σωφρονοῦντα, τὸν ἐσχηκότα τὸν λεγεῶνα, καὶ ἐφοβήθησαν. καὶ διηγήσαντο αὐτοῖς οἱ ἰδόντες πῶς ἐγένετο τῷ δαιμονιζομένῳ καὶ περὶ τῶν χοίρων. καὶ ἤρξαντο παρακαλεῖν αὐτὸν ἀπελθεῖν ἀπὸ τῶν ὁρίων αὐτῶν. καὶ ἐμβαίνοντος αὐτοῦ εἰς τὸ πλοῖον παρεκάλει αὐτὸν ὁ δαιμονισθεὶς ἵνα μετ᾿ αὐτοῦ ᾖ. καὶ οὐκ ἀφῆκεν αὐτόν, ἀλλὰ λέγει αὐτῷ· ὕπαγε εἰς τὸν οἶκόν σου πρὸς τοὺς σοὺς καὶ ἀνάγγειλον αὐτοῖς ὅσα σοι ὁ Κύριος πεποίηκε καὶ ἠλέησέ σε. καὶ ἀπῆλθε καὶ ἤρξατο κηρύσσειν ἐν τῇ Δεκαπόλει ὅσα ἐποίησεν αὐτῷ ὁ Ἰησοῦς, καὶ πάντες ἐθαύμαζον.
ltx/gr_gr_cog/le.go.mc.d215:lemcLI.Gospel.title	Τῇ Πέμπτῃ τῆς ΙΔʹ Ἑβδομάδος τοῦ Ματθαίου
ltx/gr_gr_cog/le.go.mc.d215:lemcLI.Gospel.title_abbr	Πέμπτῃ τῆς ΙΔʹ Ἑβδομάδος
ltx/gr_gr_cog/le.go.mc.d215:lemcLI.Gospel.version	@ltx/gr_gr_cog/properties:version.designation
