ltx/gr_gr_cog/sy.m10.d25:cl.syMA.commemoration01.text	[saint/com 1]
ltx/gr_gr_cog/sy.m10.d25:cl.syMA.commemoration02.text	[saint/com 2]
ltx/gr_gr_cog/sy.m10.d25:cl.syMA.commemoration03.text	[saint/com 3]
ltx/gr_gr_cog/sy.m10.d25:cl.syMA.commemoration04.text	[saint/com 4]
ltx/gr_gr_cog/sy.m10.d25:cl.syMA.commemoration05.text	[saint/com 5]
ltx/gr_gr_cog/sy.m10.d25:cl.syMA.commemoration06.text	[saint/com list]
ltx/gr_gr_cog/sy.m10.d25:syMA.commemoration01.couplet1.title	@ltx/gr_gr_cog/titles:ti.Verses
ltx/gr_gr_cog/sy.m10.d25:syMA.commemoration01.couplet1.verse1	Χριστοῦ καλάμους τοὺς Νοταρίους νόει,
ltx/gr_gr_cog/sy.m10.d25:syMA.commemoration01.couplet1.verse2	Εἰς αἷμα τὸ σφῶν ἐκ ξίφους βεβαμμένους.
ltx/gr_gr_cog/sy.m10.d25:syMA.commemoration01.narration.p01	Παύλου τοῦ Ὁμολογητοῦ πατριαρχοῦντος Κωνσταντινουπόλεως, μετὰ τὴν κοίμησιν Ἀλεξάνδρου, ἐπὶ τῆς βασιλείας Κωνσταντίου τοῦ Ἀρειανοῦ, ἐπεὶ αὐτὸς ὁ ἐν ἁγίοις Παῦλος, ὑπερόριος ἐν Ἀρμενίᾳ γενόμενος, τὸ μακάριον τέλος ἐδέξατο, ἀποπνιγεὶς παρὰ τῶν Ἀρειανῶν, καὶ αὐτοὶ δὲ οὗτοι οἱ Ἅγιοι διὰ τὴν ὀρθόδοξον πίστιν ἀναιροῦνται μαχαίρᾳ καὶ θάπτονται ἐν τῇ Μελανδησίᾳ πύλῃ, ἐν αὐτῇ τῇ Κωνσταντινουπόλει, τοποθεσίᾳ τοῦ Δευτέρου· ὧν τὸν ναὸν μετὰ ταῦτα ὁ ἐν ἁγίοις Πατὴρ ἡμῶν Ἰωάννης ὁ Χρυσόστομος ἐκ βάθρων ἤγειρεν.
ltx/gr_gr_cog/sy.m10.d25:syMA.commemoration01.single1	Πέμπτῃ Μαρκιανὸν τάμον εἰκάδι Μαρτύριόν τε.
ltx/gr_gr_cog/sy.m10.d25:syMA.commemoration01.text	Τῇ ΚΕʹ τοῦ αὐτοῦ μηνὸς μνήμη τῶν ἁγίων Μαρτύρων καὶ νοταρίων, Μαρκιανοῦ καὶ Μαρτυρίου.
ltx/gr_gr_cog/sy.m10.d25:syMA.commemoration02.couplet1.title	@ltx/gr_gr_cog/titles:ti.Verses
ltx/gr_gr_cog/sy.m10.d25:syMA.commemoration02.couplet1.verse1	Ἀναστάσιε, σοῦ δὲ τί γράψω χάριν,
ltx/gr_gr_cog/sy.m10.d25:syMA.commemoration02.couplet1.verse2	Χριστοῦ χάριν σπεύσαντος ἐκθανεῖν ξίφει;
ltx/gr_gr_cog/sy.m10.d25:syMA.commemoration02.narration.p01	Οὗτος αὐτόκλητος πρὸς τοὺς τυράννους ἀπελθὼν καὶ τὸν Χριστὸν ἀληθινὸν Θεὸν καὶ τοῦ παντὸς Ποιητὴν κηρύξας πεπαῤῥησιασμένως, ἐξέπληξεν ἅπαντας· καὶ τὸ ἀμετάθετον αὐτοῦ ἰδόντες, ξίφει τὴν κεφαλὴν αὐτοῦ ἀπέτεμον καὶ τῇ θαλάσσῃ ἐναπέῤῥιψαν. Γυνὴ δὲ εὐλαβὴς ἐκ τοῦ βυθοῦ ἀναλαβοῦσα τὸ ἅγιον αὐτοῦ λείψανον, μύροις καὶ ὀθονίοις εἱλήσασα, ἐν ᾧ κατεσκεύασεν εὐκτηρίῳ οἴκῳ ἐναπέθετο· οὗ τῇ καταθέσει πολλαὶ ἰάσεις γεγόνασι καὶ μέχρι τοῦ νῦν γίνονται, εἰς δόξαν τοῦ φιλανθρώπου Θεοῦ ἡμῶν.
ltx/gr_gr_cog/sy.m10.d25:syMA.commemoration02.text	Τῇ αὐτῇ ἡμέρᾳ μνήμη τοῦ ἁγίου Μάρτυρος Ἀναστασίου.
ltx/gr_gr_cog/sy.m10.d25:syMA.commemoration03.couplet1.title	@ltx/gr_gr_cog/titles:ti.Verses
ltx/gr_gr_cog/sy.m10.d25:syMA.commemoration03.couplet1.verse1	Οὐαλλερῖνος τὴν κάραν τμηθεὶς ξίφει,
ltx/gr_gr_cog/sy.m10.d25:syMA.commemoration03.couplet1.verse2	Τομῆς βραχείας, ὢ πόσα στέφη λάβοι!
ltx/gr_gr_cog/sy.m10.d25:syMA.commemoration03.text	Τῇ αὐτῇ ἡμέρᾳ μνήμη τοῦ ἁγίου Μάρτυρος Οὐαλλερίνου.
ltx/gr_gr_cog/sy.m10.d25:syMA.commemoration04.couplet1.title	@ltx/gr_gr_cog/titles:ti.Verses
ltx/gr_gr_cog/sy.m10.d25:syMA.commemoration04.couplet1.verse1	Εἰσδὺς τὸ πῦρ χόρευε, Μάρτυς Σαβῖνε,
ltx/gr_gr_cog/sy.m10.d25:syMA.commemoration04.couplet1.verse2	Θείαν χορείαν, πρόξενον θείου στέφους.
ltx/gr_gr_cog/sy.m10.d25:syMA.commemoration04.text	Τῇ αὐτῇ ἡμέρᾳ μνήμη τοῦ ἁγίου Μάρτυρος Σαβίνου.
ltx/gr_gr_cog/sy.m10.d25:syMA.commemoration05.couplet1.title	@ltx/gr_gr_cog/titles:ti.Verses
ltx/gr_gr_cog/sy.m10.d25:syMA.commemoration05.couplet1.verse1	Διττοῖς Ἀθληταῖς ἡ τιμωρία ξίφος,
ltx/gr_gr_cog/sy.m10.d25:syMA.commemoration05.couplet1.verse2	Ἡγουμένοις τρύφημα τὴν τιμωρίαν.
ltx/gr_gr_cog/sy.m10.d25:syMA.commemoration05.text	Τῇ αὐτῇ ἡμέρᾳ μνήμη τῶν ἁγίων Μαρτύρων Οὐαλλερίου καὶ Χρυσάφου.
ltx/gr_gr_cog/sy.m10.d25:syMA.commemoration06.couplet1.title	@ltx/gr_gr_cog/titles:ti.Verses
ltx/gr_gr_cog/sy.m10.d25:syMA.commemoration06.couplet1.verse1	Ποῦ σοι, Ταβιθά, Πέτρος; εἰ γὰρ ἦν πάλιν,
ltx/gr_gr_cog/sy.m10.d25:syMA.commemoration06.couplet1.verse2	Ἤγειρεν ἄν σε καὶ θανοῦσαν ὡς πάλαι.
ltx/gr_gr_cog/sy.m10.d25:syMA.commemoration06.text	Τῇ αὐτῇ ἡμέρᾳ μνήμη τῆς ἁγίας Ταβιθᾶς, ἣν ἀνέστησεν ἐκ νεκρῶν ὁ ἅγιος Ἀπόστολος Πέτρος.
ltx/gr_gr_cog/sy.m10.d25:syMA.lastline	Ταῖς τῶν Ἁγίων σου πρεσβείαις, ὁ Θεός, ἐλέησον ἡμᾶς. Ἀμήν.
