ltx/gr_gr_cog/me.m06.d25:meDA.commemoration.first	Ἀπόδοσις τῆς Ἑορτῆς τοῦ Προδρόμου.
ltx/gr_gr_cog/me.m06.d25:meDA.commemoration.first_name	
ltx/gr_gr_cog/me.m06.d25:meDA.commemoration.first_short	Ἀπόδοσις τῆς Ἑορτῆς τοῦ Προδρόμου.
ltx/gr_gr_cog/me.m06.d25:meDA.commemoration.first_title	@ltx/gr_gr_cog/titles:ti.Forerunner
ltx/gr_gr_cog/me.m06.d25:meDA.commemoration.full	Μνήμη τῆς Ἁγίας Ὁσιομάρτυρος Φεβρωνίας
ltx/gr_gr_cog/me.m06.d25:meDA.commemoration.second_name	
ltx/gr_gr_cog/me.m06.d25:meDA.commemoration.second_short	Μνήμη τῆς Ἁγίας Ὁσιομάρτυρος Φεβρωνίας
ltx/gr_gr_cog/me.m06.d25:meDA.commemoration.second_title	@ltx/gr_gr_cog/titles:ti.SaintW
ltx/gr_gr_cog/me.m06.d25:meDA.date	Τῌ ΚΕʹ ΙΟΥΝΙΟΥ
ltx/gr_gr_cog/me.m06.d25:meDA.dismissal	
ltx/gr_gr_cog/me.m06.d25:meDA.fordate	διὰ τὴν 25ην Ἰουνίου
ltx/gr_gr_cog/me.m06.d25:meDA.insert1	καὶ τῆς Ἁγίας Ὁσιομάρτυρος Φεβρωνίας,
ltx/gr_gr_cog/me.m06.d25:meDA.insert2	ἧς καὶ τὴν μνήμην ἐπιτελοῦμεν·
ltx/gr_gr_cog/me.m06.d25:meDA.note	
ltx/gr_gr_cog/me.m06.d25:meDA.pdfcoverdate	τῆς 25ης Ἰουνίου,
ltx/gr_gr_cog/me.m06.d25:meDA.pdfheaderdate	τῆς 25ης Ἰουνίου
ltx/gr_gr_cog/me.m06.d25:meHO.commemorations	
ltx/gr_gr_cog/me.m06.d25:meHO.note1	
ltx/gr_gr_cog/me.m06.d25:meHO.note2	
ltx/gr_gr_cog/me.m06.d25:meHO.number	
ltx/gr_gr_cog/me.m06.d25:meHO.rank	
ltx/gr_gr_cog/me.m06.d25:meLE.commemoration1	Τῆς Ἁγίας Ὁσιομάρτυρος καί Πολυάθλου Φεβρωνίας.
ltx/gr_gr_cog/me.m06.d25:meLE.commemoration2	
ltx/gr_gr_cog/me.m06.d25:meLI.Kontakion1.greekmelody	@ltx/gr_gr_cog/me.m06.d25:meMA.Kontakion1.greekmelody
ltx/gr_gr_cog/me.m06.d25:meLI.Kontakion1.incipit	@ltx/gr_gr_cog/me.m06.d25:meMA.Kontakion1.incipit
ltx/gr_gr_cog/me.m06.d25:meLI.Kontakion1.melody	@ltx/gr_gr_cog/me.m06.d25:meMA.Kontakion1.melody
ltx/gr_gr_cog/me.m06.d25:meLI.Kontakion1.mode	@ltx/gr_gr_cog/me.m06.d25:meMA.Kontakion1.mode
ltx/gr_gr_cog/me.m06.d25:meLI.Kontakion1.text	@ltx/gr_gr_cog/me.m06.d25:meMA.Kontakion1.text
ltx/gr_gr_cog/me.m06.d25:meLI.MM.CommunionHymn.text	@ltx/gr_gr_cog/properties:media.key
ltx/gr_gr_cog/me.m06.d25:meLI.Megalynarion.text	
ltx/gr_gr_cog/me.m06.d25:meMA.AposGlory.incipit	@ltx/gr_gr_cog/me.m06.d24:meSV.SticGlory.incipit
ltx/gr_gr_cog/me.m06.d25:meMA.AposGlory.melody	@ltx/gr_gr_cog/miscellanea:misc.Idiomelon
ltx/gr_gr_cog/me.m06.d25:meMA.AposGlory.mode	@ltx/gr_gr_cog/miscellanea:misc.Mode8
ltx/gr_gr_cog/me.m06.d25:meMA.AposGlory.text	@ltx/gr_gr_cog/me.m06.d24:meSV.SticGlory.text
ltx/gr_gr_cog/me.m06.d25:meMA.AposTheotokion.incipit	@ltx/gr_gr_cog/oc.m8.d5:ocMA.AposTheotokion.incipit
ltx/gr_gr_cog/me.m06.d25:meMA.AposTheotokion.melody	
ltx/gr_gr_cog/me.m06.d25:meMA.AposTheotokion.mode	@ltx/gr_gr_cog/miscellanea:misc.Mode8
ltx/gr_gr_cog/me.m06.d25:meMA.AposTheotokion.text	@ltx/gr_gr_cog/oc.m8.d5:ocMA.AposTheotokion.text
ltx/gr_gr_cog/me.m06.d25:meMA.C1.acrostic.notice1	οὗ ἡ Ἀκροστιχίς·
ltx/gr_gr_cog/me.m06.d25:meMA.C1.acrostic.text	Ὕμνοις σε μέλπω προσφόρως Φεβρωνία.
ltx/gr_gr_cog/me.m06.d25:meMA.C1.acrostic.title	Ὁ Κανὼν τῆς Ἁγίας,
ltx/gr_gr_cog/me.m06.d25:meMA.C1.poet	@ltx/gr_gr_cog/poets:po.Theofanous
ltx/gr_gr_cog/me.m06.d25:meMA.C1.title	@ltx/gr_gr_cog/titles:ti.CanonSaintW
ltx/gr_gr_cog/me.m06.d25:meMA.C1.verse	@ltx/gr_gr_cog/prayers:pr.verse_SaintW.text
ltx/gr_gr_cog/me.m06.d25:meMA.Exaposteilarion1.greekmelody	@ltx/gr_gr_cog/he.a.m2:heAU.GynaikesAkoutisthite.greekname
ltx/gr_gr_cog/me.m06.d25:meMA.Exaposteilarion1.incipit	@ltx/gr_gr_cog/me.m06.d24:meMA.Exaposteilarion1.incipit
ltx/gr_gr_cog/me.m06.d25:meMA.Exaposteilarion1.melody	@ltx/gr_gr_cog/he.a.m2:heAU.GynaikesAkoutisthite.name
ltx/gr_gr_cog/me.m06.d25:meMA.Exaposteilarion1.mode	@ltx/gr_gr_cog/miscellanea:misc.Mode2
ltx/gr_gr_cog/me.m06.d25:meMA.Exaposteilarion1.text	@ltx/gr_gr_cog/me.m06.d24:meMA.Exaposteilarion1.text
ltx/gr_gr_cog/me.m06.d25:meMA.Kontakion1.greekmelody	@ltx/gr_gr_cog/he.a.m3:heAU.IParthenosSimeron.greekname
ltx/gr_gr_cog/me.m06.d25:meMA.Kontakion1.incipit	@ltx/gr_gr_cog/me.m06.d24:meMA.Kontakion1.incipit
ltx/gr_gr_cog/me.m06.d25:meMA.Kontakion1.melody	@ltx/gr_gr_cog/he.a.m3:heAU.IParthenosSimeron.name
ltx/gr_gr_cog/me.m06.d25:meMA.Kontakion1.mode	@ltx/gr_gr_cog/miscellanea:misc.Mode3
ltx/gr_gr_cog/me.m06.d25:meMA.Kontakion1.text	@ltx/gr_gr_cog/me.m06.d24:meMA.Kontakion1.text
ltx/gr_gr_cog/me.m06.d25:meMA.Ode1C11.greekmelody	@ltx/gr_gr_cog/he.h.m8:heHE.YgranDiodefsas.greekname
ltx/gr_gr_cog/me.m06.d25:meMA.Ode1C11.incipit	Ὑπέρμαχε δόξης τῆς τοῦ Χριστοῦ…
ltx/gr_gr_cog/me.m06.d25:meMA.Ode1C11.melody	@ltx/gr_gr_cog/he.h.m8:heHE.YgranDiodefsas.name
ltx/gr_gr_cog/me.m06.d25:meMA.Ode1C11.mode	@ltx/gr_gr_cog/miscellanea:misc.Mode8
ltx/gr_gr_cog/me.m06.d25:meMA.Ode1C11.ode	@ltx/gr_gr_cog/miscellanea:misc.Ode1
ltx/gr_gr_cog/me.m06.d25:meMA.Ode1C11.text	Ὑπέρμαχε δόξης τῆς τοῦ Χριστοῦ, παράσχου μοι χάριν, Φεβρωνία καὶ φωτισμόν, τὴν σὴν εὐφημῆσαι φωτοφόρον, καὶ σεβασμίαν πανήγυριν ᾄσμασι.
ltx/gr_gr_cog/me.m06.d25:meMA.Ode1C12.incipit	Μελέτῃ θανάτου διηνεκεῖ, λαμπρύνασα Μάρτυς…
ltx/gr_gr_cog/me.m06.d25:meMA.Ode1C12.melody	@ltx/gr_gr_cog/he.h.m8:heHE.YgranDiodefsas.name
ltx/gr_gr_cog/me.m06.d25:meMA.Ode1C12.mode	@ltx/gr_gr_cog/miscellanea:misc.Mode8
ltx/gr_gr_cog/me.m06.d25:meMA.Ode1C12.ode	@ltx/gr_gr_cog/miscellanea:misc.Ode1
ltx/gr_gr_cog/me.m06.d25:meMA.Ode1C12.text	Μελέτῃ θανάτου διηνεκεῖ, λαμπρύνασα Μάρτυς, Φεβρωνία σοῦ τὴν ψυχήν, ἔδραμες πρὸς ὕψος μαρτυρίου, διὰ βασάνων πολλῶν προσαχθεῖσα Χριστῷ.
ltx/gr_gr_cog/me.m06.d25:meMA.Ode1C13.incipit	Νεώσασα πόνοις ἀσκητικοῖς, τὴν ἄρουραν…
ltx/gr_gr_cog/me.m06.d25:meMA.Ode1C13.melody	@ltx/gr_gr_cog/he.h.m8:heHE.YgranDiodefsas.name
ltx/gr_gr_cog/me.m06.d25:meMA.Ode1C13.mode	@ltx/gr_gr_cog/miscellanea:misc.Mode8
ltx/gr_gr_cog/me.m06.d25:meMA.Ode1C13.ode	@ltx/gr_gr_cog/miscellanea:misc.Ode1
ltx/gr_gr_cog/me.m06.d25:meMA.Ode1C13.text	Νεώσασα πόνοις ἀσκητικοῖς, τὴν ἄρουραν Μάρτυς, τῆς καρδίας σου τηλαυγῶς, Μαρτύρων ἐδρέψω τοὺς στεφάνους, ἀθλητικῶς τῷ Θεῷ ἡμῶν ᾄδουσα.
ltx/gr_gr_cog/me.m06.d25:meMA.Ode1C1T.incipit	Ὁ νεύματι πάντα δημιουργῶν, ἐκ…
ltx/gr_gr_cog/me.m06.d25:meMA.Ode1C1T.melody	@ltx/gr_gr_cog/he.h.m8:heHE.YgranDiodefsas.name
ltx/gr_gr_cog/me.m06.d25:meMA.Ode1C1T.mode	@ltx/gr_gr_cog/miscellanea:misc.Mode8
ltx/gr_gr_cog/me.m06.d25:meMA.Ode1C1T.ode	@ltx/gr_gr_cog/miscellanea:misc.Ode1
ltx/gr_gr_cog/me.m06.d25:meMA.Ode1C1T.text	Ὁ νεύματι πάντα δημιουργῶν, ἐκ σοῦ Θεομῆτορ, ἐσαρκώθη, ὃν εὐσεβῶς, ποθήσασα κόρη Φεβρωνία, μαρτυρικῶς ἐν αὐτῷ προσενήνεκται.
ltx/gr_gr_cog/me.m06.d25:meMA.Ode3C11.greekmelody	@ltx/gr_gr_cog/he.h.m8:heHE.SyEiToStereoma.greekname
ltx/gr_gr_cog/me.m06.d25:meMA.Ode3C11.incipit	Ἴσχυσας τῷ Πνεύματι, καταβαλεῖν ὀφρὺν…
ltx/gr_gr_cog/me.m06.d25:meMA.Ode3C11.melody	@ltx/gr_gr_cog/he.h.m8:heHE.SyEiToStereoma.name
ltx/gr_gr_cog/me.m06.d25:meMA.Ode3C11.mode	@ltx/gr_gr_cog/miscellanea:misc.Mode8
ltx/gr_gr_cog/me.m06.d25:meMA.Ode3C11.ode	@ltx/gr_gr_cog/miscellanea:misc.Ode3
ltx/gr_gr_cog/me.m06.d25:meMA.Ode3C11.text	Ἴσχυσας τῷ Πνεύματι, καταβαλεῖν ὀφρὺν ἔνδοξε, τυραννικήν, καὶ πολυθεΐας, Φεβρωνία τὸ ἄθεον.
ltx/gr_gr_cog/me.m06.d25:meMA.Ode3C12.incipit	Σὺ νῦν ἐστερέωσας, τῇ κραταιᾷ…
ltx/gr_gr_cog/me.m06.d25:meMA.Ode3C12.melody	@ltx/gr_gr_cog/he.h.m8:heHE.SyEiToStereoma.name
ltx/gr_gr_cog/me.m06.d25:meMA.Ode3C12.mode	@ltx/gr_gr_cog/miscellanea:misc.Mode8
ltx/gr_gr_cog/me.m06.d25:meMA.Ode3C12.ode	@ltx/gr_gr_cog/miscellanea:misc.Ode3
ltx/gr_gr_cog/me.m06.d25:meMA.Ode3C12.text	Σὺ νῦν ἐστερέωσας, τῇ κραταιᾷ χειρὶ Δέσποτα, μαρτυρικῶς, ἀγωνιζομένην, Φεβρωνίαν τὴν ἔνδοξον.
ltx/gr_gr_cog/me.m06.d25:meMA.Ode3C13.incipit	Σῶμά σου τεμνόμενον, ὑπὲρ Χριστοῦ…
ltx/gr_gr_cog/me.m06.d25:meMA.Ode3C13.melody	@ltx/gr_gr_cog/he.h.m8:heHE.SyEiToStereoma.name
ltx/gr_gr_cog/me.m06.d25:meMA.Ode3C13.mode	@ltx/gr_gr_cog/miscellanea:misc.Mode8
ltx/gr_gr_cog/me.m06.d25:meMA.Ode3C13.ode	@ltx/gr_gr_cog/miscellanea:misc.Ode3
ltx/gr_gr_cog/me.m06.d25:meMA.Ode3C13.text	Σῶμά σου τεμνόμενον, ὑπὲρ Χριστοῦ ἁγνὴ πάνσοφε, μαρτυρικῶς, σὺ τοῦ Παραδείσου, ἐγεώργεις ἀπόλαυσιν.
ltx/gr_gr_cog/me.m06.d25:meMA.Ode3C1T.incipit	Εὗρέ σε βοήθειαν, τὴν Θεομήτορα…
ltx/gr_gr_cog/me.m06.d25:meMA.Ode3C1T.melody	@ltx/gr_gr_cog/he.h.m8:heHE.SyEiToStereoma.name
ltx/gr_gr_cog/me.m06.d25:meMA.Ode3C1T.mode	@ltx/gr_gr_cog/miscellanea:misc.Mode8
ltx/gr_gr_cog/me.m06.d25:meMA.Ode3C1T.ode	@ltx/gr_gr_cog/miscellanea:misc.Ode3
ltx/gr_gr_cog/me.m06.d25:meMA.Ode3C1T.text	Εὗρέ σε βοήθειαν, τὴν Θεομήτορα Πάναγνε, ἡ εὐκλεής, Μάρτυς Φεβρωνία, καὶ τυράννους κατῄσχυνε.
ltx/gr_gr_cog/me.m06.d25:meMA.Ode3H.greekmelody	@ltx/gr_gr_cog/he.h.m8:heHE.SyEiToStereoma.greekname
ltx/gr_gr_cog/me.m06.d25:meMA.Ode3H.incipit	@ltx/gr_gr_cog/he.h.m8:heHE.SyEiToStereoma.incipit
ltx/gr_gr_cog/me.m06.d25:meMA.Ode3H.melody	@ltx/gr_gr_cog/he.h.m8:heHE.SyEiToStereoma.melody
ltx/gr_gr_cog/me.m06.d25:meMA.Ode3H.mode	@ltx/gr_gr_cog/miscellanea:misc.Mode8
ltx/gr_gr_cog/me.m06.d25:meMA.Ode3H.ode	@ltx/gr_gr_cog/miscellanea:misc.Ode3
ltx/gr_gr_cog/me.m06.d25:meMA.Ode3H.text	@ltx/gr_gr_cog/he.h.m8:heHE.SyEiToStereoma.text
ltx/gr_gr_cog/me.m06.d25:meMA.Ode3Kathisma1.greekmelody	@ltx/gr_gr_cog/he.a.m1:heAU.TonTafonSouSotir.greekname
ltx/gr_gr_cog/me.m06.d25:meMA.Ode3Kathisma1.incipit	Ὁ πάλαι ταῖς ῥοαῖς, Ἰορδάνου…
ltx/gr_gr_cog/me.m06.d25:meMA.Ode3Kathisma1.melody	@ltx/gr_gr_cog/he.a.m1:heAU.TonTafonSouSotir.name
ltx/gr_gr_cog/me.m06.d25:meMA.Ode3Kathisma1.mode	@ltx/gr_gr_cog/miscellanea:misc.Mode1
ltx/gr_gr_cog/me.m06.d25:meMA.Ode3Kathisma1.text	Ὁ πάλαι ταῖς ῥοαῖς, Ἰορδάνου βαπτίσας, τὴν κάθαρσιν παντός, Ἰωάννη τοῦ κόσμου, πολλοῖς με βυθιζόμενον, πλημμελήμασιν ἕλκυσον, καὶ ἀπόπλυνον, ἀπὸ παντοίας κηλῖδος, τὸν Φιλάνθρωπον· διὰ παντὸς ἱκετεύων, ὡς πρέσβυς εὐπροσδεκτος.
ltx/gr_gr_cog/me.m06.d25:meMA.Ode3Kathisma2.greekmelody	@ltx/gr_gr_cog/he.a.m1:heAU.TonTafonSouSotir.greekname
ltx/gr_gr_cog/me.m06.d25:meMA.Ode3Kathisma2.incipit	Ποθήσασα Χριστόν, τὸν ὡραῖον ἐν…
ltx/gr_gr_cog/me.m06.d25:meMA.Ode3Kathisma2.melody	@ltx/gr_gr_cog/he.a.m1:heAU.TonTafonSouSotir.name
ltx/gr_gr_cog/me.m06.d25:meMA.Ode3Kathisma2.mode	@ltx/gr_gr_cog/miscellanea:misc.Mode1
ltx/gr_gr_cog/me.m06.d25:meMA.Ode3Kathisma2.text	Ποθήσασα Χριστόν, τὸν ὡραῖον ἐν κάλλει, ἐχώρησας τομῶς, πρὸς μεγίστους ἀγῶνας, διʼ ὧν τὸν ἀρχέκακον, παντελῶς ἐθανάτωσας· οὗ με λύτρωσαι, τῶν πολυπλόκων παγίδων, ὁδηγοῦσά με, ταῖς σαῖς εὐχαῖς Φεβρωνία, πρὸς θείαν μετάνοιαν.
ltx/gr_gr_cog/me.m06.d25:meMA.Ode3KathismaT.incipit	Νηδύϊ μητρικῇ, Ἰωάννης σκιρτήσας, φερόμενον…
ltx/gr_gr_cog/me.m06.d25:meMA.Ode3KathismaT.melody	@ltx/gr_gr_cog/he.a.m1:heAU.TonTafonSouSotir.name
ltx/gr_gr_cog/me.m06.d25:meMA.Ode3KathismaT.mode	@ltx/gr_gr_cog/miscellanea:misc.Mode1
ltx/gr_gr_cog/me.m06.d25:meMA.Ode3KathismaT.text	Νηδύϊ μητρικῇ, Ἰωάννης σκιρτήσας, φερόμενον ἁγνή, τὸν Θεὸν ἐν γαστρί σου, ἐπέγνω θείᾳ χάριτι, καὶ πιστῶς προσεκύνησεν, ἀλλὰ δέομαι, σὺν τῷ Προδρόμῳ Παρθένε, καθικέτευσον, ὃν ἐσωμάτωσας Λόγον, σωθῆναι τὸν δοῦλόν σου.
ltx/gr_gr_cog/me.m06.d25:meMA.Ode4C11.greekmelody	@ltx/gr_gr_cog/he.h.m8:heHE.SyMouIschys.greekname
ltx/gr_gr_cog/me.m06.d25:meMA.Ode4C11.incipit	Μῶμος ἐν σοί, ὅλως οὐκ…
ltx/gr_gr_cog/me.m06.d25:meMA.Ode4C11.melody	@ltx/gr_gr_cog/he.h.m8:heHE.SyMouIschys.name
ltx/gr_gr_cog/me.m06.d25:meMA.Ode4C11.mode	@ltx/gr_gr_cog/miscellanea:misc.Mode8
ltx/gr_gr_cog/me.m06.d25:meMA.Ode4C11.ode	@ltx/gr_gr_cog/miscellanea:misc.Ode4
ltx/gr_gr_cog/me.m06.d25:meMA.Ode4C11.text	Μῶμος ἐν σοί, ὅλως οὐκ ἔστι πανεύφημε, Φεβρωνία· σὺ γὰρ ἀμφοτέρωθεν, τῷ λυτρωτῇ σου καὶ ἐραστῇ, τῷ πεποθημένῳ εὐαρεστῆσαι ἐσπούδασας, ἀσκήσεως ἐν πόνοις, καὶ μαρτύρων ἐν ἄθλοις, κοσμουμένη θεόφρον πανόλβιε.
ltx/gr_gr_cog/me.m06.d25:meMA.Ode4C12.incipit	Ἐξ ἁπαλῶν, Μάρτυς ὀνύχων ἐπόθησας…
ltx/gr_gr_cog/me.m06.d25:meMA.Ode4C12.melody	@ltx/gr_gr_cog/he.h.m8:heHE.SyMouIschys.name
ltx/gr_gr_cog/me.m06.d25:meMA.Ode4C12.mode	@ltx/gr_gr_cog/miscellanea:misc.Mode8
ltx/gr_gr_cog/me.m06.d25:meMA.Ode4C12.ode	@ltx/gr_gr_cog/miscellanea:misc.Ode4
ltx/gr_gr_cog/me.m06.d25:meMA.Ode4C12.text	Ἐξ ἁπαλῶν, Μάρτυς ὀνύχων ἐπόθησας, τῆς ἀγάπης, πηγὴν τὴν ἀέναον, τὴν ἐφετὴν πᾶσι λογικοῖς, ἧς ὀρεγομένη βασάνων πόνους ὑπέμεινας, πυρὶ φλογιζομένη, καὶ μελῶν στερουμένη, Φεβρωνία παρθένων τὸ καύχημα.
ltx/gr_gr_cog/me.m06.d25:meMA.Ode4C13.incipit	Λόγοις Θεοῦ, ἐντεθραμμένη θεόσοφε, τοῖς…
ltx/gr_gr_cog/me.m06.d25:meMA.Ode4C13.melody	@ltx/gr_gr_cog/he.h.m8:heHE.SyMouIschys.name
ltx/gr_gr_cog/me.m06.d25:meMA.Ode4C13.mode	@ltx/gr_gr_cog/miscellanea:misc.Mode8
ltx/gr_gr_cog/me.m06.d25:meMA.Ode4C13.ode	@ltx/gr_gr_cog/miscellanea:misc.Ode4
ltx/gr_gr_cog/me.m06.d25:meMA.Ode4C13.text	Λόγοις Θεοῦ, ἐντεθραμμένη θεόσοφε, τοῖς ποθοῦσι, λόγον τὸν σωτήριον τὰς ἱεράς, βίβλους ἱερῶς, ἐγχειριζομένη, ἐνθέως Μάρτυς ἐξήπλωσας, καὶ τῆς διδασκαλίας, τοὺς μισθοὺς ἐκομίσω, τῶν Μαρτύρων τὴν δόξαν πλουτήσασα.
ltx/gr_gr_cog/me.m06.d25:meMA.Ode4C1T.incipit	Πύλη φωτός, πᾶσιν ἐδείχθης Πανάμωμε…
ltx/gr_gr_cog/me.m06.d25:meMA.Ode4C1T.melody	@ltx/gr_gr_cog/he.h.m8:heHE.SyMouIschys.name
ltx/gr_gr_cog/me.m06.d25:meMA.Ode4C1T.mode	@ltx/gr_gr_cog/miscellanea:misc.Mode8
ltx/gr_gr_cog/me.m06.d25:meMA.Ode4C1T.ode	@ltx/gr_gr_cog/miscellanea:misc.Ode4
ltx/gr_gr_cog/me.m06.d25:meMA.Ode4C1T.text	Πύλη φωτός, πᾶσιν ἐδείχθης Πανάμωμε, τοῖς ἐν σκότει, φῶς τὸ ἀπερίγραπτον, περιγραπτῷ σώματι Χριστόν, τῆς δικαιοσύνης τὸν ἥλιον ἀπαστράψασα, οὗ νῦν ταῖς φρυκτωρίαις, Φεβρωνία ῥωσθεῖσα, τῶν Μαρτύρων τὸ κλέος ἐκτήσατο.
ltx/gr_gr_cog/me.m06.d25:meMA.Ode5C11.greekmelody	@ltx/gr_gr_cog/he.h.m8:heHE.InaTiMeAposo.greekname
ltx/gr_gr_cog/me.m06.d25:meMA.Ode5C11.incipit	Ὡραιώθης πορφύρᾳ, Μάρτυς ἐξ αἱμάτων…
ltx/gr_gr_cog/me.m06.d25:meMA.Ode5C11.melody	@ltx/gr_gr_cog/he.h.m8:heHE.InaTiMeAposo.name
ltx/gr_gr_cog/me.m06.d25:meMA.Ode5C11.mode	@ltx/gr_gr_cog/miscellanea:misc.Mode8
ltx/gr_gr_cog/me.m06.d25:meMA.Ode5C11.ode	@ltx/gr_gr_cog/miscellanea:misc.Ode5
ltx/gr_gr_cog/me.m06.d25:meMA.Ode5C11.text	Ὡραιώθης πορφύρᾳ, Μάρτυς ἐξ αἱμάτων σου ἐξυφανθείσῃ σοι, ἐγυμνώθης σῶμα, καὶ παθῶν τῶν χιτῶνα ἀπέῤῥιψας, πρὸ βημάτων στᾶσα, δικαστικῶν ὦ Φεβρωνία, τοῦ Χριστοῦ μιμουμένη τὴν γύμνωσιν.
ltx/gr_gr_cog/me.m06.d25:meMA.Ode5C12.incipit	Πυρωθεῖσα τῷ πόθῳ, Μάρτυς τοῦ…
ltx/gr_gr_cog/me.m06.d25:meMA.Ode5C12.melody	@ltx/gr_gr_cog/he.h.m8:heHE.InaTiMeAposo.name
ltx/gr_gr_cog/me.m06.d25:meMA.Ode5C12.mode	@ltx/gr_gr_cog/miscellanea:misc.Mode8
ltx/gr_gr_cog/me.m06.d25:meMA.Ode5C12.ode	@ltx/gr_gr_cog/miscellanea:misc.Ode5
ltx/gr_gr_cog/me.m06.d25:meMA.Ode5C12.text	Πυρωθεῖσα τῷ πόθῳ, Μάρτυς τοῦ νυμφίου σου τοῦ νοητοῦ τὴν ψυχήν, καὶ θελχθεῖσα τούτου, καλλοναῖς ἀκηράτοις ὑπέμεινας, τεμνομένη χεῖρας, καὶ τῶν πληγῶν τὰς ἀλγηδόνας, Φεβρωνία Μαρτύρων τὸ καύχημα.
ltx/gr_gr_cog/me.m06.d25:meMA.Ode5C13.incipit	Ῥοὴ τῶν σῶν αἱμάτων, τῆς…
ltx/gr_gr_cog/me.m06.d25:meMA.Ode5C13.melody	@ltx/gr_gr_cog/he.h.m8:heHE.InaTiMeAposo.name
ltx/gr_gr_cog/me.m06.d25:meMA.Ode5C13.mode	@ltx/gr_gr_cog/miscellanea:misc.Mode8
ltx/gr_gr_cog/me.m06.d25:meMA.Ode5C13.ode	@ltx/gr_gr_cog/miscellanea:misc.Ode5
ltx/gr_gr_cog/me.m06.d25:meMA.Ode5C13.text	Ῥοὴ τῶν σῶν αἱμάτων, τῆς πολυθεΐας τὴν φλόγα κατέσβεσεν, οἱ δέ σοι ὀδόντες, ἐκριζούμενοι πᾶσαν ἀνέσπασαν, τῶν εἰδώλων πλάνην, καὶ τῆς τρυφῆς σοι Φεβρωνία, τὴν αἰώνιον τέρψιν εἰργάσαντο.
ltx/gr_gr_cog/me.m06.d25:meMA.Ode5C1T.incipit	Οἱ σοὶ πόδες τμηθέντες, θείων…
ltx/gr_gr_cog/me.m06.d25:meMA.Ode5C1T.melody	@ltx/gr_gr_cog/he.h.m8:heHE.InaTiMeAposo.name
ltx/gr_gr_cog/me.m06.d25:meMA.Ode5C1T.mode	@ltx/gr_gr_cog/miscellanea:misc.Mode8
ltx/gr_gr_cog/me.m06.d25:meMA.Ode5C1T.ode	@ltx/gr_gr_cog/miscellanea:misc.Ode5
ltx/gr_gr_cog/me.m06.d25:meMA.Ode5C1T.text	Οἱ σοὶ πόδες τμηθέντες, θείων μαρτυρίων τὴν τρίβον διώδευσαν, καὶ πρὸς τὸν τεχθέντα, ἐκ Παρθένου ἁγίας μετέβησαν, ἐμπεριπατοῦντες, χαρμονικῶς ἐν Παραδείσῳ, Φεβρωνία παρθένε Θεόνυμφε.
ltx/gr_gr_cog/me.m06.d25:meMA.Ode6C11.greekmelody	@ltx/gr_gr_cog/he.h.m8:heHE.TinDeisinEkcheo.greekname
ltx/gr_gr_cog/me.m06.d25:meMA.Ode6C11.incipit	Σελήνου τοῦ δυσσεβοῦς ἡ ἄθεος…
ltx/gr_gr_cog/me.m06.d25:meMA.Ode6C11.melody	@ltx/gr_gr_cog/he.h.m8:heHE.TinDeisinEkcheo.name
ltx/gr_gr_cog/me.m06.d25:meMA.Ode6C11.mode	@ltx/gr_gr_cog/miscellanea:misc.Mode8
ltx/gr_gr_cog/me.m06.d25:meMA.Ode6C11.ode	@ltx/gr_gr_cog/miscellanea:misc.Ode6
ltx/gr_gr_cog/me.m06.d25:meMA.Ode6C11.text	Σελήνου τοῦ δυσσεβοῦς ἡ ἄθεος, καὶ θρασεῖα κατεβλήθη ὠμότης, τῆς τοῦ Θεοῦ, περὶ πάντων προνοίας, ἐκζητησάσης τὸ αἷμά σου, Ἔνδοξε, καὶ σέσωσται διὰ τῆς σῆς, καρτερίας ὁ θεῖος Λυσίμαχος.
ltx/gr_gr_cog/me.m06.d25:meMA.Ode6C12.incipit	Φωστῆρα θεολαμπῆ σε ἔδειξεν, ἡ…
ltx/gr_gr_cog/me.m06.d25:meMA.Ode6C12.melody	@ltx/gr_gr_cog/he.h.m8:heHE.TinDeisinEkcheo.name
ltx/gr_gr_cog/me.m06.d25:meMA.Ode6C12.mode	@ltx/gr_gr_cog/miscellanea:misc.Mode8
ltx/gr_gr_cog/me.m06.d25:meMA.Ode6C12.ode	@ltx/gr_gr_cog/miscellanea:misc.Ode6
ltx/gr_gr_cog/me.m06.d25:meMA.Ode6C12.text	Φωστῆρα θεολαμπῆ σε ἔδειξεν, ἡ σοφὴ καὶ θεοφόρος Βρυαίνη, ταῖς διδαχαῖς ἐκβιβάσασα κόρη, καὶ τῆς ἐλπίδος οὐδόλως διήμαρτε· παρέστησε γὰρ τῷ Χριστῷ, Φεβρωνία σε νύμφην ἀμόλυντον.
ltx/gr_gr_cog/me.m06.d25:meMA.Ode6C1T.incipit	Ὁ ἔμψυχος τοῦ Δεσπότου θάλαμος…
ltx/gr_gr_cog/me.m06.d25:meMA.Ode6C1T.melody	@ltx/gr_gr_cog/he.h.m8:heHE.TinDeisinEkcheo.name
ltx/gr_gr_cog/me.m06.d25:meMA.Ode6C1T.mode	@ltx/gr_gr_cog/miscellanea:misc.Mode8
ltx/gr_gr_cog/me.m06.d25:meMA.Ode6C1T.ode	@ltx/gr_gr_cog/miscellanea:misc.Ode6
ltx/gr_gr_cog/me.m06.d25:meMA.Ode6C1T.text	Ὁ ἔμψυχος τοῦ Δεσπότου θάλαμος, ὁ λαμπραῖς τῆς παρθενίας ἀκτῖσι, φωτοειδῶς, ὥσπερ κρίνον ἐκλάμπων, τῆς ἀκανθώδους ἐν μέσῳ συγχύσεως, ἡ πάναγνος καὶ εὐπρεπής, Θεοτόκος ἀξίως δοξάζεται.
ltx/gr_gr_cog/me.m06.d25:meMA.Ode6H.greekmelody	@ltx/gr_gr_cog/he.h.m8:heHE.TinDeisinEkcheo.greekname
ltx/gr_gr_cog/me.m06.d25:meMA.Ode6H.incipit	@ltx/gr_gr_cog/he.h.m8:heHE.TinDeisinEkcheo.incipit
ltx/gr_gr_cog/me.m06.d25:meMA.Ode6H.melody	@ltx/gr_gr_cog/he.h.m8:heHE.TinDeisinEkcheo.melody
ltx/gr_gr_cog/me.m06.d25:meMA.Ode6H.mode	@ltx/gr_gr_cog/miscellanea:misc.Mode8
ltx/gr_gr_cog/me.m06.d25:meMA.Ode6H.ode	@ltx/gr_gr_cog/miscellanea:misc.Ode6
ltx/gr_gr_cog/me.m06.d25:meMA.Ode6H.text	@ltx/gr_gr_cog/he.h.m8:heHE.TinDeisinEkcheo.text
ltx/gr_gr_cog/me.m06.d25:meMA.Ode7C11.greekmelody	@ltx/gr_gr_cog/he.h.m8:heHE.PaidesEvraion.greekname
ltx/gr_gr_cog/me.m06.d25:meMA.Ode7C11.incipit	Ῥεῖθρα πηγάζεις ἰαμάτων, τοῖς προστρέχουσιν…
ltx/gr_gr_cog/me.m06.d25:meMA.Ode7C11.melody	@ltx/gr_gr_cog/he.h.m8:heHE.PaidesEvraion.name
ltx/gr_gr_cog/me.m06.d25:meMA.Ode7C11.mode	@ltx/gr_gr_cog/miscellanea:misc.Mode8
ltx/gr_gr_cog/me.m06.d25:meMA.Ode7C11.ode	@ltx/gr_gr_cog/miscellanea:misc.Ode7
ltx/gr_gr_cog/me.m06.d25:meMA.Ode7C11.text	Ῥεῖθρα πηγάζεις ἰαμάτων, τοῖς προστρέχουσιν ἐν πίστει τῷ ναῷ σου, Φεβρωνία σεμνή, καὶ τῷ Χριστῷ βοῶσιν· Εὐλογητὸς εἶ Κύριε, ὁ Θεὸς εἰς τοὺς αἰῶνας.
ltx/gr_gr_cog/me.m06.d25:meMA.Ode7C12.incipit	Ὢ τῆς καλής σου πραγματείας!…
ltx/gr_gr_cog/me.m06.d25:meMA.Ode7C12.melody	@ltx/gr_gr_cog/he.h.m8:heHE.PaidesEvraion.name
ltx/gr_gr_cog/me.m06.d25:meMA.Ode7C12.mode	@ltx/gr_gr_cog/miscellanea:misc.Mode8
ltx/gr_gr_cog/me.m06.d25:meMA.Ode7C12.ode	@ltx/gr_gr_cog/miscellanea:misc.Ode7
ltx/gr_gr_cog/me.m06.d25:meMA.Ode7C12.text	Ὢ τῆς καλής σου πραγματείας! σαρκὸς αἵματος θεόφρον ἀντηλλάξω, βασιλείαν Θεοῦ, πανεύφημε βοῶσα· Εὐλογητὸς εἶ Κύριε, ὁ Θεὸς εἰς τοὺς αἰῶνας.
ltx/gr_gr_cog/me.m06.d25:meMA.Ode7C1T.incipit	Στίφει παρθένων συγχορεύεις, ἀξιάγαστε παρθένε…
ltx/gr_gr_cog/me.m06.d25:meMA.Ode7C1T.melody	@ltx/gr_gr_cog/he.h.m8:heHE.PaidesEvraion.name
ltx/gr_gr_cog/me.m06.d25:meMA.Ode7C1T.mode	@ltx/gr_gr_cog/miscellanea:misc.Mode8
ltx/gr_gr_cog/me.m06.d25:meMA.Ode7C1T.ode	@ltx/gr_gr_cog/miscellanea:misc.Ode7
ltx/gr_gr_cog/me.m06.d25:meMA.Ode7C1T.text	Στίφει παρθένων συγχορεύεις, ἀξιάγαστε παρθένε Φεβρωνία, τῇ Παρθένῳ καὶ Θεομήτορι βοῶσα· Εὐλογημένος πάναγνε, ὁ καρπὸς τῆς σῆς κοιλίας.
ltx/gr_gr_cog/me.m06.d25:meMA.Ode8C11.greekmelody	@ltx/gr_gr_cog/he.h.m8:heHE.EptaplasiosKaminon.greekname
ltx/gr_gr_cog/me.m06.d25:meMA.Ode8C11.incipit	Φωτοφανῶς ἡ μνήμη σου, Φεβρωνία…
ltx/gr_gr_cog/me.m06.d25:meMA.Ode8C11.melody	@ltx/gr_gr_cog/he.h.m8:heHE.EptaplasiosKaminon.name
ltx/gr_gr_cog/me.m06.d25:meMA.Ode8C11.mode	@ltx/gr_gr_cog/miscellanea:misc.Mode8
ltx/gr_gr_cog/me.m06.d25:meMA.Ode8C11.ode	@ltx/gr_gr_cog/miscellanea:misc.Ode8
ltx/gr_gr_cog/me.m06.d25:meMA.Ode8C11.text	Φωτοφανῶς ἡ μνήμη σου, Φεβρωνία τελεῖται νῦν, ταῖς φωτοειδέσιν ἀστραπαῖς πυρσεύουσα· φωτὶ γὰρ ὡμίλησας, καὶ φωτοφόρος γέγονας, τὸν φωτοποιόν, καὶ φωτοδότην βοῶσα· οἱ Παῖδες εὐλογεῖτε, ἱερεῖς ἀνυμνεῖτε, λαὸς ὑπερυψοῦτε, εἰς πάντας τοὺς αἰῶνας.
ltx/gr_gr_cog/me.m06.d25:meMA.Ode8C12.incipit	Ἐθαυμαστώθης πρότερον, ἐν ἀσκήσει πανεύφημε…
ltx/gr_gr_cog/me.m06.d25:meMA.Ode8C12.melody	@ltx/gr_gr_cog/he.h.m8:heHE.EptaplasiosKaminon.name
ltx/gr_gr_cog/me.m06.d25:meMA.Ode8C12.mode	@ltx/gr_gr_cog/miscellanea:misc.Mode8
ltx/gr_gr_cog/me.m06.d25:meMA.Ode8C12.ode	@ltx/gr_gr_cog/miscellanea:misc.Ode8
ltx/gr_gr_cog/me.m06.d25:meMA.Ode8C12.text	Ἐθαυμαστώθης πρότερον, ἐν ἀσκήσει πανεύφημε, καὶ μαρτυρικῶς, κατεκοσμήθης ὕστερον· ὀπίσω γὰρ ἔδραμες, τοῦ ἐραστοῦ νεᾶνις φαιδρά, καὶ σοῦ τοὺς μαστούς, τοὺς ἀγαθοὺς ὑπὲρ οἶνον, ἐτμήθης Φεβρωνία, ὑπὲρ τῆς εὐσεβείας· ὀσμῇ δέ σου τῶν μύρων, πιστοὺς εὐωδιάζεις.
ltx/gr_gr_cog/me.m06.d25:meMA.Ode8C13.incipit	Βεβαρυμμένος πταίσμασι, Φεβρωνία πανεύφημε, καὶ…
ltx/gr_gr_cog/me.m06.d25:meMA.Ode8C13.melody	@ltx/gr_gr_cog/he.h.m8:heHE.EptaplasiosKaminon.name
ltx/gr_gr_cog/me.m06.d25:meMA.Ode8C13.mode	@ltx/gr_gr_cog/miscellanea:misc.Mode8
ltx/gr_gr_cog/me.m06.d25:meMA.Ode8C13.ode	@ltx/gr_gr_cog/miscellanea:misc.Ode8
ltx/gr_gr_cog/me.m06.d25:meMA.Ode8C13.text	Βεβαρυμμένος πταίσμασι, Φεβρωνία πανεύφημε, καὶ ταῖς τρικυμίαις, τῶν παθῶν κυκλούμενος, προσφεύγω τῇ σκέπῃ σου, τῶν ἀμφοτέρων λύσιν ζητῶν, ἀλλʼ ὡς θαυμαστή, καὶ ἐκλεκτὴ τῷ Δεσπότῃ, βοῶντα μὴ παρίδῃς, ἀλλά με σαῖς πρεσβείαις, ἐξάρπασον θεόφρον, ἐκ βρόχων ψυχοφθόρων.
ltx/gr_gr_cog/me.m06.d25:meMA.Ode8C1T.incipit	Ῥητορευόντων γλῶσσαί σε, ἀνυμνῆσαι οὐ…
ltx/gr_gr_cog/me.m06.d25:meMA.Ode8C1T.melody	@ltx/gr_gr_cog/he.h.m8:heHE.EptaplasiosKaminon.name
ltx/gr_gr_cog/me.m06.d25:meMA.Ode8C1T.mode	@ltx/gr_gr_cog/miscellanea:misc.Mode8
ltx/gr_gr_cog/me.m06.d25:meMA.Ode8C1T.ode	@ltx/gr_gr_cog/miscellanea:misc.Ode8
ltx/gr_gr_cog/me.m06.d25:meMA.Ode8C1T.text	Ῥητορευόντων γλῶσσαί σε, ἀνυμνῆσαι οὐ σθένουσιν, ὦ Θεογεννῆτορ, Μαριὰμ Θεόνυμφε· Θεὸν γὰρ ἐγέννησας, τὸν ἐπὶ πάντων Κόρη ἁγνή, ἐκ παρθενικῆς, ἀπειρογάμου νηδύος, ᾧ νῦν ἡ Φεβρωνία, μελῳδοῦσα κραυγάζει· Λαὸς ὑπερυψοῦτε, εἰς πάντας τοὺς αἰῶνας.
ltx/gr_gr_cog/me.m06.d25:meMA.Ode8H.greekmelody	@ltx/gr_gr_cog/he.h.m8:heHE.EptaplasiosKaminon.greekname
ltx/gr_gr_cog/me.m06.d25:meMA.Ode8H.incipit	@ltx/gr_gr_cog/he.h.m8:heHE.EptaplasiosKaminon.incipit
ltx/gr_gr_cog/me.m06.d25:meMA.Ode8H.melody	@ltx/gr_gr_cog/he.h.m8:heHE.EptaplasiosKaminon.melody
ltx/gr_gr_cog/me.m06.d25:meMA.Ode8H.mode	@ltx/gr_gr_cog/miscellanea:misc.Mode8
ltx/gr_gr_cog/me.m06.d25:meMA.Ode8H.ode	@ltx/gr_gr_cog/miscellanea:misc.Ode8
ltx/gr_gr_cog/me.m06.d25:meMA.Ode8H.text	@ltx/gr_gr_cog/he.h.m8:heHE.EptaplasiosKaminon.text
ltx/gr_gr_cog/me.m06.d25:meMA.Ode9C11.greekmelody	@ltx/gr_gr_cog/he.h.m8:heHE.ExestiEpiTouto.greekname
ltx/gr_gr_cog/me.m06.d25:meMA.Ode9C11.incipit	Ὦ θεία τοῦ Δεσπότου περιστερά…
ltx/gr_gr_cog/me.m06.d25:meMA.Ode9C11.melody	@ltx/gr_gr_cog/he.h.m8:heHE.ExestiEpiTouto.name
ltx/gr_gr_cog/me.m06.d25:meMA.Ode9C11.mode	@ltx/gr_gr_cog/miscellanea:misc.Mode8
ltx/gr_gr_cog/me.m06.d25:meMA.Ode9C11.ode	@ltx/gr_gr_cog/miscellanea:misc.Ode9
ltx/gr_gr_cog/me.m06.d25:meMA.Ode9C11.text	Ὦ θεία τοῦ Δεσπότου περιστερά, περιηργυρωμένη λαμπρότητι, παρθενικῇ, σῶμα λαμπρυνθεῖσα ἀσκητικῶς, κεχρυσωμένη πτέρυγας, ταῖς χλωροειδέσι μαρμαρυγαῖς, τῆς σῆς ὁμολογίας, καὶ θείων σου αἱμάτων, τοὺς σὲ ὑμνοῦντας καταφαίδρυνον.
ltx/gr_gr_cog/me.m06.d25:meMA.Ode9C12.incipit	Νοῒ προσομιλοῦσα γυμνῷ τῷ νῷ…
ltx/gr_gr_cog/me.m06.d25:meMA.Ode9C12.melody	@ltx/gr_gr_cog/he.h.m8:heHE.ExestiEpiTouto.name
ltx/gr_gr_cog/me.m06.d25:meMA.Ode9C12.mode	@ltx/gr_gr_cog/miscellanea:misc.Mode8
ltx/gr_gr_cog/me.m06.d25:meMA.Ode9C12.ode	@ltx/gr_gr_cog/miscellanea:misc.Ode9
ltx/gr_gr_cog/me.m06.d25:meMA.Ode9C12.text	Νοῒ προσομιλοῦσα γυμνῷ τῷ νῷ, Φεβρωνία θεόφρον κατέλαβες, τῶν ὀρεκτῶν, ἔσχατον καὶ τέλους, μακαριστοῦ, ἐπιτυχεῖν ἠξίωσαι, νῦν συμβασιλεύουσα τῷ Χριστῷ, λαμπρῶς τῷ σῷ νυμφίῳ, ἀφράστοις ἐν θαλάμοις, ἐν εὐφροσύνῃ διαμένουσα.
ltx/gr_gr_cog/me.m06.d25:meMA.Ode9C13.incipit	Ἰάσεις ἀναβρύεις ὡς ποταμός, ῥοιζηδὸν…
ltx/gr_gr_cog/me.m06.d25:meMA.Ode9C13.melody	@ltx/gr_gr_cog/he.h.m8:heHE.ExestiEpiTouto.name
ltx/gr_gr_cog/me.m06.d25:meMA.Ode9C13.mode	@ltx/gr_gr_cog/miscellanea:misc.Mode8
ltx/gr_gr_cog/me.m06.d25:meMA.Ode9C13.ode	@ltx/gr_gr_cog/miscellanea:misc.Ode9
ltx/gr_gr_cog/me.m06.d25:meMA.Ode9C13.text	Ἰάσεις ἀναβρύεις ὡς ποταμός, ῥοιζηδὸν τοῖς ἐν πίστει προστρέχουσι, σοῦ τῇ σεπτῇ, θήκῃ Φεβρωνία θεοειδές, τῆς παρθενίας ἄγαλμα, ἄνθος τὸ τῆς φύσεως τὸ τερπνόν, θυγάτηρ Βασιλέως, ἡ ἔνδον κεκτημένη, τῆς θείας δόξης τὸ ἀγλάϊσμα.
ltx/gr_gr_cog/me.m06.d25:meMA.Ode9C1T.incipit	Ἀνώρθωσας Παρθένε τῶν γυναικῶν, τὸ…
ltx/gr_gr_cog/me.m06.d25:meMA.Ode9C1T.melody	@ltx/gr_gr_cog/he.h.m8:heHE.ExestiEpiTouto.name
ltx/gr_gr_cog/me.m06.d25:meMA.Ode9C1T.mode	@ltx/gr_gr_cog/miscellanea:misc.Mode8
ltx/gr_gr_cog/me.m06.d25:meMA.Ode9C1T.ode	@ltx/gr_gr_cog/miscellanea:misc.Ode9
ltx/gr_gr_cog/me.m06.d25:meMA.Ode9C1T.text	Ἀνώρθωσας Παρθένε τῶν γυναικῶν, τὸ ὀλίσθημα Λόγον κυήσασα, τὸν ἀνορθοῦν, τοὺς κατεῤῥαγμένους, ὡς ἀγαθόν, καὶ κραταιὸν δυνάμενον· ὃν ἡ Φεβρωνία ἡ εὐκλεής, ποθήσασα συντόνως, ὀπίσω σου δραμοῦμαι, ἀγαλλομένη ἀνεβόησεν.
ltx/gr_gr_cog/me.m06.d25:meMA.Ode9H.greekmelody	@ltx/gr_gr_cog/he.h.m8:heHE.ExestiEpiTouto.greekname
ltx/gr_gr_cog/me.m06.d25:meMA.Ode9H.incipit	@ltx/gr_gr_cog/he.h.m8:heHE.ExestiEpiTouto.incipit
ltx/gr_gr_cog/me.m06.d25:meMA.Ode9H.melody	@ltx/gr_gr_cog/he.h.m8:heHE.ExestiEpiTouto.melody
ltx/gr_gr_cog/me.m06.d25:meMA.Ode9H.mode	@ltx/gr_gr_cog/miscellanea:misc.Mode8
ltx/gr_gr_cog/me.m06.d25:meMA.Ode9H.ode	@ltx/gr_gr_cog/miscellanea:misc.Ode9
ltx/gr_gr_cog/me.m06.d25:meMA.Ode9H.text	@ltx/gr_gr_cog/he.h.m8:heHE.ExestiEpiTouto.text
ltx/gr_gr_cog/me.m06.d25:meVE.Apolytikion1.greekmelody	@ltx/gr_gr_cog/he.a.m4:heAU.TachyProkatalave.greekname
ltx/gr_gr_cog/me.m06.d25:meVE.Apolytikion1.incipit	@ltx/gr_gr_cog/me.m06.d24:meVE.Apolytikion1.incipit
ltx/gr_gr_cog/me.m06.d25:meVE.Apolytikion1.melody	@ltx/gr_gr_cog/he.a.m4:heAU.TachyProkatalave.name
ltx/gr_gr_cog/me.m06.d25:meVE.Apolytikion1.mode	@ltx/gr_gr_cog/miscellanea:misc.Mode4
ltx/gr_gr_cog/me.m06.d25:meVE.Apolytikion1.text	@ltx/gr_gr_cog/me.m06.d24:meVE.Apolytikion1.text
ltx/gr_gr_cog/me.m06.d25:meVE.Apolytikion2ger.greekmelody	@ltx/gr_gr_cog/he.a.m3:heAU.TinOraiotita.greekname
ltx/gr_gr_cog/me.m06.d25:meVE.Apolytikion2ger.incipit	Ὡς τῆς ἀσκήσεως, ῥόδον ἡδύπνευστον…
ltx/gr_gr_cog/me.m06.d25:meVE.Apolytikion2ger.melody	@ltx/gr_gr_cog/he.a.m3:heAU.TinOraiotita.name
ltx/gr_gr_cog/me.m06.d25:meVE.Apolytikion2ger.mode	@ltx/gr_gr_cog/miscellanea:misc.Mode3
ltx/gr_gr_cog/me.m06.d25:meVE.Apolytikion2ger.poet	@ltx/gr_gr_cog/poets:po.Gerasimou
ltx/gr_gr_cog/me.m06.d25:meVE.Apolytikion2ger.text	Ὡς τῆς ἀσκήσεως, ῥόδον ἡδύπνευστον, ὀσμὴν ἀθλήσεως, τῷ κόσμῳ ἔπνευσας, εἰς ὀσμὴν μύρων τοῦ Χριστοῦ, δραμοῦσα ἀσχέτῳ πόθῳ· ὅθεν ὡς Παρθένον σε, καὶ Ὁσίαν καὶ Μάρτυρα, θαυμαστῶς ἐδόξασε, Φεβρωνία ὁ Κύριος· ᾧ πρέσβευε ὑπέρ τῶν βοώντων· χαῖρε σεμνὴ Ὁσιομάρτυς.
ltx/gr_gr_cog/me.m06.d25:meVE.AposGlory.incipit	@ltx/gr_gr_cog/me.m06.d24:meVE.AposBoth.incipit
ltx/gr_gr_cog/me.m06.d25:meVE.AposGlory.melody	@ltx/gr_gr_cog/miscellanea:misc.Idiomelon
ltx/gr_gr_cog/me.m06.d25:meVE.AposGlory.mode	@ltx/gr_gr_cog/miscellanea:misc.Mode8
ltx/gr_gr_cog/me.m06.d25:meVE.AposGlory.text	@ltx/gr_gr_cog/me.m06.d24:meVE.AposBoth.text
ltx/gr_gr_cog/me.m06.d25:meVE.MM.Stichera123as567.text	@ltx/gr_gr_cog/properties:media.key
ltx/gr_gr_cog/me.m06.d25:meVE.SticGlory.incipit	@ltx/gr_gr_cog/me.m06.d24:meVE.SticBoth.incipit
ltx/gr_gr_cog/me.m06.d25:meVE.SticGlory.melody	@ltx/gr_gr_cog/miscellanea:misc.Idiomelon
ltx/gr_gr_cog/me.m06.d25:meVE.SticGlory.mode	@ltx/gr_gr_cog/miscellanea:misc.Mode6
ltx/gr_gr_cog/me.m06.d25:meVE.SticGlory.text	@ltx/gr_gr_cog/me.m06.d24:meVE.SticBoth.text
ltx/gr_gr_cog/me.m06.d25:meVE.Stichera01.incipit	@ltx/gr_gr_cog/me.m06.d24:meVE.Stichera01.incipit
ltx/gr_gr_cog/me.m06.d25:meVE.Stichera01.melody	@ltx/gr_gr_cog/miscellanea:misc.Idiomelon
ltx/gr_gr_cog/me.m06.d25:meVE.Stichera01.mode	@ltx/gr_gr_cog/miscellanea:misc.Mode4
ltx/gr_gr_cog/me.m06.d25:meVE.Stichera01.poet	@ltx/gr_gr_cog/poets:po.IoannouMonachou
ltx/gr_gr_cog/me.m06.d25:meVE.Stichera01.text	@ltx/gr_gr_cog/me.m06.d24:meVE.Stichera01.text
ltx/gr_gr_cog/me.m06.d25:meVE.Stichera02.incipit	@ltx/gr_gr_cog/me.m06.d24:meVE.Stichera02.incipit
ltx/gr_gr_cog/me.m06.d25:meVE.Stichera02.melody	@ltx/gr_gr_cog/miscellanea:misc.Idiomelon
ltx/gr_gr_cog/me.m06.d25:meVE.Stichera02.mode	@ltx/gr_gr_cog/miscellanea:misc.Mode4
ltx/gr_gr_cog/me.m06.d25:meVE.Stichera02.text	@ltx/gr_gr_cog/me.m06.d24:meVE.Stichera02.text
ltx/gr_gr_cog/me.m06.d25:meVE.Stichera03.incipit	@ltx/gr_gr_cog/me.m06.d24:meVE.Stichera03.incipit
ltx/gr_gr_cog/me.m06.d25:meVE.Stichera03.melody	@ltx/gr_gr_cog/miscellanea:misc.Idiomelon
ltx/gr_gr_cog/me.m06.d25:meVE.Stichera03.mode	@ltx/gr_gr_cog/miscellanea:misc.Mode4
ltx/gr_gr_cog/me.m06.d25:meVE.Stichera03.poet	@ltx/gr_gr_cog/poets:po.Anatoliou
ltx/gr_gr_cog/me.m06.d25:meVE.Stichera03.text	@ltx/gr_gr_cog/me.m06.d24:meVE.Stichera03.text
ltx/gr_gr_cog/me.m06.d25:meVE.Stichera04.greekmelody	@ltx/gr_gr_cog/he.a.m4:heAU.EdokasSimeiosin.greekname
ltx/gr_gr_cog/me.m06.d25:meVE.Stichera04.incipit	Ἄθλησιν ὑπέμεινας, τῇ σῇ παλαίστρᾳ…
ltx/gr_gr_cog/me.m06.d25:meVE.Stichera04.melody	@ltx/gr_gr_cog/he.a.m4:heAU.EdokasSimeiosin.name
ltx/gr_gr_cog/me.m06.d25:meVE.Stichera04.mode	@ltx/gr_gr_cog/miscellanea:misc.Mode4
ltx/gr_gr_cog/me.m06.d25:meVE.Stichera04.text	Ἄθλησιν ὑπέμεινας, τῇ σῇ παλαίστρᾳ κατάλληλον, Φεβρωνία πανεύφημε, ἱδρῶσιν ἀσκήσεως, μαρτυρίου αἷμα, συγκερασαμένη· ὅθεν καὶ στέφανον διπλοῦν, ὁ εὐεργέτης σοι ἐχαρίσατο, πρὸς ὃν καὶ ἀνελήλυθας, πεποικιλμένη λαμπρότητι, ὡς Παρθένος πανάμωμος, καὶ ὡς Μάρτυς ἀήττητος.
ltx/gr_gr_cog/me.m06.d25:meVE.Stichera05.incipit	Κάλλει τὸ τοῦ σώματος, ἡ…
ltx/gr_gr_cog/me.m06.d25:meVE.Stichera05.melody	@ltx/gr_gr_cog/he.a.m4:heAU.EdokasSimeiosin.name
ltx/gr_gr_cog/me.m06.d25:meVE.Stichera05.mode	@ltx/gr_gr_cog/miscellanea:misc.Mode4
ltx/gr_gr_cog/me.m06.d25:meVE.Stichera05.text	Κάλλει τὸ τοῦ σώματος, ἡ ὡραιότης ἡ ἔνθεος, τῆς ψυχῆς σου συνέδραμεν· ὡς κρίνον γὰρ ἔλαμψας, ἐν μοναῖς ὅσιαις, ἐκλελευκασμένη, καὶ ταῖς τοῦ αἵματος ῥοαῖς, πεφοινιγμένη Νύμφη πανάμωμε· διό σε καὶ οὐράνιος, τερπνὸς ἐδέξατο θάλαμος, καὶ παστὰς ἀκατάλυτος, ὡς Παρθένον καὶ Μάρτυρα.
ltx/gr_gr_cog/me.m06.d25:meVE.Stichera06.incipit	Κύκλῳ παρενέβαλε, σοῦ Φεβρωνία πανεύφημε…
ltx/gr_gr_cog/me.m06.d25:meVE.Stichera06.melody	@ltx/gr_gr_cog/he.a.m4:heAU.EdokasSimeiosin.name
ltx/gr_gr_cog/me.m06.d25:meVE.Stichera06.mode	@ltx/gr_gr_cog/miscellanea:misc.Mode4
ltx/gr_gr_cog/me.m06.d25:meVE.Stichera06.text	Κύκλῳ παρενέβαλε, σοῦ Φεβρωνία πανεύφημε, ὁ ῥυόμενος Ἄγγελος· ἐκ βρέφους γὰρ Κύριον, φοβουμένη ὤφθης, καὶ ἀνακειμένη, ὥσπερ ἀνάθημα τερπνόν, τετηρημένον τῷ παντοκράτορι, ἐντεῦθεν κατεπάτησας, τὴν τοῦ Σελήνου παράνοιαν, καὶ στεφθεῖσα ἀνέδραμες, πρὸς Χριστὸν τὸν νυμφίον σου.
