ltx/gr_gr_cog/pe.d112:peDA.commemoration.full	
ltx/gr_gr_cog/pe.d112:peDA.commemoration.short	Σάββατον τῆς Ϛʹ Ἑβδομάδος
ltx/gr_gr_cog/pe.d112:peDA.dismissal	@ltx/gr_gr_cog/dismissals:dis00.ascension
ltx/gr_gr_cog/pe.d112:peDA.insert1	
ltx/gr_gr_cog/pe.d112:peDA.insert2	
ltx/gr_gr_cog/pe.d112:peDA.note	
ltx/gr_gr_cog/pe.d112:peHO.commemorations	
ltx/gr_gr_cog/pe.d112:peHO.daytitle	
ltx/gr_gr_cog/pe.d112:peHO.description1	
ltx/gr_gr_cog/pe.d112:peHO.description2	
ltx/gr_gr_cog/pe.d112:peHO.note1	
ltx/gr_gr_cog/pe.d112:peHO.note2	
ltx/gr_gr_cog/pe.d112:peMA.AposGlory.incipit	Ἀνελήφθης ἐν δόξῃ, ἀπὸ γῆς…
ltx/gr_gr_cog/pe.d112:peMA.AposGlory.melody	@ltx/gr_gr_cog/miscellanea:misc.Idiomelon
ltx/gr_gr_cog/pe.d112:peMA.AposGlory.mode	@ltx/gr_gr_cog/miscellanea:misc.Mode8
ltx/gr_gr_cog/pe.d112:peMA.AposGlory.text	Ἀνελήφθης ἐν δόξῃ, ἀπὸ γῆς εἰς οὐρανούς, ὁ πάντα πληρῶν τῇ Θεότητι· καὶ ἐν δεξιᾷ Πατρὸς ἐκάθισας, ὁ ἐν ἀρχῇ Θεὸς Λόγος· ὅθεν αἱ οὐράνιαι Δυνάμεις ὁρῶσαι, τοῖς Ἀποστόλοις ἔμφοβοι ἔλεγον· Τίνι ἀτενίζετε βλέποντες εἰς τὸν οὐρανόν; οὗτος, ὃν ἐθεάσασθε, αὐτὸς πάλιν ἐλεύσεται μετὰ δόξης, τοῦ κρῖναι πᾶσαν τὴν γῆν, καὶ ἀποδοῦναι ἑκάστῳ κατὰ τὰ ἔργα αὐτοῦ. Πρὸς ὃν βοήσωμεν· Ἀκατάληπτε Κύριε, δόξα σοι.
ltx/gr_gr_cog/pe.d112:peMA.Aposticha1.greekmelody	@ltx/gr_gr_cog/he.a.m2:heAU.OikosTouEfratha.greekname
ltx/gr_gr_cog/pe.d112:peMA.Aposticha1.incipit	Οὐ λείψω ὀρφανούς, οὕς περ…
ltx/gr_gr_cog/pe.d112:peMA.Aposticha1.melody	@ltx/gr_gr_cog/he.a.m2:heAU.OikosTouEfratha.name
ltx/gr_gr_cog/pe.d112:peMA.Aposticha1.mode	@ltx/gr_gr_cog/miscellanea:misc.Mode2
ltx/gr_gr_cog/pe.d112:peMA.Aposticha1.text	Οὐ λείψω ὀρφανούς, οὕς περ ἐγὼ συνῆξα, ὁ Κύριος τοῖς Φίλοις, ἐλάλει, ἀλλὰ πέμψω, ὑμῖν Πνεῦμα τὸ ἅγιον.
ltx/gr_gr_cog/pe.d112:peMA.Aposticha2.incipit	Ἄγγελοι τοῖς σοφοῖς, ἐβόων Ἀποστόλοις…
ltx/gr_gr_cog/pe.d112:peMA.Aposticha2.melody	@ltx/gr_gr_cog/he.a.m2:heAU.OikosTouEfratha.name
ltx/gr_gr_cog/pe.d112:peMA.Aposticha2.mode	@ltx/gr_gr_cog/miscellanea:misc.Mode2
ltx/gr_gr_cog/pe.d112:peMA.Aposticha2.text	Ἄγγελοι τοῖς σοφοῖς, ἐβόων Ἀποστόλοις· Ὦ ἄνδρες Γαλιλαῖοι, ὃν τρόπον καθορᾶτε, αὐτὸς πάλιν ἐλεύσεται.
ltx/gr_gr_cog/pe.d112:peMA.Aposticha3.incipit	Κατῆλθον ἐν χαρᾷ, ἀπὸ τοῦ…
ltx/gr_gr_cog/pe.d112:peMA.Aposticha3.melody	@ltx/gr_gr_cog/he.a.m2:heAU.OikosTouEfratha.name
ltx/gr_gr_cog/pe.d112:peMA.Aposticha3.mode	@ltx/gr_gr_cog/miscellanea:misc.Mode2
ltx/gr_gr_cog/pe.d112:peMA.Aposticha3.text	Κατῆλθον ἐν χαρᾷ, ἀπὸ τοῦ Ἐλαιῶνος, οἱ Μαθηταί σου Λόγε, δοξάζοντες, ὑμνοῦντες, τὴν θείαν σου Ἀνάληψιν.
ltx/gr_gr_cog/pe.d112:peMA.Kathisma11.greekmelody	@ltx/gr_gr_cog/pe.d110:peMA.Kathisma11.greekmelody
ltx/gr_gr_cog/pe.d112:peMA.Kathisma11.incipit	@ltx/gr_gr_cog/pe.d110:peMA.Kathisma11.incipit
ltx/gr_gr_cog/pe.d112:peMA.Kathisma11.melody	@ltx/gr_gr_cog/pe.d110:peMA.Kathisma11.melody
ltx/gr_gr_cog/pe.d112:peMA.Kathisma11.mode	@ltx/gr_gr_cog/pe.d110:peMA.Kathisma11.mode
ltx/gr_gr_cog/pe.d112:peMA.Kathisma11.text	@ltx/gr_gr_cog/pe.d110:peMA.Kathisma11.text
ltx/gr_gr_cog/pe.d112:peMA.Kathisma21.greekmelody	@ltx/gr_gr_cog/he.a.m1:heAU.TouLithouSfragisthentos.greekname
ltx/gr_gr_cog/pe.d112:peMA.Kathisma21.incipit	Τοῦ ᾍδου σκυλευθέντος, ὑπὸ σοῦ…
ltx/gr_gr_cog/pe.d112:peMA.Kathisma21.melody	@ltx/gr_gr_cog/he.a.m1:heAU.TouLithouSfragisthentos.name
ltx/gr_gr_cog/pe.d112:peMA.Kathisma21.mode	@ltx/gr_gr_cog/miscellanea:misc.Mode1
ltx/gr_gr_cog/pe.d112:peMA.Kathisma21.text	Τοῦ ᾍδου σκυλευθέντος, ὑπὸ σοῦ Ζωοδότα, καὶ κόσμου φωτισθέντος, ἐν τῇ σῇ Ἀναστάσει, ἀνῆλθες μετὰ δόξης ὁ Σωτήρ, ὁ πάντα περιέχων τῇ χειρί· διὰ τοῦτο σύν Ἀγγέλοις, δοξολογοῦμέν σε, παντοκράτορ Κύριε· Δόξα τῇ Ἀναλήψει σου Χριστέ· δόξα τῇ Βασιλείᾳ σου· δόξα τῇ εὐσπλαγχνίᾳ σου, μόνε Φιλάνθρωπε.
ltx/gr_gr_cog/pe.d112:peVE.AposGlory.incipit	Εἰς τὸ ὄρος τῶν Ἐλαιῶν…
ltx/gr_gr_cog/pe.d112:peVE.AposGlory.melody	@ltx/gr_gr_cog/miscellanea:misc.Idiomelon
ltx/gr_gr_cog/pe.d112:peVE.AposGlory.mode	@ltx/gr_gr_cog/miscellanea:misc.Mode7
ltx/gr_gr_cog/pe.d112:peVE.AposGlory.text	Εἰς τὸ ὄρος τῶν Ἐλαιῶν, ἦλθες ὁ Ἐλεῶν τὸ γένος τῶν ἀνθρώπων· καὶ νεφέλη ὑπέλαβέ σε, ἀπὸ τῶν ὀφθαλμῶν τῶν Μαθητῶν σου, τρεμόντων μὲν διὰ τὴν ὀπτασίαν, χαιρόντων δὲ διὰ τὴν προσδοκίαν τοῦ ἁγίου Πνεύματος· ἐν ᾧ στηρίξας Σωτήρ, ἐλέησον ἡμᾶς.
ltx/gr_gr_cog/pe.d112:peVE.Aposticha1.greekmelody	@ltx/gr_gr_cog/he.a.m2:heAU.OikosTouEfratha.greekname
ltx/gr_gr_cog/pe.d112:peVE.Aposticha1.incipit	Πληρώσας ἀγαθέ, Πατρὸς τὴν εὐδοκίαν…
ltx/gr_gr_cog/pe.d112:peVE.Aposticha1.melody	@ltx/gr_gr_cog/he.a.m2:heAU.OikosTouEfratha.name
ltx/gr_gr_cog/pe.d112:peVE.Aposticha1.mode	@ltx/gr_gr_cog/miscellanea:misc.Mode2
ltx/gr_gr_cog/pe.d112:peVE.Aposticha1.text	Πληρώσας ἀγαθέ, Πατρὸς τὴν εὐδοκίαν, ἑνώσας τε τὰ ἄνω, τοῖς κάτω, ἀνελήφθης, ἐν δόξῃ πρὸς τὸ πρότερον.
ltx/gr_gr_cog/pe.d112:peVE.Aposticha2.incipit	Ἀνῆλθες πρὸς τὸν σόν, Γεννήτορα…
ltx/gr_gr_cog/pe.d112:peVE.Aposticha2.melody	@ltx/gr_gr_cog/he.a.m2:heAU.OikosTouEfratha.name
ltx/gr_gr_cog/pe.d112:peVE.Aposticha2.mode	@ltx/gr_gr_cog/miscellanea:misc.Mode2
ltx/gr_gr_cog/pe.d112:peVE.Aposticha2.text	Ἀνῆλθες πρὸς τὸν σόν, Γεννήτορα Οἰκτίρμον, ὅθεν οὐκ ἐχωρίσθης, καὶ ὕψωσας τὴν κάτω, κειμένην φύσιν Δέσποτα.
ltx/gr_gr_cog/pe.d112:peVE.Aposticha3.incipit	Νεφέλη σε φωτός, ἀνέλαβεν εἰς…
ltx/gr_gr_cog/pe.d112:peVE.Aposticha3.melody	@ltx/gr_gr_cog/he.a.m2:heAU.OikosTouEfratha.name
ltx/gr_gr_cog/pe.d112:peVE.Aposticha3.mode	@ltx/gr_gr_cog/miscellanea:misc.Mode2
ltx/gr_gr_cog/pe.d112:peVE.Aposticha3.text	Νεφέλη σε φωτός, ἀνέλαβεν εἰς ὕψος, καὶ Ἄγγελοι ἐν φόβῳ, καὶ τρόμῳ διηκόνουν τῷ θείῳ σου κελεύσματι.
ltx/gr_gr_cog/pe.d112:peVE.SticGlory.incipit	@ltx/gr_gr_cog/pe.d110:peMA.PostGospelIdiomelon.incipit
ltx/gr_gr_cog/pe.d112:peVE.SticGlory.melody	@ltx/gr_gr_cog/pe.d110:peMA.PostGospelIdiomelon.melody
ltx/gr_gr_cog/pe.d112:peVE.SticGlory.mode	@ltx/gr_gr_cog/pe.d110:peMA.PostGospelIdiomelon.mode
ltx/gr_gr_cog/pe.d112:peVE.SticGlory.text	@ltx/gr_gr_cog/pe.d110:peMA.PostGospelIdiomelon.text
ltx/gr_gr_cog/pe.d112:peVE.Stichera01.greekmelody	@ltx/gr_gr_cog/he.a.m4:heAU.EdokasSimeiosin.greekname
ltx/gr_gr_cog/pe.d112:peVE.Stichera01.incipit	Ἔπαθες ὡς ἄνθρωπος, ὁ ἀπαθὴς…
ltx/gr_gr_cog/pe.d112:peVE.Stichera01.melody	@ltx/gr_gr_cog/he.a.m4:heAU.EdokasSimeiosin.name
ltx/gr_gr_cog/pe.d112:peVE.Stichera01.mode	@ltx/gr_gr_cog/miscellanea:misc.Mode4
ltx/gr_gr_cog/pe.d112:peVE.Stichera01.text	Ἔπαθες ὡς ἄνθρωπος, ὁ ἀπαθὴς τῇ Θεότητι· καὶ ἀνέστης τριήμερος, σκυλεύσας τὸν θάνατον, καὶ συναναστήσας, πάντας τοὺς φθαρέντας· καὶ ἀνελήλυθας Χριστέ, πρὸς τὸν Πατέρα, ἐπαγγειλάμενος, ἐκπέμψειν τὸν Παράκλητον, τοῖς ἱεροῖς Ἀποστόλοις σου, Ἰησοῦ παντοδύναμε, ὁ Σωτὴρ τῶν ψυχῶν ἡμῶν.
ltx/gr_gr_cog/pe.d112:peVE.Stichera02.incipit	Ὑμεῖς τί ἑστήκατε, πρὸς οὐρανὸν…
ltx/gr_gr_cog/pe.d112:peVE.Stichera02.melody	@ltx/gr_gr_cog/he.a.m4:heAU.EdokasSimeiosin.name
ltx/gr_gr_cog/pe.d112:peVE.Stichera02.mode	@ltx/gr_gr_cog/miscellanea:misc.Mode4
ltx/gr_gr_cog/pe.d112:peVE.Stichera02.text	Ὑμεῖς τί ἑστήκατε, πρὸς οὐρανὸν ἀτενίζοντες; οἱ ὁρώμενοι Ἄγγελοι, ὡς ἄνθρωποι ἔλεγον, τοῖς τοῦ Λόγου Μύσταις· οὗτος, ὃν ὁρᾶτε, ὑπὸ νεφέλης φωτεινῆς, ἀναληφθέντα, αὐτὸς ἐλεύσεται, ὃν τρόπον ἐθεάσασθε, κρῖναι τὸν κόσμον, ὡς ἔφησε· πορευθέντες οὖν ἅπαντα, τὰ ῥηθέντα τελέσατε.
ltx/gr_gr_cog/pe.d112:peVE.Stichera03.incipit	Μετὰ τὴν ἐκ τάφου σου…
ltx/gr_gr_cog/pe.d112:peVE.Stichera03.melody	@ltx/gr_gr_cog/he.a.m4:heAU.EdokasSimeiosin.name
ltx/gr_gr_cog/pe.d112:peVE.Stichera03.mode	@ltx/gr_gr_cog/miscellanea:misc.Mode4
ltx/gr_gr_cog/pe.d112:peVE.Stichera03.text	Μετὰ τὴν ἐκ τάφου σου, ὑπὲρ κατάληψιν Ἔγερσιν, παντοδύναμε Κύριε, λαβὼν οὓς ἠγάπησας, ἕως Βηθανίας, ἐξήγαγες Λόγε· καὶ πρὸς τὸ ὄρος γεγονώς, τοῦ Ἐλαιῶνος, τούτους ηὐλόγησας· καὶ οὕτως ἀνελήλυθας, ὑποταγέντων Ἀγγέλων σοι, Ἰησοῦ παντοδύναμε, ὁ Σωτὴρ τῶν ψυχῶν ἡμῶν.
