ltx/gr_gr_cog/le.go.me.m06.d14:lemeLI.Gospel.book_abbr	@ltx/gr_gr_cog/le.go.lu.d005:leluLI.Gospel.book_abbr
ltx/gr_gr_cog/le.go.me.m06.d14:lemeLI.Gospel.book_string	@ltx/gr_gr_cog/le.go.lu.d005:leluLI.Gospel.book_string
ltx/gr_gr_cog/le.go.me.m06.d14:lemeLI.Gospel.chapverse	@ltx/gr_gr_cog/le.go.lu.d005:leluLI.Gospel.chapverse
ltx/gr_gr_cog/le.go.me.m06.d14:lemeLI.Gospel.incipit	@ltx/gr_gr_cog/le.go.lu.d005:leluLI.Gospel.incipit
ltx/gr_gr_cog/le.go.me.m06.d14:lemeLI.Gospel.text	@ltx/gr_gr_cog/le.go.lu.d005:leluLI.Gospel.text
ltx/gr_gr_cog/le.go.me.m06.d14:lemeLI.Gospel.title	Τοῦ Προφήτου
ltx/gr_gr_cog/le.go.me.m06.d14:lemeLI.Gospel.title_abbr	Τοῦ Προφήτου
ltx/gr_gr_cog/le.go.me.m06.d14:lemeLI.Gospel.version	@ltx/gr_gr_cog/le.go.lu.d005:leluLI.Gospel.version
