ltx/gr_gr_cog/le.go.mc.d159:lemcLI.Gospel.book_abbr	@ltx/gr_gr_cog/bible:Matthew.abbr
ltx/gr_gr_cog/le.go.mc.d159:lemcLI.Gospel.book_string	@ltx/gr_gr_cog/bible:Matthew.text
ltx/gr_gr_cog/le.go.mc.d159:lemcLI.Gospel.chapverse	13:36 – 43
ltx/gr_gr_cog/le.go.mc.d159:lemcLI.Gospel.incipit	Ἐλθόντι τῷ Ἰησοῦ εἰς τὴν οἰκίαν…
ltx/gr_gr_cog/le.go.mc.d159:lemcLI.Gospel.text	Τῷ καιρῷ ἐκείνῳ ἐλθόντι τῷ Ἰησοῦ εἰς τὴν οἰκίαν, προσῆλθον αὐτῷ οἱ μαθηταὶ αὐτοῦ λέγοντες· φράσον ἡμῖν τὴν παραβολὴν τῶν ζιζανίων τοῦ ἀγροῦ. ὁ δὲ ἀποκριθεὶς εἶπεν αὐτοῖς· ὁ σπείρων τὸ καλὸν σπέρμα ἐστὶν ὁ υἱὸς τοῦ ἀνθρώπου· ὁ δὲ ἀγρός ἐστιν ὁ κόσμος· τὸ δὲ καλὸν σπέρμα, οὗτοί εἰσιν οἱ υἱοὶ τῆς βασιλείας· τὰ δὲ ζιζάνιά εἰσιν οἱ υἱοὶ τοῦ πονηροῦ· ὁ δὲ ἐχθρὸς ὁ σπείρας αὐτά ἐστιν ὁ διάβολος· ὁ δὲ θερισμὸς συντέλεια τοῦ αἰῶνός ἐστιν· οἱ δὲ θερισταὶ ἄγγελοί εἰσιν. ὥσπερ οὖν συλλέγεται τὰ ζιζάνια καὶ πυρὶ καίεται, οὕτως ἔσται ἐν τῇ συντελείᾳ τοῦ αἰῶνος τούτου. ἀποστελεῖ ὁ υἱὸς τοῦ ἀνθρώπου τοὺς ἀγγέλους αὐτοῦ, καὶ συλλέξουσιν ἐκ τῆς βασιλείας αὐτοῦ πάντα τὰ σκάνδαλα καὶ τοὺς ποιοῦντας τὴν ἀνομίαν, καὶ βαλοῦσιν αὐτοὺς εἰς τὴν κάμινον τοῦ πυρός· ἐκεῖ ἔσται ὁ κλαυθμὸς καὶ ὁ βρυγμὸς τῶν ὀδόντων. τότε οἱ δίκαιοι ἐκλάμψουσιν ὡς ὁ ἥλιος ἐν τῇ βασιλείᾳ τοῦ πατρὸς αὐτῶν. ὁ ἔχων ὦτα ἀκούειν ἀκουέτω.
ltx/gr_gr_cog/le.go.mc.d159:lemcLI.Gospel.title	Τῇ Πέμπτῃ τῆς Ϛʹ Ἑβδομάδος τοῦ Ματθαίου
ltx/gr_gr_cog/le.go.mc.d159:lemcLI.Gospel.title_abbr	Πέμπτῃ τῆς Ϛʹ Ἑβδομάδος
ltx/gr_gr_cog/le.go.mc.d159:lemcLI.Gospel.version	@ltx/gr_gr_cog/properties:version.designation
