ltx/gr_gr_cog/ty.m01.d01:ty.Days.text	Ἔχων ἡμέρας τριάκοντα καί μίαν.
ltx/gr_gr_cog/ty.m01.d01:ty.Hours.text	Ἡ ἡμέρα ἔχει ὥρας 10 καί ἡ νύξ ὥρας 14.
ltx/gr_gr_cog/ty.m01.d01:ty.Month.text	ΙΑΝΟΥΑΡΙΟΣ
ltx/gr_gr_cog/ty.m01.d01:tyCommemoration.text	1. ΤΡΙΤΗ: Η ΚΑΤΑ ΣΑΡΚΑ ΠΕΡΙΤΟΜΗ ΤΟΥ ΚΥΡΙΟΥ ΗΜΩΝ ΙΗΣΟΥ ΧΡΙΣΤΟΥ. Τοῦ ἐν Ἁγίοις Πατρός ἡμῶν Βασιλείου τοῦ Μεγάλου, Ἀρχιεπισκόπου Καισαρείας τῆς Καππαδοκίας καί τῆς μητρός αὐτοῦ, Ἁγίας Ἐμμελείας.
ltx/gr_gr_cog/ty.m01.d01:tyDate.text	
ltx/gr_gr_cog/ty.m01.d01:tyLI.AfterCommunion.text	τὸ Ἀπολυτίκιον τῆς Ἑορτῆς.
ltx/gr_gr_cog/ty.m01.d01:tyLI.AmboPrayer.text	«Ὁ θυσίαν αἰνέσεως…».
ltx/gr_gr_cog/ty.m01.d01:tyLI.Antiphons.text	Τῆς Ἑορτῆς.
ltx/gr_gr_cog/ty.m01.d01:tyLI.Apolytikia.text	1.– Τῆς Ἑορτῆς. 2.– Τοῦ Ἁγίου· καί 3.– Τοῦ Ναοῦ.
ltx/gr_gr_cog/ty.m01.d01:tyLI.CommunionHymn.text	«Αἰνεῖτε τόν Κύριον ἐκ τῶν οὐρανῶν. Ἀλληλούια».
ltx/gr_gr_cog/ty.m01.d01:tyLI.Dismissal.text	Ἡ τοῦ Ἑσπερινοῦ.
ltx/gr_gr_cog/ty.m01.d01:tyLI.EntranceHymn.text	«Δεῦτε προσκυνήσωμεν… ὁ σαρκί περιτμηθείς…».
ltx/gr_gr_cog/ty.m01.d01:tyLI.Epistle.text	Τοῦ Ἁγίου (Κολ. β΄ 8-12).
ltx/gr_gr_cog/ty.m01.d01:tyLI.Gospel.text	Τῆς Ἑορτῆς (Λουκ. β΄ 20-21. 40-52).
ltx/gr_gr_cog/ty.m01.d01:tyLI.Kontakion.text	Τῆς Ἑορτῆς (τό ἐπισφραγιστικόν τῶν Μεσῳδίων Καθισμάτων).
ltx/gr_gr_cog/ty.m01.d01:tyLI.Megalynarion.text	Τό Μεγαλυνάριον· Ἦχος β΄. «Τόν οὐρανοφάντορα τοῦ Χριστοῦ, μύστην τοῦ Δεσπότου, τόν φωστῆρα τόν φαεινόν, τόν ἐκ Καισαρείας καί Καππαδόκων χώρας, Βασίλειον τόν μέγαν, πάντες τιμήσωμεν».
ltx/gr_gr_cog/ty.m01.d01:tyLI.TheotokosHymn.text	«Ἐπί σοί χαίρει…».
ltx/gr_gr_cog/ty.m01.d01:tyMA.Anavathmoi.text	Τό α΄ Ἀντίφωνον τοῦ δ΄ ἤχου.
ltx/gr_gr_cog/ty.m01.d01:tyMA.Apolytikia.text	1.– Τοῦ Ἁγίου. 2.– Δόξα, τό αὐτό καί 3.– Καί νῦν, τῆς Ἑορτῆς.
ltx/gr_gr_cog/ty.m01.d01:tyMA.Canons.text	Τῆς Ἑορτῆς, μετά τῶν Εἱρμῶν αὐτοῦ μετά στίχου· «Δόξα σοι, ὁ Θεός ἡμῶν, δόξα σοι» καί 2.– Τοῦ Ἁγίου, μετά στίχου· «Ἅγιε τοῦ Θεοῦ, πρέσβευε ὑπέρ ἡμῶν» καί εἰς τά δύο τελευταῖα Δόξα, Καί νῦν, ἀμφότεροι εἰς 4.
ltx/gr_gr_cog/ty.m01.d01:tyMA.Doxology.text	Μεγάλη.
ltx/gr_gr_cog/ty.m01.d01:tyMA.EndApolytikion.text	Τῆς Ἑορτῆς.
ltx/gr_gr_cog/ty.m01.d01:tyMA.Exaposteilaria.text	1.– Τοῦ Ἁγίου· καί 2.– Τῆς Ἑορτῆς.
ltx/gr_gr_cog/ty.m01.d01:tyMA.Katavasias.text	Διπλαῖ.
ltx/gr_gr_cog/ty.m01.d01:tyMA.Kathismata.text	Τοῦ Ἁγίου τῆς α΄ καί β΄ Στιχολογίας καί εἰς τό Καί νῦν, ἀντί Θεοτοκίων, ἀνά ἕν τῆς Ἑορτῆς καί τά μετά τόν Πολυέλεον Καθίσματα τοῦ Ἁγίου μετά τοῦ Θεοτοκίου αὐτῶν.
ltx/gr_gr_cog/ty.m01.d01:tyMA.KontakionOikos.text	Τοῦ Ἁγίου.
ltx/gr_gr_cog/ty.m01.d01:tyMA.Lauds.text	1.– Τό 1 Στιχηρόν Προσόμοιον τῆς Ἑορτῆς, καί 2.– Τά 3 Στιχηρά Προσόμοια τοῦ Ἁγίου.
ltx/gr_gr_cog/ty.m01.d01:tyMA.LaudsBoth.text	Τό Ἰδιόμελον τῆς Ἑορτῆς.
ltx/gr_gr_cog/ty.m01.d01:tyMA.LaudsGlory.text	Τό Ἰδιόμελον τοῦ Ἁγίου.
ltx/gr_gr_cog/ty.m01.d01:tyMA.LaudsVerses.text	δ΄.
ltx/gr_gr_cog/ty.m01.d01:tyMA.Magnificat.text	Οὐ στιχολογεῖται, ἀντ’ αὐτῆς ἡ θ΄ ᾨδή ἀμφοτέρων τῶν Κανόνων τῆς Ἑορτῆς καί τοῦ Ἁγίου.
ltx/gr_gr_cog/ty.m01.d01:tyMA.MatinsGospel.text	Τοῦ Ἱεράρχου (Ἰω. ι΄ 1-9), ζήτει τοῦτο τῇ 13ῃ Νοεμβρίου.
ltx/gr_gr_cog/ty.m01.d01:tyMA.MidodeKath.text	
ltx/gr_gr_cog/ty.m01.d01:tyMA.MidodeKontakion.text	
ltx/gr_gr_cog/ty.m01.d01:tyMA.Ode9_1.text	
ltx/gr_gr_cog/ty.m01.d01:tyMA.Ode9_2.text	
ltx/gr_gr_cog/ty.m01.d01:tyMA.Ode9_3.text	
ltx/gr_gr_cog/ty.m01.d01:tyMA.Ode9_4.text	
ltx/gr_gr_cog/ty.m01.d01:tyMA.Ode9_5.text	
ltx/gr_gr_cog/ty.m01.d01:tyMA.Ode9_6.text	
ltx/gr_gr_cog/ty.m01.d01:tyMA.Ode9_7.text	
ltx/gr_gr_cog/ty.m01.d01:tyMA.Ode9_8.text	
ltx/gr_gr_cog/ty.m01.d01:tyMA.Ode9_Katavasia1.text	Διπλαῖ.
ltx/gr_gr_cog/ty.m01.d01:tyMA.ProkVerse.text	
ltx/gr_gr_cog/ty.m01.d01:tyMA.Prokeimenon.text	«Τό στόμα μου λαλήσει σοφίαν, καί ἡ μελέτη τῆς καρδίας μου σύνεσιν».
ltx/gr_gr_cog/ty.m01.d01:tyMA.Psalm50.text	(Χῦμα). Δόξα· «Ταῖς τοῦ Ἱεράρχου…». Καί νῦν· «Ταῖς τῆς Θεοτόκου…» καί τό Ἰδιόμελον.
ltx/gr_gr_cog/ty.m01.d01:tyMA.Synaxarion.text	Τῆς ἡμέρας.
ltx/gr_gr_cog/ty.m01.d01:tyMO.Rubric1.text	Μετά τόν Ν΄ Ψαλμόν, τά διά τήν Λιτήν Στιχηρά Ἰδιόμελα τοῦ Ἁγίου μετά τοῦ Δόξα αὐτῶν, Καί νῦν, τῆς Ἑορτῆς. Τρισάγιον καί τό Ἀπολυτίκιον τῆς Ἑορτῆς.
ltx/gr_gr_cog/ty.m01.d01:tyNote1.text	Πατριαρχική καί Συνοδική Χοροστασία.
ltx/gr_gr_cog/ty.m01.d01:tyVE.Apolytikia.text	1.– Τοῦ Ἁγίου καί 2.– Δόξα, Καί νῦν, τῆς Ἑορτῆς.
ltx/gr_gr_cog/ty.m01.d01:tyVE.AposBoth.text	Τό ἕτερον Ἰδιόμελον τῆς Ἑορτῆς.
ltx/gr_gr_cog/ty.m01.d01:tyVE.AposGlory.text	Τό Ἰδιόμελον τοῦ Ἁγίου.
ltx/gr_gr_cog/ty.m01.d01:tyVE.AposGloryBoth.text	
ltx/gr_gr_cog/ty.m01.d01:tyVE.Aposticha.text	Τά 3 Στιχηρά Ἰδιόμελα τοῦ Ἁγίου, μετά τῶν πρό αὐτῶν στίχων εἰς τά δύο τελευταῖα.
ltx/gr_gr_cog/ty.m01.d01:tyVE.Dismissal.text	«Ὁ ἐν τῇ ὀγδόῃ ἡμέρᾳ σαρκί περιτμηθῆναι καταδεξάμενος διά τήν ἡμῶν σωτηρίαν, Χριστός ὁ ἀληθινός Θεός ἡμῶν…».
ltx/gr_gr_cog/ty.m01.d01:tyVE.Entrance.text	«Φῶς ἱλαρόν…». Τό Προκείμενον τῆς ἡμέρας καί τά Ἀναγνώσματα.
ltx/gr_gr_cog/ty.m01.d01:tyVE.Intro.text	Προοιμιακός – Ψαλτήριον.
ltx/gr_gr_cog/ty.m01.d01:tyVE.LIHC.text	ς΄.
ltx/gr_gr_cog/ty.m01.d01:tyVE.Note1.text	Ὁ Πατριάρχης κατέρχεται μετά τῶν Κληρικῶν τῆς Πατριαρχικῆς Αὐλῆς εἰς τόν Πάνσεπτον Πατριαρχικόν Ναόν. Εἰς τόν Νάρθηκα περιβάλλεται μανδύαν καί λαμβάνει τήν ποιμαντορικήν ράβδον παρά τοῦ Μ. Ἐκκλησιάρχου. Προχωρεῖ πρός τόν Σολέα, εὐλογεῖ τόν λαόν, τῶν Χορῶν ψαλλόντων τό· «Εἰς πολλά ἔτη, Δέσποτα» καί ἀνέρχεται εἰς τόν Θρόνον. Λαμβάνουσι καιρόν ὁ Μ. Πρωτοσύγκελλος μετά τοῦ Δευτερεύοντος καί τοῦ Τριτεύοντος καί εἶτα οἱ λοιποί Ἱερεῖς τῆς Πατριαρχικῆς Αὐλῆς. Εἰς τό· «Κύριε, ἐκέκραξα…», προπορευομένου τοῦ Μ. Ἐκκλησιάρχου ἐξέρχονται τῆς Νοτίου Πύλης τοῦ Ἱεροῦ Βήματος οἱ Ἅγιοι Ἀρχιερεῖς καί ποιοῦντες σχῆμα τῷ Πατριάρχῃ λαμβάνουσι τάς ἐν τῷ Ναῷ θέσεις αὐτῶν.
ltx/gr_gr_cog/ty.m01.d01:tyVE.Note2.text	Κατά τήν ἀπόλυσιν ὁ Μ. Ἐκκλησιάρχης ποιεῖ σχῆμα εἰς τόν Πατριάρχην καί τούς Ἀρχιερεῖς, οἵτινες καί ἐξέρχονται κατά σειράν, ποιοῦντες σχῆμα τῷ Πατριάρχῃ, ἐκ τῆς Νοτίου Πύλης τοῦ Ἱεροῦ Ναοῦ καί ἀνέρχονται εἰς τόν Πατριαρχικόν Οἶκον.
ltx/gr_gr_cog/ty.m01.d01:tyVE.SticBoth.text	Τό Ἰδιόμελον τῆς Ἑορτῆς.
ltx/gr_gr_cog/ty.m01.d01:tyVE.SticGlory.text	Τό Ἰδιόμελον τοῦ Ἁγίου.
ltx/gr_gr_cog/ty.m01.d01:tyVE.SticGloryBoth.text	
ltx/gr_gr_cog/ty.m01.d01:tyVE.Stichera.text	1.– Τά 2 Στιχηρά Ἰδιόμελα τῆς Ἑορτῆς εἰς 3, τό πρῶτον δίς καί 2.– Τά 3 Στιχηρά Προσόμοια τοῦ Ἁγίου.
