ltx/gr_gr_cog/le.ep.me.m02.d01:lemeLI.Epistle.book_abbr	@ltx/gr_gr_cog/le.ep.me.m09.d02:lemeLI.Epistle.book_abbr
ltx/gr_gr_cog/le.ep.me.m02.d01:lemeLI.Epistle.book_string	@ltx/gr_gr_cog/le.ep.me.m09.d02:lemeLI.Epistle.book_string
ltx/gr_gr_cog/le.ep.me.m02.d01:lemeLI.Epistle.chapverse	@ltx/gr_gr_cog/le.ep.me.m09.d02:lemeLI.Epistle.chapverse
ltx/gr_gr_cog/le.ep.me.m02.d01:lemeLI.Epistle.incipit	@ltx/gr_gr_cog/le.ep.me.m09.d02:lemeLI.Epistle.incipit
ltx/gr_gr_cog/le.ep.me.m02.d01:lemeLI.Epistle.text	@ltx/gr_gr_cog/le.ep.me.m09.d02:lemeLI.Epistle.text
ltx/gr_gr_cog/le.ep.me.m02.d01:lemeLI.Epistle.title	Τοῦ Ἁγίου Τρύφωνος
ltx/gr_gr_cog/le.ep.me.m02.d01:lemeLI.Epistle.title_abbr	Τοῦ Ἁγίου Τρύφωνος
ltx/gr_gr_cog/le.ep.me.m02.d01:lemeLI.Epistle.version	@ltx/gr_gr_cog/le.ep.me.m09.d02:lemeLI.Epistle.version
