ltx/gr_gr_cog/le.go.mc.d075:lemcLI.Gospel.book_abbr	@ltx/gr_gr_cog/bible:John.abbr
ltx/gr_gr_cog/le.go.mc.d075:lemcLI.Gospel.book_string	@ltx/gr_gr_cog/bible:John.text
ltx/gr_gr_cog/le.go.mc.d075:lemcLI.Gospel.chapverse	3:1 – 15
ltx/gr_gr_cog/le.go.mc.d075:lemcLI.Gospel.incipit	Ἄνθρωπός τις ἦν ἐκ τῶν Φαρισαίων…
ltx/gr_gr_cog/le.go.mc.d075:lemcLI.Gospel.text	Τῷ καιρῷ ἐκείνῳ, ἄνθρωπός τις ἦν ἐκ τῶν Φαρισαίων, Νικόδημος ὄνομα αὐτῷ, ἄρχων τῶν Ἰουδαίων. οὗτος ἦλθε πρὸς τὸν Ἰησοῦν νυκτὸς καὶ εἶπεν αὐτῷ· ῥαββί, οἴδαμεν ὅτι ἀπὸ Θεοῦ ἐλήλυθας διδάσκαλος· οὐδεὶς γὰρ ταῦτα τὰ σημεῖα δύναται ποιεῖν ἃ σὺ ποιεῖς, ἐὰν μὴ ᾖ ὁ Θεὸς μετ᾽αὐτοῦ. ἀπεκρίθη Ἰησοῦς καὶ εἶπεν αὐτῷ· ἀμὴν ἀμὴν λέγω σοι, ἐὰν μή τις γεννηθῇ ἄνωθεν, οὐ δύναται ἰδεῖν τὴν βασιλείαν τοῦ Θεοῦ. λέγει πρὸς αὐτὸν ὁ Νικόδημος· πῶς δύναται ἄνθρωπος γεννηθῆναι γέρων ὤν; μὴ δύναται εἰς τὴν κοιλίαν τῆς μητρὸς αὐτοῦ δεύτερον εἰσελθεῖν καὶ γεννηθῆναι; ἀπεκρίθη Ἰησοῦς· ἀμὴν ἀμὴν λέγω σοι, ἐὰν μή τις γεννηθῇ ἐξ ὕδατος καὶ Πνεύματος, οὐ δύναται εἰσελθεῖν εἰς τὴν βασιλείαν τοῦ Θεοῦ. τὸ γεγεννημένον ἐκ τῆς σαρκὸς σάρξ ἐστι, καὶ τὸ γεγεννημένον ἐκ τοῦ Πνεύματος πνεῦμά ἐστι. μὴ θαυμάσῃς ὅτι εἶπόν σοι, δεῖ ὑμᾶς γεννηθῆναι ἄνωθεν. τὸ πνεῦμα ὅπου θέλει πνεῖ, καὶ τὴν φωνὴν αὐτοῦ ἀκούεις, ἀλλ᾽ οὐκ οἶδας πόθεν ἔρχεται καὶ ποῦ ὑπάγει· οὕτως ἐστὶ πᾶς ὁ γεγεννημένος ἐκ τοῦ Πνεύματος. ἀπεκρίθη Νικόδημος καὶ εἶπεν αὐτῷ· πῶς δύναται ταῦτα γενέσθαι; ἀπεκρίθη Ἰησοῦς καὶ εἶπεν αὐτῷ· σὺ εἶ ὁ διδάσκαλος τοῦ Ἰσραὴλ καὶ ταῦτα οὐ γινώσκεις; ἀμὴν ἀμὴν λέγω σοι ὅτι ὃ οἴδαμεν λαλοῦμεν καὶ ὃ ἑωράκαμεν μαρτυροῦμεν, καὶ τὴν μαρτυρίαν ἡμῶν οὐ λαμβάνετε. εἰ τὰ ἐπίγεια εἶπον ὑμῖν καὶ οὐ πιστεύετε, πῶς ἐὰν εἴπω ὑμῖν τὰ ἐπουράνια πιστεύσετε; καὶ οὐδεὶς ἀναβέβηκεν εἰς τὸν οὐρανὸν εἰ μὴ ὁ ἐκ τοῦ οὐρανοῦ καταβάς, ὁ υἱὸς τοῦ ἀνθρώπου ὁ ὢν ἐν τῷ οὐρανῷ. καὶ καθὼς Μωϋσῆς ὕψωσε τὸν ὄφιν ἐν τῇ ἐρήμῳ, οὕτως ὑψωθῆναι δεῖ τὸν υἱὸν τοῦ ἀνθρώπου, ἵνα πᾶς ὁ πιστεύων εἰς αὐτὸν μὴ ἀπόληται, ἀλλ᾽ ἔχῃ ζωὴν αἰώνιον.
ltx/gr_gr_cog/le.go.mc.d075:lemcLI.Gospel.title	Τῇ Πέμπτῃ τῆς Διακαινησίμου
ltx/gr_gr_cog/le.go.mc.d075:lemcLI.Gospel.title_abbr	Πέμπτῃ τῆς Διακαινησίμου
ltx/gr_gr_cog/le.go.mc.d075:lemcLI.Gospel.version	@ltx/gr_gr_cog/properties:version.designation
