ltx/gr_gr_cog/le.ep.me.m08.d31:lemeLI.Epistle.book_abbr	@ltx/gr_gr_cog/le.ep.ge.theotokos:legeLI.Epistle2.book_abbr
ltx/gr_gr_cog/le.ep.me.m08.d31:lemeLI.Epistle.book_string	@ltx/gr_gr_cog/le.ep.ge.theotokos:legeLI.Epistle2.book_string
ltx/gr_gr_cog/le.ep.me.m08.d31:lemeLI.Epistle.chapverse	@ltx/gr_gr_cog/le.ep.ge.theotokos:legeLI.Epistle2.chapverse
ltx/gr_gr_cog/le.ep.me.m08.d31:lemeLI.Epistle.incipit	@ltx/gr_gr_cog/le.ep.ge.theotokos:legeLI.Epistle2.incipit
ltx/gr_gr_cog/le.ep.me.m08.d31:lemeLI.Epistle.text	@ltx/gr_gr_cog/le.ep.ge.theotokos:legeLI.Epistle2.text
ltx/gr_gr_cog/le.ep.me.m08.d31:lemeLI.Epistle.title	Τῆς Θεοτόκου
ltx/gr_gr_cog/le.ep.me.m08.d31:lemeLI.Epistle.title_abbr	Τῆς Θεοτόκου
ltx/gr_gr_cog/le.ep.me.m08.d31:lemeLI.Epistle.version	@ltx/gr_gr_cog/le.ep.ge.theotokos:legeLI.Epistle2.version
