ltx/gr_gr_cog/le.go.mc.d070:lemcLI.Gospel.book_abbr	@ltx/gr_gr_cog/bible:Matthew.abbr
ltx/gr_gr_cog/le.go.mc.d070:lemcLI.Gospel.book_string	@ltx/gr_gr_cog/bible:Matthew.text
ltx/gr_gr_cog/le.go.mc.d070:lemcLI.Gospel.chapverse	27:63 – 66
ltx/gr_gr_cog/le.go.mc.d070:lemcLI.Gospel.incipit	Τῇ ἐπαύριον…
ltx/gr_gr_cog/le.go.mc.d070:lemcLI.Gospel.text	Τῇ ἐπαύριον, ἥτις ἐστὶ μετὰ τὴν παρασκευήν, συνήχθησαν οἱ ἀρχιερεῖς καὶ οἱ Φαρισαῖοι πρὸς Πιλᾶτον λέγοντες· κύριε, ἐμνήσθημεν ὅτι ἐκεῖνος ὁ πλάνος εἶπεν ἔτι ζῶν, μετὰ τρεῖς ἡμέρας ἐγείρομαι. κέλευσον οὖν ἀσφαλισθῆναι τὸν τάφον ἕως τῆς τρίτης ἡμέρας, μήποτε ἐλθόντες οἱ μαθηταὶ αὐτοῦ νυκτὸς κλέψωσιν αὐτὸν καὶ εἴπωσι τῷ λαῷ, ἠγέρθη ἀπὸ τῶν νεκρῶν· καὶ ἔσται ἡ ἐσχάτη πλάνη χείρων τῆς πρώτης. ἔφη αὐτοῖς ὁ Πιλᾶτος· ἔχετε κουστωδίαν· ὑπάγετε ἀσφαλίσασθε ὡς οἴδατε. οἱ δὲ πορευθέντες ἠσφαλίσαντο τὸν τάφον σφραγίσαντες τὸν λίθον μετὰ τῆς κουστωδίας.
ltx/gr_gr_cog/le.go.mc.d070:lemcLI.Gospel.title	Τῷ Ἁγίῳ καὶ Μεγάλῳ Σαββάτῳ
ltx/gr_gr_cog/le.go.mc.d070:lemcLI.Gospel.title_abbr	Τῷ Μεγάλῳ Σαββάτῳ
ltx/gr_gr_cog/le.go.mc.d070:lemcLI.Gospel.version	@ltx/gr_gr_cog/properties:version.designation
ltx/gr_gr_cog/le.go.mc.d070:lemcVE.Gospel.book_abbr	@ltx/gr_gr_cog/bible:Matthew.abbr
ltx/gr_gr_cog/le.go.mc.d070:lemcVE.Gospel.book_string	@ltx/gr_gr_cog/bible:Matthew.text
ltx/gr_gr_cog/le.go.mc.d070:lemcVE.Gospel.chapverse	Ματθ. 27:1 – 38, Λουκ. 23:39 – 43, Ματθ. 27:39 – 54, Ιω 19:31 – 37, Ματθ. 27:55 – 61
ltx/gr_gr_cog/le.go.mc.d070:lemcVE.Gospel.incipit	Συμβούλιον ἔλαβον πάντες οἱ ἀρχιερεῖς…
ltx/gr_gr_cog/le.go.mc.d070:lemcVE.Gospel.par1.text	Τῷ καιρῷ ἐκείνῳ, συμβούλιον ἔλαβον πάντες οἱ ἀρχιερεῖς καὶ οἱ πρεσβύτεροι τοῦ λαοῦ κατὰ τοῦ Ἰησοῦ ὥστε θανατῶσαι αὐτόν· καὶ δήσαντες αὐτὸν ἀπήγαγον καὶ παρέδωκαν αὐτὸν Ποντίῳ Πιλάτῳ τῷ ἡγεμόνι. Τότε ἰδὼν Ἰούδας ὁ παραδιδοὺς αὐτὸν ὅτι κατεκρίθη, μεταμεληθεὶς ἀπέστρεψε τὰ τριάκοντα ἀργύρια τοῖς ἀρχιερεῦσι καὶ τοῖς πρεσβυτέροις λέγων· ἥμαρτον παραδοὺς αἷμα ἀθῷον. οἱ δὲ εἶπον· τί πρὸς ἡμᾶς; σὺ ὄψει. καὶ ῥίψας τὰ ἀργύρια ἐν τῷ ναῷ ἀνεχώρησε, καὶ ἀπελθὼν ἀπήγξατο. οἱ δὲ ἀρχιερεῖς λαβόντες τὰ ἀργύρια εἶπον· οὐκ ἔξεστι βαλεῖν αὐτὰ εἰς τὸν κορβανᾶν, ἐπεὶ τιμὴ αἵματός ἐστι. συμβούλιον δὲ λαβόντες ἠγόρασαν ἐξ αὐτῶν τὸν ἀγρὸν τοῦ κεραμέως εἰς ταφὴν τοῖς ξένοις· διὸ ἐκλήθη ὁ ἀγρὸς ἐκεῖνος ἀγρὸς αἵματος ἕως τῆς σήμερον. τότε ἐπληρώθη τὸ ῥηθὲν διὰ Ἱερεμίου τοῦ προφήτου λέγοντος· καὶ ἔλαβον τὰ τριάκοντα ἀργύρια, τὴν τιμὴν τοῦ τετιμημένου ὃν ἐτιμήσαντο ἀπὸ υἱῶν Ἰσραήλ, καὶ ἔδωκαν αὐτὰ εἰς τὸν ἀγρὸν τοῦ κεραμέως, καθὰ συνέταξέ μοι Κύριος. Ὁ δὲ Ἰησοῦς ἔστη ἔμπροσθεν τοῦ ἡγεμόνος· καὶ ἐπηρώτησεν αὐτὸν ὁ ἡγεμὼν λέγων· σὺ εἶ ὁ βασιλεὺς τῶν Ἰουδαίων; ὁ δὲ Ἰησοῦς ἔφη αὐτῷ· σὺ λέγεις. καὶ ἐν τῷ κατηγορεῖσθαι αὐτὸν ὑπὸ τῶν ἀρχιερέων καὶ τῶν πρεσβυτέρων οὐδὲν ἀπεκρίνατο. τότε λέγει αὐτῷ ὁ Πιλᾶτος· οὐκ ἀκούεις πόσα σου καταμαρτυροῦσι; καὶ οὐκ ἀπεκρίθη αὐτῷ πρὸς οὐδὲ ἓν ρῆμα, ὥστε θαυμάζειν τὸν ἡγεμόνα λίαν. Κατὰ δὲ ἑορτὴν εἰώθει ὁ ἡγεμὼν ἀπολύειν ἕνα τῷ ὄχλῳ δέσμιον, ὃν ἤθελον. εἶχον δὲ τότε δέσμιον ἐπίσημον λεγόμενον Βαραββᾶν. συνηγμένων οὖν αὐτῶν εἶπεν αὐτοῖς ὁ Πιλᾶτος· τίνα θέλετε ἀπολύσω ὑμῖν; Βαραββᾶν ἢ Ἰησοῦν τὸν λεγόμενον Χριστόν; ᾔδει γὰρ ὅτι διὰ φθόνον παρέδωκαν αὐτόν. Καθημένου δὲ αὐτοῦ ἐπὶ τοῦ βήματος ἀπέστειλε πρὸς αὐτὸν ἡ γυνὴ αὐτοῦ λέγουσα· μηδὲν σοὶ καὶ τῷ δικαίῳ ἐκείνῳ· πολλὰ γὰρ ἔπαθον σήμερον κατ᾿ ὄναρ δι᾿ αὐτόν. Οἱ δὲ ἀρχιερεῖς καὶ οἱ πρεσβύτεροι ἔπεισαν τοὺς ὄχλους ἵνα αἰτήσωνται τὸν Βαραββᾶν, τὸν δὲ Ἰησοῦν ἀπολέσωσιν. ἀποκριθεὶς δὲ ὁ ἡγεμὼν εἶπεν αὐτοῖς· τίνα θέλετε ἀπὸ τῶν δύο ἀπολύσω ὑμῖν; οἱ δὲ εἶπον· Βαραββᾶν. λέγει αὐτοῖς ὁ Πιλᾶτος· τί οὖν ποιήσω Ἰησοῦν τὸν λεγόμενον Χριστόν; λέγουσιν αὐτῷ πάντες· σταυρωθήτω. ὁ δὲ ἡγεμὼν ἔφη· τί γὰρ κακὸν ἐποίησεν; οἱ δὲ περισσῶς ἔκραζον λέγοντες· σταυρωθήτω. ἰδὼν δὲ ὁ Πιλᾶτος ὅτι οὐδὲν ὠφελεῖ, ἀλλὰ μᾶλλον θόρυβος γίνεται, λαβὼν ὕδωρ ἀπενίψατο τὰς χεῖρας ἀπέναντι τοῦ ὄχλου λέγων· ἀθῷός εἰμι ἀπὸ τοῦ αἵματος τοῦ δικαίου τούτου· ὑμεῖς ὄψεσθε. καὶ ἀποκριθεὶς πᾶς ὁ λαὸς εἶπε· τὸ αἷμα αὐτοῦ ἐφ᾿ ἡμᾶς καὶ ἐπὶ τὰ τέκνα ἡμῶν. τότε ἀπέλυσεν αὐτοῖς τὸν Βαραββᾶν, τὸν δὲ Ἰησοῦν φραγελλώσας παρέδωκεν ἵνα σταυρωθῇ. Τότε οἱ στρατιῶται τοῦ ἡγεμόνος παραλαβόντες τὸν Ἰησοῦν εἰς τὸ πραιτώριον συνήγαγον ἐπ᾿ αὐτὸν ὅλην τὴν σπεῖραν· καὶ ἐκδύσαντες αὐτὸν περιέθηκαν αὐτῷ χλαμύδα κοκκίνην, καὶ πλέξαντες στέφανον ἐξ ἀκανθῶν ἐπέθηκαν ἐπὶ τὴν κεφαλὴν αὐτοῦ καὶ κάλαμον ἐπὶ τὴν δεξιὰν αὐτοῦ, καὶ γονυπετήσαντες ἔμπροσθεν αὐτοῦ ἐνέπαιζον αὐτῷ λέγοντες· χαῖρε ὁ βασιλεὺς τῶν Ἰουδαίων· καὶ ἐμπτύσαντες εἰς αὐτὸν ἔλαβον τὸν κάλαμον καὶ ἔτυπτον εἰς τὴν κεφαλὴν αὐτοῦ. καὶ ὅτε ἐνέπαιξαν αὐτῷ, ἐξέδυσαν αὐτὸν τὴν χλαμύδα καὶ ἐνέδυσαν αὐτὸν τὰ ἱμάτια αὐτοῦ, καὶ ἀπήγαγον αὐτὸν εἰς τὸ σταυρῶσαι. Ἐξερχόμενοι δὲ εὗρον ἄνθρωπον Κυρηναῖον ὀνόματι Σίμωνα· τοῦτον ἠγγάρευσαν ἵνα ἄρῃ τὸν σταυρὸν αὐτοῦ. Καὶ ἐλθόντες εἰς τόπον λεγόμενον Γολγοθᾶ, ὅ ἐστι λεγόμενος κρανίου τόπος, ἔδωκαν αὐτῷ πιεῖν ὄξος μετὰ χολῆς μεμιγμένον· καὶ γευσάμενος οὐκ ἤθελε πιεῖν. σταυρώσαντες δὲ αὐτὸν διεμερίσαντο τὰ ἱμάτια αὐτοῦ βαλόντες κλῆρον, καὶ καθήμενοι ἐτήρουν αὐτὸν ἐκεῖ. καὶ ἐπέθηκαν ἐπάνω τῆς κεφαλῆς αὐτοῦ τὴν αἰτίαν αὐτοῦ γεγραμμένην· οὗτός ἐστιν Ἰησοῦς ὁ βασιλεὺς τῶν Ἰουδαίων. Τότε σταυροῦνται σὺν αὐτῷ δύο λῃσταί, εἷς ἐκ δεξιῶν καὶ εἷς ἐξ εὐωνύμων.
ltx/gr_gr_cog/le.go.mc.d070:lemcVE.Gospel.par1.title	(Ματθ. κζʹ 1 – 38)
ltx/gr_gr_cog/le.go.mc.d070:lemcVE.Gospel.par2.text	Εἷς δὲ τῶν κρεμασθέντων κακούργων ἐβλασφήμει αὐτὸν λέγων· εἰ σὺ εἶ ὁ Χριστός, σῶσον σεαυτὸν καὶ ἡμᾶς. ἀποκριθεὶς δὲ ὁ ἕτερος ἐπετίμα αὐτῷ λέγων· οὐδὲ φοβῇ σὺ τὸν Θεόν, ὅτι ἐν τῷ αὐτῷ κρίματι εἶ; καὶ ἡμεῖς μὲν δικαίως· ἄξια γὰρ ὧν ἐπράξαμεν ἀπολαμβάνομεν· οὗτος δὲ οὐδὲν ἄτοπον ἔπραξε. καὶ ἔλεγε τῷ Ἰησοῦ· μνήσθητί μου, Κύριε, ὅταν ἔλθῃς ἐν τῇ βασιλείᾳ σου. καὶ εἶπεν αὐτῷ ὁ Ἰησοῦς· ἀμὴν λέγω σοι, σήμερον μετ᾿ ἐμοῦ ἔσῃ ἐν τῷ παραδείσῳ.
ltx/gr_gr_cog/le.go.mc.d070:lemcVE.Gospel.par2.title	(Λουκ. κγʹ 39 – 43)
ltx/gr_gr_cog/le.go.mc.d070:lemcVE.Gospel.par3.text	Οἱ δὲ παραπορευόμενοι ἐβλασφήμουν αὐτὸν κινοῦντες τὰς κεφαλὰς αὐτῶν καὶ λέγοντες· ὁ καταλύων τὸν ναὸν καὶ ἐν τρισὶν ἡμέραις οἰκοδομῶν! σῶσον σεαυτόν· εἰ υἱὸς εἶ τοῦ Θεοῦ, κατάβηθι ἀπὸ τοῦ σταυροῦ. ὁμοίως δὲ καὶ οἱ ἀρχιερεῖς ἐμπαίζοντες μετὰ τῶν γραμματέων καὶ πρεσβυτέρων καὶ Φαρισαίων ἔλεγον· ἄλλους ἔσωσεν, ἑαυτὸν οὐ δύναται σῶσαι· εἰ βασιλεὺς Ἰσραήλ ἐστι, καταβάτω νῦν ἀπὸ τοῦ σταυροῦ καὶ πιστεύσομεν ἐπ᾿ αὐτῷ· πέποιθεν ἐπὶ τὸν Θεόν, ῥυσάσθω νῦν αὐτόν, εἰ θέλει αὐτόν· εἶπε γὰρ ὅτι Θεοῦ εἰμι υἱός. τὸ δ᾿ αὐτὸ καὶ οἱ λῃσταὶ οἱ συσταυρωθέντες αὐτῷ ὠνείδιζον αὐτόν. Ἀπὸ δὲ ἕκτης ὥρας σκότος ἐγένετο ἐπὶ πᾶσαν τὴν γῆν ἕως ὥρας ἐνάτης. περὶ δὲ τὴν ἐνάτην ὥραν ἀνεβόησεν ὁ Ἰησοῦς φωνῇ μεγάλῃ λέγων· ἠλὶ ἠλί, λιμᾶ σαβαχθανί; τοῦτ᾿ ἔστι, Θεέ μου Θεέ μου, ἱνατί με ἐγκατέλιπες; τινὲς δὲ τῶν ἐκεῖ ἑστώτων ἀκούσαντες ἔλεγον ὅτι Ἠλίαν φωνεῖ οὗτος. καὶ εὐθέως δραμὼν εἷς ἐξ αὐτῶν καὶ λαβὼν σπόγγον πλήσας τε ὄξους καὶ περιθεὶς καλάμῳ ἐπότιζεν αὐτόν. οἱ δὲ λοιποὶ ἔλεγον· ἄφες ἴδωμεν εἰ ἔρχεται Ἠλίας σώσων αὐτόν. ὁ δὲ Ἰησοῦς πάλιν κράξας φωνῇ μεγάλῃ ἀφῆκε τὸ πνεῦμα. Καὶ ἰδοὺ τὸ καταπέτασμα τοῦ ναοῦ ἐσχίσθη εἰς δύο ἀπὸ ἄνωθεν ἕως κάτω, καὶ ἡ γῆ ἐσείσθη καὶ αἱ πέτραι ἐσχίσθησαν, καὶ τὰ μνημεῖα ἀνεῴχθησαν καὶ πολλὰ σώματα τῶν κεκοιμημένων ἁγίων ἠγέρθη, καὶ ἐξελθόντες ἐκ τῶν μνημείων, μετὰ τὴν ἔγερσιν αὐτοῦ εἰσῆλθον εἰς τὴν ἁγίαν πόλιν καὶ ἐνεφανίσθησαν πολλοῖς. Ὁ δὲ ἑκατόνταρχος καὶ οἱ μετ᾿ αὐτοῦ τηροῦντες τὸν Ἰησοῦν, ἰδόντες τὸν σεισμὸν καὶ τὰ γενόμενα ἐφοβήθησαν σφόδρα λέγοντες· ἀληθῶς Θεοῦ υἱὸς ἦν οὗτος.
ltx/gr_gr_cog/le.go.mc.d070:lemcVE.Gospel.par3.title	(Ματθ. κζʹ 39 – 54)
ltx/gr_gr_cog/le.go.mc.d070:lemcVE.Gospel.par4.text	Οἱ οὖν Ἰουδαῖοι, ἵνα μὴ μείνῃ ἐπὶ τοῦ σταυροῦ τὰ σώματα ἐν τῷ σαββάτῳ, ἐπεὶ παρασκευὴ ἦν· ἦν γὰρ μεγάλη ἡ ἡμέρα ἐκείνη τοῦ σαββάτου· ἠρώτησαν τὸν Πιλᾶτον ἵνα κατεαγῶσιν αὐτῶν τὰ σκέλη, καὶ ἀρθῶσιν. ἦλθον οὖν οἱ στρατιῶται, καὶ τοῦ μὲν πρώτου κατέαξαν τὰ σκέλη καὶ τοῦ ἄλλου τοῦ συσταυρωθέντος αὐτῷ· ἐπὶ δὲ τὸν Ἰησοῦν ἐλθόντες ὡς εἶδον αὐτὸν ἤδη τεθνηκότα, οὐ κατέαξαν αὐτοῦ τὰ σκέλη, ἀλλ᾽ εἷς τῶν στρατιωτῶν λόγχῃ αὐτοῦ τὴν πλευρὰν ἔνυξε, καὶ εὐθέως ἐξῆλθεν αἷμα καὶ ὕδωρ. καὶ ὁ ἑωρακὼς μεμαρτύρηκε, καὶ ἀληθινὴ αὐτοῦ ἐστιν ἡ μαρτυρία, κἀκεῖνος οἶδεν ὅτι ἀληθῆ λέγει, ἵνα καὶ ὑμεῖς πιστεύσητε. ἐγένετο γὰρ ταῦτα, ἵνα ἡ γραφὴ πληρωθῇ, ὀστοῦν οὐ συντριβήσεται αὐτοῦ. καὶ πάλιν ἑτέρα γραφὴ λέγει· ὄψονται εἰς ὃν ἐξεκέντησαν.
ltx/gr_gr_cog/le.go.mc.d070:lemcVE.Gospel.par4.title	(Ιω 19:31 – 37)
ltx/gr_gr_cog/le.go.mc.d070:lemcVE.Gospel.par5.text	Ἦσαν δὲ ἐκεῖ καὶ γυναῖκες πολλαὶ ἀπὸ μακρόθεν θεωροῦσαι, αἵτινες ἠκολούθησαν τῷ Ἰησοῦ ἀπὸ τῆς Γαλιλαίας διακονοῦσαι αὐτῷ· ἐν αἷς ἦν Μαρία ἡ Μαγδαληνή, καὶ Μαρία ἡ τοῦ Ἰακώβου καὶ Ἰωσῆ μήτηρ, καὶ ἡ μήτηρ τῶν υἱῶν Ζεβεδαίου. Ὀψίας δὲ γενομένης ἦλθεν ἄνθρωπος πλούσιος ἀπὸ Ἀριμαθαίας, τοὔνομα Ἰωσήφ, ὃς καὶ αὐτὸς ἐμαθήτευσε τῷ Ἰησοῦ· οὗτος προσελθὼν τῷ Πιλάτῳ ᾐτήσατο τὸ σῶμα τοῦ Ἰησοῦ. τότε ὁ Πιλᾶτος ἐκέλευσεν ἀποδοθῆναι τὸ σῶμα. καὶ λαβὼν τὸ σῶμα ὁ Ἰωσὴφ ἐνετύλιξεν αὐτὸ σινδόνι καθαρᾷ, καὶ ἔθηκεν αὐτὸ ἐν τῷ καινῷ αὐτοῦ μνημείῳ ὃ ἐλατόμησεν ἐν τῇ πέτρᾳ, καὶ προσκυλίσας λίθον μέγαν τῇ θύρᾳ τοῦ μνημείου ἀπῆλθεν. Ἦν δὲ ἐκεῖ Μαρία ἡ Μαγδαληνὴ καὶ ἡ ἄλλη Μαρία, καθήμεναι ἀπέναντι τοῦ τάφου
ltx/gr_gr_cog/le.go.mc.d070:lemcVE.Gospel.par5.title	(Ματθ. κζʹ 55 – 61)
ltx/gr_gr_cog/le.go.mc.d070:lemcVE.Gospel.text	Τῷ καιρῷ ἐκείνῳ, συμβούλιον ἔλαβον πάντες οἱ ἀρχιερεῖς καὶ οἱ πρεσβύτεροι τοῦ λαοῦ κατὰ τοῦ Ἰησοῦ ὥστε θανατῶσαι αὐτόν· καὶ δήσαντες αὐτὸν ἀπήγαγον καὶ παρέδωκαν αὐτὸν Ποντίῳ Πιλάτῳ τῷ ἡγεμόνι. Τότε ἰδὼν Ἰούδας ὁ παραδιδοὺς αὐτὸν ὅτι κατεκρίθη, μεταμεληθεὶς ἀπέστρεψε τὰ τριάκοντα ἀργύρια τοῖς ἀρχιερεῦσι καὶ τοῖς πρεσβυτέροις λέγων· ἥμαρτον παραδοὺς αἷμα ἀθῷον. οἱ δὲ εἶπον· τί πρὸς ἡμᾶς; σὺ ὄψει. καὶ ῥίψας τὰ ἀργύρια ἐν τῷ ναῷ ἀνεχώρησε, καὶ ἀπελθὼν ἀπήγξατο. οἱ δὲ ἀρχιερεῖς λαβόντες τὰ ἀργύρια εἶπον· οὐκ ἔξεστι βαλεῖν αὐτὰ εἰς τὸν κορβανᾶν, ἐπεὶ τιμὴ αἵματός ἐστι. συμβούλιον δὲ λαβόντες ἠγόρασαν ἐξ αὐτῶν τὸν ἀγρὸν τοῦ κεραμέως εἰς ταφὴν τοῖς ξένοις· διὸ ἐκλήθη ὁ ἀγρὸς ἐκεῖνος ἀγρὸς αἵματος ἕως τῆς σήμερον. τότε ἐπληρώθη τὸ ῥηθὲν διὰ Ἱερεμίου τοῦ προφήτου λέγοντος· καὶ ἔλαβον τὰ τριάκοντα ἀργύρια, τὴν τιμὴν τοῦ τετιμημένου ὃν ἐτιμήσαντο ἀπὸ υἱῶν Ἰσραήλ, καὶ ἔδωκαν αὐτὰ εἰς τὸν ἀγρὸν τοῦ κεραμέως, καθὰ συνέταξέ μοι Κύριος. Ὁ δὲ Ἰησοῦς ἔστη ἔμπροσθεν τοῦ ἡγεμόνος· καὶ ἐπηρώτησεν αὐτὸν ὁ ἡγεμὼν λέγων· σὺ εἶ ὁ βασιλεὺς τῶν Ἰουδαίων; ὁ δὲ Ἰησοῦς ἔφη αὐτῷ· σὺ λέγεις. καὶ ἐν τῷ κατηγορεῖσθαι αὐτὸν ὑπὸ τῶν ἀρχιερέων καὶ τῶν πρεσβυτέρων οὐδὲν ἀπεκρίνατο. τότε λέγει αὐτῷ ὁ Πιλᾶτος· οὐκ ἀκούεις πόσα σου καταμαρτυροῦσι; καὶ οὐκ ἀπεκρίθη αὐτῷ πρὸς οὐδὲ ἓν ρῆμα, ὥστε θαυμάζειν τὸν ἡγεμόνα λίαν. Κατὰ δὲ ἑορτὴν εἰώθει ὁ ἡγεμὼν ἀπολύειν ἕνα τῷ ὄχλῳ δέσμιον, ὃν ἤθελον. εἶχον δὲ τότε δέσμιον ἐπίσημον λεγόμενον Βαραββᾶν. συνηγμένων οὖν αὐτῶν εἶπεν αὐτοῖς ὁ Πιλᾶτος· τίνα θέλετε ἀπολύσω ὑμῖν; Βαραββᾶν ἢ Ἰησοῦν τὸν λεγόμενον Χριστόν; ᾔδει γὰρ ὅτι διὰ φθόνον παρέδωκαν αὐτόν. Καθημένου δὲ αὐτοῦ ἐπὶ τοῦ βήματος ἀπέστειλε πρὸς αὐτὸν ἡ γυνὴ αὐτοῦ λέγουσα· μηδὲν σοὶ καὶ τῷ δικαίῳ ἐκείνῳ· πολλὰ γὰρ ἔπαθον σήμερον κατ᾿ ὄναρ δι᾿ αὐτόν. Οἱ δὲ ἀρχιερεῖς καὶ οἱ πρεσβύτεροι ἔπεισαν τοὺς ὄχλους ἵνα αἰτήσωνται τὸν Βαραββᾶν, τὸν δὲ Ἰησοῦν ἀπολέσωσιν. ἀποκριθεὶς δὲ ὁ ἡγεμὼν εἶπεν αὐτοῖς· τίνα θέλετε ἀπὸ τῶν δύο ἀπολύσω ὑμῖν; οἱ δὲ εἶπον· Βαραββᾶν. λέγει αὐτοῖς ὁ Πιλᾶτος· τί οὖν ποιήσω Ἰησοῦν τὸν λεγόμενον Χριστόν; λέγουσιν αὐτῷ πάντες· σταυρωθήτω. ὁ δὲ ἡγεμὼν ἔφη· τί γὰρ κακὸν ἐποίησεν; οἱ δὲ περισσῶς ἔκραζον λέγοντες· σταυρωθήτω. ἰδὼν δὲ ὁ Πιλᾶτος ὅτι οὐδὲν ὠφελεῖ, ἀλλὰ μᾶλλον θόρυβος γίνεται, λαβὼν ὕδωρ ἀπενίψατο τὰς χεῖρας ἀπέναντι τοῦ ὄχλου λέγων· ἀθῷός εἰμι ἀπὸ τοῦ αἵματος τοῦ δικαίου τούτου· ὑμεῖς ὄψεσθε. καὶ ἀποκριθεὶς πᾶς ὁ λαὸς εἶπε· τὸ αἷμα αὐτοῦ ἐφ᾿ ἡμᾶς καὶ ἐπὶ τὰ τέκνα ἡμῶν. τότε ἀπέλυσεν αὐτοῖς τὸν Βαραββᾶν, τὸν δὲ Ἰησοῦν φραγελλώσας παρέδωκεν ἵνα σταυρωθῇ. Τότε οἱ στρατιῶται τοῦ ἡγεμόνος παραλαβόντες τὸν Ἰησοῦν εἰς τὸ πραιτώριον συνήγαγον ἐπ᾿ αὐτὸν ὅλην τὴν σπεῖραν· καὶ ἐκδύσαντες αὐτὸν περιέθηκαν αὐτῷ χλαμύδα κοκκίνην, καὶ πλέξαντες στέφανον ἐξ ἀκανθῶν ἐπέθηκαν ἐπὶ τὴν κεφαλὴν αὐτοῦ καὶ κάλαμον ἐπὶ τὴν δεξιὰν αὐτοῦ, καὶ γονυπετήσαντες ἔμπροσθεν αὐτοῦ ἐνέπαιζον αὐτῷ λέγοντες· χαῖρε ὁ βασιλεὺς τῶν Ἰουδαίων· καὶ ἐμπτύσαντες εἰς αὐτὸν ἔλαβον τὸν κάλαμον καὶ ἔτυπτον εἰς τὴν κεφαλὴν αὐτοῦ. καὶ ὅτε ἐνέπαιξαν αὐτῷ, ἐξέδυσαν αὐτὸν τὴν χλαμύδα καὶ ἐνέδυσαν αὐτὸν τὰ ἱμάτια αὐτοῦ, καὶ ἀπήγαγον αὐτὸν εἰς τὸ σταυρῶσαι. Ἐξερχόμενοι δὲ εὗρον ἄνθρωπον Κυρηναῖον ὀνόματι Σίμωνα· τοῦτον ἠγγάρευσαν ἵνα ἄρῃ τὸν σταυρὸν αὐτοῦ. Καὶ ἐλθόντες εἰς τόπον λεγόμενον Γολγοθᾶ, ὅ ἐστι λεγόμενος κρανίου τόπος, ἔδωκαν αὐτῷ πιεῖν ὄξος μετὰ χολῆς μεμιγμένον· καὶ γευσάμενος οὐκ ἤθελε πιεῖν. σταυρώσαντες δὲ αὐτὸν διεμερίσαντο τὰ ἱμάτια αὐτοῦ βαλόντες κλῆρον, καὶ καθήμενοι ἐτήρουν αὐτὸν ἐκεῖ. καὶ ἐπέθηκαν ἐπάνω τῆς κεφαλῆς αὐτοῦ τὴν αἰτίαν αὐτοῦ γεγραμμένην· οὗτός ἐστιν Ἰησοῦς ὁ βασιλεὺς τῶν Ἰουδαίων. Τότε σταυροῦνται σὺν αὐτῷ δύο λῃσταί, εἷς ἐκ δεξιῶν καὶ εἷς ἐξ εὐωνύμων. Εἷς δὲ τῶν κρεμασθέντων κακούργων ἐβλασφήμει αὐτὸν λέγων· εἰ σὺ εἶ ὁ Χριστός, σῶσον σεαυτὸν καὶ ἡμᾶς. ἀποκριθεὶς δὲ ὁ ἕτερος ἐπετίμα αὐτῷ λέγων· οὐδὲ φοβῇ σὺ τὸν Θεόν, ὅτι ἐν τῷ αὐτῷ κρίματι εἶ; καὶ ἡμεῖς μὲν δικαίως· ἄξια γὰρ ὧν ἐπράξαμεν ἀπολαμβάνομεν· οὗτος δὲ οὐδὲν ἄτοπον ἔπραξε. καὶ ἔλεγε τῷ Ἰησοῦ· μνήσθητί μου, Κύριε, ὅταν ἔλθῃς ἐν τῇ βασιλείᾳ σου. καὶ εἶπεν αὐτῷ ὁ Ἰησοῦς· ἀμὴν λέγω σοι, σήμερον μετ᾿ ἐμοῦ ἔσῃ ἐν τῷ παραδείσῳ. Οἱ δὲ παραπορευόμενοι ἐβλασφήμουν αὐτὸν κινοῦντες τὰς κεφαλὰς αὐτῶν καὶ λέγοντες· ὁ καταλύων τὸν ναὸν καὶ ἐν τρισὶν ἡμέραις οἰκοδομῶν! σῶσον σεαυτόν· εἰ υἱὸς εἶ τοῦ Θεοῦ, κατάβηθι ἀπὸ τοῦ σταυροῦ. ὁμοίως δὲ καὶ οἱ ἀρχιερεῖς ἐμπαίζοντες μετὰ τῶν γραμματέων καὶ πρεσβυτέρων καὶ Φαρισαίων ἔλεγον· ἄλλους ἔσωσεν, ἑαυτὸν οὐ δύναται σῶσαι· εἰ βασιλεὺς Ἰσραήλ ἐστι, καταβάτω νῦν ἀπὸ τοῦ σταυροῦ καὶ πιστεύσομεν ἐπ᾿ αὐτῷ· πέποιθεν ἐπὶ τὸν Θεόν, ῥυσάσθω νῦν αὐτόν, εἰ θέλει αὐτόν· εἶπε γὰρ ὅτι Θεοῦ εἰμι υἱός. τὸ δ᾿ αὐτὸ καὶ οἱ λῃσταὶ οἱ συσταυρωθέντες αὐτῷ ὠνείδιζον αὐτόν. Ἀπὸ δὲ ἕκτης ὥρας σκότος ἐγένετο ἐπὶ πᾶσαν τὴν γῆν ἕως ὥρας ἐνάτης. περὶ δὲ τὴν ἐνάτην ὥραν ἀνεβόησεν ὁ Ἰησοῦς φωνῇ μεγάλῃ λέγων· ἠλὶ ἠλί, λιμᾶ σαβαχθανί; τοῦτ᾿ ἔστι, Θεέ μου Θεέ μου, ἱνατί με ἐγκατέλιπες; τινὲς δὲ τῶν ἐκεῖ ἑστώτων ἀκούσαντες ἔλεγον ὅτι Ἠλίαν φωνεῖ οὗτος. καὶ εὐθέως δραμὼν εἷς ἐξ αὐτῶν καὶ λαβὼν σπόγγον πλήσας τε ὄξους καὶ περιθεὶς καλάμῳ ἐπότιζεν αὐτόν. οἱ δὲ λοιποὶ ἔλεγον· ἄφες ἴδωμεν εἰ ἔρχεται Ἠλίας σώσων αὐτόν. ὁ δὲ Ἰησοῦς πάλιν κράξας φωνῇ μεγάλῃ ἀφῆκε τὸ πνεῦμα. Καὶ ἰδοὺ τὸ καταπέτασμα τοῦ ναοῦ ἐσχίσθη εἰς δύο ἀπὸ ἄνωθεν ἕως κάτω, καὶ ἡ γῆ ἐσείσθη καὶ αἱ πέτραι ἐσχίσθησαν, καὶ τὰ μνημεῖα ἀνεῴχθησαν καὶ πολλὰ σώματα τῶν κεκοιμημένων ἁγίων ἠγέρθη, καὶ ἐξελθόντες ἐκ τῶν μνημείων, μετὰ τὴν ἔγερσιν αὐτοῦ εἰσῆλθον εἰς τὴν ἁγίαν πόλιν καὶ ἐνεφανίσθησαν πολλοῖς. Ὁ δὲ ἑκατόνταρχος καὶ οἱ μετ᾿ αὐτοῦ τηροῦντες τὸν Ἰησοῦν, ἰδόντες τὸν σεισμὸν καὶ τὰ γενόμενα ἐφοβήθησαν σφόδρα λέγοντες· ἀληθῶς Θεοῦ υἱὸς ἦν οὗτος. Οἱ οὖν Ἰουδαῖοι, ἵνα μὴ μείνῃ ἐπὶ τοῦ σταυροῦ τὰ σώματα ἐν τῷ σαββάτῳ, ἐπεὶ παρασκευὴ ἦν· ἦν γὰρ μεγάλη ἡ ἡμέρα ἐκείνη τοῦ σαββάτου· ἠρώτησαν τὸν Πιλᾶτον ἵνα κατεαγῶσιν αὐτῶν τὰ σκέλη, καὶ ἀρθῶσιν. ἦλθον οὖν οἱ στρατιῶται, καὶ τοῦ μὲν πρώτου κατέαξαν τὰ σκέλη καὶ τοῦ ἄλλου τοῦ συσταυρωθέντος αὐτῷ· ἐπὶ δὲ τὸν Ἰησοῦν ἐλθόντες ὡς εἶδον αὐτὸν ἤδη τεθνηκότα, οὐ κατέαξαν αὐτοῦ τὰ σκέλη, ἀλλ᾽ εἷς τῶν στρατιωτῶν λόγχῃ αὐτοῦ τὴν πλευρὰν ἔνυξε, καὶ εὐθέως ἐξῆλθεν αἷμα καὶ ὕδωρ. καὶ ὁ ἑωρακὼς μεμαρτύρηκε, καὶ ἀληθινὴ αὐτοῦ ἐστιν ἡ μαρτυρία, κἀκεῖνος οἶδεν ὅτι ἀληθῆ λέγει, ἵνα καὶ ὑμεῖς πιστεύσητε. ἐγένετο γὰρ ταῦτα, ἵνα ἡ γραφὴ πληρωθῇ, ὀστοῦν οὐ συντριβήσεται αὐτοῦ. καὶ πάλιν ἑτέρα γραφὴ λέγει· ὄψονται εἰς ὃν ἐξεκέντησαν. Ἦσαν δὲ ἐκεῖ καὶ γυναῖκες πολλαὶ ἀπὸ μακρόθεν θεωροῦσαι, αἵτινες ἠκολούθησαν τῷ Ἰησοῦ ἀπὸ τῆς Γαλιλαίας διακονοῦσαι αὐτῷ· ἐν αἷς ἦν Μαρία ἡ Μαγδαληνή, καὶ Μαρία ἡ τοῦ Ἰακώβου καὶ Ἰωσῆ μήτηρ, καὶ ἡ μήτηρ τῶν υἱῶν Ζεβεδαίου. Ὀψίας δὲ γενομένης ἦλθεν ἄνθρωπος πλούσιος ἀπὸ Ἀριμαθαίας, τοὔνομα Ἰωσήφ, ὃς καὶ αὐτὸς ἐμαθήτευσε τῷ Ἰησοῦ· οὗτος προσελθὼν τῷ Πιλάτῳ ᾐτήσατο τὸ σῶμα τοῦ Ἰησοῦ. τότε ὁ Πιλᾶτος ἐκέλευσεν ἀποδοθῆναι τὸ σῶμα. καὶ λαβὼν τὸ σῶμα ὁ Ἰωσὴφ ἐνετύλιξεν αὐτὸ σινδόνι καθαρᾷ, καὶ ἔθηκεν αὐτὸ ἐν τῷ καινῷ αὐτοῦ μνημείῳ ὃ ἐλατόμησεν ἐν τῇ πέτρᾳ, καὶ προσκυλίσας λίθον μέγαν τῇ θύρᾳ τοῦ μνημείου ἀπῆλθεν. Ἦν δὲ ἐκεῖ Μαρία ἡ Μαγδαληνὴ καὶ ἡ ἄλλη Μαρία, καθήμεναι ἀπέναντι τοῦ τάφου.
ltx/gr_gr_cog/le.go.mc.d070:lemcVE.Gospel.title	Τῇ Ἁγίᾳ καὶ Μεγάλῃ Παρασκευῇ εἰς τὸν Ἑσπερινόν
ltx/gr_gr_cog/le.go.mc.d070:lemcVE.Gospel.title_abbr	Τῇ Μεγάλῃ Παρασκευῇ εἰς τὸν Ἑσπερινόν
ltx/gr_gr_cog/le.go.mc.d070:lemcVE.Gospel.version	@ltx/gr_gr_cog/properties:version.designation
