ltx/gr_gr_cog/sy.m10.d23:cl.syMA.commemoration01.text	[saint/com 1]
ltx/gr_gr_cog/sy.m10.d23:cl.syMA.commemoration02.text	[saint/com 2]
ltx/gr_gr_cog/sy.m10.d23:cl.syMA.commemoration03.text	[saint/com 3]
ltx/gr_gr_cog/sy.m10.d23:cl.syMA.commemoration04.text	[saint/com 4]
ltx/gr_gr_cog/sy.m10.d23:cl.syMA.commemoration05.text	[saint/com 5]
ltx/gr_gr_cog/sy.m10.d23:cl.syMA.commemoration06.text	[saint/com list]
ltx/gr_gr_cog/sy.m10.d23:syMA.commemoration01.couplet1.title	@ltx/gr_gr_cog/titles:ti.Verses
ltx/gr_gr_cog/sy.m10.d23:syMA.commemoration01.couplet1.verse1	Κληθεὶς ἀδελφὸς τοῦ κατακρίτου ξύλῳ,
ltx/gr_gr_cog/sy.m10.d23:syMA.commemoration01.couplet1.verse2	Θνῇσκεις δι̉ αὐτόν, παμμάκαρ, κρουσθεὶς ξύλῳ.
ltx/gr_gr_cog/sy.m10.d23:syMA.commemoration01.narration.p01	Οὗτος ὁ ἅγιος Ἰάκωβος ὁ Ἀδελφόθεος, πρῶτος Ἐπίσκοπος ἐν Ἱεροσολύμοις ἐγένετο, παρʼ αὐτοῦ τοῦ Κυρίου χειροτονηθείς, καὶ πρῶτος τὴν θείαν Λειτουργίαν ἔγραψε καὶ ἐξέθετο, παρʼ αὐτοῦ τοῦ Χριστοῦ ταύτην διδαχθείς· ἥν τινα Λειτουργίαν ὕστερον συντομωτέραν ἐποίησεν ὁ μέγας Βασίλειος καὶ μετʼ αὐτὸν ὁ θεῖος Χρυσόστομος, διὰ τὴν τῶν ἀνθρώπων ἀσθένειαν. Ποιμαίνων δὲ τὴν ἐν Ἱεροσολύμοις Ἐκκλησίαν καὶ πολλοὺς διδάσκων ἐκ τῶν Ἰουδαίων καὶ Ἑλλήνων καὶ ἐπιστρέφων αὐτοὺς ἐπὶ τὸν Κύριον, εἰς ὀργὴν ἐκίνησε τοὺς Ἰουδαίους. Κρατήσαντες οὖν αὐτόν, ἔῤῥιψαν ἀπὸ τοῦ ἄκρου τοῦ Ἱεροῦ, καὶ ἀπέκτειναν.
ltx/gr_gr_cog/sy.m10.d23:syMA.commemoration01.narration.p02	Περὶ δὲ τοῦ λέγεσθαι Ἀδελφόθεος, φέρεται τοιοῦτος λόγος ἐκ παραδόσεως. Τοῦ μνήστορος Ἰωσήφ, μερίζοντος τὴν γῆν αὑτοῦ τοῖς ἐκ τῆς προτέρας γυναικὸς παισὶ καὶ βουλομένου μερίδα ποιήσασθαι καὶ τῷ ἐκ τῆς ἁγίας Παρθένου Υἱῷ καὶ Θεῷ, οἱ μὲν ἄλλοι οὐ κατεδέξαντο· ὁ δὲ Ἰάκωβος, λαβὼν αὐτὸν εἰς τὴν μερίδα συγκληρονόμον, ἐκλήθη οὐ μόνον Ἀδελφόθεος, ἀλλὰ καὶ Δίκαιος.
ltx/gr_gr_cog/sy.m10.d23:syMA.commemoration01.single1	Ἐσθλὸν Ἀδελφόθεον τριτάτῃ ξύλῳ εἰκάδι πλῆξαν.
ltx/gr_gr_cog/sy.m10.d23:syMA.commemoration01.text	Τῇ ΚΓʹ τοῦ αὐτοῦ μηνὸς μνήμη τοῦ ἁγίου Ἱερομάρτυρος καὶ Ἀποστόλου Ἰακώβου τοῦ Ἀδελφοθέου.
ltx/gr_gr_cog/sy.m10.d23:syMA.commemoration02.couplet1.title	@ltx/gr_gr_cog/titles:ti.Verses
ltx/gr_gr_cog/sy.m10.d23:syMA.commemoration02.couplet1.verse1	Εὗρες μεταστὰς τὴν παλαιὰν ἀξίαν,
ltx/gr_gr_cog/sy.m10.d23:syMA.commemoration02.couplet1.verse2	Ἰγνάτιε Πρόεδρε Ῥώμης τῆς Νέας.
ltx/gr_gr_cog/sy.m10.d23:syMA.commemoration02.narration.p01	Ὁ ἐν ἁγίοις Πατὴρ ἡμῶν Ἰγνάτιος, υἱὸς μὲν γέγονε Μιχαὴλ βασιλέως καὶ Προκοπίας τῆς βασιλίσσης, ἀδελφὸς δὲ Θεοφίλου καὶ ἔγγονος Νικηφόρου τοῦ βασιλέως. Εὐνοῦχος δὲ γενόμενος, εἶτα καὶ Μοναχὸς ἀποκαρεὶς καὶ Ἡγούμενος τῆς τοῦ Ἀρχαγγέλου Μονῆς, τοῦ τότε μὲν ἐπικαλουμένου Ἀνατέλλοντος, νῦν δὲ Σατύρου, προεχειρίσθη ἔπειτα Πατριάρχης Κωνσταντινουπόλεως καὶ ἐκράτησεν ἔτη ἕνδεκα καὶ μῆνας πέντε· καὶ μετὰ ταῦτα ἐξεβλήθη ὑπὸ Μιχαὴλ βασιλέως, ἀντʼ αὐτοῦ Πατριάρχην προβαλομένου Φώτιον τὸν πρωτοσπαθάριον καὶ πρωτασηκρίτην, γενόμενον πρότερον Μοναχόν. Εἶτα ἐξεβλήθη καὶ αὐτὸς ὑπὸ Βασιλείου βασιλέως, καὶ ἀποκατέστη πάλιν Ἰγνάτιος· καὶ ἐκράτησεν ἔτη δέκα· καὶ πάλιν ἐξεβλήθη· καὶ ἐγένετο Στέφανος ὁ ἐν Ἁγίοις. Ὁ δὲ ἅγιος Ἰγνάτιος, ἀπελθὼν ἐν τῇ Σατύρου Μονῇ, ἐν εἰρήνῃ ἀνεπαύσατο.
ltx/gr_gr_cog/sy.m10.d23:syMA.commemoration02.text	Τῇ αὐτῇ ἡμέρᾳ μνήμη τοῦ ὁσίου Πατρὸς ἡμῶν Ἰγνατίου, Πατριάρχου Κωνσταντινουπόλεως.
ltx/gr_gr_cog/sy.m10.d23:syMA.commemoration03.couplet1.title	@ltx/gr_gr_cog/titles:ti.Verses
ltx/gr_gr_cog/sy.m10.d23:syMA.commemoration03.couplet1.verse1	Ἔρημον ἠγάπησας οἰκεῖν, παμμάκαρ,
ltx/gr_gr_cog/sy.m10.d23:syMA.commemoration03.couplet1.verse2	Θεῷ ὁμιλεῖν καταμόνας τῷ μόνῳ.
ltx/gr_gr_cog/sy.m10.d23:syMA.commemoration03.narration.p01	Τρεῖς τινες ἡγιασμένοι γέροντες, Σέργιος καὶ Ὑγῖνος καὶ Θεόφιλος, ἐκ τῆς Μονῆς τοῦ Ἁγίου Ἀσκληπιοῦ, τοῦ ἐν τῇ Μεσοποταμίᾳ τῆς Συρίας, ὁμονοήσαντες ἐπʼ ἀγαθῷ ποτε λογισμῷ, σκοπὸν ἔσχον ἄχρι τέλους τὴν περίγειον ταύτην διελθεῖν· καὶ τῆς πορείας ἀρξάμενοι, ἀλλεπάλληλα εὕρισκον δεινά, πῇ μὲν ἐξ ἀνθρώπων, πῇ δὲ ἐκ θηρίων· θλιβόμενοι, κακουχούμενοι καὶ αὐτῆς ἔστιν ὅτε τῆς ἐκ τῶν ἀγρίων βοτανῶν τροφῆς ὑστερούμενοι.
ltx/gr_gr_cog/sy.m10.d23:syMA.commemoration03.narration.p02	Τέως ὁδὸν ἡμερῶν οὐκ ὀλίγων διαβιβάσαντες, κατέλαβον τόπον τινά, πορείαν ἀνθρώπου μηνύοντα· διʼ ἧς καὶ ὡδηγήθησαν εἰς σπήλαιον ἀπελθεῖν, φαινόμενον ἐγκάτοικον ἔχειν ἄνθρωπον, διὰ τὸ κεκοσμημένον εὑρεθῆναι· ᾧ εἰσελθόντες, προσεκαρτέρουν ἰδεῖν τὸν τούτου οἰκήτορα. Μετὰ μικρὸν δέ, εὐωδίας τινὸς αἰσθόμενοι, εἶδον ὁμοίωμα ἀνδρὸς ἐστολισμένον ταῖς οἰκείαις θριξίν. Οὗτος δὲ ἦν ὁ ὅσιος τοῦ Θεοῦ Μακάριος ὁ Ῥωμαῖος.
ltx/gr_gr_cog/sy.m10.d23:syMA.commemoration03.narration.p03	Ἐρχόμενος δὲ οὗτος ἐπὶ τὸ σπήλαιον, ᾔσθετο μακρόθεν αὐτῶν· καὶ ῥίψας ἑαυτὸν ὁ γέρων χαμαί, προσηύξατο· καὶ κράξας φωνῇ μεγάλῃ, λέγει· Εἰ ἀπὸ Θεοῦ ἐστε, ἐμφανίσθητέ μοι· εἰ δὲ ἀπὸ τοῦ δαίμονος, ἀπόστητε ἀπʼ ἐμοῦ τοῦ ἁμαρτωλοῦ καὶ ταπεινοῦ. Ἐκεῖνοι δὲ ἀπεκρίναντο· Εὐλόγησον ἡμᾶς, δοῦλε τοῦ Θεοῦ· χριστιανοί ἐσμεν καὶ τῷ διαβόλῳ ἀπεταξάμεθα. Τότε ὁ γέρων ἀναστάς, ἔρχεται πρὸς αὐτούς· καὶ διαχωρίσας τὰς τρίχας ἀπὸ τῆς ὄψεως αὑτοῦ, εὐλόγησεν αὐτούς.
ltx/gr_gr_cog/sy.m10.d23:syMA.commemoration03.narration.p04	Ἦσαν δὲ αἱ τρίχες αὐτοῦ λευκαὶ ὡσεὶ χιών, τὸ δὲ σῶμα αὐτοῦ ὡς δέρμα χελώνης· ἐκ δὲ τοῦ πολλοῦ γήρως, κεχαλασμέναι ἦσαν αἱ ὀφρύες αὐτοῦ ἐπάνω τῶν ὀφθαλμῶν αὐτοῦ· καὶ οἱ ὄνυχες τῶν χειρῶν καὶ τῶν ποδῶν αὐτοῦ πλεῖον εἶχον τῆς σπιθαμῆς· αἱ δὲ τρίχες τοῦ πώγωνος αὐτοῦ, μέχρι τῶν ποδῶν αὐτοῦ.
ltx/gr_gr_cog/sy.m10.d23:syMA.commemoration03.narration.p05	Ἤρξατο οὖν ἐρωτᾶν αὐτοὺς καὶ λέγειν· Πόθεν ἐστέ, τεκνία μου; καὶ διὰ τί ἐληλύθατε ἐνταῦθα; Οἱ δὲ εἶπον αὐτῷ πάντα τὸν σκοπὸν αὐτῶν. Ἀπεκρίθη δὲ ἐκεῖνος· Τεκνία μου, οὐκ ἔστιν ἐν γεννητοῖς τις δυνάμενος κατανοῆσαι τὴν δύναμιν τοῦ Θεοῦ. Ἐγὼ γὰρ ὁ ἀνάξιος ἐσπούδασα τοῦτο ποιῆσαι, καὶ διὰ νυκτὸς ἐφάνη μοί τις, λέγων· Μὴ θελήσῃς πειράσαι τὸν πλάσαντά σε. Οὐ δύνασαι γὰρ πλέον διελθεῖν τοῦ τόπου τούτου. Ταῦτα ἀκούσαντες ἐκεῖνοι, ἐφοβήθησαν φόβον μέγαν.
ltx/gr_gr_cog/sy.m10.d23:syMA.commemoration03.narration.p06	Καὶ ἦν λοιπὸν πρὸς ἑσπέραν, καὶ λέγει αὐτοῖς· Τεκνία μου, ὑποχωρήσατε μικρόν· ἔχω γὰρ δύο παιδία ἐνταῦθα, πρὸς ἑσπέραν ἐρχόμενα· μήπως ξενισθέντα ἐν ὑμῖν, ἀδικήσωσιν ὑμᾶς. Καὶ ἰδοὺ δύο λέοντες, ἐλθόντες ἐκ τῆς ἐρήμου δρομαῖοι, ἔπεσον εἰς τοὺς πόδας αὐτοῦ ὠρυόμενοι· ἐκεῖνοι δὲ πάλιν ἀπὸ τοῦ φόβου ἔπεσον χαμαί. Ὁ δὲ γέρων, ἐπιθεὶς τὰς χεῖρας τοῖς θηρίοις, λέγει πρὸς αὐτά· Τεκνία μου, ἐκ τῆς γῆς τῶν ἀνθρώπων ἐληλύθασί τινες πρός με, ἀλλὰ μηδὲν αὐτοὺς βλάψητε. Καὶ εὐθὺς στραφεὶς πρὸς τοὺς Μοναχούς, λέγει· Δεῦτε ποιήσωμεν, ἀδελφοί, ἑσπερινὸν ὕμνον. Καὶ ὡς ἀνέστησαν οὗτοι περιδεεῖς, δραμόντες οἱ λέοντες, περιέλειχον τοὺς πόδας αὐτῶν.
ltx/gr_gr_cog/sy.m10.d23:syMA.commemoration03.narration.p07	Τῇ δὲ ἑξῆς λέγουσι τῷ Ἁγίῳ· Εἰπὲ ἡμῖν, τίμιε Πάτερ, πῶς ἐνταῦθα ἐλήλυθας; Ὁ δὲ ἀποκριθείς, εἶπεν· Ἐγὼ υἱὸς ἐγενόμην Ἰωάννου τινὸς Ῥωμαίου Συγκλητικοῦ, καὶ ἐμνηστεύσαντό μοι οἱ γονεῖς γυναῖκα, ἐμοῦ μὴ βουλομένου, καὶ ἐγένοντο οἱ γάμοι· καὶ ὅτε ἡμᾶς ἐγκλείειν ἔμελλον εἰς τὸν κοιτῶνα, τοῦ λαοῦ παίζοντος καὶ ὀχλοῦντος οὐ μικρῶς, ἐξῆλθον μόνος ἐγὼ σιωπηλῶς καὶ ἐκρύβην ἐν οἰκήματι γυναικὸς χήρας ἐφʼ ἡμέρας ἑπτά, θρηνούντων ἐκείνων καὶ ζητούντων με. Μετὰ δὲ ταῦτα, μέσης νυκτὸς ἀναστάς, ἦλθον παρὰ τὴν ὁδόν· καὶ εὑρών τινα γηραιόν, εἶπον πρὸς αὐτόν· Ποῦ πορεύῃ, Πάτερ; Ὁ δὲ ἀποκριθεὶς εἶπέ μοι· Ὅπου αὐτὸς ἔχεις τὸν νοῦν σου, ἐκεῖ πορεύομαι. Καὶ ἠκολούθησα αὐτῷ· καὶ διὰ τριῶν ἐτῶν ἦλθον ἐνθάδε σὺν αὐτῷ.
ltx/gr_gr_cog/sy.m10.d23:syMA.commemoration03.narration.p08	Πρό τινων οὖν ἡμερῶν τῆς πρὸς τὰ ἐνταῦθα ἀφίξεώς μου, κοιμωμένων ἡμῶν, ἅμα τῷ διυπνισθῆναί με, ἀπῆλθεν ἐξ ὀφθλαμῶν μου καὶ ἠρξάμην κλαίειν καὶ λυπεῖσθαι. Ὁ δὲ εὐθέως ἐφάνη μοι, λέγων· Ἐγώ εἰμι Ῥαφαὴλ ὁ Ἀρχάγγελος· μὴ οὖν δειλιάσῃς, ἀλλὰ δὸς δόξαν τῷ Θεῷ· ἤδη γὰρ διῆλθες τὰ σκοτεινὰ καὶ ἐλήλυθας εἰς τὸ φῶς· καὶ ταῦτα εἰπών, ἤρθη ἐξ ὀφθαλμῶν μου. Ἐγὼ δὲ εὐθέως ἠρξάμην ὁδεύειν καὶ μετὰ πέντε ἡμέρας ἦλθον ἐνθάδε καὶ εὗρον ἐν τῷ σπηλαίῳ τούτῳ λέαιναν νεκρὰν καὶ τὰ δύο λεοντάρια ἐπʼ αὐτῇ κλαίοντα καὶ κοπτόμενα, μὴ εὑρίσκοντα θηλάσαι· καὶ λαβών, ἔθρεψα αὐτὰ ἐκ τῶν ἀκροδρύων, ὡς γνήσιά μου τέκνα· τὴν δὲ λέαιναν ὀρύξας, κατέχωσα ὑπὸ τὴν γῆν.
ltx/gr_gr_cog/sy.m10.d23:syMA.commemoration03.narration.p09	Καὶ μετὰ τὸ ποιῆσαί με χρόνους δύο, ἐξελθὼν ὥραν ἑβδόμην, ἐκάθησα μετὰ τῶν σκυμνίων τούτων καὶ ἰδοὺ σουδάριον ἐν τῇ γῇ εἶδον κείμενον, ψιλώτατον πάνυ καὶ ἀέριον καὶ ἐξέστην ἐν τῇ διανοίᾳ μου καὶ εἶπον· Πόθεν ἐστὶ τοῦτο; Τῇ δὲ ἑξῆς εὑρίσκω πάλιν πέδιλα σηρικά, καὶ ἐπʼ ἀμφοτέροις ἐκπλαγεὶς καὶ περιβλεψάμενος, εἶδον γυναῖκα καθεζομένην ἐπάνω πέτρας, καὶ ἱματισμῷ χρυσέῳ καὶ πολυτελεῖ κεκοσμημένην καὶ εὐειδῆ οὖσαν, καὶ λέγω αὐτῇ· Πόθεν παραγέγονας; καὶ τί ἐστι τὸ διαβολικὸν τοῦτο σχῆμα; Ἡ δὲ ἔκλαιε πικρῶς, λέγουσα. Ἐγὼ ἡ ταλαίπωρος θυγάτηρ εἰμὶ Ῥωμαίου τινὸς Συγκλητικοῦ καὶ ἠνάγκασάν με οἱ γονεῖς μου γάμῳ συζευχθῆναι, ἐμοῦ μὴ βουλομένης· καὶ ἐκφυγοῦσα ἀπὸ τοῦ συνδέσμου, τούτων μηδενὸς ἐπιγινώσκοντος τὴν φυγήν, πλανῶμαι ἐν ὄρεσι καὶ σπηλαίοις. Ἀλλὰ καὶ νῦν ἐν τοῖς ἐρήμοις τόποις πάρειμι, μὴ γινώσκουσα, ποῦ ἀπέρχομαι. Μὴ οὖν βδελύξῃ με τὴν δούλην σου, ὅτι κἀγὼ οὐκ ᾔδειν. Εἶπον δὲ πρὸς αὐτήν. Ποῦ βούλει ἀπελθεῖν; ἐπειδὴ κἀγὼ οὐκ ἐῶ σε ὧδε εἶναι μετʼ ἐμοῦ. Ἡ δὲ εἶπεν· Ἐν τῇ ἐρήμῳ ταύτῃ ἦλθον κατοικῆσαι. Καὶ λαβὼν αὐτήν, ἐν τῷ σπηλαίῳ ἤγαγον καὶ δέδωκα αὐτῇ φαγεῖν ἐκ τῶν ἀκροδρύων ὧν ἤσθιον, καὶ τὰ δάκρυα αὐτῆς κρουνηδὸν ἔῤῥεον, κἀμοῦ ἡ ψυχὴ σύντρομος γέγονεν.
ltx/gr_gr_cog/sy.m10.d23:syMA.commemoration03.narration.p10	Ὁπηνίκα δὲ ἡ ἑσπέρα κατέλαβε καὶ τὴν ἑσπερινὴν τελέσας εὐχήν, ἀνεκλίθην εἰς τὴν γῆν ὀλίγον ἡσυχάσαι, ἤρξατό με ταράσσειν ὁ Σατανᾶς· καὶ ὁ μηδέποτε ἐπιθυμήσας τινὸς ἁμαρτίας σαρκικῆς, ἠράσθην τῆς γυναικὸς καὶ ἠβουλήθην συγγενέσθαι αὐτῇ· καὶ ἰδοὺ ἄφνω ἀφανὴς ἐγένετο ἀπʼ ἐμοῦ. Γνοὺς δέ, ὅτι ἥμαρτον ἐνώπιον τοῦ Θεοῦ, εἶπον· Ἥμαρτον ἐνώπιόν σου, Κύριε, ἐλέησόν με· καὶ τελείως εἰς ἐμαυτὸν ἐλθών, εὗρον τὴν ἁμαρτίαν μου, ὅτι πολλὴ ἦν σφόδρα· καὶ γὰρ οὐδὲ τὰ λεοντάρια ταῦτα, ἤρχοντο πρός με ἐπὶ ἡμέρας δέκα, καθὼς πρῴην ἐποίουν.
ltx/gr_gr_cog/sy.m10.d23:syMA.commemoration03.narration.p11	Ἐσκόπησα οὖν μετανάστης γενέσθαι, μήπως πάλιν πλανηθῶ καὶ ἀποῤῥιφῶ ἀπὸ προσώπου Κυρίου· καὶ ἀναστάς, ἐξῆλθον τοῦ σπηλαίου τούτου· καὶ περιπατήσαντός μου ὁδὸν ἡμερῶν δύο, ἐπέστη μοι Ἄγγελος Κυρίου λέγων· Ποῦ πορεύῃ, Μακάριε; καὶ εἶπον αὐτῷ· Ἀπὸ προσώπου τῶν ἁμαρτιῶν μου ἀποδιδράσκω. Καὶ εἶπέ μοι ὁ Ἄγγελος· Ἕνα πειρασμὸνβαστάσαι οὐκ ἠδυνήθης; Ἀποστράφηθι εἰς τὸ κελλίον σου. Καὶ εἶπον αὐτῷ· Τίς εἶ Κύριε; Καὶ εἶπεν· Ἐγώ εἰμι Ῥαφαήλ, ὁ ὁδηγήσας σε ἐν τῇ ὁδῷ· καὶ ταῦτα εἰπών, ἐφανὴς ἐγένετο ἀπʼ ἐμοῦ.
ltx/gr_gr_cog/sy.m10.d23:syMA.commemoration03.narration.p12	Ἐγὼ δὲ ὑποστρέψας ἐν τῷ κελλίῳ τούτῳ ἔκλινα γόνυ πρὸς Κύριον, τεσσαράκοντα νυχθήμερα νῆστις τελέσας· καὶ ἀναστάς, εἶδον τὸ σπήλαιον τοῦτο, ἔχον φῶτα εἰς τὰς τέσσαρας γωνίας, καὶ ἄνδρα ἠμφιεσμένον πορφύραν καὶ στέφανον χρυσοῦν ἐπὶ τὴν κεφαλὴν αὐτοῦ ἐκ λίθων πολυτίμων, καὶ ἔψαλλεν ᾠδὴν παράδοξον, καὶ ἡ φωνή αὐτοῦ, ὡς ὄχλου πολλοῦ ψάλλοντος· καὶ ὁπηνίκα τὴν ᾠδὴν ἐπλήρωσεν, εὐωδία γέγονε φοβερά· καὶ εὐθέως ἀφανής μοι ἐγένετο ὁ φανείς. Ἀνερχομένου δὲ αὐτοῦ εἰς τὸν οὐρανόν, ἐγένοντο ἀστραπαὶ καὶ βρονταὶ καὶ σεισμοί. Κἀγὼ ἐκπλαγείς, ἄφωνος ἐγενόμην, τεκνία μου, ἐπὶ ἡμέρας ἑβδομήκοντα· Ἤμην δὲ τότε τεσσαράκοντα ὀκτὼ χρόνων.
ltx/gr_gr_cog/sy.m10.d23:syMA.commemoration03.narration.p13	Ἰδοὺ ταῦτα ἠκούσατε, ἀδελφοί. Ἐὰν δύνησθε ὑπομεῖναι, μείνατε πρὸς ἡμᾶς· εἰδʼ οὔ, ὁ Κύριος ἡμᾶς ὁδηγήσει. Καὶ ἀπέλυσεν, εἰπών· Σῴζεσθε ἐν εἰρήνῃ, πνευματικὰ τέκνα, ὑπὲρ ἐμοῦ εὐχόμενοι. Καὶ διέσωσαν αὐτοὺς οἱ λέοντες ἡμέρας τρεῖς· οἳ καὶ καταφιλήσαντες τὰ ἴχνη τῶν ποδῶν αὐτῶν, ὑπέστρεψαν πρὸς τὸν γέροντα.
ltx/gr_gr_cog/sy.m10.d23:syMA.commemoration03.narration.p14	Οἱ δὲ Μοναχοί, ὁδεύσαντες πρὸς τὴν οἰκουμένην ἡμέρας τινὰς καὶ ποταμὸν καταλαβόντες καὶ μικρὸν ἀφυπνώσαντες, ἡρπάγησαν ὑπὸ θείων Ἀγγέλων καὶ ἀπετέθησαν ἐν Ἱερουσαλήμ. Ἔξυπνοι δὲ γενόμενοι καὶ κατανοήσαντες, ὁποῖον καὶ πόσον διάστημα ὡς ἐν ὀνείρῳ διῆλθον, ἐδόξαζον τὸν Θεόν. Καὶ προσευξάμενοι ἐν συντόμῳ καὶ προσκυνήσαντες ἅπαντας τοὺς ἁγίους τόπους, ὑπέστρεψαν εἰς τὴν μονὴν αὑτῶν, ἐκδιηγούμενοι πρὸς τοῖς ἄλλοις οἷς ἔπαθον καὶ εἶδον καὶ τὰ κατὰ τὸν ἅγιον Μακάριον.
ltx/gr_gr_cog/sy.m10.d23:syMA.commemoration03.text	Τῇ αὐτῇ ἡμέρᾳ μνήμη τοῦ ὁσίου Πατρὸς ἡμῶν Μακαρίου τοῦ Ῥωμαίου.
ltx/gr_gr_cog/sy.m10.d23:syMA.commemoration04.couplet1.title	@ltx/gr_gr_cog/titles:ti.Verses
ltx/gr_gr_cog/sy.m10.d23:syMA.commemoration04.couplet1.verse1	Μονὴν ἐγείρας ἱερὰν Νικηφόρος,
ltx/gr_gr_cog/sy.m10.d23:syMA.commemoration04.couplet1.verse2	Ἔσπευδεν εἶναι καὶ βίον νικηφόρος.
ltx/gr_gr_cog/sy.m10.d23:syMA.commemoration04.text	Ὁ ὅσιος Πατὴρ ἡμῶν Νικηφόρος, ὁ ἱδρυτὴς τῆς ἐν Χαρσιανῷ Μονῆς, ἐν εἰρήνῃ τελειοῦται.
ltx/gr_gr_cog/sy.m10.d23:syMA.lastline	Ταῖς αὐτῶν ἁγίαις πρεσβείαις, ὁ Θεός, ἐλέησον ἡμᾶς. Ἀμήν.
