ltx/gr_gr_cog/le.ep.mc.d157:lemcLI.Epistle.book_abbr	@ltx/gr_gr_cog/bible:Corinthians1.abbr
ltx/gr_gr_cog/le.ep.mc.d157:lemcLI.Epistle.book_string	@ltx/gr_gr_cog/bible:Corinthians1.text
ltx/gr_gr_cog/le.ep.mc.d157:lemcLI.Epistle.chapverse	1:1 – 9
ltx/gr_gr_cog/le.ep.mc.d157:lemcLI.Epistle.incipit	Παῦλος, κλητὸς ἀπόστολος Ἰησοῦ Χριστοῦ…
ltx/gr_gr_cog/le.ep.mc.d157:lemcLI.Epistle.text	Παῦλος, κλητὸς ἀπόστολος Ἰησοῦ Χριστοῦ διὰ θελήματος Θεοῦ, καὶ Σωσθένης ὁ ἀδελφός, τῇ ἐκκλησίᾳ τοῦ Θεοῦ τῇ οὔσῃ ἐν Κορίνθῳ, ἡγιασμένοις ἐν Χριστῷ Ἰησοῦ, κλητοῖς ἁγίοις, σὺν πᾶσι τοῖς ἐπικαλουμένοις τὸ ὄνομα τοῦ Κυρίου ἡμῶν Ἰησοῦ Χριστοῦ ἐν παντὶ τόπῳ αὐτῶν τε καὶ ἡμῶν· χάρις ὑμῖν καὶ εἰρήνη ἀπὸ Θεοῦ πατρὸς ἡμῶν καὶ Κυρίου Ἰησοῦ Χριστοῦ. Εὐχαριστῶ τῷ Θεῷ μου πάντοτε περὶ ὑμῶν ἐπὶ τῇ χάριτι τοῦ Θεοῦ τῇ δοθείση ὑμῖν ἐν Χριστῷ Ἰησοῦ, ὅτι ἐν παντὶ ἐπλουτίσθητε ἐν αὐτῷ, ἐν παντὶ λόγῳ καὶ πάσῃ γνώσει, καθὼς τὸ μαρτύριον τοῦ Χριστοῦ ἐβεβαιώθη ἐν ὑμῖν, ὥστε ὑμᾶς μὴ ὑστερεῖσθαι ἐν μηδενὶ χαρίσματι, ἀπεκδεχομένους τὴν ἀποκάλυψιν τοῦ Κυρίου ἡμῶν Ἰησοῦ Χριστοῦ· ὃς καὶ βεβαιώσει ὑμᾶς ἕως τέλους ἀνεγκλήτους ἐν τῇ ἡμέρᾳ τοῦ Κυρίου ἡμῶν Ἰησοῦ Χριστοῦ. πιστὸς ὁ Θεὸς δι᾿ οὗ ἐκλήθητε εἰς κοινωνίαν τοῦ υἱοῦ αὐτοῦ Ἰησοῦ Χριστοῦ τοῦ Κυρίου ἡμῶν.
ltx/gr_gr_cog/le.ep.mc.d157:lemcLI.Epistle.title	Τῇ Τρίτῃ τῆς Ϛʹ Ἑβδομάδος
ltx/gr_gr_cog/le.ep.mc.d157:lemcLI.Epistle.title_abbr	Τρίτῃ τῆς Ϛʹ Ἑβδομάδος
ltx/gr_gr_cog/le.ep.mc.d157:lemcLI.Epistle.version	@ltx/gr_gr_cog/properties:version.designation
