ltx/gr_gr_cog/sy.m03.d20:cl.syMA.commemoration01.text	[saint/com 1]
ltx/gr_gr_cog/sy.m03.d20:cl.syMA.commemoration02.text	[saint/com 2]
ltx/gr_gr_cog/sy.m03.d20:cl.syMA.commemoration03.text	[saint/com 3]
ltx/gr_gr_cog/sy.m03.d20:cl.syMA.commemoration04.text	[saint/com 4]
ltx/gr_gr_cog/sy.m03.d20:cl.syMA.commemoration05.text	[saint/com 5]
ltx/gr_gr_cog/sy.m03.d20:cl.syMA.commemoration06.text	[saint/com list]
ltx/gr_gr_cog/sy.m03.d20:syMA.commemoration01.couplet1.title	@ltx/gr_gr_cog/titles:ti.Verses
ltx/gr_gr_cog/sy.m03.d20:syMA.commemoration01.couplet1.verse1	Διπλοῦς στεφάνους χειρὸς ἐκ τοῦ Κυρίου,
ltx/gr_gr_cog/sy.m03.d20:syMA.commemoration01.couplet1.verse2	Πόνων χάριν δέχεσθε, καὶ τῶν αἱμάτων.
ltx/gr_gr_cog/sy.m03.d20:syMA.commemoration01.narration.p01	Οὗτοι οἱ Ἅγιοι Πατέρες, ἐκ διαφόρων τόπων συναθροισθέντες, καὶ τῇ Μονῇ τοῦ Ἁγίου Σάββα προσκαθεζόμενοι, ἐν ἀσκήσει πολλῇ, καὶ καλῇ πολιτείᾳ τὸν Θεὸν ἐθεράπευον. Ἀλλʼ ὁ βασκαίνων καὶ φθονῶν Διάβολος, καὶ μάλιστα τοῖς ἐν ἀρεταῖς, ἐξήγειρεν ἐπʼ αὐτοὺς ἀθέους Αἰθίοπας, ἐλπίζοντας πλούτου περιουσίαν λαβεῖν. Ὡς δὲ ἀπελθόντες οὐδὲν εὗρον, τοὺς μὲν ἀποκεφαλίσαντες, τοὺς δὲ διχοτομήσαντες, ἄλλους δὲ κατακεντήσαντες, καὶ τὰ αἵματα αὐτῶν ἐκχέαντες, καὶ διαφόρως ἀνελόντες, ἀπέκτειναν. Οἱ δὲ Ὅσιοι εὐχαριστοῦντες, παρέδωκαν τὰς ψυχὰς αὐτῶν τῷ Κυρίῳ, ἀπολαβόντες τὴν αἰώνιον καὶ μακαρίαν ζωὴν τῆς Βασιλείας τῶν Οὐρανῶν, διʼ ἣν τούς τε ἀγῶνας τῆς ἀσκήσεως, καὶ τὸ μαρτύριον τῆς ἀθλήσεως προθύμως ὑπέμειναν.
ltx/gr_gr_cog/sy.m03.d20:syMA.commemoration01.single1	Εἰκάδι Ἀββάδες ἐκ χθονὸς οὐρανὸν ἤλυθον εὐρύν.
ltx/gr_gr_cog/sy.m03.d20:syMA.commemoration01.text	Τῇ Κʹ τοῦ αὐτοῦ μηνός, μνήμη τῶν Ἁγίων Ἀββάδων, τῶν ἀναιρεθέντων ὑπό τῶν Μαύρων ἐν τῇ Μονῇ τοῦ Ἁγίου Σάββα τοῦ Ἡγιασμένου.
ltx/gr_gr_cog/sy.m03.d20:syMA.commemoration02.couplet1.title	@ltx/gr_gr_cog/titles:ti.Verses
ltx/gr_gr_cog/sy.m03.d20:syMA.commemoration02.couplet1.verse1	Ὑπὲρ τύπου σοῦ δεινὰ Νικήτας φέρων,
ltx/gr_gr_cog/sy.m03.d20:syMA.commemoration02.couplet1.verse2	Νῦν σὸν πρόσωπον, Χριστέ, ἐν πόλῳ βλέπει.
ltx/gr_gr_cog/sy.m03.d20:syMA.commemoration02.narration.p01	Οὗτος ὁ ἐν Ἁγίοις Πατὴρ ἡμῶν καὶ Ὁμολογητὴς ἐν τῷ καιρῷ τῶν Εἰκονομάχων ὑπῆρχεν Ἐπίσκοπος Ἀπολλωνιάδος, οὐ μόνον πιστὸς καὶ εὐλαβὴς καὶ ὀρθοδοξότατος, ἀλλὰ καὶ ἐλεήμων καὶ συμπαθής, πολὺς τὴν γνῶσιν, πολὺς τὸν λόγον. Ὅθεν ἀναγκασθεὶς ἀρνήσασθαι τὴν προσκύνησιν τῶν Ἁγίων Εἰκόνων τοῦ Κυρίου ἡμῶν Ἰησοῦ Χριστοῦ, καὶ τῆς παναχράντου αὐτοῦ Μητρός, καὶ τῶν ἱερῶν καὶ θείων Ἀγγέλων, καὶ πάντων τῶν Ἁγίων, καὶ μὴ πεισθείς, ἐξορίαις καταδικάζεται, καὶ πειρασμοῖς ἀνυποίστοις καθυποβάλλεται· ἐφʼ οἷς νοσήσας δεινῶς, παρέθετο τὴν ἁγίαν αὐτοῦ ψυχὴν εἰς χεῖρας Θεοῦ.
ltx/gr_gr_cog/sy.m03.d20:syMA.commemoration02.text	Τῇ αὐτῇ ἡμέρᾳ, μνήμη τοῦ Ὁσίου Πατρὸς ἡμῶν καὶ Ὁμολογητοῦ Νικήτα, Ἐπισκόπου Ἀπολλωνιάδος.
ltx/gr_gr_cog/sy.m03.d20:syMA.commemoration03.couplet1.title	@ltx/gr_gr_cog/titles:ti.Verses
ltx/gr_gr_cog/sy.m03.d20:syMA.commemoration03.couplet1.verse1	Δηλοῖ Γυναικῶν τῶν πεπυρπολημένων,
ltx/gr_gr_cog/sy.m03.d20:syMA.commemoration03.couplet1.verse2	Ἀριθμὸς ἑπτὰ παρθένος τῶν Παρθένων.
ltx/gr_gr_cog/sy.m03.d20:syMA.commemoration03.narration.p01	Αὗται ὑπῆρχον ἐπὶ τῆς βασιλείας Μαξιμιανοῦ τοῦ δυσσεβοῦς· ὑφʼ οὗ, διωγμοῦ κινηθέντος μεγάλου κατὰ τῶν Χριστιανῶν, πᾶσα ἡλικία τῶν τὸν Χριστὸν ὁμολογούντων, διαφόροις βασάνοις καὶ ποικίλοις θανάτοις ἐξεκόπτετο. Ἐπεὶ δὲ ἐν Ἀμινσῷ τῇ πόλει τὸ αὐτὸ ἐπετελεῖτο παρὰ τοῦ Ἄρχοντος τῆς πόλεως, καὶ αὗται αἱ ἑπτὰ πεπαῤῥησιασμέναι ἔστησαν ἐνώπιον αὐτοῦ· καὶ Χριστιανὰς ἑαυτὰς ὁμολογήσασαι, καὶ τὸν Ἄρχοντα ὠμὸν καὶ ἀπάνθρωπον, καὶ ἐχθρὸν τῆς ἀληθείας ἀποκαλέσασαι, πρῶτον μὲν ἐκδυθεῖσαι ῥαβδίζονται· ἔπειτα τοὺς μαστοὺς ξίφει ἐκκόπτονται· μετὰ δὲ ταῦτα κρεμασθεῖσαι ξέονται, ἄχρι καὶ τῆς διαφανείας τῶν ἐγκάτων αὐτῶν· καὶ τελευταῖον εἰς κάμινον πυρὸς ἐμβληθεῖσαι, παρέδωκαν τὰς ἑαυτῶν ψυχὰς τῷ Κυρίῳ.
ltx/gr_gr_cog/sy.m03.d20:syMA.commemoration03.text	Τῇ αὐτῇ ἡμέρᾳ, μνήμη τῶν Ἁγίων ἑπτὰ Μαρτύρων Γυναικῶν, τῶν ἐν Ἀμινσῷ, Ἀλεξανδρείας, Κλαυδίας, Εὐφρασίας, Ματρώνης, Ἰουλιανῆς, Εὐφημίας, καὶ Θεοδοσίας.
ltx/gr_gr_cog/sy.m03.d20:syMA.commemoration04.couplet1.title	@ltx/gr_gr_cog/titles:ti.Verses
ltx/gr_gr_cog/sy.m03.d20:syMA.commemoration04.couplet1.verse1	Ὁ Ῥοδιανὸς ὡς ἐρυθρόν σοι ῥόδον,
ltx/gr_gr_cog/sy.m03.d20:syMA.commemoration04.couplet1.verse2	Χριστέ, προσήχθη, τὸ σῶμα βεβαμμένος.
ltx/gr_gr_cog/sy.m03.d20:syMA.commemoration04.text	Τῇ αὐτῇ ἡμέρᾳ, ὁ Ἅγιος Μάρτυς Ῥοδιανὸς ξίφει τελειοῦται.
ltx/gr_gr_cog/sy.m03.d20:syMA.commemoration05.couplet1.title	@ltx/gr_gr_cog/titles:ti.Verses
ltx/gr_gr_cog/sy.m03.d20:syMA.commemoration05.couplet1.verse1	Ἄμωμον ἱερεῖον ὤφθης, Ἀκύλα,
ltx/gr_gr_cog/sy.m03.d20:syMA.commemoration05.couplet1.verse2	Τμηθεὶς ἀμώμῳ Δεσπότῃ διὰ ξίφους.
ltx/gr_gr_cog/sy.m03.d20:syMA.commemoration05.text	Τῇ αὐτῇ ἡμέρᾳ, ὁ Ἅγιος Ἀκύλας ὁ Ἔπαρχος ξίφει τελειοῦται.
ltx/gr_gr_cog/sy.m03.d20:syMA.commemoration06.couplet1.title	@ltx/gr_gr_cog/titles:ti.Verses
ltx/gr_gr_cog/sy.m03.d20:syMA.commemoration06.couplet1.verse1	Ὁ Λολλίων ἕστηκε τὰς πυγμὰς φέρων,
ltx/gr_gr_cog/sy.m03.d20:syMA.commemoration06.couplet1.verse2	Καὶ μὴ στεναγμόν, μηδὲ μυγμὸν ἐκφέρων.
ltx/gr_gr_cog/sy.m03.d20:syMA.commemoration06.text	Τῇ αὐτῇ ἡμέρᾳ, ὁ Ἅγιος Λολλίων πυγμαῖς βαλλόμενος τελειοῦται.
ltx/gr_gr_cog/sy.m03.d20:syMA.commemoration07.couplet1.title	@ltx/gr_gr_cog/titles:ti.Verses
ltx/gr_gr_cog/sy.m03.d20:syMA.commemoration07.couplet1.verse1	Ξίφει χεθήτω, κἂν κοτύλη φησί μοι,
ltx/gr_gr_cog/sy.m03.d20:syMA.commemoration07.couplet1.verse2	Ἐμμανουὴλ πέφυκεν αἵματος μία.
ltx/gr_gr_cog/sy.m03.d20:syMA.commemoration07.text	Τῇ αὐτῇ ἡμέρᾳ, ὁ Ἅγιος Ἐμμανουὴλ ξίφει τελειοῦται.
ltx/gr_gr_cog/sy.m03.d20:syMA.commemoration08.couplet1.title	@ltx/gr_gr_cog/titles:ti.Verses
ltx/gr_gr_cog/sy.m03.d20:syMA.commemoration08.couplet1.verse1	Μύρον νοητὸν ὡράθης ἐξ ἀγχόνης,
ltx/gr_gr_cog/sy.m03.d20:syMA.commemoration08.couplet1.verse2	Μύρων ἀθλητά, δόξα Κρήτης καὶ κλέος.
ltx/gr_gr_cog/sy.m03.d20:syMA.commemoration08.text	Ὁ Ἅγιος Νεομάρτυς Μύρων ὁ Κρής, ὁ μαρτυρήσας ἐν Κρήτῃ ἐν ἔτει 1793, ἀγχόνῃ τελειοῦται.
ltx/gr_gr_cog/sy.m03.d20:syMA.lastline	Ταῖς αὐτῶν ἁγίαις πρεσβείαις, ὁ Θεὸς ἐλεήσον ἡμᾶς. Ἀμήν.
