ltx/gr_gr_cog/le.ep.me.m10.d18:lemeLI.Epistle.book_abbr	@ltx/gr_gr_cog/bible:Colossians.abbr
ltx/gr_gr_cog/le.ep.me.m10.d18:lemeLI.Epistle.book_string	@ltx/gr_gr_cog/bible:Colossians.text
ltx/gr_gr_cog/le.ep.me.m10.d18:lemeLI.Epistle.chapverse	4:5 – 11, 14 – 18
ltx/gr_gr_cog/le.ep.me.m10.d18:lemeLI.Epistle.incipit	Ἐν σοφίᾳ περιπατεῖτε πρὸς τοὺς ἔξω…
ltx/gr_gr_cog/le.ep.me.m10.d18:lemeLI.Epistle.text	Ἀδελφοί, ἐν σοφίᾳ περιπατεῖτε πρὸς τοὺς ἔξω, τὸν καιρὸν ἐξαγοραζόμενοι. ὁ λόγος ὑμῶν πάντοτε ἐν χάριτι, ἅλατι ἠρτυμένος, εἰδέναι πῶς δεῖ ὑμᾶς ἑνὶ ἑκάστῳ ἀποκρίνεσθαι. Τὰ κατ᾽ ἐμὲ πάντα γνωρίσει ὑμῖν Τυχικὸς ὁ ἀγαπητὸς ἀδελφὸς καὶ πιστὸς διάκονος καὶ σύνδουλος ἐν Κυρίῳ, ὃν ἔπεμψα πρὸς ὑμᾶς εἰς αὐτὸ τοῦτο, ἵνα γνῷ τὰ περὶ ὑμῶν καὶ παρακαλέσῃ τὰς καρδίας ὑμῶν, σὺν Ὀνησίμῳ τῷ πιστῷ καὶ ἀγαπητῷ ἀδελφῷ, ὅς ἐστιν ἐξ ὑμῶν· πάντα ὑμῖν γνωριοῦσι τὰ ᾧδε. Ἀσπάζεται ὑμᾶς Ἀρίσταρχος ὁ συναιχμάλωτός μου, καὶ Μᾶρκος ὁ ἀνεψιὸς Βαρνάβα, — περὶ οὗ ἐλάβετε ἐντολάς· ἐὰν ἔλθῃ πρὸς ὑμᾶς, δέξασθε αὐτόν, — καὶ Ἰησοῦς ὁ λεγόμενος Ἰοῦστος, οἱ ὄντες ἐκ περιτομῆς, οὗτοι μόνοι συνεργοὶ εἰς τὴν βασιλείαν τοῦ Θεοῦ, οἵτινες ἐγενήθησάν μοι παρηγορία. ἀσπάζεται ὑμᾶς Λουκᾶς ὁ ἰατρὸς ὁ ἀγαπητὸς καὶ Δημᾶς. ἀσπάσασθε τοὺς ἐν Λαοδικείᾳ ἀδελφοὺς καὶ Νυμφᾶν καὶ τὴν κατ᾽ οἶκον αὐτοῦ ἐκκλησίαν· καὶ ὅταν ἀναγνωσθῇ παρ᾽ ὑμῖν ἡ ἐπιστολή, ποιήσατε ἵνα καὶ ἐν τῇ Λαοδικέων ἐκκλησίᾳ ἀναγνωσθῇ, καὶ τὴν ἐκ Λαοδικείας ἵνα καὶ ὑμεῖς ἀναγνῶτε. καὶ εἴπατε Ἀρχίππῳ· βλέπε τὴν διακονίαν ἣν παρέλαβες ἐν Κυρίῳ, ἵνα αὐτὴν πληροῖς. Ὁ ἀσπασμὸς τῇ ἐμῇ χειρὶ Παύλου. μνημονεύετέ μου τῶν δεσμῶν. Ἡ χάρις μεθ᾽ ὑμῶν· ἀμήν.
ltx/gr_gr_cog/le.ep.me.m10.d18:lemeLI.Epistle.title	Τοῦ Ἀποστόλου
ltx/gr_gr_cog/le.ep.me.m10.d18:lemeLI.Epistle.title_abbr	Τοῦ Ἀποστόλου
ltx/gr_gr_cog/le.ep.me.m10.d18:lemeLI.Epistle.version	@ltx/gr_gr_cog/properties:version.designation
