ltx/gr_gr_cog/eo.e10:eo.Doxasticon.incipit	Μετὰ τὴν εἰς ᾅδου κάθοδον…
ltx/gr_gr_cog/eo.e10:eo.Doxasticon.mode	@ltx/gr_gr_cog/miscellanea:misc.Mode6
ltx/gr_gr_cog/eo.e10:eo.Doxasticon.text	Μετὰ τὴν εἰς ᾅδου κάθοδον, καὶ τὴν ἐκ νεκρῶν ἀνάστασιν, ἀθυμοῦντες ὡς εἰκός, ἐπὶ τῷ χωρισμῷ σου Χριστὲ οἱ Μαθηταί, πρὸς ἐργασίαν ἐτράπησαν· καὶ πάλιν πλοῖα καὶ δίκτυα, καὶ ἄγρα οὐδαμοῦ. Ἀλλὰ σὺ Σῶτερ ἐμφανισθείς, ὡς Δεσπότης πάντων, δεξιοῖς τὰ δίκτυα κελεύεις βαλεῖν· καὶ ἦν ὁ λόγος ἔργον εὐθύς, καὶ πλῆθος τῶν ἰχθύων πολύ, καὶ δεῖπνον ξένον ἕτοιμον ἐν γῇ· οὗ μετασχόντων τότε σου τῶν Μαθητῶν, καὶ ἡμᾶς νῦν νοητῶς καταξίωσον, ἐντρυφῆσαι φιλάνθρωπε Κύριε.
ltx/gr_gr_cog/eo.e10:eo.Exaposteilarion.greekmelody	@ltx/gr_gr_cog/he.a.m2:heAU.ToisMathitaisSynelthomen.greekname
ltx/gr_gr_cog/eo.e10:eo.Exaposteilarion.incipit	Τιβεριάδος θάλασσα…
ltx/gr_gr_cog/eo.e10:eo.Exaposteilarion.melody	@ltx/gr_gr_cog/he.a.m2:heAU.ToisMathitaisSynelthomen.name
ltx/gr_gr_cog/eo.e10:eo.Exaposteilarion.mode	@ltx/gr_gr_cog/miscellanea:misc.Mode2
ltx/gr_gr_cog/eo.e10:eo.Exaposteilarion.text	Τιβεριάδος θάλασσα, σὺν παισὶ Ζεβεδαίου, Ναθαναὴλ τῷ Πέτρῳ τε, σὺν δυσὶν ἄλλοις πάλαι, καὶ Θωμᾶν εἶχε πρὸς ἄγραν· οἳ Χριστοῦ τῇ προστάξει, ἐν δεξιοῖς χαλάσαντες, πλῆθος εἷλκον ἰχθύων· ὃν Πέτρος γνούς, πρὸς αὐτὸν ἐνήχετο· οἷς τὸ τρίτον, φανεὶς καὶ ἄρτον ἔδειξε, καὶ ἰχθὺν ἐπʼ ἀνθράκων.
ltx/gr_gr_cog/eo.e10:eo.Theotokion.incipit	Τὸν ἀναστάντα Κύριον…
ltx/gr_gr_cog/eo.e10:eo.Theotokion.melody	@ltx/gr_gr_cog/he.a.m2:heAU.ToisMathitaisSynelthomen.name
ltx/gr_gr_cog/eo.e10:eo.Theotokion.mode	@ltx/gr_gr_cog/miscellanea:misc.Mode2
ltx/gr_gr_cog/eo.e10:eo.Theotokion.text	Τὸν ἀναστάντα Κύριον, τριήμερον ἐκ τοῦ τάφου, Παρθένε καθικέτευε, ὑπὲρ τῶν σὲ ὑμνούντων, καὶ πόθῳ μακαριζόντων· σὲ γὰρ ἔχομεν πάντες, καταφυγὴν σωτήριον, καὶ μεσῖτιν πρὸς τοῦτον· κλῆρος γὰρ σός, καὶ οἰκέται πέλομεν Θεοτόκε, καὶ πρὸς τὴν σὴν ἀντίληψιν, ἅπαντες ἀφορῶμεν.
ltx/gr_gr_cog/eo.e10:eo.title	Τὸ Ιʹ Ἑωθινόν.
