ltx/gr_gr_cog/me.m09.d23:meDA.commemoration.first	Ἡ Σύλληψις τοῦ Τιμίου Προδρόμου
ltx/gr_gr_cog/me.m09.d23:meDA.commemoration.first_name	
ltx/gr_gr_cog/me.m09.d23:meDA.commemoration.first_short	Ἡ Σύλληψις τοῦ Τιμίου Προδρόμου
ltx/gr_gr_cog/me.m09.d23:meDA.commemoration.first_title	@ltx/gr_gr_cog/titles:ti.Forerunner
ltx/gr_gr_cog/me.m09.d23:meDA.commemoration.full	Ἡ Σύλληψις τοῦ Τιμίου Ἐνδόξου Προφήτου, Προδρόμου, καὶ Βαπτιστοῦ Ἰωάννου.
ltx/gr_gr_cog/me.m09.d23:meDA.commemoration.second_name	
ltx/gr_gr_cog/me.m09.d23:meDA.commemoration.second_title	
ltx/gr_gr_cog/me.m09.d23:meDA.date	Τῌ ΚΓʹ ΣΕΠΤΕΜΒΡΙΟΥ
ltx/gr_gr_cog/me.m09.d23:meDA.fordate	διὰ τὴν 23ην Σεπτεμβρίου
ltx/gr_gr_cog/me.m09.d23:meDA.insert1	τοῦ τιμίου ἐνδόξου Προφήτου, Προδρόμου, καὶ Βαπτιστοῦ Ἰωάννου,
ltx/gr_gr_cog/me.m09.d23:meDA.insert2	οὗ καὶ τὴν σύλληψιν ἑορτάζομεν·
ltx/gr_gr_cog/me.m09.d23:meDA.note	
ltx/gr_gr_cog/me.m09.d23:meDA.pdfcoverdate	τῆς 23ης Σεπτεμβρίου,
ltx/gr_gr_cog/me.m09.d23:meDA.pdfheaderdate	τῆς 23ης Σεπτεμβρίου
ltx/gr_gr_cog/me.m09.d23:meHO.commemorations	
ltx/gr_gr_cog/me.m09.d23:meHO.note1	
ltx/gr_gr_cog/me.m09.d23:meHO.note2	
ltx/gr_gr_cog/me.m09.d23:meHO.number	
ltx/gr_gr_cog/me.m09.d23:meHO.rank	
ltx/gr_gr_cog/me.m09.d23:meLE.commemoration1	Ἡ Σύλληψις τοῦ Τιμίου Ἐνδόξου Προφήτου, Προδρόμου, καὶ Βαπτιστοῦ Ἰωάννου.
ltx/gr_gr_cog/me.m09.d23:meLE.commemoration2	
ltx/gr_gr_cog/me.m09.d23:meLI.Kontakion1.greekmelody	@ltx/gr_gr_cog/me.m09.d23:meMA.Kontakion1.greekmelody
ltx/gr_gr_cog/me.m09.d23:meLI.Kontakion1.incipit	@ltx/gr_gr_cog/me.m09.d23:meMA.Kontakion1.incipit
ltx/gr_gr_cog/me.m09.d23:meLI.Kontakion1.melody	@ltx/gr_gr_cog/me.m09.d23:meMA.Kontakion1.melody
ltx/gr_gr_cog/me.m09.d23:meLI.Kontakion1.mode	@ltx/gr_gr_cog/me.m09.d23:meMA.Kontakion1.mode
ltx/gr_gr_cog/me.m09.d23:meLI.Kontakion1.text	@ltx/gr_gr_cog/me.m09.d23:meMA.Kontakion1.text
ltx/gr_gr_cog/me.m09.d23:meLI.MM.CommunionHymn.text	@ltx/gr_gr_cog/properties:media.key
ltx/gr_gr_cog/me.m09.d23:meLI.Megalynarion.text	Στεῖρα καὶ πρεσβῦτις θείᾳ βουλῇ, καρπὸν συλλαμβάνει, τὸν ὑπέρτερον Προφητῶν, τὸν τὴν ἀκαρπίαν, ψυχῶν μέλλοντα τέμνειν, ἀξίνῃ μετανοίας· ὃν μεγαλύνομεν.
ltx/gr_gr_cog/me.m09.d23:meMA.C1.poet	@ltx/gr_gr_cog/poets:po.IoannouTouDamaskinou
ltx/gr_gr_cog/me.m09.d23:meMA.C1.title	@ltx/gr_gr_cog/titles:ti.CanonForerunner
ltx/gr_gr_cog/me.m09.d23:meMA.C1.verse	@ltx/gr_gr_cog/prayers:pr.verse_Baptist.text
ltx/gr_gr_cog/me.m09.d23:meMA.ExapTheotokion.incipit	Χαρμονικῶς τὸ Χαῖρε σοι, τοῦ…
ltx/gr_gr_cog/me.m09.d23:meMA.ExapTheotokion.melody	@ltx/gr_gr_cog/he.a.m2:heAU.ToisMathitaisSynelthomen.name
ltx/gr_gr_cog/me.m09.d23:meMA.ExapTheotokion.mode	@ltx/gr_gr_cog/miscellanea:misc.Mode2
ltx/gr_gr_cog/me.m09.d23:meMA.ExapTheotokion.text	Χαρμονικῶς τὸ Χαῖρε σοι, τοῦ σεπτοῦ Ἀρχαγγέλου, οἱ λυτρωθέντες πάναγνε, τῆς ἀρχαίας κατάρας, διὰ τοῦ θείου σου τόκου, εὐχαρίστως, βοῶμεν· Χαῖρε, Ἀδὰμ ἡ λύτρωσις, Θεοτόκε Παρθένε, χαῖρε σεμνή, διʼ ἧς ἀπηλλάγημεν τοῦ θανάτου, χαῖρε, διʼ ἧς ἐτύχομεν, οὐρανῶν Βασιλείας.
ltx/gr_gr_cog/me.m09.d23:meMA.Exaposteilarion1.greekmelody	@ltx/gr_gr_cog/he.a.m2:heAU.ToisMathitaisSynelthomen.greekname
ltx/gr_gr_cog/me.m09.d23:meMA.Exaposteilarion1.incipit	Ἡ τοῦ Προδρόμου ἔνδοξος, σύλληψις…
ltx/gr_gr_cog/me.m09.d23:meMA.Exaposteilarion1.melody	@ltx/gr_gr_cog/he.a.m2:heAU.ToisMathitaisSynelthomen.name
ltx/gr_gr_cog/me.m09.d23:meMA.Exaposteilarion1.mode	@ltx/gr_gr_cog/miscellanea:misc.Mode2
ltx/gr_gr_cog/me.m09.d23:meMA.Exaposteilarion1.text	Ἡ τοῦ Προδρόμου ἔνδοξος, σύλληψις προμηνύει, τὸν ἐκ Παρθένου μέλλοντα, τίκτεσθαι Βασιλέα, ὡς οὗτος ἐξ Ἐλισάβετ, τῆς ἀκάρπου καὶ στείρας, πρεσβύτου Ἱερέως τε, Ζαχαρίου τοῦ πάνυ, ὧν ταῖς εὐχαῖς, καὶ τῆς Θεοτόκου καὶ Ἰωάννου, τοῦ Βαπτιστοῦ σου Κύριε, σῶσον οἴκτειρον πάντας.
ltx/gr_gr_cog/me.m09.d23:meMA.Kathisma11.greekmelody	@ltx/gr_gr_cog/he.a.m5:heAU.TonSynanarchonLogon.greekname
ltx/gr_gr_cog/me.m09.d23:meMA.Kathisma11.incipit	@ltx/gr_gr_cog/oc.m5.d3:ocMA.Kathisma31.incipit
ltx/gr_gr_cog/me.m09.d23:meMA.Kathisma11.melody	@ltx/gr_gr_cog/he.a.m5:heAU.TonSynanarchonLogon.name
ltx/gr_gr_cog/me.m09.d23:meMA.Kathisma11.mode	@ltx/gr_gr_cog/miscellanea:misc.Mode5
ltx/gr_gr_cog/me.m09.d23:meMA.Kathisma11.text	@ltx/gr_gr_cog/oc.m5.d3:ocMA.Kathisma31.text
ltx/gr_gr_cog/me.m09.d23:meMA.Kathisma1T.incipit	@ltx/gr_gr_cog/oc.m5.d1:ocMA.Kathisma13.incipit
ltx/gr_gr_cog/me.m09.d23:meMA.Kathisma1T.melody	@ltx/gr_gr_cog/he.a.m5:heAU.TonSynanarchonLogon.name
ltx/gr_gr_cog/me.m09.d23:meMA.Kathisma1T.mode	@ltx/gr_gr_cog/miscellanea:misc.Mode5
ltx/gr_gr_cog/me.m09.d23:meMA.Kathisma1T.text	@ltx/gr_gr_cog/oc.m5.d1:ocMA.Kathisma13.text
ltx/gr_gr_cog/me.m09.d23:meMA.Kathisma21.greekmelody	@ltx/gr_gr_cog/he.a.m4:heAU.TachyProkatalave.greekname
ltx/gr_gr_cog/me.m09.d23:meMA.Kathisma21.incipit	Τρύγων ἡ φιλέρημος, ὁ ἱερὸς…
ltx/gr_gr_cog/me.m09.d23:meMA.Kathisma21.melody	@ltx/gr_gr_cog/he.a.m4:heAU.TachyProkatalave.name
ltx/gr_gr_cog/me.m09.d23:meMA.Kathisma21.mode	@ltx/gr_gr_cog/miscellanea:misc.Mode4
ltx/gr_gr_cog/me.m09.d23:meMA.Kathisma21.text	Τρύγων ἡ φιλέρημος, ὁ ἱερὸς Βαπτιστής, κηρύξας μετάνοιαν, καὶ φανερώσας Χριστόν, γενόμενον ἄνθρωπον, πάντων ἁμαρτανόντων, ἐγεννήθη προστάτης, πᾶσι χειμαζομένοις, βοηθῶν ἀενάως· αὐτοῦ ταῖς ἱκεσίαις Χριστέ, σῶσον τὸν κόσμον σου.
ltx/gr_gr_cog/me.m09.d23:meMA.Kathisma2T.incipit	@ltx/gr_gr_cog/oc.m4.d3:ocMA.Kathisma33.incipit
ltx/gr_gr_cog/me.m09.d23:meMA.Kathisma2T.melody	@ltx/gr_gr_cog/he.a.m4:heAU.TachyProkatalave.name
ltx/gr_gr_cog/me.m09.d23:meMA.Kathisma2T.mode	@ltx/gr_gr_cog/miscellanea:misc.Mode4
ltx/gr_gr_cog/me.m09.d23:meMA.Kathisma2T.text	@ltx/gr_gr_cog/oc.m4.d3:ocMA.Kathisma33.text
ltx/gr_gr_cog/me.m09.d23:meMA.Kontakion1.greekmelody	@ltx/gr_gr_cog/he.a.m1:heAU.ChorosAngelikos.greekname
ltx/gr_gr_cog/me.m09.d23:meMA.Kontakion1.incipit	Εὐφραίνεται λαμπρῶς…
ltx/gr_gr_cog/me.m09.d23:meMA.Kontakion1.melody	@ltx/gr_gr_cog/he.a.m1:heAU.ChorosAngelikos.name
ltx/gr_gr_cog/me.m09.d23:meMA.Kontakion1.mode	@ltx/gr_gr_cog/miscellanea:misc.Mode1
ltx/gr_gr_cog/me.m09.d23:meMA.Kontakion1.text	Εὐφραίνεται λαμπρῶς, Ζαχαρίας ὁ μέγας, καὶ ἡ πανευκλεής, Ἐλισάβετ ἡ σύζυξ, ἀξίως συλλαμβάνουσα, Ἰωάννην τὸν Πρόδρομον· ὂν Ἀρχάγγελος, εὐηγγελίσατο χαίρων, καὶ οἱ ἄνθρωποι, ἀξιοχρέως τιμῶμεν, ὡς μύστην τῆς χάριτος.
ltx/gr_gr_cog/me.m09.d23:meMA.Lauds1.greekmelody	@ltx/gr_gr_cog/he.a.m1:heAU.TonOuranionTagmaton.greekname
ltx/gr_gr_cog/me.m09.d23:meMA.Lauds1.incipit	Ἀγαλλιᾶται ἡ κτίσις ἐν τῇ…
ltx/gr_gr_cog/me.m09.d23:meMA.Lauds1.melody	@ltx/gr_gr_cog/he.a.m1:heAU.TonOuranionTagmaton.name
ltx/gr_gr_cog/me.m09.d23:meMA.Lauds1.mode	@ltx/gr_gr_cog/miscellanea:misc.Mode1
ltx/gr_gr_cog/me.m09.d23:meMA.Lauds1.text	Ἀγαλλιᾶται ἡ κτίσις ἐν τῇ συλλήψει σου, Πρόδρομε καὶ Προφῆτα, Βαπτιστὰ Ἰωάννη· ὁ θεῖος γὰρ σου τόκος, σημαίνει ἡμῖν, τοῦ Δεσπότου τὴν γέννησιν, καὶ διὰ τοῦτο συμφώνως οἱ ἐπὶ γῆς, ἐπαξίως εὐφημοῦμεν σε.
ltx/gr_gr_cog/me.m09.d23:meMA.Lauds2.incipit	Ὡς θαυμαστὴν μαρτυρίαν εὑρὼν ὁ…
ltx/gr_gr_cog/me.m09.d23:meMA.Lauds2.melody	@ltx/gr_gr_cog/he.a.m1:heAU.TonOuranionTagmaton.name
ltx/gr_gr_cog/me.m09.d23:meMA.Lauds2.mode	@ltx/gr_gr_cog/miscellanea:misc.Mode1
ltx/gr_gr_cog/me.m09.d23:meMA.Lauds2.text	Ὡς θαυμαστὴν μαρτυρίαν εὑρὼν ὁ Ἄγγελος, τὴν σύλληψιν τῆς στείρας, τῇ Μαρίᾳ προσάγει, πρὸς πίστωσιν προσφέρων· διὸ καὶ ἡμεῖς, Ἐλισάβετ πρὶν ἄγονον, καὶ Ζαχαρίαν ὁμόζυγον τὸν αὐτῆς, καὶ Ἰωάννην εὐφημήσωμεν.
ltx/gr_gr_cog/me.m09.d23:meMA.Lauds3.incipit	Ὁ θεοσκεύαστος λύχνος τοῦ ἀϊδίου…
ltx/gr_gr_cog/me.m09.d23:meMA.Lauds3.melody	@ltx/gr_gr_cog/he.a.m1:heAU.TonOuranionTagmaton.name
ltx/gr_gr_cog/me.m09.d23:meMA.Lauds3.mode	@ltx/gr_gr_cog/miscellanea:misc.Mode1
ltx/gr_gr_cog/me.m09.d23:meMA.Lauds3.text	Ὁ θεοσκεύαστος λύχνος τοῦ ἀϊδίου φωτός, ὁ τοῦ νυμφίου φίλος, τοῦ Ἡλίου τῆς δόξης, ὁ μέγας Ἑωσφόρος, ἡ ζῶσα φωνή, Θεοῦ Λόγου ὁ Πρόδρομος, τῆς παρουσίας Κυρίου ἀγγελικῇ, προσφωνήσει νῦν συνείληπται.
ltx/gr_gr_cog/me.m09.d23:meMA.LaudsGlory.incipit	Ἡ Ἐλισάβετ συνέλαβε τὸν Πρόδρομον…
ltx/gr_gr_cog/me.m09.d23:meMA.LaudsGlory.melody	
ltx/gr_gr_cog/me.m09.d23:meMA.LaudsGlory.mode	@ltx/gr_gr_cog/miscellanea:misc.Mode8
ltx/gr_gr_cog/me.m09.d23:meMA.LaudsGlory.text	Ἡ Ἐλισάβετ συνέλαβε τὸν Πρόδρομον τῆς χάριτος, ἡ δὲ Παρθένος τὸν Κύριον τῆς δόξης. Ἠσπάσαντο ἀλλήλας αἱ μητέρες, καὶ τὸ βρέφος ἐσκίρτησεν· ἔνδοθεν γὰρ ὁ δοῦλος ᾔνει τὸν Δεσπότην. Θαυμάσασα ἡ μήτηρ τοῦ Προδρόμου, ἤρξατο βοᾷν· Πόθεν μοι τοῦτο, ἵνα ἡ Μήτηρ τοῦ Κυρίου μου ἔλθῃ πρός με; ἵνα σώσῃ λαὸν ἀπεγνωσμένον.
ltx/gr_gr_cog/me.m09.d23:meMA.MM.Lauds1123as5678.text	@ltx/gr_gr_cog/properties:media.key
ltx/gr_gr_cog/me.m09.d23:meMA.Ode1C11.greekmelody	@ltx/gr_gr_cog/he.h.m6:heHE.OsEnIpeiroPezefsas.greekname
ltx/gr_gr_cog/me.m09.d23:meMA.Ode1C11.incipit	Τῆς στειρευούσης ψυχῆς μου τοὺς…
ltx/gr_gr_cog/me.m09.d23:meMA.Ode1C11.melody	@ltx/gr_gr_cog/he.h.m6:heHE.OsEnIpeiroPezefsas.name
ltx/gr_gr_cog/me.m09.d23:meMA.Ode1C11.mode	@ltx/gr_gr_cog/miscellanea:misc.Mode6
ltx/gr_gr_cog/me.m09.d23:meMA.Ode1C11.ode	@ltx/gr_gr_cog/miscellanea:misc.Ode1
ltx/gr_gr_cog/me.m09.d23:meMA.Ode1C11.text	Τῆς στειρευούσης ψυχῆς μου τοὺς λογισμούς, τοὺς ἀκάρπους ἔκτιλον, στειρευούσης ὁ βλαστός, εὐφημεῖν ὁρμήσαντος τὴν σήν, ἐν νηδύϊ μητρικῇ, ἁγίαν Σύλληψιν.
ltx/gr_gr_cog/me.m09.d23:meMA.Ode1C12.incipit	Ὁ Ἱερὸς Ζαχαρίας ἐν τῷ…
ltx/gr_gr_cog/me.m09.d23:meMA.Ode1C12.melody	@ltx/gr_gr_cog/he.h.m6:heHE.OsEnIpeiroPezefsas.name
ltx/gr_gr_cog/me.m09.d23:meMA.Ode1C12.mode	@ltx/gr_gr_cog/miscellanea:misc.Mode6
ltx/gr_gr_cog/me.m09.d23:meMA.Ode1C12.ode	@ltx/gr_gr_cog/miscellanea:misc.Ode1
ltx/gr_gr_cog/me.m09.d23:meMA.Ode1C12.text	Ὁ Ἱερὸς Ζαχαρίας ἐν τῷ ναῷ, εἰσελθὼν τεθέαται, θεῖον Ἄγγελον αὐτῷ, ἐμφανῶς μηνύοντα, Υἱόν, μετὰ γῆρας Ἱερεῦ, ἕξεις τὸν Πρόδρομον.
ltx/gr_gr_cog/me.m09.d23:meMA.Ode1C13.incipit	Λύχνος Ἡλίου τῆς δόξης ὁ…
ltx/gr_gr_cog/me.m09.d23:meMA.Ode1C13.melody	@ltx/gr_gr_cog/he.h.m6:heHE.OsEnIpeiroPezefsas.name
ltx/gr_gr_cog/me.m09.d23:meMA.Ode1C13.mode	@ltx/gr_gr_cog/miscellanea:misc.Mode6
ltx/gr_gr_cog/me.m09.d23:meMA.Ode1C13.ode	@ltx/gr_gr_cog/miscellanea:misc.Ode1
ltx/gr_gr_cog/me.m09.d23:meMA.Ode1C13.text	Λύχνος Ἡλίου τῆς δόξης ὁ φωταυγής, ἐν νηδύϊ ἄρχεται, ἀναλάμπειν μητρικῇ, διʼ οὗ σκότος λέλυται παθῶν, καὶ στειρώσεως δεσμά, ὁ μέγας Πρόδρομος.
ltx/gr_gr_cog/me.m09.d23:meMA.Ode1C1T.incipit	Τὸν ἐν γαστρί σου Δεσπότην…
ltx/gr_gr_cog/me.m09.d23:meMA.Ode1C1T.melody	@ltx/gr_gr_cog/he.h.m6:heHE.OsEnIpeiroPezefsas.name
ltx/gr_gr_cog/me.m09.d23:meMA.Ode1C1T.mode	@ltx/gr_gr_cog/miscellanea:misc.Mode6
ltx/gr_gr_cog/me.m09.d23:meMA.Ode1C1T.ode	@ltx/gr_gr_cog/miscellanea:misc.Ode1
ltx/gr_gr_cog/me.m09.d23:meMA.Ode1C1T.text	Τὸν ἐν γαστρί σου Δεσπότην ἐν μητρικῇ, Θεοτόκε πάναγνε, βασταζόμενον γαστρί, κατιδὼν ἐσκίρτησε σαφῶς, Ἰωάννης ὡς αὐτοῦ, ὑπάρχων Πρόδρομος.
ltx/gr_gr_cog/me.m09.d23:meMA.Ode3C11.greekmelody	@ltx/gr_gr_cog/he.h.m6:heHE.OukEstinAgios.greekname
ltx/gr_gr_cog/me.m09.d23:meMA.Ode3C11.incipit	Ἡ στεῖρα σήμερον καρπόν…
ltx/gr_gr_cog/me.m09.d23:meMA.Ode3C11.melody	@ltx/gr_gr_cog/he.h.m6:heHE.OukEstinAgios.name
ltx/gr_gr_cog/me.m09.d23:meMA.Ode3C11.mode	@ltx/gr_gr_cog/miscellanea:misc.Mode6
ltx/gr_gr_cog/me.m09.d23:meMA.Ode3C11.ode	@ltx/gr_gr_cog/miscellanea:misc.Ode3
ltx/gr_gr_cog/me.m09.d23:meMA.Ode3C11.text	Ἡ στεῖρα σήμερον καρπόν, ἱερὸν συλλαμβάνει, τὸν μετέπειτα πᾶσαν, ἀκαρπίαν τῶν ψυχῶν, ἀξίνῃ τῇ νοητῇ, ἀποτέμνειν, μέλλοντα ἐν χάριτι.
ltx/gr_gr_cog/me.m09.d23:meMA.Ode3C12.incipit	Κωφεύσας ἔνδον τοῦ ναοῦ…
ltx/gr_gr_cog/me.m09.d23:meMA.Ode3C12.melody	@ltx/gr_gr_cog/he.h.m6:heHE.OukEstinAgios.name
ltx/gr_gr_cog/me.m09.d23:meMA.Ode3C12.mode	@ltx/gr_gr_cog/miscellanea:misc.Mode6
ltx/gr_gr_cog/me.m09.d23:meMA.Ode3C12.ode	@ltx/gr_gr_cog/miscellanea:misc.Ode3
ltx/gr_gr_cog/me.m09.d23:meMA.Ode3C12.text	Κωφεύσας ἔνδον τοῦ ναοῦ, Ζαχαρίας ὁ μέγας, τὴν φωνὴν τὴν τοῦ Λόγου, ἀγγελίᾳ φοβερᾷ, κομίζεται καὶ λαμπρῶς, μεγαλύνει, Κύριον τὸν εὔσπλαγχνον.
ltx/gr_gr_cog/me.m09.d23:meMA.Ode3C13.incipit	Ὁ δείξας τρίβον ἀσφαλῆ…
ltx/gr_gr_cog/me.m09.d23:meMA.Ode3C13.melody	@ltx/gr_gr_cog/he.h.m6:heHE.OukEstinAgios.name
ltx/gr_gr_cog/me.m09.d23:meMA.Ode3C13.mode	@ltx/gr_gr_cog/miscellanea:misc.Mode6
ltx/gr_gr_cog/me.m09.d23:meMA.Ode3C13.ode	@ltx/gr_gr_cog/miscellanea:misc.Ode3
ltx/gr_gr_cog/me.m09.d23:meMA.Ode3C13.text	Ὁ δείξας τρίβον ἀσφαλῆ, τοῖς πιστοῖς μετανοίας, προτροπῇ τοῦ Ἀγγέλου, ἐν νηδύϊ μητρικῇ, βλαστάνει θείᾳ βουλῇ, παρʼ ἐλπίδα, ὁ Ἔνδοξος Πρόδρομος.
ltx/gr_gr_cog/me.m09.d23:meMA.Ode3C1T.incipit	Γαστρὶ φερόμενον Χριστόν…
ltx/gr_gr_cog/me.m09.d23:meMA.Ode3C1T.melody	@ltx/gr_gr_cog/he.h.m6:heHE.OukEstinAgios.name
ltx/gr_gr_cog/me.m09.d23:meMA.Ode3C1T.mode	@ltx/gr_gr_cog/miscellanea:misc.Mode6
ltx/gr_gr_cog/me.m09.d23:meMA.Ode3C1T.ode	@ltx/gr_gr_cog/miscellanea:misc.Ode3
ltx/gr_gr_cog/me.m09.d23:meMA.Ode3C1T.text	Γαστρὶ φερόμενον Χριστόν, τῆς Παρθένου ὡς ἔγνω, ὁ ἐκ στείρας ἐσκίρτα, προμηνύων τὴν χαράν, ἐπιδημοῦσαν ἐν γῇ, κατηφείας, πάντας ἐκλυτρώσασθαι.
ltx/gr_gr_cog/me.m09.d23:meMA.Ode3Kathisma1.greekmelody	@ltx/gr_gr_cog/he.a.m4:heAU.KateplagiIosif.greekname
ltx/gr_gr_cog/me.m09.d23:meMA.Ode3Kathisma1.incipit	Θυμιῶντι ἐν ναῷ, τῷ Ζαχαρίᾳ…
ltx/gr_gr_cog/me.m09.d23:meMA.Ode3Kathisma1.melody	@ltx/gr_gr_cog/he.a.m4:heAU.KateplagiIosif.name
ltx/gr_gr_cog/me.m09.d23:meMA.Ode3Kathisma1.mode	@ltx/gr_gr_cog/miscellanea:misc.Mode4
ltx/gr_gr_cog/me.m09.d23:meMA.Ode3Kathisma1.text	Θυμιῶντι ἐν ναῷ, τῷ Ζαχαρίᾳ Ἱερεῖ, Γαβριὴλ ἐξ οὐρανοῦ, ἐπέστη λέγων πρὸς αὐτον· Ὅτι ἐν γήρᾳ σου ἕξεις καρπὸν εὐκλεῆ. Καὶ στείρωσις ἡ πρίν, τῆς Ἐλισάβετ νυνί, λυθήσεται εὐθύς, καὶ ἀκαρπία γονῆς, καὶ συλλαβοῦσα τέξεται τὸν κήρυκα, τοῦ Ἰησοῦ τε καὶ Πρόδρομον. Αὐτῶν πρεσβείαις, Σωτὴρ τοῦ κόσμου, σῶσον τὰς ψυχὰς ἡμῶν.
ltx/gr_gr_cog/me.m09.d23:meMA.Ode3KathismaT.incipit	@ltx/gr_gr_cog/he.a.m4:heAU.KateplagiIosif.incipit
ltx/gr_gr_cog/me.m09.d23:meMA.Ode3KathismaT.melody	@ltx/gr_gr_cog/he.a.m4:heAU.KateplagiIosif.melody
ltx/gr_gr_cog/me.m09.d23:meMA.Ode3KathismaT.mode	@ltx/gr_gr_cog/miscellanea:misc.Mode4
ltx/gr_gr_cog/me.m09.d23:meMA.Ode3KathismaT.text	@ltx/gr_gr_cog/he.a.m4:heAU.KateplagiIosif.text
ltx/gr_gr_cog/me.m09.d23:meMA.Ode4C11.greekmelody	@ltx/gr_gr_cog/he.h.m6:heHE.ChristosMouDynamis.greekname
ltx/gr_gr_cog/me.m09.d23:meMA.Ode4C11.incipit	Φωνὴ Ἀγγέλου σε, τὸν ὄντως…
ltx/gr_gr_cog/me.m09.d23:meMA.Ode4C11.melody	@ltx/gr_gr_cog/he.h.m6:heHE.ChristosMouDynamis.name
ltx/gr_gr_cog/me.m09.d23:meMA.Ode4C11.mode	@ltx/gr_gr_cog/miscellanea:misc.Mode6
ltx/gr_gr_cog/me.m09.d23:meMA.Ode4C11.ode	@ltx/gr_gr_cog/miscellanea:misc.Ode4
ltx/gr_gr_cog/me.m09.d23:meMA.Ode4C11.text	Φωνὴ Ἀγγέλου σε, τὸν ὄντως ἄγγελον, τῆς Χριστοῦ παρουσίας τῷ ἱερεῖ, ἱερῶς προήγγειλε, στειρωτικῆς ἀπὸ γαστρός, ἐκβλαστάνειν μάκαρ Πρόδρομε.
ltx/gr_gr_cog/me.m09.d23:meMA.Ode4C12.incipit	Ἡ πρώην ἄγονος, καὶ ἡ…
ltx/gr_gr_cog/me.m09.d23:meMA.Ode4C12.melody	@ltx/gr_gr_cog/he.h.m6:heHE.ChristosMouDynamis.name
ltx/gr_gr_cog/me.m09.d23:meMA.Ode4C12.mode	@ltx/gr_gr_cog/miscellanea:misc.Mode6
ltx/gr_gr_cog/me.m09.d23:meMA.Ode4C12.ode	@ltx/gr_gr_cog/miscellanea:misc.Ode4
ltx/gr_gr_cog/me.m09.d23:meMA.Ode4C12.text	Ἡ πρώην ἄγονος, καὶ ἡ οὐ τίκτουσα, νῦν εὐφράνθητι στεῖρα ὅτι Χριστοῦ, Βαπτιστὴν καὶ Πρόδρομον, καρπογονεῖς πανευκλεῶς, Ἐλισάβετ ἀξιάγαστε.
ltx/gr_gr_cog/me.m09.d23:meMA.Ode4C13.incipit	Ἀξίνῃ Πρόδρομε, τῆς σῆς δεήσεως…
ltx/gr_gr_cog/me.m09.d23:meMA.Ode4C13.melody	@ltx/gr_gr_cog/he.h.m6:heHE.ChristosMouDynamis.name
ltx/gr_gr_cog/me.m09.d23:meMA.Ode4C13.mode	@ltx/gr_gr_cog/miscellanea:misc.Mode6
ltx/gr_gr_cog/me.m09.d23:meMA.Ode4C13.ode	@ltx/gr_gr_cog/miscellanea:misc.Ode4
ltx/gr_gr_cog/me.m09.d23:meMA.Ode4C13.text	Ἀξίνῃ Πρόδρομε, τῆς σῆς δεήσεως, τῶν παθῶν μου ἀκάνθας καὶ λογισμῶν, ἔκτιλον προσκόμματα, καὶ καρποφόρον μου τὸν νοῦν, ἀρεταῖς παμμάκαρ ποίησον.
ltx/gr_gr_cog/me.m09.d23:meMA.Ode4C1T.incipit	Νηδύς σε ἔφερε, τὸν πάντα…
ltx/gr_gr_cog/me.m09.d23:meMA.Ode4C1T.melody	@ltx/gr_gr_cog/he.h.m6:heHE.ChristosMouDynamis.name
ltx/gr_gr_cog/me.m09.d23:meMA.Ode4C1T.mode	@ltx/gr_gr_cog/miscellanea:misc.Mode6
ltx/gr_gr_cog/me.m09.d23:meMA.Ode4C1T.ode	@ltx/gr_gr_cog/miscellanea:misc.Ode4
ltx/gr_gr_cog/me.m09.d23:meMA.Ode4C1T.text	Νηδύς σε ἔφερε, τὸν πάντα φέροντα, τῆς Παρθένου ἡνίκα ὁ Βαπτιστής, ἐν γαστρὶ φερόμενος, σὲ προσεκύνησε Χριστέ, καὶ σκιρτῶν ἠγαλλιάσατο.
ltx/gr_gr_cog/me.m09.d23:meMA.Ode5C11.greekmelody	@ltx/gr_gr_cog/he.h.m6:heHE.ToTheioFengeiSou.greekname
ltx/gr_gr_cog/me.m09.d23:meMA.Ode5C11.incipit	Μολοῦντι ἔνδον τοῦ Ἱεροῦ, καὶ…
ltx/gr_gr_cog/me.m09.d23:meMA.Ode5C11.melody	@ltx/gr_gr_cog/he.h.m6:heHE.ToTheioFengeiSou.name
ltx/gr_gr_cog/me.m09.d23:meMA.Ode5C11.mode	@ltx/gr_gr_cog/miscellanea:misc.Mode6
ltx/gr_gr_cog/me.m09.d23:meMA.Ode5C11.ode	@ltx/gr_gr_cog/miscellanea:misc.Ode5
ltx/gr_gr_cog/me.m09.d23:meMA.Ode5C11.text	Μολοῦντι ἔνδον τοῦ Ἱεροῦ, καὶ τὰς νομικὰς τῷ Ποιητῇ, λατρείας προσαναφέροντι, ὤφθη τῷ Προφήτῃ Ἅγιος Ἄγγελος, μηνύων τοῦ Προδρόμου, τὴν θείαν σύλληψιν.
ltx/gr_gr_cog/me.m09.d23:meMA.Ode5C12.incipit	Πῶς ἔσται τοῦτό μοι τηλαυγῶς…
ltx/gr_gr_cog/me.m09.d23:meMA.Ode5C12.melody	@ltx/gr_gr_cog/he.h.m6:heHE.ToTheioFengeiSou.name
ltx/gr_gr_cog/me.m09.d23:meMA.Ode5C12.mode	@ltx/gr_gr_cog/miscellanea:misc.Mode6
ltx/gr_gr_cog/me.m09.d23:meMA.Ode5C12.ode	@ltx/gr_gr_cog/miscellanea:misc.Ode5
ltx/gr_gr_cog/me.m09.d23:meMA.Ode5C12.text	Πῶς ἔσται τοῦτό μοι τηλαυγῶς; πέλω γὰρ πρεσβύτης ὡς ὁρᾷς, καὶ στεῖραν σύζυγον κέκτημαι, ἔφη Ζαχαρίας πρὸς τὸν Ἀρχάγγελον, φύσεως ἐναντία, λέγεις μοι ῥήματα.
ltx/gr_gr_cog/me.m09.d23:meMA.Ode5C13.incipit	Πρὸς Σάῤῥαν βλέψον τοῦ Ἀβραάμ…
ltx/gr_gr_cog/me.m09.d23:meMA.Ode5C13.melody	@ltx/gr_gr_cog/he.h.m6:heHE.ToTheioFengeiSou.name
ltx/gr_gr_cog/me.m09.d23:meMA.Ode5C13.mode	@ltx/gr_gr_cog/miscellanea:misc.Mode6
ltx/gr_gr_cog/me.m09.d23:meMA.Ode5C13.ode	@ltx/gr_gr_cog/miscellanea:misc.Ode5
ltx/gr_gr_cog/me.m09.d23:meMA.Ode5C13.text	Πρὸς Σάῤῥαν βλέψον τοῦ Ἀβραάμ, ἰδὲ πῶς ἐκείνη Ἰσαάκ, ἐν γήρᾳ τέτοκεν ἄνθρωπε, καὶ τοῖς λεγομένοις δικαίως πίστευε, πρεσβύτῃ προσεφώνει, ὁ μέγας Ἄγγελος.
ltx/gr_gr_cog/me.m09.d23:meMA.Ode5C1T.incipit	Εὐλογημένη ἐν γυναιξί, σῦ Θεοχαρίτωτε…
ltx/gr_gr_cog/me.m09.d23:meMA.Ode5C1T.melody	@ltx/gr_gr_cog/he.h.m6:heHE.ToTheioFengeiSou.name
ltx/gr_gr_cog/me.m09.d23:meMA.Ode5C1T.mode	@ltx/gr_gr_cog/miscellanea:misc.Mode6
ltx/gr_gr_cog/me.m09.d23:meMA.Ode5C1T.ode	@ltx/gr_gr_cog/miscellanea:misc.Ode5
ltx/gr_gr_cog/me.m09.d23:meMA.Ode5C1T.text	Εὐλογημένη ἐν γυναιξί, σῦ Θεοχαρίτωτε σαφῶς, ἡ Ἐλισάβετ ἐβόα σοι, ὅτι κυοφόρον ἀνάνδρως ἔγνων σε, τὴν μόνην μετὰ τόκον, ἄφθορον μείνασαν.
ltx/gr_gr_cog/me.m09.d23:meMA.Ode6C11.greekmelody	@ltx/gr_gr_cog/he.h.m6:heHE.TouViouTinThalassan.greekname
ltx/gr_gr_cog/me.m09.d23:meMA.Ode6C11.incipit	Ἀμφίβολον κέκτημαι, τὴν διάνοιαν ἐγώ…
ltx/gr_gr_cog/me.m09.d23:meMA.Ode6C11.melody	@ltx/gr_gr_cog/he.h.m6:heHE.TouViouTinThalassan.name
ltx/gr_gr_cog/me.m09.d23:meMA.Ode6C11.mode	@ltx/gr_gr_cog/miscellanea:misc.Mode6
ltx/gr_gr_cog/me.m09.d23:meMA.Ode6C11.ode	@ltx/gr_gr_cog/miscellanea:misc.Ode6
ltx/gr_gr_cog/me.m09.d23:meMA.Ode6C11.text	Ἀμφίβολον κέκτημαι, τὴν διάνοιαν ἐγώ, καὶ ἀπιστῷ τοῖς λόγοις σου, τῷ Ἀρχαγγέλῳ ἔφη ὁ Ἱερεύς· λαοῦ σωτηρίαν γάρ, οὐκ ἐμῆς ἐξ ὀσφύος καρπὸν ᾔτησα.
ltx/gr_gr_cog/me.m09.d23:meMA.Ode6C12.incipit	Ὁ πλάστης τῆς φύσεως, τῶν…
ltx/gr_gr_cog/me.m09.d23:meMA.Ode6C12.melody	@ltx/gr_gr_cog/he.h.m6:heHE.TouViouTinThalassan.name
ltx/gr_gr_cog/me.m09.d23:meMA.Ode6C12.mode	@ltx/gr_gr_cog/miscellanea:misc.Mode6
ltx/gr_gr_cog/me.m09.d23:meMA.Ode6C12.ode	@ltx/gr_gr_cog/miscellanea:misc.Ode6
ltx/gr_gr_cog/me.m09.d23:meMA.Ode6C12.text	Ὁ πλάστης τῆς φύσεως, τῶν Ἀγγέλων Βασιλεύς, ὁ λειτουργὸς ἀντέφησε, τῆς παρουσίας Ἄγγελον τῆς αὐτοῦ, ηὐδόκησε τίκτειν σε, τοῖς ἐμοῖς μὴ ἀπίστει λόγοις ἄνθρωπε.
ltx/gr_gr_cog/me.m09.d23:meMA.Ode6C13.incipit	Τὸ εἶδός σου πύρινον καὶ…
ltx/gr_gr_cog/me.m09.d23:meMA.Ode6C13.melody	@ltx/gr_gr_cog/he.h.m6:heHE.TouViouTinThalassan.name
ltx/gr_gr_cog/me.m09.d23:meMA.Ode6C13.mode	@ltx/gr_gr_cog/miscellanea:misc.Mode6
ltx/gr_gr_cog/me.m09.d23:meMA.Ode6C13.ode	@ltx/gr_gr_cog/miscellanea:misc.Ode6
ltx/gr_gr_cog/me.m09.d23:meMA.Ode6C13.text	Τὸ εἶδός σου πύρινον καὶ ἡ θέα σου φρικτή, καὶ θαυμαστὸς ὁ λόγος σου, ὁ Ζαχαρίας ἔφη τῷ λειτουργῷ, ἀλλʼ οὖν οὐ πιστεύω σοι, ὑπὲρ φύσιν λαλοῦντι ξένα ῥήματα.
ltx/gr_gr_cog/me.m09.d23:meMA.Ode6C1T.incipit	Ὁ λύχνος τὸν Ἥλιον, ἐν…
ltx/gr_gr_cog/me.m09.d23:meMA.Ode6C1T.melody	@ltx/gr_gr_cog/he.h.m6:heHE.TouViouTinThalassan.name
ltx/gr_gr_cog/me.m09.d23:meMA.Ode6C1T.mode	@ltx/gr_gr_cog/miscellanea:misc.Mode6
ltx/gr_gr_cog/me.m09.d23:meMA.Ode6C1T.ode	@ltx/gr_gr_cog/miscellanea:misc.Ode6
ltx/gr_gr_cog/me.m09.d23:meMA.Ode6C1T.text	Ὁ λύχνος τὸν Ἥλιον, ἐν νεφέλῃ μητρικῇ, γαστρὸς κατακρυπτόμενον, ἐπεγνωκὼς ὑπάρχων ἐν ζοφερῷ, τῆς μήτρας σκηνώματι, προσεκύνησε χαίρων καὶ ἐσκίρτησε.
ltx/gr_gr_cog/me.m09.d23:meMA.Ode7C11.greekmelody	@ltx/gr_gr_cog/he.h.m6:heHE.DrosovolonMenTinKaminon.greekname
ltx/gr_gr_cog/me.m09.d23:meMA.Ode7C11.incipit	Ἀπιστήσας μου τοῖς ῥήμασι τὴν…
ltx/gr_gr_cog/me.m09.d23:meMA.Ode7C11.melody	@ltx/gr_gr_cog/he.h.m6:heHE.DrosovolonMenTinKaminon.name
ltx/gr_gr_cog/me.m09.d23:meMA.Ode7C11.mode	@ltx/gr_gr_cog/miscellanea:misc.Mode6
ltx/gr_gr_cog/me.m09.d23:meMA.Ode7C11.ode	@ltx/gr_gr_cog/miscellanea:misc.Ode7
ltx/gr_gr_cog/me.m09.d23:meMA.Ode7C11.text	Ἀπιστήσας μου τοῖς ῥήμασι τὴν κώφευσιν, κομίζου προδηλότατα, καὶ τικτομένην ὁπηνίκα, ἴδῃς τὴν φωνήν, τοῦ Λόγου ἀνάλαβε φωνήν· Εὐλογητὸς εἶ ἐκβοών, τοῦ Ἰσραὴλ ὁ Θεός.
ltx/gr_gr_cog/me.m09.d23:meMA.Ode7C12.incipit	Τῇ σελήνῃ Ἐλισάβετ προσενούμενος, πολύφωτος…
ltx/gr_gr_cog/me.m09.d23:meMA.Ode7C12.melody	@ltx/gr_gr_cog/he.h.m6:heHE.DrosovolonMenTinKaminon.name
ltx/gr_gr_cog/me.m09.d23:meMA.Ode7C12.mode	@ltx/gr_gr_cog/miscellanea:misc.Mode6
ltx/gr_gr_cog/me.m09.d23:meMA.Ode7C12.ode	@ltx/gr_gr_cog/miscellanea:misc.Ode7
ltx/gr_gr_cog/me.m09.d23:meMA.Ode7C12.text	Τῇ σελήνῃ Ἐλισάβετ προσενούμενος, πολύφωτος ὡς ἥλιος, ὁ Ζαχαρίας σελασφόρον λύχνον τοῦ φωτός, ἐκτέτοκε φαίνοντα ἡμῖν, τοῖς ἐν τῷ σκότει τῶν παθῶν, κατασχεθεῖσι δεινῶς.
ltx/gr_gr_cog/me.m09.d23:meMA.Ode7C13.incipit	Τοῖς σκιρτήμασιν ὡς ῥήμασι χρησάμενος…
ltx/gr_gr_cog/me.m09.d23:meMA.Ode7C13.melody	@ltx/gr_gr_cog/he.h.m6:heHE.DrosovolonMenTinKaminon.name
ltx/gr_gr_cog/me.m09.d23:meMA.Ode7C13.mode	@ltx/gr_gr_cog/miscellanea:misc.Mode6
ltx/gr_gr_cog/me.m09.d23:meMA.Ode7C13.ode	@ltx/gr_gr_cog/miscellanea:misc.Ode7
ltx/gr_gr_cog/me.m09.d23:meMA.Ode7C13.text	Τοῖς σκιρτήμασιν ὡς ῥήμασι χρησάμενος, Χριστοῦ ὁ μέγας Πρόδρομος, προσεκύνησεν ἐν νηδύϊ σε Παρθενικῇ, αὐτὸς βασταζόμενος γαστρί, τῆς Ἐλισάβετ Ἰησοῦ, ὁ τῶν Πατέρων Θεός.
ltx/gr_gr_cog/me.m09.d23:meMA.Ode7C1T.incipit	Ἡ σελήνη Ἐλισάβετ ἔνδον φέρουσα…
ltx/gr_gr_cog/me.m09.d23:meMA.Ode7C1T.melody	@ltx/gr_gr_cog/he.h.m6:heHE.DrosovolonMenTinKaminon.name
ltx/gr_gr_cog/me.m09.d23:meMA.Ode7C1T.mode	@ltx/gr_gr_cog/miscellanea:misc.Mode6
ltx/gr_gr_cog/me.m09.d23:meMA.Ode7C1T.ode	@ltx/gr_gr_cog/miscellanea:misc.Ode7
ltx/gr_gr_cog/me.m09.d23:meMA.Ode7C1T.text	Ἡ σελήνη Ἐλισάβετ ἔνδον φέρουσα, ἀστέρα θεῖον Πρόδρομον, προσεκύνησε, φωτεινὴν νεφέλην Μαριάμ, τὸν ἥλιον φέρουσαν Χριστόν, σαρκοφορούμενον ἐκ σοῦ, διὰ τὸ σῶσαι ἡμᾶς.
ltx/gr_gr_cog/me.m09.d23:meMA.Ode8C11.greekmelody	@ltx/gr_gr_cog/he.h.m6:heHE.EkFlogosToisOsiois.greekname
ltx/gr_gr_cog/me.m09.d23:meMA.Ode8C11.incipit	Τοῦ νυμφίου ὁ φίλος προετοιμάζεται…
ltx/gr_gr_cog/me.m09.d23:meMA.Ode8C11.melody	@ltx/gr_gr_cog/he.h.m6:heHE.EkFlogosToisOsiois.name
ltx/gr_gr_cog/me.m09.d23:meMA.Ode8C11.mode	@ltx/gr_gr_cog/miscellanea:misc.Mode6
ltx/gr_gr_cog/me.m09.d23:meMA.Ode8C11.ode	@ltx/gr_gr_cog/miscellanea:misc.Ode8
ltx/gr_gr_cog/me.m09.d23:meMA.Ode8C11.text	Τοῦ νυμφίου ὁ φίλος προετοιμάζεται, ἡ φωνὴ δὲ τοῦ Λόγου ἀρχὴν εἰσδέχεται, καὶ στειρωτικαῖς, νῦν λαγόσιν ἐκτρέφεται, τοῦ παμβασιλέως, ὁ μέγας Στρατιώτης.
ltx/gr_gr_cog/me.m09.d23:meMA.Ode8C12.incipit	Στειρευούσαις καρδίαις γεωργὸς ἤνθησε, τῶν…
ltx/gr_gr_cog/me.m09.d23:meMA.Ode8C12.melody	@ltx/gr_gr_cog/he.h.m6:heHE.EkFlogosToisOsiois.name
ltx/gr_gr_cog/me.m09.d23:meMA.Ode8C12.mode	@ltx/gr_gr_cog/miscellanea:misc.Mode6
ltx/gr_gr_cog/me.m09.d23:meMA.Ode8C12.ode	@ltx/gr_gr_cog/miscellanea:misc.Ode8
ltx/gr_gr_cog/me.m09.d23:meMA.Ode8C12.text	Στειρευούσαις καρδίαις γεωργὸς ἤνθησε, τῶν παθῶν ἡ ἀξίνη ἤδη χαλκεύεται, μόσχος ὁ σεπτός, ἐγκρατείᾳ σιτεύεται, Πρόδρομος ὁ μέγας, λαοὶ ἀγαλλιᾶσθε.
ltx/gr_gr_cog/me.m09.d23:meMA.Ode8C13.incipit	Τὰ δεσμὰ ὥσπερ πάλαι τὰ…
ltx/gr_gr_cog/me.m09.d23:meMA.Ode8C13.melody	@ltx/gr_gr_cog/he.h.m6:heHE.EkFlogosToisOsiois.name
ltx/gr_gr_cog/me.m09.d23:meMA.Ode8C13.mode	@ltx/gr_gr_cog/miscellanea:misc.Mode6
ltx/gr_gr_cog/me.m09.d23:meMA.Ode8C13.ode	@ltx/gr_gr_cog/miscellanea:misc.Ode8
ltx/gr_gr_cog/me.m09.d23:meMA.Ode8C13.text	Τὰ δεσμὰ ὥσπερ πάλαι τὰ τῆς στειρώσεως, τῆς ἐμῆς διανοίας, οὕτω τὴν πώρωσιν, λῦσον Βαπτιστά, καὶ καρποὺς μετανοίας με, ποίησον βλαστάνειν, καὶ ζῆν εἰς τοὺς αἰῶνας.
ltx/gr_gr_cog/me.m09.d23:meMA.Ode8C1T.incipit	Κυοφόρον σε Κόρη ὡς ἐθεάσατο…
ltx/gr_gr_cog/me.m09.d23:meMA.Ode8C1T.melody	@ltx/gr_gr_cog/he.h.m6:heHE.EkFlogosToisOsiois.name
ltx/gr_gr_cog/me.m09.d23:meMA.Ode8C1T.mode	@ltx/gr_gr_cog/miscellanea:misc.Mode6
ltx/gr_gr_cog/me.m09.d23:meMA.Ode8C1T.ode	@ltx/gr_gr_cog/miscellanea:misc.Ode8
ltx/gr_gr_cog/me.m09.d23:meMA.Ode8C1T.text	Κυοφόρον σε Κόρη ὡς ἐθεάσατο, Ἐλισάβετ ἐνθέως ἠγαλλιάσατο, ἔνδοθεν αὐτῆς, τοῦ ἐμβρύου σκιρτήσαντος, ὡς ἐπιγνωκότος, τὸν ἑαυτοῦ Δεσπότην.
ltx/gr_gr_cog/me.m09.d23:meMA.Ode9C11.greekmelody	@ltx/gr_gr_cog/he.h.m6:heHE.TheonAnthropois.greekname
ltx/gr_gr_cog/me.m09.d23:meMA.Ode9C11.incipit	Χριστοῦ ὁ μέγας καὶ θεῖος…
ltx/gr_gr_cog/me.m09.d23:meMA.Ode9C11.melody	@ltx/gr_gr_cog/he.h.m6:heHE.TheonAnthropois.name
ltx/gr_gr_cog/me.m09.d23:meMA.Ode9C11.mode	@ltx/gr_gr_cog/miscellanea:misc.Mode6
ltx/gr_gr_cog/me.m09.d23:meMA.Ode9C11.ode	@ltx/gr_gr_cog/miscellanea:misc.Ode9
ltx/gr_gr_cog/me.m09.d23:meMA.Ode9C11.text	Χριστοῦ ὁ μέγας καὶ θεῖος Πρόδρομος, στειρωτικὰς νῦν πύλας, διανοίξας αὐλίζεται, ὡς ἐν βασιλείοις ἐν νηδύϊ μητρός· ὃς τις ὡς στρατιώτης, προεξελεύσεται, τοῦ Παμβασιλέως τὰς ὁδοὺς ἐτοιμαζόμενος.
ltx/gr_gr_cog/me.m09.d23:meMA.Ode9C12.incipit	Θεοῦ Προφῆτα πρεσβῦτα χόρευε, ἕξεις…
ltx/gr_gr_cog/me.m09.d23:meMA.Ode9C12.melody	@ltx/gr_gr_cog/he.h.m6:heHE.TheonAnthropois.name
ltx/gr_gr_cog/me.m09.d23:meMA.Ode9C12.mode	@ltx/gr_gr_cog/miscellanea:misc.Mode6
ltx/gr_gr_cog/me.m09.d23:meMA.Ode9C12.ode	@ltx/gr_gr_cog/miscellanea:misc.Ode9
ltx/gr_gr_cog/me.m09.d23:meMA.Ode9C12.text	Θεοῦ Προφῆτα πρεσβῦτα χόρευε, ἕξεις υἱόν, οὗ μείζων ἐν βροτοῖς οὐκ ἐγήγερται, Ἰωάννην Κυρίου τὸν Πρόδρομον· Σκίρτησον Ἐλισάβετ· γῆ πᾶσα γήθησον, αἴνεσιν τῷ πάντων Ποιητῇ Θεῷ προσάγουσα.
ltx/gr_gr_cog/me.m09.d23:meMA.Ode9C13.incipit	Ἡμῶν τῶν πίστει ἀνευφημούντων σε…
ltx/gr_gr_cog/me.m09.d23:meMA.Ode9C13.melody	@ltx/gr_gr_cog/he.h.m6:heHE.TheonAnthropois.name
ltx/gr_gr_cog/me.m09.d23:meMA.Ode9C13.mode	@ltx/gr_gr_cog/miscellanea:misc.Mode6
ltx/gr_gr_cog/me.m09.d23:meMA.Ode9C13.ode	@ltx/gr_gr_cog/miscellanea:misc.Ode9
ltx/gr_gr_cog/me.m09.d23:meMA.Ode9C13.text	Ἡμῶν τῶν πίστει ἀνευφημούντων σε, μέμνησο νῦν Προφῆτα τοῦ Κυρίου καὶ Πρόδρομε, ψυχικῶν ἐκ παθῶν ἐκλυτρούμενος, σῴζων ἡμᾶς κινδύνων, καὶ πρὸς οὐράνιον τρίβον ὁδηγῶν, θεοπρεπῶς ἀειμακάριστε.
ltx/gr_gr_cog/me.m09.d23:meMA.Ode9C1T.incipit	Ἁγνὴν μητέρα σαφῶς ἐπέγνω σε…
ltx/gr_gr_cog/me.m09.d23:meMA.Ode9C1T.melody	@ltx/gr_gr_cog/he.h.m6:heHE.TheonAnthropois.name
ltx/gr_gr_cog/me.m09.d23:meMA.Ode9C1T.mode	@ltx/gr_gr_cog/miscellanea:misc.Mode6
ltx/gr_gr_cog/me.m09.d23:meMA.Ode9C1T.ode	@ltx/gr_gr_cog/miscellanea:misc.Ode9
ltx/gr_gr_cog/me.m09.d23:meMA.Ode9C1T.text	Ἁγνὴν μητέρα σαφῶς ἐπέγνω σε, στειρωτικῶν δεσμῶν ἡ Ἐλισάβετ ὡς ᾔσθετο, ἑαυτὴν λελυμένην καὶ φέρουσαν, Πρόδρομον τοῦ ἐν μήτρᾳ, σοῦ κατοικήσαντος, ἄχραντε Παρθένε, Μαριὰμ Θεοχαρίτωτε.
ltx/gr_gr_cog/me.m09.d23:meMA.Oikos1.text	Τὸ ἱερὸν Εὐαγγέλιον ἀναπτύξωμεν, ὁ Λουκᾶς ἡμῖν ἔγραψεν ὁ Ἱερὸς καὶ θαυμάσιος, καὶ τὴν τοῦ Προδρόμου θεασώμεθα σύλληψιν τὴν φαιδρὰν καὶ ἐπίσημον· φησὶ γάρ, ὡς εἰσῆλθεν ὁ πρεσβύτης καὶ δίκαιος Ζαχαρίας εἰς τὰ Ἅγια τῶν Ἁγίων τοῦ θυμιᾶσαι, τῷ τῆς ἐφημερίας καιρῷ, ἐπέστη αὐτῷ Γαβριήλ, εὐαγγελιζόμενος καὶ λέγων· Ἕξεις Ἱεράρχα υἱὸν ἐν τῷ γήρᾳ, Προφήτην τε καὶ Πρόδρομον, φωνήν τε καὶ κήρυκα, καὶ λύχνον ἀείφωτον, τὸν μύστην τῆς χάριτος.
ltx/gr_gr_cog/me.m09.d23:meVE.Apolytikion1.greekmelody	@ltx/gr_gr_cog/he.a.m4:heAU.TachyProkatalave.greekname
ltx/gr_gr_cog/me.m09.d23:meVE.Apolytikion1.incipit	Ἡ πρῴην οὐ τίκτουσα, στεῖρα…
ltx/gr_gr_cog/me.m09.d23:meVE.Apolytikion1.melody	@ltx/gr_gr_cog/he.a.m4:heAU.TachyProkatalave.name
ltx/gr_gr_cog/me.m09.d23:meVE.Apolytikion1.mode	@ltx/gr_gr_cog/miscellanea:misc.Mode4
ltx/gr_gr_cog/me.m09.d23:meVE.Apolytikion1.text	Ἡ πρῴην οὐ τίκτουσα, στεῖρα εὐφράνθητι· ἰδοὺ γὰρ συνέλαβες, Ἡλίου λύχνον σαφῶς, φωτίζειν τὸν μέλλοντα, πᾶσαν τὴν οἰκουμένην, ἀβλεψίαν νοσοῦσαν· χόρευε Ζαχαρία, ἐκβοῶν παῤῥησίᾳ· Προφήτης τοῦ Ὑψίστου ἐστίν, ὁ μέλλον τίκτεσθαι.
ltx/gr_gr_cog/me.m09.d23:meVE.AposGlory.incipit	@ltx/gr_gr_cog/me.m01.d07:meMA.LaudsGlory.incipit
ltx/gr_gr_cog/me.m09.d23:meVE.AposGlory.melody	
ltx/gr_gr_cog/me.m09.d23:meVE.AposGlory.mode	@ltx/gr_gr_cog/miscellanea:misc.Mode6
ltx/gr_gr_cog/me.m09.d23:meVE.AposGlory.text	@ltx/gr_gr_cog/me.m01.d07:meMA.LaudsGlory.text
ltx/gr_gr_cog/me.m09.d23:meVE.AposTheotokion.incipit	@ltx/gr_gr_cog/he.o:heOT.TheotokeSyEi.incipit
ltx/gr_gr_cog/me.m09.d23:meVE.AposTheotokion.melody	@ltx/gr_gr_cog/he.o:heOT.TheotokeSyEi.name
ltx/gr_gr_cog/me.m09.d23:meVE.AposTheotokion.mode	@ltx/gr_gr_cog/miscellanea:misc.Mode6
ltx/gr_gr_cog/me.m09.d23:meVE.AposTheotokion.text	@ltx/gr_gr_cog/he.o:heOT.TheotokeSyEiProdromou.text
ltx/gr_gr_cog/me.m09.d23:meVE.Aposticha1.greekmelody	@ltx/gr_gr_cog/he.a.m6:heAU.OlinApothemenoi.greekname
ltx/gr_gr_cog/me.m09.d23:meVE.Aposticha1.incipit	Μολοῦντι εἰς Ἅγια, τὰ τῶν…
ltx/gr_gr_cog/me.m09.d23:meVE.Aposticha1.melody	@ltx/gr_gr_cog/he.a.m6:heAU.OlinApothemenoi.name
ltx/gr_gr_cog/me.m09.d23:meVE.Aposticha1.mode	@ltx/gr_gr_cog/miscellanea:misc.Mode6
ltx/gr_gr_cog/me.m09.d23:meVE.Aposticha1.text	Μολοῦντι εἰς Ἅγια, τὰ τῶν Ἁγίων ἁγίως, ἱερεῖ Προφήτῃ τε, καὶ ἁγίῳ ἅγιος, καθὼς γέγραπται, ἐπιστὰς Ἄγγελος, προσεφώνει λέγων. Εἱσηκούσθη σοῦ ἡ δέησις, καὶ διαλύεται, νῦν τῆς Ἐλισάβετ ἡ στείρωσις, καὶ τέξεται πρεσβῦτά σοι, υἱὸν Ἰωάννην καὶ Πρόδρομον, λύχνον τοῦ Ἡλίου, προφήτην τοῦ Ὑψίστου καὶ φωνήν, τοῦ ἐκ Παρθένου θεόπαιδος, Λόγου ἀνατείλαντος.
ltx/gr_gr_cog/me.m09.d23:meVE.Aposticha2.incipit	Λέγε μοι τρανότατα, κατὰ τί…
ltx/gr_gr_cog/me.m09.d23:meVE.Aposticha2.melody	@ltx/gr_gr_cog/he.a.m6:heAU.OlinApothemenoi.name
ltx/gr_gr_cog/me.m09.d23:meVE.Aposticha2.mode	@ltx/gr_gr_cog/miscellanea:misc.Mode6
ltx/gr_gr_cog/me.m09.d23:meVE.Aposticha2.text	Λέγε μοι τρανότατα, κατὰ τί γνώσομαι τοῦτο; Αὖθις πρὸς τὸν Ἄγγελον, ὁ μακαριώτατος πρέσβυς ἔφησεν· ὡς ὁρᾷς πλήρης γάρ, ἡμερῶν ὑπάρχω, Ἐλισάβετ στεῖρα πέφυκε. Πῶς οὖν μοι ῥήματα, φθέγγῃ ὑπὲρ φύσιν, ἐξίσταμαι, οὐδόλως ἀληθεύοντα, νῦν ὑπονοῶ σε ὦ ἄνθρωπε. Ἄπιθι, ἐγὼ γάρ, λαοῦ τὴν σωτηρίαν ἐξαιτῶ, οὐχὶ δὲ παῖδα κομίσασθαι, πρᾶγμα δυσπαράδεκτον.
ltx/gr_gr_cog/me.m09.d23:meVE.Aposticha3.incipit	Θεοῦ Παντοκράτορος, ἐγὼ Ἀρχάγγελος πέλω…
ltx/gr_gr_cog/me.m09.d23:meVE.Aposticha3.melody	@ltx/gr_gr_cog/he.a.m6:heAU.OlinApothemenoi.name
ltx/gr_gr_cog/me.m09.d23:meVE.Aposticha3.mode	@ltx/gr_gr_cog/miscellanea:misc.Mode6
ltx/gr_gr_cog/me.m09.d23:meVE.Aposticha3.text	Θεοῦ Παντοκράτορος, ἐγὼ Ἀρχάγγελος πέλω, Γαβριήλ μοι ὄνομα, τῷ πρεσβύτῃ ἔφησεν ὁ Ἀσώματος, τὸ παρὸν κώφευσον, καὶ σιγὴν ἄσκησον, ἀπιστήσας ἐμοῖς ῥήμασιν. Ἐπὰν δὲ τέκῃ σοι, σάλπιγγα τοῦ Λόγου ἡ σύζυγος, τοῦ Πνεύματος τρανοῦντός σοι, γλῶτταν ἐκβοήσεις τρανότατα· Προφήτης Ὑψίστου, κληθήσῃ ὦ παιδίον τὰς αὐτοῦ, προετοίμασαι ἐν χάριτι, τρίβους ὡς ηὐδόκησεν.
ltx/gr_gr_cog/me.m09.d23:meVE.SticGlory.incipit	Ἐκ στειρευούσης σήμερον νηδύος, καρπὸς…
ltx/gr_gr_cog/me.m09.d23:meVE.SticGlory.melody	
ltx/gr_gr_cog/me.m09.d23:meVE.SticGlory.mode	@ltx/gr_gr_cog/miscellanea:misc.Mode6
ltx/gr_gr_cog/me.m09.d23:meVE.SticGlory.poet	@ltx/gr_gr_cog/poets:po.Vyzantiou
ltx/gr_gr_cog/me.m09.d23:meVE.SticGlory.text	Ἐκ στειρευούσης σήμερον νηδύος, καρπὸς προσευχῆς ἀνεβλάστησεν Ἰωάννης ὁ Πρόδρομος. Ἀγάλλου ἡ ἔρημος, καὶ χόρευε ἡ ἀνθρωπότης· ὁ τῆς μετανοίας κήρυξ, ἰδοὺ ἄρχεται, ἐν κοιλίᾳ μητρικῇ σαρκοῦσθαι. Δεῦτε ἀγαλλόμενοι ἐν τῇ ἐνδόξῳ αὐτοῦ συλλήψει, οἱ φιλέορτοι χορεύσωμεν βοῶντες· Ὁ ἐν γεννητοῖς γυναικῶν μείζων ὑπάρχων, μὴ διαλίπῃς πρεσβύειν, ὑπὲρ τῶν πίστει τιμώντων, τὴν θείαν σου σύλληψιν, ὅπως εὕρωμεν ἱλασμὸν ἁμαρτιῶν, καὶ τὸ μέγα ἔλεος.
ltx/gr_gr_cog/me.m09.d23:meVE.SticTheotokion.incipit	@ltx/gr_gr_cog/oc.m6.d1:ocVE.SticTheotokion.incipit
ltx/gr_gr_cog/me.m09.d23:meVE.SticTheotokion.melody	
ltx/gr_gr_cog/me.m09.d23:meVE.SticTheotokion.mode	@ltx/gr_gr_cog/miscellanea:misc.Mode6
ltx/gr_gr_cog/me.m09.d23:meVE.SticTheotokion.text	@ltx/gr_gr_cog/oc.m6.d1:ocVE.SticTheotokion.text
ltx/gr_gr_cog/me.m09.d23:meVE.Stichera01.greekmelody	@ltx/gr_gr_cog/he.a.m4:heAU.OExYpsistouKlitheis.greekname
ltx/gr_gr_cog/me.m09.d23:meVE.Stichera01.incipit	Ἱερατεύων ὁ θεῖος Ζαχαρίας, καὶ…
ltx/gr_gr_cog/me.m09.d23:meVE.Stichera01.melody	@ltx/gr_gr_cog/he.a.m4:heAU.OExYpsistouKlitheis.name
ltx/gr_gr_cog/me.m09.d23:meVE.Stichera01.mode	@ltx/gr_gr_cog/miscellanea:misc.Mode4
ltx/gr_gr_cog/me.m09.d23:meVE.Stichera01.text	Ἱερατεύων ὁ θεῖος Ζαχαρίας, καὶ ἔνδον γενόμενος, τοῦ θειοτάτου ναοῦ, καὶ τοῦ λαοῦ τὰ αἰτήματα, προσαναφέρων, τῷ εὐεργέτῃ καὶ πανοικτίρμονι, θειότατον Ἄγγελον, εἶδε βοῶντα αὐτῷ. Ἡ προσευχὴ καὶ ἡ δέησις, σοῦ εἱσηκούσθη, θάρσει πρεσβῦτα, καὶ μὴ ἀπίστει μοι· ἕξεις γὰρ παῖδα θεῖον Πρόδρομον, γεννητοῖς γυναικῶν ὑπερέχοντα, Ἡλίου ἐν δυνάμει, τοῦ Χριστοῦ προπορευσόμενον.
ltx/gr_gr_cog/me.m09.d23:meVE.Stichera02.incipit	Ξένος μοι φαίνῃ τῇ θέᾳ…
ltx/gr_gr_cog/me.m09.d23:meVE.Stichera02.melody	@ltx/gr_gr_cog/he.a.m4:heAU.OExYpsistouKlitheis.name
ltx/gr_gr_cog/me.m09.d23:meVE.Stichera02.mode	@ltx/gr_gr_cog/miscellanea:misc.Mode4
ltx/gr_gr_cog/me.m09.d23:meVE.Stichera02.text	Ξένος μοι φαίνῃ τῇ θέᾳ καὶ τῷ τρόπῳ, ξένος καὶ τοῖς ῥήμασι, καὶ τοῖς μηνύμασιν, ὁ Ζαχαρίας ἀντέφησεν· ἐγὼ γὰρ ἦλθον, τὴν σωτηρίαν λαοῦ αἰτήσασθαι, οὐχὶ δὲ κομίσασθαι, παῖδα ὡς προσφωνεῖς, ἀπʼ ἐναντίας εὑρίσκω σε, τῶν αἰτημάτων, καὶ ὑποπτεύω μὴ ἀληθεύειν σε· πῶς γὰρ ὃ λέγεις πιστωθήσεται; Ἐλισάβετ τὰ μέλη νενέκρωται, καὶ ἐμοῦ δὲ τὸ γῆρας, δυσπιστίαν νῦν τεκμαίρεται.
ltx/gr_gr_cog/me.m09.d23:meVE.Stichera03.incipit	Τί ἀπιστεῖς μου τοῖς λόγοις…
ltx/gr_gr_cog/me.m09.d23:meVE.Stichera03.melody	@ltx/gr_gr_cog/he.a.m4:heAU.OExYpsistouKlitheis.name
ltx/gr_gr_cog/me.m09.d23:meVE.Stichera03.mode	@ltx/gr_gr_cog/miscellanea:misc.Mode4
ltx/gr_gr_cog/me.m09.d23:meVE.Stichera03.text	Τί ἀπιστεῖς μου τοῖς λόγοις Ζαχαρία, ψευδῆ εὐαγγέλια, λέγων κομίζειν με; Θεοῦ Ἀρχάγγελος πέφυκα, ἃ προσετάχθην, ταῦτα σοι λέγω σὺν σοὶ ἱστάμενος, ἐπεὶ δὲ ἠπίστησας, καὶ οὐκ ἐπίστευσας, ἔσῃ κωφεύων καὶ ἄλαλος, ἕως ἂν ἴδῃς, ἐμῶν ῥημάτων τὴν θείαν ἔκβασιν. Ἐπὰν δὲ τέκῃ Ἐλισάβετ σοι, τὴν τοῦ Λόγου φωνὴν μέγαν Πρόδρομον, τρανουμένης τῆς γλώττης, εὐλογήσεις τὸν Θεὸν Ἰσραήλ.
