ltx/gr_gr_cog/le.ep.me.m01.d10:lemeLI.Epistle.book_abbr	@ltx/gr_gr_cog/le.ep.me.m01.dSunAE:lemeLI.Epistle.book_abbr
ltx/gr_gr_cog/le.ep.me.m01.d10:lemeLI.Epistle.book_string	@ltx/gr_gr_cog/le.ep.me.m01.dSunAE:lemeLI.Epistle.book_string
ltx/gr_gr_cog/le.ep.me.m01.d10:lemeLI.Epistle.chapverse	@ltx/gr_gr_cog/le.ep.me.m01.dSunAE:lemeLI.Epistle.chapverse
ltx/gr_gr_cog/le.ep.me.m01.d10:lemeLI.Epistle.incipit	@ltx/gr_gr_cog/le.ep.me.m01.dSunAE:lemeLI.Epistle.incipit
ltx/gr_gr_cog/le.ep.me.m01.d10:lemeLI.Epistle.text	@ltx/gr_gr_cog/le.ep.me.m01.dSunAE:lemeLI.Epistle.text
ltx/gr_gr_cog/le.ep.me.m01.d10:lemeLI.Epistle.title	Τοῦ Ἁγίου
ltx/gr_gr_cog/le.ep.me.m01.d10:lemeLI.Epistle.title_abbr	Τοῦ Ἁγίου
ltx/gr_gr_cog/le.ep.me.m01.d10:lemeLI.Epistle.version	@ltx/gr_gr_cog/le.ep.me.m01.dSunAE:lemeLI.Epistle.version
