ltx/gr_gr_cog/le.ep.me.m08.d27:lemeLI.Epistle.book_abbr	@ltx/gr_gr_cog/le.ep.mc.d308:lemcLI.Epistle.book_abbr
ltx/gr_gr_cog/le.ep.me.m08.d27:lemeLI.Epistle.book_string	@ltx/gr_gr_cog/le.ep.mc.d308:lemcLI.Epistle.book_string
ltx/gr_gr_cog/le.ep.me.m08.d27:lemeLI.Epistle.chapverse	@ltx/gr_gr_cog/le.ep.mc.d308:lemcLI.Epistle.chapverse
ltx/gr_gr_cog/le.ep.me.m08.d27:lemeLI.Epistle.incipit	@ltx/gr_gr_cog/le.ep.mc.d308:lemcLI.Epistle.incipit
ltx/gr_gr_cog/le.ep.me.m08.d27:lemeLI.Epistle.text	@ltx/gr_gr_cog/le.ep.mc.d308:lemcLI.Epistle.text
ltx/gr_gr_cog/le.ep.me.m08.d27:lemeLI.Epistle.title	Τοῦ Ἁγίου Ποιμένου
ltx/gr_gr_cog/le.ep.me.m08.d27:lemeLI.Epistle.title_abbr	Τοῦ Ἁγίου Ποιμένου
ltx/gr_gr_cog/le.ep.me.m08.d27:lemeLI.Epistle.version	@ltx/gr_gr_cog/le.ep.mc.d308:lemcLI.Epistle.version
ltx/gr_gr_cog/le.ep.me.m08.d27:lemeLI.Epistle2.book_abbr	@ltx/gr_gr_cog/le.ep.mc.d309:lemcLI.Epistle.book_abbr
ltx/gr_gr_cog/le.ep.me.m08.d27:lemeLI.Epistle2.book_string	@ltx/gr_gr_cog/le.ep.mc.d309:lemcLI.Epistle.book_string
ltx/gr_gr_cog/le.ep.me.m08.d27:lemeLI.Epistle2.chapverse	@ltx/gr_gr_cog/le.ep.mc.d309:lemcLI.Epistle.chapverse
ltx/gr_gr_cog/le.ep.me.m08.d27:lemeLI.Epistle2.incipit	@ltx/gr_gr_cog/le.ep.mc.d309:lemcLI.Epistle.incipit
ltx/gr_gr_cog/le.ep.me.m08.d27:lemeLI.Epistle2.text	@ltx/gr_gr_cog/le.ep.mc.d309:lemcLI.Epistle.text
ltx/gr_gr_cog/le.ep.me.m08.d27:lemeLI.Epistle2.title	Τοῦ Ἁγίου Φανουρίου.
ltx/gr_gr_cog/le.ep.me.m08.d27:lemeLI.Epistle2.title_abbr	Τοῦ Ἁγίου Φανουρίου
ltx/gr_gr_cog/le.ep.me.m08.d27:lemeLI.Epistle2.version	@ltx/gr_gr_cog/le.ep.mc.d309:lemcLI.Epistle.version
