ltx/gr_gr_cog/sy.m03.d11:cl.syMA.commemoration01.text	[saint/com 1]
ltx/gr_gr_cog/sy.m03.d11:cl.syMA.commemoration02.text	[saint/com 2]
ltx/gr_gr_cog/sy.m03.d11:cl.syMA.commemoration03.text	[saint/com 3]
ltx/gr_gr_cog/sy.m03.d11:cl.syMA.commemoration04.text	[saint/com 4]
ltx/gr_gr_cog/sy.m03.d11:cl.syMA.commemoration05.text	[saint/com 5]
ltx/gr_gr_cog/sy.m03.d11:cl.syMA.commemoration06.text	[saint/com list]
ltx/gr_gr_cog/sy.m03.d11:syMA.commemoration01.couplet1.title	@ltx/gr_gr_cog/titles:ti.Verses
ltx/gr_gr_cog/sy.m03.d11:syMA.commemoration01.couplet1.verse1	Ἔσπευδε τηρεῖν καὶ κεραίαν τοῦ νόμου,
ltx/gr_gr_cog/sy.m03.d11:syMA.commemoration01.couplet1.verse2	Ὁ Σωφρόνιος οὗ παρʼ οὐρανοῖς κέρας.
ltx/gr_gr_cog/sy.m03.d11:syMA.commemoration01.narration.p01	Οὗτος ὁ μέγιστος τῆς Ἐκκλησίας φωστὴρ χώρας μὲν ἔφυ Φοινίκης Λιβανοστεφάνου, πόλεως δὲ Δαμασκοῦ, εὐσεβῶν καὶ ὁμοφρόνων γονέων τέκνον, πατρὸς μὲν καλουμένου Πλινθᾶ, μητρὸς δὲ Μυροῦς· ἐντεῦθεν εὐφυΐᾳ φύσεως τὴν ἐπιμέλειαν κερασάμενος, ὑπερφυῶς ἐπιστημῶν ἁπασῶν τὸ κράτος ἀνεδήσατο. Ἔτι δὲ τὴν Δαμασκὸν οἰκῶν, πᾶσαν ἀρετήν, τὴν ἐν ταῖς ἐρήμοις πραττομένην, μετήρχετο. Ἔπειτα τὴν μάνδραν τοῦ μεγάλου Θεοδοσίου καταλαμβάνει· ἐν ᾗ σχολάζων, καὶ τῷ Θεῷ ἐν ἡσυχίᾳ συγγινόμενος, τῇ τῶν θείων Γραφῶν μελέτῃ τὴν καρδίαν καὶ τὸν νοῦν κατωχύρωσε, πᾶν νόημα αἰχμαλωτίσας εἰς τὴν ὑπακοὴν τοῦ Χριστοῦ. Ἔπειτα περισσοτέρας γλιχόμενος παιδείας καὶ φιλοσοφίας, ἐπὶ τὴν Ἀλεξάνδρου μεγαλόπολιν ἀποπλεῖ· καὶ Ἰωάννῃ, ἀξιολόγῳ τινὶ περιτυχὼν ἀνδρί, πάσης σοφίας καὶ συνέσεως πεπληρωμένῳ, τούτῳ γίνεται σύσκηνος καὶ ὁμοῤῥόφιος, ὁμοδίαιτος καὶ ὁμογνώμων, τὰ παρʼ ἐκείνου λαμβάνων, καὶ μεταδιδοὺς τὰ σφέτερα. Ἔνθα τοὺς ὀφθαλμοὺς ἐπίχυσιν παθών, ὑπὸ τῶν Ἁγίων Κύρου καὶ Ἰωάννου θεραπεύεται, καὶ τῆς ἰατρείας ἀπαιτεῖται μισθόν, τὰ καθʼ ἑκάστην παρʼ αὐτῶν τελούμενα θαύματα γραφῇ παραδοῦναι. Καὶ μέν τοι καὶ παρέδωκεν.
ltx/gr_gr_cog/sy.m03.d11:syMA.commemoration01.narration.p02	Ἔπειτα Ἐπίσκοπος Ἱεροσολύμων, διὰ τὸ ὑπερανεστηκὸς τοῦ βίου καθίσταται· καὶ τῆς Ἁγίας Πόλεως Ἱερουσαλὴμ ὑπὸ τῶν ἀλιτηρίων Περσῶν ἁλούσης, εἰς Ἀλεξάνδρειαν πρὸς τὸν μέγαν Ἰωάννην τὸν Ἐλεήμονα παραγίνεται, τηνικαῦτα τὸν Ἀποστολικὸν ἐκεῖνον θρόνον ἰθύνοντα· οὗ πρὸς τὴν μακαρίαν λῆξιν ἀπάραντος, τὸν ἄπειρον αὐτοῦ τῆς Ἐλεημοσύνης θησαυρόν, καὶ τοῦ βίου τὸ ὑψηλόν, διὰ τοῦ ἐγκωμιαστικοῦ λόγου ἀνεδίδαξε, πολλὰ καὶ αὐτὸς τὸν μακάριον ἐκεῖνον θρηνήσας.
ltx/gr_gr_cog/sy.m03.d11:syMA.commemoration01.narration.p03	Ἐπεὶ δὲ αὗθις πρὸς τὴν Ἁγίαν Πόλιν ὑπέστρεψεν, οὐκ ἔστιν εἰπεῖν μεθʼ ὅσης φροντίδος καὶ πόνου τὴν λαχοῦσαν αὐτῷ Ἐκκλησίαν ἐποίμανεν· οὐδαμῶς γὰρ δέδωκεν ὕπνον τοῖς ὀφθαλμοῖς αὑτοῦ, οὐδὲ τοῖς βλεφάροις νυσταγμόν· οὐδὲ γὰρ κατὰ δαιμόνων ἦν αὐτοῦ ἡ πάλη μόνον, ἀλλὰ καὶ κατὰ τῶν αἱρετιζόντων, οὓς Γραφικαῖς ἀποδείξεσι, καὶ Πατρικαῖς παραδόσεσιν ἀνατρέπων, καὶ μέντοι καὶ οἰκείαις διδασκαλίαις, φρούδους ἀπετέλει. Καὶ ἄλλα δὲ πλεῖστα λόγου καὶ μνήμης ἄξια συγγράμματα, τῇ Ἐκκλησίᾳ καταλέλοιπε, βιοῦν ὀρθῶς ἐκδιδάσκοντα, καὶ κατὰ τὸ Θεῷ δοκοῦν πολιτεύεσθαι· ὧν ἐστι τὸ ὑπερθαύμαστον διήγημα τῆς ἐν γυναιξὶν ἰσαγγέλου Μαρίας τῆς Αἰγυπτίας, τῆς ὑπὲρ ἀνθρωπίνην φύσιν ἐρημικοὺς ἀγωνισαμένης ἀγῶνας. Οὕτω καλῶς καὶ θεοφιλῶς αὐτὸς βιώσας, καὶ ἄλλους ἐκδιδάξας, καὶ στόμα Χριστοῦ χρηματίσας, καὶ ὁσίως τὸ δοθὲν αὐτῷ ποίμνιον ἰθύνας, ἐν χρόνοις τρισίν, ἐν εἰρήνῃ πρὸς τὸν Θεὸν μεθίσταται.
ltx/gr_gr_cog/sy.m03.d11:syMA.commemoration01.single1	Ἑνδεκάτῃ σαόφρων ἔδυ Σωφρόνιος παρὰ τύμβον.
ltx/gr_gr_cog/sy.m03.d11:syMA.commemoration01.text	Τῇ ΙΑʹ τοῦ αὐτοῦ μηνός, μνήμη τοῦ Ὁσίου Πατρὸς ἡμῶν Σωφρονίου, Ἀρχιεπισκόπου Ἱεροσολύμων.
ltx/gr_gr_cog/sy.m03.d11:syMA.commemoration02.couplet1.title	@ltx/gr_gr_cog/titles:ti.Verses
ltx/gr_gr_cog/sy.m03.d11:syMA.commemoration02.couplet1.verse1	Ὡς ἐγκρυφίας ἄρτος ἐξωπτημένος,
ltx/gr_gr_cog/sy.m03.d11:syMA.commemoration02.couplet1.verse2	Καυθείς, προσήχθη Πιόνιος Κυρίῳ.
ltx/gr_gr_cog/sy.m03.d11:syMA.commemoration02.narration.p01	Οὗτος ἦν τῆς ἐν τῇ Σμύρνῃ Ἁγίας τοῦ Θεοῦ Ἐκκλησίας Πρεσβύτερος, κατὰ τοὺς καιροὺς Δεκίου τοῦ Βασιλέως· συνελήφθη δὲ μετὰ καὶ ἑτέρων. Καὶ πρῶτον μὲν ἄγεται παρὰ Πολέμονα τὸν Νεωκόρον, πρὸς ὃν διηνέχθη περὶ τῆς θρησκείας, Γραφικαῖς ἀποδείξεσι καὶ ἱστορικαῖς, καὶ πιστοῦται παρὰ τῶν ἤδη γεγονότων τὰ ἐσόμενα, καὶ ὅτι ὁ Θεὸς διὰ πυρὸς δοκιμάζειν μέλλει τὰ τῶν ἀνθρώπων ἔργα· καὶ παρατίθησιν εἰς πίστιν τὰς πυρίνους σταγόνας, αἶς τὴν Σοδόμων γῆν ἀπετέφρωσε, καὶ τὰς πολλαχοῦ τοῦ πυρὸς ἀναβλύσεις. Εἶτα παρʼ Ἐλπίδιον τὸν Ἄρχοντα, συνεδρεύσαντα τῷ Νεωκόρῳ, ὁ Ἅγιος ἄγεται· ὕστερον δὲ παρὰ Κυντιλιανῷ, τῷ Ἀνθυπάτῳ γενόμενος, τὴν διὰ πυρὸς λαμβάνει τελείωσιν. Τελεῖται δὲ ἡ αὐτοῦ Σύναξις ἐν τῇ Λιθοστρώτῳ.
ltx/gr_gr_cog/sy.m03.d11:syMA.commemoration02.text	Τῇ αὐτῇ ἡμέρᾳ, μνήμη τοῦ Ἁγίου Ἱερομάρτυρος Πιονίου, Πρεσβυτέρου τῆς ἐν Σμύρνῃ Ἁγίας Ἐκκλησίας.
ltx/gr_gr_cog/sy.m03.d11:syMA.commemoration03.couplet1.title	@ltx/gr_gr_cog/titles:ti.Verses
ltx/gr_gr_cog/sy.m03.d11:syMA.commemoration03.couplet1.verse1	Ἐκ γειτόνων εἶ, Γεώργιε, κἀνθάδε,
ltx/gr_gr_cog/sy.m03.d11:syMA.commemoration03.couplet1.verse2	Κἀκεῖθεν, οἶμαι, Χριστομύστῃ Παρθένῳ,
ltx/gr_gr_cog/sy.m03.d11:syMA.commemoration03.narration.p01	Οὗτος, καταλιπὼν γυναῖκα καὶ τέκνα καὶ συγγενεῖς, τὴν στενὴν ὁδὸν εἵλετο· καὶ ὑπελθὼν τὸν ζυγὸν τοῦ Κυρίου τὸν ἐλαφρότατον, διήρχετο πόλεις καὶ χώρας, καὶ αὐτὴν τὴν ἔρημον, ὑστερούμενος, θλιβόμενος, κακουχούμενος. Ὅθεν, γνωσθείσης αὐτῷ θεόθεν τῆς ἀναλύσεως, κατέλαβε τὴν Κωνσταντινούπολιν· καὶ ἐλθὼν ἐν τῷ πανσέπτῳ Ναῷ τοῦ Ἁγίου Ἰωάννου τοῦ Θεολόγου, ἐν τῷ Διϊππείῳ, ἀνεπαύσατο ἐν Κυρίῳ, ἑπτὰ ἡμέρας διαρκέσας αὐτόθι. Ἐπεὶ δὲ παρῆσαν οἱ ἐνταφιάζειν αὐτὸν μέλλοντες, καὶ τὸν περικείμενον αὐτοῦ τῷ σώματι σίδηρον, πολυτάλαντον ὄντα εἶδον, καὶ ἅπαν τὸ σῶμα προσηλωμένον αὐτῷ, τό· Κύριε ἐλέησον, ἔκραζον. Διὸ καὶ τῇ ἐκ μαρμάρου κατασκευασθείσῃ θήκῃ τῷ εἰρημένῳ Ναῷ κατατίθεται πολλῶν θαυμάτων ἰάσεις προχέων τοῖς μετὰ πίστεως προσερχομένοις· ὧν ἔνιοι τῶν ἀπολελαυκότων τῆς αὐτοῦ ἐπικουρίας, ἔτι καὶ νῦν πᾶσι διαμαρτύρονται τὰς εἰς αὐτοὺς γενομένας θαυματοποιΐας.
ltx/gr_gr_cog/sy.m03.d11:syMA.commemoration03.single1	πρὸς οὐρανοὺς ἀπῆλθε μετʼ Ἀγγέλων.
ltx/gr_gr_cog/sy.m03.d11:syMA.commemoration03.text	Τῇ αὐτῇ ἡμέρᾳ, μνήμη τοῦ Ὁσίου Πατρὸς ἡμῶν Γεωργίου, Θεοφόρου καὶ Θαυματουργοῦ, τοῦ ἐν τῷ Διϊππείῷ λεγομένῳ, τοῦ Νεοφανοῦς.
ltx/gr_gr_cog/sy.m03.d11:syMA.commemoration04.couplet1.title	@ltx/gr_gr_cog/titles:ti.Verses
ltx/gr_gr_cog/sy.m03.d11:syMA.commemoration04.couplet1.verse1	Θάλλουσαν εὗρον ἐν πόλῳ τροφὴν ξένην,
ltx/gr_gr_cog/sy.m03.d11:syMA.commemoration04.couplet1.verse2	Θαλλός τε καὶ Τρόφιμος ἀθληταὶ δύο.
ltx/gr_gr_cog/sy.m03.d11:syMA.commemoration04.narration.p01	Ἐν ταῖς ἡμέραις Διοκλητιανοῦ καὶ Μαξιμιανοῦ τῶν Βασιλέων, ἡγεμονεύοντος Ἀσκληπιοῦ ἐν Λαοδικείᾳ, διωγμὸς γέγονε κατὰ τῶν Χριστιανῶν· καὶ κρατηθέντες οἱ Ἅγιοι Μάρτυρες Τρόφιμος καὶ Θαλλὸς διὰ τὴν εἰς Χριστὸν ὁμολογίαν, ἐλιθοβολήθησαν ἐπὶ ὥρας ἱκανάς· τοῦ δὲ Θεοῦ περιφρουροῦντος αὐτούς, ἔμειναν ἀβλαβεῖς. Τοῦτο θεασάμενος ὁ Ἄρχων καὶ οἱ σὺν αὐτῷ, αἰδεσθέντες, εἴασαν αὐτοὺς πρὸς μικρὸν διάγειν ἀτιμωρήτους· καὶ πάλιν διαβληθέντες, παρέστησαν τῷ Κριτηρίῳ· καὶ τὸν Χριστὸν μετὰ παῤῥησίας Θεὸν εἶναι ἀληθινὸν ἐνώπιον πάντων ὁμολογήσαντες, τὰ δὲ εἴδωλα κωμῳδήσαντες, καὶ τοὺς Τυράννους ἐλέγξαντες, εἰς ὀργὴν αὐτοὺς ἐκίνησαν. Διὸ καὶ γυμνοὺς ἐπὶ ξύλου κρεμάσαντες, τὰς σάρκας αὐτῶν εὐτόνως κατέξεσαν· οἱ δὲ Ἅγιοι προσευχόμενοι, καὶ τοὺς Ἕλληνας μυκτηρίζοντες, ἐξέμηναν αὐτὸν τὸν Ἄρχοντα. Διὸ καὶ ψηφισάμενος μετὰ ταῦτα, ἐν σταυρῷ κρεμασθῆναι αὐτοὺς προσέταξεν.
ltx/gr_gr_cog/sy.m03.d11:syMA.commemoration04.narration.p02	Ἀπερχομένων δὲ αὐτῶν ἐπὶ τὸν προκείμενον τόπον, πολὺ πλῆθος λαοῦ ἠκολούθησεν αὐτοῖς· καὶ σταυρωθέντες προσηύχοντο, καὶ ὡμίλουν τῷ λαῷ τὰ εἰς ψυχὴν συντείνοντα. Οἱ δὲ λαοὶ ἔσπευδον προσψαῦσαι τοῖς ἱεροῖς τῶν Ἁγίων σώμασιν, οἱ μὲν σταγόνας αἱμάτων, οἱ δὲ σουδάρια, ἄλλοι δακτυλίους, καὶ ἕτερα δή τινα εἴδη ἐλάμβανον, εὐλογίας χάριν, καὶ εἰς ἀποτροπὴν παντὸς ἐναντίου. Τότε οἱ Ἅγιοι, εὐλογήσαντες καὶ προπέμψαντες πάντας, τὰς ἁγίας αὑτῶν ψυχὰς τῷ Θεῷ παρέθεντο. Τινὲς δὲ τῶν εὐσεβῶν, τὰ τῶν Ἁγίων λαβόντες λείψανα, μύροις ἀλείψαντες, καὶ ὀθονίοις εἰλήσαντες, κατέθεντο ἐν τῷ Ναῷ· καὶ προσελθοῦσα τοῦ Ἄρχοντος, Ἀσκληπιοῦ ἡ γυνή, καὶ μυρίσασα τὴν τῶν Ἁγίων Μαρτύρων θήκην, ὀθόνην πολλοῦ ἀξίαν ἄνωθεν τῆς θήκης ἐφήπλωσεν. Ὕστερον δέ τις Ζώσιμος, καὶ Ἀρτέμιος, ἄνδρες εὐλαβεῖς καὶ πιστοί, τῶν Ἁγίων συμπολῖται ὄντες, τὴν τῶν λειψάνων θήκην ἀναλαβόντες, καὶ εἰς τὴν αὐτῶν πόλιν κομισάμενοι, Στρατονίκην, καλουμένην, πρὸ μιλίου ἑνὸς ἐν τοῖς Λατομίοις κατέθεντο.
ltx/gr_gr_cog/sy.m03.d11:syMA.commemoration04.text	Τῇ αὐτῇ ἡμέρᾳ, μνήμη τῶν Ἁγίων Μαρτύρων Τροφίμου καὶ Θαλλοῦ, τῶν ἐν Λαοδικείᾳ μαρτυρησάντων.
ltx/gr_gr_cog/sy.m03.d11:syMA.commemoration05.couplet1.title	@ltx/gr_gr_cog/titles:ti.Verses
ltx/gr_gr_cog/sy.m03.d11:syMA.commemoration05.couplet1.verse1	Κομίζεται σοι ὄλβος, ὀλβία Πόλις,
ltx/gr_gr_cog/sy.m03.d11:syMA.commemoration05.couplet1.verse2	Ἐπιμάχου τὸ σῶμα τοῦ τρισολβίου.
ltx/gr_gr_cog/sy.m03.d11:syMA.commemoration05.text	Τῇ αὐτῇ ἡμέρᾳ, ἡ εἰς Κωνσταντινούπολιν ἀνακομιδὴ τῶν Λειψάνων τοῦ Ἁγίου Μάρτυρος Ἐπιμάχου.
ltx/gr_gr_cog/sy.m03.d11:syMA.commemoration06.couplet1.title	@ltx/gr_gr_cog/titles:ti.Verses
ltx/gr_gr_cog/sy.m03.d11:syMA.commemoration06.couplet1.verse1	Κἂν σοῦ, Βασιλίς, κρύπτει τὸ σῶμα τάφος,
ltx/gr_gr_cog/sy.m03.d11:syMA.commemoration06.couplet1.verse2	Χριστὸς πᾶσι φαίνει σε θαυματουργίαις.
ltx/gr_gr_cog/sy.m03.d11:syMA.commemoration06.text	Τῇ αὐτῇ ἡμέρᾳ, μνήμη τῆς Ὁσίας Μητρὸς ἡμῶν Θεοδώρας τῆς Βασιλίσσης.
ltx/gr_gr_cog/sy.m03.d11:syMA.lastline	Ταῖς αὐτῶν ἁγίαις πρεσβείαις, ὁ Θεὸς ἐλέησον ἡμᾶς. Ἀμήν.
