ltx/gr_gr_cog/le.go.mc.d083:lemcLI.Gospel.book_abbr	@ltx/gr_gr_cog/bible:John.abbr
ltx/gr_gr_cog/le.go.mc.d083:lemcLI.Gospel.book_string	@ltx/gr_gr_cog/bible:John.text
ltx/gr_gr_cog/le.go.mc.d083:lemcLI.Gospel.chapverse	5:30 – 6:2
ltx/gr_gr_cog/le.go.mc.d083:lemcLI.Gospel.incipit	Καθὼς ἀκούω κρίνω…
ltx/gr_gr_cog/le.go.mc.d083:lemcLI.Gospel.text	Εἶπεν ὁ Κύριος πρὸς τοὺς ἐληλυθότας πρὸς αὐτὸν Ἰουδαίους· Καθὼς ἀκούω κρίνω, καὶ ἡ κρίσις ἡ ἐμὴ δικαία ἐστίν· ὅτι οὐ ζητῶ τὸ θέλημα τὸ ἐμόν, ἀλλὰ τὸ θέλημα τοῦ πέμψαντός με πατρός. Ἐὰν ἐγὼ μαρτυρῶ περὶ ἐμαυτοῦ, ἡ μαρτυρία μου οὐκ ἔστιν ἀληθής. ἄλλος ἐστὶν ὁ μαρτυρῶν περὶ ἐμοῦ, καὶ οἶδα ὅτι ἀληθής ἐστιν ἡ μαρτυρία ἣν μαρτυρεῖ περὶ ἐμοῦ. ὑμεῖς ἀπεστάλκατε πρὸς Ἰωάννην, καὶ μεμαρτύρηκε τῇ ἀληθείᾳ· ἐγὼ δὲ οὐ παρὰ ἀνθρώπου τὴν μαρτυρίαν λαμβάνω, ἀλλὰ ταῦτα λέγω ἵνα ὑμεῖς σωθῆτε. ἐκεῖνος ἦν ὁ λύχνος ὁ καιόμενος καὶ φαίνων, ὑμεῖς δὲ ἠθελήσατε ἀγαλλιαθῆναι πρὸς ὥραν ἐν τῷ φωτὶ αὐτοῦ. ἐγὼ δέ ἔχω τὴν μαρτυρίαν μείζω τοῦ Ἰωάννου· τὰ γὰρ ἔργα ἃ ἔδωκέ μοι ὁ πατὴρ ἵνα τελειώσω αὐτά, αὐτὰ τὰ ἔργα ἃ ἐγὼ ποιῶ, μαρτυρεῖ περὶ ἐμοῦ ὅτι ὁ πατήρ με ἀπέσταλκε. καὶ ὁ πέμψας με πατήρ, αὐτὸς μεμαρτύρηκε περὶ ἐμοῦ. οὔτε φωνὴν αὐτοῦ ἀκηκόατε πώποτε οὔτε εἶδος αὐτοῦ ἑωράκατε, καὶ τὸν λόγον αὐτοῦ οὐκ ἔχετε μένοντα ἐν ὑμῖν, ὅτι ὃν ἀπέστειλεν ἐκεῖνος, τούτῳ ὑμεῖς οὐ πιστεύετε. ἐρευνᾶτε τὰς γραφάς, ὅτι ὑμεῖς δοκεῖτε ἐν αὐταῖς ζωὴν αἰώνιον ἔχειν· καὶ ἐκεῖναί εἰσιν αἱ μαρτυροῦσαι περὶ ἐμοῦ· καὶ οὐ θέλετε ἐλθεῖν πρός με ἵνα ζωὴν ἔχητε. δόξαν παρὰ ἀνθρώπων οὐ λαμβάνω· ἀλλ᾽ ἔγνωκα ὑμᾶς ὅτι τὴν ἀγάπην τοῦ Θεοῦ οὐκ ἔχετε ἐν ἑαυτοῖς. ἐγὼ ἐλήλυθα ἐν τῷ ὀνόματι τοῦ πατρός μου, καὶ οὐ λαμβάνετέ με· ἐὰν ἄλλος ἔλθῃ ἐν τῷ ὀνόματι τῷ ἰδίῳ, ἐκεῖνον λήψεσθε. πῶς δύνασθε ὑμεῖς πιστεῦσαι, δόξαν παρὰ ἀλλήλων λαμβάνοντες, καὶ τὴν δόξαν τὴν παρὰ τοῦ μόνου Θεοῦ οὐ ζητεῖτε; μὴ δοκεῖτε ὅτι ἐγὼ κατηγορήσω ὑμῶν πρὸς τὸν πατέρα· ἔστιν ὁ κατηγορῶν ὑμῶν Μωϋσῆς, εἰς ὃν ὑμεῖς ἠλπίκατε. εἰ γὰρ ἐπιστεύετε Μωϋσεῖ, ἐπιστεύετε ἂν ἐμοί· περὶ γὰρ ἐμοῦ ἐκεῖνος ἔγραψεν. εἰ δὲ τοῖς ἐκείνου γράμμασιν οὐ πιστεύετε, πῶς τοῖς ἐμοῖς ῥήμασι πιστεύσετε; Μετὰ ταῦτα ἀπῆλθεν ὁ Ἰησοῦς πέραν τῆς θαλάσσης τῆς Γαλιλαίας τῆς Τιβεριάδος· καὶ ἠκολούθει αὐτῷ ὄχλος πολύς, ὅτι ἑώρων αὐτοῦ τὰ σημεῖα ἃ ἐποίει ἐπὶ τῶν ἀσθενούντων.
ltx/gr_gr_cog/le.go.mc.d083:lemcLI.Gospel.title	Τῇ Παρασκευῇ τῆς Βʹ Ἑβδομάδος
ltx/gr_gr_cog/le.go.mc.d083:lemcLI.Gospel.title_abbr	Παρασκευῇ τῆς Βʹ Ἑβδομάδος
ltx/gr_gr_cog/le.go.mc.d083:lemcLI.Gospel.version	@ltx/gr_gr_cog/properties:version.designation
