ltx/gr_gr_cog/sy.m09.d16:cl.syMA.commemoration01.text	[saint/com 1]
ltx/gr_gr_cog/sy.m09.d16:cl.syMA.commemoration02.text	[saint/com 2]
ltx/gr_gr_cog/sy.m09.d16:cl.syMA.commemoration03.text	[saint/com 3]
ltx/gr_gr_cog/sy.m09.d16:cl.syMA.commemoration04.text	[saint/com 4]
ltx/gr_gr_cog/sy.m09.d16:cl.syMA.commemoration05.text	[saint/com 5]
ltx/gr_gr_cog/sy.m09.d16:cl.syMA.commemoration06.text	[saint/com list]
ltx/gr_gr_cog/sy.m09.d16:syMA.commemoration01.couplet1.title	@ltx/gr_gr_cog/titles:ti.Verses
ltx/gr_gr_cog/sy.m09.d16:syMA.commemoration01.couplet1.verse1	Ὑπὲρ Θεοῦ κτανθεῖσαν ἄρκτου ταῖς μύλαις,
ltx/gr_gr_cog/sy.m09.d16:syMA.commemoration01.couplet1.verse2	Εὐφημίαις σε χρὴ στέφειν, Εὐφημία.
ltx/gr_gr_cog/sy.m09.d16:syMA.commemoration01.narration.p01	Αὕτη ὑπῆρχε κατὰ τοὺς χρόνους Διοκλητιανοῦ· διὰ δὲ τὴν εἰς Χριστὸν ὁμολογίαν κατασχεθεῖσα καὶ πυρὶ καὶ τροχοῖς προσπαλαίσασα, ἔτι δὲ καὶ μηχαναῖς ἑτέρων κολάσεων, καὶ βορὰ λέουσι προτεθεῖσα καὶ ἐκ πάντων Χριστοῦ χάριτι διαμείνασα ἀλώβητος, ἐν αὐτῷ τῷ θεάτρῳ τὴν ψυχὴν παρέδωκε τῷ Κυρίῳ.
ltx/gr_gr_cog/sy.m09.d16:syMA.commemoration01.single1	Τῇ ἑκκαιδεκάτῃ Εὐφημίαν ἔκτανεν ἄρκτος.
ltx/gr_gr_cog/sy.m09.d16:syMA.commemoration01.text	Τῇ ΙϚʹ τοῦ αὐτοῦ μηνός μνήμη τῆς ἁγίας Μεγαλομάρτυρος καὶ πανευφήμου Εὐφημίας.
ltx/gr_gr_cog/sy.m09.d16:syMA.commemoration02.couplet1.title	@ltx/gr_gr_cog/titles:ti.Verses
ltx/gr_gr_cog/sy.m09.d16:syMA.commemoration02.couplet1.verse1	Μελιτινή, τμηθεῖσα τὴν κάραν ξίφει,
ltx/gr_gr_cog/sy.m09.d16:syMA.commemoration02.couplet1.verse2	Αἷμα προσῆγεν ὡς γλυκὺ Χριστῷ μέλι.
ltx/gr_gr_cog/sy.m09.d16:syMA.commemoration02.narration.p01	Αὕτη ἦν ἐκ Μαρκιανουπόλεως τῆς Θρᾴκης, ἐπὶ βασιλέως Ἀντωνίνου καὶ ἡγεμόνος Ἀντιόχου, καὶ πολλὰ ὑποστᾶσα δεινὰ καὶ ἐνεργήσασα πλεῖστα σημεῖα, (τὰ γὰρ εἴδωλα διὰ προσευχῆς κατήνεγκεν εἰς τὴν γῆν, καὶ τὸν Ἀπόλλωνα καὶ Ἡρακλέα ὑφʼ ἓν συνέτριψε)· καὶ πολλοὺς τῷ Χριστῷ προσαγαγοῦσα, τὴν κεφαλὴν ἀπετμήθη. Ἀλλὰ καὶ πρὶν ἢ ἀποτμηθῇ, τῇ συζύγῳ τοῦ ἡγεμόνος παραδοθεῖσα, ἐπὶ τῷ κατηχηθῆναι παρʼ αὐτῆς, ταύτην χριστιανὴν πεποίηκε. Μετὰ δὲ τὸ ἐκτμηθῆναι τὴν κεφαλήν, τοῦ τιμίου σώματος αὐτῆς, ἀτάφου κειμένου, Ἀκάκιός τις Μακεδών, διερχόμενος πρὸς τὴν πατρίδα αὑτοῦ, ᾐτήσατο τὸ λείψανον· ὁ δὲ ἡγεμὼν, μηδὲν ὑποπτεύσας εἰς αὐτόν, κατένευσε. Λαβὼν οὖν οὗτος καὶ βαλὼν ἐν γλωσσοκόμῳ, ἔσπευδε πρὸς τὴν πατρίδα· ἀῤῥωστίᾳ δὲ περιπεσὼν κατὰ θάλατταν, ἐξῆλθε τοῦ βίου. Τοῦ δὲ πλοίου ἀκρωτηρίῳ τινὶ τῆς Λήμνου προσοκείλαντος, ἐν τούτῳ τὸ ἅγιον σῶμα τῆς Μάρτυρος κατετέθη καὶ πλησίον ταύτης ὁ φιλομάρτυς Ἀκάκιος.
ltx/gr_gr_cog/sy.m09.d16:syMA.commemoration02.text	Τῇ αὐτῇ ἡμέρᾳ μνήμη τῆς ἁγίας Μάρτυρος Μελιτινῆς.
ltx/gr_gr_cog/sy.m09.d16:syMA.lastline	Ταῖς αὐτῶν ἁγίαις πρεσβείαις, ὁ Θεός, ἐλέησον ἡμᾶς. Ἀμήν.
