ltx/gr_gr_cog/oc.m5.d2:ocBK.ModeNaked	@ltx/gr_gr_cog/miscellanea:misc.Mode5.naked
ltx/gr_gr_cog/oc.m5.d2:ocLI.Beatitudes1.incipit	@ltx/gr_gr_cog/oc.m5.d1:ocLI.Beatitudes1.incipit
ltx/gr_gr_cog/oc.m5.d2:ocLI.Beatitudes1.melody	
ltx/gr_gr_cog/oc.m5.d2:ocLI.Beatitudes1.mode	@ltx/gr_gr_cog/miscellanea:misc.Mode5
ltx/gr_gr_cog/oc.m5.d2:ocLI.Beatitudes1.text	@ltx/gr_gr_cog/oc.m5.d1:ocLI.Beatitudes1.text
ltx/gr_gr_cog/oc.m5.d2:ocLI.Beatitudes2.incipit	Ψυχοφθόροι με λῃσταί, ὁδῷ τοῦ…
ltx/gr_gr_cog/oc.m5.d2:ocLI.Beatitudes2.melody	
ltx/gr_gr_cog/oc.m5.d2:ocLI.Beatitudes2.mode	@ltx/gr_gr_cog/miscellanea:misc.Mode5
ltx/gr_gr_cog/oc.m5.d2:ocLI.Beatitudes2.text	Ψυχοφθόροι με λῃσταί, ὁδῷ τοῦ βίου συναντήσαντες, κατεπλήγωσάν με, ἀλλὰ τῇ σῇ εὐσπλαγχνίᾳ νῦν προστρέχων, ἴασαι Χριστέ, καὶ σῶσόν με δέομαι.
ltx/gr_gr_cog/oc.m5.d2:ocLI.Beatitudes3.incipit	Ἐπουράνιοι χοροί, ὑμνολογοῦσί σε τὸν…
ltx/gr_gr_cog/oc.m5.d2:ocLI.Beatitudes3.melody	
ltx/gr_gr_cog/oc.m5.d2:ocLI.Beatitudes3.mode	@ltx/gr_gr_cog/miscellanea:misc.Mode5
ltx/gr_gr_cog/oc.m5.d2:ocLI.Beatitudes3.text	Ἐπουράνιοι χοροί, ὑμνολογοῦσί σε τὸν πάντων Θεόν, τούτων Δέσποτα ἱεραῖς μεσιτείαις, τὰ πολλά μου πάριδε κακά, καὶ σῶσόν με δέομαι.
ltx/gr_gr_cog/oc.m5.d2:ocLI.Beatitudes4.incipit	Τῶν Ἀγγέλων τοῖς χοροῖς, συναριθμούμενοι…
ltx/gr_gr_cog/oc.m5.d2:ocLI.Beatitudes4.melody	
ltx/gr_gr_cog/oc.m5.d2:ocLI.Beatitudes4.mode	@ltx/gr_gr_cog/miscellanea:misc.Mode5
ltx/gr_gr_cog/oc.m5.d2:ocLI.Beatitudes4.text	Τῶν Ἀγγέλων τοῖς χοροῖς, συναριθμούμενοι Χριστοῦ Ἀθληταί, καὶ πληρούμενοι φωτισμοῦ ἀνεσπέρου, τὰ δυσώδη πάθη τῆς ἐμῆς, καρδίας μειώσατε.
ltx/gr_gr_cog/oc.m5.d2:ocLI.BeatitudesT.incipit	Ἡ διʼ Ἀγγέλου τὴν χαράν…
ltx/gr_gr_cog/oc.m5.d2:ocLI.BeatitudesT.melody	
ltx/gr_gr_cog/oc.m5.d2:ocLI.BeatitudesT.mode	@ltx/gr_gr_cog/miscellanea:misc.Mode5
ltx/gr_gr_cog/oc.m5.d2:ocLI.BeatitudesT.text	Ἡ διʼ Ἀγγέλου τὴν χαράν, ἐν τῇ νηδύϊ δεξαμένη Ἁγνή, σκυθρωπάζουσαν πονηραῖς ἐργασίαις, τὴν ψυχήν μου πλήρωσον χαρᾶς, πρὸς φῶς ὁδηγοῦσά με.
ltx/gr_gr_cog/oc.m5.d2:ocLI.BeatitudesTr.incipit	Μετὰ δόξης ὦ Τριάς, ταῖς…
ltx/gr_gr_cog/oc.m5.d2:ocLI.BeatitudesTr.melody	
ltx/gr_gr_cog/oc.m5.d2:ocLI.BeatitudesTr.mode	@ltx/gr_gr_cog/miscellanea:misc.Mode5
ltx/gr_gr_cog/oc.m5.d2:ocLI.BeatitudesTr.text	Μετὰ δόξης ὦ Τριάς, ταῖς τῶν Ἀγγέλων ὑμνουμένη φωναῖς, τὴν κεκακωμένην ἐκ τῶν δαιμόνων ψυχήν μου, σῷ ἐλέει ὅλην ὑγιῆ, ἀνάδειξον δέομαι.
ltx/gr_gr_cog/oc.m5.d2:ocLI.MM.Beatitudes1234TrTas78910GB.text	@ltx/gr_gr_cog/properties:media.key
ltx/gr_gr_cog/oc.m5.d2:ocMA.ApolTheotokion.incipit	Ὁ ἐκ Παρθένου ἀνατείλας…
ltx/gr_gr_cog/oc.m5.d2:ocMA.ApolTheotokion.melody	
ltx/gr_gr_cog/oc.m5.d2:ocMA.ApolTheotokion.mode	@ltx/gr_gr_cog/miscellanea:misc.Mode5
ltx/gr_gr_cog/oc.m5.d2:ocMA.ApolTheotokion.text	Ὁ ἐκ Παρθένου ἀνατείλας τῷ κόσμῳ, Χριστὲ ὁ Θεός, υἱοὺς φωτὸς διʼ αὐτῆς ἀναδείξας, ἐλέησον ἡμᾶς.
ltx/gr_gr_cog/oc.m5.d2:ocMA.AposTheotokion.incipit	Παῦσον τὸν πόνον…
ltx/gr_gr_cog/oc.m5.d2:ocMA.AposTheotokion.melody	
ltx/gr_gr_cog/oc.m5.d2:ocMA.AposTheotokion.mode	@ltx/gr_gr_cog/miscellanea:misc.Mode5
ltx/gr_gr_cog/oc.m5.d2:ocMA.AposTheotokion.text	Παῦσον τὸν πόνον, τῆς πολυστενάκτου ψυχῆς μου, ἡ παύσασα πᾶν δάκρυον, ἀπὸ προσώπου τῆς γῆς· σὺ γὰρ βροτῶν τὰς ὀδύνας διώκεις, ἁμαρτωλῶν τὴν κατήφειαν λύεις. Σὲ πάντες κεκτήμεθα, ἐλπίδα καὶ στήριγμα, Παναγία Μητροπάρθενε.
ltx/gr_gr_cog/oc.m5.d2:ocMA.Aposticha1.incipit	Οἴμοι! τί ὡμοιώθην ἐγὼ τῇ…
ltx/gr_gr_cog/oc.m5.d2:ocMA.Aposticha1.melody	
ltx/gr_gr_cog/oc.m5.d2:ocMA.Aposticha1.mode	@ltx/gr_gr_cog/miscellanea:misc.Mode5
ltx/gr_gr_cog/oc.m5.d2:ocMA.Aposticha1.text	Οἴμοι! τί ὡμοιώθην ἐγὼ τῇ ἀκάρπῳ συκῇ, καὶ πτοοῦμαι τὴν κατάραν, σὺν τῇ ἐκκοπῇ; ἀλλʼ ἐπουράνιε γεωργέ, Χριστὲ ὁ Θεός, τὴν χερσωθεῖσάν μου ψυχήν, καρποφόρον ἀνάδειξον, καὶ ὡς τὸν Ἄσωτον υἱὸν δέξαι με, καὶ ἐλέησόν με.
ltx/gr_gr_cog/oc.m5.d2:ocMA.Aposticha2.incipit	Τὰ πλήθη τῶν πταισμάτων μου…
ltx/gr_gr_cog/oc.m5.d2:ocMA.Aposticha2.melody	
ltx/gr_gr_cog/oc.m5.d2:ocMA.Aposticha2.mode	@ltx/gr_gr_cog/miscellanea:misc.Mode5
ltx/gr_gr_cog/oc.m5.d2:ocMA.Aposticha2.text	Τὰ πλήθη τῶν πταισμάτων μου, πάριδε Κύριε, ὁ ἐκ Παρθένου τεχθείς, καὶ πάσας ἐξάλειψον τὰς ἀνομίας μου, λογισμόν μοι παρέχων ἐπιστροφῆς, ὡς μόνος φιλάνθρωπος δέομαι, καὶ ἐλέησόν με.
ltx/gr_gr_cog/oc.m5.d2:ocMA.Aposticha3.incipit	Εὐλογημένος ὁ στρατός…
ltx/gr_gr_cog/oc.m5.d2:ocMA.Aposticha3.melody	
ltx/gr_gr_cog/oc.m5.d2:ocMA.Aposticha3.mode	@ltx/gr_gr_cog/miscellanea:misc.Mode5
ltx/gr_gr_cog/oc.m5.d2:ocMA.Aposticha3.text	Εὐλογημένος ὁ στρατός, τοῦ Βασιλέως τῶν οὐρανῶν· εἰ γὰρ καὶ γηγενεῖς ὑπῆρχον οἱ Ἀθλοφόροι, ἀλλὰ ἀγγελικὴν ἀξίαν ἔσπευδον φθάσαι, τῶν σωμάτων καταφρονήσαντες, καὶ διὰ τῶν παθημάτων, τῆς τῶν Ἀσωμάτων ἀξιωθέντες τιμῆς. Εὐχαῖς αὐτῶν Κύριε, κατάπεμψον ἡμῖν τὸ μέγα σου ἔλεος.
ltx/gr_gr_cog/oc.m5.d2:ocMA.C1.acrostic.notice1	οὗ ἡ ἀκροστιχὶς μετὰ τῶν Θεοτοκίων, μόνον τῆς ηʼ καὶ θʼ ᾠδῆς·
ltx/gr_gr_cog/oc.m5.d2:ocMA.C1.acrostic.text	Τὸν π(ολλά) σοι πταίσαντα οἴκτειρον, Λόγε. Ἰωσήφ.
ltx/gr_gr_cog/oc.m5.d2:ocMA.C1.acrostic.title	Κανὼν κατανυκτικός,
ltx/gr_gr_cog/oc.m5.d2:ocMA.C1.poet	@ltx/gr_gr_cog/poets:po.KyriouIosif
ltx/gr_gr_cog/oc.m5.d2:ocMA.C2.acrostic.notice1	οὗ ἡ ἀκροστιχίς·
ltx/gr_gr_cog/oc.m5.d2:ocMA.C2.acrostic.text	Μέλος Ἀγγέλοις τὸ πέμπτον.
ltx/gr_gr_cog/oc.m5.d2:ocMA.C2.acrostic.title	Κανὼν τῶν Ἀσωμάτων,
ltx/gr_gr_cog/oc.m5.d2:ocMA.C2.poet	@ltx/gr_gr_cog/poets:po.Theofanous
ltx/gr_gr_cog/oc.m5.d2:ocMA.CA.notice	
ltx/gr_gr_cog/oc.m5.d2:ocMA.Kathisma11.incipit	Κριτοῦ καθεζομένου…
ltx/gr_gr_cog/oc.m5.d2:ocMA.Kathisma11.melody	
ltx/gr_gr_cog/oc.m5.d2:ocMA.Kathisma11.mode	@ltx/gr_gr_cog/miscellanea:misc.Mode5
ltx/gr_gr_cog/oc.m5.d2:ocMA.Kathisma11.text	Κριτοῦ καθεζομένου, καὶ Ἀγγέλων ἑστώτων, σάλπιγγος ἠχούσης, καὶ φλογὸς καιομένης, τί ποιήσεις ψυχή μου, ἀπαγομένη εἰς κρίσιν; τότε γὰρ τὰ δεινά σου παρίστανται, τὰ κρυπτά σου ἐλέγχονται ἐγκλήματα· διὸ πρὸ τέλους βόησον· Ὁ Θεὸς ἱλάσθητί μοι, καὶ σῶσόν με.
ltx/gr_gr_cog/oc.m5.d2:ocMA.Kathisma12.incipit	Ψυχή, τὰ ὧδε πρόσκαιρα…
ltx/gr_gr_cog/oc.m5.d2:ocMA.Kathisma12.melody	
ltx/gr_gr_cog/oc.m5.d2:ocMA.Kathisma12.mode	@ltx/gr_gr_cog/miscellanea:misc.Mode5
ltx/gr_gr_cog/oc.m5.d2:ocMA.Kathisma12.text	Ψυχή, τὰ ὧδε πρόσκαιρα, τὰ δὲ ἐκεῖ αἰώνια· ὁρῶ τὸ δικαστήριον, καὶ ἐπὶ θρόνου τὸν Κριτήν, καὶ τρέμω τὴν ἀπόφασιν· λοιπὸν σπουδῇ ἐπίστρεψον· ἡ κρίσις ἀσυγχώρητος.
ltx/gr_gr_cog/oc.m5.d2:ocMA.Kathisma13.greekmelody	@ltx/gr_gr_cog/he.a.m5:heAU.TonSynanarchonLogon.greekname
ltx/gr_gr_cog/oc.m5.d2:ocMA.Kathisma13.incipit	Ἡ θερμὴ προστασία…
ltx/gr_gr_cog/oc.m5.d2:ocMA.Kathisma13.melody	@ltx/gr_gr_cog/he.a.m5:heAU.TonSynanarchonLogon.name
ltx/gr_gr_cog/oc.m5.d2:ocMA.Kathisma13.mode	@ltx/gr_gr_cog/miscellanea:misc.Mode5
ltx/gr_gr_cog/oc.m5.d2:ocMA.Kathisma13.text	Ἡ θερμὴ προστασία καὶ ἀπροσμάχητος, ἡ ἐλπὶς ἡ βεβαία καὶ ἀκαταίσχυντος, τεῖχος καὶ σκέπη καὶ λιμὴν τῶν προστρεχόντων σοι, Ἀειπάρθενε ἁγνή, τὸν Υἱόν σου καὶ Θεόν, ἱκέτευε σὺν Ἀγγέλοις, εἰρήνην δοῦναι τῷ κόσμῳ, καὶ σωτηρίαν καὶ μέγα ἔλεος.
ltx/gr_gr_cog/oc.m5.d2:ocMA.Kathisma21.incipit	Πάντες ἀγρυπνήσωμεν…
ltx/gr_gr_cog/oc.m5.d2:ocMA.Kathisma21.melody	
ltx/gr_gr_cog/oc.m5.d2:ocMA.Kathisma21.mode	@ltx/gr_gr_cog/miscellanea:misc.Mode5
ltx/gr_gr_cog/oc.m5.d2:ocMA.Kathisma21.text	Πάντες ἀγρυπνήσωμεν, καὶ Χριστῷ ὑπαντήσωμεν, μετὰ πλήθους ἐλαίου, καὶ λαμπάδων φαεινῶν, ὅπως τοῦ νυμφῶνος ἔνδον ἀξιωθῶμεν· ὁ γὰρ τῆς θύρας ἔξω φθανόμενος, ἄπρακτα τῷ Θεῷ κέκραγεν· Ἐλέησόν με.
ltx/gr_gr_cog/oc.m5.d2:ocMA.Kathisma22.incipit	Ἐν κλίνῃ κατακείμενος…
ltx/gr_gr_cog/oc.m5.d2:ocMA.Kathisma22.melody	
ltx/gr_gr_cog/oc.m5.d2:ocMA.Kathisma22.mode	@ltx/gr_gr_cog/miscellanea:misc.Mode5
ltx/gr_gr_cog/oc.m5.d2:ocMA.Kathisma22.text	Ἐν κλίνῃ κατακείμενος, ἁμαρτημάτων πολλῶν, συλῶμαι τὴν ἐλπίδα τῆς σωτηρίας μου· ὁ γὰρ ὕπνος τῆς ἐμῆς ῥαθυμίας, προξενεῖ μου τῇ ψυχῇ τιμωρίαν· ἀλλὰ σὺ ὁ Θεός, ὁ τεχθεὶς ἐκ Παρθένου, διέγειρόν με πρὸς τὴν σὴν ὑμνῳδίαν, ἵνα δοξάζω σε.
ltx/gr_gr_cog/oc.m5.d2:ocMA.Kathisma23.incipit	Ἁγιωτέρα τῶν Χερουβείμ…
ltx/gr_gr_cog/oc.m5.d2:ocMA.Kathisma23.melody	
ltx/gr_gr_cog/oc.m5.d2:ocMA.Kathisma23.mode	@ltx/gr_gr_cog/miscellanea:misc.Mode5
ltx/gr_gr_cog/oc.m5.d2:ocMA.Kathisma23.text	Ἁγιωτέρα τῶν Χερουβείμ, ὑψηλοτέρα τῶν οὐρανῶν Πανύμνητε, Θεοτόκον σε ἐν ἀληθείᾳ ὁμολογοῦντες, ἔχομεν ἁμαρτωλοὶ προστασίαν, καὶ εὑρίσκομεν ἐν πειρασμοῖς σωτηρίαν· διὸ μὴ παύσῃ πρεσβεύουσα ὑπὲρ ἡμῶν, κραταίωμα καὶ καταφυγὴ τῶν ψυχῶν ἡμῶν.
ltx/gr_gr_cog/oc.m5.d2:ocMA.Kathisma31.greekmelody	@ltx/gr_gr_cog/he.a.m5:heAU.TonSynanarchonLogon.greekname
ltx/gr_gr_cog/oc.m5.d2:ocMA.Kathisma31.incipit	Τὸ κριτήριον τρέμω…
ltx/gr_gr_cog/oc.m5.d2:ocMA.Kathisma31.melody	@ltx/gr_gr_cog/he.a.m5:heAU.TonSynanarchonLogon.name
ltx/gr_gr_cog/oc.m5.d2:ocMA.Kathisma31.mode	@ltx/gr_gr_cog/miscellanea:misc.Mode5
ltx/gr_gr_cog/oc.m5.d2:ocMA.Kathisma31.text	Τὸ κριτήριον τρέμω τὸ φοβερώτατον, καὶ Κριτοῦ τὴν δικαίαν φρίττω ἀπόφασιν· ἡ συνείδησις καὶ γὰρ ἀεὶ ἐλέγχει με· τῇ ἀμελείᾳ δὲ συζῶν, ἀπορῶ καὶ δειλιῶ· πρεσβείαις ὑμῶν ἁγίαις, ἐκλυτρώσασθε τοῦ πυρός με, οἱ τοὺς πιστοὺς φρουροῦντες Ἀρχάγγελοι.
ltx/gr_gr_cog/oc.m5.d2:ocMA.Kathisma32.incipit	Λάμπει σήμερον ἡ μνήμη…
ltx/gr_gr_cog/oc.m5.d2:ocMA.Kathisma32.melody	
ltx/gr_gr_cog/oc.m5.d2:ocMA.Kathisma32.mode	@ltx/gr_gr_cog/miscellanea:misc.Mode5
ltx/gr_gr_cog/oc.m5.d2:ocMA.Kathisma32.text	Λάμπει σήμερον ἡ μνήμη τῶν Ἀθλοφόρων· ἔχει γὰρ καὶ οὐρανόθεν ἀπαύγασμα· ὁ χορὸς τῶν Ἀγγέλων πανηγυρίζει, καὶ τῶν ἀνθρώπων τὸ γένος συνεορτάζει· διὸ πρεσβεύουσι τῷ Κυρίῳ, ἐλεηθῆναι τὰς ψυχὰς ἡμῶν.
ltx/gr_gr_cog/oc.m5.d2:ocMA.Kathisma33.greekmelody	@ltx/gr_gr_cog/he.a.m5:heAU.TonSynanarchonLogon.greekname
ltx/gr_gr_cog/oc.m5.d2:ocMA.Kathisma33.incipit	Γαβριήλ σοι τὸ χαῖρε…
ltx/gr_gr_cog/oc.m5.d2:ocMA.Kathisma33.melody	@ltx/gr_gr_cog/he.a.m5:heAU.TonSynanarchonLogon.name
ltx/gr_gr_cog/oc.m5.d2:ocMA.Kathisma33.mode	@ltx/gr_gr_cog/miscellanea:misc.Mode5
ltx/gr_gr_cog/oc.m5.d2:ocMA.Kathisma33.text	Γαβριήλ σοι τὸ χαῖρε τὸ ἐπουράνιον, ἐπὶ γῆς παραδόξως ἐναπεκόμισε· τὸν γὰρ Ἀγγέλων Ποιητὴν ἐν σοὶ σαρκούμενον ὁρῶν, τὸ μελῴδημα χαρᾶς ἀναμέλπει σοι Σεμνή, βροτοὺς διʼ αὐτοῦ διδάσκων, ὡς σὺ μόνη χαρᾶς αἰτία, πᾶσιν ἀνθρώποις πεφανέρωσαι.
ltx/gr_gr_cog/oc.m5.d2:ocMA.OdeW1C11.incipit	Τὸν πολλαῖς ἀπάταις, ἐξελκόμενον καὶ…
ltx/gr_gr_cog/oc.m5.d2:ocMA.OdeW1C11.melody	@ltx/gr_gr_cog/he.h.m5:heHE.AsomenToKyrio.name
ltx/gr_gr_cog/oc.m5.d2:ocMA.OdeW1C11.mode	@ltx/gr_gr_cog/miscellanea:misc.Mode5
ltx/gr_gr_cog/oc.m5.d2:ocMA.OdeW1C11.ode	@ltx/gr_gr_cog/miscellanea:misc.Ode1
ltx/gr_gr_cog/oc.m5.d2:ocMA.OdeW1C11.text	Τὸν πολλαῖς ἀπάταις, ἐξελκόμενον καὶ δελεαζόμενον, Χριστὲ τοῦ ἀλλοτρίου, ἐπίστρεψον, οἴκτειρον, ὡς παντοδύναμος.
ltx/gr_gr_cog/oc.m5.d2:ocMA.OdeW1C12.incipit	Ὁ τοῦ κωφοῦ τὰ ὦτα…
ltx/gr_gr_cog/oc.m5.d2:ocMA.OdeW1C12.melody	@ltx/gr_gr_cog/he.h.m5:heHE.AsomenToKyrio.name
ltx/gr_gr_cog/oc.m5.d2:ocMA.OdeW1C12.mode	@ltx/gr_gr_cog/miscellanea:misc.Mode5
ltx/gr_gr_cog/oc.m5.d2:ocMA.OdeW1C12.ode	@ltx/gr_gr_cog/miscellanea:misc.Ode1
ltx/gr_gr_cog/oc.m5.d2:ocMA.OdeW1C12.text	Ὁ τοῦ κωφοῦ τὰ ὦτα, διανοίξας Χριστέ, τῆς ψυχῆς μου δέομαι, κωφεύοντα τὰ ὦτα διάνοιξον, ὅπως σου, τοὺς λόγους ἐνωτισθῶ.
ltx/gr_gr_cog/oc.m5.d2:ocMA.OdeW1C13.incipit	Νεοφανεῖς ἀστέρες, χρηματίζοντες τοῦ Ἡλίου…
ltx/gr_gr_cog/oc.m5.d2:ocMA.OdeW1C13.melody	@ltx/gr_gr_cog/he.h.m5:heHE.AsomenToKyrio.name
ltx/gr_gr_cog/oc.m5.d2:ocMA.OdeW1C13.mode	@ltx/gr_gr_cog/miscellanea:misc.Mode5
ltx/gr_gr_cog/oc.m5.d2:ocMA.OdeW1C13.ode	@ltx/gr_gr_cog/miscellanea:misc.Ode1
ltx/gr_gr_cog/oc.m5.d2:ocMA.OdeW1C13.text	Νεοφανεῖς ἀστέρες, χρηματίζοντες τοῦ Ἡλίου Μάρτυρες, τοῦ τῆς δικαιοσύνης, τὸ σκότος σκεδάζετε, τῶν καρδιῶν ἡμῶν.
ltx/gr_gr_cog/oc.m5.d2:ocMA.OdeW1C14.incipit	Πεπυρωμένα βέλη, θείοις ἄνθραξι τοῦ…
ltx/gr_gr_cog/oc.m5.d2:ocMA.OdeW1C14.melody	@ltx/gr_gr_cog/he.h.m5:heHE.AsomenToKyrio.name
ltx/gr_gr_cog/oc.m5.d2:ocMA.OdeW1C14.mode	@ltx/gr_gr_cog/miscellanea:misc.Mode5
ltx/gr_gr_cog/oc.m5.d2:ocMA.OdeW1C14.ode	@ltx/gr_gr_cog/miscellanea:misc.Ode1
ltx/gr_gr_cog/oc.m5.d2:ocMA.OdeW1C14.text	Πεπυρωμένα βέλη, θείοις ἄνθραξι τοῦ ἁγίου Πνεύματος, οἱ Ἀθληταὶ δειχθέντες, τὰ βέλη συντρίβουσι, πάντα τοῦ ὄφεως.
ltx/gr_gr_cog/oc.m5.d2:ocMA.OdeW1C1H.greekmelody	@ltx/gr_gr_cog/he.h.m5:heHE.AsomenToKyrio.greekname
ltx/gr_gr_cog/oc.m5.d2:ocMA.OdeW1C1H.incipit	@ltx/gr_gr_cog/he.h.m5:heHE.AsomenToKyrio.incipit
ltx/gr_gr_cog/oc.m5.d2:ocMA.OdeW1C1H.melody	@ltx/gr_gr_cog/he.h.m5:heHE.AsomenToKyrio.melody
ltx/gr_gr_cog/oc.m5.d2:ocMA.OdeW1C1H.mode	@ltx/gr_gr_cog/miscellanea:misc.Mode5
ltx/gr_gr_cog/oc.m5.d2:ocMA.OdeW1C1H.ode	@ltx/gr_gr_cog/miscellanea:misc.Ode1
ltx/gr_gr_cog/oc.m5.d2:ocMA.OdeW1C1H.text	@ltx/gr_gr_cog/he.h.m5:heHE.AsomenToKyrio.text
ltx/gr_gr_cog/oc.m5.d2:ocMA.OdeW1C1T.incipit	Πύλη τῆς θείας δόξης, μετανοίας…
ltx/gr_gr_cog/oc.m5.d2:ocMA.OdeW1C1T.melody	@ltx/gr_gr_cog/he.h.m5:heHE.AsomenToKyrio.name
ltx/gr_gr_cog/oc.m5.d2:ocMA.OdeW1C1T.mode	@ltx/gr_gr_cog/miscellanea:misc.Mode5
ltx/gr_gr_cog/oc.m5.d2:ocMA.OdeW1C1T.ode	@ltx/gr_gr_cog/miscellanea:misc.Ode1
ltx/gr_gr_cog/oc.m5.d2:ocMA.OdeW1C1T.text	Πύλη τῆς θείας δόξης, μετανοίας μοι πύλας ἀναπέτασον, καὶ ἐκ πυλῶν τοῦ ᾍδου, ἐξάρπασον δέομαι, τὴν ταπεινήν μου ψυχήν.
ltx/gr_gr_cog/oc.m5.d2:ocMA.OdeW1C21.greekmelody	@ltx/gr_gr_cog/he.h.m5:heHE.IpponKaiAnavatin.greekname
ltx/gr_gr_cog/oc.m5.d2:ocMA.OdeW1C21.incipit	Μύσται τῆς θεαρχίας, τῆς φωτοδότιδος…
ltx/gr_gr_cog/oc.m5.d2:ocMA.OdeW1C21.melody	@ltx/gr_gr_cog/he.h.m5:heHE.IpponKaiAnavatin.name
ltx/gr_gr_cog/oc.m5.d2:ocMA.OdeW1C21.mode	@ltx/gr_gr_cog/miscellanea:misc.Mode5
ltx/gr_gr_cog/oc.m5.d2:ocMA.OdeW1C21.ode	@ltx/gr_gr_cog/miscellanea:misc.Ode1
ltx/gr_gr_cog/oc.m5.d2:ocMA.OdeW1C21.text	Μύσται τῆς θεαρχίας, τῆς φωτοδότιδος, ὡς ταῖς ταύτης ἀκτῖσι, πρωτοφανῶς λαμπόμενοι, φωτὶ καταυγάζεσθαι, τὴν ψυχήν μου Ἄγγελοι, τὸν Δεσπότην καθικετεύσατε.
ltx/gr_gr_cog/oc.m5.d2:ocMA.OdeW1C22.incipit	Ἔχοντες παῤῥησίαν, ὡς θρόνῳ τῷ…
ltx/gr_gr_cog/oc.m5.d2:ocMA.OdeW1C22.melody	@ltx/gr_gr_cog/he.h.m5:heHE.IpponKaiAnavatin.name
ltx/gr_gr_cog/oc.m5.d2:ocMA.OdeW1C22.mode	@ltx/gr_gr_cog/miscellanea:misc.Mode5
ltx/gr_gr_cog/oc.m5.d2:ocMA.OdeW1C22.ode	@ltx/gr_gr_cog/miscellanea:misc.Ode1
ltx/gr_gr_cog/oc.m5.d2:ocMA.OdeW1C22.text	Ἔχοντες παῤῥησίαν, ὡς θρόνῳ τῷ ὑψηλῷ, παριστάμενοι πάντας, τοὺς εὐσεβῶς ὑμνοῦντας ὑμᾶς, κινδύνων λυτρώσασθε, πρωτοστάται τάξεως οὐρανίου, ὦ Ἀρχιστράτηγοι.
ltx/gr_gr_cog/oc.m5.d2:ocMA.OdeW1C2T.incipit	@ltx/gr_gr_cog/oc.m5.d1:ocMA.OdeS1C1T.incipit
ltx/gr_gr_cog/oc.m5.d2:ocMA.OdeW1C2T.melody	@ltx/gr_gr_cog/he.h.m5:heHE.IpponKaiAnavatin.name
ltx/gr_gr_cog/oc.m5.d2:ocMA.OdeW1C2T.mode	@ltx/gr_gr_cog/miscellanea:misc.Mode5
ltx/gr_gr_cog/oc.m5.d2:ocMA.OdeW1C2T.ode	@ltx/gr_gr_cog/miscellanea:misc.Ode1
ltx/gr_gr_cog/oc.m5.d2:ocMA.OdeW1C2T.text	@ltx/gr_gr_cog/oc.m5.d1:ocMA.OdeS1C1T.text
ltx/gr_gr_cog/oc.m5.d2:ocMA.OdeW3C11.incipit	Σὺ ὁ μηδένα ἀπολέσθαι βουλόμενος…
ltx/gr_gr_cog/oc.m5.d2:ocMA.OdeW3C11.melody	@ltx/gr_gr_cog/he.h.m5:heHE.EpiTaEthni.name
ltx/gr_gr_cog/oc.m5.d2:ocMA.OdeW3C11.mode	@ltx/gr_gr_cog/miscellanea:misc.Mode5
ltx/gr_gr_cog/oc.m5.d2:ocMA.OdeW3C11.ode	@ltx/gr_gr_cog/miscellanea:misc.Ode3
ltx/gr_gr_cog/oc.m5.d2:ocMA.OdeW3C11.text	Σὺ ὁ μηδένα ἀπολέσθαι βουλόμενος, ἀγαθὲ Κύριε, ἀπολλύμενον οἴκτειρον, καὶ σῶσόν με ῥοπῇ, πανοικτίρμον τοῦ ἐλέους σου.
ltx/gr_gr_cog/oc.m5.d2:ocMA.OdeW3C12.incipit	Ὅτι ἐν γνώσει καὶ ἀγνοίᾳ…
ltx/gr_gr_cog/oc.m5.d2:ocMA.OdeW3C12.melody	@ltx/gr_gr_cog/he.h.m5:heHE.EpiTaEthni.name
ltx/gr_gr_cog/oc.m5.d2:ocMA.OdeW3C12.mode	@ltx/gr_gr_cog/miscellanea:misc.Mode5
ltx/gr_gr_cog/oc.m5.d2:ocMA.OdeW3C12.ode	@ltx/gr_gr_cog/miscellanea:misc.Ode3
ltx/gr_gr_cog/oc.m5.d2:ocMA.OdeW3C12.text	Ὅτι ἐν γνώσει καὶ ἀγνοίᾳ ἡμάρτηκά σοι, Χριστὲ Κύριε, τῷ πάντα γινώσκοντι, προσέρχομαι, προσπίπτω σοι, δέξαι με ὥσπερ τὸν Ἄσωτον.
ltx/gr_gr_cog/oc.m5.d2:ocMA.OdeW3C13.incipit	Ἵνα τὴν ζῶσαν ἁμαρτίαν νεκρώσητε…
ltx/gr_gr_cog/oc.m5.d2:ocMA.OdeW3C13.melody	@ltx/gr_gr_cog/he.h.m5:heHE.EpiTaEthni.name
ltx/gr_gr_cog/oc.m5.d2:ocMA.OdeW3C13.mode	@ltx/gr_gr_cog/miscellanea:misc.Mode5
ltx/gr_gr_cog/oc.m5.d2:ocMA.OdeW3C13.ode	@ltx/gr_gr_cog/miscellanea:misc.Ode3
ltx/gr_gr_cog/oc.m5.d2:ocMA.OdeW3C13.text	Ἵνα τὴν ζῶσαν ἁμαρτίαν νεκρώσητε, καὶ νεκρὸν Μάρτυρες, τὸν ἐχθρὸν ἀποδείξητε, νεκρώσεως σωμάτων, μακάριοι οὐκ ἐφροντίσατε.
ltx/gr_gr_cog/oc.m5.d2:ocMA.OdeW3C14.incipit	Πεποικιλμένοι τοῖς παθήμασι Μάρτυρες, καὶ…
ltx/gr_gr_cog/oc.m5.d2:ocMA.OdeW3C14.melody	@ltx/gr_gr_cog/he.h.m5:heHE.EpiTaEthni.name
ltx/gr_gr_cog/oc.m5.d2:ocMA.OdeW3C14.mode	@ltx/gr_gr_cog/miscellanea:misc.Mode5
ltx/gr_gr_cog/oc.m5.d2:ocMA.OdeW3C14.ode	@ltx/gr_gr_cog/miscellanea:misc.Ode3
ltx/gr_gr_cog/oc.m5.d2:ocMA.OdeW3C14.text	Πεποικιλμένοι τοῖς παθήμασι Μάρτυρες, καὶ στολαῖς αἵμασι, βεβαμμέναις κοσμούμενοι, τῷ πάντων Βασιλεῖ, στεφηφόροι νῦν παρίστασθε.
ltx/gr_gr_cog/oc.m5.d2:ocMA.OdeW3C1H.greekmelody	@ltx/gr_gr_cog/he.h.m5:heHE.EpiTaEthni.greekname
ltx/gr_gr_cog/oc.m5.d2:ocMA.OdeW3C1H.incipit	@ltx/gr_gr_cog/he.h.m5:heHE.EpiTaEthni.incipit
ltx/gr_gr_cog/oc.m5.d2:ocMA.OdeW3C1H.melody	@ltx/gr_gr_cog/he.h.m5:heHE.EpiTaEthni.melody
ltx/gr_gr_cog/oc.m5.d2:ocMA.OdeW3C1H.mode	@ltx/gr_gr_cog/miscellanea:misc.Mode5
ltx/gr_gr_cog/oc.m5.d2:ocMA.OdeW3C1H.ode	@ltx/gr_gr_cog/miscellanea:misc.Ode3
ltx/gr_gr_cog/oc.m5.d2:ocMA.OdeW3C1H.text	@ltx/gr_gr_cog/he.h.m5:heHE.EpiTaEthni.text
ltx/gr_gr_cog/oc.m5.d2:ocMA.OdeW3C1T.incipit	Παρθενομῆτορ ἡ Θεὸν σωματώσασα, τὰς…
ltx/gr_gr_cog/oc.m5.d2:ocMA.OdeW3C1T.melody	@ltx/gr_gr_cog/he.h.m5:heHE.EpiTaEthni.name
ltx/gr_gr_cog/oc.m5.d2:ocMA.OdeW3C1T.mode	@ltx/gr_gr_cog/miscellanea:misc.Mode5
ltx/gr_gr_cog/oc.m5.d2:ocMA.OdeW3C1T.ode	@ltx/gr_gr_cog/miscellanea:misc.Ode3
ltx/gr_gr_cog/oc.m5.d2:ocMA.OdeW3C1T.text	Παρθενομῆτορ ἡ Θεὸν σωματώσασα, τὰς φωνάς, πρόσδεξαι τῶν βοώντων σοι πάντοτε, καὶ λύτρωσαι ἡμᾶς, τῶν ποικίλων περιστάσεων.
ltx/gr_gr_cog/oc.m5.d2:ocMA.OdeW3C21.greekmelody	@ltx/gr_gr_cog/he.h.m5:heHE.OPixasEpOudenos.greekname
ltx/gr_gr_cog/oc.m5.d2:ocMA.OdeW3C21.incipit	Ὁ λόγῳ τοὺς χορευτὰς τῶν…
ltx/gr_gr_cog/oc.m5.d2:ocMA.OdeW3C21.melody	@ltx/gr_gr_cog/he.h.m5:heHE.OPixasEpOudenos.name
ltx/gr_gr_cog/oc.m5.d2:ocMA.OdeW3C21.mode	@ltx/gr_gr_cog/miscellanea:misc.Mode5
ltx/gr_gr_cog/oc.m5.d2:ocMA.OdeW3C21.ode	@ltx/gr_gr_cog/miscellanea:misc.Ode3
ltx/gr_gr_cog/oc.m5.d2:ocMA.OdeW3C21.text	Ὁ λόγῳ τοὺς χορευτὰς τῶν ἄνω Δυνάμεων, σαφῶς ὑποστήσας, τὴν σὴν χρηστότητα, τὴν ἀπειροδύναμον δεικνύς, τούτων ταῖς προστασίαις, τὴν Ἐκκλησίαν σου στερέωσον, μόνε ἀγαθὲ καὶ φιλάνθρωπε.
ltx/gr_gr_cog/oc.m5.d2:ocMA.OdeW3C2T.incipit	Σὺ Μήτηρ Θεοῦ ἀσυνδυάστως γεγένησαι…
ltx/gr_gr_cog/oc.m5.d2:ocMA.OdeW3C2T.melody	@ltx/gr_gr_cog/he.h.m5:heHE.OPixasEpOudenos.name
ltx/gr_gr_cog/oc.m5.d2:ocMA.OdeW3C2T.mode	@ltx/gr_gr_cog/miscellanea:misc.Mode5
ltx/gr_gr_cog/oc.m5.d2:ocMA.OdeW3C2T.ode	@ltx/gr_gr_cog/miscellanea:misc.Ode3
ltx/gr_gr_cog/oc.m5.d2:ocMA.OdeW3C2T.text	Σὺ Μήτηρ Θεοῦ ἀσυνδυάστως γεγένησαι, τοῦ τοὺς Ἀσωμάτους χοροὺς φωτίζοντος, μίαν θεαρχίαν ἐν τρισί, μέλπειν ἀκαταπαύστως, ἁγιασμοῖς καὶ κυριότησιν, ἄχραντε Παρθένε πανύμνητε.
ltx/gr_gr_cog/oc.m5.d2:ocMA.OdeW4C11.incipit	Τὰ ἔργα ἅπερ ἐν τῷ…
ltx/gr_gr_cog/oc.m5.d2:ocMA.OdeW4C11.melody	@ltx/gr_gr_cog/he.h.m5:heHE.TaErgaTisOikonomias.name
ltx/gr_gr_cog/oc.m5.d2:ocMA.OdeW4C11.mode	@ltx/gr_gr_cog/miscellanea:misc.Mode5
ltx/gr_gr_cog/oc.m5.d2:ocMA.OdeW4C11.ode	@ltx/gr_gr_cog/miscellanea:misc.Ode4
ltx/gr_gr_cog/oc.m5.d2:ocMA.OdeW4C11.text	Τὰ ἔργα ἅπερ ἐν τῷ βίῳ ἐτέλεσα, ὑπάρχουσι χαλεπὰ καὶ πονηρά, ἐξ ὧν Χριστὲ ὁ Θεὸς λύτρωσαί με, μετάνοιαν γνησίαν παρέχων μοι.
ltx/gr_gr_cog/oc.m5.d2:ocMA.OdeW4C12.incipit	Ἁπάσης ἐντολῆς σεπτῆς κατεφρόνησα, τὸν…
ltx/gr_gr_cog/oc.m5.d2:ocMA.OdeW4C12.melody	@ltx/gr_gr_cog/he.h.m5:heHE.TaErgaTisOikonomias.name
ltx/gr_gr_cog/oc.m5.d2:ocMA.OdeW4C12.mode	@ltx/gr_gr_cog/miscellanea:misc.Mode5
ltx/gr_gr_cog/oc.m5.d2:ocMA.OdeW4C12.ode	@ltx/gr_gr_cog/miscellanea:misc.Ode4
ltx/gr_gr_cog/oc.m5.d2:ocMA.OdeW4C12.text	Ἁπάσης ἐντολῆς σεπτῆς κατεφρόνησα, τὸν φόβον σου παρωσάμενος Χριστέ, καὶ δέδοικα τὸ ἀλάθητόν σου βῆμα, ἐν ᾧ μὴ κατακρίνῃς με εὔσπλαγχνε.
ltx/gr_gr_cog/oc.m5.d2:ocMA.OdeW4C13.incipit	Ἱμᾶσι πανταχόθεν ὄντως τεινόμενοι, καὶ…
ltx/gr_gr_cog/oc.m5.d2:ocMA.OdeW4C13.melody	@ltx/gr_gr_cog/he.h.m5:heHE.TaErgaTisOikonomias.name
ltx/gr_gr_cog/oc.m5.d2:ocMA.OdeW4C13.mode	@ltx/gr_gr_cog/miscellanea:misc.Mode5
ltx/gr_gr_cog/oc.m5.d2:ocMA.OdeW4C13.ode	@ltx/gr_gr_cog/miscellanea:misc.Ode4
ltx/gr_gr_cog/oc.m5.d2:ocMA.OdeW4C13.text	Ἱμᾶσι πανταχόθεν ὄντως τεινόμενοι, καὶ μάστιξι δαπανώμενοι σφοδρῶς, καὶ ὄνυξι καταξεόμενοι Λόγε, οἱ Ἀθληταί σου πίστει ἠγάλλοντο.
ltx/gr_gr_cog/oc.m5.d2:ocMA.OdeW4C14.incipit	Σαλεῦσαι Ἀθληταὶ ὑμᾶς θείας στάσεως…
ltx/gr_gr_cog/oc.m5.d2:ocMA.OdeW4C14.melody	@ltx/gr_gr_cog/he.h.m5:heHE.TaErgaTisOikonomias.name
ltx/gr_gr_cog/oc.m5.d2:ocMA.OdeW4C14.mode	@ltx/gr_gr_cog/miscellanea:misc.Mode5
ltx/gr_gr_cog/oc.m5.d2:ocMA.OdeW4C14.ode	@ltx/gr_gr_cog/miscellanea:misc.Ode4
ltx/gr_gr_cog/oc.m5.d2:ocMA.OdeW4C14.text	Σαλεῦσαι Ἀθληταὶ ὑμᾶς θείας στάσεως, οὐκ ἴσχυσε παντελῶς ὁ πονηρός· διὸ πολλῶν σαλευομένων γενναῖοι, στηρίγματα ἐνθέως ἐδείχθητε.
ltx/gr_gr_cog/oc.m5.d2:ocMA.OdeW4C1H.greekmelody	@ltx/gr_gr_cog/he.h.m5:heHE.TaErgaTisOikonomias.greekname
ltx/gr_gr_cog/oc.m5.d2:ocMA.OdeW4C1H.incipit	@ltx/gr_gr_cog/he.h.m5:heHE.TaErgaTisOikonomias.incipit
ltx/gr_gr_cog/oc.m5.d2:ocMA.OdeW4C1H.melody	@ltx/gr_gr_cog/he.h.m5:heHE.TaErgaTisOikonomias.melody
ltx/gr_gr_cog/oc.m5.d2:ocMA.OdeW4C1H.mode	@ltx/gr_gr_cog/miscellanea:misc.Mode5
ltx/gr_gr_cog/oc.m5.d2:ocMA.OdeW4C1H.ode	@ltx/gr_gr_cog/miscellanea:misc.Ode4
ltx/gr_gr_cog/oc.m5.d2:ocMA.OdeW4C1H.text	@ltx/gr_gr_cog/he.h.m5:heHE.TaErgaTisOikonomias.text
ltx/gr_gr_cog/oc.m5.d2:ocMA.OdeW4C1T.incipit	Σαρκοῦται ἐξ ἁγνῶν αἱμάτων σου…
ltx/gr_gr_cog/oc.m5.d2:ocMA.OdeW4C1T.melody	@ltx/gr_gr_cog/he.h.m5:heHE.TaErgaTisOikonomias.name
ltx/gr_gr_cog/oc.m5.d2:ocMA.OdeW4C1T.mode	@ltx/gr_gr_cog/miscellanea:misc.Mode5
ltx/gr_gr_cog/oc.m5.d2:ocMA.OdeW4C1T.ode	@ltx/gr_gr_cog/miscellanea:misc.Ode4
ltx/gr_gr_cog/oc.m5.d2:ocMA.OdeW4C1T.text	Σαρκοῦται ἐξ ἁγνῶν αἱμάτων σου Κύριος, μετάνοιαν τοῖς τιμῶσί σε διδοὺς Πανύμνητε, τῇ σῇ χρηστῇ μεσιτείᾳ, ὡς εὔσπλαγχνος καὶ μόνος φιλάνθρωπος.
ltx/gr_gr_cog/oc.m5.d2:ocMA.OdeW4C21.greekmelody	@ltx/gr_gr_cog/he.h.m5:heHE.TinTheianEnnoisas.greekname
ltx/gr_gr_cog/oc.m5.d2:ocMA.OdeW4C21.incipit	Ἀγγέλων ὑποστήσας λαμπρότητας, θεουργικαῖς μαρμαρυγαῖς…
ltx/gr_gr_cog/oc.m5.d2:ocMA.OdeW4C21.melody	@ltx/gr_gr_cog/he.h.m5:heHE.TinTheianEnnoisas.name
ltx/gr_gr_cog/oc.m5.d2:ocMA.OdeW4C21.mode	@ltx/gr_gr_cog/miscellanea:misc.Mode5
ltx/gr_gr_cog/oc.m5.d2:ocMA.OdeW4C21.ode	@ltx/gr_gr_cog/miscellanea:misc.Ode4
ltx/gr_gr_cog/oc.m5.d2:ocMA.OdeW4C21.text	Ἀγγέλων ὑποστήσας λαμπρότητας, θεουργικαῖς μαρμαρυγαῖς, ἀγαθοδότως ἐλάμπρυνας, ὡς δυνατὰς ἐν ἰσχύϊ, τὸν λόγον σου πληρῶσαι φιλάνθρωπε.
ltx/gr_gr_cog/oc.m5.d2:ocMA.OdeW4C22.incipit	Γεώδη τῶν σωμάτων φρονήματα, ἀποβαλώμεθα…
ltx/gr_gr_cog/oc.m5.d2:ocMA.OdeW4C22.melody	@ltx/gr_gr_cog/he.h.m5:heHE.TinTheianEnnoisas.name
ltx/gr_gr_cog/oc.m5.d2:ocMA.OdeW4C22.mode	@ltx/gr_gr_cog/miscellanea:misc.Mode5
ltx/gr_gr_cog/oc.m5.d2:ocMA.OdeW4C22.ode	@ltx/gr_gr_cog/miscellanea:misc.Ode4
ltx/gr_gr_cog/oc.m5.d2:ocMA.OdeW4C22.text	Γεώδη τῶν σωμάτων φρονήματα, ἀποβαλώμεθα πιστοί, τῇ πολιτείᾳ μιμούμενοι, τῶν Ἀσωμάτων τὰς τάξεις, καὶ νοῦν ἀναπτερώσωμεν πνεύματι.
ltx/gr_gr_cog/oc.m5.d2:ocMA.OdeW4C2T.incipit	Γενοῦ μοι προστασία Πανάμωμε, καταφυγή…
ltx/gr_gr_cog/oc.m5.d2:ocMA.OdeW4C2T.melody	@ltx/gr_gr_cog/he.h.m5:heHE.TinTheianEnnoisas.name
ltx/gr_gr_cog/oc.m5.d2:ocMA.OdeW4C2T.mode	@ltx/gr_gr_cog/miscellanea:misc.Mode5
ltx/gr_gr_cog/oc.m5.d2:ocMA.OdeW4C2T.ode	@ltx/gr_gr_cog/miscellanea:misc.Ode4
ltx/gr_gr_cog/oc.m5.d2:ocMA.OdeW4C2T.text	Γενοῦ μοι προστασία Πανάμωμε, καταφυγή τε καὶ λιμήν, παθῶν τὴν ζάλην διώκουσα, ἡ τὰς Ἀγγέλων χορείας, τῷ κάλλει ἀσυγκρίτως νικήσασα.
ltx/gr_gr_cog/oc.m5.d2:ocMA.OdeW5C11.incipit	Ἀνάνηψον ψυχή, ἀνάνηψον ὕπνου, βαρέος…
ltx/gr_gr_cog/oc.m5.d2:ocMA.OdeW5C11.melody	@ltx/gr_gr_cog/he.h.m5:heHE.ToFosToAlithinon.name
ltx/gr_gr_cog/oc.m5.d2:ocMA.OdeW5C11.mode	@ltx/gr_gr_cog/miscellanea:misc.Mode5
ltx/gr_gr_cog/oc.m5.d2:ocMA.OdeW5C11.ode	@ltx/gr_gr_cog/miscellanea:misc.Ode5
ltx/gr_gr_cog/oc.m5.d2:ocMA.OdeW5C11.text	Ἀνάνηψον ψυχή, ἀνάνηψον ὕπνου, βαρέος τῆς ἐμῆς δεινῆς ἁμαρτίας, καὶ μετανοίας φωτὶ περιαυγάζου.
ltx/gr_gr_cog/oc.m5.d2:ocMA.OdeW5C12.incipit	Νεώσωμεν τὴν ψυχήν, διʼ ἐμμελείας…
ltx/gr_gr_cog/oc.m5.d2:ocMA.OdeW5C12.melody	@ltx/gr_gr_cog/he.h.m5:heHE.ToFosToAlithinon.name
ltx/gr_gr_cog/oc.m5.d2:ocMA.OdeW5C12.mode	@ltx/gr_gr_cog/miscellanea:misc.Mode5
ltx/gr_gr_cog/oc.m5.d2:ocMA.OdeW5C12.ode	@ltx/gr_gr_cog/miscellanea:misc.Ode5
ltx/gr_gr_cog/oc.m5.d2:ocMA.OdeW5C12.text	Νεώσωμεν τὴν ψυχήν, διʼ ἐμμελείας, καὶ κατανύξεως ὄμβροις ἀρδευθῶμεν, ὅπως βλαστήσωμεν μετανοίας στάχυν.
ltx/gr_gr_cog/oc.m5.d2:ocMA.OdeW5C13.incipit	Τοῖς ἄνθραξι στομωθέντες, τῆς ἀγάπης…
ltx/gr_gr_cog/oc.m5.d2:ocMA.OdeW5C13.melody	@ltx/gr_gr_cog/he.h.m5:heHE.ToFosToAlithinon.name
ltx/gr_gr_cog/oc.m5.d2:ocMA.OdeW5C13.mode	@ltx/gr_gr_cog/miscellanea:misc.Mode5
ltx/gr_gr_cog/oc.m5.d2:ocMA.OdeW5C13.ode	@ltx/gr_gr_cog/miscellanea:misc.Ode5
ltx/gr_gr_cog/oc.m5.d2:ocMA.OdeW5C13.text	Τοῖς ἄνθραξι στομωθέντες, τῆς ἀγάπης, οὐρανοχάλκευτα ξίφη Ἀθλοφόροι, ἐδείχθητε δυσμενῶν κόπτοντες στίφη.
ltx/gr_gr_cog/oc.m5.d2:ocMA.OdeW5C14.incipit	Ἀδούλωτοι τῷ ἐχθρῷ, γεγενημένοι, κατεδουλώσατε…
ltx/gr_gr_cog/oc.m5.d2:ocMA.OdeW5C14.melody	@ltx/gr_gr_cog/he.h.m5:heHE.ToFosToAlithinon.name
ltx/gr_gr_cog/oc.m5.d2:ocMA.OdeW5C14.mode	@ltx/gr_gr_cog/miscellanea:misc.Mode5
ltx/gr_gr_cog/oc.m5.d2:ocMA.OdeW5C14.ode	@ltx/gr_gr_cog/miscellanea:misc.Ode5
ltx/gr_gr_cog/oc.m5.d2:ocMA.OdeW5C14.text	Ἀδούλωτοι τῷ ἐχθρῷ, γεγενημένοι, κατεδουλώσατε τοῦτον Ἀθλοφόροι, καὶ γνήσιοι τοῦ Χριστοῦ ὤφθητε φίλοι.
ltx/gr_gr_cog/oc.m5.d2:ocMA.OdeW5C1H.greekmelody	@ltx/gr_gr_cog/he.h.m5:heHE.ToFosToAlithinon.greekname
ltx/gr_gr_cog/oc.m5.d2:ocMA.OdeW5C1H.incipit	@ltx/gr_gr_cog/he.h.m5:heHE.ToFosToAlithinon.incipit
ltx/gr_gr_cog/oc.m5.d2:ocMA.OdeW5C1H.melody	@ltx/gr_gr_cog/he.h.m5:heHE.ToFosToAlithinon.melody
ltx/gr_gr_cog/oc.m5.d2:ocMA.OdeW5C1H.mode	@ltx/gr_gr_cog/miscellanea:misc.Mode5
ltx/gr_gr_cog/oc.m5.d2:ocMA.OdeW5C1H.ode	@ltx/gr_gr_cog/miscellanea:misc.Ode5
ltx/gr_gr_cog/oc.m5.d2:ocMA.OdeW5C1H.text	@ltx/gr_gr_cog/he.h.m5:heHE.ToFosToAlithinon.text
ltx/gr_gr_cog/oc.m5.d2:ocMA.OdeW5C1T.incipit	Παρθένε ἐν γυναιξίν, εὐλογημένη, τὰ…
ltx/gr_gr_cog/oc.m5.d2:ocMA.OdeW5C1T.melody	@ltx/gr_gr_cog/he.h.m5:heHE.ToFosToAlithinon.name
ltx/gr_gr_cog/oc.m5.d2:ocMA.OdeW5C1T.mode	@ltx/gr_gr_cog/miscellanea:misc.Mode5
ltx/gr_gr_cog/oc.m5.d2:ocMA.OdeW5C1T.ode	@ltx/gr_gr_cog/miscellanea:misc.Ode5
ltx/gr_gr_cog/oc.m5.d2:ocMA.OdeW5C1T.text	Παρθένε ἐν γυναιξίν, εὐλογημένη, τὰ σὰ ἐλέη παράσχου τῷ λαῷ σου· τοῦ Ἐλεήμονος γὰρ ἐδείχθης Μήτηρ.
ltx/gr_gr_cog/oc.m5.d2:ocMA.OdeW5C21.greekmelody	@ltx/gr_gr_cog/he.h.m5:heHE.OAnavallomenos.greekname
ltx/gr_gr_cog/oc.m5.d2:ocMA.OdeW5C21.incipit	Ἐπιπορευόμενοι, τῆς γῆς τὰ πέρατα…
ltx/gr_gr_cog/oc.m5.d2:ocMA.OdeW5C21.melody	@ltx/gr_gr_cog/he.h.m5:heHE.OAnavallomenos.name
ltx/gr_gr_cog/oc.m5.d2:ocMA.OdeW5C21.mode	@ltx/gr_gr_cog/miscellanea:misc.Mode5
ltx/gr_gr_cog/oc.m5.d2:ocMA.OdeW5C21.ode	@ltx/gr_gr_cog/miscellanea:misc.Ode5
ltx/gr_gr_cog/oc.m5.d2:ocMA.OdeW5C21.text	Ἐπιπορευόμενοι, τῆς γῆς τὰ πέρατα, τὰς τοῦ Δεσπότου εὐεργεσίας, τοῖς πιστοῖς κομίζετε, καὶ περιφρουρεῖτε, πανένδοξοι Ἀρχάγγελοι.
ltx/gr_gr_cog/oc.m5.d2:ocMA.OdeW5C22.incipit	Λόγῳ σου πειθόμενοι, Λόγε Θεοῦ…
ltx/gr_gr_cog/oc.m5.d2:ocMA.OdeW5C22.melody	@ltx/gr_gr_cog/he.h.m5:heHE.OAnavallomenos.name
ltx/gr_gr_cog/oc.m5.d2:ocMA.OdeW5C22.mode	@ltx/gr_gr_cog/miscellanea:misc.Mode5
ltx/gr_gr_cog/oc.m5.d2:ocMA.OdeW5C22.ode	@ltx/gr_gr_cog/miscellanea:misc.Ode5
ltx/gr_gr_cog/oc.m5.d2:ocMA.OdeW5C22.text	Λόγῳ σου πειθόμενοι, Λόγε Θεοῦ καὶ Πατρός, τῆς οὐρανίου ταξιαρχίας, οἱ κλεινοὶ διάκοσμοι, τῷ τῆς σῆς λαμπάδος, φωτὶ περιαυγάζονται.
ltx/gr_gr_cog/oc.m5.d2:ocMA.OdeW5C2T.incipit	Ὅλην μου τὴν ἔφεσιν, πρὸς…
ltx/gr_gr_cog/oc.m5.d2:ocMA.OdeW5C2T.melody	@ltx/gr_gr_cog/he.h.m5:heHE.OAnavallomenos.name
ltx/gr_gr_cog/oc.m5.d2:ocMA.OdeW5C2T.mode	@ltx/gr_gr_cog/miscellanea:misc.Mode5
ltx/gr_gr_cog/oc.m5.d2:ocMA.OdeW5C2T.ode	@ltx/gr_gr_cog/miscellanea:misc.Ode5
ltx/gr_gr_cog/oc.m5.d2:ocMA.OdeW5C2T.text	Ὅλην μου τὴν ἔφεσιν, πρὸς σὲ μετάστησον, τῆς ὑπὲρ λόγον ἐπιθυμίας, γλυκασμὸν ἡ φέρουσα, τοῖς σὲ Θεοτόκον, ἁγνὴν ἐπιγινώσκουσι.
ltx/gr_gr_cog/oc.m5.d2:ocMA.OdeW6C11.incipit	Οὐκ ἔστιν ἐν τῷ βίῳ…
ltx/gr_gr_cog/oc.m5.d2:ocMA.OdeW6C11.melody	@ltx/gr_gr_cog/he.h.m5:heHE.TouKitousTonProfitin.name
ltx/gr_gr_cog/oc.m5.d2:ocMA.OdeW6C11.mode	@ltx/gr_gr_cog/miscellanea:misc.Mode5
ltx/gr_gr_cog/oc.m5.d2:ocMA.OdeW6C11.ode	@ltx/gr_gr_cog/miscellanea:misc.Ode6
ltx/gr_gr_cog/oc.m5.d2:ocMA.OdeW6C11.text	Οὐκ ἔστιν ἐν τῷ βίῳ ἁμαρτία, ἣν μόνος οὐκ ἐτέλεσα ὁ τάλας, μόνε ἀναμάρτητε, οἰκτείρησόν με.
ltx/gr_gr_cog/oc.m5.d2:ocMA.OdeW6C12.incipit	Ἱστίῳ πτερωθῶμεν προθυμίας, καὶ σωτηρίου…
ltx/gr_gr_cog/oc.m5.d2:ocMA.OdeW6C12.melody	@ltx/gr_gr_cog/he.h.m5:heHE.TouKitousTonProfitin.name
ltx/gr_gr_cog/oc.m5.d2:ocMA.OdeW6C12.mode	@ltx/gr_gr_cog/miscellanea:misc.Mode5
ltx/gr_gr_cog/oc.m5.d2:ocMA.OdeW6C12.ode	@ltx/gr_gr_cog/miscellanea:misc.Ode6
ltx/gr_gr_cog/oc.m5.d2:ocMA.OdeW6C12.text	Ἱστίῳ πτερωθῶμεν προθυμίας, καὶ σωτηρίου μετανοίας, ὅπως προφθάσαντες, ἅπαντες σωθείημεν.
ltx/gr_gr_cog/oc.m5.d2:ocMA.OdeW6C13.incipit	Κηρύκων, Ἀποστόλων καὶ Μαρτύρων, τοῖς…
ltx/gr_gr_cog/oc.m5.d2:ocMA.OdeW6C13.melody	@ltx/gr_gr_cog/he.h.m5:heHE.TouKitousTonProfitin.name
ltx/gr_gr_cog/oc.m5.d2:ocMA.OdeW6C13.mode	@ltx/gr_gr_cog/miscellanea:misc.Mode5
ltx/gr_gr_cog/oc.m5.d2:ocMA.OdeW6C13.ode	@ltx/gr_gr_cog/miscellanea:misc.Ode6
ltx/gr_gr_cog/oc.m5.d2:ocMA.OdeW6C13.text	Κηρύκων, Ἀποστόλων καὶ Μαρτύρων, τοῖς ἄθλοις καταυγάζεται ἡ κτίσις, διʼ ὧν ἡμᾶς φώτισον φιλάνθρωπε.
ltx/gr_gr_cog/oc.m5.d2:ocMA.OdeW6C14.incipit	Τὰ σκεύη, τὰ χωρήσαντα τὴν…
ltx/gr_gr_cog/oc.m5.d2:ocMA.OdeW6C14.melody	@ltx/gr_gr_cog/he.h.m5:heHE.TouKitousTonProfitin.name
ltx/gr_gr_cog/oc.m5.d2:ocMA.OdeW6C14.mode	@ltx/gr_gr_cog/miscellanea:misc.Mode5
ltx/gr_gr_cog/oc.m5.d2:ocMA.OdeW6C14.ode	@ltx/gr_gr_cog/miscellanea:misc.Ode6
ltx/gr_gr_cog/oc.m5.d2:ocMA.OdeW6C14.text	Τὰ σκεύη, τὰ χωρήσαντα τὴν αἴγλην, τῆς θείας καὶ σεπτῆς φωτοδοσίας, τοὺς Μάρτυρας ἅπαντες τιμήσωμεν.
ltx/gr_gr_cog/oc.m5.d2:ocMA.OdeW6C1H.greekmelody	@ltx/gr_gr_cog/he.h.m5:heHE.TouKitousTonProfitin.greekname
ltx/gr_gr_cog/oc.m5.d2:ocMA.OdeW6C1H.incipit	@ltx/gr_gr_cog/he.h.m5:heHE.TouKitousTonProfitin.incipit
ltx/gr_gr_cog/oc.m5.d2:ocMA.OdeW6C1H.melody	@ltx/gr_gr_cog/he.h.m5:heHE.TouKitousTonProfitin.melody
ltx/gr_gr_cog/oc.m5.d2:ocMA.OdeW6C1H.mode	@ltx/gr_gr_cog/miscellanea:misc.Mode5
ltx/gr_gr_cog/oc.m5.d2:ocMA.OdeW6C1H.ode	@ltx/gr_gr_cog/miscellanea:misc.Ode6
ltx/gr_gr_cog/oc.m5.d2:ocMA.OdeW6C1H.text	@ltx/gr_gr_cog/he.h.m5:heHE.TouKitousTonProfitin.text
ltx/gr_gr_cog/oc.m5.d2:ocMA.OdeW6C1T.incipit	Παρθένε τῶν πιστῶν ἡ προστασία…
ltx/gr_gr_cog/oc.m5.d2:ocMA.OdeW6C1T.melody	@ltx/gr_gr_cog/he.h.m5:heHE.TouKitousTonProfitin.name
ltx/gr_gr_cog/oc.m5.d2:ocMA.OdeW6C1T.mode	@ltx/gr_gr_cog/miscellanea:misc.Mode5
ltx/gr_gr_cog/oc.m5.d2:ocMA.OdeW6C1T.ode	@ltx/gr_gr_cog/miscellanea:misc.Ode6
ltx/gr_gr_cog/oc.m5.d2:ocMA.OdeW6C1T.text	Παρθένε τῶν πιστῶν ἡ προστασία, ῥυσθῆναι ἀπὸ πάσης ἁμαρτίας, δυσώπει τὸν Κύριον, τοὺς δούλους σου.
ltx/gr_gr_cog/oc.m5.d2:ocMA.OdeW6C21.greekmelody	@ltx/gr_gr_cog/he.h.m5:heHE.MainomeninKlydoni.greekname
ltx/gr_gr_cog/oc.m5.d2:ocMA.OdeW6C21.incipit	Ἱερῶς κοσμούμενοι, τῶν Ἀγγέλων δῆμοι…
ltx/gr_gr_cog/oc.m5.d2:ocMA.OdeW6C21.melody	@ltx/gr_gr_cog/he.h.m5:heHE.MainomeninKlydoni.name
ltx/gr_gr_cog/oc.m5.d2:ocMA.OdeW6C21.mode	@ltx/gr_gr_cog/miscellanea:misc.Mode5
ltx/gr_gr_cog/oc.m5.d2:ocMA.OdeW6C21.ode	@ltx/gr_gr_cog/miscellanea:misc.Ode6
ltx/gr_gr_cog/oc.m5.d2:ocMA.OdeW6C21.text	Ἱερῶς κοσμούμενοι, τῶν Ἀγγέλων δῆμοι ἐκλεκτοί, φωτοδότοις λάμψεσι φαιδρύνονται, τὰς θεουργοὺς ἐκφαντορίας μιμούμενοι.
ltx/gr_gr_cog/oc.m5.d2:ocMA.OdeW6C2T.incipit	Συνέλαβες Ἄχραντε, τὸν τῶν ὅλων…
ltx/gr_gr_cog/oc.m5.d2:ocMA.OdeW6C2T.melody	@ltx/gr_gr_cog/he.h.m5:heHE.MainomeninKlydoni.name
ltx/gr_gr_cog/oc.m5.d2:ocMA.OdeW6C2T.mode	@ltx/gr_gr_cog/miscellanea:misc.Mode5
ltx/gr_gr_cog/oc.m5.d2:ocMA.OdeW6C2T.ode	@ltx/gr_gr_cog/miscellanea:misc.Ode6
ltx/gr_gr_cog/oc.m5.d2:ocMA.OdeW6C2T.text	Συνέλαβες Ἄχραντε, τὸν τῶν ὅλων κτίστην καὶ Θεόν, ὃν σὺν τρόμῳ βλέπουσι γηθόμενοι, πανευλαβῶς παρεστηκότες οἱ Ἄγγελοι.
ltx/gr_gr_cog/oc.m5.d2:ocMA.OdeW7C11.incipit	Εὐλογητὸς εἶ ὁ Θεός, ὁ…
ltx/gr_gr_cog/oc.m5.d2:ocMA.OdeW7C11.melody	@ltx/gr_gr_cog/he.h.m5:heHE.EvlogitosEiOTheos.name
ltx/gr_gr_cog/oc.m5.d2:ocMA.OdeW7C11.mode	@ltx/gr_gr_cog/miscellanea:misc.Mode5
ltx/gr_gr_cog/oc.m5.d2:ocMA.OdeW7C11.ode	@ltx/gr_gr_cog/miscellanea:misc.Ode7
ltx/gr_gr_cog/oc.m5.d2:ocMA.OdeW7C11.text	Εὐλογητὸς εἶ ὁ Θεός, ὁ διʼ εὐσπλαγχνίαν, μετανοοῦντας πάντας δεχόμενος, ὁ ὑπερύμνητος, καὶ ὑπερένδοξος.
ltx/gr_gr_cog/oc.m5.d2:ocMA.OdeW7C12.incipit	Ἴασαι εὔσπλαγχνε Σωτήρ, τὰ πολλὰ…
ltx/gr_gr_cog/oc.m5.d2:ocMA.OdeW7C12.melody	@ltx/gr_gr_cog/he.h.m5:heHE.EvlogitosEiOTheos.name
ltx/gr_gr_cog/oc.m5.d2:ocMA.OdeW7C12.mode	@ltx/gr_gr_cog/miscellanea:misc.Mode5
ltx/gr_gr_cog/oc.m5.d2:ocMA.OdeW7C12.ode	@ltx/gr_gr_cog/miscellanea:misc.Ode7
ltx/gr_gr_cog/oc.m5.d2:ocMA.OdeW7C12.text	Ἴασαι εὔσπλαγχνε Σωτήρ, τὰ πολλά μου πάθη, ὁ τὴν ἐμὴν γινώσκων ἀσθένειαν, ὁ ὑπερύμνητος, καὶ ὑπερένδοξος.
ltx/gr_gr_cog/oc.m5.d2:ocMA.OdeW7C13.incipit	Ῥώμῃ τῇ θείᾳ κρατυνθείς, χορὸς…
ltx/gr_gr_cog/oc.m5.d2:ocMA.OdeW7C13.melody	@ltx/gr_gr_cog/he.h.m5:heHE.EvlogitosEiOTheos.name
ltx/gr_gr_cog/oc.m5.d2:ocMA.OdeW7C13.mode	@ltx/gr_gr_cog/miscellanea:misc.Mode5
ltx/gr_gr_cog/oc.m5.d2:ocMA.OdeW7C13.ode	@ltx/gr_gr_cog/miscellanea:misc.Ode7
ltx/gr_gr_cog/oc.m5.d2:ocMA.OdeW7C13.text	Ῥώμῃ τῇ θείᾳ κρατυνθείς, χορὸς Ἀθλοφόρων, τοὺς δυσμενεῖς βοῶν κατεπάλαισεν, ὁ ὑπερύμνητος, καὶ ὑπερένδοξος.
ltx/gr_gr_cog/oc.m5.d2:ocMA.OdeW7C14.incipit	Ὁ ἐνισχύσας τοὺς σοφούς, Ἀθλοφόρους…
ltx/gr_gr_cog/oc.m5.d2:ocMA.OdeW7C14.melody	@ltx/gr_gr_cog/he.h.m5:heHE.EvlogitosEiOTheos.name
ltx/gr_gr_cog/oc.m5.d2:ocMA.OdeW7C14.mode	@ltx/gr_gr_cog/miscellanea:misc.Mode5
ltx/gr_gr_cog/oc.m5.d2:ocMA.OdeW7C14.ode	@ltx/gr_gr_cog/miscellanea:misc.Ode7
ltx/gr_gr_cog/oc.m5.d2:ocMA.OdeW7C14.text	Ὁ ἐνισχύσας τοὺς σοφούς, Ἀθλοφόρους Λόγε, ὑπενεγκεῖν πολύπλοκα βάσανα, δεήσεσιν αὐτῶν, πάντας οἴκτειρον.
ltx/gr_gr_cog/oc.m5.d2:ocMA.OdeW7C1H.greekmelody	@ltx/gr_gr_cog/he.h.m5:heHE.EvlogitosEiOTheos.greekname
ltx/gr_gr_cog/oc.m5.d2:ocMA.OdeW7C1H.incipit	@ltx/gr_gr_cog/he.h.m5:heHE.EvlogitosEiOTheos.incipit
ltx/gr_gr_cog/oc.m5.d2:ocMA.OdeW7C1H.melody	@ltx/gr_gr_cog/he.h.m5:heHE.EvlogitosEiOTheos.melody
ltx/gr_gr_cog/oc.m5.d2:ocMA.OdeW7C1H.mode	@ltx/gr_gr_cog/miscellanea:misc.Mode5
ltx/gr_gr_cog/oc.m5.d2:ocMA.OdeW7C1H.ode	@ltx/gr_gr_cog/miscellanea:misc.Ode7
ltx/gr_gr_cog/oc.m5.d2:ocMA.OdeW7C1H.text	@ltx/gr_gr_cog/he.h.m5:heHE.EvlogitosEiOTheos.text
ltx/gr_gr_cog/oc.m5.d2:ocMA.OdeW7C1T.incipit	Εὐλογητὸς εἶ ὁ Θεός, ὁ…
ltx/gr_gr_cog/oc.m5.d2:ocMA.OdeW7C1T.melody	@ltx/gr_gr_cog/he.h.m5:heHE.EvlogitosEiOTheos.name
ltx/gr_gr_cog/oc.m5.d2:ocMA.OdeW7C1T.mode	@ltx/gr_gr_cog/miscellanea:misc.Mode5
ltx/gr_gr_cog/oc.m5.d2:ocMA.OdeW7C1T.ode	@ltx/gr_gr_cog/miscellanea:misc.Ode7
ltx/gr_gr_cog/oc.m5.d2:ocMA.OdeW7C1T.text	Εὐλογητὸς εἶ ὁ Θεός, ὁ μήτραν Παρθένου, καθυποδὺς καὶ σώσας τὸν ἄνθρωπον, ὁ ὑπερύμνητος, καὶ ὑπερένδοξος.
ltx/gr_gr_cog/oc.m5.d2:ocMA.OdeW7C21.greekmelody	@ltx/gr_gr_cog/he.h.m5:heHE.OYperypsoumenos.greekname
ltx/gr_gr_cog/oc.m5.d2:ocMA.OdeW7C21.incipit	Τὴν ἀπειροδύναμον, ἀναφαίνων δύναμιν, ὑμᾶς…
ltx/gr_gr_cog/oc.m5.d2:ocMA.OdeW7C21.melody	@ltx/gr_gr_cog/he.h.m5:heHE.OYperypsoumenos.name
ltx/gr_gr_cog/oc.m5.d2:ocMA.OdeW7C21.mode	@ltx/gr_gr_cog/miscellanea:misc.Mode5
ltx/gr_gr_cog/oc.m5.d2:ocMA.OdeW7C21.ode	@ltx/gr_gr_cog/miscellanea:misc.Ode7
ltx/gr_gr_cog/oc.m5.d2:ocMA.OdeW7C21.text	Τὴν ἀπειροδύναμον, ἀναφαίνων δύναμιν, ὑμᾶς Ἀρχιστράτηγοι, Χριστὸς ὑπεστήσατο, διδάξας ἀναμέλπειν, ὁ Θεὸς εὐλογητὸς εἶ.
ltx/gr_gr_cog/oc.m5.d2:ocMA.OdeW7C22.incipit	Ὁ πληθὺν ἀμέτρητον, Ἀσωμάτων τάξεων…
ltx/gr_gr_cog/oc.m5.d2:ocMA.OdeW7C22.melody	@ltx/gr_gr_cog/he.h.m5:heHE.OYperypsoumenos.name
ltx/gr_gr_cog/oc.m5.d2:ocMA.OdeW7C22.mode	@ltx/gr_gr_cog/miscellanea:misc.Mode5
ltx/gr_gr_cog/oc.m5.d2:ocMA.OdeW7C22.ode	@ltx/gr_gr_cog/miscellanea:misc.Ode7
ltx/gr_gr_cog/oc.m5.d2:ocMA.OdeW7C22.text	Ὁ πληθὺν ἀμέτρητον, Ἀσωμάτων τάξεων, κοσμῶν ἀγαθότητι, πιστῶν τὰ συστήματα, ἀξίωσον ὑμνεῖν σε, ὁ Θεὸς εὐλογητὸς εἶ.
ltx/gr_gr_cog/oc.m5.d2:ocMA.OdeW7C2T.incipit	Πάθεσι κλονούμενον, σύ με νῦν…
ltx/gr_gr_cog/oc.m5.d2:ocMA.OdeW7C2T.melody	@ltx/gr_gr_cog/he.h.m5:heHE.OYperypsoumenos.name
ltx/gr_gr_cog/oc.m5.d2:ocMA.OdeW7C2T.mode	@ltx/gr_gr_cog/miscellanea:misc.Mode5
ltx/gr_gr_cog/oc.m5.d2:ocMA.OdeW7C2T.ode	@ltx/gr_gr_cog/miscellanea:misc.Ode7
ltx/gr_gr_cog/oc.m5.d2:ocMA.OdeW7C2T.text	Πάθεσι κλονούμενον, σύ με νῦν στερέωσον, ἡ πᾶσι πηγάσασα, πιστοῖς τὴν ἀπάθειαν, τοῖς πίστει μελῳδοῦσιν, ὁ Θεὸς εὐλογητὸς εἶ.
ltx/gr_gr_cog/oc.m5.d2:ocMA.OdeW8C11.incipit	Νεκρὸν ταῖς παραβάσεσι, γενόμενον Κύριε…
ltx/gr_gr_cog/oc.m5.d2:ocMA.OdeW8C11.melody	@ltx/gr_gr_cog/he.h.m5:heHE.TonPoiitinTisKtiseos.name
ltx/gr_gr_cog/oc.m5.d2:ocMA.OdeW8C11.mode	@ltx/gr_gr_cog/miscellanea:misc.Mode5
ltx/gr_gr_cog/oc.m5.d2:ocMA.OdeW8C11.ode	@ltx/gr_gr_cog/miscellanea:misc.Ode8
ltx/gr_gr_cog/oc.m5.d2:ocMA.OdeW8C11.text	Νεκρὸν ταῖς παραβάσεσι, γενόμενον Κύριε, ζώωσόν με, ἵνα σε δοξάζω, εἰς πάντας τοὺς αἰῶνας.
ltx/gr_gr_cog/oc.m5.d2:ocMA.OdeW8C12.incipit	Λαμπρύνας μετανοίᾳ με, σκότους ἁμαρτίας…
ltx/gr_gr_cog/oc.m5.d2:ocMA.OdeW8C12.melody	@ltx/gr_gr_cog/he.h.m5:heHE.TonPoiitinTisKtiseos.name
ltx/gr_gr_cog/oc.m5.d2:ocMA.OdeW8C12.mode	@ltx/gr_gr_cog/miscellanea:misc.Mode5
ltx/gr_gr_cog/oc.m5.d2:ocMA.OdeW8C12.ode	@ltx/gr_gr_cog/miscellanea:misc.Ode8
ltx/gr_gr_cog/oc.m5.d2:ocMA.OdeW8C12.text	Λαμπρύνας μετανοίᾳ με, σκότους ἁμαρτίας ῥῦσαι Κύριε, ἵνα σε δοξάζω, εἰς πάντας τοὺς αἰῶνας.
ltx/gr_gr_cog/oc.m5.d2:ocMA.OdeW8C13.incipit	Οἱ ἀθλοφόροι Μάρτυρες, τὴν φλόγα…
ltx/gr_gr_cog/oc.m5.d2:ocMA.OdeW8C13.melody	@ltx/gr_gr_cog/he.h.m5:heHE.TonPoiitinTisKtiseos.name
ltx/gr_gr_cog/oc.m5.d2:ocMA.OdeW8C13.mode	@ltx/gr_gr_cog/miscellanea:misc.Mode5
ltx/gr_gr_cog/oc.m5.d2:ocMA.OdeW8C13.ode	@ltx/gr_gr_cog/miscellanea:misc.Ode8
ltx/gr_gr_cog/oc.m5.d2:ocMA.OdeW8C13.text	Οἱ ἀθλοφόροι Μάρτυρες, τὴν φλόγα τῆς πλάνης κατεπάτησαν, δρόσον οὐρανόθεν, λαβόντες παραδόξως.
ltx/gr_gr_cog/oc.m5.d2:ocMA.OdeW8C14.incipit	Γῆ ὥσπερ πίων Ἅγιοι, στάχυν…
ltx/gr_gr_cog/oc.m5.d2:ocMA.OdeW8C14.melody	@ltx/gr_gr_cog/he.h.m5:heHE.TonPoiitinTisKtiseos.name
ltx/gr_gr_cog/oc.m5.d2:ocMA.OdeW8C14.mode	@ltx/gr_gr_cog/miscellanea:misc.Mode5
ltx/gr_gr_cog/oc.m5.d2:ocMA.OdeW8C14.ode	@ltx/gr_gr_cog/miscellanea:misc.Ode8
ltx/gr_gr_cog/oc.m5.d2:ocMA.OdeW8C14.text	Γῆ ὥσπερ πίων Ἅγιοι, στάχυν ἀληθῶς ἑκατοστεύοντα, τῷ ἀγωνοθέτῃ Χριστῷ καρποφορεῖτε.
ltx/gr_gr_cog/oc.m5.d2:ocMA.OdeW8C1H.greekmelody	@ltx/gr_gr_cog/he.h.m5:heHE.TonPoiitinTisKtiseos.greekname
ltx/gr_gr_cog/oc.m5.d2:ocMA.OdeW8C1H.incipit	@ltx/gr_gr_cog/he.h.m5:heHE.TonPoiitinTisKtiseos.incipit
ltx/gr_gr_cog/oc.m5.d2:ocMA.OdeW8C1H.melody	@ltx/gr_gr_cog/he.h.m5:heHE.TonPoiitinTisKtiseos.melody
ltx/gr_gr_cog/oc.m5.d2:ocMA.OdeW8C1H.mode	@ltx/gr_gr_cog/miscellanea:misc.Mode5
ltx/gr_gr_cog/oc.m5.d2:ocMA.OdeW8C1H.ode	@ltx/gr_gr_cog/miscellanea:misc.Ode8
ltx/gr_gr_cog/oc.m5.d2:ocMA.OdeW8C1H.text	@ltx/gr_gr_cog/he.h.m5:heHE.TonPoiitinTisKtiseos.text
ltx/gr_gr_cog/oc.m5.d2:ocMA.OdeW8C1T.incipit	Ἐκ σοῦ Θεὸς ἀνέτειλε, καὶ…
ltx/gr_gr_cog/oc.m5.d2:ocMA.OdeW8C1T.melody	@ltx/gr_gr_cog/he.h.m5:heHE.TonPoiitinTisKtiseos.name
ltx/gr_gr_cog/oc.m5.d2:ocMA.OdeW8C1T.mode	@ltx/gr_gr_cog/miscellanea:misc.Mode5
ltx/gr_gr_cog/oc.m5.d2:ocMA.OdeW8C1T.ode	@ltx/gr_gr_cog/miscellanea:misc.Ode8
ltx/gr_gr_cog/oc.m5.d2:ocMA.OdeW8C1T.text	Ἐκ σοῦ Θεὸς ἀνέτειλε, καὶ θεογνωσίᾳ κατελάμπρυνε, τοὺς ἐσκοτισμένους, πανύμνητε Παρθένε.
ltx/gr_gr_cog/oc.m5.d2:ocMA.OdeW8C21.greekmelody	@ltx/gr_gr_cog/he.h.m5:heHE.SoiToPantourgo.greekname
ltx/gr_gr_cog/oc.m5.d2:ocMA.OdeW8C21.incipit	Ἕλκει με τὰ νῦν, τοὺς…
ltx/gr_gr_cog/oc.m5.d2:ocMA.OdeW8C21.melody	@ltx/gr_gr_cog/he.h.m5:heHE.SoiToPantourgo.name
ltx/gr_gr_cog/oc.m5.d2:ocMA.OdeW8C21.mode	@ltx/gr_gr_cog/miscellanea:misc.Mode5
ltx/gr_gr_cog/oc.m5.d2:ocMA.OdeW8C21.ode	@ltx/gr_gr_cog/miscellanea:misc.Ode8
ltx/gr_gr_cog/oc.m5.d2:ocMA.OdeW8C21.text	Ἕλκει με τὰ νῦν, τοὺς τῶν Ἀγγέλων δήμους, ὑμνῆσαι τοῖς ᾄσμασι, καρδίας ἔφεσις, οἷς περ συμμέλπω. Τὸν Κύριον ὑμνεῖτε, καὶ ὑπερυψοῦτε εἰς πάντας τοὺς αἰῶνας.
ltx/gr_gr_cog/oc.m5.d2:ocMA.OdeW8C22.incipit	Μύσται τῆς ἁπλῆς, καὶ τρισηλίου…
ltx/gr_gr_cog/oc.m5.d2:ocMA.OdeW8C22.melody	@ltx/gr_gr_cog/he.h.m5:heHE.SoiToPantourgo.name
ltx/gr_gr_cog/oc.m5.d2:ocMA.OdeW8C22.mode	@ltx/gr_gr_cog/miscellanea:misc.Mode5
ltx/gr_gr_cog/oc.m5.d2:ocMA.OdeW8C22.ode	@ltx/gr_gr_cog/miscellanea:misc.Ode8
ltx/gr_gr_cog/oc.m5.d2:ocMA.OdeW8C22.text	Μύσται τῆς ἁπλῆς, καὶ τρισηλίου αἴγλης, σωθῆναι πρεσβεύσατε, τοὺς πίστει μέλποντας. Πάντα τὰ ἔργα, τὸν Κύριον ὑμνεῖτε, καὶ ὑπερυψοῦτε εἰς πάντας τοὺς αἰῶνας.
ltx/gr_gr_cog/oc.m5.d2:ocMA.OdeW8C2T.incipit	Πύλη τοῦ φωτός, παρθενομῆτορ Κόρη…
ltx/gr_gr_cog/oc.m5.d2:ocMA.OdeW8C2T.melody	@ltx/gr_gr_cog/he.h.m5:heHE.SoiToPantourgo.name
ltx/gr_gr_cog/oc.m5.d2:ocMA.OdeW8C2T.mode	@ltx/gr_gr_cog/miscellanea:misc.Mode5
ltx/gr_gr_cog/oc.m5.d2:ocMA.OdeW8C2T.ode	@ltx/gr_gr_cog/miscellanea:misc.Ode8
ltx/gr_gr_cog/oc.m5.d2:ocMA.OdeW8C2T.text	Πύλη τοῦ φωτός, παρθενομῆτορ Κόρη, φωτί σου καταύγασον, τοὺς σοὶ προστρέχοντας· σὺ γὰρ ὑπάρχεις, ἐλπὶς καὶ προστασία, μόνη Παναγία, ἀεὶ εὐλογημένη.
ltx/gr_gr_cog/oc.m5.d2:ocMA.OdeW9C11.incipit	Ἵλεως γενοῦ μοι Κύριε, ἄμετρα…
ltx/gr_gr_cog/oc.m5.d2:ocMA.OdeW9C11.melody	@ltx/gr_gr_cog/he.h.m5:heHE.SeTinMakarianEnGynaixi.name
ltx/gr_gr_cog/oc.m5.d2:ocMA.OdeW9C11.mode	@ltx/gr_gr_cog/miscellanea:misc.Mode5
ltx/gr_gr_cog/oc.m5.d2:ocMA.OdeW9C11.ode	@ltx/gr_gr_cog/miscellanea:misc.Ode9
ltx/gr_gr_cog/oc.m5.d2:ocMA.OdeW9C11.text	Ἵλεως γενοῦ μοι Κύριε, ἄμετρα ἀφρόνως πταίσαντι, καὶ τῆς σῆς με Λόγε, Βασιλείας καταξίωσον.
ltx/gr_gr_cog/oc.m5.d2:ocMA.OdeW9C12.incipit	Ὡς τοὺς Νινευΐτας ἔσωσας, πάλαι…
ltx/gr_gr_cog/oc.m5.d2:ocMA.OdeW9C12.melody	@ltx/gr_gr_cog/he.h.m5:heHE.SeTinMakarianEnGynaixi.name
ltx/gr_gr_cog/oc.m5.d2:ocMA.OdeW9C12.mode	@ltx/gr_gr_cog/miscellanea:misc.Mode5
ltx/gr_gr_cog/oc.m5.d2:ocMA.OdeW9C12.ode	@ltx/gr_gr_cog/miscellanea:misc.Ode9
ltx/gr_gr_cog/oc.m5.d2:ocMA.OdeW9C12.text	Ὡς τοὺς Νινευΐτας ἔσωσας, πάλαι μεταγνόντας μόνε Σωτήρ, καὶ ἡμᾶς τοὺς ὑμνοῦντάς σε, σῶσον τῷ ἐλέει σου.
ltx/gr_gr_cog/oc.m5.d2:ocMA.OdeW9C13.incipit	Σάρκα παραδόντες πάσαις πληγαῖς, ἄπληγον…
ltx/gr_gr_cog/oc.m5.d2:ocMA.OdeW9C13.melody	@ltx/gr_gr_cog/he.h.m5:heHE.SeTinMakarianEnGynaixi.name
ltx/gr_gr_cog/oc.m5.d2:ocMA.OdeW9C13.mode	@ltx/gr_gr_cog/miscellanea:misc.Mode5
ltx/gr_gr_cog/oc.m5.d2:ocMA.OdeW9C13.ode	@ltx/gr_gr_cog/miscellanea:misc.Ode9
ltx/gr_gr_cog/oc.m5.d2:ocMA.OdeW9C13.text	Σάρκα παραδόντες πάσαις πληγαῖς, ἄπληγον ἐσώσατε ψυχήν, Ἀθλοφόροι Κυρίου, τῆς θείας δόξης μέτοχοι.
ltx/gr_gr_cog/oc.m5.d2:ocMA.OdeW9C14.incipit	Ἡμεροφαεῖς ἀστέρες ἐν γῇ, πάντων…
ltx/gr_gr_cog/oc.m5.d2:ocMA.OdeW9C14.melody	@ltx/gr_gr_cog/he.h.m5:heHE.SeTinMakarianEnGynaixi.name
ltx/gr_gr_cog/oc.m5.d2:ocMA.OdeW9C14.mode	@ltx/gr_gr_cog/miscellanea:misc.Mode5
ltx/gr_gr_cog/oc.m5.d2:ocMA.OdeW9C14.ode	@ltx/gr_gr_cog/miscellanea:misc.Ode9
ltx/gr_gr_cog/oc.m5.d2:ocMA.OdeW9C14.text	Ἡμεροφαεῖς ἀστέρες ἐν γῇ, πάντων καταυγάζοντες τὰς ψυχάς, Ἀθλοφόροι τοῦ πάντων, Κυρίου ἀνεδείχθητε.
ltx/gr_gr_cog/oc.m5.d2:ocMA.OdeW9C1H.greekmelody	@ltx/gr_gr_cog/he.h.m5:heHE.SeTinMakarianEnGynaixi.greekname
ltx/gr_gr_cog/oc.m5.d2:ocMA.OdeW9C1H.incipit	@ltx/gr_gr_cog/he.h.m5:heHE.SeTinMakarianEnGynaixi.incipit
ltx/gr_gr_cog/oc.m5.d2:ocMA.OdeW9C1H.melody	@ltx/gr_gr_cog/he.h.m5:heHE.SeTinMakarianEnGynaixi.melody
ltx/gr_gr_cog/oc.m5.d2:ocMA.OdeW9C1H.mode	@ltx/gr_gr_cog/miscellanea:misc.Mode5
ltx/gr_gr_cog/oc.m5.d2:ocMA.OdeW9C1H.ode	@ltx/gr_gr_cog/miscellanea:misc.Ode9
ltx/gr_gr_cog/oc.m5.d2:ocMA.OdeW9C1H.text	@ltx/gr_gr_cog/he.h.m5:heHE.SeTinMakarianEnGynaixi.text
ltx/gr_gr_cog/oc.m5.d2:ocMA.OdeW9C1T.incipit	Φέρεις ὥσπερ θρόνος πύρινος, νεύματι…
ltx/gr_gr_cog/oc.m5.d2:ocMA.OdeW9C1T.melody	@ltx/gr_gr_cog/he.h.m5:heHE.SeTinMakarianEnGynaixi.name
ltx/gr_gr_cog/oc.m5.d2:ocMA.OdeW9C1T.mode	@ltx/gr_gr_cog/miscellanea:misc.Mode5
ltx/gr_gr_cog/oc.m5.d2:ocMA.OdeW9C1T.ode	@ltx/gr_gr_cog/miscellanea:misc.Ode9
ltx/gr_gr_cog/oc.m5.d2:ocMA.OdeW9C1T.text	Φέρεις ὥσπερ θρόνος πύρινος, νεύματι τὸν πάντα φέροντα, καὶ θηλάζεις Παρθένε, τὸν πάντα διατρέφοντα.
ltx/gr_gr_cog/oc.m5.d2:ocMA.OdeW9C21.greekmelody	@ltx/gr_gr_cog/he.h.m5:heHE.IsaiaChoreve.greekname
ltx/gr_gr_cog/oc.m5.d2:ocMA.OdeW9C21.incipit	Τῶν ταγμάτων ἔξαρχοι, πεφυκότες τῶν…
ltx/gr_gr_cog/oc.m5.d2:ocMA.OdeW9C21.melody	@ltx/gr_gr_cog/he.h.m5:heHE.IsaiaChoreve.name
ltx/gr_gr_cog/oc.m5.d2:ocMA.OdeW9C21.mode	@ltx/gr_gr_cog/miscellanea:misc.Mode5
ltx/gr_gr_cog/oc.m5.d2:ocMA.OdeW9C21.ode	@ltx/gr_gr_cog/miscellanea:misc.Ode9
ltx/gr_gr_cog/oc.m5.d2:ocMA.OdeW9C21.text	Τῶν ταγμάτων ἔξαρχοι, πεφυκότες τῶν Ἀγγελικῶν, φαιδρότατε Μιχαήλ, θεῖε Γαβριήλ, τῆς θείας σαρκώσεως, παναληθής, κήρυξ γεγονώς, πάντας φρουρήσατε, τοὺς ὑμνοῦντας ὑμᾶς ἔνδοξοι.
ltx/gr_gr_cog/oc.m5.d2:ocMA.OdeW9C22.incipit	Ὁ πλουσίαις δόσεσιν, ὑπερχέων σοῦ…
ltx/gr_gr_cog/oc.m5.d2:ocMA.OdeW9C22.melody	@ltx/gr_gr_cog/he.h.m5:heHE.IsaiaChoreve.name
ltx/gr_gr_cog/oc.m5.d2:ocMA.OdeW9C22.mode	@ltx/gr_gr_cog/miscellanea:misc.Mode5
ltx/gr_gr_cog/oc.m5.d2:ocMA.OdeW9C22.ode	@ltx/gr_gr_cog/miscellanea:misc.Ode9
ltx/gr_gr_cog/oc.m5.d2:ocMA.OdeW9C22.text	Ὁ πλουσίαις δόσεσιν, ὑπερχέων σοῦ τὸν θησαυρόν, ὁ τάξεις παραγαγών, τὰς Ἀγγελικάς, μεθʼ ὧν ἐλευσόμενος, οἷα κριτής, πάντων καὶ Θεός, φεῖσαί μου Δέσποτα, προσπεφευγότος τῷ ἐλέει σου.
ltx/gr_gr_cog/oc.m5.d2:ocMA.OdeW9C2T.incipit	Νοερῶς Ἀρχάγγελοι, Ἐξουσίαι, θρόνοι Χερουβείμ…
ltx/gr_gr_cog/oc.m5.d2:ocMA.OdeW9C2T.melody	@ltx/gr_gr_cog/he.h.m5:heHE.IsaiaChoreve.name
ltx/gr_gr_cog/oc.m5.d2:ocMA.OdeW9C2T.mode	@ltx/gr_gr_cog/miscellanea:misc.Mode5
ltx/gr_gr_cog/oc.m5.d2:ocMA.OdeW9C2T.ode	@ltx/gr_gr_cog/miscellanea:misc.Ode9
ltx/gr_gr_cog/oc.m5.d2:ocMA.OdeW9C2T.text	Νοερῶς Ἀρχάγγελοι, Ἐξουσίαι, θρόνοι Χερουβείμ, Δυνάμεις καὶ Σεραφείμ, Ἄγγελοι φαιδροί, Ἀρχαί, Κυριότητες, τῷ σῷ Υἱῷ, ἄχραντε σεμνή, τρόμῳ λατρεύουσι, Θεοτόκε παμμακάριστε.
ltx/gr_gr_cog/oc.m5.d2:ocVE.ApolTheotokionVM.incipit	Μετὰ Ἀγγέλων τὰ οὐράνια, μετὰ…
ltx/gr_gr_cog/oc.m5.d2:ocVE.ApolTheotokionVM.melody	
ltx/gr_gr_cog/oc.m5.d2:ocVE.ApolTheotokionVM.mode	@ltx/gr_gr_cog/miscellanea:misc.Mode5
ltx/gr_gr_cog/oc.m5.d2:ocVE.ApolTheotokionVM.text	Μετὰ Ἀγγέλων τὰ οὐράνια, μετὰ ἀνθρώπων τὰ ἐπίγεια, ἐν φωνῇ ἀγαλλιάσεως, Θεοτόκε βοῶμέν σοι· Χαῖρε πύλη, τῶν οὐρανῶν πλατυτέρα, χαῖρε μόνη, τῶν γηγενῶν σωτηρία, χαῖρε σεμνὴ Κεχαριτωμένη, ἡ τεκοῦσα Θεὸν σεσαρκωμένον.
ltx/gr_gr_cog/oc.m5.d2:ocVE.AposTheotokion.incipit	Φοβερὸν καὶ παράδοξον, καὶ μέγα…
ltx/gr_gr_cog/oc.m5.d2:ocVE.AposTheotokion.melody	
ltx/gr_gr_cog/oc.m5.d2:ocVE.AposTheotokion.mode	@ltx/gr_gr_cog/miscellanea:misc.Mode5
ltx/gr_gr_cog/oc.m5.d2:ocVE.AposTheotokion.text	Φοβερὸν καὶ παράδοξον, καὶ μέγα τὸ μυστήριον! ὁ ἀχώρητος ἐν γαστρὶ ἐχωρήθη, καὶ ἡ μήτηρ μετὰ τὸν τόκον Παρθένος πάλιν διέμεινε. Θεὸν γὰρ ἐγέννησεν, ἐξ αὐτῆς σαρκωθέντα. Αὐτῷ βοήσωμεν, αὐτῷ τὸν ὕμνον εἴπωμεν, σὺν Ἀγγέλοις ἀναμέλποντες· Ἅγιος εἶ Χριστὸς ὁ Θεός, ὁ διʼ ἡμᾶς ἐνανθρωπήσας δόξα σοι.
ltx/gr_gr_cog/oc.m5.d2:ocVE.Aposticha1.incipit	Κύριε, ἁμαρτάνων οὐ παύομαι, φιλανθρωπίας…
ltx/gr_gr_cog/oc.m5.d2:ocVE.Aposticha1.melody	
ltx/gr_gr_cog/oc.m5.d2:ocVE.Aposticha1.mode	@ltx/gr_gr_cog/miscellanea:misc.Mode5
ltx/gr_gr_cog/oc.m5.d2:ocVE.Aposticha1.text	Κύριε, ἁμαρτάνων οὐ παύομαι, φιλανθρωπίας ἀξιούμενος, οὐ γινώσκω, νίκησόν μου τὴν πώρωσιν, μόνε ἀγαθέ, καὶ ἐλέησόν με.
ltx/gr_gr_cog/oc.m5.d2:ocVE.Aposticha2.incipit	Κύριε, καὶ τὸν φόβον σου…
ltx/gr_gr_cog/oc.m5.d2:ocVE.Aposticha2.melody	
ltx/gr_gr_cog/oc.m5.d2:ocVE.Aposticha2.mode	@ltx/gr_gr_cog/miscellanea:misc.Mode5
ltx/gr_gr_cog/oc.m5.d2:ocVE.Aposticha2.text	Κύριε, καὶ τὸν φόβον σου πτοοῦμαι, καὶ τὸ πονηρὸν ποιεῖν οὐ παύομαι, τίς ἐν δικαστηρίῳ τὸν δικαστὴν οὐ πτοεῖται; ἢ τίς ἰαθῆναι βουλόμενος, τὸν ἰατρὸν παροργίζει ὡς κᾀγώ; Μακρόθυμε Κύριε, ἐπὶ τῇ ἀσθενείᾳ μου σπλαγχνίσθητι, καὶ ἐλέησόν με.
ltx/gr_gr_cog/oc.m5.d2:ocVE.Aposticha3.incipit	Τῶν ἐπιγείων ἁπάντων, καταφρονήσαντες, καὶ…
ltx/gr_gr_cog/oc.m5.d2:ocVE.Aposticha3.melody	
ltx/gr_gr_cog/oc.m5.d2:ocVE.Aposticha3.mode	@ltx/gr_gr_cog/miscellanea:misc.Mode5
ltx/gr_gr_cog/oc.m5.d2:ocVE.Aposticha3.text	Τῶν ἐπιγείων ἁπάντων, καταφρονήσαντες, καὶ τῶν βασάνων ἀνδρείως κατατολμήσαντες, τῶν μακαρίων ἐλπίδων οὐκ ἠστοχήσατε, ἀλλʼ οὐρανῶν Βασιλείας κληρονόμοι γεγόνατε, πανεύφημοι Μάρτυρες, ἔχοντες παῤῥησίαν πρὸς τὸν φιλάνθρωπον Θεόν, τῷ κόσμῳ τὴν εἰρήνην αἰτήσασθε, καὶ ταῖς ψυχαῖς ἡμῶν τὸ μέγα ἔλεος.
ltx/gr_gr_cog/oc.m5.d2:ocVE.SticTheotokion.greekmelody	@ltx/gr_gr_cog/he.a.m5:heAU.ChairoisAskitikon.greekname
ltx/gr_gr_cog/oc.m5.d2:ocVE.SticTheotokion.incipit	Λάμψον τὸν φωτισμόν σου ἐμοί…
ltx/gr_gr_cog/oc.m5.d2:ocVE.SticTheotokion.melody	@ltx/gr_gr_cog/he.a.m5:heAU.ChairoisAskitikon.name
ltx/gr_gr_cog/oc.m5.d2:ocVE.SticTheotokion.mode	@ltx/gr_gr_cog/miscellanea:misc.Mode5
ltx/gr_gr_cog/oc.m5.d2:ocVE.SticTheotokion.text	Λάμψον τὸν φωτισμόν σου ἐμοί, τῷ ἐν τῷ σκότει τῶν δεινῶν ἐνυπάρχοντι, τὸ φέγγος τῆς ἀληθείας, ἡ συλλαβοῦσα Θεόν, καὶ σαρκὶ τεκοῦσα Μητροπάρθενε, βυθοῦ ἀπογνώσεως, διὰ τάχους ἀνάγαγε, καὶ ἐπὶ πέτραν, ἀσφαλοῦς βιοτεύσεως, ἐπιστήριξον, τῆς ψυχῆς μου τὰ βήματα, δίκασον τοὺς ἀπαύστως με, πολεμοῦντας δαίμονας, παῦσον τὸν πόνον ἐν τάχει, τῆς ταλαιπώρου καρδίας μου, ἐλπὶς τῶν περάτων, ἡ τῷ κόσμῳ δωρουμένη, τὸ μέγα ἔλεος.
ltx/gr_gr_cog/oc.m5.d2:ocVE.Stichera1.greekmelody	@ltx/gr_gr_cog/he.a.m5:heAU.ChairoisAskitikon.greekname
ltx/gr_gr_cog/oc.m5.d2:ocVE.Stichera1.incipit	Οἴμοι τῷ παροργίσαντί σε, τὸν…
ltx/gr_gr_cog/oc.m5.d2:ocVE.Stichera1.melody	@ltx/gr_gr_cog/he.a.m5:heAU.ChairoisAskitikon.name
ltx/gr_gr_cog/oc.m5.d2:ocVE.Stichera1.mode	@ltx/gr_gr_cog/miscellanea:misc.Mode5
ltx/gr_gr_cog/oc.m5.d2:ocVE.Stichera1.text	Οἴμοι τῷ παροργίσαντί σε, τὸν ἐλεήμονα Θεόν μου καὶ Κύριον! ποσάκις ἐπηγγειλάμην, μετανοῆσαι Χριστέ, καὶ ψευδὴς εὑρέθην ὁ ἀνόητος! Τὸ πρὶν τοῦ Βαπτίσματος, κατεῤῥύπωσα ἔνδυμα, τῶν συνθηκῶν τε, τῶν πρὸς σέ μου ἠλόγησα, καὶ τὸ δεύτερον, πάλιν τοῦτο ἐπάγγελμα, ὃ σοὶ καθωμολόγησα, Ἀγγέλων ἐνώπιον, καὶ τῶν ἀνθρώπων τὸ σχῆμα, τὸ πένθιμον ἐνδυόμενος, εἰμὶ ἀθετήσας, λοιπὸν Σῶτερ μὴ εἰς τέλος, ἀφῇς ὀλέσθαι με.
ltx/gr_gr_cog/oc.m5.d2:ocVE.Stichera2.incipit	Ποίαν ἀπολογίαν ψυχή, ἔχεις ἀθλία…
ltx/gr_gr_cog/oc.m5.d2:ocVE.Stichera2.melody	@ltx/gr_gr_cog/he.a.m5:heAU.ChairoisAskitikon.name
ltx/gr_gr_cog/oc.m5.d2:ocVE.Stichera2.mode	@ltx/gr_gr_cog/miscellanea:misc.Mode5
ltx/gr_gr_cog/oc.m5.d2:ocVE.Stichera2.text	Ποίαν ἀπολογίαν ψυχή, ἔχεις ἀθλία ἐν ἡμέρᾳ τῆς κρίσεως; ἢ τίς σε τῆς καταδίκης, τοῦ αἰωνίου πυρός, καὶ πασῶν βασάνων ἐξαιρήσεται; οὐδεὶς εἰμὴ σὺ σαυτῇ, ἱλεώσῃ τὸν εὔσπλαγχνον, τὰς ἀθεμίτους, καταλείψασα πράξεις σου, καὶ θεάρεστον, κτησαμένη βιότευσιν, κλαίουσα καθʼ ἑκάστην σου, τὰ ἄπειρα σφάλματα, ἅπερ καθʼ ὥραν προσπταίεις, ἔργῳ καὶ λόγῳ ἐννοίᾳ τε, Χριστὸν αἰτουμένη, παρασχεῖν σοι τὴν τελείαν, τούτων συγχώρησιν.
ltx/gr_gr_cog/oc.m5.d2:ocVE.Stichera3.incipit	Μή μου κατακρατείτω Σωτήρ, τῆς…
ltx/gr_gr_cog/oc.m5.d2:ocVE.Stichera3.melody	@ltx/gr_gr_cog/he.a.m5:heAU.ChairoisAskitikon.name
ltx/gr_gr_cog/oc.m5.d2:ocVE.Stichera3.mode	@ltx/gr_gr_cog/miscellanea:misc.Mode5
ltx/gr_gr_cog/oc.m5.d2:ocVE.Stichera3.text	Μή μου κατακρατείτω Σωτήρ, τῆς ἁμαρτίας ἡ συνήθεια ἕλκουσα, μηδέ μου κυριευέτω, δαίμων ἀεὶ πολεμῶν, καὶ καταφερέτω πρὸς τὸ θέλημα, αὐτοῦ, ἀλλʼ ἐξάρπασον, τῆς αὐτοῦ δεσποτείας με, καὶ τυραννίδος, καὶ ζοφώδους κολάσεως, καὶ βασιλεύων ἐν ἐμοὶ σὺ φιλάνθρωπε, ὅλον τε σὸν γενέσθαι με, καὶ ζῇν καταξίωσον, κατὰ τὸ θέλημα Λόγε, τὸ σὸν καὶ ἔχειν ἀνάπαυσιν, ἐν σοὶ καὶ εὑρεῖν με, ἱλασμὸν καὶ σωτηρίαν, καὶ μέγα ἔλεος.
ltx/gr_gr_cog/oc.m5.d2:ocVE.Stichera4.greekmelody	@ltx/gr_gr_cog/he.a.m5:heAU.ChairoisAskitikon.greekname
ltx/gr_gr_cog/oc.m5.d2:ocVE.Stichera4.incipit	Λύμη με τῶν παθῶν τυραννεῖ…
ltx/gr_gr_cog/oc.m5.d2:ocVE.Stichera4.melody	@ltx/gr_gr_cog/he.a.m5:heAU.ChairoisAskitikon.name
ltx/gr_gr_cog/oc.m5.d2:ocVE.Stichera4.mode	@ltx/gr_gr_cog/miscellanea:misc.Mode5
ltx/gr_gr_cog/oc.m5.d2:ocVE.Stichera4.text	Λύμη με τῶν παθῶν τυραννεῖ, καὶ τῆς καρδίας μου τὰς κόρας ἐζόφωσε, καὶ βλέπειν οὐ σθένω ὅλως, τὰς σωτηρίους ὁδούς, προϊὼν πλανῶμαι, καὶ κρημνίζομαι, δεινῶς εἰς τὰ βάραθρα, τὰ τοῦ ᾍδου Ἀρχάγγελοι, τῶν δὲ θαυμάτων, τῶν ὑμῶν μιμνησκόμενος, θεραπεύομαι, ἀπὸ πάσης τῆς νόσου μου, ἴδοιμι τὴν εὐμένειαν, ὑμῶν νῦν ταχύτατα, σπεύσατε σβέσαι τὴν φλόγα, τὴν τῶν παθῶν μου πανσέβαστοι, πρὸς φῶς ὁδηγοῦντες, σωτηρίας με καὶ λύσιν, κακῶν μοι νέμοντες.
ltx/gr_gr_cog/oc.m5.d2:ocVE.Stichera5.incipit	Ἔσχε τὸν τῆς εὐκλείας βαθμόν…
ltx/gr_gr_cog/oc.m5.d2:ocVE.Stichera5.melody	@ltx/gr_gr_cog/he.a.m5:heAU.ChairoisAskitikon.name
ltx/gr_gr_cog/oc.m5.d2:ocVE.Stichera5.mode	@ltx/gr_gr_cog/miscellanea:misc.Mode5
ltx/gr_gr_cog/oc.m5.d2:ocVE.Stichera5.text	Ἔσχε τὸν τῆς εὐκλείας βαθμόν, τῆς καθʼ ὑμᾶς ὁ πονηρός, Ἀρχιστράτηγοι, ὁ πρῴην ὡς Ἑωσφόρος, συνανατέλλων ὑμῖν, ἀλλʼ ἐκ πονηρίας ὁ ἀντίπαλος, εἰς γῆν κατενήνεκται, καὶ τῷ σκότει ζεζόφωται, καὶ σὺν αὐτῷ με, καταῤῥάξαι ἐπείγεται, τιμηθέντα με, τῇ εἰκόνι τοῦ πλάσαντος, ὅμως εἰ καὶ προπέπτωκα, Χριστός με ἀνέστησε· φάνητε οὖν μοι προστάται, καὶ προμηθεῖς καὶ ἐπίκουροι, σοφοὶ τῷ ἀθλίῳ, σωτηρίαν μοι αἰτοῦντες, καὶ μέγα ἔλεος.
ltx/gr_gr_cog/oc.m5.d2:ocVE.Stichera6.incipit	Ἔδει με κατʼ εἰκόνα Θεοῦ…
ltx/gr_gr_cog/oc.m5.d2:ocVE.Stichera6.melody	@ltx/gr_gr_cog/he.a.m5:heAU.ChairoisAskitikon.name
ltx/gr_gr_cog/oc.m5.d2:ocVE.Stichera6.mode	@ltx/gr_gr_cog/miscellanea:misc.Mode5
ltx/gr_gr_cog/oc.m5.d2:ocVE.Stichera6.text	Ἔδει με κατʼ εἰκόνα Θεοῦ, γεγενημένον καὶ ὑμῖν συναρίθμιον, μηδʼ ὅλως καθυποκῦψαι, τῷ πονηρῷ φεῦ! ἐχθρῷ, ἀλλὰ συμβουλίᾳ τοῦ ἀλάστορος, ὑμᾶς οὐκ ἐζήλωσα, ἐντολὴν δὲ ἠθέτησα, καὶ ἐκπέπτωκα, τῆς τιμῆς τοῦ ποιήσαντος, Ἀρχιστράτηγοι, καὶ δουλείᾳ καθέλκομαι, ὅμως περιπαρέντα με, τοῖς πάθεσι βλέποντες, δότε μοι χεῖρα πρὸς τρίβον, τὴν ἀνωτάτω με φέρουσαν, τυχεῖν σωτηρίας, ἐξαιτοῦντές μοι καὶ κάλλους, ἀρχαίαν εὔκλειαν.
ltx/gr_gr_cog/oc.m5.d2:octrMA.Kathisma11.incipit	@ltx/gr_gr_cog/oc.m5.d2:ocMA.Kathisma11.incipit
ltx/gr_gr_cog/oc.m5.d2:octrMA.Kathisma11.melody	
ltx/gr_gr_cog/oc.m5.d2:octrMA.Kathisma11.mode	@ltx/gr_gr_cog/miscellanea:misc.Mode5
ltx/gr_gr_cog/oc.m5.d2:octrMA.Kathisma11.text	@ltx/gr_gr_cog/oc.m5.d2:ocMA.Kathisma11.text
ltx/gr_gr_cog/oc.m5.d2:octrMA.Kathisma12.incipit	@ltx/gr_gr_cog/oc.m5.d2:ocMA.Kathisma12.incipit
ltx/gr_gr_cog/oc.m5.d2:octrMA.Kathisma12.melody	
ltx/gr_gr_cog/oc.m5.d2:octrMA.Kathisma12.mode	@ltx/gr_gr_cog/miscellanea:misc.Mode5
ltx/gr_gr_cog/oc.m5.d2:octrMA.Kathisma12.text	@ltx/gr_gr_cog/oc.m5.d2:ocMA.Kathisma12.text
ltx/gr_gr_cog/oc.m5.d2:octrMA.Kathisma1T.incipit	@ltx/gr_gr_cog/oc.m5.d2:ocVE.ApolTheotokionVM.incipit
ltx/gr_gr_cog/oc.m5.d2:octrMA.Kathisma1T.melody	
ltx/gr_gr_cog/oc.m5.d2:octrMA.Kathisma1T.mode	@ltx/gr_gr_cog/miscellanea:misc.Mode5
ltx/gr_gr_cog/oc.m5.d2:octrMA.Kathisma1T.text	@ltx/gr_gr_cog/oc.m5.d2:ocVE.ApolTheotokionVM.text
ltx/gr_gr_cog/oc.m5.d2:octrMA.Ode7Martyricon.incipit	@ltx/gr_gr_cog/oc.m5.d5:ocMA.Kathisma32.incipit
ltx/gr_gr_cog/oc.m5.d2:octrMA.Ode7Martyricon.melody	@ltx/gr_gr_cog/miscellanea:misc.Automelon
ltx/gr_gr_cog/oc.m5.d2:octrMA.Ode7Martyricon.mode	@ltx/gr_gr_cog/miscellanea:misc.Mode5
ltx/gr_gr_cog/oc.m5.d2:octrMA.Ode7Martyricon.text	@ltx/gr_gr_cog/oc.m5.d5:ocMA.Kathisma32.text
ltx/gr_gr_cog/oc.m5.d2:octrMA.Photagogic.incipit	Φωτοδότα Κύριε, ἐξαπόστειλον τὸ φῶς…
ltx/gr_gr_cog/oc.m5.d2:octrMA.Photagogic.mode	@ltx/gr_gr_cog/miscellanea:misc.Mode5
ltx/gr_gr_cog/oc.m5.d2:octrMA.Photagogic.text	Φωτοδότα Κύριε, ἐξαπόστειλον τὸ φῶς σου, καὶ φώτισον τὴν καρδίαν μου,
ltx/gr_gr_cog/oc.m5.d2:octrMA.Triadic1.incipit	Ὑμνῳδίας ὁ καιρός…
ltx/gr_gr_cog/oc.m5.d2:octrMA.Triadic1.mode	@ltx/gr_gr_cog/miscellanea:misc.Mode5
ltx/gr_gr_cog/oc.m5.d2:octrMA.Triadic1.text	Ὑμνῳδίας ὁ καιρός, καὶ δεήσεως ὥρα, ἐκτενῶς βοήσωμεν τῷ μόνῳ Θεῷ· Ἅγιος, Ἅγιος, Ἅγιος εἶ ὁ Θεὸς ἡμῶν.
ltx/gr_gr_cog/oc.m5.d2:octrMA.Triadic2.incipit	Εἰκονίζειν τολμῶντες…
ltx/gr_gr_cog/oc.m5.d2:octrMA.Triadic2.mode	@ltx/gr_gr_cog/miscellanea:misc.Mode5
ltx/gr_gr_cog/oc.m5.d2:octrMA.Triadic2.text	Εἰκονίζειν τολμῶντες τὰ νοερά σου στρατεύματα, Τριὰς ἄναρχε, στόμασιν ἀναξίοις βοῶμεν· Ἅγιος, Ἅγιος, Ἅγιος εἶ ὁ Θεὸς ἡμῶν.
ltx/gr_gr_cog/oc.m5.d2:octrMA.Triadic3.incipit	Ὁ ἐν μήτρᾳ παρθενικῇ…
ltx/gr_gr_cog/oc.m5.d2:octrMA.Triadic3.mode	@ltx/gr_gr_cog/miscellanea:misc.Mode5
ltx/gr_gr_cog/oc.m5.d2:octrMA.Triadic3.text	Ὁ ἐν μήτρᾳ παρθενικῇ χωρηθείς, καὶ τῶν κόλπων τοῦ Πατρὸς μὴ χωρισθείς, σὺν Ἀγγέλοις καὶ ἡμᾶς Χριστὲ ὁ Θεὸς πρόσδεξαι βοῶντάς σοι· Ἅγιος, Ἅγιος, Ἅγιος εἶ ὁ Θεὸς ἡμῶν.
ltx/gr_gr_cog/oc.m5.d2:octrVE.Stichera1.incipit	@ltx/gr_gr_cog/oc.m5.d2:ocVE.Aposticha1.incipit
ltx/gr_gr_cog/oc.m5.d2:octrVE.Stichera1.melody	
ltx/gr_gr_cog/oc.m5.d2:octrVE.Stichera1.mode	@ltx/gr_gr_cog/miscellanea:misc.Mode5
ltx/gr_gr_cog/oc.m5.d2:octrVE.Stichera1.text	@ltx/gr_gr_cog/oc.m5.d2:ocVE.Aposticha1.text
ltx/gr_gr_cog/oc.m5.d2:octrVE.Stichera2.incipit	@ltx/gr_gr_cog/oc.m5.d2:ocVE.Aposticha2.incipit
ltx/gr_gr_cog/oc.m5.d2:octrVE.Stichera2.melody	
ltx/gr_gr_cog/oc.m5.d2:octrVE.Stichera2.mode	@ltx/gr_gr_cog/miscellanea:misc.Mode5
ltx/gr_gr_cog/oc.m5.d2:octrVE.Stichera2.text	@ltx/gr_gr_cog/oc.m5.d2:ocVE.Aposticha2.text
ltx/gr_gr_cog/oc.m5.d2:octrVE.Stichera3.incipit	@ltx/gr_gr_cog/oc.m5.d2:ocMA.Aposticha1.incipit
ltx/gr_gr_cog/oc.m5.d2:octrVE.Stichera3.melody	
ltx/gr_gr_cog/oc.m5.d2:octrVE.Stichera3.mode	@ltx/gr_gr_cog/miscellanea:misc.Mode5
ltx/gr_gr_cog/oc.m5.d2:octrVE.Stichera3.text	@ltx/gr_gr_cog/oc.m5.d2:ocMA.Aposticha1.text
ltx/gr_gr_cog/oc.m5.d2:octrVE.Stichera4.incipit	@ltx/gr_gr_cog/oc.m5.d2:ocMA.Aposticha2.incipit
ltx/gr_gr_cog/oc.m5.d2:octrVE.Stichera4.melody	
ltx/gr_gr_cog/oc.m5.d2:octrVE.Stichera4.mode	@ltx/gr_gr_cog/miscellanea:misc.Mode5
ltx/gr_gr_cog/oc.m5.d2:octrVE.Stichera4.text	@ltx/gr_gr_cog/oc.m5.d2:ocMA.Aposticha2.text
