ltx/gr_gr_cog/eo.e07:eo.Doxasticon.incipit	Ἰδοὺ σκοτία καὶ πρωΐ…
ltx/gr_gr_cog/eo.e07:eo.Doxasticon.mode	@ltx/gr_gr_cog/miscellanea:misc.Mode7
ltx/gr_gr_cog/eo.e07:eo.Doxasticon.text	Ἰδοὺ σκοτία καὶ πρωΐ· καὶ τί πρὸς τὸ μνημεῖον Μαρία ἕστηκας, πολὺ σκότος ἔχουσα ταῖς φρεσίν; ὑφʼ οὗ ποῦ τέθειται ζητεῖς ὁ Ἰησοῦς· ἀλλʼ ὅρα τοὺς συντρέχοντας Μαθητάς, πῶς τοῖς ὀθονίοις καὶ τῷ σουδαρίῳ, τὴν ἀνάστασιν ἐτεκμήραντο, καὶ ἀνεμνήσθησαν τῆς περὶ τούτου Γραφῆς. Μεθʼ ὧν καὶ διʼ ὧν, καὶ ἡμεῖς πιστεύσαντες, ἀνυμνοῦμέν σε τὸν ζωοδότην Χριστόν.
ltx/gr_gr_cog/eo.e07:eo.Exaposteilarion.greekmelody	@ltx/gr_gr_cog/he.a.m2:heAU.ToisMathitaisSynelthomen.greekname
ltx/gr_gr_cog/eo.e07:eo.Exaposteilarion.incipit	Ὅτι ἦραν τὸν Κύριον…
ltx/gr_gr_cog/eo.e07:eo.Exaposteilarion.melody	@ltx/gr_gr_cog/he.a.m2:heAU.ToisMathitaisSynelthomen.name
ltx/gr_gr_cog/eo.e07:eo.Exaposteilarion.mode	@ltx/gr_gr_cog/miscellanea:misc.Mode2
ltx/gr_gr_cog/eo.e07:eo.Exaposteilarion.text	Ὅτι ἦραν τὸν Κύριον, τῆς Μαρίας εἰπούσης, ἐπὶ τὸν τάφον ἔδραμον, Σίμων Πέτρος, καὶ ἄλλος, μύστης Χριστοῦ, ὃν ἠγάπα· ἔτρεχον δὲ οἱ δύο, καὶ εὗρον τὰ ὀθόνια, ἔνδον κείμενα μόνα, καὶ κεφαλῆς, ἦν δὲ τὸ σουδάριον χωρὶς τούτων· διὸ πάλιν ἡσύχασαν, τὸν Χριστὸν ἕως εἶδον.
ltx/gr_gr_cog/eo.e07:eo.Theotokion.incipit	Μεγάλα καὶ παράδοξα…
ltx/gr_gr_cog/eo.e07:eo.Theotokion.melody	@ltx/gr_gr_cog/he.a.m2:heAU.ToisMathitaisSynelthomen.name
ltx/gr_gr_cog/eo.e07:eo.Theotokion.mode	@ltx/gr_gr_cog/miscellanea:misc.Mode2
ltx/gr_gr_cog/eo.e07:eo.Theotokion.text	Μεγάλα καὶ παράδοξα, διʼ ἐμὲ κατειργάσω, Χριστέ μου πολυέλεε· ἐκ παρθένου γὰρ Κόρης, ἐτέχθης ἀνερμηνεύτως, καὶ Σταυρὸν κατεδέξω, καὶ θάνατον ὑπομείνας, ἐξανέστης ἐν δόξῃ, καὶ τὴν ἡμῶν, φύσιν ἠλευθέρωσας τοῦ θανάτου. Δόξα Χριστὲ τῇ δόξῃ σου, δόξα τῇ σῇ δυνάμει.
ltx/gr_gr_cog/eo.e07:eo.title	Τὸ Ζʹ Ἑωθινόν.
