ltx/gr_gr_cog/sy.m03.d31:cl.syMA.commemoration01.text	[saint/com 1]
ltx/gr_gr_cog/sy.m03.d31:cl.syMA.commemoration02.text	[saint/com 2]
ltx/gr_gr_cog/sy.m03.d31:cl.syMA.commemoration03.text	[saint/com 3]
ltx/gr_gr_cog/sy.m03.d31:cl.syMA.commemoration04.text	[saint/com 4]
ltx/gr_gr_cog/sy.m03.d31:cl.syMA.commemoration05.text	[saint/com 5]
ltx/gr_gr_cog/sy.m03.d31:cl.syMA.commemoration06.text	[saint/com list]
ltx/gr_gr_cog/sy.m03.d31:syMA.commemoration01.couplet1.title	@ltx/gr_gr_cog/titles:ti.Verses
ltx/gr_gr_cog/sy.m03.d31:syMA.commemoration01.couplet1.verse1	Κτείνει γυνὴ βαλοῦσα καιρίαν λίθῳ,
ltx/gr_gr_cog/sy.m03.d31:syMA.commemoration01.couplet1.verse2	Τὸν Ὑπάτιον· φεῦ γυναικὶ ἀθλίᾳ!
ltx/gr_gr_cog/sy.m03.d31:syMA.commemoration01.narration.p01	Ὁ ἐν Ἁγίοις Πατὴρ ἡμῶν Ὑπάτιος, ἐκ Κιλίκων ἀνθήσας, ἐν Γάγγραις ἀρχιερατεύσας, ἐν τῇ πρώτῃ Συνόδῳ τῶν τριακοσίων δέκα καὶ ὀκτὼ Θεοφόρων Πατέρων εἷς γεγονώς, ὅλος πεπληρωμένος ἦν Πνεύματος Ἁγίου. Πολλοὺς δὲ πειρασμοὺς ὑπομείνας, καὶ σημεῖα διάφορα ἐκτελέσας, γέγονε περιβόητος.
ltx/gr_gr_cog/sy.m03.d31:syMA.commemoration01.narration.p02	Κωνσταντίνου γὰρ βασιλεύοντος, τοῦ υἱοῦ τοῦ μεγάλου Κωνσταντίνου, δράκων τίς πόθεν τοῖς βασιλικοῖς ταμείοις προσπελάσας, ἐν οἷς ἅπας ὁ χρυσὸς ἐφυλάσσετο, καὶ πρὸς τῇ εἰσόδῳ αὐτῶν ἐμφωλεύσας, πολλὴν ἀθυμίαν τῷ Βασιλεῖ προεξένησε, μηδενὸς ἐκεῖ δυναμένου ὁπωσοῦν πλησιάσαι. Ἐν ἀμηχανίᾳ τοίνυν ὁ Βασιλεὺς ὤν, τὸν μακάριον τοῦτον προσκαλεῖται· ὃν παραγενόμενον, μετὰ πολλῆς ὑποδεξάμενος τῆς αἰδοῦς, περὶ τοῦ ἐπεισφρήσαντος ἀπαγγέλλει θηρός. Ὁ δὲ Ἅγιος, εἰ δυνατόν μοι, φησίν, ὦ Βασιλεῦ, τοῦ Θεοῦ συνεργοῦντος, οὐ παραιτήσομαι ποιῆσαι τὸ προσταχθέν· καὶ μὴ ἀθύμει, ὦ Βασιλεῦ· τὰ γὰρ παρὰ ἀνθρώποις ἀδύνατα, τῷ Θεῷ δυνατά.
ltx/gr_gr_cog/sy.m03.d31:syMA.commemoration01.narration.p03	Ταῦτα τοῦ Ἁγίου εἰρηκότος, καὶ τοῦ δράκοντος πόῤῥωθεν ἀποδειχθέντος, ὁ Βασιλεύς, μὴ ἀσυντηρήτως, ὦ Πάτερ, φησί, τῷ θηρὶ πλησιάσῃς, καὶ πείσῃ, ὅπερ καὶ πολλοὶ πεπόνθασιν, ἐξ ἐμῶν ἁμαρτιῶν. Καὶ ὁ μακάριος· Ἡ ἡμετέρα εὐχή, Βασιλεῦ, οὐδὲν ἰσχύει πρὸς ταῦτα, πρὸς Θεὸν δέ σου ἡ Πίστις, καὶ ἡ τούτου μεγάλη καὶ ἀήττητος δύναμις. Τότε πεσὼν ἐπὶ τῆς γῆς, προσηύξατο ἐφʼ ὥραν ἱκανήν· καὶ ἀναστάς, λέγει τῷ Βασιλεῖ· Κέλευσον γενέσθαι μεγάλην πυρκαϊὰν μέσον τῆς πλατείας ὁδοῦ, ἐν ᾧ τόπῳ ἡ στήλη τοῦ σοῦ Πατρὸς ἵδρυται· καὶ οἱ μέλλοντες ταύτην ἀνάπτειν, προσμενέτωσαν ἐκεῖ, τὴν ἐμὴν ἐκδεχόμενοι ἄφιξιν. Καὶ τοῦ Βασιλέως τοῦτο προστάξαντος, ὁ Ἅγιος εἰσελθών, τὰ θύρας τῶν Βασιλικῶν ταμείων ἀνέῳξε, καὶ ἅπαντες ἔφυγον· μήκοθεν δέ τινες ἑστῶτες καὶ βλέποντες, φόβῳ καὶ τρόμῳ συνείχοντο. Ὁ δὲ Ἅγιος, τύπτων τὸ θηρίον διʼ ἧς ἐπεφέρετο ῥάβδου, ἤνυεν οὐδέν, καὶ ἡ ἡμέρα ἤδη παρήρχετο, καὶ πάντες ᾤοντο θανατωθῆναι τὸν Ἅγιον. Ἀλλὰ τὸ ὄμμα εἰς οὐρανοὺς ἀνατείνας, καὶ τὸν Κύριον ἐπικαλεσάμενος, τὴν ῥάβδον τῷ στόματι τοῦ θηρίου ἐμβάλων, εἶπεν· Ἐν ὀνόματι τοῦ Κυρίου μου Ἰησοῦ Χριστοῦ, ἀκολούθει μοι. Καὶ ὁ δράκων, ἐνδακὼν τὴν ῥάβδον, ἠκολούθει τῷ Ἁγίῳ, ὡς ὑπό τινος διωκόμενος.
ltx/gr_gr_cog/sy.m03.d31:syMA.commemoration01.narration.p04	Ὁ γοῦν μακάριος, ἐξελθὼν ἀπὸ τῶν Βασιλείων, καὶ πᾶσαν τὴν λεωφόρον διοδεύσας μέχρι τοῦ φόρου, τὴν ῥάβδον ἕλκων ἐπὶ τῆς γῆς, διʼ ἧς καὶ τὸν δράκοντα, τὸ ἄκρον ἐνδακόντα τῆς ῥάβδου καὶ συρόμενον ὑπʼ αὐτῆς, ἐξέπληξεν ἅπαντας. Ἦν γὰρ φοβερὸς ὁ δράκων τὴν θέαν, ἑξήκοντα πήχεις ἔχων τὸ μῆκος, ὡς ἔλεγον. Καὶ πλησιάσας ὁ Ἅγιος τῇ πυρκαϊᾷ, φησὶ πρὸς τὸν δράκοντα· Ἐν τῷ ὀνόματι Ἰησοῦ Χριστοῦ, ὃν ἐγὼ ὁ ἐλάχιστος κηρύσσω, εἴσελθε μέσον τῆς πυρκαϊᾶς. Ὁ δὲ φοβερὸς ἐκεῖνος δράκων, καμάρας εἶδος ποιήσας, καὶ ὑποκυρτώσας ἑαυτόν, καὶ μέγα ἐκταθείς, ἔῤῥιψεν ἑαυτὸν ἐν μέσῳ τοῦ πυρός, καὶ παρανάλωμα τούτου γέγονε. Καὶ πάντες, δοξάζοντες καὶ εὐλογοῦντες τὸν Θεόν, ἐξεπλάγησαν, ὅτι τοιοῦτον φωστῆρα καὶ θαυματουργὸν ἀνέδειξεν αὐτοῖς ἐν ταῖς ἡμέραις αὐτῶν. Τότε ὁ Βασιλεύς, τὸν Ἅγιον διαφερόντως τιμήσας καὶ εὐχαριστήσας, τὸν χαρακτῆρα τῆς ὄψεως αὐτοῦ ἐκέλευσε σανίδι ἐντυπώσασθαι. Καὶ τούτου γενομένου, ἐν τῷ Βασιλικῷ ταμείῳ τοῦτον ἐπέθετο, εἰς ἀποτροπὴν παντὸς ἐναντίου. Τὸν Ἅγιον οὖν κατασπασάμενος, ἀπέστειλεν οἴκαδε.
ltx/gr_gr_cog/sy.m03.d31:syMA.commemoration01.narration.p05	Μετὰ δὲ τὸ ἐξελθεῖν τὸν Ἅγιον ἐκ τῆς Πόλεως, καὶ πρὸς τὸν οἰκεῖον ἀφικέσθαι θρόνον, οἱ τῆς Ναβάτου αἱρέσεως, φθόνον πολὺν ὠδινήσαντες κατʼ αὐτοῦ, ἐν οἷς εἰώθει ὁ ἀοίδιμος διέρχεσθαι στενωποῖς καὶ κρημνώδεσι τόποις παρακαθίσαντες, ἐγκεκρυμμένοι σὺν ῥοπάλοις καὶ ξίφεσι, τοῦ μακαρίου ἐκείνου διερχομένου, αἰφνιδὸν ὡς ἄγριοι θῆρες ἐπαναστάντες ἐκ τῆς ἐνέδρας, ὁ μέν, ξύλῳ, ὁ δὲ, λίθῳ, ἕτερος, ξίφει, κατὰ τοῦ κρημνοῦ τὸν Ἅγιον ἠκόντιζον. Καὶ ῥίψαντες αὐτὸν ἀπὸ τοῦ μεγάλου ὕψους ἐπὶ τὸν κρημνόν, οὐκ ὀλίγας αὐτῷ πληγὰς ἐπέθεντο, ὡς πρὶν οἱ Ἰουδαῖοι τῷ Πρωτομάρτυρι Στεφάνῳ. Ὁ δὲ Ἅγιος, ἐν τῷ ποταμῷ ῥιφεὶς ἡμιθανής, μικρὸν ἀφυπνώσας, καὶ τοὺς ὀφθαλμοὺς πρὸς οὐρανὸν διάρας, Κύριε, μὴ στήσῃς αὐτοῖς, ἔλεγε, τὴν ἁμαρτίαν ταύτην. Καὶ ἔτι αὐτοῦ προσευχομένου, γυνή τις ἐναγὴς καὶ ἀκάθαρτος, λίθον ἄρασα μέγαν, καὶ τὸν κρόταφον τοῦ Ἁγίου κρούσασα, τὸ λειπόμενον τῆς ζωῆς αὐτοῦ ἀφείλετο ἡ δυστυχὴς καὶ ταλαίπωρος· καὶ ἡ μὲν τούτου ἁγία ψυχὴ ἐν χερσὶν ἤδη ἦν τοῦ Θεοῦ· ἡ δὲ ἐναγὴς ἐκείνη γυνή, πονηρῷ πνεύματι ληφθεῖσα, διὰ τοῦ αὐτοῦ λίθου τὸ ἴδιον ἔτυπτε στῆθος. Ὡσαύτως δὲ καὶ πάντες, οἱ τοῦ φόνου κοινωνήσαντες, ὑπὸ ἀκαθάρτων πνευμάτων ἐπαιδεύοντο. Τὸ δὲ Λείψανον τοῦ Ἁγίου ἐν ἀχυρῶνι τινὶ κρύψαντες, ἀνεχώρησαν· ἀλλʼ ὁ γεωργός, οὗ ὁ ἀχυρὼν ἦν, εἰσελθὼν ἐπὶ τῷ δοῦναι τροφὴν τοῖς ἑαυτοῦ ζώοις, ἀκούσας οὐρανίων ἆσμάτων δοξολογίαν, μηνυτὴς γέγονε τοῦ μακαρίου Πατρός.
ltx/gr_gr_cog/sy.m03.d31:syMA.commemoration01.narration.p06	Τοῦτο ἀναμαθόντες οἱ οἰκήτορες τῆς Πόλεως Γαγγρῶν, συνήχθησαν ἐκεῖσε, καὶ κοινῇ θρηνήσαντες, ἔλαβον τὸ Ἅγιον Λείψανον· καὶ ἀνακομίσαντες τῇ ἑαυτῶν πόλει, κατέθεντο ἐν ἐπισήμῳ τόπῳ. Ἡ δὲ γυνὴ ἐλθοῦσα, καὶ τύπτουσα ἑαυτὴν τῷ λίθῳ διʼ οὗ τὸν Ἅγιον ἔκτεινε, τοῦ θείου Λειψάνου κατατεθέντος, εὐθέως ἰάθη, ὡσαύτως καὶ οἱ λοιποὶ τοῦ Ἁγίου φονεῖς, καὶ ἑτέρων πολλῶν ἐν τῇ τοῦ Ἁγίου κηδείᾳ τελεσθέντων θαυμάτων.
ltx/gr_gr_cog/sy.m03.d31:syMA.commemoration01.single1	Πρώτῃ Ὑπατίῳ βιότου πέρας ἐν τριακοστῇ.
ltx/gr_gr_cog/sy.m03.d31:syMA.commemoration01.text	Τῇ ΛΑʹ τοῦ αὐτοῦ μηνός, ἡ Ἄθλησις τοῦ Ἁγίου Ἱερομάρτυρος Ὑπατίου, Ἐπισκόπου Γαγγρῶν.
ltx/gr_gr_cog/sy.m03.d31:syMA.commemoration02.couplet1.title	@ltx/gr_gr_cog/titles:ti.Verses
ltx/gr_gr_cog/sy.m03.d31:syMA.commemoration02.couplet1.verse1	Ἀκακίῳ θνήσκοντι τῷ γῆς Ἀγγέλῳ,
ltx/gr_gr_cog/sy.m03.d31:syMA.commemoration02.couplet1.verse2	Χώραν ἑτοιμάζουσιν Ἄγγελοι πόλου.
ltx/gr_gr_cog/sy.m03.d31:syMA.commemoration02.narration.p01	Οὗτος, κατὰ τοὺς χρόνους Δεκίου τοῦ Βασιλέως, τὴν εἰς Χριστὸν πίστιν διδάσκων, συσχεθείς, προσήχθη Μαρκιανῷ Ὑπάτῳ· καὶ περὶ ὧν κηρύττει ἐρωτηθεὶς διεξῆλθε πᾶσαν τὴν καθʼ ἡμᾶς τοῦ Θεοῦ οἰκονομίαν, καὶ τὰ ληρώδη τῶν Ἑλλήνων διήλεγξεν. Ὅθεν βασάνους δέχεται, καὶ φουρᾷ κατακλείεται. Ἀνενέγκας δὲ περὶ τοὺτου ὁ Μαρκιανὸς τῷ Δεκίῳ, καὶ κατὰ τὴν ἐξέτασιν ὑπομνήματα ἀποστείλας, προστάξαντος τοῦ Δεκίου, ἀφέθη ὁ Ἅγιος τῆς εἱρκτῆς· καὶ περιῄει, τὰ στίγματα τοῦ Χριστοῦ περιφέρων τῇ σαρκὶ αὑτοῦ. Πολλοὺς δὲ τὴν εἰς Χριστὸν πίστιν παιδεύσας, καὶ ἐν θαύμασι καὶ διδασκαλίαις καλῶς διαπρέψας, ἀνεπαύσατο ἐν εἰρήνῃ.
ltx/gr_gr_cog/sy.m03.d31:syMA.commemoration02.text	Τῇ αὐτῇ ἡμέρᾳ, μνήμη τοῦ Ὁσίου Πατρὸς ἡμῶν Ἀκακίου, Ἐπισκόπου Μελιτινῆς, τοῦ Ὁμολογητοῦ.
ltx/gr_gr_cog/sy.m03.d31:syMA.commemoration03.couplet1.title	@ltx/gr_gr_cog/titles:ti.Verses
ltx/gr_gr_cog/sy.m03.d31:syMA.commemoration03.couplet1.verse1	Αὐδᾶς, ἐνισχύοντος ὑψίστου Λόγου,
ltx/gr_gr_cog/sy.m03.d31:syMA.commemoration03.couplet1.verse2	Καθεῖλεν ἰσχὺν δυσσεβῶν, τμηθεὶς κάραν.
ltx/gr_gr_cog/sy.m03.d31:syMA.commemoration03.couplet2.verse1	Ἀθλητικῷ κλυστῆρι, τῷ πάλῳ λέγω,
ltx/gr_gr_cog/sy.m03.d31:syMA.commemoration03.couplet2.verse2	Πᾶν Βενιαμὶν ψυχικὸν κενοῖ βάρος.
ltx/gr_gr_cog/sy.m03.d31:syMA.commemoration03.couplet3.verse1	Ἐν τοῖς ὄνυξι κάλαμον δεδεγμένοι,
ltx/gr_gr_cog/sy.m03.d31:syMA.commemoration03.couplet3.verse2	Σφᾶς Μάρτυρας γράφουσιν ἄνδρες ἐννέα.
ltx/gr_gr_cog/sy.m03.d31:syMA.commemoration03.couplet4.verse1	Ζώων ταμεῖα Μαρτύρων τὰ σαρκία
ltx/gr_gr_cog/sy.m03.d31:syMA.commemoration03.couplet4.verse2	Μῦς ἐτρέφοντο, καὶ γαλαῖ ἐν τῷ βόθρῳ.
ltx/gr_gr_cog/sy.m03.d31:syMA.commemoration03.narration.p01	Ἐν τοῖς χρόνοις τῆς βασιλείας Θεοδοσίου τοῦ μικροῦ, Ἰσδιγέρδης, ὁ τῶν Περσῶν Βασιλεύς, κατὰ τῶν Ἐκκλησιῶν ἐκίνησε πόλεμον, πρόφασιν ἔνθεν λαβών. Αὐδᾶς τις Ἐπίσκοπος, πολλοῖς εἴδεσιν ἀρετῶν κεκοσμημένος, οὗτος, ζήλῳ θείῳ χρησάμενος, τὸ Πυρεῖον, τουτέστι τὸν ναόν, ἔνθα οἱ Πέρσαι τὸ πῦρ ἐλάτρευον, κατέλυσε. Τοῦτο ὁ Βασιλεὺς παρὰ τῶν Μάγων μαθών, μετεστείλατο τὸν Αὐδᾶν· καὶ πρῶτον μὲν ἠπίως τὸ πραχθὲν ᾐτιάσατο, καὶ τὸ Πυρεῖον οἰκοδομῆσαι προσέταξεν. Ἐκείνου δὲ ἀντιλέγοντος καὶ τοῦτο δρᾶσαι ἀδύνατον εἶναι φάσκοντος, πάσας τὰς Ἐκκλησίας καταλύειν ἠπείλησε, καὶ τέλος ἐπέθηκεν οἷς ἠπείλησε, πρῶτον τὸν θεῖον ἄνδρα ἀναιρεθῆναι κελεύσας. Ταῦτα ἀκούσας ὁ Ἅγιος, ἐχάρη λίαν· καὶ οὕτω χαίρων καὶ ἀγαλλόμενος, τὸ μακάριον τέλος ἐδέξατο.
ltx/gr_gr_cog/sy.m03.d31:syMA.commemoration03.narration.p02	Τριάκοντα δὲ διελθόντων ἐτῶν, πάλιν ἡ ζάλη τοῦ διωγμοῦ ὑπὸ τῶν Μάγων, καθάπερ ὑπό τινων καταιγίδων, ῥιπιζομένη, τῶν κολαστηρίων τὰς ἐπηρείας τοῖς εὐσεβέσι προσήνεγκαν· καὶ παντοίαις βασάνοις πολλοὺς ἀναλώσαντες, τῷ θανάτῳ παρέδωκαν· καὶ ὑπερορίαις μακραῖς, καὶ πολλαῖς ἄλλαις βασάνοις πολλοὶ ἐξ αὐτῶν προσομιλήσαντες, τοῦ ζῆν ἀπηλλάγησαν ἐν διαφόροις θανάτοις. Ἐξ ὧν δύο, ἢ τριῶν ἐπιμνησθήσομαι, ἵνα διὰ τούτων ὑποδείξω καὶ τὴν τῶν ἄλλων ἀνδρείαν.
ltx/gr_gr_cog/sy.m03.d31:syMA.commemoration03.narration.p03	Ὁρμίσδης τις ἦν, τῶν ἄγαν περιφανῶν παρὰ Πέρσαις Ἀχαιμενιδῶν, Ἔπαρχον ἐσχηκὼς πατέρα* Τοῦτον μεμαθηκώς, πρὸς ἑαυτὸν ὁ Βασιλεὺς ἤγαγε, καὶ προσέταξεν ἀρνεῖσθαι τὸν πεποιηκότα Θεόν. Ὁ δὲ ἔφη· Μή μοι γένοιτο, εἰ καὶ παιδευόμενος, ῥᾳδίως τὸν τῶν ὅλων Θεὸν καταφρονεῖν καὶ ἀρνεῖσθαι. Ὁ δὲ Βασιλεύς, θαυμάσας τὴν τούτου παῤῥησίαν, ἐγύμνωσε μὲν τοῦ πλούτου καὶ τῶν ἀξιωμάτων, τὸν δὲ γενναῖον ἀγωνιστὴν γυμνὸν προσέταξε περιάγειν διὰ τῆς ὁδοῦ, σύροντα τῆς στρατιᾶς τὰς καμήλους, περιζώματι μόνον χρώμενον. Πολλῶν δὲ διελθουσῶν ἡμερῶν, διακύψας ὁ Βασιλεὺς ἀπὸ τοῦ ταμιείου, εἶδε τὸν ἄριστον ἐκεῖνον ἄνδρα, ὑπὸ τῆς ἡλιακῆς ἀκτῖνος φλεγόμενον, καὶ κόνεως πολλῆς ἐμπιπλάμενον· καὶ τῆς πατρῴας περιφανείας ἀναμνησθείς, μετεκαλέσατο· καὶ χιτωνίσκον, ἐκ λίνου πεποιημένον, ἐκελεύσατο ἐνδυθῆναι, νομίσας ὁ Βασιλεύς, ὡς ὑπὸ τῆς προτέρας ταλαιπωρίας, καὶ τῆς πρὸς αὐτὸν τοῦ Βασιλέως γεγενημένης φιλανθρωπίας μαλακισθῆναι τὸν ἄνδρα· εἶτα ἔφη πρὸς αὐτόν· Ἀπηλλάγης τῆς ἔριδος ἐκείνης τοῦ ἀρνεῖσθαι τὸν Υἱὸν τοῦ τέκτονος; Ὁ δέ, ζήλου πλησθείς, διέῤῥηξε τὸν χιτωνίσκον, καὶ προσέῤῥιψεν ἐπειπών· Διὰ τοῦτό με οἶῃ τῆς εὐσεβείας ἐκστήσεσθαι; ἔχε τὸ δῶρόν σου μετὰ τῆς ἀσεβείας. Τούτου τὴν ἀνδρείαν ὁ Βασιλεὺς θεασάμενος, γυμνὸν τοῦτον τῆς Βασιλείας ἐξήλασε, καὶ θανάτῳ παρέδωκε.
ltx/gr_gr_cog/sy.m03.d31:syMA.commemoration03.narration.p04	Βενιαμὶν δέ τινα Διάκονον συλλαβών, καθεῖρξεν ἐν φρουρᾷ. Δύο δὲ διεληλυθότων ἐτῶν, Ῥωμαίων πρεσβευτής ἀφίκετο περί τινων ἄλλων πραγμάτων πρεσβεύων. Καὶ τοῦτο μαθών, ᾔτησε τὸν Βασιλέα τὸν Διάκονον ἀφεθῆναι. Ὁ δὲ Βασιλεὺς ὑποσχέσθαι προσέταξε τὸν Βενιαμίν, μηδενὶ τῶν Μάγων διδασκαλίαν τοιαύτην προοίσειν τὸ σύνολον. Καὶ ὁ μὲν πρεσβευτὴς φυλάξειν ταῦτα τὸν Βενιαμὶν ἐπηγγείλατο· ὁ δὲ Βενιαμίν, ἀκούσας τῶν τοῦ πρεσβευτοῦ παραινέσεων, ἀδύνατον, ἔφη, γενέσθαι· ὢ πόσης τιμωρίας ἄξιον ἀποκρύψαι τὸ τάλαντον! Καὶ τοῦτο οὐ καταγνοὺς ὁ Βασιλεύς, ἐκέλευσε τῶν δεσμῶν ἀφεθῆναι· ἐκεῖνος δὲ τὰ συνήθη τελῶν ἦν.
ltx/gr_gr_cog/sy.m03.d31:syMA.commemoration03.narration.p05	Ἐνιαυτοῦ δὲ διελθόντος, ἐμηνύθη τῳ Βασιλεῖ, ὃς προσαχθῆναι τοῦτον προσέταξε. Καὶ δὴ προσαγαγόντων αὐτόν, ἔφη πρὸς αὐτὸν ὁ Βασιλεύς, τὸν ὑπʼ αὐτοῦ προσκυνούμενον Θεὸν ἀρνήσασθαι. Αὐτὸς δὲ ἀπεκρίνατο· Εἰ καὶ μυρίοις θανάτοις αὐτὸν παραδώσειε, τὸν Βασιλέα τοῦ παντὸς καὶ Δημιουργὸν οὐκ ἀρνήσεται. Ἐπὶ τοῦτο χαλεπήνας, ὁ Βασιλεύς, εἴκοσι καλάμους ὀξύνας, τοῖς τῶν χειρῶν καὶ τῶν ποδῶν ὄνυξι προσέταξεν ἐμπαρῆναι. Ὡς οὖν παίγνιον ἰδὼν τὴν τιμωρίαν λογισάμενον, ἕτερον κάλαμον τῷ παιδογόνῳ αὐτοῦ μορίῳ προσέταξεν εἰσωθῆναι· καὶ τοῦτον συχνῶς εἰσάγων καὶ ἐξάγων, ἀῤῥήτους καὶ ἀφορήτους ἀλγηδόνας εἰργάζετο. Μετὰ δὲ τὴν τοιαύτην τιμωρίαν, ῥάβδον παχεῖαν, ὄζους πάντοθεν ἔχουσαν, εἰσωθῆναι διὰ τῆς ἕδρας ἐκέλευσε· καὶ τούτου γενομένου, τὸ πνεῦμα παρέδωκεν ὁ γενναῖος ἀγωνιστής.
ltx/gr_gr_cog/sy.m03.d31:syMA.commemoration03.narration.p06	Καὶ ἄλλα δὲ μυρία ὅσα ὁ θηριώδης εἰργάσατο, οὐδὲν ἧττον, ἢ Διοκλητιανὸς καὶ Μαξιμιανός. Καὶ τοῦτο οὐ χρὴ θαυμάζειν, πῶς κατὰ παραχώρησιν Θεοῦ τοῦτο ἐγένετο· τοὺς γὰρ πολέμους τούτους, εἴρηκεν ὁ Δεσπότης, ἐμφαίνειν τὸ τῆς Ἐκκλησίας ἀήττητον· καὶ αὐτὰ ἡμᾶς διδάσκει τὰ πράγματα, ὡς πλείονα ἡμῖν τῆς εἰρήνης ὁ πόλεμος πορίζει τὴν ὠφέλειαν. Ὅθεν καὶ οὗτοι οἱ Ἅγιοι, διʼ ὑπομονῆς καὶ Μαρτυρίας, ἐδέξαντο τοὺς στεφάνους τῆς νίκης.
ltx/gr_gr_cog/sy.m03.d31:syMA.commemoration03.text	Τῇ αὐτῇ ἡμέρᾳ, μνήμη τῶν Ἁγίων Μαρτύρων τῶν ἐν Περσίδι μαρτυρησάντων, Αὐδᾶ Ἐπισκόπου, Βενιαμνὶν Διακόνου, καὶ τῶν σὺν αὐτοῖς ἐννέα Μαρτύρων, καὶ ἄλλων πολλῶν Ἁγίων, τῶν εἰς φυλακὴν βληθέντων, καὶ ὑπὸ μυῶν καὶ γαλῶν, τῶν συγκλεισθέντων αὐτοῖς, βιβρωσκομένων.
ltx/gr_gr_cog/sy.m03.d31:syMA.commemoration04.couplet1.title	@ltx/gr_gr_cog/titles:ti.Verses
ltx/gr_gr_cog/sy.m03.d31:syMA.commemoration04.couplet1.verse1	Γυμνὸν συρέντα τὸν Μένανδρον ἐν πέτραις,
ltx/gr_gr_cog/sy.m03.d31:syMA.commemoration04.couplet1.verse2	Στολὴν ὁ Χριστὸς ἐνδύει σωτηρίας.
ltx/gr_gr_cog/sy.m03.d31:syMA.commemoration04.text	Ὁ Ἅγιος Μάρτυς Μένανδρος κατὰ πετρῶν γυμνὸς συρόμενος τελειοῦται.
ltx/gr_gr_cog/sy.m03.d31:syMA.commemoration05.couplet1.title	@ltx/gr_gr_cog/titles:ti.Verses
ltx/gr_gr_cog/sy.m03.d31:syMA.commemoration05.couplet1.verse1	Φυλὴ πεσοῦσα συγγενὴς διὰ ξίφους,
ltx/gr_gr_cog/sy.m03.d31:syMA.commemoration05.couplet1.verse2	Φῦλα τροποῦται τῶν πεσόντων ἐκ πόλου.
ltx/gr_gr_cog/sy.m03.d31:syMA.commemoration05.text	Οἱ Ἅγιοι τριάκοντα ὀκτὼ Μάρτυρες, συγγενεῖς ὄντες, ξίφει τελειοῦνται.
ltx/gr_gr_cog/sy.m03.d31:syMA.commemoration06.couplet1.title	@ltx/gr_gr_cog/titles:ti.Verses
ltx/gr_gr_cog/sy.m03.d31:syMA.commemoration06.couplet1.verse1	Καρπούς, Βλάσιε, ἀρετῶν ἐκβλαστάνεις,
ltx/gr_gr_cog/sy.m03.d31:syMA.commemoration06.couplet1.verse2	Οὕς περ τρυγᾷς νῦν ἐν πόλῳ μετʼ Ἀγγέλων.
ltx/gr_gr_cog/sy.m03.d31:syMA.commemoration06.text	Ὁ Ὅσιος Πατὴρ ἡμῶν Βλάσιος, ὁ ἐξ Ἀμορίου ἔχων τὴν γέννησιν, ἐν εἰρήνῃ τελειοῦται.
ltx/gr_gr_cog/sy.m03.d31:syMA.commemoration07.couplet1.title	@ltx/gr_gr_cog/titles:ti.Verses
ltx/gr_gr_cog/sy.m03.d31:syMA.commemoration07.couplet1.verse1	Τὸν δὲ Στέφανον ἀστεφῆ πῶς ἐλλίπω,
ltx/gr_gr_cog/sy.m03.d31:syMA.commemoration07.couplet1.verse2	Τὸν θαυματουργόν, ὃν στέφει Θεοῦ χάρις;
ltx/gr_gr_cog/sy.m03.d31:syMA.commemoration07.text	Ὁ Ὅσιος Πατὴρ ἡμῶν Στέφανος ὁ θαυματουργὸς ἐν εἱρήνῃ τελειοῦται.
ltx/gr_gr_cog/sy.m03.d31:syMA.lastline	Ὧν ταῖς πρεσβείαις Χριστέ, ὁ Θεὸς ἡμῶν, ἐλέησον καὶ σῶσον ἡμᾶς. Ἀμήν.
ltx/gr_gr_cog/sy.m03.d31:syMA.note1	Παλαιὰ καὶ ἐπίσημος φυλὴ τῶν Περσῶν ἦσαν οἱ Ἀχαιμενίδαι, τοῦ Ἀχαιμένους ἀπόγονοι. Ἦν δὲ ὁ Ἀχαιμένης ἀρχαῖος τῆς Περσίας Βασιλεύς, καταγόμενος ἐκ τῆς γενεᾶς τοῦ Περσέως, καὶ πάππος τοῦ Καμβύσου, πατρὸς Κύρου τοῦ Μεγάλου (Ἡρόδ. α´ 125 - ζ´ 11).
ltx/gr_gr_cog/sy.m03.d31:syMA.note2	Σημειωτέον δέ, ὅτι ὁ ἀνωτέρω Ὁρμίσδης ἑορτάζεται καὶ κατὰ τὴν γ´ Νοεμβρίου, Ἀχαιμενίδης μόνον καλούμενος ἐκεῖ, τῷ πατρωνυμικῷ ὀνόματι, ὅπου λέγει ὁ Συναξαριστής, ὅτι ἐν εἰρήνῃ ἐκοιμήθη, καὶ οὐχὶ μαρτυρικῶς, ὡς ἐνταῦθα· διὸ καὶ ἐκεῖ μὲν ὀνομάζει αὐτὸν Ὁμολογητήν, ἐνταῦθα δὲ συναριθμεῖ μετὰ τῶν Μαρτύρων. Ἀλλὰ καὶ ὁ κατωτέρω Βενιαμὶν Διάκονος ἑορτάζεται ὡσαύτως καὶ κατὰ τὴν ιγ´ Ὀκτωβρίου.
