ltx/gr_gr_cog/me.m07.d10:meDA.commemoration.first	Μνήμη τῶν Ἁγίων 45 Μαρτύρων τῶν ἐν Νικοπόλει
ltx/gr_gr_cog/me.m07.d10:meDA.commemoration.first_name	
ltx/gr_gr_cog/me.m07.d10:meDA.commemoration.first_short	Μνήμη τῶν Ἁγίων 45 Μαρτύρων τῶν ἐν Νικοπόλει
ltx/gr_gr_cog/me.m07.d10:meDA.commemoration.first_title	@ltx/gr_gr_cog/titles:ti.Saints
ltx/gr_gr_cog/me.m07.d10:meDA.commemoration.full	Μνήμη τῶν Ἁγίων τεσσαράκοντα πέντε Μαρτύρων τῶν ἐν Νικοπόλει τῆς Ἀρμενίας.
ltx/gr_gr_cog/me.m07.d10:meDA.commemoration.second_name	
ltx/gr_gr_cog/me.m07.d10:meDA.commemoration.second_title	
ltx/gr_gr_cog/me.m07.d10:meDA.date	Τῌ Ιʹ ΙΟΥΛΙΟΥ
ltx/gr_gr_cog/me.m07.d10:meDA.fordate	διὰ τὴν 10ην Ἰουλίου
ltx/gr_gr_cog/me.m07.d10:meDA.insert1	καὶ τῶν Ἁγίων τεσσαράκοντα πέντε Μαρτύρων τῶν ἐν Νικοπόλει τῆς Ἀρμενίας,
ltx/gr_gr_cog/me.m07.d10:meDA.insert2	ὧν καὶ τὴν μνήμην ἐπιτελοῦμεν·
ltx/gr_gr_cog/me.m07.d10:meDA.note	
ltx/gr_gr_cog/me.m07.d10:meDA.pdfcoverdate	τῆς 10ης Ἰουλίου,
ltx/gr_gr_cog/me.m07.d10:meDA.pdfheaderdate	τῆς 10ης Ἰουλίου
ltx/gr_gr_cog/me.m07.d10:meHO.commemorations	
ltx/gr_gr_cog/me.m07.d10:meHO.note1	
ltx/gr_gr_cog/me.m07.d10:meHO.note2	
ltx/gr_gr_cog/me.m07.d10:meHO.number	
ltx/gr_gr_cog/me.m07.d10:meHO.rank	
ltx/gr_gr_cog/me.m07.d10:meLE.commemoration1	Μνήμη τῶν Ἁγίων τεσσαράκοντα πέντε Μαρτύρων τῶν ἐν Νικοπόλει τῆς Ἀρμενίας.
ltx/gr_gr_cog/me.m07.d10:meLE.commemoration2	
ltx/gr_gr_cog/me.m07.d10:meLI.Kontakion1.incipit	…
ltx/gr_gr_cog/me.m07.d10:meLI.Kontakion1.melody	
ltx/gr_gr_cog/me.m07.d10:meLI.Kontakion1.mode	
ltx/gr_gr_cog/me.m07.d10:meLI.Kontakion1.text	
ltx/gr_gr_cog/me.m07.d10:meLI.Megalynarion.text	
ltx/gr_gr_cog/me.m07.d10:meMA.C1.acrostic.notice1	οὗ ἡ Ἀκροστιχίς·
ltx/gr_gr_cog/me.m07.d10:meMA.C1.acrostic.text	Θεοστεφῆ φάλαγγα μέλπω Μαρτύρων.
ltx/gr_gr_cog/me.m07.d10:meMA.C1.acrostic.title	Κανὼν τῶν Ἁγίων,
ltx/gr_gr_cog/me.m07.d10:meMA.C1.poet	@ltx/gr_gr_cog/poets:po.IoannouMonachou
ltx/gr_gr_cog/me.m07.d10:meMA.C1.title	@ltx/gr_gr_cog/titles:ti.CanonSaints
ltx/gr_gr_cog/me.m07.d10:meMA.C1.verse	@ltx/gr_gr_cog/prayers:pr.verse_SaintsM.text
ltx/gr_gr_cog/me.m07.d10:meMA.ExapTheotokion.incipit	Σὲ προστασίαν πάντες, ἔχομεν οἱ…
ltx/gr_gr_cog/me.m07.d10:meMA.ExapTheotokion.melody	@ltx/gr_gr_cog/he.a.m3:heAU.OOuranonToisAstrois.name
ltx/gr_gr_cog/me.m07.d10:meMA.ExapTheotokion.mode	@ltx/gr_gr_cog/miscellanea:misc.Mode3
ltx/gr_gr_cog/me.m07.d10:meMA.ExapTheotokion.text	Σὲ προστασίαν πάντες, ἔχομεν οἱ ἁμαρτωλοί, ὦ Παναγία Παρθένε, σὺ εὐδιάλλακτον ἡμῖν, ἀπέργασαι τὸν Υἱόν σου, τῇ μητρικῇ παῤῥησίᾳ.
ltx/gr_gr_cog/me.m07.d10:meMA.Exaposteilarion1.greekmelody	@ltx/gr_gr_cog/he.a.m3:heAU.OOuranonToisAstrois.greekname
ltx/gr_gr_cog/me.m07.d10:meMA.Exaposteilarion1.incipit	Πολυχειρίᾳ γνώμης, καὶ ἐν ἀνδρείᾳ…
ltx/gr_gr_cog/me.m07.d10:meMA.Exaposteilarion1.melody	@ltx/gr_gr_cog/he.a.m3:heAU.OOuranonToisAstrois.name
ltx/gr_gr_cog/me.m07.d10:meMA.Exaposteilarion1.mode	@ltx/gr_gr_cog/miscellanea:misc.Mode3
ltx/gr_gr_cog/me.m07.d10:meMA.Exaposteilarion1.text	Πολυχειρίᾳ γνώμης, καὶ ἐν ἀνδρείᾳ τῆς ψυχῆς, οἱ τεσσαράκοντα πέντε, Μάρτυρες πάντας τοὺς ἐχθρούς, συνδιεσπάραξαν Σῶτερ· ὧν ταῖς εὐχαῖς ἡμᾶς σῶσον.
ltx/gr_gr_cog/me.m07.d10:meMA.Ode1C11.greekmelody	@ltx/gr_gr_cog/he.h.m5:heHE.ToSotiriTheo.greekname
ltx/gr_gr_cog/me.m07.d10:meMA.Ode1C11.incipit	Θεοφρόνως πιστοί, τοὺς στρατιώτας Χριστοῦ…
ltx/gr_gr_cog/me.m07.d10:meMA.Ode1C11.melody	@ltx/gr_gr_cog/he.h.m5:heHE.ToSotiriTheo.name
ltx/gr_gr_cog/me.m07.d10:meMA.Ode1C11.mode	@ltx/gr_gr_cog/miscellanea:misc.Mode5
ltx/gr_gr_cog/me.m07.d10:meMA.Ode1C11.ode	@ltx/gr_gr_cog/miscellanea:misc.Ode1
ltx/gr_gr_cog/me.m07.d10:meMA.Ode1C11.text	Θεοφρόνως πιστοί, τοὺς στρατιώτας Χριστοῦ, τοὺς ἀθλοφόρους ἀνυμνήσωμεν, ὡς καθαιρέτας τῆς πλάνης, καὶ τροπαιούχους φαιδρούς, Θεῷ ἐπινίκιον, ὕμνον ἀναμέλποντας.
ltx/gr_gr_cog/me.m07.d10:meMA.Ode1C12.incipit	Ἐπὶ γῆς ἀθληταί, ἠγωνισμένοι λαμπρῶς…
ltx/gr_gr_cog/me.m07.d10:meMA.Ode1C12.melody	@ltx/gr_gr_cog/he.h.m5:heHE.ToSotiriTheo.name
ltx/gr_gr_cog/me.m07.d10:meMA.Ode1C12.mode	@ltx/gr_gr_cog/miscellanea:misc.Mode5
ltx/gr_gr_cog/me.m07.d10:meMA.Ode1C12.ode	@ltx/gr_gr_cog/miscellanea:misc.Ode1
ltx/gr_gr_cog/me.m07.d10:meMA.Ode1C12.text	Ἐπὶ γῆς ἀθληταί, ἠγωνισμένοι λαμπρῶς, καὶ τὰς βασάνους ὑπομείναντες, ἐν οὐρανοῖς τοὺς στεφάνους ὑπεδέξασθε, συμφώνως ἀναμέλποντες, ὕμνον ἐπινίκιον.
ltx/gr_gr_cog/me.m07.d10:meMA.Ode1C13.incipit	Ὁμονοίᾳ ψυχῆς, συνδεδεμένοι πιστῶς, κατὰ…
ltx/gr_gr_cog/me.m07.d10:meMA.Ode1C13.melody	@ltx/gr_gr_cog/he.h.m5:heHE.ToSotiriTheo.name
ltx/gr_gr_cog/me.m07.d10:meMA.Ode1C13.mode	@ltx/gr_gr_cog/miscellanea:misc.Mode5
ltx/gr_gr_cog/me.m07.d10:meMA.Ode1C13.ode	@ltx/gr_gr_cog/miscellanea:misc.Ode1
ltx/gr_gr_cog/me.m07.d10:meMA.Ode1C13.text	Ὁμονοίᾳ ψυχῆς, συνδεδεμένοι πιστῶς, κατὰ τῆς πλάνης ἐχωρήσατε, καὶ νικηταὶ στεφανηφόροι ἀνεδείχθητε, συμφώνως ἀναμέλποντες, ὕμνον ἐπινίκιον.
ltx/gr_gr_cog/me.m07.d10:meMA.Ode1C1T.incipit	Ἄχραντε Μῆτερ Θεοῦ, τὸν σαρκωθέντα…
ltx/gr_gr_cog/me.m07.d10:meMA.Ode1C1T.melody	@ltx/gr_gr_cog/he.h.m5:heHE.ToSotiriTheo.name
ltx/gr_gr_cog/me.m07.d10:meMA.Ode1C1T.mode	@ltx/gr_gr_cog/miscellanea:misc.Mode5
ltx/gr_gr_cog/me.m07.d10:meMA.Ode1C1T.ode	@ltx/gr_gr_cog/miscellanea:misc.Ode1
ltx/gr_gr_cog/me.m07.d10:meMA.Ode1C1T.text	Ἄχραντε Μῆτερ Θεοῦ, τὸν σαρκωθέντα ἐκ σοῦ, καὶ ἐκ τῶν κόλπων τοῦ Γεννήτορος, μὴ ἐκφοιτήσαντα Θεόν, ἀπαύστως πρέσβευε, ἐκ πάσης περιστάσεως, σῶσαι οὓς ἔπλασεν.
ltx/gr_gr_cog/me.m07.d10:meMA.Ode3C11.greekmelody	@ltx/gr_gr_cog/he.h.m5:heHE.DynameiTouStavrouSou.greekname
ltx/gr_gr_cog/me.m07.d10:meMA.Ode3C11.incipit	Συνέσει στρατιῶται Χριστοῦ, κεκοσμημένοι τὸν…
ltx/gr_gr_cog/me.m07.d10:meMA.Ode3C11.melody	@ltx/gr_gr_cog/he.h.m5:heHE.DynameiTouStavrouSou.name
ltx/gr_gr_cog/me.m07.d10:meMA.Ode3C11.mode	@ltx/gr_gr_cog/miscellanea:misc.Mode5
ltx/gr_gr_cog/me.m07.d10:meMA.Ode3C11.ode	@ltx/gr_gr_cog/miscellanea:misc.Ode3
ltx/gr_gr_cog/me.m07.d10:meMA.Ode3C11.text	Συνέσει στρατιῶται Χριστοῦ, κεκοσμημένοι τὸν ἀλάστορα, ἀρχαῖον ὄφιν ἐπνίξατε, ἐν τοῖς ῥείθροις τῶν αἱμάτων ὑμῶν.
ltx/gr_gr_cog/me.m07.d10:meMA.Ode3C12.incipit	Τὸ σῶμα παραδόντες πικραῖς, καὶ…
ltx/gr_gr_cog/me.m07.d10:meMA.Ode3C12.melody	@ltx/gr_gr_cog/he.h.m5:heHE.DynameiTouStavrouSou.name
ltx/gr_gr_cog/me.m07.d10:meMA.Ode3C12.mode	@ltx/gr_gr_cog/miscellanea:misc.Mode5
ltx/gr_gr_cog/me.m07.d10:meMA.Ode3C12.ode	@ltx/gr_gr_cog/miscellanea:misc.Ode3
ltx/gr_gr_cog/me.m07.d10:meMA.Ode3C12.text	Τὸ σῶμα παραδόντες πικραῖς, καὶ ἀφορήτοις Ἀξιάγαστοι, βασάνοις θείαν εἰλήφατε, κληρουχίαν διὰ πίστεως.
ltx/gr_gr_cog/me.m07.d10:meMA.Ode3C13.incipit	Ἐν λίθων Ἀθλοφόροι βολαῖς, τυράννου…
ltx/gr_gr_cog/me.m07.d10:meMA.Ode3C13.melody	@ltx/gr_gr_cog/he.h.m5:heHE.DynameiTouStavrouSou.name
ltx/gr_gr_cog/me.m07.d10:meMA.Ode3C13.mode	@ltx/gr_gr_cog/miscellanea:misc.Mode5
ltx/gr_gr_cog/me.m07.d10:meMA.Ode3C13.ode	@ltx/gr_gr_cog/miscellanea:misc.Ode3
ltx/gr_gr_cog/me.m07.d10:meMA.Ode3C13.text	Ἐν λίθων Ἀθλοφόροι βολαῖς, τυράννου γνώμῃ συνθλαττόμενοι, τῆς εὐσεβείας τὴν ἄγκυραν, ἀσφαλῶς διεφυλάξατε.
ltx/gr_gr_cog/me.m07.d10:meMA.Ode3C1T.incipit	Ἱκέτευε ἀπαύστως Ἁγνή, τὸν προελθόντα…
ltx/gr_gr_cog/me.m07.d10:meMA.Ode3C1T.melody	@ltx/gr_gr_cog/he.h.m5:heHE.DynameiTouStavrouSou.name
ltx/gr_gr_cog/me.m07.d10:meMA.Ode3C1T.mode	@ltx/gr_gr_cog/miscellanea:misc.Mode5
ltx/gr_gr_cog/me.m07.d10:meMA.Ode3C1T.ode	@ltx/gr_gr_cog/miscellanea:misc.Ode3
ltx/gr_gr_cog/me.m07.d10:meMA.Ode3C1T.text	Ἱκέτευε ἀπαύστως Ἁγνή, τὸν προελθόντα ἐκ λαγόνων σου, ῥυσθῆναι πλάνης διαβόλου, τοὺς ὑμνοῦντάς σε Μητέρα Θεοῦ.
ltx/gr_gr_cog/me.m07.d10:meMA.Ode3H.greekmelody	@ltx/gr_gr_cog/he.h.m5:heHE.DynameiTouStavrouSou.greekname
ltx/gr_gr_cog/me.m07.d10:meMA.Ode3H.incipit	@ltx/gr_gr_cog/he.h.m5:heHE.DynameiTouStavrouSou.incipit
ltx/gr_gr_cog/me.m07.d10:meMA.Ode3H.melody	@ltx/gr_gr_cog/he.h.m5:heHE.DynameiTouStavrouSou.melody
ltx/gr_gr_cog/me.m07.d10:meMA.Ode3H.mode	@ltx/gr_gr_cog/miscellanea:misc.Mode5
ltx/gr_gr_cog/me.m07.d10:meMA.Ode3H.ode	@ltx/gr_gr_cog/miscellanea:misc.Ode3
ltx/gr_gr_cog/me.m07.d10:meMA.Ode3H.text	@ltx/gr_gr_cog/he.h.m5:heHE.DynameiTouStavrouSou.text
ltx/gr_gr_cog/me.m07.d10:meMA.Ode3Kathisma1.greekmelody	@ltx/gr_gr_cog/he.a.m4:heAU.OYpsotheisEnToStavro.greekname
ltx/gr_gr_cog/me.m07.d10:meMA.Ode3Kathisma1.incipit	Οἱ στρατιῶται τοῦ Χριστοῦ οἱ…
ltx/gr_gr_cog/me.m07.d10:meMA.Ode3Kathisma1.melody	@ltx/gr_gr_cog/he.a.m4:heAU.OYpsotheisEnToStavro.name
ltx/gr_gr_cog/me.m07.d10:meMA.Ode3Kathisma1.mode	@ltx/gr_gr_cog/miscellanea:misc.Mode4
ltx/gr_gr_cog/me.m07.d10:meMA.Ode3Kathisma1.text	Οἱ στρατιῶται τοῦ Χριστοῦ οἱ γενναῖοι, ἀγωνισάμενοι καλῶς τὸν Βελίαρ, ὁλοτελῶς ἐβύθισαν αἱμάτων ῥοαῖς· λίθοις γὰρ συνθλώμενοι, καὶ τεμνόμενοι ξίφει, πυρὶ ἐκκαιόμενοι, καὶ εἰς ὕδωρ βληθέντες, στεφανηφόροι ὤφθησαν σαφῶς· ὅθεν τιμῶνται καὶ πίστει δοξάζονται.
ltx/gr_gr_cog/me.m07.d10:meMA.Ode3KathismaSt.incipit	Τὸν ἐξ ἀνάρχου τοῦ Πατρὸς…
ltx/gr_gr_cog/me.m07.d10:meMA.Ode3KathismaSt.melody	@ltx/gr_gr_cog/he.a.m4:heAU.OYpsotheisEnToStavro.name
ltx/gr_gr_cog/me.m07.d10:meMA.Ode3KathismaSt.mode	@ltx/gr_gr_cog/miscellanea:misc.Mode4
ltx/gr_gr_cog/me.m07.d10:meMA.Ode3KathismaSt.text	Τὸν ἐξ ἀνάρχου τοῦ Πατρὸς γεννηθέντα, ἡ ἐπʼ ἐσχάτων σε σαρκὶ τετοκυῖα, ἐπὶ Σταυροῦ κρεμάμενον ὁρῶσα Χριστέ· Οἴμοι! ποθεινότατε Ἰησοῦ ἀνεβόα· πῶς ὁ δοξαζόμενος, ὡς Θεὸς ὑπʼ Ἀγγέλων, ὑπὸ βροτῶν ἀνόμων νῦν Υἱέ, θέλων σταυροῦσαι; Ὑμνῶ σε μακρόθυμε.
ltx/gr_gr_cog/me.m07.d10:meMA.Ode3KathismaT.incipit	@ltx/gr_gr_cog/me.m06.d28:meMA.Ode3KathismaT.incipit
ltx/gr_gr_cog/me.m07.d10:meMA.Ode3KathismaT.melody	@ltx/gr_gr_cog/he.a.m4:heAU.OYpsotheisEnToStavro.name
ltx/gr_gr_cog/me.m07.d10:meMA.Ode3KathismaT.mode	@ltx/gr_gr_cog/miscellanea:misc.Mode4
ltx/gr_gr_cog/me.m07.d10:meMA.Ode3KathismaT.text	@ltx/gr_gr_cog/me.m06.d28:meMA.Ode3KathismaT.text
ltx/gr_gr_cog/me.m07.d10:meMA.Ode4C11.greekmelody	@ltx/gr_gr_cog/he.h.m5:heHE.EisakikoaTinAkoin.greekname
ltx/gr_gr_cog/me.m07.d10:meMA.Ode4C11.incipit	Φιλοθέου ἀγάπης, κεκρατημένος τοῖς θεσμοῖς…
ltx/gr_gr_cog/me.m07.d10:meMA.Ode4C11.melody	@ltx/gr_gr_cog/he.h.m5:heHE.EisakikoaTinAkoin.name
ltx/gr_gr_cog/me.m07.d10:meMA.Ode4C11.mode	@ltx/gr_gr_cog/miscellanea:misc.Mode5
ltx/gr_gr_cog/me.m07.d10:meMA.Ode4C11.ode	@ltx/gr_gr_cog/miscellanea:misc.Ode4
ltx/gr_gr_cog/me.m07.d10:meMA.Ode4C11.text	Φιλοθέου ἀγάπης, κεκρατημένος τοῖς θεσμοῖς, τὸν ἀντίθεον ἐχθρόν, τῶν Ἀθλοφόρων ὁ χορὸς ἐτροπώσατο, κράτει τοῦ Χριστοῦ κρατυνόμενος.
ltx/gr_gr_cog/me.m07.d10:meMA.Ode4C12.incipit	Ἡ θεόκλητος φάλαγξ, τῶν Ἀθλοφόρων…
ltx/gr_gr_cog/me.m07.d10:meMA.Ode4C12.melody	@ltx/gr_gr_cog/he.h.m5:heHE.EisakikoaTinAkoin.name
ltx/gr_gr_cog/me.m07.d10:meMA.Ode4C12.mode	@ltx/gr_gr_cog/miscellanea:misc.Mode5
ltx/gr_gr_cog/me.m07.d10:meMA.Ode4C12.ode	@ltx/gr_gr_cog/miscellanea:misc.Ode4
ltx/gr_gr_cog/me.m07.d10:meMA.Ode4C12.text	Ἡ θεόκλητος φάλαγξ, τῶν Ἀθλοφόρων τοῦ Χριστοῦ, τὴν ἀντίθεον πληθὺν τῶν ἀσεβῶν, ἀνατρέπει ἀναμέλπουσα· Δόξα τῇ δυνάμει σου Κύριε.
ltx/gr_gr_cog/me.m07.d10:meMA.Ode4C13.incipit	Φῶς ἀπρόσιτον ἰδόντες, οἱ Ἀθλοφόροι…
ltx/gr_gr_cog/me.m07.d10:meMA.Ode4C13.melody	@ltx/gr_gr_cog/he.h.m5:heHE.EisakikoaTinAkoin.name
ltx/gr_gr_cog/me.m07.d10:meMA.Ode4C13.mode	@ltx/gr_gr_cog/miscellanea:misc.Mode5
ltx/gr_gr_cog/me.m07.d10:meMA.Ode4C13.ode	@ltx/gr_gr_cog/miscellanea:misc.Ode4
ltx/gr_gr_cog/me.m07.d10:meMA.Ode4C13.text	Φῶς ἀπρόσιτον ἰδόντες, οἱ Ἀθλοφόροι ἐν φρουρᾷ, τὴν πολύθεον ἀχλύν, εἰδωλικῆς παροινίας διεσκέδασαν, θείᾳ δυναστείᾳ νευρούμενοι.
ltx/gr_gr_cog/me.m07.d10:meMA.Ode4C14.incipit	Ἀτενίζοντες τῷ κάλλει τῶν ἀκηράτων…
ltx/gr_gr_cog/me.m07.d10:meMA.Ode4C14.melody	@ltx/gr_gr_cog/he.h.m5:heHE.EisakikoaTinAkoin.name
ltx/gr_gr_cog/me.m07.d10:meMA.Ode4C14.mode	@ltx/gr_gr_cog/miscellanea:misc.Mode5
ltx/gr_gr_cog/me.m07.d10:meMA.Ode4C14.ode	@ltx/gr_gr_cog/miscellanea:misc.Ode4
ltx/gr_gr_cog/me.m07.d10:meMA.Ode4C14.text	Ἀτενίζοντες τῷ κάλλει τῶν ἀκηράτων ἀγαθῶν, τὴν ἀβέβαιον φοράν, τῶν ἀνθρωπίνων πραγμάτων, ὁ ἀοίδιμος δῆμος τῶν Μαρτύρων ἀπώσατο.
ltx/gr_gr_cog/me.m07.d10:meMA.Ode4C1T.incipit	Ἐπεσκίασεν ἡ τοῦ Ὑψίστου, Κόρη…
ltx/gr_gr_cog/me.m07.d10:meMA.Ode4C1T.melody	@ltx/gr_gr_cog/he.h.m5:heHE.EisakikoaTinAkoin.name
ltx/gr_gr_cog/me.m07.d10:meMA.Ode4C1T.mode	@ltx/gr_gr_cog/miscellanea:misc.Mode5
ltx/gr_gr_cog/me.m07.d10:meMA.Ode4C1T.ode	@ltx/gr_gr_cog/miscellanea:misc.Ode4
ltx/gr_gr_cog/me.m07.d10:meMA.Ode4C1T.text	Ἐπεσκίασεν ἡ τοῦ Ὑψίστου, Κόρη δύναμις ἐν σοί, καὶ παράδεισον εἰργάσατο τρυφῆς, ζωῆς ξύλον ἔχουσαν, μέσον τὸν μεσίτην καὶ Κύριον.
ltx/gr_gr_cog/me.m07.d10:meMA.Ode5C11.greekmelody	@ltx/gr_gr_cog/he.h.m5:heHE.OrthrizontesVoomenSoi.greekname
ltx/gr_gr_cog/me.m07.d10:meMA.Ode5C11.incipit	Λογίοις τεθραμμένοι τοῦ Πνεύματος τοῦ…
ltx/gr_gr_cog/me.m07.d10:meMA.Ode5C11.melody	@ltx/gr_gr_cog/he.h.m5:heHE.OrthrizontesVoomenSoi.name
ltx/gr_gr_cog/me.m07.d10:meMA.Ode5C11.mode	@ltx/gr_gr_cog/miscellanea:misc.Mode5
ltx/gr_gr_cog/me.m07.d10:meMA.Ode5C11.ode	@ltx/gr_gr_cog/miscellanea:misc.Ode5
ltx/gr_gr_cog/me.m07.d10:meMA.Ode5C11.text	Λογίοις τεθραμμένοι τοῦ Πνεύματος τοῦ Ἁγίου, εἰδώλων οἱ Μάρτυρες, τὴν ἀλογίαν κατήργησαν.
ltx/gr_gr_cog/me.m07.d10:meMA.Ode5C12.incipit	Ἀστέρες φαεσφόροι γεγόνατε Ἀθλοφόροι, καὶ…
ltx/gr_gr_cog/me.m07.d10:meMA.Ode5C12.melody	@ltx/gr_gr_cog/he.h.m5:heHE.OrthrizontesVoomenSoi.name
ltx/gr_gr_cog/me.m07.d10:meMA.Ode5C12.mode	@ltx/gr_gr_cog/miscellanea:misc.Mode5
ltx/gr_gr_cog/me.m07.d10:meMA.Ode5C12.ode	@ltx/gr_gr_cog/miscellanea:misc.Ode5
ltx/gr_gr_cog/me.m07.d10:meMA.Ode5C12.text	Ἀστέρες φαεσφόροι γεγόνατε Ἀθλοφόροι, καὶ ἄνθη τῆς πίστεως, τὴν εὐωδίαν ἐκπέμποντα.
ltx/gr_gr_cog/me.m07.d10:meMA.Ode5C13.incipit	Γεώργιον πεφήνατε Ἅγιοι τοῦ Ὑψίστου…
ltx/gr_gr_cog/me.m07.d10:meMA.Ode5C13.melody	@ltx/gr_gr_cog/he.h.m5:heHE.OrthrizontesVoomenSoi.name
ltx/gr_gr_cog/me.m07.d10:meMA.Ode5C13.mode	@ltx/gr_gr_cog/miscellanea:misc.Mode5
ltx/gr_gr_cog/me.m07.d10:meMA.Ode5C13.ode	@ltx/gr_gr_cog/miscellanea:misc.Ode5
ltx/gr_gr_cog/me.m07.d10:meMA.Ode5C13.text	Γεώργιον πεφήνατε Ἅγιοι τοῦ Ὑψίστου, δρεπάναις τεμνόμενον, τοῦ Μαρτυρίου πανεύφημοι.
ltx/gr_gr_cog/me.m07.d10:meMA.Ode5C1T.incipit	Μὴ παύσῃ δυσωποῦσα ὃν ἔτεκες…
ltx/gr_gr_cog/me.m07.d10:meMA.Ode5C1T.melody	@ltx/gr_gr_cog/he.h.m5:heHE.OrthrizontesVoomenSoi.name
ltx/gr_gr_cog/me.m07.d10:meMA.Ode5C1T.mode	@ltx/gr_gr_cog/miscellanea:misc.Mode5
ltx/gr_gr_cog/me.m07.d10:meMA.Ode5C1T.ode	@ltx/gr_gr_cog/miscellanea:misc.Ode5
ltx/gr_gr_cog/me.m07.d10:meMA.Ode5C1T.text	Μὴ παύσῃ δυσωποῦσα ὃν ἔτεκες Θεοτόκε, σῶσαι τὰς ψυχὰς ἡμῶν, τῶν ἐκτενῶς ἀνυμνούντων σε.
ltx/gr_gr_cog/me.m07.d10:meMA.Ode6C11.greekmelody	@ltx/gr_gr_cog/he.h.m5:heHE.EkykloseMeAvyssos.greekname
ltx/gr_gr_cog/me.m07.d10:meMA.Ode6C11.incipit	Γηθόμενοι οἱ μάρτυρες, ἐβόων· Εἰς…
ltx/gr_gr_cog/me.m07.d10:meMA.Ode6C11.melody	@ltx/gr_gr_cog/he.h.m5:heHE.EkykloseMeAvyssos.name
ltx/gr_gr_cog/me.m07.d10:meMA.Ode6C11.mode	@ltx/gr_gr_cog/miscellanea:misc.Mode5
ltx/gr_gr_cog/me.m07.d10:meMA.Ode6C11.ode	@ltx/gr_gr_cog/miscellanea:misc.Ode6
ltx/gr_gr_cog/me.m07.d10:meMA.Ode6C11.text	Γηθόμενοι οἱ μάρτυρες, ἐβόων· Εἰς χεῖράς σου Δέσποτα, προσδέχου τὰ πνεύματα, ἡμῶν καὶ ἀνάπαυσον· σὲ γὰρ ποθοῦμεν, τὸν μόνον πολυέλεον.
ltx/gr_gr_cog/me.m07.d10:meMA.Ode6C12.incipit	Ἀγγέλων συνομόσκηνος, φάλαγξ τῶν σῶν…
ltx/gr_gr_cog/me.m07.d10:meMA.Ode6C12.melody	@ltx/gr_gr_cog/he.h.m5:heHE.EkykloseMeAvyssos.name
ltx/gr_gr_cog/me.m07.d10:meMA.Ode6C12.mode	@ltx/gr_gr_cog/miscellanea:misc.Mode5
ltx/gr_gr_cog/me.m07.d10:meMA.Ode6C12.ode	@ltx/gr_gr_cog/miscellanea:misc.Ode6
ltx/gr_gr_cog/me.m07.d10:meMA.Ode6C12.text	Ἀγγέλων συνομόσκηνος, φάλαγξ τῶν σῶν ἐχρημάτισε, Μαρτύρων Φιλάνθρωπε, τὸν δρόμον τελέσασα, καὶ νῦν πρεσβεύει, σωθῆναι τὰς ψυχὰς ἡμῶν.
ltx/gr_gr_cog/me.m07.d10:meMA.Ode6C13.incipit	Μαρτύρων ἡ πανεύκλεια, Μαρτύρων χορεία…
ltx/gr_gr_cog/me.m07.d10:meMA.Ode6C13.melody	@ltx/gr_gr_cog/he.h.m5:heHE.EkykloseMeAvyssos.name
ltx/gr_gr_cog/me.m07.d10:meMA.Ode6C13.mode	@ltx/gr_gr_cog/miscellanea:misc.Mode5
ltx/gr_gr_cog/me.m07.d10:meMA.Ode6C13.ode	@ltx/gr_gr_cog/miscellanea:misc.Ode6
ltx/gr_gr_cog/me.m07.d10:meMA.Ode6C13.text	Μαρτύρων ἡ πανεύκλεια, Μαρτύρων χορεία θεόλεκτος, Μαρτύρων εὐπρέπεια, θερμῶς δυσωπήσατε, σωθῆναι πάντας, τοὺς πρὸς ἡμᾶς προσφεύγοντας.
ltx/gr_gr_cog/me.m07.d10:meMA.Ode6C1T.incipit	Συλλήψεως ἀσπόρου σου, τίς λόγος…
ltx/gr_gr_cog/me.m07.d10:meMA.Ode6C1T.melody	@ltx/gr_gr_cog/he.h.m5:heHE.EkykloseMeAvyssos.name
ltx/gr_gr_cog/me.m07.d10:meMA.Ode6C1T.mode	@ltx/gr_gr_cog/miscellanea:misc.Mode5
ltx/gr_gr_cog/me.m07.d10:meMA.Ode6C1T.ode	@ltx/gr_gr_cog/miscellanea:misc.Ode6
ltx/gr_gr_cog/me.m07.d10:meMA.Ode6C1T.text	Συλλήψεως ἀσπόρου σου, τίς λόγος ὁ φράσαι δυνάμενος, τὸ θαῦμα Πανάμωμε; Θεὸν γὰρ συνέλαβες, διʼ εὐσπλαγχνίαν, ἡμῖν ἐπιδημήσαντα.
ltx/gr_gr_cog/me.m07.d10:meMA.Ode6H.greekmelody	@ltx/gr_gr_cog/he.h.m5:heHE.EkykloseMeAvyssos.greekname
ltx/gr_gr_cog/me.m07.d10:meMA.Ode6H.incipit	@ltx/gr_gr_cog/he.h.m5:heHE.EkykloseMeAvyssos.incipit
ltx/gr_gr_cog/me.m07.d10:meMA.Ode6H.melody	@ltx/gr_gr_cog/he.h.m5:heHE.EkykloseMeAvyssos.melody
ltx/gr_gr_cog/me.m07.d10:meMA.Ode6H.mode	@ltx/gr_gr_cog/miscellanea:misc.Mode5
ltx/gr_gr_cog/me.m07.d10:meMA.Ode6H.ode	@ltx/gr_gr_cog/miscellanea:misc.Ode6
ltx/gr_gr_cog/me.m07.d10:meMA.Ode6H.text	@ltx/gr_gr_cog/he.h.m5:heHE.EkykloseMeAvyssos.text
ltx/gr_gr_cog/me.m07.d10:meMA.Ode7C11.greekmelody	@ltx/gr_gr_cog/he.h.m5:heHE.OEnKaminoPyros.greekname
ltx/gr_gr_cog/me.m07.d10:meMA.Ode7C11.incipit	Ἐν τῇ καμίνῳ Χριστέ, οἱ…
ltx/gr_gr_cog/me.m07.d10:meMA.Ode7C11.melody	@ltx/gr_gr_cog/he.h.m5:heHE.OEnKaminoPyros.name
ltx/gr_gr_cog/me.m07.d10:meMA.Ode7C11.mode	@ltx/gr_gr_cog/miscellanea:misc.Mode5
ltx/gr_gr_cog/me.m07.d10:meMA.Ode7C11.ode	@ltx/gr_gr_cog/miscellanea:misc.Ode7
ltx/gr_gr_cog/me.m07.d10:meMA.Ode7C11.text	Ἐν τῇ καμίνῳ Χριστέ, οἱ Ἀθλοφόροι ἐμελῴδουν· Εὐλογητὸς ὁ Θεός, ὁ τῶν Πατέρων ἡμῶν.
ltx/gr_gr_cog/me.m07.d10:meMA.Ode7C12.incipit	Λελαμπρυσμένοι φωτί, τῷ τῆς Τριάδος…
ltx/gr_gr_cog/me.m07.d10:meMA.Ode7C12.melody	@ltx/gr_gr_cog/he.h.m5:heHE.OEnKaminoPyros.name
ltx/gr_gr_cog/me.m07.d10:meMA.Ode7C12.mode	@ltx/gr_gr_cog/miscellanea:misc.Mode5
ltx/gr_gr_cog/me.m07.d10:meMA.Ode7C12.ode	@ltx/gr_gr_cog/miscellanea:misc.Ode7
ltx/gr_gr_cog/me.m07.d10:meMA.Ode7C12.text	Λελαμπρυσμένοι φωτί, τῷ τῆς Τριάδος Ἀθλοφόροι, μετʼ εὐφροσύνης ὑμῶν, τὰς ψυχὰς παρεδώκατε.
ltx/gr_gr_cog/me.m07.d10:meMA.Ode7C13.incipit	Παρεστηκότες Θεῷ, στεφανηφόροι Ἀθλοφόροι, ὑπὲρ…
ltx/gr_gr_cog/me.m07.d10:meMA.Ode7C13.melody	@ltx/gr_gr_cog/he.h.m5:heHE.OEnKaminoPyros.name
ltx/gr_gr_cog/me.m07.d10:meMA.Ode7C13.mode	@ltx/gr_gr_cog/miscellanea:misc.Mode5
ltx/gr_gr_cog/me.m07.d10:meMA.Ode7C13.ode	@ltx/gr_gr_cog/miscellanea:misc.Ode7
ltx/gr_gr_cog/me.m07.d10:meMA.Ode7C13.text	Παρεστηκότες Θεῷ, στεφανηφόροι Ἀθλοφόροι, ὑπὲρ ὑμῶν ἐκτενῶς, ἀεὶ πρεσβεύετε.
ltx/gr_gr_cog/me.m07.d10:meMA.Ode7C14.incipit	Ὡς ἀληθείας πυρσοί, ὡς εὐσεβείας…
ltx/gr_gr_cog/me.m07.d10:meMA.Ode7C14.melody	@ltx/gr_gr_cog/he.h.m5:heHE.OEnKaminoPyros.name
ltx/gr_gr_cog/me.m07.d10:meMA.Ode7C14.mode	@ltx/gr_gr_cog/miscellanea:misc.Mode5
ltx/gr_gr_cog/me.m07.d10:meMA.Ode7C14.ode	@ltx/gr_gr_cog/miscellanea:misc.Ode7
ltx/gr_gr_cog/me.m07.d10:meMA.Ode7C14.text	Ὡς ἀληθείας πυρσοί, ὡς εὐσεβείας ὄντες πύργοι, περιφανεῖς, Ἀθληταί, πιστοῖς ἐδείχθητε.
ltx/gr_gr_cog/me.m07.d10:meMA.Ode7C1T.incipit	Ὡς σωτηρίαν ἡμῶν, σὲ Θεοτόκε…
ltx/gr_gr_cog/me.m07.d10:meMA.Ode7C1T.melody	@ltx/gr_gr_cog/he.h.m5:heHE.OEnKaminoPyros.name
ltx/gr_gr_cog/me.m07.d10:meMA.Ode7C1T.mode	@ltx/gr_gr_cog/miscellanea:misc.Mode5
ltx/gr_gr_cog/me.m07.d10:meMA.Ode7C1T.ode	@ltx/gr_gr_cog/miscellanea:misc.Ode7
ltx/gr_gr_cog/me.m07.d10:meMA.Ode7C1T.text	Ὡς σωτηρίαν ἡμῶν, σὲ Θεοτόκε δυσωποῦμεν· Ἐξευμενίζου ἡμῖν, τὸν σαρκωθέντα ἐκ σοῦ.
ltx/gr_gr_cog/me.m07.d10:meMA.Ode8C11.greekmelody	@ltx/gr_gr_cog/he.h.m5:heHE.TonEkPatrosProAionon.greekname
ltx/gr_gr_cog/me.m07.d10:meMA.Ode8C11.incipit	Μετὰ Μαρτύρων γενέσθω, τὰ αἰτήματα…
ltx/gr_gr_cog/me.m07.d10:meMA.Ode8C11.melody	@ltx/gr_gr_cog/he.h.m5:heHE.TonEkPatrosProAionon.name
ltx/gr_gr_cog/me.m07.d10:meMA.Ode8C11.mode	@ltx/gr_gr_cog/miscellanea:misc.Mode5
ltx/gr_gr_cog/me.m07.d10:meMA.Ode8C11.ode	@ltx/gr_gr_cog/miscellanea:misc.Ode8
ltx/gr_gr_cog/me.m07.d10:meMA.Ode8C11.text	Μετὰ Μαρτύρων γενέσθω, τὰ αἰτήματα ἡμῶν τῶν πιστῶν, καὶ τῆς αὐτῶν κληρουχίας, κοινωνοὶ ἀξιωθείημεν, τὸν Χριστὸν ὑμνοῦντες, καὶ ὑπερυψοῦντες, εἰς πάντας τοὺς αἰῶνας.
ltx/gr_gr_cog/me.m07.d10:meMA.Ode8C12.incipit	Ἀγαλλιάσει καρδίας, ὁ χορὸς τῶν…
ltx/gr_gr_cog/me.m07.d10:meMA.Ode8C12.melody	@ltx/gr_gr_cog/he.h.m5:heHE.TonEkPatrosProAionon.name
ltx/gr_gr_cog/me.m07.d10:meMA.Ode8C12.mode	@ltx/gr_gr_cog/miscellanea:misc.Mode5
ltx/gr_gr_cog/me.m07.d10:meMA.Ode8C12.ode	@ltx/gr_gr_cog/miscellanea:misc.Ode8
ltx/gr_gr_cog/me.m07.d10:meMA.Ode8C12.text	Ἀγαλλιάσει καρδίας, ὁ χορὸς τῶν καρτερῶν ἀθλητῶν, παρὰ Χριστοῦ τοὺς στεφάνους, εὐπρεπῶς ἀπολαμβάνουσι, καὶ φαιδρῶς ἀνυμνοῦσι, καὶ ὑπερυψοῦσιν, αὐτὸν εἰς τοὺς αἰῶνας.
ltx/gr_gr_cog/me.m07.d10:meMA.Ode8C13.incipit	Ῥείθροις ἰδίων αἱμάτων, φοινιχθέντες Ἀξιάγαστοι…
ltx/gr_gr_cog/me.m07.d10:meMA.Ode8C13.melody	@ltx/gr_gr_cog/he.h.m5:heHE.TonEkPatrosProAionon.name
ltx/gr_gr_cog/me.m07.d10:meMA.Ode8C13.mode	@ltx/gr_gr_cog/miscellanea:misc.Mode5
ltx/gr_gr_cog/me.m07.d10:meMA.Ode8C13.ode	@ltx/gr_gr_cog/miscellanea:misc.Ode8
ltx/gr_gr_cog/me.m07.d10:meMA.Ode8C13.text	Ῥείθροις ἰδίων αἱμάτων, φοινιχθέντες Ἀξιάγαστοι, ἐν οὐρανοῖς τῷ Χριστῷ συμβασιλεύετε, εὐσεβῶς ὑμνοῦντες, καὶ ὑπερυψοῦντες αὐτὸν εἰς τοὺς αἰῶνας.
ltx/gr_gr_cog/me.m07.d10:meMA.Ode8C14.incipit	Τοὺς καρτεροὺς στρατιώτας, τοὺς λαμπτῆρας…
ltx/gr_gr_cog/me.m07.d10:meMA.Ode8C14.melody	@ltx/gr_gr_cog/he.h.m5:heHE.TonEkPatrosProAionon.name
ltx/gr_gr_cog/me.m07.d10:meMA.Ode8C14.mode	@ltx/gr_gr_cog/miscellanea:misc.Mode5
ltx/gr_gr_cog/me.m07.d10:meMA.Ode8C14.ode	@ltx/gr_gr_cog/miscellanea:misc.Ode8
ltx/gr_gr_cog/me.m07.d10:meMA.Ode8C14.text	Τοὺς καρτεροὺς στρατιώτας, τοὺς λαμπτῆρας τοῦ ἀσβέστου πυρός, τοὺς κοινωνοὺς τῶν φωτίδων (ἴσως φωστήρων), τοὺς ἀστέρας ἀεὶ λάμποντας, εὐσεβῶς ὑμνοῦμεν, Χριστὸν ὑπερυψοῦντες, εἰς πάντας τοὺς αἰῶνας.
ltx/gr_gr_cog/me.m07.d10:meMA.Ode8C1T.incipit	Τῶν Χερουβὶμ ὑπερτέρα, ἀνεδείχθης Θεοτόκε…
ltx/gr_gr_cog/me.m07.d10:meMA.Ode8C1T.melody	@ltx/gr_gr_cog/he.h.m5:heHE.TonEkPatrosProAionon.name
ltx/gr_gr_cog/me.m07.d10:meMA.Ode8C1T.mode	@ltx/gr_gr_cog/miscellanea:misc.Mode5
ltx/gr_gr_cog/me.m07.d10:meMA.Ode8C1T.ode	@ltx/gr_gr_cog/miscellanea:misc.Ode8
ltx/gr_gr_cog/me.m07.d10:meMA.Ode8C1T.text	Τῶν Χερουβὶμ ὑπερτέρα, ἀνεδείχθης Θεοτόκε ἁγνή, ἐν τῇ γαστρί σου τὸν τούτοις ἐποχούμενον βαστάσασα, ὃν σὺν Ἀσωμάτοις, βροτοὶ δοξολογοῦμεν, εἰς πάντας τοὺς αἰῶνας.
ltx/gr_gr_cog/me.m07.d10:meMA.Ode8H.greekmelody	@ltx/gr_gr_cog/he.h.m5:heHE.TonEkPatrosProAionon.greekname
ltx/gr_gr_cog/me.m07.d10:meMA.Ode8H.incipit	@ltx/gr_gr_cog/he.h.m5:heHE.TonEkPatrosProAionon.incipit
ltx/gr_gr_cog/me.m07.d10:meMA.Ode8H.melody	@ltx/gr_gr_cog/he.h.m5:heHE.TonEkPatrosProAionon.melody
ltx/gr_gr_cog/me.m07.d10:meMA.Ode8H.mode	@ltx/gr_gr_cog/miscellanea:misc.Mode5
ltx/gr_gr_cog/me.m07.d10:meMA.Ode8H.ode	@ltx/gr_gr_cog/miscellanea:misc.Ode8
ltx/gr_gr_cog/me.m07.d10:meMA.Ode8H.text	@ltx/gr_gr_cog/he.h.m5:heHE.TonEkPatrosProAionon.text
ltx/gr_gr_cog/me.m07.d10:meMA.Ode9C11.greekmelody	@ltx/gr_gr_cog/he.h.m5:heHE.SeTinYperNoun.greekname
ltx/gr_gr_cog/me.m07.d10:meMA.Ode9C11.incipit	Ὑπὲρ τῆς κοινῆς, σωτηρίας πρεσβεύσατε…
ltx/gr_gr_cog/me.m07.d10:meMA.Ode9C11.melody	@ltx/gr_gr_cog/he.h.m5:heHE.SeTinYperNoun.name
ltx/gr_gr_cog/me.m07.d10:meMA.Ode9C11.mode	@ltx/gr_gr_cog/miscellanea:misc.Mode5
ltx/gr_gr_cog/me.m07.d10:meMA.Ode9C11.ode	@ltx/gr_gr_cog/miscellanea:misc.Ode9
ltx/gr_gr_cog/me.m07.d10:meMA.Ode9C11.text	Ὑπὲρ τῆς κοινῆς, σωτηρίας πρεσβεύσατε, παναοίδιμοι Μάρτυρες, Χριστῷ παριστάμενοι, διʼ ὃν καὶ τοὺς ἀγῶνας ὑπεμείνατε.
ltx/gr_gr_cog/me.m07.d10:meMA.Ode9C12.incipit	Ῥώμῃ κραταιᾷ, τὸ τῆς πλάνης…
ltx/gr_gr_cog/me.m07.d10:meMA.Ode9C12.melody	@ltx/gr_gr_cog/he.h.m5:heHE.SeTinYperNoun.name
ltx/gr_gr_cog/me.m07.d10:meMA.Ode9C12.mode	@ltx/gr_gr_cog/miscellanea:misc.Mode5
ltx/gr_gr_cog/me.m07.d10:meMA.Ode9C12.ode	@ltx/gr_gr_cog/miscellanea:misc.Ode9
ltx/gr_gr_cog/me.m07.d10:meMA.Ode9C12.text	Ῥώμῃ κραταιᾷ, τὸ τῆς πλάνης ὀχύρωμα, καθελόντες ἀήττητοι, οἰκίαν οὐράνιον, κατοικεῖν σὺν Ἀγγέλοις ἠξιώθητε.
ltx/gr_gr_cog/me.m07.d10:meMA.Ode9C13.incipit	Ὡς ἀειφανεῖς, δεδειγμένοι φωστῆρες ἡμῖν…
ltx/gr_gr_cog/me.m07.d10:meMA.Ode9C13.melody	@ltx/gr_gr_cog/he.h.m5:heHE.SeTinYperNoun.name
ltx/gr_gr_cog/me.m07.d10:meMA.Ode9C13.mode	@ltx/gr_gr_cog/miscellanea:misc.Mode5
ltx/gr_gr_cog/me.m07.d10:meMA.Ode9C13.ode	@ltx/gr_gr_cog/miscellanea:misc.Ode9
ltx/gr_gr_cog/me.m07.d10:meMA.Ode9C13.text	Ὡς ἀειφανεῖς, δεδειγμένοι φωστῆρες ἡμῖν, οἱ καλλίνικοι Μάρτυρες, ἀπαύστως αὐγάζουσι, φωτοβόλοις λάμψεσι τὰς ψυχὰς ἡμῶν.
ltx/gr_gr_cog/me.m07.d10:meMA.Ode9C14.incipit	Νόμοις καὶ θεσμοῖς, μαρτυρίου νικήσαντες…
ltx/gr_gr_cog/me.m07.d10:meMA.Ode9C14.melody	@ltx/gr_gr_cog/he.h.m5:heHE.SeTinYperNoun.name
ltx/gr_gr_cog/me.m07.d10:meMA.Ode9C14.mode	@ltx/gr_gr_cog/miscellanea:misc.Mode5
ltx/gr_gr_cog/me.m07.d10:meMA.Ode9C14.ode	@ltx/gr_gr_cog/miscellanea:misc.Ode9
ltx/gr_gr_cog/me.m07.d10:meMA.Ode9C14.text	Νόμοις καὶ θεσμοῖς, μαρτυρίου νικήσαντες, τὸν ἀλάστορα τύραννον, στεφάνους ἐδέξασθε, τοὺς τῆς δικαιοσύνης Πανσεβάσμιοι.
ltx/gr_gr_cog/me.m07.d10:meMA.Ode9C1T.incipit	Χαῖρε Θεοτόκε, μήτηρ Χριστοῦ τοῦ…
ltx/gr_gr_cog/me.m07.d10:meMA.Ode9C1T.melody	@ltx/gr_gr_cog/he.h.m5:heHE.SeTinYperNoun.name
ltx/gr_gr_cog/me.m07.d10:meMA.Ode9C1T.mode	@ltx/gr_gr_cog/miscellanea:misc.Mode5
ltx/gr_gr_cog/me.m07.d10:meMA.Ode9C1T.ode	@ltx/gr_gr_cog/miscellanea:misc.Ode9
ltx/gr_gr_cog/me.m07.d10:meMA.Ode9C1T.text	Χαῖρε Θεοτόκε, μήτηρ Χριστοῦ τοῦ Θεοῦ, ὃν ἐκύησας αἴτησαι, πταισμάτων τὴν ἄφεσιν, δωρηθῆναι τοῖς πίστει ἀνυμνοῦσί σε.
ltx/gr_gr_cog/me.m07.d10:meMA.Ode9H.greekmelody	@ltx/gr_gr_cog/he.h.m5:heHE.SeTinYperNoun.greekname
ltx/gr_gr_cog/me.m07.d10:meMA.Ode9H.incipit	@ltx/gr_gr_cog/he.h.m5:heHE.SeTinYperNoun.incipit
ltx/gr_gr_cog/me.m07.d10:meMA.Ode9H.melody	@ltx/gr_gr_cog/he.h.m5:heHE.SeTinYperNoun.melody
ltx/gr_gr_cog/me.m07.d10:meMA.Ode9H.mode	@ltx/gr_gr_cog/miscellanea:misc.Mode5
ltx/gr_gr_cog/me.m07.d10:meMA.Ode9H.ode	@ltx/gr_gr_cog/miscellanea:misc.Ode9
ltx/gr_gr_cog/me.m07.d10:meMA.Ode9H.text	@ltx/gr_gr_cog/he.h.m5:heHE.SeTinYperNoun.text
ltx/gr_gr_cog/me.m07.d10:meVE.Apolytikion1ger.greekmelody	@ltx/gr_gr_cog/he.a.m4:heAU.TachyProkatalave.greekname
ltx/gr_gr_cog/me.m07.d10:meVE.Apolytikion1ger.incipit	Στρατὸς θεοσύλλεκτος, παρεμβολὴ ἱερά, νομίμως…
ltx/gr_gr_cog/me.m07.d10:meVE.Apolytikion1ger.melody	@ltx/gr_gr_cog/he.a.m4:heAU.TachyProkatalave.name
ltx/gr_gr_cog/me.m07.d10:meVE.Apolytikion1ger.mode	@ltx/gr_gr_cog/miscellanea:misc.Mode4
ltx/gr_gr_cog/me.m07.d10:meVE.Apolytikion1ger.poet	@ltx/gr_gr_cog/poets:po.Gerasimou
ltx/gr_gr_cog/me.m07.d10:meVE.Apolytikion1ger.text	Στρατὸς θεοσύλλεκτος, παρεμβολὴ ἱερά, νομίμως ἀθλήσαντες ὑπὲρ τῆς δόξης Χριστοῦ, ἐν Πνεύματι ὤφθητε, Μάρτυρες τοῦ Κυρίου, Τεσσαράκοντα πέντε, λύσαντες διʼ ἀγώνων, τὴν πολύθεον πλάνην· διὸ ἡμῶν τοὺς ἀγῶνας, πάντες δοξάζομεν.
ltx/gr_gr_cog/me.m07.d10:meVE.SticStavrotheotokion.greekmelody	@ltx/gr_gr_cog/he.a.m1:heAU.PaneffimoiMartyres.greekname
ltx/gr_gr_cog/me.m07.d10:meVE.SticStavrotheotokion.incipit	@ltx/gr_gr_cog/oc.m1.d4:ocVE.AposTheotokion.incipit
ltx/gr_gr_cog/me.m07.d10:meVE.SticStavrotheotokion.melody	@ltx/gr_gr_cog/he.a.m1:heAU.PaneffimoiMartyres.name
ltx/gr_gr_cog/me.m07.d10:meVE.SticStavrotheotokion.mode	@ltx/gr_gr_cog/miscellanea:misc.Mode1
ltx/gr_gr_cog/me.m07.d10:meVE.SticStavrotheotokion.text	@ltx/gr_gr_cog/oc.m1.d4:ocVE.AposTheotokion.text
ltx/gr_gr_cog/me.m07.d10:meVE.SticTheotokion.greekmelody	@ltx/gr_gr_cog/he.a.m1:heAU.PaneffimoiMartyres.greekname
ltx/gr_gr_cog/me.m07.d10:meVE.SticTheotokion.incipit	Συνέχομαι πάντοθεν δεινοῖς, καὶ ποῦ…
ltx/gr_gr_cog/me.m07.d10:meVE.SticTheotokion.melody	@ltx/gr_gr_cog/he.a.m1:heAU.PaneffimoiMartyres.name
ltx/gr_gr_cog/me.m07.d10:meVE.SticTheotokion.mode	@ltx/gr_gr_cog/miscellanea:misc.Mode1
ltx/gr_gr_cog/me.m07.d10:meVE.SticTheotokion.text	Συνέχομαι πάντοθεν δεινοῖς, καὶ ποῦ φύγω Δέσποινα, ὁ δυστυχὴς καὶ πανάθλιος; εἰμὴ πρὸς σὲ ἁγνή, καταφεύγω μόνην, τὴν ἐμὴν βοήθειαν, ἐλπὶς ἀπηλπισμένων Θεόνυμφε, καὶ μὴ παρίδῃς με, τὸν ἀνάξιον οἰκέτην σου, θλιβομένων, ἑτοίμη βοήθεια.
ltx/gr_gr_cog/me.m07.d10:meVE.Stichera01.greekmelody	@ltx/gr_gr_cog/he.a.m1:heAU.PaneffimoiMartyres.greekname
ltx/gr_gr_cog/me.m07.d10:meVE.Stichera01.incipit	Πανεύφημοι Μάρτυρες ὑμεῖς, λίθοις συντριβόμενοι…
ltx/gr_gr_cog/me.m07.d10:meVE.Stichera01.melody	@ltx/gr_gr_cog/he.a.m1:heAU.PaneffimoiMartyres.name
ltx/gr_gr_cog/me.m07.d10:meVE.Stichera01.mode	@ltx/gr_gr_cog/miscellanea:misc.Mode1
ltx/gr_gr_cog/me.m07.d10:meVE.Stichera01.text	Πανεύφημοι Μάρτυρες ὑμεῖς, λίθοις συντριβόμενοι, Χριστὸν τὴν πέτραν τὴν ἄῤῥηκτον, οὐκ ἐξηρνήσασθε, ἀλλὰ νικηφόροι, χάριτι γενόμενοι, Ἀγγέλων τοῖς χοροῖς συναγάλλεσθε, μεθʼ ὧν πρεσβεύσατε, δωρηθῆναι ταῖς ψυχαῖς ἡμῶν, τὴν εἰρήνην, καὶ τὸ μέγα ἔλεος.
ltx/gr_gr_cog/me.m07.d10:meVE.Stichera02.incipit	Καλλίνικοι μάρτυρες φρουραῖς, ἅμα συγκλειόμενοι…
ltx/gr_gr_cog/me.m07.d10:meVE.Stichera02.melody	@ltx/gr_gr_cog/he.a.m1:heAU.PaneffimoiMartyres.name
ltx/gr_gr_cog/me.m07.d10:meVE.Stichera02.mode	@ltx/gr_gr_cog/miscellanea:misc.Mode1
ltx/gr_gr_cog/me.m07.d10:meVE.Stichera02.text	Καλλίνικοι μάρτυρες φρουραῖς, ἅμα συγκλειόμενοι, ὡς ἐντολῶν θείων φύλακες, καὶ ἐκτηκόμενοι, δίψει οὐρανόθεν, δρόσον ἐκομίσασθε, ὑμᾶς πνευματικῶς ἀναψύχουσαν· διὸ πρεσβεύσατε, δωρηθῆναι ταῖς ψυχαῖς ἡμῶν, τὴν εἰρήνην, καὶ τὸ μέγα ἔλεος.
ltx/gr_gr_cog/me.m07.d10:meVE.Stichera03.incipit	Ἀήττητοι Μάρτυρες ζωήν, ἀληθῆ ποθήσαντες…
ltx/gr_gr_cog/me.m07.d10:meVE.Stichera03.melody	@ltx/gr_gr_cog/he.a.m1:heAU.PaneffimoiMartyres.name
ltx/gr_gr_cog/me.m07.d10:meVE.Stichera03.mode	@ltx/gr_gr_cog/miscellanea:misc.Mode1
ltx/gr_gr_cog/me.m07.d10:meVE.Stichera03.text	Ἀήττητοι Μάρτυρες ζωήν, ἀληθῆ ποθήσαντες, καὶ εἰς ἀεὶ διαμένουσαν, θάνατον ἄδικον, παρανόμῳ ψήφῳ, χαίροντες ὑπέστητε, καὶ νῦν μετὰ Μαρτύρων εὐφραίνεσθε, μεθʼ ὧν πρεσβεύσατε, δωρηθῆναι ταῖς ψυχαῖς ἡμῶν, τὴν εἰρήνην, καὶ τὸ μέγα ἔλεος.
