ltx/gr_gr_cog/sy.m11.d03:cl.syMA.commemoration01.text	[saint/com 1]
ltx/gr_gr_cog/sy.m11.d03:cl.syMA.commemoration02.text	[saint/com 2]
ltx/gr_gr_cog/sy.m11.d03:cl.syMA.commemoration03.text	[saint/com 3]
ltx/gr_gr_cog/sy.m11.d03:cl.syMA.commemoration04.text	[saint/com 4]
ltx/gr_gr_cog/sy.m11.d03:cl.syMA.commemoration05.text	[saint/com 5]
ltx/gr_gr_cog/sy.m11.d03:cl.syMA.commemoration06.text	[saint/com list]
ltx/gr_gr_cog/sy.m11.d03:syMA.commemoration01.couplet1.title	@ltx/gr_gr_cog/titles:ti.Verses
ltx/gr_gr_cog/sy.m11.d03:syMA.commemoration01.couplet1.verse1	Ἀκεψιμᾶν κτείνουσιν ἐκ ῥαβδισμάτων·
ltx/gr_gr_cog/sy.m11.d03:syMA.commemoration01.couplet1.verse2	Ἀκεψιμᾶ δὲ τοὺς φίλους ἐκ λευσμάτων.
ltx/gr_gr_cog/sy.m11.d03:syMA.commemoration01.narration.p01	Οὗτοι ὑπῆρχον ἐπὶ Σαβωρίου βασιλέως Περσῶν· καὶ συσχεθέντες, παρίστανται Ἀδραχοσχὰρ τῷ ἀρχιμαγείρῳ εἰς ἐξέτασιν. Καὶ εὐθέως ὁ ἅγιος Ἀκεψιμᾶς ῥάβδοις ῥοΐναις τύπτεται· ὁ δὲ ἅγιος Ἰωσὴφ τείνεται καὶ μαστίζεται, ὡς διαιρεθῆναι τὰς σάρκας αὐτοῦ μέχρι τῶν ὀστῶν, καὶ φρουρεῖται δεδεμένος. Ὁ δὲ ἅγιος Ἀειθαλᾶς, δεσμευθεὶς χερσὶ καὶ ποσὶν ὑπὸ τὰ γόνατα, ἐξαρθροῦται τὰς ἁρμονίας μαστιζόμενος καὶ τῇ εἱρκτῇ ἐγκλείεται. Μετὰ ταῦτα ὁ μὲν ἅγιος Ἀκεψιμᾶς ὑπὸ τριάκοντα τυφθεὶς στρατιωτῶν, τὴν ψυχὴν παρέδωκε· κατὰ κεφαλῆς δὲ ὁ Ἰωσὴφ κρεμασθείς, κατελεύσθη. Ὁ δὲ Ἀειθαλᾶς, ὑπὸ τεσσαράκοντα στρατιωτῶν ταθείς, κρεμᾶται καὶ αὐτὸς κατὰ κεφαλῆς, καὶ οὕτω τὸ πνεῦμα τῷ Κυρίῳ παρέδωκε.
ltx/gr_gr_cog/sy.m11.d03:syMA.commemoration01.single1	Τύψαν Ἀκεψιμᾶν τριτάτῃ, λεῦσαν δὲ συνάθλους.
ltx/gr_gr_cog/sy.m11.d03:syMA.commemoration01.text	Τῇ Γʹ τοῦ αὐτοῦ μηνὸς μνήμη τῶν ἁγίων Μαρτύρων Ἀκεψιμᾶ, Ἰωσὴφ καὶ Ἀειθαλᾶ.
ltx/gr_gr_cog/sy.m11.d03:syMA.commemoration02.couplet1.title	@ltx/gr_gr_cog/titles:ti.Verses
ltx/gr_gr_cog/sy.m11.d03:syMA.commemoration02.couplet1.verse1	Ναοῦ τὰ ἐγκαίνια, Μάρτυς, καὶ θέσιν,
ltx/gr_gr_cog/sy.m11.d03:syMA.commemoration02.couplet1.verse2	Τῶν λειψάνων σου νῦν γεραίρει ἡ κτίσις.
ltx/gr_gr_cog/sy.m11.d03:syMA.commemoration02.narration.p01	Οὗτος ὁ ἔνδοξος τοῦ Χριστοῦ Μεγαλομάρτυς Γεώργιος ἦν ἐν τοῖς χρόνοις Διοκλητιανοῦ, πρὸς πατρὸς μὲν Καππαδόκης, ἐκ μητρὸς δὲ Παλαιστῖνος. Ἀγωγῆς δὲ θείας καὶ φύσεως τυχὼν ἀγαθῆς καὶ ῥίζης εὐκλεοῦς, τῶν γεννητόρων ἄνωθεν εὐγενείᾳ καὶ εὐσεβείᾳ κεκοσμημένων, πρὸς πολέμου γέγονεν ἐπιτηδειότατος καὶ λαμπρότατος. Ὅθεν καὶ παρὰ Διοκλητιανοῦ, τῆς ἥβης τῷ τηνικάδε ἀρξάμενος, τριβοῦνος νουμέρου ἐπισημότατος, εἶτα καὶ κόμης διὰ τὸ ἀήττητον τῆς ἀνδρείας γνωρίζεται, λανθάνων τὸ μέχρι τοῦδε, ὅτι χριστιανὸς ἦν.
ltx/gr_gr_cog/sy.m11.d03:syMA.commemoration02.narration.p02	Εἰκοστὸν δὲ λοιπὸν τῆς ἡλικίας χρόνον ἀνύων, ὀρφανὸς ἀπὸ πατρὸς ἐγεγόνει, ἐν τοῖς τῆς εὐσεβείας αγῶσιν ἐκείνου τὸν βίον ἀπολιπόντος. Ἀπάρας δὲ τῆς Καππαδοκῶν σὺν τῇ μητρί, πρὸς Παλαιστίνην, ἐξ ἧς αὐτὴ ὥρμητο, μετοικίζεται· εἰς ἣν δῆτα γῆν κτήματά τε πολλὰ καὶ κλῆροι αὐτῷ ἐτύγχανον. Τῆς οὖν μητρὸς παρὰ τὸν καιρὸν τοῦτον τὰ τῇδε ἀλλαξαμένης, κατελείφθησαν αὐτῷ χρήματά τε καὶ περιουσία πραγμάτων πολλή· ἃ καὶ λαβών, σὺν πᾶσι καὶ τοῖς αὐτῷ προσοῦσι, πρὸς τὸν Διοκλητιανὸν παραγίνεται (πιθανῶς εἰς Ῥώμην), μείζονος ἀρχῆς τυχεῖν ἐφιέμενος. Ἐκ πρώτης δὲ ἑωρακὼς τὴν τοσαύτην αὐτοῦ κατὰ χριστιανῶν μανίαν, μηδὲ οἷός τε ὢν τοιαῦτα ὁρᾶν, βούλεται τέως, ἃ παρʼ ἑαυτῷ περιέφερε χρήματα, τοῖς πένησι διανεῖμαι, ἑαυτὸν δὲ ἐνώπιον Διοκλητιανοῦ καὶ πάσης τῆς Βουλῆς χριστιανὸν κηρύξαι· ὃ καὶ πεποίηκε. Ταχέως οὖν ταῦτα τοῖς πένησι διανείμας, τούς τε παῖδας ἐλευθερίᾳ τιμήσας καὶ περὶ τῶν ἀπόντων τὰ δοκοῦντα εἰκότως διαταξάμενος, τῇ τρίτῃ τῆς βουλῆς ἡμέρᾳ, (βουλὴ γὰρ ἦν αὐτοῖς, ὥς τε τοὺς χριστιανοὺς ἐκ μέσου ποιήσασθαι), αὐτόκλητος ἐν μέσῳ τῆς Βουλῆς παραγίνεται, ἐκεῖσε τότε καὶ τοῦ Διοκλητιανοῦτυγχάνοντος.
ltx/gr_gr_cog/sy.m11.d03:syMA.commemoration02.narration.p03	Λαμπρῶς οὖν τὸν Χριστὸν Θεόν τε καὶ Θεοῦ Υἱὸν ἀνακηρύξας, παῤῥησιάζεται τὴν εὐσέβειαν. Διὸ κρατηθείς, παντοίαις καὶ ἀμετρήτοις σχεδὸν βασάνοις ἐκδίδοται· κοντῷ γὰρ τὴν γαστέρα κεντᾶται· τροχῷ καὶ βουνεύροις πολλάκις προσομιλεῖ, καὶ λάκκῳ τιτάνου πλήρει ἐμβάλλεται. Ἀσινὴς δὲ ἐκ πάντων τῇ τοῦ Χριστοῦ χάριτι διατηρηθείς, τὴν ὁμόζυγον τοῦ Διοκλητιανοῦ Ἀλεξάνδραν, σὺν αὐτῇ δὲ καὶ Γλυκέριόν τινα, καὶ ἕτερον, Ἀθανάσιον τοὔνομα, τὸν μὲν ἐκ νεκρῶν ἀναστήσας, θατέρου δὲ τὸ κτῆνος ζωώσας, καὶ ἄπειρον, ἁπλῶς εἰπεῖν, πλῆθος ἀνθρώπων μετηγάγετο πρὸς Χριστόν, θαύματα παντοῖα τῇ Χριστοῦ ἐπικλήσει ἀπεργασάμενος.
ltx/gr_gr_cog/sy.m11.d03:syMA.commemoration02.narration.p04	Τούτων οὖν οὕτως ὑπʼ αὐτοῦ τελουμένων, σιδηροδέσμιος, Διοκλητιανοῦ προστάξει, πρὸς φρουρὰν ἄγεται. Τῇ δὲ νυκτὶ ἐκείνῃ, ὁ Χριστὸς αὐτῷ ἐν ὁράματι φαίνεται, εὐαγγελιζόμενος τὰ ἀποκείμενα αὐτῷ ἀγαθά. Ἔξυπνος οὖν γεγονώς, ἀσμένως ἀπηυχαρίστει τῷ Θεῷ, τόν τε δεσμοφύλακα ἠντιβόλει, συγχωρηθῆναι προσελθεῖν τὸν ἐξ ἔθους διακονοῦντα οἰκέτην. Ἐπινεύσαντος δὲ τοῦ δεσμοφύλακος, εἰσῆλθεν ὁ οἰκέτης· ἔξωθεν γὰρ τῆς φυλακῆς παραμένων ἦν, ὃς καὶ τὰ κατὰ τὸν Ἅγιον ὑπομνήματα σὺν ἀκριβείᾳ πάσῃ ἐξέθετο. Τὸν αὑτοῦ οὖν Δεσπότην ἐν τοῖς δεσμοῖς ἰδὼν καὶ προσκυνήσας, ἐπʼ ἐδάφους ἔκειτο κλαίων. Ἀναστήσας δὲ τοῦτον ὁ Ἅγιος, εὐθυμεῖν παρεκελεύετο, εἶτα καὶ τὸ ὅραμα διεσάφει· προσέτι δὲ καὶ ἐπέσκηπτεν αὐτῷ, μετὰ τὴν ἔξοδον αὐτοῦ, τό τε σῶμα αὐτοῦ καὶ τὴν πρὸς τῆς κατασχέσεως αὐτῷ ἐκτεθεῖσαν διάταξιν λαβεῖν καὶ πρὸς τὸν τῆς παροικίας αὐτοῦ οἶκον τὸν κατὰ Παλαιστίνην ἀπαίρειν, καὶ πάντων τῶν ἐν αὐτῇ γεγραμμένων, τοῦ τε θείου φόβου, μηδαμῶς τοῦτον ἀπολιπέσθαι. Τοῦ δὲ συνθεμένου, ἀπελύθη παρὰ τοῦ Ἁγίου.
ltx/gr_gr_cog/sy.m11.d03:syMA.commemoration02.narration.p05	Τῇ οὖν ἐπαύριον, ἀχθεὶς αὖθις ὁ Μάρτυς εἰς ἐξέτασιν, καὶ μὴ πεισθεὶς θῦσαι τῷ Ἀπόλλωνι, ἀλλὰ μᾶλλον τὰ ἐν τῷ ναῷ ξόανα οἱονεὶ χοῦν ἐκλεπτύνας, ὡς εἰκὸς διʼ εὐχῆς, ξίφει τὴν κεφαλὴν ἀποτέμνεται. Ὁ μέν τοι θεράπων ἐκεῖνος, τὸ κομιδῆ τίμιον ἐκεῖνο σῶμα τοῦ Ἁγίου ἀναλαβόμενος σὺν τῇ αὐτοῦ διατάξει, εἰς Παλαιστίνην ἀπαίρει, ἔνθα τὸ μαρτυρικὸν ἐκεῖνο σκῆνος σὺν ἄλλοις χριστιανοῖς εὐλαβῶς πάνυ καὶ ἐντίμως κηδεύει, τά τε ἄλλα πάντα τὰ παρὰ τοῦ Ἁγίου διαταχθέντα αὐτῷ μετʼ εὐγνωμοσύνης πληροῖ.
ltx/gr_gr_cog/sy.m11.d03:syMA.commemoration02.narration.p06	Οὐ πολὺ τὸ ἐν μέσῳ, καὶ τῆς εὐσεβείας διαλαμψάσης καὶ Κωνσταντίνου τοῦ ἀοιδίμου μεγάλου βασιλέως καὶ ἰσαποστόλου τὴν βασιλείαν ὑποζωσαμένου, καιροῦ δραξάμενοι οἱ τῆς εὐσεβείας καὶ τοῦ Μάρτυρος ἐρασταί, ναὸν τῷ Ἁγίῳ χαριέστατον ἅμα καὶ κάλλιστον ἐν Λύδδῃ ἀνεγείρουσι· τό τε πολύαθλον καὶ ἅγιον ἐκεῖνο σῶμα τοῦ Μάρτυρος, ἐκ τοῦ ἀφανοῦς τόπου, οὗ ἔκειτο, ἀνελόμενοι, εἰς τοὐμφανὲς τὸ πολλοῦ πάνυ φωτός, καὶ πολλῷ πλέον ἐμφανείας ἐπάξιον, ἐν αὐτῷ φέροντες κατατιθέασι· καὶ διʼ αὐτοῦ τῷ τότε νεωστὶ παρʼ αὐτοῖς ἀνεγηγερμένῳ τῷδε ναῷ τὰ ἐγκαίνια ἄγουσι, τρίτην ἄγοντος τηνικάδε τοῦ Νεομβρίου μηνὸς ἡμέραν, ἀενάους κρουνοὺς θαυμάτων παρέχοντος τοῖς πιστῶς προσιοῦσιν αὐτῷ· δοξάζειν γὰρ οἶδε Θεὸς τοὺς αὐτὸν δοξάζοντας. Ἔκτοτε τοίνυν ἡ τοῦ Θεοῦ Ἐκκλησία, ἐτησίως κατὰ τὴν αὐτὴν ἡμέραν, τὴν ἀνακομιδὴν ἑορτάζει τῷ Μάρτυρι, εἰς δόξαν καὶ αἴνεσιν Χριστοῦ τοῦ ἀληθινοῦ Θεοῦ ἡμῶν καὶ τοῦ αὐτοῦ Μεγαλομάρτυρος Γεωργίου.
ltx/gr_gr_cog/sy.m11.d03:syMA.commemoration02.text	Τῇ αὐτῇ ἡμέρᾳ ἑορτάζομεν τὰ ἐγκαίνια τοῦ ναοῦ τοῦ ἁγίου Μεγαλομάρτυρος Γεωργίου ἐν Λύδδῃ, ἤτοι τὴν κατάθεσιν τοῦ ἁγίου σώματος αὐτοῦ.
ltx/gr_gr_cog/sy.m11.d03:syMA.commemoration03.couplet1.title	@ltx/gr_gr_cog/titles:ti.Verses
ltx/gr_gr_cog/sy.m11.d03:syMA.commemoration03.couplet1.verse1	Τήξας ἑαυτὸν ἐγκρατείᾳ καὶ πόνοις,
ltx/gr_gr_cog/sy.m11.d03:syMA.commemoration03.couplet1.verse2	Ἀκεψιμᾶς μετῆλθεν ἔνθα μὴ πόνοι.
ltx/gr_gr_cog/sy.m11.d03:syMA.commemoration03.narration.p01	Οὗτος ἦν ἐπὶ Θεοδοσίου τοῦ Μεγάλου· ὃς ἐν οἰκίσκῳ καθείρξας ἑαυτόν, ἑξήκοντα διετέλεσεν ἔτη, μήτε ὁρώμενος μήτε φθεγγόμενος· ἀλλʼ εἰς ἑαυτὸν νεύων καὶ τὸν Θεὸν φανταζόμενος, πᾶσαν ἐκεῖθεν ψυχαγωγίαν ἐδέχετο. Τὸ δὲ ὄρυγμα οὐ διʼ ὅλου ἦν κατʼ εὐθὺ κατωρυγμένον, ἀλλʼ ἐγκάρσιον ἑλικοειδῶς κατεσκευασμένον. Τροφὴ δὲ αὐτῷ ἐκομίζετο φακὸς διάβροχος ὕδατι. Ἅπαξ δὲ τῆς ἑβδομάδος, νύκτωρ ἐξιών, τὸ ἀρκοῦν ὕδωρ ἀπὸ τῆς πελαζούσης ἀνιμᾶτο πηγῆς, παρὰ μηδενὸς βλεπόμενος. Καὶ πολλῶν θαυμάτων γενόμενος αὐτουργὸς καὶ τὴν τοῦ πρεσβυτέρου ἀξίαν βίᾳ καταδεξάμενος, ἐν εἰρήνῃ τὸ πνεῦμα τῷ Θεῷ παρέθετο.
ltx/gr_gr_cog/sy.m11.d03:syMA.commemoration03.text	Τῇ αὐτῇ ἡμέρᾳ μνήμη τοῦ ὁσίου Πατρὸς ἡμῶν Ἀκεψιμᾶ.
ltx/gr_gr_cog/sy.m11.d03:syMA.commemoration04.couplet1.title	@ltx/gr_gr_cog/titles:ti.Verses
ltx/gr_gr_cog/sy.m11.d03:syMA.commemoration04.couplet1.verse1	Δῶρον σὺ δωρῇ τῇ πόλει τῆς Ἀγκύρας,
ltx/gr_gr_cog/sy.m11.d03:syMA.commemoration04.couplet1.verse2	Ὦ Θεόδωρε, ἐκ Θεοῦ τοῦ τῶν ὅλων.
ltx/gr_gr_cog/sy.m11.d03:syMA.commemoration04.couplet2.verse1	Σύμμαρτυς ἔστω καὶ γυνὴ τοῖς ἀνδράσι,
ltx/gr_gr_cog/sy.m11.d03:syMA.commemoration04.couplet2.verse2	Τετμημένοις τέσσαρσι συντετμημένη.
ltx/gr_gr_cog/sy.m11.d03:syMA.commemoration04.text	Τῇ αὐτῇ ἡμέρᾳ μνήμη τοῦ ὁσίου Πατρὸς ἡμῶν καὶ ὁμολογητοῦ Θεοδώρου, Ἐπισκόπου Ἀγκύρας· καὶ τῶν ἁγίων Μαρτύρων, Δασίου, Σεβήρου, Ἀνδρωνᾶ, Θεοδότου καὶ Θεοδότης, ξίφει τελειωθέντων.
ltx/gr_gr_cog/sy.m11.d03:syMA.commemoration05.couplet1.title	@ltx/gr_gr_cog/titles:ti.Verses
ltx/gr_gr_cog/sy.m11.d03:syMA.commemoration05.couplet1.verse1	Τῶν ἀρετῶν εἰς ἅρμα προβὰς Ἠλίας,
ltx/gr_gr_cog/sy.m11.d03:syMA.commemoration05.couplet1.verse2	Πόλῳ προσῆλθεν, ὥς περ ἄλλος Ἠλίας.
ltx/gr_gr_cog/sy.m11.d03:syMA.commemoration05.text	Τῇ αὐτῇ ἡμέρᾳ ὁ ὅσιος Πατὴρ ἡμῶν Ἠλίας ἐν εἰρήνῃ τελειοῦται.
ltx/gr_gr_cog/sy.m11.d03:syMA.commemoration06.couplet1.title	@ltx/gr_gr_cog/titles:ti.Verses
ltx/gr_gr_cog/sy.m11.d03:syMA.commemoration06.couplet1.verse1	Ψυχαῖς ἀτρέπτοις χερσὶ τμηθέντες πλάνων,
ltx/gr_gr_cog/sy.m11.d03:syMA.commemoration06.couplet1.verse2	Πλάνην περιτρέπουσιν ἄνδρες ἐννέα.
ltx/gr_gr_cog/sy.m11.d03:syMA.commemoration06.text	Τῇ αὐτῇ ἡμέρᾳ οἱ ἅγιοι ἐννέα Μάρτυρες ξίφει τελειοῦνται.
ltx/gr_gr_cog/sy.m11.d03:syMA.commemoration07.couplet1.title	@ltx/gr_gr_cog/titles:ti.Verses
ltx/gr_gr_cog/sy.m11.d03:syMA.commemoration07.couplet1.verse1	Φλέγουσιν ἄνδρας πέντες δὶς καὶ δὶς δύο,
ltx/gr_gr_cog/sy.m11.d03:syMA.commemoration07.couplet1.verse2	Οἷς συμφλέγουσι πέντε δὶς καὶ δὶς δύο.
ltx/gr_gr_cog/sy.m11.d03:syMA.commemoration07.text	Τῇ αὐτῇ ἡμέρᾳ οἱ ἅγιοι κηʹ Μάρτυρες πυρὶ τελειοῦνται.
ltx/gr_gr_cog/sy.m11.d03:syMA.commemoration08.couplet1.title	@ltx/gr_gr_cog/titles:ti.Verses
ltx/gr_gr_cog/sy.m11.d03:syMA.commemoration08.couplet1.verse1	Ἀχεμενίδης τὸν Θεὸν ποθῶν Λόγον
ltx/gr_gr_cog/sy.m11.d03:syMA.commemoration08.couplet1.verse2	Δόξης ἀφειδεῖ πατρικῆς καὶ βασάνων.
ltx/gr_gr_cog/sy.m11.d03:syMA.commemoration08.narration.p01	Ἐν ταῖς ἡμέραις Ἰσδιγέρδου, τοῦ υἱοῦ Γοροράνη βασιλέως Περσῶν, γέγονέ τις ἀνὴρ θαυμαστός, Ἀχεμενίδης καλούμενος, υἱὸς ἐπάρχου τῆς πόλεως γεγονώς. Οὗτος, καταλείψας τὴν πατρικὴν θρησκείαν, ἐπίστευσεν εἰς τὸν Χριστόν. Τοῦτο μαθὼν ὁ βασιλεὺς καὶ πολλὰ καμὼν τοῦ μεταβαλεῖν αὐτὸν εἰς τὴν προτέραν θρησκείαν, οὐκ ἠδυνήθη. Τότε γυμνώσας αὐτὸν τοῦ πλούτου καὶ τῶν ἀξιωμάτων, ἔτι δὲ καὶ τῆς ἐσθῆτος, προσέταξεν αὐτὸν γυμνὸν ἕλκειν τῆς στρατιᾶς τὰς καμήλους, διαζώματι χρώμενον μόνον. Πολλῶν δὲ διελθουσῶν ἡμερῶν, διακύψας ὁ βασιλεὺς τῆς στοᾶς, εἶδε τὸν ἄριστον ἄνδρα ἐκεῖνον ὑπὸ τῆς ἡλιακῆς καύσεως φλεγόμενον καὶ κόνεως οὐκ ὀλίγης ἔμπλεων· καὶ τῆς πατρῴας περιφανείας αὐτοῦ ἀναμνησθείς, ἀχθῆναι καὶ ἐνδύσασθαι χιτῶνα τοῦτον προσέταξεν. Εἶτα νομίσας ὑπὸ τοῦ προτέρου πόνου καὶ τῆς γενομένης αἰσχύνης αὐτὸν μαλακισθῆναι, φησὶ πρὸς αὐτόν· Νῦν γοῦν τῆς ἔριδος ἐκείνης ἀπαλλαγείς, ἀπόθου τοῦ τέκτονος τὸν Υἱόν. Ὁ δέ, ζήλου πλησθείς, διέῤῥηξέ τε τὸν χιτωνίσκον καὶ προσέῤῥιψεν ἐπειπών· Εἰ διὰ τοῦτόν με οἴει τῆς εὐσεβείας ἐκστῆναι, ἔχε τὸ δῶρον μετὰ τῆς ἀσεβείας. Ταύτην αὐτοῦ τὴν παῤῥησίαν ὁ βασιλεὺς θεασάμενος, γυμνὸν οὕτω τῶν βασιλείων ἐξήλασεν. Ὁ δέ, τὸν λοιπὸν τῆς ζωῆς αὐτοῦ χρόνον οὕτως εὐσεβῶς καὶ θεαρέστως διαβιώσας, ἐν εἰρήνῃ ἐκοιμήθη.
ltx/gr_gr_cog/sy.m11.d03:syMA.commemoration08.text	Τῇ αὐτῇ ἡμέρᾳ μνήμη τοῦ ἁγίου Ἀχεμενίδου τοῦ Ὁμολογητοῦ.
ltx/gr_gr_cog/sy.m11.d03:syMA.commemoration09.couplet1.title	@ltx/gr_gr_cog/titles:ti.Verses
ltx/gr_gr_cog/sy.m11.d03:syMA.commemoration09.couplet1.verse1	Γεώργιον ἔμψυχον Κυρίῳ ὤφθης,
ltx/gr_gr_cog/sy.m11.d03:syMA.commemoration09.couplet1.verse2	Γεώργιε ὅσιε, τμηθεὶς τὴν κάραν.
ltx/gr_gr_cog/sy.m11.d03:syMA.commemoration09.text	Τῇ αὐτῇ ἡμέρᾳ μνήμη τοῦ ὁσίου Πατρὸς ἡμῶν καὶ νέου Ἱερομάρτυρος Γεωργίου τοῦ Νεαπολίτου (1797).
ltx/gr_gr_cog/sy.m11.d03:syMA.lastline	Ταῖς αὐτῶν ἁγίαις πρεσβείαις, ὁ Θεός, ἐλέησον ἡμᾶς. Ἀμήν.
