ltx/gr_gr_cog/hi.hi01:hiVE.Key1000.title	ΜΕΓΑΣ ἢ ΑΣΜΑΤΙΚΟΣ ΕΣΠΕΡΙΝΟΣ
ltx/gr_gr_cog/hi.hi01:hiVE.Key1100.text	@ltx/gr_gr_cog/properties:media.key
ltx/gr_gr_cog/hi.hi01:hiVE.Key1100.title	Εὐχαὶ τοῦ Λυχνικοῦ
ltx/gr_gr_cog/hi.hi01:hiVE.Key1101.exclamation	@ltx/gr_gr_cog/prayers:pr.exc01.text
ltx/gr_gr_cog/hi.hi01:hiVE.Key1101.text	Κύριε, οἰκτίρμον καὶ ἐλεῆμον, μακρόθυμε καὶ πολυέλεε, ἐνώτισαι τὴν προσευχὴν ἡμῶν, καὶ πρόσχες τῇ φωνῇ τῆς δεήσεως ἡμῶν· ποίησον μεθʼ ἡμῶν σημεῖον εἰς ἀγαθόν· ὁδήγησον ἡμᾶς ἐν τῇ ὁδῷ σου τοῦ πορεύεσθαι ἐν τῇ ἀληθείᾳ σου· εὔφρανον τὰς καρδίας ἡμῶν, εἰς τὸ φοβεῖσθαι τὸ Ὄνομά σου τὸ ἅγιον· διότι μέγας εἶ σὺ, καὶ ποιῶν θαυμάσια· σὺ εἶ Θεὸς μόνος, καὶ οὐκ ἔστιν ὅμοιός σοι ἐν θεοῖς, Κύριε, δυνατὸς ἐν ἐλέει, καὶ ἀγαθὸς ἐν ἰσχύϊ, εἰς τὸ βοηθεῖν καὶ παρακαλεῖν, καὶ σῴζειν πάντας τοὺς ἐλπίζοντας εἰς τὸ Ὄνομά σου τὸ ἅγιον.
ltx/gr_gr_cog/hi.hi01:hiVE.Key1101.title	ΕΥΧΗ ΠΡΩΤΗ
ltx/gr_gr_cog/hi.hi01:hiVE.Key1102.exclamation	@ltx/gr_gr_cog/prayers:pr.exc02.text
ltx/gr_gr_cog/hi.hi01:hiVE.Key1102.text	Κύριε, μὴ τῷ θυμῷ σου ἐλέγξῃς ἡμᾶς, μηδὲ τῇ ὀργῇ σου παιδεύσῃς ἡμᾶς, ἀλλὰ ποίησον μεθʼ ἡμῶν κατὰ τὴν ἐπιείκειάν σου, ἰατρὲ καὶ θεραπευτὰ τῶν ψυχῶν ἡμῶν· ὁδήγησον ἡμᾶς ἐπὶ λιμένα θελήματός σου· φώτισον τοὺς ὀφθαλμοὺς τῶν καρδιῶν ἡμῶν, εἰς ἐπίγνωσιν τῆς σῆς ἀληθείας· καὶ δώρησαι ἡμῖν τὸ λοιπὸν τῆς παρούσης ἡμέρας εἰρηνικὸν καὶ ἀναμάρτητον, καὶ πάντα τὸν χρόνον τῆς ζωῆς ἡμῶν· πρεσβείαις τῆς ἁγίας Θεοτόκου, καὶ πάντων τῶν Ἁγίων.
ltx/gr_gr_cog/hi.hi01:hiVE.Key1102.title	ΕΥΧΗ ΔΕΥΤΕΡΑ
ltx/gr_gr_cog/hi.hi01:hiVE.Key1103.exclamation	@ltx/gr_gr_cog/prayers:pr.exc03.text
ltx/gr_gr_cog/hi.hi01:hiVE.Key1103.text	Κύριε, ὁ Θεὸς ἡμῶν, μνήσθητι ἡμῶν τῶν ἁμαρτωλῶν καὶ ἀχρείων δούλων σου, ἐν τῷ ἐπικαλεῖσθαι ἡμᾶς τὸ ἅγιον ὄνομά σου, καὶ μὴ καταισχύνῃς ἡμᾶς ἀπὸ τῆς προσδοκίας τοῦ ἐλέους σου, ἀλλὰ χάρισαι ἡμῖν, Κύριε, πάντα τὰ πρὸς σωτηρίαν αἰτήματα· καὶ ἀξίωσον ἡμᾶς ἀγαπᾶν, καὶ φοβεῖσθαί σε ἐξ ὅλης τῆς καρδίας ἡμῶν, καὶ ποιεῖν ἐν πᾶσι τὸ θέλημά σου.
ltx/gr_gr_cog/hi.hi01:hiVE.Key1103.title	ΕΥΧΗ ΤΡΙΤΗ
ltx/gr_gr_cog/hi.hi01:hiVE.Key1104.exclamation	@ltx/gr_gr_cog/prayers:pr.exc01.text
ltx/gr_gr_cog/hi.hi01:hiVE.Key1104.text	Ὁ τοῖς ἀσιγήτοις ὕμνοις καὶ ἀπαύστοις δοξολογίαις ὑπὸ τῶν ἁγίων δυνάμεων ἀνυμνούμενος, πλήρωσον τὸ στόμα ἡμῶν τῆς αἰνέσεώς σου, τοῦ δοῦναι μεγαλωσύνην τῷ ὀνόματί σου τῷ ἁγίῳ· καὶ δὸς ἡμῖν μερίδα καὶ κλῆρον μετὰ πάντων τῶν φοβουμένων σε ἐν ἀληθείᾳ καὶ φυλασσόντων τὰς ἐντολάς σου· πρεσβείαις τῆς ἁγίας Θεοτόκου καὶ πάντων τῶν ἁγίων σου.
ltx/gr_gr_cog/hi.hi01:hiVE.Key1104.title	ΕΥΧΗ ΤΕΤΑΡΤΗ
ltx/gr_gr_cog/hi.hi01:hiVE.Key1105.exclamation	@ltx/gr_gr_cog/prayers:pr.exc07b.text
ltx/gr_gr_cog/hi.hi01:hiVE.Key1105.text	Κύριε, Κύριε, ὁ τῇ ἀχράντῳ σου παλάμῃ συνέχων τὰ σύμπαντα, ὁ μακροθυμῶν ἐπὶ πάντας ἡμᾶς καὶ μετανοῶν ἐπὶ ταῖς κακίαις ἡμῶν, μνήσθητι τῶν οἰκτιρμῶν σου καὶ τοῦ ἐλέους σου· ἐπίσκεψαι ἡμᾶς ἐν τῇ σῇ ἀγαθότητι· καὶ δὸς ἡμῖν διαφυγεῖν καὶ τὸ λοιπὸν τῆς παρούσης ἡμέρας, ἐκ τῶν τοῦ πονηροῦ ποικίλων μηχανημάτων, καὶ ἀνεπιβούλευτον τὴν ζωὴν ἡμῶν διαφύλαξον, τῇ χάριτι τοῦ Παναγίου σου Πνεύματος.
ltx/gr_gr_cog/hi.hi01:hiVE.Key1105.title	ΕΥΧΗ ΠΕΜΠΤΗ
ltx/gr_gr_cog/hi.hi01:hiVE.Key1106.exclamation	@ltx/gr_gr_cog/prayers:pr.exc08.text
ltx/gr_gr_cog/hi.hi01:hiVE.Key1106.text	Ὁ Θεός, ὁ μέγας καὶ θαυμαστός, ὁ ἀνεκδιηγήτῳ ἀγαθωσύνῃ καὶ πλουσίᾳ προνοίᾳ διοικῶν τὰ σύμπαντα· ὁ καὶ τὰ ἐγκόσμια ἀγαθὰ ἡμῖν δωρησάμενος, καὶ κατεγγυήσας ἡμῖν τὴν ἐπηγγελμένην βασιλείαν, διὰ τῶν ἤδη κεχαρισμένων ἡμῖν ἀγαθῶν· ὁ ποιήσας ἡμᾶς καὶ τῆς νῦν ἡμέρας τὸ παρελθὸν μέρος ἀπὸ παντὸς ἐκκλῖναι κακοῦ, δώρησαι ἡμῖν καὶ τὸ ὑπόλοιπον ἀμέμπτως ἐκτελέσαι, ἐνώπιον τῆς ἁγίας δόξης σου, ὑμνοῦντάς σε τὸν μόνον ἀγαθόν, καὶ φιλάνθρωπον Θεὸν ἡμῶν.
ltx/gr_gr_cog/hi.hi01:hiVE.Key1106.title	ΕΥΧΗ ΕΚΤΗ
ltx/gr_gr_cog/hi.hi01:hiVE.Key1107.exclamation	@ltx/gr_gr_cog/prayers:pr.exc03.text
ltx/gr_gr_cog/hi.hi01:hiVE.Key1107.text	Ὁ Θεὸς ὁ μέγας καὶ ὕψιστος, ὁ μόνος ἔχων ἀθανασίαν, φῶς οἰκῶν ἀπρόσιτον, ὁ πᾶσαν τὴν κτίσιν ἐν σοφίᾳ δημιουργήσας. Ὁ διαχωρήσας ἀνὰ μέσον τοῦ φωτός, καὶ ἀνὰ μέσον τοῦ σκότους, καὶ τὸν μὲν ἥλιον θέμενος εἰς ἐξουσίαν τῆς ἡμέρας, σελήνην δὲ καὶ ἀστέρας εἰς ἐξουσίαν τῆς νυκτός· ὁ καταξιώσας ἡμᾶς τοὺς ἁμαρτωλοὺς καὶ ἐπὶ τῆς παρούσης ὥρας προφθάσαι τὸ πρόσωπόν σου ἐν ἐξομολογήσει, καὶ τὴν ἑσπερινήν σοι δοξολογίαν προσαγαγεῖν· αὐτός, φιλάνθρωπε Κύριε, κατεύθυνον τὴν προσευχὴν ἡμῶν ὡς θυμίαμα ἐνώπιόν σου καὶ πρόσδεξαι αὐτὴν εἰς ὀσμὴν εὐωδίας. Παράσχου δὲ ἡμῖν τὴν παροῦσαν ἑσπέραν καὶ τὴν ἐπιοῦσαν νύκτα εἰρηνικήν· ἔνδυσον ἡμᾶς ὅπλα φωτός· ῥῦσαι ἡμᾶς ἀπὸ φόβου νυκτερινοῦ καὶ ἀπὸ παντὸς πράγματος ἐν σκότει διαπορευομένου· καὶ δὸς ἡμῖν τὸν ὕπνον, ὃν εἰς ἀνάπαυσιν τῇ ἀσθενείᾳ ἡμῶν ἐδωρήσω, πάσης διαβολικῆς φαντασίας ἀπηλλαγμένον. Ναί, Δέσποτα τῶν ἁπάντων, τῶν ἀγαθῶν χορηγέ· ἵνα, καὶ ἐπὶ ταῖς κοίταις ἡμῶν κατανυγόμενοι, μνημονεύωμεν ἐν νυκτὶ τοῦ ὀνόματός σου, καὶ τῇ μελέτῃ τῶν σῶν ἐντολῶν καταυγαζόμενοι, ἐν ἀγαλλιάσει ψυχῆς διανιστῶμεν πρὸς δοξολογίαν τῆς σῆς ἀγαθότητος, δεήσεις καὶ ἱκεσίας τῇ σῇ εὐσπλαγχνίᾳ προσάγοντες ὑπὲρ τῶν ἰδίων ἁμαρτημάτων καὶ παντὸς τοῦ λαοῦ σου, ὃν ταῖς πρεσβείαις τῆς ἁγίας Θεοτόκου ἐν ἐλέει ἐπίσκεψαι.
ltx/gr_gr_cog/hi.hi01:hiVE.Key1107.title	ΕΥΧΗ ΕΒΔΟΜΗ
ltx/gr_gr_cog/hi.hi01:hiVE.Key1108.exclamation	@ltx/gr_gr_cog/prayers:pr.exc01.text
ltx/gr_gr_cog/hi.hi01:hiVE.Key1108.text	Ἑσπέρας καὶ πρωῒ καὶ μεσημβρίας αἰνοῦμεν, εὐλογοῦμεν, εὐχαριστοῦμεν καὶ δεόμεθά σου, Δέσποτα τῶν ἁπάντων, φιλάνθρωπε, Κύριε. Κατεύθυνον τὴν προσευχὴν ἡμῶν ὡς θυμίαμα ἐνώπιόν σου καὶ μὴ ἐκκλίνῃς τὰς καρδίας ἡμῶν εἰς λόγους ἢ εἰς λογισμοὺς πονηρίας, ἀλλὰ ῥῦσαι ἡμᾶς ἐκ πάντων τῶν θηρευόντων τὰς ψυχὰς ἡμῶν· ὅτι πρὸς σέ, Κύριε, Κύριε, οἱ ὀφθαλμοὶ ἡμῶν καὶ ἐπὶ σοὶ ἠλπίσαμεν· μὴ καταισχύνῃς ἡμᾶς, ὁ Θεὸς ἡμῶν.
ltx/gr_gr_cog/hi.hi01:hiVE.Key1108.title	ΕΥΧΗ ΤΗΣ ΕΙΣΟΔΟΥ
ltx/gr_gr_cog/hi.hi01:hiVE.Key1109.text	Ἑσπέρας Προκείμενον.
ltx/gr_gr_cog/hi.hi01:hiVE.Key1110.text	Ἑσπέρας…
ltx/gr_gr_cog/hi.hi01:hiVE.Key1111.exclamation	@ltx/gr_gr_cog/prayers:pr.exc14.text
ltx/gr_gr_cog/hi.hi01:hiVE.Key1111.text	Κύριε, ὁ Θεὸς ἡμῶν, ὁ κλίνας οὐρανοὺς καὶ καταβὰς ἐπὶ σωτηρίᾳ τοῦ γένους τῶν ἀνθρώπων, ἔπιδε ἐπί τοὺς δούλους σου καὶ ἐπὶ τὴν κληρονομίαν σου· σοὶ γὰρ τῷ φοβερῷ καὶ φιλανθρώπῳ κριτῇ οἱ σοὶ δοῦλοι ὑπέκλιναν τὰς κεφαλάς, τοὺς δὲ αὐτῶν ὑπέταξαν αὐχένας, οὐ τὴν ἐξ ἀνθρώπων ἀναμένοντες βοήθειαν, ἀλλὰ τὸ σὸν περιμένοντες ἔλεος καὶ τὴν σὴν ἀπεκδεχόμενοι σωτηρίαν· οὓς διαφύλαξον ἐν παντὶ καιρῷ καὶ κατὰ τὴν παροῦσαν ἑσπέραν καὶ τὴν προσιοῦσαν νύκτα, ἀπὸ παντὸς ἐχθροῦ, ἀπὸ πάσης ἀντικειμένης ἐνεργείας διαβολικῆς, καὶ διαλογισμῶν ματαίων καὶ ἐνθυμήσεων πονηρῶν.
ltx/gr_gr_cog/hi.hi01:hiVE.Key1111.title	ΕΥΧΗ ΤΗΣ ΚΕΦΑΛΟΚΛΙΣΙΑΣ
ltx/gr_gr_cog/hi.hi01:hiVE.Key1200.title	ΑΙ ΑΠΟΛΥΣΕΙΣ ΤΩΝ ΔΕΣΠΟΤΙΚΩΝ ΕΟΡΤΩΝ
ltx/gr_gr_cog/hi.hi01:hiVE.Key1300.title	ΜΕΤʼ «ΑΡΤΟΚΛΑΣΙΑΣ»
ltx/gr_gr_cog/hi.hi01:hiVE.Key1311.exclamation	@ltx/gr_gr_cog/prayers:pr.exc28a.text
ltx/gr_gr_cog/hi.hi01:hiVE.Key1311.text	Κύριε, Ἰησοῦ Χριστέ, ὁ Θεὸς ἡμῶν, ὁ εὐλογήσας τοὺς πέντε ἄρτους ἐν τῇ ἐρήμῳ, καὶ ἐξ αὐτῶν πεντακισχιλίους ἄνδρας χορτάσας, αὐτὸς εὐλόγησον καὶ τοὺς ἄρτους τούτους, τὸν σῖτον, τὸν οἶνον, καὶ τὸ ἔλαιον· καὶ πλήθυνον αὐτὰ ἐν τῇ ἁγίᾳ Ἐκκλησίᾳ, τῇ πόλει ταύτῃ, ἐν τοῖς οἴκοις τῶν ἑορταζόντων καὶ εἰς τὸν κόσμον σου ἅπαντα· καὶ τοὺς ἐξ αὐτῶν μεταλαμβάνοντας πιστοὺς δούλους σου ἁγίασον.
ltx/gr_gr_cog/hi.hi01:hiVE.Key1311.title	ΕΥΧΗ
ltx/gr_gr_cog/hi.hi01:hiVE.Key1320.title	ΕΝ ΑΓΡΥΠΝΙΑΙΣ
ltx/gr_gr_cog/hi.hi01:hiVE.Key1330.title	ΕΝ Τῼ ΟΡΘΡῼ
ltx/gr_gr_cog/hi.hi01:hiVE.Key2000.title	ΜΙΚΡΟΣ (ΚΑΘΗΜΕΡΙΝΟΣ) ΕΣΠΕΡΙΝΟΣ
ltx/gr_gr_cog/hi.hi01:hiVE.Key3000.title	Τῌ ΑΓΙᾼ ΚΑΙ ΜΕΓΑΛῌ ΤΕΣΣΑΡΑΚΟΣΤῌ
ltx/gr_gr_cog/hi.hi01:hiVE.Key4000.title	Τῌ ΑΓΙᾼ ΚΑΙ ΜΕΓΑΛῌ ΠΑΡΑΣΚΕΥῌ
ltx/gr_gr_cog/hi.hi01:hiVE.R1101	(ἄνευ χοροστασίας Ἀρχιερέως ἢ Ἀρτοκλασιας)
ltx/gr_gr_cog/hi.hi01:hiVE.R1102	Μετὰ τὴν Ἀπόλυσιν τῆς Ἐνάτης…
ltx/gr_gr_cog/hi.hi01:hiVE.R1103	Ἐλθόντες οὕτω προσκυνοῦσιν τρὶς…
ltx/gr_gr_cog/hi.hi01:hiVE.R1104	Εἶτα ὁ Ἱερεύς, λαβὼν τὸ Ἐπιτραχήλιον…
ltx/gr_gr_cog/hi.hi01:hiVE.R1105	Περιθεὶς δὲ τὸ Ἐπιτραχήλιον…
ltx/gr_gr_cog/hi.hi01:hiVE.R1106	Ὁ ἱερατικῶς Προϊστάμενος ἢ εἷ τῶν τεταγμένων Κληρικῶν…
ltx/gr_gr_cog/hi.hi01:hiVE.R1107	Τὸ «Δεῦτε προσκυνήσωμεν» καὶ ὁ ργʹ ψαλμός…
ltx/gr_gr_cog/hi.hi01:hiVE.R1108	Ὁ Προοιμιακὸς Ψαλμός, ἀναγινώσκεται…
ltx/gr_gr_cog/hi.hi01:hiVE.R1109	Ἀπὸ τοῦ Ἑσπερινοῦ τῆς Κυριακῆς τοῦ Θωμᾶ…
ltx/gr_gr_cog/hi.hi01:hiVE.R1110	Ἀπαγγελλομένου τοῦ Προοιμιακοῦ…
ltx/gr_gr_cog/hi.hi01:hiVE.R1111	Ὁ δὲ Ἱερεὺς εὐλογεῖ αὐτα τῇ δεξιᾷ, λέγων·
ltx/gr_gr_cog/hi.hi01:hiVE.R1112	Καὶ ὁ Διάκονος ἐνδύεται τὴν στολὴν αὐτοῦ, λέγων τὰ οἰκεῖα.
ltx/gr_gr_cog/hi.hi01:hiVE.R1113	Ἀπαγγελλομένου ἐπίσης τοῦ Προοιμιακοῦ, ὁ Ιερεὺς ἵσταται ἀσκεπὴς ἐνώπιον τῆς ἁγίας Τραπέζης ἢ καὶ ἐνώπιον τῆς εἰκόνος τοῦ Σωτῆρος Χριστοῦ, ἱστάμενος ἐπὶ τοῦ Σολέα (ὡς ἐν τῷ Ὄρθρῳ), καὶ ἀναγινώσκει μυστικῶς τὰς Εὐχὰς τοῦ Λυχνικοῦ·
ltx/gr_gr_cog/hi.hi01:hiVE.R1114	Πληρωθέντος τοῦ Προοιμιακοῦ Ψαλμοῦ, ὁ μὲν Ἱερεὺς παραμένει ἐν εὐλαβείᾳ ἐνώπιον τῆς ἁγίας Τραπέζης, ὁ δὲ Διάκονος ποιεῖ σχῆμα πρὸς τὸ Ἱερέα, καὶ ἐξελθὼν τοῦ ἱεροῦ Βήματος, διὰ τῆς βορείας πύλης, καὶ στὰς πρὸ τῆς Ὡραίας πύλης, καὶ βλέπων κατʼ ἐνώπιον τῆς εἰκόνος τοῦ Χριστοῦ, λέγει τὴν Μεγάλην Συναπτήν, ἤτοι τὰ «Εἰρηνικά».
ltx/gr_gr_cog/hi.hi01:hiVE.R1115	Ἐλλείψει Διακόνου, ἅπαντα τὰ τοῦ Διακόνου λέγει ὁ Ἱερεύς, ἱστάμενος ἀσκεπής. Μεθʼ ἑκάστην Δέησιν οἱ Χοροί, ἐναλλάξ, ψάλλουσιν ἅπαξ, τό· Κύριε, ἐλέησον.
ltx/gr_gr_cog/hi.hi01:hiVE.R1201	Ἑκάστη τῶν Δεσποτικῶν ἑορτῶν…
ltx/gr_gr_cog/hi.hi01:hiVE.R1301	Ἄνευ χοροστασίας Ἀρχιερέως
ltx/gr_gr_cog/hi.hi01:hiVE.R1302	Βλέπε· Προθεωρία τοῦ Τυπικοῦ § 11)
ltx/gr_gr_cog/hi.hi01:hiVE.R1303	Μετὰ τὴν ὑπὸ τοῦ Ἱερέως ἐκφώνησιν·…
ltx/gr_gr_cog/hi.hi01:hiVE.R1304	Οὕτω, μετὰ τὴν ἐκφώνησιν, «Εἴη τὸ κράτος…», ψάλλεται ὑπὸ τοῦ Χοροῦ ἢ ὑφʼ ἑνὸς τῶν Κληρικῶν, ἕν, κατʼ ἐκλογήν, Στιχηρὸν ἐκ τῆς Λιτῆς (ἐλλείψει δὲ τούτου τὸ Ἀπολυτίκιον). Ἐκ τῆς βορείας πύλης ἐξέρχονται οἵ τε Διάκονοι καὶ οἱ Ἱερεῖς κατὰ τὴν οἰκείαν τάξιν καὶ ἔρχονται φέροντες εἰς χεῖρας τὴν εἰκόνα τοῦ τῇ ἐπαύριον ἑορταζομένου Ἁγίου καὶ λαμπάδας, καὶ ἵστανται ἐν τῷ μέσῳ τοῦ Ναοῦ, ὅπου εἰσὶ προτεθειμένοι, ἐπὶ ηὐτρεπισμένου τετραποδίου, οἱ Ἄρτοι (ἄνωθι τῶν ὁποίων ἅπτουσι πέντε κηρία), ὁ σῖτος, ὁ οἶνος καὶ τὸ ἔλεον.
ltx/gr_gr_cog/hi.hi01:hiVE.R1305	Ὁ μὲν Διάκονος, ἢ ὁ νεώτερος τῶν Ἱερέων, ἐκφωνεῖ τὰς Δεήσεις, ὁ δὲ Χορός μεθʼ ἑκάστην Δέησιν, ψάλλει εὐλαβῶς καὶ πρᾳείᾳ τῇ φωνῇ τρίς, τό· Κύριε, ἐλέησον, ὡς ἡ τάξις.
ltx/gr_gr_cog/hi.hi01:hiVE.R1306	καὶ μνημονεύει τῶν ὀνομάτων τῶν προσκομισάντων τοὺς Ἄρτους).
ltx/gr_gr_cog/hi.hi01:hiVE.R1307	Ὁ πρῶτος τῇ τάξει τῶν Ἱερέων, κλινόμενος, λέγει ἐκφώνως·
ltx/gr_gr_cog/hi.hi01:hiVE.R1308	Ὁ Ἱερὲς εὐλογῶν τὸν Λαὸν διὰ τῆς χειρός, λέγει·
ltx/gr_gr_cog/hi.hi01:hiVE.R1309	Πάντων δὲ κλινόντων τὰς κεφαλάς, ὁ Ἱερεὺς μεγαλοφώνως ἐπεύχεται, λέγων·
ltx/gr_gr_cog/hi.hi01:hiVE.R1310	Εἶτα ὁ Ἱερεὺς λαμβάνει θυμιατήριον, καὶ θυμιᾷ σταυροειδῶς, στρεφόμενος περὶ τοὺς Ἄρτους, τοῦ Διακόνου κρατοῦντος λαμπάδα καὶ ὑποκλινομένου ἀπέναντι αὐτοῦ· θυμιῶν δὲ οὕτως ὁ Ἱερεύς, ψάλλει τό·
ltx/gr_gr_cog/hi.hi01:hiVE.R1311	Ὁ δὲ ἀριστερὸς Χορὸς συμπληροῖ, ψάλλων·
ltx/gr_gr_cog/hi.hi01:hiVE.R1312	Ἐν πάσαις ἀνεξαιρέτως ταῖς Δεσποτικαῖς καὶ Θεομητορικαῖς ἑορταῖς, ὡς καὶ ἐν ταῖς τῶν Ἁγίων μνήμαις, ἐὰν γίνηται Ἀρτοκλασία, ψάλλεται πάντοτε τό· «Θεοτόκε Παρθένε». Ἀλλʼ ἐν τῇ Διακαινησίμῳ ἑβδομάδι, ἀντὶ τοῦ «Θεοτόκε Παρθένε», ψάλλεται τό· «Χριστὸς ἀνέστη».
ltx/gr_gr_cog/hi.hi01:hiVE.R1313	Τοῦ Τροπαρίου πληρωθέντος, ὁ Διάκονος λέγει·
ltx/gr_gr_cog/hi.hi01:hiVE.R1314	Ὁ Ἱερεύς, θεὶς τὴν χεῖρα ἐπὶ τὸν ὑψωθέντα Ἄρτον, καὶ τυπώσας ἐν αὐτῷ Σταυρόν, ἐπεύχεται μεγαλοφώνως τὴν Εὐχὴν ταύτην, τῶν λοιπῶν Ἱερέων ὑποβασταζόντων τὸν Ἄρτον.
ltx/gr_gr_cog/hi.hi01:hiVE.R1315	Ὁ εὐλογήσας Ἱερεὺς καὶ οἱ λοιποὶ συμπρεσβύτεροι, ἀσπασάμενοι τὸν Ἄρτον, εἰσέρχονται, προπορευομένου τοῦ Διακόνου, εἰς τὸ ἅγιον Βῆμα, ψάλλοντες ἅπαξ, τό·
ltx/gr_gr_cog/hi.hi01:hiVE.R1316	Οἱ δὲ Χοροί ἐπαναλαμβάνουσι τὸ αὐτὸ δίς, καὶ μετὰ τοῦτο ἄρχονται ψάλλοντες τὰ Ἀπόστιχα, κατὰ τὸ Τυπικόν.
ltx/gr_gr_cog/hi.hi01:hiVE.R1317	Ὁ Ἱερεύς, ἱστάμενος πρὸ τῆς Ὡραίας Πύλης καὶ βλέπων πρὸς δυσμάς, εὐλογεῖ τὸν Λαόν, ἐκφωνῶν·
ltx/gr_gr_cog/hi.hi01:hiVE.R1318	Ὁ Ἱερεὺς ποιεῖ τὴν ἐν τῷ Μεγάλῳ Ἑσπερινῷ προδιαγραφεῖσαν Ἀπολυσιν.
ltx/gr_gr_cog/hi.hi01:hiVE.R1320	Τελουμένης ὁλονυκτίου Ἀκολουθίας…
ltx/gr_gr_cog/hi.hi01:hiVE.R1330	Τελεσθησομένης Ἀρτοκλασίας ἐν Ὄρθρῳ…
ltx/gr_gr_cog/hi.hi01:hiVE.hR1101	Ὁ Ἱερεύς, ἱστάμενος πρὸ τῆς ἁγίας τραπέζης, λέγει τὴν ἑπομένην εὐχήν.
ltx/gr_gr_cog/hi.hi01:hiVE.hR1102	Καὶ γίνεται ἡ Εἴσοδος.
ltx/gr_gr_cog/hi.hi01:hiVE.title	ΑΚΟΛΟΥΘΙΑ ΤΟΥ ΕΣΠΕΡΙΝΟΥ
