ltx/gr_gr_cog/sy.m05.d18:cl.syMA.commemoration01.text	[saint/com 1]
ltx/gr_gr_cog/sy.m05.d18:cl.syMA.commemoration02.text	[saint/com 2]
ltx/gr_gr_cog/sy.m05.d18:cl.syMA.commemoration03.text	[saint/com 3]
ltx/gr_gr_cog/sy.m05.d18:cl.syMA.commemoration04.text	[saint/com 4]
ltx/gr_gr_cog/sy.m05.d18:cl.syMA.commemoration05.text	[saint/com 5]
ltx/gr_gr_cog/sy.m05.d18:cl.syMA.commemoration06.text	[saint/com list]
ltx/gr_gr_cog/sy.m05.d18:syMA.commemoration01.couplet1.title	@ltx/gr_gr_cog/titles:ti.Verses
ltx/gr_gr_cog/sy.m05.d18:syMA.commemoration01.couplet1.verse1	Σεπτοὶ Ἀθληταί, ὑπὲρ σεπτῆς Τριάδος,
ltx/gr_gr_cog/sy.m05.d18:syMA.commemoration01.couplet1.verse2	Ὑπὲρ τὸ ζῆν εἵλοντο θανεῖν ἐμφρόνως.
ltx/gr_gr_cog/sy.m05.d18:syMA.commemoration01.narration.p01	Ὧν ὁ μὲν Ἅγιος Πέτρος ἦν ἐκ Λαμψάκου τῆς πόλεως. Ἀχθεὶς δὲ Δάκνῳ ἄρχοντι τῆς Εὐριδινῶν πόλεως (ἢ Δεκίῳ τῆς Ἀβυδηνῶν) καὶ θῦσαι προσταχθεὶς τῇ Ἀφροδίτῃ καὶ μὴ πεισθείς, ἀλλὰ τὸν Χριστὸν Θεὸν ὁμολογήσας, δεσμοῖς καὶ ξύλοις καὶ τροχαντῆρσιν ὅλον τὸ σῶμα συντρίβεται, καὶ τὸ πνεῦμα παραδίδωσι. Παῦλος δὲ καὶ Ἀνδρέας ἐκ Μεσοποταμίας ὄντες, ἅμα τῷ ἄρχοντι Δάκνῳ, ὑφʼ ὃν ἐστρατεύοντο, τὰς Ἀθήνας καταλαμβάνουσι. Συλληφθέντων δὲ ἐν αὐταῖς Διονυσίου καὶ Χριστίνης, τὴν αὐτῶν πιστεύονται φυλακήν. Τὴν δὲ ἁγίαν Χριστίναν, παρθένον οὖσαν καὶ εὐπρεπῆ καὶ γάμου ἔχουσαν ὥραν, ἐκκαλοῦνται πρὸς μῖξιν. Τῆς δὲ μὴ πεισθείσης, ἀντὶ τοῦ ταύτην βιάσασθαι, μεταβληθέντες ταῖς παραινέσεσιν αὐτῆς, ἐπίστευσαν τῷ Χριστῷ. Ὅθεν αὐτοὶ μὲν καὶ ὁ Διονύσιος νιφάσι τῶν λίθων κατεχώσθησαν· ἡ δὲ ἁγία Χριστίνα, ἐπιπεσοῦσα αὐτοῖς, τὴν κεφαλὴν ἀπετμήθη.
ltx/gr_gr_cog/sy.m05.d18:syMA.commemoration01.single1	Ὀγδοὰς Ἀθλοφόρων ἐκ γαίης εἰς πόλον ἤρθη.
ltx/gr_gr_cog/sy.m05.d18:syMA.commemoration01.text	Τῇ ΙΗʹ τοῦ αὐτοῦ μηνὸς μνήμη τῶν Ἁγίων Μαρτύρων Πέτρου, Διονυσίου, Χριστίνης παρθένου, Ἀνδρέου, Παύλου, Βενεδίμου, Παυλίνου καὶ Ἡρακλείου.
ltx/gr_gr_cog/sy.m05.d18:syMA.commemoration02.couplet1.title	Στίχοι εἰς τὸν Θεόδοτον
ltx/gr_gr_cog/sy.m05.d18:syMA.commemoration02.couplet1.verse1	Χεὶρ Θεόδοτον, ἣν Θεοῦ χεὶρ ξηράνοι,
ltx/gr_gr_cog/sy.m05.d18:syMA.commemoration02.couplet1.verse2	Θεῷ δοτὸν τίθησι πλήξασα ξίφει.
ltx/gr_gr_cog/sy.m05.d18:syMA.commemoration02.couplet2.title	Εἰς τὰς ἑπτὰ παρθένους
ltx/gr_gr_cog/sy.m05.d18:syMA.commemoration02.couplet2.verse1	Λίμνῃ γυναικῶν ἑπτὰς ἐμβεβλημένη,
ltx/gr_gr_cog/sy.m05.d18:syMA.commemoration02.couplet2.verse2	Χαίρει βίου ῥέοντος ἐκβεβλημένη.
ltx/gr_gr_cog/sy.m05.d18:syMA.commemoration02.text	Τῇ αὐτῇ ἡμέρᾳ μνήμη τῶν Ἁγίων Μαρτύρων Θεοδότου καὶ Τεκούσης καὶ τῶν ἁγίων ἑπτὰ παρθένων γυναικῶν, τῶν ἐν Ἀγκύρᾳ, Ἀλεξανδρείας, Κλαυδίας, Φαεινῆς, Εὐφρασίας, Ματρώνης, Ἰουλίας καὶ Θεοδότης.
ltx/gr_gr_cog/sy.m05.d18:syMA.lastline	Ταῖς αὐτῶν ἁγίαις πρεσβείαις, Χριστὲ ὁ Θεός, ἐλέησον ἡμᾶς. Ἀμήν.
