ltx/gr_gr_cog/ho.ho15.m10:ho.Days	ἔχων ἡμέρας 31.
ltx/gr_gr_cog/ho.ho15.m10:ho.Hours	Ἡ ἡμέρα ἔχει ὥρας 11, καὶ ἡ νὺξ ὥρας 13.
ltx/gr_gr_cog/ho.ho15.m10:ho.Month	ΜΗΝ ΟΚΤΩΒΡΙΟΣ
ltx/gr_gr_cog/ho.ho15.m10:hoD04.GeneralApolytikion1.name	Ἱερόθεε·
ltx/gr_gr_cog/ho.ho15.m10:hoD09.GeneralApolytikion3.name	Ἀνδρόνικε·
ltx/gr_gr_cog/ho.ho15.m10:hoD11.GeneralApolytikion1.name	Φίλλιπε,·
ltx/gr_gr_cog/ho.ho15.m10:hoD11.GeneralApolytikion2.name	Θεόφανες σοφέ,
ltx/gr_gr_cog/ho.ho15.m10:hoD12.Apolytikion1.greekmelody	@ltx/gr_gr_cog/he.a.m5:heAU.TonSynanarchonLogon.greekname
ltx/gr_gr_cog/ho.ho15.m10:hoD12.Apolytikion1.incipit	@ltx/gr_gr_cog/oc.m5.d3:ocMA.Kathisma32.incipit
ltx/gr_gr_cog/ho.ho15.m10:hoD12.Apolytikion1.melody	@ltx/gr_gr_cog/he.a.m5:heAU.TonSynanarchonLogon.name
ltx/gr_gr_cog/ho.ho15.m10:hoD12.Apolytikion1.mode	@ltx/gr_gr_cog/miscellanea:misc.Mode5
ltx/gr_gr_cog/ho.ho15.m10:hoD12.Apolytikion1.text	@ltx/gr_gr_cog/oc.m5.d3:ocMA.Kathisma32.text
ltx/gr_gr_cog/ho.ho15.m10:hoD12.Apolytikion1.title	Τῶν Μαρτύρων.
ltx/gr_gr_cog/ho.ho15.m10:hoD14.GeneralApolytikion3.name	σοφὲ πατὴρ Κοσμᾶ,
ltx/gr_gr_cog/ho.ho15.m10:hoD19.GeneralApolytikion1.name	Ἰωὴλ
ltx/gr_gr_cog/ho.ho15.m10:hoD22.GeneralApolytikion1.name	πάτερ ἱεράρχα Αβέρκιε·
ltx/gr_gr_cog/ho.ho15.m10:hoD28.GeneralApolytikion4.name	Στέφανε σοφέ,
ltx/gr_gr_cog/ho.ho15.m10:hoD29.GeneralApolytikion3.name	Ἀβράμιε,
