ltx/gr_gr_cog/le.ep.mc.d143:lemcLI.Epistle.book_abbr	@ltx/gr_gr_cog/bible:Romans.abbr
ltx/gr_gr_cog/le.ep.mc.d143:lemcLI.Epistle.book_string	@ltx/gr_gr_cog/bible:Romans.text
ltx/gr_gr_cog/le.ep.mc.d143:lemcLI.Epistle.chapverse	10:11 – 21; 11:1 – 2
ltx/gr_gr_cog/le.ep.mc.d143:lemcLI.Epistle.incipit	Λέγει ἡ γραφή· πᾶς ὁ πιστεύων ἐπὶ τῷ Θεῷ…
ltx/gr_gr_cog/le.ep.mc.d143:lemcLI.Epistle.text	Ἀδελφοί, λέγει ἡ γραφή· πᾶς ὁ πιστεύων ἐπὶ τῷ Θεῷ οὐ καταισχυνθήσεται. οὐ γὰρ ἔστι διαστολὴ Ἰουδαίου τε καὶ Ἕλληνος· ὁ γὰρ αὐτὸς Κύριος πάντων, πλουτῶν εἰς πάντας τοὺς ἐπικαλουμένους αὐτόν· πᾶς γὰρ ὃς ἂν ἐπικαλέσηται τὸ ὄνομα Κυρίου σωθήσεται. πῶς οὖν ἐπικαλέσονται εἰς ὃν οὐκ ἐπίστευσαν; πῶς δὲ πιστεύσουσιν οὗ οὐκ ἤκουσαν; πῶς δὲ ἀκούσουσι χωρὶς κηρύσσοντος; πῶς δὲ κηρύξουσιν ἐὰν μὴ ἀποσταλῶσι; καθὼς γέγραπται· ὡς ὡραῖοι οἱ πόδες τῶν εὐαγγελιζομένων εἰρήνην, τῶν εὐαγγελιζομένων τὰ ἀγαθά! Ἀλλ᾿ οὐ πάντες ὑπήκουσαν τῷ εὐαγγελίῳ· Ἡσαΐας γὰρ λέγει· Κύριε, τίς ἐπίστευσε τῇ ἀκοῇ ἡμῶν; ἄρα ἡ πίστις ἐξ ἀκοῆς, ἡ δὲ ἀκοὴ διὰ ῥήματος Θεοῦ. ἀλλὰ λέγω, μὴ οὐκ ἤκουσαν; μενοῦνγε εἰς πᾶσαν τὴν γῆν ἐξῆλθεν ὁ φθόγγος αὐτῶν, καὶ εἰς τὰ πέρατα τῆς οἰκουμένης τὰ ῥήματα αὐτῶν. ἀλλὰ λέγω, μὴ οὐκ ἔγνω Ἰσραήλ; πρῶτος Μωϋσῆς λέγει· ἐγὼ παραζηλώσω ὑμᾶς ἐπ᾿ οὐκ ἔθνει, ἐπὶ ἔθνει ἀσυνέτῳ παροργιῶ ὑμᾶς. Ἡσαΐας δὲ ἀποτολμᾷ καὶ λέγει· εὑρέθην τοῖς ἐμὲ μὴ ζητοῦσιν, ἐμφανὴς ἐγενόμην τοῖς ἐμὲ μὴ ἐπερωτῶσι. πρὸς δὲ τὸν Ἰσραὴλ λέγει· ὅλην τὴν ἡμέραν ἐξεπέτασα τὰς χεῖράς μου πρὸς λαὸν ἀπειθοῦντα καὶ ἀντιλέγοντα. Λέγω οὖν, μὴ ἀπώσατο ὁ Θεὸς τὸν λαὸν αὐτοῦ; μὴ γένοιτο· καὶ γὰρ ἐγὼ Ἰσραηλίτης εἰμί, ἐκ σπέρματος Ἀβραάμ, φυλῆς Βενιαμίν. οὐκ ἀπώσατο ὁ Θεὸς τὸν λαὸν αὐτοῦ ὃν προέγνω.
ltx/gr_gr_cog/le.ep.mc.d143:lemcLI.Epistle.title	Τῇ Τρίτῃ τῆς Δʹ Ἑβδομάδος
ltx/gr_gr_cog/le.ep.mc.d143:lemcLI.Epistle.title_abbr	Τρίτῃ τῆς Δʹ Ἑβδομάδος
ltx/gr_gr_cog/le.ep.mc.d143:lemcLI.Epistle.version	@ltx/gr_gr_cog/properties:version.designation
