ltx/gr_gr_cog/ty.m01:ty.days.text	Ἔχων ἡμέρας τριάκοντα καί μίαν.
ltx/gr_gr_cog/ty.m01:ty.hours.text	Ἡ ἡμέρα ἔχει ὥρας 10 καί ἡ νύξ ὥρας 14.
ltx/gr_gr_cog/ty.m01:ty.title	ΙΑΝΟΥΑΡΙΟΣ 2019
ltx/gr_gr_cog/ty.m01:tyD01.Commemoration.text	1. ΤΡΙΤΗ: Η ΚΑΤΑ ΣΑΡΚΑ ΠΕΡΙΤΟΜΗ ΤΟΥ ΚΥΡΙΟΥ ΗΜΩΝ ΙΗΣΟΥ ΧΡΙΣΤΟΥ. Τοῦ ἐν Ἁγίοις Πατρός ἡμῶν Βασιλείου τοῦ Μεγάλου, Ἀρχιεπισκόπου Καισαρείας τῆς Καππαδοκίας καί τῆς μητρός αὐτοῦ, Ἁγίας Ἐμμελείας.
ltx/gr_gr_cog/ty.m01:tyD01.LI.AfterCommunion.text	τό· «Μορφήν ἀναλλοιώτως…».
ltx/gr_gr_cog/ty.m01:tyD01.LI.AmboPrayer.text	«Ὁ θυσίαν αἰνέσεως…».
ltx/gr_gr_cog/ty.m01:tyD01.LI.Antiphons.text	Τῆς Ἑορτῆς.
ltx/gr_gr_cog/ty.m01:tyD01.LI.Apolytikia.text	1.– Τῆς Ἑορτῆς· «Μορφήν ἀναλλοιώτως…». 2.– Τοῦ Ἁγίου· «Εἰς πᾶσαν τήν γῆν…» καί 3.– Τοῦ Ναοῦ.
ltx/gr_gr_cog/ty.m01:tyD01.LI.CommunionHymn.text	«Αἰνεῖτε τόν Κύριον ἐκ τῶν οὐρανῶν. Ἀλληλούια».
ltx/gr_gr_cog/ty.m01:tyD01.LI.Dismissal.text	Ἡ τοῦ Ἑσπερινοῦ.
ltx/gr_gr_cog/ty.m01:tyD01.LI.EntranceHymn.text	«Δεῦτε προσκυνήσωμεν… ὁ σαρκί περιτμηθείς…».
ltx/gr_gr_cog/ty.m01:tyD01.LI.Epistle.text	Τοῦ Ἁγίου· «Βλέπετε μή τις ὑμᾶς ἔσται ὁ συλαγωγῶν…» (Κολ. β΄ 8-12).
ltx/gr_gr_cog/ty.m01:tyD01.LI.Gospel.text	Τῆς Ἑορτῆς· «Ὑπέστρεψαν οἱ Ποιμένες…» (Λουκ. β΄ 20-21. 40-52).
ltx/gr_gr_cog/ty.m01:tyD01.LI.Kontakion.text	Τῆς Ἑορτῆς· «Ὁ τῶν ὅλων Κύριος…» (τό ἐπισφραγιστικόν τῶν Μεσῳδίων Καθισμάτων).
ltx/gr_gr_cog/ty.m01:tyD01.LI.Megalynarion.text	Τό Μεγαλυνάριον· Ἦχος β΄. «Τόν οὐρανοφάντορα τοῦ Χριστοῦ, μύστην τοῦ Δεσπότου, τόν φωστῆρα τόν φαεινόν, τόν ἐκ Καισαρείας καί Καππαδόκων χώρας, Βασίλειον τόν μέγαν, πάντες τιμήσωμεν».
ltx/gr_gr_cog/ty.m01:tyD01.LI.TheotokosHymn.text	«Ἐπί σοί χαίρει…».
ltx/gr_gr_cog/ty.m01:tyD01.MA.Anavathmoi.text	Τό α΄ Ἀντίφωνον τοῦ δ΄ ἤχου· «Ἐκ νεότητός μου…».
ltx/gr_gr_cog/ty.m01:tyD01.MA.Apolytikia.text	1.– Τοῦ Ἁγίου· «Εἰς πᾶσαν τήν γῆν…». 2.– Δόξα, τό αὐτό καί 3.– Καί νῦν, τῆς Ἑορτῆς· «Μορφήν ἀναλλοιώτως…».
ltx/gr_gr_cog/ty.m01:tyD01.MA.Canons.text	Τῆς Ἑορτῆς· «Δεῦτε, λαοί…», μετά τῶν Εἱρμῶν αὐτοῦ μετά στίχου· «Δόξα σοι, ὁ Θεός ἡμῶν, δόξα σοι» καί 2.– Τοῦ Ἁγίου· «Σοῦ τήν φωνήν…» μετά στίχου· «Ἅγιε τοῦ Θεοῦ, πρέσβευε ὑπέρ ἡμῶν» καί εἰς τά δύο τελευταῖα Δόξα, Καί νῦν, ἀμφότεροι εἰς 4.
ltx/gr_gr_cog/ty.m01:tyD01.MA.Doxology.text	Μεγάλη.
ltx/gr_gr_cog/ty.m01:tyD01.MA.EndApolytikion.text	«Μορφήν ἀναλλοιώτως…».
ltx/gr_gr_cog/ty.m01:tyD01.MA.Exaposteilaria.text	Τοῦ Ἁγίου· «Φιλοσοφίας ἔρωτι…» καί 2.– Τῆς Ἑορτῆς· «Τήν σάρκα περιτέμνεται…».
ltx/gr_gr_cog/ty.m01:tyD01.MA.Katavasias.text	Διπλαῖ· «Βυθοῦ ἀνεκάλυψε…» καί· «Στείβει θαλάσσης…».
ltx/gr_gr_cog/ty.m01:tyD01.MA.Kathismata.text	Τοῦ Ἁγίου τῆς α΄ καί β΄ Στιχολογίας καί εἰς τό Καί νῦν, ἀντί Θεοτοκίων, ἀνά ἕν τῆς Ἑορτῆς καί τά μετά τόν Πολυέλεον Καθίσματα τοῦ Ἁγίου μετά τοῦ Θεοτοκίου αὐτῶν.
ltx/gr_gr_cog/ty.m01:tyD01.MA.KontakionOikos.text	Τοῦ Ἁγίου.
ltx/gr_gr_cog/ty.m01:tyD01.MA.Lauds.text	1.– Τό 1 Στιχηρόν Προσόμοιον τῆς Ἑορτῆς· «Φέρει περιτομήν ἐν σαρκί…» καί 2.– Τά 3 Στιχηρά Προσόμοια τοῦ Ἁγίου· «Θέσει υἱός Θεοῦ γεγονώς… – Ἔνδον ἐπουρανίου Ναοῦ… – Ὅλως ἱερωμένος Θεῷ…».
ltx/gr_gr_cog/ty.m01:tyD01.MA.LaudsBoth.text	Τό Ἰδιόμελον τῆς Ἑορτῆς· «Συγκαταβαίνων ὁ Σωτήρ…».
ltx/gr_gr_cog/ty.m01:tyD01.MA.LaudsGlory.text	Τό Ἰδιόμελον αὐτῶν· «Ἐξεχύθη ἡ χάρις…».
ltx/gr_gr_cog/ty.m01:tyD01.MA.LaudsVerses.text	δ΄.
ltx/gr_gr_cog/ty.m01:tyD01.MA.Magnificat.text	Οὐ στιχολογεῖται, ἀντ’ αὐτῆς ἡ θ΄ ᾨδή ἀμφοτέρων τῶν Κανόνων τῆς Ἑορτῆς καί τοῦ Ἁγίου, ὡς ἑξῆς:
ltx/gr_gr_cog/ty.m01:tyD01.MA.MatinsGospel.text	Τοῦ Ἱεράρχου· «Ἀμήν, ἀμήν λέγω ὑμῖν, ὅτι ὁ μή εἰσερχόμενος…» (Ἰω. ι΄ 1-9), ζήτει τοῦτο τῇ 13ῃ Νοεμβρίου.
ltx/gr_gr_cog/ty.m01:tyD01.MA.Midode.text	1.– Τοῦ Ἁγίου· «Ἐξανοίξας τό στόμα…». 2.– Δόξα· «Πᾶσαν ἤρδευσας…» καί 3.– Καί νῦν, τῆς Ἑορτῆς· «Ὁ τῶν ὅλων Κύριος…».
ltx/gr_gr_cog/ty.m01:tyD01.MA.Ode9_1.text	1. Μεγάλυνον, ψυχή μου, τήν τιμιωτέραν τῶν ἄνω στρατευμάτων. «Ἡ τόν πρό ἡλίου φωστῆρα…».
ltx/gr_gr_cog/ty.m01:tyD01.MA.Ode9_2.text	2. Μεγάλυνον, ψυχή μου, τόν κατά τόν Νόμον σαρκί περιτμηθέντα. «Ἡ τόν πρό ἡλίου φωστῆρα…».
ltx/gr_gr_cog/ty.m01:tyD01.MA.Ode9_3.text	3. Μεγάλυνον, ψυχή μου, τόν ἐν τῇ ὀγδόῃ περιτομήν λαβόντα. «Ὑπερβάς τούς ὅρους Χριστός…».
ltx/gr_gr_cog/ty.m01:tyD01.MA.Ode9_4.text	4. Σήμερον ὁ Δεσπότης σαρκί περιετμήθη καί Ἰησοῦς ἐκλήθη. «Δεῦτε τοῦ Δεσπότου τά ἔνδοξα…».
ltx/gr_gr_cog/ty.m01:tyD01.MA.Ode9_5.text	5. Μεγάλυνον, ψυχή μου, τόν ἐν Ἱεράρχαις Βασίλειον τόν Μέγαν. «Τοῦ Ἀρχιποίμενος ὡς πρόβατον…».
ltx/gr_gr_cog/ty.m01:tyD01.MA.Ode9_6.text	6. Μεγάλυνον, ψυχή μου, τόν ἐκ Καισαρείας Βασίλειον τόν Μέγαν. «Τό τῆς Ἐκκλησίας πανίερον…».
ltx/gr_gr_cog/ty.m01:tyD01.MA.Ode9_7.text	7. Δόξα· Μεγάλυνον, ψυχή μου, τῆς τρισυποστάτου καί ἀδιαιρέτου Θεότητος τό κράτος. «Τῆς τῶν Ἀποστόλων…».
ltx/gr_gr_cog/ty.m01:tyD01.MA.Ode9_8.text	8. Καί νῦν· Μεγάλυνον, ψυχή μου, τήν λυτρωσαμένην ἡμᾶς ἐκ τῆς κατάρας. «Ὁ τά ὑπερῷα ἐν ὕδασι…».
ltx/gr_gr_cog/ty.m01:tyD01.MA.Ode9_Katavasia1.text	Μεγάλυνον, ψυχή μου, τήν τιμιωτέραν τῶν ἄνω στρατευμάτων. «Ἀπορεῖ πᾶσα γλῶσσα…».
ltx/gr_gr_cog/ty.m01:tyD01.MA.Ode9_Katavasia2.text	Μεγάλυνον, ψυχή μου, τήν λυτρωσαμένην ἡμᾶς ἐκ τῆς κατάρας. «Ὤ τῶν ὑπέρ νοῦν…».
ltx/gr_gr_cog/ty.m01:tyD01.MA.ProkVerse.text	«Ἀκούσατε ταῦτα πάντα τά ἔθνη, ἐνωτίσασθε πάντες οἱ κατοικοῦντες τήν οἰκουμένην».
ltx/gr_gr_cog/ty.m01:tyD01.MA.Prokeimenon.text	«Τό στόμα μου λαλήσει σοφίαν, καί ἡ μελέτη τῆς καρδίας μου σύνεσιν».
ltx/gr_gr_cog/ty.m01:tyD01.MA.Psalm50.text	(Χῦμα). Δόξα· «Ταῖς τοῦ Ἱεράρχου…». Καί νῦν· «Ταῖς τῆς Θεοτόκου…» καί τό Ἰδιόμελον· «Ἐξεχύθη ἡ χάρις…».
ltx/gr_gr_cog/ty.m01:tyD01.MA.Synaxarion.text	Τῆς ἡμέρας.
ltx/gr_gr_cog/ty.m01:tyD01.MO.Rubric1.text	Μετά τόν Ν΄ Ψαλμόν, τά διά τήν Λιτήν Στιχηρά Ἰδιόμελα τοῦ Ἁγίου· «Χριστόν εἰσοικισάμενος…» κτλ. μετά τοῦ Δόξα αὐτῶν, Καί νῦν, τῆς Ἑορτῆς. Τρισάγιον καί τό Ἀπολυτίκιον τῆς Ἑορτῆς· «Μορφήν ἀναλλοιώτως…».
ltx/gr_gr_cog/ty.m01:tyD01.VE.Apolytikia.text	Τοῦ Ἁγίου· «Εἰς πᾶσαν τήν γῆν…» καί 2.– Δόξα, Καί νῦν, τῆς Ἑορτῆς· «Μορφήν ἀναλλοιώτως…».
ltx/gr_gr_cog/ty.m01:tyD01.VE.AposBoth.text	Τό ἕτερον Ἰδιόμελον τῆς Ἑορτῆς· «Οὐκ ἐπῃσχύνθη ὁ πανάγαθος…».
ltx/gr_gr_cog/ty.m01:tyD01.VE.AposGlory.text	Τό Ἰδιόμελον αὐτῶν· «Ὁ τήν χάριν τῶν θαυμάτων…».
ltx/gr_gr_cog/ty.m01:tyD01.VE.Aposticha.text	Τά 3 Στιχηρά Ἰδιόμελα τοῦ Ἁγίου· «Ὤ θεία καί ἱερά… – Πάντων τῶν Ἁγίων… – Τῶν ὄντων ἐκμελετήσας…», μετά τῶν πρό αὐτῶν στίχων εἰς τά δύο τελευταῖα: α΄.– «Τό στόμα μου λαλήσει σοφίαν, καί ἡ μελέτη τῆς καρδίας μου σύνεσιν». β΄.– «Στόμα δικαίου μελετήσει σοφίαν, καί ἡ γλῶσσα αὐτοῦ λαλήσει κρίσιν».
ltx/gr_gr_cog/ty.m01:tyD01.VE.Dismissal.text	«Ὁ ἐν τῇ ὀγδόῃ ἡμέρᾳ σαρκί περιτμηθῆναι καταδεξάμενος διά τήν ἡμῶν σωτηρίαν, Χριστός ὁ ἀληθινός Θεός ἡμῶν…».
ltx/gr_gr_cog/ty.m01:tyD01.VE.Entrance.text	«Φῶς ἱλαρόν…». Τό Προκείμενον τῆς ἡμέρας καί τά Ἀναγνώσματα.
ltx/gr_gr_cog/ty.m01:tyD01.VE.Intro.text	Προοιμιακός – Ψαλτήριον.
ltx/gr_gr_cog/ty.m01:tyD01.VE.LIHC.text	ς΄.
ltx/gr_gr_cog/ty.m01:tyD01.VE.SticBoth.text	Τό Ἰδιόμελον τῆς Ἑορτῆς· «Συγκαταβαίνων ὁ Σωτήρ…».
ltx/gr_gr_cog/ty.m01:tyD01.VE.SticGlory.text	Τό Ἰδιόμελον τοῦ Ἁγίου· «Σοφίας ἐραστής…».
ltx/gr_gr_cog/ty.m01:tyD01.VE.Stichera.text	1.– Τά 2 Στιχηρά Ἰδιόμελα τῆς Ἑορτῆς· «Συγκαταβαίνων ὁ Σωτήρ… – Οὐκ ἐπῃσχύνθη…» εἰς 3, τό πρῶτον δίς καί 2.– Τά 3 Στιχηρά Προσόμοια τοῦ Ἁγίου· «Ὁ ἐπωνύμως κληθείς τῆς βασιλείας… – Ἱεραρχίας στολαῖς ἠγλαϊσμένος… – Ὁ οὐρανίαις συνών χοροστασίαις…».
ltx/gr_gr_cog/ty.m01:tyD01.VE.note1.text	Ὁ Πατριάρχης κατέρχεται μετά τῶν Κληρικῶν τῆς Πατριαρχικῆς Αὐλῆς εἰς τόν Πάνσεπτον Πατριαρχικόν Ναόν. Εἰς τόν Νάρθηκα περιβάλλεται μανδύαν καί λαμβάνει τήν ποιμαντορικήν ράβδον παρά τοῦ Μ. Ἐκκλησιάρχου. Προχωρεῖ πρός τόν Σολέα, εὐλογεῖ τόν λαόν, τῶν Χορῶν ψαλλόντων τό· «Εἰς πολλά ἔτη, Δέσποτα» καί ἀνέρχεται εἰς τόν Θρόνον. Λαμβάνουσι καιρόν ὁ Μ. Πρωτοσύγκελλος μετά τοῦ Δευτερεύοντος καί τοῦ Τριτεύοντος καί εἶτα οἱ λοιποί Ἱερεῖς τῆς Πατριαρχικῆς Αὐλῆς. Εἰς τό· «Κύριε, ἐκέκραξα…», προπορευομένου τοῦ Μ. Ἐκκλησιάρχου ἐξέρχονται τῆς Νοτίου Πύλης τοῦ Ἱεροῦ Βήματος οἱ Ἅγιοι Ἀρχιερεῖς καί ποιοῦντες σχῆμα τῷ Πατριάρχῃ λαμβάνουσι τάς ἐν τῷ Ναῷ θέσεις αὐτῶν.
ltx/gr_gr_cog/ty.m01:tyD01.VE.note2.text	Κατά τήν ἀπόλυσιν ὁ Μ. Ἐκκλησιάρχης ποιεῖ σχῆμα εἰς τόν Πατριάρχην καί τούς Ἀρχιερεῖς, οἵτινες καί ἐξέρχονται κατά σειράν, ποιοῦντες σχῆμα τῷ Πατριάρχῃ, ἐκ τῆς Νοτίου Πύλης τοῦ Ἱεροῦ Ναοῦ καί ἀνέρχονται εἰς τόν Πατριαρχικόν Οἶκον.
ltx/gr_gr_cog/ty.m01:tyD01.note1.text	Πατριαρχική καί Συνοδική Χοροστασία.
ltx/gr_gr_cog/ty.m01:tyD06.VE.Apolytikia.text	
ltx/gr_gr_cog/ty.m01:tyD06.VE.AposGlory.text	
ltx/gr_gr_cog/ty.m01:tyD06.VE.Aposticha.text	
ltx/gr_gr_cog/ty.m01:tyD06.VE.Dismissal.text	
ltx/gr_gr_cog/ty.m01:tyD06.VE.Entrance.text	
ltx/gr_gr_cog/ty.m01:tyD06.VE.Epistle.text	
ltx/gr_gr_cog/ty.m01:tyD06.VE.Gospel.text	
ltx/gr_gr_cog/ty.m01:tyD06.VE.Intro.text	
ltx/gr_gr_cog/ty.m01:tyD06.VE.LIHC.text	
ltx/gr_gr_cog/ty.m01:tyD06.VE.R01	
ltx/gr_gr_cog/ty.m01:tyD06.VE.R02	
ltx/gr_gr_cog/ty.m01:tyD06.VE.R03	
ltx/gr_gr_cog/ty.m01:tyD06.VE.R04	
ltx/gr_gr_cog/ty.m01:tyD06.VE.R05	
ltx/gr_gr_cog/ty.m01:tyD06.VE.R06	
ltx/gr_gr_cog/ty.m01:tyD06.VE.R07	
ltx/gr_gr_cog/ty.m01:tyD06.VE.R08	
ltx/gr_gr_cog/ty.m01:tyD06.VE.R09	
ltx/gr_gr_cog/ty.m01:tyD06.VE.R10	
ltx/gr_gr_cog/ty.m01:tyD06.VE.R11	
ltx/gr_gr_cog/ty.m01:tyD06.VE.R12	
ltx/gr_gr_cog/ty.m01:tyD06.VE.R13	
ltx/gr_gr_cog/ty.m01:tyD06.VE.R14	
ltx/gr_gr_cog/ty.m01:tyD06.VE.R15	
ltx/gr_gr_cog/ty.m01:tyD06.VE.R16	
ltx/gr_gr_cog/ty.m01:tyD06.VE.R17	
ltx/gr_gr_cog/ty.m01:tyD06.VE.R18	
ltx/gr_gr_cog/ty.m01:tyD06.VE.R19	
ltx/gr_gr_cog/ty.m01:tyD06.VE.R20	
ltx/gr_gr_cog/ty.m01:tyD06.VE.SticGlory.text	
ltx/gr_gr_cog/ty.m01:tyD06.VE.Stichera.text	
ltx/gr_gr_cog/ty.m01:tyD06.VE.Trisagion.text	
ltx/gr_gr_cog/ty.m01:tyD07.VE.Apolytikia.text	
ltx/gr_gr_cog/ty.m01:tyD07.VE.AposBoth.text	
ltx/gr_gr_cog/ty.m01:tyD07.VE.AposGlory.text	
ltx/gr_gr_cog/ty.m01:tyD07.VE.Aposticha.text	
ltx/gr_gr_cog/ty.m01:tyD07.VE.Dismissal.text	
ltx/gr_gr_cog/ty.m01:tyD07.VE.Entrance.text	
ltx/gr_gr_cog/ty.m01:tyD07.VE.Intro.text	
ltx/gr_gr_cog/ty.m01:tyD07.VE.LIHC.text	
ltx/gr_gr_cog/ty.m01:tyD07.VE.SticBoth. text	
ltx/gr_gr_cog/ty.m01:tyD07.VE.SticGlory.text	
ltx/gr_gr_cog/ty.m01:tyD07.VE.Stichera.text	
ltx/gr_gr_cog/ty.m01:tyD07.VE.Trisagion.text	
