ltx/gr_gr_cog/le.ep.mc.d083:lemcLI.Epistle.book_abbr	@ltx/gr_gr_cog/bible:Acts.abbr
ltx/gr_gr_cog/le.ep.mc.d083:lemcLI.Epistle.book_string	@ltx/gr_gr_cog/bible:Acts.text
ltx/gr_gr_cog/le.ep.mc.d083:lemcLI.Epistle.chapverse	5:1 – 11
ltx/gr_gr_cog/le.ep.mc.d083:lemcLI.Epistle.incipit	Ἀνήρ τις Ἀνανίας ὀνόματι…
ltx/gr_gr_cog/le.ep.mc.d083:lemcLI.Epistle.text	Ἐν ταῖς ἡμέραις ἐκείναις, ἀνήρ τις ᾿Ανανίας ὀνόματι σὺν Σαπφείρῃ τῇ γυναικὶ αὐτοῦ ἐπώλησε κτῆμα καὶ ἐνοσφίσατο ἀπὸ τῆς τιμῆς, συνειδυίας καὶ τῆς γυναικὸς αὐτοῦ, καὶ ἐνέγκας μέρος τι παρὰ τοὺς πόδας τῶν ἀποστόλων ἔθηκεν. εἶπε δὲ Πέτρος· Ἀνανία, διατί ἐπλήρωσεν ὁ σατανᾶς τὴν καρδίαν σου, ψεύσασθαί σε τὸ Πνεῦμα τὸ Ἅγιον καὶ νοσφίσασθαι ἀπὸ τῆς τιμῆς τοῦ χωρίου; οὐχὶ μένον σοι ἔμενε καὶ πραθὲν ἐν τῇ σῇ ἐξουσίᾳ ὑπῆρχε; τί ὅτι ἔθου ἐν τῇ καρδίᾳ σου τὸ πρᾶγμα τοῦτο; οὐκ ἐψεύσω ἀνθρώποις, ἀλλὰ τῷ Θεῷ. ἀκούων δὲ ὁ Ἀνανίας τοὺς λόγους τούτους πεσὼν ἐξέψυξε, καὶ ἐγένετο φόβος μέγας ἐπὶ πάντας τοὺς ἀκούοντας ταῦτα. ἀναστάντες δὲ οἱ νεώτεροι συνέστειλαν αὐτὸν καὶ ἐξενέγκαντες ἔθαψαν. Ἐγένετο δὲ ὡς ὡρῶν τριῶν διάστημα καὶ ἡ γυνὴ αὐτοῦ, μὴ εἰδυῖα τὸ γεγονός, εἰσῆλθεν. ἀπεκρίθη δὲ αὐτῇ ὁ Πέτρος· εἰπέ μοι, εἰ τοσούτου τὸ χωρίον ἀπέδοσθε; ἡ δὲ εἶπε· ναί, τοσούτου. ὁ δὲ Πέτρος εἶπε πρὸς αὐτήν· τί ὅτι συνεφωνήθη ὑμῖν πειράσαι τὸ Πνεῦμα Κυρίου; ἰδοὺ οἱ πόδες τῶν θαψάντων τὸν ἄνδρα σου ἐπὶ τῇ θύρᾳ καὶ ἐξοίσουσί σε. ἔπεσε δὲ παραχρῆμα παρὰ τοὺς πόδας αὐτοῦ καὶ ἐξέψυξεν· εἰσελθόντες δὲ οἱ νεανίσκοι εὗρον αὐτὴν νεκράν, καὶ ἐξενέγκαντες ἔθαψαν πρὸς τὸν ἄνδρα αὐτῆς. καὶ ἐγένετο φόβος μέγας ἐφ᾿ ὅλην τὴν ἐκκλησίαν καὶ ἐπὶ πάντας τοὺς ἀκούοντας ταῦτα.
ltx/gr_gr_cog/le.ep.mc.d083:lemcLI.Epistle.title	Τῇ Παρασκευῇ τῆς Βʹ Ἑβδομάδος
ltx/gr_gr_cog/le.ep.mc.d083:lemcLI.Epistle.title_abbr	Παρασκευῇ τῆς Βʹ Ἑβδομάδος
ltx/gr_gr_cog/le.ep.mc.d083:lemcLI.Epistle.version	@ltx/gr_gr_cog/properties:version.designation
