ltx/gr_gr_cog/le.ep.me.m01.d22:lemeLI.Epistle.book_abbr	@ltx/gr_gr_cog/bible:Timothy2.abbr
ltx/gr_gr_cog/le.ep.me.m01.d22:lemeLI.Epistle.book_string	@ltx/gr_gr_cog/bible:Timothy2.text
ltx/gr_gr_cog/le.ep.me.m01.d22:lemeLI.Epistle.chapverse	1:3 – 9
ltx/gr_gr_cog/le.ep.me.m01.d22:lemeLI.Epistle.incipit	Χάριν ἔχω τῷ Θεῷ, ᾧ λατρεύω ἀπὸ προγόνων…
ltx/gr_gr_cog/le.ep.me.m01.d22:lemeLI.Epistle.text	Τέκνον Τιμόθεε, χάριν ἔχω τῷ Θεῷ, ᾧ λατρεύω ἀπὸ προγόνων ἐν καθαρᾷ συνειδήσει, ὡς ἀδιάλειπτον ἔχω τὴν περὶ σοῦ μνείαν ἐν ταῖς δεήσεσί μου νυκτὸς καὶ ἡμέρας, ἐπιποθῶν σε ἰδεῖν, μεμνημένος σου τῶν δακρύων, ἵνα χαρᾶς πληρωθῶ, ὑπόμνησιν λαμβάνων τῆς ἐν σοὶ ἀνυποκρίτου πίστεως, ἥτις ἐνῴκησε πρῶτον ἐν τῇ μάμμῃ σου Λωΐδι καὶ τῇ μητρί σου Εὐνίκῃ, πέπεισμαι δὲ ὅτι καὶ ἐν σοί. δι᾽ ἣν αἰτίαν ἀναμιμνήσκω σε ἀναζωπυρεῖν τὸ χάρισμα τοῦ Θεοῦ, ὅ ἐστιν ἐν σοὶ διὰ τῆς ἐπιθέσεως τῶν χειρῶν μου· οὐ γὰρ ἔδωκεν ἡμῖν ὁ Θεὸς Πνεῦμα δειλίας, ἀλλὰ δυνάμεως καὶ ἀγάπης καὶ σωφρονισμοῦ. μὴ οὖν ἐπαισχυνθῇς τὸ μαρτύριον τοῦ Κυρίου ἡμῶν μηδὲ ἐμὲ τὸν δέσμιον αὐτοῦ, ἀλλὰ συγκακοπάθησον τῷ εὐαγγελίῳ κατὰ δύναμιν Θεοῦ, τοῦ σώσαντος ἡμᾶς.
ltx/gr_gr_cog/le.ep.me.m01.d22:lemeLI.Epistle.title	Τοῦ Ἀποστόλου
ltx/gr_gr_cog/le.ep.me.m01.d22:lemeLI.Epistle.title_abbr	Τοῦ Ἀποστόλου
ltx/gr_gr_cog/le.ep.me.m01.d22:lemeLI.Epistle.version	@ltx/gr_gr_cog/properties:version.designation
