ltx/gr_gr_cog/le.go.mc.d167:lemcLI.Gospel.book_abbr	@ltx/gr_gr_cog/bible:Matthew.abbr
ltx/gr_gr_cog/le.go.mc.d167:lemcLI.Gospel.book_string	@ltx/gr_gr_cog/bible:Matthew.text
ltx/gr_gr_cog/le.go.mc.d167:lemcLI.Gospel.chapverse	15:29 – 31
ltx/gr_gr_cog/le.go.mc.d167:lemcLI.Gospel.incipit	Ἦλθεν ὁ Ἰησοῦς παρὰ τὴν θάλασσαν…
ltx/gr_gr_cog/le.go.mc.d167:lemcLI.Gospel.text	Τῷ καιρῷ ἐκείνῳ ἦλθεν ὁ Ἰησοῦς παρὰ τὴν θάλασσαν τῆς Γαλιλαίας, καὶ ἀναβὰς εἰς τὸ ὄρος ἐκάθητο ἐκεῖ. καὶ προσῆλθον αὐτῷ ὄχλοι πολλοὶ ἔχοντες μεθ᾿ ἑαυτῶν χωλούς, τυφλούς, κωφούς, κυλλοὺς καὶ ἑτέρους πολλούς, καὶ ἔρριψαν αὐτοὺς παρὰ τοὺς πόδας τοῦ Ἰησοῦ, καὶ ἐθεράπευσεν αὐτούς, ὥστε τοὺς ὄχλους θαυμάσαι βλέποντας κωφοὺς ἀκούοντας, ἀλάλους λαλοῦντας, κυλλοὺς ὑγιεῖς, χωλοὺς περιπατοῦντας καὶ τυφλοὺς βλέποντας· καὶ ἐδόξασαν τὸν Θεὸν Ἰσραήλ.
ltx/gr_gr_cog/le.go.mc.d167:lemcLI.Gospel.title	Τῇ Παρασκευῇ τῆς Ζʹ Ἑβδομάδος τοῦ Ματθαίου
ltx/gr_gr_cog/le.go.mc.d167:lemcLI.Gospel.title_abbr	Παρασκευῇ τῆς Ζʹ Ἑβδομάδος
ltx/gr_gr_cog/le.go.mc.d167:lemcLI.Gospel.version	@ltx/gr_gr_cog/properties:version.designation
