ltx/gr_gr_cog/le.go.eo.w02:leeoMA.Gospel.book_abbr	@ltx/gr_gr_cog/bible:Mark.abbr
ltx/gr_gr_cog/le.go.eo.w02:leeoMA.Gospel.book_string	@ltx/gr_gr_cog/bible:Mark.text
ltx/gr_gr_cog/le.go.eo.w02:leeoMA.Gospel.chapverse	16:1 – 8
ltx/gr_gr_cog/le.go.eo.w02:leeoMA.Gospel.incipit	Διαγενομένου τοῦ σαββάτου…
ltx/gr_gr_cog/le.go.eo.w02:leeoMA.Gospel.text	Διαγενομένου τοῦ σαββάτου Μαρία ἡ Μαγδαληνὴ καὶ Μαρία ἡ τοῦ Ἰακώβου καὶ Σαλώμη ἠγόρασαν ἀρώματα ἵνα ἐλθοῦσαι ἀλείψωσιν αὐτόν. καὶ λίαν πρωῒ τῆς μιᾶς σαββάτων ἔρχονται ἐπὶ τὸ μνημεῖον, ἀνατείλαντος τοῦ ἡλίου. καὶ ἔλεγον πρὸς ἑαυτάς· τίς ἀποκυλίσει ἡμῖν τὸν λίθον ἐκ τῆς θύρας τοῦ μνημείου; καὶ ἀναβλέψασαι θεωροῦσιν ὅτι ἀποκεκύλισται ὁ λίθος· ἦν γὰρ μέγας σφόδρα. καὶ εἰσελθοῦσαι εἰς τὸ μνημεῖον εἶδον νεανίσκον καθήμενον ἐν τοῖς δεξιοῖς, περιβεβλημένον στολὴν λευκήν, καὶ ἐξεθαμβήθησαν. ὁ δὲ λέγει αὐταῖς· μὴ ἐκθαμβεῖσθε· Ἰησοῦν ζητεῖτε τὸν Ναζαρηνὸν τὸν ἐσταυρωμένον· ἠγέρθη, οὐκ ἔστιν ὧδε· ἴδε ὁ τόπος ὅπου ἔθηκαν αὐτόν. ἀλλ᾿ ὑπάγετε εἴπατε τοῖς μαθηταῖς αὐτοῦ καὶ τῷ Πέτρῳ ὅτι προάγει ὑμᾶς εἰς τὴν Γαλιλαίαν· ἐκεῖ αὐτὸν ὄψεσθε, καθὼς εἶπεν ὑμῖν. καὶ ἐξελθοῦσαι ἔφυγον ἀπὸ τοῦ μνημείου· εἶχε δὲ αὐτὰς τρόμος καὶ ἔκστασις, καὶ οὐδενὶ οὐδὲν εἶπον· ἐφοβοῦντο γάρ.
ltx/gr_gr_cog/le.go.eo.w02:leeoMA.Gospel.title	Ἑωθινὸν Βʹ
ltx/gr_gr_cog/le.go.eo.w02:leeoMA.Gospel.title_abbr	Ἑωθινὸν Βʹ
ltx/gr_gr_cog/le.go.eo.w02:leeoMA.Gospel.version	@ltx/gr_gr_cog/properties:version.designation
