ltx/gr_gr_cog/me.m02.d15:meDA.commemoration.first	Μνήμη τοῦ Ἁγίου Ἀποστόλου Ὀνησίμου
ltx/gr_gr_cog/me.m02.d15:meDA.commemoration.first_name	
ltx/gr_gr_cog/me.m02.d15:meDA.commemoration.first_short	Μνήμη τοῦ Ἁγίου Ἀποστόλου Ὀνησίμου
ltx/gr_gr_cog/me.m02.d15:meDA.commemoration.first_title	@ltx/gr_gr_cog/titles:ti.Apostle
ltx/gr_gr_cog/me.m02.d15:meDA.commemoration.full	Μνήμη τοῦ Ἁγίου Ἀποστόλου Ὀνησίμου
ltx/gr_gr_cog/me.m02.d15:meDA.commemoration.second_name	
ltx/gr_gr_cog/me.m02.d15:meDA.commemoration.second_title	
ltx/gr_gr_cog/me.m02.d15:meDA.date	Τῌ ΙΕʹ ΦΕΒΡΟΥΑΡΙΟΥ
ltx/gr_gr_cog/me.m02.d15:meDA.fordate	διὰ τὴν 15ην Φεβρουαρίου
ltx/gr_gr_cog/me.m02.d15:meDA.insert1	καὶ τοῦ Ἁγίου Ἀποστόλου Ὀνησίμου,
ltx/gr_gr_cog/me.m02.d15:meDA.insert2	οὗ καὶ τὴν μνήμην ἐπιτελοῦμεν·
ltx/gr_gr_cog/me.m02.d15:meDA.note	
ltx/gr_gr_cog/me.m02.d15:meDA.pdfcoverdate	τῆς 15ης Φεβρουαρίου,
ltx/gr_gr_cog/me.m02.d15:meDA.pdfheaderdate	τῆς 15ης Φεβρουαρίου
ltx/gr_gr_cog/me.m02.d15:meHO.commemorations	
ltx/gr_gr_cog/me.m02.d15:meHO.note1	
ltx/gr_gr_cog/me.m02.d15:meHO.note2	
ltx/gr_gr_cog/me.m02.d15:meHO.number	
ltx/gr_gr_cog/me.m02.d15:meHO.rank	
ltx/gr_gr_cog/me.m02.d15:meLE.commemoration1	Τοῦ Ἁγίου Ἀποστόλου Ὀνησίμου.
ltx/gr_gr_cog/me.m02.d15:meLE.commemoration2	
ltx/gr_gr_cog/me.m02.d15:meLI.Kontakion1.greekmelody	@ltx/gr_gr_cog/me.m02.d15:meMA.Kontakion1.greekmelody
ltx/gr_gr_cog/me.m02.d15:meLI.Kontakion1.incipit	@ltx/gr_gr_cog/me.m02.d15:meMA.Kontakion1.incipit
ltx/gr_gr_cog/me.m02.d15:meLI.Kontakion1.melody	@ltx/gr_gr_cog/me.m02.d15:meMA.Kontakion1.melody
ltx/gr_gr_cog/me.m02.d15:meLI.Kontakion1.mode	@ltx/gr_gr_cog/me.m02.d15:meMA.Kontakion1.mode
ltx/gr_gr_cog/me.m02.d15:meLI.Kontakion1.text	@ltx/gr_gr_cog/me.m02.d15:meMA.Kontakion1.text
ltx/gr_gr_cog/me.m02.d15:meLI.Megalynarion.text	
ltx/gr_gr_cog/me.m02.d15:meMA.C1.acrostic.notice1	οὗ ἡ Ἀκροστιχίς·
ltx/gr_gr_cog/me.m02.d15:meMA.C1.acrostic.text	Παθῶν με δοῦλον ὄντα λύτρωσαι Μάκαρ.
ltx/gr_gr_cog/me.m02.d15:meMA.C1.acrostic.title	Κανὼν τοῦ Ἀποστόλου,
ltx/gr_gr_cog/me.m02.d15:meMA.C1.poet	@ltx/gr_gr_cog/poets:po.Theofanous
ltx/gr_gr_cog/me.m02.d15:meMA.C1.title	@ltx/gr_gr_cog/titles:ti.CanonApostle
ltx/gr_gr_cog/me.m02.d15:meMA.C1.verse	@ltx/gr_gr_cog/prayers:pr.verse_Apostle.text
ltx/gr_gr_cog/me.m02.d15:meMA.ExapTheotokion.incipit	Τῆς ὑπὲρ νοῦν λοχείας σου…
ltx/gr_gr_cog/me.m02.d15:meMA.ExapTheotokion.melody	@ltx/gr_gr_cog/he.a.m2:heAU.ToisMathitaisSynelthomen.name
ltx/gr_gr_cog/me.m02.d15:meMA.ExapTheotokion.mode	@ltx/gr_gr_cog/miscellanea:misc.Mode2
ltx/gr_gr_cog/me.m02.d15:meMA.ExapTheotokion.text	Τῆς ὑπὲρ νοῦν λοχείας σου, τὸ παράδοξον θαῦμα, νοῦς οὐκ Ἀγγέλων δύναται, οὐ βροτῶν ἑρμηνεῦσαι, ἢ ἐννοῆσαι Παρθένε· τίκτεις γὰρ ἀποῤῥήτως, Θεὸν τὸν ὑπερούσιον, ὃν ὑμνεῖ πᾶσα κτίσις, ὡς Ποιητήν, σὺν Πατρὶ καὶ Πνεύματι τῷ Ἁγίῳ, οὗ τῆς χαρᾶς ἀξίωσον, καὶ ἡμᾶς Θεοτόκε.
ltx/gr_gr_cog/me.m02.d15:meMA.Exaposteilarion1.greekmelody	@ltx/gr_gr_cog/he.a.m2:heAU.ToisMathitaisSynelthomen.greekname
ltx/gr_gr_cog/me.m02.d15:meMA.Exaposteilarion1.incipit	Μαθητευθεὶς πανόλβιε, Παύλῳ τῷ Κορυφαίῳ…
ltx/gr_gr_cog/me.m02.d15:meMA.Exaposteilarion1.melody	@ltx/gr_gr_cog/he.a.m2:heAU.ToisMathitaisSynelthomen.name
ltx/gr_gr_cog/me.m02.d15:meMA.Exaposteilarion1.mode	@ltx/gr_gr_cog/miscellanea:misc.Mode2
ltx/gr_gr_cog/me.m02.d15:meMA.Exaposteilarion1.text	Μαθητευθεὶς πανόλβιε, Παύλῳ τῷ Κορυφαίῳ, τῶν Ἀποστόλων πάνσοφε, σὺν αὐτῷ περιῆλθες, τὴν γῆν στηρίζων τῷ λόγῳ, παρειμένας καρδίας, τῇ πλάνῃ τοῦ ἀλάστορος, καὶ τελέσας τὸν δρόμον, ἐν οὐρανοῖς, τῷ Χριστῷ παρίστασαι σὺν Ἀγγέλοις, Ἀπόστολε Ὀνήσιμε, ὑπὲρ κόσμου πρεσβεύων.
ltx/gr_gr_cog/me.m02.d15:meMA.Kontakion1.greekmelody	@ltx/gr_gr_cog/he.a.m4:heAU.EpefanisSimeron.greekname
ltx/gr_gr_cog/me.m02.d15:meMA.Kontakion1.incipit	Ὡς ἀκτίς ἐξέλαμψας, τῇ οἰκουμένῃ…
ltx/gr_gr_cog/me.m02.d15:meMA.Kontakion1.melody	@ltx/gr_gr_cog/he.a.m4:heAU.EpefanisSimeron.name
ltx/gr_gr_cog/me.m02.d15:meMA.Kontakion1.mode	@ltx/gr_gr_cog/miscellanea:misc.Mode4
ltx/gr_gr_cog/me.m02.d15:meMA.Kontakion1.text	Ὡς ἀκτίς ἐξέλαμψας, τῇ οἰκουμένῃ, ταῖς βολαῖς λαμπόμενος, ἡλίου μάκαρ παμφαοῦς, Παύλου τοῦ κόσμον φωτίσαντος· διό σε πάντες, τιμῶμεν Ὀνήσιμε.
ltx/gr_gr_cog/me.m02.d15:meMA.Ode1C11.greekmelody	@ltx/gr_gr_cog/he.h.m6:heHE.OsEnIpeiroPezefsas.greekname
ltx/gr_gr_cog/me.m02.d15:meMA.Ode1C11.incipit	Πεφωτισμένος τῇ θείᾳ καὶ φωταυγεῖ…
ltx/gr_gr_cog/me.m02.d15:meMA.Ode1C11.melody	@ltx/gr_gr_cog/he.h.m6:heHE.OsEnIpeiroPezefsas.name
ltx/gr_gr_cog/me.m02.d15:meMA.Ode1C11.mode	@ltx/gr_gr_cog/miscellanea:misc.Mode6
ltx/gr_gr_cog/me.m02.d15:meMA.Ode1C11.ode	@ltx/gr_gr_cog/miscellanea:misc.Ode1
ltx/gr_gr_cog/me.m02.d15:meMA.Ode1C11.text	Πεφωτισμένος τῇ θείᾳ καὶ φωταυγεῖ, τοῦ Σωτῆρος χάριτι, τὴν ζοφώδη μου ψυχήν, δυσωπῶν, Ὀνήσιμε Χριστόν, τὸν φιλάνθρωπον Θεόν, Μάκαρ διάσωσον.
ltx/gr_gr_cog/me.m02.d15:meMA.Ode1C12.incipit	Ἀκτινοβόλοις τοῦ Παύλου καταυγασθείς, λαμπηδόσιν…
ltx/gr_gr_cog/me.m02.d15:meMA.Ode1C12.melody	@ltx/gr_gr_cog/he.h.m6:heHE.OsEnIpeiroPezefsas.name
ltx/gr_gr_cog/me.m02.d15:meMA.Ode1C12.mode	@ltx/gr_gr_cog/miscellanea:misc.Mode6
ltx/gr_gr_cog/me.m02.d15:meMA.Ode1C12.ode	@ltx/gr_gr_cog/miscellanea:misc.Ode1
ltx/gr_gr_cog/me.m02.d15:meMA.Ode1C12.text	Ἀκτινοβόλοις τοῦ Παύλου καταυγασθείς, λαμπηδόσιν ἔνδοξε, τῆς ἀγνοίας τὴν ἀχλύν, εὐχερῶς διέφυγες, Χριστῷ, χαριστήριον ᾠδήν, βοῶν Πανόλβιε.
ltx/gr_gr_cog/me.m02.d15:meMA.Ode1C13.incipit	Θεῖος ἐδείχθης Παμμάκαρ ἱερουργός, καὶ…
ltx/gr_gr_cog/me.m02.d15:meMA.Ode1C13.melody	@ltx/gr_gr_cog/he.h.m6:heHE.OsEnIpeiroPezefsas.name
ltx/gr_gr_cog/me.m02.d15:meMA.Ode1C13.mode	@ltx/gr_gr_cog/miscellanea:misc.Mode6
ltx/gr_gr_cog/me.m02.d15:meMA.Ode1C13.ode	@ltx/gr_gr_cog/miscellanea:misc.Ode1
ltx/gr_gr_cog/me.m02.d15:meMA.Ode1C13.text	Θεῖος ἐδείχθης Παμμάκαρ ἱερουργός, καὶ τῷ θείῳ Πνεύματι, διαλάμπων τηλαυγῶς, πανταχοῦ διέδραμες Χριστόν, ἀναγγέλλων εὐσεβῶς, θεομακάριστε.
ltx/gr_gr_cog/me.m02.d15:meMA.Ode1C1H.greekmelody	@ltx/gr_gr_cog/he.h.m6:heHE.OsEnIpeiroPezefsas.greekname
ltx/gr_gr_cog/me.m02.d15:meMA.Ode1C1H.incipit	@ltx/gr_gr_cog/he.h.m6:heHE.OsEnIpeiroPezefsas.incipit
ltx/gr_gr_cog/me.m02.d15:meMA.Ode1C1H.melody	@ltx/gr_gr_cog/he.h.m6:heHE.OsEnIpeiroPezefsas.melody
ltx/gr_gr_cog/me.m02.d15:meMA.Ode1C1H.mode	@ltx/gr_gr_cog/miscellanea:misc.Mode6
ltx/gr_gr_cog/me.m02.d15:meMA.Ode1C1H.ode	@ltx/gr_gr_cog/miscellanea:misc.Ode1
ltx/gr_gr_cog/me.m02.d15:meMA.Ode1C1H.text	@ltx/gr_gr_cog/he.h.m6:heHE.OsEnIpeiroPezefsas.text
ltx/gr_gr_cog/me.m02.d15:meMA.Ode1C1T.incipit	Ὡραϊσμένη τῷ κάλλει τῶν ἀρετῶν…
ltx/gr_gr_cog/me.m02.d15:meMA.Ode1C1T.melody	@ltx/gr_gr_cog/he.h.m6:heHE.OsEnIpeiroPezefsas.name
ltx/gr_gr_cog/me.m02.d15:meMA.Ode1C1T.mode	@ltx/gr_gr_cog/miscellanea:misc.Mode6
ltx/gr_gr_cog/me.m02.d15:meMA.Ode1C1T.ode	@ltx/gr_gr_cog/miscellanea:misc.Ode1
ltx/gr_gr_cog/me.m02.d15:meMA.Ode1C1T.text	Ὡραϊσμένη τῷ κάλλει τῶν ἀρετῶν, Θεομῆτορ ἄχραντε, τὸν Θεὸν τὸν ἀληθῆ, ὑπὲρ νοῦν συνέλαβες ἡμᾶς, τὸν ταῖς θείαις ἀρεταῖς, καταφαιδρύναντα.
ltx/gr_gr_cog/me.m02.d15:meMA.Ode3C11.greekmelody	@ltx/gr_gr_cog/he.h.m6:heHE.OukEstinAgios.greekname
ltx/gr_gr_cog/me.m02.d15:meMA.Ode3C11.incipit	Ναμάτων θείων τῇ πηγῇ, προσπελάσας…
ltx/gr_gr_cog/me.m02.d15:meMA.Ode3C11.melody	@ltx/gr_gr_cog/he.h.m6:heHE.OukEstinAgios.name
ltx/gr_gr_cog/me.m02.d15:meMA.Ode3C11.mode	@ltx/gr_gr_cog/miscellanea:misc.Mode6
ltx/gr_gr_cog/me.m02.d15:meMA.Ode3C11.ode	@ltx/gr_gr_cog/miscellanea:misc.Ode3
ltx/gr_gr_cog/me.m02.d15:meMA.Ode3C11.text	Ναμάτων θείων τῇ πηγῇ, προσπελάσας τὸ στόμα, καὶ τρυφῆς τὸν χειμάῤῥουν, ἐξ αὐτῆς ἀναλαβών, τὸ πρόσωπον τῆς σεπτῆς Ἐκκλησίας, Ἔνδοξε κατήρδευσας.
ltx/gr_gr_cog/me.m02.d15:meMA.Ode3C12.incipit	Μεθέξει φέγγους νοητοῦ, φαεινότατος ὤφθης…
ltx/gr_gr_cog/me.m02.d15:meMA.Ode3C12.melody	@ltx/gr_gr_cog/he.h.m6:heHE.OukEstinAgios.name
ltx/gr_gr_cog/me.m02.d15:meMA.Ode3C12.mode	@ltx/gr_gr_cog/miscellanea:misc.Mode6
ltx/gr_gr_cog/me.m02.d15:meMA.Ode3C12.ode	@ltx/gr_gr_cog/miscellanea:misc.Ode3
ltx/gr_gr_cog/me.m02.d15:meMA.Ode3C12.text	Μεθέξει φέγγους νοητοῦ, φαεινότατος ὤφθης, εὐσεβείας λαμπάσι, τὰς καρδίας τῶν πιστῶν, καταφωτίζων λαμπρῶς, τῇ φωσφόρῳ, αἴγλῃ τοῦ κηρύγματος.
ltx/gr_gr_cog/me.m02.d15:meMA.Ode3C13.incipit	Ἐλύθης Παύλου τοῖς δεσμοῖς, ἐκ…
ltx/gr_gr_cog/me.m02.d15:meMA.Ode3C13.melody	@ltx/gr_gr_cog/he.h.m6:heHE.OukEstinAgios.name
ltx/gr_gr_cog/me.m02.d15:meMA.Ode3C13.mode	@ltx/gr_gr_cog/miscellanea:misc.Mode6
ltx/gr_gr_cog/me.m02.d15:meMA.Ode3C13.ode	@ltx/gr_gr_cog/miscellanea:misc.Ode3
ltx/gr_gr_cog/me.m02.d15:meMA.Ode3C13.text	Ἐλύθης Παύλου τοῖς δεσμοῖς, ἐκ δουλείας τῆς πλάνης, καὶ τῇ ἐλευθερίᾳ, τῆς χάριτος τιμηθείς, Υἱὸς Θεοῦ γεγονώς, κληρονόμος, θεῖος ἀναδέδειξαι.
ltx/gr_gr_cog/me.m02.d15:meMA.Ode3C1H.greekmelody	@ltx/gr_gr_cog/he.h.m6:heHE.OukEstinAgios.greekname
ltx/gr_gr_cog/me.m02.d15:meMA.Ode3C1H.incipit	@ltx/gr_gr_cog/he.h.m6:heHE.OukEstinAgios.incipit
ltx/gr_gr_cog/me.m02.d15:meMA.Ode3C1H.melody	@ltx/gr_gr_cog/he.h.m6:heHE.OukEstinAgios.melody
ltx/gr_gr_cog/me.m02.d15:meMA.Ode3C1H.mode	@ltx/gr_gr_cog/miscellanea:misc.Mode6
ltx/gr_gr_cog/me.m02.d15:meMA.Ode3C1H.ode	@ltx/gr_gr_cog/miscellanea:misc.Ode3
ltx/gr_gr_cog/me.m02.d15:meMA.Ode3C1H.text	@ltx/gr_gr_cog/he.h.m6:heHE.OukEstinAgios.text
ltx/gr_gr_cog/me.m02.d15:meMA.Ode3C1T.incipit	Δολίως ὄφις με τὸ πρίν…
ltx/gr_gr_cog/me.m02.d15:meMA.Ode3C1T.melody	@ltx/gr_gr_cog/he.h.m6:heHE.OukEstinAgios.name
ltx/gr_gr_cog/me.m02.d15:meMA.Ode3C1T.mode	@ltx/gr_gr_cog/miscellanea:misc.Mode6
ltx/gr_gr_cog/me.m02.d15:meMA.Ode3C1T.ode	@ltx/gr_gr_cog/miscellanea:misc.Ode3
ltx/gr_gr_cog/me.m02.d15:meMA.Ode3C1T.text	Δολίως ὄφις με τὸ πρίν, ὡς αἰχμάλωτον εἷλε, δι ἀπάτης ἑρπύσας, διὰ σοῦ δὲ τῆς αὐτοῦ, δουλείας ἀπαλλαγεὶς Θεομῆτορ, ὕμνοις μακαρίζω σε.
ltx/gr_gr_cog/me.m02.d15:meMA.Ode3Kathisma1.greekmelody	@ltx/gr_gr_cog/he.a.m8:heAU.TinSofianKaiLogon.greekname
ltx/gr_gr_cog/me.m02.d15:meMA.Ode3Kathisma1.incipit	Ἐκ δουλείας τῆς πλάνης ἀπαλλαγείς…
ltx/gr_gr_cog/me.m02.d15:meMA.Ode3Kathisma1.melody	@ltx/gr_gr_cog/he.a.m8:heAU.TinSofianKaiLogon.name
ltx/gr_gr_cog/me.m02.d15:meMA.Ode3Kathisma1.mode	@ltx/gr_gr_cog/miscellanea:misc.Mode8
ltx/gr_gr_cog/me.m02.d15:meMA.Ode3Kathisma1.text	Ἐκ δουλείας τῆς πλάνης ἀπαλλαγείς, ἀπελεύθερος ὤφθης ἐν τῷ Θεῷ, αὐτοῦ δοῦλος γνήσιος, χρηματίσας ἐν χάριτι, κοινωνὸς δεσμῶν δέ, τοῦ Παύλου γενόμενος, διὰ Χριστὸν ἐκτάνθης, ἀδίκως Ἀπόστολε· ὅθεν ἠξιώθης, μαρτυρήσας νομίμως, τῆς ἄνω λαμπρότητος, Ἱεράρχα Ὀνήσιμε· διὰ τοῦτο βοῶμέν σοι· Πρέσβευε Χριστῷ τῷ Θεῷ, τῶν πταισμάτων ἄφεσιν δωρήσασθαι, τοῖς ἑορτάζουσι πόθῳ, τὴν ἁγίαν μνήμην σου.
ltx/gr_gr_cog/me.m02.d15:meMA.Ode3KathismaSt.incipit	@ltx/gr_gr_cog/me.m01.d24:meMA.Ode3KathismaSt.incipit
ltx/gr_gr_cog/me.m02.d15:meMA.Ode3KathismaSt.melody	@ltx/gr_gr_cog/he.a.m8:heAU.TinSofianKaiLogon.name
ltx/gr_gr_cog/me.m02.d15:meMA.Ode3KathismaSt.mode	@ltx/gr_gr_cog/miscellanea:misc.Mode8
ltx/gr_gr_cog/me.m02.d15:meMA.Ode3KathismaSt.text	@ltx/gr_gr_cog/me.m01.d24:meMA.Ode3KathismaSt.text
ltx/gr_gr_cog/me.m02.d15:meMA.Ode3KathismaT.incipit	@ltx/gr_gr_cog/me.m02.d07:meMA.Ode3KathismaT.incipit
ltx/gr_gr_cog/me.m02.d15:meMA.Ode3KathismaT.melody	@ltx/gr_gr_cog/he.a.m8:heAU.TinSofianKaiLogon.name
ltx/gr_gr_cog/me.m02.d15:meMA.Ode3KathismaT.mode	@ltx/gr_gr_cog/miscellanea:misc.Mode8
ltx/gr_gr_cog/me.m02.d15:meMA.Ode3KathismaT.text	@ltx/gr_gr_cog/me.m02.d07:meMA.Ode3KathismaT.text
ltx/gr_gr_cog/me.m02.d15:meMA.Ode4C11.greekmelody	@ltx/gr_gr_cog/he.h.m6:heHE.ChristosMouDynamis.greekname
ltx/gr_gr_cog/me.m02.d15:meMA.Ode4C11.incipit	Ὁ θέλων ἅπαντας, σωθῆναι Κύριος…
ltx/gr_gr_cog/me.m02.d15:meMA.Ode4C11.melody	@ltx/gr_gr_cog/he.h.m6:heHE.ChristosMouDynamis.name
ltx/gr_gr_cog/me.m02.d15:meMA.Ode4C11.mode	@ltx/gr_gr_cog/miscellanea:misc.Mode6
ltx/gr_gr_cog/me.m02.d15:meMA.Ode4C11.ode	@ltx/gr_gr_cog/miscellanea:misc.Ode4
ltx/gr_gr_cog/me.m02.d15:meMA.Ode4C11.text	Ὁ θέλων ἅπαντας, σωθῆναι Κύριος, ἐκ ζυγοῦ σε δουλείας ἱερουργόν, Μάκαρ προχειρίζεται, ἱερουργοῦντα τὸ σεπτόν, θεοφάντορ Εὐαγγέλιον.
ltx/gr_gr_cog/me.m02.d15:meMA.Ode4C12.incipit	Υἱὸς σὺ γέγονας, Θεοῦ τῇ…
ltx/gr_gr_cog/me.m02.d15:meMA.Ode4C12.melody	@ltx/gr_gr_cog/he.h.m6:heHE.ChristosMouDynamis.name
ltx/gr_gr_cog/me.m02.d15:meMA.Ode4C12.mode	@ltx/gr_gr_cog/miscellanea:misc.Mode6
ltx/gr_gr_cog/me.m02.d15:meMA.Ode4C12.ode	@ltx/gr_gr_cog/miscellanea:misc.Ode4
ltx/gr_gr_cog/me.m02.d15:meMA.Ode4C12.text	Υἱὸς σὺ γέγονας, Θεοῦ τῇ χάριτι, τὸν αὐτοῦ καταγγέλλων μονογενῆ, Λόγον τὸν ἀΐδιον, μετὰ σαρκὸς τοῖς ἐπὶ γῆς, παραδόξως ὁμιλήσαντα.
ltx/gr_gr_cog/me.m02.d15:meMA.Ode4C13.incipit	Λογίῳ κρίσεως, καὶ θείῳ χρίσματι…
ltx/gr_gr_cog/me.m02.d15:meMA.Ode4C13.melody	@ltx/gr_gr_cog/he.h.m6:heHE.ChristosMouDynamis.name
ltx/gr_gr_cog/me.m02.d15:meMA.Ode4C13.mode	@ltx/gr_gr_cog/miscellanea:misc.Mode6
ltx/gr_gr_cog/me.m02.d15:meMA.Ode4C13.ode	@ltx/gr_gr_cog/miscellanea:misc.Ode4
ltx/gr_gr_cog/me.m02.d15:meMA.Ode4C13.text	Λογίῳ κρίσεως, καὶ θείῳ χρίσματι, τῷ τῆς ἱερωσύνης ὡς Ἱερεύς, Πάνσοφε διέπρεψας, καὶ καρτερίᾳ τῶν δεινῶν, Μάρτυς θεῖος ἐχρημάτισας.
ltx/gr_gr_cog/me.m02.d15:meMA.Ode4C1H.greekmelody	@ltx/gr_gr_cog/he.h.m6:heHE.ChristosMouDynamis.greekname
ltx/gr_gr_cog/me.m02.d15:meMA.Ode4C1H.incipit	@ltx/gr_gr_cog/he.h.m6:heHE.ChristosMouDynamis.incipit
ltx/gr_gr_cog/me.m02.d15:meMA.Ode4C1H.melody	@ltx/gr_gr_cog/he.h.m6:heHE.ChristosMouDynamis.melody
ltx/gr_gr_cog/me.m02.d15:meMA.Ode4C1H.mode	@ltx/gr_gr_cog/miscellanea:misc.Mode6
ltx/gr_gr_cog/me.m02.d15:meMA.Ode4C1H.ode	@ltx/gr_gr_cog/miscellanea:misc.Ode4
ltx/gr_gr_cog/me.m02.d15:meMA.Ode4C1H.text	@ltx/gr_gr_cog/he.h.m6:heHE.ChristosMouDynamis.text
ltx/gr_gr_cog/me.m02.d15:meMA.Ode4C1T.incipit	Ὁ φύσει ἄναρχος, Υἱὸς καὶ…
ltx/gr_gr_cog/me.m02.d15:meMA.Ode4C1T.melody	@ltx/gr_gr_cog/he.h.m6:heHE.ChristosMouDynamis.name
ltx/gr_gr_cog/me.m02.d15:meMA.Ode4C1T.mode	@ltx/gr_gr_cog/miscellanea:misc.Mode6
ltx/gr_gr_cog/me.m02.d15:meMA.Ode4C1T.ode	@ltx/gr_gr_cog/miscellanea:misc.Ode4
ltx/gr_gr_cog/me.m02.d15:meMA.Ode4C1T.text	Ὁ φύσει ἄναρχος, Υἱὸς καὶ ἄχρονος, χρονικὴν ἐκ Παρθένου Κόρης ἀρχήν, θέλων καταδέχεται, τους ὑπὸ χρόνον ἐκ φθορᾶς, ἀναπλάσαι προμηθούμενος.
ltx/gr_gr_cog/me.m02.d15:meMA.Ode5C11.greekmelody	@ltx/gr_gr_cog/he.h.m6:heHE.ToTheioFengeiSou.greekname
ltx/gr_gr_cog/me.m02.d15:meMA.Ode5C11.incipit	Νοὸς ὀξύτητι καὶ ψυχῆς, Μάκαρ…
ltx/gr_gr_cog/me.m02.d15:meMA.Ode5C11.melody	@ltx/gr_gr_cog/he.h.m6:heHE.ToTheioFengeiSou.name
ltx/gr_gr_cog/me.m02.d15:meMA.Ode5C11.mode	@ltx/gr_gr_cog/miscellanea:misc.Mode6
ltx/gr_gr_cog/me.m02.d15:meMA.Ode5C11.ode	@ltx/gr_gr_cog/miscellanea:misc.Ode5
ltx/gr_gr_cog/me.m02.d15:meMA.Ode5C11.text	Νοὸς ὀξύτητι καὶ ψυχῆς, Μάκαρ καθαρότητι πάντας, τοῦ δυσμενοῦς ὑπεριπτάμενος, βρόχους ἀνυψώθης πρὸς οὐρανίους σκηνάς, πτεροῖς θεογνωσίας ἀναφερόμενος.
ltx/gr_gr_cog/me.m02.d15:meMA.Ode5C12.incipit	Ὁ σὸς Ἀπόστολος ἀγαθέ, τὴν…
ltx/gr_gr_cog/me.m02.d15:meMA.Ode5C12.melody	@ltx/gr_gr_cog/he.h.m6:heHE.ToTheioFengeiSou.name
ltx/gr_gr_cog/me.m02.d15:meMA.Ode5C12.mode	@ltx/gr_gr_cog/miscellanea:misc.Mode6
ltx/gr_gr_cog/me.m02.d15:meMA.Ode5C12.ode	@ltx/gr_gr_cog/miscellanea:misc.Ode5
ltx/gr_gr_cog/me.m02.d15:meMA.Ode5C12.text	Ὁ σὸς Ἀπόστολος ἀγαθέ, τὴν διὰ σαρκός σου παρουσίαν πρὸς ἀνθρώπους ἐκήρυξε, τοὺς πεπλανημένους πρὸς σὴν ἐπίγνωσιν, ὁδηγῶν καὶ φωτίζων, αἴγλῃ τῆς πίστεως.
ltx/gr_gr_cog/me.m02.d15:meMA.Ode5C13.incipit	Ναὸς ἐδείχθης πανευπρεπής, ἔνδον κεκτημένος…
ltx/gr_gr_cog/me.m02.d15:meMA.Ode5C13.melody	@ltx/gr_gr_cog/he.h.m6:heHE.ToTheioFengeiSou.name
ltx/gr_gr_cog/me.m02.d15:meMA.Ode5C13.mode	@ltx/gr_gr_cog/miscellanea:misc.Mode6
ltx/gr_gr_cog/me.m02.d15:meMA.Ode5C13.ode	@ltx/gr_gr_cog/miscellanea:misc.Ode5
ltx/gr_gr_cog/me.m02.d15:meMA.Ode5C13.text	Ναὸς ἐδείχθης πανευπρεπής, ἔνδον κεκτημένος ὡς λυχνίαν, τὸ φέγγος τῆς θείας χάριτος, τῇ οἰκοδομίᾳ τοῦ θείου Πνεύματος τεθεμελιωμένος Μάκαρ Ὀνήσιμε.
ltx/gr_gr_cog/me.m02.d15:meMA.Ode5C1H.greekmelody	@ltx/gr_gr_cog/he.h.m6:heHE.ToTheioFengeiSou.greekname
ltx/gr_gr_cog/me.m02.d15:meMA.Ode5C1H.incipit	@ltx/gr_gr_cog/he.h.m6:heHE.ToTheioFengeiSou.incipit
ltx/gr_gr_cog/me.m02.d15:meMA.Ode5C1H.melody	@ltx/gr_gr_cog/he.h.m6:heHE.ToTheioFengeiSou.melody
ltx/gr_gr_cog/me.m02.d15:meMA.Ode5C1H.mode	@ltx/gr_gr_cog/miscellanea:misc.Mode6
ltx/gr_gr_cog/me.m02.d15:meMA.Ode5C1H.ode	@ltx/gr_gr_cog/miscellanea:misc.Ode5
ltx/gr_gr_cog/me.m02.d15:meMA.Ode5C1H.text	@ltx/gr_gr_cog/he.h.m6:heHE.ToTheioFengeiSou.text
ltx/gr_gr_cog/me.m02.d15:meMA.Ode5C1T.incipit	Τῆς ἁμαρτίας μου τὰς σειράς…
ltx/gr_gr_cog/me.m02.d15:meMA.Ode5C1T.melody	@ltx/gr_gr_cog/he.h.m6:heHE.ToTheioFengeiSou.name
ltx/gr_gr_cog/me.m02.d15:meMA.Ode5C1T.mode	@ltx/gr_gr_cog/miscellanea:misc.Mode6
ltx/gr_gr_cog/me.m02.d15:meMA.Ode5C1T.ode	@ltx/gr_gr_cog/miscellanea:misc.Ode5
ltx/gr_gr_cog/me.m02.d15:meMA.Ode5C1T.text	Τῆς ἁμαρτίας μου τὰς σειράς, τῇ σῇ μεσιτείᾳ, καὶ προστασίᾳ, Παρθένε διάῤῥηξον· τῶν ἀπεγνωσμένων σὺ γὰρ ὑπάρχεις ἐλπίς, τῶν πίστει προστρεχόντων, τῇ θείᾳ σκέπῃ σου.
ltx/gr_gr_cog/me.m02.d15:meMA.Ode6C11.greekmelody	@ltx/gr_gr_cog/he.h.m6:heHE.TouViouTinThalassan.greekname
ltx/gr_gr_cog/me.m02.d15:meMA.Ode6C11.incipit	Ἀστράψας ὡς ἥλιος, οὐρανόθεν ὁ…
ltx/gr_gr_cog/me.m02.d15:meMA.Ode6C11.melody	@ltx/gr_gr_cog/he.h.m6:heHE.TouViouTinThalassan.name
ltx/gr_gr_cog/me.m02.d15:meMA.Ode6C11.mode	@ltx/gr_gr_cog/miscellanea:misc.Mode6
ltx/gr_gr_cog/me.m02.d15:meMA.Ode6C11.ode	@ltx/gr_gr_cog/miscellanea:misc.Ode6
ltx/gr_gr_cog/me.m02.d15:meMA.Ode6C11.text	Ἀστράψας ὡς ἥλιος, οὐρανόθεν ὁ κληθείς, τῷ φωτισμῷ τῆς χάριτος, ἐπαφῆκεν ἀκτῖνά σε τηλαυγῆ, εὐτόνως ἐλαύνουσαν, τῆς ἀγνοίας τὸν ζόφον Παμμακάριστε.
ltx/gr_gr_cog/me.m02.d15:meMA.Ode6C12.incipit	Λαμπρῶς ἐστηλίτευσας, τῶν ἀνόμων τὰ…
ltx/gr_gr_cog/me.m02.d15:meMA.Ode6C12.melody	@ltx/gr_gr_cog/he.h.m6:heHE.TouViouTinThalassan.name
ltx/gr_gr_cog/me.m02.d15:meMA.Ode6C12.mode	@ltx/gr_gr_cog/miscellanea:misc.Mode6
ltx/gr_gr_cog/me.m02.d15:meMA.Ode6C12.ode	@ltx/gr_gr_cog/miscellanea:misc.Ode6
ltx/gr_gr_cog/me.m02.d15:meMA.Ode6C12.text	Λαμπρῶς ἐστηλίτευσας, τῶν ἀνόμων τὰ σαθρά, καὶ δυσσεβῆ φρυάγματα, εὐσεβείας φθεγγόμενος εὐσεβῶς, τὰ θεῖα διδάγματα, Ἱεράρχα Κυρίου πανσεβάσμιε.
ltx/gr_gr_cog/me.m02.d15:meMA.Ode6C1H.greekmelody	@ltx/gr_gr_cog/he.h.m6:heHE.TouViouTinThalassan.greekname
ltx/gr_gr_cog/me.m02.d15:meMA.Ode6C1H.incipit	@ltx/gr_gr_cog/he.h.m6:heHE.TouViouTinThalassan.incipit
ltx/gr_gr_cog/me.m02.d15:meMA.Ode6C1H.melody	@ltx/gr_gr_cog/he.h.m6:heHE.TouViouTinThalassan.melody
ltx/gr_gr_cog/me.m02.d15:meMA.Ode6C1H.mode	@ltx/gr_gr_cog/miscellanea:misc.Mode6
ltx/gr_gr_cog/me.m02.d15:meMA.Ode6C1H.ode	@ltx/gr_gr_cog/miscellanea:misc.Ode6
ltx/gr_gr_cog/me.m02.d15:meMA.Ode6C1H.text	@ltx/gr_gr_cog/he.h.m6:heHE.TouViouTinThalassan.text
ltx/gr_gr_cog/me.m02.d15:meMA.Ode6C1T.incipit	Ὑπάρχων ὑπεύθυνος, ἁμαρτίαις καὶ δεινῶς…
ltx/gr_gr_cog/me.m02.d15:meMA.Ode6C1T.melody	@ltx/gr_gr_cog/he.h.m6:heHE.TouViouTinThalassan.name
ltx/gr_gr_cog/me.m02.d15:meMA.Ode6C1T.mode	@ltx/gr_gr_cog/miscellanea:misc.Mode6
ltx/gr_gr_cog/me.m02.d15:meMA.Ode6C1T.ode	@ltx/gr_gr_cog/miscellanea:misc.Ode6
ltx/gr_gr_cog/me.m02.d15:meMA.Ode6C1T.text	Ὑπάρχων ὑπεύθυνος, ἁμαρτίαις καὶ δεινῶς, τραυματισθεὶς ὁ δείλαιος, ἐπὶ σὲ Θεομῆτορ τὴν συμπαθῆ, προσφεύγω δεόμενος, τὰς οὐλὰς ἐξαλεῖψαι τῶν πταισμάτων μου.
ltx/gr_gr_cog/me.m02.d15:meMA.Ode7C11.greekmelody	@ltx/gr_gr_cog/he.h.m6:heHE.DrosovolonMenTinKaminon.greekname
ltx/gr_gr_cog/me.m02.d15:meMA.Ode7C11.incipit	Τὸ μακάριον ἀπείληφας Ὀνήσιμε, τέλος…
ltx/gr_gr_cog/me.m02.d15:meMA.Ode7C11.melody	@ltx/gr_gr_cog/he.h.m6:heHE.DrosovolonMenTinKaminon.name
ltx/gr_gr_cog/me.m02.d15:meMA.Ode7C11.mode	@ltx/gr_gr_cog/miscellanea:misc.Mode6
ltx/gr_gr_cog/me.m02.d15:meMA.Ode7C11.ode	@ltx/gr_gr_cog/miscellanea:misc.Ode7
ltx/gr_gr_cog/me.m02.d15:meMA.Ode7C11.text	Τὸ μακάριον ἀπείληφας Ὀνήσιμε, τέλος καὶ τὴν ἀνώλεθρον, ἀθανασίαν ἠξιώθης μάκαρ καθορᾶν καὶ μέλπεις γηθόμενος Χριστῷ· Εὐλογητὸς εἶ ὁ Θεός, ὁ τῶν Πατέρων ἡμῶν.
ltx/gr_gr_cog/me.m02.d15:meMA.Ode7C12.incipit	Ῥωμαλέῳ σου φρονήματι Ὀνήσιμε, πλάνης…
ltx/gr_gr_cog/me.m02.d15:meMA.Ode7C12.melody	@ltx/gr_gr_cog/he.h.m6:heHE.DrosovolonMenTinKaminon.name
ltx/gr_gr_cog/me.m02.d15:meMA.Ode7C12.mode	@ltx/gr_gr_cog/miscellanea:misc.Mode6
ltx/gr_gr_cog/me.m02.d15:meMA.Ode7C12.ode	@ltx/gr_gr_cog/miscellanea:misc.Ode7
ltx/gr_gr_cog/me.m02.d15:meMA.Ode7C12.text	Ῥωμαλέῳ σου φρονήματι Ὀνήσιμε, πλάνης τὰ μηχανήματα, κατεπάτησας, εὐσεβείας ταῦτα καθελών, ὀργάνοις θεόσοφε βοῶν· Εὐλογητὸς εἶ ὁ Θεός, ὁ τῶν Πατέρων ἡμῶν.
ltx/gr_gr_cog/me.m02.d15:meMA.Ode7C1H.greekmelody	@ltx/gr_gr_cog/he.h.m6:heHE.DrosovolonMenTinKaminon.greekname
ltx/gr_gr_cog/me.m02.d15:meMA.Ode7C1H.incipit	@ltx/gr_gr_cog/he.h.m6:heHE.DrosovolonMenTinKaminon.incipit
ltx/gr_gr_cog/me.m02.d15:meMA.Ode7C1H.melody	@ltx/gr_gr_cog/he.h.m6:heHE.DrosovolonMenTinKaminon.melody
ltx/gr_gr_cog/me.m02.d15:meMA.Ode7C1H.mode	@ltx/gr_gr_cog/miscellanea:misc.Mode6
ltx/gr_gr_cog/me.m02.d15:meMA.Ode7C1H.ode	@ltx/gr_gr_cog/miscellanea:misc.Ode7
ltx/gr_gr_cog/me.m02.d15:meMA.Ode7C1H.text	@ltx/gr_gr_cog/he.h.m6:heHE.DrosovolonMenTinKaminon.text
ltx/gr_gr_cog/me.m02.d15:meMA.Ode7C1T.incipit	Ὡς ὑπάρχουσα πανάμωμος Θεόνυμφε, Λόγον…
ltx/gr_gr_cog/me.m02.d15:meMA.Ode7C1T.melody	@ltx/gr_gr_cog/he.h.m6:heHE.DrosovolonMenTinKaminon.name
ltx/gr_gr_cog/me.m02.d15:meMA.Ode7C1T.mode	@ltx/gr_gr_cog/miscellanea:misc.Mode6
ltx/gr_gr_cog/me.m02.d15:meMA.Ode7C1T.ode	@ltx/gr_gr_cog/miscellanea:misc.Ode7
ltx/gr_gr_cog/me.m02.d15:meMA.Ode7C1T.text	Ὡς ὑπάρχουσα πανάμωμος Θεόνυμφε, Λόγον Θεοῦ συνέλαβες, τὸν ἀχωρήτως ἐν τοῖς κόλποις ὄντα τοῦ Πατρός, χερσί τε κρατούμενον ταῖς σαῖς, εὐλογημένη Παναγία, Θεομῆτορ ἁγνή.
ltx/gr_gr_cog/me.m02.d15:meMA.Ode8C11.greekmelody	@ltx/gr_gr_cog/he.h.m6:heHE.EkFlogosToisOsiois.greekname
ltx/gr_gr_cog/me.m02.d15:meMA.Ode8C11.incipit	Σὺν Ἀγγέλοις χορεύων Μάκαρ Ὀνήσιμε…
ltx/gr_gr_cog/me.m02.d15:meMA.Ode8C11.melody	@ltx/gr_gr_cog/he.h.m6:heHE.EkFlogosToisOsiois.name
ltx/gr_gr_cog/me.m02.d15:meMA.Ode8C11.mode	@ltx/gr_gr_cog/miscellanea:misc.Mode6
ltx/gr_gr_cog/me.m02.d15:meMA.Ode8C11.ode	@ltx/gr_gr_cog/miscellanea:misc.Ode8
ltx/gr_gr_cog/me.m02.d15:meMA.Ode8C11.text	Σὺν Ἀγγέλοις χορεύων Μάκαρ Ὀνήσιμε, μαρτυρίου τε στέφει κατακοσμούμενος, θρόνῳ νῦν φαιδρῶς, τοῦ Δεσπότου παρίστασαι, ὃν ὑπερυψοῦμεν, εἰς πάντας τοὺς αἰῶνας.
ltx/gr_gr_cog/me.m02.d15:meMA.Ode8C12.incipit	Ἀποστόλῳ τῷ θείῳ διακονούμενος, ἀποῤῥήτων…
ltx/gr_gr_cog/me.m02.d15:meMA.Ode8C12.melody	@ltx/gr_gr_cog/he.h.m6:heHE.EkFlogosToisOsiois.name
ltx/gr_gr_cog/me.m02.d15:meMA.Ode8C12.mode	@ltx/gr_gr_cog/miscellanea:misc.Mode6
ltx/gr_gr_cog/me.m02.d15:meMA.Ode8C12.ode	@ltx/gr_gr_cog/miscellanea:misc.Ode8
ltx/gr_gr_cog/me.m02.d15:meMA.Ode8C12.text	Ἀποστόλῳ τῷ θείῳ διακονούμενος, ἀποῤῥήτων τῶν θείων ἔσχες ἐνέργειαν, κήρυξ ἀληθής, Χριστοῦ Μάκαρ γενόμενος, ὃν ὑπερυψοῦμεν εἰς πάντας τοὺς αἰῶνας.
ltx/gr_gr_cog/me.m02.d15:meMA.Ode8C13.incipit	Ἰαμάτων τὴν χάριν ἐκ τῆς…
ltx/gr_gr_cog/me.m02.d15:meMA.Ode8C13.melody	@ltx/gr_gr_cog/he.h.m6:heHE.EkFlogosToisOsiois.name
ltx/gr_gr_cog/me.m02.d15:meMA.Ode8C13.mode	@ltx/gr_gr_cog/miscellanea:misc.Mode6
ltx/gr_gr_cog/me.m02.d15:meMA.Ode8C13.ode	@ltx/gr_gr_cog/miscellanea:misc.Ode8
ltx/gr_gr_cog/me.m02.d15:meMA.Ode8C13.text	Ἰαμάτων τὴν χάριν ἐκ τῆς ἀφθόνου πηγῆς, τοῦ Σωτῆρος πλουτήσας πᾶσι μετέδωκας, τούτου πειθαρχῶν, Μάκαρ θείοις προστάγμασιν, ὃν ὑπερυψοῦμεν, εἰς πάντας τοὺς αἰῶνας.
ltx/gr_gr_cog/me.m02.d15:meMA.Ode8C1H.greekmelody	@ltx/gr_gr_cog/he.h.m6:heHE.EkFlogosToisOsiois.greekname
ltx/gr_gr_cog/me.m02.d15:meMA.Ode8C1H.incipit	@ltx/gr_gr_cog/he.h.m6:heHE.EkFlogosToisOsiois.incipit
ltx/gr_gr_cog/me.m02.d15:meMA.Ode8C1H.melody	@ltx/gr_gr_cog/he.h.m6:heHE.EkFlogosToisOsiois.melody
ltx/gr_gr_cog/me.m02.d15:meMA.Ode8C1H.mode	@ltx/gr_gr_cog/miscellanea:misc.Mode6
ltx/gr_gr_cog/me.m02.d15:meMA.Ode8C1H.ode	@ltx/gr_gr_cog/miscellanea:misc.Ode8
ltx/gr_gr_cog/me.m02.d15:meMA.Ode8C1H.text	@ltx/gr_gr_cog/he.h.m6:heHE.EkFlogosToisOsiois.text
ltx/gr_gr_cog/me.m02.d15:meMA.Ode8C1T.incipit	Μυηθέντες τὸ θαῦμα τῆς σῆς…
ltx/gr_gr_cog/me.m02.d15:meMA.Ode8C1T.melody	@ltx/gr_gr_cog/he.h.m6:heHE.EkFlogosToisOsiois.name
ltx/gr_gr_cog/me.m02.d15:meMA.Ode8C1T.mode	@ltx/gr_gr_cog/miscellanea:misc.Mode6
ltx/gr_gr_cog/me.m02.d15:meMA.Ode8C1T.ode	@ltx/gr_gr_cog/miscellanea:misc.Ode8
ltx/gr_gr_cog/me.m02.d15:meMA.Ode8C1T.text	Μυηθέντες τὸ θαῦμα τῆς σῆς γεννήσεως, ἀνυμνοῦμεν τὸ μέγα καὶ ὑπὲρ ἔννοιαν, Πάναγνε σεμνή, Θεομῆτορ Μυστήριον, καὶ ὑπερυψοῦμεν, εἰς πάντας τοὺς αἰῶνας.
ltx/gr_gr_cog/me.m02.d15:meMA.Ode9C11.greekmelody	@ltx/gr_gr_cog/he.h.m6:heHE.TheonAnthropois.greekname
ltx/gr_gr_cog/me.m02.d15:meMA.Ode9C11.incipit	Ἀστὴρ ὑπέρλαμπρος ἀναδέδειξαι,φωτιστικαῖς ἀκτῖσι διαλάμπων…
ltx/gr_gr_cog/me.m02.d15:meMA.Ode9C11.melody	@ltx/gr_gr_cog/he.h.m6:heHE.TheonAnthropois.name
ltx/gr_gr_cog/me.m02.d15:meMA.Ode9C11.mode	@ltx/gr_gr_cog/miscellanea:misc.Mode6
ltx/gr_gr_cog/me.m02.d15:meMA.Ode9C11.ode	@ltx/gr_gr_cog/miscellanea:misc.Ode9
ltx/gr_gr_cog/me.m02.d15:meMA.Ode9C11.text	Ἀστὴρ ὑπέρλαμπρος ἀναδέδειξαι,φωτιστικαῖς ἀκτῖσι διαλάμπων τοῦ Πνεύματος, καὶ τὰ τοῦ κόσμου πέρατα λαμπρύνων φωτί, τῷ τῆς θεογνωσίας, μάκαρ Ὀνήσιμε· ὅθεν Ἀποστόλων σὺν χοροῖς, σὲ μεγαλύνομεν.
ltx/gr_gr_cog/me.m02.d15:meMA.Ode9C12.incipit	Καρποῖς τοῦ Πνεύματος ὢν κατάκοσμος…
ltx/gr_gr_cog/me.m02.d15:meMA.Ode9C12.melody	@ltx/gr_gr_cog/he.h.m6:heHE.TheonAnthropois.name
ltx/gr_gr_cog/me.m02.d15:meMA.Ode9C12.mode	@ltx/gr_gr_cog/miscellanea:misc.Mode6
ltx/gr_gr_cog/me.m02.d15:meMA.Ode9C12.ode	@ltx/gr_gr_cog/miscellanea:misc.Ode9
ltx/gr_gr_cog/me.m02.d15:meMA.Ode9C12.text	Καρποῖς τοῦ Πνεύματος ὢν κατάκοσμος, εἰς οὐρανούς ἐπήρθης Θεοφάντορ γηθόμενος, τοῦ Χριστοῦ Ἀπόστολος γενόμενος, πάνσοφος ἱεράρχης, Μάρτυς ἀήττητος, Κήρυξ Ἀληθὴς τῶν ὑπὲρ νοῦν, Θεομακάριστε.
ltx/gr_gr_cog/me.m02.d15:meMA.Ode9C13.incipit	Ἀεὶ προΐστασο τῶν ὑμνούντων σε…
ltx/gr_gr_cog/me.m02.d15:meMA.Ode9C13.melody	@ltx/gr_gr_cog/he.h.m6:heHE.TheonAnthropois.name
ltx/gr_gr_cog/me.m02.d15:meMA.Ode9C13.mode	@ltx/gr_gr_cog/miscellanea:misc.Mode6
ltx/gr_gr_cog/me.m02.d15:meMA.Ode9C13.ode	@ltx/gr_gr_cog/miscellanea:misc.Ode9
ltx/gr_gr_cog/me.m02.d15:meMA.Ode9C13.text	Ἀεὶ προΐστασο τῶν ὑμνούντων σε, διὰ παντὸς τὴν σήν τε ἐκτελούντων πανήγυριν, τῷ Δεσπότῃ παρεστὼς Ὀνήσιμε, ὅλος πεφωτισμένος, ὅλος ὑπέρλαμπρος, ὅλος ταῖς ἐκεῖθεν ἀστραπαῖς καταλαμπόμενος.
ltx/gr_gr_cog/me.m02.d15:meMA.Ode9C1H.greekmelody	@ltx/gr_gr_cog/he.h.m6:heHE.TheonAnthropois.greekname
ltx/gr_gr_cog/me.m02.d15:meMA.Ode9C1H.incipit	@ltx/gr_gr_cog/he.h.m6:heHE.TheonAnthropois.incipit
ltx/gr_gr_cog/me.m02.d15:meMA.Ode9C1H.melody	@ltx/gr_gr_cog/he.h.m6:heHE.TheonAnthropois.melody
ltx/gr_gr_cog/me.m02.d15:meMA.Ode9C1H.mode	@ltx/gr_gr_cog/miscellanea:misc.Mode6
ltx/gr_gr_cog/me.m02.d15:meMA.Ode9C1H.ode	@ltx/gr_gr_cog/miscellanea:misc.Ode9
ltx/gr_gr_cog/me.m02.d15:meMA.Ode9C1H.text	@ltx/gr_gr_cog/he.h.m6:heHE.TheonAnthropois.text
ltx/gr_gr_cog/me.m02.d15:meMA.Ode9C1T.incipit	Ῥυσθεὶς τῷ τόκῳ σου παναμώμητε…
ltx/gr_gr_cog/me.m02.d15:meMA.Ode9C1T.melody	@ltx/gr_gr_cog/he.h.m6:heHE.TheonAnthropois.name
ltx/gr_gr_cog/me.m02.d15:meMA.Ode9C1T.mode	@ltx/gr_gr_cog/miscellanea:misc.Mode6
ltx/gr_gr_cog/me.m02.d15:meMA.Ode9C1T.ode	@ltx/gr_gr_cog/miscellanea:misc.Ode9
ltx/gr_gr_cog/me.m02.d15:meMA.Ode9C1T.text	Ῥυσθεὶς τῷ τόκῳ σου παναμώμητε, Μήτηρ Θεοῦ της πάλαι δερματίνης νεκρώσεως, καὶ κατάραν καὶ φθορὰν καὶ θάνατον, τὸν ἐκ τῆς ἁμαρτίας, ἀποσεισάμενος, σὺν ταῖς οὐρανίαις Στρατιαῖς, νῦν μεγαλύνω σε.
ltx/gr_gr_cog/me.m02.d15:meMA.Oikos1.text	Σὲ ὑπὸ Παύλου τοῦ σοφοῦ, τῆς σάλπιγγος τῆς θείας, τῇ πίστει προσαχθέντα, καὶ λόγῳ φωτισθέντα τῆς ἀληθείας μυστικῶς, καὶ μαρτυρηθέντα ἐπʼ ἐργασίᾳ ἀρετῆς, καὶ πίστεως στεῤῥότητι, τίς ἐγκωμιάσαι ἰσχύσει, ὡς ὄντως κατʼ ἀξίαν, ἢ τοὺς πόνους εὐφημῆσαι, ἐν οἷς στεῤῥῶς ἔπαυσας τὴν πλάνην; Χρισθεὶς γὰρ Ἱερεὺς ἐν Πνεύματι θείῳ, ἐκ δουλείας κοσμικῆς, καὶ Ἀποστόλων κήρυγμα λαβών, μετέσχες καὶ τῶν στεφάνων· διό σε πάντες τιμῶμεν Ὀνήσιμε.
ltx/gr_gr_cog/me.m02.d15:meVE.Apolytikion1ger.greekmelody	@ltx/gr_gr_cog/he.a.m1:heAU.TisErimouPolitis.greekname
ltx/gr_gr_cog/me.m02.d15:meVE.Apolytikion1ger.incipit	Ταῖς ἀκτῖσι τοῦ Παύλου φωτισθεὶς…
ltx/gr_gr_cog/me.m02.d15:meVE.Apolytikion1ger.melody	@ltx/gr_gr_cog/he.a.m1:heAU.TisErimouPolitis.name
ltx/gr_gr_cog/me.m02.d15:meVE.Apolytikion1ger.mode	@ltx/gr_gr_cog/miscellanea:misc.Mode1
ltx/gr_gr_cog/me.m02.d15:meVE.Apolytikion1ger.poet	@ltx/gr_gr_cog/poets:po.Gerasimou
ltx/gr_gr_cog/me.m02.d15:meVE.Apolytikion1ger.text	Ταῖς ἀκτῖσι τοῦ Παύλου φωτισθεὶς τὴν διάνοιαν, ὤφθης ὑπηερέτης τοῦ Λότου καὶ Ἀπόστολος ἔνθεος· καὶ ὄνησιν ἐβράβευσας ζωῆς, Ὀνήσιμε θεράπον τοῦ Χριστοῦ, διὰ λόγων καὶ θαυμάτων θεοπρεπῶν, τοῖς πίστει ἐκβοῶσί σοι· δόξα τῷ σὲ δοξάσαντι φαιδρῶς, δόξα τῷ σὲ στεφανώσαντι, δόξα τῷ ἐνεργοῦντι διὰ σοῦ, πᾶσιν ἰάματα.
ltx/gr_gr_cog/me.m02.d15:meVE.SticStavrotheotokion.greekmelody	@ltx/gr_gr_cog/he.a.m4:heAU.OsGennaionEnMartysi.greekname
ltx/gr_gr_cog/me.m02.d15:meVE.SticStavrotheotokion.incipit	@ltx/gr_gr_cog/me.m02.d11:meVE.AposStavrotheotokion.incipit
ltx/gr_gr_cog/me.m02.d15:meVE.SticStavrotheotokion.melody	@ltx/gr_gr_cog/he.a.m4:heAU.OsGennaionEnMartysi.name
ltx/gr_gr_cog/me.m02.d15:meVE.SticStavrotheotokion.mode	@ltx/gr_gr_cog/miscellanea:misc.Mode4
ltx/gr_gr_cog/me.m02.d15:meVE.SticStavrotheotokion.text	@ltx/gr_gr_cog/me.m02.d11:meVE.AposStavrotheotokion.text
ltx/gr_gr_cog/me.m02.d15:meVE.SticTheotokion.greekmelody	@ltx/gr_gr_cog/he.a.m4:heAU.OsGennaionEnMartysi.greekname
ltx/gr_gr_cog/me.m02.d15:meVE.SticTheotokion.incipit	Κατακρίσεως λύτρωσαι, Παναγία Θεόνυμφε, καὶ…
ltx/gr_gr_cog/me.m02.d15:meVE.SticTheotokion.melody	@ltx/gr_gr_cog/he.a.m4:heAU.OsGennaionEnMartysi.name
ltx/gr_gr_cog/me.m02.d15:meVE.SticTheotokion.mode	@ltx/gr_gr_cog/miscellanea:misc.Mode4
ltx/gr_gr_cog/me.m02.d15:meVE.SticTheotokion.text	Κατακρίσεως λύτρωσαι, Παναγία Θεόνυμφε, καὶ δεινῶν πταισμάτων τὴν ταπεινήν μου ψυχήν, καὶ τοῦ θανάτου ἀπάλλαξον, εὐχαῖς σου καὶ δώρησαι, δικαιώσεως τυχεῖν, ἐν ἡμέρᾳ ἐτάσεως, ἧς ἐπέτυχον, τῶν Ἁγίων οἱ δῆμοι μετανοίᾳ, καθαρθέντα με πρὸ τέλους, καὶ τῶν δακρύων ταῖς χύσεσιν.
ltx/gr_gr_cog/me.m02.d15:meVE.Stichera01.greekmelody	@ltx/gr_gr_cog/he.a.m4:heAU.OsGennaionEnMartysi.greekname
ltx/gr_gr_cog/me.m02.d15:meVE.Stichera01.incipit	Ποταμοῦ τὰ ὁρμήματα, τοῦ τῆς…
ltx/gr_gr_cog/me.m02.d15:meVE.Stichera01.melody	@ltx/gr_gr_cog/he.a.m4:heAU.OsGennaionEnMartysi.name
ltx/gr_gr_cog/me.m02.d15:meVE.Stichera01.mode	@ltx/gr_gr_cog/miscellanea:misc.Mode4
ltx/gr_gr_cog/me.m02.d15:meVE.Stichera01.text	Ποταμοῦ τὰ ὁρμήματα, τοῦ τῆς χάριτος Κήρυκος, ὡς Θεοῦ φανέντα σε πόλιν ἔμψυχον, διαφερόντως εὐφραίνουσι, τὰ ἄῤῥητα ῥήματα, ἐπὶ γῆς τοῦ τῆς τρυφῆς, Παραδείσου πλουτήσαντος· οὗ καὶ γέγονας, δραστικὸς ὑπηρέτης ἐκμανθάνων τὰ οὐράνια παμμάκαρ, ἃ οὐκ ἐξὸν βροτοῖς φθέγξασθαι.
ltx/gr_gr_cog/me.m02.d15:meVE.Stichera02.incipit	Τὸ τῆς γνώμης ἐλεύθερον, καὶ…
ltx/gr_gr_cog/me.m02.d15:meVE.Stichera02.melody	@ltx/gr_gr_cog/he.a.m4:heAU.OsGennaionEnMartysi.name
ltx/gr_gr_cog/me.m02.d15:meVE.Stichera02.mode	@ltx/gr_gr_cog/miscellanea:misc.Mode4
ltx/gr_gr_cog/me.m02.d15:meVE.Stichera02.text	Τὸ τῆς γνώμης ἐλεύθερον, καὶ ψυχῆς αὐτεξούσιον, εὐγενείᾳ πίστεως κατελάμπρυνας· τῆς ἐπιγείου δὲ πάνσοφε, δουλείας ἀπήλλαξαι, καὶ τῇ ζεύγλῃ τοῦ Χριστοῦ, τὸν αὐχένα ὑπέκλινας· ὅθεν ἔδραμες, νοητῆς ἐκ δουλείας τοὺς ἀνθρώπους, ἀπαλλάττων καὶ προσάγων, ἐλευθερίᾳ τῆς χάριτος.
ltx/gr_gr_cog/me.m02.d15:meVE.Stichera03.incipit	Ὡς ἀκτῖνά σε πάνσοφε, φεγγοβόλον…
ltx/gr_gr_cog/me.m02.d15:meVE.Stichera03.melody	@ltx/gr_gr_cog/he.a.m4:heAU.OsGennaionEnMartysi.name
ltx/gr_gr_cog/me.m02.d15:meVE.Stichera03.mode	@ltx/gr_gr_cog/miscellanea:misc.Mode4
ltx/gr_gr_cog/me.m02.d15:meVE.Stichera03.text	Ὡς ἀκτῖνά σε πάνσοφε, φεγγοβόλον ἐξήστραψεν, ὁ τοῦ κόσμου Ἥλιος καὶ Διδάσκαλος, τὴν οἰκουμένην λαμπρύνουσαν, φωτὶ τοῦ κηρύγματος, καὶ ταῖς θείαις ἀστραπαῖς, τὴν τῆς πλάνης σκοτόμαιναν, ἀφανίζουσαν, καὶ ποικίλων θαυμάτων ἐνεργείας, τῶν πιστῶν τὰς διανοίας, καταφαιδρύνουσαν ἔνδοξε.
