ltx/gr_gr_cog/ho.ho13:hoSC.Key0200.title	ΕΥΧΗ
ltx/gr_gr_cog/ho.ho13:hoSC.Key0201.text	Ἅγιε Ἄγγελε, ὁ ἐφεστὼς τῆς ἀθλίας μου ψυχῆς καὶ ταλαιπώρου μου ζωῆς, μὴ ἐγκαταλίπῃς με τὸν ἁμαρτωλόν, μηδὲ ἀποστῇς ἀπʼ ἐμοῦ διὰ τὴν ἀκρασίαν μου· μὴ δώῃς χώραν τῷ πονηρῷ δαίμονι κατακυριεῦσαί μου τῇ καταδυναστείᾳ τοῦ θνητοῦ τούτου σώματος· κράτησαν τῆς ἀθλίας καὶ παρειμένης χειρός μου, καὶ ὁδήγησόν με εἰς ὁδὸν σωτηρίας. Ναί, ἅγιε Ἄγγελε τοῦ Θεοῦ, ὁ φύλαξ καὶ σκεπαστῆς τῆς ἀθλίας μου ψυχῆς καὶ τοῦ σώματος, πάντα μοι συγχώρησον, ὅσα σοι ἔθλιψα πάσας τὰς ἡμέρας τῆς ζωῆς μου, καὶ εἴ τι ἥμαρτον τὴν σήμερον ἡμέραν· σκέπασόν με ἐν τῇ παρούςῃ νυκτὶ καὶ διαφύλαξόν με ἀπὸ πάσης ἐπηρείας τοῦ ἀντικειμένου, ἵνα μὴ ἔν τινι ἁμαρτήματι παροργίσω τὸν Θεόν· καὶ πρέσβευε ὑπὲρ ἐμοῦ πρὸς τὸν Κύριον τοῦ ἐπιστηρίξαι με ἐν τῷ φόβῳ αὐτοῦ καὶ ἄξιον ἀναδεῖξαί με δοῦλον τῆς αὐτοῦ ἀγαθότητος. Ἀμήν.
ltx/gr_gr_cog/ho.ho13:hoSC.Key0201.title	Εἰς τὸ Ἄγγελον φύλακα τῆς τοῦ ἀνθρώπου ζωῆς.
ltx/gr_gr_cog/ho.ho13:hoSC.Key0202.text	@ltx/gr_gr_cog/oc.m8.d1:ocMA.Kathisma23.text
ltx/gr_gr_cog/ho.ho13:hoSC.Key0203.text	@ltx/gr_gr_cog/ho.ho10:hoVE.LentApolytikion1.text
ltx/gr_gr_cog/ho.ho13:hoSC.R101	Ἀνάγνωσις τῶν Χαιρετισμῶν τῆς Θεοτόκου ἢ κανώνος (τοῦ Μηναίου) μπορεῖ νὰ γίνεται ἐδώ.
ltx/gr_gr_cog/ho.ho13:hoSC.R201	Ἀναγινώσκονται ἡ Ὑπακοὴ καὶ Κοντάκια τῆς ἡμέρας.
ltx/gr_gr_cog/ho.ho13:hoSC.VerseBeforePrayerToTheotokos.text	Καὶ σῶσον ἡμᾶς, Παναγία Παρθένε.
ltx/gr_gr_cog/ho.ho13:hoSC.title	ΑΠΟΔΕΙΠΝΟΝ ΜΙΚΡΟΝ
ltx/gr_gr_cog/ho.ho13:hoSC.title1	Ἀπόδειπνον Μικρόν
