ltx/gr_gr_cog/me.m03.d17:meDA.commemoration.first	Μνήμη τοῦ Ἁγίου Ἀλεξίου τοῦ ἀνθρώπου τοῦ Θεοῦ
ltx/gr_gr_cog/me.m03.d17:meDA.commemoration.first_name	Ἅγιος Ἀλέξιος
ltx/gr_gr_cog/me.m03.d17:meDA.commemoration.first_short	Μνήμη τοῦ Ἁγίου Ἀλεξίου τοῦ ἀνθρώπου τοῦ Θεοῦ
ltx/gr_gr_cog/me.m03.d17:meDA.commemoration.first_title	@ltx/gr_gr_cog/titles:ti.SaintM
ltx/gr_gr_cog/me.m03.d17:meDA.commemoration.full	Μνήμη τοῦ Ἁγίου Ἀλεξίου τοῦ ἀνθρώπου τοῦ Θεοῦ
ltx/gr_gr_cog/me.m03.d17:meDA.commemoration.second_name	
ltx/gr_gr_cog/me.m03.d17:meDA.commemoration.second_title	
ltx/gr_gr_cog/me.m03.d17:meDA.date	Τῌ ΙΖʹ ΜΑΡΤΙΟΥ
ltx/gr_gr_cog/me.m03.d17:meDA.fordate	διὰ τὴν 17ην Μαρτίου
ltx/gr_gr_cog/me.m03.d17:meDA.insert1	καὶ τοῦ Ἁγίου Ἀλεξίου τοῦ ἀνθρώπου τοῦ Θεοῦ,
ltx/gr_gr_cog/me.m03.d17:meDA.insert2	οὗ καὶ τὴν μνήμην ἐπιτελοῦμεν·
ltx/gr_gr_cog/me.m03.d17:meDA.note	
ltx/gr_gr_cog/me.m03.d17:meDA.pdfcoverdate	τῆς 17ης Μαρτίου,
ltx/gr_gr_cog/me.m03.d17:meDA.pdfheaderdate	τῆς 17ης Μαρτίου
ltx/gr_gr_cog/me.m03.d17:meHO.commemorations	
ltx/gr_gr_cog/me.m03.d17:meHO.note1	
ltx/gr_gr_cog/me.m03.d17:meHO.note2	
ltx/gr_gr_cog/me.m03.d17:meHO.number	
ltx/gr_gr_cog/me.m03.d17:meHO.rank	
ltx/gr_gr_cog/me.m03.d17:meLE.commemoration1	Μνήμη τοῦ Ἁγίου Ἀλεξίου τοῦ ἀνθρώπου τοῦ Θεοῦ.
ltx/gr_gr_cog/me.m03.d17:meLE.commemoration2	
ltx/gr_gr_cog/me.m03.d17:meLI.Kontakion1.greekmelody	@ltx/gr_gr_cog/me.m03.d17:meMA.Kontakion1.greekmelody
ltx/gr_gr_cog/me.m03.d17:meLI.Kontakion1.incipit	@ltx/gr_gr_cog/me.m03.d17:meMA.Kontakion1.incipit
ltx/gr_gr_cog/me.m03.d17:meLI.Kontakion1.melody	@ltx/gr_gr_cog/me.m03.d17:meMA.Kontakion1.melody
ltx/gr_gr_cog/me.m03.d17:meLI.Kontakion1.mode	@ltx/gr_gr_cog/me.m03.d17:meMA.Kontakion1.mode
ltx/gr_gr_cog/me.m03.d17:meLI.Kontakion1.text	@ltx/gr_gr_cog/me.m03.d17:meMA.Kontakion1.text
ltx/gr_gr_cog/me.m03.d17:meLI.Megalynarion.text	Ἐπιθυμιῶν τῶν πνευματικῶν, ἀνὴρ χρηματίσας, ἐξενώθης τῶν γεηρῶν, καὶ σεμνῶς βιώσας, Θεοῦ ἄνθρωπος ὤφθης, καὶ κλήσει τε καὶ πράξει, μάκαρ Ἀλέξιε.
ltx/gr_gr_cog/me.m03.d17:meMA.C1.acrostic.notice1	οὗ ἡ Ἀκροστιχίς·
ltx/gr_gr_cog/me.m03.d17:meMA.C1.acrostic.text	Σὲ τὸν Θεοῦ Ἄνθρωπον αἰνέσω μάκαρ. Ἰωσήφ.
ltx/gr_gr_cog/me.m03.d17:meMA.C1.acrostic.title	Ο Κανών,
ltx/gr_gr_cog/me.m03.d17:meMA.C1.title	@ltx/gr_gr_cog/titles:ti.CanonSaintM
ltx/gr_gr_cog/me.m03.d17:meMA.C1.verse	@ltx/gr_gr_cog/prayers:pr.verse_SaintM.text
ltx/gr_gr_cog/me.m03.d17:meMA.ExapTheotokion.incipit	@ltx/gr_gr_cog/ho.ho23:hoCA.Exaposteilarion4.incipit
ltx/gr_gr_cog/me.m03.d17:meMA.ExapTheotokion.melody	@ltx/gr_gr_cog/he.a.m3:heAU.OOuranonToisAstrois.name
ltx/gr_gr_cog/me.m03.d17:meMA.ExapTheotokion.mode	@ltx/gr_gr_cog/miscellanea:misc.Mode3
ltx/gr_gr_cog/me.m03.d17:meMA.ExapTheotokion.text	@ltx/gr_gr_cog/ho.ho23:hoCA.Exaposteilarion4.text
ltx/gr_gr_cog/me.m03.d17:meMA.Exaposteilarion1.greekmelody	@ltx/gr_gr_cog/he.a.m3:heAU.OOuranonToisAstrois.greekname
ltx/gr_gr_cog/me.m03.d17:meMA.Exaposteilarion1.incipit	Ὦ θαῦμα! πῶς ἐν πυλῶσι…
ltx/gr_gr_cog/me.m03.d17:meMA.Exaposteilarion1.melody	@ltx/gr_gr_cog/he.a.m3:heAU.OOuranonToisAstrois.name
ltx/gr_gr_cog/me.m03.d17:meMA.Exaposteilarion1.mode	@ltx/gr_gr_cog/miscellanea:misc.Mode3
ltx/gr_gr_cog/me.m03.d17:meMA.Exaposteilarion1.text	Ὦ θαῦμα! πῶς ἐν πυλῶσι, τῶν γεννητόρων χρονίως, ὥς τις ἀδάμας ὑπέστης, φύσεως βίᾳ μὴ καμφθείς, Γονέων τε καὶ συζύγου, Ἀλέξιε πικροῖς θρήνοις.
ltx/gr_gr_cog/me.m03.d17:meMA.Kontakion1.greekmelody	@ltx/gr_gr_cog/he.a.m4:heAU.EpefanisSimeron.greekname
ltx/gr_gr_cog/me.m03.d17:meMA.Kontakion1.incipit	Ἀλεξίου σήμερον τοῦ πανολβίου, ἑορτὴν…
ltx/gr_gr_cog/me.m03.d17:meMA.Kontakion1.melody	@ltx/gr_gr_cog/he.a.m4:heAU.EpefanisSimeron.name
ltx/gr_gr_cog/me.m03.d17:meMA.Kontakion1.mode	@ltx/gr_gr_cog/miscellanea:misc.Mode4
ltx/gr_gr_cog/me.m03.d17:meMA.Kontakion1.text	Ἀλεξίου σήμερον τοῦ πανολβίου, ἑορτὴν τὴν πάνσεπτον, ἐπιτελοῦντες εὐσεβῶς, αὐτὸν ὑμνήσωμεν λέγοντες· χαίροις Ὁσίων τερπνὸν ἐγκαλλώπισμα.
ltx/gr_gr_cog/me.m03.d17:meMA.Ode1C11.greekmelody	@ltx/gr_gr_cog/he.h.m2:heHE.EnVythoKatestrose.greekname
ltx/gr_gr_cog/me.m03.d17:meMA.Ode1C11.incipit	Στενοτάτην ὥδευσας ὁδόν, ἄμεμπτον καὶ…
ltx/gr_gr_cog/me.m03.d17:meMA.Ode1C11.melody	@ltx/gr_gr_cog/he.h.m2:heHE.EnVythoKatestrose.name
ltx/gr_gr_cog/me.m03.d17:meMA.Ode1C11.mode	@ltx/gr_gr_cog/miscellanea:misc.Mode2
ltx/gr_gr_cog/me.m03.d17:meMA.Ode1C11.ode	@ltx/gr_gr_cog/miscellanea:misc.Ode1
ltx/gr_gr_cog/me.m03.d17:meMA.Ode1C11.text	Στενοτάτην ὥδευσας ὁδόν, ἄμεμπτον καὶ ὅσιον, βίον Σοφὲ μετελθὼν ἐκ νεότητος· διό μου τὴν στένωσιν καταπλάτυνον, τοῦ νοὸς εὐφημῆσαί σε, τὸν πρὸς Παραδείσου, πλάτος αὐλιζόμενον Ἀλέξιε.
ltx/gr_gr_cog/me.m03.d17:meMA.Ode1C12.incipit	Ἑαυτὸν διόλου τῷ Θεῷ, Μάκαρ…
ltx/gr_gr_cog/me.m03.d17:meMA.Ode1C12.melody	@ltx/gr_gr_cog/he.h.m2:heHE.EnVythoKatestrose.name
ltx/gr_gr_cog/me.m03.d17:meMA.Ode1C12.mode	@ltx/gr_gr_cog/miscellanea:misc.Mode2
ltx/gr_gr_cog/me.m03.d17:meMA.Ode1C12.ode	@ltx/gr_gr_cog/miscellanea:misc.Ode1
ltx/gr_gr_cog/me.m03.d17:meMA.Ode1C12.text	Ἑαυτὸν διόλου τῷ Θεῷ, Μάκαρ ἀναθέμενος, ἔξω Σαρκὸς καὶ κόσμου ἐχρημάτισας, πλούτου διαῤῥέοντος, τὸν οὐράνιον προτιμήσας καὶ μένοντα, καὶ ἐνεγκαμένης, πόλιν τὴν Σιὼν τὴν αἰωνίζουσαν.
ltx/gr_gr_cog/me.m03.d17:meMA.Ode1C13.incipit	Τῆς νηδύος σὺ τῆς μητρικῆς…
ltx/gr_gr_cog/me.m03.d17:meMA.Ode1C13.melody	@ltx/gr_gr_cog/he.h.m2:heHE.EnVythoKatestrose.name
ltx/gr_gr_cog/me.m03.d17:meMA.Ode1C13.mode	@ltx/gr_gr_cog/miscellanea:misc.Mode2
ltx/gr_gr_cog/me.m03.d17:meMA.Ode1C13.ode	@ltx/gr_gr_cog/miscellanea:misc.Ode1
ltx/gr_gr_cog/me.m03.d17:meMA.Ode1C13.text	Τῆς νηδύος σὺ τῆς μητρικῆς, στείρωσιν διέλυσας, ἀποτεχθεὶς ὡς Σαμουὴλ Πανόλβιε, ἐν γαστρὶ καρδίας δέ, τὸν ἁγνότατον συλλαβὼν φόβον ἔτεκες, πνεῦμα σωτηρίας, θείαις ἀρεταῖς διὰ τῆς πίστεως.
ltx/gr_gr_cog/me.m03.d17:meMA.Ode1C1H.greekmelody	@ltx/gr_gr_cog/he.h.m2:heHE.EnVythoKatestrose.greekname
ltx/gr_gr_cog/me.m03.d17:meMA.Ode1C1H.incipit	@ltx/gr_gr_cog/he.h.m2:heHE.EnVythoKatestrose.incipit
ltx/gr_gr_cog/me.m03.d17:meMA.Ode1C1H.melody	@ltx/gr_gr_cog/he.h.m2:heHE.EnVythoKatestrose.melody
ltx/gr_gr_cog/me.m03.d17:meMA.Ode1C1H.mode	@ltx/gr_gr_cog/miscellanea:misc.Mode2
ltx/gr_gr_cog/me.m03.d17:meMA.Ode1C1H.ode	@ltx/gr_gr_cog/miscellanea:misc.Ode1
ltx/gr_gr_cog/me.m03.d17:meMA.Ode1C1H.text	@ltx/gr_gr_cog/he.h.m2:heHE.EnVythoKatestrose.text
ltx/gr_gr_cog/me.m03.d17:meMA.Ode1C1T.incipit	Ὁ Θεοῦ συνάναρχος Υἱός, ἔσχεν…
ltx/gr_gr_cog/me.m03.d17:meMA.Ode1C1T.melody	@ltx/gr_gr_cog/he.h.m2:heHE.EnVythoKatestrose.name
ltx/gr_gr_cog/me.m03.d17:meMA.Ode1C1T.mode	@ltx/gr_gr_cog/miscellanea:misc.Mode2
ltx/gr_gr_cog/me.m03.d17:meMA.Ode1C1T.ode	@ltx/gr_gr_cog/miscellanea:misc.Ode1
ltx/gr_gr_cog/me.m03.d17:meMA.Ode1C1T.text	Ὁ Θεοῦ συνάναρχος Υἱός, ἔσχεν ὡς αἰτίαν σε, τῆς πρὸς ἡμᾶς Παρθένε ὁμοιώσεως, μόνην ὑπὲρ πᾶσαν, κτίσιν ἄχραντε καθαράν σε εὑράμενος· ὅθεν σε ὑμνοῦμεν, πᾶσαι γενεαὶ καὶ μακαρίζομεν.
ltx/gr_gr_cog/me.m03.d17:meMA.Ode3C11.greekmelody	@ltx/gr_gr_cog/he.h.m2:heHE.ExinthisenIErimos.greekname
ltx/gr_gr_cog/me.m03.d17:meMA.Ode3C11.incipit	Νυττόμενος τῷ ἔρωτι, τῆς ἁγνείας…
ltx/gr_gr_cog/me.m03.d17:meMA.Ode3C11.melody	@ltx/gr_gr_cog/he.h.m2:heHE.ExinthisenIErimos.name
ltx/gr_gr_cog/me.m03.d17:meMA.Ode3C11.mode	@ltx/gr_gr_cog/miscellanea:misc.Mode2
ltx/gr_gr_cog/me.m03.d17:meMA.Ode3C11.ode	@ltx/gr_gr_cog/miscellanea:misc.Ode3
ltx/gr_gr_cog/me.m03.d17:meMA.Ode3C11.text	Νυττόμενος τῷ ἔρωτι, τῆς ἁγνείας θάλαμον, τοῦ ἐπὶ γῆς οὐράνιον, ἀντηλλάξω καὶ γυναικὸς ἡδονῆς, τὴν ἡδίστην Ἀγγέλων ἐξομοίωσιν.
ltx/gr_gr_cog/me.m03.d17:meMA.Ode3C12.incipit	Θορύβους τοὺς ἐν βίῳ, καὶ…
ltx/gr_gr_cog/me.m03.d17:meMA.Ode3C12.melody	@ltx/gr_gr_cog/he.h.m2:heHE.ExinthisenIErimos.name
ltx/gr_gr_cog/me.m03.d17:meMA.Ode3C12.mode	@ltx/gr_gr_cog/miscellanea:misc.Mode2
ltx/gr_gr_cog/me.m03.d17:meMA.Ode3C12.ode	@ltx/gr_gr_cog/miscellanea:misc.Ode3
ltx/gr_gr_cog/me.m03.d17:meMA.Ode3C12.text	Θορύβους τοὺς ἐν βίῳ, καὶ ὄγκον πλούτου ἔλιπες, καὶ μετανάστης γέγονας, τῆς Πατρίδος Πάτερ Ἀλέξιε, τοῦ Χριστοῦ τὴν πτωχείαν ἐκμιμούμενος.
ltx/gr_gr_cog/me.m03.d17:meMA.Ode3C13.incipit	Ἐν δάκρυσι καὶ πόνοις, καὶ…
ltx/gr_gr_cog/me.m03.d17:meMA.Ode3C13.melody	@ltx/gr_gr_cog/he.h.m2:heHE.ExinthisenIErimos.name
ltx/gr_gr_cog/me.m03.d17:meMA.Ode3C13.mode	@ltx/gr_gr_cog/miscellanea:misc.Mode2
ltx/gr_gr_cog/me.m03.d17:meMA.Ode3C13.ode	@ltx/gr_gr_cog/miscellanea:misc.Ode3
ltx/gr_gr_cog/me.m03.d17:meMA.Ode3C13.text	Ἐν δάκρυσι καὶ πόνοις, καὶ ἐγκρατείᾳ Πάνσοφε, τὸ ἀγαθὸν ἐζήτησας, πότε ἥξει φῶς ἐπιγνώσεως, τὴν ἀπάθειαν νέμον τῇ καρδίᾳ σου.
ltx/gr_gr_cog/me.m03.d17:meMA.Ode3C1H.greekmelody	@ltx/gr_gr_cog/he.h.m2:heHE.ExinthisenIErimos.greekname
ltx/gr_gr_cog/me.m03.d17:meMA.Ode3C1H.incipit	@ltx/gr_gr_cog/he.h.m2:heHE.ExinthisenIErimos.incipit
ltx/gr_gr_cog/me.m03.d17:meMA.Ode3C1H.melody	@ltx/gr_gr_cog/he.h.m2:heHE.ExinthisenIErimos.melody
ltx/gr_gr_cog/me.m03.d17:meMA.Ode3C1H.mode	@ltx/gr_gr_cog/miscellanea:misc.Mode2
ltx/gr_gr_cog/me.m03.d17:meMA.Ode3C1H.ode	@ltx/gr_gr_cog/miscellanea:misc.Ode3
ltx/gr_gr_cog/me.m03.d17:meMA.Ode3C1H.text	@ltx/gr_gr_cog/he.h.m2:heHE.ExinthisenIErimos.text
ltx/gr_gr_cog/me.m03.d17:meMA.Ode3C1T.incipit	Ὁ ἄνω ἀθεώρητος, τοῖς Ἀγγέλοις…
ltx/gr_gr_cog/me.m03.d17:meMA.Ode3C1T.melody	@ltx/gr_gr_cog/he.h.m2:heHE.ExinthisenIErimos.name
ltx/gr_gr_cog/me.m03.d17:meMA.Ode3C1T.mode	@ltx/gr_gr_cog/miscellanea:misc.Mode2
ltx/gr_gr_cog/me.m03.d17:meMA.Ode3C1T.ode	@ltx/gr_gr_cog/miscellanea:misc.Ode3
ltx/gr_gr_cog/me.m03.d17:meMA.Ode3C1T.text	Ὁ ἄνω ἀθεώρητος, τοῖς Ἀγγέλοις Ἄχραντε, κάτω ἐκ σοῦ γενόμενος, καθορᾶται τέλειος ἄνθρωπος, ἀπολλύμενον κόσμον ἀνακτώμενος.
ltx/gr_gr_cog/me.m03.d17:meMA.Ode3Kathisma1.greekmelody	@ltx/gr_gr_cog/he.a.m8:heAU.TinSofianKaiLogon.greekname
ltx/gr_gr_cog/me.m03.d17:meMA.Ode3Kathisma1.incipit	Τοὺς ἱδρῶτας καὶ πόνους τοὺς…
ltx/gr_gr_cog/me.m03.d17:meMA.Ode3Kathisma1.melody	@ltx/gr_gr_cog/he.a.m8:heAU.TinSofianKaiLogon.name
ltx/gr_gr_cog/me.m03.d17:meMA.Ode3Kathisma1.mode	@ltx/gr_gr_cog/miscellanea:misc.Mode8
ltx/gr_gr_cog/me.m03.d17:meMA.Ode3Kathisma1.text	Τοὺς ἱδρῶτας καὶ πόνους τοὺς σοὺς Σοφέ, νοερῶς θεωροῦντες πάντες πιστοί, πάσης κατανύξεως τὰς ψυχὰς ἐμπιπλάμεθα, καὶ πρὸς θείους ὕμνους καὶ δόξαν καὶ αἴνεσιν, τοῦ Δεσπότου τῶν ὅλων, παμμάκαρ Ἀλέξιε, πόθῳ ἐγκαρδίῳ, ἑαυτοὺς συγκινοῦμεν, ᾠδαῖς σε γεραίροντες, καὶ πιστῶς ἐκβοῶντές σοι, ὡς Κυρίου θεράποντι· Πρέσβευε Χριστῷ τῷ Θεῷ, τῶν πταισμάτων ἄφεσιν δωρήσασθαι, τοῖς ἑορτάζουσι πόθῳ, τὴν ἁγίαν μνήμην σου.
ltx/gr_gr_cog/me.m03.d17:meMA.Ode3Kathisma2.greekmelody	@ltx/gr_gr_cog/he.a.m3:heAU.TinOraiotita.greekname
ltx/gr_gr_cog/me.m03.d17:meMA.Ode3Kathisma2.incipit	Κόσμου τερπνότητα ὁσίως ἔλιπες, ἀνταλλαξάμενος…
ltx/gr_gr_cog/me.m03.d17:meMA.Ode3Kathisma2.melody	@ltx/gr_gr_cog/he.a.m3:heAU.TinOraiotita.name
ltx/gr_gr_cog/me.m03.d17:meMA.Ode3Kathisma2.mode	@ltx/gr_gr_cog/miscellanea:misc.Mode3
ltx/gr_gr_cog/me.m03.d17:meMA.Ode3Kathisma2.text	Κόσμου τερπνότητα ὁσίως ἔλιπες, ἀνταλλαξάμενος πλούτου τοῦ ῥέοντος, τὸν ἀδιάῤῥευστον σαφῶς, καὶ μένοντα Ἀλέξιε· ὅθεν μετὰ πάντων σε, τῶν Ἁγίων δοξάζομεν, καὶ πανηγυρίζομεν, ἱερῶς ἐν τῇ μνήμῃ σου, αἰτούμενοι εὑρεῖν ταῖς εὐχαῖς σου, Πάτερ τὸ μέγα ἔλεος.
ltx/gr_gr_cog/me.m03.d17:meMA.Ode3KathismaSt.incipit	Ἡ σὲ κυήσασα Χριστὲ εἰσβλέψασα…
ltx/gr_gr_cog/me.m03.d17:meMA.Ode3KathismaSt.melody	@ltx/gr_gr_cog/he.a.m3:heAU.TinOraiotita.name
ltx/gr_gr_cog/me.m03.d17:meMA.Ode3KathismaSt.mode	@ltx/gr_gr_cog/miscellanea:misc.Mode3
ltx/gr_gr_cog/me.m03.d17:meMA.Ode3KathismaSt.text	Ἡ σὲ κυήσασα Χριστὲ εἰσβλέψασα, Σταυρῷ ὑψούμενον, ὥσπερ κατάκριτον, θρηνολογοῦσα γοερῶς, τοιαῦτα ἀπεφθέγγετο· Οἴμοι! πῶς σε ἄνομος, δῆμος ὅλως οὐκ ᾤκτειρε, τοῦτον οἰκτειρήσαντα, διὰ πλῆθος ἐλέους σου. Μή με ἐγκαταλίπῃς ἐν Κόσμῳ μόνην, ὁ μόνος ἀναμάρτητος.
ltx/gr_gr_cog/me.m03.d17:meMA.Ode3KathismaT.incipit	Ἀκατανόητον καὶ ἀκατάληπτον, ὑπάρχει Δέσποινα…
ltx/gr_gr_cog/me.m03.d17:meMA.Ode3KathismaT.melody	@ltx/gr_gr_cog/he.a.m3:heAU.TinOraiotita.name
ltx/gr_gr_cog/me.m03.d17:meMA.Ode3KathismaT.mode	@ltx/gr_gr_cog/miscellanea:misc.Mode3
ltx/gr_gr_cog/me.m03.d17:meMA.Ode3KathismaT.text	Ἀκατανόητον καὶ ἀκατάληπτον, ὑπάρχει Δέσποινα Θεοχαρίτωτε, τὸ πεπραγμένον ἐπὶ σοί, φρικτὸν μέγα μυστήριον· τὸν γὰρ ἀπερίληπτον, συλλαβοῦσα ἐκύησας, σάρκα περιθέμενον, ἐξ ἀχράντων αἱμάτων σου, ὃν πάντοτε Ἁγνὴ ἐκδυσώπει, ὡς Υἱόν σου, τοῦ σῶσαι τὰς ψυχὰς ἡμῶν.
ltx/gr_gr_cog/me.m03.d17:meMA.Ode4C11.greekmelody	@ltx/gr_gr_cog/he.h.m2:heHE.ElilythasEkParthenou.greekname
ltx/gr_gr_cog/me.m03.d17:meMA.Ode4C11.incipit	Ὑπέμεινας, τὴν πτωχείαν προσαίτης γενόμενος…
ltx/gr_gr_cog/me.m03.d17:meMA.Ode4C11.melody	@ltx/gr_gr_cog/he.h.m2:heHE.ElilythasEkParthenou.name
ltx/gr_gr_cog/me.m03.d17:meMA.Ode4C11.mode	@ltx/gr_gr_cog/miscellanea:misc.Mode2
ltx/gr_gr_cog/me.m03.d17:meMA.Ode4C11.ode	@ltx/gr_gr_cog/miscellanea:misc.Ode4
ltx/gr_gr_cog/me.m03.d17:meMA.Ode4C11.text	Ὑπέμεινας, τὴν πτωχείαν προσαίτης γενόμενος, πτωχὸς ὥσπερ Λάζαρος· ἔρως γὰρ θεῖος ἠρέθιζε, Μάκαρ τὴν καρδίαν σου, ἐπιποθοῦσαν τὸν πλοῦτον τὸν οὐράνιον.
ltx/gr_gr_cog/me.m03.d17:meMA.Ode4C12.incipit	Ἀπέριττον, καὶ ἀπράγμονα βίον ἐπόθησας…
ltx/gr_gr_cog/me.m03.d17:meMA.Ode4C12.melody	@ltx/gr_gr_cog/he.h.m2:heHE.ElilythasEkParthenou.name
ltx/gr_gr_cog/me.m03.d17:meMA.Ode4C12.mode	@ltx/gr_gr_cog/miscellanea:misc.Mode2
ltx/gr_gr_cog/me.m03.d17:meMA.Ode4C12.ode	@ltx/gr_gr_cog/miscellanea:misc.Ode4
ltx/gr_gr_cog/me.m03.d17:meMA.Ode4C12.text	Ἀπέριττον, καὶ ἀπράγμονα βίον ἐπόθησας, ἅπαξ σιτιζόμενος, τῆς ἑβδομάδος Ἀλέξιε, πόθῳ τῆς μενούσης σε, ἀδιαῤῥεύστου παμμάκαρ ἀπολαύσεως.
ltx/gr_gr_cog/me.m03.d17:meMA.Ode4C13.incipit	Ναὸν Θεοῦ, τὴν καρδίαν ζητῶν…
ltx/gr_gr_cog/me.m03.d17:meMA.Ode4C13.melody	@ltx/gr_gr_cog/he.h.m2:heHE.ElilythasEkParthenou.name
ltx/gr_gr_cog/me.m03.d17:meMA.Ode4C13.mode	@ltx/gr_gr_cog/miscellanea:misc.Mode2
ltx/gr_gr_cog/me.m03.d17:meMA.Ode4C13.ode	@ltx/gr_gr_cog/miscellanea:misc.Ode4
ltx/gr_gr_cog/me.m03.d17:meMA.Ode4C13.text	Ναὸν Θεοῦ, τὴν καρδίαν ζητῶν ἀπεργάσασθαι, ἐν οἴκῳ ἠγάπησας, τῆς Θεομήτορος Ἔνδοξε, πάντοτε καθέζεσθαι, καὶ τὰ οὐράνια κάλλη ἐνοπτρίζεσθαι.
ltx/gr_gr_cog/me.m03.d17:meMA.Ode4C1H.greekmelody	@ltx/gr_gr_cog/he.h.m2:heHE.ElilythasEkParthenou.greekname
ltx/gr_gr_cog/me.m03.d17:meMA.Ode4C1H.incipit	@ltx/gr_gr_cog/he.h.m2:heHE.ElilythasEkParthenou.incipit
ltx/gr_gr_cog/me.m03.d17:meMA.Ode4C1H.melody	@ltx/gr_gr_cog/he.h.m2:heHE.ElilythasEkParthenou.melody
ltx/gr_gr_cog/me.m03.d17:meMA.Ode4C1H.mode	@ltx/gr_gr_cog/miscellanea:misc.Mode2
ltx/gr_gr_cog/me.m03.d17:meMA.Ode4C1H.ode	@ltx/gr_gr_cog/miscellanea:misc.Ode4
ltx/gr_gr_cog/me.m03.d17:meMA.Ode4C1H.text	@ltx/gr_gr_cog/he.h.m2:heHE.ElilythasEkParthenou.text
ltx/gr_gr_cog/me.m03.d17:meMA.Ode4C1T.incipit	Θηλάσασα, τὸν Δοτῆρα Παρθένε τοῦ…
ltx/gr_gr_cog/me.m03.d17:meMA.Ode4C1T.melody	@ltx/gr_gr_cog/he.h.m2:heHE.ElilythasEkParthenou.name
ltx/gr_gr_cog/me.m03.d17:meMA.Ode4C1T.mode	@ltx/gr_gr_cog/miscellanea:misc.Mode2
ltx/gr_gr_cog/me.m03.d17:meMA.Ode4C1T.ode	@ltx/gr_gr_cog/miscellanea:misc.Ode4
ltx/gr_gr_cog/me.m03.d17:meMA.Ode4C1T.text	Θηλάσασα, τὸν Δοτῆρα Παρθένε τοῦ γάλακτος, πεινῶσαν καὶ στένουσαν, νῦν τὴν καρδίαν μου κόρεσον, πάσης ἐπιγνώσεως, καὶ κατανύξεως θείας ἱκετεύω σε.
ltx/gr_gr_cog/me.m03.d17:meMA.Ode5C11.greekmelody	@ltx/gr_gr_cog/he.h.m2:heHE.MesitisTheou.greekname
ltx/gr_gr_cog/me.m03.d17:meMA.Ode5C11.incipit	Ῥοαῖς ἱερῶν, καταρδεύων πάντοτε δακρύων…
ltx/gr_gr_cog/me.m03.d17:meMA.Ode5C11.melody	@ltx/gr_gr_cog/he.h.m2:heHE.MesitisTheou.name
ltx/gr_gr_cog/me.m03.d17:meMA.Ode5C11.mode	@ltx/gr_gr_cog/miscellanea:misc.Mode2
ltx/gr_gr_cog/me.m03.d17:meMA.Ode5C11.ode	@ltx/gr_gr_cog/miscellanea:misc.Ode5
ltx/gr_gr_cog/me.m03.d17:meMA.Ode5C11.text	Ῥοαῖς ἱερῶν, καταρδεύων πάντοτε δακρύων σου, ψυχὴν ἐγεώργησας, στάχυν ἀληθῶς ἑκατοστεύοντα, γεωργῷ ἀθανάτῳ, καλῶς διατηρούμενον.
ltx/gr_gr_cog/me.m03.d17:meMA.Ode5C12.incipit	Ὡράθης ἐν γῇ, πολιτείαν ἄσαρκον…
ltx/gr_gr_cog/me.m03.d17:meMA.Ode5C12.melody	@ltx/gr_gr_cog/he.h.m2:heHE.MesitisTheou.name
ltx/gr_gr_cog/me.m03.d17:meMA.Ode5C12.mode	@ltx/gr_gr_cog/miscellanea:misc.Mode2
ltx/gr_gr_cog/me.m03.d17:meMA.Ode5C12.ode	@ltx/gr_gr_cog/miscellanea:misc.Ode5
ltx/gr_gr_cog/me.m03.d17:meMA.Ode5C12.text	Ὡράθης ἐν γῇ, πολιτείαν ἄσαρκον μιμούμενος, τῇ ὑπερβαλλούσῃ σου, Πάτερ ἐγκρατείᾳ ἀξιάγαστε, καὶ εὐχῆς προσεδρίᾳ, διʼ ἧς φῶς ἐχρημάτισας.
ltx/gr_gr_cog/me.m03.d17:meMA.Ode5C13.incipit	Πυρὶ προσευχῶν, ἁμαρτίας ἔφλεξας τὴν…
ltx/gr_gr_cog/me.m03.d17:meMA.Ode5C13.melody	@ltx/gr_gr_cog/he.h.m2:heHE.MesitisTheou.name
ltx/gr_gr_cog/me.m03.d17:meMA.Ode5C13.mode	@ltx/gr_gr_cog/miscellanea:misc.Mode2
ltx/gr_gr_cog/me.m03.d17:meMA.Ode5C13.ode	@ltx/gr_gr_cog/miscellanea:misc.Ode5
ltx/gr_gr_cog/me.m03.d17:meMA.Ode5C13.text	Πυρὶ προσευχῶν, ἁμαρτίας ἔφλεξας τὴν ὕλην Σοφέ, ἀγρύπνοις δὲ στάσεσι, πᾶσαν ἡδυπάθειαν ἐκοίμισας, κοιμηθεὶς δὲ πρὸς φέγγος, μετέβης τὸ ἀνέσπερον.
ltx/gr_gr_cog/me.m03.d17:meMA.Ode5C1H.greekmelody	@ltx/gr_gr_cog/he.h.m2:heHE.MesitisTheou.greekname
ltx/gr_gr_cog/me.m03.d17:meMA.Ode5C1H.incipit	@ltx/gr_gr_cog/he.h.m2:heHE.MesitisTheou.incipit
ltx/gr_gr_cog/me.m03.d17:meMA.Ode5C1H.melody	@ltx/gr_gr_cog/he.h.m2:heHE.MesitisTheou.melody
ltx/gr_gr_cog/me.m03.d17:meMA.Ode5C1H.mode	@ltx/gr_gr_cog/miscellanea:misc.Mode2
ltx/gr_gr_cog/me.m03.d17:meMA.Ode5C1H.ode	@ltx/gr_gr_cog/miscellanea:misc.Ode5
ltx/gr_gr_cog/me.m03.d17:meMA.Ode5C1H.text	@ltx/gr_gr_cog/he.h.m2:heHE.MesitisTheou.text
ltx/gr_gr_cog/me.m03.d17:meMA.Ode5C1T.incipit	Ὁ φῶς κατοικῶν, τὴν ἁγίαν…
ltx/gr_gr_cog/me.m03.d17:meMA.Ode5C1T.melody	@ltx/gr_gr_cog/he.h.m2:heHE.MesitisTheou.name
ltx/gr_gr_cog/me.m03.d17:meMA.Ode5C1T.mode	@ltx/gr_gr_cog/miscellanea:misc.Mode2
ltx/gr_gr_cog/me.m03.d17:meMA.Ode5C1T.ode	@ltx/gr_gr_cog/miscellanea:misc.Ode5
ltx/gr_gr_cog/me.m03.d17:meMA.Ode5C1T.text	Ὁ φῶς κατοικῶν, τὴν ἁγίαν ᾤκησε νηδύν σου Ἁγνή, κόσμου ἀπολλύμενον, σκότει ἀγνωσίας ἀνακτώμενος, ὃν ἱκέτευε πάντας, φωτίσαι τοὺς ὑμνοῦντάς σε.
ltx/gr_gr_cog/me.m03.d17:meMA.Ode6C11.greekmelody	@ltx/gr_gr_cog/he.h.m2:heHE.EnAvyssoPtaismaton.greekname
ltx/gr_gr_cog/me.m03.d17:meMA.Ode6C11.incipit	Ναὸν ζῶντα Θεοῦ σε γενόμενον…
ltx/gr_gr_cog/me.m03.d17:meMA.Ode6C11.melody	@ltx/gr_gr_cog/he.h.m2:heHE.EnAvyssoPtaismaton.name
ltx/gr_gr_cog/me.m03.d17:meMA.Ode6C11.mode	@ltx/gr_gr_cog/miscellanea:misc.Mode2
ltx/gr_gr_cog/me.m03.d17:meMA.Ode6C11.ode	@ltx/gr_gr_cog/miscellanea:misc.Ode6
ltx/gr_gr_cog/me.m03.d17:meMA.Ode6C11.text	Ναὸν ζῶντα Θεοῦ σε γενόμενον, τοῦ Χριστοῦ τὸ σκήνωμα, ἡ Ἀπειρόγαμος, προσφανεροῖ κρυπτόμενον, καὶ δοξάζει λανθάνειν σπουδάζοντα.
ltx/gr_gr_cog/me.m03.d17:meMA.Ode6C12.incipit	Αἱ εὐχαί σου Θεῷ ὡς…
ltx/gr_gr_cog/me.m03.d17:meMA.Ode6C12.melody	@ltx/gr_gr_cog/he.h.m2:heHE.EnAvyssoPtaismaton.name
ltx/gr_gr_cog/me.m03.d17:meMA.Ode6C12.mode	@ltx/gr_gr_cog/miscellanea:misc.Mode2
ltx/gr_gr_cog/me.m03.d17:meMA.Ode6C12.ode	@ltx/gr_gr_cog/miscellanea:misc.Ode6
ltx/gr_gr_cog/me.m03.d17:meMA.Ode6C12.text	Αἱ εὐχαί σου Θεῷ ὡς θυμίαμα, Μάκαρ προσεδέχθησαν, ἔνθεν τῷ βίῳ σου, τὰ τῶν πιστῶν φρονήματα, εὐωδίασας Πνεύματος χάριτι.
ltx/gr_gr_cog/me.m03.d17:meMA.Ode6C13.incipit	Ἱερᾷ πολιτείᾳ κοσμούμενον, πάλιν ὁ…
ltx/gr_gr_cog/me.m03.d17:meMA.Ode6C13.melody	@ltx/gr_gr_cog/he.h.m2:heHE.EnAvyssoPtaismaton.name
ltx/gr_gr_cog/me.m03.d17:meMA.Ode6C13.mode	@ltx/gr_gr_cog/miscellanea:misc.Mode2
ltx/gr_gr_cog/me.m03.d17:meMA.Ode6C13.ode	@ltx/gr_gr_cog/miscellanea:misc.Ode6
ltx/gr_gr_cog/me.m03.d17:meMA.Ode6C13.text	Ἱερᾷ πολιτείᾳ κοσμούμενον, πάλιν ὁ Χριστὸς μὴ βουλόμενον Ἔνδοξε, σὲ τῇ πατρίδι δίδωσιν, ἀποφεύγοντα δόξαν τὴν πρόσκαιρον.
ltx/gr_gr_cog/me.m03.d17:meMA.Ode6C1H.greekmelody	@ltx/gr_gr_cog/he.h.m2:heHE.EnAvyssoPtaismaton.greekname
ltx/gr_gr_cog/me.m03.d17:meMA.Ode6C1H.incipit	@ltx/gr_gr_cog/he.h.m2:heHE.EnAvyssoPtaismaton.incipit
ltx/gr_gr_cog/me.m03.d17:meMA.Ode6C1H.melody	@ltx/gr_gr_cog/he.h.m2:heHE.EnAvyssoPtaismaton.melody
ltx/gr_gr_cog/me.m03.d17:meMA.Ode6C1H.mode	@ltx/gr_gr_cog/miscellanea:misc.Mode2
ltx/gr_gr_cog/me.m03.d17:meMA.Ode6C1H.ode	@ltx/gr_gr_cog/miscellanea:misc.Ode6
ltx/gr_gr_cog/me.m03.d17:meMA.Ode6C1H.text	@ltx/gr_gr_cog/he.h.m2:heHE.EnAvyssoPtaismaton.text
ltx/gr_gr_cog/me.m03.d17:meMA.Ode6C1T.incipit	Νόμους φύσεως ἄχραντε Δέσποινα, ὁ…
ltx/gr_gr_cog/me.m03.d17:meMA.Ode6C1T.melody	@ltx/gr_gr_cog/he.h.m2:heHE.EnAvyssoPtaismaton.name
ltx/gr_gr_cog/me.m03.d17:meMA.Ode6C1T.mode	@ltx/gr_gr_cog/miscellanea:misc.Mode2
ltx/gr_gr_cog/me.m03.d17:meMA.Ode6C1T.ode	@ltx/gr_gr_cog/miscellanea:misc.Ode6
ltx/gr_gr_cog/me.m03.d17:meMA.Ode6C1T.text	Νόμους φύσεως ἄχραντε Δέσποινα, ὁ δημιουργὸς καινουργήσας τῆς κτίσεως, ἐκ σοῦ ἀῤῥήτως τίκτεται, καὶ θεοί με διʼ ἄμετρον ἔλεος.
ltx/gr_gr_cog/me.m03.d17:meMA.Ode7C11.greekmelody	@ltx/gr_gr_cog/he.h.m2:heHE.AntitheonProstagma.greekname
ltx/gr_gr_cog/me.m03.d17:meMA.Ode7C11.incipit	Ἐπέμενες Ὅσιε τῶν γεννητόρων, πυλῶσι…
ltx/gr_gr_cog/me.m03.d17:meMA.Ode7C11.melody	@ltx/gr_gr_cog/he.h.m2:heHE.AntitheonProstagma.name
ltx/gr_gr_cog/me.m03.d17:meMA.Ode7C11.mode	@ltx/gr_gr_cog/miscellanea:misc.Mode2
ltx/gr_gr_cog/me.m03.d17:meMA.Ode7C11.ode	@ltx/gr_gr_cog/miscellanea:misc.Ode7
ltx/gr_gr_cog/me.m03.d17:meMA.Ode7C11.text	Ἐπέμενες Ὅσιε τῶν γεννητόρων, πυλῶσι καθήμενος, καὶ ὅλως ἀγνοούμενος, καὶ παίδων παροινίαν ὑποδεχόμενος, καὶ καταπαιζόμενος δεινῶς, καὶ ἐν πτωχείᾳ πολλῇ θλιβόμενος.
ltx/gr_gr_cog/me.m03.d17:meMA.Ode7C12.incipit	Σαρκός σου τὸ φρόνημα ἀπονεκρώσας…
ltx/gr_gr_cog/me.m03.d17:meMA.Ode7C12.melody	@ltx/gr_gr_cog/he.h.m2:heHE.AntitheonProstagma.name
ltx/gr_gr_cog/me.m03.d17:meMA.Ode7C12.mode	@ltx/gr_gr_cog/miscellanea:misc.Mode2
ltx/gr_gr_cog/me.m03.d17:meMA.Ode7C12.ode	@ltx/gr_gr_cog/miscellanea:misc.Ode7
ltx/gr_gr_cog/me.m03.d17:meMA.Ode7C12.text	Σαρκός σου τὸ φρόνημα ἀπονεκρώσας, ὁρῶν τοὺς γεννήτορας, καὶ τούτοις ἀγνοούμενος, τῆς φύσεως ἔστεγες τὴν βίαν Ὅσιε, καὶ τὴν ἐξουθένησιν τῶν σῶν, ἀπείρων παίδων ἐπιθλιβόντων σε.
ltx/gr_gr_cog/me.m03.d17:meMA.Ode7C13.incipit	Ὦ θαῦμα! πῶς ἔμεινας ἀεὶ…
ltx/gr_gr_cog/me.m03.d17:meMA.Ode7C13.melody	@ltx/gr_gr_cog/he.h.m2:heHE.AntitheonProstagma.name
ltx/gr_gr_cog/me.m03.d17:meMA.Ode7C13.mode	@ltx/gr_gr_cog/miscellanea:misc.Mode2
ltx/gr_gr_cog/me.m03.d17:meMA.Ode7C13.ode	@ltx/gr_gr_cog/miscellanea:misc.Ode7
ltx/gr_gr_cog/me.m03.d17:meMA.Ode7C13.text	Ὦ θαῦμα! πῶς ἔμεινας ἀεὶ πτωχεύων, ἐν πλούτῳ Ἀλέξιε, ἀπείρου ταπεινώσεως! πῶς ἤνεγκας παίζεσθαι καὶ ὀνειδίζεσθαι, ὑπὸ παίδων πάνσοφε τῶν σῶν, ἀγνοησάντων τὴν πολιτείαν σου!
ltx/gr_gr_cog/me.m03.d17:meMA.Ode7C1H.greekmelody	@ltx/gr_gr_cog/he.h.m2:heHE.AntitheonProstagma.greekname
ltx/gr_gr_cog/me.m03.d17:meMA.Ode7C1H.incipit	@ltx/gr_gr_cog/he.h.m2:heHE.AntitheonProstagma.incipit
ltx/gr_gr_cog/me.m03.d17:meMA.Ode7C1H.melody	@ltx/gr_gr_cog/he.h.m2:heHE.AntitheonProstagma.melody
ltx/gr_gr_cog/me.m03.d17:meMA.Ode7C1H.mode	@ltx/gr_gr_cog/miscellanea:misc.Mode2
ltx/gr_gr_cog/me.m03.d17:meMA.Ode7C1H.ode	@ltx/gr_gr_cog/miscellanea:misc.Ode7
ltx/gr_gr_cog/me.m03.d17:meMA.Ode7C1H.text	@ltx/gr_gr_cog/he.h.m2:heHE.AntitheonProstagma.text
ltx/gr_gr_cog/me.m03.d17:meMA.Ode7C1T.incipit	Μεγάλου διάκονος σὺ Μυστηρίου, ἐγένου…
ltx/gr_gr_cog/me.m03.d17:meMA.Ode7C1T.melody	@ltx/gr_gr_cog/he.h.m2:heHE.AntitheonProstagma.name
ltx/gr_gr_cog/me.m03.d17:meMA.Ode7C1T.mode	@ltx/gr_gr_cog/miscellanea:misc.Mode2
ltx/gr_gr_cog/me.m03.d17:meMA.Ode7C1T.ode	@ltx/gr_gr_cog/miscellanea:misc.Ode7
ltx/gr_gr_cog/me.m03.d17:meMA.Ode7C1T.text	Μεγάλου διάκονος σὺ Μυστηρίου, ἐγένου πανάμωμε· Θεὸν γὰρ ἐσωμάτωσας, μεγάλων κακῶν ἡμᾶς ἀπολυτρούμενον, τοὺς σὲ μεγαλύνοντας Ἁγνή, εὐλογημένη Θεοχαρίτωτε.
ltx/gr_gr_cog/me.m03.d17:meMA.Ode8C11.greekmelody	@ltx/gr_gr_cog/he.h.m2:heHE.KaminosPote.greekname
ltx/gr_gr_cog/me.m03.d17:meMA.Ode8C11.incipit	Ἄγνωστος τὸ πρίν, γεννήτορσιν ὑπάρχων…
ltx/gr_gr_cog/me.m03.d17:meMA.Ode8C11.melody	@ltx/gr_gr_cog/he.h.m2:heHE.KaminosPote.name
ltx/gr_gr_cog/me.m03.d17:meMA.Ode8C11.mode	@ltx/gr_gr_cog/miscellanea:misc.Mode2
ltx/gr_gr_cog/me.m03.d17:meMA.Ode8C11.ode	@ltx/gr_gr_cog/miscellanea:misc.Ode8
ltx/gr_gr_cog/me.m03.d17:meMA.Ode8C11.text	Ἄγνωστος τὸ πρίν, γεννήτορσιν ὑπάρχων, ἐν τῷ καιρῷ τῆς ἐκδημίας σου, τούτοις τὸ μυστήριον, ἐκκαλύπτεις φανερούμενος, εἰς δόξαν τοῦ Θεοῦ ἡμῶν· Ἔνδοξε τοῦ μεγάλως σε, καὶ ἀξίως δοξάσαντος.
ltx/gr_gr_cog/me.m03.d17:meMA.Ode8C12.incipit	Κύριος φωνῇ, μεγάλῃ φανεροῖ σε…
ltx/gr_gr_cog/me.m03.d17:meMA.Ode8C12.melody	@ltx/gr_gr_cog/he.h.m2:heHE.KaminosPote.name
ltx/gr_gr_cog/me.m03.d17:meMA.Ode8C12.mode	@ltx/gr_gr_cog/miscellanea:misc.Mode2
ltx/gr_gr_cog/me.m03.d17:meMA.Ode8C12.ode	@ltx/gr_gr_cog/miscellanea:misc.Ode8
ltx/gr_gr_cog/me.m03.d17:meMA.Ode8C12.text	Κύριος φωνῇ, μεγάλῃ φανεροῖ σε, πάσῃ τῇ Ῥώμῃ τὸν κρυπτόμενον, θησαυρὸν Πανόλβιε, ἐν πτωχοῦ σχήματι κείμενον, καὶ δωρεαῖς ἰάσεων, ἅπαντας τοὺς ἐν πίστει, σοὶ προσιόντας πλουτίζοντα.
ltx/gr_gr_cog/me.m03.d17:meMA.Ode8C13.incipit	Ἄρχοντες λαῶν, καὶ Βασιλεῖς συνῆλθον…
ltx/gr_gr_cog/me.m03.d17:meMA.Ode8C13.melody	@ltx/gr_gr_cog/he.h.m2:heHE.KaminosPote.name
ltx/gr_gr_cog/me.m03.d17:meMA.Ode8C13.mode	@ltx/gr_gr_cog/miscellanea:misc.Mode2
ltx/gr_gr_cog/me.m03.d17:meMA.Ode8C13.ode	@ltx/gr_gr_cog/miscellanea:misc.Ode8
ltx/gr_gr_cog/me.m03.d17:meMA.Ode8C13.text	Ἄρχοντες λαῶν, καὶ Βασιλεῖς συνῆλθον, καὶ ἱερεῖς Μάκαρ κηδεῦσαί σε, Θεοῦ ἐπινεύσεσι, καὶ κατεῖδον μέγα θέαμα, θαμβούμενοι θαύμασιν, Ὅσιε οἷς ἐτέλεις, θείᾳ δυνάμει τοῦ Πνεύματος.
ltx/gr_gr_cog/me.m03.d17:meMA.Ode8C1H.greekmelody	@ltx/gr_gr_cog/he.h.m2:heHE.KaminosPote.greekname
ltx/gr_gr_cog/me.m03.d17:meMA.Ode8C1H.incipit	@ltx/gr_gr_cog/he.h.m2:heHE.KaminosPote.incipit
ltx/gr_gr_cog/me.m03.d17:meMA.Ode8C1H.melody	@ltx/gr_gr_cog/he.h.m2:heHE.KaminosPote.melody
ltx/gr_gr_cog/me.m03.d17:meMA.Ode8C1H.mode	@ltx/gr_gr_cog/miscellanea:misc.Mode2
ltx/gr_gr_cog/me.m03.d17:meMA.Ode8C1H.ode	@ltx/gr_gr_cog/miscellanea:misc.Ode8
ltx/gr_gr_cog/me.m03.d17:meMA.Ode8C1H.text	@ltx/gr_gr_cog/he.h.m2:heHE.KaminosPote.text
ltx/gr_gr_cog/me.m03.d17:meMA.Ode8C1T.incipit	Ῥεύσαντας ἡμᾶς, τῇ πάλαι παραβάσει…
ltx/gr_gr_cog/me.m03.d17:meMA.Ode8C1T.melody	@ltx/gr_gr_cog/he.h.m2:heHE.KaminosPote.name
ltx/gr_gr_cog/me.m03.d17:meMA.Ode8C1T.mode	@ltx/gr_gr_cog/miscellanea:misc.Mode2
ltx/gr_gr_cog/me.m03.d17:meMA.Ode8C1T.ode	@ltx/gr_gr_cog/miscellanea:misc.Ode8
ltx/gr_gr_cog/me.m03.d17:meMA.Ode8C1T.text	Ῥεύσαντας ἡμᾶς, τῇ πάλαι παραβάσει, ἀνακαινίζων ὁ φιλάνθρωπος, ἀῤῥεύστως σεσάρκωται, ἐξ ἀφθόρου σου Πανάμωμε, νηδύος καὶ ἐῤῥύσατο, ἅπαντας ἁμαρτίας, καταφθορᾶς παναμώμητε.
ltx/gr_gr_cog/me.m03.d17:meMA.Ode9C11.greekmelody	@ltx/gr_gr_cog/he.h.m2:heHE.AnarchouGennitoros.greekname
ltx/gr_gr_cog/me.m03.d17:meMA.Ode9C11.incipit	Ἰδεῖν κατηξίωσαι, Θεοῦ τὴν δόξαν…
ltx/gr_gr_cog/me.m03.d17:meMA.Ode9C11.melody	@ltx/gr_gr_cog/he.h.m2:heHE.AnarchouGennitoros.name
ltx/gr_gr_cog/me.m03.d17:meMA.Ode9C11.mode	@ltx/gr_gr_cog/miscellanea:misc.Mode2
ltx/gr_gr_cog/me.m03.d17:meMA.Ode9C11.ode	@ltx/gr_gr_cog/miscellanea:misc.Ode9
ltx/gr_gr_cog/me.m03.d17:meMA.Ode9C11.text	Ἰδεῖν κατηξίωσαι, Θεοῦ τὴν δόξαν Ὅσιε, τοῦ λαμπρῶς σε ἐν τέλει Μάκαρ δοξάσαντος· φῶς γὰρ οἱ μὴ βλέποντες εἶδον, καὶ τὸ λαλεῖν ἔλαβον οἱ πρώην, τυγχάνοντες ἄλαλοι, παναοίδιμε Ἀλέξιε.
ltx/gr_gr_cog/me.m03.d17:meMA.Ode9C12.incipit	Ὡράθης προκείμενος, καὶ πρὸς ταφὴν…
ltx/gr_gr_cog/me.m03.d17:meMA.Ode9C12.melody	@ltx/gr_gr_cog/he.h.m2:heHE.AnarchouGennitoros.name
ltx/gr_gr_cog/me.m03.d17:meMA.Ode9C12.mode	@ltx/gr_gr_cog/miscellanea:misc.Mode2
ltx/gr_gr_cog/me.m03.d17:meMA.Ode9C12.ode	@ltx/gr_gr_cog/miscellanea:misc.Ode9
ltx/gr_gr_cog/me.m03.d17:meMA.Ode9C12.text	Ὡράθης προκείμενος, καὶ πρὸς ταφὴν ἀγόμενος, ὥσπερ ἥλιος Πάτερ, πέμπων ἰάσεων, τὰς μαρμαρυγὰς παραδόξως, καὶ σκοτεινὰ πάθη φυγαδεύων, καὶ φλέγων τοὺς δαίμονας, καὶ φωτίζων τοὺς θεόφρονας.
ltx/gr_gr_cog/me.m03.d17:meMA.Ode9C13.incipit	Συνῆλθε κηδεῦσαί σε, Πατριαρχῶν ὁ…
ltx/gr_gr_cog/me.m03.d17:meMA.Ode9C13.melody	@ltx/gr_gr_cog/he.h.m2:heHE.AnarchouGennitoros.name
ltx/gr_gr_cog/me.m03.d17:meMA.Ode9C13.mode	@ltx/gr_gr_cog/miscellanea:misc.Mode2
ltx/gr_gr_cog/me.m03.d17:meMA.Ode9C13.ode	@ltx/gr_gr_cog/miscellanea:misc.Ode9
ltx/gr_gr_cog/me.m03.d17:meMA.Ode9C13.text	Συνῆλθε κηδεῦσαί σε, Πατριαρχῶν ὁ πρόκριτος, Βασιλεύς τε ὁ λίαν φιλοχριστότατος, Ἄρχοντες πρεσβῦται καὶ νέοι, καὶ Μοναστῶν χοροὶ θείᾳ νεύσει καθαγιαζόμενοι, τῇ προσψαύσει σου Μακάριε.
ltx/gr_gr_cog/me.m03.d17:meMA.Ode9C14.incipit	Ἡρπάγης ἐν ἅρματι, τῶν ἀρετῶν…
ltx/gr_gr_cog/me.m03.d17:meMA.Ode9C14.melody	@ltx/gr_gr_cog/he.h.m2:heHE.AnarchouGennitoros.name
ltx/gr_gr_cog/me.m03.d17:meMA.Ode9C14.mode	@ltx/gr_gr_cog/miscellanea:misc.Mode2
ltx/gr_gr_cog/me.m03.d17:meMA.Ode9C14.ode	@ltx/gr_gr_cog/miscellanea:misc.Ode9
ltx/gr_gr_cog/me.m03.d17:meMA.Ode9C14.text	Ἡρπάγης ἐν ἅρματι, τῶν ἀρετῶν ὀχούμενος, καὶ κατέπαυσας ἔνθα Ὁσίων τάγματα, καὶ τῶν Ἀποστόλων Μαρτύρων, Πατριαρχῶν, καὶ πάντων Δικαίων, μεθʼ ὧν ἡμῶν μέμνησο, τῶν τιμώντων σε Ἀλέξιε.
ltx/gr_gr_cog/me.m03.d17:meMA.Ode9C1H.greekmelody	@ltx/gr_gr_cog/he.h.m2:heHE.AnarchouGennitoros.greekname
ltx/gr_gr_cog/me.m03.d17:meMA.Ode9C1H.incipit	@ltx/gr_gr_cog/he.h.m2:heHE.AnarchouGennitoros.incipit
ltx/gr_gr_cog/me.m03.d17:meMA.Ode9C1H.melody	@ltx/gr_gr_cog/he.h.m2:heHE.AnarchouGennitoros.melody
ltx/gr_gr_cog/me.m03.d17:meMA.Ode9C1H.mode	@ltx/gr_gr_cog/miscellanea:misc.Mode2
ltx/gr_gr_cog/me.m03.d17:meMA.Ode9C1H.ode	@ltx/gr_gr_cog/miscellanea:misc.Ode9
ltx/gr_gr_cog/me.m03.d17:meMA.Ode9C1H.text	@ltx/gr_gr_cog/he.h.m2:heHE.AnarchouGennitoros.text
ltx/gr_gr_cog/me.m03.d17:meMA.Ode9C1T.incipit	Φωνήν σοι προσάγομεν, τοῦ Γαβριὴλ…
ltx/gr_gr_cog/me.m03.d17:meMA.Ode9C1T.melody	@ltx/gr_gr_cog/he.h.m2:heHE.AnarchouGennitoros.name
ltx/gr_gr_cog/me.m03.d17:meMA.Ode9C1T.mode	@ltx/gr_gr_cog/miscellanea:misc.Mode2
ltx/gr_gr_cog/me.m03.d17:meMA.Ode9C1T.ode	@ltx/gr_gr_cog/miscellanea:misc.Ode9
ltx/gr_gr_cog/me.m03.d17:meMA.Ode9C1T.text	Φωνήν σοι προσάγομεν, τοῦ Γαβριὴλ γηθόμενοι, χαῖρε λέγοντες χώρα ἡ ἀγεώργητος, χαῖρε τῆς κατάρας ἡ λύσις, χαῖρε πηγή, ὕδατος τοῦ ζῶντος, Ὁσίων τὸ καύχημα, Θεοτόκε ἀειπάρθενε.
ltx/gr_gr_cog/me.m03.d17:meMA.Oikos1.text	Τίς τὰς σεπτάς σου ἀρετὰς ἀξίως εὐφημήσει, καὶ ἱκανῶς ὑμνήσει, Ἀλέξιε θεόφρον, τὴν σωφροσύνην, τὴν ὑπομονήν, τὴν πραότητα, τὴν ἐγκράτειαν, τὸν ἀκατάπαυστον ὕμνον, τὴν ἄκραν σκληραγωγίαν, καὶ ἄμετρον ταπείνωσιν, διʼ ὧν Ἀγγέλοις ἐφάμιλλος γενόμενος. Πρεσβεύεις ἀεὶ ὑπὲρ τοῦ κόσμου παντός· διὸ ἀκούεις Ὅσιε, νῦν παρὰ πάντων Πιστῶν. Χαίροις Ὁσίων τερπνὸν ἐγκαλλώπισμα.
ltx/gr_gr_cog/me.m03.d17:meVE.Apolytikion1.greekmelody	@ltx/gr_gr_cog/he.a.m4:heAU.TachyProkatalave.greekname
ltx/gr_gr_cog/me.m03.d17:meVE.Apolytikion1.incipit	Ἐκ ῥίζης ἐβλάστησας, περιφανοῦς καὶ…
ltx/gr_gr_cog/me.m03.d17:meVE.Apolytikion1.melody	@ltx/gr_gr_cog/he.a.m4:heAU.TachyProkatalave.name
ltx/gr_gr_cog/me.m03.d17:meVE.Apolytikion1.mode	@ltx/gr_gr_cog/miscellanea:misc.Mode4
ltx/gr_gr_cog/me.m03.d17:meVE.Apolytikion1.text	Ἐκ ῥίζης ἐβλάστησας, περιφανοῦς καὶ κλεινῆς, ἐκ πόλεως ἤνθησας, βασιλικῆς καὶ λαμπρᾶς, Ἀλέξιε πάνσοφε, πάντων δʼ ὑπερφρονήσας, ὡς φθαρτῶν καὶ ῥεόντων, ἔσπευσας συναφθῆναι, τῷ Χριστῷ καὶ Δεσπότῃ. Αὐτὸν οὖν ἐκδυσώπει ἀεί, ὑπὲρ τῶν ψυχῶν ἡμῶν.
ltx/gr_gr_cog/me.m03.d17:meVE.SticStavrotheotokion.greekmelody	@ltx/gr_gr_cog/he.a.m1:heAU.PaneffimoiMartyres.greekname
ltx/gr_gr_cog/me.m03.d17:meVE.SticStavrotheotokion.incipit	@ltx/gr_gr_cog/oc.m1.d4:ocVE.SticTheotokion.incipit
ltx/gr_gr_cog/me.m03.d17:meVE.SticStavrotheotokion.melody	@ltx/gr_gr_cog/he.a.m1:heAU.PaneffimoiMartyres.name
ltx/gr_gr_cog/me.m03.d17:meVE.SticStavrotheotokion.mode	@ltx/gr_gr_cog/miscellanea:misc.Mode1
ltx/gr_gr_cog/me.m03.d17:meVE.SticStavrotheotokion.text	@ltx/gr_gr_cog/oc.m1.d4:ocVE.SticTheotokion.text
ltx/gr_gr_cog/me.m03.d17:meVE.SticTheotokion.greekmelody	@ltx/gr_gr_cog/he.a.m1:heAU.PaneffimoiMartyres.greekname
ltx/gr_gr_cog/me.m03.d17:meVE.SticTheotokion.incipit	@ltx/gr_gr_cog/me.m03.d05:meVE.SticTheotokion.incipit
ltx/gr_gr_cog/me.m03.d17:meVE.SticTheotokion.melody	@ltx/gr_gr_cog/he.a.m1:heAU.PaneffimoiMartyres.name
ltx/gr_gr_cog/me.m03.d17:meVE.SticTheotokion.mode	@ltx/gr_gr_cog/miscellanea:misc.Mode1
ltx/gr_gr_cog/me.m03.d17:meVE.SticTheotokion.text	@ltx/gr_gr_cog/me.m03.d05:meVE.SticTheotokion.text
ltx/gr_gr_cog/me.m03.d17:meVE.Stichera01.greekmelody	@ltx/gr_gr_cog/he.a.m1:heAU.PaneffimoiMartyres.greekname
ltx/gr_gr_cog/me.m03.d17:meVE.Stichera01.incipit	Ἄνθρωπόν σε ἔγνωμεν Θεοῦ, κλήσει…
ltx/gr_gr_cog/me.m03.d17:meVE.Stichera01.melody	@ltx/gr_gr_cog/he.a.m1:heAU.PaneffimoiMartyres.name
ltx/gr_gr_cog/me.m03.d17:meVE.Stichera01.mode	@ltx/gr_gr_cog/miscellanea:misc.Mode1
ltx/gr_gr_cog/me.m03.d17:meVE.Stichera01.text	Ἄνθρωπόν σε ἔγνωμεν Θεοῦ, κλήσει τε καὶ πράγματι· ταῖς ἀρεταῖς γὰρ διέλαμψας, πτωχείαν ἄμετρον, καὶ στενοχωρίαν, ἐπὶ γῆς κτησάμενος, καὶ θαύμασι πιστούς πιστωσάμενος· διὸ ἱκέτευε, δωρηθῆναι ταῖς ψυχαῖς ἡμῶν, τὴν εἰρήνην καὶ τὸ μέγα ἔλεος.
ltx/gr_gr_cog/me.m03.d17:meVE.Stichera02.incipit	Ἔρωτι δροσίζοντι σαρκός, ἔρωτας φλογίζοντας…
ltx/gr_gr_cog/me.m03.d17:meVE.Stichera02.melody	@ltx/gr_gr_cog/he.a.m1:heAU.PaneffimoiMartyres.name
ltx/gr_gr_cog/me.m03.d17:meVE.Stichera02.mode	@ltx/gr_gr_cog/miscellanea:misc.Mode1
ltx/gr_gr_cog/me.m03.d17:meVE.Stichera02.text	Ἔρωτι δροσίζοντι σαρκός, ἔρωτας φλογίζοντας, ἐναποσβέσας Ἀλέξιε, θαλάμου θάλαμον, εὐσεβῶς ἠλλάξω, ἡδονῆς τε σώματος, τὴν θείαν τῶν Ἀγγέλων ὁμοίωσιν, μεθʼ ὧν ἱκέτευε, δωρηθῆναι ταῖς ψυχαῖς ἡμῶν, τὴν εἰρήνην καὶ τὸ μέγα ἔλεος.
ltx/gr_gr_cog/me.m03.d17:meVE.Stichera03.incipit	Μένεις ἀγνοούμενος Σοφέ, πρὸ πυλῶν…
ltx/gr_gr_cog/me.m03.d17:meVE.Stichera03.melody	@ltx/gr_gr_cog/he.a.m1:heAU.PaneffimoiMartyres.name
ltx/gr_gr_cog/me.m03.d17:meVE.Stichera03.mode	@ltx/gr_gr_cog/miscellanea:misc.Mode1
ltx/gr_gr_cog/me.m03.d17:meVE.Stichera03.text	Μένεις ἀγνοούμενος Σοφέ, πρὸ πυλῶν θλιβόμενος, τῶν εὐγενῶν γεννητόρων σου, ἐμπαροινούντων σοι, τῶν οἰκείων παίδων, ἐπὶ χρόνον μήκιστον, θανὼν δὲ φανεροῦσαι τοῖς θαύμασιν, οἷς ἐπετέλεσας, θεραπεύων τὰ νοσήματα, καὶ διώκων ἀκάθαρτα πνεύματα.
