ltx/gr_gr_cog/he.a.m6:heAU.AiAngelikai.greekname	 
ltx/gr_gr_cog/he.a.m6:heAU.AiAngelikai.incipit	Αἱ Ἀγγελικαί…
ltx/gr_gr_cog/he.a.m6:heAU.AiAngelikai.melody	@ltx/gr_gr_cog/miscellanea:misc.Automelon
ltx/gr_gr_cog/he.a.m6:heAU.AiAngelikai.mode	@ltx/gr_gr_cog/miscellanea:misc.Mode6
ltx/gr_gr_cog/he.a.m6:heAU.AiAngelikai.name	Αἱ Ἀγγελικαί.
ltx/gr_gr_cog/he.a.m6:heAU.AiAngelikai.text	Αἱ Ἀγγελικαί, προπορεύεσθε Δυνάμεις, οἱ ἐν Βηθλεέμ, ἐτοιμάσατε τὴν Φάτνην· ὁ λόγος γὰρ γεννᾶται, ἡ σοφία προέρχεται, δέχου ἀσπασμὸν ἡ Ἐκκλησία, εἰς τὴν χαρὰν τῆς Θεοτόκου, λαοὶ εἴπωμεν· Εὐλογημένος ὁ ἐλθών, Θεὸς ἡμῶν δόξα σοι.
ltx/gr_gr_cog/he.a.m6:heAU.AngelikaiDynameis.greekname	 
ltx/gr_gr_cog/he.a.m6:heAU.AngelikaiDynameis.incipit	Ἀγγελικαὶ Δυνάμεις…
ltx/gr_gr_cog/he.a.m6:heAU.AngelikaiDynameis.melody	@ltx/gr_gr_cog/miscellanea:misc.Automelon
ltx/gr_gr_cog/he.a.m6:heAU.AngelikaiDynameis.mode	@ltx/gr_gr_cog/miscellanea:misc.Mode6
ltx/gr_gr_cog/he.a.m6:heAU.AngelikaiDynameis.name	Ἀγγελικαὶ Δυνάμεις.
ltx/gr_gr_cog/he.a.m6:heAU.AngelikaiDynameis.text	Ἀγγελικαὶ Δυνάμεις ἐπὶ τὸ μνῆμά σου, καὶ οἱ φυλάσσοντες ἀπενεκρώθησαν· καὶ ἵστατο Μαρία ἐν τῷ τάφῳ ζητοῦσα τὸ ἄχραντόν σου σῶμα. Ἐσκύλευσας τὸν Ἅδην, μὴ πειρασθεὶς ὑπʼ αὐτοῦ· ὑπήντησας τῇ Παρθένῳ, δωρούμενος τὴν ζωήν. Ὁ ἀναστὰς ἐκ τῶν νεκρῶν, Κύριε δόξα σοι.
ltx/gr_gr_cog/he.a.m6:heAU.EkGastrosEtechthis.greekname	 
ltx/gr_gr_cog/he.a.m6:heAU.EkGastrosEtechthis.incipit	Ἐκ γαστρὸς ἐτέχθης…
ltx/gr_gr_cog/he.a.m6:heAU.EkGastrosEtechthis.melody	@ltx/gr_gr_cog/miscellanea:misc.Automelon
ltx/gr_gr_cog/he.a.m6:heAU.EkGastrosEtechthis.mode	@ltx/gr_gr_cog/miscellanea:misc.Mode6
ltx/gr_gr_cog/he.a.m6:heAU.EkGastrosEtechthis.name	Ἐκ γαστρὸς ἐτέχθης.
ltx/gr_gr_cog/he.a.m6:heAU.EkGastrosEtechthis.text	Ἐκ γαστρὸς ἐτέχθης πρὸ ἑωσφόρου, ἐκ Πατρὸς ἀμήτωρ πρὸ τῶν αἰώνων, κἂν Ἄρειος κτίσμα σε, καὶ οὐ Θεὸν δοξάζει, τόλμη συνάπτων σε τὸν κτίστην, τοῖς κτίσμασιν ἀφρόνως, ὕλην πυρὸς τοῦ αἰωνίου, ἑαυτῷ θησαυρίζων· ἀλλʼ ἡ Σύνοδος ἡ ἐν Νικαίᾳ, Υἱὸν Θεοῦ σε ἀνεκήρυξε Κύριε, Πατρὶ καὶ Πνεύματι σύνθρονον.
ltx/gr_gr_cog/he.a.m6:heAU.ElpisTouKosmouAgathi.greekname	 
ltx/gr_gr_cog/he.a.m6:heAU.ElpisTouKosmouAgathi.incipit	Ἐλπὶς τοῦ κόσμου ἀγαθή…
ltx/gr_gr_cog/he.a.m6:heAU.ElpisTouKosmouAgathi.melody	@ltx/gr_gr_cog/miscellanea:misc.Automelon
ltx/gr_gr_cog/he.a.m6:heAU.ElpisTouKosmouAgathi.mode	@ltx/gr_gr_cog/miscellanea:misc.Mode6
ltx/gr_gr_cog/he.a.m6:heAU.ElpisTouKosmouAgathi.name	Ἐλπὶς τοῦ κόσμου ἀγαθή.
ltx/gr_gr_cog/he.a.m6:heAU.ElpisTouKosmouAgathi.text	Ἐλπὶς τοῦ κόσμου ἀγαθή, Θεοτόκε Παρθένε, τὴν σὴν καὶ μόνην φοβερὰν προστασίαν αἰτοῦμεν, σπλαγχνίσθητι εἰς ἀπροστάτευτον λαόν, δυσώπησον τὸν ἐλεήμονα Θεόν, ῥυσθῆναι τὰς ψυχὰς ἡμῶν, ἐκ πάσης ἀπειλῆς, μόνη εὐλογημένη.
ltx/gr_gr_cog/he.a.m6:heAU.IApegnosmeni.greekname	 
ltx/gr_gr_cog/he.a.m6:heAU.IApegnosmeni.incipit	Ἡ ἀπεγνωσμένη…
ltx/gr_gr_cog/he.a.m6:heAU.IApegnosmeni.melody	@ltx/gr_gr_cog/miscellanea:misc.Automelon
ltx/gr_gr_cog/he.a.m6:heAU.IApegnosmeni.mode	@ltx/gr_gr_cog/miscellanea:misc.Mode6
ltx/gr_gr_cog/he.a.m6:heAU.IApegnosmeni.name	Ἡ ἀπεγνωσμένη.
ltx/gr_gr_cog/he.a.m6:heAU.IApegnosmeni.text	Ἡ ἀπεγνωσμένη διὰ τὸν βίον, καὶ ἐπεγνωσμένη διὰ τὸν τρόπον, τὸ μύρον βαστάζουσα, προσῆλθέ σοι βοῶσα· Μή με τὴν πόρνην ἀποῤῥίψῃς, ὁ τεχθεὶς ἐκ Παρθένου, μή μου τὰ δάκρυα παρίδῃς, ἡ χαρὰ τῶν Ἀγγέλων, ἀλλὰ δέξαι με μετανοοῦσαν, ἣν οὐκ ἀπώσω ἁμαρτάνουσαν Κύριε, διὰ τὸ μέγα σου ἔλεος.
ltx/gr_gr_cog/he.a.m6:heAU.KyrieEleisonImas.greekname	 
ltx/gr_gr_cog/he.a.m6:heAU.KyrieEleisonImas.incipit	Κύριε ἐλέησον ἡμᾶς…
ltx/gr_gr_cog/he.a.m6:heAU.KyrieEleisonImas.melody	@ltx/gr_gr_cog/miscellanea:misc.Automelon
ltx/gr_gr_cog/he.a.m6:heAU.KyrieEleisonImas.mode	@ltx/gr_gr_cog/miscellanea:misc.Mode6
ltx/gr_gr_cog/he.a.m6:heAU.KyrieEleisonImas.name	Κύριε ἐλέησον ἡμᾶς.
ltx/gr_gr_cog/he.a.m6:heAU.KyrieEleisonImas.text	Κύριε ἐλέησον ἡμᾶς· ἐπὶ σοὶ γὰρ πεποίθαμεν· μὴ ὀργισθῇς ἡμῖν σφόδρα, μηδὲ μνησθῇς τῶν ἀνομιῶν ἡμῶν· ἀλλʼ ἐπίβλεψον καὶ νῦν ὡς εὔσπλαγχνος, καὶ λύτρωσαι ἡμᾶς ἐκ τῶν ἐχθρῶν ἡμῶν· σὺ γὰρ εἶ Θεὸς ἡμῶν, καὶ ἡμεῖς λαός σου· πάντες ἔργα χειρῶν σου, καὶ τὸ ὄνομά σου ἐπικεκλήμεθα.
ltx/gr_gr_cog/he.a.m6:heAU.OlinApothemenoi.greekname	 
ltx/gr_gr_cog/he.a.m6:heAU.OlinApothemenoi.incipit	Ὅλην ἀποθέμενοι…
ltx/gr_gr_cog/he.a.m6:heAU.OlinApothemenoi.melody	@ltx/gr_gr_cog/miscellanea:misc.Automelon
ltx/gr_gr_cog/he.a.m6:heAU.OlinApothemenoi.mode	@ltx/gr_gr_cog/miscellanea:misc.Mode6
ltx/gr_gr_cog/he.a.m6:heAU.OlinApothemenoi.name	Ὅλην ἀποθέμενοι.
ltx/gr_gr_cog/he.a.m6:heAU.OlinApothemenoi.text	Ὅλην ἀποθέμενοι, ἐν οὐρανοῖς τὴν ἐλπίδα, θησαυρὸν ἀσύλητον, ἑαυτοῖς οἱ Ἅγιοι ἐθησαύρισαν, δωρεὰν ἔλαβον, δωρεὰν διδοῦσι, τοῖς νοσοῦσι τὰ ἰάματα, χρυσὸν ἢ ἄργυρον, εὐαγγελικῶς οὐκ ἐκτήσαντο, ἀνθρώποις τε καὶ κτήνεσι, τὰς εὐεργεσίας μετέδωκαν, ἵνα διὰ πάντων, ὑπήκοοι γενόμενοι Χριστῷ, ἐν παῤῥησίᾳ πρεσβεύωσιν, ὑπὲρ τῶν ψυχῶν ἡμῶν.
ltx/gr_gr_cog/he.a.m6:heAU.TinEnPresveiais.greekname	 
ltx/gr_gr_cog/he.a.m6:heAU.TinEnPresveiais.incipit	Τὴν ἐν πρεσβείαις…
ltx/gr_gr_cog/he.a.m6:heAU.TinEnPresveiais.melody	@ltx/gr_gr_cog/miscellanea:misc.Automelon
ltx/gr_gr_cog/he.a.m6:heAU.TinEnPresveiais.mode	@ltx/gr_gr_cog/miscellanea:misc.Mode6
ltx/gr_gr_cog/he.a.m6:heAU.TinEnPresveiais.name	Τὴν ἐν πρεσβείαις.
ltx/gr_gr_cog/he.a.m6:heAU.TinEnPresveiais.text	Τὴν ἐν πρεσβείαις ἀκοίμητον Θεοτόκον, καὶ προστασίαις ἀμετάθετον ἐλπίδα, τάφος καὶ νέκρωσις οὐκ ἐκράτησεν· ὡς γὰρ ζωῆς Μητέρα, πρὸς τὴν ζωὴν μετέστησεν, ὁ μήτραν οἰκήσας ἀειπάρθενον.
ltx/gr_gr_cog/he.a.m6:heAU.TinYperImon.greekname	 
ltx/gr_gr_cog/he.a.m6:heAU.TinYperImon.incipit	Τὴν ὑπὲρ ἡμῶν…
ltx/gr_gr_cog/he.a.m6:heAU.TinYperImon.melody	@ltx/gr_gr_cog/miscellanea:misc.Automelon
ltx/gr_gr_cog/he.a.m6:heAU.TinYperImon.mode	@ltx/gr_gr_cog/miscellanea:misc.Mode6
ltx/gr_gr_cog/he.a.m6:heAU.TinYperImon.name	Τὴν ὑπὲρ ἡμῶν.
ltx/gr_gr_cog/he.a.m6:heAU.TinYperImon.text	Τὴν ὑπὲρ ἡμῶν πληρώσας οἰκονομίαν, καὶ τὰ ἐπὶ γῆς ἑνώσας τοῖς οὐρανίοις, ἀνελήφθης ἐν δόξῃ, Χριστε ὁ Θεὸς ἡμῶν, οὐδαμόθεν χωριζόμενος, ἀλλὰ μένων ἀδιάστατος, καὶ βοῶν τοῖς ἀγαπῶσί σε· Ἐγώ εἰμι μεθʼ ὑμῶν, καὶ οὐδεὶς καθʼ ὑμῶν.
ltx/gr_gr_cog/he.a.m6:heAU.TriimerosAnestis.greekname	 
ltx/gr_gr_cog/he.a.m6:heAU.TriimerosAnestis.incipit	Τριήμερος ἀνέστης…
ltx/gr_gr_cog/he.a.m6:heAU.TriimerosAnestis.melody	@ltx/gr_gr_cog/miscellanea:misc.Automelon
ltx/gr_gr_cog/he.a.m6:heAU.TriimerosAnestis.mode	@ltx/gr_gr_cog/miscellanea:misc.Mode6
ltx/gr_gr_cog/he.a.m6:heAU.TriimerosAnestis.name	Τριήμερος ἀνέστης.
ltx/gr_gr_cog/he.a.m6:heAU.TriimerosAnestis.text	Τριήμερος ἀνέστης Χριστέ, ἐκ τάφου, καθὼς γέγραπται, συνεγείρας τὸν προπάτορα ἡμῶν· διό σε καὶ δοξάζει, τὸ γένος τῶν ἀνθρώπων, καὶ ἀνυμνεῖ σου τὴν ἀνάστασιν.
ltx/gr_gr_cog/he.a.m6:heAU.title	Αὐτόμελα τοῦ πλ. Βʹ Ἦχου
