ltx/gr_gr_cog/le.go.me.m12.d28:lemeLI.Gospel.book_abbr	@ltx/gr_gr_cog/le.go.lu.d058:leluLI.Gospel.book_abbr
ltx/gr_gr_cog/le.go.me.m12.d28:lemeLI.Gospel.book_string	@ltx/gr_gr_cog/le.go.lu.d058:leluLI.Gospel.book_string
ltx/gr_gr_cog/le.go.me.m12.d28:lemeLI.Gospel.chapverse	@ltx/gr_gr_cog/le.go.lu.d058:leluLI.Gospel.chapverse
ltx/gr_gr_cog/le.go.me.m12.d28:lemeLI.Gospel.incipit	@ltx/gr_gr_cog/le.go.lu.d058:leluLI.Gospel.incipit
ltx/gr_gr_cog/le.go.me.m12.d28:lemeLI.Gospel.text	@ltx/gr_gr_cog/le.go.lu.d058:leluLI.Gospel.text
ltx/gr_gr_cog/le.go.me.m12.d28:lemeLI.Gospel.title	Τῶν Μαρτύρων
ltx/gr_gr_cog/le.go.me.m12.d28:lemeLI.Gospel.title_abbr	Τῶν Μαρτύρων
ltx/gr_gr_cog/le.go.me.m12.d28:lemeLI.Gospel.version	@ltx/gr_gr_cog/le.go.lu.d058:leluLI.Gospel.version
