ltx/gr_gr_cog/me.m10.d25:meDA.commemoration.first	Μνήμη τῶν Ἁγίων Μαρτύρων Μαρκιανοῦ καὶ Μαρτυρίου
ltx/gr_gr_cog/me.m10.d25:meDA.commemoration.first_name	
ltx/gr_gr_cog/me.m10.d25:meDA.commemoration.first_short	Μνήμη τῶν Ἁγίων Μαρτύρων Μαρκιανοῦ καὶ Μαρτυρίου
ltx/gr_gr_cog/me.m10.d25:meDA.commemoration.first_title	@ltx/gr_gr_cog/titles:ti.Saints
ltx/gr_gr_cog/me.m10.d25:meDA.commemoration.full	Μνήμη τῶν Ἁγίων Μαρτύρων καὶ Νοταρίων, Μαρκιανοῦ καὶ Μαρτυρίου
ltx/gr_gr_cog/me.m10.d25:meDA.commemoration.second_name	
ltx/gr_gr_cog/me.m10.d25:meDA.commemoration.second_title	
ltx/gr_gr_cog/me.m10.d25:meDA.date	Τῌ ΚΕʹ ΟΚΤΩΒΡΙΟΥ
ltx/gr_gr_cog/me.m10.d25:meDA.fordate	διὰ τὴν 25ην Ὀκτωβρίου
ltx/gr_gr_cog/me.m10.d25:meDA.insert1	καὶ τῶν Ἁγίων Μαρτύρων καὶ Νοταρίων, Μαρκιανοῦ καὶ Μαρτυρίου,
ltx/gr_gr_cog/me.m10.d25:meDA.insert2	ὧν καὶ τὴν μνήμην ἐπιτελοῦμεν·
ltx/gr_gr_cog/me.m10.d25:meDA.note	
ltx/gr_gr_cog/me.m10.d25:meDA.pdfcoverdate	τῆς 25ης Ὀκτωβρίου,
ltx/gr_gr_cog/me.m10.d25:meDA.pdfheaderdate	τῆς 25ης Ὀκτωβρίου
ltx/gr_gr_cog/me.m10.d25:meHO.commemorations	
ltx/gr_gr_cog/me.m10.d25:meHO.note1	
ltx/gr_gr_cog/me.m10.d25:meHO.note2	
ltx/gr_gr_cog/me.m10.d25:meHO.number	
ltx/gr_gr_cog/me.m10.d25:meHO.rank	
ltx/gr_gr_cog/me.m10.d25:meLE.commemoration1	Μνήμη τῶν Ἁγίων Μαρτύρων καὶ Νοταρίων, Μαρκιανοῦ καὶ Μαρτυρίου.
ltx/gr_gr_cog/me.m10.d25:meLE.commemoration2	
ltx/gr_gr_cog/me.m10.d25:meLI.Kontakion1.greekmelody	@ltx/gr_gr_cog/me.m10.d25:meMA.Kontakion1.greekmelody
ltx/gr_gr_cog/me.m10.d25:meLI.Kontakion1.incipit	@ltx/gr_gr_cog/me.m10.d25:meMA.Kontakion1.incipit
ltx/gr_gr_cog/me.m10.d25:meLI.Kontakion1.melody	@ltx/gr_gr_cog/me.m10.d25:meMA.Kontakion1.melody
ltx/gr_gr_cog/me.m10.d25:meLI.Kontakion1.mode	@ltx/gr_gr_cog/me.m10.d25:meMA.Kontakion1.mode
ltx/gr_gr_cog/me.m10.d25:meLI.Kontakion1.text	@ltx/gr_gr_cog/me.m10.d25:meMA.Kontakion1.text
ltx/gr_gr_cog/me.m10.d25:meLI.Megalynarion.text	
ltx/gr_gr_cog/me.m10.d25:meMA.C1.acrostic.notice1	οὗ ἡ Ἀκροστιχίς·
ltx/gr_gr_cog/me.m10.d25:meMA.C1.acrostic.text	Διττοῖς προσοίσω Μάρτυσιν μελῳδίαν. Ἰωσήφ.
ltx/gr_gr_cog/me.m10.d25:meMA.C1.acrostic.title	Κανὼν τῶν Ἁγίων,
ltx/gr_gr_cog/me.m10.d25:meMA.C1.title	@ltx/gr_gr_cog/titles:ti.CanonSaints
ltx/gr_gr_cog/me.m10.d25:meMA.C1.verse	@ltx/gr_gr_cog/prayers:pr.verse_SaintsM.text
ltx/gr_gr_cog/me.m10.d25:meMA.ExapTheotokion.incipit	Σὲ κιβωτὸν καὶ τράπεζαν, καὶ…
ltx/gr_gr_cog/me.m10.d25:meMA.ExapTheotokion.melody	@ltx/gr_gr_cog/he.a.m2:heAU.ToisMathitaisSynelthomen.name
ltx/gr_gr_cog/me.m10.d25:meMA.ExapTheotokion.mode	@ltx/gr_gr_cog/miscellanea:misc.Mode2
ltx/gr_gr_cog/me.m10.d25:meMA.ExapTheotokion.text	Σὲ κιβωτὸν καὶ τράπεζαν, καὶ λυχνίαν καὶ στάμνον, καὶ ὄρος καὶ παλάτιον, θρόνον κλίνην καὶ πύλην, τοῦ Βασιλέως τῆς δόξης, τὴν Ἁγίαν Παρθένον, καὶ Θεοτόκον ἅπαντες, ἀνυμνοῦμεν ἐκ πόθου· Χριστιανῶν, σκέπη γὰρ ὑπάρχεις καὶ σωτηρία, καὶ ἀῤῥαγὴς ὑπέρμαχος, καὶ προστάτις καὶ φύλαξ.
ltx/gr_gr_cog/me.m10.d25:meMA.Exaposteilarion1.greekmelody	@ltx/gr_gr_cog/he.a.m2:heAU.ToisMathitaisSynelthomen.greekname
ltx/gr_gr_cog/me.m10.d25:meMA.Exaposteilarion1.incipit	Μαρκιανὸς ὁ πάνσοφος, καὶ Μαρτύριος…
ltx/gr_gr_cog/me.m10.d25:meMA.Exaposteilarion1.melody	@ltx/gr_gr_cog/he.a.m2:heAU.ToisMathitaisSynelthomen.name
ltx/gr_gr_cog/me.m10.d25:meMA.Exaposteilarion1.mode	@ltx/gr_gr_cog/miscellanea:misc.Mode2
ltx/gr_gr_cog/me.m10.d25:meMA.Exaposteilarion1.text	Μαρκιανὸς ὁ πάνσοφος, καὶ Μαρτύριος ἅμα, τὸ τοῦ Ἀρείου ἔκφυλον, δόγμα καὶ μανιῶδες, καθεῖλον χάριτι θείᾳ τῆς Ἁγίας Τριάδος, ὑπὲρ ἧς καὶ ἐνήθλησαν, καὶ ὡς Μάρτυρες θεῖοι, στέφος λαμπρόν, πρὸς Χριστοῦ δεξάμενοι τοῦ Σωτῆρος, ὑπὲρ ἡμῶν πρεσβεύουσι, τῶν αὐτοὺς εὐφημούντων.
ltx/gr_gr_cog/me.m10.d25:meMA.Kontakion1.greekmelody	@ltx/gr_gr_cog/he.a.m4:heAU.OYpsotheisEnToStavro.greekname
ltx/gr_gr_cog/me.m10.d25:meMA.Kontakion1.incipit	Ἀγωνισάμενοι καλῶς ἀπὸ βρέφους, Μαρκιανὲ…
ltx/gr_gr_cog/me.m10.d25:meMA.Kontakion1.melody	@ltx/gr_gr_cog/he.a.m4:heAU.OYpsotheisEnToStavro.name
ltx/gr_gr_cog/me.m10.d25:meMA.Kontakion1.mode	@ltx/gr_gr_cog/miscellanea:misc.Mode4
ltx/gr_gr_cog/me.m10.d25:meMA.Kontakion1.text	Ἀγωνισάμενοι καλῶς ἀπὸ βρέφους, Μαρκιανὲ σὺν τῷ σοφῷ Μαρτυρίῳ, τὸν ἀποστάτην Ἄρειον καθείλετε, ἄτρωτον τηρήσαντες, τὴν ὀρθόδοξον πίστιν, Παύλῳ ἐφεπόμενοι, τῷ σοφῷ διδασκάλῳ· ὅθεν σὺν τούτῳ εὕρατε ζωήν, ὡς τῆς Τριάδος ὑπέρμαχοι ἄριστοι.
ltx/gr_gr_cog/me.m10.d25:meMA.Ode1C11.greekmelody	@ltx/gr_gr_cog/he.h.m4:heHE.TristatasKrataious.greekname
ltx/gr_gr_cog/me.m10.d25:meMA.Ode1C11.incipit	Διόλου τῷ φωτί, τῆς Ἁγίας…
ltx/gr_gr_cog/me.m10.d25:meMA.Ode1C11.melody	@ltx/gr_gr_cog/he.h.m4:heHE.TristatasKrataious.name
ltx/gr_gr_cog/me.m10.d25:meMA.Ode1C11.mode	@ltx/gr_gr_cog/miscellanea:misc.Mode4
ltx/gr_gr_cog/me.m10.d25:meMA.Ode1C11.ode	@ltx/gr_gr_cog/miscellanea:misc.Ode1
ltx/gr_gr_cog/me.m10.d25:meMA.Ode1C11.text	Διόλου τῷ φωτί, τῆς Ἁγίας Τριάδος, ἐλλαμπόμενοι ἀεί, φωστῆρες ἀπλανεῖς, χρηματίζετε Ἅγιοι· ὅθεν πίστει τὴν φωσφόρον, ἑορτὴν ὑμῶν σήμερον, ἐκτελοῦντες φαιδρῶς ἀγαλλόμεθα.
ltx/gr_gr_cog/me.m10.d25:meMA.Ode1C12.incipit	Ἰδεῖν τὸν ἐπὶ γῆς, ἀναλάμψαντα…
ltx/gr_gr_cog/me.m10.d25:meMA.Ode1C12.melody	@ltx/gr_gr_cog/he.h.m4:heHE.TristatasKrataious.name
ltx/gr_gr_cog/me.m10.d25:meMA.Ode1C12.mode	@ltx/gr_gr_cog/miscellanea:misc.Mode4
ltx/gr_gr_cog/me.m10.d25:meMA.Ode1C12.ode	@ltx/gr_gr_cog/miscellanea:misc.Ode1
ltx/gr_gr_cog/me.m10.d25:meMA.Ode1C12.text	Ἰδεῖν τὸν ἐπὶ γῆς, ἀναλάμψαντα Λόγον, ἐκ Παρθένου διʼ ἡμᾶς, ποθοῦντες Ἀθληταί, τῷ Πατρὶ ὁμοούσιον, τοῦτον καθομολογοῦντες, βιαιότατον θάνατον, λογισμῷ στεῤῥοτάτῳ ὑπέστητε.
ltx/gr_gr_cog/me.m10.d25:meMA.Ode1C13.incipit	Τοῦ Παύλου τοῦ σοφοῦ, θεηγόροι…
ltx/gr_gr_cog/me.m10.d25:meMA.Ode1C13.melody	@ltx/gr_gr_cog/he.h.m4:heHE.TristatasKrataious.name
ltx/gr_gr_cog/me.m10.d25:meMA.Ode1C13.mode	@ltx/gr_gr_cog/miscellanea:misc.Mode4
ltx/gr_gr_cog/me.m10.d25:meMA.Ode1C13.ode	@ltx/gr_gr_cog/miscellanea:misc.Ode1
ltx/gr_gr_cog/me.m10.d25:meMA.Ode1C13.text	Τοῦ Παύλου τοῦ σοφοῦ, θεηγόροι δειχθέντες, ὀπαδοὶ καὶ φοιτηταί, ὁμότιμον Πατρί, τὸν Υἱὸν ἐκηρύξατε· ὅθεν ξίφεσι τμηθέντες, τῇ πλημμύρᾳ τοῦ αἵματος, Ἀθλοφόροι τὴν γῆν ἡγιάσατε.
ltx/gr_gr_cog/me.m10.d25:meMA.Ode1C1H.incipit	@ltx/gr_gr_cog/he.h.m4:heHE.TristatasKrataious.incipit
ltx/gr_gr_cog/me.m10.d25:meMA.Ode1C1H.melody	@ltx/gr_gr_cog/he.h.m4:heHE.TristatasKrataious.melody
ltx/gr_gr_cog/me.m10.d25:meMA.Ode1C1H.mode	@ltx/gr_gr_cog/miscellanea:misc.Mode4
ltx/gr_gr_cog/me.m10.d25:meMA.Ode1C1H.ode	@ltx/gr_gr_cog/miscellanea:misc.Ode1
ltx/gr_gr_cog/me.m10.d25:meMA.Ode1C1H.text	@ltx/gr_gr_cog/he.h.m4:heHE.TristatasKrataious.text
ltx/gr_gr_cog/me.m10.d25:meMA.Ode1C1T.incipit	Τὸν ἄναρχον Υἱόν, τοῦ Θεοῦ…
ltx/gr_gr_cog/me.m10.d25:meMA.Ode1C1T.melody	@ltx/gr_gr_cog/he.h.m4:heHE.TristatasKrataious.name
ltx/gr_gr_cog/me.m10.d25:meMA.Ode1C1T.mode	@ltx/gr_gr_cog/miscellanea:misc.Mode4
ltx/gr_gr_cog/me.m10.d25:meMA.Ode1C1T.ode	@ltx/gr_gr_cog/miscellanea:misc.Ode1
ltx/gr_gr_cog/me.m10.d25:meMA.Ode1C1T.text	Τὸν ἄναρχον Υἱόν, τοῦ Θεοῦ συλλαβοῦσα, ἐσωμάτωσας Ἁγνή, γενόμενον βροτόν, διὰ ἔλεος ἄφατον· ὅθεν τοῦτον προσκυνοῦντες, εὐσεβῶς σε δοξάζομεν, τὴν αἰτίαν τῆς πάντων θεώσεως.
ltx/gr_gr_cog/me.m10.d25:meMA.Ode3C11.greekmelody	@ltx/gr_gr_cog/he.h.m4:heHE.OukEnSofia.greekname
ltx/gr_gr_cog/me.m10.d25:meMA.Ode3C11.incipit	Ὀρθοδοξίᾳ, λαμπρυνόμενοι θείῳ ἐν Πνεύματι…
ltx/gr_gr_cog/me.m10.d25:meMA.Ode3C11.melody	@ltx/gr_gr_cog/he.h.m4:heHE.OukEnSofia.name
ltx/gr_gr_cog/me.m10.d25:meMA.Ode3C11.mode	@ltx/gr_gr_cog/miscellanea:misc.Mode4
ltx/gr_gr_cog/me.m10.d25:meMA.Ode3C11.ode	@ltx/gr_gr_cog/miscellanea:misc.Ode3
ltx/gr_gr_cog/me.m10.d25:meMA.Ode3C11.text	Ὀρθοδοξίᾳ, λαμπρυνόμενοι θείῳ ἐν Πνεύματι, τὸν Ἀρείου σκοτασμόν, ὁλοσχερῶς διεφύγετε, Μάρτυρες γενόμενοι τοῦ Παντοκράτορος.
ltx/gr_gr_cog/me.m10.d25:meMA.Ode3C12.incipit	Ἴσον τὸν Λόγον, τῷ Πατρὶ…
ltx/gr_gr_cog/me.m10.d25:meMA.Ode3C12.melody	@ltx/gr_gr_cog/he.h.m4:heHE.OukEnSofia.name
ltx/gr_gr_cog/me.m10.d25:meMA.Ode3C12.mode	@ltx/gr_gr_cog/miscellanea:misc.Mode4
ltx/gr_gr_cog/me.m10.d25:meMA.Ode3C12.ode	@ltx/gr_gr_cog/miscellanea:misc.Ode3
ltx/gr_gr_cog/me.m10.d25:meMA.Ode3C12.text	Ἴσον τὸν Λόγον, τῷ Πατρὶ δογματίσαντες Ἅγιοι, κατεκρίθητε θανεῖν, Μαρκιανὲ καὶ Μαρτύριε, καὶ πρὸς ἀτελεύτητον, ζωὴν μετέβητε.
ltx/gr_gr_cog/me.m10.d25:meMA.Ode3C13.incipit	Στρατολογίᾳ, ἱερᾷ τῶν Ἀγγέλων συνήφθητε…
ltx/gr_gr_cog/me.m10.d25:meMA.Ode3C13.melody	@ltx/gr_gr_cog/he.h.m4:heHE.OukEnSofia.name
ltx/gr_gr_cog/me.m10.d25:meMA.Ode3C13.mode	@ltx/gr_gr_cog/miscellanea:misc.Mode4
ltx/gr_gr_cog/me.m10.d25:meMA.Ode3C13.ode	@ltx/gr_gr_cog/miscellanea:misc.Ode3
ltx/gr_gr_cog/me.m10.d25:meMA.Ode3C13.text	Στρατολογίᾳ, ἱερᾷ τῶν Ἀγγέλων συνήφθητε, καὶ Μαρτύρων τοῖς χοροῖς, περιφανῶς ἠριθμήθητε· ὅθεν τὴν σεπτὴν ὑμῶν, μνήμην γεραίρομεν.
ltx/gr_gr_cog/me.m10.d25:meMA.Ode3C1T.incipit	Πεποικιλμένη, κροσσωτοῖς ἐν χρυσοῖς ὡς…
ltx/gr_gr_cog/me.m10.d25:meMA.Ode3C1T.melody	@ltx/gr_gr_cog/he.h.m4:heHE.OukEnSofia.name
ltx/gr_gr_cog/me.m10.d25:meMA.Ode3C1T.mode	@ltx/gr_gr_cog/miscellanea:misc.Mode4
ltx/gr_gr_cog/me.m10.d25:meMA.Ode3C1T.ode	@ltx/gr_gr_cog/miscellanea:misc.Ode3
ltx/gr_gr_cog/me.m10.d25:meMA.Ode3C1T.text	Πεποικιλμένη, κροσσωτοῖς ἐν χρυσοῖς ὡς Βασίλισσα, τοῦ Δεσπότου καὶ Θεοῦ, ἐκ δεξιῶν νῦν παρίσταται, Δέσποινα πρεσβεύουσα, ὑπὲρ τῶν δουλων σου.
ltx/gr_gr_cog/me.m10.d25:meMA.Ode3H.greekmelody	@ltx/gr_gr_cog/he.h.m4:heHE.OukEnSofia.greekname
ltx/gr_gr_cog/me.m10.d25:meMA.Ode3H.incipit	@ltx/gr_gr_cog/he.h.m4:heHE.OukEnSofia.incipit
ltx/gr_gr_cog/me.m10.d25:meMA.Ode3H.melody	@ltx/gr_gr_cog/he.h.m4:heHE.OukEnSofia.melody
ltx/gr_gr_cog/me.m10.d25:meMA.Ode3H.mode	@ltx/gr_gr_cog/miscellanea:misc.Mode4
ltx/gr_gr_cog/me.m10.d25:meMA.Ode3H.ode	@ltx/gr_gr_cog/miscellanea:misc.Ode3
ltx/gr_gr_cog/me.m10.d25:meMA.Ode3H.text	@ltx/gr_gr_cog/he.h.m4:heHE.OukEnSofia.text
ltx/gr_gr_cog/me.m10.d25:meMA.Ode3Kathisma1.greekmelody	@ltx/gr_gr_cog/he.a.m3:heAU.TinOraiotita.greekname
ltx/gr_gr_cog/me.m10.d25:meMA.Ode3Kathisma1.incipit	Τὸν ὁμοούσιον, τοῦ πρὸ αἰώνων…
ltx/gr_gr_cog/me.m10.d25:meMA.Ode3Kathisma1.melody	@ltx/gr_gr_cog/he.a.m3:heAU.TinOraiotita.name
ltx/gr_gr_cog/me.m10.d25:meMA.Ode3Kathisma1.mode	@ltx/gr_gr_cog/miscellanea:misc.Mode3
ltx/gr_gr_cog/me.m10.d25:meMA.Ode3Kathisma1.text	Τὸν ὁμοούσιον, τοῦ πρὸ αἰώνων Πατρός, Υἱὸν καὶ Κύριον, ἔνσαρκον Λόγον Χριστόν, ἀνεκηρύξατε σαφῶς, ἀδιαιρέτως Ἅγιοι· ὅθεν μέχρις αἵματος, ὑπὲρ τούτου ἀνέστησε, πᾶσαν στηλιτεύσαντες, τοῦ Ἀρείου δυσσέβειαν· διὸ ἐν παῤῥησίᾳ ὑπάρχοντες, πρεσβεύσατε ὑπὲρ τῶν ψυχῶν ἡμῶν.
ltx/gr_gr_cog/me.m10.d25:meMA.Ode3KathismaSt.incipit	@ltx/gr_gr_cog/oc.m3.d4:ocMA.Kathisma23.incipit
ltx/gr_gr_cog/me.m10.d25:meMA.Ode3KathismaSt.melody	@ltx/gr_gr_cog/he.a.m3:heAU.TinOraiotita.name
ltx/gr_gr_cog/me.m10.d25:meMA.Ode3KathismaSt.mode	@ltx/gr_gr_cog/miscellanea:misc.Mode3
ltx/gr_gr_cog/me.m10.d25:meMA.Ode3KathismaSt.text	@ltx/gr_gr_cog/oc.m3.d4:ocMA.Kathisma23.text
ltx/gr_gr_cog/me.m10.d25:meMA.Ode3KathismaT.incipit	@ltx/gr_gr_cog/me.m02.d03:meMA.Ode3KathismaT.incipit
ltx/gr_gr_cog/me.m10.d25:meMA.Ode3KathismaT.melody	@ltx/gr_gr_cog/he.a.m3:heAU.TinOraiotita.name
ltx/gr_gr_cog/me.m10.d25:meMA.Ode3KathismaT.mode	@ltx/gr_gr_cog/miscellanea:misc.Mode3
ltx/gr_gr_cog/me.m10.d25:meMA.Ode3KathismaT.text	@ltx/gr_gr_cog/me.m02.d03:meMA.Ode3KathismaT.text
ltx/gr_gr_cog/me.m10.d25:meMA.Ode4C11.greekmelody	@ltx/gr_gr_cog/he.h.m4:heHE.OKathimenosEnDoxi.greekname
ltx/gr_gr_cog/me.m10.d25:meMA.Ode4C11.incipit	Ῥωμαλέᾳ διανοίᾳ, καὶ τελείῳ φρονήματι…
ltx/gr_gr_cog/me.m10.d25:meMA.Ode4C11.melody	@ltx/gr_gr_cog/he.h.m4:heHE.OKathimenosEnDoxi.name
ltx/gr_gr_cog/me.m10.d25:meMA.Ode4C11.mode	@ltx/gr_gr_cog/miscellanea:misc.Mode4
ltx/gr_gr_cog/me.m10.d25:meMA.Ode4C11.ode	@ltx/gr_gr_cog/miscellanea:misc.Ode4
ltx/gr_gr_cog/me.m10.d25:meMA.Ode4C11.text	Ῥωμαλέᾳ διανοίᾳ, καὶ τελείῳ φρονήματι, τὴν ὀρθοδοξίαν, Μάρτυρες Κυρίου κρατύναντες, μαρτυρικῶς τὸν ἀγῶνα ἐτελέσατε, τῆς αἱρέσεως, τὸν σκοτασμὸν ἀπελάσαντες.
ltx/gr_gr_cog/me.m10.d25:meMA.Ode4C12.incipit	Ὁ τὸν Λόγον μὴ κηρύξας…
ltx/gr_gr_cog/me.m10.d25:meMA.Ode4C12.melody	@ltx/gr_gr_cog/he.h.m4:heHE.OKathimenosEnDoxi.name
ltx/gr_gr_cog/me.m10.d25:meMA.Ode4C12.mode	@ltx/gr_gr_cog/miscellanea:misc.Mode4
ltx/gr_gr_cog/me.m10.d25:meMA.Ode4C12.ode	@ltx/gr_gr_cog/miscellanea:misc.Ode4
ltx/gr_gr_cog/me.m10.d25:meMA.Ode4C12.text	Ὁ τὸν Λόγον μὴ κηρύξας, τῷ Πατρὶ ὁμοούσιον, ὡς μανεὶς ἀφρόνως, Μάρτυρες νευραῖς ἀπηγχόνισται, τῶν ἱερῶν ὑμῶν πόνων καὶ βεβύθισται, τῶν αἱμάτων, ταῖς ἐπιῤῥοαῖς θείᾳ χάριτι.
ltx/gr_gr_cog/me.m10.d25:meMA.Ode4C13.incipit	Στρατευθέντες τῷ Κυρίῳ, διὰ πίστεως…
ltx/gr_gr_cog/me.m10.d25:meMA.Ode4C13.melody	@ltx/gr_gr_cog/he.h.m4:heHE.OKathimenosEnDoxi.name
ltx/gr_gr_cog/me.m10.d25:meMA.Ode4C13.mode	@ltx/gr_gr_cog/miscellanea:misc.Mode4
ltx/gr_gr_cog/me.m10.d25:meMA.Ode4C13.ode	@ltx/gr_gr_cog/miscellanea:misc.Ode4
ltx/gr_gr_cog/me.m10.d25:meMA.Ode4C13.text	Στρατευθέντες τῷ Κυρίῳ, διὰ πίστεως Ἅγιοι, καὶ ἐνηθληκότες, τοῖς ἐπουρανίοις στρατεύμασι, συνηριθμήθητε· ὅθεν μακαρίζεσθε, στηριγμὸς ἡμῶν, καὶ φωτισμός χρηματίσαντες.
ltx/gr_gr_cog/me.m10.d25:meMA.Ode4C14.incipit	Οἱ μαζοὶ τῆς Ἐκκλησίας, οἱ…
ltx/gr_gr_cog/me.m10.d25:meMA.Ode4C14.melody	@ltx/gr_gr_cog/he.h.m4:heHE.OKathimenosEnDoxi.name
ltx/gr_gr_cog/me.m10.d25:meMA.Ode4C14.mode	@ltx/gr_gr_cog/miscellanea:misc.Mode4
ltx/gr_gr_cog/me.m10.d25:meMA.Ode4C14.ode	@ltx/gr_gr_cog/miscellanea:misc.Ode4
ltx/gr_gr_cog/me.m10.d25:meMA.Ode4C14.text	Οἱ μαζοὶ τῆς Ἐκκλησίας, οἱ τὸ γάλα προχέοντες, τῆς ὀρθοδοξίας, καὶ τοὺς εὐσεβεῖς διατρέφοντες, Μαρκιανὸς ὁ γενναῖος καὶ Μαρτύριος, εὐφημείσθωσαν, χαρμονικοῖς μελῳδήμασιν.
ltx/gr_gr_cog/me.m10.d25:meMA.Ode4C1T.incipit	Ἱερὸς πάλαι Προφήτης, ὄρος θεῖον…
ltx/gr_gr_cog/me.m10.d25:meMA.Ode4C1T.melody	@ltx/gr_gr_cog/he.h.m4:heHE.OKathimenosEnDoxi.name
ltx/gr_gr_cog/me.m10.d25:meMA.Ode4C1T.mode	@ltx/gr_gr_cog/miscellanea:misc.Mode4
ltx/gr_gr_cog/me.m10.d25:meMA.Ode4C1T.ode	@ltx/gr_gr_cog/miscellanea:misc.Ode4
ltx/gr_gr_cog/me.m10.d25:meMA.Ode4C1T.text	Ἱερὸς πάλαι Προφήτης, ὄρος θεῖον ἐκάλεσεν, ἀρεταῖς Παρθένε, πάναγνε διόλου κατάσκιον, ἐξ οὗ σωτήριος Λόγος πεφανέρωται, εἰς ἀνάπλασιν, καὶ φωτισμὸν τῶν ψυχῶν ἡμῶν.
ltx/gr_gr_cog/me.m10.d25:meMA.Ode5C11.greekmelody	@ltx/gr_gr_cog/he.h.m4:heHE.AseveisOukOpsontai.greekname
ltx/gr_gr_cog/me.m10.d25:meMA.Ode5C11.incipit	Σοφωτάτων ὤφθητε, δογμάτων ὀπαδοί, Παύλου…
ltx/gr_gr_cog/me.m10.d25:meMA.Ode5C11.melody	@ltx/gr_gr_cog/he.h.m4:heHE.AseveisOukOpsontai.name
ltx/gr_gr_cog/me.m10.d25:meMA.Ode5C11.mode	@ltx/gr_gr_cog/miscellanea:misc.Mode4
ltx/gr_gr_cog/me.m10.d25:meMA.Ode5C11.ode	@ltx/gr_gr_cog/miscellanea:misc.Ode5
ltx/gr_gr_cog/me.m10.d25:meMA.Ode5C11.text	Σοφωτάτων ὤφθητε, δογμάτων ὀπαδοί, Παύλου θείου ἱερουργοῦ, οὗ τοὺς τρόπους Μάρτυρες ἐκμιμησάμενοι, καρτερῶς ἠθλήσατε, καὶ νομίμως κατεστέφθητε.
ltx/gr_gr_cog/me.m10.d25:meMA.Ode5C12.incipit	Ὡς ἀστέρες λάμπετε, ἐν ὕψει…
ltx/gr_gr_cog/me.m10.d25:meMA.Ode5C12.melody	@ltx/gr_gr_cog/he.h.m4:heHE.AseveisOukOpsontai.name
ltx/gr_gr_cog/me.m10.d25:meMA.Ode5C12.mode	@ltx/gr_gr_cog/miscellanea:misc.Mode4
ltx/gr_gr_cog/me.m10.d25:meMA.Ode5C12.ode	@ltx/gr_gr_cog/miscellanea:misc.Ode5
ltx/gr_gr_cog/me.m10.d25:meMA.Ode5C12.text	Ὡς ἀστέρες λάμπετε, ἐν ὕψει τῆς σεπτῆς, Ἐκκλησίας περιφανῶς, σκότος τὸ βαθύτατον ἀποδιώκοντες, τῆς Ἀρείου Ἅγιοι, γενναιότατοι αἱρέσεως.
ltx/gr_gr_cog/me.m10.d25:meMA.Ode5C13.incipit	Μακρυνθέντες Ἅγιοι, τοῦ βίου τῶν…
ltx/gr_gr_cog/me.m10.d25:meMA.Ode5C13.melody	@ltx/gr_gr_cog/he.h.m4:heHE.AseveisOukOpsontai.name
ltx/gr_gr_cog/me.m10.d25:meMA.Ode5C13.mode	@ltx/gr_gr_cog/miscellanea:misc.Mode4
ltx/gr_gr_cog/me.m10.d25:meMA.Ode5C13.ode	@ltx/gr_gr_cog/miscellanea:misc.Ode5
ltx/gr_gr_cog/me.m10.d25:meMA.Ode5C13.text	Μακρυνθέντες Ἅγιοι, τοῦ βίου τῶν τερπνῶν, ᾠκειώθητε τῷ Χριστῷ, βραχυτάτῳ αἵματι, καὶ τὴν ἀσάλευτον, βασιλείαν ἔνδοξοι, Ἀθλοφόροι ἐκληρώσασθε.
ltx/gr_gr_cog/me.m10.d25:meMA.Ode5C1T.incipit	Ἀληθῶς Θεοῦ Υἱόν, ἐκύησας Ἁγνή…
ltx/gr_gr_cog/me.m10.d25:meMA.Ode5C1T.melody	@ltx/gr_gr_cog/he.h.m4:heHE.AseveisOukOpsontai.name
ltx/gr_gr_cog/me.m10.d25:meMA.Ode5C1T.mode	@ltx/gr_gr_cog/miscellanea:misc.Mode4
ltx/gr_gr_cog/me.m10.d25:meMA.Ode5C1T.ode	@ltx/gr_gr_cog/miscellanea:misc.Ode5
ltx/gr_gr_cog/me.m10.d25:meMA.Ode5C1T.text	Ἀληθῶς Θεοῦ Υἱόν, ἐκύησας Ἁγνή, ὁμοούσιον τῷ Πατρί, καὶ τῷ θείῳ Πνεύματι θεογεννήτρια, ὃν ἀπαύστως αἴτησαι, οἰκτειρῆσαι τὰς ψυχὰς ἡμῶν.
ltx/gr_gr_cog/me.m10.d25:meMA.Ode6C11.greekmelody	@ltx/gr_gr_cog/he.h.m4:heHE.IlthonEisTaVathi.greekname
ltx/gr_gr_cog/me.m10.d25:meMA.Ode6C11.incipit	Ῥήμασι ποιμένος θεοσόφου, σοφοὶ ἀκολουθοῦντες…
ltx/gr_gr_cog/me.m10.d25:meMA.Ode6C11.melody	@ltx/gr_gr_cog/he.h.m4:heHE.IlthonEisTaVathi.name
ltx/gr_gr_cog/me.m10.d25:meMA.Ode6C11.mode	@ltx/gr_gr_cog/miscellanea:misc.Mode4
ltx/gr_gr_cog/me.m10.d25:meMA.Ode6C11.ode	@ltx/gr_gr_cog/miscellanea:misc.Ode6
ltx/gr_gr_cog/me.m10.d25:meMA.Ode6C11.text	Ῥήμασι ποιμένος θεοσόφου, σοφοὶ ἀκολουθοῦντες, τὴν ὀρθόδοξον πίστιν τηρεῖτε, Μαρκιανέ, καὶ θεῖε Μαρτύριε, ὑπὲρ ἧς ἐσφαγιάσθητε.
ltx/gr_gr_cog/me.m10.d25:meMA.Ode6C12.incipit	Τίμιος ἐνώπιον Κυρίου, ὁ θάνατος…
ltx/gr_gr_cog/me.m10.d25:meMA.Ode6C12.melody	@ltx/gr_gr_cog/he.h.m4:heHE.IlthonEisTaVathi.name
ltx/gr_gr_cog/me.m10.d25:meMA.Ode6C12.mode	@ltx/gr_gr_cog/miscellanea:misc.Mode4
ltx/gr_gr_cog/me.m10.d25:meMA.Ode6C12.ode	@ltx/gr_gr_cog/miscellanea:misc.Ode6
ltx/gr_gr_cog/me.m10.d25:meMA.Ode6C12.text	Τίμιος ἐνώπιον Κυρίου, ὁ θάνατος ὡράθη, ὑμῶν Ἅγιοι, σοφοὶ ὁπλῖται· ὅθεν τιμαῖς, ἐτησίοις ἔνδοξοι, ὑπὸ πάντων μακαρίζεσθε.
ltx/gr_gr_cog/me.m10.d25:meMA.Ode6C13.incipit	Ὑμᾶς τοὺς γενναίους Ἀθλοφόρους, Μαρκιανὲ…
ltx/gr_gr_cog/me.m10.d25:meMA.Ode6C13.melody	@ltx/gr_gr_cog/he.h.m4:heHE.IlthonEisTaVathi.name
ltx/gr_gr_cog/me.m10.d25:meMA.Ode6C13.mode	@ltx/gr_gr_cog/miscellanea:misc.Mode4
ltx/gr_gr_cog/me.m10.d25:meMA.Ode6C13.ode	@ltx/gr_gr_cog/miscellanea:misc.Ode6
ltx/gr_gr_cog/me.m10.d25:meMA.Ode6C13.text	Ὑμᾶς τοὺς γενναίους Ἀθλοφόρους, Μαρκιανὲ παμμάκαρ, καὶ Μαρτύριε πηγὴν θαυμάτων, ἡ τοῦ Χριστοῦ, Ἐκκλησία ἔχουσα, αἰωνίως ἐπαγάλλεται.
ltx/gr_gr_cog/me.m10.d25:meMA.Ode6C1T.incipit	Στόματι καὶ γλώσσῃ σε Μητέρα…
ltx/gr_gr_cog/me.m10.d25:meMA.Ode6C1T.melody	@ltx/gr_gr_cog/he.h.m4:heHE.IlthonEisTaVathi.name
ltx/gr_gr_cog/me.m10.d25:meMA.Ode6C1T.mode	@ltx/gr_gr_cog/miscellanea:misc.Mode4
ltx/gr_gr_cog/me.m10.d25:meMA.Ode6C1T.ode	@ltx/gr_gr_cog/miscellanea:misc.Ode6
ltx/gr_gr_cog/me.m10.d25:meMA.Ode6C1T.text	Στόματι καὶ γλώσσῃ σε Μητέρα, παναληθῶς Παρθένε, τοῦ Θεοῦ ἡμῶν ὁμολογοῦμεν, αὐτὸν Ἁγνή, ἐκτενῶς ἱκέτευε, τοῦ σωθῆναι τὰς ψυχὰς ἡμῶν.
ltx/gr_gr_cog/me.m10.d25:meMA.Ode6H.greekmelody	@ltx/gr_gr_cog/he.h.m4:heHE.IlthonEisTaVathi.greekname
ltx/gr_gr_cog/me.m10.d25:meMA.Ode6H.incipit	@ltx/gr_gr_cog/he.h.m4:heHE.IlthonEisTaVathi.incipit
ltx/gr_gr_cog/me.m10.d25:meMA.Ode6H.melody	@ltx/gr_gr_cog/he.h.m4:heHE.IlthonEisTaVathi.melody
ltx/gr_gr_cog/me.m10.d25:meMA.Ode6H.mode	@ltx/gr_gr_cog/miscellanea:misc.Mode4
ltx/gr_gr_cog/me.m10.d25:meMA.Ode6H.ode	@ltx/gr_gr_cog/miscellanea:misc.Ode6
ltx/gr_gr_cog/me.m10.d25:meMA.Ode6H.text	@ltx/gr_gr_cog/he.h.m4:heHE.IlthonEisTaVathi.text
ltx/gr_gr_cog/me.m10.d25:meMA.Ode7C11.greekmelody	@ltx/gr_gr_cog/he.h.m4:heHE.AvramiaioiPote.greekname
ltx/gr_gr_cog/me.m10.d25:meMA.Ode7C11.incipit	Ἰχνηλατοῦντες καλῶς, τὸν ἱερὸν Ποιμένα…
ltx/gr_gr_cog/me.m10.d25:meMA.Ode7C11.melody	@ltx/gr_gr_cog/he.h.m4:heHE.AvramiaioiPote.name
ltx/gr_gr_cog/me.m10.d25:meMA.Ode7C11.mode	@ltx/gr_gr_cog/miscellanea:misc.Mode4
ltx/gr_gr_cog/me.m10.d25:meMA.Ode7C11.ode	@ltx/gr_gr_cog/miscellanea:misc.Ode7
ltx/gr_gr_cog/me.m10.d25:meMA.Ode7C11.text	Ἰχνηλατοῦντες καλῶς, τὸν ἱερὸν Ποιμένα, ὀρθοδοξίᾳ καλλυνόμενοι, χερσὶν ἀνῃρέθητε, κακοδοξούντων μάτην, πανευκλεεῖς ὁπλῖται.
ltx/gr_gr_cog/me.m10.d25:meMA.Ode7C12.incipit	Νομοθεσίας Θεοῦ, ἀπαρατρώτους πίστει, διατηροῦντες…
ltx/gr_gr_cog/me.m10.d25:meMA.Ode7C12.melody	@ltx/gr_gr_cog/he.h.m4:heHE.AvramiaioiPote.name
ltx/gr_gr_cog/me.m10.d25:meMA.Ode7C12.mode	@ltx/gr_gr_cog/miscellanea:misc.Mode4
ltx/gr_gr_cog/me.m10.d25:meMA.Ode7C12.ode	@ltx/gr_gr_cog/miscellanea:misc.Ode7
ltx/gr_gr_cog/me.m10.d25:meMA.Ode7C12.text	Νομοθεσίας Θεοῦ, ἀπαρατρώτους πίστει, διατηροῦντες θεῖοι Μαρτυρες, νομίμως ἠθλήσατε, ὑπὸ χειρῶν ἀνόμων, ἀναιρεθέντες ξίφει.
ltx/gr_gr_cog/me.m10.d25:meMA.Ode7C13.incipit	Μετὰ ταφὴν ἱεράν, τῶν προσιόντων…
ltx/gr_gr_cog/me.m10.d25:meMA.Ode7C13.melody	@ltx/gr_gr_cog/he.h.m4:heHE.AvramiaioiPote.name
ltx/gr_gr_cog/me.m10.d25:meMA.Ode7C13.mode	@ltx/gr_gr_cog/miscellanea:misc.Mode4
ltx/gr_gr_cog/me.m10.d25:meMA.Ode7C13.ode	@ltx/gr_gr_cog/miscellanea:misc.Ode7
ltx/gr_gr_cog/me.m10.d25:meMA.Ode7C13.text	Μετὰ ταφὴν ἱεράν, τῶν προσιόντων πίστει, ὑμῶν τῷ τάφῳ τὰ νοσήματα, ἐνθάπτετε Ἅγιοι, ταῖς πρὸς τὸν Ζωοδότην, ἁγίαις μεσιτείαις.
ltx/gr_gr_cog/me.m10.d25:meMA.Ode7C14.incipit	Ἐκ τῶν πηγῶν μυστικῶς, τῶν…
ltx/gr_gr_cog/me.m10.d25:meMA.Ode7C14.melody	@ltx/gr_gr_cog/he.h.m4:heHE.AvramiaioiPote.name
ltx/gr_gr_cog/me.m10.d25:meMA.Ode7C14.mode	@ltx/gr_gr_cog/miscellanea:misc.Mode4
ltx/gr_gr_cog/me.m10.d25:meMA.Ode7C14.ode	@ltx/gr_gr_cog/miscellanea:misc.Ode7
ltx/gr_gr_cog/me.m10.d25:meMA.Ode7C14.text	Ἐκ τῶν πηγῶν μυστικῶς, τῶν ἱερῶν πλουτοῦντες, τὴν θείαν χάριν τῶν ἰάσεων, πιστοὺς καταρδεύετε, τῶν νοσημάτων πᾶσαν, ξηραίνοντες πλημμύραν.
ltx/gr_gr_cog/me.m10.d25:meMA.Ode7C1T.incipit	Λελυτρωμένοι τῷ σῷ, Θεογεννῆτορ τόκῳ…
ltx/gr_gr_cog/me.m10.d25:meMA.Ode7C1T.melody	@ltx/gr_gr_cog/he.h.m4:heHE.AvramiaioiPote.name
ltx/gr_gr_cog/me.m10.d25:meMA.Ode7C1T.mode	@ltx/gr_gr_cog/miscellanea:misc.Mode4
ltx/gr_gr_cog/me.m10.d25:meMA.Ode7C1T.ode	@ltx/gr_gr_cog/miscellanea:misc.Ode7
ltx/gr_gr_cog/me.m10.d25:meMA.Ode7C1T.text	Λελυτρωμένοι τῷ σῷ, Θεογεννῆτορ τόκῳ, τῆς αἰωνίου κατακρίσεως, τὸ Χαῖρέ σοι κράζομεν ἀεί, εὐλογημένη καὶ κεχαριτωμένη.
ltx/gr_gr_cog/me.m10.d25:meMA.Ode8C11.greekmelody	@ltx/gr_gr_cog/he.h.m4:heHE.LytrotaTouPantos.greekname
ltx/gr_gr_cog/me.m10.d25:meMA.Ode8C11.incipit	Ὥσπερ δύο ἀμνοὶ σφαγιάζεσθε, τὸν…
ltx/gr_gr_cog/me.m10.d25:meMA.Ode8C11.melody	@ltx/gr_gr_cog/he.h.m4:heHE.LytrotaTouPantos.name
ltx/gr_gr_cog/me.m10.d25:meMA.Ode8C11.mode	@ltx/gr_gr_cog/miscellanea:misc.Mode4
ltx/gr_gr_cog/me.m10.d25:meMA.Ode8C11.ode	@ltx/gr_gr_cog/miscellanea:misc.Ode8
ltx/gr_gr_cog/me.m10.d25:meMA.Ode8C11.text	Ὥσπερ δύο ἀμνοὶ σφαγιάζεσθε, τὸν Ἀμνὸν τοῦ Θεοῦ ὁμοούσιον, Πατρὸς ἀνακηρύττοντες, καὶ τραπέζῃ τῇ ἄνω προσενεχθέντες, ἀθλητῶν ὁμηγύρει συντάττεσθε.
ltx/gr_gr_cog/me.m10.d25:meMA.Ode8C12.incipit	Δυναμούμενοι σθένει τοῦ Πνεύματος, ἐξενεύρισαν…
ltx/gr_gr_cog/me.m10.d25:meMA.Ode8C12.melody	@ltx/gr_gr_cog/he.h.m4:heHE.LytrotaTouPantos.name
ltx/gr_gr_cog/me.m10.d25:meMA.Ode8C12.mode	@ltx/gr_gr_cog/miscellanea:misc.Mode4
ltx/gr_gr_cog/me.m10.d25:meMA.Ode8C12.ode	@ltx/gr_gr_cog/miscellanea:misc.Ode8
ltx/gr_gr_cog/me.m10.d25:meMA.Ode8C12.text	Δυναμούμενοι σθένει τοῦ Πνεύματος, ἐξενεύρισαν πλάνης τὸ φρύαγμα, καὶ καρτερῶς ἀθλήσαντες, τοὺς δεινῶς παρεθέντας ταῖς ἀσθενείαις, οἱ πιστοὶ θεραπεύουσι Μάρτυρες.
ltx/gr_gr_cog/me.m10.d25:meMA.Ode8C13.incipit	Ἰατροὶ τῶν πιστῶν χρηματίζοντες, τῶν…
ltx/gr_gr_cog/me.m10.d25:meMA.Ode8C13.melody	@ltx/gr_gr_cog/he.h.m4:heHE.LytrotaTouPantos.name
ltx/gr_gr_cog/me.m10.d25:meMA.Ode8C13.mode	@ltx/gr_gr_cog/miscellanea:misc.Mode4
ltx/gr_gr_cog/me.m10.d25:meMA.Ode8C13.ode	@ltx/gr_gr_cog/miscellanea:misc.Ode8
ltx/gr_gr_cog/me.m10.d25:meMA.Ode8C13.text	Ἰατροὶ τῶν πιστῶν χρηματίζοντες, τῶν παθῶν ἡμῶν Ἅγιοι Μάρτυρες, τὰ χαλεπὰ νοσήματα, καὶ τὰς ἐπαναστάσεις τὰς ἐναντίας, θεραπεύσατε θείαις δεήσεσιν.
ltx/gr_gr_cog/me.m10.d25:meMA.Ode8C1T.incipit	Νεκρωθέντας ἡμᾶς ἀνεζώωσας, τὴν ζωὴν…
ltx/gr_gr_cog/me.m10.d25:meMA.Ode8C1T.melody	@ltx/gr_gr_cog/he.h.m4:heHE.LytrotaTouPantos.name
ltx/gr_gr_cog/me.m10.d25:meMA.Ode8C1T.mode	@ltx/gr_gr_cog/miscellanea:misc.Mode4
ltx/gr_gr_cog/me.m10.d25:meMA.Ode8C1T.ode	@ltx/gr_gr_cog/miscellanea:misc.Ode8
ltx/gr_gr_cog/me.m10.d25:meMA.Ode8C1T.text	Νεκρωθέντας ἡμᾶς ἀνεζώωσας, τὴν ζωὴν τῶν ἁπάντων κυήσασα, Θεοκυῆτορ Δέσποινα, τῶν Μαρτύρων ἡ δόξα, καὶ τῶν ἀνθρώπων, τὸ διάσωσμα καὶ περιτείχισμα
ltx/gr_gr_cog/me.m10.d25:meMA.Ode8C1Tr.incipit	Ἀνυμνοῦμεν Πατέρα ἀγέννητον, τὸν Υἱὸν…
ltx/gr_gr_cog/me.m10.d25:meMA.Ode8C1Tr.melody	@ltx/gr_gr_cog/he.h.m4:heHE.LytrotaTouPantos.name
ltx/gr_gr_cog/me.m10.d25:meMA.Ode8C1Tr.mode	@ltx/gr_gr_cog/miscellanea:misc.Mode4
ltx/gr_gr_cog/me.m10.d25:meMA.Ode8C1Tr.ode	@ltx/gr_gr_cog/miscellanea:misc.Ode8
ltx/gr_gr_cog/me.m10.d25:meMA.Ode8C1Tr.text	Ἀνυμνοῦμεν Πατέρα ἀγέννητον, τὸν Υἱὸν καὶ τὸ Πνεῦμα τὸ Ἅγιον, μίαν οὐσίαν ἄκτιστον, καὶ θεότητα μίαν· Πάντα τὰ ἔργα, εὐλογεῖτε βοῶντες τὸν Κύριον.
ltx/gr_gr_cog/me.m10.d25:meMA.Ode8H.greekmelody	@ltx/gr_gr_cog/he.h.m4:heHE.LytrotaTouPantos.greekname
ltx/gr_gr_cog/me.m10.d25:meMA.Ode8H.incipit	@ltx/gr_gr_cog/he.h.m4:heHE.LytrotaTouPantos.incipit
ltx/gr_gr_cog/me.m10.d25:meMA.Ode8H.melody	@ltx/gr_gr_cog/he.h.m4:heHE.LytrotaTouPantos.melody
ltx/gr_gr_cog/me.m10.d25:meMA.Ode8H.mode	@ltx/gr_gr_cog/miscellanea:misc.Mode4
ltx/gr_gr_cog/me.m10.d25:meMA.Ode8H.ode	@ltx/gr_gr_cog/miscellanea:misc.Ode8
ltx/gr_gr_cog/me.m10.d25:meMA.Ode8H.text	@ltx/gr_gr_cog/he.h.m4:heHE.LytrotaTouPantos.text
ltx/gr_gr_cog/me.m10.d25:meMA.Ode9C11.greekmelody	@ltx/gr_gr_cog/he.h.m4:heHE.EvaMenToTisParakois.greekname
ltx/gr_gr_cog/me.m10.d25:meMA.Ode9C11.incipit	Ἰσχὺϊ νευρούμενοι Χριστοῦ, τὸν θάνατον…
ltx/gr_gr_cog/me.m10.d25:meMA.Ode9C11.melody	@ltx/gr_gr_cog/he.h.m4:heHE.EvaMenToTisParakois.name
ltx/gr_gr_cog/me.m10.d25:meMA.Ode9C11.mode	@ltx/gr_gr_cog/miscellanea:misc.Mode4
ltx/gr_gr_cog/me.m10.d25:meMA.Ode9C11.ode	@ltx/gr_gr_cog/miscellanea:misc.Ode9
ltx/gr_gr_cog/me.m10.d25:meMA.Ode9C11.text	Ἰσχὺϊ νευρούμενοι Χριστοῦ, τὸν θάνατον ἀθλοφόροι οὐκ ἐπτήξατε, ἀλλὰ προθύμως ὑποθέντες, τοῖς ξίφεσιν αὐχένας ἠνύσατε, γενναίως τὸν ἀγῶνα τὸν ἔνθεον· ὅθεν ἀξίως μακαρίζεσθε.
ltx/gr_gr_cog/me.m10.d25:meMA.Ode9C12.incipit	Ὡς δύο ἀστέρες φαεινοί, φωτίζετε…
ltx/gr_gr_cog/me.m10.d25:meMA.Ode9C12.melody	@ltx/gr_gr_cog/he.h.m4:heHE.EvaMenToTisParakois.name
ltx/gr_gr_cog/me.m10.d25:meMA.Ode9C12.mode	@ltx/gr_gr_cog/miscellanea:misc.Mode4
ltx/gr_gr_cog/me.m10.d25:meMA.Ode9C12.ode	@ltx/gr_gr_cog/miscellanea:misc.Ode9
ltx/gr_gr_cog/me.m10.d25:meMA.Ode9C12.text	Ὡς δύο ἀστέρες φαεινοί, φωτίζετε οἰκουμένης τὰ πληρώματα, θείαις τῶν ἄθλων λαμπηδόσι, Μαρκιανὲ σοφὲ καὶ Μαρτύριε, τὸ σκότος τῆς ζοφώδους αἱρέσεως, τῆς τοῦ Ἀρείου ἀπελαύνοντες.
ltx/gr_gr_cog/me.m10.d25:meMA.Ode9C13.incipit	Στεφάνους τῆς δόξης ἐκ Θεοῦ…
ltx/gr_gr_cog/me.m10.d25:meMA.Ode9C13.melody	@ltx/gr_gr_cog/he.h.m4:heHE.EvaMenToTisParakois.name
ltx/gr_gr_cog/me.m10.d25:meMA.Ode9C13.mode	@ltx/gr_gr_cog/miscellanea:misc.Mode4
ltx/gr_gr_cog/me.m10.d25:meMA.Ode9C13.ode	@ltx/gr_gr_cog/miscellanea:misc.Ode9
ltx/gr_gr_cog/me.m10.d25:meMA.Ode9C13.text	Στεφάνους τῆς δόξης ἐκ Θεοῦ, νικήσαντες τὸν τυφλόνουν Μακεδόνιον, ἤδη εἰλήφατε ἀξίως, καὶ θρόνῳ τοῦ Δεσπότου παρίστασθε, ἡμῖν ἁμαρτιῶν ἐξαιτούμενοι, λύσιν τελείαν Ἀξιάγαστοι.
ltx/gr_gr_cog/me.m10.d25:meMA.Ode9C14.incipit	Ἡ μνήμη ἡ ἔνθεος ὑμῶν…
ltx/gr_gr_cog/me.m10.d25:meMA.Ode9C14.melody	@ltx/gr_gr_cog/he.h.m4:heHE.EvaMenToTisParakois.name
ltx/gr_gr_cog/me.m10.d25:meMA.Ode9C14.mode	@ltx/gr_gr_cog/miscellanea:misc.Mode4
ltx/gr_gr_cog/me.m10.d25:meMA.Ode9C14.ode	@ltx/gr_gr_cog/miscellanea:misc.Ode9
ltx/gr_gr_cog/me.m10.d25:meMA.Ode9C14.text	Ἡ μνήμη ἡ ἔνθεος ὑμῶν, ἀνέτειλε τοῦ ἡλίου τηλαυγέστερον, πάντων φωτίζουσα καρδίας, τῶν ταύτην ἐκτελούντων Μακάριοι, ἐν ᾗ ἐκδυσωπεῖτε τὸν Κύριον, σκότους πταισμάτων ἡμᾶς ῥύσασθαι.
ltx/gr_gr_cog/me.m10.d25:meMA.Ode9C1T.incipit	Φωτὸς οἰκητήριον Ἁγνὴ ὑπάρχουσα, τῆς…
ltx/gr_gr_cog/me.m10.d25:meMA.Ode9C1T.melody	@ltx/gr_gr_cog/he.h.m4:heHE.EvaMenToTisParakois.name
ltx/gr_gr_cog/me.m10.d25:meMA.Ode9C1T.mode	@ltx/gr_gr_cog/miscellanea:misc.Mode4
ltx/gr_gr_cog/me.m10.d25:meMA.Ode9C1T.ode	@ltx/gr_gr_cog/miscellanea:misc.Ode9
ltx/gr_gr_cog/me.m10.d25:meMA.Ode9C1T.text	Φωτὸς οἰκητήριον Ἁγνὴ ὑπάρχουσα, τῆς ψυχῆς μου κόρας φώτισον, ἀμαυρωθείσας ἀμελείᾳ, καὶ σκότος ῥαθυμίας βαθύτατον, ἀεὶ περικειμένας πανάμωμε, ὅπως ἐν πίστει μακαρίζω σε.
ltx/gr_gr_cog/me.m10.d25:meMA.Ode9H.greekmelody	@ltx/gr_gr_cog/he.h.m4:heHE.EvaMenToTisParakois.greekname
ltx/gr_gr_cog/me.m10.d25:meMA.Ode9H.incipit	@ltx/gr_gr_cog/he.h.m4:heHE.EvaMenToTisParakois.incipit
ltx/gr_gr_cog/me.m10.d25:meMA.Ode9H.melody	@ltx/gr_gr_cog/he.h.m4:heHE.EvaMenToTisParakois.melody
ltx/gr_gr_cog/me.m10.d25:meMA.Ode9H.mode	@ltx/gr_gr_cog/miscellanea:misc.Mode4
ltx/gr_gr_cog/me.m10.d25:meMA.Ode9H.ode	@ltx/gr_gr_cog/miscellanea:misc.Ode9
ltx/gr_gr_cog/me.m10.d25:meMA.Ode9H.text	@ltx/gr_gr_cog/he.h.m4:heHE.EvaMenToTisParakois.text
ltx/gr_gr_cog/me.m10.d25:meMA.Oikos1.text	Ὡς ὑπηρέται εὐσεβῶς Θεοῦ τοῦ φιλανθρώπου, Δυὰς εὐλογημένη, προφθάσατέ με τάχος, λυτρούμενοί με τῶν δεινῶν, λόγον μοι σοφίας χορηγοῦντες, τὴν ὑμῶν ἀνευφημοῦντι ἄθλησιν, ἣν ὑπὲρ τῆς πίστεως Ἅγιοι, γνώμῃ αδιστάκτῳ ὑποστάντες, τῶν στεφάνων ἐτύχετε τῶν ἐπουρανίων, χοροῖς τε τῶν Ἀθλητῶν καὶ Ἀποστόλων, Διδασκάλων καὶ σεπτῶν Ἀρχιερέων συγχαίρετε ἀεί, ὡς κήρυκες Θεοῦ Λόγου, ὡς τῆς Τριάδος ὑπέρμαχοι ἄριστοι.
ltx/gr_gr_cog/me.m10.d25:meVE.Apolytikion1ger.greekmelody	@ltx/gr_gr_cog/he.a.m3:heAU.TheiasPisteos.greekname
ltx/gr_gr_cog/me.m10.d25:meVE.Apolytikion1ger.incipit	Ζῆλον ἔνθεον, ἀναλαβόντες, ἠμαυρώσατε, Ἀρείου…
ltx/gr_gr_cog/me.m10.d25:meVE.Apolytikion1ger.melody	@ltx/gr_gr_cog/he.a.m3:heAU.TheiasPisteos.name
ltx/gr_gr_cog/me.m10.d25:meVE.Apolytikion1ger.mode	@ltx/gr_gr_cog/miscellanea:misc.Mode3
ltx/gr_gr_cog/me.m10.d25:meVE.Apolytikion1ger.poet	@ltx/gr_gr_cog/poets:po.Gerasimou
ltx/gr_gr_cog/me.m10.d25:meVE.Apolytikion1ger.text	Ζῆλον ἔνθεον, ἀναλαβόντες, ἠμαυρώσατε, Ἀρείου πλάνην, ὁμοούσιον Τριάδα κηρύττοντες, Μαρκιανὲ καὶ θεόφρον Μαρτύριε, Ὀρθοδοξίας οἱ ἄσειστοι πρόβολοι. Θεῖοι Μάρτυρες, Χριστῷ τῷ Θεῷ πρεσβεύσατε, δωρήσασθαι ἡμῖν τὸ μέγα ἔλεος.
ltx/gr_gr_cog/me.m10.d25:meVE.AposGlory.incipit	Οἱ νοεροὶ τῆς Ἐκκλησίας φωστῆρες…
ltx/gr_gr_cog/me.m10.d25:meVE.AposGlory.melody	
ltx/gr_gr_cog/me.m10.d25:meVE.AposGlory.mode	@ltx/gr_gr_cog/miscellanea:misc.Mode3
ltx/gr_gr_cog/me.m10.d25:meVE.AposGlory.text	Οἱ νοεροὶ τῆς Ἐκκλησίας φωστῆρες, καὶ Τριάδος ὑπέρμαχοι, Μαρκιανὸς καὶ Μαρτύριος, τῷ θυρεῷ τῆς πίστεως τὰς αἱρέσεις τρεψάμενοι, ὀρθοδοξίας φωτὶ τὸν κόσμον κατεφαίδρυναν· Παύλῳ δὲ πειθαρχοῦντες ἰσαποστόλῳ· ποιμένι καὶ διδασκάλῳ τῶν ἀληθῶν δογμάτων, Ἀρείου καὶ Νεστορίου καθεῖλον τὴν διαίρεσιν, Σαβελλίου καὶ Σεβήρου τὴν σύγχυσιν ἐκτρεπόμενοι, καὶ τριαδικῶς θεολογοῦντες μονάδα, καὶ τὸν ἐκ Παρθένου σαρκωθέντα Θεόν, ἐν δυσὶ ταῖς οὐσίαις ἕνα Υἱόν, εὐσεβῶς πᾶσιν ἀνυμνεῖν οἱ πανεύφημοι ἐκήρυξαν· Διὸ στεφάνους τῆς νίκης οὐρανόθεν κομισάμενοι οἱ θεσπέσιοι, αἰτοῦνται ἡμῖν τὸ μέγα ἔλεος.
ltx/gr_gr_cog/me.m10.d25:meVE.AposStavrotheotokion.greekmelody	@ltx/gr_gr_cog/he.a.m3:heAU.MegaliTouStavrouSou.greekname
ltx/gr_gr_cog/me.m10.d25:meVE.AposStavrotheotokion.incipit	Ὁρῶσα τὸν ἐκ σοῦ τεχθέντα…
ltx/gr_gr_cog/me.m10.d25:meVE.AposStavrotheotokion.melody	@ltx/gr_gr_cog/he.a.m3:heAU.MegaliTouStavrouSou.name
ltx/gr_gr_cog/me.m10.d25:meVE.AposStavrotheotokion.mode	@ltx/gr_gr_cog/miscellanea:misc.Mode3
ltx/gr_gr_cog/me.m10.d25:meVE.AposStavrotheotokion.text	Ὁρῶσα τὸν ἐκ σοῦ τεχθέντα Παναμώμητε, κρεμάμενον ἐν ξύλῳ, ὠλόλυζες βοῶσα· Ποθεινότατόν μου Τέκνον, ποῦ σου ἔδυ τὸ κάλλος, τὸ καλλωπίσαν τῶν ἀνθρώπων τὴν φύσιν.
ltx/gr_gr_cog/me.m10.d25:meVE.AposTheotokion.incipit	@ltx/gr_gr_cog/oc.m3.d2:ocMA.AposTheotokion.incipit
ltx/gr_gr_cog/me.m10.d25:meVE.AposTheotokion.melody	
ltx/gr_gr_cog/me.m10.d25:meVE.AposTheotokion.mode	@ltx/gr_gr_cog/miscellanea:misc.Mode3
ltx/gr_gr_cog/me.m10.d25:meVE.AposTheotokion.text	@ltx/gr_gr_cog/oc.m3.d2:ocMA.AposTheotokion.text
ltx/gr_gr_cog/me.m10.d25:meVE.SticGlory.incipit	Μαθηταὶ καὶ ὀπαδοὶ γεγονότες, τοῦ…
ltx/gr_gr_cog/me.m10.d25:meVE.SticGlory.melody	
ltx/gr_gr_cog/me.m10.d25:meVE.SticGlory.mode	@ltx/gr_gr_cog/miscellanea:misc.Mode1
ltx/gr_gr_cog/me.m10.d25:meVE.SticGlory.poet	@ltx/gr_gr_cog/poets:po.Germanou
ltx/gr_gr_cog/me.m10.d25:meVE.SticGlory.text	Μαθηταὶ καὶ ὀπαδοὶ γεγονότες, τοῦ τῆς ὁμοουσίου Τριάδος ὁμολογητοῦ καὶ κήρυκος, καὶ σὺν αὐτῷ ὑπὲρ αὐτῆς διωκόμενοι Μακάριοι, τὸν διὰ ξίφους θάνατον, τῶν αἱρετικῶν γλωσσαλγιῶν προεκρίνατε· ὅθεν καὶ μαρτυρικοῖς στεφάνοις κοσμηθέντες παρὰ Θεοῦ, καὶ παῤῥησίαν λαβόντες, πρεσβεύσατε τοῦ ῥυσθῆναι ἐκ κινδύνων, τοὺς τιμῶντας τὴν μνήμην ὑμῶν.
ltx/gr_gr_cog/me.m10.d25:meVE.SticStavrotheotokion.greekmelody	@ltx/gr_gr_cog/he.a.m1:heAU.TonOuranionTagmaton.greekname
ltx/gr_gr_cog/me.m10.d25:meVE.SticStavrotheotokion.incipit	Ὑπὲρ ἡμῶν ὁ Υἱός σου,παθεῖν…
ltx/gr_gr_cog/me.m10.d25:meVE.SticStavrotheotokion.melody	@ltx/gr_gr_cog/he.a.m1:heAU.TonOuranionTagmaton.name
ltx/gr_gr_cog/me.m10.d25:meVE.SticStavrotheotokion.mode	@ltx/gr_gr_cog/miscellanea:misc.Mode1
ltx/gr_gr_cog/me.m10.d25:meVE.SticStavrotheotokion.text	Ὑπὲρ ἡμῶν ὁ Υἱός σου,παθεῖν ἠνέσχετο, ἵνα τῷ τούτου πάθει, τὴν ἀπάθειαν πᾶσι, παράσχῃ Θεοτόκε· ὅθεν αὐτόν, καθικέτευε πάντοτε, παθῶν παντοίων με ῥύσασθαι, καὶ ψυχῆς, καὶ τοῦ σώματος πρεσβείαις σου.
ltx/gr_gr_cog/me.m10.d25:meVE.SticTheotokion.greekmelody	@ltx/gr_gr_cog/he.a.m1:heAU.TonOuranionTagmaton.greekname
ltx/gr_gr_cog/me.m10.d25:meVE.SticTheotokion.incipit	Γνώμῃ σαθρᾷ ὀλισθήσας, γυμνὸς κατάκειμαι…
ltx/gr_gr_cog/me.m10.d25:meVE.SticTheotokion.melody	@ltx/gr_gr_cog/he.a.m1:heAU.TonOuranionTagmaton.name
ltx/gr_gr_cog/me.m10.d25:meVE.SticTheotokion.mode	@ltx/gr_gr_cog/miscellanea:misc.Mode1
ltx/gr_gr_cog/me.m10.d25:meVE.SticTheotokion.text	Γνώμῃ σαθρᾷ ὀλισθήσας, γυμνὸς κατάκειμαι, καὶ πρὸς τὴν σὴν Παρθένε, καταφεύγω γαλήνην, ἐκ ζάλης ἐναντίας καὶ πειρασμῶν, πολυτρόπων με λύτρωσαι, ἵνα ὑμνῶ σου τὴν χάριν θεοπρεπῶς, Θεοτόκε ἀειπάρθενε.
ltx/gr_gr_cog/me.m10.d25:meVE.Stichera01.greekmelody	@ltx/gr_gr_cog/he.a.m4:heAU.OsGennaionEnMartysi.greekname
ltx/gr_gr_cog/me.m10.d25:meVE.Stichera01.incipit	Οἱ τὸν δρόμον τελέσαντες, καὶ…
ltx/gr_gr_cog/me.m10.d25:meVE.Stichera01.melody	@ltx/gr_gr_cog/he.a.m4:heAU.OsGennaionEnMartysi.name
ltx/gr_gr_cog/me.m10.d25:meVE.Stichera01.mode	@ltx/gr_gr_cog/miscellanea:misc.Mode4
ltx/gr_gr_cog/me.m10.d25:meVE.Stichera01.text	Οἱ τὸν δρόμον τελέσαντες, καὶ τὴν πίστιν τηρήσαντες, μαρτυρίου στέφανον ἀνεδήσαντο, Μαρκιανὸς καὶ Μαρτύριος, οἱ πύργοι οἱ ἄσειστοι, Ἐκκλησίας οἱ μαζοί, οἱ τὸ γάλα τὸ ἄδολον, ἀναβλύζοντες, οἱ φαιδροὶ μαργαρῖται, οἱ φωστῆρες, οἱ τὴν κτίσιν ταῖς ἀκτῖσι, τῆς εὐσεβείας πυρσεύοντες.
ltx/gr_gr_cog/me.m10.d25:meVE.Stichera02.incipit	Μίαν γνώμην προφέρουσα, καὶ τὸ…
ltx/gr_gr_cog/me.m10.d25:meVE.Stichera02.melody	@ltx/gr_gr_cog/he.a.m4:heAU.OsGennaionEnMartysi.name
ltx/gr_gr_cog/me.m10.d25:meVE.Stichera02.mode	@ltx/gr_gr_cog/miscellanea:misc.Mode4
ltx/gr_gr_cog/me.m10.d25:meVE.Stichera02.text	Μίαν γνώμην προφέρουσα, καὶ τὸ ἓν συμφρονήσασα, ἡ δυὰς ἡ ἔνθεος, τὴν διαίρεσιν, τὴν τοῦ Ἀρείου διέλυσε, διδάσκουσα σέβεσθαι, συναΐδιον Πατρί, τὸν Υἱὸν καὶ συνάναρχον, καὶ τῷ Πνεύματι, ἐν μονάδι Τριάδα, καὶ Μονάδα, ἐν Τριάδι μίαν φύσιν, τρισὶ προσώποις ἀμέριστον.
ltx/gr_gr_cog/me.m10.d25:meVE.Stichera03.incipit	Ὁπαδοὶ καὶ ὁμότροποι, μιμηταί, καὶ…
ltx/gr_gr_cog/me.m10.d25:meVE.Stichera03.melody	@ltx/gr_gr_cog/he.a.m4:heAU.OsGennaionEnMartysi.name
ltx/gr_gr_cog/me.m10.d25:meVE.Stichera03.mode	@ltx/gr_gr_cog/miscellanea:misc.Mode4
ltx/gr_gr_cog/me.m10.d25:meVE.Stichera03.text	Ὁπαδοὶ καὶ ὁμότροποι, μιμηταί, καὶ ὁμόζηλοι, τοῦ Ἱεροκήρυκος Παύλου ὤφθητε, καὶ τῇ ἐκχύσει τοῦ αἵματος, ἐχθροὺς ἐβυθίσατε· καὶ αἱρέσεων δεινῶν, ἐξηράνατε χείμαῤῥον, καὶ ἐδείχθητε, ποταμὸς εὐσεβείας καταρδεύων, τοῦ Χριστοῦ τὴν Ἐκκλησίαν, Μαρκιανὲ καὶ Μαρτύριε.
