ltx/gr_gr_cog/eu.churchdooropening:euCDO.Key0100.title	ΘΥΡΑΝΟΙΞΙΑ ΝΑΟΥ
ltx/gr_gr_cog/eu.churchdooropening:euCDO.Key0101.title	ΕΥΧΗ ΑΓΙΑΣΜΟΥ
ltx/gr_gr_cog/eu.churchdooropening:euCDO.Key0102.text	Κύριε Ἰησοῦ Χριστὲ ὁ Θεός ἡμῶν, ὁ ἁγιάσας τὰ ῥεῖθρα τοῦ Ἰορδάνου, διὰ τῆς σωτηριώδους σου ἐπιφανείας, αὐτὸς καὶ νῦν κατάπεμψον τὴν χάριν τοῦ παναγίου σου Πνεύματος, καὶ εὐλόγησον τὸ ὕδωρ τοῦτο πρὸς ἁγιασμὸν καὶ τελείωσιν τοῦ σεβασμίου τούτου οἴκου σου κατὰ τὰ θυρανοίξια ταῦτα, καὶ στερέωσον καὶ συντήρησον αὐτὸν ἀσάλευτον καὶ δεδοξασμένον ἐν σοὶ μέχρι τῆς συντελείας τῶν αἰώνων.
ltx/gr_gr_cog/eu.churchdooropening:euCDO.Key0103.text	Ὁ Θεὸς καὶ Πατὴρ τοῦ Κυρίου ἡμῶν Ἰησοῦ Χριστοῦ, ὁ ὢν εὐλογητὸς εἰς τοὺς αἰῶνας τῶν αἰώνων· Αὐτός, φιλάνθρωπε Δέσποτα, ἐπίβλεψον ἐφʼ ἡμᾶς τοὺς ἀναξίους δούλους σου, τοὺς τὰ Θυρανοίξια ἐπιτελοῦντας τοῦ σεβασμίου Ναοῦ τούτου
ltx/gr_gr_cog/eu.churchdooropening:euCDO.Key0103.title	ΕΥΧΗ
ltx/gr_gr_cog/eu.churchdooropening:euCDO.Key0104.text	(τὸ ὄνομα τοῦ Ναοῦ)
ltx/gr_gr_cog/eu.churchdooropening:euCDO.Key0105.text	εἰς λειτουργίαν τῆς Ἁγιωτάτης σου Ἐκκλησίας.
ltx/gr_gr_cog/eu.churchdooropening:euCDO.Key0106.text	Στερέωσον τοῦτον μέχρι τῆς συντελείας τοῦ αἰῶνος ἀσάλευτον, καὶ δεδοξασμένον· καὶ ἀξίωσον ἡμᾶς ἐν αὐτῷ αἰνέσεις καὶ δοξολογίας προσάγειν τῇ δόξῃ σου, εὐπροσδέκτους τε τῇ σῇ ἀγαθότητι γενέσθαι τὰς δεήσεις ἡμῶν καὶ παντὸς τοῦ Λαοῦ σου, πρεσβείαις τῆς ἀχράντου Δεσποίνης ἡμῶν Θεοτόκου καὶ ἀειπαρθένου Μαρίας καὶ πάντων τῶν Ἁγίων.
ltx/gr_gr_cog/eu.churchdooropening:euCDO.Key201.title	ΤΑ ΕΙΡΗΝΙΚΑ
ltx/gr_gr_cog/eu.churchdooropening:euCDO.R101	Πρὸ τῶν κεκλεισμένων Θυρῶν τοῦ Ἱεροῦ Ναοῦ, καὶ πρὸ τῆς ηὐτρεπισμένης Τραπέζης, ἔνθα τελεσθήσεται ὁ Ἁγιασμὸς τῶν Θυρανοιξίων, ἀναφωνεῖ:
ltx/gr_gr_cog/eu.churchdooropening:euCDO.R102	Ὁ Ἀρχιερεύς, λαβὼν τὸν τίμιον σταυρόν, βαπτίζει αὐτὸν εἰς τὰ ὕδατα ἐκ τρίτου, ψάλλων τὸ τροπάριον.
ltx/gr_gr_cog/eu.churchdooropening:euCDO.R103	Ὁ Ἀρχιερεὺς κλίνας τὴν κεφαλὴν ἐπεύχεται λέγων·
ltx/gr_gr_cog/eu.churchdooropening:euCDO.R104	Λαβὼν τὸν τίμιον σταυρόν, μετὰ κλάδων βασιλικοῦ, βαπτίζει τοῦτον τρὶς ἐντὸς τοῦ ὕδατος, ἀναδύων καὶ καταδύων τοῦτον καὶ λέγει:
ltx/gr_gr_cog/eu.churchdooropening:euCDO.R105	Εἶτα ῥαντίζων τὴν θύραν καὶ τὰς πλευράς τοῦ νέου ναοῦ καὶ τὸν παριστάμενον λαόν.
ltx/gr_gr_cog/eu.churchdooropening:euCDO.R105alt	Ὁ Ἀρχιερεὺς ῥαντίζων τὸν λαὸν ψάλλει τὸ τροπάριον·
ltx/gr_gr_cog/eu.churchdooropening:euCDO.R106	Ἐν συνεχείᾳ, ὁ Ἀρχιερεύς, πρὸ τῶν θυρῶν τοῦ ἱεροῦ ναοῦ ἱστάμενος, ἀναφωνεῖ·
ltx/gr_gr_cog/eu.churchdooropening:euCDO.R107	Ἔσωθεν δὲ τοῦ ἱεροῦ ναοῦ τίθεται ἡ ἐρώτησις·
ltx/gr_gr_cog/eu.churchdooropening:euCDO.R108	Ἔσωθεν τοῦ ἱεροῦ ναοῦ ἡ ἐρώτησις·
ltx/gr_gr_cog/eu.churchdooropening:euCDO.R109	Καὶ ἀνοίγονται αἱ πύλαι καὶ εἰσοδεύουσι ψάλλοντες τὰ κάτωθι. Τούτων ψαλλομένων ῥαντίζει ὁ Ἀρχιερεὺς διὰ τοῦ ἁγιάσματος τὸν νέον ἱερὸν ναόν.
ltx/gr_gr_cog/eu.churchdooropening:euCDO.R110	Μετὰ τοῦτο ψάλλεται τὸ Ἀπολυτίκον τοῦ Ναοῦ.
ltx/gr_gr_cog/eu.churchdooropening:euCDO.R201	Ὁ Xορός τὸ «Κύριε, ἐλέησον» εἰς ἑκάστην δέησιν μέχρι καὶ τῆς δεήσεως «Ἀντιλαβοῦ…».
