ltx/gr_gr_cog/le.pr.tr.d040:lemcTE.reading1.book_abbr	@ltx/gr_gr_cog/bible:Isaiah.abbr
ltx/gr_gr_cog/le.pr.tr.d040:lemcTE.reading1.book_string	@ltx/gr_gr_cog/bible:Isaiah.text
ltx/gr_gr_cog/le.pr.tr.d040:lemcTE.reading1.chapverse	ΙΑʹ, 10 – ΙΒʹ, 2
ltx/gr_gr_cog/le.pr.tr.d040:lemcTE.reading1.incipit	Τάδε λέγει Κύριος· Ἔσται ἐν τῇ ἡμέρᾳ ἐκείνῃ ἡ…
ltx/gr_gr_cog/le.pr.tr.d040:lemcTE.reading1.text	Τάδε λέγει Κύριος· Ἔσται ἐν τῇ ἡμέρᾳ ἐκείνῃ ἡ ῥίζα τοῦ Ἱεσσαί, καὶ ὁ ἀνιστάμενος ἄρχειν ἐθνῶν, ἐπ αὐτῷ ἔθνη ἐλπιοῦσι, καὶ ἔσται ἡ ἀνάπαυσις αὐτοῦ, τιμή. Καὶ ἔσται τῇ ἡμέρᾳ ἐκείνῃ, προσθήσει ὁ Κύριος τοῦ δεῖξαι τὴν χεῖρα αὐτοῦ, τοῦ ζηλῶσαι τὸ καταλειφθὲν ὑπόλοιπον τοῦ λαοῦ, ὃ ἂν καταλειφθῇ ὑπὸ τῶν Ἀσσυρίων, καὶ ἀπὸ Αἰγύπτου, καὶ ἀπὸ Βαβυλῶνος, καὶ ἀπὸ Αἰθιοπίας καὶ ἀπὸ Ἐλαμιτῶν, καὶ ἀπὸ ἡλίου ἀνατολῶν, καὶ ἐξ Ἀραβίας. Καὶ ἀρεῖ σημεῖον εἰς τὰ ἔθνη, καὶ συνάξει τοὺς ἀπολομένους Ἰσραήλ, καὶ τοὺς διεσπαρμένους Ἰούδα συνάξει ἐκ τῶν τεσσάρων πτερύγων τῆς γῆς. Καὶ ἀφαιρεθήσεται ὁ ζῆλος Ἐφραΐμ, καὶ οἱ ἐχθροὶ Ἰούδα ἀπολοῦνται. Καὶ ἔσται τῷ Ἰσραήλ, ὡς τῇ ἡμέρᾳ, ὅτε ἐξῆλθεν ἐκ γῆς Αἰγύπτου. Καὶ ἐρεῖς ἐν τῇ ἡμέρα ἐκείνη· Εὐλογῶ σε, Κύριε, διότι ὠργίσθης μοι, καὶ ἀπέστρεψας τὸν θυμόν σου, καὶ ἠλέησάς με. Ἰδού, ὁ Θεός μου σωτήρ μου πεποιθὼς ἔσομαι ἐπʼ αὐτῷ, καὶ σωθήσομαι ἐν αὐτῷ, καὶ οὐ φοβηθήσομαι, διότι ἡ δόξα μου, καὶ ἡ αἴνεσίς μου Κύριος, καὶ ἐγένετό μοι εἰς σωτηρίαν.
ltx/gr_gr_cog/le.pr.tr.d040:lemcTE.reading1.title	
ltx/gr_gr_cog/le.pr.tr.d040:lemcTE.reading1.title_abbr	
ltx/gr_gr_cog/le.pr.tr.d040:lemcTE.reading1.version	@ltx/gr_gr_cog/properties:version.designation
ltx/gr_gr_cog/le.pr.tr.d040:lemcVE.reading1.book_abbr	@ltx/gr_gr_cog/bible:Genesis.abbr
ltx/gr_gr_cog/le.pr.tr.d040:lemcVE.reading1.book_string	@ltx/gr_gr_cog/bible:Genesis.text
ltx/gr_gr_cog/le.pr.tr.d040:lemcVE.reading1.chapverse	Ζʹ, 6 – 9
ltx/gr_gr_cog/le.pr.tr.d040:lemcVE.reading1.incipit	Νῶε ἦν ἐτῶν ἑξακοσίων, καὶ ὁ κατακλυσμὸς τοῦ ὕδατος…
ltx/gr_gr_cog/le.pr.tr.d040:lemcVE.reading1.text	Νῶε ἦν ἐτῶν ἑξακοσίων, καὶ ὁ κατακλυσμὸς τοῦ ὕδατος ἐγένετο ἐπὶ τῆς γῆς. Εἰσῆλθε δὲ Νῶε, καὶ οἱ υἱοὶ αὐτοῦ, καὶ ἡ γυνὴ αὐτοῦ, καὶ αἱ γυναῖκες τῶν υἱῶν αὐτοῦ μετʹ αὐτοῦ εἰς τὴν κιβωτόν, διὰ τὸ ὕδωρ τοῦ κατακλυσμοῦ. Καὶ ἀπὸ τῶν πετεινῶν τῶν καθαρῶν, καὶ ἀπὸ τῶν πετεινῶν τῶν μὴ καθαρῶν, καὶ ἀπὸ τῶν κτηνῶν τῶν καθαρῶν, καὶ ἀπὸ τῶν κτηνῶν τῶν μὴ καθαρῶν, καὶ ἀπὸ τῶν θηρίων, καὶ ἀπὸ πάντων τῶν ἑρπόντων ἐπὶ τῆς γῆς, δύο δύο εἰσῆλθον πρὸς Νῶε εἰς τὴν κιβωτόν, ἄρσεν καὶ θῆλυ, καθὰ ἐνετείλατο ὁ Θεὸς τῷ Νῶε.
ltx/gr_gr_cog/le.pr.tr.d040:lemcVE.reading1.title	
ltx/gr_gr_cog/le.pr.tr.d040:lemcVE.reading1.title_abbr	
ltx/gr_gr_cog/le.pr.tr.d040:lemcVE.reading1.version	@ltx/gr_gr_cog/properties:version.designation
ltx/gr_gr_cog/le.pr.tr.d040:lemcVE.reading2.book_abbr	@ltx/gr_gr_cog/bible:Proverbs.abbr
ltx/gr_gr_cog/le.pr.tr.d040:lemcVE.reading2.book_string	@ltx/gr_gr_cog/bible:Proverbs.text
ltx/gr_gr_cog/le.pr.tr.d040:lemcVE.reading2.chapverse	Θʹ, 12 – 18
ltx/gr_gr_cog/le.pr.tr.d040:lemcVE.reading2.incipit	Υἱέ, ἐὰν σοφὸς γένῃ σεαυτῷ, σοφὸς ἔσῃ καὶ τοῖς…
ltx/gr_gr_cog/le.pr.tr.d040:lemcVE.reading2.text	Υἱέ, ἐὰν σοφὸς γένῃ σεαυτῷ, σοφὸς ἔσῃ καὶ τοῖς πλησίον σου, ἐὰν δὲ κακὸς ἀποβῇς, μόνος ἂν ἀντλήσεις τὰ κακά. Υἱὸς πεπαιδευμένος σοφὸς ἔσται, τῷ δὲ ἄφρονι διακόνῳ χρήσεται, ὃς ἐρείδεται ἐπὶ ψεύδεσιν, οὗτος ποιμανεῖ ἀνέμους, ὁ δʼ αὐτὸς διώξεται ὄρνεα πετώμενα· ἀπέλιπε γὰρ ὁδοὺς τοῦ ἑαυτοῦ ἀμπελῶνος, τοὺς δὲ ἄξονας τοῦ ἰδίου γεωργίου πεπλάνηται. Διαπορεύεται δὲ διʹ ἀνύδρου ἐρήμου, καὶ γῆν διατεταγμένην ἐν διψώδεσι, συνάγει δὲ χερσὶν ἀκαρπίαν. Γυνὴ ἄφρων καὶ θρασεῖα ἐνδεὴς ψωμοῦ γίνεται, ἣ οὐκ ἐπίσταται αἰσχύνην, ἐκάθισεν ἐπὶ θύραις τοῦ ἑαυτῆς οἴκου, ἐπὶ δίφρου ἐμφανῶς ἐν πλατείαις, προσκαλουμένη τοὺς παριόντας καὶ κατευθύνοντας ἐν ταῖς ὁδοῖς αὐτῶν. Ὃς ἐστιν ὑμῶν ἀφρονέστατος, ἐκκλινάτω πρός με, καὶ τοῖς ἐνδεέσι φρονήσεως παρακελεύομαι λέγουσα· Ἄρτον κρυφίων ἡδέως ἄψασθε, καὶ ὕδατος κλοπῆς γλυκεροῦ πίετε. Ὁ δὲ οὐκ οἶδεν, ὅτι γηγενεῖς παρʼ αὐτῇ ὄλλυνται, καὶ ἐπὶ πέταυρον ᾍδου συναντᾷ. Ἀλλὰ ἀποπήδησον, μὴ χρονίσῃς ἐν τῷ τόπῳ αὐτῆς, μηδὲ ἐπιστήσῃς τὸ σὸν ὄμμα πρὸς αὐτήν· οὕτω γὰρ διαβήσῃ ὕδωρ ἀλλότριον, ἀπὸ δὲ ὕδατος ἀλλοτρίου ἀπόσχου, καὶ ἀπὸ πηγῆς ἀλλοτρίας μὴ πίῃς, ἵνα πολὺν ζήσῃς χρόνον, προστεθήσεται δέ σοι ἔτη ζωῆς.
ltx/gr_gr_cog/le.pr.tr.d040:lemcVE.reading2.title	
ltx/gr_gr_cog/le.pr.tr.d040:lemcVE.reading2.title_abbr	
ltx/gr_gr_cog/le.pr.tr.d040:lemcVE.reading2.version	@ltx/gr_gr_cog/properties:version.designation
