ltx/gr_gr_cog/le.go.lu.d099:leluLI.Gospel.book_abbr	@ltx/gr_gr_cog/bible:Mark.abbr
ltx/gr_gr_cog/le.go.lu.d099:leluLI.Gospel.book_string	@ltx/gr_gr_cog/bible:Mark.text
ltx/gr_gr_cog/le.go.lu.d099:leluLI.Gospel.chapverse	10:46 – 52
ltx/gr_gr_cog/le.go.lu.d099:leluLI.Gospel.incipit	Ἐκπορευομένου τοῦ Ἰησοῦ ἀπὸ Ἱεριχώ…
ltx/gr_gr_cog/le.go.lu.d099:leluLI.Gospel.text	Τῷ καιρῷ ἐκείνῳ, ἐκπορευομένου τοῦ Ἰησοῦ ἀπὸ Ἱεριχὼ καὶ τῶν μαθητῶν αὐτοῦ καὶ ὄχλου ἱκανοῦ, ὁ υἱὸς Τιμαίου Βαρτιμαῖος τυφλὸς ἐκάθητο παρὰ τὴν ὁδὸν προσαιτῶν. καὶ ἀκούσας ὅτι Ἰησοῦς ὁ Ναζωραῖός ἐστιν, ἤρξατο κράζειν καὶ λέγειν· υἱὲ Δαυῒδ Ἰησοῦ, ἐλέησόν με. καὶ ἐπετίμων αὐτῷ πολλοὶ ἵνα σιωπήσῃ· ὁ δὲ πολλῷ μᾶλλον ἔκραζεν· υἱὲ Δαυΐδ, ἐλέησόν με. καὶ στὰς ὁ Ἰησοῦς εἶπε· φωνήσατε αὐτόν· καὶ φωνοῦσι τὸν τυφλὸν λέγοντες αὐτῷ· θάρσει, ἔγειρε· φωνεῖ σε. ὁ δὲ ἀποβαλὼν τὸ ἱμάτιον αὐτοῦ ἀναστὰς ἦλθε πρὸς τὸν Ἰησοῦν. καὶ ἀποκριθεὶς λέγει αὐτῷ ὁ Ἰησοῦς· τί σοι θέλεις ποιήσω; ὁ δὲ τυφλὸς εἶπεν αὐτῷ· ῥαββουνί, ἵνα ἀναβλέψω. καὶ ὁ Ἰησοῦς εἶπεν αὐτῷ· ὕπαγε, ἡ πίστις σου σέσωκέ σε. καὶ εὐθέως ἀνέβλεψε, καὶ ἠκολούθει τῷ Ἰησοῦ ἐν τῇ ὁδῷ.
ltx/gr_gr_cog/le.go.lu.d099:leluLI.Gospel.title	Τῇ Δευτέρᾳ τῆς ΙΕʹ Ἑβδομάδος τοῦ Λουκᾶ
ltx/gr_gr_cog/le.go.lu.d099:leluLI.Gospel.title_abbr	Τῇ Δευτέρᾳ τῆς ΙΕʹ Ἑβδομάδος τοῦ Λουκᾶ
ltx/gr_gr_cog/le.go.lu.d099:leluLI.Gospel.version	@ltx/gr_gr_cog/properties:version.designation
