ltx/gr_gr_cog/me.m12.d06:meDA.commemoration.first	Μνήμη τοῦ Ἁγίου Νικολάου
ltx/gr_gr_cog/me.m12.d06:meDA.commemoration.first_name	Ἅγιος Νικόλαος
ltx/gr_gr_cog/me.m12.d06:meDA.commemoration.first_short	Μνήμη τοῦ Ἁγίου Νικολάου
ltx/gr_gr_cog/me.m12.d06:meDA.commemoration.first_title	@ltx/gr_gr_cog/titles:ti.SaintM
ltx/gr_gr_cog/me.m12.d06:meDA.commemoration.full	Μνήμη τοῦ ἐν Ἁγίοις Πατρὸς ἡμῶν Νικολάου, Ἀρχιεπισκόπου Μύρων τῆς Λυκίας, τοῦ Θαυματουργοῦ.
ltx/gr_gr_cog/me.m12.d06:meDA.commemoration.second_name	
ltx/gr_gr_cog/me.m12.d06:meDA.commemoration.second_title	
ltx/gr_gr_cog/me.m12.d06:meDA.date	Τῌ Ϛʹ ΔΕΚΕΜΒΡΙΟΥ
ltx/gr_gr_cog/me.m12.d06:meDA.fordate	διὰ τὴν 6ην Δεκεμβρίου
ltx/gr_gr_cog/me.m12.d06:meDA.insert1	τοῦ ἐν Ἁγίοις Πατρὸς ἡμῶν Νικολάου, Ἀρχιεπισκόπου Μύρων τῆς Λυκίας, τοῦ θαυματουργοῦ,
ltx/gr_gr_cog/me.m12.d06:meDA.insert2	οὗ καὶ τὴν μνήμην ἐπιτελοῦμεν·
ltx/gr_gr_cog/me.m12.d06:meDA.note	
ltx/gr_gr_cog/me.m12.d06:meDA.pdfcoverdate	τῆς 6ης Δεκεμβρίου,
ltx/gr_gr_cog/me.m12.d06:meDA.pdfheaderdate	τῆς 6ης Δεκεμβρίου
ltx/gr_gr_cog/me.m12.d06:meHO.commemorations	
ltx/gr_gr_cog/me.m12.d06:meHO.note1	
ltx/gr_gr_cog/me.m12.d06:meHO.note2	
ltx/gr_gr_cog/me.m12.d06:meHO.number	
ltx/gr_gr_cog/me.m12.d06:meHO.rank	
ltx/gr_gr_cog/me.m12.d06:meLE.commemoration1	Μνήμη τοῦ ἐν Ἁγίοις Πατρὸς ἡμῶν Νικολάου, Ἀρχιεπισκόπου Μύρων τῆς Λυκίας, τοῦ Θαυματουργοῦ.
ltx/gr_gr_cog/me.m12.d06:meLE.commemoration2	
ltx/gr_gr_cog/me.m12.d06:meLI.Kontakion1.greekmelody	@ltx/gr_gr_cog/me.m12.d06:meMA.Kontakion1.greekmelody
ltx/gr_gr_cog/me.m12.d06:meLI.Kontakion1.incipit	@ltx/gr_gr_cog/me.m12.d06:meMA.Kontakion1.incipit
ltx/gr_gr_cog/me.m12.d06:meLI.Kontakion1.melody	@ltx/gr_gr_cog/me.m12.d06:meMA.Kontakion1.melody
ltx/gr_gr_cog/me.m12.d06:meLI.Kontakion1.mode	@ltx/gr_gr_cog/me.m12.d06:meMA.Kontakion1.mode
ltx/gr_gr_cog/me.m12.d06:meLI.Kontakion1.text	@ltx/gr_gr_cog/me.m12.d06:meMA.Kontakion1.text
ltx/gr_gr_cog/me.m12.d06:meLI.MM.CommunionHymn.text	@ltx/gr_gr_cog/properties:media.key
ltx/gr_gr_cog/me.m12.d06:meLI.Megalynarion.text	Ὀρφανῶν προστάτην σε καὶ χηρῶν, πεινώντων τροφέα, πενομένων τε πλουτιστήν, αἰχμαλώτων ρύστην, πλεόντων τε σωτῆρα, κεκτήμεθα παμμάκαρ, σοφὲ Νικόλαε.
ltx/gr_gr_cog/me.m12.d06:meMA.AdditionalIdiomelon1.incipit	@ltx/gr_gr_cog/me.m12.d06:meVE.Lity7.incipit
ltx/gr_gr_cog/me.m12.d06:meMA.AdditionalIdiomelon1.melody	
ltx/gr_gr_cog/me.m12.d06:meMA.AdditionalIdiomelon1.mode	@ltx/gr_gr_cog/miscellanea:misc.Mode6
ltx/gr_gr_cog/me.m12.d06:meMA.AdditionalIdiomelon1.poet	@ltx/gr_gr_cog/poets:po.Sergiou
ltx/gr_gr_cog/me.m12.d06:meMA.AdditionalIdiomelon1.text	@ltx/gr_gr_cog/me.m12.d06:meVE.Lity7.text
ltx/gr_gr_cog/me.m12.d06:meMA.AdditionalIdiomelon2.incipit	@ltx/gr_gr_cog/me.m12.d06:meVE.Lity8.incipit
ltx/gr_gr_cog/me.m12.d06:meMA.AdditionalIdiomelon2.melody	
ltx/gr_gr_cog/me.m12.d06:meMA.AdditionalIdiomelon2.mode	@ltx/gr_gr_cog/miscellanea:misc.Mode8
ltx/gr_gr_cog/me.m12.d06:meMA.AdditionalIdiomelon2.text	@ltx/gr_gr_cog/me.m12.d06:meVE.Lity8.text
ltx/gr_gr_cog/me.m12.d06:meMA.AdditionalIdiomelonBoth.incipit	@ltx/gr_gr_cog/oc.m8.d5:ocMA.AposTheotokion.incipit
ltx/gr_gr_cog/me.m12.d06:meMA.AdditionalIdiomelonBoth.melody	
ltx/gr_gr_cog/me.m12.d06:meMA.AdditionalIdiomelonBoth.mode	@ltx/gr_gr_cog/miscellanea:misc.Mode8
ltx/gr_gr_cog/me.m12.d06:meMA.AdditionalIdiomelonBoth.text	@ltx/gr_gr_cog/oc.m8.d5:ocMA.AposTheotokion.text
ltx/gr_gr_cog/me.m12.d06:meMA.AdditionalIdiomelonGlory.incipit	@ltx/gr_gr_cog/me.m12.d06:meVE.LityGlory.incipit
ltx/gr_gr_cog/me.m12.d06:meMA.AdditionalIdiomelonGlory.melody	
ltx/gr_gr_cog/me.m12.d06:meMA.AdditionalIdiomelonGlory.mode	@ltx/gr_gr_cog/miscellanea:misc.Mode8
ltx/gr_gr_cog/me.m12.d06:meMA.AdditionalIdiomelonGlory.text	@ltx/gr_gr_cog/me.m12.d06:meVE.LityGlory.text
ltx/gr_gr_cog/me.m12.d06:meMA.C1.acrostic.notice1	οὗ ἡ Ἄκροστιχίς·
ltx/gr_gr_cog/me.m12.d06:meMA.C1.acrostic.text	Σὺν Νικολάῳ τῇ Θεοτόκῳ μέλπω, καὶ πόθῳ προσᾴδω.
ltx/gr_gr_cog/me.m12.d06:meMA.C1.acrostic.title	Ὁ Κανὼν τῆς Θεοτόκου,
ltx/gr_gr_cog/me.m12.d06:meMA.C1.title	@ltx/gr_gr_cog/titles:ti.CanonTheotokos
ltx/gr_gr_cog/me.m12.d06:meMA.C1.verse	@ltx/gr_gr_cog/prayers:pr.verse_Theotokos.text
ltx/gr_gr_cog/me.m12.d06:meMA.C2.acrostic.notice1	οὗ ἡ Ἄκροστιχίς·
ltx/gr_gr_cog/me.m12.d06:meMA.C2.acrostic.text	Σοὶ, Νικόλαε, θεῖον ἐξᾴδω μέλος.
ltx/gr_gr_cog/me.m12.d06:meMA.C2.acrostic.title	Ὁ Κανὼν τοῦ Ἁγίου,
ltx/gr_gr_cog/me.m12.d06:meMA.C2.poet	@ltx/gr_gr_cog/poets:po.Theofanous
ltx/gr_gr_cog/me.m12.d06:meMA.C2.title	@ltx/gr_gr_cog/titles:ti.Canon1SaintM
ltx/gr_gr_cog/me.m12.d06:meMA.C2.verse	@ltx/gr_gr_cog/prayers:pr.verse_SaintM.text
ltx/gr_gr_cog/me.m12.d06:meMA.C3.acrostic.notice1	οὗ ἡ Ἀκροστιχὶς κατὰ Ἀλφάβητον, χωρὶς τῶν Τριαδικῶν καὶ τῶν Θεοτοκίων.
ltx/gr_gr_cog/me.m12.d06:meMA.C3.acrostic.title	Ἕτερος Κανὼν τοῦ Ἁγίου,
ltx/gr_gr_cog/me.m12.d06:meMA.C3.title	@ltx/gr_gr_cog/titles:ti.Canon2SaintM
ltx/gr_gr_cog/me.m12.d06:meMA.C3.verse	@ltx/gr_gr_cog/prayers:pr.verse_SaintM.text
ltx/gr_gr_cog/me.m12.d06:meMA.ExapTheotokion.incipit	Σοφίαν ἐνυπόστατον, καὶ Λόγον ὑπερούσιον…
ltx/gr_gr_cog/me.m12.d06:meMA.ExapTheotokion.melody	@ltx/gr_gr_cog/he.a.m2:heAU.GynaikesAkoutisthite.name
ltx/gr_gr_cog/me.m12.d06:meMA.ExapTheotokion.mode	@ltx/gr_gr_cog/miscellanea:misc.Mode2
ltx/gr_gr_cog/me.m12.d06:meMA.ExapTheotokion.text	Σοφίαν ἐνυπόστατον, καὶ Λόγον ὑπερούσιον, καὶ ἰατρὸν τῶν ἁπάντων, Χριστὸν τεκοῦσα Παρθένε, τὰ ἕλκη καὶ τὰ τραύματα, τῆς ψυχῆς μου θεράπευσον, τὰ χαλεπὰ καὶ χρόνια, καὶ τῆς καρδίας μου παῦσον, τὰς ἀπρεπεῖς ἐνθυμήσεις.
ltx/gr_gr_cog/me.m12.d06:meMA.Exaposteilarion1.greekmelody	@ltx/gr_gr_cog/he.a.m2:heAU.GynaikesAkoutisthite.greekname
ltx/gr_gr_cog/me.m12.d06:meMA.Exaposteilarion1.incipit	Τὸν μέγαν ἀρχιποίμενα, καὶ Ἱεράρχην…
ltx/gr_gr_cog/me.m12.d06:meMA.Exaposteilarion1.melody	@ltx/gr_gr_cog/he.a.m2:heAU.GynaikesAkoutisthite.name
ltx/gr_gr_cog/me.m12.d06:meMA.Exaposteilarion1.mode	@ltx/gr_gr_cog/miscellanea:misc.Mode2
ltx/gr_gr_cog/me.m12.d06:meMA.Exaposteilarion1.text	Τὸν μέγαν ἀρχιποίμενα, καὶ Ἱεράρχην ἅπαντες, τὸν πρόεδρον τῶν Μυρέων, Νικόλαον εὐφημοῦμεν· πολλοὺς γὰρ ἄνδρας ἔσωσεν, ἀδίκως θνῄσκειν μέλλοντας, καὶ Βασιλεῖ ὀπτάνεται, σὺν Ἀβλαβίῳ κατʼ ὄναρ, λύων τὴν ἄδικον ψῆφον.
ltx/gr_gr_cog/me.m12.d06:meMA.Exaposteilarion2.greekmelody	@ltx/gr_gr_cog/he.a.m2:heAU.GynaikesAkoutisthite.greekname
ltx/gr_gr_cog/me.m12.d06:meMA.Exaposteilarion2.incipit	Μεγάλως σε ἐδόξασεν, ἐν θαύμασιν…
ltx/gr_gr_cog/me.m12.d06:meMA.Exaposteilarion2.melody	@ltx/gr_gr_cog/he.a.m2:heAU.GynaikesAkoutisthite.name
ltx/gr_gr_cog/me.m12.d06:meMA.Exaposteilarion2.mode	@ltx/gr_gr_cog/miscellanea:misc.Mode2
ltx/gr_gr_cog/me.m12.d06:meMA.Exaposteilarion2.text	Μεγάλως σε ἐδόξασεν, ἐν θαύμασιν ὁ Κύριος, καὶ ζῶντα καὶ μετὰ τέλος, Νικόλαε Ἱεράρχα· τίς γὰρ ἐξ ὅλης πίστεως, μόνον ἐπεκαλέσατο, τὸ ἅγιόν σου ὄνομα, καὶ οὐκ εὐθὺς εἰσηκούσθη, θερμὸν προστάτην εὑρών σε;
ltx/gr_gr_cog/me.m12.d06:meMA.FestalMagnification.incipit	…
ltx/gr_gr_cog/me.m12.d06:meMA.FestalMagnification.text	[no Greek text]
ltx/gr_gr_cog/me.m12.d06:meMA.Kathisma11.greekmelody	@ltx/gr_gr_cog/he.a.m1:heAU.TonTafonSouSotir.greekname
ltx/gr_gr_cog/me.m12.d06:meMA.Kathisma11.incipit	Ἀστράπτεις ἐν τῇ γῇ, τῶν…
ltx/gr_gr_cog/me.m12.d06:meMA.Kathisma11.melody	@ltx/gr_gr_cog/he.a.m1:heAU.TonTafonSouSotir.name
ltx/gr_gr_cog/me.m12.d06:meMA.Kathisma11.mode	@ltx/gr_gr_cog/miscellanea:misc.Mode1
ltx/gr_gr_cog/me.m12.d06:meMA.Kathisma11.text	Ἀστράπτεις ἐν τῇ γῇ, τῶν θαυμάτων ἀκτῖσι, Νικόλαε σοφέ, καὶ κινεῖς πᾶσαν γλῶσσαν, εἰς δόξαν τε καὶ αἴνεσιν, τοῦ ἐν γῇ σε δοξάσαντος· ὃν ἱκέτευε, πάσης ἀνάγκης ῥυσθῆναι, τοὺς τὴν μνήμην σου, πίστει καὶ πόθῳ τιμῶντας, Πατέρων ἐκλόγιον.
ltx/gr_gr_cog/me.m12.d06:meMA.Kathisma1T.incipit	@ltx/gr_gr_cog/oc.m1.d1:ocMA.Kathisma23.incipit
ltx/gr_gr_cog/me.m12.d06:meMA.Kathisma1T.melody	@ltx/gr_gr_cog/he.a.m1:heAU.TonTafonSouSotir.name
ltx/gr_gr_cog/me.m12.d06:meMA.Kathisma1T.mode	@ltx/gr_gr_cog/miscellanea:misc.Mode1
ltx/gr_gr_cog/me.m12.d06:meMA.Kathisma1T.text	@ltx/gr_gr_cog/oc.m1.d1:ocMA.Kathisma23.text
ltx/gr_gr_cog/me.m12.d06:meMA.Kathisma21.greekmelody	@ltx/gr_gr_cog/he.a.m4:heAU.EpefanisSimeron.greekname
ltx/gr_gr_cog/me.m12.d06:meMA.Kathisma21.incipit	Τῶν πιστῶν προΐστασαι, σκέπων φρουρῶν…
ltx/gr_gr_cog/me.m12.d06:meMA.Kathisma21.melody	@ltx/gr_gr_cog/he.a.m4:heAU.EpefanisSimeron.name
ltx/gr_gr_cog/me.m12.d06:meMA.Kathisma21.mode	@ltx/gr_gr_cog/miscellanea:misc.Mode4
ltx/gr_gr_cog/me.m12.d06:meMA.Kathisma21.text	Τῶν πιστῶν προΐστασαι, σκέπων φρουρῶν τούτους μάκαρ, καὶ ἐκ πάσης θλίψεως, ἀπολυτρούμενος σαφῶς, Ἱεραρχῶν ὡραιότατον, κλέος καὶ δόξα, Νικόλαε Ὅσιε.
ltx/gr_gr_cog/me.m12.d06:meMA.Kathisma2T.incipit	@ltx/gr_gr_cog/me.m07.d05:meMA.Kathisma2T.incipit
ltx/gr_gr_cog/me.m12.d06:meMA.Kathisma2T.melody	@ltx/gr_gr_cog/he.a.m4:heAU.EpefanisSimeron.name
ltx/gr_gr_cog/me.m12.d06:meMA.Kathisma2T.mode	@ltx/gr_gr_cog/miscellanea:misc.Mode4
ltx/gr_gr_cog/me.m12.d06:meMA.Kathisma2T.text	@ltx/gr_gr_cog/me.m07.d05:meMA.Kathisma2T.text
ltx/gr_gr_cog/me.m12.d06:meMA.Kathisma31.greekmelody	@ltx/gr_gr_cog/he.a.m4:heAU.TachyProkatalave.greekname
ltx/gr_gr_cog/me.m12.d06:meMA.Kathisma31.incipit	Προστάτης θερμότατος, τῆς Ἐκκλησίας Χριστοῦ…
ltx/gr_gr_cog/me.m12.d06:meMA.Kathisma31.melody	@ltx/gr_gr_cog/he.a.m4:heAU.TachyProkatalave.name
ltx/gr_gr_cog/me.m12.d06:meMA.Kathisma31.mode	@ltx/gr_gr_cog/miscellanea:misc.Mode4
ltx/gr_gr_cog/me.m12.d06:meMA.Kathisma31.text	Προστάτης θερμότατος, τῆς Ἐκκλησίας Χριστοῦ, ἐδείχθης Νικόλαε, τὰ τῶν αἱρέσεων, διδάγματα ἄθεα, λύων σὺν παῤῥησίᾳ, καὶ κανὼν ἀνεδείχθης, πᾶσιν ὀρθοδοξίας, ὑπὲρ πάντων πρεσβεύων, τῶν ἐφεπομένων σου θείαις, διδασκαλίαις καὶ εἰσηγήσεσι.
ltx/gr_gr_cog/me.m12.d06:meMA.Kathisma3T.incipit	Ταχὺ δέξαι Δέσποινα τὰς ἱκεσίας…
ltx/gr_gr_cog/me.m12.d06:meMA.Kathisma3T.melody	@ltx/gr_gr_cog/he.a.m4:heAU.TachyProkatalave.name
ltx/gr_gr_cog/me.m12.d06:meMA.Kathisma3T.mode	@ltx/gr_gr_cog/miscellanea:misc.Mode4
ltx/gr_gr_cog/me.m12.d06:meMA.Kathisma3T.text	Ταχὺ δέξαι Δέσποινα τὰς ἱκεσίας ἡμῶν, καὶ ταύτας προσάγαγε, τῷ σῷ Υἱῷ καὶ Θεῷ, Κυρία Πανάμωμε· λῦσον τὰς περιστάσεις, τῶν εἰς σὲ προστρεχόντων, σύντριψον μηχανίας, καὶ κατάβαλε θράσος, τῶν ὁπλιζομένων ἀθέων, κατὰ τῶν δούλων σου.
ltx/gr_gr_cog/me.m12.d06:meMA.Kontakion1.greekmelody	@ltx/gr_gr_cog/he.a.m3:heAU.IParthenosSimeron.greekname
ltx/gr_gr_cog/me.m12.d06:meMA.Kontakion1.incipit	Ἐν τοῖς Μύροις Ἅγιε, ἱερουργὸς…
ltx/gr_gr_cog/me.m12.d06:meMA.Kontakion1.melody	@ltx/gr_gr_cog/he.a.m3:heAU.IParthenosSimeron.name
ltx/gr_gr_cog/me.m12.d06:meMA.Kontakion1.mode	@ltx/gr_gr_cog/miscellanea:misc.Mode3
ltx/gr_gr_cog/me.m12.d06:meMA.Kontakion1.text	Ἐν τοῖς Μύροις Ἅγιε, ἱερουργὸς ἀνεδείχθης· τοῦ Χριστοῦ γὰρ Ὅσιε, τὸ Εὐαγγέλιον πληρώσας, ἔθηκας τὴν ψυχήν σου ὑπὲρ λαοῦ σου, ἔσωσας τοὺς ἀθώους ἐκ τοῦ θανάτου· διὰ τοῦτο ἡγιάσθης, ὡς μέγας μύστης Θεοῦ τῆς χάριτος.
ltx/gr_gr_cog/me.m12.d06:meMA.Lauds1.greekmelody	@ltx/gr_gr_cog/he.a.m1:heAU.TonOuranionTagmaton.greekname
ltx/gr_gr_cog/me.m12.d06:meMA.Lauds1.incipit	Τῆς Ἐκκλησίας τὰ ἄνθη, περιϊπτάμενος…
ltx/gr_gr_cog/me.m12.d06:meMA.Lauds1.melody	@ltx/gr_gr_cog/he.a.m1:heAU.TonOuranionTagmaton.name
ltx/gr_gr_cog/me.m12.d06:meMA.Lauds1.mode	@ltx/gr_gr_cog/miscellanea:misc.Mode1
ltx/gr_gr_cog/me.m12.d06:meMA.Lauds1.text	Τῆς Ἐκκλησίας τὰ ἄνθη, περιϊπτάμενος, ὡς νεοττὸς τῆς ἄνω, καλιᾶς τῶν Ἀγγέλων, Νικόλαε τρισμάκαρ, κράζεις ἀεί, πρὸς τὸν Θεὸν ὑπὲρ πάντων ἡμῶν, τῶν ἐν ἀνάγκαις κινδύνων καὶ πειρασμῶν, καὶ λυτροῦσαι ταῖς πρεσβείαις σου.
ltx/gr_gr_cog/me.m12.d06:meMA.Lauds2.incipit	Τῆς ἱερᾶς διπλοΐδος, τὴν ὡραιότητα…
ltx/gr_gr_cog/me.m12.d06:meMA.Lauds2.melody	@ltx/gr_gr_cog/he.a.m1:heAU.TonOuranionTagmaton.name
ltx/gr_gr_cog/me.m12.d06:meMA.Lauds2.mode	@ltx/gr_gr_cog/miscellanea:misc.Mode1
ltx/gr_gr_cog/me.m12.d06:meMA.Lauds2.text	Τῆς ἱερᾶς διπλοΐδος, τὴν ὡραιότητα, ταῖς πρακτικαῖς εἰργάσω, ἀρεταῖς λαμπροτέραν, Πάτερ θεοφόρε· ὅθεν ἡμῖν, ἱερουργεῖς τὰ τεράστια, τῶν ἀοιδίμων θαυμάτων ἱερουργέ, τῶν δεινῶν ἡμᾶς λυτρούμενος.
ltx/gr_gr_cog/me.m12.d06:meMA.Lauds3.incipit	Τῶν ἀθεάτων τὰ κάλλη, περιεχόμενος…
ltx/gr_gr_cog/me.m12.d06:meMA.Lauds3.melody	@ltx/gr_gr_cog/he.a.m1:heAU.TonOuranionTagmaton.name
ltx/gr_gr_cog/me.m12.d06:meMA.Lauds3.mode	@ltx/gr_gr_cog/miscellanea:misc.Mode1
ltx/gr_gr_cog/me.m12.d06:meMA.Lauds3.text	Τῶν ἀθεάτων τὰ κάλλη, περιεχόμενος, τὴν φοβερὰν ἐκείνην, κατενόησας δόξαν, Ἅγιε ἁγίων· ὅθεν ἡμῖν, τὰ οὐράνια λόγια, τῶν ἀειζώων ἐκείνων θεωριῶν, ἀναγγέλλεις Ἱερώτατε.
ltx/gr_gr_cog/me.m12.d06:meMA.Lauds4.greekmelody	@ltx/gr_gr_cog/he.a.m1:heAU.TonOuranionTagmaton.greekname
ltx/gr_gr_cog/me.m12.d06:meMA.Lauds4.incipit	Ὡς ἐν ὀνείρῳ ἐπέστης, τῷ…
ltx/gr_gr_cog/me.m12.d06:meMA.Lauds4.melody	@ltx/gr_gr_cog/he.a.m1:heAU.TonOuranionTagmaton.name
ltx/gr_gr_cog/me.m12.d06:meMA.Lauds4.mode	@ltx/gr_gr_cog/miscellanea:misc.Mode1
ltx/gr_gr_cog/me.m12.d06:meMA.Lauds4.text	Ὡς ἐν ὀνείρῳ ἐπέστης, τῷ εὐσεβεῖ Βασιλεῖ, καὶ τοὺς δεσμώτας Πάτερ, ἐκ θανάτου ἐῤῥύσω, πρέσβευε ἀπαύστως, ὅπως καὶ νῦν, ταῖς εὐχαῖς σου ῥυσθείημεν, ἐκ πειρασμῶν καὶ κινδύνων καὶ ὀδυνῶν, οἱ ἀξίως εὐφημοῦντές σε.
ltx/gr_gr_cog/me.m12.d06:meMA.LaudsGlory.incipit	Σαλπίσωμεν ἐν σάλπιγγι ᾀσμάτων…
ltx/gr_gr_cog/me.m12.d06:meMA.LaudsGlory.melody	
ltx/gr_gr_cog/me.m12.d06:meMA.LaudsGlory.mode	@ltx/gr_gr_cog/miscellanea:misc.Mode5
ltx/gr_gr_cog/me.m12.d06:meMA.LaudsGlory.text	Σαλπίσωμεν ἐν σάλπιγγι ᾀσμάτων, σκιρτήσωμεν ἑόρτια, καὶ χορεύσωμεν ἀγαλλόμενοι, τῇ ἐτησίῳ πανηγύρει τοῦ θεοφόρου Πατρός· Βασιλεῖς καὶ Ἄρχοντες συντρεχέτωσαν, καὶ τὸν διʼ ὀνείρου φρικτῆς ἐπιστασίας, Βασιλέα πείθοντα, ἀναιτίους κρατουμένους τρεῖς, ἀπολῦσαι στρατηλάτας, ἀνυμνείτωσαν. Ποιμένες καὶ Διδάσκαλοι, τὸν τοῦ καλοῦ Ποιμένος, ὁμόζηλον Ποιμένα, συνελθόντες εὐφημήσωμεν. οἱ ἐν νόσοις τὸν ἰατρόν, οἱ ἐν κινδύνοις τὸν ῥύστην, οἱ ἁμαρτωλοὶ τὸν προστάτην, οἱ πένητες τὸν θησαυρόν, οἱ ἐν θλίψεσι τὴν παραμυθίαν· τὸν συνοδίτην οἱ ὁδοιπόροι, οἱ ἐν θαλάσσῃ τὸν κυβερνήτην, οἱ πάντες τὸν πανταχοῦ θερμῶς προφθάνοντα, μέγιστον Ἱεράρχην, ἐγκωμιάζοντες οὕτως εἴπωμεν· Πανάγιε Νικόλαε, πρόφθασον, ἐξελοῦ ἡμᾶς τῆς ἐνεστώσης ἀνάγκης, καὶ σῶσον τὴν ποίμνην σου ταῖς ἱκεσίαις σου.
ltx/gr_gr_cog/me.m12.d06:meMA.LaudsTheotokion.incipit	Σαλπίσωμεν ἐν σάλπιγγι ᾀσμάτων· προκύψασα…
ltx/gr_gr_cog/me.m12.d06:meMA.LaudsTheotokion.melody	
ltx/gr_gr_cog/me.m12.d06:meMA.LaudsTheotokion.mode	@ltx/gr_gr_cog/miscellanea:misc.Mode5
ltx/gr_gr_cog/me.m12.d06:meMA.LaudsTheotokion.text	Σαλπίσωμεν ἐν σάλπιγγι ᾀσμάτων· προκύψασα γὰρ ἄνωθεν, ἡ παντάνασσα Μητροπάρθενος, ταῖς εὐλογίαις καταστέφει τοὺς ἀνυμνοῦντας αὐτήν. Βασιλεῖς καὶ ἄρχοντες συντρεχέτωσαν, καὶ τὴν Βασιλίδα κροτείτωσαν ἐν ὕμνοις, Βασιλέα τέξασαν, τοὺς θανάτῳ κρατουμένους πρίν, ἀπολῦσαι φιλανθρώπως εὐδοκήσαντα. Ποιμένες καὶ Διδάσκαλοι, τὴν τοῦ καλοῦ Ποιμένος ὑπέραγνον Μητέρα, συνελθόντες εὐφημήσωμεν· τὴν λυχνίαν τὴν χρυσαυγῆ· τὴν φωτοφόρον νεφέλην· τὴν τῶν οὐρανῶν πλατυτέραν· τὴν ἔμψυχόν τε κιβωτόν· τὸν πυρίμορφον τοῦ Δεσπότου θρόνον· τὴν μανναδόχον χρυσέαν στάμνον· τὴν κεκλεισμένην τοῦ Λόγου πύλην· τὴν πάντων Χριστιανῶν τὸ καταφύγιον, ᾄσμασι θεηγόροις, ἐγκωμιάζοντες οὕτως εἴπωμεν· Παλάτιον τοῦ Λόγου, ἀξίωσον τοὺς ταπεινοὺς ἡμᾶς, τῆς οὐρανῶν Βασιλείας· οὐδὲν γὰρ ἀδύνατον τῇ μεσιτείᾳ σου.
ltx/gr_gr_cog/me.m12.d06:meMA.MM.Lauds1234as5678.text	@ltx/gr_gr_cog/properties:media.key
ltx/gr_gr_cog/me.m12.d06:meMA.Ode1C11.greekmelody	@ltx/gr_gr_cog/he.h.m1:heHE.OdinEpinikion.greekname
ltx/gr_gr_cog/me.m12.d06:meMA.Ode1C11.incipit	Σοφίας τὴν ἄβυσσον, ἡ τετοκυῖα…
ltx/gr_gr_cog/me.m12.d06:meMA.Ode1C11.melody	@ltx/gr_gr_cog/he.h.m1:heHE.OdinEpinikion.name
ltx/gr_gr_cog/me.m12.d06:meMA.Ode1C11.mode	@ltx/gr_gr_cog/miscellanea:misc.Mode1
ltx/gr_gr_cog/me.m12.d06:meMA.Ode1C11.ode	@ltx/gr_gr_cog/miscellanea:misc.Ode1
ltx/gr_gr_cog/me.m12.d06:meMA.Ode1C11.text	Σοφίας τὴν ἄβυσσον, ἡ τετοκυῖα, σταγόνα σοφίας μοι, Πηγὴ χαριτόβρυτε, σεμνὴ κατάπεμψον, ὑμνολογῆσαι τῶν χαρίτων σου τὸ πέλαγος.
ltx/gr_gr_cog/me.m12.d06:meMA.Ode1C12.incipit	Ὑμνῶ σε Πανύμνητε, ἣν ἀνυμνοῦσιν…
ltx/gr_gr_cog/me.m12.d06:meMA.Ode1C12.melody	@ltx/gr_gr_cog/he.h.m1:heHE.OdinEpinikion.name
ltx/gr_gr_cog/me.m12.d06:meMA.Ode1C12.mode	@ltx/gr_gr_cog/miscellanea:misc.Mode1
ltx/gr_gr_cog/me.m12.d06:meMA.Ode1C12.ode	@ltx/gr_gr_cog/miscellanea:misc.Ode1
ltx/gr_gr_cog/me.m12.d06:meMA.Ode1C12.text	Ὑμνῶ σε Πανύμνητε, ἣν ἀνυμνοῦσιν, Ἀγγέλων τὰ τάγματα, ὡς Θεὸν κυήσασαν, τὸν ὑπερύμνητον· ὃν πᾶσα κτίσις ἀνυμνεῖ ὅτι δεδόξασται.
ltx/gr_gr_cog/me.m12.d06:meMA.Ode1C1H.greekmelody	@ltx/gr_gr_cog/he.h.m1:heHE.OdinEpinikion.greekname
ltx/gr_gr_cog/me.m12.d06:meMA.Ode1C1H.incipit	@ltx/gr_gr_cog/he.h.m1:heHE.OdinEpinikion.incipit
ltx/gr_gr_cog/me.m12.d06:meMA.Ode1C1H.melody	@ltx/gr_gr_cog/he.h.m1:heHE.OdinEpinikion.melody
ltx/gr_gr_cog/me.m12.d06:meMA.Ode1C1H.mode	@ltx/gr_gr_cog/miscellanea:misc.Mode1
ltx/gr_gr_cog/me.m12.d06:meMA.Ode1C1H.ode	@ltx/gr_gr_cog/miscellanea:misc.Ode1
ltx/gr_gr_cog/me.m12.d06:meMA.Ode1C1H.text	@ltx/gr_gr_cog/he.h.m1:heHE.OdinEpinikion.text
ltx/gr_gr_cog/me.m12.d06:meMA.Ode1C21.greekmelody	@ltx/gr_gr_cog/he.h.m2:heHE.EnVythoKatestrose.greekname
ltx/gr_gr_cog/me.m12.d06:meMA.Ode1C21.incipit	Στεφηφόρος βήματι Χριστοῦ, πάνσοφε Νικόλαε…
ltx/gr_gr_cog/me.m12.d06:meMA.Ode1C21.melody	@ltx/gr_gr_cog/he.h.m2:heHE.EnVythoKatestrose.name
ltx/gr_gr_cog/me.m12.d06:meMA.Ode1C21.mode	@ltx/gr_gr_cog/miscellanea:misc.Mode2
ltx/gr_gr_cog/me.m12.d06:meMA.Ode1C21.ode	@ltx/gr_gr_cog/miscellanea:misc.Ode1
ltx/gr_gr_cog/me.m12.d06:meMA.Ode1C21.text	Στεφηφόρος βήματι Χριστοῦ, πάνσοφε Νικόλαε, παρεστηκὼς σὺν Ἀγγέλων στρατεύμασι, φωτισμόν μοι δώρησαι, καταυγάζοντα τῆς ψυχῆς μου τὴν ζόφωσιν, ὅπως εὐφημήσω χαίρων σου, παμμάκαρ τὴν Πανήγυριν.
ltx/gr_gr_cog/me.m12.d06:meMA.Ode1C22.incipit	Ὁ δοξάζων πάντας τοὺς αὐτόν…
ltx/gr_gr_cog/me.m12.d06:meMA.Ode1C22.melody	@ltx/gr_gr_cog/he.h.m2:heHE.EnVythoKatestrose.name
ltx/gr_gr_cog/me.m12.d06:meMA.Ode1C22.mode	@ltx/gr_gr_cog/miscellanea:misc.Mode2
ltx/gr_gr_cog/me.m12.d06:meMA.Ode1C22.ode	@ltx/gr_gr_cog/miscellanea:misc.Ode1
ltx/gr_gr_cog/me.m12.d06:meMA.Ode1C22.text	Ὁ δοξάζων πάντας τοὺς αὐτόν, Κύριος δοξάζοντας, σὲ τοῖς πιστοῖς καταφύγιον δέδωκε, πειρασμῶν ῥυόμενον, τοὺς προστρέχοντας τῇ σῇ σκέπῃ Νικόλαε, καὶ προσκαλουμένους πίστει σε, καὶ πόθῳ παναοίδιμε.
ltx/gr_gr_cog/me.m12.d06:meMA.Ode1C2T.incipit	Ἰσωθῆναι πόθον μοι ἐνθείς, ὄφις…
ltx/gr_gr_cog/me.m12.d06:meMA.Ode1C2T.melody	@ltx/gr_gr_cog/he.h.m2:heHE.EnVythoKatestrose.name
ltx/gr_gr_cog/me.m12.d06:meMA.Ode1C2T.mode	@ltx/gr_gr_cog/miscellanea:misc.Mode2
ltx/gr_gr_cog/me.m12.d06:meMA.Ode1C2T.ode	@ltx/gr_gr_cog/miscellanea:misc.Ode1
ltx/gr_gr_cog/me.m12.d06:meMA.Ode1C2T.text	Ἰσωθῆναι πόθον μοι ἐνθείς, ὄφις ὁ παμπόνηρος, τῷ Πλαστουργῷ, ὡς αἰχμάλωτον ἥρπασε· διὰ σοῦ δὲ Πάναγνε, ἀνακέκλημαι, θεωθεὶς ἀληθέστατα· σὺ γὰρ Θεομῆτορ, τὸν ἐμὲ θεώσαντα γεγέννηκας.
ltx/gr_gr_cog/me.m12.d06:meMA.Ode1C31.greekmelody	@ltx/gr_gr_cog/he.h.m1:heHE.ChristosGennatai.greekname
ltx/gr_gr_cog/me.m12.d06:meMA.Ode1C31.incipit	Ἀπόρῳ γλώττῃ καὶ χείλεσιν, ἐγκώμιον…
ltx/gr_gr_cog/me.m12.d06:meMA.Ode1C31.melody	@ltx/gr_gr_cog/he.h.m1:heHE.ChristosGennatai.name
ltx/gr_gr_cog/me.m12.d06:meMA.Ode1C31.mode	@ltx/gr_gr_cog/miscellanea:misc.Mode1
ltx/gr_gr_cog/me.m12.d06:meMA.Ode1C31.ode	@ltx/gr_gr_cog/miscellanea:misc.Ode1
ltx/gr_gr_cog/me.m12.d06:meMA.Ode1C31.text	Ἀπόρῳ γλώττῃ καὶ χείλεσιν, ἐγκώμιον βραχὺ καὶ παράκλησιν, προσάξαι τῇ σῇ Νικόλαε, ἥκω θεομιμήτῳ ὑπεροχῇ, ἀλλʼ ὡς πλουτοδότης, τὸν Σωτῆρα καὶ Θεὸν ἵλεων δίδου μοι.
ltx/gr_gr_cog/me.m12.d06:meMA.Ode1C32.incipit	Βροτὸς ὑπάρχων οὐράνιος, ἰσάγγελος ἐν…
ltx/gr_gr_cog/me.m12.d06:meMA.Ode1C32.melody	@ltx/gr_gr_cog/he.h.m1:heHE.ChristosGennatai.name
ltx/gr_gr_cog/me.m12.d06:meMA.Ode1C32.mode	@ltx/gr_gr_cog/miscellanea:misc.Mode1
ltx/gr_gr_cog/me.m12.d06:meMA.Ode1C32.ode	@ltx/gr_gr_cog/miscellanea:misc.Ode1
ltx/gr_gr_cog/me.m12.d06:meMA.Ode1C32.text	Βροτὸς ὑπάρχων οὐράνιος, ἰσάγγελος ἐν γῇ πεφανέρωσαι, χηρῶν ἀντιλήπτωρ μέγιστος, καὶ καταπονουμένων ἐκδικητής, πάντων θλιβομένων, ἐν κινδύνοις βοηθός, Πάτερ Νικόλαε.
ltx/gr_gr_cog/me.m12.d06:meMA.Ode1C33.incipit	Γνωρίζει πᾶσα ὑφήλιος, Νικόλαε τρισμάκαρ…
ltx/gr_gr_cog/me.m12.d06:meMA.Ode1C33.melody	@ltx/gr_gr_cog/he.h.m1:heHE.ChristosGennatai.name
ltx/gr_gr_cog/me.m12.d06:meMA.Ode1C33.mode	@ltx/gr_gr_cog/miscellanea:misc.Mode1
ltx/gr_gr_cog/me.m12.d06:meMA.Ode1C33.ode	@ltx/gr_gr_cog/miscellanea:misc.Ode1
ltx/gr_gr_cog/me.m12.d06:meMA.Ode1C33.text	Γνωρίζει πᾶσα ὑφήλιος, Νικόλαε τρισμάκαρ τὰ θαύματα, τῶν σῶν ἀρετῶν τὸ πέλαγος, πένητες τὸν Προστάτην, καὶ ὀρφανοί, χῆραι τὸν τροφέα, καὶ τυφλοὶ τὸν ὁδηγόν, πάντες τὸν πρόμαχον.
ltx/gr_gr_cog/me.m12.d06:meMA.Ode1C3T.incipit	Ἀσπόρως Λόγον συνείληφας, τὸν ἕνα…
ltx/gr_gr_cog/me.m12.d06:meMA.Ode1C3T.melody	@ltx/gr_gr_cog/he.h.m1:heHE.ChristosGennatai.name
ltx/gr_gr_cog/me.m12.d06:meMA.Ode1C3T.mode	@ltx/gr_gr_cog/miscellanea:misc.Mode1
ltx/gr_gr_cog/me.m12.d06:meMA.Ode1C3T.ode	@ltx/gr_gr_cog/miscellanea:misc.Ode1
ltx/gr_gr_cog/me.m12.d06:meMA.Ode1C3T.text	Ἀσπόρως Λόγον συνείληφας, τὸν ἕνα τῆς Τριάδος Πανάχραντε, καὶ τοῦτον σαρκὶ γεγέννηκας, μείνασα μετὰ τόκον ὥσπερ τὸ πρίν, τοῦτον ὡς Υἱόν σου, καὶ Θεὸν ὑπέρ ἡμῶν ἀεὶ ἱκέτευε.
ltx/gr_gr_cog/me.m12.d06:meMA.Ode1C3Tr.incipit	Τριάδα σέβω τὴν ἄκτιστον, Πατέρα…
ltx/gr_gr_cog/me.m12.d06:meMA.Ode1C3Tr.melody	@ltx/gr_gr_cog/he.h.m1:heHE.ChristosGennatai.name
ltx/gr_gr_cog/me.m12.d06:meMA.Ode1C3Tr.mode	@ltx/gr_gr_cog/miscellanea:misc.Mode1
ltx/gr_gr_cog/me.m12.d06:meMA.Ode1C3Tr.ode	@ltx/gr_gr_cog/miscellanea:misc.Ode1
ltx/gr_gr_cog/me.m12.d06:meMA.Ode1C3Tr.text	Τριάδα σέβω τὴν ἄκτιστον, Πατέρα καὶ Υἱὸν σὺν τῷ Πνεύματι, οὐσίαν ἁπλὴν Θεότητα, φύσιν μὴ τεμνομένην οὐσιωδῶς, τρεῖς τὰς ὑποστάσεις, διαιρῶν προσωπικῶς, καὶ καθʼ ὑπόστασιν.
ltx/gr_gr_cog/me.m12.d06:meMA.Ode3C11.greekmelody	@ltx/gr_gr_cog/he.h.m1:heHE.StereothitoIKardiaMou.greekname
ltx/gr_gr_cog/me.m12.d06:meMA.Ode3C11.incipit	Ὁ οὐρανὸς ὁ καθαρώτατος, τὸ…
ltx/gr_gr_cog/me.m12.d06:meMA.Ode3C11.melody	@ltx/gr_gr_cog/he.h.m1:heHE.StereothitoIKardiaMou.name
ltx/gr_gr_cog/me.m12.d06:meMA.Ode3C11.mode	@ltx/gr_gr_cog/miscellanea:misc.Mode1
ltx/gr_gr_cog/me.m12.d06:meMA.Ode3C11.ode	@ltx/gr_gr_cog/miscellanea:misc.Ode3
ltx/gr_gr_cog/me.m12.d06:meMA.Ode3C11.text	Ὁ οὐρανὸς ὁ καθαρώτατος, τὸ τοῦ Βασιλέως ἀνάκτορον, ὁ χαριτόπνους ἀληθῶς, καὶ εὐώδης Παράδεισος, ἡ ἐλπὶς Χριστιανῶν, ἡ Θεοτόκος ὑμνείσθω μοι.
ltx/gr_gr_cog/me.m12.d06:meMA.Ode3C12.incipit	Λόγῳ τὸν Λόγον ἀπεκύησας, τὸν…
ltx/gr_gr_cog/me.m12.d06:meMA.Ode3C12.melody	@ltx/gr_gr_cog/he.h.m1:heHE.StereothitoIKardiaMou.name
ltx/gr_gr_cog/me.m12.d06:meMA.Ode3C12.mode	@ltx/gr_gr_cog/miscellanea:misc.Mode1
ltx/gr_gr_cog/me.m12.d06:meMA.Ode3C12.ode	@ltx/gr_gr_cog/miscellanea:misc.Ode3
ltx/gr_gr_cog/me.m12.d06:meMA.Ode3C12.text	Λόγῳ τὸν Λόγον ἀπεκύησας, τὸν τῷ λόγῳ πᾶσαν πρὸς ὕπαρξιν, παραγαγόντα λογικήν, φύσιν ἅμα καὶ ἄλογον, ἀλογίας ἐκλυτρούμενον, βροτοὺς Παντευλόγητε.
ltx/gr_gr_cog/me.m12.d06:meMA.Ode3C1H.greekmelody	@ltx/gr_gr_cog/he.h.m1:heHE.StereothitoIKardiaMou.greekname
ltx/gr_gr_cog/me.m12.d06:meMA.Ode3C1H.incipit	@ltx/gr_gr_cog/he.h.m1:heHE.StereothitoIKardiaMou.incipit
ltx/gr_gr_cog/me.m12.d06:meMA.Ode3C1H.melody	@ltx/gr_gr_cog/he.h.m1:heHE.StereothitoIKardiaMou.melody
ltx/gr_gr_cog/me.m12.d06:meMA.Ode3C1H.mode	@ltx/gr_gr_cog/miscellanea:misc.Mode1
ltx/gr_gr_cog/me.m12.d06:meMA.Ode3C1H.ode	@ltx/gr_gr_cog/miscellanea:misc.Ode3
ltx/gr_gr_cog/me.m12.d06:meMA.Ode3C1H.text	@ltx/gr_gr_cog/he.h.m1:heHE.StereothitoIKardiaMou.text
ltx/gr_gr_cog/me.m12.d06:meMA.Ode3C21.greekmelody	@ltx/gr_gr_cog/he.h.m2:heHE.ExinthisenIErimos.greekname
ltx/gr_gr_cog/me.m12.d06:meMA.Ode3C21.incipit	Νικόλαε μακάριε, τοῦ Δεσπότου γνήσιος…
ltx/gr_gr_cog/me.m12.d06:meMA.Ode3C21.melody	@ltx/gr_gr_cog/he.h.m2:heHE.ExinthisenIErimos.name
ltx/gr_gr_cog/me.m12.d06:meMA.Ode3C21.mode	@ltx/gr_gr_cog/miscellanea:misc.Mode2
ltx/gr_gr_cog/me.m12.d06:meMA.Ode3C21.ode	@ltx/gr_gr_cog/miscellanea:misc.Ode3
ltx/gr_gr_cog/me.m12.d06:meMA.Ode3C21.text	Νικόλαε μακάριε, τοῦ Δεσπότου γνήσιος, σὺ μαθητὴς γενόμενος, διασῴζεις τοὺς σοὶ προστρέχοντας χαλεπῶν ἐκ κινδύνων, καὶ θανάτου πικροῦ.
ltx/gr_gr_cog/me.m12.d06:meMA.Ode3C22.incipit	Ἱλάσθητι τοῖς δούλοις σου, τῶν…
ltx/gr_gr_cog/me.m12.d06:meMA.Ode3C22.melody	@ltx/gr_gr_cog/he.h.m2:heHE.ExinthisenIErimos.name
ltx/gr_gr_cog/me.m12.d06:meMA.Ode3C22.mode	@ltx/gr_gr_cog/miscellanea:misc.Mode2
ltx/gr_gr_cog/me.m12.d06:meMA.Ode3C22.ode	@ltx/gr_gr_cog/miscellanea:misc.Ode3
ltx/gr_gr_cog/me.m12.d06:meMA.Ode3C22.text	Ἱλάσθητι τοῖς δούλοις σου, τῶν πταισμάτων ἄφεσιν, ὡς ἀγαθὸς δωρούμενος, Νικολάου τοῦ σοῦ θεράποντος, ταῖς πρὸς σὲ μεσιτείαις Πολυέλεε.
ltx/gr_gr_cog/me.m12.d06:meMA.Ode3C2T.incipit	Κατεύνασον τὸν τάραχον, τῶν παθῶν…
ltx/gr_gr_cog/me.m12.d06:meMA.Ode3C2T.melody	@ltx/gr_gr_cog/he.h.m2:heHE.ExinthisenIErimos.name
ltx/gr_gr_cog/me.m12.d06:meMA.Ode3C2T.mode	@ltx/gr_gr_cog/miscellanea:misc.Mode2
ltx/gr_gr_cog/me.m12.d06:meMA.Ode3C2T.ode	@ltx/gr_gr_cog/miscellanea:misc.Ode3
ltx/gr_gr_cog/me.m12.d06:meMA.Ode3C2T.text	Κατεύνασον τὸν τάραχον, τῶν παθῶν μου Δέσποινα καὶ τὴν ζωὴν κυβέρνησον, Παναγία Χριστὸν ἡ τέξασα, ἐν ᾧ ἐστερεώθῃ ἡ καρδία μου.
ltx/gr_gr_cog/me.m12.d06:meMA.Ode3C31.greekmelody	@ltx/gr_gr_cog/he.h.m1:heHE.ToProTonAionon.greekname
ltx/gr_gr_cog/me.m12.d06:meMA.Ode3C31.incipit	Δέλτον ἐν καρδίᾳ, κεκτημένος θεόφρον…
ltx/gr_gr_cog/me.m12.d06:meMA.Ode3C31.melody	@ltx/gr_gr_cog/he.h.m1:heHE.ToProTonAionon.name
ltx/gr_gr_cog/me.m12.d06:meMA.Ode3C31.mode	@ltx/gr_gr_cog/miscellanea:misc.Mode1
ltx/gr_gr_cog/me.m12.d06:meMA.Ode3C31.ode	@ltx/gr_gr_cog/miscellanea:misc.Ode3
ltx/gr_gr_cog/me.m12.d06:meMA.Ode3C31.text	Δέλτον ἐν καρδίᾳ, κεκτημένος θεόφρον πολλῶν ἀρετῶν, ἐγγεγραμμένην ἀθανάτῳ, καὶ ἀχράντῳ δακτύλῳ, Χριστοῦ τοῦ Θεοῦ Νικόλαε, ὑπὲρ κηρίον καὶ μέλι γλυκύ, στάζεις ἐν τοῖς λόγοις σου.
ltx/gr_gr_cog/me.m12.d06:meMA.Ode3C32.incipit	Ἔδειξεν ἡ χάρις, ἐπὶ σὲ…
ltx/gr_gr_cog/me.m12.d06:meMA.Ode3C32.melody	@ltx/gr_gr_cog/he.h.m1:heHE.ToProTonAionon.name
ltx/gr_gr_cog/me.m12.d06:meMA.Ode3C32.mode	@ltx/gr_gr_cog/miscellanea:misc.Mode1
ltx/gr_gr_cog/me.m12.d06:meMA.Ode3C32.ode	@ltx/gr_gr_cog/miscellanea:misc.Ode3
ltx/gr_gr_cog/me.m12.d06:meMA.Ode3C32.text	Ἔδειξεν ἡ χάρις, ἐπὶ σὲ παραδόξως τὰ θαύματα· ἡ φαιδρὰ γάρ σου πολιτεία, ὦ Νικόλαε ὄντως, χρυσοῦ παντὸς τηλαυγέστερον, ὑπεραστράπτει καὶ λάμπει ψυχαῖς, αἴγλῃ θείου Πνεύματος.
ltx/gr_gr_cog/me.m12.d06:meMA.Ode3C33.incipit	Ζῇς καὶ μετὰ πότμον, ἐν…
ltx/gr_gr_cog/me.m12.d06:meMA.Ode3C33.melody	@ltx/gr_gr_cog/he.h.m1:heHE.ToProTonAionon.name
ltx/gr_gr_cog/me.m12.d06:meMA.Ode3C33.mode	@ltx/gr_gr_cog/miscellanea:misc.Mode1
ltx/gr_gr_cog/me.m12.d06:meMA.Ode3C33.ode	@ltx/gr_gr_cog/miscellanea:misc.Ode3
ltx/gr_gr_cog/me.m12.d06:meMA.Ode3C33.text	Ζῇς καὶ μετὰ πότμον, ἐν ὀνείροις σαφῶς ὀπτανόμενος, καὶ νεανίας ἐκ θανάτου, παραδόξως λυτροῦσαι βοῶν ἐμφανῶς τῷ Ἄνακτι· Μὴ ἀδικήσῃς τοὺς ἄνδρας, ἐπεὶ φθόνῳ διεβλήθησαν.
ltx/gr_gr_cog/me.m12.d06:meMA.Ode3C3T.incipit	Νέμοις Θεοτόκε, σωτηρίας ἐλπίδα τοῖς…
ltx/gr_gr_cog/me.m12.d06:meMA.Ode3C3T.melody	@ltx/gr_gr_cog/he.h.m1:heHE.ToProTonAionon.name
ltx/gr_gr_cog/me.m12.d06:meMA.Ode3C3T.mode	@ltx/gr_gr_cog/miscellanea:misc.Mode1
ltx/gr_gr_cog/me.m12.d06:meMA.Ode3C3T.ode	@ltx/gr_gr_cog/miscellanea:misc.Ode3
ltx/gr_gr_cog/me.m12.d06:meMA.Ode3C3T.text	Νέμοις Θεοτόκε, σωτηρίας ἐλπίδα τοῖς δούλοις σου, καὶ ἐν ἀνάγκαις καὶ κινδύνοις, ταχυδρόμοις πρεσβείαις, φρουρεῖν, βοηθεῖν παράστηθι· σὺ γὰρ τὸ κλέος ἡμῶν τῶν πιστῶν, πέλεις θεονύμφευτε.
ltx/gr_gr_cog/me.m12.d06:meMA.Ode3C3Tr.incipit	Ἵλεως γενοῦ μοι, Παναγία Τριὰς…
ltx/gr_gr_cog/me.m12.d06:meMA.Ode3C3Tr.melody	@ltx/gr_gr_cog/he.h.m1:heHE.ToProTonAionon.name
ltx/gr_gr_cog/me.m12.d06:meMA.Ode3C3Tr.mode	@ltx/gr_gr_cog/miscellanea:misc.Mode1
ltx/gr_gr_cog/me.m12.d06:meMA.Ode3C3Tr.ode	@ltx/gr_gr_cog/miscellanea:misc.Ode3
ltx/gr_gr_cog/me.m12.d06:meMA.Ode3C3Tr.text	Ἵλεως γενοῦ μοι, Παναγία Τριὰς ὁ Θεὸς ἡμῶν, τῷ ἐν ἀμέτροις πλημμελείαις, ῥυπωθέντι τῷ βίῳ, Πατήρ, ὁ Υἱός, Πνεῦμα τὸ ζῶν, διατηροῦσά με πάντοθεν καὶ ἀεί, ἄτρωτον ἐκ θλίψεως.
ltx/gr_gr_cog/me.m12.d06:meMA.Ode3Kathisma1.greekmelody	@ltx/gr_gr_cog/he.a.m8:heAU.TinSofianKaiLogon.greekname
ltx/gr_gr_cog/me.m12.d06:meMA.Ode3Kathisma1.incipit	Ποταμὸν ἰαμάτων ὑπερχειλῆ, καὶ πηγήν…
ltx/gr_gr_cog/me.m12.d06:meMA.Ode3Kathisma1.melody	@ltx/gr_gr_cog/he.a.m8:heAU.TinSofianKaiLogon.name
ltx/gr_gr_cog/me.m12.d06:meMA.Ode3Kathisma1.mode	@ltx/gr_gr_cog/miscellanea:misc.Mode8
ltx/gr_gr_cog/me.m12.d06:meMA.Ode3Kathisma1.text	Ποταμὸν ἰαμάτων ὑπερχειλῆ, καὶ πηγήν σε θαυμάτων ἀνελλιπῆ, ἔδειξε Νικόλαε, τοῦ ἐλέους ἡ ἄβυσσος· οἱ γὰρ βαρείαις νόσοις, πικρῶς πιεζόμενοι, καὶ συμφοραῖς τοῦ βίου, δεινῶς ἐταζόμενοι, πάσης ἀθυμίας, ἀκεσώδυνον ὄντως, εὑρίσκουσι φάρμακον, τὴν θερμήν σου ἀντίληψιν· διὰ τοῦτο βοῶμέν σοι· Πρέσβευε Χριστῷ τῷ Θεῷ, τῶν πταισμάτων ἄφεσιν δωρήσασθαι, τοῖς ἑορτάζουσι πόθῳ, τὴν ἁγίαν μνήμην σου.
ltx/gr_gr_cog/me.m12.d06:meMA.Ode3KathismaT.incipit	@ltx/gr_gr_cog/he.a.m8:heAU.TinSofianKaiLogon.incipit
ltx/gr_gr_cog/me.m12.d06:meMA.Ode3KathismaT.melody	@ltx/gr_gr_cog/he.a.m8:heAU.TinSofianKaiLogon.melody
ltx/gr_gr_cog/me.m12.d06:meMA.Ode3KathismaT.mode	@ltx/gr_gr_cog/miscellanea:misc.Mode8
ltx/gr_gr_cog/me.m12.d06:meMA.Ode3KathismaT.text	@ltx/gr_gr_cog/he.a.m8:heAU.TinSofianKaiLogon.text
ltx/gr_gr_cog/me.m12.d06:meMA.Ode4C11.greekmelody	@ltx/gr_gr_cog/he.h.m1:heHE.EnPnevmatiProvlepon.greekname
ltx/gr_gr_cog/me.m12.d06:meMA.Ode4C11.incipit	Θανάτου μὲν αἰτία, ἡ Εὔα…
ltx/gr_gr_cog/me.m12.d06:meMA.Ode4C11.melody	@ltx/gr_gr_cog/he.h.m1:heHE.EnPnevmatiProvlepon.name
ltx/gr_gr_cog/me.m12.d06:meMA.Ode4C11.mode	@ltx/gr_gr_cog/miscellanea:misc.Mode1
ltx/gr_gr_cog/me.m12.d06:meMA.Ode4C11.ode	@ltx/gr_gr_cog/miscellanea:misc.Ode4
ltx/gr_gr_cog/me.m12.d06:meMA.Ode4C11.text	Θανάτου μὲν αἰτία, ἡ Εὔα τοῖς βροτοῖς, συμβουλίᾳ ὄφεως, γεγένηται Ἁγνή, σὺ δὲ Παρθένε τεκοῦσα λόγῳ τὸν Λόγον, ἀθανασίας καὶ ζωῆς πρόξενος ὤφθης· ὅθεν ἐπαξίως ὑμνοῦμέν σε.
ltx/gr_gr_cog/me.m12.d06:meMA.Ode4C12.incipit	Ἐν πνεύματι Προφῆται, προεῖδόν σε…
ltx/gr_gr_cog/me.m12.d06:meMA.Ode4C12.melody	@ltx/gr_gr_cog/he.h.m1:heHE.EnPnevmatiProvlepon.name
ltx/gr_gr_cog/me.m12.d06:meMA.Ode4C12.mode	@ltx/gr_gr_cog/miscellanea:misc.Mode1
ltx/gr_gr_cog/me.m12.d06:meMA.Ode4C12.ode	@ltx/gr_gr_cog/miscellanea:misc.Ode4
ltx/gr_gr_cog/me.m12.d06:meMA.Ode4C12.text	Ἐν πνεύματι Προφῆται, προεῖδόν σε Ἁγνή, Ὄρος, Πύλην, Τράπεζαν, ἁγίαν Κιβωτόν, Λυχνίαν θρόνον ζωῆς, Στάμνον καὶ Κλίνην, Θεοῦ Μητέρα, ἐν συμβόλοις σε δηλοῦντες, ὧν ἡμεῖς ὁρῶμεν τὴν ἔκβασιν.
ltx/gr_gr_cog/me.m12.d06:meMA.Ode4C1H.greekmelody	@ltx/gr_gr_cog/he.h.m1:heHE.EnPnevmatiProvlepon.greekname
ltx/gr_gr_cog/me.m12.d06:meMA.Ode4C1H.incipit	@ltx/gr_gr_cog/he.h.m1:heHE.EnPnevmatiProvlepon.incipit
ltx/gr_gr_cog/me.m12.d06:meMA.Ode4C1H.melody	@ltx/gr_gr_cog/he.h.m1:heHE.EnPnevmatiProvlepon.melody
ltx/gr_gr_cog/me.m12.d06:meMA.Ode4C1H.mode	@ltx/gr_gr_cog/miscellanea:misc.Mode1
ltx/gr_gr_cog/me.m12.d06:meMA.Ode4C1H.ode	@ltx/gr_gr_cog/miscellanea:misc.Ode4
ltx/gr_gr_cog/me.m12.d06:meMA.Ode4C1H.text	@ltx/gr_gr_cog/he.h.m1:heHE.EnPnevmatiProvlepon.text
ltx/gr_gr_cog/me.m12.d06:meMA.Ode4C21.greekmelody	@ltx/gr_gr_cog/he.h.m2:heHE.ElilythasEkParthenou.greekname
ltx/gr_gr_cog/me.m12.d06:meMA.Ode4C21.incipit	Ὁμιλήσας, καθαρῶς ταῖς ἀκτῖσι τοῦ…
ltx/gr_gr_cog/me.m12.d06:meMA.Ode4C21.melody	@ltx/gr_gr_cog/he.h.m2:heHE.ElilythasEkParthenou.name
ltx/gr_gr_cog/me.m12.d06:meMA.Ode4C21.mode	@ltx/gr_gr_cog/miscellanea:misc.Mode2
ltx/gr_gr_cog/me.m12.d06:meMA.Ode4C21.ode	@ltx/gr_gr_cog/miscellanea:misc.Ode4
ltx/gr_gr_cog/me.m12.d06:meMA.Ode4C21.text	Ὁμιλήσας, καθαρῶς ταῖς ἀκτῖσι τοῦ Πνεύματος, φωτοφόρος γέγονας, κόσμου φωτίζων τὰ πέρατα, πᾶσι παριστάμενος, καὶ πάντας σῴζων, τοὺς πίστει σοι προστρέχοντας.
ltx/gr_gr_cog/me.m12.d06:meMA.Ode4C22.incipit	Λυτρούμενος, ἐκ θανάτου ὡς ὤφθης…
ltx/gr_gr_cog/me.m12.d06:meMA.Ode4C22.melody	@ltx/gr_gr_cog/he.h.m2:heHE.ElilythasEkParthenou.name
ltx/gr_gr_cog/me.m12.d06:meMA.Ode4C22.mode	@ltx/gr_gr_cog/miscellanea:misc.Mode2
ltx/gr_gr_cog/me.m12.d06:meMA.Ode4C22.ode	@ltx/gr_gr_cog/miscellanea:misc.Ode4
ltx/gr_gr_cog/me.m12.d06:meMA.Ode4C22.text	Λυτρούμενος, ἐκ θανάτου ὡς ὤφθης τὸ πρότερον, νεανίας Ὅσιε, οὕτω καὶ νῦν με διάσωσον, πάσης περιστάσεως, καὶ πειρασμῶν καὶ κινδύνων παμμακάριστε.
ltx/gr_gr_cog/me.m12.d06:meMA.Ode4C23.incipit	Ἀπήστραψας, ἀρετῶν λαμπηδόνας Πανόλβιε, μιμητὴς…
ltx/gr_gr_cog/me.m12.d06:meMA.Ode4C23.melody	@ltx/gr_gr_cog/he.h.m2:heHE.ElilythasEkParthenou.name
ltx/gr_gr_cog/me.m12.d06:meMA.Ode4C23.mode	@ltx/gr_gr_cog/miscellanea:misc.Mode2
ltx/gr_gr_cog/me.m12.d06:meMA.Ode4C23.ode	@ltx/gr_gr_cog/miscellanea:misc.Ode4
ltx/gr_gr_cog/me.m12.d06:meMA.Ode4C23.text	Ἀπήστραψας, ἀρετῶν λαμπηδόνας Πανόλβιε, μιμητὴς πανάριστος τοῦ σοῦ Δεσπότου γενόμενος· σῴζεις δὲ καλούμενος, τοὺς εὐλαβείᾳ καὶ πόθῳ σε δοξάζοντας.
ltx/gr_gr_cog/me.m12.d06:meMA.Ode4C2T.incipit	Ἐλήλυθεν, ἐπὶ σοὶ ὁ Δεσπότης…
ltx/gr_gr_cog/me.m12.d06:meMA.Ode4C2T.melody	@ltx/gr_gr_cog/he.h.m2:heHE.ElilythasEkParthenou.name
ltx/gr_gr_cog/me.m12.d06:meMA.Ode4C2T.mode	@ltx/gr_gr_cog/miscellanea:misc.Mode2
ltx/gr_gr_cog/me.m12.d06:meMA.Ode4C2T.ode	@ltx/gr_gr_cog/miscellanea:misc.Ode4
ltx/gr_gr_cog/me.m12.d06:meMA.Ode4C2T.text	Ἐλήλυθεν, ἐπὶ σοὶ ὁ Δεσπότης καὶ Κύριος, σωματωθησόμενος, καὶ διασώσων ὡς εὔσπλαγχνος, ὅλον με τὸν ἄνθρωπον· διὸ κραυγάζω σοι· Χαῖρε Θεοτόκε Πανάμωμε.
ltx/gr_gr_cog/me.m12.d06:meMA.Ode4C31.greekmelody	@ltx/gr_gr_cog/he.h.m1:heHE.RavdosEkTisRizis.greekname
ltx/gr_gr_cog/me.m12.d06:meMA.Ode4C31.incipit	Ἡ κλῆσίς μου μόνη ἀληθῶς…
ltx/gr_gr_cog/me.m12.d06:meMA.Ode4C31.melody	@ltx/gr_gr_cog/he.h.m1:heHE.RavdosEkTisRizis.name
ltx/gr_gr_cog/me.m12.d06:meMA.Ode4C31.mode	@ltx/gr_gr_cog/miscellanea:misc.Mode1
ltx/gr_gr_cog/me.m12.d06:meMA.Ode4C31.ode	@ltx/gr_gr_cog/miscellanea:misc.Ode4
ltx/gr_gr_cog/me.m12.d06:meMA.Ode4C31.text	Ἡ κλῆσίς μου μόνη ἀληθῶς, ἐν πάσαις τῶν ἐχθρῶν βουλαῖς, προσκαλουμένη θᾶττον ῥύεται, τοὺς κράζοντάς σοι θερμῶς, Ἱερὲ Νικόλαε. Ὡς πρὶν στρατηλάτας ἐλυτρώσω, διάσωσον καὶ ἡμᾶς, πάσης ἐκ δεινῆς περιστάσεως.
ltx/gr_gr_cog/me.m12.d06:meMA.Ode4C32.incipit	Θρόνῳ παριστάμενος Θεοῦ, πρεσβεύειν ἐκτενῶς…
ltx/gr_gr_cog/me.m12.d06:meMA.Ode4C32.melody	@ltx/gr_gr_cog/he.h.m1:heHE.RavdosEkTisRizis.name
ltx/gr_gr_cog/me.m12.d06:meMA.Ode4C32.mode	@ltx/gr_gr_cog/miscellanea:misc.Mode1
ltx/gr_gr_cog/me.m12.d06:meMA.Ode4C32.ode	@ltx/gr_gr_cog/miscellanea:misc.Ode4
ltx/gr_gr_cog/me.m12.d06:meMA.Ode4C32.text	Θρόνῳ παριστάμενος Θεοῦ, πρεσβεύειν ἐκτενῶς σοφέ, μὴ διαλίπῃς ὑπὲρ πάντων ὑμῶν, τῶν σῶν πιστῶν οἰκετῶν, θαυμαστὲ Νικόλαε, ἵνα τοῦ πυρὸς τοῦ αἰωνίου, ῥυσθῶμεν καὶ ἐξ ἐχθρῶν, γνώμης πονηρὰς καὶ κακώσεως.
ltx/gr_gr_cog/me.m12.d06:meMA.Ode4C33.incipit	Ἰάματα βρύεις πανταχοῦ, τοῖς πίστει…
ltx/gr_gr_cog/me.m12.d06:meMA.Ode4C33.melody	@ltx/gr_gr_cog/he.h.m1:heHE.RavdosEkTisRizis.name
ltx/gr_gr_cog/me.m12.d06:meMA.Ode4C33.mode	@ltx/gr_gr_cog/miscellanea:misc.Mode1
ltx/gr_gr_cog/me.m12.d06:meMA.Ode4C33.ode	@ltx/gr_gr_cog/miscellanea:misc.Ode4
ltx/gr_gr_cog/me.m12.d06:meMA.Ode4C33.text	Ἰάματα βρύεις πανταχοῦ, τοῖς πίστει σοι προστρέχουσι, καὶ ἐκ δεσμῶν λυτροῦσαι ἅπαντας· διὸ τὴν λύπην ἡμῶν, εἰς χαρὰν μετάβαλε, ταῖς εὐπροσδέκτοις ἱκεσίαις, Νικόλαε φαεινέ, θραύων τὴν ὀφρὺν τῶν ἐχθρῶν ἡμῶν.
ltx/gr_gr_cog/me.m12.d06:meMA.Ode4C3T.incipit	Σὺ ὄντως ἐπέκεινα βροτῶν, Ἀγγέλων…
ltx/gr_gr_cog/me.m12.d06:meMA.Ode4C3T.melody	@ltx/gr_gr_cog/he.h.m1:heHE.RavdosEkTisRizis.name
ltx/gr_gr_cog/me.m12.d06:meMA.Ode4C3T.mode	@ltx/gr_gr_cog/miscellanea:misc.Mode1
ltx/gr_gr_cog/me.m12.d06:meMA.Ode4C3T.ode	@ltx/gr_gr_cog/miscellanea:misc.Ode4
ltx/gr_gr_cog/me.m12.d06:meMA.Ode4C3T.text	Σὺ ὄντως ἐπέκεινα βροτῶν, Ἀγγέλων τε ὑπέρτιμος, θεογεννῆτορ Κόρη πέφηνας· τὸν πάντων γὰρ Ποιητήν, ἐν γαστρὶ συνείληφας, σάρκα ὑλικὴν ἠμφιεσμένον, τεκοῦσα δίχα σπορᾶς. Ὢ καινοπρεποῦς θεωρήματος!
ltx/gr_gr_cog/me.m12.d06:meMA.Ode4C3Tr.incipit	Ἀνάρχου θεότητος ἀρχήν, Πατέρα καὶ…
ltx/gr_gr_cog/me.m12.d06:meMA.Ode4C3Tr.melody	@ltx/gr_gr_cog/he.h.m1:heHE.RavdosEkTisRizis.name
ltx/gr_gr_cog/me.m12.d06:meMA.Ode4C3Tr.mode	@ltx/gr_gr_cog/miscellanea:misc.Mode1
ltx/gr_gr_cog/me.m12.d06:meMA.Ode4C3Tr.ode	@ltx/gr_gr_cog/miscellanea:misc.Ode4
ltx/gr_gr_cog/me.m12.d06:meMA.Ode4C3Tr.text	Ἀνάρχου θεότητος ἀρχήν, Πατέρα καὶ Υἱὸν τιμῶ, καὶ Πνεῦμα σέβω τὸ πανάγιον, τὴν πάντων παντουργικήν, ἑνιαίαν ἄτμητον, τρισὶ χαρακτῆρσι καὶ προσώποις, διῃρημένην ἀεί, μίαν Βασιλείαν ἀμέριστον.
ltx/gr_gr_cog/me.m12.d06:meMA.Ode5C11.greekmelody	@ltx/gr_gr_cog/he.h.m1:heHE.ToFaeinonIminExanateilon.greekname
ltx/gr_gr_cog/me.m12.d06:meMA.Ode5C11.incipit	Ὡς Κιβωτὸς Σεμνὴ ἁγιάσματος, καὶ…
ltx/gr_gr_cog/me.m12.d06:meMA.Ode5C11.melody	@ltx/gr_gr_cog/he.h.m1:heHE.ToFaeinonIminExanateilon.name
ltx/gr_gr_cog/me.m12.d06:meMA.Ode5C11.mode	@ltx/gr_gr_cog/miscellanea:misc.Mode1
ltx/gr_gr_cog/me.m12.d06:meMA.Ode5C11.ode	@ltx/gr_gr_cog/miscellanea:misc.Ode5
ltx/gr_gr_cog/me.m12.d06:meMA.Ode5C11.text	Ὡς Κιβωτὸς Σεμνὴ ἁγιάσματος, καὶ ὡς πυρίμορφος θρόνος ἅγιος, καὶ ὡς Παλάτιον ἡγιασμένον, Δέσποινα ἐχώρησας, Θεὸν Παντοκράτορα.
ltx/gr_gr_cog/me.m12.d06:meMA.Ode5C12.incipit	Μήτηρ ἀπειράνδρως ἐν παρθένοις σύ…
ltx/gr_gr_cog/me.m12.d06:meMA.Ode5C12.melody	@ltx/gr_gr_cog/he.h.m1:heHE.ToFaeinonIminExanateilon.name
ltx/gr_gr_cog/me.m12.d06:meMA.Ode5C12.mode	@ltx/gr_gr_cog/miscellanea:misc.Mode1
ltx/gr_gr_cog/me.m12.d06:meMA.Ode5C12.ode	@ltx/gr_gr_cog/miscellanea:misc.Ode5
ltx/gr_gr_cog/me.m12.d06:meMA.Ode5C12.text	Μήτηρ ἀπειράνδρως ἐν παρθένοις σύ, αὖθις Παρθένος δέ, ἐν μητράσι μόνη Πάναγνε ἀῤῥήτως ὤφθης· Θεὸν γὰρ ἐγέννησας, τὸν φύσεις ἀμείβοντα.
ltx/gr_gr_cog/me.m12.d06:meMA.Ode5C1H.greekmelody	@ltx/gr_gr_cog/he.h.m1:heHE.ToFaeinonIminExanateilon.greekname
ltx/gr_gr_cog/me.m12.d06:meMA.Ode5C1H.incipit	@ltx/gr_gr_cog/he.h.m1:heHE.ToFaeinonIminExanateilon.incipit
ltx/gr_gr_cog/me.m12.d06:meMA.Ode5C1H.melody	@ltx/gr_gr_cog/he.h.m1:heHE.ToFaeinonIminExanateilon.melody
ltx/gr_gr_cog/me.m12.d06:meMA.Ode5C1H.mode	@ltx/gr_gr_cog/miscellanea:misc.Mode1
ltx/gr_gr_cog/me.m12.d06:meMA.Ode5C1H.ode	@ltx/gr_gr_cog/miscellanea:misc.Ode5
ltx/gr_gr_cog/me.m12.d06:meMA.Ode5C1H.text	@ltx/gr_gr_cog/he.h.m1:heHE.ToFaeinonIminExanateilon.text
ltx/gr_gr_cog/me.m12.d06:meMA.Ode5C21.greekmelody	@ltx/gr_gr_cog/he.h.m2:heHE.OFotismos.greekname
ltx/gr_gr_cog/me.m12.d06:meMA.Ode5C21.incipit	Θεοπρεπεῖ, πολιτείᾳ Τρισμάκαρ λελαμπρυσμένος, τοὺς…
ltx/gr_gr_cog/me.m12.d06:meMA.Ode5C21.melody	@ltx/gr_gr_cog/he.h.m2:heHE.OFotismos.name
ltx/gr_gr_cog/me.m12.d06:meMA.Ode5C21.mode	@ltx/gr_gr_cog/miscellanea:misc.Mode2
ltx/gr_gr_cog/me.m12.d06:meMA.Ode5C21.ode	@ltx/gr_gr_cog/miscellanea:misc.Ode5
ltx/gr_gr_cog/me.m12.d06:meMA.Ode5C21.text	Θεοπρεπεῖ, πολιτείᾳ Τρισμάκαρ λελαμπρυσμένος, τοὺς κατακριθέντας ἀδίκῳ ψήφῳ θανατωθῆναι, παραστὰς ἐλυτρώσω, τῷ Δεσπότῃ Χριστῷ κραυγάζοντας· Ἕτερον ἐκτός σου, Θεὸν οὐ γινώσκομεν.
ltx/gr_gr_cog/me.m12.d06:meMA.Ode5C22.incipit	Ἐν οὐρανοῖς, τὴν ἀΐδιον δόξαν…
ltx/gr_gr_cog/me.m12.d06:meMA.Ode5C22.melody	@ltx/gr_gr_cog/he.h.m2:heHE.OFotismos.name
ltx/gr_gr_cog/me.m12.d06:meMA.Ode5C22.mode	@ltx/gr_gr_cog/miscellanea:misc.Mode2
ltx/gr_gr_cog/me.m12.d06:meMA.Ode5C22.ode	@ltx/gr_gr_cog/miscellanea:misc.Ode5
ltx/gr_gr_cog/me.m12.d06:meMA.Ode5C22.text	Ἐν οὐρανοῖς, τὴν ἀΐδιον δόξαν νῦν ἐποπτεύων, καὶ τῆς ἀποῤῥήτου καὶ θείας αἴγλης, ταῖς φανοτάταις ἐντρυφῶν λαμπηδόσι, σκέπασόν με τῇ προστασίᾳ σου, Ὅσιε θεράπον, Χριστοῦ πανσεβάσμιε.
ltx/gr_gr_cog/me.m12.d06:meMA.Ode5C2T.incipit	Ἵνα τὴν σήν, ἐκζητήσῃς εἰκόνα…
ltx/gr_gr_cog/me.m12.d06:meMA.Ode5C2T.melody	@ltx/gr_gr_cog/he.h.m2:heHE.OFotismos.name
ltx/gr_gr_cog/me.m12.d06:meMA.Ode5C2T.mode	@ltx/gr_gr_cog/miscellanea:misc.Mode2
ltx/gr_gr_cog/me.m12.d06:meMA.Ode5C2T.ode	@ltx/gr_gr_cog/miscellanea:misc.Ode5
ltx/gr_gr_cog/me.m12.d06:meMA.Ode5C2T.text	Ἵνα τὴν σήν, ἐκζητήσῃς εἰκόνα συγκεχωσμένην, τοῖς πάθεσι Σῶτερ τὰς οὐρανίους, λαθὼν δυνάμεις, σαρκωθεὶς ἐκ Παρθένου, ἐπεφάνης τοῖς σοὶ κραυγάζουσιν· Ἕτερον ἐκτός σου, Θεὸν οὐ γινώσκομεν.
ltx/gr_gr_cog/me.m12.d06:meMA.Ode5C31.greekmelody	@ltx/gr_gr_cog/he.h.m1:heHE.TheosOnEirinis.greekname
ltx/gr_gr_cog/me.m12.d06:meMA.Ode5C31.incipit	Κηρύττει σου Πάτερ, τὰ θαύματα…
ltx/gr_gr_cog/me.m12.d06:meMA.Ode5C31.melody	@ltx/gr_gr_cog/he.h.m1:heHE.TheosOnEirinis.name
ltx/gr_gr_cog/me.m12.d06:meMA.Ode5C31.mode	@ltx/gr_gr_cog/miscellanea:misc.Mode1
ltx/gr_gr_cog/me.m12.d06:meMA.Ode5C31.ode	@ltx/gr_gr_cog/miscellanea:misc.Ode5
ltx/gr_gr_cog/me.m12.d06:meMA.Ode5C31.text	Κηρύττει σου Πάτερ, τὰ θαύματα νῦν, ἡ Μυρέων μεγίστη μητρόπολις, Λυκίων ἐπαρχία τε, καὶ πᾶσαι πατριαί, τὰς σὰς τερατουργίας, διʼ ὧν πάντας ἐκ πόνων, θλιβερῶν ἐλυτρώσω, ἀξιοθαύμαστε Νικόλαε.
ltx/gr_gr_cog/me.m12.d06:meMA.Ode5C32.incipit	Λιμὴν τῶν χηρῶν, καὶ Πατὴρ…
ltx/gr_gr_cog/me.m12.d06:meMA.Ode5C32.melody	@ltx/gr_gr_cog/he.h.m1:heHE.TheosOnEirinis.name
ltx/gr_gr_cog/me.m12.d06:meMA.Ode5C32.mode	@ltx/gr_gr_cog/miscellanea:misc.Mode1
ltx/gr_gr_cog/me.m12.d06:meMA.Ode5C32.ode	@ltx/gr_gr_cog/miscellanea:misc.Ode5
ltx/gr_gr_cog/me.m12.d06:meMA.Ode5C32.text	Λιμὴν τῶν χηρῶν, καὶ Πατὴρ τῶν ὀρφανῶν, βοηθὸς τῶν ἐν θλίψει πανάριστος, πενθούντων παραμύθιον, ποιμὴν καὶ ὁδηγός, πάντων τῶν πλανωμένων, Νικόλαε ὑπάρχων, καὶ ἡμᾶς ἐκ κινδύνων, ταῖς σαῖς πρεσβείαις ἀπολύτρωσαι.
ltx/gr_gr_cog/me.m12.d06:meMA.Ode5C33.incipit	Μετέστης ἐκ γῆς, πρὸς ἀΰλους…
ltx/gr_gr_cog/me.m12.d06:meMA.Ode5C33.melody	@ltx/gr_gr_cog/he.h.m1:heHE.TheosOnEirinis.name
ltx/gr_gr_cog/me.m12.d06:meMA.Ode5C33.mode	@ltx/gr_gr_cog/miscellanea:misc.Mode1
ltx/gr_gr_cog/me.m12.d06:meMA.Ode5C33.ode	@ltx/gr_gr_cog/miscellanea:misc.Ode5
ltx/gr_gr_cog/me.m12.d06:meMA.Ode5C33.text	Μετέστης ἐκ γῆς, πρὸς ἀΰλους σκηνάς, ἔνθα βλέπεις τὸ ἄφραστον κάλλος Χριστοῦ, Ἀγγέλων τοῖς στρατεύμασιν ἐφάμιλλος δειχθείς· διὸ σὺν Ἀποστόλοις, καὶ Μάρτυσι χορεύων, ἐκτενῶς τὸν Σωτῆρα, Πάτερ Νικόλαε ἱκέτευε.
ltx/gr_gr_cog/me.m12.d06:meMA.Ode5C3T.incipit	Βροτῶν σωτηρία, καὶ πάντων ἐλπίς…
ltx/gr_gr_cog/me.m12.d06:meMA.Ode5C3T.melody	@ltx/gr_gr_cog/he.h.m1:heHE.TheosOnEirinis.name
ltx/gr_gr_cog/me.m12.d06:meMA.Ode5C3T.mode	@ltx/gr_gr_cog/miscellanea:misc.Mode1
ltx/gr_gr_cog/me.m12.d06:meMA.Ode5C3T.ode	@ltx/gr_gr_cog/miscellanea:misc.Ode5
ltx/gr_gr_cog/me.m12.d06:meMA.Ode5C3T.text	Βροτῶν σωτηρία, καὶ πάντων ἐλπίς, ἡ προφθάνουσα τάχος καὶ σῴζουσα, οἰκτείρησον καὶ νῦν ἡμᾶς, βοῶμέν σοι Ἁγνή, τοὺς σὲ προσκαλουμένους, ἀεὶ ἐν περιστάσει· προστασίαν γὰρ ἡμεῖς, μετὰ Θεὸν ἄλλην οὐκ ἔχομεν.
ltx/gr_gr_cog/me.m12.d06:meMA.Ode5C3Tr.incipit	Συνάναρχα τρία, ὁμόθρονα μέν, ἀμερίστου…
ltx/gr_gr_cog/me.m12.d06:meMA.Ode5C3Tr.melody	@ltx/gr_gr_cog/he.h.m1:heHE.TheosOnEirinis.name
ltx/gr_gr_cog/me.m12.d06:meMA.Ode5C3Tr.mode	@ltx/gr_gr_cog/miscellanea:misc.Mode1
ltx/gr_gr_cog/me.m12.d06:meMA.Ode5C3Tr.ode	@ltx/gr_gr_cog/miscellanea:misc.Ode5
ltx/gr_gr_cog/me.m12.d06:meMA.Ode5C3Tr.text	Συνάναρχα τρία, ὁμόθρονα μέν, ἀμερίστου μιᾶς δὲ Θεότητος, δοξάζω αὐτεξούσια, τὰ πρόσωπα σαφῶς, διʼ ἧς ἐκ τοῦ μὴ ὄντος, παρήχθην εἰς τὸ εἶναι, σὺν Ἀγγέλοις κραυγάζων, Ἅγιος, Ἅγιος, Ἅγιος εἶ Κύριε.
ltx/gr_gr_cog/me.m12.d06:meMA.Ode6C11.greekmelody	@ltx/gr_gr_cog/he.h.m1:heHE.TonProfitinIonan.greekname
ltx/gr_gr_cog/me.m12.d06:meMA.Ode6C11.incipit	Προστασία τῶν πιστῶν, ἀθυμούντων χαρμονή…
ltx/gr_gr_cog/me.m12.d06:meMA.Ode6C11.melody	@ltx/gr_gr_cog/he.h.m1:heHE.TonProfitinIonan.name
ltx/gr_gr_cog/me.m12.d06:meMA.Ode6C11.mode	@ltx/gr_gr_cog/miscellanea:misc.Mode1
ltx/gr_gr_cog/me.m12.d06:meMA.Ode6C11.ode	@ltx/gr_gr_cog/miscellanea:misc.Ode6
ltx/gr_gr_cog/me.m12.d06:meMA.Ode6C11.text	Προστασία τῶν πιστῶν, ἀθυμούντων χαρμονή, εὐφροσύνης καὶ χαρᾶς, ἔμπλησον πνευματικῆς, τοὺς δούλους σου, τοὺς πεποιθότας τῇ προστασίᾳ σου.
ltx/gr_gr_cog/me.m12.d06:meMA.Ode6C12.incipit	Οὐρανὸς ὁ λογικός, ὁ Ναὸς…
ltx/gr_gr_cog/me.m12.d06:meMA.Ode6C12.melody	@ltx/gr_gr_cog/he.h.m1:heHE.TonProfitinIonan.name
ltx/gr_gr_cog/me.m12.d06:meMA.Ode6C12.mode	@ltx/gr_gr_cog/miscellanea:misc.Mode1
ltx/gr_gr_cog/me.m12.d06:meMA.Ode6C12.ode	@ltx/gr_gr_cog/miscellanea:misc.Ode6
ltx/gr_gr_cog/me.m12.d06:meMA.Ode6C12.text	Οὐρανὸς ὁ λογικός, ὁ Ναὸς ὁ καθαρός, ἡ ἁγία Κιβωτός, ὁ τερπνότατος Θεοῦ, Παράδεισος, ἐν ᾧ τὸ ξύλον τῆς ζωῆς ὑμνείσθω μοι.
ltx/gr_gr_cog/me.m12.d06:meMA.Ode6C1H.greekmelody	@ltx/gr_gr_cog/he.h.m1:heHE.TonProfitinIonan.greekname
ltx/gr_gr_cog/me.m12.d06:meMA.Ode6C1H.incipit	@ltx/gr_gr_cog/he.h.m1:heHE.TonProfitinIonan.incipit
ltx/gr_gr_cog/me.m12.d06:meMA.Ode6C1H.melody	@ltx/gr_gr_cog/he.h.m1:heHE.TonProfitinIonan.melody
ltx/gr_gr_cog/me.m12.d06:meMA.Ode6C1H.mode	@ltx/gr_gr_cog/miscellanea:misc.Mode1
ltx/gr_gr_cog/me.m12.d06:meMA.Ode6C1H.ode	@ltx/gr_gr_cog/miscellanea:misc.Ode6
ltx/gr_gr_cog/me.m12.d06:meMA.Ode6C1H.text	@ltx/gr_gr_cog/he.h.m1:heHE.TonProfitinIonan.text
ltx/gr_gr_cog/me.m12.d06:meMA.Ode6C21.greekmelody	@ltx/gr_gr_cog/he.h.m2:heHE.EnAvyssoPtaismaton.greekname
ltx/gr_gr_cog/me.m12.d06:meMA.Ode6C21.incipit	Ὁ τῆς νίκης Νικόλαε στέφανος…
ltx/gr_gr_cog/me.m12.d06:meMA.Ode6C21.melody	@ltx/gr_gr_cog/he.h.m2:heHE.EnAvyssoPtaismaton.name
ltx/gr_gr_cog/me.m12.d06:meMA.Ode6C21.mode	@ltx/gr_gr_cog/miscellanea:misc.Mode2
ltx/gr_gr_cog/me.m12.d06:meMA.Ode6C21.ode	@ltx/gr_gr_cog/miscellanea:misc.Ode6
ltx/gr_gr_cog/me.m12.d06:meMA.Ode6C21.text	Ὁ τῆς νίκης Νικόλαε στέφανος, σοῦ τῇ κορυφῇ ἀξίως ἐπιτέθειται, ὡς νικητὴς οὖν ἄριστος, τοὺς σὲ προσκαλουμένους διάσωσον.
ltx/gr_gr_cog/me.m12.d06:meMA.Ode6C22.incipit	Νεκρωθέντα με Μάκαρ τοῖς πταίσμασι…
ltx/gr_gr_cog/me.m12.d06:meMA.Ode6C22.melody	@ltx/gr_gr_cog/he.h.m2:heHE.EnAvyssoPtaismaton.name
ltx/gr_gr_cog/me.m12.d06:meMA.Ode6C22.mode	@ltx/gr_gr_cog/miscellanea:misc.Mode2
ltx/gr_gr_cog/me.m12.d06:meMA.Ode6C22.ode	@ltx/gr_gr_cog/miscellanea:misc.Ode6
ltx/gr_gr_cog/me.m12.d06:meMA.Ode6C22.text	Νεκρωθέντα με Μάκαρ τοῖς πταίσμασι, καὶ ταῖς τῶν παθῶν τρικυμίαις ποντούμενον, ἐπιφανεὶς διάσωσον, πρὸς λιμένα τοῦ θείου θελήματος.
ltx/gr_gr_cog/me.m12.d06:meMA.Ode6C2T.incipit	Ἐπὶ σοὶ τὰς ἐλπίδας ἀνέθηκα…
ltx/gr_gr_cog/me.m12.d06:meMA.Ode6C2T.melody	@ltx/gr_gr_cog/he.h.m2:heHE.EnAvyssoPtaismaton.name
ltx/gr_gr_cog/me.m12.d06:meMA.Ode6C2T.mode	@ltx/gr_gr_cog/miscellanea:misc.Mode2
ltx/gr_gr_cog/me.m12.d06:meMA.Ode6C2T.ode	@ltx/gr_gr_cog/miscellanea:misc.Ode6
ltx/gr_gr_cog/me.m12.d06:meMA.Ode6C2T.text	Ἐπὶ σοὶ τὰς ἐλπίδας ἀνέθηκα, Μῆτερ ἀειπάρθενε τῆς σωτηρίας μου, καὶ σὲ προστάτιν τίθημι, τῆς ζωῆς ἀσφαλῆ τε καὶ ἄσειστον.
ltx/gr_gr_cog/me.m12.d06:meMA.Ode6C31.greekmelody	@ltx/gr_gr_cog/he.h.m1:heHE.SplanchnonIonan.greekname
ltx/gr_gr_cog/me.m12.d06:meMA.Ode6C31.incipit	Νέος Ἀβραάμ, ἐδείχθης Νικόλαε, ὡς…
ltx/gr_gr_cog/me.m12.d06:meMA.Ode6C31.melody	@ltx/gr_gr_cog/he.h.m1:heHE.SplanchnonIonan.name
ltx/gr_gr_cog/me.m12.d06:meMA.Ode6C31.mode	@ltx/gr_gr_cog/miscellanea:misc.Mode1
ltx/gr_gr_cog/me.m12.d06:meMA.Ode6C31.ode	@ltx/gr_gr_cog/miscellanea:misc.Ode6
ltx/gr_gr_cog/me.m12.d06:meMA.Ode6C31.text	Νέος Ἀβραάμ, ἐδείχθης Νικόλαε, ὡς μονογενῆ υἱὸν προσάξας τὸν νοῦν, τῷ Δεσπότῃ σου, ἀναιμάκτους θυσίας προσφέρων ἀεί, κἀντεῦθεν εὐλογήθης ὡς φιλόξενος, Πάτερ, καὶ Τριάδος γέγονας, οἰκητήριον θεῖον καὶ ἄμωμον.
ltx/gr_gr_cog/me.m12.d06:meMA.Ode6C32.incipit	Ξένα καὶ φρικτά, ἐργάζῃ τεράστια…
ltx/gr_gr_cog/me.m12.d06:meMA.Ode6C32.melody	@ltx/gr_gr_cog/he.h.m1:heHE.SplanchnonIonan.name
ltx/gr_gr_cog/me.m12.d06:meMA.Ode6C32.mode	@ltx/gr_gr_cog/miscellanea:misc.Mode1
ltx/gr_gr_cog/me.m12.d06:meMA.Ode6C32.ode	@ltx/gr_gr_cog/miscellanea:misc.Ode6
ltx/gr_gr_cog/me.m12.d06:meMA.Ode6C32.text	Ξένα καὶ φρικτά, ἐργάζῃ τεράστια, ἐν πάσῃ τῇ γῇ, καὶ ἐν θαλάσσῃ μακράν, κινδυνεύουσι, ταχυδρόμοις λιταῖς ἐφιστάμενος, ἀσθενούντων ἰατρός, καὶ πτωχευόντων τροφεύς, νίκης τε λαοῦ φερώνυμος, τοῦ πιστοῦ κατʼ ἐχθρῶν ἀναδέδειξαι.
ltx/gr_gr_cog/me.m12.d06:meMA.Ode6C33.incipit	Ὄμματι νοός, προβλέπων τὰ μέλλοντα…
ltx/gr_gr_cog/me.m12.d06:meMA.Ode6C33.melody	@ltx/gr_gr_cog/he.h.m1:heHE.SplanchnonIonan.name
ltx/gr_gr_cog/me.m12.d06:meMA.Ode6C33.mode	@ltx/gr_gr_cog/miscellanea:misc.Mode1
ltx/gr_gr_cog/me.m12.d06:meMA.Ode6C33.ode	@ltx/gr_gr_cog/miscellanea:misc.Ode6
ltx/gr_gr_cog/me.m12.d06:meMA.Ode6C33.text	Ὄμματι νοός, προβλέπων τὰ μέλλοντα, δογμάτων ὀρθῶν, πάντας ἐνέπλησας, ὁμοούσιον, τῷ Πατρὶ τὸν Υἱὸν καταγγείλας ἡμῖν, καὶ Ἀρείου τὴν μανίαν ἐξωλόθρευσας, στήλην ὀρθοδόξου πίστεως, τὰ σεπτά σου προσθεὶς κατορθώματα.
ltx/gr_gr_cog/me.m12.d06:meMA.Ode6C3T.incipit	Κλίνας οὐρανούς, ἐν μήτρᾳ σου…
ltx/gr_gr_cog/me.m12.d06:meMA.Ode6C3T.melody	@ltx/gr_gr_cog/he.h.m1:heHE.SplanchnonIonan.name
ltx/gr_gr_cog/me.m12.d06:meMA.Ode6C3T.mode	@ltx/gr_gr_cog/miscellanea:misc.Mode1
ltx/gr_gr_cog/me.m12.d06:meMA.Ode6C3T.ode	@ltx/gr_gr_cog/miscellanea:misc.Ode6
ltx/gr_gr_cog/me.m12.d06:meMA.Ode6C3T.text	Κλίνας οὐρανούς, ἐν μήτρᾳ σου Πάναγνε, Χριστὸς βουληθείς, ὅλος ἐσκήνωσεν· οὐ γὰρ ἔφερε, τῶν ἰδίων χειρῶν τὸ πλαστούργημα, καθορᾶν ὑπὸ τοῦ πλάνου τυραννούμενον, ἦλθε δὲ ἐν δούλου σχήματι, τὸ ἀνθρώπινον γένος λυτρώσασθαι.
ltx/gr_gr_cog/me.m12.d06:meMA.Ode6C3Tr.incipit	Σέβω καὶ τιμῶ, Τριάδα ἀμέριστον…
ltx/gr_gr_cog/me.m12.d06:meMA.Ode6C3Tr.melody	@ltx/gr_gr_cog/he.h.m1:heHE.SplanchnonIonan.name
ltx/gr_gr_cog/me.m12.d06:meMA.Ode6C3Tr.mode	@ltx/gr_gr_cog/miscellanea:misc.Mode1
ltx/gr_gr_cog/me.m12.d06:meMA.Ode6C3Tr.ode	@ltx/gr_gr_cog/miscellanea:misc.Ode6
ltx/gr_gr_cog/me.m12.d06:meMA.Ode6C3Tr.text	Σέβω καὶ τιμῶ, Τριάδα ἀμέριστον, προσώποις τρισὶ διαιρουμένην ἀεί, ἑνουμένην δέ, τῇ οὐσίᾳ καὶ φύσει ὡς μίαν ἀρχήν, τὸν Πατέρα καὶ Υἱὸν καὶ Πνεῦμα Ἅγιον, πάντων κραταιῶς δεσπόζουσαν, καὶ τὸ πᾶν συντηροῦσαν ὡς βούλεται.
ltx/gr_gr_cog/me.m12.d06:meMA.Ode7C11.greekmelody	@ltx/gr_gr_cog/he.h.m1:heHE.IKaminosSotirEdrosizeto.greekname
ltx/gr_gr_cog/me.m12.d06:meMA.Ode7C11.incipit	Ὁ Ὕψιστος Παράδεισον ἔμψυχον, Παστάδα…
ltx/gr_gr_cog/me.m12.d06:meMA.Ode7C11.melody	@ltx/gr_gr_cog/he.h.m1:heHE.IKaminosSotirEdrosizeto.name
ltx/gr_gr_cog/me.m12.d06:meMA.Ode7C11.mode	@ltx/gr_gr_cog/miscellanea:misc.Mode1
ltx/gr_gr_cog/me.m12.d06:meMA.Ode7C11.ode	@ltx/gr_gr_cog/miscellanea:misc.Ode7
ltx/gr_gr_cog/me.m12.d06:meMA.Ode7C11.text	Ὁ Ὕψιστος Παράδεισον ἔμψυχον, Παστάδα τε Ἁγνὴ χαριτόπλοκον, χρυσόμορφον Πορφύραν, καὶ Οὐρανόν σε ἀνέδειξε.
ltx/gr_gr_cog/me.m12.d06:meMA.Ode7C12.incipit	Στερέωσον τὸν νοῦν μου τρεπόμενον…
ltx/gr_gr_cog/me.m12.d06:meMA.Ode7C12.melody	@ltx/gr_gr_cog/he.h.m1:heHE.IKaminosSotirEdrosizeto.name
ltx/gr_gr_cog/me.m12.d06:meMA.Ode7C12.mode	@ltx/gr_gr_cog/miscellanea:misc.Mode1
ltx/gr_gr_cog/me.m12.d06:meMA.Ode7C12.ode	@ltx/gr_gr_cog/miscellanea:misc.Ode7
ltx/gr_gr_cog/me.m12.d06:meMA.Ode7C12.text	Στερέωσον τὸν νοῦν μου τρεπόμενον, τὸν λογισμὸν κλονούμενον ἕδρασον ἐν ἀσαλεύτῳ με πέτρα, τῇ σῇ σκέπῃ Μητροπάρθενε.
ltx/gr_gr_cog/me.m12.d06:meMA.Ode7C1H.greekmelody	@ltx/gr_gr_cog/he.h.m1:heHE.IKaminosSotirEdrosizeto.greekname
ltx/gr_gr_cog/me.m12.d06:meMA.Ode7C1H.incipit	@ltx/gr_gr_cog/he.h.m1:heHE.IKaminosSotirEdrosizeto.incipit
ltx/gr_gr_cog/me.m12.d06:meMA.Ode7C1H.melody	@ltx/gr_gr_cog/he.h.m1:heHE.IKaminosSotirEdrosizeto.melody
ltx/gr_gr_cog/me.m12.d06:meMA.Ode7C1H.mode	@ltx/gr_gr_cog/miscellanea:misc.Mode1
ltx/gr_gr_cog/me.m12.d06:meMA.Ode7C1H.ode	@ltx/gr_gr_cog/miscellanea:misc.Ode7
ltx/gr_gr_cog/me.m12.d06:meMA.Ode7C1H.text	@ltx/gr_gr_cog/he.h.m1:heHE.IKaminosSotirEdrosizeto.text
ltx/gr_gr_cog/me.m12.d06:meMA.Ode7C21.greekmelody	@ltx/gr_gr_cog/he.h.m2:heHE.EikonosChrysis.greekname
ltx/gr_gr_cog/me.m12.d06:meMA.Ode7C21.incipit	Ξυρῷ πειρασμῶν, περιπέπτωκα δεινῶς κατακεντούμενος…
ltx/gr_gr_cog/me.m12.d06:meMA.Ode7C21.melody	@ltx/gr_gr_cog/he.h.m2:heHE.EikonosChrysis.name
ltx/gr_gr_cog/me.m12.d06:meMA.Ode7C21.mode	@ltx/gr_gr_cog/miscellanea:misc.Mode2
ltx/gr_gr_cog/me.m12.d06:meMA.Ode7C21.ode	@ltx/gr_gr_cog/miscellanea:misc.Ode7
ltx/gr_gr_cog/me.m12.d06:meMA.Ode7C21.text	Ξυρῷ πειρασμῶν, περιπέπτωκα δεινῶς κατακεντούμενος, καὶ πύλαις ᾅδου προσεπέλασα, ταῖς ἀθυμίαις βαλλόμενος· σῶσόν με πρεσβείαις σου Μάκαρ, καὶ ἀνάστησον ψάλλοντα· Εὐλογητὸς εἶ ὁ Θεός, ὁ τῶν Πατέρων ἡμῶν.
ltx/gr_gr_cog/me.m12.d06:meMA.Ode7C22.incipit	Ἀδύτου φωτὸς ταῖς ἀΰλοις ἀστραπαῖς…
ltx/gr_gr_cog/me.m12.d06:meMA.Ode7C22.melody	@ltx/gr_gr_cog/he.h.m2:heHE.EikonosChrysis.name
ltx/gr_gr_cog/me.m12.d06:meMA.Ode7C22.mode	@ltx/gr_gr_cog/miscellanea:misc.Mode2
ltx/gr_gr_cog/me.m12.d06:meMA.Ode7C22.ode	@ltx/gr_gr_cog/miscellanea:misc.Ode7
ltx/gr_gr_cog/me.m12.d06:meMA.Ode7C22.text	Ἀδύτου φωτὸς ταῖς ἀΰλοις ἀστραπαῖς περιλαμπόμενος, τοὺς ἐν τῷ σκότει τῶν θλίψεων, κεκακωμένους ἐξάρπασον, καὶ πρὸς φωτισμὸν εὐφροσύνης, καθοδήγησον ψάλλοντας· Εὐλογητὸς εἶ ὁ Θεὸς ὁ τῶν Πατέρων ἡμῶν.
ltx/gr_gr_cog/me.m12.d06:meMA.Ode7C2T.incipit	Δυσώπει Χριστόν, τὸν Υἱόν σου…
ltx/gr_gr_cog/me.m12.d06:meMA.Ode7C2T.melody	@ltx/gr_gr_cog/he.h.m2:heHE.EikonosChrysis.name
ltx/gr_gr_cog/me.m12.d06:meMA.Ode7C2T.mode	@ltx/gr_gr_cog/miscellanea:misc.Mode2
ltx/gr_gr_cog/me.m12.d06:meMA.Ode7C2T.ode	@ltx/gr_gr_cog/miscellanea:misc.Ode7
ltx/gr_gr_cog/me.m12.d06:meMA.Ode7C2T.text	Δυσώπει Χριστόν, τὸν Υἱόν σου καὶ Θεὸν Θεογεννήτρια, τοὺς πεπραμένους δεινοῖς πταίσμασι, καὶ ταῖς ἀπάταις τοῦ ὄφεως, αἵματι αὐτοῦ τῷ τιμίῳ, ἀναῤῥύσασθαι ψάλλοντας· Εὐλογητὸς εἶ ὁ Θεός, ὁ τῶν Πατέρων ἡμῶν.
ltx/gr_gr_cog/me.m12.d06:meMA.Ode7C31.greekmelody	@ltx/gr_gr_cog/he.h.m1:heHE.OiPaidesEfseveia.greekname
ltx/gr_gr_cog/me.m12.d06:meMA.Ode7C31.incipit	Παντοίων χαλεπῶν τε νοσημάτων, ἰατρὸς…
ltx/gr_gr_cog/me.m12.d06:meMA.Ode7C31.melody	@ltx/gr_gr_cog/he.h.m1:heHE.OiPaidesEfseveia.name
ltx/gr_gr_cog/me.m12.d06:meMA.Ode7C31.mode	@ltx/gr_gr_cog/miscellanea:misc.Mode1
ltx/gr_gr_cog/me.m12.d06:meMA.Ode7C31.ode	@ltx/gr_gr_cog/miscellanea:misc.Ode7
ltx/gr_gr_cog/me.m12.d06:meMA.Ode7C31.text	Παντοίων χαλεπῶν τε νοσημάτων, ἰατρὸς πανάριστος Πάτερ Νικόλαε, φανείς, τῆς ψυχῆς μου τὴν ἀσθένειαν, ἰασάμενος παράσχου εὐρωστίαν βοᾶν· Ὁ τῶν Πατέρων, Θεός εὐλογητὸς εἶ.
ltx/gr_gr_cog/me.m12.d06:meMA.Ode7C32.incipit	Ῥυσάμενος τοὺς πάλαι στρατηλάτας, ἐκ…
ltx/gr_gr_cog/me.m12.d06:meMA.Ode7C32.melody	@ltx/gr_gr_cog/he.h.m1:heHE.OiPaidesEfseveia.name
ltx/gr_gr_cog/me.m12.d06:meMA.Ode7C32.mode	@ltx/gr_gr_cog/miscellanea:misc.Mode1
ltx/gr_gr_cog/me.m12.d06:meMA.Ode7C32.ode	@ltx/gr_gr_cog/miscellanea:misc.Ode7
ltx/gr_gr_cog/me.m12.d06:meMA.Ode7C32.text	Ῥυσάμενος τοὺς πάλαι στρατηλάτας, ἐκ θανάτου Ἅγιε τούτους διήγειρας, ὑμνεῖν, καὶ δοξάζειν τὸν Σωτῆρα Χριστόν, μετὰ πίστεως θερμῆς καὶ ἀνακράζειν σοι· Σὲ ἀνευφημοῦμεν, σοφὲ ὡς εὐεργέτην.
ltx/gr_gr_cog/me.m12.d06:meMA.Ode7C33.incipit	Σοφίας τῷ κρατῆρι πλησιάσας, μυστικῶς…
ltx/gr_gr_cog/me.m12.d06:meMA.Ode7C33.melody	@ltx/gr_gr_cog/he.h.m1:heHE.OiPaidesEfseveia.name
ltx/gr_gr_cog/me.m12.d06:meMA.Ode7C33.mode	@ltx/gr_gr_cog/miscellanea:misc.Mode1
ltx/gr_gr_cog/me.m12.d06:meMA.Ode7C33.ode	@ltx/gr_gr_cog/miscellanea:misc.Ode7
ltx/gr_gr_cog/me.m12.d06:meMA.Ode7C33.text	Σοφίας τῷ κρατῆρι πλησιάσας, μυστικῶς τὰ χείλη σου Πάτερ Νικόλαε, κρουνοὺς ἀμβροσίας ἔνθεν ἤντλησας, ὑπὲρ μέλι καὶ κηρίον τοῖς λαοῖς ἐκβοῶν· Ὁ τῶν Πατέρων, Θεὸς εὐλογητὸς εἶ.
ltx/gr_gr_cog/me.m12.d06:meMA.Ode7C3T.incipit	Ἐκ πάντων δεχομένη τὰς δεήσεις…
ltx/gr_gr_cog/me.m12.d06:meMA.Ode7C3T.melody	@ltx/gr_gr_cog/he.h.m1:heHE.OiPaidesEfseveia.name
ltx/gr_gr_cog/me.m12.d06:meMA.Ode7C3T.mode	@ltx/gr_gr_cog/miscellanea:misc.Mode1
ltx/gr_gr_cog/me.m12.d06:meMA.Ode7C3T.ode	@ltx/gr_gr_cog/miscellanea:misc.Ode7
ltx/gr_gr_cog/me.m12.d06:meMA.Ode7C3T.text	Ἐκ πάντων δεχομένη τὰς δεήσεις, Θεοτόκε πρέσβευε, τῷ σῷ Υἱῷ καὶ Θεῷ, λυτρωθῆναι τῆς κολάσεως, τοὺς τιμῶντάς σε κυρίως καὶ κραυγάζοντας· Ὁ τῶν Πατέρων, Θεός εὐλογητὸς εἶ.
ltx/gr_gr_cog/me.m12.d06:meMA.Ode7C3Tr.incipit	Τριὰς σὲ ἀνυμνοῦμεν τρισαγία, καὶ…
ltx/gr_gr_cog/me.m12.d06:meMA.Ode7C3Tr.melody	@ltx/gr_gr_cog/he.h.m1:heHE.OiPaidesEfseveia.name
ltx/gr_gr_cog/me.m12.d06:meMA.Ode7C3Tr.mode	@ltx/gr_gr_cog/miscellanea:misc.Mode1
ltx/gr_gr_cog/me.m12.d06:meMA.Ode7C3Tr.ode	@ltx/gr_gr_cog/miscellanea:misc.Ode7
ltx/gr_gr_cog/me.m12.d06:meMA.Ode7C3Tr.text	Τριὰς σὲ ἀνυμνοῦμεν τρισαγία, καὶ Μονὰς τριλαμπεστάτη ὁμοούσιε, Πατὴρ ὁ Υἱὸς καὶ Πνεῦμα Ἅγιον· ἐν οἷς πάντες βαπτισθέντες ἀναμέλπομεν· Ὁ τῶν Πατέρων, Θεός εὐλογητὸς εἶ.
ltx/gr_gr_cog/me.m12.d06:meMA.Ode8C11.greekmelody	@ltx/gr_gr_cog/he.h.m1:heHE.OnFrittousinAngeloi.greekname
ltx/gr_gr_cog/me.m12.d06:meMA.Ode8C11.incipit	Ὡς ἔμψυχος θάλαμος, καὶ ἔμπνους…
ltx/gr_gr_cog/me.m12.d06:meMA.Ode8C11.melody	@ltx/gr_gr_cog/he.h.m1:heHE.OnFrittousinAngeloi.name
ltx/gr_gr_cog/me.m12.d06:meMA.Ode8C11.mode	@ltx/gr_gr_cog/miscellanea:misc.Mode1
ltx/gr_gr_cog/me.m12.d06:meMA.Ode8C11.ode	@ltx/gr_gr_cog/miscellanea:misc.Ode8
ltx/gr_gr_cog/me.m12.d06:meMA.Ode8C11.text	Ὡς ἔμψυχος θάλαμος, καὶ ἔμπνους ἁλουργίς, χλαμὺς ἁλουργόχροος, τῷ πάντων Βασιλεῖ, ἐδείχθης Παρθένε, καὶ πορφύρα ἐξ ἧς, ἡ σάρξ συνεξυφάνθη, τοῦ θεανθρώπου Λόγου.
ltx/gr_gr_cog/me.m12.d06:meMA.Ode8C12.incipit	Συνέλαβες Ἄχραντε, τὸν ἅπασαν δρακί…
ltx/gr_gr_cog/me.m12.d06:meMA.Ode8C12.melody	@ltx/gr_gr_cog/he.h.m1:heHE.OnFrittousinAngeloi.name
ltx/gr_gr_cog/me.m12.d06:meMA.Ode8C12.mode	@ltx/gr_gr_cog/miscellanea:misc.Mode1
ltx/gr_gr_cog/me.m12.d06:meMA.Ode8C12.ode	@ltx/gr_gr_cog/miscellanea:misc.Ode8
ltx/gr_gr_cog/me.m12.d06:meMA.Ode8C12.text	Συνέλαβες Ἄχραντε, τὸν ἅπασαν δρακί, τὴν κτίσιν συνέχοντα, ὡς Κτίστην καὶ Θεόν, ἀῤῥήτως ἀφράστως, διʼ ἡμᾶς καθʼ ἡμᾶς, βροτὸν γεγονότα, καὶ ὃ ἦν μὴ ἐκστάντα.
ltx/gr_gr_cog/me.m12.d06:meMA.Ode8C1H.greekmelody	@ltx/gr_gr_cog/he.h.m1:heHE.OnFrittousinAngeloi.greekname
ltx/gr_gr_cog/me.m12.d06:meMA.Ode8C1H.incipit	@ltx/gr_gr_cog/he.h.m1:heHE.OnFrittousinAngeloi.incipit
ltx/gr_gr_cog/me.m12.d06:meMA.Ode8C1H.melody	@ltx/gr_gr_cog/he.h.m1:heHE.OnFrittousinAngeloi.melody
ltx/gr_gr_cog/me.m12.d06:meMA.Ode8C1H.mode	@ltx/gr_gr_cog/miscellanea:misc.Mode1
ltx/gr_gr_cog/me.m12.d06:meMA.Ode8C1H.ode	@ltx/gr_gr_cog/miscellanea:misc.Ode8
ltx/gr_gr_cog/me.m12.d06:meMA.Ode8C1H.text	@ltx/gr_gr_cog/he.h.m1:heHE.OnFrittousinAngeloi.text
ltx/gr_gr_cog/me.m12.d06:meMA.Ode8C21.greekmelody	@ltx/gr_gr_cog/he.h.m2:heHE.TonEnKaminoTouPyros.greekname
ltx/gr_gr_cog/me.m12.d06:meMA.Ode8C21.incipit	Ὡς εὐμενὴς καὶ συμπαθής, τοὺς…
ltx/gr_gr_cog/me.m12.d06:meMA.Ode8C21.melody	@ltx/gr_gr_cog/he.h.m2:heHE.TonEnKaminoTouPyros.name
ltx/gr_gr_cog/me.m12.d06:meMA.Ode8C21.mode	@ltx/gr_gr_cog/miscellanea:misc.Mode2
ltx/gr_gr_cog/me.m12.d06:meMA.Ode8C21.ode	@ltx/gr_gr_cog/miscellanea:misc.Ode8
ltx/gr_gr_cog/me.m12.d06:meMA.Ode8C21.text	Ὡς εὐμενὴς καὶ συμπαθής, τοὺς ἐν βάθει πειρασμῶν περισχεθέντας, ἐλευθέρωσον μάκαρ, τῶν κατεχόντων δεινῶν, τὴν λύσιν βραβεύων πρεσβείαις σου, ταῖς πρὸς τὸν Σωτῆρα, Χριστὸν Ἱερομύστα.
ltx/gr_gr_cog/me.m12.d06:meMA.Ode8C22.incipit	Μυσταγωγὸς τῶν ὑπὲρ νοῦν, τῶν…
ltx/gr_gr_cog/me.m12.d06:meMA.Ode8C22.melody	@ltx/gr_gr_cog/he.h.m2:heHE.TonEnKaminoTouPyros.name
ltx/gr_gr_cog/me.m12.d06:meMA.Ode8C22.mode	@ltx/gr_gr_cog/miscellanea:misc.Mode2
ltx/gr_gr_cog/me.m12.d06:meMA.Ode8C22.ode	@ltx/gr_gr_cog/miscellanea:misc.Ode8
ltx/gr_gr_cog/me.m12.d06:meMA.Ode8C22.text	Μυσταγωγὸς τῶν ὑπὲρ νοῦν, τῶν Ἁγίων λειτουργὸς καὶ οὐρανίων, χρηματίζων θεόφρον ἀρχιερεύς τε πιστός, πταισμάτων τὴν ἄφεσιν αἴτησαι, παρὰ τοῦ Σωτῆρος, ἡμῶν Ἱεροφάντα.
ltx/gr_gr_cog/me.m12.d06:meMA.Ode8C2T.incipit	Ἐξασθενεῖ μου νῦν ὁ νοῦς…
ltx/gr_gr_cog/me.m12.d06:meMA.Ode8C2T.melody	@ltx/gr_gr_cog/he.h.m2:heHE.TonEnKaminoTouPyros.name
ltx/gr_gr_cog/me.m12.d06:meMA.Ode8C2T.mode	@ltx/gr_gr_cog/miscellanea:misc.Mode2
ltx/gr_gr_cog/me.m12.d06:meMA.Ode8C2T.ode	@ltx/gr_gr_cog/miscellanea:misc.Ode8
ltx/gr_gr_cog/me.m12.d06:meMA.Ode8C2T.text	Ἐξασθενεῖ μου νῦν ὁ νοῦς, εἰς τὰ βάθη ἐμπεσὼν τῆς ἀτιμίας, ὡς ἐντεῦθεν ποικίλοις, περιπαρῆναι κακοῖς· ἀλλὰ σὺ Παρθένε θεράπευσον, τῷ τῆς ἀπαθείας, φωτὶ περιβαλοῦσα.
ltx/gr_gr_cog/me.m12.d06:meMA.Ode8C31.greekmelody	@ltx/gr_gr_cog/he.h.m1:heHE.ThavmatosYperfyous.greekname
ltx/gr_gr_cog/me.m12.d06:meMA.Ode8C31.incipit	Τάγματα Πατριαρχῶν καὶ Ἀποστόλων, Ἱερέων…
ltx/gr_gr_cog/me.m12.d06:meMA.Ode8C31.melody	@ltx/gr_gr_cog/he.h.m1:heHE.ThavmatosYperfyous.name
ltx/gr_gr_cog/me.m12.d06:meMA.Ode8C31.mode	@ltx/gr_gr_cog/miscellanea:misc.Mode1
ltx/gr_gr_cog/me.m12.d06:meMA.Ode8C31.ode	@ltx/gr_gr_cog/miscellanea:misc.Ode8
ltx/gr_gr_cog/me.m12.d06:meMA.Ode8C31.text	Τάγματα Πατριαρχῶν καὶ Ἀποστόλων, Ἱερέων τε Μαρτύρων δῆμοι, Προφητῶν ὁ σύλλογος, ἅπας δῆμος τῶν Ἀσκητῶν, μακαρίζουσι τὴν θείαν πολιτείαν σου· μεθʼ ὧν καὶ ἡμεῖς παρακαλοῦμέν σε· Μὴ ἐλλίπῃς δυσωπῶν ἀεὶ τὸν Κύριον, διαφυλαχθῆναι, ἡμᾶς ἐκ πάσης βλάβης.
ltx/gr_gr_cog/me.m12.d06:meMA.Ode8C32.incipit	Ὕψιστε Παμβασιλεῦ μεγαλοκράτορ, ταῖς εὐχαῖς…
ltx/gr_gr_cog/me.m12.d06:meMA.Ode8C32.melody	@ltx/gr_gr_cog/he.h.m1:heHE.ThavmatosYperfyous.name
ltx/gr_gr_cog/me.m12.d06:meMA.Ode8C32.mode	@ltx/gr_gr_cog/miscellanea:misc.Mode1
ltx/gr_gr_cog/me.m12.d06:meMA.Ode8C32.ode	@ltx/gr_gr_cog/miscellanea:misc.Ode8
ltx/gr_gr_cog/me.m12.d06:meMA.Ode8C32.text	Ὕψιστε Παμβασιλεῦ μεγαλοκράτορ, ταῖς εὐχαῖς τοῦ Ὁσίου ποιμένος, τὴν ζωὴν εἰρήνευσον, πάντων Λόγε Χριστιανῶν, χορηγῶν κατὰ βαρβάρων εὐσεβεῖ βασιλεῖ, τὴν νίκην καὶ τὴν ἰσχὺν δεόμεθα, ἵνα πάντες ἀεὶ ὑμνῶμεν τὸ κράτος σου, καὶ ὑπερυψῶμεν, εἰς πάντας τοὺς αἰῶνας.
ltx/gr_gr_cog/me.m12.d06:meMA.Ode8C33.incipit	Φωτὶ ἐλλαμφθεὶς τῷ ἀπροσίτῳ Πάτερ…
ltx/gr_gr_cog/me.m12.d06:meMA.Ode8C33.melody	@ltx/gr_gr_cog/he.h.m1:heHE.ThavmatosYperfyous.name
ltx/gr_gr_cog/me.m12.d06:meMA.Ode8C33.mode	@ltx/gr_gr_cog/miscellanea:misc.Mode1
ltx/gr_gr_cog/me.m12.d06:meMA.Ode8C33.ode	@ltx/gr_gr_cog/miscellanea:misc.Ode8
ltx/gr_gr_cog/me.m12.d06:meMA.Ode8C33.text	Φωτὶ ἐλλαμφθεὶς τῷ ἀπροσίτῳ Πάτερ, τὰς ψυχὰς τῶν ἐν θλίψει αὐγάζεις, διαλύων ἅπαντα, ζόφον σκότους τῶν πειρασμῶν, ἀπαστράπτων τε ἀκτῖνας εὐφροσύνης ἀεί, ἐν αἷς τηλαγῶς καταλαμπόμενοι· Εὐλογείτω, βοῶμεν ἡ κτίσις τὸν Κύριον, καὶ ὑπερυψούτω, εἰς πάντας τοὺς αἰῶνας.
ltx/gr_gr_cog/me.m12.d06:meMA.Ode8C3T.incipit	Πράγματος ξενοπρεποῦς ἡ Βάτος τύπον…
ltx/gr_gr_cog/me.m12.d06:meMA.Ode8C3T.melody	@ltx/gr_gr_cog/he.h.m1:heHE.ThavmatosYperfyous.name
ltx/gr_gr_cog/me.m12.d06:meMA.Ode8C3T.mode	@ltx/gr_gr_cog/miscellanea:misc.Mode1
ltx/gr_gr_cog/me.m12.d06:meMA.Ode8C3T.ode	@ltx/gr_gr_cog/miscellanea:misc.Ode8
ltx/gr_gr_cog/me.m12.d06:meMA.Ode8C3T.text	Πράγματος ξενοπρεποῦς ἡ Βάτος τύπον, προεικόνισεν ἄχραντε Κόρη, καιομένη ἄφλεκτος, πάλαι ὄρει ἐν τῷ Σινᾷ, τὸ Μυστήριον τοῦ τόκου σου προγράφουσα· τὸ πῦρ γάρ ἐν σοὶ τὸ τῆς Θεότητος, ἐνοικῆσαν, ἀλώβητόν σε τετήρηκε· διό σε ὑμνοῦμεν, εἰς πάντας τοὺς αἰῶνας.
ltx/gr_gr_cog/me.m12.d06:meMA.Ode8C3Tr.incipit	Ζωὴν καὶ ζωὰς καὶ ἓν…
ltx/gr_gr_cog/me.m12.d06:meMA.Ode8C3Tr.melody	@ltx/gr_gr_cog/he.h.m1:heHE.ThavmatosYperfyous.name
ltx/gr_gr_cog/me.m12.d06:meMA.Ode8C3Tr.mode	@ltx/gr_gr_cog/miscellanea:misc.Mode1
ltx/gr_gr_cog/me.m12.d06:meMA.Ode8C3Tr.ode	@ltx/gr_gr_cog/miscellanea:misc.Ode8
ltx/gr_gr_cog/me.m12.d06:meMA.Ode8C3Tr.text	Ζωὴν καὶ ζωὰς καὶ ἓν καὶ τρία φῶτα, τὴν Τριάδα πιστῶς ἀνυμνοῦμεν, πατρικαῖς ἑπόμενοι θείαις ὄντως ταῖς διδαχαῖς, τὸν Πατέρα καὶ Υἱὸν καὶ Πνεῦμα Ἅγιον, μεθʼ ὧν εὐσεβοῦντες ἀναμέλψωμεν· Εὐλογείτω ἡ κτίσις πᾶσα τὸν Κύριον, καὶ ὑπερυψούτω, εἰς πάντας τοὺς αἰῶνας.
ltx/gr_gr_cog/me.m12.d06:meMA.Ode9C11.greekmelody	@ltx/gr_gr_cog/he.h.m1:heHE.TinZoodochonPigin.greekname
ltx/gr_gr_cog/me.m12.d06:meMA.Ode9C11.incipit	Ῥείθρῳ τῆς σῆς με κατάρδευσον…
ltx/gr_gr_cog/me.m12.d06:meMA.Ode9C11.melody	@ltx/gr_gr_cog/he.h.m1:heHE.TinZoodochonPigin.name
ltx/gr_gr_cog/me.m12.d06:meMA.Ode9C11.mode	@ltx/gr_gr_cog/miscellanea:misc.Mode1
ltx/gr_gr_cog/me.m12.d06:meMA.Ode9C11.ode	@ltx/gr_gr_cog/miscellanea:misc.Ode9
ltx/gr_gr_cog/me.m12.d06:meMA.Ode9C11.text	Ῥείθρῳ τῆς σῆς με κατάρδευσον χάριτος, τῶν συμφορῶν τῷ φλογμῷ φλογιζόμενον, καὶ δεινῶς τηκόμενον, Πηγὴ χαριτόβρυτε, τὸν Ποταμὸν ἡ τεκοῦσα τῶν χαρίτων, ἐξ οὗ ὁ πίνων διψήσει οὐδέποτε.
ltx/gr_gr_cog/me.m12.d06:meMA.Ode9C12.incipit	Ὡς τοῦ Νυμφίου ὡραῖόν τε…
ltx/gr_gr_cog/me.m12.d06:meMA.Ode9C12.melody	@ltx/gr_gr_cog/he.h.m1:heHE.TinZoodochonPigin.name
ltx/gr_gr_cog/me.m12.d06:meMA.Ode9C12.mode	@ltx/gr_gr_cog/miscellanea:misc.Mode1
ltx/gr_gr_cog/me.m12.d06:meMA.Ode9C12.ode	@ltx/gr_gr_cog/miscellanea:misc.Ode9
ltx/gr_gr_cog/me.m12.d06:meMA.Ode9C12.text	Ὡς τοῦ Νυμφίου ὡραῖόν τε θάλαμον, ὡς τοῦ Δεσπότου Παλάτιον ἔμψυχον, ὡς Πορφύραν πάγχρυσον, καὶ τερπνὸν Ἀνάκτορον, τοῦ Χριστοῦ Δέσποινα πάντων, καθικετεύοντά σε σῶσόν με.
ltx/gr_gr_cog/me.m12.d06:meMA.Ode9C1H.greekmelody	@ltx/gr_gr_cog/he.h.m1:heHE.TinZoodochonPigin.greekname
ltx/gr_gr_cog/me.m12.d06:meMA.Ode9C1H.incipit	@ltx/gr_gr_cog/he.h.m1:heHE.TinZoodochonPigin.incipit
ltx/gr_gr_cog/me.m12.d06:meMA.Ode9C1H.melody	@ltx/gr_gr_cog/he.h.m1:heHE.TinZoodochonPigin.melody
ltx/gr_gr_cog/me.m12.d06:meMA.Ode9C1H.mode	@ltx/gr_gr_cog/miscellanea:misc.Mode1
ltx/gr_gr_cog/me.m12.d06:meMA.Ode9C1H.ode	@ltx/gr_gr_cog/miscellanea:misc.Ode9
ltx/gr_gr_cog/me.m12.d06:meMA.Ode9C1H.text	@ltx/gr_gr_cog/he.h.m1:heHE.TinZoodochonPigin.text
ltx/gr_gr_cog/me.m12.d06:meMA.Ode9C21.greekmelody	@ltx/gr_gr_cog/he.h.m2:heHE.AnarchouGennitoros.greekname
ltx/gr_gr_cog/me.m12.d06:meMA.Ode9C21.incipit	Λαμπάσι τῆς χάριτος, θεόφρον φωτιζόμενος…
ltx/gr_gr_cog/me.m12.d06:meMA.Ode9C21.melody	@ltx/gr_gr_cog/he.h.m2:heHE.AnarchouGennitoros.name
ltx/gr_gr_cog/me.m12.d06:meMA.Ode9C21.mode	@ltx/gr_gr_cog/miscellanea:misc.Mode2
ltx/gr_gr_cog/me.m12.d06:meMA.Ode9C21.ode	@ltx/gr_gr_cog/miscellanea:misc.Ode9
ltx/gr_gr_cog/me.m12.d06:meMA.Ode9C21.text	Λαμπάσι τῆς χάριτος, θεόφρον φωτιζόμενος, καὶ φωστὴρ εὐσεβείας, σαφῶς γενόμενος, τοὺς ἐν πειρασμοῖς διασῴζεις, τοὺς ἐν βυθῷ θαλάσσης λυτροῦσαι, καὶ τρέφεις λιμώττοντας, παραδόξως Παμμακάριστε.
ltx/gr_gr_cog/me.m12.d06:meMA.Ode9C22.incipit	Ὁ ἐν Παραδείσῳ, τῆς τρυφῆς…
ltx/gr_gr_cog/me.m12.d06:meMA.Ode9C22.melody	@ltx/gr_gr_cog/he.h.m2:heHE.AnarchouGennitoros.name
ltx/gr_gr_cog/me.m12.d06:meMA.Ode9C22.mode	@ltx/gr_gr_cog/miscellanea:misc.Mode2
ltx/gr_gr_cog/me.m12.d06:meMA.Ode9C22.ode	@ltx/gr_gr_cog/miscellanea:misc.Ode9
ltx/gr_gr_cog/me.m12.d06:meMA.Ode9C22.text	Ὁ ἐν Παραδείσῳ, τῆς τρυφῆς νῦν αὐλιζόμενος, καὶ τὴν ἄφραστον δόξαν τρανῶς θεώμενος, ἐκ τῶν οὐρανίων ἁψίδων, τοὺς ὑμνητὰς τοὺς σοὺς ἐποπτεύοις, παθῶν ἐκλυτρούμενος, θεοφόρε παμμακάριστε.
ltx/gr_gr_cog/me.m12.d06:meMA.Ode9C2T.incipit	Σοφίαν καὶ δύναμιν, καὶ Λόγον…
ltx/gr_gr_cog/me.m12.d06:meMA.Ode9C2T.melody	@ltx/gr_gr_cog/he.h.m2:heHE.AnarchouGennitoros.name
ltx/gr_gr_cog/me.m12.d06:meMA.Ode9C2T.mode	@ltx/gr_gr_cog/miscellanea:misc.Mode2
ltx/gr_gr_cog/me.m12.d06:meMA.Ode9C2T.ode	@ltx/gr_gr_cog/miscellanea:misc.Ode9
ltx/gr_gr_cog/me.m12.d06:meMA.Ode9C2T.text	Σοφίαν καὶ δύναμιν, καὶ Λόγον ἐνυπόστατον, τοῦ Πατρὸς Θεομῆτορ, Ἁγνὴ γεγέννηκας, ἐκ τῶν σῶν ἀχράντων αἱμάτων, τὸν ἑαυτῆς ναὸν προσλαβοῦσαν, καὶ τούτῳ καθʼ ἕνωσιν, ἑνωθεῖσαν ἀδιάῤῥηκτον.
ltx/gr_gr_cog/me.m12.d06:meMA.Ode9C31.greekmelody	@ltx/gr_gr_cog/he.h.m1:heHE.MystirionXenon.greekname
ltx/gr_gr_cog/me.m12.d06:meMA.Ode9C31.incipit	Χορεύσατε πνεύματι, πάντες φιλέορτοι, οὐρανοὶ…
ltx/gr_gr_cog/me.m12.d06:meMA.Ode9C31.melody	@ltx/gr_gr_cog/he.h.m1:heHE.MystirionXenon.name
ltx/gr_gr_cog/me.m12.d06:meMA.Ode9C31.mode	@ltx/gr_gr_cog/miscellanea:misc.Mode1
ltx/gr_gr_cog/me.m12.d06:meMA.Ode9C31.ode	@ltx/gr_gr_cog/miscellanea:misc.Ode9
ltx/gr_gr_cog/me.m12.d06:meMA.Ode9C31.text	Χορεύσατε πνεύματι, πάντες φιλέορτοι, οὐρανοὶ εὐφραίνεσθε, Ὄρη τε καὶ Βουνοί, Ἐκκλησίαι, καὶ Παρθένων, Ἀσκητῶν τε χοροί, φαιδρῶς ἐν τῇ μνήμῃ τοῦ Παμμάκαρος, ἐν ᾗ συνελθόντες, τὸν Σωτῆρα μεγαλύνωμεν.
ltx/gr_gr_cog/me.m12.d06:meMA.Ode9C32.incipit	Ψαλάτωσαν ὕμνοις, τὰ πέρατα ἅπαντα…
ltx/gr_gr_cog/me.m12.d06:meMA.Ode9C32.melody	@ltx/gr_gr_cog/he.h.m1:heHE.MystirionXenon.name
ltx/gr_gr_cog/me.m12.d06:meMA.Ode9C32.mode	@ltx/gr_gr_cog/miscellanea:misc.Mode1
ltx/gr_gr_cog/me.m12.d06:meMA.Ode9C32.ode	@ltx/gr_gr_cog/miscellanea:misc.Ode9
ltx/gr_gr_cog/me.m12.d06:meMA.Ode9C32.text	Ψαλάτωσαν ὕμνοις, τὰ πέρατα ἅπαντα, ἐγκωμίων στέμμασι, πάντες τὴν κορυφὴν Νικολάου, τοῦ θείου κοσμοῦντες σαφῶς, τοῦ θεράποντος Χριστοῦ τοῦ Θεοῦ, διʼ οὗ ἐκ παθῶν τε καὶ κινδύνων λυτρωθείημεν.
ltx/gr_gr_cog/me.m12.d06:meMA.Ode9C33.incipit	Ὡς ἄξιον δέχου, τὸν ὕμνον…
ltx/gr_gr_cog/me.m12.d06:meMA.Ode9C33.melody	@ltx/gr_gr_cog/he.h.m1:heHE.MystirionXenon.name
ltx/gr_gr_cog/me.m12.d06:meMA.Ode9C33.mode	@ltx/gr_gr_cog/miscellanea:misc.Mode1
ltx/gr_gr_cog/me.m12.d06:meMA.Ode9C33.ode	@ltx/gr_gr_cog/miscellanea:misc.Ode9
ltx/gr_gr_cog/me.m12.d06:meMA.Ode9C33.text	Ὡς ἄξιον δέχου, τὸν ὕμνον Νικόλαε, τοῦ μικροῦ πονήματος, τούτου ὥσπερ Χριστός, προσεδέξατο τῆς χήρας τὰ δύω λεπτά· μὴ βδελύξῃ τὴν ἐγχείρησιν· ποθῶν οὐ κομπάζων γάρ, Τρισμάκαρ κατετόλμησα.
ltx/gr_gr_cog/me.m12.d06:meMA.Ode9C3T.incipit	Διέσωσται πᾶσα, ἡ κτίσις τῷ…
ltx/gr_gr_cog/me.m12.d06:meMA.Ode9C3T.melody	@ltx/gr_gr_cog/he.h.m1:heHE.MystirionXenon.name
ltx/gr_gr_cog/me.m12.d06:meMA.Ode9C3T.mode	@ltx/gr_gr_cog/miscellanea:misc.Mode1
ltx/gr_gr_cog/me.m12.d06:meMA.Ode9C3T.ode	@ltx/gr_gr_cog/miscellanea:misc.Ode9
ltx/gr_gr_cog/me.m12.d06:meMA.Ode9C3T.text	Διέσωσται πᾶσα, ἡ κτίσις τῷ τόκῳ σου, καὶ ἀφεῖλε Κύριος, θρῆνον καὶ ὀδυρμόν, καὶ πᾶν δάκρυον, ἐκ παντὸς προσώπου Ἁγνή, Θεοτόκε παναμώμητε ἐν σοί, καὶ ἡμεῖς τὰς ὀφειλὰς ἀποδιδόαμεν.
ltx/gr_gr_cog/me.m12.d06:meMA.Ode9C3Tr.incipit	Ἑνίζεται ὁμοουσίῳ θελήματι, ἡ Τριὰς…
ltx/gr_gr_cog/me.m12.d06:meMA.Ode9C3Tr.melody	@ltx/gr_gr_cog/he.h.m1:heHE.MystirionXenon.name
ltx/gr_gr_cog/me.m12.d06:meMA.Ode9C3Tr.mode	@ltx/gr_gr_cog/miscellanea:misc.Mode1
ltx/gr_gr_cog/me.m12.d06:meMA.Ode9C3Tr.ode	@ltx/gr_gr_cog/miscellanea:misc.Ode9
ltx/gr_gr_cog/me.m12.d06:meMA.Ode9C3Tr.text	Ἑνίζεται ὁμοουσίῳ θελήματι, ἡ Τριὰς μερίζεται, πάλιν προσωπικῶς ἀμερίστως, συντηροῦσα τὸ κράτος ἀεί, ὁ Πατήρ, ὁ Υἱὸς καὶ Πνεῦμα τὸ ζῶν, ὁ εἷς τρισυπόστατος Θεός, ὃν μεγαλύνομεν.
ltx/gr_gr_cog/me.m12.d06:meMA.Oikos1.text	Ἀνυμνήσωμεν νῦν τὸν Ἱεράρχην ᾄσμασι, τὸν ἐν Μύροις λαοὶ ποιμένα καὶ διδάσκαλον, ἵνα ταῖς πρεσβείαις αὐτοῦ ἐλλαμφθῶμεν· ἰδοὺ γὰρ ὤφθη ὅλος καθάρσιος, ἀκήρατος πνεύματι, Χριστῷ προσάγων θυσίαν ἄμωμον, τὴν εἰλικρινῆ καὶ Θεῷ εὐπρόσδεκτον, ὡς ἱερεὺς κεκαθαρμένος τῇ ψυχῇ καὶ τῇ σαρκί· ὅθεν ὑπάρχει ἀληθῶς, τῆς Ἐκκλησίας προστάτης, καὶ ὑπέρμαχος ταύτης, ὡς μέγας μύστης Θεοῦ τῆς χάριτος.
ltx/gr_gr_cog/me.m12.d06:meMA.PostGospelBoth.incipit	@ltx/gr_gr_cog/ho.ho03:hoMA.PostGospelTheotokos.incipit
ltx/gr_gr_cog/me.m12.d06:meMA.PostGospelBoth.melody	
ltx/gr_gr_cog/me.m12.d06:meMA.PostGospelBoth.mode	@ltx/gr_gr_cog/miscellanea:misc.Mode2
ltx/gr_gr_cog/me.m12.d06:meMA.PostGospelBoth.text	@ltx/gr_gr_cog/ho.ho03:hoMA.PostGospelTheotokos.text
ltx/gr_gr_cog/me.m12.d06:meMA.PostGospelGlory.incipit	@ltx/gr_gr_cog/ho.ho03:hoMA.PostGospelHierarch.incipit
ltx/gr_gr_cog/me.m12.d06:meMA.PostGospelGlory.melody	
ltx/gr_gr_cog/me.m12.d06:meMA.PostGospelGlory.mode	@ltx/gr_gr_cog/miscellanea:misc.Mode2
ltx/gr_gr_cog/me.m12.d06:meMA.PostGospelGlory.text	@ltx/gr_gr_cog/ho.ho03:hoMA.PostGospelHierarch.text
ltx/gr_gr_cog/me.m12.d06:meMA.PostGospelIdiomelon.incipit	@ltx/gr_gr_cog/me.m12.d06:meVE.Lity7.incipit
ltx/gr_gr_cog/me.m12.d06:meMA.PostGospelIdiomelon.melody	
ltx/gr_gr_cog/me.m12.d06:meMA.PostGospelIdiomelon.mode	@ltx/gr_gr_cog/miscellanea:misc.Mode6
ltx/gr_gr_cog/me.m12.d06:meMA.PostGospelIdiomelon.text	@ltx/gr_gr_cog/me.m12.d06:meVE.Lity7.text
ltx/gr_gr_cog/me.m12.d06:meSV.AposGlory.incipit	Ζηλώσας ὁ ἀντίδικος, τὴν ποίμνην…
ltx/gr_gr_cog/me.m12.d06:meSV.AposGlory.melody	@ltx/gr_gr_cog/he.a.m6:heAU.TriimerosAnestis.name
ltx/gr_gr_cog/me.m12.d06:meSV.AposGlory.mode	@ltx/gr_gr_cog/miscellanea:misc.Mode6
ltx/gr_gr_cog/me.m12.d06:meSV.AposGlory.text	Ζηλώσας ὁ ἀντίδικος, τὴν ποίμνην Πανάχραντε, καθʼ ἑκάστην, ἐκζητεῖ ὁ πονηρός, κατάβρωμα ποιῆσαι, ἀλλὰ σὺ Θεοτόκε, τῆς τούτου βλάβης ἐξελοῦ ἡμᾶς.
ltx/gr_gr_cog/me.m12.d06:meSV.Aposticha1.incipit	Νικόλαε μακάριε, προσπίπτοντά με οἴκτειρον…
ltx/gr_gr_cog/me.m12.d06:meSV.Aposticha1.melody	@ltx/gr_gr_cog/he.a.m6:heAU.TriimerosAnestis.name
ltx/gr_gr_cog/me.m12.d06:meSV.Aposticha1.mode	@ltx/gr_gr_cog/miscellanea:misc.Mode6
ltx/gr_gr_cog/me.m12.d06:meSV.Aposticha1.text	Νικόλαε μακάριε, προσπίπτοντά με οἴκτειρον, δέομαί σου, καὶ τὰ ὄμματα σοφέ, φώτισον τῆς ψυχῆς μου, ἵνα καθαρῶς βλέψω, τὸν φωτοδότην καὶ οἰκτίρμονα.
ltx/gr_gr_cog/me.m12.d06:meSV.Aposticha2.incipit	Ἐχθρῶν ἐπιζητούντων με, κακοποιῆσαι Ἅγιε…
ltx/gr_gr_cog/me.m12.d06:meSV.Aposticha2.melody	@ltx/gr_gr_cog/he.a.m6:heAU.TriimerosAnestis.name
ltx/gr_gr_cog/me.m12.d06:meSV.Aposticha2.mode	@ltx/gr_gr_cog/miscellanea:misc.Mode6
ltx/gr_gr_cog/me.m12.d06:meSV.Aposticha2.text	Ἐχθρῶν ἐπιζητούντων με, κακοποιῆσαι Ἅγιε, ἐξελοῦ με, παῤῥησίαν πρὸς Θεόν, ὡς ἔχων Ἱεράρχα, Νικόλαε παμμάκαρ, καὶ ἐξ ἀνδρῶν αἱμάτων σῶσόν με.
ltx/gr_gr_cog/me.m12.d06:meSV.Aposticha3.incipit	Λιμένα σε ἀχείμαστον, καὶ τεῖχος…
ltx/gr_gr_cog/me.m12.d06:meSV.Aposticha3.melody	@ltx/gr_gr_cog/he.a.m6:heAU.TriimerosAnestis.name
ltx/gr_gr_cog/me.m12.d06:meSV.Aposticha3.mode	@ltx/gr_gr_cog/miscellanea:misc.Mode6
ltx/gr_gr_cog/me.m12.d06:meSV.Aposticha3.text	Λιμένα σε ἀχείμαστον, καὶ τεῖχος ἀπροσμάχητον, Ἱεράρχα, σὲ κεκτήμεθα πιστοί, καὶ πύργον ἀσφαλείας, καὶ θύραν μετανοίας, καὶ ὁδηγὸν ψυχῶν καὶ πρόμαχον.
ltx/gr_gr_cog/me.m12.d06:meSV.SticBoth.incipit	@ltx/gr_gr_cog/he.o:heOT.TheotokeSyEi.incipit
ltx/gr_gr_cog/me.m12.d06:meSV.SticBoth.melody	@ltx/gr_gr_cog/he.o:heOT.TheotokeSyEi.name
ltx/gr_gr_cog/me.m12.d06:meSV.SticBoth.mode	@ltx/gr_gr_cog/miscellanea:misc.Mode6
ltx/gr_gr_cog/me.m12.d06:meSV.SticBoth.text	@ltx/gr_gr_cog/he.o:heOT.TheotokeSyEiIerarchou.text
ltx/gr_gr_cog/me.m12.d06:meSV.SticGlory.incipit	Κληρονόμε Θεοῦ, συγκληρονόμε Χριστοῦ, λειτουργὲ…
ltx/gr_gr_cog/me.m12.d06:meSV.SticGlory.melody	
ltx/gr_gr_cog/me.m12.d06:meSV.SticGlory.mode	@ltx/gr_gr_cog/miscellanea:misc.Mode6
ltx/gr_gr_cog/me.m12.d06:meSV.SticGlory.text	Κληρονόμε Θεοῦ, συγκληρονόμε Χριστοῦ, λειτουργὲ Κυρίου, Ἅγιε Νικόλαε, κατὰ τὸ ὄνομά σου, οὕτω καὶ ἡ πολιτεία σου· συνεξέλαμψε γὰρ τῇ πολιᾷ ἡ σύνεσις, ἐμαρτύρει τὸ φαιδρὸν τοῦ προσώπου σου, τῆς ψυχῆς τὸ ἀνεξίκακον, ἐβεβαίου τὴν πραότητα, τοῦ λόγου τὸ ἥσυχον, ἡ ζωή σου ἔνδοξος, καὶ ἡ κοίμησις μετὰ Ἁγίων. Πρέσβευε ὑπὲρ τῶν ψυχῶν ἡμῶν.
ltx/gr_gr_cog/me.m12.d06:meSV.Stichera1.incipit	Μύρῳ θείῳ σε ἔχρισε, θεία…
ltx/gr_gr_cog/me.m12.d06:meSV.Stichera1.melody	@ltx/gr_gr_cog/he.a.m4:heAU.OsGennaionEnMartysi.name
ltx/gr_gr_cog/me.m12.d06:meSV.Stichera1.mode	@ltx/gr_gr_cog/miscellanea:misc.Mode4
ltx/gr_gr_cog/me.m12.d06:meSV.Stichera1.text	Μύρῳ θείῳ σε ἔχρισε, θεία χάρις τοῦ Πνεύματος, Μύρων προεδρεύσαντα καὶ μυρίσαντα, ταῖς ἀρεταῖς Ἱερώτατε, τοῦ κόσμου τὰ πέρατα, ἡδυπνόοις τε εὐχαῖς, τὰ δυσώδη διώκοντα, πάθη πάντοτε· διὰ τοῦτό σε πίστει εὐφημοῦμεν, καὶ τελοῦμέν σου τὴν μνήμην, τὴν παναγίαν Νικόλαε.
ltx/gr_gr_cog/me.m12.d06:meSV.Stichera2.incipit	Ὡς λαμπτῆρά σε ἄδυτον, ὡς…
ltx/gr_gr_cog/me.m12.d06:meSV.Stichera2.melody	@ltx/gr_gr_cog/he.a.m4:heAU.OsGennaionEnMartysi.name
ltx/gr_gr_cog/me.m12.d06:meSV.Stichera2.mode	@ltx/gr_gr_cog/miscellanea:misc.Mode4
ltx/gr_gr_cog/me.m12.d06:meSV.Stichera2.text	Ὡς λαμπτῆρά σε ἄδυτον, ὡς φωστῆρα παγκόσμιον, ἐν τῷ στερεώματι ἀναλάμψαντα, τῆς Ἐκκλησίας Νικόλαε, καὶ κόσμον φωτίζοντα, καὶ κινδύνων χαλεπῶν, τὴν ἀχλύν ἀπελαύνοντα, καὶ ἐξαίροντα, ἀθεΐας χειμῶνα καὶ γαλήνην, ἐργαζόμενον βαθεῖαν, χρεωστικῶς μακαρίζομεν.
ltx/gr_gr_cog/me.m12.d06:meSV.Stichera3.incipit	Καὶ παρὼν καὶ φαινόμενος, ἐν…
ltx/gr_gr_cog/me.m12.d06:meSV.Stichera3.melody	@ltx/gr_gr_cog/he.a.m4:heAU.OsGennaionEnMartysi.name
ltx/gr_gr_cog/me.m12.d06:meSV.Stichera3.mode	@ltx/gr_gr_cog/miscellanea:misc.Mode4
ltx/gr_gr_cog/me.m12.d06:meSV.Stichera3.text	Καὶ παρὼν καὶ φαινόμενος, ἐν ὀνείροις Νικόλαε, τοὺς ἀδίκως μέλλοντας θνῄσκειν ἔσωσας, ὡς συμπαθὴς ὡς φιλάγαθος, ὡς ῥύστης θερμότατος, ὡς προστάτης ἀληθής, τῶν πιστῶς ἐξαιτούντων σου, τὴν ἀντίληψιν, Ἱερώτατε Πάτερ τῶν Ἀγγέλων, συμπολῖτα Ἀποστόλων καὶ Προφητῶν ἰσοστάσιε.
ltx/gr_gr_cog/me.m12.d06:meVE.AposBoth.incipit	Ἀνύμφευτε Παρθένε, πόθεν ἥκεις; τὶς…
ltx/gr_gr_cog/me.m12.d06:meVE.AposBoth.melody	
ltx/gr_gr_cog/me.m12.d06:meVE.AposBoth.mode	@ltx/gr_gr_cog/miscellanea:misc.Mode6
ltx/gr_gr_cog/me.m12.d06:meVE.AposBoth.text	Ἀνύμφευτε Παρθένε, πόθεν ἥκεις; τίς ὁ τεκὼν σε; τίς καὶ ἡ Μήτηρ σου; πῶς τὸν Κτίστην φέρεις ἐν ἀγκάλαις; πῶς οὐκ ἐφθάρης τὴν νηδύν, μεγάλων παραδόξων ἐπὶ γῆς τελουμένων, ὁρῶμεν Παναγία, καὶ προευτρεπίζομεν ἐπάξιόν σοι χρέος, ἐκ τῆς γῆς τὸ Σπήλαιον, καὶ οὐρανὸν αἰτοῦμεν, παρασχεῖν τὸν Ἀστέρα, καὶ Μάγοι δὲ προέρχονται, ἀπὸ Ἀνατολῶν τῆς γῆς, εἰς δυσμὰς θεάσασθαι, τὴν σωτηρίαν τῶν βροτῶν, ὡς βρέφος γαλουχούμενον.
ltx/gr_gr_cog/me.m12.d06:meVE.AposGlory.incipit	Ἄνθρωπε τοῦ Θεοῦ, καὶ πιστὲ…
ltx/gr_gr_cog/me.m12.d06:meVE.AposGlory.melody	
ltx/gr_gr_cog/me.m12.d06:meVE.AposGlory.mode	@ltx/gr_gr_cog/miscellanea:misc.Mode6
ltx/gr_gr_cog/me.m12.d06:meVE.AposGlory.text	Ἄνθρωπε τοῦ Θεοῦ, καὶ πιστὲ θεράπον, λειτουργὲ Κυρίου, ἄνερ ἐπιθυμιῶν, σκεῦος ἐκλογῆς, στῦλε καὶ ἑδραίωμα τῆς Ἐκκλησίας, Βασιλείας κληρονόμε, μὴ παρασιωπήσῃς, τοῦ βοᾶν ὑπὲρ ἡμῶν τὸν Κύριον.
ltx/gr_gr_cog/me.m12.d06:meVE.Aposticha1.greekmelody	@ltx/gr_gr_cog/he.a.m5:heAU.ChairoisAskitikon.greekname
ltx/gr_gr_cog/me.m12.d06:meVE.Aposticha1.incipit	Χαίροις ἡ ἱερὰ κεφαλή, τὸ…
ltx/gr_gr_cog/me.m12.d06:meVE.Aposticha1.melody	@ltx/gr_gr_cog/he.a.m5:heAU.ChairoisAskitikon.name
ltx/gr_gr_cog/me.m12.d06:meVE.Aposticha1.mode	@ltx/gr_gr_cog/miscellanea:misc.Mode5
ltx/gr_gr_cog/me.m12.d06:meVE.Aposticha1.text	Χαίροις ἡ ἱερὰ κεφαλή, τὸ καθαρὸν τῶν ἀρετῶν καταγώγιον, ὁ θεῖος τῆς θειοτάτης, ἱερωσύνης κανών, ὁ Ποιμὴν ὁ μέγας, ὁ φανότατος, πυρσὸς ὁ τῆς νίκης, ἐπιφερόμενος ὄνομα, ὁ δεομένοις, συμπαθῶς ἐπικλώμενος· ὁ καμπτόμενος, ἀσθενῶν ταῖς δεήσεσι· ῥύστης ὁ ἑτοιμότατος, φρουρὸς ὁ σωτήριος, πᾶσι τοῖς πίστει τελοῦσι, τὴν παναοίδιμον μνήμην σου. Χριστὸν καταπέμψαι, παμμακάριστε δυσώπει, τὸ μέγα ἔλεος.
ltx/gr_gr_cog/me.m12.d06:meVE.Aposticha2.incipit	Χαίροις ὁ ἱερώτατος νοῦς, τὸ…
ltx/gr_gr_cog/me.m12.d06:meVE.Aposticha2.melody	@ltx/gr_gr_cog/he.a.m5:heAU.ChairoisAskitikon.name
ltx/gr_gr_cog/me.m12.d06:meVE.Aposticha2.mode	@ltx/gr_gr_cog/miscellanea:misc.Mode5
ltx/gr_gr_cog/me.m12.d06:meVE.Aposticha2.text	Χαίροις ὁ ἱερώτατος νοῦς, τὸ τῆς Τριάδος καθαρὸν ἐνδιαίτημα, ὁ στῦλος τῆς Ἐκκλησίας, ὁ τῶν πιστῶν στηριγμός, καταπονουμένων ἡ βοήθεια, ἀστήρ, ὁ ταῖς λάμψεσιν, εὐπροσδέκτων δεήσεων, διασκεδάζων, πειρασμῶν τε καὶ θλίψεων, σκότος πάντοτε, Ἱεράρχα Νικόλαε. ὅρμος ὁ γαληνότατος, ἐν ᾧ καταφεύγοντες, οἱ τρικυμίαις τοῦ βίου περιστατούμενοι σώζονται. Χριστὸν ἐκδυσώπει, ταῖς ψυχαῖς ἡμῶν δοθῆναι, τὸ μέγα ἔλεος.
ltx/gr_gr_cog/me.m12.d06:meVE.Aposticha3.incipit	Χαίροις ὁ ζήλου θείου πλησθείς…
ltx/gr_gr_cog/me.m12.d06:meVE.Aposticha3.melody	@ltx/gr_gr_cog/he.a.m5:heAU.ChairoisAskitikon.name
ltx/gr_gr_cog/me.m12.d06:meVE.Aposticha3.mode	@ltx/gr_gr_cog/miscellanea:misc.Mode5
ltx/gr_gr_cog/me.m12.d06:meVE.Aposticha3.text	Χαίροις ὁ ζήλου θείου πλησθείς, ἀπαγωγῆς τε πονηρὰς λυτρωσάμενος, ἀδίκως μέλλοντας θνῄσκειν, ἐπιστασίᾳ φρικτῇ, καὶ ταῖς διʼ ὀνείρων προσφοιτήσεσι. Πηγὴ ἡ πηγάζουσα, ἐν τοῖς Μύροις Νικόλαε, μύρα πλουσίως, καὶ ψυχὰς καταρδεύουσα, τὰ δυσώδη τε τῶν παθῶν ἀπελαύνουσα. Μάχαιρα τὰ ζιζάνια, τῆς πλάνης ἐκτέμνουσα. Πτύον λικμίζον Ἀρείου, τὰ ἀχυρώδη διδάγματα. Χριστὸν καταπέμψαι, ταῖς ψυχαῖς ἡμῶν δυσώπει, τὸ μέγα ἔλεος.
ltx/gr_gr_cog/me.m12.d06:meVE.GeneralApolytikion1.melody	@ltx/gr_gr_cog/he.ga:heGA.KanonaPisteos.name
ltx/gr_gr_cog/me.m12.d06:meVE.GeneralApolytikion1.mode	@ltx/gr_gr_cog/miscellanea:misc.Mode4
ltx/gr_gr_cog/me.m12.d06:meVE.GeneralApolytikion1.name	Πάτερ ἱεράρχα Νικόλαε·
ltx/gr_gr_cog/me.m12.d06:meVE.Lity1.incipit	Ἐνατενίσας ἀκλινῶς τῷ ὕψει τῆς…
ltx/gr_gr_cog/me.m12.d06:meVE.Lity1.melody	
ltx/gr_gr_cog/me.m12.d06:meVE.Lity1.mode	@ltx/gr_gr_cog/miscellanea:misc.Mode1
ltx/gr_gr_cog/me.m12.d06:meVE.Lity1.text	Ἐνατενίσας ἀκλινῶς τῷ ὕψει τῆς γνώσεως, καὶ κατοπτεύσας ἀδήλως σοφίας τὸν βυθόν, σαῖς διδαχαῖς κόσμον κατεπλούτισας, Πάτερ. Ὑπὲρ ἡμῶν ἀεὶ Χριστὸν δυσώπει, Ἱεράρχα Νικόλαε.
ltx/gr_gr_cog/me.m12.d06:meVE.Lity2.incipit	Ἄνθρωπε τοῦ Θεοῦ καὶ πιστὲ…
ltx/gr_gr_cog/me.m12.d06:meVE.Lity2.melody	
ltx/gr_gr_cog/me.m12.d06:meVE.Lity2.mode	@ltx/gr_gr_cog/miscellanea:misc.Mode1
ltx/gr_gr_cog/me.m12.d06:meVE.Lity2.text	Ἄνθρωπε τοῦ Θεοῦ καὶ πιστὲ θεράπον, καὶ οἰκονόμε τῶν αὐτοῦ μυστηρίων, καὶ ἄνερ ἐπιθυμιῶν τῶν τοῦ Πνεύματος, στήλη τε ἔμψυχε, καὶ ἔμπνους εἰκών· ὡς θεῖον γὰρ θησαυρόν σε, ἡ τῶν Μυρέων Ἐκκλησία, ἀγαμένη προσήκατο, καὶ πρεσβευτὴν τῶν ψυχῶν ἡμῶν.
ltx/gr_gr_cog/me.m12.d06:meVE.Lity3.incipit	Κανόνα πίστεως, καὶ εἰκόνα πραότητος…
ltx/gr_gr_cog/me.m12.d06:meVE.Lity3.melody	
ltx/gr_gr_cog/me.m12.d06:meVE.Lity3.mode	@ltx/gr_gr_cog/miscellanea:misc.Mode2
ltx/gr_gr_cog/me.m12.d06:meVE.Lity3.text	Κανόνα πίστεως, καὶ εἰκόνα πραότητος, ἀνέδειξέ σε τῇ ποίμνῃ σου Χριστὸς ὁ Θεός, Ἱεράρχα Νικόλαε· ἐν γὰρ τοῖς Μύροις μυρίζων, διαλάμπεις φαιδρῶς τοῖς θείοις σου κατορθώμασιν, ὀρφανῶν καὶ χηρῶν προστάτα· διὸ ἱκετεύων μὴ παύσῃ, σωθῆναι τὰς ψυχὰς ἡμῶν.
ltx/gr_gr_cog/me.m12.d06:meVE.Lity4.incipit	Πάτερ Νικόλαε, ἡ μυροθήκη τῶν…
ltx/gr_gr_cog/me.m12.d06:meVE.Lity4.melody	
ltx/gr_gr_cog/me.m12.d06:meVE.Lity4.mode	@ltx/gr_gr_cog/miscellanea:misc.Mode2
ltx/gr_gr_cog/me.m12.d06:meVE.Lity4.text	Πάτερ Νικόλαε, ἡ μυροθήκη τῶν λειψάνων σου, τὰ Μύρα πολιουχεῖ· διὸ καὶ δεσμίους, ἀκρίτως κατακριθέντας, ἐν ὀνείρῳ Βασιλεῖ τῇ ὀπτασίᾳ σου φανείς, ἠλευθέρωσας θανάτου, δεσμῶν καὶ φυλακῆς· ἀλλὰ καὶ νῦν, ὡς τότε, καὶ ἀεί, διʼ ὀπτασίας σου φάνηθι, πρεσβεύων ὑπὲρ τῶν ψυχῶν ἡμῶν.
ltx/gr_gr_cog/me.m12.d06:meVE.Lity5.incipit	Πάτερ Νικόλαε, εἰ καὶ τὰ…
ltx/gr_gr_cog/me.m12.d06:meVE.Lity5.melody	
ltx/gr_gr_cog/me.m12.d06:meVE.Lity5.mode	@ltx/gr_gr_cog/miscellanea:misc.Mode2
ltx/gr_gr_cog/me.m12.d06:meVE.Lity5.text	Πάτερ Νικόλαε, εἰ καὶ τὰ Μύρα σιωπᾷ, ἀλλʼ ὁ κόσμος ὅλος, ὁ ὑπὸ σοῦ φωτισθείς, καὶ ἡ τοῦ Μύρου εὐωδία, καὶ τῶν θαυμάτων τὰ πλήθη, ἀνακράζει εὐφήμοις ὑμνῳδίαις, καὶ οἱ σωθέντες διὰ σοῦ κατάκριτοι. Σὺν τοῖς ἐν Μύροις καὶ ἡμεῖς μέλποντες βοῶμεν· Πρέσβευε σωθῆναι τὰς ψυχὰς ἡμῶν.
ltx/gr_gr_cog/me.m12.d06:meVE.Lity6.incipit	Πάτερ Νικόλαε, τοῦ παναγίου Πνεύματος…
ltx/gr_gr_cog/me.m12.d06:meVE.Lity6.melody	
ltx/gr_gr_cog/me.m12.d06:meVE.Lity6.mode	@ltx/gr_gr_cog/miscellanea:misc.Mode4
ltx/gr_gr_cog/me.m12.d06:meVE.Lity6.text	Πάτερ Νικόλαε, τοῦ παναγίου Πνεύματος μυροθήκη ὑπάρχων, ὡς ἔαρ μυρίζεις εὐφρόσυνον, τῶν θείων ἀρωμάτων Χριστοῦ· τῶν Ἀποστόλων γὰρ μιμητὴς γενόμενος, τὴν οἰκουμένην περιπολεύεις, διὰ τῶν λόγων τῶν θαυμάτων σου. Ὅθεν καὶ τοῖς πόῤῥω ὡς ἐγγύς, διʼ ὀνείρων ὀπτανόμενος, ἐκ θανάτου λυτροῦσαι, τοὺς ἀδίκῳ ψήφῳ θνῄσκειν μέλλοντας, διασῴζων παραδόξως, ἐκ κινδύνων πολλῶν, τοὺς ἐπικαλουμένους σε. Διὸ καὶ ἡμᾶς τῶν ἐπεμβαινόντων δυσχερῶν, ἐλευθέρωσον σαῖς πρεσβείαις, τοὺς ἀεὶ ἀνευφημοῦντάς σε.
ltx/gr_gr_cog/me.m12.d06:meVE.Lity7.incipit	Εὖ δοῦλε ἀγαθὲ καὶ πιστέ…
ltx/gr_gr_cog/me.m12.d06:meVE.Lity7.melody	
ltx/gr_gr_cog/me.m12.d06:meVE.Lity7.mode	@ltx/gr_gr_cog/miscellanea:misc.Mode6
ltx/gr_gr_cog/me.m12.d06:meVE.Lity7.text	Εὖ δοῦλε ἀγαθὲ καὶ πιστέ· εὖ ἐργάτα τοῦ ἀμπελῶνος Χριστοῦ· σὺ καὶ τὸ βάρος τῆς ἡμέρας ἐβάστασας· σὺ καὶ τὸ δοθέν σοι τάλαντον ἐπηύξησας, καὶ τοῖς μετὰ σὲ ἐλθοῦσιν οὐκ ἐφθόνησας. Διὸ πύλη σοι οὐρανῶν ἠνέῳκται· εἴσελθε εἰς τὴν χαρὰν τοῦ Κυρίου σου, καὶ πρέσβευε ὑπὲρ ἡμῶν, Ἅγιε Νικόλαε.
ltx/gr_gr_cog/me.m12.d06:meVE.Lity8.incipit	Εἰς αἶνον ἔδραμες τοῦ Κυρίου…
ltx/gr_gr_cog/me.m12.d06:meVE.Lity8.melody	
ltx/gr_gr_cog/me.m12.d06:meVE.Lity8.mode	@ltx/gr_gr_cog/miscellanea:misc.Mode8
ltx/gr_gr_cog/me.m12.d06:meVE.Lity8.text	Εἰς αἶνον ἔδραμες τοῦ Κυρίου Νικόλαε, ἐν τῇ προσκαίρῳ ζωῇ, καὶ αὐτός σε ἐδόξασεν ἐν ἐπουρανίῳ, καὶ ὄντως ζωή. Διὸ παῤῥησίαν κεκτημένος πρὸς αὐτόν, ἱκέτευε σωθῆναι τὰς ψυχὰς ἡμῶν.
ltx/gr_gr_cog/me.m12.d06:meVE.LityBoth.incipit	@ltx/gr_gr_cog/me.m12.d24:meH1.Idiomelon1.incipit
ltx/gr_gr_cog/me.m12.d06:meVE.LityBoth.melody	
ltx/gr_gr_cog/me.m12.d06:meVE.LityBoth.mode	@ltx/gr_gr_cog/miscellanea:misc.Mode8
ltx/gr_gr_cog/me.m12.d06:meVE.LityBoth.text	@ltx/gr_gr_cog/me.m12.d24:meH1.Idiomelon1.text
ltx/gr_gr_cog/me.m12.d06:meVE.LityGlory.incipit	Τῶν ἀνδραγαθημάτων σου, Ὅσιε Πάτερ…
ltx/gr_gr_cog/me.m12.d06:meVE.LityGlory.melody	
ltx/gr_gr_cog/me.m12.d06:meVE.LityGlory.mode	@ltx/gr_gr_cog/miscellanea:misc.Mode8
ltx/gr_gr_cog/me.m12.d06:meVE.LityGlory.text	Τῶν ἀνδραγαθημάτων σου, Ὅσιε Πάτερ, ὁ καρπὸς ἐφαίδρυνε τῶν πιστῶν τὰς καρδίας· τίς γὰρ ἀκούων τὴν ἄμετρόν σου ταπείνωσιν, τὴν ὑπομονὴν οὐκ ἐθαύμασε; τὴν πρὸς τοὺς πένητας ἱλαρότητα; θλιβομένων τὸ συμπαθές; πάντας θεοπρεπῶς ἐδίδαξας, Ἱεράρχα Νικόλαε, καὶ νῦν τὸν ἀμαράντινον ἀναδησάμενος στέφανον, πρέσβευε ὑπὲρ τῶν ψυχῶν ἡμῶν.
ltx/gr_gr_cog/me.m12.d06:meVE.MM.GeneralApolytikion1.text	
ltx/gr_gr_cog/me.m12.d06:meVE.SticBoth.incipit	Σπήλαιον εὐτρεπίζου· ἡ Ἀμνὰς γὰρ…
ltx/gr_gr_cog/me.m12.d06:meVE.SticBoth.melody	
ltx/gr_gr_cog/me.m12.d06:meVE.SticBoth.mode	@ltx/gr_gr_cog/miscellanea:misc.Mode6
ltx/gr_gr_cog/me.m12.d06:meVE.SticBoth.text	Σπήλαιον εὐτρεπίζου· ἡ Ἀμνὰς γὰρ ἥκει, ἔμβρυον φέρουσα Χριστόν. Φάτνη δὲ ὑποδέχου, τὸν τῷ λόγῳ λύσαντα τῆς ἀλόγου πράξεως, ἡμᾶς τοὺς γηγενεῖς. Ποιμένες ἀγραυλοῦντες, μαρτυρεῖτε θαῦμα τὸ φρικτόν, καὶ Μάγοι ἐκ Περσίδος, χρυσὸν καὶ λίβανον καὶ σμύρναν, τῷ Βασιλεῖ προσάξατε· ὅτι ὤφθη Κύριος ἐκ Παρθένου Μητρός, ὅν περ καὶ κύψασα, δουλικῶς ἡ Μήτηρ προσεκύνησε, καὶ προσεφθέγξατο τῷ ἐν ἀγκάλαις αὐτῆς. Πῶς ἐνεσπάρης μοι, ἢ πῶς μοι ἐνεφύης, ὁ λυτρωτής μου καὶ Θεός;
ltx/gr_gr_cog/me.m12.d06:meVE.SticGlory.incipit	Ἱεραρχῶν τὴν καλλονήν, καὶ τῶν…
ltx/gr_gr_cog/me.m12.d06:meVE.SticGlory.melody	
ltx/gr_gr_cog/me.m12.d06:meVE.SticGlory.mode	@ltx/gr_gr_cog/miscellanea:misc.Mode6
ltx/gr_gr_cog/me.m12.d06:meVE.SticGlory.text	Ἱεραρχῶν τὴν καλλονήν, καὶ τῶν Πατέρων κλέος, τὴν βρύσιν τῶν θαυμάτων, καὶ τῶν πιστῶν ἀντιλήπτορα μέγιστον, συνελθόντες ὦ φιλέορτοι, ᾀσματικοῖς ἐγκωμίοις ὑμνήσωμεν λέγοντες· Χαίροις ὁ τῶν Μυρέων φρουρός, καὶ πρόεδρος σεπτός, καὶ στῦλος ἀπερίτρεπτος. Χαίροις φωστὴρ παμφαέστατε, ὁ τὰ τοῦ κόσμου πέρατα, διαλάμπων τοῖς θαύμασι. Χαίροις τῶν θλιβομένων ἡ θεία χαρμοσύνη, καὶ ἀδικουμένων θερμότατος προστάτης, καὶ νῦν παμμάκαρ Νικόλαε, μὴ παύσῃ πρεσβεύων Χριστῷ τῷ Θεῷ, ὑπὲρ τῶν πίστει καὶ πόθῳ τιμώντων ἀεί, τὴν χαρμόσυνον καί πανέορτον μνήμην σου.
ltx/gr_gr_cog/me.m12.d06:meVE.Stichera01.greekmelody	@ltx/gr_gr_cog/he.a.m2:heAU.OteEkTouXylou.greekname
ltx/gr_gr_cog/me.m12.d06:meVE.Stichera01.incipit	Μύροις, παροικήσας αἰσθητῶς, μύρον ἀληθῶς…
ltx/gr_gr_cog/me.m12.d06:meVE.Stichera01.melody	@ltx/gr_gr_cog/he.a.m2:heAU.OteEkTouXylou.name
ltx/gr_gr_cog/me.m12.d06:meVE.Stichera01.mode	@ltx/gr_gr_cog/miscellanea:misc.Mode2
ltx/gr_gr_cog/me.m12.d06:meVE.Stichera01.text	Μύροις, παροικήσας αἰσθητῶς, μύρον ἀληθῶς ἀνεδείχθης, μύρῳ χρισθεὶς νοητῷ Ἅγιε Νικόλαε, Ἀρχιεράρχα Χριστοῦ, καὶ μυρίζεις τὰ πρόσωπα, τῶν πίστει καὶ πόθῳ, σοῦ τὴν παναοίδιμον, μνήμην τελούντων ἀεί, λύων συμφορῶν καὶ κινδύνων, τούτους καὶ τῶν θλίψεων Πάτερ, ἐν ταῖς πρὸς τὸν Κύριον πρεσβείαις σου.
ltx/gr_gr_cog/me.m12.d06:meVE.Stichera02.incipit	Νίκη, φερωνύμως ἀληθῶς, τοῦ πιστοῦ…
ltx/gr_gr_cog/me.m12.d06:meVE.Stichera02.melody	@ltx/gr_gr_cog/he.a.m2:heAU.OteEkTouXylou.name
ltx/gr_gr_cog/me.m12.d06:meVE.Stichera02.mode	@ltx/gr_gr_cog/miscellanea:misc.Mode2
ltx/gr_gr_cog/me.m12.d06:meVE.Stichera02.text	Νίκη, φερωνύμως ἀληθῶς, τοῦ πιστοῦ λαοῦ ἀνεδείχθης, ἐν πειρασμοῖς κραταιά, Ἅγιε Νικόλαε, θεράπων ὄντως Χριστοῦ· πανταχοῦ γὰρ καλούμενος, ὀξέως προφθάνεις, πόθῳ τοὺς προστρέχοντας, ὑπὸ τὴν σκέπην σου· σὺ γὰρ ἐν νυκτὶ καὶ ἡμέρᾳ, πίστει ὀπτανόμενος σῴζεις, ἐκ τῶν πειρασμῶν καὶ περιστασεων.
ltx/gr_gr_cog/me.m12.d06:meVE.Stichera03.incipit	Ὤφθης, Κωνσταντίνῳ Βασιλεῖ, σὺν τῷ…
ltx/gr_gr_cog/me.m12.d06:meVE.Stichera03.melody	@ltx/gr_gr_cog/he.a.m2:heAU.OteEkTouXylou.name
ltx/gr_gr_cog/me.m12.d06:meVE.Stichera03.mode	@ltx/gr_gr_cog/miscellanea:misc.Mode2
ltx/gr_gr_cog/me.m12.d06:meVE.Stichera03.text	Ὤφθης, Κωνσταντίνῳ Βασιλεῖ, σὺν τῷ Ἀβλαβίῳ κατʼ ὄναρ, καὶ τούτους φόβῳ βαλών, οὕτως αὐτοῖς εἴρηκας. Λύσατε δὴ ἐν σπουδῇ, τῆς εἱρκτῆς οὓς κατέχετε, δεσμίους ἀδίκως, ἀθώους τυγχάνοντας, τῆς παρανόμου σφαγῆς· ὅμως ἀλλʼ ἐὰν παρακούσῃς, ἔντευξιν ποιήσομαι Ἄναξ, κατὰ σοῦ πρὸς Κύριον δεόμενος.
ltx/gr_gr_cog/me.m12.d06:meVE.Stichera04.greekmelody	@ltx/gr_gr_cog/he.a.m2:heAU.OteEkTouXylou.greekname
ltx/gr_gr_cog/me.m12.d06:meVE.Stichera04.incipit	Μέγας, ἀντιλήπτωρ καὶ θερμός, τοῖς…
ltx/gr_gr_cog/me.m12.d06:meVE.Stichera04.melody	@ltx/gr_gr_cog/he.a.m2:heAU.OteEkTouXylou.name
ltx/gr_gr_cog/me.m12.d06:meVE.Stichera04.mode	@ltx/gr_gr_cog/miscellanea:misc.Mode2
ltx/gr_gr_cog/me.m12.d06:meVE.Stichera04.text	Μέγας, ἀντιλήπτωρ καὶ θερμός, τοῖς ἐν τοῖς κινδύνοις τελοῦσιν, ὑπάρχεις ἔνδοξε, Ἅγιε Νικόλαε, Ἱεροκήρυξ Χριστοῦ, τοῖς ἐν γῇ καὶ τοῖς πλέουσι, τοῖς πόῤῥω καὶ πέλας, οἷα συμπαθέστατος, καὶ πρεσβευτὴς κραταιός· ὅθεν συνελθόντες βοῶμεν· Πρέσβευε πρὸς Κύριον ὅπως, πάσης λυτρωθῶμεν περιστάσεως.
ltx/gr_gr_cog/me.m12.d06:meVE.Stichera05.incipit	Ποίοις εὐφημιῶν στέμμασιν, ἀναδήσωμεν τὸν…
ltx/gr_gr_cog/me.m12.d06:meVE.Stichera05.melody	@ltx/gr_gr_cog/he.a.m2:heAU.PoioisEffimionStemmasin.name
ltx/gr_gr_cog/me.m12.d06:meVE.Stichera05.mode	@ltx/gr_gr_cog/miscellanea:misc.Mode2
ltx/gr_gr_cog/me.m12.d06:meVE.Stichera05.text	Ποίοις εὐφημιῶν στέμμασιν, ἀναδήσωμεν τὸν Ἱεράρχην, τὸν σαρκὶ ἐν Μύροις ὑπάρχοντα, καὶ πνευματικῶς πᾶσι προφθάνοντα, τοῖς εἰλικρινῶς αὐτὸν ποθοῦσι, τὸ πάντων, τῶν θλιβομένων παραμύθιον, καὶ πάντων, τῶν ἐν κινδύνοις καταφύγιον, τῆς εὐσεβείας τὸν πύργον, τῶν πιστῶν τὸν πρόμαχον, τὸν διʼ οὗ ὀφρὺν δυσμενῶν, Χριστός καταβέβληκεν, ὁ ἔχων τὸ μέγα ἔλεος.
ltx/gr_gr_cog/me.m12.d06:meVE.Stichera06.incipit	Ποίοις μελῳδικοῖς ᾄσμασιν, ἐπαινέσωμεν τὸν…
ltx/gr_gr_cog/me.m12.d06:meVE.Stichera06.melody	@ltx/gr_gr_cog/he.a.m2:heAU.PoioisEffimionStemmasin.name
ltx/gr_gr_cog/me.m12.d06:meVE.Stichera06.mode	@ltx/gr_gr_cog/miscellanea:misc.Mode2
ltx/gr_gr_cog/me.m12.d06:meVE.Stichera06.text	Ποίοις μελῳδικοῖς ᾄσμασιν, ἐπαινέσωμεν τὸν Ἱεράρχην, τὸν τῆς ἀσεβείας ἀντίπαλον, καὶ τῆς εὐσεβείας ὑπέρμαχον, τὸν τῆς Ἐκκλησίας πρωτοστάτην, τὸν μέγαν, προασπιστήν τε καὶ διδάσκαλον, τὸν πάντας, τοὺς κακοδόξους καταισχύνοντα, τὸν ὀλετῆρα Ἀρείου, καὶ θερμὸν ἀντίμαχον, τὸν διʼ οὗ τὴν τούτου ὀφρύν, Χριστὸς καταβέβληκεν, ὁ ἔχων τὸ μέγα ἔλεος.
ltx/gr_gr_cog/me.m12.d06:meVE.Stichera07.incipit	Ποίοις προφητικοῖς ᾄσμασιν, ἐπαινέσωμεν τὸν…
ltx/gr_gr_cog/me.m12.d06:meVE.Stichera07.melody	@ltx/gr_gr_cog/he.a.m2:heAU.PoioisEffimionStemmasin.name
ltx/gr_gr_cog/me.m12.d06:meVE.Stichera07.mode	@ltx/gr_gr_cog/miscellanea:misc.Mode2
ltx/gr_gr_cog/me.m12.d06:meVE.Stichera07.text	Ποίοις προφητικοῖς ᾄσμασιν, ἐπαινέσωμεν τὸν Ἱεράρχην, τὸν τὰ πόῤῥω ὄντα προβλέποντα, καὶ ταῦτα σαφῶς προαγγέλλοντα, προθεσπίζοντά τε ὡς παρόντα, τὸν πᾶσαν, τὴν οἰκουμένην περιθέοντα, καὶ πάντας, ἀδικουμένους ἐκλυτρούμενον, τὸν ἐν ὀνείροις ὀφθέντα, Βασιλεῖ θεόφρονι, καὶ τοὺς πρὶν δεσμίους σφαγῆς, ἀδίκου ῥυσάμενον, τὸν πλουτοῦντα τὸ μέγα ἔλεος.
