ltx/gr_gr_cog/le.go.mc.d019:lemcLI.Gospel.book_abbr	@ltx/gr_gr_cog/bible:Luke.abbr
ltx/gr_gr_cog/le.go.mc.d019:lemcLI.Gospel.book_string	@ltx/gr_gr_cog/bible:Luke.text
ltx/gr_gr_cog/le.go.mc.d019:lemcLI.Gospel.chapverse	23:1 – 31, 33, 44 – 56
ltx/gr_gr_cog/le.go.mc.d019:lemcLI.Gospel.incipit	Ἤγαγον τὸν Ἰησοῦν οἱ ἀρχιερεῖς καὶ οἱ πρεσβύτεροι…
ltx/gr_gr_cog/le.go.mc.d019:lemcLI.Gospel.text	Τῷ καιρῷ ἐκείνῳ, ἤγαγον τὸν Ἰησοῦν οἱ ἀρχιερεῖς καὶ οἱ πρεσβύτεροι τοῦ λαοῦ ἐπὶ τὸν Πιλᾶτον. ἤρξαντο δὲ κατηγορεῖν αὐτοῦ λέγοντες· τοῦτον εὕρομεν διαστρέφοντα τὸ ἔθνος καὶ κωλύοντα Καίσαρι φόρους διδόναι, λέγοντα ἑαυτὸν Χριστὸν βασιλέα εἶναι. ὁ δὲ Πιλᾶτος ἐπηρώτησεν αὐτὸν λέγων· σὺ εἶ ὁ βασιλεὺς τῶν Ἰουδαίων; ὁ δὲ ἀποκριθεὶς αὐτῷ ἔφη· σὺ λέγεις. ὁ δὲ Πιλᾶτος εἶπε πρὸς τοὺς ἀρχιερεῖς καὶ τοὺς ὄχλους ὅτι οὐδὲν εὑρίσκω αἴτιον ἐν τῷ ἀνθρώπῳ τούτῳ. οἱ δὲ ἐπίσχυον λέγοντες ὅτι ἀνασείει τὸν λαὸν διδάσκων καθ᾿ ὅλης τῆς Ἰουδαίας, ἀρξάμενος ἀπὸ τῆς Γαλιλαίας ἕως ὧδε. Πιλᾶτος δὲ ἀκούσας Γαλιλαίαν ἐπηρώτησεν εἰ ὁ ἄνθρωπος Γαλιλαῖός ἐστι, καὶ ἐπιγνοὺς ὅτι ἐκ τῆς ἐξουσίας Ἡρῴδου ἐστίν, ἀνέπεμψεν αὐτὸν πρὸς Ἡρῴδην, ὄντα καὶ αὐτὸν ἐν Ἱεροσολύμοις ἐν ταύταις ταῖς ἡμέραις. ὁ δὲ Ἡρῴδης ἰδὼν τὸν Ἰησοῦν ἐχάρη λίαν· ἦν γὰρ ἐξ ἱκανοῦ θέλων ἰδεῖν αὐτὸν διὰ τὸ ἀκούειν αὐτὸν πολλὰ περὶ αὐτοῦ, καὶ ἤλπιζέ τι σημεῖον ἰδεῖν ὑπ᾿ αὐτοῦ γινόμενον. ἐπηρώτα δὲ αὐτὸν ἐν λόγοις ἱκανοῖς· αὐτὸς δὲ οὐδὲν ἀπεκρίνατο αὐτῷ. εἱστήκεισαν δὲ οἱ γραμματεῖς καὶ οἱ ἀρχιερεῖς εὐτόνως κατηγοροῦντες αὐτοῦ. ἐξουθενήσας δὲ αὐτὸν ὁ Ἡρῴδης σὺν τοῖς στρατεύμασιν αὐτοῦ καὶ ἐμπαίξας, περιβαλὼν αὐτὸν ἐσθῆτα λαμπρὰν ἀνέπεμψεν αὐτὸν τῷ Πιλάτῳ. ἐγένοντο δὲ φίλοι ὅ τε Ἡρῴδης καὶ ὁ Πιλᾶτος ἐν αὐτῇ τῇ ἡμέρᾳ μετ᾿ ἀλλήλων· προϋπῆρχον γὰρ ἐν ἔχθρᾳ ὄντες πρὸς ἑαυτούς. Πιλᾶτος δὲ συγκαλεσάμενος τοὺς ἀρχιερεῖς καὶ τοὺς ἄρχοντας καὶ τὸν λαὸν εἶπε πρὸς αὐτούς· προσηνέγκατέ μοι τὸν ἄνθρωπον τοῦτον ὡς ἀποστρέφοντα τὸν λαόν, καὶ ἰδοὺ ἐγὼ ἐνώπιον ὑμῶν ἀνακρίνας οὐδὲν εὗρον ἐν τῷ ἀνθρώπῳ τούτῳ αἴτιον ὧν κατηγορεῖτε κατ᾿ αὐτοῦ. ἀλλ᾿ οὐδὲ Ἡρῴδης· ἀνέπεμψα γὰρ ὑμᾶς πρὸς αὐτόν· καὶ ἰδοὺ οὐδὲν ἄξιον θανάτου ἐστὶ πεπραγμένον αὐτῷ. παιδεύσας οὖν αὐτὸν ἀπολύσω. ἀνάγκην δὲ εἶχεν ἀπολύειν αὐτοῖς κατὰ ἑορτὴν ἕνα. ἀνέκραξαν δὲ παμπληθεὶ λέγοντες· αἶρε τοῦτον, ἀπόλυσον δὲ ἡμῖν Βαραββᾶν· ὅστις ἦν διὰ στάσιν τινὰ γενομένην ἐν τῇ πόλει καὶ φόνον βεβλημένος εἰς τὴν φυλακήν. πάλιν οὖν ὁ Πιλᾶτος προσεφώνησε, θέλων ἀπολῦσαι τὸν Ἰησοῦν. οἱ δὲ ἐπεφώνουν λέγοντες· σταύρωσον σταύρωσον αὐτόν. ὁ δὲ τρίτον εἶπε πρὸς αὐτούς· τί γὰρ κακὸν ἐποίησεν οὗτος; οὐδὲν ἄξιον θανάτου εὗρον ἐν αὐτῷ· παιδεύσας οὖν αὐτὸν ἀπολύσω. οἱ δὲ ἐπέκειντο φωναῖς μεγάλαις αἰτούμενοι αὐτὸν σταυρωθῆναι, καὶ κατίσχυον αἱ φωναὶ αὐτῶν καὶ τῶν ἀρχιερέων. ὁ δὲ Πιλᾶτος ἐπέκρινε γενέσθαι τὸ αἴτημα αὐτῶν, ἀπέλυσε δὲ αὐτοῖς τὸν Βαραββᾶν τὸν διὰ στάσιν καὶ φόνον βεβλημένον εἰς τὴν φυλακήν, ὃν ᾐτοῦντο, τὸν δὲ Ἰησοῦν παρέδωκε τῷ θελήματι αὐτῶν. Καὶ ὡς ἀπήγαγον αὐτόν, ἐπιλαβόμενοι Σίμωνός τινος Κυρηναίου, ἐρχομένου ἀπ᾿ ἀγροῦ, ἐπέθηκαν αὐτῷ τὸν σταυρὸν φέρειν ὀπίσω τοῦ Ἰησοῦ. ἠκολούθει δὲ αὐτῷ πολὺ πλῆθος τοῦ λαοῦ καὶ γυναικῶν, αἳ καὶ ἐκόπτοντο καὶ ἐθρήνουν αὐτόν. στραφεὶς δὲ πρὸς αὐτὰς ὁ Ἰησοῦς εἶπε· θυγατέρες Ἱερουσαλήμ, μὴ κλαίετε ἐπ᾿ ἐμέ, πλὴν ἐφ᾿ ἑαυτὰς κλαίετε καὶ ἐπὶ τὰ τέκνα ὑμῶν. ὅτι ἰδοὺ ἔρχονται ἡμέραι ἐν αἷς ἐροῦσι· μακάριαι αἱ στεῖραι καὶ κοιλίαι αἳ οὐκ ἐγέννησαν, καὶ μαστοὶ οἳ οὐκ ἐθήλασαν. τότε ἄρξονται λέγειν τοῖς ὄρεσι, πέσετε ἐφ᾿ ἡμᾶς, καὶ τοῖς βουνοῖς, καλύψατε ἡμᾶς· ὅτι εἰ ἐν τῷ ὑγρῷ ξύλῳ ταῦτα ποιοῦσιν, ἐν τῷ ξηρῷ τί γένηται; Καὶ ὅτε ἀπῆλθον ἐπὶ τὸν τόπον τὸν καλούμενον Κρανίον, ἐκεῖ ἐσταύρωσαν αὐτόν. Ἦν δὲ ὡσεὶ ὥρα ἕκτη καὶ σκότος ἐγένετο ἐφ᾿ ὅλην τὴν γῆν ἕως ὥρας ἐνάτης, τοῦ ἡλίου ἐκλείποντος, καὶ ἐσχίσθη τὸ καταπέτασμα τοῦ ναοῦ μέσον· καὶ φωνήσας φωνῇ μεγάλῃ ὁ Ἰησοῦς εἶπε· πάτερ, εἰς χεῖράς σου παρατίθεμαι τὸ πνεῦμά μου· καὶ ταῦτα εἰπὼν ἐξέπνευσεν. ἰδὼν δὲ ὁ ἑκατόνταρχος τὸ γενόμενον ἐδόξασε τὸν Θεὸν λέγων· ὄντως ὁ ἄνθρωπος οὗτος δίκαιος ἦν. καὶ πάντες οἱ συμπαραγενόμενοι ὄχλοι ἐπὶ τὴν θεωρίαν ταύτην, θεωροῦντες τὰ γενόμενα, τύπτοντες ἑαυτῶν τὰ στήθη ὑπέστρεφον. εἱστήκεισαν δὲ πάντες οἱ γνωστοὶ αὐτοῦ ἀπὸ μακρόθεν, καὶ γυναῖκες αἱ συνακολουθήσασαι αὐτῷ ἀπὸ τῆς Γαλιλαίας, ὁρῶσαι ταῦτα. Καὶ ἰδοὺ ἀνὴρ ὀνόματι Ἰωσήφ, βουλευτὴς ὑπάρχων καὶ ἀνὴρ ἀγαθὸς καὶ δίκαιος — οὗτος οὐκ ἦν συγκατατεθειμένος τῇ βουλῇ καὶ τῇ πράξει αὐτῶν — ἀπὸ Ἀριμαθαίας πόλεως τῶν Ἰουδαίων, ὃς προσεδέχετο καὶ αὐτὸς τὴν βασιλείαν τοῦ Θεοῦ, οὗτος προσελθὼν τῷ Πιλάτῳ ᾐτήσατο τὸ σῶμα τοῦ Ἰησοῦ, καὶ καθελὼν αὐτὸ ἐνετύλιξε σινδόνι καὶ ἔθηκεν αὐτὸ ἐν μνήματι λαξευτῷ, οὗ οὐκ ἦν οὐδεὶς οὐδέπω κείμενος· καὶ ἡμέρα ἦν παρασκευή, σάββατον ἐπέφωσκε. Κατακολουθήσασαι δὲ αἱ γυναῖκες, αἵτινες ἦσαν συνεληλυθυῖαι αὐτῷ ἐκ τῆς Γαλιλαίας, ἐθεάσαντο τὸ μνημεῖον καὶ ὡς ἐτέθη τὸ σῶμα αὐτοῦ, ὑποστρέψασαι δὲ ἡτοίμασαν ἀρώματα καὶ μύρα. καὶ τὸ μὲν σάββατον ἡσύχασαν κατὰ τὴν ἐντολήν.
ltx/gr_gr_cog/le.go.mc.d019:lemcLI.Gospel.title	Τῇ Πέμπτῃ τῆς Τυροφάγου
ltx/gr_gr_cog/le.go.mc.d019:lemcLI.Gospel.title_abbr	Πέμπτῃ τῆς Τυροφάγου
ltx/gr_gr_cog/le.go.mc.d019:lemcLI.Gospel.version	@ltx/gr_gr_cog/properties:version.designation
