ltx/gr_gr_cog/le.go.mc.d115:lemcLI.Gospel.book_abbr	@ltx/gr_gr_cog/bible:John.abbr
ltx/gr_gr_cog/le.go.mc.d115:lemcLI.Gospel.book_string	@ltx/gr_gr_cog/bible:John.text
ltx/gr_gr_cog/le.go.mc.d115:lemcLI.Gospel.chapverse	16:2 – 13
ltx/gr_gr_cog/le.go.mc.d115:lemcLI.Gospel.incipit	Ἔρχεται ὥρα ἵνα πᾶς ὁ ἀποκτείνας ὑμᾶς…
ltx/gr_gr_cog/le.go.mc.d115:lemcLI.Gospel.text	Εἶπεν ὁ Κύριος τοῖς ἑαυτοῦ μαθηταῖς· ἔρχεται ὥρα ἵνα πᾶς ὁ ἀποκτείνας ὑμᾶς δόξῃ λατρείαν προσφέρειν τῷ Θεῷ. καὶ ταῦτα ποιήσουσιν, ὅτι οὐκ ἔγνωσαν τὸν πατέρα οὐδὲ ἐμέ. ἀλλὰ ταῦτα λελάληκα ὑμῖν ἵνα ὅταν ἔλθῃ ἡ ὥρα, μνημονεύητε αὐτῶν ὅτι ἐγὼ εἶπον ὑμῖν. ταῦτα δὲ ὑμῖν ἐξ ἀρχῆς οὐκ εἶπον, ὅτι μεθ᾽ ὑμῶν ἤμην. Νῦν δὲ ὑπάγω πρὸς τὸν πέμψαντά με, καὶ οὐδεὶς ἐξ ὑμῶν ἐρωτᾷ με ποῦ ὑπάγεις! ἀλλ᾽ ὅτι ταῦτα λελάληκα ὑμῖν, ἡ λύπη πεπλήρωκεν ὑμῶν τὴν καρδίαν. ἀλλ᾽ ἐγὼ τὴν ἀλήθειαν λέγω ὑμῖν· συμφέρει ὑμῖν ἵνα ἐγὼ ἀπέλθω. ἐὰν γὰρ ἐγὼ μὴ ἀπέλθω, ὁ παράκλητος οὐκ ἐλεύσεται πρὸς ὑμᾶς· ἐὰν δὲ πορευθῶ, πέμψω αὐτὸν πρὸς ὑμᾶς· καὶ ἐλθὼν ἐκεῖνος ἐλέγξει τὸν κόσμον περὶ ἁμαρτίας καὶ περὶ δικαιοσύνης καὶ περὶ κρίσεως. περὶ ἁμαρτίας μέν, ὅτι οὐ πιστεύουσιν εἰς ἐμέ· περὶ δικαιοσύνης δέ, ὅτι πρὸς τὸν πατέρα μου ὑπάγω καὶ οὐκέτι θεωρεῖτέ με· περὶ δὲ κρίσεως, ὅτι ὁ ἄρχων τοῦ κόσμου τούτου κέκριται. Ἔτι πολλὰ ἔχω λέγειν ὑμῖν, ἀλλ᾽ οὐ δύνασθε βαστάζειν ἄρτι. ὅταν δὲ ἔλθῃ ἐκεῖνος, τὸ Πνεῦμα τῆς ἀληθείας, ὁδηγήσει ὑμᾶς εἰς πᾶσαν τὴν ἀλήθειαν
ltx/gr_gr_cog/le.go.mc.d115:lemcLI.Gospel.title	Τῇ Τρίτῃ τῆς Ζʹ Ἑβδομάδος
ltx/gr_gr_cog/le.go.mc.d115:lemcLI.Gospel.title_abbr	Τρίτῃ τῆς Ζʹ Ἑβδομάδος
ltx/gr_gr_cog/le.go.mc.d115:lemcLI.Gospel.version	@ltx/gr_gr_cog/properties:version.designation
