ltx/gr_gr_cog/le.ep.mc.d191:lemcLI.Epistle.book_abbr	@ltx/gr_gr_cog/bible:Corinthians2.abbr
ltx/gr_gr_cog/le.ep.mc.d191:lemcLI.Epistle.book_string	@ltx/gr_gr_cog/bible:Corinthians2.text
ltx/gr_gr_cog/le.ep.mc.d191:lemcLI.Epistle.chapverse	2:3 – 15
ltx/gr_gr_cog/le.ep.mc.d191:lemcLI.Epistle.incipit	Ἡ ἐμὴ χαρὰ πάντων ὑμῶν ἐστιν…
ltx/gr_gr_cog/le.ep.mc.d191:lemcLI.Epistle.text	Ἀδελφοί, ἡ ἐμὴ χαρὰ πάντων ὑμῶν ἐστιν. ἐκ γὰρ πολλῆς θλίψεως καὶ συνοχῆς καρδίας ἔγραψα ὑμῖν διὰ πολλῶν δακρύων, οὐχ ἵνα λυπηθῆτε, ἀλλὰ τὴν ἀγάπην ἵνα γνῶτε ἣν ἔχω περισσοτέρως εἰς ὑμᾶς. Εἰ δέ τις λελύπηκεν, οὐκ ἐμὲ λελύπηκεν, ἀλλά, ἀπὸ μέρους ἵνα μὴ ἐπιβαρῶ, πάντας ὑμᾶς. ἱκανὸν τῷ τοιούτῳ ἡ ἐπιτιμία αὕτη ἡ ὑπὸ τῶν πλειόνων· ὥστε τοὐναντίον μᾶλλον ὑμᾶς χαρίσασθαι καὶ παρακαλέσαι, μήπως τῇ περισσοτέρᾳ λύπῃ καταποθῇ ὁ τοιοῦτος. διὸ παρακαλῶ ὑμᾶς κυρῶσαι εἰς αὐτὸν ἀγάπην. εἰς τοῦτο γὰρ καὶ ἔγραψα, ἵνα γνῶ τὴν δοκιμὴν ὑμῶν, εἰ εἰς πάντα ὑπήκοοί ἐστε. ᾧ δέ τι χαρίζεσθε, καὶ ἐγώ· καὶ γὰρ ἐγὼ εἴ τι κεχάρισμαι ᾧ κεχάρισμαι, δι᾿ ὑμᾶς ἐν προσώπῳ Χριστοῦ, ἵνα μὴ πλεονεκτηθῶμεν ὑπὸ τοῦ σατανᾶ· οὐ γὰρ αὐτοῦ τὰ νοήματα ἀγνοοῦμεν. Ἐλθὼν δὲ εἰς τὴν Τρῳάδα εἰς τὸ εὐαγγέλιον τοῦ Χριστοῦ, καὶ θύρας μοι ἀνεῳγμένης ἐν Κυρίῳ, οὐκ ἔσχηκα ἄνεσιν τῷ πνεύματί μου τῷ μὴ εὑρεῖν με Τίτον τὸν ἀδελφόν μου, ἀλλὰ ἀποταξάμενος αὐτοῖς ἐξῆλθον εἰς Μακεδονίαν. Τῷ δὲ Θεῷ χάρις τῷ πάντοτε θριαμβεύοντι ἡμᾶς ἐν τῷ Χριστῷ καὶ τὴν ὀσμὴν τῆς γνώσεως αὐτοῦ φανεροῦντι δι᾿ ἡμῶν ἐν παντὶ τόπῳ· ὅτι Χριστοῦ εὐωδία ἐσμὲν τῷ Θεῷ ἐν τοῖς σῳζομένοις καὶ ἐν τοῖς ἀπολλυμένοις.
ltx/gr_gr_cog/le.ep.mc.d191:lemcLI.Epistle.title	Τῇ Δευτέρᾳ τῆς ΙΑʹ Ἑβδομάδος
ltx/gr_gr_cog/le.ep.mc.d191:lemcLI.Epistle.title_abbr	Δευτέρᾳ τῆς ΙΑʹ Ἑβδομάδος
ltx/gr_gr_cog/le.ep.mc.d191:lemcLI.Epistle.version	@ltx/gr_gr_cog/properties:version.designation
