ltx/gr_gr_cog/le.ep.mc.d128:lemcLI.Epistle.book_abbr	@ltx/gr_gr_cog/bible:Romans.abbr
ltx/gr_gr_cog/le.ep.mc.d128:lemcLI.Epistle.book_string	@ltx/gr_gr_cog/bible:Romans.text
ltx/gr_gr_cog/le.ep.mc.d128:lemcLI.Epistle.chapverse	2:28 – 29; 3:1 – 18
ltx/gr_gr_cog/le.ep.mc.d128:lemcLI.Epistle.incipit	Οὐχ ὁ ἐν τῷ φανερῷ Ἰουδαῖός ἐστιν…
ltx/gr_gr_cog/le.ep.mc.d128:lemcLI.Epistle.text	Ἀδελφοί, οὐχ ὁ ἐν τῷ φανερῷ Ἰουδαῖός ἐστιν, οὐδὲ ἡ ἐν τῷ φανερῷ ἐν σαρκὶ περιτομή, ἀλλ᾿ ὁ ἐν τῷ κρυπτῷ Ἰουδαῖος, καὶ περιτομὴ καρδίας ἐν πνεύματι, οὐ γράμματι, οὗ ὁ ἔπαινος οὐκ ἐξ ἀνθρώπων, ἀλλ᾿ ἐκ τοῦ Θεοῦ. Τί οὖν τὸ περισσὸν τοῦ Ἰουδαίου, ἢ τίς ἡ ὠφέλεια τῆς περιτομῆς; πολὺ κατὰ πάντα τρόπον. πρῶτον μὲν γὰρ ὅτι ἐπιστεύθησαν τὰ λόγια τοῦ Θεοῦ. τί γὰρ εἰ ἠπίστησάν τινες; μὴ ἡ ἀπιστία αὐτῶν τὴν πίστιν τοῦ Θεοῦ καταργήσει; μὴ γένοιτο· γινέσθω δὲ ὁ Θεὸς ἀληθής, πᾶς δὲ ἄνθρωπος ψεύστης, καθὼς γέγραπται· ὅπως ἂν δικαιωθῇς ἐν τοῖς λόγοις σου καὶ νικήσῃς ἐν τῷ κρίνεσθαί σε. εἰ δὲ ἡ ἀδικία ἡμῶν Θεοῦ δικαιοσύνην συνίστησι, τί ἐροῦμεν; μὴ ἄδικος ὁ Θεὸς ὁ ἐπιφέρων τὴν ὀργήν; κατὰ ἄνθρωπον λέγω. μὴ γένοιτο· ἐπεὶ πῶς κρινεῖ ὁ Θεὸς τὸν κόσμον; εἰ γὰρ ἡ ἀλήθεια τοῦ Θεοῦ ἐν τῷ ἐμῷ ψεύσματι ἐπερίσσευσεν εἰς τὴν δόξαν αὐτοῦ, τί ἔτι κἀγὼ ὡς ἁμαρτωλὸς κρίνομαι, καὶ μὴ καθὼς βλασφημούμεθα καὶ καθὼς φασί τινες ἡμᾶς λέγειν ὅτι ποιήσωμεν τὰ κακὰ ἵνα ἔλθῃ τὰ ἀγαθά; ὧν τὸ κρῖμα ἔνδικόν ἐστι. Τί οὖν; προεχόμεθα; οὐ πάντως· προῃτιασάμεθα γὰρ Ἰουδαίους τε καὶ Ἕλληνας πάντας ὑφ᾿ ἁμαρτίαν εἶναι, καθὼς γέγραπται ὅτι οὐκ ἔστι δίκαιος οὐδὲ εἷς, οὐκ ἔστιν ὁ συνιῶν, οὐκ ἔστιν ὁ ἐκζητῶν τὸν Θεόν· πάντες ἐξέκλιναν, ἅμα ἠχρειώθησαν· οὐκ ἔστι ποιῶν χρηστότητα, οὐκ ἔστιν ἕως ἑνός. τάφος ἀνεῳγμένος ὁ λάρυγξ αὐτῶν, ταῖς γλώσσαις αὐτῶν ἐδολιοῦσαν, ἰὸς ἀσπίδων ὑπὸ τὰ χείλη αὐτῶν· ὧν τὸ στόμα ἀρᾶς καὶ πικρίας γέμει· ὀξεῖς οἱ πόδες αὐτῶν ἐκχέαι αἷμα, σύντριμμα καὶ ταλαιπωρία ἐν ταῖς ὁδοῖς αὐτῶν, καὶ ὁδὸν εἰρήνης οὐκ ἔγνωσαν. οὐκ ἔστι φόβος Θεοῦ ἀπέναντι τῶν ὀφθαλμῶν αὐτῶν.
ltx/gr_gr_cog/le.ep.mc.d128:lemcLI.Epistle.title	Τῇ Δευτέρᾳ τῆς Βʹ Ἑβδομάδος
ltx/gr_gr_cog/le.ep.mc.d128:lemcLI.Epistle.title_abbr	Δευτέρᾳ τῆς Βʹ Ἑβδομάδος
ltx/gr_gr_cog/le.ep.mc.d128:lemcLI.Epistle.version	@ltx/gr_gr_cog/properties:version.designation
