ltx/gr_gr_cog/me.m12.d05:meDA.commemoration.first	Μνήμη τοῦ Ὀσiου Σάββα τοῦ Ἡγιασμένου
ltx/gr_gr_cog/me.m12.d05:meDA.commemoration.first_name	
ltx/gr_gr_cog/me.m12.d05:meDA.commemoration.first_short	Μνήμη τοῦ Ὀσiου Σάββα τοῦ Ἡγιασμένου
ltx/gr_gr_cog/me.m12.d05:meDA.commemoration.first_title	@ltx/gr_gr_cog/titles:ti.SaintM
ltx/gr_gr_cog/me.m12.d05:meDA.commemoration.full	Μνήμη τοῦ Ὀσiου καὶ Θεοφόρου Πατρὸς ἡμῶν Σάββα τοῦ Ἡγιασμένου
ltx/gr_gr_cog/me.m12.d05:meDA.commemoration.second_name	
ltx/gr_gr_cog/me.m12.d05:meDA.commemoration.second_title	
ltx/gr_gr_cog/me.m12.d05:meDA.date	Τῌ Εʹ ΔΕΚΕΜΒΡΙΟΥ
ltx/gr_gr_cog/me.m12.d05:meDA.fordate	διὰ τὴν 5ην Δεκεμβρίου
ltx/gr_gr_cog/me.m12.d05:meDA.insert1	καὶ τοῦ Ὀσiου καὶ θεοφόρου Πατρὸς ἡμῶν Σάββα τοῦ Ἡγιασμένου,
ltx/gr_gr_cog/me.m12.d05:meDA.insert2	οὗ καὶ τὴν μνήμην ἐπιτελοῦμεν·
ltx/gr_gr_cog/me.m12.d05:meDA.note	
ltx/gr_gr_cog/me.m12.d05:meDA.pdfcoverdate	τῆς 5ης Δεκεμβρίου,
ltx/gr_gr_cog/me.m12.d05:meDA.pdfheaderdate	τῆς 5ης Δεκεμβρίου
ltx/gr_gr_cog/me.m12.d05:meHO.commemorations	
ltx/gr_gr_cog/me.m12.d05:meHO.note1	
ltx/gr_gr_cog/me.m12.d05:meHO.note2	
ltx/gr_gr_cog/me.m12.d05:meHO.number	
ltx/gr_gr_cog/me.m12.d05:meHO.rank	
ltx/gr_gr_cog/me.m12.d05:meLE.commemoration1	Μνήμη τοῦ Ὀσiου καὶ Θεοφόρου Πατρὸς ἡμῶν Σάββα τοῦ Ἡγιασμένου.
ltx/gr_gr_cog/me.m12.d05:meLE.commemoration2	
ltx/gr_gr_cog/me.m12.d05:meLI.Kontakion1.greekmelody	@ltx/gr_gr_cog/me.m12.d05:meMA.Kontakion1.greekmelody
ltx/gr_gr_cog/me.m12.d05:meLI.Kontakion1.incipit	@ltx/gr_gr_cog/me.m12.d05:meMA.Kontakion1.incipit
ltx/gr_gr_cog/me.m12.d05:meLI.Kontakion1.melody	@ltx/gr_gr_cog/me.m12.d05:meMA.Kontakion1.melody
ltx/gr_gr_cog/me.m12.d05:meLI.Kontakion1.mode	@ltx/gr_gr_cog/me.m12.d05:meMA.Kontakion1.mode
ltx/gr_gr_cog/me.m12.d05:meLI.Kontakion1.text	@ltx/gr_gr_cog/me.m12.d05:meMA.Kontakion1.text
ltx/gr_gr_cog/me.m12.d05:meLI.MM.CommunionHymn.text	@ltx/gr_gr_cog/properties:media.key
ltx/gr_gr_cog/me.m12.d05:meLI.Megalynarion.text	Ὤφθης ὑποτύπωσις καὶ κανών, θεοφόρε Σάββα, ὡς τοῦ Πνεύματος θησαυρός, Ὁσίων Πατέρων, ῥυθμίζων καὶ ἰθύνων, πρὸς κλῆρον ἀφθαρσίας τοὺς πειθομένους σοι.
ltx/gr_gr_cog/me.m12.d05:meMA.C1.acrostic.notice1	οὗ ἡ Ἀκροστιχίς·
ltx/gr_gr_cog/me.m12.d05:meMA.C1.acrostic.notice2	Γράφεται τό, Σ ά β α ν ἐνταῦθα διʼ ἑνὸς β, οὐχ ὡς ἁμάρτημα, ἀλλὰ διὰ τὸ μέτρον τοῦ στίχου· ὅρα καὶ τὰ ἐφεξῆς τῆ Ἀκροστιχίδος Τροπάρια.
ltx/gr_gr_cog/me.m12.d05:meMA.C1.acrostic.text	Τον Πανάριστον ἐν Ἀσκηταῖς Σάβαν ἔξοχα μέλπω.
ltx/gr_gr_cog/me.m12.d05:meMA.C1.acrostic.title	Κανὼν τοῦ Ἁγίου,
ltx/gr_gr_cog/me.m12.d05:meMA.C1.poet	@ltx/gr_gr_cog/poets:po.Theofanous
ltx/gr_gr_cog/me.m12.d05:meMA.C1.title	@ltx/gr_gr_cog/titles:ti.CanonDevoutM
ltx/gr_gr_cog/me.m12.d05:meMA.C1.verse	@ltx/gr_gr_cog/prayers:pr.verse_DevoutMan.text
ltx/gr_gr_cog/me.m12.d05:meMA.ExapTheotokion.incipit	@ltx/gr_gr_cog/ho.ho23:hoCA.Exaposteilarion4.incipit
ltx/gr_gr_cog/me.m12.d05:meMA.ExapTheotokion.melody	@ltx/gr_gr_cog/he.a.m3:heAU.FosAnalloioton.name
ltx/gr_gr_cog/me.m12.d05:meMA.ExapTheotokion.mode	@ltx/gr_gr_cog/miscellanea:misc.Mode3
ltx/gr_gr_cog/me.m12.d05:meMA.ExapTheotokion.text	@ltx/gr_gr_cog/ho.ho23:hoCA.Exaposteilarion4.text
ltx/gr_gr_cog/me.m12.d05:meMA.Exaposteilarion1.greekmelody	@ltx/gr_gr_cog/he.a.m3:heAU.EnPnevmatiToIero.greekname
ltx/gr_gr_cog/me.m12.d05:meMA.Exaposteilarion1.incipit	Τὴν ἔρημον ἐπόλισας, τρόποις ἐν…
ltx/gr_gr_cog/me.m12.d05:meMA.Exaposteilarion1.melody	@ltx/gr_gr_cog/he.a.m3:heAU.EnPnevmatiToIero.name
ltx/gr_gr_cog/me.m12.d05:meMA.Exaposteilarion1.mode	@ltx/gr_gr_cog/miscellanea:misc.Mode3
ltx/gr_gr_cog/me.m12.d05:meMA.Exaposteilarion1.text	Τὴν ἔρημον ἐπόλισας, τρόποις ἐν φιλοσόφοις, Πατέρων τὸ ἀγλάϊσμα, Σάββα Πάτερ θεόφρον, καὶ ταύτην ἀπετέλεσας, νοητὸν Παράδεισον, κομῶσαν ἄνθεσι θείοις, μονοτρόπων τῷ πλήθει, τῶν ἀξίως τελούντων, τὴν σὴν σεβάσμιον μνήμην.
ltx/gr_gr_cog/me.m12.d05:meMA.Exaposteilarion2.greekmelody	@ltx/gr_gr_cog/he.a.m3:heAU.FosAnalloioton.greekname
ltx/gr_gr_cog/me.m12.d05:meMA.Exaposteilarion2.incipit	Ἡ ἔρημος εὐφραινέσθω, καὶ ἐξανθείτω…
ltx/gr_gr_cog/me.m12.d05:meMA.Exaposteilarion2.melody	@ltx/gr_gr_cog/he.a.m3:heAU.FosAnalloioton.name
ltx/gr_gr_cog/me.m12.d05:meMA.Exaposteilarion2.mode	@ltx/gr_gr_cog/miscellanea:misc.Mode3
ltx/gr_gr_cog/me.m12.d05:meMA.Exaposteilarion2.text	Ἡ ἔρημος εὐφραινέσθω, καὶ ἐξανθείτω ὡς κρίνον, ὅτι ἐπλήθυνας ταύτης, τὰ τέκνα Σάββα θεόφρον, ἡ χώρα τοῦ Ἰορδάνου, ἀγαλλιάσθω νῦν χαρμοσύνως, ἐπὶ τῇ θείᾳ σου μνήμῃ.
ltx/gr_gr_cog/me.m12.d05:meMA.Kathisma11.greekmelody	@ltx/gr_gr_cog/he.a.m1:heAU.TonTafonSouSotir.greekname
ltx/gr_gr_cog/me.m12.d05:meMA.Kathisma11.incipit	Τὸν βίον εὐσεβῶς, ἐπὶ τῆς…
ltx/gr_gr_cog/me.m12.d05:meMA.Kathisma11.melody	@ltx/gr_gr_cog/he.a.m1:heAU.TonTafonSouSotir.name
ltx/gr_gr_cog/me.m12.d05:meMA.Kathisma11.mode	@ltx/gr_gr_cog/miscellanea:misc.Mode1
ltx/gr_gr_cog/me.m12.d05:meMA.Kathisma11.text	Τὸν βίον εὐσεβῶς, ἐπὶ τῆς γῆς ἐκτελέσας, δοχεῖον καθαρόν, σὺ τοῦ Πνεύματος ὤφθης, φωτίζων τοὺς ἐν πίστει σοι, προσιόντας Μακάριε· ὅθεν αἴτησαι, τὸν σόν Δεσπότην φωτίσαι, τὰς ψυχὰς ἡμῶν, τῶν ἀνυμνούντων σε Σάββα, θεόφρον Πατὴρ ἡμῶν.
ltx/gr_gr_cog/me.m12.d05:meMA.Kathisma1T.incipit	@ltx/gr_gr_cog/oc.m1.d1:ocMA.Kathisma13.incipit
ltx/gr_gr_cog/me.m12.d05:meMA.Kathisma1T.melody	@ltx/gr_gr_cog/he.a.m1:heAU.TonTafonSouSotir.name
ltx/gr_gr_cog/me.m12.d05:meMA.Kathisma1T.mode	@ltx/gr_gr_cog/miscellanea:misc.Mode1
ltx/gr_gr_cog/me.m12.d05:meMA.Kathisma1T.text	@ltx/gr_gr_cog/oc.m1.d1:ocMA.Kathisma13.text
ltx/gr_gr_cog/me.m12.d05:meMA.Kathisma21.greekmelody	@ltx/gr_gr_cog/he.a.m8:heAU.TinSofianKaiLogon.greekname
ltx/gr_gr_cog/me.m12.d05:meMA.Kathisma21.incipit	Τὸν Σταυρὸν τοῦ Κυρίου ἄρας…
ltx/gr_gr_cog/me.m12.d05:meMA.Kathisma21.melody	@ltx/gr_gr_cog/he.a.m8:heAU.TinSofianKaiLogon.name
ltx/gr_gr_cog/me.m12.d05:meMA.Kathisma21.mode	@ltx/gr_gr_cog/miscellanea:misc.Mode8
ltx/gr_gr_cog/me.m12.d05:meMA.Kathisma21.text	Τὸν Σταυρὸν τοῦ Κυρίου ἄρας Σοφέ, καὶ αὐτῷ μέχρι τέλους ἀκολουθῶν, τὸν νοῦν οὐχ ὑπέστρεψας, ἐν τῷ κόσμῳ θεόσοφε, ἐγκρατείᾳ καὶ πόνοις, τὰ πάθη ἐνέκρωσας, καὶ ναὸν ἡτοίμασας, σαυτὸν τῷ Κυρίῳ σου· ὅθεν χαρισμάτων, ἀμοιβὴν ἐκομίσω, ἰᾶσθαι νοσήματα, καὶ διώκειν τὰ πνεύματα, θεοφόρε μακάριε. Πρέσβευε Χριστῷ τῷ Θεῷ, τῶν πταισμάτων ἄφεσιν δωρήσασθαι, τοῖς ἑορτάζουσι πόθῳ, τὴν ἁγίαν μνήμην σου.
ltx/gr_gr_cog/me.m12.d05:meMA.Kathisma2T.incipit	@ltx/gr_gr_cog/he.a.m8:heAU.TinSofianKaiLogon.incipit
ltx/gr_gr_cog/me.m12.d05:meMA.Kathisma2T.melody	@ltx/gr_gr_cog/he.a.m8:heAU.TinSofianKaiLogon.melody
ltx/gr_gr_cog/me.m12.d05:meMA.Kathisma2T.mode	@ltx/gr_gr_cog/miscellanea:misc.Mode8
ltx/gr_gr_cog/me.m12.d05:meMA.Kathisma2T.text	@ltx/gr_gr_cog/he.a.m8:heAU.TinSofianKaiLogon.text
ltx/gr_gr_cog/me.m12.d05:meMA.Kathisma31.greekmelody	@ltx/gr_gr_cog/he.a.m8:heAU.TinSofianKaiLogon.greekname
ltx/gr_gr_cog/me.m12.d05:meMA.Kathisma31.incipit	Τὰ ἐπίγεια πάντα καταλιπών, καὶ…
ltx/gr_gr_cog/me.m12.d05:meMA.Kathisma31.melody	@ltx/gr_gr_cog/he.a.m8:heAU.TinSofianKaiLogon.name
ltx/gr_gr_cog/me.m12.d05:meMA.Kathisma31.mode	@ltx/gr_gr_cog/miscellanea:misc.Mode8
ltx/gr_gr_cog/me.m12.d05:meMA.Kathisma31.text	Τὰ ἐπίγεια πάντα καταλιπών, καὶ ἐν κόσμῳ ὑπάρχων σωματικῶς, τῷ πνεύματι γέγονας, τῶν Ἀγγέλων συμμέτοχος· τὰ γὰρ παρόντα πάθη νεκρώσας τοῦ σώματος, τῆς Τριάδος ἐδείχθης θεράπων Μακάριε. Ὅθεν καὶ νοσούντων, θεραπεύεις τὰ πάθη, καὶ λόγῳ τὰ πνεύματα, ἀπελαύνεις τῇ χάριτι, θεοφόρε Πατὴρ ἡμῶν. Πρέσβευε Χριστῷ τῷ Θεῷ, τῶν πταισμάτων ἄφεσιν δωρήσασθαι, τοῖς ἑορτάζουσι πόθῳ, τὴν ἁγίαν μνήμην σου.
ltx/gr_gr_cog/me.m12.d05:meMA.Kathisma3T.incipit	@ltx/gr_gr_cog/me.m11.d16:meMA.Ode3KathismaT.incipit
ltx/gr_gr_cog/me.m12.d05:meMA.Kathisma3T.melody	@ltx/gr_gr_cog/he.a.m8:heAU.TinSofianKaiLogon.name
ltx/gr_gr_cog/me.m12.d05:meMA.Kathisma3T.mode	@ltx/gr_gr_cog/miscellanea:misc.Mode8
ltx/gr_gr_cog/me.m12.d05:meMA.Kathisma3T.text	@ltx/gr_gr_cog/me.m11.d16:meMA.Ode3KathismaT.text
ltx/gr_gr_cog/me.m12.d05:meMA.Kontakion1.greekmelody	@ltx/gr_gr_cog/he.a.m8:heAU.TiYpermacho.greekname
ltx/gr_gr_cog/me.m12.d05:meMA.Kontakion1.incipit	Ὡς ἀπὸ βρέφους τῷ Θεῷ…
ltx/gr_gr_cog/me.m12.d05:meMA.Kontakion1.melody	@ltx/gr_gr_cog/he.a.m8:heAU.TiYpermacho.name
ltx/gr_gr_cog/me.m12.d05:meMA.Kontakion1.mode	@ltx/gr_gr_cog/miscellanea:misc.Mode8
ltx/gr_gr_cog/me.m12.d05:meMA.Kontakion1.text	Ὡς ἀπὸ βρέφους τῷ Θεῷ θυσία ἄμωμος, προσενεχθεὶς διʼ ἀρετῆς, Σάββα μακάριε, τῷ σὲ πρὶν γεννηθῆναι ἐπισταμένῳ, ἐχρημάτισας Ὁσίων ἐγκαλλώπισμα, πολιστὴς τε τῆς ἐρήμου ἀξιέπαινος, διὸ κράζω σοι· Χαίροις Πάτερ ἀοίδιμε.
ltx/gr_gr_cog/me.m12.d05:meMA.Lauds1.greekmelody	@ltx/gr_gr_cog/he.a.m1:heAU.TonOuranionTagmaton.greekname
ltx/gr_gr_cog/me.m12.d05:meMA.Lauds1.incipit	Ὁ ὑπερόπτης τῶν κάτω, καὶ…
ltx/gr_gr_cog/me.m12.d05:meMA.Lauds1.melody	@ltx/gr_gr_cog/he.a.m1:heAU.TonOuranionTagmaton.name
ltx/gr_gr_cog/me.m12.d05:meMA.Lauds1.mode	@ltx/gr_gr_cog/miscellanea:misc.Mode1
ltx/gr_gr_cog/me.m12.d05:meMA.Lauds1.text	Ὁ ὑπερόπτης τῶν κάτω, καὶ παρεπίδημος, ὁ ἐραστὴς τῶν ἄνω, καὶ ἐρημοπολίτης, Σάββας ὁ θεόφρων, πάντας ἡμᾶς, ἑορτάσαι προτρέπεται, τῆς πρὸς Θεὸν ἐκδημίας αὐτοῦ πιστῶς, τὴν ἡμέραν τὴν σεβάσμιον.
ltx/gr_gr_cog/me.m12.d05:meMA.Lauds2.incipit	Ἔξω σαρκὸς καὶ τοῦ κόσμου…
ltx/gr_gr_cog/me.m12.d05:meMA.Lauds2.melody	@ltx/gr_gr_cog/he.a.m1:heAU.TonOuranionTagmaton.name
ltx/gr_gr_cog/me.m12.d05:meMA.Lauds2.mode	@ltx/gr_gr_cog/miscellanea:misc.Mode1
ltx/gr_gr_cog/me.m12.d05:meMA.Lauds2.text	Ἔξω σαρκὸς καὶ τοῦ κόσμου, ταῖς ἀρεταῖς γεγονώς, καὶ διʼ αὐτῶν δοξάσας, ἐπὶ γῆς διὰ βίου, τὸν Κύριον τῆς δόξης, Πάτερ σοφέ, κατʼ ἀξίαν δεδόξασαι, καὶ ἰαμάτων ἐδείχθης θεία πηγή, παρʼ αὐτοῦ Σάββα θεόληπτε.
ltx/gr_gr_cog/me.m12.d05:meMA.Lauds3.incipit	Μέτριος ἄκακος πρᾶος, ἁπλοῦς, ἡσύχιος…
ltx/gr_gr_cog/me.m12.d05:meMA.Lauds3.melody	@ltx/gr_gr_cog/he.a.m1:heAU.TonOuranionTagmaton.name
ltx/gr_gr_cog/me.m12.d05:meMA.Lauds3.mode	@ltx/gr_gr_cog/miscellanea:misc.Mode1
ltx/gr_gr_cog/me.m12.d05:meMA.Lauds3.text	Μέτριος ἄκακος πρᾶος, ἁπλοῦς, ἡσύχιος, ὡς χρηματίσας Πάτερ, ὑπὲρ ἄνθρωπον ὄντως, καὶ ἄϋλος ἐν ὕλῃ, οἶκος Θεοῦ, καθωράθης πανάξιος, τὰς ἐξ αὐτοῦ προϊούσας σοι δωρεάς, συμπαθῶς διαπορθμεύων ἡμῖν.
ltx/gr_gr_cog/me.m12.d05:meMA.LaudsGlory.incipit	@ltx/gr_gr_cog/me.m01.d15:meVE.AposGlory.incipit
ltx/gr_gr_cog/me.m12.d05:meMA.LaudsGlory.melody	
ltx/gr_gr_cog/me.m12.d05:meMA.LaudsGlory.mode	@ltx/gr_gr_cog/miscellanea:misc.Mode6
ltx/gr_gr_cog/me.m12.d05:meMA.LaudsGlory.text	@ltx/gr_gr_cog/me.m01.d15:meVE.AposGlory.text
ltx/gr_gr_cog/me.m12.d05:meMA.LaudsTheotokion.incipit	@ltx/gr_gr_cog/he.o:heOT.TheotokeSyEi.incipit
ltx/gr_gr_cog/me.m12.d05:meMA.LaudsTheotokion.melody	@ltx/gr_gr_cog/he.o:heOT.TheotokeSyEi.name
ltx/gr_gr_cog/me.m12.d05:meMA.LaudsTheotokion.mode	@ltx/gr_gr_cog/miscellanea:misc.Mode6
ltx/gr_gr_cog/me.m12.d05:meMA.LaudsTheotokion.text	@ltx/gr_gr_cog/he.o:heOT.TheotokeSyEiOsiou.text
ltx/gr_gr_cog/me.m12.d05:meMA.MM.Lauds1123as5678.text	@ltx/gr_gr_cog/properties:media.key
ltx/gr_gr_cog/me.m12.d05:meMA.Ode1C11.greekmelody	@ltx/gr_gr_cog/he.h.m8:heHE.ArmatilatinFarao.greekname
ltx/gr_gr_cog/me.m12.d05:meMA.Ode1C11.incipit	Τῇ φωταυγείᾳ τοῦ Ἁγίου Πνεύματος…
ltx/gr_gr_cog/me.m12.d05:meMA.Ode1C11.melody	@ltx/gr_gr_cog/he.h.m8:heHE.ArmatilatinFarao.name
ltx/gr_gr_cog/me.m12.d05:meMA.Ode1C11.mode	@ltx/gr_gr_cog/miscellanea:misc.Mode8
ltx/gr_gr_cog/me.m12.d05:meMA.Ode1C11.ode	@ltx/gr_gr_cog/miscellanea:misc.Ode1
ltx/gr_gr_cog/me.m12.d05:meMA.Ode1C11.text	Τῇ φωταυγείᾳ τοῦ Ἁγίου Πνεύματος, Σάββα καταύγασον, τοὺς εὐσεβεῖς πόθῳ, ὕμνοις εὐφημοῦντάς σε, τῶν Ἀσκητῶν τὸ καύχημα, Μοναζόντων τὸ κλέος, τὸν τῆς ἐρήμου κοσμήτορα, τὸν τῆς παρθενίας Διδάσκαλον.
ltx/gr_gr_cog/me.m12.d05:meMA.Ode1C12.incipit	Ὅλον τὸν πόθον πρὸς Θεὸν…
ltx/gr_gr_cog/me.m12.d05:meMA.Ode1C12.melody	@ltx/gr_gr_cog/he.h.m8:heHE.ArmatilatinFarao.name
ltx/gr_gr_cog/me.m12.d05:meMA.Ode1C12.mode	@ltx/gr_gr_cog/miscellanea:misc.Mode8
ltx/gr_gr_cog/me.m12.d05:meMA.Ode1C12.ode	@ltx/gr_gr_cog/miscellanea:misc.Ode1
ltx/gr_gr_cog/me.m12.d05:meMA.Ode1C12.text	Ὅλον τὸν πόθον πρὸς Θεὸν ἀνέτεινας, ἀπὸ νεότητος, καὶ πρὸς αὐτὸν ἔχων, πᾶσάν σου τὴν ἔφεσιν, τὰ τῆς σαρκὸς κινήματα, καὶ παθῶν τὰς ἐφόδους, διʼ ἐγκρατείας ἐνέκρωσας, Σάββα θεοφόρε πανεύφημε.
ltx/gr_gr_cog/me.m12.d05:meMA.Ode1C13.incipit	Νενικηκὼς τὸν τῷ καρπῷ κρυπτόμενον…
ltx/gr_gr_cog/me.m12.d05:meMA.Ode1C13.melody	@ltx/gr_gr_cog/he.h.m8:heHE.ArmatilatinFarao.name
ltx/gr_gr_cog/me.m12.d05:meMA.Ode1C13.mode	@ltx/gr_gr_cog/miscellanea:misc.Mode8
ltx/gr_gr_cog/me.m12.d05:meMA.Ode1C13.ode	@ltx/gr_gr_cog/miscellanea:misc.Ode1
ltx/gr_gr_cog/me.m12.d05:meMA.Ode1C13.text	Νενικηκὼς τὸν τῷ καρπῷ κρυπτόμενον, ὄφιν ἐπάτησας, καὶ τοὺς αὐτοῦ βρόχους, κούφως ὑπερβέβηκας, θεοσεβείας πτέρυξιν, ἀνιπτάμενος Πάτερ· ζωὴν δὲ χαίρων ἐτρύγησας, ἀπὸ τοῦ φυτοῦ τοῦ τῆς γνώσεως.
ltx/gr_gr_cog/me.m12.d05:meMA.Ode1C14.incipit	Περιλαμπόμενος φωτὶ τῆς χάριτος, τὸ…
ltx/gr_gr_cog/me.m12.d05:meMA.Ode1C14.melody	@ltx/gr_gr_cog/he.h.m8:heHE.ArmatilatinFarao.name
ltx/gr_gr_cog/me.m12.d05:meMA.Ode1C14.mode	@ltx/gr_gr_cog/miscellanea:misc.Mode8
ltx/gr_gr_cog/me.m12.d05:meMA.Ode1C14.ode	@ltx/gr_gr_cog/miscellanea:misc.Ode1
ltx/gr_gr_cog/me.m12.d05:meMA.Ode1C14.text	Περιλαμπόμενος φωτὶ τῆς χάριτος, τὸ πῦρ εἰσέδραμες, ὥσπερ οἱ τρεῖς παῖδες, μείνας ἀκατάφλεκτος, σὲ τοῦ Θεοῦ φυλάξαντος, καὶ μηνύσαντος πᾶσι, τὴν ἐσομένην σοι ὕστερον, Πάτερ προκοπὴν καὶ λαμπρότητα.
ltx/gr_gr_cog/me.m12.d05:meMA.Ode1C1T.incipit	Ἀκατασχέτοις καθʼ ἡμῶν ὁ θάνατος…
ltx/gr_gr_cog/me.m12.d05:meMA.Ode1C1T.melody	@ltx/gr_gr_cog/he.h.m8:heHE.ArmatilatinFarao.name
ltx/gr_gr_cog/me.m12.d05:meMA.Ode1C1T.mode	@ltx/gr_gr_cog/miscellanea:misc.Mode8
ltx/gr_gr_cog/me.m12.d05:meMA.Ode1C1T.ode	@ltx/gr_gr_cog/miscellanea:misc.Ode1
ltx/gr_gr_cog/me.m12.d05:meMA.Ode1C1T.text	Ἀκατασχέτοις καθʼ ἡμῶν ὁ θάνατος, ὁρμαῖς ἐκέχρητο· ἀλλὰ τῷ σῷ τόκῳ προσεγγίσας ὤλετο, καὶ προσβαλὼν κατήργηται, Θεοτόκε Παρθένε· ζωὴν γὰρ ὄντως ἀΐδιον, σεσωματωμένην γεγέννηκας.
ltx/gr_gr_cog/me.m12.d05:meMA.Ode3C11.greekmelody	@ltx/gr_gr_cog/he.h.m8:heHE.OStereosasKatArchas.greekname
ltx/gr_gr_cog/me.m12.d05:meMA.Ode3C11.incipit	Νοῦν ἡγεμόνα τῶν παθῶν, Πανόλβιε…
ltx/gr_gr_cog/me.m12.d05:meMA.Ode3C11.melody	@ltx/gr_gr_cog/he.h.m8:heHE.OStereosasKatArchas.name
ltx/gr_gr_cog/me.m12.d05:meMA.Ode3C11.mode	@ltx/gr_gr_cog/miscellanea:misc.Mode8
ltx/gr_gr_cog/me.m12.d05:meMA.Ode3C11.ode	@ltx/gr_gr_cog/miscellanea:misc.Ode3
ltx/gr_gr_cog/me.m12.d05:meMA.Ode3C11.text	Νοῦν ἡγεμόνα τῶν παθῶν, Πανόλβιε καταστήσας, βραβευτὴς δικαιοσύνης ἐδείχθης· τῷ γὰρ κρείττονι σαφῶς, τὸ χεῖρον καθυπέταξας· ὅθεν ὡς φοίνιξ Πάτερ, ἐν τοῖς ἐρήμοις ἐξήνθησας.
ltx/gr_gr_cog/me.m12.d05:meMA.Ode3C12.incipit	Ἀκολουθῆσαι διαγνούς, τοῖς ἴχνεσι τοῦ…
ltx/gr_gr_cog/me.m12.d05:meMA.Ode3C12.melody	@ltx/gr_gr_cog/he.h.m8:heHE.OStereosasKatArchas.name
ltx/gr_gr_cog/me.m12.d05:meMA.Ode3C12.mode	@ltx/gr_gr_cog/miscellanea:misc.Mode8
ltx/gr_gr_cog/me.m12.d05:meMA.Ode3C12.ode	@ltx/gr_gr_cog/miscellanea:misc.Ode3
ltx/gr_gr_cog/me.m12.d05:meMA.Ode3C12.text	Ἀκολουθῆσαι διαγνούς, τοῖς ἴχνεσι τοῦ Δεσπότου, μετανάστης τῆς πατρίδος ἐγένου, καὶ τὴν ἔρημον οἰκῶν, τὸ τρόπαιον ἀνέστησας, κατὰ τῶν ἀντιπάλων, θείᾳ δυνάμει ῥωννύμενος.
ltx/gr_gr_cog/me.m12.d05:meMA.Ode3C13.incipit	Ῥωμαλεότητι φρενῶν, Παμμάκαρ ὠχυρωμένος, τὰς…
ltx/gr_gr_cog/me.m12.d05:meMA.Ode3C13.melody	@ltx/gr_gr_cog/he.h.m8:heHE.OStereosasKatArchas.name
ltx/gr_gr_cog/me.m12.d05:meMA.Ode3C13.mode	@ltx/gr_gr_cog/miscellanea:misc.Mode8
ltx/gr_gr_cog/me.m12.d05:meMA.Ode3C13.ode	@ltx/gr_gr_cog/miscellanea:misc.Ode3
ltx/gr_gr_cog/me.m12.d05:meMA.Ode3C13.text	Ῥωμαλεότητι φρενῶν, Παμμάκαρ ὠχυρωμένος, τὰς ποικίλας τοῦ ἐχθροῦ μεθοδείας, ἐθριάμβευσας σοφέ, καὶ πᾶσιν ἐφανέρωσας, καὶ τὴν ὀφρὺν ἐκείνου τὴν ἐπηρμένην κατέβαλες.
ltx/gr_gr_cog/me.m12.d05:meMA.Ode3C14.incipit	Ἱλαρωτάτῃ σε ψυχῇ, καὶ προσηνεῖ…
ltx/gr_gr_cog/me.m12.d05:meMA.Ode3C14.melody	@ltx/gr_gr_cog/he.h.m8:heHE.OStereosasKatArchas.name
ltx/gr_gr_cog/me.m12.d05:meMA.Ode3C14.mode	@ltx/gr_gr_cog/miscellanea:misc.Mode8
ltx/gr_gr_cog/me.m12.d05:meMA.Ode3C14.ode	@ltx/gr_gr_cog/miscellanea:misc.Ode3
ltx/gr_gr_cog/me.m12.d05:meMA.Ode3C14.text	Ἱλαρωτάτῃ σε ψυχῇ, καὶ προσηνεῖ διαθέσει, ἀρεταῖς κατακοσμούμενον βλέπων, ὁ λαμπρότατος φωστήρ, Εὐθύμιος ἐδέξατο, φωτιστικῶς θεσπίζων, τὴν σὴν Παμμάκαρ φαιδρότητα.
ltx/gr_gr_cog/me.m12.d05:meMA.Ode3C1T.incipit	Σωτηριώδους διʼ ἡμᾶς, τοῦ Λόγου…
ltx/gr_gr_cog/me.m12.d05:meMA.Ode3C1T.melody	@ltx/gr_gr_cog/he.h.m8:heHE.OStereosasKatArchas.name
ltx/gr_gr_cog/me.m12.d05:meMA.Ode3C1T.mode	@ltx/gr_gr_cog/miscellanea:misc.Mode8
ltx/gr_gr_cog/me.m12.d05:meMA.Ode3C1T.ode	@ltx/gr_gr_cog/miscellanea:misc.Ode3
ltx/gr_gr_cog/me.m12.d05:meMA.Ode3C1T.text	Σωτηριώδους διʼ ἡμᾶς, τοῦ Λόγου οἰκονομίας, φωτεινὴ σὺ Μητροπάρθενε πύλη, ἐγνωρίσθης ἀληθῶς· σὺ γὰρ ἡμῖν εἰσήγαγες, τὴν νοητὴν ἀκτῖνα, τῆς ὑπερθέου Θεότητος.
ltx/gr_gr_cog/me.m12.d05:meMA.Ode3Kathisma1.greekmelody	@ltx/gr_gr_cog/he.a.m8:heAU.TinSofianKaiLogon.greekname
ltx/gr_gr_cog/me.m12.d05:meMA.Ode3Kathisma1.incipit	Τοὺς θορύβους τοῦ βίου καταλιπών…
ltx/gr_gr_cog/me.m12.d05:meMA.Ode3Kathisma1.melody	@ltx/gr_gr_cog/he.a.m8:heAU.TinSofianKaiLogon.name
ltx/gr_gr_cog/me.m12.d05:meMA.Ode3Kathisma1.mode	@ltx/gr_gr_cog/miscellanea:misc.Mode8
ltx/gr_gr_cog/me.m12.d05:meMA.Ode3Kathisma1.text	Τοὺς θορύβους τοῦ βίου καταλιπών, τὸν σταυρόν σου ἐπʼ ὤμων ἀναλαβών, ὅλον ἀνατέθεικας, σεαυτὸν τῷ Κυρίῳ σου, καὶ σαρκὸς δὲ ἔξω, καὶ κόσμου γενόμενος, τοῦ Ἁγίου ἐγένου, συνόμιλος Πνεύματος· ὅθεν καὶ πρὸς ζῆλον, τοὺς λαοὺς διεγείρων, τὰς πόλεις ἐκένωσας, καὶ ἐρήμους ἐπόλισας, θεοφόρε Πατὴρ ἡμῶν. Πρέσβευε Χριστῷ τῷ Θεῷ, τῶν πταισμάτων ἄφεσιν δωρήσασθαι, τοῖς ἑορτάζουσι πόθῳ, τὴν ἁγίαν μνήμην σου.
ltx/gr_gr_cog/me.m12.d05:meMA.Ode3KathismaT.incipit	Τὴν ψυχήν μου Παρθένε, τὴν…
ltx/gr_gr_cog/me.m12.d05:meMA.Ode3KathismaT.melody	@ltx/gr_gr_cog/he.a.m8:heAU.TinSofianKaiLogon.name
ltx/gr_gr_cog/me.m12.d05:meMA.Ode3KathismaT.mode	@ltx/gr_gr_cog/miscellanea:misc.Mode8
ltx/gr_gr_cog/me.m12.d05:meMA.Ode3KathismaT.text	Τὴν ψυχήν μου Παρθένε, τὴν ταπεινήν, ἀπὸ βρέφους μολύνας ὁ μιαρός, καὶ λόγοις καὶ πράξεσιν, ἐμαυτὸν κατεῤῥύπωσα, καὶ οὐκ ἔχω τί πράξω, ἢ ποῦ καταφεύξομαι, ἀλλʼ οὐδʼ ἄλλην ἐλπίδα, πλήν σου Κόρη ἐπίσταμαι. Φεῦ μοι ὁ ἀχρεῖος! διὰ τοῦτο ἱκέτης, πρὸς σὲ τὴν Πανάχραντον, νῦν προστρέχω καὶ δέομαι, ὁμολογῶν σοι τό, Ἥμαρτον. Πρέσβευε τῷ σῷ Υἱῷ καὶ Θεῷ, τῶν πταισμάτων ἄφεσιν δοθῆναί μοι· εἰς σὲ γὰρ πάσας Παρθένε, τὰς ἐλπίδας ἀνέθηκα.
ltx/gr_gr_cog/me.m12.d05:meMA.Ode4C11.greekmelody	@ltx/gr_gr_cog/he.h.m8:heHE.SyMouIschys.greekname
ltx/gr_gr_cog/me.m12.d05:meMA.Ode4C11.incipit	Τὴν τῆς ψυχῆς, ἀνακαθαίρων κατάστασιν…
ltx/gr_gr_cog/me.m12.d05:meMA.Ode4C11.melody	@ltx/gr_gr_cog/he.h.m8:heHE.SyMouIschys.name
ltx/gr_gr_cog/me.m12.d05:meMA.Ode4C11.mode	@ltx/gr_gr_cog/miscellanea:misc.Mode8
ltx/gr_gr_cog/me.m12.d05:meMA.Ode4C11.ode	@ltx/gr_gr_cog/miscellanea:misc.Ode4
ltx/gr_gr_cog/me.m12.d05:meMA.Ode4C11.text	Τὴν τῆς ψυχῆς, ἀνακαθαίρων κατάστασιν, καὶ πλατύνων, θείοις θεωρήμασι, χωρητικήν, ταύτην ἀληθῶς, θείων χαρισμάτων, εἰργάσω θεομακάριστε, ἁφῇ δὲ τῶν χειρῶν σου, ἀσθενοῦντας ἰάσω, μιμητὴς τοῦ Δεσπότου γενόμενος.
ltx/gr_gr_cog/me.m12.d05:meMA.Ode4C12.incipit	Ὁ κατὰ σοῦ, Πάτερ δεινῶς…
ltx/gr_gr_cog/me.m12.d05:meMA.Ode4C12.melody	@ltx/gr_gr_cog/he.h.m8:heHE.SyMouIschys.name
ltx/gr_gr_cog/me.m12.d05:meMA.Ode4C12.mode	@ltx/gr_gr_cog/miscellanea:misc.Mode8
ltx/gr_gr_cog/me.m12.d05:meMA.Ode4C12.ode	@ltx/gr_gr_cog/miscellanea:misc.Ode4
ltx/gr_gr_cog/me.m12.d05:meMA.Ode4C12.text	Ὁ κατὰ σοῦ, Πάτερ δεινῶς θρασυνόμενος, κατεπόθη, ὡς Δαθὰν ὁ δείλαιος, ὡς Ἀβειρὼν ἐξαφανισθείς· σὲ γὰρ ἀοράτως, ἡ θεία χάρις ἐφύλαττε, πολλῶν προνοουμένη διὰ σοῦ σωζομένων, καὶ τοῖς σοῖς ἑπομένων διδάγμασι.
ltx/gr_gr_cog/me.m12.d05:meMA.Ode4C13.incipit	Νόμῳ Θεοῦ, παιδαγωγήσας θεσπέσιε, τὰς…
ltx/gr_gr_cog/me.m12.d05:meMA.Ode4C13.melody	@ltx/gr_gr_cog/he.h.m8:heHE.SyMouIschys.name
ltx/gr_gr_cog/me.m12.d05:meMA.Ode4C13.mode	@ltx/gr_gr_cog/miscellanea:misc.Mode8
ltx/gr_gr_cog/me.m12.d05:meMA.Ode4C13.ode	@ltx/gr_gr_cog/miscellanea:misc.Ode4
ltx/gr_gr_cog/me.m12.d05:meMA.Ode4C13.text	Νόμῳ Θεοῦ, παιδαγωγήσας θεσπέσιε, τὰς αἰσθήσεις, πρὸς τὴν κατανόησιν, τῶν ἀσωμάτων καὶ νοητῶν, σοῦ ἐπιτηδείαν, κατέστησας τὴν διάνοιαν, προβαίνων ἀνενδότως, ἀπὸ δόξης εἰς δόξαν, ἐκ δυνάμεως Πάτερ εἰς δύναμιν.
ltx/gr_gr_cog/me.m12.d05:meMA.Ode4C14.incipit	Εὐεργετεῖν, τοὺς ὁμοφύλους προθέμενος, ἐν…
ltx/gr_gr_cog/me.m12.d05:meMA.Ode4C14.melody	@ltx/gr_gr_cog/he.h.m8:heHE.SyMouIschys.name
ltx/gr_gr_cog/me.m12.d05:meMA.Ode4C14.mode	@ltx/gr_gr_cog/miscellanea:misc.Mode8
ltx/gr_gr_cog/me.m12.d05:meMA.Ode4C14.ode	@ltx/gr_gr_cog/miscellanea:misc.Ode4
ltx/gr_gr_cog/me.m12.d05:meMA.Ode4C14.text	Εὐεργετεῖν, τοὺς ὁμοφύλους προθέμενος, ἐν ἐρήμῳ, πόλεις ᾠκοδόμησας, θεοπρεπεῖς καὶ ψυχωφελεῖς καὶ ἐν γῇ διψώσῃ, πηγὰς ὑδάτων ἐξήγαγες, καὶ ὄμβρους οὐρανόθεν, παραδόξως θεόφρον, ἐν ἀνύδροις χωρίοις κατήγαγες.
ltx/gr_gr_cog/me.m12.d05:meMA.Ode4C1T.incipit	Νεοθαλής, ἀθανασίας Παράδεισος, καὶ ὡραῖος…
ltx/gr_gr_cog/me.m12.d05:meMA.Ode4C1T.melody	@ltx/gr_gr_cog/he.h.m8:heHE.SyMouIschys.name
ltx/gr_gr_cog/me.m12.d05:meMA.Ode4C1T.mode	@ltx/gr_gr_cog/miscellanea:misc.Mode8
ltx/gr_gr_cog/me.m12.d05:meMA.Ode4C1T.ode	@ltx/gr_gr_cog/miscellanea:misc.Ode4
ltx/gr_gr_cog/me.m12.d05:meMA.Ode4C1T.text	Νεοθαλής, ἀθανασίας Παράδεισος, καὶ ὡραῖος, ὄντως ἀναδέδειξαι, ξύλον ζωῆς, ἐν σοὶ φυτευθέν, θεαρχικωτάτως, κυοφοροῦσα καὶ τίκτουσα, τὸ πᾶσιν ἀποστάζον, ζωηφόρους ἐλπίδας, τοῖς πιστῶς Θεοτόκον φρονοῦσί σε.
ltx/gr_gr_cog/me.m12.d05:meMA.Ode5C11.greekmelody	@ltx/gr_gr_cog/he.h.m8:heHE.InaTiMeAposo.greekname
ltx/gr_gr_cog/me.m12.d05:meMA.Ode5C11.incipit	Ἀκλινεῖ διανοίᾳ, πρὸς τὸν σὸν…
ltx/gr_gr_cog/me.m12.d05:meMA.Ode5C11.melody	@ltx/gr_gr_cog/he.h.m8:heHE.InaTiMeAposo.name
ltx/gr_gr_cog/me.m12.d05:meMA.Ode5C11.mode	@ltx/gr_gr_cog/miscellanea:misc.Mode8
ltx/gr_gr_cog/me.m12.d05:meMA.Ode5C11.ode	@ltx/gr_gr_cog/miscellanea:misc.Ode5
ltx/gr_gr_cog/me.m12.d05:meMA.Ode5C11.text	Ἀκλινεῖ διανοίᾳ, πρὸς τὸν σὸν ποθούμενον ἀνατεινόμενος, παρʼ αὐτοῦ τὴν χάριν, τῶν μεγίστων θαυμάτων τὴν ἄφθονον, ἐκομίσω Πάτερ, καὶ τοὺς πιστῶς προσερχομένους, συμπαθῶς ἐθεράπευσας Ὅσιε.
ltx/gr_gr_cog/me.m12.d05:meMA.Ode5C12.incipit	Σαρκικῶν βαρημάτων, ὄγκον ἀποθέμενος, σκεῦος…
ltx/gr_gr_cog/me.m12.d05:meMA.Ode5C12.melody	@ltx/gr_gr_cog/he.h.m8:heHE.InaTiMeAposo.name
ltx/gr_gr_cog/me.m12.d05:meMA.Ode5C12.mode	@ltx/gr_gr_cog/miscellanea:misc.Mode8
ltx/gr_gr_cog/me.m12.d05:meMA.Ode5C12.ode	@ltx/gr_gr_cog/miscellanea:misc.Ode5
ltx/gr_gr_cog/me.m12.d05:meMA.Ode5C12.text	Σαρκικῶν βαρημάτων, ὄγκον ἀποθέμενος, σκεῦος θεότευκτον, ἐκλογῆς ἐγένου, τοῦ ἁγίου θεσπέσιε Πνεύματος, ἀποχῇ βρωμάτων, καὶ προσευχῇ καὶ καρτερίᾳ, καὶ ταπεινοφροσύνῃ κοσμούμενος.
ltx/gr_gr_cog/me.m12.d05:meMA.Ode5C13.incipit	Κήρυξ θείων δογμάτων, μεγαλοφωνότατος κεχειροτόνησαι…
ltx/gr_gr_cog/me.m12.d05:meMA.Ode5C13.melody	@ltx/gr_gr_cog/he.h.m8:heHE.InaTiMeAposo.name
ltx/gr_gr_cog/me.m12.d05:meMA.Ode5C13.mode	@ltx/gr_gr_cog/miscellanea:misc.Mode8
ltx/gr_gr_cog/me.m12.d05:meMA.Ode5C13.ode	@ltx/gr_gr_cog/miscellanea:misc.Ode5
ltx/gr_gr_cog/me.m12.d05:meMA.Ode5C13.text	Κήρυξ θείων δογμάτων, μεγαλοφωνότατος κεχειροτόνησαι, τῶν Συνόδων Πάτερ, τῶν Ἁγίων συνήγορος γέγονας, Βασιλεῖς σοφίζων, οἷς ἐμφανῶς χάριτι θείᾳ, τειχιζόμενος ὤφθης μακάριε.
ltx/gr_gr_cog/me.m12.d05:meMA.Ode5C14.incipit	Ἡ θεόθεν δοθεῖσα, χάρις σοι…
ltx/gr_gr_cog/me.m12.d05:meMA.Ode5C14.melody	@ltx/gr_gr_cog/he.h.m8:heHE.InaTiMeAposo.name
ltx/gr_gr_cog/me.m12.d05:meMA.Ode5C14.mode	@ltx/gr_gr_cog/miscellanea:misc.Mode8
ltx/gr_gr_cog/me.m12.d05:meMA.Ode5C14.ode	@ltx/gr_gr_cog/miscellanea:misc.Ode5
ltx/gr_gr_cog/me.m12.d05:meMA.Ode5C14.text	Ἡ θεόθεν δοθεῖσα, χάρις σοι Θεόπνευστε διαβεβόηται, διεδόθη πᾶσιν, εἰς τὰ τῆς οἰκουμένης ἀκρότατα, ἐναργεῖς ποιοῦσα, θεοπρεπῶς τὰς ἀποδείξεις, τῶν θαυμάτων τὴν θείαν ἐνεργειαν.
ltx/gr_gr_cog/me.m12.d05:meMA.Ode5C1T.incipit	Τῶν πιστῶν ἡ προστάτις, τεῖχος…
ltx/gr_gr_cog/me.m12.d05:meMA.Ode5C1T.melody	@ltx/gr_gr_cog/he.h.m8:heHE.InaTiMeAposo.name
ltx/gr_gr_cog/me.m12.d05:meMA.Ode5C1T.mode	@ltx/gr_gr_cog/miscellanea:misc.Mode8
ltx/gr_gr_cog/me.m12.d05:meMA.Ode5C1T.ode	@ltx/gr_gr_cog/miscellanea:misc.Ode5
ltx/gr_gr_cog/me.m12.d05:meMA.Ode5C1T.text	Τῶν πιστῶν ἡ προστάτις, τεῖχος ἀκατάλυτον, τῶν εὐφημούντων σε, ἡ παντὶ τῷ γένει, τῶν ἀνθρώπων φανεῖσα σωτήριος, ὡς Θεὸν τεκοῦσα, σωματικῶς ἐπιφανέντα, τὴν ψυχήν μου διάσωσον Πάναγνε.
ltx/gr_gr_cog/me.m12.d05:meMA.Ode6C11.greekmelody	@ltx/gr_gr_cog/he.h.m8:heHE.IlasthitiMoiSotir.greekname
ltx/gr_gr_cog/me.m12.d05:meMA.Ode6C11.incipit	Ἀγάπην πρὸς τὸν Θεόν, καὶ…
ltx/gr_gr_cog/me.m12.d05:meMA.Ode6C11.melody	@ltx/gr_gr_cog/he.h.m8:heHE.IlasthitiMoiSotir.name
ltx/gr_gr_cog/me.m12.d05:meMA.Ode6C11.mode	@ltx/gr_gr_cog/miscellanea:misc.Mode8
ltx/gr_gr_cog/me.m12.d05:meMA.Ode6C11.ode	@ltx/gr_gr_cog/miscellanea:misc.Ode6
ltx/gr_gr_cog/me.m12.d05:meMA.Ode6C11.text	Ἀγάπην πρὸς τὸν Θεόν, καὶ τὸν πλησίον κτησάμενος, τοῦ Νόμου καὶ Προφητῶν, πληροῖς τὸ κεφάλαιον· τὴν γὰρ ὑπερέχουσαν, πασῶν ἀσυγκρίτως, ἀρετὴν Πάτερ κατώρθωσας.
ltx/gr_gr_cog/me.m12.d05:meMA.Ode6C12.incipit	Ἰσάγγελον ἐπὶ γῆς, σὺ πολιτείαν…
ltx/gr_gr_cog/me.m12.d05:meMA.Ode6C12.melody	@ltx/gr_gr_cog/he.h.m8:heHE.IlasthitiMoiSotir.name
ltx/gr_gr_cog/me.m12.d05:meMA.Ode6C12.mode	@ltx/gr_gr_cog/miscellanea:misc.Mode8
ltx/gr_gr_cog/me.m12.d05:meMA.Ode6C12.ode	@ltx/gr_gr_cog/miscellanea:misc.Ode6
ltx/gr_gr_cog/me.m12.d05:meMA.Ode6C12.text	Ἰσάγγελον ἐπὶ γῆς, σὺ πολιτείαν διήνυσας, ἰσάγγελον δὲ τιμήν, Χριστός σοι δεδώρηται, Ἁγίων τὰ τάγματα, συνοδοιποροῦντα, τῇ ψυχῇ σου παρασχόμενος.
ltx/gr_gr_cog/me.m12.d05:meMA.Ode6C13.incipit	Σοφίας γόνος ὀφθείς, ἀρχὴν σοφίας…
ltx/gr_gr_cog/me.m12.d05:meMA.Ode6C13.melody	@ltx/gr_gr_cog/he.h.m8:heHE.IlasthitiMoiSotir.name
ltx/gr_gr_cog/me.m12.d05:meMA.Ode6C13.mode	@ltx/gr_gr_cog/miscellanea:misc.Mode8
ltx/gr_gr_cog/me.m12.d05:meMA.Ode6C13.ode	@ltx/gr_gr_cog/miscellanea:misc.Ode6
ltx/gr_gr_cog/me.m12.d05:meMA.Ode6C13.text	Σοφίας γόνος ὀφθείς, ἀρχὴν σοφίας ἐπόθησας, τὸν φόβον τὸν τοῦ Θεοῦ, ᾧ καὶ στοιχειούμενος, πρὸς τὴν τελειότητα, τὴν ἐνδεχομένην, τοῖς ἀνθρώποις Πάτερ ἔφθασας.
ltx/gr_gr_cog/me.m12.d05:meMA.Ode6C1T.incipit	Σωτῆρα καὶ Λυτρωτήν, Θεὸν τῶν…
ltx/gr_gr_cog/me.m12.d05:meMA.Ode6C1T.melody	@ltx/gr_gr_cog/he.h.m8:heHE.IlasthitiMoiSotir.name
ltx/gr_gr_cog/me.m12.d05:meMA.Ode6C1T.mode	@ltx/gr_gr_cog/miscellanea:misc.Mode8
ltx/gr_gr_cog/me.m12.d05:meMA.Ode6C1T.ode	@ltx/gr_gr_cog/miscellanea:misc.Ode6
ltx/gr_gr_cog/me.m12.d05:meMA.Ode6C1T.text	Σωτῆρα καὶ Λυτρωτήν, Θεὸν τῶν ὅλων καὶ Κύριον, τεκοῦσα διὰ σαρκός, ἡμῖν ὁμιλήσαντα, διάσωσον Πάναγνε, τοὺς προσκαλουμένους, ἐκ κινδύνων σε τὴν Δέσποιναν.
ltx/gr_gr_cog/me.m12.d05:meMA.Ode7C11.greekmelody	@ltx/gr_gr_cog/he.h.m8:heHE.TheouSynkatavasin.greekname
ltx/gr_gr_cog/me.m12.d05:meMA.Ode7C11.incipit	Ἀπέθου τὰ πρόσκαιρα, τῶν αἰωνίων…
ltx/gr_gr_cog/me.m12.d05:meMA.Ode7C11.melody	@ltx/gr_gr_cog/he.h.m8:heHE.TheouSynkatavasin.name
ltx/gr_gr_cog/me.m12.d05:meMA.Ode7C11.mode	@ltx/gr_gr_cog/miscellanea:misc.Mode8
ltx/gr_gr_cog/me.m12.d05:meMA.Ode7C11.ode	@ltx/gr_gr_cog/miscellanea:misc.Ode7
ltx/gr_gr_cog/me.m12.d05:meMA.Ode7C11.text	Ἀπέθου τὰ πρόσκαιρα, τῶν αἰωνίων διαμειβόμενος· σὺν Ἀγγέλοις χορεύεις, ὡς τῶν Ἀγγέλων πολιτευσάμενος, τὴν πολιτείαν, μεθʼ ὧν καὶ συνέψαλλες· Εὐλογητὸς ὁ Θεός, ὁ τῶν Πατέρων ἡμῶν.
ltx/gr_gr_cog/me.m12.d05:meMA.Ode7C12.incipit	Βοᾷ χαριστήρια, ἡ σὴ μεγίστη…
ltx/gr_gr_cog/me.m12.d05:meMA.Ode7C12.melody	@ltx/gr_gr_cog/he.h.m8:heHE.TheouSynkatavasin.name
ltx/gr_gr_cog/me.m12.d05:meMA.Ode7C12.mode	@ltx/gr_gr_cog/miscellanea:misc.Mode8
ltx/gr_gr_cog/me.m12.d05:meMA.Ode7C12.ode	@ltx/gr_gr_cog/miscellanea:misc.Ode7
ltx/gr_gr_cog/me.m12.d05:meMA.Ode7C12.text	Βοᾷ χαριστήρια, ἡ σὴ μεγίστη Λαύρα καὶ πάντιμος, οἰκιστήν σε καὶ κτίστην, καὶ πολιοῦχον προβαλλομένη Σοφέ, καὶ καυχωμένη κραυγάζει πρὸς κύριον· Εὐλογητός ὁ Θεός, ὁ τῶν Πατέρων ἡμῶν.
ltx/gr_gr_cog/me.m12.d05:meMA.Ode7C13.incipit	Ἀπαύστως ἱκέτευε, Σάββα θεόφρον ὑπὲρ…
ltx/gr_gr_cog/me.m12.d05:meMA.Ode7C13.melody	@ltx/gr_gr_cog/he.h.m8:heHE.TheouSynkatavasin.name
ltx/gr_gr_cog/me.m12.d05:meMA.Ode7C13.mode	@ltx/gr_gr_cog/miscellanea:misc.Mode8
ltx/gr_gr_cog/me.m12.d05:meMA.Ode7C13.ode	@ltx/gr_gr_cog/miscellanea:misc.Ode7
ltx/gr_gr_cog/me.m12.d05:meMA.Ode7C13.text	Ἀπαύστως ἱκέτευε, Σάββα θεόφρον ὑπὲρ τῆς ποίμνης σου, ἐκτενῶς τε δυσώπει, τοὺς σοὺς καμάτους διαιωνίζειν ἀεί, καρποφοροῦντας, τοὺς πόθῳ κραυγάζοντας· Εὐλογητός ὁ Θεός, ὁ τῶν Πατέρων ἡμῶν.
ltx/gr_gr_cog/me.m12.d05:meMA.Ode7C1T.incipit	Νυμφῶνα πανάχραντον, τῆς ὑπὲρ λόγον…
ltx/gr_gr_cog/me.m12.d05:meMA.Ode7C1T.melody	@ltx/gr_gr_cog/he.h.m8:heHE.TheouSynkatavasin.name
ltx/gr_gr_cog/me.m12.d05:meMA.Ode7C1T.mode	@ltx/gr_gr_cog/miscellanea:misc.Mode8
ltx/gr_gr_cog/me.m12.d05:meMA.Ode7C1T.ode	@ltx/gr_gr_cog/miscellanea:misc.Ode7
ltx/gr_gr_cog/me.m12.d05:meMA.Ode7C1T.text	Νυμφῶνα πανάχραντον, τῆς ὑπὲρ λόγον Λόγου σαρκώσεως, καὶ Παστάδα καὶ Θρόνον, ὀρθὰ φρονοῦντες σὲ ὀνομάζομεν, καὶ γεγηθότες, τῷ τόκῳ σου ψάλλομεν· Εὐλογητός ὁ Θεός, ὁ τῶν Πατέρων ἡμῶν.
ltx/gr_gr_cog/me.m12.d05:meMA.Ode8C11.greekmelody	@ltx/gr_gr_cog/he.h.m8:heHE.EptaplasiosKaminon.greekname
ltx/gr_gr_cog/me.m12.d05:meMA.Ode8C11.incipit	Ἐν εὐφροσύνῃ Ὅσιε, τῶν Ἁγίων…
ltx/gr_gr_cog/me.m12.d05:meMA.Ode8C11.melody	@ltx/gr_gr_cog/he.h.m8:heHE.EptaplasiosKaminon.name
ltx/gr_gr_cog/me.m12.d05:meMA.Ode8C11.mode	@ltx/gr_gr_cog/miscellanea:misc.Mode8
ltx/gr_gr_cog/me.m12.d05:meMA.Ode8C11.ode	@ltx/gr_gr_cog/miscellanea:misc.Ode8
ltx/gr_gr_cog/me.m12.d05:meMA.Ode8C11.text	Ἐν εὐφροσύνῃ Ὅσιε, τῶν Ἁγίων τὰ τάγματα, τῆς καθαρωτάτης, σοῦ ψυχῆς προτρέχουσιν, εἰς τόπον ἀνέσεως, εἰς φωτεινὰ σκηνώματα, ἔνθα τῶν Ἁγίων, οἱ χοροὶ ποδηγοῦντες· μεθʼ ὧν νῦν ἀναμέλπεις· Ἱερεῖς εὐλογεῖτε, λαὸς ὑπερυψοῦτε, Χριστὸν εἰς τοὺς αἰῶνας.
ltx/gr_gr_cog/me.m12.d05:meMA.Ode8C12.incipit	Ξένα τὰ σὰ θαυμάσια· τοὺς…
ltx/gr_gr_cog/me.m12.d05:meMA.Ode8C12.melody	@ltx/gr_gr_cog/he.h.m8:heHE.EptaplasiosKaminon.name
ltx/gr_gr_cog/me.m12.d05:meMA.Ode8C12.mode	@ltx/gr_gr_cog/miscellanea:misc.Mode8
ltx/gr_gr_cog/me.m12.d05:meMA.Ode8C12.ode	@ltx/gr_gr_cog/miscellanea:misc.Ode8
ltx/gr_gr_cog/me.m12.d05:meMA.Ode8C12.text	Ξένα τὰ σὰ θαυμάσια· τοὺς γὰρ θῆρας ἡμέρωσας, προκατηρεμίσας, τῶν παθῶν τὰ κύματα, προλέγεις τὰ μέλλοντα, προφητικῷ χαρίσματι, στίφη τῶν δαιμόνων, φυγαδεύων ἐλαύνεις, εὐτόνοις ἀγρυπνίαις, προσευχαῖς καὶ νηστείαις, Σταυροῦ τε τῇ ἀμάχῳ, δυνάμει θεοφόρε.
ltx/gr_gr_cog/me.m12.d05:meMA.Ode8C13.incipit	Ὁ Μωϋσῇ τὸ πρότερον, ἀπὸ…
ltx/gr_gr_cog/me.m12.d05:meMA.Ode8C13.melody	@ltx/gr_gr_cog/he.h.m8:heHE.EptaplasiosKaminon.name
ltx/gr_gr_cog/me.m12.d05:meMA.Ode8C13.mode	@ltx/gr_gr_cog/miscellanea:misc.Mode8
ltx/gr_gr_cog/me.m12.d05:meMA.Ode8C13.ode	@ltx/gr_gr_cog/miscellanea:misc.Ode8
ltx/gr_gr_cog/me.m12.d05:meMA.Ode8C13.text	Ὁ Μωϋσῇ τὸ πρότερον, ἀπὸ στύλου φθεγγόμενος, στῦλον ἀπὸ γῆς, εἰς οὐρανοὺς ὁλόφωτον, ἐκτείνας σοι ἔδειξεν, ἔνθα καὶ νῦν κατάκειται, τὸ καρτερικόν σου, καὶ πολύαθλον σῶμα· ᾧ πίστει παρεστῶτες, εὐσεβῶς μελῳδοῦμεν· Λαὸς ὑπερυψοῦτε, Χριστὸν εἰς τοὺς αἰῶνας.
ltx/gr_gr_cog/me.m12.d05:meMA.Ode8C14.incipit	Χαρμονικῶς ἡ μνήμη σου, ἐκτελεῖται…
ltx/gr_gr_cog/me.m12.d05:meMA.Ode8C14.melody	@ltx/gr_gr_cog/he.h.m8:heHE.EptaplasiosKaminon.name
ltx/gr_gr_cog/me.m12.d05:meMA.Ode8C14.mode	@ltx/gr_gr_cog/miscellanea:misc.Mode8
ltx/gr_gr_cog/me.m12.d05:meMA.Ode8C14.ode	@ltx/gr_gr_cog/miscellanea:misc.Ode8
ltx/gr_gr_cog/me.m12.d05:meMA.Ode8C14.text	Χαρμονικῶς ἡ μνήμη σου, ἐκτελεῖται Πανεύφημε· τὴν χαροποιὸν γὰρ ἀρετὴν ἐνδέδυσαι, τὸ ὄντως ἱμάτιον, τοῦ σωτηρίου καὶ καθαρόν, καὶ φωτοειδῆ τῆς εὐφροσύνης χιτῶνα· ᾧ νῦν ὡραϊσμένως, μελῳδεῖς ἀνενδότως· Λαὸς ὑπερυψοῦτε, Χριστὸν εἰς τοὺς αἰῶνας.
ltx/gr_gr_cog/me.m12.d05:meMA.Ode8C1T.incipit	Ἀπειρογάμως τέτοκας, καὶ Παρθένος διέμεινας…
ltx/gr_gr_cog/me.m12.d05:meMA.Ode8C1T.melody	@ltx/gr_gr_cog/he.h.m8:heHE.EptaplasiosKaminon.name
ltx/gr_gr_cog/me.m12.d05:meMA.Ode8C1T.mode	@ltx/gr_gr_cog/miscellanea:misc.Mode8
ltx/gr_gr_cog/me.m12.d05:meMA.Ode8C1T.ode	@ltx/gr_gr_cog/miscellanea:misc.Ode8
ltx/gr_gr_cog/me.m12.d05:meMA.Ode8C1T.text	Ἀπειρογάμως τέτοκας, καὶ Παρθένος διέμεινας, καὶ τῷ ξένῳ τόκῳ σου, συνῆψας ἅπαντα, τὸν χρόνιον πόλεμον, καὶ τὴν μακρὰν διάστασιν λύσασα, Χριστὸν τὸν τῆς εἰρήνης δοτῆρα, βαστάζοντα ἐν κόλποις· ὃν πιστῶς εὐλογοῦντες, σὲ πόθῳ ἀνυμνοῦμεν, τὴν μόνην Θεοτόκον.
ltx/gr_gr_cog/me.m12.d05:meMA.Ode9C11.greekmelody	@ltx/gr_gr_cog/he.h.m8:heHE.ExestiEpiTouto.greekname
ltx/gr_gr_cog/me.m12.d05:meMA.Ode9C11.incipit	Μυρίζει σου ἡ θήκη πνευματικήν…
ltx/gr_gr_cog/me.m12.d05:meMA.Ode9C11.melody	@ltx/gr_gr_cog/he.h.m8:heHE.ExestiEpiTouto.name
ltx/gr_gr_cog/me.m12.d05:meMA.Ode9C11.mode	@ltx/gr_gr_cog/miscellanea:misc.Mode8
ltx/gr_gr_cog/me.m12.d05:meMA.Ode9C11.ode	@ltx/gr_gr_cog/miscellanea:misc.Ode9
ltx/gr_gr_cog/me.m12.d05:meMA.Ode9C11.text	Μυρίζει σου ἡ θήκη πνευματικήν, εὐωδίαν πλουσίως εὐφραίνουσα, τοὺς σοὺς υἱούς, σὲ περιεστώτας εἰλικρινῶς, ἐνθυμουμένους Ὅσιε, τὴν Ἀγγελικήν σου διαγωγήν, καὶ τὴν σοὶ δεδομένην, λαμπρότητα καὶ δόξαν, καὶ τὴν ἀΐδιον τερπνότητα.
ltx/gr_gr_cog/me.m12.d05:meMA.Ode9C12.incipit	Ἐῤῥάγη ἐν ἐρήμῳ ὕδωρ καὶ…
ltx/gr_gr_cog/me.m12.d05:meMA.Ode9C12.melody	@ltx/gr_gr_cog/he.h.m8:heHE.ExestiEpiTouto.name
ltx/gr_gr_cog/me.m12.d05:meMA.Ode9C12.mode	@ltx/gr_gr_cog/miscellanea:misc.Mode8
ltx/gr_gr_cog/me.m12.d05:meMA.Ode9C12.ode	@ltx/gr_gr_cog/miscellanea:misc.Ode9
ltx/gr_gr_cog/me.m12.d05:meMA.Ode9C12.text	Ἐῤῥάγη ἐν ἐρήμῳ ὕδωρ καὶ γῆ, ἡ διψῶσα εἰς ἕλη ἐγένετο, ταῖς προσευχαῖς, μετασκευασθεῖσα Πάτερ ταῖς σαῖς· ἀσκητικαὶ γὰρ φάλαγγες, ταύτην κατοικοῦσι ποταμηδόν, ἡ χώρα Ἰορδάνου, ἐξήνθησεν ὡς κρίνον, ἀρδευομένη τοῖς σοῖς δάκρυσι.
ltx/gr_gr_cog/me.m12.d05:meMA.Ode9C13.incipit	Λαμπρότης τῶν Ἁγίων ἐν οὐρανοῖς…
ltx/gr_gr_cog/me.m12.d05:meMA.Ode9C13.melody	@ltx/gr_gr_cog/he.h.m8:heHE.ExestiEpiTouto.name
ltx/gr_gr_cog/me.m12.d05:meMA.Ode9C13.mode	@ltx/gr_gr_cog/miscellanea:misc.Mode8
ltx/gr_gr_cog/me.m12.d05:meMA.Ode9C13.ode	@ltx/gr_gr_cog/miscellanea:misc.Ode9
ltx/gr_gr_cog/me.m12.d05:meMA.Ode9C13.text	Λαμπρότης τῶν Ἁγίων ἐν οὐρανοῖς, ὡς δικαίῳ σοι Πάτερ ἀνέτειλε· τὸν γὰρ Χριστόν, τὴν δικαιοσύνην τὴν ἀληθῆ, περιφανῶς ἠγάπησας, οὗ τὴν πολιτείαν ἰχνηλατῶν, τὴν τούτου ζωηφόρον, Παμμάκαρ ἐμιμήσω, ὡς δυνατόν σοι ἁγιότητα.
ltx/gr_gr_cog/me.m12.d05:meMA.Ode9C14.incipit	Πλουσίως Θεοφόρε λάμπων φωτί, καὶ…
ltx/gr_gr_cog/me.m12.d05:meMA.Ode9C14.melody	@ltx/gr_gr_cog/he.h.m8:heHE.ExestiEpiTouto.name
ltx/gr_gr_cog/me.m12.d05:meMA.Ode9C14.mode	@ltx/gr_gr_cog/miscellanea:misc.Mode8
ltx/gr_gr_cog/me.m12.d05:meMA.Ode9C14.ode	@ltx/gr_gr_cog/miscellanea:misc.Ode9
ltx/gr_gr_cog/me.m12.d05:meMA.Ode9C14.text	Πλουσίως Θεοφόρε λάμπων φωτί, καὶ χορείας Ἀγγέλων θεώμενος, φωτοειδεῖς, περιπολευούσας τὸ τρισσὸν φῶς, καὶ δεχομένας χάριτι, τὰς τῆς θεοπτίας ἐπιβολάς, μὴ παύσῃ ἱκετεύων, ἀφέσεως πταισμάτων, ἀξιωθῆναι τοὺς ὑμνοῦντάς σε.
ltx/gr_gr_cog/me.m12.d05:meMA.Ode9C1T.incipit	Ὡράθης ὦ Παρθένε Μήτηρ Θεοῦ…
ltx/gr_gr_cog/me.m12.d05:meMA.Ode9C1T.melody	@ltx/gr_gr_cog/he.h.m8:heHE.ExestiEpiTouto.name
ltx/gr_gr_cog/me.m12.d05:meMA.Ode9C1T.mode	@ltx/gr_gr_cog/miscellanea:misc.Mode8
ltx/gr_gr_cog/me.m12.d05:meMA.Ode9C1T.ode	@ltx/gr_gr_cog/miscellanea:misc.Ode9
ltx/gr_gr_cog/me.m12.d05:meMA.Ode9C1T.text	Ὡράθης ὦ Παρθένε Μήτηρ Θεοῦ, ὑπὲρ φύσιν τεκοῦσα ἐν σώματι, τὸν ἀγαθόν, Λόγον ἐκ καρδίας τῆς ἑαυτοῦ, ὃν ὁ Πατὴρ ἠρεύξατο, πάντων πρὸ αἰώνων ὡς ἀγαθός, ὃν νῦν καὶ τῶν σωμάτων, ἐπέκεινα νοοῦμεν, εἰ καὶ τὸ σῶμα περιβέβληται.
ltx/gr_gr_cog/me.m12.d05:meMA.Oikos1.text	Σοφίας ὑπάρχων βλάστημα, Σάββα Ὅσιε, παιδιόθεν ἐπόθησας Σοφίαν τὴν ἐνυπόστατον· ἣ συνοικήσασά σοι, ἀπὸ γῆς σε ἐχώρισε, καὶ πρὸς ὕψος ἀνήγαγεν, ἐξ ἀΰλων ἀνθέων πλέξασα στέφανον, καὶ τῇ σῇ ἐπιθεῖσα ἡγιασμένῃ κάρᾳ θεόφρον· ᾧπερ κεκοσμημένος, ἐξιλέωσαι τὸ Θεῖον, τοῦ δοθῆναί μοι σοφίαν λόγου ἐπαξίως, ὅπως ἀνυμνήσω τὴν ἁγίαν σου κοίμησιν, ἣν ἐδόξασε Χριστὸς ὁ Θεὸς ἡμῶν· διὸ καὶ ἡμεῖς κράζομέν σοι· Χαίροις Πάτερ ἀοίδιμε.
ltx/gr_gr_cog/me.m12.d05:meMA.PostGospelBoth.incipit	@ltx/gr_gr_cog/ho.ho03:hoMA.PostGospelTheotokos.incipit
ltx/gr_gr_cog/me.m12.d05:meMA.PostGospelBoth.melody	
ltx/gr_gr_cog/me.m12.d05:meMA.PostGospelBoth.mode	@ltx/gr_gr_cog/miscellanea:misc.Mode2
ltx/gr_gr_cog/me.m12.d05:meMA.PostGospelBoth.text	@ltx/gr_gr_cog/ho.ho03:hoMA.PostGospelTheotokos.text
ltx/gr_gr_cog/me.m12.d05:meMA.PostGospelGlory.incipit	@ltx/gr_gr_cog/ho.ho03:hoMA.PostGospelMonastic.incipit
ltx/gr_gr_cog/me.m12.d05:meMA.PostGospelGlory.melody	
ltx/gr_gr_cog/me.m12.d05:meMA.PostGospelGlory.mode	@ltx/gr_gr_cog/miscellanea:misc.Mode2
ltx/gr_gr_cog/me.m12.d05:meMA.PostGospelGlory.text	@ltx/gr_gr_cog/ho.ho03:hoMA.PostGospelMonastic.text
ltx/gr_gr_cog/me.m12.d05:meMA.PostGospelIdiomelon.incipit	@ltx/gr_gr_cog/me.m01.d15:meVE.AposGlory.incipit
ltx/gr_gr_cog/me.m12.d05:meMA.PostGospelIdiomelon.melody	
ltx/gr_gr_cog/me.m12.d05:meMA.PostGospelIdiomelon.mode	@ltx/gr_gr_cog/miscellanea:misc.Mode6
ltx/gr_gr_cog/me.m12.d05:meMA.PostGospelIdiomelon.text	@ltx/gr_gr_cog/me.m01.d15:meVE.AposGlory.text
ltx/gr_gr_cog/me.m12.d05:meSV.AposGlory.incipit	Δέσποινα ἀγαθή, τὰς ἁγίας σου…
ltx/gr_gr_cog/me.m12.d05:meSV.AposGlory.melody	@ltx/gr_gr_cog/he.a.m2:heAU.OikosTouEfratha.name
ltx/gr_gr_cog/me.m12.d05:meSV.AposGlory.mode	@ltx/gr_gr_cog/miscellanea:misc.Mode2
ltx/gr_gr_cog/me.m12.d05:meSV.AposGlory.text	Δέσποινα ἀγαθή, τὰς ἁγίας σου χεῖρας, πρὸς τὸν Υἱόν σου ἆρον, τὸν φιλόψυχον Πλάστην, οἰκτειρῆσαι τοὺς δούλους σου.
ltx/gr_gr_cog/me.m12.d05:meSV.Aposticha1.incipit	Ὤφθης ἐκ μητρικῶν, σπαργάνων θεοφόρε…
ltx/gr_gr_cog/me.m12.d05:meSV.Aposticha1.melody	@ltx/gr_gr_cog/he.a.m2:heAU.OikosTouEfratha.name
ltx/gr_gr_cog/me.m12.d05:meSV.Aposticha1.mode	@ltx/gr_gr_cog/miscellanea:misc.Mode2
ltx/gr_gr_cog/me.m12.d05:meSV.Aposticha1.text	Ὤφθης ἐκ μητρικῶν, σπαργάνων θεοφόρε, ἡγιασμένον σκεῦος, Πατὴρ ἡμῶν καὶ οἶκος, τοῦ παναγίου Πνεύματος.
ltx/gr_gr_cog/me.m12.d05:meSV.Aposticha2.incipit	Φέρων ἐν ταῖς χερσί, σοῦ…
ltx/gr_gr_cog/me.m12.d05:meSV.Aposticha2.melody	@ltx/gr_gr_cog/he.a.m2:heAU.OikosTouEfratha.name
ltx/gr_gr_cog/me.m12.d05:meSV.Aposticha2.mode	@ltx/gr_gr_cog/miscellanea:misc.Mode2
ltx/gr_gr_cog/me.m12.d05:meSV.Aposticha2.text	Φέρων ἐν ταῖς χερσί, σοῦ Σάββα τοῦ Κυρίου, Σταυρὸν τὰ τῶν δαιμόνων, φαντάσματα τελείως, Πατὴρ ἡμῶν ἠφάνισας.
ltx/gr_gr_cog/me.m12.d05:meSV.Aposticha3.incipit	Δόλους τῶν πονηρῶν, δαιμόνων θριαμβεύσας…
ltx/gr_gr_cog/me.m12.d05:meSV.Aposticha3.melody	@ltx/gr_gr_cog/he.a.m2:heAU.OikosTouEfratha.name
ltx/gr_gr_cog/me.m12.d05:meSV.Aposticha3.mode	@ltx/gr_gr_cog/miscellanea:misc.Mode2
ltx/gr_gr_cog/me.m12.d05:meSV.Aposticha3.text	Δόλους τῶν πονηρῶν, δαιμόνων θριαμβεύσας, τῇ τοῦ Σταυροῦ δυνάμει, ἐτράνωσας τὴν δόξαν, Χριστοῦ Σάββα Πατὴρ ἡμῶν.
ltx/gr_gr_cog/me.m12.d05:meSV.SticBoth.incipit	@ltx/gr_gr_cog/ho.ho23:hoCA.Troparion7.incipit
ltx/gr_gr_cog/me.m12.d05:meSV.SticBoth.melody	
ltx/gr_gr_cog/me.m12.d05:meSV.SticBoth.mode	@ltx/gr_gr_cog/miscellanea:misc.Mode2
ltx/gr_gr_cog/me.m12.d05:meSV.SticBoth.text	@ltx/gr_gr_cog/ho.ho23:hoCA.Troparion7.text
ltx/gr_gr_cog/me.m12.d05:meSV.SticGlory.incipit	@ltx/gr_gr_cog/me.m12.d05:meVE.Lity3.incipit
ltx/gr_gr_cog/me.m12.d05:meSV.SticGlory.melody	
ltx/gr_gr_cog/me.m12.d05:meSV.SticGlory.mode	@ltx/gr_gr_cog/miscellanea:misc.Mode2
ltx/gr_gr_cog/me.m12.d05:meSV.SticGlory.text	@ltx/gr_gr_cog/me.m12.d05:meVE.Lity3.text
ltx/gr_gr_cog/me.m12.d05:meSV.Stichera1.incipit	Θεωρὸς γεγένησαι νοΐ, νοερῶν δυνάμεων…
ltx/gr_gr_cog/me.m12.d05:meSV.Stichera1.melody	@ltx/gr_gr_cog/he.a.m1:heAU.PaneffimoiMartyres.name
ltx/gr_gr_cog/me.m12.d05:meSV.Stichera1.mode	@ltx/gr_gr_cog/miscellanea:misc.Mode1
ltx/gr_gr_cog/me.m12.d05:meSV.Stichera1.text	Θεωρὸς γεγένησαι νοΐ, νοερῶν δυνάμεων, ὡς πρακτικὸς θεῖα λόγια, διατιθέμενος, ἐν τῇ σῇ καρδίᾳ, ἐν ᾗ καὶ ἀνάβασιν, ὡς κλίμακα ἐστήριξας Ὅσιε, Σάββα Πατήρ ἡμῶν, καὶ πρεσβεύεις δωρηθῆναι ἡμῖν, τὴν εἰρήνην, καὶ τὸ μέγα ἔλεος.
ltx/gr_gr_cog/me.m12.d05:meSV.Stichera2.incipit	Σάββα Ὁσιώτατε τὴν σήν, ἐκ…
ltx/gr_gr_cog/me.m12.d05:meSV.Stichera2.melody	@ltx/gr_gr_cog/he.a.m1:heAU.PaneffimoiMartyres.name
ltx/gr_gr_cog/me.m12.d05:meSV.Stichera2.mode	@ltx/gr_gr_cog/miscellanea:misc.Mode1
ltx/gr_gr_cog/me.m12.d05:meSV.Stichera2.text	Σάββα Ὁσιώτατε τὴν σήν, ἐκ παιδὸς ἀνέθηκας, ζωὴν Χριστῷ τῷ Θεῷ ἡμῶν, ὑφʼ οὗ σθενούμενος, τῆς σαρκὸς τὰ πάθη, λογισμῷ ὑπέταξας, τὸ χεῖρον ὑποτάττων τῷ κρείττονι· διὸ ἱκέτευε, δωρηθῆναι ταῖς ψυχαῖς ἡμῶν, τὴν εἰρήνην, καὶ τὸ μέγα ἔλεος.
ltx/gr_gr_cog/me.m12.d05:meSV.Stichera3.incipit	Θεόφρον Πατὴρ ἡμῶν φωστήρ, καθωράθης…
ltx/gr_gr_cog/me.m12.d05:meSV.Stichera3.melody	@ltx/gr_gr_cog/he.a.m1:heAU.PaneffimoiMartyres.name
ltx/gr_gr_cog/me.m12.d05:meSV.Stichera3.mode	@ltx/gr_gr_cog/miscellanea:misc.Mode1
ltx/gr_gr_cog/me.m12.d05:meSV.Stichera3.text	Θεόφρον Πατὴρ ἡμῶν φωστήρ, καθωράθης μέγιστος, φωταγωγῶν τὴν ὑφήλιον, θαυμάτων λάμψεσι, καὶ ἐνθέων ἔργων· ὅθεν μετὰ κοίμησιν, τὸ ἄδυτόν σε φῶς ὑπεδέξατο· διὸ ἱκέτευε, δωρηθῆναι ταῖς ψυχαῖς ἡμῶν, τὴν εἰρήνην, καὶ τὸ μέγα ἔλεος.
ltx/gr_gr_cog/me.m12.d05:meVE.Apolytikion1ger.greekmelody	@ltx/gr_gr_cog/he.a.m1:heAU.TisErimouPolitis.greekname
ltx/gr_gr_cog/me.m12.d05:meVE.Apolytikion1ger.incipit	Τῶν Ὁσίων ἀκρότης καὶ Ἀγγέλοις…
ltx/gr_gr_cog/me.m12.d05:meVE.Apolytikion1ger.melody	@ltx/gr_gr_cog/he.a.m1:heAU.TisErimouPolitis.name
ltx/gr_gr_cog/me.m12.d05:meVE.Apolytikion1ger.mode	@ltx/gr_gr_cog/miscellanea:misc.Mode1
ltx/gr_gr_cog/me.m12.d05:meVE.Apolytikion1ger.poet	@ltx/gr_gr_cog/poets:po.Gerasimou
ltx/gr_gr_cog/me.m12.d05:meVE.Apolytikion1ger.text	Τῶν Ὁσίων ἀκρότης καὶ Ἀγγέλοις ἐφάμιλλος, ὡς ἡγιασμένος ἐδείχθης, ἐκ παιδὸς Σάββα Ὅσιε· οὐράνιον γὰρ βίον ὑπελθών, πρὸς ἔνθεον ζωὴν χειραγωγεῖς, διὰ λόγου τε καὶ πράξεως ἀληθοῦς, τοὺς πίστει ἐκβοῶντάς σοι· δόξα τῷ δεδωκότι σοι ἰσχύν, δόξα τῷ σὲ στεφανώσαντι, δόξα τῷ ἐνεργοῦντι διὰ σοῦ, πᾶσιν ἰάματα.
ltx/gr_gr_cog/me.m12.d05:meVE.AposGlory.incipit	Τῶν Μοναστῶν τὰ πλήθη, τὸν…
ltx/gr_gr_cog/me.m12.d05:meVE.AposGlory.melody	
ltx/gr_gr_cog/me.m12.d05:meVE.AposGlory.mode	@ltx/gr_gr_cog/miscellanea:misc.Mode8
ltx/gr_gr_cog/me.m12.d05:meVE.AposGlory.text	Τῶν Μοναστῶν τὰ πλήθη, τὸν καθηγητήν σε τιμῶμεν, Σάββα Πατὴρ ἡμῶν· διὰ σοῦ γὰρ τὴν τρίβον, τὴν ὄντως εὐθεῖαν, πορεύεσθαι ἔγνωμεν. Μακάριος εἶ, τῷ Χριστῷ δουλεύσας, καὶ ἐχθροῦ θριαμβεύσας τὴν δύναμιν, Ἀγγέλων συνόμιλε, Δικαίων ὁμόσκηνε, καὶ Ὁσίων, μεθʼ ὧν πρέσβευε τῷ Κυρίῳ, ἐλεηθῆναι τὰς ψυχὰς ἡμῶν.
ltx/gr_gr_cog/me.m12.d05:meVE.AposTheotokion.incipit	@ltx/gr_gr_cog/oc.m8.d1:ocVE.AposTheotokion.incipit
ltx/gr_gr_cog/me.m12.d05:meVE.AposTheotokion.melody	
ltx/gr_gr_cog/me.m12.d05:meVE.AposTheotokion.mode	@ltx/gr_gr_cog/miscellanea:misc.Mode8
ltx/gr_gr_cog/me.m12.d05:meVE.AposTheotokion.text	@ltx/gr_gr_cog/oc.m8.d1:ocVE.AposTheotokion.text
ltx/gr_gr_cog/me.m12.d05:meVE.Aposticha1.greekmelody	@ltx/gr_gr_cog/he.a.m5:heAU.ChairoisAskitikon.greekname
ltx/gr_gr_cog/me.m12.d05:meVE.Aposticha1.incipit	@ltx/gr_gr_cog/he.a.m5:heAU.ChairoisAskitikon.incipit
ltx/gr_gr_cog/me.m12.d05:meVE.Aposticha1.melody	@ltx/gr_gr_cog/he.a.m5:heAU.ChairoisAskitikon.melody
ltx/gr_gr_cog/me.m12.d05:meVE.Aposticha1.mode	@ltx/gr_gr_cog/miscellanea:misc.Mode5
ltx/gr_gr_cog/me.m12.d05:meVE.Aposticha1.text	@ltx/gr_gr_cog/he.a.m5:heAU.ChairoisAskitikon.text
ltx/gr_gr_cog/me.m12.d05:meVE.Aposticha2.incipit	Ἄνθραξ θεοφεγγὴς τῷ πυρί, προσομιλήσας…
ltx/gr_gr_cog/me.m12.d05:meVE.Aposticha2.melody	@ltx/gr_gr_cog/he.a.m5:heAU.ChairoisAskitikon.name
ltx/gr_gr_cog/me.m12.d05:meVE.Aposticha2.mode	@ltx/gr_gr_cog/miscellanea:misc.Mode5
ltx/gr_gr_cog/me.m12.d05:meVE.Aposticha2.text	Ἄνθραξ θεοφεγγὴς τῷ πυρί, προσομιλήσας θεοφόρε τοῦ Πνεύματος, ἐδείχθης ἐν κόσμῳ Σάββα, καταλαμπρύνων ψυχάς, τῶν πιστῶς θεόφρον προσιόντων σοι, πρὸς φῶς ὁδηγῶν αὐτούς, τὸ ἀνέσπερον Ὅσιε, ἐρημικοὺς δέ, δροσιζόμενος ἄνωθεν, θείᾳ χάριτι κατεμάρανας ἄνθρακας. Ὅθεν καὶ τὸν τῆς νίκης σοι, προδήλως δεδώρηται στέφανον Πάτερ τῆς θείας, δικαιοσύνης ὁ πρύτανις, Χριστός, ὃν δυσώπει, ταῖς ψυχαῖς ἡμῶν δοθῆναι, τὸ μέγα ἔλεος.
ltx/gr_gr_cog/me.m12.d05:meVE.Aposticha3.incipit	Κλῖμαξ οὐρανομήκης σαφῶς, ἡ πολιτεία…
ltx/gr_gr_cog/me.m12.d05:meVE.Aposticha3.melody	@ltx/gr_gr_cog/he.a.m5:heAU.ChairoisAskitikon.name
ltx/gr_gr_cog/me.m12.d05:meVE.Aposticha3.mode	@ltx/gr_gr_cog/miscellanea:misc.Mode5
ltx/gr_gr_cog/me.m12.d05:meVE.Aposticha3.text	Κλῖμαξ οὐρανομήκης σαφῶς, ἡ πολιτεία σου θεόφρον γεγένηται, διʼ ἧσπερ πρὸς ὕψος ἤρθης, καὶ τῷ Δεσπότῃ Χριστῷ, ὁμιλεῖν παμμάκαρ κατηξίωσαι, τὸν νοῦν ἐλλαμπόμενος, ταῖς ἐκεῖθεν ἐλλάμψεσι, μαρμαρυγαῖς δέ, ταῖς αὐτοῦ φωτιζόμενος, τὴν ἰσάγγελον, ἐκομίσω φαιδρότητα· ᾧ καὶ νῦν παριστάμενος, ἱκέτευε Ὅσιε, τοὺς ἐκτελοῦντας τὴν θείαν, καὶ πανσεβάσμιον μνήμην σου, σὺν σοὶ παραστῆναι, καὶ τῷ κόσμῳ δωρηθῆναι, τὸ μέγα ἔλεος.
ltx/gr_gr_cog/me.m12.d05:meVE.GeneralApolytikion1.name	Σάββα πατὴρ ἡμῶν ὅσιε.
ltx/gr_gr_cog/me.m12.d05:meVE.Lity1.incipit	Ἀσκητικὸν γυμνάσιον συγκροτήσας ἐπὶ γῆς…
ltx/gr_gr_cog/me.m12.d05:meVE.Lity1.melody	
ltx/gr_gr_cog/me.m12.d05:meVE.Lity1.mode	@ltx/gr_gr_cog/miscellanea:misc.Mode2
ltx/gr_gr_cog/me.m12.d05:meVE.Lity1.text	Ἀσκητικὸν γυμνάσιον συγκροτήσας ἐπὶ γῆς, Ὅσιε Σάββα, τῶν παθῶν τὰς προσβολάς, ἐν τῇ ῥοῇ τῶν δακρύων σου, πάσας ἀπήμβλυνας. Κλῖμαξ θεία καὶ σεπτή, εἰς οὐρανούς ἀνάγουσα, τοῖς πᾶσιν ἐγνωρίσθη, ὁ θεόληπτος βίος σου. Εὐσεβείας γὰρ καρποὺς ἐν αὐτῷ ἐνδειξάμενος, θεραπεύεις διʼ αὐτῶν τὰς ἀσθενείας τῶν παθῶν, τῶν πιστῶς ἐκβοώντων σοι. Χαίροις τῆς Ἑῴας ἀστὴρ χρυσαυγέστατος, καὶ τῶν Μοναζόντων λαμπαδοῦχε καὶ ποιμήν. Χαίροις Ἀοίδιμε, τὸ τῆς ἐρήμου κάλλιστον θρέμμα, καὶ τῆς Ἐκκλησίας ἀκράδαντον ἔρεισμα. Χαίροις τῶν πλανωμένων ὁ μέγας ὁδηγός. Χαίροις τὸ ἡμέτερον καύχημα, καὶ τῆς οἰκουμένης φαιδρὸν ἀγαλλίαμα.
ltx/gr_gr_cog/me.m12.d05:meVE.Lity2.incipit	Τὸν ἐπὶ γῆς Ἄγγελον, καὶ…
ltx/gr_gr_cog/me.m12.d05:meVE.Lity2.melody	
ltx/gr_gr_cog/me.m12.d05:meVE.Lity2.mode	@ltx/gr_gr_cog/miscellanea:misc.Mode2
ltx/gr_gr_cog/me.m12.d05:meVE.Lity2.text	Τὸν ἐπὶ γῆς Ἄγγελον, καὶ ἐν οὐρανοῖς ἄνθρωπον Θεοῦ, τοῦ κόσμου τὴν εὐκοσμίαν, τὴν τρυφὴν τῶν ἀγαθῶν καὶ τῶν ἀρετῶν, τῶν Ἀσκητῶν τὸ καύχημα, Σάββαν τιμήσωμεν· πεφυτευμένος γὰρ ἐν τῷ οἴκῳ τοῦ Θεοῦ, ἐξήνθησε δικαίως, καὶ ὡσεὶ κέδρος ἐν ἐρήμῳ, ἐπλήθυνε τὸ ποίμνιον τοῦ Χριστοῦ, τῶν λογικῶν προβάτων, ἐν ὁσιότητι καὶ δικαιοσύνῃ.
ltx/gr_gr_cog/me.m12.d05:meVE.Lity3.incipit	Ὅσιε Πάτερ, ἐκ βρέφους τὴν…
ltx/gr_gr_cog/me.m12.d05:meVE.Lity3.melody	
ltx/gr_gr_cog/me.m12.d05:meVE.Lity3.mode	@ltx/gr_gr_cog/miscellanea:misc.Mode2
ltx/gr_gr_cog/me.m12.d05:meVE.Lity3.text	Ὅσιε Πάτερ, ἐκ βρέφους τὴν ἀρετὴν ἐπιμελῶς ἀσκήσας, ὄργανον γέγονας τοῦ Ἁγίου Πνεύματος καὶ παρʼ αὐτοῦ λαβὼν τῶν θαυμάτων τὴν ἐνέργειαν, ἔπεισας τοὺς ἀνθρώπους καταφρονεῖν τῶν ἡδέων· νῦν δὲ τῷ θείῳ φωτί, καθαρώτερον ἐλλαμπόμενος, φώτισον καὶ ἡμῶν τὰς διανοίας, Σάββα Πατὴρ ἡμῶν.
ltx/gr_gr_cog/me.m12.d05:meVE.LityBoth.incipit	@ltx/gr_gr_cog/ho.ho23:hoCA.Troparion7.incipit
ltx/gr_gr_cog/me.m12.d05:meVE.LityBoth.melody	
ltx/gr_gr_cog/me.m12.d05:meVE.LityBoth.mode	@ltx/gr_gr_cog/miscellanea:misc.Mode2
ltx/gr_gr_cog/me.m12.d05:meVE.LityBoth.text	@ltx/gr_gr_cog/ho.ho23:hoCA.Troparion7.text
ltx/gr_gr_cog/me.m12.d05:meVE.LityGlory.incipit	Τῶν ὑπὲρ νοῦν ἀγαθῶν δεξάμενος…
ltx/gr_gr_cog/me.m12.d05:meVE.LityGlory.melody	
ltx/gr_gr_cog/me.m12.d05:meVE.LityGlory.mode	@ltx/gr_gr_cog/miscellanea:misc.Mode2
ltx/gr_gr_cog/me.m12.d05:meVE.LityGlory.poet	@ltx/gr_gr_cog/poets:po.Theofanous
ltx/gr_gr_cog/me.m12.d05:meVE.LityGlory.text	Τῶν ὑπὲρ νοῦν ἀγαθῶν δεξάμενος ἔρωτα, πάντα τὰ ἐν τῷ κόσμῳ τερπνὰ ὑπερεῖδες θεόληπτε· ἐντεῦθεν γὰρ τῷ καρπῷ οὐχ ἑάλως, καθάπερ Ἀδάμ· τὸν ὄφιν δὲ ἐναποκρουσάμενος διʼ ἐγκρατείας, ἀγγελικῶς τὸν βίον διήνυσας, καὶ νῦν ἐν οὐρανοῖς αὐλίζῃ, ἐπαπολαύων τοῦ ξύλου τῆς ζωῆς, Θεὸν ἱλεούμενος ὑπὲρ ἡμῶν, τῶν πιστῶς ἐκτελούντων, ἡγιασμένε Σάββα τὴν μνήμην σου.
ltx/gr_gr_cog/me.m12.d05:meVE.MM.GeneralApolytikion1.text	@ltx/gr_gr_cog/properties:media.key
ltx/gr_gr_cog/me.m12.d05:meVE.SticGlory.incipit	Τὸ κατʼ εἰκόνα τηρήσας ἀλώβητον…
ltx/gr_gr_cog/me.m12.d05:meVE.SticGlory.melody	
ltx/gr_gr_cog/me.m12.d05:meVE.SticGlory.mode	@ltx/gr_gr_cog/miscellanea:misc.Mode6
ltx/gr_gr_cog/me.m12.d05:meVE.SticGlory.text	Τὸ κατʼ εἰκόνα τηρήσας ἀλώβητον, νοῦν ἡγεμόνα κατὰ παθῶν ὀλεθρίων, ἀσκητικῶς ἐνστησάμενος, εἰς τὸ καθʼ ὁμοίωσιν ὡς δυνατὸν ἀνελήλυθας· ἀνδρικῶς γὰρ τὴν φύσιν ἐκβιασάμενος, ἔσπευσας τὸ χεῖρον καθυποτάξαι τῷ κρείττονι, καὶ τὴν σάρκα δουλῶσαι τῷ πνεύματι. Ὅθεν Μοναζόντων, ἀνεδείχθης ἀκρότης, πολιστὴς τῆς ἐρήμου, εὐδρομούντων ἀλείπτης, κανὼν ἀρετῆς ἀκριβέστατος, καὶ νῦν ἐν οὐρανοῖς, τῶν ἐσόπτρων λυθέντων Μακάριε, καθαρῶς ἐποπτεύεις, τὴν ἁγίαν Τριάδα, ἐντυγχάνων ἀμέσως, ὑπὲρ τῶν πίστει καὶ πόθῳ τιμώντων σε.
ltx/gr_gr_cog/me.m12.d05:meVE.SticTheotokion.incipit	@ltx/gr_gr_cog/oc.m6.d1:ocVE.SticTheotokion.incipit
ltx/gr_gr_cog/me.m12.d05:meVE.SticTheotokion.melody	
ltx/gr_gr_cog/me.m12.d05:meVE.SticTheotokion.mode	@ltx/gr_gr_cog/miscellanea:misc.Mode6
ltx/gr_gr_cog/me.m12.d05:meVE.SticTheotokion.text	@ltx/gr_gr_cog/oc.m6.d1:ocVE.SticTheotokion.text
ltx/gr_gr_cog/me.m12.d05:meVE.Stichera01.greekmelody	@ltx/gr_gr_cog/he.a.m5:heAU.OsiePater.greekname
ltx/gr_gr_cog/me.m12.d05:meVE.Stichera01.incipit	Σάββα θεόφρον, τῶν Ἀγγέλων Ἰσοστάσιε…
ltx/gr_gr_cog/me.m12.d05:meVE.Stichera01.melody	@ltx/gr_gr_cog/he.a.m5:heAU.OsiePater.name
ltx/gr_gr_cog/me.m12.d05:meVE.Stichera01.mode	@ltx/gr_gr_cog/miscellanea:misc.Mode5
ltx/gr_gr_cog/me.m12.d05:meVE.Stichera01.text	Σάββα θεόφρον, τῶν Ἀγγέλων Ἰσοστάσιε, ὁμόσκηνε Ὁσίων, συνόμιλε Προφητῶν, Μαρτύρων Ἀπόστόλων συγκληρονόμε, φῶς τὸ ἀνέσπερον, ὁ νῦν κατοικῶν, οὗ ταῖς φρυκτωρίαις, λαμπόμενος ταῖς θείαις, τῷ ἀκροτάτῳ τῶν ἐφετῶν, ὁ παρεστὼς παῤῥησίᾳ λελαμπρυσμένος, καὶ ἐνηδόμενος αὐτοῦ ταῖς θεωρίαις, καὶ ἐντρυφῶν αὐτοῦ, τῷ κάλλει ἀνενδότως, Χριστὸν ἱκέτευε, Χριστὸν δυσώπει Ὅσιε, δωρηθῆναι τῇ Ἐκκλησίᾳ ὁμόνοιαν, εἰρήνην, καὶ μέγα ἔλεος.
ltx/gr_gr_cog/me.m12.d05:meVE.Stichera02.incipit	Σάββα παμμάκαρ, ἐγκρατείας λύχνος ἄσβεστος…
ltx/gr_gr_cog/me.m12.d05:meVE.Stichera02.melody	@ltx/gr_gr_cog/he.a.m5:heAU.OsiePater.name
ltx/gr_gr_cog/me.m12.d05:meVE.Stichera02.mode	@ltx/gr_gr_cog/miscellanea:misc.Mode5
ltx/gr_gr_cog/me.m12.d05:meVE.Stichera02.text	Σάββα παμμάκαρ, ἐγκρατείας λύχνος ἄσβεστος, φωστὴρ τῶν Μοναζόντων ὁ διαυγέστατος, ἀγάπης φρυκτωρίαις λελαμπρυσμένος, πύργος ἀκλόνητος τῆς ὑπομονῆς, ἔρεισμα καὶ σθένος, τῶν πίστει σε τιμώντων, τῶν ἰαμάτων ὁ θησαυρός, ὁ πολιστὴς τῆς ἐρήμου ὡς ἀληθῶς, ὁ ὡς Παράδεισον αὐτὴν ἔνθεον δείξας, θείους προσφέρουσαν, καρπούς τῶν σῳζομένων, Χριστὸν ἱκέτευε, Χριστὸν δυσώπει Ὅσιε, δωρηθῆναι τῇ Ἐκκλησίᾳ, ὁμόνοιαν, εἰρήνην, καὶ μέγα ἔλεος.
ltx/gr_gr_cog/me.m12.d05:meVE.Stichera03.incipit	Σάββα θεόφρον, ἀρετῶν στῦλος ὁ…
ltx/gr_gr_cog/me.m12.d05:meVE.Stichera03.melody	@ltx/gr_gr_cog/he.a.m5:heAU.OsiePater.name
ltx/gr_gr_cog/me.m12.d05:meVE.Stichera03.mode	@ltx/gr_gr_cog/miscellanea:misc.Mode5
ltx/gr_gr_cog/me.m12.d05:meVE.Stichera03.text	Σάββα θεόφρον, ἀρετῶν στῦλος ὁ πύρινος, πυρσὸς ὁ ἐκ θαλάσσης, τῆς κοσμικῆς τοὺς λαούς, λιμένα πρὸς τὸν θεῖον καθοδηγῶν, πλάνης τὰ πνεύματα ὁ καταβαλών, Πνεύματος Ἁγίου τὸ καθαρὸν δοχεῖον, ὁ ποδηγέτης τῶν Μοναστῶν, ἠκριβωμένη τε στάθμη τῆς ἐγκρατείας, τῆς ταπεινώσεως, περίβλεπτον τὸ ὕψος, κρήνη ἡ βρύουσα, ἰάσεων πελάγη, Χριστὸν ἱκέτευε, Χριστὸν δυσώπει Ὅσιε, δωρηθῆναι τῇ Ἐκκλησία, ὁμόνοιαν, εἰρήνην, καὶ μέγα ἔλεος.
