ltx/gr_gr_cog/me.m10.d24:meDA.commemoration.first	Μνήμη τοῦ Ἁγίου Μεγαλομάρτυρος Ἀρέθα, καὶ τῆς Συνοδίας αὐτοῦ
ltx/gr_gr_cog/me.m10.d24:meDA.commemoration.first_name	
ltx/gr_gr_cog/me.m10.d24:meDA.commemoration.first_short	Μνήμη τοῦ Ἁγίου Μεγαλομάρτυρος Ἀρέθα, καὶ τῆς Συνοδίας αὐτοῦ
ltx/gr_gr_cog/me.m10.d24:meDA.commemoration.first_title	@ltx/gr_gr_cog/titles:ti.Saints
ltx/gr_gr_cog/me.m10.d24:meDA.commemoration.full	Μνήμη τοῦ Ἁγίου Μεγαλομάρτυρος Ἀρέθα, καὶ τῆς Συνοδίας αὐτοῦ
ltx/gr_gr_cog/me.m10.d24:meDA.commemoration.second_name	
ltx/gr_gr_cog/me.m10.d24:meDA.commemoration.second_title	
ltx/gr_gr_cog/me.m10.d24:meDA.date	Τῌ ΚΔʹ ΟΚΤΩΒΡΙΟΥ
ltx/gr_gr_cog/me.m10.d24:meDA.fordate	διὰ τὴν 24ην Ὀκτωβρίου
ltx/gr_gr_cog/me.m10.d24:meDA.insert1	καὶ τοῦ ἁγίου Μεγαλομάρτυρος Ἀρέθα, καὶ τῆς συνοδίας αὐτοῦ,
ltx/gr_gr_cog/me.m10.d24:meDA.insert2	οὗ καὶ τὴν μνήμην ἐπιτελοῦμεν·
ltx/gr_gr_cog/me.m10.d24:meDA.note	
ltx/gr_gr_cog/me.m10.d24:meDA.pdfcoverdate	τῆς 24ης Ὀκτωβρίου,
ltx/gr_gr_cog/me.m10.d24:meDA.pdfheaderdate	τῆς 24ης Ὀκτωβρίου
ltx/gr_gr_cog/me.m10.d24:meHO.commemorations	
ltx/gr_gr_cog/me.m10.d24:meHO.note1	
ltx/gr_gr_cog/me.m10.d24:meHO.note2	
ltx/gr_gr_cog/me.m10.d24:meHO.number	
ltx/gr_gr_cog/me.m10.d24:meHO.rank	
ltx/gr_gr_cog/me.m10.d24:meLE.commemoration1	Μνήμη τοῦ Ἁγίου Μεγαλομάρτυρος Ἀρέθα, καὶ τῆς Συνοδίας αὐτοῦ.
ltx/gr_gr_cog/me.m10.d24:meLE.commemoration2	
ltx/gr_gr_cog/me.m10.d24:meLI.Kontakion1.greekmelody	@ltx/gr_gr_cog/me.m10.d24:meMA.Kontakion1.greekmelody
ltx/gr_gr_cog/me.m10.d24:meLI.Kontakion1.incipit	@ltx/gr_gr_cog/me.m10.d24:meMA.Kontakion1.incipit
ltx/gr_gr_cog/me.m10.d24:meLI.Kontakion1.melody	@ltx/gr_gr_cog/me.m10.d24:meMA.Kontakion1.melody
ltx/gr_gr_cog/me.m10.d24:meLI.Kontakion1.mode	@ltx/gr_gr_cog/me.m10.d24:meMA.Kontakion1.mode
ltx/gr_gr_cog/me.m10.d24:meLI.Kontakion1.text	@ltx/gr_gr_cog/me.m10.d24:meMA.Kontakion1.text
ltx/gr_gr_cog/me.m10.d24:meLI.Megalynarion.text	
ltx/gr_gr_cog/me.m10.d24:meMA.C1.acrostic.notice1	οὗ ἡ Ἀκροστιχίς·
ltx/gr_gr_cog/me.m10.d24:meMA.C1.acrostic.text	Μαρτυρικὴν σύνοδον Θεοτερπέα μέλψομεν ὕμνοις.
ltx/gr_gr_cog/me.m10.d24:meMA.C1.acrostic.title	Κανὼν τῶν Ἁγίων,
ltx/gr_gr_cog/me.m10.d24:meMA.C1.poet	@ltx/gr_gr_cog/poets:po.Theofanous
ltx/gr_gr_cog/me.m10.d24:meMA.C1.title	@ltx/gr_gr_cog/titles:ti.CanonSaintM
ltx/gr_gr_cog/me.m10.d24:meMA.C1.verse	@ltx/gr_gr_cog/prayers:pr.verse_SaintM.text
ltx/gr_gr_cog/me.m10.d24:meMA.ExapTheotokion.incipit	Φθαρεῖσαν ἀνεκαίνισας, τὴν φύσιν τοῦ…
ltx/gr_gr_cog/me.m10.d24:meMA.ExapTheotokion.melody	@ltx/gr_gr_cog/he.a.m2:heAU.GynaikesAkoutisthite.name
ltx/gr_gr_cog/me.m10.d24:meMA.ExapTheotokion.mode	@ltx/gr_gr_cog/miscellanea:misc.Mode2
ltx/gr_gr_cog/me.m10.d24:meMA.ExapTheotokion.text	Φθαρεῖσαν ἀνεκαίνισας, τὴν φύσιν τοῦ Προπάτορος, ὑπερφυῶς συλλαβοῦσα, καὶ ἀπειράνδρως τεκοῦσα, τὸν Ποιητὴν τῆς κτίσεως, ὑφʼ οὗ ῥωσθέντες ἤθλησαν, χοροὶ Μαρτύρων μέλποντες, σὲ τῆς ἡμῶν σωτηρίας, τὴν ἀπαρχὴν Θεοτόκε.
ltx/gr_gr_cog/me.m10.d24:meMA.Exaposteilarion1.greekmelody	@ltx/gr_gr_cog/he.a.m2:heAU.GynaikesAkoutisthite.greekname
ltx/gr_gr_cog/me.m10.d24:meMA.Exaposteilarion1.incipit	Ἀρέθα παναοίδιμε, σὺν τοῖς συνάθλοις…
ltx/gr_gr_cog/me.m10.d24:meMA.Exaposteilarion1.melody	@ltx/gr_gr_cog/he.a.m2:heAU.GynaikesAkoutisthite.name
ltx/gr_gr_cog/me.m10.d24:meMA.Exaposteilarion1.mode	@ltx/gr_gr_cog/miscellanea:misc.Mode2
ltx/gr_gr_cog/me.m10.d24:meMA.Exaposteilarion1.text	Ἀρέθα παναοίδιμε, σὺν τοῖς συνάθλοις πρέσβευε, Χριστῷ βραβεῦσαι τῷ κόσμῳ, ὁμόνοιαν καὶ εἰρήνην, τῷ εὐσεβείας κράτορι, καὶ Βασιλεῖ θεόφρονι, Μεγαλομάρτυς ἔνδοξε, καὶ ἱλασμὸν τοῖς τελοῦσι, τὴν ἱερὰν ἡμῶν μνήμην.
ltx/gr_gr_cog/me.m10.d24:meMA.Kontakion1.greekmelody	@ltx/gr_gr_cog/he.a.m4:heAU.EpefanisSimeron.greekname
ltx/gr_gr_cog/me.m10.d24:meMA.Kontakion1.incipit	Εὐφροσύνης πρόξενος, ἡμῖν ἐπέστη, ἡ…
ltx/gr_gr_cog/me.m10.d24:meMA.Kontakion1.melody	@ltx/gr_gr_cog/he.a.m4:heAU.EpefanisSimeron.name
ltx/gr_gr_cog/me.m10.d24:meMA.Kontakion1.mode	@ltx/gr_gr_cog/miscellanea:misc.Mode4
ltx/gr_gr_cog/me.m10.d24:meMA.Kontakion1.text	Εὐφροσύνης πρόξενος, ἡμῖν ἐπέστη, ἡ φωσφόρος σήμερον, τῶν Ἀθλοφόρων ἑορτή· ἣν ἀνυμνοῦντες δοξάζομεν, τὸν ἐν ὑψίστοις ὑπάρχοντα Κύριον.
ltx/gr_gr_cog/me.m10.d24:meMA.Ode1C11.greekmelody	@ltx/gr_gr_cog/he.h.m8:heHE.AsmaAnapempsomen.greekname
ltx/gr_gr_cog/me.m10.d24:meMA.Ode1C11.incipit	Μάρτυς ἀθλοφόρε τοῦ Χριστοῦ, Ἀρέθα…
ltx/gr_gr_cog/me.m10.d24:meMA.Ode1C11.melody	@ltx/gr_gr_cog/he.h.m8:heHE.AsmaAnapempsomen.name
ltx/gr_gr_cog/me.m10.d24:meMA.Ode1C11.mode	@ltx/gr_gr_cog/miscellanea:misc.Mode8
ltx/gr_gr_cog/me.m10.d24:meMA.Ode1C11.ode	@ltx/gr_gr_cog/miscellanea:misc.Ode1
ltx/gr_gr_cog/me.m10.d24:meMA.Ode1C11.text	Μάρτυς ἀθλοφόρε τοῦ Χριστοῦ, Ἀρέθα παμμακάριστε ταῖς ἱκεσίαις σου, καὶ τῶν σὺν σοὶ Μαρτύρων, τὸν νοῦν μου καταύγασον, ὅπως ὑμῶν ὑμνήσω, τὴν φωσφόρον καὶ ἔνθεον μνήμην.
ltx/gr_gr_cog/me.m10.d24:meMA.Ode1C12.incipit	Ἄνω τὸ πολίτευμα σαφῶς, ἐν…
ltx/gr_gr_cog/me.m10.d24:meMA.Ode1C12.melody	@ltx/gr_gr_cog/he.h.m8:heHE.AsmaAnapempsomen.name
ltx/gr_gr_cog/me.m10.d24:meMA.Ode1C12.mode	@ltx/gr_gr_cog/miscellanea:misc.Mode8
ltx/gr_gr_cog/me.m10.d24:meMA.Ode1C12.ode	@ltx/gr_gr_cog/miscellanea:misc.Ode1
ltx/gr_gr_cog/me.m10.d24:meMA.Ode1C12.text	Ἄνω τὸ πολίτευμα σαφῶς, ἐν οὐρανοῖς κτησάμενος, θεομακάριστε, Χριστοῦ τῇ ἐκμιμήσει, σαυτὸν παραδέδωκας, πόθῳ τοῦ Μαρτυρίου, τοῖς ἀνόμοις Ἑβραίοις θεόφρον.
ltx/gr_gr_cog/me.m10.d24:meMA.Ode1C13.incipit	Ῥῆμα παραβὰς τὸ τοῦ Θεοῦ…
ltx/gr_gr_cog/me.m10.d24:meMA.Ode1C13.melody	@ltx/gr_gr_cog/he.h.m8:heHE.AsmaAnapempsomen.name
ltx/gr_gr_cog/me.m10.d24:meMA.Ode1C13.mode	@ltx/gr_gr_cog/miscellanea:misc.Mode8
ltx/gr_gr_cog/me.m10.d24:meMA.Ode1C13.ode	@ltx/gr_gr_cog/miscellanea:misc.Ode1
ltx/gr_gr_cog/me.m10.d24:meMA.Ode1C13.text	Ῥῆμα παραβὰς τὸ τοῦ Θεοῦ, Ἑβραῖος ὁ παράνομος, καὶ ἀδικώτατος τὴν θεόλεκτον ποίμνην, Χριστοῦ ἐλυμήνατο, ὅμως εἰσπράττει δίκην, τῇ δικαίᾳ καὶ θείᾳ προνοία.
ltx/gr_gr_cog/me.m10.d24:meMA.Ode1C14.incipit	Τρίβον διοδεύων ἀληθῶς, πρὸς οὐρανὸν…
ltx/gr_gr_cog/me.m10.d24:meMA.Ode1C14.melody	@ltx/gr_gr_cog/he.h.m8:heHE.AsmaAnapempsomen.name
ltx/gr_gr_cog/me.m10.d24:meMA.Ode1C14.mode	@ltx/gr_gr_cog/miscellanea:misc.Mode8
ltx/gr_gr_cog/me.m10.d24:meMA.Ode1C14.ode	@ltx/gr_gr_cog/miscellanea:misc.Ode1
ltx/gr_gr_cog/me.m10.d24:meMA.Ode1C14.text	Τρίβον διοδεύων ἀληθῶς, πρὸς οὐρανὸν τὴν φέρουσαν, Χριστῷ προσήγαγες, Μαρτύρων Ἐκκλησίαν, Ἀρέθα πανεύφημε, πάσης ἐξ ἡλικίας, καὶ ἐκ γένους παντὸς ἠθροισμένην.
ltx/gr_gr_cog/me.m10.d24:meMA.Ode1C1T.incipit	Ὕμνοις τὴν πανάχραντον πιστοί, Παρθένον…
ltx/gr_gr_cog/me.m10.d24:meMA.Ode1C1T.melody	@ltx/gr_gr_cog/he.h.m8:heHE.AsmaAnapempsomen.name
ltx/gr_gr_cog/me.m10.d24:meMA.Ode1C1T.mode	@ltx/gr_gr_cog/miscellanea:misc.Mode8
ltx/gr_gr_cog/me.m10.d24:meMA.Ode1C1T.ode	@ltx/gr_gr_cog/miscellanea:misc.Ode1
ltx/gr_gr_cog/me.m10.d24:meMA.Ode1C1T.text	Ὕμνοις τὴν πανάχραντον πιστοί, Παρθένον εὐφημήσωμεν, τὴν Θεομήτορα, τὴν κεχαριτωμένην, τὴν σκέπην τὴν ἔνθεον, τὸν εὔδιον λιμένα, τὴν ἁπάντων πιστῶν σωτηρίαν.
ltx/gr_gr_cog/me.m10.d24:meMA.Ode3C11.greekmelody	@ltx/gr_gr_cog/he.h.m8:heHE.OuraniasApsidos.greekname
ltx/gr_gr_cog/me.m10.d24:meMA.Ode3C11.incipit	Ῥωννυμένην ὁρῶντες, τῇ τοῦ Σταυροῦ…
ltx/gr_gr_cog/me.m10.d24:meMA.Ode3C11.melody	@ltx/gr_gr_cog/he.h.m8:heHE.OuraniasApsidos.name
ltx/gr_gr_cog/me.m10.d24:meMA.Ode3C11.mode	@ltx/gr_gr_cog/miscellanea:misc.Mode8
ltx/gr_gr_cog/me.m10.d24:meMA.Ode3C11.ode	@ltx/gr_gr_cog/miscellanea:misc.Ode3
ltx/gr_gr_cog/me.m10.d24:meMA.Ode3C11.text	Ῥωννυμένην ὁρῶντες, τῇ τοῦ Σταυροῦ χάριτι, σοῦ τὴν Ἐκκλησίαν, Ἑβραίων παῖδες παράνομοι, φθόνῳ τηκόμενοι, ἐν αἰκισμοῖς πολυτρόποις, ἀφειδῶς ᾐκίζοντο, μόνε Φιλανθρωπε.
ltx/gr_gr_cog/me.m10.d24:meMA.Ode3C12.incipit	Ἰοβόλον τὴν γλῶσσαν, οἱ δυσσεβεῖς…
ltx/gr_gr_cog/me.m10.d24:meMA.Ode3C12.melody	@ltx/gr_gr_cog/he.h.m8:heHE.OuraniasApsidos.name
ltx/gr_gr_cog/me.m10.d24:meMA.Ode3C12.mode	@ltx/gr_gr_cog/miscellanea:misc.Mode8
ltx/gr_gr_cog/me.m10.d24:meMA.Ode3C12.ode	@ltx/gr_gr_cog/miscellanea:misc.Ode3
ltx/gr_gr_cog/me.m10.d24:meMA.Ode3C12.text	Ἰοβόλον τὴν γλῶσσαν, οἱ δυσσεβεῖς ἔχοντες, καὶ σὲ βλασφημοῦντες τὸν τούτων, τοὺς προγεννήτορας, ἐλευθερώσαντα, τῆς παλαιᾶς τυραννίδος, τοὺς εἰς σὲ πιστεύοντας, Σῶτερ κατέσφαξαν.
ltx/gr_gr_cog/me.m10.d24:meMA.Ode3C13.incipit	Κατὰ μόνας ὁ πλάσας, θεουργικῷ…
ltx/gr_gr_cog/me.m10.d24:meMA.Ode3C13.melody	@ltx/gr_gr_cog/he.h.m8:heHE.OuraniasApsidos.name
ltx/gr_gr_cog/me.m10.d24:meMA.Ode3C13.mode	@ltx/gr_gr_cog/miscellanea:misc.Mode8
ltx/gr_gr_cog/me.m10.d24:meMA.Ode3C13.ode	@ltx/gr_gr_cog/miscellanea:misc.Ode3
ltx/gr_gr_cog/me.m10.d24:meMA.Ode3C13.text	Κατὰ μόνας ὁ πλάσας, θεουργικῷ νεύματι, σὺ τὰς τῶν ἀνθρώπων καρδίας, τίς τῆς προνοίας σου, βάθος δυνήσεται, καταλαβεῖν ὅπως ποίμνην, ἣν Χριστὲ συνήγαγες, λύκοις παρέδωκας;
ltx/gr_gr_cog/me.m10.d24:meMA.Ode3C14.incipit	Ἡ θεόφρων σου ποίμνη, βαρβαρικοῖς…
ltx/gr_gr_cog/me.m10.d24:meMA.Ode3C14.melody	@ltx/gr_gr_cog/he.h.m8:heHE.OuraniasApsidos.name
ltx/gr_gr_cog/me.m10.d24:meMA.Ode3C14.mode	@ltx/gr_gr_cog/miscellanea:misc.Mode8
ltx/gr_gr_cog/me.m10.d24:meMA.Ode3C14.ode	@ltx/gr_gr_cog/miscellanea:misc.Ode3
ltx/gr_gr_cog/me.m10.d24:meMA.Ode3C14.text	Ἡ θεόφρων σου ποίμνη, βαρβαρικοῖς ξίφεσι, κατατεμνομένη προθύμως, ἐπεκαλεῖτό σε. Δέξαι τὰ πνεύματα, καὶ τὰς ψυχὰς ἡμῶν Σῶτερ, καὶ πρὸς φῶς ὁδήγησον, τῆς βασιλείας σου.
ltx/gr_gr_cog/me.m10.d24:meMA.Ode3C1T.incipit	Νεκρωθέντα μὲ πάλαι, πρὸς τὴν…
ltx/gr_gr_cog/me.m10.d24:meMA.Ode3C1T.melody	@ltx/gr_gr_cog/he.h.m8:heHE.OuraniasApsidos.name
ltx/gr_gr_cog/me.m10.d24:meMA.Ode3C1T.mode	@ltx/gr_gr_cog/miscellanea:misc.Mode8
ltx/gr_gr_cog/me.m10.d24:meMA.Ode3C1T.ode	@ltx/gr_gr_cog/miscellanea:misc.Ode3
ltx/gr_gr_cog/me.m10.d24:meMA.Ode3C1T.text	Νεκρωθέντα μὲ πάλαι, πρὸς τὴν ζωὴν Πάναγνε, πάλιν ἐπανήγαγες, μόνη τὴν ἐνυπόστατον, ζωὴν γεννήσασα· ᾗ προσβαλὼν διεῤῥάγη, προφανῶς ὁ θάνατος, ὁ δυσμενέστατος.
ltx/gr_gr_cog/me.m10.d24:meMA.Ode3H.greekmelody	@ltx/gr_gr_cog/he.h.m8:heHE.OuraniasApsidos.greekname
ltx/gr_gr_cog/me.m10.d24:meMA.Ode3H.incipit	@ltx/gr_gr_cog/he.h.m8:heHE.OuraniasApsidos.incipit
ltx/gr_gr_cog/me.m10.d24:meMA.Ode3H.melody	@ltx/gr_gr_cog/he.h.m8:heHE.OuraniasApsidos.melody
ltx/gr_gr_cog/me.m10.d24:meMA.Ode3H.mode	@ltx/gr_gr_cog/miscellanea:misc.Mode8
ltx/gr_gr_cog/me.m10.d24:meMA.Ode3H.ode	@ltx/gr_gr_cog/miscellanea:misc.Ode3
ltx/gr_gr_cog/me.m10.d24:meMA.Ode3H.text	@ltx/gr_gr_cog/he.h.m8:heHE.OuraniasApsidos.text
ltx/gr_gr_cog/me.m10.d24:meMA.Ode3Kathisma1.greekmelody	@ltx/gr_gr_cog/he.a.m8:heAU.TinSofianKaiLogon.greekname
ltx/gr_gr_cog/me.m10.d24:meMA.Ode3Kathisma1.incipit	Τοῦ Σταυροῦ τῇ δυνάμει καθοπλισθείς…
ltx/gr_gr_cog/me.m10.d24:meMA.Ode3Kathisma1.melody	@ltx/gr_gr_cog/he.a.m8:heAU.TinSofianKaiLogon.name
ltx/gr_gr_cog/me.m10.d24:meMA.Ode3Kathisma1.mode	@ltx/gr_gr_cog/miscellanea:misc.Mode8
ltx/gr_gr_cog/me.m10.d24:meMA.Ode3Kathisma1.text	Τοῦ Σταυροῦ τῇ δυνάμει καθοπλισθείς, καὶ τῇ πίστει τειχίσας πόλιν τὴν σήν, τοῖς ἔργοις κατῄσχυνας, τοῦ τυράννου τὸ φρύαγμα, ὑπομονῆς δὲ τύπος, ἐνθέου γενόμενος, τῷ Χριστῷ προσήγαγες, ἐν ταύτῃ τοὺς Μάρτυρας· ὅθεν συνελθόντες, κατὰ χρέος τιμῶμεν, Ἀρέθα ἀείμνηστε, τὴν πανέορτον μνήμην σου. Ἀθλοφόρε μακάριε, πρέσβευε Χριστῷ τῷ Θεῷ, τῶν πταισμάτων λύτρωσιν δωρήσασθαι, τοῖς ἑορτάζουσι πόθω, τὴν ἁγίαν μνήμην σου.
ltx/gr_gr_cog/me.m10.d24:meMA.Ode3KathismaSt.incipit	Ἀνελκόμενον Σῶτερ ἐν τῷ Σταυρῷ…
ltx/gr_gr_cog/me.m10.d24:meMA.Ode3KathismaSt.melody	@ltx/gr_gr_cog/he.a.m8:heAU.TinSofianKaiLogon.name
ltx/gr_gr_cog/me.m10.d24:meMA.Ode3KathismaSt.mode	@ltx/gr_gr_cog/miscellanea:misc.Mode8
ltx/gr_gr_cog/me.m10.d24:meMA.Ode3KathismaSt.text	Ἀνελκόμενον Σῶτερ ἐν τῷ Σταυρῷ, ἀγαθότητος πλούτῳ φύσει Θεόν, ὁρῶσα ἡ κτίσις σε, ἀκατάληπτε ἔτρεμε, καὶ κλονουμένη πᾶσα, τῷ φόβω συνείχετο, ἀλλʼ Ἰουδαίων δῆμος, Πιλάτῳ ἐκραύγαζεν. Ἆρον ὡς κακοῦργον, καὶ σταυρῷ ἀναρτήσας, τοῖς ἥλοις καθήλωσον, καὶ τῇ λόγχη ἐκκέντησον, καὶ θανάτῳ κατάγαγε· καὶ ταῦτα πάσχοντά σε δεινῶς, καθορῶσα ἔλεγεν ἡ Μήτηρ σου·. Ὑμνολογῶ σου τὴν ἄκραν, Υἱὲ συγκατάβασιν.
ltx/gr_gr_cog/me.m10.d24:meMA.Ode3KathismaT.incipit	@ltx/gr_gr_cog/me.m10.d09:meMA.Ode3KathismaT.incipit
ltx/gr_gr_cog/me.m10.d24:meMA.Ode3KathismaT.melody	@ltx/gr_gr_cog/he.a.m8:heAU.TinSofianKaiLogon.name
ltx/gr_gr_cog/me.m10.d24:meMA.Ode3KathismaT.mode	@ltx/gr_gr_cog/miscellanea:misc.Mode8
ltx/gr_gr_cog/me.m10.d24:meMA.Ode3KathismaT.text	@ltx/gr_gr_cog/me.m10.d09:meMA.Ode3KathismaT.text
ltx/gr_gr_cog/me.m10.d24:meMA.Ode4C11.greekmelody	@ltx/gr_gr_cog/he.h.m8:heHE.SyMouIschys.greekname
ltx/gr_gr_cog/me.m10.d24:meMA.Ode4C11.incipit	Συναγωγή, κραταιουμένη τῷ Πνεύματι, καὶ…
ltx/gr_gr_cog/me.m10.d24:meMA.Ode4C11.melody	@ltx/gr_gr_cog/he.h.m8:heHE.SyMouIschys.name
ltx/gr_gr_cog/me.m10.d24:meMA.Ode4C11.mode	@ltx/gr_gr_cog/miscellanea:misc.Mode8
ltx/gr_gr_cog/me.m10.d24:meMA.Ode4C11.ode	@ltx/gr_gr_cog/miscellanea:misc.Ode4
ltx/gr_gr_cog/me.m10.d24:meMA.Ode4C11.text	Συναγωγή, κραταιουμένη τῷ Πνεύματι, καὶ χορεία, θεία καὶ ὑπέρλαμπρος, μαρτυρικὸς δῆμος καὶ στρατός, ὁ τροπαιοφόρος, Ἀρέθαν ἔχων ταξίαρχον, ὑμνείσθω φιλοτίμως, ὑπὸ τῶν μελῳδούντων· τῇ δυνάμει σου δόξα Φιλάνθρωπε.
ltx/gr_gr_cog/me.m10.d24:meMA.Ode4C12.incipit	Ὑπὸ τῆς σῆς, συγκροτουμένη συνέσεως…
ltx/gr_gr_cog/me.m10.d24:meMA.Ode4C12.melody	@ltx/gr_gr_cog/he.h.m8:heHE.SyMouIschys.name
ltx/gr_gr_cog/me.m10.d24:meMA.Ode4C12.mode	@ltx/gr_gr_cog/miscellanea:misc.Mode8
ltx/gr_gr_cog/me.m10.d24:meMA.Ode4C12.ode	@ltx/gr_gr_cog/miscellanea:misc.Ode4
ltx/gr_gr_cog/me.m10.d24:meMA.Ode4C12.text	Ὑπὸ τῆς σῆς, συγκροτουμένη συνέσεως, ἡ θεόφρων, πόλις σου Πανόλβιε, τοῦ πολιᾷ, λάμποντος σεμνή, πρὸς τοὺς παρανόμους, ἀνδρείως διηγωνίσατο, καὶ νίκην ἀραμένη, μελῳδεῖ τῷ Σωτῆρι· τῇ δυνάμει σου δόξα Φιλάνθρωπε.
ltx/gr_gr_cog/me.m10.d24:meMA.Ode4C13.incipit	Νόμῳ καινῷ, ζωοποιοῦντι τῷ Πνεύματι…
ltx/gr_gr_cog/me.m10.d24:meMA.Ode4C13.melody	@ltx/gr_gr_cog/he.h.m8:heHE.SyMouIschys.name
ltx/gr_gr_cog/me.m10.d24:meMA.Ode4C13.mode	@ltx/gr_gr_cog/miscellanea:misc.Mode8
ltx/gr_gr_cog/me.m10.d24:meMA.Ode4C13.ode	@ltx/gr_gr_cog/miscellanea:misc.Ode4
ltx/gr_gr_cog/me.m10.d24:meMA.Ode4C13.text	Νόμῳ καινῷ, ζωοποιοῦντι τῷ Πνεύματι, πεφραγμένη, νόμον τὸν τοῦ γράμματος, τὸν ἀναιροῦντα ἡ εὐσεβής, πόλις ὑπερέσχε, τῇ τῆς ψυχῆς καθαρότητι, καὶ τρόπων εὐγενεία, τῷ Χριστῷ μελῳδοῦσα· τῇ δυνάμει σου δόξα Φιλάνθρωπε.
ltx/gr_gr_cog/me.m10.d24:meMA.Ode4C14.incipit	Ὄντως Θεοῦ, πόλις ἐδείχθης Ὑπέρτιμε…
ltx/gr_gr_cog/me.m10.d24:meMA.Ode4C14.melody	@ltx/gr_gr_cog/he.h.m8:heHE.SyMouIschys.name
ltx/gr_gr_cog/me.m10.d24:meMA.Ode4C14.mode	@ltx/gr_gr_cog/miscellanea:misc.Mode8
ltx/gr_gr_cog/me.m10.d24:meMA.Ode4C14.ode	@ltx/gr_gr_cog/miscellanea:misc.Ode4
ltx/gr_gr_cog/me.m10.d24:meMA.Ode4C14.text	Ὄντως Θεοῦ, πόλις ἐδείχθης Ὑπέρτιμε, καὶ Μαρτύρων, θεῖον ἐνδιαίτημα, καὶ περὶ σοῦ ᾄδεται φαιδρῶς, νῦν δεδοξασμένα, μεγάλα καὶ ἀξιάκουστα· χορὸν γὰρ μελῳδοῦντα, τῷ Δεσπότῃ προσῆγες· τῇ δυνάμει σου δόξα Φιλάνθρωπε.
ltx/gr_gr_cog/me.m10.d24:meMA.Ode4C1T.incipit	Δαυϊτικῆς, ἐκ βασιλίδος βλαστήσασα, συγγενείας…
ltx/gr_gr_cog/me.m10.d24:meMA.Ode4C1T.melody	@ltx/gr_gr_cog/he.h.m8:heHE.SyMouIschys.name
ltx/gr_gr_cog/me.m10.d24:meMA.Ode4C1T.mode	@ltx/gr_gr_cog/miscellanea:misc.Mode8
ltx/gr_gr_cog/me.m10.d24:meMA.Ode4C1T.ode	@ltx/gr_gr_cog/miscellanea:misc.Ode4
ltx/gr_gr_cog/me.m10.d24:meMA.Ode4C1T.text	Δαυϊτικῆς, ἐκ βασιλίδος βλαστήσασα, συγγενείας, τὸν παμβασιλεύοντα, τὸν πρὸ αἰώνων ἐκ τοῦ Πατρός, Λόγον ἀποῤῥήτως, καὶ ὑπὲρ νοῦν ἀναλάμψαντα, ἐγέννησας Παρθένε, Θεοτόκον· διό σε, θεοφρόνως πιστοὶ μακαρίζομεν.
ltx/gr_gr_cog/me.m10.d24:meMA.Ode5C11.greekmelody	@ltx/gr_gr_cog/he.h.m8:heHE.InaTiMeAposo.greekname
ltx/gr_gr_cog/me.m10.d24:meMA.Ode5C11.incipit	Ὁ θεόλεκτος δῆμος, καὶ θεομακάριστος…
ltx/gr_gr_cog/me.m10.d24:meMA.Ode5C11.melody	@ltx/gr_gr_cog/he.h.m8:heHE.InaTiMeAposo.name
ltx/gr_gr_cog/me.m10.d24:meMA.Ode5C11.mode	@ltx/gr_gr_cog/miscellanea:misc.Mode8
ltx/gr_gr_cog/me.m10.d24:meMA.Ode5C11.ode	@ltx/gr_gr_cog/miscellanea:misc.Ode5
ltx/gr_gr_cog/me.m10.d24:meMA.Ode5C11.text	Ὁ θεόλεκτος δῆμος, καὶ θεομακάριστος ἀγωνιζόμενος, καὶ θερμῶς ἀλλήλους, ἐνισχύοντες καὶ συνασπίζοντες, ὑπὸ τῶν ἀνόμων, ὑπὲρ Χριστοῦ σφαγιασθῆναι, εὐκλεῶς οἱ καλλίνικοι εἵλοντο.
ltx/gr_gr_cog/me.m10.d24:meMA.Ode5C12.incipit	Νευρωθέντες τῇ πίστει, καὶ τῆς…
ltx/gr_gr_cog/me.m10.d24:meMA.Ode5C12.melody	@ltx/gr_gr_cog/he.h.m8:heHE.InaTiMeAposo.name
ltx/gr_gr_cog/me.m10.d24:meMA.Ode5C12.mode	@ltx/gr_gr_cog/miscellanea:misc.Mode8
ltx/gr_gr_cog/me.m10.d24:meMA.Ode5C12.ode	@ltx/gr_gr_cog/miscellanea:misc.Ode5
ltx/gr_gr_cog/me.m10.d24:meMA.Ode5C12.text	Νευρωθέντες τῇ πίστει, καὶ τῆς εὐσεβείας τῷ ζήλῳ Σῶτερ πυρούμενοι, οἱ θεράποντές σου, παρανόμων τὸν φόβον οὐκ ἔπτηξαν, καὶ τῇ σῇ ἀγάπῃ, εἰλικρινῶς συνδεδεμένοι, ἑαυτοὺς ἑκουσίως παρέδωκαν.
ltx/gr_gr_cog/me.m10.d24:meMA.Ode5C13.incipit	Θεοῦ θείᾳ προνοίᾳ, καὶ τοῖς…
ltx/gr_gr_cog/me.m10.d24:meMA.Ode5C13.melody	@ltx/gr_gr_cog/he.h.m8:heHE.InaTiMeAposo.name
ltx/gr_gr_cog/me.m10.d24:meMA.Ode5C13.mode	@ltx/gr_gr_cog/miscellanea:misc.Mode8
ltx/gr_gr_cog/me.m10.d24:meMA.Ode5C13.ode	@ltx/gr_gr_cog/miscellanea:misc.Ode5
ltx/gr_gr_cog/me.m10.d24:meMA.Ode5C13.text	Θεοῦ θείᾳ προνοίᾳ, καὶ τοῖς ἀνεφίκτοις της σοφίας κρίμασιν, ἀναθέντες πᾶσαν, τὴν ζωὴν αὐτῶν δῆμος ὁ ἔνθεος, πρὸς τὰς παρανόμους, Ἑβραϊκὰς μιαιφονίας, εὐθαρσῶς οἱ γενναῖοι ἐχώρησαν.
ltx/gr_gr_cog/me.m10.d24:meMA.Ode5C14.incipit	Ἐπὶ σοὶ πεποιθότες, καὶ πεπιστευκότες…
ltx/gr_gr_cog/me.m10.d24:meMA.Ode5C14.melody	@ltx/gr_gr_cog/he.h.m8:heHE.InaTiMeAposo.name
ltx/gr_gr_cog/me.m10.d24:meMA.Ode5C14.mode	@ltx/gr_gr_cog/miscellanea:misc.Mode8
ltx/gr_gr_cog/me.m10.d24:meMA.Ode5C14.ode	@ltx/gr_gr_cog/miscellanea:misc.Ode5
ltx/gr_gr_cog/me.m10.d24:meMA.Ode5C14.text	Ἐπὶ σοὶ πεποιθότες, καὶ πεπιστευκότες ἐν τῇ Ἀναστάσει σου, οἱ σοὶ Σῶτερ μύσται, οὐκ ἐρίζοντες οὐδὲ κραυγάζοντες, ὑπὸ τῶν ἀνόμων, ὑπὲρ τῆς σῆς ὁμολογίας, ἀνῃρέθησαν οἱ γενναιότατοι.
ltx/gr_gr_cog/me.m10.d24:meMA.Ode5C1T.incipit	Ὁ Θεοῦ Θεὸς Λόγος, ὁ…
ltx/gr_gr_cog/me.m10.d24:meMA.Ode5C1T.melody	@ltx/gr_gr_cog/he.h.m8:heHE.InaTiMeAposo.name
ltx/gr_gr_cog/me.m10.d24:meMA.Ode5C1T.mode	@ltx/gr_gr_cog/miscellanea:misc.Mode8
ltx/gr_gr_cog/me.m10.d24:meMA.Ode5C1T.ode	@ltx/gr_gr_cog/miscellanea:misc.Ode5
ltx/gr_gr_cog/me.m10.d24:meMA.Ode5C1T.text	Ὁ Θεοῦ Θεὸς Λόγος, ὁ πρὸ τῶν αἰώνων Πατρὶ συναΐδιος, εὐσπλαγχνίας πλούτῳ, ἐν γαστρί σου σκηνώσας ἐπτώχευσε, καὶ βροτὸς ἐφάνη, ἐπὶ τῆς γῆς σάρξ χρηματίσας, Θεοτόκε Παρθένε πανύμνητε.
ltx/gr_gr_cog/me.m10.d24:meMA.Ode6C11.greekmelody	@ltx/gr_gr_cog/he.h.m8:heHE.IlasthitiMoiSotir.greekname
ltx/gr_gr_cog/me.m10.d24:meMA.Ode6C11.incipit	Τῷ αἵματι τοῦ Χριστοῦ, σημειωθέντες…
ltx/gr_gr_cog/me.m10.d24:meMA.Ode6C11.melody	@ltx/gr_gr_cog/he.h.m8:heHE.IlasthitiMoiSotir.name
ltx/gr_gr_cog/me.m10.d24:meMA.Ode6C11.mode	@ltx/gr_gr_cog/miscellanea:misc.Mode8
ltx/gr_gr_cog/me.m10.d24:meMA.Ode6C11.ode	@ltx/gr_gr_cog/miscellanea:misc.Ode6
ltx/gr_gr_cog/me.m10.d24:meMA.Ode6C11.text	Τῷ αἵματι τοῦ Χριστοῦ, σημειωθέντες οἱ Ἅγιοι, τὰ αἵματα ἑαυτῶν, προθύμως ἐξέχεον, οἱ ἔνδοξοι Μάρτυρες, καὶ νῦν βασιλεύειν, σὺν αὐτῷ κατηξιώθησαν.
ltx/gr_gr_cog/me.m10.d24:meMA.Ode6C12.incipit	Εἰρήνην προφητικῶς, ἐλάλουν γλῶσσαι ψελλίζουσαι…
ltx/gr_gr_cog/me.m10.d24:meMA.Ode6C12.melody	@ltx/gr_gr_cog/he.h.m8:heHE.IlasthitiMoiSotir.name
ltx/gr_gr_cog/me.m10.d24:meMA.Ode6C12.mode	@ltx/gr_gr_cog/miscellanea:misc.Mode8
ltx/gr_gr_cog/me.m10.d24:meMA.Ode6C12.ode	@ltx/gr_gr_cog/miscellanea:misc.Ode6
ltx/gr_gr_cog/me.m10.d24:meMA.Ode6C12.text	Εἰρήνην προφητικῶς, ἐλάλουν γλῶσσαι ψελλίζουσαι, ἐκήρυττον τὸν Χριστόν, νηπίων ψελλίσματα, παρθένοι θεόφρονες, ὑπὲρ εὐσεβείας, ἑαυτὰς Θεῷ προσήνεγκαν.
ltx/gr_gr_cog/me.m10.d24:meMA.Ode6C13.incipit	Ῥαγήσεταί σοι τὸ φῶς, ἀνατελεῖ…
ltx/gr_gr_cog/me.m10.d24:meMA.Ode6C13.melody	@ltx/gr_gr_cog/he.h.m8:heHE.IlasthitiMoiSotir.name
ltx/gr_gr_cog/me.m10.d24:meMA.Ode6C13.mode	@ltx/gr_gr_cog/miscellanea:misc.Mode8
ltx/gr_gr_cog/me.m10.d24:meMA.Ode6C13.ode	@ltx/gr_gr_cog/miscellanea:misc.Ode6
ltx/gr_gr_cog/me.m10.d24:meMA.Ode6C13.text	Ῥαγήσεταί σοι τὸ φῶς, ἀνατελεῖ τὰ ἱμάτια, πλουσίως παρὰ Θεοῦ, Ἀρέθα θεσπέσιε, πρὸς ὃν ἐξεδήμησας, ἀποστάζων ἔτι, τοὺς ἱδρῶτας τῆς ἀθλήσεως.
ltx/gr_gr_cog/me.m10.d24:meMA.Ode6C14.incipit	Πληθύς σοι Μαρτυρική, ἐνθέως Σῶτερ…
ltx/gr_gr_cog/me.m10.d24:meMA.Ode6C14.melody	@ltx/gr_gr_cog/he.h.m8:heHE.IlasthitiMoiSotir.name
ltx/gr_gr_cog/me.m10.d24:meMA.Ode6C14.mode	@ltx/gr_gr_cog/miscellanea:misc.Mode8
ltx/gr_gr_cog/me.m10.d24:meMA.Ode6C14.ode	@ltx/gr_gr_cog/miscellanea:misc.Ode6
ltx/gr_gr_cog/me.m10.d24:meMA.Ode6C14.text	Πληθύς σοι Μαρτυρική, ἐνθέως Σῶτερ προσήνεκται,τὰ αἵματα διὰ σέ, προθύμως κενώσασα, καὶ αἰτεῖ τὴν ἄφεσιν, τῶν ἁμαρτημάτων, τοῖς αὐτὴν ἀεὶ δοξάζουσιν.
ltx/gr_gr_cog/me.m10.d24:meMA.Ode6C1T.incipit	Ἐξέλαμψεν ἐκ Σιών, ἡ τοῦ…
ltx/gr_gr_cog/me.m10.d24:meMA.Ode6C1T.melody	@ltx/gr_gr_cog/he.h.m8:heHE.IlasthitiMoiSotir.name
ltx/gr_gr_cog/me.m10.d24:meMA.Ode6C1T.mode	@ltx/gr_gr_cog/miscellanea:misc.Mode8
ltx/gr_gr_cog/me.m10.d24:meMA.Ode6C1T.ode	@ltx/gr_gr_cog/miscellanea:misc.Ode6
ltx/gr_gr_cog/me.m10.d24:meMA.Ode6C1T.text	Ἐξέλαμψεν ἐκ Σιών, ἡ τοῦ Ὑψίστου εὐπρέπεια, τὸ πρόβλημα τῆς σαρκός, καθʼ ἕνωσιν ἄῤῥητον, ἐκ σοῦ Ἀπειρόγαμε, περιβεβλημένη, καὶ τὸν κόσμον κατεφώτισεν.
ltx/gr_gr_cog/me.m10.d24:meMA.Ode6H.greekmelody	@ltx/gr_gr_cog/he.h.m8:heHE.IlasthitiMoiSotir.greekname
ltx/gr_gr_cog/me.m10.d24:meMA.Ode6H.incipit	@ltx/gr_gr_cog/he.h.m8:heHE.IlasthitiMoiSotir.incipit
ltx/gr_gr_cog/me.m10.d24:meMA.Ode6H.melody	@ltx/gr_gr_cog/he.h.m8:heHE.IlasthitiMoiSotir.melody
ltx/gr_gr_cog/me.m10.d24:meMA.Ode6H.mode	@ltx/gr_gr_cog/miscellanea:misc.Mode8
ltx/gr_gr_cog/me.m10.d24:meMA.Ode6H.ode	@ltx/gr_gr_cog/miscellanea:misc.Ode6
ltx/gr_gr_cog/me.m10.d24:meMA.Ode6H.text	@ltx/gr_gr_cog/he.h.m8:heHE.IlasthitiMoiSotir.text
ltx/gr_gr_cog/me.m10.d24:meMA.Ode7C11.greekmelody	@ltx/gr_gr_cog/he.h.m8:heHE.TheouSynkatavasin.greekname
ltx/gr_gr_cog/me.m10.d24:meMA.Ode7C11.incipit	Αἱμάτων οἱ χείμαῤῥοι, τῶν ἀθλητῶν…
ltx/gr_gr_cog/me.m10.d24:meMA.Ode7C11.melody	@ltx/gr_gr_cog/he.h.m8:heHE.TheouSynkatavasin.name
ltx/gr_gr_cog/me.m10.d24:meMA.Ode7C11.mode	@ltx/gr_gr_cog/miscellanea:misc.Mode8
ltx/gr_gr_cog/me.m10.d24:meMA.Ode7C11.ode	@ltx/gr_gr_cog/miscellanea:misc.Ode7
ltx/gr_gr_cog/me.m10.d24:meMA.Ode7C11.text	Αἱμάτων οἱ χείμαῤῥοι, τῶν ἀθλητῶν σου ἀναπηγάζουσι, τὰς ἰάσεις τοῖς πίστει, τὴν τούτων Μνήμην καταγεραίρουσι, καὶ σοὶ τῷ Κτίστῃ προθύμως κραυγάζουσιν· Εὐλογητός εἶ ὁ Θεός, ὁ τῶν Πατέρων ἡμῶν.
ltx/gr_gr_cog/me.m10.d24:meMA.Ode7C12.incipit	Μητέρες οἰκτίρμονες, ὡς τετρωμέναι τῆς…
ltx/gr_gr_cog/me.m10.d24:meMA.Ode7C12.melody	@ltx/gr_gr_cog/he.h.m8:heHE.TheouSynkatavasin.name
ltx/gr_gr_cog/me.m10.d24:meMA.Ode7C12.mode	@ltx/gr_gr_cog/miscellanea:misc.Mode8
ltx/gr_gr_cog/me.m10.d24:meMA.Ode7C12.ode	@ltx/gr_gr_cog/miscellanea:misc.Ode7
ltx/gr_gr_cog/me.m10.d24:meMA.Ode7C12.text	Μητέρες οἰκτίρμονες, ὡς τετρωμέναι τῆς σῆς ἀγάπης Χριστέ, οὐκ ἐφείσαντο παίδων, ἀλλʼ ἐν καμίνῳ καταφλεγόμεναι, σοὶ τῷ Δεσπότῃ ἐκραύγαζον λέγουσαι· Εὐλογητός ὁ Θεός, ὁ τῶν Πατέρων ἡμῶν.
ltx/gr_gr_cog/me.m10.d24:meMA.Ode7C13.incipit	Ἐμώραναν ἅπασαν, οἱ Ἀθλοφόροι τὴν…
ltx/gr_gr_cog/me.m10.d24:meMA.Ode7C13.melody	@ltx/gr_gr_cog/he.h.m8:heHE.TheouSynkatavasin.name
ltx/gr_gr_cog/me.m10.d24:meMA.Ode7C13.mode	@ltx/gr_gr_cog/miscellanea:misc.Mode8
ltx/gr_gr_cog/me.m10.d24:meMA.Ode7C13.ode	@ltx/gr_gr_cog/miscellanea:misc.Ode7
ltx/gr_gr_cog/me.m10.d24:meMA.Ode7C13.text	Ἐμώραναν ἅπασαν, οἱ Ἀθλοφόροι τὴν τῶν ἀνόμων βουλήν, ὡς τῇ θείᾳ συνέσει, καὶ ἀγχινοίᾳ κατακοσμούμενοι, καὶ γεγηθότες ἐσφάττοντο ψάλλοντες· Εὐλογητὸς ὁ Θεός, ὁ τῶν Πατέρων ἡμῶν.
ltx/gr_gr_cog/me.m10.d24:meMA.Ode7C14.incipit	Λαμπάδα ἀθλήσεως, καὶ παρθενίας φαιδρῶς…
ltx/gr_gr_cog/me.m10.d24:meMA.Ode7C14.melody	@ltx/gr_gr_cog/he.h.m8:heHE.TheouSynkatavasin.name
ltx/gr_gr_cog/me.m10.d24:meMA.Ode7C14.mode	@ltx/gr_gr_cog/miscellanea:misc.Mode8
ltx/gr_gr_cog/me.m10.d24:meMA.Ode7C14.ode	@ltx/gr_gr_cog/miscellanea:misc.Ode7
ltx/gr_gr_cog/me.m10.d24:meMA.Ode7C14.text	Λαμπάδα ἀθλήσεως, καὶ παρθενίας φαιδρῶς ἀνάψασαι, εἰς τὸν θεῖον νυμφῶνα, αἱ νικηφόροι ἀγαλλιώμεναι, σὺν ταῖς φρονίμοις Παρθένοις κραυγάζουσιν· Εὐλογητός ὁ Θεός, ὁ τῶν Πατέρων ἡμῶν.
ltx/gr_gr_cog/me.m10.d24:meMA.Ode7C1T.incipit	Ψυχῶν καθαρτήριον, καὶ σωτηρίας ὑπάρχεις…
ltx/gr_gr_cog/me.m10.d24:meMA.Ode7C1T.melody	@ltx/gr_gr_cog/he.h.m8:heHE.TheouSynkatavasin.name
ltx/gr_gr_cog/me.m10.d24:meMA.Ode7C1T.mode	@ltx/gr_gr_cog/miscellanea:misc.Mode8
ltx/gr_gr_cog/me.m10.d24:meMA.Ode7C1T.ode	@ltx/gr_gr_cog/miscellanea:misc.Ode7
ltx/gr_gr_cog/me.m10.d24:meMA.Ode7C1T.text	Ψυχῶν καθαρτήριον, καὶ σωτηρίας ὑπάρχεις πρόξενος, τοῖς ἐν πίστει καὶ πόθῳ, Θεοῦ Μητέρα σε καταγγέλλουσι, καὶ τῷ Υἱῷ σου συμφώνως κραυγάζουσιν· Εὐλογητός ὁ Θεός, ὁ τῶν Πατέρων ἡμῶν.
ltx/gr_gr_cog/me.m10.d24:meMA.Ode8C11.greekmelody	@ltx/gr_gr_cog/he.h.m8:heHE.EptaplasiosKaminon.greekname
ltx/gr_gr_cog/me.m10.d24:meMA.Ode8C11.incipit	Οὐκ ἐν τῷ νόμῳ πέφυκε…
ltx/gr_gr_cog/me.m10.d24:meMA.Ode8C11.melody	@ltx/gr_gr_cog/he.h.m8:heHE.EptaplasiosKaminon.name
ltx/gr_gr_cog/me.m10.d24:meMA.Ode8C11.mode	@ltx/gr_gr_cog/miscellanea:misc.Mode8
ltx/gr_gr_cog/me.m10.d24:meMA.Ode8C11.ode	@ltx/gr_gr_cog/miscellanea:misc.Ode8
ltx/gr_gr_cog/me.m10.d24:meMA.Ode8C11.text	Οὐκ ἐν τῷ νόμῳ πέφυκε, προφανῶς ἡ τελείωσις, ἀλλʼ ἐν τῷ Χριστῷ, ἡ σωτηρία δέδοται, ἐβόων οἱ Μάρτυρες, τοῖς θεοκτόνοις λέγοντες· ὅθεν γεγηθότες ἀναιρούμενοι πάντες, καὶ θνῄσκομεν προθύμως, καὶ αὐτῷ μελῳδοῦμεν· Λαὸς ὑπερυψοῦτε, Χριστὸν εἰς τοὺς αἰῶνας.
ltx/gr_gr_cog/me.m10.d24:meMA.Ode8C12.incipit	Μυσταγωγεῖ τὸ νήπιον, καὶ διδάσκει…
ltx/gr_gr_cog/me.m10.d24:meMA.Ode8C12.melody	@ltx/gr_gr_cog/he.h.m8:heHE.EptaplasiosKaminon.name
ltx/gr_gr_cog/me.m10.d24:meMA.Ode8C12.mode	@ltx/gr_gr_cog/miscellanea:misc.Mode8
ltx/gr_gr_cog/me.m10.d24:meMA.Ode8C12.ode	@ltx/gr_gr_cog/miscellanea:misc.Ode8
ltx/gr_gr_cog/me.m10.d24:meMA.Ode8C12.text	Μυσταγωγεῖ τὸ νήπιον, καὶ διδάσκει τοὺς ἄφρονας, πρὸς τὴν σὴν εἰκόνα, καθορᾶν τὴν ἄχραντον, καὶ πίστιν εἰσδέξασθαι, τῆς ἐν γῇ παρουσίας σου, καὶ διαλαθόν τῶν παρανόμων τὰς χεῖρας, τὴν φλόγα ὑπεισῆλθε, τῇ τεκούσῃ συμψάλλον· Λαὸς ὑπερυψοῦτε, Χριστὸν εἰς τοὺς αἰῶνας.
ltx/gr_gr_cog/me.m10.d24:meMA.Ode8C13.incipit	Ἐπὶ τῆς γῆς οἱ Μάρτυρες…
ltx/gr_gr_cog/me.m10.d24:meMA.Ode8C13.melody	@ltx/gr_gr_cog/he.h.m8:heHE.EptaplasiosKaminon.name
ltx/gr_gr_cog/me.m10.d24:meMA.Ode8C13.mode	@ltx/gr_gr_cog/miscellanea:misc.Mode8
ltx/gr_gr_cog/me.m10.d24:meMA.Ode8C13.ode	@ltx/gr_gr_cog/miscellanea:misc.Ode8
ltx/gr_gr_cog/me.m10.d24:meMA.Ode8C13.text	Ἐπὶ τῆς γῆς οἱ Μάρτυρες, εὐσεβῶς ἠγωνίσαντο, καὶ ἐν οὐρανοῖς, παρὰ Χριστοῦ τὸν στέφανον ἀξίως ἐδέξαντο, χαρμονικῶς ἀπάραντες, τῶν εὐφραινομένων, ἔνθα ἡ κατοικία, τῶν πίστει μελῳδούντων, καὶ βοώντων ἀπαύστως· Λαὸς ὑπερυψοῦτε, Χριστὸν εἰς τοὺς αἰῶνας.
ltx/gr_gr_cog/me.m10.d24:meMA.Ode8C14.incipit	Νενικηκότες Ἅγιοι, τὸν δεινὸν κοσμοκράτορα…
ltx/gr_gr_cog/me.m10.d24:meMA.Ode8C14.melody	@ltx/gr_gr_cog/he.h.m8:heHE.EptaplasiosKaminon.name
ltx/gr_gr_cog/me.m10.d24:meMA.Ode8C14.mode	@ltx/gr_gr_cog/miscellanea:misc.Mode8
ltx/gr_gr_cog/me.m10.d24:meMA.Ode8C14.ode	@ltx/gr_gr_cog/miscellanea:misc.Ode8
ltx/gr_gr_cog/me.m10.d24:meMA.Ode8C14.text	Νενικηκότες Ἅγιοι, τὸν δεινὸν κοσμοκράτορα, καὶ τοὺς ὑπουργοῦντας, τοῖς αὐτοῦ θελήμασι πρὸς τὸν Παντοκράτορα, καὶ τὸν τῶν ὅλων Κύριον, μετὰ παῤῥησίας καὶ χαρᾶς ἀνεκφράστου, μετέστησε βοῶντες· Ἱερεῖς εὐλογεῖτε, λαὸς ὑπερυψοῦτε, Χριστὸν εἰς τοὺς αἰῶνας.
ltx/gr_gr_cog/me.m10.d24:meMA.Ode8C1T.incipit	Ὑπὲρ ἡμῶν δυσώπησον, τὸν Υἱόν…
ltx/gr_gr_cog/me.m10.d24:meMA.Ode8C1T.melody	@ltx/gr_gr_cog/he.h.m8:heHE.EptaplasiosKaminon.name
ltx/gr_gr_cog/me.m10.d24:meMA.Ode8C1T.mode	@ltx/gr_gr_cog/miscellanea:misc.Mode8
ltx/gr_gr_cog/me.m10.d24:meMA.Ode8C1T.ode	@ltx/gr_gr_cog/miscellanea:misc.Ode8
ltx/gr_gr_cog/me.m10.d24:meMA.Ode8C1T.text	Ὑπὲρ ἡμῶν δυσώπησον, τὸν Υἱόν σου Πανάχραντε, τῶν εἰλικρινῶς καὶ καθαρῶς βοώντων σοι, καὶ σὲ Θεομήτορα ὁμολογούντων Πάναγνε, τῶν ἁμαρτημάτων, αἰτουμένη τὴν λύσιν, τυχεῖν τε σωτηρίας, τοὺς πιστῶς μελῳδοῦντας· Λαὸς ὑπερυψοῦτε, Χριστὸν εἰς τοὺς αἰῶνας.
ltx/gr_gr_cog/me.m10.d24:meMA.Ode8H.greekmelody	@ltx/gr_gr_cog/he.h.m8:heHE.EptaplasiosKaminon.greekname
ltx/gr_gr_cog/me.m10.d24:meMA.Ode8H.incipit	@ltx/gr_gr_cog/he.h.m8:heHE.EptaplasiosKaminon.incipit
ltx/gr_gr_cog/me.m10.d24:meMA.Ode8H.melody	@ltx/gr_gr_cog/he.h.m8:heHE.EptaplasiosKaminon.melody
ltx/gr_gr_cog/me.m10.d24:meMA.Ode8H.mode	@ltx/gr_gr_cog/miscellanea:misc.Mode8
ltx/gr_gr_cog/me.m10.d24:meMA.Ode8H.ode	@ltx/gr_gr_cog/miscellanea:misc.Ode8
ltx/gr_gr_cog/me.m10.d24:meMA.Ode8H.text	@ltx/gr_gr_cog/he.h.m8:heHE.EptaplasiosKaminon.text
ltx/gr_gr_cog/me.m10.d24:meMA.Ode9C11.greekmelody	@ltx/gr_gr_cog/he.h.m8:heHE.EfrixePasaAkoi.greekname
ltx/gr_gr_cog/me.m10.d24:meMA.Ode9C11.incipit	Μέτοχοι δόξης τοῦ Χριστοῦ, κοινωνήσαντες…
ltx/gr_gr_cog/me.m10.d24:meMA.Ode9C11.melody	@ltx/gr_gr_cog/he.h.m8:heHE.EfrixePasaAkoi.name
ltx/gr_gr_cog/me.m10.d24:meMA.Ode9C11.mode	@ltx/gr_gr_cog/miscellanea:misc.Mode8
ltx/gr_gr_cog/me.m10.d24:meMA.Ode9C11.ode	@ltx/gr_gr_cog/miscellanea:misc.Ode9
ltx/gr_gr_cog/me.m10.d24:meMA.Ode9C11.text	Μέτοχοι δόξης τοῦ Χριστοῦ, κοινωνήσαντες θανάτου γεγόνατε, Ἅγιοι Μάρτυρες, καὶ βασιλείας τῷ διαδήματι, κατεκοσμήθητε φαιδρῶς· Θεῷ δὲ παρίστασθε, ἡμῖν αἰτούμενοι, σωτηρίαν ψυχικὴν ἀξιάγαστοι.
ltx/gr_gr_cog/me.m10.d24:meMA.Ode9C12.incipit	Νόμιμοι ὤφθητε Χριστοῦ, στρατιῶται καὶ…
ltx/gr_gr_cog/me.m10.d24:meMA.Ode9C12.melody	@ltx/gr_gr_cog/he.h.m8:heHE.EfrixePasaAkoi.name
ltx/gr_gr_cog/me.m10.d24:meMA.Ode9C12.mode	@ltx/gr_gr_cog/miscellanea:misc.Mode8
ltx/gr_gr_cog/me.m10.d24:meMA.Ode9C12.ode	@ltx/gr_gr_cog/miscellanea:misc.Ode9
ltx/gr_gr_cog/me.m10.d24:meMA.Ode9C12.text	Νόμιμοι ὤφθητε Χριστοῦ, στρατιῶται καὶ ἀήττητοι Μάρτυρες, Ἀρέθα πάνσοφε, καὶ σοὶ προθύμως οἱ συναθλήσαντες, σὺν Ἀθλοφόροις γυναιξί, παρθένοι νεάνιδες· διὸ δεόμεθα, ἐκτενῶς ὑπὲρ ἡμῶν ἱκετεύσατε.
ltx/gr_gr_cog/me.m10.d24:meMA.Ode9C13.incipit	Ὅμιλος πρόκειται ἡμῖν, ἐκκλησία τε…
ltx/gr_gr_cog/me.m10.d24:meMA.Ode9C13.melody	@ltx/gr_gr_cog/he.h.m8:heHE.EfrixePasaAkoi.name
ltx/gr_gr_cog/me.m10.d24:meMA.Ode9C13.mode	@ltx/gr_gr_cog/miscellanea:misc.Mode8
ltx/gr_gr_cog/me.m10.d24:meMA.Ode9C13.ode	@ltx/gr_gr_cog/miscellanea:misc.Ode9
ltx/gr_gr_cog/me.m10.d24:meMA.Ode9C13.text	Ὅμιλος πρόκειται ἡμῖν, ἐκκλησία τε Μαρτύρων θεόλεκτος, δεῦτε φιλόθεοι, μετʼ ἐγκωμίων τούτους ὑμνήσωμεν, ὡς νικηφόρους Ἀθλητάς, ὡς θείους θεράποντας, ὡς ἱκετεύοντας, ἐκτενῶς ὑπὲρ ἡμῶν τὸν φιλάνθρωπον.
ltx/gr_gr_cog/me.m10.d24:meMA.Ode9C14.incipit	Ἴθυνον Λόγε τοῦ Θεοῦ, τὴν…
ltx/gr_gr_cog/me.m10.d24:meMA.Ode9C14.melody	@ltx/gr_gr_cog/he.h.m8:heHE.EfrixePasaAkoi.name
ltx/gr_gr_cog/me.m10.d24:meMA.Ode9C14.mode	@ltx/gr_gr_cog/miscellanea:misc.Mode8
ltx/gr_gr_cog/me.m10.d24:meMA.Ode9C14.ode	@ltx/gr_gr_cog/miscellanea:misc.Ode9
ltx/gr_gr_cog/me.m10.d24:meMA.Ode9C14.text	Ἴθυνον Λόγε τοῦ Θεοῦ, τὴν ζωήν μου καὶ κυβέρνησον Δέσποτα, τῶν θεραπόντων σου, ταῖς ἱκεσίαις τῶν ἀγαπώντων σε, καὶ καταξίωσον αὐτῶν, γενέσθαι συμμέτοχον, τὰς ἁμαρτίας μου, παρορῶν ὡς ἀγαθὸς καὶ φιλάνθρωπος.
ltx/gr_gr_cog/me.m10.d24:meMA.Ode9C1T.incipit	Σκήνωμα γέγονας Θεοῦ, τὸν ἀχώρητον…
ltx/gr_gr_cog/me.m10.d24:meMA.Ode9C1T.melody	@ltx/gr_gr_cog/he.h.m8:heHE.EfrixePasaAkoi.name
ltx/gr_gr_cog/me.m10.d24:meMA.Ode9C1T.mode	@ltx/gr_gr_cog/miscellanea:misc.Mode8
ltx/gr_gr_cog/me.m10.d24:meMA.Ode9C1T.ode	@ltx/gr_gr_cog/miscellanea:misc.Ode9
ltx/gr_gr_cog/me.m10.d24:meMA.Ode9C1T.text	Σκήνωμα γέγονας Θεοῦ, τὸν ἀχώρητον ἐν μήτρᾳ χωρήσασα, καὶ τὸν πρὶν ἄσαρκον, σεσαρκωμένον ἡμῖν γεγέννηκας, ὃν νῦν δυσώπησον Ἀγνή, πταισμάτων συγχώρησιν, πᾶσι δωρήσασθαι, τοῖς ἐν πίστει σε ἀεὶ μεγαλύνουσιν.
ltx/gr_gr_cog/me.m10.d24:meMA.Ode9H.greekmelody	@ltx/gr_gr_cog/he.h.m8:heHE.EfrixePasaAkoi.greekname
ltx/gr_gr_cog/me.m10.d24:meMA.Ode9H.incipit	@ltx/gr_gr_cog/he.h.m8:heHE.EfrixePasaAkoi.incipit
ltx/gr_gr_cog/me.m10.d24:meMA.Ode9H.melody	@ltx/gr_gr_cog/he.h.m8:heHE.EfrixePasaAkoi.melody
ltx/gr_gr_cog/me.m10.d24:meMA.Ode9H.mode	@ltx/gr_gr_cog/miscellanea:misc.Mode8
ltx/gr_gr_cog/me.m10.d24:meMA.Ode9H.ode	@ltx/gr_gr_cog/miscellanea:misc.Ode9
ltx/gr_gr_cog/me.m10.d24:meMA.Ode9H.text	@ltx/gr_gr_cog/he.h.m8:heHE.EfrixePasaAkoi.text
ltx/gr_gr_cog/me.m10.d24:meMA.Oikos1.text	Τὸν νοῦν μου φώτισον Χριστέ, τῇ αἴγλῃ τῶν ἀγώνων Ἀρέθα τοῦ γενναίου, καὶ πάντων τῶν Ἁγίων τῶν ἀθλησάντων σὺν αὐτῷ· πρῶτος γὰρ ἁπάντων ἀνεδείχθη ὁ στεῤῥός, φαιδρῶς παραταξάμενος κατὰ τῶν ἀθετούντων τὴν σάρκωσιν σοῦ, τοῦ ὑπὲρ φύσιν σαρκωθέντος καὶ τεχθέντος, ἵνα ἡμᾶς λυτρώσῃς τῆς πλάνης, καὶ δείξῃς ἀπλανῶς τοῖς βουλομένοις διοδεύειν τὴν ὁδὸν τοῦ μαρτυρίου· ἣν οἱ Ἀθληταὶ ἐβάδισαν σὲ ἀνυμνοῦντες, τὸν ἐν ὑψίστοις ὑπάρχοντα Κύριον.
ltx/gr_gr_cog/me.m10.d24:meVE.Apolytikion1ger.greekmelody	@ltx/gr_gr_cog/he.a.m1:heAU.TisErimouPolitis.greekname
ltx/gr_gr_cog/me.m10.d24:meVE.Apolytikion1ger.incipit	Εὐσεβείᾳ ἐμπρέπων τῇ ἀθλήσει δεδόξασαι…
ltx/gr_gr_cog/me.m10.d24:meVE.Apolytikion1ger.melody	@ltx/gr_gr_cog/he.a.m1:heAU.TisErimouPolitis.name
ltx/gr_gr_cog/me.m10.d24:meVE.Apolytikion1ger.mode	@ltx/gr_gr_cog/miscellanea:misc.Mode1
ltx/gr_gr_cog/me.m10.d24:meVE.Apolytikion1ger.poet	@ltx/gr_gr_cog/poets:po.Gerasimou
ltx/gr_gr_cog/me.m10.d24:meVE.Apolytikion1ger.text	Εὐσεβείᾳ ἐμπρέπων τῇ ἀθλήσει δεδόξασαι, τὴν τῶν Χριστοκτόνων κακίαν καθελὼν τῇ ἐνστάσει σου· διὸ καὶ προσενήνοχας Χριστῷ, Μαρτύρων ἀῤῥαγῆ συνασπισμόν, ὡσπερ θεῖος παιδοτρίβης καὶ ὁδηγός, Ἀρέθα παμμακάριστε. Δόξα τῷ δεδωκότι σοι ἰσχύν, δόξα τῷ σὲ στεφανώσαντι, δόξα τῷ ἐνεργοῦντι διὰ σοῦ, πᾶσιν ἰάματα.
ltx/gr_gr_cog/me.m10.d24:meVE.AposGlory.incipit	Τὴν πονηρὰν καὶ ἄπιστον, κακοβουλίαν…
ltx/gr_gr_cog/me.m10.d24:meVE.AposGlory.melody	
ltx/gr_gr_cog/me.m10.d24:meVE.AposGlory.mode	@ltx/gr_gr_cog/miscellanea:misc.Mode8
ltx/gr_gr_cog/me.m10.d24:meVE.AposGlory.text	Τὴν πονηρὰν καὶ ἄπιστον, κακοβουλίαν Ἑβραίων προδιαγνόντες, ἐν τῇ τοῦ πνεύματος τόλμῃ, ὑπὲρ Χριστοῦ μαρτυρῆσαι ἠγωνίσασθε· ὡς γὰρ ἔκπαλαι ἐν νόμῳ, τὸν ἐξ Αἰγύπτου σώσαντα, ἐν ἐρήμῳ παρώργισαν, καὶ τοῦτον σταυρῷ κατεδίκασαν. Οὕτω νῦν καὶ ὑμῖν, ἔργω τὸν λόγον παρῆλθον, καὶ ἀπιστίαν ζηλώσαντες ὑμᾶς τῷ πυρὶ κατεδίκασαν. Ὑμεῖς δὲ ὁμοφρόνως, ἀνδρείως τῇ καρτερίᾳ ἐναθλήσαντες, φοβεροὶ ἐν Μάρτυσιν ἀνεδείχθητε. Παῤῥησίαν ἔχοντες πρὸς Θεόν, αἰτήσασθε ῥυσθῆναι, ἐκ πταισμάτων πολλῶν τὰς ψυχὰς ἡμῶν.
ltx/gr_gr_cog/me.m10.d24:meVE.AposStavrotheotokion.greekmelody	@ltx/gr_gr_cog/he.a.m8:heAU.OiMartyresSouKyrie.greekname
ltx/gr_gr_cog/me.m10.d24:meVE.AposStavrotheotokion.incipit	Ὁρῶσά σε σταυρούμενον, καὶ θανατούμενον…
ltx/gr_gr_cog/me.m10.d24:meVE.AposStavrotheotokion.melody	@ltx/gr_gr_cog/he.a.m8:heAU.OiMartyresSouKyrie.name
ltx/gr_gr_cog/me.m10.d24:meVE.AposStavrotheotokion.mode	@ltx/gr_gr_cog/miscellanea:misc.Mode8
ltx/gr_gr_cog/me.m10.d24:meVE.AposStavrotheotokion.text	Ὁρῶσά σε σταυρούμενον, καὶ θανατούμενον ἡ Θεοτόκος, οἴμοι! ἐκραύγαζε, πῶς τὰς ὀδύνας, φέρεις γλυκύτατε Υἱὲ; βάλλει τὴν καρδίαν μου ἡ λόγχη σου, φλέγει δὲ τὰ σπλάγχνα μου τὸ πάθος σου, ὅμως ὑμνολογῶ σε· θέλων γὰρ ταῦτα πάσχεις, σῶσαι τὸν ἄνθρωπον.
ltx/gr_gr_cog/me.m10.d24:meVE.AposTheotokion.greekmelody	@ltx/gr_gr_cog/he.a.m8:heAU.OiMartyresSouKyrie.greekname
ltx/gr_gr_cog/me.m10.d24:meVE.AposTheotokion.incipit	@ltx/gr_gr_cog/me.m01.d21:meVE.AposTheotokion.incipit
ltx/gr_gr_cog/me.m10.d24:meVE.AposTheotokion.melody	@ltx/gr_gr_cog/he.a.m8:heAU.OiMartyresSouKyrie.name
ltx/gr_gr_cog/me.m10.d24:meVE.AposTheotokion.mode	@ltx/gr_gr_cog/miscellanea:misc.Mode8
ltx/gr_gr_cog/me.m10.d24:meVE.AposTheotokion.text	@ltx/gr_gr_cog/me.m01.d21:meVE.AposTheotokion.text
ltx/gr_gr_cog/me.m10.d24:meVE.SticGlory.incipit	ᾈσματικῶς τὸν ποιμενάρχην, σήμερον πιστοί…
ltx/gr_gr_cog/me.m10.d24:meVE.SticGlory.melody	@ltx/gr_gr_cog/he.a.m4:heAU.EdokasSimeiosin.name
ltx/gr_gr_cog/me.m10.d24:meVE.SticGlory.mode	@ltx/gr_gr_cog/miscellanea:misc.Mode4
ltx/gr_gr_cog/me.m10.d24:meVE.SticGlory.poet	@ltx/gr_gr_cog/poets:po.Anatoliou
ltx/gr_gr_cog/me.m10.d24:meVE.SticGlory.text	ᾈσματικῶς τὸν ποιμενάρχην, σήμερον πιστοί, ὁμοφρόνως τιμήσωμεν, Ἀρέθαν τὸν ἐνδοξότατον, μετὰ τῆς συνοδίας αὐτοῦ, ὅτι ἤλεγξε βασιλέα παρανομήσαντα, καὶ τὸ αἷμα ἐξέχεεν ὑπὲρ Χριστοῦ τῆς ὁμολογίας· ὅθεν καὶ πύρινον νέφος κατέφλεγεν ἀπὸ προσώπου τῆς γῆς, διελέγχον τῶν παρανόμων τὴν ἀσέβειαν. Διὸ Χριστὲ ὁ Θεός, ὁ τοὺς σούς, Ἀθλοφόρους ἐνισχύσας πρὸς σὴν δοξολογίαν, καὶ ἡμᾶς διάσωσον ὡς τῶν ὅλων Δεσπότης, ἐκ πειρασμῶν καὶ θλίψεων, ταῖς πρεσβείαις τῶν Ἁγίων σου.
ltx/gr_gr_cog/me.m10.d24:meVE.SticStavrotheotokion.greekmelody	@ltx/gr_gr_cog/he.a.m4:heAU.EdokasSimeiosin.greekname
ltx/gr_gr_cog/me.m10.d24:meVE.SticStavrotheotokion.incipit	Ἰδών σε ὁ ἥλιος, καὶ…
ltx/gr_gr_cog/me.m10.d24:meVE.SticStavrotheotokion.melody	@ltx/gr_gr_cog/he.a.m4:heAU.EdokasSimeiosin.name
ltx/gr_gr_cog/me.m10.d24:meVE.SticStavrotheotokion.mode	@ltx/gr_gr_cog/miscellanea:misc.Mode4
ltx/gr_gr_cog/me.m10.d24:meVE.SticStavrotheotokion.text	Ἰδών σε ὁ ἥλιος, καὶ ἡ σελήνη φιλάνθρωπε, ἐπὶ ξύλου κρεμάμενον, ἀκτῖνας ἀπέκρυψε, τῆς δικαιοσύνης, Ἥλιε Χριστέ μου, καὶ τὰ θεμέλια τῆς γῆς, διεδονήθη φόβῳ τοῦ κράτους σου, ἡ Μήτηρ σου τὰ σπλάγχνα δέ, τιτρωσκομένη ἐβόα σοι τῷ Ἰησοῦ ὑπεράγαθε, δόξα τῇ Εὐσπλαγχνίᾳ σου.
ltx/gr_gr_cog/me.m10.d24:meVE.SticTheotokion.greekmelody	@ltx/gr_gr_cog/he.a.m4:heAU.EdokasSimeiosin.greekname
ltx/gr_gr_cog/me.m10.d24:meVE.SticTheotokion.incipit	Τὸν ῥύπον ἀπόσμηξον, τῆς ταλαιπώρου…
ltx/gr_gr_cog/me.m10.d24:meVE.SticTheotokion.melody	@ltx/gr_gr_cog/he.a.m4:heAU.EdokasSimeiosin.name
ltx/gr_gr_cog/me.m10.d24:meVE.SticTheotokion.mode	@ltx/gr_gr_cog/miscellanea:misc.Mode4
ltx/gr_gr_cog/me.m10.d24:meVE.SticTheotokion.text	Τὸν ῥύπον ἀπόσμηξον, τῆς ταλαιπώρου καρδίας μου, Θεοτόκε πανύμνητε, καὶ πάντα τὰ τραύματα, καὶ τὰ ἕλκη ταύτης, τὰ ἐξ ἁμαρτίας, ἐναποκάθαρον Ἁγνή, καὶ τοῦ νοός μου στῆσον τὸ ἄστατον· ὅπως τὴν δυναστείαν σου, καὶ τὴν μεγάλην ἀντίληψιν, μεγαλύνω σῳζόμενος, ὁ ἀχρεῖος οἰκέτης σου.
ltx/gr_gr_cog/me.m10.d24:meVE.Stichera01.greekmelody	@ltx/gr_gr_cog/he.a.m1:heAU.PaneffimoiMartyres.greekname
ltx/gr_gr_cog/me.m10.d24:meVE.Stichera01.incipit	Ἑβραίων ὠμότητι τὴν σήν, ἀνδρείαν…
ltx/gr_gr_cog/me.m10.d24:meVE.Stichera01.melody	@ltx/gr_gr_cog/he.a.m1:heAU.PaneffimoiMartyres.name
ltx/gr_gr_cog/me.m10.d24:meVE.Stichera01.mode	@ltx/gr_gr_cog/miscellanea:misc.Mode1
ltx/gr_gr_cog/me.m10.d24:meVE.Stichera01.text	Ἑβραίων ὠμότητι τὴν σήν, ἀνδρείαν ἀντέθηκας, Μάρτυς Ἀρέθα πανεύφημε· καὶ θείᾳ χάριτι, νικηφόρος ὤφθης, καὶ χορὸν προσήγαγες, Μαρτύρων τῷ Χριστῷ στρατευόμενον, ἐκ πάσης ἔνδοξε, ἡλικίας συγκροτούμενον, καὶ ἐκ γένους, παντὸς συνιστάμενον.
ltx/gr_gr_cog/me.m10.d24:meVE.Stichera02.incipit	Ἀρέθα πανένδοξε τερπνήν, χορείαν στησάμενος…
ltx/gr_gr_cog/me.m10.d24:meVE.Stichera02.melody	@ltx/gr_gr_cog/he.a.m1:heAU.PaneffimoiMartyres.name
ltx/gr_gr_cog/me.m10.d24:meVE.Stichera02.mode	@ltx/gr_gr_cog/miscellanea:misc.Mode1
ltx/gr_gr_cog/me.m10.d24:meVE.Stichera02.text	Ἀρέθα πανένδοξε τερπνήν, χορείαν στησάμενος, τῶν ἱερῶν συμμαρτύρων σου, μεθʼ ὧν ἠγώνισαι, τὸν καλὸν ἀγῶνα, καὶ τὸν δρόμον ἤνυσας, τῆς σῆς ἀνδρειοτάτης ἀθλήσεως, Χριστὸν δυσώπησον, δωρηθῆναι ταῖς ψυχαῖς ἡμῶν, τὴν εἰρήνην, καὶ τὸ μέγα ἔλεος.
ltx/gr_gr_cog/me.m10.d24:meVE.Stichera03.incipit	Παρθένοι νεάνιδες Χριστοῦ, ἔρωτι πυρούμεναι…
ltx/gr_gr_cog/me.m10.d24:meVE.Stichera03.melody	@ltx/gr_gr_cog/he.a.m1:heAU.PaneffimoiMartyres.name
ltx/gr_gr_cog/me.m10.d24:meVE.Stichera03.mode	@ltx/gr_gr_cog/miscellanea:misc.Mode1
ltx/gr_gr_cog/me.m10.d24:meVE.Stichera03.text	Παρθένοι νεάνιδες Χριστοῦ, ἔρωτι πυρούμεναι, τῆς ἀσθενείας τῆς φύσεως, ἐπιλαθόμεναι, καὶ δυνάμει θείᾳ, προφανῶς ῥωννύμεναι, τὴν πλάνην τοῦ ἐχθροῦ κατεπάτησαν, μὴ δειλιάσασαι, τῶν βασάνων τὸ ἐπίπονον, καὶ καμίνου, τὸ πῦρ μὴ πτοούμεναι.
