ltx/gr_gr_cog/le.ep.mc.d276:lemcLI.Epistle.book_abbr	@ltx/gr_gr_cog/bible:Thessalonians1.abbr
ltx/gr_gr_cog/le.ep.mc.d276:lemcLI.Epistle.book_string	@ltx/gr_gr_cog/bible:Thessalonians1.text
ltx/gr_gr_cog/le.ep.mc.d276:lemcLI.Epistle.chapverse	1:6 – 10
ltx/gr_gr_cog/le.ep.mc.d276:lemcLI.Epistle.incipit	Ὑμεῖς μιμηταὶ ἡμῶν ἐγενήθητε καὶ τοῦ Κυρίου…
ltx/gr_gr_cog/le.ep.mc.d276:lemcLI.Epistle.text	Ἀδελφοί, ὑμεῖς μιμηταὶ ἡμῶν ἐγενήθητε καὶ τοῦ Κυρίου δεξάμενοι τὸν λόγον ἐν θλίψει πολλῇ μετὰ χαρᾶς Πνεύματος Ἁγίου, ὥστε γενέσθαι ὑμᾶς τύπους πᾶσι τοῖς πιστεύουσιν ἐν τῇ Μακεδονίᾳ καὶ ἐν τῇ Ἀχαΐᾳ. ἀφ᾽ ὑμῶν γὰρ ἐξήχηται ὁ λόγος τοῦ Κυρίου· οὐ μόνον ἐν τῇ Μακεδονίᾳ καὶ ἐν τῇ Ἀχαΐᾳ, ἀλλὰ καὶ ἐν παντὶ τόπῳ ἡ πίστις ὑμῶν ἡ πρὸς τὸν Θεὸν ἐξελήλυθεν, ὥστε μὴ χρείαν ἡμᾶς ἔχειν λαλεῖν τι· αὐτοὶ γὰρ περὶ ἡμῶν ἀπαγγέλλουσιν ὁποίαν εἴσοδον ἔσχομεν πρὸς ὑμᾶς, καὶ πῶς ἐπεστρέψατε πρὸς τὸν Θεὸν ἀπὸ τῶν εἰδώλων δουλεύειν Θεῷ ζῶντι καὶ ἀληθινῷ, καὶ ἀναμένειν τὸν υἱὸν αὐτοῦ ἐκ τῶν οὐρανῶν, ὃν ἤγειρεν ἐκ τῶν νεκρῶν, Ἰησοῦν τὸν ῥυόμενον ἡμᾶς ἀπὸ τῆς ὀργῆς τῆς ἐρχομένης.
ltx/gr_gr_cog/le.ep.mc.d276:lemcLI.Epistle.title	Τῇ Τρίτῃ τῆς ΚΓʹ Ἑβδομάδος
ltx/gr_gr_cog/le.ep.mc.d276:lemcLI.Epistle.title_abbr	Τρίτῃ τῆς ΚΓʹ Ἑβδομάδος
ltx/gr_gr_cog/le.ep.mc.d276:lemcLI.Epistle.version	@ltx/gr_gr_cog/properties:version.designation
