ltx/gr_gr_cog/me.m01.d17:meDA.commemoration.first	Μνήμη τοῦ Ἁγίου Ἀντωνίου τοῦ Μεγάλου
ltx/gr_gr_cog/me.m01.d17:meDA.commemoration.first_name	Ἅγιος Ἀντώνιος
ltx/gr_gr_cog/me.m01.d17:meDA.commemoration.first_short	Μνήμη τοῦ Ἁγίου Ἀντωνίου τοῦ Μεγάλου
ltx/gr_gr_cog/me.m01.d17:meDA.commemoration.first_title	@ltx/gr_gr_cog/titles:ti.SaintM
ltx/gr_gr_cog/me.m01.d17:meDA.commemoration.full	Μνήμη τοῦ Ὁσίου καὶ Θεοφόρου Πατρὸς ἡμῶν Ἀντωνίου τοῦ Μεγάλου· καὶ τοῦ ἁγίου νεωμάρτυρος Γεωργίου τοῦ ἐξ Ἰωαννίνων.
ltx/gr_gr_cog/me.m01.d17:meDA.commemoration.second_name	
ltx/gr_gr_cog/me.m01.d17:meDA.commemoration.second_title	
ltx/gr_gr_cog/me.m01.d17:meDA.date	Τῌ ΙΖʹ ΙΑΝΟΥΑΡΙΟΥ
ltx/gr_gr_cog/me.m01.d17:meDA.fordate	διὰ τὴν 17ην Ἰανουαρίου
ltx/gr_gr_cog/me.m01.d17:meDA.insert1	καὶ τοῦ Ὁσίου καὶ Θεοφόρου Πατρὸς ἡμῶν Ἀντωνίου τοῦ Μεγάλου,
ltx/gr_gr_cog/me.m01.d17:meDA.insert2	οὗ καὶ τὴν μνήμην ἐπιτελοῦμεν·
ltx/gr_gr_cog/me.m01.d17:meDA.note	
ltx/gr_gr_cog/me.m01.d17:meDA.pdfcoverdate	τῆς 17ης Ἰανουαρίου,
ltx/gr_gr_cog/me.m01.d17:meDA.pdfheaderdate	τῆς 17ης Ἰανουαρίου
ltx/gr_gr_cog/me.m01.d17:meHO.commemorations	
ltx/gr_gr_cog/me.m01.d17:meHO.note1	@ltx/gr_gr_cog/rubrical:ru.HolidayWineOil
ltx/gr_gr_cog/me.m01.d17:meHO.note2	
ltx/gr_gr_cog/me.m01.d17:meHO.number	17.
ltx/gr_gr_cog/me.m01.d17:meHO.rank	
ltx/gr_gr_cog/me.m01.d17:meLE.commemoration1	Μνήμη τοῦ Ὁσίου Πατρός ἡμῶν Ἀντωνίου τοῦ Μεγάλου.
ltx/gr_gr_cog/me.m01.d17:meLE.commemoration2	
ltx/gr_gr_cog/me.m01.d17:meLI.Kontakion1.greekmelody	@ltx/gr_gr_cog/me.m01.d17:meMA.Kontakion1.greekmelody
ltx/gr_gr_cog/me.m01.d17:meLI.Kontakion1.incipit	@ltx/gr_gr_cog/me.m01.d17:meMA.Kontakion1.incipit
ltx/gr_gr_cog/me.m01.d17:meLI.Kontakion1.melody	@ltx/gr_gr_cog/me.m01.d17:meMA.Kontakion1.melody
ltx/gr_gr_cog/me.m01.d17:meLI.Kontakion1.mode	@ltx/gr_gr_cog/me.m01.d17:meMA.Kontakion1.mode
ltx/gr_gr_cog/me.m01.d17:meLI.Kontakion1.text	@ltx/gr_gr_cog/me.m01.d17:meMA.Kontakion1.text
ltx/gr_gr_cog/me.m01.d17:meLI.MM.CommunionHymn.text	@ltx/gr_gr_cog/properties:media.key
ltx/gr_gr_cog/me.m01.d17:meLI.Megalynarion.text	Χαίροις τῶν Ὁσίων ὁ ἀρχηγός, καὶ τῆς ἰσαγγέλου πολιτείας καθηγητής· χαίροις τῆς ἐρήμου, στυλοειδὴς νεφέλη, Ἀντώνιε παμμάκαρ, Πατέρων καύχημα.
ltx/gr_gr_cog/me.m01.d17:meMA.C1.acrostic.notice1	οὗ ἡ Ἀκροστιχίς·
ltx/gr_gr_cog/me.m01.d17:meMA.C1.acrostic.text	Ἀντώνιον τὸν θεῖον εὐφημεῖν θέμις. Θεοφάνους.
ltx/gr_gr_cog/me.m01.d17:meMA.C1.acrostic.title	Κανὼν τοῦ Ὁσίου,
ltx/gr_gr_cog/me.m01.d17:meMA.C1.title	@ltx/gr_gr_cog/titles:ti.CanonDevoutM
ltx/gr_gr_cog/me.m01.d17:meMA.C1.verse	@ltx/gr_gr_cog/prayers:pr.verse_DevoutMan.text
ltx/gr_gr_cog/me.m01.d17:meMA.ExapTheotokion.incipit	Ἐλπὶς τοῦ κόσμου ἀγαθή, Θεοτόκε…
ltx/gr_gr_cog/me.m01.d17:meMA.ExapTheotokion.melody	@ltx/gr_gr_cog/he.a.m3:heAU.EnPnevmatiToIero.name
ltx/gr_gr_cog/me.m01.d17:meMA.ExapTheotokion.mode	@ltx/gr_gr_cog/miscellanea:misc.Mode3
ltx/gr_gr_cog/me.m01.d17:meMA.ExapTheotokion.text	Ἐλπὶς τοῦ κόσμου ἀγαθή, Θεοτόκε Παρθένε, τὴν σὴν ἄμαχον Δέσποινα, προστασίαν αἰτοῦμεν, οἱ θλίψεσι συσχεθέντες, καὶ κλυδωνιζόμενοι, τοῦ βίου ταῖς τρικυμίαις· στῆσον αὔρας τῶν παθῶν, καὶ λιμένα εἰς Θεοῦ, ἐμβίβασον θελημάτων.
ltx/gr_gr_cog/me.m01.d17:meMA.Exaposteilarion1.greekmelody	@ltx/gr_gr_cog/he.a.m2:heAU.GynaikesAkoutisthite.greekname
ltx/gr_gr_cog/me.m01.d17:meMA.Exaposteilarion1.incipit	Καινὴν ὁδὸν καὶ ἄτριπτον, ἀνθρώποις…
ltx/gr_gr_cog/me.m01.d17:meMA.Exaposteilarion1.melody	@ltx/gr_gr_cog/he.a.m2:heAU.GynaikesAkoutisthite.name
ltx/gr_gr_cog/me.m01.d17:meMA.Exaposteilarion1.mode	@ltx/gr_gr_cog/miscellanea:misc.Mode2
ltx/gr_gr_cog/me.m01.d17:meMA.Exaposteilarion1.text	Καινὴν ὁδὸν καὶ ἄτριπτον, ἀνθρώποις ἐκ νεότητος, ἀναλαβὼν θεοφόρε, ταύτην θερμῶς ἕως τέλους, ἀνεπιστρόφως ὥδευσας, νόμῳ καινῷ πειθόμενος, Χριστοῦ, καὶ πρῶτος πέφηνας, καθηγητὴς τῆς ἐρήμου, καὶ Μοναζόντων ἀκρότης.
ltx/gr_gr_cog/me.m01.d17:meMA.Exaposteilarion2.greekmelody	@ltx/gr_gr_cog/he.a.m3:heAU.EnPnevmatiToIero.greekname
ltx/gr_gr_cog/me.m01.d17:meMA.Exaposteilarion2.incipit	Φωστὴρ φωστήρων γέγονας, Μοναστῶν δὲ…
ltx/gr_gr_cog/me.m01.d17:meMA.Exaposteilarion2.melody	@ltx/gr_gr_cog/he.a.m3:heAU.EnPnevmatiToIero.name
ltx/gr_gr_cog/me.m01.d17:meMA.Exaposteilarion2.mode	@ltx/gr_gr_cog/miscellanea:misc.Mode3
ltx/gr_gr_cog/me.m01.d17:meMA.Exaposteilarion2.text	Φωστὴρ φωστήρων γέγονας, Μοναστῶν δὲ ἀλείπτης, καὶ ἀρχηγὸς Ἀντώνιε, οἰκουμένης τὸ κλέος, διδάσκων οἷα γενναῖος, στρατηγέτης ἄριστα, τὰς τῶν δαιμόνων ἐφόδους, μὴ πτοεῖσθαι ἀῤῥωγόν, κεκτημένους τὸν Χριστόν, τῆς πλάνης τὸν καθαιρέτην.
ltx/gr_gr_cog/me.m01.d17:meMA.Exaposteilarion3.greekmelody	@ltx/gr_gr_cog/he.a.m3:heAU.EnPnevmatiToIero.greekname
ltx/gr_gr_cog/me.m01.d17:meMA.Exaposteilarion3.incipit	Ἐν σώματι διατελῶν, τῶν Ἀγγέλων…
ltx/gr_gr_cog/me.m01.d17:meMA.Exaposteilarion3.melody	@ltx/gr_gr_cog/he.a.m3:heAU.EnPnevmatiToIero.name
ltx/gr_gr_cog/me.m01.d17:meMA.Exaposteilarion3.mode	@ltx/gr_gr_cog/miscellanea:misc.Mode3
ltx/gr_gr_cog/me.m01.d17:meMA.Exaposteilarion3.text	Ἐν σώματι διατελῶν, τῶν Ἀγγέλων τὸν βίον, ὑπῆλθες ὥσπερ ἄσαρκος, καὶ τῷ κόσμῳ ἐδείχθης, φωστὴρ ἀειλαμπέστατος, καὶ τοῖς πᾶσιν ἔδειξας, Ἀντώνιε θεοφόρε, Μοναζόντων τὸ κλέος, Ἀσκητῶν ἡ καλλονή, καὶ τῶν Πατέρων ἡ δόξα.
ltx/gr_gr_cog/me.m01.d17:meMA.Kathisma11.greekmelody	@ltx/gr_gr_cog/he.a.m8:heAU.TinSofianKaiLogon.greekname
ltx/gr_gr_cog/me.m01.d17:meMA.Kathisma11.incipit	Τὴν ψυχήν σου δεσμεύσας πόθῳ…
ltx/gr_gr_cog/me.m01.d17:meMA.Kathisma11.melody	@ltx/gr_gr_cog/he.a.m8:heAU.TinSofianKaiLogon.name
ltx/gr_gr_cog/me.m01.d17:meMA.Kathisma11.mode	@ltx/gr_gr_cog/miscellanea:misc.Mode8
ltx/gr_gr_cog/me.m01.d17:meMA.Kathisma11.text	Τὴν ψυχήν σου δεσμεύσας πόθῳ Χριστοῦ, τὰ γεώδη μισήσας πάντα σαφῶς, ηὐλίσθης Πάτερ Ὅσιε, ἐν ἐρήμοις καὶ ὄρεσι· τοῦ γνωστικοῦ γὰρ ξύλου, γευσάμενος ἔνδοξε, ὡς ἐξ ἀδύτων μύστης, ἀγγελικῶς διέλαμψας· ὅθεν καὶ τὸν γνόφον, διαβὰς τῆς σαρκός σου, τὸ σκότος ἐδίωξας, τῶν δαιμόνων μακάριε, Μοναζόντων ὁ πρόκριτος. Πρέσβευε Χριστῷ τῷ Θεῷ, τῶν πταισμάτων ἄφεσιν δωρήσασθαι, τοῖς ἑορτάζουσι πόθῳ, τὴν Ἁγίαν μνήμην σου.
ltx/gr_gr_cog/me.m01.d17:meMA.Kathisma1T.incipit	@ltx/gr_gr_cog/he.a.m8:heAU.TinSofianKaiLogon.incipit
ltx/gr_gr_cog/me.m01.d17:meMA.Kathisma1T.melody	
ltx/gr_gr_cog/me.m01.d17:meMA.Kathisma1T.mode	@ltx/gr_gr_cog/miscellanea:misc.Mode8
ltx/gr_gr_cog/me.m01.d17:meMA.Kathisma1T.text	@ltx/gr_gr_cog/he.a.m8:heAU.TinSofianKaiLogon.text
ltx/gr_gr_cog/me.m01.d17:meMA.Kathisma21.greekmelody	@ltx/gr_gr_cog/he.a.m5:heAU.TonSynanarchonLogon.greekname
ltx/gr_gr_cog/me.m01.d17:meMA.Kathisma21.incipit	Τὸν Ἀσκητὴν τοῦ Κυρίου ὕμνοις…
ltx/gr_gr_cog/me.m01.d17:meMA.Kathisma21.melody	@ltx/gr_gr_cog/he.a.m5:heAU.TonSynanarchonLogon.name
ltx/gr_gr_cog/me.m01.d17:meMA.Kathisma21.mode	@ltx/gr_gr_cog/miscellanea:misc.Mode5
ltx/gr_gr_cog/me.m01.d17:meMA.Kathisma21.text	Τὸν Ἀσκητὴν τοῦ Κυρίου ὕμνοις τιμήσωμεν, ὡς νεκρώσαντα πάσας τὰς προσβολὰς τῶν παθῶν, διʼ ἐγκρατείας καὶ στεῤῥᾶς ὑπομονῆς ἀληθῶς, καὶ καταισχύναντα σφοδρῶς, τὸν ἀντίπαλον ἐχθρόν, καὶ πάσας τούτου ἐπάρσεις· καὶ νῦν πρεσβεύοντα τῷ Κυρίῳ, ἐλεηθῆναι τὰς ψυχὰς ἡμῶν.
ltx/gr_gr_cog/me.m01.d17:meMA.Kathisma2T.incipit	Χαῖρε πύλη Κυρίου ἡ ἀδιόδευτος…
ltx/gr_gr_cog/me.m01.d17:meMA.Kathisma2T.melody	
ltx/gr_gr_cog/me.m01.d17:meMA.Kathisma2T.mode	@ltx/gr_gr_cog/miscellanea:misc.Mode5
ltx/gr_gr_cog/me.m01.d17:meMA.Kathisma2T.text	Χαῖρε πύλη Κυρίου ἡ ἀδιόδευτος, ἣν προεκήρυξαν πάντες οἱ δικαιότατοι, καὶ ὁ Προφήτης Δανιήλ, Ὄρος ἀλάξευτον, καὶ Δαυῒδ ὁ μελῳδός, σὺν Μωϋσεῖ καὶ τοῖς λοιποῖς, Βάτον καὶ Στάμνον καὶ Ῥάβδον, Νεφέλην Πύλην καὶ θρόνον, καὶ μέγα Ὄρος ἀναδειχθεῖσαν ἡμῖν.
ltx/gr_gr_cog/me.m01.d17:meMA.Kathisma31.greekmelody	@ltx/gr_gr_cog/he.a.m8:heAU.TinSofianKaiLogon.greekname
ltx/gr_gr_cog/me.m01.d17:meMA.Kathisma31.incipit	Τοὺς θορύβους τοῦ βίου καταλιπών…
ltx/gr_gr_cog/me.m01.d17:meMA.Kathisma31.melody	@ltx/gr_gr_cog/he.a.m8:heAU.TinSofianKaiLogon.name
ltx/gr_gr_cog/me.m01.d17:meMA.Kathisma31.mode	@ltx/gr_gr_cog/miscellanea:misc.Mode8
ltx/gr_gr_cog/me.m01.d17:meMA.Kathisma31.text	Τοὺς θορύβους τοῦ βίου καταλιπών, τὸν σταυρόν σου ἐπʼ ὤμων ἀναλαβών, ὅλον ἀνατέθεικας, σεαυτὸν τῷ Κυρίῳ σου· καὶ σαρκὸς ἔξω Πάτερ, καὶ κόσμου γενόμενος, τοῦ Ἁγίου γέγονας, συνόμιλος Πνεύματος· ὅθεν καὶ πρὸς ζῆλον, τοὺς λαοὺς διεγείρων, τὰς πόλεις ἐκένωσας, τὰς ἐρήμους ἐπόλισας, θεοφόρε Ἀντώνιε. Πρέσβευε Χριστῷ τῷ Θεῷ, τῶν πταισμάτων ἄφεσιν δωρήσασθαι, τοῖς ἑορτάζουσι πόθῳ, τὴν ἁγίαν μνήμην σου.
ltx/gr_gr_cog/me.m01.d17:meMA.Kathisma32.greekmelody	@ltx/gr_gr_cog/he.a.m4:heAU.EpefanisSimeron.greekname
ltx/gr_gr_cog/me.m01.d17:meMA.Kathisma32.incipit	Τῷ φωτὶ λαμπομενος, τῷ ἀπροσίτῳ…
ltx/gr_gr_cog/me.m01.d17:meMA.Kathisma32.melody	@ltx/gr_gr_cog/he.a.m4:heAU.EpefanisSimeron.name
ltx/gr_gr_cog/me.m01.d17:meMA.Kathisma32.mode	@ltx/gr_gr_cog/miscellanea:misc.Mode4
ltx/gr_gr_cog/me.m01.d17:meMA.Kathisma32.text	Τῷ φωτὶ λαμπομενος, τῷ ἀπροσίτῳ, ὡς ἀστὴρ ἐξέλαμψας, ἐν ταῖς ἐρήμοις, διδαχαῖς, καταφωτίζων Ἀντώνιε, τοὺς ἀδιστάκτῳ ψυχῇ προσιόντας σοι.
ltx/gr_gr_cog/me.m01.d17:meMA.Kathisma3T.incipit	Ἐπελεύσει Πνεύματος, τοῦ Παναγίου, τοῦ…
ltx/gr_gr_cog/me.m01.d17:meMA.Kathisma3T.melody	@ltx/gr_gr_cog/he.a.m4:heAU.EpefanisSimeron.name
ltx/gr_gr_cog/me.m01.d17:meMA.Kathisma3T.mode	@ltx/gr_gr_cog/miscellanea:misc.Mode4
ltx/gr_gr_cog/me.m01.d17:meMA.Kathisma3T.text	Ἐπελεύσει Πνεύματος, τοῦ Παναγίου, τοῦ Πατρὸς τὸν σύνθρονον, καὶ ὁμοούσιον φωνῇ, Ἁγνὴ Ἀγγέλου συνέλαβες, Θεοκυῆτορ, Ἀδὰμ ἡ ἀνάκλησις.
ltx/gr_gr_cog/me.m01.d17:meMA.Kontakion1.greekmelody	@ltx/gr_gr_cog/he.a.m2:heAU.TaAnoZiton.greekname
ltx/gr_gr_cog/me.m01.d17:meMA.Kontakion1.incipit	Τοὺς βιωτικοὺς θορύβους ἀπωσάμενος, ἡσυχαστικῶς…
ltx/gr_gr_cog/me.m01.d17:meMA.Kontakion1.melody	@ltx/gr_gr_cog/he.a.m2:heAU.TaAnoZiton.name
ltx/gr_gr_cog/me.m01.d17:meMA.Kontakion1.mode	@ltx/gr_gr_cog/miscellanea:misc.Mode2
ltx/gr_gr_cog/me.m01.d17:meMA.Kontakion1.text	Τοὺς βιωτικοὺς θορύβους ἀπωσάμενος, ἡσυχαστικῶς τὸν βίον ἐξετέλεσας, τὸν Βαπτιστὴν μιμούμενος, κατὰ πάντα τρόπον Ὁσιώτατε, σὺν αὐτῷ οὖν σε γεραίρομεν, Πατέρων Πάτερ Ἀντώνιε.
ltx/gr_gr_cog/me.m01.d17:meMA.Lauds1.greekmelody	@ltx/gr_gr_cog/he.a.m8:heAU.OTouParadoxou.greekname
ltx/gr_gr_cog/me.m01.d17:meMA.Lauds1.incipit	Ὅσιε Πάτερ Ἀντώνιε, σὺ τὸν…
ltx/gr_gr_cog/me.m01.d17:meMA.Lauds1.melody	@ltx/gr_gr_cog/he.a.m8:heAU.OTouParadoxou.name
ltx/gr_gr_cog/me.m01.d17:meMA.Lauds1.mode	@ltx/gr_gr_cog/miscellanea:misc.Mode8
ltx/gr_gr_cog/me.m01.d17:meMA.Lauds1.text	Ὅσιε Πάτερ Ἀντώνιε, σὺ τὸν ζυγὸν τοῦ Χριστοῦ, ἐπὶ ὤμων ἀράμενος, τῷ Σταυρῷ τὴν ἔπαρσιν, τοῦ Σατᾶν καταβέβληκας, καὶ τὰς ἐρήμους, πόλεις ἀνέδειξας, διὰ τοῦ τρόπου τῆς πολιτείας σου. Ὦ παμμακάριστε, Ἀσκητῶν τὸ καύχημα, διὸ Χριστόν, ἀπαύστως ἱκέτευε, ἐλεηθῆναι ἡμᾶς.
ltx/gr_gr_cog/me.m01.d17:meMA.Lauds2.incipit	Ὅσιε Πάτερ Ἀντώνιε, διὰ τὴν…
ltx/gr_gr_cog/me.m01.d17:meMA.Lauds2.melody	@ltx/gr_gr_cog/he.a.m8:heAU.OTouParadoxou.name
ltx/gr_gr_cog/me.m01.d17:meMA.Lauds2.mode	@ltx/gr_gr_cog/miscellanea:misc.Mode8
ltx/gr_gr_cog/me.m01.d17:meMA.Lauds2.text	Ὅσιε Πάτερ Ἀντώνιε, διὰ τὴν ὄντως ζωήν, ἐν τῷ μνήματι κέκλεισαι, μηδόλως πτοούμενος, προσβολὰς τοῦ ἀλάστορος, τὰς μετὰ κτύπων καὶ κρότων Ὅσιε· ταῖς δὲ εὐχαῖς σου, ταύτας ἠδάφισας. Ὦ καρτερόψυχε, τῆς ἐρήμου πρώταρχε, διὸ καὶ νῦν, πάντες σε γεραίρομεν, καὶ μακαρίζομεν.
ltx/gr_gr_cog/me.m01.d17:meMA.Lauds3.incipit	Πίστει συνελθόντες πάντες σε, ὡς…
ltx/gr_gr_cog/me.m01.d17:meMA.Lauds3.melody	@ltx/gr_gr_cog/he.a.m8:heAU.OTouParadoxou.name
ltx/gr_gr_cog/me.m01.d17:meMA.Lauds3.mode	@ltx/gr_gr_cog/miscellanea:misc.Mode8
ltx/gr_gr_cog/me.m01.d17:meMA.Lauds3.text	Πίστει συνελθόντες πάντες σε, ὡς Ἀσκητὴν τοῦ Χριστοῦ, σὲ τιμῶμεν Ἀντώνιε· γεγηθὼς γὰρ ὥδευσας, ἐν ἐρήμοις σαφέστατα, καθηγητής τε ταύτης ἐγένου πιστός· ὅθεν σοι πάντες, ἡμεῖς κραυγάζομεν. Ὦ παμμακάριστε, Μοναστῶν τὸ καύχημα, τῷ Λυτρωτῇ, ἀπαύστως ἱκέτευε, εἰς τὸ σωθῆναι ἡμᾶς.
ltx/gr_gr_cog/me.m01.d17:meMA.Lauds4.greekmelody	@ltx/gr_gr_cog/he.a.m8:heAU.OTouParadoxou.greekname
ltx/gr_gr_cog/me.m01.d17:meMA.Lauds4.incipit	Πάτερ Πατέρων Ἀντώνιε, τῇ ἀκορέστῳ…
ltx/gr_gr_cog/me.m01.d17:meMA.Lauds4.melody	@ltx/gr_gr_cog/he.a.m8:heAU.OTouParadoxou.name
ltx/gr_gr_cog/me.m01.d17:meMA.Lauds4.mode	@ltx/gr_gr_cog/miscellanea:misc.Mode8
ltx/gr_gr_cog/me.m01.d17:meMA.Lauds4.text	Πάτερ Πατέρων Ἀντώνιε, τῇ ἀκορέστῳ στοργῇ, τοῦ Χριστοῦ καὶ τῷ ἔρωτι, τὴν ψυχὴν κινούμενος, ἐν ἐρήμοις ἐζήτησας, αὐτὸν θορύβους, ἐκκλίνας ἅπαντας, καὶ μόνος τούτῳ, μόνῳ ὡμίλησας, νοῒ ἑνούμενος, καὶ φωτὸς πληρούμενος, ᾧ καὶ ἡμῶν, τὰς ψυχὰς καταύγασον, τῶν ἀνυμνούντων σε.
ltx/gr_gr_cog/me.m01.d17:meMA.LaudsGlory.incipit	Οὐρανοδρόμῳ ἐπιβὰς ὀχήματι θεσπέσιε, τῶν…
ltx/gr_gr_cog/me.m01.d17:meMA.LaudsGlory.melody	
ltx/gr_gr_cog/me.m01.d17:meMA.LaudsGlory.mode	@ltx/gr_gr_cog/miscellanea:misc.Mode8
ltx/gr_gr_cog/me.m01.d17:meMA.LaudsGlory.poet	@ltx/gr_gr_cog/poets:po.Anatoliou
ltx/gr_gr_cog/me.m01.d17:meMA.LaudsGlory.text	Οὐρανοδρόμῳ ἐπιβὰς ὀχήματι θεσπέσιε, τῶν ἀρετῶν κατέλαβες, τὴν ἀκρόπολιν διʼ ἀσκήσεως, ἐκ τῆς ἐρήμου πολεύων, τῆς ἄνω Ἱερουσαλήμ, τὰ ὑπερκόσμια, καὶ τῶν ἐκ πόνων ἀγώνων, ἀξίως τὰ γέρα κομισάμενος, ταῖς οὐρανίαις συναγάλλῃ, ταξιαρχίαις Παμμακάριστε, τῶν αἰωνίων ἀγαθῶν κληρονόμος, καὶ τῆς Βασιλείας οἰκήτωρ γενόμενος. Ἀλλὰ πρέσβευε θεοφόρε Ἀντώνιε, τῷ Σωτῆρι τῶν ὅλων, εἰρηνεῦσαι τὸν κόσμον, καὶ σῶσαι τὰς ψυχὰς ἡμῶν.
ltx/gr_gr_cog/me.m01.d17:meMA.LaudsTheotokion.incipit	@ltx/gr_gr_cog/oc.m8.d5:ocMA.AposTheotokion.incipit
ltx/gr_gr_cog/me.m01.d17:meMA.LaudsTheotokion.melody	
ltx/gr_gr_cog/me.m01.d17:meMA.LaudsTheotokion.mode	@ltx/gr_gr_cog/miscellanea:misc.Mode8
ltx/gr_gr_cog/me.m01.d17:meMA.LaudsTheotokion.text	@ltx/gr_gr_cog/oc.m8.d5:ocMA.AposTheotokion.text
ltx/gr_gr_cog/me.m01.d17:meMA.MM.Lauds1234as5678.text	@ltx/gr_gr_cog/properties:media.key
ltx/gr_gr_cog/me.m01.d17:meMA.Ode1C11.greekmelody	@ltx/gr_gr_cog/he.h.m8:heHE.ArmatilatinFarao.greekname
ltx/gr_gr_cog/me.m01.d17:meMA.Ode1C11.incipit	Ἀθανασίας καὶ ζωῆς λαβόμενος, τῆς…
ltx/gr_gr_cog/me.m01.d17:meMA.Ode1C11.melody	@ltx/gr_gr_cog/he.h.m8:heHE.ArmatilatinFarao.name
ltx/gr_gr_cog/me.m01.d17:meMA.Ode1C11.mode	@ltx/gr_gr_cog/miscellanea:misc.Mode8
ltx/gr_gr_cog/me.m01.d17:meMA.Ode1C11.ode	@ltx/gr_gr_cog/miscellanea:misc.Ode1
ltx/gr_gr_cog/me.m01.d17:meMA.Ode1C11.text	Ἀθανασίας καὶ ζωῆς λαβόμενος, τῆς αἰωνίου σαφῶς, καὶ τριλαμποῦς αἴγλης, Πάτερ ἐμφορούμενος, τῷ φωτισμῷ τῆς χάριτος, τὴν ζοφώδη ψυχήν μου, καταυγασθῆναι δυσώπησον, ὅπως ἐπαξίως ὑμνήσω σε.
ltx/gr_gr_cog/me.m01.d17:meMA.Ode1C12.incipit	Νέος ὑπάρχων ἡλικίᾳ σώματος, καινὴν…
ltx/gr_gr_cog/me.m01.d17:meMA.Ode1C12.melody	@ltx/gr_gr_cog/he.h.m8:heHE.ArmatilatinFarao.name
ltx/gr_gr_cog/me.m01.d17:meMA.Ode1C12.mode	@ltx/gr_gr_cog/miscellanea:misc.Mode8
ltx/gr_gr_cog/me.m01.d17:meMA.Ode1C12.ode	@ltx/gr_gr_cog/miscellanea:misc.Ode1
ltx/gr_gr_cog/me.m01.d17:meMA.Ode1C12.text	Νέος ὑπάρχων ἡλικίᾳ σώματος, καινὴν ὁδὸν ἀρετῆς, ἀναλαβὼν ταύτην, ἀκινδύνως ὥδευσας, νόμῳ καινῷ πειθόμενος, τοῦ Σωτῆρος Τρισμάκαρ, καὶ ζωηφόροις προστάγμασι, τοῦ Εὐαγγελίου ἑπόμενος.
ltx/gr_gr_cog/me.m01.d17:meMA.Ode1C13.incipit	Τῇ τρισηλίῳ λαμπηδόνι Πάνσοφε, καταλαμπόμενος…
ltx/gr_gr_cog/me.m01.d17:meMA.Ode1C13.melody	@ltx/gr_gr_cog/he.h.m8:heHE.ArmatilatinFarao.name
ltx/gr_gr_cog/me.m01.d17:meMA.Ode1C13.mode	@ltx/gr_gr_cog/miscellanea:misc.Mode8
ltx/gr_gr_cog/me.m01.d17:meMA.Ode1C13.ode	@ltx/gr_gr_cog/miscellanea:misc.Ode1
ltx/gr_gr_cog/me.m01.d17:meMA.Ode1C13.text	Τῇ τρισηλίῳ λαμπηδόνι Πάνσοφε, καταλαμπόμενος, τὸ δυσμενὲς μάκαρ, τῶν δαιμόνων φρύαγμα, καὶ τῶν θηρῶν τὰ χάσματα, αἰκισμῶν τε τοὺς πόνους, ἀράχνης δίκην διέλυσας, θείῳ πυρακτούμενος ἔρωτι.
ltx/gr_gr_cog/me.m01.d17:meMA.Ode1C1T.incipit	Ὡς Θεοῦ Μήτηρ παῤῥησίαν ἔχουσα…
ltx/gr_gr_cog/me.m01.d17:meMA.Ode1C1T.melody	@ltx/gr_gr_cog/he.h.m8:heHE.ArmatilatinFarao.name
ltx/gr_gr_cog/me.m01.d17:meMA.Ode1C1T.mode	@ltx/gr_gr_cog/miscellanea:misc.Mode8
ltx/gr_gr_cog/me.m01.d17:meMA.Ode1C1T.ode	@ltx/gr_gr_cog/miscellanea:misc.Ode1
ltx/gr_gr_cog/me.m01.d17:meMA.Ode1C1T.text	Ὡς Θεοῦ Μήτηρ παῤῥησίαν ἔχουσα, πρὸς τὸν τεχθέντα ἐκ σοῦ, μονογενῆ Λόγον, τὸν Πατρὶ συνάναρχον, καὶ συμφυῆ τῷ Πνεύματι, δυσωποῦσα μὴ παύσῃ, κινδύνων σῶσαι Πανάμωμε, τοὺς σὲ Θεοτόκον δοξάζοντας.
ltx/gr_gr_cog/me.m01.d17:meMA.Ode3C11.greekmelody	@ltx/gr_gr_cog/he.h.m8:heHE.OStereosasKatArchas.greekname
ltx/gr_gr_cog/me.m01.d17:meMA.Ode3C11.incipit	Νενευρωμένῳ λογισμῷ, καὶ σταθηρᾷ διανοίᾳ…
ltx/gr_gr_cog/me.m01.d17:meMA.Ode3C11.melody	@ltx/gr_gr_cog/he.h.m8:heHE.OStereosasKatArchas.name
ltx/gr_gr_cog/me.m01.d17:meMA.Ode3C11.mode	@ltx/gr_gr_cog/miscellanea:misc.Mode8
ltx/gr_gr_cog/me.m01.d17:meMA.Ode3C11.ode	@ltx/gr_gr_cog/miscellanea:misc.Ode3
ltx/gr_gr_cog/me.m01.d17:meMA.Ode3C11.text	Νενευρωμένῳ λογισμῷ, καὶ σταθηρᾷ διανοίᾳ, τῶν παθῶν καταμαράνας τὴν φλόγα, ἀπαθείας τὴν φαιδράν, καταστολὴν Ἀντώνιε, περιεβάλου Πάτερ, καὶ σωτηρίου ἱμάτιον.
ltx/gr_gr_cog/me.m01.d17:meMA.Ode3C12.incipit	Ἰσχυροτάταις προσβολαῖς, δαιμόνων θρασυνομένων, καὶ…
ltx/gr_gr_cog/me.m01.d17:meMA.Ode3C12.melody	@ltx/gr_gr_cog/he.h.m8:heHE.OStereosasKatArchas.name
ltx/gr_gr_cog/me.m01.d17:meMA.Ode3C12.mode	@ltx/gr_gr_cog/miscellanea:misc.Mode8
ltx/gr_gr_cog/me.m01.d17:meMA.Ode3C12.ode	@ltx/gr_gr_cog/miscellanea:misc.Ode3
ltx/gr_gr_cog/me.m01.d17:meMA.Ode3C12.text	Ἰσχυροτάταις προσβολαῖς, δαιμόνων θρασυνομένων, καὶ θηρίων τὰς μορφὰς μιμουμένων, κατεφρόνησας αὐτῶν, τῆς ἀσθενοῦς δυνάμεως· τὸν κραταιὸν γὰρ εἶχες, ἐν τοῖς πολέμοις συλλήπτορα.
ltx/gr_gr_cog/me.m01.d17:meMA.Ode3C13.incipit	Ὁ θεοφόρος τὰς ἀρχάς, τοῦ…
ltx/gr_gr_cog/me.m01.d17:meMA.Ode3C13.melody	@ltx/gr_gr_cog/he.h.m8:heHE.OStereosasKatArchas.name
ltx/gr_gr_cog/me.m01.d17:meMA.Ode3C13.mode	@ltx/gr_gr_cog/miscellanea:misc.Mode8
ltx/gr_gr_cog/me.m01.d17:meMA.Ode3C13.ode	@ltx/gr_gr_cog/miscellanea:misc.Ode3
ltx/gr_gr_cog/me.m01.d17:meMA.Ode3C13.text	Ὁ θεοφόρος τὰς ἀρχάς, τοῦ σκότους καὶ ἐξουσίας, θριαμβεύσας ἐγκρατείᾳ συντόνῳ, τροπαιοῦχος νικητής, Ἀντώνιος ἐγένετο, τῶν ἀσκητῶν ἡ δόξα, καὶ μοναζόντων τὸ καύχημα.
ltx/gr_gr_cog/me.m01.d17:meMA.Ode3C1T.incipit	Νενεκρωμένον μου τὸν νοῦν, τῇ…
ltx/gr_gr_cog/me.m01.d17:meMA.Ode3C1T.melody	@ltx/gr_gr_cog/he.h.m8:heHE.OStereosasKatArchas.name
ltx/gr_gr_cog/me.m01.d17:meMA.Ode3C1T.mode	@ltx/gr_gr_cog/miscellanea:misc.Mode8
ltx/gr_gr_cog/me.m01.d17:meMA.Ode3C1T.ode	@ltx/gr_gr_cog/miscellanea:misc.Ode3
ltx/gr_gr_cog/me.m01.d17:meMA.Ode3C1T.text	Νενεκρωμένον μου τὸν νοῦν, τῇ τῆς ζωῆς ἐνεργείᾳ, τῆς ἐκ σοῦ φανερωθείσης τῷ κόσμῳ, ἐξανάστησον Ἁγνή, καὶ πρὸς ζωὴν ὁδήγησον, ἡ τοῦ θανάτου πύλας, λύσασα μόνη τῷ κόσμῳ σου.
ltx/gr_gr_cog/me.m01.d17:meMA.Ode3Kathisma1.greekmelody	@ltx/gr_gr_cog/he.a.m8:heAU.TinSofianKaiLogon.greekname
ltx/gr_gr_cog/me.m01.d17:meMA.Ode3Kathisma1.incipit	Τὸν Σταυρόν τοῦ Κυρίου ἄρας…
ltx/gr_gr_cog/me.m01.d17:meMA.Ode3Kathisma1.melody	@ltx/gr_gr_cog/he.a.m8:heAU.TinSofianKaiLogon.name
ltx/gr_gr_cog/me.m01.d17:meMA.Ode3Kathisma1.mode	@ltx/gr_gr_cog/miscellanea:misc.Mode8
ltx/gr_gr_cog/me.m01.d17:meMA.Ode3Kathisma1.text	Τὸν Σταυρόν τοῦ Κυρίου ἄρας σοφέ, καὶ αὐτῷ μέχρι τέλους ἀκολουθῶν, τὸν νοῦν οὐχ ὑπέστρεψας, ἐν τῷ κόσμῳ θεόσοφε· ἀλλʼ ἐγκρατείας πόνοις, τὰ πάθη ἐνέκρωσας, καὶ ναὸν ἡτοίμασας, σαυτὸν τῷ Κυρίῳ σου· ὅθεν χαρισμάτων ἀμοιβὴν ἐκομίσω, ἰᾶσθαι νοσήματα, καὶ διώκειν τὰ πνεύματα, θεοφόρε Ἀντώνιε. Πρέσβευε Χριστῷ τῷ Θεῷ, τῶν πταισμάτων ἄφεσιν δωρήσασθαι, τοῖς ἑορτάζουσι πόθῳ, τὴν ἁγίαν μνήμην σου.
ltx/gr_gr_cog/me.m01.d17:meMA.Ode3KathismaT.incipit	Ὡς πανάμωμος Νύμφη τοῦ Ποιητοῦ…
ltx/gr_gr_cog/me.m01.d17:meMA.Ode3KathismaT.melody	@ltx/gr_gr_cog/he.a.m8:heAU.TinSofianKaiLogon.name
ltx/gr_gr_cog/me.m01.d17:meMA.Ode3KathismaT.mode	@ltx/gr_gr_cog/miscellanea:misc.Mode8
ltx/gr_gr_cog/me.m01.d17:meMA.Ode3KathismaT.text	Ὡς πανάμωμος Νύμφη τοῦ Ποιητοῦ, ὡς ἀπείρανδρος Μήτηρ τοῦ Λυτρωτοῦ, δοχεῖον ὡς ὑπάρχουσα, τοῦ Παρακλήτου πανύμνητε, ἀνομίας με ὄντα, αἰσχρὸν καταγώγιον, καὶ δαιμόνων παίγνιον, ἐν γνώσει γενόμενον, σπεῦσον καὶ τῆς τούτων, κακουργίας με ῥῦσαι, λαμπρὸν οἰκητήριον, διʼ ἀρετῆς ἀπαρτίσασα, Φωτοδόχε ἀκήρατε· δίωξον τὸ νέφος τῶν παθῶν, καὶ τῆς ἄνω μεθέξεως ἀξίωσον, καὶ φωτὸς ἀνεσπέρου πρεσβείαις σου.
ltx/gr_gr_cog/me.m01.d17:meMA.Ode4C11.greekmelody	@ltx/gr_gr_cog/he.h.m8:heHE.SyMouIschys.greekname
ltx/gr_gr_cog/me.m01.d17:meMA.Ode4C11.incipit	Τῶν ἀρετῶν, κλίμακι θείᾳ χρησάμενος…
ltx/gr_gr_cog/me.m01.d17:meMA.Ode4C11.melody	@ltx/gr_gr_cog/he.h.m8:heHE.SyMouIschys.name
ltx/gr_gr_cog/me.m01.d17:meMA.Ode4C11.mode	@ltx/gr_gr_cog/miscellanea:misc.Mode8
ltx/gr_gr_cog/me.m01.d17:meMA.Ode4C11.ode	@ltx/gr_gr_cog/miscellanea:misc.Ode4
ltx/gr_gr_cog/me.m01.d17:meMA.Ode4C11.text	Τῶν ἀρετῶν, κλίμακι θείᾳ χρησάμενος, πρὸς τὸ ὕψος, Πάτερ ἀναβέβηκας, καὶ τὸν Θεὸν εἶδες ἐπʼ αὐτήν, ἐπεστηριγμένον, καὶ δωρεὰς διανέμοντα, χειρὶ πλουσιωτάτῃ, τοῖς Πιστῶς μελῳδοῦσι. Τῇ δυνάμει σου δόξα Φιλάνθρωπε.
ltx/gr_gr_cog/me.m01.d17:meMA.Ode4C12.incipit	Ὅλος Θεῷ, καθιερώθης Ἀντώνιε, μόνος…
ltx/gr_gr_cog/me.m01.d17:meMA.Ode4C12.melody	@ltx/gr_gr_cog/he.h.m8:heHE.SyMouIschys.name
ltx/gr_gr_cog/me.m01.d17:meMA.Ode4C12.mode	@ltx/gr_gr_cog/miscellanea:misc.Mode8
ltx/gr_gr_cog/me.m01.d17:meMA.Ode4C12.ode	@ltx/gr_gr_cog/miscellanea:misc.Ode4
ltx/gr_gr_cog/me.m01.d17:meMA.Ode4C12.text	Ὅλος Θεῷ, καθιερώθης Ἀντώνιε, μόνος μόνῳ, πάνσοφε ἑνούμενος, διʼ ἀρετῆς, καὶ καθομιλῶν, καὶ θεοφανείας, ὡς καθαρὸς ἀξιούμενος, τῆς γῆς καὶ τῶν γηΐνων· ἀποστὰς γὰρ ἀξίως, τὴν οὐράνιον εὗρες ἀπόλαυσιν.
ltx/gr_gr_cog/me.m01.d17:meMA.Ode4C13.incipit	Νοῦν καὶ ψυχήν, κεκαθαρμένος Ἀντώνιε…
ltx/gr_gr_cog/me.m01.d17:meMA.Ode4C13.melody	@ltx/gr_gr_cog/he.h.m8:heHE.SyMouIschys.name
ltx/gr_gr_cog/me.m01.d17:meMA.Ode4C13.mode	@ltx/gr_gr_cog/miscellanea:misc.Mode8
ltx/gr_gr_cog/me.m01.d17:meMA.Ode4C13.ode	@ltx/gr_gr_cog/miscellanea:misc.Ode4
ltx/gr_gr_cog/me.m01.d17:meMA.Ode4C13.text	Νοῦν καὶ ψυχήν, κεκαθαρμένος Ἀντώνιε, τὴν ἀπάτην, Πάτερ τὴν ψυχόλεθρον, καὶ μηχανάς, δόλους τε πικρούς, καὶ τὰς φαντασίας, τῶν δυσμενῶν ἐφανέρωσας· παθῶν γὰρ ἐδιδάχθης, καὶ μαθὼν ἐκδιδάσκεις, Μοναζόντων τὰ πλήθη Πανόλβιε.
ltx/gr_gr_cog/me.m01.d17:meMA.Ode4C1T.incipit	Θεὸν ἐκ σοῦ, τὸν σαρκωθέντα…
ltx/gr_gr_cog/me.m01.d17:meMA.Ode4C1T.melody	@ltx/gr_gr_cog/he.h.m8:heHE.SyMouIschys.name
ltx/gr_gr_cog/me.m01.d17:meMA.Ode4C1T.mode	@ltx/gr_gr_cog/miscellanea:misc.Mode8
ltx/gr_gr_cog/me.m01.d17:meMA.Ode4C1T.ode	@ltx/gr_gr_cog/miscellanea:misc.Ode4
ltx/gr_gr_cog/me.m01.d17:meMA.Ode4C1T.text	Θεὸν ἐκ σοῦ, τὸν σαρκωθέντα δυσώπησον, τὸν ἀτρέπτως, ὃ ἦν διαμείναντα, καὶ φυσικῶς, ἴσον τῷ Πατρί, καὶ σοὶ τῇ Τεκούσῃ, γενόμενον ὁμοούσιον, συγχώρησιν πταισμάτων, καὶ ψυχῶν σωτηρίαν, τοῖς ὑμνοῦσί σε πίστει δωρήσασθαι.
ltx/gr_gr_cog/me.m01.d17:meMA.Ode5C11.greekmelody	@ltx/gr_gr_cog/he.h.m8:heHE.InaTiMeAposo.greekname
ltx/gr_gr_cog/me.m01.d17:meMA.Ode5C11.incipit	Ἐνοικοῦντά σοι ἔχων, τὸν τὰ…
ltx/gr_gr_cog/me.m01.d17:meMA.Ode5C11.melody	@ltx/gr_gr_cog/he.h.m8:heHE.InaTiMeAposo.name
ltx/gr_gr_cog/me.m01.d17:meMA.Ode5C11.mode	@ltx/gr_gr_cog/miscellanea:misc.Mode8
ltx/gr_gr_cog/me.m01.d17:meMA.Ode5C11.ode	@ltx/gr_gr_cog/miscellanea:misc.Ode5
ltx/gr_gr_cog/me.m01.d17:meMA.Ode5C11.text	Ἐνοικοῦντά σοι ἔχων, τὸν τὰ πάντα βλέποντα Θεὸν μακάριον, ἐκδιδάσκοντά σε, καὶ φωτίζοντα καὶ συνετίζοντα, τῶν ψυχῶν Τρισμάκαρ, τῶν καθαρῶν καὶ μακαρίων, τὰς ἀνόδους ὁρᾶν κατηξίωσαι.
ltx/gr_gr_cog/me.m01.d17:meMA.Ode5C12.incipit	Ἰαμάτων σοι χάριν, κατὰ νοσημάτων…
ltx/gr_gr_cog/me.m01.d17:meMA.Ode5C12.melody	@ltx/gr_gr_cog/he.h.m8:heHE.InaTiMeAposo.name
ltx/gr_gr_cog/me.m01.d17:meMA.Ode5C12.mode	@ltx/gr_gr_cog/miscellanea:misc.Mode8
ltx/gr_gr_cog/me.m01.d17:meMA.Ode5C12.ode	@ltx/gr_gr_cog/miscellanea:misc.Ode5
ltx/gr_gr_cog/me.m01.d17:meMA.Ode5C12.text	Ἰαμάτων σοι χάριν, κατὰ νοσημάτων ποικίλων δεδώρηται, καὶ κατὰ πνευμάτων, ἀκαθάρτων Χριστὸς ἐξουσίαν Σοφέ· τὴν γὰρ φύσιν Πάτερ, νενικηκὼς τῶν ὑπὲρ φύσιν, χαρισμάτων μετέσχες τοῦ Πνεύματος.
ltx/gr_gr_cog/me.m01.d17:meMA.Ode5C1T.incipit	Οἱ σὲ τεῖχος πλουτοῦντες, καὶ…
ltx/gr_gr_cog/me.m01.d17:meMA.Ode5C1T.melody	@ltx/gr_gr_cog/he.h.m8:heHE.InaTiMeAposo.name
ltx/gr_gr_cog/me.m01.d17:meMA.Ode5C1T.mode	@ltx/gr_gr_cog/miscellanea:misc.Mode8
ltx/gr_gr_cog/me.m01.d17:meMA.Ode5C1T.ode	@ltx/gr_gr_cog/miscellanea:misc.Ode5
ltx/gr_gr_cog/me.m01.d17:meMA.Ode5C1T.text	Οἱ σὲ τεῖχος πλουτοῦντες, καὶ τῇ προστασίᾳ σου περιφρουρούμενοι, δόξῃ, τῇ σῇ θείᾳ ἐγκαυχώμενοι σὲ μακαρίζομεν· σὺ γὰρ Παναγία, τὴν τῶν ψυχῶν ἡμῶν πηγάζεις, εὐφροσύνην τε καὶ ἀγαλλίασιν.
ltx/gr_gr_cog/me.m01.d17:meMA.Ode6C11.greekmelody	@ltx/gr_gr_cog/he.h.m8:heHE.AvyssosAmartion.greekname
ltx/gr_gr_cog/me.m01.d17:meMA.Ode6C11.incipit	Νόμιμον ἀθλητικῶς, πολιτείαν ἁπαλῶν ἐξ…
ltx/gr_gr_cog/me.m01.d17:meMA.Ode6C11.melody	@ltx/gr_gr_cog/he.h.m8:heHE.AvyssosAmartion.name
ltx/gr_gr_cog/me.m01.d17:meMA.Ode6C11.mode	@ltx/gr_gr_cog/miscellanea:misc.Mode8
ltx/gr_gr_cog/me.m01.d17:meMA.Ode6C11.ode	@ltx/gr_gr_cog/miscellanea:misc.Ode6
ltx/gr_gr_cog/me.m01.d17:meMA.Ode6C11.text	Νόμιμον ἀθλητικῶς, πολιτείαν ἁπαλῶν ἐξ ὀνύχων ἀναλαβὼν Θεόφρον, μέχρι τέλους διέσωσας, καὶ ὡς θεῖος ἀριστεύς, στέφανον εἴληφας, τὸν τῆς νίκης, παρὰ τοῦ πάντων Βασιλεύοντος.
ltx/gr_gr_cog/me.m01.d17:meMA.Ode6C12.incipit	Ἔχοντες πρὸς τὸν Θεόν, πρεσβευτὴν…
ltx/gr_gr_cog/me.m01.d17:meMA.Ode6C12.melody	@ltx/gr_gr_cog/he.h.m8:heHE.AvyssosAmartion.name
ltx/gr_gr_cog/me.m01.d17:meMA.Ode6C12.mode	@ltx/gr_gr_cog/miscellanea:misc.Mode8
ltx/gr_gr_cog/me.m01.d17:meMA.Ode6C12.ode	@ltx/gr_gr_cog/miscellanea:misc.Ode6
ltx/gr_gr_cog/me.m01.d17:meMA.Ode6C12.text	Ἔχοντες πρὸς τὸν Θεόν, πρεσβευτήν σε δυνατώτατον Μάκαρ, καὶ κοινωνὸν φροντίδων, καὶ προστάτην καὶ πρόμαχον, καὶ μεσίτην εὐμενῆ, πάντων σῳζόμεθα τῶν κινδύνων, καὶ πειρασμῶν καὶ περιστάσεων.
ltx/gr_gr_cog/me.m01.d17:meMA.Ode6C1T.incipit	Ὕψωσας παναληθῶς, τὴν πεσοῦσαν τῶν…
ltx/gr_gr_cog/me.m01.d17:meMA.Ode6C1T.melody	@ltx/gr_gr_cog/he.h.m8:heHE.AvyssosAmartion.name
ltx/gr_gr_cog/me.m01.d17:meMA.Ode6C1T.mode	@ltx/gr_gr_cog/miscellanea:misc.Mode8
ltx/gr_gr_cog/me.m01.d17:meMA.Ode6C1T.ode	@ltx/gr_gr_cog/miscellanea:misc.Ode6
ltx/gr_gr_cog/me.m01.d17:meMA.Ode6C1T.text	Ὕψωσας παναληθῶς, τὴν πεσοῦσαν τῶν ἀνθρώπων οὐσίαν, τὸν ἐν μορφῇ τῇ θείᾳ, καὶ Πατρὸς ἐν ἰσότητι, καθορώμενον Υἱόν, τὸν ἀναλλοίωτον Θεοτόκε, ἄνευ σπορᾶς κυοφορήσασα.
ltx/gr_gr_cog/me.m01.d17:meMA.Ode7C11.greekmelody	@ltx/gr_gr_cog/he.h.m8:heHE.TheouSynkatavasin.greekname
ltx/gr_gr_cog/me.m01.d17:meMA.Ode7C11.incipit	Φιάλαι πεφύκασι, τῶν ἀρωμάτων αἱ…
ltx/gr_gr_cog/me.m01.d17:meMA.Ode7C11.melody	@ltx/gr_gr_cog/he.h.m8:heHE.TheouSynkatavasin.name
ltx/gr_gr_cog/me.m01.d17:meMA.Ode7C11.mode	@ltx/gr_gr_cog/miscellanea:misc.Mode8
ltx/gr_gr_cog/me.m01.d17:meMA.Ode7C11.ode	@ltx/gr_gr_cog/miscellanea:misc.Ode7
ltx/gr_gr_cog/me.m01.d17:meMA.Ode7C11.text	Φιάλαι πεφύκασι, τῶν ἀρωμάτων αἱ σιαγόνες σου, ἀρετῶν εὐωδίας, καὶ σωτηρίας ἀρωματίζουσαι, ὡς ἐκ λειμῶνος, τοῖς πόθῳ κραυγάζουσιν· Εὐλογητὸς ὁ Θεός, ὁ τῶν Πατέρων ἡμῶν.
ltx/gr_gr_cog/me.m01.d17:meMA.Ode7C12.incipit	Ἡ χάρις τοῦ Πνεύματος, τοῦ…
ltx/gr_gr_cog/me.m01.d17:meMA.Ode7C12.melody	@ltx/gr_gr_cog/he.h.m8:heHE.TheouSynkatavasin.name
ltx/gr_gr_cog/me.m01.d17:meMA.Ode7C12.mode	@ltx/gr_gr_cog/miscellanea:misc.Mode8
ltx/gr_gr_cog/me.m01.d17:meMA.Ode7C12.ode	@ltx/gr_gr_cog/miscellanea:misc.Ode7
ltx/gr_gr_cog/me.m01.d17:meMA.Ode7C12.text	Ἡ χάρις τοῦ Πνεύματος, τοῦ Παναγίου σοὶ ἐνοικήσασα, τῶν πνευμάτων διώκτην, τῆς πονηρίας Πάτερ εἰργάσατο, καὶ Μοναζόντων ἀλείπτην κραυγάζοντα· Εὐλογητός ὁ Θεός, ὁ τῶν Πατέρων ἡμῶν.
ltx/gr_gr_cog/me.m01.d17:meMA.Ode7C1T.incipit	Μαρίαν τὴν ἄχραντον, καὶ παναγίαν…
ltx/gr_gr_cog/me.m01.d17:meMA.Ode7C1T.melody	@ltx/gr_gr_cog/he.h.m8:heHE.TheouSynkatavasin.name
ltx/gr_gr_cog/me.m01.d17:meMA.Ode7C1T.mode	@ltx/gr_gr_cog/miscellanea:misc.Mode8
ltx/gr_gr_cog/me.m01.d17:meMA.Ode7C1T.ode	@ltx/gr_gr_cog/miscellanea:misc.Ode7
ltx/gr_gr_cog/me.m01.d17:meMA.Ode7C1T.text	Μαρίαν τὴν ἄχραντον, καὶ παναγίαν· ἀνευφημήσωμεν· διʼ αὐτῆς γὰρ ἡ χάρις, ἡμῖν πηγάζει τῶν ὑπὲρ νοῦν δωρεῶν, ὡς ἐκ χειμάῤῥου τῆς θείας χρηστότητος· ἣν εὐσεβεῖ λογισμῷ, νῦν μακαρίζομεν.
ltx/gr_gr_cog/me.m01.d17:meMA.Ode8C11.greekmelody	@ltx/gr_gr_cog/he.h.m8:heHE.EptaplasiosKaminon.greekname
ltx/gr_gr_cog/me.m01.d17:meMA.Ode8C11.incipit	Ἐν προσευχαῖς τὸ ἄγρυπνον, ἐν…
ltx/gr_gr_cog/me.m01.d17:meMA.Ode8C11.melody	@ltx/gr_gr_cog/he.h.m8:heHE.EptaplasiosKaminon.name
ltx/gr_gr_cog/me.m01.d17:meMA.Ode8C11.mode	@ltx/gr_gr_cog/miscellanea:misc.Mode8
ltx/gr_gr_cog/me.m01.d17:meMA.Ode8C11.ode	@ltx/gr_gr_cog/miscellanea:misc.Ode8
ltx/gr_gr_cog/me.m01.d17:meMA.Ode8C11.text	Ἐν προσευχαῖς τὸ ἄγρυπνον, ἐν νηστείαις τὸ εὔτονον, τὸ καρτερικόν, ἐν πειρασμοῖς κτησάμενος, νοὸς καθαρότητι, ἐπὶ γῆς ὡς Ἄγγελος, πεπολιτευμένος, τῷ Θεῷ ἀνεβόας· Οἱ Παῖδες εὐλογεῖτε, λαὸς ὑπερυψοῦτε, εἰς πάντας τοὺς αἰῶνας.
ltx/gr_gr_cog/me.m01.d17:meMA.Ode8C12.incipit	Ἱκετηρίαις Ὅσιε, δεήσεσι χρώμενος, σὺ…
ltx/gr_gr_cog/me.m01.d17:meMA.Ode8C12.melody	@ltx/gr_gr_cog/he.h.m8:heHE.EptaplasiosKaminon.name
ltx/gr_gr_cog/me.m01.d17:meMA.Ode8C12.mode	@ltx/gr_gr_cog/miscellanea:misc.Mode8
ltx/gr_gr_cog/me.m01.d17:meMA.Ode8C12.ode	@ltx/gr_gr_cog/miscellanea:misc.Ode8
ltx/gr_gr_cog/me.m01.d17:meMA.Ode8C12.text	Ἱκετηρίαις Ὅσιε, δεήσεσι χρώμενος, σὺ διηνεκῶς, πρὸς τὸν Θεὸν ἀνέδραμες, πρὸς ὕψος μετάρσιον, τοὺς τῶν δαιμόνων βρόχους φυγών, ἐλευθερωθεὶς δέ, τῆς αὐτῶν τυραννίδος, θεόφρον ἀναμέλπεις· ἱερεῖς ἀνυμνεῖτε, λαὸς ὑπερυψοῦτε, εἰς πάντας τοὺς αἰῶνας.
ltx/gr_gr_cog/me.m01.d17:meMA.Ode8C13.incipit	Νέος Μωσῆς γενόμενος, ἐν ἐρήμῳ…
ltx/gr_gr_cog/me.m01.d17:meMA.Ode8C13.melody	@ltx/gr_gr_cog/he.h.m8:heHE.EptaplasiosKaminon.name
ltx/gr_gr_cog/me.m01.d17:meMA.Ode8C13.mode	@ltx/gr_gr_cog/miscellanea:misc.Mode8
ltx/gr_gr_cog/me.m01.d17:meMA.Ode8C13.ode	@ltx/gr_gr_cog/miscellanea:misc.Ode8
ltx/gr_gr_cog/me.m01.d17:meMA.Ode8C13.text	Νέος Μωσῆς γενόμενος, ἐν ἐρήμῳ τὸ τρόπαιον, κατὰ τῶν ἐχθρῶν καὶ πολεμίων ἔστησας, λαοῦ προηγούμενος, τῶν Ἀσκητῶν συστήματος, τοῦ ἐν εὐφροσύνῃ, καὶ σεμνῇ πολιτείᾳ, βοῶντος· Τὸν Δεσπότην, Ἱερεῖς εὐλογεῖτε, λαὸς ὑπερυψοῦτε, εἰς πάντας τοὺς αἰῶνας.
ltx/gr_gr_cog/me.m01.d17:meMA.Ode8C1T.incipit	Θεογεννῆτορ Πάναγνε, τῆς ψυχῆς μου…
ltx/gr_gr_cog/me.m01.d17:meMA.Ode8C1T.melody	@ltx/gr_gr_cog/he.h.m8:heHE.EptaplasiosKaminon.name
ltx/gr_gr_cog/me.m01.d17:meMA.Ode8C1T.mode	@ltx/gr_gr_cog/miscellanea:misc.Mode8
ltx/gr_gr_cog/me.m01.d17:meMA.Ode8C1T.ode	@ltx/gr_gr_cog/miscellanea:misc.Ode8
ltx/gr_gr_cog/me.m01.d17:meMA.Ode8C1T.text	Θεογεννῆτορ Πάναγνε, τῆς ψυχῆς μου τὰ τραύματα, καὶ τῆς ἁμαρτίας, τὰς οὐλὰς ἐξάλειψον, πηγαῖς ἀποσμήχουσα, ταῖς ἐκ πλευρᾶς τοῦ Τόκου σου, καὶ τοῖς ἐξ αὐτῆς, ἀποκαθαίρουσα ῥείθροις· πρὸς σὲ γὰρ ἀνακράζω, καὶ πρὸς σὲ καταφεύγω, καὶ σὲ ἐπικαλοῦμαι, τὴν Κεχαριτωμένην.
ltx/gr_gr_cog/me.m01.d17:meMA.Ode9C11.greekmelody	@ltx/gr_gr_cog/he.h.m8:heHE.ExestiEpiTouto.greekname
ltx/gr_gr_cog/me.m01.d17:meMA.Ode9C11.incipit	Ἐπέστη ἡ φωσφόρος σου Ἑορτὴ…
ltx/gr_gr_cog/me.m01.d17:meMA.Ode9C11.melody	@ltx/gr_gr_cog/he.h.m8:heHE.ExestiEpiTouto.name
ltx/gr_gr_cog/me.m01.d17:meMA.Ode9C11.mode	@ltx/gr_gr_cog/miscellanea:misc.Mode8
ltx/gr_gr_cog/me.m01.d17:meMA.Ode9C11.ode	@ltx/gr_gr_cog/miscellanea:misc.Ode9
ltx/gr_gr_cog/me.m01.d17:meMA.Ode9C11.text	Ἐπέστη ἡ φωσφόρος σου Ἑορτὴ παμμακάριστε Πάτερ Ἀντώνιε πλήρης χαρᾶς, πλήρης εὐφροσύνης πνευματικῆς, πλήρης Ἁγίου Πνεύματος, πλήρης εὐωδίας καὶ φωτισμοῦ· καὶ νῦν σε κεκτημένοι, ἀσκήσεως κανόνα, καὶ νομοθέτην ἀγαλλόμεθα.
ltx/gr_gr_cog/me.m01.d17:meMA.Ode9C12.incipit	Μὴ παύσῃ ἱκετεύων τὸν Λυτρωτήν…
ltx/gr_gr_cog/me.m01.d17:meMA.Ode9C12.melody	@ltx/gr_gr_cog/he.h.m8:heHE.ExestiEpiTouto.name
ltx/gr_gr_cog/me.m01.d17:meMA.Ode9C12.mode	@ltx/gr_gr_cog/miscellanea:misc.Mode8
ltx/gr_gr_cog/me.m01.d17:meMA.Ode9C12.ode	@ltx/gr_gr_cog/miscellanea:misc.Ode9
ltx/gr_gr_cog/me.m01.d17:meMA.Ode9C12.text	Μὴ παύσῃ ἱκετεύων τὸν Λυτρωτήν, πανσεβάσμιε Πάτερ δωρήσασθαι, τοῖς εὐλαβῶς, μνήμην σου τελοῦσι τὴν Ἱεράν, τὴν τῶν πταισμάτων ἄφεσιν, τὴν τῶν χαρισμάτων διανομήν, τὴν θείαν προστασίαν, ψυχῶν τὴν σωτηρίαν, καὶ αἰωνίαν ἀπολύτρωσιν.
ltx/gr_gr_cog/me.m01.d17:meMA.Ode9C13.incipit	Ἰσάγγελος βιώσας ἐπὶ τῆς γῆς…
ltx/gr_gr_cog/me.m01.d17:meMA.Ode9C13.melody	@ltx/gr_gr_cog/he.h.m8:heHE.ExestiEpiTouto.name
ltx/gr_gr_cog/me.m01.d17:meMA.Ode9C13.mode	@ltx/gr_gr_cog/miscellanea:misc.Mode8
ltx/gr_gr_cog/me.m01.d17:meMA.Ode9C13.ode	@ltx/gr_gr_cog/miscellanea:misc.Ode9
ltx/gr_gr_cog/me.m01.d17:meMA.Ode9C13.text	Ἰσάγγελος βιώσας ἐπὶ τῆς γῆς, τὴν ἰσάγγελον εὗρες φαιδρότητα· τῆς γὰρ αὐτῶν, θεοειδεστάτης μαρμαρυγῆς, ἐν μετουσίᾳ γέγονας, οἷς καὶ συναγάλλῃ διηνεκῶς, ὡς ἔνθεος Προφήτης, ὡς Μάρτυς στεφηφόρος, ὡς Μοναζόντων ἀκροθίνιον.
ltx/gr_gr_cog/me.m01.d17:meMA.Ode9C1T.incipit	Συνέλαβες Παρθένε δίχα σπορᾶς, τὸν…
ltx/gr_gr_cog/me.m01.d17:meMA.Ode9C1T.melody	@ltx/gr_gr_cog/he.h.m8:heHE.ExestiEpiTouto.name
ltx/gr_gr_cog/me.m01.d17:meMA.Ode9C1T.mode	@ltx/gr_gr_cog/miscellanea:misc.Mode8
ltx/gr_gr_cog/me.m01.d17:meMA.Ode9C1T.ode	@ltx/gr_gr_cog/miscellanea:misc.Ode9
ltx/gr_gr_cog/me.m01.d17:meMA.Ode9C1T.text	Συνέλαβες Παρθένε δίχα σπορᾶς, τὸν τὰ σύμπαντα δημιουργήσαντα, Λόγον Θεοῦ, ἄνευ θελημάτων τῶν τῆς σαρκός, ἄνευ φθορᾶς δὲ τέτοκας, ἄνευθεν ὠδίνων τῶν μητρικῶν· διὸ σὲ Θεοτόκον, καὶ γλώσσῃ καὶ καρδίᾳ, ὁμολογοῦντες μεγαλύνομεν.
ltx/gr_gr_cog/me.m01.d17:meMA.Oikos1.text	Τῆς τοῦ Χριστοῦ φωνῆς ἐπακούσας, ἐπορεύθης ὀπίσω τῶν αὐτοῦ ἐντολῶν, γυμνὸς τοῦ βίου γενόμενος, καὶ ἀποῤῥίψας φροντίδας πάσας τῶν χρημάτων, κτημάτων, καὶ οἰκετῶν σου, καὶ ἀδελφῆς τὴν στοργήν, θεοφόρε Ἀντώνιε· καὶ μόνος ἐν τοῖς ἐρήμοις, τῷ Θεῷ ὁμιλῶν καθαρώτατα, γνώσεως χάριν εἴληφας· ἣν μοι πέμψον ὑμνεῖν σε μέλλοντι, Πατέρων Πάτερ Ἀντώνιε.
ltx/gr_gr_cog/me.m01.d17:meMA.PostGospelBoth.incipit	@ltx/gr_gr_cog/ho.ho03:hoMA.PostGospelTheotokos.incipit
ltx/gr_gr_cog/me.m01.d17:meMA.PostGospelBoth.melody	
ltx/gr_gr_cog/me.m01.d17:meMA.PostGospelBoth.mode	@ltx/gr_gr_cog/miscellanea:misc.Mode2
ltx/gr_gr_cog/me.m01.d17:meMA.PostGospelBoth.text	@ltx/gr_gr_cog/ho.ho03:hoMA.PostGospelTheotokos.text
ltx/gr_gr_cog/me.m01.d17:meMA.PostGospelGlory.incipit	@ltx/gr_gr_cog/ho.ho03:hoMA.PostGospelMonastic.incipit
ltx/gr_gr_cog/me.m01.d17:meMA.PostGospelGlory.melody	
ltx/gr_gr_cog/me.m01.d17:meMA.PostGospelGlory.mode	@ltx/gr_gr_cog/miscellanea:misc.Mode2
ltx/gr_gr_cog/me.m01.d17:meMA.PostGospelGlory.text	@ltx/gr_gr_cog/ho.ho03:hoMA.PostGospelMonastic.text
ltx/gr_gr_cog/me.m01.d17:meMA.PostGospelIdiomelon.incipit	@ltx/gr_gr_cog/me.m01.d15:meVE.AposGlory.incipit
ltx/gr_gr_cog/me.m01.d17:meMA.PostGospelIdiomelon.melody	
ltx/gr_gr_cog/me.m01.d17:meMA.PostGospelIdiomelon.mode	@ltx/gr_gr_cog/miscellanea:misc.Mode6
ltx/gr_gr_cog/me.m01.d17:meMA.PostGospelIdiomelon.text	@ltx/gr_gr_cog/me.m01.d15:meVE.AposGlory.text
ltx/gr_gr_cog/me.m01.d17:meSV.AposGlory.incipit	Ἄνω σε οἱ χοροί, Θεοτόκε…
ltx/gr_gr_cog/me.m01.d17:meSV.AposGlory.melody	@ltx/gr_gr_cog/he.a.m2:heAU.OikosTouEfratha.name
ltx/gr_gr_cog/me.m01.d17:meSV.AposGlory.mode	@ltx/gr_gr_cog/miscellanea:misc.Mode2
ltx/gr_gr_cog/me.m01.d17:meSV.AposGlory.text	Ἄνω σε οἱ χοροί, Θεοτόκε Παρθένε, ὑμνοῦσι σὺν τοῖς κάτω, δοξάζοντες ἀπαύστως, τὸν Τόκον σου τὸν ἄχραντον.
ltx/gr_gr_cog/me.m01.d17:meSV.Aposticha1.incipit	Ὤφθης ἐκ μητρικῶν, σπαργάνων θεοφόρε…
ltx/gr_gr_cog/me.m01.d17:meSV.Aposticha1.melody	@ltx/gr_gr_cog/he.a.m2:heAU.OikosTouEfratha.name
ltx/gr_gr_cog/me.m01.d17:meSV.Aposticha1.mode	@ltx/gr_gr_cog/miscellanea:misc.Mode2
ltx/gr_gr_cog/me.m01.d17:meSV.Aposticha1.text	Ὤφθης ἐκ μητρικῶν, σπαργάνων θεοφόρε, ἡγιασμένον σκεῦος, Ἀντώνιε καὶ οἶκος, τοῦ Παναγίου Πνεύματος.
ltx/gr_gr_cog/me.m01.d17:meSV.Aposticha2.incipit	Δόλους τῶν πονηρῶν, δαιμόνων θριαμβεύσας…
ltx/gr_gr_cog/me.m01.d17:meSV.Aposticha2.melody	@ltx/gr_gr_cog/he.a.m2:heAU.OikosTouEfratha.name
ltx/gr_gr_cog/me.m01.d17:meSV.Aposticha2.mode	@ltx/gr_gr_cog/miscellanea:misc.Mode2
ltx/gr_gr_cog/me.m01.d17:meSV.Aposticha2.text	Δόλους τῶν πονηρῶν, δαιμόνων θριαμβεύσας, τῇ τοῦ Σταυροῦ δυνάμει, ἐτράνωσας τὴν δόξαν, Χριστοῦ Πάτερ Ἀντώνιε.
ltx/gr_gr_cog/me.m01.d17:meSV.Aposticha3.incipit	Ἤρθης ὡς Ἠλιού, ἐν ἅρματι…
ltx/gr_gr_cog/me.m01.d17:meSV.Aposticha3.melody	@ltx/gr_gr_cog/he.a.m2:heAU.OikosTouEfratha.name
ltx/gr_gr_cog/me.m01.d17:meSV.Aposticha3.mode	@ltx/gr_gr_cog/miscellanea:misc.Mode2
ltx/gr_gr_cog/me.m01.d17:meSV.Aposticha3.text	Ἤρθης ὡς Ἠλιού, ἐν ἅρματι πυρίνῳ, καὶ συνεκράθης μάκαρ, ἀμέσως τῇ Τριάδι, Ἀντώνιε παγκόσμιε.
ltx/gr_gr_cog/me.m01.d17:meSV.SticBoth.incipit	Ἀδιόδευτε πύλη, μυστικῶς ἐσφραγισμένη, εὐλογημένη…
ltx/gr_gr_cog/me.m01.d17:meSV.SticBoth.melody	
ltx/gr_gr_cog/me.m01.d17:meSV.SticBoth.mode	@ltx/gr_gr_cog/miscellanea:misc.Mode2
ltx/gr_gr_cog/me.m01.d17:meSV.SticBoth.text	Ἀδιόδευτε πύλη, μυστικῶς ἐσφραγισμένη, εὐλογημένη Θεοτόκε, δέξαι τὰς δεήσεις ἡμῶν, καὶ προσάγαγε τῷ σῷ Υἱῷ καὶ Θεῷ, ἵνα σώσῃ διὰ σοῦ τὰς ψυχὰς ἡμῶν.
ltx/gr_gr_cog/me.m01.d17:meSV.SticGlory.incipit	Τὸν ἐπὶ γῆς Ἄγγελον, καὶ…
ltx/gr_gr_cog/me.m01.d17:meSV.SticGlory.melody	
ltx/gr_gr_cog/me.m01.d17:meSV.SticGlory.mode	@ltx/gr_gr_cog/miscellanea:misc.Mode2
ltx/gr_gr_cog/me.m01.d17:meSV.SticGlory.text	Τὸν ἐπὶ γῆς Ἄγγελον, καὶ ἐν οὐρανοῖς ἄνθρωπον Θεοῦ, τοῦ κόσμου τὴν εὐκοσμίαν, τὴν τρυφὴν τῶν ἀγαθῶν καὶ τῶν ἀρετῶν, τῶν Ἀσκητῶν τὸ καύχημα, Ἀντώνιον τιμήσωμεν· πεφυτευμένος γὰρ ἐν τῷ οἴκῳ τοῦ Θεοῦ, ἐξήνθησε δικαίως, καὶ ὡσεὶ κέδρος ἐν ἐρήμῳ, ἐπλήθυνε τὰ ποίμνια Χριστοῦ, τῶν λογικῶν προβάτων, ἐν ὁσιότητι καὶ δικαιοσύνῃ.
ltx/gr_gr_cog/me.m01.d17:meSV.Stichera1.incipit	Ὅτε, ἐν τῷ μνήματι σαυτόν…
ltx/gr_gr_cog/me.m01.d17:meSV.Stichera1.melody	@ltx/gr_gr_cog/he.a.m2:heAU.OteEkTouXylou.name
ltx/gr_gr_cog/me.m01.d17:meSV.Stichera1.mode	@ltx/gr_gr_cog/miscellanea:misc.Mode2
ltx/gr_gr_cog/me.m01.d17:meSV.Stichera1.text	Ὅτε, ἐν τῷ μνήματι σαυτόν, χαίρων περιέκλεισας Πάτερ, ὑπὲρ ἀγάπης Χριστοῦ, φέρων σταθερώτατα, τὰς τῶν δαιμόνων ποινάς, προσευχῇ δὲ καὶ χάριτι, ἀπέδειξας τούτων, πάχνης ἀδρανέστερα, τὰ βουλευτήρια· τότε ἐπεκρότησαν τάξεις, τῶν Ἀγγέλων κράζουσαι.· Δόξα, τῷ ἐνδυναμοῦντί σε Ἀντώνιε.
ltx/gr_gr_cog/me.m01.d17:meSV.Stichera2.incipit	Ἄλλος, ἀνεδείχθης Ἠλιού, ἔχων τοὺς…
ltx/gr_gr_cog/me.m01.d17:meSV.Stichera2.melody	@ltx/gr_gr_cog/he.a.m2:heAU.OteEkTouXylou.name
ltx/gr_gr_cog/me.m01.d17:meSV.Stichera2.mode	@ltx/gr_gr_cog/miscellanea:misc.Mode2
ltx/gr_gr_cog/me.m01.d17:meSV.Stichera2.text	Ἄλλος, ἀνεδείχθης Ἠλιού, ἔχων τοὺς κλεινοὺς φοιτητάς σου, ὡς Ἐλισαῖον σοφέ, οἷς περ καὶ τὴν χάριν σου, διπλῆν κατέλιπες, ἁρπαγεὶς ὡς ἐν ἅρματι, αἰθέριος Πάτερ· ὅθεν ζῶν τῷ πνεύματι, νῦν συναγάλλῃ αὐτοῖς, πάντων μνημονεύων παμμάκαρ, τῶν ἐπιτελούντων σου πόθῳ, τὴν σεπτὴν πανήγυριν Ἀντώνιε.
ltx/gr_gr_cog/me.m01.d17:meSV.Stichera3.incipit	Ὥσπερ, ὁ θεόπτης Μωϋσῆς, γνόφῳ…
ltx/gr_gr_cog/me.m01.d17:meSV.Stichera3.melody	@ltx/gr_gr_cog/he.a.m2:heAU.OteEkTouXylou.name
ltx/gr_gr_cog/me.m01.d17:meSV.Stichera3.mode	@ltx/gr_gr_cog/miscellanea:misc.Mode2
ltx/gr_gr_cog/me.m01.d17:meSV.Stichera3.text	Ὥσπερ, ὁ θεόπτης Μωϋσῆς, γνόφῳ νοητῷ ὑπεισῆλθες, θεωριῶν ἀληθῶς, αὖθις δὲ κατώπτευσας, ὅν περ ἐπόθεις τρανῶς· δοξασθεὶς δὲ τὸ πρόσωπον, τῇ αἴγλῃ ἐκείνου, Πάτερ καθωδήγησαι, εἰς σωτηρίου μονάς· ὅθεν συνελθόντες Θεόφρον, χαίροντες κραυγάζομεν· Δόξα, τῷ σὲ ἐνισχύσαντι Θεῷ ἡμῶν.
ltx/gr_gr_cog/me.m01.d17:meVE.Apolytikion1.incipit	Τὸν ζηλωτὴν Ἠλίαν τοῖς τρόποις…
ltx/gr_gr_cog/me.m01.d17:meVE.Apolytikion1.melody	
ltx/gr_gr_cog/me.m01.d17:meVE.Apolytikion1.mode	@ltx/gr_gr_cog/miscellanea:misc.Mode4
ltx/gr_gr_cog/me.m01.d17:meVE.Apolytikion1.text	Τὸν ζηλωτὴν Ἠλίαν τοῖς τρόποις μιμούμενος, τῷ Βαπτιστῇ εὐθείαις ταῖς τρίβοις ἑπόμενος, Πάτερ Ἀντώνιε, τῆς ἐρήμου γέγονας οἰκιστής, καὶ τὴν οἰκουμένην ἐστήριξας εὐχαῖς σου· διὸ πρέσβευε Χριστῷ τῷ Θεῷ, σωθῆναι τὰς ψυχὰς ἡμῶν.
ltx/gr_gr_cog/me.m01.d17:meVE.AposGlory.incipit	Τῶν Μοναστῶν τὰ πλήθη, τὸν…
ltx/gr_gr_cog/me.m01.d17:meVE.AposGlory.melody	
ltx/gr_gr_cog/me.m01.d17:meVE.AposGlory.mode	@ltx/gr_gr_cog/miscellanea:misc.Mode8
ltx/gr_gr_cog/me.m01.d17:meVE.AposGlory.poet	@ltx/gr_gr_cog/poets:po.Sykeotou
ltx/gr_gr_cog/me.m01.d17:meVE.AposGlory.text	Τῶν Μοναστῶν τὰ πλήθη, τὸν καθηγητήν σε τιμῶμεν Ἀντώνιε· διὰ σοῦ γὰρ τὴν τρίβον, τὴν ὄντως εὐθεῖαν, πορεύεσθαι ἔγνωμεν. Μακάριος εἶ, τῷ Χριστῷ δουλεύσας, καὶ ἐχθροῦ θριαμβεύσας τὴν δύναμιν. Ἀγγέλων συνόμιλε, τοῦ Παύλου συμμέτοχε τοῦ Θηβαίου· μεθʼ ὧν πρέσβευε τῷ Κυρίῳ, ἐλεηθῆναι τὰς ψυχὰς ἡμῶν.
ltx/gr_gr_cog/me.m01.d17:meVE.AposTheotokion.incipit	@ltx/gr_gr_cog/oc.m8.d1:ocVE.AposTheotokion.incipit
ltx/gr_gr_cog/me.m01.d17:meVE.AposTheotokion.melody	
ltx/gr_gr_cog/me.m01.d17:meVE.AposTheotokion.mode	@ltx/gr_gr_cog/miscellanea:misc.Mode8
ltx/gr_gr_cog/me.m01.d17:meVE.AposTheotokion.text	@ltx/gr_gr_cog/oc.m8.d1:ocVE.AposTheotokion.text
ltx/gr_gr_cog/me.m01.d17:meVE.Aposticha1.greekmelody	@ltx/gr_gr_cog/he.a.m5:heAU.ChairoisAskitikon.greekname
ltx/gr_gr_cog/me.m01.d17:meVE.Aposticha1.incipit	Χαίροις τῶν ἀσκητῶν ἀρχηγός, γεγενημένος…
ltx/gr_gr_cog/me.m01.d17:meVE.Aposticha1.melody	@ltx/gr_gr_cog/he.a.m5:heAU.ChairoisAskitikon.name
ltx/gr_gr_cog/me.m01.d17:meVE.Aposticha1.mode	@ltx/gr_gr_cog/miscellanea:misc.Mode5
ltx/gr_gr_cog/me.m01.d17:meVE.Aposticha1.text	Χαίροις τῶν ἀσκητῶν ἀρχηγός, γεγενημένος καὶ ἀήττητος πρόμαχος· παθῶν γὰρ ἐκτέμνων ῥίζας, καὶ τῶν δαιμόνων ὁρμάς, ὑποστὰς ἀνδρείως ἐθριάμβευσας, αὐτῶν τὴν ἀσθένειαν, καὶ ψυχόλεθρον πλάνησιν, τὴν τοῦ Σταυροῦ δέ, τοῦ Σωτῆρος ἐνέργειαν, καὶ ἀνίκητον, ἐφανέρωσας δύναμιν· ἣν καὶ περιζωσάμενος, ἐνίκησας ἅπαντας, τοὺς ἀθετοῦντας τὴν θείαν, διὰ σαρκὸς ἐπιφάνειαν, Χριστοῦ· ὃν δυσώπει, ταῖς ψυχαῖς ἡμῶν δοθῆναι, τὸ μέγα ἔλεος.
ltx/gr_gr_cog/me.m01.d17:meVE.Aposticha2.incipit	Στῦλος φωτοειδὴς ἀρεταῖς, ἐστηριγμένος, καὶ…
ltx/gr_gr_cog/me.m01.d17:meVE.Aposticha2.melody	@ltx/gr_gr_cog/he.a.m5:heAU.ChairoisAskitikon.name
ltx/gr_gr_cog/me.m01.d17:meVE.Aposticha2.mode	@ltx/gr_gr_cog/miscellanea:misc.Mode5
ltx/gr_gr_cog/me.m01.d17:meVE.Aposticha2.text	Στῦλος φωτοειδὴς ἀρεταῖς, ἐστηριγμένος, καὶ νεφέλη σκιάζουσα, ἐγένου τοῖς ἐν ἐρήμῳ, πρὸς οὐρανὸν ἀπὸ γῆς, τὸν Θεὸν ὁρώντων προηγούμενος· Σταυροῦ βακτηρία, τὴν τῶν παθῶν ῥήξας θάλασσαν· τὸν νοητὸν δέ, Ἀμαλὴκ τροπωσάμενος, ἀνεμπόδιστον, τὴν οὐράνιον ἄνοδον, εὗρες θεομακάριστε, καὶ κλῆρον ἀκήρατον, σὺν Ἀσωμάτοις τῷ θρόνῳ, περιχαρῶς παριστάμενος, Χριστοῦ· ὃν δυσώπει, ταῖς ψυχαῖς ἡμῶν δοθῆναι, τὸ μέγα ἔλεος.
ltx/gr_gr_cog/me.m01.d17:meVE.Aposticha3.incipit	Χαίροις ἀγγελικαῖς ὁμιλῶν, χοροστασίαις ἐν…
ltx/gr_gr_cog/me.m01.d17:meVE.Aposticha3.melody	@ltx/gr_gr_cog/he.a.m5:heAU.ChairoisAskitikon.name
ltx/gr_gr_cog/me.m01.d17:meVE.Aposticha3.mode	@ltx/gr_gr_cog/miscellanea:misc.Mode5
ltx/gr_gr_cog/me.m01.d17:meVE.Aposticha3.text	Χαίροις ἀγγελικαῖς ὁμιλῶν, χοροστασίαις ἐν ὑψίστοις Ἀντώνιε· τὸν βίον γὰρ τούτων Πάτερ, ἐπὶ τῆς γῆς ἀληθῶς, ἀρετὴν ἀσκήσας πεπολίτευσαι, φανεὶς καθαρώτατον, ἀκηλίδωτον ἔσοπτρον, ἀκτινοβόλους, ἀστραπὰς εἰσδεχόμενον, τὰς τοῦ Πνεύματος, τοῦ Ἁγίου πανόλβιε· ὅθεν καταυγαζόμενος, ἑώρας τὰ μέλλοντα, πάντα προλέγων ἐκ θείας, φωτοφανείας μυούμενος, Χριστοῦ· ὃν δυσώπει, ταῖς ψυχαῖς ἡμῶν δοθῆναι, τὸ μέγα ἔλεος.
ltx/gr_gr_cog/me.m01.d17:meVE.Lity1.incipit	Ἀσκητικὸν γυμνάσιον, συγκροτήσας ἐπὶ γῆς…
ltx/gr_gr_cog/me.m01.d17:meVE.Lity1.melody	
ltx/gr_gr_cog/me.m01.d17:meVE.Lity1.mode	@ltx/gr_gr_cog/miscellanea:misc.Mode2
ltx/gr_gr_cog/me.m01.d17:meVE.Lity1.poet	@ltx/gr_gr_cog/poets:po.Stouditou
ltx/gr_gr_cog/me.m01.d17:meVE.Lity1.text	Ἀσκητικὸν γυμνάσιον, συγκροτήσας ἐπὶ γῆς, Ὅσιε Ἀντώνιε, τὰς τῶν παθῶν προσβολὰς ἐν τῇ ῥοῇ τῶν δακρύων σου, πάσας ἀπήμβλυνας, καὶ κλῖμαξ θεία καὶ σεπτή, εἰς οὐρανοὺς ἀνάγουσα, τοῖς πᾶσιν ἐγνωρίσθη, ὁ θεόληπτος βίος σου· εὐσεβείας γὰρ καρπούς, ἐν αὐτῷ ἐνδειξάμενος, ἰατρεύεις διʼ αὐτῶν, τὰς ἀσθενείας τῶν παθῶν, τῶν πιστῶς ἐκβοώντων σοι· Χαίροις τῆς Ἑῴας ἀστὴρ χρυσαυγέστατε, καὶ τῶν Μοναζόντων λαμπαδοῦχε καὶ ποιμήν. Χαίροις ἀοίδιμε, τὸ τῆς ἐρήμου κάλλιστον θρέμμα, καὶ τῆς Ἐκκλησίας ἀκράδαντον ἔρεισμα. Χαίροις τῶν πλανωμένων, ὁ μέγας ὁδηγός· Χαίροις τὸ ἡμέτερον καύχημα, καὶ τῆς οἰκουμένης φαιδρὸν ἀγαλλίαμα.
ltx/gr_gr_cog/me.m01.d17:meVE.Lity2.incipit	Τὸν ἐπὶ γῆς Ἄγγελον, καὶ…
ltx/gr_gr_cog/me.m01.d17:meVE.Lity2.melody	
ltx/gr_gr_cog/me.m01.d17:meVE.Lity2.mode	@ltx/gr_gr_cog/miscellanea:misc.Mode2
ltx/gr_gr_cog/me.m01.d17:meVE.Lity2.text	Τὸν ἐπὶ γῆς Ἄγγελον, καὶ ἐν οὐρανοῖς ἄνθρωπον Θεοῦ, τοῦ κόσμου τὴν εὐκοσμίαν, καὶ τὴν τρυφὴν τῶν ἀγαθῶν καὶ τῶν ἀρετῶν, τῶν Ἀσκητῶν τὸ καύχημα, Ἀντώνιον τιμήσωμεν· πεφυτευμένος γὰρ ἐν τῷ οἴκῳ τοῦ Θεοῦ, ἐξήνθησε δικαίως, καὶ ὡσεὶ κέδρος ἐν ἐρήμῳ, ἐπλήθυνε τὰ ποίμνια Χριστοῦ, τῶν λογικῶν προβάτων, ἐν ὁσιότητι καὶ δικαιοσύνῃ.
ltx/gr_gr_cog/me.m01.d17:meVE.Lity3.incipit	Ὅσιε Πάτερ, ἐκ βρέφους τὴν…
ltx/gr_gr_cog/me.m01.d17:meVE.Lity3.melody	
ltx/gr_gr_cog/me.m01.d17:meVE.Lity3.mode	@ltx/gr_gr_cog/miscellanea:misc.Mode2
ltx/gr_gr_cog/me.m01.d17:meVE.Lity3.text	Ὅσιε Πάτερ, ἐκ βρέφους τὴν ἀρετὴν ἐπιμελῶς ἀσκήσας, ὄργανον γέγονας τοῦ Ἁγίου Πνεύματος, καὶ παρʼ αὐτοῦ λαβών, τῶν θαυμάτων τὴν ἐνέργειαν, ἔπεισας τοὺς ἀνθρώπους, καταφρονεῖν τῶν ἠδέων, νῦν δὲ τῷ θείῳ φωτί, καθαρώτερον ἐλλαμπόμενος, φώτισον καὶ ἡμῶν τὰς διανοίας, Πάτερ Ἀντώνιε.
ltx/gr_gr_cog/me.m01.d17:meVE.Lity4.incipit	Ὅσιε Ἀντώνιε, τῆς στεῤῥοτάτης ἀσκήσεως…
ltx/gr_gr_cog/me.m01.d17:meVE.Lity4.melody	
ltx/gr_gr_cog/me.m01.d17:meVE.Lity4.mode	@ltx/gr_gr_cog/miscellanea:misc.Mode3
ltx/gr_gr_cog/me.m01.d17:meVE.Lity4.poet	@ltx/gr_gr_cog/poets:po.Anatoliou
ltx/gr_gr_cog/me.m01.d17:meVE.Lity4.text	Ὅσιε Ἀντώνιε, τῆς στεῤῥοτάτης ἀσκήσεως, τὴν καυστικὴν καὶ εὔψυχον διατριβήν, ὡς ἐν ἀΰλοις ἀναπαυόμενος ἐτέλεσας· τοῖς ἐρημοτέροις γάρ, σεαυτὸν συνάψας πνευματικῶς, τὰς πυριφλέκτους φαρέτρας τῶν δαιμόνων κατεπάτησας· καὶ ὑπεράνω πάσης ἀρετῆς γεγονώς, συναυλίζῃ Ἀγγέλοις, ἐν τῇ Βασιλείᾳ τῶν οὐρανῶν. Διὸ πρέσβευε Χριστῷ τῷ Θεῷ, σωθῆναι τὰς ψυχὰς ἡμῶν.
ltx/gr_gr_cog/me.m01.d17:meVE.LityBoth.incipit	@ltx/gr_gr_cog/oc.m5.d3:ocVE.AposTheotokion.incipit
ltx/gr_gr_cog/me.m01.d17:meVE.LityBoth.melody	
ltx/gr_gr_cog/me.m01.d17:meVE.LityBoth.mode	@ltx/gr_gr_cog/miscellanea:misc.Mode5
ltx/gr_gr_cog/me.m01.d17:meVE.LityBoth.text	@ltx/gr_gr_cog/oc.m5.d3:ocVE.AposTheotokion.text
ltx/gr_gr_cog/me.m01.d17:meVE.LityGlory.incipit	Ὅσιε Πάτερ, τῆς φωνῆς τοῦ…
ltx/gr_gr_cog/me.m01.d17:meVE.LityGlory.melody	
ltx/gr_gr_cog/me.m01.d17:meVE.LityGlory.mode	@ltx/gr_gr_cog/miscellanea:misc.Mode5
ltx/gr_gr_cog/me.m01.d17:meVE.LityGlory.poet	@ltx/gr_gr_cog/poets:po.Stouditou
ltx/gr_gr_cog/me.m01.d17:meVE.LityGlory.text	Ὅσιε Πάτερ, τῆς φωνῆς τοῦ Εὐαγγελίου τοῦ Κυρίου ἀκούσας, τὸν κόσμον κατέλιπες, τὸν πλοῦτον καὶ τὴν δόξαν, εἰς οὐδὲν λογισάμενος· ὅθεν πάσιν ἐβόας· Ἀγαπήσατε τὸν Θεόν, καὶ εὑρήσετε χάριν αἰώνιον· μηδὲν προτιμήσητε τῆς ἀγάπης αὐτοῦ· ἵνα ὅταν ἔλθῃ ἐν τῇ δόξῃ αὐτοῦ, εὔρητε ἀνάπαυσιν μετὰ πάντων τῶν Ἁγίων· οὗ ταῖς ἱκεσίαις Χριστέ, φύλαξον, καὶ σῶσον τὰς ψυχὰς ἡμῶν.
ltx/gr_gr_cog/me.m01.d17:meVE.MM.Stichera1234as78910.text	@ltx/gr_gr_cog/properties:media.key
ltx/gr_gr_cog/me.m01.d17:meVE.SticGlory.incipit	Τὸ κατʼ εἰκόνα τηρήσας ἀλώβητον…
ltx/gr_gr_cog/me.m01.d17:meVE.SticGlory.melody	
ltx/gr_gr_cog/me.m01.d17:meVE.SticGlory.mode	@ltx/gr_gr_cog/miscellanea:misc.Mode6
ltx/gr_gr_cog/me.m01.d17:meVE.SticGlory.poet	@ltx/gr_gr_cog/poets:po.Sykeotou
ltx/gr_gr_cog/me.m01.d17:meVE.SticGlory.text	Τὸ κατʼ εἰκόνα τηρήσας ἀλώβητον, νοῦν ἡγεμόνα κατὰ παθῶν ὀλεθρίων, ἀσκητικῶς ἐνστησάμενος, εἰς τὸ καθʼ ὁμοίωσιν ὡς δυνατὸν ἀνελήλυθας· ἀνδρικῶς γὰρ τὴν φύσιν ἐκβιασάμενος, ἔσπευσας τὸ χεῖρον, καθυποτάξαι τῷ κρείττονι, καὶ τὴν σάρκα δουλῶσαι τῷ πνεύματι· ὅθεν μοναζόντων, ἀνεδείχθης ἀκρότης, πολιστὴς τῆς ἐρήμου, εὐδρομούντων ἀλείπτης, κανὼν ἀρετῆς ἀκριβέστατος· καὶ νῦν ἐν οὐρανοῖς, τῶν ἐσόπτρων λυθέντων Ἀντώνιε, καθαρῶς ἐποπτεύεις τὴν ἁγίαν Τριάδα, ἐντυγχάνων ἀμέσως, ὑπὲρ τῶν πίστει καὶ πόθῳ τιμώντων σε.
ltx/gr_gr_cog/me.m01.d17:meVE.SticTheotokion.incipit	@ltx/gr_gr_cog/oc.m6.d1:ocVE.SticTheotokion.incipit
ltx/gr_gr_cog/me.m01.d17:meVE.SticTheotokion.melody	
ltx/gr_gr_cog/me.m01.d17:meVE.SticTheotokion.mode	@ltx/gr_gr_cog/miscellanea:misc.Mode6
ltx/gr_gr_cog/me.m01.d17:meVE.SticTheotokion.text	@ltx/gr_gr_cog/oc.m6.d1:ocVE.SticTheotokion.text
ltx/gr_gr_cog/me.m01.d17:meVE.Stichera01.greekmelody	@ltx/gr_gr_cog/he.a.m4:heAU.OExYpsistouKlitheis.greekname
ltx/gr_gr_cog/me.m01.d17:meVE.Stichera01.incipit	Ὁ φωτισθεὶς ταῖς τοῦ Πνεύματος…
ltx/gr_gr_cog/me.m01.d17:meVE.Stichera01.melody	@ltx/gr_gr_cog/he.a.m4:heAU.OExYpsistouKlitheis.name
ltx/gr_gr_cog/me.m01.d17:meVE.Stichera01.mode	@ltx/gr_gr_cog/miscellanea:misc.Mode4
ltx/gr_gr_cog/me.m01.d17:meVE.Stichera01.text	Ὁ φωτισθεὶς ταῖς τοῦ Πνεύματος ἀκτῖσιν, ὅτε σε ὁ ἔνθεος ἔρως ἀνέφλεξε, καὶ τὴν ψυχὴν ἀνεπτέρωσεν, αὐτὸ ποθῆσαι, τὸ τῆς ἀγάπης ὄντως ἀκρότατον, τότε κατεφρόνησας, σαρκὸς καὶ αἵματος, καὶ ἔξω κόσμου γεγένησαι, πολλῇ ἀσκήσει, καὶ ἡσυχίᾳ τούτῳ ἑνούμενος· ὅθεν ἐπλήσθης, ὡς ἐζήτησας, τῶν ἐκεῖθεν καλῶν καὶ ἀνέλαμψας, ὡς Ἀστὴρ καταυγάζων, τὰς ψυχὰς ἡμῶν Ἀντώνιε.
ltx/gr_gr_cog/me.m01.d17:meVE.Stichera02.incipit	Ὁ τῶν δαιμόνων τὰ τόξα…
ltx/gr_gr_cog/me.m01.d17:meVE.Stichera02.melody	@ltx/gr_gr_cog/he.a.m4:heAU.OExYpsistouKlitheis.name
ltx/gr_gr_cog/me.m01.d17:meVE.Stichera02.mode	@ltx/gr_gr_cog/miscellanea:misc.Mode4
ltx/gr_gr_cog/me.m01.d17:meVE.Stichera02.text	Ὁ τῶν δαιμόνων τὰ τόξα καὶ τὰ βέλη, συντρίψας τῇ χάριτι, τοῦ θείου Πνεύματος, καὶ τὴν κακίαν καὶ ἔνεδραν, αὐτῶν τοῖς πᾶσι, δηλοποιήσας θείοις διδάγμασι, ταῖς θείαις λαμπρότησι καταστραπτόμενος, τῶν Μοναστῶν διαυγέστατος, φωστὴρ ἐγένου, καὶ τῆς ἐρήμου πρῶτος διάκοσμος, καὶ τῶν νοσούντων ἐμπειρότατος, καὶ σεπτὸς ἰατρὸς καὶ ἀρχέτυπος, χαρακτὴρ ἐναρέτου, ἀγωγῆς Πάτερ Ἀντώνιε.
ltx/gr_gr_cog/me.m01.d17:meVE.Stichera03.incipit	Ὁ χαρισμάτων ἐνθέων πεπλησμένος, σὲ…
ltx/gr_gr_cog/me.m01.d17:meVE.Stichera03.melody	@ltx/gr_gr_cog/he.a.m4:heAU.OExYpsistouKlitheis.name
ltx/gr_gr_cog/me.m01.d17:meVE.Stichera03.mode	@ltx/gr_gr_cog/miscellanea:misc.Mode4
ltx/gr_gr_cog/me.m01.d17:meVE.Stichera03.text	Ὁ χαρισμάτων ἐνθέων πεπλησμένος, σὲ ὡς ἀκηλίδωτον, ἔσοπτρον Πάτερ εὑρών, Χριστὸς τῶν θείων ἐμφάσεων, λαμπρὰς οἰκείου, μαρμαρυγὰς φωτός σοι ἐξήστραψεν· ἐντεῦθεν ἰάσεων, ἄφθονος ὤφθης πηγή, διατροφή τε λιμώττουσι, καὶ τῶν διψώντων, διʼ ἑπομβρίας ἄρδων τὴν ἔφεσιν· τὰς ψυχικὰς δὲ διαθέσεις ὁρῶν, σοῦ τῷ λόγῳ σοφῶς ἐβελτίους Θεῷ· ὃν ἱκέτευε σῶσαι, καὶ φωτίσαι τὰς ψυχὰς ἡμῶν.
ltx/gr_gr_cog/me.m01.d17:meVE.Stichera04.greekmelody	@ltx/gr_gr_cog/he.a.m4:heAU.OExYpsistouKlitheis.greekname
ltx/gr_gr_cog/me.m01.d17:meVE.Stichera04.incipit	Ὁ καθαρὸς τὴν ψυχὴν καὶ…
ltx/gr_gr_cog/me.m01.d17:meVE.Stichera04.melody	@ltx/gr_gr_cog/he.a.m4:heAU.OExYpsistouKlitheis.name
ltx/gr_gr_cog/me.m01.d17:meVE.Stichera04.mode	@ltx/gr_gr_cog/miscellanea:misc.Mode4
ltx/gr_gr_cog/me.m01.d17:meVE.Stichera04.text	Ὁ καθαρὸς τὴν ψυχὴν καὶ τὴν καρδίαν, Ἄγγελος ἐπίγειος, βροτὸς οὐράνιος, τῆς παρθενίας διδάσκαλος, τῆς ἐγκρατείας, ἠκριβωμένη στάθμη Ἀντώνιε· συνών τῷ Δεσπότῃ σου, καὶ τὴν ἀσίγητον δοξολογίαν μακάριε, σὺν τοῖς Ἀγγέλοις, καὶ τοῖς Ὁσίοις πᾶσι καὶ Μάρτυσι, τούτῳ προσάγων, τοὺς τελοῦντάς σου, τὴν ἱερὰν μνήμην πάντοτε, χαλεπῶν ἐκ κινδύνων, καὶ πταισμάτων ἐλευθέρωσον.
