ltx/gr_gr_cog/le.go.lu.d083:leluLI.Gospel.book_abbr	@ltx/gr_gr_cog/bible:Luke.abbr
ltx/gr_gr_cog/le.go.lu.d083:leluLI.Gospel.book_string	@ltx/gr_gr_cog/bible:Luke.text
ltx/gr_gr_cog/le.go.lu.d083:leluLI.Gospel.chapverse	13:19 – 29
ltx/gr_gr_cog/le.go.lu.d083:leluLI.Gospel.incipit	Ὡμοιώθη ἡ βασιλεία τοῦ Θεοῦ κόκκῳ σινάπεως…
ltx/gr_gr_cog/le.go.lu.d083:leluLI.Gospel.text	Εἶπεν ὁ Κύριος τὴν παραβολὴν ταύτην· Ὡμοιώθη ἡ βασιλεία τοῦ Θεοῦ κόκκῳ σινάπεως, ὃν λαβὼν ἄνθρωπος ἔβαλεν εἰς κῆπον ἑαυτοῦ· καὶ ηὔξησε καὶ ἐγένετο εἰς δένδρον μέγα, καὶ τὰ πετεινὰ τοῦ οὐρανοῦ κατεσκήνωσεν ἐν τοῖς κλάδοις αὐτοῦ. Πάλιν εἶπε· τίνι ὁμοιώσω τὴν βασιλείαν τοῦ Θεοῦ; ὁμοία ἐστὶ ζύμῃ, ἣν λαβοῦσα γυνὴ ἔκρυψεν εἰς ἀλεύρου σάτα τρία, ἕως οὗ ἐζυμώθη ὅλον. Καὶ διεπορεύετο κατὰ πόλεις καὶ κώμας διδάσκων καὶ πορείαν ποιούμενος εἰς Ἱερουσαλήμ. εἶπε δέ τις αὐτῷ· Κύριε, εἰ ὀλίγοι οἱ σῳζόμενοι; ὁ δὲ εἶπε πρὸς αὐτούς· ἀγωνίζεσθε εἰσελθεῖν διὰ τῆς στενῆς πύλης· ὅτι πολλοί, λέγω ὑμῖν, ζητήσουσιν εἰσελθεῖν καὶ οὐκ ἰσχύσουσιν. ἀφ᾿ οὗ ἂν ἐγερθῇ ὁ οἰκοδεσπότης καὶ ἀποκλείσῃ τὴν θύραν, καὶ ἄρξησθε ἔξω ἑστάναι καὶ κρούειν τὴν θύραν λέγοντες· Κύριε Κύριε, ἄνοιξον ἡμῖν· καὶ ἀποκριθεὶς ἐρεῖ ὑμῖν, οὐκ οἶδα ὑμᾶς πόθεν ἐστέ. τότε ἄρξεσθε λέγειν· ἐφάγομεν ἐνώπιόν σου καὶ ἐπίομεν, καὶ ἐν ταῖς πλατείαις ἡμῶν ἐδίδαξας· καὶ ἐρεῖ· λέγω ὑμῖν, οὐκ οἶδα ὑμᾶς πόθεν ἐστέ· ἀπόστητε ἀπ᾿ ἐμοῦ πάντες οἱ ἐργάται τῆς ἀδικίας. ἐκεῖ ἔσται ὁ κλαυθμὸς καὶ ὁ βρυγμὸς τῶν ὀδόντων, ὅταν ὄψησθε Ἀβραὰμ καὶ Ἰσαὰκ καὶ Ἰακὼβ καὶ πάντας τοὺς προφήτας ἐν τῇ βασιλείᾳ τοῦ Θεοῦ, ὑμᾶς δὲ ἐκβαλλομένους ἔξω, καὶ ἥξουσιν ἀπὸ ἀνατολῶν καὶ δυσμῶν καὶ ἀπὸ βορρᾶ καὶ νότου, καὶ ἀνακλιθήσονται ἐν τῇ βασιλείᾳ τοῦ Θεοῦ.
ltx/gr_gr_cog/le.go.lu.d083:leluLI.Gospel.title	Τῷ Σαββάτῳ τῆς ΙΒʹ Ἑβδομάδος τοῦ Λουκᾶ
ltx/gr_gr_cog/le.go.lu.d083:leluLI.Gospel.title_abbr	Τῷ Σαββάτῳ τῆς ΙΒʹ Ἑβδομάδος τοῦ Λουκᾶ
ltx/gr_gr_cog/le.go.lu.d083:leluLI.Gospel.version	@ltx/gr_gr_cog/properties:version.designation
