ltx/gr_gr_cog/me.m08.d20:meDA.commemoration.first	Μνήμη τοῦ Ἁγίου Προφήτου Σαμουήλ
ltx/gr_gr_cog/me.m08.d20:meDA.commemoration.first_name	
ltx/gr_gr_cog/me.m08.d20:meDA.commemoration.first_short	Μνήμη τοῦ Ἁγίου Προφήτου Σαμουήλ
ltx/gr_gr_cog/me.m08.d20:meDA.commemoration.first_title	@ltx/gr_gr_cog/titles:ti.Prophet
ltx/gr_gr_cog/me.m08.d20:meDA.commemoration.full	Μνήμη τοῦ Ἁγίου Προφήτου Σαμουήλ
ltx/gr_gr_cog/me.m08.d20:meDA.commemoration.second_name	
ltx/gr_gr_cog/me.m08.d20:meDA.commemoration.second_title	
ltx/gr_gr_cog/me.m08.d20:meDA.date	Τῌ Κʹ ΑΥΓΟΥΣΤΟΥ
ltx/gr_gr_cog/me.m08.d20:meDA.fordate	
ltx/gr_gr_cog/me.m08.d20:meDA.insert1	καὶ τοῦ Ἁγίου Προφήτου Σαμουήλ,
ltx/gr_gr_cog/me.m08.d20:meDA.insert2	οὗ καὶ τὴν μνήμην ἐπιτελοῦμεν·
ltx/gr_gr_cog/me.m08.d20:meDA.note	
ltx/gr_gr_cog/me.m08.d20:meDA.pdfcoverdate	τῆς 20ῆς Αὐγούστου,
ltx/gr_gr_cog/me.m08.d20:meDA.pdfheaderdate	τῆς 20ῆς Αὐγούστου
ltx/gr_gr_cog/me.m08.d20:meHO.commemorations	
ltx/gr_gr_cog/me.m08.d20:meHO.note1	
ltx/gr_gr_cog/me.m08.d20:meHO.note2	
ltx/gr_gr_cog/me.m08.d20:meHO.number	
ltx/gr_gr_cog/me.m08.d20:meHO.rank	
ltx/gr_gr_cog/me.m08.d20:meLE.commemoration1	Τοῦ Ἁγίου Προφήτου Σαμουήλ.
ltx/gr_gr_cog/me.m08.d20:meLE.commemoration2	
ltx/gr_gr_cog/me.m08.d20:meLI.Kontakion1.incipit	…
ltx/gr_gr_cog/me.m08.d20:meLI.Kontakion1.melody	
ltx/gr_gr_cog/me.m08.d20:meLI.Kontakion1.mode	
ltx/gr_gr_cog/me.m08.d20:meLI.Kontakion1.text	
ltx/gr_gr_cog/me.m08.d20:meLI.Megalynarion.text	
ltx/gr_gr_cog/me.m08.d20:meMA.AposGlory.incipit	@ltx/gr_gr_cog/me.m08.d16:meVE.AposGlory.incipit
ltx/gr_gr_cog/me.m08.d20:meMA.AposGlory.melody	@ltx/gr_gr_cog/he.a.m2:heAU.OikosTouEfratha.name
ltx/gr_gr_cog/me.m08.d20:meMA.AposGlory.mode	@ltx/gr_gr_cog/miscellanea:misc.Mode2
ltx/gr_gr_cog/me.m08.d20:meMA.AposGlory.text	@ltx/gr_gr_cog/me.m08.d16:meVE.AposGlory.text
ltx/gr_gr_cog/me.m08.d20:meMA.Aposticha1.greekmelody	@ltx/gr_gr_cog/he.a.m2:heAU.OikosTouEfratha.greekname
ltx/gr_gr_cog/me.m08.d20:meMA.Aposticha1.incipit	@ltx/gr_gr_cog/me.m08.d16:meVE.AposGlory.incipit
ltx/gr_gr_cog/me.m08.d20:meMA.Aposticha1.melody	@ltx/gr_gr_cog/he.a.m2:heAU.OikosTouEfratha.name
ltx/gr_gr_cog/me.m08.d20:meMA.Aposticha1.mode	@ltx/gr_gr_cog/miscellanea:misc.Mode2
ltx/gr_gr_cog/me.m08.d20:meMA.Aposticha1.text	@ltx/gr_gr_cog/me.m08.d16:meVE.AposGlory.text
ltx/gr_gr_cog/me.m08.d20:meMA.Aposticha2.incipit	@ltx/gr_gr_cog/me.m08.d16:meVE.Aposticha2.incipit
ltx/gr_gr_cog/me.m08.d20:meMA.Aposticha2.melody	@ltx/gr_gr_cog/he.a.m2:heAU.OikosTouEfratha.name
ltx/gr_gr_cog/me.m08.d20:meMA.Aposticha2.mode	@ltx/gr_gr_cog/miscellanea:misc.Mode2
ltx/gr_gr_cog/me.m08.d20:meMA.Aposticha2.text	@ltx/gr_gr_cog/me.m08.d16:meVE.Aposticha2.text
ltx/gr_gr_cog/me.m08.d20:meMA.Aposticha3.incipit	Στῖφος τῶν Μαθητῶν, καὶ θείων…
ltx/gr_gr_cog/me.m08.d20:meMA.Aposticha3.melody	@ltx/gr_gr_cog/he.a.m2:heAU.OikosTouEfratha.name
ltx/gr_gr_cog/me.m08.d20:meMA.Aposticha3.mode	@ltx/gr_gr_cog/miscellanea:misc.Mode2
ltx/gr_gr_cog/me.m08.d20:meMA.Aposticha3.text	Στῖφος τῶν Μαθητῶν, καὶ θείων Ἀποστόλων, ἀθροίσθητε κηδεῦσαι, τὸ θεοδόχον σῶμα, τῆς μόνης Θεομήτορος.
ltx/gr_gr_cog/me.m08.d20:meMA.C1.acrostic.notice1	οὗ ἡ Ἀκροστιχίς·
ltx/gr_gr_cog/me.m08.d20:meMA.C1.acrostic.text	Τὸ τοῦ βλέποντος Σαμουὴλ μέλπω κλέος. Ἰωσήφ.
ltx/gr_gr_cog/me.m08.d20:meMA.C1.acrostic.title	Ὁ Κανὼν τοῦ Προφήτου,
ltx/gr_gr_cog/me.m08.d20:meMA.C1.title	@ltx/gr_gr_cog/titles:ti.CanonProphet
ltx/gr_gr_cog/me.m08.d20:meMA.C1.verse	@ltx/gr_gr_cog/prayers:pr.verse_Prophet.text
ltx/gr_gr_cog/me.m08.d20:meMA.Exaposteilarion1.greekmelody	@ltx/gr_gr_cog/he.a.m3:heAU.OOuranonToisAstrois.greekname
ltx/gr_gr_cog/me.m08.d20:meMA.Exaposteilarion1.incipit	Ὁ Σαμουὴλ ὑμνείσθω, ὁ πρὸ…
ltx/gr_gr_cog/me.m08.d20:meMA.Exaposteilarion1.melody	@ltx/gr_gr_cog/he.a.m3:heAU.OOuranonToisAstrois.name
ltx/gr_gr_cog/me.m08.d20:meMA.Exaposteilarion1.mode	@ltx/gr_gr_cog/miscellanea:misc.Mode3
ltx/gr_gr_cog/me.m08.d20:meMA.Exaposteilarion1.text	Ὁ Σαμουὴλ ὑμνείσθω, ὁ πρὸ συλλήψεως δοθείς, δοτὸς Θεῷ τῷ Ὑψίστῳ, ὑπὸ μητρὸς πανευκλεοῦς, καὶ βασιλεῖς χρίων οὗτος, ὡς Ἱερεὺς καὶ Προφήτης.
ltx/gr_gr_cog/me.m08.d20:meMA.Exaposteilarion2.greekmelody	@ltx/gr_gr_cog/he.a.m3:heAU.OOuranonToisAstrois.greekname
ltx/gr_gr_cog/me.m08.d20:meMA.Exaposteilarion2.incipit	@ltx/gr_gr_cog/me.m08.d15:meMA.Exaposteilarion1.incipit
ltx/gr_gr_cog/me.m08.d20:meMA.Exaposteilarion2.melody	@ltx/gr_gr_cog/he.a.m3:heAU.OOuranonToisAstrois.name
ltx/gr_gr_cog/me.m08.d20:meMA.Exaposteilarion2.mode	@ltx/gr_gr_cog/miscellanea:misc.Mode3
ltx/gr_gr_cog/me.m08.d20:meMA.Exaposteilarion2.text	@ltx/gr_gr_cog/me.m08.d15:meMA.Exaposteilarion1.text
ltx/gr_gr_cog/me.m08.d20:meMA.Kathisma11.greekmelody	@ltx/gr_gr_cog/he.a.m3:heAU.TinOraiotita.greekname
ltx/gr_gr_cog/me.m08.d20:meMA.Kathisma11.incipit	@ltx/gr_gr_cog/me.m08.d17:meMA.Kathisma11.incipit
ltx/gr_gr_cog/me.m08.d20:meMA.Kathisma11.melody	@ltx/gr_gr_cog/he.a.m3:heAU.TinOraiotita.name
ltx/gr_gr_cog/me.m08.d20:meMA.Kathisma11.mode	@ltx/gr_gr_cog/miscellanea:misc.Mode3
ltx/gr_gr_cog/me.m08.d20:meMA.Kathisma11.text	@ltx/gr_gr_cog/me.m08.d17:meMA.Kathisma11.text
ltx/gr_gr_cog/me.m08.d20:meMA.Kathisma21.greekmelody	@ltx/gr_gr_cog/he.a.m4:heAU.KateplagiIosif.greekname
ltx/gr_gr_cog/me.m08.d20:meMA.Kathisma21.incipit	@ltx/gr_gr_cog/me.m08.d16:meMA.Kathisma21.incipit
ltx/gr_gr_cog/me.m08.d20:meMA.Kathisma21.melody	@ltx/gr_gr_cog/he.a.m4:heAU.KateplagiIosif.name
ltx/gr_gr_cog/me.m08.d20:meMA.Kathisma21.mode	@ltx/gr_gr_cog/miscellanea:misc.Mode4
ltx/gr_gr_cog/me.m08.d20:meMA.Kathisma21.text	@ltx/gr_gr_cog/me.m08.d16:meMA.Kathisma21.text
ltx/gr_gr_cog/me.m08.d20:meMA.Ode1C11.greekmelody	@ltx/gr_gr_cog/he.h.m4:heHE.TristatasKrataious.greekname
ltx/gr_gr_cog/me.m08.d20:meMA.Ode1C11.incipit	Τὴν στεῖράν μου ψυχήν, ἀρετῶν…
ltx/gr_gr_cog/me.m08.d20:meMA.Ode1C11.melody	@ltx/gr_gr_cog/he.h.m4:heHE.TristatasKrataious.name
ltx/gr_gr_cog/me.m08.d20:meMA.Ode1C11.mode	@ltx/gr_gr_cog/miscellanea:misc.Mode4
ltx/gr_gr_cog/me.m08.d20:meMA.Ode1C11.ode	@ltx/gr_gr_cog/miscellanea:misc.Ode1
ltx/gr_gr_cog/me.m08.d20:meMA.Ode1C11.text	Τὴν στεῖράν μου ψυχήν, ἀρετῶν εὐτεκνίαν, ἐκβλαστάνειν σαῖς εὐχαῖς, ἀξίωσον σοφέ, στειρευούσης τὸ βλάστημα, ὅπως σου ἀνευφημήσω, τὴν φωσφόρον πανήγυριν, ἱεροῖς Σαμουὴλ μελῳδήμασιν.
ltx/gr_gr_cog/me.m08.d20:meMA.Ode1C12.incipit	Ὁ πάλαι τὴν νηδύν, διανοίξας…
ltx/gr_gr_cog/me.m08.d20:meMA.Ode1C12.melody	@ltx/gr_gr_cog/he.h.m4:heHE.TristatasKrataious.name
ltx/gr_gr_cog/me.m08.d20:meMA.Ode1C12.mode	@ltx/gr_gr_cog/miscellanea:misc.Mode4
ltx/gr_gr_cog/me.m08.d20:meMA.Ode1C12.ode	@ltx/gr_gr_cog/miscellanea:misc.Ode1
ltx/gr_gr_cog/me.m08.d20:meMA.Ode1C12.text	Ὁ πάλαι τὴν νηδύν, διανοίξας τῆς Σάῤῥας, τὴν τῆς Ἄννης προσευχήν, πληροῖ περιφανῶς, καὶ τὴν ἄγονον γόνιμον, χάριτι ἀποτελέσας Σαμουὴλ ὡς ἀστέρα σε, ἐξ αὐτῆς ἀνατεῖλαι ηὐδόκησεν.
ltx/gr_gr_cog/me.m08.d20:meMA.Ode1C13.incipit	Τῇ θείᾳ ἱερῶς, συνακμάσας παμμάκαρ…
ltx/gr_gr_cog/me.m08.d20:meMA.Ode1C13.melody	@ltx/gr_gr_cog/he.h.m4:heHE.TristatasKrataious.name
ltx/gr_gr_cog/me.m08.d20:meMA.Ode1C13.mode	@ltx/gr_gr_cog/miscellanea:misc.Mode4
ltx/gr_gr_cog/me.m08.d20:meMA.Ode1C13.ode	@ltx/gr_gr_cog/miscellanea:misc.Ode1
ltx/gr_gr_cog/me.m08.d20:meMA.Ode1C13.text	Τῇ θείᾳ ἱερῶς, συνακμάσας παμμάκαρ, διπλοΐδι τὴν ψυχήν, ἀκτῖσι μυστικαῖς ἐφωτίσθης τοῦ Πνεύματος, πᾶσαν μύησιν θεόφρον μυηθείς, καὶ ὡς Ἄγγελος, λειτουργήσας Θεῷ παντοκράτορι.
ltx/gr_gr_cog/me.m08.d20:meMA.Ode1C1T.incipit	Ὁ ὢν σὺν τῷ Πατρί…
ltx/gr_gr_cog/me.m08.d20:meMA.Ode1C1T.melody	@ltx/gr_gr_cog/he.h.m4:heHE.TristatasKrataious.name
ltx/gr_gr_cog/me.m08.d20:meMA.Ode1C1T.mode	@ltx/gr_gr_cog/miscellanea:misc.Mode4
ltx/gr_gr_cog/me.m08.d20:meMA.Ode1C1T.ode	@ltx/gr_gr_cog/miscellanea:misc.Ode1
ltx/gr_gr_cog/me.m08.d20:meMA.Ode1C1T.text	Ὁ ὢν σὺν τῷ Πατρί, ὡς Υἱὸς πρὸ αἰώνων, ἐπʼ ἐσχάτων σαρκωθείς, Υἱός σου ἀληθῶς, ἐχρημάτισεν Ἄχραντε, ἅπαντας υἱοθετήσας, τῷ Θεῷ διὰ πίστεως, δουλωθέντας δεινῷ πολεμήτορι.
ltx/gr_gr_cog/me.m08.d20:meMA.Ode3C11.greekmelody	@ltx/gr_gr_cog/he.h.m4:heHE.OukEnSofia.greekname
ltx/gr_gr_cog/me.m08.d20:meMA.Ode3C11.incipit	Ὑψηλοτάτως, τῷ Θεῷ προσκολλώμενος ἔνδοξε…
ltx/gr_gr_cog/me.m08.d20:meMA.Ode3C11.melody	@ltx/gr_gr_cog/he.h.m4:heHE.OukEnSofia.name
ltx/gr_gr_cog/me.m08.d20:meMA.Ode3C11.mode	@ltx/gr_gr_cog/miscellanea:misc.Mode4
ltx/gr_gr_cog/me.m08.d20:meMA.Ode3C11.ode	@ltx/gr_gr_cog/miscellanea:misc.Ode3
ltx/gr_gr_cog/me.m08.d20:meMA.Ode3C11.text	Ὑψηλοτάτως, τῷ Θεῷ προσκολλώμενος ἔνδοξε, ἠγαπήθης παρʼ αὐτοῦ, φρονήσει θείᾳ κοσμούμενος, καὶ ἀκεραιότητι, καλλωπιζόμενος.
ltx/gr_gr_cog/me.m08.d20:meMA.Ode3C12.incipit	Βίον Ἀγγέλων, ἐπὶ γῆς Σαμουὴλ…
ltx/gr_gr_cog/me.m08.d20:meMA.Ode3C12.melody	@ltx/gr_gr_cog/he.h.m4:heHE.OukEnSofia.name
ltx/gr_gr_cog/me.m08.d20:meMA.Ode3C12.mode	@ltx/gr_gr_cog/miscellanea:misc.Mode4
ltx/gr_gr_cog/me.m08.d20:meMA.Ode3C12.ode	@ltx/gr_gr_cog/miscellanea:misc.Ode3
ltx/gr_gr_cog/me.m08.d20:meMA.Ode3C12.text	Βίον Ἀγγέλων, ἐπὶ γῆς Σαμουὴλ ἐνδεικνύμενος, συλλαλοῦντας ἐμφανῶς, Ἀγγέλους ἔσχες μακάριε, καὶ τὰ ὑπὲρ ἔννοιαν, μυσταγωγοῦντάς σε.
ltx/gr_gr_cog/me.m08.d20:meMA.Ode3C13.incipit	Λαμπρὸν τὸ ὄμμα, τῆς ψυχῆς…
ltx/gr_gr_cog/me.m08.d20:meMA.Ode3C13.melody	@ltx/gr_gr_cog/he.h.m4:heHE.OukEnSofia.name
ltx/gr_gr_cog/me.m08.d20:meMA.Ode3C13.mode	@ltx/gr_gr_cog/miscellanea:misc.Mode4
ltx/gr_gr_cog/me.m08.d20:meMA.Ode3C13.ode	@ltx/gr_gr_cog/miscellanea:misc.Ode3
ltx/gr_gr_cog/me.m08.d20:meMA.Ode3C13.text	Λαμπρὸν τὸ ὄμμα, τῆς ψυχῆς ἱερῶς προσκτησάμενος, βλέπεις ὄντως τὰ μακράν, ὡς ἐνεστῶτα μακάριε, Προφήτης δεικνύμενος, τοῦ Παντοκράτορος.
ltx/gr_gr_cog/me.m08.d20:meMA.Ode3C1T.incipit	Ἐκ σοῦ προῆλθεν, Ἰησοῦς ὁ…
ltx/gr_gr_cog/me.m08.d20:meMA.Ode3C1T.melody	@ltx/gr_gr_cog/he.h.m4:heHE.OukEnSofia.name
ltx/gr_gr_cog/me.m08.d20:meMA.Ode3C1T.mode	@ltx/gr_gr_cog/miscellanea:misc.Mode4
ltx/gr_gr_cog/me.m08.d20:meMA.Ode3C1T.ode	@ltx/gr_gr_cog/miscellanea:misc.Ode3
ltx/gr_gr_cog/me.m08.d20:meMA.Ode3C1T.text	Ἐκ σοῦ προῆλθεν, Ἰησοῦς ὁ Χριστὸς σωματούμενος, καὶ ἐθέωσεν ἡμᾶς, σαρκὸς προσλήψει πανάμωμε· ὅθεν ὡς Μητέρα σε, τούτου γεραίρομεν.
ltx/gr_gr_cog/me.m08.d20:meMA.Ode3H.greekmelody	@ltx/gr_gr_cog/he.h.m4:heHE.OukEnSofia.greekname
ltx/gr_gr_cog/me.m08.d20:meMA.Ode3H.incipit	@ltx/gr_gr_cog/he.h.m4:heHE.OukEnSofia.incipit
ltx/gr_gr_cog/me.m08.d20:meMA.Ode3H.melody	@ltx/gr_gr_cog/he.h.m4:heHE.OukEnSofia.melody
ltx/gr_gr_cog/me.m08.d20:meMA.Ode3H.mode	@ltx/gr_gr_cog/miscellanea:misc.Mode4
ltx/gr_gr_cog/me.m08.d20:meMA.Ode3H.ode	@ltx/gr_gr_cog/miscellanea:misc.Ode3
ltx/gr_gr_cog/me.m08.d20:meMA.Ode3H.text	@ltx/gr_gr_cog/he.h.m4:heHE.OukEnSofia.text
ltx/gr_gr_cog/me.m08.d20:meMA.Ode3Kathisma1.greekmelody	@ltx/gr_gr_cog/he.a.m3:heAU.TheiasPisteos.greekname
ltx/gr_gr_cog/me.m08.d20:meMA.Ode3Kathisma1.incipit	Νόμου κρίμασιν ἐντεθραμμένος, χρῖσμα τίμιον…
ltx/gr_gr_cog/me.m08.d20:meMA.Ode3Kathisma1.melody	@ltx/gr_gr_cog/he.a.m3:heAU.TheiasPisteos.name
ltx/gr_gr_cog/me.m08.d20:meMA.Ode3Kathisma1.mode	@ltx/gr_gr_cog/miscellanea:misc.Mode3
ltx/gr_gr_cog/me.m08.d20:meMA.Ode3Kathisma1.text	Νόμου κρίμασιν ἐντεθραμμένος, χρῖσμα τίμιον εἰσδεδεγμένος, ὡς Ἀαρὼν ἱερωσύνῃ διέπρεψας, καὶ λαμπρυνθεὶς τὴν καρδίαν τῷ Πνεύματι, ὡς ἐνεστῶτα τὰ πόῤῥω διέβλεψας, ἱερώτατε, Χριστὸν τὸν Θεὸν ἱκέτευε, δωρήσασθαι ἡμῖν τὸ μέγα ἔλεος.
ltx/gr_gr_cog/me.m08.d20:meMA.Ode3Kathisma2.greekmelody	@ltx/gr_gr_cog/he.a.m3:heAU.TinOraiotita.greekname
ltx/gr_gr_cog/me.m08.d20:meMA.Ode3Kathisma2.incipit	@ltx/gr_gr_cog/me.m08.d15:meMA.Kathisma31.incipit
ltx/gr_gr_cog/me.m08.d20:meMA.Ode3Kathisma2.melody	@ltx/gr_gr_cog/he.a.m3:heAU.TinOraiotita.name
ltx/gr_gr_cog/me.m08.d20:meMA.Ode3Kathisma2.mode	@ltx/gr_gr_cog/miscellanea:misc.Mode3
ltx/gr_gr_cog/me.m08.d20:meMA.Ode3Kathisma2.text	@ltx/gr_gr_cog/me.m08.d15:meMA.Kathisma31.text
ltx/gr_gr_cog/me.m08.d20:meMA.Ode4C11.greekmelody	@ltx/gr_gr_cog/he.h.m4:heHE.OKathimenosEnDoxi.greekname
ltx/gr_gr_cog/me.m08.d20:meMA.Ode4C11.incipit	Περιβλέπτῳ πολιτείᾳ, ἱερῶς ἐγκοσμούμενος, τοῦ…
ltx/gr_gr_cog/me.m08.d20:meMA.Ode4C11.melody	@ltx/gr_gr_cog/he.h.m4:heHE.OKathimenosEnDoxi.name
ltx/gr_gr_cog/me.m08.d20:meMA.Ode4C11.mode	@ltx/gr_gr_cog/miscellanea:misc.Mode4
ltx/gr_gr_cog/me.m08.d20:meMA.Ode4C11.ode	@ltx/gr_gr_cog/miscellanea:misc.Ode4
ltx/gr_gr_cog/me.m08.d20:meMA.Ode4C11.text	Περιβλέπτῳ πολιτείᾳ, ἱερῶς ἐγκοσμούμενος, τοῦ Θεοῦ τοὺς νόμους, τοὺς σωτηριώδεις πεπίστευσαι, τῷ Ἰσραὴλ διαγγέλλειν παραβαίνοντι, καὶ τὸν εὔσπλαγχνον, διηνεκῶς παροργίζοντι.
ltx/gr_gr_cog/me.m08.d20:meMA.Ode4C12.incipit	Ὁ Ἠλεὶ παρανομούντων, τῶν υἱῶν…
ltx/gr_gr_cog/me.m08.d20:meMA.Ode4C12.melody	@ltx/gr_gr_cog/he.h.m4:heHE.OKathimenosEnDoxi.name
ltx/gr_gr_cog/me.m08.d20:meMA.Ode4C12.mode	@ltx/gr_gr_cog/miscellanea:misc.Mode4
ltx/gr_gr_cog/me.m08.d20:meMA.Ode4C12.ode	@ltx/gr_gr_cog/miscellanea:misc.Ode4
ltx/gr_gr_cog/me.m08.d20:meMA.Ode4C12.text	Ὁ Ἠλεὶ παρανομούντων, τῶν υἱῶν κατακρίνεται, καὶ δικαίᾳ ψήφῳ, θείας λειτουργίας ἀπείργεται, ὁ ἱερὸς Σαμουὴλ δὲ ὡς ὑπήκοος, τοῦ καλοῦντος, ἀπλάστῳ ψυχῇ εἰσοικίζεται.
ltx/gr_gr_cog/me.m08.d20:meMA.Ode4C13.incipit	Νομικῶν διαταγμάτων, προϊστάμενος ἄριστα, Ἀαρὼν…
ltx/gr_gr_cog/me.m08.d20:meMA.Ode4C13.melody	@ltx/gr_gr_cog/he.h.m4:heHE.OKathimenosEnDoxi.name
ltx/gr_gr_cog/me.m08.d20:meMA.Ode4C13.mode	@ltx/gr_gr_cog/miscellanea:misc.Mode4
ltx/gr_gr_cog/me.m08.d20:meMA.Ode4C13.ode	@ltx/gr_gr_cog/miscellanea:misc.Ode4
ltx/gr_gr_cog/me.m08.d20:meMA.Ode4C13.text	Νομικῶν διαταγμάτων, προϊστάμενος ἄριστα, Ἀαρὼν ὡς πάλαι, τῷ Παμβασιλεῖ ἐλειτούργησας, καὶ τὰς ἐννόμους θυσίας προσενήνοχας, προτυπούσας, Χριστοῦ τὴν σφαγήν τὴν σωτήριον.
ltx/gr_gr_cog/me.m08.d20:meMA.Ode4C14.incipit	Τῷ παράφρονι λαῷ σου, Σαμουὴλ…
ltx/gr_gr_cog/me.m08.d20:meMA.Ode4C14.melody	@ltx/gr_gr_cog/he.h.m4:heHE.OKathimenosEnDoxi.name
ltx/gr_gr_cog/me.m08.d20:meMA.Ode4C14.mode	@ltx/gr_gr_cog/miscellanea:misc.Mode4
ltx/gr_gr_cog/me.m08.d20:meMA.Ode4C14.ode	@ltx/gr_gr_cog/miscellanea:misc.Ode4
ltx/gr_gr_cog/me.m08.d20:meMA.Ode4C14.text	Τῷ παράφρονι λαῷ σου, Σαμουὴλ μὴ ἐμμένοντι, τοῦ Παμβασιλέως, θείαις προσταγαῖς χρίεις νεύματι, θεουργικῷ βασιλέα ὡς ᾐτήσατο, κερτομοῦντα, αὐτοῦ τὴν βουλήν τὴν ὑπέρφρονα.
ltx/gr_gr_cog/me.m08.d20:meMA.Ode4C1T.incipit	Ὁ τοὺς κόλπους μὴ κενώσας…
ltx/gr_gr_cog/me.m08.d20:meMA.Ode4C1T.melody	@ltx/gr_gr_cog/he.h.m4:heHE.OKathimenosEnDoxi.name
ltx/gr_gr_cog/me.m08.d20:meMA.Ode4C1T.mode	@ltx/gr_gr_cog/miscellanea:misc.Mode4
ltx/gr_gr_cog/me.m08.d20:meMA.Ode4C1T.ode	@ltx/gr_gr_cog/miscellanea:misc.Ode4
ltx/gr_gr_cog/me.m08.d20:meMA.Ode4C1T.text	Ὁ τοὺς κόλπους μὴ κενώσας, τοῦ Πατρὸς ἐν τοῖς κόλποις σου, νέον ὥσπερ βρέφος, ἐπανακλιθῆναι εὐδόκησεν, ἐπʼ ἀνακλήσει Παρθένε τῶν ψυχῶν ἡμῶν, ᾧ κραυγάζομεν· Δόξα Χριστὲ τῇ δυνάμει σου.
ltx/gr_gr_cog/me.m08.d20:meMA.Ode5C11.greekmelody	@ltx/gr_gr_cog/he.h.m4:heHE.AseveisOukOpsontai.greekname
ltx/gr_gr_cog/me.m08.d20:meMA.Ode5C11.incipit	Σοφισθεὶς τῷ Πνεύματι, τῷ θείῳ…
ltx/gr_gr_cog/me.m08.d20:meMA.Ode5C11.melody	@ltx/gr_gr_cog/he.h.m4:heHE.AseveisOukOpsontai.name
ltx/gr_gr_cog/me.m08.d20:meMA.Ode5C11.mode	@ltx/gr_gr_cog/miscellanea:misc.Mode4
ltx/gr_gr_cog/me.m08.d20:meMA.Ode5C11.ode	@ltx/gr_gr_cog/miscellanea:misc.Ode5
ltx/gr_gr_cog/me.m08.d20:meMA.Ode5C11.text	Σοφισθεὶς τῷ Πνεύματι, τῷ θείῳ ἐκ παιδός, λειτουργὸς γέγονας Θεοῦ, τῷ ἐλαίῳ ἔνδοξε τῷ τῆς χρίσεως, βασιλεῖς ἐν χάριτι, χρίων θείαις ἐπινεύσεσιν.
ltx/gr_gr_cog/me.m08.d20:meMA.Ode5C12.incipit	Σοβαρῶς ἐμμένοντι, προέφης τῷ Σαούλ…
ltx/gr_gr_cog/me.m08.d20:meMA.Ode5C12.melody	@ltx/gr_gr_cog/he.h.m4:heHE.AseveisOukOpsontai.name
ltx/gr_gr_cog/me.m08.d20:meMA.Ode5C12.mode	@ltx/gr_gr_cog/miscellanea:misc.Mode4
ltx/gr_gr_cog/me.m08.d20:meMA.Ode5C12.ode	@ltx/gr_gr_cog/miscellanea:misc.Ode5
ltx/gr_gr_cog/me.m08.d20:meMA.Ode5C12.text	Σοβαρῶς ἐμμένοντι, προέφης τῷ Σαούλ, ταῖς ἀτάκτοις μεταβολαῖς, Σαμουὴλ μακάριε, τὸ θεῖον βούλημα, καὶ τὴν ἐγκατάλειψιν, προφανῶς τοῦ θείου Πνεύματος.
ltx/gr_gr_cog/me.m08.d20:meMA.Ode5C13.incipit	Ἀκακίᾳ πάντοτε σὺ ζῶν, τοῦ…
ltx/gr_gr_cog/me.m08.d20:meMA.Ode5C13.melody	@ltx/gr_gr_cog/he.h.m4:heHE.AseveisOukOpsontai.name
ltx/gr_gr_cog/me.m08.d20:meMA.Ode5C13.mode	@ltx/gr_gr_cog/miscellanea:misc.Mode4
ltx/gr_gr_cog/me.m08.d20:meMA.Ode5C13.ode	@ltx/gr_gr_cog/miscellanea:misc.Ode5
ltx/gr_gr_cog/me.m08.d20:meMA.Ode5C13.text	Ἀκακίᾳ πάντοτε σὺ ζῶν, τοῦ Ἰσραὴλ τὴν κακίστην μεταβολήν, προφανῶς διήλεγχες, σὺ διορθούμενος, ἱερεὺς ὡς ἔνθεος, ὡς Προφήτης ἀληθέστατος.
ltx/gr_gr_cog/me.m08.d20:meMA.Ode5C1T.incipit	Μεθʼ ἡμῶν γενόμενος, διʼ οἶκτον…
ltx/gr_gr_cog/me.m08.d20:meMA.Ode5C1T.melody	@ltx/gr_gr_cog/he.h.m4:heHE.AseveisOukOpsontai.name
ltx/gr_gr_cog/me.m08.d20:meMA.Ode5C1T.mode	@ltx/gr_gr_cog/miscellanea:misc.Mode4
ltx/gr_gr_cog/me.m08.d20:meMA.Ode5C1T.ode	@ltx/gr_gr_cog/miscellanea:misc.Ode5
ltx/gr_gr_cog/me.m08.d20:meMA.Ode5C1T.text	Μεθʼ ἡμῶν γενόμενος, διʼ οἶκτον ὁ Σωτήρ, ἐξ αἱμάτων σου ἱερῶν, ὑπὲρ νοῦν Πανάμωμε σεσωμάτωται, καὶ Θεὸς καὶ ἄνθρωπος, ὁ φιλάνθρωπος γνωρίζεται.
ltx/gr_gr_cog/me.m08.d20:meMA.Ode6C11.greekmelody	@ltx/gr_gr_cog/he.h.m4:heHE.EvoiseProtypon.greekname
ltx/gr_gr_cog/me.m08.d20:meMA.Ode6C11.incipit	Ὁ λόγος σου, τῇ τοῦ…
ltx/gr_gr_cog/me.m08.d20:meMA.Ode6C11.melody	@ltx/gr_gr_cog/he.h.m4:heHE.EvoiseProtypon.name
ltx/gr_gr_cog/me.m08.d20:meMA.Ode6C11.mode	@ltx/gr_gr_cog/miscellanea:misc.Mode4
ltx/gr_gr_cog/me.m08.d20:meMA.Ode6C11.ode	@ltx/gr_gr_cog/miscellanea:misc.Ode6
ltx/gr_gr_cog/me.m08.d20:meMA.Ode6C11.text	Ὁ λόγος σου, τῇ τοῦ Λόγου θεούμενος χάριτι, προεδήλου τὰ μακράν, ὡς ἐγγὺς συμβησόμενα, Σαμουὴλ Προφῆτα, ἐνδιαίτημα θεῖον τοῦ Πνεύματος.
ltx/gr_gr_cog/me.m08.d20:meMA.Ode6C12.incipit	Ὑψούμενος, ὑψηλαῖς θεωρίαις καὶ πράξεσιν…
ltx/gr_gr_cog/me.m08.d20:meMA.Ode6C12.melody	@ltx/gr_gr_cog/he.h.m4:heHE.EvoiseProtypon.name
ltx/gr_gr_cog/me.m08.d20:meMA.Ode6C12.mode	@ltx/gr_gr_cog/miscellanea:misc.Mode4
ltx/gr_gr_cog/me.m08.d20:meMA.Ode6C12.ode	@ltx/gr_gr_cog/miscellanea:misc.Ode6
ltx/gr_gr_cog/me.m08.d20:meMA.Ode6C12.text	Ὑψούμενος, ὑψηλαῖς θεωρίαις καὶ πράξεσιν, ὡς Προφήτης καὶ Θεοῦ, Ἱερεὺς παντοκράτορος, νομικαῖς λατρείαις, καθαγνίζεις ἀξιάγαστε.
ltx/gr_gr_cog/me.m08.d20:meMA.Ode6C13.incipit	Ἠχρείωται, ὁ Σαοὺλ παραβάτης γενόμενος…
ltx/gr_gr_cog/me.m08.d20:meMA.Ode6C13.melody	@ltx/gr_gr_cog/he.h.m4:heHE.EvoiseProtypon.name
ltx/gr_gr_cog/me.m08.d20:meMA.Ode6C13.mode	@ltx/gr_gr_cog/miscellanea:misc.Mode4
ltx/gr_gr_cog/me.m08.d20:meMA.Ode6C13.ode	@ltx/gr_gr_cog/miscellanea:misc.Ode6
ltx/gr_gr_cog/me.m08.d20:meMA.Ode6C13.text	Ἠχρείωται, ὁ Σαοὺλ παραβάτης γενόμενος, καὶ Θεός σοι, ἀντʼ ἐκείνου Δαυῒδ τὸν πραότατον, Σαμουὴλ θεόφρον, ἐγκελεύεται χρῖσαι τῷ χρίσματι.
ltx/gr_gr_cog/me.m08.d20:meMA.Ode6C1T.incipit	Λελύτρωται, τῶν ὠδίνων ἡ Εὔα…
ltx/gr_gr_cog/me.m08.d20:meMA.Ode6C1T.melody	@ltx/gr_gr_cog/he.h.m4:heHE.EvoiseProtypon.name
ltx/gr_gr_cog/me.m08.d20:meMA.Ode6C1T.mode	@ltx/gr_gr_cog/miscellanea:misc.Mode4
ltx/gr_gr_cog/me.m08.d20:meMA.Ode6C1T.ode	@ltx/gr_gr_cog/miscellanea:misc.Ode6
ltx/gr_gr_cog/me.m08.d20:meMA.Ode6C1T.text	Λελύτρωται, τῶν ὠδίνων ἡ Εὔα Πανάμωμε, ἀνωδίνως, σοῦ τεκούσης Χριστὸν τὸν Θεὸν ἡμῶν, τὸν τὰ πάθη πάντων, καὶ ὀδύνας σαφῶς θεραπεύσαντα.
ltx/gr_gr_cog/me.m08.d20:meMA.Ode6H.greekmelody	@ltx/gr_gr_cog/he.h.m4:heHE.EvoiseProtypon.greekname
ltx/gr_gr_cog/me.m08.d20:meMA.Ode6H.incipit	@ltx/gr_gr_cog/he.h.m4:heHE.EvoiseProtypon.incipit
ltx/gr_gr_cog/me.m08.d20:meMA.Ode6H.melody	@ltx/gr_gr_cog/he.h.m4:heHE.EvoiseProtypon.melody
ltx/gr_gr_cog/me.m08.d20:meMA.Ode6H.mode	@ltx/gr_gr_cog/miscellanea:misc.Mode4
ltx/gr_gr_cog/me.m08.d20:meMA.Ode6H.ode	@ltx/gr_gr_cog/miscellanea:misc.Ode6
ltx/gr_gr_cog/me.m08.d20:meMA.Ode6H.text	@ltx/gr_gr_cog/he.h.m4:heHE.EvoiseProtypon.text
ltx/gr_gr_cog/me.m08.d20:meMA.Ode7C11.greekmelody	@ltx/gr_gr_cog/he.h.m4:heHE.NeoiTreisEnVavyloni.greekname
ltx/gr_gr_cog/me.m08.d20:meMA.Ode7C11.incipit	Μέγιστόν σε ἡ τεκοῦσα, δῶρον…
ltx/gr_gr_cog/me.m08.d20:meMA.Ode7C11.melody	@ltx/gr_gr_cog/he.h.m4:heHE.NeoiTreisEnVavyloni.name
ltx/gr_gr_cog/me.m08.d20:meMA.Ode7C11.mode	@ltx/gr_gr_cog/miscellanea:misc.Mode4
ltx/gr_gr_cog/me.m08.d20:meMA.Ode7C11.ode	@ltx/gr_gr_cog/miscellanea:misc.Ode7
ltx/gr_gr_cog/me.m08.d20:meMA.Ode7C11.text	Μέγιστόν σε ἡ τεκοῦσα, δῶρον τῷ Παμβασιλεῖ, προσάγει μακάριε, εὐχὴν ἱερὰν ἐκπληροῦσα, καὶ μελῳδοῦσα· Κύριε, ὁ Θεὸς ὁ τῶν Πατέρων εὐλογητὸς εἶ.
ltx/gr_gr_cog/me.m08.d20:meMA.Ode7C12.incipit	Ἔνδον ὄντα τοῦ ναοῦ σε…
ltx/gr_gr_cog/me.m08.d20:meMA.Ode7C12.melody	@ltx/gr_gr_cog/he.h.m4:heHE.NeoiTreisEnVavyloni.name
ltx/gr_gr_cog/me.m08.d20:meMA.Ode7C12.mode	@ltx/gr_gr_cog/miscellanea:misc.Mode4
ltx/gr_gr_cog/me.m08.d20:meMA.Ode7C12.ode	@ltx/gr_gr_cog/miscellanea:misc.Ode7
ltx/gr_gr_cog/me.m08.d20:meMA.Ode7C12.text	Ἔνδον ὄντα τοῦ ναοῦ σε, καὶ κατὰ τοῦ Ἀαρών, τὴν τάξιν λατρεύοντα, τῷ ἐπουρανίῳ Δεσπότῃ, ἡ θεία χάρις ἔνδοξε, Σαμουὴλ κατελάμπρυνεν.
ltx/gr_gr_cog/me.m08.d20:meMA.Ode7C13.incipit	Λόγῳ θείῳ κρίνεις μάκαρ, τὸν…
ltx/gr_gr_cog/me.m08.d20:meMA.Ode7C13.melody	@ltx/gr_gr_cog/he.h.m4:heHE.NeoiTreisEnVavyloni.name
ltx/gr_gr_cog/me.m08.d20:meMA.Ode7C13.mode	@ltx/gr_gr_cog/miscellanea:misc.Mode4
ltx/gr_gr_cog/me.m08.d20:meMA.Ode7C13.ode	@ltx/gr_gr_cog/miscellanea:misc.Ode7
ltx/gr_gr_cog/me.m08.d20:meMA.Ode7C13.text	Λόγῳ θείῳ κρίνεις μάκαρ, τὸν λαὸν τοῦ Ἰσραήλ, τούτῳ τὸ δικαίωμα, πάντοτε Θεοῦ διαγγέλλων, καὶ ἀποστρέφων πᾶσαν βλάβην, ἐχθρῶν προσευχῇ ἐκτενεῖ.
ltx/gr_gr_cog/me.m08.d20:meMA.Ode7C14.incipit	Πᾶσαν ὕλην ἐκκενώσας, ἔνδοξε τοῦ…
ltx/gr_gr_cog/me.m08.d20:meMA.Ode7C14.melody	@ltx/gr_gr_cog/he.h.m4:heHE.NeoiTreisEnVavyloni.name
ltx/gr_gr_cog/me.m08.d20:meMA.Ode7C14.mode	@ltx/gr_gr_cog/miscellanea:misc.Mode4
ltx/gr_gr_cog/me.m08.d20:meMA.Ode7C14.ode	@ltx/gr_gr_cog/miscellanea:misc.Ode7
ltx/gr_gr_cog/me.m08.d20:meMA.Ode7C14.text	Πᾶσαν ὕλην ἐκκενώσας, ἔνδοξε τοῦ σοῦ νοός, ἔσοπρον τοῦ Πνεύματος, ἐδείχθης βοῶν ἀσιγήτως· Εὐλογητὸς εἶ Κύριε, ὁ Θεὸς ὁ τῶν Πατέρων εἰς τοὺς αἰῶνας.
ltx/gr_gr_cog/me.m08.d20:meMA.Ode7C1T.incipit	Ὤφθης ἄφλεκτος τεκοῦσα, πάναγνε ὡς…
ltx/gr_gr_cog/me.m08.d20:meMA.Ode7C1T.melody	@ltx/gr_gr_cog/he.h.m4:heHE.NeoiTreisEnVavyloni.name
ltx/gr_gr_cog/me.m08.d20:meMA.Ode7C1T.mode	@ltx/gr_gr_cog/miscellanea:misc.Mode4
ltx/gr_gr_cog/me.m08.d20:meMA.Ode7C1T.ode	@ltx/gr_gr_cog/miscellanea:misc.Ode7
ltx/gr_gr_cog/me.m08.d20:meMA.Ode7C1T.text	Ὤφθης ἄφλεκτος τεκοῦσα, πάναγνε ὡς ἀληθῶς, τὸ πῦρ τῆς Θεότητος· διὸ τὰ ὑλώδη μου πάθη, Θεοκυῆτορ φλέξον, ὡς συμπαθὴς καὶ φιλάγαθος.
ltx/gr_gr_cog/me.m08.d20:meMA.Ode8C11.greekmelody	@ltx/gr_gr_cog/he.h.m4:heHE.LytrotaTouPantos.greekname
ltx/gr_gr_cog/me.m08.d20:meMA.Ode8C11.incipit	Κοσμηθεὶς Ἀαρὼν τῷ ἐνδύματι, τῶν…
ltx/gr_gr_cog/me.m08.d20:meMA.Ode8C11.melody	@ltx/gr_gr_cog/he.h.m4:heHE.LytrotaTouPantos.name
ltx/gr_gr_cog/me.m08.d20:meMA.Ode8C11.mode	@ltx/gr_gr_cog/miscellanea:misc.Mode4
ltx/gr_gr_cog/me.m08.d20:meMA.Ode8C11.ode	@ltx/gr_gr_cog/miscellanea:misc.Ode8
ltx/gr_gr_cog/me.m08.d20:meMA.Ode8C11.text	Κοσμηθεὶς Ἀαρὼν τῷ ἐνδύματι, τῶν Ἁγίων εἰσῆλθες εἰς Ἅγια, θυσίαις παμμακάριστε Ἰσραὴλ ἐφαγνίζων προμηνυούσαις τὴν σφαγὴν τοῦ Ἀμνοῦ τὴν σωτήριον.
ltx/gr_gr_cog/me.m08.d20:meMA.Ode8C12.incipit	Λογισμῷ καθαρῷ εἰσδεχόμενος, τὰς αὐγὰς…
ltx/gr_gr_cog/me.m08.d20:meMA.Ode8C12.melody	@ltx/gr_gr_cog/he.h.m4:heHE.LytrotaTouPantos.name
ltx/gr_gr_cog/me.m08.d20:meMA.Ode8C12.mode	@ltx/gr_gr_cog/miscellanea:misc.Mode4
ltx/gr_gr_cog/me.m08.d20:meMA.Ode8C12.ode	@ltx/gr_gr_cog/miscellanea:misc.Ode8
ltx/gr_gr_cog/me.m08.d20:meMA.Ode8C12.text	Λογισμῷ καθαρῷ εἰσδεχόμενος, τὰς αὐγὰς Σαμουὴλ τὰς τοῦ Πνεύματος, οἷα Προφήτης ἔνθεος, προμηνύεις τὰ πόῤῥω ὡς ἐνεστῶτα· διὰ τοῦτο πιστῶς εὐφημοῦμέν σε.
ltx/gr_gr_cog/me.m08.d20:meMA.Ode8C13.incipit	Ἐκλεκτὸς ὁ Δαυῒδ ἐχρημάτισεν, ἐν…
ltx/gr_gr_cog/me.m08.d20:meMA.Ode8C13.melody	@ltx/gr_gr_cog/he.h.m4:heHE.LytrotaTouPantos.name
ltx/gr_gr_cog/me.m08.d20:meMA.Ode8C13.mode	@ltx/gr_gr_cog/miscellanea:misc.Mode4
ltx/gr_gr_cog/me.m08.d20:meMA.Ode8C13.ode	@ltx/gr_gr_cog/miscellanea:misc.Ode8
ltx/gr_gr_cog/me.m08.d20:meMA.Ode8C13.text	Ἐκλεκτὸς ὁ Δαυῒδ ἐχρημάτισεν, ἐν υἱοῖς Ἱεσσαὶ ὡς ἐδήλωσας χρίων αὐτὸν τῷ χρίσματι, Σαμουὴλ τῷ ἁγίῳ καὶ ἀνακράζων· Εὐλογεῖτε τὰ ἔργα τὸν Κύριον.
ltx/gr_gr_cog/me.m08.d20:meMA.Ode8C14.incipit	Οἱ τὴν σὴν ἐκτελοῦντες πανήγυριν…
ltx/gr_gr_cog/me.m08.d20:meMA.Ode8C14.melody	@ltx/gr_gr_cog/he.h.m4:heHE.LytrotaTouPantos.name
ltx/gr_gr_cog/me.m08.d20:meMA.Ode8C14.mode	@ltx/gr_gr_cog/miscellanea:misc.Mode4
ltx/gr_gr_cog/me.m08.d20:meMA.Ode8C14.ode	@ltx/gr_gr_cog/miscellanea:misc.Ode8
ltx/gr_gr_cog/me.m08.d20:meMA.Ode8C14.text	Οἱ τὴν σὴν ἐκτελοῦντες πανήγυριν, Σαμουὴλ τῶν Δικαίων συνόμιλε ταῖς σαῖς πρεσβείαις τύχοιμεν, βασιλείας τῆς ἄνω ἀναβοῶντες· Εὐλογεῖτε τὰ ἔργα τὸ Κύριον.
ltx/gr_gr_cog/me.m08.d20:meMA.Ode8C1T.incipit	Συμπαθείας τῆς σῆς με ἀξίωσον…
ltx/gr_gr_cog/me.m08.d20:meMA.Ode8C1T.melody	@ltx/gr_gr_cog/he.h.m4:heHE.LytrotaTouPantos.name
ltx/gr_gr_cog/me.m08.d20:meMA.Ode8C1T.mode	@ltx/gr_gr_cog/miscellanea:misc.Mode4
ltx/gr_gr_cog/me.m08.d20:meMA.Ode8C1T.ode	@ltx/gr_gr_cog/miscellanea:misc.Ode8
ltx/gr_gr_cog/me.m08.d20:meMA.Ode8C1T.text	Συμπαθείας τῆς σῆς με ἀξίωσον, συμπαθὴς καὶ φιλάγαθε Δέσποινα, καὶ τῆς γεέννης ῥῦσαί με, καὶ τοῦ σκότους ἐκείνου τοῦ ἐξωτέρου, ἵνα πίστει καὶ πόθῳ γεραίρω σε.
ltx/gr_gr_cog/me.m08.d20:meMA.Ode8H.greekmelody	@ltx/gr_gr_cog/he.h.m4:heHE.LytrotaTouPantos.greekname
ltx/gr_gr_cog/me.m08.d20:meMA.Ode8H.incipit	@ltx/gr_gr_cog/he.h.m4:heHE.LytrotaTouPantos.incipit
ltx/gr_gr_cog/me.m08.d20:meMA.Ode8H.melody	@ltx/gr_gr_cog/he.h.m4:heHE.LytrotaTouPantos.melody
ltx/gr_gr_cog/me.m08.d20:meMA.Ode8H.mode	@ltx/gr_gr_cog/miscellanea:misc.Mode4
ltx/gr_gr_cog/me.m08.d20:meMA.Ode8H.ode	@ltx/gr_gr_cog/miscellanea:misc.Ode8
ltx/gr_gr_cog/me.m08.d20:meMA.Ode8H.text	@ltx/gr_gr_cog/he.h.m4:heHE.LytrotaTouPantos.text
ltx/gr_gr_cog/me.m08.d20:meMA.Ode9C11.greekmelody	@ltx/gr_gr_cog/he.h.m4:heHE.EvaMenToTisParakois.greekname
ltx/gr_gr_cog/me.m08.d20:meMA.Ode9C11.incipit	Ἱστάμενος οἷα λειτουργός, ἐπίπροσθεν, τοῦ…
ltx/gr_gr_cog/me.m08.d20:meMA.Ode9C11.melody	@ltx/gr_gr_cog/he.h.m4:heHE.EvaMenToTisParakois.name
ltx/gr_gr_cog/me.m08.d20:meMA.Ode9C11.mode	@ltx/gr_gr_cog/miscellanea:misc.Mode4
ltx/gr_gr_cog/me.m08.d20:meMA.Ode9C11.ode	@ltx/gr_gr_cog/miscellanea:misc.Ode9
ltx/gr_gr_cog/me.m08.d20:meMA.Ode9C11.text	Ἱστάμενος οἷα λειτουργός, ἐπίπροσθεν, τοῦ Δεσπότου καὶ Θεοῦ ἡμῶν, μάκαρ ἀμέμπτῳ πολιτείᾳ, κοσμούμενος αὐτῷ ἐλειτούργησας, τὰς θείας ἐκφαντορίας δεχόμενος, καὶ προφητεύων ἐμφανέστατα.
ltx/gr_gr_cog/me.m08.d20:meMA.Ode9C12.incipit	Ὤφθης ἐκ νηδύος μητρικῆς, ἀοίδιμε…
ltx/gr_gr_cog/me.m08.d20:meMA.Ode9C12.melody	@ltx/gr_gr_cog/he.h.m4:heHE.EvaMenToTisParakois.name
ltx/gr_gr_cog/me.m08.d20:meMA.Ode9C12.mode	@ltx/gr_gr_cog/miscellanea:misc.Mode4
ltx/gr_gr_cog/me.m08.d20:meMA.Ode9C12.ode	@ltx/gr_gr_cog/miscellanea:misc.Ode9
ltx/gr_gr_cog/me.m08.d20:meMA.Ode9C12.text	Ὤφθης ἐκ νηδύος μητρικῆς, ἀοίδιμε τοῦ Ἁγίου σκεῦος Πνεύματος, τῷ ἱερῷ συναυξηθεὶς δέ, ἐνδύματι Θεὸν ἐθεράπευσας, πραότητι καρδίας πανόλβιε, καὶ διανοίας ὡραιότητι.
ltx/gr_gr_cog/me.m08.d20:meMA.Ode9C13.incipit	Σήμερον ἡ μνήμη σου ἡμῖν…
ltx/gr_gr_cog/me.m08.d20:meMA.Ode9C13.melody	@ltx/gr_gr_cog/he.h.m4:heHE.EvaMenToTisParakois.name
ltx/gr_gr_cog/me.m08.d20:meMA.Ode9C13.mode	@ltx/gr_gr_cog/miscellanea:misc.Mode4
ltx/gr_gr_cog/me.m08.d20:meMA.Ode9C13.ode	@ltx/gr_gr_cog/miscellanea:misc.Ode9
ltx/gr_gr_cog/me.m08.d20:meMA.Ode9C13.text	Σήμερον ἡ μνήμη σου ἡμῖν, ὡς ἥλιος θεοφόρε ἀνατέταλκε, φέγγει πλουσίῳ χαρισμάτων, φωτίζουσα ψυχὰς τῶν τιμώντων σε, ὁμίχλην τε δεινῶν ἀπελαύνουσα· ὅθεν σε πάντες μεγαλύνομεν.
ltx/gr_gr_cog/me.m08.d20:meMA.Ode9C14.incipit	Ἤρθης πρὸς μονὰς φωτοειδεῖς, καὶ…
ltx/gr_gr_cog/me.m08.d20:meMA.Ode9C14.melody	@ltx/gr_gr_cog/he.h.m4:heHE.EvaMenToTisParakois.name
ltx/gr_gr_cog/me.m08.d20:meMA.Ode9C14.mode	@ltx/gr_gr_cog/miscellanea:misc.Mode4
ltx/gr_gr_cog/me.m08.d20:meMA.Ode9C14.ode	@ltx/gr_gr_cog/miscellanea:misc.Ode9
ltx/gr_gr_cog/me.m08.d20:meMA.Ode9C14.text	Ἤρθης πρὸς μονὰς φωτοειδεῖς, καὶ ἔλαμψας τοῦ ἡλίου τηλαυγέστερον, βλέπεις ἃ βλέπουσι Προφῆται, Ἀπόστολοι καὶ ἅπαντες Δίκαιοι, θεούμενος μεθέξει θεόπνευστε· ὅθεν σε πάντες μακαρίζομεν.
ltx/gr_gr_cog/me.m08.d20:meMA.Ode9C1T.incipit	Φθορὰν μὴ γνωρίσασα ἀνδρός, τὸν…
ltx/gr_gr_cog/me.m08.d20:meMA.Ode9C1T.melody	@ltx/gr_gr_cog/he.h.m4:heHE.EvaMenToTisParakois.name
ltx/gr_gr_cog/me.m08.d20:meMA.Ode9C1T.mode	@ltx/gr_gr_cog/miscellanea:misc.Mode4
ltx/gr_gr_cog/me.m08.d20:meMA.Ode9C1T.ode	@ltx/gr_gr_cog/miscellanea:misc.Ode9
ltx/gr_gr_cog/me.m08.d20:meMA.Ode9C1T.text	Φθορὰν μὴ γνωρίσασα ἀνδρός, τὸν ἄφθαρτον ἐν νηδύϊ ὑποδέδεξαι, Λόγον ἡμᾶς καταφθαρέντας, ῥυόμενον πολλοῖς παραπτώμασι, τῷ πάθει τῆς ἀφθάρτου σαρκὸς αὐτοῦ, ἄφθορε μόνη Παναμώμητε.
ltx/gr_gr_cog/me.m08.d20:meMA.Ode9H.greekmelody	@ltx/gr_gr_cog/he.h.m4:heHE.EvaMenToTisParakois.greekname
ltx/gr_gr_cog/me.m08.d20:meMA.Ode9H.incipit	@ltx/gr_gr_cog/he.h.m4:heHE.EvaMenToTisParakois.incipit
ltx/gr_gr_cog/me.m08.d20:meMA.Ode9H.melody	@ltx/gr_gr_cog/he.h.m4:heHE.EvaMenToTisParakois.melody
ltx/gr_gr_cog/me.m08.d20:meMA.Ode9H.mode	@ltx/gr_gr_cog/miscellanea:misc.Mode4
ltx/gr_gr_cog/me.m08.d20:meMA.Ode9H.ode	@ltx/gr_gr_cog/miscellanea:misc.Ode9
ltx/gr_gr_cog/me.m08.d20:meMA.Ode9H.text	@ltx/gr_gr_cog/he.h.m4:heHE.EvaMenToTisParakois.text
ltx/gr_gr_cog/me.m08.d20:meVE.Apolytikion1ger.greekmelody	@ltx/gr_gr_cog/he.a.m4:heAU.TachyProkatalave.greekname
ltx/gr_gr_cog/me.m08.d20:meVE.Apolytikion1ger.incipit	Ἐκ στείρας ἐβλάστησας, δικαιοσύνης καρπός…
ltx/gr_gr_cog/me.m08.d20:meVE.Apolytikion1ger.melody	@ltx/gr_gr_cog/he.a.m4:heAU.TachyProkatalave.name
ltx/gr_gr_cog/me.m08.d20:meVE.Apolytikion1ger.mode	@ltx/gr_gr_cog/miscellanea:misc.Mode4
ltx/gr_gr_cog/me.m08.d20:meVE.Apolytikion1ger.poet	@ltx/gr_gr_cog/poets:po.Gerasimou
ltx/gr_gr_cog/me.m08.d20:meVE.Apolytikion1ger.text	Ἐκ στείρας ἐβλάστησας, δικαιοσύνης καρπός, προφαίνων τὴν μέλλουσαν, εὐεργεσίαν ἡμῖν, Σαμουὴλ θεσπέσιε· ὅθεν ἱερατεύσας, παιδιόθεν Κυρίῳ, ἔχρισας ὡς Προφήτης, βασιλεῖς θείῳ μύρῳ. Καὶ νῦν τῶν σὲ εὐφημούντων, μάκαρ μνημόνευε.
ltx/gr_gr_cog/me.m08.d20:meVE.AposGlory.incipit	@ltx/gr_gr_cog/me.m08.d16:meMA.Aposticha3.incipit
ltx/gr_gr_cog/me.m08.d20:meVE.AposGlory.melody	@ltx/gr_gr_cog/he.a.m2:heAU.OikosTouEfratha.name
ltx/gr_gr_cog/me.m08.d20:meVE.AposGlory.mode	@ltx/gr_gr_cog/miscellanea:misc.Mode2
ltx/gr_gr_cog/me.m08.d20:meVE.AposGlory.text	@ltx/gr_gr_cog/me.m08.d16:meMA.Aposticha3.text
ltx/gr_gr_cog/me.m08.d20:meVE.Aposticha1.greekmelody	@ltx/gr_gr_cog/he.a.m2:heAU.OikosTouEfratha.greekname
ltx/gr_gr_cog/me.m08.d20:meVE.Aposticha1.incipit	@ltx/gr_gr_cog/me.m08.d16:meMA.Aposticha1.incipit
ltx/gr_gr_cog/me.m08.d20:meVE.Aposticha1.melody	@ltx/gr_gr_cog/he.a.m2:heAU.OikosTouEfratha.name
ltx/gr_gr_cog/me.m08.d20:meVE.Aposticha1.mode	@ltx/gr_gr_cog/miscellanea:misc.Mode2
ltx/gr_gr_cog/me.m08.d20:meVE.Aposticha1.text	@ltx/gr_gr_cog/me.m08.d16:meMA.Aposticha1.text
ltx/gr_gr_cog/me.m08.d20:meVE.Aposticha2.incipit	@ltx/gr_gr_cog/me.m08.d16:meMA.Aposticha2.incipit
ltx/gr_gr_cog/me.m08.d20:meVE.Aposticha2.melody	@ltx/gr_gr_cog/he.a.m2:heAU.OikosTouEfratha.name
ltx/gr_gr_cog/me.m08.d20:meVE.Aposticha2.mode	@ltx/gr_gr_cog/miscellanea:misc.Mode2
ltx/gr_gr_cog/me.m08.d20:meVE.Aposticha2.text	@ltx/gr_gr_cog/me.m08.d16:meMA.Aposticha2.text
ltx/gr_gr_cog/me.m08.d20:meVE.Aposticha3.incipit	Πύλαι τῶν οὐρανῶν, ἐπάρθητε ὁρῶσαι…
ltx/gr_gr_cog/me.m08.d20:meVE.Aposticha3.melody	@ltx/gr_gr_cog/he.a.m2:heAU.OikosTouEfratha.name
ltx/gr_gr_cog/me.m08.d20:meVE.Aposticha3.mode	@ltx/gr_gr_cog/miscellanea:misc.Mode2
ltx/gr_gr_cog/me.m08.d20:meVE.Aposticha3.text	Πύλαι τῶν οὐρανῶν, ἐπάρθητε ὁρῶσαι, τὴν πύλην τοῦ Ὑψίστου, χωροῦσαν μετὰ δόξης, πρὸς τὸν Υἱὸν καὶ Κύριον.
ltx/gr_gr_cog/me.m08.d20:meVE.SticGlory.incipit	@ltx/gr_gr_cog/me.m08.d15:meMA.LaudsGlory.incipit
ltx/gr_gr_cog/me.m08.d20:meVE.SticGlory.melody	
ltx/gr_gr_cog/me.m08.d20:meVE.SticGlory.mode	@ltx/gr_gr_cog/miscellanea:misc.Mode6
ltx/gr_gr_cog/me.m08.d20:meVE.SticGlory.text	@ltx/gr_gr_cog/me.m08.d15:meMA.LaudsGlory.text
ltx/gr_gr_cog/me.m08.d20:meVE.Stichera01.greekmelody	@ltx/gr_gr_cog/he.a.m5:heAU.ChairoisAskitikon.greekname
ltx/gr_gr_cog/me.m08.d20:meVE.Stichera01.incipit	Ὅτε ὁ διʼ ἡμᾶς καθ’…
ltx/gr_gr_cog/me.m08.d20:meVE.Stichera01.melody	@ltx/gr_gr_cog/he.a.m5:heAU.ChairoisAskitikon.name
ltx/gr_gr_cog/me.m08.d20:meVE.Stichera01.mode	@ltx/gr_gr_cog/miscellanea:misc.Mode5
ltx/gr_gr_cog/me.m08.d20:meVE.Stichera01.text	Ὅτε ὁ διʼ ἡμᾶς καθʼ ἡμᾶς, ἐκ τῶν πανάγνων σου αἱμάτων γενόμενος, ἐκ κόσμου σε μεταστῆσαι, καὶ πρὸς αὐτὸν ὡς ἁγνήν, προσλαβέσθαι ξένως ἐπευδόκησεν, αὐτοῦ ἀπεσύναξε, τοὺς ἰδίους κηδεῦσαί σε, διὰ νεφέλης, ὀπαδοὺς τούτου νεύματι, παραστήσας σοι, εἰς τιμὴν τῆς ἐξόδου σου, οἵτινες θεασάμενοι, τῆς χάριτος ἔμπλεοι, γεγενημένοι Παρθένε, σὲ ἱερῶς προσεκύνησαν, πιστῶς ἐκβοῶντες· Χαῖρε κόσμῳ ἡ τεκοῦσα τὸ μέγα ἔλεος.
ltx/gr_gr_cog/me.m08.d20:meVE.Stichera02.incipit	Πόθεν τὸ ἐπιγνῶναι ὑμᾶς, τὴν…
ltx/gr_gr_cog/me.m08.d20:meVE.Stichera02.melody	@ltx/gr_gr_cog/he.a.m5:heAU.ChairoisAskitikon.name
ltx/gr_gr_cog/me.m08.d20:meVE.Stichera02.mode	@ltx/gr_gr_cog/miscellanea:misc.Mode5
ltx/gr_gr_cog/me.m08.d20:meVE.Stichera02.text	Πόθεν τὸ ἐπιγνῶναι ὑμᾶς, τὴν ἐκ τοῦ σώματός μου ἔξοδον, ἔφησεν, ἡ πάναγνος Θεοτόκος, τοῖς ἱεροῖς Μαθηταῖς, τί τὸ ξένον τοῦτο, τέκνα θέαμα; οἱ δὲ Ἄφνω ἔφησαν, ἐν νεφέλαις ἐπήρθημεν, καὶ καθὼς βλέπεις, τῇ σκηνή σου ἐπέστημεν, προσκυνῆσαί σε, ὥσπερ θρόνον πυρίμορφον, βλέψαι τε σοῦ τὴν ἔνδοξον, καὶ θείαν Μετάστασιν, καὶ ταῖς παλάμαις κηδεῦσαι, τὸ θεοδόχον σου σκήνωμα, σκηνὴ Παναγία, διʼ ἧς εὔρατο ὁ κόσμος τὸ μέγα ἔλεος.
ltx/gr_gr_cog/me.m08.d20:meVE.Stichera03.incipit	Κλίνην περιεστῶτες τὴν σήν, οἱ…
ltx/gr_gr_cog/me.m08.d20:meVE.Stichera03.melody	@ltx/gr_gr_cog/he.a.m5:heAU.ChairoisAskitikon.name
ltx/gr_gr_cog/me.m08.d20:meVE.Stichera03.mode	@ltx/gr_gr_cog/miscellanea:misc.Mode5
ltx/gr_gr_cog/me.m08.d20:meVE.Stichera03.text	Κλίνην περιεστῶτες τὴν σήν, οἱ Μαθηταὶ τοῦ Λυτρωτοῦ, καὶ προπέμποντες, πρὸς τάφον φύσεως νόμῳ, σὲ Παναγία ἁγνή, ἐξοδίους ὕμνους προσεφώνουν σοι· Σεμνὴ χαῖρε, λέγοντες, τοῦ Θεοῦ τὸ παλάτιον, χαῖρε ἑτοίμη, τῶν ἀνθρώπων βοήθεια, χαῖρε ὄχημα, καθαρὸν τῆς Θεότητος. Ἄπιθι καὶ μετάβαινε, πρὸς ὄρη αἰώνια, σκήνωμα δόξης πρὸς θεῖα, νῦν κατασκήνου σκηνώματα, πιστοῖς αἰτουμένη, τὴν ἀνέκλειπτον εἰρήνην καὶ μέγα ἔλεος.
ltx/gr_gr_cog/me.m08.d20:meVE.Stichera04.greekmelody	@ltx/gr_gr_cog/he.a.m4:heAU.EdokasSimeiosin.greekname
ltx/gr_gr_cog/me.m08.d20:meVE.Stichera04.incipit	Δῶρον εὐαπόδεκτον, ἐκ μητρικῶν σε…
ltx/gr_gr_cog/me.m08.d20:meVE.Stichera04.melody	@ltx/gr_gr_cog/he.a.m4:heAU.EdokasSimeiosin.name
ltx/gr_gr_cog/me.m08.d20:meVE.Stichera04.mode	@ltx/gr_gr_cog/miscellanea:misc.Mode4
ltx/gr_gr_cog/me.m08.d20:meVE.Stichera04.text	Δῶρον εὐαπόδεκτον, ἐκ μητρικῶν σε ἀνέθετο, ἀγκαλῶν ἡ κυήσασα, εὐχῆς γονιμώτατον, Σαμουὴλ καρπόν σε, προσκληρωσαμένη, καὶ ἀποδοῦσα τῷ Θεῷ, τῷ εὐεργέτῃ καθάπερ ηὔξατο· διό σοι ἀνεπαύσατο, χάρις τοῦ Πνεύματος ἔνδοξε, ἀκακίᾳ συναύξοντι, καὶ φρονήσει ἐμπρέποντι.
ltx/gr_gr_cog/me.m08.d20:meVE.Stichera05.incipit	Χρῖσμα ἱερώτατον, ὡς ἱερεὺς περικείμενος…
ltx/gr_gr_cog/me.m08.d20:meVE.Stichera05.melody	@ltx/gr_gr_cog/he.a.m4:heAU.EdokasSimeiosin.name
ltx/gr_gr_cog/me.m08.d20:meVE.Stichera05.mode	@ltx/gr_gr_cog/miscellanea:misc.Mode4
ltx/gr_gr_cog/me.m08.d20:meVE.Stichera05.text	Χρῖσμα ἱερώτατον, ὡς ἱερεὺς περικείμενος, καὶ Προφήτης δεικνύμενος, προβλέπεις τὰ ἔμπροσθεν· καὶ προστάξει θείᾳ, χρίεις βασιλέας, καὶ τὰ ἐσόμενα δηλοῖς, κρίνων δικαίως Ἰσραηλίτην λαόν, ἀπαύστως παραβαίνοντα, καὶ τοῦ Θεοῦ μακρυνόμενον, Σαμουὴλ ἀξιάγαστε, θεοφόρε πανόλβιε.
ltx/gr_gr_cog/me.m08.d20:meVE.Stichera06.incipit	Νῦν οὐκ ἐν αἰνίγμασιν, οὐδὲ…
ltx/gr_gr_cog/me.m08.d20:meVE.Stichera06.melody	@ltx/gr_gr_cog/he.a.m4:heAU.EdokasSimeiosin.name
ltx/gr_gr_cog/me.m08.d20:meVE.Stichera06.mode	@ltx/gr_gr_cog/miscellanea:misc.Mode4
ltx/gr_gr_cog/me.m08.d20:meVE.Stichera06.text	Νῦν οὐκ ἐν αἰνίγμασιν, οὐδὲ σκιαῖς ὡς τὸ πρότερον, πρὸς δὲ πρόσωπον πρόσωπον, ὁρᾷς ὃ ἐπόθησας, τῆς σαρκὸς τὸν γνόφον, καὶ τὴν βαρύτητα, ὑπεξελθὼν καὶ οὐρανούς, περιπολεύων καὶ ἀγαλλόμενος, Προφῆτα πανσεβάσμιε, τῶν προφητῶν ἰσοστάσιε, τῶν δικαίων συνόμιλε, τῶν Ἀγγέλων συμμέτοχε.
