ltx/gr_gr_cog/le.ep.mc.d117:lemcLI.Epistle.book_abbr	@ltx/gr_gr_cog/bible:Acts.abbr
ltx/gr_gr_cog/le.ep.mc.d117:lemcLI.Epistle.book_string	@ltx/gr_gr_cog/bible:Acts.text
ltx/gr_gr_cog/le.ep.mc.d117:lemcLI.Epistle.chapverse	25:13 – 19
ltx/gr_gr_cog/le.ep.mc.d117:lemcLI.Epistle.incipit	Ἀγρίππας ὁ βασιλεὺς καὶ Βερνίκη…
ltx/gr_gr_cog/le.ep.mc.d117:lemcLI.Epistle.text	Ἐν ταῖς ἡμέραις ἐκείναις, Ἀγρίππας ὁ βασιλεὺς καὶ Βερνίκη κατήντησαν εἰς Καισάρειαν ἀσπασόμενοι τὸν Φῆστον. ὡς δὲ πλείους ἡμέρας διέτριβον ἐκεῖ, ὁ Φῆστος τῷ βασιλεῖ ἀνέθετο τὰ κατὰ τὸν Παῦλον λέγων· ἀνήρ τίς ἐστι καταλελειμμένος ὑπὸ Φήλικος δέσμιος, περὶ οὗ γενομένου μου εἰς Ἱεροσόλυμα ἐνεφάνισαν οἱ ἀρχιερεῖς καὶ οἱ πρεσβύτεροι τῶν Ἰουδαίων αἰτούμενοι κατ᾿ αὐτοῦ δίκην· πρὸς οὓς ἀπεκρίθην ὅτι οὐκ ἔστιν ἔθος Ῥωμαίοις χαρίζεσθαί τινα ἄνθρωπον εἰς ἀπώλειαν πρὶν ἢ ὁ κατηγορούμενος κατὰ πρόσωπον ἔχοι τοὺς κατηγόρους τόπον τε ἀπολογίας λάβοι περὶ τοῦ ἐγκλήματος. συνελθόντων οὖν αὐτῶν ἐνθάδε ἀναβολὴν μηδεμίαν ποιησάμενος τῇ ἑξῆς καθίσας ἐπὶ τοῦ βήματος ἐκέλευσα ἀχθῆναι τὸν ἄνδρα· περὶ οὗ σταθέντες οἱ κατήγοροι οὐδεμίαν αἰτίαν ἐπέφερον ὧν ὑπενόουν ἐγώ, ζητήματα δέ τινα περὶ τῆς ἰδίας δεισιδαιμονίας εἶχον πρὸς αὐτὸν καὶ περί τινος Ἰησοῦ τεθνηκότος, ὃν ἔφασκεν ὁ Παῦλος ζῆν.
ltx/gr_gr_cog/le.ep.mc.d117:lemcLI.Epistle.title	Τῇ Πέμτῃ τῆς Ζʹ Ἑβδομάδος
ltx/gr_gr_cog/le.ep.mc.d117:lemcLI.Epistle.title_abbr	Πέμτῃ τῆς Ζʹ Ἑβδομάδος
ltx/gr_gr_cog/le.ep.mc.d117:lemcLI.Epistle.version	@ltx/gr_gr_cog/properties:version.designation
