ltx/gr_gr_cog/me.m10.d12:meDA.commemoration.first	Μνήμη τῶν Ἁγίων Μαρτύρων Πρόβου, Ταράχου, καὶ Ἀνδρονίκου
ltx/gr_gr_cog/me.m10.d12:meDA.commemoration.first_name	
ltx/gr_gr_cog/me.m10.d12:meDA.commemoration.first_short	Μνήμη τῶν Ἁγίων Μαρτύρων Πρόβου, Ταράχου, καὶ Ἀνδρονίκου
ltx/gr_gr_cog/me.m10.d12:meDA.commemoration.first_title	@ltx/gr_gr_cog/titles:ti.Saints
ltx/gr_gr_cog/me.m10.d12:meDA.commemoration.full	Μνήμη τῶν Ἁγίων Μαρτύρων Πρόβου, Ταράχου, καὶ Ἀνδρονίκου
ltx/gr_gr_cog/me.m10.d12:meDA.commemoration.second_name	
ltx/gr_gr_cog/me.m10.d12:meDA.commemoration.second_title	
ltx/gr_gr_cog/me.m10.d12:meDA.date	Τῌ ΙΒʹ ΟΚΤΩΒΡΙΟΥ
ltx/gr_gr_cog/me.m10.d12:meDA.fordate	διὰ τὴν 12ην Ὀκτωβρίου
ltx/gr_gr_cog/me.m10.d12:meDA.insert1	καὶ τῶν ἁγίων Μαρτύρων Πρόβου, Ταράχου, καὶ Ἀνδρονίκου,
ltx/gr_gr_cog/me.m10.d12:meDA.insert2	ὧν καὶ τὴν μνήμην ἐπιτελοῦμεν·
ltx/gr_gr_cog/me.m10.d12:meDA.note	
ltx/gr_gr_cog/me.m10.d12:meDA.pdfcoverdate	τῆς 12ης Ὀκτωβρίου,
ltx/gr_gr_cog/me.m10.d12:meDA.pdfheaderdate	τῆς 12ης Ὀκτωβρίου
ltx/gr_gr_cog/me.m10.d12:meHO.commemorations	
ltx/gr_gr_cog/me.m10.d12:meHO.note1	
ltx/gr_gr_cog/me.m10.d12:meHO.note2	
ltx/gr_gr_cog/me.m10.d12:meHO.number	
ltx/gr_gr_cog/me.m10.d12:meHO.rank	
ltx/gr_gr_cog/me.m10.d12:meLE.commemoration1	Μνήμη τῶν Ἁγίων Μαρτύρων Πρόβου, Ταράχου, καὶ Ἀνδρονίκου.
ltx/gr_gr_cog/me.m10.d12:meLE.commemoration2	
ltx/gr_gr_cog/me.m10.d12:meLI.Kontakion1.greekmelody	@ltx/gr_gr_cog/me.m10.d12:meMA.Kontakion1.greekmelody
ltx/gr_gr_cog/me.m10.d12:meLI.Kontakion1.incipit	@ltx/gr_gr_cog/me.m10.d12:meMA.Kontakion1.incipit
ltx/gr_gr_cog/me.m10.d12:meLI.Kontakion1.melody	@ltx/gr_gr_cog/me.m10.d12:meMA.Kontakion1.melody
ltx/gr_gr_cog/me.m10.d12:meLI.Kontakion1.mode	@ltx/gr_gr_cog/me.m10.d12:meMA.Kontakion1.mode
ltx/gr_gr_cog/me.m10.d12:meLI.Kontakion1.text	@ltx/gr_gr_cog/me.m10.d12:meMA.Kontakion1.text
ltx/gr_gr_cog/me.m10.d12:meLI.Megalynarion.text	
ltx/gr_gr_cog/me.m10.d12:meMA.AposGlory.incipit	@ltx/gr_gr_cog/me.m10.d12:meVE.SticGlory.incipit
ltx/gr_gr_cog/me.m10.d12:meMA.AposGlory.melody	
ltx/gr_gr_cog/me.m10.d12:meMA.AposGlory.mode	@ltx/gr_gr_cog/miscellanea:misc.Mode4
ltx/gr_gr_cog/me.m10.d12:meMA.AposGlory.text	@ltx/gr_gr_cog/me.m10.d12:meVE.SticGlory.text
ltx/gr_gr_cog/me.m10.d12:meMA.AposStavrotheotokion.greekmelody	@ltx/gr_gr_cog/he.a.m4:heAU.EdokasSimeiosin.greekname
ltx/gr_gr_cog/me.m10.d12:meMA.AposStavrotheotokion.incipit	Ῥήγνυται χειρόγραφον, τὸ ἀπʼ αἰῶνος…
ltx/gr_gr_cog/me.m10.d12:meMA.AposStavrotheotokion.melody	@ltx/gr_gr_cog/he.a.m4:heAU.EdokasSimeiosin.name
ltx/gr_gr_cog/me.m10.d12:meMA.AposStavrotheotokion.mode	@ltx/gr_gr_cog/miscellanea:misc.Mode4
ltx/gr_gr_cog/me.m10.d12:meMA.AposStavrotheotokion.text	Ῥήγνυται χειρόγραφον, τὸ ἀπʼ αἰῶνος νυγείσης σου, τῆς πλευρᾶς Πολυέλεε, Ἀδὰμ τοῦ προπάτορος, καὶ ἡ ἀπωσμένη, φύσις τῶν ἀνθρώπων, ῥανίσιν αἵματος τοῦ σοῦ, καθαγιάζεται ἀνακραζουσα· Δόξα τῇ εὐσπλαγχνίᾳ σου, δόξα τῇ θείᾳ σταυρώσει σου, Ἰησοῦ παντοδύναμε, ὁ Σωτὴρ τῶν ψυχῶν ἡμῶν.
ltx/gr_gr_cog/me.m10.d12:meMA.AposTheotokion.greekmelody	@ltx/gr_gr_cog/he.a.m4:heAU.EdokasSimeiosin.greekname
ltx/gr_gr_cog/me.m10.d12:meMA.AposTheotokion.incipit	Τὸ χαῦνον καὶ ἔκλυτον, Παρθενομῆτορ…
ltx/gr_gr_cog/me.m10.d12:meMA.AposTheotokion.melody	@ltx/gr_gr_cog/he.a.m4:heAU.EdokasSimeiosin.name
ltx/gr_gr_cog/me.m10.d12:meMA.AposTheotokion.mode	@ltx/gr_gr_cog/miscellanea:misc.Mode4
ltx/gr_gr_cog/me.m10.d12:meMA.AposTheotokion.text	Τὸ χαῦνον καὶ ἔκλυτον, Παρθενομῆτορ μετάβαλε, τῆς ψυχῆς μου πανάμωμε, εἰς ῥῶσιν καὶ δύναμιν, τοῦ φόβῳ καὶ πόθῳ, ποιεῖν τε καὶ πράττειν, τὰ δικαιωματα Χριστοῦ, ὅπως ἐκφύγω τὸ πῦρ τὸ ἄστεκτον, καὶ κλῆρον τὸν οὐράνιον, καὶ τὴν ζωὴν τὴν ἀπέραντον, διὰ σοῦ ἀπολάβοιμι, εὐφραινόμενος πάντοτε.
ltx/gr_gr_cog/me.m10.d12:meMA.C1.acrostic.notice1	οὗ ἡ Ἀκροστιχίς·
ltx/gr_gr_cog/me.m10.d12:meMA.C1.acrostic.text	Μέλψοιμι τῶν σῶν Μαρτύρων Σῶτερ κλέος. Ἰωσήφ.
ltx/gr_gr_cog/me.m10.d12:meMA.C1.acrostic.title	Κανὼν τῶν Ἁγίων,
ltx/gr_gr_cog/me.m10.d12:meMA.C1.title	@ltx/gr_gr_cog/titles:ti.CanonMartyrs
ltx/gr_gr_cog/me.m10.d12:meMA.C1.verse	@ltx/gr_gr_cog/prayers:pr.verse_SaintsM.text
ltx/gr_gr_cog/me.m10.d12:meMA.ExapTheotokion.incipit	Ἁμαρτιῶν πελάγει με, καὶ παθῶν…
ltx/gr_gr_cog/me.m10.d12:meMA.ExapTheotokion.melody	@ltx/gr_gr_cog/he.a.m2:heAU.ToisMathitaisSynelthomen.name
ltx/gr_gr_cog/me.m10.d12:meMA.ExapTheotokion.mode	@ltx/gr_gr_cog/miscellanea:misc.Mode2
ltx/gr_gr_cog/me.m10.d12:meMA.ExapTheotokion.text	Ἁμαρτιῶν πελάγει με, καὶ παθῶν ἐν τῇ ζάλῃ, διηνεκῶς ποντούμενον, πρόφθασον Θεοτόκε, τῇ παναλκεῖ σου δυνάμει, καὶ διάσωσον τάχος, καὶ πρὸς λιμένα ἴθυνον, μετανοίας με ὅπως, δοξολογῶ, σὸν Υἱὸν ὃν ἔτεκες ἀποῤῥήτως, καὶ σὲ τὴν Θεομήτορα, εὐλαβῶς μεγαλύνω.
ltx/gr_gr_cog/me.m10.d12:meMA.Exaposteilarion1.greekmelody	@ltx/gr_gr_cog/he.a.m2:heAU.ToisMathitaisSynelthomen.greekname
ltx/gr_gr_cog/me.m10.d12:meMA.Exaposteilarion1.incipit	Πολυειδεῖς οἱ Μάρτυρες, αἰκισμοὺς ἐνεγκόντες…
ltx/gr_gr_cog/me.m10.d12:meMA.Exaposteilarion1.melody	@ltx/gr_gr_cog/he.a.m2:heAU.ToisMathitaisSynelthomen.name
ltx/gr_gr_cog/me.m10.d12:meMA.Exaposteilarion1.mode	@ltx/gr_gr_cog/miscellanea:misc.Mode2
ltx/gr_gr_cog/me.m10.d12:meMA.Exaposteilarion1.text	Πολυειδεῖς οἱ Μάρτυρες, αἰκισμοὺς ἐνεγκόντες, πολλῶν ἐπάθλων ἔτυχον, καὶ βραβείων τῆς νίκης, παρὰ Χριστοῦ τοῦ Σωτῆρος, Τάραχος ὁ θεόφρων καὶ Πρόβος καὶ Ἀνδρόνικος, οἱ στεῤῥοί, Ἀθλοφόροι, ὧν τὴν σεπτήν, ἐκτελοῦντες μνήμην, τούτους τιμῶμεν, ὑπὲρ ἡμῶν πρεσβεύοντας, τοῦ ῥυσθῆναι πταισμάτων.
ltx/gr_gr_cog/me.m10.d12:meMA.Kontakion1.greekmelody	@ltx/gr_gr_cog/he.a.m2:heAU.TaAnoZiton.greekname
ltx/gr_gr_cog/me.m10.d12:meMA.Kontakion1.incipit	Τριάδος ἡμῖν, τὴν δόξαν ἐμφανίσαντες…
ltx/gr_gr_cog/me.m10.d12:meMA.Kontakion1.melody	@ltx/gr_gr_cog/he.a.m2:heAU.TaAnoZiton.name
ltx/gr_gr_cog/me.m10.d12:meMA.Kontakion1.mode	@ltx/gr_gr_cog/miscellanea:misc.Mode2
ltx/gr_gr_cog/me.m10.d12:meMA.Kontakion1.text	Τριάδος ἡμῖν, τὴν δόξαν ἐμφανίσαντες, γενναῖοι Χριστοῦ, ὁπλῖται θεῖοι Μάρτυρες, σὺν Ταράχῳ Πρόβος τε καὶ Ἀνδρονικος, ἤλεγξαν ἅπασαν, τῶν τυράννων ἀθεότητα, τῇ πίστει γενναίως ἐναθλήσαντες.
ltx/gr_gr_cog/me.m10.d12:meMA.Ode1C11.greekmelody	@ltx/gr_gr_cog/he.h.m8:heHE.ArmatilatinFarao.greekname
ltx/gr_gr_cog/me.m10.d12:meMA.Ode1C11.incipit	Μαρτυρικαῖς ἠγλαϊσμένοι χάρισι, τῷ στεφοδότῃ…
ltx/gr_gr_cog/me.m10.d12:meMA.Ode1C11.melody	@ltx/gr_gr_cog/he.h.m8:heHE.ArmatilatinFarao.name
ltx/gr_gr_cog/me.m10.d12:meMA.Ode1C11.mode	@ltx/gr_gr_cog/miscellanea:misc.Mode8
ltx/gr_gr_cog/me.m10.d12:meMA.Ode1C11.ode	@ltx/gr_gr_cog/miscellanea:misc.Ode1
ltx/gr_gr_cog/me.m10.d12:meMA.Ode1C11.text	Μαρτυρικαῖς ἠγλαϊσμένοι χάρισι, τῷ στεφοδότῃ Χριστῷ, ἐν οὐρανοῖς πόθῳ, Μάρτυρες παρίστασθε, φωτὶ καταυγαζόμενοι, τρισηλίου λαμπάδος, καὶ πάντας καταφωτίζετε, πίστει τοὺς ὑμᾶς μακαρίζοντας.
ltx/gr_gr_cog/me.m10.d12:meMA.Ode1C12.incipit	Ἐν διωγμῷ τῆς εὐσεβείας ὤφθητε…
ltx/gr_gr_cog/me.m10.d12:meMA.Ode1C12.melody	@ltx/gr_gr_cog/he.h.m8:heHE.ArmatilatinFarao.name
ltx/gr_gr_cog/me.m10.d12:meMA.Ode1C12.mode	@ltx/gr_gr_cog/miscellanea:misc.Mode8
ltx/gr_gr_cog/me.m10.d12:meMA.Ode1C12.ode	@ltx/gr_gr_cog/miscellanea:misc.Ode1
ltx/gr_gr_cog/me.m10.d12:meMA.Ode1C12.text	Ἐν διωγμῷ τῆς εὐσεβείας ὤφθητε, πᾶσαν διώκοντες, τὴν δυσσεβῆ πλάνην, Μάρτυρες ἀήττητοι, γενναίοις ἀγωνίσμασιν, ὡς καλοὶ στρατιῶται, ὡς Ἐκκλησίας ἐρείσματα, καὶ τῆς ἀληθείας κραταίωμα.
ltx/gr_gr_cog/me.m10.d12:meMA.Ode1C13.incipit	Λελογισμένῃ διανοίᾳ Πάνσοφοι, ἀποκρουσάμενοι, τὴν…
ltx/gr_gr_cog/me.m10.d12:meMA.Ode1C13.melody	@ltx/gr_gr_cog/he.h.m8:heHE.ArmatilatinFarao.name
ltx/gr_gr_cog/me.m10.d12:meMA.Ode1C13.mode	@ltx/gr_gr_cog/miscellanea:misc.Mode8
ltx/gr_gr_cog/me.m10.d12:meMA.Ode1C13.ode	@ltx/gr_gr_cog/miscellanea:misc.Ode1
ltx/gr_gr_cog/me.m10.d12:meMA.Ode1C13.text	Λελογισμένῃ διανοίᾳ Πάνσοφοι, ἀποκρουσάμενοι, τὴν πονηρὰν ζάλην, καὶ τὴν ἀγριαίνουσαν, τῆς ἀσεβείας θάλασσαν, ταῖς τοῦ Πνεύματος αὔραις, πρὸς τοὺς λιμένας ἐφθάσατε, τοὺς ἐπουρανίους γηθόμενοι.
ltx/gr_gr_cog/me.m10.d12:meMA.Ode1C14.incipit	Ψυχαῖς Μαρτύρων τὰ ὑμῶν συγχαίρουσι…
ltx/gr_gr_cog/me.m10.d12:meMA.Ode1C14.melody	@ltx/gr_gr_cog/he.h.m8:heHE.ArmatilatinFarao.name
ltx/gr_gr_cog/me.m10.d12:meMA.Ode1C14.mode	@ltx/gr_gr_cog/miscellanea:misc.Mode8
ltx/gr_gr_cog/me.m10.d12:meMA.Ode1C14.ode	@ltx/gr_gr_cog/miscellanea:misc.Ode1
ltx/gr_gr_cog/me.m10.d12:meMA.Ode1C14.text	Ψυχαῖς Μαρτύρων τὰ ὑμῶν συγχαίρουσι, Μάρτυρες πνεύματα, ἐν οὐρανοῖς ὄντως, Πρόβε καὶ Ἀνδρόνικε, καὶ Τάραχε μακάριε· ἀνδρικῶς γὰρ τοὺς πόνους, τῆς μαρτυρίας ἠνύσατε, νίκαις θεϊκαῖς κλεϊζόμενοι.
ltx/gr_gr_cog/me.m10.d12:meMA.Ode1C1T.incipit	Ὁ τῷ Πατρὶ καὶ τῷ…
ltx/gr_gr_cog/me.m10.d12:meMA.Ode1C1T.melody	@ltx/gr_gr_cog/he.h.m8:heHE.ArmatilatinFarao.name
ltx/gr_gr_cog/me.m10.d12:meMA.Ode1C1T.mode	@ltx/gr_gr_cog/miscellanea:misc.Mode8
ltx/gr_gr_cog/me.m10.d12:meMA.Ode1C1T.ode	@ltx/gr_gr_cog/miscellanea:misc.Ode1
ltx/gr_gr_cog/me.m10.d12:meMA.Ode1C1T.text	Ὁ τῷ Πατρὶ καὶ τῷ Ἁγίῳ Πνεύματι, Λόγος συνάναρχος, Παρθενικὴν μήτραν, βουληθεὶς κατῴκησε, καὶ σάρξ ἀτρέπτως γέγονε· καὶ παθῶν ἑκουσίως, Μαρτύρων θεῖα στρατεύματα, πίστει ἐναθλεῖν παρεσκεύασεν.
ltx/gr_gr_cog/me.m10.d12:meMA.Ode3C11.greekmelody	@ltx/gr_gr_cog/he.h.m8:heHE.OuraniasApsidos.greekname
ltx/gr_gr_cog/me.m10.d12:meMA.Ode3C11.incipit	Ἰσχυρῶς τῷ διώκτῃ, ἀντιταχθεὶς Τάραχε…
ltx/gr_gr_cog/me.m10.d12:meMA.Ode3C11.melody	@ltx/gr_gr_cog/he.h.m8:heHE.OuraniasApsidos.name
ltx/gr_gr_cog/me.m10.d12:meMA.Ode3C11.mode	@ltx/gr_gr_cog/miscellanea:misc.Mode8
ltx/gr_gr_cog/me.m10.d12:meMA.Ode3C11.ode	@ltx/gr_gr_cog/miscellanea:misc.Ode3
ltx/gr_gr_cog/me.m10.d12:meMA.Ode3C11.text	Ἰσχυρῶς τῷ διώκτῃ, ἀντιταχθεὶς Τάραχε, καὶ τὴν συντριβὴν τοῦ προσώπου, φέρων στεῤῥότατα, μύλας συνέθλασας, τῶν νοουμένων λεόντων, ἀριστεὺς γενόμενος, σθένει τοῦ Πνεύματος.
ltx/gr_gr_cog/me.m10.d12:meMA.Ode3C12.incipit	Μεγαλόφρονι γνώμῃ, τοὺς αἰκισμοὺς ἤνεγκας…
ltx/gr_gr_cog/me.m10.d12:meMA.Ode3C12.melody	@ltx/gr_gr_cog/he.h.m8:heHE.OuraniasApsidos.name
ltx/gr_gr_cog/me.m10.d12:meMA.Ode3C12.mode	@ltx/gr_gr_cog/miscellanea:misc.Mode8
ltx/gr_gr_cog/me.m10.d12:meMA.Ode3C12.ode	@ltx/gr_gr_cog/miscellanea:misc.Ode3
ltx/gr_gr_cog/me.m10.d12:meMA.Ode3C12.text	Μεγαλόφρονι γνώμῃ, τοὺς αἰκισμοὺς ἤνεγκας, νώτου καὶ γαστρὸς Μάρτυς Πρόβε, διατεινόμενος, καὶ συμφλεγόμενος, τοῖς ὀβελίσκοις τὰ στέρνα, καὶ τὸ θεολόγον σου, στόμα τυπτόμενος.
ltx/gr_gr_cog/me.m10.d12:meMA.Ode3C13.incipit	Ἱερεῖον καθάπερ, ἀναρτηθεὶς ἔφερες, πόνους…
ltx/gr_gr_cog/me.m10.d12:meMA.Ode3C13.melody	@ltx/gr_gr_cog/he.h.m8:heHE.OuraniasApsidos.name
ltx/gr_gr_cog/me.m10.d12:meMA.Ode3C13.mode	@ltx/gr_gr_cog/miscellanea:misc.Mode8
ltx/gr_gr_cog/me.m10.d12:meMA.Ode3C13.ode	@ltx/gr_gr_cog/miscellanea:misc.Ode3
ltx/gr_gr_cog/me.m10.d12:meMA.Ode3C13.text	Ἱερεῖον καθάπερ, ἀναρτηθεὶς ἔφερες, πόνους δριμυτάτων μαστίγων, Μάρτυς Ἀνδρόνικε, πυρὸς κατάφλεξιν, ἐκρίζωσιν τῶν ὀδόντων, καὶ τῆς θεολόγου σου, γλώσσης ἀφαίρεσιν.
ltx/gr_gr_cog/me.m10.d12:meMA.Ode3C14.incipit	Τριφεγγεῖς ἀστέρες, ταῖς νοηταῖς λάμψεσιν…
ltx/gr_gr_cog/me.m10.d12:meMA.Ode3C14.melody	@ltx/gr_gr_cog/he.h.m8:heHE.OuraniasApsidos.name
ltx/gr_gr_cog/me.m10.d12:meMA.Ode3C14.mode	@ltx/gr_gr_cog/miscellanea:misc.Mode8
ltx/gr_gr_cog/me.m10.d12:meMA.Ode3C14.ode	@ltx/gr_gr_cog/miscellanea:misc.Ode3
ltx/gr_gr_cog/me.m10.d12:meMA.Ode3C14.text	Τριφεγγεῖς ἀστέρες, ταῖς νοηταῖς λάμψεσιν, ἅπασαν ἐν δόξῃ τὴν κτίσιν, καταφωτίζετε, σκότος διώκοντες, τῆς πολυθέου ἀπάτης, ἀθλοφόροι Μάρτυρες, θεοειδέστατοι.
ltx/gr_gr_cog/me.m10.d12:meMA.Ode3C1T.incipit	Ὡς καλὴν ὡς ὡραίαν, ὡς…
ltx/gr_gr_cog/me.m10.d12:meMA.Ode3C1T.melody	@ltx/gr_gr_cog/he.h.m8:heHE.OuraniasApsidos.name
ltx/gr_gr_cog/me.m10.d12:meMA.Ode3C1T.mode	@ltx/gr_gr_cog/miscellanea:misc.Mode8
ltx/gr_gr_cog/me.m10.d12:meMA.Ode3C1T.ode	@ltx/gr_gr_cog/miscellanea:misc.Ode3
ltx/gr_gr_cog/me.m10.d12:meMA.Ode3C1T.text	Ὡς καλὴν ὡς ὡραίαν, ὡς ἐκλεκτὴν ἄχραντε, Λόγος ὁ τὸ πᾶν οὐσιώσας, σὲ ἐκλεξάμενος, σοῦ τὴν ἀμόλυντον, καὶ θεοδόχον γαστέρα, βουληθεὶς κατῴκησεν ὁ ὑπερούσιος.
ltx/gr_gr_cog/me.m10.d12:meMA.Ode3H.greekmelody	@ltx/gr_gr_cog/he.h.m8:heHE.OuraniasApsidos.greekname
ltx/gr_gr_cog/me.m10.d12:meMA.Ode3H.incipit	@ltx/gr_gr_cog/he.h.m8:heHE.OuraniasApsidos.incipit
ltx/gr_gr_cog/me.m10.d12:meMA.Ode3H.melody	@ltx/gr_gr_cog/he.h.m8:heHE.OuraniasApsidos.melody
ltx/gr_gr_cog/me.m10.d12:meMA.Ode3H.mode	@ltx/gr_gr_cog/miscellanea:misc.Mode8
ltx/gr_gr_cog/me.m10.d12:meMA.Ode3H.ode	@ltx/gr_gr_cog/miscellanea:misc.Ode3
ltx/gr_gr_cog/me.m10.d12:meMA.Ode3H.text	@ltx/gr_gr_cog/he.h.m8:heHE.OuraniasApsidos.text
ltx/gr_gr_cog/me.m10.d12:meMA.Ode3Kathisma1.greekmelody	@ltx/gr_gr_cog/he.a.m8:heAU.TinSofianKaiLogon.greekname
ltx/gr_gr_cog/me.m10.d12:meMA.Ode3Kathisma1.incipit	Τῆς Ἁγίας Τριάδος τὴν κραταιάν…
ltx/gr_gr_cog/me.m10.d12:meMA.Ode3Kathisma1.melody	@ltx/gr_gr_cog/he.a.m8:heAU.TinSofianKaiLogon.name
ltx/gr_gr_cog/me.m10.d12:meMA.Ode3Kathisma1.mode	@ltx/gr_gr_cog/miscellanea:misc.Mode8
ltx/gr_gr_cog/me.m10.d12:meMA.Ode3Kathisma1.text	Τῆς Ἁγίας Τριάδος τὴν κραταιάν, ὁπλισάμενοι πίστιν νεανικῶς, Ἀνδρόνικος, Πρόβος τε, καὶ ὁ πάνσοφος Τάραχος, τῆς πολυθέου πλάνης, τὸ κράτος διέλυσαν, καὶ λαοὺς πρὸς θείαν, ἀγάπην συνέδησαν· ὅθεν τὰ τῆς νίκης, κομισάμενοι γέρα, χοροῖς συνευφραίνονται, ἀσωμάτων Δυνάμεων, οἷς ἐν πίστει βοήσωμεν· Πρεσβεύσατε Χριστῷ τῷ Θεῷ, τῶν πταισμάτων ἄφεσιν δωρήσασθαι, τοῖς ἑορτάζουσι πόθῳ, τὴν ἁγίαν μνήμην ὑμῶν.
ltx/gr_gr_cog/me.m10.d12:meMA.Ode3KathismaSt.incipit	Ἐν τῷ ξύλῳ ὁρῶσα τῷ…
ltx/gr_gr_cog/me.m10.d12:meMA.Ode3KathismaSt.melody	@ltx/gr_gr_cog/he.a.m8:heAU.TinSofianKaiLogon.name
ltx/gr_gr_cog/me.m10.d12:meMA.Ode3KathismaSt.mode	@ltx/gr_gr_cog/miscellanea:misc.Mode8
ltx/gr_gr_cog/me.m10.d12:meMA.Ode3KathismaSt.text	Ἐν τῷ ξύλῳ ὁρῶσα τῷ σταυρικῷ, ἡ πανάμωμος Μήτηρ τὸν Λυτρωτήν, ἐθρήνει δακρύουσα, καὶ πικρῶς ἀπεφθέγγετο, καὶ συνοχῇ καρδίας, τὰς κόμας ἐσπάραττε, καὶ πρὸς αὐτὸν ἐβόα· Υἱέ μου καὶ Κύριε, πῶς σε τῶν Ἑβραίων, ἀνομώτατος δῆμος, ἀδίκως προσπήγνυσι, τῷ σταυρῷ Ἀναμάρτητε; πῶς καὶ θέλων ὑφίστασαι, ὄξος καὶ τὴν τρῆσιν πλευρᾶς, χολήν τε, οἴμοι! καὶ ἥλους μακρόθυμε; ἀλλὰ δόξα σου Σῶτερ, τοῖς θείοις παθήμασι.
ltx/gr_gr_cog/me.m10.d12:meMA.Ode3KathismaT.incipit	Τοῦ Ἡλίου νεφέλη τοῦ νοητοῦ…
ltx/gr_gr_cog/me.m10.d12:meMA.Ode3KathismaT.melody	@ltx/gr_gr_cog/he.a.m8:heAU.TinSofianKaiLogon.name
ltx/gr_gr_cog/me.m10.d12:meMA.Ode3KathismaT.mode	@ltx/gr_gr_cog/miscellanea:misc.Mode8
ltx/gr_gr_cog/me.m10.d12:meMA.Ode3KathismaT.text	Τοῦ Ἡλίου νεφέλη τοῦ νοητοῦ, θείου φέγγους λυχνία χρυσοφαής, ἄσπιλε ἀμόλυντε, παναμώμητε Δέσποινα, τὴν σκοτεινὴν ψυχήν μου, τυφλώττουσαν πάθεσι, τῆς ἀπαθείας αἴγλῃ, καταύγασον δέομαι, καὶ μεμολυσμένην, τὴν καρδίαν μου πλῦνον, ῥοαῖς κατανύξεως, μετανοίας τε δάκρυσι, καὶ τοῦ ῥύπου με κάθαρον, πρεσβεύουσα Χριστῷ τῷ Θεῷ, τῶν πταισμάτων δοῦναί μοι τὴν ἄφεσιν, τῷ εὐσεβῶς προσκυνοῦντι, τὸν πανάγιον τόκον σου.
ltx/gr_gr_cog/me.m10.d12:meMA.Ode4C11.greekmelody	@ltx/gr_gr_cog/he.h.m8:heHE.SyMouIschys.greekname
ltx/gr_gr_cog/me.m10.d12:meMA.Ode4C11.incipit	Νόμον τὸν σόν, Λόγε τηροῦντες…
ltx/gr_gr_cog/me.m10.d12:meMA.Ode4C11.melody	@ltx/gr_gr_cog/he.h.m8:heHE.SyMouIschys.name
ltx/gr_gr_cog/me.m10.d12:meMA.Ode4C11.mode	@ltx/gr_gr_cog/miscellanea:misc.Mode8
ltx/gr_gr_cog/me.m10.d12:meMA.Ode4C11.ode	@ltx/gr_gr_cog/miscellanea:misc.Ode4
ltx/gr_gr_cog/me.m10.d12:meMA.Ode4C11.text	Νόμον τὸν σόν, Λόγε τηροῦντες οἱ Μάρτυρες, τῶν ἀνόμων νόμους ἑβδελύξαντο, τοὺς ἀθετεῖν σε τὸν Ποιητήν, ἐγκελευομένους, δαιμόνων ἐπιτηδεύμασι, καὶ πᾶσαν ὑποστάντες, τρικυμίαν βασάνων, οὐρανίου γαλήνης ἐπέτυχον.
ltx/gr_gr_cog/me.m10.d12:meMA.Ode4C12.incipit	Στέργων Χριστοῦ, φέρειν ζυγὸν ἐπαυχένιον…
ltx/gr_gr_cog/me.m10.d12:meMA.Ode4C12.melody	@ltx/gr_gr_cog/he.h.m8:heHE.SyMouIschys.name
ltx/gr_gr_cog/me.m10.d12:meMA.Ode4C12.mode	@ltx/gr_gr_cog/miscellanea:misc.Mode8
ltx/gr_gr_cog/me.m10.d12:meMA.Ode4C12.ode	@ltx/gr_gr_cog/miscellanea:misc.Ode4
ltx/gr_gr_cog/me.m10.d12:meMA.Ode4C12.text	Στέργων Χριστοῦ, φέρειν ζυγὸν ἐπαυχένιον, τὸν αὐχένα χαίρεις συντριβόμενος, τὸν δὲ Σταυρόν, ῥάβδον κραταιᾶς, Τάραχε παμμάκαρ, δυνάμεως ἐπαγόμενος, τῶν ῥάβδων τὰς νιφάδας, ὑποφέρεις κραυγάζων· τῇ δυνάμει σου δόξα Φιλάνθρωπε.
ltx/gr_gr_cog/me.m10.d12:meMA.Ode4C13.incipit	Ὡς δυνατός, θείῳ γενόμενος Πνεύματι…
ltx/gr_gr_cog/me.m10.d12:meMA.Ode4C13.melody	@ltx/gr_gr_cog/he.h.m8:heHE.SyMouIschys.name
ltx/gr_gr_cog/me.m10.d12:meMA.Ode4C13.mode	@ltx/gr_gr_cog/miscellanea:misc.Mode8
ltx/gr_gr_cog/me.m10.d12:meMA.Ode4C13.ode	@ltx/gr_gr_cog/miscellanea:misc.Ode4
ltx/gr_gr_cog/me.m10.d12:meMA.Ode4C13.text	Ὡς δυνατός, θείῳ γενόμενος Πνεύματι, τῶν κνημῶν σου, φέρεις τὴν ἐπώδυνον, καρτερικῶς, Πρόβε συντριβήν, καὶ τὴν τῶν ὀμμάτων, ἀφαίρεσιν φωτιζόμενος, τῇ γνώσει τῆς Τριάδος, τελεώτατον Μάρτυς, καὶ τοῖς ἄνω χοροῖς συναπτόμενος.
ltx/gr_gr_cog/me.m10.d12:meMA.Ode4C14.incipit	Νεανικῶς, Μάρτυς Ἀνδρόνικε ἵστασο, πρὸ…
ltx/gr_gr_cog/me.m10.d12:meMA.Ode4C14.melody	@ltx/gr_gr_cog/he.h.m8:heHE.SyMouIschys.name
ltx/gr_gr_cog/me.m10.d12:meMA.Ode4C14.mode	@ltx/gr_gr_cog/miscellanea:misc.Mode8
ltx/gr_gr_cog/me.m10.d12:meMA.Ode4C14.ode	@ltx/gr_gr_cog/miscellanea:misc.Ode4
ltx/gr_gr_cog/me.m10.d12:meMA.Ode4C14.text	Νεανικῶς, Μάρτυς Ἀνδρόνικε ἵστασο, πρὸ βημάτων, ἀνταγωνιζόμενος, τῷ δυσμενεῖ, λίαν καρτερῶς· ὅθεν κατατέμνων, τὰς κνήμας σου εὐτονώτερον, εἰργάζετό σε κάραν, τὴν αὐτοῦ συμπατοῦντα, καὶ πορείαν τὴν ἄνω στελλόμενον.
ltx/gr_gr_cog/me.m10.d12:meMA.Ode4C1T.incipit	Μόνη Θεόν, φέρεις ἐν μήτρᾳ…
ltx/gr_gr_cog/me.m10.d12:meMA.Ode4C1T.melody	@ltx/gr_gr_cog/he.h.m8:heHE.SyMouIschys.name
ltx/gr_gr_cog/me.m10.d12:meMA.Ode4C1T.mode	@ltx/gr_gr_cog/miscellanea:misc.Mode8
ltx/gr_gr_cog/me.m10.d12:meMA.Ode4C1T.ode	@ltx/gr_gr_cog/miscellanea:misc.Ode4
ltx/gr_gr_cog/me.m10.d12:meMA.Ode4C1T.text	Μόνη Θεόν, φέρεις ἐν μήτρᾳ σαρκούμενον, τὸν τὸ εἶναι, πᾶσι παρεχόμενον, ὃν ἐν σταδίῳ οἱ ἀκλινεῖς, καθομολογοῦντες, ἐνήθλησαν θεῖοι Μάρτυρες. Παρθένε Θεοτόκε, τῶν Ἀγγέλων τὸ θαῦμα, καὶ δαιμόνων τὸ τραῦμα πανύμνητε.
ltx/gr_gr_cog/me.m10.d12:meMA.Ode5C11.greekmelody	@ltx/gr_gr_cog/he.h.m8:heHE.InaTiMeAposo.greekname
ltx/gr_gr_cog/me.m10.d12:meMA.Ode5C11.incipit	Ἀκλινεῖς ὁδοιπόροι, τρίβου τῆς στενῆς…
ltx/gr_gr_cog/me.m10.d12:meMA.Ode5C11.melody	@ltx/gr_gr_cog/he.h.m8:heHE.InaTiMeAposo.name
ltx/gr_gr_cog/me.m10.d12:meMA.Ode5C11.mode	@ltx/gr_gr_cog/miscellanea:misc.Mode8
ltx/gr_gr_cog/me.m10.d12:meMA.Ode5C11.ode	@ltx/gr_gr_cog/miscellanea:misc.Ode5
ltx/gr_gr_cog/me.m10.d12:meMA.Ode5C11.text	Ἀκλινεῖς ὁδοιπόροι, τρίβου τῆς στενῆς καὶ τραχείας γεγόνατε, πειρασμῶν νιφάδας, ὡς ἀφροὺς θαλαττίους ὠθούμενοι, ἀῤῥαγεῖς ὡς πύργοι, ὡς ἐπὶ πέτραν τὴν καρδίαν, Ἀθλοφόροι ἑδράσαντες πίστεως.
ltx/gr_gr_cog/me.m10.d12:meMA.Ode5C12.incipit	Ῥητορεύων τὰ θεῖα, καὶ θεολογῶν…
ltx/gr_gr_cog/me.m10.d12:meMA.Ode5C12.melody	@ltx/gr_gr_cog/he.h.m8:heHE.InaTiMeAposo.name
ltx/gr_gr_cog/me.m10.d12:meMA.Ode5C12.mode	@ltx/gr_gr_cog/miscellanea:misc.Mode8
ltx/gr_gr_cog/me.m10.d12:meMA.Ode5C12.ode	@ltx/gr_gr_cog/miscellanea:misc.Ode5
ltx/gr_gr_cog/me.m10.d12:meMA.Ode5C12.text	Ῥητορεύων τὰ θεῖα, καὶ θεολογῶν τὰ σωτήρια δόγματα, τῶν χειλέων φέρεις, τὰ σπαράγματα γνώμης στεῤῥότητι, ἀποφράττων στόμα, κατὰ Θεοῦ Τάραχε μάκαρ, βλασφημίαν λαλοῦν τοῦ ποιήσαντος.
ltx/gr_gr_cog/me.m10.d12:meMA.Ode5C13.incipit	Τετραχῶς τεταμένος, καὶ ταῖς ἐκ…
ltx/gr_gr_cog/me.m10.d12:meMA.Ode5C13.melody	@ltx/gr_gr_cog/he.h.m8:heHE.InaTiMeAposo.name
ltx/gr_gr_cog/me.m10.d12:meMA.Ode5C13.mode	@ltx/gr_gr_cog/miscellanea:misc.Mode8
ltx/gr_gr_cog/me.m10.d12:meMA.Ode5C13.ode	@ltx/gr_gr_cog/miscellanea:misc.Ode5
ltx/gr_gr_cog/me.m10.d12:meMA.Ode5C13.text	Τετραχῶς τεταμένος, καὶ ταῖς ἐκ μαστίγων πληγαῖς συνεχόμενος, τῆς ψυχῆς ἐδήλου, τὸ γενναῖον ὁ Πρόβος ἀνάστημα, στεφηφόρος· ὅθεν, ἀναδειχθεὶς σὺν τοῖς συνάθλοις, Βασιλεῖ τῶν αἰώνων παρίσταται.
ltx/gr_gr_cog/me.m10.d12:meMA.Ode5C1T.incipit	Ὑπερτέρα τῶν ἄνω, πέφυκας Δυνάμεων…
ltx/gr_gr_cog/me.m10.d12:meMA.Ode5C1T.melody	@ltx/gr_gr_cog/he.h.m8:heHE.InaTiMeAposo.name
ltx/gr_gr_cog/me.m10.d12:meMA.Ode5C1T.mode	@ltx/gr_gr_cog/miscellanea:misc.Mode8
ltx/gr_gr_cog/me.m10.d12:meMA.Ode5C1T.ode	@ltx/gr_gr_cog/miscellanea:misc.Ode5
ltx/gr_gr_cog/me.m10.d12:meMA.Ode5C1T.text	Ὑπερτέρα τῶν ἄνω, πέφυκας Δυνάμεων, Λόγον κυήσασα, τοῦ Πατρὸς Παρθένε, τὸν συνάναρχον καὶ συναΐδιον, οὗ ταῖς φρυκτωρίαις, οἱ Ἀθληταὶ καταυγασθέντες, ἀθεΐας τὴν νύκτα παρέδραμον.
ltx/gr_gr_cog/me.m10.d12:meMA.Ode6C11.greekmelody	@ltx/gr_gr_cog/he.h.m8:heHE.IlasthitiMoiSotir.greekname
ltx/gr_gr_cog/me.m10.d12:meMA.Ode6C11.incipit	Ῥομφαία τοῦ δυνατοῦ, γενόμενοι διὰ…
ltx/gr_gr_cog/me.m10.d12:meMA.Ode6C11.melody	@ltx/gr_gr_cog/he.h.m8:heHE.IlasthitiMoiSotir.name
ltx/gr_gr_cog/me.m10.d12:meMA.Ode6C11.mode	@ltx/gr_gr_cog/miscellanea:misc.Mode8
ltx/gr_gr_cog/me.m10.d12:meMA.Ode6C11.ode	@ltx/gr_gr_cog/miscellanea:misc.Ode6
ltx/gr_gr_cog/me.m10.d12:meMA.Ode6C11.text	Ῥομφαία τοῦ δυνατοῦ, γενόμενοι διὰ πίστεως, καρδίας τῶν ἀσεβῶν, ἀνδρείως ἐτρώσατε, ἀνταγωνισάμενοι, κατʼ αὐτῶν γενναίως, Ἀθλοφόροι μεγαλώνυμοι.
ltx/gr_gr_cog/me.m10.d12:meMA.Ode6C12.incipit	Ὡς πάλαι τὸν Δανιήλ, ἐν…
ltx/gr_gr_cog/me.m10.d12:meMA.Ode6C12.melody	@ltx/gr_gr_cog/he.h.m8:heHE.IlasthitiMoiSotir.name
ltx/gr_gr_cog/me.m10.d12:meMA.Ode6C12.mode	@ltx/gr_gr_cog/miscellanea:misc.Mode8
ltx/gr_gr_cog/me.m10.d12:meMA.Ode6C12.ode	@ltx/gr_gr_cog/miscellanea:misc.Ode6
ltx/gr_gr_cog/me.m10.d12:meMA.Ode6C12.text	Ὡς πάλαι τὸν Δανιήλ, ἐν λάκκῳ θῆρες ἠδέσθησαν· οὕτω καὶ νῦν τοὺς στεῤῥούς, ὁπλίτας τῆς χάριτος, ἐν σταδίῳ ἔπτηξαν, κατευλαβηθέντες, τὰ σεπτὰ τούτων παθήματα.
ltx/gr_gr_cog/me.m10.d12:meMA.Ode6C13.incipit	Νυγεῖσάν σου τὴν πλευράν, ἐξεικονίζων…
ltx/gr_gr_cog/me.m10.d12:meMA.Ode6C13.melody	@ltx/gr_gr_cog/he.h.m8:heHE.IlasthitiMoiSotir.name
ltx/gr_gr_cog/me.m10.d12:meMA.Ode6C13.mode	@ltx/gr_gr_cog/miscellanea:misc.Mode8
ltx/gr_gr_cog/me.m10.d12:meMA.Ode6C13.ode	@ltx/gr_gr_cog/miscellanea:misc.Ode6
ltx/gr_gr_cog/me.m10.d12:meMA.Ode6C13.text	Νυγεῖσάν σου τὴν πλευράν, ἐξεικονίζων ὁ Τάραχος, εἰσδέχεται ταῖς πλευραῖς, κεντήματα Δέσποτα, καὶ ὄξος ποτίζεται, καὶ πυρὶ τὴν κάραν, ὠμοτάτως καταφλέγεται.
ltx/gr_gr_cog/me.m10.d12:meMA.Ode6C1T.incipit	Συνέλαβες ἐν γαστρί, τὸν προαιώνιον…
ltx/gr_gr_cog/me.m10.d12:meMA.Ode6C1T.melody	@ltx/gr_gr_cog/he.h.m8:heHE.IlasthitiMoiSotir.name
ltx/gr_gr_cog/me.m10.d12:meMA.Ode6C1T.mode	@ltx/gr_gr_cog/miscellanea:misc.Mode8
ltx/gr_gr_cog/me.m10.d12:meMA.Ode6C1T.ode	@ltx/gr_gr_cog/miscellanea:misc.Ode6
ltx/gr_gr_cog/me.m10.d12:meMA.Ode6C1T.text	Συνέλαβες ἐν γαστρί, τὸν προαιώνιον ἄχραντε, καὶ τέτοκας ἐν σαρκί, τὸν φύσει ἀπρόσιτον, καὶ γάλα ἐπότισας, τὸν τροφέα πάντων, Θεομῆτορ ἀπειρόγαμε.
ltx/gr_gr_cog/me.m10.d12:meMA.Ode6H.greekmelody	@ltx/gr_gr_cog/he.h.m8:heHE.IlasthitiMoiSotir.greekname
ltx/gr_gr_cog/me.m10.d12:meMA.Ode6H.incipit	@ltx/gr_gr_cog/he.h.m8:heHE.IlasthitiMoiSotir.incipit
ltx/gr_gr_cog/me.m10.d12:meMA.Ode6H.melody	@ltx/gr_gr_cog/he.h.m8:heHE.IlasthitiMoiSotir.melody
ltx/gr_gr_cog/me.m10.d12:meMA.Ode6H.mode	@ltx/gr_gr_cog/miscellanea:misc.Mode8
ltx/gr_gr_cog/me.m10.d12:meMA.Ode6H.ode	@ltx/gr_gr_cog/miscellanea:misc.Ode6
ltx/gr_gr_cog/me.m10.d12:meMA.Ode6H.text	@ltx/gr_gr_cog/he.h.m8:heHE.IlasthitiMoiSotir.text
ltx/gr_gr_cog/me.m10.d12:meMA.Ode7C11.greekmelody	@ltx/gr_gr_cog/he.h.m8:heHE.TheouSynkatavasin.greekname
ltx/gr_gr_cog/me.m10.d12:meMA.Ode7C11.incipit	Ὠτίων ἀφαίρεσιν, ὑπέστης χαίρων Τάραχε…
ltx/gr_gr_cog/me.m10.d12:meMA.Ode7C11.melody	@ltx/gr_gr_cog/he.h.m8:heHE.TheouSynkatavasin.name
ltx/gr_gr_cog/me.m10.d12:meMA.Ode7C11.mode	@ltx/gr_gr_cog/miscellanea:misc.Mode8
ltx/gr_gr_cog/me.m10.d12:meMA.Ode7C11.ode	@ltx/gr_gr_cog/miscellanea:misc.Ode7
ltx/gr_gr_cog/me.m10.d12:meMA.Ode7C11.text	Ὠτίων ἀφαίρεσιν, ὑπέστης χαίρων Τάραχε ἔνδοξε, ὡς εὐήκοος δοῦλος, τοῦ κλίναντός σοι οὓς εὐμενέστατον, καὶ τὰς εὐχάς σου πληρώσαντος, κράζοντος· Εὐλογητὸς ὁ Θεός, ὁ τῶν Πατέρων ἡμῶν.
ltx/gr_gr_cog/me.m10.d12:meMA.Ode7C12.incipit	Τεινόμενοι Μάρτυρες, καὶ ταῖς βασάνοις…
ltx/gr_gr_cog/me.m10.d12:meMA.Ode7C12.melody	@ltx/gr_gr_cog/he.h.m8:heHE.TheouSynkatavasin.name
ltx/gr_gr_cog/me.m10.d12:meMA.Ode7C12.mode	@ltx/gr_gr_cog/miscellanea:misc.Mode8
ltx/gr_gr_cog/me.m10.d12:meMA.Ode7C12.ode	@ltx/gr_gr_cog/miscellanea:misc.Ode7
ltx/gr_gr_cog/me.m10.d12:meMA.Ode7C12.text	Τεινόμενοι Μάρτυρες, καὶ ταῖς βασάνοις καταικιζόμενοι, σταθηρᾷ διανοίᾳ, τοῖς παρανόμοις ἀντικατέστητε· καὶ νικηφόροι γενόμενοι ψάλλετε· Εὐλογητὸς ὁ Θεός, ὁ τῶν Πατέρων ἡμῶν.
ltx/gr_gr_cog/me.m10.d12:meMA.Ode7C13.incipit	Ἐπλήσθη τὸ πνεῦμά σου, ἐνθέου…
ltx/gr_gr_cog/me.m10.d12:meMA.Ode7C13.melody	@ltx/gr_gr_cog/he.h.m8:heHE.TheouSynkatavasin.name
ltx/gr_gr_cog/me.m10.d12:meMA.Ode7C13.mode	@ltx/gr_gr_cog/miscellanea:misc.Mode8
ltx/gr_gr_cog/me.m10.d12:meMA.Ode7C13.ode	@ltx/gr_gr_cog/miscellanea:misc.Ode7
ltx/gr_gr_cog/me.m10.d12:meMA.Ode7C13.text	Ἐπλήσθη τὸ πνεῦμά σου, ἐνθέου δρόσου καὶ ἀναψύξεως, ὁπηνίκα τὰς χεῖρας, πυρὶ καὶ κάραν καταφλεγόμενος, ὥσπερ οἱ Παῖδες ἐκραύγαζες Τάραχε· Εὐλογητὸς ὁ Θεός, ὁ τῶν Πατέρων ἡμῶν.
ltx/gr_gr_cog/me.m10.d12:meMA.Ode7C14.incipit	Ῥαντίσματι Ἅγιοι, σεπτῶν αἱμάτων πλάνης…
ltx/gr_gr_cog/me.m10.d12:meMA.Ode7C14.melody	@ltx/gr_gr_cog/he.h.m8:heHE.TheouSynkatavasin.name
ltx/gr_gr_cog/me.m10.d12:meMA.Ode7C14.mode	@ltx/gr_gr_cog/miscellanea:misc.Mode8
ltx/gr_gr_cog/me.m10.d12:meMA.Ode7C14.ode	@ltx/gr_gr_cog/miscellanea:misc.Ode7
ltx/gr_gr_cog/me.m10.d12:meMA.Ode7C14.text	Ῥαντίσματι Ἅγιοι, σεπτῶν αἱμάτων πλάνης τοὺς ἄνθρακας, κατασβέσαντες, δρόσον ἡμῖν ἐνθέου βλύζετε χάριτος, καὶ ἰαμάτων προχέετε νάματα, τοῖς εὐφημοῦσιν ὑμῶν, τὴν μνήμην πάντοτε.
ltx/gr_gr_cog/me.m10.d12:meMA.Ode7C1T.incipit	Κενοῦται ἐν μήτρᾳ σου, πατρῴων…
ltx/gr_gr_cog/me.m10.d12:meMA.Ode7C1T.melody	@ltx/gr_gr_cog/he.h.m8:heHE.TheouSynkatavasin.name
ltx/gr_gr_cog/me.m10.d12:meMA.Ode7C1T.mode	@ltx/gr_gr_cog/miscellanea:misc.Mode8
ltx/gr_gr_cog/me.m10.d12:meMA.Ode7C1T.ode	@ltx/gr_gr_cog/miscellanea:misc.Ode7
ltx/gr_gr_cog/me.m10.d12:meMA.Ode7C1T.text	Κενοῦται ἐν μήτρᾳ σου, πατρῴων κόλπων μὴ ἀφιστάμενος, ὁ πληρέστατος Λόγος, καὶ σάρξ ὁρᾶται, καὶ βρέφος τίκτεται, ᾧ μελῳδοῦμεν Παρθένε γηθόμενοι· Εὐλογητός ὁ Θεός, ὁ τῶν Πατέρων ἡμῶν.
ltx/gr_gr_cog/me.m10.d12:meMA.Ode8C11.greekmelody	@ltx/gr_gr_cog/he.h.m8:heHE.EptaplasiosKaminon.greekname
ltx/gr_gr_cog/me.m10.d12:meMA.Ode8C11.incipit	Λελαμπρυσμένοι στίγμασι, καὶ ὡραῖοι ἐν…
ltx/gr_gr_cog/me.m10.d12:meMA.Ode8C11.melody	@ltx/gr_gr_cog/he.h.m8:heHE.EptaplasiosKaminon.name
ltx/gr_gr_cog/me.m10.d12:meMA.Ode8C11.mode	@ltx/gr_gr_cog/miscellanea:misc.Mode8
ltx/gr_gr_cog/me.m10.d12:meMA.Ode8C11.ode	@ltx/gr_gr_cog/miscellanea:misc.Ode8
ltx/gr_gr_cog/me.m10.d12:meMA.Ode8C11.text	Λελαμπρυσμένοι στίγμασι, καὶ ὡραῖοι ἐν κάλλεσι, τῆς καλλοποιοῦ Μακάριοι ἀθλήσεως, Κυρίῳ παρίστασθε, στεφανηφόροι πάντοτε, αἴγλης τῆς ἐκεῖθεν, πεμπομένης πλουσίως, πληρούμενοι, καὶ πόθῳ, μελῳδοῦντες ἀπαύστως, λαὸς ὑπερυψοῦτε, Χριστὸν εἰς τοὺς αἰῶνας.
ltx/gr_gr_cog/me.m10.d12:meMA.Ode8C12.incipit	Ἐν ἑαυτῷ μαινόμενος, ὁ παράφορος…
ltx/gr_gr_cog/me.m10.d12:meMA.Ode8C12.melody	@ltx/gr_gr_cog/he.h.m8:heHE.EptaplasiosKaminon.name
ltx/gr_gr_cog/me.m10.d12:meMA.Ode8C12.mode	@ltx/gr_gr_cog/miscellanea:misc.Mode8
ltx/gr_gr_cog/me.m10.d12:meMA.Ode8C12.ode	@ltx/gr_gr_cog/miscellanea:misc.Ode8
ltx/gr_gr_cog/me.m10.d12:meMA.Ode8C12.text	Ἐν ἑαυτῷ μαινόμενος, ὁ παράφορος τύραννος, ὡς νενικημένος ταῖς ὑμῶν ἐνστάσεσι, τομῶς ἀποφαίνεται, θανατωθῆναι ξίφει ὑμᾶς· Τὸν Δημιουργὸν καὶ Λυτρωτὴν μελῳδοῦντας· οἱ Παῖδες εὐλογεῖτε, Ἱερεῖς ἀνυμνεῖτε, λαὸς ὑπερυψοῦτε, εἰς πάντας τοὺς αἰῶνας.
ltx/gr_gr_cog/me.m10.d12:meMA.Ode8C13.incipit	Οἱ τῆς Τριάδος πρόμαχοι, οἱ…
ltx/gr_gr_cog/me.m10.d12:meMA.Ode8C13.melody	@ltx/gr_gr_cog/he.h.m8:heHE.EptaplasiosKaminon.name
ltx/gr_gr_cog/me.m10.d12:meMA.Ode8C13.mode	@ltx/gr_gr_cog/miscellanea:misc.Mode8
ltx/gr_gr_cog/me.m10.d12:meMA.Ode8C13.ode	@ltx/gr_gr_cog/miscellanea:misc.Ode8
ltx/gr_gr_cog/me.m10.d12:meMA.Ode8C13.text	Οἱ τῆς Τριάδος πρόμαχοι, οἱ καλλίνικοι Μάρτυρες, οἱ τῆς ἀθεΐας τὸν κρυμὸν σκεδάσαντες, τῇ θέρμῃ τῆς πίστεως, τὰ τῶν πιστῶν προπύργια, ἄνθη τὰ τερπνὰ τοῦ νοητοῦ Παραδείσου, λιμένες τῶν ἐν ζάλῃ, οἱ ἀκλόνητοι στῦλοι, Ἀνδρόνικος καὶ Πρόβος,καὶ Τάραχος τιμάσθωσαν.
ltx/gr_gr_cog/me.m10.d12:meMA.Ode8C1T.incipit	Σὺν Ἀσωμάτων τάξεσι, σὺν Μαρτύρων…
ltx/gr_gr_cog/me.m10.d12:meMA.Ode8C1T.melody	@ltx/gr_gr_cog/he.h.m8:heHE.EptaplasiosKaminon.name
ltx/gr_gr_cog/me.m10.d12:meMA.Ode8C1T.mode	@ltx/gr_gr_cog/miscellanea:misc.Mode8
ltx/gr_gr_cog/me.m10.d12:meMA.Ode8C1T.ode	@ltx/gr_gr_cog/miscellanea:misc.Ode8
ltx/gr_gr_cog/me.m10.d12:meMA.Ode8C1T.text	Σὺν Ἀσωμάτων τάξεσι, σὺν Μαρτύρων στρατεύμασι, σὺν τοῖς Ἀποστόλοις, καὶ Προφήταις ἅπαντες, τὴν πάντων δεσπόζουσαν, τῶν ποιημάτων Δέσποιναν, ὡς τῶν Χερουβίμ, ἁγιωτέραν καὶ μόνην, Θεοῦ ἁγνὴν Μητέρα, εὐσεβῶς ἀνυμνοῦμεν, Χριστὸν ὑπερυψοῦντες, εἰς πάντας τοὺς αἰῶνας.
ltx/gr_gr_cog/me.m10.d12:meMA.Ode8H.greekmelody	@ltx/gr_gr_cog/he.h.m8:heHE.EptaplasiosKaminon.greekname
ltx/gr_gr_cog/me.m10.d12:meMA.Ode8H.incipit	@ltx/gr_gr_cog/he.h.m8:heHE.EptaplasiosKaminon.incipit
ltx/gr_gr_cog/me.m10.d12:meMA.Ode8H.melody	@ltx/gr_gr_cog/he.h.m8:heHE.EptaplasiosKaminon.melody
ltx/gr_gr_cog/me.m10.d12:meMA.Ode8H.mode	@ltx/gr_gr_cog/miscellanea:misc.Mode8
ltx/gr_gr_cog/me.m10.d12:meMA.Ode8H.ode	@ltx/gr_gr_cog/miscellanea:misc.Ode8
ltx/gr_gr_cog/me.m10.d12:meMA.Ode8H.text	@ltx/gr_gr_cog/he.h.m8:heHE.EptaplasiosKaminon.text
ltx/gr_gr_cog/me.m10.d12:meMA.Ode9C11.greekmelody	@ltx/gr_gr_cog/he.h.m8:heHE.EfrixePasaAkoi.greekname
ltx/gr_gr_cog/me.m10.d12:meMA.Ode9C11.incipit	Ἴσχυσαν σώματι φθαρτοῖς ἀφθαρσίαν τοῖς…
ltx/gr_gr_cog/me.m10.d12:meMA.Ode9C11.melody	@ltx/gr_gr_cog/he.h.m8:heHE.EfrixePasaAkoi.name
ltx/gr_gr_cog/me.m10.d12:meMA.Ode9C11.mode	@ltx/gr_gr_cog/miscellanea:misc.Mode8
ltx/gr_gr_cog/me.m10.d12:meMA.Ode9C11.ode	@ltx/gr_gr_cog/miscellanea:misc.Ode9
ltx/gr_gr_cog/me.m10.d12:meMA.Ode9C11.text	Ἴσχυσαν σώματι φθαρτοῖς ἀφθαρσίαν τοῖς ἀγῶσι προσκτήσασθαι, οἱ γενναιότατοι, καὶ τοῖς Ἀγγέλοις ἐξωμοιώθησαν, τὴν βασιλείαν τοῦ Θεοῦ, λαβόντες ἀσάλευτον, Πρόβος καὶ Τάραχος, καὶ Ἀνδρόνικος Χριστοῦ οἱ θεράποντες.
ltx/gr_gr_cog/me.m10.d12:meMA.Ode9C12.incipit	Ὤφθητε ἄνθρακες πυρί, τῷ ἀϋλῳ…
ltx/gr_gr_cog/me.m10.d12:meMA.Ode9C12.melody	@ltx/gr_gr_cog/he.h.m8:heHE.EfrixePasaAkoi.name
ltx/gr_gr_cog/me.m10.d12:meMA.Ode9C12.mode	@ltx/gr_gr_cog/miscellanea:misc.Mode8
ltx/gr_gr_cog/me.m10.d12:meMA.Ode9C12.ode	@ltx/gr_gr_cog/miscellanea:misc.Ode9
ltx/gr_gr_cog/me.m10.d12:meMA.Ode9C12.text	Ὤφθητε ἄνθρακες πυρί, τῷ ἀϋλῳ μυστικῶς ἀναπτόμενοι, καὶ κατεφλέξατε, ὑλώδη πλάνην Μεγαλομάρτυρες, καὶ ἀναλάμψαντες ὡς φῶς, τὴν κτίσιν αὐγάζετε, καὶ περισώζετε, ἐκ κινδύνων καὶ παθῶν τὰς ψυχὰς ἡμῶν.
ltx/gr_gr_cog/me.m10.d12:meMA.Ode9C13.incipit	Σήμερον ἄγει ἑορτήν, ἐτησίαν καὶ…
ltx/gr_gr_cog/me.m10.d12:meMA.Ode9C13.melody	@ltx/gr_gr_cog/he.h.m8:heHE.EfrixePasaAkoi.name
ltx/gr_gr_cog/me.m10.d12:meMA.Ode9C13.mode	@ltx/gr_gr_cog/miscellanea:misc.Mode8
ltx/gr_gr_cog/me.m10.d12:meMA.Ode9C13.ode	@ltx/gr_gr_cog/miscellanea:misc.Ode9
ltx/gr_gr_cog/me.m10.d12:meMA.Ode9C13.text	Σήμερον ἄγει ἑορτήν, ἐτησίαν καὶ λαμπρὰν καὶ χαρμόσυνον, ἡ Ἐκκλησία Χριστοῦ, τὴν θείαν ταύτην ὑμῶν πανήγυριν, καὶ συναγάλλονται ὑμῖν, Προφῆται Ἀπόστολοι, καὶ πάντες Μάρτυρες, Ἀθλοφόροι νικηταὶ μεγαλώνυμοι.
ltx/gr_gr_cog/me.m10.d12:meMA.Ode9C14.incipit	Ἤρθητε πρὸς φωτοειδῆ Παραδείσου Ἀθλοφόροι…
ltx/gr_gr_cog/me.m10.d12:meMA.Ode9C14.melody	@ltx/gr_gr_cog/he.h.m8:heHE.EfrixePasaAkoi.name
ltx/gr_gr_cog/me.m10.d12:meMA.Ode9C14.mode	@ltx/gr_gr_cog/miscellanea:misc.Mode8
ltx/gr_gr_cog/me.m10.d12:meMA.Ode9C14.ode	@ltx/gr_gr_cog/miscellanea:misc.Ode9
ltx/gr_gr_cog/me.m10.d12:meMA.Ode9C14.text	Ἤρθητε πρὸς φωτοειδῆ Παραδείσου Ἀθλοφόροι σκηνώματα, περιβαλλόμενοι λαμπρὰν ἐσθῆτα, ἣν ἐξυφάνατε, πολυειδέσιν αἰκισμοῖς, καὶ θρόνῳ παρίστασθε, τοῦ Παντοκράτορος, ὑπὲρ πάντων ἐκτενῶς ἱκετεύοντες.
ltx/gr_gr_cog/me.m10.d12:meMA.Ode9C1T.incipit	Φεῖσαί μου Σῶτερ ὁ τεχθείς…
ltx/gr_gr_cog/me.m10.d12:meMA.Ode9C1T.melody	@ltx/gr_gr_cog/he.h.m8:heHE.EfrixePasaAkoi.name
ltx/gr_gr_cog/me.m10.d12:meMA.Ode9C1T.mode	@ltx/gr_gr_cog/miscellanea:misc.Mode8
ltx/gr_gr_cog/me.m10.d12:meMA.Ode9C1T.ode	@ltx/gr_gr_cog/miscellanea:misc.Ode9
ltx/gr_gr_cog/me.m10.d12:meMA.Ode9C1T.text	Φεῖσαί μου Σῶτερ ὁ τεχθείς, καὶ φυλάξας τὴν τεκοῦσάν σε ἄφθορον, μετὰ τὴν κύησιν, ὅταν καθίσῃς κρῖναι τὰ ἔργα μου, τὰς ἀνομίας παρορῶν, καὶ τὰς ἁμαρτίας μου, ὡς ἀναμάρτητος, ἐλεήμων ὡς Θεὸς καὶ φιλάνθρωπος.
ltx/gr_gr_cog/me.m10.d12:meMA.Ode9H.greekmelody	@ltx/gr_gr_cog/he.h.m8:heHE.EfrixePasaAkoi.greekname
ltx/gr_gr_cog/me.m10.d12:meMA.Ode9H.incipit	@ltx/gr_gr_cog/he.h.m8:heHE.EfrixePasaAkoi.incipit
ltx/gr_gr_cog/me.m10.d12:meMA.Ode9H.melody	@ltx/gr_gr_cog/he.h.m8:heHE.EfrixePasaAkoi.melody
ltx/gr_gr_cog/me.m10.d12:meMA.Ode9H.mode	@ltx/gr_gr_cog/miscellanea:misc.Mode8
ltx/gr_gr_cog/me.m10.d12:meMA.Ode9H.ode	@ltx/gr_gr_cog/miscellanea:misc.Ode9
ltx/gr_gr_cog/me.m10.d12:meMA.Ode9H.text	@ltx/gr_gr_cog/he.h.m8:heHE.EfrixePasaAkoi.text
ltx/gr_gr_cog/me.m10.d12:meMA.Oikos1.text	Του Ἰησοῦ τὰ πάθη γενναίως μιμησάμενοι, ἅμα σὺν Ταράχῳ τῷ σοφῷ, ὁ Πρόβος τε καὶ Ἀνδρόνικος, χαίροντες ἤχθησαν ἐν σταδίῳ, παρανόμων ἐλέγχοντες ἀθεΐαν. Ὅθεν ἡμεῖς οἱ ἐκ πόθου τιμῶντες τὴν μνήμην αὐτῶν, ἐν ὕμνοις ἀνευφημοῦμεν, καὶ πιστῶς τοὺς ἀγῶνας κηρύττομεν· ἐθαυμάστωσε γὰρ ὁ Κύριος, ὡς φωστῆρας ἐν κόσμῳ, τῇ πίστει γενναίως ἐναθλήσαντας.
ltx/gr_gr_cog/me.m10.d12:meVE.Apolytikion1ger.greekmelody	@ltx/gr_gr_cog/he.a.m3:heAU.TinOraiotita.greekname
ltx/gr_gr_cog/me.m10.d12:meVE.Apolytikion1ger.incipit	Ἰσχὺν τὴν ἄμαχον, περιζωσάμενοι, κατεπαλαίσατε…
ltx/gr_gr_cog/me.m10.d12:meVE.Apolytikion1ger.melody	@ltx/gr_gr_cog/he.a.m3:heAU.TinOraiotita.name
ltx/gr_gr_cog/me.m10.d12:meVE.Apolytikion1ger.mode	@ltx/gr_gr_cog/miscellanea:misc.Mode3
ltx/gr_gr_cog/me.m10.d12:meVE.Apolytikion1ger.poet	@ltx/gr_gr_cog/poets:po.Gerasimou
ltx/gr_gr_cog/me.m10.d12:meVE.Apolytikion1ger.text	Ἰσχὺν τὴν ἄμαχον, περιζωσάμενοι, κατεπαλαίσατε, ἐχθρῶν τὰς φάλαγγας, καὶ ἐδοξάσατε Χριστόν, ἀθλήσεως τοῖς ἀγῶσι, Πρόβε παναοίδιμε, ὁ προβὰς πρὸς τὰ κρείττονα, ἔνδοξε Ἀνδρόνικε, Ἐκκλησίας ἐκνίκημα, καὶ Τάραχε πιστῶν ἡ γαλήνη· ὁ τρισαυγὴς Μαρτύρων δῆμος.
ltx/gr_gr_cog/me.m10.d12:meVE.AposGlory.incipit	Τὸ τριστέλεχον ἄθροισμα, οἱ ἰσάριθμοι…
ltx/gr_gr_cog/me.m10.d12:meVE.AposGlory.melody	
ltx/gr_gr_cog/me.m10.d12:meVE.AposGlory.mode	@ltx/gr_gr_cog/miscellanea:misc.Mode1
ltx/gr_gr_cog/me.m10.d12:meVE.AposGlory.poet	@ltx/gr_gr_cog/poets:po.AndreouIerosolymitou
ltx/gr_gr_cog/me.m10.d12:meVE.AposGlory.text	Τὸ τριστέλεχον ἄθροισμα, οἱ ἰσάριθμοι τῆς Ἁγίας Τριάδος,ὥσπερ ἀστέρες φαεινοὶ ἐκ τῆς Ἑῴας φανέντες, τὴν κτίσιν συγκαλοῦσι, πρὸς ἱερὰν πανήγυριν, Πρόβος, καὶ Τάραχος σὺν Ἀνδρονίκῳ τῷ σοφῷ· τὰς γὰρ σάρκας αὐτῶν θηρίοις παρέδωκαν, καὶ τῷ αἵματι τὴν γῆν πορφυρώσαντες, στεφηφόροι ἐν οὐρανοῖς, μέτʼ Ἀγγέλων χορεύουσιν, αἰτούμενοι ὑπὲρ ἡμῶν τὸν φιλάνθρωπον Θεόν, πλημμελημάτων ἄφεσιν δωρηθῆναι, καὶ τὸ μέγα ἔλεος.
ltx/gr_gr_cog/me.m10.d12:meVE.AposStavrotheotokion.greekmelody	@ltx/gr_gr_cog/he.a.m1:heAU.TonOuranionTagmaton.greekname
ltx/gr_gr_cog/me.m10.d12:meVE.AposStavrotheotokion.incipit	@ltx/gr_gr_cog/oc.m1.d6:ocVE.SticTheotokion.incipit
ltx/gr_gr_cog/me.m10.d12:meVE.AposStavrotheotokion.melody	@ltx/gr_gr_cog/he.a.m1:heAU.TonOuranionTagmaton.name
ltx/gr_gr_cog/me.m10.d12:meVE.AposStavrotheotokion.mode	@ltx/gr_gr_cog/miscellanea:misc.Mode1
ltx/gr_gr_cog/me.m10.d12:meVE.AposStavrotheotokion.text	@ltx/gr_gr_cog/oc.m1.d6:ocVE.SticTheotokion.text
ltx/gr_gr_cog/me.m10.d12:meVE.AposTheotokion.greekmelody	@ltx/gr_gr_cog/he.a.m1:heAU.TonOuranionTagmaton.greekname
ltx/gr_gr_cog/me.m10.d12:meVE.AposTheotokion.incipit	Μεταβολήν μοι τοῦ βίου, Παρθένε…
ltx/gr_gr_cog/me.m10.d12:meVE.AposTheotokion.melody	@ltx/gr_gr_cog/he.a.m1:heAU.TonOuranionTagmaton.name
ltx/gr_gr_cog/me.m10.d12:meVE.AposTheotokion.mode	@ltx/gr_gr_cog/miscellanea:misc.Mode1
ltx/gr_gr_cog/me.m10.d12:meVE.AposTheotokion.text	Μεταβολήν μοι τοῦ βίου, Παρθένε χάρισαι, ἀπὸ τῶν ἐμπαθῶν μου, μεταφέρουσα τρόπων, πρὸς θείας ἀπαθείας, νεῦσιν ὁμοῦ, καὶ οἰκείωσιν ἄῤῥητον, πένθος χαρμόσυνον βρύειν μου τὴν ψυχήν, ἀενάως μοι παρέχουσα.
ltx/gr_gr_cog/me.m10.d12:meVE.SticGlory.incipit	Στρατευθέντες τῷ Χριστῷ, τὰ ἐπὶ…
ltx/gr_gr_cog/me.m10.d12:meVE.SticGlory.melody	
ltx/gr_gr_cog/me.m10.d12:meVE.SticGlory.mode	@ltx/gr_gr_cog/miscellanea:misc.Mode4
ltx/gr_gr_cog/me.m10.d12:meVE.SticGlory.poet	@ltx/gr_gr_cog/poets:po.Anatoliou
ltx/gr_gr_cog/me.m10.d12:meVE.SticGlory.text	Στρατευθέντες τῷ Χριστῷ, τὰ ἐπὶ γῆς τερπνὰ κατελίπετε, καὶ τὸν σταυρὸν ἐπʼ ὤμων ἄραντες, διὰ βασάνων πολυπλόκων, αὐτῷ ἠκολουθήσατε, καὶ ἐναντίον βασιλέων καὶ τυράννων πολλῶν, μὴ ἀρνησάμενοι αὐτόν, ὑπʼ Ἀγγέλων τὰ βραβεῖα τῆς νίκης ἐδέξασθε, τὰς κεφαλὰς ὑμῶν στεφθέντες, καὶ πεπαῤῥησιασμένῃ τῇ ψυχῇ, φαιδρῶς εἰς τὸν νυμφῶνα τὸν μέγαν συνεληλύθατε. Πρόβε, τὸ κλέος τῶν Μαρτύρων, Τάραχε, τῶν δαιμόνων ὀλοθρευτά, καὶ Ἀνδρόνικε, νίκη τῶν πιστῶν, παῤῥησίαν ἔχοντες, τῷ Σωτῆρι τῶν ὅλων πρεσβεύσατε, ὑπὲρ τῶν ψυχῶν ἡμῶν.
ltx/gr_gr_cog/me.m10.d12:meVE.SticStavrotheotokion.greekmelody	@ltx/gr_gr_cog/he.a.m4:heAU.EdokasSimeiosin.greekname
ltx/gr_gr_cog/me.m10.d12:meVE.SticStavrotheotokion.incipit	@ltx/gr_gr_cog/oc.m4.d4:ocVE.SticTheotokion.incipit
ltx/gr_gr_cog/me.m10.d12:meVE.SticStavrotheotokion.melody	@ltx/gr_gr_cog/he.a.m4:heAU.EdokasSimeiosin.name
ltx/gr_gr_cog/me.m10.d12:meVE.SticStavrotheotokion.mode	@ltx/gr_gr_cog/miscellanea:misc.Mode4
ltx/gr_gr_cog/me.m10.d12:meVE.SticStavrotheotokion.text	@ltx/gr_gr_cog/oc.m4.d4:ocVE.SticTheotokion.text
ltx/gr_gr_cog/me.m10.d12:meVE.SticTheotokion.greekmelody	@ltx/gr_gr_cog/he.a.m4:heAU.EdokasSimeiosin.greekname
ltx/gr_gr_cog/me.m10.d12:meVE.SticTheotokion.incipit	@ltx/gr_gr_cog/oc.m4.d6:ocVE.Stichera4.incipit
ltx/gr_gr_cog/me.m10.d12:meVE.SticTheotokion.melody	@ltx/gr_gr_cog/he.a.m4:heAU.EdokasSimeiosin.name
ltx/gr_gr_cog/me.m10.d12:meVE.SticTheotokion.mode	@ltx/gr_gr_cog/miscellanea:misc.Mode4
ltx/gr_gr_cog/me.m10.d12:meVE.SticTheotokion.text	@ltx/gr_gr_cog/oc.m4.d6:ocVE.Stichera4.text
ltx/gr_gr_cog/me.m10.d12:meVE.Stichera01.greekmelody	@ltx/gr_gr_cog/he.a.m1:heAU.PaneffimoiMartyres.greekname
ltx/gr_gr_cog/me.m10.d12:meVE.Stichera01.incipit	Οἱ Ἅγιοι Μάρτυρες οἱ τρεῖς…
ltx/gr_gr_cog/me.m10.d12:meVE.Stichera01.melody	@ltx/gr_gr_cog/he.a.m1:heAU.PaneffimoiMartyres.name
ltx/gr_gr_cog/me.m10.d12:meVE.Stichera01.mode	@ltx/gr_gr_cog/miscellanea:misc.Mode1
ltx/gr_gr_cog/me.m10.d12:meVE.Stichera01.text	Οἱ Ἅγιοι Μάρτυρες οἱ τρεῖς, ἐν ἑνὶ φρονήματι, τῇ τρισαγίῳ θεότητι, ἀεὶ λατρεύοντες, ἀπειλὰς τυράννων, καὶ πληγὰς αἰκίσεων, ὑπέμειναν τῇ πίστει ῥωννύμενοι, Πρόβος καὶ Τάραχος, καὶ ὁ σύναθλος Ἀνδρόνικος, καὶ τῆς νίκης, στεφάνους ἐδέξαντο.
ltx/gr_gr_cog/me.m10.d12:meVE.Stichera02.incipit	Χριστὸν ἐνδυσάμενοι Σταυρόν, ὡς ὅπλον…
ltx/gr_gr_cog/me.m10.d12:meVE.Stichera02.melody	@ltx/gr_gr_cog/he.a.m1:heAU.PaneffimoiMartyres.name
ltx/gr_gr_cog/me.m10.d12:meVE.Stichera02.mode	@ltx/gr_gr_cog/miscellanea:misc.Mode1
ltx/gr_gr_cog/me.m10.d12:meVE.Stichera02.text	Χριστὸν ἐνδυσάμενοι Σταυρόν, ὡς ὅπλον δὲ φέροντες, ἐν ταῖς χερσὶν ὑμῶν Ἅγιοι, στεῤῥῶς καθείλετε, τῶν ἐχθρῶν τὰ θράση, καὶ τῆς νίκης ἔνδοξοι, βραβεῖα ἐκ Θεοῦ ἐκομίσασθε, αὐτῷ πρεσβεύοντες, δωρηθῆναι ταῖς ψυχαῖς ἡμῶν, τὴν εἰρήνην καὶ τὸ μέγα ἔλεος.
ltx/gr_gr_cog/me.m10.d12:meVE.Stichera03.incipit	Τῷ πόθῳ φλεγομενοι Χριστοῦ, Ἀθλοφόροι…
ltx/gr_gr_cog/me.m10.d12:meVE.Stichera03.melody	@ltx/gr_gr_cog/he.a.m1:heAU.PaneffimoiMartyres.name
ltx/gr_gr_cog/me.m10.d12:meVE.Stichera03.mode	@ltx/gr_gr_cog/miscellanea:misc.Mode1
ltx/gr_gr_cog/me.m10.d12:meVE.Stichera03.text	Τῷ πόθῳ φλεγομενοι Χριστοῦ, Ἀθλοφόροι ἔνδοξοι, ἀκαταγώνιστοι ὤφθητε, ξίφος οὐ κάμινος, οὐ θυμὸς τυράννων, οὐ ποιναὶ κολάσεων, οὐ θάνατος ὑμᾶς ἐξεφόβησεν, ἀλλʼ ἐκτελέσαντες, τὸν ἀγῶνα τῆς ἀθλήσεως, ἐπαξίως, στεφάνους ἐδέξασθε.
