ltx/gr_gr_cog/me.m04.d05:meDA.commemoration.first	Μνήμη τῶν Ἁγίων Μαρτύρων Κλαυδίου, Διοδώρου κτλ.
ltx/gr_gr_cog/me.m04.d05:meDA.commemoration.first_name	
ltx/gr_gr_cog/me.m04.d05:meDA.commemoration.first_short	Μνήμη τῶν Ἁγίων Μαρτύρων Κλαυδίου, Διοδώρου κτλ.
ltx/gr_gr_cog/me.m04.d05:meDA.commemoration.first_title	@ltx/gr_gr_cog/titles:ti.Saints
ltx/gr_gr_cog/me.m04.d05:meDA.commemoration.full	Μνήμη τῶν Ἁγίων Μαρτύρων Κλαυδίου, Διοδώρου, Οὐίκτωρος [Βίκτωρος], Οὐϊκτωρίνου [Βικτωρίνου], Παππίου, Νικηφόρου καὶ Σεραπίωνος
ltx/gr_gr_cog/me.m04.d05:meDA.commemoration.second_name	
ltx/gr_gr_cog/me.m04.d05:meDA.commemoration.second_title	
ltx/gr_gr_cog/me.m04.d05:meDA.date	Τῌ Εʹ ΑΠΡΙΛΙΟΥ
ltx/gr_gr_cog/me.m04.d05:meDA.fordate	διὰ τὴν 5ην Ἀπριλίου
ltx/gr_gr_cog/me.m04.d05:meDA.insert1	καὶ τῶν Ἁγίων Μαρτύρων Κλαυδίου, Διοδώρου, Οὐίκτωρος [Βίκτωρος], Οὐϊκτωρίνου [Βικτωρίνου], Παππίου, Νικηφόρου καὶ Σεραπίωνος,
ltx/gr_gr_cog/me.m04.d05:meDA.insert2	ὧν καὶ τὴν μνήμην ἐπιτελοῦμεν·
ltx/gr_gr_cog/me.m04.d05:meDA.note	
ltx/gr_gr_cog/me.m04.d05:meDA.pdfcoverdate	τῆς 5ης Ἀπριλίου,
ltx/gr_gr_cog/me.m04.d05:meDA.pdfheaderdate	τῆς 5ης Ἀπριλίου
ltx/gr_gr_cog/me.m04.d05:meHO.commemorations	
ltx/gr_gr_cog/me.m04.d05:meHO.note1	
ltx/gr_gr_cog/me.m04.d05:meHO.note2	
ltx/gr_gr_cog/me.m04.d05:meHO.number	
ltx/gr_gr_cog/me.m04.d05:meHO.rank	
ltx/gr_gr_cog/me.m04.d05:meLE.commemoration1	Μνήμη τῶν Ἁγίων Μαρτύρων Κλαυδίου, Διοδώρου, Οὐίκτωρος [Βίκτωρος], Οὐϊκτωρίνου [Βικτωρίνου], Παππίου, Νικηφόρου καὶ Σεραπίωνος.
ltx/gr_gr_cog/me.m04.d05:meLE.commemoration2	
ltx/gr_gr_cog/me.m04.d05:meLI.Kontakion1.incipit	@ltx/gr_gr_cog/me.m04.d05:meMA.Kontakion1ger.incipit
ltx/gr_gr_cog/me.m04.d05:meLI.Kontakion1.melody	@ltx/gr_gr_cog/me.m04.d05:meMA.Kontakion1ger.melody
ltx/gr_gr_cog/me.m04.d05:meLI.Kontakion1.mode	@ltx/gr_gr_cog/me.m04.d05:meMA.Kontakion1ger.mode
ltx/gr_gr_cog/me.m04.d05:meLI.Kontakion1.text	@ltx/gr_gr_cog/me.m04.d05:meMA.Kontakion1ger.text
ltx/gr_gr_cog/me.m04.d05:meLI.MM.CommunionHymn.text	@ltx/gr_gr_cog/properties:media.key
ltx/gr_gr_cog/me.m04.d05:meLI.Megalynarion.text	
ltx/gr_gr_cog/me.m04.d05:meMA.C1.acrostic.notice1	οὗ ἡ Ἀκροστιχίς·
ltx/gr_gr_cog/me.m04.d05:meMA.C1.acrostic.text	Τὴν ἑπτάριθμον Μαρτύρων τιμῶ χάριν. Ἰωσήφ.
ltx/gr_gr_cog/me.m04.d05:meMA.C1.acrostic.title	Ὁ Κανὼν τῶν Ἁγίων,
ltx/gr_gr_cog/me.m04.d05:meMA.C1.title	@ltx/gr_gr_cog/titles:ti.CanonSaints
ltx/gr_gr_cog/me.m04.d05:meMA.C1.verse	@ltx/gr_gr_cog/prayers:pr.verse_SaintsM.text
ltx/gr_gr_cog/me.m04.d05:meMA.Kontakion1ger.incipit	Ὡς στρατιῶται Χριστοῦ ἀκατάπληκτοι, τὰς…
ltx/gr_gr_cog/me.m04.d05:meMA.Kontakion1ger.melody	@ltx/gr_gr_cog/he.a.m2:heAU.ToisTonAimatonSou.name
ltx/gr_gr_cog/me.m04.d05:meMA.Kontakion1ger.mode	@ltx/gr_gr_cog/miscellanea:misc.Mode2
ltx/gr_gr_cog/me.m04.d05:meMA.Kontakion1ger.poet	@ltx/gr_gr_cog/poets:po.Gerasimou
ltx/gr_gr_cog/me.m04.d05:meMA.Kontakion1ger.text	Ὡς στρατιῶται Χριστοῦ ἀκατάπληκτοι, τὰς ἐναντίον ἀρχὰς ἐτροπώσασθε, φαιδρῶς συνημμένοι τῷ πνεύματι, καὶ ὁμοφώνως κραυγάζοντες Μάρτυρες· Χριστὸς τῶν ἀθλούντων ὁ στέφανος.
ltx/gr_gr_cog/me.m04.d05:meMA.Ode1C11.greekmelody	@ltx/gr_gr_cog/he.h.m4:heHE.ThalassisToErythraion.greekname
ltx/gr_gr_cog/me.m04.d05:meMA.Ode1C11.incipit	Τὸν δρόμον, τὸν ἱερὸν τελέσαντες…
ltx/gr_gr_cog/me.m04.d05:meMA.Ode1C11.melody	@ltx/gr_gr_cog/he.h.m4:heHE.ThalassisToErythraion.name
ltx/gr_gr_cog/me.m04.d05:meMA.Ode1C11.mode	@ltx/gr_gr_cog/miscellanea:misc.Mode4
ltx/gr_gr_cog/me.m04.d05:meMA.Ode1C11.ode	@ltx/gr_gr_cog/miscellanea:misc.Ode1
ltx/gr_gr_cog/me.m04.d05:meMA.Ode1C11.text	Τὸν δρόμον, τὸν ἱερὸν τελέσαντες, Ἅγιοι Μάρτυρες, στεφηφοροῦντες θρόνῳ τοῦ Θεοῦ, μετὰ δόξης παρίστασθε, φωτιστικαῖς τοῦ Πνεύματος, κόσμον ἀκτῖσι καταυγάζοντες.
ltx/gr_gr_cog/me.m04.d05:meMA.Ode1C12.incipit	Ἡ θεία, τῶν Ἀθλητῶν ἑπτάριθμος…
ltx/gr_gr_cog/me.m04.d05:meMA.Ode1C12.melody	@ltx/gr_gr_cog/he.h.m4:heHE.ThalassisToErythraion.name
ltx/gr_gr_cog/me.m04.d05:meMA.Ode1C12.mode	@ltx/gr_gr_cog/miscellanea:misc.Mode4
ltx/gr_gr_cog/me.m04.d05:meMA.Ode1C12.ode	@ltx/gr_gr_cog/miscellanea:misc.Ode1
ltx/gr_gr_cog/me.m04.d05:meMA.Ode1C12.text	Ἡ θεία, τῶν Ἀθλητῶν ἑπτάριθμος, χορεία σήμερον, μεγαλυνέσθω, θείαις καλλοναῖς, ἱερῶς ἐξαστράπτουσα, καὶ ἀσωμάτοις τάξεσιν, ἐν οὐρανοῖς νῦν συγχορεύουσα.
ltx/gr_gr_cog/me.m04.d05:meMA.Ode1C13.incipit	Νομίμως τὸ Μαρτυρίου στάδιον, διαδραμόντες…
ltx/gr_gr_cog/me.m04.d05:meMA.Ode1C13.melody	@ltx/gr_gr_cog/he.h.m4:heHE.ThalassisToErythraion.name
ltx/gr_gr_cog/me.m04.d05:meMA.Ode1C13.mode	@ltx/gr_gr_cog/miscellanea:misc.Mode4
ltx/gr_gr_cog/me.m04.d05:meMA.Ode1C13.ode	@ltx/gr_gr_cog/miscellanea:misc.Ode1
ltx/gr_gr_cog/me.m04.d05:meMA.Ode1C13.text	Νομίμως τὸ Μαρτυρίου στάδιον, διαδραμόντες Σοφοί, καὶ αἰκισμῶν παντοίων προσβολάς, ἐνεγκόντες, στεῤῥότατα, τὴν κληρουχίαν χαίροντες, τὴν αἰωνίζουσαν εἰλήφατε.
ltx/gr_gr_cog/me.m04.d05:meMA.Ode1C1H.greekmelody	@ltx/gr_gr_cog/he.h.m4:heHE.ThalassisToErythraion.greekname
ltx/gr_gr_cog/me.m04.d05:meMA.Ode1C1H.incipit	@ltx/gr_gr_cog/he.h.m4:heHE.ThalassisToErythraion.incipit
ltx/gr_gr_cog/me.m04.d05:meMA.Ode1C1H.melody	@ltx/gr_gr_cog/he.h.m4:heHE.ThalassisToErythraion.melody
ltx/gr_gr_cog/me.m04.d05:meMA.Ode1C1H.mode	@ltx/gr_gr_cog/miscellanea:misc.Mode4
ltx/gr_gr_cog/me.m04.d05:meMA.Ode1C1H.ode	@ltx/gr_gr_cog/miscellanea:misc.Ode1
ltx/gr_gr_cog/me.m04.d05:meMA.Ode1C1H.text	@ltx/gr_gr_cog/he.h.m4:heHE.ThalassisToErythraion.text
ltx/gr_gr_cog/me.m04.d05:meMA.Ode1C1T.incipit	Ἐν χρόνῳ, ὁ ἔξω χρόνων…
ltx/gr_gr_cog/me.m04.d05:meMA.Ode1C1T.melody	@ltx/gr_gr_cog/he.h.m4:heHE.ThalassisToErythraion.name
ltx/gr_gr_cog/me.m04.d05:meMA.Ode1C1T.mode	@ltx/gr_gr_cog/miscellanea:misc.Mode4
ltx/gr_gr_cog/me.m04.d05:meMA.Ode1C1T.ode	@ltx/gr_gr_cog/miscellanea:misc.Ode1
ltx/gr_gr_cog/me.m04.d05:meMA.Ode1C1T.text	Ἐν χρόνῳ, ὁ ἔξω χρόνων Κύριος, ἐκ σοῦ σαρκούμενος, τὰ τῶν βροτῶν διέλυσεν Ἁγνή, πολυχρόνια πταίσματα· Ὃν ἐκτενῶς ἱκέτευε, τοῦ οἰκτειρῆσαι τὰς ψυχὰς ἡμῶν.
ltx/gr_gr_cog/me.m04.d05:meMA.Ode3C11.greekmelody	@ltx/gr_gr_cog/he.h.m4:heHE.EffrainetaiEpiSoi.greekname
ltx/gr_gr_cog/me.m04.d05:meMA.Ode3C11.incipit	Παντοίοις διὰ Χριστόν, προσομιλοῦντες αἰκισμοῖς…
ltx/gr_gr_cog/me.m04.d05:meMA.Ode3C11.melody	@ltx/gr_gr_cog/he.h.m4:heHE.EffrainetaiEpiSoi.name
ltx/gr_gr_cog/me.m04.d05:meMA.Ode3C11.mode	@ltx/gr_gr_cog/miscellanea:misc.Mode4
ltx/gr_gr_cog/me.m04.d05:meMA.Ode3C11.ode	@ltx/gr_gr_cog/miscellanea:misc.Ode3
ltx/gr_gr_cog/me.m04.d05:meMA.Ode3C11.text	Παντοίοις διὰ Χριστόν, προσομιλοῦντες αἰκισμοῖς Ἅγιοι, ὑπὲρ χρυσὸν χάριτι, Πνεύματος Ἁγίου ἠστράψατε.
ltx/gr_gr_cog/me.m04.d05:meMA.Ode3C12.incipit	Τοῦ νώτου σου συντριβήν, Οὐϊκτωρῖνε…
ltx/gr_gr_cog/me.m04.d05:meMA.Ode3C12.melody	@ltx/gr_gr_cog/he.h.m4:heHE.EffrainetaiEpiSoi.name
ltx/gr_gr_cog/me.m04.d05:meMA.Ode3C12.mode	@ltx/gr_gr_cog/miscellanea:misc.Mode4
ltx/gr_gr_cog/me.m04.d05:meMA.Ode3C12.ode	@ltx/gr_gr_cog/miscellanea:misc.Ode3
ltx/gr_gr_cog/me.m04.d05:meMA.Ode3C12.text	Τοῦ νώτου σου συντριβήν, Οὐϊκτωρῖνε, ὀφθαλμῶν στέρησιν, καὶ τῶν χειρῶν ἔνδοξε, Μάρτυς καὶ ποδῶν ἐκαρτέρησας.
ltx/gr_gr_cog/me.m04.d05:meMA.Ode3C13.incipit	Ἀγάπῃ τῇ εἰς Χριστόν, προσδεδεμένοι…
ltx/gr_gr_cog/me.m04.d05:meMA.Ode3C13.melody	@ltx/gr_gr_cog/he.h.m4:heHE.EffrainetaiEpiSoi.name
ltx/gr_gr_cog/me.m04.d05:meMA.Ode3C13.mode	@ltx/gr_gr_cog/miscellanea:misc.Mode4
ltx/gr_gr_cog/me.m04.d05:meMA.Ode3C13.ode	@ltx/gr_gr_cog/miscellanea:misc.Ode3
ltx/gr_gr_cog/me.m04.d05:meMA.Ode3C13.text	Ἀγάπῃ τῇ εἰς Χριστόν, προσδεδεμένοι Ἀθληταὶ ἔνδοξοι, τοῦ σκολιοῦ δράκοντος, πάσας μηχανὰς διελύσατε.
ltx/gr_gr_cog/me.m04.d05:meMA.Ode3C1H.greekmelody	@ltx/gr_gr_cog/he.h.m4:heHE.EffrainetaiEpiSoi.greekname
ltx/gr_gr_cog/me.m04.d05:meMA.Ode3C1H.incipit	@ltx/gr_gr_cog/he.h.m4:heHE.EffrainetaiEpiSoi.incipit
ltx/gr_gr_cog/me.m04.d05:meMA.Ode3C1H.melody	@ltx/gr_gr_cog/he.h.m4:heHE.EffrainetaiEpiSoi.melody
ltx/gr_gr_cog/me.m04.d05:meMA.Ode3C1H.mode	@ltx/gr_gr_cog/miscellanea:misc.Mode4
ltx/gr_gr_cog/me.m04.d05:meMA.Ode3C1H.ode	@ltx/gr_gr_cog/miscellanea:misc.Ode3
ltx/gr_gr_cog/me.m04.d05:meMA.Ode3C1H.text	@ltx/gr_gr_cog/he.h.m4:heHE.EffrainetaiEpiSoi.text
ltx/gr_gr_cog/me.m04.d05:meMA.Ode3C1T.incipit	Ῥυόμενον τοὺς βροτούς, αἰχμαλωσίας νοητῆς…
ltx/gr_gr_cog/me.m04.d05:meMA.Ode3C1T.melody	@ltx/gr_gr_cog/he.h.m4:heHE.EffrainetaiEpiSoi.name
ltx/gr_gr_cog/me.m04.d05:meMA.Ode3C1T.mode	@ltx/gr_gr_cog/miscellanea:misc.Mode4
ltx/gr_gr_cog/me.m04.d05:meMA.Ode3C1T.ode	@ltx/gr_gr_cog/miscellanea:misc.Ode3
ltx/gr_gr_cog/me.m04.d05:meMA.Ode3C1T.text	Ῥυόμενον τοὺς βροτούς, αἰχμαλωσίας νοητῆς τέτοκας, τὸν τοῦ παντὸς Κύριον, ἄχραντε Παρθένε πανύμνητε.
ltx/gr_gr_cog/me.m04.d05:meMA.Ode3Kathisma1.greekmelody	@ltx/gr_gr_cog/he.a.m4:heAU.OYpsotheisEnToStavro.greekname
ltx/gr_gr_cog/me.m04.d05:meMA.Ode3Kathisma1.incipit	Τοὺς πολυτρόπους αἰκισμοὺς ἐνεγκόντες, ἐν…
ltx/gr_gr_cog/me.m04.d05:meMA.Ode3Kathisma1.melody	@ltx/gr_gr_cog/he.a.m4:heAU.OYpsotheisEnToStavro.name
ltx/gr_gr_cog/me.m04.d05:meMA.Ode3Kathisma1.mode	@ltx/gr_gr_cog/miscellanea:misc.Mode4
ltx/gr_gr_cog/me.m04.d05:meMA.Ode3Kathisma1.text	Τοὺς πολυτρόπους αἰκισμοὺς ἐνεγκόντες, ἐν ἀπτοήτῳ λογισμῷ Ἀθλοφόροι, ὑπὲρ ἡλίου λάμπετε φαιδρότητα· ὅθεν τὴν φαιδρὰν ὑμῶν, ἑορτάζομεν μνήμην, πίστει ἱκετεύοντες, ταῖς ὑμῶν μεσιτείαις, ἁμαρτημάτων λύτρωσιν λαβεῖν, καὶ αἰωνίων καλῶν τὴν ἀπόλαυσιν.
ltx/gr_gr_cog/me.m04.d05:meMA.Ode3KathismaSt.incipit	Οὐ φέρω βλέπειν σε Σταυρῷ…
ltx/gr_gr_cog/me.m04.d05:meMA.Ode3KathismaSt.melody	@ltx/gr_gr_cog/he.a.m4:heAU.OYpsotheisEnToStavro.name
ltx/gr_gr_cog/me.m04.d05:meMA.Ode3KathismaSt.mode	@ltx/gr_gr_cog/miscellanea:misc.Mode4
ltx/gr_gr_cog/me.m04.d05:meMA.Ode3KathismaSt.text	Οὐ φέρω βλέπειν σε Σταυρῷ τεταμένον, Μήτηρ ἡ σὴ Παμβασιλεῦ ἀνεβόα· ὃν ὑπὲρ φύσιν τέτοκα Υἱὸν καὶ Θεόν· οἶδα γάρ σου Δέσποτα, τὸ φιλάνθρωπον οἶδα, ὅπως πάσχεις ἕνεκα, τῆς βροτῶν σωτηρίας, ἀλλʼ οὖν οὐ σθένω Τέκνον μητρικάς, φέρειν ὀδύνας, Σταυρῷ καθορῶσά σε.
ltx/gr_gr_cog/me.m04.d05:meMA.Ode3KathismaT.incipit	Τῶν δωρεῶν σου τῶν σεπτῶν…
ltx/gr_gr_cog/me.m04.d05:meMA.Ode3KathismaT.melody	@ltx/gr_gr_cog/he.a.m4:heAU.OYpsotheisEnToStavro.name
ltx/gr_gr_cog/me.m04.d05:meMA.Ode3KathismaT.mode	@ltx/gr_gr_cog/miscellanea:misc.Mode4
ltx/gr_gr_cog/me.m04.d05:meMA.Ode3KathismaT.text	Τῶν δωρεῶν σου τῶν σεπτῶν ἀπολαύοντες, οὐ σιωπήσομεν ὑμνεῖν Θεοτόκε, τὰ σὰ ἐλέη πάντοτε οἱ δούλοί σου, κράζοντες καὶ λέγοντες· Παναγία Παρθένε, πάντας ἐξελοῦ ἡμᾶς, ἐξ ἐχθρῶν ἀοράτων, καὶ ἀναγκῶν καὶ πάσης ἀπειλῆς· σὺ γὰρ ὑπάρχεις ἡμῶν ἡ ἀντίληψις.
ltx/gr_gr_cog/me.m04.d05:meMA.Ode4C11.greekmelody	@ltx/gr_gr_cog/he.h.m4:heHE.EparthentaSeIdousa.greekname
ltx/gr_gr_cog/me.m04.d05:meMA.Ode4C11.incipit	Ἰοβόλον ἀπεῤῥάπισας πονηρίαν, τοῦ δυσμενοῦς…
ltx/gr_gr_cog/me.m04.d05:meMA.Ode4C11.melody	@ltx/gr_gr_cog/he.h.m4:heHE.EparthentaSeIdousa.name
ltx/gr_gr_cog/me.m04.d05:meMA.Ode4C11.mode	@ltx/gr_gr_cog/miscellanea:misc.Mode4
ltx/gr_gr_cog/me.m04.d05:meMA.Ode4C11.ode	@ltx/gr_gr_cog/miscellanea:misc.Ode4
ltx/gr_gr_cog/me.m04.d05:meMA.Ode4C11.text	Ἰοβόλον ἀπεῤῥάπισας πονηρίαν, τοῦ δυσμενοῦς ἐν χάριτι, Οὐΐκτωρ θεόφρον, γλῶσσαν ἀφαιρούμενος, πλευράς τε ξεόμενος, καὶ μαρτυρικῶς κλεϊζόμενος.
ltx/gr_gr_cog/me.m04.d05:meMA.Ode4C12.incipit	Θυρεῷ τῆς εὐσεβείας ἐμπεφραγμένος, τὴν…
ltx/gr_gr_cog/me.m04.d05:meMA.Ode4C12.melody	@ltx/gr_gr_cog/he.h.m4:heHE.EparthentaSeIdousa.name
ltx/gr_gr_cog/me.m04.d05:meMA.Ode4C12.mode	@ltx/gr_gr_cog/miscellanea:misc.Mode4
ltx/gr_gr_cog/me.m04.d05:meMA.Ode4C12.ode	@ltx/gr_gr_cog/miscellanea:misc.Ode4
ltx/gr_gr_cog/me.m04.d05:meMA.Ode4C12.text	Θυρεῷ τῆς εὐσεβείας ἐμπεφραγμένος, τὴν συντριβὴν τοῦ σώματος, Μάρτυς Νικηφόρε, σταθερῶς ὑπήνεγκας, βοῶν τῷ Δεσπότῃ σου· Δόξα τῇ δυνάμει σου Κύριε.
ltx/gr_gr_cog/me.m04.d05:meMA.Ode4C13.incipit	Μεγαλύνων τὸν τῶν ὅλων Θεὸν…
ltx/gr_gr_cog/me.m04.d05:meMA.Ode4C13.melody	@ltx/gr_gr_cog/he.h.m4:heHE.EparthentaSeIdousa.name
ltx/gr_gr_cog/me.m04.d05:meMA.Ode4C13.mode	@ltx/gr_gr_cog/miscellanea:misc.Mode4
ltx/gr_gr_cog/me.m04.d05:meMA.Ode4C13.ode	@ltx/gr_gr_cog/miscellanea:misc.Ode4
ltx/gr_gr_cog/me.m04.d05:meMA.Ode4C13.text	Μεγαλύνων τὸν τῶν ὅλων Θεὸν προθύμως, Κλαύδιος ὁ πανάριστος, χεῖράς τε καὶ πόδας, ἀφαιρεῖται θλώμενος, τυράννου ὠμότητι, λίθοις σιαγόνας γηθόμενος.
ltx/gr_gr_cog/me.m04.d05:meMA.Ode4C14.incipit	Οὐκ ἑπτήξατε Πανεύφημοι τρικυμίας, πολυειδεῖς…
ltx/gr_gr_cog/me.m04.d05:meMA.Ode4C14.melody	@ltx/gr_gr_cog/he.h.m4:heHE.EparthentaSeIdousa.name
ltx/gr_gr_cog/me.m04.d05:meMA.Ode4C14.mode	@ltx/gr_gr_cog/miscellanea:misc.Mode4
ltx/gr_gr_cog/me.m04.d05:meMA.Ode4C14.ode	@ltx/gr_gr_cog/miscellanea:misc.Ode4
ltx/gr_gr_cog/me.m04.d05:meMA.Ode4C14.text	Οὐκ ἑπτήξατε Πανεύφημοι τρικυμίας, πολυειδεῖς κολάσεων, οὐ θάνατον δόξης, αἰωνίου πρόξενον, ἐν πίστει κραυγάζοντες· Δόξα τῇ δυνάμει σου Κύριε.
ltx/gr_gr_cog/me.m04.d05:meMA.Ode4C1H.greekmelody	@ltx/gr_gr_cog/he.h.m4:heHE.EparthentaSeIdousa.greekname
ltx/gr_gr_cog/me.m04.d05:meMA.Ode4C1H.incipit	@ltx/gr_gr_cog/he.h.m4:heHE.EparthentaSeIdousa.incipit
ltx/gr_gr_cog/me.m04.d05:meMA.Ode4C1H.melody	@ltx/gr_gr_cog/he.h.m4:heHE.EparthentaSeIdousa.melody
ltx/gr_gr_cog/me.m04.d05:meMA.Ode4C1H.mode	@ltx/gr_gr_cog/miscellanea:misc.Mode4
ltx/gr_gr_cog/me.m04.d05:meMA.Ode4C1H.ode	@ltx/gr_gr_cog/miscellanea:misc.Ode4
ltx/gr_gr_cog/me.m04.d05:meMA.Ode4C1H.text	@ltx/gr_gr_cog/he.h.m4:heHE.EparthentaSeIdousa.text
ltx/gr_gr_cog/me.m04.d05:meMA.Ode4C1T.incipit	Νοερῶς σε ὁ Προφήτης προεθεώρει…
ltx/gr_gr_cog/me.m04.d05:meMA.Ode4C1T.melody	@ltx/gr_gr_cog/he.h.m4:heHE.EparthentaSeIdousa.name
ltx/gr_gr_cog/me.m04.d05:meMA.Ode4C1T.mode	@ltx/gr_gr_cog/miscellanea:misc.Mode4
ltx/gr_gr_cog/me.m04.d05:meMA.Ode4C1T.ode	@ltx/gr_gr_cog/miscellanea:misc.Ode4
ltx/gr_gr_cog/me.m04.d05:meMA.Ode4C1T.text	Νοερῶς σε ὁ Προφήτης προεθεώρει, ὄρος Σεμνὴ κατάσκιον, ἐξ οὗ ὁ Δεσπότης, ἀληθῶς ἐπέφανε, σαρκὸς ὁμοιώματι, σῴζων ἐκ φθορᾶς τὸ ἀνθρώπινον.
ltx/gr_gr_cog/me.m04.d05:meMA.Ode5C11.greekmelody	@ltx/gr_gr_cog/he.h.m4:heHE.SyKyrieMouFos.greekname
ltx/gr_gr_cog/me.m04.d05:meMA.Ode5C11.incipit	Μεγάλοις αἰκισμοῖς, ὁμιλήσας Διόδωρε, ὑπέφερες…
ltx/gr_gr_cog/me.m04.d05:meMA.Ode5C11.melody	@ltx/gr_gr_cog/he.h.m4:heHE.SyKyrieMouFos.name
ltx/gr_gr_cog/me.m04.d05:meMA.Ode5C11.mode	@ltx/gr_gr_cog/miscellanea:misc.Mode4
ltx/gr_gr_cog/me.m04.d05:meMA.Ode5C11.ode	@ltx/gr_gr_cog/miscellanea:misc.Ode5
ltx/gr_gr_cog/me.m04.d05:meMA.Ode5C11.text	Μεγάλοις αἰκισμοῖς, ὁμιλήσας Διόδωρε, ὑπέφερες ὀβελίσκων, πυρακτώσεις, προθύμως, ἀνθράκων τε κατάφλεξιν.
ltx/gr_gr_cog/me.m04.d05:meMA.Ode5C12.incipit	Ἀσάλευτον τὸν νοῦν, Σεραπίων διέμεινας…
ltx/gr_gr_cog/me.m04.d05:meMA.Ode5C12.melody	@ltx/gr_gr_cog/he.h.m4:heHE.SyKyrieMouFos.name
ltx/gr_gr_cog/me.m04.d05:meMA.Ode5C12.mode	@ltx/gr_gr_cog/miscellanea:misc.Mode4
ltx/gr_gr_cog/me.m04.d05:meMA.Ode5C12.ode	@ltx/gr_gr_cog/miscellanea:misc.Ode5
ltx/gr_gr_cog/me.m04.d05:meMA.Ode5C12.text	Ἀσάλευτον τὸν νοῦν, Σεραπίων διέμεινας, κρεμάμενος καὶ βασάνοις, ὁμιλῶν πολυτρόποις, καὶ ξίφει τελειούμενος.
ltx/gr_gr_cog/me.m04.d05:meMA.Ode5C13.incipit	Ῥομφαίας τοῦ ἐχθροῦ, ὦ Παππία…
ltx/gr_gr_cog/me.m04.d05:meMA.Ode5C13.melody	@ltx/gr_gr_cog/he.h.m4:heHE.SyKyrieMouFos.name
ltx/gr_gr_cog/me.m04.d05:meMA.Ode5C13.mode	@ltx/gr_gr_cog/miscellanea:misc.Mode4
ltx/gr_gr_cog/me.m04.d05:meMA.Ode5C13.ode	@ltx/gr_gr_cog/miscellanea:misc.Ode5
ltx/gr_gr_cog/me.m04.d05:meMA.Ode5C13.text	Ῥομφαίας τοῦ ἐχθροῦ, ὦ Παππία ἀπήμβλυνας, ξεόμενος καὶ τοῖς ἥλοις, καθηλούμενος Μάρτυς, καὶ ὕδασι ποντούμενος.
ltx/gr_gr_cog/me.m04.d05:meMA.Ode5C1H.greekmelody	@ltx/gr_gr_cog/he.h.m4:heHE.SyKyrieMouFos.greekname
ltx/gr_gr_cog/me.m04.d05:meMA.Ode5C1H.incipit	@ltx/gr_gr_cog/he.h.m4:heHE.SyKyrieMouFos.incipit
ltx/gr_gr_cog/me.m04.d05:meMA.Ode5C1H.melody	@ltx/gr_gr_cog/he.h.m4:heHE.SyKyrieMouFos.melody
ltx/gr_gr_cog/me.m04.d05:meMA.Ode5C1H.mode	@ltx/gr_gr_cog/miscellanea:misc.Mode4
ltx/gr_gr_cog/me.m04.d05:meMA.Ode5C1H.ode	@ltx/gr_gr_cog/miscellanea:misc.Ode5
ltx/gr_gr_cog/me.m04.d05:meMA.Ode5C1H.text	@ltx/gr_gr_cog/he.h.m4:heHE.SyKyrieMouFos.text
ltx/gr_gr_cog/me.m04.d05:meMA.Ode5C1T.incipit	Τὴν πτῶσιν τῶν βροτῶν, ἐπηνώρθωσας…
ltx/gr_gr_cog/me.m04.d05:meMA.Ode5C1T.melody	@ltx/gr_gr_cog/he.h.m4:heHE.SyKyrieMouFos.name
ltx/gr_gr_cog/me.m04.d05:meMA.Ode5C1T.mode	@ltx/gr_gr_cog/miscellanea:misc.Mode4
ltx/gr_gr_cog/me.m04.d05:meMA.Ode5C1T.ode	@ltx/gr_gr_cog/miscellanea:misc.Ode5
ltx/gr_gr_cog/me.m04.d05:meMA.Ode5C1T.text	Τὴν πτῶσιν τῶν βροτῶν, ἐπηνώρθωσας Δέσποινα, κυήσασα, Θεὸν Λόγον, τὸν τοὺς κατεῤῥαγμένους ἐπανορθοῦν δυνάμενον.
ltx/gr_gr_cog/me.m04.d05:meMA.Ode6C11.greekmelody	@ltx/gr_gr_cog/he.h.m4:heHE.ThysoSoiMetaFonis.greekname
ltx/gr_gr_cog/me.m04.d05:meMA.Ode6C11.incipit	Ὑμνείσθω, Σεραπίων καὶ θεῖος Διόδωρος…
ltx/gr_gr_cog/me.m04.d05:meMA.Ode6C11.melody	@ltx/gr_gr_cog/he.h.m4:heHE.ThysoSoiMetaFonis.name
ltx/gr_gr_cog/me.m04.d05:meMA.Ode6C11.mode	@ltx/gr_gr_cog/miscellanea:misc.Mode4
ltx/gr_gr_cog/me.m04.d05:meMA.Ode6C11.ode	@ltx/gr_gr_cog/miscellanea:misc.Ode6
ltx/gr_gr_cog/me.m04.d05:meMA.Ode6C11.text	Ὑμνείσθω, Σεραπίων καὶ θεῖος Διόδωρος, Οὐϊκτωρῖνος, Παππίας, Νικηφόρος, Κλαύδιος καὶ Οὐΐκτωρ, ὡς τὴν πλάνην, τοῦ δολίου τελείως νικήσαντες.
ltx/gr_gr_cog/me.m04.d05:meMA.Ode6C12.incipit	Ῥομφαῖαι, στομωθεῖσαι ὡράθητε Πνεύματι, καὶ…
ltx/gr_gr_cog/me.m04.d05:meMA.Ode6C12.melody	@ltx/gr_gr_cog/he.h.m4:heHE.ThysoSoiMetaFonis.name
ltx/gr_gr_cog/me.m04.d05:meMA.Ode6C12.mode	@ltx/gr_gr_cog/miscellanea:misc.Mode4
ltx/gr_gr_cog/me.m04.d05:meMA.Ode6C12.ode	@ltx/gr_gr_cog/miscellanea:misc.Ode6
ltx/gr_gr_cog/me.m04.d05:meMA.Ode6C12.text	Ῥομφαῖαι, στομωθεῖσαι ὡράθητε Πνεύματι, καὶ διεκόψατε πάσας, τοῦ ἐχθροῦ τὰς φάλαγγας, Ἀθλοφόροι, οὐρανίου, βασιλείας καλῶν ἀπολαύοντες.
ltx/gr_gr_cog/me.m04.d05:meMA.Ode6C13.incipit	Ὦ θαῦμα! πῶς εἰς ὅλμον…
ltx/gr_gr_cog/me.m04.d05:meMA.Ode6C13.melody	@ltx/gr_gr_cog/he.h.m4:heHE.ThysoSoiMetaFonis.name
ltx/gr_gr_cog/me.m04.d05:meMA.Ode6C13.mode	@ltx/gr_gr_cog/miscellanea:misc.Mode4
ltx/gr_gr_cog/me.m04.d05:meMA.Ode6C13.ode	@ltx/gr_gr_cog/miscellanea:misc.Ode6
ltx/gr_gr_cog/me.m04.d05:meMA.Ode6C13.text	Ὦ θαῦμα! πῶς εἰς ὅλμον βληθέντες ἐθλάσθητε, καθάπερ σῖτος Οὐΐκτωρ, καὶ Οὐϊκτωρῖνε τῇ συντριβῇ τε, τῶν ὀστέων, τὰς παγίδας ἐχθροῦ συνετρίψατε!
ltx/gr_gr_cog/me.m04.d05:meMA.Ode6C1H.greekmelody	@ltx/gr_gr_cog/he.h.m4:heHE.ThysoSoiMetaFonis.greekname
ltx/gr_gr_cog/me.m04.d05:meMA.Ode6C1H.incipit	@ltx/gr_gr_cog/he.h.m4:heHE.ThysoSoiMetaFonis.incipit
ltx/gr_gr_cog/me.m04.d05:meMA.Ode6C1H.melody	@ltx/gr_gr_cog/he.h.m4:heHE.ThysoSoiMetaFonis.melody
ltx/gr_gr_cog/me.m04.d05:meMA.Ode6C1H.mode	@ltx/gr_gr_cog/miscellanea:misc.Mode4
ltx/gr_gr_cog/me.m04.d05:meMA.Ode6C1H.ode	@ltx/gr_gr_cog/miscellanea:misc.Ode6
ltx/gr_gr_cog/me.m04.d05:meMA.Ode6C1H.text	@ltx/gr_gr_cog/he.h.m4:heHE.ThysoSoiMetaFonis.text
ltx/gr_gr_cog/me.m04.d05:meMA.Ode6C1T.incipit	Νεύρωσον, τῆς ψυχῆς μου τὸν…
ltx/gr_gr_cog/me.m04.d05:meMA.Ode6C1T.melody	@ltx/gr_gr_cog/he.h.m4:heHE.ThysoSoiMetaFonis.name
ltx/gr_gr_cog/me.m04.d05:meMA.Ode6C1T.mode	@ltx/gr_gr_cog/miscellanea:misc.Mode4
ltx/gr_gr_cog/me.m04.d05:meMA.Ode6C1T.ode	@ltx/gr_gr_cog/miscellanea:misc.Ode6
ltx/gr_gr_cog/me.m04.d05:meMA.Ode6C1T.text	Νεύρωσον, τῆς ψυχῆς μου τὸν τόνον Πανάμωμε, τῇ συνεχεῖ ἀμελείᾳ, καὶ τῇ ἁμαρτίᾳ κεχαυνωμένον, ἵνα πίστει, καὶ προθυμίᾳ μέλπω σε πάντοτε.
ltx/gr_gr_cog/me.m04.d05:meMA.Ode7C11.greekmelody	@ltx/gr_gr_cog/he.h.m4:heHE.EnTiKaminoAvramiaioi.greekname
ltx/gr_gr_cog/me.m04.d05:meMA.Ode7C11.incipit	Ταθεὶς Οὐίκτωρ, τὰς πλευρὰς κατεξάνθης…
ltx/gr_gr_cog/me.m04.d05:meMA.Ode7C11.melody	@ltx/gr_gr_cog/he.h.m4:heHE.EnTiKaminoAvramiaioi.name
ltx/gr_gr_cog/me.m04.d05:meMA.Ode7C11.mode	@ltx/gr_gr_cog/miscellanea:misc.Mode4
ltx/gr_gr_cog/me.m04.d05:meMA.Ode7C11.ode	@ltx/gr_gr_cog/miscellanea:misc.Ode7
ltx/gr_gr_cog/me.m04.d05:meMA.Ode7C11.text	Ταθεὶς Οὐίκτωρ, τὰς πλευρὰς κατεξάνθης πανένδοξε, ὅλμῳ συνθλασθείς, καὶ γλῶτταν δὲ ἐκτμηθείς, ἀναμέλπων τετελείωσαι· Εὐλογημένος εἶ, ἐν τῷ ναῷ τῆς δόξης σου Κύριε.
ltx/gr_gr_cog/me.m04.d05:meMA.Ode7C12.incipit	Ἰσχὺϊ Μάρτυς, τοῦ θείου Πνεύματος…
ltx/gr_gr_cog/me.m04.d05:meMA.Ode7C12.melody	@ltx/gr_gr_cog/he.h.m4:heHE.EnTiKaminoAvramiaioi.name
ltx/gr_gr_cog/me.m04.d05:meMA.Ode7C12.mode	@ltx/gr_gr_cog/miscellanea:misc.Mode4
ltx/gr_gr_cog/me.m04.d05:meMA.Ode7C12.ode	@ltx/gr_gr_cog/miscellanea:misc.Ode7
ltx/gr_gr_cog/me.m04.d05:meMA.Ode7C12.text	Ἰσχὺϊ Μάρτυς, τοῦ θείου Πνεύματος Κλαύδιε, νώτου καὶ κοιλίας μάστιγας ὑποστάς, σιαγόνας συντριβόμενος, χεῖρας καὶ πόδας τε, προσαφῃρέθης, ὑμνῶν τὸν Κύριον.
ltx/gr_gr_cog/me.m04.d05:meMA.Ode7C13.incipit	Μεγαλοφρόνως, ὦ Νικηφόρε δακτύλων στέρησιν…
ltx/gr_gr_cog/me.m04.d05:meMA.Ode7C13.melody	@ltx/gr_gr_cog/he.h.m4:heHE.EnTiKaminoAvramiaioi.name
ltx/gr_gr_cog/me.m04.d05:meMA.Ode7C13.mode	@ltx/gr_gr_cog/miscellanea:misc.Mode4
ltx/gr_gr_cog/me.m04.d05:meMA.Ode7C13.ode	@ltx/gr_gr_cog/miscellanea:misc.Ode7
ltx/gr_gr_cog/me.m04.d05:meMA.Ode7C13.text	Μεγαλοφρόνως, ὦ Νικηφόρε δακτύλων στέρησιν, ὄντως ὑπομείνας Μάρτυς νεανικῶς, συντριβήν τε παντὸς σώματος, νίκης διάδημα, φερωνυμίᾳ σὺ ἀναδέδησαι.
ltx/gr_gr_cog/me.m04.d05:meMA.Ode7C1H.greekmelody	@ltx/gr_gr_cog/he.h.m4:heHE.EnTiKaminoAvramiaioi.greekname
ltx/gr_gr_cog/me.m04.d05:meMA.Ode7C1H.incipit	@ltx/gr_gr_cog/he.h.m4:heHE.EnTiKaminoAvramiaioi.incipit
ltx/gr_gr_cog/me.m04.d05:meMA.Ode7C1H.melody	@ltx/gr_gr_cog/he.h.m4:heHE.EnTiKaminoAvramiaioi.melody
ltx/gr_gr_cog/me.m04.d05:meMA.Ode7C1H.mode	@ltx/gr_gr_cog/miscellanea:misc.Mode4
ltx/gr_gr_cog/me.m04.d05:meMA.Ode7C1H.ode	@ltx/gr_gr_cog/miscellanea:misc.Ode7
ltx/gr_gr_cog/me.m04.d05:meMA.Ode7C1H.text	@ltx/gr_gr_cog/he.h.m4:heHE.EnTiKaminoAvramiaioi.text
ltx/gr_gr_cog/me.m04.d05:meMA.Ode7C1T.incipit	Ὡς τοῦ Ὑψίστου, θρόνον Παρθένε…
ltx/gr_gr_cog/me.m04.d05:meMA.Ode7C1T.melody	@ltx/gr_gr_cog/he.h.m4:heHE.EnTiKaminoAvramiaioi.name
ltx/gr_gr_cog/me.m04.d05:meMA.Ode7C1T.mode	@ltx/gr_gr_cog/miscellanea:misc.Mode4
ltx/gr_gr_cog/me.m04.d05:meMA.Ode7C1T.ode	@ltx/gr_gr_cog/miscellanea:misc.Ode7
ltx/gr_gr_cog/me.m04.d05:meMA.Ode7C1T.text	Ὡς τοῦ Ὑψίστου, θρόνον Παρθένε ὑψηλότατον, πάντες, καὶ χρυσῆν λυχνίαν καὶ κιβωτόν, ἁγιάσματος ὑμνοῦμέν σε· Εὐλογημένη σὺ ἐν γυναιξί, βοῶντες Πανάμωμε.
ltx/gr_gr_cog/me.m04.d05:meMA.Ode8C11.greekmelody	@ltx/gr_gr_cog/he.h.m4:heHE.CheirasEkpetasasDaniil.greekname
ltx/gr_gr_cog/me.m04.d05:meMA.Ode8C11.incipit	Χεῖρας ἀνυψοῦντες πρὸς Θεόν, θεομακάριστοι…
ltx/gr_gr_cog/me.m04.d05:meMA.Ode8C11.melody	@ltx/gr_gr_cog/he.h.m4:heHE.CheirasEkpetasasDaniil.name
ltx/gr_gr_cog/me.m04.d05:meMA.Ode8C11.mode	@ltx/gr_gr_cog/miscellanea:misc.Mode4
ltx/gr_gr_cog/me.m04.d05:meMA.Ode8C11.ode	@ltx/gr_gr_cog/miscellanea:misc.Ode8
ltx/gr_gr_cog/me.m04.d05:meMA.Ode8C11.text	Χεῖρας ἀνυψοῦντες πρὸς Θεόν, θεομακάριστοι, σῴζειν δυνάμενον, πόνους στρεβλώσεων φέροντες, πολυτρόπων ὑπεμείνατε, καὶ νικηφόροι πρὸς αὐτὸν βοῶντες ἤρθητε· Εὐλογεῖτε, πάντα τὰ ἔργα Κυρίου τὸν Κύριον.
ltx/gr_gr_cog/me.m04.d05:meMA.Ode8C12.incipit	Ἀνυμνολογήσωμεν πιστοί, Παππίαν σήμερον, καὶ…
ltx/gr_gr_cog/me.m04.d05:meMA.Ode8C12.melody	@ltx/gr_gr_cog/he.h.m4:heHE.CheirasEkpetasasDaniil.name
ltx/gr_gr_cog/me.m04.d05:meMA.Ode8C12.mode	@ltx/gr_gr_cog/miscellanea:misc.Mode4
ltx/gr_gr_cog/me.m04.d05:meMA.Ode8C12.ode	@ltx/gr_gr_cog/miscellanea:misc.Ode8
ltx/gr_gr_cog/me.m04.d05:meMA.Ode8C12.text	Ἀνυμνολογήσωμεν πιστοί, Παππίαν σήμερον, καὶ Σεραπίωνα, καὶ τὸν Διόδωρον, Κλαύδιον, Νικηφόρον καὶ Οὐΐκτωρα, Οὐϊκτωρῖνόν τε ὁμοῦ, Χριστοῦ τοὺς Μάρτυρας, μελῳδοῦντες· Πάντα τὰ ἔργα ὑμνεῖτε τὸν Κύριον.
ltx/gr_gr_cog/me.m04.d05:meMA.Ode8C13.incipit	Ῥεύσαντα τὰ αἵματα ὑμῶν, Μεγαλομάρτυρες…
ltx/gr_gr_cog/me.m04.d05:meMA.Ode8C13.melody	@ltx/gr_gr_cog/he.h.m4:heHE.CheirasEkpetasasDaniil.name
ltx/gr_gr_cog/me.m04.d05:meMA.Ode8C13.mode	@ltx/gr_gr_cog/miscellanea:misc.Mode4
ltx/gr_gr_cog/me.m04.d05:meMA.Ode8C13.ode	@ltx/gr_gr_cog/miscellanea:misc.Ode8
ltx/gr_gr_cog/me.m04.d05:meMA.Ode8C13.text	Ῥεύσαντα τὰ αἵματα ὑμῶν, Μεγαλομάρτυρες, τὴν γῆν ἡγίασαν, τῆς ἀπιστίας δὲ ἔστησαν, θείᾳ χάριτι τὰ ῥεύματα, καὶ τῶν βοώντων τὰς ψυχὰς πλουσίως ἤρδευσαν· Εὐλογεῖτε, πάντα τὰ ἔργα Κυρίου τὸν Κύριον.
ltx/gr_gr_cog/me.m04.d05:meMA.Ode8C14.incipit	Ἱερολογίαις ἱεραῖς, Πατέρα ἄναρχον, Υἱὸν…
ltx/gr_gr_cog/me.m04.d05:meMA.Ode8C14.melody	@ltx/gr_gr_cog/he.h.m4:heHE.CheirasEkpetasasDaniil.name
ltx/gr_gr_cog/me.m04.d05:meMA.Ode8C14.mode	@ltx/gr_gr_cog/miscellanea:misc.Mode4
ltx/gr_gr_cog/me.m04.d05:meMA.Ode8C14.ode	@ltx/gr_gr_cog/miscellanea:misc.Ode8
ltx/gr_gr_cog/me.m04.d05:meMA.Ode8C14.text	Ἱερολογίαις ἱεραῖς, Πατέρα ἄναρχον, Υἱὸν συναναρχον, καὶ Πνεῦμα Ἅγιον μέλψωμεν, ὁμοδύναμον Θεότητα, ὁμοβασίλειον ζωήν, καὶ ἀνακράξωμεν· Εὐλογεῖτε, πάντα τὰ ἔργα Κυρίου τὸν Κύριον.
ltx/gr_gr_cog/me.m04.d05:meMA.Ode8C1H.greekmelody	@ltx/gr_gr_cog/he.h.m4:heHE.CheirasEkpetasasDaniil.greekname
ltx/gr_gr_cog/me.m04.d05:meMA.Ode8C1H.incipit	@ltx/gr_gr_cog/he.h.m4:heHE.CheirasEkpetasasDaniil.incipit
ltx/gr_gr_cog/me.m04.d05:meMA.Ode8C1H.melody	@ltx/gr_gr_cog/he.h.m4:heHE.CheirasEkpetasasDaniil.melody
ltx/gr_gr_cog/me.m04.d05:meMA.Ode8C1H.mode	@ltx/gr_gr_cog/miscellanea:misc.Mode4
ltx/gr_gr_cog/me.m04.d05:meMA.Ode8C1H.ode	@ltx/gr_gr_cog/miscellanea:misc.Ode8
ltx/gr_gr_cog/me.m04.d05:meMA.Ode8C1H.text	@ltx/gr_gr_cog/he.h.m4:heHE.CheirasEkpetasasDaniil.text
ltx/gr_gr_cog/me.m04.d05:meMA.Ode8C1T.incipit	Νοὸς ὁ φρικτός σου τοκετός…
ltx/gr_gr_cog/me.m04.d05:meMA.Ode8C1T.melody	@ltx/gr_gr_cog/he.h.m4:heHE.CheirasEkpetasasDaniil.name
ltx/gr_gr_cog/me.m04.d05:meMA.Ode8C1T.mode	@ltx/gr_gr_cog/miscellanea:misc.Mode4
ltx/gr_gr_cog/me.m04.d05:meMA.Ode8C1T.ode	@ltx/gr_gr_cog/miscellanea:misc.Ode8
ltx/gr_gr_cog/me.m04.d05:meMA.Ode8C1T.text	Νοὸς ὁ φρικτός σου τοκετός, νικᾷ κατάληψιν, Θεοχαρίτωτε· Θεὸς γὰρ πέφυκεν ἄναρχος, χρονικὴν ἀρχὴν δεξάμενος, διὰ τὸ σῶσαι τοὺς πιστῶς αὐτῷ κραυγάζοντας· Εὐλογεῖτε, πάντα τὰ ἔργα Κυρίου τὸν Κύριον.
ltx/gr_gr_cog/me.m04.d05:meMA.Ode9C11.greekmelody	@ltx/gr_gr_cog/he.h.m4:heHE.LithosAcheirotmitos.greekname
ltx/gr_gr_cog/me.m04.d05:meMA.Ode9C11.incipit	Ἴχνεσι σεπτῶν παθημάτων, ἀκολουθοῦντες, Ἀθλοφόροι…
ltx/gr_gr_cog/me.m04.d05:meMA.Ode9C11.melody	@ltx/gr_gr_cog/he.h.m4:heHE.LithosAcheirotmitos.name
ltx/gr_gr_cog/me.m04.d05:meMA.Ode9C11.mode	@ltx/gr_gr_cog/miscellanea:misc.Mode4
ltx/gr_gr_cog/me.m04.d05:meMA.Ode9C11.ode	@ltx/gr_gr_cog/miscellanea:misc.Ode9
ltx/gr_gr_cog/me.m04.d05:meMA.Ode9C11.text	Ἴχνεσι σεπτῶν παθημάτων, ἀκολουθοῦντες, Ἀθλοφόροι, πᾶσαν ὑπεμείνατε πεῖραν, κολαστηρίων στεῤῥῷ φρονήματι· καὶ εὐκλεῶς τεθνήξαντες, εἰς τοὺς αἰῶνας μακαρίζεσθε.
ltx/gr_gr_cog/me.m04.d05:meMA.Ode9C12.incipit	Ὥσπερ προσφορὰ καὶ θυσία, εὐωδεστάτη…
ltx/gr_gr_cog/me.m04.d05:meMA.Ode9C12.melody	@ltx/gr_gr_cog/he.h.m4:heHE.LithosAcheirotmitos.name
ltx/gr_gr_cog/me.m04.d05:meMA.Ode9C12.mode	@ltx/gr_gr_cog/miscellanea:misc.Mode4
ltx/gr_gr_cog/me.m04.d05:meMA.Ode9C12.ode	@ltx/gr_gr_cog/miscellanea:misc.Ode9
ltx/gr_gr_cog/me.m04.d05:meMA.Ode9C12.text	Ὥσπερ προσφορὰ καὶ θυσία, εὐωδεστάτη προσαχθέντες, τῇ ἐπουρανίῳ τραπέζῃ, τῶν πρωτοτόκων κατεφαιδρύνατε, τὴν Ἐκκλησίαν Μάρτυρες, ὑπὲρ τὸν ἥλιον ἐκλάμποντες.
ltx/gr_gr_cog/me.m04.d05:meMA.Ode9C13.incipit	Σήμερον πιστοὶ συνελθόντες, Οὐϊκτωρῖνον τὸν…
ltx/gr_gr_cog/me.m04.d05:meMA.Ode9C13.melody	@ltx/gr_gr_cog/he.h.m4:heHE.LithosAcheirotmitos.name
ltx/gr_gr_cog/me.m04.d05:meMA.Ode9C13.mode	@ltx/gr_gr_cog/miscellanea:misc.Mode4
ltx/gr_gr_cog/me.m04.d05:meMA.Ode9C13.ode	@ltx/gr_gr_cog/miscellanea:misc.Ode9
ltx/gr_gr_cog/me.m04.d05:meMA.Ode9C13.text	Σήμερον πιστοὶ συνελθόντες, Οὐϊκτωρῖνον τὸν γενναῖον, Κλαύδιον, Παππίαν τε θεῖον, Διόδωρόν τε καὶ Σεραπίωνα, καὶ τὸν σοφὸν Οὐΐκτωρα, καὶ Νικηφόρον μακαρίσωμεν.
ltx/gr_gr_cog/me.m04.d05:meMA.Ode9C14.incipit	Ἡ πλησιφαὴς ὑμῶν μνήμη, ἐξανατείλασα…
ltx/gr_gr_cog/me.m04.d05:meMA.Ode9C14.melody	@ltx/gr_gr_cog/he.h.m4:heHE.LithosAcheirotmitos.name
ltx/gr_gr_cog/me.m04.d05:meMA.Ode9C14.mode	@ltx/gr_gr_cog/miscellanea:misc.Mode4
ltx/gr_gr_cog/me.m04.d05:meMA.Ode9C14.ode	@ltx/gr_gr_cog/miscellanea:misc.Ode9
ltx/gr_gr_cog/me.m04.d05:meMA.Ode9C14.text	Ἡ πλησιφαὴς ὑμῶν μνήμη, ἐξανατείλασα φωτίζει, πᾶσαν τοῦ Χριστοῦ Ἐκκλησίαν, σεπτοὶ ὁπλῖται, ἐν ᾗ πρεσβεύσατε, ἁμαρτημάτων ἄφεσιν, ἡμῖν δοθῆναι ἀξιάγαστοι.
ltx/gr_gr_cog/me.m04.d05:meMA.Ode9C1H.greekmelody	@ltx/gr_gr_cog/he.h.m4:heHE.LithosAcheirotmitos.greekname
ltx/gr_gr_cog/me.m04.d05:meMA.Ode9C1H.incipit	@ltx/gr_gr_cog/he.h.m4:heHE.LithosAcheirotmitos.incipit
ltx/gr_gr_cog/me.m04.d05:meMA.Ode9C1H.melody	@ltx/gr_gr_cog/he.h.m4:heHE.LithosAcheirotmitos.melody
ltx/gr_gr_cog/me.m04.d05:meMA.Ode9C1H.mode	@ltx/gr_gr_cog/miscellanea:misc.Mode4
ltx/gr_gr_cog/me.m04.d05:meMA.Ode9C1H.ode	@ltx/gr_gr_cog/miscellanea:misc.Ode9
ltx/gr_gr_cog/me.m04.d05:meMA.Ode9C1H.text	@ltx/gr_gr_cog/he.h.m4:heHE.LithosAcheirotmitos.text
ltx/gr_gr_cog/me.m04.d05:meMA.Ode9C1T.incipit	Φέρουσα Χριστὸν ἐν ἀγκάλαις, σάρκα…
ltx/gr_gr_cog/me.m04.d05:meMA.Ode9C1T.melody	@ltx/gr_gr_cog/he.h.m4:heHE.LithosAcheirotmitos.name
ltx/gr_gr_cog/me.m04.d05:meMA.Ode9C1T.mode	@ltx/gr_gr_cog/miscellanea:misc.Mode4
ltx/gr_gr_cog/me.m04.d05:meMA.Ode9C1T.ode	@ltx/gr_gr_cog/miscellanea:misc.Ode9
ltx/gr_gr_cog/me.m04.d05:meMA.Ode9C1T.text	Φέρουσα Χριστὸν ἐν ἀγκάλαις, σάρκα θνητὴν ἐκ σοῦ λαβόντα, τοῦτον ἐκδυσώπει Παρθένε, ἀθανασίας τυχεῖν Πανάμωμε, τοὺς σὲ πιστῶς γεραίροντας, καὶ Θεοτόκον μεγαλύνοντας.
ltx/gr_gr_cog/me.m04.d05:meVE.Apolytikion1ger.greekmelody	@ltx/gr_gr_cog/he.a.m3:heAU.TheiasPisteos.greekname
ltx/gr_gr_cog/me.m04.d05:meVE.Apolytikion1ger.incipit	Θείας πίστεως, τῇ ἀναλάμψει, ὁ…
ltx/gr_gr_cog/me.m04.d05:meVE.Apolytikion1ger.melody	@ltx/gr_gr_cog/he.a.m3:heAU.TheiasPisteos.name
ltx/gr_gr_cog/me.m04.d05:meVE.Apolytikion1ger.mode	@ltx/gr_gr_cog/miscellanea:misc.Mode3
ltx/gr_gr_cog/me.m04.d05:meVE.Apolytikion1ger.poet	@ltx/gr_gr_cog/poets:po.Gerasimou
ltx/gr_gr_cog/me.m04.d05:meVE.Apolytikion1ger.text	Θείας πίστεως, τῇ ἀναλάμψει, ὁ ἑπτάριθμος, Μαρτύρων δῆμος, ὡς λυχνία ἀνεδείχθη ἑπτάφωτος, ταῖς τῶν ἀγώνων ἐνθέοις λαμπρότησι, φωταγωγοῦντες τοὺς πίστει κραυγάζοντας· Θεῖοι Μάρτυρες, Χριστῷ τῷ Θεῷ πρεσβεύσατε, δωρήσασθαι ἡμῖν τὸ μέγα ἔλεος.
ltx/gr_gr_cog/me.m04.d05:meVE.SticStavrotheotokion.greekmelody	@ltx/gr_gr_cog/he.a.m4:heAU.OsGennaionEnMartysi.greekname
ltx/gr_gr_cog/me.m04.d05:meVE.SticStavrotheotokion.incipit	@ltx/gr_gr_cog/oc.m4.d4:ocVE.AposTheotokion.incipit
ltx/gr_gr_cog/me.m04.d05:meVE.SticStavrotheotokion.melody	@ltx/gr_gr_cog/he.a.m4:heAU.OsGennaionEnMartysi.name
ltx/gr_gr_cog/me.m04.d05:meVE.SticStavrotheotokion.mode	@ltx/gr_gr_cog/miscellanea:misc.Mode4
ltx/gr_gr_cog/me.m04.d05:meVE.SticStavrotheotokion.text	@ltx/gr_gr_cog/oc.m4.d4:ocVE.AposTheotokion.text
ltx/gr_gr_cog/me.m04.d05:meVE.SticTheotokion.greekmelody	@ltx/gr_gr_cog/he.a.m4:heAU.OsGennaionEnMartysi.greekname
ltx/gr_gr_cog/me.m04.d05:meVE.SticTheotokion.incipit	Τὴν σκηνὴν τὴν ἀμόλυντον, τὴν…
ltx/gr_gr_cog/me.m04.d05:meVE.SticTheotokion.melody	@ltx/gr_gr_cog/he.a.m4:heAU.OsGennaionEnMartysi.name
ltx/gr_gr_cog/me.m04.d05:meVE.SticTheotokion.mode	@ltx/gr_gr_cog/miscellanea:misc.Mode4
ltx/gr_gr_cog/me.m04.d05:meVE.SticTheotokion.text	Τὴν σκηνὴν τὴν ἀμόλυντον, τὴν νεφέλην τὴν ἔμψυχον, τὸν ναὸν τὸν ἅγιον, τοῦ Θεοῦ ἡμῶν, τὴν ἀδιάβατον γέφυραν, τὴν στάμνον, τὴν πάγχρυσον, τὴν ἁγίαν κιβωτόν, τὴν μετάρσιον κλίμακα, τὸ εὐρύχωρον, τοῦ Δεσπότου χωρίον, τὴν Παρθένον, καὶ Μητέρα τοῦ Κυρίου, περιφανῶς μακαρίσωμεν.
ltx/gr_gr_cog/me.m04.d05:meVE.Stichera01.greekmelody	@ltx/gr_gr_cog/he.a.m4:heAU.OsGennaionEnMartysi.greekname
ltx/gr_gr_cog/me.m04.d05:meVE.Stichera01.incipit	Ὀφθαλμοὺς ἐκκεντούμενοι, καὶ δακτύλους κοπτόμενοι…
ltx/gr_gr_cog/me.m04.d05:meVE.Stichera01.melody	@ltx/gr_gr_cog/he.a.m4:heAU.OsGennaionEnMartysi.name
ltx/gr_gr_cog/me.m04.d05:meVE.Stichera01.mode	@ltx/gr_gr_cog/miscellanea:misc.Mode4
ltx/gr_gr_cog/me.m04.d05:meVE.Stichera01.text	Ὀφθαλμοὺς ἐκκεντούμενοι, καὶ δακτύλους κοπτόμενοι, καὶ πλευρὰς ξεόμενοι, καὶ κρεμάμενοι, καὶ τὰ ὀστᾶ συντριβόμενοι, καὶ ξίφει τεμνόμενοι, μεληδὸν καὶ κεφαλήν, τοῦ δολίου συντρίψαντες, οὐκ ἠρνήσασθε, τὸν Σωτῆρα τῶν ὅλων, οὐ ξοάνοις, ἐπεθύσατε ἀλόγως, Μεγαλομαρτυρες ἔνδοξοι.
ltx/gr_gr_cog/me.m04.d05:meVE.Stichera02.incipit	Σὺν Κλαυδίῳ τιμήσωμεν, Νικηφόρον τὸν…
ltx/gr_gr_cog/me.m04.d05:meVE.Stichera02.melody	@ltx/gr_gr_cog/he.a.m4:heAU.OsGennaionEnMartysi.name
ltx/gr_gr_cog/me.m04.d05:meVE.Stichera02.mode	@ltx/gr_gr_cog/miscellanea:misc.Mode4
ltx/gr_gr_cog/me.m04.d05:meVE.Stichera02.text	Σὺν Κλαυδίῳ τιμήσωμεν, Νικηφόρον τὸν ἔνδοξον, τὸν σεπτὸν Διόδωρον καὶ Οὐΐκτωρα, Οὐϊκτωρῖνον Παππίαν τε, καὶ τὸν Σεραπίωνα, τὸν ἑπτάριθμον χορόν, τὸ πανάγιον ἄθροισμα, τὴν ὁλόκληρον, ἐκκλησίαν, τὸν δῆμον τὸν ἁπάσας, τῶν δαιμόνων μυριάδας, ξίφει ἀνδρείας συγκόψαντα.
ltx/gr_gr_cog/me.m04.d05:meVE.Stichera03.incipit	Οἱ τὸ πάθος τὸ ἅγιον…
ltx/gr_gr_cog/me.m04.d05:meVE.Stichera03.melody	@ltx/gr_gr_cog/he.a.m4:heAU.OsGennaionEnMartysi.name
ltx/gr_gr_cog/me.m04.d05:meVE.Stichera03.mode	@ltx/gr_gr_cog/miscellanea:misc.Mode4
ltx/gr_gr_cog/me.m04.d05:meVE.Stichera03.text	Οἱ τὸ πάθος τὸ ἅγιον, τοῦ Χριστοῦ μιμησάμενοι, καὶ τῇ θείᾳ χάριτι φυγαδεύοντες, πάθη ψυχῆς τε καὶ σώματος, οἱ στῦλοι οἱ ἄσειστοι, οἱ φωστῆρες τῶν πιστῶν, οἱ τὸν δόλιον κτείναντες, οἱ πανεύδιοι, τῶν ἐν ζάλῃ λιμένες, οἱ τὰ ἄνω κατοικοῦντες ἐπαξίως, μεγαλυνέσθωσαν Μάρτυρες.
