ltx/gr_gr_cog/sy.m10.d22:cl.syMA.commemoration01.text	[saint/com 1]
ltx/gr_gr_cog/sy.m10.d22:cl.syMA.commemoration02.text	[saint/com 2]
ltx/gr_gr_cog/sy.m10.d22:cl.syMA.commemoration03.text	[saint/com 3]
ltx/gr_gr_cog/sy.m10.d22:cl.syMA.commemoration04.text	[saint/com 4]
ltx/gr_gr_cog/sy.m10.d22:cl.syMA.commemoration05.text	[saint/com 5]
ltx/gr_gr_cog/sy.m10.d22:cl.syMA.commemoration06.text	[saint/com list]
ltx/gr_gr_cog/sy.m10.d22:syMA.commemoration01.couplet1.title	@ltx/gr_gr_cog/titles:ti.Verses
ltx/gr_gr_cog/sy.m10.d22:syMA.commemoration01.couplet1.verse1	Δοὺς Ἀβέρκιος χοῦν χοΐ θνητῶν νόμῳ,
ltx/gr_gr_cog/sy.m10.d22:syMA.commemoration01.couplet1.verse2	Θεὸς Θεῷ πρόσεισι, τῷ φύσει θέσει.
ltx/gr_gr_cog/sy.m10.d22:syMA.commemoration01.narration.p01	Οὗτος γέγονεν Ἱεραπόλεως Ἐπίσκοπος, Φρυγίας Σαλουταρίας, ἐπὶ τῆς βασιλείας Μάρκου Ἀντωνίνου, θαυμάτων πολλῶν καὶ ἰάσεων αὐτουργός. Οἴνου γὰρ καὶ ἐλαίου μετὰ καὶ ἑτέρου εἴδους ἐν ἀγγείῳ βληθέντων ἑνί, ἀσύγχυτον φυλαχθῆναι αὐτῶν τὴν κρᾶσιν πεποίηκε διʼ εὐχῆς· καὶ λίθον μέγιστον προσέταξεν ἀνακομισθῆναι παρὰ τοῦ δαίμονος ἀπὸ Ῥώμης εἰς Φρυγίαν· ὃν καὶ ἀντὶ στήλης τῷ τάφῳ αὑτοῦ προσέπηξε· καὶ θερμὰ ὕδατα διὰ προσευχῆς ἀπὸ τῶν τῆς γῆς λαγόνων ἐξήνεγκεν. Οὕτω βιώσας ἐν ὁσιότητι καὶ δικαιοσύνῃ τὸ λειπόμενον τῆς ζωῆς, πρὸς Κύριον ἐξεδήμησεν.
ltx/gr_gr_cog/sy.m10.d22:syMA.commemoration01.single1	Εἰκάδι δευτερίῃ Ἀβέρκιος ᾤχετο γαίης.
ltx/gr_gr_cog/sy.m10.d22:syMA.commemoration01.text	Τῇ ΚΒʹ τοῦ αὐτοῦ μηνὸς μνήμη τοῦ ἐν ἁγίοις πατρὸς ἡμῶν καὶ Ἰσαποστόλου Ἀβερκίου, Ἐπισκόπου Ἱεραπόλεως, τοῦ Θαυματουργοῦ.
ltx/gr_gr_cog/sy.m10.d22:syMA.commemoration02.couplet1.title	@ltx/gr_gr_cog/titles:ti.Verses
ltx/gr_gr_cog/sy.m10.d22:syMA.commemoration02.couplet1.verse1	Παῖδες λιπόντες πρὸς μικρὸν μακροὺς ὕπνους.
ltx/gr_gr_cog/sy.m10.d22:syMA.commemoration02.couplet1.verse2	Ὕπνωσαν αὖθις τὸν μετʼ εἰρήνης ὕπνον*.
ltx/gr_gr_cog/sy.m10.d22:syMA.commemoration02.text	Τῇ αὐτῇ ἡμέρᾳ μνήμη τῶν ἁγίων ἑπτὰ Παίδων τῶν ἐν Ἐφέσῳ, Μαξιμιλιανοῦ, Ἰαμβλίχου, Μαρτινιανοῦ, Διονυσίου, Ἀντωνίνου, Ἐξακουστωδιανοῦ καὶ Ἰωάννου.
ltx/gr_gr_cog/sy.m10.d22:syMA.commemoration03.couplet1.title	@ltx/gr_gr_cog/titles:ti.Verses
ltx/gr_gr_cog/sy.m10.d22:syMA.commemoration03.couplet1.verse1	Τμηθεὶς ὁ σεπτὸς Ἀλέξανδρος αὐχένα,
ltx/gr_gr_cog/sy.m10.d22:syMA.commemoration03.couplet1.verse2	Καὶ Μάρτυς ἐστίν, οὐ θύτης Χριστοῦ μόνον.
ltx/gr_gr_cog/sy.m10.d22:syMA.commemoration03.couplet2.verse1	Θεοδότην ἄγχουσι καὶ Γλυκερίαν,
ltx/gr_gr_cog/sy.m10.d22:syMA.commemoration03.couplet2.verse2	Θεοῦ γλυκείας ἠγαπηκυίας δόσεις.
ltx/gr_gr_cog/sy.m10.d22:syMA.commemoration03.couplet3.verse1	«Στῶμεν καλῶς, καὶ θῶμεν αὐχένας ξίφει»,
ltx/gr_gr_cog/sy.m10.d22:syMA.commemoration03.couplet3.verse2	Ἀθληφόροι λέγουσιν ἀλλήλαις δύο.
ltx/gr_gr_cog/sy.m10.d22:syMA.commemoration03.narration.p01	Ὁ ἅγιος Μάρτυς Ἀλέξανδρος, Ἐπίσκοπος ὢν καὶ πολλοὺς διδάσκων καὶ ἐπιστρέφων καὶ βαπτίζων, ἐκρατήθη παρὰ τοῦ ἡγεμόνος καὶ πολλὰ τιμωρηθεὶς καὶ ξεσθεὶς καὶ ἀναγκασθεὶς θῦσαι τοῖς εἰδώλοις, οὐκ ἐπείσθη. Ἰδὼν δὲ τὴν καρτερίαν αὐτοῦ Ἡράκλειος ὁ στρατιώτης, ἐπίστευσε τῷ Χριστῷ, καὶ πολλὰ καὶ αὐτὸς τιμωρηθεὶς πρότερον, ἀπετμήθη τὴν κεφαλήν. Θαυματουργήσας δὲ ὁ ἅγιος Ἀλέξανδρος, ἔτι δὲ καὶ γενόμενος ἐκ τῶν πληγῶν ὑγιής, τῇ τοῦ Κυρίου ἐπισκέψει καὶ χάριτι, ἐπεσπάσατο πρὸς τὴν τοῦ Χριστοῦ πίστιν καὶ γυναῖκας τινὰς τέσσαρας, Θεοδότην καὶ Γλυκερίαν, Ἄνναν καὶ Ἐλισάβετ, αἵτινες ἐνώπιον τοῦ ἡγεμόνος ἐλέγξασαι τὴν τῶν εἰδώλων πλάνην, τὰς κεφαλὰς ἐπετμήθησαν. Ὕστερον δὲ πάντων καὶ ὁ ἅγιος Ἀλέξανδρος, τῷ ξίφει κρουσθείς, ἐτελειώθη.
ltx/gr_gr_cog/sy.m10.d22:syMA.commemoration03.text	Τῇ αὐτῇ ἡμέρᾳ μνήμη τῶν ἁγίων Μαρτύρων Ἀλεξάνδρου Ἐπισκόπου καὶ Ἡρακλείου, Θεοδότης καὶ Γλυκερίας, Ἄννης καὶ Ἐλισάβετ.
ltx/gr_gr_cog/sy.m10.d22:syMA.lastline	Ταῖς αὐτῶν ἁγίαις πρεσβείαις, ὁ Θεός, ἐλέησον ἡμᾶς. Ἀμήν.
ltx/gr_gr_cog/sy.m10.d22:syMA.note1	Τὸ δὲ Συναξάριον αὐτῶν ὅρα εἰς τὴν τετάρτην τοῦ Αὐγούστου.
