ltx/gr_gr_cog/eo.e08:eo.Doxasticon.incipit	Τὰ τῆς Μαρίας δάκρυα…
ltx/gr_gr_cog/eo.e08:eo.Doxasticon.mode	@ltx/gr_gr_cog/miscellanea:misc.Mode8
ltx/gr_gr_cog/eo.e08:eo.Doxasticon.text	Τὰ τῆς Μαρίας δάκρυα οὐ μάτην χεῖνται θερμῶς· ἰδοὺ γὰρ κατηξίωται, καὶ διδασκόντων Ἀγγέλων, καὶ τῆς ὄψεως τῆς σῆς, ὦ Ἰησοῦ· ἀλλʼ ἔτι πρόσγεια φρονεῖ, οἷα γυνὴ ἀσθενής· διὸ καὶ ἀποπέμπεται, μὴ προσψαῦσαί σοι Χριστέ. Ἀλλʼ ὅμως κήρυξ πέμπεται τοῖς σοῖς Μαθηταῖς, οἷς εὐαγγέλια ἔφησε, τὴν πρὸς τὸν πατρῷον κλῆρον ἄνοδον ἀπαγγέλλουσα. Μεθʼ ἧς ἀξίωσον καὶ ἡμᾶς, τῆς ἐμφανείας σου, Δέσποτα Κύριε.
ltx/gr_gr_cog/eo.e08:eo.Exaposteilarion.greekmelody	@ltx/gr_gr_cog/he.a.m2:heAU.ToisMathitaisSynelthomen.greekname
ltx/gr_gr_cog/eo.e08:eo.Exaposteilarion.incipit	Δύο Ἀγγέλους βλέψασα…
ltx/gr_gr_cog/eo.e08:eo.Exaposteilarion.melody	@ltx/gr_gr_cog/he.a.m2:heAU.ToisMathitaisSynelthomen.name
ltx/gr_gr_cog/eo.e08:eo.Exaposteilarion.mode	@ltx/gr_gr_cog/miscellanea:misc.Mode2
ltx/gr_gr_cog/eo.e08:eo.Exaposteilarion.text	Δύο Ἀγγέλους βλέψασα, ἔνδοθεν τοῦ μνημείου, Μαρία ἐξεπλήττετο, καὶ Χριστὸν ἀγνοοῦσα, ὡς κηπουρὸν ἐπηρώτα· Κύριε ποῦ τὸ σῶμα, τοῦ Ἰησοῦ μου τέθεικας; κλήσει δὲ τοῦτον γνοῦσα, εἶναι αὐτόν, τὸν Σωτῆρα ἤκουσε· Μή μου ἅπτου, πρὸς τὸν Πατέρα ἄπειμι, εἰπὲ τοῖς ἀδελφοῖς μου.
ltx/gr_gr_cog/eo.e08:eo.Theotokion.incipit	Τριάδος Κόρη τέτοκας…
ltx/gr_gr_cog/eo.e08:eo.Theotokion.melody	@ltx/gr_gr_cog/he.a.m2:heAU.ToisMathitaisSynelthomen.name
ltx/gr_gr_cog/eo.e08:eo.Theotokion.mode	@ltx/gr_gr_cog/miscellanea:misc.Mode2
ltx/gr_gr_cog/eo.e08:eo.Theotokion.text	Τριάδος Κόρη τέτοκας, ἀποῤῥήτως τὸν ἕνα, διπλοῦν τῇ φύσει πέλοντα, καὶ διπλοῦν ἐνεργείᾳ, καὶ ἕνα τῇ ὑποστάσει· τοῦτον οὖν ἐκδυσώπει, ἀεὶ ὑπὲρ τῶν πίστει σε, προσκυνούντων, ἐκ πάσης ἐπιβουλῆς, τοῦ ἐχθροῦ λυτρώσασθαι, ὅτι πάντες, πρὸς σὲ νῦν καταφεύγομεν, Δέσποινα Θεοτόκε.
ltx/gr_gr_cog/eo.e08:eo.title	Τὸ Ηʹ Ἑωθινόν.
