ltx/gr_gr_cog/le.ep.mc.d125:lemcLI.Epistle.book_abbr	@ltx/gr_gr_cog/bible:Romans.abbr
ltx/gr_gr_cog/le.ep.mc.d125:lemcLI.Epistle.book_string	@ltx/gr_gr_cog/bible:Romans.text
ltx/gr_gr_cog/le.ep.mc.d125:lemcLI.Epistle.chapverse	2:14 – 28
ltx/gr_gr_cog/le.ep.mc.d125:lemcLI.Epistle.incipit	Ὅταν ἔθνη τὰ μὴ νόμον ἔχοντα…
ltx/gr_gr_cog/le.ep.mc.d125:lemcLI.Epistle.text	Ἀδελφοί, ὅταν ἔθνη τὰ μὴ νόμον ἔχοντα φύσει τὰ τοῦ νόμου ποιῇ, οὗτοι νόμον μὴ ἔχοντες ἑαυτοῖς εἰσι νόμος, οἵτινες ἐνδείκνυνται τὸ ἔργον τοῦ νόμου γραπτὸν ἐν ταῖς καρδίαις αὐτῶν, συμμαρτυρούσης αὐτῶν τῆς συνειδήσεως καὶ μεταξὺ ἀλλήλων τῶν λογισμῶν κατηγορούντων ἢ καὶ ἀπολογουμένων — ἐν ἡμέρᾳ ὅτε κρινεῖ ὁ Θεὸς τὰ κρυπτὰ τῶν ἀνθρώπων κατὰ τὸ εὐαγγέλιόν μου διὰ Ἰησοῦ Χριστοῦ. ῎Ιδε σὺ Ἰουδαῖος ἐπονομάζῃ, καὶ ἐπαναπαύῃ τῷ νόμῳ, καὶ καυχᾶσαι ἐν Θεῷ, καὶ γινώσκεις τὸ θέλημα, καὶ δοκιμάζεις τὰ διαφέροντα, κατηχούμενος ἐκ τοῦ νόμου, πέποιθάς τε σεαυτὸν ὁδηγὸν εἶναι τυφλῶν, φῶς τῶν ἐν σκότει, παιδευτὴν ἀφρόνων, διδάσκαλον νηπίων, ἔχοντα τὴν μόρφωσιν τῆς γνώσεως καὶ τῆς ἀληθείας ἐν τῷ νόμῳ. ὁ οὖν διδάσκων ἕτερον σεαυτὸν οὐ διδάσκεις; ὁ κηρύσσων μὴ κλέπτειν κλέπτεις; ὁ λέγων μὴ μοιχεύειν μοιχεύεις; ὁ βδελυσσόμενος τὰ εἴδωλα ἱεροσυλεῖς; ὃς ἐν νόμῳ καυχᾶσαι, διὰ τῆς παραβάσεως τοῦ νόμου τὸν Θεὸν ἀτιμάζεις; τὸ γὰρ ὄνομα τοῦ Θεοῦ δι᾿ ὑμᾶς βλασφημεῖται ἐν τοῖς ἔθνεσι, καθὼς γέγραπται. περιτομὴ μὲν γὰρ ὠφελεῖ, ἐὰν νόμον πράσσῃς· ἐὰν δὲ παραβάτης νόμου ᾖς, ἡ περιτομή σου ἀκροβυστία γέγονεν. ἐὰν οὖν ἡ ἀκροβυστία τὰ δικαιώματα τοῦ νόμου φυλάσσῃ, οὐχὶ ἡ ἀκροβυστία αὐτοῦ εἰς περιτομὴν λογισθήσεται; καὶ κρινεῖ ἡ ἐκ φύσεως ἀκροβυστία, τὸν νόμον τελοῦσα, σὲ τὸν διὰ γράμματος καὶ περιτομῆς παραβάτην νόμου. οὐ γὰρ ὁ ἐν τῷ φανερῷ Ἰουδαῖός ἐστιν, οὐδὲ ἡ ἐν τῷ φανερῷ ἐν σαρκὶ περιτομή.
ltx/gr_gr_cog/le.ep.mc.d125:lemcLI.Epistle.title	Τῇ Παρασκευῇ τῆς Αʹ Ἑβδομάδος
ltx/gr_gr_cog/le.ep.mc.d125:lemcLI.Epistle.title_abbr	Παρασκευῇ τῆς Αʹ Ἑβδομάδος
ltx/gr_gr_cog/le.ep.mc.d125:lemcLI.Epistle.version	@ltx/gr_gr_cog/properties:version.designation
