ltx/gr_gr_cog/me.m01.d03:meCO.C1.acrostic.notice1	οὗ ἡ Ἀκροστιχίς·
ltx/gr_gr_cog/me.m01.d03:meCO.C1.acrostic.text	Τετράδι ψαλῶ.
ltx/gr_gr_cog/me.m01.d03:meCO.C1.acrostic.title	Τριῴδιον,
ltx/gr_gr_cog/me.m01.d03:meCO.C1.poet	@ltx/gr_gr_cog/poets:po.SymeonTouLogothetou
ltx/gr_gr_cog/me.m01.d03:meCO.C1.title	Τριῴδιον.
ltx/gr_gr_cog/me.m01.d03:meCO.C1.verse	@ltx/gr_gr_cog/prayers:pr.verse_God.text
ltx/gr_gr_cog/me.m01.d03:meCO.C2.acrostic.notice1	οὗ ἡ Ἀκροστιχίς·
ltx/gr_gr_cog/me.m01.d03:meCO.C2.acrostic.text	Προσάββατόν τε.
ltx/gr_gr_cog/me.m01.d03:meCO.C2.acrostic.title	Ἕτερον Τριῴδιον,
ltx/gr_gr_cog/me.m01.d03:meCO.C2.title	Ἕτερον Τριῴδιον.
ltx/gr_gr_cog/me.m01.d03:meCO.C2.verse	@ltx/gr_gr_cog/prayers:pr.verse_God.text
ltx/gr_gr_cog/me.m01.d03:meCO.Ode3C11.incipit	Ἐν κενοῖς ἡ ἐπίνοια τοῦ…
ltx/gr_gr_cog/me.m01.d03:meCO.Ode3C11.melody	@ltx/gr_gr_cog/he.h.m2:heHE.TisPisteosEnPetra.name
ltx/gr_gr_cog/me.m01.d03:meCO.Ode3C11.mode	@ltx/gr_gr_cog/miscellanea:misc.Mode2
ltx/gr_gr_cog/me.m01.d03:meCO.Ode3C11.ode	@ltx/gr_gr_cog/miscellanea:misc.Ode3
ltx/gr_gr_cog/me.m01.d03:meCO.Ode3C11.text	Ἐν κενοῖς ἡ ἐπίνοια τοῦ Ἡρώδου, τοῦ μέλλοντας τυχεῖν τῆς ἐλευθερίας, ἀνόμως ἀνελόντος παῖδας· Χριστὸς γάρ, ὁ λυτρωτὴς ἡμῶν, ζωὴν χαρίζεται, πᾶσι τὴν ἀνώλεθρον βαπτιζόμενος.
ltx/gr_gr_cog/me.m01.d03:meCO.Ode3C12.incipit	Τὸ δεινὸν βουλευτήριον τοῦ Ἡρώδου…
ltx/gr_gr_cog/me.m01.d03:meCO.Ode3C12.melody	@ltx/gr_gr_cog/he.h.m2:heHE.TisPisteosEnPetra.name
ltx/gr_gr_cog/me.m01.d03:meCO.Ode3C12.mode	@ltx/gr_gr_cog/miscellanea:misc.Mode2
ltx/gr_gr_cog/me.m01.d03:meCO.Ode3C12.ode	@ltx/gr_gr_cog/miscellanea:misc.Ode3
ltx/gr_gr_cog/me.m01.d03:meCO.Ode3C12.text	Τὸ δεινὸν βουλευτήριον τοῦ Ἡρώδου, νηπίων πρὶν ἀπέκτεινε νεολαίαν, τὴν Βηθλεὲμ αἱμάτων πληρῶσαν, νῦν δέ, τῇ Ἐκκλησίᾳ Χριστὸς ἔρχεται, τέκνα πολλά, διὰ τοῦ Βαπτίσματος εἰσποιήσασθαι.
ltx/gr_gr_cog/me.m01.d03:meCO.Ode3C1H.incipit	@ltx/gr_gr_cog/he.h.m2:heHE.TisPisteosEnPetra.incipit
ltx/gr_gr_cog/me.m01.d03:meCO.Ode3C1H.melody	@ltx/gr_gr_cog/he.h.m2:heHE.TisPisteosEnPetra.melody
ltx/gr_gr_cog/me.m01.d03:meCO.Ode3C1H.mode	@ltx/gr_gr_cog/miscellanea:misc.Mode2
ltx/gr_gr_cog/me.m01.d03:meCO.Ode3C1H.ode	@ltx/gr_gr_cog/miscellanea:misc.Ode3
ltx/gr_gr_cog/me.m01.d03:meCO.Ode3C1H.text	@ltx/gr_gr_cog/he.h.m2:heHE.TisPisteosEnPetra.text
ltx/gr_gr_cog/me.m01.d03:meCO.Ode5C21.incipit	Ῥυφθέντες φρένας…
ltx/gr_gr_cog/me.m01.d03:meCO.Ode5C21.melody	@ltx/gr_gr_cog/he.h.m6:heHE.ProsSeOrthrizoEpiphany.name
ltx/gr_gr_cog/me.m01.d03:meCO.Ode5C21.mode	@ltx/gr_gr_cog/miscellanea:misc.Mode6
ltx/gr_gr_cog/me.m01.d03:meCO.Ode5C21.ode	@ltx/gr_gr_cog/miscellanea:misc.Ode5
ltx/gr_gr_cog/me.m01.d03:meCO.Ode5C21.text	Ῥυφθέντες φρένας, καὶ προκαθαρθέντες, μυστηρίου μεθέξει, φρικτῆς οἰκονομίας, ἅπαντες πιστοί, ἐρχομένῳ Χριστῷ, ὑπαντήσωμεν, Ἰορδάνου τοῖς ῥείθροις ἐκκαθᾶραι ἡμᾶς.
ltx/gr_gr_cog/me.m01.d03:meCO.Ode5C22.incipit	Ὁρᾶτε φίλοι…
ltx/gr_gr_cog/me.m01.d03:meCO.Ode5C22.melody	@ltx/gr_gr_cog/he.h.m6:heHE.ProsSeOrthrizoEpiphany.name
ltx/gr_gr_cog/me.m01.d03:meCO.Ode5C22.mode	@ltx/gr_gr_cog/miscellanea:misc.Mode6
ltx/gr_gr_cog/me.m01.d03:meCO.Ode5C22.ode	@ltx/gr_gr_cog/miscellanea:misc.Ode5
ltx/gr_gr_cog/me.m01.d03:meCO.Ode5C22.text	Ὁρᾶτε φίλοι, τὴν φωνὴν τοῦ Λόγου, τοῦ Ἡλίου τὸν λύχνον, τὸν φίλον τοῦ Νυμφίου· Μετανοεῖτε τοῖς λαοῖς ἐκβοῶντα, καὶ σπεύσατε καθαρθῆναι, τοῦ Κτίστου εἰς ὑπάντησιν.
ltx/gr_gr_cog/me.m01.d03:meCO.Ode5C2H.incipit	@ltx/gr_gr_cog/he.h.m6:heHE.ProsSeOrthrizoEpiphany.incipit
ltx/gr_gr_cog/me.m01.d03:meCO.Ode5C2H.melody	@ltx/gr_gr_cog/he.h.m6:heHE.ProsSeOrthrizoEpiphany.melody
ltx/gr_gr_cog/me.m01.d03:meCO.Ode5C2H.mode	@ltx/gr_gr_cog/miscellanea:misc.Mode6
ltx/gr_gr_cog/me.m01.d03:meCO.Ode5C2H.ode	@ltx/gr_gr_cog/miscellanea:misc.Ode5
ltx/gr_gr_cog/me.m01.d03:meCO.Ode5C2H.text	@ltx/gr_gr_cog/he.h.m6:heHE.ProsSeOrthrizoEpiphany.text
ltx/gr_gr_cog/me.m01.d03:meCO.Ode8C11.incipit	Ἀποκενοῦντες, δακρύων πηγὰς οἱ πιστοί…
ltx/gr_gr_cog/me.m01.d03:meCO.Ode8C11.melody	@ltx/gr_gr_cog/he.h.m2:heHE.RimaTyrannou.name
ltx/gr_gr_cog/me.m01.d03:meCO.Ode8C11.mode	@ltx/gr_gr_cog/miscellanea:misc.Mode2
ltx/gr_gr_cog/me.m01.d03:meCO.Ode8C11.ode	@ltx/gr_gr_cog/miscellanea:misc.Ode8
ltx/gr_gr_cog/me.m01.d03:meCO.Ode8C11.text	Ἀποκενοῦντες, δακρύων πηγὰς οἱ πιστοί, ἐξ ὀφθαλμῶν καθάρωμεν, πάντα ῥύπον ψυχῶν, καὶ φῶς ἐν φωτὶ τρισσὸν ὀψόμεθα, βαπτισθῆναι Χριστοῦ ἐρχομένου· ᾧ προσμαρτυρήσει Πατὴρ οὐρανόθεν, καὶ Πνεύματος Ἁγίου, λάμψει παρουσίᾳ, περιστερᾶς ἐν εἴδει.
ltx/gr_gr_cog/me.m01.d03:meCO.Ode8C12.incipit	Δάκρυον ἅπαν, Χριστὸς ἀφαιρούμενος, ἀπὸ…
ltx/gr_gr_cog/me.m01.d03:meCO.Ode8C12.melody	@ltx/gr_gr_cog/he.h.m2:heHE.RimaTyrannou.name
ltx/gr_gr_cog/me.m01.d03:meCO.Ode8C12.mode	@ltx/gr_gr_cog/miscellanea:misc.Mode2
ltx/gr_gr_cog/me.m01.d03:meCO.Ode8C12.ode	@ltx/gr_gr_cog/miscellanea:misc.Ode8
ltx/gr_gr_cog/me.m01.d03:meCO.Ode8C12.text	Δάκρυον ἅπαν, Χριστὸς ἀφαιρούμενος, ἀπὸ παντὸς προσώπου, προέρχεται ψυχῶν, πολυώδυνα νοσήματα, ἀνωδύνως ἐν ὕδατι παύων, καὶ παλαιωθέντας ἀνθρώπους, καινίζων τῇ παλιγγενεσίᾳ, τοὺς ὑμνολογοῦντας αὐτὸν εἰς τοὺς αἰῶνας.
ltx/gr_gr_cog/me.m01.d03:meCO.Ode8C13.incipit	Ἱερουργοῦνται, ψυχαὶ τοῦ Βαπτίσματος, τῷ…
ltx/gr_gr_cog/me.m01.d03:meCO.Ode8C13.melody	@ltx/gr_gr_cog/he.h.m2:heHE.RimaTyrannou.name
ltx/gr_gr_cog/me.m01.d03:meCO.Ode8C13.mode	@ltx/gr_gr_cog/miscellanea:misc.Mode2
ltx/gr_gr_cog/me.m01.d03:meCO.Ode8C13.ode	@ltx/gr_gr_cog/miscellanea:misc.Ode8
ltx/gr_gr_cog/me.m01.d03:meCO.Ode8C13.text	Ἱερουργοῦνται, ψυχαὶ τοῦ Βαπτίσματος, τῷ θεοσδότῳ λουτρῷ, καὶ Πνεύματος πυρί, τοῦ τὰ πάθη ἐκκαθαίροντος, καὶ τὴν ὕλην συμφλέγοντος πᾶσαν, μοχθηρὰς κακίας, καὶ χάριν διδόντος, βοᾶν ἐν κατανύξει· Σὲ ὑπερυψοῦμεν, Χριστὲ εἰς τοὺς αἰῶνας.
ltx/gr_gr_cog/me.m01.d03:meCO.Ode8C1H.incipit	@ltx/gr_gr_cog/he.h.m2:heHE.RimaTyrannou.incipit
ltx/gr_gr_cog/me.m01.d03:meCO.Ode8C1H.melody	@ltx/gr_gr_cog/he.h.m2:heHE.RimaTyrannou.melody
ltx/gr_gr_cog/me.m01.d03:meCO.Ode8C1H.mode	@ltx/gr_gr_cog/miscellanea:misc.Mode2
ltx/gr_gr_cog/me.m01.d03:meCO.Ode8C1H.ode	@ltx/gr_gr_cog/miscellanea:misc.Ode8
ltx/gr_gr_cog/me.m01.d03:meCO.Ode8C1H.text	@ltx/gr_gr_cog/he.h.m2:heHE.RimaTyrannou.text
ltx/gr_gr_cog/me.m01.d03:meCO.Ode8C21.incipit	Ἀπὸ βλεφάρων, ψυχῶν κακίας ὕπνον…
ltx/gr_gr_cog/me.m01.d03:meCO.Ode8C21.melody	@ltx/gr_gr_cog/he.h.m6:heHE.StilinKakiasTouDeinou.name
ltx/gr_gr_cog/me.m01.d03:meCO.Ode8C21.mode	@ltx/gr_gr_cog/miscellanea:misc.Mode6
ltx/gr_gr_cog/me.m01.d03:meCO.Ode8C21.ode	@ltx/gr_gr_cog/miscellanea:misc.Ode8
ltx/gr_gr_cog/me.m01.d03:meCO.Ode8C21.text	Ἀπὸ βλεφάρων, ψυχῶν κακίας ὕπνον ἐκτιναξάμενοι, τὰς πονηρίας ἀφελώμεθα, πιστοὶ καρδιῶν ἡμῶν, καὶ δάκρυσι θερμοῖς, λούσωμεν φρένας, θεαταὶ τοῦ ἐπιφανέντος, ὅπως ὀφθῶμεν, τὸν Χριστὸν δοξάζοντες εἰς τοὺς αἰῶνας.
ltx/gr_gr_cog/me.m01.d03:meCO.Ode8C22.incipit	Βέβηλον ἔπος, πονηρῶν ἐννοημάτων μὴ…
ltx/gr_gr_cog/me.m01.d03:meCO.Ode8C22.melody	@ltx/gr_gr_cog/he.h.m6:heHE.StilinKakiasTouDeinou.name
ltx/gr_gr_cog/me.m01.d03:meCO.Ode8C22.mode	@ltx/gr_gr_cog/miscellanea:misc.Mode6
ltx/gr_gr_cog/me.m01.d03:meCO.Ode8C22.ode	@ltx/gr_gr_cog/miscellanea:misc.Ode8
ltx/gr_gr_cog/me.m01.d03:meCO.Ode8C22.text	Βέβηλον ἔπος, πονηρῶν ἐννοημάτων μὴ προσενέγκωμεν, λόγον δὲ θεῖον μελετήσαντες, τοῖς ὕμνοις προσάξωμεν τῷ Λόγῳ, διʼ ἡμᾶς σαρκὶ φανέντι, καὶ φωτίζοντι τοὺς ἐν σκότει· ὂν πᾶσα κτίσις εὐλογεῖ, δοξάζουσα εἰς τοὺς αἰῶνας.
ltx/gr_gr_cog/me.m01.d03:meCO.Ode8C23.incipit	Βάθους σοφίας, κεκρυμμένον μυστήριον, νῦν…
ltx/gr_gr_cog/me.m01.d03:meCO.Ode8C23.melody	@ltx/gr_gr_cog/he.h.m6:heHE.StilinKakiasTouDeinou.name
ltx/gr_gr_cog/me.m01.d03:meCO.Ode8C23.mode	@ltx/gr_gr_cog/miscellanea:misc.Mode6
ltx/gr_gr_cog/me.m01.d03:meCO.Ode8C23.ode	@ltx/gr_gr_cog/miscellanea:misc.Ode8
ltx/gr_gr_cog/me.m01.d03:meCO.Ode8C23.text	Βάθους σοφίας, κεκρυμμένον μυστήριον, νῦν φανεροῦται βροτοῖς, Θεοῦ κριμάτων νῦν ἡ ἄβυσσος, πιστοῖς ἐκκαλύπτεται, Θεοῦ μετὰ σαρκὸς ἐν γῇ φανέντος, εἰς ἀνάπλασιν βροτείου γένους· ὂν πᾶσα κτίσις εὐλογεῖ, δοξάζουσα εἰς τοὺς αἰῶνας.
ltx/gr_gr_cog/me.m01.d03:meCO.Ode8C24.incipit	Ἀπαγορεύεις, Ἰωάννη ὅπερ δράσεις τάχος…
ltx/gr_gr_cog/me.m01.d03:meCO.Ode8C24.melody	@ltx/gr_gr_cog/he.h.m6:heHE.StilinKakiasTouDeinou.name
ltx/gr_gr_cog/me.m01.d03:meCO.Ode8C24.mode	@ltx/gr_gr_cog/miscellanea:misc.Mode6
ltx/gr_gr_cog/me.m01.d03:meCO.Ode8C24.ode	@ltx/gr_gr_cog/miscellanea:misc.Ode8
ltx/gr_gr_cog/me.m01.d03:meCO.Ode8C24.text	Ἀπαγορεύεις, Ἰωάννη ὅπερ δράσεις τάχος ὑπείκων μου· Ἄφες οὖν ἄρτι· οὕτω πρέπον γὰρ ἡμῖν ἐστιν ἅπασαν, πληρῶσαι ἀληθῶς δικαιοσύνην, ὁ Δεσπότης τῷ δούλῳ ἔφη· ὂν πᾶσα κτίσις εὐλογεῖ, δοξάζουσα εἰς τοὺς αἰῶνας.
ltx/gr_gr_cog/me.m01.d03:meCO.Ode8C2H.incipit	@ltx/gr_gr_cog/he.h.m6:heHE.StilinKakiasTouDeinou.incipit
ltx/gr_gr_cog/me.m01.d03:meCO.Ode8C2H.melody	@ltx/gr_gr_cog/he.h.m6:heHE.StilinKakiasTouDeinou.melody
ltx/gr_gr_cog/me.m01.d03:meCO.Ode8C2H.mode	@ltx/gr_gr_cog/miscellanea:misc.Mode6
ltx/gr_gr_cog/me.m01.d03:meCO.Ode8C2H.ode	@ltx/gr_gr_cog/miscellanea:misc.Ode8
ltx/gr_gr_cog/me.m01.d03:meCO.Ode8C2H.text	@ltx/gr_gr_cog/he.h.m6:heHE.StilinKakiasTouDeinou.text
ltx/gr_gr_cog/me.m01.d03:meCO.Ode9C11.incipit	Ἀγνώμων μηδείς, καὶ πρὸς Χριστὸν…
ltx/gr_gr_cog/me.m01.d03:meCO.Ode9C11.melody	@ltx/gr_gr_cog/he.h.m2:heHE.PsychaisKatharais.name
ltx/gr_gr_cog/me.m01.d03:meCO.Ode9C11.mode	@ltx/gr_gr_cog/miscellanea:misc.Mode2
ltx/gr_gr_cog/me.m01.d03:meCO.Ode9C11.ode	@ltx/gr_gr_cog/miscellanea:misc.Ode9
ltx/gr_gr_cog/me.m01.d03:meCO.Ode9C11.text	Ἀγνώμων μηδείς, καὶ πρὸς Χριστὸν ἀχάριστος, ἔστω τὸ μακρόθυμον τῆς ἀνοχῆς αὐτοῦ, καὶ χρηστότητος ὑβρίζων καταφρονήσει, ἀλλʼ ἐν φόβῳ καὶ χαρᾷ δουλεύσωμεν, αὐτῷ μελῳδοῦντες· Φεῖσαι τῶν ψυχῶν ἡμῶν, Χριστὲ ὁ Θεός, καὶ σῶσον ἡμᾶς,
ltx/gr_gr_cog/me.m01.d03:meCO.Ode9C12.incipit	Λέγει τοῖς λαοῖς, τῶν ἀπειθῶν…
ltx/gr_gr_cog/me.m01.d03:meCO.Ode9C12.melody	@ltx/gr_gr_cog/he.h.m2:heHE.PsychaisKatharais.name
ltx/gr_gr_cog/me.m01.d03:meCO.Ode9C12.mode	@ltx/gr_gr_cog/miscellanea:misc.Mode2
ltx/gr_gr_cog/me.m01.d03:meCO.Ode9C12.ode	@ltx/gr_gr_cog/miscellanea:misc.Ode9
ltx/gr_gr_cog/me.m01.d03:meCO.Ode9C12.text	Λέγει τοῖς λαοῖς, τῶν ἀπειθῶν ὁ Πρόδρομος· Τίς ὑμῖν ὑπέδειξεν, ἐκ τῆς ὀργῆς φυγεῖν, ἐχιδνῶν γεννήματα τῆς μελλούσης; μετανοίας οὖν καρπούς, ἐνδείξασθε ἀξίους βοῶντες· Φεῖσαι τῶν ψυχῶν ἡμῶν, Χριστὲ ὁ Θεός, καὶ σῶσον ἡμᾶς.
ltx/gr_gr_cog/me.m01.d03:meCO.Ode9C13.incipit	Ὦ πηρωτικῆς, ἀγνωμοσύνης τόλμημα! ὂν…
ltx/gr_gr_cog/me.m01.d03:meCO.Ode9C13.melody	@ltx/gr_gr_cog/he.h.m2:heHE.PsychaisKatharais.name
ltx/gr_gr_cog/me.m01.d03:meCO.Ode9C13.mode	@ltx/gr_gr_cog/miscellanea:misc.Mode2
ltx/gr_gr_cog/me.m01.d03:meCO.Ode9C13.ode	@ltx/gr_gr_cog/miscellanea:misc.Ode9
ltx/gr_gr_cog/me.m01.d03:meCO.Ode9C13.text	Ὦ πηρωτικῆς, ἀγνωμοσύνης τόλμημα! ὂν γὰρ οἱ ἀλλόφυλοι, ὡς λυτρωτὴν Χριστόν, προσεκύνησαν ἐν δώροις τετιμηκότες, οἱ οἰκεῖοι μανικῶς, ἐζήτουν ἀποκτεῖναι φανέντα. Φεῖσαι τῶν ψυχῶν ἡμῶν, Χριστὲ ὁ Θεός, καὶ σῶσον ἡμᾶς.
ltx/gr_gr_cog/me.m01.d03:meCO.Ode9C1H.incipit	@ltx/gr_gr_cog/he.h.m2:heHE.PsychaisKatharais.incipit
ltx/gr_gr_cog/me.m01.d03:meCO.Ode9C1H.melody	@ltx/gr_gr_cog/he.h.m2:heHE.PsychaisKatharais.melody
ltx/gr_gr_cog/me.m01.d03:meCO.Ode9C1H.mode	@ltx/gr_gr_cog/miscellanea:misc.Mode2
ltx/gr_gr_cog/me.m01.d03:meCO.Ode9C1H.ode	@ltx/gr_gr_cog/miscellanea:misc.Ode9
ltx/gr_gr_cog/me.m01.d03:meCO.Ode9C1H.text	@ltx/gr_gr_cog/he.h.m2:heHE.PsychaisKatharais.text
ltx/gr_gr_cog/me.m01.d03:meCO.Ode9C21.incipit	Ὀλέθριον πτῶμα τὸ τοῦ Ἀδάμ…
ltx/gr_gr_cog/me.m01.d03:meCO.Ode9C21.melody	@ltx/gr_gr_cog/he.h.m6:heHE.TinTimioteran.name
ltx/gr_gr_cog/me.m01.d03:meCO.Ode9C21.mode	@ltx/gr_gr_cog/miscellanea:misc.Mode6
ltx/gr_gr_cog/me.m01.d03:meCO.Ode9C21.ode	@ltx/gr_gr_cog/miscellanea:misc.Ode9
ltx/gr_gr_cog/me.m01.d03:meCO.Ode9C21.text	Ὀλέθριον πτῶμα τὸ τοῦ Ἀδάμ, νῦν ἐπανορθώσων, ἐπεφάνη νέος, Ἀδάμ, τὴν ἐλευθερίαν, τῆς παλιγγενεσίας, παρέχων παραδόξως, διὰ Βαπτίσματος.
ltx/gr_gr_cog/me.m01.d03:meCO.Ode9C22.incipit	Νόμον καὶ Προφήτας ἀποπληρῶν, καὶ…
ltx/gr_gr_cog/me.m01.d03:meCO.Ode9C22.melody	@ltx/gr_gr_cog/he.h.m6:heHE.TinTimioteran.name
ltx/gr_gr_cog/me.m01.d03:meCO.Ode9C22.mode	@ltx/gr_gr_cog/miscellanea:misc.Mode6
ltx/gr_gr_cog/me.m01.d03:meCO.Ode9C22.ode	@ltx/gr_gr_cog/miscellanea:misc.Ode9
ltx/gr_gr_cog/me.m01.d03:meCO.Ode9C22.text	Νόμον καὶ Προφήτας ἀποπληρῶν, καὶ δικαιοσύνην, ἐκτελῶν ὁ πάντων Σωτήρ, νῦν ὑπὸ παλάμης, χειροθετεῖται δούλου, δουλείας ἀφαρπάζων, ἐχθροῦ τὸν ἄνθρωπον.
ltx/gr_gr_cog/me.m01.d03:meCO.Ode9C23.incipit	Τοῖς ἔθνεσιν ἔλαμψε μέγα φῶς…
ltx/gr_gr_cog/me.m01.d03:meCO.Ode9C23.melody	@ltx/gr_gr_cog/he.h.m6:heHE.TinTimioteran.name
ltx/gr_gr_cog/me.m01.d03:meCO.Ode9C23.mode	@ltx/gr_gr_cog/miscellanea:misc.Mode6
ltx/gr_gr_cog/me.m01.d03:meCO.Ode9C23.ode	@ltx/gr_gr_cog/miscellanea:misc.Ode9
ltx/gr_gr_cog/me.m01.d03:meCO.Ode9C23.text	Τοῖς ἔθνεσιν ἔλαμψε μέγα φῶς· τοῖς ἐσκοτισμένοις, θεϊκῇ ἀνέσχεν αὐγῇ, τοῖς ἐν σκιᾷ πάλαι θανάτου καθημένοις, ὁ Ἥλιος τῆς δόξης, Χριστὸς ἀνέτειλεν.
ltx/gr_gr_cog/me.m01.d03:meCO.Ode9C24.incipit	Ἐκύκλουν Ἀγγέλων αἱ στρατιαί, τὸν…
ltx/gr_gr_cog/me.m01.d03:meCO.Ode9C24.melody	@ltx/gr_gr_cog/he.h.m6:heHE.TinTimioteran.name
ltx/gr_gr_cog/me.m01.d03:meCO.Ode9C24.mode	@ltx/gr_gr_cog/miscellanea:misc.Mode6
ltx/gr_gr_cog/me.m01.d03:meCO.Ode9C24.ode	@ltx/gr_gr_cog/miscellanea:misc.Ode9
ltx/gr_gr_cog/me.m01.d03:meCO.Ode9C24.text	Ἐκύκλουν Ἀγγέλων αἱ στρατιαί, τὸν ἐν Ἰορδάνῃ, βαπτιζόμενον Λυτρωτήν, καὶ τρόμῳ τὸ μέγα, Μυστήριον ἀνύμνουν, τῆς τούτου ἀποῤῥήτου, συγκαταβάσεως.
ltx/gr_gr_cog/me.m01.d03:meCO.Ode9C2H.incipit	@ltx/gr_gr_cog/he.h.m6:heHE.TinTimioteran.incipit
ltx/gr_gr_cog/me.m01.d03:meCO.Ode9C2H.melody	@ltx/gr_gr_cog/he.h.m6:heHE.TinTimioteran.melody
ltx/gr_gr_cog/me.m01.d03:meCO.Ode9C2H.mode	@ltx/gr_gr_cog/miscellanea:misc.Mode6
ltx/gr_gr_cog/me.m01.d03:meCO.Ode9C2H.ode	@ltx/gr_gr_cog/miscellanea:misc.Ode9
ltx/gr_gr_cog/me.m01.d03:meCO.Ode9C2H.text	@ltx/gr_gr_cog/he.h.m6:heHE.TinTimioteran.text
ltx/gr_gr_cog/me.m01.d03:meDA.commemoration.first	Προεόρτια τῶν Φώτων
ltx/gr_gr_cog/me.m01.d03:meDA.commemoration.first_name	
ltx/gr_gr_cog/me.m01.d03:meDA.commemoration.first_short	Προεόρτια τῶν Φώτων
ltx/gr_gr_cog/me.m01.d03:meDA.commemoration.first_title	@ltx/gr_gr_cog/titles:ti.Prophet
ltx/gr_gr_cog/me.m01.d03:meDA.commemoration.full	Προεόρτια τῶν Φώτων, καὶ μνήμη τοῦ Ἁγίου Προφήτου Μαλαχίου, καὶ τοῦ Ἁγίου Μάρτυρος Γορδίου.
ltx/gr_gr_cog/me.m01.d03:meDA.commemoration.second_name	
ltx/gr_gr_cog/me.m01.d03:meDA.commemoration.second_title	@ltx/gr_gr_cog/titles:ti.Martyr
ltx/gr_gr_cog/me.m01.d03:meDA.date	Τῌ Γʹ ΙΑΝΟΥΑΡΙΟΥ
ltx/gr_gr_cog/me.m01.d03:meDA.fordate	διὰ τὴν 3ην Ἰανουαρίου
ltx/gr_gr_cog/me.m01.d03:meDA.insert1	
ltx/gr_gr_cog/me.m01.d03:meDA.insert2	
ltx/gr_gr_cog/me.m01.d03:meDA.note	
ltx/gr_gr_cog/me.m01.d03:meDA.pdfcoverdate	τῆς 3ης Ἰανουαρίου,
ltx/gr_gr_cog/me.m01.d03:meDA.pdfheaderdate	τῆς 3ης Ἰανουαρίου
ltx/gr_gr_cog/me.m01.d03:meHO.commemorations	
ltx/gr_gr_cog/me.m01.d03:meHO.note1	
ltx/gr_gr_cog/me.m01.d03:meHO.note2	
ltx/gr_gr_cog/me.m01.d03:meHO.number	3.
ltx/gr_gr_cog/me.m01.d03:meHO.rank	
ltx/gr_gr_cog/me.m01.d03:meLE.commemoration1	Προεόρτια τῶν Φώτων, καὶ μνήμη τοῦ Ἁγίου Προφήτου Μαλαχίου, καὶ τοῦ Ἁγίου Μάρτυρος Γορδίου.
ltx/gr_gr_cog/me.m01.d03:meLE.commemoration2	
ltx/gr_gr_cog/me.m01.d03:meLI.Kontakion1.greekmelody	@ltx/gr_gr_cog/me.m01.d03:meMA.Kontakion1.greekmelody
ltx/gr_gr_cog/me.m01.d03:meLI.Kontakion1.incipit	@ltx/gr_gr_cog/me.m01.d03:meMA.Kontakion1.incipit
ltx/gr_gr_cog/me.m01.d03:meLI.Kontakion1.melody	@ltx/gr_gr_cog/me.m01.d03:meMA.Kontakion1.melody
ltx/gr_gr_cog/me.m01.d03:meLI.Kontakion1.mode	@ltx/gr_gr_cog/me.m01.d03:meMA.Kontakion1.mode
ltx/gr_gr_cog/me.m01.d03:meLI.Kontakion1.text	@ltx/gr_gr_cog/me.m01.d03:meMA.Kontakion1.text
ltx/gr_gr_cog/me.m01.d03:meLI.Megalynarion.text	
ltx/gr_gr_cog/me.m01.d03:meMA.AposGlory.incipit	Ὤφθη τὸ πατρικόν, ἀπαύγασμα τῆς…
ltx/gr_gr_cog/me.m01.d03:meMA.AposGlory.melody	@ltx/gr_gr_cog/he.a.m2:heAU.OikosTouEfratha.name
ltx/gr_gr_cog/me.m01.d03:meMA.AposGlory.mode	@ltx/gr_gr_cog/miscellanea:misc.Mode2
ltx/gr_gr_cog/me.m01.d03:meMA.AposGlory.text	Ὤφθη τὸ πατρικόν, ἀπαύγασμα τῆς δόξης, ἐν ῥείθροις Ἰορδάνου, Βαπτίσματι καθαῖρον, τὸν ῥύπον τῶν ψυχῶν ἡμῶν.
ltx/gr_gr_cog/me.m01.d03:meMA.Aposticha1.greekmelody	@ltx/gr_gr_cog/he.a.m2:heAU.OikosTouEfratha.greekname
ltx/gr_gr_cog/me.m01.d03:meMA.Aposticha1.incipit	Ἀπὸ τῆς Βηθλεέμ, ἐπὶ τὸν…
ltx/gr_gr_cog/me.m01.d03:meMA.Aposticha1.melody	@ltx/gr_gr_cog/he.a.m2:heAU.OikosTouEfratha.name
ltx/gr_gr_cog/me.m01.d03:meMA.Aposticha1.mode	@ltx/gr_gr_cog/miscellanea:misc.Mode2
ltx/gr_gr_cog/me.m01.d03:meMA.Aposticha1.text	Ἀπὸ τῆς Βηθλεέμ, ἐπὶ τὸν Ἰορδάνην, μεταβῶμεν· ἐκεῖ γάρ, τὸ φῶς τοῖς ἐν τῷ σκότει, αὐγάζειν ἤδη ἄρχεται.
ltx/gr_gr_cog/me.m01.d03:meMA.Aposticha2.incipit	Γῆ ἡ τοῦ Ζαβουλών, οἱ…
ltx/gr_gr_cog/me.m01.d03:meMA.Aposticha2.melody	@ltx/gr_gr_cog/he.a.m2:heAU.OikosTouEfratha.name
ltx/gr_gr_cog/me.m01.d03:meMA.Aposticha2.mode	@ltx/gr_gr_cog/miscellanea:misc.Mode2
ltx/gr_gr_cog/me.m01.d03:meMA.Aposticha2.text	Γῆ ἡ τοῦ Ζαβουλών, οἱ πέραν Ἰορδάνου, ἀκούσατε· Ἐγγίζει, Χριστὸς ἡ σωτηρία, τὸ φῶς ἡ ἀπολύτρωσις.
ltx/gr_gr_cog/me.m01.d03:meMA.Aposticha3.incipit	Εὐτρέπιζε καὶ σύ, Ἰορδάνη τὸ…
ltx/gr_gr_cog/me.m01.d03:meMA.Aposticha3.melody	@ltx/gr_gr_cog/he.a.m2:heAU.OikosTouEfratha.name
ltx/gr_gr_cog/me.m01.d03:meMA.Aposticha3.mode	@ltx/gr_gr_cog/miscellanea:misc.Mode2
ltx/gr_gr_cog/me.m01.d03:meMA.Aposticha3.text	Εὐτρέπιζε καὶ σύ, Ἰορδάνη τὸ ῥεῖθρον· ὁ πυρὶ γὰρ βαπτίζων, ἐγγίζει τοῦ καινίσαι, τὸ συντριβὲν πλαστούργημα.
ltx/gr_gr_cog/me.m01.d03:meMA.C.acrostic.notice2	Ἐν δὲ τῇ θʹ ᾠδῇ· Ἰωσφήφ.
ltx/gr_gr_cog/me.m01.d03:meMA.C1.acrostic.notice1	οὗ ἡ Ἀκροστιχίς· κατʼ Ἀλφάβητον.
ltx/gr_gr_cog/me.m01.d03:meMA.C1.acrostic.title	Ὁ Προεόρτιος Κανών,
ltx/gr_gr_cog/me.m01.d03:meMA.C1.title	@ltx/gr_gr_cog/titles:ti.CanonForefeast
ltx/gr_gr_cog/me.m01.d03:meMA.C1.verse	@ltx/gr_gr_cog/prayers:pr.verse_God.text
ltx/gr_gr_cog/me.m01.d03:meMA.C2.acrostic.notice1	οὗ ἡ Ἀκροστιχίς·
ltx/gr_gr_cog/me.m01.d03:meMA.C2.acrostic.text	Μαλαχίου με τὸ κλέος δοξαζέτω.
ltx/gr_gr_cog/me.m01.d03:meMA.C2.acrostic.title	Ἕτερος Κανὼν τοῦ Προφήτου,
ltx/gr_gr_cog/me.m01.d03:meMA.C2.poet	@ltx/gr_gr_cog/poets:po.Theofanous
ltx/gr_gr_cog/me.m01.d03:meMA.C2.title	@ltx/gr_gr_cog/titles:ti.CanonProphet
ltx/gr_gr_cog/me.m01.d03:meMA.C2.verse	@ltx/gr_gr_cog/prayers:pr.verse_Prophet.text
ltx/gr_gr_cog/me.m01.d03:meMA.C3.acrostic.notice1	οὗ ἡ Ἀκροστιχίς·
ltx/gr_gr_cog/me.m01.d03:meMA.C3.acrostic.text	Μάρτυρα Γόρδιον ὕμνοισιν μελιηδέσιν ᾄδω.
ltx/gr_gr_cog/me.m01.d03:meMA.C3.acrostic.title	Ἕτερος Κανὼν τοῦ Μάρτυρος,
ltx/gr_gr_cog/me.m01.d03:meMA.C3.poet	@ltx/gr_gr_cog/poets:po.Theofanous
ltx/gr_gr_cog/me.m01.d03:meMA.C3.title	@ltx/gr_gr_cog/titles:ti.CanonMartyrM
ltx/gr_gr_cog/me.m01.d03:meMA.C3.verse	@ltx/gr_gr_cog/prayers:pr.verse_SaintM.text
ltx/gr_gr_cog/me.m01.d03:meMA.Exaposteilarion1.greekmelody	@ltx/gr_gr_cog/he.a.m2:heAU.GynaikesAkoutisthite.greekname
ltx/gr_gr_cog/me.m01.d03:meMA.Exaposteilarion1.incipit	Γορδίου τοῦ θεόφρονος, καὶ πανενδόξου…
ltx/gr_gr_cog/me.m01.d03:meMA.Exaposteilarion1.melody	@ltx/gr_gr_cog/he.a.m2:heAU.GynaikesAkoutisthite.name
ltx/gr_gr_cog/me.m01.d03:meMA.Exaposteilarion1.mode	@ltx/gr_gr_cog/miscellanea:misc.Mode2
ltx/gr_gr_cog/me.m01.d03:meMA.Exaposteilarion1.text	Γορδίου τοῦ θεόφρονος, καὶ πανενδόξου Μάρτυρος, αὔτη ἐπεῖδεν ἡμέρα, τὴν ἄθλησιν, ἧς τὴν μνήμην, λαμπρῶς νῦν ἐκτελέσωμεν, Χριστοῦ γὰρ ὑπερήθλησε. Διαναστῶμεν προθύμως, ὦ φιλομάρτυρες πάντες, πρὸς ἀρετῶν εὐκαρπίαν.
ltx/gr_gr_cog/me.m01.d03:meMA.Exaposteilarion2.greekmelody	@ltx/gr_gr_cog/he.a.m3:heAU.EnPnevmatiToIero.greekname
ltx/gr_gr_cog/me.m01.d03:meMA.Exaposteilarion2.incipit	Τὴν Βηθλεὲμ ἀφέμενοι, τὸ καινότατον…
ltx/gr_gr_cog/me.m01.d03:meMA.Exaposteilarion2.melody	@ltx/gr_gr_cog/he.a.m3:heAU.EnPnevmatiToIero.name
ltx/gr_gr_cog/me.m01.d03:meMA.Exaposteilarion2.mode	@ltx/gr_gr_cog/miscellanea:misc.Mode3
ltx/gr_gr_cog/me.m01.d03:meMA.Exaposteilarion2.text	Τὴν Βηθλεὲμ ἀφέμενοι, τὸ καινότατον θαῦμα, πρός, Ἰορδάνην δράμωμεν, ἐκ ψυχῆς θερμοτάτης, κἀκεῖσε κατοπτεύσωμεν τὸ φρικτὸν Μυστήριον· θεοπρεπῶς γὰρ ἐπέστη, γυμνωθεὶς ὁ Χριστός μου, ἐπενδύων με στολήν, τῆς οὐρανῶν Βασιλείας.
ltx/gr_gr_cog/me.m01.d03:meMA.Kathisma11.greekmelody	@ltx/gr_gr_cog/he.a.m3:heAU.TinOraiotita.greekname
ltx/gr_gr_cog/me.m01.d03:meMA.Kathisma11.incipit	Ὁ ἀπερίγραπτος ὢν τῇ θεότητι…
ltx/gr_gr_cog/me.m01.d03:meMA.Kathisma11.melody	@ltx/gr_gr_cog/he.a.m3:heAU.TinOraiotita.name
ltx/gr_gr_cog/me.m01.d03:meMA.Kathisma11.mode	@ltx/gr_gr_cog/miscellanea:misc.Mode3
ltx/gr_gr_cog/me.m01.d03:meMA.Kathisma11.text	Ὁ ἀπερίγραπτος ὢν τῇ θεότητι, περιγραφόμενος ὕλῃ τοῦ σώματος, μέλλει προέρχεσθαι ῥοαῖς, Ἰορδάνου τοῦ βαπτισθῆναι. Τοῦτον καθαρότητι, διανοίας δεξώμεθα· πάντων γὰρ ἐργάσασθαι, τὴν ἀνάπλασιν βούλεται, πρὸς ὂν νῦν ἐκβοήσωμεν φόβῳ· Δόξα Χριστὲ τῇ ἐπιφανείᾳ σου.
ltx/gr_gr_cog/me.m01.d03:meMA.Kathisma12.greekmelody	@ltx/gr_gr_cog/he.a.m3:heAU.TinOraiotita.greekname
ltx/gr_gr_cog/me.m01.d03:meMA.Kathisma12.incipit	Ἐπιφανέντος σου ἐν Ἰορδάνῃ Σωτήρ…
ltx/gr_gr_cog/me.m01.d03:meMA.Kathisma12.melody	@ltx/gr_gr_cog/he.a.m3:heAU.TinOraiotita.name
ltx/gr_gr_cog/me.m01.d03:meMA.Kathisma12.mode	@ltx/gr_gr_cog/miscellanea:misc.Mode3
ltx/gr_gr_cog/me.m01.d03:meMA.Kathisma12.text	Ἐπιφανέντος σου ἐν Ἰορδάνῃ Σωτήρ, ἐπὶ τὰ ὕδατα τοῦ βαπτισθῆναι σαρκί, αἱ τῶν Ἀγγέλων στρατιαί, ἐξίσταντο καθορῶσαι, δούλῳ παριστάμενον, τὸν Δεσπότην τῆς κτίσεως, ἄνωθεν ἐκήρυττε, σὲ Πατὴρ ὁ προάναρχος· διὸ μετʼ εὐφροούνης βοῶμέν σοι. Δόξα Χριστὲ τῇ ἐπιφανείᾳ σου.
ltx/gr_gr_cog/me.m01.d03:meMA.Kathisma21.greekmelody	@ltx/gr_gr_cog/he.a.m5:heAU.TonSynanarchonLogon.greekname
ltx/gr_gr_cog/me.m01.d03:meMA.Kathisma21.incipit	Τὸν ὁμότιμον Λόγον Πατρὶ καὶ…
ltx/gr_gr_cog/me.m01.d03:meMA.Kathisma21.melody	@ltx/gr_gr_cog/he.a.m5:heAU.TonSynanarchonLogon.name
ltx/gr_gr_cog/me.m01.d03:meMA.Kathisma21.mode	@ltx/gr_gr_cog/miscellanea:misc.Mode5
ltx/gr_gr_cog/me.m01.d03:meMA.Kathisma21.text	Τὸν ὁμότιμον Λόγον Πατρὶ καὶ Πνεύματι, σαρκωθέντα διʼ οἶκτον καὶ βαπτιζόμενον, τῶν Ἀγγέλων οἱ χοροί, βλέποντες ἔτρεμον, καὶ Ἰορδάνης ποταμός, εὐλαβηθεὶς καὶ φοβηθείς, ἐστράφη εἰς τὰ ὀπίσω, ἡμᾶς ἀνάγων πρὸς ὕψος, τῆς σωτηρίας, πάθεσι ῥεύσαντας.
ltx/gr_gr_cog/me.m01.d03:meMA.Kathisma22.greekmelody	@ltx/gr_gr_cog/he.a.m5:heAU.TonSynanarchonLogon.greekname
ltx/gr_gr_cog/me.m01.d03:meMA.Kathisma22.incipit	Ὁ συνάναρχος Λόγος Πατρὶ καὶ…
ltx/gr_gr_cog/me.m01.d03:meMA.Kathisma22.melody	@ltx/gr_gr_cog/he.a.m5:heAU.TonSynanarchonLogon.name
ltx/gr_gr_cog/me.m01.d03:meMA.Kathisma22.mode	@ltx/gr_gr_cog/miscellanea:misc.Mode5
ltx/gr_gr_cog/me.m01.d03:meMA.Kathisma22.text	Ὁ συνάναρχος Λόγος Πατρὶ καὶ Πνεύματι, μορφωθεὶς διὰ σπλάγχνα νῦν τὸ ἀλλότριον, βαπτισθῆναι διʼ ἡμᾶς, ἤδη ἐπείγεται, ὑπαντήσωμεν αὐτῷ, διανοίᾳ καθαρᾷ· Εὐλογητὸς εἶ βοῶντες, Χριστὲ Σωτὴρ εὐεργέτα, ὁ ἁγιάσαι ἡμᾶς ἐρχόμενος.
ltx/gr_gr_cog/me.m01.d03:meMA.Kontakion1.greekmelody	@ltx/gr_gr_cog/he.a.m3:heAU.IParthenosSimeron.greekname
ltx/gr_gr_cog/me.m01.d03:meMA.Kontakion1.incipit	Τῆς σοφίας ἔμπλεως, τῆς ὑπερσόφου…
ltx/gr_gr_cog/me.m01.d03:meMA.Kontakion1.melody	@ltx/gr_gr_cog/he.a.m3:heAU.IParthenosSimeron.name
ltx/gr_gr_cog/me.m01.d03:meMA.Kontakion1.mode	@ltx/gr_gr_cog/miscellanea:misc.Mode3
ltx/gr_gr_cog/me.m01.d03:meMA.Kontakion1.text	Τῆς σοφίας ἔμπλεως, τῆς ὑπερσόφου καὶ θείας, Μαλαχία μέγιστε, σὺ πεφυκὼς ὡς Προφήτης, ἄνωθεν αὐτὸν τὸν ὄντα Θεοῦ σοφίαν, ἔδειξας τοῖς πᾶσι κάτω ἀναστραφέντα· διὰ τοῦτό σε τιμῶμεν, τελοῦντες πίστει τὴν θείαν μνήμην σου.
ltx/gr_gr_cog/me.m01.d03:meMA.Kontakion2.greekmelody	@ltx/gr_gr_cog/he.a.m6:heAU.TinEnPresveiais.greekname
ltx/gr_gr_cog/me.m01.d03:meMA.Kontakion2.incipit	Τὸν ἐν ἀθλήσει ἀήττητον στρατιώτην…
ltx/gr_gr_cog/me.m01.d03:meMA.Kontakion2.melody	@ltx/gr_gr_cog/he.a.m6:heAU.TinEnPresveiais.name
ltx/gr_gr_cog/me.m01.d03:meMA.Kontakion2.mode	@ltx/gr_gr_cog/miscellanea:misc.Mode6
ltx/gr_gr_cog/me.m01.d03:meMA.Kontakion2.text	Τὸν ἐν ἀθλήσει ἀήττητον στρατιώτην, καὶ ἐν βασάνοις ἀνίκητον στεφανίτην, Γόρδιον πάντες ἀνευφημήσωμεν, τὸν ἐξ Ἑῴας μέγαν, ὄντως ἀστέρα λάμψαντα, τὸ θεῖον ἀγλάϊσμα τῶν Μαρτύρων Χριστοῦ.
ltx/gr_gr_cog/me.m01.d03:meMA.Lauds1.greekmelody	@ltx/gr_gr_cog/he.a.m6:heAU.AiAngelikai.greekname
ltx/gr_gr_cog/me.m01.d03:meMA.Lauds1.incipit	Θρόνον οὐρανόν, κεκτημένος ὁ Δεσπότης…
ltx/gr_gr_cog/me.m01.d03:meMA.Lauds1.melody	@ltx/gr_gr_cog/he.a.m6:heAU.AiAngelikai.name
ltx/gr_gr_cog/me.m01.d03:meMA.Lauds1.mode	@ltx/gr_gr_cog/miscellanea:misc.Mode6
ltx/gr_gr_cog/me.m01.d03:meMA.Lauds1.text	Θρόνον οὐρανόν, κεκτημένος ὁ Δεσπότης, ἦλθεν ἐπὶ γῆς, σαρκωθεὶς ἐκ τῆς Παρθένου, καὶ πρὸς τὸν Ἰορδάνην, ἐπιστὰς τὸ καθάρσιον, πάντων ἑξαιρεῖ τὸν Ἰωάννην. Αἱ πατριαὶ τῆς γῆς ἁπάσης, αὐτῷ ψάλλωμεν· Εὐλογημένος ὁ φανείς, Θεὸς ἡμῶν δόξα σοι.
ltx/gr_gr_cog/me.m01.d03:meMA.Lauds2.incipit	Ἔφθασε Χριστός, πρὸς τὰ ῥεῖθρα…
ltx/gr_gr_cog/me.m01.d03:meMA.Lauds2.melody	@ltx/gr_gr_cog/he.a.m6:heAU.AiAngelikai.name
ltx/gr_gr_cog/me.m01.d03:meMA.Lauds2.mode	@ltx/gr_gr_cog/miscellanea:misc.Mode6
ltx/gr_gr_cog/me.m01.d03:meMA.Lauds2.text	Ἔφθασε Χριστός, πρὸς τὰ ῥεῖθρα Ἰορδάνου, Βάπτισμα αἰτῶν, ὁ καθαίρων ἁμαρτίας. Πᾶσα ἡ γῆ σκιρτάτω· Οὐρανοὶ εὐφραινέσθωσαν· Χαῖρε τῶν Ἐθνῶν ἡ Ἐκκλησία, τῷ Βασιλεῖ νυμφευομένη, πιστῶς βόησον· Εὐλογημένος ὁ φανείς, Θεὸς ἡμῶν δόξα σοι.
ltx/gr_gr_cog/me.m01.d03:meMA.Lauds3.incipit	Ὄρη γλυκασμόν, εὐφροσύνης σταλαξάτω, χεῖρας…
ltx/gr_gr_cog/me.m01.d03:meMA.Lauds3.melody	@ltx/gr_gr_cog/he.a.m6:heAU.AiAngelikai.name
ltx/gr_gr_cog/me.m01.d03:meMA.Lauds3.mode	@ltx/gr_gr_cog/miscellanea:misc.Mode6
ltx/gr_gr_cog/me.m01.d03:meMA.Lauds3.text	Ὄρη γλυκασμόν, εὐφροσύνης σταλαξάτω, χεῖρας μυστικῶς, νῦν κροτήσατε τὰ Ἔθνη, ἡ ἔρημος ἀνθείτω Ἰορδάνη ὑπόδεξαι, δεῦρο Βαπτιστὰ τῷ μυστηρίῳ, τοῦ Λυτρωτοῦ ὑπούργει χαίρων, λαοὶ μέλψωμεν· Εὐλογημένος ὁ φανείς, Θεὸς ἡμῶν δόξα σοι.
ltx/gr_gr_cog/me.m01.d03:meMA.Lauds4.greekmelody	@ltx/gr_gr_cog/he.a.m6:heAU.AiAngelikai.greekname
ltx/gr_gr_cog/me.m01.d03:meMA.Lauds4.incipit	Φῶς τὸ ἐκ φωτός, ὑπὲρ…
ltx/gr_gr_cog/me.m01.d03:meMA.Lauds4.melody	@ltx/gr_gr_cog/he.a.m6:heAU.AiAngelikai.name
ltx/gr_gr_cog/me.m01.d03:meMA.Lauds4.mode	@ltx/gr_gr_cog/miscellanea:misc.Mode6
ltx/gr_gr_cog/me.m01.d03:meMA.Lauds4.text	Φῶς τὸ ἐκ φωτός, ὑπὲρ χρόνον προεκλάμψαν, τοῖς ἐν τῇ νυκτί, καθημένοις ἐπεφάνη, καὶ σκότος ἁμαρτίας, ἐκκαθᾶραν ἐφώτισε. Χόρευσον Ἀδάμ· εὐφραίνου Εὕα, ἡ λύτρωσις Χριστὸς ἐπέστη, Δαυῒδ βόησον· Εὐλογημένος ὁ φανείς, Θεὸς ἡμῶν δόξα σοι.
ltx/gr_gr_cog/me.m01.d03:meMA.LaudsBoth.incipit	Νόμου πληρωτής, κατὰ σάρκα χρηματίσας…
ltx/gr_gr_cog/me.m01.d03:meMA.LaudsBoth.melody	@ltx/gr_gr_cog/he.a.m6:heAU.AiAngelikai.name
ltx/gr_gr_cog/me.m01.d03:meMA.LaudsBoth.mode	@ltx/gr_gr_cog/miscellanea:misc.Mode6
ltx/gr_gr_cog/me.m01.d03:meMA.LaudsBoth.text	Νόμου πληρωτής, κατὰ σάρκα χρηματίσας, ἦλθεν ὁ Χριστός, ἀπαρχὴν τῆς σωτηρίας, ἐπὶ τὸν Ἰορδάνην, ἐκτελέσαι ὡς εὔσπλαγχνος, καὶ τῷ Βαπτιστῇ καθυποκλίνει, τὴν κορυφὴν πιστῶς βοῶντι, λαοὶ κράξωμεν· Εὐλογημένος ὁ φανείς, Θεὸς ἡμῶν δόξα σοι.
ltx/gr_gr_cog/me.m01.d03:meMA.LaudsGlory.incipit	Ἄστρον Ἰακώβ, ἑξανέτειλε τῷ κόσμῳ…
ltx/gr_gr_cog/me.m01.d03:meMA.LaudsGlory.melody	@ltx/gr_gr_cog/he.a.m6:heAU.AiAngelikai.name
ltx/gr_gr_cog/me.m01.d03:meMA.LaudsGlory.mode	@ltx/gr_gr_cog/miscellanea:misc.Mode6
ltx/gr_gr_cog/me.m01.d03:meMA.LaudsGlory.text	Ἄστρον Ἰακώβ, ἑξανέτειλε τῷ κόσμῳ, καὶ τὴν φλογεράν, τῶν ἀνθρώπων ἁμαρτίαν, ἀναλαβὼν ἐνθάπτει, Ἰορδάνου τοῖς νάμασι, λάμπων τῆς θεότητος τῷ φέγγει, καὶ φωτισμὸν θεογνωσίας, διδοὺς Ἔθνεσιν· Εὐλογημένος ὁ φανείς, Θεὸς ἡμῶν δόξα σοι.
ltx/gr_gr_cog/me.m01.d03:meMA.Ode1C11.greekmelody	@ltx/gr_gr_cog/he.h.m4:heHE.AnoixoToStomaMou.greekname
ltx/gr_gr_cog/me.m01.d03:meMA.Ode1C11.incipit	Ἀβύσσους προστάγματι, δημιουργήσας φιλάνθρωπε, τὴν…
ltx/gr_gr_cog/me.m01.d03:meMA.Ode1C11.melody	@ltx/gr_gr_cog/he.h.m4:heHE.AnoixoToStomaMou.name
ltx/gr_gr_cog/me.m01.d03:meMA.Ode1C11.mode	@ltx/gr_gr_cog/miscellanea:misc.Mode4
ltx/gr_gr_cog/me.m01.d03:meMA.Ode1C11.ode	@ltx/gr_gr_cog/miscellanea:misc.Ode1
ltx/gr_gr_cog/me.m01.d03:meMA.Ode1C11.text	Ἀβύσσους προστάγματι, δημιουργήσας φιλάνθρωπε, τὴν γῆν ὁ τοῖς ὕδασι, κρεμάσας Κύριε, ταπεινούμενος, προέρχῃ βαπτισθῆναι, ποταμίοις ῥεύμασι, πλύνων με ῥύπου παθῶν.
ltx/gr_gr_cog/me.m01.d03:meMA.Ode1C12.incipit	Βουλήσει ἐπτώχευσας, τὸν ἑκουσίως πτωχεύσαντα…
ltx/gr_gr_cog/me.m01.d03:meMA.Ode1C12.melody	@ltx/gr_gr_cog/he.h.m4:heHE.AnoixoToStomaMou.name
ltx/gr_gr_cog/me.m01.d03:meMA.Ode1C12.mode	@ltx/gr_gr_cog/miscellanea:misc.Mode4
ltx/gr_gr_cog/me.m01.d03:meMA.Ode1C12.ode	@ltx/gr_gr_cog/miscellanea:misc.Ode1
ltx/gr_gr_cog/me.m01.d03:meMA.Ode1C12.text	Βουλήσει ἐπτώχευσας, τὸν ἑκουσίως πτωχεύσαντα, κακῶν ἐπιδόσεσιν, ἐμὲ πλουτίζων Χριστέ, καὶ ἐν ὕδασι, προέρχῃ Ἰορδάνου, Βάπτισμα αἰτούμενος, ὁ ἀναμάρτητος.
ltx/gr_gr_cog/me.m01.d03:meMA.Ode1C13.incipit	Γηράσαντα πταίσμασι, κόσμον καινίζων Φιλάνθρωπε…
ltx/gr_gr_cog/me.m01.d03:meMA.Ode1C13.melody	@ltx/gr_gr_cog/he.h.m4:heHE.AnoixoToStomaMou.name
ltx/gr_gr_cog/me.m01.d03:meMA.Ode1C13.mode	@ltx/gr_gr_cog/miscellanea:misc.Mode4
ltx/gr_gr_cog/me.m01.d03:meMA.Ode1C13.ode	@ltx/gr_gr_cog/miscellanea:misc.Ode1
ltx/gr_gr_cog/me.m01.d03:meMA.Ode1C13.text	Γηράσαντα πταίσμασι, κόσμον καινίζων Φιλάνθρωπε, ξένην ἀναγέννησιν, ἔρχῃ ποιήσασθαι, διὰ ὕδατος καὶ πνεύματος ἀνθρώποις· ὅθεν, σου δοξάζομεν, τὴν ἐπιφάνειαν.
ltx/gr_gr_cog/me.m01.d03:meMA.Ode1C14.incipit	Δαυΐδ θείῳ Πνεύματι, προκελαδῶν ἀπεφθέγγετο…
ltx/gr_gr_cog/me.m01.d03:meMA.Ode1C14.melody	@ltx/gr_gr_cog/he.h.m4:heHE.AnoixoToStomaMou.name
ltx/gr_gr_cog/me.m01.d03:meMA.Ode1C14.mode	@ltx/gr_gr_cog/miscellanea:misc.Mode4
ltx/gr_gr_cog/me.m01.d03:meMA.Ode1C14.ode	@ltx/gr_gr_cog/miscellanea:misc.Ode1
ltx/gr_gr_cog/me.m01.d03:meMA.Ode1C14.text	Δαυΐδ θείῳ Πνεύματι, προκελαδῶν ἀπεφθέγγετο· Τί σοι ἒστι θάλασσα, ὅτι νῦν ἔφυγες; καὶ τί ὅτι σύ, ἐστράφης Ἰορδάνη, Χριστὸν θεασάμενος, γυμνὸν ἑστῶτα ἐν σοί;
ltx/gr_gr_cog/me.m01.d03:meMA.Ode1C1H.greekmelody	@ltx/gr_gr_cog/he.h.m4:heHE.AnoixoToStomaMou.greekname
ltx/gr_gr_cog/me.m01.d03:meMA.Ode1C1H.incipit	@ltx/gr_gr_cog/he.h.m4:heHE.AnoixoToStomaMou.incipit
ltx/gr_gr_cog/me.m01.d03:meMA.Ode1C1H.melody	@ltx/gr_gr_cog/he.h.m4:heHE.AnoixoToStomaMou.melody
ltx/gr_gr_cog/me.m01.d03:meMA.Ode1C1H.mode	@ltx/gr_gr_cog/miscellanea:misc.Mode4
ltx/gr_gr_cog/me.m01.d03:meMA.Ode1C1H.ode	@ltx/gr_gr_cog/miscellanea:misc.Ode1
ltx/gr_gr_cog/me.m01.d03:meMA.Ode1C1H.text	@ltx/gr_gr_cog/he.h.m4:heHE.AnoixoToStomaMou.text
ltx/gr_gr_cog/me.m01.d03:meMA.Ode1C21.greekmelody	@ltx/gr_gr_cog/he.h.m8:heHE.IKekommeni.greekname
ltx/gr_gr_cog/me.m01.d03:meMA.Ode1C21.incipit	Μετὰ τῆς ἄνω χορείας γηθόμενος…
ltx/gr_gr_cog/me.m01.d03:meMA.Ode1C21.melody	@ltx/gr_gr_cog/he.h.m8:heHE.IKekommeni.name
ltx/gr_gr_cog/me.m01.d03:meMA.Ode1C21.mode	@ltx/gr_gr_cog/miscellanea:misc.Mode8
ltx/gr_gr_cog/me.m01.d03:meMA.Ode1C21.ode	@ltx/gr_gr_cog/miscellanea:misc.Ode1
ltx/gr_gr_cog/me.m01.d03:meMA.Ode1C21.text	Μετὰ τῆς ἄνω χορείας γηθόμενος, καὶ ταύτῃ συγχορεύων καὶ συναγαλλόμενος, καὶ θείου φωτισμοῦ, ἀξίως ἐμφορούμενος, θεόπνευστε, τοὺς πίστει τὴν σεπτήν, σοῦ μνήμην ἑορτάζοντας, τῷ Κυρίῳ ψάλλοντας, πρεσβεύων διαφυλάττε.
ltx/gr_gr_cog/me.m01.d03:meMA.Ode1C22.incipit	Ἀγγελομόρφῳ ψυχῆς ὡραιότητι, καὶ κάλλει…
ltx/gr_gr_cog/me.m01.d03:meMA.Ode1C22.melody	@ltx/gr_gr_cog/he.h.m8:heHE.IKekommeni.name
ltx/gr_gr_cog/me.m01.d03:meMA.Ode1C22.mode	@ltx/gr_gr_cog/miscellanea:misc.Mode8
ltx/gr_gr_cog/me.m01.d03:meMA.Ode1C22.ode	@ltx/gr_gr_cog/miscellanea:misc.Ode1
ltx/gr_gr_cog/me.m01.d03:meMA.Ode1C22.text	Ἀγγελομόρφῳ ψυχῆς ὡραιότητι, καὶ κάλλει διαπρέπων, πάλιν τῷ τοῦ σώματος, τὴν ἄνωθεν αὐγήν, τῆς θείας ἐπιλάμψεως, ἐδέξω θεηγόρε τηλαυγῶς, καὶ χαίρων ἀνεκραύγαζες· τῷ Κυρίῳ ᾄσωμεν, ἐνδόξως γὰρ δεδόξασται.
ltx/gr_gr_cog/me.m01.d03:meMA.Ode1C23.incipit	Λελογισμένως ἀνύων τὸν βίον σου…
ltx/gr_gr_cog/me.m01.d03:meMA.Ode1C23.melody	@ltx/gr_gr_cog/he.h.m8:heHE.IKekommeni.name
ltx/gr_gr_cog/me.m01.d03:meMA.Ode1C23.mode	@ltx/gr_gr_cog/miscellanea:misc.Mode8
ltx/gr_gr_cog/me.m01.d03:meMA.Ode1C23.ode	@ltx/gr_gr_cog/miscellanea:misc.Ode1
ltx/gr_gr_cog/me.m01.d03:meMA.Ode1C23.text	Λελογισμένως ἀνύων τὸν βίον σου, καὶ τρόπων εὐκοσμίᾳ, καθωραΐζόμενος, καὶ ἤθεσι χρηστοῖς, Παμμάκαρ σεμνυνόμενος, Προφήτης ἀληθείας εὐσεβής, κραυγάζων ἐναπέφηνας. Τῷ Κυρίῳ ᾄσωμεν· ἐνδόξως γὰρ δεδόξασται.
ltx/gr_gr_cog/me.m01.d03:meMA.Ode1C2T.incipit	Ἄχραντε Μήτηρ Θεοῦ Παντοκράτορος, ἡ…
ltx/gr_gr_cog/me.m01.d03:meMA.Ode1C2T.melody	@ltx/gr_gr_cog/he.h.m8:heHE.IKekommeni.name
ltx/gr_gr_cog/me.m01.d03:meMA.Ode1C2T.mode	@ltx/gr_gr_cog/miscellanea:misc.Mode8
ltx/gr_gr_cog/me.m01.d03:meMA.Ode1C2T.ode	@ltx/gr_gr_cog/miscellanea:misc.Ode1
ltx/gr_gr_cog/me.m01.d03:meMA.Ode1C2T.text	Ἄχραντε Μήτηρ Θεοῦ Παντοκράτορος, ἡ Βασιλίδος φυλῆς, Δέσποινα βλαστήσασα, καὶ μόνη τὸν Θεόν, τὸν πάντων βασιλεύοντα, γεννήσασα σαρκὶ ὑπερφυῶς, κινδύνων με διάσωσον, τῷ Υἱῷ σου ψάλλοντα· Ἐνδόξως γὰρ δεδόξασται.
ltx/gr_gr_cog/me.m01.d03:meMA.Ode1C31.greekmelody	@ltx/gr_gr_cog/he.h.m8:heHE.AsomenToKyrio.greekname
ltx/gr_gr_cog/me.m01.d03:meMA.Ode1C31.incipit	Μάρτυς τῆς ἀληθείας, Γόρδιε παμμάκαρ…
ltx/gr_gr_cog/me.m01.d03:meMA.Ode1C31.melody	@ltx/gr_gr_cog/he.h.m8:heHE.AsomenToKyrio.name
ltx/gr_gr_cog/me.m01.d03:meMA.Ode1C31.mode	@ltx/gr_gr_cog/miscellanea:misc.Mode8
ltx/gr_gr_cog/me.m01.d03:meMA.Ode1C31.ode	@ltx/gr_gr_cog/miscellanea:misc.Ode1
ltx/gr_gr_cog/me.m01.d03:meMA.Ode1C31.text	Μάρτυς τῆς ἀληθείας, Γόρδιε παμμάκαρ γνωριζόμενος, φωτοφόρον μοι χάριν, οὐρανόθεν παράσχου ταῖς πρεσβείαις σου.
ltx/gr_gr_cog/me.m01.d03:meMA.Ode1C32.incipit	Ἄσωμεν τῷ Κυρίῳ, τῷ τὸν…
ltx/gr_gr_cog/me.m01.d03:meMA.Ode1C32.melody	@ltx/gr_gr_cog/he.h.m8:heHE.AsomenToKyrio.name
ltx/gr_gr_cog/me.m01.d03:meMA.Ode1C32.mode	@ltx/gr_gr_cog/miscellanea:misc.Mode8
ltx/gr_gr_cog/me.m01.d03:meMA.Ode1C32.ode	@ltx/gr_gr_cog/miscellanea:misc.Ode1
ltx/gr_gr_cog/me.m01.d03:meMA.Ode1C32.text	Ἄσωμεν τῷ Κυρίῳ, τῷ τὸν Ἀθλοφόρον ἐνισχύσαντι, κατὰ τῶν ἀντιπάλων, καὶ στεφάνῳ τῆς νίκης κοσμήσαντι.
ltx/gr_gr_cog/me.m01.d03:meMA.Ode1C33.incipit	Ῥώμῃ καὶ πανοπλίᾳ, τοῦ Παμβασιλέως…
ltx/gr_gr_cog/me.m01.d03:meMA.Ode1C33.melody	@ltx/gr_gr_cog/he.h.m8:heHE.AsomenToKyrio.name
ltx/gr_gr_cog/me.m01.d03:meMA.Ode1C33.mode	@ltx/gr_gr_cog/miscellanea:misc.Mode8
ltx/gr_gr_cog/me.m01.d03:meMA.Ode1C33.ode	@ltx/gr_gr_cog/miscellanea:misc.Ode1
ltx/gr_gr_cog/me.m01.d03:meMA.Ode1C33.text	Ῥώμῃ καὶ πανοπλίᾳ, τοῦ Παμβασιλέως κρατυνόμενος, τῶν τυράννων καθεῖλες, τὴν μανίαν πανένδοξε Γόρδιε.
ltx/gr_gr_cog/me.m01.d03:meMA.Ode1C34.incipit	Τόνοις τῆς εὐσεβείας, ἐγγεγυμνασμένος δι’…
ltx/gr_gr_cog/me.m01.d03:meMA.Ode1C34.melody	@ltx/gr_gr_cog/he.h.m8:heHE.AsomenToKyrio.name
ltx/gr_gr_cog/me.m01.d03:meMA.Ode1C34.mode	@ltx/gr_gr_cog/miscellanea:misc.Mode8
ltx/gr_gr_cog/me.m01.d03:meMA.Ode1C34.ode	@ltx/gr_gr_cog/miscellanea:misc.Ode1
ltx/gr_gr_cog/me.m01.d03:meMA.Ode1C34.text	Τόνοις τῆς εὐσεβείας, ἐγγεγυμνασμένος διʼ ἀσκήσεως, τοὺς ἀγῶνας ὑπέδυς, ἑκουσίως πανεύφημε Γόρδιε.
ltx/gr_gr_cog/me.m01.d03:meMA.Ode1C3T.incipit	Ὕδατος ἁλλομένου, εἰς ἀθανασίαν ὤφθης…
ltx/gr_gr_cog/me.m01.d03:meMA.Ode1C3T.melody	@ltx/gr_gr_cog/he.h.m8:heHE.AsomenToKyrio.name
ltx/gr_gr_cog/me.m01.d03:meMA.Ode1C3T.mode	@ltx/gr_gr_cog/miscellanea:misc.Mode8
ltx/gr_gr_cog/me.m01.d03:meMA.Ode1C3T.ode	@ltx/gr_gr_cog/miscellanea:misc.Ode1
ltx/gr_gr_cog/me.m01.d03:meMA.Ode1C3T.text	Ὕδατος ἁλλομένου, εἰς ἀθανασίαν ὤφθης σκήνωμα, τοῦ πηγάζοντος πᾶσι, τὴν ζωὴν τοῖς ἀνθρώποις Θεόνυμφε.
ltx/gr_gr_cog/me.m01.d03:meMA.Ode3C11.greekmelody	@ltx/gr_gr_cog/he.h.m4:heHE.TousSousYmnologous.greekname
ltx/gr_gr_cog/me.m01.d03:meMA.Ode3C11.incipit	Εὐφράνθητι ἔρημος διψῶσα, βροτῶν φύσις…
ltx/gr_gr_cog/me.m01.d03:meMA.Ode3C11.melody	@ltx/gr_gr_cog/he.h.m4:heHE.TousSousYmnologous.name
ltx/gr_gr_cog/me.m01.d03:meMA.Ode3C11.mode	@ltx/gr_gr_cog/miscellanea:misc.Mode4
ltx/gr_gr_cog/me.m01.d03:meMA.Ode3C11.ode	@ltx/gr_gr_cog/miscellanea:misc.Ode3
ltx/gr_gr_cog/me.m01.d03:meMA.Ode3C11.text	Εὐφράνθητι ἔρημος διψῶσα, βροτῶν φύσις ἅπασα ἰδού, τὸ ὕδωρ ἐπιφαίνεται, τὸ τῆς ζωῆς ἀρδεῦον σε, γονιμωτάτως χάριτι, Χριστὸς ἡ πάντων ἀνάπλασις.
ltx/gr_gr_cog/me.m01.d03:meMA.Ode3C12.incipit	Ζητῆσαί με γνώμῃ πλανηθέντα, προέρχῃ…
ltx/gr_gr_cog/me.m01.d03:meMA.Ode3C12.melody	@ltx/gr_gr_cog/he.h.m4:heHE.TousSousYmnologous.name
ltx/gr_gr_cog/me.m01.d03:meMA.Ode3C12.mode	@ltx/gr_gr_cog/miscellanea:misc.Mode4
ltx/gr_gr_cog/me.m01.d03:meMA.Ode3C12.ode	@ltx/gr_gr_cog/miscellanea:misc.Ode3
ltx/gr_gr_cog/me.m01.d03:meMA.Ode3C12.text	Ζητῆσαί με γνώμῃ πλανηθέντα, προέρχῃ ἐν ὕδασι Χριστέ, ἐν οἷς καταδυόμενος, βυθίζεις μου τὰ πταίσματα, καὶ ἐκ βυθοῦ ἀνάγεις με, πάσης κακίας ὡς εὔσπλαγχνος.
ltx/gr_gr_cog/me.m01.d03:meMA.Ode3C13.incipit	Ἥλιος ὁρᾶν σε μέλλων Λόγε…
ltx/gr_gr_cog/me.m01.d03:meMA.Ode3C13.melody	@ltx/gr_gr_cog/he.h.m4:heHE.TousSousYmnologous.name
ltx/gr_gr_cog/me.m01.d03:meMA.Ode3C13.mode	@ltx/gr_gr_cog/miscellanea:misc.Mode4
ltx/gr_gr_cog/me.m01.d03:meMA.Ode3C13.ode	@ltx/gr_gr_cog/miscellanea:misc.Ode3
ltx/gr_gr_cog/me.m01.d03:meMA.Ode3C13.text	Ἥλιος ὁρᾶν σε μέλλων Λόγε, γυμνούμενον κρύπτει τὰς αὐγάς· ἔρχῃ γὰρ γυμνωθέντα με, ἀπάτῃ τῇ τοῦ ὄφεως, διὰ τοῦ σοῦ Βαπτίσματος, στολὴν ἐνδῦσαι σωτήριον.
ltx/gr_gr_cog/me.m01.d03:meMA.Ode3C1H.greekmelody	@ltx/gr_gr_cog/he.h.m4:heHE.TousSousYmnologous.greekname
ltx/gr_gr_cog/me.m01.d03:meMA.Ode3C1H.incipit	@ltx/gr_gr_cog/he.h.m4:heHE.TousSousYmnologous.incipit
ltx/gr_gr_cog/me.m01.d03:meMA.Ode3C1H.melody	@ltx/gr_gr_cog/he.h.m4:heHE.TousSousYmnologous.melody
ltx/gr_gr_cog/me.m01.d03:meMA.Ode3C1H.mode	@ltx/gr_gr_cog/miscellanea:misc.Mode4
ltx/gr_gr_cog/me.m01.d03:meMA.Ode3C1H.ode	@ltx/gr_gr_cog/miscellanea:misc.Ode3
ltx/gr_gr_cog/me.m01.d03:meMA.Ode3C1H.text	@ltx/gr_gr_cog/he.h.m4:heHE.TousSousYmnologous.text
ltx/gr_gr_cog/me.m01.d03:meMA.Ode3C21.greekmelody	@ltx/gr_gr_cog/he.h.m8:heHE.SyEiToStereoma.greekname
ltx/gr_gr_cog/me.m01.d03:meMA.Ode3C21.incipit	Χαίρεις νῦν θεώμενος, τὴν τῶν…
ltx/gr_gr_cog/me.m01.d03:meMA.Ode3C21.melody	@ltx/gr_gr_cog/he.h.m8:heHE.SyEiToStereoma.name
ltx/gr_gr_cog/me.m01.d03:meMA.Ode3C21.mode	@ltx/gr_gr_cog/miscellanea:misc.Mode8
ltx/gr_gr_cog/me.m01.d03:meMA.Ode3C21.ode	@ltx/gr_gr_cog/miscellanea:misc.Ode3
ltx/gr_gr_cog/me.m01.d03:meMA.Ode3C21.text	Χαίρεις νῦν θεώμενος, τὴν τῶν προῤῥήσεων ἔκβασιν, μάκαρ τῶν σῶν, τετελειωμένην, Μαλαχία θεόληπτε.
ltx/gr_gr_cog/me.m01.d03:meMA.Ode3C22.incipit	Ἴασιν ἐν πτέρυξιν, ἔχων ἀνέτειλεν…
ltx/gr_gr_cog/me.m01.d03:meMA.Ode3C22.melody	@ltx/gr_gr_cog/he.h.m8:heHE.SyEiToStereoma.name
ltx/gr_gr_cog/me.m01.d03:meMA.Ode3C22.mode	@ltx/gr_gr_cog/miscellanea:misc.Mode8
ltx/gr_gr_cog/me.m01.d03:meMA.Ode3C22.ode	@ltx/gr_gr_cog/miscellanea:misc.Ode3
ltx/gr_gr_cog/me.m01.d03:meMA.Ode3C22.text	Ἴασιν ἐν πτέρυξιν, ἔχων ἀνέτειλεν Ἥλιος, ὁ νοητός, τῆς δικαιοσύνης, ὡς προέφης θεόπνευστε.
ltx/gr_gr_cog/me.m01.d03:meMA.Ode3C2T.incipit	Ὅλην τὴν ἐλπίδα μου, ἐν…
ltx/gr_gr_cog/me.m01.d03:meMA.Ode3C2T.melody	@ltx/gr_gr_cog/he.h.m8:heHE.SyEiToStereoma.name
ltx/gr_gr_cog/me.m01.d03:meMA.Ode3C2T.mode	@ltx/gr_gr_cog/miscellanea:misc.Mode8
ltx/gr_gr_cog/me.m01.d03:meMA.Ode3C2T.ode	@ltx/gr_gr_cog/miscellanea:misc.Ode3
ltx/gr_gr_cog/me.m01.d03:meMA.Ode3C2T.text	Ὅλην τὴν ἐλπίδα μου, ἐν σοὶ Πανάμωμε τίθημι, ὅλην πρὸς σέ, χαίρων ἀνατείνω, τὴν ψυχὴν καὶ διάνοιαν.
ltx/gr_gr_cog/me.m01.d03:meMA.Ode3C31.greekmelody	@ltx/gr_gr_cog/he.h.m8:heHE.OukEstinAgios.greekname
ltx/gr_gr_cog/me.m01.d03:meMA.Ode3C31.incipit	Ῥεόντων τὸ ἄστατον λογιζόμενος, καὶ…
ltx/gr_gr_cog/me.m01.d03:meMA.Ode3C31.melody	@ltx/gr_gr_cog/he.h.m8:heHE.OukEstinAgios.name
ltx/gr_gr_cog/me.m01.d03:meMA.Ode3C31.mode	@ltx/gr_gr_cog/miscellanea:misc.Mode8
ltx/gr_gr_cog/me.m01.d03:meMA.Ode3C31.ode	@ltx/gr_gr_cog/miscellanea:misc.Ode3
ltx/gr_gr_cog/me.m01.d03:meMA.Ode3C31.text	Ῥεόντων τὸ ἄστατον λογιζόμενος, καὶ μενόντων τὴν σύστασιν, Μάρτυς, ἀοίδιμε, ἐνθυμούμενος μάκαρ, ἀτρόμως τὸ στάδιον, ὑπῆλθες τῆς ἀθλήσεως.
ltx/gr_gr_cog/me.m01.d03:meMA.Ode3C32.incipit	Ἀπέθου τὴν πρόσκαιρον ματαιότητα, καὶ…
ltx/gr_gr_cog/me.m01.d03:meMA.Ode3C32.melody	@ltx/gr_gr_cog/he.h.m8:heHE.OukEstinAgios.name
ltx/gr_gr_cog/me.m01.d03:meMA.Ode3C32.mode	@ltx/gr_gr_cog/miscellanea:misc.Mode8
ltx/gr_gr_cog/me.m01.d03:meMA.Ode3C32.ode	@ltx/gr_gr_cog/miscellanea:misc.Ode3
ltx/gr_gr_cog/me.m01.d03:meMA.Ode3C32.text	Ἀπέθου τὴν πρόσκαιρον ματαιότητα, καὶ συνέθου Πανόλβιε, τοῖς ἀεὶ διαμένουσι, καὶ φυγὼν τοὺς ἀνθρώπους, Ἀγγέλων ὁμόσκηνος, θεόφρον ἐχρημάτισας.
ltx/gr_gr_cog/me.m01.d03:meMA.Ode3C33.incipit	Γεώδη φρονήματα καταλέλοιπας, πολιτείαν οὐράνιον…
ltx/gr_gr_cog/me.m01.d03:meMA.Ode3C33.melody	@ltx/gr_gr_cog/he.h.m8:heHE.OukEstinAgios.name
ltx/gr_gr_cog/me.m01.d03:meMA.Ode3C33.mode	@ltx/gr_gr_cog/miscellanea:misc.Mode8
ltx/gr_gr_cog/me.m01.d03:meMA.Ode3C33.ode	@ltx/gr_gr_cog/miscellanea:misc.Ode3
ltx/gr_gr_cog/me.m01.d03:meMA.Ode3C33.text	Γεώδη φρονήματα καταλέλοιπας, πολιτείαν οὐράνιον, Μάρτυς εὑράμενος· καθορᾶν γὰρ μὴ φέρων, τῆς πλάνης τὸ φρύαγμα, εἰς ἔρημον ἐμάκρυνας.
ltx/gr_gr_cog/me.m01.d03:meMA.Ode3C3T.incipit	Οὐκ ἔστιν ἄμεμπτος ὡς σὺ…
ltx/gr_gr_cog/me.m01.d03:meMA.Ode3C3T.melody	@ltx/gr_gr_cog/he.h.m8:heHE.OukEstinAgios.name
ltx/gr_gr_cog/me.m01.d03:meMA.Ode3C3T.mode	@ltx/gr_gr_cog/miscellanea:misc.Mode8
ltx/gr_gr_cog/me.m01.d03:meMA.Ode3C3T.ode	@ltx/gr_gr_cog/miscellanea:misc.Ode3
ltx/gr_gr_cog/me.m01.d03:meMA.Ode3C3T.text	Οὐκ ἔστιν ἄμεμπτος ὡς σὺ Δέσποινα, καὶ οὐκ ἔστιν ἄχραντος, πλήν σου πανάμωμε· ἐν γαστρὶ γὰρ τὸν Κτίστην, τῶν πάντων ἐχώρησας, τὸν μόνον πολυέλεον.
ltx/gr_gr_cog/me.m01.d03:meMA.Ode3H.greekmelody	@ltx/gr_gr_cog/he.h.m8:heHE.OukEstinAgios.greekname
ltx/gr_gr_cog/me.m01.d03:meMA.Ode3H.incipit	@ltx/gr_gr_cog/he.h.m8:heHE.OukEstinAgios.incipit
ltx/gr_gr_cog/me.m01.d03:meMA.Ode3H.melody	@ltx/gr_gr_cog/he.h.m8:heHE.OukEstinAgios.melody
ltx/gr_gr_cog/me.m01.d03:meMA.Ode3H.mode	@ltx/gr_gr_cog/miscellanea:misc.Mode8
ltx/gr_gr_cog/me.m01.d03:meMA.Ode3H.ode	@ltx/gr_gr_cog/miscellanea:misc.Ode3
ltx/gr_gr_cog/me.m01.d03:meMA.Ode3H.text	@ltx/gr_gr_cog/he.h.m8:heHE.OukEstinAgios.text
ltx/gr_gr_cog/me.m01.d03:meMA.Ode3Kathisma1.greekmelody	@ltx/gr_gr_cog/he.a.m8:heAU.TinSofianKaiLogon.greekname
ltx/gr_gr_cog/me.m01.d03:meMA.Ode3Kathisma1.incipit	Προφητείας τὴν χάριν πεπλουτηκώς, ἐσομένων…
ltx/gr_gr_cog/me.m01.d03:meMA.Ode3Kathisma1.melody	@ltx/gr_gr_cog/he.a.m8:heAU.TinSofianKaiLogon.name
ltx/gr_gr_cog/me.m01.d03:meMA.Ode3Kathisma1.mode	@ltx/gr_gr_cog/miscellanea:misc.Mode8
ltx/gr_gr_cog/me.m01.d03:meMA.Ode3Kathisma1.text	Προφητείας τὴν χάριν πεπλουτηκώς, ἐσομένων τὴν γνῶσιν θεοπρεπῶς, μεμύησαι ἐν Πνεύματι, Μαλαχία θεόπνευστε, καὶ προλέγεις ἅπασι, Χριστοῦ τὴν ἐπέλευσιν, καὶ Ἐθνῶν πανόλβιε, τὴν θείαν ἀνάκλησιν. Ὃθεν τὴν σεπτήν σου, ἑορτάζομεν μνήμην, καὶ πόθῳ ὑμνοῦμεν σε, καὶ πιστῶς μακαρίζομεν, ἐκβοῶντές σοι ἔνδοξε. Πρέσβευε Χριστῷ τῷ Θεῷ, τῶν πταισμάτων ἄφεσιν δωρήσασθαι, τοῖς ἑορτάζουσι πόθῳ τὴν ἁγίαν μνήμην σου.
ltx/gr_gr_cog/me.m01.d03:meMA.Ode3Kathisma2.greekmelody	@ltx/gr_gr_cog/he.a.m8:heAU.TinSofianKaiLogon.greekname
ltx/gr_gr_cog/me.m01.d03:meMA.Ode3Kathisma2.incipit	Πυρωθεὶς τῇ ἀγάπῃ τοῦ Ἰησοῦ…
ltx/gr_gr_cog/me.m01.d03:meMA.Ode3Kathisma2.melody	@ltx/gr_gr_cog/he.a.m8:heAU.TinSofianKaiLogon.name
ltx/gr_gr_cog/me.m01.d03:meMA.Ode3Kathisma2.mode	@ltx/gr_gr_cog/miscellanea:misc.Mode8
ltx/gr_gr_cog/me.m01.d03:meMA.Ode3Kathisma2.text	Πυρωθεὶς τῇ ἀγάπῃ τοῦ Ἰησοῦ, αὐθαιρέτῳ βουλήσει Μάρτυς σοφέ, προθύμως εἰς θάνατον, σεαυτὸν παραδέδωκας, καὶ σταδίου ἐν μέσῳ, αὐτόκλητος ἵστασο, ἐκβοῶν τοῖς τυράννοις, ἰδοὺ ἐγὼ πάρειμι. Ὅθεν καὶ τὴν πλάνην παῤῥησίᾳ ἐλέγξας, ἐτμήθης τὴν κάραν σου, καὶ ζωὴν πρὸς τὴν ἄληκτον, μεταβέβηκας ἔνδοξε. Πρέσβευε Χριστῷ τῷ Θεῷ, τῶν πταισμάτων ἄφεσιν δωρήσασθαι, τοῖς ἑορτάζουσι πόθῳ, τὴν ἁγίαν μνήμην σου.
ltx/gr_gr_cog/me.m01.d03:meMA.Ode3Kathisma3.greekmelody	@ltx/gr_gr_cog/he.a.m8:heAU.AvlonPoimenikon.greekname
ltx/gr_gr_cog/me.m01.d03:meMA.Ode3Kathisma3.incipit	Χορὸς προφητικός, προκηρύττων χαίρει, τὸ…
ltx/gr_gr_cog/me.m01.d03:meMA.Ode3Kathisma3.melody	@ltx/gr_gr_cog/he.a.m8:heAU.AvlonPoimenikon.name
ltx/gr_gr_cog/me.m01.d03:meMA.Ode3Kathisma3.mode	@ltx/gr_gr_cog/miscellanea:misc.Mode8
ltx/gr_gr_cog/me.m01.d03:meMA.Ode3Kathisma3.text	Χορὸς προφητικός, προκηρύττων χαίρει, τὸ Βάπτισμα Χριστοῦ τὴν ζωὴν ἀναβλύζον· Κράζει ὁ Ἠσαΐας, ἀντλῆσαι ὕδωρ τὸ καθαρτήριον. Γράφει ὁ Θεοπάτωρ, πῶς ἐκ προσώπου φεύγει ἡ θάλασσα, τοῦ εὐδοκίᾳ σῴζοντος Θεοῦ, τὸ γένος τῶν ἀνθρώπων.
ltx/gr_gr_cog/me.m01.d03:meMA.Ode4C11.greekmelody	@ltx/gr_gr_cog/he.h.m4:heHE.TinAnexichniaston.greekname
ltx/gr_gr_cog/me.m01.d03:meMA.Ode4C11.incipit	Θάμβει συσχεθήσεται ὁ οὐρανός, καὶ…
ltx/gr_gr_cog/me.m01.d03:meMA.Ode4C11.melody	@ltx/gr_gr_cog/he.h.m4:heHE.TinAnexichniaston.name
ltx/gr_gr_cog/me.m01.d03:meMA.Ode4C11.mode	@ltx/gr_gr_cog/miscellanea:misc.Mode4
ltx/gr_gr_cog/me.m01.d03:meMA.Ode4C11.ode	@ltx/gr_gr_cog/miscellanea:misc.Ode4
ltx/gr_gr_cog/me.m01.d03:meMA.Ode4C11.text	Θάμβει συσχεθήσεται ὁ οὐρανός, καὶ τὰ τῶν Ἀγγέλων στρατεύματα, δουλοπρεπῶς σε, ἀφικνούμενον Χριστέ, πρὸς τὸν σὸν δοῦλον βλέποντες, καὶ ἐπιζητοῦντα τὸ Βάπτισμα.
ltx/gr_gr_cog/me.m01.d03:meMA.Ode4C12.incipit	Ἰωάννη σκίρτησον· ἔρχεται γάρ, πάντας…
ltx/gr_gr_cog/me.m01.d03:meMA.Ode4C12.melody	@ltx/gr_gr_cog/he.h.m4:heHE.TinAnexichniaston.name
ltx/gr_gr_cog/me.m01.d03:meMA.Ode4C12.mode	@ltx/gr_gr_cog/miscellanea:misc.Mode4
ltx/gr_gr_cog/me.m01.d03:meMA.Ode4C12.ode	@ltx/gr_gr_cog/miscellanea:misc.Ode4
ltx/gr_gr_cog/me.m01.d03:meMA.Ode4C12.text	Ἰωάννη σκίρτησον· ἔρχεται γάρ, πάντας ὁ λυτρούμενος Κύριος, ὑποκλιθῆναι, ὁ τῇ χειρί σου ταπεινῶς, ὅπως ταπεινωθέντα με, θείῳ ἀνυψώσῃ Βαπτίσματι.
ltx/gr_gr_cog/me.m01.d03:meMA.Ode4C13.incipit	Κλίνας καταβέβηκας τοὺς οὐρανούς, ἐπὶ…
ltx/gr_gr_cog/me.m01.d03:meMA.Ode4C13.melody	@ltx/gr_gr_cog/he.h.m4:heHE.TinAnexichniaston.name
ltx/gr_gr_cog/me.m01.d03:meMA.Ode4C13.mode	@ltx/gr_gr_cog/miscellanea:misc.Mode4
ltx/gr_gr_cog/me.m01.d03:meMA.Ode4C13.ode	@ltx/gr_gr_cog/miscellanea:misc.Ode4
ltx/gr_gr_cog/me.m01.d03:meMA.Ode4C13.text	Κλίνας καταβέβηκας τοὺς οὐρανούς, ἐπὶ τὴν Παρθένον Φιλάνθρωπε, καὶ Ἰωάννῃ, ὑποκλίνεις κορυφήν, ἐπιζητῶν τὸ Βάπτισμα· δόξα τῇ πολλῇ εὐσπλαγχνίᾳ σου.
ltx/gr_gr_cog/me.m01.d03:meMA.Ode4C14.incipit	Λύων τὰς ἀμέτρους μου Λόγε…
ltx/gr_gr_cog/me.m01.d03:meMA.Ode4C14.melody	@ltx/gr_gr_cog/he.h.m4:heHE.TinAnexichniaston.name
ltx/gr_gr_cog/me.m01.d03:meMA.Ode4C14.mode	@ltx/gr_gr_cog/miscellanea:misc.Mode4
ltx/gr_gr_cog/me.m01.d03:meMA.Ode4C14.ode	@ltx/gr_gr_cog/miscellanea:misc.Ode4
ltx/gr_gr_cog/me.m01.d03:meMA.Ode4C14.text	Λύων τὰς ἀμέτρους μου Λόγε σειράς, τῶν ἁμαρτημάτων ἐν ὕδασι, τοῦ Ἰορδάνου, ἐπισπεύδεις προσελθεῖν, καὶ βαπτισθῆναι Δέσποτα, δόξα τῇ πολλῇ εὐσπλαγχνίᾳ σου.
ltx/gr_gr_cog/me.m01.d03:meMA.Ode4C1H.greekmelody	@ltx/gr_gr_cog/he.h.m4:heHE.TinAnexichniaston.greekname
ltx/gr_gr_cog/me.m01.d03:meMA.Ode4C1H.incipit	@ltx/gr_gr_cog/he.h.m4:heHE.TinAnexichniaston.incipit
ltx/gr_gr_cog/me.m01.d03:meMA.Ode4C1H.melody	@ltx/gr_gr_cog/he.h.m4:heHE.TinAnexichniaston.melody
ltx/gr_gr_cog/me.m01.d03:meMA.Ode4C1H.mode	@ltx/gr_gr_cog/miscellanea:misc.Mode4
ltx/gr_gr_cog/me.m01.d03:meMA.Ode4C1H.ode	@ltx/gr_gr_cog/miscellanea:misc.Ode4
ltx/gr_gr_cog/me.m01.d03:meMA.Ode4C1H.text	@ltx/gr_gr_cog/he.h.m4:heHE.TinAnexichniaston.text
ltx/gr_gr_cog/me.m01.d03:meMA.Ode4C21.greekmelody	@ltx/gr_gr_cog/he.h.m8:heHE.EisakikoaKyrie.greekname
ltx/gr_gr_cog/me.m01.d03:meMA.Ode4C21.incipit	Ὑποφήτης γενόμενος, τῆς θεαρχικῆς Μάκαρ…
ltx/gr_gr_cog/me.m01.d03:meMA.Ode4C21.melody	@ltx/gr_gr_cog/he.h.m8:heHE.EisakikoaKyrie.name
ltx/gr_gr_cog/me.m01.d03:meMA.Ode4C21.mode	@ltx/gr_gr_cog/miscellanea:misc.Mode8
ltx/gr_gr_cog/me.m01.d03:meMA.Ode4C21.ode	@ltx/gr_gr_cog/miscellanea:misc.Ode4
ltx/gr_gr_cog/me.m01.d03:meMA.Ode4C21.text	Ὑποφήτης γενόμενος, τῆς θεαρχικῆς Μάκαρ ἀγαθότητος, πᾶσιν Ἔθνεσιν ἐκήρυξας, τὴν γεγενημένην ἀπολύτρωσιν.
ltx/gr_gr_cog/me.m01.d03:meMA.Ode4C22.incipit	Μυηθεὶς διὰ Πνεύματος, τῆς ὑπερφυοῦς…
ltx/gr_gr_cog/me.m01.d03:meMA.Ode4C22.melody	@ltx/gr_gr_cog/he.h.m8:heHE.EisakikoaKyrie.name
ltx/gr_gr_cog/me.m01.d03:meMA.Ode4C22.mode	@ltx/gr_gr_cog/miscellanea:misc.Mode8
ltx/gr_gr_cog/me.m01.d03:meMA.Ode4C22.ode	@ltx/gr_gr_cog/miscellanea:misc.Ode4
ltx/gr_gr_cog/me.m01.d03:meMA.Ode4C22.text	Μυηθεὶς διὰ Πνεύματος, τῆς ὑπερφυοῦς τοῦ Λόγου σαρκώσεως, τὸ ἀπόῤῥητον μυστήριον, Μαλαχία μάκαρ προηγόρευσας.
ltx/gr_gr_cog/me.m01.d03:meMA.Ode4C2T.incipit	Ἐπὶ σοὶ ἀνατίθημι, πᾶσαν προσδοκίαν…
ltx/gr_gr_cog/me.m01.d03:meMA.Ode4C2T.melody	@ltx/gr_gr_cog/he.h.m8:heHE.EisakikoaKyrie.name
ltx/gr_gr_cog/me.m01.d03:meMA.Ode4C2T.mode	@ltx/gr_gr_cog/miscellanea:misc.Mode8
ltx/gr_gr_cog/me.m01.d03:meMA.Ode4C2T.ode	@ltx/gr_gr_cog/miscellanea:misc.Ode4
ltx/gr_gr_cog/me.m01.d03:meMA.Ode4C2T.text	Ἐπὶ σοὶ ἀνατίθημι, πᾶσαν προσδοκίαν τῆς σωτηρίας μου, καὶ τοῦ βίου τὴν κυβέρνησιν, Κεχαριτωμένη Μητροπάρθενε.
ltx/gr_gr_cog/me.m01.d03:meMA.Ode4C31.greekmelody	@ltx/gr_gr_cog/he.h.m8:heHE.ExOrousKataskiou.greekname
ltx/gr_gr_cog/me.m01.d03:meMA.Ode4C31.incipit	Ῥήσεων Χριστοῦ, παμμάκαρ ὑπακούσας, χαίρων…
ltx/gr_gr_cog/me.m01.d03:meMA.Ode4C31.melody	@ltx/gr_gr_cog/he.h.m8:heHE.ExOrousKataskiou.name
ltx/gr_gr_cog/me.m01.d03:meMA.Ode4C31.mode	@ltx/gr_gr_cog/miscellanea:misc.Mode8
ltx/gr_gr_cog/me.m01.d03:meMA.Ode4C31.ode	@ltx/gr_gr_cog/miscellanea:misc.Ode4
ltx/gr_gr_cog/me.m01.d03:meMA.Ode4C31.text	Ῥήσεων Χριστοῦ, παμμάκαρ ὑπακούσας, χαίρων τὴν φθαρτήν, κατέλιπες στρατείαν, καὶ Βασιλεῖ ἐστρατεύθης τῷ οὐρανίῳ, στεφανηφόρε Μάρτυς Γόρδιε.
ltx/gr_gr_cog/me.m01.d03:meMA.Ode4C32.incipit	Διεθρύβησαν Μάρτυς, ὄρη τῶν τυράννων…
ltx/gr_gr_cog/me.m01.d03:meMA.Ode4C32.melody	@ltx/gr_gr_cog/he.h.m8:heHE.ExOrousKataskiou.name
ltx/gr_gr_cog/me.m01.d03:meMA.Ode4C32.mode	@ltx/gr_gr_cog/miscellanea:misc.Mode8
ltx/gr_gr_cog/me.m01.d03:meMA.Ode4C32.ode	@ltx/gr_gr_cog/miscellanea:misc.Ode4
ltx/gr_gr_cog/me.m01.d03:meMA.Ode4C32.text	Διεθρύβησαν Μάρτυς, ὄρη τῶν τυράννων, ἐτάκησαν δέ, βουνοὶ οἱ τῶν εἰδώλων, τῇ καρτερᾷ σου ἀθλήσει καὶ παῤῥησίᾳ, στεφανηφόρε προσεγγίσαντα.
ltx/gr_gr_cog/me.m01.d03:meMA.Ode4C33.incipit	Ἴσχυσας Σταυροῦ, τῇ θείᾳ δυναστείᾳ…
ltx/gr_gr_cog/me.m01.d03:meMA.Ode4C33.melody	@ltx/gr_gr_cog/he.h.m8:heHE.ExOrousKataskiou.name
ltx/gr_gr_cog/me.m01.d03:meMA.Ode4C33.mode	@ltx/gr_gr_cog/miscellanea:misc.Mode8
ltx/gr_gr_cog/me.m01.d03:meMA.Ode4C33.ode	@ltx/gr_gr_cog/miscellanea:misc.Ode4
ltx/gr_gr_cog/me.m01.d03:meMA.Ode4C33.text	Ἴσχυσας Σταυροῦ, τῇ θείᾳ δυναστείᾳ, δήμῳ δυσσεβεῖ, βοᾶν μεγαλοφώνως· Τοῖς μὴ ζητοῦσιν εὑρέθην μηδʼ ἐρωτῶσι· νῦν πεποιθότως ἐμφανίζομαι.
ltx/gr_gr_cog/me.m01.d03:meMA.Ode4C34.incipit	Ὅλην κατὰ σοῦ, θέοφρον τοῦ…
ltx/gr_gr_cog/me.m01.d03:meMA.Ode4C34.melody	@ltx/gr_gr_cog/he.h.m8:heHE.ExOrousKataskiou.name
ltx/gr_gr_cog/me.m01.d03:meMA.Ode4C34.mode	@ltx/gr_gr_cog/miscellanea:misc.Mode8
ltx/gr_gr_cog/me.m01.d03:meMA.Ode4C34.ode	@ltx/gr_gr_cog/miscellanea:misc.Ode4
ltx/gr_gr_cog/me.m01.d03:meMA.Ode4C34.text	Ὅλην κατὰ σοῦ, θέοφρον τοῦ τυράννου, ἤγειρας σοφέ, τὴν ἄσχετον μανίαν, καταπλαγέντος παμμάκαρ τῆς διανοίας, καὶ τῆς ψυχῆς σου τὸ ἀνάστημα.
ltx/gr_gr_cog/me.m01.d03:meMA.Ode4C3T.incipit	Νύμφη τοῦ Θεοῦ, Μαρία Θεοτόκε…
ltx/gr_gr_cog/me.m01.d03:meMA.Ode4C3T.melody	@ltx/gr_gr_cog/he.h.m8:heHE.ExOrousKataskiou.name
ltx/gr_gr_cog/me.m01.d03:meMA.Ode4C3T.mode	@ltx/gr_gr_cog/miscellanea:misc.Mode8
ltx/gr_gr_cog/me.m01.d03:meMA.Ode4C3T.ode	@ltx/gr_gr_cog/miscellanea:misc.Ode4
ltx/gr_gr_cog/me.m01.d03:meMA.Ode4C3T.text	Νύμφη τοῦ Θεοῦ, Μαρία Θεοτόκε, ῥῦσαί με δεινῶν, πταισμάτων καὶ κινδύνων, καὶ πρὸς γαλήνης λιμένα καὶ σωτηρίας, ταῖς σαῖς πρεσβείαις καθοδήγησον.
ltx/gr_gr_cog/me.m01.d03:meMA.Ode5C11.greekmelody	@ltx/gr_gr_cog/he.h.m4:heHE.ExestiTaSympanta.greekname
ltx/gr_gr_cog/me.m01.d03:meMA.Ode5C11.incipit	Μακρὰν τὸ ἀνθρώπινον, ἀπὸ Θεοῦ…
ltx/gr_gr_cog/me.m01.d03:meMA.Ode5C11.melody	@ltx/gr_gr_cog/he.h.m4:heHE.ExestiTaSympanta.name
ltx/gr_gr_cog/me.m01.d03:meMA.Ode5C11.mode	@ltx/gr_gr_cog/miscellanea:misc.Mode4
ltx/gr_gr_cog/me.m01.d03:meMA.Ode5C11.ode	@ltx/gr_gr_cog/miscellanea:misc.Ode5
ltx/gr_gr_cog/me.m01.d03:meMA.Ode5C11.text	Μακρὰν τὸ ἀνθρώπινον, ἀπὸ Θεοῦ γενόμενον, ὁ Λόγος Θεοῦ κατοικτειρήσας, ἄνθρωπος ὤφθη, καὶ Βαπτισμῷ θεουργῷ, τοῦτο οἰκειοῖ θεοπρεπῶς, καὶ πρὸς τὸ ἀρχέτυπον, ἐπανάγει ἀξίωμα.
ltx/gr_gr_cog/me.m01.d03:meMA.Ode5C12.incipit	Νεκροὺς χρηματίσαντας, ἡμᾶς ταῖς παραβάσεσιν…
ltx/gr_gr_cog/me.m01.d03:meMA.Ode5C12.melody	@ltx/gr_gr_cog/he.h.m4:heHE.ExestiTaSympanta.name
ltx/gr_gr_cog/me.m01.d03:meMA.Ode5C12.mode	@ltx/gr_gr_cog/miscellanea:misc.Mode4
ltx/gr_gr_cog/me.m01.d03:meMA.Ode5C12.ode	@ltx/gr_gr_cog/miscellanea:misc.Ode5
ltx/gr_gr_cog/me.m01.d03:meMA.Ode5C12.text	Νεκροὺς χρηματίσαντας, ἡμᾶς ταῖς παραβάσεσιν, ἔρχῃ Ζωοδότα πανοικτίρμον, ἀναζωῶσαι ταῖς, Ἰορδάνου ῥοαῖς· ὅθεν σου δοξάζομεν πιστῶς, νῦν τὴν ἐπιφάνειαν, καὶ ἄφατον ἔλεος.
ltx/gr_gr_cog/me.m01.d03:meMA.Ode5C13.incipit	Ξενίζεται ἅπασα, ψυχὴ ἐννοουμένη σου…
ltx/gr_gr_cog/me.m01.d03:meMA.Ode5C13.melody	@ltx/gr_gr_cog/he.h.m4:heHE.ExestiTaSympanta.name
ltx/gr_gr_cog/me.m01.d03:meMA.Ode5C13.mode	@ltx/gr_gr_cog/miscellanea:misc.Mode4
ltx/gr_gr_cog/me.m01.d03:meMA.Ode5C13.ode	@ltx/gr_gr_cog/miscellanea:misc.Ode5
ltx/gr_gr_cog/me.m01.d03:meMA.Ode5C13.text	Ξενίζεται ἅπασα, ψυχὴ ἐννοουμένη σου, Λόγε τὴν φρικτὴν οἰκονομίαν! πῶς ἀναπλάσαι πάντα βουλόμενος, ἔρχῃ ἐπιβῆναι ποταμοῦ, ῥεύμασι γυμνούμενος, ὁ φῶς ἀναβαλλόμενος.
ltx/gr_gr_cog/me.m01.d03:meMA.Ode5C1H.greekmelody	@ltx/gr_gr_cog/he.h.m4:heHE.ExestiTaSympanta.greekname
ltx/gr_gr_cog/me.m01.d03:meMA.Ode5C1H.incipit	@ltx/gr_gr_cog/he.h.m4:heHE.ExestiTaSympanta.incipit
ltx/gr_gr_cog/me.m01.d03:meMA.Ode5C1H.melody	@ltx/gr_gr_cog/he.h.m4:heHE.ExestiTaSympanta.melody
ltx/gr_gr_cog/me.m01.d03:meMA.Ode5C1H.mode	@ltx/gr_gr_cog/miscellanea:misc.Mode4
ltx/gr_gr_cog/me.m01.d03:meMA.Ode5C1H.ode	@ltx/gr_gr_cog/miscellanea:misc.Ode5
ltx/gr_gr_cog/me.m01.d03:meMA.Ode5C1H.text	@ltx/gr_gr_cog/he.h.m4:heHE.ExestiTaSympanta.text
ltx/gr_gr_cog/me.m01.d03:meMA.Ode5C21.greekmelody	@ltx/gr_gr_cog/he.h.m8:heHE.OEkNyktosAgnoias.greekname
ltx/gr_gr_cog/me.m01.d03:meMA.Ode5C21.incipit	Τὴν φοβερὰν ἡμέραν, τῆς τοῦ…
ltx/gr_gr_cog/me.m01.d03:meMA.Ode5C21.melody	@ltx/gr_gr_cog/he.h.m8:heHE.OEkNyktosAgnoias.name
ltx/gr_gr_cog/me.m01.d03:meMA.Ode5C21.mode	@ltx/gr_gr_cog/miscellanea:misc.Mode8
ltx/gr_gr_cog/me.m01.d03:meMA.Ode5C21.ode	@ltx/gr_gr_cog/miscellanea:misc.Ode5
ltx/gr_gr_cog/me.m01.d03:meMA.Ode5C21.text	Τὴν φοβερὰν ἡμέραν, τῆς τοῦ Χριστοῦ παρουσίας παρήγγειλας, Μαλαχία θεόφρον, θείῳ φωτιζόμενος Πνεύματι.
ltx/gr_gr_cog/me.m01.d03:meMA.Ode5C22.incipit	Ὁ τῶν ψυχῶν τὸν ῥύπον…
ltx/gr_gr_cog/me.m01.d03:meMA.Ode5C22.melody	@ltx/gr_gr_cog/he.h.m8:heHE.OEkNyktosAgnoias.name
ltx/gr_gr_cog/me.m01.d03:meMA.Ode5C22.mode	@ltx/gr_gr_cog/miscellanea:misc.Mode8
ltx/gr_gr_cog/me.m01.d03:meMA.Ode5C22.ode	@ltx/gr_gr_cog/miscellanea:misc.Ode5
ltx/gr_gr_cog/me.m01.d03:meMA.Ode5C22.text	Ὁ τῶν ψυχῶν τὸν ῥύπον, ἀναχωνεύων καὶ πλύνων τῇ χάριτι, ὡς ἐν πόᾳ πλυνόντων, οὕτως σε θεόφρον ἐδόξασε.
ltx/gr_gr_cog/me.m01.d03:meMA.Ode5C2T.incipit	Κράτος θανάτου Κόρη, τῷ ζωηφόρῳ…
ltx/gr_gr_cog/me.m01.d03:meMA.Ode5C2T.melody	@ltx/gr_gr_cog/he.h.m8:heHE.OEkNyktosAgnoias.name
ltx/gr_gr_cog/me.m01.d03:meMA.Ode5C2T.mode	@ltx/gr_gr_cog/miscellanea:misc.Mode8
ltx/gr_gr_cog/me.m01.d03:meMA.Ode5C2T.ode	@ltx/gr_gr_cog/miscellanea:misc.Ode5
ltx/gr_gr_cog/me.m01.d03:meMA.Ode5C2T.text	Κράτος θανάτου Κόρη, τῷ ζωηφόρῳ σου τόκῳ διέλυσας, Παναγία Παρθένε, καὶ ζωὴν ἐπήγασας ἄλυπον.
ltx/gr_gr_cog/me.m01.d03:meMA.Ode5C31.greekmelody	@ltx/gr_gr_cog/he.h.m8:heHE.OEkNyktosAgnoias.greekname
ltx/gr_gr_cog/me.m01.d03:meMA.Ode5C31.incipit	Ὑπεισελθὼν ἀτρόμως, καὶ ῥωμαλέως ὡς…
ltx/gr_gr_cog/me.m01.d03:meMA.Ode5C31.melody	@ltx/gr_gr_cog/he.h.m8:heHE.OEkNyktosAgnoias.name
ltx/gr_gr_cog/me.m01.d03:meMA.Ode5C31.mode	@ltx/gr_gr_cog/miscellanea:misc.Mode8
ltx/gr_gr_cog/me.m01.d03:meMA.Ode5C31.ode	@ltx/gr_gr_cog/miscellanea:misc.Ode5
ltx/gr_gr_cog/me.m01.d03:meMA.Ode5C31.text	Ὑπεισελθὼν ἀτρόμως, καὶ ῥωμαλέως ὡς λέων τὸ θέατρον, πέτρας ὥσπερ ἀψύχους, Μάκαρ ἐλογίσω τοὺς ἄφρονας.
ltx/gr_gr_cog/me.m01.d03:meMA.Ode5C32.incipit	Μεμυημένος Μάρτυς, τῆς θεοπνεύστου Γραφῆς…
ltx/gr_gr_cog/me.m01.d03:meMA.Ode5C32.melody	@ltx/gr_gr_cog/he.h.m8:heHE.OEkNyktosAgnoias.name
ltx/gr_gr_cog/me.m01.d03:meMA.Ode5C32.mode	@ltx/gr_gr_cog/miscellanea:misc.Mode8
ltx/gr_gr_cog/me.m01.d03:meMA.Ode5C32.ode	@ltx/gr_gr_cog/miscellanea:misc.Ode5
ltx/gr_gr_cog/me.m01.d03:meMA.Ode5C32.text	Μεμυημένος Μάρτυς, τῆς θεοπνεύστου Γραφῆς τὰ διδάγματα, πάντα πρὸς σωτηρίαν, εὗρες ἐπαλείφοντα Γόρδιε.
ltx/gr_gr_cog/me.m01.d03:meMA.Ode5C33.incipit	Νενοηκὼς θέοφρον, τὴν σταθεράν σου…
ltx/gr_gr_cog/me.m01.d03:meMA.Ode5C33.melody	@ltx/gr_gr_cog/he.h.m8:heHE.OEkNyktosAgnoias.name
ltx/gr_gr_cog/me.m01.d03:meMA.Ode5C33.mode	@ltx/gr_gr_cog/miscellanea:misc.Mode8
ltx/gr_gr_cog/me.m01.d03:meMA.Ode5C33.ode	@ltx/gr_gr_cog/miscellanea:misc.Ode5
ltx/gr_gr_cog/me.m01.d03:meMA.Ode5C33.text	Νενοηκὼς θέοφρον, τὴν σταθεράν σου ὁ Τύραννος ἔνστασιν, πέτρα καθάπερ κῦμα, τῇ σῇ διεῤῥάγη στεῤῥότητι.
ltx/gr_gr_cog/me.m01.d03:meMA.Ode5C3T.incipit	Ὁ ἐκ τῆς σῆς νηδύος…
ltx/gr_gr_cog/me.m01.d03:meMA.Ode5C3T.melody	@ltx/gr_gr_cog/he.h.m8:heHE.OEkNyktosAgnoias.name
ltx/gr_gr_cog/me.m01.d03:meMA.Ode5C3T.mode	@ltx/gr_gr_cog/miscellanea:misc.Mode8
ltx/gr_gr_cog/me.m01.d03:meMA.Ode5C3T.ode	@ltx/gr_gr_cog/miscellanea:misc.Ode5
ltx/gr_gr_cog/me.m01.d03:meMA.Ode5C3T.text	Ὁ ἐκ τῆς σῆς νηδύος, ὑπερουσίως Παρθένε σαρκούμενος, θεογνωσίας αἴγλῃ, κόσμον κατελάμπρυνε Πάναγνε.
ltx/gr_gr_cog/me.m01.d03:meMA.Ode6C11.greekmelody	@ltx/gr_gr_cog/he.h.m4:heHE.TinTheianTaftin.greekname
ltx/gr_gr_cog/me.m01.d03:meMA.Ode6C11.incipit	Οἱ σκότει πάλαι καθήμενοι, τὸ…
ltx/gr_gr_cog/me.m01.d03:meMA.Ode6C11.melody	@ltx/gr_gr_cog/he.h.m4:heHE.TinTheianTaftin.name
ltx/gr_gr_cog/me.m01.d03:meMA.Ode6C11.mode	@ltx/gr_gr_cog/miscellanea:misc.Mode4
ltx/gr_gr_cog/me.m01.d03:meMA.Ode6C11.ode	@ltx/gr_gr_cog/miscellanea:misc.Ode6
ltx/gr_gr_cog/me.m01.d03:meMA.Ode6C11.text	Οἱ σκότει πάλαι καθήμενοι, τὸ φῶς ἐπιδημῆσαν θεώμενοι, χαρᾶς ἐμπλήσθητε, ἰδοὺ ἐπέφανε Κύριος, τὰ Ἰορδάνου ῥεῖθρα περιβαλλόμενος.
ltx/gr_gr_cog/me.m01.d03:meMA.Ode6C12.incipit	Πῶς βλέψει σε ἀφικόμενον, ὁ…
ltx/gr_gr_cog/me.m01.d03:meMA.Ode6C12.melody	@ltx/gr_gr_cog/he.h.m4:heHE.TinTheianTaftin.name
ltx/gr_gr_cog/me.m01.d03:meMA.Ode6C12.mode	@ltx/gr_gr_cog/miscellanea:misc.Mode4
ltx/gr_gr_cog/me.m01.d03:meMA.Ode6C12.ode	@ltx/gr_gr_cog/miscellanea:misc.Ode6
ltx/gr_gr_cog/me.m01.d03:meMA.Ode6C12.text	Πῶς βλέψει σε ἀφικόμενον, ὁ Πρόδρομος Σωτὴρ καὶ αἰτούμενον, τὸ θεῖον Βάπτισμα, πῶς σε ῥοαὶ ὑποδέξονται, τοῦ Ἰορδάνου, ῥεῖθρον ὄντα ἀφέσεως;
ltx/gr_gr_cog/me.m01.d03:meMA.Ode6C13.incipit	Ῥανάτωσαν εὐφραινόμεναι, νεφέλαι νοητὴν ἀγαλλίασιν…
ltx/gr_gr_cog/me.m01.d03:meMA.Ode6C13.melody	@ltx/gr_gr_cog/he.h.m4:heHE.TinTheianTaftin.name
ltx/gr_gr_cog/me.m01.d03:meMA.Ode6C13.mode	@ltx/gr_gr_cog/miscellanea:misc.Mode4
ltx/gr_gr_cog/me.m01.d03:meMA.Ode6C13.ode	@ltx/gr_gr_cog/miscellanea:misc.Ode6
ltx/gr_gr_cog/me.m01.d03:meMA.Ode6C13.text	Ῥανάτωσαν εὐφραινόμεναι, νεφέλαι νοητὴν ἀγαλλίασιν, ἰδοὺ ἀφίκετο, τοῦ βαπτισθῆναι ὁ Κύριος, διασκεδάζων νέφη τῶν καρδιῶν ἡμῶν.
ltx/gr_gr_cog/me.m01.d03:meMA.Ode6C1H.greekmelody	@ltx/gr_gr_cog/he.h.m4:heHE.TinTheianTaftin.greekname
ltx/gr_gr_cog/me.m01.d03:meMA.Ode6C1H.incipit	@ltx/gr_gr_cog/he.h.m4:heHE.TinTheianTaftin.incipit
ltx/gr_gr_cog/me.m01.d03:meMA.Ode6C1H.melody	@ltx/gr_gr_cog/he.h.m4:heHE.TinTheianTaftin.melody
ltx/gr_gr_cog/me.m01.d03:meMA.Ode6C1H.mode	@ltx/gr_gr_cog/miscellanea:misc.Mode4
ltx/gr_gr_cog/me.m01.d03:meMA.Ode6C1H.ode	@ltx/gr_gr_cog/miscellanea:misc.Ode6
ltx/gr_gr_cog/me.m01.d03:meMA.Ode6C1H.text	@ltx/gr_gr_cog/he.h.m4:heHE.TinTheianTaftin.text
ltx/gr_gr_cog/me.m01.d03:meMA.Ode6C21.greekmelody	@ltx/gr_gr_cog/he.h.m8:heHE.TinDeisinEkcheo.greekname
ltx/gr_gr_cog/me.m01.d03:meMA.Ode6C21.incipit	Λαμφθεῖσά σου ἡ σοφὴ διάνοια…
ltx/gr_gr_cog/me.m01.d03:meMA.Ode6C21.melody	@ltx/gr_gr_cog/he.h.m8:heHE.TinDeisinEkcheo.name
ltx/gr_gr_cog/me.m01.d03:meMA.Ode6C21.mode	@ltx/gr_gr_cog/miscellanea:misc.Mode8
ltx/gr_gr_cog/me.m01.d03:meMA.Ode6C21.ode	@ltx/gr_gr_cog/miscellanea:misc.Ode6
ltx/gr_gr_cog/me.m01.d03:meMA.Ode6C21.text	Λαμφθεῖσά σου ἡ σοφὴ διάνοια, ὑπʼ αὐτῆς τῆς θεϊκῆς φωταυγίας, καὶ τῶν χαμαί, χωρισθεῖσα πραγμάτων, τῆς τῶν μελλόντων ἠξίωται γνώσεως· τὴν κλῆσιν γὰρ τὴν τῶν Ἐθνῶν, καὶ τοῦ νόμου τὴν παῦσιν προείρηκας.
ltx/gr_gr_cog/me.m01.d03:meMA.Ode6C22.incipit	Ἐλήλυθεν ἀληθῶς ὁ Κύριος, ὃν…
ltx/gr_gr_cog/me.m01.d03:meMA.Ode6C22.melody	@ltx/gr_gr_cog/he.h.m8:heHE.TinDeisinEkcheo.name
ltx/gr_gr_cog/me.m01.d03:meMA.Ode6C22.mode	@ltx/gr_gr_cog/miscellanea:misc.Mode8
ltx/gr_gr_cog/me.m01.d03:meMA.Ode6C22.ode	@ltx/gr_gr_cog/miscellanea:misc.Ode6
ltx/gr_gr_cog/me.m01.d03:meMA.Ode6C22.text	Ἐλήλυθεν ἀληθῶς ὁ Κύριος, ὃν ἡμεῖς περιχαρῶς ἐζητοῦμεν, εἰς τὸν ναόν, ὃν αὐτὸς ἐκ Παρθένου, εὐλογημένης σοφῶς ᾠκοδόμησεν, ὡς ἔφησεν ὑπὸ Θεοῦ, ἐλλαμφθεὶς Μαλαχίας ὁ ἔνδοξος.
ltx/gr_gr_cog/me.m01.d03:meMA.Ode6C2T.incipit	Ὁ ἄναρχος τοῦ Πατρὸς μονογενής…
ltx/gr_gr_cog/me.m01.d03:meMA.Ode6C2T.melody	@ltx/gr_gr_cog/he.h.m8:heHE.TinDeisinEkcheo.name
ltx/gr_gr_cog/me.m01.d03:meMA.Ode6C2T.mode	@ltx/gr_gr_cog/miscellanea:misc.Mode8
ltx/gr_gr_cog/me.m01.d03:meMA.Ode6C2T.ode	@ltx/gr_gr_cog/miscellanea:misc.Ode6
ltx/gr_gr_cog/me.m01.d03:meMA.Ode6C2T.text	Ὁ ἄναρχος τοῦ Πατρὸς μονογενής, ὁ αὐτὸς μονογενὴς ἐκ Παρθένου, σωματωθείς, ἀποῤῥήτως ἐτέχθη, καὶ τὴν τεκοῦσαν Παρθένον ἐφύλαξε· Θεὸς γὰρ ἦν ἀληθινός, εἰ καὶ φύσιν ἀνθρώπου ἀνέλαβε.
ltx/gr_gr_cog/me.m01.d03:meMA.Ode6C31.greekmelody	@ltx/gr_gr_cog/he.h.m8:heHE.OsTonProfitinErryso.greekname
ltx/gr_gr_cog/me.m01.d03:meMA.Ode6C31.incipit	Ἱερουργείται θυσία, καὶ δεκτὴ προσφορά…
ltx/gr_gr_cog/me.m01.d03:meMA.Ode6C31.melody	@ltx/gr_gr_cog/he.h.m8:heHE.OsTonProfitinErryso.name
ltx/gr_gr_cog/me.m01.d03:meMA.Ode6C31.mode	@ltx/gr_gr_cog/miscellanea:misc.Mode8
ltx/gr_gr_cog/me.m01.d03:meMA.Ode6C31.ode	@ltx/gr_gr_cog/miscellanea:misc.Ode6
ltx/gr_gr_cog/me.m01.d03:meMA.Ode6C31.text	Ἱερουργείται θυσία, καὶ δεκτὴ προσφορά σοι προσάγεται, σταζόμενος αἵματι, ὁ Γόρδιος Δέσποτα, τὸ ἑκούσιον Πάθος σου μιμούμενος.
ltx/gr_gr_cog/me.m01.d03:meMA.Ode6C32.incipit	Σεσοβημένος τὰς φρένας, σοὶ φθαρτὸν…
ltx/gr_gr_cog/me.m01.d03:meMA.Ode6C32.melody	@ltx/gr_gr_cog/he.h.m8:heHE.OsTonProfitinErryso.name
ltx/gr_gr_cog/me.m01.d03:meMA.Ode6C32.mode	@ltx/gr_gr_cog/miscellanea:misc.Mode8
ltx/gr_gr_cog/me.m01.d03:meMA.Ode6C32.ode	@ltx/gr_gr_cog/miscellanea:misc.Ode6
ltx/gr_gr_cog/me.m01.d03:meMA.Ode6C32.text	Σεσοβημένος τὰς φρένας, σοὶ φθαρτὸν ὑπισχνεῖτο δοξάριον, τῷ δόξαν ἀκήρατον, Γόρδιε πλουτήσαντι, καὶ ἀθάνατον ζωὴν θησαυρίσαντι.
ltx/gr_gr_cog/me.m01.d03:meMA.Ode6C33.incipit	Ἰθυτενεῖς τὰς ἐλπίδας, πρὸς Θεὸν…
ltx/gr_gr_cog/me.m01.d03:meMA.Ode6C33.melody	@ltx/gr_gr_cog/he.h.m8:heHE.OsTonProfitinErryso.name
ltx/gr_gr_cog/me.m01.d03:meMA.Ode6C33.mode	@ltx/gr_gr_cog/miscellanea:misc.Mode8
ltx/gr_gr_cog/me.m01.d03:meMA.Ode6C33.ode	@ltx/gr_gr_cog/miscellanea:misc.Ode6
ltx/gr_gr_cog/me.m01.d03:meMA.Ode6C33.text	Ἰθυτενεῖς τὰς ἐλπίδας, πρὸς Θεὸν κεκτημένος παρέδραμες, τοῦ βίου τὸ ἄστατον, καὶ ξίφει τεμνόμενος, πρὸς εὐρύχωρον πλάτος μεταβέβηκας.
ltx/gr_gr_cog/me.m01.d03:meMA.Ode6C3T.incipit	Νενεκρωμένον τὸν νοῦν μου, τῶν…
ltx/gr_gr_cog/me.m01.d03:meMA.Ode6C3T.melody	@ltx/gr_gr_cog/he.h.m8:heHE.OsTonProfitinErryso.name
ltx/gr_gr_cog/me.m01.d03:meMA.Ode6C3T.mode	@ltx/gr_gr_cog/miscellanea:misc.Mode8
ltx/gr_gr_cog/me.m01.d03:meMA.Ode6C3T.ode	@ltx/gr_gr_cog/miscellanea:misc.Ode6
ltx/gr_gr_cog/me.m01.d03:meMA.Ode6C3T.text	Νενεκρωμένον τὸν νοῦν μου, τῶν παθῶν τρικυμίαις ἀνάστησον, ζωὴν τὴν αἰώνιον, Χριστὸν ἡ κυήσασα, τὸν παρέχοντα πᾶσι τὰ ἰάματα.
ltx/gr_gr_cog/me.m01.d03:meMA.Ode6H.greekmelody	@ltx/gr_gr_cog/he.h.m8:heHE.OsTonProfitinErryso.greekname
ltx/gr_gr_cog/me.m01.d03:meMA.Ode6H.incipit	@ltx/gr_gr_cog/he.h.m8:heHE.OsTonProfitinErryso.incipit
ltx/gr_gr_cog/me.m01.d03:meMA.Ode6H.melody	@ltx/gr_gr_cog/he.h.m8:heHE.OsTonProfitinErryso.melody
ltx/gr_gr_cog/me.m01.d03:meMA.Ode6H.mode	@ltx/gr_gr_cog/miscellanea:misc.Mode8
ltx/gr_gr_cog/me.m01.d03:meMA.Ode6H.ode	@ltx/gr_gr_cog/miscellanea:misc.Ode6
ltx/gr_gr_cog/me.m01.d03:meMA.Ode6H.text	@ltx/gr_gr_cog/he.h.m8:heHE.OsTonProfitinErryso.text
ltx/gr_gr_cog/me.m01.d03:meMA.Ode7C11.greekmelody	@ltx/gr_gr_cog/he.h.m4:heHE.OukElatrefsan.greekname
ltx/gr_gr_cog/me.m01.d03:meMA.Ode7C11.incipit	Συντριβέντα με τοῖς πταίσμασι, καὶ…
ltx/gr_gr_cog/me.m01.d03:meMA.Ode7C11.melody	@ltx/gr_gr_cog/he.h.m4:heHE.OukElatrefsan.name
ltx/gr_gr_cog/me.m01.d03:meMA.Ode7C11.mode	@ltx/gr_gr_cog/miscellanea:misc.Mode4
ltx/gr_gr_cog/me.m01.d03:meMA.Ode7C11.ode	@ltx/gr_gr_cog/miscellanea:misc.Ode7
ltx/gr_gr_cog/me.m01.d03:meMA.Ode7C11.text	Συντριβέντα με τοῖς πταίσμασι, καὶ κείμενον, ἐν σκότει Κύριε, τῆς παραβάσεως, οἰκτείρας ἠλέησας, διʼ ἀγαθότητα, καὶ ἐν ὕδασι, τοῦ Ἰορδάνου Κύριε, παραγίνῃ βαπτισθῆναι.
ltx/gr_gr_cog/me.m01.d03:meMA.Ode7C12.incipit	Τί τὸ ξένον τοῦτο θέαμα…
ltx/gr_gr_cog/me.m01.d03:meMA.Ode7C12.melody	@ltx/gr_gr_cog/he.h.m4:heHE.OukElatrefsan.name
ltx/gr_gr_cog/me.m01.d03:meMA.Ode7C12.mode	@ltx/gr_gr_cog/miscellanea:misc.Mode4
ltx/gr_gr_cog/me.m01.d03:meMA.Ode7C12.ode	@ltx/gr_gr_cog/miscellanea:misc.Ode7
ltx/gr_gr_cog/me.m01.d03:meMA.Ode7C12.text	Τί τὸ ξένον τοῦτο θέαμα; ἐβόησαν Ἀγγέλων τάγματα, ὁ λίμνας καὶ ποταμούς, ποιήσας προστάγματι, τὰ Ἰορδάνια, ῥεῖθρα ἔρχεται, περιβαλέσθαι· τούτοις γάρ, τὸν Ἀδὰμ ἀνακαινίζει.
ltx/gr_gr_cog/me.m01.d03:meMA.Ode7C13.incipit	Ὕψος ἄφατον, καὶ βάθος μὴ…
ltx/gr_gr_cog/me.m01.d03:meMA.Ode7C13.melody	@ltx/gr_gr_cog/he.h.m4:heHE.OukElatrefsan.name
ltx/gr_gr_cog/me.m01.d03:meMA.Ode7C13.mode	@ltx/gr_gr_cog/miscellanea:misc.Mode4
ltx/gr_gr_cog/me.m01.d03:meMA.Ode7C13.ode	@ltx/gr_gr_cog/miscellanea:misc.Ode7
ltx/gr_gr_cog/me.m01.d03:meMA.Ode7C13.text	Ὕψος ἄφατον, καὶ βάθος μὴ μετρούμενον, ὑπάρχει Δέσποτα, οἰκονομία ἡ σή, πᾶσαν ὑπερβαίνουσα, νοὸς κατάληψιν, πῶς διʼ ὕδατος, καὶ Παναγίου Πνεύματος, τοὺς βροτοὺς ἀναχωνεύεις.
ltx/gr_gr_cog/me.m01.d03:meMA.Ode7C1H.greekmelody	@ltx/gr_gr_cog/he.h.m4:heHE.OukElatrefsan.greekname
ltx/gr_gr_cog/me.m01.d03:meMA.Ode7C1H.incipit	@ltx/gr_gr_cog/he.h.m4:heHE.OukElatrefsan.incipit
ltx/gr_gr_cog/me.m01.d03:meMA.Ode7C1H.melody	@ltx/gr_gr_cog/he.h.m4:heHE.OukElatrefsan.melody
ltx/gr_gr_cog/me.m01.d03:meMA.Ode7C1H.mode	@ltx/gr_gr_cog/miscellanea:misc.Mode4
ltx/gr_gr_cog/me.m01.d03:meMA.Ode7C1H.ode	@ltx/gr_gr_cog/miscellanea:misc.Ode7
ltx/gr_gr_cog/me.m01.d03:meMA.Ode7C1H.text	@ltx/gr_gr_cog/he.h.m4:heHE.OukElatrefsan.text
ltx/gr_gr_cog/me.m01.d03:meMA.Ode7C21.greekmelody	@ltx/gr_gr_cog/he.h.m8:heHE.PaidesEvraion.greekname
ltx/gr_gr_cog/me.m01.d03:meMA.Ode7C21.incipit	Σὺ τοῦ δεσπόζοντος τῶν ὅλων…
ltx/gr_gr_cog/me.m01.d03:meMA.Ode7C21.melody	@ltx/gr_gr_cog/he.h.m8:heHE.PaidesEvraion.name
ltx/gr_gr_cog/me.m01.d03:meMA.Ode7C21.mode	@ltx/gr_gr_cog/miscellanea:misc.Mode8
ltx/gr_gr_cog/me.m01.d03:meMA.Ode7C21.ode	@ltx/gr_gr_cog/miscellanea:misc.Ode7
ltx/gr_gr_cog/me.m01.d03:meMA.Ode7C21.text	Σὺ τοῦ δεσπόζοντος τῶν ὅλων, τὴν σεβάσμιον προεῖπες παρουσίαν, Μαλαχία Προφῆτα, μακάριε κραυγάζων· Εὐλογητὸς εἶ Κύριε, ὁ Θεὸς εἰς τοὺς αἰῶνας.
ltx/gr_gr_cog/me.m01.d03:meMA.Ode7C22.incipit	Δέχου πρεσβεύοντα οἰκτίρμον, τὸν ἀοίδιμον…
ltx/gr_gr_cog/me.m01.d03:meMA.Ode7C22.melody	@ltx/gr_gr_cog/he.h.m8:heHE.PaidesEvraion.name
ltx/gr_gr_cog/me.m01.d03:meMA.Ode7C22.mode	@ltx/gr_gr_cog/miscellanea:misc.Mode8
ltx/gr_gr_cog/me.m01.d03:meMA.Ode7C22.ode	@ltx/gr_gr_cog/miscellanea:misc.Ode7
ltx/gr_gr_cog/me.m01.d03:meMA.Ode7C22.text	Δέχου πρεσβεύοντα οἰκτίρμον, τὸν ἀοίδιμον Προφήτην Μαλαχίαν, ὑπὲρ τῶν εὐσεβῶς, ὑμνούντων καὶ βοώντων· Εὐλογητὸς εἶ Κύριε, ὁ Θεὸς εἰς τοὺς αἰῶνας.
ltx/gr_gr_cog/me.m01.d03:meMA.Ode7C2T.incipit	Ὅλῳ μοι ὅλος ἀσυγχύτως, καθ’…
ltx/gr_gr_cog/me.m01.d03:meMA.Ode7C2T.melody	@ltx/gr_gr_cog/he.h.m8:heHE.PaidesEvraion.name
ltx/gr_gr_cog/me.m01.d03:meMA.Ode7C2T.mode	@ltx/gr_gr_cog/miscellanea:misc.Mode8
ltx/gr_gr_cog/me.m01.d03:meMA.Ode7C2T.ode	@ltx/gr_gr_cog/miscellanea:misc.Ode7
ltx/gr_gr_cog/me.m01.d03:meMA.Ode7C2T.text	Ὅλῳ μοι ὅλος ἀσυγχύτως, καθʼ ὑπόστασιν ἡνώθης Θεοῦ Λόγε, ἐκ Παρθένου σεπτῆς, φορέσας με οἰκτίρμον· Εὐλογητὸς εἶ Κύριε, ὁ Θεὸς εἰς τοὺς αἰῶνας.
ltx/gr_gr_cog/me.m01.d03:meMA.Ode7C31.greekmelody	@ltx/gr_gr_cog/he.h.m8:heHE.OTousPaidasDrosisas.greekname
ltx/gr_gr_cog/me.m01.d03:meMA.Ode7C31.incipit	Μαρτυρίου τὸ κλέος κεκτημένος, μετ’…
ltx/gr_gr_cog/me.m01.d03:meMA.Ode7C31.melody	@ltx/gr_gr_cog/he.h.m8:heHE.OTousPaidasDrosisas.name
ltx/gr_gr_cog/me.m01.d03:meMA.Ode7C31.mode	@ltx/gr_gr_cog/miscellanea:misc.Mode8
ltx/gr_gr_cog/me.m01.d03:meMA.Ode7C31.ode	@ltx/gr_gr_cog/miscellanea:misc.Ode7
ltx/gr_gr_cog/me.m01.d03:meMA.Ode7C31.text	Μαρτυρίου τὸ κλέος κεκτημένος, μετʼ Ἀγγέλων χορεύεις, στεφηφόρος Χριστῷ κραυγάζων· Εὐλογητὸς εἶ Κύριε, ὁ Θεὸς ὁ τῶν Πατέρων ἡμῶν.
ltx/gr_gr_cog/me.m01.d03:meMA.Ode7C32.incipit	Εὐσεβῆ παῤῥησίαν κεκτημένος, δυσσεβεῖς καταισχύνεις…
ltx/gr_gr_cog/me.m01.d03:meMA.Ode7C32.melody	@ltx/gr_gr_cog/he.h.m8:heHE.OTousPaidasDrosisas.name
ltx/gr_gr_cog/me.m01.d03:meMA.Ode7C32.mode	@ltx/gr_gr_cog/miscellanea:misc.Mode8
ltx/gr_gr_cog/me.m01.d03:meMA.Ode7C32.ode	@ltx/gr_gr_cog/miscellanea:misc.Ode7
ltx/gr_gr_cog/me.m01.d03:meMA.Ode7C32.text	Εὐσεβῆ παῤῥησίαν κεκτημένος, δυσσεβεῖς καταισχύνεις, ἀναμέλπων μεγαλοφώνως· Εὐλογητὸς εἶ Κύριε, ὁ Θεὸς ὁ τῶν Πατέρων ἡμῶν.
ltx/gr_gr_cog/me.m01.d03:meMA.Ode7C33.incipit	Λυτρωθῆναι πταισμάτων νῦν δυσώπει, τοὺς…
ltx/gr_gr_cog/me.m01.d03:meMA.Ode7C33.melody	@ltx/gr_gr_cog/he.h.m8:heHE.OTousPaidasDrosisas.name
ltx/gr_gr_cog/me.m01.d03:meMA.Ode7C33.mode	@ltx/gr_gr_cog/miscellanea:misc.Mode8
ltx/gr_gr_cog/me.m01.d03:meMA.Ode7C33.ode	@ltx/gr_gr_cog/miscellanea:misc.Ode7
ltx/gr_gr_cog/me.m01.d03:meMA.Ode7C33.text	Λυτρωθῆναι πταισμάτων νῦν δυσώπει, τοὺς ἐν πίστει ὑμνοῦντας τὴν σὴν μνήμην, Χριστῷ βοῶντας. Εὐλογητὸς εἶ Κύριε, ὁ Θεὸς ὁ τῶν Πατέρων ἡμῶν.
ltx/gr_gr_cog/me.m01.d03:meMA.Ode7C3T.incipit	Ἰοβόλους ἀκάνθας ἁμαρτίας, ἰαμάτων πλημμύρᾳ…
ltx/gr_gr_cog/me.m01.d03:meMA.Ode7C3T.melody	@ltx/gr_gr_cog/he.h.m8:heHE.OTousPaidasDrosisas.name
ltx/gr_gr_cog/me.m01.d03:meMA.Ode7C3T.mode	@ltx/gr_gr_cog/miscellanea:misc.Mode8
ltx/gr_gr_cog/me.m01.d03:meMA.Ode7C3T.ode	@ltx/gr_gr_cog/miscellanea:misc.Ode7
ltx/gr_gr_cog/me.m01.d03:meMA.Ode7C3T.text	Ἰοβόλους ἀκάνθας ἁμαρτίας, ἰαμάτων πλημμύρᾳ τῶν σῶν, ἀμβλύνεις Θεοκυῆτορ, εὐλογημένη Πάναγνε, ἡ Θεὸν ἀσπόρως τέξασα.
ltx/gr_gr_cog/me.m01.d03:meMA.Ode8C11.greekmelody	@ltx/gr_gr_cog/he.h.m4:heHE.PaidasEvageis.greekname
ltx/gr_gr_cog/me.m01.d03:meMA.Ode8C11.incipit	Φωνὴ τοῦ Γεννήτορος ἐξ ὕψους…
ltx/gr_gr_cog/me.m01.d03:meMA.Ode8C11.melody	@ltx/gr_gr_cog/he.h.m4:heHE.PaidasEvageis.name
ltx/gr_gr_cog/me.m01.d03:meMA.Ode8C11.mode	@ltx/gr_gr_cog/miscellanea:misc.Mode4
ltx/gr_gr_cog/me.m01.d03:meMA.Ode8C11.ode	@ltx/gr_gr_cog/miscellanea:misc.Ode8
ltx/gr_gr_cog/me.m01.d03:meMA.Ode8C11.text	Φωνὴ τοῦ Γεννήτορος ἐξ ὕψους, Υἱὸν μαρτυρήσει ὁμοούσιον, βαίνοντα ἐν ὕδασι, καὶ τὴν εὐλογίαν σου, τούτοις προσεπιπέμποντα, εὐλογημένε Χριστέ, καὶ Πνεῦμα σε τὸ Ἅγιον πᾶσιν, ἐπανακηρύξει, Θεὸν σεσαρκωμένον.
ltx/gr_gr_cog/me.m01.d03:meMA.Ode8C12.incipit	Χόρευε ἡ κτίσις αἰσθομένη, Θεοῦ…
ltx/gr_gr_cog/me.m01.d03:meMA.Ode8C12.melody	@ltx/gr_gr_cog/he.h.m4:heHE.PaidasEvageis.name
ltx/gr_gr_cog/me.m01.d03:meMA.Ode8C12.mode	@ltx/gr_gr_cog/miscellanea:misc.Mode4
ltx/gr_gr_cog/me.m01.d03:meMA.Ode8C12.ode	@ltx/gr_gr_cog/miscellanea:misc.Ode8
ltx/gr_gr_cog/me.m01.d03:meMA.Ode8C12.text	Χόρευε ἡ κτίσις αἰσθομένη, Θεοῦ τὴν ἁγίαν ἐπιφάνειαν. Ἄγγελοι ὑμνήσατε, θάλασσα εὐφράνθητι· Λίμναι Πηγαὶ σκιρτήσατε, καὶ Ποταμοὶ μυστικῶς, κροτήσατε ἐν ὕμνοις, ἐπέστη, ὁ ταῖς εὐλογίαις, ὑμᾶς Χριστὸς λαμπρύνων.
ltx/gr_gr_cog/me.m01.d03:meMA.Ode8C13.incipit	Ψάλωμεν Κυρίῳ ἐν αἰνέσει, τῷ…
ltx/gr_gr_cog/me.m01.d03:meMA.Ode8C13.melody	@ltx/gr_gr_cog/he.h.m4:heHE.PaidasEvageis.name
ltx/gr_gr_cog/me.m01.d03:meMA.Ode8C13.mode	@ltx/gr_gr_cog/miscellanea:misc.Mode4
ltx/gr_gr_cog/me.m01.d03:meMA.Ode8C13.ode	@ltx/gr_gr_cog/miscellanea:misc.Ode8
ltx/gr_gr_cog/me.m01.d03:meMA.Ode8C13.text	Ψάλωμεν Κυρίῳ ἐν αἰνέσει, τῷ ἐπιφανέντι ἐν τοῖς ὕδασι, καὶ τὴν συντριβὴν ἡμῶν, τούτοις ἀναπλάσαντι, καὶ κεφαλὰς συντρίψαντι, τῶν ἀοράτων ἐχθρῶν, καὶ κράξωμεν· Ὑμνεῖτε τὰ ἔργα, καὶ ὑπερυψοῦτε, εἰς πάντας τοὺς αἰῶνας.
ltx/gr_gr_cog/me.m01.d03:meMA.Ode8C1H.greekmelody	@ltx/gr_gr_cog/he.h.m4:heHE.PaidasEvageis.greekname
ltx/gr_gr_cog/me.m01.d03:meMA.Ode8C1H.incipit	@ltx/gr_gr_cog/he.h.m4:heHE.PaidasEvageis.incipit
ltx/gr_gr_cog/me.m01.d03:meMA.Ode8C1H.melody	@ltx/gr_gr_cog/he.h.m4:heHE.PaidasEvageis.melody
ltx/gr_gr_cog/me.m01.d03:meMA.Ode8C1H.mode	@ltx/gr_gr_cog/miscellanea:misc.Mode4
ltx/gr_gr_cog/me.m01.d03:meMA.Ode8C1H.ode	@ltx/gr_gr_cog/miscellanea:misc.Ode8
ltx/gr_gr_cog/me.m01.d03:meMA.Ode8C1H.text	@ltx/gr_gr_cog/he.h.m4:heHE.PaidasEvageis.text
ltx/gr_gr_cog/me.m01.d03:meMA.Ode8C1T.incipit	Ὦ θαῦμα θαυμάτων! πῶς ὁ…
ltx/gr_gr_cog/me.m01.d03:meMA.Ode8C1T.melody	@ltx/gr_gr_cog/he.h.m4:heHE.PaidasEvageis.name
ltx/gr_gr_cog/me.m01.d03:meMA.Ode8C1T.mode	@ltx/gr_gr_cog/miscellanea:misc.Mode4
ltx/gr_gr_cog/me.m01.d03:meMA.Ode8C1T.ode	@ltx/gr_gr_cog/miscellanea:misc.Ode8
ltx/gr_gr_cog/me.m01.d03:meMA.Ode8C1T.text	Ὦ θαῦμα θαυμάτων! πῶς ὁ πάσης, ἐπέκεινα κτίσεως Θεὸς ἡμῶν, κτίζεται καὶ πλάττεται, ἐκ τῆς Θεομήτορος, καὶ καινουργεῖ θελήματι, καὶ ἀναπλάττει ἡμᾶς, διʼ ὕδατος καὶ Πνεύματος πλάσιν, θαυμασιωτάτην, ὁ μόνος εὐεργέτης.
ltx/gr_gr_cog/me.m01.d03:meMA.Ode8C21.greekmelody	@ltx/gr_gr_cog/he.h.m8:heHE.NikitaiTyrannou.greekname
ltx/gr_gr_cog/me.m01.d03:meMA.Ode8C21.incipit	Ξενωθεὶς ἁπάσης, ὑλικῆς ἐμφάσεως Ἱεροφάντα…
ltx/gr_gr_cog/me.m01.d03:meMA.Ode8C21.melody	@ltx/gr_gr_cog/he.h.m8:heHE.NikitaiTyrannou.name
ltx/gr_gr_cog/me.m01.d03:meMA.Ode8C21.mode	@ltx/gr_gr_cog/miscellanea:misc.Mode8
ltx/gr_gr_cog/me.m01.d03:meMA.Ode8C21.ode	@ltx/gr_gr_cog/miscellanea:misc.Ode8
ltx/gr_gr_cog/me.m01.d03:meMA.Ode8C21.text	Ξενωθεὶς ἁπάσης, ὑλικῆς ἐμφάσεως Ἱεροφάντα, θεϊκῆς ἀκτῖνος, ὤφθης ἀκηλίδωτον ἔσοπτρον μέλπων· Εὐλογεῖτε πάντα τὰ ἔργα τὸν Κύριον, καὶ ὑπερυψοῦτε, εἰς πάντας τοὺς αἰῶνας.
ltx/gr_gr_cog/me.m01.d03:meMA.Ode8C22.incipit	Ἀποῤῥήτου δόξης, θεατὴς σὺ γέγονας…
ltx/gr_gr_cog/me.m01.d03:meMA.Ode8C22.melody	@ltx/gr_gr_cog/he.h.m8:heHE.NikitaiTyrannou.name
ltx/gr_gr_cog/me.m01.d03:meMA.Ode8C22.mode	@ltx/gr_gr_cog/miscellanea:misc.Mode8
ltx/gr_gr_cog/me.m01.d03:meMA.Ode8C22.ode	@ltx/gr_gr_cog/miscellanea:misc.Ode8
ltx/gr_gr_cog/me.m01.d03:meMA.Ode8C22.text	Ἀποῤῥήτου δόξης, θεατὴς σὺ γέγονας, καὶ μυστηρίων, οὐρανίων μάκαρ, κήρυξ ἐχρημάτισας, μέλπων ἀπαύστως· Εὐλογεῖτε πάντα τὰ ἔργα τὸν Κύριον, καὶ ὑπερυψοῦτε, εἰς πάντας τοὺς αἰῶνας.
ltx/gr_gr_cog/me.m01.d03:meMA.Ode8C2T.incipit	Ζωῆς σε Μητέρα, καὶ Θεοῦ…
ltx/gr_gr_cog/me.m01.d03:meMA.Ode8C2T.melody	@ltx/gr_gr_cog/he.h.m8:heHE.NikitaiTyrannou.name
ltx/gr_gr_cog/me.m01.d03:meMA.Ode8C2T.mode	@ltx/gr_gr_cog/miscellanea:misc.Mode8
ltx/gr_gr_cog/me.m01.d03:meMA.Ode8C2T.ode	@ltx/gr_gr_cog/miscellanea:misc.Ode8
ltx/gr_gr_cog/me.m01.d03:meMA.Ode8C2T.text	Ζωῆς σε Μητέρα, καὶ Θεοῦ γεννήτριαν ἐπεγνωκότες, ὀρθοδόξῳ πίστει, πάντες μακαρίζομεν Παρθενομῆτορ, εὐλογοῦντες ἅμα τὸν τόκον σου Ἄχραντε, καὶ ὑπερυψοῦντες, εἰς πάντας τοὺς αἰῶνας.
ltx/gr_gr_cog/me.m01.d03:meMA.Ode8C31.greekmelody	@ltx/gr_gr_cog/he.h.m8:heHE.OiTheorrimonesPaides.greekname
ltx/gr_gr_cog/me.m01.d03:meMA.Ode8C31.incipit	Ἡ ἑπομένη σοι χάρις ἀοράτως…
ltx/gr_gr_cog/me.m01.d03:meMA.Ode8C31.melody	@ltx/gr_gr_cog/he.h.m8:heHE.OiTheorrimonesPaides.name
ltx/gr_gr_cog/me.m01.d03:meMA.Ode8C31.mode	@ltx/gr_gr_cog/miscellanea:misc.Mode8
ltx/gr_gr_cog/me.m01.d03:meMA.Ode8C31.ode	@ltx/gr_gr_cog/miscellanea:misc.Ode8
ltx/gr_gr_cog/me.m01.d03:meMA.Ode8C31.text	Ἡ ἑπομένη σοι χάρις ἀοράτως, καταλαμπρύνουσα Μάρτυς, ἀνδραγαθίας ἐνέπλησεν· Εὐλογεῖτε βοῶντα τὰ ἔργα τὸν Κύριον, καὶ ὑπερυψοῦτε, εἰς πάντας τοὺς αἰῶνας.
ltx/gr_gr_cog/me.m01.d03:meMA.Ode8C32.incipit	Δρόμῳ συντόνῳ χρησάμενος Ἀθλοφόρε, πρὸς…
ltx/gr_gr_cog/me.m01.d03:meMA.Ode8C32.melody	@ltx/gr_gr_cog/he.h.m8:heHE.OiTheorrimonesPaides.name
ltx/gr_gr_cog/me.m01.d03:meMA.Ode8C32.mode	@ltx/gr_gr_cog/miscellanea:misc.Mode8
ltx/gr_gr_cog/me.m01.d03:meMA.Ode8C32.ode	@ltx/gr_gr_cog/miscellanea:misc.Ode8
ltx/gr_gr_cog/me.m01.d03:meMA.Ode8C32.text	Δρόμῳ συντόνῳ χρησάμενος Ἀθλοφόρε, πρὸς τὸ ποθούμενον τέλος, τῆς Βασιλείας κατήντησας· Εὐλογεῖτε κραυγάζων τὰ ἔργα τὸν Κύριον, καὶ ὑπερυψοῦτε, εἰς πάντας τοὺς αἰῶνας.
ltx/gr_gr_cog/me.m01.d03:meMA.Ode8C33.incipit	Εἰς ἀπεράντους αἰῶνας διαμένει, ἡ…
ltx/gr_gr_cog/me.m01.d03:meMA.Ode8C33.melody	@ltx/gr_gr_cog/he.h.m8:heHE.OiTheorrimonesPaides.name
ltx/gr_gr_cog/me.m01.d03:meMA.Ode8C33.mode	@ltx/gr_gr_cog/miscellanea:misc.Mode8
ltx/gr_gr_cog/me.m01.d03:meMA.Ode8C33.ode	@ltx/gr_gr_cog/miscellanea:misc.Ode8
ltx/gr_gr_cog/me.m01.d03:meMA.Ode8C33.text	Εἰς ἀπεράντους αἰῶνας διαμένει, ἡ τῶν Μαρτύρων σου δόξα, καὶ ἡ ἀθάνατος εὔκλεια· Εὐλογοῦμεν διό σε ἀπαύστως τὸν Κύριον, καὶ ὑπερυψοῦμεν, εἰς πάντας τοὺς αἰῶνας.
ltx/gr_gr_cog/me.m01.d03:meMA.Ode8C3T.incipit	Σεσαρκωμένον τὸν Λόγον συλλαβοῦσα, τὸν…
ltx/gr_gr_cog/me.m01.d03:meMA.Ode8C3T.melody	@ltx/gr_gr_cog/he.h.m8:heHE.OiTheorrimonesPaides.name
ltx/gr_gr_cog/me.m01.d03:meMA.Ode8C3T.mode	@ltx/gr_gr_cog/miscellanea:misc.Mode8
ltx/gr_gr_cog/me.m01.d03:meMA.Ode8C3T.ode	@ltx/gr_gr_cog/miscellanea:misc.Ode8
ltx/gr_gr_cog/me.m01.d03:meMA.Ode8C3T.text	Σεσαρκωμένον τὸν Λόγον συλλαβοῦσα, τὸν πρὶν ἀσώματον Εὔας, ἀρὰν τῆς πάλαι ἀνέτρεψας, εὐλογίαν Παρθένε, τῷ κόσμῳ κυήσασα· ὅθεν σε ὑμνοῦμεν, εἰς πάντας τοὺς αἰῶνας.
ltx/gr_gr_cog/me.m01.d03:meMA.Ode8H.greekmelody	@ltx/gr_gr_cog/he.h.m8:heHE.OiTheorrimonesPaides.greekname
ltx/gr_gr_cog/me.m01.d03:meMA.Ode8H.incipit	@ltx/gr_gr_cog/he.h.m8:heHE.OiTheorrimonesPaides.incipit
ltx/gr_gr_cog/me.m01.d03:meMA.Ode8H.melody	@ltx/gr_gr_cog/he.h.m8:heHE.OiTheorrimonesPaides.melody
ltx/gr_gr_cog/me.m01.d03:meMA.Ode8H.mode	@ltx/gr_gr_cog/miscellanea:misc.Mode8
ltx/gr_gr_cog/me.m01.d03:meMA.Ode8H.ode	@ltx/gr_gr_cog/miscellanea:misc.Ode8
ltx/gr_gr_cog/me.m01.d03:meMA.Ode8H.text	@ltx/gr_gr_cog/he.h.m8:heHE.OiTheorrimonesPaides.text
ltx/gr_gr_cog/me.m01.d03:meMA.Ode9C11.greekmelody	@ltx/gr_gr_cog/he.h.m4:heHE.ApasGigenis.greekname
ltx/gr_gr_cog/me.m01.d03:meMA.Ode9C11.incipit	Ἴδε ὁ Ἀμνός, ὁ αἲρων…
ltx/gr_gr_cog/me.m01.d03:meMA.Ode9C11.melody	@ltx/gr_gr_cog/he.h.m4:heHE.ApasGigenis.name
ltx/gr_gr_cog/me.m01.d03:meMA.Ode9C11.mode	@ltx/gr_gr_cog/miscellanea:misc.Mode4
ltx/gr_gr_cog/me.m01.d03:meMA.Ode9C11.ode	@ltx/gr_gr_cog/miscellanea:misc.Ode9
ltx/gr_gr_cog/me.m01.d03:meMA.Ode9C11.text	Ἴδε ὁ Ἀμνός, ὁ αἲρων τὰ πταίσματα τῆς ἀνθρωπότητος, ἦλθεν ἐπεδήμησε· καὶ πρὸς τὸν δοῦλον αἰτῶν τὸ Βάπτισμα, δουλοπρεπῶς ἐφίσταται, ἐλευθερῶσαι ζητῶν, δουλωθέντας, ἡμᾶς τῷ ἀλάστορι, καὶ τὸ κάλλος πρὶν ἀπολέσαντας.
ltx/gr_gr_cog/me.m01.d03:meMA.Ode9C12.incipit	Ὤφθη ἐμφανῶς, Θεὸς σωματούμενος, δι’…
ltx/gr_gr_cog/me.m01.d03:meMA.Ode9C12.melody	@ltx/gr_gr_cog/he.h.m4:heHE.ApasGigenis.name
ltx/gr_gr_cog/me.m01.d03:meMA.Ode9C12.mode	@ltx/gr_gr_cog/miscellanea:misc.Mode4
ltx/gr_gr_cog/me.m01.d03:meMA.Ode9C12.ode	@ltx/gr_gr_cog/miscellanea:misc.Ode9
ltx/gr_gr_cog/me.m01.d03:meMA.Ode9C12.text	Ὤφθη ἐμφανῶς, Θεὸς σωματούμενος, διʼ ἀγαθότητα, καὶ τὰ Ἰορδάνια, περιβαλέσθαι ἔρχεται νάματα, ὁ περιβάλλων νέφεσι, τὸν οὐρανὸν ἀληθῶς, τούτου πάντες, νῦν προεορτάσωμεν, τὴν σεπτὴν ἐν χαρᾷ Ἐπιφάνειαν.
ltx/gr_gr_cog/me.m01.d03:meMA.Ode9C13.incipit	Σκίρτησον χαρᾷ, καὶ προετοιμάσθητι, καθυποδέξασθαι…
ltx/gr_gr_cog/me.m01.d03:meMA.Ode9C13.melody	@ltx/gr_gr_cog/he.h.m4:heHE.ApasGigenis.name
ltx/gr_gr_cog/me.m01.d03:meMA.Ode9C13.mode	@ltx/gr_gr_cog/miscellanea:misc.Mode4
ltx/gr_gr_cog/me.m01.d03:meMA.Ode9C13.ode	@ltx/gr_gr_cog/miscellanea:misc.Ode9
ltx/gr_gr_cog/me.m01.d03:meMA.Ode9C13.text	Σκίρτησον χαρᾷ, καὶ προετοιμάσθητι, καθυποδέξασθαι, ὕδωρ τὸ ἁλλόμενον, ὦ Ἰορδάνη εἰς αἰωνίαν ζωήν, οἱ ποταμοὶ χορεύσατε, βλέποντες νῦν τῆς τρυφῆς, τὸν χειμάῤῥουν, ῥείθροις ἐπιβαίνοντα, καὶ κακίας τὴν χύσιν ξηραίνοντα.
ltx/gr_gr_cog/me.m01.d03:meMA.Ode9C14.incipit	Ηὔγασεν ἡμῖν, ἡμέρα σωτήριος, τοῖς…
ltx/gr_gr_cog/me.m01.d03:meMA.Ode9C14.melody	@ltx/gr_gr_cog/he.h.m4:heHE.ApasGigenis.name
ltx/gr_gr_cog/me.m01.d03:meMA.Ode9C14.mode	@ltx/gr_gr_cog/miscellanea:misc.Mode4
ltx/gr_gr_cog/me.m01.d03:meMA.Ode9C14.ode	@ltx/gr_gr_cog/miscellanea:misc.Ode9
ltx/gr_gr_cog/me.m01.d03:meMA.Ode9C14.text	Ηὔγασεν ἡμῖν, ἡμέρα σωτήριος, τοῖς ἐν νυκτὶ τῶν παθῶν, πάντοτε καθεύδουσι· καὶ γὰρ ἐπέστη Χριστὸς ὁ Κύριος, δικαιοσύνης Ἥλιος, ὢν καὶ νοούμενος, ὑποκλῖναι, δούλῳ κεφαλὴν αὐτοῦ, καὶ σαρκὶ βαπτισθῆναι θελήματι.
ltx/gr_gr_cog/me.m01.d03:meMA.Ode9C1H.greekmelody	@ltx/gr_gr_cog/he.h.m4:heHE.ApasGigenis.greekname
ltx/gr_gr_cog/me.m01.d03:meMA.Ode9C1H.incipit	@ltx/gr_gr_cog/he.h.m4:heHE.ApasGigenis.incipit
ltx/gr_gr_cog/me.m01.d03:meMA.Ode9C1H.melody	@ltx/gr_gr_cog/he.h.m4:heHE.ApasGigenis.melody
ltx/gr_gr_cog/me.m01.d03:meMA.Ode9C1H.mode	@ltx/gr_gr_cog/miscellanea:misc.Mode4
ltx/gr_gr_cog/me.m01.d03:meMA.Ode9C1H.ode	@ltx/gr_gr_cog/miscellanea:misc.Ode9
ltx/gr_gr_cog/me.m01.d03:meMA.Ode9C1H.text	@ltx/gr_gr_cog/he.h.m4:heHE.ApasGigenis.text
ltx/gr_gr_cog/me.m01.d03:meMA.Ode9C1T.incipit	Φρίττει Χερουβίμ, καὶ πᾶσα οὐράνιος…
ltx/gr_gr_cog/me.m01.d03:meMA.Ode9C1T.melody	@ltx/gr_gr_cog/he.h.m4:heHE.ApasGigenis.name
ltx/gr_gr_cog/me.m01.d03:meMA.Ode9C1T.mode	@ltx/gr_gr_cog/miscellanea:misc.Mode4
ltx/gr_gr_cog/me.m01.d03:meMA.Ode9C1T.ode	@ltx/gr_gr_cog/miscellanea:misc.Ode9
ltx/gr_gr_cog/me.m01.d03:meMA.Ode9C1T.text	Φρίττει Χερουβίμ, καὶ πᾶσα οὐράνιος φύσις Πανάμωμε, τὸν ὑπὲρ κατάληψιν, σεπτόν σου τόκον ὁμοιωθέντα ἡμῖν, διʼ εὐσπλαγχνίαν ἄφατον, καὶ βαπτισθέντα σαρκί, οὗ τὴν θείαν, πάντες Ἐπιφάνειαν, ἑορτάζομεν νῦν ἀγαλλόμενοι.
ltx/gr_gr_cog/me.m01.d03:meMA.Ode9C21.greekmelody	@ltx/gr_gr_cog/he.h.m8:heHE.EfrixePasaAkoi.greekname
ltx/gr_gr_cog/me.m01.d03:meMA.Ode9C21.incipit	Ἐπέστη ἡ θεοφεγγής, τοῦ Προφήτου…
ltx/gr_gr_cog/me.m01.d03:meMA.Ode9C21.melody	@ltx/gr_gr_cog/he.h.m8:heHE.EfrixePasaAkoi.name
ltx/gr_gr_cog/me.m01.d03:meMA.Ode9C21.mode	@ltx/gr_gr_cog/miscellanea:misc.Mode8
ltx/gr_gr_cog/me.m01.d03:meMA.Ode9C21.ode	@ltx/gr_gr_cog/miscellanea:misc.Ode9
ltx/gr_gr_cog/me.m01.d03:meMA.Ode9C21.text	Ἐπέστη ἡ θεοφεγγής, τοῦ Προφήτου ἑορτὴ καὶ σεβάσμιος, περιαυγάζουσα, τοὺς συνελθόντας πίστει καὶ ψάλλοντας, προφητικαῖς μαρμαρυγαῖς, καὶ πᾶσι πηγάζουσα, ψυχῶν ἰάματα, καὶ φωτίζουσα φαιδρῶς τοὺς θεόφρονας.
ltx/gr_gr_cog/me.m01.d03:meMA.Ode9C22.incipit	Τήρησον τῇ ζωαρχικῇ, κραταιᾷ τε…
ltx/gr_gr_cog/me.m01.d03:meMA.Ode9C22.melody	@ltx/gr_gr_cog/he.h.m8:heHE.EfrixePasaAkoi.name
ltx/gr_gr_cog/me.m01.d03:meMA.Ode9C22.mode	@ltx/gr_gr_cog/miscellanea:misc.Mode8
ltx/gr_gr_cog/me.m01.d03:meMA.Ode9C22.ode	@ltx/gr_gr_cog/miscellanea:misc.Ode9
ltx/gr_gr_cog/me.m01.d03:meMA.Ode9C22.text	Τήρησον τῇ ζωαρχικῇ, κραταιᾷ τε δεξιᾷ σου Φιλάνθρωπε, τὴν Ἐκκλησίαν σου, ταῖς ἱκεσίαις τοῦ σοῦ θεράποντος, τοῦ προθεσπίσαντος ἡμῖν τὴν σὴν ἐνανθρώπησιν, διʼ ἧς ἀνέτειλε, σωτηρία καὶ πιστῶν ἀπολύτρωσις.
ltx/gr_gr_cog/me.m01.d03:meMA.Ode9C2H.greekmelody	@ltx/gr_gr_cog/he.h.m8:heHE.EfrixePasaAkoi.greekname
ltx/gr_gr_cog/me.m01.d03:meMA.Ode9C2H.incipit	@ltx/gr_gr_cog/he.h.m8:heHE.EfrixePasaAkoi.incipit
ltx/gr_gr_cog/me.m01.d03:meMA.Ode9C2H.melody	@ltx/gr_gr_cog/he.h.m8:heHE.EfrixePasaAkoi.melody
ltx/gr_gr_cog/me.m01.d03:meMA.Ode9C2H.mode	@ltx/gr_gr_cog/miscellanea:misc.Mode8
ltx/gr_gr_cog/me.m01.d03:meMA.Ode9C2H.ode	@ltx/gr_gr_cog/miscellanea:misc.Ode9
ltx/gr_gr_cog/me.m01.d03:meMA.Ode9C2H.text	@ltx/gr_gr_cog/he.h.m8:heHE.EfrixePasaAkoi.text
ltx/gr_gr_cog/me.m01.d03:meMA.Ode9C2T.incipit	Ὥριμον δρέπομαι ζωήν, μὴ βλαπτόμενος…
ltx/gr_gr_cog/me.m01.d03:meMA.Ode9C2T.melody	@ltx/gr_gr_cog/he.h.m8:heHE.EfrixePasaAkoi.name
ltx/gr_gr_cog/me.m01.d03:meMA.Ode9C2T.mode	@ltx/gr_gr_cog/miscellanea:misc.Mode8
ltx/gr_gr_cog/me.m01.d03:meMA.Ode9C2T.ode	@ltx/gr_gr_cog/miscellanea:misc.Ode9
ltx/gr_gr_cog/me.m01.d03:meMA.Ode9C2T.text	Ὥριμον δρέπομαι ζωήν, μὴ βλαπτόμενος τῷ ξύλῳ τῆς γνώσεως· σὺ γὰρ Πανάμωμε, ζωῆς τὸ ξύλον Χριστὸν ἐξήνθησας, τὸν τὰς εἰσόδους τῆς ζωῆς, τοῖς πᾶσι γνωρίσαντα· διό σε πάναγνε, Θεοτόκον οἱ πιστοὶ καταγγέλλομεν.
ltx/gr_gr_cog/me.m01.d03:meMA.Ode9C31.greekmelody	@ltx/gr_gr_cog/he.h.m8:heHE.TonProdilothenta.greekname
ltx/gr_gr_cog/me.m01.d03:meMA.Ode9C31.incipit	Ἵλεων γενέσθαι, δυσώπησον τὸν Δεσπότην…
ltx/gr_gr_cog/me.m01.d03:meMA.Ode9C31.melody	@ltx/gr_gr_cog/he.h.m8:heHE.TonProdilothenta.name
ltx/gr_gr_cog/me.m01.d03:meMA.Ode9C31.mode	@ltx/gr_gr_cog/miscellanea:misc.Mode8
ltx/gr_gr_cog/me.m01.d03:meMA.Ode9C31.ode	@ltx/gr_gr_cog/miscellanea:misc.Ode9
ltx/gr_gr_cog/me.m01.d03:meMA.Ode9C31.text	Ἵλεων γενέσθαι, δυσώπησον τὸν Δεσπότην, τοῖς ἐν πίστει σε τιμῶσι, καὶ τὴν σὴν φωτοφόρον, καὶ σεπτὴν Ἑορτὴν ἐκτελοῦσι, Γόρδιε Μαρτύρων ἐγκαλλώπισμα.
ltx/gr_gr_cog/me.m01.d03:meMA.Ode9C32.incipit	Νῦν τῆς ἀκηράτου, τρυφῆς καὶ…
ltx/gr_gr_cog/me.m01.d03:meMA.Ode9C32.melody	@ltx/gr_gr_cog/he.h.m8:heHE.TonProdilothenta.name
ltx/gr_gr_cog/me.m01.d03:meMA.Ode9C32.mode	@ltx/gr_gr_cog/miscellanea:misc.Mode8
ltx/gr_gr_cog/me.m01.d03:meMA.Ode9C32.ode	@ltx/gr_gr_cog/miscellanea:misc.Ode9
ltx/gr_gr_cog/me.m01.d03:meMA.Ode9C32.text	Νῦν τῆς ἀκηράτου, τρυφῆς καὶ τῆς θεοπτίας, ἐμφορούμενος Γόρδιε, καὶ φωτὸς ἀνεσπέρου, ἐν σκηναῖς αἰωνίοις κομίζῃ, τὰς ἐπικαρπίας τῶν ἀγώνων σου.
ltx/gr_gr_cog/me.m01.d03:meMA.Ode9C33.incipit	Αὕτη ἡ ἡμέρα, τὴν σὴν…
ltx/gr_gr_cog/me.m01.d03:meMA.Ode9C33.melody	@ltx/gr_gr_cog/he.h.m8:heHE.TonProdilothenta.name
ltx/gr_gr_cog/me.m01.d03:meMA.Ode9C33.mode	@ltx/gr_gr_cog/miscellanea:misc.Mode8
ltx/gr_gr_cog/me.m01.d03:meMA.Ode9C33.ode	@ltx/gr_gr_cog/miscellanea:misc.Ode9
ltx/gr_gr_cog/me.m01.d03:meMA.Ode9C33.text	Αὕτη ἡ ἡμέρα, τὴν σὴν ἄθλησιν ἐπεῖδεν, ἣν οὐκ ἠμαύρωσεν ὁ χρόνος, οὐκ ἐκάλυψε λήθη, ἀλλʼ ἀεὶ τοῖς ὑμνοῦσί σε πίστει, Μάρτυς ἀνατέλλει ὥσπερ ἥλιος.
ltx/gr_gr_cog/me.m01.d03:meMA.Ode9C34.incipit	Δόξαν τὴν ῥευστήν, καὶ φθαρτὴν…
ltx/gr_gr_cog/me.m01.d03:meMA.Ode9C34.melody	@ltx/gr_gr_cog/he.h.m8:heHE.TonProdilothenta.name
ltx/gr_gr_cog/me.m01.d03:meMA.Ode9C34.mode	@ltx/gr_gr_cog/miscellanea:misc.Mode8
ltx/gr_gr_cog/me.m01.d03:meMA.Ode9C34.ode	@ltx/gr_gr_cog/miscellanea:misc.Ode9
ltx/gr_gr_cog/me.m01.d03:meMA.Ode9C34.text	Δόξαν τὴν ῥευστήν, καὶ φθαρτὴν καὶ πεπατημένην, παριδὼν θέοφρον Μάρτυς, ἀϊδίου νῦν δόξης, καὶ χαρᾶς ἀληθοῦς ἀπολαύεις, θρόνῳ τοῦ Δεσπότου παριστάμενος.
ltx/gr_gr_cog/me.m01.d03:meMA.Ode9C3T.incipit	Ὡς διασωθέντες, Παρθένε πρὶν τῆς…
ltx/gr_gr_cog/me.m01.d03:meMA.Ode9C3T.melody	@ltx/gr_gr_cog/he.h.m8:heHE.TonProdilothenta.name
ltx/gr_gr_cog/me.m01.d03:meMA.Ode9C3T.mode	@ltx/gr_gr_cog/miscellanea:misc.Mode8
ltx/gr_gr_cog/me.m01.d03:meMA.Ode9C3T.ode	@ltx/gr_gr_cog/miscellanea:misc.Ode9
ltx/gr_gr_cog/me.m01.d03:meMA.Ode9C3T.text	Ὡς διασωθέντες, Παρθένε πρὶν τῆς κατάρας, διὰ τοῦ σοῦ θείου τόκου, ἐπαξίως ὑμνοῦμεν, εὐχαρίστως πάντες μελῳδοῦντες· Χαῖρε Θεοτόκε ἡ ἐλπὶς ἡμῶν.
ltx/gr_gr_cog/me.m01.d03:meMA.Ode9H.greekmelody	@ltx/gr_gr_cog/he.h.m8:heHE.TonProdilothenta.greekname
ltx/gr_gr_cog/me.m01.d03:meMA.Ode9H.incipit	@ltx/gr_gr_cog/he.h.m8:heHE.TonProdilothenta.incipit
ltx/gr_gr_cog/me.m01.d03:meMA.Ode9H.melody	@ltx/gr_gr_cog/he.h.m8:heHE.TonProdilothenta.melody
ltx/gr_gr_cog/me.m01.d03:meMA.Ode9H.mode	@ltx/gr_gr_cog/miscellanea:misc.Mode8
ltx/gr_gr_cog/me.m01.d03:meMA.Ode9H.ode	@ltx/gr_gr_cog/miscellanea:misc.Ode9
ltx/gr_gr_cog/me.m01.d03:meMA.Ode9H.text	@ltx/gr_gr_cog/he.h.m8:heHE.TonProdilothenta.text
ltx/gr_gr_cog/me.m01.d03:meVE.Apolytikion1.greekmelody	@ltx/gr_gr_cog/me.m01.d02:meVE.Apolytikion1.greekmelody
ltx/gr_gr_cog/me.m01.d03:meVE.Apolytikion1.incipit	@ltx/gr_gr_cog/me.m01.d02:meVE.Apolytikion1.incipit
ltx/gr_gr_cog/me.m01.d03:meVE.Apolytikion1.melody	@ltx/gr_gr_cog/me.m01.d02:meVE.Apolytikion1.melody
ltx/gr_gr_cog/me.m01.d03:meVE.Apolytikion1.mode	@ltx/gr_gr_cog/me.m01.d02:meVE.Apolytikion1.mode
ltx/gr_gr_cog/me.m01.d03:meVE.Apolytikion1.text	@ltx/gr_gr_cog/me.m01.d02:meVE.Apolytikion1.text
ltx/gr_gr_cog/me.m01.d03:meVE.AposGlory.incipit	Ἐν Ἰορδάνῃ ποταμῷ…
ltx/gr_gr_cog/me.m01.d03:meVE.AposGlory.melody	
ltx/gr_gr_cog/me.m01.d03:meVE.AposGlory.mode	@ltx/gr_gr_cog/miscellanea:misc.Mode5
ltx/gr_gr_cog/me.m01.d03:meVE.AposGlory.poet	@ltx/gr_gr_cog/poets:po.Vyzantiou
ltx/gr_gr_cog/me.m01.d03:meVE.AposGlory.text	Ἐν Ἰορδάνῃ ποταμῷ Χριστὸς ὁ Θεὸς ἡμῶν, μολεῖ πρὸς τὸ Βάπτισμα, καθᾶραι θέλων ἡμᾶς, ἐκ τῶν ἀνομιῶν ἡμῶν, τῇ αὐτοῦ ἐπιφανείᾳ, ὡς μόνος ἀγαθὸς καὶ φιλάνθρωπος.
ltx/gr_gr_cog/me.m01.d03:meVE.Aposticha1.greekmelody	@ltx/gr_gr_cog/he.a.m6:heAU.TriimerosAnestis.greekname
ltx/gr_gr_cog/me.m01.d03:meVE.Aposticha1.incipit	Ἰδοὺ ὁ φωτισμὸς…
ltx/gr_gr_cog/me.m01.d03:meVE.Aposticha1.melody	@ltx/gr_gr_cog/he.a.m6:heAU.TriimerosAnestis.name
ltx/gr_gr_cog/me.m01.d03:meVE.Aposticha1.mode	@ltx/gr_gr_cog/miscellanea:misc.Mode6
ltx/gr_gr_cog/me.m01.d03:meVE.Aposticha1.text	Ἰδοὺ ὁ φωτισμὸς τῶν πιστῶν, ἰδοὺ ὁ ἱλασμὸς ἡμῶν, ἐπιβαίνειν, μέλλει ῥείθροις ποταμοῦ, τὸν ῥύπον ὅπως πλύνῃ, κακίας τῶν ἀνθρώπων, καὶ ἀναπλάσῃ συντριβέντας ἡμᾶς.
ltx/gr_gr_cog/me.m01.d03:meVE.Aposticha2.incipit	Ὡς εἶδέ σε ἐρχόμενον…
ltx/gr_gr_cog/me.m01.d03:meVE.Aposticha2.melody	@ltx/gr_gr_cog/he.a.m6:heAU.TriimerosAnestis.name
ltx/gr_gr_cog/me.m01.d03:meVE.Aposticha2.mode	@ltx/gr_gr_cog/miscellanea:misc.Mode6
ltx/gr_gr_cog/me.m01.d03:meVE.Aposticha2.text	Ὡς εἶδέ σε ἐρχόμενον, ὁ Πρόδρομος σου Κύριε, καὶ αἰτοῦντα, βαπτισθῆναι ὑπʼ αὐτοῦ, ἐν φόβῳ ἀνεβόα· Θεέ μου πλαστουργέ μου, πῶς σε βαπτίσω τὸν ἀμόλυντον;
ltx/gr_gr_cog/me.m01.d03:meVE.Aposticha3.incipit	Συνέλθωμεν πιστοὶ νοητῶς…
ltx/gr_gr_cog/me.m01.d03:meVE.Aposticha3.melody	@ltx/gr_gr_cog/he.a.m6:heAU.TriimerosAnestis.name
ltx/gr_gr_cog/me.m01.d03:meVE.Aposticha3.mode	@ltx/gr_gr_cog/miscellanea:misc.Mode6
ltx/gr_gr_cog/me.m01.d03:meVE.Aposticha3.text	Συνέλθωμεν πιστοὶ νοητῶς, πρὸς τὰς τοῦ Ἰορδάνου ῥοάς, θαῦμα μέγα, ὅπως ἴδωμεν σαφῶς· ὁ Κτίστης γὰρ τῶν ὅλων, ἐπιφανεὶς ὡράθη, καὶ βαπτισθῆναι παραγέγονε.
ltx/gr_gr_cog/me.m01.d03:meVE.SticGlory.incipit	Ὢ τοῦ παραδόξου θαύματος…
ltx/gr_gr_cog/me.m01.d03:meVE.SticGlory.melody	
ltx/gr_gr_cog/me.m01.d03:meVE.SticGlory.mode	@ltx/gr_gr_cog/miscellanea:misc.Mode4
ltx/gr_gr_cog/me.m01.d03:meVE.SticGlory.poet	@ltx/gr_gr_cog/poets:po.IoannouMonachou
ltx/gr_gr_cog/me.m01.d03:meVE.SticGlory.text	Ὢ τοῦ παραδόξου θαύματος! ὁ ἐν Πνεύματι Ἁγίῳ βαπτίζων καὶ πυρί, ἐν Ἰορδάνῃ ἔρχεται βαπτισθῆναι ὑπὸ Ἰωάννου, Θεὸς οὐ γυμνός, οὐδὲ ἄνθρωπος ψιλός, ἀλλʼ ἐν δυσὶ ταῖς φύσεσιν, εἷς ὁ αὐτὸς Υἱὸς μονογενής, ζητῶν μὲν τὸ βάπτισμα, ὡς ἄνθρωπος ἐκ θνητοῦ, αἴρων δὲ ὡς Θεός, τὴν ἁμαρτίαν τοῦ κόσμου, καὶ παρέχων πᾶσι τὸ μέγα ἔλεος.
ltx/gr_gr_cog/me.m01.d03:meVE.Stichera01.greekmelody	@ltx/gr_gr_cog/he.a.m8:heAU.KyrieEiKaiKritirio.greekname
ltx/gr_gr_cog/me.m01.d03:meVE.Stichera01.incipit	Κύριε, σοὶ τὸν σὸν Προφήτην…
ltx/gr_gr_cog/me.m01.d03:meVE.Stichera01.melody	@ltx/gr_gr_cog/he.a.m8:heAU.KyrieEiKaiKritirio.name
ltx/gr_gr_cog/me.m01.d03:meVE.Stichera01.mode	@ltx/gr_gr_cog/miscellanea:misc.Mode8
ltx/gr_gr_cog/me.m01.d03:meVE.Stichera01.text	Κύριε, σοὶ τὸν σὸν Προφήτην ἱκέτην, καὶ πρεσβευτὴν προχειρίζομαι, οὗ ταῖς ἱκεσίαις οἰκτίρμον, καὶ ταῖς πρεσβείαις ὡς εὔσπλαγχνος, ἀπεγνωσμένης ψυχῆς, τὰ πταίσματα διάλυσον, οὐσιώδη κεκτημένος, καὶ φυσικὴν ἀγαθότητα.
ltx/gr_gr_cog/me.m01.d03:meVE.Stichera02.incipit	Ῥήματα, τῆς θεοκινήτου σου γλώττης…
ltx/gr_gr_cog/me.m01.d03:meVE.Stichera02.melody	@ltx/gr_gr_cog/he.a.m8:heAU.KyrieEiKaiKritirio.name
ltx/gr_gr_cog/me.m01.d03:meVE.Stichera02.mode	@ltx/gr_gr_cog/miscellanea:misc.Mode8
ltx/gr_gr_cog/me.m01.d03:meVE.Stichera02.text	Ῥήματα, τῆς θεοκινήτου σου γλώττης, ἐκβεβηκότα θεώμενος, σὲ νῦν μακαρίζω Προφῆτα, τῆς ἀληθείας ἀγάμενος· σὺ γὰρ φωνῇ λιγυρᾷ, τὸν κόσμον περιήχησας, τὴν τοῦ Κυρίου προαγορεύων, παρουσίαν τὴν σωτήριον.
ltx/gr_gr_cog/me.m01.d03:meVE.Stichera03.incipit	Ἄγγελος, ἀγγελομιμήτῳ σου βίῳ, ἐπὶ…
ltx/gr_gr_cog/me.m01.d03:meVE.Stichera03.melody	@ltx/gr_gr_cog/he.a.m8:heAU.KyrieEiKaiKritirio.name
ltx/gr_gr_cog/me.m01.d03:meVE.Stichera03.mode	@ltx/gr_gr_cog/miscellanea:misc.Mode8
ltx/gr_gr_cog/me.m01.d03:meVE.Stichera03.text	Ἄγγελος, ἀγγελομιμήτῳ σου βίῳ, ἐπὶ τῆς γῆς ἐχρημάτισας, καὶ προσηγορίαν Ἀγγέλου, παναρμονίως ἐπλούτησας, τὴν καλλονὴν τῆς ψυχῆς, τῷ κάλλει τῷ τοῦ σώματος, καταλλήλως συναρμόσας, Μαλαχία παμμακάριστε.
ltx/gr_gr_cog/me.m01.d03:meVE.Stichera04.greekmelody	@ltx/gr_gr_cog/he.a.m8:heAU.OTouParadoxou.greekname
ltx/gr_gr_cog/me.m01.d03:meVE.Stichera04.incipit	Κορυφουμένην θεώμενος, τὴν τῆς ἀπάτης…
ltx/gr_gr_cog/me.m01.d03:meVE.Stichera04.melody	@ltx/gr_gr_cog/he.a.m8:heAU.OTouParadoxou.name
ltx/gr_gr_cog/me.m01.d03:meVE.Stichera04.mode	@ltx/gr_gr_cog/miscellanea:misc.Mode8
ltx/gr_gr_cog/me.m01.d03:meVE.Stichera04.text	Κορυφουμένην θεώμενος, τὴν τῆς ἀπάτης ἀχλύν, φυγαδεύων ἐμάκρυνας, ἀθλοφόρε Γόρδιε, τὸν Θεὸν προσδεχόμενος, πολλοῖς δὲ πόνοις, ἐγγυμνασάμενος, καὶ ταῖς νηστείαις παιδοτριβούμενος, ὥσπερ αἰσθόμενος, τῆς σαυτοῦ δυνάμεως, ἀγωνιστής, ὥρμησας αὐτόκλητος, πρὸς τὸν ἀντίπαλον.
ltx/gr_gr_cog/me.m01.d03:meVE.Stichera05.incipit	Σφόδρα πεποιθὼς κατείληφας, τῶν δυσμενῶν…
ltx/gr_gr_cog/me.m01.d03:meVE.Stichera05.melody	@ltx/gr_gr_cog/he.a.m8:heAU.OTouParadoxou.name
ltx/gr_gr_cog/me.m01.d03:meVE.Stichera05.mode	@ltx/gr_gr_cog/miscellanea:misc.Mode8
ltx/gr_gr_cog/me.m01.d03:meVE.Stichera05.text	Σφόδρα πεποιθὼς κατείληφας, τῶν δυσμενῶν τὴν πληθύν, παναοίδιμε Γόρδιε, παρʼ οὐδὲν ἡγούμενος, τῶν ἀνόμων τὸ θέατρον, καὶ στὰς ἐν μέσῳ, κήρυξ αὐτόμολος, μεγαλοφώνως Χριστὸν ἐκήρυξας, Κτίστην καὶ Κύριον, τῷ Πατρὶ συνάναρχον, καὶ τῷ σεπτῶ, Πνεύματι ὁμότιμον, καὶ συναΐδιον.
ltx/gr_gr_cog/me.m01.d03:meVE.Stichera06.incipit	Ξίφει κεφαλὴν τεμνόμενος, ἀπὸ ζωῆς…
ltx/gr_gr_cog/me.m01.d03:meVE.Stichera06.melody	@ltx/gr_gr_cog/he.a.m8:heAU.OTouParadoxou.name
ltx/gr_gr_cog/me.m01.d03:meVE.Stichera06.mode	@ltx/gr_gr_cog/miscellanea:misc.Mode8
ltx/gr_gr_cog/me.m01.d03:meVE.Stichera06.text	Ξίφει κεφαλὴν τεμνόμενος, ἀπὸ ζωῆς εἰς ζωήν, ἐκ θνητῆς εἰς ἀθάνατον, καὶ φθαρτῆς πρὸς ἄφθαρτον, προφανῶς μεταβέβηκας, μὴ ἀναμείνας φύσεως νέκρωσιν, ἀλλʼ αὐθαιρέτως θανεῖν ἑλόμενος. Ὢ τῶν ἀγώνων σου, Ἀθλοφόρε Γόρδιε! διʼ ὧν Χριστόν, Μάρτυς ἐμεγάλυνας, τὸν μόνον εὔσπλαγχνον.
