ltx/gr_gr_cog/tr.d050:trCO.header	
ltx/gr_gr_cog/tr.d050:trDA.commemoration.full	ΚΥΡΙΑΚΗ Δʹ ΤΩΝ ΝΗΣΤΕΙΩΝ ΤΟΥ ΟΣΙΟΥ ΠΑΤΡΟΣ ΗΜΩΝ ΙΩΑΝΝΟΥ ΤΟΥ ΣΥΓΓΡΑΦΕΩΣ ΤΗΣ «ΚΛΙΜΑΚΟΣ»
ltx/gr_gr_cog/tr.d050:trDA.commemoration.short	Κυριακὴ Δʹ τῶν Νηστειῶν τοῦ Ὁσίου Ἰωάννου τῆς Κλίμακος
ltx/gr_gr_cog/tr.d050:trDA.dismissal	@ltx/gr_gr_cog/dismissals:dis00.resurrection
ltx/gr_gr_cog/tr.d050:trDA.insert1	τοῦ Ὁσίου Πατρὸς ἡμῶν Ἰωάννου, τοῦ Συγγραφέως τῆς Κλίμακος,
ltx/gr_gr_cog/tr.d050:trDA.insert2	οὗ καὶ τὴν μνήμην ἐπιτελοῦμεν·
ltx/gr_gr_cog/tr.d050:trDA.note	
ltx/gr_gr_cog/tr.d050:trDA.title	@ltx/gr_gr_cog/titles:ti.SaintM
ltx/gr_gr_cog/tr.d050:trHO.commemorations	
ltx/gr_gr_cog/tr.d050:trHO.daytitle	
ltx/gr_gr_cog/tr.d050:trHO.description1	
ltx/gr_gr_cog/tr.d050:trHO.description2	
ltx/gr_gr_cog/tr.d050:trHO.note1	
ltx/gr_gr_cog/tr.d050:trHO.note2	
ltx/gr_gr_cog/tr.d050:trLI.Kontakion1.incipit	@ltx/gr_gr_cog/tr.d050:trMA.Kontakion1.incipit
ltx/gr_gr_cog/tr.d050:trLI.Kontakion1.melody	@ltx/gr_gr_cog/tr.d050:trMA.Kontakion1.melody
ltx/gr_gr_cog/tr.d050:trLI.Kontakion1.mode	@ltx/gr_gr_cog/tr.d050:trMA.Kontakion1.mode
ltx/gr_gr_cog/tr.d050:trLI.Kontakion1.text	@ltx/gr_gr_cog/tr.d050:trMA.Kontakion1.text
ltx/gr_gr_cog/tr.d050:trLI.Megalynarion.text	Τὴν οὐρανοδρόμον ἣν Ἰακώβ, κλίμακα προεῖδεν, ἐτεχνήσω πνευματικῶς, πάτερ Ἰωάννη, συνθήκῃ τῶν σῶν λόγων· διʼἧς πρὸς ἀφθαρσίας βαίνομεν μέθεξιν.
ltx/gr_gr_cog/tr.d050:trMA.C1.title	@ltx/gr_gr_cog/titles:ti.CanonTriodion
ltx/gr_gr_cog/tr.d050:trMA.C1.verse	@ltx/gr_gr_cog/prayers:pr.verse_God.text
ltx/gr_gr_cog/tr.d050:trMA.C2.notice1	Ἡ ἀκολουθία τοῦ Ἁγίου Ἰωάννου τῆς Κλίμακος ψάλλεται (ἢ ἀναγινώσκεται) ἐδὼ ἐφέτος, ἐπειδὴ συνέπεσε μὲ τὴν ἀπόδοσιν τῆς ἑορτῆς τοῦ Εὐαγγελισμοῦ.
ltx/gr_gr_cog/tr.d050:trMA.C2.title	@ltx/gr_gr_cog/titles:ti.CanonDevoutM
ltx/gr_gr_cog/tr.d050:trMA.C2.verse	@ltx/gr_gr_cog/prayers:pr.verse_SaintM.text
ltx/gr_gr_cog/tr.d050:trMA.ExapTheotokion.greekmelody	@ltx/gr_gr_cog/he.a.m2:heAU.GynaikesAkoutisthite.greekname
ltx/gr_gr_cog/tr.d050:trMA.ExapTheotokion.incipit	Κυρίως Θεοτόκον σε, ὁμολογοῦμεν Δέσποινα…
ltx/gr_gr_cog/tr.d050:trMA.ExapTheotokion.melody	@ltx/gr_gr_cog/he.a.m2:heAU.GynaikesAkoutisthite.name
ltx/gr_gr_cog/tr.d050:trMA.ExapTheotokion.mode	@ltx/gr_gr_cog/miscellanea:misc.Mode2
ltx/gr_gr_cog/tr.d050:trMA.ExapTheotokion.text	Κυρίως Θεοτόκον σε, ὁμολογοῦμεν Δέσποινα, οἱ διὰ σοῦ σεσωσμένοι· καὶ γὰρ Θεὸν ἐκύησας, ἀποῤῥήτως τὸν λύσαντα, διὰ Σταυροῦ τὸν θάνατον, πρὸς ἑαυτὸν δʹ ἑλκύσαντα, Ὁσίων δήμους, μεθʹ ὧν σε, ἀνευφημοῦμεν Παρθένε.
ltx/gr_gr_cog/tr.d050:trMA.Exaposteilarion1.greekmelody	@ltx/gr_gr_cog/he.a.m2:heAU.GynaikesAkoutisthite.greekname
ltx/gr_gr_cog/tr.d050:trMA.Exaposteilarion1.incipit	Τοῦ κόσμου τὴν εὐπάθειαν, ὡς…
ltx/gr_gr_cog/tr.d050:trMA.Exaposteilarion1.melody	@ltx/gr_gr_cog/he.a.m2:heAU.GynaikesAkoutisthite.name
ltx/gr_gr_cog/tr.d050:trMA.Exaposteilarion1.mode	@ltx/gr_gr_cog/miscellanea:misc.Mode2
ltx/gr_gr_cog/tr.d050:trMA.Exaposteilarion1.text	Τοῦ κόσμου τὴν εὐπάθειαν, ὡς μοχθηρὰν ἐξέκλινας, καὶ ἀτροφίᾳ τὴν σάρκα, μαράνας ἀνεκαίνισας, ψυχῆς τὸν τόνον Ὅσιε, καὶ δόξαν κατεπλούτησας, οὐράνιον ἀοίδιμε· διὸ μὴ παύσῃ πρεσβεύων ὑπὲρ ἡμῶν Ἰωάννη.
ltx/gr_gr_cog/tr.d050:trMA.Kontakion1.incipit	Ἐν τῷ ὕψει Κύριος, τῆς…
ltx/gr_gr_cog/tr.d050:trMA.Kontakion1.melody	@ltx/gr_gr_cog/he.a.m4:heAU.EpefanisSimeron.name
ltx/gr_gr_cog/tr.d050:trMA.Kontakion1.mode	@ltx/gr_gr_cog/miscellanea:misc.Mode4
ltx/gr_gr_cog/tr.d050:trMA.Kontakion1.text	Ἐν τῷ ὕψει Κύριος, τῆς ἐγκρατείας, ἀληθῆ σε ἔθετο, ὥσπερ ἀστέρα ἀπλανῆ, φωταγωγοῦντα τὰ πέρατα, καθηγητὰ Ἰωάννη Πατὴρ ἡμῶν.
ltx/gr_gr_cog/tr.d050:trMA.Lauds1.greekmelody	@ltx/gr_gr_cog/he.a.m8:heAU.OTouParadoxou.greekname
ltx/gr_gr_cog/tr.d050:trMA.Lauds1.incipit	@ltx/gr_gr_cog/tr.d050:trVE.Stichera01.incipit
ltx/gr_gr_cog/tr.d050:trMA.Lauds1.melody	@ltx/gr_gr_cog/he.a.m8:heAU.OTouParadoxou.name
ltx/gr_gr_cog/tr.d050:trMA.Lauds1.mode	@ltx/gr_gr_cog/miscellanea:misc.Mode8
ltx/gr_gr_cog/tr.d050:trMA.Lauds1.text	@ltx/gr_gr_cog/tr.d050:trVE.Stichera01.text
ltx/gr_gr_cog/tr.d050:trMA.Lauds2.incipit	@ltx/gr_gr_cog/tr.d050:trVE.Stichera02.incipit
ltx/gr_gr_cog/tr.d050:trMA.Lauds2.melody	@ltx/gr_gr_cog/he.a.m8:heAU.OTouParadoxou.name
ltx/gr_gr_cog/tr.d050:trMA.Lauds2.mode	@ltx/gr_gr_cog/miscellanea:misc.Mode8
ltx/gr_gr_cog/tr.d050:trMA.Lauds2.text	@ltx/gr_gr_cog/tr.d050:trVE.Stichera02.text
ltx/gr_gr_cog/tr.d050:trMA.Lauds3.incipit	@ltx/gr_gr_cog/tr.d050:trVE.Stichera03.incipit
ltx/gr_gr_cog/tr.d050:trMA.Lauds3.melody	@ltx/gr_gr_cog/he.a.m8:heAU.OTouParadoxou.name
ltx/gr_gr_cog/tr.d050:trMA.Lauds3.mode	@ltx/gr_gr_cog/miscellanea:misc.Mode8
ltx/gr_gr_cog/tr.d050:trMA.Lauds3.text	@ltx/gr_gr_cog/tr.d050:trVE.Stichera03.text
ltx/gr_gr_cog/tr.d050:trMA.LaudsGlory.incipit	Δεῦτε ἐργασώμεθα ἐν τῷ μυστικῷ…
ltx/gr_gr_cog/tr.d050:trMA.LaudsGlory.melody	@ltx/gr_gr_cog/miscellanea:misc.Idiomelon
ltx/gr_gr_cog/tr.d050:trMA.LaudsGlory.mode	@ltx/gr_gr_cog/miscellanea:misc.Mode1
ltx/gr_gr_cog/tr.d050:trMA.LaudsGlory.text	Δεῦτε ἐργασώμεθα ἐν τῷ μυστικῷ ἀμπελῶνι καρποὺς μετανοίας, ἐν τούτῳ ποιούμενοι οὐκ ἐν βρώμασι καὶ πόμασι κοπιῶντες, ἀλλʹ ἐν προσευχαῖς καὶ νηστείαις τὰς ἀρετὰς κατορθοῦντες, τούτοις ἀρεσκόμενος, ὁ Κύριος τοῦ ἔργου δηνάριον παρέχει δι οὗ ψυχὰς λυτροῦται, χρέους ἁμαρτίας, ὁ μόνος πολυέλεος.
ltx/gr_gr_cog/tr.d050:trMA.Ode1C11.greekmelody	@ltx/gr_gr_cog/he.h.m5:heHE.ToSotiriTheo.greekname
ltx/gr_gr_cog/tr.d050:trMA.Ode1C11.incipit	Ὡμοιώθην Χριστέ, τῷ ἐν χερσὶ…
ltx/gr_gr_cog/tr.d050:trMA.Ode1C11.melody	@ltx/gr_gr_cog/he.h.m5:heHE.ToSotiriTheo.name
ltx/gr_gr_cog/tr.d050:trMA.Ode1C11.mode	@ltx/gr_gr_cog/miscellanea:misc.Mode5
ltx/gr_gr_cog/tr.d050:trMA.Ode1C11.ode	@ltx/gr_gr_cog/miscellanea:misc.Ode1
ltx/gr_gr_cog/tr.d050:trMA.Ode1C11.text	Ὡμοιώθην Χριστέ, τῷ ἐν χερσὶ τῶν λῃστῶν περιπεσόντι, καὶ τυπτήμασιν ἡμιθανεῖ ὑπὸ τούτων, καταλειφθέντι Σωτήρ, κἀγὼ οὕτω πέπληγμαι, ταῖς ἁμαρτίαις μου.
ltx/gr_gr_cog/tr.d050:trMA.Ode1C12.incipit	Μὴ παρίδῃς ἐμέ, τὸν ἀσθενοῦντα…
ltx/gr_gr_cog/tr.d050:trMA.Ode1C12.melody	@ltx/gr_gr_cog/he.h.m5:heHE.ToSotiriTheo.name
ltx/gr_gr_cog/tr.d050:trMA.Ode1C12.mode	@ltx/gr_gr_cog/miscellanea:misc.Mode5
ltx/gr_gr_cog/tr.d050:trMA.Ode1C12.ode	@ltx/gr_gr_cog/miscellanea:misc.Ode1
ltx/gr_gr_cog/tr.d050:trMA.Ode1C12.text	Μὴ παρίδῃς ἐμέ, τὸν ἀσθενοῦντα δεινῶς, ἐβόα Σῶτερ ὀδυρόμενος, εἰς τοὺς λῃστὰς ὁ τὸν πλοῦτον ἀποσυλήσας σου, κᾀγὼ οὕτω δέομαι· οἴκτειρον σῶσόν με.
ltx/gr_gr_cog/tr.d050:trMA.Ode1C13.incipit	Ἰατρεύσας ἐμέ, τὸν μαστιχθέντα τὸν…
ltx/gr_gr_cog/tr.d050:trMA.Ode1C13.melody	@ltx/gr_gr_cog/he.h.m5:heHE.ToSotiriTheo.name
ltx/gr_gr_cog/tr.d050:trMA.Ode1C13.mode	@ltx/gr_gr_cog/miscellanea:misc.Mode5
ltx/gr_gr_cog/tr.d050:trMA.Ode1C13.ode	@ltx/gr_gr_cog/miscellanea:misc.Ode1
ltx/gr_gr_cog/tr.d050:trMA.Ode1C13.text	Ἰατρεύσας ἐμέ, τὸν μαστιχθέντα τὸν νοῦν, ταῖς ἁμαρτίαις ἐν ταῖς μάστιξιν, ὑπὸ λῃστῶν τῶν ἀδίκων καὶ πονηρῶν λογισμῶν, Χριστὲ Σωτὴρ σῶσόν με, ὡς πολυέλεος.
ltx/gr_gr_cog/tr.d050:trMA.Ode1C1T.incipit	Ἄχραντε Μήτηρ Χριστοῦ, τὸν σαρκωθέντα…
ltx/gr_gr_cog/tr.d050:trMA.Ode1C1T.melody	@ltx/gr_gr_cog/he.h.m5:heHE.ToSotiriTheo.name
ltx/gr_gr_cog/tr.d050:trMA.Ode1C1T.mode	@ltx/gr_gr_cog/miscellanea:misc.Mode5
ltx/gr_gr_cog/tr.d050:trMA.Ode1C1T.ode	@ltx/gr_gr_cog/miscellanea:misc.Ode1
ltx/gr_gr_cog/tr.d050:trMA.Ode1C1T.text	Ἄχραντε Μήτηρ Χριστοῦ, τὸν σαρκωθέντα ἐκ σοῦ καὶ ἐκ τῶν κόλπων τοῦ Γεννήτορος, μὴ ἐκφοιτήσαντα Θεόν, ἀπαύστως πρέσβευε, ἐκ πάσης περιστάσεως σῶσαι οὓς ἔπλασεν.
ltx/gr_gr_cog/tr.d050:trMA.Ode1C21.greekmelody	@ltx/gr_gr_cog/he.h.m8:heHE.YgranDiodefsas.greekname
ltx/gr_gr_cog/tr.d050:trMA.Ode1C21.incipit	Ἐν φωτὶ ἀΰλῳ καὶ νοητῷ…
ltx/gr_gr_cog/tr.d050:trMA.Ode1C21.melody	@ltx/gr_gr_cog/he.h.m8:heHE.YgranDiodefsas.name
ltx/gr_gr_cog/tr.d050:trMA.Ode1C21.mode	@ltx/gr_gr_cog/miscellanea:misc.Mode8
ltx/gr_gr_cog/tr.d050:trMA.Ode1C21.ode	@ltx/gr_gr_cog/miscellanea:misc.Ode1
ltx/gr_gr_cog/tr.d050:trMA.Ode1C21.text	Ἐν φωτὶ ἀΰλῳ καὶ νοητῷ, ἐκ τῆς κατηφείας, τῶν ἐνύλων ἀναδραμών, Ἰωάννη Ὅσιε λιταῖς σου, ταῖς πρὸς τὸν Κύριόν με φώτισον.
ltx/gr_gr_cog/tr.d050:trMA.Ode1C22.incipit	Ὡς τῆς ἐγκρατείας τὸν γλυκασμόν…
ltx/gr_gr_cog/tr.d050:trMA.Ode1C22.melody	@ltx/gr_gr_cog/he.h.m8:heHE.YgranDiodefsas.name
ltx/gr_gr_cog/tr.d050:trMA.Ode1C22.mode	@ltx/gr_gr_cog/miscellanea:misc.Mode8
ltx/gr_gr_cog/tr.d050:trMA.Ode1C22.ode	@ltx/gr_gr_cog/miscellanea:misc.Ode1
ltx/gr_gr_cog/tr.d050:trMA.Ode1C22.text	Ὡς τῆς ἐγκρατείας τὸν γλυκασμόν, θηλάσας ἀπώσω, τὴν πικρίαν τῶν ἡδονῶν· ὅθεν ὑπὲρ μέλι καὶ κηρίον, ἡδύνεις Πάτερ τὰς αἰσθήσεις ἡμῶν.
ltx/gr_gr_cog/tr.d050:trMA.Ode1C23.incipit	Ἐπιβὰς τῷ ὕψει τῶν ἀρετῶν…
ltx/gr_gr_cog/tr.d050:trMA.Ode1C23.melody	@ltx/gr_gr_cog/he.h.m8:heHE.YgranDiodefsas.name
ltx/gr_gr_cog/tr.d050:trMA.Ode1C23.mode	@ltx/gr_gr_cog/miscellanea:misc.Mode8
ltx/gr_gr_cog/tr.d050:trMA.Ode1C23.ode	@ltx/gr_gr_cog/miscellanea:misc.Ode1
ltx/gr_gr_cog/tr.d050:trMA.Ode1C23.text	Ἐπιβὰς τῷ ὕψει τῶν ἀρετῶν, καὶ τὰς χαμαιζήλους, διαπτύσας τῶν ἡδονῶν, γλυκασμὸς ἐδείχθης σωτηρίας, Ὅσιε Πάτερ τῷ ποιμνίῳ σου.
ltx/gr_gr_cog/tr.d050:trMA.Ode1C2T.incipit	Σοφίαν καὶ Λόγον ἡ τοῦ…
ltx/gr_gr_cog/tr.d050:trMA.Ode1C2T.melody	@ltx/gr_gr_cog/he.h.m8:heHE.YgranDiodefsas.name
ltx/gr_gr_cog/tr.d050:trMA.Ode1C2T.mode	@ltx/gr_gr_cog/miscellanea:misc.Mode8
ltx/gr_gr_cog/tr.d050:trMA.Ode1C2T.ode	@ltx/gr_gr_cog/miscellanea:misc.Ode1
ltx/gr_gr_cog/tr.d050:trMA.Ode1C2T.text	Σοφίαν καὶ Λόγον ἡ τοῦ Πατρός, ἀφράστως τεκοῦσα, τῆς ψυχῆς μου τὸ χαλεπόν, θεράπευσον τραῦμα καὶ καρδίας, τὴν ἀλγηδόνα καταπράϋνον.
ltx/gr_gr_cog/tr.d050:trMA.Ode3C11.greekmelody	@ltx/gr_gr_cog/he.h.m5:heHE.StereosonImasOTheos.greekname
ltx/gr_gr_cog/tr.d050:trMA.Ode3C11.incipit	Ὁδῷ ἐν τῇ τοῦ βίου…
ltx/gr_gr_cog/tr.d050:trMA.Ode3C11.melody	@ltx/gr_gr_cog/he.h.m5:heHE.StereosonImasOTheos.name
ltx/gr_gr_cog/tr.d050:trMA.Ode3C11.mode	@ltx/gr_gr_cog/miscellanea:misc.Mode5
ltx/gr_gr_cog/tr.d050:trMA.Ode3C11.ode	@ltx/gr_gr_cog/miscellanea:misc.Ode3
ltx/gr_gr_cog/tr.d050:trMA.Ode3C11.text	Ὁδῷ ἐν τῇ τοῦ βίου Χριστὲ δεινῶς ὁδεύων τετραυμάτισμαι, ὑπὸ λῃστῶν ἐν τοῖς πάθεσιν, ἀλλʹ ἀνάστησόν με δέομαι.
ltx/gr_gr_cog/tr.d050:trMA.Ode3C12.incipit	Ἐσύλησαν τὸν νοῦν μου λῃσταί…
ltx/gr_gr_cog/tr.d050:trMA.Ode3C12.melody	@ltx/gr_gr_cog/he.h.m5:heHE.StereosonImasOTheos.name
ltx/gr_gr_cog/tr.d050:trMA.Ode3C12.mode	@ltx/gr_gr_cog/miscellanea:misc.Mode5
ltx/gr_gr_cog/tr.d050:trMA.Ode3C12.ode	@ltx/gr_gr_cog/miscellanea:misc.Ode3
ltx/gr_gr_cog/tr.d050:trMA.Ode3C12.text	Ἐσύλησαν τὸν νοῦν μου λῃσταί, καὶ ἔλιπόν με ἐν τοῖς μώλωψιν, ἡμιθανῆ τῶν πταισμάτων μου ἀλλὰ ἴασαί με Κύριε.
ltx/gr_gr_cog/tr.d050:trMA.Ode3C13.incipit	Ἐγύμνωσάν με Σῶτερ Χριστέ, τῶν…
ltx/gr_gr_cog/tr.d050:trMA.Ode3C13.melody	@ltx/gr_gr_cog/he.h.m5:heHE.StereosonImasOTheos.name
ltx/gr_gr_cog/tr.d050:trMA.Ode3C13.mode	@ltx/gr_gr_cog/miscellanea:misc.Mode5
ltx/gr_gr_cog/tr.d050:trMA.Ode3C13.ode	@ltx/gr_gr_cog/miscellanea:misc.Ode3
ltx/gr_gr_cog/tr.d050:trMA.Ode3C13.text	Ἐγύμνωσάν με Σῶτερ Χριστέ, τῶν ἐντολῶν σου τὰ παθήματα, καὶ ἡδοναῖς μεμαστίγωμαι, ἀλλʹ ἐπίχεέ μοι ἔλεος.
ltx/gr_gr_cog/tr.d050:trMA.Ode3C1T.incipit	Ἱκέτευε ἀπαύστως Ἁγνή, τον προελθόντα…
ltx/gr_gr_cog/tr.d050:trMA.Ode3C1T.melody	@ltx/gr_gr_cog/he.h.m5:heHE.StereosonImasOTheos.name
ltx/gr_gr_cog/tr.d050:trMA.Ode3C1T.mode	@ltx/gr_gr_cog/miscellanea:misc.Mode5
ltx/gr_gr_cog/tr.d050:trMA.Ode3C1T.ode	@ltx/gr_gr_cog/miscellanea:misc.Ode3
ltx/gr_gr_cog/tr.d050:trMA.Ode3C1T.text	Ἱκέτευε ἀπαύστως Ἁγνή, τον προελθόντα ἐκ λαγόνων σου ῥυσθῆναι πλάνης διαβόλου τοὺς ὑμνοῦντάς σε Θεόνυμφε.
ltx/gr_gr_cog/tr.d050:trMA.Ode3C21.greekmelody	@ltx/gr_gr_cog/he.h.m8:heHE.SyEiToStereoma.greekname
ltx/gr_gr_cog/tr.d050:trMA.Ode3C21.incipit	Ἔφλεξας τῷ ἄνθρακι, τῷ τῆς…
ltx/gr_gr_cog/tr.d050:trMA.Ode3C21.melody	@ltx/gr_gr_cog/he.h.m8:heHE.SyEiToStereoma.name
ltx/gr_gr_cog/tr.d050:trMA.Ode3C21.mode	@ltx/gr_gr_cog/miscellanea:misc.Mode8
ltx/gr_gr_cog/tr.d050:trMA.Ode3C21.ode	@ltx/gr_gr_cog/miscellanea:misc.Ode3
ltx/gr_gr_cog/tr.d050:trMA.Ode3C21.text	Ἔφλεξας τῷ ἄνθρακι, τῷ τῆς ἀσκήσεως Ὅσιε, τὴν τῶν παθῶν, ἄκανθαν καὶ θάλπεις, Μοναστῶν τὰ συστήματα.
ltx/gr_gr_cog/tr.d050:trMA.Ode3C22.incipit	Μύρον ἁγιάσματος ἐκ τῶν ἀσκητικῶν…
ltx/gr_gr_cog/tr.d050:trMA.Ode3C22.melody	@ltx/gr_gr_cog/he.h.m8:heHE.SyEiToStereoma.name
ltx/gr_gr_cog/tr.d050:trMA.Ode3C22.mode	@ltx/gr_gr_cog/miscellanea:misc.Mode8
ltx/gr_gr_cog/tr.d050:trMA.Ode3C22.ode	@ltx/gr_gr_cog/miscellanea:misc.Ode3
ltx/gr_gr_cog/tr.d050:trMA.Ode3C22.text	Μύρον ἁγιάσματος ἐκ τῶν ἀσκητικῶν Ὅσιε ἀρωμάτων, ὅλος συνετέθης, εἰς ὀσμὴν εὐωδίας Θεοῦ.
ltx/gr_gr_cog/tr.d050:trMA.Ode3C23.incipit	Νόμοις τοῖς ἀσκήσεως ἐμμελετῶν τὰ…
ltx/gr_gr_cog/tr.d050:trMA.Ode3C23.melody	@ltx/gr_gr_cog/he.h.m8:heHE.SyEiToStereoma.name
ltx/gr_gr_cog/tr.d050:trMA.Ode3C23.mode	@ltx/gr_gr_cog/miscellanea:misc.Mode8
ltx/gr_gr_cog/tr.d050:trMA.Ode3C23.ode	@ltx/gr_gr_cog/miscellanea:misc.Ode3
ltx/gr_gr_cog/tr.d050:trMA.Ode3C23.text	Νόμοις τοῖς ἀσκήσεως ἐμμελετῶν τὰ πάθη ἐβύθισας, ὥσπερ ἄλλους, πρὶν Φαραωνίτας, τῇ ῥοῇ τῶν δακρύων σου.
ltx/gr_gr_cog/tr.d050:trMA.Ode3C2T.incipit	Στῆσόν μου τὸν ἄστατον, τῶν…
ltx/gr_gr_cog/tr.d050:trMA.Ode3C2T.melody	@ltx/gr_gr_cog/he.h.m8:heHE.SyEiToStereoma.name
ltx/gr_gr_cog/tr.d050:trMA.Ode3C2T.mode	@ltx/gr_gr_cog/miscellanea:misc.Mode8
ltx/gr_gr_cog/tr.d050:trMA.Ode3C2T.ode	@ltx/gr_gr_cog/miscellanea:misc.Ode3
ltx/gr_gr_cog/tr.d050:trMA.Ode3C2T.text	Στῆσόν μου τὸν ἄστατον, τῶν λογισμῶν ἁγνὴ τάραχον Μῆτερ Θεοῦ, τὴν πρὸς τὸν Υἱόν σου, κατευθύνουσα κίνησιν.
ltx/gr_gr_cog/tr.d050:trMA.Ode3Kathisma1.incipit	Τὸν ἄχραντον Σταυρόν, σου Σωτὴρ…
ltx/gr_gr_cog/tr.d050:trMA.Ode3Kathisma1.melody	Τὸ ξένον τῆς Παρθένου.
ltx/gr_gr_cog/tr.d050:trMA.Ode3Kathisma1.mode	@ltx/gr_gr_cog/miscellanea:misc.Mode5
ltx/gr_gr_cog/tr.d050:trMA.Ode3Kathisma1.text	Τὸν ἄχραντον Σταυρόν, σου Σωτὴρ ἡμῶν ὡς ὅπλον σωτηρίας κατέχοντες, ἐν αὐτῷ σοι βοῶμεν· Σῶσον ἡμᾶς, ὁ παθὼν ἑκουσίως ὑπὲρ ἡμῶν, ὁ πάντων Θεὸς ὡς πολυέλεος.
ltx/gr_gr_cog/tr.d050:trMA.Ode3Kathisma2.greekmelody	@ltx/gr_gr_cog/he.a.m4:heAU.OYpsotheisEnToStavro.greekname
ltx/gr_gr_cog/tr.d050:trMA.Ode3Kathisma2.incipit	Ταῖς ἀρεταῖς πρὸς οὐρανὸν ἀναλάμψας…
ltx/gr_gr_cog/tr.d050:trMA.Ode3Kathisma2.melody	@ltx/gr_gr_cog/he.a.m4:heAU.OYpsotheisEnToStavro.name
ltx/gr_gr_cog/tr.d050:trMA.Ode3Kathisma2.mode	@ltx/gr_gr_cog/miscellanea:misc.Mode4
ltx/gr_gr_cog/tr.d050:trMA.Ode3Kathisma2.text	Ταῖς ἀρεταῖς πρὸς οὐρανὸν ἀναλάμψας, καταπηξάμενος σαφῶς ἐπανῆλθες, πρὸς θεωρίας ἄπλετον βυθὸν εὐσεβῶς, πάσας στηλιτεύσας μέν, τῶν Δαιμόνων ἐνέδρας, σκέπεις ἐκ τῆς λώβης δέ, τοὺς ἀνθρώπους τῆς τούτων, ὦ Ἰωάννη, κλῖμαξ ἀρετῶν· καὶ νῦν πρεσβεύεις σωθῆναι τοὺς δούλους σου.
ltx/gr_gr_cog/tr.d050:trMA.Ode3Kathisma3.greekmelody	@ltx/gr_gr_cog/he.a.m4:heAU.OYpsotheisEnToStavro.greekname
ltx/gr_gr_cog/tr.d050:trMA.Ode3Kathisma3.incipit	Ὁ ἐπὶ θρόνου Χερουβὶμ καθεζόμενος…
ltx/gr_gr_cog/tr.d050:trMA.Ode3Kathisma3.melody	@ltx/gr_gr_cog/he.a.m4:heAU.OYpsotheisEnToStavro.name
ltx/gr_gr_cog/tr.d050:trMA.Ode3Kathisma3.mode	@ltx/gr_gr_cog/miscellanea:misc.Mode4
ltx/gr_gr_cog/tr.d050:trMA.Ode3Kathisma3.text	Ὁ ἐπὶ θρόνου Χερουβὶμ καθεζόμενος, καὶ ἐν τοῖς κόλποις τοῦ πατρὸς αὐλιζόμενος, ὡς ἐπὶ θρόνου κάθηται ἁγίου αὐτοῦ· Δέσποινα ἐν κόλποις σου σαρκικῶς ὁ Θεός γάρ, οὕτω βασιλεύσας τε, ἐπὶ πάντα τὰ ἔθνη, καὶ συνετῶς νῦν ψάλλομεν αὐτῷ, ὃν ἐκδυσώπει σωθῆναι τοὺς δούλους σου.
ltx/gr_gr_cog/tr.d050:trMA.Ode4C11.greekmelody	@ltx/gr_gr_cog/he.h.m5:heHE.AkikoaKyrieTinEkTouTafou.greekname
ltx/gr_gr_cog/tr.d050:trMA.Ode4C11.incipit	Λῃσταί μου ἐσύλησαν, τὴν ἐργασίαν…
ltx/gr_gr_cog/tr.d050:trMA.Ode4C11.melody	@ltx/gr_gr_cog/he.h.m5:heHE.AkikoaKyrieTinEkTouTafou.name
ltx/gr_gr_cog/tr.d050:trMA.Ode4C11.mode	@ltx/gr_gr_cog/miscellanea:misc.Mode5
ltx/gr_gr_cog/tr.d050:trMA.Ode4C11.ode	@ltx/gr_gr_cog/miscellanea:misc.Ode4
ltx/gr_gr_cog/tr.d050:trMA.Ode4C11.text	Λῃσταί μου ἐσύλησαν, τὴν ἐργασίαν τὴν ἔνθεον, καὶ κατέλιπόν με, ταῖς πληγαῖς τιμωρούμενον.
ltx/gr_gr_cog/tr.d050:trMA.Ode4C12.incipit	Ἐξέδυσάν Σῶτέρ με, τῶν ἐντολῶν…
ltx/gr_gr_cog/tr.d050:trMA.Ode4C12.melody	@ltx/gr_gr_cog/he.h.m5:heHE.AkikoaKyrieTinEkTouTafou.name
ltx/gr_gr_cog/tr.d050:trMA.Ode4C12.mode	@ltx/gr_gr_cog/miscellanea:misc.Mode5
ltx/gr_gr_cog/tr.d050:trMA.Ode4C12.ode	@ltx/gr_gr_cog/miscellanea:misc.Ode4
ltx/gr_gr_cog/tr.d050:trMA.Ode4C12.text	Ἐξέδυσάν Σῶτέρ με, τῶν ἐντολῶν σου, οἱ ἄστατοι λογισμοί μου· ὅθεν μεμαστίγωμαι πταίσμασι.
ltx/gr_gr_cog/tr.d050:trMA.Ode4C13.incipit	Λευΐτης τοῖς μώλωψι τραυματισθέντα ὡς…
ltx/gr_gr_cog/tr.d050:trMA.Ode4C13.melody	@ltx/gr_gr_cog/he.h.m5:heHE.AkikoaKyrieTinEkTouTafou.name
ltx/gr_gr_cog/tr.d050:trMA.Ode4C13.mode	@ltx/gr_gr_cog/miscellanea:misc.Mode5
ltx/gr_gr_cog/tr.d050:trMA.Ode4C13.ode	@ltx/gr_gr_cog/miscellanea:misc.Ode4
ltx/gr_gr_cog/tr.d050:trMA.Ode4C13.text	Λευΐτης τοῖς μώλωψι τραυματισθέντα ὡς εἶδέ με παρῆλθε Σωτήρ μου, ἀλλὰ σύ με διάσωσον.
ltx/gr_gr_cog/tr.d050:trMA.Ode4C1T.incipit	Κυρίως δοξάζομεν σὲ Θεοτόκε ἀνύμφευτε…
ltx/gr_gr_cog/tr.d050:trMA.Ode4C1T.melody	@ltx/gr_gr_cog/he.h.m5:heHE.AkikoaKyrieTinEkTouTafou.name
ltx/gr_gr_cog/tr.d050:trMA.Ode4C1T.mode	@ltx/gr_gr_cog/miscellanea:misc.Mode5
ltx/gr_gr_cog/tr.d050:trMA.Ode4C1T.ode	@ltx/gr_gr_cog/miscellanea:misc.Ode4
ltx/gr_gr_cog/tr.d050:trMA.Ode4C1T.text	Κυρίως δοξάζομεν σὲ Θεοτόκε ἀνύμφευτε, καὶ τῷ σῷ λιμένι, οἱ πιστοὶ καταφεύγομεν.
ltx/gr_gr_cog/tr.d050:trMA.Ode4C21.greekmelody	@ltx/gr_gr_cog/he.h.m8:heHE.EisakikoaKyrie.greekname
ltx/gr_gr_cog/tr.d050:trMA.Ode4C21.incipit	Ὡς λειμὼν εὐωδέστατος, καὶ τῶν…
ltx/gr_gr_cog/tr.d050:trMA.Ode4C21.melody	@ltx/gr_gr_cog/he.h.m8:heHE.EisakikoaKyrie.name
ltx/gr_gr_cog/tr.d050:trMA.Ode4C21.mode	@ltx/gr_gr_cog/miscellanea:misc.Mode8
ltx/gr_gr_cog/tr.d050:trMA.Ode4C21.ode	@ltx/gr_gr_cog/miscellanea:misc.Ode4
ltx/gr_gr_cog/tr.d050:trMA.Ode4C21.text	Ὡς λειμὼν εὐωδέστατος, καὶ τῶν ἀρετῶν Παράδεισος ἔμψυχος, τὴν ἐγκράτειαν ἐξήνθησας, δι΄ ἧς πάντας ἔθρεψας τοὺς τιμῶντάς σε.
ltx/gr_gr_cog/tr.d050:trMA.Ode4C22.incipit	Νομοθέτην ἀσκήσεως, καὶ τῶν μοναστῶν…
ltx/gr_gr_cog/tr.d050:trMA.Ode4C22.melody	@ltx/gr_gr_cog/he.h.m8:heHE.EisakikoaKyrie.name
ltx/gr_gr_cog/tr.d050:trMA.Ode4C22.mode	@ltx/gr_gr_cog/miscellanea:misc.Mode8
ltx/gr_gr_cog/tr.d050:trMA.Ode4C22.ode	@ltx/gr_gr_cog/miscellanea:misc.Ode4
ltx/gr_gr_cog/tr.d050:trMA.Ode4C22.text	Νομοθέτην ἀσκήσεως, καὶ τῶν μοναστῶν κανόνα πραότατον, ὡς Μωσῆν σε καὶ Δαυῒδ ἀληθῶς, κεκτημένοι Πάτερ μακαρίζομεν.
ltx/gr_gr_cog/tr.d050:trMA.Ode4C23.incipit	Φυτευθεὶς ἐν τοῖς ὕδασι, τοῖς…
ltx/gr_gr_cog/tr.d050:trMA.Ode4C23.melody	@ltx/gr_gr_cog/he.h.m8:heHE.EisakikoaKyrie.name
ltx/gr_gr_cog/tr.d050:trMA.Ode4C23.mode	@ltx/gr_gr_cog/miscellanea:misc.Mode8
ltx/gr_gr_cog/tr.d050:trMA.Ode4C23.ode	@ltx/gr_gr_cog/miscellanea:misc.Ode4
ltx/gr_gr_cog/tr.d050:trMA.Ode4C23.text	Φυτευθεὶς ἐν τοῖς ὕδασι, τοῖς τῆς ἐγκρατείας, ὤφθης μακάριε, κλῆμα Πάτερ εὐθαλέστατον εὐσεβείας βότρυας προβαλλόμενον.
ltx/gr_gr_cog/tr.d050:trMA.Ode4C2T.incipit	Ὑπὸ χρόνον γενόμενον, τὸν ἐκ…
ltx/gr_gr_cog/tr.d050:trMA.Ode4C2T.melody	@ltx/gr_gr_cog/he.h.m8:heHE.EisakikoaKyrie.name
ltx/gr_gr_cog/tr.d050:trMA.Ode4C2T.mode	@ltx/gr_gr_cog/miscellanea:misc.Mode8
ltx/gr_gr_cog/tr.d050:trMA.Ode4C2T.ode	@ltx/gr_gr_cog/miscellanea:misc.Ode4
ltx/gr_gr_cog/tr.d050:trMA.Ode4C2T.text	Ὑπὸ χρόνον γενόμενον, τὸν ἐκ τοῦ Πατρὸς ἀχρόνως ἐκλάψαντα Θεομῆτορ ἡμῖν τέτοκας, ὃν δυσώπει σῶσαι τοὺς ὑμνοῦντάς σε.
ltx/gr_gr_cog/tr.d050:trMA.Ode5C11.greekmelody	@ltx/gr_gr_cog/he.h.m5:heHE.EkNyktosOrthrizontes.greekname
ltx/gr_gr_cog/tr.d050:trMA.Ode5C11.incipit	Ἰησοῦ ἐπίσκεψαι, τοὺς μώλωπας ψυχῆς…
ltx/gr_gr_cog/tr.d050:trMA.Ode5C11.melody	@ltx/gr_gr_cog/he.h.m5:heHE.EkNyktosOrthrizontes.name
ltx/gr_gr_cog/tr.d050:trMA.Ode5C11.mode	@ltx/gr_gr_cog/miscellanea:misc.Mode5
ltx/gr_gr_cog/tr.d050:trMA.Ode5C11.ode	@ltx/gr_gr_cog/miscellanea:misc.Ode5
ltx/gr_gr_cog/tr.d050:trMA.Ode5C11.text	Ἰησοῦ ἐπίσκεψαι, τοὺς μώλωπας ψυχῆς τῆς ἐμῆς, καθάπερ πάλαι, τὸν ἐν χερσὶ πεσόντα λῃστῶν, καὶ ἰάτρευσόν μου, Χριστέ, τὸ ἄλγος δέομαι.
ltx/gr_gr_cog/tr.d050:trMA.Ode5C12.incipit	Ἀλγεινῶς ταῖς μάστιξιν, ἠσθένησε ψυχή…
ltx/gr_gr_cog/tr.d050:trMA.Ode5C12.melody	@ltx/gr_gr_cog/he.h.m5:heHE.EkNyktosOrthrizontes.name
ltx/gr_gr_cog/tr.d050:trMA.Ode5C12.mode	@ltx/gr_gr_cog/miscellanea:misc.Mode5
ltx/gr_gr_cog/tr.d050:trMA.Ode5C12.ode	@ltx/gr_gr_cog/miscellanea:misc.Ode5
ltx/gr_gr_cog/tr.d050:trMA.Ode5C12.text	Ἀλγεινῶς ταῖς μάστιξιν, ἠσθένησε ψυχή μου Χριστὲ ταῖς τῶν πταισμάτων, καὶ ἔνθεν γυμνὸς περίκειμαι, ἀρετῶν ἐνθέων, καθικετεύω, Σῶσόν με.
ltx/gr_gr_cog/tr.d050:trMA.Ode5C13.incipit	Ἱερεὺς ὡς εἶδέ με, καὶ…
ltx/gr_gr_cog/tr.d050:trMA.Ode5C13.melody	@ltx/gr_gr_cog/he.h.m5:heHE.EkNyktosOrthrizontes.name
ltx/gr_gr_cog/tr.d050:trMA.Ode5C13.mode	@ltx/gr_gr_cog/miscellanea:misc.Mode5
ltx/gr_gr_cog/tr.d050:trMA.Ode5C13.ode	@ltx/gr_gr_cog/miscellanea:misc.Ode5
ltx/gr_gr_cog/tr.d050:trMA.Ode5C13.text	Ἱερεὺς ὡς εἶδέ με, καὶ Λευΐτης οὐκ ἴσχυσε σαφῶς· παρῆλθον γάρ με, ἀλλʹ αὐτὸς ὡς εὔσπλαγχνος, νῦν τὴν σωτηρίαν, παρέσχες καὶ διέσωσας.
ltx/gr_gr_cog/tr.d050:trMA.Ode5C1T.incipit	Μὴ παρίδῃς Δέσποτα, τὸν δείλαιον…
ltx/gr_gr_cog/tr.d050:trMA.Ode5C1T.melody	@ltx/gr_gr_cog/he.h.m5:heHE.EkNyktosOrthrizontes.name
ltx/gr_gr_cog/tr.d050:trMA.Ode5C1T.mode	@ltx/gr_gr_cog/miscellanea:misc.Mode5
ltx/gr_gr_cog/tr.d050:trMA.Ode5C1T.ode	@ltx/gr_gr_cog/miscellanea:misc.Ode5
ltx/gr_gr_cog/tr.d050:trMA.Ode5C1T.text	Μὴ παρίδῃς Δέσποτα, τὸν δείλαιον ἐμὲ δυσωπῶ τὸν μαστιχθέντα τὸν νοῦν ἀλγεινῶς ὑπὸ λῃστῶν, ἀλλʹ οἰκτείρησον πρεσβείαις Σωτὴρ τῆς κυησάσης σε.
ltx/gr_gr_cog/tr.d050:trMA.Ode5C21.greekmelody	@ltx/gr_gr_cog/he.h.m8:heHE.InaTiMeAposo.greekname
ltx/gr_gr_cog/tr.d050:trMA.Ode5C21.incipit	Σβέσας πάντα τὰ πάθη δρόσῳ…
ltx/gr_gr_cog/tr.d050:trMA.Ode5C21.melody	@ltx/gr_gr_cog/he.h.m8:heHE.InaTiMeAposo.name
ltx/gr_gr_cog/tr.d050:trMA.Ode5C21.mode	@ltx/gr_gr_cog/miscellanea:misc.Mode8
ltx/gr_gr_cog/tr.d050:trMA.Ode5C21.ode	@ltx/gr_gr_cog/miscellanea:misc.Ode5
ltx/gr_gr_cog/tr.d050:trMA.Ode5C21.text	Σβέσας πάντα τὰ πάθη δρόσῳ τῶν ἀγώνων σου, Πάτερ μακάριε, δαψιλῶς ἀνῆψας, τῷ πυρὶ τῆς ἀγάπης καὶ πίστεως, ἐγκρατείας λύχνον, καὶ φωτισμὸς τῆς ἀπαθείας, καὶ ἡμέρας υἱὸς ἐχρημάτισας.
ltx/gr_gr_cog/tr.d050:trMA.Ode5C22.incipit	Τὸν τῆς πίστεως βότρυν, θείᾳ…
ltx/gr_gr_cog/tr.d050:trMA.Ode5C22.melody	@ltx/gr_gr_cog/he.h.m8:heHE.InaTiMeAposo.name
ltx/gr_gr_cog/tr.d050:trMA.Ode5C22.mode	@ltx/gr_gr_cog/miscellanea:misc.Mode8
ltx/gr_gr_cog/tr.d050:trMA.Ode5C22.ode	@ltx/gr_gr_cog/miscellanea:misc.Ode5
ltx/gr_gr_cog/tr.d050:trMA.Ode5C22.text	Τὸν τῆς πίστεως βότρυν, θείᾳ γεωργίᾳ σου, Πάτερ ἐξέθρεψας, καὶ ληνοῖς ἀπέθου, καὶ ἐξέθλιψας πόνοις ἀσκήσεως, καὶ κρατῆρα πλήσας, πνευματικόν τῆς ἐγκρατείας, κατευφραίνεις καρδίας τῆς ποίμνης σου.
ltx/gr_gr_cog/tr.d050:trMA.Ode5C23.incipit	Ὑπομείνας γενναίως, προσβολὰς καὶ στίγματα…
ltx/gr_gr_cog/tr.d050:trMA.Ode5C23.melody	@ltx/gr_gr_cog/he.h.m8:heHE.InaTiMeAposo.name
ltx/gr_gr_cog/tr.d050:trMA.Ode5C23.mode	@ltx/gr_gr_cog/miscellanea:misc.Mode8
ltx/gr_gr_cog/tr.d050:trMA.Ode5C23.ode	@ltx/gr_gr_cog/miscellanea:misc.Ode5
ltx/gr_gr_cog/tr.d050:trMA.Ode5C23.text	Ὑπομείνας γενναίως, προσβολὰς καὶ στίγματα, τῶν ἐναντίων ἐχθρῶν, ἀνεδείχθης στῦλος, καρτερίας στηρίζων τὴν ποίμνην σου, βακτηρίᾳ θείᾳ, ἐπὶ νομὰς τῆς ἐγκρατείας, καὶ ἐφ΄ ὕδωρ ἐκτρέφων Μακάριε.
ltx/gr_gr_cog/tr.d050:trMA.Ode5C2T.incipit	Ῥήσεσι σῶν χειλέων, Πάναγνε ἑπόμενοι…
ltx/gr_gr_cog/tr.d050:trMA.Ode5C2T.melody	@ltx/gr_gr_cog/he.h.m8:heHE.InaTiMeAposo.name
ltx/gr_gr_cog/tr.d050:trMA.Ode5C2T.mode	@ltx/gr_gr_cog/miscellanea:misc.Mode8
ltx/gr_gr_cog/tr.d050:trMA.Ode5C2T.ode	@ltx/gr_gr_cog/miscellanea:misc.Ode5
ltx/gr_gr_cog/tr.d050:trMA.Ode5C2T.text	Ῥήσεσι σῶν χειλέων, Πάναγνε ἑπόμενοι, σὲ μακαρίζομεν· μετὰ σοῦ γὰρ ὄντως, μεγαλεῖα ποιήσας ὁ Κύριος, ἐμεγάλυνέ σε, καὶ ἀληθῆ Θεοῦ Μητέρα, γεννηθεὶς ἐκ γαστρός σου ἀνέδειξεν.
ltx/gr_gr_cog/tr.d050:trMA.Ode6C11.greekmelody	@ltx/gr_gr_cog/he.h.m5:heHE.EkykloseMeAvyssos.greekname
ltx/gr_gr_cog/tr.d050:trMA.Ode6C11.incipit	Τοῖς πάθεσιν ἠνάλωσα, τὸν βίον…
ltx/gr_gr_cog/tr.d050:trMA.Ode6C11.melody	@ltx/gr_gr_cog/he.h.m5:heHE.EkykloseMeAvyssos.name
ltx/gr_gr_cog/tr.d050:trMA.Ode6C11.mode	@ltx/gr_gr_cog/miscellanea:misc.Mode5
ltx/gr_gr_cog/tr.d050:trMA.Ode6C11.ode	@ltx/gr_gr_cog/miscellanea:misc.Ode6
ltx/gr_gr_cog/tr.d050:trMA.Ode6C11.text	Τοῖς πάθεσιν ἠνάλωσα, τὸν βίον τὸν ἔνθεον Δέσποτα, καὶ ὅλως τοῖς πταίσμασι, δεινῶς μαστιζόμενος, κατέφυγόν σοι, οἰκτείρησόν με δέομαι.
ltx/gr_gr_cog/tr.d050:trMA.Ode6C12.incipit	Ἀφήρπασαν τὸν πλοῦτόν μου, καὶ…
ltx/gr_gr_cog/tr.d050:trMA.Ode6C12.melody	@ltx/gr_gr_cog/he.h.m5:heHE.EkykloseMeAvyssos.name
ltx/gr_gr_cog/tr.d050:trMA.Ode6C12.mode	@ltx/gr_gr_cog/miscellanea:misc.Mode5
ltx/gr_gr_cog/tr.d050:trMA.Ode6C12.ode	@ltx/gr_gr_cog/miscellanea:misc.Ode6
ltx/gr_gr_cog/tr.d050:trMA.Ode6C12.text	Ἀφήρπασαν τὸν πλοῦτόν μου, καὶ ὥσπερ νεκρόν με κατέλιπον, λῃσταὶ τοῖς παθήμασι, τὸν νοῦν μου μαστίξαντες, ἀλλʹ οἰκτειρήσας, διάσωσόν με Κύριε.
ltx/gr_gr_cog/tr.d050:trMA.Ode6C13.incipit	Ὡς εἶδεν ὁ Λευΐτης μου…
ltx/gr_gr_cog/tr.d050:trMA.Ode6C13.melody	@ltx/gr_gr_cog/he.h.m5:heHE.EkykloseMeAvyssos.name
ltx/gr_gr_cog/tr.d050:trMA.Ode6C13.mode	@ltx/gr_gr_cog/miscellanea:misc.Mode5
ltx/gr_gr_cog/tr.d050:trMA.Ode6C13.ode	@ltx/gr_gr_cog/miscellanea:misc.Ode6
ltx/gr_gr_cog/tr.d050:trMA.Ode6C13.text	Ὡς εἶδεν ὁ Λευΐτης μου, μαστίγων τὸ ἄλγος, τοὺς μώλωπας μὴ φέρων παρῆλθέ με, αὐτὸς δὲ Φιλάνθρωπε, κατέχεάς μοι, το πλούσιόν σου ἔλεος.
ltx/gr_gr_cog/tr.d050:trMA.Ode6C1T.incipit	Βάτον σε ἀκατάφλεκτον, καὶ ὄρος…
ltx/gr_gr_cog/tr.d050:trMA.Ode6C1T.melody	@ltx/gr_gr_cog/he.h.m5:heHE.EkykloseMeAvyssos.name
ltx/gr_gr_cog/tr.d050:trMA.Ode6C1T.mode	@ltx/gr_gr_cog/miscellanea:misc.Mode5
ltx/gr_gr_cog/tr.d050:trMA.Ode6C1T.ode	@ltx/gr_gr_cog/miscellanea:misc.Ode6
ltx/gr_gr_cog/tr.d050:trMA.Ode6C1T.text	Βάτον σε ἀκατάφλεκτον, καὶ ὄρος καὶ κλίμακα ἔμψυχον, καὶ πύλην οὐράνιον, ἀξίως δοξάζομεν, Μαρία ἔνδοξε, Ὀρθοδόξων καύχημα.
ltx/gr_gr_cog/tr.d050:trMA.Ode6C21.greekmelody	@ltx/gr_gr_cog/he.h.m8:heHE.IlasthitiMoiSotir.greekname
ltx/gr_gr_cog/tr.d050:trMA.Ode6C21.incipit	Ἐδέξω ἐν τῇ ψυχῇ, τὸν…
ltx/gr_gr_cog/tr.d050:trMA.Ode6C21.melody	@ltx/gr_gr_cog/he.h.m8:heHE.IlasthitiMoiSotir.name
ltx/gr_gr_cog/tr.d050:trMA.Ode6C21.mode	@ltx/gr_gr_cog/miscellanea:misc.Mode8
ltx/gr_gr_cog/tr.d050:trMA.Ode6C21.ode	@ltx/gr_gr_cog/miscellanea:misc.Ode6
ltx/gr_gr_cog/tr.d050:trMA.Ode6C21.text	Ἐδέξω ἐν τῇ ψυχῇ, τὸν θεῖον πλοῦτον τοῦ Πνεύματος, τὴν ἄμεμπτον προσευχήν, ἁγνείαν σεμνότητα, ἀγρυπνίαν σύντονον, ἐγκρατείας πόνους, δι ὧν οἶκος ἐγνωρίσθης Θεοῦ.
ltx/gr_gr_cog/tr.d050:trMA.Ode6C22.incipit	Ὕλης τῆς κάτω Σοφὲ παρέδραμες…
ltx/gr_gr_cog/tr.d050:trMA.Ode6C22.melody	@ltx/gr_gr_cog/he.h.m8:heHE.IlasthitiMoiSotir.name
ltx/gr_gr_cog/tr.d050:trMA.Ode6C22.mode	@ltx/gr_gr_cog/miscellanea:misc.Mode8
ltx/gr_gr_cog/tr.d050:trMA.Ode6C22.ode	@ltx/gr_gr_cog/miscellanea:misc.Ode6
ltx/gr_gr_cog/tr.d050:trMA.Ode6C22.text	Ὕλης τῆς κάτω Σοφὲ παρέδραμες τὴν εὐτέλειαν, ἀΰλῳ δὲ προσευχῇ τὸν νοῦν ἀνεπτέρωσας, καὶ τῆς ἄνω λήξεως, ὤφθης κληρονόμος, διὰ βίου τελειότητα.
ltx/gr_gr_cog/tr.d050:trMA.Ode6C23.incipit	Ἱδρῶσιν ἀσκητικοῖς, τοὺς ἄνθρακας τῶν…
ltx/gr_gr_cog/tr.d050:trMA.Ode6C23.melody	@ltx/gr_gr_cog/he.h.m8:heHE.IlasthitiMoiSotir.name
ltx/gr_gr_cog/tr.d050:trMA.Ode6C23.mode	@ltx/gr_gr_cog/miscellanea:misc.Mode8
ltx/gr_gr_cog/tr.d050:trMA.Ode6C23.ode	@ltx/gr_gr_cog/miscellanea:misc.Ode6
ltx/gr_gr_cog/tr.d050:trMA.Ode6C23.text	Ἱδρῶσιν ἀσκητικοῖς, τοὺς ἄνθρακας τῶν βελῶν τοῦ ἐχθροῦ, κατέσβεσας ἀληθῶς, καὶ τὸ πῦρ τῆς πίστεως, ἐκλάμψας κατέφλεξας, τὰ τῆς ἀπιστίας, τῶν αἱρέσεων φρυάγματα.
ltx/gr_gr_cog/tr.d050:trMA.Ode6C2T.incipit	Ἐξέλαμψεν ἐκ Σιών, ἡ τοῦ…
ltx/gr_gr_cog/tr.d050:trMA.Ode6C2T.melody	@ltx/gr_gr_cog/he.h.m8:heHE.IlasthitiMoiSotir.name
ltx/gr_gr_cog/tr.d050:trMA.Ode6C2T.mode	@ltx/gr_gr_cog/miscellanea:misc.Mode8
ltx/gr_gr_cog/tr.d050:trMA.Ode6C2T.ode	@ltx/gr_gr_cog/miscellanea:misc.Ode6
ltx/gr_gr_cog/tr.d050:trMA.Ode6C2T.text	Ἐξέλαμψεν ἐκ Σιών, ἡ τοῦ Ὑψίστου εὐπρέπεια, τὸ πρόβλημα τῆς σαρκός, καθ΄ ἕνωσιν ἄῤῥητον, ἐκ σοῦ Ἀπειρόγαμε, περιβεβλημένη, καὶ τὸν Κόσμον κατεφώτισε.
ltx/gr_gr_cog/tr.d050:trMA.Ode7C11.greekmelody	@ltx/gr_gr_cog/he.h.m5:heHE.OYperypsoumenos.greekname
ltx/gr_gr_cog/tr.d050:trMA.Ode7C11.incipit	Λῃσταὶ περιέπεσαν ἐπʼ ἐμὲ τὸν…
ltx/gr_gr_cog/tr.d050:trMA.Ode7C11.melody	@ltx/gr_gr_cog/he.h.m5:heHE.OYperypsoumenos.name
ltx/gr_gr_cog/tr.d050:trMA.Ode7C11.mode	@ltx/gr_gr_cog/miscellanea:misc.Mode5
ltx/gr_gr_cog/tr.d050:trMA.Ode7C11.ode	@ltx/gr_gr_cog/miscellanea:misc.Ode7
ltx/gr_gr_cog/tr.d050:trMA.Ode7C11.text	Λῃσταὶ περιέπεσαν ἐπʼ ἐμὲ τὸν δείλαιον, καὶ μάστιξιν ἔλιπον νεκρὸν ὥσπερ ἄπνουν με· διό σε ἱκετεύω, ὁ Θεὸς ἐπίσκεψαί με.
ltx/gr_gr_cog/tr.d050:trMA.Ode7C12.incipit	Τὸν νοῦν μου ἐσύλησαν λογισμοὶ…
ltx/gr_gr_cog/tr.d050:trMA.Ode7C12.melody	@ltx/gr_gr_cog/he.h.m5:heHE.OYperypsoumenos.name
ltx/gr_gr_cog/tr.d050:trMA.Ode7C12.mode	@ltx/gr_gr_cog/miscellanea:misc.Mode5
ltx/gr_gr_cog/tr.d050:trMA.Ode7C12.ode	@ltx/gr_gr_cog/miscellanea:misc.Ode7
ltx/gr_gr_cog/tr.d050:trMA.Ode7C12.text	Τὸν νοῦν μου ἐσύλησαν λογισμοὶ οἱ ἄστατοι καὶ πλήξαντες πάθεσι, νεκρόν με ἔλιπον, τῷ πλήθει τῶν πταισμάτων, ἀλλὰ Σῶτερ ἴασαί με.
ltx/gr_gr_cog/tr.d050:trMA.Ode7C13.incipit	Ὡς εἶδε Λευΐτης με, ταῖς…
ltx/gr_gr_cog/tr.d050:trMA.Ode7C13.melody	@ltx/gr_gr_cog/he.h.m5:heHE.OYperypsoumenos.name
ltx/gr_gr_cog/tr.d050:trMA.Ode7C13.mode	@ltx/gr_gr_cog/miscellanea:misc.Mode5
ltx/gr_gr_cog/tr.d050:trMA.Ode7C13.ode	@ltx/gr_gr_cog/miscellanea:misc.Ode7
ltx/gr_gr_cog/tr.d050:trMA.Ode7C13.text	Ὡς εἶδε Λευΐτης με, ταῖς πληγαῖς ὀδυνώμενον, μὴ φέρων τοὺς μώλωπας, διὰ τὸ ἀνίατον παρῆλθέ με Σωτήρ μου, ἀλλʹ αὐτὸς ἰάτρευσόν με.
ltx/gr_gr_cog/tr.d050:trMA.Ode7C1T.incipit	Σὺ ὁ ἐκ Παρθένου με…
ltx/gr_gr_cog/tr.d050:trMA.Ode7C1T.melody	@ltx/gr_gr_cog/he.h.m5:heHE.OYperypsoumenos.name
ltx/gr_gr_cog/tr.d050:trMA.Ode7C1T.mode	@ltx/gr_gr_cog/miscellanea:misc.Mode5
ltx/gr_gr_cog/tr.d050:trMA.Ode7C1T.ode	@ltx/gr_gr_cog/miscellanea:misc.Ode7
ltx/gr_gr_cog/tr.d050:trMA.Ode7C1T.text	Σὺ ὁ ἐκ Παρθένου με σαρκωθεὶς διέσωσας, τοῖς μώλωψι χέας μου, τὸ πλούσιον ἔλεος Χριστὲ τῶν οἰκτιρμῶν σου, διὰ τοῦτό σε δοξάζω.
ltx/gr_gr_cog/tr.d050:trMA.Ode7C21.greekmelody	@ltx/gr_gr_cog/he.h.m8:heHE.OiEkTisIoudaias.greekname
ltx/gr_gr_cog/tr.d050:trMA.Ode7C21.incipit	Ἐν τῇ χλόῃ τῆς ἄνω…
ltx/gr_gr_cog/tr.d050:trMA.Ode7C21.melody	@ltx/gr_gr_cog/he.h.m8:heHE.OiEkTisIoudaias.name
ltx/gr_gr_cog/tr.d050:trMA.Ode7C21.mode	@ltx/gr_gr_cog/miscellanea:misc.Mode8
ltx/gr_gr_cog/tr.d050:trMA.Ode7C21.ode	@ltx/gr_gr_cog/miscellanea:misc.Ode7
ltx/gr_gr_cog/tr.d050:trMA.Ode7C21.text	Ἐν τῇ χλόῃ τῆς ἄνω, βασιλείας, τὴν ποίμνην Πάτερ ἐξέθρεψας καὶ ῥάβδῳ τῶν δογμάτων, τοὺς θῆρας ἀπελάσας, τῶν αἱρέσεων ἔψαλλες· ὁ τῶν Πατέρων ἡμῶν, Θεὸς εὐλογητός εἶ.
ltx/gr_gr_cog/tr.d050:trMA.Ode7C22.incipit	Ἐν τῇ ἄνω εἰσῆλθες, νυμφικῇ…
ltx/gr_gr_cog/tr.d050:trMA.Ode7C22.melody	@ltx/gr_gr_cog/he.h.m8:heHE.OiEkTisIoudaias.name
ltx/gr_gr_cog/tr.d050:trMA.Ode7C22.mode	@ltx/gr_gr_cog/miscellanea:misc.Mode8
ltx/gr_gr_cog/tr.d050:trMA.Ode7C22.ode	@ltx/gr_gr_cog/miscellanea:misc.Ode7
ltx/gr_gr_cog/tr.d050:trMA.Ode7C22.text	Ἐν τῇ ἄνω εἰσῆλθες, νυμφικῇ εὐωχίᾳ, τοῦ Βασιλέως Χριστοῦ, στολὴν ἐνδεδυμένος ἀξίαν τοῦ καλοῦντος, ἐν ᾧ καὶ ἀνεκλίθης βοῶν· ὁ τῶν Πατέρων ἡμῶν Θεὸς εὐλογητός εἶ.
ltx/gr_gr_cog/tr.d050:trMA.Ode7C23.incipit	Μὴ βραχεὶς ἁμαρτίαις, ποταμὸς ἀνεδείχθης…
ltx/gr_gr_cog/tr.d050:trMA.Ode7C23.melody	@ltx/gr_gr_cog/he.h.m8:heHE.OiEkTisIoudaias.name
ltx/gr_gr_cog/tr.d050:trMA.Ode7C23.mode	@ltx/gr_gr_cog/miscellanea:misc.Mode8
ltx/gr_gr_cog/tr.d050:trMA.Ode7C23.ode	@ltx/gr_gr_cog/miscellanea:misc.Ode7
ltx/gr_gr_cog/tr.d050:trMA.Ode7C23.text	Μὴ βραχεὶς ἁμαρτίαις, ποταμὸς ἀνεδείχθης, τῆς ἐγκρατείας Πάτερ λογισμοὺς κατακλύζων, καὶ ῥύπον ἐκκαθαίρων, τῶν βοώντων ἐκ πίστεως· ὁ τῶν Πατέρων ἡμῶν, Θεὸς εὐλογητὸς εἶ.
ltx/gr_gr_cog/tr.d050:trMA.Ode7C2T.incipit	Ἐκ γαστρός σου προῆλθε, σαρκωθεὶς…
ltx/gr_gr_cog/tr.d050:trMA.Ode7C2T.melody	@ltx/gr_gr_cog/he.h.m8:heHE.OiEkTisIoudaias.name
ltx/gr_gr_cog/tr.d050:trMA.Ode7C2T.mode	@ltx/gr_gr_cog/miscellanea:misc.Mode8
ltx/gr_gr_cog/tr.d050:trMA.Ode7C2T.ode	@ltx/gr_gr_cog/miscellanea:misc.Ode7
ltx/gr_gr_cog/tr.d050:trMA.Ode7C2T.text	Ἐκ γαστρός σου προῆλθε, σαρκωθεὶς ἐκ Παρθένου τῶν ὅλων Κύριος· διό σε Θεοτόκον, φρονοῦντες ὀρθοδόξως, τῷ Υἱῷ σου κραυγάζομεν· ὁ τῶν Πατέρων ἡμῶν, Θεὸς εὐλογητός εἶ.
ltx/gr_gr_cog/tr.d050:trMA.Ode8C11.greekmelody	@ltx/gr_gr_cog/he.h.m5:heHE.SoiToPantourgo.greekname
ltx/gr_gr_cog/tr.d050:trMA.Ode8C11.incipit	Ὑπὸ τῶν λῃστῶν τῶν λογισμῶν…
ltx/gr_gr_cog/tr.d050:trMA.Ode8C11.melody	@ltx/gr_gr_cog/he.h.m5:heHE.SoiToPantourgo.name
ltx/gr_gr_cog/tr.d050:trMA.Ode8C11.mode	@ltx/gr_gr_cog/miscellanea:misc.Mode5
ltx/gr_gr_cog/tr.d050:trMA.Ode8C11.ode	@ltx/gr_gr_cog/miscellanea:misc.Ode8
ltx/gr_gr_cog/tr.d050:trMA.Ode8C11.text	Ὑπὸ τῶν λῃστῶν τῶν λογισμῶν μου Σῶτερ διέφθειρα βίον μου πταισμάτων μάστιξιν· ὅθεν τῆς θείας γεγύμνωμαι εἰκόνος σοῦ τοῦ φιλανθρώπου Θεοῦ ἀλλʹ οἴκτειρόν με.
ltx/gr_gr_cog/tr.d050:trMA.Ode8C12.incipit	Ἦλθες ἐπὶ γῆς, ἐκ τῶν…
ltx/gr_gr_cog/tr.d050:trMA.Ode8C12.melody	@ltx/gr_gr_cog/he.h.m5:heHE.SoiToPantourgo.name
ltx/gr_gr_cog/tr.d050:trMA.Ode8C12.mode	@ltx/gr_gr_cog/miscellanea:misc.Mode5
ltx/gr_gr_cog/tr.d050:trMA.Ode8C12.ode	@ltx/gr_gr_cog/miscellanea:misc.Ode8
ltx/gr_gr_cog/tr.d050:trMA.Ode8C12.text	Ἦλθες ἐπὶ γῆς, ἐκ τῶν ὑψίστων Σῶτερ, οἰκτείρας τὸν μάστιξι, τραυματισθέντα με, ὅλον πταισμάτων τοῖς μώλωψιν οἰκτίρμον, καὶ ἐξέχεάς μοι, Χριστὲ τὸ ἔλεός σου.
ltx/gr_gr_cog/tr.d050:trMA.Ode8C13.incipit	Σῶμα καὶ ψυχήν, σὺ ὁ…
ltx/gr_gr_cog/tr.d050:trMA.Ode8C13.melody	@ltx/gr_gr_cog/he.h.m5:heHE.SoiToPantourgo.name
ltx/gr_gr_cog/tr.d050:trMA.Ode8C13.mode	@ltx/gr_gr_cog/miscellanea:misc.Mode5
ltx/gr_gr_cog/tr.d050:trMA.Ode8C13.ode	@ltx/gr_gr_cog/miscellanea:misc.Ode8
ltx/gr_gr_cog/tr.d050:trMA.Ode8C13.text	Σῶμα καὶ ψυχήν, σὺ ὁ Δεσπότης Σῶτερ, ἀντίλυτρον δέδωκας ἐμοῦ καὶ ἔσωσας, ὅλου πταισμάτων, ἑσμῷ τραυματισθέντος, ἐν ταῖς ἀνιάτοις, πληγαῖς ὡς ἐλεήμων.
ltx/gr_gr_cog/tr.d050:trMA.Ode8C1T.incipit	Σὲ τὴν ὑπὲρ νοῦν, θεανδρικῷ…
ltx/gr_gr_cog/tr.d050:trMA.Ode8C1T.melody	@ltx/gr_gr_cog/he.h.m5:heHE.SoiToPantourgo.name
ltx/gr_gr_cog/tr.d050:trMA.Ode8C1T.mode	@ltx/gr_gr_cog/miscellanea:misc.Mode5
ltx/gr_gr_cog/tr.d050:trMA.Ode8C1T.ode	@ltx/gr_gr_cog/miscellanea:misc.Ode8
ltx/gr_gr_cog/tr.d050:trMA.Ode8C1T.text	Σὲ τὴν ὑπὲρ νοῦν, θεανδρικῷ τῷ λόγῳ, τεκοῦσαν τὸν Κύριον, καὶ παρθενεύουσαν, πάντα τὰ ἔργα, Παρθένε εὐλογοῦμεν, καὶ ὑπερυψοῦμεν, εἰς πάντας τοὺς αἰῶνας.
ltx/gr_gr_cog/tr.d050:trMA.Ode8C21.greekmelody	@ltx/gr_gr_cog/he.h.m8:heHE.TonVasileaTonOuranon.greekname
ltx/gr_gr_cog/tr.d050:trMA.Ode8C21.incipit	Στήλην σε ἔμπνουν ὡς ἀληθῶς…
ltx/gr_gr_cog/tr.d050:trMA.Ode8C21.melody	@ltx/gr_gr_cog/he.h.m8:heHE.TonVasileaTonOuranon.name
ltx/gr_gr_cog/tr.d050:trMA.Ode8C21.mode	@ltx/gr_gr_cog/miscellanea:misc.Mode8
ltx/gr_gr_cog/tr.d050:trMA.Ode8C21.ode	@ltx/gr_gr_cog/miscellanea:misc.Ode8
ltx/gr_gr_cog/tr.d050:trMA.Ode8C21.text	Στήλην σε ἔμπνουν ὡς ἀληθῶς καὶ εἰκόνα ἐγκρατείας Πάτερ κεκτημένοι πάντες σου τὴν μνήμην τιμῶμεν Ἰωάννη.
ltx/gr_gr_cog/tr.d050:trMA.Ode8C22.incipit	Θίασος χαίρει τῶν Μοναστῶν, καὶ…
ltx/gr_gr_cog/tr.d050:trMA.Ode8C22.melody	@ltx/gr_gr_cog/he.h.m8:heHE.TonVasileaTonOuranon.name
ltx/gr_gr_cog/tr.d050:trMA.Ode8C22.mode	@ltx/gr_gr_cog/miscellanea:misc.Mode8
ltx/gr_gr_cog/tr.d050:trMA.Ode8C22.ode	@ltx/gr_gr_cog/miscellanea:misc.Ode8
ltx/gr_gr_cog/tr.d050:trMA.Ode8C22.text	Θίασος χαίρει τῶν Μοναστῶν, καὶ χορεύει, τῶν Ὁσίων δῆμος καὶ Δικαίων· στέφος γὰρ ἀξίως, σὺν τούτοις ἐκομίσω.
ltx/gr_gr_cog/tr.d050:trMA.Ode8C23.incipit	Ὡραϊσμένος ταῖς ἀρεταῖς εἰς νυμφῶνα…
ltx/gr_gr_cog/tr.d050:trMA.Ode8C23.melody	@ltx/gr_gr_cog/he.h.m8:heHE.TonVasileaTonOuranon.name
ltx/gr_gr_cog/tr.d050:trMA.Ode8C23.mode	@ltx/gr_gr_cog/miscellanea:misc.Mode8
ltx/gr_gr_cog/tr.d050:trMA.Ode8C23.ode	@ltx/gr_gr_cog/miscellanea:misc.Ode8
ltx/gr_gr_cog/tr.d050:trMA.Ode8C23.text	Ὡραϊσμένος ταῖς ἀρεταῖς εἰς νυμφῶνα τῆς ἀῤῥήτου δόξης συνεισῆλθες, ὕμνον ἀναμέλπων, Χριστῷ εἰς τοὺς αἰῶνας.
ltx/gr_gr_cog/tr.d050:trMA.Ode8C2T.incipit	Τοὺς βοηθείας τῆς παρὰ σοῦ…
ltx/gr_gr_cog/tr.d050:trMA.Ode8C2T.melody	@ltx/gr_gr_cog/he.h.m8:heHE.TonVasileaTonOuranon.name
ltx/gr_gr_cog/tr.d050:trMA.Ode8C2T.mode	@ltx/gr_gr_cog/miscellanea:misc.Mode8
ltx/gr_gr_cog/tr.d050:trMA.Ode8C2T.ode	@ltx/gr_gr_cog/miscellanea:misc.Ode8
ltx/gr_gr_cog/tr.d050:trMA.Ode8C2T.text	Τοὺς βοηθείας τῆς παρὰ σοῦ δεομένους μὴ παρίδῃς Παρθένε ὑμνοῦντας καὶ ὑπερυψοῦντάς σε Κόρη εἰς αἰῶνας.
ltx/gr_gr_cog/tr.d050:trMA.Ode9C11.greekmelody	@ltx/gr_gr_cog/he.h.m5:heHE.IsaiaChoreve.greekname
ltx/gr_gr_cog/tr.d050:trMA.Ode9C11.incipit	Ἐντολάς σου Δέσποτα μὴ φυλάξας…
ltx/gr_gr_cog/tr.d050:trMA.Ode9C11.melody	@ltx/gr_gr_cog/he.h.m5:heHE.IsaiaChoreve.name
ltx/gr_gr_cog/tr.d050:trMA.Ode9C11.mode	@ltx/gr_gr_cog/miscellanea:misc.Mode5
ltx/gr_gr_cog/tr.d050:trMA.Ode9C11.ode	@ltx/gr_gr_cog/miscellanea:misc.Ode9
ltx/gr_gr_cog/tr.d050:trMA.Ode9C11.text	Ἐντολάς σου Δέσποτα μὴ φυλάξας, γνώμῃ ἐμαυτοῦ, τοῖς πάθεσιν ὑπελθών, τοῖς τῶν ἡδονῶν, γεγύμνωμαι χάριτος, καὶ ταῖς πληγαῖς ἔῤῥιμμαι γυμνός· ὅθεν αἰτοῦμαί σε, τὸν Σωτῆρα διασῶσαί με.
ltx/gr_gr_cog/tr.d050:trMA.Ode9C12.incipit	Οὐ Λευΐτης ἴσχυσεν, ἀποσμῆξαι, μώλωπας…
ltx/gr_gr_cog/tr.d050:trMA.Ode9C12.melody	@ltx/gr_gr_cog/he.h.m5:heHE.IsaiaChoreve.name
ltx/gr_gr_cog/tr.d050:trMA.Ode9C12.mode	@ltx/gr_gr_cog/miscellanea:misc.Mode5
ltx/gr_gr_cog/tr.d050:trMA.Ode9C12.ode	@ltx/gr_gr_cog/miscellanea:misc.Ode9
ltx/gr_gr_cog/tr.d050:trMA.Ode9C12.text	Οὐ Λευΐτης ἴσχυσεν, ἀποσμῆξαι, μώλωπας ἐμούς, ἀλλʹ ἦλθες ὁ ἀγαθός, πρός με συμπαθῶς καὶ ἔχεας ἔλεος σῶν οἰκτιρμῶν, Σῶτερ ἐπ΄ ἐμὲ ὥσπερ πανάριστος, ἰατρός με ἰασάμενος.
ltx/gr_gr_cog/tr.d050:trMA.Ode9C13.incipit	Ὡς ὑπάρχων εὔσπλαγχνος, κατοικτείρας ἔσωσας…
ltx/gr_gr_cog/tr.d050:trMA.Ode9C13.melody	@ltx/gr_gr_cog/he.h.m5:heHE.IsaiaChoreve.name
ltx/gr_gr_cog/tr.d050:trMA.Ode9C13.mode	@ltx/gr_gr_cog/miscellanea:misc.Mode5
ltx/gr_gr_cog/tr.d050:trMA.Ode9C13.ode	@ltx/gr_gr_cog/miscellanea:misc.Ode9
ltx/gr_gr_cog/tr.d050:trMA.Ode9C13.text	Ὡς ὑπάρχων εὔσπλαγχνος, κατοικτείρας ἔσωσας Χριστὲ τὸν μάστιξιν ἀλγεινῶς, ὑπὸ τῶν λῃστῶν, Σωτὴρ μαστιχθέντα με καὶ τὴν ψυχὴν σῶμά τε σαυτοῦ ὥσπερ δηνάρια δύο δέδωκας ἀντίλυτρον.
ltx/gr_gr_cog/tr.d050:trMA.Ode9C1T.incipit	Ὑπὲρ νοῦν ὁ τόκος σου…
ltx/gr_gr_cog/tr.d050:trMA.Ode9C1T.melody	@ltx/gr_gr_cog/he.h.m5:heHE.IsaiaChoreve.name
ltx/gr_gr_cog/tr.d050:trMA.Ode9C1T.mode	@ltx/gr_gr_cog/miscellanea:misc.Mode5
ltx/gr_gr_cog/tr.d050:trMA.Ode9C1T.ode	@ltx/gr_gr_cog/miscellanea:misc.Ode9
ltx/gr_gr_cog/tr.d050:trMA.Ode9C1T.text	Ὑπὲρ νοῦν ὁ τόκος σου, Θεομῆτορ· ἄνευ γὰρ ἀνδρός, ἡ σύλληψις ἐν σοὶ καὶ παρθενικῶς, ἡ κύησις γέγονεν· καὶ γὰρ Θεός, ἐστιν ὁ τεχθείς· Ὃν μεγαλύνοντες, σὲ Παρθένε μακαρίζομεν.
ltx/gr_gr_cog/tr.d050:trMA.Ode9C21.greekmelody	@ltx/gr_gr_cog/he.h.m8:heHE.TinAgninEndoxos.greekname
ltx/gr_gr_cog/tr.d050:trMA.Ode9C21.incipit	Ἰατὴρ νοσούντων ἐν πταίσμασι θεόθεν…
ltx/gr_gr_cog/tr.d050:trMA.Ode9C21.melody	@ltx/gr_gr_cog/he.h.m8:heHE.TinAgninEndoxos.name
ltx/gr_gr_cog/tr.d050:trMA.Ode9C21.mode	@ltx/gr_gr_cog/miscellanea:misc.Mode8
ltx/gr_gr_cog/tr.d050:trMA.Ode9C21.ode	@ltx/gr_gr_cog/miscellanea:misc.Ode9
ltx/gr_gr_cog/tr.d050:trMA.Ode9C21.text	Ἰατὴρ νοσούντων ἐν πταίσμασι θεόθεν Μακάριε, ἐλατὴρ δὲ ἐδείχθης καὶ διώκτης τῶν πονηρῶν πνευμάτων· διό σε μακαρίζομεν.
ltx/gr_gr_cog/tr.d050:trMA.Ode9C22.incipit	Τὴν γῆν ὡς φθορᾶς οἰκητήριον…
ltx/gr_gr_cog/tr.d050:trMA.Ode9C22.melody	@ltx/gr_gr_cog/he.h.m8:heHE.TinAgninEndoxos.name
ltx/gr_gr_cog/tr.d050:trMA.Ode9C22.mode	@ltx/gr_gr_cog/miscellanea:misc.Mode8
ltx/gr_gr_cog/tr.d050:trMA.Ode9C22.ode	@ltx/gr_gr_cog/miscellanea:misc.Ode9
ltx/gr_gr_cog/tr.d050:trMA.Ode9C22.text	Τὴν γῆν ὡς φθορᾶς οἰκητήριον, κατέλιπες Πάτερ, καὶ εἰς γῆν κατεσκήνωσας, τῶν πραέων, καὶ σὺν αὐτοῖς ἀγάλλῃ, τῆς θείας ἀπολαύων τρυφῆς.
ltx/gr_gr_cog/tr.d050:trMA.Ode9C23.incipit	Σήμερον ἡμέρα ἑόρτιος· πάντα συγκαλεῖ…
ltx/gr_gr_cog/tr.d050:trMA.Ode9C23.melody	@ltx/gr_gr_cog/he.h.m8:heHE.TinAgninEndoxos.name
ltx/gr_gr_cog/tr.d050:trMA.Ode9C23.mode	@ltx/gr_gr_cog/miscellanea:misc.Mode8
ltx/gr_gr_cog/tr.d050:trMA.Ode9C23.ode	@ltx/gr_gr_cog/miscellanea:misc.Ode9
ltx/gr_gr_cog/tr.d050:trMA.Ode9C23.text	Σήμερον ἡμέρα ἑόρτιος· πάντα συγκαλεῖ γὰρ τῶν μοναζόντων τὰ ποίμνια, εἰς χορείαν πνευματικήν, τράπεζαν, καὶ βρῶσιν ἀκηράτου ζωῆς.
ltx/gr_gr_cog/tr.d050:trMA.Ode9C2T.incipit	Ὁ ἐν σοὶ σκηνωσας Πανάμωμε…
ltx/gr_gr_cog/tr.d050:trMA.Ode9C2T.melody	@ltx/gr_gr_cog/he.h.m8:heHE.TinAgninEndoxos.name
ltx/gr_gr_cog/tr.d050:trMA.Ode9C2T.mode	@ltx/gr_gr_cog/miscellanea:misc.Mode8
ltx/gr_gr_cog/tr.d050:trMA.Ode9C2T.ode	@ltx/gr_gr_cog/miscellanea:misc.Ode9
ltx/gr_gr_cog/tr.d050:trMA.Ode9C2T.text	Ὁ ἐν σοὶ σκηνωσας Πανάμωμε, τὸν πρὶν τοὺς γενάρχας κακοτρόπως πτερνίσαντα, βροτοκτόνον καταβαλών, ἐτέχθη, καὶ πάντας ἡμᾶς ἔσωσε.
ltx/gr_gr_cog/tr.d050:trMA.Oikos1.text	Οἶκον Θεοῦ ὡς ἀληθῶς, σαυτὸν εἰργάσω Πάτερ, ταῖς θείαις ἀρεταῖς σου, σαφῶς κατακοσμήσας, ὥσπερ χρυσίον τηλαυγές, πίστιν ἐλπίδα καὶ ἀγάπην ἀληθῆ, θείους θεσμοὺς ἐκθέμενος, ἐγκρατείᾳ ἀσκήσας ὡς ἄσαρκος, φρόνησιν, ἀνδρείαν, σωφροσύνην κτησάμενος ταπείνωσιν, διʹ ἧς ἀνυψώθης· διὸ καὶ ἐφωτίσθης εὐχαῖς ἀεννάοις, καὶ τοῦ οὐρανοῦ κατέλαβες τὰς σκηνώσεις, καθηγητὰ Ἰωάννη Πατὴρ ἡμῶν.
ltx/gr_gr_cog/tr.d050:trMA.PostGospelBoth.incipit	@ltx/gr_gr_cog/tr.d001:trMA.PostGospelBoth.incipit
ltx/gr_gr_cog/tr.d050:trMA.PostGospelBoth.melody	
ltx/gr_gr_cog/tr.d050:trMA.PostGospelBoth.mode	@ltx/gr_gr_cog/miscellanea:misc.Mode8
ltx/gr_gr_cog/tr.d050:trMA.PostGospelBoth.text	@ltx/gr_gr_cog/tr.d001:trMA.PostGospelBoth.text
ltx/gr_gr_cog/tr.d050:trMA.PostGospelGlory.incipit	@ltx/gr_gr_cog/tr.d001:trMA.PostGospelGlory.incipit
ltx/gr_gr_cog/tr.d050:trMA.PostGospelGlory.melody	
ltx/gr_gr_cog/tr.d050:trMA.PostGospelGlory.mode	@ltx/gr_gr_cog/miscellanea:misc.Mode8
ltx/gr_gr_cog/tr.d050:trMA.PostGospelGlory.text	@ltx/gr_gr_cog/tr.d001:trMA.PostGospelGlory.text
ltx/gr_gr_cog/tr.d050:trMA.PostGospelIdiomelon.incipit	@ltx/gr_gr_cog/tr.d001:trMA.PostGospelIdiomelon.incipit
ltx/gr_gr_cog/tr.d050:trMA.PostGospelIdiomelon.melody	
ltx/gr_gr_cog/tr.d050:trMA.PostGospelIdiomelon.mode	@ltx/gr_gr_cog/miscellanea:misc.Mode6
ltx/gr_gr_cog/tr.d050:trMA.PostGospelIdiomelon.text	@ltx/gr_gr_cog/tr.d001:trMA.PostGospelIdiomelon.text
ltx/gr_gr_cog/tr.d050:trSY.commemoration.couplet1.title	@ltx/gr_gr_cog/titles:ti.Verses
ltx/gr_gr_cog/tr.d050:trSY.commemoration.couplet1.verse1	Ὁ σάρκα καὶ ζῶν νεκρὸς ὢν Ἰωάννης,
ltx/gr_gr_cog/tr.d050:trSY.commemoration.couplet1.verse2	Αἰωνίως ζῇ, καὶ νεκρὸς φανεὶς ἄπνους.
ltx/gr_gr_cog/tr.d050:trSY.commemoration.couplet2.verse1	Σύγγραμμα λιπὼν Κλίμακα τῇ ἀνόδῳ,
ltx/gr_gr_cog/tr.d050:trSY.commemoration.couplet2.verse2	Δείκνυσιν αὐτοῦ πορείαν τῆς ἀνόδου.
ltx/gr_gr_cog/tr.d050:trSY.commemoration.narration.p01	[paragraph 01]
ltx/gr_gr_cog/tr.d050:trSY.commemoration.narration.p02	[paragraph 02]
ltx/gr_gr_cog/tr.d050:trSY.commemoration.narration.p03	[paragraph 03]
ltx/gr_gr_cog/tr.d050:trSY.commemoration.narration.p04	[paragraph 04]
ltx/gr_gr_cog/tr.d050:trSY.commemoration.narration.p05	[paragraph 05]
ltx/gr_gr_cog/tr.d050:trSY.commemoration.narration.p06	[paragraph 06]
ltx/gr_gr_cog/tr.d050:trSY.commemoration.narration.p07	[paragraph 07]
ltx/gr_gr_cog/tr.d050:trSY.commemoration.onotherday.text	Τῇ αὐτῇ ἡμέρᾳ, μνήμην ποιοῦμεν τοῦ Ὁσίου Πατρὸς ἡμῶν Ἰωάννου, τοῦ Συγγραφέως τῆς Κλίμακος.
ltx/gr_gr_cog/tr.d050:trSY.commemoration.text	Τῇ αὐτῇ ἡμέρᾳ, Κυριακῇ τετάρτῃ τῶν Νηστειῶν, μνήμην ποιοῦμεν τοῦ Ὁσίου Πατρὸς ἡμῶν Ἰωάννου, τοῦ Συγγραφέως τῆς Κλίμακος.
ltx/gr_gr_cog/tr.d050:trSY.lastline	Ταῖς αὐτοῦ πρεσβείαις, ὁ Θεός, ἐλέησον, καὶ σῶσον ἡμᾶς. Ἀμήν.
ltx/gr_gr_cog/tr.d050:trVE.ApolTheotokion.incipit	@ltx/gr_gr_cog/oc.m8.d1:ocVE.ApolTheotokionVM.incipit
ltx/gr_gr_cog/tr.d050:trVE.ApolTheotokion.melody	
ltx/gr_gr_cog/tr.d050:trVE.ApolTheotokion.mode	@ltx/gr_gr_cog/miscellanea:misc.Mode8
ltx/gr_gr_cog/tr.d050:trVE.ApolTheotokion.text	@ltx/gr_gr_cog/oc.m8.d1:ocVE.ApolTheotokionVM.text
ltx/gr_gr_cog/tr.d050:trVE.Apolytikion1.melody	@ltx/gr_gr_cog/he.ga:heGA.TaisTonDakryonSou.name
ltx/gr_gr_cog/tr.d050:trVE.Apolytikion1.mode	@ltx/gr_gr_cog/miscellanea:misc.Mode8
ltx/gr_gr_cog/tr.d050:trVE.Apolytikion1.text	@ltx/gr_gr_cog/properties:media.key
ltx/gr_gr_cog/tr.d050:trVE.AposGlory.incipit	Τὸν ἐπὶ γῆς Ἄγγελον, καὶ…
ltx/gr_gr_cog/tr.d050:trVE.AposGlory.melody	@ltx/gr_gr_cog/miscellanea:misc.Idiomelon
ltx/gr_gr_cog/tr.d050:trVE.AposGlory.mode	@ltx/gr_gr_cog/miscellanea:misc.Mode2
ltx/gr_gr_cog/tr.d050:trVE.AposGlory.text	Τὸν ἐπὶ γῆς Ἄγγελον, καὶ ἐν οὐρανοῖς ἄνθρωπον Θεοῦ, τοῦ κόσμου τὴν εὐκοσμίαν, τὴν τρυφὴν τῶν ἀγαθῶν καὶ τῶν ἀρετῶν, τῶν Ἀσκητῶν τὸ καύχημα Ἰωάννην τιμήσωμεν· πεφυτευμένος γὰρ ἐν τῷ οἴκω τοῦ Θεοῦ, ἐξήνθησε δικαίως, καὶ ὡσεὶ κέδρος ἐν ἐρήμῳ ἐπλήθυνε τὰ ποίμνια Χριστοῦ, τῶν λογικῶν προβάτων, ἐν Ὁσιότητι καὶ δικαιοσύνῃ.
ltx/gr_gr_cog/tr.d050:trVE.GeneralApolytikion1.name	Ἰωάννη Πατὴρ ἡμῶν ὅσιε,
ltx/gr_gr_cog/tr.d050:trVE.MM.Stichera1123as78910.text	@ltx/gr_gr_cog/properties:media.key
ltx/gr_gr_cog/tr.d050:trVE.SticGlory.incipit	Ὅσιε Πάτερ, τῆς φωνῆς τοῦ…
ltx/gr_gr_cog/tr.d050:trVE.SticGlory.melody	@ltx/gr_gr_cog/miscellanea:misc.Idiomelon
ltx/gr_gr_cog/tr.d050:trVE.SticGlory.mode	@ltx/gr_gr_cog/miscellanea:misc.Mode5
ltx/gr_gr_cog/tr.d050:trVE.SticGlory.text	Ὅσιε Πάτερ, τῆς φωνῆς τοῦ Εὐαγγελίου, τοῦ Κυρίου ἀκούσας, τὸν κόσμον κατέλιπες, τὸν πλοῦτον καὶ τὴν δόξαν εἰς οὐδὲν λογισάμενος· ὅθεν πᾶσιν ἐβόας· Ἀγαπήσατε τὸν Θεὸν καὶ εὑρήσετε χάριν αἰώνιον, μηδὲν προτιμήσητε τῆς ἀγάπης αὐτοῦ, ἵνα ὅταν ἔλθῃ ἐν τῇ δόξῃ αὐτοῦ εὑρήσητε ἀνάπαυσιν μετὰ πάντων τῶν Ἁγιων· ὧν ταίς ἱκεσίαις Χριστέ, φύλαξον, καὶ σῶσον τὰς ψυχὰς ἡμῶν.
ltx/gr_gr_cog/tr.d050:trVE.Stichera01.greekmelody	@ltx/gr_gr_cog/he.a.m8:heAU.OTouParadoxou.greekname
ltx/gr_gr_cog/tr.d050:trVE.Stichera01.incipit	@ltx/gr_gr_cog/me.m03.d30:meVE.Stichera01.incipit
ltx/gr_gr_cog/tr.d050:trVE.Stichera01.melody	@ltx/gr_gr_cog/he.a.m8:heAU.OTouParadoxou.name
ltx/gr_gr_cog/tr.d050:trVE.Stichera01.mode	@ltx/gr_gr_cog/miscellanea:misc.Mode8
ltx/gr_gr_cog/tr.d050:trVE.Stichera01.text	@ltx/gr_gr_cog/me.m03.d30:meVE.Stichera01.text
ltx/gr_gr_cog/tr.d050:trVE.Stichera02.greekmelody	@ltx/gr_gr_cog/he.a.m8:heAU.OTouParadoxou.greekname
ltx/gr_gr_cog/tr.d050:trVE.Stichera02.incipit	@ltx/gr_gr_cog/me.m03.d30:meVE.Stichera02.incipit
ltx/gr_gr_cog/tr.d050:trVE.Stichera02.melody	@ltx/gr_gr_cog/he.a.m8:heAU.OTouParadoxou.name
ltx/gr_gr_cog/tr.d050:trVE.Stichera02.mode	@ltx/gr_gr_cog/miscellanea:misc.Mode8
ltx/gr_gr_cog/tr.d050:trVE.Stichera02.text	@ltx/gr_gr_cog/me.m03.d30:meVE.Stichera02.text
ltx/gr_gr_cog/tr.d050:trVE.Stichera03.greekmelody	@ltx/gr_gr_cog/he.a.m8:heAU.OTouParadoxou.greekname
ltx/gr_gr_cog/tr.d050:trVE.Stichera03.incipit	@ltx/gr_gr_cog/me.m03.d30:meVE.Stichera03.incipit
ltx/gr_gr_cog/tr.d050:trVE.Stichera03.melody	@ltx/gr_gr_cog/he.a.m8:heAU.OTouParadoxou.name
ltx/gr_gr_cog/tr.d050:trVE.Stichera03.mode	@ltx/gr_gr_cog/miscellanea:misc.Mode8
ltx/gr_gr_cog/tr.d050:trVE.Stichera03.text	@ltx/gr_gr_cog/me.m03.d30:meVE.Stichera03.text
