ltx/gr_gr_cog/le.ep.me.m11.d23:lemeLI.Epistle.book_abbr	@ltx/gr_gr_cog/le.ep.me.m01.d18:lemeLI.Epistle.book_abbr
ltx/gr_gr_cog/le.ep.me.m11.d23:lemeLI.Epistle.book_string	@ltx/gr_gr_cog/le.ep.me.m01.d18:lemeLI.Epistle.book_string
ltx/gr_gr_cog/le.ep.me.m11.d23:lemeLI.Epistle.chapverse	@ltx/gr_gr_cog/le.ep.me.m01.d18:lemeLI.Epistle.chapverse
ltx/gr_gr_cog/le.ep.me.m11.d23:lemeLI.Epistle.incipit	@ltx/gr_gr_cog/le.ep.me.m01.d18:lemeLI.Epistle.incipit
ltx/gr_gr_cog/le.ep.me.m11.d23:lemeLI.Epistle.text	@ltx/gr_gr_cog/le.ep.me.m01.d18:lemeLI.Epistle.text
ltx/gr_gr_cog/le.ep.me.m11.d23:lemeLI.Epistle.title	Τῶν Ἱεράρχων
ltx/gr_gr_cog/le.ep.me.m11.d23:lemeLI.Epistle.title_abbr	Τῶν Ἱεράρχων
ltx/gr_gr_cog/le.ep.me.m11.d23:lemeLI.Epistle.version	@ltx/gr_gr_cog/le.ep.me.m01.d18:lemeLI.Epistle.version
