ltx/gr_gr_cog/le.ep.me.m11.d14:lemeLI.Epistle.book_abbr	@ltx/gr_gr_cog/le.ep.mc.d190:lemcLI.Epistle.book_abbr
ltx/gr_gr_cog/le.ep.me.m11.d14:lemeLI.Epistle.book_string	@ltx/gr_gr_cog/le.ep.mc.d190:lemcLI.Epistle.book_string
ltx/gr_gr_cog/le.ep.me.m11.d14:lemeLI.Epistle.chapverse	@ltx/gr_gr_cog/le.ep.mc.d190:lemcLI.Epistle.chapverse
ltx/gr_gr_cog/le.ep.me.m11.d14:lemeLI.Epistle.incipit	@ltx/gr_gr_cog/le.ep.mc.d190:lemcLI.Epistle.incipit
ltx/gr_gr_cog/le.ep.me.m11.d14:lemeLI.Epistle.text	@ltx/gr_gr_cog/le.ep.mc.d190:lemcLI.Epistle.text
ltx/gr_gr_cog/le.ep.me.m11.d14:lemeLI.Epistle.title	Τοῦ Ἀποστόλου
ltx/gr_gr_cog/le.ep.me.m11.d14:lemeLI.Epistle.title_abbr	Τοῦ Ἀποστόλου
ltx/gr_gr_cog/le.ep.me.m11.d14:lemeLI.Epistle.version	@ltx/gr_gr_cog/le.ep.mc.d190:lemcLI.Epistle.version
