ltx/gr_gr_cog/le.ep.mc.d258:lemcLI.Epistle.book_abbr	@ltx/gr_gr_cog/bible:Philippians.abbr
ltx/gr_gr_cog/le.ep.mc.d258:lemcLI.Epistle.book_string	@ltx/gr_gr_cog/bible:Philippians.text
ltx/gr_gr_cog/le.ep.mc.d258:lemcLI.Epistle.chapverse	3:8 – 19
ltx/gr_gr_cog/le.ep.mc.d258:lemcLI.Epistle.incipit	Τὰ πάντα ἐζημιώθην, καὶ ἡγοῦμαι σκύβαλα εἶναι…
ltx/gr_gr_cog/le.ep.mc.d258:lemcLI.Epistle.text	Ἀδελφοί, τὰ πάντα ἐζημιώθην, καὶ ἡγοῦμαι σκύβαλα εἶναι ἵνα Χριστὸν κερδήσω καὶ εὑρεθῶ ἐν αὐτῷ μὴ ἔχων ἐμὴν δικαιοσύνην τὴν ἐκ νόμου, ἀλλὰ τὴν διὰ πίστεως Χριστοῦ, τὴν ἐκ Θεοῦ δικαιοσύνην ἐπὶ τῇ πίστει, τοῦ γνῶναι αὐτὸν καὶ τὴν δύναμιν τῆς ἀναστάσεως αὐτοῦ καὶ τὴν κοινωνίαν τῶν παθημάτων αὐτοῦ, συμμορφούμενος τῷ θανάτῳ αὐτοῦ, εἴ πως καταντήσω εἰς τὴν ἐξανάστασιν τῶν νεκρῶν. οὐχ ὅτι ἤδη ἔλαβον ἢ ἤδη τετελείωμαι, διώκω δὲ εἰ καὶ καταλάβω, ἐφ ᾧ καὶ κατελήφθην ὑπὸ τοῦ Χριστοῦ Ἰησοῦ. ἀδελφοί, ἐγὼ ἐμαυτὸν οὔπω λογίζομαι κατειληφέναι· ἓν δέ, τὰ μὲν ὀπίσω ἐπιλανθανόμενος τοῖς δὲ ἔμπροσθεν ἐπεκτεινόμενος κατὰ σκοπὸν διώκω ἐπὶ τὸ βραβεῖον τῆς ἄνω κλήσεως τοῦ Θεοῦ ἐν Χριστῷ Ἰησοῦ. ὅσοι οὖν τέλειοι, τοῦτο φρονῶμεν· καὶ εἴ τι ἑτέρως φρονεῖτε, καὶ τοῦτο ὁ Θεὸς ὑμῖν ἀποκαλύψει. πλὴν εἰς ὃ ἐφθάσαμεν, τῷ αὐτῷ στοιχεῖν κανόνι, τὸ αὐτὸ φρονεῖν. Συμμιμηταί μου γίνεσθε, ἀδελφοί, καὶ σκοπεῖτε τοὺς οὕτω περιπατοῦντας, καθὼς ἔχετε τύπον ἡμᾶς. πολλοὶ γὰρ περιπατοῦσιν, — οὓς πολλάκις ἔλεγον ὑμῖν, νῦν δὲ καὶ κλαίων λέγω, τοὺς ἐχθροὺς τοῦ σταυροῦ τοῦ Χριστοῦ, ὧν τὸ τέλος ἀπώλεια, ὧν ὁ Θεὸς ἡ κοιλία καὶ ἡ δόξα ἐν τῇ αἰσχύνῃ αὐτῶν, οἱ τὰ ἐπίγεια φρονοῦντες!
ltx/gr_gr_cog/le.ep.mc.d258:lemcLI.Epistle.title	Τῇ Παρασκευῇ τῆς Κʹ Ἑβδομάδος
ltx/gr_gr_cog/le.ep.mc.d258:lemcLI.Epistle.title_abbr	Παρασκευῇ τῆς Κʹ Ἑβδομάδος
ltx/gr_gr_cog/le.ep.mc.d258:lemcLI.Epistle.version	@ltx/gr_gr_cog/properties:version.designation
