ltx/gr_gr_cog/other.stnektariosparaklesis1:hoCA.Apolytikion1.incipit	Τω Ιεράρχη του Χριστού Νεκταρίω…
ltx/gr_gr_cog/other.stnektariosparaklesis1:hoCA.Apolytikion1.melody	@ltx/gr_gr_cog/he.a.m4:heAU.OYpsotheisEnToStavro.name
ltx/gr_gr_cog/other.stnektariosparaklesis1:hoCA.Apolytikion1.mode	@ltx/gr_gr_cog/miscellanea:misc.Mode4
ltx/gr_gr_cog/other.stnektariosparaklesis1:hoCA.Apolytikion1.text	Τω Ιεράρχη του Χριστού Νεκταρίω, τω δοξασθέντι δωρεάς ουρανίας, προσπέσωμεν κραυγάζοντες εκ βάθους ψυχής, άγιε Νεκτάριε, Ορθοδόξων προστάτα, πάσης ημάς λύτρωσαι, συμφοράς και ανάγκης, και πειρασμών και νόσων χαλεπών, τους καταφεύγοντας, Πάτερ τη σκέπη σου.
ltx/gr_gr_cog/other.stnektariosparaklesis1:hoCA.Apolytikion2.incipit	Ως ειληφώς παρά Θεού εξουσίαν…
ltx/gr_gr_cog/other.stnektariosparaklesis1:hoCA.Apolytikion2.melody	@ltx/gr_gr_cog/he.a.m4:heAU.OYpsotheisEnToStavro.name
ltx/gr_gr_cog/other.stnektariosparaklesis1:hoCA.Apolytikion2.mode	@ltx/gr_gr_cog/miscellanea:misc.Mode4
ltx/gr_gr_cog/other.stnektariosparaklesis1:hoCA.Apolytikion2.text	Ως ειληφώς παρά Θεού εξουσίαν, του θεραπεύειν τας δεινάς καχεξίας τῶν προσιόντων, Πάτερ, τοις λειψάνοις σου, ίασαι δεόμεθα, τούς δεινώς θλιβομένους, νόσοις και παθήμασι, και πικραίς αλγηδόσι, και εν ειρήνη φύλαττε ημάς, ταις σαις πρεσβείαις Νεκτάριε όσιε.
ltx/gr_gr_cog/other.stnektariosparaklesis1:hoCA.Insert1	τοῦ ἐν ἁγίοις Πατρὸς ἡμῶν Νεκταρίου, Μητροπολίτου Πενταπόλεως, τοῦ Θαυματουργοῦ,
ltx/gr_gr_cog/other.stnektariosparaklesis1:hoCA.Kathisma11.incipit	Πηγή δαψιλής, ιάσεων εν Πνεύματι…
ltx/gr_gr_cog/other.stnektariosparaklesis1:hoCA.Kathisma11.melody	Πρεσβεία θερμή.
ltx/gr_gr_cog/other.stnektariosparaklesis1:hoCA.Kathisma11.mode	@ltx/gr_gr_cog/miscellanea:misc.Mode2
ltx/gr_gr_cog/other.stnektariosparaklesis1:hoCA.Kathisma11.text	Πηγή δαψιλής, ιάσεων εν Πνεύματι, εδείχθη σοφέ, η θήκη τῶν λειψάνων σου, ιάται γαρ τους πάσχοντας, και υγείαν και ρώσιν χαρίζεται, τοις προσιούσιν εν πίστει θερμή, Νεκτάριε πάτερ ιερώτατε.
ltx/gr_gr_cog/other.stnektariosparaklesis1:hoCA.Kontakion.incipit	Πεπτωκότων επανόρθωσις γέγονας, και τῶν…
ltx/gr_gr_cog/other.stnektariosparaklesis1:hoCA.Kontakion.melody	
ltx/gr_gr_cog/other.stnektariosparaklesis1:hoCA.Kontakion.mode	@ltx/gr_gr_cog/miscellanea:misc.Mode2
ltx/gr_gr_cog/other.stnektariosparaklesis1:hoCA.Kontakion.text	Πεπτωκότων επανόρθωσις γέγονας, και τῶν κλονουμένων Νεκτάριε στήριγμα, εν υστέροις τοις καιροίς παρά Κυρίου δοξασθείς, αλλά πάντοτε και ημάς, τῶν εν τω βίω πειρασμών, ανωτέρους διάσωζε, άφεσιν τῶν πταισμάτων, και ρώσιν και σωτηρίαν, αιτούμενος παρά Θεού, Ιεράρχα ταις ψυχαίς ημών.
ltx/gr_gr_cog/other.stnektariosparaklesis1:hoCA.Meg00.incipit	@ltx/gr_gr_cog/ho.ho03:hoMA.Ode9.Meg00.incipit
ltx/gr_gr_cog/other.stnektariosparaklesis1:hoCA.Meg00.text	@ltx/gr_gr_cog/ho.ho03:hoMA.Ode9.Meg00.text
ltx/gr_gr_cog/other.stnektariosparaklesis1:hoCA.Meg01.incipit	@ltx/gr_gr_cog/he.h.m6:heHE.TinTimioteran.incipit
ltx/gr_gr_cog/other.stnektariosparaklesis1:hoCA.Meg01.melody	@ltx/gr_gr_cog/he.h.m6:heHE.TinTimioteran.melody
ltx/gr_gr_cog/other.stnektariosparaklesis1:hoCA.Meg01.text	@ltx/gr_gr_cog/he.h.m6:heHE.TinTimioteran.text
ltx/gr_gr_cog/other.stnektariosparaklesis1:hoCA.Meg02.incipit	Τον της ευσεβείας νέον πυρσόν…
ltx/gr_gr_cog/other.stnektariosparaklesis1:hoCA.Meg02.melody	@ltx/gr_gr_cog/he.h.m6:heHE.TinTimioteran.name
ltx/gr_gr_cog/other.stnektariosparaklesis1:hoCA.Meg02.text	Τον της ευσεβείας νέον πυρσόν, και της Εκκλησίας, τον φωστήρα τον φαεινόν, τον θερμόν προστάτην, και έφορον Αιγίνης, Νεκτάριον τον θείον, ύμνοις τιμήσωμεν.
ltx/gr_gr_cog/other.stnektariosparaklesis1:hoCA.Meg03.incipit	Χαίροις ο νεόῤῥυτος ποταμός, ό…
ltx/gr_gr_cog/other.stnektariosparaklesis1:hoCA.Meg03.melody	@ltx/gr_gr_cog/he.h.m6:heHE.TinTimioteran.name
ltx/gr_gr_cog/other.stnektariosparaklesis1:hoCA.Meg03.text	Χαίροις ο νεόῤῥυτος ποταμός, ό τα νεκταρώδη, τῶν χαρίτων τῶν θεικών, ρείθρα πελαγίζων, τη θεία επομβρία, Χριστού τη Εκκλησία, Πάτερ Νεκτάριε.
ltx/gr_gr_cog/other.stnektariosparaklesis1:hoCA.Meg04.incipit	Λάμψας εν τω ύψει τῶν…
ltx/gr_gr_cog/other.stnektariosparaklesis1:hoCA.Meg04.melody	@ltx/gr_gr_cog/he.h.m6:heHE.TinTimioteran.name
ltx/gr_gr_cog/other.stnektariosparaklesis1:hoCA.Meg04.text	Λάμψας εν τω ύψει τῶν αρετών, εν εσχάτοις χρόνοις, ώσπερ λύχνος θεολαμπής, νοητώς λαμπρύνεις, πιστών τας διανοίας, τη καθαρά ζωή σου, Πάτερ Νεκτάριε.
ltx/gr_gr_cog/other.stnektariosparaklesis1:hoCA.Meg05.incipit	Χαίροις τεθλιμμένων ο αρωγός, και…
ltx/gr_gr_cog/other.stnektariosparaklesis1:hoCA.Meg05.melody	@ltx/gr_gr_cog/he.h.m6:heHE.TinTimioteran.name
ltx/gr_gr_cog/other.stnektariosparaklesis1:hoCA.Meg05.text	Χαίροις τεθλιμμένων ο αρωγός, και τῶν δαιμονόντων, ο ταχύτατος ιατρός, χαίροις ο τα πάθη, και νόσους θεραπεύων, τῶν προσιόντων Πάτερ, εν τοις λειψάνοις σου.
ltx/gr_gr_cog/other.stnektariosparaklesis1:hoCA.Meg06.incipit	Χαίροις της Αιγίνης ο θυσαυρός…
ltx/gr_gr_cog/other.stnektariosparaklesis1:hoCA.Meg06.melody	@ltx/gr_gr_cog/he.h.m6:heHE.TinTimioteran.name
ltx/gr_gr_cog/other.stnektariosparaklesis1:hoCA.Meg06.text	Χαίροις της Αιγίνης ο θυσαυρός, και τῶν Ορθοδόξων, αντιλήπτωρ και βοηθός, χαίροις της Ελλάδος, αγλάισμα το νέον, Νεκτάριε παμμάκαρ, ημών το στήριγμα.
ltx/gr_gr_cog/other.stnektariosparaklesis1:hoCA.Meg07.incipit	Τη ση προστασία τη πατρική…
ltx/gr_gr_cog/other.stnektariosparaklesis1:hoCA.Meg07.melody	@ltx/gr_gr_cog/he.h.m6:heHE.TinTimioteran.name
ltx/gr_gr_cog/other.stnektariosparaklesis1:hoCA.Meg07.text	Τη ση προστασία τη πατρική, την σεπτήν Μονήν σου, διαφύλαττε αβλαβή, Νεκτάριε Πάτερ, και πλήρου τας αιτήσεις, τῶν ευλαβώς τελούντων, την θείαν μνήμην σου.
ltx/gr_gr_cog/other.stnektariosparaklesis1:hoCA.Meg0F.incipit	@ltx/gr_gr_cog/ho.ho23:hoCA.Meg0F.incipit
ltx/gr_gr_cog/other.stnektariosparaklesis1:hoCA.Meg0F.melody	@ltx/gr_gr_cog/he.h.m6:heHE.TinTimioteran.name
ltx/gr_gr_cog/other.stnektariosparaklesis1:hoCA.Meg0F.text	@ltx/gr_gr_cog/ho.ho23:hoCA.Meg0F.text
ltx/gr_gr_cog/other.stnektariosparaklesis1:hoCA.Ode11.incipit	Πληγείς τη κακία του δυσμενούς…
ltx/gr_gr_cog/other.stnektariosparaklesis1:hoCA.Ode11.melody	@ltx/gr_gr_cog/he.h.m8:heHE.YgranDiodefsas.name
ltx/gr_gr_cog/other.stnektariosparaklesis1:hoCA.Ode11.mode	@ltx/gr_gr_cog/miscellanea:misc.Mode8
ltx/gr_gr_cog/other.stnektariosparaklesis1:hoCA.Ode11.ode	@ltx/gr_gr_cog/miscellanea:misc.Ode1
ltx/gr_gr_cog/other.stnektariosparaklesis1:hoCA.Ode11.text	Πληγείς τη κακία του δυσμενούς, τη ση αντιλήψει, καταφεύγω αναβοών. Ειρήνευσον Πάτερ την ζωήν μου και την κατ’ άμφω υγείαν μου δώρησαι.
ltx/gr_gr_cog/other.stnektariosparaklesis1:hoCA.Ode12.incipit	Αγίως ανύσας σου την ζωήν…
ltx/gr_gr_cog/other.stnektariosparaklesis1:hoCA.Ode12.melody	@ltx/gr_gr_cog/he.h.m8:heHE.YgranDiodefsas.name
ltx/gr_gr_cog/other.stnektariosparaklesis1:hoCA.Ode12.mode	@ltx/gr_gr_cog/miscellanea:misc.Mode8
ltx/gr_gr_cog/other.stnektariosparaklesis1:hoCA.Ode12.ode	@ltx/gr_gr_cog/miscellanea:misc.Ode1
ltx/gr_gr_cog/other.stnektariosparaklesis1:hoCA.Ode12.text	Αγίως ανύσας σου την ζωήν, αεί αγιάζεις, και λυτρούσαι παντός κακού, Νεκτάριε Πάτερ θεοφόρε, τους προσιόντας τοις θείοις λειψάνοις σου.
ltx/gr_gr_cog/other.stnektariosparaklesis1:hoCA.Ode13.incipit	Θαυμάτων δυνάμεις ως ενεργών, θεράπευσον…
ltx/gr_gr_cog/other.stnektariosparaklesis1:hoCA.Ode13.melody	@ltx/gr_gr_cog/he.h.m8:heHE.YgranDiodefsas.name
ltx/gr_gr_cog/other.stnektariosparaklesis1:hoCA.Ode13.mode	@ltx/gr_gr_cog/miscellanea:misc.Mode8
ltx/gr_gr_cog/other.stnektariosparaklesis1:hoCA.Ode13.ode	@ltx/gr_gr_cog/miscellanea:misc.Ode1
ltx/gr_gr_cog/other.stnektariosparaklesis1:hoCA.Ode13.text	Θαυμάτων δυνάμεις ως ενεργών, θεράπευσον Πάτερ, ασθενείας οδυνηράς, τῶν την σην βοήθειαν ζητούντων, θαυματουργέ Ιεράρχα Νεκτάριε.
ltx/gr_gr_cog/other.stnektariosparaklesis1:hoCA.Ode1T.incipit	Ως Μήτηρ φιλεύσπλαχνος του Θεού…
ltx/gr_gr_cog/other.stnektariosparaklesis1:hoCA.Ode1T.melody	@ltx/gr_gr_cog/he.h.m8:heHE.YgranDiodefsas.name
ltx/gr_gr_cog/other.stnektariosparaklesis1:hoCA.Ode1T.mode	@ltx/gr_gr_cog/miscellanea:misc.Mode8
ltx/gr_gr_cog/other.stnektariosparaklesis1:hoCA.Ode1T.ode	@ltx/gr_gr_cog/miscellanea:misc.Ode1
ltx/gr_gr_cog/other.stnektariosparaklesis1:hoCA.Ode1T.text	Ως Μήτηρ φιλεύσπλαχνος του Θεού, φιλάγαθε Κόρη, ευσπλαχνίσθητι επ’ εμοί, και βλάβης με πάσης και μανίας, του αοράτου απάλλαξον όφεως.
ltx/gr_gr_cog/other.stnektariosparaklesis1:hoCA.Ode31.incipit	Νοσημάτων παντοίων, χαλεπών θλίψεων, και…
ltx/gr_gr_cog/other.stnektariosparaklesis1:hoCA.Ode31.melody	@ltx/gr_gr_cog/he.h.m8:heHE.OuraniasApsidos.name
ltx/gr_gr_cog/other.stnektariosparaklesis1:hoCA.Ode31.mode	@ltx/gr_gr_cog/miscellanea:misc.Mode8
ltx/gr_gr_cog/other.stnektariosparaklesis1:hoCA.Ode31.ode	@ltx/gr_gr_cog/miscellanea:misc.Ode3
ltx/gr_gr_cog/other.stnektariosparaklesis1:hoCA.Ode31.text	Νοσημάτων παντοίων, χαλεπών θλίψεων, και επηρειών ολεθρίων, και επιθέσεων του αρχεκάκου εχθρού, ως συμπαθής Ιεράρχης, ασινείς διάσωζε, τους σε γεραίροντας.
ltx/gr_gr_cog/other.stnektariosparaklesis1:hoCA.Ode32.incipit	Νέκταρ άυλον θείον, της θεικής…
ltx/gr_gr_cog/other.stnektariosparaklesis1:hoCA.Ode32.melody	@ltx/gr_gr_cog/he.h.m8:heHE.OuraniasApsidos.name
ltx/gr_gr_cog/other.stnektariosparaklesis1:hoCA.Ode32.mode	@ltx/gr_gr_cog/miscellanea:misc.Mode8
ltx/gr_gr_cog/other.stnektariosparaklesis1:hoCA.Ode32.ode	@ltx/gr_gr_cog/miscellanea:misc.Ode3
ltx/gr_gr_cog/other.stnektariosparaklesis1:hoCA.Ode32.text	Νέκταρ άυλον θείον, της θεικής χάριτος, ής παρά Θεού εκομίσω, βλύζει εκάστοτε, η θεία κάρα σου, και τῶν παθών την πικρίαν, απελαύνει άγιε, εκ τῶν ψυχών ημών.
ltx/gr_gr_cog/other.stnektariosparaklesis1:hoCA.Ode33.incipit	Εν οδύναις και πόνοις, και…
ltx/gr_gr_cog/other.stnektariosparaklesis1:hoCA.Ode33.melody	@ltx/gr_gr_cog/he.h.m8:heHE.OuraniasApsidos.name
ltx/gr_gr_cog/other.stnektariosparaklesis1:hoCA.Ode33.mode	@ltx/gr_gr_cog/miscellanea:misc.Mode8
ltx/gr_gr_cog/other.stnektariosparaklesis1:hoCA.Ode33.ode	@ltx/gr_gr_cog/miscellanea:misc.Ode3
ltx/gr_gr_cog/other.stnektariosparaklesis1:hoCA.Ode33.text	Εν οδύναις και πόνοις, και θλιβεραίς μάστιξι, Πάτερ την ζωήν μου ανύων, προς σε κατέφυγον, μη ούν παρίδης με, αλλά τη ση επισκέψει, εκ τῶν συνεχόντων με, δεινών απάλλαξον.
ltx/gr_gr_cog/other.stnektariosparaklesis1:hoCA.Ode3T.incipit	Καταφύγιον κόσμου, και αῤῥαγές στήριγμα…
ltx/gr_gr_cog/other.stnektariosparaklesis1:hoCA.Ode3T.melody	@ltx/gr_gr_cog/he.h.m8:heHE.OuraniasApsidos.name
ltx/gr_gr_cog/other.stnektariosparaklesis1:hoCA.Ode3T.mode	@ltx/gr_gr_cog/miscellanea:misc.Mode8
ltx/gr_gr_cog/other.stnektariosparaklesis1:hoCA.Ode3T.ode	@ltx/gr_gr_cog/miscellanea:misc.Ode3
ltx/gr_gr_cog/other.stnektariosparaklesis1:hoCA.Ode3T.text	Καταφύγιον κόσμου, και αῤῥαγές στήριγμα, Κεχαριτωμένη Παρθένε, τους καταφεύγοντας, υπό την σκέπην σου, τῶν πολυπλόκων σκανδάλων, του δολίου δράκοντος, σκέπε και φύλαττε.
ltx/gr_gr_cog/other.stnektariosparaklesis1:hoCA.Ode41.incipit	Την Μονήν σου Νεκτάριε, πάσης…
ltx/gr_gr_cog/other.stnektariosparaklesis1:hoCA.Ode41.melody	@ltx/gr_gr_cog/he.h.m8:heHE.EisakikoaKyrie.name
ltx/gr_gr_cog/other.stnektariosparaklesis1:hoCA.Ode41.mode	@ltx/gr_gr_cog/miscellanea:misc.Mode8
ltx/gr_gr_cog/other.stnektariosparaklesis1:hoCA.Ode41.ode	@ltx/gr_gr_cog/miscellanea:misc.Ode4
ltx/gr_gr_cog/other.stnektariosparaklesis1:hoCA.Ode41.text	Την Μονήν σου Νεκτάριε, πάσης επηρείας ανεπηρέαστον, του δολίου πολεμήτορος, Πάτερ διατήρει τη ση χάριτι.
ltx/gr_gr_cog/other.stnektariosparaklesis1:hoCA.Ode42.incipit	Ασθενείς τους προστρέχοντας, Πάτερ πανταχόθεν…
ltx/gr_gr_cog/other.stnektariosparaklesis1:hoCA.Ode42.melody	@ltx/gr_gr_cog/he.h.m8:heHE.EisakikoaKyrie.name
ltx/gr_gr_cog/other.stnektariosparaklesis1:hoCA.Ode42.mode	@ltx/gr_gr_cog/miscellanea:misc.Mode8
ltx/gr_gr_cog/other.stnektariosparaklesis1:hoCA.Ode42.ode	@ltx/gr_gr_cog/miscellanea:misc.Ode4
ltx/gr_gr_cog/other.stnektariosparaklesis1:hoCA.Ode42.text	Ασθενείς τους προστρέχοντας, Πάτερ πανταχόθεν τη θεία Μάνδρα σου, θεραπείας καταξίωσον, και την λύπην τούτων διασκέδασον.
ltx/gr_gr_cog/other.stnektariosparaklesis1:hoCA.Ode43.incipit	Ρώσιν δίδου και ίασιν, την…
ltx/gr_gr_cog/other.stnektariosparaklesis1:hoCA.Ode43.melody	@ltx/gr_gr_cog/he.h.m8:heHE.EisakikoaKyrie.name
ltx/gr_gr_cog/other.stnektariosparaklesis1:hoCA.Ode43.mode	@ltx/gr_gr_cog/miscellanea:misc.Mode8
ltx/gr_gr_cog/other.stnektariosparaklesis1:hoCA.Ode43.ode	@ltx/gr_gr_cog/miscellanea:misc.Ode4
ltx/gr_gr_cog/other.stnektariosparaklesis1:hoCA.Ode43.text	Ρώσιν δίδου και ίασιν, την κατά ψυχήν και σώμα Νεκτάριε, και πταισμάτων απολύτρωσιν, τους ειλικρινώς σε μακαρίζοουσι.
ltx/gr_gr_cog/other.stnektariosparaklesis1:hoCA.Ode4T.incipit	ίθυνόν με Πανάμωμε, προς της…
ltx/gr_gr_cog/other.stnektariosparaklesis1:hoCA.Ode4T.melody	@ltx/gr_gr_cog/he.h.m8:heHE.EisakikoaKyrie.name
ltx/gr_gr_cog/other.stnektariosparaklesis1:hoCA.Ode4T.mode	@ltx/gr_gr_cog/miscellanea:misc.Mode8
ltx/gr_gr_cog/other.stnektariosparaklesis1:hoCA.Ode4T.ode	@ltx/gr_gr_cog/miscellanea:misc.Ode4
ltx/gr_gr_cog/other.stnektariosparaklesis1:hoCA.Ode4T.text	ίθυνόν με Πανάμωμε, προς της μετανοίας οδόν σωτήριον, και παθών μου τα σκιρτήματα, νέκρωσον εις τέλος και αφάνισον.
ltx/gr_gr_cog/other.stnektariosparaklesis1:hoCA.Ode51.incipit	Εύρε σε θερμόν, αντιλήπτορα η…
ltx/gr_gr_cog/other.stnektariosparaklesis1:hoCA.Ode51.melody	@ltx/gr_gr_cog/he.h.m8:heHE.FotisonImas.name
ltx/gr_gr_cog/other.stnektariosparaklesis1:hoCA.Ode51.mode	@ltx/gr_gr_cog/miscellanea:misc.Mode8
ltx/gr_gr_cog/other.stnektariosparaklesis1:hoCA.Ode51.ode	@ltx/gr_gr_cog/miscellanea:misc.Ode5
ltx/gr_gr_cog/other.stnektariosparaklesis1:hoCA.Ode51.text	Εύρε σε θερμόν, αντιλήπτορα η Αίγινα, δια τούτο σου τη χάριτι αεί, καταφεύγει και λυτρούται πάσης θλίψεως.
ltx/gr_gr_cog/other.stnektariosparaklesis1:hoCA.Ode52.incipit	ήρεμον ζωήν, διανύειν και ατάραχον…
ltx/gr_gr_cog/other.stnektariosparaklesis1:hoCA.Ode52.melody	@ltx/gr_gr_cog/he.h.m8:heHE.FotisonImas.name
ltx/gr_gr_cog/other.stnektariosparaklesis1:hoCA.Ode52.mode	@ltx/gr_gr_cog/miscellanea:misc.Mode8
ltx/gr_gr_cog/other.stnektariosparaklesis1:hoCA.Ode52.ode	@ltx/gr_gr_cog/miscellanea:misc.Ode5
ltx/gr_gr_cog/other.stnektariosparaklesis1:hoCA.Ode52.text	ήρεμον ζωήν, διανύειν και ατάραχον, από πάσης του εχθρού επιβουλής, καταξίωσον ημάς Πάτερ Νεκτάριε.
ltx/gr_gr_cog/other.stnektariosparaklesis1:hoCA.Ode53.incipit	Μέγαν σε φρουρόν, και προστάτην…
ltx/gr_gr_cog/other.stnektariosparaklesis1:hoCA.Ode53.melody	@ltx/gr_gr_cog/he.h.m8:heHE.FotisonImas.name
ltx/gr_gr_cog/other.stnektariosparaklesis1:hoCA.Ode53.mode	@ltx/gr_gr_cog/miscellanea:misc.Mode8
ltx/gr_gr_cog/other.stnektariosparaklesis1:hoCA.Ode53.ode	@ltx/gr_gr_cog/miscellanea:misc.Ode5
ltx/gr_gr_cog/other.stnektariosparaklesis1:hoCA.Ode53.text	Μέγαν σε φρουρόν, και προστάτην Πάτερ όσιε, κεκτημένη η Μονή σου η σεπτή, εγκαυχάται τη ταχεία αντιλήψει σου.
ltx/gr_gr_cog/other.stnektariosparaklesis1:hoCA.Ode5T.incipit	άχραντε Αγνή, του Θεού Μήτερ…
ltx/gr_gr_cog/other.stnektariosparaklesis1:hoCA.Ode5T.melody	@ltx/gr_gr_cog/he.h.m8:heHE.FotisonImas.name
ltx/gr_gr_cog/other.stnektariosparaklesis1:hoCA.Ode5T.mode	@ltx/gr_gr_cog/miscellanea:misc.Mode8
ltx/gr_gr_cog/other.stnektariosparaklesis1:hoCA.Ode5T.ode	@ltx/gr_gr_cog/miscellanea:misc.Ode5
ltx/gr_gr_cog/other.stnektariosparaklesis1:hoCA.Ode5T.text	άχραντε Αγνή, του Θεού Μήτερ απείρανδρε, τους ελπίζοντας τη σκέπη σου αεί, ανωτέρους πάσης βλάβης διατήρησον.
ltx/gr_gr_cog/other.stnektariosparaklesis1:hoCA.Ode61.incipit	Σωμάτων, και τῶν ψυχών τας…
ltx/gr_gr_cog/other.stnektariosparaklesis1:hoCA.Ode61.melody	@ltx/gr_gr_cog/he.h.m8:heHE.TinDeisinEkcheo.name
ltx/gr_gr_cog/other.stnektariosparaklesis1:hoCA.Ode61.mode	@ltx/gr_gr_cog/miscellanea:misc.Mode8
ltx/gr_gr_cog/other.stnektariosparaklesis1:hoCA.Ode61.ode	@ltx/gr_gr_cog/miscellanea:misc.Ode6
ltx/gr_gr_cog/other.stnektariosparaklesis1:hoCA.Ode61.text	Σωμάτων, και τῶν ψυχών τας οδύνας, επικούφησον Νεκτάριε Πάτερ, τῶν προς την σην αφορώντων πρεσβείαν, και τας καρδίας ημών χαράς πλήρωσον, και αθυμίας χαλεπής, εξ ημών την ομίχλην διάλυσον.
ltx/gr_gr_cog/other.stnektariosparaklesis1:hoCA.Ode62.incipit	Ρυσθήναι, πειρατηρίων παντοίων, και σκανδάλων…
ltx/gr_gr_cog/other.stnektariosparaklesis1:hoCA.Ode62.melody	@ltx/gr_gr_cog/he.h.m8:heHE.TinDeisinEkcheo.name
ltx/gr_gr_cog/other.stnektariosparaklesis1:hoCA.Ode62.mode	@ltx/gr_gr_cog/miscellanea:misc.Mode8
ltx/gr_gr_cog/other.stnektariosparaklesis1:hoCA.Ode62.ode	@ltx/gr_gr_cog/miscellanea:misc.Ode6
ltx/gr_gr_cog/other.stnektariosparaklesis1:hoCA.Ode62.text	Ρυσθήναι, πειρατηρίων παντοίων, και σκανδάλων του εχθρού ολεθρίων, και αναγκών και στενώσεων πλείστων, τον Πανοικτίρμονα Λόγον ικέτευε, Νεκτάριε θαυματουργέ, τους προστρέχοντας πίστει τη σκέπη σου.
ltx/gr_gr_cog/other.stnektariosparaklesis1:hoCA.Ode63.incipit	Ὑψόθεν, ως συμπαθής εποπτεύων, και…
ltx/gr_gr_cog/other.stnektariosparaklesis1:hoCA.Ode63.melody	@ltx/gr_gr_cog/he.h.m8:heHE.TinDeisinEkcheo.name
ltx/gr_gr_cog/other.stnektariosparaklesis1:hoCA.Ode63.mode	@ltx/gr_gr_cog/miscellanea:misc.Mode8
ltx/gr_gr_cog/other.stnektariosparaklesis1:hoCA.Ode63.ode	@ltx/gr_gr_cog/miscellanea:misc.Ode6
ltx/gr_gr_cog/other.stnektariosparaklesis1:hoCA.Ode63.text	Ὑψόθεν, ως συμπαθής εποπτεύων, και απαύστως προστατεύων μη παύση, της ιεράς σου Μονής θεοφόρε, της κεκτημένης ως μέγα θυσαύρισμα, Νεκτάριε θαυματουργέ, την σορόν τῶν αγίων λειψάνων σου.
ltx/gr_gr_cog/other.stnektariosparaklesis1:hoCA.Ode6T.incipit	Σωτήρα, και Λυτρωτήν τῶν ανθρώπων…
ltx/gr_gr_cog/other.stnektariosparaklesis1:hoCA.Ode6T.melody	@ltx/gr_gr_cog/he.h.m8:heHE.TinDeisinEkcheo.name
ltx/gr_gr_cog/other.stnektariosparaklesis1:hoCA.Ode6T.mode	@ltx/gr_gr_cog/miscellanea:misc.Mode8
ltx/gr_gr_cog/other.stnektariosparaklesis1:hoCA.Ode6T.ode	@ltx/gr_gr_cog/miscellanea:misc.Ode6
ltx/gr_gr_cog/other.stnektariosparaklesis1:hoCA.Ode6T.text	Σωτήρα, και Λυτρωτήν τῶν ανθρώπων, τον φιλάνθρωπον κυήσασα Λόγον, σώσον με Κόρη τη ση προστασία, της πονηράς τυραννίδος του χείρονος, και νεύρωσόν μου την ψυχήν, προς επίδοσιν βίου βελτίονος.
ltx/gr_gr_cog/other.stnektariosparaklesis1:hoCA.Ode71.incipit	Αλγηδόνων ποικίλων, πειρασμών και κινδύνων…
ltx/gr_gr_cog/other.stnektariosparaklesis1:hoCA.Ode71.melody	@ltx/gr_gr_cog/he.h.m8:heHE.OiEkTisIoudaias.name
ltx/gr_gr_cog/other.stnektariosparaklesis1:hoCA.Ode71.mode	@ltx/gr_gr_cog/miscellanea:misc.Mode8
ltx/gr_gr_cog/other.stnektariosparaklesis1:hoCA.Ode71.ode	@ltx/gr_gr_cog/miscellanea:misc.Ode7
ltx/gr_gr_cog/other.stnektariosparaklesis1:hoCA.Ode71.text	Αλγηδόνων ποικίλων, πειρασμών και κινδύνων και περιστάσεων, και φθόνου και κακίας, ανθρώπων κακοτρόπων, ασινείς διαφύλαττε, τους σε τιμώντας αεί, Νεκτάριε παμμάκαρ.
ltx/gr_gr_cog/other.stnektariosparaklesis1:hoCA.Ode72.incipit	Ιατρεύων απαύστως, χαλεπάς ασθενείας Πάτερ…
ltx/gr_gr_cog/other.stnektariosparaklesis1:hoCA.Ode72.melody	@ltx/gr_gr_cog/he.h.m8:heHE.OiEkTisIoudaias.name
ltx/gr_gr_cog/other.stnektariosparaklesis1:hoCA.Ode72.mode	@ltx/gr_gr_cog/miscellanea:misc.Mode8
ltx/gr_gr_cog/other.stnektariosparaklesis1:hoCA.Ode72.ode	@ltx/gr_gr_cog/miscellanea:misc.Ode7
ltx/gr_gr_cog/other.stnektariosparaklesis1:hoCA.Ode72.text	Ιατρεύων απαύστως, χαλεπάς ασθενείας Πάτερ Νεκτάριε, τῶν πίστει προσιόντων, τοις θείοις σου λειψάνοις, αρωγός ετοιμότατος, εν τοις εσχάτοις καιροίς, τῶν ευσεβούντων ώφθης.
ltx/gr_gr_cog/other.stnektariosparaklesis1:hoCA.Ode73.incipit	Γέρας ένθεον ώφθης, και διάδημα…
ltx/gr_gr_cog/other.stnektariosparaklesis1:hoCA.Ode73.melody	@ltx/gr_gr_cog/he.h.m8:heHE.OiEkTisIoudaias.name
ltx/gr_gr_cog/other.stnektariosparaklesis1:hoCA.Ode73.mode	@ltx/gr_gr_cog/miscellanea:misc.Mode8
ltx/gr_gr_cog/other.stnektariosparaklesis1:hoCA.Ode73.ode	@ltx/gr_gr_cog/miscellanea:misc.Ode7
ltx/gr_gr_cog/other.stnektariosparaklesis1:hoCA.Ode73.text	Γέρας ένθεον ώφθης, και διάδημα νέον Πάτερ Νεκτάριε, τη νήσω της Αιγίνης, ήτις αεί προστρέχει, τη πρεσβεία σου άγιε, και της ευνοίας της σής, τρυγά τας αντιλήψεις.
ltx/gr_gr_cog/other.stnektariosparaklesis1:hoCA.Ode7T.incipit	Εντολών με προς τρίβον, του…
ltx/gr_gr_cog/other.stnektariosparaklesis1:hoCA.Ode7T.melody	@ltx/gr_gr_cog/he.h.m8:heHE.OiEkTisIoudaias.name
ltx/gr_gr_cog/other.stnektariosparaklesis1:hoCA.Ode7T.mode	@ltx/gr_gr_cog/miscellanea:misc.Mode8
ltx/gr_gr_cog/other.stnektariosparaklesis1:hoCA.Ode7T.ode	@ltx/gr_gr_cog/miscellanea:misc.Ode7
ltx/gr_gr_cog/other.stnektariosparaklesis1:hoCA.Ode7T.text	Εντολών με προς τρίβον, του εκ σου σαρκωθέντος, Κόρη οδήγησον, πυλών της αμαρτίας, εξαίρουσα Παρθένε, την ροπήν της καρδίας μου, ίνα υμνώ σε αεί, σωθείς τη χάριτί σου.
ltx/gr_gr_cog/other.stnektariosparaklesis1:hoCA.Ode81.incipit	Ρούν της κακίας, τον κατακλύζοντα…
ltx/gr_gr_cog/other.stnektariosparaklesis1:hoCA.Ode81.melody	@ltx/gr_gr_cog/he.h.m8:heHE.TonVasileaTonOuranon.name
ltx/gr_gr_cog/other.stnektariosparaklesis1:hoCA.Ode81.mode	@ltx/gr_gr_cog/miscellanea:misc.Mode8
ltx/gr_gr_cog/other.stnektariosparaklesis1:hoCA.Ode81.ode	@ltx/gr_gr_cog/miscellanea:misc.Ode8
ltx/gr_gr_cog/other.stnektariosparaklesis1:hoCA.Ode81.text	Ρούν της κακίας, τον κατακλύζοντα Πάτερ, της καρδίας μου τους αύλακας εις τέλος, ξήρανον δυνάμει, τῶν θείων πρεβειών σου.
ltx/gr_gr_cog/other.stnektariosparaklesis1:hoCA.Ode82.incipit	Ασθενειών σε, θεραπευτήν εγνωκότες, καταφεύγομεν…
ltx/gr_gr_cog/other.stnektariosparaklesis1:hoCA.Ode82.melody	@ltx/gr_gr_cog/he.h.m8:heHE.TonVasileaTonOuranon.name
ltx/gr_gr_cog/other.stnektariosparaklesis1:hoCA.Ode82.mode	@ltx/gr_gr_cog/miscellanea:misc.Mode8
ltx/gr_gr_cog/other.stnektariosparaklesis1:hoCA.Ode82.ode	@ltx/gr_gr_cog/miscellanea:misc.Ode8
ltx/gr_gr_cog/other.stnektariosparaklesis1:hoCA.Ode82.text	Ασθενειών σε, θεραπευτήν εγνωκότες, καταφεύγομεν τη Κάρα σου τη θεία, ίνα λυτρωθώμεν, μαστίγων επωδύνων.
ltx/gr_gr_cog/other.stnektariosparaklesis1:hoCA.Ode83.incipit	Σκέπε απαύστως, την σην Μονήν…
ltx/gr_gr_cog/other.stnektariosparaklesis1:hoCA.Ode83.melody	@ltx/gr_gr_cog/he.h.m8:heHE.TonVasileaTonOuranon.name
ltx/gr_gr_cog/other.stnektariosparaklesis1:hoCA.Ode83.mode	@ltx/gr_gr_cog/miscellanea:misc.Mode8
ltx/gr_gr_cog/other.stnektariosparaklesis1:hoCA.Ode83.ode	@ltx/gr_gr_cog/miscellanea:misc.Ode8
ltx/gr_gr_cog/other.stnektariosparaklesis1:hoCA.Ode83.text	Σκέπε απαύστως, την σην Μονήν την αγίαν, και πρυτάνευε αυτή τη ση πρεσβεία, Πάτερ Ιεράρχα, τας πατρικάς σου δόσεις.
ltx/gr_gr_cog/other.stnektariosparaklesis1:hoCA.Ode8T.incipit	ίασαι Κόρη, την ασθενούσαν ψυχήν…
ltx/gr_gr_cog/other.stnektariosparaklesis1:hoCA.Ode8T.melody	@ltx/gr_gr_cog/he.h.m8:heHE.TonVasileaTonOuranon.name
ltx/gr_gr_cog/other.stnektariosparaklesis1:hoCA.Ode8T.mode	@ltx/gr_gr_cog/miscellanea:misc.Mode8
ltx/gr_gr_cog/other.stnektariosparaklesis1:hoCA.Ode8T.ode	@ltx/gr_gr_cog/miscellanea:misc.Ode8
ltx/gr_gr_cog/other.stnektariosparaklesis1:hoCA.Ode8T.text	ίασαι Κόρη, την ασθενούσαν ψυχήν μου, τη του όφεως κακίστη επηρεία, και καταύσανόν με, φωτί της απαθείας.
ltx/gr_gr_cog/other.stnektariosparaklesis1:hoCA.Ode91.incipit	Μανίας ημάς ρύσαι, εχθρού του…
ltx/gr_gr_cog/other.stnektariosparaklesis1:hoCA.Ode91.melody	@ltx/gr_gr_cog/he.h.m8:heHE.KyriosTheotokon.name
ltx/gr_gr_cog/other.stnektariosparaklesis1:hoCA.Ode91.mode	@ltx/gr_gr_cog/miscellanea:misc.Mode8
ltx/gr_gr_cog/other.stnektariosparaklesis1:hoCA.Ode91.ode	@ltx/gr_gr_cog/miscellanea:misc.Ode9
ltx/gr_gr_cog/other.stnektariosparaklesis1:hoCA.Ode91.text	Μανίας ημάς ρύσαι, εχθρού του αοράτου, και τῶν εν βίω δεινών περιστάσεων, τους καταφεύγοντας Πάτερ, υπό την σκέπην σου.
ltx/gr_gr_cog/other.stnektariosparaklesis1:hoCA.Ode92.incipit	Οδύνης ψυχικής τε, και τῶν…
ltx/gr_gr_cog/other.stnektariosparaklesis1:hoCA.Ode92.melody	@ltx/gr_gr_cog/he.h.m8:heHE.KyriosTheotokon.name
ltx/gr_gr_cog/other.stnektariosparaklesis1:hoCA.Ode92.mode	@ltx/gr_gr_cog/miscellanea:misc.Mode8
ltx/gr_gr_cog/other.stnektariosparaklesis1:hoCA.Ode92.ode	@ltx/gr_gr_cog/miscellanea:misc.Ode9
ltx/gr_gr_cog/other.stnektariosparaklesis1:hoCA.Ode92.text	Οδύνης ψυχικής τε, και τῶν αλγημάτων, τῶν εν τω σώματι Πάτερ απάλλαξον, τη εκ Θεού σοι δοθείση πλοισία χάριτι.
ltx/gr_gr_cog/other.stnektariosparaklesis1:hoCA.Ode93.incipit	Υπέρ της ευγούς σου, Μάνδρας…
ltx/gr_gr_cog/other.stnektariosparaklesis1:hoCA.Ode93.melody	@ltx/gr_gr_cog/he.h.m8:heHE.KyriosTheotokon.name
ltx/gr_gr_cog/other.stnektariosparaklesis1:hoCA.Ode93.mode	@ltx/gr_gr_cog/miscellanea:misc.Mode8
ltx/gr_gr_cog/other.stnektariosparaklesis1:hoCA.Ode93.ode	@ltx/gr_gr_cog/miscellanea:misc.Ode9
ltx/gr_gr_cog/other.stnektariosparaklesis1:hoCA.Ode93.text	Υπέρ της ευγούς σου, Μάνδρας εκδυσώπει, και της Αιγίνης Χριστόν τον φιλάνθρωπον, και της Ελλάδος απάσης, Πάτερ Νεκτάριε.
ltx/gr_gr_cog/other.stnektariosparaklesis1:hoCA.Ode9T.incipit	Υμνούμεν σου την χάριν, Κεχαριτωμένη…
ltx/gr_gr_cog/other.stnektariosparaklesis1:hoCA.Ode9T.melody	@ltx/gr_gr_cog/he.h.m8:heHE.KyriosTheotokon.name
ltx/gr_gr_cog/other.stnektariosparaklesis1:hoCA.Ode9T.mode	@ltx/gr_gr_cog/miscellanea:misc.Mode8
ltx/gr_gr_cog/other.stnektariosparaklesis1:hoCA.Ode9T.ode	@ltx/gr_gr_cog/miscellanea:misc.Ode9
ltx/gr_gr_cog/other.stnektariosparaklesis1:hoCA.Ode9T.text	Υμνούμεν σου την χάριν, Κεχαριτωμένη, συ γαρ απαύστως ως μήτηρ φιλόστοργος, σκέπεις και τρέφεις και θάλπεις, ημάς εκάστοτε.
ltx/gr_gr_cog/other.stnektariosparaklesis1:hoCA.PostGospelBoth.incipit	@ltx/gr_gr_cog/ho.ho03:hoMA.PostGospelTheotokos.incipit
ltx/gr_gr_cog/other.stnektariosparaklesis1:hoCA.PostGospelBoth.melody	
ltx/gr_gr_cog/other.stnektariosparaklesis1:hoCA.PostGospelBoth.mode	@ltx/gr_gr_cog/miscellanea:misc.Mode2
ltx/gr_gr_cog/other.stnektariosparaklesis1:hoCA.PostGospelBoth.text	@ltx/gr_gr_cog/ho.ho03:hoMA.PostGospelTheotokos.text
ltx/gr_gr_cog/other.stnektariosparaklesis1:hoCA.PostGospelGlory.incipit	@ltx/gr_gr_cog/ho.ho03:hoMA.PostGospelHierarch.incipit
ltx/gr_gr_cog/other.stnektariosparaklesis1:hoCA.PostGospelGlory.melody	
ltx/gr_gr_cog/other.stnektariosparaklesis1:hoCA.PostGospelGlory.mode	@ltx/gr_gr_cog/miscellanea:misc.Mode2
ltx/gr_gr_cog/other.stnektariosparaklesis1:hoCA.PostGospelGlory.text	@ltx/gr_gr_cog/ho.ho03:hoMA.PostGospelHierarch.text
ltx/gr_gr_cog/other.stnektariosparaklesis1:hoCA.PostGospelHymn1.incipit	Νέον άστρον πέφηνας, τη του…
ltx/gr_gr_cog/other.stnektariosparaklesis1:hoCA.PostGospelHymn1.melody	@ltx/gr_gr_cog/he.a.m6:heAU.OlinApothemenoi.name
ltx/gr_gr_cog/other.stnektariosparaklesis1:hoCA.PostGospelHymn1.mode	@ltx/gr_gr_cog/miscellanea:misc.Mode6
ltx/gr_gr_cog/other.stnektariosparaklesis1:hoCA.PostGospelHymn1.text	Νέον άστρον πέφηνας, τη του Χριστού Εκκλησία, εν εσχάτοις έτεσι, βίου καθαρότητι λάμψας όσιε, νοηταίς λάμψεσι, τῶν εν σοι χαρίτων, καταυγάζων τας ψυχάς ημών, και τῶν ιάσεων, ταις μαρμαρυγαίς λύων πάντοτε, δαιμόνων την σκοτόμαιναν, και αῤῥωστημάτων την ζόφωσιν, όθεν σοι βοώμεν, μη παύση εκλυτρούμενος ημάς, επηρειών του αλάστωρος, και παντοίων θλίψεων.
ltx/gr_gr_cog/other.stnektariosparaklesis1:hoCA.Troparion1.incipit	Πάσιν αντιλήπτωρ και φρουρός, και…
ltx/gr_gr_cog/other.stnektariosparaklesis1:hoCA.Troparion1.melody	@ltx/gr_gr_cog/he.a.m2:heAU.OteEkTouXylou.name
ltx/gr_gr_cog/other.stnektariosparaklesis1:hoCA.Troparion1.mode	@ltx/gr_gr_cog/miscellanea:misc.Mode2
ltx/gr_gr_cog/other.stnektariosparaklesis1:hoCA.Troparion1.text	Πάσιν αντιλήπτωρ και φρουρός, και θερμός προστάτης και σκέπη, γενού Νεκτάριε, τοις προσερχομένοις σοι, Πάτερ εκ πίστεως, και τα θεία σου λείψανα, κατασπαζομένοις, ά Χριστός εδόξασε, θαυμάτων χάρισι, λύων πειρασμών τας οδύνας, και ειρήνην πάσι παρέχων, και πταισμάτων άνωθεν συγχώρησιν.
ltx/gr_gr_cog/other.stnektariosparaklesis1:hoCA.Troparion2.incipit	@ltx/gr_gr_cog/ho.ho23:hoCA.Troparion6.incipit
ltx/gr_gr_cog/other.stnektariosparaklesis1:hoCA.Troparion2.melody	
ltx/gr_gr_cog/other.stnektariosparaklesis1:hoCA.Troparion2.mode	@ltx/gr_gr_cog/miscellanea:misc.Mode2
ltx/gr_gr_cog/other.stnektariosparaklesis1:hoCA.Troparion2.text	@ltx/gr_gr_cog/ho.ho23:hoCA.Troparion6.text
ltx/gr_gr_cog/other.stnektariosparaklesis1:hoCA.Troparion3.incipit	@ltx/gr_gr_cog/ho.ho23:hoCA.Troparion7.incipit
ltx/gr_gr_cog/other.stnektariosparaklesis1:hoCA.Troparion3.melody	
ltx/gr_gr_cog/other.stnektariosparaklesis1:hoCA.Troparion3.mode	@ltx/gr_gr_cog/miscellanea:misc.Mode2
ltx/gr_gr_cog/other.stnektariosparaklesis1:hoCA.Troparion3.text	@ltx/gr_gr_cog/ho.ho23:hoCA.Troparion7.text
ltx/gr_gr_cog/other.stnektariosparaklesis1:hoCA.Troparion31.incipit	Διάσωσον εκ πάσης βλάβης και…
ltx/gr_gr_cog/other.stnektariosparaklesis1:hoCA.Troparion31.melody	
ltx/gr_gr_cog/other.stnektariosparaklesis1:hoCA.Troparion31.mode	@ltx/gr_gr_cog/miscellanea:misc.Mode8
ltx/gr_gr_cog/other.stnektariosparaklesis1:hoCA.Troparion31.text	Διάσωσον εκ πάσης βλάβης και θλίψεως Ιεράρχα, τους εν πίστει τη ση πρεσβεία προστρέχοντας, και σε τιμώντας Νεκτάριε θεοφόρε.
ltx/gr_gr_cog/other.stnektariosparaklesis1:hoCA.Troparion32.incipit	@ltx/gr_gr_cog/ho.ho23:hoCA.Troparion32.incipit
ltx/gr_gr_cog/other.stnektariosparaklesis1:hoCA.Troparion32.melody	
ltx/gr_gr_cog/other.stnektariosparaklesis1:hoCA.Troparion32.mode	@ltx/gr_gr_cog/miscellanea:misc.Mode8
ltx/gr_gr_cog/other.stnektariosparaklesis1:hoCA.Troparion32.text	@ltx/gr_gr_cog/ho.ho23:hoCA.Troparion32.text
ltx/gr_gr_cog/other.stnektariosparaklesis1:hoCA.Troparion61.incipit	@ltx/gr_gr_cog/other.stnektariosparaklesis1:hoCA.Troparion31.incipit
ltx/gr_gr_cog/other.stnektariosparaklesis1:hoCA.Troparion61.melody	
ltx/gr_gr_cog/other.stnektariosparaklesis1:hoCA.Troparion61.mode	@ltx/gr_gr_cog/miscellanea:misc.Mode8
ltx/gr_gr_cog/other.stnektariosparaklesis1:hoCA.Troparion61.text	@ltx/gr_gr_cog/other.stnektariosparaklesis1:hoCA.Troparion31.text
ltx/gr_gr_cog/other.stnektariosparaklesis1:hoCA.Troparion62.incipit	@ltx/gr_gr_cog/ho.ho23:hoCA.Troparion62.incipit
ltx/gr_gr_cog/other.stnektariosparaklesis1:hoCA.Troparion62.melody	
ltx/gr_gr_cog/other.stnektariosparaklesis1:hoCA.Troparion62.mode	@ltx/gr_gr_cog/miscellanea:misc.Mode8
ltx/gr_gr_cog/other.stnektariosparaklesis1:hoCA.Troparion62.text	@ltx/gr_gr_cog/ho.ho23:hoCA.Troparion62.text
ltx/gr_gr_cog/other.stnektariosparaklesis1:hoCA.acrostic	οὗ ἡ Ἀκροστιχίς· «Παθῶν, Νεκτάριε, ἡμᾶς ῥῦσαι. Γερασίμου».
ltx/gr_gr_cog/other.stnektariosparaklesis1:hoCA.couplet1.title	@ltx/gr_gr_cog/titles:ti.Couplet
ltx/gr_gr_cog/other.stnektariosparaklesis1:hoCA.couplet1.verse1	Ἐλευθερίαν μοι παθῶν, Νεκτάριε, παράσχου
ltx/gr_gr_cog/other.stnektariosparaklesis1:hoCA.couplet1.verse2	ἀγγελωνύμῳ οὐ τρόπῳ σὴν βοήθειαν ζητούντι.
ltx/gr_gr_cog/other.stnektariosparaklesis1:hoCA.media.text	
ltx/gr_gr_cog/other.stnektariosparaklesis1:hoCA.poet	@ltx/gr_gr_cog/poets:po.GerasimouMonachouMikragiannanitou
ltx/gr_gr_cog/other.stnektariosparaklesis1:hoCA.title	ΠΑΡΑΚΛΗΤΙΚΟΣ ΚΑΝΩΝ
ltx/gr_gr_cog/other.stnektariosparaklesis1:hoCA.title2	ΑΓΙΟΥ ΝΕΚΤΑΡΙΟΥ
ltx/gr_gr_cog/other.stnektariosparaklesis1:hoCA.translator	
ltx/gr_gr_cog/other.stnektariosparaklesis1:hoCA.verse	@ltx/gr_gr_cog/prayers:pr.verse_SaintM.text
