ltx/gr_gr_cog/me.m01.d11:meDA.commemoration.first	Μνήμη τοῦ Ὁσίου Θεοδοσίου τοῦ Κοινοβιάρχου
ltx/gr_gr_cog/me.m01.d11:meDA.commemoration.first_name	
ltx/gr_gr_cog/me.m01.d11:meDA.commemoration.first_short	Μνήμη τοῦ Ὁσίου Θεοδοσίου τοῦ Κοινοβιάρχου
ltx/gr_gr_cog/me.m01.d11:meDA.commemoration.first_title	@ltx/gr_gr_cog/titles:ti.SaintM
ltx/gr_gr_cog/me.m01.d11:meDA.commemoration.full	Μνήμη τοῦ Ὁσίου Πατρὸς ἡμῶν Θεοδοσίου τοῦ Κοινοβιάρχου
ltx/gr_gr_cog/me.m01.d11:meDA.commemoration.second_name	
ltx/gr_gr_cog/me.m01.d11:meDA.commemoration.second_title	
ltx/gr_gr_cog/me.m01.d11:meDA.date	Τῌ ΙΑʹ ΙΑΝΟΥΑΡΙΟΥ
ltx/gr_gr_cog/me.m01.d11:meDA.dismissal	@ltx/gr_gr_cog/dismissals:dis00.epiphany
ltx/gr_gr_cog/me.m01.d11:meDA.fordate	διὰ τὴν 11ην Ἰανουαρίου
ltx/gr_gr_cog/me.m01.d11:meDA.insert1	καὶ τοῦ Ὁσίου Πατρὸς ἡμῶν Θεοδοσίου τοῦ Κοινοβιάρχου,
ltx/gr_gr_cog/me.m01.d11:meDA.insert2	οὗ καὶ τὴν μνήμην ἐπιτελοῦμεν·
ltx/gr_gr_cog/me.m01.d11:meDA.note	
ltx/gr_gr_cog/me.m01.d11:meDA.pdfcoverdate	τῆς 11ης Ἰανουαρίου,
ltx/gr_gr_cog/me.m01.d11:meDA.pdfheaderdate	τῆς 11ης Ἰανουαρίου
ltx/gr_gr_cog/me.m01.d11:meHO.commemorations	
ltx/gr_gr_cog/me.m01.d11:meHO.note1	@ltx/gr_gr_cog/rubrical:ru.WineOil
ltx/gr_gr_cog/me.m01.d11:meHO.note2	
ltx/gr_gr_cog/me.m01.d11:meHO.number	11.
ltx/gr_gr_cog/me.m01.d11:meHO.rank	
ltx/gr_gr_cog/me.m01.d11:meLE.commemoration1	Μνήμη τοῦ Ὁσίου Πατρὸς ἡμῶν Θεοδοσίου τοῦ Κοινοβιάρχου.
ltx/gr_gr_cog/me.m01.d11:meLE.commemoration2	
ltx/gr_gr_cog/me.m01.d11:meLI.Kontakion1.greekmelody	@ltx/gr_gr_cog/me.m01.d11:meMA.Kontakion1.greekmelody
ltx/gr_gr_cog/me.m01.d11:meLI.Kontakion1.incipit	@ltx/gr_gr_cog/me.m01.d11:meMA.Kontakion1.incipit
ltx/gr_gr_cog/me.m01.d11:meLI.Kontakion1.melody	@ltx/gr_gr_cog/me.m01.d11:meMA.Kontakion1.melody
ltx/gr_gr_cog/me.m01.d11:meLI.Kontakion1.mode	@ltx/gr_gr_cog/me.m01.d11:meMA.Kontakion1.mode
ltx/gr_gr_cog/me.m01.d11:meLI.Kontakion1.text	@ltx/gr_gr_cog/me.m01.d11:meMA.Kontakion1.text
ltx/gr_gr_cog/me.m01.d11:meLI.MM.CommunionHymn.text	@ltx/gr_gr_cog/properties:media.key
ltx/gr_gr_cog/me.m01.d11:meLI.Megalynarion.text	Δόσιν θεοδώρητον εἰληφώς, δόσεσιν ὁσίοις, τὰς χορείας τῶν μοναστῶν, ἱερῶς ῥυθμίσας, δοτοὺς Θεῷ προσῆξας τοὺς σοὶ ἐφεπομένους, ὦ Θεοδόσιε.
ltx/gr_gr_cog/me.m01.d11:meMA.C1.title	@ltx/gr_gr_cog/titles:ti.CanonDevoutM
ltx/gr_gr_cog/me.m01.d11:meMA.C1.verse	@ltx/gr_gr_cog/prayers:pr.verse_SaintM.text
ltx/gr_gr_cog/me.m01.d11:meMA.Exaposteilarion1.greekmelody	@ltx/gr_gr_cog/he.a.m2:heAU.GynaikesAkoutisthite.greekname
ltx/gr_gr_cog/me.m01.d11:meMA.Exaposteilarion1.incipit	Τὸν νοῦν καθάρας Ὅσιε, τῆς…
ltx/gr_gr_cog/me.m01.d11:meMA.Exaposteilarion1.melody	@ltx/gr_gr_cog/he.a.m2:heAU.GynaikesAkoutisthite.name
ltx/gr_gr_cog/me.m01.d11:meMA.Exaposteilarion1.mode	@ltx/gr_gr_cog/miscellanea:misc.Mode2
ltx/gr_gr_cog/me.m01.d11:meMA.Exaposteilarion1.text	Τὸν νοῦν καθάρας Ὅσιε, τῆς τῶν παθῶν συγχύσεως, τρανῶς ἐδέξω τὰς θείας, ἐμφάσεις τῆς ὑπερφώτου, καὶ τριλαμποῦς Θεότητος, παμμάκαρ Θεοδόσιε, τῶν ἀσκητῶν ἀγλάϊσμα· καὶ νῦν πρεσβεύων μὴ παύσῃ, ὑπὲρ ἡμῶν θεοφόρε.
ltx/gr_gr_cog/me.m01.d11:meMA.Exaposteilarion2.greekmelody	@ltx/gr_gr_cog/he.a.m2:heAU.GynaikesAkoutisthite.greekname
ltx/gr_gr_cog/me.m01.d11:meMA.Exaposteilarion2.incipit	Βαβαὶ τῶν θείων ἔργων σου…
ltx/gr_gr_cog/me.m01.d11:meMA.Exaposteilarion2.melody	@ltx/gr_gr_cog/he.a.m2:heAU.GynaikesAkoutisthite.name
ltx/gr_gr_cog/me.m01.d11:meMA.Exaposteilarion2.mode	@ltx/gr_gr_cog/miscellanea:misc.Mode2
ltx/gr_gr_cog/me.m01.d11:meMA.Exaposteilarion2.text	Βαβαὶ τῶν θείων ἔργων σου, Σωτήρ μου παντοδύναμε! Θεὸς γὰρ ὢν πρὸ αἰώνων, Παρθένου μήτραν ὑπέδυς, καὶ σὰρξ ἀτρέπτως γέγονας, καὶ ὕδασιν ἀπέπλυνας, τοῦ Ἰορδάνου Δέσποτα, βροτῶν τὴν φύσιν τοῦ ῥύπου, τῶν ψυχικῶν ἁμαρτάδων.
ltx/gr_gr_cog/me.m01.d11:meMA.Kathisma11.greekmelody	@ltx/gr_gr_cog/he.a.m4:heAU.KateplagiIosif.greekname
ltx/gr_gr_cog/me.m01.d11:meMA.Kathisma11.incipit	@ltx/gr_gr_cog/me.m01.d08:meMA.Kathisma11.incipit
ltx/gr_gr_cog/me.m01.d11:meMA.Kathisma11.melody	@ltx/gr_gr_cog/he.a.m4:heAU.KateplagiIosif.name
ltx/gr_gr_cog/me.m01.d11:meMA.Kathisma11.mode	@ltx/gr_gr_cog/miscellanea:misc.Mode4
ltx/gr_gr_cog/me.m01.d11:meMA.Kathisma11.text	@ltx/gr_gr_cog/me.m01.d08:meMA.Kathisma11.text
ltx/gr_gr_cog/me.m01.d11:meMA.Kathisma21.greekmelody	@ltx/gr_gr_cog/he.a.m4:heAU.KateplagiIosif.greekname
ltx/gr_gr_cog/me.m01.d11:meMA.Kathisma21.incipit	@ltx/gr_gr_cog/me.m01.d10:meMA.Kathisma21.incipit
ltx/gr_gr_cog/me.m01.d11:meMA.Kathisma21.melody	@ltx/gr_gr_cog/he.a.m4:heAU.KateplagiIosif.name
ltx/gr_gr_cog/me.m01.d11:meMA.Kathisma21.mode	@ltx/gr_gr_cog/miscellanea:misc.Mode4
ltx/gr_gr_cog/me.m01.d11:meMA.Kathisma21.text	@ltx/gr_gr_cog/me.m01.d10:meMA.Kathisma21.text
ltx/gr_gr_cog/me.m01.d11:meMA.Kathisma31.greekmelody	@ltx/gr_gr_cog/he.a.m3:heAU.TheiasPisteos.greekname
ltx/gr_gr_cog/me.m01.d11:meMA.Kathisma31.incipit	Θείας αἴρων σου χεῖρας πρὸς…
ltx/gr_gr_cog/me.m01.d11:meMA.Kathisma31.melody	@ltx/gr_gr_cog/he.a.m3:heAU.TheiasPisteos.name
ltx/gr_gr_cog/me.m01.d11:meMA.Kathisma31.mode	@ltx/gr_gr_cog/miscellanea:misc.Mode3
ltx/gr_gr_cog/me.m01.d11:meMA.Kathisma31.text	Θείας αἴρων σου χεῖρας πρὸς ὕψος, στῦλος Ὅσιε φωσφόρος ὤφθης, τῶν προσευχῶν ἐν ταῖς ἀκτῖσι λαμπόμενος· πρὸς οὐρανὸν γὰρ πτερώσας διάνοιαν, καὶ τῶν ἀῤῥήτων γενόμενος μέτοχος, ὅλος ἤστραψας, Χριστὸν τὸν Θεὸν αἰτούμενος, δωρήσασθαι ἡμῖν τὸ μέγα ἔλεος.
ltx/gr_gr_cog/me.m01.d11:meMA.Kathisma32.greekmelody	@ltx/gr_gr_cog/he.a.m3:heAU.IParthenosSimeron.greekname
ltx/gr_gr_cog/me.m01.d11:meMA.Kathisma32.incipit	@ltx/gr_gr_cog/me.m01.d10:meMA.Kathisma11.incipit
ltx/gr_gr_cog/me.m01.d11:meMA.Kathisma32.melody	@ltx/gr_gr_cog/he.a.m3:heAU.IParthenosSimeron.name
ltx/gr_gr_cog/me.m01.d11:meMA.Kathisma32.mode	@ltx/gr_gr_cog/miscellanea:misc.Mode3
ltx/gr_gr_cog/me.m01.d11:meMA.Kathisma32.text	@ltx/gr_gr_cog/me.m01.d10:meMA.Kathisma11.text
ltx/gr_gr_cog/me.m01.d11:meMA.Kontakion1.greekmelody	@ltx/gr_gr_cog/he.a.m8:heAU.TiYpermacho.greekname
ltx/gr_gr_cog/me.m01.d11:meMA.Kontakion1.incipit	Πεφυτευμένος ἐν αὐλαῖς ταῖς τοῦ…
ltx/gr_gr_cog/me.m01.d11:meMA.Kontakion1.melody	@ltx/gr_gr_cog/he.a.m8:heAU.TiYpermacho.name
ltx/gr_gr_cog/me.m01.d11:meMA.Kontakion1.mode	@ltx/gr_gr_cog/miscellanea:misc.Mode8
ltx/gr_gr_cog/me.m01.d11:meMA.Kontakion1.text	Πεφυτευμένος ἐν αὐλαῖς ταῖς τοῦ Κυρίου σου, τὰς φανοτάτας ἀρετὰς τερπνῶς ἐξήνθησας, καὶ ἐπλήθυνας τὰ τέκνα σου ἐν ἐρήμῳ, τῶν δακρύων σου τοῖς ὄμβροις ἀρδευόμενα, ἀγελάρχα τῶν Θεοῦ θείων ἐπαύλεων· ὅθεν κράζομεν· Χαίροις Πάτερ Θεοδόσιε.
ltx/gr_gr_cog/me.m01.d11:meMA.Lauds1.greekmelody	@ltx/gr_gr_cog/he.a.m5:heAU.ChairoisAskitikon.greekname
ltx/gr_gr_cog/me.m01.d11:meMA.Lauds1.incipit	Οἶκον τῶν ἱερῶν ἀρετῶν, προκαταστήσας…
ltx/gr_gr_cog/me.m01.d11:meMA.Lauds1.melody	@ltx/gr_gr_cog/he.a.m5:heAU.ChairoisAskitikon.name
ltx/gr_gr_cog/me.m01.d11:meMA.Lauds1.mode	@ltx/gr_gr_cog/miscellanea:misc.Mode5
ltx/gr_gr_cog/me.m01.d11:meMA.Lauds1.text	Οἶκον τῶν ἱερῶν ἀρετῶν, προκαταστήσας σεαυτὸν Θεοδόσιε, τὸν θεῖον τῆς Θεοτόκου, κατηξιώθης ναόν, κατοικεῖν καὶ τοῦτον ἐπισκέπτεσθαι· Θεοῦ τὴν λαμπρότητα, θεωρεῖν γὰρ ἠγάπησας· τῆς ἀληθοῦς δέ, νῦν σκηνῆς τὴν εὐπρέπειαν, καὶ τὴν ἄφραστον, καθορᾷς ὡραιότητα· ἥν περ ἐθεμελίωσεν, ὁ Ὕψιστος Ὅσιε, καὶ κατοικίζει προθύμως, τοὺς πρὸς αὐτὸν ἀνανεύοντας. Αὐτὸν δωρηθῆναι, ταῖς ψυχαῖς ἡμῶν δυσώπει, τὸ μέγα ἔλεος.
ltx/gr_gr_cog/me.m01.d11:meMA.Lauds2.incipit	Πόνοις ἀσκητικοῖς σεαυτόν, ἀνακαθάρας μιμητὴς…
ltx/gr_gr_cog/me.m01.d11:meMA.Lauds2.melody	@ltx/gr_gr_cog/he.a.m5:heAU.ChairoisAskitikon.name
ltx/gr_gr_cog/me.m01.d11:meMA.Lauds2.mode	@ltx/gr_gr_cog/miscellanea:misc.Mode5
ltx/gr_gr_cog/me.m01.d11:meMA.Lauds2.text	Πόνοις ἀσκητικοῖς σεαυτόν, ἀνακαθάρας μιμητὴς ἐχρημάτισας, παμμάκαρ, τοῦ σοῦ Δεσπότου· τῆς γὰρ κρασπέδων τῶν σῶν, ἁψαμένης πάθος ἐθεράπευσας· λιμῷ τηκομένους, ἐν τῇ ἐρήμῳ δὲ ἔθρεψας, ἐξ ἀκενώτου, χορηγῶν θησαυρίσματος, ὡς φερώνυμος, Θεοῦ δόσις γενόμενος. Πίστιν δὲ τὴν ὀρθόδοξον, ἐκήρυξας Ὅσιε, τὴν τοῦ τυράννου μανίαν, ἀντʼ οὐδενὸς λογισάμενος, Χριστὸν ἱκετεύων, ταῖς ψυχαῖς ἡμῶν δοθῆναι, τὸ μέγα ἔλεος.
ltx/gr_gr_cog/me.m01.d11:meMA.Lauds3.incipit	Φλόγα τῆς πρὸς Θεὸν ἀκλινοῦς…
ltx/gr_gr_cog/me.m01.d11:meMA.Lauds3.melody	@ltx/gr_gr_cog/he.a.m5:heAU.ChairoisAskitikon.name
ltx/gr_gr_cog/me.m01.d11:meMA.Lauds3.mode	@ltx/gr_gr_cog/miscellanea:misc.Mode5
ltx/gr_gr_cog/me.m01.d11:meMA.Lauds3.text	Φλόγα τῆς πρὸς Θεὸν ἀκλινοῦς, καὶ διαπύρου καὶ θερμῆς ἀγαπήσεως, ἐξάψας τὸν οὐρανόθεν, ἀντεκομίσω πυρσόν, εὐδοκίαν θείαν σοι μηνύοντα, ναὸν ἁγιώτατον, ἀρετῆς παιδευτήριον, οἰκοδομῆσαι, καὶ ψυχῶν φροντιστήριον· ὃν ἀρξάμενος, εὐσεβῶς ἐτελείωσας· ἔνθα καὶ τὸ πολύαθλον, κατάκειται σῶμά σου, θήκαις ὁσίαις Παμμάκαρ, διαφερόντως τιμώμενον. Χριστὸν δωρηθῆναι, ταῖς ψυχαῖς ἡμῶν δυσώπει, τὸ μέγα ἔλεος.
ltx/gr_gr_cog/me.m01.d11:meMA.Lauds4.greekmelody	@ltx/gr_gr_cog/he.a.m5:heAU.ChairoisAskitikon.greekname
ltx/gr_gr_cog/me.m01.d11:meMA.Lauds4.incipit	Ὄντως ἕως σκηνῆς θαυμαστῆς, ἕως…
ltx/gr_gr_cog/me.m01.d11:meMA.Lauds4.melody	@ltx/gr_gr_cog/he.a.m5:heAU.ChairoisAskitikon.name
ltx/gr_gr_cog/me.m01.d11:meMA.Lauds4.mode	@ltx/gr_gr_cog/miscellanea:misc.Mode5
ltx/gr_gr_cog/me.m01.d11:meMA.Lauds4.text	Ὄντως ἕως σκηνῆς θαυμαστῆς, ἕως τοῦ οἴκου τοῦ Θεοῦ Θεοδόσιε, διῆλθες ἀγαλλιάσει, καὶ εὐφροσύνῃ ψυχῆς, ἔνθα ἦχος Πάτερ ἑορτάζοντος, τερπνῆς ἀκουσάμενος, καὶ γλυκείας ὑμνήσεως, καὶ τῆς ἀφράστου, θυμηδίας καὶ τέρψεως, γενησόμενος, ἐν μεθέξει μακάριε, ἧς μόνης ἐφιέμενος, τὴν σάρκα ἐνέκρωσας, ἧς καὶ ἐπέτυχες θείᾳ, δικαιοσύνῃ κοσμούμενος, Χριστὸν ἱκετεύων, ταῖς ψυχαῖς ἡμῶν δοθῆναι, τὸ μέγα ἔλεος.
ltx/gr_gr_cog/me.m01.d11:meMA.LaudsBoth.incipit	@ltx/gr_gr_cog/me.m01.d06:meMA.LaudsBoth.incipit
ltx/gr_gr_cog/me.m01.d11:meMA.LaudsBoth.melody	
ltx/gr_gr_cog/me.m01.d11:meMA.LaudsBoth.mode	@ltx/gr_gr_cog/miscellanea:misc.Mode2
ltx/gr_gr_cog/me.m01.d11:meMA.LaudsBoth.poet	@ltx/gr_gr_cog/poets:po.Anatoliou
ltx/gr_gr_cog/me.m01.d11:meMA.LaudsBoth.text	@ltx/gr_gr_cog/me.m01.d06:meMA.LaudsBoth.text
ltx/gr_gr_cog/me.m01.d11:meMA.LaudsGlory.incipit	Τῶν ἀρετῶν ἡ κλῖμαξ, ὑπογραμμὸς…
ltx/gr_gr_cog/me.m01.d11:meMA.LaudsGlory.melody	
ltx/gr_gr_cog/me.m01.d11:meMA.LaudsGlory.mode	@ltx/gr_gr_cog/miscellanea:misc.Mode2
ltx/gr_gr_cog/me.m01.d11:meMA.LaudsGlory.poet	@ltx/gr_gr_cog/poets:po.Anatoliou
ltx/gr_gr_cog/me.m01.d11:meMA.LaudsGlory.text	Τῶν ἀρετῶν ἡ κλῖμαξ, ὑπογραμμὸς ἀνεδείχθη τοῖς ἐπὶ γῆς· τοῦτον εὐφημήσωμεν, ὡς ἀσκητῶν ἐγκαλλώπισμα· ἑξασκήσας γὰρ ἀληθῶς, ὥσπερ ὁ μέγας Ἀντώνιος, ἄμετρον ταπείνωσιν ἐνδειξάμενος, καὶ ποιμάνας τὸν λαὸν αὐτοῦ εὐσεβῶς εἰς μάνδραν ἁγίαν ἐνήλασεν, οὗ ὁ χορὸς τῶν Ἁγίων καθέστηκεν. Ἐκτενῶς οὖν βοῶμεν· Μὴ ἐπιλάθῃ, καὶ νῦν τῆς ποίμνης σου, παμμάκαρ Θεοδόσιε, ἀλλὰ πρεσβείαις σου πρὸς Κύριον, σῶσον ἡμᾶς δεόμεθα.
ltx/gr_gr_cog/me.m01.d11:meMA.Ode1C11.greekmelody	@ltx/gr_gr_cog/he.h.m2:heHE.EnVythoKatestrose.greekname
ltx/gr_gr_cog/me.m01.d11:meMA.Ode1C11.incipit	Ὡς σοφὸς ταξίαρχος ἡμῶν, Πάτερ…
ltx/gr_gr_cog/me.m01.d11:meMA.Ode1C11.melody	@ltx/gr_gr_cog/he.h.m2:heHE.EnVythoKatestrose.name
ltx/gr_gr_cog/me.m01.d11:meMA.Ode1C11.mode	@ltx/gr_gr_cog/miscellanea:misc.Mode2
ltx/gr_gr_cog/me.m01.d11:meMA.Ode1C11.ode	@ltx/gr_gr_cog/miscellanea:misc.Ode1
ltx/gr_gr_cog/me.m01.d11:meMA.Ode1C11.text	Ὡς σοφὸς ταξίαρχος ἡμῶν, Πάτερ Θεοδόσιε, θεοπρεπῶς τὴν ᾠδὴν προανάκρουσον, τῷ ἐπιδημήσαντι, εἰς παγκόσμιον σωτηρίαν Χριστῷ τῷ Θεῷ, καὶ τὴν παναγίαν μνήμην σου, σὺν ἑαυτῷ δοξάσαντι.
ltx/gr_gr_cog/me.m01.d11:meMA.Ode1C12.incipit	Ἐξ ἐρήμου Πρόδρομος Χριστοῦ, τῆς…
ltx/gr_gr_cog/me.m01.d11:meMA.Ode1C12.melody	@ltx/gr_gr_cog/he.h.m2:heHE.EnVythoKatestrose.name
ltx/gr_gr_cog/me.m01.d11:meMA.Ode1C12.mode	@ltx/gr_gr_cog/miscellanea:misc.Mode2
ltx/gr_gr_cog/me.m01.d11:meMA.Ode1C12.ode	@ltx/gr_gr_cog/miscellanea:misc.Ode1
ltx/gr_gr_cog/me.m01.d11:meMA.Ode1C12.text	Ἐξ ἐρήμου Πρόδρομος Χριστοῦ, τῆς Ἀαρωνίτιδος, ὁ Ἐλισάβετ βλαστὸς προελήλυθεν, ἐν τῇ Κολυμβήθρᾳ δέ, Θεοδόσιος γεννηθεὶς διὰ Πνεύματος, ἐρημοπολίτης γέγονε, τῷ Ἰησοῦ ἑπόμενος.
ltx/gr_gr_cog/me.m01.d11:meMA.Ode1C13.incipit	Βαπτισθέντος ῥείθροις τοῦ Χριστοῦ, τῆς…
ltx/gr_gr_cog/me.m01.d11:meMA.Ode1C13.melody	@ltx/gr_gr_cog/he.h.m2:heHE.EnVythoKatestrose.name
ltx/gr_gr_cog/me.m01.d11:meMA.Ode1C13.mode	@ltx/gr_gr_cog/miscellanea:misc.Mode2
ltx/gr_gr_cog/me.m01.d11:meMA.Ode1C13.ode	@ltx/gr_gr_cog/miscellanea:misc.Ode1
ltx/gr_gr_cog/me.m01.d11:meMA.Ode1C13.text	Βαπτισθέντος ῥείθροις τοῦ Χριστοῦ, τῆς Ἰσραηλίτιδος, συναγωγῆς καθαιρεῖται τὸ φρύαγμα, ἐν τῇ Ἐκκλησίᾳ δέ, ἡ ἰσάγγελος πολιτεία πεφύτευται· ἣν ἀνεπιστρόφως ἤνυσας, παμμάκαρ Θεοδόσιε.
ltx/gr_gr_cog/me.m01.d11:meMA.Ode1C14.incipit	Κοινωνὸς τοῦ πάθους γεγονώς, Πάτερ…
ltx/gr_gr_cog/me.m01.d11:meMA.Ode1C14.melody	@ltx/gr_gr_cog/he.h.m2:heHE.EnVythoKatestrose.name
ltx/gr_gr_cog/me.m01.d11:meMA.Ode1C14.mode	@ltx/gr_gr_cog/miscellanea:misc.Mode2
ltx/gr_gr_cog/me.m01.d11:meMA.Ode1C14.ode	@ltx/gr_gr_cog/miscellanea:misc.Ode1
ltx/gr_gr_cog/me.m01.d11:meMA.Ode1C14.text	Κοινωνὸς τοῦ πάθους γεγονώς, Πάτερ διʼ ἀσκήσεως, τοῦ διʼ ἡμᾶς τῷ Σταυρῷ ὁμιλήσαντος, ἐπαξίως σύμμορφος, ἐχρημάτισας τῆς αὐτοῦ ἀναστάσεως, καὶ συγκληρονόμος γέγονας, τῆς δόξης Θεοδόσιε.
ltx/gr_gr_cog/me.m01.d11:meMA.Ode1C1T.incipit	Νεανίδων θείων ὁ χορός, ἐνθεαστικώτατα…
ltx/gr_gr_cog/me.m01.d11:meMA.Ode1C1T.melody	@ltx/gr_gr_cog/he.h.m2:heHE.EnVythoKatestrose.name
ltx/gr_gr_cog/me.m01.d11:meMA.Ode1C1T.mode	@ltx/gr_gr_cog/miscellanea:misc.Mode2
ltx/gr_gr_cog/me.m01.d11:meMA.Ode1C1T.ode	@ltx/gr_gr_cog/miscellanea:misc.Ode1
ltx/gr_gr_cog/me.m01.d11:meMA.Ode1C1T.text	Νεανίδων θείων ὁ χορός, ἐνθεαστικώτατα, ἐν γυναιξί σε καλὴν ᾀσματίζουσι, Θεοτόκε Δέσποινα, καλλοναῖς ὡραϊζομένην θεότητος· τὸν καλλοποιὸν γὰρ Λόγον, ὑπὲρ λόγον ἀπεκύησας.
ltx/gr_gr_cog/me.m01.d11:meMA.Ode3C11.greekmelody	@ltx/gr_gr_cog/he.h.m2:heHE.ExinthisenIErimos.greekname
ltx/gr_gr_cog/me.m01.d11:meMA.Ode3C11.incipit	Ὁ ὕδασι στεγάζων, τὰ ὑπερῷα…
ltx/gr_gr_cog/me.m01.d11:meMA.Ode3C11.melody	@ltx/gr_gr_cog/he.h.m2:heHE.ExinthisenIErimos.name
ltx/gr_gr_cog/me.m01.d11:meMA.Ode3C11.mode	@ltx/gr_gr_cog/miscellanea:misc.Mode2
ltx/gr_gr_cog/me.m01.d11:meMA.Ode3C11.ode	@ltx/gr_gr_cog/miscellanea:misc.Ode3
ltx/gr_gr_cog/me.m01.d11:meMA.Ode3C11.text	Ὁ ὕδασι στεγάζων, τὰ ὑπερῷα Κύριος σωματικῶς τὰ ῥεῖθρα, τοῦ Ἰορδάνου περιεβάλετο, ἐν ᾧ ἐστερεώθη ἡ καρδία μου.
ltx/gr_gr_cog/me.m01.d11:meMA.Ode3C12.incipit	Ὁ φῶς ἐν Ἰορδάνῃ, τὸ…
ltx/gr_gr_cog/me.m01.d11:meMA.Ode3C12.melody	@ltx/gr_gr_cog/he.h.m2:heHE.ExinthisenIErimos.name
ltx/gr_gr_cog/me.m01.d11:meMA.Ode3C12.mode	@ltx/gr_gr_cog/miscellanea:misc.Mode2
ltx/gr_gr_cog/me.m01.d11:meMA.Ode3C12.ode	@ltx/gr_gr_cog/miscellanea:misc.Ode3
ltx/gr_gr_cog/me.m01.d11:meMA.Ode3C12.text	Ὁ φῶς ἐν Ἰορδάνῃ, τὸ θεῖον λάμψας βλάστημα, τοῖς ἐπὶ γῆς θεόσδοτον, εὐλογίας καὶ προαιρέσεως, ἀγαθῆς σε προφαίνει Θεοδόσιε.
ltx/gr_gr_cog/me.m01.d11:meMA.Ode3C13.incipit	Κατέλιπες τὸν κόσμον, καὶ τὰ…
ltx/gr_gr_cog/me.m01.d11:meMA.Ode3C13.melody	@ltx/gr_gr_cog/he.h.m2:heHE.ExinthisenIErimos.name
ltx/gr_gr_cog/me.m01.d11:meMA.Ode3C13.mode	@ltx/gr_gr_cog/miscellanea:misc.Mode2
ltx/gr_gr_cog/me.m01.d11:meMA.Ode3C13.ode	@ltx/gr_gr_cog/miscellanea:misc.Ode3
ltx/gr_gr_cog/me.m01.d11:meMA.Ode3C13.text	Κατέλιπες τὸν κόσμον, καὶ τὰ ἐν τῷ κόσμῳ Ὅσιε, τὴν τελεσθεῖσαν γύμνωσιν, τοῦ Δεσπότου ἐκμιμησάμενος, ἐπὶ τοῦ Ἰορδάνου Θεοδόσιε.
ltx/gr_gr_cog/me.m01.d11:meMA.Ode3C14.incipit	Τὸν Σταυρὸν τοῦ Σωτῆρος, ἐπ’…
ltx/gr_gr_cog/me.m01.d11:meMA.Ode3C14.melody	@ltx/gr_gr_cog/he.h.m2:heHE.ExinthisenIErimos.name
ltx/gr_gr_cog/me.m01.d11:meMA.Ode3C14.mode	@ltx/gr_gr_cog/miscellanea:misc.Mode2
ltx/gr_gr_cog/me.m01.d11:meMA.Ode3C14.ode	@ltx/gr_gr_cog/miscellanea:misc.Ode3
ltx/gr_gr_cog/me.m01.d11:meMA.Ode3C14.text	Τὸν Σταυρὸν τοῦ Σωτῆρος, ἐπʼ ὤμων ἄρας ἔδραμες, ἐπὶ τὸν τούτου τάφον, ἐλάφου δίκην ἐπὶ ὑδάτων πηγάς, σωτηρίους παμμάκαρ Θεοδόσιε.
ltx/gr_gr_cog/me.m01.d11:meMA.Ode3C1T.incipit	Τὰ τάγματα ἐξέστησαν, τῶν Ἀγγέλων…
ltx/gr_gr_cog/me.m01.d11:meMA.Ode3C1T.melody	@ltx/gr_gr_cog/he.h.m2:heHE.ExinthisenIErimos.name
ltx/gr_gr_cog/me.m01.d11:meMA.Ode3C1T.mode	@ltx/gr_gr_cog/miscellanea:misc.Mode2
ltx/gr_gr_cog/me.m01.d11:meMA.Ode3C1T.ode	@ltx/gr_gr_cog/miscellanea:misc.Ode3
ltx/gr_gr_cog/me.m01.d11:meMA.Ode3C1T.text	Τὰ τάγματα ἐξέστησαν, τῶν Ἀγγέλων Πάναγνε, καὶ τῶν ἀνθρώπων ἔφριξαν, αἱ καρδίαι ἐπὶ τῷ τόκῳ σου· διό σε Θεοτόκον πίστει σέβομεν.
ltx/gr_gr_cog/me.m01.d11:meMA.Ode3Kathisma1.greekmelody	@ltx/gr_gr_cog/he.a.m8:heAU.TinSofianKaiLogon.greekname
ltx/gr_gr_cog/me.m01.d11:meMA.Ode3Kathisma1.incipit	Ἐγκρατείᾳ καὶ πόνοις καὶ προσευχαῖς…
ltx/gr_gr_cog/me.m01.d11:meMA.Ode3Kathisma1.melody	@ltx/gr_gr_cog/he.a.m8:heAU.TinSofianKaiLogon.name
ltx/gr_gr_cog/me.m01.d11:meMA.Ode3Kathisma1.mode	@ltx/gr_gr_cog/miscellanea:misc.Mode8
ltx/gr_gr_cog/me.m01.d11:meMA.Ode3Kathisma1.text	Ἐγκρατείᾳ καὶ πόνοις καὶ προσευχαῖς, τὴν ψυχήν σου κοσμήσας θεοπρεπῶς, γέγονας συμμέτοχος, τῶν Ὁσίων Ἀοίδιμε· καὶ τῶν θαυμάτων ὄντως, χαρίσματα ἔλαβες, τοῦ ἰᾶσθαι τὰς νόσους, τῶν πίστει τιμώντων σε· ὅθεν καὶ Δαιμόνων, ἀπελαύνων τὰ πλήθη, παρέχεις ἰάματα, τοῖς ἀνθρώποις τῇ χάριτι, θεοφόρε Θεοδόσιε. Πρέσβευε Χριστῷ τῷ Θεῷ, τῶν πταισμάτων ἄφεσιν δωρήσασθαι, τοῖς ἑορτάζουσι πόθῳ, τὴν ἁγίαν μνήμην σου.
ltx/gr_gr_cog/me.m01.d11:meMA.Ode3Kathisma2.greekmelody	@ltx/gr_gr_cog/he.a.m8:heAU.TinSofianKaiLogon.greekname
ltx/gr_gr_cog/me.m01.d11:meMA.Ode3Kathisma2.incipit	Ἰορδάνης τῷ ῥείθρῳ καθυπουργεῖ, Ἰωάννης…
ltx/gr_gr_cog/me.m01.d11:meMA.Ode3Kathisma2.melody	@ltx/gr_gr_cog/he.a.m8:heAU.TinSofianKaiLogon.name
ltx/gr_gr_cog/me.m01.d11:meMA.Ode3Kathisma2.mode	@ltx/gr_gr_cog/miscellanea:misc.Mode8
ltx/gr_gr_cog/me.m01.d11:meMA.Ode3Kathisma2.text	Ἰορδάνης τῷ ῥείθρῳ καθυπουργεῖ, Ἰωάννης ἐκτείνει χεῖρα φθαρτήν, φανέντος σοῦ Ἀόρατε, ἐν σαρκὶ πρὸς τὸ βάπτισμα, ἀλλʼ ὁ μὲν ἐστρέφετο, εἰς τὰ ὀπίσω φόβῳ, ὁ δὲ αὖθις ἐκράτει, ἐν τρόμῳ τὸν ἄφθαρτον, ὄντως ὁ Ἀμνὸς τοῦ Θεοῦ, ἡ πηγὴ ἡ ἀείζωος, πηγάς τε καὶ θαλάσσας, καὶ ἀνθρώπους ἡγίασας. Ἡ Τριὰς γὰρ ἐπέλαμψεν· ἄνωθεν Υἱόν σε ὀνομάζει ὁ Γεννήτωρ, καὶ τὸ Ἅγιον Πνεῦμα συγκατέρχεται.
ltx/gr_gr_cog/me.m01.d11:meMA.Ode4C11.greekmelody	@ltx/gr_gr_cog/he.h.m2:heHE.ElilythasEkParthenou.greekname
ltx/gr_gr_cog/me.m01.d11:meMA.Ode4C11.incipit	Ἐν ὕδασι, κεφαλὰς τῶν δρακόντων…
ltx/gr_gr_cog/me.m01.d11:meMA.Ode4C11.melody	@ltx/gr_gr_cog/he.h.m2:heHE.ElilythasEkParthenou.name
ltx/gr_gr_cog/me.m01.d11:meMA.Ode4C11.mode	@ltx/gr_gr_cog/miscellanea:misc.Mode2
ltx/gr_gr_cog/me.m01.d11:meMA.Ode4C11.ode	@ltx/gr_gr_cog/miscellanea:misc.Ode4
ltx/gr_gr_cog/me.m01.d11:meMA.Ode4C11.text	Ἐν ὕδασι, κεφαλὰς τῶν δρακόντων συνέτριψας, καὶ διὰ τοῦ Πνεύματος, Λόγε Θεοῦ ἀνεκαίνισας, ὅλον μὲ τὸν ἄνθρωπον· διὸ κραυγάζω σοι· Δόξα τῇ δυνάμει σου Κύριε.
ltx/gr_gr_cog/me.m01.d11:meMA.Ode4C12.incipit	Τοῦ κλίναντος, κορυφὴν τῷ Προδρόμῳ…
ltx/gr_gr_cog/me.m01.d11:meMA.Ode4C12.melody	@ltx/gr_gr_cog/he.h.m2:heHE.ElilythasEkParthenou.name
ltx/gr_gr_cog/me.m01.d11:meMA.Ode4C12.mode	@ltx/gr_gr_cog/miscellanea:misc.Mode2
ltx/gr_gr_cog/me.m01.d11:meMA.Ode4C12.ode	@ltx/gr_gr_cog/miscellanea:misc.Ode4
ltx/gr_gr_cog/me.m01.d11:meMA.Ode4C12.text	Τοῦ κλίναντος, κορυφὴν τῷ Προδρόμῳ μιμούμενος, Χριστοῦ τὸ ὑπήκοον, καὶ τὴν ἀρίστην ταπείνωσιν, Πάτερ Θεοδόσιε, πρὸς ἀρετῶν ἀνηνέχθης πύργον ἄσειστον.
ltx/gr_gr_cog/me.m01.d11:meMA.Ode4C13.incipit	Τῇ Παρθένῳ, καὶ Μητρὶ λειτουργήσας…
ltx/gr_gr_cog/me.m01.d11:meMA.Ode4C13.melody	@ltx/gr_gr_cog/he.h.m2:heHE.ElilythasEkParthenou.name
ltx/gr_gr_cog/me.m01.d11:meMA.Ode4C13.mode	@ltx/gr_gr_cog/miscellanea:misc.Mode2
ltx/gr_gr_cog/me.m01.d11:meMA.Ode4C13.ode	@ltx/gr_gr_cog/miscellanea:misc.Ode4
ltx/gr_gr_cog/me.m01.d11:meMA.Ode4C13.text	Τῇ Παρθένῳ, καὶ Μητρὶ λειτουργήσας Χριστοῦ τοῦ Θεοῦ, τὴν ἀκαταμάχητον, χάριν ἐδέξω τοῦ Πνεύματος, Πάτερ Θεοδόσιε, καὶ δυσμενεῖς ἀοράτους καταβέβληκας.
ltx/gr_gr_cog/me.m01.d11:meMA.Ode4C14.incipit	Τῶν Μάγων σε, τὸ ἀοίδιμον…
ltx/gr_gr_cog/me.m01.d11:meMA.Ode4C14.melody	@ltx/gr_gr_cog/he.h.m2:heHE.ElilythasEkParthenou.name
ltx/gr_gr_cog/me.m01.d11:meMA.Ode4C14.mode	@ltx/gr_gr_cog/miscellanea:misc.Mode2
ltx/gr_gr_cog/me.m01.d11:meMA.Ode4C14.ode	@ltx/gr_gr_cog/miscellanea:misc.Ode4
ltx/gr_gr_cog/me.m01.d11:meMA.Ode4C14.text	Τῶν Μάγων σε, τὸ ἀοίδιμον ἄντρον δεξάμενον, δωροφόρον ἔδειξε, τῷ διʼ ἡμᾶς βαπτισθέντι Χριστῷ, πίστιν Θεοδόσιε, καὶ σὺν ἐλπίδι ἀγάπην προσκομίζοντα.
ltx/gr_gr_cog/me.m01.d11:meMA.Ode4C15.incipit	Τοῖς πάθεσι, τοῦ Δεσπότου Χριστοῦ…
ltx/gr_gr_cog/me.m01.d11:meMA.Ode4C15.melody	@ltx/gr_gr_cog/he.h.m2:heHE.ElilythasEkParthenou.name
ltx/gr_gr_cog/me.m01.d11:meMA.Ode4C15.mode	@ltx/gr_gr_cog/miscellanea:misc.Mode2
ltx/gr_gr_cog/me.m01.d11:meMA.Ode4C15.ode	@ltx/gr_gr_cog/miscellanea:misc.Ode4
ltx/gr_gr_cog/me.m01.d11:meMA.Ode4C15.text	Τοῖς πάθεσι, τοῦ Δεσπότου Χριστοῦ δυναμούμενος, τὸ τῆς συνειδήσεως, πόθῳ ἀνέτλης μαρτύριον, Πάτερ Θεοδόσιε, τῷ ζοφερῷ προσπαλαίων κοσμοκράτορι.
ltx/gr_gr_cog/me.m01.d11:meMA.Ode4C1T.incipit	Συνέλαβες, ἐν γαστρί σου ἀσπόρως…
ltx/gr_gr_cog/me.m01.d11:meMA.Ode4C1T.melody	@ltx/gr_gr_cog/he.h.m2:heHE.ElilythasEkParthenou.name
ltx/gr_gr_cog/me.m01.d11:meMA.Ode4C1T.mode	@ltx/gr_gr_cog/miscellanea:misc.Mode2
ltx/gr_gr_cog/me.m01.d11:meMA.Ode4C1T.ode	@ltx/gr_gr_cog/miscellanea:misc.Ode4
ltx/gr_gr_cog/me.m01.d11:meMA.Ode4C1T.text	Συνέλαβες, ἐν γαστρί σου ἀσπόρως, τὸν Κύριον, καὶ τοῦτον ἐκύησας, σεσαρκωμένον τὸν σῴζοντα, κόσμον ταῖς πρεσβείαις σου· διό σοι κράζομεν· Χαῖρε ἀειπάρθενε Δέσποινα.
ltx/gr_gr_cog/me.m01.d11:meMA.Ode5C11.greekmelody	@ltx/gr_gr_cog/he.h.m2:heHE.MesitisTheou.greekname
ltx/gr_gr_cog/me.m01.d11:meMA.Ode5C11.incipit	Ἑξάψας τὸν νοῦν, τοῦ ἡμᾶς…
ltx/gr_gr_cog/me.m01.d11:meMA.Ode5C11.melody	@ltx/gr_gr_cog/he.h.m2:heHE.MesitisTheou.name
ltx/gr_gr_cog/me.m01.d11:meMA.Ode5C11.mode	@ltx/gr_gr_cog/miscellanea:misc.Mode2
ltx/gr_gr_cog/me.m01.d11:meMA.Ode5C11.ode	@ltx/gr_gr_cog/miscellanea:misc.Ode5
ltx/gr_gr_cog/me.m01.d11:meMA.Ode5C11.text	Ἑξάψας τὸν νοῦν, τοῦ ἡμᾶς ἐν ῥείθροις καινουργήσαντος, σοφῶς ὑπεστήριζες, καταβεβλημένον διʼ ἀσκήσεως, κρεμαστῆρσι τὸ σῶμα, παμμάκαρ Θεοδόσιε.
ltx/gr_gr_cog/me.m01.d11:meMA.Ode5C12.incipit	Τὸν βίον ἀεί, τοῦ θανάτου…
ltx/gr_gr_cog/me.m01.d11:meMA.Ode5C12.melody	@ltx/gr_gr_cog/he.h.m2:heHE.MesitisTheou.name
ltx/gr_gr_cog/me.m01.d11:meMA.Ode5C12.mode	@ltx/gr_gr_cog/miscellanea:misc.Mode2
ltx/gr_gr_cog/me.m01.d11:meMA.Ode5C12.ode	@ltx/gr_gr_cog/miscellanea:misc.Ode5
ltx/gr_gr_cog/me.m01.d11:meMA.Ode5C12.text	Τὸν βίον ἀεί, τοῦ θανάτου θέμενος μελέτημα, ἐκδημῆσαι σπεύδων τε, πρὸς τὸν διʼ ἡμᾶς ἐπιφανέντα σαρκί, σεαυτῷ ἐδομήσω, τὸν τάφον Θεοδόσιε.
ltx/gr_gr_cog/me.m01.d11:meMA.Ode5C13.incipit	Τὸν θάνατον Χριστοῦ, τὸν ἑκούσιον…
ltx/gr_gr_cog/me.m01.d11:meMA.Ode5C13.melody	@ltx/gr_gr_cog/he.h.m2:heHE.MesitisTheou.name
ltx/gr_gr_cog/me.m01.d11:meMA.Ode5C13.mode	@ltx/gr_gr_cog/miscellanea:misc.Mode2
ltx/gr_gr_cog/me.m01.d11:meMA.Ode5C13.ode	@ltx/gr_gr_cog/miscellanea:misc.Ode5
ltx/gr_gr_cog/me.m01.d11:meMA.Ode5C13.text	Τὸν θάνατον Χριστοῦ, τὸν ἑκούσιον ὁ σὸς φοιτητής, ὁ κλεινὸς Βασίλειος, Πάτερ Θεοδόσιε μιμούμενος, τὸν καινὸν ἐγκαινίζει, τάφον ἀγαλλόμενος.
ltx/gr_gr_cog/me.m01.d11:meMA.Ode5C1T.incipit	Ἰδοὺ ἐν γαστρί, Θεοτόκε πάναγνε…
ltx/gr_gr_cog/me.m01.d11:meMA.Ode5C1T.melody	@ltx/gr_gr_cog/he.h.m2:heHE.MesitisTheou.name
ltx/gr_gr_cog/me.m01.d11:meMA.Ode5C1T.mode	@ltx/gr_gr_cog/miscellanea:misc.Mode2
ltx/gr_gr_cog/me.m01.d11:meMA.Ode5C1T.ode	@ltx/gr_gr_cog/miscellanea:misc.Ode5
ltx/gr_gr_cog/me.m01.d11:meMA.Ode5C1T.text	Ἰδοὺ ἐν γαστρί, Θεοτόκε πάναγνε, Χριστὸν τὸν Θεόν, ὑπὲρ λόγον ἔσχηκας, ὥσπερ Ἡσαΐας προσηγόρευσεν, ὑπὲρ φύσιν τε τοῦτον, Θεογεννῆτορ τέτοκας.
ltx/gr_gr_cog/me.m01.d11:meMA.Ode6C11.greekmelody	@ltx/gr_gr_cog/he.h.m2:heHE.EnAvyssoPtaismaton.greekname
ltx/gr_gr_cog/me.m01.d11:meMA.Ode6C11.incipit	Ἀφθαρσίαν ἡμῖν ἐδωρήσω Χριστέ, ἐν…
ltx/gr_gr_cog/me.m01.d11:meMA.Ode6C11.melody	@ltx/gr_gr_cog/he.h.m2:heHE.EnAvyssoPtaismaton.name
ltx/gr_gr_cog/me.m01.d11:meMA.Ode6C11.mode	@ltx/gr_gr_cog/miscellanea:misc.Mode2
ltx/gr_gr_cog/me.m01.d11:meMA.Ode6C11.ode	@ltx/gr_gr_cog/miscellanea:misc.Ode6
ltx/gr_gr_cog/me.m01.d11:meMA.Ode6C11.text	Ἀφθαρσίαν ἡμῖν ἐδωρήσω Χριστέ, ἐν τῇ ἀναστάσει σου· ὅθεν Βασίλειος, ὁ εὐκλεὴς θεράπων σου, καὶ θανὼν ὥσπερ ζῶν, ἐπιφαίνεται.
ltx/gr_gr_cog/me.m01.d11:meMA.Ode6C12.incipit	Ὁ καθαίρων τὸν κόσμον βαπτίζεται…
ltx/gr_gr_cog/me.m01.d11:meMA.Ode6C12.melody	@ltx/gr_gr_cog/he.h.m2:heHE.EnAvyssoPtaismaton.name
ltx/gr_gr_cog/me.m01.d11:meMA.Ode6C12.mode	@ltx/gr_gr_cog/miscellanea:misc.Mode2
ltx/gr_gr_cog/me.m01.d11:meMA.Ode6C12.ode	@ltx/gr_gr_cog/miscellanea:misc.Ode6
ltx/gr_gr_cog/me.m01.d11:meMA.Ode6C12.text	Ὁ καθαίρων τὸν κόσμον βαπτίζεται, διʼ ἐμὲ βροτός, ὁ Θεὸς κατʼ ἐμὲ γεγονώς, ὃν ἐν δυσὶ ταῖς φύσεσι, Θεοδόσιε μάκαρ ἐκήρυξας.
ltx/gr_gr_cog/me.m01.d11:meMA.Ode6C13.incipit	Γλυκασμὸν εὐφροσύνης Χριστῷ τῷ Θεῷ…
ltx/gr_gr_cog/me.m01.d11:meMA.Ode6C13.melody	@ltx/gr_gr_cog/he.h.m2:heHE.EnAvyssoPtaismaton.name
ltx/gr_gr_cog/me.m01.d11:meMA.Ode6C13.mode	@ltx/gr_gr_cog/miscellanea:misc.Mode2
ltx/gr_gr_cog/me.m01.d11:meMA.Ode6C13.ode	@ltx/gr_gr_cog/miscellanea:misc.Ode6
ltx/gr_gr_cog/me.m01.d11:meMA.Ode6C13.text	Γλυκασμὸν εὐφροσύνης Χριστῷ τῷ Θεῷ, τῷ τῶν Μυροφόρων τὰ δάκρυα τρέψαντι, εἰς χαρὰν Θεοδόσιε, οἱ κρουνοὶ τῶν δακρύων σου ἔσταξαν.
ltx/gr_gr_cog/me.m01.d11:meMA.Ode6C1T.incipit	Συμπαθείας τῆς σῆς με ἀξίωσον…
ltx/gr_gr_cog/me.m01.d11:meMA.Ode6C1T.melody	@ltx/gr_gr_cog/he.h.m2:heHE.EnAvyssoPtaismaton.name
ltx/gr_gr_cog/me.m01.d11:meMA.Ode6C1T.mode	@ltx/gr_gr_cog/miscellanea:misc.Mode2
ltx/gr_gr_cog/me.m01.d11:meMA.Ode6C1T.ode	@ltx/gr_gr_cog/miscellanea:misc.Ode6
ltx/gr_gr_cog/me.m01.d11:meMA.Ode6C1T.text	Συμπαθείας τῆς σῆς με ἀξίωσον, ἡ τὸν συμπαθέστατον Λόγον κυήσασα, τῶν τῷ ἰδίῳ αἵματι, ἐκ φθορᾶς τοὺς ἀνθρώπους ῥυσάμενον.
ltx/gr_gr_cog/me.m01.d11:meMA.Ode7C11.greekmelody	@ltx/gr_gr_cog/he.h.m2:heHE.AntitheonProstagma.greekname
ltx/gr_gr_cog/me.m01.d11:meMA.Ode7C11.incipit	Ὁ ρεῖθρα φλογίζοντα τὴν ἁμαρτίαν…
ltx/gr_gr_cog/me.m01.d11:meMA.Ode7C11.melody	@ltx/gr_gr_cog/he.h.m2:heHE.AntitheonProstagma.name
ltx/gr_gr_cog/me.m01.d11:meMA.Ode7C11.mode	@ltx/gr_gr_cog/miscellanea:misc.Mode2
ltx/gr_gr_cog/me.m01.d11:meMA.Ode7C11.ode	@ltx/gr_gr_cog/miscellanea:misc.Ode7
ltx/gr_gr_cog/me.m01.d11:meMA.Ode7C11.text	Ὁ ρεῖθρα φλογίζοντα τὴν ἁμαρτίαν, καὶ φλόγα δροσίζουσαν, ἀνθρώπων γένος Κύριε, ἐν τῷ σῷ Βαπτίσματι, συνάψας Λόγε Θεοῦ, ὁ ὑπερυψούμενος Θεός, εὐλογημένος καὶ ὑπερένδοξος.
ltx/gr_gr_cog/me.m01.d11:meMA.Ode7C12.incipit	Τῷ κάμινον τεύξαντι τὸν Ἰορδάνην…
ltx/gr_gr_cog/me.m01.d11:meMA.Ode7C12.melody	@ltx/gr_gr_cog/he.h.m2:heHE.AntitheonProstagma.name
ltx/gr_gr_cog/me.m01.d11:meMA.Ode7C12.mode	@ltx/gr_gr_cog/miscellanea:misc.Mode2
ltx/gr_gr_cog/me.m01.d11:meMA.Ode7C12.ode	@ltx/gr_gr_cog/miscellanea:misc.Ode7
ltx/gr_gr_cog/me.m01.d11:meMA.Ode7C12.text	Τῷ κάμινον τεύξαντι τὸν Ἰορδάνην, σαυτὸν ὡς θυμίαμα, ὁλοκαυτώσας Ὅσιε, καὶ φλόγα οὐράνιον, ἀψευδὲς σύμβολον, θείας ἐπινεύσεως λαβών, σηκὸν ἱδρύσω ψυχῶν σωτήριον.
ltx/gr_gr_cog/me.m01.d11:meMA.Ode7C13.incipit	Τοῖς σοῖς στρατηγήμασι τὰ τοῦ…
ltx/gr_gr_cog/me.m01.d11:meMA.Ode7C13.melody	@ltx/gr_gr_cog/he.h.m2:heHE.AntitheonProstagma.name
ltx/gr_gr_cog/me.m01.d11:meMA.Ode7C13.mode	@ltx/gr_gr_cog/miscellanea:misc.Mode2
ltx/gr_gr_cog/me.m01.d11:meMA.Ode7C13.ode	@ltx/gr_gr_cog/miscellanea:misc.Ode7
ltx/gr_gr_cog/me.m01.d11:meMA.Ode7C13.text	Τοῖς σοῖς στρατηγήμασι τὰ τοῦ Μωσέως, ὑπείκει τῆς χάριτος, ἐπιφανείσης Ὅσιε· ἐχθροὺς ἀοράτους γάρ, καταστρεψάμενος, πόλιν ἐπουράνιον ὁ σός, κληροδοτεῖται λαὸς Πανεύφημε.
ltx/gr_gr_cog/me.m01.d11:meMA.Ode7C14.incipit	Τῷ ῥείθροις ἐνθάψαντι τὴν ἁμαρτίαν…
ltx/gr_gr_cog/me.m01.d11:meMA.Ode7C14.melody	@ltx/gr_gr_cog/he.h.m2:heHE.AntitheonProstagma.name
ltx/gr_gr_cog/me.m01.d11:meMA.Ode7C14.mode	@ltx/gr_gr_cog/miscellanea:misc.Mode2
ltx/gr_gr_cog/me.m01.d11:meMA.Ode7C14.ode	@ltx/gr_gr_cog/miscellanea:misc.Ode7
ltx/gr_gr_cog/me.m01.d11:meMA.Ode7C14.text	Τῷ ῥείθροις ἐνθάψαντι τὴν ἁμαρτίαν, σαυτὸν ἐνδιαίτημα, ἔδρασας Θεοδόσιε, θεάρεστον τέμενος ἐπῳκοδόμησας, φέρειν ἀκατάπαυστον ᾠδήν, νομοθετήσας ἐν πολυγλώσσοις φωναῖς.
ltx/gr_gr_cog/me.m01.d11:meMA.Ode7C15.incipit	Τῶν Παίδων μιμούμενος τὴν παῤῥησίαν…
ltx/gr_gr_cog/me.m01.d11:meMA.Ode7C15.melody	@ltx/gr_gr_cog/he.h.m2:heHE.AntitheonProstagma.name
ltx/gr_gr_cog/me.m01.d11:meMA.Ode7C15.mode	@ltx/gr_gr_cog/miscellanea:misc.Mode2
ltx/gr_gr_cog/me.m01.d11:meMA.Ode7C15.ode	@ltx/gr_gr_cog/miscellanea:misc.Ode7
ltx/gr_gr_cog/me.m01.d11:meMA.Ode7C15.text	Τῶν Παίδων μιμούμενος τὴν παῤῥησίαν, τυράννου πυρίπνοον, ἀπειλὴν ἐξεφαύλισας, σοφῶς προϊστάμενος τῆς Ἐκκλησίας Χριστοῦ, Πάτερ Θεοδόσιε, διʼ ἣν ἑκὼν ὡράθη, σαρκὶ σταυρούμενος.
ltx/gr_gr_cog/me.m01.d11:meMA.Ode7C1T.incipit	Πανάχραντον σύλληψιν, ἄχραντον τόκον, σὺ…
ltx/gr_gr_cog/me.m01.d11:meMA.Ode7C1T.melody	@ltx/gr_gr_cog/he.h.m2:heHE.AntitheonProstagma.name
ltx/gr_gr_cog/me.m01.d11:meMA.Ode7C1T.mode	@ltx/gr_gr_cog/miscellanea:misc.Mode2
ltx/gr_gr_cog/me.m01.d11:meMA.Ode7C1T.ode	@ltx/gr_gr_cog/miscellanea:misc.Ode7
ltx/gr_gr_cog/me.m01.d11:meMA.Ode7C1T.text	Πανάχραντον σύλληψιν, ἄχραντον τόκον, σὺ μόνη ὑπέδειξας, Παρθένος διαμείνασα· Θεὸν γὰρ συνέλαβες, τὸν ὑπὲρ πάντων Ἁγνή, ἄνθρωπον γενόμενον, πιστῶν εἰς σωτηρίαν καὶ ἀπολύτρωσιν.
ltx/gr_gr_cog/me.m01.d11:meMA.Ode8C11.greekmelody	@ltx/gr_gr_cog/he.h.m2:heHE.KaminosPote.greekname
ltx/gr_gr_cog/me.m01.d11:meMA.Ode8C11.incipit	Κάμινός ποτε, ἐν Βαβυλῶνι ῥεῖθρα…
ltx/gr_gr_cog/me.m01.d11:meMA.Ode8C11.melody	@ltx/gr_gr_cog/he.h.m2:heHE.KaminosPote.name
ltx/gr_gr_cog/me.m01.d11:meMA.Ode8C11.mode	@ltx/gr_gr_cog/miscellanea:misc.Mode2
ltx/gr_gr_cog/me.m01.d11:meMA.Ode8C11.ode	@ltx/gr_gr_cog/miscellanea:misc.Ode8
ltx/gr_gr_cog/me.m01.d11:meMA.Ode8C11.text	Κάμινός ποτε, ἐν Βαβυλῶνι ῥεῖθρα, τοῦ Ἰορδάνου ἐξεικόνισε, τῷ θείῳ Βαπτίσματι, ἐναντίους καταφλέγουσα, τοὺς δὲ πιστοὺς δροσίζουσα κράζοντας· Εὐλογεῖτε, πάντα τὰ ἔργα Κυρίου τὸν Κύριον.
ltx/gr_gr_cog/me.m01.d11:meMA.Ode8C12.incipit	Τῶν σωματικῶν, παθῶν προεκδημήσας, τῆς…
ltx/gr_gr_cog/me.m01.d11:meMA.Ode8C12.melody	@ltx/gr_gr_cog/he.h.m2:heHE.KaminosPote.name
ltx/gr_gr_cog/me.m01.d11:meMA.Ode8C12.mode	@ltx/gr_gr_cog/miscellanea:misc.Mode2
ltx/gr_gr_cog/me.m01.d11:meMA.Ode8C12.ode	@ltx/gr_gr_cog/miscellanea:misc.Ode8
ltx/gr_gr_cog/me.m01.d11:meMA.Ode8C12.text	Τῶν σωματικῶν, παθῶν προεκδημήσας, τῆς ἐκδημίας Θεοδόσιε, ἐν τοῖς κενεῶσι τῆς γῆς, τῶν ὑδάτων ἑξαιρούμενος, τῷ νεανίᾳ δείκνυσαι, κράζοντι· Εὐλογεῖτε, πάντα τὰ ἔργα Κυρίου τὸν Κύριον.
ltx/gr_gr_cog/me.m01.d11:meMA.Ode8C13.incipit	Γέγονε τῶν σῶν, χειρῶν ἡ…
ltx/gr_gr_cog/me.m01.d11:meMA.Ode8C13.melody	@ltx/gr_gr_cog/he.h.m2:heHE.KaminosPote.name
ltx/gr_gr_cog/me.m01.d11:meMA.Ode8C13.mode	@ltx/gr_gr_cog/miscellanea:misc.Mode2
ltx/gr_gr_cog/me.m01.d11:meMA.Ode8C13.ode	@ltx/gr_gr_cog/miscellanea:misc.Ode8
ltx/gr_gr_cog/me.m01.d11:meMA.Ode8C13.text	Γέγονε τῶν σῶν, χειρῶν ἡ εὐλογία, τὸ τοῦ ἐν ῥείθροις βαπτισθέντος Χριστοῦ, θειότατον πρόσταγμα, τῇ ἀνίκμῳ γονιμώτατον, ὕδωρ καὶ θάλπων ἥλιος· κόκκος γὰρ εἰς πολύχουν, σῖτον ἀσπόρως ἐτρέφετο.
ltx/gr_gr_cog/me.m01.d11:meMA.Ode8C14.incipit	Γνόφον νοητόν, φωτὸς τοῦ θειοτάτου…
ltx/gr_gr_cog/me.m01.d11:meMA.Ode8C14.melody	@ltx/gr_gr_cog/he.h.m2:heHE.KaminosPote.name
ltx/gr_gr_cog/me.m01.d11:meMA.Ode8C14.mode	@ltx/gr_gr_cog/miscellanea:misc.Mode2
ltx/gr_gr_cog/me.m01.d11:meMA.Ode8C14.ode	@ltx/gr_gr_cog/miscellanea:misc.Ode8
ltx/gr_gr_cog/me.m01.d11:meMA.Ode8C14.text	Γνόφον νοητόν, φωτὸς τοῦ θειοτάτου, σὺ ὑπεισδύνας Θεοδόσιε, καὶ πλάκας δακτύλῳ Θεοῦ, ἐγγραφείσας τῇ καρδίᾳ σου, τὰ εὐσεβείας δόγματα, ἔφερες τοῖς φοιτῶσι, βίβλον ζωῆς παμμακάριστε.
ltx/gr_gr_cog/me.m01.d11:meMA.Ode8C15.incipit	Πίστιν ἀῤῥαγῆ, τὴν τῆς Αἱμόῤῥου…
ltx/gr_gr_cog/me.m01.d11:meMA.Ode8C15.melody	@ltx/gr_gr_cog/he.h.m2:heHE.KaminosPote.name
ltx/gr_gr_cog/me.m01.d11:meMA.Ode8C15.mode	@ltx/gr_gr_cog/miscellanea:misc.Mode2
ltx/gr_gr_cog/me.m01.d11:meMA.Ode8C15.ode	@ltx/gr_gr_cog/miscellanea:misc.Ode8
ltx/gr_gr_cog/me.m01.d11:meMA.Ode8C15.text	Πίστιν ἀῤῥαγῆ, τὴν τῆς Αἱμόῤῥου Πάτερ, ἐκμιμησάμενον τὸ γύναιον, τοῦ ῥάκους ἁψάμενον, ὥσπερ σκότος τῷ ἐν σοὶ φωτισμῷ τὸ πάθος ἐφυγάδευσε· γέγονας ἐκλογῆς γάρ, σκεῦος τῷ ἐπιφανέντι Χριστῷ.
ltx/gr_gr_cog/me.m01.d11:meMA.Ode8C16.incipit	Σὲ τὸν ἐκ Θεοῦ, Θεὸν…
ltx/gr_gr_cog/me.m01.d11:meMA.Ode8C16.melody	@ltx/gr_gr_cog/he.h.m2:heHE.KaminosPote.name
ltx/gr_gr_cog/me.m01.d11:meMA.Ode8C16.mode	@ltx/gr_gr_cog/miscellanea:misc.Mode2
ltx/gr_gr_cog/me.m01.d11:meMA.Ode8C16.ode	@ltx/gr_gr_cog/miscellanea:misc.Ode8
ltx/gr_gr_cog/me.m01.d11:meMA.Ode8C16.text	Σὲ τὸν ἐκ Θεοῦ, Θεὸν ἑωρακότες, σωματικῶς ἐπιφανέντα Χριστέ, ἀῤῥήτως ἐπέγνωμεν, τὸν ἀόρατον Πατέρα σου, καὶ Πνεῦμά σου τὸ Ἅγιον, κράζοντες· Εὐλογεῖτε, πάντα τὰ ἔργα Κυρίου τὸν Κύριον.
ltx/gr_gr_cog/me.m01.d11:meMA.Ode8C1T.incipit	Σὺ τὸν τοῦ Πατρός, ἀχώριστον…
ltx/gr_gr_cog/me.m01.d11:meMA.Ode8C1T.melody	@ltx/gr_gr_cog/he.h.m2:heHE.KaminosPote.name
ltx/gr_gr_cog/me.m01.d11:meMA.Ode8C1T.mode	@ltx/gr_gr_cog/miscellanea:misc.Mode2
ltx/gr_gr_cog/me.m01.d11:meMA.Ode8C1T.ode	@ltx/gr_gr_cog/miscellanea:misc.Ode8
ltx/gr_gr_cog/me.m01.d11:meMA.Ode8C1T.text	Σὺ τὸν τοῦ Πατρός, ἀχώριστον ἐν μήτρᾳ, θεανδρικὼς πολιτευσάμενον, ἀσπόρως συνέλαβες, καὶ ἀφράστως ἀπεκύησας, Θεὸν ὁμοῦ καὶ ἄνθρωπον· ὅθεν σε σωτηρίαν, πάντων ἡμῶν ἐπιστάμεθα.
ltx/gr_gr_cog/me.m01.d11:meMA.Ode9C11.greekmelody	@ltx/gr_gr_cog/he.h.m2:heHE.AnarchouGennitoros.greekname
ltx/gr_gr_cog/me.m01.d11:meMA.Ode9C11.incipit	Συνόδους ἐκήρυξας, θεόφρον Θεοδόσιε, τῶν…
ltx/gr_gr_cog/me.m01.d11:meMA.Ode9C11.melody	@ltx/gr_gr_cog/he.h.m2:heHE.AnarchouGennitoros.name
ltx/gr_gr_cog/me.m01.d11:meMA.Ode9C11.mode	@ltx/gr_gr_cog/miscellanea:misc.Mode2
ltx/gr_gr_cog/me.m01.d11:meMA.Ode9C11.ode	@ltx/gr_gr_cog/miscellanea:misc.Ode9
ltx/gr_gr_cog/me.m01.d11:meMA.Ode9C11.text	Συνόδους ἐκήρυξας, θεόφρον Θεοδόσιε, τῶν σεπτῶν ἰσαρίθμους, Εὐαγγελίων Χριστοῦ, τὸ τῆς προαιρέσεως αἷμα, μαρτυρικῷ, προέμενος ζήλῳ, καὶ μάρτυς ἀναίμακτος, εὐσεβείας ἀναδέδειξαι.
ltx/gr_gr_cog/me.m01.d11:meMA.Ode9C12.incipit	Ἡ δίκη τὸν ἄδικον, ἐνδίκως…
ltx/gr_gr_cog/me.m01.d11:meMA.Ode9C12.melody	@ltx/gr_gr_cog/he.h.m2:heHE.AnarchouGennitoros.name
ltx/gr_gr_cog/me.m01.d11:meMA.Ode9C12.mode	@ltx/gr_gr_cog/miscellanea:misc.Mode2
ltx/gr_gr_cog/me.m01.d11:meMA.Ode9C12.ode	@ltx/gr_gr_cog/miscellanea:misc.Ode9
ltx/gr_gr_cog/me.m01.d11:meMA.Ode9C12.text	Ἡ δίκη τὸν ἄδικον, ἐνδίκως κατεδίκασε, τῆς σῆς ὑπερορίας προεξορίσασα, καὶ διὰ βλασφήμων χειλέων, τὴν δυσσεβῆ, ψυχὴν ἐξελοῦσα, ζωῆς τε στερήσασα, τῆς ζωῆς τὸν ἐχθρὸν Ὅσιε.
ltx/gr_gr_cog/me.m01.d11:meMA.Ode9C13.incipit	Τῶν σῶν μεμνημένοι, διδαγμάτων Θεοδόσιε…
ltx/gr_gr_cog/me.m01.d11:meMA.Ode9C13.melody	@ltx/gr_gr_cog/he.h.m2:heHE.AnarchouGennitoros.name
ltx/gr_gr_cog/me.m01.d11:meMA.Ode9C13.mode	@ltx/gr_gr_cog/miscellanea:misc.Mode2
ltx/gr_gr_cog/me.m01.d11:meMA.Ode9C13.ode	@ltx/gr_gr_cog/miscellanea:misc.Ode9
ltx/gr_gr_cog/me.m01.d11:meMA.Ode9C13.text	Τῶν σῶν μεμνημένοι, διδαγμάτων Θεοδόσιε, ἐν δυσὶ ταῖς οὐσίαις, Χριστὸν κηρύττομεν, δύω τὰς θελήσεις εἰδότες, τὰς φυσικάς, καὶ τὰς ἐνεργείας, καὶ τὰ αὐτεξούσια, ἐν Θεῷ τῷ βαπτισθέντι σαρκί.
ltx/gr_gr_cog/me.m01.d11:meMA.Ode9C14.incipit	Φερώνυμος δόσις ἀγαθή, ἐκ τοῦ…
ltx/gr_gr_cog/me.m01.d11:meMA.Ode9C14.melody	@ltx/gr_gr_cog/he.h.m2:heHE.AnarchouGennitoros.name
ltx/gr_gr_cog/me.m01.d11:meMA.Ode9C14.mode	@ltx/gr_gr_cog/miscellanea:misc.Mode2
ltx/gr_gr_cog/me.m01.d11:meMA.Ode9C14.ode	@ltx/gr_gr_cog/miscellanea:misc.Ode9
ltx/gr_gr_cog/me.m01.d11:meMA.Ode9C14.text	Φερώνυμος δόσις ἀγαθή, ἐκ τοῦ τῶν φώτων Πατρός, τῶν ψυχῶν καὶ τῶν σωμάτων ἰατρὸς πέφηνας, βρῶσις εὐθηνοῦσα καὶ πόσις, τῶν ἐν λιμῷ τακέντων καὶ δίψει, γυμνῶν περιβόλαιον, καὶ πιπτόντων ἐπανόρθωσις.
ltx/gr_gr_cog/me.m01.d11:meMA.Ode9C15.incipit	Μὴ παύσῃ τὴν ποίμνην σου…
ltx/gr_gr_cog/me.m01.d11:meMA.Ode9C15.melody	@ltx/gr_gr_cog/he.h.m2:heHE.AnarchouGennitoros.name
ltx/gr_gr_cog/me.m01.d11:meMA.Ode9C15.mode	@ltx/gr_gr_cog/miscellanea:misc.Mode2
ltx/gr_gr_cog/me.m01.d11:meMA.Ode9C15.ode	@ltx/gr_gr_cog/miscellanea:misc.Ode9
ltx/gr_gr_cog/me.m01.d11:meMA.Ode9C15.text	Μὴ παύσῃ τὴν ποίμνην σου, ἐφορῶν Πάτερ Ὅσιε, καὶ τῆς σῆς μεμνημένος καθυποσχέσεως, ἧς τὰς τῆς ἐλπίδος ἀγκύρας, ὡς ἀῤῥαγοῦς ἐξήψαμεν πέτρας, πρὸς Χριστὸν μεσίτην σε, κεκτημένοι Θεοδόσιε.
ltx/gr_gr_cog/me.m01.d11:meMA.Ode9C1T.incipit	Ὡς ὄρθρος εὑρέθης πρωϊνός, ἐν…
ltx/gr_gr_cog/me.m01.d11:meMA.Ode9C1T.melody	@ltx/gr_gr_cog/he.h.m2:heHE.AnarchouGennitoros.name
ltx/gr_gr_cog/me.m01.d11:meMA.Ode9C1T.mode	@ltx/gr_gr_cog/miscellanea:misc.Mode2
ltx/gr_gr_cog/me.m01.d11:meMA.Ode9C1T.ode	@ltx/gr_gr_cog/miscellanea:misc.Ode9
ltx/gr_gr_cog/me.m01.d11:meMA.Ode9C1T.text	Ὡς ὄρθρος εὑρέθης πρωϊνός, ἐν τῇ τοῦ βίου νυκτί, παρθενίας ἀκτῖσι περιαστράπτουσα, τὴν ἀνατολὴν τοῦ Ἡλίου, τοῦ νοητοῦ τῆς δικαιοσύνης, ἡμῖν φανερώσασα, Θεομῆτορ πανσεβάσμιε.
ltx/gr_gr_cog/me.m01.d11:meMA.Oikos1.text	Ἄνθρωπος μὲν τῇ φύσει ἐχρημάτισας Πάτερ, ἀλλʼ ὤφθης συμπολίτης Ἀγγέλων· ὡς γὰρ ἄσαρκον ἐπὶ τῆς γῆς βιοτεύσας σοφέ, τῆς σαρκὸς ἅπασαν τὴν πρόνοιαν ἀπέῤῥιψας· διὸ καὶ παρʼ ἡμῶν ἀκούεις·
ltx/gr_gr_cog/me.m01.d11:meMA.Oikos12.text	Χαίροις, Πατρὸς εὐλαβοῦς ὁ γόνος, χαίροις, Μητρὸς εὐσεβοῦς ὁ κλάδος.
ltx/gr_gr_cog/me.m01.d11:meMA.Oikos13.text	Χαίροις, τῆς Ἐρήμου πολιστὴς παγκόσμιος· χαίροις οἰκουμένης φωστὴρ ὁ πολύφωτος.
ltx/gr_gr_cog/me.m01.d11:meMA.Oikos14.text	Χαίροις, ὅτι ἐκ νεότητος ἠκολούθησας Χριστῷ· χαίροις ὅτι κατεμάρανας τῆς σαρκὸς τὰς ἡδονάς.
ltx/gr_gr_cog/me.m01.d11:meMA.Oikos15.text	Χαίροις, τῶν Μοναζόντων πρόξενος σωτηρίας· χαίροις, τῶν ῥαθυμούντων τρόπος παρηγορίας.
ltx/gr_gr_cog/me.m01.d11:meMA.Oikos16.text	Χαίροις, πολλοὺς ἐκ πλάνης ῥυσάμενος· χαίροις, κρουνοὺς θαυμάτων δωρούμενος.
ltx/gr_gr_cog/me.m01.d11:meMA.Oikos17.text	Χαίροις, πτωχῶν τὴν φροντίδα ποιήσας, χαίροις, ἡμῶν ὁ προστάτης καὶ ῥύστης.
ltx/gr_gr_cog/me.m01.d11:meMA.Oikos18.text	Χαίροις, Πάτερ Θεοδόσιε.
ltx/gr_gr_cog/me.m01.d11:meMA.PostGospelBoth.incipit	@ltx/gr_gr_cog/ho.ho03:hoMA.PostGospelTheotokos.incipit
ltx/gr_gr_cog/me.m01.d11:meMA.PostGospelBoth.melody	
ltx/gr_gr_cog/me.m01.d11:meMA.PostGospelBoth.mode	@ltx/gr_gr_cog/miscellanea:misc.Mode2
ltx/gr_gr_cog/me.m01.d11:meMA.PostGospelBoth.text	@ltx/gr_gr_cog/ho.ho03:hoMA.PostGospelTheotokos.text
ltx/gr_gr_cog/me.m01.d11:meMA.PostGospelGlory.incipit	@ltx/gr_gr_cog/ho.ho03:hoMA.PostGospelMonastic.incipit
ltx/gr_gr_cog/me.m01.d11:meMA.PostGospelGlory.melody	
ltx/gr_gr_cog/me.m01.d11:meMA.PostGospelGlory.mode	@ltx/gr_gr_cog/miscellanea:misc.Mode2
ltx/gr_gr_cog/me.m01.d11:meMA.PostGospelGlory.text	@ltx/gr_gr_cog/ho.ho03:hoMA.PostGospelMonastic.text
ltx/gr_gr_cog/me.m01.d11:meMA.PostGospelIdiomelon.incipit	@ltx/gr_gr_cog/me.m01.d15:meVE.AposGlory.incipit
ltx/gr_gr_cog/me.m01.d11:meMA.PostGospelIdiomelon.melody	
ltx/gr_gr_cog/me.m01.d11:meMA.PostGospelIdiomelon.mode	@ltx/gr_gr_cog/miscellanea:misc.Mode6
ltx/gr_gr_cog/me.m01.d11:meMA.PostGospelIdiomelon.text	@ltx/gr_gr_cog/me.m01.d15:meVE.AposGlory.text
ltx/gr_gr_cog/me.m01.d11:meVE.AposBoth.incipit	Τὰ τῶν Ἀγγέλων στρατεύματα ἐξίσταντο…
ltx/gr_gr_cog/me.m01.d11:meVE.AposBoth.melody	
ltx/gr_gr_cog/me.m01.d11:meVE.AposBoth.mode	@ltx/gr_gr_cog/miscellanea:misc.Mode8
ltx/gr_gr_cog/me.m01.d11:meVE.AposBoth.poet	@ltx/gr_gr_cog/poets:po.IoannouMonachou
ltx/gr_gr_cog/me.m01.d11:meVE.AposBoth.text	Τὰ τῶν Ἀγγέλων στρατεύματα ἐξίσταντο, ὁρῶντά σε σήμερον ἐν Ἰορδάνῃ, γυμνὸν ἑστῶτα Σωτὴρ ἐν τοῖς ὕδασι, καὶ τὴν ἄχραντον κορυφήν σου ὑποκλίναντα, βαπτισθῆναι ὑπὸ Ἰωάννου· σοῦ γὰρ πτωχεύσαντος ἑκουσίως, ὁ κόσμος ἐπλουτίσθη, Κύριε δόξα σοι.
ltx/gr_gr_cog/me.m01.d11:meVE.AposGlory.incipit	Τῶν Μοναστῶν τὰ πλήθη…
ltx/gr_gr_cog/me.m01.d11:meVE.AposGlory.melody	
ltx/gr_gr_cog/me.m01.d11:meVE.AposGlory.mode	@ltx/gr_gr_cog/miscellanea:misc.Mode8
ltx/gr_gr_cog/me.m01.d11:meVE.AposGlory.poet	@ltx/gr_gr_cog/poets:po.Sykeotou
ltx/gr_gr_cog/me.m01.d11:meVE.AposGlory.text	Τῶν Μοναστῶν τὰ πλήθη, τὸν καθηγητήν σε τιμῶμεν, Πατὴρ ἡμῶν Θεοδόσιε· διὰ σοῦ γὰρ τὴν τρίβον, τὴν ὄντως εὐθεῖαν, πορεύεσθαι ἔγνωμεν. Μακάριος εἶ, τῷ Χριστῷ δουλεύσας, καὶ ἐχθροῦ θριαμβεύσας τὴν δύναμιν, Ἀγγέλων συνόμιλε, Ὁσίων ὁμόσκηνε καὶ Δικαίων. Μεθʼ ὧν πρέσβευε τῷ Κυρίῳ, ἐλεηθῆναι τὰς ψυχὰς ἡμῶν.
ltx/gr_gr_cog/me.m01.d11:meVE.Aposticha1.greekmelody	@ltx/gr_gr_cog/he.a.m4:heAU.EdokasSimeiosin.greekname
ltx/gr_gr_cog/me.m01.d11:meVE.Aposticha1.incipit	Ἴδε πῶς περίκειμαι, τὴν σὴν…
ltx/gr_gr_cog/me.m01.d11:meVE.Aposticha1.melody	@ltx/gr_gr_cog/he.a.m4:heAU.EdokasSimeiosin.name
ltx/gr_gr_cog/me.m01.d11:meVE.Aposticha1.mode	@ltx/gr_gr_cog/miscellanea:misc.Mode4
ltx/gr_gr_cog/me.m01.d11:meVE.Aposticha1.text	Ἴδε πῶς περίκειμαι, τὴν σὴν εἰκόνα ἣν ἔπλασα, ὑπὲρ νοῦν ταπεινούμενος, ὁ Κύριος ἔφησε. Τί οὖν ξένον φίλε, εἰ καθυποκύπτω, τῇ δεξιᾷ σου ὥς περ εἷς, τῶν σῶν συνδούλων καὶ περιβάλλομαι, γυμνούμενος τὰ ὕδατα; τοὺς γυμνωθέντας γὰρ βούλομαι, ἐπενδῦσαι ὡς εὔσπλαγχνος, ἀφθαρσίαν αἰώνιον.
ltx/gr_gr_cog/me.m01.d11:meVE.Aposticha2.incipit	Ὤφθης σωματούμενος, ἀλλὰ νηδὺς σε…
ltx/gr_gr_cog/me.m01.d11:meVE.Aposticha2.melody	@ltx/gr_gr_cog/he.a.m4:heAU.EdokasSimeiosin.name
ltx/gr_gr_cog/me.m01.d11:meVE.Aposticha2.mode	@ltx/gr_gr_cog/miscellanea:misc.Mode4
ltx/gr_gr_cog/me.m01.d11:meVE.Aposticha2.text	Ὤφθης σωματούμενος, ἀλλὰ νηδύς σε ἐδέξατο, ἀκατάφλεκτος μείνασα· κάμινος γὰρ πόῤῥωθεν, ταύτην εἰκονίζει, μὴ φλέξασα Παῖδας, ἐγὼ δὲ χόρτος ὢν πυρί, πῶς ἐπιθήσω χεῖράς σοι Δέσποτα; ὃν φρίττει τὰ οὐράνια, καὶ τὰ ἐπίγεια ἅπαντα; Ἰησοῦ παντοδύναμε, ὁ Σωτὴρ τῶν ψυχῶν ἡμῶν.
ltx/gr_gr_cog/me.m01.d11:meVE.Aposticha3.incipit	Σύ με ἐν τοῖς ὕδασι…
ltx/gr_gr_cog/me.m01.d11:meVE.Aposticha3.melody	@ltx/gr_gr_cog/he.a.m4:heAU.EdokasSimeiosin.name
ltx/gr_gr_cog/me.m01.d11:meVE.Aposticha3.mode	@ltx/gr_gr_cog/miscellanea:misc.Mode4
ltx/gr_gr_cog/me.m01.d11:meVE.Aposticha3.text	Σύ με ἐν τοῖς ὕδασι, τοῦ Ἰορδάνου ἀπόπλυνον, ῥύπον ὅλως μὴ ἔχοντα, ὁ Κύριος ἔφησε· καὶ ἡ ῥυπωθεῖσα, φύσις τῶν ἀνθρώπων, τῇ παραβάσει τοῦ Ἀδάμ, ἀποπλυθεῖσα καινὴ γενήσεται· ἐμοῦ βαπτιζομένου γάρ, ἡ ἀναγέννησις ἅπασι, τοῖς ἀνθρώποις διʼ ὕδατος, καὶ τοῦ Πνεύματος γίνεται.
ltx/gr_gr_cog/me.m01.d11:meVE.GeneralApolytikion1.melody	@ltx/gr_gr_cog/he.ga:heGA.TaisTonDakryonSou.name
ltx/gr_gr_cog/me.m01.d11:meVE.GeneralApolytikion1.mode	@ltx/gr_gr_cog/miscellanea:misc.Mode8
ltx/gr_gr_cog/me.m01.d11:meVE.GeneralApolytikion1.name	Ὅσιε Πατὴρ ἡμῶν Θεοδόσιε,
ltx/gr_gr_cog/me.m01.d11:meVE.MM.GeneralApolytikion1.text	@ltx/gr_gr_cog/properties:media.key
ltx/gr_gr_cog/me.m01.d11:meVE.SticBoth.incipit	@ltx/gr_gr_cog/me.m01.d06:meVE.SticGlory.incipit
ltx/gr_gr_cog/me.m01.d11:meVE.SticBoth.melody	
ltx/gr_gr_cog/me.m01.d11:meVE.SticBoth.mode	@ltx/gr_gr_cog/miscellanea:misc.Mode2
ltx/gr_gr_cog/me.m01.d11:meVE.SticBoth.poet	@ltx/gr_gr_cog/poets:po.Vyzantiou
ltx/gr_gr_cog/me.m01.d11:meVE.SticBoth.text	@ltx/gr_gr_cog/me.m01.d06:meVE.SticGlory.text
ltx/gr_gr_cog/me.m01.d11:meVE.SticGlory.incipit	Ὅσιε Πάτερ, ὡς πόλιν ζῶντος…
ltx/gr_gr_cog/me.m01.d11:meVE.SticGlory.melody	
ltx/gr_gr_cog/me.m01.d11:meVE.SticGlory.mode	@ltx/gr_gr_cog/miscellanea:misc.Mode2
ltx/gr_gr_cog/me.m01.d11:meVE.SticGlory.poet	@ltx/gr_gr_cog/poets:po.Anatoliou
ltx/gr_gr_cog/me.m01.d11:meVE.SticGlory.text	Ὅσιε Πάτερ, ὡς πόλιν ζῶντος Θεοῦ, εὔφραναν τὴν ἱεράν σου ψυχήν, τοῦ ποταμοῦ τὰ ὁρμήματα, τοῦ ὕδατος τῆς ἀφέσεως, τοῦ διελθόντος τὸν Ἰορδάνην, καὶ πᾶσι τοῖς πέρασι, τῆς εὐσεβείας τὸν λόγον πηγάσαντος, Χριστοῦ τοῦ Θεοῦ ἡμῶν, ὃν ἱκέτευε παμμάκαρ Θεοδόσιε, τοῦ σωθῆναι τὰς ψυχὰς ἡμῶν.
ltx/gr_gr_cog/me.m01.d11:meVE.Stichera01.greekmelody	@ltx/gr_gr_cog/he.a.m5:heAU.OsiePater.greekname
ltx/gr_gr_cog/me.m01.d11:meVE.Stichera01.incipit	@ltx/gr_gr_cog/he.a.m5:heAU.OsiePater.incipit
ltx/gr_gr_cog/me.m01.d11:meVE.Stichera01.melody	@ltx/gr_gr_cog/he.a.m5:heAU.OsiePater.melody
ltx/gr_gr_cog/me.m01.d11:meVE.Stichera01.mode	@ltx/gr_gr_cog/miscellanea:misc.Mode5
ltx/gr_gr_cog/me.m01.d11:meVE.Stichera01.text	@ltx/gr_gr_cog/he.a.m5:heAU.OsiePater.text
ltx/gr_gr_cog/me.m01.d11:meVE.Stichera02.incipit	Ὅσιε Πάτερ, Θεοφόρε Θεοδόσιε, εὑροῦσα…
ltx/gr_gr_cog/me.m01.d11:meVE.Stichera02.melody	@ltx/gr_gr_cog/he.a.m5:heAU.OsiePater.name
ltx/gr_gr_cog/me.m01.d11:meVE.Stichera02.mode	@ltx/gr_gr_cog/miscellanea:misc.Mode5
ltx/gr_gr_cog/me.m01.d11:meVE.Stichera02.text	Ὅσιε Πάτερ, Θεοφόρε Θεοδόσιε, εὑροῦσα ὡς ἐπόθει, τὴν καθαράν σου ψυχήν, τοῦ Πνεύματος ἡ χάρις τοῦ Παναγίου, σοὶ ἐνεσκήνωσεν ὡς ἄχραντον φῶς, οὗ τῇ ἐνεργείᾳ φαιδρῶς ἠγλαϊσμένος, Χριστὸν ἀπαύστως δοξολογεῖς, τὸν ἐν δυσὶ ταῖς οὐσίαις ἕνα Υἱόν, τὸν βαπτιζόμενον χειρὶ τῇ τοῦ Προδρόμου, καὶ μαρτυρούμενον τῇ φωνῇ τῇ πατρῴᾳ. Αὐτὸν ἱκέτευε, αὐτὸν δυσώπει Ὅσιε, δωρηθῆναι τῇ οἰκουμένῃ, ὁμόνοιαν, εἰρήνην, καὶ μέγα ἔλεος.
ltx/gr_gr_cog/me.m01.d11:meVE.Stichera03.incipit	Ὅσιε Πάτερ, Θεοφόρε Θεοδόσιε, εἰκότως…
ltx/gr_gr_cog/me.m01.d11:meVE.Stichera03.melody	@ltx/gr_gr_cog/he.a.m5:heAU.OsiePater.name
ltx/gr_gr_cog/me.m01.d11:meVE.Stichera03.mode	@ltx/gr_gr_cog/miscellanea:misc.Mode5
ltx/gr_gr_cog/me.m01.d11:meVE.Stichera03.text	Ὅσιε Πάτερ, Θεοφόρε Θεοδόσιε, εἰκότως ἠξιώθης τῆς μακαρίας ζωῆς, ἁγνείᾳ καὶ ἀσκήσει ταύτην εὑρών· ζῶν γὰρ μετέστης πρὸς τὴν ἄνω ζωήν, πᾶσι χαίρειν εἰπών, καὶ σὺν τοῖς Ἀσωμάτοις, Χριστὸν ἀπαύστως δοξολογῶν, τὸν ἐκ Παρθένου ἀφράστως σάρκα λαβόντα, καὶ καταδύσαντα τὰς ἡμῶν ἁμαρτίας, ἐν τῷ Βαπτίσματι, ἐν ῥείθροις Ἰορδάνου. Αὐτὸν ἱκέτευε, αὐτὸν δυσώπει Ὅσιε, δωρηθῆναι τῇ οἰκουμένῃ, ὁμόνοιαν, εἰρήνην, καὶ μέγα ἔλεος.
ltx/gr_gr_cog/me.m01.d11:meVE.Stichera8910.text	@ltx/gr_gr_cog/properties:media.key
