ltx/gr_gr_cog/me.m06.d13:meDA.commemoration.first	Μνήμη τῆς Ἁγίας Μάρτυρος Ἀκυλίνης
ltx/gr_gr_cog/me.m06.d13:meDA.commemoration.first_name	
ltx/gr_gr_cog/me.m06.d13:meDA.commemoration.first_short	Μνήμη τῆς Ἁγίας Μάρτυρος Ἀκυλίνης
ltx/gr_gr_cog/me.m06.d13:meDA.commemoration.first_title	@ltx/gr_gr_cog/titles:ti.SaintW
ltx/gr_gr_cog/me.m06.d13:meDA.commemoration.full	Μνήμη τῆς Ἁγίας Μάρτυρος Ἀκυλίνης
ltx/gr_gr_cog/me.m06.d13:meDA.commemoration.second_name	
ltx/gr_gr_cog/me.m06.d13:meDA.commemoration.second_title	
ltx/gr_gr_cog/me.m06.d13:meDA.date	Τῌ ΙΓʹ ΙΟΥΝΙΟΥ
ltx/gr_gr_cog/me.m06.d13:meDA.dismissal	
ltx/gr_gr_cog/me.m06.d13:meDA.fordate	διὰ τὴν 13ην Ἰουνίου
ltx/gr_gr_cog/me.m06.d13:meDA.insert1	καὶ τῆς Ἁγίας Μάρτυρος Ἀκυλίνης,
ltx/gr_gr_cog/me.m06.d13:meDA.insert2	ἧς καὶ τὴν μνήμην ἐπιτελοῦμεν·
ltx/gr_gr_cog/me.m06.d13:meDA.note	
ltx/gr_gr_cog/me.m06.d13:meDA.pdfcoverdate	τῆς 13ης Ἰουνίου,
ltx/gr_gr_cog/me.m06.d13:meDA.pdfheaderdate	τῆς 13ης Ἰουνίου
ltx/gr_gr_cog/me.m06.d13:meHO.commemorations	
ltx/gr_gr_cog/me.m06.d13:meHO.note1	
ltx/gr_gr_cog/me.m06.d13:meHO.note2	
ltx/gr_gr_cog/me.m06.d13:meHO.number	
ltx/gr_gr_cog/me.m06.d13:meHO.rank	
ltx/gr_gr_cog/me.m06.d13:meLE.commemoration1	Μνήμη τῆς Ἁγίας Μάρτυρος Ἀκυλίνης.
ltx/gr_gr_cog/me.m06.d13:meLE.commemoration2	
ltx/gr_gr_cog/me.m06.d13:meLI.Kontakion1.greekmelody	@ltx/gr_gr_cog/me.m06.d13:meMA.Kontakion1.greekmelody
ltx/gr_gr_cog/me.m06.d13:meLI.Kontakion1.incipit	@ltx/gr_gr_cog/me.m06.d13:meMA.Kontakion1.incipit
ltx/gr_gr_cog/me.m06.d13:meLI.Kontakion1.melody	@ltx/gr_gr_cog/me.m06.d13:meMA.Kontakion1.melody
ltx/gr_gr_cog/me.m06.d13:meLI.Kontakion1.mode	@ltx/gr_gr_cog/me.m06.d13:meMA.Kontakion1.mode
ltx/gr_gr_cog/me.m06.d13:meLI.Kontakion1.text	@ltx/gr_gr_cog/me.m06.d13:meMA.Kontakion1.text
ltx/gr_gr_cog/me.m06.d13:meLI.MM.CommunionHymn.text	@ltx/gr_gr_cog/properties:media.key
ltx/gr_gr_cog/me.m06.d13:meLI.Megalynarion.text	
ltx/gr_gr_cog/me.m06.d13:meMA.C1.acrostic.notice1	οὗ ἡ Ἀκροστιχίς·
ltx/gr_gr_cog/me.m06.d13:meMA.C1.acrostic.text	Δέχου τὸν ὕμνον καλλίπαις Ἀκυλῖνα. Ἰωσήφ.
ltx/gr_gr_cog/me.m06.d13:meMA.C1.acrostic.title	Ὁ Κανὼν τῆς Ἁγίας,
ltx/gr_gr_cog/me.m06.d13:meMA.C1.title	@ltx/gr_gr_cog/titles:ti.CanonSaintW
ltx/gr_gr_cog/me.m06.d13:meMA.C1.verse	@ltx/gr_gr_cog/prayers:pr.verse_SaintW.text
ltx/gr_gr_cog/me.m06.d13:meMA.Kontakion1.greekmelody	@ltx/gr_gr_cog/he.a.m3:heAU.IParthenosSimeron.greekname
ltx/gr_gr_cog/me.m06.d13:meMA.Kontakion1.incipit	Ῥαντισμοῖς αἱμάτων σου…
ltx/gr_gr_cog/me.m06.d13:meMA.Kontakion1.melody	@ltx/gr_gr_cog/he.a.m3:heAU.IParthenosSimeron.name
ltx/gr_gr_cog/me.m06.d13:meMA.Kontakion1.mode	@ltx/gr_gr_cog/miscellanea:misc.Mode3
ltx/gr_gr_cog/me.m06.d13:meMA.Kontakion1.text	Ῥαντισμοῖς αἱμάτων σου, καθηγνισμένην παρθένε, καὶ Μαρτύρων στέμμασι, σὲ Ἀκυλῖνα στεφθεῖσαν, δέδωκε, τοῖς ἐν ἀνάγκαις τῶν νοσημάτων, ἴασιν, καὶ σωτηρίαν ὁ σὸς νυμφίος, τοῖς προστρέχουσιν ἐν πίστει, Χριστὸς ὁ βρύων ζωὴν αἰώνιον.
ltx/gr_gr_cog/me.m06.d13:meMA.Ode1C11.greekmelody	@ltx/gr_gr_cog/he.h.m8:heHE.IKekommeni.greekname
ltx/gr_gr_cog/me.m06.d13:meMA.Ode1C11.incipit	Δεδοξασμένη Χριστῷ τῷ νυμφίῳ σου…
ltx/gr_gr_cog/me.m06.d13:meMA.Ode1C11.melody	@ltx/gr_gr_cog/he.h.m8:heHE.IKekommeni.name
ltx/gr_gr_cog/me.m06.d13:meMA.Ode1C11.mode	@ltx/gr_gr_cog/miscellanea:misc.Mode8
ltx/gr_gr_cog/me.m06.d13:meMA.Ode1C11.ode	@ltx/gr_gr_cog/miscellanea:misc.Ode1
ltx/gr_gr_cog/me.m06.d13:meMA.Ode1C11.text	Δεδοξασμένη Χριστῷ τῷ νυμφίῳ σου, ἐν οὐρανοῖς ἀληθῶς, χαίρουσα παρίστασαι· διό σε ἐπὶ γῆς τοὺς εὐσεβῶς γεραίροντας, εὐχαῖς σου ἀντιδόξασον Σεμνή, καὶ σοῦ μετόχους ποίησον, τῷ Κυρίῳ ψάλλοντας· Ἐνδόξως γὰρ δεδόξασται.
ltx/gr_gr_cog/me.m06.d13:meMA.Ode1C12.incipit	Εἰσεποιήσω τὴν χάριν τοῦ Πνεύματος…
ltx/gr_gr_cog/me.m06.d13:meMA.Ode1C12.melody	@ltx/gr_gr_cog/he.h.m8:heHE.IKekommeni.name
ltx/gr_gr_cog/me.m06.d13:meMA.Ode1C12.mode	@ltx/gr_gr_cog/miscellanea:misc.Mode8
ltx/gr_gr_cog/me.m06.d13:meMA.Ode1C12.ode	@ltx/gr_gr_cog/miscellanea:misc.Ode1
ltx/gr_gr_cog/me.m06.d13:meMA.Ode1C12.text	Εἰσεποιήσω τὴν χάριν τοῦ Πνεύματος, τὴν σὴν ψυχὴν καθαράν, Ἔνδοξε τελέσασα, καὶ στίγμασι σαρκὸς ὡραιοτάτη πέφηνας· διό σε ὁ νυμφίος τῶν ψυχῶν, ἁγνή, τελείως ἄμωμον, ὅλην χρηματίσασαν, ἡρμόσατο πανεύφημε.
ltx/gr_gr_cog/me.m06.d13:meMA.Ode1C13.incipit	Χειμῶνος πλάνης τῆς γῆς τὰ…
ltx/gr_gr_cog/me.m06.d13:meMA.Ode1C13.melody	@ltx/gr_gr_cog/he.h.m8:heHE.IKekommeni.name
ltx/gr_gr_cog/me.m06.d13:meMA.Ode1C13.mode	@ltx/gr_gr_cog/miscellanea:misc.Mode8
ltx/gr_gr_cog/me.m06.d13:meMA.Ode1C13.ode	@ltx/gr_gr_cog/miscellanea:misc.Ode1
ltx/gr_gr_cog/me.m06.d13:meMA.Ode1C13.text	Χειμῶνος πλάνης τῆς γῆς τὰ πληρώματα, πληροῦντος πάλαι δεινῶς, πλήρης οὖσα Πνεύματος, ὡς Μάρτυς ἀπλανὴς Κυρίου παντοκράτορος, ἐπέφθασας τὸ ἔαρ τῆς ζωῆς, καὶ νίκης ἦρας τρόπαιον, Ἀκυλῖνα ἔνδοξε, θεόφρον ἀξιάγαστε.
ltx/gr_gr_cog/me.m06.d13:meMA.Ode1C1T.incipit	Ὁ τῷ ἀνάρχῳ Πατρὶ συννοούμενος…
ltx/gr_gr_cog/me.m06.d13:meMA.Ode1C1T.melody	@ltx/gr_gr_cog/he.h.m8:heHE.IKekommeni.name
ltx/gr_gr_cog/me.m06.d13:meMA.Ode1C1T.mode	@ltx/gr_gr_cog/miscellanea:misc.Mode8
ltx/gr_gr_cog/me.m06.d13:meMA.Ode1C1T.ode	@ltx/gr_gr_cog/miscellanea:misc.Ode1
ltx/gr_gr_cog/me.m06.d13:meMA.Ode1C1T.text	Ὁ τῷ ἀνάρχῳ Πατρὶ συννοούμενος, ὑπέδυ μήτραν τὴν σήν, ἄνθρωπος γενόμενος, καὶ ἔσωσεν ἡμᾶς, κακίᾳ ὑποκύψαντας, καὶ πλάνῃ δουλωθέντας τοῦ ἐχθροῦ, Μαρία Θεονύμφευτε· διὰ τοῦτο πίστει σε, καὶ πόθῳ μακαρίζομεν.
ltx/gr_gr_cog/me.m06.d13:meMA.Ode3C11.greekmelody	@ltx/gr_gr_cog/he.h.m8:heHE.SyEiToStereoma.greekname
ltx/gr_gr_cog/me.m06.d13:meMA.Ode3C11.incipit	Ὕφανας ἐν χάριτι, καταστολὴν φωτὸς…
ltx/gr_gr_cog/me.m06.d13:meMA.Ode3C11.melody	@ltx/gr_gr_cog/he.h.m8:heHE.SyEiToStereoma.name
ltx/gr_gr_cog/me.m06.d13:meMA.Ode3C11.mode	@ltx/gr_gr_cog/miscellanea:misc.Mode8
ltx/gr_gr_cog/me.m06.d13:meMA.Ode3C11.ode	@ltx/gr_gr_cog/miscellanea:misc.Ode3
ltx/gr_gr_cog/me.m06.d13:meMA.Ode3C11.text	Ὕφανας ἐν χάριτι, καταστολὴν φωτὸς ἔνδοξε, αἵματι σῷ, ταύτην Ἀκυλῖνα, ἱερῶς ἐπιχρώσασα.
ltx/gr_gr_cog/me.m06.d13:meMA.Ode3C12.incipit	Τέτρωσαι τῷ ἔρωτι, τῷ θεϊκῷ…
ltx/gr_gr_cog/me.m06.d13:meMA.Ode3C12.melody	@ltx/gr_gr_cog/he.h.m8:heHE.SyEiToStereoma.name
ltx/gr_gr_cog/me.m06.d13:meMA.Ode3C12.mode	@ltx/gr_gr_cog/miscellanea:misc.Mode8
ltx/gr_gr_cog/me.m06.d13:meMA.Ode3C12.ode	@ltx/gr_gr_cog/miscellanea:misc.Ode3
ltx/gr_gr_cog/me.m06.d13:meMA.Ode3C12.text	Τέτρωσαι τῷ ἔρωτι, τῷ θεϊκῷ σαφῶς Πάνσεμνε· ὅθεν στεῤῥῶς, τρώσεις τε καὶ πόνους, χαλεποὺς ἐκαρτέρησας.
ltx/gr_gr_cog/me.m06.d13:meMA.Ode3C13.incipit	Ὅλην σε ἡγίασεν, ὁ λυτρωτὴς…
ltx/gr_gr_cog/me.m06.d13:meMA.Ode3C13.melody	@ltx/gr_gr_cog/he.h.m8:heHE.SyEiToStereoma.name
ltx/gr_gr_cog/me.m06.d13:meMA.Ode3C13.mode	@ltx/gr_gr_cog/miscellanea:misc.Mode8
ltx/gr_gr_cog/me.m06.d13:meMA.Ode3C13.ode	@ltx/gr_gr_cog/miscellanea:misc.Ode3
ltx/gr_gr_cog/me.m06.d13:meMA.Ode3C13.text	Ὅλην σε ἡγίασεν, ὁ λυτρωτὴς σεμνὴ Κύριος, ὁλοσχερῶς, τοῦτον Ἀκυλῖνα, ἐκ ψυχῆς ἀγαπήσασα.
ltx/gr_gr_cog/me.m06.d13:meMA.Ode3C1T.incipit	Νύμφην σε ἀνύμφευτον, καὶ καθαρὸν…
ltx/gr_gr_cog/me.m06.d13:meMA.Ode3C1T.melody	@ltx/gr_gr_cog/he.h.m8:heHE.SyEiToStereoma.name
ltx/gr_gr_cog/me.m06.d13:meMA.Ode3C1T.mode	@ltx/gr_gr_cog/miscellanea:misc.Mode8
ltx/gr_gr_cog/me.m06.d13:meMA.Ode3C1T.ode	@ltx/gr_gr_cog/miscellanea:misc.Ode3
ltx/gr_gr_cog/me.m06.d13:meMA.Ode3C1T.text	Νύμφην σε ἀνύμφευτον, καὶ καθαρὸν Ἁγνὴ σκήνωμα, τοῦ Ποιητοῦ, καὶ ἁγιωτέραν Χερουβὶμ ἐπιστάμεθα.
ltx/gr_gr_cog/me.m06.d13:meMA.Ode3H.greekmelody	@ltx/gr_gr_cog/he.h.m8:heHE.SyEiToStereoma.greekname
ltx/gr_gr_cog/me.m06.d13:meMA.Ode3H.incipit	@ltx/gr_gr_cog/he.h.m8:heHE.SyEiToStereoma.incipit
ltx/gr_gr_cog/me.m06.d13:meMA.Ode3H.melody	@ltx/gr_gr_cog/he.h.m8:heHE.SyEiToStereoma.melody
ltx/gr_gr_cog/me.m06.d13:meMA.Ode3H.mode	@ltx/gr_gr_cog/miscellanea:misc.Mode8
ltx/gr_gr_cog/me.m06.d13:meMA.Ode3H.ode	@ltx/gr_gr_cog/miscellanea:misc.Ode3
ltx/gr_gr_cog/me.m06.d13:meMA.Ode3H.text	@ltx/gr_gr_cog/he.h.m8:heHE.SyEiToStereoma.text
ltx/gr_gr_cog/me.m06.d13:meMA.Ode3Kathisma1.greekmelody	@ltx/gr_gr_cog/he.a.m8:heAU.TinSofianKaiLogon.greekname
ltx/gr_gr_cog/me.m06.d13:meMA.Ode3Kathisma1.incipit	Ἀρετῶν πυρσευθεῖσα θείῳ φωτί, ἀθλητῶν…
ltx/gr_gr_cog/me.m06.d13:meMA.Ode3Kathisma1.melody	@ltx/gr_gr_cog/he.a.m8:heAU.TinSofianKaiLogon.name
ltx/gr_gr_cog/me.m06.d13:meMA.Ode3Kathisma1.mode	@ltx/gr_gr_cog/miscellanea:misc.Mode8
ltx/gr_gr_cog/me.m06.d13:meMA.Ode3Kathisma1.text	Ἀρετῶν πυρσευθεῖσα θείῳ φωτί, ἀθλητῶν ἐκοσμήθης πανευκλεῶς, σεμνὴ διαδήματι, καὶ ὡραία ἐν κάλλει, γεγονυῖα πίστει, τῷ πάντων δεσπόζοντι, ἐνυμφεύθης ὄντως, ἀμίαντος ἄφθορος· ὅθεν οὐρανίων, ἠξιώθης θαλάμων, καλῶς ἐναθλήσασα, καὶ τὸν δόλιον κτείνασα, Ἀκυλῖνα θεόσοφε, πρέσβευε Χριστῷ τῷ Θεῷ τῶν πταισμάτων ἄφεσιν δωρήσασθαι, τοῖς ἑορτάζουσι πίστει, τὴν ἁγίαν μνήμην σου.
ltx/gr_gr_cog/me.m06.d13:meMA.Ode3KathismaSt.incipit	@ltx/gr_gr_cog/me.m01.d24:meMA.Ode3KathismaSt.incipit
ltx/gr_gr_cog/me.m06.d13:meMA.Ode3KathismaSt.melody	@ltx/gr_gr_cog/he.a.m8:heAU.TinSofianKaiLogon.name
ltx/gr_gr_cog/me.m06.d13:meMA.Ode3KathismaSt.mode	@ltx/gr_gr_cog/miscellanea:misc.Mode8
ltx/gr_gr_cog/me.m06.d13:meMA.Ode3KathismaSt.text	@ltx/gr_gr_cog/me.m01.d24:meMA.Ode3KathismaSt.text
ltx/gr_gr_cog/me.m06.d13:meMA.Ode3KathismaT.incipit	Παναγία Παρθένε Μήτηρ Θεοῦ, τῆς…
ltx/gr_gr_cog/me.m06.d13:meMA.Ode3KathismaT.melody	@ltx/gr_gr_cog/he.a.m8:heAU.TinSofianKaiLogon.name
ltx/gr_gr_cog/me.m06.d13:meMA.Ode3KathismaT.mode	@ltx/gr_gr_cog/miscellanea:misc.Mode8
ltx/gr_gr_cog/me.m06.d13:meMA.Ode3KathismaT.text	Παναγία Παρθένε Μήτηρ Θεοῦ, τῆς ψυχῆς μου τὰ πάθη τὰ χαλεπά, ἴασαι δέομαι, καὶ συγγνώμην παράσχου μοι, τῶν ἐμῶν πταισμάτων, ἀφρόνως ὧν ἔπραξα, τὴν ψυχήν καὶ τὸ σῶμα, μολύνας ὁ ἄθλιος, Οἴμοι! Τί ποιήσω ἐν ἐκείνῃ τῇ ὥρᾳ, ἡνίκα οἱ Ἄγγελοι, τὴν ψυχήν μου χωρίζουσιν, ἐκ τοῦ ἀθλίου μου σώματος; Τότε Δέσποινα βοήθειά μοι γενοῦ, καὶ προστάτις θερμότατος· σὲ γὰρ ἔχω ἐλπίδα, ὁ ἀνάξιος δοῦλός σου.
ltx/gr_gr_cog/me.m06.d13:meMA.Ode4C11.greekmelody	@ltx/gr_gr_cog/he.h.m8:heHE.EisakikoaKyrie.greekname
ltx/gr_gr_cog/me.m06.d13:meMA.Ode4C11.incipit	Ὑπερήφανον δράκοντα, σὺ διʼ ἀσθενείας…
ltx/gr_gr_cog/me.m06.d13:meMA.Ode4C11.melody	@ltx/gr_gr_cog/he.h.m8:heHE.EisakikoaKyrie.name
ltx/gr_gr_cog/me.m06.d13:meMA.Ode4C11.mode	@ltx/gr_gr_cog/miscellanea:misc.Mode8
ltx/gr_gr_cog/me.m06.d13:meMA.Ode4C11.ode	@ltx/gr_gr_cog/miscellanea:misc.Ode4
ltx/gr_gr_cog/me.m06.d13:meMA.Ode4C11.text	Ὑπερήφανον δράκοντα, σὺ διʼ ἀσθενείας σαρκὸς κατέβαλες, ἀριστεύσασα λαμπρότατα, καὶ τυράννων θράσος ἀφανίσασα.
ltx/gr_gr_cog/me.m06.d13:meMA.Ode4C12.incipit	Μαρτυρίου λαμπρότησι, καὶ τῆς παρθενίας…
ltx/gr_gr_cog/me.m06.d13:meMA.Ode4C12.melody	@ltx/gr_gr_cog/he.h.m8:heHE.EisakikoaKyrie.name
ltx/gr_gr_cog/me.m06.d13:meMA.Ode4C12.mode	@ltx/gr_gr_cog/miscellanea:misc.Mode8
ltx/gr_gr_cog/me.m06.d13:meMA.Ode4C12.ode	@ltx/gr_gr_cog/miscellanea:misc.Ode4
ltx/gr_gr_cog/me.m06.d13:meMA.Ode4C12.text	Μαρτυρίου λαμπρότησι, καὶ τῆς παρθενίας θείοις ἐν κάλλεσιν, Ἀκυλῖνα ἐχρημάτισας, τοῦ Δεσπότου νύμφη περιδέξιος.
ltx/gr_gr_cog/me.m06.d13:meMA.Ode4C13.incipit	Νεκρωθὲν τὸ σαρκίον σου, ταῖς…
ltx/gr_gr_cog/me.m06.d13:meMA.Ode4C13.melody	@ltx/gr_gr_cog/he.h.m8:heHE.EisakikoaKyrie.name
ltx/gr_gr_cog/me.m06.d13:meMA.Ode4C13.mode	@ltx/gr_gr_cog/miscellanea:misc.Mode8
ltx/gr_gr_cog/me.m06.d13:meMA.Ode4C13.ode	@ltx/gr_gr_cog/miscellanea:misc.Ode4
ltx/gr_gr_cog/me.m06.d13:meMA.Ode4C13.text	Νεκρωθὲν τὸ σαρκίον σου, ταῖς πολυειδέσι στρέβλαις θεόπνευστε, τὴν ζωήν σοι προεξένησε, τὴν εἰς τοὺς αἰῶνας διαμένουσαν.
ltx/gr_gr_cog/me.m06.d13:meMA.Ode4C14.incipit	Οἱ κρουνοὶ τῶν αἱμάτων σου…
ltx/gr_gr_cog/me.m06.d13:meMA.Ode4C14.melody	@ltx/gr_gr_cog/he.h.m8:heHE.EisakikoaKyrie.name
ltx/gr_gr_cog/me.m06.d13:meMA.Ode4C14.mode	@ltx/gr_gr_cog/miscellanea:misc.Mode8
ltx/gr_gr_cog/me.m06.d13:meMA.Ode4C14.ode	@ltx/gr_gr_cog/miscellanea:misc.Ode4
ltx/gr_gr_cog/me.m06.d13:meMA.Ode4C14.text	Οἱ κρουνοὶ τῶν αἱμάτων σου, τῆς πολυθεΐας τὸ πῦρ κατέσβεσαν, τῶν θαυμάτων δὲ τὰ ῥεύματα, τῶν βροτῶν ἐκπλύνει τὰ νοσήματα.
ltx/gr_gr_cog/me.m06.d13:meMA.Ode4C1T.incipit	Νυσταγμῷ ἀμελείας με, ὕπνος ἁμαρτίας…
ltx/gr_gr_cog/me.m06.d13:meMA.Ode4C1T.melody	@ltx/gr_gr_cog/he.h.m8:heHE.EisakikoaKyrie.name
ltx/gr_gr_cog/me.m06.d13:meMA.Ode4C1T.mode	@ltx/gr_gr_cog/miscellanea:misc.Mode8
ltx/gr_gr_cog/me.m06.d13:meMA.Ode4C1T.ode	@ltx/gr_gr_cog/miscellanea:misc.Ode4
ltx/gr_gr_cog/me.m06.d13:meMA.Ode4C1T.text	Νυσταγμῷ ἀμελείας με, ὕπνος ἁμαρτίας Κόρη κατέλαβε, τῇ ἀγρύπνῳ ἱκεσίᾳ σου, διανάστησόν με πρὸς μετάνοιαν.
ltx/gr_gr_cog/me.m06.d13:meMA.Ode5C11.greekmelody	@ltx/gr_gr_cog/he.h.m8:heHE.OEkNyktosAgnoias.greekname
ltx/gr_gr_cog/me.m06.d13:meMA.Ode5C11.incipit	Κυμαινομένης ὥσπερ, ἀγριαινούσης θαλάσσης τῆς…
ltx/gr_gr_cog/me.m06.d13:meMA.Ode5C11.melody	@ltx/gr_gr_cog/he.h.m8:heHE.OEkNyktosAgnoias.name
ltx/gr_gr_cog/me.m06.d13:meMA.Ode5C11.mode	@ltx/gr_gr_cog/miscellanea:misc.Mode8
ltx/gr_gr_cog/me.m06.d13:meMA.Ode5C11.ode	@ltx/gr_gr_cog/miscellanea:misc.Ode5
ltx/gr_gr_cog/me.m06.d13:meMA.Ode5C11.text	Κυμαινομένης ὥσπερ, ἀγριαινούσης θαλάσσης τῆς πλάνης ποτέ, ὤφθης κυβερνωμένη, Μάρτυς Ἀκυλῖνα Χριστοῦ δεξιᾷ.
ltx/gr_gr_cog/me.m06.d13:meMA.Ode5C12.incipit	Ἀποσκοποῦσα Μάρτυς, πρὸς τὰ βραβεῖα…
ltx/gr_gr_cog/me.m06.d13:meMA.Ode5C12.melody	@ltx/gr_gr_cog/he.h.m8:heHE.OEkNyktosAgnoias.name
ltx/gr_gr_cog/me.m06.d13:meMA.Ode5C12.mode	@ltx/gr_gr_cog/miscellanea:misc.Mode8
ltx/gr_gr_cog/me.m06.d13:meMA.Ode5C12.ode	@ltx/gr_gr_cog/miscellanea:misc.Ode5
ltx/gr_gr_cog/me.m06.d13:meMA.Ode5C12.text	Ἀποσκοποῦσα Μάρτυς, πρὸς τὰ βραβεῖα ὑπέστης στεῤῥότατα, σπαραγμοὺς τῶν μελῶν σου, καὶ τὸν βιαιότατον θάνατον.
ltx/gr_gr_cog/me.m06.d13:meMA.Ode5C13.incipit	Λαμπροφανὴς ὡράθης, τοῖς πολεμίοις αὐτοὺς…
ltx/gr_gr_cog/me.m06.d13:meMA.Ode5C13.melody	@ltx/gr_gr_cog/he.h.m8:heHE.OEkNyktosAgnoias.name
ltx/gr_gr_cog/me.m06.d13:meMA.Ode5C13.mode	@ltx/gr_gr_cog/miscellanea:misc.Mode8
ltx/gr_gr_cog/me.m06.d13:meMA.Ode5C13.ode	@ltx/gr_gr_cog/miscellanea:misc.Ode5
ltx/gr_gr_cog/me.m06.d13:meMA.Ode5C13.text	Λαμπροφανὴς ὡράθης, τοῖς πολεμίοις αὐτοὺς καταπλήττουσα, τῷ ὡραίῳ σου κάλλει, καὶ τῷ τῆς ψυχῆς ἀναστήματι.
ltx/gr_gr_cog/me.m06.d13:meMA.Ode5C1T.incipit	Λελυτρωμένοι πάντες, προγονικῆς καταδίκης τῷ…
ltx/gr_gr_cog/me.m06.d13:meMA.Ode5C1T.melody	@ltx/gr_gr_cog/he.h.m8:heHE.OEkNyktosAgnoias.name
ltx/gr_gr_cog/me.m06.d13:meMA.Ode5C1T.mode	@ltx/gr_gr_cog/miscellanea:misc.Mode8
ltx/gr_gr_cog/me.m06.d13:meMA.Ode5C1T.ode	@ltx/gr_gr_cog/miscellanea:misc.Ode5
ltx/gr_gr_cog/me.m06.d13:meMA.Ode5C1T.text	Λελυτρωμένοι πάντες, προγονικῆς καταδίκης τῷ τόκῳ σου· Χαῖρέ σοι προσφωνοῦμεν, Κεχαριτωμένη πανύμνητε.
ltx/gr_gr_cog/me.m06.d13:meMA.Ode6C11.greekmelody	@ltx/gr_gr_cog/he.h.m8:heHE.TonIonanEnToKitei.greekname
ltx/gr_gr_cog/me.m06.d13:meMA.Ode6C11.incipit	Ἰχνηλατεῖν τοῦ Χριστοῦ τὰ ἔνδοξα…
ltx/gr_gr_cog/me.m06.d13:meMA.Ode6C11.melody	@ltx/gr_gr_cog/he.h.m8:heHE.TonIonanEnToKitei.name
ltx/gr_gr_cog/me.m06.d13:meMA.Ode6C11.mode	@ltx/gr_gr_cog/miscellanea:misc.Mode8
ltx/gr_gr_cog/me.m06.d13:meMA.Ode6C11.ode	@ltx/gr_gr_cog/miscellanea:misc.Ode6
ltx/gr_gr_cog/me.m06.d13:meMA.Ode6C11.text	Ἰχνηλατεῖν τοῦ Χριστοῦ τὰ ἔνδοξα, ἐπόθησας παθήματα, Παρθένε καὶ ἀνδρειοφρόνως, ὑπέστης τοὺς αἰκισμούς, καὶ σπαραγμούς, τοῦ ἁγνοῦ σου σώματος.
ltx/gr_gr_cog/me.m06.d13:meMA.Ode6C12.incipit	Πολυειδεῖς πόνους ἐκαρτέρησας, πυρός τε…
ltx/gr_gr_cog/me.m06.d13:meMA.Ode6C12.melody	@ltx/gr_gr_cog/he.h.m8:heHE.TonIonanEnToKitei.name
ltx/gr_gr_cog/me.m06.d13:meMA.Ode6C12.mode	@ltx/gr_gr_cog/miscellanea:misc.Mode8
ltx/gr_gr_cog/me.m06.d13:meMA.Ode6C12.ode	@ltx/gr_gr_cog/miscellanea:misc.Ode6
ltx/gr_gr_cog/me.m06.d13:meMA.Ode6C12.text	Πολυειδεῖς πόνους ἐκαρτέρησας, πυρός τε κατεφρόνησας· παρθένε ὅθεν Ἀκυλῖνα, καὶ τὰς ὀδύνας ἡμῶν, διαπαντὸς κουφίζεις πρεσβείαις σου.
ltx/gr_gr_cog/me.m06.d13:meMA.Ode6C13.incipit	Ἀποσκοπῶν ἄνωθεν ἐθαύμασε, χορὸς Ἀγγέλων…
ltx/gr_gr_cog/me.m06.d13:meMA.Ode6C13.melody	@ltx/gr_gr_cog/he.h.m8:heHE.TonIonanEnToKitei.name
ltx/gr_gr_cog/me.m06.d13:meMA.Ode6C13.mode	@ltx/gr_gr_cog/miscellanea:misc.Mode8
ltx/gr_gr_cog/me.m06.d13:meMA.Ode6C13.ode	@ltx/gr_gr_cog/miscellanea:misc.Ode6
ltx/gr_gr_cog/me.m06.d13:meMA.Ode6C13.text	Ἀποσκοπῶν ἄνωθεν ἐθαύμασε, χορὸς Ἀγγέλων ἔνδοξε, Παρθένε τὴν ὑπομονήν σου, ὅπως ἀσάρκους ἐχθρούς, μετὰ σαρκὸς ἐνίκησας ἐν χάριτι.
ltx/gr_gr_cog/me.m06.d13:meMA.Ode6C1T.incipit	Ἵνα Θεὸς ὁ ἄνθρωπος γένηται…
ltx/gr_gr_cog/me.m06.d13:meMA.Ode6C1T.melody	@ltx/gr_gr_cog/he.h.m8:heHE.TonIonanEnToKitei.name
ltx/gr_gr_cog/me.m06.d13:meMA.Ode6C1T.mode	@ltx/gr_gr_cog/miscellanea:misc.Mode8
ltx/gr_gr_cog/me.m06.d13:meMA.Ode6C1T.ode	@ltx/gr_gr_cog/miscellanea:misc.Ode6
ltx/gr_gr_cog/me.m06.d13:meMA.Ode6C1T.text	Ἵνα Θεὸς ὁ ἄνθρωπος γένηται, Θεὸς ὡράθη ἀνθρώποις, Παρθένε ἐκ τῶν σῶν λαγόνων, ἀνερμηνεύτως τεχθείς, καὶ ὅπερ ἦν μείνας ἀναλλοίωτος.
ltx/gr_gr_cog/me.m06.d13:meMA.Ode6H.greekmelody	@ltx/gr_gr_cog/he.h.m8:heHE.TonIonanEnToKitei.greekname
ltx/gr_gr_cog/me.m06.d13:meMA.Ode6H.incipit	@ltx/gr_gr_cog/he.h.m8:heHE.TonIonanEnToKitei.incipit
ltx/gr_gr_cog/me.m06.d13:meMA.Ode6H.melody	@ltx/gr_gr_cog/he.h.m8:heHE.TonIonanEnToKitei.melody
ltx/gr_gr_cog/me.m06.d13:meMA.Ode6H.mode	@ltx/gr_gr_cog/miscellanea:misc.Mode8
ltx/gr_gr_cog/me.m06.d13:meMA.Ode6H.ode	@ltx/gr_gr_cog/miscellanea:misc.Ode6
ltx/gr_gr_cog/me.m06.d13:meMA.Ode6H.text	@ltx/gr_gr_cog/he.h.m8:heHE.TonIonanEnToKitei.text
ltx/gr_gr_cog/me.m06.d13:meMA.Ode7C11.greekmelody	@ltx/gr_gr_cog/he.h.m8:heHE.PaidesEvraion.greekname
ltx/gr_gr_cog/me.m06.d13:meMA.Ode7C11.incipit	Σώματος πάσχοντος θεόφρον, οὐκ ἐφρόντισας…
ltx/gr_gr_cog/me.m06.d13:meMA.Ode7C11.melody	@ltx/gr_gr_cog/he.h.m8:heHE.PaidesEvraion.name
ltx/gr_gr_cog/me.m06.d13:meMA.Ode7C11.mode	@ltx/gr_gr_cog/miscellanea:misc.Mode8
ltx/gr_gr_cog/me.m06.d13:meMA.Ode7C11.ode	@ltx/gr_gr_cog/miscellanea:misc.Ode7
ltx/gr_gr_cog/me.m06.d13:meMA.Ode7C11.text	Σώματος πάσχοντος θεόφρον, οὐκ ἐφρόντισας σκοποῦσα τὰς ἐκεῖθεν, ἀντιδόσεις σαφῶς, καὶ δόξαν Ἀκυλῖνα, καὶ τοῦ Θεοῦ τερπνότητα, καὶ τὴν θείαν εὐφροσύνην.
ltx/gr_gr_cog/me.m06.d13:meMA.Ode7C12.incipit	Ἄσπιλον φέρουσα τὸ σῶμα, τὴν…
ltx/gr_gr_cog/me.m06.d13:meMA.Ode7C12.melody	@ltx/gr_gr_cog/he.h.m8:heHE.PaidesEvraion.name
ltx/gr_gr_cog/me.m06.d13:meMA.Ode7C12.mode	@ltx/gr_gr_cog/miscellanea:misc.Mode8
ltx/gr_gr_cog/me.m06.d13:meMA.Ode7C12.ode	@ltx/gr_gr_cog/miscellanea:misc.Ode7
ltx/gr_gr_cog/me.m06.d13:meMA.Ode7C12.text	Ἄσπιλον φέρουσα τὸ σῶμα, τὴν καρδίαν τε Κυρίῳ ἡνωμένην, πρὸ βημάτων Ἁγνή, δικαστικῶν παρέστης, ἀσυνετοῦντα τύραννον, διελέγχουσα θεόφρον.
ltx/gr_gr_cog/me.m06.d13:meMA.Ode7C13.incipit	Κόσμου ἠλλάξω φθειρομένου, ὑπερκόσμιον ζωὴν…
ltx/gr_gr_cog/me.m06.d13:meMA.Ode7C13.melody	@ltx/gr_gr_cog/he.h.m8:heHE.PaidesEvraion.name
ltx/gr_gr_cog/me.m06.d13:meMA.Ode7C13.mode	@ltx/gr_gr_cog/miscellanea:misc.Mode8
ltx/gr_gr_cog/me.m06.d13:meMA.Ode7C13.ode	@ltx/gr_gr_cog/miscellanea:misc.Ode7
ltx/gr_gr_cog/me.m06.d13:meMA.Ode7C13.text	Κόσμου ἠλλάξω φθειρομένου, ὑπερκόσμιον ζωὴν μὴ φθειρομένην, καὶ προσκαίρου τρυφῆς, τὴν μένουσαν Παρθένε, τοῦ σαρκικοῦ μνηστῆρός τε, τὸν ἀθάνατον νυμφίον.
ltx/gr_gr_cog/me.m06.d13:meMA.Ode7C1Tr.incipit	Ὕμνοις τὴν θείαν Μοναρχίαν, τρισσουμένην…
ltx/gr_gr_cog/me.m06.d13:meMA.Ode7C1Tr.melody	@ltx/gr_gr_cog/he.h.m8:heHE.PaidesEvraion.name
ltx/gr_gr_cog/me.m06.d13:meMA.Ode7C1Tr.mode	@ltx/gr_gr_cog/miscellanea:misc.Mode8
ltx/gr_gr_cog/me.m06.d13:meMA.Ode7C1Tr.ode	@ltx/gr_gr_cog/miscellanea:misc.Ode7
ltx/gr_gr_cog/me.m06.d13:meMA.Ode7C1Tr.text	Ὕμνοις τὴν θείαν Μοναρχίαν, τρισσουμένην μὲν προσώποις παραδόξως, τῇ δὲ φύσει ἁπλήν, ὑπάρχουσαν τιμῶμεν, ἀναβοῶντες· Κύριε, ὁ Θεὸς εὐλογητὸς εἶ.
ltx/gr_gr_cog/me.m06.d13:meMA.Ode8C11.greekmelody	@ltx/gr_gr_cog/he.h.m8:heHE.OiTheorrimonesPaides.greekname
ltx/gr_gr_cog/me.m06.d13:meMA.Ode8C11.incipit	Λελαμπρυσμένη τῷ φέγγει τῷ τῆς…
ltx/gr_gr_cog/me.m06.d13:meMA.Ode8C11.melody	@ltx/gr_gr_cog/he.h.m8:heHE.OiTheorrimonesPaides.name
ltx/gr_gr_cog/me.m06.d13:meMA.Ode8C11.mode	@ltx/gr_gr_cog/miscellanea:misc.Mode8
ltx/gr_gr_cog/me.m06.d13:meMA.Ode8C11.ode	@ltx/gr_gr_cog/miscellanea:misc.Ode8
ltx/gr_gr_cog/me.m06.d13:meMA.Ode8C11.text	Λελαμπρυσμένη τῷ φέγγει τῷ τῆς ἁγνείας, καὶ ταῖς βαφαῖς τῶν αἱμάτων, διηνθισμένη παρίστασαι, Ἀκυλῖνα παρθένε, Χριστῷ τῷ Θεῷ ἡμῶν.
ltx/gr_gr_cog/me.m06.d13:meMA.Ode8C12.incipit	Ἱερωτάτη θυσία προσηνέχθης, καὶ προσφορὰ…
ltx/gr_gr_cog/me.m06.d13:meMA.Ode8C12.melody	@ltx/gr_gr_cog/he.h.m8:heHE.OiTheorrimonesPaides.name
ltx/gr_gr_cog/me.m06.d13:meMA.Ode8C12.mode	@ltx/gr_gr_cog/miscellanea:misc.Mode8
ltx/gr_gr_cog/me.m06.d13:meMA.Ode8C12.ode	@ltx/gr_gr_cog/miscellanea:misc.Ode8
ltx/gr_gr_cog/me.m06.d13:meMA.Ode8C12.text	Ἱερωτάτη θυσία προσηνέχθης, καὶ προσφορὰ λαμπροτάτη, καὶ ὡς εὐῶδες θυμίαμα, θεόφρον Ἀκυλῖνα, Χριστῷ τῷ Θεῷ ἡμῶν.
ltx/gr_gr_cog/me.m06.d13:meMA.Ode8C13.incipit	Νόσους ἀνθρώπων θεραπεύει, καὶ ἀπελαύνει…
ltx/gr_gr_cog/me.m06.d13:meMA.Ode8C13.melody	@ltx/gr_gr_cog/he.h.m8:heHE.OiTheorrimonesPaides.name
ltx/gr_gr_cog/me.m06.d13:meMA.Ode8C13.mode	@ltx/gr_gr_cog/miscellanea:misc.Mode8
ltx/gr_gr_cog/me.m06.d13:meMA.Ode8C13.ode	@ltx/gr_gr_cog/miscellanea:misc.Ode8
ltx/gr_gr_cog/me.m06.d13:meMA.Ode8C13.text	Νόσους ἀνθρώπων θεραπεύει, καὶ ἀπελαύνει δαιμόνων, λώβην τὸ ἅγιον σῶμά σου, Ἀκυλῖνα ἐν τάφῳ, πανένδοξε κείμενον.
ltx/gr_gr_cog/me.m06.d13:meMA.Ode8C1T.incipit	Ἀδιαφθόρως τὸν Λόγον ὑπὲρ λόγον…
ltx/gr_gr_cog/me.m06.d13:meMA.Ode8C1T.melody	@ltx/gr_gr_cog/he.h.m8:heHE.OiTheorrimonesPaides.name
ltx/gr_gr_cog/me.m06.d13:meMA.Ode8C1T.mode	@ltx/gr_gr_cog/miscellanea:misc.Mode8
ltx/gr_gr_cog/me.m06.d13:meMA.Ode8C1T.ode	@ltx/gr_gr_cog/miscellanea:misc.Ode8
ltx/gr_gr_cog/me.m06.d13:meMA.Ode8C1T.text	Ἀδιαφθόρως τὸν Λόγον ὑπὲρ λόγον, κατὰ φθορᾶς ἡμᾶς πάσης, ἀπολυτρούμενον τέτοκας· διὰ τοῦτο σε πάντες, Παρθένε δοξάζομεν.
ltx/gr_gr_cog/me.m06.d13:meMA.Ode8H.greekmelody	@ltx/gr_gr_cog/he.h.m8:heHE.OiTheorrimonesPaides.greekname
ltx/gr_gr_cog/me.m06.d13:meMA.Ode8H.incipit	@ltx/gr_gr_cog/he.h.m8:heHE.OiTheorrimonesPaides.incipit
ltx/gr_gr_cog/me.m06.d13:meMA.Ode8H.melody	@ltx/gr_gr_cog/he.h.m8:heHE.OiTheorrimonesPaides.melody
ltx/gr_gr_cog/me.m06.d13:meMA.Ode8H.mode	@ltx/gr_gr_cog/miscellanea:misc.Mode8
ltx/gr_gr_cog/me.m06.d13:meMA.Ode8H.ode	@ltx/gr_gr_cog/miscellanea:misc.Ode8
ltx/gr_gr_cog/me.m06.d13:meMA.Ode8H.text	@ltx/gr_gr_cog/he.h.m8:heHE.OiTheorrimonesPaides.text
ltx/gr_gr_cog/me.m06.d13:meMA.Ode9C11.greekmelody	@ltx/gr_gr_cog/he.h.m8:heHE.KyriosTheotokon.greekname
ltx/gr_gr_cog/me.m06.d13:meMA.Ode9C11.incipit	Ἰκρίῳ προσπαγέντι, Σῶτερ ἡ Παρθένος…
ltx/gr_gr_cog/me.m06.d13:meMA.Ode9C11.melody	@ltx/gr_gr_cog/he.h.m8:heHE.KyriosTheotokon.name
ltx/gr_gr_cog/me.m06.d13:meMA.Ode9C11.mode	@ltx/gr_gr_cog/miscellanea:misc.Mode8
ltx/gr_gr_cog/me.m06.d13:meMA.Ode9C11.ode	@ltx/gr_gr_cog/miscellanea:misc.Ode9
ltx/gr_gr_cog/me.m06.d13:meMA.Ode9C11.text	Ἰκρίῳ προσπαγέντι, Σῶτερ ἡ Παρθένος, συνεσταυρώθη σοι γνώμῃ ἀθλήσασα, καὶ τὴν τοῦ δράκοντος κάραν, καταπατήσασα.
ltx/gr_gr_cog/me.m06.d13:meMA.Ode9C12.incipit	Ὡραῖόν σου τὸ κάλλος, καὶ…
ltx/gr_gr_cog/me.m06.d13:meMA.Ode9C12.melody	@ltx/gr_gr_cog/he.h.m8:heHE.KyriosTheotokon.name
ltx/gr_gr_cog/me.m06.d13:meMA.Ode9C12.mode	@ltx/gr_gr_cog/miscellanea:misc.Mode8
ltx/gr_gr_cog/me.m06.d13:meMA.Ode9C12.ode	@ltx/gr_gr_cog/miscellanea:misc.Ode9
ltx/gr_gr_cog/me.m06.d13:meMA.Ode9C12.text	Ὡραῖόν σου τὸ κάλλος, καὶ ὑπερφερής σου, ἡ τῆς ψυχῆς ἀπεφάνθη εὐγένεια, θεοειδὴς Ἀκυλῖνα, ἀξιοθαύμαστε.
ltx/gr_gr_cog/me.m06.d13:meMA.Ode9C13.incipit	Συνοῦσα ταῖς χορείαις, ταῖς τῶν…
ltx/gr_gr_cog/me.m06.d13:meMA.Ode9C13.melody	@ltx/gr_gr_cog/he.h.m8:heHE.KyriosTheotokon.name
ltx/gr_gr_cog/me.m06.d13:meMA.Ode9C13.mode	@ltx/gr_gr_cog/miscellanea:misc.Mode8
ltx/gr_gr_cog/me.m06.d13:meMA.Ode9C13.ode	@ltx/gr_gr_cog/miscellanea:misc.Ode9
ltx/gr_gr_cog/me.m06.d13:meMA.Ode9C13.text	Συνοῦσα ταῖς χορείαις, ταῖς τῶν Ἀσωμάτων, καὶ τῶν Μαρτύρων τοῖς δήμοις πανεύφημε, ὑπὲρ ἡμῶν τὸν τῶν ὅλων Θεὸν ἱκέτευε.
ltx/gr_gr_cog/me.m06.d13:meMA.Ode9C14.incipit	Ἡ ἔνδοξός σου μνήμη, πάντας…
ltx/gr_gr_cog/me.m06.d13:meMA.Ode9C14.melody	@ltx/gr_gr_cog/he.h.m8:heHE.KyriosTheotokon.name
ltx/gr_gr_cog/me.m06.d13:meMA.Ode9C14.mode	@ltx/gr_gr_cog/miscellanea:misc.Mode8
ltx/gr_gr_cog/me.m06.d13:meMA.Ode9C14.ode	@ltx/gr_gr_cog/miscellanea:misc.Ode9
ltx/gr_gr_cog/me.m06.d13:meMA.Ode9C14.text	Ἡ ἔνδοξός σου μνήμη, πάντας συγκαλεῖται, περιχαρῶς Ἀκυλῖνα ὑμνῆσαί σου, τοὺς εὐκλεεῖς Μάρτυς πόνους, καὶ τὰ παλαίσματα.
ltx/gr_gr_cog/me.m06.d13:meMA.Ode9C1T.incipit	Φωνήν σοι τοῦ Ἀγγέλου, Πάναγνε…
ltx/gr_gr_cog/me.m06.d13:meMA.Ode9C1T.melody	@ltx/gr_gr_cog/he.h.m8:heHE.KyriosTheotokon.name
ltx/gr_gr_cog/me.m06.d13:meMA.Ode9C1T.mode	@ltx/gr_gr_cog/miscellanea:misc.Mode8
ltx/gr_gr_cog/me.m06.d13:meMA.Ode9C1T.ode	@ltx/gr_gr_cog/miscellanea:misc.Ode9
ltx/gr_gr_cog/me.m06.d13:meMA.Ode9C1T.text	Φωνήν σοι τοῦ Ἀγγέλου, Πάναγνε βοῶμεν· Χαῖρε ἀνθρώπων ἁπάντων διάσωσμα, καὶ πανενδόξων Μαρτύρων, θεῖον στεφάνωμα.
ltx/gr_gr_cog/me.m06.d13:meMA.Ode9H.greekmelody	@ltx/gr_gr_cog/he.h.m8:heHE.KyriosTheotokon.greekname
ltx/gr_gr_cog/me.m06.d13:meMA.Ode9H.incipit	@ltx/gr_gr_cog/he.h.m8:heHE.KyriosTheotokon.incipit
ltx/gr_gr_cog/me.m06.d13:meMA.Ode9H.melody	@ltx/gr_gr_cog/he.h.m8:heHE.KyriosTheotokon.melody
ltx/gr_gr_cog/me.m06.d13:meMA.Ode9H.mode	@ltx/gr_gr_cog/miscellanea:misc.Mode8
ltx/gr_gr_cog/me.m06.d13:meMA.Ode9H.ode	@ltx/gr_gr_cog/miscellanea:misc.Ode9
ltx/gr_gr_cog/me.m06.d13:meMA.Ode9H.text	@ltx/gr_gr_cog/he.h.m8:heHE.KyriosTheotokon.text
ltx/gr_gr_cog/me.m06.d13:meVE.Apolytikion1ger.greekmelody	@ltx/gr_gr_cog/he.a.m4:heAU.TachyProkatalave.greekname
ltx/gr_gr_cog/me.m06.d13:meVE.Apolytikion1ger.incipit	Παρθένος ἀκήρατος, καὶ Ἀθληφόρος σεμνή…
ltx/gr_gr_cog/me.m06.d13:meVE.Apolytikion1ger.melody	@ltx/gr_gr_cog/he.a.m4:heAU.TachyProkatalave.name
ltx/gr_gr_cog/me.m06.d13:meVE.Apolytikion1ger.mode	@ltx/gr_gr_cog/miscellanea:misc.Mode4
ltx/gr_gr_cog/me.m06.d13:meVE.Apolytikion1ger.poet	@ltx/gr_gr_cog/poets:po.Gerasimou
ltx/gr_gr_cog/me.m06.d13:meVE.Apolytikion1ger.text	Παρθένος ἀκήρατος, καὶ Ἀθληφόρος σεμνή, ἐδείχθης τοῖς πέρασι, τῇ ἀγαπήσει Χριστοῦ, Ἀκυλίνα θεόνυμφε· σὺ γὰρ καθάπερ ρόδον, νοητὸν τεθηλυῖα, ἔπνευσας ἐν ἀθλήσει, τῆς ἁγνείας τὴν χάριν, πρεσβεύουσα τῷ Κυρίῳ, ὑπὲρ τῶν τιμώντων σε.
ltx/gr_gr_cog/me.m06.d13:meVE.SticStavrotheotokion.greekmelody	@ltx/gr_gr_cog/he.a.m4:heAU.EdokasSimeiosin.greekname
ltx/gr_gr_cog/me.m06.d13:meVE.SticStavrotheotokion.incipit	@ltx/gr_gr_cog/me.m06.d06:meVE.SticStavrotheotokion.incipit
ltx/gr_gr_cog/me.m06.d13:meVE.SticStavrotheotokion.melody	@ltx/gr_gr_cog/he.a.m4:heAU.EdokasSimeiosin.name
ltx/gr_gr_cog/me.m06.d13:meVE.SticStavrotheotokion.mode	@ltx/gr_gr_cog/miscellanea:misc.Mode4
ltx/gr_gr_cog/me.m06.d13:meVE.SticStavrotheotokion.text	@ltx/gr_gr_cog/me.m06.d06:meVE.SticStavrotheotokion.text
ltx/gr_gr_cog/me.m06.d13:meVE.SticTheotokion.greekmelody	@ltx/gr_gr_cog/he.a.m4:heAU.EdokasSimeiosin.greekname
ltx/gr_gr_cog/me.m06.d13:meVE.SticTheotokion.incipit	Μαρία Θεόνυμφε, τῆς ταλαιπώρου καρδίας…
ltx/gr_gr_cog/me.m06.d13:meVE.SticTheotokion.melody	@ltx/gr_gr_cog/he.a.m4:heAU.EdokasSimeiosin.name
ltx/gr_gr_cog/me.m06.d13:meVE.SticTheotokion.mode	@ltx/gr_gr_cog/miscellanea:misc.Mode4
ltx/gr_gr_cog/me.m06.d13:meVE.SticTheotokion.text	Μαρία Θεόνυμφε, τῆς ταλαιπώρου καρδίας μου, ἀποπλύνουσα βόρβορον, ῥείθρῳ τοῦ ἐλέους σου, ξήρανον πελάγη, τῶν ἐμῶν πταισμάτων, καὶ πρὸς μετάνοιαν ἁγνή, τὸν ἀδιόρθωτον ἐγκαθόρμισον· λιμένα εὐσπλαγχνίας γάρ, ὡς τετοκυῖα πανάμωμε, ἐπὶ σοὶ τὴν ἐλπίδα μου, ἀνατίθημι Παναγνε.
ltx/gr_gr_cog/me.m06.d13:meVE.Stichera01.greekmelody	@ltx/gr_gr_cog/he.a.m4:heAU.EdokasSimeiosin.greekname
ltx/gr_gr_cog/me.m06.d13:meVE.Stichera01.incipit	Νύμφην ἀδιάφθορον, καλλωπισθεῖσαν ἐν Πνεύματι…
ltx/gr_gr_cog/me.m06.d13:meVE.Stichera01.melody	@ltx/gr_gr_cog/he.a.m4:heAU.EdokasSimeiosin.name
ltx/gr_gr_cog/me.m06.d13:meVE.Stichera01.mode	@ltx/gr_gr_cog/miscellanea:misc.Mode4
ltx/gr_gr_cog/me.m06.d13:meVE.Stichera01.text	Νύμφην ἀδιάφθορον, καλλωπισθεῖσαν ἐν Πνεύματι, τῷ Ἁγίῳ γινώσκοντες, τελοῦμεν τὴν μνήμην σου, τὴν φωτεινοτάτην, Μάρτυς ἀθληφόρε, καὶ προσκυνοῦμεν εὐσεβῶς, τὴν τῶν λειψάνων ἁγίαν λάρνακα, τὴν ῥῶσιν ἀρυόμενοι, τὴν τῶν παθῶν ἡμῶν πάντοτε, Ἀκυλῖνα πανεύφημε, οἱ πιστῶς σε γεραίροντες.
ltx/gr_gr_cog/me.m06.d13:meVE.Stichera02.incipit	Ἔρωτι πανεύφημε, κεκρατημένη τοῦ Κτίστου…
ltx/gr_gr_cog/me.m06.d13:meVE.Stichera02.melody	@ltx/gr_gr_cog/he.a.m4:heAU.EdokasSimeiosin.name
ltx/gr_gr_cog/me.m06.d13:meVE.Stichera02.mode	@ltx/gr_gr_cog/miscellanea:misc.Mode4
ltx/gr_gr_cog/me.m06.d13:meVE.Stichera02.text	Ἔρωτι πανεύφημε, κεκρατημένη τοῦ Κτίστου σου, τὰ ἐκείνου παθήματα, σαρκὶ ἐξεικόνισας, πᾶσαν τρικυμίαν, πόνων ἐνεγκοῦσα, καὶ νῦν οἰκεῖς τοὺς οὐρανούς, ἄπονον δόξαν καὶ στέφος φέρουσα, ἀμάραντον καὶ βλέπουσα, ἃ θεωροῦσι γηθόμενα, τῶν Ἀγγέλων τὰ τάγματα, Ἀκυλῖνα θεόπνευστε.
ltx/gr_gr_cog/me.m06.d13:meVE.Stichera03.incipit	Προῖκα προσενήνοχας, τῶν σῶν μελῶν…
ltx/gr_gr_cog/me.m06.d13:meVE.Stichera03.melody	@ltx/gr_gr_cog/he.a.m4:heAU.EdokasSimeiosin.name
ltx/gr_gr_cog/me.m06.d13:meVE.Stichera03.mode	@ltx/gr_gr_cog/miscellanea:misc.Mode4
ltx/gr_gr_cog/me.m06.d13:meVE.Stichera03.text	Προῖκα προσενήνοχας, τῶν σῶν μελῶν τὰ λακτίσματα, τῷ νυμφίῳ σου πάνσεμνε· διὸ τῶν θαλάμων σε, τῶν φωτεινοτάτων, αὐτὸς ἀξιώσας, καταλαμπρύνει τῷ φωτί, τῆς θείας δόξης ὁ ὑπερούσιος, ᾧ παρεστῶσα χαίρουσα, ὑπὲρ ὑμῶν καθικέτευε, τῶν πιστῶς ἐκτελούντων νῦν, Ἀκυλῖνα τὴν μνήμην σου.
