ltx/gr_gr_cog/le.pr.me.r04:leprVE.reading.book_abbr	@ltx/gr_gr_cog/bible:Isaiah.abbr
ltx/gr_gr_cog/le.pr.me.r04:leprVE.reading.book_string	@ltx/gr_gr_cog/bible:Isaiah.text
ltx/gr_gr_cog/le.pr.me.r04:leprVE.reading.chapverse	λεʹ 1 – 10
ltx/gr_gr_cog/le.pr.me.r04:leprVE.reading.incipit	Τάδε λέγει Κύριος· Εὐφράνθητι ἔρημος διψῶσα, ἀγαλλιάσθω ἔρημος, καὶ…
ltx/gr_gr_cog/le.pr.me.r04:leprVE.reading.text	Τάδε λέγει Κύριος· Εὐφράνθητι ἔρημος διψῶσα, ἀγαλλιάσθω ἔρημος, καὶ ἀνθείτω ὡς κρίνον. Καὶ ἑξανθήσει, καὶ ὑλοχαρήσει, καὶ ἀγαλλιασεται τὰ ἔρημα τοῦ Ἰορδάνου· καὶ ἡ δόξα τοῦ Λιβάνου ἐδόθη αὐτῇ, καὶ ἡ τιμὴ τοῦ Καρμήλου· καὶ ὁ λαός μου ὄψεται τὴν δόξαν Κυρίου, καὶ τὸ ὕψος τοῦ Θεοῦ. Ἰσχύσατε χεῖρες ἀνειμέναι, καὶ γόνατα παραλελυμένα. Παρακαλέσατε, καὶ εἴπατε τοῖς ὀλιγοψύχοις τῇ διανοίᾳ· Ἰσχύσατε καὶ μὴ φοβεῖσθε· ἰδοὺ ὁ Θεὸς ἡμῶν κρίσιν ἀνταποδίδωσι, καὶ ἀνταποδώσει, αὐτὸς ἥξει καὶ σώσει ἡμᾶς. Τότε ἀνοιχθήσονται ὀφθαλμοὶ τυφλῶν, καὶ ὦτα κωφῶν ἀκούσονται. Τότε ἁλεῖται χωλὸς ὡς ἔλαφος, καὶ τρανὴ ἔσται γλῶσσα μογγιλάλων, ὅτι ἐῤῥάγη ἐν τῇ ἐρήμῳ ὕδωρ, καὶ φάραγξ ἐν γῇ διψώσῃ. Καὶ ἔσται ἡ ἄνυδρος εἰς ἕλη, καὶ εἰς τὴν διψῶσαν γῆν πηγὴ ὕδατος ἔσται, ἐκεῖ ἔσται εὐφροσύνη ὀρνέων, ἐπαύλεις ποιμνίων καὶ καλάμη καὶ ἕλη. Καὶ ἔσται ἐκεῖ ὁδὸς καθαρά, καὶ ὁδὸς ἁγία κληθήσεται, οὐ μὴ παρέλθῃ ἐκεῖ ἀκάθαρτος, οὐδὲ ἔσται ἐκεῖ ὁδὸς ἀκάθαρτος, οἱ δὲ διεσπαρμένοι πορεύσονται ἐπʼ αὐτῆς, καὶ οὐ μὴ πλανηθῶσι. Καὶ οὐκ ἔσται ἐκεῖ λέων, οὐδὲ τῶν πονηρῶν θηρίων, οὐ μὴ ἀναβῇ εἰς αὐτήν, οὐδὲ μὴ εὑρεθῇ ἐκεῖ· ἀλλὰ πορεύσονται ἐν αὐτῇ λελυτρωμένοι καὶ συνηγμένοι ὑπὸ Κυρίου. Καὶ ἀποστραφήσονται, καὶ ἥξουσιν εἰς Σιὼν μετʼ εὐφροσύνης καὶ ἀγαλλιάσεως, καὶ εὐφροσύνη αἰώνιος ὑπὲρ κεφαλῆς αὐτῶν· ἐπὶ γὰρ τῆς κεφαλῆς αὐτῶν αἴνεσις καὶ ἀγαλλίαμα, καὶ εὐφροσύνη καταλήψεται αὐτούς· ἀπέδρα ὀδύνη, λύπη καὶ στεναγμός.
ltx/gr_gr_cog/le.pr.me.r04:leprVE.reading.title	
ltx/gr_gr_cog/le.pr.me.r04:leprVE.reading.title_abbr	
ltx/gr_gr_cog/le.pr.me.r04:leprVE.reading.version	@ltx/gr_gr_cog/properties:version.designation
