ltx/gr_gr_cog/le.ep.va.funeral:levaFUN.Epistle.book_abbr	@ltx/gr_gr_cog/le.ep.va.deceased:levaDEC.Epistle1.book_abbr
ltx/gr_gr_cog/le.ep.va.funeral:levaFUN.Epistle.book_string	@ltx/gr_gr_cog/le.ep.va.deceased:levaDEC.Epistle1.book_string
ltx/gr_gr_cog/le.ep.va.funeral:levaFUN.Epistle.chapverse	@ltx/gr_gr_cog/le.ep.va.deceased:levaDEC.Epistle1.chapverse
ltx/gr_gr_cog/le.ep.va.funeral:levaFUN.Epistle.incipit	@ltx/gr_gr_cog/le.ep.va.deceased:levaDEC.Epistle1.incipit
ltx/gr_gr_cog/le.ep.va.funeral:levaFUN.Epistle.text	@ltx/gr_gr_cog/le.ep.va.deceased:levaDEC.Epistle1.text
ltx/gr_gr_cog/le.ep.va.funeral:levaFUN.Epistle.title	Εἰς Κηδείαν
ltx/gr_gr_cog/le.ep.va.funeral:levaFUN.Epistle.title_abbr	Εἰς Κηδείαν
ltx/gr_gr_cog/le.ep.va.funeral:levaFUN.Epistle.version	@ltx/gr_gr_cog/properties:version.designation
