ltx/gr_gr_cog/oc.m2.d5:ocBK.ModeNaked	@ltx/gr_gr_cog/miscellanea:misc.Mode2.naked
ltx/gr_gr_cog/oc.m2.d5:ocLI.Beatitudes1.incipit	@ltx/gr_gr_cog/oc.m2.d1:ocLI.Beatitudes1.incipit
ltx/gr_gr_cog/oc.m2.d5:ocLI.Beatitudes1.melody	@ltx/gr_gr_cog/he.h.m2:heHE.SyToLogoSouKyrie.name
ltx/gr_gr_cog/oc.m2.d5:ocLI.Beatitudes1.mode	@ltx/gr_gr_cog/miscellanea:misc.Mode2
ltx/gr_gr_cog/oc.m2.d5:ocLI.Beatitudes1.text	@ltx/gr_gr_cog/oc.m2.d1:ocLI.Beatitudes1.text
ltx/gr_gr_cog/oc.m2.d5:ocLI.Beatitudes2.incipit	Τὰ τοῦ κόσμου πληρώματα, διελθόντες…
ltx/gr_gr_cog/oc.m2.d5:ocLI.Beatitudes2.melody	@ltx/gr_gr_cog/he.h.m2:heHE.SyToLogoSouKyrie.name
ltx/gr_gr_cog/oc.m2.d5:ocLI.Beatitudes2.mode	@ltx/gr_gr_cog/miscellanea:misc.Mode2
ltx/gr_gr_cog/oc.m2.d5:ocLI.Beatitudes2.text	Τὰ τοῦ κόσμου πληρώματα, διελθόντες Ἀπόστολοι, σκότους τοῦ τῆς πλάνης βροτούς, ἐῤῥύσασθε Πάνσοφοι.
ltx/gr_gr_cog/oc.m2.d5:ocLI.Beatitudes3.incipit	Τῇ σαγήνῃ τῆς χάριτος, ἐκ…
ltx/gr_gr_cog/oc.m2.d5:ocLI.Beatitudes3.melody	@ltx/gr_gr_cog/he.h.m2:heHE.SyToLogoSouKyrie.name
ltx/gr_gr_cog/oc.m2.d5:ocLI.Beatitudes3.mode	@ltx/gr_gr_cog/miscellanea:misc.Mode2
ltx/gr_gr_cog/oc.m2.d5:ocLI.Beatitudes3.text	Τῇ σαγήνῃ τῆς χάριτος, ἐκ βυθοῦ ματαιότητος, ἀνθρώπους Μύσται σοφοί, σαφῶς ἀνειλκύσατε.
ltx/gr_gr_cog/oc.m2.d5:ocLI.Beatitudes4.incipit	Τοὺς τὸν δρόμον τελέσαντας, καὶ…
ltx/gr_gr_cog/oc.m2.d5:ocLI.Beatitudes4.melody	@ltx/gr_gr_cog/he.h.m2:heHE.SyToLogoSouKyrie.name
ltx/gr_gr_cog/oc.m2.d5:ocLI.Beatitudes4.mode	@ltx/gr_gr_cog/miscellanea:misc.Mode2
ltx/gr_gr_cog/oc.m2.d5:ocLI.Beatitudes4.text	Τοὺς τὸν δρόμον τελέσαντας, καὶ τὴν πίστιν τηρήσαντας, τοὺς Ἀθλοφόρους Χριστοῦ, συμφώνως ὑμνήσωμεν.
ltx/gr_gr_cog/oc.m2.d5:ocLI.BeatitudesT.incipit	Ἀποστόλων τὸ καύχημα, Ἀθλητῶν ἐγκαλλώπισμα…
ltx/gr_gr_cog/oc.m2.d5:ocLI.BeatitudesT.melody	@ltx/gr_gr_cog/he.h.m2:heHE.SyToLogoSouKyrie.name
ltx/gr_gr_cog/oc.m2.d5:ocLI.BeatitudesT.mode	@ltx/gr_gr_cog/miscellanea:misc.Mode2
ltx/gr_gr_cog/oc.m2.d5:ocLI.BeatitudesT.text	Ἀποστόλων τὸ καύχημα, Ἀθλητῶν ἐγκαλλώπισμα, σὺ εἶ Παρθένε ἁγνή, καὶ κόσμου διάσωσμα.
ltx/gr_gr_cog/oc.m2.d5:ocLI.BeatitudesTr.incipit	Ἰσουργὸν τῷ Γεννήτορι, τὸν Υἱὸν…
ltx/gr_gr_cog/oc.m2.d5:ocLI.BeatitudesTr.melody	@ltx/gr_gr_cog/he.h.m2:heHE.SyToLogoSouKyrie.name
ltx/gr_gr_cog/oc.m2.d5:ocLI.BeatitudesTr.mode	@ltx/gr_gr_cog/miscellanea:misc.Mode2
ltx/gr_gr_cog/oc.m2.d5:ocLI.BeatitudesTr.text	Ἰσουργὸν τῷ Γεννήτορι, τὸν Υἱὸν σὺν τῷ Πνεύματι, ἅπαντες νῦν οἱ πιστοί, ἐν φόβῳ δοξάσωμεν.
ltx/gr_gr_cog/oc.m2.d5:ocLI.MM.Beatitudes1234TrTas78910GB.text	@ltx/gr_gr_cog/properties:media.key
ltx/gr_gr_cog/oc.m2.d5:ocMA.ApolTheotokion.incipit	@ltx/gr_gr_cog/oc.m2.d2:ocMA.Kathisma23.incipit
ltx/gr_gr_cog/oc.m2.d5:ocMA.ApolTheotokion.melody	
ltx/gr_gr_cog/oc.m2.d5:ocMA.ApolTheotokion.mode	@ltx/gr_gr_cog/miscellanea:misc.Mode2
ltx/gr_gr_cog/oc.m2.d5:ocMA.ApolTheotokion.text	@ltx/gr_gr_cog/oc.m2.d2:ocMA.Kathisma23.text
ltx/gr_gr_cog/oc.m2.d5:ocMA.AposTheotokion.greekmelody	@ltx/gr_gr_cog/he.a.m2:heAU.OteEkTouXylou.greekname
ltx/gr_gr_cog/oc.m2.d5:ocMA.AposTheotokion.incipit	@ltx/gr_gr_cog/oc.m2.d1:ocSV.Aposticha1.incipit
ltx/gr_gr_cog/oc.m2.d5:ocMA.AposTheotokion.melody	@ltx/gr_gr_cog/he.a.m2:heAU.OteEkTouXylou.name
ltx/gr_gr_cog/oc.m2.d5:ocMA.AposTheotokion.mode	@ltx/gr_gr_cog/miscellanea:misc.Mode2
ltx/gr_gr_cog/oc.m2.d5:ocMA.AposTheotokion.text	@ltx/gr_gr_cog/oc.m2.d1:ocSV.Aposticha1.text
ltx/gr_gr_cog/oc.m2.d5:ocMA.Aposticha1.incipit	@ltx/gr_gr_cog/oc.m2.d5:ocVE.Aposticha1.incipit
ltx/gr_gr_cog/oc.m2.d5:ocMA.Aposticha1.melody	
ltx/gr_gr_cog/oc.m2.d5:ocMA.Aposticha1.mode	@ltx/gr_gr_cog/miscellanea:misc.Mode2
ltx/gr_gr_cog/oc.m2.d5:ocMA.Aposticha1.text	@ltx/gr_gr_cog/oc.m2.d5:ocVE.Aposticha1.text
ltx/gr_gr_cog/oc.m2.d5:ocMA.Aposticha2.incipit	@ltx/gr_gr_cog/oc.m2.d5:ocVE.Aposticha2.incipit
ltx/gr_gr_cog/oc.m2.d5:ocMA.Aposticha2.melody	
ltx/gr_gr_cog/oc.m2.d5:ocMA.Aposticha2.mode	@ltx/gr_gr_cog/miscellanea:misc.Mode2
ltx/gr_gr_cog/oc.m2.d5:ocMA.Aposticha2.text	@ltx/gr_gr_cog/oc.m2.d5:ocVE.Aposticha2.text
ltx/gr_gr_cog/oc.m2.d5:ocMA.Aposticha3.incipit	Πᾶσα πόλις καὶ χώρα, τιμᾷ…
ltx/gr_gr_cog/oc.m2.d5:ocMA.Aposticha3.melody	
ltx/gr_gr_cog/oc.m2.d5:ocMA.Aposticha3.mode	@ltx/gr_gr_cog/miscellanea:misc.Mode2
ltx/gr_gr_cog/oc.m2.d5:ocMA.Aposticha3.text	Πᾶσα πόλις καὶ χώρα, τιμᾷ ὑμῶν τὰ λείψανα, ὦ ἀθλοφόροι Μάρτυρες· ὑμεῖς γὰρ νομίμως ἀθλήσαντες, στέφανον οὐράνιον ἐλάβετε, καὶ διὰ τοῦτο Ἱερέων ἐστὲ τὸ καύχημα, Βασιλέων τὸ νῖκος, Ἐκκλησιῶν ἡ εὐπρέπεια.
ltx/gr_gr_cog/oc.m2.d5:ocMA.C2.acrostic.notice1	οὗ ἡ ἀκροστιχίς·
ltx/gr_gr_cog/oc.m2.d5:ocMA.C2.acrostic.text	Σοί, Νικόλαε, θεῖον ἐξᾴδω μέλος.
ltx/gr_gr_cog/oc.m2.d5:ocMA.C2.acrostic.title	Κανὼν τοῦ ἁγίου Νικολάου,
ltx/gr_gr_cog/oc.m2.d5:ocMA.CA.notice	
ltx/gr_gr_cog/oc.m2.d5:ocMA.Kathisma11.incipit	Ὁ σοφίσας ὑπὲρ ῥήτορας τοὺς…
ltx/gr_gr_cog/oc.m2.d5:ocMA.Kathisma11.melody	
ltx/gr_gr_cog/oc.m2.d5:ocMA.Kathisma11.mode	@ltx/gr_gr_cog/miscellanea:misc.Mode2
ltx/gr_gr_cog/oc.m2.d5:ocMA.Kathisma11.text	Ὁ σοφίσας ὑπὲρ ῥήτορας τοὺς ἁλιεῖς, καὶ ἐκπέμψας ὥσπερ κήρυκας πάσῃ τῇ γῇ, ἀφάτῳ φιλανθρωπίᾳ, Χριστὲ ὁ Θεός, διʼ αὐτῶν κραταίωσον τὴν Ἐκκλησίαν σου, καὶ τοῖς πιστοῖς κατάπεμψον τὴν εὐλογίαν σου, ὁ μόνος ἐλεήμων καὶ φιλάνθρωπος.
ltx/gr_gr_cog/oc.m2.d5:ocMA.Kathisma12.incipit	Σαγηνεύσαντες τὰ ἔθνη οἱ ἁλιεῖς…
ltx/gr_gr_cog/oc.m2.d5:ocMA.Kathisma12.melody	
ltx/gr_gr_cog/oc.m2.d5:ocMA.Kathisma12.mode	@ltx/gr_gr_cog/miscellanea:misc.Mode2
ltx/gr_gr_cog/oc.m2.d5:ocMA.Kathisma12.text	Σαγηνεύσαντες τὰ ἔθνη οἱ ἁλιεῖς, καὶ διδάξαντες τὰ πέρατά σε προσκυνεῖν, σὺν Πατρὶ καὶ Πνεύματι, Χριστὲ ὁ Θεός, διʼ αὐτῶν στερέωσον πίστιν τὴν ἔνθεον, καὶ τοῖς λαοῖς κατάπεμψον νῦν τὰ ἐλέη σου, ὁ μόνος ἐν Ἁγίοις ἀναπαυόμενος.
ltx/gr_gr_cog/oc.m2.d5:ocMA.Kathisma13.incipit	Θείας γεγόναμεν κοινωνοὶ φύσεως…
ltx/gr_gr_cog/oc.m2.d5:ocMA.Kathisma13.melody	
ltx/gr_gr_cog/oc.m2.d5:ocMA.Kathisma13.mode	@ltx/gr_gr_cog/miscellanea:misc.Mode2
ltx/gr_gr_cog/oc.m2.d5:ocMA.Kathisma13.text	Θείας γεγόναμεν κοινωνοὶ φύσεως, διὰ σοῦ Ἀειπάρθενε· Θεὸν γὰρ ἡμῖν σεσαρκωμένον ἔτεκες· διὸ κατὰ χρέος σε, πάντες εὐσεβῶς μεγαλύνομεν.
ltx/gr_gr_cog/oc.m2.d5:ocMA.Kathisma21.greekmelody	@ltx/gr_gr_cog/he.a.m2:heAU.EfsplagchniasYparchousa.greekname
ltx/gr_gr_cog/oc.m2.d5:ocMA.Kathisma21.incipit	Εὐσπλαγχνίᾳ πτωχεύσας ὁ Θεός…
ltx/gr_gr_cog/oc.m2.d5:ocMA.Kathisma21.melody	@ltx/gr_gr_cog/he.a.m2:heAU.EfsplagchniasYparchousa.name
ltx/gr_gr_cog/oc.m2.d5:ocMA.Kathisma21.mode	@ltx/gr_gr_cog/miscellanea:misc.Mode2
ltx/gr_gr_cog/oc.m2.d5:ocMA.Kathisma21.text	Εὐσπλαγχνίᾳ πτωχεύσας ὁ Θεός, πλουτιστὰς ἐξαπέστειλεν ὑμᾶς ἐν τῷ κόσμῳ, φαίνοντας πτωχείᾳ τοῦ κηρύγματος, πλοῦτον τὸν οὐράνιον τοῖς πέρασι, διʼ ὧν καὶ πλουτήσαντες, τὴν πίστιν τὴν ἔνθεον, ἀνυμνοῦμεν εὐσεβῶς, τὴν θείαν ὑμῶν μνήμην Ἀπόστολοι.
ltx/gr_gr_cog/oc.m2.d5:ocMA.Kathisma22.greekmelody	@ltx/gr_gr_cog/he.a.m2:heAU.EfsplagchniasYparchousa.greekname
ltx/gr_gr_cog/oc.m2.d5:ocMA.Kathisma22.incipit	Τῆς σοφίας ὑπάρχοντες Θεοῦ…
ltx/gr_gr_cog/oc.m2.d5:ocMA.Kathisma22.melody	@ltx/gr_gr_cog/he.a.m2:heAU.EfsplagchniasYparchousa.name
ltx/gr_gr_cog/oc.m2.d5:ocMA.Kathisma22.mode	@ltx/gr_gr_cog/miscellanea:misc.Mode2
ltx/gr_gr_cog/oc.m2.d5:ocMA.Kathisma22.text	Τῆς σοφίας ὑπάρχοντες Θεοῦ, Μαθηταὶ καὶ αὐτόπται, τῶν σοφῶν καὶ ῥητόρων, ἄσοφον σοφίαν ἐξεφαύλισαν, τῇ ἰδιωτείᾳ τοῦ κηρύγματος, τὰ ἔθνη σοφίσαντες, οἱ θεῖοι Ἀπόστολοι, ὀρθοδόξως ἀνυμνεῖν, τὸν Δημιουργὸν καὶ μόνον Κύριον.
ltx/gr_gr_cog/oc.m2.d5:ocMA.Kathisma23.incipit	Βοηθὸς τοῖς ἐν θλίψει Θεοκυῆτορ…
ltx/gr_gr_cog/oc.m2.d5:ocMA.Kathisma23.melody	
ltx/gr_gr_cog/oc.m2.d5:ocMA.Kathisma23.mode	@ltx/gr_gr_cog/miscellanea:misc.Mode2
ltx/gr_gr_cog/oc.m2.d5:ocMA.Kathisma23.text	Βοηθὸς τοῖς ἐν θλίψει Θεοκυῆτορ, καὶ προστάτις ὑπάρχεις τοῖς ἐν ἀνάγκαις, ἀπεγνωσμένοις ἐλπίδα παρέχουσα, καὶ ἀνιάτων τὰς νόσους καθαίρουσα, Θεοτόκε Πανύμνητε· διὸ ὑπὲρ ἡμῶν δυσώπει τὸν Κύριον.
ltx/gr_gr_cog/oc.m2.d5:ocMA.Kathisma31.greekmelody	@ltx/gr_gr_cog/he.a.m2:heAU.ToisTonAimatonSou.greekname
ltx/gr_gr_cog/oc.m2.d5:ocMA.Kathisma31.incipit	Ταῖς τῶν θαυμάτων ἀκτῖσι Νικόλαε…
ltx/gr_gr_cog/oc.m2.d5:ocMA.Kathisma31.melody	@ltx/gr_gr_cog/he.a.m2:heAU.ToisTonAimatonSou.name
ltx/gr_gr_cog/oc.m2.d5:ocMA.Kathisma31.mode	@ltx/gr_gr_cog/miscellanea:misc.Mode2
ltx/gr_gr_cog/oc.m2.d5:ocMA.Kathisma31.text	Ταῖς τῶν θαυμάτων ἀκτῖσι Νικόλαε, καταφαιδρύνεις ὑφήλιον ἅπασαν, καὶ λύεις τὸν ζόφον τῶν θλίψεων, καὶ τῶν κινδύνων ἐλαύνεις τὴν ἔφοδον, προστάτης ὑπάρχων θερμότατος.
ltx/gr_gr_cog/oc.m2.d5:ocMA.Kathisma32.incipit	Ἀπόστολοι, Μάρτυρες, καὶ Προφῆται, Ἱεράρχαι…
ltx/gr_gr_cog/oc.m2.d5:ocMA.Kathisma32.melody	
ltx/gr_gr_cog/oc.m2.d5:ocMA.Kathisma32.mode	@ltx/gr_gr_cog/miscellanea:misc.Mode2
ltx/gr_gr_cog/oc.m2.d5:ocMA.Kathisma32.text	Ἀπόστολοι, Μάρτυρες, καὶ Προφῆται, Ἱεράρχαι, Ὅσιοι καὶ Δίκαιοι, οἱ καλῶς τὸν ἀγῶνα τελέσαντες, καὶ τὴν πίστιν τηρήσαντες, παῤῥησίαν ἔχοντες πρὸς τὸν Σωτῆρα, ὑπὲρ ἡμῶν αὐτὸν ὡς ἀγαθὸν ἱκετεύσατε, σωθῆναι δεόμεθα τὰς ψυχὰς ἡμῶν.
ltx/gr_gr_cog/oc.m2.d5:ocMA.Kathisma33.incipit	Ἡ μόνη Θεὸν ἀσπόρως κυήσασα…
ltx/gr_gr_cog/oc.m2.d5:ocMA.Kathisma33.melody	
ltx/gr_gr_cog/oc.m2.d5:ocMA.Kathisma33.mode	@ltx/gr_gr_cog/miscellanea:misc.Mode2
ltx/gr_gr_cog/oc.m2.d5:ocMA.Kathisma33.text	Ἡ μόνη Θεὸν ἀσπόρως κυήσασα, καὶ μετὰ φρικτὴν λοχείαν ἁγνεύουσα, σοὶ προσπίπτω Ἄχραντε, μετὰ φόβου κράζων καὶ πίστεως· Ἐκ παθῶν καὶ νόσων δεινῶν, καὶ πάσης ἀνάγκης με διάσωσον.
ltx/gr_gr_cog/oc.m2.d5:ocMA.OdeW1C11.incipit	Τοῦ φωτὸς τοῦ θείου ἀστραπαί…
ltx/gr_gr_cog/oc.m2.d5:ocMA.OdeW1C11.melody	@ltx/gr_gr_cog/he.h.m2:heHE.EnVythoKatestrose.name
ltx/gr_gr_cog/oc.m2.d5:ocMA.OdeW1C11.mode	@ltx/gr_gr_cog/miscellanea:misc.Mode2
ltx/gr_gr_cog/oc.m2.d5:ocMA.OdeW1C11.ode	@ltx/gr_gr_cog/miscellanea:misc.Ode1
ltx/gr_gr_cog/oc.m2.d5:ocMA.OdeW1C11.text	Τοῦ φωτὸς τοῦ θείου ἀστραπαί, πίστει χρηματίσαντες, φωτοειδεῖς τοῦ Σωτῆρος Ἀπόστολοι, ὅλον με φωτίσατε, σκοτιζόμενον ἡδονῶν ἀμαυρότησι, καὶ ἐν ἀμελείᾳ, πάντα μου τὸν βίον διανύοντα.
ltx/gr_gr_cog/oc.m2.d5:ocMA.OdeW1C12.incipit	Μαθηταὶ καὶ φίλοι τοῦ Χριστοῦ…
ltx/gr_gr_cog/oc.m2.d5:ocMA.OdeW1C12.melody	@ltx/gr_gr_cog/he.h.m2:heHE.EnVythoKatestrose.name
ltx/gr_gr_cog/oc.m2.d5:ocMA.OdeW1C12.mode	@ltx/gr_gr_cog/miscellanea:misc.Mode2
ltx/gr_gr_cog/oc.m2.d5:ocMA.OdeW1C12.ode	@ltx/gr_gr_cog/miscellanea:misc.Ode1
ltx/gr_gr_cog/oc.m2.d5:ocMA.OdeW1C12.text	Μαθηταὶ καὶ φίλοι τοῦ Χριστοῦ, φίλον με γενόμενον, τοῦ δυσμενοῦς διὰ κακῶν οἰκείωσιν, τούτου ἐκλυτρώσασθε, συγκινοῦντές μου τὴν ψυχὴν εἰς ἀγάπησιν, τοῦ πεφιληκότος, γένος τῶν βροτῶν διʼ ἀγαθότητα.
ltx/gr_gr_cog/oc.m2.d5:ocMA.OdeW1C13.incipit	Ταπεινὴ ψυχή μου πρὸ θανῆς…
ltx/gr_gr_cog/oc.m2.d5:ocMA.OdeW1C13.melody	@ltx/gr_gr_cog/he.h.m2:heHE.EnVythoKatestrose.name
ltx/gr_gr_cog/oc.m2.d5:ocMA.OdeW1C13.mode	@ltx/gr_gr_cog/miscellanea:misc.Mode2
ltx/gr_gr_cog/oc.m2.d5:ocMA.OdeW1C13.ode	@ltx/gr_gr_cog/miscellanea:misc.Ode1
ltx/gr_gr_cog/oc.m2.d5:ocMA.OdeW1C13.text	Ταπεινὴ ψυχή μου πρὸ θανῆς, σπεῦσον μετανόησον, καὶ σεαυτὴν νενεκρωμένην πένθησον, ὅπως ὁ τὸν Λάζαρον, τετραήμερον ἀναστήσας ὡς εὔσπλαγχνος, καὶ σὲ ἀναστήσῃ, ταῖς τῶν Ἀποστόλων παρακλήσεσιν.
ltx/gr_gr_cog/oc.m2.d5:ocMA.OdeW1C1H.greekmelody	@ltx/gr_gr_cog/he.h.m2:heHE.EnVythoKatestrose.greekname
ltx/gr_gr_cog/oc.m2.d5:ocMA.OdeW1C1H.incipit	@ltx/gr_gr_cog/he.h.m2:heHE.EnVythoKatestrose.incipit
ltx/gr_gr_cog/oc.m2.d5:ocMA.OdeW1C1H.melody	@ltx/gr_gr_cog/he.h.m2:heHE.EnVythoKatestrose.melody
ltx/gr_gr_cog/oc.m2.d5:ocMA.OdeW1C1H.mode	@ltx/gr_gr_cog/miscellanea:misc.Mode2
ltx/gr_gr_cog/oc.m2.d5:ocMA.OdeW1C1H.ode	@ltx/gr_gr_cog/miscellanea:misc.Ode1
ltx/gr_gr_cog/oc.m2.d5:ocMA.OdeW1C1H.text	@ltx/gr_gr_cog/he.h.m2:heHE.EnVythoKatestrose.text
ltx/gr_gr_cog/oc.m2.d5:ocMA.OdeW1C1T.incipit	Ἀγαθὸν κυήσασα Θεόν, πάντας ἀγαθύνοντα…
ltx/gr_gr_cog/oc.m2.d5:ocMA.OdeW1C1T.melody	@ltx/gr_gr_cog/he.h.m2:heHE.EnVythoKatestrose.name
ltx/gr_gr_cog/oc.m2.d5:ocMA.OdeW1C1T.mode	@ltx/gr_gr_cog/miscellanea:misc.Mode2
ltx/gr_gr_cog/oc.m2.d5:ocMA.OdeW1C1T.ode	@ltx/gr_gr_cog/miscellanea:misc.Ode1
ltx/gr_gr_cog/oc.m2.d5:ocMA.OdeW1C1T.text	Ἀγαθὸν κυήσασα Θεόν, πάντας ἀγαθύνοντα, τοὺς τῇ φθορᾷ κεκρατημένους Πάναγνε, τοῦτον καθικέτευε, Παναμώμητε, σὺν Προφήταις καὶ Μάρτυσι, καὶ τοῖς Ἀποστόλοις, πάντας λυτρωθῆναι παραβάσεως.
ltx/gr_gr_cog/oc.m2.d5:ocMA.OdeW1C21.greekmelody	@ltx/gr_gr_cog/he.h.m2:heHE.EnVythoKatestrose.greekname
ltx/gr_gr_cog/oc.m2.d5:ocMA.OdeW1C21.incipit	Στεφηφόρος βήματι Χριστοῦ, πάνσοφε Νικόλαε…
ltx/gr_gr_cog/oc.m2.d5:ocMA.OdeW1C21.melody	@ltx/gr_gr_cog/he.h.m2:heHE.EnVythoKatestrose.name
ltx/gr_gr_cog/oc.m2.d5:ocMA.OdeW1C21.mode	@ltx/gr_gr_cog/miscellanea:misc.Mode2
ltx/gr_gr_cog/oc.m2.d5:ocMA.OdeW1C21.ode	@ltx/gr_gr_cog/miscellanea:misc.Ode1
ltx/gr_gr_cog/oc.m2.d5:ocMA.OdeW1C21.text	Στεφηφόρος βήματι Χριστοῦ, πάνσοφε Νικόλαε, παρεστηκὼς σὺν Ἀγγέλων στρατεύμασι, φωτισμόν μοι δώρησαι, καταυγάζοντα τῆς ψυχῆς μου τὴν ζόφωσιν, ὅπως εὐφημήσω, χαίρων σου παμμάκαρ τὸ μνημόσυνον.
ltx/gr_gr_cog/oc.m2.d5:ocMA.OdeW1C22.incipit	Ὁ δοξάζων πάντας τοὺς αὐτόν…
ltx/gr_gr_cog/oc.m2.d5:ocMA.OdeW1C22.melody	@ltx/gr_gr_cog/he.h.m2:heHE.EnVythoKatestrose.name
ltx/gr_gr_cog/oc.m2.d5:ocMA.OdeW1C22.mode	@ltx/gr_gr_cog/miscellanea:misc.Mode2
ltx/gr_gr_cog/oc.m2.d5:ocMA.OdeW1C22.ode	@ltx/gr_gr_cog/miscellanea:misc.Ode1
ltx/gr_gr_cog/oc.m2.d5:ocMA.OdeW1C22.text	Ὁ δοξάζων πάντας τοὺς αὐτόν, Κύριος δοξάζοντας, σὲ τοῖς πιστοῖς καταφύγιον δέδωκε, πειρασμῶν ῥυόμενον, τοὺς προστρέχοντας τῇ σῇ σκέπῃ Νικόλαε, καὶ προσκαλουμένους, πίστει σε καὶ πόθῳ παναοίδιμε.
ltx/gr_gr_cog/oc.m2.d5:ocMA.OdeW1C2T.incipit	Ἰσωθῆναι πόθον μοι ἐνθείς, ὄφις…
ltx/gr_gr_cog/oc.m2.d5:ocMA.OdeW1C2T.melody	@ltx/gr_gr_cog/he.h.m2:heHE.EnVythoKatestrose.name
ltx/gr_gr_cog/oc.m2.d5:ocMA.OdeW1C2T.mode	@ltx/gr_gr_cog/miscellanea:misc.Mode2
ltx/gr_gr_cog/oc.m2.d5:ocMA.OdeW1C2T.ode	@ltx/gr_gr_cog/miscellanea:misc.Ode1
ltx/gr_gr_cog/oc.m2.d5:ocMA.OdeW1C2T.text	Ἰσωθῆναι πόθον μοι ἐνθείς, ὄφις ὁ παμπόνηρος, τῷ πλαστουργῷ, ὡς αἰχμάλωτον εἷλέ με, διὰ σοῦ δὲ Πάναγνε, ἀνακέκλημαι, θεωθεὶς ἀληθέστατα· σὺ γὰρ Θεομῆτορ, τὸν ἐμὲ θεώσαντα γεγέννηκας.
ltx/gr_gr_cog/oc.m2.d5:ocMA.OdeW3C11.incipit	Διδάσκαλον κτησάμενοι, τὴν σοφίαν ἔνδοξοι…
ltx/gr_gr_cog/oc.m2.d5:ocMA.OdeW3C11.melody	@ltx/gr_gr_cog/he.h.m2:heHE.ExinthisenIErimos.name
ltx/gr_gr_cog/oc.m2.d5:ocMA.OdeW3C11.mode	@ltx/gr_gr_cog/miscellanea:misc.Mode2
ltx/gr_gr_cog/oc.m2.d5:ocMA.OdeW3C11.ode	@ltx/gr_gr_cog/miscellanea:misc.Ode3
ltx/gr_gr_cog/oc.m2.d5:ocMA.OdeW3C11.text	Διδάσκαλον κτησάμενοι, τὴν σοφίαν ἔνδοξοι, τὴν τοῦ Πατρὸς ἐν Πνεύματι, τῶν Ἑλλήνων ἀπεμωράνατε, τὴν σοφίαν θεόπται ἀξιάγαστοι.
ltx/gr_gr_cog/oc.m2.d5:ocMA.OdeW3C12.incipit	Τὴν στείρωσιν πανεύφημοι, τῆς ψυχῆς…
ltx/gr_gr_cog/oc.m2.d5:ocMA.OdeW3C12.melody	@ltx/gr_gr_cog/he.h.m2:heHE.ExinthisenIErimos.name
ltx/gr_gr_cog/oc.m2.d5:ocMA.OdeW3C12.mode	@ltx/gr_gr_cog/miscellanea:misc.Mode2
ltx/gr_gr_cog/oc.m2.d5:ocMA.OdeW3C12.ode	@ltx/gr_gr_cog/miscellanea:misc.Ode3
ltx/gr_gr_cog/oc.m2.d5:ocMA.OdeW3C12.text	Τὴν στείρωσιν πανεύφημοι, τῆς ψυχῆς μου λύσατε, καὶ εὐτεκνίαν πράξεων, ἐναρέτων φέρειν, ποιήσατε, ὡς τοῦ Λόγου αὐτόπται πανσεβάσμιοι.
ltx/gr_gr_cog/oc.m2.d5:ocMA.OdeW3C13.incipit	Δεινῶς με φαρμαχθέντα νῦν, τῷ…
ltx/gr_gr_cog/oc.m2.d5:ocMA.OdeW3C13.melody	@ltx/gr_gr_cog/he.h.m2:heHE.ExinthisenIErimos.name
ltx/gr_gr_cog/oc.m2.d5:ocMA.OdeW3C13.mode	@ltx/gr_gr_cog/miscellanea:misc.Mode2
ltx/gr_gr_cog/oc.m2.d5:ocMA.OdeW3C13.ode	@ltx/gr_gr_cog/miscellanea:misc.Ode3
ltx/gr_gr_cog/oc.m2.d5:ocMA.OdeW3C13.text	Δεινῶς με φαρμαχθέντα νῦν, τῷ ἰοβόλῳ δήγματι, τοῦ δυσμενοῦς θεράπευσον, ἱκεσίαις τῶν Ἀποστόλων σου, Εὐεργέτα τῶν ὅλων πολυέλεε.
ltx/gr_gr_cog/oc.m2.d5:ocMA.OdeW3C1H.greekmelody	@ltx/gr_gr_cog/he.h.m2:heHE.ExinthisenIErimos.greekname
ltx/gr_gr_cog/oc.m2.d5:ocMA.OdeW3C1H.incipit	@ltx/gr_gr_cog/he.h.m2:heHE.ExinthisenIErimos.incipit
ltx/gr_gr_cog/oc.m2.d5:ocMA.OdeW3C1H.melody	@ltx/gr_gr_cog/he.h.m2:heHE.ExinthisenIErimos.melody
ltx/gr_gr_cog/oc.m2.d5:ocMA.OdeW3C1H.mode	@ltx/gr_gr_cog/miscellanea:misc.Mode2
ltx/gr_gr_cog/oc.m2.d5:ocMA.OdeW3C1H.ode	@ltx/gr_gr_cog/miscellanea:misc.Ode3
ltx/gr_gr_cog/oc.m2.d5:ocMA.OdeW3C1H.text	@ltx/gr_gr_cog/he.h.m2:heHE.ExinthisenIErimos.text
ltx/gr_gr_cog/oc.m2.d5:ocMA.OdeW3C1T.incipit	Χριστὸν τὸν ὑπεράγαθον, ἐκδυσώπει Πάναγνε…
ltx/gr_gr_cog/oc.m2.d5:ocMA.OdeW3C1T.melody	@ltx/gr_gr_cog/he.h.m2:heHE.ExinthisenIErimos.name
ltx/gr_gr_cog/oc.m2.d5:ocMA.OdeW3C1T.mode	@ltx/gr_gr_cog/miscellanea:misc.Mode2
ltx/gr_gr_cog/oc.m2.d5:ocMA.OdeW3C1T.ode	@ltx/gr_gr_cog/miscellanea:misc.Ode3
ltx/gr_gr_cog/oc.m2.d5:ocMA.OdeW3C1T.text	Χριστὸν τὸν ὑπεράγαθον, ἐκδυσώπει Πάναγνε, σὺν Ἀποστόλοις ἅπασι, πάσης βλάβης καὶ περιστάσεως, καὶ κινδύνων ῥυσθῆναι τοὺς ὑμνοῦντάς σε.
ltx/gr_gr_cog/oc.m2.d5:ocMA.OdeW3C21.greekmelody	@ltx/gr_gr_cog/he.h.m2:heHE.ExinthisenIErimos.greekname
ltx/gr_gr_cog/oc.m2.d5:ocMA.OdeW3C21.incipit	Νικόλαε μακάριε, τοῦ Δεσπότου γνήσιος…
ltx/gr_gr_cog/oc.m2.d5:ocMA.OdeW3C21.melody	@ltx/gr_gr_cog/he.h.m2:heHE.ExinthisenIErimos.name
ltx/gr_gr_cog/oc.m2.d5:ocMA.OdeW3C21.mode	@ltx/gr_gr_cog/miscellanea:misc.Mode2
ltx/gr_gr_cog/oc.m2.d5:ocMA.OdeW3C21.ode	@ltx/gr_gr_cog/miscellanea:misc.Ode3
ltx/gr_gr_cog/oc.m2.d5:ocMA.OdeW3C21.text	Νικόλαε μακάριε, τοῦ Δεσπότου γνήσιος, σὺ μαθητὴς γενόμενος, διασῴζεις τοὺς σοὶ προστρέχοντας, χαλεπῶν ἐκ κινδύνων, καὶ θανάτου πικροῦ.
ltx/gr_gr_cog/oc.m2.d5:ocMA.OdeW3C22.incipit	Ἱλάσθητι τοῖς δούλοις σου, τῶν…
ltx/gr_gr_cog/oc.m2.d5:ocMA.OdeW3C22.melody	@ltx/gr_gr_cog/he.h.m2:heHE.ExinthisenIErimos.name
ltx/gr_gr_cog/oc.m2.d5:ocMA.OdeW3C22.mode	@ltx/gr_gr_cog/miscellanea:misc.Mode2
ltx/gr_gr_cog/oc.m2.d5:ocMA.OdeW3C22.ode	@ltx/gr_gr_cog/miscellanea:misc.Ode3
ltx/gr_gr_cog/oc.m2.d5:ocMA.OdeW3C22.text	Ἱλάσθητι τοῖς δούλοις σου, τῶν πταισμάτων ἄφεσιν, ὡς ἀγαθὸς δωρούμενος, Νικολάου τοῦ σοῦ θεράποντος, ταῖς πρὸς σὲ μεσιτείαις πολυέλεε.
ltx/gr_gr_cog/oc.m2.d5:ocMA.OdeW3C2T.incipit	Κατεύνασον τὸν τάραχον, τῶν παθῶν…
ltx/gr_gr_cog/oc.m2.d5:ocMA.OdeW3C2T.melody	@ltx/gr_gr_cog/he.h.m2:heHE.ExinthisenIErimos.name
ltx/gr_gr_cog/oc.m2.d5:ocMA.OdeW3C2T.mode	@ltx/gr_gr_cog/miscellanea:misc.Mode2
ltx/gr_gr_cog/oc.m2.d5:ocMA.OdeW3C2T.ode	@ltx/gr_gr_cog/miscellanea:misc.Ode3
ltx/gr_gr_cog/oc.m2.d5:ocMA.OdeW3C2T.text	Κατεύνασον τὸν τάραχον, τῶν παθῶν μου Δέσποινα, καὶ τὴν ζωὴν κυβέρνησον, Παναγία Θεὸν ἡ τέξασα, ἐν ᾧ ἐστερεώθῃ ἡ καρδία μου.
ltx/gr_gr_cog/oc.m2.d5:ocMA.OdeW4C11.incipit	Πεινῶντά με καὶ λιμῷ, καθ’…
ltx/gr_gr_cog/oc.m2.d5:ocMA.OdeW4C11.melody	@ltx/gr_gr_cog/he.h.m2:heHE.ElilythasEkParthenou.name
ltx/gr_gr_cog/oc.m2.d5:ocMA.OdeW4C11.mode	@ltx/gr_gr_cog/miscellanea:misc.Mode2
ltx/gr_gr_cog/oc.m2.d5:ocMA.OdeW4C11.ode	@ltx/gr_gr_cog/miscellanea:misc.Ode4
ltx/gr_gr_cog/oc.m2.d5:ocMA.OdeW4C11.text	Πεινῶντά με καὶ λιμῷ, καθʼ ἑκάστην τηκόμενον, σωτηρίου βρώσεως ἔμπλησον, μόνε Ἀθάνατε, θείαις παρακλήσεσι, τῶν εἰς τὸν σύμπαντα κόσμον κηρυξάντων σε.
ltx/gr_gr_cog/oc.m2.d5:ocMA.OdeW4C12.incipit	Εἰς θάλασσαν κοσμικήν, ἐπεβίβασας ἅπαντας…
ltx/gr_gr_cog/oc.m2.d5:ocMA.OdeW4C12.melody	@ltx/gr_gr_cog/he.h.m2:heHE.ElilythasEkParthenou.name
ltx/gr_gr_cog/oc.m2.d5:ocMA.OdeW4C12.mode	@ltx/gr_gr_cog/miscellanea:misc.Mode2
ltx/gr_gr_cog/oc.m2.d5:ocMA.OdeW4C12.ode	@ltx/gr_gr_cog/miscellanea:misc.Ode4
ltx/gr_gr_cog/oc.m2.d5:ocMA.OdeW4C12.text	Εἰς θάλασσαν κοσμικήν, ἐπεβίβασας ἅπαντας, ὡς ἵππους φιλάνθρωπε, τοὺς εὐκλεεῖς Ἀποστόλους σου, ταύτης συνταράσσοντας, τῆς ἁλμυρᾶς ἀπιστίας πικρὰ ὕδατα.
ltx/gr_gr_cog/oc.m2.d5:ocMA.OdeW4C13.incipit	Τὸν Ἥλιον τοῖς ἐν σκότει…
ltx/gr_gr_cog/oc.m2.d5:ocMA.OdeW4C13.melody	@ltx/gr_gr_cog/he.h.m2:heHE.ElilythasEkParthenou.name
ltx/gr_gr_cog/oc.m2.d5:ocMA.OdeW4C13.mode	@ltx/gr_gr_cog/miscellanea:misc.Mode2
ltx/gr_gr_cog/oc.m2.d5:ocMA.OdeW4C13.ode	@ltx/gr_gr_cog/miscellanea:misc.Ode4
ltx/gr_gr_cog/oc.m2.d5:ocMA.OdeW4C13.text	Τὸν Ἥλιον τοῖς ἐν σκότει, Χριστὸν ἀνατείλαντες, ἐν σκότει με κείμενον, τῆς ἁμαρτίας φωτίσατε, εἴργοντες πανεύφημοι, τὰς πονηρὰς ἐνθυμήσεις τῆς καρδίας μου.
ltx/gr_gr_cog/oc.m2.d5:ocMA.OdeW4C1H.greekmelody	@ltx/gr_gr_cog/he.h.m2:heHE.ElilythasEkParthenou.greekname
ltx/gr_gr_cog/oc.m2.d5:ocMA.OdeW4C1H.incipit	@ltx/gr_gr_cog/he.h.m2:heHE.ElilythasEkParthenou.incipit
ltx/gr_gr_cog/oc.m2.d5:ocMA.OdeW4C1H.melody	@ltx/gr_gr_cog/he.h.m2:heHE.ElilythasEkParthenou.melody
ltx/gr_gr_cog/oc.m2.d5:ocMA.OdeW4C1H.mode	@ltx/gr_gr_cog/miscellanea:misc.Mode2
ltx/gr_gr_cog/oc.m2.d5:ocMA.OdeW4C1H.ode	@ltx/gr_gr_cog/miscellanea:misc.Ode4
ltx/gr_gr_cog/oc.m2.d5:ocMA.OdeW4C1H.text	@ltx/gr_gr_cog/he.h.m2:heHE.ElilythasEkParthenou.text
ltx/gr_gr_cog/oc.m2.d5:ocMA.OdeW4C1T.incipit	Πανύμνητε ἡ Θεόν, ὑπερύμνητον τέξασα…
ltx/gr_gr_cog/oc.m2.d5:ocMA.OdeW4C1T.melody	@ltx/gr_gr_cog/he.h.m2:heHE.ElilythasEkParthenou.name
ltx/gr_gr_cog/oc.m2.d5:ocMA.OdeW4C1T.mode	@ltx/gr_gr_cog/miscellanea:misc.Mode2
ltx/gr_gr_cog/oc.m2.d5:ocMA.OdeW4C1T.ode	@ltx/gr_gr_cog/miscellanea:misc.Ode4
ltx/gr_gr_cog/oc.m2.d5:ocMA.OdeW4C1T.text	Πανύμνητε ἡ Θεόν, ὑπερύμνητον τέξασα, ὑπὲρ τῶν ὑμνούντων σε, σὺν Ἀποστόλοις ἱκέτευε, ὅπως λυτρωθείημεν, ἁμαρτιῶν καὶ κινδύνων καὶ κολάσεως.
ltx/gr_gr_cog/oc.m2.d5:ocMA.OdeW4C21.greekmelody	@ltx/gr_gr_cog/he.h.m2:heHE.ElilythasEkParthenou.greekname
ltx/gr_gr_cog/oc.m2.d5:ocMA.OdeW4C21.incipit	Ὁμιλήσας καθαρῶς, ταῖς ἀκτῖσι τοῦ…
ltx/gr_gr_cog/oc.m2.d5:ocMA.OdeW4C21.melody	@ltx/gr_gr_cog/he.h.m2:heHE.ElilythasEkParthenou.name
ltx/gr_gr_cog/oc.m2.d5:ocMA.OdeW4C21.mode	@ltx/gr_gr_cog/miscellanea:misc.Mode2
ltx/gr_gr_cog/oc.m2.d5:ocMA.OdeW4C21.ode	@ltx/gr_gr_cog/miscellanea:misc.Ode4
ltx/gr_gr_cog/oc.m2.d5:ocMA.OdeW4C21.text	Ὁμιλήσας καθαρῶς, ταῖς ἀκτῖσι τοῦ Πνεύματος, φωτοφόρος γέγονας, κόσμου φωτίζων τὰ πέρατα, πᾶσι προϊστάμενος, καὶ πάντας σῴζων τοὺς πίστει σε δοξάζοντας.
ltx/gr_gr_cog/oc.m2.d5:ocMA.OdeW4C22.incipit	Λυτρούμενος ἐκ θανάτου, ὡς ὤφθης…
ltx/gr_gr_cog/oc.m2.d5:ocMA.OdeW4C22.melody	@ltx/gr_gr_cog/he.h.m2:heHE.ElilythasEkParthenou.name
ltx/gr_gr_cog/oc.m2.d5:ocMA.OdeW4C22.mode	@ltx/gr_gr_cog/miscellanea:misc.Mode2
ltx/gr_gr_cog/oc.m2.d5:ocMA.OdeW4C22.ode	@ltx/gr_gr_cog/miscellanea:misc.Ode4
ltx/gr_gr_cog/oc.m2.d5:ocMA.OdeW4C22.text	Λυτρούμενος ἐκ θανάτου, ὡς ὤφθης τὸ πρότερον, νεανίας ὅσιε, οὕτω καὶ νῦν με διάσωσον, πάσης περιστάσεως, καὶ πειρασμῶν καὶ κινδύνων παμμακάριστε.
ltx/gr_gr_cog/oc.m2.d5:ocMA.OdeW4C23.incipit	Ἀπήστραψας ἀρετῶν, λαμπηδόνας πανόλβιε, μιμητὴς…
ltx/gr_gr_cog/oc.m2.d5:ocMA.OdeW4C23.melody	@ltx/gr_gr_cog/he.h.m2:heHE.ElilythasEkParthenou.name
ltx/gr_gr_cog/oc.m2.d5:ocMA.OdeW4C23.mode	@ltx/gr_gr_cog/miscellanea:misc.Mode2
ltx/gr_gr_cog/oc.m2.d5:ocMA.OdeW4C23.ode	@ltx/gr_gr_cog/miscellanea:misc.Ode4
ltx/gr_gr_cog/oc.m2.d5:ocMA.OdeW4C23.text	Ἀπήστραψας ἀρετῶν, λαμπηδόνας πανόλβιε, μιμητὴς πανάριστος, τοῦ σοῦ Δεσπότου γενόμενος, σῴζεις δὲ καλούμενος, τοὺς εὐλαβείᾳ καὶ πόθῳ σε δοξάζοντας.
ltx/gr_gr_cog/oc.m2.d5:ocMA.OdeW4C2T.incipit	Ἐλήλυθεν ἐπὶ σοί, ὁ Δεσπότης…
ltx/gr_gr_cog/oc.m2.d5:ocMA.OdeW4C2T.melody	@ltx/gr_gr_cog/he.h.m2:heHE.ElilythasEkParthenou.name
ltx/gr_gr_cog/oc.m2.d5:ocMA.OdeW4C2T.mode	@ltx/gr_gr_cog/miscellanea:misc.Mode2
ltx/gr_gr_cog/oc.m2.d5:ocMA.OdeW4C2T.ode	@ltx/gr_gr_cog/miscellanea:misc.Ode4
ltx/gr_gr_cog/oc.m2.d5:ocMA.OdeW4C2T.text	Ἐλήλυθεν ἐπὶ σοί, ὁ Δεσπότης τῆς κτίσεως, σωματωθησόμενος, καὶ διασῴζων ὡς εὔσπλαγχνος, ὅλον με τὸν ἄνθρωπον· διό σε πάντες Θεοτόκον πιστοὶ σέβομεν.
ltx/gr_gr_cog/oc.m2.d5:ocMA.OdeW5C11.incipit	Ὁ μέγας ποιμήν, μέσον λύκων…
ltx/gr_gr_cog/oc.m2.d5:ocMA.OdeW5C11.melody	@ltx/gr_gr_cog/he.h.m2:heHE.MesitisTheou.name
ltx/gr_gr_cog/oc.m2.d5:ocMA.OdeW5C11.mode	@ltx/gr_gr_cog/miscellanea:misc.Mode2
ltx/gr_gr_cog/oc.m2.d5:ocMA.OdeW5C11.ode	@ltx/gr_gr_cog/miscellanea:misc.Ode5
ltx/gr_gr_cog/oc.m2.d5:ocMA.OdeW5C11.text	Ὁ μέγας ποιμήν, μέσον λύκων ἔστειλεν ὡς πρόβατα, αὐτοὺς μεταπλάττοντα, τῇ θεοσθενείᾳ τοῦ βαπτίσματος, καὶ τῷ κάλλει τῶν λόγων, τοὺς θείους Μαθητὰς αὐτοῦ.
ltx/gr_gr_cog/oc.m2.d5:ocMA.OdeW5C12.incipit	Τῷ θείῳ φωτί, τὰς ἐν…
ltx/gr_gr_cog/oc.m2.d5:ocMA.OdeW5C12.melody	@ltx/gr_gr_cog/he.h.m2:heHE.MesitisTheou.name
ltx/gr_gr_cog/oc.m2.d5:ocMA.OdeW5C12.mode	@ltx/gr_gr_cog/miscellanea:misc.Mode2
ltx/gr_gr_cog/oc.m2.d5:ocMA.OdeW5C12.ode	@ltx/gr_gr_cog/miscellanea:misc.Ode5
ltx/gr_gr_cog/oc.m2.d5:ocMA.OdeW5C12.text	Τῷ θείῳ φωτί, τὰς ἐν ζόφῳ πλάνης ἐφωτίσατε, καρδίας Ἀπόστολοι· ὅθεν ἱκετεύω, σκοτισθέντα με ἡδονῶν ἀμαυρώσει, φωτίσατε μακάριοι.
ltx/gr_gr_cog/oc.m2.d5:ocMA.OdeW5C13.incipit	Ἀθλία ψυχή, πρὸ τοῦ τέλους…
ltx/gr_gr_cog/oc.m2.d5:ocMA.OdeW5C13.melody	@ltx/gr_gr_cog/he.h.m2:heHE.MesitisTheou.name
ltx/gr_gr_cog/oc.m2.d5:ocMA.OdeW5C13.mode	@ltx/gr_gr_cog/miscellanea:misc.Mode2
ltx/gr_gr_cog/oc.m2.d5:ocMA.OdeW5C13.ode	@ltx/gr_gr_cog/miscellanea:misc.Ode5
ltx/gr_gr_cog/oc.m2.d5:ocMA.OdeW5C13.text	Ἀθλία ψυχή, πρὸ τοῦ τέλους σπεῦσον μετανόησον, Κυρίῳ κραυγάζουσα· Ἥμαρτόν σοι Δέσποτα συγχώρησον, διὰ τῶν Ἀποστόλων, καὶ σῶσόν με ὡς εὔσπλαγχνος.
ltx/gr_gr_cog/oc.m2.d5:ocMA.OdeW5C1H.greekmelody	@ltx/gr_gr_cog/he.h.m2:heHE.MesitisTheou.greekname
ltx/gr_gr_cog/oc.m2.d5:ocMA.OdeW5C1H.incipit	@ltx/gr_gr_cog/he.h.m2:heHE.MesitisTheou.incipit
ltx/gr_gr_cog/oc.m2.d5:ocMA.OdeW5C1H.melody	@ltx/gr_gr_cog/he.h.m2:heHE.MesitisTheou.melody
ltx/gr_gr_cog/oc.m2.d5:ocMA.OdeW5C1H.mode	@ltx/gr_gr_cog/miscellanea:misc.Mode2
ltx/gr_gr_cog/oc.m2.d5:ocMA.OdeW5C1H.ode	@ltx/gr_gr_cog/miscellanea:misc.Ode5
ltx/gr_gr_cog/oc.m2.d5:ocMA.OdeW5C1H.text	@ltx/gr_gr_cog/he.h.m2:heHE.MesitisTheou.text
ltx/gr_gr_cog/oc.m2.d5:ocMA.OdeW5C1T.incipit	Φωτί με τῷ σῷ, τὸν…
ltx/gr_gr_cog/oc.m2.d5:ocMA.OdeW5C1T.melody	@ltx/gr_gr_cog/he.h.m2:heHE.MesitisTheou.name
ltx/gr_gr_cog/oc.m2.d5:ocMA.OdeW5C1T.mode	@ltx/gr_gr_cog/miscellanea:misc.Mode2
ltx/gr_gr_cog/oc.m2.d5:ocMA.OdeW5C1T.ode	@ltx/gr_gr_cog/miscellanea:misc.Ode5
ltx/gr_gr_cog/oc.m2.d5:ocMA.OdeW5C1T.text	Φωτί με τῷ σῷ, τὸν ἐν σκότει κείμενον καταύγασον, Φωτὸς οἰκητήριον, καὶ σὺν Ἀποστόλοις καθικέτευε, ἀπὸ πάσης ἀνάγκης, ῥυσθῆναι ταῖς πρεσβείαις σου.
ltx/gr_gr_cog/oc.m2.d5:ocMA.OdeW5C21.greekmelody	@ltx/gr_gr_cog/he.h.m2:heHE.OFotismos.greekname
ltx/gr_gr_cog/oc.m2.d5:ocMA.OdeW5C21.incipit	Θεοπρεπεῖ, πολιτείᾳ, τρισμάκαρ λελαμπρυσμένος, τοὺς…
ltx/gr_gr_cog/oc.m2.d5:ocMA.OdeW5C21.melody	@ltx/gr_gr_cog/he.h.m2:heHE.OFotismos.name
ltx/gr_gr_cog/oc.m2.d5:ocMA.OdeW5C21.mode	@ltx/gr_gr_cog/miscellanea:misc.Mode2
ltx/gr_gr_cog/oc.m2.d5:ocMA.OdeW5C21.ode	@ltx/gr_gr_cog/miscellanea:misc.Ode5
ltx/gr_gr_cog/oc.m2.d5:ocMA.OdeW5C21.text	Θεοπρεπεῖ, πολιτείᾳ, τρισμάκαρ λελαμπρυσμένος, τοὺς κατακριθέντας ἀδίκῳ ψήφῳ, θανατωθῆναι παραστὰς ἐλυτρώσω, τῷ Δεσπότῃ Χριστῷ κραυγάζοντας· Ἕτερον ἐκτός σου, Θεὸν οὐ γινώσκομεν.
ltx/gr_gr_cog/oc.m2.d5:ocMA.OdeW5C22.incipit	Ἐν οὐρανοῖς, τὴν ἀΐδιον δόξαν…
ltx/gr_gr_cog/oc.m2.d5:ocMA.OdeW5C22.melody	@ltx/gr_gr_cog/he.h.m2:heHE.OFotismos.name
ltx/gr_gr_cog/oc.m2.d5:ocMA.OdeW5C22.mode	@ltx/gr_gr_cog/miscellanea:misc.Mode2
ltx/gr_gr_cog/oc.m2.d5:ocMA.OdeW5C22.ode	@ltx/gr_gr_cog/miscellanea:misc.Ode5
ltx/gr_gr_cog/oc.m2.d5:ocMA.OdeW5C22.text	Ἐν οὐρανοῖς, τὴν ἀΐδιον δόξαν νῦν ἐποπτεύων, καὶ τῆς ἀποῤῥήτου θείας αἴγλης, ταῖς φανοτάταις ἐντρυφῶν λαμπηδόσι, σκέπασόν με τῇ προστασίᾳ σου, ὅσιε θεράπον Χριστοῦ πανσεβάσμιε.
ltx/gr_gr_cog/oc.m2.d5:ocMA.OdeW5C2T.incipit	Ἵνα τὴν σήν, ἐκζητήσῃς εἰκόνα…
ltx/gr_gr_cog/oc.m2.d5:ocMA.OdeW5C2T.melody	@ltx/gr_gr_cog/he.h.m2:heHE.OFotismos.name
ltx/gr_gr_cog/oc.m2.d5:ocMA.OdeW5C2T.mode	@ltx/gr_gr_cog/miscellanea:misc.Mode2
ltx/gr_gr_cog/oc.m2.d5:ocMA.OdeW5C2T.ode	@ltx/gr_gr_cog/miscellanea:misc.Ode5
ltx/gr_gr_cog/oc.m2.d5:ocMA.OdeW5C2T.text	Ἵνα τὴν σήν, ἐκζητήσῃς εἰκόνα συγκεχωσμένην, τοῖς πάθεσι Σῶτερ τὰς οὐρανίους, λαθὼν δυνάμεις, σαρκωθεὶς ἐκ Παρθένου, ἐπεφάνης τοῖς σοὶ κραυγάζουσιν· Ἕτερον ἐκτός σου Θεὸν οὐ γινώσκομεν.
ltx/gr_gr_cog/oc.m2.d5:ocMA.OdeW6C11.incipit	Οἱ τὸ ὕδωρ τὸ ζῶν…
ltx/gr_gr_cog/oc.m2.d5:ocMA.OdeW6C11.melody	@ltx/gr_gr_cog/he.h.m2:heHE.EnAvyssoPtaismaton.name
ltx/gr_gr_cog/oc.m2.d5:ocMA.OdeW6C11.mode	@ltx/gr_gr_cog/miscellanea:misc.Mode2
ltx/gr_gr_cog/oc.m2.d5:ocMA.OdeW6C11.ode	@ltx/gr_gr_cog/miscellanea:misc.Ode6
ltx/gr_gr_cog/oc.m2.d5:ocMA.OdeW6C11.text	Οἱ τὸ ὕδωρ τὸ ζῶν εὐπορήσαντες, τὴν κατατακεῖσαν ψυχήν μου τῷ καύσωνι, τῆς ἁμαρτίας δέομαι, μαθηταὶ τοῦ Σωτῆρος ποτίσατε.
ltx/gr_gr_cog/oc.m2.d5:ocMA.OdeW6C12.incipit	Οὐρανοὶ νοητοὶ χρηματίσαντες, δόξαν τοῦ…
ltx/gr_gr_cog/oc.m2.d5:ocMA.OdeW6C12.melody	@ltx/gr_gr_cog/he.h.m2:heHE.EnAvyssoPtaismaton.name
ltx/gr_gr_cog/oc.m2.d5:ocMA.OdeW6C12.mode	@ltx/gr_gr_cog/miscellanea:misc.Mode2
ltx/gr_gr_cog/oc.m2.d5:ocMA.OdeW6C12.ode	@ltx/gr_gr_cog/miscellanea:misc.Ode6
ltx/gr_gr_cog/oc.m2.d5:ocMA.OdeW6C12.text	Οὐρανοὶ νοητοὶ χρηματίσαντες, δόξαν τοῦ Θεοῦ διηγεῖσθε τὴν ἄῤῥητον, θεοφεγγεῖς Ἀπόστολοι, ἧς τυχεῖν ἡμᾶς πάντας πρεσβεύσατε.
ltx/gr_gr_cog/oc.m2.d5:ocMA.OdeW6C13.incipit	Ἐν πελάγει δεινῶς κυματούμενος, σοὶ…
ltx/gr_gr_cog/oc.m2.d5:ocMA.OdeW6C13.melody	@ltx/gr_gr_cog/he.h.m2:heHE.EnAvyssoPtaismaton.name
ltx/gr_gr_cog/oc.m2.d5:ocMA.OdeW6C13.mode	@ltx/gr_gr_cog/miscellanea:misc.Mode2
ltx/gr_gr_cog/oc.m2.d5:ocMA.OdeW6C13.ode	@ltx/gr_gr_cog/miscellanea:misc.Ode6
ltx/gr_gr_cog/oc.m2.d5:ocMA.OdeW6C13.text	Ἐν πελάγει δεινῶς κυματούμενος, σοὶ τῷ τοῦ παντὸς κυβερνήτῃ, προσέρχομαι, διὰ τῶν Ἀποστόλων σου, σωτηρίας πρὸς ὅρμον με ἴθυνον.
ltx/gr_gr_cog/oc.m2.d5:ocMA.OdeW6C1H.greekmelody	@ltx/gr_gr_cog/he.h.m2:heHE.EnAvyssoPtaismaton.greekname
ltx/gr_gr_cog/oc.m2.d5:ocMA.OdeW6C1H.incipit	@ltx/gr_gr_cog/he.h.m2:heHE.EnAvyssoPtaismaton.incipit
ltx/gr_gr_cog/oc.m2.d5:ocMA.OdeW6C1H.melody	@ltx/gr_gr_cog/he.h.m2:heHE.EnAvyssoPtaismaton.melody
ltx/gr_gr_cog/oc.m2.d5:ocMA.OdeW6C1H.mode	@ltx/gr_gr_cog/miscellanea:misc.Mode2
ltx/gr_gr_cog/oc.m2.d5:ocMA.OdeW6C1H.ode	@ltx/gr_gr_cog/miscellanea:misc.Ode6
ltx/gr_gr_cog/oc.m2.d5:ocMA.OdeW6C1H.text	@ltx/gr_gr_cog/he.h.m2:heHE.EnAvyssoPtaismaton.text
ltx/gr_gr_cog/oc.m2.d5:ocMA.OdeW6C1T.incipit	Μετὰ πασῶν τῶν ἄνω Δυνάμεων…
ltx/gr_gr_cog/oc.m2.d5:ocMA.OdeW6C1T.melody	@ltx/gr_gr_cog/he.h.m2:heHE.EnAvyssoPtaismaton.name
ltx/gr_gr_cog/oc.m2.d5:ocMA.OdeW6C1T.mode	@ltx/gr_gr_cog/miscellanea:misc.Mode2
ltx/gr_gr_cog/oc.m2.d5:ocMA.OdeW6C1T.ode	@ltx/gr_gr_cog/miscellanea:misc.Ode6
ltx/gr_gr_cog/oc.m2.d5:ocMA.OdeW6C1T.text	Μετὰ πασῶν τῶν ἄνω Δυνάμεων, μετὰ Προφητῶν, Ἀποστόλων, Μαρτύρων σου, εἰς ἱλασμὸν προσάγω σοι, τὴν Μητέρα σου, οἴκτειρον, σῶσόν με.
ltx/gr_gr_cog/oc.m2.d5:ocMA.OdeW6C21.greekmelody	@ltx/gr_gr_cog/he.h.m2:heHE.EnAvyssoPtaismaton.greekname
ltx/gr_gr_cog/oc.m2.d5:ocMA.OdeW6C21.incipit	Ὁ τῆς νίκης Νικόλαε στέφανος…
ltx/gr_gr_cog/oc.m2.d5:ocMA.OdeW6C21.melody	@ltx/gr_gr_cog/he.h.m2:heHE.EnAvyssoPtaismaton.name
ltx/gr_gr_cog/oc.m2.d5:ocMA.OdeW6C21.mode	@ltx/gr_gr_cog/miscellanea:misc.Mode2
ltx/gr_gr_cog/oc.m2.d5:ocMA.OdeW6C21.ode	@ltx/gr_gr_cog/miscellanea:misc.Ode6
ltx/gr_gr_cog/oc.m2.d5:ocMA.OdeW6C21.text	Ὁ τῆς νίκης Νικόλαε στέφανος, τῇ σῇ κορυφῇ ἀξίως ἐπιτίθεται· ὡς νικητὴς οὖν ἄριστος, τοὺς σὲ προσκαλουμένους διάσωσον.
ltx/gr_gr_cog/oc.m2.d5:ocMA.OdeW6C22.incipit	Νεκρωθέντα με μάκαρ τοῖς πταίσμασι…
ltx/gr_gr_cog/oc.m2.d5:ocMA.OdeW6C22.melody	@ltx/gr_gr_cog/he.h.m2:heHE.EnAvyssoPtaismaton.name
ltx/gr_gr_cog/oc.m2.d5:ocMA.OdeW6C22.mode	@ltx/gr_gr_cog/miscellanea:misc.Mode2
ltx/gr_gr_cog/oc.m2.d5:ocMA.OdeW6C22.ode	@ltx/gr_gr_cog/miscellanea:misc.Ode6
ltx/gr_gr_cog/oc.m2.d5:ocMA.OdeW6C22.text	Νεκρωθέντα με μάκαρ τοῖς πταίσμασι, καὶ ταῖς τῶν παθῶν τρικυμίαις ποντούμενον, ἐπιφανεὶς διάσωσον, πρὸς λιμένα τοῦ θείου θελήματος.
ltx/gr_gr_cog/oc.m2.d5:ocMA.OdeW6C2T.incipit	Ἐπὶ σοὶ τὰς ἐλπίδας ἀνέθηκα…
ltx/gr_gr_cog/oc.m2.d5:ocMA.OdeW6C2T.melody	@ltx/gr_gr_cog/he.h.m2:heHE.EnAvyssoPtaismaton.name
ltx/gr_gr_cog/oc.m2.d5:ocMA.OdeW6C2T.mode	@ltx/gr_gr_cog/miscellanea:misc.Mode2
ltx/gr_gr_cog/oc.m2.d5:ocMA.OdeW6C2T.ode	@ltx/gr_gr_cog/miscellanea:misc.Ode6
ltx/gr_gr_cog/oc.m2.d5:ocMA.OdeW6C2T.text	Ἐπὶ σοὶ τὰς ἐλπίδας ἀνέθηκα, Μῆτερ ἀειπάρθενε τῆς σωτηρίας μου, καὶ σὲ προστάτιν τίθημι, τῆς ζωῆς ἀσφαλῆ τε καὶ ἄσειστον.
ltx/gr_gr_cog/oc.m2.d5:ocMA.OdeW7C11.incipit	Πυρὶ θείου πνεύματος προσαναφθέντες, τῆς…
ltx/gr_gr_cog/oc.m2.d5:ocMA.OdeW7C11.melody	@ltx/gr_gr_cog/he.h.m2:heHE.AntitheonProstagma.name
ltx/gr_gr_cog/oc.m2.d5:ocMA.OdeW7C11.mode	@ltx/gr_gr_cog/miscellanea:misc.Mode2
ltx/gr_gr_cog/oc.m2.d5:ocMA.OdeW7C11.ode	@ltx/gr_gr_cog/miscellanea:misc.Ode7
ltx/gr_gr_cog/oc.m2.d5:ocMA.OdeW7C11.text	Πυρὶ θείου πνεύματος προσαναφθέντες, τῆς πλάνης τοὺς ἄνθρακας, Ἀπόστολοι ἐσβέσατε, Θεοῦ δὲ τὸν ἔρωτα, ἐν ταῖς φρεσὶ τῶν πιστῶν, πάντων ἐπανήψατε· διὸ μεγαλοφώνως ὑμᾶς γεραίρομεν.
ltx/gr_gr_cog/oc.m2.d5:ocMA.OdeW7C12.incipit	Τὸν κόσμον μισήσαντες καὶ τὰ…
ltx/gr_gr_cog/oc.m2.d5:ocMA.OdeW7C12.melody	@ltx/gr_gr_cog/he.h.m2:heHE.AntitheonProstagma.name
ltx/gr_gr_cog/oc.m2.d5:ocMA.OdeW7C12.mode	@ltx/gr_gr_cog/miscellanea:misc.Mode2
ltx/gr_gr_cog/oc.m2.d5:ocMA.OdeW7C12.ode	@ltx/gr_gr_cog/miscellanea:misc.Ode7
ltx/gr_gr_cog/oc.m2.d5:ocMA.OdeW7C12.text	Τὸν κόσμον μισήσαντες καὶ τὰ ἐν κόσμῳ, Χριστὸν ἠγαπήσατε, ἐν κόσμῳ μετὰ σώματος, βροτοῖς ὁμιλήσαντα, ὃν ἱκετεύσατε, πάντων τῶν ἐν βίῳ με δεινῶν, ἐλευθερῶσαι, θεῖοι Ἀπόστολοι.
ltx/gr_gr_cog/oc.m2.d5:ocMA.OdeW7C13.incipit	Κριτὰ δικαιότατε καρδιογνῶστα, ὁ μόνος…
ltx/gr_gr_cog/oc.m2.d5:ocMA.OdeW7C13.melody	@ltx/gr_gr_cog/he.h.m2:heHE.AntitheonProstagma.name
ltx/gr_gr_cog/oc.m2.d5:ocMA.OdeW7C13.mode	@ltx/gr_gr_cog/miscellanea:misc.Mode2
ltx/gr_gr_cog/oc.m2.d5:ocMA.OdeW7C13.ode	@ltx/gr_gr_cog/miscellanea:misc.Ode7
ltx/gr_gr_cog/oc.m2.d5:ocMA.OdeW7C13.text	Κριτὰ δικαιότατε καρδιογνῶστα, ὁ μόνος τὰ κρύφια, εἰδώς μου πλημμελήματα, ἐν ὥρᾳ τῆς κρίσεως μὴ κατακρίνῃς με, μηδὲ πέμψῃς με εἰς πῦρ, ταῖς ἱκεσίαις τῶν Ἀποστόλων σου.
ltx/gr_gr_cog/oc.m2.d5:ocMA.OdeW7C1H.greekmelody	@ltx/gr_gr_cog/he.h.m2:heHE.AntitheonProstagma.greekname
ltx/gr_gr_cog/oc.m2.d5:ocMA.OdeW7C1H.incipit	@ltx/gr_gr_cog/he.h.m2:heHE.AntitheonProstagma.incipit
ltx/gr_gr_cog/oc.m2.d5:ocMA.OdeW7C1H.melody	@ltx/gr_gr_cog/he.h.m2:heHE.AntitheonProstagma.melody
ltx/gr_gr_cog/oc.m2.d5:ocMA.OdeW7C1H.mode	@ltx/gr_gr_cog/miscellanea:misc.Mode2
ltx/gr_gr_cog/oc.m2.d5:ocMA.OdeW7C1H.ode	@ltx/gr_gr_cog/miscellanea:misc.Ode7
ltx/gr_gr_cog/oc.m2.d5:ocMA.OdeW7C1H.text	@ltx/gr_gr_cog/he.h.m2:heHE.AntitheonProstagma.text
ltx/gr_gr_cog/oc.m2.d5:ocMA.OdeW7C1T.incipit	Τὸ πῦρ τῆς Θεότητος οὐ…
ltx/gr_gr_cog/oc.m2.d5:ocMA.OdeW7C1T.melody	@ltx/gr_gr_cog/he.h.m2:heHE.AntitheonProstagma.name
ltx/gr_gr_cog/oc.m2.d5:ocMA.OdeW7C1T.mode	@ltx/gr_gr_cog/miscellanea:misc.Mode2
ltx/gr_gr_cog/oc.m2.d5:ocMA.OdeW7C1T.ode	@ltx/gr_gr_cog/miscellanea:misc.Ode7
ltx/gr_gr_cog/oc.m2.d5:ocMA.OdeW7C1T.text	Τὸ πῦρ τῆς Θεότητος οὐ κατεφλέχθης, ἀῤῥήτως κυήσασα, Παρθένε ἀπειρόγαμε· διὸ καθικέτευε σὺν Ἀποστόλοις ἁγνή, διαιωνιζούσης με φλογός, ἐλευθερῶσαι τὸν σὲ δοξάζοντα.
ltx/gr_gr_cog/oc.m2.d5:ocMA.OdeW7C21.greekmelody	@ltx/gr_gr_cog/he.h.m2:heHE.EikonosChrysis.greekname
ltx/gr_gr_cog/oc.m2.d5:ocMA.OdeW7C21.incipit	Ξυρῷ πειρασμῷ περιπέπτωκα δεινῶς κατακεντούμενος…
ltx/gr_gr_cog/oc.m2.d5:ocMA.OdeW7C21.melody	@ltx/gr_gr_cog/he.h.m2:heHE.EikonosChrysis.name
ltx/gr_gr_cog/oc.m2.d5:ocMA.OdeW7C21.mode	@ltx/gr_gr_cog/miscellanea:misc.Mode2
ltx/gr_gr_cog/oc.m2.d5:ocMA.OdeW7C21.ode	@ltx/gr_gr_cog/miscellanea:misc.Ode7
ltx/gr_gr_cog/oc.m2.d5:ocMA.OdeW7C21.text	Ξυρῷ πειρασμῷ περιπέπτωκα δεινῶς κατακεντούμενος, καὶ πύλαις ᾅδου προσεπέλασα, ταῖς ἀθυμίαις βαλλόμενος, σῶσόν με πρεσβείαις σου μάκαρ, καὶ ἀνάστησον ψάλλειν σοι· Σὲ μακαρίζω ἱερέ, Χριστοῦ θεράπον ἀεί.
ltx/gr_gr_cog/oc.m2.d5:ocMA.OdeW7C22.incipit	Ἀδύτου φωτός, ταῖς ἀΰλοις ἀστραπαῖς…
ltx/gr_gr_cog/oc.m2.d5:ocMA.OdeW7C22.melody	@ltx/gr_gr_cog/he.h.m2:heHE.EikonosChrysis.name
ltx/gr_gr_cog/oc.m2.d5:ocMA.OdeW7C22.mode	@ltx/gr_gr_cog/miscellanea:misc.Mode2
ltx/gr_gr_cog/oc.m2.d5:ocMA.OdeW7C22.ode	@ltx/gr_gr_cog/miscellanea:misc.Ode7
ltx/gr_gr_cog/oc.m2.d5:ocMA.OdeW7C22.text	Ἀδύτου φωτός, ταῖς ἀΰλοις ἀστραπαῖς περιλαμπόμενος, τοὺς ἐν τῷ σκότει τῷ τῶν θλίψεων, κεκρατημένους ἐξάρπασον, καὶ πρὸς φωτισμὸν εὐσεβείας, καθοδήγησον ψάλλοντας· Σὲ μακαρίζομεν ἀεί, θεράπον ὄντως Χριστοῦ.
ltx/gr_gr_cog/oc.m2.d5:ocMA.OdeW7C2T.incipit	Δυσώπει Χριστόν, τὸν Υἱόν σου…
ltx/gr_gr_cog/oc.m2.d5:ocMA.OdeW7C2T.melody	@ltx/gr_gr_cog/he.h.m2:heHE.EikonosChrysis.name
ltx/gr_gr_cog/oc.m2.d5:ocMA.OdeW7C2T.mode	@ltx/gr_gr_cog/miscellanea:misc.Mode2
ltx/gr_gr_cog/oc.m2.d5:ocMA.OdeW7C2T.ode	@ltx/gr_gr_cog/miscellanea:misc.Ode7
ltx/gr_gr_cog/oc.m2.d5:ocMA.OdeW7C2T.text	Δυσώπει Χριστόν, τὸν Υἱόν σου καὶ Θεὸν θεογεννήτρια, τοὺς πεπραμένους δεινοῖς πταίσμασι, καὶ ταῖς ἀπάταις τοῦ ὄφεως, αἵματι αὐτοῦ, τῷ τιμίῳ, ἀναῤῥύσασθαι ψάλλοντας· Εὐλογητὸς εἶ ὁ Θεός, ὁ τῶν Πατέρων ἡμῶν.
ltx/gr_gr_cog/oc.m2.d5:ocMA.OdeW8C11.incipit	Σωματοειδῶς, ὑμῖν ἐπιφοιτῆσαν, πυρὸς ἐν…
ltx/gr_gr_cog/oc.m2.d5:ocMA.OdeW8C11.melody	@ltx/gr_gr_cog/he.h.m2:heHE.KaminosPote.name
ltx/gr_gr_cog/oc.m2.d5:ocMA.OdeW8C11.mode	@ltx/gr_gr_cog/miscellanea:misc.Mode2
ltx/gr_gr_cog/oc.m2.d5:ocMA.OdeW8C11.ode	@ltx/gr_gr_cog/miscellanea:misc.Ode8
ltx/gr_gr_cog/oc.m2.d5:ocMA.OdeW8C11.text	Σωματοειδῶς, ὑμῖν ἐπιφοιτῆσαν, πυρὸς ἐν εἴδει Παράκλητον, Πνεῦμα ἀπειργάσατο, ὡς λαμπάδας φλογιζούσας μὲν ἀθέους, φωτιζούσας δέ, πάντας τοὺς εὐσεβοῦντας, θεῖοι τοῦ λόγου Ἀπόστολοι.
ltx/gr_gr_cog/oc.m2.d5:ocMA.OdeW8C12.incipit	Πάθει τὰ δεινῶς, χειμάζοντα Οἰκτίρμον…
ltx/gr_gr_cog/oc.m2.d5:ocMA.OdeW8C12.melody	@ltx/gr_gr_cog/he.h.m2:heHE.KaminosPote.name
ltx/gr_gr_cog/oc.m2.d5:ocMA.OdeW8C12.mode	@ltx/gr_gr_cog/miscellanea:misc.Mode2
ltx/gr_gr_cog/oc.m2.d5:ocMA.OdeW8C12.ode	@ltx/gr_gr_cog/miscellanea:misc.Ode8
ltx/gr_gr_cog/oc.m2.d5:ocMA.OdeW8C12.text	Πάθει τὰ δεινῶς, χειμάζοντα Οἰκτίρμον, τὴν ἀδιόρθωτον καρδίαν μου, θεράπευσον δέομαι, τὴν ψυχήν μου φωταγώγησον, τὸν νοῦν μου καθοδήγησον, ῥέποντα εἰς κακίαν, τῶν Μαθητῶν σου δεήσεσιν.
ltx/gr_gr_cog/oc.m2.d5:ocMA.OdeW8C13.incipit	Στέναξον ψυχή, καὶ δάκρυσον συντόνως…
ltx/gr_gr_cog/oc.m2.d5:ocMA.OdeW8C13.melody	@ltx/gr_gr_cog/he.h.m2:heHE.KaminosPote.name
ltx/gr_gr_cog/oc.m2.d5:ocMA.OdeW8C13.mode	@ltx/gr_gr_cog/miscellanea:misc.Mode2
ltx/gr_gr_cog/oc.m2.d5:ocMA.OdeW8C13.ode	@ltx/gr_gr_cog/miscellanea:misc.Ode8
ltx/gr_gr_cog/oc.m2.d5:ocMA.OdeW8C13.text	Στέναξον ψυχή, καὶ δάκρυσον συντόνως, καὶ σεαυτὴν πρὸ τέλους πένθησον, πρὸ τοῦ καταλάβῃ σε, ὁ κλαυθμὸς ὁ ἀπαράκλητος, καὶ βόησον τῷ Κτίστη σου· Δέσποτα οἴκτειρόν με, τῶν Ἀποστόλων δεήσεσιν.
ltx/gr_gr_cog/oc.m2.d5:ocMA.OdeW8C1H.greekmelody	@ltx/gr_gr_cog/he.h.m2:heHE.KaminosPote.greekname
ltx/gr_gr_cog/oc.m2.d5:ocMA.OdeW8C1H.incipit	@ltx/gr_gr_cog/he.h.m2:heHE.KaminosPote.incipit
ltx/gr_gr_cog/oc.m2.d5:ocMA.OdeW8C1H.melody	@ltx/gr_gr_cog/he.h.m2:heHE.KaminosPote.melody
ltx/gr_gr_cog/oc.m2.d5:ocMA.OdeW8C1H.mode	@ltx/gr_gr_cog/miscellanea:misc.Mode2
ltx/gr_gr_cog/oc.m2.d5:ocMA.OdeW8C1H.ode	@ltx/gr_gr_cog/miscellanea:misc.Ode8
ltx/gr_gr_cog/oc.m2.d5:ocMA.OdeW8C1H.text	@ltx/gr_gr_cog/he.h.m2:heHE.KaminosPote.text
ltx/gr_gr_cog/oc.m2.d5:ocMA.OdeW8C1T.incipit	Κάμινος ποτέ, μὴ φλέξασα τοὺς…
ltx/gr_gr_cog/oc.m2.d5:ocMA.OdeW8C1T.melody	@ltx/gr_gr_cog/he.h.m2:heHE.KaminosPote.name
ltx/gr_gr_cog/oc.m2.d5:ocMA.OdeW8C1T.mode	@ltx/gr_gr_cog/miscellanea:misc.Mode2
ltx/gr_gr_cog/oc.m2.d5:ocMA.OdeW8C1T.ode	@ltx/gr_gr_cog/miscellanea:misc.Ode8
ltx/gr_gr_cog/oc.m2.d5:ocMA.OdeW8C1T.text	Κάμινος ποτέ, μὴ φλέξασα τοὺς Παῖδας, τὴν σὴν λοχείαν προεικόνιζε, Παρθένε Πανάχραντε· διὰ τοῦτο ἱκετεύω σε, σὺν Ἀποστόλοις πρέσβευε, ἅπασι καὶ Προφήταις, πυρὸς γεέννης ῥυσθῆναί με.
ltx/gr_gr_cog/oc.m2.d5:ocMA.OdeW8C21.greekmelody	@ltx/gr_gr_cog/he.h.m2:heHE.TonEnKaminoTouPyros.greekname
ltx/gr_gr_cog/oc.m2.d5:ocMA.OdeW8C21.incipit	Ὡς εὐμενὴς καὶ συμπαθής, τοὺς…
ltx/gr_gr_cog/oc.m2.d5:ocMA.OdeW8C21.melody	@ltx/gr_gr_cog/he.h.m2:heHE.TonEnKaminoTouPyros.name
ltx/gr_gr_cog/oc.m2.d5:ocMA.OdeW8C21.mode	@ltx/gr_gr_cog/miscellanea:misc.Mode2
ltx/gr_gr_cog/oc.m2.d5:ocMA.OdeW8C21.ode	@ltx/gr_gr_cog/miscellanea:misc.Ode8
ltx/gr_gr_cog/oc.m2.d5:ocMA.OdeW8C21.text	Ὡς εὐμενὴς καὶ συμπαθής, τοὺς ἐν βάθει πειρασμῶν περισχεθέντας, ἐλευθέρωσον μάκαρ, τῶν κατεχόντων δεινῶν, τὴν λύσιν βραβεύων πρεσβείαις σου, ταῖς πρὸς τὸν Σωτῆρα, Χριστὸν ἱερομύστα.
ltx/gr_gr_cog/oc.m2.d5:ocMA.OdeW8C22.incipit	Μυσταγωγὸς τῶν ὑπὲρ νοῦν, τῶν…
ltx/gr_gr_cog/oc.m2.d5:ocMA.OdeW8C22.melody	@ltx/gr_gr_cog/he.h.m2:heHE.TonEnKaminoTouPyros.name
ltx/gr_gr_cog/oc.m2.d5:ocMA.OdeW8C22.mode	@ltx/gr_gr_cog/miscellanea:misc.Mode2
ltx/gr_gr_cog/oc.m2.d5:ocMA.OdeW8C22.ode	@ltx/gr_gr_cog/miscellanea:misc.Ode8
ltx/gr_gr_cog/oc.m2.d5:ocMA.OdeW8C22.text	Μυσταγωγὸς τῶν ὑπὲρ νοῦν, τῶν ἀΰλων λειτουργὸς καὶ οὐρανίων, χρηματίζων θεόφρον, Ἀρχιερεύς τε πιστός, πταισμάτων τὴν ἄφεσιν αἴτησαι, παρὰ τοῦ Σωτῆρος ἡμῶν ἱερομύστα.
ltx/gr_gr_cog/oc.m2.d5:ocMA.OdeW8C2T.incipit	Ἐξασθενεῖ μου νῦν ὁ νοῦς…
ltx/gr_gr_cog/oc.m2.d5:ocMA.OdeW8C2T.melody	@ltx/gr_gr_cog/he.h.m2:heHE.TonEnKaminoTouPyros.name
ltx/gr_gr_cog/oc.m2.d5:ocMA.OdeW8C2T.mode	@ltx/gr_gr_cog/miscellanea:misc.Mode2
ltx/gr_gr_cog/oc.m2.d5:ocMA.OdeW8C2T.ode	@ltx/gr_gr_cog/miscellanea:misc.Ode8
ltx/gr_gr_cog/oc.m2.d5:ocMA.OdeW8C2T.text	Ἐξασθενεῖ μου νῦν ὁ νοῦς, εἰς τὰ βάθη ἐμπεσὼν τῆς ἀτιμίας, ὡς ἐντεῦθεν ποικίλοις περιπαρῆναι κακοῖς, ἀλλὰ σὺ Παρθένε θεράπευσον, τῷ τῆς ἀπαθείας φωτὶ περιβαλοῦσα.
ltx/gr_gr_cog/oc.m2.d5:ocMA.OdeW9C11.incipit	Ἐμὲ τὸν κατάκριτον, ἐμὲ τὸν…
ltx/gr_gr_cog/oc.m2.d5:ocMA.OdeW9C11.melody	@ltx/gr_gr_cog/he.h.m2:heHE.AnarchouGennitoros.name
ltx/gr_gr_cog/oc.m2.d5:ocMA.OdeW9C11.mode	@ltx/gr_gr_cog/miscellanea:misc.Mode2
ltx/gr_gr_cog/oc.m2.d5:ocMA.OdeW9C11.ode	@ltx/gr_gr_cog/miscellanea:misc.Ode9
ltx/gr_gr_cog/oc.m2.d5:ocMA.OdeW9C11.text	Ἐμὲ τὸν κατάκριτον, ἐμὲ τὸν ἀδιόρθωτον, τὸν τῶν σῶν προσταγμάτων καταφρονήσαντα, καὶ ταῖς τῶν δαιμόνων ἀπάταις, φρενοβλαβῶς ἐξακολουθοῦντα, ἐπίστρεψον Κύριε, προσευχαῖς τῶν Ἀποστόλων σου.
ltx/gr_gr_cog/oc.m2.d5:ocMA.OdeW9C12.incipit	Ἀπόστολοι ἔνδοξοι, Ἀπόστολοι μακάριοι, μαθηταὶ…
ltx/gr_gr_cog/oc.m2.d5:ocMA.OdeW9C12.melody	@ltx/gr_gr_cog/he.h.m2:heHE.AnarchouGennitoros.name
ltx/gr_gr_cog/oc.m2.d5:ocMA.OdeW9C12.mode	@ltx/gr_gr_cog/miscellanea:misc.Mode2
ltx/gr_gr_cog/oc.m2.d5:ocMA.OdeW9C12.ode	@ltx/gr_gr_cog/miscellanea:misc.Ode9
ltx/gr_gr_cog/oc.m2.d5:ocMA.OdeW9C12.text	Ἀπόστολοι ἔνδοξοι, Ἀπόστολοι μακάριοι, μαθηταὶ τοῦ Σωτῆρος, κήρυκες πάνσοφοι, πάσης με λυτρώσασθε βλάβης, πάσης ὀργῆς, πάσης ἁμαρτίας, πάσης περιστάσεως, καὶ ποικίλης παραβάσεως.
ltx/gr_gr_cog/oc.m2.d5:ocMA.OdeW9C13.incipit	Ψυχὴν ἀδιόρθωτον, προσφέρων καὶ συνείδησιν…
ltx/gr_gr_cog/oc.m2.d5:ocMA.OdeW9C13.melody	@ltx/gr_gr_cog/he.h.m2:heHE.AnarchouGennitoros.name
ltx/gr_gr_cog/oc.m2.d5:ocMA.OdeW9C13.mode	@ltx/gr_gr_cog/miscellanea:misc.Mode2
ltx/gr_gr_cog/oc.m2.d5:ocMA.OdeW9C13.ode	@ltx/gr_gr_cog/miscellanea:misc.Ode9
ltx/gr_gr_cog/oc.m2.d5:ocMA.OdeW9C13.text	Ψυχὴν ἀδιόρθωτον, προσφέρων καὶ συνείδησιν, συγχωσθεῖσαν τῇ ὕλῃ τῶν παραπτώσεων, καὶ μεμολυσμένην καρδίαν, καὶ λογισμὸν κατεσπιλωμένον, βοῶ σοι φιλάνθρωπε· Οἴκτειρόν με τῷ ἐλέει σου.
ltx/gr_gr_cog/oc.m2.d5:ocMA.OdeW9C1H.greekmelody	@ltx/gr_gr_cog/he.h.m2:heHE.AnarchouGennitoros.greekname
ltx/gr_gr_cog/oc.m2.d5:ocMA.OdeW9C1H.incipit	@ltx/gr_gr_cog/he.h.m2:heHE.AnarchouGennitoros.incipit
ltx/gr_gr_cog/oc.m2.d5:ocMA.OdeW9C1H.melody	@ltx/gr_gr_cog/he.h.m2:heHE.AnarchouGennitoros.melody
ltx/gr_gr_cog/oc.m2.d5:ocMA.OdeW9C1H.mode	@ltx/gr_gr_cog/miscellanea:misc.Mode2
ltx/gr_gr_cog/oc.m2.d5:ocMA.OdeW9C1H.ode	@ltx/gr_gr_cog/miscellanea:misc.Ode9
ltx/gr_gr_cog/oc.m2.d5:ocMA.OdeW9C1H.text	@ltx/gr_gr_cog/he.h.m2:heHE.AnarchouGennitoros.text
ltx/gr_gr_cog/oc.m2.d5:ocMA.OdeW9C1T.incipit	Ἀπόστολοι Πάναγνε, τὸν σὸν Υἱὸν…
ltx/gr_gr_cog/oc.m2.d5:ocMA.OdeW9C1T.melody	@ltx/gr_gr_cog/he.h.m2:heHE.AnarchouGennitoros.name
ltx/gr_gr_cog/oc.m2.d5:ocMA.OdeW9C1T.mode	@ltx/gr_gr_cog/miscellanea:misc.Mode2
ltx/gr_gr_cog/oc.m2.d5:ocMA.OdeW9C1T.ode	@ltx/gr_gr_cog/miscellanea:misc.Ode9
ltx/gr_gr_cog/oc.m2.d5:ocMA.OdeW9C1T.text	Ἀπόστολοι Πάναγνε, τὸν σὸν Υἱὸν ἐκήρυξαν, εἰς τὸν σύμπαντα κόσμον, Θεὸν καὶ ἄνθρωπον· ὅθεν σὺν αὐτοῖς ἐκδυσώπει, τῇ φοβερᾷ ἡμέρᾳ τῆς δίκης, ῥυσθῆναι κολάσεως, τοὺς πιστῶς σε μεγαλύνοντας.
ltx/gr_gr_cog/oc.m2.d5:ocMA.OdeW9C21.greekmelody	@ltx/gr_gr_cog/he.h.m2:heHE.AnarchouGennitoros.greekname
ltx/gr_gr_cog/oc.m2.d5:ocMA.OdeW9C21.incipit	Λαμπάσι τῆς χάριτος, θεόφρον φωτιζόμενος…
ltx/gr_gr_cog/oc.m2.d5:ocMA.OdeW9C21.melody	@ltx/gr_gr_cog/he.h.m2:heHE.AnarchouGennitoros.name
ltx/gr_gr_cog/oc.m2.d5:ocMA.OdeW9C21.mode	@ltx/gr_gr_cog/miscellanea:misc.Mode2
ltx/gr_gr_cog/oc.m2.d5:ocMA.OdeW9C21.ode	@ltx/gr_gr_cog/miscellanea:misc.Ode9
ltx/gr_gr_cog/oc.m2.d5:ocMA.OdeW9C21.text	Λαμπάσι τῆς χάριτος, θεόφρον φωτιζόμενος, καὶ φωστὴρ εὐσεβείας σαφῶς γενόμενος, τοὺς ἐν πειρασμοῖς διασῴζεις, τοὺς ἐν βυθῷ θαλάσσης λυτροῦσαι, καὶ τρέφεις λιμώττοντας, παραδόξως παμμακάριστε.
ltx/gr_gr_cog/oc.m2.d5:ocMA.OdeW9C22.incipit	Ὡς ἐν Παραδείσῳ τῆς τρυφῆς…
ltx/gr_gr_cog/oc.m2.d5:ocMA.OdeW9C22.melody	@ltx/gr_gr_cog/he.h.m2:heHE.AnarchouGennitoros.name
ltx/gr_gr_cog/oc.m2.d5:ocMA.OdeW9C22.mode	@ltx/gr_gr_cog/miscellanea:misc.Mode2
ltx/gr_gr_cog/oc.m2.d5:ocMA.OdeW9C22.ode	@ltx/gr_gr_cog/miscellanea:misc.Ode9
ltx/gr_gr_cog/oc.m2.d5:ocMA.OdeW9C22.text	Ὡς ἐν Παραδείσῳ τῆς τρυφῆς, νῦν αὐλιζόμενος, καὶ τὴν ἄφραστον δόξαν τρανῶς θεώμενος, ἐκ τῶν οὐρανίων ἁψίδων, τοὺς ὑμνητὰς τοὺς σοὺς ἐποπτεύεις, παθῶν ἐκλυτρούμενος, θεοφόρε πανσεβάσμιε.
ltx/gr_gr_cog/oc.m2.d5:ocMA.OdeW9C2T.incipit	Σοφίαν καὶ δύναμιν, καὶ Λόγον…
ltx/gr_gr_cog/oc.m2.d5:ocMA.OdeW9C2T.melody	@ltx/gr_gr_cog/he.h.m2:heHE.AnarchouGennitoros.name
ltx/gr_gr_cog/oc.m2.d5:ocMA.OdeW9C2T.mode	@ltx/gr_gr_cog/miscellanea:misc.Mode2
ltx/gr_gr_cog/oc.m2.d5:ocMA.OdeW9C2T.ode	@ltx/gr_gr_cog/miscellanea:misc.Ode9
ltx/gr_gr_cog/oc.m2.d5:ocMA.OdeW9C2T.text	Σοφίαν καὶ δύναμιν, καὶ Λόγον ἐνυπόστατον, τοῦ Πατρὸς Θεομῆτορ ἁγνὴ συνέλαβες, ἐκ τῶν σῶν ἀχράντων αἱμάτων, τὸν ἑαυτῆς ναὸν προσλαβοῦσαν, καὶ τούτῳ καθʼ ἕνωσιν, ἑνωθεῖσαν ἀδιάῤῥηκτον.
ltx/gr_gr_cog/oc.m2.d5:ocVE.ApolTheotokionVM.incipit	@ltx/gr_gr_cog/oc.m2.d5:ocMA.Kathisma13.incipit
ltx/gr_gr_cog/oc.m2.d5:ocVE.ApolTheotokionVM.melody	
ltx/gr_gr_cog/oc.m2.d5:ocVE.ApolTheotokionVM.mode	@ltx/gr_gr_cog/miscellanea:misc.Mode2
ltx/gr_gr_cog/oc.m2.d5:ocVE.ApolTheotokionVM.text	@ltx/gr_gr_cog/oc.m2.d5:ocMA.Kathisma13.text
ltx/gr_gr_cog/oc.m2.d5:ocVE.AposTheotokion.greekmelody	@ltx/gr_gr_cog/he.a.m2:heAU.OteEkTouXylou.greekname
ltx/gr_gr_cog/oc.m2.d5:ocVE.AposTheotokion.incipit	Πάντων προστατεύεις Ἀγαθή, τῶν καταφευγόντων…
ltx/gr_gr_cog/oc.m2.d5:ocVE.AposTheotokion.melody	@ltx/gr_gr_cog/he.a.m2:heAU.OteEkTouXylou.name
ltx/gr_gr_cog/oc.m2.d5:ocVE.AposTheotokion.mode	@ltx/gr_gr_cog/miscellanea:misc.Mode2
ltx/gr_gr_cog/oc.m2.d5:ocVE.AposTheotokion.text	Πάντων προστατεύεις Ἀγαθή, τῶν καταφευγόντων ἐν πίστει, τῇ κραταιᾷ σου χειρί· ἄλλην γὰρ οὐκ ἔχομεν, ἁμαρτωλοὶ πρὸς Θεόν, ἐν κινδύνοις καὶ θλίψεσιν, ἀεὶ μεσιτείαν, οἱ κατακαμπτόμενοι, ὑπὸ πταισμάτων πολλῶν. Μῆτερ τοῦ Θεοῦ τοῦ Ὑψίστου· ὅθεν σοι προσπίπτομεν ῥῦσαι, πάσης περιστάσεως τοὺς δούλους σου.
ltx/gr_gr_cog/oc.m2.d5:ocVE.Aposticha1.incipit	Ἐμεγάλυνας Σωτήρ…
ltx/gr_gr_cog/oc.m2.d5:ocVE.Aposticha1.melody	
ltx/gr_gr_cog/oc.m2.d5:ocVE.Aposticha1.mode	@ltx/gr_gr_cog/miscellanea:misc.Mode2
ltx/gr_gr_cog/oc.m2.d5:ocVE.Aposticha1.text	Ἐμεγάλυνας Σωτήρ, ἐν τῇ οἰκουμένῃ τῶν Κορυφαίων Ἀποστόλων τὰ ὀνόματα, ἔμαθον τῶν οὐρανῶν τὰ ἄῤῥητα, ἔδωκαν τοῖς ἐπὶ γῆς ἰάματα, καὶ αἱ σκιαὶ αὐτῶν μόναι τὰ πάθη ἐθεράπευον, ὁ ἐξ ἁλιέων ἐθαυματούργει καὶ ὁ ἐξ Ἰουδαίων ἐθεολόγει, τῆς χάριτος τὰ δόγματα, διʼ ὧν Εὔσπλαγχνε, δὸς ἡμῖν τὸ μέγα σου ἔλεος.
ltx/gr_gr_cog/oc.m2.d5:ocVE.Aposticha2.incipit	Οἱ ἐξ ἀδίκων πράξεων, πάντοθεν…
ltx/gr_gr_cog/oc.m2.d5:ocVE.Aposticha2.melody	
ltx/gr_gr_cog/oc.m2.d5:ocVE.Aposticha2.mode	@ltx/gr_gr_cog/miscellanea:misc.Mode2
ltx/gr_gr_cog/oc.m2.d5:ocVE.Aposticha2.text	Οἱ ἐξ ἀδίκων πράξεων, πάντοθεν πολεμούμενοι, καὶ πρὸς σὲ καταφεύγοντες, τὸν ὄντως ὄντα Θεόν, τὴν φωνὴν τῶν σῶν Μαθητῶν, προσφέρομέν σοι, λέγοντες· Σῶσον ἡμᾶς, Ἐπιστάτα, ἀπολλύμεθα, δεῖξον καὶ νῦν τοῖς ἐχθροῖς ἡμῶν δεόμεθα, ὅτι σκέπεις λαόν, καὶ σῴζεις ἐκ κινδύνων, τῇ πρεσβείᾳ τῶν Ἀποστόλων, παρορῶν ἁμαρτίας διὰ πολλὴν ἀγαθότητα, Κύριε δόξα σοι.
ltx/gr_gr_cog/oc.m2.d5:ocVE.Aposticha3.incipit	Μεγάλη ἡ δόξα, ἣν ἐκτήσασθε…
ltx/gr_gr_cog/oc.m2.d5:ocVE.Aposticha3.melody	
ltx/gr_gr_cog/oc.m2.d5:ocVE.Aposticha3.mode	@ltx/gr_gr_cog/miscellanea:misc.Mode2
ltx/gr_gr_cog/oc.m2.d5:ocVE.Aposticha3.text	Μεγάλη ἡ δόξα, ἣν ἐκτήσασθε Ἅγιοι, διὰ τῆς πίστεως! οὐ μόνον γὰρ ἐν τῷ πάσχειν, τὸν ἐχθρὸν ἐνικήσατε, ἀλλὰ καὶ μετὰ θάνατον πνεύματα ἀπελαύνετε, ἀσθενοῦντας θεραπεύετε, ψυχῶν καὶ σωμάτων ἰατροί, πρεσβεύσατε πρὸς Κύριον, ἐλεηθῆναι τὰς ψυχὰς ἡμῶν.
ltx/gr_gr_cog/oc.m2.d5:ocVE.SticTheotokion.greekmelody	@ltx/gr_gr_cog/he.a.m2:heAU.OteEkTouXylou.greekname
ltx/gr_gr_cog/oc.m2.d5:ocVE.SticTheotokion.incipit	Πᾶσα τῆς ζωῆς ἡμῶν ἰσχύς…
ltx/gr_gr_cog/oc.m2.d5:ocVE.SticTheotokion.melody	@ltx/gr_gr_cog/he.a.m2:heAU.OteEkTouXylou.name
ltx/gr_gr_cog/oc.m2.d5:ocVE.SticTheotokion.mode	@ltx/gr_gr_cog/miscellanea:misc.Mode2
ltx/gr_gr_cog/oc.m2.d5:ocVE.SticTheotokion.text	Πᾶσα τῆς ζωῆς ἡμῶν ἰσχύς, σὺ ὑπάρχεις ἄχραντε Μῆτερ, καὶ καταφύγιον· πάντων τῶν ὑμνούντων σε, σὺ εἶ ἀντίληψις· μὴ οὖν μάτην λογίζοιντο, τὴν σὴν προστασίαν, οἱ κατακαυχώμενοι κατὰ τῶν δούλων σου· σὺ γὰρ πρὸς Θεὸν προστασία, δέδοσαι· διὸ μὴ παρίδῃς, διασῶσαι Δέσποινα τοὺς δούλους σου.
ltx/gr_gr_cog/oc.m2.d5:ocVE.Stichera1.greekmelody	@ltx/gr_gr_cog/he.a.m2:heAU.OteEkTouXylou.greekname
ltx/gr_gr_cog/oc.m2.d5:ocVE.Stichera1.incipit	Λόγου τοῦ φανέντος ἐπὶ γῆς…
ltx/gr_gr_cog/oc.m2.d5:ocVE.Stichera1.melody	@ltx/gr_gr_cog/he.a.m2:heAU.OteEkTouXylou.name
ltx/gr_gr_cog/oc.m2.d5:ocVE.Stichera1.mode	@ltx/gr_gr_cog/miscellanea:misc.Mode2
ltx/gr_gr_cog/oc.m2.d5:ocVE.Stichera1.text	Λόγου τοῦ φανέντος ἐπὶ γῆς, σάλπιγγες καθάπερ ὀφθέντες, θεῖοι Ἀπόστολοι, τούτου τὸ σωτήριον πᾶσιν ἐφάνατε, καὶ λαοὺς συνηθροίσατε, πρὸς ἔνθεον πίστιν, πλάνης ὀχυρώματα καταστρεψάμενοι· ὅθεν καὶ ἀξίως τὰ γέρα, καὶ νικητικῶς τοὺς στεφάνους, ὄντως ἐκομίσασθε μακάριοι.
ltx/gr_gr_cog/oc.m2.d5:ocVE.Stichera2.incipit	Δῆμοι τῶν Ἀγγέλων ἀληθῶς…
ltx/gr_gr_cog/oc.m2.d5:ocVE.Stichera2.melody	@ltx/gr_gr_cog/he.a.m2:heAU.OteEkTouXylou.name
ltx/gr_gr_cog/oc.m2.d5:ocVE.Stichera2.mode	@ltx/gr_gr_cog/miscellanea:misc.Mode2
ltx/gr_gr_cog/oc.m2.d5:ocVE.Stichera2.text	Δῆμοι τῶν Ἀγγέλων ἀληθῶς, χαίροντες ἐκρότησαν ἄνω, τοὺς ἱεροὺς Μαθητάς, βλέποντες κηρύττοντας, ἐν παῤῥησίᾳ πολλῇ, τοῦ Κυρίου τὴν σάρκωσιν, καὶ πᾶσι βοῶντας· Οὗτος ὁ Θεὸς ἡμῶν, ὁ πρὸ αἰώνων ἐστί, σάρκα προσλαβὼν ἑκουσίως, σύνθρονος Πατρὶ δὲ ὑπάρχων, καὶ τῷ θείῳ Πνεύματι ὁμότιμος.
ltx/gr_gr_cog/oc.m2.d5:ocVE.Stichera3.incipit	Πάσης οἰκουμένης ἁλιεῖς…
ltx/gr_gr_cog/oc.m2.d5:ocVE.Stichera3.melody	@ltx/gr_gr_cog/he.a.m2:heAU.OteEkTouXylou.name
ltx/gr_gr_cog/oc.m2.d5:ocVE.Stichera3.mode	@ltx/gr_gr_cog/miscellanea:misc.Mode2
ltx/gr_gr_cog/oc.m2.d5:ocVE.Stichera3.text	Πάσης οἰκουμένης ἁλιεῖς, τὴν ἠγκιστρωμένην ψυχήν μου, ταῖς μεθοδείαις ἐχθροῦ, τάχος ἐκλυτρώσασθε, καὶ ἀπογνώσει με νῦν, κινδυνεύοντα σώσατε, καρποὺς μετανοίας, φέρειν ἐνισχύοντες, θεῖοι Ἀπόστολοι, ὅπως τοῦ πυρὸς τῆς γεέννης, πεῖραν μὴ λαβὼν Βασιλείας, τῆς τῶν οὐρανῶν ἀξιωθήσωμαι.
ltx/gr_gr_cog/oc.m2.d5:ocVE.Stichera4.greekmelody	@ltx/gr_gr_cog/he.a.m2:heAU.OteEkTouXylou.greekname
ltx/gr_gr_cog/oc.m2.d5:ocVE.Stichera4.incipit	Πλήθει πειρασμῶν περισχεθείς…
ltx/gr_gr_cog/oc.m2.d5:ocVE.Stichera4.melody	@ltx/gr_gr_cog/he.a.m2:heAU.OteEkTouXylou.name
ltx/gr_gr_cog/oc.m2.d5:ocVE.Stichera4.mode	@ltx/gr_gr_cog/miscellanea:misc.Mode2
ltx/gr_gr_cog/oc.m2.d5:ocVE.Stichera4.text	Πλήθει πειρασμῶν περισχεθείς, καὶ ταῖς τρικυμίαις τοῦ βίου, περικυκλούμενος, σάλῳ τε ποντούμενος, τῶν περιστάσεων, καὶ ταῖς λύπαις βαλλόμενος, ἐν σοὶ τὴν ἐλπίδα, πᾶσαν ἀνατίθημι, Πάτερ Νικόλαε· πάντων τῶν δεινῶν μοι παράσχου, λύσιν ταῖς πρεσβείαις σου Μάκαρ, ταῖς πρὸς τὸν Δεσπότην σου ἐντεύξεσιν.
ltx/gr_gr_cog/oc.m2.d5:ocVE.Stichera5.incipit	Νέφει ἀθυμίας σκοτεινῷ…
ltx/gr_gr_cog/oc.m2.d5:ocVE.Stichera5.melody	@ltx/gr_gr_cog/he.a.m2:heAU.OteEkTouXylou.name
ltx/gr_gr_cog/oc.m2.d5:ocVE.Stichera5.mode	@ltx/gr_gr_cog/miscellanea:misc.Mode2
ltx/gr_gr_cog/oc.m2.d5:ocVE.Stichera5.text	Νέφει ἀθυμίας σκοτεινῷ, καὶ στενοχωρίας ὁμίχλῃ, νυνὶ καλύπτομαι, θλίψεως ἀλλεπάλληλοι διαταράττουσιν, ὁ δὲ φόβος κινδύνων με, δεινῶς περιέχει· δέομαί σου σῶσόν με, Θεομακάριστε· σὲ γὰρ ὀνομάζω προστάτην, καὶ σοῦ τὴν βοήθειαν Πάτερ, ἐπικαλουμένῳ μοι κατάπεμψον.
ltx/gr_gr_cog/oc.m2.d5:ocVE.Stichera6.incipit	Χάριν εἰληφὼς παρὰ Θεοῦ…
ltx/gr_gr_cog/oc.m2.d5:ocVE.Stichera6.melody	@ltx/gr_gr_cog/he.a.m2:heAU.OteEkTouXylou.name
ltx/gr_gr_cog/oc.m2.d5:ocVE.Stichera6.mode	@ltx/gr_gr_cog/miscellanea:misc.Mode2
ltx/gr_gr_cog/oc.m2.d5:ocVE.Stichera6.text	Χάριν εἰληφὼς παρὰ Θεοῦ, πᾶσι χορηγεῖς τὰς ἰάσεις, ὑπὸ τὴν σκέπην σου, ἅγιε Νικόλαε, τοῖς σοὶ προστρέχουσι· φυγαδεύσεις δαιμόνων γάρ, ἀνίατα πάθη, πάντας θεραπεύεις δέ, τῇ προστασίᾳ σου· ὅθεν καὶ ἡμεῖς δυσωποῦμεν, πρέσβευε πρὸς Κύριον πάσης, λυτρωθῆναι βλάβης τοὺς ὑμνοῦντάς σε.
ltx/gr_gr_cog/oc.m2.d5:octrMA.Kathisma11.incipit	@ltx/gr_gr_cog/oc.m2.d5:ocMA.Kathisma11.incipit
ltx/gr_gr_cog/oc.m2.d5:octrMA.Kathisma11.melody	
ltx/gr_gr_cog/oc.m2.d5:octrMA.Kathisma11.mode	@ltx/gr_gr_cog/miscellanea:misc.Mode2
ltx/gr_gr_cog/oc.m2.d5:octrMA.Kathisma11.text	@ltx/gr_gr_cog/oc.m2.d5:ocMA.Kathisma11.text
ltx/gr_gr_cog/oc.m2.d5:octrMA.Kathisma12.incipit	@ltx/gr_gr_cog/oc.m2.d5:ocMA.Kathisma12.incipit
ltx/gr_gr_cog/oc.m2.d5:octrMA.Kathisma12.melody	
ltx/gr_gr_cog/oc.m2.d5:octrMA.Kathisma12.mode	@ltx/gr_gr_cog/miscellanea:misc.Mode2
ltx/gr_gr_cog/oc.m2.d5:octrMA.Kathisma12.text	@ltx/gr_gr_cog/oc.m2.d5:ocMA.Kathisma12.text
ltx/gr_gr_cog/oc.m2.d5:octrMA.Kathisma1T.incipit	@ltx/gr_gr_cog/oc.m2.d2:ocMA.Kathisma23.incipit
ltx/gr_gr_cog/oc.m2.d5:octrMA.Kathisma1T.melody	
ltx/gr_gr_cog/oc.m2.d5:octrMA.Kathisma1T.mode	@ltx/gr_gr_cog/miscellanea:misc.Mode2
ltx/gr_gr_cog/oc.m2.d5:octrMA.Kathisma1T.text	@ltx/gr_gr_cog/oc.m2.d2:ocMA.Kathisma23.text
ltx/gr_gr_cog/oc.m2.d5:octrMA.Ode7Martyricon.incipit	@ltx/gr_gr_cog/oc.m2.d5:ocMA.Kathisma32.incipit
ltx/gr_gr_cog/oc.m2.d5:octrMA.Ode7Martyricon.melody	
ltx/gr_gr_cog/oc.m2.d5:octrMA.Ode7Martyricon.mode	@ltx/gr_gr_cog/miscellanea:misc.Mode2
ltx/gr_gr_cog/oc.m2.d5:octrMA.Ode7Martyricon.text	@ltx/gr_gr_cog/oc.m2.d5:ocMA.Kathisma32.text
ltx/gr_gr_cog/oc.m2.d5:octrMA.Photogogic.incipit	@ltx/gr_gr_cog/oc.m2.d2:octrMA.Photagogic.incipit
ltx/gr_gr_cog/oc.m2.d5:octrMA.Photogogic.mode	@ltx/gr_gr_cog/miscellanea:misc.Mode2
ltx/gr_gr_cog/oc.m2.d5:octrMA.Photogogic.text	@ltx/gr_gr_cog/oc.m2.d2:octrMA.Photagogic.text
ltx/gr_gr_cog/oc.m2.d5:octrMA.Triadic1.incipit	@ltx/gr_gr_cog/oc.m2.d2:octrMA.Triadic1.incipit
ltx/gr_gr_cog/oc.m2.d5:octrMA.Triadic1.mode	@ltx/gr_gr_cog/miscellanea:misc.Mode2
ltx/gr_gr_cog/oc.m2.d5:octrMA.Triadic1.text	@ltx/gr_gr_cog/oc.m2.d2:octrMA.Triadic1.text
ltx/gr_gr_cog/oc.m2.d5:octrMA.Triadic2.incipit	@ltx/gr_gr_cog/oc.m2.d2:octrMA.Triadic2.incipit
ltx/gr_gr_cog/oc.m2.d5:octrMA.Triadic2.mode	@ltx/gr_gr_cog/miscellanea:misc.Mode2
ltx/gr_gr_cog/oc.m2.d5:octrMA.Triadic2.text	@ltx/gr_gr_cog/oc.m2.d2:octrMA.Triadic2.text
ltx/gr_gr_cog/oc.m2.d5:octrMA.Triadic3.incipit	@ltx/gr_gr_cog/oc.m2.d2:octrMA.Triadic3.incipit
ltx/gr_gr_cog/oc.m2.d5:octrMA.Triadic3.mode	@ltx/gr_gr_cog/miscellanea:misc.Mode2
ltx/gr_gr_cog/oc.m2.d5:octrMA.Triadic3.text	@ltx/gr_gr_cog/oc.m2.d2:octrMA.Triadic3.text
