ltx/gr_gr_cog/pe.d076:peDA.commemoration.full	Παρασκευὴ τῆς Διακαινησίμου - Ἀκολουθία εἰς τὴν Ζωοδόχον Πηγήν
ltx/gr_gr_cog/pe.d076:peDA.commemoration.name	Ζωοδόχος Πηγή
ltx/gr_gr_cog/pe.d076:peDA.commemoration.short	Παρασκευὴ τῆς Διακαινησίμου
ltx/gr_gr_cog/pe.d076:peDA.dismissal	@ltx/gr_gr_cog/dismissals:dis00.resurrection
ltx/gr_gr_cog/pe.d076:peDA.insert1	
ltx/gr_gr_cog/pe.d076:peDA.insert2	
ltx/gr_gr_cog/pe.d076:peDA.note	Ψάλλομεν τὴν παροῦσαν Ἀκολουθίαν, τὴν γεγονυῖαν παρὰ κυρίου Νικηφόρου Καλλίστου τοῦ Ξανθοπούλου, εἰς τὴν Ὑπεραγίαν καὶ Κυρίαν Δέσποιναν Θεοτόκον, τὴν Ζωοδόχον Πηγήν· οὐ γὰρ εὕρομεν ὑπὸ τυπικοῦ τὴν τοιαύτην Ἀκολουθίαν, ἀλλʼ ἐτέθη διʼ ἀγάπην τῆς Ὑπεραγίας Θεοτόκου.
ltx/gr_gr_cog/pe.d076:peHO.commemorations	
ltx/gr_gr_cog/pe.d076:peHO.daytitle	
ltx/gr_gr_cog/pe.d076:peHO.description1	
ltx/gr_gr_cog/pe.d076:peHO.description2	
ltx/gr_gr_cog/pe.d076:peHO.note1	
ltx/gr_gr_cog/pe.d076:peHO.note2	
ltx/gr_gr_cog/pe.d076:peLI.Megalynarion.rubric	Εἰς τὰ δίπτυχα εἴθισται νὰ ψάλλεται τὸ ἑξῆς Μεγαλυνάριον·
ltx/gr_gr_cog/pe.d076:peLI.Megalynarion.text	Ὕδωρ τὸ ζωήῤῥυτον τῆς Πηγῆς, μάννα τὸ προχέον τὸν ἀθάνατον δροσισμόν, τὸ νέκταρ τὸ θεῖον, τὴν ξένην ἀμβροσίαν, τὸ μέλι τὸ ἐκ πέτρας, πίστει τιμήσωμεν.
ltx/gr_gr_cog/pe.d076:peMA.C1.title	@ltx/gr_gr_cog/titles:ti.CanonTheotokos
ltx/gr_gr_cog/pe.d076:peMA.C1.verse	@ltx/gr_gr_cog/prayers:pr.verse_Theotokos.text
ltx/gr_gr_cog/pe.d076:peMA.Exaposteilarion1.incipit	@ltx/gr_gr_cog/he.a.m2:heAU.SarkiYpnosas.incipit
ltx/gr_gr_cog/pe.d076:peMA.Exaposteilarion1.melody	@ltx/gr_gr_cog/he.a.m2:heAU.SarkiYpnosas.melody
ltx/gr_gr_cog/pe.d076:peMA.Exaposteilarion1.mode	@ltx/gr_gr_cog/miscellanea:misc.Mode2
ltx/gr_gr_cog/pe.d076:peMA.Exaposteilarion1.text	@ltx/gr_gr_cog/he.a.m2:heAU.SarkiYpnosas.text
ltx/gr_gr_cog/pe.d076:peMA.Exaposteilarion2.greekmelody	@ltx/gr_gr_cog/he.a.m2:heAU.SarkiYpnosas.greekname
ltx/gr_gr_cog/pe.d076:peMA.Exaposteilarion2.incipit	Πηγὴ ὑπάρχεις ἀληθῶς, ὕδατος ζῶντος…
ltx/gr_gr_cog/pe.d076:peMA.Exaposteilarion2.melody	@ltx/gr_gr_cog/he.a.m2:heAU.SarkiYpnosas.name
ltx/gr_gr_cog/pe.d076:peMA.Exaposteilarion2.mode	@ltx/gr_gr_cog/miscellanea:misc.Mode2
ltx/gr_gr_cog/pe.d076:peMA.Exaposteilarion2.text	Πηγὴ ὑπάρχεις ἀληθῶς, ὕδατος ζῶντος Δέσποινα· ἐκπλύνεις οὖν νοσήματα, ψυχῶν σωμάτων χαλεπά, ἐν τῇ προσψαύσει μόνη σου ὕδωρ τῆς σωτηρίας, Χριστὸν ἡ προχέουσα.
ltx/gr_gr_cog/pe.d076:peMA.Kontakion1.incipit	Ἐξ ἀκενώτου σου Πηγῆς θεοχαρίτωτε…
ltx/gr_gr_cog/pe.d076:peMA.Kontakion1.melody	@ltx/gr_gr_cog/he.a.m8:heAU.TiYpermacho.name
ltx/gr_gr_cog/pe.d076:peMA.Kontakion1.mode	@ltx/gr_gr_cog/miscellanea:misc.Mode8
ltx/gr_gr_cog/pe.d076:peMA.Kontakion1.text	Ἐξ ἀκενώτου σου Πηγῆς θεοχαρίτωτε ἐπιβραβεύεις μοι πηγάζουσα τὰ νάματα, ἀενάως τῆς σῆς χάριτος ὑπὲρ λόγον· τὸν γὰρ Λόγον ὡς τεκοῦσαν ὑπὲρ ἔννοιαν, ἱκετεύω σε δροσίζειν με σῇ χάριτι, ἵνα κράζω σοι· Χαῖρε ὕδωρ σωτήριον.
ltx/gr_gr_cog/pe.d076:peMA.Lauds1.incipit	@ltx/gr_gr_cog/oc.m6.d1:ocMA.Lauds1.incipit
ltx/gr_gr_cog/pe.d076:peMA.Lauds1.melody	
ltx/gr_gr_cog/pe.d076:peMA.Lauds1.mode	@ltx/gr_gr_cog/miscellanea:misc.Mode6
ltx/gr_gr_cog/pe.d076:peMA.Lauds1.text	@ltx/gr_gr_cog/oc.m6.d1:ocMA.Lauds1.text
ltx/gr_gr_cog/pe.d076:peMA.Lauds2.incipit	@ltx/gr_gr_cog/oc.m6.d1:ocMA.Lauds2.incipit
ltx/gr_gr_cog/pe.d076:peMA.Lauds2.melody	
ltx/gr_gr_cog/pe.d076:peMA.Lauds2.mode	@ltx/gr_gr_cog/miscellanea:misc.Mode6
ltx/gr_gr_cog/pe.d076:peMA.Lauds2.text	@ltx/gr_gr_cog/oc.m6.d1:ocMA.Lauds2.text
ltx/gr_gr_cog/pe.d076:peMA.Lauds3.incipit	@ltx/gr_gr_cog/oc.m6.d1:ocMA.Lauds3.incipit
ltx/gr_gr_cog/pe.d076:peMA.Lauds3.melody	
ltx/gr_gr_cog/pe.d076:peMA.Lauds3.mode	@ltx/gr_gr_cog/miscellanea:misc.Mode6
ltx/gr_gr_cog/pe.d076:peMA.Lauds3.text	@ltx/gr_gr_cog/oc.m6.d1:ocMA.Lauds3.text
ltx/gr_gr_cog/pe.d076:peMA.Lauds4.incipit	@ltx/gr_gr_cog/oc.m6.d1:ocMA.Lauds4.incipit
ltx/gr_gr_cog/pe.d076:peMA.Lauds4.melody	@ltx/gr_gr_cog/miscellanea:misc.Automelon
ltx/gr_gr_cog/pe.d076:peMA.Lauds4.mode	@ltx/gr_gr_cog/miscellanea:misc.Mode6
ltx/gr_gr_cog/pe.d076:peMA.Lauds4.text	@ltx/gr_gr_cog/oc.m6.d1:ocMA.Lauds4.text
ltx/gr_gr_cog/pe.d076:peMA.Lauds5.greekmelody	@ltx/gr_gr_cog/he.a.m2:heAU.OikosTouEfratha.greekname
ltx/gr_gr_cog/pe.d076:peMA.Lauds5.incipit	Ὕδωρ τὸ τῆς Πηγῆς, σωτήριον…
ltx/gr_gr_cog/pe.d076:peMA.Lauds5.melody	@ltx/gr_gr_cog/he.a.m2:heAU.OikosTouEfratha.name
ltx/gr_gr_cog/pe.d076:peMA.Lauds5.mode	@ltx/gr_gr_cog/miscellanea:misc.Mode2
ltx/gr_gr_cog/pe.d076:peMA.Lauds5.text	Ὕδωρ τὸ τῆς Πηγῆς, σωτήριον ὑπάρχει, πᾶσι τοῖς ἀσθενοῦσι· προσέλθωμεν οὖν πίστει, καὶ χάριν ἀρυσώμεθα.
ltx/gr_gr_cog/pe.d076:peMA.Lauds6.greekmelody	@ltx/gr_gr_cog/he.a.m2:heAU.OikosTouEfratha.greekname
ltx/gr_gr_cog/pe.d076:peMA.Lauds6.incipit	Φρέαρ τὸ ζωηρόν, Πηγῆς τῆς…
ltx/gr_gr_cog/pe.d076:peMA.Lauds6.melody	@ltx/gr_gr_cog/he.a.m2:heAU.OikosTouEfratha.name
ltx/gr_gr_cog/pe.d076:peMA.Lauds6.mode	@ltx/gr_gr_cog/miscellanea:misc.Mode2
ltx/gr_gr_cog/pe.d076:peMA.Lauds6.text	Φρέαρ τὸ ζωηρόν, Πηγῆς τῆς ἀθανάτου τοῖς προσιοῦσι πόθῳ, ἰάσεων παρέχει, πλημμυραν ἀνεξάντλητον.
ltx/gr_gr_cog/pe.d076:peMA.Lauds7.incipit	Ῥώννυσι τὰς ψυχάς, τὸ ὕδωρ…
ltx/gr_gr_cog/pe.d076:peMA.Lauds7.melody	@ltx/gr_gr_cog/he.a.m2:heAU.OikosTouEfratha.name
ltx/gr_gr_cog/pe.d076:peMA.Lauds7.mode	@ltx/gr_gr_cog/miscellanea:misc.Mode2
ltx/gr_gr_cog/pe.d076:peMA.Lauds7.text	Ῥώννυσι τὰς ψυχάς, τὸ ὕδωρ τῆς Παρθένου, οἱ τῶν παθῶν ἐν ῥύποις, προσδράμωμεν τῇ Κόρῃ, καὶ τούτους ἀποπλύνωμεν.
ltx/gr_gr_cog/pe.d076:peMA.Lauds8.incipit	Στάμνος ἡ ἱερά, τὸ μάννα…
ltx/gr_gr_cog/pe.d076:peMA.Lauds8.melody	@ltx/gr_gr_cog/he.a.m2:heAU.OikosTouEfratha.name
ltx/gr_gr_cog/pe.d076:peMA.Lauds8.mode	@ltx/gr_gr_cog/miscellanea:misc.Mode2
ltx/gr_gr_cog/pe.d076:peMA.Lauds8.text	Στάμνος ἡ ἱερά, τὸ μάννα νῦν ἀφθόνως, Πηγῆς ἐξ ἀενάου, προχέει τοῖς αἰτοῦσι, τὴν χρείαν πᾶς ἀντλήσωμεν.
ltx/gr_gr_cog/pe.d076:peMA.MM.Lauds1234as1234.text	@ltx/gr_gr_cog/properties:media.key
ltx/gr_gr_cog/pe.d076:peMA.MM.Lauds12as12.text	@ltx/gr_gr_cog/properties:media.key
ltx/gr_gr_cog/pe.d076:peMA.MM.Lauds5678as5678.text	@ltx/gr_gr_cog/properties:media.key
ltx/gr_gr_cog/pe.d076:peMA.Ode1C11.greekmelody	@ltx/gr_gr_cog/he.h.m1:heHE.AnastaseosImera.greekname
ltx/gr_gr_cog/pe.d076:peMA.Ode1C11.incipit	Νῦν πηγάσαις μοι Παρθένε, Θεοτόκε…
ltx/gr_gr_cog/pe.d076:peMA.Ode1C11.melody	@ltx/gr_gr_cog/he.h.m1:heHE.AnastaseosImera.name
ltx/gr_gr_cog/pe.d076:peMA.Ode1C11.mode	@ltx/gr_gr_cog/miscellanea:misc.Mode1
ltx/gr_gr_cog/pe.d076:peMA.Ode1C11.ode	@ltx/gr_gr_cog/miscellanea:misc.Ode1
ltx/gr_gr_cog/pe.d076:peMA.Ode1C11.text	Νῦν πηγάσαις μοι Παρθένε, Θεοτόκε Πηγή, χάριν διδοῦσα λόγου, ὡς ἀνυμνήσω σου πηγήν, τὴν βλυστάνουσαν ζωήν, καὶ χάριν πιστοῖς· σὺ γὰρ ἐνυπόστατον Λόγον ἐπήγασας.
ltx/gr_gr_cog/pe.d076:peMA.Ode1C12.incipit	Ἰατρεῖον ὑπὲρ φύσιν, ὁ ναός…
ltx/gr_gr_cog/pe.d076:peMA.Ode1C12.melody	@ltx/gr_gr_cog/he.h.m1:heHE.AnastaseosImera.name
ltx/gr_gr_cog/pe.d076:peMA.Ode1C12.mode	@ltx/gr_gr_cog/miscellanea:misc.Mode1
ltx/gr_gr_cog/pe.d076:peMA.Ode1C12.ode	@ltx/gr_gr_cog/miscellanea:misc.Ode1
ltx/gr_gr_cog/pe.d076:peMA.Ode1C12.text	Ἰατρεῖον ὑπὲρ φύσιν, ὁ ναός σου σεμνή, δείκνυται πᾶσι Κόρη· ἐκ γὰρ θανάτου προφανοῦς τοὺς προστρέχοντας πιστούς, σαφῶς ἀνιστᾷ, καὶ πᾶσι τὴν ἄφθονον, ἀναβλύζει γλυκύτητα.
ltx/gr_gr_cog/pe.d076:peMA.Ode1C13.incipit	Καταῤῥέεις οὐρανόθεν ἀκενώτως ἡμῖν, χάριτας…
ltx/gr_gr_cog/pe.d076:peMA.Ode1C13.melody	@ltx/gr_gr_cog/he.h.m1:heHE.AnastaseosImera.name
ltx/gr_gr_cog/pe.d076:peMA.Ode1C13.mode	@ltx/gr_gr_cog/miscellanea:misc.Mode1
ltx/gr_gr_cog/pe.d076:peMA.Ode1C13.ode	@ltx/gr_gr_cog/miscellanea:misc.Ode1
ltx/gr_gr_cog/pe.d076:peMA.Ode1C13.text	Καταῤῥέεις οὐρανόθεν ἀκενώτως ἡμῖν, χάριτας ὄντως μόνη· τὸν γὰρ τυφλώττοντα ποιεῖς, ἀναβλέπειν πρὸς τὸ φῶς, βορβόρῳ καινῷ, φωνήσασα ἄνωθεν, ὑπὲρ ἔννοιαν τῷ Λέοντι.
ltx/gr_gr_cog/pe.d076:peMA.Ode1C14.incipit	Ἡ κοινὴ φιλοτιμία, τοῦ βροτείου…
ltx/gr_gr_cog/pe.d076:peMA.Ode1C14.melody	@ltx/gr_gr_cog/he.h.m1:heHE.AnastaseosImera.name
ltx/gr_gr_cog/pe.d076:peMA.Ode1C14.mode	@ltx/gr_gr_cog/miscellanea:misc.Mode1
ltx/gr_gr_cog/pe.d076:peMA.Ode1C14.ode	@ltx/gr_gr_cog/miscellanea:misc.Ode1
ltx/gr_gr_cog/pe.d076:peMA.Ode1C14.text	Ἡ κοινὴ φιλοτιμία, τοῦ βροτείου σεμνή, Χαῖρε Μαρία, Χαῖρε· ὁ γὰρ τῶν ὅλων ποιητής, ἐπὶ σοὶ ὥς περ σταγών, κατέβη σαφῶς, Πηγήν σε ἀθάνατον, ἀναδείξας Θεόνυμφε.
ltx/gr_gr_cog/pe.d076:peMA.Ode3C11.greekmelody	@ltx/gr_gr_cog/he.h.m1:heHE.DeftePomaPiomen.greekname
ltx/gr_gr_cog/pe.d076:peMA.Ode3C11.incipit	Φωτεινόν σε ἅγιον ναόν, τοῦ…
ltx/gr_gr_cog/pe.d076:peMA.Ode3C11.melody	@ltx/gr_gr_cog/he.h.m1:heHE.DeftePomaPiomen.name
ltx/gr_gr_cog/pe.d076:peMA.Ode3C11.mode	@ltx/gr_gr_cog/miscellanea:misc.Mode1
ltx/gr_gr_cog/pe.d076:peMA.Ode3C11.ode	@ltx/gr_gr_cog/miscellanea:misc.Ode3
ltx/gr_gr_cog/pe.d076:peMA.Ode3C11.text	Φωτεινόν σε ἅγιον ναόν, τοῦ Δεσπότου τῶν ὅλων Κόρη ἐπίσταμαι, καὶ ἀφθαρσίας πηγήν, τὸ ὕδωρ προῤῥέουσαν Χριστόν, ἐξ οὗ ποτιζόμεθα.
ltx/gr_gr_cog/pe.d076:peMA.Ode3C12.incipit	Ὅσην χάριν Δέσποινα Πηγή, Αὐτοκράτορι…
ltx/gr_gr_cog/pe.d076:peMA.Ode3C12.melody	@ltx/gr_gr_cog/he.h.m1:heHE.DeftePomaPiomen.name
ltx/gr_gr_cog/pe.d076:peMA.Ode3C12.mode	@ltx/gr_gr_cog/miscellanea:misc.Mode1
ltx/gr_gr_cog/pe.d076:peMA.Ode3C12.ode	@ltx/gr_gr_cog/miscellanea:misc.Ode3
ltx/gr_gr_cog/pe.d076:peMA.Ode3C12.text	Ὅσην χάριν Δέσποινα Πηγή, Αὐτοκράτορι δίδως οὔρων τὴν πρόοδον ἐπεχομένην δεινῶς, τοῦ λίθου ὑπόστασιν φρικτήν, τῷ ὕδατι λύσασαν.
ltx/gr_gr_cog/pe.d076:peMA.Ode3C13.incipit	Ῥέει χάρις ἄφθονος ἐκ σοῦ…
ltx/gr_gr_cog/pe.d076:peMA.Ode3C13.melody	@ltx/gr_gr_cog/he.h.m1:heHE.DeftePomaPiomen.name
ltx/gr_gr_cog/pe.d076:peMA.Ode3C13.mode	@ltx/gr_gr_cog/miscellanea:misc.Mode1
ltx/gr_gr_cog/pe.d076:peMA.Ode3C13.ode	@ltx/gr_gr_cog/miscellanea:misc.Ode3
ltx/gr_gr_cog/pe.d076:peMA.Ode3C13.text	Ῥέει χάρις ἄφθονος ἐκ σοῦ, Θεοτόκε Παρθένε χύδην πηγάζουσα· χωλοὶ σκιρτῶσιν ἐν σοί, λεπρῶν καθαρίζεται πληθύς, καὶ Δαίμονες πνίγονται.
ltx/gr_gr_cog/pe.d076:peMA.Ode3C14.incipit	Ὅλοις νέμεις ἴασιν πιστοῖς, βασιλεῦσι…
ltx/gr_gr_cog/pe.d076:peMA.Ode3C14.melody	@ltx/gr_gr_cog/he.h.m1:heHE.DeftePomaPiomen.name
ltx/gr_gr_cog/pe.d076:peMA.Ode3C14.mode	@ltx/gr_gr_cog/miscellanea:misc.Mode1
ltx/gr_gr_cog/pe.d076:peMA.Ode3C14.ode	@ltx/gr_gr_cog/miscellanea:misc.Ode3
ltx/gr_gr_cog/pe.d076:peMA.Ode3C14.text	Ὅλοις νέμεις ἴασιν πιστοῖς, βασιλεῦσι, δημόταις, καὶ πένησιν, ἄρχουσι, πτωχοῖς, πλουσίοις κοινῶς, τὸ ὕδωρ προχέουσα Πηγή, ἀποίκιλον φάρμακον.
ltx/gr_gr_cog/pe.d076:peMA.Ode3Kathisma1.greekmelody	@ltx/gr_gr_cog/he.a.m8:heAU.TinSofianKaiLogon.greekname
ltx/gr_gr_cog/pe.d076:peMA.Ode3Kathisma1.incipit	Τὴν ἀέναον κρήνην καὶ ζωηράν…
ltx/gr_gr_cog/pe.d076:peMA.Ode3Kathisma1.melody	@ltx/gr_gr_cog/he.a.m8:heAU.TinSofianKaiLogon.name
ltx/gr_gr_cog/pe.d076:peMA.Ode3Kathisma1.mode	@ltx/gr_gr_cog/miscellanea:misc.Mode8
ltx/gr_gr_cog/pe.d076:peMA.Ode3Kathisma1.text	Τὴν ἀέναον κρήνην καὶ ζωηράν, τὴν πηγάζουσαν ῥεῖθρα θείαν Πηγήν, συμφώνως αἰνέσωμεν, οἱ τὴν χάριν αἰτούμενοι· καθʼ ἑκάστην βρύει, καὶ γὰρ τὰ ἰάματα, ὡς ποταμῶν τὰ ῥεύματα, δεικνῦσα ἐλάχιστα. Ὅθεν κατὰ χρέος προσιόντες ἐν πόθῳ, πιστῶς ἀρυσώμεθα, ἐκ Πηγῆς ἀνεξάντλητον, ῥῶσιν ὄντως ἀθάνατον, δροσίζουσαν σαφῶς τῶν εὐσεβῶν, τὰς καρδίας, καὶ χείλεσιν ἐκβοήσωμεν. Σὺ εἶ τῶν πιστῶν τὸ παραμύθιον.
ltx/gr_gr_cog/pe.d076:peMA.Ode4C11.greekmelody	@ltx/gr_gr_cog/he.h.m1:heHE.EpiTisTheiasFylakis.greekname
ltx/gr_gr_cog/pe.d076:peMA.Ode4C11.incipit	Ὑπὲρ τὴν ψάμμον ἀληθῶς, καὶ…
ltx/gr_gr_cog/pe.d076:peMA.Ode4C11.melody	@ltx/gr_gr_cog/he.h.m1:heHE.EpiTisTheiasFylakis.name
ltx/gr_gr_cog/pe.d076:peMA.Ode4C11.mode	@ltx/gr_gr_cog/miscellanea:misc.Mode1
ltx/gr_gr_cog/pe.d076:peMA.Ode4C11.ode	@ltx/gr_gr_cog/miscellanea:misc.Ode4
ltx/gr_gr_cog/pe.d076:peMA.Ode4C11.text	Ὑπὲρ τὴν ψάμμον ἀληθῶς, καὶ τὰς σταγόνας ὑετῶν, πέφυκε Παρθένε τὰ πλήθη τῆς Πηγῆς τῶν ἔργων σου, ἀκαταπαύστως ῥέοντα, ἅπασαν ἐπὶ χθόνα πλουσίως πάντα νοσοῦντα δεινῶς, τάχος ἰώμενα.
ltx/gr_gr_cog/pe.d076:peMA.Ode4C12.incipit	Κατασχεθέντα γυναικός, ὑπὸ καρκίνου τὸν…
ltx/gr_gr_cog/pe.d076:peMA.Ode4C12.melody	@ltx/gr_gr_cog/he.h.m1:heHE.EpiTisTheiasFylakis.name
ltx/gr_gr_cog/pe.d076:peMA.Ode4C12.mode	@ltx/gr_gr_cog/miscellanea:misc.Mode1
ltx/gr_gr_cog/pe.d076:peMA.Ode4C12.ode	@ltx/gr_gr_cog/miscellanea:misc.Ode4
ltx/gr_gr_cog/pe.d076:peMA.Ode4C12.text	Κατασχεθέντα γυναικός, ὑπὸ καρκίνου τὸν μαζόν, ὕδωρ ἐπιχεῖται Παρθένε, τῆς Πηγῆς σου Δέσποινα, καὶ παραυτίκα πέπαυται, πάθη θανατηφόρα τῷ ῥείθρῳ, καὶ ὁ καρκίνος ὀρθὰ βαίνειν ἐγνώρισεν.
ltx/gr_gr_cog/pe.d076:peMA.Ode4C13.incipit	Ἀκατανόητον ἐν σοί, καὶ ὑπὲρ…
ltx/gr_gr_cog/pe.d076:peMA.Ode4C13.melody	@ltx/gr_gr_cog/he.h.m1:heHE.EpiTisTheiasFylakis.name
ltx/gr_gr_cog/pe.d076:peMA.Ode4C13.mode	@ltx/gr_gr_cog/miscellanea:misc.Mode1
ltx/gr_gr_cog/pe.d076:peMA.Ode4C13.ode	@ltx/gr_gr_cog/miscellanea:misc.Ode4
ltx/gr_gr_cog/pe.d076:peMA.Ode4C13.text	Ἀκατανόητον ἐν σοί, καὶ ὑπὲρ φύσιν τὸ πραχθέν, ἔνεστι σαφῶς Θεοτόκε· τὸ γὰρ ὕδωρ γίνεται, τὸ τῆς Πηγῆς σου ἴαμα, νόσων θανατηφόρων ἐναντίον, ὅπερ ἡ φύσις, σαφῶς οἶδεν οὐδέποτε.
ltx/gr_gr_cog/pe.d076:peMA.Ode4C14.incipit	Ἀεὶ θανατοῖ με ὁ ἐχθρός…
ltx/gr_gr_cog/pe.d076:peMA.Ode4C14.melody	@ltx/gr_gr_cog/he.h.m1:heHE.EpiTisTheiasFylakis.name
ltx/gr_gr_cog/pe.d076:peMA.Ode4C14.mode	@ltx/gr_gr_cog/miscellanea:misc.Mode1
ltx/gr_gr_cog/pe.d076:peMA.Ode4C14.ode	@ltx/gr_gr_cog/miscellanea:misc.Ode4
ltx/gr_gr_cog/pe.d076:peMA.Ode4C14.text	Ἀεὶ θανατοῖ με ὁ ἐχθρός, ταῖς ἐνηδόνοις προσβολαῖς, Δέσποινα Πηγὴ Θεοτόκε· μὴ παρίδῃς, πρόφθασον, ἡ ταχινὴ βοήθεια, τούτου δὲ τῶν παγίδων με λύτρου, ἵνα ὑμνῶ σε ἀεὶ τὴν πολυύμνητον.
ltx/gr_gr_cog/pe.d076:peMA.Ode5C11.greekmelody	@ltx/gr_gr_cog/he.h.m1:heHE.OrthrisomenOrthrouVatheos.greekname
ltx/gr_gr_cog/pe.d076:peMA.Ode5C11.incipit	Λαλούμενα Κόρη Παρθένε, τὰ τῆς…
ltx/gr_gr_cog/pe.d076:peMA.Ode5C11.melody	@ltx/gr_gr_cog/he.h.m1:heHE.OrthrisomenOrthrouVatheos.name
ltx/gr_gr_cog/pe.d076:peMA.Ode5C11.mode	@ltx/gr_gr_cog/miscellanea:misc.Mode1
ltx/gr_gr_cog/pe.d076:peMA.Ode5C11.ode	@ltx/gr_gr_cog/miscellanea:misc.Ode5
ltx/gr_gr_cog/pe.d076:peMA.Ode5C11.text	Λαλούμενα Κόρη Παρθένε, τὰ τῆς Πηγῆς σου τῷ ὄντι τεράστια, καταπλήττει τῶν βροτῶν διάνοιαν· ὑπὲρ γὰρ φύσιν πέφυκε, πάντας πιστοὺς ἁγιάζοντα.
ltx/gr_gr_cog/pe.d076:peMA.Ode5C12.incipit	Ἱστόρησε πόκος τὸ Μάννα, καὶ…
ltx/gr_gr_cog/pe.d076:peMA.Ode5C12.melody	@ltx/gr_gr_cog/he.h.m1:heHE.OrthrisomenOrthrouVatheos.name
ltx/gr_gr_cog/pe.d076:peMA.Ode5C12.mode	@ltx/gr_gr_cog/miscellanea:misc.Mode1
ltx/gr_gr_cog/pe.d076:peMA.Ode5C12.ode	@ltx/gr_gr_cog/miscellanea:misc.Ode5
ltx/gr_gr_cog/pe.d076:peMA.Ode5C12.text	Ἱστόρησε πόκος τὸ Μάννα, καὶ Σιλωὰμ καὶ ἡ πέτρα πηγάζουσα, Σολομῶντος ἡ στοὰ τὴν χάριν σου, τὰ Ἰορδάνεια νάματα, καὶ ἡ πηγὴ Σαμαρείτιδος.
ltx/gr_gr_cog/pe.d076:peMA.Ode5C13.incipit	Σταγόνες σου Κόρη Παρθένε, αἱ…
ltx/gr_gr_cog/pe.d076:peMA.Ode5C13.melody	@ltx/gr_gr_cog/he.h.m1:heHE.OrthrisomenOrthrouVatheos.name
ltx/gr_gr_cog/pe.d076:peMA.Ode5C13.mode	@ltx/gr_gr_cog/miscellanea:misc.Mode1
ltx/gr_gr_cog/pe.d076:peMA.Ode5C13.ode	@ltx/gr_gr_cog/miscellanea:misc.Ode5
ltx/gr_gr_cog/pe.d076:peMA.Ode5C13.text	Σταγόνες σου Κόρη Παρθένε, αἱ τῆς Πηγῆς καὶ νεκρὸν ἀνεζώωσαν, ὑπὲρ λόγον τὸ πραχθὲν καὶ ἔννοιαν! τὰ σὰ γὰρ πάντα πάναγνε, λόγον νικᾷ τὸν ἀνθρώπινον.
ltx/gr_gr_cog/pe.d076:peMA.Ode5C14.incipit	Τὰ πάθη μου Κόρη ἰάσαις…
ltx/gr_gr_cog/pe.d076:peMA.Ode5C14.melody	@ltx/gr_gr_cog/he.h.m1:heHE.OrthrisomenOrthrouVatheos.name
ltx/gr_gr_cog/pe.d076:peMA.Ode5C14.mode	@ltx/gr_gr_cog/miscellanea:misc.Mode1
ltx/gr_gr_cog/pe.d076:peMA.Ode5C14.ode	@ltx/gr_gr_cog/miscellanea:misc.Ode5
ltx/gr_gr_cog/pe.d076:peMA.Ode5C14.text	Τὰ πάθη μου Κόρη ἰάσαις, τῆς αἱμοῤῥοίας πηγὴν ἡ ξηράνασα, καὶ τὸ ῥῖγος, τῆς φλογὸς τὴν ἄναψιν, καὶ ἑκτικὴν διάθεσιν, οὔρων δεσμὰ καὶ γαστρόῤῥοιαν.
ltx/gr_gr_cog/pe.d076:peMA.Ode6C11.greekmelody	@ltx/gr_gr_cog/he.h.m1:heHE.KatilthesEnToisKatotatois.greekname
ltx/gr_gr_cog/pe.d076:peMA.Ode6C11.incipit	Οἱ λόγοι τοῦ λόγου ὡς…
ltx/gr_gr_cog/pe.d076:peMA.Ode6C11.melody	@ltx/gr_gr_cog/he.h.m1:heHE.KatilthesEnToisKatotatois.name
ltx/gr_gr_cog/pe.d076:peMA.Ode6C11.mode	@ltx/gr_gr_cog/miscellanea:misc.Mode1
ltx/gr_gr_cog/pe.d076:peMA.Ode6C11.ode	@ltx/gr_gr_cog/miscellanea:misc.Ode6
ltx/gr_gr_cog/pe.d076:peMA.Ode6C11.text	Οἱ λόγοι τοῦ λόγου ὡς ὄντως πηγήν, ἀνυμνοῦσί σε Ἁγνή· τῆς σοφίας βυθὸν γάρ, ὡς ὑπὲρ λόγον γεννᾷς, τὸν κρεμάσαντα, ἐν αἰθέρι τὰς ῥοάς, καὶ τὴν γῆν ἐπὶ ὕδωρ.
ltx/gr_gr_cog/pe.d076:peMA.Ode6C12.incipit	Ὑπῆλθες τὴν τῶν κλιμάκων φοράν…
ltx/gr_gr_cog/pe.d076:peMA.Ode6C12.melody	@ltx/gr_gr_cog/he.h.m1:heHE.KatilthesEnToisKatotatois.name
ltx/gr_gr_cog/pe.d076:peMA.Ode6C12.mode	@ltx/gr_gr_cog/miscellanea:misc.Mode1
ltx/gr_gr_cog/pe.d076:peMA.Ode6C12.ode	@ltx/gr_gr_cog/miscellanea:misc.Ode6
ltx/gr_gr_cog/pe.d076:peMA.Ode6C12.text	Ὑπῆλθες τὴν τῶν κλιμάκων φοράν, ἀπειλοῦσαν συντριβήν, τοὺς ἐκεῖσε ζωγράφους, ὦ παναγία Πηγή, διασώσασα, καὶ λαὸν ὑπὸ σεισμοῦ, πεπτωκότος τοῦ δόμου.
ltx/gr_gr_cog/pe.d076:peMA.Ode6C13.incipit	Τὰς μήτρας ἀγόνους στειρώσει τὸ…
ltx/gr_gr_cog/pe.d076:peMA.Ode6C13.melody	@ltx/gr_gr_cog/he.h.m1:heHE.KatilthesEnToisKatotatois.name
ltx/gr_gr_cog/pe.d076:peMA.Ode6C13.mode	@ltx/gr_gr_cog/miscellanea:misc.Mode1
ltx/gr_gr_cog/pe.d076:peMA.Ode6C13.ode	@ltx/gr_gr_cog/miscellanea:misc.Ode6
ltx/gr_gr_cog/pe.d076:peMA.Ode6C13.text	Τὰς μήτρας ἀγόνους στειρώσει τὸ πρίν, διαλύεις ἐμφανῶς, τῆς Πηγῆς σου τῷ ῥείθρῳ· καὶ γὰρ ὡς τέξασα σὺ παρθενεύουσα, τὸν Δεσπότην τοῦ παντός, καὶ τοὺς τόκους βραβεύεις.
ltx/gr_gr_cog/pe.d076:peMA.Ode6C14.incipit	Οὐ λόγος, οὐ νοῦς, οὐδὲ…
ltx/gr_gr_cog/pe.d076:peMA.Ode6C14.melody	@ltx/gr_gr_cog/he.h.m1:heHE.KatilthesEnToisKatotatois.name
ltx/gr_gr_cog/pe.d076:peMA.Ode6C14.mode	@ltx/gr_gr_cog/miscellanea:misc.Mode1
ltx/gr_gr_cog/pe.d076:peMA.Ode6C14.ode	@ltx/gr_gr_cog/miscellanea:misc.Ode6
ltx/gr_gr_cog/pe.d076:peMA.Ode6C14.text	Οὐ λόγος, οὐ νοῦς, οὐδὲ γλῶττα τὸν σὸν ἐξισχύουσιν Ἁγνή, τοκετὸν εὐφημῆσαι· ἀλλʼ ἀσθενοῦσιν ἐν σοί, καὶ ἐλέγχεται, φιλοσόφων τὸ σεμνὸν καὶ ῥητόρων κομψότης.
ltx/gr_gr_cog/pe.d076:peMA.Ode7C11.greekmelody	@ltx/gr_gr_cog/he.h.m1:heHE.OPaidasEkKaminou.greekname
ltx/gr_gr_cog/pe.d076:peMA.Ode7C11.incipit	Ὑδρεύσασθε νοσοῦντες ἰάματα· ἡ πάναγνος…
ltx/gr_gr_cog/pe.d076:peMA.Ode7C11.melody	@ltx/gr_gr_cog/he.h.m1:heHE.OPaidasEkKaminou.name
ltx/gr_gr_cog/pe.d076:peMA.Ode7C11.mode	@ltx/gr_gr_cog/miscellanea:misc.Mode1
ltx/gr_gr_cog/pe.d076:peMA.Ode7C11.ode	@ltx/gr_gr_cog/miscellanea:misc.Ode7
ltx/gr_gr_cog/pe.d076:peMA.Ode7C11.text	Ὑδρεύσασθε νοσοῦντες ἰάματα· ἡ πάναγνος ῥέει γάρ, θείας ἐκ πηγῆς, τὸν γλυκασμὸν τὸν ἀληθῆ, τὸν χειμάῤῥουν τρυφῆς ὄντως βλύζουσα· διὸ καὶ πίστει κρουνούς, τοὺς ἀφθόνους ἀρυσώμεθα σύμπαντες.
ltx/gr_gr_cog/pe.d076:peMA.Ode7C12.incipit	Ξενίζει τοὺς ἀκούοντας Δέσποινα, τὰ…
ltx/gr_gr_cog/pe.d076:peMA.Ode7C12.melody	@ltx/gr_gr_cog/he.h.m1:heHE.OPaidasEkKaminou.name
ltx/gr_gr_cog/pe.d076:peMA.Ode7C12.mode	@ltx/gr_gr_cog/miscellanea:misc.Mode1
ltx/gr_gr_cog/pe.d076:peMA.Ode7C12.ode	@ltx/gr_gr_cog/miscellanea:misc.Ode7
ltx/gr_gr_cog/pe.d076:peMA.Ode7C12.text	Ξενίζει τοὺς ἀκούοντας Δέσποινα, τὰ ξένα σου τέρατα, πάντας τοὺς πιστούς· τοὺς γὰρ ἀλάλους καὶ κωφούς, ὡς εὐλάλους δεικνύει τὸ ὕδωρ σου, τοὺς πάσχοντάς τε δεινῶς θεραπεύει, καὶ ἴασιν χαρίζεται.
ltx/gr_gr_cog/pe.d076:peMA.Ode7C13.incipit	Ἀνάγεις ἐκ καμίνου τῶν θλίψεων…
ltx/gr_gr_cog/pe.d076:peMA.Ode7C13.melody	@ltx/gr_gr_cog/he.h.m1:heHE.OPaidasEkKaminou.name
ltx/gr_gr_cog/pe.d076:peMA.Ode7C13.mode	@ltx/gr_gr_cog/miscellanea:misc.Mode1
ltx/gr_gr_cog/pe.d076:peMA.Ode7C13.ode	@ltx/gr_gr_cog/miscellanea:misc.Ode7
ltx/gr_gr_cog/pe.d076:peMA.Ode7C13.text	Ἀνάγεις ἐκ καμίνου τῶν θλίψεων, δροσίζουσα νάμασι, ξένης ἐκ Πηγῆς, τοὺς προσιόντάς σοι Σεμνή· φαγεδαίνης λυτροῦται γὰρ ἄνθρωπος, καὶ λώβης, τὸν δὲ λεπρόν θεραπεύεις καὶ ἄνθρακας κατέσβεσας.
ltx/gr_gr_cog/pe.d076:peMA.Ode7C14.incipit	Νεάνιδες καὶ κόραι τὴν Δέσποιναν…
ltx/gr_gr_cog/pe.d076:peMA.Ode7C14.melody	@ltx/gr_gr_cog/he.h.m1:heHE.OPaidasEkKaminou.name
ltx/gr_gr_cog/pe.d076:peMA.Ode7C14.mode	@ltx/gr_gr_cog/miscellanea:misc.Mode1
ltx/gr_gr_cog/pe.d076:peMA.Ode7C14.ode	@ltx/gr_gr_cog/miscellanea:misc.Ode7
ltx/gr_gr_cog/pe.d076:peMA.Ode7C14.text	Νεάνιδες καὶ κόραι τὴν Δέσποιναν καὶ σύμπαντες ἄνθρωποι, πίστει ἐκ ψυχῆς ἀνευφημήσωμεν λαμπρῶς· διατρήσεις γὰρ ἥλων, ὑέλωπας, καὶ ἕλκη τὰ πονηρὰ καὶ ὀγκώσεις, καὶ παράλυτον ἰάσατο.
ltx/gr_gr_cog/pe.d076:peMA.Ode8C11.greekmelody	@ltx/gr_gr_cog/he.h.m1:heHE.AftiIKliti.greekname
ltx/gr_gr_cog/pe.d076:peMA.Ode8C11.incipit	Θεῖον ἡ Πηγὴ καὶ σεβάσμιον…
ltx/gr_gr_cog/pe.d076:peMA.Ode8C11.melody	@ltx/gr_gr_cog/he.h.m1:heHE.AftiIKliti.name
ltx/gr_gr_cog/pe.d076:peMA.Ode8C11.mode	@ltx/gr_gr_cog/miscellanea:misc.Mode1
ltx/gr_gr_cog/pe.d076:peMA.Ode8C11.ode	@ltx/gr_gr_cog/miscellanea:misc.Ode8
ltx/gr_gr_cog/pe.d076:peMA.Ode8C11.text	Θεῖον ἡ Πηγὴ καὶ σεβάσμιον ὕδωρ, προῤῥέει σου Παρθένε· ὑδρωπικῶν γὰρ τὸ ῥεῦμα, ἀναχαιτίζει σφοδρῶς, ἐπικλήσει τῇ θείᾳ τῆς χάριτος· διό σε τιμῶμεν, Πηγὴ εἰς τοὺς αἰῶνας.
ltx/gr_gr_cog/pe.d076:peMA.Ode8C12.incipit	Πάντες τὸ σεπτὸν καὶ ζωήῤῥυτον…
ltx/gr_gr_cog/pe.d076:peMA.Ode8C12.melody	@ltx/gr_gr_cog/he.h.m1:heHE.AftiIKliti.name
ltx/gr_gr_cog/pe.d076:peMA.Ode8C12.mode	@ltx/gr_gr_cog/miscellanea:misc.Mode1
ltx/gr_gr_cog/pe.d076:peMA.Ode8C12.ode	@ltx/gr_gr_cog/miscellanea:misc.Ode8
ltx/gr_gr_cog/pe.d076:peMA.Ode8C12.text	Πάντες τὸ σεπτὸν καὶ ζωήῤῥυτον ὕδωρ, ὑμνήσωμεν προφρόνως· τῆς γὰρ δυσπνοίας τὸ ῥεῦμα κατὰ χώραν ἱστᾷ, καὶ ἐλεύθερον ποιεῖ πρὸς διέξοδον. Βαβαὶ σῶν θαυμασίων! ἁγνὴ Θεοκυῆτορ.
ltx/gr_gr_cog/pe.d076:peMA.Ode8C13.incipit	Ποῖον εὐφημήσει Πανύμνητε στόμα, τοῦ…
ltx/gr_gr_cog/pe.d076:peMA.Ode8C13.melody	@ltx/gr_gr_cog/he.h.m1:heHE.AftiIKliti.name
ltx/gr_gr_cog/pe.d076:peMA.Ode8C13.mode	@ltx/gr_gr_cog/miscellanea:misc.Mode1
ltx/gr_gr_cog/pe.d076:peMA.Ode8C13.ode	@ltx/gr_gr_cog/miscellanea:misc.Ode8
ltx/gr_gr_cog/pe.d076:peMA.Ode8C13.text	Ποῖον εὐφημήσει Πανύμνητε στόμα, τοῦ τόκου σου τὸ ξένον, ἀλλὰ καὶ νοῦς ὁποῖος, τῶν θαυμάτων πηγὴν περιβλέψαιτο, καὶ λόγοις κροτήσειεν, οὐκ ἔστι τῇ φύσει ἰσχύς, τὰ σὰ θαυμάζειν.
ltx/gr_gr_cog/pe.d076:peMA.Ode8C14.incipit	Ὅλον ἐπὶ σοὶ τοῦ θανάτου…
ltx/gr_gr_cog/pe.d076:peMA.Ode8C14.melody	@ltx/gr_gr_cog/he.h.m1:heHE.AftiIKliti.name
ltx/gr_gr_cog/pe.d076:peMA.Ode8C14.mode	@ltx/gr_gr_cog/miscellanea:misc.Mode1
ltx/gr_gr_cog/pe.d076:peMA.Ode8C14.ode	@ltx/gr_gr_cog/miscellanea:misc.Ode8
ltx/gr_gr_cog/pe.d076:peMA.Ode8C14.text	Ὅλον ἐπὶ σοὶ τοῦ θανάτου τὸ κράτος, ἠφάνισται ἀθρόον, ὦ Βασιλὶς καὶ Κυρία· Βασιλέα καὶ γάρ, τὴν ἀθάνατον ζωὴν σὺ ἐπήγασας, τὸ ὕδωρ τὸ μάννα, Χριστὸν εἰς τοὺς αἰῶνας.
ltx/gr_gr_cog/pe.d076:peMA.Ode9C11.greekmelody	@ltx/gr_gr_cog/he.h.m1:heHE.FotizouFotizou.greekname
ltx/gr_gr_cog/pe.d076:peMA.Ode9C11.incipit	Ὑδάτων ἁπάντων, Κόρη ὑπέρκειται ἁγνή…
ltx/gr_gr_cog/pe.d076:peMA.Ode9C11.melody	@ltx/gr_gr_cog/he.h.m1:heHE.FotizouFotizou.name
ltx/gr_gr_cog/pe.d076:peMA.Ode9C11.mode	@ltx/gr_gr_cog/miscellanea:misc.Mode1
ltx/gr_gr_cog/pe.d076:peMA.Ode9C11.ode	@ltx/gr_gr_cog/miscellanea:misc.Ode9
ltx/gr_gr_cog/pe.d076:peMA.Ode9C11.text	Ὑδάτων ἁπάντων, Κόρη ὑπέρκειται ἁγνή, τῆς Πηγῆς σου τὸ ὕδωρ, ἐμφανῶς δωρούμενον, ἀπαλλαγὴν νοσημάτων δεινῶν, καὶ ταῖς ψυχαῖς, ἅπασαν τὴν ῥῶσιν, ὡς ὑπὲρ φύσιν χεόμενον.
ltx/gr_gr_cog/pe.d076:peMA.Ode9C12.incipit	Λυτῆρα τῶν νόσων, τὸν νέον…
ltx/gr_gr_cog/pe.d076:peMA.Ode9C12.melody	@ltx/gr_gr_cog/he.h.m1:heHE.FotizouFotizou.name
ltx/gr_gr_cog/pe.d076:peMA.Ode9C12.mode	@ltx/gr_gr_cog/miscellanea:misc.Mode1
ltx/gr_gr_cog/pe.d076:peMA.Ode9C12.ode	@ltx/gr_gr_cog/miscellanea:misc.Ode9
ltx/gr_gr_cog/pe.d076:peMA.Ode9C12.text	Λυτῆρα τῶν νόσων, τὸν νέον ἰδοὺ Σιλωάμ, τῆς Πηγῆς σου Παρθένε, καθορῶμεν ἅπαντες· ὄμματα γὰρ προσλαμβάνει πηρός, ἅπαντες δέ, ῥῶσιν ἀενάως, πρὸς τῇ ζωῇ ποριζόμεθα!
ltx/gr_gr_cog/pe.d076:peMA.Ode9C13.incipit	Οἱ ῥῶσιν ζητοῦντες, προσδράμετε ἐν…
ltx/gr_gr_cog/pe.d076:peMA.Ode9C13.melody	@ltx/gr_gr_cog/he.h.m1:heHE.FotizouFotizou.name
ltx/gr_gr_cog/pe.d076:peMA.Ode9C13.mode	@ltx/gr_gr_cog/miscellanea:misc.Mode1
ltx/gr_gr_cog/pe.d076:peMA.Ode9C13.ode	@ltx/gr_gr_cog/miscellanea:misc.Ode9
ltx/gr_gr_cog/pe.d076:peMA.Ode9C13.text	Οἱ ῥῶσιν ζητοῦντες, προσδράμετε ἐν τῇ Πηγῇ· ἡ γὰρ Κόρη Παρθένος, ἐνοικεῖ τῷ ὕδατι. Σκίρτα πιστῶν, καὶ εὐφραίνου πληθύς, οὕτω ὡς χρή, ἕξεις τῷ τεμένει, τὴν ἀμοιβὴν τῶν αἰτήσεων.
ltx/gr_gr_cog/pe.d076:peMA.Ode9C14.incipit	Ὑψώθη Πηγῆς σου, τὸ ὕδωρ…
ltx/gr_gr_cog/pe.d076:peMA.Ode9C14.melody	@ltx/gr_gr_cog/he.h.m1:heHE.FotizouFotizou.name
ltx/gr_gr_cog/pe.d076:peMA.Ode9C14.mode	@ltx/gr_gr_cog/miscellanea:misc.Mode1
ltx/gr_gr_cog/pe.d076:peMA.Ode9C14.ode	@ltx/gr_gr_cog/miscellanea:misc.Ode9
ltx/gr_gr_cog/pe.d076:peMA.Ode9C14.text	Ὑψώθη Πηγῆς σου, τὸ ὕδωρ ὑπὲρ οὐρανούς, καὶ τῆς γῆς τὰς ἀβύσσους, ταῖς ῥοαῖς διέδραμε, τοῦτο ἐστὶν ἀμβροσία ψυχῆς, νέκταρ πιστῶν, μέλι τὸ ἐκ πέτρας, καὶ ἡ τοῦ μάννα διάδοσις.
ltx/gr_gr_cog/pe.d076:peMA.Ode9C15.incipit	Εὐφραίνεις Παρθένε, τὸν Ἄνακτα ὑπερφυῶς…
ltx/gr_gr_cog/pe.d076:peMA.Ode9C15.melody	@ltx/gr_gr_cog/he.h.m1:heHE.FotizouFotizou.name
ltx/gr_gr_cog/pe.d076:peMA.Ode9C15.mode	@ltx/gr_gr_cog/miscellanea:misc.Mode1
ltx/gr_gr_cog/pe.d076:peMA.Ode9C15.ode	@ltx/gr_gr_cog/miscellanea:misc.Ode9
ltx/gr_gr_cog/pe.d076:peMA.Ode9C15.text	Εὐφραίνεις Παρθένε, τὸν Ἄνακτα ὑπερφυῶς, ἀναβλύζουσα χάριν, ἐκ Πηγῆς ἀέναον, τούτῳ διδοῦσα, κατʼ ἐχθρῶν τὴν ἰσχύν, νίκας ἀεί, ῥῶσιν καὶ εἰρήνην, καὶ αἰτημάτων ἐκπλήρωσιν.
ltx/gr_gr_cog/pe.d076:peMA.Oikos1.text	Ἄχραντε Θεοτόκε, ἡ τεκοῦσα ἀῤῥήτως, Πατρὸς τὸν προαιώνιον Λόγον πλάτυνόν μου τὸ στόμα σεμνή, συνεισφέρουσά με πρὸς τὸν σὸν ἔπαινον, ὡς ἂν ἀνευφημήσω σε, κραυγάζων τῇ πηγῇ σου ταῦτα.
ltx/gr_gr_cog/pe.d076:peMA.Oikos12.text	Χαῖρε πηγή, χαρμονῆς ἀλλήκτου, χαῖρε ῥοή, καλλονῆς ἀῤῥήτου.
ltx/gr_gr_cog/pe.d076:peMA.Oikos13.text	Χαῖρε, νοσημάτων παντοίων κατάλυσις, χαῖρε, παθημάτων ποικίλων κατάκλυσις.
ltx/gr_gr_cog/pe.d076:peMA.Oikos14.text	Χαῖρε ῥεῖθρον διειδέστατον, ὑγιάζον τοὺς πιστούς, χαῖρε ὕδωρ χαριέστατον τοῖς νοσοῦσι πολλαπλῶς.
ltx/gr_gr_cog/pe.d076:peMA.Oikos15.text	Χαῖρε νᾶμα σοφίας, ἀγνωσίαν ἐξαῖρον, χαῖρε κρᾶμα καρδίας, ἀμβροσίαν προῤῥέον.
ltx/gr_gr_cog/pe.d076:peMA.Oikos16.text	Χαῖρε κρατὴρ τοῦ μάννα ζωήῤῥυτε, χαῖρε λουτὴρ καὶ νέκταρ θεόῤῥευστε.
ltx/gr_gr_cog/pe.d076:peMA.Oikos17.text	Χαῖρε, πορθμὸν ἀσθενείας δεικνῦσα·χαῖρε, φλογμὸν ἀῤῥωστίας σβεννῦσα.
ltx/gr_gr_cog/pe.d076:peMA.Oikos18.text	Χαῖρε ὕδωρ σωτήριον.
ltx/gr_gr_cog/pe.d076:peSY.commemoration.couplet1.verse1	Μάννα Σιλωάμ, καὶ Στοὰν Σολομῶντος
ltx/gr_gr_cog/pe.d076:peSY.commemoration.couplet1.verse2	Πηγὴν Κόρη σὴν ἐμφανῶς πᾶς τις βλέπει.
ltx/gr_gr_cog/pe.d076:peSY.commemoration.narration.p01	[paragraph 01]
ltx/gr_gr_cog/pe.d076:peSY.commemoration.narration.p02	[paragraph 02]
ltx/gr_gr_cog/pe.d076:peSY.commemoration.narration.p03	[paragraph 03]
ltx/gr_gr_cog/pe.d076:peSY.commemoration.narration.p04	[paragraph 04]
ltx/gr_gr_cog/pe.d076:peSY.commemoration.narration.p05	[paragraph 05]
ltx/gr_gr_cog/pe.d076:peSY.commemoration.narration.p06	[paragraph 06]
ltx/gr_gr_cog/pe.d076:peSY.commemoration.narration.p07	[paragraph 07]
ltx/gr_gr_cog/pe.d076:peSY.commemoration.text	Τῇ Παρασκευῇ τῆς Διακαινησίμου, ἑορτάζομεν τὰ ἐγκαίνια τοῦ ναοῦ τῆς ὑπεραγίας Δεσποίνης ἡμῶν καὶ θεομήτορος, τῆς Ζωηφόρου Πηγῆς, ἔτι δὲ καὶ μνείαν ποιούμεθα τῶν ἐν τούτῳ τελεσθέντων ὑπερφυῶν θαυμάτων παρὰ τῆς Θεομήτορος.
ltx/gr_gr_cog/pe.d076:peSY.lastline	Ταῖς τῆς σῆς Μητρὸς πρεσβείαις, Χριστὲ ὁ Θεός, ἐλέησον ἡμᾶς. Ἀμήν.
ltx/gr_gr_cog/pe.d076:peVE.Apolytikion1.incipit	Ὁ ναός σου, Θεοτόκε, ἀνεδείχθη…
ltx/gr_gr_cog/pe.d076:peVE.Apolytikion1.melody	
ltx/gr_gr_cog/pe.d076:peVE.Apolytikion1.mode	@ltx/gr_gr_cog/miscellanea:misc.Mode1
ltx/gr_gr_cog/pe.d076:peVE.Apolytikion1.text	Ὁ ναός σου, Θεοτόκε, ἀνεδείχθη παράδεισος, ὡς ποταμοὺς ἀειζώους, ἀναβλύζων ἰάματα· ᾧ προσερχόμενοι πιστῶς, ὡς ζωοδόχου ἐκ Πηγῆς, ῥῶσιν ἀντλοῦμεν, καὶ ζωὴν τὴν αἰώνιον· πρεσβεύεις γὰρ σύ, τῷ ἐκ σοῦ τεχθέντι Σωτῆρι Χριστῷ, σωθῆναι τὰς ψυχὰς ἡμῶν.
ltx/gr_gr_cog/pe.d076:peVE.AposGlory.incipit	Σαλπίσωμεν φιλέορτοι ἐν ὕμνοις, σκιρτήσωμεν…
ltx/gr_gr_cog/pe.d076:peVE.AposGlory.melody	
ltx/gr_gr_cog/pe.d076:peVE.AposGlory.mode	@ltx/gr_gr_cog/miscellanea:misc.Mode5
ltx/gr_gr_cog/pe.d076:peVE.AposGlory.text	Σαλπίσωμεν φιλέορτοι ἐν ὕμνοις, σκιρτήσωμεν ἐν ὕδασι καὶ χορεύσωμεν εὐφραινόμενοι, τοῖς ἀενάως πλημμυροῦσι τῆς ζωηφόρου Πηγῆς. Βασιλεῖς καὶ ἄρχοντες συντρεχέτωσαν, καὶ Πηγῆς τὴν χάριν προχείτωσαν ἀφθόνως· Βασιλεῖς γὰρ ἔσωσε, τοὺς ἐν κλίνῃ συσχεθέντας δέ, τῇ προσψαύσει ἐξανέστησε. Ποιμένες τε καὶ σύμπαντες, τὴν ὀμβροφόρον νεφέλην, τὸ σωτήριον συνελθόντες ἀρυσώμεθα, οἱ ἐν νόσοις ἀπαλλαγήν, οἱ ἐν κινδύνοις τὴν ῥῶσιν, τὴν ἀναψυχὴν οἱ ἐν δίψει· τὰ ὄμματά τε οἱ τυφλοί, οἱ κωφεύοντες τὴν εὐηκοΐαν, τὴν ἰατρείαν οἱ καχεκτοῦντες, οἱ ἐν θανάτοις τὴν ζωηφόρον, οἱ πάντες τὴν πανταχοῦ πιστοῖς προῤῥέουσαν, ὕδατα σωτηρίας, ἀνακροτήσαντες, οὕτω κράξωμεν· Ἀείζωα προχέουσα νάματα, ἐκ Πηγῆς ἁγνή, μὴ διαλίπῃς Παρθένε πρεσβεύουσα πάντοτε ὑπὲρ τῶν δούλων σου.
ltx/gr_gr_cog/pe.d076:peVE.Aposticha1.incipit	@ltx/gr_gr_cog/oc.m6.d1:ocVE.Aposticha1.incipit
ltx/gr_gr_cog/pe.d076:peVE.Aposticha1.melody	
ltx/gr_gr_cog/pe.d076:peVE.Aposticha1.mode	@ltx/gr_gr_cog/miscellanea:misc.Mode6
ltx/gr_gr_cog/pe.d076:peVE.Aposticha1.text	@ltx/gr_gr_cog/oc.m6.d1:ocVE.Aposticha1.text
ltx/gr_gr_cog/pe.d076:peVE.Aposticha2.greekmelody	@ltx/gr_gr_cog/he.a.m5:heAU.ChairoisAskitikon.greekname
ltx/gr_gr_cog/pe.d076:peVE.Aposticha2.incipit	Χαίροις ἡ ζωηφόρος Πηγή, κατὰ…
ltx/gr_gr_cog/pe.d076:peVE.Aposticha2.melody	@ltx/gr_gr_cog/he.a.m5:heAU.ChairoisAskitikon.name
ltx/gr_gr_cog/pe.d076:peVE.Aposticha2.mode	@ltx/gr_gr_cog/miscellanea:misc.Mode5
ltx/gr_gr_cog/pe.d076:peVE.Aposticha2.text	Χαίροις ἡ ζωηφόρος Πηγή, κατὰ θαλάσσας πελαγίζουσα θαύματα, πρὸς πᾶσαν τὴν οἰκουμένην Ὠκεανὲ νοητέ, τὰ Νειλῷα ῥεῖθρα ὑπερβαίνουσα, τῇ χύσει τῆς χάριτος, Σιλωὰμ ἐκ πέτρας ἄλλος δεύτερος, ὕδωρ πηγάζων, ὡς παράδοξον, Ἰορδάνου τε δεξαμένη ἐνέργειαν, μάννα σωτηριῶδές τε ἐναργῶς τὸ γινόμενον πρὸς τοῦ ζητοῦντος τὴν χρείαν· πλούσιον ὄντως καὶ ἄφθονον, Χριστοῦ Μῆτερ Κόρη ἡ προχέουσα τῷ κόσμῳ τὸ μέγα ἔλεος.
ltx/gr_gr_cog/pe.d076:peVE.Aposticha3.incipit	Ὕμνοις ἐν ἐξαισίοις, Πιστοὶ, τὴν…
ltx/gr_gr_cog/pe.d076:peVE.Aposticha3.melody	@ltx/gr_gr_cog/he.a.m5:heAU.ChairoisAskitikon.name
ltx/gr_gr_cog/pe.d076:peVE.Aposticha3.mode	@ltx/gr_gr_cog/miscellanea:misc.Mode5
ltx/gr_gr_cog/pe.d076:peVE.Aposticha3.text	Ὕμνοις ἐν ἐξαισίοις, Πιστοὶ, τὴν ἐπουράνιον νεφέλην ὑμνήσωμεν, σταγόνα τὴν οὐρανίαν, τὸν ζωοδότην Χριστόν, ἐπὶ γῆς ἀῤῥεύστως ὑετίζουσαν, τὸ ζῶν, τὸ ἁλλόμενον, καὶ πηγάζον ἀθάνατα, ὕδωρ τὸ θεῖον, τὴν ἀμβροσίαν τοῦ νέκταρος τοῦ μηδέποτε μετὰ πόσιν ἐκρέοντος, δίψαν δὲ τὴν συντήκουσαν ψυχὰς ἀπελαύνοντος, οὗπερ πιόντες ἐμφρόνως, ῥεύματα θεῖα προβάλλονται, κοιλίας ἐκ νόου, ἑπομβρίζοντα τοῖς πᾶσι, χάριν τὴν ἄφθονον.
ltx/gr_gr_cog/pe.d076:peVE.Aposticha4.incipit	Χαίροις ἡ ζωοδόχος Πηγή, ἡ…
ltx/gr_gr_cog/pe.d076:peVE.Aposticha4.melody	@ltx/gr_gr_cog/he.a.m5:heAU.ChairoisAskitikon.name
ltx/gr_gr_cog/pe.d076:peVE.Aposticha4.mode	@ltx/gr_gr_cog/miscellanea:misc.Mode5
ltx/gr_gr_cog/pe.d076:peVE.Aposticha4.text	Χαίροις ἡ ζωοδόχος Πηγή, ἡ ἀενάως ἀναβλύζουσα χάριτας, ἡ βρύσις τῶν ἰαμάτων ἡ πᾶσαν νόσων ἰσχύν, ἀσθενῆ καὶ φαύλην ἀπελέγχουσα· τυφλῶν ἡ ἀνάβλεψις, καὶ λεπρῶν θεία κάθαρσις· σθένος ἀῤῥώστον, παρειμένων ἀνόρθωσις, ἡ πηγάζουσα, νοσημάτων πᾶν φάρμακον, ἅπασι τοῖς προστρέχουσι, πιστῶς τῷ τεμένει σου, μέγα κοινὸν ἰατρεῖον ἄμισθον ὄντως καὶ ἕτοιμον, Χριστοῦ Μῆτερ Λόγου, τοῦ πηγάζοντος τῷ κόσμῳ τὸ μέγα ἔλεος.
ltx/gr_gr_cog/pe.d076:peVE.MM.Stichera1234as3456.text	@ltx/gr_gr_cog/properties:media.key
ltx/gr_gr_cog/pe.d076:peVE.MM.Stichera123as123.text	@ltx/gr_gr_cog/properties:media.key
ltx/gr_gr_cog/pe.d076:peVE.MM.Stichera789as456.text	@ltx/gr_gr_cog/properties:media.key
ltx/gr_gr_cog/pe.d076:peVE.SticBoth.incipit	@ltx/gr_gr_cog/oc.m6.d1:ocVE.SticTheotokion.incipit
ltx/gr_gr_cog/pe.d076:peVE.SticBoth.melody	
ltx/gr_gr_cog/pe.d076:peVE.SticBoth.mode	@ltx/gr_gr_cog/miscellanea:misc.Mode6
ltx/gr_gr_cog/pe.d076:peVE.SticBoth.text	@ltx/gr_gr_cog/oc.m6.d1:ocVE.SticTheotokion.text
ltx/gr_gr_cog/pe.d076:peVE.SticGlory.incipit	Τίς λαλήσει τὰς δυναστείας σου…
ltx/gr_gr_cog/pe.d076:peVE.SticGlory.melody	
ltx/gr_gr_cog/pe.d076:peVE.SticGlory.mode	@ltx/gr_gr_cog/miscellanea:misc.Mode8
ltx/gr_gr_cog/pe.d076:peVE.SticGlory.text	Τίς λαλήσει τὰς δυναστείας σου Πηγή; ἥτις ἐξ ἀκενώτων θαυμάτων πλημμυροῦσα, πολλὰ καὶ ὑπὲρ φύσιν ἐνεργεῖς διὰ ἰάσεων. Βαβαὶ τῶν μεγαλείων, ὧν τοῖς πάσιν ἐπιῤῥέεις! οὐ μόνον γὰρ νοσήματα χαλεπὰ ἀπήλασας, τῶν προσιόντων μετὰ πόθου, ἀλλὰ καὶ τὰ τῶν ψυχῶν πάθη ἐκπλύνεις καθαρίζουσα πανάσπιλε, σὺν πᾶσι βραβεύουσα καὶ μέγα ἔλεος.
ltx/gr_gr_cog/pe.d076:peVE.Stichera01.incipit	@ltx/gr_gr_cog/oc.m6.d1:ocVE.Stichera1.incipit
ltx/gr_gr_cog/pe.d076:peVE.Stichera01.melody	
ltx/gr_gr_cog/pe.d076:peVE.Stichera01.mode	@ltx/gr_gr_cog/miscellanea:misc.Mode6
ltx/gr_gr_cog/pe.d076:peVE.Stichera01.text	@ltx/gr_gr_cog/oc.m6.d1:ocVE.Stichera1.text
ltx/gr_gr_cog/pe.d076:peVE.Stichera02.incipit	@ltx/gr_gr_cog/oc.m6.d1:ocVE.Stichera2.incipit
ltx/gr_gr_cog/pe.d076:peVE.Stichera02.melody	
ltx/gr_gr_cog/pe.d076:peVE.Stichera02.mode	@ltx/gr_gr_cog/miscellanea:misc.Mode6
ltx/gr_gr_cog/pe.d076:peVE.Stichera02.text	@ltx/gr_gr_cog/oc.m6.d1:ocVE.Stichera2.text
ltx/gr_gr_cog/pe.d076:peVE.Stichera03.incipit	@ltx/gr_gr_cog/oc.m6.d1:ocVE.Stichera3.incipit
ltx/gr_gr_cog/pe.d076:peVE.Stichera03.melody	
ltx/gr_gr_cog/pe.d076:peVE.Stichera03.mode	@ltx/gr_gr_cog/miscellanea:misc.Mode6
ltx/gr_gr_cog/pe.d076:peVE.Stichera03.text	@ltx/gr_gr_cog/oc.m6.d1:ocVE.Stichera3.text
ltx/gr_gr_cog/pe.d076:peVE.Stichera04.incipit	@ltx/gr_gr_cog/oc.m6.d1:ocVE.Stichera4.incipit
ltx/gr_gr_cog/pe.d076:peVE.Stichera04.melody	
ltx/gr_gr_cog/pe.d076:peVE.Stichera04.mode	@ltx/gr_gr_cog/miscellanea:misc.Mode6
ltx/gr_gr_cog/pe.d076:peVE.Stichera04.text	@ltx/gr_gr_cog/oc.m6.d1:ocVE.Stichera4.text
ltx/gr_gr_cog/pe.d076:peVE.Stichera05.incipit	@ltx/gr_gr_cog/oc.m6.d1:ocVE.Stichera6.incipit
ltx/gr_gr_cog/pe.d076:peVE.Stichera05.melody	
ltx/gr_gr_cog/pe.d076:peVE.Stichera05.mode	@ltx/gr_gr_cog/miscellanea:misc.Mode6
ltx/gr_gr_cog/pe.d076:peVE.Stichera05.text	@ltx/gr_gr_cog/oc.m6.d1:ocVE.Stichera6.text
ltx/gr_gr_cog/pe.d076:peVE.Stichera06.incipit	@ltx/gr_gr_cog/oc.m6.d1:ocVE.Stichera5.incipit
ltx/gr_gr_cog/pe.d076:peVE.Stichera06.melody	
ltx/gr_gr_cog/pe.d076:peVE.Stichera06.mode	@ltx/gr_gr_cog/miscellanea:misc.Mode6
ltx/gr_gr_cog/pe.d076:peVE.Stichera06.text	@ltx/gr_gr_cog/oc.m6.d1:ocVE.Stichera5.text
ltx/gr_gr_cog/pe.d076:peVE.Stichera07.greekmelody	@ltx/gr_gr_cog/he.a.m6:heAU.OlinApothemenoi.greekname
ltx/gr_gr_cog/pe.d076:peVE.Stichera07.incipit	Ξένα καὶ παράδοξα, τῶν οὐρανῶν…
ltx/gr_gr_cog/pe.d076:peVE.Stichera07.melody	@ltx/gr_gr_cog/he.a.m6:heAU.OlinApothemenoi.name
ltx/gr_gr_cog/pe.d076:peVE.Stichera07.mode	@ltx/gr_gr_cog/miscellanea:misc.Mode6
ltx/gr_gr_cog/pe.d076:peVE.Stichera07.text	Ξένα καὶ παράδοξα, τῶν οὐρανῶν ὁ Δεσπότης, ἐπὶ σοὶ τετέλεκε, καταρχὰς Πανάμωμε· καὶ γὰρ ἄνωθεν, ἐμφανῶς ἔσταξεν, ὑετὸς καθάπερ, ἐν τῇ μήτρᾳ σου Θεόνυμφε, Πηγὴν δεικνύων σε, σύμπαν ἀγαθὸν ἀναβλύζουσαν, πλημμύραν τε ἰάσεων, τὰς εὐεργεσίας προῤῥέουσαν ἅπασιν ἀφθόνως, τοῖς χρῄζουσι τὴν ῥῶσιν τῶν ψυχῶν, καὶ τὴν ὑγείαν τοῦ σώματος, ὕδατι τῆς χάριτος.
ltx/gr_gr_cog/pe.d076:peVE.Stichera08.greekmelody	@ltx/gr_gr_cog/he.a.m6:heAU.OlinApothemenoi.greekname
ltx/gr_gr_cog/pe.d076:peVE.Stichera08.incipit	Μάννα σε οὐράνιον, καὶ Παραδείσου…
ltx/gr_gr_cog/pe.d076:peVE.Stichera08.melody	@ltx/gr_gr_cog/he.a.m6:heAU.OlinApothemenoi.name
ltx/gr_gr_cog/pe.d076:peVE.Stichera08.mode	@ltx/gr_gr_cog/miscellanea:misc.Mode6
ltx/gr_gr_cog/pe.d076:peVE.Stichera08.text	Μάννα σε οὐράνιον, καὶ Παραδείσου Παρθένε, τὴν Πηγὴν τὴν ἔνθεον, ὀνομάζω Δέσποινα προσφυέστατα· τῆς γὰρ γῆς ἔδραμεν, ἡ ῥοὴ καὶ χάρις, τῆς Πηγῆς σου τετραμέρειαν αὐτῆς καλύπτουσα, ξένοις τεραστίοις ἑκάστοτε, καὶ πᾶσι τὸ αἰτούμενον γίνεται τὸ ὕδωρ πινόμενον· ὅθεν γεγηθότες, Χριστώνυμοι προστρέχομεν πιστῶς, ἁγιασμόν ἀρυόμενοι, πάντοτε γλυκύῤῥοον.
ltx/gr_gr_cog/pe.d076:peVE.Stichera09.incipit	Ῥεῖθρα τῶν ἰάσεων, ἀναβλυστάνεις Παρθένε…
ltx/gr_gr_cog/pe.d076:peVE.Stichera09.melody	@ltx/gr_gr_cog/he.a.m6:heAU.OlinApothemenoi.name
ltx/gr_gr_cog/pe.d076:peVE.Stichera09.mode	@ltx/gr_gr_cog/miscellanea:misc.Mode6
ltx/gr_gr_cog/pe.d076:peVE.Stichera09.text	Ῥεῖθρα τῶν ἰάσεων, ἀναβλυστάνεις Παρθένε, τοῖς πιστῶς προστρέχουσι, τῇ Πηγῇ σου πάντοτε, θεονύμφευτε· δωρεὰν ῥέεις γάρ, δαψιλῆ καὶ χύδην τοῖς νοσοῦσι τὰ Ἰάματα, τυφλοὺς ἐμβλέποντας, φαίνεις ἐναργῶς προσιόντας σοι, χωλοὺς πολλοὺς ἀνώρθωσας καὶ τοὺς παρειμένους συνέσφιγξας, τὸν δὲ νεκρωθέντα, ἐζώωσας προσχύσει τῇ τριττῇ, ὑδρωπικῶν καὶ δυσπνόων τε, πάθη ἐθεράπευσας.
