ltx/gr_gr_cog/le.pr.me.r62:leprVE.reading.book_abbr	@ltx/gr_gr_cog/le.pr.me.r28:leprVE.reading.book_abbr
ltx/gr_gr_cog/le.pr.me.r62:leprVE.reading.book_string	@ltx/gr_gr_cog/le.pr.me.r28:leprVE.reading.book_string
ltx/gr_gr_cog/le.pr.me.r62:leprVE.reading.chapverse	@ltx/gr_gr_cog/le.pr.me.r28:leprVE.reading.chapverse
ltx/gr_gr_cog/le.pr.me.r62:leprVE.reading.text	@ltx/gr_gr_cog/le.pr.me.r28:leprVE.reading.text
ltx/gr_gr_cog/le.pr.me.r62:leprVE.reading.title	
ltx/gr_gr_cog/le.pr.me.r62:leprVE.reading.title_abbr	
ltx/gr_gr_cog/le.pr.me.r62:leprVE.reading.version	@ltx/gr_gr_cog/properties:version.designation
