ltx/gr_gr_cog/le.go.mc.d035:lemcLI.Gospel.book_abbr	@ltx/gr_gr_cog/bible:Mark.abbr
ltx/gr_gr_cog/le.go.mc.d035:lemcLI.Gospel.book_string	@ltx/gr_gr_cog/bible:Mark.text
ltx/gr_gr_cog/le.go.mc.d035:lemcLI.Gospel.chapverse	1:35 – 44
ltx/gr_gr_cog/le.go.mc.d035:lemcLI.Gospel.incipit	Ἀπῆλθεν ὁ Ἰησοῦς εἰς ἔρημον τόπον,…
ltx/gr_gr_cog/le.go.mc.d035:lemcLI.Gospel.text	Τῷ καιρῷ ἐκείνῳ, ἀπῆλθεν ὁ Ἰησοῦς εἰς ἔρημον τόπον, κἀκεῖ προσηύχετο. καὶ κατεδίωξαν αὐτὸν ὁ Σίμων καὶ οἱ μετ᾿ αὐτοῦ, καὶ εὑρόντες αὐτὸν λέγουσιν αὐτῷ ὅτι πάντες σε ζητοῦσι. καὶ λέγει αὐτοῖς· ἄγωμεν εἰς τὰς ἐχομένας κωμοπόλεις, ἵνα καὶ ἐκεῖ κηρύξω· εἰς τοῦτο γὰρ ἐξελήλυθα. καὶ ἦν κηρύσσων ἐν ταῖς συναγωγαῖς αὐτῶν εἰς ὅλην τὴν Γαλιλαίαν καὶ τὰ δαιμόνια ἐκβάλλων. Καὶ ἔρχεται πρὸς αὐτὸν λεπρὸς παρακαλῶν αὐτὸν καὶ γονυπετῶν αὐτὸν καὶ λέγων αὐτῷ ὅτι ἐὰν θέλῃς, δύνασαί με καθαρίσαι. ὁ δὲ Ἰησοῦς σπλαγχνισθείς, ἐκτείνας τὴν χεῖρα ἥψατο αὐτοῦ καὶ λέγει αὐτῷ· θέλω, καθαρίσθητι. καὶ εἰπόντος αὐτοῦ εὐθέως ἀπῆλθεν ἀπ᾿ αὐτοῦ ἡ λέπρα, καὶ ἐκαθαρίσθη. καὶ ἐμβριμησάμενος αὐτῷ εὐθέως ἐξέβαλεν αὐτὸν καὶ λέγει αὐτῷ· ὅρα μηδενὶ μηδὲν εἴπῃς, ἀλλ᾿ ὕπαγε σεαυτὸν δεῖξον τῷ ἱερεῖ καὶ προσένεγκε περὶ τοῦ καθαρισμοῦ σου ἃ προσέταξε Μωϋσῆς εἰς μαρτύριον αὐτοῖς.
ltx/gr_gr_cog/le.go.mc.d035:lemcLI.Gospel.title	Τῷ Σαββάτῳ τῆς Βʹ Ἑβδομάδος τῶν Νηστειῶν
ltx/gr_gr_cog/le.go.mc.d035:lemcLI.Gospel.title_abbr	Τῷ Σαββάτῳ τῆς Βʹ τῶν Νηστειῶν
ltx/gr_gr_cog/le.go.mc.d035:lemcLI.Gospel.version	@ltx/gr_gr_cog/properties:version.designation
