ltx/gr_gr_cog/me.m03.d15:meDA.commemoration.first	Μνήμη τῶν Ἁγίων Μαρτύρων, Ἀγαπίου καὶ τῶν σὺν αὐτῷ
ltx/gr_gr_cog/me.m03.d15:meDA.commemoration.first_name	
ltx/gr_gr_cog/me.m03.d15:meDA.commemoration.first_short	Μνήμη τῶν Ἁγίων Μαρτύρων, Ἀγαπίου καὶ τῶν σὺν αὐτῷ
ltx/gr_gr_cog/me.m03.d15:meDA.commemoration.first_title	@ltx/gr_gr_cog/titles:ti.Saints
ltx/gr_gr_cog/me.m03.d15:meDA.commemoration.full	Μνήμη τῶν Ἁγίων Μαρτύρων, Ἀγαπίου καὶ τῶν σὺν αὐτῷ
ltx/gr_gr_cog/me.m03.d15:meDA.commemoration.second_name	
ltx/gr_gr_cog/me.m03.d15:meDA.commemoration.second_title	
ltx/gr_gr_cog/me.m03.d15:meDA.date	Τῌ ΙΕʹ ΜΑΡΤΙΟΥ
ltx/gr_gr_cog/me.m03.d15:meDA.fordate	διὰ τὴν 15ην Μαρτίου
ltx/gr_gr_cog/me.m03.d15:meDA.insert1	καὶ τῶν Ἁγίων Μαρτύρων, Ἀγαπίου καὶ τῶν σὺν αὐτῷ,
ltx/gr_gr_cog/me.m03.d15:meDA.insert2	ὧν καὶ τὴν μνήμην ἐπιτελοῦμεν·
ltx/gr_gr_cog/me.m03.d15:meDA.note	
ltx/gr_gr_cog/me.m03.d15:meDA.pdfcoverdate	τῆς 15ης Μαρτίου,
ltx/gr_gr_cog/me.m03.d15:meDA.pdfheaderdate	τῆς 15ης Μαρτίου
ltx/gr_gr_cog/me.m03.d15:meHO.commemorations	
ltx/gr_gr_cog/me.m03.d15:meHO.note1	
ltx/gr_gr_cog/me.m03.d15:meHO.note2	
ltx/gr_gr_cog/me.m03.d15:meHO.number	
ltx/gr_gr_cog/me.m03.d15:meHO.rank	
ltx/gr_gr_cog/me.m03.d15:meLE.commemoration1	Μνήμη τῶν Ἁγίων Μαρτύρων, Ἀγαπίου καὶ τῶν σὺν αὐτῷ.
ltx/gr_gr_cog/me.m03.d15:meLE.commemoration2	
ltx/gr_gr_cog/me.m03.d15:meLI.Kontakion1.incipit	@ltx/gr_gr_cog/me.m03.d15:meMA.Kontakion1ger.incipit
ltx/gr_gr_cog/me.m03.d15:meLI.Kontakion1.melody	@ltx/gr_gr_cog/me.m03.d15:meMA.Kontakion1ger.melody
ltx/gr_gr_cog/me.m03.d15:meLI.Kontakion1.mode	@ltx/gr_gr_cog/me.m03.d15:meMA.Kontakion1ger.mode
ltx/gr_gr_cog/me.m03.d15:meLI.Kontakion1.text	@ltx/gr_gr_cog/me.m03.d15:meMA.Kontakion1ger.text
ltx/gr_gr_cog/me.m03.d15:meLI.Megalynarion.text	
ltx/gr_gr_cog/me.m03.d15:meMA.C1.acrostic.notice1	οὗ ἡ Ἀκροστιχίς·
ltx/gr_gr_cog/me.m03.d15:meMA.C1.acrostic.text	Ἑπτὰ προσάξω μάρτυσι μελῳδίαν. Ἰωσήφ.
ltx/gr_gr_cog/me.m03.d15:meMA.C1.acrostic.title	Ὁ Κανὼν τῶν Ἁγίων,
ltx/gr_gr_cog/me.m03.d15:meMA.C1.title	@ltx/gr_gr_cog/titles:ti.CanonSaints
ltx/gr_gr_cog/me.m03.d15:meMA.C1.verse	@ltx/gr_gr_cog/prayers:pr.verse_SaintsM.text
ltx/gr_gr_cog/me.m03.d15:meMA.Kontakion1ger.incipit	Ὡς ἀγαπήσας Χριστὸν τὸν Θεὸν…
ltx/gr_gr_cog/me.m03.d15:meMA.Kontakion1ger.melody	@ltx/gr_gr_cog/he.a.m2:heAU.ToisTonAimatonSou.name
ltx/gr_gr_cog/me.m03.d15:meMA.Kontakion1ger.mode	@ltx/gr_gr_cog/miscellanea:misc.Mode2
ltx/gr_gr_cog/me.m03.d15:meMA.Kontakion1ger.poet	@ltx/gr_gr_cog/poets:po.Gerasimou
ltx/gr_gr_cog/me.m03.d15:meMA.Kontakion1ger.text	Ὡς ἀγαπήσας Χριστὸν τὸν Θεὸν ἡμῶν, τῶν ἐπιγείων ἁπάντων ἠλόγησε, Μαρτύρων χορὸς ὁ ὀκτάριθμος, καὶ κεφαλὰς ἐκτεμνόμενοι ἔκραζον· προσδέχου Οἰκτίρμον τοὺς δούλους σου.
ltx/gr_gr_cog/me.m03.d15:meMA.Ode1C11.greekmelody	@ltx/gr_gr_cog/he.h.m8:heHE.AsomenToKyrio.greekname
ltx/gr_gr_cog/me.m03.d15:meMA.Ode1C11.incipit	Ἐν τοῖς ἐπουρανίοις, Μάρτυρες ὑπάρχοντες…
ltx/gr_gr_cog/me.m03.d15:meMA.Ode1C11.melody	@ltx/gr_gr_cog/he.h.m8:heHE.AsomenToKyrio.name
ltx/gr_gr_cog/me.m03.d15:meMA.Ode1C11.mode	@ltx/gr_gr_cog/miscellanea:misc.Mode8
ltx/gr_gr_cog/me.m03.d15:meMA.Ode1C11.ode	@ltx/gr_gr_cog/miscellanea:misc.Ode1
ltx/gr_gr_cog/me.m03.d15:meMA.Ode1C11.text	Ἐν τοῖς ἐπουρανίοις, Μάρτυρες ὑπάρχοντες σκηνώμασι, τοὺς ὑμᾶς εὐφημοῦντας, ἐπὶ γῆς φωτισμοῦ ἀξιώσατε.
ltx/gr_gr_cog/me.m03.d15:meMA.Ode1C12.incipit	Πύργοι τῆς Ἐκκλησίας, ὤφθητε τὰ…
ltx/gr_gr_cog/me.m03.d15:meMA.Ode1C12.melody	@ltx/gr_gr_cog/he.h.m8:heHE.AsomenToKyrio.name
ltx/gr_gr_cog/me.m03.d15:meMA.Ode1C12.mode	@ltx/gr_gr_cog/miscellanea:misc.Mode8
ltx/gr_gr_cog/me.m03.d15:meMA.Ode1C12.ode	@ltx/gr_gr_cog/miscellanea:misc.Ode1
ltx/gr_gr_cog/me.m03.d15:meMA.Ode1C12.text	Πύργοι τῆς Ἐκκλησίας, ὤφθητε τὰ τείχη καταστρέφοντες, τῆς εἰδωλομανίας, Ἀθλοφόροι Χριστοῦ γενναιότατοι.
ltx/gr_gr_cog/me.m03.d15:meMA.Ode1C13.incipit	Τέτρωσαι τῇ ἀγάπῃ, Μάρτυς ἀξιάγαστε…
ltx/gr_gr_cog/me.m03.d15:meMA.Ode1C13.melody	@ltx/gr_gr_cog/he.h.m8:heHE.AsomenToKyrio.name
ltx/gr_gr_cog/me.m03.d15:meMA.Ode1C13.mode	@ltx/gr_gr_cog/miscellanea:misc.Mode8
ltx/gr_gr_cog/me.m03.d15:meMA.Ode1C13.ode	@ltx/gr_gr_cog/miscellanea:misc.Ode1
ltx/gr_gr_cog/me.m03.d15:meMA.Ode1C13.text	Τέτρωσαι τῇ ἀγάπῃ, Μάρτυς ἀξιάγαστε Ἀγάπιε, τοῦ Δεσπότου τῶν ὅλων, καὶ θανεῖν διʼ αὐτὸν προτεθύμησαι.
ltx/gr_gr_cog/me.m03.d15:meMA.Ode1C1H.greekmelody	@ltx/gr_gr_cog/he.h.m8:heHE.AsomenToKyrio.greekname
ltx/gr_gr_cog/me.m03.d15:meMA.Ode1C1H.incipit	@ltx/gr_gr_cog/he.h.m8:heHE.AsomenToKyrio.incipit
ltx/gr_gr_cog/me.m03.d15:meMA.Ode1C1H.melody	@ltx/gr_gr_cog/he.h.m8:heHE.AsomenToKyrio.melody
ltx/gr_gr_cog/me.m03.d15:meMA.Ode1C1H.mode	@ltx/gr_gr_cog/miscellanea:misc.Mode8
ltx/gr_gr_cog/me.m03.d15:meMA.Ode1C1H.ode	@ltx/gr_gr_cog/miscellanea:misc.Ode1
ltx/gr_gr_cog/me.m03.d15:meMA.Ode1C1H.text	@ltx/gr_gr_cog/he.h.m8:heHE.AsomenToKyrio.text
ltx/gr_gr_cog/me.m03.d15:meMA.Ode1C1T.incipit	Αἴγλῃ φαεινοτάτῃ, τοῦ ἐκ σοῦ…
ltx/gr_gr_cog/me.m03.d15:meMA.Ode1C1T.melody	@ltx/gr_gr_cog/he.h.m8:heHE.AsomenToKyrio.name
ltx/gr_gr_cog/me.m03.d15:meMA.Ode1C1T.mode	@ltx/gr_gr_cog/miscellanea:misc.Mode8
ltx/gr_gr_cog/me.m03.d15:meMA.Ode1C1T.ode	@ltx/gr_gr_cog/miscellanea:misc.Ode1
ltx/gr_gr_cog/me.m03.d15:meMA.Ode1C1T.text	Αἴγλῃ φαεινοτάτῃ, τοῦ ἐκ σοῦ Παρθένε ἀνατείλαντος, τῆς ψυχῆς μου τὰς κόρας, φωταγώγησον ὅπως δοξάζω σε.
ltx/gr_gr_cog/me.m03.d15:meMA.Ode3C11.greekmelody	@ltx/gr_gr_cog/he.h.m8:heHE.OukEstinAgios.greekname
ltx/gr_gr_cog/me.m03.d15:meMA.Ode3C11.incipit	Πυρὶ ἀναπτόμενος, τῆς ἀγάπης τοῦ…
ltx/gr_gr_cog/me.m03.d15:meMA.Ode3C11.melody	@ltx/gr_gr_cog/he.h.m8:heHE.OukEstinAgios.name
ltx/gr_gr_cog/me.m03.d15:meMA.Ode3C11.mode	@ltx/gr_gr_cog/miscellanea:misc.Mode8
ltx/gr_gr_cog/me.m03.d15:meMA.Ode3C11.ode	@ltx/gr_gr_cog/miscellanea:misc.Ode3
ltx/gr_gr_cog/me.m03.d15:meMA.Ode3C11.text	Πυρὶ ἀναπτόμενος, τῆς ἀγάπης τοῦ Χριστοῦ, τὴν πυρὰν ἐναπέσβεσας, Μάρτυς Ἀγάπιε τῆς εἰδωλομανίας, ῥοαῖς τῶν αἱμάτων σου· ὅθεν εὐφημοῦμέν σε.
ltx/gr_gr_cog/me.m03.d15:meMA.Ode3C12.incipit	Ῥομφαῖαι ὡράθητε, διακόπτουσαι τομῶς, μυριάδας…
ltx/gr_gr_cog/me.m03.d15:meMA.Ode3C12.melody	@ltx/gr_gr_cog/he.h.m8:heHE.OukEstinAgios.name
ltx/gr_gr_cog/me.m03.d15:meMA.Ode3C12.mode	@ltx/gr_gr_cog/miscellanea:misc.Mode8
ltx/gr_gr_cog/me.m03.d15:meMA.Ode3C12.ode	@ltx/gr_gr_cog/miscellanea:misc.Ode3
ltx/gr_gr_cog/me.m03.d15:meMA.Ode3C12.text	Ῥομφαῖαι ὡράθητε, διακόπτουσαι τομῶς, μυριάδας μακάριοι, δαιμόνων ἐν χάριτι, καὶ νῦν ταῖς μυριάσιν, ἡνώθητε χαίροντες, τῶν νοερῶν Δυνάμεων.
ltx/gr_gr_cog/me.m03.d15:meMA.Ode3C13.incipit	Ὁδὸν διανύοντες, μαρτυρίου ἀνδρικῶς, ἀποθέσει…
ltx/gr_gr_cog/me.m03.d15:meMA.Ode3C13.melody	@ltx/gr_gr_cog/he.h.m8:heHE.OukEstinAgios.name
ltx/gr_gr_cog/me.m03.d15:meMA.Ode3C13.mode	@ltx/gr_gr_cog/miscellanea:misc.Mode8
ltx/gr_gr_cog/me.m03.d15:meMA.Ode3C13.ode	@ltx/gr_gr_cog/miscellanea:misc.Ode3
ltx/gr_gr_cog/me.m03.d15:meMA.Ode3C13.text	Ὁδὸν διανύοντες, μαρτυρίου ἀνδρικῶς, ἀποθέσει τοῦ πνεύματος, τὴν ἄνω ἐφθάσατε Βασιλείαν, ἐν ᾗ περ ἐκέκτησθε, Μάρτυρες θεῖοι τὸ πολίτευμα.
ltx/gr_gr_cog/me.m03.d15:meMA.Ode3C1H.greekmelody	@ltx/gr_gr_cog/he.h.m8:heHE.OukEstinAgios.greekname
ltx/gr_gr_cog/me.m03.d15:meMA.Ode3C1H.incipit	@ltx/gr_gr_cog/he.h.m8:heHE.OukEstinAgios.incipit
ltx/gr_gr_cog/me.m03.d15:meMA.Ode3C1H.melody	@ltx/gr_gr_cog/he.h.m8:heHE.OukEstinAgios.melody
ltx/gr_gr_cog/me.m03.d15:meMA.Ode3C1H.mode	@ltx/gr_gr_cog/miscellanea:misc.Mode8
ltx/gr_gr_cog/me.m03.d15:meMA.Ode3C1H.ode	@ltx/gr_gr_cog/miscellanea:misc.Ode3
ltx/gr_gr_cog/me.m03.d15:meMA.Ode3C1H.text	@ltx/gr_gr_cog/he.h.m8:heHE.OukEstinAgios.text
ltx/gr_gr_cog/me.m03.d15:meMA.Ode3C1T.incipit	Σαρκὸς ὁμοιώτατι, ἐμφανισθέντα ἐκ τῆς…
ltx/gr_gr_cog/me.m03.d15:meMA.Ode3C1T.melody	@ltx/gr_gr_cog/he.h.m8:heHE.OukEstinAgios.name
ltx/gr_gr_cog/me.m03.d15:meMA.Ode3C1T.mode	@ltx/gr_gr_cog/miscellanea:misc.Mode8
ltx/gr_gr_cog/me.m03.d15:meMA.Ode3C1T.ode	@ltx/gr_gr_cog/miscellanea:misc.Ode3
ltx/gr_gr_cog/me.m03.d15:meMA.Ode3C1T.text	Σαρκὸς ὁμοιώτατι, ἐμφανισθέντα ἐκ τῆς σῆς φωτοφόρου νηδύος, τὸν Κτίστην ἐπέγνωμεν, διὰ σπλάγχνα ἐλέους, ἡμῖν τοῖς ὑμνοῦσί σε, Μῆτερ ἀειπάρθενε.
ltx/gr_gr_cog/me.m03.d15:meMA.Ode3Kathisma1.greekmelody	@ltx/gr_gr_cog/he.a.m1:heAU.TonTafonSouSotir.greekname
ltx/gr_gr_cog/me.m03.d15:meMA.Ode3Kathisma1.incipit	Ἑπτάριθμος χορός, τῶν Μαρτύρων ὑμνείσθω…
ltx/gr_gr_cog/me.m03.d15:meMA.Ode3Kathisma1.melody	@ltx/gr_gr_cog/he.a.m1:heAU.TonTafonSouSotir.name
ltx/gr_gr_cog/me.m03.d15:meMA.Ode3Kathisma1.mode	@ltx/gr_gr_cog/miscellanea:misc.Mode1
ltx/gr_gr_cog/me.m03.d15:meMA.Ode3Kathisma1.text	Ἑπτάριθμος χορός, τῶν Μαρτύρων ὑμνείσθω· αὐτοὶ γὰρ τὴν ἡμῶν ἐκδιώκουσι βλάβην, ὡς φύλακες τῆς Πίστεως, Ἐκκλησίας προπύργια, οὗτοι φάλαγγας, ἀποσοβοῦσι δαιμόνων, καὶ πρεσβεύουσιν, ὑπὲρ ἡμῶν τὸν Δεσπότην, εἰρήνην βραβεύοντες.
ltx/gr_gr_cog/me.m03.d15:meMA.Ode3KathismaSt.incipit	Ἡ ἄσπιλος Ἀμνάς, τὸν Ἀμνὸν…
ltx/gr_gr_cog/me.m03.d15:meMA.Ode3KathismaSt.melody	@ltx/gr_gr_cog/he.a.m1:heAU.TonTafonSouSotir.name
ltx/gr_gr_cog/me.m03.d15:meMA.Ode3KathismaSt.mode	@ltx/gr_gr_cog/miscellanea:misc.Mode1
ltx/gr_gr_cog/me.m03.d15:meMA.Ode3KathismaSt.text	Ἡ ἄσπιλος Ἀμνάς, τὸν Ἀμνὸν καὶ Ποιμένα, κρεμάμενον νεκρόν, ἐπὶ ξύλου ὁρῶσα, θρηνοῦσα ἐφθέγγετο, μητρικῶς ἀλαλάζουσα· Πῶς ἐνέγκω σου, τὴν ὑπὲρ λόγον Υἱέ μου, συγκατάβασιν, καὶ τὰ ἑκούσια Πάθη, Θεὲ ὑπεράγαθε;
ltx/gr_gr_cog/me.m03.d15:meMA.Ode3KathismaT.incipit	Μητέρα σε Θεοῦ, ἐπιστάμεθα πάντες…
ltx/gr_gr_cog/me.m03.d15:meMA.Ode3KathismaT.melody	@ltx/gr_gr_cog/he.a.m1:heAU.TonTafonSouSotir.name
ltx/gr_gr_cog/me.m03.d15:meMA.Ode3KathismaT.mode	@ltx/gr_gr_cog/miscellanea:misc.Mode1
ltx/gr_gr_cog/me.m03.d15:meMA.Ode3KathismaT.text	Μητέρα σε Θεοῦ, ἐπιστάμεθα πάντες, Παρθένον ἀληθῶς, καὶ μετὰ τόκον ὀφθεῖσαν, οἱ πόθῳ καταφεύγοντες, πρὸς τὴν σὴν ἀγαθότητα· σὲ γὰρ ἔχομεν, ἁμαρτωλοὶ προστασίαν, σὲ κεκτήμεθα, ἐν πειρασμοῖς σωτηρίαν, τὴν μόνην πανάμωμον.
ltx/gr_gr_cog/me.m03.d15:meMA.Ode4C11.greekmelody	@ltx/gr_gr_cog/he.h.m8:heHE.ExOrousKataskiou.greekname
ltx/gr_gr_cog/me.m03.d15:meMA.Ode4C11.incipit	Ἄγαν τὸν Χριστὸν Ἀγάπιε ποθήσας…
ltx/gr_gr_cog/me.m03.d15:meMA.Ode4C11.melody	@ltx/gr_gr_cog/he.h.m8:heHE.ExOrousKataskiou.name
ltx/gr_gr_cog/me.m03.d15:meMA.Ode4C11.mode	@ltx/gr_gr_cog/miscellanea:misc.Mode8
ltx/gr_gr_cog/me.m03.d15:meMA.Ode4C11.ode	@ltx/gr_gr_cog/miscellanea:misc.Ode4
ltx/gr_gr_cog/me.m03.d15:meMA.Ode4C11.text	Ἄγαν τὸν Χριστὸν Ἀγάπιε ποθήσας, πάθη τὰ αὐτοῦ ἀνδρείως ἐμιμήσω, σφαγιασθεὶς ὡς ἀρνίον ἐθελουσίως, Μεγαλομάρτυς ἀξιάγαστε.
ltx/gr_gr_cog/me.m03.d15:meMA.Ode4C12.incipit	Ξίφει ἑαυτοὺς ἐνδόντες ὁλοψύχως, Μάρτυρες…
ltx/gr_gr_cog/me.m03.d15:meMA.Ode4C12.melody	@ltx/gr_gr_cog/he.h.m8:heHE.ExOrousKataskiou.name
ltx/gr_gr_cog/me.m03.d15:meMA.Ode4C12.mode	@ltx/gr_gr_cog/miscellanea:misc.Mode8
ltx/gr_gr_cog/me.m03.d15:meMA.Ode4C12.ode	@ltx/gr_gr_cog/miscellanea:misc.Ode4
ltx/gr_gr_cog/me.m03.d15:meMA.Ode4C12.text	Ξίφει ἑαυτοὺς ἐνδόντες ὁλοψύχως, Μάρτυρες σοφοὶ ῥανίσι τῶν αἱμάτων, ἐπορφυρώσατε χλαῖναν, ἣν στολισθέντες, τοὺς οὐρανοὺς περιπολεύετε.
ltx/gr_gr_cog/me.m03.d15:meMA.Ode4C13.incipit	Ὢ τῆς πρὸς Θεὸν ὑμῶν…
ltx/gr_gr_cog/me.m03.d15:meMA.Ode4C13.melody	@ltx/gr_gr_cog/he.h.m8:heHE.ExOrousKataskiou.name
ltx/gr_gr_cog/me.m03.d15:meMA.Ode4C13.mode	@ltx/gr_gr_cog/miscellanea:misc.Mode8
ltx/gr_gr_cog/me.m03.d15:meMA.Ode4C13.ode	@ltx/gr_gr_cog/miscellanea:misc.Ode4
ltx/gr_gr_cog/me.m03.d15:meMA.Ode4C13.text	Ὢ τῆς πρὸς Θεὸν ὑμῶν θερμῆς ἀγάπης! διʼ ἧς ἑαυτοὺς ἠρνήσασθε τελείως, καὶ βιαιότατον θάνατον ὑποστάντες, ἀθανασίας ἠξιώθητε.
ltx/gr_gr_cog/me.m03.d15:meMA.Ode4C1H.greekmelody	@ltx/gr_gr_cog/he.h.m8:heHE.ExOrousKataskiou.greekname
ltx/gr_gr_cog/me.m03.d15:meMA.Ode4C1H.incipit	@ltx/gr_gr_cog/he.h.m8:heHE.ExOrousKataskiou.incipit
ltx/gr_gr_cog/me.m03.d15:meMA.Ode4C1H.melody	@ltx/gr_gr_cog/he.h.m8:heHE.ExOrousKataskiou.melody
ltx/gr_gr_cog/me.m03.d15:meMA.Ode4C1H.mode	@ltx/gr_gr_cog/miscellanea:misc.Mode8
ltx/gr_gr_cog/me.m03.d15:meMA.Ode4C1H.ode	@ltx/gr_gr_cog/miscellanea:misc.Ode4
ltx/gr_gr_cog/me.m03.d15:meMA.Ode4C1H.text	@ltx/gr_gr_cog/he.h.m8:heHE.ExOrousKataskiou.text
ltx/gr_gr_cog/me.m03.d15:meMA.Ode4C1T.incipit	Μύρον ἐν γαστρὶ τὸν Λόγον…
ltx/gr_gr_cog/me.m03.d15:meMA.Ode4C1T.melody	@ltx/gr_gr_cog/he.h.m8:heHE.ExOrousKataskiou.name
ltx/gr_gr_cog/me.m03.d15:meMA.Ode4C1T.mode	@ltx/gr_gr_cog/miscellanea:misc.Mode8
ltx/gr_gr_cog/me.m03.d15:meMA.Ode4C1T.ode	@ltx/gr_gr_cog/miscellanea:misc.Ode4
ltx/gr_gr_cog/me.m03.d15:meMA.Ode4C1T.text	Μύρον ἐν γαστρὶ τὸν Λόγον ὑπεδέξω, ἄχραντε Ἁγνὴ τὸν κόσμον δυσωδίας, ἀποκαθαίροντα πάσης τῶν ἐπταισμένων· ὅθεν πιστῶς σε μακαρίζομεν.
ltx/gr_gr_cog/me.m03.d15:meMA.Ode5C11.greekmelody	@ltx/gr_gr_cog/he.h.m8:heHE.OEkNyktosAgnoias.greekname
ltx/gr_gr_cog/me.m03.d15:meMA.Ode5C11.incipit	Ἀγαπητὸς τῇ πράξει, ὡς καὶ…
ltx/gr_gr_cog/me.m03.d15:meMA.Ode5C11.melody	@ltx/gr_gr_cog/he.h.m8:heHE.OEkNyktosAgnoias.name
ltx/gr_gr_cog/me.m03.d15:meMA.Ode5C11.mode	@ltx/gr_gr_cog/miscellanea:misc.Mode8
ltx/gr_gr_cog/me.m03.d15:meMA.Ode5C11.ode	@ltx/gr_gr_cog/miscellanea:misc.Ode5
ltx/gr_gr_cog/me.m03.d15:meMA.Ode5C11.text	Ἀγαπητὸς τῇ πράξει, ὡς καὶ τῇ κλήσει γενόμενος Ἔνδοξε, ἤθλησας διʼ ἀγάπην, τοῦ παμβασιλέως Θεοῦ ἡμῶν.
ltx/gr_gr_cog/me.m03.d15:meMA.Ode5C12.incipit	Ῥῆμα δεινοῦ τυράννου, ἐξεφαυλίσατε Ἅγιοι…
ltx/gr_gr_cog/me.m03.d15:meMA.Ode5C12.melody	@ltx/gr_gr_cog/he.h.m8:heHE.OEkNyktosAgnoias.name
ltx/gr_gr_cog/me.m03.d15:meMA.Ode5C12.mode	@ltx/gr_gr_cog/miscellanea:misc.Mode8
ltx/gr_gr_cog/me.m03.d15:meMA.Ode5C12.ode	@ltx/gr_gr_cog/miscellanea:misc.Ode5
ltx/gr_gr_cog/me.m03.d15:meMA.Ode5C12.text	Ῥῆμα δεινοῦ τυράννου, ἐξεφαυλίσατε Ἅγιοι Μάρτυρες, καὶ Χριστῷ στρατευθέντες, φάλαγγας δαιμόνων ὠλέσατε.
ltx/gr_gr_cog/me.m03.d15:meMA.Ode5C13.incipit	Τοῖς ἱεροῖς ἀγῶσι, καταβαλόντες ἀνόμων…
ltx/gr_gr_cog/me.m03.d15:meMA.Ode5C13.melody	@ltx/gr_gr_cog/he.h.m8:heHE.OEkNyktosAgnoias.name
ltx/gr_gr_cog/me.m03.d15:meMA.Ode5C13.mode	@ltx/gr_gr_cog/miscellanea:misc.Mode8
ltx/gr_gr_cog/me.m03.d15:meMA.Ode5C13.ode	@ltx/gr_gr_cog/miscellanea:misc.Ode5
ltx/gr_gr_cog/me.m03.d15:meMA.Ode5C13.text	Τοῖς ἱεροῖς ἀγῶσι, καταβαλόντες ἀνόμων τὸ φρύαγμα, στέφος ἀθανασίας, Μάρτυρες Χριστῷ ἀνεδήσασθε.
ltx/gr_gr_cog/me.m03.d15:meMA.Ode5C1H.greekmelody	@ltx/gr_gr_cog/he.h.m8:heHE.OEkNyktosAgnoias.greekname
ltx/gr_gr_cog/me.m03.d15:meMA.Ode5C1H.incipit	@ltx/gr_gr_cog/he.h.m8:heHE.OEkNyktosAgnoias.incipit
ltx/gr_gr_cog/me.m03.d15:meMA.Ode5C1H.melody	@ltx/gr_gr_cog/he.h.m8:heHE.OEkNyktosAgnoias.melody
ltx/gr_gr_cog/me.m03.d15:meMA.Ode5C1H.mode	@ltx/gr_gr_cog/miscellanea:misc.Mode8
ltx/gr_gr_cog/me.m03.d15:meMA.Ode5C1H.ode	@ltx/gr_gr_cog/miscellanea:misc.Ode5
ltx/gr_gr_cog/me.m03.d15:meMA.Ode5C1H.text	@ltx/gr_gr_cog/he.h.m8:heHE.OEkNyktosAgnoias.text
ltx/gr_gr_cog/me.m03.d15:meMA.Ode5C1T.incipit	Ὑμνολογίαις θείαις, τὴν Θεοτόκον πιστοὶ…
ltx/gr_gr_cog/me.m03.d15:meMA.Ode5C1T.melody	@ltx/gr_gr_cog/he.h.m8:heHE.OEkNyktosAgnoias.name
ltx/gr_gr_cog/me.m03.d15:meMA.Ode5C1T.mode	@ltx/gr_gr_cog/miscellanea:misc.Mode8
ltx/gr_gr_cog/me.m03.d15:meMA.Ode5C1T.ode	@ltx/gr_gr_cog/miscellanea:misc.Ode5
ltx/gr_gr_cog/me.m03.d15:meMA.Ode5C1T.text	Ὑμνολογίαις θείαις, τὴν Θεοτόκον πιστοὶ μακαρίσωμεν, χαῖρε λέγοντες, πύλη, μόνος ἣν διώδευσε Κύριος.
ltx/gr_gr_cog/me.m03.d15:meMA.Ode6C11.greekmelody	@ltx/gr_gr_cog/he.h.m8:heHE.IlasthitiMoiSotir.greekname
ltx/gr_gr_cog/me.m03.d15:meMA.Ode6C11.incipit	Σὺν Ἀλεξάνδροις δυσί, Διονυσίοις τε…
ltx/gr_gr_cog/me.m03.d15:meMA.Ode6C11.melody	@ltx/gr_gr_cog/he.h.m8:heHE.IlasthitiMoiSotir.name
ltx/gr_gr_cog/me.m03.d15:meMA.Ode6C11.mode	@ltx/gr_gr_cog/miscellanea:misc.Mode8
ltx/gr_gr_cog/me.m03.d15:meMA.Ode6C11.ode	@ltx/gr_gr_cog/miscellanea:misc.Ode6
ltx/gr_gr_cog/me.m03.d15:meMA.Ode6C11.text	Σὺν Ἀλεξάνδροις δυσί, Διονυσίοις τε μέλψωμεν, Ἀγάπιον τὸν κλεινόν, Τιμόλαον Ῥώμυλον, στεῤῥῶς ἐναθλήσαντας, καὶ τὰς μυριάδας, τοῦ ἐχθροῦ καταπαλαίσαντας.
ltx/gr_gr_cog/me.m03.d15:meMA.Ode6C12.incipit	Ἰάσεων ποταμούς, ἀναπηγάζοντες Μάρτυρες, τὰ…
ltx/gr_gr_cog/me.m03.d15:meMA.Ode6C12.melody	@ltx/gr_gr_cog/he.h.m8:heHE.IlasthitiMoiSotir.name
ltx/gr_gr_cog/me.m03.d15:meMA.Ode6C12.mode	@ltx/gr_gr_cog/miscellanea:misc.Mode8
ltx/gr_gr_cog/me.m03.d15:meMA.Ode6C12.ode	@ltx/gr_gr_cog/miscellanea:misc.Ode6
ltx/gr_gr_cog/me.m03.d15:meMA.Ode6C12.text	Ἰάσεων ποταμούς, ἀναπηγάζοντες Μάρτυρες, τὰ πάθη τῶν γηγενῶν, ἐνθέως καθαίρετε· διὰ τοῦτο χαίροντες, τὰ ὑμῶν ἐν πίστει, εὐφημοῦμεν προτερήματα.
ltx/gr_gr_cog/me.m03.d15:meMA.Ode6C13.incipit	Νομίμως τὸν ἱερόν, ἀγῶνα διατελέσαντες…
ltx/gr_gr_cog/me.m03.d15:meMA.Ode6C13.melody	@ltx/gr_gr_cog/he.h.m8:heHE.IlasthitiMoiSotir.name
ltx/gr_gr_cog/me.m03.d15:meMA.Ode6C13.mode	@ltx/gr_gr_cog/miscellanea:misc.Mode8
ltx/gr_gr_cog/me.m03.d15:meMA.Ode6C13.ode	@ltx/gr_gr_cog/miscellanea:misc.Ode6
ltx/gr_gr_cog/me.m03.d15:meMA.Ode6C13.text	Νομίμως τὸν ἱερόν, ἀγῶνα διατελέσαντες, νομίμως παντουργικῇ, παλάμῃ ἐστέφθητε, ἑπτάριθμοι Μάρτυρες, οὐρανοπολῖται, τῶν Ἀγγέλων ἰσοστάσιοι.
ltx/gr_gr_cog/me.m03.d15:meMA.Ode6C1H.greekmelody	@ltx/gr_gr_cog/he.h.m8:heHE.IlasthitiMoiSotir.greekname
ltx/gr_gr_cog/me.m03.d15:meMA.Ode6C1H.incipit	@ltx/gr_gr_cog/he.h.m8:heHE.IlasthitiMoiSotir.incipit
ltx/gr_gr_cog/me.m03.d15:meMA.Ode6C1H.melody	@ltx/gr_gr_cog/he.h.m8:heHE.IlasthitiMoiSotir.melody
ltx/gr_gr_cog/me.m03.d15:meMA.Ode6C1H.mode	@ltx/gr_gr_cog/miscellanea:misc.Mode8
ltx/gr_gr_cog/me.m03.d15:meMA.Ode6C1H.ode	@ltx/gr_gr_cog/miscellanea:misc.Ode6
ltx/gr_gr_cog/me.m03.d15:meMA.Ode6C1H.text	@ltx/gr_gr_cog/he.h.m8:heHE.IlasthitiMoiSotir.text
ltx/gr_gr_cog/me.m03.d15:meMA.Ode6C1T.incipit	Μαράνασα τὰ φυτά, τῆς ἀθεΐας…
ltx/gr_gr_cog/me.m03.d15:meMA.Ode6C1T.melody	@ltx/gr_gr_cog/he.h.m8:heHE.IlasthitiMoiSotir.name
ltx/gr_gr_cog/me.m03.d15:meMA.Ode6C1T.mode	@ltx/gr_gr_cog/miscellanea:misc.Mode8
ltx/gr_gr_cog/me.m03.d15:meMA.Ode6C1T.ode	@ltx/gr_gr_cog/miscellanea:misc.Ode6
ltx/gr_gr_cog/me.m03.d15:meMA.Ode6C1T.text	Μαράνασα τὰ φυτά, τῆς ἀθεΐας Πανάμωμε, τῷ σῷ Ἁγίῳ βλαστῷ, τὴν ἀναβλαστάνουσαν, ἐν ἐμοὶ ἑκάστοτε, τοῦ ἐχθροῦ κακίαν, ἀπομείωσον Θεόνυμφε.
ltx/gr_gr_cog/me.m03.d15:meMA.Ode7C11.greekmelody	@ltx/gr_gr_cog/he.h.m8:heHE.OiEkTisIoudaias.greekname
ltx/gr_gr_cog/me.m03.d15:meMA.Ode7C11.incipit	Ἑαυτοὺς ἑκουσίως, πρὸς σφαγὴν ὡς…
ltx/gr_gr_cog/me.m03.d15:meMA.Ode7C11.melody	@ltx/gr_gr_cog/he.h.m8:heHE.OiEkTisIoudaias.name
ltx/gr_gr_cog/me.m03.d15:meMA.Ode7C11.mode	@ltx/gr_gr_cog/miscellanea:misc.Mode8
ltx/gr_gr_cog/me.m03.d15:meMA.Ode7C11.ode	@ltx/gr_gr_cog/miscellanea:misc.Ode7
ltx/gr_gr_cog/me.m03.d15:meMA.Ode7C11.text	Ἑαυτοὺς ἑκουσίως, πρὸς σφαγὴν ὡς ἀρνία παραδεδώκατε, μὴ πτήξαντες βασάνους, πανεύφημοι ὁπλῖται, ἀλλʼ εὐθύμως κραυγάζοντες· ὁ τῶν Πατέρων ἡμῶν, Θεὸς εὐλογητός εἶ.
ltx/gr_gr_cog/me.m03.d15:meMA.Ode7C12.incipit	Λαμπρυνθεὶς τῇ ἀγάπῃ, τοῦ τῶν…
ltx/gr_gr_cog/me.m03.d15:meMA.Ode7C12.melody	@ltx/gr_gr_cog/he.h.m8:heHE.OiEkTisIoudaias.name
ltx/gr_gr_cog/me.m03.d15:meMA.Ode7C12.mode	@ltx/gr_gr_cog/miscellanea:misc.Mode8
ltx/gr_gr_cog/me.m03.d15:meMA.Ode7C12.ode	@ltx/gr_gr_cog/miscellanea:misc.Ode7
ltx/gr_gr_cog/me.m03.d15:meMA.Ode7C12.text	Λαμπρυνθεὶς τῇ ἀγάπῃ, τοῦ τῶν ὅλων Δεσπότου, Μάρτυς Ἀγάπιε, ὑπέκλινας αὐχένα, τῷ ξίφει καὶ Μαρτύρων, ἠριθμήθης στρατεύμασιν· Ὁ τῶν Πατέρων βοῶν, Θεὸς εὐλογητός εἶ.
ltx/gr_gr_cog/me.m03.d15:meMA.Ode7C13.incipit	Ὡς λυχνία ὁρᾶσθε, ἐν τῷ…
ltx/gr_gr_cog/me.m03.d15:meMA.Ode7C13.melody	@ltx/gr_gr_cog/he.h.m8:heHE.OiEkTisIoudaias.name
ltx/gr_gr_cog/me.m03.d15:meMA.Ode7C13.mode	@ltx/gr_gr_cog/miscellanea:misc.Mode8
ltx/gr_gr_cog/me.m03.d15:meMA.Ode7C13.ode	@ltx/gr_gr_cog/miscellanea:misc.Ode7
ltx/gr_gr_cog/me.m03.d15:meMA.Ode7C13.text	Ὡς λυχνία ὁρᾶσθε, ἐν τῷ οἴκῳ Κυρίου Μάρτυρες ἔνδοξοι, ἑπτάφωτος τῷ κόσμῳ, φωτίζουσα βοῶντας, τοὺς ἐν πίστει προφθάνοντας· ὁ τῶν Πατέρων ἡμῶν, Θεὸς εὐλογητός εἶ.
ltx/gr_gr_cog/me.m03.d15:meMA.Ode7C1H.greekmelody	@ltx/gr_gr_cog/he.h.m8:heHE.OiEkTisIoudaias.greekname
ltx/gr_gr_cog/me.m03.d15:meMA.Ode7C1H.incipit	@ltx/gr_gr_cog/he.h.m8:heHE.OiEkTisIoudaias.incipit
ltx/gr_gr_cog/me.m03.d15:meMA.Ode7C1H.melody	@ltx/gr_gr_cog/he.h.m8:heHE.OiEkTisIoudaias.melody
ltx/gr_gr_cog/me.m03.d15:meMA.Ode7C1H.mode	@ltx/gr_gr_cog/miscellanea:misc.Mode8
ltx/gr_gr_cog/me.m03.d15:meMA.Ode7C1H.ode	@ltx/gr_gr_cog/miscellanea:misc.Ode7
ltx/gr_gr_cog/me.m03.d15:meMA.Ode7C1H.text	@ltx/gr_gr_cog/he.h.m8:heHE.OiEkTisIoudaias.text
ltx/gr_gr_cog/me.m03.d15:meMA.Ode7C1T.incipit	Δεδεμένον σειραῖς με, ἀμυθήτων πταισμάτων…
ltx/gr_gr_cog/me.m03.d15:meMA.Ode7C1T.melody	@ltx/gr_gr_cog/he.h.m8:heHE.OiEkTisIoudaias.name
ltx/gr_gr_cog/me.m03.d15:meMA.Ode7C1T.mode	@ltx/gr_gr_cog/miscellanea:misc.Mode8
ltx/gr_gr_cog/me.m03.d15:meMA.Ode7C1T.ode	@ltx/gr_gr_cog/miscellanea:misc.Ode7
ltx/gr_gr_cog/me.m03.d15:meMA.Ode7C1T.text	Δεδεμένον σειραῖς με, ἀμυθήτων πταισμάτων λῦσον Πανάμωμε, παρέχουσά μοι ὄμβρους, δακρύων μελῳδοῦντι, τῷ ἐκ σοῦ ἀνατείλαντι, ὁ τῶν Πατέρων ἡμῶν, Θεὸς εὐλογητός εἶ.
ltx/gr_gr_cog/me.m03.d15:meMA.Ode8C11.greekmelody	@ltx/gr_gr_cog/he.h.m8:heHE.TonEnOreiAgio.greekname
ltx/gr_gr_cog/me.m03.d15:meMA.Ode8C11.incipit	Ἰατῆρες ποικίλων νοσημάτων, χειρουργίᾳ τοῦ…
ltx/gr_gr_cog/me.m03.d15:meMA.Ode8C11.melody	@ltx/gr_gr_cog/he.h.m8:heHE.TonEnOreiAgio.name
ltx/gr_gr_cog/me.m03.d15:meMA.Ode8C11.mode	@ltx/gr_gr_cog/miscellanea:misc.Mode8
ltx/gr_gr_cog/me.m03.d15:meMA.Ode8C11.ode	@ltx/gr_gr_cog/miscellanea:misc.Ode8
ltx/gr_gr_cog/me.m03.d15:meMA.Ode8C11.text	Ἰατῆρες ποικίλων νοσημάτων, χειρουργίᾳ τοῦ Πνεύματος δειχθέντες, πάσας ἡμῶν τὰς νόσους θεραπεύετε, ὅπως εὐφημῶμεν, καὶ δοξολογῶμεν, ὑμῶν τὴν θείαν μνήμην.
ltx/gr_gr_cog/me.m03.d15:meMA.Ode8C12.incipit	Ἀγαπήσας Θεόν, πρὸς τοῦτο Μάρτυς…
ltx/gr_gr_cog/me.m03.d15:meMA.Ode8C12.melody	@ltx/gr_gr_cog/he.h.m8:heHE.TonEnOreiAgio.name
ltx/gr_gr_cog/me.m03.d15:meMA.Ode8C12.mode	@ltx/gr_gr_cog/miscellanea:misc.Mode8
ltx/gr_gr_cog/me.m03.d15:meMA.Ode8C12.ode	@ltx/gr_gr_cog/miscellanea:misc.Ode8
ltx/gr_gr_cog/me.m03.d15:meMA.Ode8C12.text	Ἀγαπήσας Θεόν, πρὸς τοῦτο Μάρτυς ἠγαπήθης· διό σε τὸν ἀγῶνα, τὸν θεῖον ἐκτελέσαντα προσήκατο, σὺν τοῖς ὁμοζήλοις, ἐν ἐπουρανίοις, Ἀγάπιε θαλάμοις.
ltx/gr_gr_cog/me.m03.d15:meMA.Ode8C13.incipit	Νευρωθέντες τῇ πίστει τοῦ Δεσπότου…
ltx/gr_gr_cog/me.m03.d15:meMA.Ode8C13.melody	@ltx/gr_gr_cog/he.h.m8:heHE.TonEnOreiAgio.name
ltx/gr_gr_cog/me.m03.d15:meMA.Ode8C13.mode	@ltx/gr_gr_cog/miscellanea:misc.Mode8
ltx/gr_gr_cog/me.m03.d15:meMA.Ode8C13.ode	@ltx/gr_gr_cog/miscellanea:misc.Ode8
ltx/gr_gr_cog/me.m03.d15:meMA.Ode8C13.text	Νευρωθέντες τῇ πίστει τοῦ Δεσπότου, δυναστείαν καθείλετε τοῦ πλάνου, καὶ εὐκλεῶς ταῖς νίκαις κλεϊζόμενοι, εἰς ἐπουρανίους, Μάρτυρες Κυρίου, οἰκεῖτε καταπαύσεις.
ltx/gr_gr_cog/me.m03.d15:meMA.Ode8C1H.greekmelody	@ltx/gr_gr_cog/he.h.m8:heHE.TonEnOreiAgio.greekname
ltx/gr_gr_cog/me.m03.d15:meMA.Ode8C1H.incipit	@ltx/gr_gr_cog/he.h.m8:heHE.TonEnOreiAgio.incipit
ltx/gr_gr_cog/me.m03.d15:meMA.Ode8C1H.melody	@ltx/gr_gr_cog/he.h.m8:heHE.TonEnOreiAgio.melody
ltx/gr_gr_cog/me.m03.d15:meMA.Ode8C1H.mode	@ltx/gr_gr_cog/miscellanea:misc.Mode8
ltx/gr_gr_cog/me.m03.d15:meMA.Ode8C1H.ode	@ltx/gr_gr_cog/miscellanea:misc.Ode8
ltx/gr_gr_cog/me.m03.d15:meMA.Ode8C1H.text	@ltx/gr_gr_cog/he.h.m8:heHE.TonEnOreiAgio.text
ltx/gr_gr_cog/me.m03.d15:meMA.Ode8C1T.incipit	Ἴασαί μου τὰ πάθη τῆς…
ltx/gr_gr_cog/me.m03.d15:meMA.Ode8C1T.melody	@ltx/gr_gr_cog/he.h.m8:heHE.TonEnOreiAgio.name
ltx/gr_gr_cog/me.m03.d15:meMA.Ode8C1T.mode	@ltx/gr_gr_cog/miscellanea:misc.Mode8
ltx/gr_gr_cog/me.m03.d15:meMA.Ode8C1T.ode	@ltx/gr_gr_cog/miscellanea:misc.Ode8
ltx/gr_gr_cog/me.m03.d15:meMA.Ode8C1T.text	Ἴασαί μου τὰ πάθη τῆς καρδίας, ἀπαθείας πηγὴν ἡ τετοκυῖα, καὶ πρὸς ζωήν, με θείαν καθοδήγησον, ἵνα σε δοξάζω, Μῆτερ τοῦ Σωτῆρος, εἰς πάντας τοὺς αἰῶνας.
ltx/gr_gr_cog/me.m03.d15:meMA.Ode9C11.greekmelody	@ltx/gr_gr_cog/he.h.m8:heHE.KyriosTheotokon.greekname
ltx/gr_gr_cog/me.m03.d15:meMA.Ode9C11.incipit	Ὡραῖοι γεγονότες, θείαις εὐμορφίαις, τῆς…
ltx/gr_gr_cog/me.m03.d15:meMA.Ode9C11.melody	@ltx/gr_gr_cog/he.h.m8:heHE.KyriosTheotokon.name
ltx/gr_gr_cog/me.m03.d15:meMA.Ode9C11.mode	@ltx/gr_gr_cog/miscellanea:misc.Mode8
ltx/gr_gr_cog/me.m03.d15:meMA.Ode9C11.ode	@ltx/gr_gr_cog/miscellanea:misc.Ode9
ltx/gr_gr_cog/me.m03.d15:meMA.Ode9C11.text	Ὡραῖοι γεγονότες, θείαις εὐμορφίαις, τῆς μαρτυρίας Κυρίῳ παρέστητε, καὶ σὺν αὐτῷ Ἀθλοφόροι ἀεὶ εὐφραίνεσθε.
ltx/gr_gr_cog/me.m03.d15:meMA.Ode9C12.incipit	Στρατὸς ὑμᾶς Ἀγγέλων, ἐπανακομίζει, διαζευχθέντας…
ltx/gr_gr_cog/me.m03.d15:meMA.Ode9C12.melody	@ltx/gr_gr_cog/he.h.m8:heHE.KyriosTheotokon.name
ltx/gr_gr_cog/me.m03.d15:meMA.Ode9C12.mode	@ltx/gr_gr_cog/miscellanea:misc.Mode8
ltx/gr_gr_cog/me.m03.d15:meMA.Ode9C12.ode	@ltx/gr_gr_cog/miscellanea:misc.Ode9
ltx/gr_gr_cog/me.m03.d15:meMA.Ode9C12.text	Στρατὸς ὑμᾶς Ἀγγέλων, ἐπανακομίζει, διαζευχθέντας τοῦ σώματος Μάρτυρες, πρὸς τὴν οὐράνιον πόλιν, πρὸς φῶς ἀνέσπερον.
ltx/gr_gr_cog/me.m03.d15:meMA.Ode9C13.incipit	Ἡμῶν τῶν ἐκτελούντων, σήμερον τὴν…
ltx/gr_gr_cog/me.m03.d15:meMA.Ode9C13.melody	@ltx/gr_gr_cog/he.h.m8:heHE.KyriosTheotokon.name
ltx/gr_gr_cog/me.m03.d15:meMA.Ode9C13.mode	@ltx/gr_gr_cog/miscellanea:misc.Mode8
ltx/gr_gr_cog/me.m03.d15:meMA.Ode9C13.ode	@ltx/gr_gr_cog/miscellanea:misc.Ode9
ltx/gr_gr_cog/me.m03.d15:meMA.Ode9C13.text	Ἡμῶν τῶν ἐκτελούντων, σήμερον τὴν μνήμην, τὴν ἱερὰν ὑμῶν Μάρτυρες ἔνδοξοι, πρὸς τὸν Θεὸν μνημονεύειν μὴ διαλίπητε.
ltx/gr_gr_cog/me.m03.d15:meMA.Ode9C1H.greekmelody	@ltx/gr_gr_cog/he.h.m8:heHE.KyriosTheotokon.greekname
ltx/gr_gr_cog/me.m03.d15:meMA.Ode9C1H.incipit	@ltx/gr_gr_cog/he.h.m8:heHE.KyriosTheotokon.incipit
ltx/gr_gr_cog/me.m03.d15:meMA.Ode9C1H.melody	@ltx/gr_gr_cog/he.h.m8:heHE.KyriosTheotokon.melody
ltx/gr_gr_cog/me.m03.d15:meMA.Ode9C1H.mode	@ltx/gr_gr_cog/miscellanea:misc.Mode8
ltx/gr_gr_cog/me.m03.d15:meMA.Ode9C1H.ode	@ltx/gr_gr_cog/miscellanea:misc.Ode9
ltx/gr_gr_cog/me.m03.d15:meMA.Ode9C1H.text	@ltx/gr_gr_cog/he.h.m8:heHE.KyriosTheotokon.text
ltx/gr_gr_cog/me.m03.d15:meMA.Ode9C1T.incipit	Φωτί με μετανοίας, τὸν ἐσκοτισμένον…
ltx/gr_gr_cog/me.m03.d15:meMA.Ode9C1T.melody	@ltx/gr_gr_cog/he.h.m8:heHE.KyriosTheotokon.name
ltx/gr_gr_cog/me.m03.d15:meMA.Ode9C1T.mode	@ltx/gr_gr_cog/miscellanea:misc.Mode8
ltx/gr_gr_cog/me.m03.d15:meMA.Ode9C1T.ode	@ltx/gr_gr_cog/miscellanea:misc.Ode9
ltx/gr_gr_cog/me.m03.d15:meMA.Ode9C1T.text	Φωτί με μετανοίας, τὸν ἐσκοτισμένον, τῇ ἀμελείᾳ Πανάμωμε λάμπρυνον, ὅπως ὑμνῶ καὶ δοξάζω τὰ μεγαλεῖά σου.
ltx/gr_gr_cog/me.m03.d15:meVE.Apolytikion1ger.greekmelody	@ltx/gr_gr_cog/he.a.m4:heAU.TachyProkatalave.greekname
ltx/gr_gr_cog/me.m03.d15:meVE.Apolytikion1ger.incipit	Ἀγάπῃ τοῦ Κτίσαντος, πεπυρσευμένος τὸν…
ltx/gr_gr_cog/me.m03.d15:meVE.Apolytikion1ger.melody	@ltx/gr_gr_cog/he.a.m4:heAU.TachyProkatalave.name
ltx/gr_gr_cog/me.m03.d15:meVE.Apolytikion1ger.mode	@ltx/gr_gr_cog/miscellanea:misc.Mode4
ltx/gr_gr_cog/me.m03.d15:meVE.Apolytikion1ger.poet	@ltx/gr_gr_cog/poets:po.Gerasimou
ltx/gr_gr_cog/me.m03.d15:meVE.Apolytikion1ger.text	Ἀγάπῃ τοῦ Κτίσαντος, πεπυρσευμένος τὸν νοῦν, χορείαν συνήθροισας, πανευκλεῶν Ἀθλητῶν, Ἀγάπιε ἔνδοξε· ὅθεν σὺν τούτοις Μάρτυς, ἀριστεύσας νομίμως, ξίφει τὸν σὸν αὐχένα, σὺν αὐτοῖς ἀπετμήθης· μεθʼ ὧν ἀεὶ ἐκδυσώπει, δοῦναι ἡμῖν ἄφεσιν.
ltx/gr_gr_cog/me.m03.d15:meVE.SticStavrotheotokion.greekmelody	@ltx/gr_gr_cog/he.a.m8:heAU.OTouParadoxou.greekname
ltx/gr_gr_cog/me.m03.d15:meVE.SticStavrotheotokion.incipit	Ἥλιος Τέκνον ἠμαύρωται…
ltx/gr_gr_cog/me.m03.d15:meVE.SticStavrotheotokion.melody	@ltx/gr_gr_cog/he.a.m8:heAU.OTouParadoxou.name
ltx/gr_gr_cog/me.m03.d15:meVE.SticStavrotheotokion.mode	@ltx/gr_gr_cog/miscellanea:misc.Mode8
ltx/gr_gr_cog/me.m03.d15:meVE.SticStavrotheotokion.text	Ἥλιος Τέκνον ἠμαύρωται, καὶ ἡ σελήνη τὸ φῶς, εἰς ζοφῶδες ἱμάτιον, ζοφερῶς μετέβαλε, γῆ κλονεῖται καὶ ῥήγνυται, φρικτῶς ναοῦ σου τὸ καταπέτασμα, κἀγὼ πῶς Τέκνον μὴ διαῤῥήξομαι, σπλάγχνα καὶ ὄμματα; πῶς δὲ μὴ τὸ πρόσωπον καταξανῶ, ἀδίκως σε θνῄσκοντα, βλέπουσα Σῶτέρ μου;
ltx/gr_gr_cog/me.m03.d15:meVE.SticTheotokion.greekmelody	@ltx/gr_gr_cog/he.a.m8:heAU.OTouParadoxou.greekname
ltx/gr_gr_cog/me.m03.d15:meVE.SticTheotokion.incipit	Χαῖρε φωτὸς θεῖον ὄχημα, χαῖρε…
ltx/gr_gr_cog/me.m03.d15:meVE.SticTheotokion.melody	@ltx/gr_gr_cog/he.a.m8:heAU.OTouParadoxou.name
ltx/gr_gr_cog/me.m03.d15:meVE.SticTheotokion.mode	@ltx/gr_gr_cog/miscellanea:misc.Mode8
ltx/gr_gr_cog/me.m03.d15:meVE.SticTheotokion.text	Χαῖρε φωτὸς θεῖον ὄχημα, χαῖρε Κυρίου ναέ, καὶ σκηνὴ ἁγιάσματος, φῶς ἡμῖν ἀνέτειλας, ἐξ ἀχράντου νηδύος σου, καταφωτίζον κόσμου τὰ πέρατα, καὶ ἁγιάζον ἡμᾶς χρηστότητι, χαῖρε κεφάλαιον, σωτηρίας Ἄχραντε, χαῖρε φρικτόν, ἄκουσμα καὶ λάλημα, τῶν πεποιθότων εἰς σέ.
ltx/gr_gr_cog/me.m03.d15:meVE.Stichera01.greekmelody	@ltx/gr_gr_cog/he.a.m8:heAU.OTouParadoxou.greekname
ltx/gr_gr_cog/me.m03.d15:meVE.Stichera01.incipit	Μάρτυρες Χριστοῦ ἑπτάριθμοι, τῶν διωκτῶν…
ltx/gr_gr_cog/me.m03.d15:meVE.Stichera01.melody	@ltx/gr_gr_cog/he.a.m8:heAU.OTouParadoxou.name
ltx/gr_gr_cog/me.m03.d15:meVE.Stichera01.mode	@ltx/gr_gr_cog/miscellanea:misc.Mode8
ltx/gr_gr_cog/me.m03.d15:meVE.Stichera01.text	Μάρτυρες Χριστοῦ ἑπτάριθμοι, τῶν διωκτῶν τὰς ὁρμάς, καὶ τὸν βίαιον θάνατον, εἰς οὐδὲν ἡγήσασθε, ἀλλʼ ἑτοίμως ἐσπεύσατε, ἀνδρειοφρόνως πρὸς τὰ παλαίσματα, καὶ νίκης στέφος ἀναδησάμενοι, συνηριθμήθητε, τοῖς δικαίοις ἅπασι, μεθʼ ὧν ὑμᾶς, πάντοτε γεραίρομεν καὶ μακαρίζομεν.
ltx/gr_gr_cog/me.m03.d15:meVE.Stichera02.incipit	Μάρτυς ἀθλητὰ Ἀγάπιε, τῶν ἀγαθῶν…
ltx/gr_gr_cog/me.m03.d15:meVE.Stichera02.melody	@ltx/gr_gr_cog/he.a.m8:heAU.OTouParadoxou.name
ltx/gr_gr_cog/me.m03.d15:meVE.Stichera02.mode	@ltx/gr_gr_cog/miscellanea:misc.Mode8
ltx/gr_gr_cog/me.m03.d15:meVE.Stichera02.text	Μάρτυς ἀθλητὰ Ἀγάπιε, τῶν ἀγαθῶν τὴν πηγήν, ὀρεκτῶν τὸ ἀκρότατον, ἀγαπήσας ἔσπευσας, τοῦ πιεῖν τὸ ποτήριον, τοῦ μαρτυρίου ἐπικαλούμενος, Θεοῦ τοῦ ζῶντος τὸ θεῖον ὄνομα, Ὢ τῆς ἀνδρείας σου! ὢ τῆς καρτερίας σου! διʼ ἧς τυχεῖν, δόξης καὶ λαμπρότητος, σαφῶς ἠξίωσαι.
ltx/gr_gr_cog/me.m03.d15:meVE.Stichera03.incipit	Μάρτυρες ἀξιοθαύμαστοι, ἐθελουσίῳ σφαγῇ, ἑαυτοὺς…
ltx/gr_gr_cog/me.m03.d15:meVE.Stichera03.melody	@ltx/gr_gr_cog/he.a.m8:heAU.OTouParadoxou.name
ltx/gr_gr_cog/me.m03.d15:meVE.Stichera03.mode	@ltx/gr_gr_cog/miscellanea:misc.Mode8
ltx/gr_gr_cog/me.m03.d15:meVE.Stichera03.text	Μάρτυρες ἀξιοθαύμαστοι, ἐθελουσίῳ σφαγῇ, ἑαυτοὺς ἐξεδώκατε, καὶ τὴν γῆν τοῖς αἵμασι, τοῖς ἡμῶν ἡγιάσατε, καὶ τὸν αἰθέρα κατελαμπρύνατε, τῇ διαβάσει, καὶ νῦν οἰκίζεσθε, εἰς τὰ οὐράνια, πρὸς φῶς τὸ ἀνέσπερον, ὑπὲρ ἡμῶν, πάντοτε δεόμενοι, θεοειδέστατοι.
