ltx/gr_gr_cog/le.go.mc.d225:lemcLI.Gospel.book_abbr	@ltx/gr_gr_cog/bible:Matthew.abbr
ltx/gr_gr_cog/le.go.mc.d225:lemcLI.Gospel.book_string	@ltx/gr_gr_cog/bible:Matthew.text
ltx/gr_gr_cog/le.go.mc.d225:lemcLI.Gospel.chapverse	22:35 – 46
ltx/gr_gr_cog/le.go.mc.d225:lemcLI.Gospel.incipit	Νομικός τις προσῆλθε τῷ Ἰησοῦ…
ltx/gr_gr_cog/le.go.mc.d225:lemcLI.Gospel.text	Τῷ καιρῷ ἐκείνῳ, νομικός τις προσῆλθε τῷ Ἰησοῦ, πειράζων αὐτὸν καὶ λέγων· διδάσκαλε, ποία ἐντολὴ μεγάλη ἐν τῷ νόμῳ; ὁ δὲ ᾿Ιησοῦς ἔφη αὐτῷ· ἀγαπήσεις Κύριον τὸν Θεόν σου ἐν ὅλῃ τῇ καρδίᾳ σου καὶ ἐν ὅλῃ τῇ ψυχῇ σου καὶ ἐν ὅλῃ τῇ διανοίᾳ σου. αὕτη ἐστὶ πρώτη καὶ μεγάλη ἐντολή. δευτέρα δὲ ὁμοία αὐτῇ· ἀγαπήσεις τὸν πλησίον σου ὡς σεαυτόν. ἐν ταύταις ταῖς δυσὶν ἐντολαῖς ὅλος ὁ νόμος καὶ οἱ προφῆται κρέμανται. Συνηγμένων δὲ τῶν Φαρισαίων ἐπηρώτησεν αὐτοὺς ὁ ᾿Ιησοῦς λέγων· τί ὑμῖν δοκεῖ περὶ τοῦ Χριστοῦ; τίνος υἱός ἐστι; λέγουσιν αὐτῷ· τοῦ Δαυΐδ. λέγει αὐτοῖς· πῶς οὖν Δαυῒδ ἐν Πνεύματι Κύριον αὐτὸν καλεῖ λέγων, εἶπεν ὁ Κύριος τῷ Κυρίῳ μου, κάθου ἐκ δεξιῶν μου ἕως ἂν θῶ τοὺς ἐχθρούς σου ὑποπόδιον τῶν ποδῶν σου; εἰ οὖν Δαυῒδ καλεῖ αὐτὸν Κύριον, πῶς υἱὸς αὐτοῦ ἐστι; καὶ οὐδεὶς ἐδύνατο αὐτῷ ἀποκριθῆναι λόγον, οὐδὲ ἐτόλμησέ τις ἀπ᾿ ἐκείνης τῆς ἡμέρας ἐπερωτῆσαι αὐτὸν οὐκέτι.
ltx/gr_gr_cog/le.go.mc.d225:lemcLI.Gospel.title	Κυριακῇ Δεκάτῃ Πέμπτῃ τοῦ Ματθαίου
ltx/gr_gr_cog/le.go.mc.d225:lemcLI.Gospel.title_abbr	Κυριακὴ ΙΕʹ τοῦ Ματθαίου
ltx/gr_gr_cog/le.go.mc.d225:lemcLI.Gospel.version	@ltx/gr_gr_cog/properties:version.designation
