ltx/gr_gr_cog/le.go.lu.d058:leluLI.Gospel.book_abbr	@ltx/gr_gr_cog/bible:Luke.abbr
ltx/gr_gr_cog/le.go.lu.d058:leluLI.Gospel.book_string	@ltx/gr_gr_cog/bible:Luke.text
ltx/gr_gr_cog/le.go.lu.d058:leluLI.Gospel.chapverse	14:25 – 35
ltx/gr_gr_cog/le.go.lu.d058:leluLI.Gospel.incipit	Συνεπορεύοντο τῷ Ἰησοῦ ὄχλοι πολλοί…
ltx/gr_gr_cog/le.go.lu.d058:leluLI.Gospel.text	Τῷ καιρῷ ἐκείνῳ, συνεπορεύοντο τῷ Ἰησοῦ ὄχλοι πολλοί. καὶ στραφεὶς εἶπε πρὸς αὐτούς· εἴ τις ἔρχεται πρός με καὶ οὐ μισεῖ τὸν πατέρα ἑαυτοῦ καὶ τὴν μητέρα καὶ τὴν γυναῖκα καὶ τὰ τέκνα καὶ τοὺς ἀδελφοὺς καὶ τὰς ἀδελφάς, ἔτι δὲ καὶ τὴν ἑαυτοῦ ψυχήν, οὐ δύναταί μου μαθητὴς εἶναι. καὶ ὅστις οὐ βαστάζει τὸν σταυρὸν ἑαυτοῦ καὶ ἔρχεται ὀπίσω μου, οὐ δύναται εἶναί μου μαθητής. τίς γὰρ ἐξ ὑμῶν, θέλων πύργον οἰκοδομῆσαι, οὐχὶ πρῶτον καθίσας ψηφίζει τὴν δαπάνην, εἰ ἔχει τὰ πρὸς ἀπαρτισμόν; ἵνα μήποτε, θέντος αὐτοῦ θεμέλιον καὶ μὴ ἰσχύσαντος ἐκτελέσαι, πάντες οἱ θεωροῦντες ἄρξωνται αὐτῷ ἐμπαίζειν, λέγοντες ὅτι οὗτος ὁ ἄνθρωπος ἤρξατο οἰκοδομεῖν καὶ οὐκ ἴσχυσεν ἐκτελέσαι; ἢ τίς βασιλεύς, πορευόμενος συμβαλεῖν ἑτέρῳ βασιλεῖ εἰς πόλεμον, οὐχὶ πρῶτον καθίσας βουλεύεται εἰ δυνατός ἐστιν ἐν δέκα χιλιάσιν ἀπαντῆσαι τῷ μετὰ εἴκοσι χιλιάδων ἐρχομένῳ ἐπ᾿ αὐτόν; εἰ δὲ μήγε, ἔτι πόρρω αὐτοῦ ὄντος πρεσβείαν ἀποστείλας ἐρωτᾷ τὰ πρὸς εἰρήνην. οὕτως οὖν πᾶς ἐξ ὑμῶν, ὃς οὐκ ἀποτάσσεται πᾶσι τοῖς ἑαυτοῦ ὑπάρχουσιν, οὐ δύναται εἶναί μου μαθητής. Καλὸν τὸ ἅλας· ἐὰν δὲ καὶ τὸ ἅλας μωρανθῇ, ἐν τίνι ἀρτυθήσεται; οὔτε εἰς γῆν οὔτε εἰς κοπρίαν εὔθετόν ἐστιν· ἔξω βάλλουσιν αὐτό. ὁ ἔχων ὦτα ἀκούειν ἀκουέτω.
ltx/gr_gr_cog/le.go.lu.d058:leluLI.Gospel.title	Τῇ Τρίτῃ τῆς Θʹ Ἑβδομάδος τοῦ Λουκᾶ
ltx/gr_gr_cog/le.go.lu.d058:leluLI.Gospel.title_abbr	Τῇ Τρίτῃ τῆς Θʹ Ἑβδομάδος τοῦ Λουκᾶ
ltx/gr_gr_cog/le.go.lu.d058:leluLI.Gospel.version	@ltx/gr_gr_cog/properties:version.designation
