ltx/gr_gr_cog/le.go.me.m01.d21:lemeLI.Gospel.book_abbr	@ltx/gr_gr_cog/le.go.me.m11.d06:lemeLI.Gospel.book_abbr
ltx/gr_gr_cog/le.go.me.m01.d21:lemeLI.Gospel.book_string	@ltx/gr_gr_cog/le.go.me.m11.d06:lemeLI.Gospel.book_string
ltx/gr_gr_cog/le.go.me.m01.d21:lemeLI.Gospel.chapverse	@ltx/gr_gr_cog/le.go.me.m11.d06:lemeLI.Gospel.chapverse
ltx/gr_gr_cog/le.go.me.m01.d21:lemeLI.Gospel.incipit	@ltx/gr_gr_cog/le.go.me.m11.d06:lemeLI.Gospel.incipit
ltx/gr_gr_cog/le.go.me.m01.d21:lemeLI.Gospel.text	@ltx/gr_gr_cog/le.go.me.m11.d06:lemeLI.Gospel.text
ltx/gr_gr_cog/le.go.me.m01.d21:lemeLI.Gospel.title	Τοῦ Ὁσίου
ltx/gr_gr_cog/le.go.me.m01.d21:lemeLI.Gospel.title_abbr	Τοῦ Ὁσίου
ltx/gr_gr_cog/le.go.me.m01.d21:lemeLI.Gospel.version	@ltx/gr_gr_cog/le.go.me.m11.d06:lemeLI.Gospel.version
