ltx/gr_gr_cog/me.m07.d01:meDA.commemoration.first	Μνήμη τῶν Ἁγίων Ἀναργύρων Κοσμᾶ καὶ Δαμιανοῦ τῶν ἐν Ῥώμῃ
ltx/gr_gr_cog/me.m07.d01:meDA.commemoration.first_name	
ltx/gr_gr_cog/me.m07.d01:meDA.commemoration.first_short	Μνήμη τῶν Ἁγίων Ἀναργύρων Κοσμᾶ καὶ Δαμιανοῦ τῶν ἐν Ῥώμῃ
ltx/gr_gr_cog/me.m07.d01:meDA.commemoration.first_title	Τῶν Ἀναργύρων.
ltx/gr_gr_cog/me.m07.d01:meDA.commemoration.full	Μνήμη τῶν Ἁγίων καὶ Θαυματουργῶν Ἀναργύρων Κοσμᾶ καὶ Δαμιανοῦ, τῶν ἐν Ῥώμῃ Μαρτυρησάντων
ltx/gr_gr_cog/me.m07.d01:meDA.commemoration.second_name	
ltx/gr_gr_cog/me.m07.d01:meDA.commemoration.second_title	
ltx/gr_gr_cog/me.m07.d01:meDA.date	Τῌ Αʹ ΙΟΥΛΙΟΥ
ltx/gr_gr_cog/me.m07.d01:meDA.fordate	διὰ τὴν 1ην Ἰουλίου
ltx/gr_gr_cog/me.m07.d01:meDA.insert1	τῶν ἁγίων καὶ ἐνδόξων Ἀναργύρων Κοσμᾶ καὶ Δαμιανοῦ,
ltx/gr_gr_cog/me.m07.d01:meDA.insert2	ὧν καὶ τὴν μνήμην ἐπιτελοῦμεν·
ltx/gr_gr_cog/me.m07.d01:meDA.note	Εἰ βούλει ἑορτάσαι τοὺς Ἁγίου τούτους,…
ltx/gr_gr_cog/me.m07.d01:meDA.pdfcoverdate	τῆς 1ης Ἰουλίου,
ltx/gr_gr_cog/me.m07.d01:meDA.pdfheaderdate	τῆς 1ης Ἰουλίου
ltx/gr_gr_cog/me.m07.d01:meHO.commemorations	
ltx/gr_gr_cog/me.m07.d01:meHO.note1	
ltx/gr_gr_cog/me.m07.d01:meHO.note2	
ltx/gr_gr_cog/me.m07.d01:meHO.number	
ltx/gr_gr_cog/me.m07.d01:meHO.rank	
ltx/gr_gr_cog/me.m07.d01:meLE.commemoration1	Τῶν Ἁγίων καὶ Θαυματουργῶν Ἀναργύρων Κοσμᾶ καὶ Δαμιανοῦ, τῶν ἐν Ῥώμῃ Μαρτυρησάντων
ltx/gr_gr_cog/me.m07.d01:meLE.commemoration2	
ltx/gr_gr_cog/me.m07.d01:meLI.Kontakion1.incipit	@ltx/gr_gr_cog/me.m07.d01:meMA.Kontakion1.incipit
ltx/gr_gr_cog/me.m07.d01:meLI.Kontakion1.melody	@ltx/gr_gr_cog/me.m07.d01:meMA.Kontakion1.melody
ltx/gr_gr_cog/me.m07.d01:meLI.Kontakion1.mode	@ltx/gr_gr_cog/me.m07.d01:meMA.Kontakion1.mode
ltx/gr_gr_cog/me.m07.d01:meLI.Kontakion1.text	@ltx/gr_gr_cog/me.m07.d01:meMA.Kontakion1.text
ltx/gr_gr_cog/me.m07.d01:meLI.MM.CommunionHymn.text	@ltx/gr_gr_cog/properties:media.key
ltx/gr_gr_cog/me.m07.d01:meLI.Megalynarion.text	Ἴασιν σωμάτων ῥῶσιν ψυχῶν, Κοσμᾶ θεοφόρε, σὺν τῷ θείῳ Δαμιανῷ, νείματε ὑψόθεν, ἀΰλῳ χειρουργίᾳ, τοῖς κατατρυχομένοις ποικίλοις πάθεσι.
ltx/gr_gr_cog/me.m07.d01:meMA.C1.acrostic.notice1	οὗ ἡ Ἀκροστιχίς·
ltx/gr_gr_cog/me.m07.d01:meMA.C1.acrostic.text	Κλεινοὺς ἰατροὺς τῶν βροτῶν μέλπειν θέμις. Ἰωσήφ.
ltx/gr_gr_cog/me.m07.d01:meMA.C1.acrostic.title	Ὁ Κανὼν τῶν Ἁγίων,
ltx/gr_gr_cog/me.m07.d01:meMA.C1.title	@ltx/gr_gr_cog/titles:ti.CanonSaints
ltx/gr_gr_cog/me.m07.d01:meMA.C1.verse	@ltx/gr_gr_cog/prayers:pr.verse_SaintsM.text
ltx/gr_gr_cog/me.m07.d01:meMA.ExapTheotokion.incipit	Ἐκύησας Πανάχραντε, τὸν Θεοῦ Θεὸν…
ltx/gr_gr_cog/me.m07.d01:meMA.ExapTheotokion.melody	@ltx/gr_gr_cog/he.a.m3:heAU.EnPnevmatiToIero.name
ltx/gr_gr_cog/me.m07.d01:meMA.ExapTheotokion.mode	@ltx/gr_gr_cog/miscellanea:misc.Mode3
ltx/gr_gr_cog/me.m07.d01:meMA.ExapTheotokion.text	Ἐκύησας Πανάχραντε, τὸν Θεοῦ Θεὸν Λόγον, τῷ κόσμῳ τὴν σωτήριον, ἐκτελοῦντα πανσόφως, οἰκονομίαν ἀρίστην· διὰ τοῦτό σε πάντες, ὑμνολογοῦμεν ἀξίως, ὡς πρεσβεύουσαν τούτῳ, λυτρωθῆναι ἡμᾶς νόσων, καὶ παντοίων κινδύνων.
ltx/gr_gr_cog/me.m07.d01:meMA.Exaposteilarion1.greekmelody	@ltx/gr_gr_cog/he.a.m3:heAU.EnPnevmatiToIero.greekname
ltx/gr_gr_cog/me.m07.d01:meMA.Exaposteilarion1.incipit	Τὴν χάριν τῶν ἰάσεων, ἐκ…
ltx/gr_gr_cog/me.m07.d01:meMA.Exaposteilarion1.melody	@ltx/gr_gr_cog/he.a.m3:heAU.EnPnevmatiToIero.name
ltx/gr_gr_cog/me.m07.d01:meMA.Exaposteilarion1.mode	@ltx/gr_gr_cog/miscellanea:misc.Mode3
ltx/gr_gr_cog/me.m07.d01:meMA.Exaposteilarion1.text	Τὴν χάριν τῶν ἰάσεων, ἐκ Θεοῦ εἰληφότες, Ἀνάργυροι μακάριοι, ἰατρεύετε νόσους, καὶ θεραπεύετε πάντας, τοὺς πιστῶς προστρέχοντας, τῷ θείῳ ὑμῶν τεμένει· διὰ τοῦτο συμφώνως, μακαρίζομεν ἀξίως, τὴν σεπτὴν ὑμῶν μνήμην.
ltx/gr_gr_cog/me.m07.d01:meMA.Kathisma11.greekmelody	@ltx/gr_gr_cog/he.a.m8:heAU.TinSofianKaiLogon.greekname
ltx/gr_gr_cog/me.m07.d01:meMA.Kathisma11.incipit	Οὐρανόθεν θαυμάτων τὴν δωρεάν, παραδόξως…
ltx/gr_gr_cog/me.m07.d01:meMA.Kathisma11.melody	@ltx/gr_gr_cog/he.a.m8:heAU.TinSofianKaiLogon.name
ltx/gr_gr_cog/me.m07.d01:meMA.Kathisma11.mode	@ltx/gr_gr_cog/miscellanea:misc.Mode8
ltx/gr_gr_cog/me.m07.d01:meMA.Kathisma11.text	Οὐρανόθεν θαυμάτων τὴν δωρεάν, παραδόξως λαβόντες παρὰ Χριστοῦ, πάντα θεραπεύετε, ἀενάως τὰ πάθη· ἐν ὑμῖν γὰρ ὤφθη, ἡ χάρις τοῦ Πνεύματος, ἐνεργοῦσα θείων ἰάσεων δύναμιν· ὅθεν καὶ ἀφθάρτων, ἀγαθῶν εὐπορίαν, τῇ πίστει ἐκτήσασθε, ἀναργύρῳ φρονήματι, θεοφόροι Ἀνάργυροι. Πρεσβεύσατε Χριστῷ τῷ Θεῷ, τῶν πταισμάτων ἄφεσιν δωρήσασθαι, τοῖς ἑορτάζουσι πόθῳ, τὴν ἁγίαν μνήμην ὑμῶν.
ltx/gr_gr_cog/me.m07.d01:meMA.Kathisma1T.incipit	Ὡς Παρθένον καὶ μόνην…
ltx/gr_gr_cog/me.m07.d01:meMA.Kathisma1T.melody	@ltx/gr_gr_cog/he.a.m8:heAU.TinSofianKaiLogon.name
ltx/gr_gr_cog/me.m07.d01:meMA.Kathisma1T.mode	@ltx/gr_gr_cog/miscellanea:misc.Mode8
ltx/gr_gr_cog/me.m07.d01:meMA.Kathisma1T.text	Ὡς Παρθένον καὶ μόνην ἐν γυναιξί, σὲ ἀσπόρως τεκοῦσαν Θεὸν σαρκί, πᾶσαι μακαρίζομεν γενεαὶ τῶν ἀνθρώπων· τὸ γὰρ πῦρ ἐσκήνωσεν, ἐν σοὶ τῆς Θεότητος, καὶ ὡς βρέφος θηλάζεις, τὸν Κτίστην καὶ Κύριον· ὅθεν τῶν Ἀγγέλων, καὶ ἀνθρώπων τὸ γένος, ἀξίως δοξάζομεν, τὸν πανάγιον τόκον σου, καὶ συμφώνως βοῶμέν σοι· Πρέσβευε τῷ σῷ Υἱῷ καὶ Θεῷ, τῶν πταισμάτων ἄφεσιν δωρήσασθαι, τοῖς καταφεύγουσι πίστει, τῇ σκέπῃ σου, Ἄχραντε.
ltx/gr_gr_cog/me.m07.d01:meMA.Kathisma21.greekmelody	@ltx/gr_gr_cog/he.a.m4:heAU.EpefanisSimeron.greekname
ltx/gr_gr_cog/me.m07.d01:meMA.Kathisma21.incipit	Τὴν φαιδρὰν πανήγυριν, τῶν Ἄναργύρων…
ltx/gr_gr_cog/me.m07.d01:meMA.Kathisma21.melody	@ltx/gr_gr_cog/he.a.m4:heAU.EpefanisSimeron.name
ltx/gr_gr_cog/me.m07.d01:meMA.Kathisma21.mode	@ltx/gr_gr_cog/miscellanea:misc.Mode4
ltx/gr_gr_cog/me.m07.d01:meMA.Kathisma21.text	Τὴν φαιδρὰν πανήγυριν, τῶν Ἄναργύρων, οἱ πιστοὶ τελέσωμεν, καθικετεύοντες αὐτούς, ἵνα ἡμᾶς ἀπαλλάττωσι, παντοίων νόσων, ψυχῆς τε καὶ σώματος.
ltx/gr_gr_cog/me.m07.d01:meMA.Kathisma2T.incipit	Προστασία ἄμαχε, τῶν θλιβομένων, καὶ…
ltx/gr_gr_cog/me.m07.d01:meMA.Kathisma2T.melody	@ltx/gr_gr_cog/he.a.m4:heAU.EpefanisSimeron.name
ltx/gr_gr_cog/me.m07.d01:meMA.Kathisma2T.mode	@ltx/gr_gr_cog/miscellanea:misc.Mode4
ltx/gr_gr_cog/me.m07.d01:meMA.Kathisma2T.text	Προστασία ἄμαχε, τῶν θλιβομένων, καὶ θερμὴ ἀντίληψις, τῶν πεποιθότων ἐπὶ σέ, ἐκ τῶν κινδύνων με λύτρωσαι· σὺ γὰρ ὑπάρχεις, ἡ πάντων βοήθεια.
ltx/gr_gr_cog/me.m07.d01:meMA.Kontakion1.incipit	Οἱ τὴν χάριν λαβόντες τῶν…
ltx/gr_gr_cog/me.m07.d01:meMA.Kontakion1.melody	
ltx/gr_gr_cog/me.m07.d01:meMA.Kontakion1.mode	@ltx/gr_gr_cog/miscellanea:misc.Mode2
ltx/gr_gr_cog/me.m07.d01:meMA.Kontakion1.text	Οἱ τὴν χάριν λαβόντες τῶν ἰαμάτων, ἐφαπλοῦτε τὴν ῥῶσιν τοῖς ἐν ἀνάγκαις, ἰατροὶ θαυματουργοὶ ἔνδοξοι. Ἀλλὰ τῇ ἡμῶν ἐπισκέψει, καὶ τῶν πολεμίων τὰ θράση καταβάλλετε, τὸν κόσμον ἰώμενοι ἐν τοῖς θαύμασι.
ltx/gr_gr_cog/me.m07.d01:meMA.Lauds1.greekmelody	@ltx/gr_gr_cog/he.a.m4:heAU.EdokasSimeiosin.greekname
ltx/gr_gr_cog/me.m07.d01:meMA.Lauds1.incipit	Νάμασι τοῦ Πνεύματος, ὡς ποταμοὶ…
ltx/gr_gr_cog/me.m07.d01:meMA.Lauds1.melody	@ltx/gr_gr_cog/he.a.m4:heAU.EdokasSimeiosin.name
ltx/gr_gr_cog/me.m07.d01:meMA.Lauds1.mode	@ltx/gr_gr_cog/miscellanea:misc.Mode4
ltx/gr_gr_cog/me.m07.d01:meMA.Lauds1.text	Νάμασι τοῦ Πνεύματος, ὡς ποταμοὶ προσκλυζόμενοι, καὶ σαφῶς πελαγίζοντες, τὴν κτίσιν ἀρδεύετε, ταῖς θεοσημείαις, καὶ ταῖς παραδόξοις, τῶν ἰαμάτων παροχαῖς, καὶ ψυχοφθόρα πάθη ξηραίνετε, καὶ νόσους θεραπεύετε, καὶ φυγαδεύετε πνεύματα, θεοφόροι Ἀνάργυροι, πρεσβευταὶ τῶν ψυχῶν ἡμῶν.
ltx/gr_gr_cog/me.m07.d01:meMA.Lauds2.incipit	Πάθη ἀλογώτατα, καθυποτάξαντες Ἅγιοι, ψυχικαῖς…
ltx/gr_gr_cog/me.m07.d01:meMA.Lauds2.melody	@ltx/gr_gr_cog/he.a.m4:heAU.EdokasSimeiosin.name
ltx/gr_gr_cog/me.m07.d01:meMA.Lauds2.mode	@ltx/gr_gr_cog/miscellanea:misc.Mode4
ltx/gr_gr_cog/me.m07.d01:meMA.Lauds2.text	Πάθη ἀλογώτατα, καθυποτάξαντες Ἅγιοι, ψυχικαῖς ταῖς δυνάμεσιν, ἀνθρώποις καὶ κτήνεσι, τὰς εὐεργεσίας, ἐπιχορηγεῖτε, παρὰ Χριστοῦ τὴν δωρεάν, τῶν ἰαμάτων καταπλουτήσαντες· διὸ τὴν ἱερὰν ὑμῶν, καὶ φωτοφόρον πανήγυριν, ἐκτελοῦντες αἰτούμεθα, φωτισμὸν ταῖς ψυχαῖς ἡμῶν.
ltx/gr_gr_cog/me.m07.d01:meMA.Lauds3.incipit	Ὁ θεῖος ναὸς ὑμῶν, ὡς…
ltx/gr_gr_cog/me.m07.d01:meMA.Lauds3.melody	@ltx/gr_gr_cog/he.a.m4:heAU.EdokasSimeiosin.name
ltx/gr_gr_cog/me.m07.d01:meMA.Lauds3.mode	@ltx/gr_gr_cog/miscellanea:misc.Mode4
ltx/gr_gr_cog/me.m07.d01:meMA.Lauds3.text	Ὁ θεῖος ναὸς ὑμῶν, ὡς οὐρανὸς ἀναδέδεικται, φωταυγὴς καὶ οὐράνιος, ὡς ἄστρα τὰ θαύματα, τὰ σωτηριώδη, νῦν προσκεκτημένος, καὶ ὥσπερ ἥλιον φαιδρόν, τῶν ἰαμάτων θείαν ἐνέργειαν, Κοσμᾶ μακαριώτατε, Δαμιανὲ παναοίδιμε, τοῦ Κυρίου θεράποντες, πρεσβευταὶ τῶν ψυχῶν ἡμῶν.
ltx/gr_gr_cog/me.m07.d01:meMA.LaudsGlory.incipit	Πηγὴν ἰαμάτων ἔχοντες, Ἅγιοι Ἀνάργυροι…
ltx/gr_gr_cog/me.m07.d01:meMA.LaudsGlory.melody	
ltx/gr_gr_cog/me.m07.d01:meMA.LaudsGlory.mode	@ltx/gr_gr_cog/miscellanea:misc.Mode4
ltx/gr_gr_cog/me.m07.d01:meMA.LaudsGlory.text	Πηγὴν ἰαμάτων ἔχοντες, Ἅγιοι Ἀνάργυροι, τὰς ἰάσεις παρέχετε πᾶσι τοῖς δεομένοις, ὡς μεγίστων δωρεῶν ἀξιωθέντες, παρὰ τῆς ἀενάου πηγῆς τοῦ Σωτῆρος Χριστοῦ· Φησὶ γὰρ πρὸς ὑμᾶς ὁ Κύριος, ὡς ὁμοζήλους τῶν Ἀποστόλων. Ἰδοὺ δέδωκα ὑμῖν τὴν ἐξουσίαν, κατὰ πνευμάτων ἀκαθάρτων, ὥστε αὐτὰ ἐκβάλλειν, καὶ θεραπεύειν πᾶσαν νόσον, καὶ πᾶσαν μαλακίαν. Διὸ τοῖς προστάγμασιν αὐτοῦ καλῶς πολιτευσάμενοι, δωρεὰν ἐλάβετε, δωρεὰν παρέχετε, ἰατρεύοντες τὰ πάθη τῶν ψυχῶν, καὶ τῶν σωμάτων ἡμῶν.
ltx/gr_gr_cog/me.m07.d01:meMA.LaudsTheotokion.incipit	@ltx/gr_gr_cog/oc.m4.d2:ocMA.AposTheotokion.incipit
ltx/gr_gr_cog/me.m07.d01:meMA.LaudsTheotokion.melody	
ltx/gr_gr_cog/me.m07.d01:meMA.LaudsTheotokion.mode	@ltx/gr_gr_cog/miscellanea:misc.Mode4
ltx/gr_gr_cog/me.m07.d01:meMA.LaudsTheotokion.text	@ltx/gr_gr_cog/oc.m4.d2:ocMA.AposTheotokion.text
ltx/gr_gr_cog/me.m07.d01:meMA.MM.Lauds1123as5678.text	@ltx/gr_gr_cog/properties:media.key
ltx/gr_gr_cog/me.m07.d01:meMA.Ode1C11.greekmelody	@ltx/gr_gr_cog/he.h.m6:heHE.OsEnIpeiroPezefsas.greekname
ltx/gr_gr_cog/me.m07.d01:meMA.Ode1C11.incipit	Καταστραπτόμενοι δόξῃ τῇ θεϊκῇ φωταυγεῖς…
ltx/gr_gr_cog/me.m07.d01:meMA.Ode1C11.melody	@ltx/gr_gr_cog/he.h.m6:heHE.OsEnIpeiroPezefsas.name
ltx/gr_gr_cog/me.m07.d01:meMA.Ode1C11.mode	@ltx/gr_gr_cog/miscellanea:misc.Mode6
ltx/gr_gr_cog/me.m07.d01:meMA.Ode1C11.ode	@ltx/gr_gr_cog/miscellanea:misc.Ode1
ltx/gr_gr_cog/me.m07.d01:meMA.Ode1C11.text	Καταστραπτόμενοι δόξῃ τῇ θεϊκῇ φωταυγεῖς Ἀνάργυροι, καταυγάσατε ἡμῶν, τὰς ψυχάς, σκεδάζοντες παθῶν, τὴν ἀχλύν, ὅπως ὑμᾶς πίστει γεραίρωμεν.
ltx/gr_gr_cog/me.m07.d01:meMA.Ode1C12.incipit	Λυμαντικῶν καθαρθέντες πρώην παθῶν, πόνων…
ltx/gr_gr_cog/me.m07.d01:meMA.Ode1C12.melody	@ltx/gr_gr_cog/he.h.m6:heHE.OsEnIpeiroPezefsas.name
ltx/gr_gr_cog/me.m07.d01:meMA.Ode1C12.mode	@ltx/gr_gr_cog/miscellanea:misc.Mode6
ltx/gr_gr_cog/me.m07.d01:meMA.Ode1C12.ode	@ltx/gr_gr_cog/miscellanea:misc.Ode1
ltx/gr_gr_cog/me.m07.d01:meMA.Ode1C12.text	Λυμαντικῶν καθαρθέντες πρώην παθῶν, πόνων ἐπιδόσεσιν, ἐκκαθαίρετε ἡμῶν, χαλεπὰ νοσήματα σοφοί, καὶ τοὺς πόνους τῶν ψυχῶν ἐπικουφίζετε.
ltx/gr_gr_cog/me.m07.d01:meMA.Ode1C13.incipit	Ἐκ τοῦ τῶν ὅλων Δεσπότου…
ltx/gr_gr_cog/me.m07.d01:meMA.Ode1C13.melody	@ltx/gr_gr_cog/he.h.m6:heHE.OsEnIpeiroPezefsas.name
ltx/gr_gr_cog/me.m07.d01:meMA.Ode1C13.mode	@ltx/gr_gr_cog/miscellanea:misc.Mode6
ltx/gr_gr_cog/me.m07.d01:meMA.Ode1C13.ode	@ltx/gr_gr_cog/miscellanea:misc.Ode1
ltx/gr_gr_cog/me.m07.d01:meMA.Ode1C13.text	Ἐκ τοῦ τῶν ὅλων Δεσπότου τὰς δωρεάς, εἰληφότες Ἅγιοι, τῶν θαυμάτων δωρεάν, τὰ ἡμῶν ἰάσασθε πολλά, καὶ δυσίατα σαρκὸς πάθη δεόμεθα.
ltx/gr_gr_cog/me.m07.d01:meMA.Ode1C1T.incipit	Νόμου τῆς φύσεως δίχα τίκτεις…
ltx/gr_gr_cog/me.m07.d01:meMA.Ode1C1T.melody	@ltx/gr_gr_cog/he.h.m6:heHE.OsEnIpeiroPezefsas.name
ltx/gr_gr_cog/me.m07.d01:meMA.Ode1C1T.mode	@ltx/gr_gr_cog/miscellanea:misc.Mode6
ltx/gr_gr_cog/me.m07.d01:meMA.Ode1C1T.ode	@ltx/gr_gr_cog/miscellanea:misc.Ode1
ltx/gr_gr_cog/me.m07.d01:meMA.Ode1C1T.text	Νόμου τῆς φύσεως δίχα τίκτεις Ἁγνή, τὸν τοῦ νόμου πάροχον, Ἰησοῦν τὸν λυτρωτήν, ὃν δυσώπει ῥύσασθαι ἡμᾶς, Θεοτόκε τῶν πολλῶν ἀνομιῶν ἡμῶν.
ltx/gr_gr_cog/me.m07.d01:meMA.Ode3C11.greekmelody	@ltx/gr_gr_cog/he.h.m6:heHE.OukEstinAgios.greekname
ltx/gr_gr_cog/me.m07.d01:meMA.Ode3C11.incipit	Ὁ κόσμος ᾄδει τὰς ὑμῶν…
ltx/gr_gr_cog/me.m07.d01:meMA.Ode3C11.melody	@ltx/gr_gr_cog/he.h.m6:heHE.OukEstinAgios.name
ltx/gr_gr_cog/me.m07.d01:meMA.Ode3C11.mode	@ltx/gr_gr_cog/miscellanea:misc.Mode6
ltx/gr_gr_cog/me.m07.d01:meMA.Ode3C11.ode	@ltx/gr_gr_cog/miscellanea:misc.Ode3
ltx/gr_gr_cog/me.m07.d01:meMA.Ode3C11.text	Ὁ κόσμος ᾄδει τὰς ὑμῶν, Ἅγιοι καθʼ ἑκάστην, πολλὰς εὐεργεσίας καὶ θαυμάτων τὴν πληθύν, θαυματουργοὶ Ἰατροί, τῶν Ἀγγέλων ὄντως ἰσοστάσιοι.
ltx/gr_gr_cog/me.m07.d01:meMA.Ode3C12.incipit	Ὑμᾶς τοὺς δύο φωταυγεῖς, δυσωποῦμεν…
ltx/gr_gr_cog/me.m07.d01:meMA.Ode3C12.melody	@ltx/gr_gr_cog/he.h.m6:heHE.OukEstinAgios.name
ltx/gr_gr_cog/me.m07.d01:meMA.Ode3C12.mode	@ltx/gr_gr_cog/miscellanea:misc.Mode6
ltx/gr_gr_cog/me.m07.d01:meMA.Ode3C12.ode	@ltx/gr_gr_cog/miscellanea:misc.Ode3
ltx/gr_gr_cog/me.m07.d01:meMA.Ode3C12.text	Ὑμᾶς τοὺς δύο φωταυγεῖς, δυσωποῦμεν ἀστέρας, τοὺς ἐν ὕψει κειμένους, Ἐκκλησίας μυστικῶς, Κοσμᾶ καὶ Δαμιανέ, τὰς καρδίας, πάντων καταυγάζετε.
ltx/gr_gr_cog/me.m07.d01:meMA.Ode3C13.incipit	Ἰδοὺ συνήθροισται λαός, Ἅγιοι πανταχόθεν…
ltx/gr_gr_cog/me.m07.d01:meMA.Ode3C13.melody	@ltx/gr_gr_cog/he.h.m6:heHE.OukEstinAgios.name
ltx/gr_gr_cog/me.m07.d01:meMA.Ode3C13.mode	@ltx/gr_gr_cog/miscellanea:misc.Mode6
ltx/gr_gr_cog/me.m07.d01:meMA.Ode3C13.ode	@ltx/gr_gr_cog/miscellanea:misc.Ode3
ltx/gr_gr_cog/me.m07.d01:meMA.Ode3C13.text	Ἰδοὺ συνήθροισται λαός, Ἅγιοι πανταχόθεν, τοῦ ὑμῶν ἀνυμνῆσαι τὰς μεγίστας δωρεάς, ἐν τῷ τεμένει ὑμῶν, ἀλλὰ πάντων, τὰς εὐχὰς πληρώσατε.
ltx/gr_gr_cog/me.m07.d01:meMA.Ode3C1T.incipit	Ἁγία Δέσποινα ἁγνή, ὑπεράγιον Λόγον…
ltx/gr_gr_cog/me.m07.d01:meMA.Ode3C1T.melody	@ltx/gr_gr_cog/he.h.m6:heHE.OukEstinAgios.name
ltx/gr_gr_cog/me.m07.d01:meMA.Ode3C1T.mode	@ltx/gr_gr_cog/miscellanea:misc.Mode6
ltx/gr_gr_cog/me.m07.d01:meMA.Ode3C1T.ode	@ltx/gr_gr_cog/miscellanea:misc.Ode3
ltx/gr_gr_cog/me.m07.d01:meMA.Ode3C1T.text	Ἁγία Δέσποινα ἁγνή, ὑπεράγιον Λόγον, σωματώσασα λόγῳ, τῶν ἀλόγων με παθῶν, ὑμνοῦντά σε εὐσεβῶς, θείοις λόγοις, λύτρωσαι πανάμωμε.
ltx/gr_gr_cog/me.m07.d01:meMA.Ode3Kathisma1.greekmelody	@ltx/gr_gr_cog/he.a.m8:heAU.TinSofianKaiLogon.greekname
ltx/gr_gr_cog/me.m07.d01:meMA.Ode3Kathisma1.incipit	Ἰαμάτων δοτῆρες θαυματουργοί, καὶ θαυμάτων…
ltx/gr_gr_cog/me.m07.d01:meMA.Ode3Kathisma1.melody	@ltx/gr_gr_cog/he.a.m8:heAU.TinSofianKaiLogon.name
ltx/gr_gr_cog/me.m07.d01:meMA.Ode3Kathisma1.mode	@ltx/gr_gr_cog/miscellanea:misc.Mode8
ltx/gr_gr_cog/me.m07.d01:meMA.Ode3Kathisma1.text	Ἰαμάτων δοτῆρες θαυματουργοί, καὶ θαυμάτων λαμπτῆρες φωταγωγοί, πᾶσιν ἀνεδείχθητε, τῇ τοῦ Πνεύματος χάριτι· τῶν γὰρ παθῶν τὴν φλόγα, τῇ πίστει δροσίζοντες, τῶν πιστῶν ἐν ταύτῃ, τὸ φρόνημα θάλπετε· ὅθεν ἰατρεῖον, τῶν ψυχῶν κεκτημένοι, τὸν θεῖον ναὸν ὑμῶν, ἐν αὐτῷ καταφεύγομεν, θεοφόροι Ἀνάργυροι. Πρεσβευσατε Χριστῷ τῷ Θεῷ, τῶν πταισμάτων ἄφεσιν δωρήσασθαι, τοῖς ἑορτάζουσι πόθῳ, τὴν ἁγίαν μνήμην ὑμῶν.
ltx/gr_gr_cog/me.m07.d01:meMA.Ode3KathismaT.incipit	Πειρασμοῖς πολυπλόκοις περιπεσών, ἐξ ἐχθρῶν…
ltx/gr_gr_cog/me.m07.d01:meMA.Ode3KathismaT.melody	@ltx/gr_gr_cog/he.a.m8:heAU.TinSofianKaiLogon.name
ltx/gr_gr_cog/me.m07.d01:meMA.Ode3KathismaT.mode	@ltx/gr_gr_cog/miscellanea:misc.Mode8
ltx/gr_gr_cog/me.m07.d01:meMA.Ode3KathismaT.text	Πειρασμοῖς πολυπλόκοις περιπεσών, ἐξ ἐχθρῶν ἀοράτων καὶ ὁρατῶν, τῷ σάλῳ συνέχομαι τῶν ἀμέτρων πταισμάτων μου, καὶ ὡς ἔχων ἀντίληψιν, καὶ σκέπην σε ἄχραντε, τῷ λιμένι προστρέχω, τῆς σῆς ἀγαθότητος· ὅθεν Παναγία, τὸν ἐκ σοῦ σαρκωθέντα, ἀσπόρως ἱκέτευε, ὑπὲρ πάντων τῶν δούλων σου, τῶν ἀπαύστως ὑμνούντων σε, πρεσβεύουσα αὐτῷ ἐκτενῶς, τῶν πταισμάτων ἄφεσιν δωρήσασθαι, τοῖς προσκυνοῦσιν ἐν πίστει, τὸν τόκον σου, Ἄχραντε.
ltx/gr_gr_cog/me.m07.d01:meMA.Ode4C11.greekmelody	@ltx/gr_gr_cog/he.h.m6:heHE.ChristosMouDynamis.greekname
ltx/gr_gr_cog/me.m07.d01:meMA.Ode4C11.incipit	Τὰ θεῖα κλήματα, τὰ ὄντως…
ltx/gr_gr_cog/me.m07.d01:meMA.Ode4C11.melody	@ltx/gr_gr_cog/he.h.m6:heHE.ChristosMouDynamis.name
ltx/gr_gr_cog/me.m07.d01:meMA.Ode4C11.mode	@ltx/gr_gr_cog/miscellanea:misc.Mode6
ltx/gr_gr_cog/me.m07.d01:meMA.Ode4C11.ode	@ltx/gr_gr_cog/miscellanea:misc.Ode4
ltx/gr_gr_cog/me.m07.d01:meMA.Ode4C11.text	Τὰ θεῖα κλήματα, τὰ ὄντως εὔκαρπα, τῆς ἀμπέλου τῆς θείας τὸν μυστικόν, οἶνον ἀποστάζοντα, ἐν εὐφροσύνῃ τοὺς σοφούς, Ἀναργύρους εὐφημήσωμεν.
ltx/gr_gr_cog/me.m07.d01:meMA.Ode4C12.incipit	Ῥομφαία ὤφθητε, κατατιτρώσκοντες, δυσμενεῖς ἀοράτους…
ltx/gr_gr_cog/me.m07.d01:meMA.Ode4C12.melody	@ltx/gr_gr_cog/he.h.m6:heHE.ChristosMouDynamis.name
ltx/gr_gr_cog/me.m07.d01:meMA.Ode4C12.mode	@ltx/gr_gr_cog/miscellanea:misc.Mode6
ltx/gr_gr_cog/me.m07.d01:meMA.Ode4C12.ode	@ltx/gr_gr_cog/miscellanea:misc.Ode4
ltx/gr_gr_cog/me.m07.d01:meMA.Ode4C12.text	Ῥομφαία ὤφθητε, κατατιτρώσκοντες, δυσμενεῖς ἀοράτους, ὧν καὶ ἡμᾶς, τῶν βελῶν λυτρώσασθε, περιποιούμενοι ἡμῶν, τὴν ζωὴν σοφοὶ Ἀνάργυροι.
ltx/gr_gr_cog/me.m07.d01:meMA.Ode4C13.incipit	Οὐκ ἔστιν ἄνθρωπος, ὅστις οὐ…
ltx/gr_gr_cog/me.m07.d01:meMA.Ode4C13.melody	@ltx/gr_gr_cog/he.h.m6:heHE.ChristosMouDynamis.name
ltx/gr_gr_cog/me.m07.d01:meMA.Ode4C13.mode	@ltx/gr_gr_cog/miscellanea:misc.Mode6
ltx/gr_gr_cog/me.m07.d01:meMA.Ode4C13.ode	@ltx/gr_gr_cog/miscellanea:misc.Ode4
ltx/gr_gr_cog/me.m07.d01:meMA.Ode4C13.text	Οὐκ ἔστιν ἄνθρωπος, ὅστις οὐ κέκτηται, ἀγαθοὺς ὑμᾶς πρέσβεις πρὸς τὸν Χριστόν, Ἅγιοι Ἀνάργυροι, ὃν δυσωπήσατε πυρός, αἰωνίου λυτρωθῆναί με.
ltx/gr_gr_cog/me.m07.d01:meMA.Ode4C1T.incipit	Σκηνώσας Κύριος, ἁγνὴ ἐν μέσῳ…
ltx/gr_gr_cog/me.m07.d01:meMA.Ode4C1T.melody	@ltx/gr_gr_cog/he.h.m6:heHE.ChristosMouDynamis.name
ltx/gr_gr_cog/me.m07.d01:meMA.Ode4C1T.mode	@ltx/gr_gr_cog/miscellanea:misc.Mode6
ltx/gr_gr_cog/me.m07.d01:meMA.Ode4C1T.ode	@ltx/gr_gr_cog/miscellanea:misc.Ode4
ltx/gr_gr_cog/me.m07.d01:meMA.Ode4C1T.text	Σκηνώσας Κύριος, ἁγνὴ ἐν μέσῳ σου, τὴν σκηνὴν τὴν ἁγίαν, πηγὴν πολλῶν, δείκνυσιν ἰάσεων, καὶ καθαρτήριον παθῶν, Θεοτόκε ἀειπάρθενε.
ltx/gr_gr_cog/me.m07.d01:meMA.Ode5C11.greekmelody	@ltx/gr_gr_cog/he.h.m6:heHE.ToTheioFengeiSou.greekname
ltx/gr_gr_cog/me.m07.d01:meMA.Ode5C11.incipit	Τὸν θεῖον εἵλκυσαν φωτισμόν, τῶν…
ltx/gr_gr_cog/me.m07.d01:meMA.Ode5C11.melody	@ltx/gr_gr_cog/he.h.m6:heHE.ToTheioFengeiSou.name
ltx/gr_gr_cog/me.m07.d01:meMA.Ode5C11.mode	@ltx/gr_gr_cog/miscellanea:misc.Mode6
ltx/gr_gr_cog/me.m07.d01:meMA.Ode5C11.ode	@ltx/gr_gr_cog/miscellanea:misc.Ode5
ltx/gr_gr_cog/me.m07.d01:meMA.Ode5C11.text	Τὸν θεῖον εἵλκυσαν φωτισμόν, τῶν ἀπαυγασμάτων τὴν πηγήν, ὁλοκαρδίως ποθήσαντες, καὶ φωταγωγοῦσιν ἡμᾶς ἑκάστοτε, θαυμάτων δᾳδουχίαις οἱ μεγαλώνυμοι.
ltx/gr_gr_cog/me.m07.d01:meMA.Ode5C12.incipit	Ὡραῖον ζεῦγος ὄντες σοφοί, αὔλακας…
ltx/gr_gr_cog/me.m07.d01:meMA.Ode5C12.melody	@ltx/gr_gr_cog/he.h.m6:heHE.ToTheioFengeiSou.name
ltx/gr_gr_cog/me.m07.d01:meMA.Ode5C12.mode	@ltx/gr_gr_cog/miscellanea:misc.Mode6
ltx/gr_gr_cog/me.m07.d01:meMA.Ode5C12.ode	@ltx/gr_gr_cog/miscellanea:misc.Ode5
ltx/gr_gr_cog/me.m07.d01:meMA.Ode5C12.text	Ὡραῖον ζεῦγος ὄντες σοφοί, αὔλακας ἐργάζεσθε ψυχῶν, θεοσημείαις ἑκάστοτε, τέμνοντες τὰ πάθη ὥσπερ ζιζάνια, καὶ ῥώσεως τὸν στάχυν ἑκατοστεύοντες.
ltx/gr_gr_cog/me.m07.d01:meMA.Ode5C13.incipit	Νενευρωμένοι σθένει Χριστοῦ, τοῦ ἐν…
ltx/gr_gr_cog/me.m07.d01:meMA.Ode5C13.melody	@ltx/gr_gr_cog/he.h.m6:heHE.ToTheioFengeiSou.name
ltx/gr_gr_cog/me.m07.d01:meMA.Ode5C13.mode	@ltx/gr_gr_cog/miscellanea:misc.Mode6
ltx/gr_gr_cog/me.m07.d01:meMA.Ode5C13.ode	@ltx/gr_gr_cog/miscellanea:misc.Ode5
ltx/gr_gr_cog/me.m07.d01:meMA.Ode5C13.text	Νενευρωμένοι σθένει Χριστοῦ, τοῦ ἐν τῇ κακίᾳ δυνατοῦ, πᾶσαν ἰσχὺν διωλέσατε, οὗ τῆς τυραννίδος ἡμᾶς λυτρώσασθε, ἀκοίμητοι προστάται ἡμῶν Ἀνάργυροι.
ltx/gr_gr_cog/me.m07.d01:meMA.Ode5C1T.incipit	Ῥῦσαί με Δέσποινα ἀγαθή, τῶν…
ltx/gr_gr_cog/me.m07.d01:meMA.Ode5C1T.melody	@ltx/gr_gr_cog/he.h.m6:heHE.ToTheioFengeiSou.name
ltx/gr_gr_cog/me.m07.d01:meMA.Ode5C1T.mode	@ltx/gr_gr_cog/miscellanea:misc.Mode6
ltx/gr_gr_cog/me.m07.d01:meMA.Ode5C1T.ode	@ltx/gr_gr_cog/miscellanea:misc.Ode5
ltx/gr_gr_cog/me.m07.d01:meMA.Ode5C1T.text	Ῥῦσαί με Δέσποινα ἀγαθή, τῶν πειρατηρίων τοῦ ἐχθροῦ, τῆς ἐν γεέννῃ κολάσεως, καὶ τῆς συνεχούσης αἰχμαλωσίας με, καὶ μή με καταισχύνῃς ὑμνολογοῦντά σε.
ltx/gr_gr_cog/me.m07.d01:meMA.Ode6C11.greekmelody	@ltx/gr_gr_cog/he.h.m6:heHE.TouViouTinThalassan.greekname
ltx/gr_gr_cog/me.m07.d01:meMA.Ode6C11.incipit	Οἰκοῦντες Ἀνάργυροι, ἐν χαρᾷ τοὺς…
ltx/gr_gr_cog/me.m07.d01:meMA.Ode6C11.melody	@ltx/gr_gr_cog/he.h.m6:heHE.TouViouTinThalassan.name
ltx/gr_gr_cog/me.m07.d01:meMA.Ode6C11.mode	@ltx/gr_gr_cog/miscellanea:misc.Mode6
ltx/gr_gr_cog/me.m07.d01:meMA.Ode6C11.ode	@ltx/gr_gr_cog/miscellanea:misc.Ode6
ltx/gr_gr_cog/me.m07.d01:meMA.Ode6C11.text	Οἰκοῦντες Ἀνάργυροι, ἐν χαρᾷ τοὺς οὐρανούς, ἐν τῷ σεπτῷ ναῷ ὑμῶν, παραγενέσθαι σπεύσατε καὶ ἡμῶν, τὰς νόσους τοῦ σώματος, καὶ καρδίας τὰ πάθη ἐξοικίσατε.
ltx/gr_gr_cog/me.m07.d01:meMA.Ode6C12.incipit	Τὴν θείαν εὐπρέπειαν, στολισθέντες εὐπρεπῶς…
ltx/gr_gr_cog/me.m07.d01:meMA.Ode6C12.melody	@ltx/gr_gr_cog/he.h.m6:heHE.TouViouTinThalassan.name
ltx/gr_gr_cog/me.m07.d01:meMA.Ode6C12.mode	@ltx/gr_gr_cog/miscellanea:misc.Mode6
ltx/gr_gr_cog/me.m07.d01:meMA.Ode6C12.ode	@ltx/gr_gr_cog/miscellanea:misc.Ode6
ltx/gr_gr_cog/me.m07.d01:meMA.Ode6C12.text	Τὴν θείαν εὐπρέπειαν, στολισθέντες εὐπρεπῶς, ὡς διπλοΐδα Ἅγιοι, γυμνοὺς ἡμᾶς ὑπάρχοντας ἀρετῶν, ἐνθέως στολίσατε, καὶ παθῶν ἀτιμίας ἐκγυμνώσατε.
ltx/gr_gr_cog/me.m07.d01:meMA.Ode6C13.incipit	Ὡς κόσμον τὰ θαύματα, περικείμενοι…
ltx/gr_gr_cog/me.m07.d01:meMA.Ode6C13.melody	@ltx/gr_gr_cog/he.h.m6:heHE.TouViouTinThalassan.name
ltx/gr_gr_cog/me.m07.d01:meMA.Ode6C13.mode	@ltx/gr_gr_cog/miscellanea:misc.Mode6
ltx/gr_gr_cog/me.m07.d01:meMA.Ode6C13.ode	@ltx/gr_gr_cog/miscellanea:misc.Ode6
ltx/gr_gr_cog/me.m07.d01:meMA.Ode6C13.text	Ὡς κόσμον τὰ θαύματα, περικείμενοι παντός, σωτῆρες κόσμου ὤφθητε, τῆς κοσμικῆς οὖν βλάβης πάντας ἡμᾶς, λυτρώσασθε Ἅγιοι, καὶ παθῶν ἀτιμίας καὶ κολάσεως.
ltx/gr_gr_cog/me.m07.d01:meMA.Ode6C1T.incipit	Μὴ φλέξας τὴν μήτραν σου…
ltx/gr_gr_cog/me.m07.d01:meMA.Ode6C1T.melody	@ltx/gr_gr_cog/he.h.m6:heHE.TouViouTinThalassan.name
ltx/gr_gr_cog/me.m07.d01:meMA.Ode6C1T.mode	@ltx/gr_gr_cog/miscellanea:misc.Mode6
ltx/gr_gr_cog/me.m07.d01:meMA.Ode6C1T.ode	@ltx/gr_gr_cog/miscellanea:misc.Ode6
ltx/gr_gr_cog/me.m07.d01:meMA.Ode6C1T.text	Μὴ φλέξας τὴν μήτραν σου, πῦρ ὑπάρχων Ἰησοῦς, ἐκ σοῦ σαρκὶ προέρχεται, τοῦτον ἁγνὴ δυσώπησον τοῦ πυρός, καὶ πάσης κολάσεως, λυτρωθῆναι τοὺς πίστει ἀνυμνοῦντάς σε.
ltx/gr_gr_cog/me.m07.d01:meMA.Ode7C11.greekmelody	@ltx/gr_gr_cog/he.h.m6:heHE.DrosovolonMenTinKaminon.greekname
ltx/gr_gr_cog/me.m07.d01:meMA.Ode7C11.incipit	Ἑπτερώσατε τὸν νοῦν πρὸς τὰ…
ltx/gr_gr_cog/me.m07.d01:meMA.Ode7C11.melody	@ltx/gr_gr_cog/he.h.m6:heHE.DrosovolonMenTinKaminon.name
ltx/gr_gr_cog/me.m07.d01:meMA.Ode7C11.mode	@ltx/gr_gr_cog/miscellanea:misc.Mode6
ltx/gr_gr_cog/me.m07.d01:meMA.Ode7C11.ode	@ltx/gr_gr_cog/miscellanea:misc.Ode7
ltx/gr_gr_cog/me.m07.d01:meMA.Ode7C11.text	Ἑπτερώσατε τὸν νοῦν πρὸς τὰ οὐράνια, καλῶν ταῖς ἐπιδόσεσι, καὶ γενόμενοι, κοινωνοὶ τῶν θείων δωρεῶν, ὑπόπτεροι ὄντες ἀετοί, πᾶσαν διέρχεσθε τὴν γῆν, θαυματουργοῦντες ἀεί.
ltx/gr_gr_cog/me.m07.d01:meMA.Ode7C12.incipit	Λαμπρυνθέντες ὥσπερ ὄρυζον Ἀνάργυροι, χρυσίον…
ltx/gr_gr_cog/me.m07.d01:meMA.Ode7C12.melody	@ltx/gr_gr_cog/he.h.m6:heHE.DrosovolonMenTinKaminon.name
ltx/gr_gr_cog/me.m07.d01:meMA.Ode7C12.mode	@ltx/gr_gr_cog/miscellanea:misc.Mode6
ltx/gr_gr_cog/me.m07.d01:meMA.Ode7C12.ode	@ltx/gr_gr_cog/miscellanea:misc.Ode7
ltx/gr_gr_cog/me.m07.d01:meMA.Ode7C12.text	Λαμπρυνθέντες ὥσπερ ὄρυζον Ἀνάργυροι, χρυσίον θείᾳ χάριτι, ἐπλουτήσατε, ἰαμάτων χάριν δαψιλῶς· διὸ οἰκτιρήσατε ἡμᾶς, χειμαζομένους χαλεπῶν, ἐπαγωγαῖς πειρασμῶν.
ltx/gr_gr_cog/me.m07.d01:meMA.Ode7C13.incipit	Παραθέμενοι Κυρίῳ καθαρὰ ὑμῶν, τὰ…
ltx/gr_gr_cog/me.m07.d01:meMA.Ode7C13.melody	@ltx/gr_gr_cog/he.h.m6:heHE.DrosovolonMenTinKaminon.name
ltx/gr_gr_cog/me.m07.d01:meMA.Ode7C13.mode	@ltx/gr_gr_cog/miscellanea:misc.Mode6
ltx/gr_gr_cog/me.m07.d01:meMA.Ode7C13.ode	@ltx/gr_gr_cog/miscellanea:misc.Ode7
ltx/gr_gr_cog/me.m07.d01:meMA.Ode7C13.text	Παραθέμενοι Κυρίῳ καθαρὰ ὑμῶν, τὰ πνεύματα Ἀνάργυροι, τὰ ἀκάθαρτα, ἐκδιώκειν χάριν παρʼ αὐτοῦ, ἐδέξασθε πνεύματα ἀεί, ὧν τῆς κακίας τῆς πικρᾶς, ῥύσασθε πάντας ἡμᾶς.
ltx/gr_gr_cog/me.m07.d01:meMA.Ode7C14.incipit	Ἐκοιμήθητε δικαίοις ὀφειλόμενον, ὕπνον σοφοὶ…
ltx/gr_gr_cog/me.m07.d01:meMA.Ode7C14.melody	@ltx/gr_gr_cog/he.h.m6:heHE.DrosovolonMenTinKaminon.name
ltx/gr_gr_cog/me.m07.d01:meMA.Ode7C14.mode	@ltx/gr_gr_cog/miscellanea:misc.Mode6
ltx/gr_gr_cog/me.m07.d01:meMA.Ode7C14.ode	@ltx/gr_gr_cog/miscellanea:misc.Ode7
ltx/gr_gr_cog/me.m07.d01:meMA.Ode7C14.text	Ἐκοιμήθητε δικαίοις ὀφειλόμενον, ὕπνον σοφοὶ Ἀνάργυροι, καὶ ἀκοίμητοι πρεσβευταὶ ὑπάρχετε πιστῶν· διὸ τῶν ψυχῶν ἡμῶν ἀεί, καὶ τῶν σωμάτων τὰ δεινὰ πάθη κοιμίσατε.
ltx/gr_gr_cog/me.m07.d01:meMA.Ode7C1T.incipit	Ἱκετεύουσα μὴ παύσῃ τὸν φιλάνθρωπον…
ltx/gr_gr_cog/me.m07.d01:meMA.Ode7C1T.melody	@ltx/gr_gr_cog/he.h.m6:heHE.DrosovolonMenTinKaminon.name
ltx/gr_gr_cog/me.m07.d01:meMA.Ode7C1T.mode	@ltx/gr_gr_cog/miscellanea:misc.Mode6
ltx/gr_gr_cog/me.m07.d01:meMA.Ode7C1T.ode	@ltx/gr_gr_cog/miscellanea:misc.Ode7
ltx/gr_gr_cog/me.m07.d01:meMA.Ode7C1T.text	Ἱκετεύουσα μὴ παύσῃ τὸν φιλάνθρωπον, Θεὸν ἡμῶν Πανάμωμε, ὅπως λάβωμεν, παντελῆ συγχώρησιν κακῶν, καὶ τύχωμεν τῶν ἐν οὐρανοῖς, ἡτοιμασμένων ἀγαθῶν τοῖς ἀγαπῶσιν αὐτόν.
ltx/gr_gr_cog/me.m07.d01:meMA.Ode8C11.greekmelody	@ltx/gr_gr_cog/he.h.m6:heHE.EkFlogosToisOsiois.greekname
ltx/gr_gr_cog/me.m07.d01:meMA.Ode8C11.incipit	Νοσημάτων παντοίων ὄντες πολέμιοι, συμμαχίᾳ…
ltx/gr_gr_cog/me.m07.d01:meMA.Ode8C11.melody	@ltx/gr_gr_cog/he.h.m6:heHE.EkFlogosToisOsiois.name
ltx/gr_gr_cog/me.m07.d01:meMA.Ode8C11.mode	@ltx/gr_gr_cog/miscellanea:misc.Mode6
ltx/gr_gr_cog/me.m07.d01:meMA.Ode8C11.ode	@ltx/gr_gr_cog/miscellanea:misc.Ode8
ltx/gr_gr_cog/me.m07.d01:meMA.Ode8C11.text	Νοσημάτων παντοίων ὄντες πολέμιοι, συμμαχίᾳ τοῦ θείου Πνεύματος Ἅγιοι, παύσατε ἡμῶν, τῶν ψυχῶν τὰ νοσήματα, καὶ τὰς τῶν σωμάτων, κουφίσατε ὀδύνας.
ltx/gr_gr_cog/me.m07.d01:meMA.Ode8C12.incipit	Θεωροὶ τοῦ Κυρίου νῦν τῆς…
ltx/gr_gr_cog/me.m07.d01:meMA.Ode8C12.melody	@ltx/gr_gr_cog/he.h.m6:heHE.EkFlogosToisOsiois.name
ltx/gr_gr_cog/me.m07.d01:meMA.Ode8C12.mode	@ltx/gr_gr_cog/miscellanea:misc.Mode6
ltx/gr_gr_cog/me.m07.d01:meMA.Ode8C12.ode	@ltx/gr_gr_cog/miscellanea:misc.Ode8
ltx/gr_gr_cog/me.m07.d01:meMA.Ode8C12.text	Θεωροὶ τοῦ Κυρίου νῦν τῆς τερπνότητος, χρηματίζοντες ὄντως προσεπισκέπτεσθε, τοῦτον τὸν τερπνόν, θεοφόροι ναὸν ὑμῶν, καὶ πηγὴν θαυμάτων, πολλῶν ἐπιτελεῖτε.
ltx/gr_gr_cog/me.m07.d01:meMA.Ode8C13.incipit	Ἐκ πηγῆς Παραδείσου ἐκπορευόμενοι, ποταμοὶ…
ltx/gr_gr_cog/me.m07.d01:meMA.Ode8C13.melody	@ltx/gr_gr_cog/he.h.m6:heHE.EkFlogosToisOsiois.name
ltx/gr_gr_cog/me.m07.d01:meMA.Ode8C13.mode	@ltx/gr_gr_cog/miscellanea:misc.Mode6
ltx/gr_gr_cog/me.m07.d01:meMA.Ode8C13.ode	@ltx/gr_gr_cog/miscellanea:misc.Ode8
ltx/gr_gr_cog/me.m07.d01:meMA.Ode8C13.text	Ἐκ πηγῆς Παραδείσου ἐκπορευόμενοι, ποταμοὶ ὥσπερ δύο ἅπαν ἀρδεύετε, πρόσωπον τῆς γῆς, ἰαμάτων τοῖς νάμασι, καὶ τῶν νοσημάτων, ξηραίνετε τους ὄμβρους.
ltx/gr_gr_cog/me.m07.d01:meMA.Ode8C14.incipit	Μακαρίων ἐλπίδων ἐπιλαβόμενοι, ὑπὸ πάντων…
ltx/gr_gr_cog/me.m07.d01:meMA.Ode8C14.melody	@ltx/gr_gr_cog/he.h.m6:heHE.EkFlogosToisOsiois.name
ltx/gr_gr_cog/me.m07.d01:meMA.Ode8C14.mode	@ltx/gr_gr_cog/miscellanea:misc.Mode6
ltx/gr_gr_cog/me.m07.d01:meMA.Ode8C14.ode	@ltx/gr_gr_cog/miscellanea:misc.Ode8
ltx/gr_gr_cog/me.m07.d01:meMA.Ode8C14.text	Μακαρίων ἐλπίδων ἐπιλαβόμενοι, ὑπὸ πάντων ἀξίως νῦν μακαρίζεσθε, ὡς ἐκπληρωταί, μακαρίου Θεοῦ ἡμῶν, θείων θελημάτων, Ἀνάργυροι δειχθέντες.
ltx/gr_gr_cog/me.m07.d01:meMA.Ode8C15.incipit	Ἰατροὶ ἀνιάτων παθῶν Ἀναργυροι, τὰ…
ltx/gr_gr_cog/me.m07.d01:meMA.Ode8C15.melody	@ltx/gr_gr_cog/he.h.m6:heHE.EkFlogosToisOsiois.name
ltx/gr_gr_cog/me.m07.d01:meMA.Ode8C15.mode	@ltx/gr_gr_cog/miscellanea:misc.Mode6
ltx/gr_gr_cog/me.m07.d01:meMA.Ode8C15.ode	@ltx/gr_gr_cog/miscellanea:misc.Ode8
ltx/gr_gr_cog/me.m07.d01:meMA.Ode8C15.text	Ἰατροὶ ἀνιάτων παθῶν Ἀναργυροι, τὰ ἀνίατα πάθη ἡμῶν ἰάσασθε, καὶ τῶν πειρασμῶν, τὸν χειμῶνα πραΰνατε, καὶ τῆς ἀθυμίας, σκεδάσατε τὰ νέφη.
ltx/gr_gr_cog/me.m07.d01:meMA.Ode8C1Tr.incipit	Σὺν ἁγίοις Ἀγγέλοις ὑμνολογήσωμεν, τὸν…
ltx/gr_gr_cog/me.m07.d01:meMA.Ode8C1Tr.melody	@ltx/gr_gr_cog/he.h.m6:heHE.EkFlogosToisOsiois.name
ltx/gr_gr_cog/me.m07.d01:meMA.Ode8C1Tr.mode	@ltx/gr_gr_cog/miscellanea:misc.Mode6
ltx/gr_gr_cog/me.m07.d01:meMA.Ode8C1Tr.ode	@ltx/gr_gr_cog/miscellanea:misc.Ode8
ltx/gr_gr_cog/me.m07.d01:meMA.Ode8C1Tr.text	Σὺν ἁγίοις Ἀγγέλοις ὑμνολογήσωμεν, τὸν Πατέρα καὶ Λόγον καὶ Πνεῦμα Ἅγιον, μίαν ἐν τρισί, χαρακτῆρσι Θεότητα, μίαν βασιλείαν, καὶ μίαν ἐξουσίαν.
ltx/gr_gr_cog/me.m07.d01:meMA.Ode9C11.greekmelody	@ltx/gr_gr_cog/he.h.m6:heHE.TheonAnthropois.greekname
ltx/gr_gr_cog/me.m07.d01:meMA.Ode9C11.incipit	Ἰδοὺ ὁ οἶκος ὑμῶν τοῖς…
ltx/gr_gr_cog/me.m07.d01:meMA.Ode9C11.melody	@ltx/gr_gr_cog/he.h.m6:heHE.TheonAnthropois.name
ltx/gr_gr_cog/me.m07.d01:meMA.Ode9C11.mode	@ltx/gr_gr_cog/miscellanea:misc.Mode6
ltx/gr_gr_cog/me.m07.d01:meMA.Ode9C11.ode	@ltx/gr_gr_cog/miscellanea:misc.Ode9
ltx/gr_gr_cog/me.m07.d01:meMA.Ode9C11.text	Ἰδοὺ ὁ οἶκος ὑμῶν τοῖς θαύμασι, πανευπρεπῶς, ὡς ἄστροις φωταυγέσι λαμπρύνεται, καὶ συμφώνως ὑμᾶς ἀγαλλόμενος, πάντοτε μακαρίζει, καὶ τὴν σεπτὴν ὑμῶν, μνήμην ἑορτάζει εὐσεβῶς, σεπτοὶ Ἀνάργυροι.
ltx/gr_gr_cog/me.m07.d01:meMA.Ode9C12.incipit	Ὡς φῶς ὡς δύο μεγάλοι…
ltx/gr_gr_cog/me.m07.d01:meMA.Ode9C12.melody	@ltx/gr_gr_cog/he.h.m6:heHE.TheonAnthropois.name
ltx/gr_gr_cog/me.m07.d01:meMA.Ode9C12.mode	@ltx/gr_gr_cog/miscellanea:misc.Mode6
ltx/gr_gr_cog/me.m07.d01:meMA.Ode9C12.ode	@ltx/gr_gr_cog/miscellanea:misc.Ode9
ltx/gr_gr_cog/me.m07.d01:meMA.Ode9C12.text	Ὡς φῶς ὡς δύο μεγάλοι ἥλιοι, τὸ νοητὸν στερέωμα κοσμεῖτε Ἀνάργυροι, καὶ σημείων ἀκτῖσι λαμπρύνετε πάντων πιστῶν καρδίας· ὅθεν κραυγάζομεν· Λύσατε τὸ σκότος, τῶν παθῶν ἡμῶν δεόμεθα.
ltx/gr_gr_cog/me.m07.d01:meMA.Ode9C13.incipit	Σκηνὰς τὰς ἄνω οἰκοῦντες Ἅγιοι…
ltx/gr_gr_cog/me.m07.d01:meMA.Ode9C13.melody	@ltx/gr_gr_cog/he.h.m6:heHE.TheonAnthropois.name
ltx/gr_gr_cog/me.m07.d01:meMA.Ode9C13.mode	@ltx/gr_gr_cog/miscellanea:misc.Mode6
ltx/gr_gr_cog/me.m07.d01:meMA.Ode9C13.ode	@ltx/gr_gr_cog/miscellanea:misc.Ode9
ltx/gr_gr_cog/me.m07.d01:meMA.Ode9C13.text	Σκηνὰς τὰς ἄνω οἰκοῦντες Ἅγιοι, μέσον ἡμῶν γενέσθαι ἀοράτως σπλαγχνίσθητε, τῶν ἐν μέσῳ τῆς θείας σκηνῆς ὑμῶν, ὕμνους ἀναπεμπόντων, τῷ παντοκράτορι, καὶ μακαριζόντων, ἐκτενῶς ὑμᾶς πανεύφημοι.
ltx/gr_gr_cog/me.m07.d01:meMA.Ode9C14.incipit	Ἡ γῆ τοῖς ἄνω συνεπαγάλλεται…
ltx/gr_gr_cog/me.m07.d01:meMA.Ode9C14.melody	@ltx/gr_gr_cog/he.h.m6:heHE.TheonAnthropois.name
ltx/gr_gr_cog/me.m07.d01:meMA.Ode9C14.mode	@ltx/gr_gr_cog/miscellanea:misc.Mode6
ltx/gr_gr_cog/me.m07.d01:meMA.Ode9C14.ode	@ltx/gr_gr_cog/miscellanea:misc.Ode9
ltx/gr_gr_cog/me.m07.d01:meMA.Ode9C14.text	Ἡ γῆ τοῖς ἄνω συνεπαγάλλεται, ἐν τῇ φαιδρᾷ καὶ θείᾳ ἑορτῇ ὑμῶν Ἅγιοι, ἣν τελοῦντας ἡμᾶς ἐκλυτρώσατε, σκότος ἀῤῥωστημάτων, πάσης στενώσεως, καὶ τῆς ἐν τῷ Ἅδῃ, χαλεπῆς σοφοὶ κολάσεως.
ltx/gr_gr_cog/me.m07.d01:meMA.Ode9C1T.incipit	Φρικτὴν λοχείαν ἔχουσα Πάναγνε, ἐν…
ltx/gr_gr_cog/me.m07.d01:meMA.Ode9C1T.melody	@ltx/gr_gr_cog/he.h.m6:heHE.TheonAnthropois.name
ltx/gr_gr_cog/me.m07.d01:meMA.Ode9C1T.mode	@ltx/gr_gr_cog/miscellanea:misc.Mode6
ltx/gr_gr_cog/me.m07.d01:meMA.Ode9C1T.ode	@ltx/gr_gr_cog/miscellanea:misc.Ode9
ltx/gr_gr_cog/me.m07.d01:meMA.Ode9C1T.text	Φρικτὴν λοχείαν ἔχουσα Πάναγνε, ἐν τῇ φρικτῇ ἡμέρᾳ τῆς ἐτάσεως δέομαι, τῆς φρικτῆς ἀποφάσεως ῥῦσαί με, καὶ τῆς τῶν σῳζομένων στάσεως μέτοχον, ποίησον ὑμνοῦντα, σὲ πιστῶς θεοχαρίτωτε.
ltx/gr_gr_cog/me.m07.d01:meMA.Oikos1.text	Πάσης συνέσεως καὶ σοφίας, ὑπέρκειται ὁ λόγος τῶν σοφῶν ἰατρῶν, καὶ πᾶσι γνῶσιν παρέχουσι· τοῦ γὰρ Ὑψίστου χάριν λαβόντες, ἀοράτως τὴν ῥῶσιν δωροῦνται πᾶσιν· ὅθεν κἀμοὶ διηγήσεως χάριν δεδώρηνται, ὑμνῆσαι ὡς θεοφόρους, εὐαρέστους Χριστοῦ καὶ θεράποντας, ἰαμάτων πλήθη παρέχοντας· ἀλγηδόνων γὰρ πάντας λυτροῦνται, τὸν κόσμον ἰώμενοι ἐν τοῖς θαύμασι.
ltx/gr_gr_cog/me.m07.d01:meVE.Apolytikion1.incipit	Ἅγιοι Ἀνάργυροι…
ltx/gr_gr_cog/me.m07.d01:meVE.Apolytikion1.melody	
ltx/gr_gr_cog/me.m07.d01:meVE.Apolytikion1.mode	@ltx/gr_gr_cog/miscellanea:misc.Mode8
ltx/gr_gr_cog/me.m07.d01:meVE.Apolytikion1.text	Ἅγιοι Ἀνάργυροι καὶ θαυματουργοί, ἐπισκέψασθε τὰς ἀσθενείας ἡμῶν, δωρεὰν ἐλάβετε, δωρεὰν δότε ἡμῖν.
ltx/gr_gr_cog/me.m07.d01:meVE.AposGlory.incipit	Πάντοτε ἔχοντες Χριστόν…
ltx/gr_gr_cog/me.m07.d01:meVE.AposGlory.melody	
ltx/gr_gr_cog/me.m07.d01:meVE.AposGlory.mode	@ltx/gr_gr_cog/miscellanea:misc.Mode6
ltx/gr_gr_cog/me.m07.d01:meVE.AposGlory.text	Πάντοτε ἔχοντες Χριστόν, ἐνεργοῦντα ἐν ὑμῖν, Ἅγιοι Ἀνάργυροι, θαυματουργεῖτε ἐν κόσμῳ, ἀσθενοῦντας θεραπεύετε· καὶ γὰρ τὸ ἰατρεῖον ὑμῶν, πηγὴ ὑπάρχει ἀνεξάντλητος· ἀντλουμένη δέ, μᾶλλον ὑπερεκβλύζει, καὶ χεομένη περισσεύεται, καθʼ ἑκάστην κενουμένη καὶ πληθυνομένη, πᾶσι χορηγοῦσα καὶ μὴ λειπομένη· καὶ οἱ ἀρυόμενοι κορέννυνται ἰάματα, καὶ αὕτη διαμένει ἀδαπάνητος. Τί οὖν ὑμᾶς καλέσωμεν; θεράποντας ἰατροὺς ψυχῶν τε καὶ σωμάτων, ἰατῆρας παθῶν ἀνιάτων, δωρεὰν ἰωμένους ἅπαντας, εἰληφότας χαρίσματα, παρὰ τοῦ Σωτῆρος Χριστοῦ, τοῦ παρέχοντος ἡμῖν τὸ μέγα ἔλεος.
ltx/gr_gr_cog/me.m07.d01:meVE.AposTheotokion.incipit	@ltx/gr_gr_cog/he.o:heOT.TheotokeSyEi.incipit
ltx/gr_gr_cog/me.m07.d01:meVE.AposTheotokion.melody	@ltx/gr_gr_cog/he.o:heOT.TheotokeSyEi.name
ltx/gr_gr_cog/me.m07.d01:meVE.AposTheotokion.mode	@ltx/gr_gr_cog/miscellanea:misc.Mode6
ltx/gr_gr_cog/me.m07.d01:meVE.AposTheotokion.text	@ltx/gr_gr_cog/he.o:heOT.TheotokeSyEiAnargyron.text
ltx/gr_gr_cog/me.m07.d01:meVE.Aposticha1.greekmelody	@ltx/gr_gr_cog/he.a.m1:heAU.TonOuranionTagmaton.greekname
ltx/gr_gr_cog/me.m07.d01:meVE.Aposticha1.incipit	Τῶν Ἀναργύρων τῇ μνήμῃ…
ltx/gr_gr_cog/me.m07.d01:meVE.Aposticha1.melody	@ltx/gr_gr_cog/he.a.m1:heAU.TonOuranionTagmaton.name
ltx/gr_gr_cog/me.m07.d01:meVE.Aposticha1.mode	@ltx/gr_gr_cog/miscellanea:misc.Mode1
ltx/gr_gr_cog/me.m07.d01:meVE.Aposticha1.text	Τῶν Ἀναργύρων τῇ μνήμῃ πάντες συνδράμωμεν, ἐν καθαρᾷ καρδίᾳ, καὶ ἁγνῷ συνειδότι, αὐτοῖς συνεκβοῶντες· Χαίροις δυάς, τῶν ἀσθενούντων ἡ ἴασις, ὅτι ὑμεῖς ἀπειλήφατε ἐκ Θεοῦ, τὴν ἐξουσίαν τῶν ἰάσεων.
ltx/gr_gr_cog/me.m07.d01:meVE.Aposticha2.incipit	Τὰς ἐντολὰς τοῦ Κυρίου…
ltx/gr_gr_cog/me.m07.d01:meVE.Aposticha2.melody	@ltx/gr_gr_cog/he.a.m1:heAU.TonOuranionTagmaton.name
ltx/gr_gr_cog/me.m07.d01:meVE.Aposticha2.mode	@ltx/gr_gr_cog/miscellanea:misc.Mode1
ltx/gr_gr_cog/me.m07.d01:meVE.Aposticha2.text	Τὰς ἐντολὰς τοῦ Κυρίου καλῶς φυλάξαντες, φιλαργυρίας νόσον, ἐκτεμόντες πανσόφως, ἰᾶσθε ἀναργύρως· ὅθεν ὑμῶν, τὴν πανσέβαστον κοίμησιν, ἀξιοχρέως τιμῶμεν θαυματουργοί, ἱκετεύσατε σωθῆναι ἡμᾶς.
ltx/gr_gr_cog/me.m07.d01:meVE.Aposticha3.incipit	Ὡς παῤῥησίαν λαβόντες…
ltx/gr_gr_cog/me.m07.d01:meVE.Aposticha3.melody	@ltx/gr_gr_cog/he.a.m1:heAU.TonOuranionTagmaton.name
ltx/gr_gr_cog/me.m07.d01:meVE.Aposticha3.mode	@ltx/gr_gr_cog/miscellanea:misc.Mode1
ltx/gr_gr_cog/me.m07.d01:meVE.Aposticha3.text	Ὡς παῤῥησίαν λαβόντες παρὰ τοῦ μόνου Θεοῦ, τοῦ ἐλεεῖν καὶ σῴζειν, ἐκ ποικίλων κινδύνων, λυτρώσασθε τοὺς πίστει ὑμνοῦντας ὑμᾶς, θεοφόροι Ἀνάργυροι, καὶ ἐκ παθῶν καὶ κινδύνων καὶ πειρασμῶν, ψυχῆς ἅμα καὶ τοῦ σώματος.
ltx/gr_gr_cog/me.m07.d01:meVE.Lity1.incipit	Ἡ πηγὴ τῶν ἰαμάτων…
ltx/gr_gr_cog/me.m07.d01:meVE.Lity1.melody	
ltx/gr_gr_cog/me.m07.d01:meVE.Lity1.mode	@ltx/gr_gr_cog/miscellanea:misc.Mode2
ltx/gr_gr_cog/me.m07.d01:meVE.Lity1.text	Ἡ πηγὴ τῶν ἰαμάτων, ἕνα καὶ μόνον ἐθεράπευε τοῦ ἔτους, ἡ σκηνὴ τῶν Ἀναργύρων, ἄπαν τὸ πλῆθος θεραπεύει τῶν νοσούντων· ἀνενδεὴς γὰρ ὑπάρχει, καὶ ἀδαπάνητος ὁ πλοῦτος τῶν Ἁγίων. Ταῖς αὐτῶν ἱκεσίαις Χριστέ, ἐλέησον ἡμᾶς.
ltx/gr_gr_cog/me.m07.d01:meVE.Lity2.incipit	Πόθῳ θείῳ, καὶ ἔρωτι…
ltx/gr_gr_cog/me.m07.d01:meVE.Lity2.melody	
ltx/gr_gr_cog/me.m07.d01:meVE.Lity2.mode	@ltx/gr_gr_cog/miscellanea:misc.Mode2
ltx/gr_gr_cog/me.m07.d01:meVE.Lity2.text	Πόθῳ θείῳ, καὶ ἔρωτι τῶν μελλόντων, πρακτικῶς πολιτευσάμενοι, τὰς σωτηρίους ὁδοὺς διηνύσατε· ὅθεν τὸ καθαρὸν τῆς ψυχῆς ἀκηλίδωτον τηρήσαντες, τῶν ἐνύλων τελείως ἀπέστητε, Πνεύματι δὲ θείῳ χρυσωθέντες, ἀχρύσως τὰς ἰάσεις τοῖς νοσοῦσι παρέχετε, δυὰς ἱερά, φωταυγὴς ξυνωρίς, πεφωτισμένον θεῖον ζεῦγος, Ἀνάργυροι, ἐν θλίψεσι καὶ νόσοις ἐπισκεπτόμενοι ἡμᾶς, καὶ τῶν ψυχῶν ἡμῶν τὰς νόσους, ἀναργύρως ἰώμενοι.
ltx/gr_gr_cog/me.m07.d01:meVE.Lity3.incipit	Μεγάλων ἀξιωθέντες δωρεῶν…
ltx/gr_gr_cog/me.m07.d01:meVE.Lity3.melody	
ltx/gr_gr_cog/me.m07.d01:meVE.Lity3.mode	@ltx/gr_gr_cog/miscellanea:misc.Mode2
ltx/gr_gr_cog/me.m07.d01:meVE.Lity3.text	Μεγάλων ἀξιωθέντες δωρεῶν πανεύφημοι, ἐν ταπεινότητι βίου ἐν τῇ γῇ ἐπολιτεύσασθε, καὶ διερχόμενοι πανταχοῦ, δωρεὰν τῶν νοσούντων τὰ πάθη ἰώμενοι, ὤφθητε Ἀγγέλων συνόμιλοι, Κοσμᾶ σὺν Δαμιανῷ τῷ σοφῷ, ἀδελφοὶ τερπνότατοι, καὶ ἡμῶν τὰ πάθη, ταῖς εὐχαῖς ἡμῶν ἰάσασθε.
ltx/gr_gr_cog/me.m07.d01:meVE.Lity4.incipit	Ἀγάλλεται ὁ χορὸς…
ltx/gr_gr_cog/me.m07.d01:meVE.Lity4.melody	
ltx/gr_gr_cog/me.m07.d01:meVE.Lity4.mode	@ltx/gr_gr_cog/miscellanea:misc.Mode2
ltx/gr_gr_cog/me.m07.d01:meVE.Lity4.text	Ἀγάλλεται ὁ χορὸς τῶν Ἁγίων εἰς αἰῶνας· βασιλείαν γὰρ οὐρανῶν ἐκληρονόμησαν. Γῆ τὰ Λείψανα αὐτῶν δεξαμένη, εὐωδίαν διέπνευσε. Δοῦλοι Χριστοῦ γεγόνασι, κατασκηνώσαντες εἰς ζωὴν τὴν αἰώνιον.
ltx/gr_gr_cog/me.m07.d01:meVE.Lity5.incipit	Ἰατροὶ τῶν ἀσθενούντων…
ltx/gr_gr_cog/me.m07.d01:meVE.Lity5.melody	
ltx/gr_gr_cog/me.m07.d01:meVE.Lity5.mode	@ltx/gr_gr_cog/miscellanea:misc.Mode2
ltx/gr_gr_cog/me.m07.d01:meVE.Lity5.text	Ἰατροὶ τῶν ἀσθενούντων, θησαυροὶ τῶν ἰαμάτων, σωτήριοι τῶν πιστῶν, Ἀνάργυροι πανευκλεεῖς, τοὺς ἐν ἀνάγκαις κράζοντας, καὶ ὀδυνωμένους ἰάσασθε, ἱκετεύοντες Θεὸν τὸν ἀγαθόν, λυτρώσασθαι ἡμᾶς, τῶν παγίδων τοῦ ἐχθροῦ.
ltx/gr_gr_cog/me.m07.d01:meVE.LityBoth.incipit	@ltx/gr_gr_cog/he.o:heOT.TheotokeSyEi.incipit
ltx/gr_gr_cog/me.m07.d01:meVE.LityBoth.melody	@ltx/gr_gr_cog/he.o:heOT.TheotokeSyEi.name
ltx/gr_gr_cog/me.m07.d01:meVE.LityBoth.mode	@ltx/gr_gr_cog/miscellanea:misc.Mode6
ltx/gr_gr_cog/me.m07.d01:meVE.LityBoth.text	@ltx/gr_gr_cog/he.o:heOT.TheotokeSyEiAnargyron.text
ltx/gr_gr_cog/me.m07.d01:meVE.LityGlory.incipit	Φαιδρὰ καὶ ἐπίφωτος ἀνέτειλε σήμερον…
ltx/gr_gr_cog/me.m07.d01:meVE.LityGlory.melody	
ltx/gr_gr_cog/me.m07.d01:meVE.LityGlory.mode	@ltx/gr_gr_cog/miscellanea:misc.Mode6
ltx/gr_gr_cog/me.m07.d01:meVE.LityGlory.text	Φαιδρὰ καὶ ἐπίφωτος ἀνέτειλε σήμερον, ἡ μνήμη τῶν Ἀναργύρων Χριστοῦ, λαμπρῶς καταλάμπουσα ταῖς ἀκτῖσι τῶν θαυμάτων. Δεῦτε οὖν φιλέορτοι, πιστῶς πανηγυρίσωμεν, δεῦτε, τῇ σορῷ τῶν Ἁγίων, προθύμως πάντες προσδράμωμεν, ὅπως τὴν ταχίστην ἴασιν ἀφθόνως παρʼ αὐτῶν κομισώμεθα· ἀναργύρως γὰρ παρέχουσι πᾶσι, τῇ ἐνεργείᾳ τοῦ Ἁγίου Πνεύματος, τῶν ἰαμάτων τὰ χαρίσματα.
ltx/gr_gr_cog/me.m07.d01:meVE.SticGlory.incipit	Ἀτελεύτητος ὑπάρχει τῶν Ἁγίων ἡ χάρις…
ltx/gr_gr_cog/me.m07.d01:meVE.SticGlory.melody	
ltx/gr_gr_cog/me.m07.d01:meVE.SticGlory.mode	@ltx/gr_gr_cog/miscellanea:misc.Mode6
ltx/gr_gr_cog/me.m07.d01:meVE.SticGlory.poet	@ltx/gr_gr_cog/poets:po.Anatoliou
ltx/gr_gr_cog/me.m07.d01:meVE.SticGlory.text	Ἀτελεύτητος ὑπάρχει τῶν Ἁγίων ἡ χάρις, ἣν παρὰ Χριστοῦ ἐκομίσαντο· ὅθεν αὐτῶν καὶ τὰ λείψανα, ἐκ θείας δυνάμεως, διηνεκῶς ἐνεργοῦσι τοῖς θαύμασιν· ὧν καὶ τὰ ὀνόματα μόνα, ἐκ πίστεως ἐπιβοώμενα, τῶν ἀνιάτων ἀλγηδόνων ἀπαλλάττουσι. Διʼ ὧν Κύριε καὶ ἡμᾶς, τῶν τῆς ψυχῆς καὶ τοῦ σώματος παθῶν ἐλευθέρωσον, ὡς φιλάνθρωπος.
ltx/gr_gr_cog/me.m07.d01:meVE.SticTheotokion.incipit	@ltx/gr_gr_cog/oc.m6.d1:ocVE.SticTheotokion.incipit
ltx/gr_gr_cog/me.m07.d01:meVE.SticTheotokion.melody	
ltx/gr_gr_cog/me.m07.d01:meVE.SticTheotokion.mode	@ltx/gr_gr_cog/miscellanea:misc.Mode6
ltx/gr_gr_cog/me.m07.d01:meVE.SticTheotokion.text	@ltx/gr_gr_cog/oc.m6.d1:ocVE.SticTheotokion.text
ltx/gr_gr_cog/me.m07.d01:meVE.Stichera01.greekmelody	@ltx/gr_gr_cog/he.a.m6:heAU.OlinApothemenoi.greekname
ltx/gr_gr_cog/me.m07.d01:meVE.Stichera01.incipit	@ltx/gr_gr_cog/he.a.m6:heAU.OlinApothemenoi.incipit
ltx/gr_gr_cog/me.m07.d01:meVE.Stichera01.melody	@ltx/gr_gr_cog/he.a.m6:heAU.OlinApothemenoi.melody
ltx/gr_gr_cog/me.m07.d01:meVE.Stichera01.mode	@ltx/gr_gr_cog/miscellanea:misc.Mode6
ltx/gr_gr_cog/me.m07.d01:meVE.Stichera01.text	@ltx/gr_gr_cog/he.a.m6:heAU.OlinApothemenoi.text
ltx/gr_gr_cog/me.m07.d01:meVE.Stichera02.incipit	Ὕλην ἑβδελύξαντο…
ltx/gr_gr_cog/me.m07.d01:meVE.Stichera02.melody	@ltx/gr_gr_cog/he.a.m6:heAU.OlinApothemenoi.name
ltx/gr_gr_cog/me.m07.d01:meVE.Stichera02.mode	@ltx/gr_gr_cog/miscellanea:misc.Mode6
ltx/gr_gr_cog/me.m07.d01:meVE.Stichera02.text	Ὕλην ἑβδελύξαντο, τὴν ἐπὶ γῆς φθειρομένην, οὐρανοπολῖται δέ, ἐν σαρκὶ ἰσάγγελοι ἐχρημάτισαν, ἡ ὁμόφρων σύσκηνος, ξυνωρὶς ὁμότροπος, τῶν Ἁγίων καὶ ὁμόψυχος· διὸ τοῖς κάμνουσι, πᾶσι τὰς ἰάσεις βραβεύουσιν, ἀνάργυρον παρέχοντες, τὴν εὐεργεσίαν τοῖς χρῄζουσιν. Οὓς ἐν ἐτησίοις, τιμήσωμεν ἀξίως ἑορταῖς, ἐν παῤῥησίᾳ πρεσβεύοντας, ὑπὲρ τῶν ψυχῶν ἡμῶν.
ltx/gr_gr_cog/me.m07.d01:meVE.Stichera03.incipit	Ὅλην εἰσοικίσασα…
ltx/gr_gr_cog/me.m07.d01:meVE.Stichera03.melody	@ltx/gr_gr_cog/he.a.m6:heAU.OlinApothemenoi.name
ltx/gr_gr_cog/me.m07.d01:meVE.Stichera03.mode	@ltx/gr_gr_cog/miscellanea:misc.Mode6
ltx/gr_gr_cog/me.m07.d01:meVE.Stichera03.text	Ὅλην εἰσοικίσασα, ἐν ἑαυτῇ τὴν Τριάδα, δυὰς ἡ ἀοίδιμος, Κοσμᾶς καὶ Δαμιανὸς οἱ θεόφρονες, ὡς κρουνοὶ βλύζουσιν, ἐκ πηγῆς νάματα, ζωηφόρου τῶν ἰάσεων, ὧν καὶ τὰ λείψανα, πάθη διʼ ἁφῆς θεραπεύουσι, καὶ μόνα τὰ ὀνόματα, νόσους ἐκ βροτῶν ἀπελαύνουσι, πάντων τῶν προσφύγων, σωτήριοι τελοῦντες, τῷ Χριστῷ, ἐν παῤῥησίᾳ πρεσβεύουσιν, ὑπὲρ τῶν ψυχῶν ἡμῶν.
