ltx/gr_gr_cog/me.m04.d13:meDA.commemoration.first	Μνήμη τοῦ Ἁγίου Μαρτίνου, Πάπα Ῥώμης
ltx/gr_gr_cog/me.m04.d13:meDA.commemoration.first_name	
ltx/gr_gr_cog/me.m04.d13:meDA.commemoration.first_short	Μνήμη τοῦ Ἁγίου Μαρτίνου, Πάπα Ῥώμης
ltx/gr_gr_cog/me.m04.d13:meDA.commemoration.first_title	@ltx/gr_gr_cog/titles:ti.SaintM
ltx/gr_gr_cog/me.m04.d13:meDA.commemoration.full	Μνήμη τοῦ ἐν Ἁγίοις Πατρὸς ἡμῶν Μαρτίνου, Πάπα Ῥώμης
ltx/gr_gr_cog/me.m04.d13:meDA.commemoration.second_name	
ltx/gr_gr_cog/me.m04.d13:meDA.commemoration.second_title	
ltx/gr_gr_cog/me.m04.d13:meDA.date	Τῌ ΙΓʹ ΑΠΡΙΛΙΟΥ
ltx/gr_gr_cog/me.m04.d13:meDA.fordate	διὰ τὴν 13ην Ἀπριλίου
ltx/gr_gr_cog/me.m04.d13:meDA.insert1	καὶ τοῦ ἐν Ἁγίοις Πατρὸς ἡμῶν Μαρτίνου, Πάπα Ῥώμη,
ltx/gr_gr_cog/me.m04.d13:meDA.insert2	οὗ καὶ τὴν μνήμην ἐπιτελοῦμεν·
ltx/gr_gr_cog/me.m04.d13:meDA.note	
ltx/gr_gr_cog/me.m04.d13:meDA.pdfcoverdate	τῆς 13ης Ἀπριλίου,
ltx/gr_gr_cog/me.m04.d13:meDA.pdfheaderdate	τῆς 13ης Ἀπριλίου
ltx/gr_gr_cog/me.m04.d13:meHO.commemorations	
ltx/gr_gr_cog/me.m04.d13:meHO.note1	
ltx/gr_gr_cog/me.m04.d13:meHO.note2	
ltx/gr_gr_cog/me.m04.d13:meHO.number	
ltx/gr_gr_cog/me.m04.d13:meHO.rank	
ltx/gr_gr_cog/me.m04.d13:meLE.commemoration1	Μνήμη τοῦ ἐν Ἁγίοις Πατρὸς ἡμῶν Μαρτίνου, Πάπα Ῥώμης.
ltx/gr_gr_cog/me.m04.d13:meLE.commemoration2	
ltx/gr_gr_cog/me.m04.d13:meLI.Kontakion1.incipit	@ltx/gr_gr_cog/me.m04.d13:meMA.Kontakion1ger.incipit
ltx/gr_gr_cog/me.m04.d13:meLI.Kontakion1.melody	@ltx/gr_gr_cog/me.m04.d13:meMA.Kontakion1ger.melody
ltx/gr_gr_cog/me.m04.d13:meLI.Kontakion1.mode	@ltx/gr_gr_cog/me.m04.d13:meMA.Kontakion1ger.mode
ltx/gr_gr_cog/me.m04.d13:meLI.Kontakion1.text	@ltx/gr_gr_cog/me.m04.d13:meMA.Kontakion1ger.text
ltx/gr_gr_cog/me.m04.d13:meLI.MM.CommunionHymn.text	@ltx/gr_gr_cog/properties:media.key
ltx/gr_gr_cog/me.m04.d13:meLI.Megalynarion.text	
ltx/gr_gr_cog/me.m04.d13:meMA.C1.acrostic.notice1	οὗ ἡ Ἀκροστιχίς·
ltx/gr_gr_cog/me.m04.d13:meMA.C1.acrostic.text	Πόνους ἐπαινεῖν Μαρτίνου [κ]λέος μέγα. Ἰωσήφ.
ltx/gr_gr_cog/me.m04.d13:meMA.C1.acrostic.title	Κανὼν τοῦ Ἁγίου,
ltx/gr_gr_cog/me.m04.d13:meMA.C1.title	@ltx/gr_gr_cog/titles:ti.CanonSaintM
ltx/gr_gr_cog/me.m04.d13:meMA.C1.verse	@ltx/gr_gr_cog/prayers:pr.verse_SaintM.text
ltx/gr_gr_cog/me.m04.d13:meMA.Kontakion1ger.incipit	Ὡς Ἱεράρχης τῶν ἀῤῥήτων καὶ…
ltx/gr_gr_cog/me.m04.d13:meMA.Kontakion1ger.melody	@ltx/gr_gr_cog/he.a.m8:heAU.TiYpermacho.name
ltx/gr_gr_cog/me.m04.d13:meMA.Kontakion1ger.mode	@ltx/gr_gr_cog/miscellanea:misc.Mode8
ltx/gr_gr_cog/me.m04.d13:meMA.Kontakion1ger.poet	@ltx/gr_gr_cog/poets:po.Gerasimou
ltx/gr_gr_cog/me.m04.d13:meMA.Kontakion1ger.text	Ὡς Ἱεράρχης τῶν ἀῤῥήτων καὶ διδάσκαλος, Θεολογίας ἀληθοῦς ἐκφάντωρ πέφηνας, καὶ ἀνέβλυσας Μαρτῖνε δογμάτων ρεῖθρα· Τὸν Χριστὸν γὰρ ἐν δυσί τελείαις φύσεσι, καὶ θελήσεσι πανσόφως ἐδογμάτισας, τοῖς βοῶσί σοι, χαίροις Πάτερ πανόλβιε.
ltx/gr_gr_cog/me.m04.d13:meMA.Ode1C11.greekmelody	@ltx/gr_gr_cog/he.h.m8:heHE.IKekommeni.greekname
ltx/gr_gr_cog/me.m04.d13:meMA.Ode1C11.incipit	Πόνους μυρίους, Μαρτῖνε ὑπέμεινας, ὑπὲρ…
ltx/gr_gr_cog/me.m04.d13:meMA.Ode1C11.melody	@ltx/gr_gr_cog/he.h.m8:heHE.IKekommeni.name
ltx/gr_gr_cog/me.m04.d13:meMA.Ode1C11.mode	@ltx/gr_gr_cog/miscellanea:misc.Mode8
ltx/gr_gr_cog/me.m04.d13:meMA.Ode1C11.ode	@ltx/gr_gr_cog/miscellanea:misc.Ode1
ltx/gr_gr_cog/me.m04.d13:meMA.Ode1C11.text	Πόνους μυρίους, Μαρτῖνε ὑπέμεινας, ὑπὲρ Χριστοῦ τοῦ Θεοῦ, καὶ νῦν ἐξεδήμησας, πρὸς ἄπονον ζωήν, καλῶς ἀγωνισάμενος· διό μου τῆς ψυχῆς τὰς χαλεπάς, ὀδύνας ἐπικούφισον, ὅπως ἀνυμνήσω σε, εὐχαῖς σου φωτιζόμενος.
ltx/gr_gr_cog/me.m04.d13:meMA.Ode1C12.incipit	Οὐσίας δύο, καὶ δύο θελήματα…
ltx/gr_gr_cog/me.m04.d13:meMA.Ode1C12.melody	@ltx/gr_gr_cog/he.h.m8:heHE.IKekommeni.name
ltx/gr_gr_cog/me.m04.d13:meMA.Ode1C12.mode	@ltx/gr_gr_cog/miscellanea:misc.Mode8
ltx/gr_gr_cog/me.m04.d13:meMA.Ode1C12.ode	@ltx/gr_gr_cog/miscellanea:misc.Ode1
ltx/gr_gr_cog/me.m04.d13:meMA.Ode1C12.text	Οὐσίας δύο, καὶ δύο θελήματα, καὶ ἐνεργείας διπλᾶς, φέροντα Μακάριε, τὸν ἕνα τῆς σεπτῆς, Τριάδος ἐδογμάτισας, Χριστὸν τὸν ὑπερούσιον Θεόν, καί τους μὴ οὕτω σέβοντας, πάντας ἀπεκήρυξας, Μαρτῖνε ἱερώτατε.
ltx/gr_gr_cog/me.m04.d13:meMA.Ode1C13.incipit	Νενοσηκότας, ἀλόγως τοὺς ἄφρονας, καὶ…
ltx/gr_gr_cog/me.m04.d13:meMA.Ode1C13.melody	@ltx/gr_gr_cog/he.h.m8:heHE.IKekommeni.name
ltx/gr_gr_cog/me.m04.d13:meMA.Ode1C13.mode	@ltx/gr_gr_cog/miscellanea:misc.Mode8
ltx/gr_gr_cog/me.m04.d13:meMA.Ode1C13.ode	@ltx/gr_gr_cog/miscellanea:misc.Ode1
ltx/gr_gr_cog/me.m04.d13:meMA.Ode1C13.text	Νενοσηκότας, ἀλόγως τοὺς ἄφρονας, καὶ ἐπὶ μόνου Χριστοῦ, ἓν φρονοῦντας θέλημα, φρονήσει ἀληθεῖ, καὶ πίστει σεμνυνόμενος, διήλεγξας Μαρτῖνε προφανῶς, καὶ χαίρων ἀνεκραύγαζες· τῷ Κυρίῳ ᾄσωμεν· ἐνδόξως γὰρ δεδόξασται.
ltx/gr_gr_cog/me.m04.d13:meMA.Ode1C1H.greekmelody	@ltx/gr_gr_cog/he.h.m8:heHE.IKekommeni.greekname
ltx/gr_gr_cog/me.m04.d13:meMA.Ode1C1H.incipit	@ltx/gr_gr_cog/he.h.m8:heHE.IKekommeni.incipit
ltx/gr_gr_cog/me.m04.d13:meMA.Ode1C1H.melody	@ltx/gr_gr_cog/he.h.m8:heHE.IKekommeni.melody
ltx/gr_gr_cog/me.m04.d13:meMA.Ode1C1H.mode	@ltx/gr_gr_cog/miscellanea:misc.Mode8
ltx/gr_gr_cog/me.m04.d13:meMA.Ode1C1H.ode	@ltx/gr_gr_cog/miscellanea:misc.Ode1
ltx/gr_gr_cog/me.m04.d13:meMA.Ode1C1H.text	@ltx/gr_gr_cog/he.h.m8:heHE.IKekommeni.text
ltx/gr_gr_cog/me.m04.d13:meMA.Ode1C1T.incipit	Ὁ κατὰ φύσιν, τὴν θείαν…
ltx/gr_gr_cog/me.m04.d13:meMA.Ode1C1T.melody	@ltx/gr_gr_cog/he.h.m8:heHE.IKekommeni.name
ltx/gr_gr_cog/me.m04.d13:meMA.Ode1C1T.mode	@ltx/gr_gr_cog/miscellanea:misc.Mode8
ltx/gr_gr_cog/me.m04.d13:meMA.Ode1C1T.ode	@ltx/gr_gr_cog/miscellanea:misc.Ode1
ltx/gr_gr_cog/me.m04.d13:meMA.Ode1C1T.text	Ὁ κατὰ φύσιν, τὴν θείαν ἀόρατος, ὡράθη βρέφος ἐκ σοῦ, ἄνθρωπος γενόμενος, διπλᾶς ὡς ἀληθῶς, θελήσεις ἐνεργείας τε, προφαίνων ὑποστάσει ἐν μιᾷ· ᾧ πρέσβευε Πανάμωμε, πάντας ἡμᾶς σῴζεσθαι τοὺς πόθῳ σε γεραίροντας.
ltx/gr_gr_cog/me.m04.d13:meMA.Ode3C11.greekmelody	@ltx/gr_gr_cog/he.h.m8:heHE.TonFovonSouKyrie.greekname
ltx/gr_gr_cog/me.m04.d13:meMA.Ode3C11.incipit	Ὑπάρχων ἀνάπλεως πανόλβιε, θείου ζήλου…
ltx/gr_gr_cog/me.m04.d13:meMA.Ode3C11.melody	@ltx/gr_gr_cog/he.h.m8:heHE.TonFovonSouKyrie.name
ltx/gr_gr_cog/me.m04.d13:meMA.Ode3C11.mode	@ltx/gr_gr_cog/miscellanea:misc.Mode8
ltx/gr_gr_cog/me.m04.d13:meMA.Ode3C11.ode	@ltx/gr_gr_cog/miscellanea:misc.Ode3
ltx/gr_gr_cog/me.m04.d13:meMA.Ode3C11.text	Ὑπάρχων ἀνάπλεως πανόλβιε, θείου ζήλου συνήθροισας, ἱερὰν Μαρτῖνε σύνοδον, καὶ τὸ τῆς Ἐκκλησίας ἐκύρωσας δόγμα.
ltx/gr_gr_cog/me.m04.d13:meMA.Ode3C12.incipit	Συνόδου ἐν μέσῳ ἀπεκήρυξας, Πύῤῥον…
ltx/gr_gr_cog/me.m04.d13:meMA.Ode3C12.melody	@ltx/gr_gr_cog/he.h.m8:heHE.TonFovonSouKyrie.name
ltx/gr_gr_cog/me.m04.d13:meMA.Ode3C12.mode	@ltx/gr_gr_cog/miscellanea:misc.Mode8
ltx/gr_gr_cog/me.m04.d13:meMA.Ode3C12.ode	@ltx/gr_gr_cog/miscellanea:misc.Ode3
ltx/gr_gr_cog/me.m04.d13:meMA.Ode3C12.text	Συνόδου ἐν μέσῳ ἀπεκήρυξας, Πύῤῥον, Σέργιον, Ὅσιε, τὸν Θεόδωρον καὶ Κῦρόν τε, καὶ τοὺς σὺν ἐκείνοις ὁμοίως ληρωδοῦντας.
ltx/gr_gr_cog/me.m04.d13:meMA.Ode3C13.incipit	Ἐκ Ῥώμης βιαίως ἐλαυνόμενος, περιήρχου…
ltx/gr_gr_cog/me.m04.d13:meMA.Ode3C13.melody	@ltx/gr_gr_cog/he.h.m8:heHE.TonFovonSouKyrie.name
ltx/gr_gr_cog/me.m04.d13:meMA.Ode3C13.mode	@ltx/gr_gr_cog/miscellanea:misc.Mode8
ltx/gr_gr_cog/me.m04.d13:meMA.Ode3C13.ode	@ltx/gr_gr_cog/miscellanea:misc.Ode3
ltx/gr_gr_cog/me.m04.d13:meMA.Ode3C13.text	Ἐκ Ῥώμης βιαίως ἐλαυνόμενος, περιήρχου ὡς ἥλιος, τὰς ἀκτῖνας πέμπων Ὅσιε, τὰς τῆς ὀρθοδοξίας, καὶ φωτίζων πάντας.
ltx/gr_gr_cog/me.m04.d13:meMA.Ode3C1H.greekmelody	@ltx/gr_gr_cog/he.h.m8:heHE.TonFovonSouKyrie.greekname
ltx/gr_gr_cog/me.m04.d13:meMA.Ode3C1H.incipit	@ltx/gr_gr_cog/he.h.m8:heHE.TonFovonSouKyrie.incipit
ltx/gr_gr_cog/me.m04.d13:meMA.Ode3C1H.melody	@ltx/gr_gr_cog/he.h.m8:heHE.TonFovonSouKyrie.melody
ltx/gr_gr_cog/me.m04.d13:meMA.Ode3C1H.mode	@ltx/gr_gr_cog/miscellanea:misc.Mode8
ltx/gr_gr_cog/me.m04.d13:meMA.Ode3C1H.ode	@ltx/gr_gr_cog/miscellanea:misc.Ode3
ltx/gr_gr_cog/me.m04.d13:meMA.Ode3C1H.text	@ltx/gr_gr_cog/he.h.m8:heHE.TonFovonSouKyrie.text
ltx/gr_gr_cog/me.m04.d13:meMA.Ode3C1T.incipit	Πατρὸς τὸν ὁμότιμον καὶ σύνθρονον…
ltx/gr_gr_cog/me.m04.d13:meMA.Ode3C1T.melody	@ltx/gr_gr_cog/he.h.m8:heHE.TonFovonSouKyrie.name
ltx/gr_gr_cog/me.m04.d13:meMA.Ode3C1T.mode	@ltx/gr_gr_cog/miscellanea:misc.Mode8
ltx/gr_gr_cog/me.m04.d13:meMA.Ode3C1T.ode	@ltx/gr_gr_cog/miscellanea:misc.Ode3
ltx/gr_gr_cog/me.m04.d13:meMA.Ode3C1T.text	Πατρὸς τὸν ὁμότιμον καὶ σύνθρονον, ὑπὲρ λόγον ἐγέννησας, ἐνεργείας δύο φέροντα, καὶ δύο τὰς θελήσεις, Παναγία Κόρη.
ltx/gr_gr_cog/me.m04.d13:meMA.Ode3Kathisma1.greekmelody	@ltx/gr_gr_cog/he.a.m8:heAU.TinSofianKaiLogon.greekname
ltx/gr_gr_cog/me.m04.d13:meMA.Ode3Kathisma1.incipit	Τῷ Θεῷ ἀπὸ βρέφους ἀνατεθείς…
ltx/gr_gr_cog/me.m04.d13:meMA.Ode3Kathisma1.melody	@ltx/gr_gr_cog/he.a.m8:heAU.TinSofianKaiLogon.name
ltx/gr_gr_cog/me.m04.d13:meMA.Ode3Kathisma1.mode	@ltx/gr_gr_cog/miscellanea:misc.Mode8
ltx/gr_gr_cog/me.m04.d13:meMA.Ode3Kathisma1.text	Τῷ Θεῷ ἀπὸ βρέφους ἀνατεθείς, ἀρεταῖς αὐξηθείς τε πνευματικῶς, ἠξίωσαι διάδοχος, Ἀποστόλων γενήσεσθαι, ὀρθοδοξίᾳ ποιμάνας, Κυρίου τὸ ποίμνιον, αἱρετικῶν δὲ φάλαγγας ἐλαύνων πανεύφημε· ὅθεν ἐπὶ τέλει, Μαρτυρίου τῷ στέφει, ἐστέφθης ἀοίδιμε, ἀθλητὴς ὡς ἀήττητος, ὦ Μαρτῖνε θεόπνευστε· Πρέσβευε Χριστῷ τῷ Θεῷ, τῶν πταισμάτων ἄφεσιν δωρήσασθαι, τοῖς ἑορτάζουσι πόθῳ, τὴν ἁγίαν μνήμην σου.
ltx/gr_gr_cog/me.m04.d13:meMA.Ode3KathismaSt.incipit	Τὸν ἀμνὸν καὶ ποιμένα καὶ…
ltx/gr_gr_cog/me.m04.d13:meMA.Ode3KathismaSt.melody	@ltx/gr_gr_cog/he.a.m8:heAU.TinSofianKaiLogon.name
ltx/gr_gr_cog/me.m04.d13:meMA.Ode3KathismaSt.mode	@ltx/gr_gr_cog/miscellanea:misc.Mode8
ltx/gr_gr_cog/me.m04.d13:meMA.Ode3KathismaSt.text	Τὸν ἀμνὸν καὶ ποιμένα καὶ λυτρωτήν, ἡ ἀμνὰς θεωροῦσα ἐπὶ Σταυροῦ, ἀδίκως ὑψούμενον, θρηνῳδοῦσα ἐκραύγαζεν· Οἴμοι φίλτατον τέκνον! Υἱέ μου γλυκύτατε, πῶς ὑποίσω Λόγε, φρικτὸν βλέπειν θέαμα; κόπτομαι τὰ σπλάγχνα, τὴν καρδίαν τιτρώσκομαι, καὶ οὐ δύναμαι φέρειν, σφαγήν σου τὴν ἄδικον. Ἀλλʼ ὁ φύσει μακρόθυμος, σπεῦσον ἐξανάστηθι ταχύ, καὶ τὴν σὴν ἐκπλήρωσον ὑπόσχεσιν, ὅπως δοξάσῃς Υἱέ μου, κἀμὲ τὴν τεκοῦσάν σε.
ltx/gr_gr_cog/me.m04.d13:meMA.Ode3KathismaT.incipit	Λογισμοῖς ὀλισθαίνων τοῖς πονηροῖς, εἰς…
ltx/gr_gr_cog/me.m04.d13:meMA.Ode3KathismaT.melody	@ltx/gr_gr_cog/he.a.m8:heAU.TinSofianKaiLogon.name
ltx/gr_gr_cog/me.m04.d13:meMA.Ode3KathismaT.mode	@ltx/gr_gr_cog/miscellanea:misc.Mode8
ltx/gr_gr_cog/me.m04.d13:meMA.Ode3KathismaT.text	Λογισμοῖς ὀλισθαίνων τοῖς πονηροῖς, εἰς βυθὸν κατηνέχθην ἁμαρτιῶν· καὶ στένων κραυγάζω σοι, ἐκ καρδίας Πανάχραντε. Ἐν ἐμοὶ θαυμάστωσον, τὸ πλούσιον ἔλεος, καὶ τῆς σῆς εὐσπλαγχνίας, τὸ ἄπειρον πέλαγος, καὶ τῶν οἰκτιρμῶν σου, τὸν ἀμέτρητον πλοῦτον· καὶ δός μοι μετάνοιαν, καὶ πταισμάτων συγχώρησιν, ἵνα πόθῳ κραυγάζω σοι· Πρέσβευε τῷ σῷ Υἱῷ καὶ Θεῷ, τῶν πταισμάτων ἄφεσιν δοθῆναί μοι· σὲ γὰρ ἔχω ἐλπίδα, ὁ δοῦλός σου, Ἄχραντε.
ltx/gr_gr_cog/me.m04.d13:meMA.Ode4C11.greekmelody	@ltx/gr_gr_cog/he.h.m8:heHE.EpevisEfIppous.greekname
ltx/gr_gr_cog/me.m04.d13:meMA.Ode4C11.incipit	Ἀδίκως τοῦ θρόνου, σοφὲ τοῦ…
ltx/gr_gr_cog/me.m04.d13:meMA.Ode4C11.melody	@ltx/gr_gr_cog/he.h.m8:heHE.EpevisEfIppous.name
ltx/gr_gr_cog/me.m04.d13:meMA.Ode4C11.mode	@ltx/gr_gr_cog/miscellanea:misc.Mode8
ltx/gr_gr_cog/me.m04.d13:meMA.Ode4C11.ode	@ltx/gr_gr_cog/miscellanea:misc.Ode4
ltx/gr_gr_cog/me.m04.d13:meMA.Ode4C11.text	Ἀδίκως τοῦ θρόνου, σοφὲ τοῦ σοῦ ἐλαυνόμενος, ὑπ ἀνθρώπων ἀδίκων ὁ δίκαιος, κακωθῆναι προῄρησο, ὅπως τὸ δίκαιον δόγμα τῆς, Ἐκκλησίας, Πάτερ διασώσῃς ἀλώβητον.
ltx/gr_gr_cog/me.m04.d13:meMA.Ode4C12.incipit	Ἱστάμενος μέσον, παρανομούντων ὁ ἔννομος…
ltx/gr_gr_cog/me.m04.d13:meMA.Ode4C12.melody	@ltx/gr_gr_cog/he.h.m8:heHE.EpevisEfIppous.name
ltx/gr_gr_cog/me.m04.d13:meMA.Ode4C12.mode	@ltx/gr_gr_cog/miscellanea:misc.Mode8
ltx/gr_gr_cog/me.m04.d13:meMA.Ode4C12.ode	@ltx/gr_gr_cog/miscellanea:misc.Ode4
ltx/gr_gr_cog/me.m04.d13:meMA.Ode4C12.text	Ἱστάμενος μέσον, παρανομούντων ὁ ἔννομος, ἀθλητὴς Ἱεράρχα θεόληπτε, καὶ ὑπ αὐτῶν θλιβόμενος καὶ ἐμπαιζόμενος, καὶ συρόμενος μάτην, ἔμεινας τὸν νοῦν ἀπαράτρεπτος.
ltx/gr_gr_cog/me.m04.d13:meMA.Ode4C13.incipit	Νηπίων ἡγήσω, Πάτερ Μαρτῖνε τοξεύματα…
ltx/gr_gr_cog/me.m04.d13:meMA.Ode4C13.melody	@ltx/gr_gr_cog/he.h.m8:heHE.EpevisEfIppous.name
ltx/gr_gr_cog/me.m04.d13:meMA.Ode4C13.mode	@ltx/gr_gr_cog/miscellanea:misc.Mode8
ltx/gr_gr_cog/me.m04.d13:meMA.Ode4C13.ode	@ltx/gr_gr_cog/miscellanea:misc.Ode4
ltx/gr_gr_cog/me.m04.d13:meMA.Ode4C13.text	Νηπίων ἡγήσω, Πάτερ Μαρτῖνε τοξεύματα, παροινίας τῶν μάτην θλιβόντων σε, καὶ καρτερῶς ἐνήθλησας, περιδονούμενος, καὶ δεσμούμενος μάκαρ, καὶ ταῖς φυλακαῖς συγκλειόμενος.
ltx/gr_gr_cog/me.m04.d13:meMA.Ode4C1H.greekmelody	@ltx/gr_gr_cog/he.h.m8:heHE.EpevisEfIppous.greekname
ltx/gr_gr_cog/me.m04.d13:meMA.Ode4C1H.incipit	@ltx/gr_gr_cog/he.h.m8:heHE.EpevisEfIppous.incipit
ltx/gr_gr_cog/me.m04.d13:meMA.Ode4C1H.melody	@ltx/gr_gr_cog/he.h.m8:heHE.EpevisEfIppous.melody
ltx/gr_gr_cog/me.m04.d13:meMA.Ode4C1H.mode	@ltx/gr_gr_cog/miscellanea:misc.Mode8
ltx/gr_gr_cog/me.m04.d13:meMA.Ode4C1H.ode	@ltx/gr_gr_cog/miscellanea:misc.Ode4
ltx/gr_gr_cog/me.m04.d13:meMA.Ode4C1H.text	@ltx/gr_gr_cog/he.h.m8:heHE.EpevisEfIppous.text
ltx/gr_gr_cog/me.m04.d13:meMA.Ode4C1T.incipit	Ἐν δύο οὐσίαις, θεανδρικῶς γνωριζόμενον…
ltx/gr_gr_cog/me.m04.d13:meMA.Ode4C1T.melody	@ltx/gr_gr_cog/he.h.m8:heHE.EpevisEfIppous.name
ltx/gr_gr_cog/me.m04.d13:meMA.Ode4C1T.mode	@ltx/gr_gr_cog/miscellanea:misc.Mode8
ltx/gr_gr_cog/me.m04.d13:meMA.Ode4C1T.ode	@ltx/gr_gr_cog/miscellanea:misc.Ode4
ltx/gr_gr_cog/me.m04.d13:meMA.Ode4C1T.text	Ἐν δύο οὐσίαις, θεανδρικῶς γνωριζόμενον, τῆς Τριάδος τὸν ἕνα ἐκύησας, Θεὸν ὁμοῦ καὶ ἄνθρωπον, θελήσεις φέροντα, καταλλήλως ταῖς τούτου, φύσεσι Παρθένε πανάμωμε.
ltx/gr_gr_cog/me.m04.d13:meMA.Ode5C11.greekmelody	@ltx/gr_gr_cog/he.h.m8:heHE.TonEkNyktosAgnosias.greekname
ltx/gr_gr_cog/me.m04.d13:meMA.Ode5C11.incipit	Ἱερωτάτῳ σου λόγῳ, Πάτερ, τὸ…
ltx/gr_gr_cog/me.m04.d13:meMA.Ode5C11.melody	@ltx/gr_gr_cog/he.h.m8:heHE.TonEkNyktosAgnosias.name
ltx/gr_gr_cog/me.m04.d13:meMA.Ode5C11.mode	@ltx/gr_gr_cog/miscellanea:misc.Mode8
ltx/gr_gr_cog/me.m04.d13:meMA.Ode5C11.ode	@ltx/gr_gr_cog/miscellanea:misc.Ode5
ltx/gr_gr_cog/me.m04.d13:meMA.Ode5C11.text	Ἱερωτάτῳ σου λόγῳ, Πάτερ, τὸ πανίερον σαφῶς δόγμα ἐκράτυνας, καὶ τὸ στῖφος τῶν αἱρέσεων ἔτρεψας, ὑπομένων ἐξορίας, καὶ φυλακὰς καὶ θλίψεις ἔνδοξε.
ltx/gr_gr_cog/me.m04.d13:meMA.Ode5C12.incipit	Νυσταγμὸν τοῖς σοῖς βλεφάροις, Ὅσιε…
ltx/gr_gr_cog/me.m04.d13:meMA.Ode5C12.melody	@ltx/gr_gr_cog/he.h.m8:heHE.TonEkNyktosAgnosias.name
ltx/gr_gr_cog/me.m04.d13:meMA.Ode5C12.mode	@ltx/gr_gr_cog/miscellanea:misc.Mode8
ltx/gr_gr_cog/me.m04.d13:meMA.Ode5C12.ode	@ltx/gr_gr_cog/miscellanea:misc.Ode5
ltx/gr_gr_cog/me.m04.d13:meMA.Ode5C12.text	Νυσταγμὸν τοῖς σοῖς βλεφάροις, Ὅσιε οὐκ ἔδωκας, ἕως σκήνωμα γέγονας τοῦ Θεοῦ, καὶ πᾶσαν ἀνεμόχλευσας, τῆς αἱρέσεως τὴν πλάνην, μαρτυρικῶς ἀγωνισάμενος.
ltx/gr_gr_cog/me.m04.d13:meMA.Ode5C13.incipit	Μανιωδῶς σε ὡς θῆρες, ἔσυραν…
ltx/gr_gr_cog/me.m04.d13:meMA.Ode5C13.melody	@ltx/gr_gr_cog/he.h.m8:heHE.TonEkNyktosAgnosias.name
ltx/gr_gr_cog/me.m04.d13:meMA.Ode5C13.mode	@ltx/gr_gr_cog/miscellanea:misc.Mode8
ltx/gr_gr_cog/me.m04.d13:meMA.Ode5C13.ode	@ltx/gr_gr_cog/miscellanea:misc.Ode5
ltx/gr_gr_cog/me.m04.d13:meMA.Ode5C13.text	Μανιωδῶς σε ὡς θῆρες, ἔσυραν ἁλύσεσι Σοφέ, ἐχθροὶ δεσμήσαντες, ἐν τῷ μέσῳ παικτικῶς τῆς πόλεως, λοιδοροῦντες βλασφημοῦντες, καὶ ἀναιδῶς σοι ἐπεμβαίνοντες.
ltx/gr_gr_cog/me.m04.d13:meMA.Ode5C1H.greekmelody	@ltx/gr_gr_cog/he.h.m8:heHE.TonEkNyktosAgnosias.greekname
ltx/gr_gr_cog/me.m04.d13:meMA.Ode5C1H.incipit	@ltx/gr_gr_cog/he.h.m8:heHE.TonEkNyktosAgnosias.incipit
ltx/gr_gr_cog/me.m04.d13:meMA.Ode5C1H.melody	@ltx/gr_gr_cog/he.h.m8:heHE.TonEkNyktosAgnosias.melody
ltx/gr_gr_cog/me.m04.d13:meMA.Ode5C1H.mode	@ltx/gr_gr_cog/miscellanea:misc.Mode8
ltx/gr_gr_cog/me.m04.d13:meMA.Ode5C1H.ode	@ltx/gr_gr_cog/miscellanea:misc.Ode5
ltx/gr_gr_cog/me.m04.d13:meMA.Ode5C1H.text	@ltx/gr_gr_cog/he.h.m8:heHE.TonEkNyktosAgnosias.text
ltx/gr_gr_cog/me.m04.d13:meMA.Ode5C1T.incipit	Ἀπειρογάμως Παρθένε, ἡ τὸν ἀπερίγραπτον…
ltx/gr_gr_cog/me.m04.d13:meMA.Ode5C1T.melody	@ltx/gr_gr_cog/he.h.m8:heHE.TonEkNyktosAgnosias.name
ltx/gr_gr_cog/me.m04.d13:meMA.Ode5C1T.mode	@ltx/gr_gr_cog/miscellanea:misc.Mode8
ltx/gr_gr_cog/me.m04.d13:meMA.Ode5C1T.ode	@ltx/gr_gr_cog/miscellanea:misc.Ode5
ltx/gr_gr_cog/me.m04.d13:meMA.Ode5C1T.text	Ἀπειρογάμως Παρθένε, ἡ τὸν ἀπερίγραπτον Θεὸν σαρκὶ κυήσασα, τῆς σαρκός μου τὰ πάθη θανάτωσον, ζώωσον δὲ τὴν ψυχήν μου, νενεκρωμένην πλημμελήμασιν.
ltx/gr_gr_cog/me.m04.d13:meMA.Ode6C11.greekmelody	@ltx/gr_gr_cog/he.h.m8:heHE.AvyssosAmartion.greekname
ltx/gr_gr_cog/me.m04.d13:meMA.Ode6C11.incipit	Ῥήγνυται ὁ πονηρός, θεοφόρε πρὸ…
ltx/gr_gr_cog/me.m04.d13:meMA.Ode6C11.melody	@ltx/gr_gr_cog/he.h.m8:heHE.AvyssosAmartion.name
ltx/gr_gr_cog/me.m04.d13:meMA.Ode6C11.mode	@ltx/gr_gr_cog/miscellanea:misc.Mode8
ltx/gr_gr_cog/me.m04.d13:meMA.Ode6C11.ode	@ltx/gr_gr_cog/miscellanea:misc.Ode6
ltx/gr_gr_cog/me.m04.d13:meMA.Ode6C11.text	Ῥήγνυται ὁ πονηρός, θεοφόρε πρὸ ποδῶν ἱερῶν σου, καὶ πονηρῶν ἀνθρώπων, τὰ ἀπύλωτα στόματα, ἀποφράττονται τῷ σῷ, λόγῳ καὶ δείκνυται διαλάμπον, δόγμα τὸ θεῖον ὑπὲρ ἥλιον.
ltx/gr_gr_cog/me.m04.d13:meMA.Ode6C12.incipit	Τείνουσί σε ἀφειδῶς, καὶ σχοινίοις…
ltx/gr_gr_cog/me.m04.d13:meMA.Ode6C12.melody	@ltx/gr_gr_cog/he.h.m8:heHE.AvyssosAmartion.name
ltx/gr_gr_cog/me.m04.d13:meMA.Ode6C12.mode	@ltx/gr_gr_cog/miscellanea:misc.Mode8
ltx/gr_gr_cog/me.m04.d13:meMA.Ode6C12.ode	@ltx/gr_gr_cog/miscellanea:misc.Ode6
ltx/gr_gr_cog/me.m04.d13:meMA.Ode6C12.text	Τείνουσί σε ἀφειδῶς, καὶ σχοινίοις συνδεσμοῦσιν οἱ πλάνοι, πλάνην δεσμοῦντα πᾶσαν, καὶ αἱρέσεων σύνδεσμον, διαῤῥήσσοντα δεσμοῖς, θείων δογμάτων σου, Ἱεράρχα, Πάτερ Μαρτῖνε ἱερώτατε.
ltx/gr_gr_cog/me.m04.d13:meMA.Ode6C13.incipit	Ἵστασο δικαστικῶν, πρὸ βημάτων κατακρίνων…
ltx/gr_gr_cog/me.m04.d13:meMA.Ode6C13.melody	@ltx/gr_gr_cog/he.h.m8:heHE.AvyssosAmartion.name
ltx/gr_gr_cog/me.m04.d13:meMA.Ode6C13.mode	@ltx/gr_gr_cog/miscellanea:misc.Mode8
ltx/gr_gr_cog/me.m04.d13:meMA.Ode6C13.ode	@ltx/gr_gr_cog/miscellanea:misc.Ode6
ltx/gr_gr_cog/me.m04.d13:meMA.Ode6C13.text	Ἵστασο δικαστικῶν, πρὸ βημάτων κατακρίνων τὴν πλάνην, τῶν κηρυττόντων μίαν τοῦ Χριστοῦ Πάτερ θέλησιν, καὶ Μαρτύρων προφανῶς, καλλωπιζόμενος τῷ στεφάνῳ, τούτων τῆς δόξης κατηξίωσαι.
ltx/gr_gr_cog/me.m04.d13:meMA.Ode6C1H.greekmelody	@ltx/gr_gr_cog/he.h.m8:heHE.AvyssosAmartion.greekname
ltx/gr_gr_cog/me.m04.d13:meMA.Ode6C1H.incipit	@ltx/gr_gr_cog/he.h.m8:heHE.AvyssosAmartion.incipit
ltx/gr_gr_cog/me.m04.d13:meMA.Ode6C1H.melody	@ltx/gr_gr_cog/he.h.m8:heHE.AvyssosAmartion.melody
ltx/gr_gr_cog/me.m04.d13:meMA.Ode6C1H.mode	@ltx/gr_gr_cog/miscellanea:misc.Mode8
ltx/gr_gr_cog/me.m04.d13:meMA.Ode6C1H.ode	@ltx/gr_gr_cog/miscellanea:misc.Ode6
ltx/gr_gr_cog/me.m04.d13:meMA.Ode6C1H.text	@ltx/gr_gr_cog/he.h.m8:heHE.AvyssosAmartion.text
ltx/gr_gr_cog/me.m04.d13:meMA.Ode6C1T.incipit	Νόμοι φύσεως ἐν σοί, καταλύονται…
ltx/gr_gr_cog/me.m04.d13:meMA.Ode6C1T.melody	@ltx/gr_gr_cog/he.h.m8:heHE.AvyssosAmartion.name
ltx/gr_gr_cog/me.m04.d13:meMA.Ode6C1T.mode	@ltx/gr_gr_cog/miscellanea:misc.Mode8
ltx/gr_gr_cog/me.m04.d13:meMA.Ode6C1T.ode	@ltx/gr_gr_cog/miscellanea:misc.Ode6
ltx/gr_gr_cog/me.m04.d13:meMA.Ode6C1T.text	Νόμοι φύσεως ἐν σοί, καταλύονται· ἀῤῥήτως γὰρ τίκτεις, τὸν πλαστουργὸν τῶν ὅλων, Θεοτόκε πανύμνητε, ὡς Θεόν τε καὶ βροτόν, δύο θελήσεις δὲ κεκτημένον, καὶ ἐνεργείας Μητροπάρθενε.
ltx/gr_gr_cog/me.m04.d13:meMA.Ode7C11.greekmelody	@ltx/gr_gr_cog/he.h.m8:heHE.OiEkTisIoudaias.greekname
ltx/gr_gr_cog/me.m04.d13:meMA.Ode7C11.incipit	Οἱ διπλῆς ἐνεργείας, καὶ θελήσεως…
ltx/gr_gr_cog/me.m04.d13:meMA.Ode7C11.melody	@ltx/gr_gr_cog/he.h.m8:heHE.OiEkTisIoudaias.name
ltx/gr_gr_cog/me.m04.d13:meMA.Ode7C11.mode	@ltx/gr_gr_cog/miscellanea:misc.Mode8
ltx/gr_gr_cog/me.m04.d13:meMA.Ode7C11.ode	@ltx/gr_gr_cog/miscellanea:misc.Ode7
ltx/gr_gr_cog/me.m04.d13:meMA.Ode7C11.text	Οἱ διπλῆς ἐνεργείας, καὶ θελήσεως Πάτερ Χριστὸν στερήσαντες, ἐστέρησάν σε θρόνου, ἐκδόντες ἐξορίαις, μακροτάταις κραυγάζοντα· ὁ τῶν Πατέρων ἡμῶν, Θεὸς εὐλογητός εἶ.
ltx/gr_gr_cog/me.m04.d13:meMA.Ode7C12.incipit	Ὑπελθὼν τὰς χρονίους, φυλακάς, οἷα…
ltx/gr_gr_cog/me.m04.d13:meMA.Ode7C12.melody	@ltx/gr_gr_cog/he.h.m8:heHE.OiEkTisIoudaias.name
ltx/gr_gr_cog/me.m04.d13:meMA.Ode7C12.mode	@ltx/gr_gr_cog/miscellanea:misc.Mode8
ltx/gr_gr_cog/me.m04.d13:meMA.Ode7C12.ode	@ltx/gr_gr_cog/miscellanea:misc.Ode7
ltx/gr_gr_cog/me.m04.d13:meMA.Ode7C12.text	Ὑπελθὼν τὰς χρονίους, φυλακάς, οἷα φύλαξ ἀμώμου Πίστεως, αἱρέσεων τὸ σκότος, ἐμείωσας καὶ μέλπειν, τοὺς πιστοὺς κατεφώτισας· ὁ τῶν Πατέρων ἡμῶν, Θεὸς εὐλογητός εἶ.
ltx/gr_gr_cog/me.m04.d13:meMA.Ode7C13.incipit	Λέων Πάτερ καθάπερ, πεποιθὼς πρὸς…
ltx/gr_gr_cog/me.m04.d13:meMA.Ode7C13.melody	@ltx/gr_gr_cog/he.h.m8:heHE.OiEkTisIoudaias.name
ltx/gr_gr_cog/me.m04.d13:meMA.Ode7C13.mode	@ltx/gr_gr_cog/miscellanea:misc.Mode8
ltx/gr_gr_cog/me.m04.d13:meMA.Ode7C13.ode	@ltx/gr_gr_cog/miscellanea:misc.Ode7
ltx/gr_gr_cog/me.m04.d13:meMA.Ode7C13.text	Λέων Πάτερ καθάπερ, πεποιθὼς πρὸς ἀνόμους τομῶς ἐχώρησας, Θεόδωρον καὶ Κῦρον, καὶ Σέργιον καὶ Πύῤῥον, καὶ τοὺς τούτων ὁμόφρονας, τῆς τοῦ Χριστοῦ ἀφιστῶν, ἁγίας Ἐκκλησίας.
ltx/gr_gr_cog/me.m04.d13:meMA.Ode7C1H.greekmelody	@ltx/gr_gr_cog/he.h.m8:heHE.OiEkTisIoudaias.greekname
ltx/gr_gr_cog/me.m04.d13:meMA.Ode7C1H.incipit	@ltx/gr_gr_cog/he.h.m8:heHE.OiEkTisIoudaias.incipit
ltx/gr_gr_cog/me.m04.d13:meMA.Ode7C1H.melody	@ltx/gr_gr_cog/he.h.m8:heHE.OiEkTisIoudaias.melody
ltx/gr_gr_cog/me.m04.d13:meMA.Ode7C1H.mode	@ltx/gr_gr_cog/miscellanea:misc.Mode8
ltx/gr_gr_cog/me.m04.d13:meMA.Ode7C1H.ode	@ltx/gr_gr_cog/miscellanea:misc.Ode7
ltx/gr_gr_cog/me.m04.d13:meMA.Ode7C1H.text	@ltx/gr_gr_cog/he.h.m8:heHE.OiEkTisIoudaias.text
ltx/gr_gr_cog/me.m04.d13:meMA.Ode7C1T.incipit	Ὁ θελήσεσι δύο, καὶ δυσὶν…
ltx/gr_gr_cog/me.m04.d13:meMA.Ode7C1T.melody	@ltx/gr_gr_cog/he.h.m8:heHE.OiEkTisIoudaias.name
ltx/gr_gr_cog/me.m04.d13:meMA.Ode7C1T.mode	@ltx/gr_gr_cog/miscellanea:misc.Mode8
ltx/gr_gr_cog/me.m04.d13:meMA.Ode7C1T.ode	@ltx/gr_gr_cog/miscellanea:misc.Ode7
ltx/gr_gr_cog/me.m04.d13:meMA.Ode7C1T.text	Ὁ θελήσεσι δύο, καὶ δυσὶν ἐνεργείαις ἐκ σοῦ Πανάμωμε, τεχθεὶς ἀνερμηνεύτως, τοὺς οὕτω συμφρονοῦντας, διασῴζει κραυγάζοντας· ὁ τῶν Πατέρων ἡμῶν, Θεὸς εὐλογητός εἶ.
ltx/gr_gr_cog/me.m04.d13:meMA.Ode7C1Tr.incipit	Ἑνιζομένη φύσει, διαιρεῖται προσώποις ἡ…
ltx/gr_gr_cog/me.m04.d13:meMA.Ode7C1Tr.melody	@ltx/gr_gr_cog/he.h.m8:heHE.OiEkTisIoudaias.name
ltx/gr_gr_cog/me.m04.d13:meMA.Ode7C1Tr.mode	@ltx/gr_gr_cog/miscellanea:misc.Mode8
ltx/gr_gr_cog/me.m04.d13:meMA.Ode7C1Tr.ode	@ltx/gr_gr_cog/miscellanea:misc.Ode7
ltx/gr_gr_cog/me.m04.d13:meMA.Ode7C1Tr.text	Ἑνιζομένη φύσει, διαιρεῖται προσώποις ἡ Παναγία Τριάς, Πατὴρ ὁ Παντοκράτωρ, Υἱὸς ὁ συνυπάρχων, καὶ τὸ Πνεῦμα τὸ Ἅγιον· Ὁ τῶν Πατέρων ἡμῶν, Θεὸς Εὐλογητός εἶ.
ltx/gr_gr_cog/me.m04.d13:meMA.Ode8C11.greekmelody	@ltx/gr_gr_cog/he.h.m8:heHE.OiTheorrimonesPaides.greekname
ltx/gr_gr_cog/me.m04.d13:meMA.Ode8C11.incipit	Στενοχωρούμενος Πάτερ ἀσθενείαις, καὶ χαλεπαῖς…
ltx/gr_gr_cog/me.m04.d13:meMA.Ode8C11.melody	@ltx/gr_gr_cog/he.h.m8:heHE.OiTheorrimonesPaides.name
ltx/gr_gr_cog/me.m04.d13:meMA.Ode8C11.mode	@ltx/gr_gr_cog/miscellanea:misc.Mode8
ltx/gr_gr_cog/me.m04.d13:meMA.Ode8C11.ode	@ltx/gr_gr_cog/miscellanea:misc.Ode8
ltx/gr_gr_cog/me.m04.d13:meMA.Ode8C11.text	Στενοχωρούμενος Πάτερ ἀσθενείαις, καὶ χαλεπαῖς ἐξορίαις, καὶ πολυτρόποις κολάσεσι, Μαρτυρίου στεφάνους, ὡς Μάρτυς ἀπείληφας.
ltx/gr_gr_cog/me.m04.d13:meMA.Ode8C12.incipit	Μακαρισμοῦ ἠξιώθης θεολέκτου, δεδιωγμένος Μαρτῖνε…
ltx/gr_gr_cog/me.m04.d13:meMA.Ode8C12.melody	@ltx/gr_gr_cog/he.h.m8:heHE.OiTheorrimonesPaides.name
ltx/gr_gr_cog/me.m04.d13:meMA.Ode8C12.mode	@ltx/gr_gr_cog/miscellanea:misc.Mode8
ltx/gr_gr_cog/me.m04.d13:meMA.Ode8C12.ode	@ltx/gr_gr_cog/miscellanea:misc.Ode8
ltx/gr_gr_cog/me.m04.d13:meMA.Ode8C12.text	Μακαρισμοῦ ἠξιώθης θεολέκτου, δεδιωγμένος Μαρτῖνε, δικαιοσύνης ἐχόμενος, ἐκδιώξας ἐκ μέσου τὴν ἄδικον αἵρεσιν.
ltx/gr_gr_cog/me.m04.d13:meMA.Ode8C13.incipit	Ἐπικοσμήσας τὸν Πέτρου θεῖον θρόνον…
ltx/gr_gr_cog/me.m04.d13:meMA.Ode8C13.melody	@ltx/gr_gr_cog/he.h.m8:heHE.OiTheorrimonesPaides.name
ltx/gr_gr_cog/me.m04.d13:meMA.Ode8C13.mode	@ltx/gr_gr_cog/miscellanea:misc.Mode8
ltx/gr_gr_cog/me.m04.d13:meMA.Ode8C13.ode	@ltx/gr_gr_cog/miscellanea:misc.Ode8
ltx/gr_gr_cog/me.m04.d13:meMA.Ode8C13.text	Ἐπικοσμήσας τὸν Πέτρου θεῖον θρόνον, καὶ τῇ αὐτοῦ θείᾳ πέτρᾳ, τὴν Ἐκκλησίαν ἀσάλευτον, συντηρήσας Μαρτῖνε, σὺν τούτῳ δεδόξασαι.
ltx/gr_gr_cog/me.m04.d13:meMA.Ode8C1H.greekmelody	@ltx/gr_gr_cog/he.h.m8:heHE.OiTheorrimonesPaides.greekname
ltx/gr_gr_cog/me.m04.d13:meMA.Ode8C1H.incipit	@ltx/gr_gr_cog/he.h.m8:heHE.OiTheorrimonesPaides.incipit
ltx/gr_gr_cog/me.m04.d13:meMA.Ode8C1H.melody	@ltx/gr_gr_cog/he.h.m8:heHE.OiTheorrimonesPaides.melody
ltx/gr_gr_cog/me.m04.d13:meMA.Ode8C1H.mode	@ltx/gr_gr_cog/miscellanea:misc.Mode8
ltx/gr_gr_cog/me.m04.d13:meMA.Ode8C1H.ode	@ltx/gr_gr_cog/miscellanea:misc.Ode8
ltx/gr_gr_cog/me.m04.d13:meMA.Ode8C1H.text	@ltx/gr_gr_cog/he.h.m8:heHE.OiTheorrimonesPaides.text
ltx/gr_gr_cog/me.m04.d13:meMA.Ode8C1T.incipit	Ἁγιωτέρα τῶν ἄνω στρατευμάτων, καὶ…
ltx/gr_gr_cog/me.m04.d13:meMA.Ode8C1T.melody	@ltx/gr_gr_cog/he.h.m8:heHE.OiTheorrimonesPaides.name
ltx/gr_gr_cog/me.m04.d13:meMA.Ode8C1T.mode	@ltx/gr_gr_cog/miscellanea:misc.Mode8
ltx/gr_gr_cog/me.m04.d13:meMA.Ode8C1T.ode	@ltx/gr_gr_cog/miscellanea:misc.Ode8
ltx/gr_gr_cog/me.m04.d13:meMA.Ode8C1T.text	Ἁγιωτέρα τῶν ἄνω στρατευμάτων, καὶ Χερουβὶμ ὑπερτέρα, Μῆτερ Θεοῦ χρηματίζουσα, τῶν παθῶν τῆς σαρκός με, ὑπέρτερον ποίησον.
ltx/gr_gr_cog/me.m04.d13:meMA.Ode8C1Tr.incipit	Γλώσσῃ πυρίνῃ τῶν θείων Ἀσωμάτων…
ltx/gr_gr_cog/me.m04.d13:meMA.Ode8C1Tr.melody	@ltx/gr_gr_cog/he.h.m8:heHE.OiTheorrimonesPaides.name
ltx/gr_gr_cog/me.m04.d13:meMA.Ode8C1Tr.mode	@ltx/gr_gr_cog/miscellanea:misc.Mode8
ltx/gr_gr_cog/me.m04.d13:meMA.Ode8C1Tr.ode	@ltx/gr_gr_cog/miscellanea:misc.Ode8
ltx/gr_gr_cog/me.m04.d13:meMA.Ode8C1Tr.text	Γλώσσῃ πυρίνῃ τῶν θείων Ἀσωμάτων, ἀναλαβόντες τὸν ὕμνον Ἅγιος, Ἅγιος, Ἅγιος, τῇ Τριάδι συμφώνως, πιστοὶ ἐκβοήσωμεν.
ltx/gr_gr_cog/me.m04.d13:meMA.Ode9C11.greekmelody	@ltx/gr_gr_cog/he.h.m8:heHE.OrousParilthes.greekname
ltx/gr_gr_cog/me.m04.d13:meMA.Ode9C11.incipit	Ἱερουργὸς ἱερώτατος, ὁμολογητής τε καὶ…
ltx/gr_gr_cog/me.m04.d13:meMA.Ode9C11.melody	@ltx/gr_gr_cog/he.h.m8:heHE.OrousParilthes.name
ltx/gr_gr_cog/me.m04.d13:meMA.Ode9C11.mode	@ltx/gr_gr_cog/miscellanea:misc.Mode8
ltx/gr_gr_cog/me.m04.d13:meMA.Ode9C11.ode	@ltx/gr_gr_cog/miscellanea:misc.Ode9
ltx/gr_gr_cog/me.m04.d13:meMA.Ode9C11.text	Ἱερουργὸς ἱερώτατος, ὁμολογητής τε καὶ μάρτυς γενόμενος, Πατριαρχῶν χορείαις Μαρτῖνε μέγιοτε, ἀξίως συναγάλλῃ· ὅθεν σε πίστει μακαρίζομεν.
ltx/gr_gr_cog/me.m04.d13:meMA.Ode9C12.incipit	Ὡς φωταυγὴς Μάκαρ ἥλιος, ἀνατεταλκὼς…
ltx/gr_gr_cog/me.m04.d13:meMA.Ode9C12.melody	@ltx/gr_gr_cog/he.h.m8:heHE.OrousParilthes.name
ltx/gr_gr_cog/me.m04.d13:meMA.Ode9C12.mode	@ltx/gr_gr_cog/miscellanea:misc.Mode8
ltx/gr_gr_cog/me.m04.d13:meMA.Ode9C12.ode	@ltx/gr_gr_cog/miscellanea:misc.Ode9
ltx/gr_gr_cog/me.m04.d13:meMA.Ode9C12.text	Ὡς φωταυγὴς Μάκαρ ἥλιος, ἀνατεταλκὼς πρὸς ἑῴαν ἐκ δύσεως, ἅπασαν ἀκτῖσι τὴν γῆν ἐφώτισας, καὶ ἤλασας τὸ σκότος, αἱρετιζόντων τὸ βαθύτατον.
ltx/gr_gr_cog/me.m04.d13:meMA.Ode9C13.incipit	Στῶμεν ἐν οἴκῳ Θεοῦ ἡμῶν…
ltx/gr_gr_cog/me.m04.d13:meMA.Ode9C13.melody	@ltx/gr_gr_cog/he.h.m8:heHE.OrousParilthes.name
ltx/gr_gr_cog/me.m04.d13:meMA.Ode9C13.mode	@ltx/gr_gr_cog/miscellanea:misc.Mode8
ltx/gr_gr_cog/me.m04.d13:meMA.Ode9C13.ode	@ltx/gr_gr_cog/miscellanea:misc.Ode9
ltx/gr_gr_cog/me.m04.d13:meMA.Ode9C13.text	Στῶμεν ἐν οἴκῳ Θεοῦ ἡμῶν, ἐπανακηρύττοντες ἄθλους καὶ παλαίσματα, καὶ τὰς ὁμολογίας τοῦ οὐρανόφρονος, Πατρὸς ἡμῶν Μαρτίνου, καὶ τοῦτον πόθῳ μακαρίσωμεν.
ltx/gr_gr_cog/me.m04.d13:meMA.Ode9C14.incipit	Ἤστραψε μάκαρ ἡ μνήμη σου…
ltx/gr_gr_cog/me.m04.d13:meMA.Ode9C14.melody	@ltx/gr_gr_cog/he.h.m8:heHE.OrousParilthes.name
ltx/gr_gr_cog/me.m04.d13:meMA.Ode9C14.mode	@ltx/gr_gr_cog/miscellanea:misc.Mode8
ltx/gr_gr_cog/me.m04.d13:meMA.Ode9C14.ode	@ltx/gr_gr_cog/miscellanea:misc.Ode9
ltx/gr_gr_cog/me.m04.d13:meMA.Ode9C14.text	Ἤστραψε μάκαρ ἡ μνήμη σου, ἡμεροφαὴς ὡς ἀστὴρ ἐν τοῖς πέρασι, καὶ πάντας καταυγάζει τοὺς εὐφημοῦντάς σε, ἐν ὕμνοις ἐπαξίοις, Πάτερ Μαρτῖνε θεοδόξαστε.
ltx/gr_gr_cog/me.m04.d13:meMA.Ode9C1H.greekmelody	@ltx/gr_gr_cog/he.h.m8:heHE.OrousParilthes.greekname
ltx/gr_gr_cog/me.m04.d13:meMA.Ode9C1H.incipit	@ltx/gr_gr_cog/he.h.m8:heHE.OrousParilthes.incipit
ltx/gr_gr_cog/me.m04.d13:meMA.Ode9C1H.melody	@ltx/gr_gr_cog/he.h.m8:heHE.OrousParilthes.melody
ltx/gr_gr_cog/me.m04.d13:meMA.Ode9C1H.mode	@ltx/gr_gr_cog/miscellanea:misc.Mode8
ltx/gr_gr_cog/me.m04.d13:meMA.Ode9C1H.ode	@ltx/gr_gr_cog/miscellanea:misc.Ode9
ltx/gr_gr_cog/me.m04.d13:meMA.Ode9C1H.text	@ltx/gr_gr_cog/he.h.m8:heHE.OrousParilthes.text
ltx/gr_gr_cog/me.m04.d13:meMA.Ode9C1T.incipit	Φωναῖς Πατέρων πειθόμενοι, δύο ἐν…
ltx/gr_gr_cog/me.m04.d13:meMA.Ode9C1T.melody	@ltx/gr_gr_cog/he.h.m8:heHE.OrousParilthes.name
ltx/gr_gr_cog/me.m04.d13:meMA.Ode9C1T.mode	@ltx/gr_gr_cog/miscellanea:misc.Mode8
ltx/gr_gr_cog/me.m04.d13:meMA.Ode9C1T.ode	@ltx/gr_gr_cog/miscellanea:misc.Ode9
ltx/gr_gr_cog/me.m04.d13:meMA.Ode9C1T.text	Φωναῖς Πατέρων πειθόμενοι, δύο ἐν οὐσίαις ἁγνὴ καὶ θελήσεσι, τὸν ἕνα τῆς Τριάδος ἐκ σοῦ τικτόμενον, πιστῶς ὁμολογοῦμεν, καὶ σὲ Παρθένε μεγαλύνομεν.
ltx/gr_gr_cog/me.m04.d13:meVE.Apolytikion1ger.greekmelody	@ltx/gr_gr_cog/he.a.m3:heAU.TheiasPisteos.greekname
ltx/gr_gr_cog/me.m04.d13:meVE.Apolytikion1ger.incipit	Θείοις δόγμασι, τῆς εὐσεβείας, ὑπεστήριξας…
ltx/gr_gr_cog/me.m04.d13:meVE.Apolytikion1ger.melody	@ltx/gr_gr_cog/he.a.m3:heAU.TheiasPisteos.name
ltx/gr_gr_cog/me.m04.d13:meVE.Apolytikion1ger.mode	@ltx/gr_gr_cog/miscellanea:misc.Mode3
ltx/gr_gr_cog/me.m04.d13:meVE.Apolytikion1ger.poet	@ltx/gr_gr_cog/poets:po.Gerasimou
ltx/gr_gr_cog/me.m04.d13:meVE.Apolytikion1ger.text	Θείοις δόγμασι, τῆς εὐσεβείας, ὑπεστήριξας, τὴν Ἐκκλησίαν, ὦ Μαρτῖνε Ἱεράρχα θεόσοφε· τὸν γὰρ Χριστὸν διπλοῦν ὄντα ταῖς φύσεσιν, ὁμολογήσας τὴν πλάνην κατῄσχυνας. Πάτερ Ὅσιε, Χριστὸν τὸν Θεὸν ἱκέτευε, δωρήσασθαι ἡμῖν τὸ μέγα ἔλεος.
ltx/gr_gr_cog/me.m04.d13:meVE.SticStavrotheotokion.greekmelody	@ltx/gr_gr_cog/he.a.m8:heAU.TiYmasKalesomen.greekname
ltx/gr_gr_cog/me.m04.d13:meVE.SticStavrotheotokion.incipit	Τί τὸ φοβερὸν τοῦτο θέαμα…
ltx/gr_gr_cog/me.m04.d13:meVE.SticStavrotheotokion.melody	@ltx/gr_gr_cog/he.a.m8:heAU.TiYmasKalesomen.name
ltx/gr_gr_cog/me.m04.d13:meVE.SticStavrotheotokion.mode	@ltx/gr_gr_cog/miscellanea:misc.Mode8
ltx/gr_gr_cog/me.m04.d13:meVE.SticStavrotheotokion.text	Τί τὸ φοβερὸν τοῦτο θέαμα; ἡ Παρθένος ἀνεβόα, τῷ Κυρίῳ μητρικῶς, αἱ ὠδῖνες ἃς οὐκ ἔγνων, ἐν τῷ τίκτειν σε Υἱέ, δριμεῖαι, καθικνοῦνται τῇ καρδίᾳ μου, οὐ φέρω, τῷ Σταυρῷ σε προσηλούμενον, ὁρᾶν ὦ φῶς τῶν ὀμμάτων μου. Σπεῦσον λοιπὸν ἐξανάστηθι, καὶ δόξασον, τὴν φρικτὴν οἰκονομίαν σου.
ltx/gr_gr_cog/me.m04.d13:meVE.SticTheotokion.greekmelody	@ltx/gr_gr_cog/he.a.m8:heAU.TiYmasKalesomen.greekname
ltx/gr_gr_cog/me.m04.d13:meVE.SticTheotokion.incipit	Τί τῶν σῶν καλῶν θαυμαστότερον…
ltx/gr_gr_cog/me.m04.d13:meVE.SticTheotokion.melody	@ltx/gr_gr_cog/he.a.m8:heAU.TiYmasKalesomen.name
ltx/gr_gr_cog/me.m04.d13:meVE.SticTheotokion.mode	@ltx/gr_gr_cog/miscellanea:misc.Mode8
ltx/gr_gr_cog/me.m04.d13:meVE.SticTheotokion.text	Τί τῶν σῶν καλῶν θαυμαστότερον, θεραπεύεις πάντας Κόρη, καὶ λυτροῦσαι τῶν παθῶν· ἀπελαύνεις πολεμίων, τὰς ἀθέσμους προσβολάς, κινδύνων, ἀπαλλάττεις τοὺς τιμῶντάς σε, καὶ θλίψεις καταπαύεις Θεονύμφευτε. Χαρᾶς Παρθένε τῆς κρείττονος, πρόξενος γίνου τοῖς δούλοις σου, πρεσβεύουσα, τοῦ σωθῆναι τὰς ψυχὰς ἡμῶν.
ltx/gr_gr_cog/me.m04.d13:meVE.Stichera01.greekmelody	@ltx/gr_gr_cog/he.a.m8:heAU.TiYmasKalesomen.greekname
ltx/gr_gr_cog/me.m04.d13:meVE.Stichera01.incipit	Τί σε νῦν Μαρτῖνε προσφθέγξωμαι…
ltx/gr_gr_cog/me.m04.d13:meVE.Stichera01.melody	@ltx/gr_gr_cog/he.a.m8:heAU.TiYmasKalesomen.name
ltx/gr_gr_cog/me.m04.d13:meVE.Stichera01.mode	@ltx/gr_gr_cog/miscellanea:misc.Mode8
ltx/gr_gr_cog/me.m04.d13:meVE.Stichera01.text	Τί σε νῦν Μαρτῖνε προσφθέγξωμαι; Ὀρθοδόξων διδαχῶν, καθηγητὴν πανευκλεῆ, κορυφαῖον ἱερόν, δογμάτων θείων ἀψευδῶς, τοῦ ψεύδους, ἀληθέστατον κατήγορον, τοῦ λόγου, γενναιότατον συνήγορον, ἱερουργὸν ἱερώτατον, θαυματουργὸν τιμιώτατον, ἱκέτευε, τοῦ σωθῆναι τὰς ψυχὰς ἡμῶν.
ltx/gr_gr_cog/me.m04.d13:meVE.Stichera02.incipit	Τί σε νῦν Μαρτῖνε καλέσωμεν…
ltx/gr_gr_cog/me.m04.d13:meVE.Stichera02.melody	@ltx/gr_gr_cog/he.a.m8:heAU.TiYmasKalesomen.name
ltx/gr_gr_cog/me.m04.d13:meVE.Stichera02.mode	@ltx/gr_gr_cog/miscellanea:misc.Mode8
ltx/gr_gr_cog/me.m04.d13:meVE.Stichera02.text	Τί σε νῦν Μαρτῖνε καλέσωμεν, ποταμὸν πνευματικῶν, ναμάτων ἔμπλεων ἀεί, καταρδεύοντα ψυχάς, πρὸς εὐκαρπίαν νοητήν, λυχνίαν, εὐσεβείας φῶς ἐκλάμπουσαν, σταλάζον, ὄρος θείαν ἀγαλλίασιν· θείων λογίων ἐκφάντορα, πάσης αἱρέσεως ἔλεγχον, ἱκέτευε, τοῦ σωθῆναι τὰς ψυχὰς ἡμῶν.
ltx/gr_gr_cog/me.m04.d13:meVE.Stichera03.incipit	Τί σε νῦν Μαρτῖνε προσείπωμεν…
ltx/gr_gr_cog/me.m04.d13:meVE.Stichera03.melody	@ltx/gr_gr_cog/he.a.m8:heAU.TiYmasKalesomen.name
ltx/gr_gr_cog/me.m04.d13:meVE.Stichera03.mode	@ltx/gr_gr_cog/miscellanea:misc.Mode8
ltx/gr_gr_cog/me.m04.d13:meVE.Stichera03.text	Τί σε νῦν Μαρτῖνε προσείπωμεν, τῆς σκηνῆς τῆς ἀληθοῦς, ἱερουργὸν πανευσεβῆ, μεσιτεύοντα Θεῷ, καὶ πλάσματι θεοπρεπῶς, κρατῆρα, πόμα θεῖον ἀναβλύζοντα· φωστῆρα, ζωῆς λόγον ὡς ἐπέχοντα, Δύσεως μὲν ἐξορμώμενον, Ἀνατολῇ δὲ φαινόμενον, ἱκέτευε, τοῦ σωθῆναι τὰς ψυχὰς ἡμῶν.
