ltx/gr_gr_cog/le.ep.mc.d331:lemcLI.Epistle.book_abbr	@ltx/gr_gr_cog/bible:Hebrews.abbr
ltx/gr_gr_cog/le.ep.mc.d331:lemcLI.Epistle.book_string	@ltx/gr_gr_cog/bible:Hebrews.text
ltx/gr_gr_cog/le.ep.mc.d331:lemcLI.Epistle.chapverse	11:17 – 31
ltx/gr_gr_cog/le.ep.mc.d331:lemcLI.Epistle.incipit	Πίστει προσενήνοχεν Ἀβραὰμ τὸν Ἰσαὰκ πειραζόμενος…
ltx/gr_gr_cog/le.ep.mc.d331:lemcLI.Epistle.text	Ἀδελφοί, πίστει προσενήνοχεν Ἀβραὰμ τὸν Ἰσαὰκ πειραζόμενος, καὶ τὸν μονογενῆ προσέφερεν ὁ τὰς ἐπαγγελίας ἀναδεξάμενος, πρὸς ὃν ἐλαλήθη ὅτι ἐν Ἰσαὰκ κληθήσεταί σοι σπέρμα, λογισάμενος ὅτι καὶ ἐκ νεκρῶν ἐγείρειν δυνατὸς ὁ Θεός· ὅθεν αὐτὸν καὶ ἐν παραβολῇ ἐκομίσατο. Πίστει περὶ μελλόντων εὐλόγησεν Ἰσαὰκ τὸν Ἰακὼβ καὶ τὸν Ἠσαῦ. Πίστει Ἰακὼβ ἀποθνήσκων ἕκαστον τῶν υἱῶν Ἰωσὴφ εὐλόγησε, καὶ προσεκύνησεν ἐπὶ τὸ ἄκρον τῆς ῥάβδου αὐτοῦ. Πίστει Ἰωσὴφ τελευτῶν περὶ τῆς ἐξόδου τῶν υἱῶν Ἰσραὴλ ἐμνημόνευσε καὶ περὶ τῶν ὀστέων αὐτοῦ ἐνετείλατο. Πίστει Μωϋσῆς γεννηθεὶς ἐκρύβη τρίμηνον ὑπὸ τῶν πατέρων αὐτοῦ, διότι εἶδον ἀστεῖον τὸ παιδίον, καὶ οὐκ ἐφοβήθησαν τὸ διάταγμα τοῦ βασιλέως. Πίστει Μωϋσῆς μέγας γενόμενος ἠρνήσατο λέγεσθαι υἱὸς θυγατρὸς Φαραώ, μᾶλλον ἑλόμενος συγκακουχεῖσθαι τῷ λαῷ τοῦ Θεοῦ ἢ πρόσκαιρον ἔχειν ἁμαρτίας ἀπόλαυσιν, μείζονα πλοῦτον ἡγησάμενος τῶν Αἰγύπτου θησαυρῶν τὸν ὀνειδισμὸν τοῦ Χριστοῦ· ἀπέβλεπε γὰρ εἰς τὴν μισθαποδοσίαν. Πίστει κατέλιπεν Αἴγυπτον μὴ φοβηθεὶς τὸν θυμὸν τοῦ βασιλέως· τὸν γὰρ ἀόρατον ὡς ὁρῶν ἐκαρτέρησε. Πίστει πεποίηκε τὸ πάσχα καὶ τὴν πρόσχυσιν τοῦ αἵματος, ἵνα μὴ ὁ ὀλοθρεύων τὰ πρωτότοκα θίγῃ αὐτῶν. Πίστει διέβησαν τὴν Ἐρυθρὰν θάλασσαν ὡς διὰ ξηρᾶς, ἧς πεῖραν λαβόντες οἱ Αἰγύπτιοι κατεπόθησαν. Πίστει τὰ τείχη Ἱεριχὼ ἔπεσε κυκλωθέντα ἐπὶ ἑπτὰ ἡμέρας. Πίστει Ῥαὰβ ἡ πόρνη οὐ συναπώλετο τοῖς ἀπειθήσασι, δεξαμένη τοὺς κατασκόπους μετ᾽ εἰρήνης.
ltx/gr_gr_cog/le.ep.mc.d331:lemcLI.Epistle.title	Τῇ Δευτέρᾳ τῆς ΛΑʹ Ἑβδομάδος
ltx/gr_gr_cog/le.ep.mc.d331:lemcLI.Epistle.title_abbr	Δευτέρᾳ τῆς ΛΑʹ Ἑβδομάδος
ltx/gr_gr_cog/le.ep.mc.d331:lemcLI.Epistle.version	@ltx/gr_gr_cog/properties:version.designation
