ltx/gr_gr_cog/me.m03.d08:meDA.commemoration.first	Μνήμη τοῦ Ὁσίου Θεοφυλάκτου, Ἐπισκόπου Νικομηδείας
ltx/gr_gr_cog/me.m03.d08:meDA.commemoration.first_name	
ltx/gr_gr_cog/me.m03.d08:meDA.commemoration.first_short	Μνήμη τοῦ Ὁσίου Θεοφυλάκτου, Ἐπισκόπου Νικομηδείας
ltx/gr_gr_cog/me.m03.d08:meDA.commemoration.first_title	@ltx/gr_gr_cog/titles:ti.SaintM
ltx/gr_gr_cog/me.m03.d08:meDA.commemoration.full	Μνήμη τοῦ Ὁσίου Πατρὸς ἡμῶν Θεοφυλάκτου, Ἐπισκόπου Νικομηδείας
ltx/gr_gr_cog/me.m03.d08:meDA.commemoration.second_name	
ltx/gr_gr_cog/me.m03.d08:meDA.commemoration.second_title	
ltx/gr_gr_cog/me.m03.d08:meDA.date	Τῌ Ηʹ ΜΑΡΤΙΟΥ
ltx/gr_gr_cog/me.m03.d08:meDA.fordate	διὰ τὴν 8ην Μαρτίου
ltx/gr_gr_cog/me.m03.d08:meDA.insert1	καὶ τοῦ Ὁσίου Πατρὸς ἡμῶν Θεοφυλάκτου, Ἐπισκόπου Νικομηδείας,
ltx/gr_gr_cog/me.m03.d08:meDA.insert2	οὗ καὶ τὴν μνήμην ἐπιτελοῦμεν·
ltx/gr_gr_cog/me.m03.d08:meDA.note	
ltx/gr_gr_cog/me.m03.d08:meDA.pdfcoverdate	τῆς 8ης Μαρτίου,
ltx/gr_gr_cog/me.m03.d08:meDA.pdfheaderdate	τῆς 8ης Μαρτίου
ltx/gr_gr_cog/me.m03.d08:meHO.commemorations	
ltx/gr_gr_cog/me.m03.d08:meHO.note1	
ltx/gr_gr_cog/me.m03.d08:meHO.note2	
ltx/gr_gr_cog/me.m03.d08:meHO.number	
ltx/gr_gr_cog/me.m03.d08:meHO.rank	
ltx/gr_gr_cog/me.m03.d08:meLE.commemoration1	Μνήμη τοῦ Ὁσίου Πατρὸς ἡμῶν Θεοφυλάκτου, Ἐπισκόπου Νικομηδείας.
ltx/gr_gr_cog/me.m03.d08:meLE.commemoration2	
ltx/gr_gr_cog/me.m03.d08:meLI.Kontakion1.incipit	@ltx/gr_gr_cog/me.m03.d08:meMA.Kontakion1ger.incipit
ltx/gr_gr_cog/me.m03.d08:meLI.Kontakion1.melody	@ltx/gr_gr_cog/me.m03.d08:meMA.Kontakion1ger.melody
ltx/gr_gr_cog/me.m03.d08:meLI.Kontakion1.mode	@ltx/gr_gr_cog/me.m03.d08:meMA.Kontakion1ger.mode
ltx/gr_gr_cog/me.m03.d08:meLI.Kontakion1.text	@ltx/gr_gr_cog/me.m03.d08:meMA.Kontakion1ger.text
ltx/gr_gr_cog/me.m03.d08:meLI.Megalynarion.text	
ltx/gr_gr_cog/me.m03.d08:meMA.C1.acrostic.notice1	οὗ ἡ Ἀκροστιχίς·
ltx/gr_gr_cog/me.m03.d08:meMA.C1.acrostic.text	Θεῖον Θεοφύλακτον ἐν ᾠδαῖς εὐφημήσω.
ltx/gr_gr_cog/me.m03.d08:meMA.C1.acrostic.title	Ὁ Κανὼν τοῦ Ἁγίου,
ltx/gr_gr_cog/me.m03.d08:meMA.C1.poet	@ltx/gr_gr_cog/poets:po.Theofanous
ltx/gr_gr_cog/me.m03.d08:meMA.C1.title	@ltx/gr_gr_cog/titles:ti.CanonSaintM
ltx/gr_gr_cog/me.m03.d08:meMA.C1.verse	@ltx/gr_gr_cog/prayers:pr.verse_SaintM.text
ltx/gr_gr_cog/me.m03.d08:meMA.Kontakion1ger.incipit	Ὡς ἀῤῥαγῆ, Ὀρθοδοξίας πρόμαχον, καὶ…
ltx/gr_gr_cog/me.m03.d08:meMA.Kontakion1ger.melody	@ltx/gr_gr_cog/he.a.m2:heAU.TousAsfaleis.name
ltx/gr_gr_cog/me.m03.d08:meMA.Kontakion1ger.mode	@ltx/gr_gr_cog/miscellanea:misc.Mode2
ltx/gr_gr_cog/me.m03.d08:meMA.Kontakion1ger.poet	@ltx/gr_gr_cog/poets:po.Gerasimou
ltx/gr_gr_cog/me.m03.d08:meMA.Kontakion1ger.text	Ὡς ἀῤῥαγῆ, Ὀρθοδοξίας πρόμαχον, καὶ ἰσχυρόν, κακοδοξίας ἔλεγχον, εὐφημοῦμεν καὶ βοῶμέν σοι, Ἱερομύστα Θεοφύλακτε. Ἐκ πάσης ἐπηρείας διαφύλαττε, τοὺς πίστει ἑορτάζοντας τὴν μνήμην σου, πρεσβεύων σωθῆναι τὰς ψυχὰς ἡμῶν.
ltx/gr_gr_cog/me.m03.d08:meMA.Ode1C11.greekmelody	@ltx/gr_gr_cog/he.h.m8:heHE.AsomenToKyrio.greekname
ltx/gr_gr_cog/me.m03.d08:meMA.Ode1C11.incipit	Θρόνῳ τῷ τοῦ Δεσπότου, Πάτερ…
ltx/gr_gr_cog/me.m03.d08:meMA.Ode1C11.melody	@ltx/gr_gr_cog/he.h.m8:heHE.AsomenToKyrio.name
ltx/gr_gr_cog/me.m03.d08:meMA.Ode1C11.mode	@ltx/gr_gr_cog/miscellanea:misc.Mode8
ltx/gr_gr_cog/me.m03.d08:meMA.Ode1C11.ode	@ltx/gr_gr_cog/miscellanea:misc.Ode1
ltx/gr_gr_cog/me.m03.d08:meMA.Ode1C11.text	Θρόνῳ τῷ τοῦ Δεσπότου, Πάτερ θεοφόρε Θεοφύλακτε, παριστάμενος πίστει, τοὺς τελοῦντας τὴν μνήμην σου φύλαττε.
ltx/gr_gr_cog/me.m03.d08:meMA.Ode1C12.incipit	Ἔχρισέ σε ἀξίως, χάρις ἡ…
ltx/gr_gr_cog/me.m03.d08:meMA.Ode1C12.melody	@ltx/gr_gr_cog/he.h.m8:heHE.AsomenToKyrio.name
ltx/gr_gr_cog/me.m03.d08:meMA.Ode1C12.mode	@ltx/gr_gr_cog/miscellanea:misc.Mode8
ltx/gr_gr_cog/me.m03.d08:meMA.Ode1C12.ode	@ltx/gr_gr_cog/miscellanea:misc.Ode1
ltx/gr_gr_cog/me.m03.d08:meMA.Ode1C12.text	Ἔχρισέ σε ἀξίως, χάρις ἡ τοῦ Πνεύματος Πανόλβιε, ἕνεκεν ἀληθείας, καὶ τὸν τρόπον σου χάριν χρηστότητος.
ltx/gr_gr_cog/me.m03.d08:meMA.Ode1C13.incipit	Ἵνα τῶν οὐρανίων, Μάκαρ ἐπιτύχῃς…
ltx/gr_gr_cog/me.m03.d08:meMA.Ode1C13.melody	@ltx/gr_gr_cog/he.h.m8:heHE.AsomenToKyrio.name
ltx/gr_gr_cog/me.m03.d08:meMA.Ode1C13.mode	@ltx/gr_gr_cog/miscellanea:misc.Mode8
ltx/gr_gr_cog/me.m03.d08:meMA.Ode1C13.ode	@ltx/gr_gr_cog/miscellanea:misc.Ode1
ltx/gr_gr_cog/me.m03.d08:meMA.Ode1C13.text	Ἵνα τῶν οὐρανίων, Μάκαρ ἐπιτύχῃς τὰ ἐπίγεια, κατεπάτησας πάντα, καὶ Χριστῷ τῷ Θεῷ ἠκολούθησας.
ltx/gr_gr_cog/me.m03.d08:meMA.Ode1C1H.greekmelody	@ltx/gr_gr_cog/he.h.m8:heHE.AsomenToKyrio.greekname
ltx/gr_gr_cog/me.m03.d08:meMA.Ode1C1H.incipit	@ltx/gr_gr_cog/he.h.m8:heHE.AsomenToKyrio.incipit
ltx/gr_gr_cog/me.m03.d08:meMA.Ode1C1H.melody	@ltx/gr_gr_cog/he.h.m8:heHE.AsomenToKyrio.melody
ltx/gr_gr_cog/me.m03.d08:meMA.Ode1C1H.mode	@ltx/gr_gr_cog/miscellanea:misc.Mode8
ltx/gr_gr_cog/me.m03.d08:meMA.Ode1C1H.ode	@ltx/gr_gr_cog/miscellanea:misc.Ode1
ltx/gr_gr_cog/me.m03.d08:meMA.Ode1C1H.text	@ltx/gr_gr_cog/he.h.m8:heHE.AsomenToKyrio.text
ltx/gr_gr_cog/me.m03.d08:meMA.Ode1C1T.incipit	Ὅλος ἐπιθυμίᾳ, ὁ ἐκ τῆς…
ltx/gr_gr_cog/me.m03.d08:meMA.Ode1C1T.melody	@ltx/gr_gr_cog/he.h.m8:heHE.AsomenToKyrio.name
ltx/gr_gr_cog/me.m03.d08:meMA.Ode1C1T.mode	@ltx/gr_gr_cog/miscellanea:misc.Mode8
ltx/gr_gr_cog/me.m03.d08:meMA.Ode1C1T.ode	@ltx/gr_gr_cog/miscellanea:misc.Ode1
ltx/gr_gr_cog/me.m03.d08:meMA.Ode1C1T.text	Ὅλος ἐπιθυμίᾳ, ὁ ἐκ τῆς γαστρός σου Θεονύμφευτε, εὐδοκήσας τεχθῆναι, γλυκασμός τε καὶ φῶς Ἁγνὴ ἄδυτον.
ltx/gr_gr_cog/me.m03.d08:meMA.Ode3C11.greekmelody	@ltx/gr_gr_cog/he.h.m8:heHE.SyEiToStereoma.greekname
ltx/gr_gr_cog/me.m03.d08:meMA.Ode3C11.incipit	Νόμοις σὺ πειθόμενος, τοῖς τοῦ…
ltx/gr_gr_cog/me.m03.d08:meMA.Ode3C11.melody	@ltx/gr_gr_cog/he.h.m8:heHE.SyEiToStereoma.name
ltx/gr_gr_cog/me.m03.d08:meMA.Ode3C11.mode	@ltx/gr_gr_cog/miscellanea:misc.Mode8
ltx/gr_gr_cog/me.m03.d08:meMA.Ode3C11.ode	@ltx/gr_gr_cog/miscellanea:misc.Ode3
ltx/gr_gr_cog/me.m03.d08:meMA.Ode3C11.text	Νόμοις σὺ πειθόμενος, τοῖς τοῦ Δεσπότου σου ἔνδοξε, Ἀρχιερεῦ, νόμων παρανόμων, βασιλέων ἠλόγησας.
ltx/gr_gr_cog/me.m03.d08:meMA.Ode3C12.incipit	Θεῖον ἐξεικόνισμα, Χριστοῦ καὶ ἄχραντον…
ltx/gr_gr_cog/me.m03.d08:meMA.Ode3C12.melody	@ltx/gr_gr_cog/he.h.m8:heHE.SyEiToStereoma.name
ltx/gr_gr_cog/me.m03.d08:meMA.Ode3C12.mode	@ltx/gr_gr_cog/miscellanea:misc.Mode8
ltx/gr_gr_cog/me.m03.d08:meMA.Ode3C12.ode	@ltx/gr_gr_cog/miscellanea:misc.Ode3
ltx/gr_gr_cog/me.m03.d08:meMA.Ode3C12.text	Θεῖον ἐξεικόνισμα, Χριστοῦ καὶ ἄχραντον ἔσεβες, τὰς τῶν ἀσεβούντων ἀσεβείας ἀρνούμενος.
ltx/gr_gr_cog/me.m03.d08:meMA.Ode3C13.incipit	Ἔτλης τὸ μαρτύριον, τῆς συνειδήσεως…
ltx/gr_gr_cog/me.m03.d08:meMA.Ode3C13.melody	@ltx/gr_gr_cog/he.h.m8:heHE.SyEiToStereoma.name
ltx/gr_gr_cog/me.m03.d08:meMA.Ode3C13.mode	@ltx/gr_gr_cog/miscellanea:misc.Mode8
ltx/gr_gr_cog/me.m03.d08:meMA.Ode3C13.ode	@ltx/gr_gr_cog/miscellanea:misc.Ode3
ltx/gr_gr_cog/me.m03.d08:meMA.Ode3C13.text	Ἔτλης τὸ μαρτύριον, τῆς συνειδήσεως πρότερον, ἀσκητικῶς, καὶ νῦν τῶν Μαρτύρων, ἀνεδήσω τὸν στέφανον.
ltx/gr_gr_cog/me.m03.d08:meMA.Ode3C1H.greekmelody	@ltx/gr_gr_cog/he.h.m8:heHE.SyEiToStereoma.greekname
ltx/gr_gr_cog/me.m03.d08:meMA.Ode3C1H.incipit	@ltx/gr_gr_cog/he.h.m8:heHE.SyEiToStereoma.incipit
ltx/gr_gr_cog/me.m03.d08:meMA.Ode3C1H.melody	@ltx/gr_gr_cog/he.h.m8:heHE.SyEiToStereoma.melody
ltx/gr_gr_cog/me.m03.d08:meMA.Ode3C1H.mode	@ltx/gr_gr_cog/miscellanea:misc.Mode8
ltx/gr_gr_cog/me.m03.d08:meMA.Ode3C1H.ode	@ltx/gr_gr_cog/miscellanea:misc.Ode3
ltx/gr_gr_cog/me.m03.d08:meMA.Ode3C1H.text	@ltx/gr_gr_cog/he.h.m8:heHE.SyEiToStereoma.text
ltx/gr_gr_cog/me.m03.d08:meMA.Ode3C1T.incipit	Ἵνα τρίβον Δέσποτα, πρὸς ἁγιότητα…
ltx/gr_gr_cog/me.m03.d08:meMA.Ode3C1T.melody	@ltx/gr_gr_cog/he.h.m8:heHE.SyEiToStereoma.name
ltx/gr_gr_cog/me.m03.d08:meMA.Ode3C1T.mode	@ltx/gr_gr_cog/miscellanea:misc.Mode8
ltx/gr_gr_cog/me.m03.d08:meMA.Ode3C1T.ode	@ltx/gr_gr_cog/miscellanea:misc.Ode3
ltx/gr_gr_cog/me.m03.d08:meMA.Ode3C1T.text	Ἵνα τρίβον Δέσποτα, πρὸς ἁγιότητα φέρουσαν, δείξῃς ἡμῖν, μήτραν παναγίαν, παναγίως κατῴκησας.
ltx/gr_gr_cog/me.m03.d08:meMA.Ode3Kathisma1.greekmelody	@ltx/gr_gr_cog/he.a.m8:heAU.TinSofianKaiLogon.greekname
ltx/gr_gr_cog/me.m03.d08:meMA.Ode3Kathisma1.incipit	Ἐξασκήσας ὁσίως Πάτερ σοφέ, Ἱεράρχης…
ltx/gr_gr_cog/me.m03.d08:meMA.Ode3Kathisma1.melody	@ltx/gr_gr_cog/he.a.m8:heAU.TinSofianKaiLogon.name
ltx/gr_gr_cog/me.m03.d08:meMA.Ode3Kathisma1.mode	@ltx/gr_gr_cog/miscellanea:misc.Mode8
ltx/gr_gr_cog/me.m03.d08:meMA.Ode3Kathisma1.text	Ἐξασκήσας ὁσίως Πάτερ σοφέ, Ἱεράρχης ἐχρίσθης ἱερουργεῖν, τὰ θεῖα μυστήρια, εἰς ψυχῶν περιποίησιν, τὴν Χριστοῦ δὲ εἰκόνα, τιμήσας ὑπήνεγκας, ἐξορίας θλίψεις, καὶ χρόνιον κάθειρξιν· ὅθεν μετὰ τέλος, ἀναβλύζων ἰάσεις, ἰᾶσαι τοὺς κάμνοντας, καὶ φωτίζεις τοὺς ψάλλοντας, Ἱεράρχα Θεοφύλακτε· πρέσβευε Χριστῷ τῷ Θεῷ, τῶν πταισμάτων ἄφεσιν δωρήσασθαι, τοῖς ἑορτάζουσι πόθῳ, τὴν ἁγίαν μνήμην σου.
ltx/gr_gr_cog/me.m03.d08:meMA.Ode3KathismaSt.incipit	@ltx/gr_gr_cog/me.m01.d24:meMA.Ode3KathismaSt.incipit
ltx/gr_gr_cog/me.m03.d08:meMA.Ode3KathismaSt.melody	@ltx/gr_gr_cog/he.a.m8:heAU.TinSofianKaiLogon.name
ltx/gr_gr_cog/me.m03.d08:meMA.Ode3KathismaSt.mode	@ltx/gr_gr_cog/miscellanea:misc.Mode8
ltx/gr_gr_cog/me.m03.d08:meMA.Ode3KathismaSt.text	@ltx/gr_gr_cog/me.m01.d24:meMA.Ode3KathismaSt.text
ltx/gr_gr_cog/me.m03.d08:meMA.Ode3KathismaT.incipit	Τοῦ Ἡλίου νεφέλη τοῦ νοητοῦ…
ltx/gr_gr_cog/me.m03.d08:meMA.Ode3KathismaT.melody	@ltx/gr_gr_cog/he.a.m8:heAU.TinSofianKaiLogon.name
ltx/gr_gr_cog/me.m03.d08:meMA.Ode3KathismaT.mode	@ltx/gr_gr_cog/miscellanea:misc.Mode8
ltx/gr_gr_cog/me.m03.d08:meMA.Ode3KathismaT.text	Τοῦ Ἡλίου νεφέλη τοῦ νοητοῦ, θείου φέγγους λυχνία χρυσοφαής, ἄσπιλε, ἀμόλυντε, ὑπεράμωμε Δέσποινα, τὴν σκοτεινὴν ψυχήν μου, τυφλώττουσαν πάθεσι, τῆς ἀπαθείας αἴγλῃ καταύγασον δέομαι, καὶ μεμολυσμένην, τὴν καρδίαν μου, πλῦνον ῥοαῖς κατανύξεως, μετανοίας τε δάκρυσι, ἵνα πόθῳ κραυγάζω σοι· Πρέσβευε τῷ σῷ Υἱῷ καὶ Θεῷ, τῶν πταισμάτων ἄφεσιν δοθῆναί μοι· σὲ γὰρ ἔχω ἐλπίδα, ὁ ἀνάξιος δοῦλός σου.
ltx/gr_gr_cog/me.m03.d08:meMA.Ode4C11.greekmelody	@ltx/gr_gr_cog/he.h.m8:heHE.EisakikoaKyrie.greekname
ltx/gr_gr_cog/me.m03.d08:meMA.Ode4C11.incipit	Οὐ τὸ πῦρ ἐδειλίασας, τὸ…
ltx/gr_gr_cog/me.m03.d08:meMA.Ode4C11.melody	@ltx/gr_gr_cog/he.h.m8:heHE.EisakikoaKyrie.name
ltx/gr_gr_cog/me.m03.d08:meMA.Ode4C11.mode	@ltx/gr_gr_cog/miscellanea:misc.Mode8
ltx/gr_gr_cog/me.m03.d08:meMA.Ode4C11.ode	@ltx/gr_gr_cog/miscellanea:misc.Ode4
ltx/gr_gr_cog/me.m03.d08:meMA.Ode4C11.text	Οὐ τὸ πῦρ ἐδειλίασας, τὸ τῶν πειρασμῶν παμμάκαρ θεόπνευστε, οὐκ ἐχαύνωσε τὸν τόνον σου, τῆς τρυφῆς τὸ λεῖον Θεοφύλακτε.
ltx/gr_gr_cog/me.m03.d08:meMA.Ode4C12.incipit	Φυλακήν σου τῷ στόματι, ἔθετο…
ltx/gr_gr_cog/me.m03.d08:meMA.Ode4C12.melody	@ltx/gr_gr_cog/he.h.m8:heHE.EisakikoaKyrie.name
ltx/gr_gr_cog/me.m03.d08:meMA.Ode4C12.mode	@ltx/gr_gr_cog/miscellanea:misc.Mode8
ltx/gr_gr_cog/me.m03.d08:meMA.Ode4C12.ode	@ltx/gr_gr_cog/miscellanea:misc.Ode4
ltx/gr_gr_cog/me.m03.d08:meMA.Ode4C12.text	Φυλακήν σου τῷ στόματι, ἔθετο Χριστὸς καὶ χείλεσιν, Ὅσιε· ὅθεν ἔμεινας ἀσάλευτος, ἀσεβῶν συστάντων ἐναντίον σου.
ltx/gr_gr_cog/me.m03.d08:meMA.Ode4C13.incipit	Ὑπομένων ὑπέμεινας, τὸν ἐπὶ τὴν…
ltx/gr_gr_cog/me.m03.d08:meMA.Ode4C13.melody	@ltx/gr_gr_cog/he.h.m8:heHE.EisakikoaKyrie.name
ltx/gr_gr_cog/me.m03.d08:meMA.Ode4C13.mode	@ltx/gr_gr_cog/miscellanea:misc.Mode8
ltx/gr_gr_cog/me.m03.d08:meMA.Ode4C13.ode	@ltx/gr_gr_cog/miscellanea:misc.Ode4
ltx/gr_gr_cog/me.m03.d08:meMA.Ode4C13.text	Ὑπομένων ὑπέμεινας, τὸν ἐπὶ τὴν πέτραν πόδας σου στήσαντα, καὶ προσέσχε σοι ὁ Ὕψιστος, τὴν αὐτοῦ εἰκόνα προσκυνήσαντι.
ltx/gr_gr_cog/me.m03.d08:meMA.Ode4C1H.greekmelody	@ltx/gr_gr_cog/he.h.m8:heHE.EisakikoaKyrie.greekname
ltx/gr_gr_cog/me.m03.d08:meMA.Ode4C1H.incipit	@ltx/gr_gr_cog/he.h.m8:heHE.EisakikoaKyrie.incipit
ltx/gr_gr_cog/me.m03.d08:meMA.Ode4C1H.melody	@ltx/gr_gr_cog/he.h.m8:heHE.EisakikoaKyrie.melody
ltx/gr_gr_cog/me.m03.d08:meMA.Ode4C1H.mode	@ltx/gr_gr_cog/miscellanea:misc.Mode8
ltx/gr_gr_cog/me.m03.d08:meMA.Ode4C1H.ode	@ltx/gr_gr_cog/miscellanea:misc.Ode4
ltx/gr_gr_cog/me.m03.d08:meMA.Ode4C1H.text	@ltx/gr_gr_cog/he.h.m8:heHE.EisakikoaKyrie.text
ltx/gr_gr_cog/me.m03.d08:meMA.Ode4C1T.incipit	Λυτρωθέντες τῷ τόκῳ σου, τοῦ…
ltx/gr_gr_cog/me.m03.d08:meMA.Ode4C1T.melody	@ltx/gr_gr_cog/he.h.m8:heHE.EisakikoaKyrie.name
ltx/gr_gr_cog/me.m03.d08:meMA.Ode4C1T.mode	@ltx/gr_gr_cog/miscellanea:misc.Mode8
ltx/gr_gr_cog/me.m03.d08:meMA.Ode4C1T.ode	@ltx/gr_gr_cog/miscellanea:misc.Ode4
ltx/gr_gr_cog/me.m03.d08:meMA.Ode4C1T.text	Λυτρωθέντες τῷ τόκῳ σου, τοῦ τῆς ἁμαρτίας χρέους πανάμωμε, χαριστήριον ἐφύμνιον, ἀναμέλπομέν σοι Θεονύμφευτε.
ltx/gr_gr_cog/me.m03.d08:meMA.Ode5C11.greekmelody	@ltx/gr_gr_cog/he.h.m8:heHE.OrthrizontesVoomenSoi.greekname
ltx/gr_gr_cog/me.m03.d08:meMA.Ode5C11.incipit	Αἱ χεῖρές σου ὁσίως θεόπνευστε…
ltx/gr_gr_cog/me.m03.d08:meMA.Ode5C11.melody	@ltx/gr_gr_cog/he.h.m8:heHE.OrthrizontesVoomenSoi.name
ltx/gr_gr_cog/me.m03.d08:meMA.Ode5C11.mode	@ltx/gr_gr_cog/miscellanea:misc.Mode8
ltx/gr_gr_cog/me.m03.d08:meMA.Ode5C11.ode	@ltx/gr_gr_cog/miscellanea:misc.Ode5
ltx/gr_gr_cog/me.m03.d08:meMA.Ode5C11.text	Αἱ χεῖρές σου ὁσίως θεόπνευστε, πρὸς τὸν Θεόν, Πάτερ ἐπαιρόμεναι, τοὺς δυσσεβεῖς ἐτροπώσαντο.
ltx/gr_gr_cog/me.m03.d08:meMA.Ode5C12.incipit	Κρατήσας τῆς χειρός σου ὁ…
ltx/gr_gr_cog/me.m03.d08:meMA.Ode5C12.melody	@ltx/gr_gr_cog/he.h.m8:heHE.OrthrizontesVoomenSoi.name
ltx/gr_gr_cog/me.m03.d08:meMA.Ode5C12.mode	@ltx/gr_gr_cog/miscellanea:misc.Mode8
ltx/gr_gr_cog/me.m03.d08:meMA.Ode5C12.ode	@ltx/gr_gr_cog/miscellanea:misc.Ode5
ltx/gr_gr_cog/me.m03.d08:meMA.Ode5C12.text	Κρατήσας τῆς χειρός σου ὁ Κύριος Θεοφόρε, Πάτερ καθωδήγησε, πρὸς οὐρανίαν ἀπόλαυσιν.
ltx/gr_gr_cog/me.m03.d08:meMA.Ode5C13.incipit	Τὴν τρίβον τὴν στενὴν Θεοφύλακτε…
ltx/gr_gr_cog/me.m03.d08:meMA.Ode5C13.melody	@ltx/gr_gr_cog/he.h.m8:heHE.OrthrizontesVoomenSoi.name
ltx/gr_gr_cog/me.m03.d08:meMA.Ode5C13.mode	@ltx/gr_gr_cog/miscellanea:misc.Mode8
ltx/gr_gr_cog/me.m03.d08:meMA.Ode5C13.ode	@ltx/gr_gr_cog/miscellanea:misc.Ode5
ltx/gr_gr_cog/me.m03.d08:meMA.Ode5C13.text	Τὴν τρίβον τὴν στενὴν Θεοφύλακτε, διαπερῶν, πρὸς πλάτος κατήντησας, τοῦ Παραδείσου θεόπνευστε.
ltx/gr_gr_cog/me.m03.d08:meMA.Ode5C1H.greekmelody	@ltx/gr_gr_cog/he.h.m8:heHE.OrthrizontesVoomenSoi.greekname
ltx/gr_gr_cog/me.m03.d08:meMA.Ode5C1H.incipit	@ltx/gr_gr_cog/he.h.m8:heHE.OrthrizontesVoomenSoi.incipit
ltx/gr_gr_cog/me.m03.d08:meMA.Ode5C1H.melody	@ltx/gr_gr_cog/he.h.m8:heHE.OrthrizontesVoomenSoi.melody
ltx/gr_gr_cog/me.m03.d08:meMA.Ode5C1H.mode	@ltx/gr_gr_cog/miscellanea:misc.Mode8
ltx/gr_gr_cog/me.m03.d08:meMA.Ode5C1H.ode	@ltx/gr_gr_cog/miscellanea:misc.Ode5
ltx/gr_gr_cog/me.m03.d08:meMA.Ode5C1H.text	@ltx/gr_gr_cog/he.h.m8:heHE.OrthrizontesVoomenSoi.text
ltx/gr_gr_cog/me.m03.d08:meMA.Ode5C1T.incipit	Οἱ μή σε Θεοτόκον γινώσκοντες…
ltx/gr_gr_cog/me.m03.d08:meMA.Ode5C1T.melody	@ltx/gr_gr_cog/he.h.m8:heHE.OrthrizontesVoomenSoi.name
ltx/gr_gr_cog/me.m03.d08:meMA.Ode5C1T.mode	@ltx/gr_gr_cog/miscellanea:misc.Mode8
ltx/gr_gr_cog/me.m03.d08:meMA.Ode5C1T.ode	@ltx/gr_gr_cog/miscellanea:misc.Ode5
ltx/gr_gr_cog/me.m03.d08:meMA.Ode5C1T.text	Οἱ μή σε Θεοτόκον γινώσκοντες, Θεομῆτορ, φῶς οὐ μὴ θεάσωνται, τὸ γεννηθὲν ἐκ σοῦ πάναγνε.
ltx/gr_gr_cog/me.m03.d08:meMA.Ode6C11.greekmelody	@ltx/gr_gr_cog/he.h.m8:heHE.ChitonaMoiParaschou.greekname
ltx/gr_gr_cog/me.m03.d08:meMA.Ode6C11.incipit	Νεκρώσας τὰς αἰσθήσεις ἐγκρατῶς, παθῶν…
ltx/gr_gr_cog/me.m03.d08:meMA.Ode6C11.melody	@ltx/gr_gr_cog/he.h.m8:heHE.ChitonaMoiParaschou.name
ltx/gr_gr_cog/me.m03.d08:meMA.Ode6C11.mode	@ltx/gr_gr_cog/miscellanea:misc.Mode8
ltx/gr_gr_cog/me.m03.d08:meMA.Ode6C11.ode	@ltx/gr_gr_cog/miscellanea:misc.Ode6
ltx/gr_gr_cog/me.m03.d08:meMA.Ode6C11.text	Νεκρώσας τὰς αἰσθήσεις ἐγκρατῶς, παθῶν ἐβασίλευσας, καὶ νῦν Θεοφύλακτε, ἀπαθείας ἐντρυφᾷς ταῖς λαμπρότησιν.
ltx/gr_gr_cog/me.m03.d08:meMA.Ode6C12.incipit	Εἰκόνα τοῦ Σωτῆρος προσκυνεῖν, τοὺς…
ltx/gr_gr_cog/me.m03.d08:meMA.Ode6C12.melody	@ltx/gr_gr_cog/he.h.m8:heHE.ChitonaMoiParaschou.name
ltx/gr_gr_cog/me.m03.d08:meMA.Ode6C12.mode	@ltx/gr_gr_cog/miscellanea:misc.Mode8
ltx/gr_gr_cog/me.m03.d08:meMA.Ode6C12.ode	@ltx/gr_gr_cog/miscellanea:misc.Ode6
ltx/gr_gr_cog/me.m03.d08:meMA.Ode6C12.text	Εἰκόνα τοῦ Σωτῆρος προσκυνεῖν, τοὺς πάντας ἐδίδαξας, ἔργοις καὶ δόγμασι, διαπρέψας ἐμφανῶς Θεοφύλακτε.
ltx/gr_gr_cog/me.m03.d08:meMA.Ode6C13.incipit	Νεφέλην σε τὸν ὄμβρον τῆς…
ltx/gr_gr_cog/me.m03.d08:meMA.Ode6C13.melody	@ltx/gr_gr_cog/he.h.m8:heHE.ChitonaMoiParaschou.name
ltx/gr_gr_cog/me.m03.d08:meMA.Ode6C13.mode	@ltx/gr_gr_cog/miscellanea:misc.Mode8
ltx/gr_gr_cog/me.m03.d08:meMA.Ode6C13.ode	@ltx/gr_gr_cog/miscellanea:misc.Ode6
ltx/gr_gr_cog/me.m03.d08:meMA.Ode6C13.text	Νεφέλην σε τὸν ὄμβρον τῆς ζωῆς, ὁ Χριστὸς ἀνέδειξε, Πάτερ πηγάζουσαν, Ἱεράρχα τοῦ Χριστοῦ Θεοφύλακτε.
ltx/gr_gr_cog/me.m03.d08:meMA.Ode6C1H.greekmelody	@ltx/gr_gr_cog/he.h.m8:heHE.ChitonaMoiParaschou.greekname
ltx/gr_gr_cog/me.m03.d08:meMA.Ode6C1H.incipit	@ltx/gr_gr_cog/he.h.m8:heHE.ChitonaMoiParaschou.incipit
ltx/gr_gr_cog/me.m03.d08:meMA.Ode6C1H.melody	@ltx/gr_gr_cog/he.h.m8:heHE.ChitonaMoiParaschou.melody
ltx/gr_gr_cog/me.m03.d08:meMA.Ode6C1H.mode	@ltx/gr_gr_cog/miscellanea:misc.Mode8
ltx/gr_gr_cog/me.m03.d08:meMA.Ode6C1H.ode	@ltx/gr_gr_cog/miscellanea:misc.Ode6
ltx/gr_gr_cog/me.m03.d08:meMA.Ode6C1H.text	@ltx/gr_gr_cog/he.h.m8:heHE.ChitonaMoiParaschou.text
ltx/gr_gr_cog/me.m03.d08:meMA.Ode6C1T.incipit	Ὡραῖος παρὰ πάντας τοὺς βροτούς…
ltx/gr_gr_cog/me.m03.d08:meMA.Ode6C1T.melody	@ltx/gr_gr_cog/he.h.m8:heHE.ChitonaMoiParaschou.name
ltx/gr_gr_cog/me.m03.d08:meMA.Ode6C1T.mode	@ltx/gr_gr_cog/miscellanea:misc.Mode8
ltx/gr_gr_cog/me.m03.d08:meMA.Ode6C1T.ode	@ltx/gr_gr_cog/miscellanea:misc.Ode6
ltx/gr_gr_cog/me.m03.d08:meMA.Ode6C1T.text	Ὡραῖος παρὰ πάντας τοὺς βροτούς, ὁ Υἱός σου Πάναγνε, κάλλει Θεότητος, εἰ καὶ σάρκα διʼ ἡμᾶς ἀνελάβετο.
ltx/gr_gr_cog/me.m03.d08:meMA.Ode7C11.greekmelody	@ltx/gr_gr_cog/he.h.m8:heHE.PaidesEvraion.greekname
ltx/gr_gr_cog/me.m03.d08:meMA.Ode7C11.incipit	Δρόμον τὸν θεῖον ἐκτελέσας, καὶ…
ltx/gr_gr_cog/me.m03.d08:meMA.Ode7C11.melody	@ltx/gr_gr_cog/he.h.m8:heHE.PaidesEvraion.name
ltx/gr_gr_cog/me.m03.d08:meMA.Ode7C11.mode	@ltx/gr_gr_cog/miscellanea:misc.Mode8
ltx/gr_gr_cog/me.m03.d08:meMA.Ode7C11.ode	@ltx/gr_gr_cog/miscellanea:misc.Ode7
ltx/gr_gr_cog/me.m03.d08:meMA.Ode7C11.text	Δρόμον τὸν θεῖον ἐκτελέσας, καὶ τὴν πίστιν σου τηρήσας μέχρι τέλους, τῶν σῶν πόνων Σοφέ, τὸν στέφανον ἐκτήσω, ἀναβοῶν μακάριε· ὁ Θεὸς εὐλογητὸς εἶ.
ltx/gr_gr_cog/me.m03.d08:meMA.Ode7C12.incipit	Ἅρματι θείων ἀρετῶν σου, ἐποχούμενος…
ltx/gr_gr_cog/me.m03.d08:meMA.Ode7C12.melody	@ltx/gr_gr_cog/he.h.m8:heHE.PaidesEvraion.name
ltx/gr_gr_cog/me.m03.d08:meMA.Ode7C12.mode	@ltx/gr_gr_cog/miscellanea:misc.Mode8
ltx/gr_gr_cog/me.m03.d08:meMA.Ode7C12.ode	@ltx/gr_gr_cog/miscellanea:misc.Ode7
ltx/gr_gr_cog/me.m03.d08:meMA.Ode7C12.text	Ἅρματι θείων ἀρετῶν σου, ἐποχούμενος πρὸς ὕψος ἀνηνέχθης, τῷ Θεῷ δὲ τανῦν παρέστηκας κραυγάζων· Εὐλογητὸς εἶ Κύριε, ὁ Θεὸς εἰς τοὺς αἰῶνας.
ltx/gr_gr_cog/me.m03.d08:meMA.Ode7C13.incipit	Ἴδεν ὁ πλάσας κατὰ μόνας…
ltx/gr_gr_cog/me.m03.d08:meMA.Ode7C13.melody	@ltx/gr_gr_cog/he.h.m8:heHE.PaidesEvraion.name
ltx/gr_gr_cog/me.m03.d08:meMA.Ode7C13.mode	@ltx/gr_gr_cog/miscellanea:misc.Mode8
ltx/gr_gr_cog/me.m03.d08:meMA.Ode7C13.ode	@ltx/gr_gr_cog/miscellanea:misc.Ode7
ltx/gr_gr_cog/me.m03.d08:meMA.Ode7C13.text	Ἴδεν ὁ πλάσας κατὰ μόνας, τὰς καρδίας τῶν ἀνθρώπων Θεοφόρε, τῆς καρδίας τῆς σῆς, τὸ ἔνθεον καὶ θρόνοις, διδασκαλίας ἵδρυσε, Θεοφύλακτε τρισμάκαρ.
ltx/gr_gr_cog/me.m03.d08:meMA.Ode7C1H.greekmelody	@ltx/gr_gr_cog/he.h.m8:heHE.PaidesEvraion.greekname
ltx/gr_gr_cog/me.m03.d08:meMA.Ode7C1H.incipit	@ltx/gr_gr_cog/he.h.m8:heHE.PaidesEvraion.incipit
ltx/gr_gr_cog/me.m03.d08:meMA.Ode7C1H.melody	@ltx/gr_gr_cog/he.h.m8:heHE.PaidesEvraion.melody
ltx/gr_gr_cog/me.m03.d08:meMA.Ode7C1H.mode	@ltx/gr_gr_cog/miscellanea:misc.Mode8
ltx/gr_gr_cog/me.m03.d08:meMA.Ode7C1H.ode	@ltx/gr_gr_cog/miscellanea:misc.Ode7
ltx/gr_gr_cog/me.m03.d08:meMA.Ode7C1H.text	@ltx/gr_gr_cog/he.h.m8:heHE.PaidesEvraion.text
ltx/gr_gr_cog/me.m03.d08:meMA.Ode7C1T.incipit	Σοὶ νῦν προσφεύγω Θεοτόκε, καὶ…
ltx/gr_gr_cog/me.m03.d08:meMA.Ode7C1T.melody	@ltx/gr_gr_cog/he.h.m8:heHE.PaidesEvraion.name
ltx/gr_gr_cog/me.m03.d08:meMA.Ode7C1T.mode	@ltx/gr_gr_cog/miscellanea:misc.Mode8
ltx/gr_gr_cog/me.m03.d08:meMA.Ode7C1T.ode	@ltx/gr_gr_cog/miscellanea:misc.Ode7
ltx/gr_gr_cog/me.m03.d08:meMA.Ode7C1T.text	Σοὶ νῦν προσφεύγω Θεοτόκε, καὶ τῇ σκέπῃ σου καὶ θείᾳ προστασίᾳ, λυτρωθῆναι δεινῶν, δεόμενος πταισμάτων, εὐλογημένη πάναγνε, ἡ Θεὸν σαρκὶ τεκοῦσα.
ltx/gr_gr_cog/me.m03.d08:meMA.Ode8C11.greekmelody	@ltx/gr_gr_cog/he.h.m8:heHE.EptaplasiosKaminon.greekname
ltx/gr_gr_cog/me.m03.d08:meMA.Ode8C11.incipit	Εὐφραινομένων ἔνθα νῦν, κατοικία κατῴκησας…
ltx/gr_gr_cog/me.m03.d08:meMA.Ode8C11.melody	@ltx/gr_gr_cog/he.h.m8:heHE.EptaplasiosKaminon.name
ltx/gr_gr_cog/me.m03.d08:meMA.Ode8C11.mode	@ltx/gr_gr_cog/miscellanea:misc.Mode8
ltx/gr_gr_cog/me.m03.d08:meMA.Ode8C11.ode	@ltx/gr_gr_cog/miscellanea:misc.Ode8
ltx/gr_gr_cog/me.m03.d08:meMA.Ode8C11.text	Εὐφραινομένων ἔνθα νῦν, κατοικία κατῴκησας, Ὁμολογητὰ τῆς ἀληθείας πρόμαχε, καὶ φῶς σοι ἀνέτειλεν, οἷα δικαίω πάνσοφε, καὶ τοὺς τῶν Μαρτύρων ἠθληκότι ἀγῶνας, μεθʼ ὧν νῦν ἀνακράζεις· Ἱερεῖς εὐλογεῖτε, λαὸς ὑπερυψοῦτε, Χριστὸν εἰς τοὺς αἰῶνας.
ltx/gr_gr_cog/me.m03.d08:meMA.Ode8C12.incipit	Ὑπομονῆς τὸν στέφανον, ἐκομίσω θεόληπτε…
ltx/gr_gr_cog/me.m03.d08:meMA.Ode8C12.melody	@ltx/gr_gr_cog/he.h.m8:heHE.EptaplasiosKaminon.name
ltx/gr_gr_cog/me.m03.d08:meMA.Ode8C12.mode	@ltx/gr_gr_cog/miscellanea:misc.Mode8
ltx/gr_gr_cog/me.m03.d08:meMA.Ode8C12.ode	@ltx/gr_gr_cog/miscellanea:misc.Ode8
ltx/gr_gr_cog/me.m03.d08:meMA.Ode8C12.text	Ὑπομονῆς τὸν στέφανον, ἐκομίσω θεόληπτε· τὰς ὑπερορίας γὰρ πικρῶς κατῴκησας, μισθὸν ἐκδεχόμενος, ἀπολαβεῖν τῶν ἄθλων σου, καὶ τῆς ἀγαθῆς οὐ διεψεύσθης ἐλπίδος, Χριστῷ ἀνακραυγάζων· Ἱερεῖς εὐλογεῖτε, λαὸς ὑπερυψοῦτε, εἰς πάντας τοὺς αἰῶνας.
ltx/gr_gr_cog/me.m03.d08:meMA.Ode8C13.incipit	Φωτοφανῶς ἡ μνήμη σου, θεοφόρε…
ltx/gr_gr_cog/me.m03.d08:meMA.Ode8C13.melody	@ltx/gr_gr_cog/he.h.m8:heHE.EptaplasiosKaminon.name
ltx/gr_gr_cog/me.m03.d08:meMA.Ode8C13.mode	@ltx/gr_gr_cog/miscellanea:misc.Mode8
ltx/gr_gr_cog/me.m03.d08:meMA.Ode8C13.ode	@ltx/gr_gr_cog/miscellanea:misc.Ode8
ltx/gr_gr_cog/me.m03.d08:meMA.Ode8C13.text	Φωτοφανῶς ἡ μνήμη σου, θεοφόρε τελεῖται νῦν, τῆς ὁμολογίας φωτισμοῦ πυρσεύουσα· ἁγίαν εἰκόνα γάρ, τὴν τοῦ Χριστοῦ ἐτίμησας, καὶ τῆς Θεοτόκου, τῶν Ἁγίων τε πάντων, μεθʼ ὧν νῦν ἀναμέλπεις· Ἱερεῖς εὐλογεῖτε, λαὸς ὑπερυψοῦτε, Χριστὸν εἰς τοὺς αἰῶνας.
ltx/gr_gr_cog/me.m03.d08:meMA.Ode8C1H.greekmelody	@ltx/gr_gr_cog/he.h.m8:heHE.EptaplasiosKaminon.greekname
ltx/gr_gr_cog/me.m03.d08:meMA.Ode8C1H.incipit	@ltx/gr_gr_cog/he.h.m8:heHE.EptaplasiosKaminon.incipit
ltx/gr_gr_cog/me.m03.d08:meMA.Ode8C1H.melody	@ltx/gr_gr_cog/he.h.m8:heHE.EptaplasiosKaminon.melody
ltx/gr_gr_cog/me.m03.d08:meMA.Ode8C1H.mode	@ltx/gr_gr_cog/miscellanea:misc.Mode8
ltx/gr_gr_cog/me.m03.d08:meMA.Ode8C1H.ode	@ltx/gr_gr_cog/miscellanea:misc.Ode8
ltx/gr_gr_cog/me.m03.d08:meMA.Ode8C1H.text	@ltx/gr_gr_cog/he.h.m8:heHE.EptaplasiosKaminon.text
ltx/gr_gr_cog/me.m03.d08:meMA.Ode8C1T.incipit	Ἡ Θεομήτωρ πάναγνε, τῆς ψυχῆς…
ltx/gr_gr_cog/me.m03.d08:meMA.Ode8C1T.melody	@ltx/gr_gr_cog/he.h.m8:heHE.EptaplasiosKaminon.name
ltx/gr_gr_cog/me.m03.d08:meMA.Ode8C1T.mode	@ltx/gr_gr_cog/miscellanea:misc.Mode8
ltx/gr_gr_cog/me.m03.d08:meMA.Ode8C1T.ode	@ltx/gr_gr_cog/miscellanea:misc.Ode8
ltx/gr_gr_cog/me.m03.d08:meMA.Ode8C1T.text	Ἡ Θεομήτωρ πάναγνε, τῆς ψυχῆς μου τὰ τραύματα καὶ τῆς ἁμαρτίας τὰς οὐλὰς ἐξάλειψον, Θεὸν ἡ κυήσασα, τῶν ἐπὶ πάντων Κόρη ἁγνή, ἐκ παρθενικῆς ἀπειρογάμου νηδύος, ὃν Παῖδες εὐλογοῦσιν, Ἱερεῖς ἀνυμνοῦσι, λαοὶ ὑπερυψοῦσιν, εἰς πάντας τοὺς αἰῶνας.
ltx/gr_gr_cog/me.m03.d08:meMA.Ode9C11.greekmelody	@ltx/gr_gr_cog/he.h.m8:heHE.KyriosTheotokon.greekname
ltx/gr_gr_cog/me.m03.d08:meMA.Ode9C11.incipit	Μεγάλων χαρισμάτων, ὄντως ἠξιώθης, ὑπὲρ…
ltx/gr_gr_cog/me.m03.d08:meMA.Ode9C11.melody	@ltx/gr_gr_cog/he.h.m8:heHE.KyriosTheotokon.name
ltx/gr_gr_cog/me.m03.d08:meMA.Ode9C11.mode	@ltx/gr_gr_cog/miscellanea:misc.Mode8
ltx/gr_gr_cog/me.m03.d08:meMA.Ode9C11.ode	@ltx/gr_gr_cog/miscellanea:misc.Ode9
ltx/gr_gr_cog/me.m03.d08:meMA.Ode9C11.text	Μεγάλων χαρισμάτων, ὄντως ἠξιώθης, ὑπὲρ Χριστοῦ κινδυνεύσας φρονήματι, καρτερικῷ θεοφόρε θεομακάριστε.
ltx/gr_gr_cog/me.m03.d08:meMA.Ode9C12.incipit	Ἡμᾶς τοὺς σὲ ὑμνοῦντας, Μάκαρ…
ltx/gr_gr_cog/me.m03.d08:meMA.Ode9C12.melody	@ltx/gr_gr_cog/he.h.m8:heHE.KyriosTheotokon.name
ltx/gr_gr_cog/me.m03.d08:meMA.Ode9C12.mode	@ltx/gr_gr_cog/miscellanea:misc.Mode8
ltx/gr_gr_cog/me.m03.d08:meMA.Ode9C12.ode	@ltx/gr_gr_cog/miscellanea:misc.Ode9
ltx/gr_gr_cog/me.m03.d08:meMA.Ode9C12.text	Ἡμᾶς τοὺς σὲ ὑμνοῦντας, Μάκαρ ἐποπτεύεις, ἐκ πειρασμῶν καὶ κινδύνων λυτρούμενος, καὶ τῶν αἱρέσεων θραύων τὰ μηχανήματα.
ltx/gr_gr_cog/me.m03.d08:meMA.Ode9C13.incipit	Σωφρόνως καὶ δικαίως, ὡς Ἱεροφάντωρ…
ltx/gr_gr_cog/me.m03.d08:meMA.Ode9C13.melody	@ltx/gr_gr_cog/he.h.m8:heHE.KyriosTheotokon.name
ltx/gr_gr_cog/me.m03.d08:meMA.Ode9C13.mode	@ltx/gr_gr_cog/miscellanea:misc.Mode8
ltx/gr_gr_cog/me.m03.d08:meMA.Ode9C13.ode	@ltx/gr_gr_cog/miscellanea:misc.Ode9
ltx/gr_gr_cog/me.m03.d08:meMA.Ode9C13.text	Σωφρόνως καὶ δικαίως, ὡς Ἱεροφάντωρ, πολιτευσάμενος Μάρτυς ἐγένου λαμπρός, τὴν σὴν πορφύραν ὑφάνας ἐκ τῶν αἱμάτων σου.
ltx/gr_gr_cog/me.m03.d08:meMA.Ode9C1H.greekmelody	@ltx/gr_gr_cog/he.h.m8:heHE.KyriosTheotokon.greekname
ltx/gr_gr_cog/me.m03.d08:meMA.Ode9C1H.incipit	@ltx/gr_gr_cog/he.h.m8:heHE.KyriosTheotokon.incipit
ltx/gr_gr_cog/me.m03.d08:meMA.Ode9C1H.melody	@ltx/gr_gr_cog/he.h.m8:heHE.KyriosTheotokon.melody
ltx/gr_gr_cog/me.m03.d08:meMA.Ode9C1H.mode	@ltx/gr_gr_cog/miscellanea:misc.Mode8
ltx/gr_gr_cog/me.m03.d08:meMA.Ode9C1H.ode	@ltx/gr_gr_cog/miscellanea:misc.Ode9
ltx/gr_gr_cog/me.m03.d08:meMA.Ode9C1H.text	@ltx/gr_gr_cog/he.h.m8:heHE.KyriosTheotokon.text
ltx/gr_gr_cog/me.m03.d08:meMA.Ode9C1T.incipit	Ὡς ὄρθρος τοῖς ἐν σκότει…
ltx/gr_gr_cog/me.m03.d08:meMA.Ode9C1T.melody	@ltx/gr_gr_cog/he.h.m8:heHE.KyriosTheotokon.name
ltx/gr_gr_cog/me.m03.d08:meMA.Ode9C1T.mode	@ltx/gr_gr_cog/miscellanea:misc.Mode8
ltx/gr_gr_cog/me.m03.d08:meMA.Ode9C1T.ode	@ltx/gr_gr_cog/miscellanea:misc.Ode9
ltx/gr_gr_cog/me.m03.d08:meMA.Ode9C1T.text	Ὡς ὄρθρος τοῖς ἐν σκότει, καὶ πεπλανημένοις, δικαιοσύνης τὸν Ἥλιον ἔχουσα, ἐν ταῖς ἀγκάλαις Παρθένε Χριστὸν ἀνέτειλας.
ltx/gr_gr_cog/me.m03.d08:meR001	Τῇ αὐτῇ ἡμέρᾳ προψάλλεται ἡ ἀκολουθία τῶν Ἁγίων Τεσσαράκοντα Μαρτύρων (9 Μαρτίου), λόγῳ συμπτώσεως τῆς μνήμης αὐτῶν μετὰ τοῦ Σαββάτου τῶν Ψυχῶν.
ltx/gr_gr_cog/me.m03.d08:meVE.Apolytikion1ger.greekmelody	@ltx/gr_gr_cog/he.a.m3:heAU.TheiasPisteos.greekname
ltx/gr_gr_cog/me.m03.d08:meVE.Apolytikion1ger.incipit	Φύλαξ ἄγρυπνος, τῆς Ἐκκλησίας, καὶ…
ltx/gr_gr_cog/me.m03.d08:meVE.Apolytikion1ger.melody	@ltx/gr_gr_cog/he.a.m3:heAU.TheiasPisteos.name
ltx/gr_gr_cog/me.m03.d08:meVE.Apolytikion1ger.mode	@ltx/gr_gr_cog/miscellanea:misc.Mode3
ltx/gr_gr_cog/me.m03.d08:meVE.Apolytikion1ger.poet	@ltx/gr_gr_cog/poets:po.Gerasimou
ltx/gr_gr_cog/me.m03.d08:meVE.Apolytikion1ger.text	Φύλαξ ἄγρυπνος, τῆς Ἐκκλησίας, καὶ καθαίρεσις, τῆς δυσσεβείας, Ἱεράρχα Θεοφύλακτε πέφηνας· τοῦ γὰρ Χριστοῦ τὴν Εἰκόνα σεβόμενος, ὑπερορίας καὶ θλίψεις ὑπέμεινας· Πάτερ Ὅσιε, Χριστὸν τὸν Θεὸν ἱκέτευε, δωρήσασθαι ἡμῖν τὸ μέγα ἔλεος.
ltx/gr_gr_cog/me.m03.d08:meVE.SticStavrotheotokion.greekmelody	@ltx/gr_gr_cog/he.a.m1:heAU.PaneffimoiMartyres.greekname
ltx/gr_gr_cog/me.m03.d08:meVE.SticStavrotheotokion.incipit	@ltx/gr_gr_cog/oc.m1.d4:ocVE.AposTheotokion.incipit
ltx/gr_gr_cog/me.m03.d08:meVE.SticStavrotheotokion.melody	@ltx/gr_gr_cog/he.a.m1:heAU.PaneffimoiMartyres.name
ltx/gr_gr_cog/me.m03.d08:meVE.SticStavrotheotokion.mode	@ltx/gr_gr_cog/miscellanea:misc.Mode1
ltx/gr_gr_cog/me.m03.d08:meVE.SticStavrotheotokion.text	@ltx/gr_gr_cog/oc.m1.d4:ocVE.AposTheotokion.text
ltx/gr_gr_cog/me.m03.d08:meVE.SticTheotokion.greekmelody	@ltx/gr_gr_cog/he.a.m1:heAU.PaneffimoiMartyres.greekname
ltx/gr_gr_cog/me.m03.d08:meVE.SticTheotokion.incipit	@ltx/gr_gr_cog/me.m01.d29:meMA.AposTheotokion.incipit
ltx/gr_gr_cog/me.m03.d08:meVE.SticTheotokion.melody	@ltx/gr_gr_cog/he.a.m1:heAU.PaneffimoiMartyres.name
ltx/gr_gr_cog/me.m03.d08:meVE.SticTheotokion.mode	@ltx/gr_gr_cog/miscellanea:misc.Mode1
ltx/gr_gr_cog/me.m03.d08:meVE.SticTheotokion.text	@ltx/gr_gr_cog/me.m01.d29:meMA.AposTheotokion.text
ltx/gr_gr_cog/me.m03.d08:meVE.Stichera01.greekmelody	@ltx/gr_gr_cog/he.a.m1:heAU.PaneffimoiMartyres.greekname
ltx/gr_gr_cog/me.m03.d08:meVE.Stichera01.incipit	Πάτερ Θεοφύλακτε Θεοῦ, φυλακαῖς φρουρούμενος…
ltx/gr_gr_cog/me.m03.d08:meVE.Stichera01.melody	@ltx/gr_gr_cog/he.a.m1:heAU.PaneffimoiMartyres.name
ltx/gr_gr_cog/me.m03.d08:meVE.Stichera01.mode	@ltx/gr_gr_cog/miscellanea:misc.Mode1
ltx/gr_gr_cog/me.m03.d08:meVE.Stichera01.text	Πάτερ Θεοφύλακτε Θεοῦ, φυλακαῖς φρουρούμενος, διεφυλάχθης ἀλώβητος, καὶ πύργος ἄσειστος, Ἐκκλησίας ὤφθης, πειρασμοῖς ἀκλόνητος, τοῖς τῶν αἱρετικῶν μηχανήμασι, καὶ νῦν ἱκέτευε, δωρηθῆναι ταῖς ψυχαῖς ἡμῶν, τὴν εἰρήνην καὶ τὸ μέγα ἔλεος.
ltx/gr_gr_cog/me.m03.d08:meVE.Stichera02.incipit	Πάτερ Θεοφύλακτε τῆς γῆς, μεταστὰς…
ltx/gr_gr_cog/me.m03.d08:meVE.Stichera02.melody	@ltx/gr_gr_cog/he.a.m1:heAU.PaneffimoiMartyres.name
ltx/gr_gr_cog/me.m03.d08:meVE.Stichera02.mode	@ltx/gr_gr_cog/miscellanea:misc.Mode1
ltx/gr_gr_cog/me.m03.d08:meVE.Stichera02.text	Πάτερ Θεοφύλακτε τῆς γῆς, μεταστὰς ἀνέδραμες, πρὸς οὐρανὸν καὶ οὐράνια, οἰκεῖν σκηνώματα, ἠξιώθης μάκαρ, ἐξορίας ἕνεκεν, ἣν διὰ τὸν Χριστὸν ἐκαρτέρησας, καὶ νῦν ἱκέτευε, δωρηθῆναι ταῖς ψυχαῖς ἡμῶν, τὴν εἰρήνην καὶ τὸ μέγα ἔλεος.
ltx/gr_gr_cog/me.m03.d08:meVE.Stichera03.incipit	Πάτερ Θεοφύλακτε Θεόν, νῦν ὁρῶν…
ltx/gr_gr_cog/me.m03.d08:meVE.Stichera03.melody	@ltx/gr_gr_cog/he.a.m1:heAU.PaneffimoiMartyres.name
ltx/gr_gr_cog/me.m03.d08:meVE.Stichera03.mode	@ltx/gr_gr_cog/miscellanea:misc.Mode1
ltx/gr_gr_cog/me.m03.d08:meVE.Stichera03.text	Πάτερ Θεοφύλακτε Θεόν, νῦν ὁρῶν μακάριε, ὡς ἐφικτὸν καὶ ὁρώμενος, ἑνώσει κρείττονι, ἀπολαύων τούτου, καὶ θετῶς θεούμενος, τὸ μόνον ὀρεκτὸν καὶ μακάριον, χαίρων ἀπέλαβες, Ἱεράρχα παμμακάριστε, τοῖς Ἀγγέλοις νῦν συναυλιζόμενος.
