ltx/gr_gr_cog/le.go.lu.d102:leluLI.Gospel.book_abbr	@ltx/gr_gr_cog/bible:Mark.abbr
ltx/gr_gr_cog/le.go.lu.d102:leluLI.Gospel.book_string	@ltx/gr_gr_cog/bible:Mark.text
ltx/gr_gr_cog/le.go.lu.d102:leluLI.Gospel.chapverse	11:27 – 33
ltx/gr_gr_cog/le.go.lu.d102:leluLI.Gospel.incipit	Ἦλθεν ὁ Ἰησοῦς πάλιν εἰς Ἱεροσόλυμα…
ltx/gr_gr_cog/le.go.lu.d102:leluLI.Gospel.text	Τῷ καιρῷ ἐκείνῳ, ἦλθεν ὁ Ἰησοῦς πάλιν εἰς Ἱεροσόλυμα· καὶ ἐν τῶ ἱερῷ περιπατοῦντος αὐτοῦ ἔρχονται πρὸς αὐτὸν οἱ ἀρχιερεῖς καὶ οἱ γραμματεῖς καὶ οἱ πρεσβύτεροι καὶ λέγουσιν αὐτῷ· ἐν ποίᾳ ἐξουσίᾳ ταῦτα ποιεῖς; ἢ τίς σοι ἔδωκε τὴν ἐξουσίαν ταύτην ἵνα ταῦτα ποιῇς; ὁ δὲ Ἰησοῦς ἀποκριθεὶς εἶπεν αὐτοῖς· ἐπερωτήσω ὑμᾶς κἀγὼ ἕνα λόγον, καὶ ἀποκρίθητέ μοι, καὶ ἐρῶ ὑμῖν ἐν ποίᾳ ἐξουσίᾳ ταῦτα ποιῶ. τὸ βάπτισμα Ἰωάννου ἐξ οὐρανοῦ ἦν ἢ ἐξ ἀνθρώπων; ἀποκρίθητέ μοι. καὶ ἐλογίζοντο πρὸς ἑαυτοὺς λέγοντες· ἐὰν εἴπωμεν, ἐξ οὐρανοῦ, ἐρεῖ· διατί οὖν οὐκ ἐπιστεύσατε αὐτῷ; ἀλλὰ εἴπωμεν, ἐξ ἀνθρώπων; — ἐφοβοῦντο τὸν λαόν· ἅπαντες γὰρ εἶχον τὸν Ἰωάννην ὅτι προφήτης ἦν. καὶ ἀποκριθέντες λέγουσι τῷ Ἰησοῦ· οὐκ οἴδαμεν. καὶ ὁ Ἰησοῦς ἀποκριθεὶς λέγει αὐτοῖς· οὐδὲ ἐγὼ λέγω ὑμῖν ἐν ποίᾳ ἐξουσίᾳ ταῦτα ποιῶ.
ltx/gr_gr_cog/le.go.lu.d102:leluLI.Gospel.title	Τῇ Πέμπτῃ τῆς ΙΕʹ Ἑβδομάδος τοῦ Λουκᾶ
ltx/gr_gr_cog/le.go.lu.d102:leluLI.Gospel.title_abbr	Τῇ Πέμπτῃ τῆς ΙΕʹ Ἑβδομάδος τοῦ Λουκᾶ
ltx/gr_gr_cog/le.go.lu.d102:leluLI.Gospel.version	@ltx/gr_gr_cog/properties:version.designation
