ltx/gr_gr_cog/sy.m09.d11:cl.syMA.commemoration01.text	[saint/com 1]
ltx/gr_gr_cog/sy.m09.d11:cl.syMA.commemoration02.text	[saint/com 2]
ltx/gr_gr_cog/sy.m09.d11:cl.syMA.commemoration03.text	[saint/com 3]
ltx/gr_gr_cog/sy.m09.d11:cl.syMA.commemoration04.text	[saint/com 4]
ltx/gr_gr_cog/sy.m09.d11:cl.syMA.commemoration05.text	[saint/com 5]
ltx/gr_gr_cog/sy.m09.d11:cl.syMA.commemoration06.text	[saint/com list]
ltx/gr_gr_cog/sy.m09.d11:syMA.commemoration01.couplet1.title	@ltx/gr_gr_cog/titles:ti.Verses
ltx/gr_gr_cog/sy.m09.d11:syMA.commemoration01.couplet1.verse1	Καὶ σχῆμα καὶ νοῦν ἀῤῥενοῖ Θεοδώρα,
ltx/gr_gr_cog/sy.m09.d11:syMA.commemoration01.couplet1.verse2	Καὶ τὸν μέγαν νοῦν αἰσχύνει πρὸ τοῦ τέλους.
ltx/gr_gr_cog/sy.m09.d11:syMA.commemoration01.poem.verse01	Τῇ θείᾳ βίβλῳ Διαθήκης τῆς Νέας*,
ltx/gr_gr_cog/sy.m09.d11:syMA.commemoration01.poem.verse02	Ὡς ἐξισοῦσθαι, φησί, παρθένοις δέκα,
ltx/gr_gr_cog/sy.m09.d11:syMA.commemoration01.poem.verse03	Τὴν βασιλείαν οὐρανῶν Χριστοῦ στόμα,
ltx/gr_gr_cog/sy.m09.d11:syMA.commemoration01.poem.verse04	Ἐν ἀνδρικῷ σχήματι γυναῖκες δέκα,
ltx/gr_gr_cog/sy.m09.d11:syMA.commemoration01.poem.verse05	Ἀπήμβλυναν τὰ κέντρα τοῦ βροτοκτόνου.
ltx/gr_gr_cog/sy.m09.d11:syMA.commemoration01.poem.verse06	Δῶρον Θεοῦ λαχοῦσα τὴν κλῆσιν μία,
ltx/gr_gr_cog/sy.m09.d11:syMA.commemoration01.poem.verse07	Ὥρμητο δʼ αὕτη χώρας Ἀλεξανδρέων·
ltx/gr_gr_cog/sy.m09.d11:syMA.commemoration01.poem.verse08	Ἡ δὴ νομίμῳ συμπλακεῖσα συζύγῳ,
ltx/gr_gr_cog/sy.m09.d11:syMA.commemoration01.poem.verse09	Εὔτακτον ἦγεν ἀκατάγνωστον βίον.
ltx/gr_gr_cog/sy.m09.d11:syMA.commemoration01.poem.verse10	Φθόνῳ δὲ πάντως δαίμονος κακοσχόλου,
ltx/gr_gr_cog/sy.m09.d11:syMA.commemoration01.poem.verse11	Ἐγκλήματι μοιχείας ἁλοῦσα τότε,
ltx/gr_gr_cog/sy.m09.d11:syMA.commemoration01.poem.verse12	Καὶ γνοῦσα καὶ ζητοῦσα τὴν σωτηρίαν,
ltx/gr_gr_cog/sy.m09.d11:syMA.commemoration01.poem.verse13	Εὐαγγελικῶν ῥημάτων τοῦ Κυρίου,
ltx/gr_gr_cog/sy.m09.d11:syMA.commemoration01.poem.verse14	Ἤκουσεν οὕτως· Ὡς λέληθεν οὐδόλως
ltx/gr_gr_cog/sy.m09.d11:syMA.commemoration01.poem.verse15	Ὅπερ κρυφίως, ὡς λαθοῦσα, σὺ φέρεις.
ltx/gr_gr_cog/sy.m09.d11:syMA.commemoration01.poem.verse16	Καὶ λοιπὸν ὡς ἔγνωκε τὴν ἁμαρτίαν,
ltx/gr_gr_cog/sy.m09.d11:syMA.commemoration01.poem.verse17	Ὡς μύσος ἀκάθαρτον, ὡς βδέλυγμά τι,
ltx/gr_gr_cog/sy.m09.d11:syMA.commemoration01.poem.verse18	Στολὴν ἀποῤῥίψασα τὴν ἐξ αἰσχύνης,
ltx/gr_gr_cog/sy.m09.d11:syMA.commemoration01.poem.verse19	Ὡς Θεόδωρος ἀγγελικὴν λαμβάνει.
ltx/gr_gr_cog/sy.m09.d11:syMA.commemoration01.poem.verse20	Καὶ μὴν προσῆλθε τῷ χορῷ τῶν ἀζύγων.
ltx/gr_gr_cog/sy.m09.d11:syMA.commemoration01.poem.verse21	Κλαίουσα καὶ πενθοῦσα τὴν ἁμαρτίαν.
ltx/gr_gr_cog/sy.m09.d11:syMA.commemoration01.poem.verse22	Ἐπὶ χρόνοις δέ τισι δουλειῶν βάρει
ltx/gr_gr_cog/sy.m09.d11:syMA.commemoration01.poem.verse23	Κάμνουσα, πυκτεύουσα τοῖς ἀγωγίμοις,
ltx/gr_gr_cog/sy.m09.d11:syMA.commemoration01.poem.verse24	Ἤκουσε πόρνος· δεῖγμα τούτου καὶ βρέφος,
ltx/gr_gr_cog/sy.m09.d11:syMA.commemoration01.poem.verse25	Προσριφθὲν αὐτῇ τῆς μονῆς ἔξω, φθόνῳ,
ltx/gr_gr_cog/sy.m09.d11:syMA.commemoration01.poem.verse26	Ψυχοφθόρου δράκοντος· ἄλλου γὰρ τίνος;
ltx/gr_gr_cog/sy.m09.d11:syMA.commemoration01.poem.verse27	Ὃ καὶ λαβοῦσα, καὶ τρέφουσα γνησίως,
ltx/gr_gr_cog/sy.m09.d11:syMA.commemoration01.poem.verse28	Ἔσπευδε λαβεῖν, ὡς γυνὴ κατὰ φύσιν.
ltx/gr_gr_cog/sy.m09.d11:syMA.commemoration01.poem.verse29	Κρύει δὲ καὶ καύσωνι καὶ χαμευνίᾳ
ltx/gr_gr_cog/sy.m09.d11:syMA.commemoration01.poem.verse30	Προσκαρτεροῦσα τῷ πυλῶνι, καὶ χρόνοις
ltx/gr_gr_cog/sy.m09.d11:syMA.commemoration01.poem.verse31	Ἑπτὰ κατατακεῖσα συκοφαντίαις,
ltx/gr_gr_cog/sy.m09.d11:syMA.commemoration01.poem.verse32	Εἰσῆλθεν ὀψὲ τῆς μονῆς ἐντὸς βίᾳ,
ltx/gr_gr_cog/sy.m09.d11:syMA.commemoration01.poem.verse33	Οὐχ ὡς γυνή, σχήματι διʼ ἀνδρικῷ πάλιν.
ltx/gr_gr_cog/sy.m09.d11:syMA.commemoration01.poem.verse34	Αὐτίκα πυκναῖς ταῖς προσευχαῖς καὶ κόποις,
ltx/gr_gr_cog/sy.m09.d11:syMA.commemoration01.poem.verse35	Τήξασα σῶμα, καὶ στάσει τῇ παννύχῳ,
ltx/gr_gr_cog/sy.m09.d11:syMA.commemoration01.poem.verse36	Καὶ νοῦν λαβοῦσα τῆς ἄνω κληρουχίας,
ltx/gr_gr_cog/sy.m09.d11:syMA.commemoration01.poem.verse37	Κατὰ σκοπὸν πέφθακεν, ὥς περ ἠγάπα.
ltx/gr_gr_cog/sy.m09.d11:syMA.commemoration01.poem.verse38	Φρικτὸν τὸ θαῦμα! τίς ἄρα μὴ θαυμάσει;
ltx/gr_gr_cog/sy.m09.d11:syMA.commemoration01.poem.verse39	Γυνὴ λαθοῦσα πλῆθος ἀνδρῶν ἀζύγων,
ltx/gr_gr_cog/sy.m09.d11:syMA.commemoration01.poem.verse40	Εἷς ὥς περ αὐτῶν ἐν μέσῳ τοῦ σταδίου,
ltx/gr_gr_cog/sy.m09.d11:syMA.commemoration01.poem.verse41	Ἀσκητικῶς λάμψασα, φωστὴρ ὡς μέγας.
ltx/gr_gr_cog/sy.m09.d11:syMA.commemoration01.poem.verse42	Ἐπάξια φέρουσα τῶν πάντων γέρα,
ltx/gr_gr_cog/sy.m09.d11:syMA.commemoration01.poem.verse43	Ἀπῆλθε χαρᾷ πρὸς ποθεινὸν Νυμφίον.
ltx/gr_gr_cog/sy.m09.d11:syMA.commemoration01.poem.verse44	Οἱ γοῦν μονασταὶ θαῦμα τοῦτο τὸ ξένον,
ltx/gr_gr_cog/sy.m09.d11:syMA.commemoration01.poem.verse45	Ἰδόντες ἐξέστησαν· ὢ φρικτῆς θέας!
ltx/gr_gr_cog/sy.m09.d11:syMA.commemoration01.single1	Ἑνδεκάτῃ πύματον Θεοδώρη ὕπνον ἰαύει.
ltx/gr_gr_cog/sy.m09.d11:syMA.commemoration01.text	Τῇ ΙΑʹ τοῦ αὐτοῦ μηνός μνήμη τῆς Ὁσίας Μητρὸς ἡμῶν Θεοδώρας τῆς ἐν Ἀλεξανδρείᾳ.
ltx/gr_gr_cog/sy.m09.d11:syMA.commemoration02.narration.p01	Οὗτος, ἐξ ἀγροίκων ἀποτεχθεὶς καὶ ἰδιώτης ὤν, μοναστῶν διάκονος ἐχρημάτισε, παρορώμενος πολλὰ καὶ μυκτηριζόμενος, καὶ τῷ μαγειρείῳ προστετηκώς. Ἐν ᾧ δὲ ἦν οὗτος φροντιστηρίῳ, Ἱερεὺς τῶν εὐαρεστούντων ἐξελιπάρει τὸν Κύριον ὑποδειχθῆναι αὐτῷ αἰσθητῶς τὰ τοῖς ἀγαπῶσιν αὐτὸν ἀποκείμενα ἀγαθά· καὶ μιᾷ τῶν νυκτῶν ἐδόκει ἐν Παραδείσῳ ἑστάναι, καὶ θάμβει κατενόει τὰ ὁρώμενα. Εἶδε δὲ πρὸς τούτοις καὶ τὸν τῆς μονῆς μάγειρον, τὸν Εὐφρόσυνον, μέσον ἑστῶτα καὶ ἐν ἀπολαύσει ὄντα τῶν ἐν Παραδείσῳ ἐκείνων ἀγαθῶν, ᾧ καὶ προσεγγίσας ἠρώτα μαθεῖν· Τίς ἆρα ὁ Παράδεισος οὗτος; πῶς ἐνταῦθα εὑρέθη; Καὶ ὅς· Οὗτός ἐστι τὸ καταγώγιον τῶν τοῦ Θεοῦ ἐκλεκτῶν, κἀγώ, διὰ τὴν πολλὴν τούτου ἀγαθότητα, ἐνθάδε συνεχωρήθην αὐλίζεσθαι, ἔφη.
ltx/gr_gr_cog/sy.m09.d11:syMA.commemoration02.narration.p02	Καὶ ὁ Ἱερεύς· Τί δὲ ἐργάζῃ ἐν τούτῳ τῷ Παραδείσῳ; Τὴν ἐξουσίαν ἔχων πάντων τῶν φαινομένων σοι, ἐνηδύνομαι τῇ τούτων αἰσθήσει, φησὶν ὁ Εὐφρόσυνος. Καὶ ὁ Ἱερεύς· Δύνασαί μοι δοῦναί τι; Καὶ ὁ Εὐφρόσυνος· Εἰ βούλει, λήψῃ τῇ τοῦ Θεοῦ μου ἀγαθότητι. Τότε ὁ Ἱερεύς, δείξας τῇ χειρὶ μῆλα, ἐπεζήτει ἐξ αὐτῶν· καὶ λαβὼν ὁ Εὐφρόσυνος, δέδωκε τῷ Ἱερεῖ πρὸς τὸ παλλίον, εἰρηκώς· Ὥσπερ ἐζήτησας, λαβὼν κατατρύφησον. Καὶ παρευθύς, ὡς τὸ ξύλον ἔκρουσε τῆς Ἑωθινῆς ὑμνῳδίας, διυπνισθεὶς ὁ Ἱερεύς, ὡς ὄναρ τὸ φανὲν ὑπετόπαζε· πρὸς τὸ παλλίον δὲ ὑφαπλώσας καὶ τὰ μῆλα κατασχών, τῇ ἡδύτητι τῆς ὀσφρήσεως καταπλαγείς, ἀκίνητος ἔμεινεν.
ltx/gr_gr_cog/sy.m09.d11:syMA.commemoration02.narration.p03	Εὑρὼν δὲ τὸν Εὐφρόσυνον ἐν τῇ συνάξει, ὅρκοις αὐτὸν προκατελάμβανεν εἰπεῖν, τὴν νύκτα ταύτην ὅπου ἆρα καὶ ἦν. Ὁ δέ, Συγχώρησον, ἔφη, Πάτερ· ἐκεῖσε ἤμην, ὅπου καὶ νῦν με εὗρες. Καὶ ὁ Ἱερεύς· Διὰ τοῦτό σε ὅρκοις προκατέλαβον, εἰς δήλωσιν τῶν τοῦ Θεοῦ μεγαλείων, καὶ οὐ βούλει εἰπεῖν τὸ ἀληθές; Τότε ὁ ταπεινόφρων Εὐφρόσυνος· Ἐν αὐτῷ με τοῦ Θεοῦ τῷ Παραδείσῳ, φησί, κατέλαβες, ἐν ᾧ ἰδεῖν ἐπεζήτεις τὰ τοῖς ἐκλεκτοῖς ἀποκείμενα· καὶ τὴν σὴν ἁγιότητα πληροφορῆσαι θέλων ὁ Κύριος, διʼ ἐμοῦ τοῦ εὐτελοῦς ἐνήργησε τὸ παράδοξον. Καὶ ὁ Ἱερεύς· Καὶ τί μοι, Πάτερ, ἐν τῷ Παραδείσῳ αἰτήσαντι δέδωκας; Καὶ ὁ Εὐφρόσυνος· Τὰ εὐανθῆ μῆλα, ἃ προσφάτως ἐν τῇ κλίνῃ σου τέθεικας· ὅμως, Πάτερ, συγχώρησον, ὅτι σκώληξ ἐγὼ καὶ οὐκ ἄνθρωπος.
ltx/gr_gr_cog/sy.m09.d11:syMA.commemoration02.narration.p04	Τότε ὁ Ἱερεύς, τὴν ὀπτασίαν τοῖς ἀδελφοῖς διηγησάμενος, πάντας εἰς ἀγωνίαν ἐνέβαλεν, οὐ τοσοῦτον τῷ διηγήματι, ὅσῳ τῇ τῶν τερπνῶν ἐκείνων μήλων θέᾳ καὶ εὐωδίᾳ, ὡς καὶ μᾶλλον ἐπεκτείνεσθαι πρὸς τὸ βέλτιον.
ltx/gr_gr_cog/sy.m09.d11:syMA.commemoration02.narration.p05	Ὁ δὲ μέγας Εὐφρόσυνος, ὡς ἐκ ψιλοῦ τὰ λαληθέντα, ἀνέμαθε, λάθρᾳ ὑπεξελθών, ἐμάκρυνε φυγαδεύων, ἄγνωστος τὸ παράπαν μέχρι τοῖς δεῦρο γενόμενος. Ἐκ δὲ τῆς τῶν μήλων μεταλήψεως πολλοὶ τῶν νοσούντων ἐῤῥώσθησαν εἰς δόξαν Θεοῦ.
ltx/gr_gr_cog/sy.m09.d11:syMA.commemoration02.text	Τῇ αὐτῇ ἡμέρᾳ μνήμη τοῦ Ὁσίου Πατρὸς ἡμῶν Εὐφροσυνου τοῦ μαγείρου.
ltx/gr_gr_cog/sy.m09.d11:syMA.commemoration03.couplet1.title	@ltx/gr_gr_cog/titles:ti.Verses
ltx/gr_gr_cog/sy.m09.d11:syMA.commemoration03.couplet1.verse1	Διόδωρος μάστιξι σὺν τοῖς συνάθλοις.
ltx/gr_gr_cog/sy.m09.d11:syMA.commemoration03.couplet1.verse2	Τὴν σάρκα δόντες, μαστιγοῦσι τὴν πλάνην.
ltx/gr_gr_cog/sy.m09.d11:syMA.commemoration03.narration.p01	Οὗτοι ὑπῆρχον ἐκ Λαοδικείας τῆς Συρίας· καὶ παρὰ τοῦ κατὰ τὸν τόπον ἄρχοντος συλληφθέντες καὶ παῤῥησιασάμενοι καὶ ἀφειδῶς μαστιχθέντες, τοῦ βίου τὸ πέρας ἐδέξαντο.
ltx/gr_gr_cog/sy.m09.d11:syMA.commemoration03.text	Τῇ αὐτῇ ἡμέρᾳ μνήμη τῶν ἁγίων Μαρτύρων Διοδώρου, Διομήδους καὶ Διδύμου.
ltx/gr_gr_cog/sy.m09.d11:syMA.commemoration04.couplet1.title	@ltx/gr_gr_cog/titles:ti.Verses
ltx/gr_gr_cog/sy.m09.d11:syMA.commemoration04.couplet1.verse1	Ὀσμὴν μύρων ἔπνευσεν ἡ Μάρτυς Ἴα,
ltx/gr_gr_cog/sy.m09.d11:syMA.commemoration04.couplet1.verse2	Ἐρυθροβαφῶν αἱμάτων ἀτμοπνόων.
ltx/gr_gr_cog/sy.m09.d11:syMA.commemoration04.narration.p01	Αὕτη συνελήφθη αἰχμάλωτος μετὰ ἐννέα χιλιάδων χριστιανῶν· παρὰ δὲ τοῦ ἀρχιμάγου τοῦ βασιλέως Περσῶν διαφόροις βασάνοις ἐξετασθεῖσα, τὴν κεφαλὴν ἀπετμήθη. Λέγεται δέ, μετὰ τὴν αὐτῆς ἐκτομήν, τὴν γῆν, δεξαμένην τὸ αἷμα τῆς Μάρτυρος, εἰς ὄγκον ἀρθῆναι τινὰ καὶ τοὺς παρόντας δημίους παρεθῆναι καὶ τὸν ἥλιον ἀμαυρῶσαι τὸ φῶς καὶ εὐωδίας τὸν κόσμον πληρωθῆναι.
ltx/gr_gr_cog/sy.m09.d11:syMA.commemoration04.text	Τῇ αὐτῇ ἡμέρᾳ μνήμη τῆς ἁγίας Μάρτυρος Ἴας, πρεσβύτιδος τὴν ἡλικίαν.
ltx/gr_gr_cog/sy.m09.d11:syMA.lastline	Ταῖς τῶν Ἁγίων σου πρεσβείαις, Χριστὲ ὁ Θεός, ἐλέησον ἡμᾶς. Ἀμήν.
ltx/gr_gr_cog/sy.m09.d11:syMA.note1	Τὸ Συναξάριον τοῦτο, ὡς καὶ ἄλλα τοιούτων γυναικῶν, συνεγράφη διὰ στίχων Ἰάμβων· πολλοὶ ὅμως ἐξ αὐτῶν εἰσιν ἄμετροι, τὸ δωδεκασύλλαβον σῴζοντες μόνον.
