ltx/gr_gr_cog/le.ep.mc.d085:lemcLI.Epistle.book_abbr	@ltx/gr_gr_cog/bible:Acts.abbr
ltx/gr_gr_cog/le.ep.mc.d085:lemcLI.Epistle.book_string	@ltx/gr_gr_cog/bible:Acts.text
ltx/gr_gr_cog/le.ep.mc.d085:lemcLI.Epistle.chapverse	6:1 – 7
ltx/gr_gr_cog/le.ep.mc.d085:lemcLI.Epistle.incipit	Ἐν ταῖς ἡμέραις ἐκείναις, πληθυνόντων…
ltx/gr_gr_cog/le.ep.mc.d085:lemcLI.Epistle.text	Ἐν ταῖς ἡμέραις ἐκείναις, πληθυνόντων τῶν μαθητῶν ἐγένετο γογγυσμὸς τῶν Ἑλληνιστῶν πρὸς τοὺς Ἑβραίους, ὅτι παρεθεωροῦντο ἐν τῇ διακονίᾳ τῇ καθημερινῇ αἱ χῆραι αὐτῶν. προσκαλεσάμενοι δὲ οἱ δώδεκα τὸ πλῆθος τῶν μαθητῶν εἶπον· οὐκ ἀρεστόν ἐστιν ἡμᾶς καταλείψαντας τὸν λόγον τοῦ Θεοῦ διακονεῖν τραπέζαις. ἐπισκέψασθε οὖν, ἀδελφοί, ἄνδρας ἐξ ὑμῶν μαρτυρουμένους ἑπτά, πλήρεις Πνεύματος Ἁγίου καὶ σοφίας, οὓς καταστήσομεν ἐπὶ τῆς χρείας ταύτης· ἡμεῖς δὲ τῇ προσευχῇ καὶ τῇ διακονίᾳ τοῦ λόγου προσκαρτερήσομεν. καὶ ἤρεσεν ὁ λόγος ἐνώπιον παντὸς τοῦ πλήθους· καὶ ἐξελέξαντο Στέφανον, ἄνδρα πλήρη πίστεως καὶ Πνεύματος Ἁγίου, καὶ Φίλιππον καὶ Πρόχορον καὶ Νικάνορα καὶ Τίμωνα καὶ Παρμενᾶν καὶ Νικόλαον προσήλυτον Ἀντιοχέα, οὓς ἔστησαν ἐνώπιον τῶν ἀποστόλων, καὶ προσευξάμενοι ἐπέθηκαν αὐτοῖς τὰς χεῖρας. καὶ ὁ λόγος τοῦ Θεοῦ ηὔξανε, καὶ ἐπληθύνετο ὁ ἀριθμὸς τῶν μαθητῶν ἐν Ἱερουσαλὴμ σφόδρα, πολύς τε ὄχλος τῶν Ἰουδαίων ὑπήκουον τῇ πίστει.
ltx/gr_gr_cog/le.ep.mc.d085:lemcLI.Epistle.title	Κυριακῇ Τρίτῃ, τῶν Μυροφόρων
ltx/gr_gr_cog/le.ep.mc.d085:lemcLI.Epistle.title_abbr	Κυριακῇ τῶν Μυροφόρων
ltx/gr_gr_cog/le.ep.mc.d085:lemcLI.Epistle.version	@ltx/gr_gr_cog/properties:version.designation
