ltx/gr_gr_cog/me.m01.d09:meDA.commemoration.first	Μνήμη τοῦ Ἁγίου Μάρτυρος Πολυεύκτου
ltx/gr_gr_cog/me.m01.d09:meDA.commemoration.first_name	
ltx/gr_gr_cog/me.m01.d09:meDA.commemoration.first_short	Μνήμη τοῦ Ἁγίου Μάρτυρος Πολυεύκτου
ltx/gr_gr_cog/me.m01.d09:meDA.commemoration.first_title	@ltx/gr_gr_cog/titles:ti.Feast
ltx/gr_gr_cog/me.m01.d09:meDA.commemoration.full	Μνήμη τοῦ Ἁγίου Μάρτυρος Πολυεύκτου
ltx/gr_gr_cog/me.m01.d09:meDA.commemoration.second_name	
ltx/gr_gr_cog/me.m01.d09:meDA.commemoration.second_title	@ltx/gr_gr_cog/titles:ti.SaintM
ltx/gr_gr_cog/me.m01.d09:meDA.date	Τῌ Θʹ ΙΑΝΟΥΑΡΙΟΥ
ltx/gr_gr_cog/me.m01.d09:meDA.dismissal	@ltx/gr_gr_cog/dismissals:dis00.epiphany
ltx/gr_gr_cog/me.m01.d09:meDA.fordate	διὰ τὴν 9ην Ἰανουαρίου
ltx/gr_gr_cog/me.m01.d09:meDA.insert1	καὶ τοῦ Ἁγίου Μάρτυρος Πολυεύκτου,
ltx/gr_gr_cog/me.m01.d09:meDA.insert2	οὗ καὶ τὴν μνήμην ἐπιτελοῦμεν·
ltx/gr_gr_cog/me.m01.d09:meDA.note	
ltx/gr_gr_cog/me.m01.d09:meDA.pdfcoverdate	τῆς 9ης Ἰανουαρίου,
ltx/gr_gr_cog/me.m01.d09:meDA.pdfheaderdate	τῆς 9ης Ἰανουαρίου
ltx/gr_gr_cog/me.m01.d09:meHO.commemorations	
ltx/gr_gr_cog/me.m01.d09:meHO.note1	
ltx/gr_gr_cog/me.m01.d09:meHO.note2	
ltx/gr_gr_cog/me.m01.d09:meHO.number	9.
ltx/gr_gr_cog/me.m01.d09:meHO.rank	
ltx/gr_gr_cog/me.m01.d09:meLE.commemoration1	Τοῦ Ἁγίου Μάρτυρος Πολυεύκτου.
ltx/gr_gr_cog/me.m01.d09:meLE.commemoration2	
ltx/gr_gr_cog/me.m01.d09:meLI.Kontakion1.greekmelody	@ltx/gr_gr_cog/me.m01.d09:meMA.Kontakion1.greekmelody
ltx/gr_gr_cog/me.m01.d09:meLI.Kontakion1.incipit	@ltx/gr_gr_cog/me.m01.d09:meMA.Kontakion1.incipit
ltx/gr_gr_cog/me.m01.d09:meLI.Kontakion1.melody	@ltx/gr_gr_cog/me.m01.d09:meMA.Kontakion1.melody
ltx/gr_gr_cog/me.m01.d09:meLI.Kontakion1.mode	@ltx/gr_gr_cog/me.m01.d09:meMA.Kontakion1.mode
ltx/gr_gr_cog/me.m01.d09:meLI.Kontakion1.text	@ltx/gr_gr_cog/me.m01.d09:meMA.Kontakion1.text
ltx/gr_gr_cog/me.m01.d09:meLI.MM.CommunionHymn.text	@ltx/gr_gr_cog/properties:media.key
ltx/gr_gr_cog/me.m01.d09:meLI.Megalynarion.text	
ltx/gr_gr_cog/me.m01.d09:meMA.AposGlory.incipit	Τρυφὴ ζωτική, ἐκ χειμάῤῥου Ἰορδάνου…
ltx/gr_gr_cog/me.m01.d09:meMA.AposGlory.melody	@ltx/gr_gr_cog/he.a.m6:heAU.AiAngelikai.name
ltx/gr_gr_cog/me.m01.d09:meMA.AposGlory.mode	@ltx/gr_gr_cog/miscellanea:misc.Mode6
ltx/gr_gr_cog/me.m01.d09:meMA.AposGlory.text	Τρυφὴ ζωτική, ἐκ χειμάῤῥου Ἰορδάνου, ἀνέβλυσεν ἡμῖν, τοῦ Βαπτίσματος ἡ χάρις, ἐν ᾧ οἱ φωτισθέντες, τῷ Βαπτίσματι λέγομεν· Δόξα τῷ φανέντι ἐν τῷ κόσμῳ, καὶ ζωὴν ἡμῖν παρεσχηκότι· ᾧ καὶ ψάλλομεν. Εὐλογημένος ὁ φανείς, Θεὸς ἡμῶν δόξα σοι.
ltx/gr_gr_cog/me.m01.d09:meMA.Aposticha1.greekmelody	@ltx/gr_gr_cog/he.a.m6:heAU.AiAngelikai.greekname
ltx/gr_gr_cog/me.m01.d09:meMA.Aposticha1.incipit	Φράσον καὶ εἰπέ, ὦ Προφῆτα…
ltx/gr_gr_cog/me.m01.d09:meMA.Aposticha1.melody	@ltx/gr_gr_cog/he.a.m6:heAU.AiAngelikai.name
ltx/gr_gr_cog/me.m01.d09:meMA.Aposticha1.mode	@ltx/gr_gr_cog/miscellanea:misc.Mode6
ltx/gr_gr_cog/me.m01.d09:meMA.Aposticha1.text	Φράσον καὶ εἰπέ, ὦ Προφῆτα Ἠσαΐα· Τίς ὁ κεκραγώς, ἐν ἐρήμῳ τῇ βοήσει; Ἀντλήσατε δὴ ὕδωρ, εὐφροσύνης καθάρσιον. Οὗτος Ἰωάννης ὁ βαπτίζων, ἐν τῇ ἐρήμῳ καὶ βοήσας· Χριστὸς ἔρχεται· Εὐλογημένος ὁ φανείς, Θεὸς ἡμῶν δόξα σοι.
ltx/gr_gr_cog/me.m01.d09:meMA.Aposticha2.incipit	Ὢ τῆς ὑπὲρ νοῦν, καὶ…
ltx/gr_gr_cog/me.m01.d09:meMA.Aposticha2.melody	@ltx/gr_gr_cog/he.a.m6:heAU.AiAngelikai.name
ltx/gr_gr_cog/me.m01.d09:meMA.Aposticha2.mode	@ltx/gr_gr_cog/miscellanea:misc.Mode6
ltx/gr_gr_cog/me.m01.d09:meMA.Aposticha2.text	Ὢ τῆς ὑπὲρ νοῦν, καὶ ἀφάτου εὐσπλαγχνίας! πῶς ὁ Ποιητής, τῷ ποιήματι προσκλίνει, τὴν ἄχραντον καὶ θείαν, κορυφὴν τῷ βαπτίσματι! Δόξα τῷ φανέντι ἐν τῷ κόσμῳ, καὶ ζωὴν ἡμῖν παρεσχηκότι, ἐν ᾧ ψάλλομεν· Εὐλογημένος ὁ φανείς, Θεὸς ἡμῶν δόξα σοι.
ltx/gr_gr_cog/me.m01.d09:meMA.Aposticha3.incipit	Ὡς ἐπιβλαβῶν, τῶν γηΐνων ἀπαχθέντες…
ltx/gr_gr_cog/me.m01.d09:meMA.Aposticha3.melody	@ltx/gr_gr_cog/he.a.m6:heAU.AiAngelikai.name
ltx/gr_gr_cog/me.m01.d09:meMA.Aposticha3.mode	@ltx/gr_gr_cog/miscellanea:misc.Mode6
ltx/gr_gr_cog/me.m01.d09:meMA.Aposticha3.text	Ὡς ἐπιβλαβῶν, τῶν γηΐνων ἀπαχθέντες, δεῦτε νοητῶς, καθαρθῶμεν τὰς αἰσθήσεις· καὶ τὸν Χριστὸν ἰδόντες ἐν σαρκὶ βαπτιζόμενον, ὑπὸ Ἰωάννου τοῦ Προδρόμου, πάντες σὺν αὐτῷ ὑμνολογοῦντες, πιστῶς κράξωμεν· Εὐλογημένος ὁ φανείς, Θεὸς ἡμῶν δόξα σοι.
ltx/gr_gr_cog/me.m01.d09:meMA.C1.acrostic.notice1	οὗ ἡ Ἀκροστιχίς·
ltx/gr_gr_cog/me.m01.d09:meMA.C1.acrostic.text	Τὴν σὴν δίδου μοι Μάρτυς εὐκταίαν χάριν.
ltx/gr_gr_cog/me.m01.d09:meMA.C1.acrostic.title	Κανὼν τοῦ Ἁγίου,
ltx/gr_gr_cog/me.m01.d09:meMA.C1.poet	@ltx/gr_gr_cog/poets:po.Theofanous
ltx/gr_gr_cog/me.m01.d09:meMA.C1.title	@ltx/gr_gr_cog/titles:ti.CanonSaintM
ltx/gr_gr_cog/me.m01.d09:meMA.C1.verse	@ltx/gr_gr_cog/prayers:pr.verse_SaintM.text
ltx/gr_gr_cog/me.m01.d09:meMA.Exaposteilarion1.greekmelody	@ltx/gr_gr_cog/he.a.m3:heAU.EnPnevmatiToIero.greekname
ltx/gr_gr_cog/me.m01.d09:meMA.Exaposteilarion1.incipit	Πολύευκτον κτησάμενος, ἐκ ψυχῆς πολυεύκτου…
ltx/gr_gr_cog/me.m01.d09:meMA.Exaposteilarion1.melody	@ltx/gr_gr_cog/he.a.m3:heAU.EnPnevmatiToIero.name
ltx/gr_gr_cog/me.m01.d09:meMA.Exaposteilarion1.mode	@ltx/gr_gr_cog/miscellanea:misc.Mode3
ltx/gr_gr_cog/me.m01.d09:meMA.Exaposteilarion1.text	Πολύευκτον κτησάμενος, ἐκ ψυχῆς πολυεύκτου, τὸν πλοῦτον τὸν οὐράνιον, ὦ Πολύευκτε μάκαρ, καὶ δόξαν καὶ λαμπρότητα, ἐν Θεῷ γενόμενος· καὶ στέφος θεῖον ἐδέξω, ἐκ χειρὸς τοῦ Ὑψίστου, σὺν Μαρτύρων τοῖς χοροῖς, ὡς Μάρτυς τῆς ἀληθείας.
ltx/gr_gr_cog/me.m01.d09:meMA.Exaposteilarion2.greekmelody	@ltx/gr_gr_cog/he.a.m3:heAU.EnPnevmatiToIero.greekname
ltx/gr_gr_cog/me.m01.d09:meMA.Exaposteilarion2.incipit	Ἐν δουλικῷ τῷ σχήματι, παραγέγονας…
ltx/gr_gr_cog/me.m01.d09:meMA.Exaposteilarion2.melody	@ltx/gr_gr_cog/he.a.m3:heAU.EnPnevmatiToIero.name
ltx/gr_gr_cog/me.m01.d09:meMA.Exaposteilarion2.mode	@ltx/gr_gr_cog/miscellanea:misc.Mode3
ltx/gr_gr_cog/me.m01.d09:meMA.Exaposteilarion2.text	Ἐν δουλικῷ τῷ σχήματι, παραγέγονας Λόγε, καὶ Βάπτισμα ὁ ἄχρονος, ὡς βροτὸς ἐπεζήτεις· ἐξέστη γῆ καὶ οὐρανός, καὶ Ἀγγέλων τάγματα, καὶ τῶν ὑδάτων ἡ φύσις, ὁ δὲ Πρόδρομος πτήξας, ἐν δειλίᾳ καὶ χαρᾷ, τὴν λειτουργίαν ἐτέλει.
ltx/gr_gr_cog/me.m01.d09:meMA.Kathisma11.greekmelody	@ltx/gr_gr_cog/he.a.m4:heAU.OYpsotheisEnToStavro.greekname
ltx/gr_gr_cog/me.m01.d09:meMA.Kathisma11.incipit	Τοῖς οἰκτιρμοῖς σου ὁ Θεὸς…
ltx/gr_gr_cog/me.m01.d09:meMA.Kathisma11.melody	@ltx/gr_gr_cog/he.a.m4:heAU.OYpsotheisEnToStavro.name
ltx/gr_gr_cog/me.m01.d09:meMA.Kathisma11.mode	@ltx/gr_gr_cog/miscellanea:misc.Mode4
ltx/gr_gr_cog/me.m01.d09:meMA.Kathisma11.text	Τοῖς οἰκτιρμοῖς σου ὁ Θεὸς δυσωπούμενος, τὸ πλανηθὲν ἀπολωλὸς ἐξεζήτησας, διὰ σπλάγχνα ἐλέους σου φιλάνθρωπε· ὅθεν παραγέγονας, ἐπὶ τὸν Ἰορδάνην, γνωρίσαι τὸ μυστήριον, τῆς Ἁγίας Τριάδος· καὶ ἀνυμνοῦντες κραυγάζομεν πιστῶς· Ἦλθες ἐφάνης τὸ Φῶς τὸ ἀπρόσιτον.
ltx/gr_gr_cog/me.m01.d09:meMA.Kathisma21.greekmelody	@ltx/gr_gr_cog/he.a.m8:heAU.AnestisEkNekron.greekname
ltx/gr_gr_cog/me.m01.d09:meMA.Kathisma21.incipit	Ἐπέφανεν ἡμῖν, ὁ τῶν ὅλων…
ltx/gr_gr_cog/me.m01.d09:meMA.Kathisma21.melody	@ltx/gr_gr_cog/he.a.m8:heAU.AnestisEkNekron.name
ltx/gr_gr_cog/me.m01.d09:meMA.Kathisma21.mode	@ltx/gr_gr_cog/miscellanea:misc.Mode8
ltx/gr_gr_cog/me.m01.d09:meMA.Kathisma21.text	Ἐπέφανεν ἡμῖν, ὁ τῶν ὅλων Δεσπότης, ἐν ῥείθροις μυστικῶς, Ἰορδάνου χωνεῦσαι, πᾶσαν τὴν ἁμαρτίαν, ὡς ἐλεήμων καὶ ὑπεράγαθος, πᾶσα κτίσις σκιρτάτω, ὅτι βαπτίζεται Χριστὸς ὁ Κύριος, ὁ εὐδοκήσας σῶσαι ὡς Θεός, τὸ γένος τῶν ἀνθρώπων.
ltx/gr_gr_cog/me.m01.d09:meMA.Kontakion1.greekmelody	@ltx/gr_gr_cog/he.a.m4:heAU.EpefanisSimeron.greekname
ltx/gr_gr_cog/me.m01.d09:meMA.Kontakion1.incipit	Ὁ Δεσπότης κλίνας μὲν ἐν…
ltx/gr_gr_cog/me.m01.d09:meMA.Kontakion1.melody	@ltx/gr_gr_cog/he.a.m4:heAU.EpefanisSimeron.name
ltx/gr_gr_cog/me.m01.d09:meMA.Kontakion1.mode	@ltx/gr_gr_cog/miscellanea:misc.Mode4
ltx/gr_gr_cog/me.m01.d09:meMA.Kontakion1.poet	@ltx/gr_gr_cog/poets:po.RomanouTouMelodou
ltx/gr_gr_cog/me.m01.d09:meMA.Kontakion1.text	Ὁ Δεσπότης κλίνας μὲν ἐν Ἰορδάνῃ, κεφαλὴν συνέτριψε, τὰς τῶν δρακόντων κεφαλάς· τοῦ Ἀθλοφόρου ἡ κάρα δέ, ἀποτμηθεῖσα τὸν δόλιον ᾔσχυνεν.
ltx/gr_gr_cog/me.m01.d09:meMA.Ode1C11.greekmelody	@ltx/gr_gr_cog/he.h.m8:heHE.IKekommeni.greekname
ltx/gr_gr_cog/me.m01.d09:meMA.Ode1C11.incipit	Τῆς πολυεύκτου, τρυφῆς ἐμφορούμενος, καὶ…
ltx/gr_gr_cog/me.m01.d09:meMA.Ode1C11.melody	@ltx/gr_gr_cog/he.h.m8:heHE.IKekommeni.name
ltx/gr_gr_cog/me.m01.d09:meMA.Ode1C11.mode	@ltx/gr_gr_cog/miscellanea:misc.Mode8
ltx/gr_gr_cog/me.m01.d09:meMA.Ode1C11.ode	@ltx/gr_gr_cog/miscellanea:misc.Ode1
ltx/gr_gr_cog/me.m01.d09:meMA.Ode1C11.text	Τῆς πολυεύκτου, τρυφῆς ἐμφορούμενος, καὶ μακαρίας αἴγλης, ἔνδοξε πληρούμενος, καὶ τῆς Ἀγγελικῆς χορείας ἀξιούμενος, τοὺς τὴν σὴν εὐφημοῦντας Ἑορτήν, Πολύευκτε περίσῳζε, τῷ Κυρίῳ ψάλλοντας· Ἐνδόξως γὰρ δεδόξασται.
ltx/gr_gr_cog/me.m01.d09:meMA.Ode1C12.incipit	Ἡ φωτοφόρος, καὶ εὔσημος μνήμη…
ltx/gr_gr_cog/me.m01.d09:meMA.Ode1C12.melody	@ltx/gr_gr_cog/he.h.m8:heHE.IKekommeni.name
ltx/gr_gr_cog/me.m01.d09:meMA.Ode1C12.mode	@ltx/gr_gr_cog/miscellanea:misc.Mode8
ltx/gr_gr_cog/me.m01.d09:meMA.Ode1C12.ode	@ltx/gr_gr_cog/miscellanea:misc.Ode1
ltx/gr_gr_cog/me.m01.d09:meMA.Ode1C12.text	Ἡ φωτοφόρος, καὶ εὔσημος μνήμη σου, φωτὸς τοῦ θειοτάτου, πλήρης ἀνατέταλκε, φωτίζουσα λαμπρῶς, τοὺς πίστει ἀνυμνοῦντάς σε, γενναῖε στρατιῶτα τοῦ Χριστοῦ, Πολύευκτε πανόλβιε, τῷ Κυρίῳ ψάλλοντας· Ἐνδόξως γὰρ δεδόξασται.
ltx/gr_gr_cog/me.m01.d09:meMA.Ode1C13.incipit	Νενευρωμένος, ἰσχύϊ τοῦ Πνεύματος, καὶ…
ltx/gr_gr_cog/me.m01.d09:meMA.Ode1C13.melody	@ltx/gr_gr_cog/he.h.m8:heHE.IKekommeni.name
ltx/gr_gr_cog/me.m01.d09:meMA.Ode1C13.mode	@ltx/gr_gr_cog/miscellanea:misc.Mode8
ltx/gr_gr_cog/me.m01.d09:meMA.Ode1C13.ode	@ltx/gr_gr_cog/miscellanea:misc.Ode1
ltx/gr_gr_cog/me.m01.d09:meMA.Ode1C13.text	Νενευρωμένος, ἰσχύϊ τοῦ Πνεύματος, καὶ θείαν δυναστείαν, Μάκαρ ἐνδυσάμενος, ἐχώρησας στεῤῥῶς, πρὸς τὴν πάλην τοῦ ἀλάστορος, καὶ τοῦτον κατὰ κράτος καθελών, προθύμως ἀνεκραύγαζες· Τῷ Κυρίῳ ᾄσωμεν, ἐνδόξως γὰρ δεδόξασται.
ltx/gr_gr_cog/me.m01.d09:meMA.Ode1C1T.incipit	Σεσαρκωμένον, τὸν πρότερον ἄσαρκον, Παρθένε…
ltx/gr_gr_cog/me.m01.d09:meMA.Ode1C1T.melody	@ltx/gr_gr_cog/he.h.m8:heHE.IKekommeni.name
ltx/gr_gr_cog/me.m01.d09:meMA.Ode1C1T.mode	@ltx/gr_gr_cog/miscellanea:misc.Mode8
ltx/gr_gr_cog/me.m01.d09:meMA.Ode1C1T.ode	@ltx/gr_gr_cog/miscellanea:misc.Ode1
ltx/gr_gr_cog/me.m01.d09:meMA.Ode1C1T.text	Σεσαρκωμένον, τὸν πρότερον ἄσαρκον, Παρθένε Θεοτόκε, τέτοκας πανάχραντε, πανάμωμος σαφῶς, Παρθένος διαμείνασα, τὸν πλούτῳ εὐσπλαγχνίας διʼ ἡμᾶς, πτωχεύσαντα καὶ σώσαντα τοὺς αὐτῷ κραυγάζοντας· ἐνδόξως γὰρ δεδόξασται.
ltx/gr_gr_cog/me.m01.d09:meMA.Ode3C11.greekmelody	@ltx/gr_gr_cog/he.h.m8:heHE.SyEiToStereoma.greekname
ltx/gr_gr_cog/me.m01.d09:meMA.Ode3C11.incipit	Ἤμειψας τὸ φρόνημα, πρὸς τὴν…
ltx/gr_gr_cog/me.m01.d09:meMA.Ode3C11.melody	@ltx/gr_gr_cog/he.h.m8:heHE.SyEiToStereoma.name
ltx/gr_gr_cog/me.m01.d09:meMA.Ode3C11.mode	@ltx/gr_gr_cog/miscellanea:misc.Mode8
ltx/gr_gr_cog/me.m01.d09:meMA.Ode3C11.ode	@ltx/gr_gr_cog/miscellanea:misc.Ode3
ltx/gr_gr_cog/me.m01.d09:meMA.Ode3C11.text	Ἤμειψας τὸ φρόνημα, πρὸς τὴν εὐσέβειαν ἄνωθεν, ἀξιωθείς, θείας ὀπτασίας, τοῦ Σωτῆρος Πολύευκτε.
ltx/gr_gr_cog/me.m01.d09:meMA.Ode3C12.incipit	Νίκης ἐφιέμενος, πάντων κατέπτυσας Ἔνδοξε…
ltx/gr_gr_cog/me.m01.d09:meMA.Ode3C12.melody	@ltx/gr_gr_cog/he.h.m8:heHE.SyEiToStereoma.name
ltx/gr_gr_cog/me.m01.d09:meMA.Ode3C12.mode	@ltx/gr_gr_cog/miscellanea:misc.Mode8
ltx/gr_gr_cog/me.m01.d09:meMA.Ode3C12.ode	@ltx/gr_gr_cog/miscellanea:misc.Ode3
ltx/gr_gr_cog/me.m01.d09:meMA.Ode3C12.text	Νίκης ἐφιέμενος, πάντων κατέπτυσας Ἔνδοξε, τῶν ἐπὶ γῆς, καὶ τῆς οὐρανίου, κληρουχίας ἠξίωσαι.
ltx/gr_gr_cog/me.m01.d09:meMA.Ode3C13.incipit	Δόξης ὀρεγόμενος, τῆς ὑπὲρ ἔννοιαν…
ltx/gr_gr_cog/me.m01.d09:meMA.Ode3C13.melody	@ltx/gr_gr_cog/he.h.m8:heHE.SyEiToStereoma.name
ltx/gr_gr_cog/me.m01.d09:meMA.Ode3C13.mode	@ltx/gr_gr_cog/miscellanea:misc.Mode8
ltx/gr_gr_cog/me.m01.d09:meMA.Ode3C13.ode	@ltx/gr_gr_cog/miscellanea:misc.Ode3
ltx/gr_gr_cog/me.m01.d09:meMA.Ode3C13.text	Δόξης ὀρεγόμενος, τῆς ὑπὲρ ἔννοιαν ὥρμησας, καρτερικῶς, καὶ τὴν τῶν ειδώλων, ἀδοξίαν κατέβαλες.
ltx/gr_gr_cog/me.m01.d09:meMA.Ode3C1T.incipit	Ἴθυνόν μοι Δέσποινα, τὰ διαβήματα…
ltx/gr_gr_cog/me.m01.d09:meMA.Ode3C1T.melody	@ltx/gr_gr_cog/he.h.m8:heHE.SyEiToStereoma.name
ltx/gr_gr_cog/me.m01.d09:meMA.Ode3C1T.mode	@ltx/gr_gr_cog/miscellanea:misc.Mode8
ltx/gr_gr_cog/me.m01.d09:meMA.Ode3C1T.ode	@ltx/gr_gr_cog/miscellanea:misc.Ode3
ltx/gr_gr_cog/me.m01.d09:meMA.Ode3C1T.text	Ἴθυνόν μοι Δέσποινα, τὰ διαβήματα, ἵνα σοῦ, πρὸς τὸν Υἱόν, διʼ ἐπαινουμένης, πολιτείας πορεύσωμαι.
ltx/gr_gr_cog/me.m01.d09:meMA.Ode3H.greekmelody	@ltx/gr_gr_cog/he.h.m8:heHE.SyEiToStereoma.greekname
ltx/gr_gr_cog/me.m01.d09:meMA.Ode3H.incipit	@ltx/gr_gr_cog/he.h.m8:heHE.SyEiToStereoma.incipit
ltx/gr_gr_cog/me.m01.d09:meMA.Ode3H.melody	@ltx/gr_gr_cog/he.h.m8:heHE.SyEiToStereoma.melody
ltx/gr_gr_cog/me.m01.d09:meMA.Ode3H.mode	@ltx/gr_gr_cog/miscellanea:misc.Mode8
ltx/gr_gr_cog/me.m01.d09:meMA.Ode3H.ode	@ltx/gr_gr_cog/miscellanea:misc.Ode3
ltx/gr_gr_cog/me.m01.d09:meMA.Ode3H.text	@ltx/gr_gr_cog/he.h.m8:heHE.SyEiToStereoma.text
ltx/gr_gr_cog/me.m01.d09:meMA.Ode3Kathisma1.greekmelody	@ltx/gr_gr_cog/he.a.m5:heAU.TonSynanarchonLogon.greekname
ltx/gr_gr_cog/me.m01.d09:meMA.Ode3Kathisma1.incipit	Ὡς καλὸς στρατιώτης Χριστοῦ τοῦ…
ltx/gr_gr_cog/me.m01.d09:meMA.Ode3Kathisma1.melody	@ltx/gr_gr_cog/he.a.m5:heAU.TonSynanarchonLogon.name
ltx/gr_gr_cog/me.m01.d09:meMA.Ode3Kathisma1.mode	@ltx/gr_gr_cog/miscellanea:misc.Mode5
ltx/gr_gr_cog/me.m01.d09:meMA.Ode3Kathisma1.text	Ὡς καλὸς στρατιώτης Χριστοῦ τοῦ πάντων Θεοῦ, ἐν τῇ χάριτι τούτου ἐνδυναμούμενος, ὅλον μετέθηκας σαυτόν, ἐν τῇ ἀγάπῃ αὐτοῦ, διὰ Νεάρχου τοῦ πιστοῦ, συστρατιώτου σου σοφέ· διὸ νομίμως ἀθλήσας, ἀξίως ἐστεφανώθης, παρὰ Κυρίου Μάρτυς Πολύευκτε.
ltx/gr_gr_cog/me.m01.d09:meMA.Ode3Kathisma2.greekmelody	@ltx/gr_gr_cog/he.a.m5:heAU.TonSynanarchonLogon.greekname
ltx/gr_gr_cog/me.m01.d09:meMA.Ode3Kathisma2.incipit	Ἰορδάνου τὸ ῥεῖθρον περιβαλλόμενος, ὁ…
ltx/gr_gr_cog/me.m01.d09:meMA.Ode3Kathisma2.melody	@ltx/gr_gr_cog/he.a.m5:heAU.TonSynanarchonLogon.name
ltx/gr_gr_cog/me.m01.d09:meMA.Ode3Kathisma2.mode	@ltx/gr_gr_cog/miscellanea:misc.Mode5
ltx/gr_gr_cog/me.m01.d09:meMA.Ode3Kathisma2.text	Ἰορδάνου τὸ ῥεῖθρον περιβαλλόμενος, ὁ τὸ φῶς παραδόξως ἀναβαλλόμενος, ἐν αὐτῷ τὴν τοῦ Ἀδάμ, φύσιν ἀνέπλασας, συντριβεῖσαν πονηρᾷ, παρακοῇ Λόγε Θεοῦ· διό σε ἀνευφημοῦμεν, καὶ τὴν ἁγίαν σου πάντες, δοξολογοῦμεν Ἐπιφάνειαν.
ltx/gr_gr_cog/me.m01.d09:meMA.Ode4C11.greekmelody	@ltx/gr_gr_cog/he.h.m8:heHE.SyMouIschys.greekname
ltx/gr_gr_cog/me.m01.d09:meMA.Ode4C11.incipit	Διʼ εὐσεβοῦς, ὁμολογίας Πανάριστε, τῷ…
ltx/gr_gr_cog/me.m01.d09:meMA.Ode4C11.melody	@ltx/gr_gr_cog/he.h.m8:heHE.SyMouIschys.name
ltx/gr_gr_cog/me.m01.d09:meMA.Ode4C11.mode	@ltx/gr_gr_cog/miscellanea:misc.Mode8
ltx/gr_gr_cog/me.m01.d09:meMA.Ode4C11.ode	@ltx/gr_gr_cog/miscellanea:misc.Ode4
ltx/gr_gr_cog/me.m01.d09:meMA.Ode4C11.text	Διʼ εὐσεβοῦς, ὁμολογίας Πανάριστε, τῷ Δεσπότῃ, σαυτὸν προσενήνοχας, τὴν διʼ αὐτόν, Ἔνδοξε σφαγήν, πόθῳ δεδεγμένος· καὶ μώμου παντὸς ἐλεύθερος, γενόμενος ἐντεῦθεν, τῷ Σωτῆρι κραυγάζεις. Τῇ δυνάμει σου δόξα Φιλάνθρωπε.
ltx/gr_gr_cog/me.m01.d09:meMA.Ode4C12.incipit	Ὁ γλυκασμός, τῆς εὐσεβείας ἠδύνθη…
ltx/gr_gr_cog/me.m01.d09:meMA.Ode4C12.melody	@ltx/gr_gr_cog/he.h.m8:heHE.SyMouIschys.name
ltx/gr_gr_cog/me.m01.d09:meMA.Ode4C12.mode	@ltx/gr_gr_cog/miscellanea:misc.Mode8
ltx/gr_gr_cog/me.m01.d09:meMA.Ode4C12.ode	@ltx/gr_gr_cog/miscellanea:misc.Ode4
ltx/gr_gr_cog/me.m01.d09:meMA.Ode4C12.text	Ὁ γλυκασμός, τῆς εὐσεβείας ἠδύνθη σοι· ἐπτερώθης, θείας ἀγαπήσεως, τῷ καθαρῷ καὶ εἰλικρινεῖ, πόθῳ τετρωμένος, καὶ ἔρωτι πυρπολούμενος, τῆς ἄνω Βασιλείας, μελῳδεῖς τῷ Δεσπότῃ· Τῇ δυνάμει σου δόξα Φιλάνθρωπε.
ltx/gr_gr_cog/me.m01.d09:meMA.Ode4C13.incipit	Ὑπερφυεῖ, ὁμοφροσύνῃ συνδούμενος, τῷ Νεάρχῳ…
ltx/gr_gr_cog/me.m01.d09:meMA.Ode4C13.melody	@ltx/gr_gr_cog/he.h.m8:heHE.SyMouIschys.name
ltx/gr_gr_cog/me.m01.d09:meMA.Ode4C13.mode	@ltx/gr_gr_cog/miscellanea:misc.Mode8
ltx/gr_gr_cog/me.m01.d09:meMA.Ode4C13.ode	@ltx/gr_gr_cog/miscellanea:misc.Ode4
ltx/gr_gr_cog/me.m01.d09:meMA.Ode4C13.text	Ὑπερφυεῖ, ὁμοφροσύνῃ συνδούμενος, τῷ Νεάρχῳ, τούτου τε τοῖς ῥήμασι, κατηχηθείς, πρὸς τὴν εὐσεβῆ, πίστιν τῆς Τριάδος, θέοφρον Μάρτυς Πολύευκτε, τῆς ὄντως πολυεύκτου, καὶ τῆς πεποθημένης, ἠξιώθης Μαρτύρων φαιδρότητος.
ltx/gr_gr_cog/me.m01.d09:meMA.Ode4C14.incipit	Μαρτυρικοῖς συνηριθμήθης στρατεύμασι· βασιλείαν, ἔλαβες…
ltx/gr_gr_cog/me.m01.d09:meMA.Ode4C14.melody	@ltx/gr_gr_cog/he.h.m8:heHE.SyMouIschys.name
ltx/gr_gr_cog/me.m01.d09:meMA.Ode4C14.mode	@ltx/gr_gr_cog/miscellanea:misc.Mode8
ltx/gr_gr_cog/me.m01.d09:meMA.Ode4C14.ode	@ltx/gr_gr_cog/miscellanea:misc.Ode4
ltx/gr_gr_cog/me.m01.d09:meMA.Ode4C14.text	Μαρτυρικοῖς συνηριθμήθης στρατεύμασι· βασιλείαν, ἔλαβες ἀσάλευτον, νεοσφαγής, ταύτης ἐπιβάς, ἔτι τῶν αἱμάτων, σταζόντων· ἤχθης δὲ Πάνσοφε, χαρᾶς ἀδιαδόχου, καὶ φωτὸς ἀνεσπέρου, καὶ μεγάλης εὐκλείας τευξόμενος.
ltx/gr_gr_cog/me.m01.d09:meMA.Ode4C1T.incipit	Ὁμοιωθείς, τοῖς ἐπὶ γῆς ὁ…
ltx/gr_gr_cog/me.m01.d09:meMA.Ode4C1T.melody	@ltx/gr_gr_cog/he.h.m8:heHE.SyMouIschys.name
ltx/gr_gr_cog/me.m01.d09:meMA.Ode4C1T.mode	@ltx/gr_gr_cog/miscellanea:misc.Mode8
ltx/gr_gr_cog/me.m01.d09:meMA.Ode4C1T.ode	@ltx/gr_gr_cog/miscellanea:misc.Ode4
ltx/gr_gr_cog/me.m01.d09:meMA.Ode4C1T.text	Ὁμοιωθείς, τοῖς ἐπὶ γῆς ὁ οὐράνιος, οὐρανίους, τούτους ἀπειργάσατο, καὶ πεπονθώς, φύσει παθητῇ, θείας ἀπαθείας, τὴν μέθεξιν ἐδωρήσατο· τὴν τοῦτον οὖν τεκοῦσαν, ἀπειρόγαμον Κόρην, Θεοτόκον εἰδότες δοξάζομεν.
ltx/gr_gr_cog/me.m01.d09:meMA.Ode5C11.greekmelody	@ltx/gr_gr_cog/he.h.m8:heHE.InaTiMeAposo.greekname
ltx/gr_gr_cog/me.m01.d09:meMA.Ode5C11.incipit	Ἵνα τῆς ἀϊδίου, τύχῃς ἀπολαύσεως…
ltx/gr_gr_cog/me.m01.d09:meMA.Ode5C11.melody	@ltx/gr_gr_cog/he.h.m8:heHE.InaTiMeAposo.name
ltx/gr_gr_cog/me.m01.d09:meMA.Ode5C11.mode	@ltx/gr_gr_cog/miscellanea:misc.Mode8
ltx/gr_gr_cog/me.m01.d09:meMA.Ode5C11.ode	@ltx/gr_gr_cog/miscellanea:misc.Ode5
ltx/gr_gr_cog/me.m01.d09:meMA.Ode5C11.text	Ἵνα τῆς ἀϊδίου, τύχῃς ἀπολαύσεως Μακαριώτατε, τὰ τερπνὰ τοῦ βίου, καὶ τῆς φύσεως τὴν οἰκειότητα, καὶ τρυφὴν καὶ δόξαν, καὶ τὴν ζωὴν αὐτὴν παρεῖδες, καὶ ἐλπίδος τῆς σῆς οὐ διήμαρτες.
ltx/gr_gr_cog/me.m01.d09:meMA.Ode5C12.incipit	Μεμυσταγωγημένος, τὰ τῆς θείας ὄψεως…
ltx/gr_gr_cog/me.m01.d09:meMA.Ode5C12.melody	@ltx/gr_gr_cog/he.h.m8:heHE.InaTiMeAposo.name
ltx/gr_gr_cog/me.m01.d09:meMA.Ode5C12.mode	@ltx/gr_gr_cog/miscellanea:misc.Mode8
ltx/gr_gr_cog/me.m01.d09:meMA.Ode5C12.ode	@ltx/gr_gr_cog/miscellanea:misc.Ode5
ltx/gr_gr_cog/me.m01.d09:meMA.Ode5C12.text	Μεμυσταγωγημένος, τὰ τῆς θείας ὄψεως θεῖα μυστήρια, σταθερᾷ τῇ γνώμῃ, πρὸς τελείους ἀγῶνες ἐχώρησας· καὶ τροπαιοφόρος, ἀναδειχθεὶς τῶν ἀκηράτων, ἠξιώθης στεφάνων Πολύευκτε.
ltx/gr_gr_cog/me.m01.d09:meMA.Ode5C13.incipit	Ἀθεώτατον σέβας, φύσει μισοπόνηρον ἔχων…
ltx/gr_gr_cog/me.m01.d09:meMA.Ode5C13.melody	@ltx/gr_gr_cog/he.h.m8:heHE.InaTiMeAposo.name
ltx/gr_gr_cog/me.m01.d09:meMA.Ode5C13.mode	@ltx/gr_gr_cog/miscellanea:misc.Mode8
ltx/gr_gr_cog/me.m01.d09:meMA.Ode5C13.ode	@ltx/gr_gr_cog/miscellanea:misc.Ode5
ltx/gr_gr_cog/me.m01.d09:meMA.Ode5C13.text	Ἀθεώτατον σέβας, φύσει μισοπόνηρον ἔχων τὸ φρόνημα, εὐσεβῶς ἀπώσω, καὶ Θεοὺς τοὺς ματαίους κατέστρεψας, εὐσεβείας ζήλῳ πυρποληθεὶς καὶ προθυμίας, θεοπνεύστου πλησθεὶς Παναοίδιμε.
ltx/gr_gr_cog/me.m01.d09:meMA.Ode5C1T.incipit	Ῥήσεσι τῶν χειλέων, Πάναγνε ἑπόμενοι…
ltx/gr_gr_cog/me.m01.d09:meMA.Ode5C1T.melody	@ltx/gr_gr_cog/he.h.m8:heHE.InaTiMeAposo.name
ltx/gr_gr_cog/me.m01.d09:meMA.Ode5C1T.mode	@ltx/gr_gr_cog/miscellanea:misc.Mode8
ltx/gr_gr_cog/me.m01.d09:meMA.Ode5C1T.ode	@ltx/gr_gr_cog/miscellanea:misc.Ode5
ltx/gr_gr_cog/me.m01.d09:meMA.Ode5C1T.text	Ῥήσεσι τῶν χειλέων, Πάναγνε ἑπόμενοι σὲ μακαρίζομεν· μετὰ σοῦ γὰρ ὄντως, μεγαλεῖα ποιήσας ὁ Κύριος, ἐμεγάλυνέ σε, καὶ ἀληθῆ Θεοῦ Μητέρα, γεννηθεὶς ἐκ γαστρός σου ἀνέδειξεν.
ltx/gr_gr_cog/me.m01.d09:meMA.Ode6C11.greekmelody	@ltx/gr_gr_cog/he.h.m8:heHE.AvyssosAmartion.greekname
ltx/gr_gr_cog/me.m01.d09:meMA.Ode6C11.incipit	Τάξεως Ἀγγελικῆς, ἠξιώθης ἀξιάγαστε Μάρτυς…
ltx/gr_gr_cog/me.m01.d09:meMA.Ode6C11.melody	@ltx/gr_gr_cog/he.h.m8:heHE.AvyssosAmartion.name
ltx/gr_gr_cog/me.m01.d09:meMA.Ode6C11.mode	@ltx/gr_gr_cog/miscellanea:misc.Mode8
ltx/gr_gr_cog/me.m01.d09:meMA.Ode6C11.ode	@ltx/gr_gr_cog/miscellanea:misc.Ode6
ltx/gr_gr_cog/me.m01.d09:meMA.Ode6C11.text	Τάξεως Ἀγγελικῆς, ἠξιώθης ἀξιάγαστε Μάρτυς, ἀγγελικὸν τὸν ζῆλον, προφανῶς ἐνδειξάμενος· σὺν αὐτοῖς οὖν ἐκτενῶς, Μάκαρ ἱκέτευε λυτρωθῆναι, ἐκ πειρασμῶν τοὺς ἀνυμνοῦντάς σε.
ltx/gr_gr_cog/me.m01.d09:meMA.Ode6C12.incipit	Ὕπνωσας ἀγαπητοῖς, Ἀθλητὰ τὸν ὀφειλόμενον…
ltx/gr_gr_cog/me.m01.d09:meMA.Ode6C12.melody	@ltx/gr_gr_cog/he.h.m8:heHE.AvyssosAmartion.name
ltx/gr_gr_cog/me.m01.d09:meMA.Ode6C12.mode	@ltx/gr_gr_cog/miscellanea:misc.Mode8
ltx/gr_gr_cog/me.m01.d09:meMA.Ode6C12.ode	@ltx/gr_gr_cog/miscellanea:misc.Ode6
ltx/gr_gr_cog/me.m01.d09:meMA.Ode6C12.text	Ὕπνωσας ἀγαπητοῖς, Ἀθλητὰ τὸν ὀφειλόμενον ὕπνον, ἀποτμηθεὶς τὴν κάραν, διὰ ξίφους πολύαθλε· καὶ τανῦν ἐν οὐρανοῖς, κλῆρον ἀκήρατον ἐκληρώσω, μετὰ Μαρτύρων αὐλιζόμενος.
ltx/gr_gr_cog/me.m01.d09:meMA.Ode6C13.incipit	Σύμμορφος καὶ κοινωνός, παθημάτων τοῦ…
ltx/gr_gr_cog/me.m01.d09:meMA.Ode6C13.melody	@ltx/gr_gr_cog/he.h.m8:heHE.AvyssosAmartion.name
ltx/gr_gr_cog/me.m01.d09:meMA.Ode6C13.mode	@ltx/gr_gr_cog/miscellanea:misc.Mode8
ltx/gr_gr_cog/me.m01.d09:meMA.Ode6C13.ode	@ltx/gr_gr_cog/miscellanea:misc.Ode6
ltx/gr_gr_cog/me.m01.d09:meMA.Ode6C13.text	Σύμμορφος καὶ κοινωνός, παθημάτων τοῦ Σωτῆρος ἐγένου, τοῦ διʼ ἡμᾶς τῷ πάθει, τοῦ Σταυροῦ ὁμιλήσαντος· καὶ νῦν Μάκαρ σὺν αὐτῷ, ὡς ἐπηγγείλατο βασιλεύεις, εἰς τὸν αἰῶνα τὸν ἀπέραντον.
ltx/gr_gr_cog/me.m01.d09:meMA.Ode6C1T.incipit	Ἔχουσα τὸ συμπαθές, ὡς τεκοῦσα…
ltx/gr_gr_cog/me.m01.d09:meMA.Ode6C1T.melody	@ltx/gr_gr_cog/he.h.m8:heHE.AvyssosAmartion.name
ltx/gr_gr_cog/me.m01.d09:meMA.Ode6C1T.mode	@ltx/gr_gr_cog/miscellanea:misc.Mode8
ltx/gr_gr_cog/me.m01.d09:meMA.Ode6C1T.ode	@ltx/gr_gr_cog/miscellanea:misc.Ode6
ltx/gr_gr_cog/me.m01.d09:meMA.Ode6C1T.text	Ἔχουσα τὸ συμπαθές, ὡς τεκοῦσα τὸν φιλάνθρωπον Λόγον, σῶσον ἡμᾶς βιαίας, καὶ δεινῆς περιστάσεως· σὲ γὰρ μόνον οἱ πιστοί, πάναγνε Δέσποινα προστασίαν, ἀκαταμάχητον κεκτήμεθα.
ltx/gr_gr_cog/me.m01.d09:meMA.Ode6H.greekmelody	@ltx/gr_gr_cog/he.h.m8:heHE.AvyssosAmartion.greekname
ltx/gr_gr_cog/me.m01.d09:meMA.Ode6H.incipit	@ltx/gr_gr_cog/he.h.m8:heHE.AvyssosAmartion.incipit
ltx/gr_gr_cog/me.m01.d09:meMA.Ode6H.melody	@ltx/gr_gr_cog/he.h.m8:heHE.AvyssosAmartion.melody
ltx/gr_gr_cog/me.m01.d09:meMA.Ode6H.mode	@ltx/gr_gr_cog/miscellanea:misc.Mode8
ltx/gr_gr_cog/me.m01.d09:meMA.Ode6H.ode	@ltx/gr_gr_cog/miscellanea:misc.Ode6
ltx/gr_gr_cog/me.m01.d09:meMA.Ode6H.text	@ltx/gr_gr_cog/he.h.m8:heHE.AvyssosAmartion.text
ltx/gr_gr_cog/me.m01.d09:meMA.Ode7C11.greekmelody	@ltx/gr_gr_cog/he.h.m8:heHE.TheouSynkatavasin.greekname
ltx/gr_gr_cog/me.m01.d09:meMA.Ode7C11.incipit	Ὑπέδειξας Δέσποτα, τῷ σῷ οἰκέτῃ…
ltx/gr_gr_cog/me.m01.d09:meMA.Ode7C11.melody	@ltx/gr_gr_cog/he.h.m8:heHE.TheouSynkatavasin.name
ltx/gr_gr_cog/me.m01.d09:meMA.Ode7C11.mode	@ltx/gr_gr_cog/miscellanea:misc.Mode8
ltx/gr_gr_cog/me.m01.d09:meMA.Ode7C11.ode	@ltx/gr_gr_cog/miscellanea:misc.Ode7
ltx/gr_gr_cog/me.m01.d09:meMA.Ode7C11.text	Ὑπέδειξας Δέσποτα, τῷ σῷ οἰκέτῃ τὴν δυναστείαν σου· διὰ τοῦτο προθύμως, πρὸς τοὺς ἀγῶνας, ἦλθεν αὐτόκλητος, καὶ νικηφόρος γενόμενος ἔψαλλεν· Εὐλογητὸς ὁ Θεὸς ὁ τῶν Πατέρων ἡμῶν.
ltx/gr_gr_cog/me.m01.d09:meMA.Ode7C12.incipit	Κλητὴ καὶ πανεύσημος, ἡ ἑορτή…
ltx/gr_gr_cog/me.m01.d09:meMA.Ode7C12.melody	@ltx/gr_gr_cog/he.h.m8:heHE.TheouSynkatavasin.name
ltx/gr_gr_cog/me.m01.d09:meMA.Ode7C12.mode	@ltx/gr_gr_cog/miscellanea:misc.Mode8
ltx/gr_gr_cog/me.m01.d09:meMA.Ode7C12.ode	@ltx/gr_gr_cog/miscellanea:misc.Ode7
ltx/gr_gr_cog/me.m01.d09:meMA.Ode7C12.text	Κλητὴ καὶ πανεύσημος, ἡ ἑορτή σου Μάρτυς ἀνέτειλε· τῆς γὰρ ἐπιφανείας τοῦ σοῦ Δεσπότου, φῶς ἐπιφέρεται, καὶ καταυγάζει τοὺς πίστει κραυγάζοντας.·Εὐλογητὸς ὁ Θεὸς ὁ τῶν Πατέρων ἡμῶν.
ltx/gr_gr_cog/me.m01.d09:meMA.Ode7C13.incipit	Τὸν πλοῦτον τὸν ἄσυλον, τὸ…
ltx/gr_gr_cog/me.m01.d09:meMA.Ode7C13.melody	@ltx/gr_gr_cog/he.h.m8:heHE.TheouSynkatavasin.name
ltx/gr_gr_cog/me.m01.d09:meMA.Ode7C13.mode	@ltx/gr_gr_cog/miscellanea:misc.Mode8
ltx/gr_gr_cog/me.m01.d09:meMA.Ode7C13.ode	@ltx/gr_gr_cog/miscellanea:misc.Ode7
ltx/gr_gr_cog/me.m01.d09:meMA.Ode7C13.text	Τὸν πλοῦτον τὸν ἄσυλον, τὸ διαμένον εὗρες ἀξίωμα, καὶ τὸ μὴ διαπίπτον, ἀλλʼ εἰς αἰῶνας ἀϊδιούμενον, εἴληφας κλέος, κραυγάζων θεσπέσιε· Εὐλογητὸς ὁ Θεός, ὁ τῶν Πατέρων ἡμῶν.
ltx/gr_gr_cog/me.m01.d09:meMA.Ode7C1T.incipit	Ἀνάρχῳ Γεννήτορι, τὸν συννημένως ἀεὶ…
ltx/gr_gr_cog/me.m01.d09:meMA.Ode7C1T.melody	@ltx/gr_gr_cog/he.h.m8:heHE.TheouSynkatavasin.name
ltx/gr_gr_cog/me.m01.d09:meMA.Ode7C1T.mode	@ltx/gr_gr_cog/miscellanea:misc.Mode8
ltx/gr_gr_cog/me.m01.d09:meMA.Ode7C1T.ode	@ltx/gr_gr_cog/miscellanea:misc.Ode7
ltx/gr_gr_cog/me.m01.d09:meMA.Ode7C1T.text	Ἀνάρχῳ Γεννήτορι, τὸν συννημένως ἀεὶ νοούμενον, συλλαβοῦσα Παρθένε, σεσαρκωμένον Υἱὸν γεγέννηκας, διὰ τὸ σῶσαι τοὺς πίστει κραυγάζοντας. Εὐλογητὸς ὁ Θεός, ὁ τῶν Πατέρων ἡμῶν.
ltx/gr_gr_cog/me.m01.d09:meMA.Ode8C11.greekmelody	@ltx/gr_gr_cog/he.h.m8:heHE.EptaplasiosKaminon.greekname
ltx/gr_gr_cog/me.m01.d09:meMA.Ode8C11.incipit	Ἱερουργεῖται σήμερον, ἡ πολύευκτος, μνήμη…
ltx/gr_gr_cog/me.m01.d09:meMA.Ode8C11.melody	@ltx/gr_gr_cog/he.h.m8:heHE.EptaplasiosKaminon.name
ltx/gr_gr_cog/me.m01.d09:meMA.Ode8C11.mode	@ltx/gr_gr_cog/miscellanea:misc.Mode8
ltx/gr_gr_cog/me.m01.d09:meMA.Ode8C11.ode	@ltx/gr_gr_cog/miscellanea:misc.Ode8
ltx/gr_gr_cog/me.m01.d09:meMA.Ode8C11.text	Ἱερουργεῖται σήμερον, ἡ πολύευκτος, μνήμη σου, Μάρτυς τοῦ Χριστοῦ, ἀθλοφόρε Πολύευκτε· Χριστῷ γὰρ εὐάρεστος, δεκτὴ θυσία γέγονας, τῷ σφαγιασθέντι, διὰ σὲ καὶ τυθέντι· ὃν παῖδες εὐλογοῦσιν, ἱερεῖς ἀνυμνοῦσι, λαοὶ ὑπερυψοῦσιν, εἰς πάντας τοὺς αἰῶνας.
ltx/gr_gr_cog/me.m01.d09:meMA.Ode8C12.incipit	Ἀθλητικὴν τὴν ἔνστασιν, Ἀθλητὰ μέχρις…
ltx/gr_gr_cog/me.m01.d09:meMA.Ode8C12.melody	@ltx/gr_gr_cog/he.h.m8:heHE.EptaplasiosKaminon.name
ltx/gr_gr_cog/me.m01.d09:meMA.Ode8C12.mode	@ltx/gr_gr_cog/miscellanea:misc.Mode8
ltx/gr_gr_cog/me.m01.d09:meMA.Ode8C12.ode	@ltx/gr_gr_cog/miscellanea:misc.Ode8
ltx/gr_gr_cog/me.m01.d09:meMA.Ode8C12.text	Ἀθλητικὴν τὴν ἔνστασιν, Ἀθλητὰ μέχρις αἵματος, ἐπιδεδειγμένος, ἐπὶ γῆς Πολύευκτε, παστάδα πολύφωτον, ἐν οὐρανοῖς ἐσκήνωσας, τῇ τῶν σῶν αἱμάτων, βαπτισθεὶς κολυμβήθρᾳ, καὶ μέλπων· Τὸν Δεσπότην, Ἱερεῖς εὐλογεῖτε, λαὸς ὑπερυψοῦτε, εἰς πάντας τοὺς αἰῶνας.
ltx/gr_gr_cog/me.m01.d09:meMA.Ode8C13.incipit	Νενεκρωμένην πταίσμασι, τὴν ψυχήν μου…
ltx/gr_gr_cog/me.m01.d09:meMA.Ode8C13.melody	@ltx/gr_gr_cog/he.h.m8:heHE.EptaplasiosKaminon.name
ltx/gr_gr_cog/me.m01.d09:meMA.Ode8C13.mode	@ltx/gr_gr_cog/miscellanea:misc.Mode8
ltx/gr_gr_cog/me.m01.d09:meMA.Ode8C13.ode	@ltx/gr_gr_cog/miscellanea:misc.Ode8
ltx/gr_gr_cog/me.m01.d09:meMA.Ode8C13.text	Νενεκρωμένην πταίσμασι, τὴν ψυχήν μου ἀνάστησον, τῇ μαρτυρικῇ σου, παῤῥησίᾳ χρώμενος, τοῖς θείοις προστάγμασι, διαῤῥυθμίζων Ἔνδοξε, ἀξιοπρεπῶς, πρὸς ἀρετὴν ἐπιστρέφων, βοῶσαν· Τὸν Δεσπότην, Ἱερεῖς εὐλογεῖτε, λαὸς ὑπερυψοῦτε, εἰς πάντας τοὺς αἰῶνας.
ltx/gr_gr_cog/me.m01.d09:meMA.Ode8C1T.incipit	Χαῖρε διʼ ἧς ἐσχήκαμεν, τὴν…
ltx/gr_gr_cog/me.m01.d09:meMA.Ode8C1T.melody	@ltx/gr_gr_cog/he.h.m8:heHE.EptaplasiosKaminon.name
ltx/gr_gr_cog/me.m01.d09:meMA.Ode8C1T.mode	@ltx/gr_gr_cog/miscellanea:misc.Mode8
ltx/gr_gr_cog/me.m01.d09:meMA.Ode8C1T.ode	@ltx/gr_gr_cog/miscellanea:misc.Ode8
ltx/gr_gr_cog/me.m01.d09:meMA.Ode8C1T.text	Χαῖρε διʼ ἧς ἐσχήκαμεν, τὴν χαρὰν τὴν αἰώνιον. Χαῖρε τὸ τῆς Εὔας, σκυθρωπὸν ἡ λύσασα, Ἀδὰμ τὴν κατήφειαν, πρὸς τὸ φαιδρὸν ἡ τρέψασα. Χαῖρε ἡ Θεόν, σωματωθέντα τεκοῦσα, Παρθένε Θεοτόκε, τῶν πιστῶν ἡ προστάτις, τῶν σὲ ὑπερυψούντων, εἰς πάντας τοὺς αἰῶνας.
ltx/gr_gr_cog/me.m01.d09:meMA.Ode8H.greekmelody	@ltx/gr_gr_cog/he.h.m8:heHE.EptaplasiosKaminon.greekname
ltx/gr_gr_cog/me.m01.d09:meMA.Ode8H.incipit	@ltx/gr_gr_cog/he.h.m8:heHE.EptaplasiosKaminon.incipit
ltx/gr_gr_cog/me.m01.d09:meMA.Ode8H.melody	@ltx/gr_gr_cog/he.h.m8:heHE.EptaplasiosKaminon.melody
ltx/gr_gr_cog/me.m01.d09:meMA.Ode8H.mode	@ltx/gr_gr_cog/miscellanea:misc.Mode8
ltx/gr_gr_cog/me.m01.d09:meMA.Ode8H.ode	@ltx/gr_gr_cog/miscellanea:misc.Ode8
ltx/gr_gr_cog/me.m01.d09:meMA.Ode8H.text	@ltx/gr_gr_cog/he.h.m8:heHE.EptaplasiosKaminon.text
ltx/gr_gr_cog/me.m01.d09:meMA.Ode9C11.greekmelody	@ltx/gr_gr_cog/he.h.m8:heHE.EfrixePasaAkoi.greekname
ltx/gr_gr_cog/me.m01.d09:meMA.Ode9C11.incipit	Ἄγε δὴ τὸν θεοστεφῆ, φιλομάρτυρες…
ltx/gr_gr_cog/me.m01.d09:meMA.Ode9C11.melody	@ltx/gr_gr_cog/he.h.m8:heHE.EfrixePasaAkoi.name
ltx/gr_gr_cog/me.m01.d09:meMA.Ode9C11.mode	@ltx/gr_gr_cog/miscellanea:misc.Mode8
ltx/gr_gr_cog/me.m01.d09:meMA.Ode9C11.ode	@ltx/gr_gr_cog/miscellanea:misc.Ode9
ltx/gr_gr_cog/me.m01.d09:meMA.Ode9C11.text	Ἄγε δὴ τὸν θεοστεφῆ, φιλομάρτυρες ὑμνήσωμεν Μάρτυρα, ὃν συνεδόξασε, τῇ φωτωνύμῳ αὐτοῦ ὁ Ὕψιστος, Ἐπιφανείᾳ καὶ σεπτῇ, ἡμέρᾳ τετίμηκε, καὶ ἐστεφάνωσε, καὶ ἐνθέοις ἀρεταῖς κατεκόσμησε.
ltx/gr_gr_cog/me.m01.d09:meMA.Ode9C12.incipit	Ῥεύμασι τῶν μαρτυρικῶν, ἐκχυθέντων σου…
ltx/gr_gr_cog/me.m01.d09:meMA.Ode9C12.melody	@ltx/gr_gr_cog/he.h.m8:heHE.EfrixePasaAkoi.name
ltx/gr_gr_cog/me.m01.d09:meMA.Ode9C12.mode	@ltx/gr_gr_cog/miscellanea:misc.Mode8
ltx/gr_gr_cog/me.m01.d09:meMA.Ode9C12.ode	@ltx/gr_gr_cog/miscellanea:misc.Ode9
ltx/gr_gr_cog/me.m01.d09:meMA.Ode9C12.text	Ῥεύμασι τῶν μαρτυρικῶν, ἐκχυθέντων σου αἱμάτων ἀπέπνιξας, τὸν δυσμενέστατον, τὸν τὴν κακίαν δημιουργήσαντα· τὴν Ἐκκλησίαν δὲ Χριστοῦ, ἀρδεύων ἐφαίδρυνας, θεομακάριστε, τὴν ἐν πίστει σε ἀεὶ μακαρίζουσαν.
ltx/gr_gr_cog/me.m01.d09:meMA.Ode9C13.incipit	Ἴθι μοι Μάρτυς ἀῤῥωγός, πειρασμῶν…
ltx/gr_gr_cog/me.m01.d09:meMA.Ode9C13.melody	@ltx/gr_gr_cog/he.h.m8:heHE.EfrixePasaAkoi.name
ltx/gr_gr_cog/me.m01.d09:meMA.Ode9C13.mode	@ltx/gr_gr_cog/miscellanea:misc.Mode8
ltx/gr_gr_cog/me.m01.d09:meMA.Ode9C13.ode	@ltx/gr_gr_cog/miscellanea:misc.Ode9
ltx/gr_gr_cog/me.m01.d09:meMA.Ode9C13.text	Ἴθι μοι Μάρτυς ἀῤῥωγός, πειρασμῶν με ἐκ ποικίλων ῥυόμενος, καὶ περιστάσεων, δεσμῶν τε λύων τῆς αἱρέσεως, καὶ χαλεπῆς ἐλευθερῶν, φρουρὰς ταῖς πρεσβείαις σου, τὸν ἀνυμνοῦντά σε, διανοίᾳ καθαρᾷ παναοίδιμε.
ltx/gr_gr_cog/me.m01.d09:meMA.Ode9C1T.incipit	Νόμου τε σὺ καὶ Προφητῶν…
ltx/gr_gr_cog/me.m01.d09:meMA.Ode9C1T.melody	@ltx/gr_gr_cog/he.h.m8:heHE.EfrixePasaAkoi.name
ltx/gr_gr_cog/me.m01.d09:meMA.Ode9C1T.mode	@ltx/gr_gr_cog/miscellanea:misc.Mode8
ltx/gr_gr_cog/me.m01.d09:meMA.Ode9C1T.ode	@ltx/gr_gr_cog/miscellanea:misc.Ode9
ltx/gr_gr_cog/me.m01.d09:meMA.Ode9C1T.text	Νόμου τε σὺ καὶ Προφητῶν, τὸ κεφάλαιον Χριστὸν καὶ τὸ πλήρωμα, Πάναγνε τέτοκας, διʼ εὐσπλαγχνίας, ἄπειρον πέλαγος, ἐνανθρωπῆσαι διʼ ἡμᾶς, ἐκ σοῦ εὐδοκήσαντα, καὶ διασώσαντα, τοὺς ἐν πίστει σε ἀεὶ μεγαλύνοντας.
ltx/gr_gr_cog/me.m01.d09:meMA.Ode9H.greekmelody	@ltx/gr_gr_cog/he.h.m8:heHE.EfrixePasaAkoi.greekname
ltx/gr_gr_cog/me.m01.d09:meMA.Ode9H.incipit	@ltx/gr_gr_cog/he.h.m8:heHE.EfrixePasaAkoi.incipit
ltx/gr_gr_cog/me.m01.d09:meMA.Ode9H.melody	@ltx/gr_gr_cog/he.h.m8:heHE.EfrixePasaAkoi.melody
ltx/gr_gr_cog/me.m01.d09:meMA.Ode9H.mode	@ltx/gr_gr_cog/miscellanea:misc.Mode8
ltx/gr_gr_cog/me.m01.d09:meMA.Ode9H.ode	@ltx/gr_gr_cog/miscellanea:misc.Ode9
ltx/gr_gr_cog/me.m01.d09:meMA.Ode9H.text	@ltx/gr_gr_cog/he.h.m8:heHE.EfrixePasaAkoi.text
ltx/gr_gr_cog/me.m01.d09:meMA.Oikos1.text	Ἐν Ἰορδάνῃ ποταμῷ, ὁ Κτίστης τῶν ἁπάντων, τὴν κάραν ὑποκλίνας, τὸ Βάπτισμα λαμβάνει· καὶ τῶν δρακόντων κεφαλὰς ἀοράτως συνθλάσας, ῥώμην παρέσχε τοῖς βροτοῖς κατὰ τοῦ μεγαλόφρονος, τοῦ πρὶν ἐν Παραδείσῳ πτερνίσαντος τὸν Ἀδάμ, ἐν βρώσει τῇ τοῦ ξύλου, καὶ θανάτῳ ὑποβαλόντος αὐτὸν παρʼ ἐλπίδα. Διὸ ὁ ἀθλητὴς νῦν Πολύευκτος, κολακείαις γυναικὸς μὴ ὑποκύψας, ἤθλησε στεῤῥῶς, προτείνας τὴν κάραν, ἥνπερ ἀποτμηθεῖσα, τὸν δόλιον ᾔσχυνε.
ltx/gr_gr_cog/me.m01.d09:meVE.Apolytikion1.greekmelody	@ltx/gr_gr_cog/he.a.m4:heAU.TachyProkatalave.greekname
ltx/gr_gr_cog/me.m01.d09:meVE.Apolytikion1.incipit	@ltx/gr_gr_cog/he.ga:heGA.OMartysSouKyrie.incipit
ltx/gr_gr_cog/me.m01.d09:meVE.Apolytikion1.melody	@ltx/gr_gr_cog/he.a.m4:heAU.TachyProkatalave.name
ltx/gr_gr_cog/me.m01.d09:meVE.Apolytikion1.mode	@ltx/gr_gr_cog/miscellanea:misc.Mode4
ltx/gr_gr_cog/me.m01.d09:meVE.Apolytikion1.text	@ltx/gr_gr_cog/he.ga:heGA.OMartysSouKyrie.text
ltx/gr_gr_cog/me.m01.d09:meVE.Apolytikion2.incipit	@ltx/gr_gr_cog/me.m01.d06:meVE.Apolytikion1.incipit
ltx/gr_gr_cog/me.m01.d09:meVE.Apolytikion2.melody	
ltx/gr_gr_cog/me.m01.d09:meVE.Apolytikion2.mode	@ltx/gr_gr_cog/miscellanea:misc.Mode1
ltx/gr_gr_cog/me.m01.d09:meVE.Apolytikion2.text	@ltx/gr_gr_cog/me.m01.d06:meVE.Apolytikion1.text
ltx/gr_gr_cog/me.m01.d09:meVE.AposGlory.incipit	@ltx/gr_gr_cog/me.m01.d06:meVE.Lity1.incipit
ltx/gr_gr_cog/me.m01.d09:meVE.AposGlory.melody	
ltx/gr_gr_cog/me.m01.d09:meVE.AposGlory.mode	@ltx/gr_gr_cog/miscellanea:misc.Mode4
ltx/gr_gr_cog/me.m01.d09:meVE.AposGlory.poet	@ltx/gr_gr_cog/poets:po.KosmaMonachou
ltx/gr_gr_cog/me.m01.d09:meVE.AposGlory.text	@ltx/gr_gr_cog/me.m01.d06:meVE.Lity1.text
ltx/gr_gr_cog/me.m01.d09:meVE.Aposticha1.greekmelody	@ltx/gr_gr_cog/he.a.m6:heAU.TriimerosAnestis.greekname
ltx/gr_gr_cog/me.m01.d09:meVE.Aposticha1.incipit	Ἐπέστης ἐν τοῖς ὕδασιν, ὁ…
ltx/gr_gr_cog/me.m01.d09:meVE.Aposticha1.melody	@ltx/gr_gr_cog/he.a.m6:heAU.TriimerosAnestis.name
ltx/gr_gr_cog/me.m01.d09:meVE.Aposticha1.mode	@ltx/gr_gr_cog/miscellanea:misc.Mode6
ltx/gr_gr_cog/me.m01.d09:meVE.Aposticha1.text	Ἐπέστης ἐν τοῖς ὕδασιν, ὁ πᾶσιν ἀκατάληπτος, τῷ Προδρόμῳ, ὑποκλίνας κεφαλήν· καὶ κόσμον ἁγιάσας, δουλείας ἐλυτρώσω, τῷ βαπτισμῷ σου Ἀναμάρτητε.
ltx/gr_gr_cog/me.m01.d09:meVE.Aposticha2.incipit	Υἱὸν ἀγαπητὸν ὁ Πατήρ, ἐκ…
ltx/gr_gr_cog/me.m01.d09:meVE.Aposticha2.melody	@ltx/gr_gr_cog/he.a.m6:heAU.TriimerosAnestis.name
ltx/gr_gr_cog/me.m01.d09:meVE.Aposticha2.mode	@ltx/gr_gr_cog/miscellanea:misc.Mode6
ltx/gr_gr_cog/me.m01.d09:meVE.Aposticha2.text	Υἱὸν ἀγαπητὸν ὁ Πατήρ, ἐκ τῶν ὑψίστων ἄνωθεν, καὶ τὸ Πνεῦμα ἐμαρτύρει σε Χριστέ· διʼ οὗ τὸ τῆς Τριάδος, μυστήριον ἐγνώσθη, ἐν Ἰορδάνῃ βαπτισθέντος σου.
ltx/gr_gr_cog/me.m01.d09:meVE.Aposticha3.incipit	Ἡγίασας τὰ ῥεῖθρα Σωτήρ, τοῦ…
ltx/gr_gr_cog/me.m01.d09:meVE.Aposticha3.melody	@ltx/gr_gr_cog/he.a.m6:heAU.TriimerosAnestis.name
ltx/gr_gr_cog/me.m01.d09:meVE.Aposticha3.mode	@ltx/gr_gr_cog/miscellanea:misc.Mode6
ltx/gr_gr_cog/me.m01.d09:meVE.Aposticha3.text	Ἡγίασας τὰ ῥεῖθρα Σωτήρ, τοῦ Ἰορδάνου ἅπαντα, καὶ τὴν φύσιν, τῶν ὑδάτων ὡς Θεός· διό σε καὶ δοξάζει, τὸ γένος τῶν ἀνθρώπων, καὶ ἀνυμνεῖ σὴν Ἐπιφάνειαν.
ltx/gr_gr_cog/me.m01.d09:meVE.SticBoth.incipit	@ltx/gr_gr_cog/me.m01.d06:meVE.Aposticha3.incipit
ltx/gr_gr_cog/me.m01.d09:meVE.SticBoth.melody	
ltx/gr_gr_cog/me.m01.d09:meVE.SticBoth.mode	@ltx/gr_gr_cog/miscellanea:misc.Mode2
ltx/gr_gr_cog/me.m01.d09:meVE.SticBoth.poet	@ltx/gr_gr_cog/poets:po.Anatoliou
ltx/gr_gr_cog/me.m01.d09:meVE.SticBoth.text	@ltx/gr_gr_cog/me.m01.d06:meVE.Aposticha3.text
ltx/gr_gr_cog/me.m01.d09:meVE.SticGlory.incipit	Τὰ τῶν Ἀγγέλων στρατεύματα, σήμερον…
ltx/gr_gr_cog/me.m01.d09:meVE.SticGlory.melody	
ltx/gr_gr_cog/me.m01.d09:meVE.SticGlory.mode	@ltx/gr_gr_cog/miscellanea:misc.Mode1
ltx/gr_gr_cog/me.m01.d09:meVE.SticGlory.poet	@ltx/gr_gr_cog/poets:po.Vyzantos
ltx/gr_gr_cog/me.m01.d09:meVE.SticGlory.text	Τὰ τῶν Ἀγγέλων στρατεύματα, σήμερον χορεύουσιν, ἐπὶ τῇ μνήμῃ τοῦ Μάρτυρος Πολυεύκτου, καὶ τῶν ἀνθρώπων τὸ γένος, πιστῶς πανηγυρίζει, καὶ χαρμονικῶς ἐκβοᾷ. Χαίροις Πανεύφημε, ὁ τοῦ πολυπλόκου Βελίαρ, τὰ ἔνέδρα τροπωσάμενος, καὶ τῆς νίκης τὸν στέφανον, παρὰ Χριστοῦ ἀναδησάμενος. Χαίροις Στρατιῶτα τοῦ μεγάλου Βασιλέως, καὶ Σωτῆρος ἡμῶν, ὁ τοὺς βωμοὺς τῶν εἰδώλων καταστρεψάμενος. Χαίροις Μαρτύρων ἐγκαλλώπισμα. Πρέσβευε λυτρωθῆναι ἀπὸ πάσης ἀνάγκης, τοὺς ἐν πίστει ἐκτελοῦντας, τὴν ἀεισέβαστον μνήμην σου.
ltx/gr_gr_cog/me.m01.d09:meVE.Stichera01.greekmelody	@ltx/gr_gr_cog/he.a.m8:heAU.KyrieEiKaiKritirio.greekname
ltx/gr_gr_cog/me.m01.d09:meVE.Stichera01.incipit	Κύριε, εἰ καὶ Ἰωάννῃ παρέστης…
ltx/gr_gr_cog/me.m01.d09:meVE.Stichera01.melody	@ltx/gr_gr_cog/he.a.m8:heAU.KyrieEiKaiKritirio.name
ltx/gr_gr_cog/me.m01.d09:meVE.Stichera01.mode	@ltx/gr_gr_cog/miscellanea:misc.Mode8
ltx/gr_gr_cog/me.m01.d09:meVE.Stichera01.text	Κύριε, εἰ καὶ Ἰωάννῃ παρέστης, ἐν Ἰορδάνῃ ὡς ἄνθρωπος, ἀλλʼ οὐκ ἀπελείφθης τοῦ θρόνου, τῷ Πατρὶ συγκαθεζόμενος· καὶ βαπτισθεὶς διʼ ἡμᾶς, τὸν κόσμον ἠλευθέρωσας, ἐκ τῆς δουλείας τοῦ ἀλλοτρίου, ὡς οἰκτίρμων καὶ φιλάνθρωπος.
ltx/gr_gr_cog/me.m01.d09:meVE.Stichera02.incipit	Κύριε, εἰ καὶ Ἰορδάνου τὰ…
ltx/gr_gr_cog/me.m01.d09:meVE.Stichera02.melody	@ltx/gr_gr_cog/he.a.m8:heAU.KyrieEiKaiKritirio.name
ltx/gr_gr_cog/me.m01.d09:meVE.Stichera02.mode	@ltx/gr_gr_cog/miscellanea:misc.Mode8
ltx/gr_gr_cog/me.m01.d09:meVE.Stichera02.text	Κύριε, εἰ καὶ Ἰορδάνου τὰ ῥεῖθρα, περιεβάλου ὡς ἄνθρωπος, ἀλλʼ ἐμαρτυρήθης ἐξ ὕψους, τῇ καταβάσει τοῦ Πνεύματος, καὶ ἡ φωνὴ τοῦ Πατρός, Υἱόν σε ἐμαρτύρησεν· ἀλλʼ ἐμφάνηθι καὶ παράσχου, ἀφθαρσίαν ταῖς ψυχαῖς ἡμῶν.
ltx/gr_gr_cog/me.m01.d09:meVE.Stichera03.incipit	Κύριε, σὺ ἐκ τοῦ Πατρὸς…
ltx/gr_gr_cog/me.m01.d09:meVE.Stichera03.melody	@ltx/gr_gr_cog/he.a.m8:heAU.KyrieEiKaiKritirio.name
ltx/gr_gr_cog/me.m01.d09:meVE.Stichera03.mode	@ltx/gr_gr_cog/miscellanea:misc.Mode8
ltx/gr_gr_cog/me.m01.d09:meVE.Stichera03.text	Κύριε, σὺ ἐκ τοῦ Πατρὸς πρὸ αἰώνων, γεννηθεὶς ὁ ἀναλλοίωτος, ἦλθες ἐπʼ ἐσχάτων τῶν χρόνων, καὶ μορφὴν δούλου ἀνέλαβες, καὶ τὴν εἰκόνα τὴν σήν, ὡς Κτίστης ἀνεκαίνισας· βαπτισθεὶς γὰρ ἐδωρήσω, ἀφθαρσίαν ταῖς ψυχαῖς ἡμῶν.
ltx/gr_gr_cog/me.m01.d09:meVE.Stichera04.greekmelody	@ltx/gr_gr_cog/he.a.m1:heAU.TonOuranionTagmaton.greekname
ltx/gr_gr_cog/me.m01.d09:meVE.Stichera04.incipit	Δαυϊτικῶς ὡς ἐκ λάκκου, ταλαιπωρίας…
ltx/gr_gr_cog/me.m01.d09:meVE.Stichera04.melody	@ltx/gr_gr_cog/he.a.m1:heAU.TonOuranionTagmaton.name
ltx/gr_gr_cog/me.m01.d09:meVE.Stichera04.mode	@ltx/gr_gr_cog/miscellanea:misc.Mode1
ltx/gr_gr_cog/me.m01.d09:meVE.Stichera04.text	Δαυϊτικῶς ὡς ἐκ λάκκου, ταλαιπωρίας Χριστός, καὶ ἐκ πηλοῦ ἰλύος, τῶν εἰδώλων τῆς πλάνης, ἀνήγαγέ σε Μάρτυς· ἔστησε γάρ, ἐπὶ πέτραν τοὺς πόδας σου, τῆς ἑαυτοῦ ἐπιγνώσεως μυστικῶς· ὃν ἱκέτευε σωθῆναι ἡμᾶς.
ltx/gr_gr_cog/me.m01.d09:meVE.Stichera05.incipit	Οὔτε συζύγου ὁ πόθος, οὔτε…
ltx/gr_gr_cog/me.m01.d09:meVE.Stichera05.melody	@ltx/gr_gr_cog/he.a.m1:heAU.TonOuranionTagmaton.name
ltx/gr_gr_cog/me.m01.d09:meVE.Stichera05.mode	@ltx/gr_gr_cog/miscellanea:misc.Mode1
ltx/gr_gr_cog/me.m01.d09:meVE.Stichera05.text	Οὔτε συζύγου ὁ πόθος, οὔτε τῶν τέκνων στοργή, οὐ κηδεστοῦ ἀξία, οὔτε περιουσία, κτημάτων ἢ χρημάτων, σοῦ τὸ στεῤῥόν, τῆς ψυχῆς παρεσάλευσαν, ἀπὸ τῆς Πίστεως ὄντως τῆς εἰς Χριστόν, παμμακάριστε Πολύευκτε.
ltx/gr_gr_cog/me.m01.d09:meVE.Stichera06.incipit	Καὶ πρὸ τῆς χάριτος Μάκαρ…
ltx/gr_gr_cog/me.m01.d09:meVE.Stichera06.melody	@ltx/gr_gr_cog/he.a.m1:heAU.TonOuranionTagmaton.name
ltx/gr_gr_cog/me.m01.d09:meVE.Stichera06.mode	@ltx/gr_gr_cog/miscellanea:misc.Mode1
ltx/gr_gr_cog/me.m01.d09:meVE.Stichera06.text	Καὶ πρὸ τῆς χάριτος Μάκαρ, τῆς σῆς ἀθλήσεως, δικαιοσύνης ἔργοις, ἀληθῶς ἐκοσμήθης· ὅθεν μετὰ ταῦτα, Μάρτυς πιστός, ἠξιώθης γενέσθαι Χριστοῦ, ἐν τῷ ἰδίῳ σου αἵματι βαπτισθείς, εἰς τὸν θάνατον αὐτοῦ εὐσεβῶς.
