ltx/gr_gr_cog/le.ep.me.m10.d10:lemeLI.Epistle.book_abbr	@ltx/gr_gr_cog/le.ep.me.m09.d02:lemeLI.Epistle.book_abbr
ltx/gr_gr_cog/le.ep.me.m10.d10:lemeLI.Epistle.book_string	@ltx/gr_gr_cog/le.ep.me.m09.d02:lemeLI.Epistle.book_string
ltx/gr_gr_cog/le.ep.me.m10.d10:lemeLI.Epistle.chapverse	@ltx/gr_gr_cog/le.ep.me.m09.d02:lemeLI.Epistle.chapverse
ltx/gr_gr_cog/le.ep.me.m10.d10:lemeLI.Epistle.incipit	@ltx/gr_gr_cog/le.ep.me.m09.d02:lemeLI.Epistle.incipit
ltx/gr_gr_cog/le.ep.me.m10.d10:lemeLI.Epistle.text	@ltx/gr_gr_cog/le.ep.me.m09.d02:lemeLI.Epistle.text
ltx/gr_gr_cog/le.ep.me.m10.d10:lemeLI.Epistle.title	Τῶν Μαρτύρων
ltx/gr_gr_cog/le.ep.me.m10.d10:lemeLI.Epistle.title_abbr	Τῶν Μαρτύρων
ltx/gr_gr_cog/le.ep.me.m10.d10:lemeLI.Epistle.version	@ltx/gr_gr_cog/le.ep.me.m09.d02:lemeLI.Epistle.version
