ltx/gr_gr_cog/me.m08.d26:meDA.commemoration.first	Μνήμη τῶν Ἁγίων Μαρτύρων Ἀδριανοῦ καὶ Ναταλίας
ltx/gr_gr_cog/me.m08.d26:meDA.commemoration.first_name	
ltx/gr_gr_cog/me.m08.d26:meDA.commemoration.first_short	Μνήμη τῶν Ἁγίων Μαρτύρων Ἀδριανοῦ καὶ Ναταλίας
ltx/gr_gr_cog/me.m08.d26:meDA.commemoration.first_title	@ltx/gr_gr_cog/titles:ti.Saints
ltx/gr_gr_cog/me.m08.d26:meDA.commemoration.full	Μνήμη τῶν Ἁγίων Μαρτύρων Ἀδριανοῦ καὶ Ναταλίας
ltx/gr_gr_cog/me.m08.d26:meDA.commemoration.second_name	
ltx/gr_gr_cog/me.m08.d26:meDA.commemoration.second_title	
ltx/gr_gr_cog/me.m08.d26:meDA.date	Τῌ ΚϚʹ ΑΥΓΟΥΣΤΟΥ
ltx/gr_gr_cog/me.m08.d26:meDA.fordate	διὰ τὴν 26ην Αὐγούστου
ltx/gr_gr_cog/me.m08.d26:meDA.insert1	καὶ τῶν Ἁγίων Μαρτύρων Ἀδριανοῦ καὶ Ναταλίας,
ltx/gr_gr_cog/me.m08.d26:meDA.insert2	ὧν καὶ τὴν μνήμην ἐπιτελοῦμεν·
ltx/gr_gr_cog/me.m08.d26:meDA.note	
ltx/gr_gr_cog/me.m08.d26:meDA.pdfcoverdate	τῆς 26ης Αὐγούστου,
ltx/gr_gr_cog/me.m08.d26:meDA.pdfheaderdate	τῆς 26ης Αὐγούστου
ltx/gr_gr_cog/me.m08.d26:meHO.commemorations	
ltx/gr_gr_cog/me.m08.d26:meHO.note1	
ltx/gr_gr_cog/me.m08.d26:meHO.note2	
ltx/gr_gr_cog/me.m08.d26:meHO.number	
ltx/gr_gr_cog/me.m08.d26:meHO.rank	
ltx/gr_gr_cog/me.m08.d26:meLE.commemoration1	Τῶν Ἁγίων Μαρτύρων Ἀδριανοῦ καὶ Ναταλίας.
ltx/gr_gr_cog/me.m08.d26:meLE.commemoration2	
ltx/gr_gr_cog/me.m08.d26:meLI.Kontakion1.greekmelody	@ltx/gr_gr_cog/me.m08.d26:meMA.Kontakion1.greekmelody
ltx/gr_gr_cog/me.m08.d26:meLI.Kontakion1.incipit	@ltx/gr_gr_cog/me.m08.d26:meMA.Kontakion1.incipit
ltx/gr_gr_cog/me.m08.d26:meLI.Kontakion1.melody	@ltx/gr_gr_cog/me.m08.d26:meMA.Kontakion1.melody
ltx/gr_gr_cog/me.m08.d26:meLI.Kontakion1.mode	@ltx/gr_gr_cog/me.m08.d26:meMA.Kontakion1.mode
ltx/gr_gr_cog/me.m08.d26:meLI.Kontakion1.text	@ltx/gr_gr_cog/me.m08.d26:meMA.Kontakion1.text
ltx/gr_gr_cog/me.m08.d26:meLI.Megalynarion.text	
ltx/gr_gr_cog/me.m08.d26:meMA.C1.poet	@ltx/gr_gr_cog/poets:po.Theofanous
ltx/gr_gr_cog/me.m08.d26:meMA.C1.title	@ltx/gr_gr_cog/titles:ti.CanonSaints
ltx/gr_gr_cog/me.m08.d26:meMA.C1.verse	@ltx/gr_gr_cog/prayers:pr.verse_SaintsM.text
ltx/gr_gr_cog/me.m08.d26:meMA.ExapTheotokion.incipit	Σὲ προστασίαν ἄμαχον, καὶ φρουρὰν…
ltx/gr_gr_cog/me.m08.d26:meMA.ExapTheotokion.melody	@ltx/gr_gr_cog/he.a.m2:heAU.ToisMathitaisSynelthomen.name
ltx/gr_gr_cog/me.m08.d26:meMA.ExapTheotokion.mode	@ltx/gr_gr_cog/miscellanea:misc.Mode2
ltx/gr_gr_cog/me.m08.d26:meMA.ExapTheotokion.text	Σὲ προστασίαν ἄμαχον, καὶ φρουρὰν Παναγία, καὶ σκέπην καὶ κραταίωμα, καὶ ἀπόρθητον τεῖχος, καὶ ἀῤῥαγῆ σωτηρίαν, καὶ ὀχύρωμα θεῖον, ὁ κόσμος ἅπας κέκτηται, ἐν ἀνάγκαις, ποικίλαις. Ἀλλʼ ὦ Θεοῦ, τοῦ παμβασιλέως Μήτηρ καὶ δούλη, σῴζοις κᾀμὲ τὸν δοῦλόν σου, ἐκ παντοίων κινδύνων.
ltx/gr_gr_cog/me.m08.d26:meMA.Exaposteilarion1.greekmelody	@ltx/gr_gr_cog/he.a.m2:heAU.ToisMathitaisSynelthomen.greekname
ltx/gr_gr_cog/me.m08.d26:meMA.Exaposteilarion1.incipit	Ἀδριανὸς ὁ πάνσοφος, καὶ ἀήττητος…
ltx/gr_gr_cog/me.m08.d26:meMA.Exaposteilarion1.melody	@ltx/gr_gr_cog/he.a.m2:heAU.ToisMathitaisSynelthomen.name
ltx/gr_gr_cog/me.m08.d26:meMA.Exaposteilarion1.mode	@ltx/gr_gr_cog/miscellanea:misc.Mode2
ltx/gr_gr_cog/me.m08.d26:meMA.Exaposteilarion1.text	Ἀδριανὸς ὁ πάνσοφος, καὶ ἀήττητος μάρτυς, ὡς ἀθλητῶν ἑδραίωμα, παρʼ ἡμῶν δοξαζέσθω, σὺν τῇ σεπτῇ Ναταλίᾳ, τούτοις τε συνεκλάμπει, μαρτύρων δῆμος Ἅγιος, φάλαγξ τροπαιοφόρος, ὧν τὴν λαμπράν, ἐκτελοῦντες μνήμην τούτους ὑμνοῦμεν· καὶ γὰρ αὐτοὶ πρεσβεύουσι, τῷ Χριστῷ ὑπὲρ πάντων.
ltx/gr_gr_cog/me.m08.d26:meMA.Kontakion1.greekmelody	@ltx/gr_gr_cog/he.a.m4:heAU.EpefanisSimeron.greekname
ltx/gr_gr_cog/me.m08.d26:meMA.Kontakion1.incipit	Γυναικὸς θεόφρονος τοὺς θείους λόγους…
ltx/gr_gr_cog/me.m08.d26:meMA.Kontakion1.melody	@ltx/gr_gr_cog/he.a.m4:heAU.EpefanisSimeron.name
ltx/gr_gr_cog/me.m08.d26:meMA.Kontakion1.mode	@ltx/gr_gr_cog/miscellanea:misc.Mode4
ltx/gr_gr_cog/me.m08.d26:meMA.Kontakion1.text	Γυναικὸς θεόφρονος τοὺς θείους λόγους, ἐν καρδίᾳ θέμενος, Ἀδριανὲ μάρτυς Χριστοῦ, ἐν τοῖς βασάνοις προσέδραμες, σὺν τῇ συζύγῳ τὸ στέφος δεξάμενος.
ltx/gr_gr_cog/me.m08.d26:meMA.Lauds1.greekmelody	@ltx/gr_gr_cog/he.a.m8:heAU.OTouParadoxou.greekname
ltx/gr_gr_cog/me.m08.d26:meMA.Lauds1.incipit	Ἀδριανὲ γενναιότατε, τῆς τοῦ Δεσπότου…
ltx/gr_gr_cog/me.m08.d26:meMA.Lauds1.melody	@ltx/gr_gr_cog/he.a.m8:heAU.OTouParadoxou.name
ltx/gr_gr_cog/me.m08.d26:meMA.Lauds1.mode	@ltx/gr_gr_cog/miscellanea:misc.Mode8
ltx/gr_gr_cog/me.m08.d26:meMA.Lauds1.text	Ἀδριανὲ γενναιότατε, τῆς τοῦ Δεσπότου φωνῆς, πληρωτὴς ἐχρημάτισας, κοσμικὴν τερπνότητα, ἀποθέμενος ἅπασαν, καὶ τὸν Σταυρὸν ἐπʼ ὤμων ἀράμενος, τῶν παθῶν τούτου κοινωνὸς γέγονας· ἐν ἀμφοτέροις γάρ, ὤφθης ὄντως δόκιμος· ὅθεν πιστοί, σήμερον γεραίρομεν, τὴν θείαν μνήμην σου.
ltx/gr_gr_cog/me.m08.d26:meMA.Lauds2.incipit	Ἀδριανὲ καρτερώτατε, πελάγει τῶν αἰκισμῶν…
ltx/gr_gr_cog/me.m08.d26:meMA.Lauds2.melody	@ltx/gr_gr_cog/he.a.m8:heAU.OTouParadoxou.name
ltx/gr_gr_cog/me.m08.d26:meMA.Lauds2.mode	@ltx/gr_gr_cog/miscellanea:misc.Mode8
ltx/gr_gr_cog/me.m08.d26:meMA.Lauds2.text	Ἀδριανὲ καρτερώτατε, πελάγει τῶν αἰκισμῶν, συνεχῶς κυματούμενος, πηδαλιουχοῦσάν σε, σοῦ τὴν σύνοικον ἔσχηκας, καὶ πρὸς γαλήνης, ὅρμον ἰθύνουσαν, τῇ ἄνω πόλει προσεμβιβάζουσαν, ἐν ᾗ πανεύφημε, μάρτυς αὐλιζόμενος, ὑπὲρ ἡμῶν, πρέσβευε δεόμεθα, τῶν εὐφημούντων σε.
ltx/gr_gr_cog/me.m08.d26:meMA.Lauds3.incipit	Μέχρι δεσμῶν καὶ στρεβλώσεων, καὶ…
ltx/gr_gr_cog/me.m08.d26:meMA.Lauds3.melody	@ltx/gr_gr_cog/he.a.m8:heAU.OTouParadoxou.name
ltx/gr_gr_cog/me.m08.d26:meMA.Lauds3.mode	@ltx/gr_gr_cog/miscellanea:misc.Mode8
ltx/gr_gr_cog/me.m08.d26:meMA.Lauds3.text	Μέχρι δεσμῶν καὶ στρεβλώσεων, καὶ τῶν μελῶν ἐκκοπῆς, καρτερῶς ἀνθιστάμενοι, τὰς ψυχὰς τῷ Κτίσαντι, ἀποδόντες εἰλήφατε, τὴν αἰωνίαν ὄντως ἀνάπαυσιν, καὶ τὴν ἀγήρω μακαριότητα. Ὢ ἧς ἐτύχατε, θείας ἀντιδόσεως παρὰ Χριστοῦ, μάρτυρες πανένδοξοι, σεβασμιώτατοι!
ltx/gr_gr_cog/me.m08.d26:meMA.LaudsGlory.incipit	Ὁ πάντα προγινώσκων Κύριος, ἀῤῥήτῳ…
ltx/gr_gr_cog/me.m08.d26:meMA.LaudsGlory.melody	
ltx/gr_gr_cog/me.m08.d26:meMA.LaudsGlory.mode	@ltx/gr_gr_cog/miscellanea:misc.Mode2
ltx/gr_gr_cog/me.m08.d26:meMA.LaudsGlory.text	Ὁ πάντα προγινώσκων Κύριος, ἀῤῥήτῳ προμηθείᾳ σε Μάρτυς, ὡς εὔκαρπον κλῆμα προσήκατο, ξίφει μαρτυρίου ποικίλως τεμνόμενον, καρτερίας δαψιλοῦς ἐπιφέροντα καρπούς, ἐξ ὧν τρέφονται πιστῶν καρδίαι, τῶν εὐφημούντων σε πόθῳ, Ἀδριανὲ ἔνδοξε.
ltx/gr_gr_cog/me.m08.d26:meMA.LaudsTheotokion.incipit	@ltx/gr_gr_cog/ho.ho23:hoCA.Troparion7.incipit
ltx/gr_gr_cog/me.m08.d26:meMA.LaudsTheotokion.melody	
ltx/gr_gr_cog/me.m08.d26:meMA.LaudsTheotokion.mode	@ltx/gr_gr_cog/miscellanea:misc.Mode2
ltx/gr_gr_cog/me.m08.d26:meMA.LaudsTheotokion.text	@ltx/gr_gr_cog/ho.ho23:hoCA.Troparion7.text
ltx/gr_gr_cog/me.m08.d26:meMA.MM.Lauds1123as5678.text	@ltx/gr_gr_cog/properties:media.key
ltx/gr_gr_cog/me.m08.d26:meMA.Ode1C11.greekmelody	@ltx/gr_gr_cog/he.h.m6:heHE.OsEnIpeiroPezefsas.greekname
ltx/gr_gr_cog/me.m08.d26:meMA.Ode1C11.incipit	Ἐν τῇ νυκτί με τοῦ…
ltx/gr_gr_cog/me.m08.d26:meMA.Ode1C11.melody	@ltx/gr_gr_cog/he.h.m6:heHE.OsEnIpeiroPezefsas.name
ltx/gr_gr_cog/me.m08.d26:meMA.Ode1C11.mode	@ltx/gr_gr_cog/miscellanea:misc.Mode6
ltx/gr_gr_cog/me.m08.d26:meMA.Ode1C11.ode	@ltx/gr_gr_cog/miscellanea:misc.Ode1
ltx/gr_gr_cog/me.m08.d26:meMA.Ode1C11.text	Ἐν τῇ νυκτί με τοῦ βίου ὕπνῳ δεινῷ συσχεθέντα πράξεσι, μετανοίας πρὸς τὸ φῶς, ὁ Θεὸς ἐξέγειρον εὐχαῖς, τῶν μαρτύρων σου Χριστέ, ἵνα δοξάζω σε.
ltx/gr_gr_cog/me.m08.d26:meMA.Ode1C12.incipit	Ἀπὸ χειλέων σταζόντων τὸν γλυκασμὸν…
ltx/gr_gr_cog/me.m08.d26:meMA.Ode1C12.melody	@ltx/gr_gr_cog/he.h.m6:heHE.OsEnIpeiroPezefsas.name
ltx/gr_gr_cog/me.m08.d26:meMA.Ode1C12.mode	@ltx/gr_gr_cog/miscellanea:misc.Mode6
ltx/gr_gr_cog/me.m08.d26:meMA.Ode1C12.ode	@ltx/gr_gr_cog/miscellanea:misc.Ode1
ltx/gr_gr_cog/me.m08.d26:meMA.Ode1C12.text	Ἀπὸ χειλέων σταζόντων τὸν γλυκασμὸν τῆς ἐνθέου γνώσεως, γλυκανθεὶς Ἀδριανέ, τὸν ἰὸν ἐξήμεσας τῆς πρὶν ἀγνωσίας ἀληθῶς θεομακάριστε.
ltx/gr_gr_cog/me.m08.d26:meMA.Ode1C13.incipit	Ἀνατολῆς λαμπροτέραν ἡλιακῆς, τὴν ψυχὴν…
ltx/gr_gr_cog/me.m08.d26:meMA.Ode1C13.melody	@ltx/gr_gr_cog/he.h.m6:heHE.OsEnIpeiroPezefsas.name
ltx/gr_gr_cog/me.m08.d26:meMA.Ode1C13.mode	@ltx/gr_gr_cog/miscellanea:misc.Mode6
ltx/gr_gr_cog/me.m08.d26:meMA.Ode1C13.ode	@ltx/gr_gr_cog/miscellanea:misc.Ode1
ltx/gr_gr_cog/me.m08.d26:meMA.Ode1C13.text	Ἀνατολῆς λαμπροτέραν ἡλιακῆς, τὴν ψυχὴν ὡς ἔχουσα, τῆς ἀθλήσεως πρὸς φῶς, συνωθεῖς ὁμόζυγον τὸν σόν, Ναταλία, γυναικῶν τὸ ἐγκαλλώπισμα.
ltx/gr_gr_cog/me.m08.d26:meMA.Ode1C1T.incipit	Τὸν σεαυτῆς δεξαμένη Δημιουργόν, ὡς…
ltx/gr_gr_cog/me.m08.d26:meMA.Ode1C1T.melody	@ltx/gr_gr_cog/he.h.m6:heHE.OsEnIpeiroPezefsas.name
ltx/gr_gr_cog/me.m08.d26:meMA.Ode1C1T.mode	@ltx/gr_gr_cog/miscellanea:misc.Mode6
ltx/gr_gr_cog/me.m08.d26:meMA.Ode1C1T.ode	@ltx/gr_gr_cog/miscellanea:misc.Ode1
ltx/gr_gr_cog/me.m08.d26:meMA.Ode1C1T.text	Τὸν σεαυτῆς δεξαμένη Δημιουργόν, ὡς αὐτὸς ἠθέλησεν, ἐξ ἀσπόρου σου γαστρός, ὑπὲρ νοῦν σαρκούμενον Ἁγνή, τῶν κτισμάτων, ἀληθῶς ἐδείχθης Δέσποινα.
ltx/gr_gr_cog/me.m08.d26:meMA.Ode3C11.greekmelody	@ltx/gr_gr_cog/he.h.m6:heHE.OukEstinAgios.greekname
ltx/gr_gr_cog/me.m08.d26:meMA.Ode3C11.incipit	Δεσμὰ φυγὼν εἰδωλικῆς, ματαιότητος μάρτυς…
ltx/gr_gr_cog/me.m08.d26:meMA.Ode3C11.melody	@ltx/gr_gr_cog/he.h.m6:heHE.OukEstinAgios.name
ltx/gr_gr_cog/me.m08.d26:meMA.Ode3C11.mode	@ltx/gr_gr_cog/miscellanea:misc.Mode6
ltx/gr_gr_cog/me.m08.d26:meMA.Ode3C11.ode	@ltx/gr_gr_cog/miscellanea:misc.Ode3
ltx/gr_gr_cog/me.m08.d26:meMA.Ode3C11.text	Δεσμὰ φυγὼν εἰδωλικῆς, ματαιότητος μάρτυς, συνεδέθης τῷ πόθῳ, τῆς ἀγάπης τοῦ Χριστοῦ, καὶ τοῖς δεσμοῖς τῶν αὐτοῦ, ἀθλοφόρων, χαίρων ἐκοινώνησας.
ltx/gr_gr_cog/me.m08.d26:meMA.Ode3C12.incipit	Μοχλῷ τὰ σκέλη σιδηρῷ, συνθλαττόμενοι…
ltx/gr_gr_cog/me.m08.d26:meMA.Ode3C12.melody	@ltx/gr_gr_cog/he.h.m6:heHE.OukEstinAgios.name
ltx/gr_gr_cog/me.m08.d26:meMA.Ode3C12.mode	@ltx/gr_gr_cog/miscellanea:misc.Mode6
ltx/gr_gr_cog/me.m08.d26:meMA.Ode3C12.ode	@ltx/gr_gr_cog/miscellanea:misc.Ode3
ltx/gr_gr_cog/me.m08.d26:meMA.Ode3C12.text	Μοχλῷ τὰ σκέλη σιδηρῷ, συνθλαττόμενοι πάντες, ἀθλοφόροι Κυρίου, ἀσεβείας τὰ ὀστᾶ, ὑπομονῆς τῷ μοχλῷ, καὶ ἀνδρείας, ὄντως συνετρίψατε.
ltx/gr_gr_cog/me.m08.d26:meMA.Ode3C13.incipit	Πυρὶ ἀγάπης θεϊκῆς, τὴν ψυχὴν…
ltx/gr_gr_cog/me.m08.d26:meMA.Ode3C13.melody	@ltx/gr_gr_cog/he.h.m6:heHE.OukEstinAgios.name
ltx/gr_gr_cog/me.m08.d26:meMA.Ode3C13.mode	@ltx/gr_gr_cog/miscellanea:misc.Mode6
ltx/gr_gr_cog/me.m08.d26:meMA.Ode3C13.ode	@ltx/gr_gr_cog/miscellanea:misc.Ode3
ltx/gr_gr_cog/me.m08.d26:meMA.Ode3C13.text	Πυρὶ ἀγάπης θεϊκῆς, τὴν ψυχὴν φλεγομένη, τοῦ συζύγου ἐξῆψας, τὸν ἔρωτα εἰς Χριστόν, τὸν πόθον τὸν τῆς σαρκὸς Ναταλία, τέλεον μιμήσασα.
ltx/gr_gr_cog/me.m08.d26:meMA.Ode3C1T.incipit	Τοῦ θείου τόκου σου Ἁγνὴ…
ltx/gr_gr_cog/me.m08.d26:meMA.Ode3C1T.melody	@ltx/gr_gr_cog/he.h.m6:heHE.OukEstinAgios.name
ltx/gr_gr_cog/me.m08.d26:meMA.Ode3C1T.mode	@ltx/gr_gr_cog/miscellanea:misc.Mode6
ltx/gr_gr_cog/me.m08.d26:meMA.Ode3C1T.ode	@ltx/gr_gr_cog/miscellanea:misc.Ode3
ltx/gr_gr_cog/me.m08.d26:meMA.Ode3C1T.text	Τοῦ θείου τόκου σου Ἁγνὴ πᾶσαν φύσεως τάξιν, ὑπερβαίνει τὸ θαῦμα· Θεὸν γὰρ ὑπερφυῶς, συνέλαβες ἐν γαστρί, καὶ τεκοῦσα, μένεις ἀειπάρθενος.
ltx/gr_gr_cog/me.m08.d26:meMA.Ode3H.greekmelody	@ltx/gr_gr_cog/he.h.m6:heHE.OukEstinAgios.greekname
ltx/gr_gr_cog/me.m08.d26:meMA.Ode3H.incipit	@ltx/gr_gr_cog/he.h.m6:heHE.OukEstinAgios.incipit
ltx/gr_gr_cog/me.m08.d26:meMA.Ode3H.melody	@ltx/gr_gr_cog/he.h.m6:heHE.OukEstinAgios.melody
ltx/gr_gr_cog/me.m08.d26:meMA.Ode3H.mode	@ltx/gr_gr_cog/miscellanea:misc.Mode6
ltx/gr_gr_cog/me.m08.d26:meMA.Ode3H.ode	@ltx/gr_gr_cog/miscellanea:misc.Ode3
ltx/gr_gr_cog/me.m08.d26:meMA.Ode3H.text	@ltx/gr_gr_cog/he.h.m6:heHE.OukEstinAgios.text
ltx/gr_gr_cog/me.m08.d26:meMA.Ode3Kathisma1.greekmelody	@ltx/gr_gr_cog/he.a.m8:heAU.TinSofianKaiLogon.greekname
ltx/gr_gr_cog/me.m08.d26:meMA.Ode3Kathisma1.incipit	Τῶν μαρτύρων τοῖς πόνοις περιπλακείς…
ltx/gr_gr_cog/me.m08.d26:meMA.Ode3Kathisma1.melody	@ltx/gr_gr_cog/he.a.m8:heAU.TinSofianKaiLogon.name
ltx/gr_gr_cog/me.m08.d26:meMA.Ode3Kathisma1.mode	@ltx/gr_gr_cog/miscellanea:misc.Mode8
ltx/gr_gr_cog/me.m08.d26:meMA.Ode3Kathisma1.text	Τῶν μαρτύρων τοῖς πόνοις περιπλακείς, καὶ ἀνδρείως τῇ πίστει καθοπλισθείς, προθύμως ἀνέθηκας, σεαυτὸν τῷ Κυρίῳ σου, καὶ τοῦ ἐχθροῦ κατέβαλες, τὸ θράσος τῇ χάριτι, Ἀδριανὲ παμμάκαρ, Χριστοῦ μάρτυς ἔνδοξε· ὅθεν Ναταλία, ἐναθλοῦντα ὁρῶσα, ἐπήλειφε λόγοις σε, σωτηρίοις πανεύφημε. Διὰ τοῦτο βοῶμέν σοι· Πρέσβευε Χριστῷ τῷ Θεῷ, τῶν πταισμάτων ἄφεσιν δωρήσασθαι, τοῖς ἑορτάζουσι πόθῳ, τὴν ἁγίαν μνήμην σου.
ltx/gr_gr_cog/me.m08.d26:meMA.Ode3KathismaSt.incipit	@ltx/gr_gr_cog/me.m11.d15:meMA.Ode3KathismaSt.incipit
ltx/gr_gr_cog/me.m08.d26:meMA.Ode3KathismaSt.melody	@ltx/gr_gr_cog/he.a.m8:heAU.TinSofianKaiLogon.name
ltx/gr_gr_cog/me.m08.d26:meMA.Ode3KathismaSt.mode	@ltx/gr_gr_cog/miscellanea:misc.Mode8
ltx/gr_gr_cog/me.m08.d26:meMA.Ode3KathismaSt.text	@ltx/gr_gr_cog/me.m11.d15:meMA.Ode3KathismaSt.text
ltx/gr_gr_cog/me.m08.d26:meMA.Ode3KathismaT.incipit	@ltx/gr_gr_cog/me.m02.d17:meMA.Ode3KathismaT.incipit
ltx/gr_gr_cog/me.m08.d26:meMA.Ode3KathismaT.melody	@ltx/gr_gr_cog/he.a.m8:heAU.TinSofianKaiLogon.name
ltx/gr_gr_cog/me.m08.d26:meMA.Ode3KathismaT.mode	@ltx/gr_gr_cog/miscellanea:misc.Mode8
ltx/gr_gr_cog/me.m08.d26:meMA.Ode3KathismaT.text	@ltx/gr_gr_cog/me.m02.d17:meMA.Ode3KathismaT.text
ltx/gr_gr_cog/me.m08.d26:meMA.Ode4C11.greekmelody	@ltx/gr_gr_cog/he.h.m6:heHE.ChristosMouDynamis.greekname
ltx/gr_gr_cog/me.m08.d26:meMA.Ode4C11.incipit	Χριστὸν οἱ μάρτυρες, ἰσχὺν τιθέμενοι…
ltx/gr_gr_cog/me.m08.d26:meMA.Ode4C11.melody	@ltx/gr_gr_cog/he.h.m6:heHE.ChristosMouDynamis.name
ltx/gr_gr_cog/me.m08.d26:meMA.Ode4C11.mode	@ltx/gr_gr_cog/miscellanea:misc.Mode6
ltx/gr_gr_cog/me.m08.d26:meMA.Ode4C11.ode	@ltx/gr_gr_cog/miscellanea:misc.Ode4
ltx/gr_gr_cog/me.m08.d26:meMA.Ode4C11.text	Χριστὸν οἱ μάρτυρες, ἰσχὺν τιθέμενοι, τὸ ἀνίσχυρον θράσος τῶν διωκτῶν, ὄντως κατεπάτησαν, καὶ τὰ βραβεῖα τῆς νίκης, οὐρανόθεν ἐκομίσαντο.
ltx/gr_gr_cog/me.m08.d26:meMA.Ode4C12.incipit	Οἰκείοις αἵμασι, στολὴν ἐξύφανας, σεαυτῷ…
ltx/gr_gr_cog/me.m08.d26:meMA.Ode4C12.melody	@ltx/gr_gr_cog/he.h.m6:heHE.ChristosMouDynamis.name
ltx/gr_gr_cog/me.m08.d26:meMA.Ode4C12.mode	@ltx/gr_gr_cog/miscellanea:misc.Mode6
ltx/gr_gr_cog/me.m08.d26:meMA.Ode4C12.ode	@ltx/gr_gr_cog/miscellanea:misc.Ode4
ltx/gr_gr_cog/me.m08.d26:meMA.Ode4C12.text	Οἰκείοις αἵμασι, στολὴν ἐξύφανας, σεαυτῷ ἀφθαρσίας ἀποβαλών, τῆς φθορᾶς τὸ ἔνδυμα, καὶ τῷ Θεῷ Ἀδριανέ, μετὰ δόξης νῦν παρίστασαι.
ltx/gr_gr_cog/me.m08.d26:meMA.Ode4C13.incipit	Ἰχῶρσι πάντοθεν, περιῤῥεόμενον, τῶν Ἁγίων…
ltx/gr_gr_cog/me.m08.d26:meMA.Ode4C13.melody	@ltx/gr_gr_cog/he.h.m6:heHE.ChristosMouDynamis.name
ltx/gr_gr_cog/me.m08.d26:meMA.Ode4C13.mode	@ltx/gr_gr_cog/miscellanea:misc.Mode6
ltx/gr_gr_cog/me.m08.d26:meMA.Ode4C13.ode	@ltx/gr_gr_cog/miscellanea:misc.Ode4
ltx/gr_gr_cog/me.m08.d26:meMA.Ode4C13.text	Ἰχῶρσι πάντοθεν, περιῤῥεόμενον, τῶν Ἁγίων τὸ αἷμα, μύρον Θεῷ, ὄντως προσενήνεκται, τὴν σηπεδόνα τῆς πλάνης, ἐκκαθαῖρον κραταιότατα.
ltx/gr_gr_cog/me.m08.d26:meMA.Ode4C14.incipit	Δολίοις ῥήμασιν, Ἀδὰμ πεπλάνηται, τῆς…
ltx/gr_gr_cog/me.m08.d26:meMA.Ode4C14.melody	@ltx/gr_gr_cog/he.h.m6:heHE.ChristosMouDynamis.name
ltx/gr_gr_cog/me.m08.d26:meMA.Ode4C14.mode	@ltx/gr_gr_cog/miscellanea:misc.Mode6
ltx/gr_gr_cog/me.m08.d26:meMA.Ode4C14.ode	@ltx/gr_gr_cog/miscellanea:misc.Ode4
ltx/gr_gr_cog/me.m08.d26:meMA.Ode4C14.text	Δολίοις ῥήμασιν, Ἀδὰμ πεπλάνηται, τῆς συζύγου, τοῖς σοῖς δὲ Ἀδριανός, πλάνης ἀπαλλάττεται, καὶ πρὸς Παράδεισον χαρά, Ναταλία εἰσοικίζεται.
ltx/gr_gr_cog/me.m08.d26:meMA.Ode4C1T.incipit	Ὡς ὄντως ἄφθεγκτα, καὶ ἀκατάληπτα…
ltx/gr_gr_cog/me.m08.d26:meMA.Ode4C1T.melody	@ltx/gr_gr_cog/he.h.m6:heHE.ChristosMouDynamis.name
ltx/gr_gr_cog/me.m08.d26:meMA.Ode4C1T.mode	@ltx/gr_gr_cog/miscellanea:misc.Mode6
ltx/gr_gr_cog/me.m08.d26:meMA.Ode4C1T.ode	@ltx/gr_gr_cog/miscellanea:misc.Ode4
ltx/gr_gr_cog/me.m08.d26:meMA.Ode4C1T.text	Ὡς ὄντως ἄφθεγκτα, καὶ ἀκατάληπτα, τὰ τῆς σῆς Θεοτόκε θεοπρεποῦς, πέφυκε κυήσεως, τοῖς ἐπὶ γῆς καὶ οὐρανοῦ, ἀειπαρθένε μυστήρια.
ltx/gr_gr_cog/me.m08.d26:meMA.Ode5C11.greekmelody	@ltx/gr_gr_cog/he.h.m6:heHE.ToTheioFengeiSou.greekname
ltx/gr_gr_cog/me.m08.d26:meMA.Ode5C11.incipit	Δεκὰς διπλῆ ἡ τῶν ἀθλητῶν…
ltx/gr_gr_cog/me.m08.d26:meMA.Ode5C11.melody	@ltx/gr_gr_cog/he.h.m6:heHE.ToTheioFengeiSou.name
ltx/gr_gr_cog/me.m08.d26:meMA.Ode5C11.mode	@ltx/gr_gr_cog/miscellanea:misc.Mode6
ltx/gr_gr_cog/me.m08.d26:meMA.Ode5C11.ode	@ltx/gr_gr_cog/miscellanea:misc.Ode5
ltx/gr_gr_cog/me.m08.d26:meMA.Ode5C11.text	Δεκὰς διπλῆ ἡ τῶν ἀθλητῶν, σὺν ἁπλῇ τριάδι τῷ Χριστῷ νῦν συνδεόμενοι ἔλυσαν, δέσιν ἀσεβείας ὄντως ἀνίσχυρον, ἰσχὺϊ τῆς Τριάδος οἱ γενναιότατοι.
ltx/gr_gr_cog/me.m08.d26:meMA.Ode5C12.incipit	Ἥλιος ὥσπερ μέσον ἑστώς, ἄστρων…
ltx/gr_gr_cog/me.m08.d26:meMA.Ode5C12.melody	@ltx/gr_gr_cog/he.h.m6:heHE.ToTheioFengeiSou.name
ltx/gr_gr_cog/me.m08.d26:meMA.Ode5C12.mode	@ltx/gr_gr_cog/miscellanea:misc.Mode6
ltx/gr_gr_cog/me.m08.d26:meMA.Ode5C12.ode	@ltx/gr_gr_cog/miscellanea:misc.Ode5
ltx/gr_gr_cog/me.m08.d26:meMA.Ode5C12.text	Ἥλιος ὥσπερ μέσον ἑστώς, ἄστρων φαεινῶν, Ἀδριανὲ τῶν σῶν συνάθλων ἀπήστραψας, φέγγος εὐσεβείας, τῆς ἀσεβείας ἀχλύν, διώξας καὶ φωτίσας κόσμου τὰ πέρατα.
ltx/gr_gr_cog/me.m08.d26:meMA.Ode5C13.incipit	Δρόσος ῥημάτων σου τῶν σεπτῶν…
ltx/gr_gr_cog/me.m08.d26:meMA.Ode5C13.melody	@ltx/gr_gr_cog/he.h.m6:heHE.ToTheioFengeiSou.name
ltx/gr_gr_cog/me.m08.d26:meMA.Ode5C13.mode	@ltx/gr_gr_cog/miscellanea:misc.Mode6
ltx/gr_gr_cog/me.m08.d26:meMA.Ode5C13.ode	@ltx/gr_gr_cog/miscellanea:misc.Ode5
ltx/gr_gr_cog/me.m08.d26:meMA.Ode5C13.text	Δρόσος ῥημάτων σου τῶν σεπτῶν, ἴαμα τῶν πόνων ἀληθῶς, τοῦ σοῦ συζύγου γεγένηται, ἀπογενομένων τῇ τῶν κρειττόνων στοργῇ, θεόφρον Ναταλία μαρτύρων σύσκηνε.
ltx/gr_gr_cog/me.m08.d26:meMA.Ode5C1T.incipit	Τοὺς Θεοτόκον σε ἐκ ψυχῆς…
ltx/gr_gr_cog/me.m08.d26:meMA.Ode5C1T.melody	@ltx/gr_gr_cog/he.h.m6:heHE.ToTheioFengeiSou.name
ltx/gr_gr_cog/me.m08.d26:meMA.Ode5C1T.mode	@ltx/gr_gr_cog/miscellanea:misc.Mode6
ltx/gr_gr_cog/me.m08.d26:meMA.Ode5C1T.ode	@ltx/gr_gr_cog/miscellanea:misc.Ode5
ltx/gr_gr_cog/me.m08.d26:meMA.Ode5C1T.text	Τοὺς Θεοτόκον σε ἐκ ψυχῆς, Δέσποινα τοῦ κόσμου ἀγαθή, ὑμνολογοῦντας διάσωσον· σὲ γὰρ προστασίαν ἀκαταμάχητον, κεκτήμεθα, τὴν ὄντως Θεογεννήτριαν.
ltx/gr_gr_cog/me.m08.d26:meMA.Ode6C11.greekmelody	@ltx/gr_gr_cog/he.h.m6:heHE.TouViouTinThalassan.greekname
ltx/gr_gr_cog/me.m08.d26:meMA.Ode6C11.incipit	Χριστοῦ κυβερνώμενοι, τῇ παλάμῃ ἀβλαβῶς…
ltx/gr_gr_cog/me.m08.d26:meMA.Ode6C11.melody	@ltx/gr_gr_cog/he.h.m6:heHE.TouViouTinThalassan.name
ltx/gr_gr_cog/me.m08.d26:meMA.Ode6C11.mode	@ltx/gr_gr_cog/miscellanea:misc.Mode6
ltx/gr_gr_cog/me.m08.d26:meMA.Ode6C11.ode	@ltx/gr_gr_cog/miscellanea:misc.Ode6
ltx/gr_gr_cog/me.m08.d26:meMA.Ode6C11.text	Χριστοῦ κυβερνώμενοι, τῇ παλάμῃ ἀβλαβῶς, τῆς ἀθεΐας πέλαγος, διήλθετε καὶ ὅρμῳ τῷ γαληνῷ, τῆς ἄνω λαμπρότητος, ἀθληταὶ τοῦ Κυρίου προσωρμίσθητε.
ltx/gr_gr_cog/me.m08.d26:meMA.Ode6C12.incipit	Ὡς ἄνθη μυρίζουσι, τῶν ἀγώνων…
ltx/gr_gr_cog/me.m08.d26:meMA.Ode6C12.melody	@ltx/gr_gr_cog/he.h.m6:heHE.TouViouTinThalassan.name
ltx/gr_gr_cog/me.m08.d26:meMA.Ode6C12.mode	@ltx/gr_gr_cog/miscellanea:misc.Mode6
ltx/gr_gr_cog/me.m08.d26:meMA.Ode6C12.ode	@ltx/gr_gr_cog/miscellanea:misc.Ode6
ltx/gr_gr_cog/me.m08.d26:meMA.Ode6C12.text	Ὡς ἄνθη μυρίζουσι, τῶν ἀγώνων σου σοφέ, τὰ ὑπὲρ φύσιν ἔπαθλα· καὶ γὰρ Θεοῦ ἐδείχθης, Ἀδριανέ, εὐῶδες θυμίαμα, τῷ πυρὶ τῶν βασάνων πυρπολούμενος.
ltx/gr_gr_cog/me.m08.d26:meMA.Ode6C13.incipit	Τῷ κάλλει τῆς πίστεως, ἡ…
ltx/gr_gr_cog/me.m08.d26:meMA.Ode6C13.melody	@ltx/gr_gr_cog/he.h.m6:heHE.TouViouTinThalassan.name
ltx/gr_gr_cog/me.m08.d26:meMA.Ode6C13.mode	@ltx/gr_gr_cog/miscellanea:misc.Mode6
ltx/gr_gr_cog/me.m08.d26:meMA.Ode6C13.ode	@ltx/gr_gr_cog/miscellanea:misc.Ode6
ltx/gr_gr_cog/me.m08.d26:meMA.Ode6C13.text	Τῷ κάλλει τῆς πίστεως, ἡ ἁγία σου ψυχή, ὡραϊσμένη πάνσεμνε, καὶ τὸ κάλλος ζητοῦσα, ὡς ἀληθῶς, Χριστοῦ τὸ ἀμήχανον, Ναταλία τοῦ πόθου οὐ διήμαρτες.
ltx/gr_gr_cog/me.m08.d26:meMA.Ode6C1T.incipit	Ἡ πάναγνος Δέσποινα, ἡ τεκοῦσα…
ltx/gr_gr_cog/me.m08.d26:meMA.Ode6C1T.melody	@ltx/gr_gr_cog/he.h.m6:heHE.TouViouTinThalassan.name
ltx/gr_gr_cog/me.m08.d26:meMA.Ode6C1T.mode	@ltx/gr_gr_cog/miscellanea:misc.Mode6
ltx/gr_gr_cog/me.m08.d26:meMA.Ode6C1T.ode	@ltx/gr_gr_cog/miscellanea:misc.Ode6
ltx/gr_gr_cog/me.m08.d26:meMA.Ode6C1T.text	Ἡ πάναγνος Δέσποινα, ἡ τεκοῦσα τοῖς βροτοῖς, τὸν κυβερνήτην Κύριον, τῶν παθῶν μου τὸν ἄστατον καὶ δεινόν, κατεύνασον τάραχον, καὶ γαλήνην παράσχου τῇ καρδίᾳ μου.
ltx/gr_gr_cog/me.m08.d26:meMA.Ode6H.greekmelody	@ltx/gr_gr_cog/he.h.m6:heHE.TouViouTinThalassan.greekname
ltx/gr_gr_cog/me.m08.d26:meMA.Ode6H.incipit	@ltx/gr_gr_cog/he.h.m6:heHE.TouViouTinThalassan.incipit
ltx/gr_gr_cog/me.m08.d26:meMA.Ode6H.melody	@ltx/gr_gr_cog/he.h.m6:heHE.TouViouTinThalassan.melody
ltx/gr_gr_cog/me.m08.d26:meMA.Ode6H.mode	@ltx/gr_gr_cog/miscellanea:misc.Mode6
ltx/gr_gr_cog/me.m08.d26:meMA.Ode6H.ode	@ltx/gr_gr_cog/miscellanea:misc.Ode6
ltx/gr_gr_cog/me.m08.d26:meMA.Ode6H.text	@ltx/gr_gr_cog/he.h.m6:heHE.TouViouTinThalassan.text
ltx/gr_gr_cog/me.m08.d26:meMA.Ode7C11.greekmelody	@ltx/gr_gr_cog/he.h.m6:heHE.DrosovolonMenTinKaminon.greekname
ltx/gr_gr_cog/me.m08.d26:meMA.Ode7C11.incipit	Ἀκαθαίρετοι ὡς πύργοι ἀνεδείχθητε, Σιὼν…
ltx/gr_gr_cog/me.m08.d26:meMA.Ode7C11.melody	@ltx/gr_gr_cog/he.h.m6:heHE.DrosovolonMenTinKaminon.name
ltx/gr_gr_cog/me.m08.d26:meMA.Ode7C11.mode	@ltx/gr_gr_cog/miscellanea:misc.Mode6
ltx/gr_gr_cog/me.m08.d26:meMA.Ode7C11.ode	@ltx/gr_gr_cog/miscellanea:misc.Ode7
ltx/gr_gr_cog/me.m08.d26:meMA.Ode7C11.text	Ἀκαθαίρετοι ὡς πύργοι ἀνεδείχθητε, Σιὼν τῆς ἄνω μάρτυρες, ἐδαφίσαντες, ἑλεπόλεις πάσας τοῦ ἐχθροῦ, μοχλῷ τῆς ἀθλήσεως ὑμῶν· διὸ τιμῶμεν εὐσεβῶς ὑμῶν τὴν μνήμην ἀεί.
ltx/gr_gr_cog/me.m08.d26:meMA.Ode7C12.incipit	Βοηθός, Ἀδριανῷ ἡ Ναταλία ὡς…
ltx/gr_gr_cog/me.m08.d26:meMA.Ode7C12.melody	@ltx/gr_gr_cog/he.h.m6:heHE.DrosovolonMenTinKaminon.name
ltx/gr_gr_cog/me.m08.d26:meMA.Ode7C12.mode	@ltx/gr_gr_cog/miscellanea:misc.Mode6
ltx/gr_gr_cog/me.m08.d26:meMA.Ode7C12.ode	@ltx/gr_gr_cog/miscellanea:misc.Ode7
ltx/gr_gr_cog/me.m08.d26:meMA.Ode7C12.text	Βοηθός, Ἀδριανῷ ἡ Ναταλία ὡς καὶ σύμψυχος, παρὰ Θεοῦ δεδώρηται, ἀνελκύουσα, ἐμπαρέντα τοῦτον τῷ βυθῷ, τῆς πλάνης καὶ πείθουσα βοᾶν· Εὐλογητὸς εἶ ὁ Θεός ὁ τῶν Πατέρων ἡμῶν.
ltx/gr_gr_cog/me.m08.d26:meMA.Ode7C13.incipit	Ὡς πολύτιμον θησαύρισμα τοῦ μάρτυρος…
ltx/gr_gr_cog/me.m08.d26:meMA.Ode7C13.melody	@ltx/gr_gr_cog/he.h.m6:heHE.DrosovolonMenTinKaminon.name
ltx/gr_gr_cog/me.m08.d26:meMA.Ode7C13.mode	@ltx/gr_gr_cog/miscellanea:misc.Mode6
ltx/gr_gr_cog/me.m08.d26:meMA.Ode7C13.ode	@ltx/gr_gr_cog/miscellanea:misc.Ode7
ltx/gr_gr_cog/me.m08.d26:meMA.Ode7C13.text	Ὡς πολύτιμον θησαύρισμα τοῦ μάρτυρος, τὴν χεῖρα θησαυρίσασα, οὐ προέδωκας, σωφροσύνης σου τὸν θησαυρόν, συλῆσαι τοῖς σπεύδουσι Σεμνή, κυβερνωμένη τῇ χειρὶ τοῦ τῶν ἁπάντων Θεοῦ.
ltx/gr_gr_cog/me.m08.d26:meMA.Ode7C1T.incipit	Νεανίας τρεῖς ἡ κάμινος οὐκ…
ltx/gr_gr_cog/me.m08.d26:meMA.Ode7C1T.melody	@ltx/gr_gr_cog/he.h.m6:heHE.DrosovolonMenTinKaminon.name
ltx/gr_gr_cog/me.m08.d26:meMA.Ode7C1T.mode	@ltx/gr_gr_cog/miscellanea:misc.Mode6
ltx/gr_gr_cog/me.m08.d26:meMA.Ode7C1T.ode	@ltx/gr_gr_cog/miscellanea:misc.Ode7
ltx/gr_gr_cog/me.m08.d26:meMA.Ode7C1T.text	Νεανίας τρεῖς ἡ κάμινος οὐκ ἔφλεξε, γέννησιν προτυποῦσα τὴν σήν· τὸ γὰρ θεῖον πῦρ σε μὴ φλέξαν, ᾤκησεν ἐν σοί, καὶ πάντας ἐφώτισε βοᾶν· Εὐλογητὸς εἶ ὁ Θεός ὁ τῶν Πατέρων ἡμῶν.
ltx/gr_gr_cog/me.m08.d26:meMA.Ode8C11.greekmelody	@ltx/gr_gr_cog/he.h.m6:heHE.EkFlogosToisOsiois.greekname
ltx/gr_gr_cog/me.m08.d26:meMA.Ode8C11.incipit	Τῷ πυρὶ τῶν βασάνων ὁλοκαυτούμενοι…
ltx/gr_gr_cog/me.m08.d26:meMA.Ode8C11.melody	@ltx/gr_gr_cog/he.h.m6:heHE.EkFlogosToisOsiois.name
ltx/gr_gr_cog/me.m08.d26:meMA.Ode8C11.mode	@ltx/gr_gr_cog/miscellanea:misc.Mode6
ltx/gr_gr_cog/me.m08.d26:meMA.Ode8C11.ode	@ltx/gr_gr_cog/miscellanea:misc.Ode8
ltx/gr_gr_cog/me.m08.d26:meMA.Ode8C11.text	Τῷ πυρὶ τῶν βασάνων ὁλοκαυτούμενοι, ἀσεβείας τὴν φλόγα πᾶσαν ἐσβέσατε, αἵμασιν ὑμῶν, ἀθλοφόροι κραυγάζοντες· Σὲ ὑπερυψοῦμεν, Χριστὲ εἰς τοὺς αἰῶνας.
ltx/gr_gr_cog/me.m08.d26:meMA.Ode8C12.incipit	Οἱ κρουνοὶ τῶν αἱμάτων τῶν…
ltx/gr_gr_cog/me.m08.d26:meMA.Ode8C12.melody	@ltx/gr_gr_cog/he.h.m6:heHE.EkFlogosToisOsiois.name
ltx/gr_gr_cog/me.m08.d26:meMA.Ode8C12.mode	@ltx/gr_gr_cog/miscellanea:misc.Mode6
ltx/gr_gr_cog/me.m08.d26:meMA.Ode8C12.ode	@ltx/gr_gr_cog/miscellanea:misc.Ode8
ltx/gr_gr_cog/me.m08.d26:meMA.Ode8C12.text	Οἱ κρουνοὶ τῶν αἱμάτων τῶν ἀθλοφόρων σου, ποταμοὶ ἰαμάτων κόσμῳ γεγόνασι, θάλασσαν δεινῶν, παθημάτων ξηραίνοντες, οὓς ἀνευφημοῦντες, Χριστὲ σὲ εὐλογοῦμεν.
ltx/gr_gr_cog/me.m08.d26:meMA.Ode8C13.incipit	Γυναικὸς θαυμασίας τίς οὐ θαυμάσειε…
ltx/gr_gr_cog/me.m08.d26:meMA.Ode8C13.melody	@ltx/gr_gr_cog/he.h.m6:heHE.EkFlogosToisOsiois.name
ltx/gr_gr_cog/me.m08.d26:meMA.Ode8C13.mode	@ltx/gr_gr_cog/miscellanea:misc.Mode6
ltx/gr_gr_cog/me.m08.d26:meMA.Ode8C13.ode	@ltx/gr_gr_cog/miscellanea:misc.Ode8
ltx/gr_gr_cog/me.m08.d26:meMA.Ode8C13.text	Γυναικὸς θαυμασίας τίς οὐ θαυμάσειε, τὸ πρὸς Κύριον φίλτρον, ὅπως ἐμίσησεν, ἔρωτα σαρκός, καὶ τὸν σύζυγον ἔπεισε, σέβειν καὶ δοξάζειν, Χριστὸν εἰς τοὺς αἰῶνας.
ltx/gr_gr_cog/me.m08.d26:meMA.Ode8C1T.incipit	Ἐκ φωτὸς φωτοδότην Λόγον συνέλαβες…
ltx/gr_gr_cog/me.m08.d26:meMA.Ode8C1T.melody	@ltx/gr_gr_cog/he.h.m6:heHE.EkFlogosToisOsiois.name
ltx/gr_gr_cog/me.m08.d26:meMA.Ode8C1T.mode	@ltx/gr_gr_cog/miscellanea:misc.Mode6
ltx/gr_gr_cog/me.m08.d26:meMA.Ode8C1T.ode	@ltx/gr_gr_cog/miscellanea:misc.Ode8
ltx/gr_gr_cog/me.m08.d26:meMA.Ode8C1T.text	Ἐκ φωτὸς φωτοδότην Λόγον συνέλαβες, καὶ τεκοῦσα ἀφράστως τοῦτον δεδόξασαι· Πνεῦμα γὰρ ἐν σοί, Κόρη θεῖον ἐσκήνωσεν, ὃν ὑπερυψοῦμεν, εἰς πάντας τοὺς αἰῶνας.
ltx/gr_gr_cog/me.m08.d26:meMA.Ode8H.greekmelody	@ltx/gr_gr_cog/he.h.m6:heHE.EkFlogosToisOsiois.greekname
ltx/gr_gr_cog/me.m08.d26:meMA.Ode8H.incipit	@ltx/gr_gr_cog/he.h.m6:heHE.EkFlogosToisOsiois.incipit
ltx/gr_gr_cog/me.m08.d26:meMA.Ode8H.melody	@ltx/gr_gr_cog/he.h.m6:heHE.EkFlogosToisOsiois.melody
ltx/gr_gr_cog/me.m08.d26:meMA.Ode8H.mode	@ltx/gr_gr_cog/miscellanea:misc.Mode6
ltx/gr_gr_cog/me.m08.d26:meMA.Ode8H.ode	@ltx/gr_gr_cog/miscellanea:misc.Ode8
ltx/gr_gr_cog/me.m08.d26:meMA.Ode8H.text	@ltx/gr_gr_cog/he.h.m6:heHE.EkFlogosToisOsiois.text
ltx/gr_gr_cog/me.m08.d26:meMA.Ode9C11.greekmelody	@ltx/gr_gr_cog/he.h.m6:heHE.TheonAnthropois.greekname
ltx/gr_gr_cog/me.m08.d26:meMA.Ode9C11.incipit	Μελῶν στρεβλώσεις δεινῶν ἐπίτασις, ξίφος…
ltx/gr_gr_cog/me.m08.d26:meMA.Ode9C11.melody	@ltx/gr_gr_cog/he.h.m6:heHE.TheonAnthropois.name
ltx/gr_gr_cog/me.m08.d26:meMA.Ode9C11.mode	@ltx/gr_gr_cog/miscellanea:misc.Mode6
ltx/gr_gr_cog/me.m08.d26:meMA.Ode9C11.ode	@ltx/gr_gr_cog/miscellanea:misc.Ode9
ltx/gr_gr_cog/me.m08.d26:meMA.Ode9C11.text	Μελῶν στρεβλώσεις δεινῶν ἐπίτασις, ξίφος οὐ πῦρ οὐ θάνατος, σαρκὸς ὁ ἐπίκηρος, τοῦ Χριστοῦ τῆς ἀγάπης χωρίσαι ὑμᾶς, ἔνδοξοι ἀθλοφόροι, ὅλως οὐκ ἴσχυσεν· ὅθεν εἰς αἰῶνας, σὺν αὐτῷ ἀεὶ εὐφραίνεσθε.
ltx/gr_gr_cog/me.m08.d26:meMA.Ode9C12.incipit	Στρατὸς ἐχθροῖς πᾶσιν ἀπροσμάχητος, πόλις…
ltx/gr_gr_cog/me.m08.d26:meMA.Ode9C12.melody	@ltx/gr_gr_cog/he.h.m6:heHE.TheonAnthropois.name
ltx/gr_gr_cog/me.m08.d26:meMA.Ode9C12.mode	@ltx/gr_gr_cog/miscellanea:misc.Mode6
ltx/gr_gr_cog/me.m08.d26:meMA.Ode9C12.ode	@ltx/gr_gr_cog/miscellanea:misc.Ode9
ltx/gr_gr_cog/me.m08.d26:meMA.Ode9C12.text	Στρατὸς ἐχθροῖς πᾶσιν ἀπροσμάχητος, πόλις Θεοῦ, καὶ κατωχυρωμένον βασίλειον, κεκλεισμένος Παράδεισος ἄσυλος, φάλαγξ τροπαιοφόρος, δῆμος θεόλεκτος, στῦλοι Ἐκκλησίας, ἀῤῥαγεῖς μάρτυρες ὤφθητε.
ltx/gr_gr_cog/me.m08.d26:meMA.Ode9C13.incipit	Λαμπὰς θεόφωτος ἄστρα φαίνοντα, λύχνος…
ltx/gr_gr_cog/me.m08.d26:meMA.Ode9C13.melody	@ltx/gr_gr_cog/he.h.m6:heHE.TheonAnthropois.name
ltx/gr_gr_cog/me.m08.d26:meMA.Ode9C13.mode	@ltx/gr_gr_cog/miscellanea:misc.Mode6
ltx/gr_gr_cog/me.m08.d26:meMA.Ode9C13.ode	@ltx/gr_gr_cog/miscellanea:misc.Ode9
ltx/gr_gr_cog/me.m08.d26:meMA.Ode9C13.text	Λαμπὰς θεόφωτος ἄστρα φαίνοντα, λύχνος ἡμῖν τὸ φῶς τῆς εὐσεβείας πυρσεύοντες, τοῦ ἡλίου τῆς δόξης αὐγάσματα, τέκνα τῆς ἀνεσπέρου μακαριότητος, μάρτυρες ἐδείχθητε, Χριστοῦ σεβασμιώτατοι.
ltx/gr_gr_cog/me.m08.d26:meMA.Ode9C14.incipit	Πηγὴ ναμάτων πλήρης τοῦ Πνεύματος…
ltx/gr_gr_cog/me.m08.d26:meMA.Ode9C14.melody	@ltx/gr_gr_cog/he.h.m6:heHE.TheonAnthropois.name
ltx/gr_gr_cog/me.m08.d26:meMA.Ode9C14.mode	@ltx/gr_gr_cog/miscellanea:misc.Mode6
ltx/gr_gr_cog/me.m08.d26:meMA.Ode9C14.ode	@ltx/gr_gr_cog/miscellanea:misc.Ode9
ltx/gr_gr_cog/me.m08.d26:meMA.Ode9C14.text	Πηγὴ ναμάτων πλήρης τοῦ Πνεύματος, καὶ ποταμὸς ἐνθέων, χαρισμάτων πληρούμενος, καὶ κρατὴρ ἀθλήσεως, προχέων κρουνούς, πέλαγος σωτηρίας, μάρτυρες ὤφθητε, ζάλης πειρασμῶν, παντοδαπῶν ἡμᾶς λυτρούμενοι.
ltx/gr_gr_cog/me.m08.d26:meMA.Ode9C15.incipit	Χοροῖς μαρτύρων Χριστοῦ πανεύφημε, παρεστηκὼς…
ltx/gr_gr_cog/me.m08.d26:meMA.Ode9C15.melody	@ltx/gr_gr_cog/he.h.m6:heHE.TheonAnthropois.name
ltx/gr_gr_cog/me.m08.d26:meMA.Ode9C15.mode	@ltx/gr_gr_cog/miscellanea:misc.Mode6
ltx/gr_gr_cog/me.m08.d26:meMA.Ode9C15.ode	@ltx/gr_gr_cog/miscellanea:misc.Ode9
ltx/gr_gr_cog/me.m08.d26:meMA.Ode9C15.text	Χοροῖς μαρτύρων Χριστοῦ πανεύφημε, παρεστηκὼς τῷ θρόνῳ, τοῦ τῶν ὅλων δεσπόζοντος, τοὺς τελοῦντας σὴν μνήμην περίσῳζε, πίστει καὶ προθυμίᾳ, πάντων λυτρούμενος, τῶν παρενοχλούντων, πειρασμῶν ταῖς ἱκεσίαις σου.
ltx/gr_gr_cog/me.m08.d26:meMA.Ode9C1T.incipit	Νεκροῖς ἀνάστασις νῦν δεδώρηται, διὰ…
ltx/gr_gr_cog/me.m08.d26:meMA.Ode9C1T.melody	@ltx/gr_gr_cog/he.h.m6:heHE.TheonAnthropois.name
ltx/gr_gr_cog/me.m08.d26:meMA.Ode9C1T.mode	@ltx/gr_gr_cog/miscellanea:misc.Mode6
ltx/gr_gr_cog/me.m08.d26:meMA.Ode9C1T.ode	@ltx/gr_gr_cog/miscellanea:misc.Ode9
ltx/gr_gr_cog/me.m08.d26:meMA.Ode9C1T.text	Νεκροῖς ἀνάστασις νῦν δεδώρηται, διὰ τῆς σῆς ἀφράστου, καὶ ἀῤῥήτου κυήσεως, Θεοτόκε πάνσεμνε· ζωὴ γὰρ ἐκ σοῦ, σάρκα περικειμένη, πᾶσιν ἐξέλαμψε, καὶ τὸ τοῦ θανάτου, ἀμειδὲς σαφῶς διέλυσεν.
ltx/gr_gr_cog/me.m08.d26:meMA.Ode9H.greekmelody	@ltx/gr_gr_cog/he.h.m6:heHE.TheonAnthropois.greekname
ltx/gr_gr_cog/me.m08.d26:meMA.Ode9H.incipit	@ltx/gr_gr_cog/he.h.m6:heHE.TheonAnthropois.incipit
ltx/gr_gr_cog/me.m08.d26:meMA.Ode9H.melody	@ltx/gr_gr_cog/he.h.m6:heHE.TheonAnthropois.melody
ltx/gr_gr_cog/me.m08.d26:meMA.Ode9H.mode	@ltx/gr_gr_cog/miscellanea:misc.Mode6
ltx/gr_gr_cog/me.m08.d26:meMA.Ode9H.ode	@ltx/gr_gr_cog/miscellanea:misc.Ode9
ltx/gr_gr_cog/me.m08.d26:meMA.Ode9H.text	@ltx/gr_gr_cog/he.h.m6:heHE.TheonAnthropois.text
ltx/gr_gr_cog/me.m08.d26:meMA.Oikos1.text	Καιρὸς ἐπέστη τοῖς πιστοῖς, χαρμόσυνος ἡμέρα, Ἀδριανοῦ τοῦ θείου ἐνθέως εὐφρανθῶμεν, ἀναβοῶντες πρὸς αὐτόν· Μάρτυς τοῦ Κυρίου, ὁ τὸν ἀγῶνα τὸν καλὸν σαφῶς ἀγωνισάμενος, καὶ στέφος οὐρανόθεν δεξάμενος τῆς δικαιοσύνης, ἀπὸ πάσης ἐπηρείας τοῦ ἀλλοτρίου ἡμᾶς ῥῦσαι πάντας, ἴασίν τε ψυχῶν καὶ τῶν σωμάτων ἐξαπόστειλον ἡμῖν, καὶ τὴν κηλῖδα πᾶσαν τοῦ νοὸς ἐκκάθαρον οὐρανόθεν, σὺν τῇ συζύγῳ τὸ στέφος δεξάμενος.
ltx/gr_gr_cog/me.m08.d26:meVE.Apolytikion1.greekmelody	@ltx/gr_gr_cog/he.a.m3:heAU.TheiasPisteos.greekname
ltx/gr_gr_cog/me.m08.d26:meVE.Apolytikion1.incipit	Ἀναφαίρετον ὄλβον ἡγήσω, τὴν σωτήριον…
ltx/gr_gr_cog/me.m08.d26:meVE.Apolytikion1.melody	@ltx/gr_gr_cog/he.a.m3:heAU.TheiasPisteos.name
ltx/gr_gr_cog/me.m08.d26:meVE.Apolytikion1.mode	@ltx/gr_gr_cog/miscellanea:misc.Mode3
ltx/gr_gr_cog/me.m08.d26:meVE.Apolytikion1.text	Ἀναφαίρετον ὄλβον ἡγήσω, τὴν σωτήριον πίστιν τρισμάκαρ, καταλιπὼν τὴν πατρῴαν ἀσέβειαν, καὶ τῷ Δεσπότῃ κατʼ ἴχνος ἑπόμενος, κατεπλουτίσθης ἐνθέοις χαρίσμασιν, Ἀδριανὲ ἔνδοξε, Χριστὸν τὸν Θεὸν ἱκέτευε, σωθῆναι τὰς ψυχὰς ἡμῶν.
ltx/gr_gr_cog/me.m08.d26:meVE.AposGlory.incipit	Ὢ ζεῦγος ἄμωμον, καὶ ἐκλεκτὸν…
ltx/gr_gr_cog/me.m08.d26:meVE.AposGlory.melody	
ltx/gr_gr_cog/me.m08.d26:meVE.AposGlory.mode	@ltx/gr_gr_cog/miscellanea:misc.Mode6
ltx/gr_gr_cog/me.m08.d26:meVE.AposGlory.text	Ὢ ζεῦγος ἄμωμον, καὶ ἐκλεκτὸν τῷ Κυρίῳ! ὢ πεποθημένη δυάς, καὶ πεφιλημένη Χριστῷ, ὢ συζυγία ἀρίστη καὶ μακαρία! Τίς οὐκ ἐκπλαγῇ ἐν τούτῳ ἀκουτισθείς, τὰς τούτων ὑπὲρ ἄνθρωπον πράξεις! πῶς τὸ θῆλυ ἠνδρίσατο κατὰ τοῦ πικροῦ τυράννου, καὶ τὸν ταύτης σύνευνον ἐνεύρωσε, μὴ ὑπενδοῦναι τοῖς δεινοῖς, ἀλλʼ ὑπὲρ τῆς πίστεως ἑλέσθαι, τὸ θανεῖν ὑπὲρ τὸ ζῆν; Ὢ θεοπλόκων ῥημάτων Ναταλίας τῆς σοφῆς! ὢ παραινέσεων θείων, τοὺς οὐρανοὺς διασχουσῶν, καὶ πρὸς αὐτὸν τὸν θρόνον τοῦ μεγάλου βασιλέως, Ἀδριανὸν τὸν ἔνδοξον γνώριμον καταστησασῶν! Ἀλλʼ ὦ ξυνωρὶς ἁγία, ὑπὲρ ἡμῶν τῷ Θεῷ ἱκετεύσατε, τῶν ἐκ πόθου τελούντων τὴν μνήμην ὑμῶν, πειρασμῶν ῥυσθῆναι καὶ πάσης θλίψεως.
ltx/gr_gr_cog/me.m08.d26:meVE.AposStavrotheotokion.greekmelody	@ltx/gr_gr_cog/he.a.m6:heAU.TriimerosAnestis.greekname
ltx/gr_gr_cog/me.m08.d26:meVE.AposStavrotheotokion.incipit	@ltx/gr_gr_cog/oc.m6.d4:ocVE.AposTheotokion.incipit
ltx/gr_gr_cog/me.m08.d26:meVE.AposStavrotheotokion.melody	@ltx/gr_gr_cog/he.a.m6:heAU.TriimerosAnestis.name
ltx/gr_gr_cog/me.m08.d26:meVE.AposStavrotheotokion.mode	@ltx/gr_gr_cog/miscellanea:misc.Mode6
ltx/gr_gr_cog/me.m08.d26:meVE.AposStavrotheotokion.text	@ltx/gr_gr_cog/oc.m6.d4:ocVE.AposTheotokion.text
ltx/gr_gr_cog/me.m08.d26:meVE.AposTheotokion.incipit	@ltx/gr_gr_cog/he.o:heOT.TheotokeSyEi.incipit
ltx/gr_gr_cog/me.m08.d26:meVE.AposTheotokion.melody	@ltx/gr_gr_cog/he.o:heOT.TheotokeSyEi.name
ltx/gr_gr_cog/me.m08.d26:meVE.AposTheotokion.mode	@ltx/gr_gr_cog/miscellanea:misc.Mode6
ltx/gr_gr_cog/me.m08.d26:meVE.AposTheotokion.text	@ltx/gr_gr_cog/he.o:heOT.TheotokeSyEiAthloforon.text
ltx/gr_gr_cog/me.m08.d26:meVE.Aposticha1.greekmelody	@ltx/gr_gr_cog/he.a.m1:heAU.PaneffimoiMartyres.greekname
ltx/gr_gr_cog/me.m08.d26:meVE.Aposticha1.incipit	Πορφύραν ἐξ αἵματος τοῦ σοῦ…
ltx/gr_gr_cog/me.m08.d26:meVE.Aposticha1.melody	@ltx/gr_gr_cog/he.a.m1:heAU.PaneffimoiMartyres.name
ltx/gr_gr_cog/me.m08.d26:meVE.Aposticha1.mode	@ltx/gr_gr_cog/miscellanea:misc.Mode1
ltx/gr_gr_cog/me.m08.d26:meVE.Aposticha1.text	Πορφύραν ἐξ αἵματος τοῦ σοῦ, Μάρτυς κατεφοίνιξας, στολὴν μεθʼ ἧς τῷ Δεσπότῃ σου, ὡς ἡ ὑπόσχεσις, νῦν συμβασιλεύεις, ἄθλων ταῖς λαμπρότησι, καὶ θείαις καλλοναῖς σεμνυνόμενος. Χριστὸν ἱκέτευε, δωρηθῆναι ταῖς ψυχαῖς ἡμῶν, τὴν εἰρήνην, καὶ τὸ μέγα ἔλεος.
ltx/gr_gr_cog/me.m08.d26:meVE.Aposticha2.incipit	Ἀδριανὲ Μάρτυς τὰς ὁδούς, τῶν…
ltx/gr_gr_cog/me.m08.d26:meVE.Aposticha2.melody	@ltx/gr_gr_cog/he.a.m1:heAU.PaneffimoiMartyres.name
ltx/gr_gr_cog/me.m08.d26:meVE.Aposticha2.mode	@ltx/gr_gr_cog/miscellanea:misc.Mode1
ltx/gr_gr_cog/me.m08.d26:meVE.Aposticha2.text	Ἀδριανὲ Μάρτυς τὰς ὁδούς, τῶν παθῶν ἐξέκλινας, τῷ σωτηρίῳ ἀγόμενος, δρόμῳ πανεύφημε· καὶ πρὸς τὰς ἀφθάρτους, μονὰς κατεσκήνωσας, σὺν πᾶσι τοῖς Χριστῷ πειθαρχήσασι· μεθʼ ὧν ἱκέτευε, δωρηθῆναι ταῖς ψυχαῖς ἡμῶν, τὴν εἰρήνην, καὶ τὸ μέγα ἔλεος.
ltx/gr_gr_cog/me.m08.d26:meVE.Aposticha3.incipit	Ὢ θαῦμα καινὸν καὶ ἀληθῶς…
ltx/gr_gr_cog/me.m08.d26:meVE.Aposticha3.melody	@ltx/gr_gr_cog/he.a.m1:heAU.PaneffimoiMartyres.name
ltx/gr_gr_cog/me.m08.d26:meVE.Aposticha3.mode	@ltx/gr_gr_cog/miscellanea:misc.Mode1
ltx/gr_gr_cog/me.m08.d26:meVE.Aposticha3.text	Ὢ θαῦμα καινὸν καὶ ἀληθῶς, μέγα καὶ παράδοξον! πῶς Ναταλία ἡ πάνσοφος, τὸν ταύτης σύζυγον, πείθει ὑπομεῖναι, ξίφη κατατέμνοντα; τίς εἶδέ τι τοιοῦτον; τίς ἤκουσεν; ὅν περ ἐκέκτητο, ὀφθαλμὸν βίου πρὸς θάνατον, ἐπεπόθει, προδοῦναι σωτήριον.
ltx/gr_gr_cog/me.m08.d26:meVE.SticGlory.incipit	Ζῆλος ἀνδρὸς εὐσεβοῦς, εἵλκυσε γυναῖκα…
ltx/gr_gr_cog/me.m08.d26:meVE.SticGlory.melody	
ltx/gr_gr_cog/me.m08.d26:meVE.SticGlory.mode	@ltx/gr_gr_cog/miscellanea:misc.Mode1
ltx/gr_gr_cog/me.m08.d26:meVE.SticGlory.poet	@ltx/gr_gr_cog/poets:po.EfraimKarias
ltx/gr_gr_cog/me.m08.d26:meVE.SticGlory.text	Ζῆλος ἀνδρὸς εὐσεβοῦς, εἵλκυσε γυναῖκα θεοφιλῆ, πρὸς παραίνεσιν φαιδράν· Ἀδριανὸς γὰρ ὁ πανάριστος, Ναταλίας τῶν ῥημάτων ὑπαχθείς, ἀθλήσεως τὸν δρόμον ἐκτετέλεκεν· Ὢ γυναικὸς θεοφιλοῦς! οὐχ ὡς γὰρ Εὔα τῷ, Ἀδὰμ ἤνεγκε φθοράν, ἀλλὰ ζωὴν ἄληκτον τῷ συζύγῳ προεξένησε. Ταύτην σὺν τῷ ἀνδρὶ ἐπαινοῦντες, βοήσωμεν Χριστῷ· Δὸς ἡμῖν βοήθειαν, ταῖς πρεσβείαις τῶν Ἁγίων σου.
ltx/gr_gr_cog/me.m08.d26:meVE.SticStavrotheotokion.greekmelody	@ltx/gr_gr_cog/he.a.m1:heAU.TonOuranionTagmaton.greekname
ltx/gr_gr_cog/me.m08.d26:meVE.SticStavrotheotokion.incipit	@ltx/gr_gr_cog/me.m06.d07:meVE.SticStavrotheotokion.incipit
ltx/gr_gr_cog/me.m08.d26:meVE.SticStavrotheotokion.melody	@ltx/gr_gr_cog/he.a.m1:heAU.TonOuranionTagmaton.name
ltx/gr_gr_cog/me.m08.d26:meVE.SticStavrotheotokion.mode	@ltx/gr_gr_cog/miscellanea:misc.Mode1
ltx/gr_gr_cog/me.m08.d26:meVE.SticStavrotheotokion.text	@ltx/gr_gr_cog/me.m06.d07:meVE.SticStavrotheotokion.text
ltx/gr_gr_cog/me.m08.d26:meVE.SticTheotokion.greekmelody	@ltx/gr_gr_cog/he.a.m1:heAU.TonOuranionTagmaton.greekname
ltx/gr_gr_cog/me.m08.d26:meVE.SticTheotokion.incipit	Ἐκ τῆς ἁγίας εἰκόνος τῆς…
ltx/gr_gr_cog/me.m08.d26:meVE.SticTheotokion.melody	@ltx/gr_gr_cog/he.a.m1:heAU.TonOuranionTagmaton.name
ltx/gr_gr_cog/me.m08.d26:meVE.SticTheotokion.mode	@ltx/gr_gr_cog/miscellanea:misc.Mode1
ltx/gr_gr_cog/me.m08.d26:meVE.SticTheotokion.text	Ἐκ τῆς ἁγίας εἰκόνος τῆς σῆς Πανάχραντε, ἰάσεις ἰαμάτων, χορηγοῦνται ἀφθόνως, τοῖς πίστει προσιοῦσιν· ὅθεν κἀμοῦ, τὰς ἀσθενείας ἐπίσκεψαι, καὶ τὴν ψυχήν μου ἐλέησον ἀγαθή, καὶ τὸ σῶμά μου θεράπευσον.
ltx/gr_gr_cog/me.m08.d26:meVE.Stichera01.greekmelody	@ltx/gr_gr_cog/he.a.m4:heAU.OsGennaionEnMartysi.greekname
ltx/gr_gr_cog/me.m08.d26:meVE.Stichera01.incipit	Τὴν ὑπέρτιμον ἄθλησιν, τὰ γενναῖα…
ltx/gr_gr_cog/me.m08.d26:meVE.Stichera01.melody	@ltx/gr_gr_cog/he.a.m4:heAU.OsGennaionEnMartysi.name
ltx/gr_gr_cog/me.m08.d26:meVE.Stichera01.mode	@ltx/gr_gr_cog/miscellanea:misc.Mode4
ltx/gr_gr_cog/me.m08.d26:meVE.Stichera01.text	Τὴν ὑπέρτιμον ἄθλησιν, τὰ γενναῖα παλαίσματα, τῶν μαρτύρων ἔνδοξε θεασάμενος, αὐτομολεῖς πρὸς τὰ σκάμματα, ἀνδρείῳ φρονήματι, ἀφειδήσας τῆς σαρκός, διʼ ἀγάπην τὴν ἔνθεον· ὅθεν ἤνυσας, τοὺς γενναίους ἀγῶνας, ταπεινώσας, τὴν ὀφρὺν τοῦ ἀντιπάλου, Ἀδριανὲ καρτερώτατε.
ltx/gr_gr_cog/me.m08.d26:meVE.Stichera02.incipit	Ταῖς εἱρκταῖς συγκλειόμενος, τοῖς βουνεύροις…
ltx/gr_gr_cog/me.m08.d26:meVE.Stichera02.melody	@ltx/gr_gr_cog/he.a.m4:heAU.OsGennaionEnMartysi.name
ltx/gr_gr_cog/me.m08.d26:meVE.Stichera02.mode	@ltx/gr_gr_cog/miscellanea:misc.Mode4
ltx/gr_gr_cog/me.m08.d26:meVE.Stichera02.text	Ταῖς εἱρκταῖς συγκλειόμενος, τοῖς βουνεύροις τυπτόμενος, τοῖς κλοιοῖς ἀοίδιμε βαρυνόμενος, καὶ τοῖς μοχλοῖς συνθλιβόμενος, σὺν πλείοσι μάρτυσι, σὺν αὐτοῖς τῶν ἀγαθῶν, οὐρανίων ἐπέτυχες, ἐπαλείφουσαν, τὴν ὁμόζυγον ἔχων Ναταλίαν, τὴν Θεῷ πεποθημένην, Ἀδριανὲ γενναιότατε.
ltx/gr_gr_cog/me.m08.d26:meVE.Stichera03.incipit	Τὸν Ἀδὰμ ἡ ὁμόζυγος, Παραδείσου…
ltx/gr_gr_cog/me.m08.d26:meVE.Stichera03.melody	@ltx/gr_gr_cog/he.a.m4:heAU.OsGennaionEnMartysi.name
ltx/gr_gr_cog/me.m08.d26:meVE.Stichera03.mode	@ltx/gr_gr_cog/miscellanea:misc.Mode4
ltx/gr_gr_cog/me.m08.d26:meVE.Stichera03.text	Τὸν Ἀδὰμ ἡ ὁμόζυγος, Παραδείσου ἐξώρισε, συμβουλίᾳ ὄφεως, Ναταλία δέ, Ἀδριανὸν πρὸς Παράδεισον, πανσόφως εἰσήγαγεν, ἱεραῖς προσλαλιαῖς, νουθετοῦσα διδάσκουσα, τὰ ἐπίπονα, τῆς ἀθλήσεως φέρειν οὐρανίους, ἀντιδόσεις προξενοῦντα, καὶ αἰωνίζουσαν εὔκλειαν.
