ltx/gr_gr_cog/le.pr.pe.d095:lemcVE.reading1.book_abbr	@ltx/gr_gr_cog/bible:Micah.abbr
ltx/gr_gr_cog/le.pr.pe.d095:lemcVE.reading1.book_string	@ltx/gr_gr_cog/bible:Micah.text
ltx/gr_gr_cog/le.pr.pe.d095:lemcVE.reading1.chapverse	4,2 – 3, 5, 6,2 – 5, 8, 5,3
ltx/gr_gr_cog/le.pr.pe.d095:lemcVE.reading1.incipit	Τάδε λέγει Κύριος· Ἐκ Σιὼν ἐξελεύσεται νόμος, καὶ λόγος…
ltx/gr_gr_cog/le.pr.pe.d095:lemcVE.reading1.text	Τάδε λέγει Κύριος· Ἐκ Σιὼν ἐξελεύσεται νόμος, καὶ λόγος Κυρίου ἐξ Ἱερουσαλήμ, καὶ κρινεῖ ἀνὰ μέσον λαῶν πολλῶν, καὶ ἐλέγξει ἔθνη ἰσχυρά, ἕως εἰς γῆν μακράν. Ὅτι πάντες οἱ λαοὶ πορεύσονται ἕκαστος τὴν ὁδὸν αὐτοῦ, ἡμεῖς δὲ πορευσόμεθα ἐν ὀνόματι Κυρίου Θεοῦ ἡμῶν, εἰς τὸν αἰῶνα. Τάδε λέγει Κύριος παντοκράτωρ· Ἀκούσατε βουνοί, καὶ φάραγγες, θεμέλια τῆς γῆς, ὅτι κρίσις τῷ Κυρίῳ πρὸς τὸν λαὸν αὐτοῦ· διελεγχθήσεται γὰρ μετὰ τοῦ Ἰσραήλ, λέγων· Λαός μου, τί ἐποίησά σοι, ἢ τί ἐλύπησά σε; ἀποκρίθητί μοι. Διότι ἀνήγαγόν σε ἐκ γῆς Αἰγύπτου, καὶ ἐξ οἴκου δουλείας ἐλυτρωσάμην σε, καὶ ἐξαπέστειλα πρὸ προσώπου σου τὸν Μωϋσῆν καὶ τὸν Ἀαρών. Λαός μου, τί ἐβουλεύσαντο κατὰ σοῦ οἱ ὑπεναντίοι; εἰ ἀνηγγέλη σοι, ἄνθρωπε, τί καλόν, καὶ τί Κύριος ἐκζητεῖ παρὰ σοῦ, ἀλλʼ ἤ, τοῦ ποιεῖν κρῖμα, καὶ ἀγαπᾶν ἔλεος, καὶ ἕτοιμον εἶναι τοῦ πορεύεσθαι μετὰ Κυρίου τοῦ Θεοῦ σου; Διότι ἐν ἰσχύϊ μεγαλυνθήσεται Κύριος, καὶ ποιμανεῖ τὸ ποίμνιον αὐτοῦ ἐν εἰρήνῃ, ἕως ἄκρων τῆς γῆς.
ltx/gr_gr_cog/le.pr.pe.d095:lemcVE.reading1.title	
ltx/gr_gr_cog/le.pr.pe.d095:lemcVE.reading1.title_abbr	
ltx/gr_gr_cog/le.pr.pe.d095:lemcVE.reading1.version	@ltx/gr_gr_cog/properties:version.designation
ltx/gr_gr_cog/le.pr.pe.d095:lemcVE.reading2.book_abbr	@ltx/gr_gr_cog/bible:Isaiah.abbr
ltx/gr_gr_cog/le.pr.pe.d095:lemcVE.reading2.book_string	@ltx/gr_gr_cog/bible:Isaiah.text
ltx/gr_gr_cog/le.pr.pe.d095:lemcVE.reading2.chapverse	ΝΕʹ, 1 – 2· ΙΒʹ, 3 – 4· ΝΕʹ, 2 – 3, 6 – 13
ltx/gr_gr_cog/le.pr.pe.d095:lemcVE.reading2.incipit	Τάδε λέγει Κύριος· οἱ διψῶντες, πορεύεσθε ἐφʼ ὕδωρ, καὶ…
ltx/gr_gr_cog/le.pr.pe.d095:lemcVE.reading2.text	Τάδε λέγει Κύριος· οἱ διψῶντες, πορεύεσθε ἐφʼ ὕδωρ, καὶ ὅσοι μὴ ἔχετε ἀργύριον, βαδίσαντες ἀγοράσατε, καὶ φάγεσθε, καὶ πίεσθε ἄνευ ἀργυρίου καὶ τιμῆς, οἶνον καὶ στέαρ. Ὅτι τάδε λέγει Κύριος Παντοκράτωρ ὑμῖν· Λαός μου, ἀντλήσατε ὕδωρ μετʼ εὐφροσύνης ἐκ τῶν πηγῶν τοῦ σωτηρίου, καὶ ἐρεῖς ἐν τῇ ἡμέρᾳ ἐκείνῃ· Ὑμνεῖτε τὸν Κύριον, βοᾶτε τὸ ὄνομα αὐτοῦ, ἀναγγείλατε ἐν τοῖς ἔθνεσι τὴν δόξαν αὐτοῦ, μιμνῄσκεσθε, ὅτι ὑψώθη τὸ ὄνομα αὐτοῦ. Λαός μου, ἀκούσατέ μου, καὶ φάγεσθε ἀγαθά, καὶ ἐντρυφήσει ἐν ἀγαθοῖς ἡ ψυχὴ ὑμῶν. Προσέχετε τοῖς ὠσὶν ὑμῶν, καὶ ἐπακολουθήσατε ταῖς ὁδοῖς μου, εἰσακούσατέ μου, καὶ ζήσεται ἐν ἀγαθοῖς ἡ ψυχὴ ὑμῶν, καὶ διαθήσομαι ὑμῖν διαθήκην αἰώνιον, καὶ ἐπικαλέσεσθε, ἡνίκα δʼ ἂν ἐγγίζητέ μοι, ἀπολειπέτω ὁ ἀσεβὴς τὰς ὁδοὺς αὐτοῦ, καὶ ἀνὴρ ἄνομος τὰς βουλάς αὐτοῦ, καὶ ἐπιστράφητε πρός με καὶ ἐλεήσω ὑμᾶς καὶ ἀφήσω τὰς ἁμαρτίας ὑμῶν· οὐ γὰρ εἰσὶν αἱ βουλαί μου, ὥσπερ αἱ βουλαι ὑμῶν, λέγει Κύριος, ἀλλʼ ὥσπερ ἀπέχει ὁ οὐρανὸς ἀπὸ τῆς γῆς, οὕτω απέχει ἡ ὁδός μου ἀπὸ τῶν ὁδῶν ὑμῶν, καὶ τὰ διανοήματα ὑμῶν ἀπὸ τῆς διανοίας μου. Ὡς γὰρ ἐὰν καταβῇ ὑετός, ἢ χιὼν ἐκ τοῦ οὐρανοῦ, καὶ οὐ μὴ ἀποστραφῇ ἐκεῖθεν, ἕως ἂν μεθύσῃ τὴν γῆν, καὶ ἐκτέκῃ, καὶ βλαστήσῃ, καὶ δῷ σπέρμα τῷ σπείροντι, καὶ ἄρτον εἰς βρῶσιν, οὕτως ἔσται τὸ ῥῆμά μου, ὃ ἐὰν ἐξέλθη ἐκ τοῦ στόματός μου, οὐ μὴ ἀποστραφῇ πρός με κενόν, ἕως ἂν συντελεσθῇ πάντα ὅσα ἠθέλησα, καὶ εὐοδώσω τὰς ὁδούς μου, καὶ τὰ ἐντάλματά μου. Ἐν γὰρ εὐφροσύνῃ ἐξελεύσεσθε, καὶ ἐν χαρᾷ διδαχθήσεσθε· τὰ γὰρ ὄρη καὶ οἱ βουνοὶ ἐξαλοῦνται προσδεχόμενοι ὑμᾶς ἐν χαρᾷ, καὶ πάντα τὰ ξύλα τοῦ ἀγροῦ ἐπικροτήσει τοῖς κλάδοις αὐτῶν, καὶ ἀντὶ τῆς στοιβῆς, ἀναβήσεται κυπάρισσος, ἀντὶ δὲ τῆς κονύζης, ἀναβήσεται μυρσίνη, καὶ ἔσται Κύριος εἰς ὄνομα, καὶ εἰς σημεῖον αἰώνιον, λέγει Κύριος ὁ Θεός, ὁ ἅγιος Ἰσραήλ.
ltx/gr_gr_cog/le.pr.pe.d095:lemcVE.reading2.title	
ltx/gr_gr_cog/le.pr.pe.d095:lemcVE.reading2.title_abbr	
ltx/gr_gr_cog/le.pr.pe.d095:lemcVE.reading2.version	@ltx/gr_gr_cog/properties:version.designation
ltx/gr_gr_cog/le.pr.pe.d095:lemcVE.reading3.book_abbr	@ltx/gr_gr_cog/le.pr.me.r41:leprVE.reading.book_abbr
ltx/gr_gr_cog/le.pr.pe.d095:lemcVE.reading3.book_string	@ltx/gr_gr_cog/le.pr.me.r41:leprVE.reading.book_string
ltx/gr_gr_cog/le.pr.pe.d095:lemcVE.reading3.chapverse	@ltx/gr_gr_cog/le.pr.me.r41:leprVE.reading.chapverse
ltx/gr_gr_cog/le.pr.pe.d095:lemcVE.reading3.text	@ltx/gr_gr_cog/le.pr.me.r41:leprVE.reading.text
ltx/gr_gr_cog/le.pr.pe.d095:lemcVE.reading3.title	
ltx/gr_gr_cog/le.pr.pe.d095:lemcVE.reading3.title_abbr	
ltx/gr_gr_cog/le.pr.pe.d095:lemcVE.reading3.version	@ltx/gr_gr_cog/properties:version.designation
