ltx/gr_gr_cog/me.m02.d02:meDA.commemoration.first	Ἡ Ὑπαπαντὴ τοῦ Κυρίου
ltx/gr_gr_cog/me.m02.d02:meDA.commemoration.first_name	Ὑπαπαντή
ltx/gr_gr_cog/me.m02.d02:meDA.commemoration.first_short	Ἡ Ὑπαπαντὴ τοῦ Κυρίου
ltx/gr_gr_cog/me.m02.d02:meDA.commemoration.first_title	@ltx/gr_gr_cog/titles:ti.Feast
ltx/gr_gr_cog/me.m02.d02:meDA.commemoration.full	Ἡ Ὑπαπαντὴ τοῦ Κυρίου, καὶ Θεοῦ καὶ Σωτῆρος ἡμῶν Ἰησοῦ Χριστοῦ.
ltx/gr_gr_cog/me.m02.d02:meDA.commemoration.second_name	
ltx/gr_gr_cog/me.m02.d02:meDA.commemoration.second_title	
ltx/gr_gr_cog/me.m02.d02:meDA.date	Τῌ Βʹ ΦΕΒΡΟΥΑΡΙΟΥ
ltx/gr_gr_cog/me.m02.d02:meDA.dismissal	@ltx/gr_gr_cog/dismissals:dis00.meeting
ltx/gr_gr_cog/me.m02.d02:meDA.fordate	διὰ τὴν 2αν Φεβρουαρίου
ltx/gr_gr_cog/me.m02.d02:meDA.insert1	
ltx/gr_gr_cog/me.m02.d02:meDA.insert2	
ltx/gr_gr_cog/me.m02.d02:meDA.note	
ltx/gr_gr_cog/me.m02.d02:meDA.pdfcoverdate	τῆς 2ας Φεβρουαρίου,
ltx/gr_gr_cog/me.m02.d02:meDA.pdfheaderdate	τῆς 2ας Φεβρουαρίου
ltx/gr_gr_cog/me.m02.d02:meHO.commemorations	
ltx/gr_gr_cog/me.m02.d02:meHO.note1	@ltx/gr_gr_cog/rubrical:ru.HolidayFish
ltx/gr_gr_cog/me.m02.d02:meHO.note2	
ltx/gr_gr_cog/me.m02.d02:meHO.number	
ltx/gr_gr_cog/me.m02.d02:meHO.rank	
ltx/gr_gr_cog/me.m02.d02:meLE.commemoration1	Ἡ Ὑπαπαντὴ τοῦ Κυρίου καὶ Θεοῦ καὶ Σωτῆρος ἡμῶν Ἰησοῦ Χριστοῦ.
ltx/gr_gr_cog/me.m02.d02:meLE.commemoration2	
ltx/gr_gr_cog/me.m02.d02:meLI.Kontakion1.incipit	@ltx/gr_gr_cog/me.m02.d02:meMA.Kontakion1.incipit
ltx/gr_gr_cog/me.m02.d02:meLI.Kontakion1.melody	@ltx/gr_gr_cog/me.m02.d02:meMA.Kontakion1.melody
ltx/gr_gr_cog/me.m02.d02:meLI.Kontakion1.mode	@ltx/gr_gr_cog/me.m02.d02:meMA.Kontakion1.mode
ltx/gr_gr_cog/me.m02.d02:meLI.Kontakion1.text	@ltx/gr_gr_cog/me.m02.d02:meMA.Kontakion1.text
ltx/gr_gr_cog/me.m02.d02:meLI.MM.Antiphon2.text	@ltx/gr_gr_cog/properties:media.key
ltx/gr_gr_cog/me.m02.d02:meLI.MM.EntranceHymn.text	@ltx/gr_gr_cog/properties:media.key
ltx/gr_gr_cog/me.m02.d02:meLI.MM.EntranceHymnSunday.text	@ltx/gr_gr_cog/properties:media.key
ltx/gr_gr_cog/me.m02.d02:meLI.Megalynarion.text	Σήμερον ἡ πάναγνος Μαριάμ, τῷ ναῷ προσάγει, ὥσπερ βρέφος τὸν Ποιητήν, Ὃν ἐν ταῖς ἀγκάλαις, ὁ Πρέσβυς δεδεγμένος, Θεὸν αὐτὸν κηρύττει κἂν σάρκα εἴληφε.
ltx/gr_gr_cog/me.m02.d02:meLI.TheotokosHymn.incipit	@ltx/gr_gr_cog/he.h.m3:heHE.EnNomoSkia.incipit
ltx/gr_gr_cog/me.m02.d02:meLI.TheotokosHymn.mode	@ltx/gr_gr_cog/miscellanea:misc.Mode3
ltx/gr_gr_cog/me.m02.d02:meLI.TheotokosHymn.text	@ltx/gr_gr_cog/he.h.m3:heHE.EnNomoSkia.text
ltx/gr_gr_cog/me.m02.d02:meLI.TheotokosHymnVerse.incipit	@ltx/gr_gr_cog/me.m02.d02:meMA.Ode9C1MTh.incipit
ltx/gr_gr_cog/me.m02.d02:meLI.TheotokosHymnVerse.text	@ltx/gr_gr_cog/me.m02.d02:meMA.Ode9C1MTh.text
ltx/gr_gr_cog/me.m02.d02:meMA.C1.acrostic.notice1	οὗ ἡ Ἀκροστιχίς·
ltx/gr_gr_cog/me.m02.d02:meMA.C1.acrostic.text	Χριστὸν γεγηθὼς Πρέσβυς ἀγκαλίζεται.
ltx/gr_gr_cog/me.m02.d02:meMA.C1.acrostic.title	Ὁ Κανών,
ltx/gr_gr_cog/me.m02.d02:meMA.C1.poet	@ltx/gr_gr_cog/poets:po.KosmaMonachou
ltx/gr_gr_cog/me.m02.d02:meMA.C1.title	@ltx/gr_gr_cog/titles:ti.CanonFeast
ltx/gr_gr_cog/me.m02.d02:meMA.C1.verse	@ltx/gr_gr_cog/prayers:pr.verse_God.text
ltx/gr_gr_cog/me.m02.d02:meMA.Exaposteilarion1.greekmelody	@ltx/gr_gr_cog/he.a.m3:heAU.EnPnevmatiToIero.greekname
ltx/gr_gr_cog/me.m02.d02:meMA.Exaposteilarion1.incipit	@ltx/gr_gr_cog/he.a.m3:heAU.EnPnevmatiToIero.incipit
ltx/gr_gr_cog/me.m02.d02:meMA.Exaposteilarion1.melody	@ltx/gr_gr_cog/he.a.m3:heAU.EnPnevmatiToIero.melody
ltx/gr_gr_cog/me.m02.d02:meMA.Exaposteilarion1.mode	@ltx/gr_gr_cog/miscellanea:misc.Mode3
ltx/gr_gr_cog/me.m02.d02:meMA.Exaposteilarion1.text	@ltx/gr_gr_cog/he.a.m3:heAU.EnPnevmatiToIero.text
ltx/gr_gr_cog/me.m02.d02:meMA.Kathisma11.greekmelody	@ltx/gr_gr_cog/he.a.m1:heAU.ChorosAngelikos.greekname
ltx/gr_gr_cog/me.m02.d02:meMA.Kathisma11.incipit	@ltx/gr_gr_cog/he.a.m1:heAU.ChorosAngelikos.incipit
ltx/gr_gr_cog/me.m02.d02:meMA.Kathisma11.melody	@ltx/gr_gr_cog/he.a.m1:heAU.ChorosAngelikos.melody
ltx/gr_gr_cog/me.m02.d02:meMA.Kathisma11.mode	@ltx/gr_gr_cog/miscellanea:misc.Mode1
ltx/gr_gr_cog/me.m02.d02:meMA.Kathisma11.text	@ltx/gr_gr_cog/he.a.m1:heAU.ChorosAngelikos.text
ltx/gr_gr_cog/me.m02.d02:meMA.Kathisma21.greekmelody	@ltx/gr_gr_cog/he.a.m1:heAU.TonTafonSouSotir.greekname
ltx/gr_gr_cog/me.m02.d02:meMA.Kathisma21.incipit	Ὁ ὢν σὺν τῷ Πατρί…
ltx/gr_gr_cog/me.m02.d02:meMA.Kathisma21.melody	@ltx/gr_gr_cog/he.a.m1:heAU.TonTafonSouSotir.name
ltx/gr_gr_cog/me.m02.d02:meMA.Kathisma21.mode	@ltx/gr_gr_cog/miscellanea:misc.Mode1
ltx/gr_gr_cog/me.m02.d02:meMA.Kathisma21.text	Ὁ ὢν σὺν τῷ Πατρί, ἐπὶ θρόνου ἁγίου, ἐλθὼν ἐπὶ τῆς γῆς, ἐκ Παρθένου ἐτέχθη, καὶ βρέφος ἐγένετο, χρόνοις ὢν ἀπερίγραπτος, ὃν δεξάμενος, ὁ Συμεὼν ἐν ἀγκάλαις, χαίρων ἔλεγε· Νῦν ἀπολύεις Οἰκτίρμον, εὐφράνας τὸν δοῦλόν σου.
ltx/gr_gr_cog/me.m02.d02:meMA.Kathisma31.greekmelody	@ltx/gr_gr_cog/he.a.m4:heAU.KateplagiIosif.greekname
ltx/gr_gr_cog/me.m02.d02:meMA.Kathisma31.incipit	Νηπιάζει διʼ ἐμέ, ὁ Παλαιὸς…
ltx/gr_gr_cog/me.m02.d02:meMA.Kathisma31.melody	@ltx/gr_gr_cog/he.a.m4:heAU.KateplagiIosif.name
ltx/gr_gr_cog/me.m02.d02:meMA.Kathisma31.mode	@ltx/gr_gr_cog/miscellanea:misc.Mode4
ltx/gr_gr_cog/me.m02.d02:meMA.Kathisma31.text	Νηπιάζει διʼ ἐμέ, ὁ Παλαιὸς τῶν ἡμερῶν, καθαρσίων κοινωνεῖ, ὁ καθαρώτατος Θεός, ἵνα τὴν σάρκα πιστώσῃ μου, τὴν ἐκ Παρθένου. Καὶ ταῦτα Συμεὼν μυσταγωγούμενος, ἐπέγνω τὸν αὐτόν, Θεὸν φανέντα σαρκί, καὶ ὡς ζωὴν ἠσπάζετο, καὶ χαίρων, πρεσβυτικῶς ἀνεκραύγαζεν· Ἀπόλυσόν με· σὲ γὰρ κατεῖδον, τὴν ζωὴν τῶν ἁπάντων.
ltx/gr_gr_cog/me.m02.d02:meMA.Kontakion1.incipit	Ὁ μήτραν παρθενικὴν…
ltx/gr_gr_cog/me.m02.d02:meMA.Kontakion1.melody	
ltx/gr_gr_cog/me.m02.d02:meMA.Kontakion1.mode	@ltx/gr_gr_cog/miscellanea:misc.Mode1
ltx/gr_gr_cog/me.m02.d02:meMA.Kontakion1.text	Ὁ μήτραν παρθενικὴν ἁγιάσας τῷ τόκῳ σου, καὶ χεῖρας τοῦ Συμεὼν εὐλογήσας ὡς ἔπρεπε, προφθάσας καὶ νῦν ἔσωσας ἡμᾶς Χριστὲ ὁ Θεός. Ἀλλʼ εἰρήνευσον ἐν πολέμοις τὸ πολίτευμα, καὶ κραταίωσον Βασιλεῖς οὓς ἠγάπησας, ὁ μόνος φιλάνθρωπος.
ltx/gr_gr_cog/me.m02.d02:meMA.Lauds1.greekmelody	@ltx/gr_gr_cog/he.a.m4:heAU.EdokasSimeiosin.greekname
ltx/gr_gr_cog/me.m02.d02:meMA.Lauds1.incipit	Νόμον τὸν ἐν γράμματι, ἀποπληρῶν…
ltx/gr_gr_cog/me.m02.d02:meMA.Lauds1.melody	@ltx/gr_gr_cog/he.a.m4:heAU.EdokasSimeiosin.name
ltx/gr_gr_cog/me.m02.d02:meMA.Lauds1.mode	@ltx/gr_gr_cog/miscellanea:misc.Mode4
ltx/gr_gr_cog/me.m02.d02:meMA.Lauds1.text	Νόμον τὸν ἐν γράμματι, ἀποπληρῶν ὁ φιλάνθρωπος, τῷ ναῷ νῦν προσάγεται, καὶ τοῦτον εἰσδέχεται, γηραιαῖς ἀγκάλαις, Συμεὼν ὁ πρέσβυς· Νῦν ἀπολύεις με βοῶν, πρὸς τὴν ἐκεῖθεν μακαριότητα· κατεῖδον γὰρ σε σήμερον, σάρκα θνητὴν περικείμενον, τὸν ζωῆς κυριεύοντα, καὶ θανάτου δεσπόζοντα.
ltx/gr_gr_cog/me.m02.d02:meMA.Lauds2.incipit	Φῶς εἰς ἀποκάλυψιν, ἐθνῶν ἐπέφανας…
ltx/gr_gr_cog/me.m02.d02:meMA.Lauds2.melody	@ltx/gr_gr_cog/he.a.m4:heAU.EdokasSimeiosin.name
ltx/gr_gr_cog/me.m02.d02:meMA.Lauds2.mode	@ltx/gr_gr_cog/miscellanea:misc.Mode4
ltx/gr_gr_cog/me.m02.d02:meMA.Lauds2.text	Φῶς εἰς ἀποκάλυψιν, ἐθνῶν ἐπέφανας Κύριε, ἐπὶ κούφης καθήμενος, νεφέλης ὁ Ἥλιος, τῆς δικαιοσύνης, νόμου τὸ σκιῶδες, ἀποπληρῶν καὶ τὴν ἀρχήν, καθυποφαίνων τῆς νέας χάριτος· διό σε θεασάμενος, ὁ Συμεὼν ἀνεκραύγαζεν· Ἐκ φθορᾶς με ἀπόλυσον, ὅτι εἶδόν σε σήμερον.
ltx/gr_gr_cog/me.m02.d02:meMA.Lauds3.incipit	Κόλπων τοῦ γεννήτορος, μὴ χωρισθεὶς…
ltx/gr_gr_cog/me.m02.d02:meMA.Lauds3.melody	@ltx/gr_gr_cog/he.a.m4:heAU.EdokasSimeiosin.name
ltx/gr_gr_cog/me.m02.d02:meMA.Lauds3.mode	@ltx/gr_gr_cog/miscellanea:misc.Mode4
ltx/gr_gr_cog/me.m02.d02:meMA.Lauds3.text	Κόλπων τοῦ γεννήτορος, μὴ χωρισθεὶς τῇ Θεότητι, σαρκωθεὶς ὡς εὐδόκησας, ἀγκάλαις κρατούμενος, τῆς Ἀειπαρθένου, χερσὶν ἐπεδόθης, τοῦ θεοδόχου Συμεών, ὁ τῇ χειρί σου κρατῶν τὰ σύμπαντα· διὸ νῦν ἀπολύεις με, περιχαρῶς ἀνεκραύγαζεν, ἐν εἰρήνῃ τὸν δοῦλόν σου, ὅτι εἶδόν σε Δέσποτα.
ltx/gr_gr_cog/me.m02.d02:meMA.LaudsGlory.incipit	Ὁ ἐν χερσὶ πρεσβυτικαῖς, τὴν…
ltx/gr_gr_cog/me.m02.d02:meMA.LaudsGlory.melody	
ltx/gr_gr_cog/me.m02.d02:meMA.LaudsGlory.mode	@ltx/gr_gr_cog/miscellanea:misc.Mode6
ltx/gr_gr_cog/me.m02.d02:meMA.LaudsGlory.poet	@ltx/gr_gr_cog/poets:po.Germanou
ltx/gr_gr_cog/me.m02.d02:meMA.LaudsGlory.text	Ὁ ἐν χερσὶ πρεσβυτικαῖς, τὴν σήμερον ἡμέραν, ὡς ἐφʼ ἅρματος Χερουβίμ, ἀνακλιθῆναι εὐδοκήσας Χριστὲ ὁ Θεός, καὶ ἡμᾶς τοὺς ὑμνοῦντάς σε, τῆς τῶν παθῶν τυραννίδος, ἀνακαλούμενος ῥῦσαι, καὶ σῶσον τὰς ψυχὰς ἡμῶν.
ltx/gr_gr_cog/me.m02.d02:meMA.MM.Lauds1123as5678.text	@ltx/gr_gr_cog/properties:media.key
ltx/gr_gr_cog/me.m02.d02:meMA.MM.Lauds123as123.text	@ltx/gr_gr_cog/properties:media.key
ltx/gr_gr_cog/me.m02.d02:meMA.MM.Lauds123as678.text	@ltx/gr_gr_cog/properties:media.key
ltx/gr_gr_cog/me.m02.d02:meMA.MM.Lauds12as45.text	@ltx/gr_gr_cog/properties:media.key
ltx/gr_gr_cog/me.m02.d02:meMA.Ode1C11.greekmelody	@ltx/gr_gr_cog/he.h.m3:heHE.ChersonAvyssotokon.greekname
ltx/gr_gr_cog/me.m02.d02:meMA.Ode1C11.incipit	Ῥανάτωσαν ὕδωρ νεφέλαι…
ltx/gr_gr_cog/me.m02.d02:meMA.Ode1C11.melody	@ltx/gr_gr_cog/he.h.m3:heHE.ChersonAvyssotokon.name
ltx/gr_gr_cog/me.m02.d02:meMA.Ode1C11.mode	@ltx/gr_gr_cog/miscellanea:misc.Mode3
ltx/gr_gr_cog/me.m02.d02:meMA.Ode1C11.ode	@ltx/gr_gr_cog/miscellanea:misc.Ode1
ltx/gr_gr_cog/me.m02.d02:meMA.Ode1C11.text	Ῥανάτωσαν ὕδωρ νεφέλαι· Ἥλιος ἐν νεφέλῃ γὰρ κούφη, ἐποχούμενος ἐπέστη, ἀκηράτοις ὠλέναις, Χριστὸς ἐν τῷ ναῷ ὡς βρέφος· διὸ πιστοὶ βοήσωμεν· ᾌσωμεν τῷ Κυρίῳ· ἐνδόξως γὰρ δεδόξασται.
ltx/gr_gr_cog/me.m02.d02:meMA.Ode1C12.incipit	Ἰσχύσατε χεῖρες Συμεών…
ltx/gr_gr_cog/me.m02.d02:meMA.Ode1C12.melody	@ltx/gr_gr_cog/he.h.m3:heHE.ChersonAvyssotokon.name
ltx/gr_gr_cog/me.m02.d02:meMA.Ode1C12.mode	@ltx/gr_gr_cog/miscellanea:misc.Mode3
ltx/gr_gr_cog/me.m02.d02:meMA.Ode1C12.ode	@ltx/gr_gr_cog/miscellanea:misc.Ode1
ltx/gr_gr_cog/me.m02.d02:meMA.Ode1C12.text	Ἰσχύσατε χεῖρες Συμεών τῷ γήρᾳ, ἀνειμέναι καὶ κνῆμαι, παρειμέναι δὲ Πρεσβύτου, αὐθυβόλως κινεῖσθε, Χριστοῦ πρὸς ὑπαντήν. Χορείαν, σὺν Ἀσωμάτοις στήσαντες, ᾄσωμεν τῷ Κυρίῳ· ἐνδόξως γὰρ δεδόξασται.
ltx/gr_gr_cog/me.m02.d02:meMA.Ode1C13.incipit	Συνέσει ταθέντες οὐρανοὶ…
ltx/gr_gr_cog/me.m02.d02:meMA.Ode1C13.melody	@ltx/gr_gr_cog/he.h.m3:heHE.ChersonAvyssotokon.name
ltx/gr_gr_cog/me.m02.d02:meMA.Ode1C13.mode	@ltx/gr_gr_cog/miscellanea:misc.Mode3
ltx/gr_gr_cog/me.m02.d02:meMA.Ode1C13.ode	@ltx/gr_gr_cog/miscellanea:misc.Ode1
ltx/gr_gr_cog/me.m02.d02:meMA.Ode1C13.text	Συνέσει ταθέντες οὐρανοὶ εὐφράνθητε, ἀγάλλου δὲ ἡ γῆ· ὑπερθέων γὰρ ἐκ κόλπων, ὁ τεχνίτης φοιτήσας, Χριστὸς ὑπὸ Μητρὸς Παρθένου, Θεῷ Πατρὶ προσάγεται, νήπιος ὁ πρὸ πάντων· ἐνδόξως γὰρ δεδόξασται.
ltx/gr_gr_cog/me.m02.d02:meMA.Ode1C1H.greekmelody	@ltx/gr_gr_cog/he.h.m3:heHE.ChersonAvyssotokon.greekname
ltx/gr_gr_cog/me.m02.d02:meMA.Ode1C1H.incipit	@ltx/gr_gr_cog/he.h.m3:heHE.ChersonAvyssotokon.incipit
ltx/gr_gr_cog/me.m02.d02:meMA.Ode1C1H.melody	@ltx/gr_gr_cog/he.h.m3:heHE.ChersonAvyssotokon.melody
ltx/gr_gr_cog/me.m02.d02:meMA.Ode1C1H.mode	@ltx/gr_gr_cog/miscellanea:misc.Mode3
ltx/gr_gr_cog/me.m02.d02:meMA.Ode1C1H.ode	@ltx/gr_gr_cog/miscellanea:misc.Ode1
ltx/gr_gr_cog/me.m02.d02:meMA.Ode1C1H.text	@ltx/gr_gr_cog/he.h.m3:heHE.ChersonAvyssotokon.text
ltx/gr_gr_cog/me.m02.d02:meMA.Ode3C11.greekmelody	@ltx/gr_gr_cog/he.h.m3:heHE.ToStereoma.greekname
ltx/gr_gr_cog/me.m02.d02:meMA.Ode3C11.incipit	Ὁ πρωτότοκος ἐκ Πατρὸς…
ltx/gr_gr_cog/me.m02.d02:meMA.Ode3C11.melody	@ltx/gr_gr_cog/he.h.m3:heHE.ToStereoma.name
ltx/gr_gr_cog/me.m02.d02:meMA.Ode3C11.mode	@ltx/gr_gr_cog/miscellanea:misc.Mode3
ltx/gr_gr_cog/me.m02.d02:meMA.Ode3C11.ode	@ltx/gr_gr_cog/miscellanea:misc.Ode3
ltx/gr_gr_cog/me.m02.d02:meMA.Ode3C11.text	Ὁ πρωτότοκος ἐκ Πατρὸς πρὸ αἰώνων, Πρωτότοκος νήπιος, Κόρης ἀφθόρου, τῷ Ἀδὰμ χεῖρας προτείνων ἐπέφανε.
ltx/gr_gr_cog/me.m02.d02:meMA.Ode3C12.incipit	Νηπιόφρονα, τὸν γεγονότα…
ltx/gr_gr_cog/me.m02.d02:meMA.Ode3C12.melody	@ltx/gr_gr_cog/he.h.m3:heHE.ToStereoma.name
ltx/gr_gr_cog/me.m02.d02:meMA.Ode3C12.mode	@ltx/gr_gr_cog/miscellanea:misc.Mode3
ltx/gr_gr_cog/me.m02.d02:meMA.Ode3C12.ode	@ltx/gr_gr_cog/miscellanea:misc.Ode3
ltx/gr_gr_cog/me.m02.d02:meMA.Ode3C12.text	Νηπιόφρονα, τὸν γεγονότα ἀπάτῃ, Πρωτόπλαστον ἔμπαλιν ἐπανορθώσων, Θεὸς Λόγος, νηπιάσας ἐπέφανε.
ltx/gr_gr_cog/me.m02.d02:meMA.Ode3C13.incipit	Γῆς ἀπόγονον…
ltx/gr_gr_cog/me.m02.d02:meMA.Ode3C13.melody	@ltx/gr_gr_cog/he.h.m3:heHE.ToStereoma.name
ltx/gr_gr_cog/me.m02.d02:meMA.Ode3C13.mode	@ltx/gr_gr_cog/miscellanea:misc.Mode3
ltx/gr_gr_cog/me.m02.d02:meMA.Ode3C13.ode	@ltx/gr_gr_cog/miscellanea:misc.Ode3
ltx/gr_gr_cog/me.m02.d02:meMA.Ode3C13.text	Γῆς ἀπόγονον, παλινδρομήσασαν ταύτῃ, Θεότητος σύμμορφον φύσιν ὁ Πλάστης, ὡς ἀτρέπτως νηπιάσας ἀνέδειξε.
ltx/gr_gr_cog/me.m02.d02:meMA.Ode3C1H.greekmelody	@ltx/gr_gr_cog/he.h.m3:heHE.ToStereoma.greekname
ltx/gr_gr_cog/me.m02.d02:meMA.Ode3C1H.incipit	@ltx/gr_gr_cog/he.h.m3:heHE.ToStereoma.incipit
ltx/gr_gr_cog/me.m02.d02:meMA.Ode3C1H.melody	@ltx/gr_gr_cog/he.h.m3:heHE.ToStereoma.melody
ltx/gr_gr_cog/me.m02.d02:meMA.Ode3C1H.mode	@ltx/gr_gr_cog/miscellanea:misc.Mode3
ltx/gr_gr_cog/me.m02.d02:meMA.Ode3C1H.ode	@ltx/gr_gr_cog/miscellanea:misc.Ode3
ltx/gr_gr_cog/me.m02.d02:meMA.Ode3C1H.text	@ltx/gr_gr_cog/he.h.m3:heHE.ToStereoma.text
ltx/gr_gr_cog/me.m02.d02:meMA.Ode3Kathisma1.greekmelody	@ltx/gr_gr_cog/he.a.m4:heAU.KateplagiIosif.greekname
ltx/gr_gr_cog/me.m02.d02:meMA.Ode3Kathisma1.incipit	Ἐν τῷ ὄρει τῷ Σινᾷ…
ltx/gr_gr_cog/me.m02.d02:meMA.Ode3Kathisma1.melody	@ltx/gr_gr_cog/he.a.m4:heAU.KateplagiIosif.name
ltx/gr_gr_cog/me.m02.d02:meMA.Ode3Kathisma1.mode	@ltx/gr_gr_cog/miscellanea:misc.Mode4
ltx/gr_gr_cog/me.m02.d02:meMA.Ode3Kathisma1.text	Ἐν τῷ ὄρει τῷ Σινᾷ πάλαι κατεῖδε Μωϋσῆς, τὰ ὀπίσθια Θεοῦ καὶ ἀμυδρῶς θείας φωνῆς, κατηξιώθη ἐν γνόφῳ τε καὶ θυέλλῃ· νῦν δὲ Συμεών, τὸν σαρκωθέντα Θεόν, ἀτρέπτως διʼ ἡμᾶς, ἐνηγκαλίσατο· καὶ γεγηθὼς ἠπείγετο τῶν τῇδε, πρὸς τὴν ζωὴν τὴν αἰώνιον· διὸ ἐβόα· Νῦν ἀπολύεις, τὸν δοῦλόν σου Δέσποτα.
ltx/gr_gr_cog/me.m02.d02:meMA.Ode4C11.greekmelody	@ltx/gr_gr_cog/he.h.m3:heHE.EkalypsenOuranous.greekname
ltx/gr_gr_cog/me.m02.d02:meMA.Ode4C11.incipit	Γηθόμενος Συμεών…
ltx/gr_gr_cog/me.m02.d02:meMA.Ode4C11.melody	@ltx/gr_gr_cog/he.h.m3:heHE.EkalypsenOuranous.name
ltx/gr_gr_cog/me.m02.d02:meMA.Ode4C11.mode	@ltx/gr_gr_cog/miscellanea:misc.Mode3
ltx/gr_gr_cog/me.m02.d02:meMA.Ode4C11.ode	@ltx/gr_gr_cog/miscellanea:misc.Ode4
ltx/gr_gr_cog/me.m02.d02:meMA.Ode4C11.text	Γηθόμενος Συμεών, τῶν ἀποῤῥήτων μύστα, ἡ Θεοτόκος ἐβόα ὃν ὑφʼ Ἁγίου πάλαι, κεχρημάτισαι, Πνεύματος νηπιάσαντα, Λόγον Χριστὸν ἐναγκαλίζου κράζων, αὐτῷ· Ἐπλήσθη τὰ πάντα, τῆς σῆς αἰνέσεως.
ltx/gr_gr_cog/me.m02.d02:meMA.Ode4C12.incipit	Ἣν ἤλπισας Συμεὼν…
ltx/gr_gr_cog/me.m02.d02:meMA.Ode4C12.melody	@ltx/gr_gr_cog/he.h.m3:heHE.EkalypsenOuranous.name
ltx/gr_gr_cog/me.m02.d02:meMA.Ode4C12.mode	@ltx/gr_gr_cog/miscellanea:misc.Mode3
ltx/gr_gr_cog/me.m02.d02:meMA.Ode4C12.ode	@ltx/gr_gr_cog/miscellanea:misc.Ode4
ltx/gr_gr_cog/me.m02.d02:meMA.Ode4C12.text	Ἣν ἤλπισας Συμεών, ἡλικιώτην βρεφῶν, χαίρων ὑπόδεξαι Χριστόν τοῦ Ἰσραὴλ τοῦ θείου, τὴν παράκλησιν, τὸν νόμου Ποιητήν, καὶ Δεσπότην πληροῦντα νόμου τάξιν, κράζων, αὐτῷ· Ἐπλήσθη τὰ πάντα, τῆς σῆς αἰνέσεως.
ltx/gr_gr_cog/me.m02.d02:meMA.Ode4C13.incipit	Θεώμενος Συμεὼν…
ltx/gr_gr_cog/me.m02.d02:meMA.Ode4C13.melody	@ltx/gr_gr_cog/he.h.m3:heHE.EkalypsenOuranous.name
ltx/gr_gr_cog/me.m02.d02:meMA.Ode4C13.mode	@ltx/gr_gr_cog/miscellanea:misc.Mode3
ltx/gr_gr_cog/me.m02.d02:meMA.Ode4C13.ode	@ltx/gr_gr_cog/miscellanea:misc.Ode4
ltx/gr_gr_cog/me.m02.d02:meMA.Ode4C13.text	Θεώμενος Συμεών, Λόγον τὸν ἄναρχον, μετὰ σαρκὸς ὡς ἐν θρόνῳ Χερουβικῷ Παρθένῳ, ἐποχούμενον, τὸν αἴτιον τοῦ εἶναι, τὰ πάντα ὡς βρέφος ἐκπλαγεὶς ἐβόα, αὐτῷ· Ἐπλήσθη τὰ πάντα, τῆς σῆς αἰνέσεως.
ltx/gr_gr_cog/me.m02.d02:meMA.Ode4C1H.greekmelody	@ltx/gr_gr_cog/he.h.m3:heHE.EkalypsenOuranous.greekname
ltx/gr_gr_cog/me.m02.d02:meMA.Ode4C1H.incipit	@ltx/gr_gr_cog/he.h.m3:heHE.EkalypsenOuranous.incipit
ltx/gr_gr_cog/me.m02.d02:meMA.Ode4C1H.melody	@ltx/gr_gr_cog/he.h.m3:heHE.EkalypsenOuranous.melody
ltx/gr_gr_cog/me.m02.d02:meMA.Ode4C1H.mode	@ltx/gr_gr_cog/miscellanea:misc.Mode3
ltx/gr_gr_cog/me.m02.d02:meMA.Ode4C1H.ode	@ltx/gr_gr_cog/miscellanea:misc.Ode4
ltx/gr_gr_cog/me.m02.d02:meMA.Ode4C1H.text	@ltx/gr_gr_cog/he.h.m3:heHE.EkalypsenOuranous.text
ltx/gr_gr_cog/me.m02.d02:meMA.Ode5C11.greekmelody	@ltx/gr_gr_cog/he.h.m3:heHE.OsEidenIsaias.greekname
ltx/gr_gr_cog/me.m02.d02:meMA.Ode5C11.incipit	Συνεὶς ὁ θεῖος Πρέσβυς…
ltx/gr_gr_cog/me.m02.d02:meMA.Ode5C11.melody	@ltx/gr_gr_cog/he.h.m3:heHE.OsEidenIsaias.name
ltx/gr_gr_cog/me.m02.d02:meMA.Ode5C11.mode	@ltx/gr_gr_cog/miscellanea:misc.Mode3
ltx/gr_gr_cog/me.m02.d02:meMA.Ode5C11.ode	@ltx/gr_gr_cog/miscellanea:misc.Ode5
ltx/gr_gr_cog/me.m02.d02:meMA.Ode5C11.text	Συνεὶς ὁ θεῖος Πρέσβυς, τὴν προφανεῖσαν πάλαι τῷ Προφήτῃ δόξαν, χερσὶ Λόγον βλέπων Μητρὸς κρατούμενον, ὦ χαίροις ἐβόα Σεμνή· ὡς γὰρ θρόνος περιέχεις τὸν Θεόν, φωτὸς ἀνεσπέρου, καὶ εἰρήνης δεσπόζοντα.
ltx/gr_gr_cog/me.m02.d02:meMA.Ode5C12.incipit	Προκύψας ὁ Πρεσβύτης…
ltx/gr_gr_cog/me.m02.d02:meMA.Ode5C12.melody	@ltx/gr_gr_cog/he.h.m3:heHE.OsEidenIsaias.name
ltx/gr_gr_cog/me.m02.d02:meMA.Ode5C12.mode	@ltx/gr_gr_cog/miscellanea:misc.Mode3
ltx/gr_gr_cog/me.m02.d02:meMA.Ode5C12.ode	@ltx/gr_gr_cog/miscellanea:misc.Ode5
ltx/gr_gr_cog/me.m02.d02:meMA.Ode5C12.text	Προκύψας ὁ Πρεσβύτης, καὶ τῶν ἰχνῶν ἐνθέως ἐφαψάμενος, τῆς ἀπειρογάμου καὶ Θεομήτορος, πῦρ ἔφη βαστάζεις Ἁγνή, βρέφος φρίττω ἀγκαλίσασθαι Θεόν, φωτός ἀνεσπέρου, καὶ εἰρήνης δεσπόζοντα.
ltx/gr_gr_cog/me.m02.d02:meMA.Ode5C13.incipit	Ῥύπτεται Ἠσαΐας…
ltx/gr_gr_cog/me.m02.d02:meMA.Ode5C13.melody	@ltx/gr_gr_cog/he.h.m3:heHE.OsEidenIsaias.name
ltx/gr_gr_cog/me.m02.d02:meMA.Ode5C13.mode	@ltx/gr_gr_cog/miscellanea:misc.Mode3
ltx/gr_gr_cog/me.m02.d02:meMA.Ode5C13.ode	@ltx/gr_gr_cog/miscellanea:misc.Ode5
ltx/gr_gr_cog/me.m02.d02:meMA.Ode5C13.text	Ῥύπτεται Ἠσαΐας, τοῦ Σεραφὶμ τὸν ἄνθρακα δεξάμενος, ὁ Πρέσβυς ἐβόα τῇ Θεομήτορι· σὺ ὥσπερ λαβίδι χερσί, λαμπρύνεις με ἐπιδοῦσα ὃν φέρεις, φωτὸς ἀνεσπέρου, καὶ εἰρήνης δεσπόζοντα.
ltx/gr_gr_cog/me.m02.d02:meMA.Ode5C1H.greekmelody	@ltx/gr_gr_cog/he.h.m3:heHE.OsEidenIsaias.greekname
ltx/gr_gr_cog/me.m02.d02:meMA.Ode5C1H.incipit	@ltx/gr_gr_cog/he.h.m3:heHE.OsEidenIsaias.incipit
ltx/gr_gr_cog/me.m02.d02:meMA.Ode5C1H.melody	@ltx/gr_gr_cog/he.h.m3:heHE.OsEidenIsaias.melody
ltx/gr_gr_cog/me.m02.d02:meMA.Ode5C1H.mode	@ltx/gr_gr_cog/miscellanea:misc.Mode3
ltx/gr_gr_cog/me.m02.d02:meMA.Ode5C1H.ode	@ltx/gr_gr_cog/miscellanea:misc.Ode5
ltx/gr_gr_cog/me.m02.d02:meMA.Ode5C1H.text	@ltx/gr_gr_cog/he.h.m3:heHE.OsEidenIsaias.text
ltx/gr_gr_cog/me.m02.d02:meMA.Ode6C11.greekmelody	@ltx/gr_gr_cog/he.h.m3:heHE.EvoiseSoi.greekname
ltx/gr_gr_cog/me.m02.d02:meMA.Ode6C11.incipit	Σιὼν σὺ λίθος…
ltx/gr_gr_cog/me.m02.d02:meMA.Ode6C11.melody	@ltx/gr_gr_cog/he.h.m3:heHE.EvoiseSoi.name
ltx/gr_gr_cog/me.m02.d02:meMA.Ode6C11.mode	@ltx/gr_gr_cog/miscellanea:misc.Mode3
ltx/gr_gr_cog/me.m02.d02:meMA.Ode6C11.ode	@ltx/gr_gr_cog/miscellanea:misc.Ode6
ltx/gr_gr_cog/me.m02.d02:meMA.Ode6C11.text	Σιὼν σὺ λίθος, ἐναπετέθης, τοῖς ἀπειθοῦσι προσκόμματος, καὶ σκανδάλου πέτρα, ἀῤῥαγὴς πιστῶν σωτηρία.
ltx/gr_gr_cog/me.m02.d02:meMA.Ode6C12.incipit	Βεβαίως φέρων…
ltx/gr_gr_cog/me.m02.d02:meMA.Ode6C12.melody	@ltx/gr_gr_cog/he.h.m3:heHE.EvoiseSoi.name
ltx/gr_gr_cog/me.m02.d02:meMA.Ode6C12.mode	@ltx/gr_gr_cog/miscellanea:misc.Mode3
ltx/gr_gr_cog/me.m02.d02:meMA.Ode6C12.ode	@ltx/gr_gr_cog/miscellanea:misc.Ode6
ltx/gr_gr_cog/me.m02.d02:meMA.Ode6C12.text	Βεβαίως φέρων, τὸν χαρακτῆρα, τοῦ πρὸ αἰώνων σε φύσαντος, τὴν βροτῶν διʼ οἶκτον, νῦν ἀσθένειαν περιέθου.
ltx/gr_gr_cog/me.m02.d02:meMA.Ode6C13.incipit	Υἱὸν Ὑψίστου…
ltx/gr_gr_cog/me.m02.d02:meMA.Ode6C13.melody	@ltx/gr_gr_cog/he.h.m3:heHE.EvoiseSoi.name
ltx/gr_gr_cog/me.m02.d02:meMA.Ode6C13.mode	@ltx/gr_gr_cog/miscellanea:misc.Mode3
ltx/gr_gr_cog/me.m02.d02:meMA.Ode6C13.ode	@ltx/gr_gr_cog/miscellanea:misc.Ode6
ltx/gr_gr_cog/me.m02.d02:meMA.Ode6C13.text	Υἱὸν Ὑψίστου, Υἱὸν Παρθένου, Θεὸν παιδίον γενόμενον, προσκυνήσαντά σε, νῦν ἀπόλυσον ἐν εἰρήνῃ.
ltx/gr_gr_cog/me.m02.d02:meMA.Ode6C1H.greekmelody	@ltx/gr_gr_cog/he.h.m3:heHE.EvoiseSoi.greekname
ltx/gr_gr_cog/me.m02.d02:meMA.Ode6C1H.incipit	@ltx/gr_gr_cog/he.h.m3:heHE.EvoiseSoi.incipit
ltx/gr_gr_cog/me.m02.d02:meMA.Ode6C1H.melody	@ltx/gr_gr_cog/he.h.m3:heHE.EvoiseSoi.melody
ltx/gr_gr_cog/me.m02.d02:meMA.Ode6C1H.mode	@ltx/gr_gr_cog/miscellanea:misc.Mode3
ltx/gr_gr_cog/me.m02.d02:meMA.Ode6C1H.ode	@ltx/gr_gr_cog/miscellanea:misc.Ode6
ltx/gr_gr_cog/me.m02.d02:meMA.Ode6C1H.text	@ltx/gr_gr_cog/he.h.m3:heHE.EvoiseSoi.text
ltx/gr_gr_cog/me.m02.d02:meMA.Ode7C11.greekmelody	@ltx/gr_gr_cog/he.h.m3:heHE.SeTonEnPyri.greekname
ltx/gr_gr_cog/me.m02.d02:meMA.Ode7C11.incipit	Ἀδὰμ ἐμφανίσων ἄπειμι…
ltx/gr_gr_cog/me.m02.d02:meMA.Ode7C11.melody	@ltx/gr_gr_cog/he.h.m3:heHE.SeTonEnPyri.name
ltx/gr_gr_cog/me.m02.d02:meMA.Ode7C11.mode	@ltx/gr_gr_cog/miscellanea:misc.Mode3
ltx/gr_gr_cog/me.m02.d02:meMA.Ode7C11.ode	@ltx/gr_gr_cog/miscellanea:misc.Ode7
ltx/gr_gr_cog/me.m02.d02:meMA.Ode7C11.text	Ἀδὰμ ἐμφανίσων ἄπειμι, εἰς ᾍδου διατρίβοντι, καὶ τῇ Εὔᾳ προσκομίσων εὐαγγέλια, Συμεὼν ἀνεβόα, σὺν Προφήταις χορεύων· Εὐλογητὸς ὁ Θεός, ὁ τῶν Πατέρων ἡμῶν.
ltx/gr_gr_cog/me.m02.d02:meMA.Ode7C12.incipit	Γένος χοϊκὸν ῥυσόμενος…
ltx/gr_gr_cog/me.m02.d02:meMA.Ode7C12.melody	@ltx/gr_gr_cog/he.h.m3:heHE.SeTonEnPyri.name
ltx/gr_gr_cog/me.m02.d02:meMA.Ode7C12.mode	@ltx/gr_gr_cog/miscellanea:misc.Mode3
ltx/gr_gr_cog/me.m02.d02:meMA.Ode7C12.ode	@ltx/gr_gr_cog/miscellanea:misc.Ode7
ltx/gr_gr_cog/me.m02.d02:meMA.Ode7C12.text	Γένος χοϊκὸν ῥυσόμενος Θεός, ἕως τοῦ ᾍδου ἥξει· αἰχμαλώτοις δὲ παρέξει πᾶσιν ἄφεσιν, καὶ ἀνάβλεψιν πηροῖς, ὡς ἀλάλοις βοῆσαι· Εὐλογητός, ὁ Θεὸς ὁ τῶν Πατέρων ἡμῶν.
ltx/gr_gr_cog/me.m02.d02:meMA.Ode7C13.incipit	Καὶ σοῦ τὴν καρδίαν…
ltx/gr_gr_cog/me.m02.d02:meMA.Ode7C13.melody	@ltx/gr_gr_cog/he.h.m3:heHE.SeTonEnPyri.name
ltx/gr_gr_cog/me.m02.d02:meMA.Ode7C13.mode	@ltx/gr_gr_cog/miscellanea:misc.Mode3
ltx/gr_gr_cog/me.m02.d02:meMA.Ode7C13.ode	@ltx/gr_gr_cog/miscellanea:misc.Ode7
ltx/gr_gr_cog/me.m02.d02:meMA.Ode7C13.text	Καὶ σοῦ τὴν καρδίαν ἄφθορε, ῥομφαία διελεύσεται, Συμεὼν τῇ Θεοτόκῳ προηγόρευσεν, ἐν Σταυρῷ καθορώσης, τὸν Υἱὸν ᾧ βοῶμεν· Εὐλογητὸς ὁ Θεός, ὁ τῶν Πατέρων ἡμῶν.
ltx/gr_gr_cog/me.m02.d02:meMA.Ode7C1H.greekmelody	@ltx/gr_gr_cog/he.h.m3:heHE.SeTonEnPyri.greekname
ltx/gr_gr_cog/me.m02.d02:meMA.Ode7C1H.incipit	@ltx/gr_gr_cog/he.h.m3:heHE.SeTonEnPyri.incipit
ltx/gr_gr_cog/me.m02.d02:meMA.Ode7C1H.melody	@ltx/gr_gr_cog/he.h.m3:heHE.SeTonEnPyri.melody
ltx/gr_gr_cog/me.m02.d02:meMA.Ode7C1H.mode	@ltx/gr_gr_cog/miscellanea:misc.Mode3
ltx/gr_gr_cog/me.m02.d02:meMA.Ode7C1H.ode	@ltx/gr_gr_cog/miscellanea:misc.Ode7
ltx/gr_gr_cog/me.m02.d02:meMA.Ode7C1H.text	@ltx/gr_gr_cog/he.h.m3:heHE.SeTonEnPyri.text
ltx/gr_gr_cog/me.m02.d02:meMA.Ode8C11.greekmelody	@ltx/gr_gr_cog/he.h.m3:heHE.AstektoPyri.greekname
ltx/gr_gr_cog/me.m02.d02:meMA.Ode8C11.incipit	Λαὸς Ἰσραὴλ τὴν σὴν δόξαν…
ltx/gr_gr_cog/me.m02.d02:meMA.Ode8C11.melody	@ltx/gr_gr_cog/he.h.m3:heHE.AstektoPyri.name
ltx/gr_gr_cog/me.m02.d02:meMA.Ode8C11.mode	@ltx/gr_gr_cog/miscellanea:misc.Mode3
ltx/gr_gr_cog/me.m02.d02:meMA.Ode8C11.ode	@ltx/gr_gr_cog/miscellanea:misc.Ode8
ltx/gr_gr_cog/me.m02.d02:meMA.Ode8C11.text	Λαὸς Ἰσραὴλ τὴν σὴν δόξαν, τὸν Ἐμμανουὴλ ὁρῶν παιδίον ἐκ Παρθένου, πρὸ προσώπου τῆς θείας, κιβωτοῦ νῦν χόρευε· Εὐλογεῖτε πάντα τὰ ἔργα τὸν Κύριον, καὶ ὑπερυψοῦτε, εἰς πάντας τοὺς αἰῶνας.
ltx/gr_gr_cog/me.m02.d02:meMA.Ode8C12.incipit	Ἰδού, Συμεὼν ἀνεβόα…
ltx/gr_gr_cog/me.m02.d02:meMA.Ode8C12.melody	@ltx/gr_gr_cog/he.h.m3:heHE.AstektoPyri.name
ltx/gr_gr_cog/me.m02.d02:meMA.Ode8C12.mode	@ltx/gr_gr_cog/miscellanea:misc.Mode3
ltx/gr_gr_cog/me.m02.d02:meMA.Ode8C12.ode	@ltx/gr_gr_cog/miscellanea:misc.Ode8
ltx/gr_gr_cog/me.m02.d02:meMA.Ode8C12.text	Ἰδοὺ Συμεὼν ἀνεβόα, τὸ ἀντιλεγόμενον σημεῖον οὗτος ἔσται, Θεὸς ὢν καὶ παιδίον· τούτῳ πίστει μέλψωμεν· Εὐλογεῖτε πάντα τὰ ἔργα τὸν Κύριον, καὶ ὑπερυψοῦτε, εἰς πάντας τοὺς αἰῶνας.
ltx/gr_gr_cog/me.m02.d02:meMA.Ode8C13.incipit	Ζωὴ πεφυκὼς οὗτος ἔσται…
ltx/gr_gr_cog/me.m02.d02:meMA.Ode8C13.melody	@ltx/gr_gr_cog/he.h.m3:heHE.AstektoPyri.name
ltx/gr_gr_cog/me.m02.d02:meMA.Ode8C13.mode	@ltx/gr_gr_cog/miscellanea:misc.Mode3
ltx/gr_gr_cog/me.m02.d02:meMA.Ode8C13.ode	@ltx/gr_gr_cog/miscellanea:misc.Ode8
ltx/gr_gr_cog/me.m02.d02:meMA.Ode8C13.text	Ζωὴ πεφυκὼς οὗτος ἔσται, πτῶσις ἀπειθοῦσι, νηπιάσας Θεὸς Λόγος, ὡς ἀνάστασις πᾶσι, τοῖς πίστει μέλπουσιν· Εὐλογεῖτε πάντα τὰ ἔργα τὸν Κύριον, καὶ ὑπερυψοῦτε, εἰς πάντας τοὺς αἰῶνας.
ltx/gr_gr_cog/me.m02.d02:meMA.Ode8C1H.greekmelody	@ltx/gr_gr_cog/he.h.m3:heHE.AstektoPyri.greekname
ltx/gr_gr_cog/me.m02.d02:meMA.Ode8C1H.incipit	@ltx/gr_gr_cog/he.h.m3:heHE.AstektoPyri.incipit
ltx/gr_gr_cog/me.m02.d02:meMA.Ode8C1H.melody	@ltx/gr_gr_cog/he.h.m3:heHE.AstektoPyri.melody
ltx/gr_gr_cog/me.m02.d02:meMA.Ode8C1H.mode	@ltx/gr_gr_cog/miscellanea:misc.Mode3
ltx/gr_gr_cog/me.m02.d02:meMA.Ode8C1H.ode	@ltx/gr_gr_cog/miscellanea:misc.Ode8
ltx/gr_gr_cog/me.m02.d02:meMA.Ode8C1H.text	@ltx/gr_gr_cog/he.h.m3:heHE.AstektoPyri.text
ltx/gr_gr_cog/me.m02.d02:meMA.Ode9C11.greekmelody	@ltx/gr_gr_cog/he.h.m3:heHE.EnNomoSkia.greekname
ltx/gr_gr_cog/me.m02.d02:meMA.Ode9C11.incipit	Τοῖς πρὶν νεογνῶν…
ltx/gr_gr_cog/me.m02.d02:meMA.Ode9C11.melody	@ltx/gr_gr_cog/he.h.m3:heHE.EnNomoSkia.name
ltx/gr_gr_cog/me.m02.d02:meMA.Ode9C11.mode	@ltx/gr_gr_cog/miscellanea:misc.Mode3
ltx/gr_gr_cog/me.m02.d02:meMA.Ode9C11.ode	@ltx/gr_gr_cog/miscellanea:misc.Ode9
ltx/gr_gr_cog/me.m02.d02:meMA.Ode9C11.text	Τοῖς πρὶν νεογνῶν τρυγόνων ζεῦγος, δυάς τε ἦν νεοσσῶν· ἀνθʼ ὧν ὁ θεῖος Πρέσβυς καὶ σώφρων, Ἄννα Προφῆτις, τῷ ἐκ Παρθένου τεχθέντι, καὶ οἵῳ γόνῳ Πατρός, ἐν τῷ ναῷ προσιόντι, λειτουργοῦντες ἐμεγάλυνον.
ltx/gr_gr_cog/me.m02.d02:meMA.Ode9C12.incipit	Ἀπέδωκάς μοι ἐβόα Συμεών…
ltx/gr_gr_cog/me.m02.d02:meMA.Ode9C12.melody	@ltx/gr_gr_cog/he.h.m3:heHE.EnNomoSkia.name
ltx/gr_gr_cog/me.m02.d02:meMA.Ode9C12.mode	@ltx/gr_gr_cog/miscellanea:misc.Mode3
ltx/gr_gr_cog/me.m02.d02:meMA.Ode9C12.ode	@ltx/gr_gr_cog/miscellanea:misc.Ode9
ltx/gr_gr_cog/me.m02.d02:meMA.Ode9C12.text	Ἀπέδωκάς μοι ἐβόα Συμεών, τοῦ σωτηρίου σου Χριστέ, ἀγαλλίασιν· ἀπόλαβέ σου, τὸν λάτριν, τὸν τῇ σκιᾷ κεκμηκότα, νέον τῆς χάριτος, Ἱεροκήρυκα μύστην, ἐν αἰνέσει μεγαλύνοντα.
ltx/gr_gr_cog/me.m02.d02:meMA.Ode9C13.incipit	Ἱεροπρεπῶς ἀνθωμολογεῖτο…
ltx/gr_gr_cog/me.m02.d02:meMA.Ode9C13.melody	@ltx/gr_gr_cog/he.h.m3:heHE.EnNomoSkia.name
ltx/gr_gr_cog/me.m02.d02:meMA.Ode9C13.mode	@ltx/gr_gr_cog/miscellanea:misc.Mode3
ltx/gr_gr_cog/me.m02.d02:meMA.Ode9C13.ode	@ltx/gr_gr_cog/miscellanea:misc.Ode9
ltx/gr_gr_cog/me.m02.d02:meMA.Ode9C13.text	Ἱεροπρεπῶς ἀνθωμολογεῖτο, Ἄννα ὑποφητεύουσα, ἡ σώφρων καὶ ὁσία καὶ πρεσβυρά, τῷ Δεσπότῃ, ἐν τῷ ναῷ διαῤῥήδην· τὴν Θεοτόκον δέ, ἀνακηρύττουσα πᾶσι, τοῖς παροῦσιν ἐμεγάλυνεν.
ltx/gr_gr_cog/me.m02.d02:meMA.Ode9C1H.greekmelody	@ltx/gr_gr_cog/he.h.m3:heHE.EnNomoSkia.greekname
ltx/gr_gr_cog/me.m02.d02:meMA.Ode9C1H.incipit	@ltx/gr_gr_cog/he.h.m3:heHE.EnNomoSkia.incipit
ltx/gr_gr_cog/me.m02.d02:meMA.Ode9C1H.melody	@ltx/gr_gr_cog/he.h.m3:heHE.EnNomoSkia.melody
ltx/gr_gr_cog/me.m02.d02:meMA.Ode9C1H.mode	@ltx/gr_gr_cog/miscellanea:misc.Mode3
ltx/gr_gr_cog/me.m02.d02:meMA.Ode9C1H.ode	@ltx/gr_gr_cog/miscellanea:misc.Ode9
ltx/gr_gr_cog/me.m02.d02:meMA.Ode9C1H.text	@ltx/gr_gr_cog/he.h.m3:heHE.EnNomoSkia.text
ltx/gr_gr_cog/me.m02.d02:meMA.Ode9C1M01.incipit	…
ltx/gr_gr_cog/me.m02.d02:meMA.Ode9C1M01.text	Ἀκατάληπτόν ἐστι, τὸ τελούμενον ἐν σοί, καὶ Ἀγγέλοις καὶ βροτοῖς, Μητροπάρθενε ἁγνή.
ltx/gr_gr_cog/me.m02.d02:meMA.Ode9C1M02.incipit	…
ltx/gr_gr_cog/me.m02.d02:meMA.Ode9C1M02.text	Ἀγκαλίζεται χερσίν, ὁ Πρεσβύτης Συμεών, τὸν τοῦ νόμου Ποιητήν, καὶ Δεσπότην τοῦ παντός.
ltx/gr_gr_cog/me.m02.d02:meMA.Ode9C1M03.incipit	…
ltx/gr_gr_cog/me.m02.d02:meMA.Ode9C1M03.text	Βουληθεὶς ὁ Πλαστουργός, ἵνα σώσῃ τὸν Ἀδάμ, μήτραν ᾤκησε τὴν σήν, τῆς Παρθένου καὶ ἁγνῆς.
ltx/gr_gr_cog/me.m02.d02:meMA.Ode9C1M04.incipit	…
ltx/gr_gr_cog/me.m02.d02:meMA.Ode9C1M04.text	Γένος ἅπαν τῶν βροτῶν, μακαρίζει σε Ἁγνή, καὶ δοξάζει σε πιστῶς, ὡς Μητέρα τοῦ Θεοῦ.
ltx/gr_gr_cog/me.m02.d02:meMA.Ode9C1M05.incipit	…
ltx/gr_gr_cog/me.m02.d02:meMA.Ode9C1M05.text	Δεῦτε ἴδετε Χριστόν, τὸν Δεσπότην τοῦ παντός, ὃν βαστάζει Συμεών, σήμερον ἐν τῷ ναῷ.
ltx/gr_gr_cog/me.m02.d02:meMA.Ode9C1M06.incipit	…
ltx/gr_gr_cog/me.m02.d02:meMA.Ode9C1M06.text	Ἐπιβλέπεις πρὸς τὴν γῆν, καὶ ποιεῖς τρέμειν αὐτήν, καὶ πῶς γέρων κεκμηκώς, σὲ κατέχει ἐν χερσί;
ltx/gr_gr_cog/me.m02.d02:meMA.Ode9C1M07.incipit	…
ltx/gr_gr_cog/me.m02.d02:meMA.Ode9C1M07.text	Ζήσας ἔτη Συμεών, ἕως εἶδε τὸν Χριστόν, καὶ ἐβόα πρὸς αὐτόν. Νῦν ἀπόλυσιν ζητῶ.
ltx/gr_gr_cog/me.m02.d02:meMA.Ode9C1M08.incipit	…
ltx/gr_gr_cog/me.m02.d02:meMA.Ode9C1M08.text	Ἡ λαβὶς ἡ μυστική, ἡ τὸν ἄνθρακα Χριστόν, συλλαβοῦσα ἐν γαστρί, σὺ ὑπάρχεις Μαριάμ.
ltx/gr_gr_cog/me.m02.d02:meMA.Ode9C1M09.incipit	…
ltx/gr_gr_cog/me.m02.d02:meMA.Ode9C1M09.text	Θέλων ἐνηνθρώπησας, ὁ προάναρχος Θεός, καὶ ναῷ προσφέρεσαι, τεσσαρακονθήμερος.
ltx/gr_gr_cog/me.m02.d02:meMA.Ode9C1M10.incipit	…
ltx/gr_gr_cog/me.m02.d02:meMA.Ode9C1M10.text	Κατελθόντʼ ἐξ οὐρανοῦ, τὸν Δεσπότην τοῦ παντός, ὑπεδέξατο αὐτόν, Συμεὼν ὁ Ἱερεύς.
ltx/gr_gr_cog/me.m02.d02:meMA.Ode9C1M11.incipit	…
ltx/gr_gr_cog/me.m02.d02:meMA.Ode9C1M11.text	Λάμπρυνόν μου τὴν ψυχήν, καὶ τὸ φῶς τὸ αἰσθητόν, ὅπως ἴδω καθαρῶς, καὶ κηρύξω σε Θεόν.
ltx/gr_gr_cog/me.m02.d02:meMA.Ode9C1M12.incipit	…
ltx/gr_gr_cog/me.m02.d02:meMA.Ode9C1M12.text	Μητροπάρθενε ἁγνή, τί προσφέρεις τῷ ναῷ, νέον βρέφος ἀποδούς, ἐν ἀγκάλαις Συμεών;
ltx/gr_gr_cog/me.m02.d02:meMA.Ode9C1M13.incipit	…
ltx/gr_gr_cog/me.m02.d02:meMA.Ode9C1M13.text	Νῦν ἀπόλυσιν ζητῶ, ἀπὸ σοῦ τοῦ Πλαστουργοῦ, ὅτι εἶδόν σε Χριστέ, τὸ σωτήριόν μου φῶς.
ltx/gr_gr_cog/me.m02.d02:meMA.Ode9C1M14.incipit	…
ltx/gr_gr_cog/me.m02.d02:meMA.Ode9C1M14.text	Ὃν οἱ ἄνω λειτουργοί, τρόμῳ λιτανεύουσι, κάτω νῦν ὁ Συμεών, ἀγκαλίζεται χερσί.
ltx/gr_gr_cog/me.m02.d02:meMA.Ode9C1MTh.incipit	Θεοτόκε ἡ ἐλπίς…
ltx/gr_gr_cog/me.m02.d02:meMA.Ode9C1MTh.text	Θεοτόκε ἡ ἐλπίς, πάντων τῶν Χριστιανῶν, σκέπε φρούρει φύλαττε, τοὺς ἐλπίζοντας εἰς σέ.
ltx/gr_gr_cog/me.m02.d02:meMA.Ode9C1MTr.incipit	…
ltx/gr_gr_cog/me.m02.d02:meMA.Ode9C1MTr.text	Ἡ τῇ φύσει μὲν Μονάς, τοῖς προσώποις δὲ Τριάς, φύλαττε τοὺς δούλους σου, τοὺς πιστεύοντας εἰς σέ.
ltx/gr_gr_cog/me.m02.d02:meMA.Oikos1.text	Τῇ Θεοτόκῳ προσδράμωμεν οἱ βουλόμενοι κατιδεῖν τὸν Υἱὸν αὐτῆς, πρὸς Συμεὼν ἀπαγόμενον· ὅν περ οὐρανόθεν οἱ Ἀσώματοι βλέποντες, ἐξεπλήττοντο λέγοντες· Θαυμαστὰ θεωροῦμεν νυνὶ καὶ παράδοξα, ἀκατάληπτα, ἄφραστα· ὁ τὸν Ἀδὰμ δημιουργήσας, βαστάζεται ὡς βρέφος· ὁ ἀχώρητος χωρεῖται ἐν ἀγκάλαις τοῦ Πρεσβύτου· ὁ ἐπὶ τῶν κόλπων ἀπεριγράπτως ὑπάρχων τοῦ Πατρὸς αὐτοῦ, ἑκὼν περιγράφεται σαρκί, οὐ Θεότητι, ὁ μόνος φιλάνθρωπος.
ltx/gr_gr_cog/me.m02.d02:meMA.PostGospelBoth.incipit	@ltx/gr_gr_cog/ho.ho03:hoMA.PostGospelTheotokos.incipit
ltx/gr_gr_cog/me.m02.d02:meMA.PostGospelBoth.melody	
ltx/gr_gr_cog/me.m02.d02:meMA.PostGospelBoth.mode	@ltx/gr_gr_cog/miscellanea:misc.Mode2
ltx/gr_gr_cog/me.m02.d02:meMA.PostGospelBoth.text	@ltx/gr_gr_cog/ho.ho03:hoMA.PostGospelTheotokos.text
ltx/gr_gr_cog/me.m02.d02:meMA.PostGospelGlory.incipit	@ltx/gr_gr_cog/ho.ho03:hoMA.PostGospelTheotokos.incipit
ltx/gr_gr_cog/me.m02.d02:meMA.PostGospelGlory.melody	
ltx/gr_gr_cog/me.m02.d02:meMA.PostGospelGlory.mode	@ltx/gr_gr_cog/miscellanea:misc.Mode2
ltx/gr_gr_cog/me.m02.d02:meMA.PostGospelGlory.text	@ltx/gr_gr_cog/ho.ho03:hoMA.PostGospelTheotokos.text
ltx/gr_gr_cog/me.m02.d02:meMA.PostGospelIdiomelon.incipit	@ltx/gr_gr_cog/me.m02.d02:meVE.SticGlory.incipit
ltx/gr_gr_cog/me.m02.d02:meMA.PostGospelIdiomelon.melody	
ltx/gr_gr_cog/me.m02.d02:meMA.PostGospelIdiomelon.mode	@ltx/gr_gr_cog/miscellanea:misc.Mode6
ltx/gr_gr_cog/me.m02.d02:meMA.PostGospelIdiomelon.poet	@ltx/gr_gr_cog/poets:po.IoannouMonachou
ltx/gr_gr_cog/me.m02.d02:meMA.PostGospelIdiomelon.text	@ltx/gr_gr_cog/me.m02.d02:meVE.SticGlory.text
ltx/gr_gr_cog/me.m02.d02:meSV.AposGlory.incipit	Δέχου ὦ Συμεών, ἡ Πάναγνος…
ltx/gr_gr_cog/me.m02.d02:meSV.AposGlory.melody	@ltx/gr_gr_cog/he.a.m2:heAU.OikosTouEfratha.name
ltx/gr_gr_cog/me.m02.d02:meSV.AposGlory.mode	@ltx/gr_gr_cog/miscellanea:misc.Mode2
ltx/gr_gr_cog/me.m02.d02:meSV.AposGlory.text	Δέχου ὦ Συμεών, ἡ Πάναγνος ἐβόα, ἐν ἀγκάλαις ὡς βρέφος, τὸν Κύριον τῆς δόξης, καὶ κόσμου τὸ σωτήριον.
ltx/gr_gr_cog/me.m02.d02:meSV.Aposticha1.incipit	Σήμερον ὁ Σωτήρ, ὡς βρέφος…
ltx/gr_gr_cog/me.m02.d02:meSV.Aposticha1.melody	@ltx/gr_gr_cog/he.a.m2:heAU.OikosTouEfratha.name
ltx/gr_gr_cog/me.m02.d02:meSV.Aposticha1.mode	@ltx/gr_gr_cog/miscellanea:misc.Mode2
ltx/gr_gr_cog/me.m02.d02:meSV.Aposticha1.text	Σήμερον ὁ Σωτήρ, ὡς βρέφος προσηνέχθη, ἐν τῷ ναῷ Κυρίου, καὶ χερσὶ γηραλέαις, ὁ Πρέσβυς τοῦτον δέχεται.
ltx/gr_gr_cog/me.m02.d02:meSV.Aposticha2.incipit	Ἄνθραξ ὁ προοφθείς, τῷ θείῳ…
ltx/gr_gr_cog/me.m02.d02:meSV.Aposticha2.melody	@ltx/gr_gr_cog/he.a.m2:heAU.OikosTouEfratha.name
ltx/gr_gr_cog/me.m02.d02:meSV.Aposticha2.mode	@ltx/gr_gr_cog/miscellanea:misc.Mode2
ltx/gr_gr_cog/me.m02.d02:meSV.Aposticha2.text	Ἄνθραξ ὁ προοφθείς, τῷ θείῳ Ἠσαΐᾳ, Χριστὸς ὡς ἐν λαβίδι, χερσὶ τῆς Θεοτόκου, νῦν τῷ Πρεσβύτῃ δίδοται.
ltx/gr_gr_cog/me.m02.d02:meSV.Aposticha3.incipit	Φόβῳ τε καὶ χαρᾷ, ἀγκάλαις…
ltx/gr_gr_cog/me.m02.d02:meSV.Aposticha3.melody	@ltx/gr_gr_cog/he.a.m2:heAU.OikosTouEfratha.name
ltx/gr_gr_cog/me.m02.d02:meSV.Aposticha3.mode	@ltx/gr_gr_cog/miscellanea:misc.Mode2
ltx/gr_gr_cog/me.m02.d02:meSV.Aposticha3.text	Φόβῳ τε καὶ χαρᾷ, ἀγκάλαις τὸν Δεσπότην, ὁ Συμεὼν κατέχων, ζωῆς ᾐτεῖτο λύσιν, ὑμνῶν τὴν Θεομήτορα.
ltx/gr_gr_cog/me.m02.d02:meSV.SticGlory.incipit	@ltx/gr_gr_cog/me.m02.d02:meVE.Lity8.incipit
ltx/gr_gr_cog/me.m02.d02:meSV.SticGlory.melody	
ltx/gr_gr_cog/me.m02.d02:meSV.SticGlory.mode	@ltx/gr_gr_cog/miscellanea:misc.Mode4
ltx/gr_gr_cog/me.m02.d02:meSV.SticGlory.poet	@ltx/gr_gr_cog/poets:po.AndreouKritis
ltx/gr_gr_cog/me.m02.d02:meSV.SticGlory.text	@ltx/gr_gr_cog/me.m02.d02:meVE.Lity8.text
ltx/gr_gr_cog/me.m02.d02:meSV.Stichera1.incipit	Τὸν ἀπερίγραπτον Λόγον καὶ ὑπερούσιον…
ltx/gr_gr_cog/me.m02.d02:meSV.Stichera1.melody	@ltx/gr_gr_cog/he.a.m1:heAU.TonOuranionTagmaton.name
ltx/gr_gr_cog/me.m02.d02:meSV.Stichera1.mode	@ltx/gr_gr_cog/miscellanea:misc.Mode1
ltx/gr_gr_cog/me.m02.d02:meSV.Stichera1.text	Τὸν ἀπερίγραπτον Λόγον καὶ ὑπερούσιον, τὸν οὐρανίοις θρόνοις, ἐποχούμενον δόξῃ, εἰσδέχεται ἀγκάλαις ὁ Συμεών, ἐκβοῶν· Νὺν ἀπόλυσον, κατὰ τὸ ῥῆμά σου Σῶτερ, ἡ τῶν πιστῶν, σωτηρία καὶ ἀπόλαυσις.
ltx/gr_gr_cog/me.m02.d02:meSV.Stichera2.incipit	Βρέφος ὁρῶν σε ἐβόα ὁ…
ltx/gr_gr_cog/me.m02.d02:meSV.Stichera2.melody	@ltx/gr_gr_cog/he.a.m1:heAU.TonOuranionTagmaton.name
ltx/gr_gr_cog/me.m02.d02:meSV.Stichera2.mode	@ltx/gr_gr_cog/miscellanea:misc.Mode1
ltx/gr_gr_cog/me.m02.d02:meSV.Stichera2.text	Βρέφος ὁρῶν σε ἐβόα ὁ θαυμαστὸς Συμεών, τὸν πρὸ αἰώνων Λόγον, ἐκ Πατρὸς γεννηθέντα. Φρίττω καὶ πτοοῦμαι χερσὶν ἐμαῖς, ἀγκαλίσασθαι Δέσποτα, ἀλλʼ ἐν εἰρήνῃ τὸν δοῦλόν σου ἐκζητῶ, νῦν ἀπόλυσον ὡς εὔσπλαγχνος.
ltx/gr_gr_cog/me.m02.d02:meSV.Stichera3.incipit	Νῦν ἀνοιγέσθω ἡ πύλη ἡ…
ltx/gr_gr_cog/me.m02.d02:meSV.Stichera3.melody	@ltx/gr_gr_cog/he.a.m1:heAU.TonOuranionTagmaton.name
ltx/gr_gr_cog/me.m02.d02:meSV.Stichera3.mode	@ltx/gr_gr_cog/miscellanea:misc.Mode1
ltx/gr_gr_cog/me.m02.d02:meSV.Stichera3.text	Νῦν ἀνοιγέσθω ἡ πύλη ἡ ἐπουράνιος, ὁ ἐκ Πατρὸς ἀχρόνως, γεννηθεὶς Θεὸς Λόγος, ἐτέχθη ἐκ Παρθένου, σάρκα λαβών, τὴν βροτείαν βουλόμενος, ἀνακαλέσασθαι φύσιν ὡς ἀγαθός, καὶ βαλεῖν ἐν δεξιᾷ τοῦ Πατρός.
ltx/gr_gr_cog/me.m02.d02:meVE.Apolytikion1.incipit	Χαῖρε κεχαριτωμένη…
ltx/gr_gr_cog/me.m02.d02:meVE.Apolytikion1.melody	
ltx/gr_gr_cog/me.m02.d02:meVE.Apolytikion1.mode	@ltx/gr_gr_cog/miscellanea:misc.Mode1
ltx/gr_gr_cog/me.m02.d02:meVE.Apolytikion1.text	Χαῖρε κεχαριτωμένη Θεοτόκε Παρθένε· ἐκ σοῦ γὰρ ἀνέτειλεν ὁ Ἥλιος τῆς δικαιοσύνης, Χριστὸς ὁ Θεὸς ἡμῶν, φωτίζων τοὺς ἐν σκότει. Εὐφραίνου καὶ σὺ Πρεσβύτα δίκαιε, δεξάμενος ἐν ἀγκάλαις τὸν ἐλευθερωτὴν τῶν ψυχῶν ἡμῶν, χαριζόμενον ἡμῖν καὶ τὴν Ἀνάστασιν.
ltx/gr_gr_cog/me.m02.d02:meVE.AposGlory.incipit	Ὁ τοῖς Χερουβὶμ ἐποχούμενος, καὶ…
ltx/gr_gr_cog/me.m02.d02:meVE.AposGlory.melody	
ltx/gr_gr_cog/me.m02.d02:meVE.AposGlory.mode	@ltx/gr_gr_cog/miscellanea:misc.Mode8
ltx/gr_gr_cog/me.m02.d02:meVE.AposGlory.poet	@ltx/gr_gr_cog/poets:po.AndreouKritis
ltx/gr_gr_cog/me.m02.d02:meVE.AposGlory.text	Ὁ τοῖς Χερουβὶμ ἐποχούμενος, καὶ ὑμνούμενος ὑπὸ τῶν Σεραφίμ, σήμερον τῷ θείῳ Ἱερῷ κατὰ νόμον προσφερόμενος, πρεσβυτικαῖς ἐνθρονίζεται ἀγκάλαις, καὶ ὑπὸ Ἰωσὴφ εἰσδέχεται δῶρα θεοπρεπῶς, ὡς ζεῦγος τρυγόνων τὴν ἀμίαντον Ἐκκλησίαν, καὶ τῶν ἐθνῶν τὸν νεόλεκτον λαόν, περιστερῶν δὲ δύο νεοσσούς, ὡς ἀρχηγὸς Παλαιᾶς τε καὶ Καινῆς. Τοῦ πρὸς αὐτὸν χρησμοῦ δὲ Συμεών, τὸ πέρας δεξάμενος, εὐλογῶν τὴν Παρθένον, Θεοτόκον Μαρίαν, τὰ τοῦ πάθους σύμβολα τοῦ ἐξ αὐτῆς προηγόρευσε, καὶ παρʼ αὐτοῦ ἐξαιτεῖται τὴν ἀπόλυσιν βοῶν· Νῦν ἀπολύεις με Δέσποτα, καθὼς προεπηγγείλω μοι, ὅτι εἶδόν σε τὸ προαιώνιον φῶς, καὶ Σωτῆρα Κύριον τοῦ Χριστωνύμου λαοῦ.
ltx/gr_gr_cog/me.m02.d02:meVE.Aposticha1.incipit	Κατακόσμησον τὸν νυμφῶνά σου Σιών…
ltx/gr_gr_cog/me.m02.d02:meVE.Aposticha1.melody	
ltx/gr_gr_cog/me.m02.d02:meVE.Aposticha1.mode	@ltx/gr_gr_cog/miscellanea:misc.Mode7
ltx/gr_gr_cog/me.m02.d02:meVE.Aposticha1.poet	@ltx/gr_gr_cog/poets:po.KosmaMonachou
ltx/gr_gr_cog/me.m02.d02:meVE.Aposticha1.text	Κατακόσμησον τὸν νυμφῶνά σου Σιών, καὶ ὑπόδεξαι τὸν Βασιλέα Χριστόν, ἄσπασαι τὴν Μαριάμ, τὴν ἐπουράνιον πύλην· αὕτη γὰρ θρόνος Χερουβικὸς ἀνεδείχθη, αὕτη βαστάζει τὸν Βασιλέα τῆς δόξης, νεφέλη φωτὸς ὑπάρχει ἡ Παρθένος, φέρουσα ἐν σαρκὶ Υἱὸν πρὸ Ἑωσφόρου, ὃν λαβὼν Συμεὼν ἐν ἀγκάλαις αὐτοῦ ἐκήρυξε λαοῖς, Δεσπότην αὐτὸν εἶναι, ζωῆς καὶ τοῦ θανάτου, καὶ Σωτῆρα τοῦ κόσμου.
ltx/gr_gr_cog/me.m02.d02:meVE.Aposticha2.incipit	Τὸν ἐκλάμψαντα πρὸ αἰώνων ἐκ…
ltx/gr_gr_cog/me.m02.d02:meVE.Aposticha2.melody	
ltx/gr_gr_cog/me.m02.d02:meVE.Aposticha2.mode	@ltx/gr_gr_cog/miscellanea:misc.Mode7
ltx/gr_gr_cog/me.m02.d02:meVE.Aposticha2.text	Τὸν ἐκλάμψαντα πρὸ αἰώνων ἐκ Πατρός, ἐπʼ ἐσχάτων δὲ ἐκ μήτρας Παρθενικῆς, φέρουσα ἐν τῷ ναῷ, ἡ ἀπειρόγαμος Μήτηρ, τὸν ἐν Σιναίῳ νομοθετήσαντα ὄρει, τῇ διατάξει τῇ νομικῇ πειθαρχοῦντα, προσῆγεν Ἱερεῖ, πρεσβύτῃ καὶ δικαίῳ, Χριστὸν τὸν Κύριον, ἰδεῖν χρηματισθέντι, ὃν δεξάμενος Συμεὼν ἐν ταῖς ἀγκάλαις αὐτοῦ, ἠγαλλιάσατο βοῶν· Θεὸς ὑπάρχει οὗτος, Πατρὶ συναΐδιος, καὶ Λυτρωτὴς τῶν ψυχῶν ἡμῶν.
ltx/gr_gr_cog/me.m02.d02:meVE.Aposticha3.incipit	Τὸν ὀχούμενον ἐν ἅρμασι Χερουβίμ…
ltx/gr_gr_cog/me.m02.d02:meVE.Aposticha3.melody	
ltx/gr_gr_cog/me.m02.d02:meVE.Aposticha3.mode	@ltx/gr_gr_cog/miscellanea:misc.Mode7
ltx/gr_gr_cog/me.m02.d02:meVE.Aposticha3.text	Τὸν ὀχούμενον ἐν ἅρμασι Χερουβίμ, καὶ ὑμνούμενον ἐν ᾄσματι Σεραφίμ, φέρουσα ἐν ἀγκάλαις ἡ Θεοτόκος Μαρία, ἀπειρογάμως ἐξ αὐτῆς σαρκωθέντα, τὸν Νομοδότην νόμου, πληροῦντα νόμου τάξιν, ἐδίδου χερσὶ πρεσβύτου Ἱερέως· ζωὴν δὲ φέρων, ζωῆς ᾐτεῖτο λύσιν, λέγων· Δέσποτα, νῦν ἀπόλυσόν με, μηνῦσαι τῷ Ἀδάμ, ὡς εἶδον ἄτρεπτον βρέφος, Θεὸν προαιώνιον, καὶ Σωτῆρα τοῦ κόσμου.
ltx/gr_gr_cog/me.m02.d02:meVE.Lity1.incipit	Ὁ παλαιὸς ἡμερῶν…
ltx/gr_gr_cog/me.m02.d02:meVE.Lity1.melody	
ltx/gr_gr_cog/me.m02.d02:meVE.Lity1.mode	@ltx/gr_gr_cog/miscellanea:misc.Mode1
ltx/gr_gr_cog/me.m02.d02:meVE.Lity1.poet	@ltx/gr_gr_cog/poets:po.Anatoliou
ltx/gr_gr_cog/me.m02.d02:meVE.Lity1.text	Ὁ παλαιὸς ἡμερῶν, ὁ καὶ τὸν νόμον πάλαι ἐν Σινᾷ δοὺς τῷ Μωσεῖ, σήμερον βρέφος ὁρᾶται, καὶ κατὰ νόμον, ὡς νόμου Ποιητής, τὸν νόμον ἐκπληρῶν, ναῷ προσάγεται, καὶ τῷ Πρεσβύτῃ ἐπιδίδοται. Δεξάμενος δὲ τοῦτον Συμεὼν ὁ δίκαιος, καὶ τῶν δεσμῶν τὴν ἔκβασιν ἰδὼν τελεσθεῖσαν, γηθοσύνως ἐβόα· Εἶδον οἱ ὀφθαλμοί μου, τὸ ἀπʼ αἰῶνος Μυστήριον ἀποκεκρυμμένον, ἐπʼ ἐσχάτων τούτων ἡμερῶν φανερωθέν, φῶς διασκεδάζον, τῶν ἀπίστων ἐθνῶν τὴν σκοτόμαιναν, καὶ δόξαν τοῦ νεολέκτου Ἰσραήλ· διὸ ἀπόλυσον τὸν δοῦλόν σου, ἐκ τῶν δεσμῶν τοῦδε τοῦ σαρκίου, πρὸς τὴν ἀγήρω καὶ θαυμασίαν ἄληκτον ζωήν, ὁ παρέχων τῷ κόσμῳ τὸ μέγα ἔλεος.
ltx/gr_gr_cog/me.m02.d02:meVE.Lity2.incipit	Σήμερον ὁ πάλαι τῷ Μωσεῖ…
ltx/gr_gr_cog/me.m02.d02:meVE.Lity2.melody	
ltx/gr_gr_cog/me.m02.d02:meVE.Lity2.mode	@ltx/gr_gr_cog/miscellanea:misc.Mode1
ltx/gr_gr_cog/me.m02.d02:meVE.Lity2.poet	@ltx/gr_gr_cog/poets:po.IoannouMonachou
ltx/gr_gr_cog/me.m02.d02:meVE.Lity2.text	Σήμερον ὁ πάλαι τῷ Μωσεῖ, ἐν Σινᾷ νόμον ἐπιδούς, τοῖς νομικοῖς ὑποκύπτει θεσμοῖς, διʼ ἡμᾶς εὔσπλαγχνος γεγονώς. Νῦν ὁ καθαρὸς Θεός, ὡς παιδίον ἅγιον, μήτραν διανοίξαν ἁγνήν, ἑαυτῷ ὡς Θεὸς συγκομίζεται, τῆς τοῦ νόμου κατάρας ἐλευθερῶν, καὶ φωτίζων τὰς ψυχὰς ἡμῶν.
ltx/gr_gr_cog/me.m02.d02:meVE.Lity3.incipit	Ὄνπερ οἱ ἄνω Λειτουργοὶ τρόμῳ…
ltx/gr_gr_cog/me.m02.d02:meVE.Lity3.melody	
ltx/gr_gr_cog/me.m02.d02:meVE.Lity3.mode	@ltx/gr_gr_cog/miscellanea:misc.Mode2
ltx/gr_gr_cog/me.m02.d02:meVE.Lity3.poet	@ltx/gr_gr_cog/poets:po.AndreouPyrou
ltx/gr_gr_cog/me.m02.d02:meVE.Lity3.text	Ὄνπερ οἱ ἄνω Λειτουργοὶ τρόμῳ λιτανεύουσι, κάτω νῦν ὁ Συμεών, ὑλικαῖς ἀγκάλαις δεχόμενος, τὸ θεῖον τοῖς ἀνθρώποις ἑνοῦσθαι ἐκήρυττε, καὶ βροτὸν τὸν οὐράνιον Θεὸν ὀπτανόμενος, ἀναχωρῶν τῶν ἐπὶ γῆς, χαρμονικῶς ἀνέκραζεν, ὁ τοῖς ἐν σκότει τὸ ἀνέσπερον φῶς ἀποκαλύπτων, Κύριε δόξα σοι.
ltx/gr_gr_cog/me.m02.d02:meVE.Lity4.incipit	@ltx/gr_gr_cog/me.m02.d01:meVE.SticBoth.incipit
ltx/gr_gr_cog/me.m02.d02:meVE.Lity4.melody	
ltx/gr_gr_cog/me.m02.d02:meVE.Lity4.mode	@ltx/gr_gr_cog/miscellanea:misc.Mode2
ltx/gr_gr_cog/me.m02.d02:meVE.Lity4.poet	@ltx/gr_gr_cog/poets:po.Germanou
ltx/gr_gr_cog/me.m02.d02:meVE.Lity4.text	@ltx/gr_gr_cog/me.m02.d01:meVE.SticBoth.text
ltx/gr_gr_cog/me.m02.d02:meVE.Lity5.incipit	@ltx/gr_gr_cog/me.m02.d01:meVE.AposGlory.incipit
ltx/gr_gr_cog/me.m02.d02:meVE.Lity5.melody	
ltx/gr_gr_cog/me.m02.d02:meVE.Lity5.mode	@ltx/gr_gr_cog/miscellanea:misc.Mode2
ltx/gr_gr_cog/me.m02.d02:meVE.Lity5.poet	@ltx/gr_gr_cog/poets:po.GermanouOiDeIoannouMonachou
ltx/gr_gr_cog/me.m02.d02:meVE.Lity5.text	@ltx/gr_gr_cog/me.m02.d01:meVE.AposGlory.text
ltx/gr_gr_cog/me.m02.d02:meVE.Lity6.incipit	@ltx/gr_gr_cog/me.m02.d01:meMA.AposGlory.incipit
ltx/gr_gr_cog/me.m02.d02:meVE.Lity6.melody	
ltx/gr_gr_cog/me.m02.d02:meVE.Lity6.mode	@ltx/gr_gr_cog/miscellanea:misc.Mode2
ltx/gr_gr_cog/me.m02.d02:meVE.Lity6.poet	@ltx/gr_gr_cog/poets:po.GermanouOiDeIoannouMonachou
ltx/gr_gr_cog/me.m02.d02:meVE.Lity6.text	@ltx/gr_gr_cog/me.m02.d01:meMA.AposGlory.text
ltx/gr_gr_cog/me.m02.d02:meVE.Lity7.incipit	Σήμερον Συμεὼν ὁ πρεσβύτης…
ltx/gr_gr_cog/me.m02.d02:meVE.Lity7.melody	
ltx/gr_gr_cog/me.m02.d02:meVE.Lity7.mode	@ltx/gr_gr_cog/miscellanea:misc.Mode2
ltx/gr_gr_cog/me.m02.d02:meVE.Lity7.poet	@ltx/gr_gr_cog/poets:po.AnatoliouOiDeAndreouIerosolymitou
ltx/gr_gr_cog/me.m02.d02:meVE.Lity7.text	Σήμερον Συμεὼν ὁ πρεσβύτης, ἐν τῷ Ναῷ εἰσέρχεται, χαίρων τῷ πνεύματι τὸν Νομοδότην Μωσέως, καὶ πληρωτὴν τοῦ νόμου, ἀγκάλαις εἰσδέξασθαι· ἐκεῖνος μέν, διὰ γνόφου καὶ φωνῆς ἀμυδρᾶς, θεόπτης ἠξίωτο, καὶ κεκαλυμμένῳ προσώπῳ τῶν Ἑβραίων τὰς ἀπίστους καρδίας διήλεγξεν, οὗτος δέ, τὸν προαιώνιον Λόγον τοῦ Πατρός, σωματωθέντα ἐβάστασε, καὶ τῶν Ἐθνῶν ἀπεκάλυψε τὸ φῶς, τὸν Σταυρὸν καὶ τὴν Ἀνάστασιν. Καὶ Ἄννα Προφῆτις ἀναδείκνυται, τὸν Σωτῆρα λυτρωτὴν τοῦ Ἰσραὴλ κηρύττουσα. Αὐτῷ βοήσωμεν. Χριστὲ ὁ Θεὸς ἡμῶν, διὰ τῆς Θεοτόκου ἐλέησον ἡμᾶς.
ltx/gr_gr_cog/me.m02.d02:meVE.Lity8.incipit	Σήμερον ἡ Ἱερὰ Μήτηρ, καὶ…
ltx/gr_gr_cog/me.m02.d02:meVE.Lity8.melody	
ltx/gr_gr_cog/me.m02.d02:meVE.Lity8.mode	@ltx/gr_gr_cog/miscellanea:misc.Mode4
ltx/gr_gr_cog/me.m02.d02:meVE.Lity8.poet	@ltx/gr_gr_cog/poets:po.AndreouKritis
ltx/gr_gr_cog/me.m02.d02:meVE.Lity8.text	Σήμερον ἡ Ἱερὰ Μήτηρ, καὶ τοῦ Ἱεροῦ ὑψηλοτέρα, ἐπὶ τὸ Ἱερὸν παραγέγονεν, ἐμφανίζουσα τῷ κόσμῳ, τὸν τοῦ κόσμου Ποιητήν, καὶ τοῦ νόμου πάροχον, ὃν καὶ ἐν ἀγκάλαις ὑποδεξάμενος, ὁ πρεσβύτης Συμεών, γεραίρων ἐκραύγαζε· Νῦν ἀπολύεις τὸν δοῦλόν σου, ὅτι εἶδόν σε τὸν Σωτῆρα τῶν ψυχῶν ἡμῶν.
ltx/gr_gr_cog/me.m02.d02:meVE.LityBoth.incipit	Ὁ παλαιὸς ἡμερῶν, νηπιάσας σαρκί…
ltx/gr_gr_cog/me.m02.d02:meVE.LityBoth.melody	
ltx/gr_gr_cog/me.m02.d02:meVE.LityBoth.mode	@ltx/gr_gr_cog/miscellanea:misc.Mode5
ltx/gr_gr_cog/me.m02.d02:meVE.LityBoth.poet	@ltx/gr_gr_cog/poets:po.GermanouOiDeAnatoliou
ltx/gr_gr_cog/me.m02.d02:meVE.LityBoth.text	Ὁ παλαιὸς ἡμερῶν, νηπιάσας σαρκί, ὑπὸ Μητρὸς Παρθένου τῷ Ἱερῷ προσάγεται, τοῦ οἰκείου νόμου πληρῶν τὸ ἐπάγγελμα, ὃν Συμεὼν δεξάμενος ἔλεγε. Νῦν ἀπολύεις ἐν εἰρήνῃ κατὰ τὸ ῥῆμά σου τὸν δοῦλόν σου· εἶδον γὰρ οἱ ὀφθαλμοί μου τὸ σωτήριόν σου Κύριε.
ltx/gr_gr_cog/me.m02.d02:meVE.LityGlory.incipit	Ἐρευνᾶτε τὰς Γραφάς, καθὼς εἶπεν…
ltx/gr_gr_cog/me.m02.d02:meVE.LityGlory.melody	
ltx/gr_gr_cog/me.m02.d02:meVE.LityGlory.mode	@ltx/gr_gr_cog/miscellanea:misc.Mode5
ltx/gr_gr_cog/me.m02.d02:meVE.LityGlory.poet	@ltx/gr_gr_cog/poets:po.AndreouKritis
ltx/gr_gr_cog/me.m02.d02:meVE.LityGlory.text	Ἐρευνᾶτε τὰς Γραφάς, καθὼς εἶπεν ἐν Εὐαγγελίοις Χριστὸς ὁ Θεὸς ἡμῶν· ἐν αὐταῖς γὰρ εὑρίσκομεν αὐτόν, τικτόμενον καὶ σπαργανούμενον, τιθηνούμενον καὶ γαλακτοτροφούμενον, περιτομὴν δεχόμενον, καὶ ὑπὸ Συμεὼν βασταχθέντα, οὐ δοκήσει οὐδὲ φαντασίᾳ, ἀλλʼ ἀληθείᾳ τῷ κόσμῳ φανέντα, πρὸς ὃν βοήσωμεν· Ὁ πρὸ αἰώνων Θεός, δόξα σοι.
ltx/gr_gr_cog/me.m02.d02:meVE.MM.Stichera1123as78910.text	@ltx/gr_gr_cog/properties:media.key
ltx/gr_gr_cog/me.m02.d02:meVE.MM.Stichera123as567.text	@ltx/gr_gr_cog/properties:media.key
ltx/gr_gr_cog/me.m02.d02:meVE.MM.Stichera123as8910.text	@ltx/gr_gr_cog/properties:media.key
ltx/gr_gr_cog/me.m02.d02:meVE.SticGlory.incipit	Ἀνοιγέσθω ἡ πύλη τοῦ οὐρανοῦ…
ltx/gr_gr_cog/me.m02.d02:meVE.SticGlory.melody	
ltx/gr_gr_cog/me.m02.d02:meVE.SticGlory.mode	@ltx/gr_gr_cog/miscellanea:misc.Mode6
ltx/gr_gr_cog/me.m02.d02:meVE.SticGlory.poet	@ltx/gr_gr_cog/poets:po.IoannouMonachou
ltx/gr_gr_cog/me.m02.d02:meVE.SticGlory.text	Ἀνοιγέσθω ἡ πύλη τοῦ οὐρανοῦ σήμερον· ὁ γὰρ ἄναρχος Λόγος τοῦ Πατρός, ἀρχὴν λαβὼν χρονικήν, μὴ ἐκστὰς τῆς αὐτοῦ Θεότητος, ὑπὸ Παρθένου ὡς βρέφος τεσσαρακονθήμερον, Μητρὸς ἑκὼν προσφέρεται, ἐν ναῷ τῷ νομικῷ καὶ τοῦτον ἀγκάλαις εἰσδέχεται ὁ Πρέσβυς. Ἀπόλυσον κράζων, ὁ δοῦλος τῷ Δεσπότῃ· οἱ γὰρ ὀφθαλμοί μου εἶδον τὸ σωτήριόν σου, ὁ ἐλθὼν εἰς τὸν κόσμον, σῶσαι γένος ἀνθρώπων, Κύριε, δόξα σοι.
ltx/gr_gr_cog/me.m02.d02:meVE.Stichera01.incipit	Λέγε Συμεών, τίνα φέρων ἐν…
ltx/gr_gr_cog/me.m02.d02:meVE.Stichera01.melody	
ltx/gr_gr_cog/me.m02.d02:meVE.Stichera01.mode	@ltx/gr_gr_cog/miscellanea:misc.Mode1
ltx/gr_gr_cog/me.m02.d02:meVE.Stichera01.poet	@ltx/gr_gr_cog/poets:po.GermanouPatriarchou
ltx/gr_gr_cog/me.m02.d02:meVE.Stichera01.text	Λέγε Συμεών, τίνα φέρων ἐν ἀγκάλαις, ἐν τῷ ναῷ ἀγάλλῃ; τίνι κράζεις καὶ βοᾷς; Νῦν ἠλευθέρωμαι· εἶδον γὰρ τὸν Σωτῆρά μου· Οὗτός ἐστιν, ὁ ἐκ Παρθένου τεχθείς, οὗτός ἐστιν ὁ ἐκ Θεοῦ Θεὸς Λόγος, ὁ σαρκωθεὶς διʼ ἡμᾶς, καὶ σώσας τὸν ἄνθρωπον· Αὐτὸν προσκυνήσωμεν.
ltx/gr_gr_cog/me.m02.d02:meVE.Stichera02.incipit	Δέχου Συμεών, ὃν ὑπὸ τὸν…
ltx/gr_gr_cog/me.m02.d02:meVE.Stichera02.melody	
ltx/gr_gr_cog/me.m02.d02:meVE.Stichera02.mode	@ltx/gr_gr_cog/miscellanea:misc.Mode1
ltx/gr_gr_cog/me.m02.d02:meVE.Stichera02.text	Δέχου Συμεών, ὃν ὑπὸ τὸν γνόφον, Μωσῆς νομοθετοῦντα, προεώρα ἐν Σινᾷ, βρέφος γενόμενον, νόμῳ ὑποταττόμενον. Οὗτός ἐστιν, ὁ διὰ νόμου λαλήσας οὗτός ἐστιν, ὁ ἐν Προφήταις ῥηθείς, ὁ σαρκωθεὶς διʼ ἡμᾶς, καὶ σώσας τὸν ἄνθρωπον· Αὐτὸν προσκυνήσωμεν.
ltx/gr_gr_cog/me.m02.d02:meVE.Stichera03.incipit	Δεῦτε καὶ ἡμεῖς, ᾄσμασιν ἐνθέοις…
ltx/gr_gr_cog/me.m02.d02:meVE.Stichera03.melody	
ltx/gr_gr_cog/me.m02.d02:meVE.Stichera03.mode	@ltx/gr_gr_cog/miscellanea:misc.Mode1
ltx/gr_gr_cog/me.m02.d02:meVE.Stichera03.text	Δεῦτε καὶ ἡμεῖς, ᾄσμασιν ἐνθέοις, Χριστῷ συναντηθῶμεν, καὶ δεξώμεθα αὐτόν, οὗ τὸ σωτήριον ὁ Συμεὼν ἑώρακεν. Οὗτός ἐστιν, ὃν ὁ Δαυῒδ καταγγέλλει οὗτός ἐστιν, ὁ ἐν Προφήταις λαλήσας, ὁ σαρκωθεὶς διʼ ἡμᾶς, καὶ νόμῳ φθεγγόμενος· Αὐτὸν προσκυνήσωμεν.
