ltx/gr_gr_cog/le.go.lu.d026:leluLI.Gospel.book_abbr	@ltx/gr_gr_cog/bible:Luke.abbr
ltx/gr_gr_cog/le.go.lu.d026:leluLI.Gospel.book_string	@ltx/gr_gr_cog/bible:Luke.text
ltx/gr_gr_cog/le.go.lu.d026:leluLI.Gospel.chapverse	9:12 – 18
ltx/gr_gr_cog/le.go.lu.d026:leluLI.Gospel.incipit	Προσελθόντες τῷ Ἰησοῦ οἱ δώδεκα μαθηταί…
ltx/gr_gr_cog/le.go.lu.d026:leluLI.Gospel.text	Τῷ καιρῷ ἐκείνῳ, προσελθόντες τῷ Ἰησοῦ οἱ δώδεκα εἶπον αὐτῷ· ἀπόλυσον τὸν ὄχλον, ἵνα πορευθέντες εἰς τὰς κύκλῳ κώμας καὶ τοὺς ἀγροὺς καταλύσωσι καὶ εὕρωσιν ἐπισιτισμόν, ὅτι ὧδε ἐν ἐρήμῳ τόπῳ ἐσμέν. εἶπε δὲ πρὸς αὐτούς· δότε αὐτοῖς ὑμεῖς φαγεῖν. οἱ δὲ εἶπον· οὐκ εἰσὶν ἡμῖν πλεῖον ἢ πέντε ἄρτοι καὶ ἰχθύες δύο, εἰ μήτι πορευθέντες ἡμεῖς ἀγοράσωμεν εἰς πάντα τὸν λαὸν τοῦτον βρώματα· ἦσαν γὰρ ὡσεὶ ἄνδρες πεντακισχίλιοι. εἶπε δὲ πρὸς τοὺς μαθητὰς αὐτοῦ· κατακλίνατε αὐτοὺς κλισίας ἀνὰ πεντήκοντα. καὶ ἐποίησαν οὕτω καὶ ἀνέκλιναν ἅπαντας. λαβὼν δὲ τοὺς πέντε ἄρτους καὶ τοὺς δύο ἰχθύας, ἀναβλέψας εἰς τὸν οὐρανὸν εὐλόγησεν αὐτοὺς καὶ κατέκλασε, καὶ ἐδίδου τοῖς μαθηταῖς παραθεῖναι τῷ ὄχλῳ. καὶ ἔφαγον καὶ ἐχορτάσθησαν πάντες, καὶ ἤρθη τὸ περισσεῦσαν αὐτοῖς κλασμάτων κόφινοι δώδεκα. Καὶ ἐγένετο ἐν τῷ εἶναι αὐτὸν προσευχόμενον καταμόνας, συνῆσαν αὐτῷ οἱ μαθηταὶ αὐτοῦ.
ltx/gr_gr_cog/le.go.lu.d026:leluLI.Gospel.title	Τῇ Παρασκευῇ τῆς Δʹ Ἑβδομάδος τοῦ Λουκᾶ
ltx/gr_gr_cog/le.go.lu.d026:leluLI.Gospel.title_abbr	Τῇ Παρασκευῇ τῆς Δʹ Ἑβδομάδος τοῦ Λουκᾶ
ltx/gr_gr_cog/le.go.lu.d026:leluLI.Gospel.version	@ltx/gr_gr_cog/properties:version.designation
