ltx/gr_gr_cog/tr.d031:trCO.header	(Μέγα)
ltx/gr_gr_cog/tr.d031:trDA.commemoration.full	
ltx/gr_gr_cog/tr.d031:trDA.commemoration.short	Τρίτη τῆς Βʹ Ἑβδομάδος
ltx/gr_gr_cog/tr.d031:trDA.insert1	
ltx/gr_gr_cog/tr.d031:trDA.insert2	
ltx/gr_gr_cog/tr.d031:trDA.note	
ltx/gr_gr_cog/tr.d031:trDA.title	
ltx/gr_gr_cog/tr.d031:trHO.commemorations	
ltx/gr_gr_cog/tr.d031:trHO.daytitle	
ltx/gr_gr_cog/tr.d031:trHO.description1	
ltx/gr_gr_cog/tr.d031:trHO.description2	
ltx/gr_gr_cog/tr.d031:trHO.note1	
ltx/gr_gr_cog/tr.d031:trHO.note2	
ltx/gr_gr_cog/tr.d031:trMA.AposIdiomelon1.incipit	Ἵνα τί ῥαθυμοῦσα ψυχή μου…
ltx/gr_gr_cog/tr.d031:trMA.AposIdiomelon1.melody	@ltx/gr_gr_cog/miscellanea:misc.Idiomelon
ltx/gr_gr_cog/tr.d031:trMA.AposIdiomelon1.mode	@ltx/gr_gr_cog/miscellanea:misc.Mode5
ltx/gr_gr_cog/tr.d031:trMA.AposIdiomelon1.text	Ἵνα τί ῥαθυμοῦσα ψυχή μου, τῇ ἁμαρτίᾳ δουλεύεις; καὶ ἵνα τί ἀσθενοῦσα, τῷ ἰατρῷ οὐ προστρέχεις; Ἰδοὺ καιρὸς εὐπρόσδεκτος, ἰδοὺ σωτηρίας νῦν ἡμέρα ἀληθής, διεγέρθητι, νίψον σου τὸ πρόσωπον τοῖς τῆς μετανοίας δάκρυσι, καὶ ἐλαίῳ εὐποιΐας, τὴν λαμπάδα φαίδρυνον, ὅπως εὕρῃς ἱλασμόν, παρὰ Χριστοῦ τοῦ Θεοῦ, καὶ τὸ μέγα ἔλεος.
ltx/gr_gr_cog/tr.d031:trMA.AposMartyric.incipit	@ltx/gr_gr_cog/oc.m5.d4:ocMA.Aposticha3.incipit
ltx/gr_gr_cog/tr.d031:trMA.AposMartyric.melody	
ltx/gr_gr_cog/tr.d031:trMA.AposMartyric.mode	@ltx/gr_gr_cog/miscellanea:misc.Mode5
ltx/gr_gr_cog/tr.d031:trMA.AposMartyric.text	@ltx/gr_gr_cog/oc.m5.d4:ocMA.Aposticha3.text
ltx/gr_gr_cog/tr.d031:trMA.AposTheotokion.incipit	@ltx/gr_gr_cog/oc.m5.d3:ocVE.AposTheotokion.incipit
ltx/gr_gr_cog/tr.d031:trMA.AposTheotokion.melody	
ltx/gr_gr_cog/tr.d031:trMA.AposTheotokion.mode	@ltx/gr_gr_cog/miscellanea:misc.Mode5
ltx/gr_gr_cog/tr.d031:trMA.AposTheotokion.text	@ltx/gr_gr_cog/oc.m5.d3:ocVE.AposTheotokion.text
ltx/gr_gr_cog/tr.d031:trMA.C1.poet	@ltx/gr_gr_cog/poets:po.Iosif
ltx/gr_gr_cog/tr.d031:trMA.C2.poet	@ltx/gr_gr_cog/poets:po.Theodorou
ltx/gr_gr_cog/tr.d031:trMA.Kathisma21.greekmelody	@ltx/gr_gr_cog/he.a.m8:heAU.AnestisEkNekron.greekname
ltx/gr_gr_cog/tr.d031:trMA.Kathisma21.incipit	Τὰ πάθη χαλινῷ, τῆς ἀμώμου…
ltx/gr_gr_cog/tr.d031:trMA.Kathisma21.melody	@ltx/gr_gr_cog/he.a.m8:heAU.AnestisEkNekron.name
ltx/gr_gr_cog/tr.d031:trMA.Kathisma21.mode	@ltx/gr_gr_cog/miscellanea:misc.Mode8
ltx/gr_gr_cog/tr.d031:trMA.Kathisma21.text	Τὰ πάθη χαλινῷ, τῆς ἀμώμου Νηστείας, ἐπέχοντες τὸν νοῦν, πρὸς σεπτὰς θεωρίας, πίστει τελειοτάτῃ, ἀναπτερῶσαι πάντες σπουδάσωμεν, ὅπως τῆς χαμαιζήλου, τοῦ βίου τρυφῆς καταφρονήσωμεν, καὶ οὐρανίου τύχωμεν ζωῆς, καὶ θείας ἐλλάμψεως.
ltx/gr_gr_cog/tr.d031:trMA.Kathisma22.greekmelody	@ltx/gr_gr_cog/he.a.m8:heAU.AnestisEkNekron.greekname
ltx/gr_gr_cog/tr.d031:trMA.Kathisma22.incipit	@ltx/gr_gr_cog/oc.m8.d3:ocMA.Kathisma23.incipit
ltx/gr_gr_cog/tr.d031:trMA.Kathisma22.melody	@ltx/gr_gr_cog/he.a.m8:heAU.AnestisEkNekron.name
ltx/gr_gr_cog/tr.d031:trMA.Kathisma22.mode	@ltx/gr_gr_cog/miscellanea:misc.Mode8
ltx/gr_gr_cog/tr.d031:trMA.Kathisma22.text	@ltx/gr_gr_cog/oc.m8.d3:ocMA.Kathisma23.text
ltx/gr_gr_cog/tr.d031:trMA.Kathisma31.greekmelody	@ltx/gr_gr_cog/he.a.m8:heAU.AnestisEkNekron.greekname
ltx/gr_gr_cog/tr.d031:trMA.Kathisma31.incipit	Προθεῖσα μυστικήν, ἡ νηστεία τράπεζαν…
ltx/gr_gr_cog/tr.d031:trMA.Kathisma31.melody	@ltx/gr_gr_cog/he.a.m8:heAU.AnestisEkNekron.name
ltx/gr_gr_cog/tr.d031:trMA.Kathisma31.mode	@ltx/gr_gr_cog/miscellanea:misc.Mode8
ltx/gr_gr_cog/tr.d031:trMA.Kathisma31.text	Προθεῖσα μυστικήν, ἡ νηστεία τράπεζαν, προτρέπεται ἡμᾶς, δαψιλῶς ἐμφορηθῆναι, φάγωμεν ὥσπερ βρῶσιν, τὰ ἀείζῳα δῶρα τοῦ Πνεύματος, πίωμεν ὥσπερ πόμα, τὰ τῶν δακρύων ῥεῖθρα θεόῤῥυτα, καὶ εὐφρανθέντες αἶνον τῷ Θεῷ ἀπαύστως προσοίσωμεν.
ltx/gr_gr_cog/tr.d031:trMA.Kathisma32.greekmelody	@ltx/gr_gr_cog/he.a.m8:heAU.AnestisEkNekron.greekname
ltx/gr_gr_cog/tr.d031:trMA.Kathisma32.incipit	Ἐκ πάσης ἀπειλῆς, καὶ κακίας…
ltx/gr_gr_cog/tr.d031:trMA.Kathisma32.melody	@ltx/gr_gr_cog/he.a.m8:heAU.AnestisEkNekron.name
ltx/gr_gr_cog/tr.d031:trMA.Kathisma32.mode	@ltx/gr_gr_cog/miscellanea:misc.Mode8
ltx/gr_gr_cog/tr.d031:trMA.Kathisma32.text	Ἐκ πάσης ἀπειλῆς, καὶ κακίας ἀνθρώπων, διάσωσον ἡμᾶς, Παναγία Παρθένε· σὲ γὰρ ἔχομεν σκέπην, καὶ προστασίαν οἱ καταφεύγοντες, ἐπὶ σοὶ Θεομῆτορ, καὶ τὸν τεχθέντα ἐκ σοῦ Θεὸν ἡμῶν, ὃν ἐκδυσώπει ῥύσασθαι ἡμᾶς, κινδύνων καὶ θλίψεων.
ltx/gr_gr_cog/tr.d031:trMA.Ode2C11.greekmelody	@ltx/gr_gr_cog/he.h.m8:heHE.IdeteIdeteOProTonAionon.greekname
ltx/gr_gr_cog/tr.d031:trMA.Ode2C11.incipit	Στέναξον δάκρυσον, ψυχὴ ἐπίστρεψον μετανόησον…
ltx/gr_gr_cog/tr.d031:trMA.Ode2C11.melody	@ltx/gr_gr_cog/he.h.m8:heHE.IdeteIdeteOProTonAionon.name
ltx/gr_gr_cog/tr.d031:trMA.Ode2C11.mode	@ltx/gr_gr_cog/miscellanea:misc.Mode8
ltx/gr_gr_cog/tr.d031:trMA.Ode2C11.ode	@ltx/gr_gr_cog/miscellanea:misc.Ode2
ltx/gr_gr_cog/tr.d031:trMA.Ode2C11.text	Στέναξον δάκρυσον, ψυχὴ ἐπίστρεψον μετανόησον, ἤγγικεν ἡ ἡμέρα, ἐπὶ θύραις ὁ Κριτής, πρὸς ἀπολογίαν ἑτοιμάζου, καὶ βόησον· Ἡμάρτηκά σοι Οἰκτίρμον, ἐλεῆμον ἀγαθέ, σύ με οἴκτειρον.
ltx/gr_gr_cog/tr.d031:trMA.Ode2C12.incipit	Κόρον ἁμαρτίας, ψυχή μου μίσησον…
ltx/gr_gr_cog/tr.d031:trMA.Ode2C12.melody	@ltx/gr_gr_cog/he.h.m8:heHE.IdeteIdeteOProTonAionon.name
ltx/gr_gr_cog/tr.d031:trMA.Ode2C12.mode	@ltx/gr_gr_cog/miscellanea:misc.Mode8
ltx/gr_gr_cog/tr.d031:trMA.Ode2C12.ode	@ltx/gr_gr_cog/miscellanea:misc.Ode2
ltx/gr_gr_cog/tr.d031:trMA.Ode2C12.text	Κόρον ἁμαρτίας, ψυχή μου μίσησον τὸν ὀλέθριον, τρύφησον τῷ κόρῳ τῆς νηστείας ἐμμελῶς, τὰς σωτηριώδεις ἐντολάς, βρῶμα ποίησον, ἀπόλαυσιν προξενούσας, αἰωνίων ἀγαθῶν διὰ πίστεως.
ltx/gr_gr_cog/tr.d031:trMA.Ode2C13.incipit	Ἄγγελοι, Δυνάμεις, Ἀρχαί, Ἀρχάγγελοι, Κυριότητες…
ltx/gr_gr_cog/tr.d031:trMA.Ode2C13.melody	@ltx/gr_gr_cog/he.h.m8:heHE.IdeteIdeteOProTonAionon.name
ltx/gr_gr_cog/tr.d031:trMA.Ode2C13.mode	@ltx/gr_gr_cog/miscellanea:misc.Mode8
ltx/gr_gr_cog/tr.d031:trMA.Ode2C13.ode	@ltx/gr_gr_cog/miscellanea:misc.Ode2
ltx/gr_gr_cog/tr.d031:trMA.Ode2C13.text	Ἄγγελοι, Δυνάμεις, Ἀρχαί, Ἀρχάγγελοι, Κυριότητες, θρόνοι, Ἐξουσίαι, Χερουβίμ, καὶ Σεραφίμ, τὸν ἀγαθοδότην, καὶ Θεὸν ἱκετεύσατε, συγχώρησιν ὀφλημάτων, καὶ παθῶν ἀπαλλαγήν, δωρηθῆναι ἡμῖν.
ltx/gr_gr_cog/tr.d031:trMA.Ode2C1H.greekmelody	@ltx/gr_gr_cog/he.h.m8:heHE.IdeteIdeteOProTonAionon.greekname
ltx/gr_gr_cog/tr.d031:trMA.Ode2C1H.incipit	@ltx/gr_gr_cog/he.h.m8:heHE.IdeteIdeteOProTonAionon.incipit
ltx/gr_gr_cog/tr.d031:trMA.Ode2C1H.melody	@ltx/gr_gr_cog/he.h.m8:heHE.IdeteIdeteOProTonAionon.melody
ltx/gr_gr_cog/tr.d031:trMA.Ode2C1H.mode	@ltx/gr_gr_cog/miscellanea:misc.Mode8
ltx/gr_gr_cog/tr.d031:trMA.Ode2C1H.ode	@ltx/gr_gr_cog/miscellanea:misc.Ode2
ltx/gr_gr_cog/tr.d031:trMA.Ode2C1H.text	@ltx/gr_gr_cog/he.h.m8:heHE.IdeteIdeteOProTonAionon.text
ltx/gr_gr_cog/tr.d031:trMA.Ode2C1T.incipit	Ἡ μόνη κυήσασα, τὸν ἄναρχον…
ltx/gr_gr_cog/tr.d031:trMA.Ode2C1T.melody	@ltx/gr_gr_cog/he.h.m8:heHE.IdeteIdeteOProTonAionon.name
ltx/gr_gr_cog/tr.d031:trMA.Ode2C1T.mode	@ltx/gr_gr_cog/miscellanea:misc.Mode8
ltx/gr_gr_cog/tr.d031:trMA.Ode2C1T.ode	@ltx/gr_gr_cog/miscellanea:misc.Ode2
ltx/gr_gr_cog/tr.d031:trMA.Ode2C1T.text	Ἡ μόνη κυήσασα, τὸν ἄναρχον Λόγον Πανάμωμε, ἐκ σοῦ σαρκωθέντα, καὶ μὴ τραπέντα, ὅπερ ἦν, μείνασα παρθένος, μετὰ τόκον ἀνύμφευτε, ἱκέτευε ὑπὲρ πάντων λυτρωθῆναι, ἐκ φθορᾶς τὴν ζωὴν ἡμῶν.
ltx/gr_gr_cog/tr.d031:trMA.Ode2C21.greekmelody	@ltx/gr_gr_cog/he.h.m8:heHE.IdeteIdeteOProTonAionon.greekname
ltx/gr_gr_cog/tr.d031:trMA.Ode2C21.incipit	Ἴδομεν, ἔγνωμεν, ὡς ἀγαθὸς ἡμῖν…
ltx/gr_gr_cog/tr.d031:trMA.Ode2C21.melody	@ltx/gr_gr_cog/he.h.m8:heHE.IdeteIdeteOProTonAionon.name
ltx/gr_gr_cog/tr.d031:trMA.Ode2C21.mode	@ltx/gr_gr_cog/miscellanea:misc.Mode8
ltx/gr_gr_cog/tr.d031:trMA.Ode2C21.ode	@ltx/gr_gr_cog/miscellanea:misc.Ode2
ltx/gr_gr_cog/tr.d031:trMA.Ode2C21.text	Ἴδομεν, ἔγνωμεν, ὡς ἀγαθὸς ἡμῖν εἰς μετάνοιαν, ὃν καιρὸν ὡρίσω, ἀλλʼ ἐν τούτῳ ὁ Θεὸς πρόσδεξαι ἡμῶν τὰς προσευχάς, καὶ κατεύθυνον ἐνώπιόν σου Οἰκτίρμον, ὡς θυμίαμα καλόν, ὥσπερ θυσίαν δεκτήν.
ltx/gr_gr_cog/tr.d031:trMA.Ode2C22.incipit	Φρίττω καὶ πτοοῦμαι, κατανοούμενος ὅσα…
ltx/gr_gr_cog/tr.d031:trMA.Ode2C22.melody	@ltx/gr_gr_cog/he.h.m8:heHE.IdeteIdeteOProTonAionon.name
ltx/gr_gr_cog/tr.d031:trMA.Ode2C22.mode	@ltx/gr_gr_cog/miscellanea:misc.Mode8
ltx/gr_gr_cog/tr.d031:trMA.Ode2C22.ode	@ltx/gr_gr_cog/miscellanea:misc.Ode2
ltx/gr_gr_cog/tr.d031:trMA.Ode2C22.text	Φρίττω καὶ πτοοῦμαι, κατανοούμενος ὅσα ἥμαρτον· Πῶς σοι ὑπαντήσω; πῶς ὀφθῶ σοι φοβερὲ; πῶς δὲ παραστῷ τῷ ἀδεκάστῳ σου Βήματι; διὸ φεῖσαί μου Οἰκτίρμον ἐν τῇ ὥρᾳ, ὅταν μέλλῃς κρῖναι πᾶσαν τὴν γῆν.
ltx/gr_gr_cog/tr.d031:trMA.Ode2C2A1.incipit	Σὺ τοὺς Νινευΐτας, μετανοήσαντας καὶ…
ltx/gr_gr_cog/tr.d031:trMA.Ode2C2A1.melody	@ltx/gr_gr_cog/he.h.m8:heHE.IdeteIdeteOProTonAionon.name
ltx/gr_gr_cog/tr.d031:trMA.Ode2C2A1.mode	@ltx/gr_gr_cog/miscellanea:misc.Mode8
ltx/gr_gr_cog/tr.d031:trMA.Ode2C2A1.ode	@ltx/gr_gr_cog/miscellanea:misc.Ode2
ltx/gr_gr_cog/tr.d031:trMA.Ode2C2A1.text	Σὺ τοὺς Νινευΐτας, μετανοήσαντας καὶ νηστεύσαντας, τῆς ἀπειλουμένης, ἐπανήγαγες ὀργῆς, τοὺς δὲ Σοδομίτας, ἐν πυρὶ ἀπετέφρωσας, ἐν πλησμονῇ ἀσελγοῦντας. Ἀλλὰ ῥῦσαί με Χριστέ, τῆς ἀπειλῆς αὐτῶν.
ltx/gr_gr_cog/tr.d031:trMA.Ode2C2H.greekmelody	@ltx/gr_gr_cog/he.h.m8:heHE.IdeteIdeteOKathierosas.greekname
ltx/gr_gr_cog/tr.d031:trMA.Ode2C2H.incipit	@ltx/gr_gr_cog/he.h.m8:heHE.IdeteIdeteOKathierosas.incipit
ltx/gr_gr_cog/tr.d031:trMA.Ode2C2H.melody	@ltx/gr_gr_cog/he.h.m8:heHE.IdeteIdeteOKathierosas.melody
ltx/gr_gr_cog/tr.d031:trMA.Ode2C2H.mode	@ltx/gr_gr_cog/miscellanea:misc.Mode8
ltx/gr_gr_cog/tr.d031:trMA.Ode2C2H.ode	@ltx/gr_gr_cog/miscellanea:misc.Ode2
ltx/gr_gr_cog/tr.d031:trMA.Ode2C2H.text	@ltx/gr_gr_cog/he.h.m8:heHE.IdeteIdeteOKathierosas.text
ltx/gr_gr_cog/tr.d031:trMA.Ode2C2T.incipit	Ἄῤῥητον τὸ θαῦμα, τῆς σῆς…
ltx/gr_gr_cog/tr.d031:trMA.Ode2C2T.melody	@ltx/gr_gr_cog/he.h.m8:heHE.IdeteIdeteOProTonAionon.name
ltx/gr_gr_cog/tr.d031:trMA.Ode2C2T.mode	@ltx/gr_gr_cog/miscellanea:misc.Mode8
ltx/gr_gr_cog/tr.d031:trMA.Ode2C2T.ode	@ltx/gr_gr_cog/miscellanea:misc.Ode2
ltx/gr_gr_cog/tr.d031:trMA.Ode2C2T.text	Ἄῤῥητον τὸ θαῦμα, τῆς σῆς κυήσεως Μητροπάρθενε· πῶς γὰρ καὶ λοχεύεις, καὶ ἁγνεύεις ἐνταυτῶ; πῶς παιδοτοκεῖς καὶ ἀγνοεῖς, πεῖραν ὅλως ἀνδρός; Ὡς οἶδεν ὁ ὑπὲρ φύσιν, ἐξ ἐμοῦ καινοπρεπῶς, Λόγος Θεοῦ γεννηθείς.
ltx/gr_gr_cog/tr.d031:trMA.Ode2C2Tr.incipit	Ὑπερτελεστάτη Μονάς, ὑπέρθεε, τρισυπόστατε, ἀγέννητε…
ltx/gr_gr_cog/tr.d031:trMA.Ode2C2Tr.melody	@ltx/gr_gr_cog/he.h.m8:heHE.IdeteIdeteOProTonAionon.name
ltx/gr_gr_cog/tr.d031:trMA.Ode2C2Tr.mode	@ltx/gr_gr_cog/miscellanea:misc.Mode8
ltx/gr_gr_cog/tr.d031:trMA.Ode2C2Tr.ode	@ltx/gr_gr_cog/miscellanea:misc.Ode2
ltx/gr_gr_cog/tr.d031:trMA.Ode2C2Tr.text	Ὑπερτελεστάτη Μονάς, ὑπέρθεε, τρισυπόστατε, ἀγέννητε Πάτερ, καὶ Υἱὲ μονογενές, Πνεῦμα ἐκ Πατρὸς ἐκπορευθέν, διʼ Υἱοῦ δὲ φανέν, οὐσία μία καὶ φύσις, κυριότης βασιλεία, σῶσον πάντας ἡμᾶς.
ltx/gr_gr_cog/tr.d031:trMA.Ode8C11.greekmelody	@ltx/gr_gr_cog/he.h.m8:heHE.OiTheorrimonesPaides.greekname
ltx/gr_gr_cog/tr.d031:trMA.Ode8C11.incipit	Ὁ δικαιώσας στενάξαντα τὸν Τελώνην…
ltx/gr_gr_cog/tr.d031:trMA.Ode8C11.melody	@ltx/gr_gr_cog/he.h.m8:heHE.OiTheorrimonesPaides.name
ltx/gr_gr_cog/tr.d031:trMA.Ode8C11.mode	@ltx/gr_gr_cog/miscellanea:misc.Mode8
ltx/gr_gr_cog/tr.d031:trMA.Ode8C11.ode	@ltx/gr_gr_cog/miscellanea:misc.Ode8
ltx/gr_gr_cog/tr.d031:trMA.Ode8C11.text	Ὁ δικαιώσας στενάξαντα τὸν Τελώνην, ὁ οἰκτειρήσας τὴν Πόρνην, ἀπὸ καρδίας δακρύσασαν, σῶσον οἴκτειρον Σῶτερ, ψυχὰς τῶν ὑμνούντων σε.
ltx/gr_gr_cog/tr.d031:trMA.Ode8C12.incipit	Καρποφορήσωμεν πράξεις ἐναρέτους, διὰ νηστείας…
ltx/gr_gr_cog/tr.d031:trMA.Ode8C12.melody	@ltx/gr_gr_cog/he.h.m8:heHE.OiTheorrimonesPaides.name
ltx/gr_gr_cog/tr.d031:trMA.Ode8C12.mode	@ltx/gr_gr_cog/miscellanea:misc.Mode8
ltx/gr_gr_cog/tr.d031:trMA.Ode8C12.ode	@ltx/gr_gr_cog/miscellanea:misc.Ode8
ltx/gr_gr_cog/tr.d031:trMA.Ode8C12.text	Καρποφορήσωμεν πράξεις ἐναρέτους, διὰ νηστείας Κυρίῳ, καὶ βλαβερῶν ἀποσχώμεθα, λογισμῶν, ἵνα ὅλως, τρυφῆς ἐπιτύχωμεν.
ltx/gr_gr_cog/tr.d031:trMA.Ode8C13.incipit	Οἱ τῶν Ἀγγέλων χοροί σε…
ltx/gr_gr_cog/tr.d031:trMA.Ode8C13.melody	@ltx/gr_gr_cog/he.h.m8:heHE.OiTheorrimonesPaides.name
ltx/gr_gr_cog/tr.d031:trMA.Ode8C13.mode	@ltx/gr_gr_cog/miscellanea:misc.Mode8
ltx/gr_gr_cog/tr.d031:trMA.Ode8C13.ode	@ltx/gr_gr_cog/miscellanea:misc.Ode8
ltx/gr_gr_cog/tr.d031:trMA.Ode8C13.text	Οἱ τῶν Ἀγγέλων χοροί σε δυσωποῦσι, τῶν Ἀποστόλων οἱ δῆμοι, καὶ τῶν Μαρτύρων τὰ τάγματα, Ἰησοῦ τῷ λαῷ σου, συγχώρησιν δώρησαι.
ltx/gr_gr_cog/tr.d031:trMA.Ode8C1T.incipit	Τὸ ἀλατόμητον ὄρος τὴν Παρθένον…
ltx/gr_gr_cog/tr.d031:trMA.Ode8C1T.melody	@ltx/gr_gr_cog/he.h.m8:heHE.OiTheorrimonesPaides.name
ltx/gr_gr_cog/tr.d031:trMA.Ode8C1T.mode	@ltx/gr_gr_cog/miscellanea:misc.Mode8
ltx/gr_gr_cog/tr.d031:trMA.Ode8C1T.ode	@ltx/gr_gr_cog/miscellanea:misc.Ode8
ltx/gr_gr_cog/tr.d031:trMA.Ode8C1T.text	Τὸ ἀλατόμητον ὄρος τὴν Παρθένον, τὴν φωτοφόρον λυχνίαν, τὴν εὐδιάβατον κλίμακα, καὶ Θεοῦ τὸ χωρίον, πιστοὶ μακαρίσωμεν.
ltx/gr_gr_cog/tr.d031:trMA.Ode8C21.greekmelody	@ltx/gr_gr_cog/he.h.m8:heHE.TonEnOreiAgio.greekname
ltx/gr_gr_cog/tr.d031:trMA.Ode8C21.incipit	Ἐν εὐσήμῳ, ἡμέρᾳ ἐγκρατείας, δεῦτε…
ltx/gr_gr_cog/tr.d031:trMA.Ode8C21.melody	@ltx/gr_gr_cog/he.h.m8:heHE.TonEnOreiAgio.name
ltx/gr_gr_cog/tr.d031:trMA.Ode8C21.mode	@ltx/gr_gr_cog/miscellanea:misc.Mode8
ltx/gr_gr_cog/tr.d031:trMA.Ode8C21.ode	@ltx/gr_gr_cog/miscellanea:misc.Ode8
ltx/gr_gr_cog/tr.d031:trMA.Ode8C21.text	Ἐν εὐσήμῳ, ἡμέρᾳ ἐγκρατείας, δεῦτε πάντες, σαλπίσωμεν τοῖς ὕμνοις, καὶ ὡς τρυφὴν τοῖς θείοις εὐωχούμενοι, Κύριον ὑμνοῦμεν, καὶ ὑπερυψοῦμεν, εἰς πάντας τοὺς αἰῶνας.
ltx/gr_gr_cog/tr.d031:trMA.Ode8C22.incipit	Τίς βιβρώσκει, Θεοῦ ἄνθρωπον πάλαι…
ltx/gr_gr_cog/tr.d031:trMA.Ode8C22.melody	@ltx/gr_gr_cog/he.h.m8:heHE.TonEnOreiAgio.name
ltx/gr_gr_cog/tr.d031:trMA.Ode8C22.mode	@ltx/gr_gr_cog/miscellanea:misc.Mode8
ltx/gr_gr_cog/tr.d031:trMA.Ode8C22.ode	@ltx/gr_gr_cog/miscellanea:misc.Ode8
ltx/gr_gr_cog/tr.d031:trMA.Ode8C22.text	Τίς βιβρώσκει, Θεοῦ ἄνθρωπον πάλαι; θὴρ ὁ λέων, ἐκ πλάνης τοῦ Προφήτου, παρακοῆς τὰ βρώματα δεξάμενον. Βλέπε οὖν ψυχή μου, μή σε ἀπατήσῃ, γαστριμαργίας ὄφις.
ltx/gr_gr_cog/tr.d031:trMA.Ode8C2A1.incipit	Τὴν Νηστείαν, ὡς φύλακα ἁγνείας…
ltx/gr_gr_cog/tr.d031:trMA.Ode8C2A1.melody	@ltx/gr_gr_cog/he.h.m8:heHE.TonEnOreiAgio.name
ltx/gr_gr_cog/tr.d031:trMA.Ode8C2A1.mode	@ltx/gr_gr_cog/miscellanea:misc.Mode8
ltx/gr_gr_cog/tr.d031:trMA.Ode8C2A1.ode	@ltx/gr_gr_cog/miscellanea:misc.Ode8
ltx/gr_gr_cog/tr.d031:trMA.Ode8C2A1.text	Τὴν Νηστείαν, ὡς φύλακα ἁγνείας, καὶ μητέρα, ἀπαθείας τιμῶντες, δεῦτε λαοὶ ἐκ πόθου ἀσπασώμεθα, Κύριον ὑμνοῦντες, καὶ ὑπερυψοῦντες, εἰς πάντας τοὺς αἰῶνας.
ltx/gr_gr_cog/tr.d031:trMA.Ode8C2H.greekmelody	@ltx/gr_gr_cog/he.h.m8:heHE.TonEnOreiAgio.greekname
ltx/gr_gr_cog/tr.d031:trMA.Ode8C2H.incipit	@ltx/gr_gr_cog/he.h.m8:heHE.TonEnOreiAgio.incipit
ltx/gr_gr_cog/tr.d031:trMA.Ode8C2H.melody	@ltx/gr_gr_cog/he.h.m8:heHE.TonEnOreiAgio.melody
ltx/gr_gr_cog/tr.d031:trMA.Ode8C2H.mode	@ltx/gr_gr_cog/miscellanea:misc.Mode8
ltx/gr_gr_cog/tr.d031:trMA.Ode8C2H.ode	@ltx/gr_gr_cog/miscellanea:misc.Ode8
ltx/gr_gr_cog/tr.d031:trMA.Ode8C2H.text	@ltx/gr_gr_cog/he.h.m8:heHE.TonEnOreiAgio.text
ltx/gr_gr_cog/tr.d031:trMA.Ode8C2T.incipit	Σὺ τὸ ὄρος, τοῦ Θεοῦ…
ltx/gr_gr_cog/tr.d031:trMA.Ode8C2T.melody	@ltx/gr_gr_cog/he.h.m8:heHE.TonEnOreiAgio.name
ltx/gr_gr_cog/tr.d031:trMA.Ode8C2T.mode	@ltx/gr_gr_cog/miscellanea:misc.Mode8
ltx/gr_gr_cog/tr.d031:trMA.Ode8C2T.ode	@ltx/gr_gr_cog/miscellanea:misc.Ode8
ltx/gr_gr_cog/tr.d031:trMA.Ode8C2T.text	Σὺ τὸ ὄρος, τοῦ Θεοῦ ἀνεδείχθης, Θεοτόκε, ἐν ᾧ Χριστὸς οἰκήσας, θείους ναοὺς εἰργάσατο τοὺς ψάλλοντας· Κύριον ὑμνεῖτε, καὶ ὑπερυψοῦτε, εἰς πάντας τοὺς αἰῶνας.
ltx/gr_gr_cog/tr.d031:trMA.Ode8C2Tr.incipit	Ὡς Μονάδα, τῇ οὐσίᾳ ὑμνῶ…
ltx/gr_gr_cog/tr.d031:trMA.Ode8C2Tr.melody	@ltx/gr_gr_cog/he.h.m8:heHE.TonEnOreiAgio.name
ltx/gr_gr_cog/tr.d031:trMA.Ode8C2Tr.mode	@ltx/gr_gr_cog/miscellanea:misc.Mode8
ltx/gr_gr_cog/tr.d031:trMA.Ode8C2Tr.ode	@ltx/gr_gr_cog/miscellanea:misc.Ode8
ltx/gr_gr_cog/tr.d031:trMA.Ode8C2Tr.text	Ὡς Μονάδα, τῇ οὐσίᾳ ὑμνῶ σε, ὡς Τριάδα, τοῖς προσώποις σὲ σέβω, Πάτερ, Υἱέ, καὶ Πνεῦμα τὸ πανάγιον, ἄναρχον τὸ κράτος, τῆς σῆς βασιλείας, δοξάζω εἰς αἰῶνας.
ltx/gr_gr_cog/tr.d031:trMA.Ode9C11.greekmelody	@ltx/gr_gr_cog/he.h.m8:heHE.TonProdilothenta.greekname
ltx/gr_gr_cog/tr.d031:trMA.Ode9C11.incipit	Ἡ καλὴ νηστεία, πιαίνουσα τὴν…
ltx/gr_gr_cog/tr.d031:trMA.Ode9C11.melody	@ltx/gr_gr_cog/he.h.m8:heHE.TonProdilothenta.name
ltx/gr_gr_cog/tr.d031:trMA.Ode9C11.mode	@ltx/gr_gr_cog/miscellanea:misc.Mode8
ltx/gr_gr_cog/tr.d031:trMA.Ode9C11.ode	@ltx/gr_gr_cog/miscellanea:misc.Ode9
ltx/gr_gr_cog/tr.d031:trMA.Ode9C11.text	Ἡ καλὴ νηστεία, πιαίνουσα τὴν καρδίαν, στάχυν ἀρετῶν ὥριμον, ἐνθέως ἐκβλαστάνει, ἣν ποθήσωμεν, ἐν ἁγίαις ἡμέραις, τὸν ἁγιασμὸν ὑποδεχόμενοι.
ltx/gr_gr_cog/tr.d031:trMA.Ode9C12.incipit	Τὸν ἐν ἁμαρτίαις, πολλαῖς κατεσπιλωμένον…
ltx/gr_gr_cog/tr.d031:trMA.Ode9C12.melody	@ltx/gr_gr_cog/he.h.m8:heHE.TonProdilothenta.name
ltx/gr_gr_cog/tr.d031:trMA.Ode9C12.mode	@ltx/gr_gr_cog/miscellanea:misc.Mode8
ltx/gr_gr_cog/tr.d031:trMA.Ode9C12.ode	@ltx/gr_gr_cog/miscellanea:misc.Ode9
ltx/gr_gr_cog/tr.d031:trMA.Ode9C12.text	Τὸν ἐν ἁμαρτίαις, πολλαῖς κατεσπιλωμένον, τετραυματισμένον ὁρῶν καὶ κατακεκριμένον, τῷ σῷ ἐλέει οἰκτείρας, σῶσον ἱκεσίαις Ἐλεῆμον, τῶν Ἁγίων σου.
ltx/gr_gr_cog/tr.d031:trMA.Ode9C13.incipit	Οἴμοι παναθλία, ψυχὴ πῶς ἀπολογήσῃ…
ltx/gr_gr_cog/tr.d031:trMA.Ode9C13.melody	@ltx/gr_gr_cog/he.h.m8:heHE.TonProdilothenta.name
ltx/gr_gr_cog/tr.d031:trMA.Ode9C13.mode	@ltx/gr_gr_cog/miscellanea:misc.Mode8
ltx/gr_gr_cog/tr.d031:trMA.Ode9C13.ode	@ltx/gr_gr_cog/miscellanea:misc.Ode9
ltx/gr_gr_cog/tr.d031:trMA.Ode9C13.text	Οἴμοι παναθλία, ψυχὴ πῶς ἀπολογήσῃ; ποία φρίκη σε λήψεται, Κριτοῦ καθεζομένου, μυριάδων παρισταμένων Ἀγγέλων; Σπεῦσον οὖν πρὸ τέλους μετανόησον.
ltx/gr_gr_cog/tr.d031:trMA.Ode9C1T.incipit	Τὸ βασιλικὸν ὄχημα, τὴν φαιδρὰν…
ltx/gr_gr_cog/tr.d031:trMA.Ode9C1T.melody	@ltx/gr_gr_cog/he.h.m8:heHE.TonProdilothenta.name
ltx/gr_gr_cog/tr.d031:trMA.Ode9C1T.mode	@ltx/gr_gr_cog/miscellanea:misc.Mode8
ltx/gr_gr_cog/tr.d031:trMA.Ode9C1T.ode	@ltx/gr_gr_cog/miscellanea:misc.Ode9
ltx/gr_gr_cog/tr.d031:trMA.Ode9C1T.text	Τὸ βασιλικὸν ὄχημα, τὴν φαιδρὰν νεφέλην, ὄρος τὸ πιώτατον, ὄρος τετυρωμένον, ἀπειρόγαμε δυσωποῦμεν Παρθένε. Ἴασαι τὰ πάθη τῶν ψυχῶν ἡμῶν.
ltx/gr_gr_cog/tr.d031:trMA.Ode9C21.greekmelody	@ltx/gr_gr_cog/he.h.m8:heHE.TonProdilothenta.greekname
ltx/gr_gr_cog/tr.d031:trMA.Ode9C21.incipit	Ἀληθῆ νηστείαν, νηστεύσωμεν τῷ Κυρίῳ…
ltx/gr_gr_cog/tr.d031:trMA.Ode9C21.melody	@ltx/gr_gr_cog/he.h.m8:heHE.TonProdilothenta.name
ltx/gr_gr_cog/tr.d031:trMA.Ode9C21.mode	@ltx/gr_gr_cog/miscellanea:misc.Mode8
ltx/gr_gr_cog/tr.d031:trMA.Ode9C21.ode	@ltx/gr_gr_cog/miscellanea:misc.Ode9
ltx/gr_gr_cog/tr.d031:trMA.Ode9C21.text	Ἀληθῆ νηστείαν, νηστεύσωμεν τῷ Κυρίῳ, ὡς βρωμάτων ἐγκράτειαν, γλώσσης θυμοῦ καὶ ψεύδους, καὶ παντὸς ἄλλου ἀλλοτρίωσιν πάθους, ἵνα καθαρῶς τὸ Πάσχα ἴδωμεν.
ltx/gr_gr_cog/tr.d031:trMA.Ode9C22.incipit	Σὺ τὸν Σαμουὴλ ἤνθησας, καρπὸν…
ltx/gr_gr_cog/tr.d031:trMA.Ode9C22.melody	@ltx/gr_gr_cog/he.h.m8:heHE.TonProdilothenta.name
ltx/gr_gr_cog/tr.d031:trMA.Ode9C22.mode	@ltx/gr_gr_cog/miscellanea:misc.Mode8
ltx/gr_gr_cog/tr.d031:trMA.Ode9C22.ode	@ltx/gr_gr_cog/miscellanea:misc.Ode9
ltx/gr_gr_cog/tr.d031:trMA.Ode9C22.text	Σὺ τὸν Σαμουὴλ ἤνθησας, καρπὸν ἡ νηστεία, σὺ ἐτιθηνήσω Σαμψὼν τὸν μέγαν ἀριστέα, σὺ τελειοῖς Ἱερεῖς καὶ Προφήτας, σὺ ἡμᾶς ἁγίασον, νηστεία σεμνή.
ltx/gr_gr_cog/tr.d031:trMA.Ode9C2A1.incipit	Ἔχοντες τὸ Πνεῦμα, τὸ ἅγιον…
ltx/gr_gr_cog/tr.d031:trMA.Ode9C2A1.melody	@ltx/gr_gr_cog/he.h.m8:heHE.TonProdilothenta.name
ltx/gr_gr_cog/tr.d031:trMA.Ode9C2A1.mode	@ltx/gr_gr_cog/miscellanea:misc.Mode8
ltx/gr_gr_cog/tr.d031:trMA.Ode9C2A1.ode	@ltx/gr_gr_cog/miscellanea:misc.Ode9
ltx/gr_gr_cog/tr.d031:trMA.Ode9C2A1.text	Ἔχοντες τὸ Πνεῦμα, τὸ ἅγιον τῆς νηστείας, ἑστιάτορα πλούσιον, τῶν αὐτοῦ χαρισμάτων, ἐμφορηθῶμεν καὶ δαψιλῶς ἐντρυφῶμεν, τοῦτο ἀνυμνοῦντες ὡς Θεὸν ἡμῶν.
ltx/gr_gr_cog/tr.d031:trMA.Ode9C2H.greekmelody	@ltx/gr_gr_cog/he.h.m8:heHE.TonProdilothenta.greekname
ltx/gr_gr_cog/tr.d031:trMA.Ode9C2H.incipit	@ltx/gr_gr_cog/he.h.m8:heHE.TonProdilothenta.incipit
ltx/gr_gr_cog/tr.d031:trMA.Ode9C2H.melody	@ltx/gr_gr_cog/he.h.m8:heHE.TonProdilothenta.melody
ltx/gr_gr_cog/tr.d031:trMA.Ode9C2H.mode	@ltx/gr_gr_cog/miscellanea:misc.Mode8
ltx/gr_gr_cog/tr.d031:trMA.Ode9C2H.ode	@ltx/gr_gr_cog/miscellanea:misc.Ode9
ltx/gr_gr_cog/tr.d031:trMA.Ode9C2H.text	@ltx/gr_gr_cog/he.h.m8:heHE.TonProdilothenta.text
ltx/gr_gr_cog/tr.d031:trMA.Ode9C2T.incipit	Σὺ εἶ Θεοτόκε, τὰ ὅπλα…
ltx/gr_gr_cog/tr.d031:trMA.Ode9C2T.melody	@ltx/gr_gr_cog/he.h.m8:heHE.TonProdilothenta.name
ltx/gr_gr_cog/tr.d031:trMA.Ode9C2T.mode	@ltx/gr_gr_cog/miscellanea:misc.Mode8
ltx/gr_gr_cog/tr.d031:trMA.Ode9C2T.ode	@ltx/gr_gr_cog/miscellanea:misc.Ode9
ltx/gr_gr_cog/tr.d031:trMA.Ode9C2T.text	Σὺ εἶ Θεοτόκε, τὰ ὅπλα ἡμῶν καὶ τεῖχος, σὺ εἶ ἡ ἀντίληψις, τῶν εἰς σὲ προστρεχόντων, σὲ καὶ νῦν εἰς πρεσβείαν κινοῦμεν, ἵνα λυτρωθῶμεν τῶν ἐχθρῶν ἡμῶν.
ltx/gr_gr_cog/tr.d031:trMA.Ode9C2Tr.incipit	Τὸ τρισσοφαὲς Κύριε, τῆς σῆς…
ltx/gr_gr_cog/tr.d031:trMA.Ode9C2Tr.melody	@ltx/gr_gr_cog/he.h.m8:heHE.TonProdilothenta.name
ltx/gr_gr_cog/tr.d031:trMA.Ode9C2Tr.mode	@ltx/gr_gr_cog/miscellanea:misc.Mode8
ltx/gr_gr_cog/tr.d031:trMA.Ode9C2Tr.ode	@ltx/gr_gr_cog/miscellanea:misc.Ode9
ltx/gr_gr_cog/tr.d031:trMA.Ode9C2Tr.text	Τὸ τρισσοφαὲς Κύριε, τῆς σῆς μοναρχίας, ἐκφαντορικαῖς λάμψεσιν, εἰς νοῦν ἡμῶν ἀστράπτον, ἀπὸ πλάνης πολυσχιδοῦς ἐπιστρέφει, πρὸς ἑνωτικὴν ἡμᾶς ἐνθέωσιν.
ltx/gr_gr_cog/tr.d031:trTE.Troparion.incipit	Ἀξίως ἀνυμνεῖν σε οὐκ ἔχομεν…
ltx/gr_gr_cog/tr.d031:trTE.Troparion.melody	
ltx/gr_gr_cog/tr.d031:trTE.Troparion.mode	@ltx/gr_gr_cog/miscellanea:misc.Mode6
ltx/gr_gr_cog/tr.d031:trTE.Troparion.text	Ἀξίως ἀνυμνεῖν σε οὐκ ἔχομεν, ἀλλʼ αἰτοῦμεν δεόμενοι· Μὴ συναπολέσῃς ἡμᾶς, ταῖς ἀνομίαις ἡμῶν, εὐδιάλλακτε Κύριε.
ltx/gr_gr_cog/tr.d031:trTE.Troparion2.incipit	Μὴ συναπολέσῃς ἡμᾶς, ταῖς ἀνομίαις…
ltx/gr_gr_cog/tr.d031:trTE.Troparion2.text	Μὴ συναπολέσῃς ἡμᾶς, ταῖς ἀνομίαις ἡμῶν, εὐδιάλλακτε Κύριε.
ltx/gr_gr_cog/tr.d031:trVE.AposIdiomelon1.incipit	Τὴν πνευματικὴν Νηστείαν νηστεύσωμεν, διάῤῥήξωμεν…
ltx/gr_gr_cog/tr.d031:trVE.AposIdiomelon1.melody	@ltx/gr_gr_cog/miscellanea:misc.Idiomelon
ltx/gr_gr_cog/tr.d031:trVE.AposIdiomelon1.mode	@ltx/gr_gr_cog/miscellanea:misc.Mode3
ltx/gr_gr_cog/tr.d031:trVE.AposIdiomelon1.text	Τὴν πνευματικὴν Νηστείαν νηστεύσωμεν, διάῤῥήξωμεν πᾶσαν στραγγαλιάν, ἐκφευξώμεθα δὲ καὶ τῶν σκανδάλων τῆς ἁμαρτίας, ἀφήσωμεν ἀδελφοῖς τὰ ὀφειλήματα, ἵνα καὶ ἡμῖν ἀφεθῇ τὰ παραπτώματα ἡμῶν· οὕτω γὰρ βοῆσαι δυνησόμεθα. Κατευθυνθήτω ἡ προσευχὴ ἡμῶν, ὡς θυμίαμα, ἐνώπιόν σου Κύριε.
ltx/gr_gr_cog/tr.d031:trVE.AposMartyric.incipit	@ltx/gr_gr_cog/oc.m3.d4:ocVE.Aposticha3.incipit
ltx/gr_gr_cog/tr.d031:trVE.AposMartyric.melody	
ltx/gr_gr_cog/tr.d031:trVE.AposMartyric.mode	@ltx/gr_gr_cog/miscellanea:misc.Mode3
ltx/gr_gr_cog/tr.d031:trVE.AposMartyric.text	@ltx/gr_gr_cog/oc.m3.d4:ocVE.Aposticha3.text
ltx/gr_gr_cog/tr.d031:trVE.AposTheotokion.incipit	Εἰς τέλος τῶν πενήτων σου…
ltx/gr_gr_cog/tr.d031:trVE.AposTheotokion.melody	
ltx/gr_gr_cog/tr.d031:trVE.AposTheotokion.mode	@ltx/gr_gr_cog/miscellanea:misc.Mode3
ltx/gr_gr_cog/tr.d031:trVE.AposTheotokion.text	Εἰς τέλος τῶν πενήτων σου, μὴ ἐπιλάθῃ Δέσποινα, ἀλλὰ ταῖς σαῖς πρεσβείαις, μελλούσης ἡμᾶς λύτρωσαι ἀπειλῆς, καὶ ἐνεστώσης βλάβης, καὶ τῆς ὀργῆς Κυρίου ἐξάρπασον, Θεοτόκε σοὺς δούλους.
ltx/gr_gr_cog/tr.d031:trVE.Stichera01.greekmelody	@ltx/gr_gr_cog/he.a.m8:heAU.TiYmasKalesomen.greekname
ltx/gr_gr_cog/tr.d031:trVE.Stichera01.incipit	Τίνι ὡμοιώθης ταλαίπωρε, ῥαθυμοῦσα, ὦ…
ltx/gr_gr_cog/tr.d031:trVE.Stichera01.melody	@ltx/gr_gr_cog/he.a.m8:heAU.TiYmasKalesomen.name
ltx/gr_gr_cog/tr.d031:trVE.Stichera01.mode	@ltx/gr_gr_cog/miscellanea:misc.Mode8
ltx/gr_gr_cog/tr.d031:trVE.Stichera01.poet	@ltx/gr_gr_cog/poets:po.KyriouIosif
ltx/gr_gr_cog/tr.d031:trVE.Stichera01.text	Τίνι ὡμοιώθης ταλαίπωρε, ῥαθυμοῦσα, ὦ ψυχή, καὶ μὴ ποιοῦσα τὰ καλά, ἀλλὰ στέργουσα ἀεί, τῇ τῶν κακῶν ἐπιμονῆ; ἡ κρίσις ἐπὶ θύραις, μετανόησον, νηστείᾳ, καὶ δεήσει καθαγνίσθητι, καὶ τῷ Δεσπότῃ σου βόησον· Ἡμάρτηκά σοι, συγχώρησον, ὡς εὔσπλαγχνος, καὶ τὴν ἄφεσίν μοι δώρησαι.
ltx/gr_gr_cog/tr.d031:trVE.Stichera02.greekmelody	@ltx/gr_gr_cog/he.a.m8:heAU.TiYmasKalesomen.greekname
ltx/gr_gr_cog/tr.d031:trVE.Stichera02.incipit	Ἔχων ἀγαθότητος πέλαγος, τὰ πελάγη…
ltx/gr_gr_cog/tr.d031:trVE.Stichera02.melody	@ltx/gr_gr_cog/he.a.m8:heAU.TiYmasKalesomen.name
ltx/gr_gr_cog/tr.d031:trVE.Stichera02.mode	@ltx/gr_gr_cog/miscellanea:misc.Mode8
ltx/gr_gr_cog/tr.d031:trVE.Stichera02.text	Ἔχων ἀγαθότητος πέλαγος, τὰ πελάγη τῶν ἐμῶν, ἁμαρτιῶν τὰ πονηρά, ἀποξήρανον Χριστέ, ὡς ἀναμάρτητος Θεός, καὶ δίδου, τῇ καρδίᾳ μου κατάνυξιν, χειμάῤῥους, ἀνομίας ἀναστέλλουσαν, ἵνα ὑμνῶ καὶ δοξάζω σου, τὴν εὐσπλαγχνίαν τὴν ἄφατον, μακρόθυμε, εὐεργέτα τῶν ψυχῶν ἡμῶν.
ltx/gr_gr_cog/tr.d031:trVE.Stichera03.greekmelody	@ltx/gr_gr_cog/he.a.m8:heAU.OEnEdemParadeisos.greekname
ltx/gr_gr_cog/tr.d031:trVE.Stichera03.incipit	Ὁ ἀγαγὼν καὶ νῦν ἡμᾶς…
ltx/gr_gr_cog/tr.d031:trVE.Stichera03.melody	@ltx/gr_gr_cog/he.a.m8:heAU.OEnEdemParadeisos.name
ltx/gr_gr_cog/tr.d031:trVE.Stichera03.mode	@ltx/gr_gr_cog/miscellanea:misc.Mode8
ltx/gr_gr_cog/tr.d031:trVE.Stichera03.poet	@ltx/gr_gr_cog/poets:po.KyriouTheodorou
ltx/gr_gr_cog/tr.d031:trVE.Stichera03.text	Ὁ ἀγαγὼν καὶ νῦν ἡμᾶς Θεός, τοῦ χρόνου περίοδον, τῶν πανσέπτων Νηστειῶν διατελεῖν, καὶ χαρισάμενος ἡμῖν, εἰς τὸ ἅγιον στάδιον, τῆς δευτέρας Ἑβδομάδος εἰσελθεῖν, αὐτὸς ἀξίωσον Κύριε, καὶ πρὸς τὸ μέλλον εὐδρομεῖν, τὸ σῶμα καὶ τὴν ψυχὴν ἡμῶν, καὶ χαριτῶν καὶ δυναμῶν, ὅπως προφθάσωμεν, ἐκτελέσαντες τὸν δρόμον ἀνδρικῶς, τὴν κυρίαν ἡμέραν, τῆς Ἀναστάσεώς σου πάντες ἐν χαρᾷ καὶ στεφανηφοροῦντες, ἀκαταπαύστως αἰνέσωμεν.
