ltx/gr_gr_cog/le.ep.me.m09.d03:lemeLI.Epistle.book_abbr	@ltx/gr_gr_cog/le.ep.me.m01.d18:lemeLI.Epistle.book_abbr
ltx/gr_gr_cog/le.ep.me.m09.d03:lemeLI.Epistle.book_string	@ltx/gr_gr_cog/le.ep.me.m01.d18:lemeLI.Epistle.book_string
ltx/gr_gr_cog/le.ep.me.m09.d03:lemeLI.Epistle.chapverse	@ltx/gr_gr_cog/le.ep.me.m01.d18:lemeLI.Epistle.chapverse
ltx/gr_gr_cog/le.ep.me.m09.d03:lemeLI.Epistle.incipit	@ltx/gr_gr_cog/le.ep.me.m01.d18:lemeLI.Epistle.incipit
ltx/gr_gr_cog/le.ep.me.m09.d03:lemeLI.Epistle.text	@ltx/gr_gr_cog/le.ep.me.m01.d18:lemeLI.Epistle.text
ltx/gr_gr_cog/le.ep.me.m09.d03:lemeLI.Epistle.title	Τοῦ Ἱερομάρτυρος
ltx/gr_gr_cog/le.ep.me.m09.d03:lemeLI.Epistle.title_abbr	Τοῦ Ἱερομάρτυρος
ltx/gr_gr_cog/le.ep.me.m09.d03:lemeLI.Epistle.version	@ltx/gr_gr_cog/le.ep.me.m01.d18:lemeLI.Epistle.version
ltx/gr_gr_cog/le.ep.me.m09.d03:lemeLI.Epistle2.book_abbr	@ltx/gr_gr_cog/le.ep.me.m12.d15:lemeLI.Epistle.book_abbr
ltx/gr_gr_cog/le.ep.me.m09.d03:lemeLI.Epistle2.book_string	@ltx/gr_gr_cog/le.ep.me.m12.d15:lemeLI.Epistle.book_string
ltx/gr_gr_cog/le.ep.me.m09.d03:lemeLI.Epistle2.chapverse	@ltx/gr_gr_cog/le.ep.me.m12.d15:lemeLI.Epistle.chapverse
ltx/gr_gr_cog/le.ep.me.m09.d03:lemeLI.Epistle2.incipit	@ltx/gr_gr_cog/le.ep.me.m12.d15:lemeLI.Epistle.incipit
ltx/gr_gr_cog/le.ep.me.m09.d03:lemeLI.Epistle2.text	@ltx/gr_gr_cog/le.ep.me.m12.d15:lemeLI.Epistle.text
ltx/gr_gr_cog/le.ep.me.m09.d03:lemeLI.Epistle2.title	Τοῦ Ὁσίου
ltx/gr_gr_cog/le.ep.me.m09.d03:lemeLI.Epistle2.title_abbr	Τοῦ Ὁσίου
ltx/gr_gr_cog/le.ep.me.m09.d03:lemeLI.Epistle2.version	@ltx/gr_gr_cog/le.ep.me.m12.d15:lemeLI.Epistle.version
