ltx/gr_gr_cog/me.m03.d16:meDA.commemoration.first	Μνήμη τοῦ Ἁγίου Μάρτυρος Σαβίνου τοῦ Αἰγυπτίου
ltx/gr_gr_cog/me.m03.d16:meDA.commemoration.first_name	
ltx/gr_gr_cog/me.m03.d16:meDA.commemoration.first_short	Μνήμη τοῦ Ἁγίου Μάρτυρος Σαβίνου τοῦ Αἰγυπτίου
ltx/gr_gr_cog/me.m03.d16:meDA.commemoration.first_title	@ltx/gr_gr_cog/titles:ti.SaintM
ltx/gr_gr_cog/me.m03.d16:meDA.commemoration.full	Μνήμη τοῦ Ἁγίου Μάρτυρος Σαβίνου τοῦ Αἰγυπτίου, καὶ τοῦ Ὁσίου Πατρὸς ἡμῶν Χριστοδούλου τοῦ ἐν Πάτμῳ.
ltx/gr_gr_cog/me.m03.d16:meDA.commemoration.second_name	
ltx/gr_gr_cog/me.m03.d16:meDA.commemoration.second_title	
ltx/gr_gr_cog/me.m03.d16:meDA.date	Τῌ ΙϚʹ ΜΑΡΤΙΟΥ
ltx/gr_gr_cog/me.m03.d16:meDA.fordate	διὰ τὴν 16ην Μαρτίου
ltx/gr_gr_cog/me.m03.d16:meDA.insert1	καὶ τοῦ Ἁγίου Μάρτυρος Σαβίνου τοῦ Αἰγυπτίου, καὶ τοῦ Ὁσίου Πατρὸς ἡμῶν Χριστοδούλου τοῦ ἐν Πάτμῳ,
ltx/gr_gr_cog/me.m03.d16:meDA.insert2	ὧν καὶ τὴν μνήμην ἐπιτελοῦμεν·
ltx/gr_gr_cog/me.m03.d16:meDA.note	
ltx/gr_gr_cog/me.m03.d16:meDA.pdfcoverdate	τῆς 16ης Μαρτίου,
ltx/gr_gr_cog/me.m03.d16:meDA.pdfheaderdate	τῆς 16ης Μαρτίου
ltx/gr_gr_cog/me.m03.d16:meHO.commemorations	
ltx/gr_gr_cog/me.m03.d16:meHO.note1	
ltx/gr_gr_cog/me.m03.d16:meHO.note2	
ltx/gr_gr_cog/me.m03.d16:meHO.number	
ltx/gr_gr_cog/me.m03.d16:meHO.rank	
ltx/gr_gr_cog/me.m03.d16:meLE.commemoration1	Μνήμη τοῦ Ἁγίου Μάρτυρος Σαβίνου τοῦ Αἰγυπτίου, καὶ τοῦ Ὁσίου Πατρὸς ἡμῶν Χριστοδούλου τοῦ ἐν Πάτμῳ.
ltx/gr_gr_cog/me.m03.d16:meLE.commemoration2	
ltx/gr_gr_cog/me.m03.d16:meLI.Kontakion1.incipit	@ltx/gr_gr_cog/me.m03.d16:meMA.Kontakion1ger.incipit
ltx/gr_gr_cog/me.m03.d16:meLI.Kontakion1.melody	@ltx/gr_gr_cog/me.m03.d16:meMA.Kontakion1ger.melody
ltx/gr_gr_cog/me.m03.d16:meLI.Kontakion1.mode	@ltx/gr_gr_cog/me.m03.d16:meMA.Kontakion1ger.mode
ltx/gr_gr_cog/me.m03.d16:meLI.Kontakion1.text	@ltx/gr_gr_cog/me.m03.d16:meMA.Kontakion1ger.text
ltx/gr_gr_cog/me.m03.d16:meLI.Megalynarion.text	
ltx/gr_gr_cog/me.m03.d16:meMA.C1.acrostic.notice1	οὗ ἡ Ἀκροστιχίς, ἐν τοῖς Θεοτοκίοις·
ltx/gr_gr_cog/me.m03.d16:meMA.C1.acrostic.text	Γεωργίου.
ltx/gr_gr_cog/me.m03.d16:meMA.C1.acrostic.title	Ὁ Κανὼν τοῦ Ἁγίου,
ltx/gr_gr_cog/me.m03.d16:meMA.C1.title	@ltx/gr_gr_cog/titles:ti.CanonSaintM
ltx/gr_gr_cog/me.m03.d16:meMA.C1.verse	@ltx/gr_gr_cog/prayers:pr.verse_SaintM.text
ltx/gr_gr_cog/me.m03.d16:meMA.Kontakion1ger.incipit	Πρὸς ὕδωρ ζωῆς, καὶ πέλαγος…
ltx/gr_gr_cog/me.m03.d16:meMA.Kontakion1ger.melody	@ltx/gr_gr_cog/he.a.m2:heAU.TaAnoZiton.name
ltx/gr_gr_cog/me.m03.d16:meMA.Kontakion1ger.mode	@ltx/gr_gr_cog/miscellanea:misc.Mode2
ltx/gr_gr_cog/me.m03.d16:meMA.Kontakion1ger.poet	@ltx/gr_gr_cog/poets:po.Gerasimou
ltx/gr_gr_cog/me.m03.d16:meMA.Kontakion1ger.text	Πρὸς ὕδωρ ζωῆς, καὶ πέλαγος χρηστότητος, ἰθύνθης σαφῶς, ἱστίῳ τῷ τοῦ Πνεύματος, ποταμίοις ὕδασι, προσριφεὶς Σαβῖνε πανεύφημε· διὸ λύσιν ἁμαρτιῶν, ὀμβρίζεις ἀπαύστως, προσευχαρῖς σου ἡμῖν.
ltx/gr_gr_cog/me.m03.d16:meMA.Ode1C11.greekmelody	@ltx/gr_gr_cog/he.h.m8:heHE.YgranDiodefsas.greekname
ltx/gr_gr_cog/me.m03.d16:meMA.Ode1C11.incipit	Τὸ ὄμμα καθάραντες τῆς ψυχῆς…
ltx/gr_gr_cog/me.m03.d16:meMA.Ode1C11.melody	@ltx/gr_gr_cog/he.h.m8:heHE.YgranDiodefsas.name
ltx/gr_gr_cog/me.m03.d16:meMA.Ode1C11.mode	@ltx/gr_gr_cog/miscellanea:misc.Mode8
ltx/gr_gr_cog/me.m03.d16:meMA.Ode1C11.ode	@ltx/gr_gr_cog/miscellanea:misc.Ode1
ltx/gr_gr_cog/me.m03.d16:meMA.Ode1C11.text	Τὸ ὄμμα καθάραντες τῆς ψυχῆς, ἐγκρατείας πόνοις καὶ δακρύων καταῤῥοαῖς, νοητῶς τὸν Ἥλιον τῆς δόξης, ἐξαναστάντα θεασώμεθα.
ltx/gr_gr_cog/me.m03.d16:meMA.Ode1C12.incipit	Ἐν ὕψει τῆς γνώσεως τοῦ…
ltx/gr_gr_cog/me.m03.d16:meMA.Ode1C12.melody	@ltx/gr_gr_cog/he.h.m8:heHE.YgranDiodefsas.name
ltx/gr_gr_cog/me.m03.d16:meMA.Ode1C12.mode	@ltx/gr_gr_cog/miscellanea:misc.Mode8
ltx/gr_gr_cog/me.m03.d16:meMA.Ode1C12.ode	@ltx/gr_gr_cog/miscellanea:misc.Ode1
ltx/gr_gr_cog/me.m03.d16:meMA.Ode1C12.text	Ἐν ὕψει τῆς γνώσεως τοῦ Χριστοῦ, σοφῇ διανοίᾳ, Ἀθλοφόρε ἀναδραμών, τοῦ ψεύδους κατέλιπες τὴν πλάνην, καὶ οὐρανίου δόξης ἔτυχες.
ltx/gr_gr_cog/me.m03.d16:meMA.Ode1C13.incipit	Χρυσοῤῥόας Μάρτυς ἄλλος Χριστοῦ, ἐν…
ltx/gr_gr_cog/me.m03.d16:meMA.Ode1C13.melody	@ltx/gr_gr_cog/he.h.m8:heHE.YgranDiodefsas.name
ltx/gr_gr_cog/me.m03.d16:meMA.Ode1C13.mode	@ltx/gr_gr_cog/miscellanea:misc.Mode8
ltx/gr_gr_cog/me.m03.d16:meMA.Ode1C13.ode	@ltx/gr_gr_cog/miscellanea:misc.Ode1
ltx/gr_gr_cog/me.m03.d16:meMA.Ode1C13.text	Χρυσοῤῥόας Μάρτυς ἄλλος Χριστοῦ, ἐν γῇ Αἰγυπτίων, καὶ ἐν κόσμῳ ἀθλητικῶς, πλημμυρήσας αἵμασι Σαβίνε, θεογνωσίᾳ ἀνθρώπους κατήρδευσας.
ltx/gr_gr_cog/me.m03.d16:meMA.Ode1C1H.greekmelody	@ltx/gr_gr_cog/he.h.m8:heHE.YgranDiodefsas.greekname
ltx/gr_gr_cog/me.m03.d16:meMA.Ode1C1H.incipit	@ltx/gr_gr_cog/he.h.m8:heHE.YgranDiodefsas.incipit
ltx/gr_gr_cog/me.m03.d16:meMA.Ode1C1H.melody	@ltx/gr_gr_cog/he.h.m8:heHE.YgranDiodefsas.melody
ltx/gr_gr_cog/me.m03.d16:meMA.Ode1C1H.mode	@ltx/gr_gr_cog/miscellanea:misc.Mode8
ltx/gr_gr_cog/me.m03.d16:meMA.Ode1C1H.ode	@ltx/gr_gr_cog/miscellanea:misc.Ode1
ltx/gr_gr_cog/me.m03.d16:meMA.Ode1C1H.text	@ltx/gr_gr_cog/he.h.m8:heHE.YgranDiodefsas.text
ltx/gr_gr_cog/me.m03.d16:meMA.Ode1C1T.incipit	Γαλήνης Πανάχραντε ὁ ἐκ σοῦ…
ltx/gr_gr_cog/me.m03.d16:meMA.Ode1C1T.melody	@ltx/gr_gr_cog/he.h.m8:heHE.YgranDiodefsas.name
ltx/gr_gr_cog/me.m03.d16:meMA.Ode1C1T.mode	@ltx/gr_gr_cog/miscellanea:misc.Mode8
ltx/gr_gr_cog/me.m03.d16:meMA.Ode1C1T.ode	@ltx/gr_gr_cog/miscellanea:misc.Ode1
ltx/gr_gr_cog/me.m03.d16:meMA.Ode1C1T.text	Γαλήνης Πανάχραντε ὁ ἐκ σοῦ, τεχθεὶς ὑπὲρ λόγον, ταῖς πρεσβείαις σου ἐκπληροῖ, τὸν παρόντα χρόνον καὶ ἰθύνει, τοὺς σὲ δοξάζοντας πανάμωμε.
ltx/gr_gr_cog/me.m03.d16:meMA.Ode3C11.greekmelody	@ltx/gr_gr_cog/he.h.m8:heHE.SyEiToStereoma.greekname
ltx/gr_gr_cog/me.m03.d16:meMA.Ode3C11.incipit	Σὺ ἡμᾶς ἐνίσχυσον, διὰ νηστείας…
ltx/gr_gr_cog/me.m03.d16:meMA.Ode3C11.melody	@ltx/gr_gr_cog/he.h.m8:heHE.SyEiToStereoma.name
ltx/gr_gr_cog/me.m03.d16:meMA.Ode3C11.mode	@ltx/gr_gr_cog/miscellanea:misc.Mode8
ltx/gr_gr_cog/me.m03.d16:meMA.Ode3C11.ode	@ltx/gr_gr_cog/miscellanea:misc.Ode3
ltx/gr_gr_cog/me.m03.d16:meMA.Ode3C11.text	Σὺ ἡμᾶς ἐνίσχυσον, διὰ νηστείας σοι Κύριε, εὐαρεστεῖν, καὶ πληροῦν προθύμως, τὰ σεπτά σου θελήματα.
ltx/gr_gr_cog/me.m03.d16:meMA.Ode3C12.incipit	Κράτος ἀπροσμάχητον, θωρακισάμενος Ἔνδοξε, τὴν…
ltx/gr_gr_cog/me.m03.d16:meMA.Ode3C12.melody	@ltx/gr_gr_cog/he.h.m8:heHE.SyEiToStereoma.name
ltx/gr_gr_cog/me.m03.d16:meMA.Ode3C12.mode	@ltx/gr_gr_cog/miscellanea:misc.Mode8
ltx/gr_gr_cog/me.m03.d16:meMA.Ode3C12.ode	@ltx/gr_gr_cog/miscellanea:misc.Ode3
ltx/gr_gr_cog/me.m03.d16:meMA.Ode3C12.text	Κράτος ἀπροσμάχητον, θωρακισάμενος Ἔνδοξε, τὴν τοῦ Χριστοῦ, πίστιν καὶ ἀγάπην, κατʼ ἐχθρῶν σὺ ἠρίστευσας.
ltx/gr_gr_cog/me.m03.d16:meMA.Ode3C13.incipit	Πλάνης τὰ θεμέλια, τῇ καρτερίᾳ…
ltx/gr_gr_cog/me.m03.d16:meMA.Ode3C13.melody	@ltx/gr_gr_cog/he.h.m8:heHE.SyEiToStereoma.name
ltx/gr_gr_cog/me.m03.d16:meMA.Ode3C13.mode	@ltx/gr_gr_cog/miscellanea:misc.Mode8
ltx/gr_gr_cog/me.m03.d16:meMA.Ode3C13.ode	@ltx/gr_gr_cog/miscellanea:misc.Ode3
ltx/gr_gr_cog/me.m03.d16:meMA.Ode3C13.text	Πλάνης τὰ θεμέλια, τῇ καρτερίᾳ σου ἔσεισας, καὶ εἰς βυθόν, βωμοὺς τῶν εἰδώλων, Σαβίνε καταβέβληκας.
ltx/gr_gr_cog/me.m03.d16:meMA.Ode3C1H.greekmelody	@ltx/gr_gr_cog/he.h.m8:heHE.SyEiToStereoma.greekname
ltx/gr_gr_cog/me.m03.d16:meMA.Ode3C1H.incipit	@ltx/gr_gr_cog/he.h.m8:heHE.SyEiToStereoma.incipit
ltx/gr_gr_cog/me.m03.d16:meMA.Ode3C1H.melody	@ltx/gr_gr_cog/he.h.m8:heHE.SyEiToStereoma.melody
ltx/gr_gr_cog/me.m03.d16:meMA.Ode3C1H.mode	@ltx/gr_gr_cog/miscellanea:misc.Mode8
ltx/gr_gr_cog/me.m03.d16:meMA.Ode3C1H.ode	@ltx/gr_gr_cog/miscellanea:misc.Ode3
ltx/gr_gr_cog/me.m03.d16:meMA.Ode3C1H.text	@ltx/gr_gr_cog/he.h.m8:heHE.SyEiToStereoma.text
ltx/gr_gr_cog/me.m03.d16:meMA.Ode3C1T.incipit	Ἐν σοὶ δυναμούμενοι, καὶ κραταιούμενοι…
ltx/gr_gr_cog/me.m03.d16:meMA.Ode3C1T.melody	@ltx/gr_gr_cog/he.h.m8:heHE.SyEiToStereoma.name
ltx/gr_gr_cog/me.m03.d16:meMA.Ode3C1T.mode	@ltx/gr_gr_cog/miscellanea:misc.Mode8
ltx/gr_gr_cog/me.m03.d16:meMA.Ode3C1T.ode	@ltx/gr_gr_cog/miscellanea:misc.Ode3
ltx/gr_gr_cog/me.m03.d16:meMA.Ode3C1T.text	Ἐν σοὶ δυναμούμενοι, καὶ κραταιούμενοι, Ἄχραντε, ἐν τῷ καιρῷ τῷ τῆς ἐγκρατείας, παθῶν νικῶμεν τὸν πόλεμον.
ltx/gr_gr_cog/me.m03.d16:meMA.Ode3Kathisma1.greekmelody	@ltx/gr_gr_cog/he.a.m3:heAU.IParthenosSimeron.greekname
ltx/gr_gr_cog/me.m03.d16:meMA.Ode3Kathisma1.incipit	Ἀθλοφόρε μέγιστε, τῆς ἀληθείας ὁπλῖτα…
ltx/gr_gr_cog/me.m03.d16:meMA.Ode3Kathisma1.melody	@ltx/gr_gr_cog/he.a.m3:heAU.IParthenosSimeron.name
ltx/gr_gr_cog/me.m03.d16:meMA.Ode3Kathisma1.mode	@ltx/gr_gr_cog/miscellanea:misc.Mode3
ltx/gr_gr_cog/me.m03.d16:meMA.Ode3Kathisma1.text	Ἀθλοφόρε μέγιστε, τῆς ἀληθείας ὁπλῖτα, Χριστομάρτυς ἔνδοξε, Κήρυξ τῆς θείας Τριάδος, αἴτησαι, τοῖς σὲ τιμῶσιν ἐξ ὕψους χάριν, δώρησαι, ταῖς σαῖς πρεσβείαις πᾶσιν εἰρήνην, τοῖς ἀπαύστως ἀνυμνοῦσι, τὴν θείαν μνήμην, τῆς σῆς ἀθλήσεως.
ltx/gr_gr_cog/me.m03.d16:meMA.Ode3KathismaSt.incipit	@ltx/gr_gr_cog/oc.m3.d4:ocMA.Kathisma13.incipit
ltx/gr_gr_cog/me.m03.d16:meMA.Ode3KathismaSt.melody	
ltx/gr_gr_cog/me.m03.d16:meMA.Ode3KathismaSt.mode	@ltx/gr_gr_cog/miscellanea:misc.Mode3
ltx/gr_gr_cog/me.m03.d16:meMA.Ode3KathismaSt.text	@ltx/gr_gr_cog/oc.m3.d4:ocMA.Kathisma13.text
ltx/gr_gr_cog/me.m03.d16:meMA.Ode3KathismaT.incipit	@ltx/gr_gr_cog/oc.m3.d3:ocMA.Kathisma33.incipit
ltx/gr_gr_cog/me.m03.d16:meMA.Ode3KathismaT.melody	
ltx/gr_gr_cog/me.m03.d16:meMA.Ode3KathismaT.mode	@ltx/gr_gr_cog/miscellanea:misc.Mode3
ltx/gr_gr_cog/me.m03.d16:meMA.Ode3KathismaT.text	@ltx/gr_gr_cog/oc.m3.d3:ocMA.Kathisma33.text
ltx/gr_gr_cog/me.m03.d16:meMA.Ode4C11.greekmelody	@ltx/gr_gr_cog/he.h.m8:heHE.EisakikoaKyrie.greekname
ltx/gr_gr_cog/me.m03.d16:meMA.Ode4C11.incipit	Τῆς σαρκὸς τὰ σκιρτήματα, νηστείᾳ…
ltx/gr_gr_cog/me.m03.d16:meMA.Ode4C11.melody	@ltx/gr_gr_cog/he.h.m8:heHE.EisakikoaKyrie.name
ltx/gr_gr_cog/me.m03.d16:meMA.Ode4C11.mode	@ltx/gr_gr_cog/miscellanea:misc.Mode8
ltx/gr_gr_cog/me.m03.d16:meMA.Ode4C11.ode	@ltx/gr_gr_cog/miscellanea:misc.Ode4
ltx/gr_gr_cog/me.m03.d16:meMA.Ode4C11.text	Τῆς σαρκὸς τὰ σκιρτήματα, νηστείᾳ καὶ πόνοις καθυποτάξαντες, ἀπαθῶς Χριστοῦ ὀψόμεθα, καὶ ἁγνῶς τὰ πάθη τὰ σωτήρια.
ltx/gr_gr_cog/me.m03.d16:meMA.Ode4C12.incipit	Ὥσπερ μάστιγι ἔπληξας, ῥήμασι Σαβίνε…
ltx/gr_gr_cog/me.m03.d16:meMA.Ode4C12.melody	@ltx/gr_gr_cog/he.h.m8:heHE.EisakikoaKyrie.name
ltx/gr_gr_cog/me.m03.d16:meMA.Ode4C12.mode	@ltx/gr_gr_cog/miscellanea:misc.Mode8
ltx/gr_gr_cog/me.m03.d16:meMA.Ode4C12.ode	@ltx/gr_gr_cog/miscellanea:misc.Ode4
ltx/gr_gr_cog/me.m03.d16:meMA.Ode4C12.text	Ὥσπερ μάστιγι ἔπληξας, ῥήμασι Σαβίνε ὁμολογίας σου, τῆς ἐνθέου τοὺς διώκοντας, καὶ αὐτὸς ἐσώθης ἀπαράτρωτος.
ltx/gr_gr_cog/me.m03.d16:meMA.Ode4C13.incipit	Τοὺς τῇ κτίσει λατρεύοντας, ἔπεισας…
ltx/gr_gr_cog/me.m03.d16:meMA.Ode4C13.melody	@ltx/gr_gr_cog/he.h.m8:heHE.EisakikoaKyrie.name
ltx/gr_gr_cog/me.m03.d16:meMA.Ode4C13.mode	@ltx/gr_gr_cog/miscellanea:misc.Mode8
ltx/gr_gr_cog/me.m03.d16:meMA.Ode4C13.ode	@ltx/gr_gr_cog/miscellanea:misc.Ode4
ltx/gr_gr_cog/me.m03.d16:meMA.Ode4C13.text	Τοὺς τῇ κτίσει λατρεύοντας, ἔπεισας Σαβίνε καὶ καθωδήγησας, εἰς λατρείαν τοῦ τῶν ὅλων Θεοῦ, ὁδηγόν σε Μάρτυς καταγγέλλοντας.
ltx/gr_gr_cog/me.m03.d16:meMA.Ode4C1H.greekmelody	@ltx/gr_gr_cog/he.h.m8:heHE.EisakikoaKyrie.greekname
ltx/gr_gr_cog/me.m03.d16:meMA.Ode4C1H.incipit	@ltx/gr_gr_cog/he.h.m8:heHE.EisakikoaKyrie.incipit
ltx/gr_gr_cog/me.m03.d16:meMA.Ode4C1H.melody	@ltx/gr_gr_cog/he.h.m8:heHE.EisakikoaKyrie.melody
ltx/gr_gr_cog/me.m03.d16:meMA.Ode4C1H.mode	@ltx/gr_gr_cog/miscellanea:misc.Mode8
ltx/gr_gr_cog/me.m03.d16:meMA.Ode4C1H.ode	@ltx/gr_gr_cog/miscellanea:misc.Ode4
ltx/gr_gr_cog/me.m03.d16:meMA.Ode4C1H.text	@ltx/gr_gr_cog/he.h.m8:heHE.EisakikoaKyrie.text
ltx/gr_gr_cog/me.m03.d16:meMA.Ode4C1T.incipit	Ὡς ἀγκύρας δεξάμενοι, τῆς σῆς…
ltx/gr_gr_cog/me.m03.d16:meMA.Ode4C1T.melody	@ltx/gr_gr_cog/he.h.m8:heHE.EisakikoaKyrie.name
ltx/gr_gr_cog/me.m03.d16:meMA.Ode4C1T.mode	@ltx/gr_gr_cog/miscellanea:misc.Mode8
ltx/gr_gr_cog/me.m03.d16:meMA.Ode4C1T.ode	@ltx/gr_gr_cog/miscellanea:misc.Ode4
ltx/gr_gr_cog/me.m03.d16:meMA.Ode4C1T.text	Ὡς ἀγκύρας δεξάμενοι, τῆς σῆς προστασίας μόνη Πανύμνητε, τοῦ Υἱοῦ σου καὶ Θεοῦ ἡμῶν, εἰς λιμένα θεῖον ἀναγόμεθα.
ltx/gr_gr_cog/me.m03.d16:meMA.Ode5C11.greekmelody	@ltx/gr_gr_cog/he.h.m8:heHE.FotisonImas.greekname
ltx/gr_gr_cog/me.m03.d16:meMA.Ode5C11.incipit	Λάμπρυνον ἡμᾶς, τῆς νηστείας ταῖς…
ltx/gr_gr_cog/me.m03.d16:meMA.Ode5C11.melody	@ltx/gr_gr_cog/he.h.m8:heHE.FotisonImas.name
ltx/gr_gr_cog/me.m03.d16:meMA.Ode5C11.mode	@ltx/gr_gr_cog/miscellanea:misc.Mode8
ltx/gr_gr_cog/me.m03.d16:meMA.Ode5C11.ode	@ltx/gr_gr_cog/miscellanea:misc.Ode5
ltx/gr_gr_cog/me.m03.d16:meMA.Ode5C11.text	Λάμπρυνον ἡμᾶς, τῆς νηστείας ταῖς ἐλλάμψεσι, καὶ ἀξίωσον ἁγνῶς κατιδεῖν σε, τῆς Δόξης καὶ Δικαιοσύνης τὸν Ἥλιον.
ltx/gr_gr_cog/me.m03.d16:meMA.Ode5C12.incipit	Ἔχων ἐν ψυχῇ ὥσπερ λύχνον…
ltx/gr_gr_cog/me.m03.d16:meMA.Ode5C12.melody	@ltx/gr_gr_cog/he.h.m8:heHE.FotisonImas.name
ltx/gr_gr_cog/me.m03.d16:meMA.Ode5C12.mode	@ltx/gr_gr_cog/miscellanea:misc.Mode8
ltx/gr_gr_cog/me.m03.d16:meMA.Ode5C12.ode	@ltx/gr_gr_cog/miscellanea:misc.Ode5
ltx/gr_gr_cog/me.m03.d16:meMA.Ode5C12.text	Ἔχων ἐν ψυχῇ ὥσπερ λύχνον φαεινότατον, τὴν Χριστοῦ θείαν ἀγάπησιν, πρὸς τοῦτον Μάρτυς, ὡδηγήθης διʼ ἀθλήσεως.
ltx/gr_gr_cog/me.m03.d16:meMA.Ode5C13.incipit	Ἔκτεινας Σοφέ, Αἰγυπτίων τὰ σεβάσματα…
ltx/gr_gr_cog/me.m03.d16:meMA.Ode5C13.melody	@ltx/gr_gr_cog/he.h.m8:heHE.FotisonImas.name
ltx/gr_gr_cog/me.m03.d16:meMA.Ode5C13.mode	@ltx/gr_gr_cog/miscellanea:misc.Mode8
ltx/gr_gr_cog/me.m03.d16:meMA.Ode5C13.ode	@ltx/gr_gr_cog/miscellanea:misc.Ode5
ltx/gr_gr_cog/me.m03.d16:meMA.Ode5C13.text	Ἔκτεινας Σοφέ, Αἰγυπτίων τὰ σεβάσματα, ἐν τῇ ῥάβδῳ τῆς σοφίας σου, τὸν τῶν ἁπάντων Ποιητὴν δοξάζων Κύριον.
ltx/gr_gr_cog/me.m03.d16:meMA.Ode5C1H.greekmelody	@ltx/gr_gr_cog/he.h.m8:heHE.FotisonImas.greekname
ltx/gr_gr_cog/me.m03.d16:meMA.Ode5C1H.incipit	@ltx/gr_gr_cog/he.h.m8:heHE.FotisonImas.incipit
ltx/gr_gr_cog/me.m03.d16:meMA.Ode5C1H.melody	@ltx/gr_gr_cog/he.h.m8:heHE.FotisonImas.melody
ltx/gr_gr_cog/me.m03.d16:meMA.Ode5C1H.mode	@ltx/gr_gr_cog/miscellanea:misc.Mode8
ltx/gr_gr_cog/me.m03.d16:meMA.Ode5C1H.ode	@ltx/gr_gr_cog/miscellanea:misc.Ode5
ltx/gr_gr_cog/me.m03.d16:meMA.Ode5C1H.text	@ltx/gr_gr_cog/he.h.m8:heHE.FotisonImas.text
ltx/gr_gr_cog/me.m03.d16:meMA.Ode5C1T.incipit	Ῥώμην τὴν ἡμῶν, περιβάλλουσα ἀσθένειαν…
ltx/gr_gr_cog/me.m03.d16:meMA.Ode5C1T.melody	@ltx/gr_gr_cog/he.h.m8:heHE.FotisonImas.name
ltx/gr_gr_cog/me.m03.d16:meMA.Ode5C1T.mode	@ltx/gr_gr_cog/miscellanea:misc.Mode8
ltx/gr_gr_cog/me.m03.d16:meMA.Ode5C1T.ode	@ltx/gr_gr_cog/miscellanea:misc.Ode5
ltx/gr_gr_cog/me.m03.d16:meMA.Ode5C1T.text	Ῥώμην τὴν ἡμῶν, περιβάλλουσα ἀσθένειαν, ἐν καιρῷ τῆς ἐγκρατείας Ἁγνή, κατὰ πολέμων, καὶ παθῶν ἡμᾶς ἐνίσχυσον.
ltx/gr_gr_cog/me.m03.d16:meMA.Ode6C11.greekmelody	@ltx/gr_gr_cog/he.h.m8:heHE.IlasthitiMoiSotir.greekname
ltx/gr_gr_cog/me.m03.d16:meMA.Ode6C11.incipit	Ἀπόλαυσιν ἀγαθῶν, καὶ μέθεξιν ἀκηράτου…
ltx/gr_gr_cog/me.m03.d16:meMA.Ode6C11.melody	@ltx/gr_gr_cog/he.h.m8:heHE.IlasthitiMoiSotir.name
ltx/gr_gr_cog/me.m03.d16:meMA.Ode6C11.mode	@ltx/gr_gr_cog/miscellanea:misc.Mode8
ltx/gr_gr_cog/me.m03.d16:meMA.Ode6C11.ode	@ltx/gr_gr_cog/miscellanea:misc.Ode6
ltx/gr_gr_cog/me.m03.d16:meMA.Ode6C11.text	Ἀπόλαυσιν ἀγαθῶν, καὶ μέθεξιν ἀκηράτου τρυφῆς, ἡ νηστεία προξενεῖ τοῖς ταύτης μετέχουσι, καὶ Χριστὸν δοξάζουσι, καθαρᾷ καρδίᾳ σωτηρίας μόνον πρόξενον.
ltx/gr_gr_cog/me.m03.d16:meMA.Ode6C12.incipit	Εὐπρέπειαν ὁρατήν, καὶ κοσμικὴν περιφάνειαν…
ltx/gr_gr_cog/me.m03.d16:meMA.Ode6C12.melody	@ltx/gr_gr_cog/he.h.m8:heHE.IlasthitiMoiSotir.name
ltx/gr_gr_cog/me.m03.d16:meMA.Ode6C12.mode	@ltx/gr_gr_cog/miscellanea:misc.Mode8
ltx/gr_gr_cog/me.m03.d16:meMA.Ode6C12.ode	@ltx/gr_gr_cog/miscellanea:misc.Ode6
ltx/gr_gr_cog/me.m03.d16:meMA.Ode6C12.text	Εὐπρέπειαν ὁρατήν, καὶ κοσμικὴν περιφάνειαν, ἐβδελύξω εὐσεβῶς, καὶ δόξης τῆς κρείττονος, καὶ πλούτου τοῦ μένοντος, ἐραστὴς ἐδείχθης, Ἀθλοφόρε παναοίδιμε.
ltx/gr_gr_cog/me.m03.d16:meMA.Ode6C13.incipit	Τὴν ζάλην τοῦ μοχθηροῦ, Σαβίνε…
ltx/gr_gr_cog/me.m03.d16:meMA.Ode6C13.melody	@ltx/gr_gr_cog/he.h.m8:heHE.IlasthitiMoiSotir.name
ltx/gr_gr_cog/me.m03.d16:meMA.Ode6C13.mode	@ltx/gr_gr_cog/miscellanea:misc.Mode8
ltx/gr_gr_cog/me.m03.d16:meMA.Ode6C13.ode	@ltx/gr_gr_cog/miscellanea:misc.Ode6
ltx/gr_gr_cog/me.m03.d16:meMA.Ode6C13.text	Τὴν ζάλην τοῦ μοχθηροῦ, Σαβίνε βίου κατέλιπες, εἰς ὅρμον δὲ τῆς Χριστοῦ κατήντησας πίστεως, διʼ ἧς τῆς ἀθλήσεως, τὸν πλοῦτον εἰς θεῖα, ταμεῖα ἐναπέθηκας.
ltx/gr_gr_cog/me.m03.d16:meMA.Ode6C1H.greekmelody	@ltx/gr_gr_cog/he.h.m8:heHE.IlasthitiMoiSotir.greekname
ltx/gr_gr_cog/me.m03.d16:meMA.Ode6C1H.incipit	@ltx/gr_gr_cog/he.h.m8:heHE.IlasthitiMoiSotir.incipit
ltx/gr_gr_cog/me.m03.d16:meMA.Ode6C1H.melody	@ltx/gr_gr_cog/he.h.m8:heHE.IlasthitiMoiSotir.melody
ltx/gr_gr_cog/me.m03.d16:meMA.Ode6C1H.mode	@ltx/gr_gr_cog/miscellanea:misc.Mode8
ltx/gr_gr_cog/me.m03.d16:meMA.Ode6C1H.ode	@ltx/gr_gr_cog/miscellanea:misc.Ode6
ltx/gr_gr_cog/me.m03.d16:meMA.Ode6C1H.text	@ltx/gr_gr_cog/he.h.m8:heHE.IlasthitiMoiSotir.text
ltx/gr_gr_cog/me.m03.d16:meMA.Ode6C1T.incipit	Γευσάμενοι τοῦ φυτοῦ, παρακοῇ οἱ…
ltx/gr_gr_cog/me.m03.d16:meMA.Ode6C1T.melody	@ltx/gr_gr_cog/he.h.m8:heHE.IlasthitiMoiSotir.name
ltx/gr_gr_cog/me.m03.d16:meMA.Ode6C1T.mode	@ltx/gr_gr_cog/miscellanea:misc.Mode8
ltx/gr_gr_cog/me.m03.d16:meMA.Ode6C1T.ode	@ltx/gr_gr_cog/miscellanea:misc.Ode6
ltx/gr_gr_cog/me.m03.d16:meMA.Ode6C1T.text	Γευσάμενοι τοῦ φυτοῦ, παρακοῇ οἱ Πρωτόπλαστοι, ἐξόριστοι τῆς τρυφῆς, γεγόνασιν Ἄχραντε, ἡμεῖς δὲ μετέχοντες, τοῦ ἐκ σοῦ τεχθέντος, ἐντρυφῶμεν ἀκηράτῳ ζωῇ.
ltx/gr_gr_cog/me.m03.d16:meMA.Ode7C11.greekmelody	@ltx/gr_gr_cog/he.h.m8:heHE.OiEkTisIoudaias.greekname
ltx/gr_gr_cog/me.m03.d16:meMA.Ode7C11.incipit	Τὴν ἀχλὺν τῶν ὀμμάτων, τῆς…
ltx/gr_gr_cog/me.m03.d16:meMA.Ode7C11.melody	@ltx/gr_gr_cog/he.h.m8:heHE.OiEkTisIoudaias.name
ltx/gr_gr_cog/me.m03.d16:meMA.Ode7C11.mode	@ltx/gr_gr_cog/miscellanea:misc.Mode8
ltx/gr_gr_cog/me.m03.d16:meMA.Ode7C11.ode	@ltx/gr_gr_cog/miscellanea:misc.Ode7
ltx/gr_gr_cog/me.m03.d16:meMA.Ode7C11.text	Τὴν ἀχλὺν τῶν ὀμμάτων, τῆς ψυχῆς, ἀφελόντες διὰ νηστείας τὸ φῶς, τὸ ἔνθεον τῇ πίστει, δεξώμεθα ἐν φόβῳ καὶ ἁγνείᾳ κραυγάζοντες· ὁ τῶν Πατέρων ἡμῶν, Θεός εὐλογητὸς εἶ.
ltx/gr_gr_cog/me.m03.d16:meMA.Ode7C12.incipit	Τῆς ψυχῆς τὸ ὡραῖον, τῷ…
ltx/gr_gr_cog/me.m03.d16:meMA.Ode7C12.melody	@ltx/gr_gr_cog/he.h.m8:heHE.OiEkTisIoudaias.name
ltx/gr_gr_cog/me.m03.d16:meMA.Ode7C12.mode	@ltx/gr_gr_cog/miscellanea:misc.Mode8
ltx/gr_gr_cog/me.m03.d16:meMA.Ode7C12.ode	@ltx/gr_gr_cog/miscellanea:misc.Ode7
ltx/gr_gr_cog/me.m03.d16:meMA.Ode7C12.text	Τῆς ψυχῆς τὸ ὡραῖον, τῷ τοῦ σώματος Μάρτυς, κάλλει ἐνέφηνας· φαιδρὸς γὰρ θεωρίαις, ἡδύς τε ἐν τοῖς λόγοις, ἀνεδείχθης καὶ ἔψαλλες· ὁ τῶν Πατέρων ἡμῶν, Θεός εὐλογητὸς εἶ.
ltx/gr_gr_cog/me.m03.d16:meMA.Ode7C13.incipit	Γενναιότητι Μάρτυς, τῆς ψυχῆς καὶ…
ltx/gr_gr_cog/me.m03.d16:meMA.Ode7C13.melody	@ltx/gr_gr_cog/he.h.m8:heHE.OiEkTisIoudaias.name
ltx/gr_gr_cog/me.m03.d16:meMA.Ode7C13.mode	@ltx/gr_gr_cog/miscellanea:misc.Mode8
ltx/gr_gr_cog/me.m03.d16:meMA.Ode7C13.ode	@ltx/gr_gr_cog/miscellanea:misc.Ode7
ltx/gr_gr_cog/me.m03.d16:meMA.Ode7C13.text	Γενναιότητι Μάρτυς, τῆς ψυχῆς καὶ ἀνδρείᾳ θράσος ἀντίπαλον, τυράννων ἀνομούντων, διήλεγξας Σαβίνε, καὶ Χριστῷ ἀνεκραύγαζες· ὁ τῶν Πατέρων ἡμῶν, Θεὸς εὐλογητός εἶ.
ltx/gr_gr_cog/me.m03.d16:meMA.Ode7C1H.greekmelody	@ltx/gr_gr_cog/he.h.m8:heHE.OiEkTisIoudaias.greekname
ltx/gr_gr_cog/me.m03.d16:meMA.Ode7C1H.incipit	@ltx/gr_gr_cog/he.h.m8:heHE.OiEkTisIoudaias.incipit
ltx/gr_gr_cog/me.m03.d16:meMA.Ode7C1H.melody	@ltx/gr_gr_cog/he.h.m8:heHE.OiEkTisIoudaias.melody
ltx/gr_gr_cog/me.m03.d16:meMA.Ode7C1H.mode	@ltx/gr_gr_cog/miscellanea:misc.Mode8
ltx/gr_gr_cog/me.m03.d16:meMA.Ode7C1H.ode	@ltx/gr_gr_cog/miscellanea:misc.Ode7
ltx/gr_gr_cog/me.m03.d16:meMA.Ode7C1H.text	@ltx/gr_gr_cog/he.h.m8:heHE.OiEkTisIoudaias.text
ltx/gr_gr_cog/me.m03.d16:meMA.Ode7C1T.incipit	Ἰδεῖν Θεοκυῆτορ, τοῦ Υἱοῦ καὶ…
ltx/gr_gr_cog/me.m03.d16:meMA.Ode7C1T.melody	@ltx/gr_gr_cog/he.h.m8:heHE.OiEkTisIoudaias.name
ltx/gr_gr_cog/me.m03.d16:meMA.Ode7C1T.mode	@ltx/gr_gr_cog/miscellanea:misc.Mode8
ltx/gr_gr_cog/me.m03.d16:meMA.Ode7C1T.ode	@ltx/gr_gr_cog/miscellanea:misc.Ode7
ltx/gr_gr_cog/me.m03.d16:meMA.Ode7C1T.text	Ἰδεῖν Θεοκυῆτορ, τοῦ Υἱοῦ καὶ Θεοῦ σου τὴν θείαν ἔγερσιν, νηστείᾳ καθαρθέντας, ἀξίωσον τοὺς πίστει, εὐλογοῦντας καὶ λέγοντας· ὁ τῶν Πατέρων ἡμῶν, Θεὸς εὐλογητός εἶ.
ltx/gr_gr_cog/me.m03.d16:meMA.Ode8C11.greekmelody	@ltx/gr_gr_cog/he.h.m8:heHE.TonVasileaTonOuranon.greekname
ltx/gr_gr_cog/me.m03.d16:meMA.Ode8C11.incipit	Τὸν Βασιλέα τῶν οὐρανῶν κοσμηθέντες…
ltx/gr_gr_cog/me.m03.d16:meMA.Ode8C11.melody	@ltx/gr_gr_cog/he.h.m8:heHE.TonVasileaTonOuranon.name
ltx/gr_gr_cog/me.m03.d16:meMA.Ode8C11.mode	@ltx/gr_gr_cog/miscellanea:misc.Mode8
ltx/gr_gr_cog/me.m03.d16:meMA.Ode8C11.ode	@ltx/gr_gr_cog/miscellanea:misc.Ode8
ltx/gr_gr_cog/me.m03.d16:meMA.Ode8C11.text	Τὸν Βασιλέα τῶν οὐρανῶν κοσμηθέντες, τὰς ψυχὰς νηστείᾳ καὶ δεήσει, πίστει ἀδιστάκτῳ, δεξώμεθα ἐνθέως.
ltx/gr_gr_cog/me.m03.d16:meMA.Ode8C12.incipit	Τοῦ Παρακλήτου ταῖς νοηταῖς Ἀθλοφόρε…
ltx/gr_gr_cog/me.m03.d16:meMA.Ode8C12.melody	@ltx/gr_gr_cog/he.h.m8:heHE.TonVasileaTonOuranon.name
ltx/gr_gr_cog/me.m03.d16:meMA.Ode8C12.mode	@ltx/gr_gr_cog/miscellanea:misc.Mode8
ltx/gr_gr_cog/me.m03.d16:meMA.Ode8C12.ode	@ltx/gr_gr_cog/miscellanea:misc.Ode8
ltx/gr_gr_cog/me.m03.d16:meMA.Ode8C12.text	Τοῦ Παρακλήτου ταῖς νοηταῖς Ἀθλοφόρε, ἀρδευθεὶς ῥοαῖς, καρποὺς προσῆξας, τοὺς τοῦ Μαρτυρίου, Σαβίνε τῷ Κυρίῳ.
ltx/gr_gr_cog/me.m03.d16:meMA.Ode8C13.incipit	Οἱ τῶν αἱμάτων σοι ποταμοὶ…
ltx/gr_gr_cog/me.m03.d16:meMA.Ode8C13.melody	@ltx/gr_gr_cog/he.h.m8:heHE.TonVasileaTonOuranon.name
ltx/gr_gr_cog/me.m03.d16:meMA.Ode8C13.mode	@ltx/gr_gr_cog/miscellanea:misc.Mode8
ltx/gr_gr_cog/me.m03.d16:meMA.Ode8C13.ode	@ltx/gr_gr_cog/miscellanea:misc.Ode8
ltx/gr_gr_cog/me.m03.d16:meMA.Ode8C13.text	Οἱ τῶν αἱμάτων σοι ποταμοὶ πλημμυροῦντες, ἐπὶ γῆς Σαβίνε ἰαμάτων, νάματα τοῖς πᾶσι, προχέουσιν ἀνθρώποις.
ltx/gr_gr_cog/me.m03.d16:meMA.Ode8C1H.greekmelody	@ltx/gr_gr_cog/he.h.m8:heHE.TonVasileaTonOuranon.greekname
ltx/gr_gr_cog/me.m03.d16:meMA.Ode8C1H.incipit	@ltx/gr_gr_cog/he.h.m8:heHE.TonVasileaTonOuranon.incipit
ltx/gr_gr_cog/me.m03.d16:meMA.Ode8C1H.melody	@ltx/gr_gr_cog/he.h.m8:heHE.TonVasileaTonOuranon.melody
ltx/gr_gr_cog/me.m03.d16:meMA.Ode8C1H.mode	@ltx/gr_gr_cog/miscellanea:misc.Mode8
ltx/gr_gr_cog/me.m03.d16:meMA.Ode8C1H.ode	@ltx/gr_gr_cog/miscellanea:misc.Ode8
ltx/gr_gr_cog/me.m03.d16:meMA.Ode8C1H.text	@ltx/gr_gr_cog/he.h.m8:heHE.TonVasileaTonOuranon.text
ltx/gr_gr_cog/me.m03.d16:meMA.Ode8C1T.incipit	Οἱ ἐγκαυχώμενοι ἐπὶ σοὶ Θεοτόκε…
ltx/gr_gr_cog/me.m03.d16:meMA.Ode8C1T.melody	@ltx/gr_gr_cog/he.h.m8:heHE.TonVasileaTonOuranon.name
ltx/gr_gr_cog/me.m03.d16:meMA.Ode8C1T.mode	@ltx/gr_gr_cog/miscellanea:misc.Mode8
ltx/gr_gr_cog/me.m03.d16:meMA.Ode8C1T.ode	@ltx/gr_gr_cog/miscellanea:misc.Ode8
ltx/gr_gr_cog/me.m03.d16:meMA.Ode8C1T.text	Οἱ ἐγκαυχώμενοι ἐπὶ σοὶ Θεοτόκε, τύχοιμεν τῆς δόξης τοῦ Υἱοῦ σου, καὶ ταῖς σαῖς ἱκεσίαις, ἐν τῇ αὐτοῦ ἐγέρσει.
ltx/gr_gr_cog/me.m03.d16:meMA.Ode9C11.greekmelody	@ltx/gr_gr_cog/he.h.m8:heHE.KyriosTheotokon.greekname
ltx/gr_gr_cog/me.m03.d16:meMA.Ode9C11.incipit	Τὰ πάθη χαλινοῦντες, διὰ ἐγκρατείας…
ltx/gr_gr_cog/me.m03.d16:meMA.Ode9C11.melody	@ltx/gr_gr_cog/he.h.m8:heHE.KyriosTheotokon.name
ltx/gr_gr_cog/me.m03.d16:meMA.Ode9C11.mode	@ltx/gr_gr_cog/miscellanea:misc.Mode8
ltx/gr_gr_cog/me.m03.d16:meMA.Ode9C11.ode	@ltx/gr_gr_cog/miscellanea:misc.Ode9
ltx/gr_gr_cog/me.m03.d16:meMA.Ode9C11.text	Τὰ πάθη χαλινοῦντες, διὰ ἐγκρατείας, καθυποτάξωμεν νοῒ καθαρῷ, ἵνα τῷ πάντων Δεσπότῃ συμβασιλεύσωμεν.
ltx/gr_gr_cog/me.m03.d16:meMA.Ode9C12.incipit	Κρατήσας Ἀθλοφόρε, νοητῶν πολέμων, καὶ…
ltx/gr_gr_cog/me.m03.d16:meMA.Ode9C12.melody	@ltx/gr_gr_cog/he.h.m8:heHE.KyriosTheotokon.name
ltx/gr_gr_cog/me.m03.d16:meMA.Ode9C12.mode	@ltx/gr_gr_cog/miscellanea:misc.Mode8
ltx/gr_gr_cog/me.m03.d16:meMA.Ode9C12.ode	@ltx/gr_gr_cog/miscellanea:misc.Ode9
ltx/gr_gr_cog/me.m03.d16:meMA.Ode9C12.text	Κρατήσας Ἀθλοφόρε, νοητῶν πολέμων, καὶ ὑποτάξας τυράννους γενναίᾳ ψυχῇ, τῷ Ποιητῇ τῶν ἁπάντων συμβασιλεύεις Χριστῷ.
ltx/gr_gr_cog/me.m03.d16:meMA.Ode9C13.incipit	Ἀπάρας πρὸς τὸν πόλον, ἐκ…
ltx/gr_gr_cog/me.m03.d16:meMA.Ode9C13.melody	@ltx/gr_gr_cog/he.h.m8:heHE.KyriosTheotokon.name
ltx/gr_gr_cog/me.m03.d16:meMA.Ode9C13.mode	@ltx/gr_gr_cog/miscellanea:misc.Mode8
ltx/gr_gr_cog/me.m03.d16:meMA.Ode9C13.ode	@ltx/gr_gr_cog/miscellanea:misc.Ode9
ltx/gr_gr_cog/me.m03.d16:meMA.Ode9C13.text	Ἀπάρας πρὸς τὸν πόλον, ἐκ τῆς γῆς Σαβίνε, ὑπὲρ ἡμῶν τῶν τιμώντων σε πρέσβευε, τῷ Ποιητῇ τῶν ἁπάντων καὶ στεφοδότῃ σου.
ltx/gr_gr_cog/me.m03.d16:meMA.Ode9C1H.greekmelody	@ltx/gr_gr_cog/he.h.m8:heHE.KyriosTheotokon.greekname
ltx/gr_gr_cog/me.m03.d16:meMA.Ode9C1H.incipit	@ltx/gr_gr_cog/he.h.m8:heHE.KyriosTheotokon.incipit
ltx/gr_gr_cog/me.m03.d16:meMA.Ode9C1H.melody	@ltx/gr_gr_cog/he.h.m8:heHE.KyriosTheotokon.melody
ltx/gr_gr_cog/me.m03.d16:meMA.Ode9C1H.mode	@ltx/gr_gr_cog/miscellanea:misc.Mode8
ltx/gr_gr_cog/me.m03.d16:meMA.Ode9C1H.ode	@ltx/gr_gr_cog/miscellanea:misc.Ode9
ltx/gr_gr_cog/me.m03.d16:meMA.Ode9C1H.text	@ltx/gr_gr_cog/he.h.m8:heHE.KyriosTheotokon.text
ltx/gr_gr_cog/me.m03.d16:meMA.Ode9C1T.incipit	Ὑπάρχεις Θεοτόκε, δόξα τῶν σῶν…
ltx/gr_gr_cog/me.m03.d16:meMA.Ode9C1T.melody	@ltx/gr_gr_cog/he.h.m8:heHE.KyriosTheotokon.name
ltx/gr_gr_cog/me.m03.d16:meMA.Ode9C1T.mode	@ltx/gr_gr_cog/miscellanea:misc.Mode8
ltx/gr_gr_cog/me.m03.d16:meMA.Ode9C1T.ode	@ltx/gr_gr_cog/miscellanea:misc.Ode9
ltx/gr_gr_cog/me.m03.d16:meMA.Ode9C1T.text	Ὑπάρχεις Θεοτόκε, δόξα τῶν σῶν δούλων, καὶ παῤῥησία καὶ σθένος καὶ καύχημα, καὶ ἀσφαλὴς ἀπαρτία τῆς προσδοκίας μου.
ltx/gr_gr_cog/me.m03.d16:meVE.Apolytikion1ger.greekmelody	@ltx/gr_gr_cog/he.a.m1:heAU.TonTafonSouSotir.greekname
ltx/gr_gr_cog/me.m03.d16:meVE.Apolytikion1ger.incipit	Κηρύξας εὐσεβῶς, ἀσεβῶν ἐναντίον, τῶν…
ltx/gr_gr_cog/me.m03.d16:meVE.Apolytikion1ger.melody	@ltx/gr_gr_cog/he.a.m1:heAU.TonTafonSouSotir.name
ltx/gr_gr_cog/me.m03.d16:meVE.Apolytikion1ger.mode	@ltx/gr_gr_cog/miscellanea:misc.Mode1
ltx/gr_gr_cog/me.m03.d16:meVE.Apolytikion1ger.poet	@ltx/gr_gr_cog/poets:po.Gerasimou
ltx/gr_gr_cog/me.m03.d16:meVE.Apolytikion1ger.text	Κηρύξας εὐσεβῶς, ἀσεβῶν ἐναντίον, τῶν πάντων Ποιητήν, σαρκωθέντα ἀτρέπτως, Σαβῖνε παμμακάριστε, ἱερῶς ἠνδραγάθησας· ὅθεν ἔφθασας, πρὸς ἀφθαρσίας χειρμάῤῥουν, τέλος ἅγιον, ἐν ποταμῷ δεδεγμένος· διὸ εὐφημοῦμέν σε.
ltx/gr_gr_cog/me.m03.d16:meVE.Apolytikion2ger.greekmelody	@ltx/gr_gr_cog/he.a.m1:heAU.TisErimouPolitis.greekname
ltx/gr_gr_cog/me.m03.d16:meVE.Apolytikion2ger.incipit	Τῆς Νικαίας τὸν γόνον καὶ…
ltx/gr_gr_cog/me.m03.d16:meVE.Apolytikion2ger.melody	@ltx/gr_gr_cog/he.a.m1:heAU.TisErimouPolitis.name
ltx/gr_gr_cog/me.m03.d16:meVE.Apolytikion2ger.mode	@ltx/gr_gr_cog/miscellanea:misc.Mode1
ltx/gr_gr_cog/me.m03.d16:meVE.Apolytikion2ger.poet	@ltx/gr_gr_cog/poets:po.Gerasimou
ltx/gr_gr_cog/me.m03.d16:meVE.Apolytikion2ger.text	Τῆς Νικαίας τὸν γόνον καὶ τῆς Πάτμου τὸ καύχημα, καὶ τῶν Μοναζόντων τὸ κλέος, θεοφόρον Χριστόδουλον, τιμήσωμεν ἐν ὕμνοις ἀδελφοί, τὸ σκῆνος προσπτυσσόμενοι αὐτοῦ, ἵνα λάβωμεν τὴν ἴασιν τῶν ψυχῶν, καὶ τῶν σωμάτων κράζοντες· δόξα τῷ δεδωκότι σοι ἰσχύν, δόξα τῷ σὲ στεφανώσαντι, δόξα τῷ ἐνεργοῦντι διὰ σοῦ, πᾶσιν, ἰάματα.
ltx/gr_gr_cog/me.m03.d16:meVE.SticStavrotheotokion.greekmelody	@ltx/gr_gr_cog/he.a.m8:heAU.KyrieEiKaiKritirio.greekname
ltx/gr_gr_cog/me.m03.d16:meVE.SticStavrotheotokion.incipit	Κύριε, ὅτε σε ὁ ἥλιος…
ltx/gr_gr_cog/me.m03.d16:meVE.SticStavrotheotokion.melody	@ltx/gr_gr_cog/he.a.m8:heAU.KyrieEiKaiKritirio.name
ltx/gr_gr_cog/me.m03.d16:meVE.SticStavrotheotokion.mode	@ltx/gr_gr_cog/miscellanea:misc.Mode8
ltx/gr_gr_cog/me.m03.d16:meVE.SticStavrotheotokion.text	Κύριε, ὅτε σε ὁ ἥλιος εἶδεν, ἐπὶ ξύλου κρεμάμενον, Ἥλιε τῆς Δικαιοσύνης, τὰς ἀκτῖνας ἐναπέκρυψε, καὶ ἡ σελήνη τὸ φῶς, εἰς σκότος μετεβάλετο, ἡ δὲ πανάμωμός σου Μήτηρ, τὰ σπλάγχνα διετέτρωτο.
ltx/gr_gr_cog/me.m03.d16:meVE.SticTheotokion.greekmelody	@ltx/gr_gr_cog/he.a.m8:heAU.KyrieEiKaiKritirio.greekname
ltx/gr_gr_cog/me.m03.d16:meVE.SticTheotokion.incipit	Κύριε, δέξαι σῆς Μητρὸς ἱκεσίας…
ltx/gr_gr_cog/me.m03.d16:meVE.SticTheotokion.melody	@ltx/gr_gr_cog/he.a.m8:heAU.KyrieEiKaiKritirio.name
ltx/gr_gr_cog/me.m03.d16:meVE.SticTheotokion.mode	@ltx/gr_gr_cog/miscellanea:misc.Mode8
ltx/gr_gr_cog/me.m03.d16:meVE.SticTheotokion.text	Κύριε, δέξαι σῆς Μητρὸς ἱκεσίας, καὶ σπλαγχνισθεὶς ἐπικάμφθητι, σῶσον ἅπαν γένος ἀνθρώπων, τῶν δοξαζόντων τὸ κράτος σου, καὶ ἐκλύτρωσαι ἡμᾶς, τῆς πλάνης τοῦ ἀλάστορος, καὶ ἐλέησον ἐλεῆμον, καὶ σφαλμάτων δίδου ἄφεσιν.
ltx/gr_gr_cog/me.m03.d16:meVE.Stichera01.greekmelody	@ltx/gr_gr_cog/he.a.m8:heAU.KyrieEiKaiKritirio.greekname
ltx/gr_gr_cog/me.m03.d16:meVE.Stichera01.incipit	Κύριε, σὺ τὸ ἀσθενὲς τῆς…
ltx/gr_gr_cog/me.m03.d16:meVE.Stichera01.melody	@ltx/gr_gr_cog/he.a.m8:heAU.KyrieEiKaiKritirio.name
ltx/gr_gr_cog/me.m03.d16:meVE.Stichera01.mode	@ltx/gr_gr_cog/miscellanea:misc.Mode8
ltx/gr_gr_cog/me.m03.d16:meVE.Stichera01.text	Κύριε, σὺ τὸ ἀσθενὲς τῆς ἀνθρώπων, ὡς ἐπιστάμενος φύσεως, ζῶσον ἐν καιρῷ τῆς νηστείας, ἰσχὺν ἡμᾶς καὶ κραταίωσον, κατὰ παθῶν καὶ ἐχθρῶν, νοουμένων ὡς εὔσπλαγχνος, ἀπαθείᾳ ψυχῆς τειχίσας, τοῦ δοξάζειν σου τὸ ἔλεος.
ltx/gr_gr_cog/me.m03.d16:meVE.Stichera02.incipit	Κύριε, σὺ τὸν Ἀθλοφόρον ἐκ…
ltx/gr_gr_cog/me.m03.d16:meVE.Stichera02.melody	@ltx/gr_gr_cog/he.a.m8:heAU.KyrieEiKaiKritirio.name
ltx/gr_gr_cog/me.m03.d16:meVE.Stichera02.mode	@ltx/gr_gr_cog/miscellanea:misc.Mode8
ltx/gr_gr_cog/me.m03.d16:meVE.Stichera02.text	Κύριε, σὺ τὸν Ἀθλοφόρον ἐκ σκότους, πρὸς φῶς τῆς θείας σκηνώσεως τῇ τοῦ Παρακλήτου ἐμπνεύσει, ὡς ἀγαθὸς μετεποίησας, καὶ κραταιὸν κατʼ ἐχθρῶν, ἀνέδειξας ὁπλίτην σου· διὰ τοῦτο ἀριστεύων, ἐδόξασέ σε φιλάνθρωπε.
ltx/gr_gr_cog/me.m03.d16:meVE.Stichera03.incipit	Κύριε, σὺ ταῖς τῶν Μαρτύρων…
ltx/gr_gr_cog/me.m03.d16:meVE.Stichera03.melody	@ltx/gr_gr_cog/he.a.m8:heAU.KyrieEiKaiKritirio.name
ltx/gr_gr_cog/me.m03.d16:meVE.Stichera03.mode	@ltx/gr_gr_cog/miscellanea:misc.Mode8
ltx/gr_gr_cog/me.m03.d16:meVE.Stichera03.text	Κύριε, σὺ ταῖς τῶν Μαρτύρων πρεσβείαις, ὡς ἀγαθὸς καὶ φιλάνθρωπος, φύλαξον ἡμᾶς ἐν τῇ σκέπῃ τῶν νοουμένων πτερύγων σου, καὶ καθαρῶς καὶ ἁγνῶς, ἀξίωσον θεάσασθαι, τὴν τριήμερόν σου Λόγε, ἐξανάστασιν ὡς εὔσπλαγχνος.
