ltx/gr_gr_cog/tr.d040:trCO.header	(Μέγα)
ltx/gr_gr_cog/tr.d040:trDA.commemoration.full	
ltx/gr_gr_cog/tr.d040:trDA.commemoration.short	Πέμπτη τῆς Γʹ Ἑβδομάδος
ltx/gr_gr_cog/tr.d040:trDA.insert1	
ltx/gr_gr_cog/tr.d040:trDA.insert2	
ltx/gr_gr_cog/tr.d040:trDA.note	
ltx/gr_gr_cog/tr.d040:trDA.title	
ltx/gr_gr_cog/tr.d040:trHO.commemorations	
ltx/gr_gr_cog/tr.d040:trHO.daytitle	
ltx/gr_gr_cog/tr.d040:trHO.description1	
ltx/gr_gr_cog/tr.d040:trHO.description2	
ltx/gr_gr_cog/tr.d040:trHO.note1	
ltx/gr_gr_cog/tr.d040:trHO.note2	
ltx/gr_gr_cog/tr.d040:trMA.AposIdiomelon1.incipit	Τῆς υἱοθεσίας ἐκπεσὼν ὁ ἄσωτος…
ltx/gr_gr_cog/tr.d040:trMA.AposIdiomelon1.melody	@ltx/gr_gr_cog/miscellanea:misc.Idiomelon
ltx/gr_gr_cog/tr.d040:trMA.AposIdiomelon1.mode	@ltx/gr_gr_cog/miscellanea:misc.Mode6
ltx/gr_gr_cog/tr.d040:trMA.AposIdiomelon1.text	Τῆς υἱοθεσίας ἐκπεσὼν ὁ ἄσωτος ἐγώ, δουλοπρεπῶς χοίροις συνδιαιτώμενος, καὶ μηδὲ τῆς αὐτῶν τροφῆς χορταζόμενος, ἐπανέρχομαι πρὸς σέ, τὸν Πατέρα τὸν εὔσπλαγχνον· ὅθεν ἐξῆλθον κακῶς, ὑποστρέφω καλῶς, ἐν μετανοίᾳ κραυγάζων· Ἥμαρτον εἰς τὸν οὐρανόν, καὶ ἐνώπιόν σου Πάτερ· Παράσχου μοι ἐν ἐπιστροφῇ τὸ μέγα ἔλεος.
ltx/gr_gr_cog/tr.d040:trMA.AposMartyric.incipit	@ltx/gr_gr_cog/oc.m6.d5:ocMA.Aposticha3.incipit
ltx/gr_gr_cog/tr.d040:trMA.AposMartyric.melody	
ltx/gr_gr_cog/tr.d040:trMA.AposMartyric.mode	@ltx/gr_gr_cog/miscellanea:misc.Mode6
ltx/gr_gr_cog/tr.d040:trMA.AposMartyric.text	@ltx/gr_gr_cog/oc.m6.d5:ocMA.Aposticha3.text
ltx/gr_gr_cog/tr.d040:trMA.AposTheotokion.incipit	@ltx/gr_gr_cog/oc.m6.d5:ocVE.AposTheotokion.incipit
ltx/gr_gr_cog/tr.d040:trMA.AposTheotokion.melody	
ltx/gr_gr_cog/tr.d040:trMA.AposTheotokion.mode	@ltx/gr_gr_cog/miscellanea:misc.Mode6
ltx/gr_gr_cog/tr.d040:trMA.AposTheotokion.text	@ltx/gr_gr_cog/oc.m6.d5:ocVE.AposTheotokion.text
ltx/gr_gr_cog/tr.d040:trMA.C1.poet	@ltx/gr_gr_cog/poets:po.Iosif
ltx/gr_gr_cog/tr.d040:trMA.C2.poet	@ltx/gr_gr_cog/poets:po.Theodorou
ltx/gr_gr_cog/tr.d040:trMA.Kathisma21.greekmelody	@ltx/gr_gr_cog/he.a.m6:heAU.ElpisTouKosmouAgathi.greekname
ltx/gr_gr_cog/tr.d040:trMA.Kathisma21.incipit	Φωστῆρες κόσμου ἀπλανεῖς, Μαθηταὶ τοῦ…
ltx/gr_gr_cog/tr.d040:trMA.Kathisma21.melody	@ltx/gr_gr_cog/he.a.m6:heAU.ElpisTouKosmouAgathi.name
ltx/gr_gr_cog/tr.d040:trMA.Kathisma21.mode	@ltx/gr_gr_cog/miscellanea:misc.Mode6
ltx/gr_gr_cog/tr.d040:trMA.Kathisma21.text	Φωστῆρες κόσμου ἀπλανεῖς, Μαθηταὶ τοῦ Σωτῆρος, φωτίσατέ μου τὴν ψυχήν, ἁμαρτίᾳ τυφλώττουσαν, καὶ δείξατε θείας ἡμέρας κοινωνόν, φυλάττοντα τὰς σωτηρίους ἐντολάς, καὶ σκότους με λυτρώσατε ἐκεῖ τοῦ ἀφεγγοῦς, ὅπως ἡμᾶς δοξάζω.
ltx/gr_gr_cog/tr.d040:trMA.Kathisma22.greekmelody	@ltx/gr_gr_cog/he.a.m6:heAU.ElpisTouKosmouAgathi.greekname
ltx/gr_gr_cog/tr.d040:trMA.Kathisma22.incipit	Ἁγία Δέσποινα Χριστοῦ, τοῦ Θεοῦ…
ltx/gr_gr_cog/tr.d040:trMA.Kathisma22.melody	@ltx/gr_gr_cog/he.a.m6:heAU.ElpisTouKosmouAgathi.name
ltx/gr_gr_cog/tr.d040:trMA.Kathisma22.mode	@ltx/gr_gr_cog/miscellanea:misc.Mode6
ltx/gr_gr_cog/tr.d040:trMA.Kathisma22.text	Ἁγία Δέσποινα Χριστοῦ, τοῦ Θεοῦ ἡμῶν Μῆτερ, ὡς τῶν ἁπάντων ποιητὴν ἀποῤῥήτως τεκοῦσα, ἱκέτευε σὺν Ἀποστόλοις Ἱεροῖς, ἑκάστοτε τὴν ἀγαθότητα αὐτοῦ, παθῶν ἡμᾶς λυτρώσασθαι, καὶ ἄφεσιν ἡμῖν, δοῦναι ἁμαρτημάτων.
ltx/gr_gr_cog/tr.d040:trMA.Kathisma31.greekmelody	@ltx/gr_gr_cog/he.a.m6:heAU.AngelikaiDynameis.greekname
ltx/gr_gr_cog/tr.d040:trMA.Kathisma31.incipit	Κοσμολαμπεῖς φωστῆρες, θεῖοι Ἀπόστολοι, καταφωτίσατε…
ltx/gr_gr_cog/tr.d040:trMA.Kathisma31.melody	@ltx/gr_gr_cog/he.a.m6:heAU.AngelikaiDynameis.name
ltx/gr_gr_cog/tr.d040:trMA.Kathisma31.mode	@ltx/gr_gr_cog/miscellanea:misc.Mode6
ltx/gr_gr_cog/tr.d040:trMA.Kathisma31.text	Κοσμολαμπεῖς φωστῆρες, θεῖοι Ἀπόστολοι, καταφωτίσατε τοὺς ὑμνῳδοὺς ὑμῶν, ἀμείβοντες τὸν χρόνον τῆς Νηστείας, ἀξίως αἰτούμενοι, πάντας θεάσασθαι, τὸ ξύλον τοῦ ζωηφόρου Σταυροῦ, καὶ ἀσπάσασθαι ἀῤῥύποις χείλεσι, καὶ ὀφθαλμοῖς, ἐκβοῶντας ψαλμικῶς· Κύριε δόξα σοι.
ltx/gr_gr_cog/tr.d040:trMA.Kathisma32.greekmelody	@ltx/gr_gr_cog/he.a.m6:heAU.ElpisTouKosmouAgathi.greekname
ltx/gr_gr_cog/tr.d040:trMA.Kathisma32.incipit	@ltx/gr_gr_cog/he.a.m6:heAU.ElpisTouKosmouAgathi.incipit
ltx/gr_gr_cog/tr.d040:trMA.Kathisma32.melody	@ltx/gr_gr_cog/he.a.m6:heAU.ElpisTouKosmouAgathi.melody
ltx/gr_gr_cog/tr.d040:trMA.Kathisma32.mode	@ltx/gr_gr_cog/miscellanea:misc.Mode6
ltx/gr_gr_cog/tr.d040:trMA.Kathisma32.text	@ltx/gr_gr_cog/he.a.m6:heAU.ElpisTouKosmouAgathi.text
ltx/gr_gr_cog/tr.d040:trMA.Ode4C11.greekmelody	@ltx/gr_gr_cog/he.h.m6:heHE.ChristosMouDynamis.greekname
ltx/gr_gr_cog/tr.d040:trMA.Ode4C11.incipit	Νηστείαν δάκρυα, εὐχὰς συμπάθειαν, εὐκατάνυκτον…
ltx/gr_gr_cog/tr.d040:trMA.Ode4C11.melody	@ltx/gr_gr_cog/he.h.m6:heHE.ChristosMouDynamis.name
ltx/gr_gr_cog/tr.d040:trMA.Ode4C11.mode	@ltx/gr_gr_cog/miscellanea:misc.Mode6
ltx/gr_gr_cog/tr.d040:trMA.Ode4C11.ode	@ltx/gr_gr_cog/miscellanea:misc.Ode4
ltx/gr_gr_cog/tr.d040:trMA.Ode4C11.text	Νηστείαν δάκρυα, εὐχὰς συμπάθειαν, εὐκατάνυκτον ἦθος, γνώμην ὀρθήν, βίου καθαρότητα, ἐπιδειξώμεθα πιστοί, ὅπως δόξης ἀπολαύσωμεν.
ltx/gr_gr_cog/tr.d040:trMA.Ode4C12.incipit	Φωστῆρες φαίνοντες, τῷ στερεώματι, τῆς…
ltx/gr_gr_cog/tr.d040:trMA.Ode4C12.melody	@ltx/gr_gr_cog/he.h.m6:heHE.ChristosMouDynamis.name
ltx/gr_gr_cog/tr.d040:trMA.Ode4C12.mode	@ltx/gr_gr_cog/miscellanea:misc.Mode6
ltx/gr_gr_cog/tr.d040:trMA.Ode4C12.ode	@ltx/gr_gr_cog/miscellanea:misc.Ode4
ltx/gr_gr_cog/tr.d040:trMA.Ode4C12.text	Φωστῆρες φαίνοντες, τῷ στερεώματι, τῆς σεπτῆς Ἐκκλησίας περιφανῶς, ὤφθητε Ἀπόστολοι· διὸ φωτίσατε ἡμῶν, τὰς καρδίας θείῳ Πνεύματι.
ltx/gr_gr_cog/tr.d040:trMA.Ode4C13.incipit	Ὡς θεῖοι ἄνθρακες, προσαναπτόμενοι, τῷ…
ltx/gr_gr_cog/tr.d040:trMA.Ode4C13.melody	@ltx/gr_gr_cog/he.h.m6:heHE.ChristosMouDynamis.name
ltx/gr_gr_cog/tr.d040:trMA.Ode4C13.mode	@ltx/gr_gr_cog/miscellanea:misc.Mode6
ltx/gr_gr_cog/tr.d040:trMA.Ode4C13.ode	@ltx/gr_gr_cog/miscellanea:misc.Ode4
ltx/gr_gr_cog/tr.d040:trMA.Ode4C13.text	Ὡς θεῖοι ἄνθρακες, προσαναπτόμενοι, τῷ πυρὶ τῷ ἀΰλῳ τὰς ἐμπαθεῖς, ὕλας καταφλέξατε, τῶν καρδιῶν ἡμῶν σοφοί, τοῦ Θεοῦ ἡμῶν Ἀπόστολοι.
ltx/gr_gr_cog/tr.d040:trMA.Ode4C1T.incipit	Λυχνία ἄσβεστος, νυμφὼν ὁλόφωτε, Σεραφὶμ…
ltx/gr_gr_cog/tr.d040:trMA.Ode4C1T.melody	@ltx/gr_gr_cog/he.h.m6:heHE.ChristosMouDynamis.name
ltx/gr_gr_cog/tr.d040:trMA.Ode4C1T.mode	@ltx/gr_gr_cog/miscellanea:misc.Mode6
ltx/gr_gr_cog/tr.d040:trMA.Ode4C1T.ode	@ltx/gr_gr_cog/miscellanea:misc.Ode4
ltx/gr_gr_cog/tr.d040:trMA.Ode4C1T.text	Λυχνία ἄσβεστος, νυμφὼν ὁλόφωτε, Σεραφὶμ ὑπερτέρα καὶ Χερουβίμ, ὄχημα Πανάμωμε, ἁμαρτιῶν με χαλεπῶν, καὶ κινδύνων ἐλευθέρωσον.
ltx/gr_gr_cog/tr.d040:trMA.Ode4C21.greekmelody	@ltx/gr_gr_cog/he.h.m6:heHE.AkikoenOProfitis.greekname
ltx/gr_gr_cog/tr.d040:trMA.Ode4C21.incipit	Λαμπτῆρες θεοφανείας, Ἀπόστολοι τοῦ Σωτῆρος…
ltx/gr_gr_cog/tr.d040:trMA.Ode4C21.melody	@ltx/gr_gr_cog/he.h.m6:heHE.AkikoenOProfitis.name
ltx/gr_gr_cog/tr.d040:trMA.Ode4C21.mode	@ltx/gr_gr_cog/miscellanea:misc.Mode6
ltx/gr_gr_cog/tr.d040:trMA.Ode4C21.ode	@ltx/gr_gr_cog/miscellanea:misc.Ode4
ltx/gr_gr_cog/tr.d040:trMA.Ode4C21.text	Λαμπτῆρες θεοφανείας, Ἀπόστολοι τοῦ Σωτῆρος ἀναδειχθέντες, τῆς ἀγνοίας τὴν νύκτα ἐλύσατε, καὶ τὴν Ἐκκλησίαν αἰθριάσαντες φωτίζετε τὴν Οἰκουμένην ταῖς πυριφθόγγοις, θείαις διδαχαῖς ὑμῶν.
ltx/gr_gr_cog/tr.d040:trMA.Ode4C22.incipit	Τὸν Κόσμον διαδραμόντες, ἄλλος οὖν…
ltx/gr_gr_cog/tr.d040:trMA.Ode4C22.melody	@ltx/gr_gr_cog/he.h.m6:heHE.AkikoenOProfitis.name
ltx/gr_gr_cog/tr.d040:trMA.Ode4C22.mode	@ltx/gr_gr_cog/miscellanea:misc.Mode6
ltx/gr_gr_cog/tr.d040:trMA.Ode4C22.ode	@ltx/gr_gr_cog/miscellanea:misc.Ode4
ltx/gr_gr_cog/tr.d040:trMA.Ode4C22.text	Τὸν Κόσμον διαδραμόντες, ἄλλος οὖν κατʼ ἄλλο μέρος, εἰς μίαν πίστιν, πάντας συνηθροίσατε Ἀπόστολοι, καὶ μεταλαχόντες τὰ οὐράνια, χορεύετε, Χριστὸν ἀπαύστως ἐκδυσωποῦντες, τοῦ σωθῆναι πάντας ἡμᾶς.
ltx/gr_gr_cog/tr.d040:trMA.Ode4C2A1.incipit	Πρεσβείαις ὑμῶν ἁγίαις, Ἀπόστολοι τοῦ…
ltx/gr_gr_cog/tr.d040:trMA.Ode4C2A1.melody	@ltx/gr_gr_cog/he.h.m6:heHE.AkikoenOProfitis.name
ltx/gr_gr_cog/tr.d040:trMA.Ode4C2A1.mode	@ltx/gr_gr_cog/miscellanea:misc.Mode6
ltx/gr_gr_cog/tr.d040:trMA.Ode4C2A1.ode	@ltx/gr_gr_cog/miscellanea:misc.Ode4
ltx/gr_gr_cog/tr.d040:trMA.Ode4C2A1.text	Πρεσβείαις ὑμῶν ἁγίαις, Ἀπόστολοι τοῦ Κυρίου ἀξιωθῶμεν, τὸν ζωοποιὸν Σταυρὸν προσπτύξασθαι, ἁγνοῖς καὶ τοῖς χείλεσι καὶ ὄμμασι, προκείμενον τοῖς ἐν τῷ Κόσμῳ, καὶ ὑπὸ πάντων καταπροσκυνούμενον.
ltx/gr_gr_cog/tr.d040:trMA.Ode4C2H.greekmelody	@ltx/gr_gr_cog/he.h.m6:heHE.AkikoenOProfitis.greekname
ltx/gr_gr_cog/tr.d040:trMA.Ode4C2H.incipit	@ltx/gr_gr_cog/he.h.m6:heHE.AkikoenOProfitis.incipit
ltx/gr_gr_cog/tr.d040:trMA.Ode4C2H.melody	@ltx/gr_gr_cog/he.h.m6:heHE.AkikoenOProfitis.melody
ltx/gr_gr_cog/tr.d040:trMA.Ode4C2H.mode	@ltx/gr_gr_cog/miscellanea:misc.Mode6
ltx/gr_gr_cog/tr.d040:trMA.Ode4C2H.ode	@ltx/gr_gr_cog/miscellanea:misc.Ode4
ltx/gr_gr_cog/tr.d040:trMA.Ode4C2H.text	@ltx/gr_gr_cog/he.h.m6:heHE.AkikoenOProfitis.text
ltx/gr_gr_cog/tr.d040:trMA.Ode4C2T.incipit	Παρθένος βρέφος τεκοῦσα, καὶ τὴν…
ltx/gr_gr_cog/tr.d040:trMA.Ode4C2T.melody	@ltx/gr_gr_cog/he.h.m6:heHE.AkikoenOProfitis.name
ltx/gr_gr_cog/tr.d040:trMA.Ode4C2T.mode	@ltx/gr_gr_cog/miscellanea:misc.Mode6
ltx/gr_gr_cog/tr.d040:trMA.Ode4C2T.ode	@ltx/gr_gr_cog/miscellanea:misc.Ode4
ltx/gr_gr_cog/tr.d040:trMA.Ode4C2T.text	Παρθένος βρέφος τεκοῦσα, καὶ τὴν ἁγνείαν φρουροῦσα, σεμνὴ σὺ ὤφθης, τὸν Θεὸν γεννήσασα καὶ ἄνθρωπον, ἕνα τὸν αὐτὸν ἐν ἑκατέρᾳ μορφῇ, τὸ θαῦμα σου Παρθενομῆτορ, ἐκπλήττει πᾶσαν, ἀκοὴν καὶ ἔννοιαν.
ltx/gr_gr_cog/tr.d040:trMA.Ode4C2Tr.incipit	Υἱὸν ἐκ Πατρὸς καὶ Πνεῦμα…
ltx/gr_gr_cog/tr.d040:trMA.Ode4C2Tr.melody	@ltx/gr_gr_cog/he.h.m4:heHE.AkikoenOProfitis.name
ltx/gr_gr_cog/tr.d040:trMA.Ode4C2Tr.mode	@ltx/gr_gr_cog/miscellanea:misc.Mode6
ltx/gr_gr_cog/tr.d040:trMA.Ode4C2Tr.ode	@ltx/gr_gr_cog/miscellanea:misc.Ode4
ltx/gr_gr_cog/tr.d040:trMA.Ode4C2Tr.text	Υἱὸν ἐκ Πατρὸς καὶ Πνεῦμα, δοξάζω ὡς ἐξ ἡλίου φῶς καὶ ἀκτῖνα τὸ μὲν γεννητῶς, ὅτι καὶ γέννημα, τὸ δὲ προβλητῶς, ὅτι καὶ πρόβλημα συνάναρχον, μίαν οὐσίαν, προσκυνουμένην, ὑπὸ πάσης κτίσεως.
ltx/gr_gr_cog/tr.d040:trMA.Ode8C11.greekmelody	@ltx/gr_gr_cog/he.h.m6:heHE.EkFlogosToisOsiois.greekname
ltx/gr_gr_cog/tr.d040:trMA.Ode8C11.incipit	Μωϋσῆν ἡ νηστεία, θεόπτην ἔδειξε…
ltx/gr_gr_cog/tr.d040:trMA.Ode8C11.melody	@ltx/gr_gr_cog/he.h.m6:heHE.EkFlogosToisOsiois.name
ltx/gr_gr_cog/tr.d040:trMA.Ode8C11.mode	@ltx/gr_gr_cog/miscellanea:misc.Mode6
ltx/gr_gr_cog/tr.d040:trMA.Ode8C11.ode	@ltx/gr_gr_cog/miscellanea:misc.Ode8
ltx/gr_gr_cog/tr.d040:trMA.Ode8C11.text	Μωϋσῆν ἡ νηστεία, θεόπτην ἔδειξε, καὶ Ἠλίαν πυρίνῳ ἅρματι ἔλαβε, σπεῦσον λογισμῶν βλαβερῶν ἐγκρατεύθητι, ὅπως χαμαιζήλου, ψυχὴ ῥυσθῇς ἀπάτης.
ltx/gr_gr_cog/tr.d040:trMA.Ode8C12.incipit	Ὀλισθαίνων τοῖς χείρω, προσεπεκτείνομαι, καὶ…
ltx/gr_gr_cog/tr.d040:trMA.Ode8C12.melody	@ltx/gr_gr_cog/he.h.m6:heHE.EkFlogosToisOsiois.name
ltx/gr_gr_cog/tr.d040:trMA.Ode8C12.mode	@ltx/gr_gr_cog/miscellanea:misc.Mode6
ltx/gr_gr_cog/tr.d040:trMA.Ode8C12.ode	@ltx/gr_gr_cog/miscellanea:misc.Ode8
ltx/gr_gr_cog/tr.d040:trMA.Ode8C12.text	Ὀλισθαίνων τοῖς χείρω, προσεπεκτείνομαι, καὶ τῷ μώλωπι τραῦμα, προσεπιτίθημι, ἴασαι Χριστὲ τὴν λιθώδη μου πώρωσιν, ταῖς τῶν Ἀποστόλων, Οἰκτίρμον ἱκεσίαις.
ltx/gr_gr_cog/tr.d040:trMA.Ode8C13.incipit	Οἱ τοῦ Κόσμου φωστῆρες, οἱ…
ltx/gr_gr_cog/tr.d040:trMA.Ode8C13.melody	@ltx/gr_gr_cog/he.h.m6:heHE.EkFlogosToisOsiois.name
ltx/gr_gr_cog/tr.d040:trMA.Ode8C13.mode	@ltx/gr_gr_cog/miscellanea:misc.Mode6
ltx/gr_gr_cog/tr.d040:trMA.Ode8C13.ode	@ltx/gr_gr_cog/miscellanea:misc.Ode8
ltx/gr_gr_cog/tr.d040:trMA.Ode8C13.text	Οἱ τοῦ Κόσμου φωστῆρες, οἱ θεαυγέστατοι, τῶν παθῶν ἡμῶν νέφη, διασκεδάσατε, καὶ προσκυνητάς, τῆς λαμπρᾶς Ἀναστάσεως, δείξατε ὑμνοῦντας, τὸν Ἥλιον τῆς Δόξης.
ltx/gr_gr_cog/tr.d040:trMA.Ode8C1T.incipit	Γενεαὶ γενεῶν σου Θεομακάριστε μακαρίζουσι…
ltx/gr_gr_cog/tr.d040:trMA.Ode8C1T.melody	@ltx/gr_gr_cog/he.h.m6:heHE.EkFlogosToisOsiois.name
ltx/gr_gr_cog/tr.d040:trMA.Ode8C1T.mode	@ltx/gr_gr_cog/miscellanea:misc.Mode6
ltx/gr_gr_cog/tr.d040:trMA.Ode8C1T.ode	@ltx/gr_gr_cog/miscellanea:misc.Ode8
ltx/gr_gr_cog/tr.d040:trMA.Ode8C1T.text	Γενεαὶ γενεῶν σου Θεομακάριστε μακαρίζουσι πάλαι, ὡς προεφήτευσας· μόνη γὰρ βροτοῖς τὸν μακάριον τέτοκας, Λόγον ἀποῤῥήτως, ἐκ σοῦ σωματωθέντα.
ltx/gr_gr_cog/tr.d040:trMA.Ode8C21.greekmelody	@ltx/gr_gr_cog/he.h.m6:heHE.OiOsioiSouPaides.greekname
ltx/gr_gr_cog/tr.d040:trMA.Ode8C21.incipit	Ἐν τῷ βυθῷ τῆς πλάνης…
ltx/gr_gr_cog/tr.d040:trMA.Ode8C21.melody	@ltx/gr_gr_cog/he.h.m6:heHE.OiOsioiSouPaides.name
ltx/gr_gr_cog/tr.d040:trMA.Ode8C21.mode	@ltx/gr_gr_cog/miscellanea:misc.Mode6
ltx/gr_gr_cog/tr.d040:trMA.Ode8C21.ode	@ltx/gr_gr_cog/miscellanea:misc.Ode8
ltx/gr_gr_cog/tr.d040:trMA.Ode8C21.text	Ἐν τῷ βυθῷ τῆς πλάνης τοὺς νηχομένους, ἀγρεύσαντες καλάμῳ τῆς πίστεως, Ἀπόστολοι Κυρίου φέρετε τούτους, εὐλογοῦντας, ὑμνοῦντας, καὶ ὑπερυψοῦντας τὸν Κύριον.
ltx/gr_gr_cog/tr.d040:trMA.Ode8C22.incipit	Μεγάλη ἡ ἰσχύς σου ἐν…
ltx/gr_gr_cog/tr.d040:trMA.Ode8C22.melody	@ltx/gr_gr_cog/he.h.m6:heHE.OiOsioiSouPaides.name
ltx/gr_gr_cog/tr.d040:trMA.Ode8C22.mode	@ltx/gr_gr_cog/miscellanea:misc.Mode6
ltx/gr_gr_cog/tr.d040:trMA.Ode8C22.ode	@ltx/gr_gr_cog/miscellanea:misc.Ode8
ltx/gr_gr_cog/tr.d040:trMA.Ode8C22.text	Μεγάλη ἡ ἰσχύς σου ἐν Ἀποστόλοις, ὅτι σκιαὶ καὶ σουδάρια αὐτῶν, ἰῶνται τοὺς ἀσθενοῦντας, εὐλογοῦντας, ὑμνοῦντας, καὶ ὑπερυψοῦντας τὸν Κύριον.
ltx/gr_gr_cog/tr.d040:trMA.Ode8C2A1.incipit	Ἡ δωδεκὰς ἁγία τῶν Ἀποστόλων…
ltx/gr_gr_cog/tr.d040:trMA.Ode8C2A1.melody	@ltx/gr_gr_cog/he.h.m6:heHE.OiOsioiSouPaides.name
ltx/gr_gr_cog/tr.d040:trMA.Ode8C2A1.mode	@ltx/gr_gr_cog/miscellanea:misc.Mode6
ltx/gr_gr_cog/tr.d040:trMA.Ode8C2A1.ode	@ltx/gr_gr_cog/miscellanea:misc.Ode8
ltx/gr_gr_cog/tr.d040:trMA.Ode8C2A1.text	Ἡ δωδεκὰς ἁγία τῶν Ἀποστόλων, τὸν τίμιον Σταυρὸν καταξίωσον, ἀκατακρίτως με προσκυνῆσαι εὐλογοῦντα, ὑμνοῦντα, καὶ ὑπερυψοῦντα τὸν Κύριον.
ltx/gr_gr_cog/tr.d040:trMA.Ode8C2H.greekmelody	@ltx/gr_gr_cog/he.h.m6:heHE.OiOsioiSouPaides.greekname
ltx/gr_gr_cog/tr.d040:trMA.Ode8C2H.incipit	@ltx/gr_gr_cog/he.h.m6:heHE.OiOsioiSouPaides.incipit
ltx/gr_gr_cog/tr.d040:trMA.Ode8C2H.melody	@ltx/gr_gr_cog/he.h.m6:heHE.OiOsioiSouPaides.melody
ltx/gr_gr_cog/tr.d040:trMA.Ode8C2H.mode	@ltx/gr_gr_cog/miscellanea:misc.Mode6
ltx/gr_gr_cog/tr.d040:trMA.Ode8C2H.ode	@ltx/gr_gr_cog/miscellanea:misc.Ode8
ltx/gr_gr_cog/tr.d040:trMA.Ode8C2H.text	@ltx/gr_gr_cog/he.h.m6:heHE.OiOsioiSouPaides.text
ltx/gr_gr_cog/tr.d040:trMA.Ode8C2T.incipit	Ὃν ἔτεκες Παρθένε ἀνερμηνεύτως, διαπαντὸς…
ltx/gr_gr_cog/tr.d040:trMA.Ode8C2T.melody	@ltx/gr_gr_cog/he.h.m6:heHE.OiOsioiSouPaides.name
ltx/gr_gr_cog/tr.d040:trMA.Ode8C2T.mode	@ltx/gr_gr_cog/miscellanea:misc.Mode6
ltx/gr_gr_cog/tr.d040:trMA.Ode8C2T.ode	@ltx/gr_gr_cog/miscellanea:misc.Ode8
ltx/gr_gr_cog/tr.d040:trMA.Ode8C2T.text	Ὃν ἔτεκες Παρθένε ἀνερμηνεύτως, διαπαντὸς ὡς φιλάνθρωπον, μὴ διαλίπῃς δυσωποῦσα, ἵνα κινδύνων σώσῃ, τοὺς εἰς σὲ καταφεύγοντας.
ltx/gr_gr_cog/tr.d040:trMA.Ode8C2Tr.incipit	Ἀνάρχῳ καὶ γεννήσει τε καὶ…
ltx/gr_gr_cog/tr.d040:trMA.Ode8C2Tr.melody	@ltx/gr_gr_cog/he.h.m6:heHE.OiOsioiSouPaides.name
ltx/gr_gr_cog/tr.d040:trMA.Ode8C2Tr.mode	@ltx/gr_gr_cog/miscellanea:misc.Mode6
ltx/gr_gr_cog/tr.d040:trMA.Ode8C2Tr.ode	@ltx/gr_gr_cog/miscellanea:misc.Ode8
ltx/gr_gr_cog/tr.d040:trMA.Ode8C2Tr.text	Ἀνάρχῳ καὶ γεννήσει τε καὶ προόδῳ, Πατέρα προσκυνῶ τὸν γεννήσαντα, Υἱὸν δοξάζω τὸν γεννηθέντα, ὑμνῶ τὸ συνεκλάμπον, Πατρί τε καὶ Υἱῷ Πνεῦμα ἅγιον.
ltx/gr_gr_cog/tr.d040:trMA.Ode9C11.greekmelody	@ltx/gr_gr_cog/he.h.m6:heHE.TheonAnthropois.greekname
ltx/gr_gr_cog/tr.d040:trMA.Ode9C11.incipit	Θεὲ καὶ Κύριε, πολυέλεε, τὰ…
ltx/gr_gr_cog/tr.d040:trMA.Ode9C11.melody	@ltx/gr_gr_cog/he.h.m6:heHE.TheonAnthropois.name
ltx/gr_gr_cog/tr.d040:trMA.Ode9C11.mode	@ltx/gr_gr_cog/miscellanea:misc.Mode6
ltx/gr_gr_cog/tr.d040:trMA.Ode9C11.ode	@ltx/gr_gr_cog/miscellanea:misc.Ode9
ltx/gr_gr_cog/tr.d040:trMA.Ode9C11.text	Θεὲ καὶ Κύριε, πολυέλεε, τὰ τῆς ἐμῆς καρδίας, ἀποκάθαρον τραύματα, μετανοίας προσπλάττων μοι φάρμακα, ἥμαρτον, ἥμαρτόν σοι, οἴκτειρον σῶσόν με, ταῖς τῶν Ἀποστόλων σου εὐχαῖς, ὡς πολυέλεος.
ltx/gr_gr_cog/tr.d040:trMA.Ode9C12.incipit	Ὁρμαῖς ἀτόποις ἐξηκολούθησα, φρενοβλαβῶς καὶ…
ltx/gr_gr_cog/tr.d040:trMA.Ode9C12.melody	@ltx/gr_gr_cog/he.h.m6:heHE.TheonAnthropois.name
ltx/gr_gr_cog/tr.d040:trMA.Ode9C12.mode	@ltx/gr_gr_cog/miscellanea:misc.Mode6
ltx/gr_gr_cog/tr.d040:trMA.Ode9C12.ode	@ltx/gr_gr_cog/miscellanea:misc.Ode9
ltx/gr_gr_cog/tr.d040:trMA.Ode9C12.text	Ὁρμαῖς ἀτόποις ἐξηκολούθησα, φρενοβλαβῶς καὶ ἔξω, ἐμαυτοῦ ὅλως γέγονα, ἡδονῶν τὸ τραχὺ σιτιζόμενος, καὶ τῆς σωτηριώδους καθυστερούμενος, βρώσεως ὁ ἄσωτος Χριστέ, οἴκτειρον σῶσόν με.
ltx/gr_gr_cog/tr.d040:trMA.Ode9C13.incipit	Ψυχὴ κακίας μὴ καθαρεύουσα, καὶ…
ltx/gr_gr_cog/tr.d040:trMA.Ode9C13.melody	@ltx/gr_gr_cog/he.h.m6:heHE.TheonAnthropois.name
ltx/gr_gr_cog/tr.d040:trMA.Ode9C13.mode	@ltx/gr_gr_cog/miscellanea:misc.Mode6
ltx/gr_gr_cog/tr.d040:trMA.Ode9C13.ode	@ltx/gr_gr_cog/miscellanea:misc.Ode9
ltx/gr_gr_cog/tr.d040:trMA.Ode9C13.text	Ψυχὴ κακίας μὴ καθαρεύουσα, καὶ ἡδονῶν σαυτήν, φθοροποιῶν μὴ μακρύνουσα, τί ἀκαίρως ἀγάλλῃ νηστεύουσα; ταύτην γὰρ τὴν νηστείαν οὐκ ἐξελέξατο, Κύριος ὁ μόνος, τὴν ἡμῶν θέλων διόρθωσιν.
ltx/gr_gr_cog/tr.d040:trMA.Ode9C1T.incipit	Φωτὶ τῷ θείῳ με φωταγώγησον…
ltx/gr_gr_cog/tr.d040:trMA.Ode9C1T.melody	@ltx/gr_gr_cog/he.h.m6:heHE.TheonAnthropois.name
ltx/gr_gr_cog/tr.d040:trMA.Ode9C1T.mode	@ltx/gr_gr_cog/miscellanea:misc.Mode6
ltx/gr_gr_cog/tr.d040:trMA.Ode9C1T.ode	@ltx/gr_gr_cog/miscellanea:misc.Ode9
ltx/gr_gr_cog/tr.d040:trMA.Ode9C1T.text	Φωτὶ τῷ θείῳ με φωταγώγησον, ἡ τοῦ φωτὸς Παρθένε, Θεοτόκε λοχεύτρια, καὶ ψυχῆς μου τὸν ζόφον ἀπέλασον, ὅπως σε μακαρίζω, ἣν μακαρίζουσι, πᾶσαι τῶν ἀνθρώπων γενεαί, ὡς προεφήτευσας.
ltx/gr_gr_cog/tr.d040:trMA.Ode9C21.greekmelody	@ltx/gr_gr_cog/he.h.m6:heHE.AsporouSyllipseos.greekname
ltx/gr_gr_cog/tr.d040:trMA.Ode9C21.incipit	Οἱ λόγῳ ἰδιῶται, σοφοὶ τῇ…
ltx/gr_gr_cog/tr.d040:trMA.Ode9C21.melody	@ltx/gr_gr_cog/he.h.m6:heHE.AsporouSyllipseos.name
ltx/gr_gr_cog/tr.d040:trMA.Ode9C21.mode	@ltx/gr_gr_cog/miscellanea:misc.Mode6
ltx/gr_gr_cog/tr.d040:trMA.Ode9C21.ode	@ltx/gr_gr_cog/miscellanea:misc.Ode9
ltx/gr_gr_cog/tr.d040:trMA.Ode9C21.text	Οἱ λόγῳ ἰδιῶται, σοφοὶ τῇ γνώσει ὤφθητε, πλοκὰς τῶν λόγων, φιλοσόφων λύσαντες, ῥητόρων τὰς διπλόας, καὶ ψήφους ἀστρονόμων· διὸ Ἀπόστολοι τοῦ Χριστοῦ, μόνοι πάσης οἰκουμένης, ἀνεδείχθητε Διδάσκαλοι.
ltx/gr_gr_cog/tr.d040:trMA.Ode9C22.incipit	Ὁ Πέτρος ῥητορεύει, καὶ Πλάτων…
ltx/gr_gr_cog/tr.d040:trMA.Ode9C22.melody	@ltx/gr_gr_cog/he.h.m6:heHE.AsporouSyllipseos.name
ltx/gr_gr_cog/tr.d040:trMA.Ode9C22.mode	@ltx/gr_gr_cog/miscellanea:misc.Mode6
ltx/gr_gr_cog/tr.d040:trMA.Ode9C22.ode	@ltx/gr_gr_cog/miscellanea:misc.Ode9
ltx/gr_gr_cog/tr.d040:trMA.Ode9C22.text	Ὁ Πέτρος ῥητορεύει, καὶ Πλάτων κατεσίγησε, διδάσκει Παῦλος, Πυθαγόρας ἔδυσε, λοιπὸν τῶν Ἀποστόλων, θεολογῶν ὁ δῆμος, τὴν τῶν Ἑλλήνων νεκρὰν φθογγήν, καταθάπτει, καὶ τὸν Κόσμον, συνεγείρει πρὸς λατρείαν Χριστοῦ.
ltx/gr_gr_cog/tr.d040:trMA.Ode9C2A1.incipit	Τὸν Σταυρὸν τὸν τίμιον, τὸ…
ltx/gr_gr_cog/tr.d040:trMA.Ode9C2A1.melody	@ltx/gr_gr_cog/he.h.m6:heHE.AsporouSyllipseos.name
ltx/gr_gr_cog/tr.d040:trMA.Ode9C2A1.mode	@ltx/gr_gr_cog/miscellanea:misc.Mode6
ltx/gr_gr_cog/tr.d040:trMA.Ode9C2A1.ode	@ltx/gr_gr_cog/miscellanea:misc.Ode9
ltx/gr_gr_cog/tr.d040:trMA.Ode9C2A1.text	Τὸν Σταυρὸν τὸν τίμιον, τὸ ξύλον τὸ πανάγιον, ὃ τὴν τοῦ Κόσμου, σωτηρίαν ἤνθησεν, ἰδεῖν καὶ προσκυνῆσαι, πάντες ἀξιωθῶμεν, ἁγνοῖς καὶ χείλεσι καὶ ψυχῇ ἱκεσίαις ὑμῶν πάντων, τῶν ἁγίων Ἀποστόλων Χριστοῦ.
ltx/gr_gr_cog/tr.d040:trMA.Ode9C2H.greekmelody	@ltx/gr_gr_cog/he.h.m6:heHE.AsporouSyllipseos.greekname
ltx/gr_gr_cog/tr.d040:trMA.Ode9C2H.incipit	@ltx/gr_gr_cog/he.h.m6:heHE.AsporouSyllipseos.incipit
ltx/gr_gr_cog/tr.d040:trMA.Ode9C2H.melody	@ltx/gr_gr_cog/he.h.m6:heHE.AsporouSyllipseos.melody
ltx/gr_gr_cog/tr.d040:trMA.Ode9C2H.mode	@ltx/gr_gr_cog/miscellanea:misc.Mode6
ltx/gr_gr_cog/tr.d040:trMA.Ode9C2H.ode	@ltx/gr_gr_cog/miscellanea:misc.Ode9
ltx/gr_gr_cog/tr.d040:trMA.Ode9C2H.text	@ltx/gr_gr_cog/he.h.m6:heHE.AsporouSyllipseos.text
ltx/gr_gr_cog/tr.d040:trMA.Ode9C2T.incipit	Τὸ θαῦμα τοῦ τόκου σου…
ltx/gr_gr_cog/tr.d040:trMA.Ode9C2T.melody	@ltx/gr_gr_cog/he.h.m6:heHE.AsporouSyllipseos.name
ltx/gr_gr_cog/tr.d040:trMA.Ode9C2T.mode	@ltx/gr_gr_cog/miscellanea:misc.Mode6
ltx/gr_gr_cog/tr.d040:trMA.Ode9C2T.ode	@ltx/gr_gr_cog/miscellanea:misc.Ode9
ltx/gr_gr_cog/tr.d040:trMA.Ode9C2T.text	Τὸ θαῦμα τοῦ τόκου σου, ἐκπλήττει με Πανάμωμε, πῶς συλλαμβάνεις, ἀσπόρως τὸν ἄληπτον; εἰπὲ πῶς παρθενεύεις, γεννήσασα ὡς μήτηρ; Τὸ ὑπὲρ φύσιν πίστει λαβών, τὸ τικτόμενον προσκύνει· ὅσα θέλει γὰρ καὶ δύναται.
ltx/gr_gr_cog/tr.d040:trMA.Ode9C2Tr.incipit	Μόνου μονογεννήτωρ, μονογενοῦς Υἱοῦ Πατήρ…
ltx/gr_gr_cog/tr.d040:trMA.Ode9C2Tr.melody	@ltx/gr_gr_cog/he.h.m6:heHE.AsporouSyllipseos.name
ltx/gr_gr_cog/tr.d040:trMA.Ode9C2Tr.mode	@ltx/gr_gr_cog/miscellanea:misc.Mode6
ltx/gr_gr_cog/tr.d040:trMA.Ode9C2Tr.ode	@ltx/gr_gr_cog/miscellanea:misc.Ode9
ltx/gr_gr_cog/tr.d040:trMA.Ode9C2Tr.text	Μόνου μονογεννήτωρ, μονογενοῦς Υἱοῦ Πατήρ, καὶ μόνε μόνου, φῶς φωτὸς ἀπαύγασμα, καὶ μόνον μόνος μόνου, Θεοῦ ἅγιον Πνεῦμα Κυρίου Κύριον ὄντως ὂν· ὦ Τριάς μονὰς ἁγία, σῶσόν με θεολογοῦντά σε.
ltx/gr_gr_cog/tr.d040:trTE.Troparion.incipit	Ἐὰν ἀνομίας παρατηρήσῃς Φιλάνθρωπε, ποία…
ltx/gr_gr_cog/tr.d040:trTE.Troparion.melody	
ltx/gr_gr_cog/tr.d040:trTE.Troparion.mode	@ltx/gr_gr_cog/miscellanea:misc.Mode7
ltx/gr_gr_cog/tr.d040:trTE.Troparion.text	Ἐὰν ἀνομίας παρατηρήσῃς Φιλάνθρωπε, ποία σωτηρίας ἐλπὶς ἡμῖν, ἀλλὰ τὴν σὴν ἐξ ὕψους βοήθειαν, ὡς οἰκτίρμων τῷ λαῷ σου, κατάπεμψον Κύριε.
ltx/gr_gr_cog/tr.d040:trTE.Troparion2.incipit	ἀλλὰ τὴν σὴν ἐξ ὕψους…
ltx/gr_gr_cog/tr.d040:trTE.Troparion2.text	ἀλλὰ τὴν σὴν ἐξ ὕψους βοήθειαν, ὡς οἰκτίρμων τῷ λαῷ σου, κατάπεμψον Κύριε.
ltx/gr_gr_cog/tr.d040:trVE.AposIdiomelon1.incipit	Ἀσώτως διασπείρας, τὸν πατρικόν μου…
ltx/gr_gr_cog/tr.d040:trVE.AposIdiomelon1.melody	@ltx/gr_gr_cog/miscellanea:misc.Idiomelon
ltx/gr_gr_cog/tr.d040:trVE.AposIdiomelon1.mode	@ltx/gr_gr_cog/miscellanea:misc.Mode4
ltx/gr_gr_cog/tr.d040:trVE.AposIdiomelon1.text	Ἀσώτως διασπείρας, τὸν πατρικόν μου πλοῦτον, ἔρημος γέγονα, ἐν τῇ χώρᾳ οἰκήσας, τῶν πονηρῶν πολιτῶν, καὶ τῇ ἀλογίᾳ ὡμοιώθην ἀνοήτοις κτήνεσι καὶ πάσης γεγύμνωμαι θείας χάριτος· διὸ ἐπιστρέψας βοῶ σοι· τῷ εὐσπλάγχνῳ καὶ οἰκτίρμονι Πατρί· Ἥμαρτον, δέξαι με μετανοοῦντα ὁ Θεός, καὶ ἐλέησόν με.
ltx/gr_gr_cog/tr.d040:trVE.AposMartyric.incipit	@ltx/gr_gr_cog/oc.m4.d5:ocVE.Aposticha3.incipit
ltx/gr_gr_cog/tr.d040:trVE.AposMartyric.melody	
ltx/gr_gr_cog/tr.d040:trVE.AposMartyric.mode	@ltx/gr_gr_cog/miscellanea:misc.Mode4
ltx/gr_gr_cog/tr.d040:trVE.AposMartyric.text	@ltx/gr_gr_cog/oc.m4.d5:ocVE.Aposticha3.text
ltx/gr_gr_cog/tr.d040:trVE.Stichera01.greekmelody	@ltx/gr_gr_cog/he.a.m6:heAU.OlinApothemenoi.greekname
ltx/gr_gr_cog/tr.d040:trVE.Stichera01.incipit	Ἠλίου αὐγάσματα, τοῦ νοητοῦ δεδειγμένοι…
ltx/gr_gr_cog/tr.d040:trVE.Stichera01.melody	@ltx/gr_gr_cog/he.a.m6:heAU.OlinApothemenoi.name
ltx/gr_gr_cog/tr.d040:trVE.Stichera01.mode	@ltx/gr_gr_cog/miscellanea:misc.Mode6
ltx/gr_gr_cog/tr.d040:trVE.Stichera01.poet	@ltx/gr_gr_cog/poets:po.Iosif
ltx/gr_gr_cog/tr.d040:trVE.Stichera01.text	Ἠλίου αὐγάσματα, τοῦ νοητοῦ δεδειγμένοι, θεόπται Ἀπόστολοι, φωτισμὸν αἰτήσατε, ταῖς ψυχαῖς ἡμῶν, καὶ παθῶν ῥύσατε, ἀχλυώδους σκότους, καὶ ἡμέραν τὴν σωτήριον, ἰδεῖν πρεσβεύσατε, διὰ πρεσβειῶν καὶ δεήσεων, καρδίας ἐκκαθάραντες, ἃς ὁ πονηρὸς ἐτραυμάτισεν, ὅπως ἡμᾶς πίστει, σῳζόμενοι γεραίρωμεν ἀεί, τοὺς τῷ πανσόφῳ κηρύγματι, Κόσμον διασώσαντας.
ltx/gr_gr_cog/tr.d040:trVE.Stichera02.greekmelody	@ltx/gr_gr_cog/he.a.m6:heAU.OlinApothemenoi.greekname
ltx/gr_gr_cog/tr.d040:trVE.Stichera02.incipit	Εἰς χώραν ὁ Ἄσωτος, ἀποδημήσας…
ltx/gr_gr_cog/tr.d040:trVE.Stichera02.melody	@ltx/gr_gr_cog/he.a.m6:heAU.OlinApothemenoi.name
ltx/gr_gr_cog/tr.d040:trVE.Stichera02.mode	@ltx/gr_gr_cog/miscellanea:misc.Mode6
ltx/gr_gr_cog/tr.d040:trVE.Stichera02.text	Εἰς χώραν ὁ Ἄσωτος, ἀποδημήσας κακίας, κακῶς ἐδαπάνησα, ὅν περ Πάτερ εὔσπλαγχνε, πλοῦτον δέδωκας, καὶ λιμῷ τήκομαι, ἀγαθῶν πράξεων, καὶ αἰσχύνην παραβάσεως, ἰδοὺ ἐνδέδυμαι, χάριτος ἐνθέου γυμνούμενος, καὶ κράζω σοι τὸ Ἥμαρτον· οἶδα γὰρ τὴν σὴν ἀγαθότητα, δέξαι με ὡς ἕνα, οἰκτίρμον τῶν μισθίων σου Χριστέ, τῶν Ἀποστόλων δεήσεσι, τῶν ἠγαπηκότων σε.
ltx/gr_gr_cog/tr.d040:trVE.Stichera03.incipit	Ἀπόστολοι τοῦ Σωτῆρος, φωστῆρες Οἰκουμένης…
ltx/gr_gr_cog/tr.d040:trVE.Stichera03.melody	Ἐκ δεξιῶν τοῦ Σωτῆρος.
ltx/gr_gr_cog/tr.d040:trVE.Stichera03.mode	@ltx/gr_gr_cog/miscellanea:misc.Mode6
ltx/gr_gr_cog/tr.d040:trVE.Stichera03.poet	@ltx/gr_gr_cog/poets:po.Theodorou
ltx/gr_gr_cog/tr.d040:trVE.Stichera03.text	Ἀπόστολοι τοῦ Σωτῆρος, φωστῆρες Οἰκουμένης, καὶ εὐεργέται καὶ σῶσται, οἱ Θεοῦ τῆς δόξης, ὡς οὐρανοὶ διηγήτορες, καὶ πεποικιλμένοι τοῖς ἄστροις τῶν θαυμάτων, καὶ τοῖς τέρασι τῶν ἰάσεων, ἐκτενῶς ὑπὲρ ἡμῶν, τὰς ἱκετηρίας Κυρίῳ προσάγετε, εἰς ὀσμὴν ἄχραντον, τὰς εὐχὰς δεχθῆναι ἡμῶν, καὶ ἀξιωθῆναι τὸν ζωηφόρον Σταυρόν καὶ προσπτύξασθαι, καὶ βλέψαι φόβῳ ἅπαντας, αὐτοῦ τῇ προσκυνήσει. Κατάπεμψον ἡμῖν τὰ ἐλέη σου, Σωτὴρ ὡς φιλάνθρωπος.
ltx/gr_gr_cog/tr.d040:trVL.header	Προηγιασμένη Λειτουργία τῇ Τετάρτῃ τῆς Γʹ Ἑβδομάδος
