ltx/gr_gr_cog/le.pr.me.r12:leprVE.reading.book_abbr	@ltx/gr_gr_cog/bible:Genesis.abbr
ltx/gr_gr_cog/le.pr.me.r12:leprVE.reading.book_string	@ltx/gr_gr_cog/bible:Genesis.text
ltx/gr_gr_cog/le.pr.me.r12:leprVE.reading.chapverse	Αʹ, 1 – 13
ltx/gr_gr_cog/le.pr.me.r12:leprVE.reading.incipit	Ἐν ἀρχῇ ἐποίησεν ὁ θεὸς τὸν οὐρανὸν καὶ τὴν…
ltx/gr_gr_cog/le.pr.me.r12:leprVE.reading.text	Ἐν ἀρχῇ ἐποίησεν ὁ θεὸς τὸν οὐρανὸν καὶ τὴν γῆν. Ἡ δὲ γῆ ἦν ἀόρατος καὶ ἀκατασκεύαστος, καὶ σκότος ἐπάνω τῆς ἀβύσσου, καὶ πνεῦμα θεοῦ ἐπεφέρετο ἐπάνω τοῦ ὕδατος. καὶ εἶπεν ὁ θεός· Γενηθήτω φῶς. καὶ ἐγένετο φῶς. καὶ εἶδεν ὁ θεὸς τὸ φῶς ὅτι καλόν. καὶ διεχώρισεν ὁ θεὸς ἀνὰ μέσον τοῦ φωτὸς καὶ ἀνὰ μέσον τοῦ σκότους. καὶ ἐκάλεσεν ὁ θεὸς τὸ φῶς ἡμέραν καὶ τὸ σκότος ἐκάλεσεν νύκτα. καὶ ἐγένετο ἑσπέρα καὶ ἐγένετο πρωί, ἡμέρα μία. Καὶ εἶπεν ὁ θεός· Γενηθήτω στερέωμα ἐν μέσῳ τοῦ ὕδατος καὶ ἔστω διαχωρίζον ἀνὰ μέσον ὕδατος καὶ ὕδατος. καὶ ἐγένετο οὕτως. καὶ ἐποίησεν ὁ θεὸς τὸ στερέωμα, καὶ διεχώρισεν ὁ θεὸς ἀνὰ μέσον τοῦ ὕδατος, ὃ ἦν ὑποκάτω τοῦ στερεώματος, καὶ ἀνὰ μέσον τοῦ ὕδατος τοῦ ἐπάνω τοῦ στερεώματος. καὶ ἐκάλεσεν ὁ θεὸς τὸ στερέωμα οὐρανόν. καὶ εἶδεν ὁ θεὸς ὅτι καλόν. καὶ ἐγένετο ἑσπέρα καὶ ἐγένετο πρωί, ἡμέρα δευτέρα. Καὶ εἶπεν ὁ θεός· Συναχθήτω τὸ ὕδωρ τὸ ὑποκάτω τοῦ οὐρανοῦ εἰς συναγωγὴν μίαν, καὶ ὀφθήτω ἡ ξηρά. καὶ ἐγένετο οὕτως. καὶ συνήχθη τὸ ὕδωρ τὸ ὑποκάτω τοῦ οὐρανοῦ εἰς τὰς συναγωγὰς αὐτῶν, καὶ ὤφθη ἡ ξηρά. καὶ ἐκάλεσεν ὁ θεὸς τὴν ξηρὰν γῆν καὶ τὰ συστήματα τῶν ὑδάτων ἐκάλεσεν θαλάσσας. καὶ εἶδεν ὁ θεὸς ὅτι καλόν. καὶ εἶπεν ὁ θεός· Βλαστησάτω ἡ γῆ βοτάνην χόρτου, σπεῖρον σπέρμα κατὰ γένος καὶ καθʼ ὁμοιότητα, καὶ ξύλον κάρπιμον ποιοῦν καρπόν, οὗ τὸ σπέρμα αὐτοῦ ἐν αὐτῷ κατὰ γένος ἐπὶ τῆς γῆς. καὶ ἐγένετο οὕτως. καὶ ἐξήνεγκεν ἡ γῆ βοτάνην χόρτου, σπεῖρον σπέρμα κατὰ γένος καὶ καθʼ ὁμοιότητα, καὶ ξύλον κάρπιμον ποιοῦν καρπόν, οὗ τὸ σπέρμα αὐτοῦ ἐν αὐτῷ κατὰ γένος ἐπὶ τῆς γῆς. καὶ εἶδεν ὁ θεὸς ὅτι καλόν. καὶ ἐγένετο ἑσπέρα καὶ ἐγένετο πρωί, ἡμέρα τρίτη.
ltx/gr_gr_cog/le.pr.me.r12:leprVE.reading.title	
ltx/gr_gr_cog/le.pr.me.r12:leprVE.reading.title_abbr	
ltx/gr_gr_cog/le.pr.me.r12:leprVE.reading.version	@ltx/gr_gr_cog/properties:version.designation
