ltx/gr_gr_cog/le.go.mc.d016:lemcLI.Gospel.book_abbr	@ltx/gr_gr_cog/bible:Luke.abbr
ltx/gr_gr_cog/le.go.mc.d016:lemcLI.Gospel.book_string	@ltx/gr_gr_cog/bible:Luke.text
ltx/gr_gr_cog/le.go.mc.d016:lemcLI.Gospel.chapverse	19:29 – 40, 22:7 – 39
ltx/gr_gr_cog/le.go.mc.d016:lemcLI.Gospel.incipit	Ὡς ἤγγισεν ὁ Ἰησοῦς εἰς Βηθσφαγῆ…
ltx/gr_gr_cog/le.go.mc.d016:lemcLI.Gospel.text	Τῷ καιρῷ ἐκείνῳ, ὡς ἤγγισεν ὁ Ἰησοῦς εἰς Βηθσφαγῆ καὶ Βηθανίαν πρὸς τὸ ὄρος τὸ καλούμενον ἐλαιῶν, ἀπέστειλε δύο τῶν μαθητῶν αὐτοῦ εἰπών· ὑπάγετε εἰς τὴν κατέναντι κώμην, ἐν ᾗ εἰσπορευόμενοι εὑρήσετε πῶλον δεδεμένον, ἐφ᾿ ὃν οὐδεὶς πώποτε ἀνθρώπων ἐκάθισε· λύσαντες αὐτὸν ἀγάγετε. καὶ ἐάν τις ὑμᾶς ἐρωτᾷ, διατί λύετε; οὕτως ἐρεῖτε αὐτῷ, ὅτι ὁ Κύριος αὐτοῦ χρείαν ἔχει. ἀπελθόντες δὲ οἱ ἀπεσταλμένοι εὗρον καθὼς εἶπεν αὐτοῖς, ἑστῶτα τὸν πῶλον· λυόντων δὲ αὐτῶν τὸν πῶλον εἶπον οἱ κύριοι αὐτοῦ πρὸς αὐτούς· τί λύετε τὸν πῶλον; οἱ δὲ εἶπον ὅτι ὁ Κύριος αὐτοῦ χρείαν ἔχει. καὶ ἤγαγον αὐτὸν πρὸς τὸν Ἰησοῦν, καὶ ἐπιρρίψαντες ἑαυτῶν τὰ ἱμάτια ἐπὶ τὸν πῶλον ἐπεβίβασαν τὸν Ἰησοῦν. πορευομένου δὲ αὐτοῦ ὑπεστρώννυον τὰ ἱμάτια αὐτῶν ἐν τῇ ὁδῷ. ἐγγίζοντος δὲ αὐτοῦ ἤδη πρὸς τῇ καταβάσει τοῦ ὄρους τῶν ἐλαιῶν ἤρξατο ἅπαν τὸ πλῆθος τῶν μαθητῶν χαίροντες αἰνεῖν τὸν Θεὸν φωνῇ μεγάλῃ περὶ πασῶν ὧν εἶδον δυνάμεων λέγοντες· εὐλογημένος ὁ ἐρχόμενος βασιλεὺς ἐν ὀνόματι Κυρίου· εἰρήνη ἐν οὐρανῷ καὶ δόξα ἐν ὑψίστοις. καί τινες τῶν Φαρισαίων ἀπὸ τοῦ ὄχλου εἶπον πρὸς αὐτόν· διδάσκαλε, ἐπιτίμησον τοῖς μαθηταῖς σου. καὶ ἀποκριθεὶς εἶπεν αὐτοῖς· λέγω ὑμῖν ὅτι ἐὰν οὗτοι σιωπήσωσιν, οἱ λίθοι κεκράξονται. Ἦλθε δὲ ἡ ἡμέρα τῶν ἀζύμων, ἐν ᾗ ἔδει θύεσθαι τὸ πάσχα, καὶ ἀπέστειλε Πέτρον καὶ Ἰωάννην εἰπών· πορευθέντες ἑτοιμάσατε ἡμῖν τὸ πάσχα ἵνα φάγωμεν. οἱ δὲ εἶπον αὐτῷ· ποῦ θέλεις ἑτοιμάσωμεν; ὁ δὲ εἶπεν αὐτοῖς· ἰδοὺ εἰσελθόντων ὑμῶν εἰς τὴν πόλιν συναντήσει ὑμῖν ἄνθρωπος κεράμιον ὕδατος βαστάζων· ἀκολουθήσατε αὐτῷ εἰς τὴν οἰκίαν οὗ εἰσπορεύεται, καὶ ἐρεῖτε τῷ οἰκοδεσπότῃ τῆς οἰκίας· λέγει σοι ὁ διδάσκαλος, ποῦ ἐστι τὸ κατάλυμα ὅπου τὸ πάσχα μετὰ τῶν μαθητῶν μου φάγω; κἀκεῖνος ὑμῖν δείξει ἀνώγαιον μέγα ἐστρωμένον· ἐκεῖ ἑτοιμάσατε. ἀπελθόντες δὲ εὗρον καθὼς εἴρηκεν αὐτοῖς, καὶ ἡτοίμασαν τὸ πάσχα. Καὶ ὅτε ἐγένετο ἡ ὥρα, ἀνέπεσε, καὶ οἱ δώδεκα ἀπόστολοι σὺν αὐτῷ. καὶ εἶπε πρὸς αὐτούς· ἐπιθυμίᾳ ἐπεθύμησα τοῦτο τὸ πάσχα φαγεῖν μεθ᾿ ὑμῶν πρὸ τοῦ με παθεῖν· λέγω γὰρ ὑμῖν ὅτι οὐκέτι οὐ μὴ φάγω ἐξ αὐτοῦ ἕως ὅτου πληρωθῇ ἐν τῇ βασιλείᾳ τοῦ Θεοῦ. καὶ δεξάμενος τὸ ποτήριον εὐχαριστήσας εἶπε· λάβετε τοῦτο καὶ διαμερίσατε ἑαυτοῖς· λέγω γὰρ ὑμῖν ὅτι οὐ μὴ πίω ἀπὸ τοῦ γενήματος τῆς ἀμπέλου ἕως ὅτου ἡ βασιλεία τοῦ Θεοῦ ἔλθῃ. καὶ λαβὼν ἄρτον εὐχαριστήσας ἔκλασε καὶ ἔδωκεν αὐτοῖς λέγων· τοῦτό ἐστι τὸ σῶμά μου τὸ ὑπὲρ ὑμῶν διδόμενον· τοῦτο ποιεῖτε εἰς τὴν ἐμὴν ἀνάμνησιν. ὡσαύτως καὶ τὸ ποτήριον μετὰ τὸ δειπνῆσαι λέγων· τοῦτο τὸ ποτήριον ἡ καινὴ διαθήκη ἐν τῷ αἵματί μου, τὸ ὑπὲρ ὑμῶν ἐκχυνόμενον. πλὴν ἰδοὺ ἡ χεὶρ τοῦ παραδιδόντος με μετ᾿ ἐμοῦ ἐπὶ τῆς τραπέζης. καὶ ὁ μὲν υἱὸς τοῦ ἀνθρώπου πορεύεται κατὰ τὸ ὡρισμένον· πλὴν οὐαὶ τῷ ἀνθρώπῳ ἐκείνῳ δι᾿ οὗ παραδίδοται. καὶ αὐτοὶ ἤρξαντο συζητεῖν πρὸς ἑαυτοὺς τὸ τίς ἄρα εἴη ἐξ αὐτῶν ὁ τοῦτο μέλλων πράσσειν. Ἐγένετο δὲ καὶ φιλονεικία ἐν αὐτοῖς, τὸ τίς αὐτῶν δοκεῖ εἶναι μείζων. ὁ δὲ εἶπεν αὐτοῖς· οἱ βασιλεῖς τῶν ἐθνῶν κυριεύουσιν αὐτῶν, καὶ οἱ ἐξουσιάζοντες αὐτῶν εὐεργέται καλοῦνται· ὑμεῖς δὲ οὐχ οὕτως, ἀλλ᾿ ὁ μείζων ἐν ὑμῖν γινέσθω ὡς ὁ νεώτερος, καὶ ὁ ἡγούμενος ὡς ὁ διακονῶν. τίς γὰρ μείζων, ὁ ἀνακείμενος ἢ ὁ διακονῶν; οὐχὶ ὁ ἀνακείμενος; ἐγὼ δέ εἰμι ἐν μέσῳ ὑμῶν ὡς ὁ διακονῶν. ὑμεῖς δέ ἐστε οἱ διαμεμενηκότες μετ᾿ ἐμοῦ ἐν τοῖς πειρασμοῖς μου· κἀγὼ διατίθεμαι ὑμῖν καθὼς διέθετό μοι ὁ πατήρ μου βασιλείαν, ἵνα ἐσθίητε καὶ πίνητε ἐπὶ τῆς τραπέζης μου ἐν τῇ βασιλείᾳ μου, καὶ καθίσεσθε ἐπὶ θρόνων κρίνοντες τὰς δώδεκα φυλὰς τοῦ Ἰσραήλ. Εἶπε δὲ ὁ Κύριος· Σίμων Σίμων, ἰδοὺ ὁ σατανᾶς ἐξῃτήσατο ὑμᾶς τοῦ σινιάσαι ὡς τὸν σῖτον· ἐγὼ δὲ ἐδεήθην περὶ σοῦ ἵνα μὴ ἐκλίπῃ ἡ πίστις σου· καὶ σύ ποτε ἐπιστρέψας στήριξον τοὺς ἀδελφούς σου. ὁ δὲ εἶπεν αὐτῷ· Κύριε, μετὰ σοῦ ἕτοιμός εἰμι καὶ εἰς φυλακὴν καὶ εἰς θάνατον πορεύεσθαι. ὁ δὲ εἶπε· λέγω σοι, Πέτρε, οὐ φωνήσει σήμερον ἀλέκτωρ πρὶν ἢ τρὶς ἀπαρνήσῃ μὴ εἰδέναι με. Καὶ εἶπεν αὐτοῖς· ὅτε ἀπέστειλα ὑμᾶς ἄτερ βαλλαντίου καὶ πήρας καὶ ὑποδημάτων, μή τινος ὑστερήθητε; οἱ δὲ εἶπον· οὐθενός. εἶπεν οὖν αὐτοῖς· ἀλλὰ νῦν ὁ ἔχων βαλλάντιον ἀράτω, ὁμοίως καὶ πήραν, καὶ ὁ μὴ ἔχων πωλήσει τὸ ἱμάτιον αὐτοῦ καὶ ἀγοράσει μάχαιραν. λέγω γὰρ ὑμῖν ὅτι ἔτι τοῦτο τὸ γεγραμμένον δεῖ τελεσθῆναι ἐν ἐμοί, τὸ καὶ μετὰ ἀνόμων ἐλογίσθη· καὶ γὰρ τὰ περὶ ἐμοῦ τέλος ἔχει. οἱ δὲ εἶπον· Κύριε, ἰδοὺ μάχαιραι ὧδε δύο. ὁ δὲ εἶπεν αὐτοῖς· ἱκανόν ἐστι. Καὶ ἐξελθὼν ἐπορεύθη κατὰ τὸ ἔθος εἰς τὸ ὄρος τῶν ἐλαιῶν· ἠκολούθησαν δὲ αὐτῷ καὶ οἱ μαθηταὶ αὐτοῦ.
ltx/gr_gr_cog/le.go.mc.d016:lemcLI.Gospel.title	Τῇ Δευτέρᾳ τῆς Τυροφάγου
ltx/gr_gr_cog/le.go.mc.d016:lemcLI.Gospel.title_abbr	Δευτέρᾳ τῆς Τυροφάγου
ltx/gr_gr_cog/le.go.mc.d016:lemcLI.Gospel.version	@ltx/gr_gr_cog/properties:version.designation
