ltx/gr_gr_cog/sy.m07.d12:alt1.syMA.commemoration01.couplet1.title	@ltx/gr_gr_cog/titles:ti.Verses
ltx/gr_gr_cog/sy.m07.d12:alt1.syMA.commemoration01.couplet1.verse1	Ζήσας Παΐσιος μόνος Θεῷ μόνῳ,
ltx/gr_gr_cog/sy.m07.d12:alt1.syMA.commemoration01.couplet1.verse2	Πολλοὺς τεθλιμμένους ἐκούφισεν πόνων.
ltx/gr_gr_cog/sy.m07.d12:alt1.syMA.commemoration01.couplet2.verse1	Ἡνωμένος γὰρ τῷ Θεῷ διʼ ἀγάπης,
ltx/gr_gr_cog/sy.m07.d12:alt1.syMA.commemoration01.couplet2.verse2	Παραμυθεῖσθαι πάντας εἴληφεν χάριν.
ltx/gr_gr_cog/sy.m07.d12:alt1.syMA.commemoration01.narration.p01	
ltx/gr_gr_cog/sy.m07.d12:alt1.syMA.commemoration01.single1	Δωδεκάτῃ Παΐσιος ἀνέσπερον αὐγὴν εἶδε.
ltx/gr_gr_cog/sy.m07.d12:alt1.syMA.commemoration01.text	Τῇ ΙΒʹ τοῦ αὐτοῦ μηνός, μνήμη τοῦ ὁσίου Πατρὸς ἡμῶν Παϊσίου τοῦ νέου τοῦ Ἁγιορείτου, τελειωθέντος ἐν εἰρήνῃ, ἐν ἔτει χιλιοστῷ ἐννεακοσιοστῷ ἐνενηκοστῷ τετάρτῳ (1994).
ltx/gr_gr_cog/sy.m07.d12:cl.syMA.commemoration01.text	[saint/com 1]
ltx/gr_gr_cog/sy.m07.d12:cl.syMA.commemoration02.text	[saint/com 2]
ltx/gr_gr_cog/sy.m07.d12:cl.syMA.commemoration03.text	[saint/com 3]
ltx/gr_gr_cog/sy.m07.d12:cl.syMA.commemoration04.text	[saint/com 4]
ltx/gr_gr_cog/sy.m07.d12:cl.syMA.commemoration05.text	[saint/com 5]
ltx/gr_gr_cog/sy.m07.d12:cl.syMA.commemoration06.text	[saint/com list]
ltx/gr_gr_cog/sy.m07.d12:syMA.commemoration01.couplet1.title	@ltx/gr_gr_cog/titles:ti.Verses
ltx/gr_gr_cog/sy.m07.d12:syMA.commemoration01.couplet1.verse1	Ἤνεγκε γυμνὸς πυκνὰ ὁ Πρόκλος βέλη.
ltx/gr_gr_cog/sy.m07.d12:syMA.commemoration01.couplet1.verse2	Ξίφει δὲ Ἱλάριος ἐτμήθη κάραν.
ltx/gr_gr_cog/sy.m07.d12:syMA.commemoration01.narration.p01	Οὗτοι οἱ Ἅγιοι ὑπῆρχον ἐπὶ Τραϊανοῦ τοῦ βασιλέως καὶ Μαξίμου ἡγεμόνος. Κατεσχέθη δὲ πρῶτον ὁ Ἅγιος Πρόκλος, καὶ ἐνώπιον τοῦ βασιλέως ὁμολογήσας τὸν Χριστόν, Μαξίμῳ τῷ ἡγεμόνι ἐκδίδοται καὶ λαμπάσι πυρὸς τὴν γαστέρα καὶ τὰς πλευρὰς κατακαίεται καὶ ξέεται καὶ ἐπὶ ξύλου κρεμᾶται καὶ λίθῳ βαρεῖται τοὺς πόδας· καὶ ἀπαγόμενος τοῦ τοξευθῆναι, συναντᾷ τὸν ἑαυτοῦ ἀνεψιὸν Ἱλάριον, ἑλκόμενον ὑπὸ τῶν Ἑλλήνων. Καὶ ὁ μὲν Ἅγιος Πρόκλος ταῖς νιφάσι τῶν βελῶν κατατρωθείς, πρὸς Κύριον ἐξεδήμησεν. Ὁ δὲ Ἅγιος Ἱλάριος, ἐρωτηθεὶς καὶ χριστιανὸν ἑαυτὸν ἀποκαλεσάμενος, κρεμασθεὶς τύπτεται καὶ ἐπὶ μιλίοις τρισὶ σύρεται· εἶτα τὴν κεφαλὴν ἐκτμηθείς, κατετέθη μετὰ τοῦ Ἁγίου Πρόκλου.
ltx/gr_gr_cog/sy.m07.d12:syMA.commemoration01.single1	Δωδεκάτῃ βέλος εἷλε Πρόκλον, ξίφος Ἱλάριόν τε.
ltx/gr_gr_cog/sy.m07.d12:syMA.commemoration01.text	Τῇ ΙΒʹ τοῦ αὐτοῦ μηνός, μνήμη τῶν Ἁγίων Μαρτύρων Πρόκλου καὶ Ἱλαρίου.
ltx/gr_gr_cog/sy.m07.d12:syMA.commemoration01as02.text	Τῇ αὐτῇ ἡμέρᾳ, μνήμη τῶν Ἁγίων Μαρτύρων Πρόκλου καὶ Ἱλαρίου.
ltx/gr_gr_cog/sy.m07.d12:syMA.commemoration02.couplet1.title	@ltx/gr_gr_cog/titles:ti.Verses
ltx/gr_gr_cog/sy.m07.d12:syMA.commemoration02.couplet1.verse1	Ζήσας, Μιχαήλ, ὡς ἄσαρκος ἐν βίῳ,
ltx/gr_gr_cog/sy.m07.d12:syMA.commemoration02.couplet1.verse2	Ὁμωνύμῳ νῦν συμπαρίστασαι Νόῳ.
ltx/gr_gr_cog/sy.m07.d12:syMA.commemoration02.text	Τῇ αὐτῇ ἡμέρᾳ, μνήμη τοῦ Ὁσίου Πατρὸς ἡμῶν Μιχαὴλ τοῦ Μαλεΐνου, ὃς ἐχρημάτισε πατὴρ πνευματικὸς τοῦ Ἁγίου Ἀθανασίου, τοῦ ἐν τῷ Ἄθῳ.
ltx/gr_gr_cog/sy.m07.d12:syMA.commemoration03.couplet1.title	@ltx/gr_gr_cog/titles:ti.Verses
ltx/gr_gr_cog/sy.m07.d12:syMA.commemoration03.couplet1.verse1	Πῖόν τι Χριστῷ θῦμα καὶ Σεραπίων,
ltx/gr_gr_cog/sy.m07.d12:syMA.commemoration03.couplet1.verse2	Χριστοῦ παρʼ ἐχθρῶν εἰς τὸ πῦρ βεβλημένος.
ltx/gr_gr_cog/sy.m07.d12:syMA.commemoration03.couplet2.verse1	Ὡς ἅρμα αἷμα τετράιππον εἰς Πόλον
ltx/gr_gr_cog/sy.m07.d12:syMA.commemoration03.couplet2.verse2	Εὑροῦσα, ἐξώρμησε τετρὰς Μαρτύρων.
ltx/gr_gr_cog/sy.m07.d12:syMA.commemoration03.couplet3.verse1	Μάμαντα ἂν δὲ ἀγέραστον παρίδω,
ltx/gr_gr_cog/sy.m07.d12:syMA.commemoration03.couplet3.verse2	Πῶς ἂν φανείην φίλος εἶναι Μαρτύρων;
ltx/gr_gr_cog/sy.m07.d12:syMA.commemoration03.text	Τῇ αὐτῇ ἡμέρᾳ, μνήμη τοῦ Ἁγίου Μάρτυρος Σεραπίωνος· καὶ τῶν Ἁγίων Μαρτύρων Ἀνδρέου τοῦ στρατηλάτου, Ἡρακλείου, Φαύστου, Μηνᾶ, καὶ τῆς συνοδείας αὐτῶν· καὶ τοῦ Ἁγίου Μάρτυρος Μάμαντος, πέραν ἐν τῷ Σίγματι.
ltx/gr_gr_cog/sy.m07.d12:syMA.commemoration04.couplet1.title	@ltx/gr_gr_cog/titles:ti.Verses
ltx/gr_gr_cog/sy.m07.d12:syMA.commemoration04.couplet1.verse1	Ὅλου νοητῶς δράττεταί σου νῦν, Λόγε,
ltx/gr_gr_cog/sy.m07.d12:syMA.commemoration04.couplet1.verse2	Ἡ κρασπέδου σου πρὶν μόνον δραξαμένη.
ltx/gr_gr_cog/sy.m07.d12:syMA.commemoration04.text	Ἡ Ἁγία Βερονίκη ἡ αἱμοῤῥοοῦσα, ἣν ἰάσατο ὁ Χριστός, ἐν εἰρήνῃ τελειοῦται.
ltx/gr_gr_cog/sy.m07.d12:syMA.commemoration05.couplet1.title	@ltx/gr_gr_cog/titles:ti.Verses
ltx/gr_gr_cog/sy.m07.d12:syMA.commemoration05.couplet1.verse1	Ζήσας Παΐσιος μόνος Θεῷ μόνῳ,
ltx/gr_gr_cog/sy.m07.d12:syMA.commemoration05.couplet1.verse2	Πολλοὺς τεθλιμμένους ἐκούφισεν πόνων.
ltx/gr_gr_cog/sy.m07.d12:syMA.commemoration05.couplet2.verse1	Ἡνωμένος γὰρ τῷ Θεῷ διʼ ἀγάπης,
ltx/gr_gr_cog/sy.m07.d12:syMA.commemoration05.couplet2.verse2	Παραμυθεῖσθαι πάντας εἴληφεν χάριν.
ltx/gr_gr_cog/sy.m07.d12:syMA.commemoration05.narration.p01	
ltx/gr_gr_cog/sy.m07.d12:syMA.commemoration05.single1	Δωδεκάτῃ Παΐσιος ἀνέσπερον αὐγὴν εἶδε.
ltx/gr_gr_cog/sy.m07.d12:syMA.commemoration05.text	Τῇ αὐτῇ ἡμέρᾳ, μνήμη τοῦ ὁσίου Πατρὸς ἡμῶν Παϊσίου τοῦ νέου τοῦ Ἁγιορείτου, τελειωθέντος ἐν εἰρήνῃ, ἐν ἔτει χιλιοστῷ ἐννεακοσιοστῷ ἐνενηκοστῷ τετάρτῳ (1994).
ltx/gr_gr_cog/sy.m07.d12:syMA.lastline	Ταῖς αὐτῶν ἁγίαις πρεσβείαις, ὁ Θεός, ἐλέησον ἡμᾶς. Ἀμήν.
