ltx/gr_gr_cog/le.go.me.m11.d13:lemeLI.Gospel.book_abbr	@ltx/gr_gr_cog/le.go.ge.hierarch:legeLI.Gospel.book_abbr
ltx/gr_gr_cog/le.go.me.m11.d13:lemeLI.Gospel.book_string	@ltx/gr_gr_cog/le.go.ge.hierarch:legeLI.Gospel.book_string
ltx/gr_gr_cog/le.go.me.m11.d13:lemeLI.Gospel.chapverse	@ltx/gr_gr_cog/le.go.ge.hierarch:legeLI.Gospel.chapverse
ltx/gr_gr_cog/le.go.me.m11.d13:lemeLI.Gospel.incipit	@ltx/gr_gr_cog/le.go.ge.hierarch:legeLI.Gospel.incipit
ltx/gr_gr_cog/le.go.me.m11.d13:lemeLI.Gospel.text	@ltx/gr_gr_cog/le.go.ge.hierarch:legeLI.Gospel.text
ltx/gr_gr_cog/le.go.me.m11.d13:lemeLI.Gospel.title	Τοῦ Ἱεράρχου
ltx/gr_gr_cog/le.go.me.m11.d13:lemeLI.Gospel.title_abbr	Τοῦ Ἱεράρχου
ltx/gr_gr_cog/le.go.me.m11.d13:lemeLI.Gospel.version	@ltx/gr_gr_cog/le.go.ge.hierarch:legeLI.Gospel.version
ltx/gr_gr_cog/le.go.me.m11.d13:lemeMA.Gospel.book_abbr	@ltx/gr_gr_cog/le.go.ge.hierarch:legeMA.Gospel.book_abbr
ltx/gr_gr_cog/le.go.me.m11.d13:lemeMA.Gospel.book_string	@ltx/gr_gr_cog/le.go.ge.hierarch:legeMA.Gospel.book_string
ltx/gr_gr_cog/le.go.me.m11.d13:lemeMA.Gospel.chapverse	@ltx/gr_gr_cog/le.go.ge.hierarch:legeMA.Gospel.chapverse
ltx/gr_gr_cog/le.go.me.m11.d13:lemeMA.Gospel.incipit	@ltx/gr_gr_cog/le.go.ge.hierarch:legeMA.Gospel.incipit
ltx/gr_gr_cog/le.go.me.m11.d13:lemeMA.Gospel.text	@ltx/gr_gr_cog/le.go.ge.hierarch:legeMA.Gospel.text
ltx/gr_gr_cog/le.go.me.m11.d13:lemeMA.Gospel.title	Τοῦ Ἱεράρχου
ltx/gr_gr_cog/le.go.me.m11.d13:lemeMA.Gospel.title_abbr	Τοῦ Ἱεράρχου
ltx/gr_gr_cog/le.go.me.m11.d13:lemeMA.Gospel.version	@ltx/gr_gr_cog/le.go.ge.hierarch:legeMA.Gospel.version
