ltx/gr_gr_cog/oc.m1.d6:ocBK.ModeNaked	@ltx/gr_gr_cog/miscellanea:misc.Mode1.naked
ltx/gr_gr_cog/oc.m1.d6:ocLI.Beatitudes1.incipit	@ltx/gr_gr_cog/oc.m1.d1:ocLI.Beatitudes1.incipit
ltx/gr_gr_cog/oc.m1.d6:ocLI.Beatitudes1.melody	@ltx/gr_gr_cog/he.h.m1:heHE.StereothitoIKardiaMou.name
ltx/gr_gr_cog/oc.m1.d6:ocLI.Beatitudes1.mode	@ltx/gr_gr_cog/miscellanea:misc.Mode1
ltx/gr_gr_cog/oc.m1.d6:ocLI.Beatitudes1.text	@ltx/gr_gr_cog/oc.m1.d1:ocLI.Beatitudes1.text
ltx/gr_gr_cog/oc.m1.d6:ocLI.Beatitudes2.incipit	Σταυρωθεὶς ὁ ἀναμάρτητος, τὰς ἁμαρτίας…
ltx/gr_gr_cog/oc.m1.d6:ocLI.Beatitudes2.melody	@ltx/gr_gr_cog/he.h.m1:heHE.StereothitoIKardiaMou.name
ltx/gr_gr_cog/oc.m1.d6:ocLI.Beatitudes2.mode	@ltx/gr_gr_cog/miscellanea:misc.Mode1
ltx/gr_gr_cog/oc.m1.d6:ocLI.Beatitudes2.text	Σταυρωθεὶς ὁ ἀναμάρτητος, τὰς ἁμαρτίας πάντων ᾖρας Χριστέ, καὶ λογχευθείς σου τὴν πλευράν, σωτηρίας κρουνοὺς ἔβλυσας, αἵματος καὶ ὕδατος ἀναπλάττων, τοὺς συντετριμμένους φθορᾷ.
ltx/gr_gr_cog/oc.m1.d6:ocLI.Beatitudes3.incipit	Ἐπὶ ξύλου καθηλούμενος, ἐθελουσίως Ἰησοῦ…
ltx/gr_gr_cog/oc.m1.d6:ocLI.Beatitudes3.melody	@ltx/gr_gr_cog/he.h.m1:heHE.StereothitoIKardiaMou.name
ltx/gr_gr_cog/oc.m1.d6:ocLI.Beatitudes3.mode	@ltx/gr_gr_cog/miscellanea:misc.Mode1
ltx/gr_gr_cog/oc.m1.d6:ocLI.Beatitudes3.text	Ἐπὶ ξύλου καθηλούμενος, ἐθελουσίως Ἰησοῦ ὁ Θεός, ἄπαν ἐξήλωσας Ἀδάμ, ἐμπαθὲς Οἰκτίρμον νόημα, τραύμασι τιμίοις δέ, τῶν δαιμόνων, πληθὺν ἐτραυμάτισας.
ltx/gr_gr_cog/oc.m1.d6:ocLI.Beatitudes4.incipit	Οἱ τὰ Πάθη μιμησάμενοι, τοῦ…
ltx/gr_gr_cog/oc.m1.d6:ocLI.Beatitudes4.melody	@ltx/gr_gr_cog/he.h.m1:heHE.StereothitoIKardiaMou.name
ltx/gr_gr_cog/oc.m1.d6:ocLI.Beatitudes4.mode	@ltx/gr_gr_cog/miscellanea:misc.Mode1
ltx/gr_gr_cog/oc.m1.d6:ocLI.Beatitudes4.text	Οἱ τὰ Πάθη μιμησάμενοι, τοῦ ἑκουσίως πεπονθότος σαρκί, Μάρτυρες ἔνδοξοι ἀεί, πάθη παύετε δυσίατα, νόσους τε διώκετε, τῶν ἀνθρώπων, ἰσχύϊ τοῦ Πνεύματος.
ltx/gr_gr_cog/oc.m1.d6:ocLI.BeatitudesT.incipit	Τῷ Σταυρῷ σε καθηλούμενον, ὡς…
ltx/gr_gr_cog/oc.m1.d6:ocLI.BeatitudesT.melody	@ltx/gr_gr_cog/he.h.m1:heHE.StereothitoIKardiaMou.name
ltx/gr_gr_cog/oc.m1.d6:ocLI.BeatitudesT.mode	@ltx/gr_gr_cog/miscellanea:misc.Mode1
ltx/gr_gr_cog/oc.m1.d6:ocLI.BeatitudesT.text	Τῷ Σταυρῷ σε καθηλούμενον, ὡς ἐθεάσατο Χριστὲ ὁ Θεός, ἡ σὲ κυήσασα σαρκί, θρηνῳδοῦσα ἀπεφθέγγετο. Τί σοι ἀνταπέδωκεν, ὦ Υἱέ μου, δῆμος ὁ ἀχάριστος;
ltx/gr_gr_cog/oc.m1.d6:ocLI.BeatitudesTr.incipit	Ἰσοδύναμον ὁμότιμον, σὲ τὴν Τριάδα…
ltx/gr_gr_cog/oc.m1.d6:ocLI.BeatitudesTr.melody	@ltx/gr_gr_cog/he.h.m1:heHE.StereothitoIKardiaMou.name
ltx/gr_gr_cog/oc.m1.d6:ocLI.BeatitudesTr.mode	@ltx/gr_gr_cog/miscellanea:misc.Mode1
ltx/gr_gr_cog/oc.m1.d6:ocLI.BeatitudesTr.text	Ἰσοδύναμον ὁμότιμον, σὲ τὴν Τριάδα ὀνομάζομεν, Πατέρα ἄναρχον Θεόν, καὶ Υἱὸν καὶ Πνεῦμα ἅγιον, μίαν τρισυπόστατον, θεαρχίαν, πιστῶς μεγαλύνοντες.
ltx/gr_gr_cog/oc.m1.d6:ocLI.MM.Beatitudes1234TrTas78910GB.text	@ltx/gr_gr_cog/properties:media.key
ltx/gr_gr_cog/oc.m1.d6:ocMA.ApolTheotokion.incipit	@ltx/gr_gr_cog/oc.m1.d2:ocMA.Kathisma13.incipit
ltx/gr_gr_cog/oc.m1.d6:ocMA.ApolTheotokion.melody	
ltx/gr_gr_cog/oc.m1.d6:ocMA.ApolTheotokion.mode	@ltx/gr_gr_cog/miscellanea:misc.Mode1
ltx/gr_gr_cog/oc.m1.d6:ocMA.ApolTheotokion.text	@ltx/gr_gr_cog/oc.m1.d2:ocMA.Kathisma13.text
ltx/gr_gr_cog/oc.m1.d6:ocMA.AposTheotokion.greekmelody	@ltx/gr_gr_cog/he.a.m1:heAU.PaneffimoiMartyres.greekname
ltx/gr_gr_cog/oc.m1.d6:ocMA.AposTheotokion.incipit	Ὑψώθης Οἰκτίρμον ἐν Σταυρῷ, ὡς…
ltx/gr_gr_cog/oc.m1.d6:ocMA.AposTheotokion.melody	@ltx/gr_gr_cog/he.a.m1:heAU.PaneffimoiMartyres.name
ltx/gr_gr_cog/oc.m1.d6:ocMA.AposTheotokion.mode	@ltx/gr_gr_cog/miscellanea:misc.Mode1
ltx/gr_gr_cog/oc.m1.d6:ocMA.AposTheotokion.text	Ὑψώθης Οἰκτίρμον ἐν Σταυρῷ, ὡς ἀρνίον ἄκακον, ἐθελουσίως σφαττόμενος, τέκνον γλυκύτατον, ἐν κλαυθμῷ ἐβόα, ἡ Ἀμνὰς ἡ ἄσπιλος, ὁρῶσα ἐπὶ ξύλου τὸν Κύριον, ἐγὼ δὲ πίμπραμαι, τὴν καρδίαν καὶ τιτρώσκομαι, ἀλλʼ ὑμνῶ σου τὸ ἄμετρον ἔλεος.
ltx/gr_gr_cog/oc.m1.d6:ocMA.Aposticha1.incipit	@ltx/gr_gr_cog/oc.m1.d4:ocMA.Aposticha1.incipit
ltx/gr_gr_cog/oc.m1.d6:ocMA.Aposticha1.melody	
ltx/gr_gr_cog/oc.m1.d6:ocMA.Aposticha1.mode	@ltx/gr_gr_cog/miscellanea:misc.Mode1
ltx/gr_gr_cog/oc.m1.d6:ocMA.Aposticha1.text	@ltx/gr_gr_cog/oc.m1.d4:ocMA.Aposticha1.text
ltx/gr_gr_cog/oc.m1.d6:ocMA.Aposticha2.incipit	@ltx/gr_gr_cog/oc.m1.d4:ocMA.Aposticha2.incipit
ltx/gr_gr_cog/oc.m1.d6:ocMA.Aposticha2.melody	
ltx/gr_gr_cog/oc.m1.d6:ocMA.Aposticha2.mode	@ltx/gr_gr_cog/miscellanea:misc.Mode1
ltx/gr_gr_cog/oc.m1.d6:ocMA.Aposticha2.text	@ltx/gr_gr_cog/oc.m1.d4:ocMA.Aposticha2.text
ltx/gr_gr_cog/oc.m1.d6:ocMA.Aposticha3.incipit	@ltx/gr_gr_cog/oc.m1.d2:ocMA.Aposticha3.incipit
ltx/gr_gr_cog/oc.m1.d6:ocMA.Aposticha3.melody	
ltx/gr_gr_cog/oc.m1.d6:ocMA.Aposticha3.mode	@ltx/gr_gr_cog/miscellanea:misc.Mode1
ltx/gr_gr_cog/oc.m1.d6:ocMA.Aposticha3.text	@ltx/gr_gr_cog/oc.m1.d2:ocMA.Aposticha3.text
ltx/gr_gr_cog/oc.m1.d6:ocMA.C1.acrostic.notice1	οὗ ἡ ἀκροστιχις, ἄνευ τῶν Θεοτοκίων·
ltx/gr_gr_cog/oc.m1.d6:ocMA.C1.acrostic.text	Πάθο(ς τὸ σ)επτὸν αἰνέσω τοῦ Δεσπότου. Ὁ Ἰωσήφ.
ltx/gr_gr_cog/oc.m1.d6:ocMA.C1.acrostic.title	Κανὼν Σταυρώσιμος,
ltx/gr_gr_cog/oc.m1.d6:ocMA.C1.poet	@ltx/gr_gr_cog/poets:po.KyriouIosif
ltx/gr_gr_cog/oc.m1.d6:ocMA.C2.poet	@ltx/gr_gr_cog/poets:po.IoannouTouDamaskinou
ltx/gr_gr_cog/oc.m1.d6:ocMA.CA.notice	
ltx/gr_gr_cog/oc.m1.d6:ocMA.Kathisma11.incipit	@ltx/gr_gr_cog/oc.m1.d4:ocMA.Kathisma11.incipit
ltx/gr_gr_cog/oc.m1.d6:ocMA.Kathisma11.melody	
ltx/gr_gr_cog/oc.m1.d6:ocMA.Kathisma11.mode	@ltx/gr_gr_cog/miscellanea:misc.Mode1
ltx/gr_gr_cog/oc.m1.d6:ocMA.Kathisma11.text	@ltx/gr_gr_cog/oc.m1.d4:ocMA.Kathisma11.text
ltx/gr_gr_cog/oc.m1.d6:ocMA.Kathisma12.incipit	@ltx/gr_gr_cog/oc.m1.d4:ocMA.Kathisma12.incipit
ltx/gr_gr_cog/oc.m1.d6:ocMA.Kathisma12.melody	
ltx/gr_gr_cog/oc.m1.d6:ocMA.Kathisma12.mode	@ltx/gr_gr_cog/miscellanea:misc.Mode1
ltx/gr_gr_cog/oc.m1.d6:ocMA.Kathisma12.text	@ltx/gr_gr_cog/oc.m1.d4:ocMA.Kathisma12.text
ltx/gr_gr_cog/oc.m1.d6:ocMA.Kathisma13.greekmelody	@ltx/gr_gr_cog/he.a.m1:heAU.TonTafonSouSotir.greekname
ltx/gr_gr_cog/oc.m1.d6:ocMA.Kathisma13.incipit	Σταυρῷ σου τοὺς ἐχθρούς…
ltx/gr_gr_cog/oc.m1.d6:ocMA.Kathisma13.melody	@ltx/gr_gr_cog/he.a.m1:heAU.TonTafonSouSotir.name
ltx/gr_gr_cog/oc.m1.d6:ocMA.Kathisma13.mode	@ltx/gr_gr_cog/miscellanea:misc.Mode1
ltx/gr_gr_cog/oc.m1.d6:ocMA.Kathisma13.text	Σταυρῷ σου τοὺς ἐχθρούς, τροπωσάμενος Σῶτερ, διάλυσον αὐτῶν, τὰς αἱρέσεις ὡς κόνιν, τὸ κέρας δὲ ἀνύψωσον, τῆς σεπτῆς Ἐκκλησίας σου, στῆσον, Κύριε, τὴν καθʼ ἡμῶν τούτων ζάλην, καὶ εἰρήνευσον, τῶν Ὀρθοδόξων τὰ πλήθη, εὐχαῖς τῆς Τεκούσης σε.
ltx/gr_gr_cog/oc.m1.d6:ocMA.Kathisma21.greekmelody	@ltx/gr_gr_cog/he.a.m1:heAU.TouLithouSfragisthentos.greekname
ltx/gr_gr_cog/oc.m1.d6:ocMA.Kathisma21.incipit	@ltx/gr_gr_cog/oc.m1.d4:ocMA.Kathisma21.incipit
ltx/gr_gr_cog/oc.m1.d6:ocMA.Kathisma21.melody	@ltx/gr_gr_cog/he.a.m1:heAU.TouLithouSfragisthentos.name
ltx/gr_gr_cog/oc.m1.d6:ocMA.Kathisma21.mode	@ltx/gr_gr_cog/miscellanea:misc.Mode1
ltx/gr_gr_cog/oc.m1.d6:ocMA.Kathisma21.text	@ltx/gr_gr_cog/oc.m1.d4:ocMA.Kathisma21.text
ltx/gr_gr_cog/oc.m1.d6:ocMA.Kathisma22.greekmelody	@ltx/gr_gr_cog/he.a.m1:heAU.TonTafonSouSotir.greekname
ltx/gr_gr_cog/oc.m1.d6:ocMA.Kathisma22.incipit	@ltx/gr_gr_cog/oc.m1.d4:ocMA.Kathisma22.incipit
ltx/gr_gr_cog/oc.m1.d6:ocMA.Kathisma22.melody	@ltx/gr_gr_cog/he.a.m1:heAU.TonTafonSouSotir.name
ltx/gr_gr_cog/oc.m1.d6:ocMA.Kathisma22.mode	@ltx/gr_gr_cog/miscellanea:misc.Mode1
ltx/gr_gr_cog/oc.m1.d6:ocMA.Kathisma22.text	@ltx/gr_gr_cog/oc.m1.d4:ocMA.Kathisma22.text
ltx/gr_gr_cog/oc.m1.d6:ocMA.Kathisma23.greekmelody	@ltx/gr_gr_cog/he.a.m1:heAU.TonTafonSouSotir.greekname
ltx/gr_gr_cog/oc.m1.d6:ocMA.Kathisma23.incipit	Ὁρῶσά σε νεκρόν…
ltx/gr_gr_cog/oc.m1.d6:ocMA.Kathisma23.melody	@ltx/gr_gr_cog/he.a.m1:heAU.TonTafonSouSotir.name
ltx/gr_gr_cog/oc.m1.d6:ocMA.Kathisma23.mode	@ltx/gr_gr_cog/miscellanea:misc.Mode1
ltx/gr_gr_cog/oc.m1.d6:ocMA.Kathisma23.text	Ὁρῶσά σε νεκρόν, καὶ γυμνὸν ἐπὶ ξύλου, τιτρώσκομαι δεινῶς, καὶ δονοῦμαι τὰ σπλάγχνα, Υἱέ μου ὑπεράγαθε, καὶ Θεὲ παντοδύναμε, ἡ πανάμωμος, ἐν στεναγμοῖς ἀνεβόα· ἣν ὑμνήσωμεν, ὡς τοῦ Κυρίου Μητέρα, καὶ πίστει δοξάσωμεν.
ltx/gr_gr_cog/oc.m1.d6:ocMA.Kathisma31.greekmelody	@ltx/gr_gr_cog/he.a.m1:heAU.TonTafonSouSotir.greekname
ltx/gr_gr_cog/oc.m1.d6:ocMA.Kathisma31.incipit	Σταυρῷ προσηλωθείς…
ltx/gr_gr_cog/oc.m1.d6:ocMA.Kathisma31.melody	@ltx/gr_gr_cog/he.a.m1:heAU.TonTafonSouSotir.name
ltx/gr_gr_cog/oc.m1.d6:ocMA.Kathisma31.mode	@ltx/gr_gr_cog/miscellanea:misc.Mode1
ltx/gr_gr_cog/oc.m1.d6:ocMA.Kathisma31.text	Σταυρῷ προσηλωθείς, ἑκουσίως Οἰκτίρμον, ἐθέωσας ἡμῶν, τὴν φθαρεῖσαν οὐσίαν, καὶ τὸν ἀνθρωπόλεθρον, ἐθανάτωσας δράκοντα, ἀλλὰ στήριξον, ὀρθοδοξίᾳ τὸν κόσμον καὶ κατάβαλε, αἱρετικῶν τὰς ἐπάρσεις, Σταυρῷ τῷ τιμίῳ σου.
ltx/gr_gr_cog/oc.m1.d6:ocMA.Kathisma32.incipit	@ltx/gr_gr_cog/oc.m1.d2:ocMA.Kathisma32.incipit
ltx/gr_gr_cog/oc.m1.d6:ocMA.Kathisma32.melody	
ltx/gr_gr_cog/oc.m1.d6:ocMA.Kathisma32.mode	@ltx/gr_gr_cog/miscellanea:misc.Mode1
ltx/gr_gr_cog/oc.m1.d6:ocMA.Kathisma32.text	@ltx/gr_gr_cog/oc.m1.d2:ocMA.Kathisma32.text
ltx/gr_gr_cog/oc.m1.d6:ocMA.Kathisma33.greekmelody	@ltx/gr_gr_cog/he.a.m1:heAU.TonTafonSouSotir.greekname
ltx/gr_gr_cog/oc.m1.d6:ocMA.Kathisma33.incipit	@ltx/gr_gr_cog/oc.m1.d4:ocMA.Kathisma33.incipit
ltx/gr_gr_cog/oc.m1.d6:ocMA.Kathisma33.melody	@ltx/gr_gr_cog/he.a.m1:heAU.TonTafonSouSotir.name
ltx/gr_gr_cog/oc.m1.d6:ocMA.Kathisma33.mode	@ltx/gr_gr_cog/miscellanea:misc.Mode1
ltx/gr_gr_cog/oc.m1.d6:ocMA.Kathisma33.text	@ltx/gr_gr_cog/oc.m1.d4:ocMA.Kathisma33.text
ltx/gr_gr_cog/oc.m1.d6:ocMA.OdeW1C11.incipit	Παθεῖν ἠνέσχου διʼ ἡμᾶς, ὁ…
ltx/gr_gr_cog/oc.m1.d6:ocMA.OdeW1C11.melody	@ltx/gr_gr_cog/he.h.m1:heHE.ToVoithisantiTheo.name
ltx/gr_gr_cog/oc.m1.d6:ocMA.OdeW1C11.mode	@ltx/gr_gr_cog/miscellanea:misc.Mode1
ltx/gr_gr_cog/oc.m1.d6:ocMA.OdeW1C11.ode	@ltx/gr_gr_cog/miscellanea:misc.Ode1
ltx/gr_gr_cog/oc.m1.d6:ocMA.OdeW1C11.text	Παθεῖν ἠνέσχου διʼ ἡμᾶς, ὁ τῇ φύσει ἀπαθής, καὶ σταυρωθεὶς μετὰ λῃστῶν, τὸν ἀρχέκακον ἐχθρόν, ἐθανάτωσας Λόγε καὶ ἔσωσας, τοὺς ἀνυμνοῦντάς σε.
ltx/gr_gr_cog/oc.m1.d6:ocMA.OdeW1C12.incipit	Ἀνατολὴ ἀνατολῶν, χρηματίζων πρὸς δυσμάς…
ltx/gr_gr_cog/oc.m1.d6:ocMA.OdeW1C12.melody	@ltx/gr_gr_cog/he.h.m1:heHE.ToVoithisantiTheo.name
ltx/gr_gr_cog/oc.m1.d6:ocMA.OdeW1C12.mode	@ltx/gr_gr_cog/miscellanea:misc.Mode1
ltx/gr_gr_cog/oc.m1.d6:ocMA.OdeW1C12.ode	@ltx/gr_gr_cog/miscellanea:misc.Ode1
ltx/gr_gr_cog/oc.m1.d6:ocMA.OdeW1C12.text	Ἀνατολὴ ἀνατολῶν, χρηματίζων πρὸς δυσμάς, τῆς ἀπωσμένης Ἰησοῦ, ἦλθες φύσεως ἡμῶν, ὃν ὁ ἥλιος βλέπων κρεμάμενον, τὸ φῶς συνέστειλεν.
ltx/gr_gr_cog/oc.m1.d6:ocMA.OdeW1C13.incipit	Θάνατον πρόξενον ζωῆς, αἰωνίου Ἀθληταί…
ltx/gr_gr_cog/oc.m1.d6:ocMA.OdeW1C13.melody	@ltx/gr_gr_cog/he.h.m1:heHE.ToVoithisantiTheo.name
ltx/gr_gr_cog/oc.m1.d6:ocMA.OdeW1C13.mode	@ltx/gr_gr_cog/miscellanea:misc.Mode1
ltx/gr_gr_cog/oc.m1.d6:ocMA.OdeW1C13.ode	@ltx/gr_gr_cog/miscellanea:misc.Ode1
ltx/gr_gr_cog/oc.m1.d6:ocMA.OdeW1C13.text	Θάνατον πρόξενον ζωῆς, αἰωνίου Ἀθληταί, ἀνταλλαξάμενοι καλῶς, βασιλείας οὐρανῶν ἠξιώθητε· ὅθεν δοξάζεσθε, καὶ μακαρίζεσθε.
ltx/gr_gr_cog/oc.m1.d6:ocMA.OdeW1C14.incipit	Οἱ τὰ παθήματα Χριστοῦ, μιμησάμενοι…
ltx/gr_gr_cog/oc.m1.d6:ocMA.OdeW1C14.melody	@ltx/gr_gr_cog/he.h.m1:heHE.ToVoithisantiTheo.name
ltx/gr_gr_cog/oc.m1.d6:ocMA.OdeW1C14.mode	@ltx/gr_gr_cog/miscellanea:misc.Mode1
ltx/gr_gr_cog/oc.m1.d6:ocMA.OdeW1C14.ode	@ltx/gr_gr_cog/miscellanea:misc.Ode1
ltx/gr_gr_cog/oc.m1.d6:ocMA.OdeW1C14.text	Οἱ τὰ παθήματα Χριστοῦ, μιμησάμενοι καλῶς, πάθη ἰᾶσθε τῶν βροτῶν, χειρουργίᾳ μυστικῇ, καὶ διώκετε λόγῳ τὰ πνεύματα, ἅγιοι Μάρτυρες.
ltx/gr_gr_cog/oc.m1.d6:ocMA.OdeW1C1H.greekmelody	@ltx/gr_gr_cog/he.h.m1:heHE.ToVoithisantiTheo.greekname
ltx/gr_gr_cog/oc.m1.d6:ocMA.OdeW1C1H.incipit	@ltx/gr_gr_cog/he.h.m1:heHE.ToVoithisantiTheo.incipit
ltx/gr_gr_cog/oc.m1.d6:ocMA.OdeW1C1H.melody	@ltx/gr_gr_cog/he.h.m1:heHE.ToVoithisantiTheo.melody
ltx/gr_gr_cog/oc.m1.d6:ocMA.OdeW1C1H.mode	@ltx/gr_gr_cog/miscellanea:misc.Mode1
ltx/gr_gr_cog/oc.m1.d6:ocMA.OdeW1C1H.ode	@ltx/gr_gr_cog/miscellanea:misc.Ode1
ltx/gr_gr_cog/oc.m1.d6:ocMA.OdeW1C1H.text	@ltx/gr_gr_cog/he.h.m1:heHE.ToVoithisantiTheo.text
ltx/gr_gr_cog/oc.m1.d6:ocMA.OdeW1C1T.incipit	Ὥσπερ ἀμνὸν ἐπὶ Σταυροῦ, καθορῶσα…
ltx/gr_gr_cog/oc.m1.d6:ocMA.OdeW1C1T.melody	@ltx/gr_gr_cog/he.h.m1:heHE.ToVoithisantiTheo.name
ltx/gr_gr_cog/oc.m1.d6:ocMA.OdeW1C1T.mode	@ltx/gr_gr_cog/miscellanea:misc.Mode1
ltx/gr_gr_cog/oc.m1.d6:ocMA.OdeW1C1T.ode	@ltx/gr_gr_cog/miscellanea:misc.Ode1
ltx/gr_gr_cog/oc.m1.d6:ocMA.OdeW1C1T.text	Ὥσπερ ἀμνὸν ἐπὶ Σταυροῦ, καθορῶσα ἡ Ἀμνάς, ἀναρτηθέντα τὸν Χριστόν, ἀλαλάζει καὶ βοᾷ· Ποῦ σου ἔδυ τὸ κάλλος μακρόθυμε, Υἱὲ προάναρχε;
ltx/gr_gr_cog/oc.m1.d6:ocMA.OdeW1C21.greekmelody	@ltx/gr_gr_cog/he.h.m1:heHE.ToVoithisantiTheo.greekname
ltx/gr_gr_cog/oc.m1.d6:ocMA.OdeW1C21.incipit	Ἐν τῷ πελάγει τῶν δεινῶν…
ltx/gr_gr_cog/oc.m1.d6:ocMA.OdeW1C21.melody	@ltx/gr_gr_cog/he.h.m1:heHE.ToVoithisantiTheo.name
ltx/gr_gr_cog/oc.m1.d6:ocMA.OdeW1C21.mode	@ltx/gr_gr_cog/miscellanea:misc.Mode1
ltx/gr_gr_cog/oc.m1.d6:ocMA.OdeW1C21.ode	@ltx/gr_gr_cog/miscellanea:misc.Ode1
ltx/gr_gr_cog/oc.m1.d6:ocMA.OdeW1C21.text	Ἐν τῷ πελάγει τῶν δεινῶν, καὶ τῇ ζάλῃ τῶν παθῶν, κλυδωνιζόμενος ἐγώ, τὴν σὴν ἄχραντε Σεμνή, ἐπικαλοῦμαι γαλήνην, διάσωσόν με· λιμὴν γὰρ εἶ τῶν πιστῶν.
ltx/gr_gr_cog/oc.m1.d6:ocMA.OdeW1C22.incipit	Προκαθαρθεῖσα τὴν ψυχήν, θείου Πνεύματος…
ltx/gr_gr_cog/oc.m1.d6:ocMA.OdeW1C22.melody	@ltx/gr_gr_cog/he.h.m1:heHE.ToVoithisantiTheo.name
ltx/gr_gr_cog/oc.m1.d6:ocMA.OdeW1C22.mode	@ltx/gr_gr_cog/miscellanea:misc.Mode1
ltx/gr_gr_cog/oc.m1.d6:ocMA.OdeW1C22.ode	@ltx/gr_gr_cog/miscellanea:misc.Ode1
ltx/gr_gr_cog/oc.m1.d6:ocMA.OdeW1C22.text	Προκαθαρθεῖσα τὴν ψυχήν, θείου Πνεύματος φωτί, ὅλον ἐδέξω ἐν γαστρί, τὸ ἀπαύγασμα Πατρός, διὸ τὸν ζόφον μου λῦσον τοῦ πταίσματος, Παρθένε ἄχραντε.
ltx/gr_gr_cog/oc.m1.d6:ocMA.OdeW1C23.incipit	Σὲ τὴν οὐράνιον σκηνήν, καὶ…
ltx/gr_gr_cog/oc.m1.d6:ocMA.OdeW1C23.melody	@ltx/gr_gr_cog/he.h.m1:heHE.ToVoithisantiTheo.name
ltx/gr_gr_cog/oc.m1.d6:ocMA.OdeW1C23.mode	@ltx/gr_gr_cog/miscellanea:misc.Mode1
ltx/gr_gr_cog/oc.m1.d6:ocMA.OdeW1C23.ode	@ltx/gr_gr_cog/miscellanea:misc.Ode1
ltx/gr_gr_cog/oc.m1.d6:ocMA.OdeW1C23.text	Σὲ τὴν οὐράνιον σκηνήν, καὶ ἁγίαν κιβωτόν, ἐν ᾗ τὸν οἶκον ἑαυτοῦ, ᾠκοδόμησε Χριστός, καὶ ἱλαστήριον ἔδειξεν εἰς σωτηρίαν, ἡμῶν μεγαλύνομεν.
ltx/gr_gr_cog/oc.m1.d6:ocMA.OdeW1C24.incipit	Σὺ εἶ τοῦ γένους τῶν…
ltx/gr_gr_cog/oc.m1.d6:ocMA.OdeW1C24.melody	@ltx/gr_gr_cog/he.h.m1:heHE.ToVoithisantiTheo.name
ltx/gr_gr_cog/oc.m1.d6:ocMA.OdeW1C24.mode	@ltx/gr_gr_cog/miscellanea:misc.Mode1
ltx/gr_gr_cog/oc.m1.d6:ocMA.OdeW1C24.ode	@ltx/gr_gr_cog/miscellanea:misc.Ode1
ltx/gr_gr_cog/oc.m1.d6:ocMA.OdeW1C24.text	Σὺ εἶ τοῦ γένους τῶν βροτῶν, ἀσφαλὴς καταφυγή, τεῖχος καὶ σκέπη καὶ λιμήν, καὶ προστάτις κραταιά, ἐν μοχθηροῖς τοῦ βίου πανύμνητε, Θεογεννήτρια.
ltx/gr_gr_cog/oc.m1.d6:ocMA.OdeW3C11.incipit	Ἐπὶ Σταυροῦ παλάμας ἥπλωσας, καὶ…
ltx/gr_gr_cog/oc.m1.d6:ocMA.OdeW3C11.melody	@ltx/gr_gr_cog/he.h.m1:heHE.StereothitoIKardiaMou.name
ltx/gr_gr_cog/oc.m1.d6:ocMA.OdeW3C11.mode	@ltx/gr_gr_cog/miscellanea:misc.Mode1
ltx/gr_gr_cog/oc.m1.d6:ocMA.OdeW3C11.ode	@ltx/gr_gr_cog/miscellanea:misc.Ode3
ltx/gr_gr_cog/oc.m1.d6:ocMA.OdeW3C11.text	Ἐπὶ Σταυροῦ παλάμας ἥπλωσας, καὶ δακτύλους θείους ᾑμάτωσας, ἔργον χειρῶν σου τὸν Ἀδάμ, φονικῆς χειρὸς Δέσποτα, ἐκλυτρούμενος, ὡς μόνος ἀγαθὸς καὶ φιλάνθρωπος.
ltx/gr_gr_cog/oc.m1.d6:ocMA.OdeW3C12.incipit	Πλευρὰν ἐνύγης λόγχῃ Δέσποτα, ἀνορθῶν…
ltx/gr_gr_cog/oc.m1.d6:ocMA.OdeW3C12.melody	@ltx/gr_gr_cog/he.h.m1:heHE.StereothitoIKardiaMou.name
ltx/gr_gr_cog/oc.m1.d6:ocMA.OdeW3C12.mode	@ltx/gr_gr_cog/miscellanea:misc.Mode1
ltx/gr_gr_cog/oc.m1.d6:ocMA.OdeW3C12.ode	@ltx/gr_gr_cog/miscellanea:misc.Ode3
ltx/gr_gr_cog/oc.m1.d6:ocMA.OdeW3C12.text	Πλευρὰν ἐνύγης λόγχῃ Δέσποτα, ἀνορθῶν πλευρᾶς τὸ ὀλίσθημα, ξύλῳ ὑψώθης τὸν ποτέ, ναυαγήσαντα ξύλου καρπῷ, πρὸς Παράδεισον εἰσάγων, σὺν Λῃστῇ τῷ εὐγνώμονι.
ltx/gr_gr_cog/oc.m1.d6:ocMA.OdeW3C13.incipit	Τῆς Ἐκκλησίας τὰ στηρίγματα, τὰ…
ltx/gr_gr_cog/oc.m1.d6:ocMA.OdeW3C13.melody	@ltx/gr_gr_cog/he.h.m1:heHE.StereothitoIKardiaMou.name
ltx/gr_gr_cog/oc.m1.d6:ocMA.OdeW3C13.mode	@ltx/gr_gr_cog/miscellanea:misc.Mode1
ltx/gr_gr_cog/oc.m1.d6:ocMA.OdeW3C13.ode	@ltx/gr_gr_cog/miscellanea:misc.Ode3
ltx/gr_gr_cog/oc.m1.d6:ocMA.OdeW3C13.text	Τῆς Ἐκκλησίας τὰ στηρίγματα, τὰ τῆς εὐσεβείας προπύργια, τοὺς καθαιρέτας τοῦ ἐχθροῦ, τοῦ Κυρίου τοὺς Μάρτυρας, διανοίᾳ καθαρᾷ, μελῳδικῶς ἀνυμνήσωμεν.
ltx/gr_gr_cog/oc.m1.d6:ocMA.OdeW3C14.incipit	Οἷά περ θεῖα ὄντες κλήματα…
ltx/gr_gr_cog/oc.m1.d6:ocMA.OdeW3C14.melody	@ltx/gr_gr_cog/he.h.m1:heHE.StereothitoIKardiaMou.name
ltx/gr_gr_cog/oc.m1.d6:ocMA.OdeW3C14.mode	@ltx/gr_gr_cog/miscellanea:misc.Mode1
ltx/gr_gr_cog/oc.m1.d6:ocMA.OdeW3C14.ode	@ltx/gr_gr_cog/miscellanea:misc.Ode3
ltx/gr_gr_cog/oc.m1.d6:ocMA.OdeW3C14.text	Οἷά περ θεῖα ὄντες κλήματα, νοητῆς ἀμπέλου οἱ Μάρτυρες, βότρυας ἤνεγκαν σαφῶς, καρτερίας προχέοντες οἶνον, πάντων τὰς καρδίας, τῶν πιστῶν κατευφραίνοντα.
ltx/gr_gr_cog/oc.m1.d6:ocMA.OdeW3C1H.greekmelody	@ltx/gr_gr_cog/he.h.m1:heHE.StereothitoIKardiaMou.greekname
ltx/gr_gr_cog/oc.m1.d6:ocMA.OdeW3C1H.incipit	@ltx/gr_gr_cog/he.h.m1:heHE.StereothitoIKardiaMou.incipit
ltx/gr_gr_cog/oc.m1.d6:ocMA.OdeW3C1H.melody	@ltx/gr_gr_cog/he.h.m1:heHE.StereothitoIKardiaMou.melody
ltx/gr_gr_cog/oc.m1.d6:ocMA.OdeW3C1H.mode	@ltx/gr_gr_cog/miscellanea:misc.Mode1
ltx/gr_gr_cog/oc.m1.d6:ocMA.OdeW3C1H.ode	@ltx/gr_gr_cog/miscellanea:misc.Ode3
ltx/gr_gr_cog/oc.m1.d6:ocMA.OdeW3C1H.text	@ltx/gr_gr_cog/he.h.m1:heHE.StereothitoIKardiaMou.text
ltx/gr_gr_cog/oc.m1.d6:ocMA.OdeW3C1T.incipit	Εὐλογημένος τῆς κοιλίας σου, ὁ…
ltx/gr_gr_cog/oc.m1.d6:ocMA.OdeW3C1T.melody	@ltx/gr_gr_cog/he.h.m1:heHE.StereothitoIKardiaMou.name
ltx/gr_gr_cog/oc.m1.d6:ocMA.OdeW3C1T.mode	@ltx/gr_gr_cog/miscellanea:misc.Mode1
ltx/gr_gr_cog/oc.m1.d6:ocMA.OdeW3C1T.ode	@ltx/gr_gr_cog/miscellanea:misc.Ode3
ltx/gr_gr_cog/oc.m1.d6:ocMA.OdeW3C1T.text	Εὐλογημένος τῆς κοιλίας σου, ὁ καρπὸς Παρθένε πανύμνητε, ὁ τοὺς φθαρέντας τῷ καρπῷ, διὰ ξύλου Σταυροῦ αὐτοῦ, ἀφθαρσίας καταστήσας, κοινωνοὺς θείᾳ χάριτι.
ltx/gr_gr_cog/oc.m1.d6:ocMA.OdeW3C21.greekmelody	@ltx/gr_gr_cog/he.h.m1:heHE.StereosonKyrie.greekname
ltx/gr_gr_cog/oc.m1.d6:ocMA.OdeW3C21.incipit	Ἐν τῷ φωτὶ Δέσποινα, τῷ…
ltx/gr_gr_cog/oc.m1.d6:ocMA.OdeW3C21.melody	@ltx/gr_gr_cog/he.h.m1:heHE.StereosonKyrie.name
ltx/gr_gr_cog/oc.m1.d6:ocMA.OdeW3C21.mode	@ltx/gr_gr_cog/miscellanea:misc.Mode1
ltx/gr_gr_cog/oc.m1.d6:ocMA.OdeW3C21.ode	@ltx/gr_gr_cog/miscellanea:misc.Ode3
ltx/gr_gr_cog/oc.m1.d6:ocMA.OdeW3C21.text	Ἐν τῷ φωτὶ Δέσποινα, τῷ τοῦ Υἱοῦ σου, τὸ ζοφῶδες τῶν ἐμῶν ἀγνοημάτων, μετὰ δακρύων σοῦ δέομαι, διασκέδασον τῇ σῇ πρεσβείᾳ.
ltx/gr_gr_cog/oc.m1.d6:ocMA.OdeW3C22.incipit	Ὡς ἔχουσα Πανάχραντε, θαυμάτων ἄβυσσον…
ltx/gr_gr_cog/oc.m1.d6:ocMA.OdeW3C22.melody	@ltx/gr_gr_cog/he.h.m1:heHE.StereosonKyrie.name
ltx/gr_gr_cog/oc.m1.d6:ocMA.OdeW3C22.mode	@ltx/gr_gr_cog/miscellanea:misc.Mode1
ltx/gr_gr_cog/oc.m1.d6:ocMA.OdeW3C22.ode	@ltx/gr_gr_cog/miscellanea:misc.Ode3
ltx/gr_gr_cog/oc.m1.d6:ocMA.OdeW3C22.text	Ὡς ἔχουσα Πανάχραντε, θαυμάτων ἄβυσσον, καὶ πηγὴν ἰαμάτων, ταῖς πρεσβείαις σου ἀπόσμηξον, πάντα ῥύπον τῆς ἐμῆς ψυχῆς, τὸν ἐξ ἁμαρτίας.
ltx/gr_gr_cog/oc.m1.d6:ocMA.OdeW3C23.incipit	Τὸν ἄῤῥητον τόκον σου, εὐλογημένη…
ltx/gr_gr_cog/oc.m1.d6:ocMA.OdeW3C23.melody	@ltx/gr_gr_cog/he.h.m1:heHE.StereosonKyrie.name
ltx/gr_gr_cog/oc.m1.d6:ocMA.OdeW3C23.mode	@ltx/gr_gr_cog/miscellanea:misc.Mode1
ltx/gr_gr_cog/oc.m1.d6:ocMA.OdeW3C23.ode	@ltx/gr_gr_cog/miscellanea:misc.Ode3
ltx/gr_gr_cog/oc.m1.d6:ocMA.OdeW3C23.text	Τὸν ἄῤῥητον τόκον σου, εὐλογημένη προσκυνοῦμεν, εἰς πρεσβείαν σε καλοῦντες, δυσώπησον Ἁγνὴ πάσης ἀνάγκης λυτρωθῆναι, τοὺς σὲ ἀνυμνοῦντας.
ltx/gr_gr_cog/oc.m1.d6:ocMA.OdeW3C24.incipit	Ἐλπίδων σε πλήρωμα, καὶ θείαν…
ltx/gr_gr_cog/oc.m1.d6:ocMA.OdeW3C24.melody	@ltx/gr_gr_cog/he.h.m1:heHE.StereosonKyrie.name
ltx/gr_gr_cog/oc.m1.d6:ocMA.OdeW3C24.mode	@ltx/gr_gr_cog/miscellanea:misc.Mode1
ltx/gr_gr_cog/oc.m1.d6:ocMA.OdeW3C24.ode	@ltx/gr_gr_cog/miscellanea:misc.Ode3
ltx/gr_gr_cog/oc.m1.d6:ocMA.OdeW3C24.text	Ἐλπίδων σε πλήρωμα, καὶ θείαν σκέπην, προστασίαν, καὶ ἡμέραν σωτηρίας, κεκτήμεθα, Μήτηρ τοῦ Λόγου, λάμψον ἡμῖν φῶς τῆς μετανοίας.
ltx/gr_gr_cog/oc.m1.d6:ocMA.OdeW4C11.incipit	Νομοθέτης ὢν δίκαιος, μετὰ ἀνόμων…
ltx/gr_gr_cog/oc.m1.d6:ocMA.OdeW4C11.melody	@ltx/gr_gr_cog/he.h.m1:heHE.EisakikoaKyrieTinAkoin.name
ltx/gr_gr_cog/oc.m1.d6:ocMA.OdeW4C11.mode	@ltx/gr_gr_cog/miscellanea:misc.Mode1
ltx/gr_gr_cog/oc.m1.d6:ocMA.OdeW4C11.ode	@ltx/gr_gr_cog/miscellanea:misc.Ode4
ltx/gr_gr_cog/oc.m1.d6:ocMA.OdeW4C11.text	Νομοθέτης ὢν δίκαιος, μετὰ ἀνόμων κατελογίσθης, ἐπὶ ξύλου ἀναρτώμενος, εὐεργέτα Κύριε, πάντας δικαιῶσαι βουλόμενος.
ltx/gr_gr_cog/oc.m1.d6:ocMA.OdeW4C12.incipit	Αἱ δυνάμεις ἐξέστησαν, αἱ τῶν…
ltx/gr_gr_cog/oc.m1.d6:ocMA.OdeW4C12.melody	@ltx/gr_gr_cog/he.h.m1:heHE.EisakikoaKyrieTinAkoin.name
ltx/gr_gr_cog/oc.m1.d6:ocMA.OdeW4C12.mode	@ltx/gr_gr_cog/miscellanea:misc.Mode1
ltx/gr_gr_cog/oc.m1.d6:ocMA.OdeW4C12.ode	@ltx/gr_gr_cog/miscellanea:misc.Ode4
ltx/gr_gr_cog/oc.m1.d6:ocMA.OdeW4C12.text	Αἱ δυνάμεις ἐξέστησαν, αἱ τῶν Ἀγγέλων, ἐπὶ Σταυροῦ σε, θεασάμεναι ὑψούμενον, καὶ τοῦ σκότους Ἥλιε, τὰς ἀρχὰς δυνάμει τροπούμενον.
ltx/gr_gr_cog/oc.m1.d6:ocMA.OdeW4C13.incipit	Ἰαμάτων χαρίσματα, ἐκ τῶν τοῦ…
ltx/gr_gr_cog/oc.m1.d6:ocMA.OdeW4C13.melody	@ltx/gr_gr_cog/he.h.m1:heHE.EisakikoaKyrieTinAkoin.name
ltx/gr_gr_cog/oc.m1.d6:ocMA.OdeW4C13.mode	@ltx/gr_gr_cog/miscellanea:misc.Mode1
ltx/gr_gr_cog/oc.m1.d6:ocMA.OdeW4C13.ode	@ltx/gr_gr_cog/miscellanea:misc.Ode4
ltx/gr_gr_cog/oc.m1.d6:ocMA.OdeW4C13.text	Ἰαμάτων χαρίσματα, ἐκ τῶν τοῦ Πνεύματος χαρισμάτων, ἀπαντλήσαντες οἱ μάρτυρες, πάντων ἀναπαύουσι, πάθη ψυχοφθόρα ἐν χάριτι.
ltx/gr_gr_cog/oc.m1.d6:ocMA.OdeW4C14.incipit	Νυσταγμὸν ἀπωσάμενοι, τῆς ἀμελείας οἱ…
ltx/gr_gr_cog/oc.m1.d6:ocMA.OdeW4C14.melody	@ltx/gr_gr_cog/he.h.m1:heHE.EisakikoaKyrieTinAkoin.name
ltx/gr_gr_cog/oc.m1.d6:ocMA.OdeW4C14.mode	@ltx/gr_gr_cog/miscellanea:misc.Mode1
ltx/gr_gr_cog/oc.m1.d6:ocMA.OdeW4C14.ode	@ltx/gr_gr_cog/miscellanea:misc.Ode4
ltx/gr_gr_cog/oc.m1.d6:ocMA.OdeW4C14.text	Νυσταγμὸν ἀπωσάμενοι, τῆς ἀμελείας οἱ ἀθλοφόροι, ἐγρηγόρσει θείας πίστεως, τῶν θηρῶν ἐκοίμισαν τὰς ὁρμάς, καὶ χαίροντες ἤθλησαν.
ltx/gr_gr_cog/oc.m1.d6:ocMA.OdeW4C1H.greekmelody	@ltx/gr_gr_cog/he.h.m1:heHE.EisakikoaKyrieTinAkoin.greekname
ltx/gr_gr_cog/oc.m1.d6:ocMA.OdeW4C1H.incipit	@ltx/gr_gr_cog/he.h.m1:heHE.EisakikoaKyrieTinAkoin.incipit
ltx/gr_gr_cog/oc.m1.d6:ocMA.OdeW4C1H.melody	@ltx/gr_gr_cog/he.h.m1:heHE.EisakikoaKyrieTinAkoin.melody
ltx/gr_gr_cog/oc.m1.d6:ocMA.OdeW4C1H.mode	@ltx/gr_gr_cog/miscellanea:misc.Mode1
ltx/gr_gr_cog/oc.m1.d6:ocMA.OdeW4C1H.ode	@ltx/gr_gr_cog/miscellanea:misc.Ode4
ltx/gr_gr_cog/oc.m1.d6:ocMA.OdeW4C1H.text	@ltx/gr_gr_cog/he.h.m1:heHE.EisakikoaKyrieTinAkoin.text
ltx/gr_gr_cog/oc.m1.d6:ocMA.OdeW4C1T.incipit	Οἴμοι τέκνον! Πῶς βλέψω σε…
ltx/gr_gr_cog/oc.m1.d6:ocMA.OdeW4C1T.melody	@ltx/gr_gr_cog/he.h.m1:heHE.EisakikoaKyrieTinAkoin.name
ltx/gr_gr_cog/oc.m1.d6:ocMA.OdeW4C1T.mode	@ltx/gr_gr_cog/miscellanea:misc.Mode1
ltx/gr_gr_cog/oc.m1.d6:ocMA.OdeW4C1T.ode	@ltx/gr_gr_cog/miscellanea:misc.Ode4
ltx/gr_gr_cog/oc.m1.d6:ocMA.OdeW4C1T.text	Οἴμοι τέκνον! Πῶς βλέψω σε, ἐπὶ τοῦ ξύλου ἀνηρτημένον, καὶ ἀδίκως θανατούμενον, τὸν ζωὴν παρέχοντα; Ἡ Παρθένος κλαίουσα ἔλεγεν.
ltx/gr_gr_cog/oc.m1.d6:ocMA.OdeW4C21.greekmelody	@ltx/gr_gr_cog/he.h.m1:heHE.KatenoisaPantodyname.greekname
ltx/gr_gr_cog/oc.m1.d6:ocMA.OdeW4C21.incipit	Ἱλαστήριον ἀκαταίσχυντον, τὴν πρεσβείαν σου…
ltx/gr_gr_cog/oc.m1.d6:ocMA.OdeW4C21.melody	@ltx/gr_gr_cog/he.h.m1:heHE.KatenoisaPantodyname.name
ltx/gr_gr_cog/oc.m1.d6:ocMA.OdeW4C21.mode	@ltx/gr_gr_cog/miscellanea:misc.Mode1
ltx/gr_gr_cog/oc.m1.d6:ocMA.OdeW4C21.ode	@ltx/gr_gr_cog/miscellanea:misc.Ode4
ltx/gr_gr_cog/oc.m1.d6:ocMA.OdeW4C21.text	Ἱλαστήριον ἀκαταίσχυντον, τὴν πρεσβείαν σου πάντες, ἁγνὴ Παρθένε, οἱ πιστοὶ κεκτήμεθα.
ltx/gr_gr_cog/oc.m1.d6:ocMA.OdeW4C22.incipit	Θεὸν Ἁγνὴ Λόγον ἐν μήτρᾳ…
ltx/gr_gr_cog/oc.m1.d6:ocMA.OdeW4C22.melody	@ltx/gr_gr_cog/he.h.m1:heHE.KatenoisaPantodyname.name
ltx/gr_gr_cog/oc.m1.d6:ocMA.OdeW4C22.mode	@ltx/gr_gr_cog/miscellanea:misc.Mode1
ltx/gr_gr_cog/oc.m1.d6:ocMA.OdeW4C22.ode	@ltx/gr_gr_cog/miscellanea:misc.Ode4
ltx/gr_gr_cog/oc.m1.d6:ocMA.OdeW4C22.text	Θεὸν Ἁγνὴ Λόγον ἐν μήτρᾳ σου, ἀφράστως συλλαβοῦσα, Θεὸν σωτῆρα, τίκτεις τοῦ γένους ἡμῶν.
ltx/gr_gr_cog/oc.m1.d6:ocMA.OdeW4C23.incipit	Ἀπροσμάχητον τεῖχος ἔχοντες, τὴν σὴν…
ltx/gr_gr_cog/oc.m1.d6:ocMA.OdeW4C23.melody	@ltx/gr_gr_cog/he.h.m1:heHE.KatenoisaPantodyname.name
ltx/gr_gr_cog/oc.m1.d6:ocMA.OdeW4C23.mode	@ltx/gr_gr_cog/miscellanea:misc.Mode1
ltx/gr_gr_cog/oc.m1.d6:ocMA.OdeW4C23.ode	@ltx/gr_gr_cog/miscellanea:misc.Ode4
ltx/gr_gr_cog/oc.m1.d6:ocMA.OdeW4C23.text	Ἀπροσμάχητον τεῖχος ἔχοντες, τὴν σὴν σκέπην Παρθένε, τῶν ἀοράτων, ἐχθρῶν λυτρούμεθα.
ltx/gr_gr_cog/oc.m1.d6:ocMA.OdeW4C24.incipit	Πεπτωκότας ἁμαρτήμασι, διανάστησον Κόρη, εὐλογημένη…
ltx/gr_gr_cog/oc.m1.d6:ocMA.OdeW4C24.melody	@ltx/gr_gr_cog/he.h.m1:heHE.KatenoisaPantodyname.name
ltx/gr_gr_cog/oc.m1.d6:ocMA.OdeW4C24.mode	@ltx/gr_gr_cog/miscellanea:misc.Mode1
ltx/gr_gr_cog/oc.m1.d6:ocMA.OdeW4C24.ode	@ltx/gr_gr_cog/miscellanea:misc.Ode4
ltx/gr_gr_cog/oc.m1.d6:ocMA.OdeW4C24.text	Πεπτωκότας ἁμαρτήμασι, διανάστησον Κόρη, εὐλογημένη· ἐλπὶς γὰρ εἶ τῶν πιστῶν.
ltx/gr_gr_cog/oc.m1.d6:ocMA.OdeW5C11.incipit	Ἐπὶ Σταυροῦ σαρκὶ ἀνυψούμενος, ἔθνη…
ltx/gr_gr_cog/oc.m1.d6:ocMA.OdeW5C11.melody	@ltx/gr_gr_cog/he.h.m1:heHE.ToFaeinonIminExanateilon.name
ltx/gr_gr_cog/oc.m1.d6:ocMA.OdeW5C11.mode	@ltx/gr_gr_cog/miscellanea:misc.Mode1
ltx/gr_gr_cog/oc.m1.d6:ocMA.OdeW5C11.ode	@ltx/gr_gr_cog/miscellanea:misc.Ode5
ltx/gr_gr_cog/oc.m1.d6:ocMA.OdeW5C11.text	Ἐπὶ Σταυροῦ σαρκὶ ἀνυψούμενος, ἔθνη ἐκάλεσας, μὴ εἰδότα σε, πρὸς σὴν ἐπίγνωσιν, Κριτὰ τῶν ὅλων, μόνε εὐσυμπάθητε, Χριστὲ ὁ Θεὸς ἡμῶν.
ltx/gr_gr_cog/oc.m1.d6:ocMA.OdeW5C12.incipit	Σοῦ πρὸς κριτήριον στάντος ἄδικον…
ltx/gr_gr_cog/oc.m1.d6:ocMA.OdeW5C12.melody	@ltx/gr_gr_cog/he.h.m1:heHE.ToFaeinonIminExanateilon.name
ltx/gr_gr_cog/oc.m1.d6:ocMA.OdeW5C12.mode	@ltx/gr_gr_cog/miscellanea:misc.Mode1
ltx/gr_gr_cog/oc.m1.d6:ocMA.OdeW5C12.ode	@ltx/gr_gr_cog/miscellanea:misc.Ode5
ltx/gr_gr_cog/oc.m1.d6:ocMA.OdeW5C12.text	Σοῦ πρὸς κριτήριον στάντος ἄδικον, δίκαιε Κύριε, δεδικαίωται ὁ πρὶν κατάκριτος Ἀδάμ, καὶ κράζει· Δόξα τῇ Σταυρώσει σου, μακρόθυμε Κύριε.
ltx/gr_gr_cog/oc.m1.d6:ocMA.OdeW5C13.incipit	Ὥσπερ Παράδεισος θεοφύτευτος, ὤφθητε μάρτυρες…
ltx/gr_gr_cog/oc.m1.d6:ocMA.OdeW5C13.melody	@ltx/gr_gr_cog/he.h.m1:heHE.ToFaeinonIminExanateilon.name
ltx/gr_gr_cog/oc.m1.d6:ocMA.OdeW5C13.mode	@ltx/gr_gr_cog/miscellanea:misc.Mode1
ltx/gr_gr_cog/oc.m1.d6:ocMA.OdeW5C13.ode	@ltx/gr_gr_cog/miscellanea:misc.Ode5
ltx/gr_gr_cog/oc.m1.d6:ocMA.OdeW5C13.text	Ὥσπερ Παράδεισος θεοφύτευτος, ὤφθητε μάρτυρες, πάθη τίμια, ὡς ἄνθη εὔοσμα προσκεκτημένοι, οἷς εὐωδιάζεται, πιστῶν ψυχὴ ἅπασα.
ltx/gr_gr_cog/oc.m1.d6:ocMA.OdeW5C14.incipit	Τὰ εὐθαλέστατα καὶ κατάκαρπα, δένδρα…
ltx/gr_gr_cog/oc.m1.d6:ocMA.OdeW5C14.melody	@ltx/gr_gr_cog/he.h.m1:heHE.ToFaeinonIminExanateilon.name
ltx/gr_gr_cog/oc.m1.d6:ocMA.OdeW5C14.mode	@ltx/gr_gr_cog/miscellanea:misc.Mode1
ltx/gr_gr_cog/oc.m1.d6:ocMA.OdeW5C14.ode	@ltx/gr_gr_cog/miscellanea:misc.Ode5
ltx/gr_gr_cog/oc.m1.d6:ocMA.OdeW5C14.text	Τὰ εὐθαλέστατα καὶ κατάκαρπα, δένδρα τῆς πίστεως, τὸν ἀθάνατον καρπὸν ἀνθήσαντα, τὰ τῆς κακίας ῥίζας ἀνασπάσαντα, ὑμνοῦμεν τοὺς μάρτυρας.
ltx/gr_gr_cog/oc.m1.d6:ocMA.OdeW5C1H.greekmelody	@ltx/gr_gr_cog/he.h.m1:heHE.ToFaeinonIminExanateilon.greekname
ltx/gr_gr_cog/oc.m1.d6:ocMA.OdeW5C1H.incipit	@ltx/gr_gr_cog/he.h.m1:heHE.ToFaeinonIminExanateilon.incipit
ltx/gr_gr_cog/oc.m1.d6:ocMA.OdeW5C1H.melody	@ltx/gr_gr_cog/he.h.m1:heHE.ToFaeinonIminExanateilon.melody
ltx/gr_gr_cog/oc.m1.d6:ocMA.OdeW5C1H.mode	@ltx/gr_gr_cog/miscellanea:misc.Mode1
ltx/gr_gr_cog/oc.m1.d6:ocMA.OdeW5C1H.ode	@ltx/gr_gr_cog/miscellanea:misc.Ode5
ltx/gr_gr_cog/oc.m1.d6:ocMA.OdeW5C1H.text	@ltx/gr_gr_cog/he.h.m1:heHE.ToFaeinonIminExanateilon.text
ltx/gr_gr_cog/oc.m1.d6:ocMA.OdeW5C1T.incipit	Ῥάβδος ἡ ἔντιμος ἡ βλαστήσασα…
ltx/gr_gr_cog/oc.m1.d6:ocMA.OdeW5C1T.melody	@ltx/gr_gr_cog/he.h.m1:heHE.ToFaeinonIminExanateilon.name
ltx/gr_gr_cog/oc.m1.d6:ocMA.OdeW5C1T.mode	@ltx/gr_gr_cog/miscellanea:misc.Mode1
ltx/gr_gr_cog/oc.m1.d6:ocMA.OdeW5C1T.ode	@ltx/gr_gr_cog/miscellanea:misc.Ode5
ltx/gr_gr_cog/oc.m1.d6:ocMA.OdeW5C1T.text	Ῥάβδος ἡ ἔντιμος ἡ βλαστήσασα, κλάδον ἀμάραντον, ἀνυψούμενον αὐτὸν ὡς ἔβλεπεν ἐπὶ τοῦ ξύλου, Δέσποτα, ἐκραύγαζε· μὴ ἄτεκνον δείξῃς με.
ltx/gr_gr_cog/oc.m1.d6:ocMA.OdeW5C21.greekmelody	@ltx/gr_gr_cog/he.h.m1:heHE.EkNyktosOrthrizontes.greekname
ltx/gr_gr_cog/oc.m1.d6:ocMA.OdeW5C21.incipit	Κραταιάν σε ἀντίληψιν, Ἀειπάρθενε ὑπάρχουσαν…
ltx/gr_gr_cog/oc.m1.d6:ocMA.OdeW5C21.melody	@ltx/gr_gr_cog/he.h.m1:heHE.EkNyktosOrthrizontes.name
ltx/gr_gr_cog/oc.m1.d6:ocMA.OdeW5C21.mode	@ltx/gr_gr_cog/miscellanea:misc.Mode1
ltx/gr_gr_cog/oc.m1.d6:ocMA.OdeW5C21.ode	@ltx/gr_gr_cog/miscellanea:misc.Ode5
ltx/gr_gr_cog/oc.m1.d6:ocMA.OdeW5C21.text	Κραταιάν σε ἀντίληψιν, Ἀειπάρθενε ὑπάρχουσαν, ἐν πειρασμοῖς καὶ θλίψεσι, καὶ δειναῖς ἁμαρτίαις, εὕροιμεν εὔκαιρον βοήθειαν.
ltx/gr_gr_cog/oc.m1.d6:ocMA.OdeW5C22.incipit	Τὰ τῶν Ἀγγέλων στρατεύματα, ὡς…
ltx/gr_gr_cog/oc.m1.d6:ocMA.OdeW5C22.melody	@ltx/gr_gr_cog/he.h.m1:heHE.EkNyktosOrthrizontes.name
ltx/gr_gr_cog/oc.m1.d6:ocMA.OdeW5C22.mode	@ltx/gr_gr_cog/miscellanea:misc.Mode1
ltx/gr_gr_cog/oc.m1.d6:ocMA.OdeW5C22.ode	@ltx/gr_gr_cog/miscellanea:misc.Ode5
ltx/gr_gr_cog/oc.m1.d6:ocMA.OdeW5C22.text	Τὰ τῶν Ἀγγέλων στρατεύματα, ὡς τὸν Κτίστην τῶν ἁπάντων, ὑπερφυῶς κυήσασαν, καὶ Παρθένον μείνασαν, Θεοτόκε ἀνυμνοῦσί σε ἀεί.
ltx/gr_gr_cog/oc.m1.d6:ocMA.OdeW5C23.incipit	Ἐν τῇ πηγῇ τῶν ἰαμάτων…
ltx/gr_gr_cog/oc.m1.d6:ocMA.OdeW5C23.melody	@ltx/gr_gr_cog/he.h.m1:heHE.EkNyktosOrthrizontes.name
ltx/gr_gr_cog/oc.m1.d6:ocMA.OdeW5C23.mode	@ltx/gr_gr_cog/miscellanea:misc.Mode1
ltx/gr_gr_cog/oc.m1.d6:ocMA.OdeW5C23.ode	@ltx/gr_gr_cog/miscellanea:misc.Ode5
ltx/gr_gr_cog/oc.m1.d6:ocMA.OdeW5C23.text	Ἐν τῇ πηγῇ τῶν ἰαμάτων σου, καὶ τοῖς ῥείθροις τῶν θαυμάτων σου, τὸν μολυσμὸν ἀπόπλυνον, τὸν ἐκ τῆς ἁμαρτίας, προστριβέντα μοι πανάμωμε.
ltx/gr_gr_cog/oc.m1.d6:ocMA.OdeW5C24.incipit	Τὸν ἱλασμὸν τῶν ψυχῶν ἡμῶν…
ltx/gr_gr_cog/oc.m1.d6:ocMA.OdeW5C24.melody	@ltx/gr_gr_cog/he.h.m1:heHE.EkNyktosOrthrizontes.name
ltx/gr_gr_cog/oc.m1.d6:ocMA.OdeW5C24.mode	@ltx/gr_gr_cog/miscellanea:misc.Mode1
ltx/gr_gr_cog/oc.m1.d6:ocMA.OdeW5C24.ode	@ltx/gr_gr_cog/miscellanea:misc.Ode5
ltx/gr_gr_cog/oc.m1.d6:ocMA.OdeW5C24.text	Τὸν ἱλασμὸν τῶν ψυχῶν ἡμῶν, ἐν νηδύϊ συλλαβοῦσα Ἁγνή, σωτηρίαν τέτοκας, τοῖς ἐν πίστει ἀπλέτῳ, Θεοτόκον σὲ δοξάζουσιν.
ltx/gr_gr_cog/oc.m1.d6:ocMA.OdeW6C11.incipit	Ὁ τιμῆς πάσης ὕπερθεν, ἀτιμίαν…
ltx/gr_gr_cog/oc.m1.d6:ocMA.OdeW6C11.melody	@ltx/gr_gr_cog/he.h.m1:heHE.TonProfitinDiesosas.name
ltx/gr_gr_cog/oc.m1.d6:ocMA.OdeW6C11.mode	@ltx/gr_gr_cog/miscellanea:misc.Mode1
ltx/gr_gr_cog/oc.m1.d6:ocMA.OdeW6C11.ode	@ltx/gr_gr_cog/miscellanea:misc.Ode6
ltx/gr_gr_cog/oc.m1.d6:ocMA.OdeW6C11.text	Ὁ τιμῆς πάσης ὕπερθεν, ἀτιμίαν ὑπήνεγκας, Σταυρῷ προσπαγεὶς τοὺς ἀνθρώπους, τιμῆσαι βουλόμενος.
ltx/gr_gr_cog/oc.m1.d6:ocMA.OdeW6C12.incipit	Ὑπογράφεις μοι ἄφεσιν, τῷ καλάμῳ…
ltx/gr_gr_cog/oc.m1.d6:ocMA.OdeW6C12.melody	@ltx/gr_gr_cog/he.h.m1:heHE.TonProfitinDiesosas.name
ltx/gr_gr_cog/oc.m1.d6:ocMA.OdeW6C12.mode	@ltx/gr_gr_cog/miscellanea:misc.Mode1
ltx/gr_gr_cog/oc.m1.d6:ocMA.OdeW6C12.ode	@ltx/gr_gr_cog/miscellanea:misc.Ode6
ltx/gr_gr_cog/oc.m1.d6:ocMA.OdeW6C12.text	Ὑπογράφεις μοι ἄφεσιν, τῷ καλάμῳ τυπτόμενος, καταδουλωθέντι τῷ πλάνῳ, Χριστὲ ὁ Θεὸς ἡμῶν.
ltx/gr_gr_cog/oc.m1.d6:ocMA.OdeW6C13.incipit	Διὰ πόνων ἀθλήσεως, πρὸς τὴν…
ltx/gr_gr_cog/oc.m1.d6:ocMA.OdeW6C13.melody	@ltx/gr_gr_cog/he.h.m1:heHE.TonProfitinDiesosas.name
ltx/gr_gr_cog/oc.m1.d6:ocMA.OdeW6C13.mode	@ltx/gr_gr_cog/miscellanea:misc.Mode1
ltx/gr_gr_cog/oc.m1.d6:ocMA.OdeW6C13.ode	@ltx/gr_gr_cog/miscellanea:misc.Ode6
ltx/gr_gr_cog/oc.m1.d6:ocMA.OdeW6C13.text	Διὰ πόνων ἀθλήσεως, πρὸς τὴν ἄπονον ἅγιοι, μετέβητε λῆξιν ἀῤῥήτου, χαρᾶς ἀξιούμενοι.
ltx/gr_gr_cog/oc.m1.d6:ocMA.OdeW6C14.incipit	Ἐπυρώθητε ἄνθραξι, τῆς Χριστοῦ ἀγαπήσεως…
ltx/gr_gr_cog/oc.m1.d6:ocMA.OdeW6C14.melody	@ltx/gr_gr_cog/he.h.m1:heHE.TonProfitinDiesosas.name
ltx/gr_gr_cog/oc.m1.d6:ocMA.OdeW6C14.mode	@ltx/gr_gr_cog/miscellanea:misc.Mode1
ltx/gr_gr_cog/oc.m1.d6:ocMA.OdeW6C14.ode	@ltx/gr_gr_cog/miscellanea:misc.Ode6
ltx/gr_gr_cog/oc.m1.d6:ocMA.OdeW6C14.text	Ἐπυρώθητε ἄνθραξι, τῆς Χριστοῦ ἀγαπήσεως· ὅθεν τῷ πυρὶ ὁμιλοῦντες, ἐμείνατε ἄφλεκτοι.
ltx/gr_gr_cog/oc.m1.d6:ocMA.OdeW6C1H.greekmelody	@ltx/gr_gr_cog/he.h.m1:heHE.TonProfitinDiesosas.greekname
ltx/gr_gr_cog/oc.m1.d6:ocMA.OdeW6C1H.incipit	@ltx/gr_gr_cog/he.h.m1:heHE.TonProfitinDiesosas.incipit
ltx/gr_gr_cog/oc.m1.d6:ocMA.OdeW6C1H.melody	@ltx/gr_gr_cog/he.h.m1:heHE.TonProfitinDiesosas.melody
ltx/gr_gr_cog/oc.m1.d6:ocMA.OdeW6C1H.mode	@ltx/gr_gr_cog/miscellanea:misc.Mode1
ltx/gr_gr_cog/oc.m1.d6:ocMA.OdeW6C1H.ode	@ltx/gr_gr_cog/miscellanea:misc.Ode6
ltx/gr_gr_cog/oc.m1.d6:ocMA.OdeW6C1H.text	@ltx/gr_gr_cog/he.h.m1:heHE.TonProfitinDiesosas.text
ltx/gr_gr_cog/oc.m1.d6:ocMA.OdeW6C1T.incipit	Μετὰ τόκον Πανάμωμε, ὡς πρὸ…
ltx/gr_gr_cog/oc.m1.d6:ocMA.OdeW6C1T.melody	@ltx/gr_gr_cog/he.h.m1:heHE.TonProfitinDiesosas.name
ltx/gr_gr_cog/oc.m1.d6:ocMA.OdeW6C1T.mode	@ltx/gr_gr_cog/miscellanea:misc.Mode1
ltx/gr_gr_cog/oc.m1.d6:ocMA.OdeW6C1T.ode	@ltx/gr_gr_cog/miscellanea:misc.Ode6
ltx/gr_gr_cog/oc.m1.d6:ocMA.OdeW6C1T.text	Μετὰ τόκον Πανάμωμε, ὡς πρὸ τόκου διέμεινας· Θεὸν γὰρ ἐκύησας ξύλῳ, τὸν ἄνθρωπον σώσαντα.
ltx/gr_gr_cog/oc.m1.d6:ocMA.OdeW6C21.greekmelody	@ltx/gr_gr_cog/he.h.m1:heHE.SynToIonaVoomen.greekname
ltx/gr_gr_cog/oc.m1.d6:ocMA.OdeW6C21.incipit	Τῶν ἀλγεινῶν παθῶν μου τὰ…
ltx/gr_gr_cog/oc.m1.d6:ocMA.OdeW6C21.melody	@ltx/gr_gr_cog/he.h.m1:heHE.SynToIonaVoomen.name
ltx/gr_gr_cog/oc.m1.d6:ocMA.OdeW6C21.mode	@ltx/gr_gr_cog/miscellanea:misc.Mode1
ltx/gr_gr_cog/oc.m1.d6:ocMA.OdeW6C21.ode	@ltx/gr_gr_cog/miscellanea:misc.Ode6
ltx/gr_gr_cog/oc.m1.d6:ocMA.OdeW6C21.text	Τῶν ἀλγεινῶν παθῶν μου τὰ συντρίμματα, ἐν τῷ συνδέσμῳ Δέσποινα, τῆς πρεσβείας σου θεράπευσον, καὶ τὴν ῥῶσίν μοι δώρησαι.
ltx/gr_gr_cog/oc.m1.d6:ocMA.OdeW6C22.incipit	Ὅλος συλληφθεὶς πολλοῖς ἀτοπήμασι, καὶ…
ltx/gr_gr_cog/oc.m1.d6:ocMA.OdeW6C22.melody	@ltx/gr_gr_cog/he.h.m1:heHE.SynToIonaVoomen.name
ltx/gr_gr_cog/oc.m1.d6:ocMA.OdeW6C22.mode	@ltx/gr_gr_cog/miscellanea:misc.Mode1
ltx/gr_gr_cog/oc.m1.d6:ocMA.OdeW6C22.ode	@ltx/gr_gr_cog/miscellanea:misc.Ode6
ltx/gr_gr_cog/oc.m1.d6:ocMA.OdeW6C22.text	Ὅλος συλληφθεὶς πολλοῖς ἀτοπήμασι, καὶ συληθεὶς τὸν νοῦν, ἁμαρτίαις πολλαῖς, τῇ σκέπῃ σου καταφεύγω, διάσωσόν με.
ltx/gr_gr_cog/oc.m1.d6:ocMA.OdeW6C23.incipit	Πάντες ἀδιστάκτῳ πίστει σε Πάναγνε…
ltx/gr_gr_cog/oc.m1.d6:ocMA.OdeW6C23.melody	@ltx/gr_gr_cog/he.h.m1:heHE.SynToIonaVoomen.name
ltx/gr_gr_cog/oc.m1.d6:ocMA.OdeW6C23.mode	@ltx/gr_gr_cog/miscellanea:misc.Mode1
ltx/gr_gr_cog/oc.m1.d6:ocMA.OdeW6C23.ode	@ltx/gr_gr_cog/miscellanea:misc.Ode6
ltx/gr_gr_cog/oc.m1.d6:ocMA.OdeW6C23.text	Πάντες ἀδιστάκτῳ πίστει σε Πάναγνε, ἐκδυσωποῦμεν Παρθένε, τῶν ἐπταισμένων ἡμῖν δώρησαι λύσιν, ὡς Μήτηρ Θεοῦ.
ltx/gr_gr_cog/oc.m1.d6:ocMA.OdeW6C24.incipit	Ὡς του νοητοῦ Ἡλίου πανάμωμε…
ltx/gr_gr_cog/oc.m1.d6:ocMA.OdeW6C24.melody	@ltx/gr_gr_cog/he.h.m1:heHE.SynToIonaVoomen.name
ltx/gr_gr_cog/oc.m1.d6:ocMA.OdeW6C24.mode	@ltx/gr_gr_cog/miscellanea:misc.Mode1
ltx/gr_gr_cog/oc.m1.d6:ocMA.OdeW6C24.ode	@ltx/gr_gr_cog/miscellanea:misc.Ode6
ltx/gr_gr_cog/oc.m1.d6:ocMA.OdeW6C24.text	Ὡς του νοητοῦ Ἡλίου πανάμωμε, ἀναδειχθεῖσα ὄχημα, φωταγώγησον, τοὺς ἐν νυκτί, ἀγνωσίας καθεύδοντας.
ltx/gr_gr_cog/oc.m1.d6:ocMA.OdeW7C11.incipit	Σταυρούμενος τὴν κτίσιν ἐσάλευσας, νεκρούμενος…
ltx/gr_gr_cog/oc.m1.d6:ocMA.OdeW7C11.melody	@ltx/gr_gr_cog/he.h.m1:heHE.IKaminosSotirEdrosizeto.name
ltx/gr_gr_cog/oc.m1.d6:ocMA.OdeW7C11.mode	@ltx/gr_gr_cog/miscellanea:misc.Mode1
ltx/gr_gr_cog/oc.m1.d6:ocMA.OdeW7C11.ode	@ltx/gr_gr_cog/miscellanea:misc.Ode7
ltx/gr_gr_cog/oc.m1.d6:ocMA.OdeW7C11.text	Σταυρούμενος τὴν κτίσιν ἐσάλευσας, νεκρούμενος τὸν ὄφιν ἐνέκρωσας. Εὐλογητὸς ὁ Θεός, ὁ τῶν Πατέρων ἡμῶν.
ltx/gr_gr_cog/oc.m1.d6:ocMA.OdeW7C12.incipit	Ποτίζεται χολὴ ὁ Μακρόθυμος, πηγάζων…
ltx/gr_gr_cog/oc.m1.d6:ocMA.OdeW7C12.melody	@ltx/gr_gr_cog/he.h.m1:heHE.IKaminosSotirEdrosizeto.name
ltx/gr_gr_cog/oc.m1.d6:ocMA.OdeW7C12.mode	@ltx/gr_gr_cog/miscellanea:misc.Mode1
ltx/gr_gr_cog/oc.m1.d6:ocMA.OdeW7C12.ode	@ltx/gr_gr_cog/miscellanea:misc.Ode7
ltx/gr_gr_cog/oc.m1.d6:ocMA.OdeW7C12.text	Ποτίζεται χολὴ ὁ Μακρόθυμος, πηγάζων μοι γλυκασμὸν σωτήριον, τῇ ἐνηδόνῳ βρώσει στερηθέντι, Παραδείσου τῆς τρυφῆς.
ltx/gr_gr_cog/oc.m1.d6:ocMA.OdeW7C13.incipit	Οἱ Μάρτυρες ξεόμενοι ὄνυξι, νεκρώσεως…
ltx/gr_gr_cog/oc.m1.d6:ocMA.OdeW7C13.melody	@ltx/gr_gr_cog/he.h.m1:heHE.IKaminosSotirEdrosizeto.name
ltx/gr_gr_cog/oc.m1.d6:ocMA.OdeW7C13.mode	@ltx/gr_gr_cog/miscellanea:misc.Mode1
ltx/gr_gr_cog/oc.m1.d6:ocMA.OdeW7C13.ode	@ltx/gr_gr_cog/miscellanea:misc.Ode7
ltx/gr_gr_cog/oc.m1.d6:ocMA.OdeW7C13.text	Οἱ Μάρτυρες ξεόμενοι ὄνυξι, νεκρώσεως τὸ πάθος ἀπέθεντο, καταστολὴν δὲ θείαν, ἐκ Θεοῦ ἐκομίσαντο.
ltx/gr_gr_cog/oc.m1.d6:ocMA.OdeW7C14.incipit	Τοῖς πάθεσι τὸ πάθος τὸ…
ltx/gr_gr_cog/oc.m1.d6:ocMA.OdeW7C14.melody	@ltx/gr_gr_cog/he.h.m1:heHE.IKaminosSotirEdrosizeto.name
ltx/gr_gr_cog/oc.m1.d6:ocMA.OdeW7C14.mode	@ltx/gr_gr_cog/miscellanea:misc.Mode1
ltx/gr_gr_cog/oc.m1.d6:ocMA.OdeW7C14.ode	@ltx/gr_gr_cog/miscellanea:misc.Ode7
ltx/gr_gr_cog/oc.m1.d6:ocMA.OdeW7C14.text	Τοῖς πάθεσι τὸ πάθος τὸ ἄχραντον, μιμούμενοι καλλίνικοι Μάρτυρες, τοὺς αἰκισμοὺς ῥαδίως, τῶν ἐχθρῶν ὑπεμείνατε.
ltx/gr_gr_cog/oc.m1.d6:ocMA.OdeW7C1H.greekmelody	@ltx/gr_gr_cog/he.h.m1:heHE.IKaminosSotirEdrosizeto.greekname
ltx/gr_gr_cog/oc.m1.d6:ocMA.OdeW7C1H.incipit	@ltx/gr_gr_cog/he.h.m1:heHE.IKaminosSotirEdrosizeto.incipit
ltx/gr_gr_cog/oc.m1.d6:ocMA.OdeW7C1H.melody	@ltx/gr_gr_cog/he.h.m1:heHE.IKaminosSotirEdrosizeto.melody
ltx/gr_gr_cog/oc.m1.d6:ocMA.OdeW7C1H.mode	@ltx/gr_gr_cog/miscellanea:misc.Mode1
ltx/gr_gr_cog/oc.m1.d6:ocMA.OdeW7C1H.ode	@ltx/gr_gr_cog/miscellanea:misc.Ode7
ltx/gr_gr_cog/oc.m1.d6:ocMA.OdeW7C1H.text	@ltx/gr_gr_cog/he.h.m1:heHE.IKaminosSotirEdrosizeto.text
ltx/gr_gr_cog/oc.m1.d6:ocMA.OdeW7C1T.incipit	Σταυρούμενον ὁρῶσα τὸν Κύριον, ἡ…
ltx/gr_gr_cog/oc.m1.d6:ocMA.OdeW7C1T.melody	@ltx/gr_gr_cog/he.h.m1:heHE.IKaminosSotirEdrosizeto.name
ltx/gr_gr_cog/oc.m1.d6:ocMA.OdeW7C1T.mode	@ltx/gr_gr_cog/miscellanea:misc.Mode1
ltx/gr_gr_cog/oc.m1.d6:ocMA.OdeW7C1T.ode	@ltx/gr_gr_cog/miscellanea:misc.Ode7
ltx/gr_gr_cog/oc.m1.d6:ocMA.OdeW7C1T.text	Σταυρούμενον ὁρῶσα τὸν Κύριον, ἡ ἄμεμπτος Θεοτόκος ἔλεγεν· Οἴμοι! Υἱὲ πῶς θνῄσκεις, ἡ ζωὴ καὶ ἐλπὶς τῶν πιστῶν.
ltx/gr_gr_cog/oc.m1.d6:ocMA.OdeW7C21.greekmelody	@ltx/gr_gr_cog/he.h.m1:heHE.OEnTiVatoOftheis.greekname
ltx/gr_gr_cog/oc.m1.d6:ocMA.OdeW7C21.incipit	Ἐν πειρασμοῖς βοηθόν, ἐν κινδύνοις…
ltx/gr_gr_cog/oc.m1.d6:ocMA.OdeW7C21.melody	@ltx/gr_gr_cog/he.h.m1:heHE.OEnTiVatoOftheis.name
ltx/gr_gr_cog/oc.m1.d6:ocMA.OdeW7C21.mode	@ltx/gr_gr_cog/miscellanea:misc.Mode1
ltx/gr_gr_cog/oc.m1.d6:ocMA.OdeW7C21.ode	@ltx/gr_gr_cog/miscellanea:misc.Ode7
ltx/gr_gr_cog/oc.m1.d6:ocMA.OdeW7C21.text	Ἐν πειρασμοῖς βοηθόν, ἐν κινδύνοις σωτηρίαν, σὲ Δέσποινα ἐπιστάμενοι, πιστῶς ἐκβοῶμεν· Εὐλογημένος Πάναγνε, ὁ καρπὸς τῆς κοιλίας σου.
ltx/gr_gr_cog/oc.m1.d6:ocMA.OdeW7C22.incipit	Τὸν τῆς ζωῆς χορηγόν, ὡς…
ltx/gr_gr_cog/oc.m1.d6:ocMA.OdeW7C22.melody	@ltx/gr_gr_cog/he.h.m1:heHE.OEnTiVatoOftheis.name
ltx/gr_gr_cog/oc.m1.d6:ocMA.OdeW7C22.mode	@ltx/gr_gr_cog/miscellanea:misc.Mode1
ltx/gr_gr_cog/oc.m1.d6:ocMA.OdeW7C22.ode	@ltx/gr_gr_cog/miscellanea:misc.Ode7
ltx/gr_gr_cog/oc.m1.d6:ocMA.OdeW7C22.text	Τὸν τῆς ζωῆς χορηγόν, ὡς τεκοῦσα Θεοτόκε, ἀνάστησον νεκρωθέντα με, δειναῖς ἁμαρτίαις· Εὐλογητὸς εἶ κράζοντα, ὁ Θεὸς τῶν Πατέρων ἡμῶν.
ltx/gr_gr_cog/oc.m1.d6:ocMA.OdeW7C23.incipit	Θεὸς ἐκ σοῦ προελθών, ἐλυτρώσατο…
ltx/gr_gr_cog/oc.m1.d6:ocMA.OdeW7C23.melody	@ltx/gr_gr_cog/he.h.m1:heHE.OEnTiVatoOftheis.name
ltx/gr_gr_cog/oc.m1.d6:ocMA.OdeW7C23.mode	@ltx/gr_gr_cog/miscellanea:misc.Mode1
ltx/gr_gr_cog/oc.m1.d6:ocMA.OdeW7C23.ode	@ltx/gr_gr_cog/miscellanea:misc.Ode7
ltx/gr_gr_cog/oc.m1.d6:ocMA.OdeW7C23.text	Θεὸς ἐκ σοῦ προελθών, ἐλυτρώσατο τὴν φύσιν τῆς κατάρας, καὶ ἰάσατο τὰς πάντων ὀδύνας· Εὐλογημένος Πάναγνε, ὁ καρπὸς τῆς κοιλίας σου.
ltx/gr_gr_cog/oc.m1.d6:ocMA.OdeW7C24.incipit	Χαῖρε χαρὰ τῶν πιστῶν, καὶ…
ltx/gr_gr_cog/oc.m1.d6:ocMA.OdeW7C24.melody	@ltx/gr_gr_cog/he.h.m1:heHE.OEnTiVatoOftheis.name
ltx/gr_gr_cog/oc.m1.d6:ocMA.OdeW7C24.mode	@ltx/gr_gr_cog/miscellanea:misc.Mode1
ltx/gr_gr_cog/oc.m1.d6:ocMA.OdeW7C24.ode	@ltx/gr_gr_cog/miscellanea:misc.Ode7
ltx/gr_gr_cog/oc.m1.d6:ocMA.OdeW7C24.text	Χαῖρε χαρὰ τῶν πιστῶν, καὶ λυτήριον λύπης. Χαῖρε πάντων ἱλαστήριον, τῶν πίστει βοώντων· Εὐλογημένη ἄχραντε, Θεοτόκε πανύμνητε.
ltx/gr_gr_cog/oc.m1.d6:ocMA.OdeW8C11.incipit	Ὅτε τῷ Σταυρῷ Σῶτερ ἐπάγης…
ltx/gr_gr_cog/oc.m1.d6:ocMA.OdeW8C11.melody	@ltx/gr_gr_cog/he.h.m1:heHE.TonTousYmnologousEnKamino.name
ltx/gr_gr_cog/oc.m1.d6:ocMA.OdeW8C11.mode	@ltx/gr_gr_cog/miscellanea:misc.Mode1
ltx/gr_gr_cog/oc.m1.d6:ocMA.OdeW8C11.ode	@ltx/gr_gr_cog/miscellanea:misc.Ode8
ltx/gr_gr_cog/oc.m1.d6:ocMA.OdeW8C11.text	Ὅτε τῷ Σταυρῷ Σῶτερ ἐπάγης, ἐκλονεῖτο ἡ κτίσις, ἥλιος ἔπαυσε τὰς ἀκτῖνας, καὶ πέτραι ἐσχίζοντο, καὶ ᾅδης Σῶτερ ἐγυμνοῦτο, μὴ φέρων σου τὸ κράτος.
ltx/gr_gr_cog/oc.m1.d6:ocMA.OdeW8C12.incipit	Ὑπὲρ καταδίκων ἀπωσμένων, καταδίκης ἠνέσχου…
ltx/gr_gr_cog/oc.m1.d6:ocMA.OdeW8C12.melody	@ltx/gr_gr_cog/he.h.m1:heHE.TonTousYmnologousEnKamino.name
ltx/gr_gr_cog/oc.m1.d6:ocMA.OdeW8C12.mode	@ltx/gr_gr_cog/miscellanea:misc.Mode1
ltx/gr_gr_cog/oc.m1.d6:ocMA.OdeW8C12.ode	@ltx/gr_gr_cog/miscellanea:misc.Ode8
ltx/gr_gr_cog/oc.m1.d6:ocMA.OdeW8C12.text	Ὑπὲρ καταδίκων ἀπωσμένων, καταδίκης ἠνέσχου, ὑπὲρ τοῦ γύμνωσιν ὑποστάντος, γυμνὸς ξύλῳ κρέμασαι, Οἰκτίρμον. Μέγα σου τὸ κράτος, καὶ ἡ φιλανθρωπία.
ltx/gr_gr_cog/oc.m1.d6:ocMA.OdeW8C13.incipit	Οἱ τῶν Ἀσωμάτων συμπολῖται, οἱ…
ltx/gr_gr_cog/oc.m1.d6:ocMA.OdeW8C13.melody	@ltx/gr_gr_cog/he.h.m1:heHE.TonTousYmnologousEnKamino.name
ltx/gr_gr_cog/oc.m1.d6:ocMA.OdeW8C13.mode	@ltx/gr_gr_cog/miscellanea:misc.Mode1
ltx/gr_gr_cog/oc.m1.d6:ocMA.OdeW8C13.ode	@ltx/gr_gr_cog/miscellanea:misc.Ode8
ltx/gr_gr_cog/oc.m1.d6:ocMA.OdeW8C13.text	Οἱ τῶν Ἀσωμάτων συμπολῖται, οἱ Χριστοῦ στρατιῶται, Σταυρὸν ὡς θωρακα ἐνδυσάμενοι, πρὸς τὸν ἀντίπαλον χωροῦσι, καὶ τούτων ὡραίοις, ποσὶ καταπατοῦσιν.
ltx/gr_gr_cog/oc.m1.d6:ocMA.OdeW8C14.incipit	Ἵσταντο ἐν μέσῳ τοῦ σταδίου…
ltx/gr_gr_cog/oc.m1.d6:ocMA.OdeW8C14.melody	@ltx/gr_gr_cog/he.h.m1:heHE.TonTousYmnologousEnKamino.name
ltx/gr_gr_cog/oc.m1.d6:ocMA.OdeW8C14.mode	@ltx/gr_gr_cog/miscellanea:misc.Mode1
ltx/gr_gr_cog/oc.m1.d6:ocMA.OdeW8C14.ode	@ltx/gr_gr_cog/miscellanea:misc.Ode8
ltx/gr_gr_cog/oc.m1.d6:ocMA.OdeW8C14.text	Ἵσταντο ἐν μέσῳ τοῦ σταδίου, τοῖς μοχλοῖς οἱ γενναῖοι μέλη συνθλώμενοι, καὶ τὴν δόμησιν ἀναμοχλεύοντες τῆς πλάνης, καὶ τοὺς δαιμόνων βωμοὺς ἐδαφίζοντες.
ltx/gr_gr_cog/oc.m1.d6:ocMA.OdeW8C1H.greekmelody	@ltx/gr_gr_cog/he.h.m1:heHE.TonTousYmnologousEnKamino.greekname
ltx/gr_gr_cog/oc.m1.d6:ocMA.OdeW8C1H.incipit	@ltx/gr_gr_cog/he.h.m1:heHE.TonTousYmnologousEnKamino.incipit
ltx/gr_gr_cog/oc.m1.d6:ocMA.OdeW8C1H.melody	@ltx/gr_gr_cog/he.h.m1:heHE.TonTousYmnologousEnKamino.melody
ltx/gr_gr_cog/oc.m1.d6:ocMA.OdeW8C1H.mode	@ltx/gr_gr_cog/miscellanea:misc.Mode1
ltx/gr_gr_cog/oc.m1.d6:ocMA.OdeW8C1H.ode	@ltx/gr_gr_cog/miscellanea:misc.Ode8
ltx/gr_gr_cog/oc.m1.d6:ocMA.OdeW8C1H.text	@ltx/gr_gr_cog/he.h.m1:heHE.TonTousYmnologousEnKamino.text
ltx/gr_gr_cog/oc.m1.d6:ocMA.OdeW8C1T.incipit	Ἡ τῶν οὐρανῶν ὑψηλοτέρα, ὑψωθέντα…
ltx/gr_gr_cog/oc.m1.d6:ocMA.OdeW8C1T.melody	@ltx/gr_gr_cog/he.h.m1:heHE.TonTousYmnologousEnKamino.name
ltx/gr_gr_cog/oc.m1.d6:ocMA.OdeW8C1T.mode	@ltx/gr_gr_cog/miscellanea:misc.Mode1
ltx/gr_gr_cog/oc.m1.d6:ocMA.OdeW8C1T.ode	@ltx/gr_gr_cog/miscellanea:misc.Ode8
ltx/gr_gr_cog/oc.m1.d6:ocMA.OdeW8C1T.text	Ἡ τῶν οὐρανῶν ὑψηλοτέρα, ὑψωθέντα ἐν ξύλῳ, καὶ καταράσσοντα τὰς ὑψώσεις, ἐχθροῦ θεωρήσασα, τὸν μόνον ὕψιστον, ἀνύμνει Χριστὸν μεγαλοφώνως.
ltx/gr_gr_cog/oc.m1.d6:ocMA.OdeW8C21.greekmelody	@ltx/gr_gr_cog/he.h.m1:heHE.YmnonSoiProsferomen.greekname
ltx/gr_gr_cog/oc.m1.d6:ocMA.OdeW8C21.incipit	Ἱλέωσαι τὸν εὔσπλαγχνον Θεὸν καὶ…
ltx/gr_gr_cog/oc.m1.d6:ocMA.OdeW8C21.melody	@ltx/gr_gr_cog/he.h.m1:heHE.YmnonSoiProsferomen.name
ltx/gr_gr_cog/oc.m1.d6:ocMA.OdeW8C21.mode	@ltx/gr_gr_cog/miscellanea:misc.Mode1
ltx/gr_gr_cog/oc.m1.d6:ocMA.OdeW8C21.ode	@ltx/gr_gr_cog/miscellanea:misc.Ode8
ltx/gr_gr_cog/oc.m1.d6:ocMA.OdeW8C21.text	Ἱλέωσαι τὸν εὔσπλαγχνον Θεὸν καὶ Λόγον, Θεοκυῆτορ ὑπὲρ τῶν πίστει, ἀσιγήτως βοώντων· Εὐλογεῖτε πάντα τὰ ἔργα Κυρίου τὸν Κύριον.
ltx/gr_gr_cog/oc.m1.d6:ocMA.OdeW8C22.incipit	Καθάρσιον ἔχοντες τὴν σὴν πρεσβείαν…
ltx/gr_gr_cog/oc.m1.d6:ocMA.OdeW8C22.melody	@ltx/gr_gr_cog/he.h.m1:heHE.YmnonSoiProsferomen.name
ltx/gr_gr_cog/oc.m1.d6:ocMA.OdeW8C22.mode	@ltx/gr_gr_cog/miscellanea:misc.Mode1
ltx/gr_gr_cog/oc.m1.d6:ocMA.OdeW8C22.ode	@ltx/gr_gr_cog/miscellanea:misc.Ode8
ltx/gr_gr_cog/oc.m1.d6:ocMA.OdeW8C22.text	Καθάρσιον ἔχοντες τὴν σὴν πρεσβείαν, οἱ ἐμπαγέντες βυθῷ πταισμάτων, Θεοτόκε βοῶμεν· Εὐλογεῖτε πάντα τὰ ἔργα Κυρίου τὸν Κύριον.
ltx/gr_gr_cog/oc.m1.d6:ocMA.OdeW8C23.incipit	Σὲ πάντες καταφύγιον ἐν περιστάσει…
ltx/gr_gr_cog/oc.m1.d6:ocMA.OdeW8C23.melody	@ltx/gr_gr_cog/he.h.m1:heHE.YmnonSoiProsferomen.name
ltx/gr_gr_cog/oc.m1.d6:ocMA.OdeW8C23.mode	@ltx/gr_gr_cog/miscellanea:misc.Mode1
ltx/gr_gr_cog/oc.m1.d6:ocMA.OdeW8C23.ode	@ltx/gr_gr_cog/miscellanea:misc.Ode8
ltx/gr_gr_cog/oc.m1.d6:ocMA.OdeW8C23.text	Σὲ πάντες καταφύγιον ἐν περιστάσει, καὶ συμμαχίαν καὶ προστασίαν, κεκτημένοι βοῶμεν· Εὐλογεῖτε πάντα τὰ ἔργα Κυρίου τὸν Κύριον.
ltx/gr_gr_cog/oc.m1.d6:ocMA.OdeW8C24.incipit	Ἀχλὺς κυμάτων δεινῶν συνταράττει με…
ltx/gr_gr_cog/oc.m1.d6:ocMA.OdeW8C24.melody	@ltx/gr_gr_cog/he.h.m1:heHE.YmnonSoiProsferomen.name
ltx/gr_gr_cog/oc.m1.d6:ocMA.OdeW8C24.mode	@ltx/gr_gr_cog/miscellanea:misc.Mode1
ltx/gr_gr_cog/oc.m1.d6:ocMA.OdeW8C24.ode	@ltx/gr_gr_cog/miscellanea:misc.Ode8
ltx/gr_gr_cog/oc.m1.d6:ocMA.OdeW8C24.text	Ἀχλὺς κυμάτων δεινῶν συνταράττει με· διὸ προστρέχω ἐν τῷ λιμένι, τῆς σῆς πρεσβείας κραυγάζων· Εὐλογεῖτε πάντα τὰ ἔργα Κυρίου τὸν Κύριον.
ltx/gr_gr_cog/oc.m1.d6:ocMA.OdeW9C11.incipit	Ὢ! πῶς λαὸς ὁ ἀπειθής…
ltx/gr_gr_cog/oc.m1.d6:ocMA.OdeW9C11.melody	@ltx/gr_gr_cog/he.h.m1:heHE.SeInPerEideMoysis.name
ltx/gr_gr_cog/oc.m1.d6:ocMA.OdeW9C11.mode	@ltx/gr_gr_cog/miscellanea:misc.Mode1
ltx/gr_gr_cog/oc.m1.d6:ocMA.OdeW9C11.ode	@ltx/gr_gr_cog/miscellanea:misc.Ode9
ltx/gr_gr_cog/oc.m1.d6:ocMA.OdeW9C11.text	Ὢ! πῶς λαὸς ὁ ἀπειθής, παραδίδωσι Σταυρῷ, τὸν μόνον μακρόθυμον, ἐθελοντὶ πτωχεύσαντα, καὶ πάθος δεξάμενον, καὶ ἀπαθείας πρόξενον γενόμενον, πᾶσι τοῖς ἐξ Ἀδὰμ ὀλισθήσασιν.
ltx/gr_gr_cog/oc.m1.d6:ocMA.OdeW9C12.incipit	Σταύρωσιν ἄτιμον Χριστέ, κατεδέξω ἐν…
ltx/gr_gr_cog/oc.m1.d6:ocMA.OdeW9C12.melody	@ltx/gr_gr_cog/he.h.m1:heHE.SeInPerEideMoysis.name
ltx/gr_gr_cog/oc.m1.d6:ocMA.OdeW9C12.mode	@ltx/gr_gr_cog/miscellanea:misc.Mode1
ltx/gr_gr_cog/oc.m1.d6:ocMA.OdeW9C12.ode	@ltx/gr_gr_cog/miscellanea:misc.Ode9
ltx/gr_gr_cog/oc.m1.d6:ocMA.OdeW9C12.text	Σταύρωσιν ἄτιμον Χριστέ, κατεδέξω ἐν σαρκί, τιμῆσαι βουλόμενος, ἀτιμασθέντα πάθεσιν, ἀλόγοις τὸν ἄνθρωπον, καὶ τὸ ἀρχαῖον κάλλος ἀπολέσαντα, δόξα τῇ ὑπέρ νοῦν εὐσπλαγχνίᾳ σου.
ltx/gr_gr_cog/oc.m1.d6:ocMA.OdeW9C13.incipit	Ἥλιε ἄδυτε Χριστέ, τοὺς ὀρθρίζοντας…
ltx/gr_gr_cog/oc.m1.d6:ocMA.OdeW9C13.melody	@ltx/gr_gr_cog/he.h.m1:heHE.SeInPerEideMoysis.name
ltx/gr_gr_cog/oc.m1.d6:ocMA.OdeW9C13.mode	@ltx/gr_gr_cog/miscellanea:misc.Mode1
ltx/gr_gr_cog/oc.m1.d6:ocMA.OdeW9C13.ode	@ltx/gr_gr_cog/miscellanea:misc.Ode9
ltx/gr_gr_cog/oc.m1.d6:ocMA.OdeW9C13.text	Ἥλιε ἄδυτε Χριστέ, τοὺς ὀρθρίζοντας πρὸς σέ, καὶ σκότος κολάσεως, παραδραμόντας νεύσει σου, εἰς φέγγος ὡδήγησας τῆς σῆς, ἀῤῥήτου δόξης καὶ λαμπρότητος· φώτισον οὖν ἡμᾶς ταῖς αὐτῶν προσευχαῖς.
ltx/gr_gr_cog/oc.m1.d6:ocMA.OdeW9C14.incipit	Φάλαγξ μαρτύρων ἱερῶν, μυριάδας νοητῶν…
ltx/gr_gr_cog/oc.m1.d6:ocMA.OdeW9C14.melody	@ltx/gr_gr_cog/he.h.m1:heHE.SeInPerEideMoysis.name
ltx/gr_gr_cog/oc.m1.d6:ocMA.OdeW9C14.mode	@ltx/gr_gr_cog/miscellanea:misc.Mode1
ltx/gr_gr_cog/oc.m1.d6:ocMA.OdeW9C14.ode	@ltx/gr_gr_cog/miscellanea:misc.Ode9
ltx/gr_gr_cog/oc.m1.d6:ocMA.OdeW9C14.text	Φάλαγξ μαρτύρων ἱερῶν, μυριάδας νοητῶν, ἐχθρῶν ἐτροπώσαντο, καὶ μυριάσιν ἥνωνται ἁγίων Δυνάμεων, καὶ τὰ μύρια πάθη τῶν ψυχῶν ἡμῶν, νεύσει παντουργικῇ θεραπεύουσιν.
ltx/gr_gr_cog/oc.m1.d6:ocMA.OdeW9C1H.greekmelody	@ltx/gr_gr_cog/he.h.m1:heHE.SeInPerEideMoysis.greekname
ltx/gr_gr_cog/oc.m1.d6:ocMA.OdeW9C1H.incipit	@ltx/gr_gr_cog/he.h.m1:heHE.SeInPerEideMoysis.incipit
ltx/gr_gr_cog/oc.m1.d6:ocMA.OdeW9C1H.melody	@ltx/gr_gr_cog/he.h.m1:heHE.SeInPerEideMoysis.melody
ltx/gr_gr_cog/oc.m1.d6:ocMA.OdeW9C1H.mode	@ltx/gr_gr_cog/miscellanea:misc.Mode1
ltx/gr_gr_cog/oc.m1.d6:ocMA.OdeW9C1H.ode	@ltx/gr_gr_cog/miscellanea:misc.Ode9
ltx/gr_gr_cog/oc.m1.d6:ocMA.OdeW9C1H.text	@ltx/gr_gr_cog/he.h.m1:heHE.SeInPerEideMoysis.text
ltx/gr_gr_cog/oc.m1.d6:ocMA.OdeW9C1T.incipit	Φέγγει Παρθένε τοῦ ἐκ σοῦ…
ltx/gr_gr_cog/oc.m1.d6:ocMA.OdeW9C1T.melody	@ltx/gr_gr_cog/he.h.m1:heHE.SeInPerEideMoysis.name
ltx/gr_gr_cog/oc.m1.d6:ocMA.OdeW9C1T.mode	@ltx/gr_gr_cog/miscellanea:misc.Mode1
ltx/gr_gr_cog/oc.m1.d6:ocMA.OdeW9C1T.ode	@ltx/gr_gr_cog/miscellanea:misc.Ode9
ltx/gr_gr_cog/oc.m1.d6:ocMA.OdeW9C1T.text	Φέγγει Παρθένε τοῦ ἐκ σοῦ, ἀνατείλαντος σαρκί, τὸν νοῦν μου καταύγασον, καὶ τὴν καρδίαν φώτισον, τὸ σκότος διώκουσα τῆς ἁμαρτίας, καὶ τῆς ῥαθυμίας μου, ἅπασαν τὴν ἀχλὺν ἀπελαύνουσα.
ltx/gr_gr_cog/oc.m1.d6:ocMA.OdeW9C21.greekmelody	@ltx/gr_gr_cog/he.h.m1:heHE.SeInPerEideMoysis.greekname
ltx/gr_gr_cog/oc.m1.d6:ocMA.OdeW9C21.incipit	Ἔχουσα πλῆθος συμπαθές, καὶ πλουσίους…
ltx/gr_gr_cog/oc.m1.d6:ocMA.OdeW9C21.melody	@ltx/gr_gr_cog/he.h.m1:heHE.SeInPerEideMoysis.name
ltx/gr_gr_cog/oc.m1.d6:ocMA.OdeW9C21.mode	@ltx/gr_gr_cog/miscellanea:misc.Mode1
ltx/gr_gr_cog/oc.m1.d6:ocMA.OdeW9C21.ode	@ltx/gr_gr_cog/miscellanea:misc.Ode9
ltx/gr_gr_cog/oc.m1.d6:ocMA.OdeW9C21.text	Ἔχουσα πλῆθος συμπαθές, καὶ πλουσίους οἰκτιρμούς, τὰ πάθη καὶ τραύματα, τοῦ σώματος καὶ μώλωπας, καὶ τὰς ὀδύνας θεράπευσον Δέσποινα, δούλου τοῦ σοῦ, ὅπως κατὰ χρέος δοξάζω σε.
ltx/gr_gr_cog/oc.m1.d6:ocMA.OdeW9C22.incipit	Σὲ ὡς τὸν Λόγον τοῦ…
ltx/gr_gr_cog/oc.m1.d6:ocMA.OdeW9C22.melody	@ltx/gr_gr_cog/he.h.m1:heHE.SeInPerEideMoysis.name
ltx/gr_gr_cog/oc.m1.d6:ocMA.OdeW9C22.mode	@ltx/gr_gr_cog/miscellanea:misc.Mode1
ltx/gr_gr_cog/oc.m1.d6:ocMA.OdeW9C22.ode	@ltx/gr_gr_cog/miscellanea:misc.Ode9
ltx/gr_gr_cog/oc.m1.d6:ocMA.OdeW9C22.text	Σὲ ὡς τὸν Λόγον τοῦ Πατρός, συλλαβοῦσαν ἐν γαστρί, καὶ τοῦτον κυήσασαν, ὑπὲρ φύσιν πάναγνε, καὶ Παρθένον μείνασαν, δοξολογῶ εὐχαρίστως, κράζων σοι· Χαῖρε ἁμαρτωλῶν ἡ βοήθεια.
ltx/gr_gr_cog/oc.m1.d6:ocMA.OdeW9C23.incipit	Μόνη ὑπάρχεις ἀπλανής, ὁδηγία τῶν…
ltx/gr_gr_cog/oc.m1.d6:ocMA.OdeW9C23.melody	@ltx/gr_gr_cog/he.h.m1:heHE.SeInPerEideMoysis.name
ltx/gr_gr_cog/oc.m1.d6:ocMA.OdeW9C23.mode	@ltx/gr_gr_cog/miscellanea:misc.Mode1
ltx/gr_gr_cog/oc.m1.d6:ocMA.OdeW9C23.ode	@ltx/gr_gr_cog/miscellanea:misc.Ode9
ltx/gr_gr_cog/oc.m1.d6:ocMA.OdeW9C23.text	Μόνη ὑπάρχεις ἀπλανής, ὁδηγία τῶν πιστῶν, καὶ τρίβος σωτήριος, εἰς εὐθεῖαν ἡμᾶς ἄγουσα, ὁδὸν οὐράνιον, τῆς Βασιλείας τοῦ μόνου Θεοῦ, Ἄχραντε, ἡ ἐλπὶς τῶν ψυχῶν ἡμῶν.
ltx/gr_gr_cog/oc.m1.d6:ocMA.OdeW9C24.incipit	Σὺ τὸν οὐράνιον ἡμῖν, ἐγεώργησας…
ltx/gr_gr_cog/oc.m1.d6:ocMA.OdeW9C24.melody	@ltx/gr_gr_cog/he.h.m1:heHE.SeInPerEideMoysis.name
ltx/gr_gr_cog/oc.m1.d6:ocMA.OdeW9C24.mode	@ltx/gr_gr_cog/miscellanea:misc.Mode1
ltx/gr_gr_cog/oc.m1.d6:ocMA.OdeW9C24.ode	@ltx/gr_gr_cog/miscellanea:misc.Ode9
ltx/gr_gr_cog/oc.m1.d6:ocMA.OdeW9C24.text	Σὺ τὸν οὐράνιον ἡμῖν, ἐγεώργησας στάχυν, καὶ τρέφεις πανάμωμε, καὶ πρεσβεύεις πάντοτε, καὶ σῴζεις ἐκ θλίψεως καὶ κινδύνων, καὶ παρέχεις ἅπασιν, ἱλασμόν ἁμαρτιῶν τοῖς ὑμνοῦσί σε.
ltx/gr_gr_cog/oc.m1.d6:ocVE.ApolTheotokionVM.incipit	@ltx/gr_gr_cog/oc.m1.d4:ocMA.Kathisma13.incipit
ltx/gr_gr_cog/oc.m1.d6:ocVE.ApolTheotokionVM.melody	
ltx/gr_gr_cog/oc.m1.d6:ocVE.ApolTheotokionVM.mode	@ltx/gr_gr_cog/miscellanea:misc.Mode1
ltx/gr_gr_cog/oc.m1.d6:ocVE.ApolTheotokionVM.text	@ltx/gr_gr_cog/oc.m1.d4:ocMA.Kathisma13.text
ltx/gr_gr_cog/oc.m1.d6:ocVE.AposTheotokion.greekmelody	@ltx/gr_gr_cog/he.a.m1:heAU.PaneffimoiMartyres.greekname
ltx/gr_gr_cog/oc.m1.d6:ocVE.AposTheotokion.incipit	Τὴν γεῦσιν τὴν πάλαι τοῦ…
ltx/gr_gr_cog/oc.m1.d6:ocVE.AposTheotokion.melody	@ltx/gr_gr_cog/he.a.m1:heAU.PaneffimoiMartyres.name
ltx/gr_gr_cog/oc.m1.d6:ocVE.AposTheotokion.mode	@ltx/gr_gr_cog/miscellanea:misc.Mode1
ltx/gr_gr_cog/oc.m1.d6:ocVE.AposTheotokion.text	Τὴν γεῦσιν τὴν πάλαι τοῦ Ἀδάμ, τὴν πικρὰν ἐγλύκανας, χολὴν καὶ ὄξος γευσάμενος, τέκνον γλυκύτατον, ὑψωθεὶς ἐν ξύλῳ, ὡς κριτὸς ὁ δίκαιος· διό με φαρμαχθεῖσαν τῷ πάθει σου, γλύκανον Δέσποτα, ἀναστὰς ὡς παντοδύναμος, ἡ Παρθένος ἔλεγε δακρύουσα.
ltx/gr_gr_cog/oc.m1.d6:ocVE.Aposticha1.incipit	@ltx/gr_gr_cog/oc.m1.d4:ocVE.Aposticha1.incipit
ltx/gr_gr_cog/oc.m1.d6:ocVE.Aposticha1.melody	
ltx/gr_gr_cog/oc.m1.d6:ocVE.Aposticha1.mode	@ltx/gr_gr_cog/miscellanea:misc.Mode1
ltx/gr_gr_cog/oc.m1.d6:ocVE.Aposticha1.text	@ltx/gr_gr_cog/oc.m1.d4:ocVE.Aposticha1.text
ltx/gr_gr_cog/oc.m1.d6:ocVE.Aposticha2.incipit	@ltx/gr_gr_cog/oc.m1.d4:ocVE.Aposticha2.incipit
ltx/gr_gr_cog/oc.m1.d6:ocVE.Aposticha2.melody	
ltx/gr_gr_cog/oc.m1.d6:ocVE.Aposticha2.mode	@ltx/gr_gr_cog/miscellanea:misc.Mode1
ltx/gr_gr_cog/oc.m1.d6:ocVE.Aposticha2.text	@ltx/gr_gr_cog/oc.m1.d4:ocVE.Aposticha2.text
ltx/gr_gr_cog/oc.m1.d6:ocVE.Aposticha3.incipit	@ltx/gr_gr_cog/oc.m1.d2:ocVE.Aposticha3.incipit
ltx/gr_gr_cog/oc.m1.d6:ocVE.Aposticha3.melody	
ltx/gr_gr_cog/oc.m1.d6:ocVE.Aposticha3.mode	@ltx/gr_gr_cog/miscellanea:misc.Mode1
ltx/gr_gr_cog/oc.m1.d6:ocVE.Aposticha3.text	@ltx/gr_gr_cog/oc.m1.d2:ocVE.Aposticha3.text
ltx/gr_gr_cog/oc.m1.d6:ocVE.SticTheotokion.greekmelody	@ltx/gr_gr_cog/he.a.m1:heAU.TonOuranionTagmaton.greekname
ltx/gr_gr_cog/oc.m1.d6:ocVE.SticTheotokion.incipit	Ἀναρτηθέντα ὡς εἶδεν…
ltx/gr_gr_cog/oc.m1.d6:ocVE.SticTheotokion.melody	@ltx/gr_gr_cog/he.a.m1:heAU.TonOuranionTagmaton.name
ltx/gr_gr_cog/oc.m1.d6:ocVE.SticTheotokion.mode	@ltx/gr_gr_cog/miscellanea:misc.Mode1
ltx/gr_gr_cog/oc.m1.d6:ocVE.SticTheotokion.text	Ἀναρτηθέντα ὡς εἶδεν, ἐπὶ Σταυροῦ τὸν Ἀμνόν, ἡ ἄμωμος Παρθένος, θρηνῳδοῦσα ἐβόα· Γλυκύτατον μου Τέκνον, τί τὸ καινόν, καὶ παράδοξον θέαμα; πῶς ὁ κατέχων τὰ πάντα ἐν τῇ δρακί, ἐπὶ ξύλου προσηλώθης σαρκί;
ltx/gr_gr_cog/oc.m1.d6:ocVE.Stichera1.greekmelody	@ltx/gr_gr_cog/he.a.m1:heAU.TonOuranionTagmaton.greekname
ltx/gr_gr_cog/oc.m1.d6:ocVE.Stichera1.incipit	Ξύλῳ μὲν πρὶν ὁ προπάτωρ…
ltx/gr_gr_cog/oc.m1.d6:ocVE.Stichera1.melody	@ltx/gr_gr_cog/he.a.m1:heAU.TonOuranionTagmaton.name
ltx/gr_gr_cog/oc.m1.d6:ocVE.Stichera1.mode	@ltx/gr_gr_cog/miscellanea:misc.Mode1
ltx/gr_gr_cog/oc.m1.d6:ocVE.Stichera1.text	Ξύλῳ μὲν πρὶν ὁ προπάτωρ, θανάτου γεύεται, ξύλῳ δὲ νῦν τιμίῳ, πᾶς πιστὸς ἐκλυτροῦται, θανάτου καταδίκης· πᾶσα πνοή, ἀνυμνοῦντες δοξάσωμεν, τὸν Σταυρωθέντα βουλήσει ὑπὲρ ἡμῶν, καὶ φωτίσαντα τὰ πέρατα.
ltx/gr_gr_cog/oc.m1.d6:ocVE.Stichera2.incipit	Πεπωρωμένος καρδίαν…
ltx/gr_gr_cog/oc.m1.d6:ocVE.Stichera2.melody	@ltx/gr_gr_cog/he.a.m1:heAU.TonOuranionTagmaton.name
ltx/gr_gr_cog/oc.m1.d6:ocVE.Stichera2.mode	@ltx/gr_gr_cog/miscellanea:misc.Mode1
ltx/gr_gr_cog/oc.m1.d6:ocVE.Stichera2.text	Πεπωρωμένος καρδίαν, καὶ λογισμοῖς πονηροῖς, ἀπεγνωσμένος ὅλος, καὶ κατακεκριμένος, ὑπάρχων ἐκβοῶ σοι· Λόγε Θεοῦ, τὰ κρυφῆ μοι ἐγκλήματα, καὶ τὰς ἀτάκτους κινήσεις τῶν λογισμῶν, καταπράϋνον ὡς εὔσπλαγχνος.
ltx/gr_gr_cog/oc.m1.d6:ocVE.Stichera3.incipit	Ἐν τῷ Σταυρῷ σου Οἰκτίρμον…
ltx/gr_gr_cog/oc.m1.d6:ocVE.Stichera3.melody	@ltx/gr_gr_cog/he.a.m1:heAU.TonOuranionTagmaton.name
ltx/gr_gr_cog/oc.m1.d6:ocVE.Stichera3.mode	@ltx/gr_gr_cog/miscellanea:misc.Mode1
ltx/gr_gr_cog/oc.m1.d6:ocVE.Stichera3.text	Ἐν τῷ Σταυρῷ σου οἰκτίρμον, Χριστὲ καυχώμεθα, καὶ ἐν αὐτῷ τὴν πλάνην, τοῦ ἐχθροῦ ἐκπορθοῦντες, ὑμνοῦμέν σε ἀπαύστως, ὅτι ἡμῶν, τὸ σωτήριον Εὔσπλαγχνε, τῆς γῆς ἐν μέσῳ εἰργάσω ὡς ἀγαθός, ἑκουσίως ὑψωθεὶς ἐν αὐτῷ.
ltx/gr_gr_cog/oc.m1.d6:ocVE.Stichera4.greekmelody	@ltx/gr_gr_cog/he.a.m1:heAU.TonOuranionTagmaton.greekname
ltx/gr_gr_cog/oc.m1.d6:ocVE.Stichera4.incipit	Σὲ σωτηρίαν μου πάντοτε…
ltx/gr_gr_cog/oc.m1.d6:ocVE.Stichera4.melody	@ltx/gr_gr_cog/he.a.m1:heAU.TonOuranionTagmaton.name
ltx/gr_gr_cog/oc.m1.d6:ocVE.Stichera4.mode	@ltx/gr_gr_cog/miscellanea:misc.Mode1
ltx/gr_gr_cog/oc.m1.d6:ocVE.Stichera4.text	Σὲ σωτηρίαν μου πάντοτε ἐπιγράφομαι· ἐν σοὶ θαῤῥῶ σωθῆναι, Παναγία Παρθένε· ἐκ πάσης οὖν με βλάβης, φθορᾶς καὶ παθῶν, ἀνελπίστου κακίας τε, καὶ ἐξαιρέτως ἐκ γνώμης ἀνηλεοῦς, φιλαργύρου τε ἐξάρπασον.
ltx/gr_gr_cog/oc.m1.d6:ocVE.Stichera5.incipit	Ἐπικαλοῦμαί σε πάλιν…
ltx/gr_gr_cog/oc.m1.d6:ocVE.Stichera5.melody	@ltx/gr_gr_cog/he.a.m1:heAU.TonOuranionTagmaton.name
ltx/gr_gr_cog/oc.m1.d6:ocVE.Stichera5.mode	@ltx/gr_gr_cog/miscellanea:misc.Mode1
ltx/gr_gr_cog/oc.m1.d6:ocVE.Stichera5.text	Ἐπικαλοῦμαί σε πάλιν, Παρθένε Δέσποινα, κατὰ τοῦ πάθους τούτου, τῆς φιλοχρηματίας· καὶ γὰρ θηρὸς ἀγρίου αὐτῆς τὰς ὁρμάς, ἀληθῶς πλέον δέδοικα· φιλαργυρίᾳ γὰρ πράγμασι καὶ μικροῖς, φειδομένοις τούτων κρίνεται.
ltx/gr_gr_cog/oc.m1.d6:ocVE.Stichera6.incipit	Ἱλαρωτάτῃ προθέσει…
ltx/gr_gr_cog/oc.m1.d6:ocVE.Stichera6.melody	@ltx/gr_gr_cog/he.a.m1:heAU.TonOuranionTagmaton.name
ltx/gr_gr_cog/oc.m1.d6:ocVE.Stichera6.mode	@ltx/gr_gr_cog/miscellanea:misc.Mode1
ltx/gr_gr_cog/oc.m1.d6:ocVE.Stichera6.text	Ἱλαρωτάτῃ προθέσει, καὶ διαθέσει χρηστῇ, πρὸς τοὺς πτωχοὺς καὶ ξένους, καὶ πενήτων τὰ πλήθη, ὁρᾷν με καθʼ ἑκάστην, ἰσχὺν κραταιάν, Θεοτόκε χορήγησον, ἀκτημοσύνην ἀσπάσασθαι τῷ Θεῷ, οἰκειῶσαι δυναμένην με.
ltx/gr_gr_cog/oc.m1.d6:octrMA.Kathisma11.incipit	@ltx/gr_gr_cog/oc.m1.d4:ocMA.Kathisma12.incipit
ltx/gr_gr_cog/oc.m1.d6:octrMA.Kathisma11.melody	
ltx/gr_gr_cog/oc.m1.d6:octrMA.Kathisma11.mode	@ltx/gr_gr_cog/miscellanea:misc.Mode1
ltx/gr_gr_cog/oc.m1.d6:octrMA.Kathisma11.text	@ltx/gr_gr_cog/oc.m1.d4:ocMA.Kathisma12.text
ltx/gr_gr_cog/oc.m1.d6:octrMA.Kathisma12.greekmelody	@ltx/gr_gr_cog/he.a.m1:heAU.TonTafonSouSotir.greekname
ltx/gr_gr_cog/oc.m1.d6:octrMA.Kathisma12.incipit	@ltx/gr_gr_cog/oc.m1.d4:ocMA.Kathisma22.incipit
ltx/gr_gr_cog/oc.m1.d6:octrMA.Kathisma12.melody	@ltx/gr_gr_cog/he.a.m1:heAU.TonTafonSouSotir.name
ltx/gr_gr_cog/oc.m1.d6:octrMA.Kathisma12.mode	@ltx/gr_gr_cog/miscellanea:misc.Mode1
ltx/gr_gr_cog/oc.m1.d6:octrMA.Kathisma12.text	@ltx/gr_gr_cog/oc.m1.d4:ocMA.Kathisma22.text
ltx/gr_gr_cog/oc.m1.d6:octrMA.Kathisma1T.incipit	@ltx/gr_gr_cog/oc.m1.d4:ocMA.Kathisma13.incipit
ltx/gr_gr_cog/oc.m1.d6:octrMA.Kathisma1T.melody	
ltx/gr_gr_cog/oc.m1.d6:octrMA.Kathisma1T.mode	@ltx/gr_gr_cog/miscellanea:misc.Mode1
ltx/gr_gr_cog/oc.m1.d6:octrMA.Kathisma1T.text	@ltx/gr_gr_cog/oc.m1.d4:ocMA.Kathisma13.text
ltx/gr_gr_cog/oc.m1.d6:octrMA.Ode7Martyricon.incipit	@ltx/gr_gr_cog/oc.m1.d2:ocMA.Kathisma32.incipit
ltx/gr_gr_cog/oc.m1.d6:octrMA.Ode7Martyricon.melody	
ltx/gr_gr_cog/oc.m1.d6:octrMA.Ode7Martyricon.mode	@ltx/gr_gr_cog/miscellanea:misc.Mode1
ltx/gr_gr_cog/oc.m1.d6:octrMA.Ode7Martyricon.text	@ltx/gr_gr_cog/oc.m1.d2:ocMA.Kathisma32.text
ltx/gr_gr_cog/oc.m1.d6:octrMA.Photogogic.incipit	@ltx/gr_gr_cog/oc.m1.d2:octrMA.Photagogic.incipit
ltx/gr_gr_cog/oc.m1.d6:octrMA.Photogogic.mode	@ltx/gr_gr_cog/miscellanea:misc.Mode1
ltx/gr_gr_cog/oc.m1.d6:octrMA.Photogogic.text	@ltx/gr_gr_cog/oc.m1.d2:octrMA.Photagogic.text
ltx/gr_gr_cog/oc.m1.d6:octrMA.Triadic1.incipit	@ltx/gr_gr_cog/oc.m1.d2:octrMA.Triadic1.incipit
ltx/gr_gr_cog/oc.m1.d6:octrMA.Triadic1.mode	@ltx/gr_gr_cog/miscellanea:misc.Mode1
ltx/gr_gr_cog/oc.m1.d6:octrMA.Triadic1.text	@ltx/gr_gr_cog/oc.m1.d2:octrMA.Triadic1.text
ltx/gr_gr_cog/oc.m1.d6:octrMA.Triadic2.incipit	@ltx/gr_gr_cog/oc.m1.d2:octrMA.Triadic2.incipit
ltx/gr_gr_cog/oc.m1.d6:octrMA.Triadic2.mode	@ltx/gr_gr_cog/miscellanea:misc.Mode1
ltx/gr_gr_cog/oc.m1.d6:octrMA.Triadic2.text	@ltx/gr_gr_cog/oc.m1.d2:octrMA.Triadic2.text
ltx/gr_gr_cog/oc.m1.d6:octrMA.Triadic3.incipit	@ltx/gr_gr_cog/oc.m1.d2:octrMA.Triadic3.incipit
ltx/gr_gr_cog/oc.m1.d6:octrMA.Triadic3.mode	@ltx/gr_gr_cog/miscellanea:misc.Mode1
ltx/gr_gr_cog/oc.m1.d6:octrMA.Triadic3.text	@ltx/gr_gr_cog/oc.m1.d2:octrMA.Triadic3.text
