ltx/gr_gr_cog/tr.d048:trCO.header	(Μέγα)
ltx/gr_gr_cog/tr.d048:trDA.commemoration.full	
ltx/gr_gr_cog/tr.d048:trDA.commemoration.short	Παρασκευὴ τῆς Δʹ Ἑβδομάδος
ltx/gr_gr_cog/tr.d048:trDA.insert1	
ltx/gr_gr_cog/tr.d048:trDA.insert2	
ltx/gr_gr_cog/tr.d048:trDA.note	
ltx/gr_gr_cog/tr.d048:trDA.title	
ltx/gr_gr_cog/tr.d048:trHO.commemorations	
ltx/gr_gr_cog/tr.d048:trHO.daytitle	
ltx/gr_gr_cog/tr.d048:trHO.description1	
ltx/gr_gr_cog/tr.d048:trHO.description2	
ltx/gr_gr_cog/tr.d048:trHO.note1	
ltx/gr_gr_cog/tr.d048:trHO.note2	
ltx/gr_gr_cog/tr.d048:trMA.AposGlory.incipit	@ltx/gr_gr_cog/tr.d043:trMA.AdditionalIdiomelon2.incipit
ltx/gr_gr_cog/tr.d048:trMA.AposGlory.melody	@ltx/gr_gr_cog/miscellanea:misc.Idiomelon
ltx/gr_gr_cog/tr.d048:trMA.AposGlory.mode	@ltx/gr_gr_cog/miscellanea:misc.Mode8
ltx/gr_gr_cog/tr.d048:trMA.AposGlory.text	@ltx/gr_gr_cog/tr.d043:trMA.AdditionalIdiomelon2.text
ltx/gr_gr_cog/tr.d048:trMA.AposIdiomelon1.incipit	Ὁ τῆς ἀληθείας ἐξεταστής, καὶ…
ltx/gr_gr_cog/tr.d048:trMA.AposIdiomelon1.melody	@ltx/gr_gr_cog/miscellanea:misc.Idiomelon
ltx/gr_gr_cog/tr.d048:trMA.AposIdiomelon1.mode	@ltx/gr_gr_cog/miscellanea:misc.Mode4
ltx/gr_gr_cog/tr.d048:trMA.AposIdiomelon1.text	Ὁ τῆς ἀληθείας ἐξεταστής, καὶ τῶν κρυπτῶν γνώστης Κύριος, τὸν Φαρισαῖον τῇ κενοδοξίᾳ νικώμενον, καὶ ταῖς ἐξ ἔργων ἀρεταῖς, δικαιούμενον κατέκρινας, τὸν δὲ Τελώνην κατανύξει προσευχόμενον, καὶ ὑπʼ ἐκείνου κατακριθέντα ἐδικαίωσας, οὗ καὶ ἡμᾶς, τῆς μετανοίας ζηλωτάς, ὁ σταυρωθεὶς ἀνάδειξον, καὶ τῆς ἀφέσεως ἀξίωσον ὡς φιλάνθρωπος.
ltx/gr_gr_cog/tr.d048:trMA.AposMartyric.incipit	Τίς οὐκ ἐξίσταται ὁρῶν, ἅγιοι…
ltx/gr_gr_cog/tr.d048:trMA.AposMartyric.melody	
ltx/gr_gr_cog/tr.d048:trMA.AposMartyric.mode	@ltx/gr_gr_cog/miscellanea:misc.Mode4
ltx/gr_gr_cog/tr.d048:trMA.AposMartyric.text	Τίς οὐκ ἐξίσταται ὁρῶν, ἅγιοι Μάρτυρες, τὸν ἀγῶνα τὸν καλόν, ὃν ἠγωνίσασθε; πῶς ἐν σώματι ὄντες, τὸν ἀσώματον ἐχθρὸν ἐνικήσατε, Χριστὸν ὁμολογήσαντες, καὶ Σταυρὸν ὁπλισάμενοι; ὅθεν ἐπαξίως ἀνεδείχθητε, δαιμόνων φυγαδευταί, καὶ βαρβάρων πολέμιοι, ἀπαύστως πρεσβεύσατε, σωθῆναι τὰς ψυχὰς ἡμῶν.
ltx/gr_gr_cog/tr.d048:trMA.C1.acrostic.notice1	οὗ ἡ Ἀκροστιχίς·
ltx/gr_gr_cog/tr.d048:trMA.C1.acrostic.text	Τὸ προσκυνητὸν πάντες ὑμνοῦμεν Ξύλον. Ἰωσήφ.
ltx/gr_gr_cog/tr.d048:trMA.C1.acrostic.title	Κανὼν τοῦ τιμίου Σταυροῦ,
ltx/gr_gr_cog/tr.d048:trMA.C1.title	@ltx/gr_gr_cog/titles:ti.Canon1Triodion
ltx/gr_gr_cog/tr.d048:trMA.C1.verse	@ltx/gr_gr_cog/prayers:pr.verse_Cross.text
ltx/gr_gr_cog/tr.d048:trMA.C2.poet	@ltx/gr_gr_cog/poets:po.Iosif
ltx/gr_gr_cog/tr.d048:trMA.C2.title	Τὸ Τριῴδιον.
ltx/gr_gr_cog/tr.d048:trMA.C2.verse	@ltx/gr_gr_cog/prayers:pr.verse_Cross.text
ltx/gr_gr_cog/tr.d048:trMA.C3.poet	@ltx/gr_gr_cog/poets:po.Theodorou
ltx/gr_gr_cog/tr.d048:trMA.C3.title	Ἕτερον Τριῴδιον.
ltx/gr_gr_cog/tr.d048:trMA.C3.verse	@ltx/gr_gr_cog/prayers:pr.verse_Cross.text
ltx/gr_gr_cog/tr.d048:trMA.Kathisma21.greekmelody	@ltx/gr_gr_cog/he.a.m4:heAU.OYpsotheisEnToStavro.greekname
ltx/gr_gr_cog/tr.d048:trMA.Kathisma21.incipit	Τῆς ἐγκρατείας τὸν καιρὸν ἁγιάζων…
ltx/gr_gr_cog/tr.d048:trMA.Kathisma21.melody	@ltx/gr_gr_cog/he.a.m4:heAU.OYpsotheisEnToStavro.name
ltx/gr_gr_cog/tr.d048:trMA.Kathisma21.mode	@ltx/gr_gr_cog/miscellanea:misc.Mode4
ltx/gr_gr_cog/tr.d048:trMA.Kathisma21.text	Τῆς ἐγκρατείας τὸν καιρὸν ἁγιάζων, ὁ πανσεβάσμιος Σταυρὸς καθορᾶται, ὃν προσκυνοῦντες σήμερον βοήσωμεν· Δέσποτα φιλάνθρωπε, τῇ αὐτοῦ συμμαχίᾳ, δίδου διελθεῖν ἡμᾶς, τὸ λοιπὸν τῆς Νηστείας, ἐν κατανύξει καὶ τὰ ζωηρά, βλέψαι σου Πάθη, διʹ ὧν ἐλυτρώθημεν.
ltx/gr_gr_cog/tr.d048:trMA.Kathisma22.greekmelody	@ltx/gr_gr_cog/he.a.m4:heAU.OYpsotheisEnToStavro.greekname
ltx/gr_gr_cog/tr.d048:trMA.Kathisma22.incipit	Τὸν ἐξ ἀνάρχου τοῦ Πατρὸς…
ltx/gr_gr_cog/tr.d048:trMA.Kathisma22.melody	@ltx/gr_gr_cog/he.a.m4:heAU.OYpsotheisEnToStavro.name
ltx/gr_gr_cog/tr.d048:trMA.Kathisma22.mode	@ltx/gr_gr_cog/miscellanea:misc.Mode4
ltx/gr_gr_cog/tr.d048:trMA.Kathisma22.text	Τὸν ἐξ ἀνάρχου τοῦ Πατρὸς γεννηθέντα, ἡ ἐπʼ ἐσχάτων σε Χριστὲ τετοκυῖα, ἐπὶ Σταυροῦ κρεμάμενον ἠλάλαζεν· Οἴμοι ποθεινότατε Ἰησοῦ! ἀνεβόα, πῶς ὁ δοξαζόμενος, ὡς Θεὸς ὑπʼ Ἀγγέλων, ὑπὸ ἀνόμων νῦν βροτῶν Υἱέ, θέλων σταυροῦσαι; Ὑμνῶ σε Μακρόθυμε.
ltx/gr_gr_cog/tr.d048:trMA.Kathisma31.greekmelody	@ltx/gr_gr_cog/he.a.m4:heAU.TachyProkatalave.greekname
ltx/gr_gr_cog/tr.d048:trMA.Kathisma31.incipit	Τὸ φῶς τῶν ψυχῶν ἡμῶν…
ltx/gr_gr_cog/tr.d048:trMA.Kathisma31.melody	@ltx/gr_gr_cog/he.a.m4:heAU.TachyProkatalave.name
ltx/gr_gr_cog/tr.d048:trMA.Kathisma31.mode	@ltx/gr_gr_cog/miscellanea:misc.Mode4
ltx/gr_gr_cog/tr.d048:trMA.Kathisma31.text	Τὸ φῶς τῶν ψυχῶν ἡμῶν, νῦν καθορῶντες Χριστέ, Σταυρόν σου τὸν ἄχραντον, καὶ προσκυνοῦντες χαρᾷ, φαιδρῶς ἐκβοήσωμεν· Δόξα σοι ὁ ἐν τούτῳ, ὑψωθῆναι θελήσας, δόξα σοι ὁ φωτίσας, διʹ αὐτοῦ πᾶσαν Κτίσιν, ἐν ᾧ σε ἀκαταπαύστως, ὕμνοις δοξάζομεν.
ltx/gr_gr_cog/tr.d048:trMA.Kathisma32.greekmelody	@ltx/gr_gr_cog/he.a.m4:heAU.TachyProkatalave.greekname
ltx/gr_gr_cog/tr.d048:trMA.Kathisma32.incipit	Σταυρῷ σε ὑψούμενον, ὡς ἐθεάσατο…
ltx/gr_gr_cog/tr.d048:trMA.Kathisma32.melody	@ltx/gr_gr_cog/he.a.m4:heAU.TachyProkatalave.name
ltx/gr_gr_cog/tr.d048:trMA.Kathisma32.mode	@ltx/gr_gr_cog/miscellanea:misc.Mode4
ltx/gr_gr_cog/tr.d048:trMA.Kathisma32.text	Σταυρῷ σε ὑψούμενον, ὡς ἐθεάσατο, ἡ ἄνυμφος Μήτηρ σου, Λόγε Θεοῦ μητρικῶς θρηνοῦσα ἐφθέγγετο· Τί τὸ καινὸν καὶ ξένον, τοῦτο Υἱέ μου θαῦμα; πῶς ἡ ζωὴ τῶν ὅλων ὁμιλεῖς τῷ θανάτῳ; ζωῶσαι τοὺς τεθνεῶτας, θέλων ὡς εὔσπλαγχνος.
ltx/gr_gr_cog/tr.d048:trMA.Kontakion1.incipit	@ltx/gr_gr_cog/tr.d043:trMA.Kontakion1.incipit
ltx/gr_gr_cog/tr.d048:trMA.Kontakion1.melody	@ltx/gr_gr_cog/miscellanea:misc.Automelon
ltx/gr_gr_cog/tr.d048:trMA.Kontakion1.mode	@ltx/gr_gr_cog/miscellanea:misc.Mode7
ltx/gr_gr_cog/tr.d048:trMA.Kontakion1.text	@ltx/gr_gr_cog/tr.d043:trMA.Kontakion1.text
ltx/gr_gr_cog/tr.d048:trMA.Ode1C11.greekmelody	@ltx/gr_gr_cog/he.h.m8:heHE.ArmatilatinFarao.greekname
ltx/gr_gr_cog/tr.d048:trMA.Ode1C11.incipit	Τὸν τοῦ Κυρίου προσελθόντες σήμερον…
ltx/gr_gr_cog/tr.d048:trMA.Ode1C11.melody	@ltx/gr_gr_cog/he.h.m8:heHE.ArmatilatinFarao.name
ltx/gr_gr_cog/tr.d048:trMA.Ode1C11.mode	@ltx/gr_gr_cog/miscellanea:misc.Mode8
ltx/gr_gr_cog/tr.d048:trMA.Ode1C11.ode	@ltx/gr_gr_cog/miscellanea:misc.Ode1
ltx/gr_gr_cog/tr.d048:trMA.Ode1C11.text	Τὸν τοῦ Κυρίου προσελθόντες σήμερον, Σταυρὸν νοῒ καθαρῷ, καὶ εὐσεβεῖ γνώμῃ, δεῦτε προσκυνήσωμεν· πρόκειται γὰρ δωρούμενος, τοῖς αὐτὸν προσκυνοῦσιν, ἁγιασμόν τε σωτήριον, ἔλλαμψιν καὶ δόξαν καὶ ἔλεος.
ltx/gr_gr_cog/tr.d048:trMA.Ode1C12.incipit	Ὁ ζωοδώρητος Σταυρὸς προκείμενος, καὶ…
ltx/gr_gr_cog/tr.d048:trMA.Ode1C12.melody	@ltx/gr_gr_cog/he.h.m8:heHE.ArmatilatinFarao.name
ltx/gr_gr_cog/tr.d048:trMA.Ode1C12.mode	@ltx/gr_gr_cog/miscellanea:misc.Mode8
ltx/gr_gr_cog/tr.d048:trMA.Ode1C12.ode	@ltx/gr_gr_cog/miscellanea:misc.Ode1
ltx/gr_gr_cog/tr.d048:trMA.Ode1C12.text	Ὁ ζωοδώρητος Σταυρὸς προκείμενος, καὶ καθορώμενος, φωτοειδῆ αἴγλην, ἀποπέμπει χάριτος, προσέλθωμεν καὶ λάβωμεν, φωτισμὸν εὐφροσύνης, καὶ σωτηρίαν καὶ ἄφεσιν αἴνεσιν Κυρίῳ προσάγοντες.
ltx/gr_gr_cog/tr.d048:trMA.Ode1C13.incipit	Πρόκειται ξένον τοῖς ὁρῶσι θέαμα…
ltx/gr_gr_cog/tr.d048:trMA.Ode1C13.melody	@ltx/gr_gr_cog/he.h.m8:heHE.ArmatilatinFarao.name
ltx/gr_gr_cog/tr.d048:trMA.Ode1C13.mode	@ltx/gr_gr_cog/miscellanea:misc.Mode8
ltx/gr_gr_cog/tr.d048:trMA.Ode1C13.ode	@ltx/gr_gr_cog/miscellanea:misc.Ode1
ltx/gr_gr_cog/tr.d048:trMA.Ode1C13.text	Πρόκειται ξένον τοῖς ὁρῶσι θέαμα, Σταυρὸς ὁ τίμιος, καὶ ὡς πηγὴ βρύει, ψυχικὰ χαρίσματα, καὶ παύει ἁμαρτήματα, καὶ νοσήματα, λύει, καὶ τὰ φρονήματα ῥώννυσι, τῶν εἰλικρινῶς προσιόντων αὐτῷ.
ltx/gr_gr_cog/tr.d048:trMA.Ode1C14.incipit	Ῥάβδος ἐτύπου τοῦ Σταυροῦ τὸ…
ltx/gr_gr_cog/tr.d048:trMA.Ode1C14.melody	@ltx/gr_gr_cog/he.h.m8:heHE.ArmatilatinFarao.name
ltx/gr_gr_cog/tr.d048:trMA.Ode1C14.mode	@ltx/gr_gr_cog/miscellanea:misc.Mode8
ltx/gr_gr_cog/tr.d048:trMA.Ode1C14.ode	@ltx/gr_gr_cog/miscellanea:misc.Ode1
ltx/gr_gr_cog/tr.d048:trMA.Ode1C14.text	Ῥάβδος ἐτύπου τοῦ Σταυροῦ τὸ τρόπαιον, θάλασσαν τέμνουσα, διʹ οὗ ἡμεῖς πίστει, ἀποντίστως πλέομεν, τοῦ βίου ὕδωρ ἄστατον, καὶ τὰ ῥεύματα πάντα, τῆς ἁμαρτίας ἐκφεύγομεν, καὶ θείας γαλήνης πληρούμεθα.
ltx/gr_gr_cog/tr.d048:trMA.Ode1C1H.greekmelody	@ltx/gr_gr_cog/he.h.m8:heHE.ArmatilatinFarao.greekname
ltx/gr_gr_cog/tr.d048:trMA.Ode1C1H.incipit	@ltx/gr_gr_cog/he.h.m8:heHE.ArmatilatinFarao.incipit
ltx/gr_gr_cog/tr.d048:trMA.Ode1C1H.melody	@ltx/gr_gr_cog/he.h.m8:heHE.ArmatilatinFarao.melody
ltx/gr_gr_cog/tr.d048:trMA.Ode1C1H.mode	@ltx/gr_gr_cog/miscellanea:misc.Mode8
ltx/gr_gr_cog/tr.d048:trMA.Ode1C1H.ode	@ltx/gr_gr_cog/miscellanea:misc.Ode1
ltx/gr_gr_cog/tr.d048:trMA.Ode1C1H.text	@ltx/gr_gr_cog/he.h.m8:heHE.ArmatilatinFarao.text
ltx/gr_gr_cog/tr.d048:trMA.Ode1C1T.incipit	Ὅτε σε Τέκνον ἀποῤῥήτως ἔτεκον…
ltx/gr_gr_cog/tr.d048:trMA.Ode1C1T.melody	@ltx/gr_gr_cog/he.h.m8:heHE.ArmatilatinFarao.name
ltx/gr_gr_cog/tr.d048:trMA.Ode1C1T.mode	@ltx/gr_gr_cog/miscellanea:misc.Mode8
ltx/gr_gr_cog/tr.d048:trMA.Ode1C1T.ode	@ltx/gr_gr_cog/miscellanea:misc.Ode1
ltx/gr_gr_cog/tr.d048:trMA.Ode1C1T.text	Ὅτε σε Τέκνον ἀποῤῥήτως ἔτεκον, ὠδῖνας ἔφυγον· καὶ πῶς νυνὶ ὅλη, ὀδυνῶν πεπλήρωμαι; Ὁρῶ γάρ σε κρεμάμενον, ὡς κακοῦργον τῷ ξύλῳ, τὸν γῆν ἀσχέτως κρεμάσαντα, ἔλεγεν ἡ Πάναγνος κλαίουσα.
ltx/gr_gr_cog/tr.d048:trMA.Ode3C11.greekmelody	@ltx/gr_gr_cog/he.h.m8:heHE.OStereosasKatArchas.greekname
ltx/gr_gr_cog/tr.d048:trMA.Ode3C11.incipit	Σταυρὸς ἁπάντων τῶν καλῶν, παρεκτικὸς…
ltx/gr_gr_cog/tr.d048:trMA.Ode3C11.melody	@ltx/gr_gr_cog/he.h.m8:heHE.OStereosasKatArchas.name
ltx/gr_gr_cog/tr.d048:trMA.Ode3C11.mode	@ltx/gr_gr_cog/miscellanea:misc.Mode8
ltx/gr_gr_cog/tr.d048:trMA.Ode3C11.ode	@ltx/gr_gr_cog/miscellanea:misc.Ode3
ltx/gr_gr_cog/tr.d048:trMA.Ode3C11.text	Σταυρὸς ἁπάντων τῶν καλῶν, παρεκτικὸς καθορᾶται, προσκυνούμενος, καὶ πᾶσα ἡ Κτίσις, ἑορτάζει ἐν χαρᾷ, φωτιζομένη χάριτι, τοῦ ἐν αὐτῷ βουλήσει, ἀνυψωθέντος Θεοῦ ἡμῶν.
ltx/gr_gr_cog/tr.d048:trMA.Ode3C12.incipit	Καταυγαζόμενοι φωτί, τῶν τοῦ Σταυροῦ…
ltx/gr_gr_cog/tr.d048:trMA.Ode3C12.melody	@ltx/gr_gr_cog/he.h.m8:heHE.OStereosasKatArchas.name
ltx/gr_gr_cog/tr.d048:trMA.Ode3C12.mode	@ltx/gr_gr_cog/miscellanea:misc.Mode8
ltx/gr_gr_cog/tr.d048:trMA.Ode3C12.ode	@ltx/gr_gr_cog/miscellanea:misc.Ode3
ltx/gr_gr_cog/tr.d048:trMA.Ode3C12.text	Καταυγαζόμενοι φωτί, τῶν τοῦ Σταυροῦ λαμπηδόνων, μεσασμῷ τῆς ἱερᾶς ἐγκρατείας, σκοτασμὸν ἁμαρτιῶν, ἐκφύγωμεν καὶ κράξωμεν· Ὁ φωτισμὸς τῶν ὅλων, εὔσπλαγχνε Κύριε δόξα σοι.
ltx/gr_gr_cog/tr.d048:trMA.Ode3C13.incipit	Ὑμνολογοῦμέν σε Σταυρέ, καὶ προσπτυσσόμεθα…
ltx/gr_gr_cog/tr.d048:trMA.Ode3C13.melody	@ltx/gr_gr_cog/he.h.m8:heHE.OStereosasKatArchas.name
ltx/gr_gr_cog/tr.d048:trMA.Ode3C13.mode	@ltx/gr_gr_cog/miscellanea:misc.Mode8
ltx/gr_gr_cog/tr.d048:trMA.Ode3C13.ode	@ltx/gr_gr_cog/miscellanea:misc.Ode3
ltx/gr_gr_cog/tr.d048:trMA.Ode3C13.text	Ὑμνολογοῦμέν σε Σταυρέ, καὶ προσπτυσσόμεθα πίστει, ἐξαιτούμενοι τῇ σῇ δυναστείᾳ, ἐξελοῦ ἡμᾶς ἐχθροῦ, παγίδων καὶ κυβέρνησον, πάντας ἡμᾶς πρὸς ὅρμον, τῆς σωτηρίας τιμῶντάς σε.
ltx/gr_gr_cog/tr.d048:trMA.Ode3C1H.greekmelody	@ltx/gr_gr_cog/he.h.m8:heHE.OStereosasKatArchas.greekname
ltx/gr_gr_cog/tr.d048:trMA.Ode3C1H.incipit	@ltx/gr_gr_cog/he.h.m8:heHE.OStereosasKatArchas.incipit
ltx/gr_gr_cog/tr.d048:trMA.Ode3C1H.melody	@ltx/gr_gr_cog/he.h.m8:heHE.OStereosasKatArchas.melody
ltx/gr_gr_cog/tr.d048:trMA.Ode3C1H.mode	@ltx/gr_gr_cog/miscellanea:misc.Mode8
ltx/gr_gr_cog/tr.d048:trMA.Ode3C1H.ode	@ltx/gr_gr_cog/miscellanea:misc.Ode3
ltx/gr_gr_cog/tr.d048:trMA.Ode3C1H.text	@ltx/gr_gr_cog/he.h.m8:heHE.OStereosasKatArchas.text
ltx/gr_gr_cog/tr.d048:trMA.Ode3C1T.incipit	Νενεκρωμένην τὴν ζωήν, ἐπὶ Σταυροῦ…
ltx/gr_gr_cog/tr.d048:trMA.Ode3C1T.melody	@ltx/gr_gr_cog/he.h.m8:heHE.OStereosasKatArchas.name
ltx/gr_gr_cog/tr.d048:trMA.Ode3C1T.mode	@ltx/gr_gr_cog/miscellanea:misc.Mode8
ltx/gr_gr_cog/tr.d048:trMA.Ode3C1T.ode	@ltx/gr_gr_cog/miscellanea:misc.Ode3
ltx/gr_gr_cog/tr.d048:trMA.Ode3C1T.text	Νενεκρωμένην τὴν ζωήν, ἐπὶ Σταυροῦ θεωροῦσα, καὶ μὴ φέρουσα τῶν σπλάγχνων τὸν πόνον, ἐδονεῖτο ἡ σεμνή, Παρθένος ἀνακράζουσα· Οἴμοι Υἱέ μου, τί σοι, δῆμος ἀνόμων ἀπέδωκεν!
ltx/gr_gr_cog/tr.d048:trMA.Ode3Kathisma1.incipit	Μόνον ἐπάγη τὸ ξύλον Χριστὲ…
ltx/gr_gr_cog/tr.d048:trMA.Ode3Kathisma1.melody	
ltx/gr_gr_cog/tr.d048:trMA.Ode3Kathisma1.mode	@ltx/gr_gr_cog/miscellanea:misc.Mode6
ltx/gr_gr_cog/tr.d048:trMA.Ode3Kathisma1.text	Μόνον ἐπάγη τὸ ξύλον Χριστὲ τοῦ Σταυροῦ σου, τὰ θεμέλια ἐσαλεύθη τοῦ θανάτου Κύριε· ὃν γὰρ κατέπιε πόθῳ ὁ ᾍδης, ἀπέλυσε τρόμῳ, ἔδειξας ἡμῖν τὸ σωτήριόν σου Ἅγιε, καὶ δοξολογοῦμέν σε Υἱὲ Θεοῦ. Ἐλέησον ἡμᾶς.
ltx/gr_gr_cog/tr.d048:trMA.Ode3Kathisma2.incipit	Σήμερον τὸ προφητικὸν πεπλήρωται λόγιον…
ltx/gr_gr_cog/tr.d048:trMA.Ode3Kathisma2.melody	
ltx/gr_gr_cog/tr.d048:trMA.Ode3Kathisma2.mode	@ltx/gr_gr_cog/miscellanea:misc.Mode6
ltx/gr_gr_cog/tr.d048:trMA.Ode3Kathisma2.text	Σήμερον τὸ προφητικὸν πεπλήρωται λόγιον· ἰδοὺ γὰρ προσκυνοῦμεν εἰς τὸν τόπον, οὗ ἔστησαν οἱ πόδες σου Κύριε, καὶ Ξύλου σωτηρίας γευσάμενοι, τῶν ἐξ ἁμαρτίας παθῶν ἐλευθερίας ἐτύχομεν, πρεσβείαις τῆς Θεοτόκου, μόνε φιλάνθρωπε.
ltx/gr_gr_cog/tr.d048:trMA.Ode4C11.greekmelody	@ltx/gr_gr_cog/he.h.m8:heHE.SyMouIschys.greekname
ltx/gr_gr_cog/tr.d048:trMA.Ode4C11.incipit	Ἡ κραταιά, σκέπη τε καὶ…
ltx/gr_gr_cog/tr.d048:trMA.Ode4C11.melody	@ltx/gr_gr_cog/he.h.m8:heHE.SyMouIschys.name
ltx/gr_gr_cog/tr.d048:trMA.Ode4C11.mode	@ltx/gr_gr_cog/miscellanea:misc.Mode6
ltx/gr_gr_cog/tr.d048:trMA.Ode4C11.ode	@ltx/gr_gr_cog/miscellanea:misc.Ode4
ltx/gr_gr_cog/tr.d048:trMA.Ode4C11.text	Ἡ κραταιά, σκέπη τε καὶ ἐπανόρθωσις, τῶν ἀνθρώπων, τὸ ἀκαταμάχητον, ὅπλον τῆς πίστεως ὁ Σταυρός, ὁ σωτηριώδης, ἰδοὺ ὁρᾶται προκείμενος, καὶ πάντων τὰς καρδίας, τῶν πιστῶς προσιόντων, ἁγιάζει φωτίζει ἐν χάριτι.
ltx/gr_gr_cog/tr.d048:trMA.Ode4C12.incipit	Τῷ μεσασμῷ, τῆς ἐγκρατείας προκείμενος…
ltx/gr_gr_cog/tr.d048:trMA.Ode4C12.melody	@ltx/gr_gr_cog/he.h.m8:heHE.SyMouIschys.name
ltx/gr_gr_cog/tr.d048:trMA.Ode4C12.mode	@ltx/gr_gr_cog/miscellanea:misc.Mode6
ltx/gr_gr_cog/tr.d048:trMA.Ode4C12.ode	@ltx/gr_gr_cog/miscellanea:misc.Ode4
ltx/gr_gr_cog/tr.d048:trMA.Ode4C12.text	Τῷ μεσασμῷ, τῆς ἐγκρατείας προκείμενος, ἐν τῷ μέσῳ, πάντων ὑπεράγαθε, Σταυρὸς ὁ τίμιος μέσον γῆς, ἐν ᾧ ἀνυψώθης, ἐθελουσίως φιλάνθρωπε τὸν Κόσμον ἁγιάζει, τῇ αὐτοῦ προσκυνήσει, καὶ διώκει δαιμόνων τὰς φάλαγγας.
ltx/gr_gr_cog/tr.d048:trMA.Ode4C13.incipit	Ὁ Οὐρανός, καὶ πᾶσα γῆ…
ltx/gr_gr_cog/tr.d048:trMA.Ode4C13.melody	@ltx/gr_gr_cog/he.h.m8:heHE.SyMouIschys.name
ltx/gr_gr_cog/tr.d048:trMA.Ode4C13.mode	@ltx/gr_gr_cog/miscellanea:misc.Mode6
ltx/gr_gr_cog/tr.d048:trMA.Ode4C13.ode	@ltx/gr_gr_cog/miscellanea:misc.Ode4
ltx/gr_gr_cog/tr.d048:trMA.Ode4C13.text	Ὁ Οὐρανός, καὶ πᾶσα γῆ συνευφραίνεται, Ἀθλοφόροι, Μάρτυρες, Ἀπόστολοι, ψυχαὶ Δικαίων περιχαρῶς, νῦν ἀγαλλιῶνται, τὸ πάντας σῷζον θεώμενοι, προκείμενον ἐν μέσῳ, ζωοδώρητον Ξύλον, καὶ πιστοὺς ἁγιάζον ἐν χάριτι.
ltx/gr_gr_cog/tr.d048:trMA.Ode4C14.incipit	Νόμους τοὺς σούς, Κύριε ὁ…
ltx/gr_gr_cog/tr.d048:trMA.Ode4C14.melody	@ltx/gr_gr_cog/he.h.m8:heHE.SyMouIschys.name
ltx/gr_gr_cog/tr.d048:trMA.Ode4C14.mode	@ltx/gr_gr_cog/miscellanea:misc.Mode6
ltx/gr_gr_cog/tr.d048:trMA.Ode4C14.ode	@ltx/gr_gr_cog/miscellanea:misc.Ode4
ltx/gr_gr_cog/tr.d048:trMA.Ode4C14.text	Νόμους τοὺς σούς, Κύριε ὁ ἀσυνείδητος μὴ φυλάξας, μέλλω κατακρίνεσθαι, ἡνίκα ἔρχῃ ἐξ οὐρανοῦ, κρῖναι τῶν ἀνθρώπων, τὰ ἔργα· ὅθεν κραυγάζω σοι· Δυνάμει τοῦ Σταυροῦ σου, ἐπιστρέψας με σῶσόν μετανοίας παρέχων μοι δάκρυα.
ltx/gr_gr_cog/tr.d048:trMA.Ode4C1H.greekmelody	@ltx/gr_gr_cog/he.h.m8:heHE.SyMouIschys.greekname
ltx/gr_gr_cog/tr.d048:trMA.Ode4C1H.incipit	@ltx/gr_gr_cog/he.h.m8:heHE.SyMouIschys.incipit
ltx/gr_gr_cog/tr.d048:trMA.Ode4C1H.melody	@ltx/gr_gr_cog/he.h.m8:heHE.SyMouIschys.melody
ltx/gr_gr_cog/tr.d048:trMA.Ode4C1H.mode	@ltx/gr_gr_cog/miscellanea:misc.Mode8
ltx/gr_gr_cog/tr.d048:trMA.Ode4C1H.ode	@ltx/gr_gr_cog/miscellanea:misc.Ode4
ltx/gr_gr_cog/tr.d048:trMA.Ode4C1H.text	@ltx/gr_gr_cog/he.h.m8:heHE.SyMouIschys.text
ltx/gr_gr_cog/tr.d048:trMA.Ode4C1T.incipit	Παρθενικῆς, Τέκνον ἐκ μήτρας σε…
ltx/gr_gr_cog/tr.d048:trMA.Ode4C1T.melody	@ltx/gr_gr_cog/he.h.m8:heHE.SyMouIschys.name
ltx/gr_gr_cog/tr.d048:trMA.Ode4C1T.mode	@ltx/gr_gr_cog/miscellanea:misc.Mode6
ltx/gr_gr_cog/tr.d048:trMA.Ode4C1T.ode	@ltx/gr_gr_cog/miscellanea:misc.Ode4
ltx/gr_gr_cog/tr.d048:trMA.Ode4C1T.text	Παρθενικῆς, Τέκνον ἐκ μήτρας σε ἔτεκον καὶ ὁρῶσα, Ξύλῳ σε κρεμάμενον, ἐξαπορῶ, καὶ οὐ συνορῶ, ὕψος μυστηρίου, καὶ βάθος πολλῶν κριμάτων σου, ἡ Πάναγνος ἐβόα, ἣν φωναῖς ἀσιγήτοις, ὡς Μητέρα Θεοῦ μακαρίζομεν.
ltx/gr_gr_cog/tr.d048:trMA.Ode5C11.greekmelody	@ltx/gr_gr_cog/he.h.m8:heHE.InaTiMeAposo.greekname
ltx/gr_gr_cog/tr.d048:trMA.Ode5C11.incipit	Ἀλαλάξατε ἔθνη, ᾄσατε καὶ ψάλατε…
ltx/gr_gr_cog/tr.d048:trMA.Ode5C11.melody	@ltx/gr_gr_cog/he.h.m8:heHE.InaTiMeAposo.name
ltx/gr_gr_cog/tr.d048:trMA.Ode5C11.mode	@ltx/gr_gr_cog/miscellanea:misc.Mode6
ltx/gr_gr_cog/tr.d048:trMA.Ode5C11.ode	@ltx/gr_gr_cog/miscellanea:misc.Ode5
ltx/gr_gr_cog/tr.d048:trMA.Ode5C11.text	Ἀλαλάξατε ἔθνη, ᾄσατε καὶ ψάλατε, φυλαὶ σκιρτήσατε, τῷ Θεῷ τῷ δόντι, τὸν Σταυρὸν ἀδιάσειστον ἔρεισμα, οἱ τῆς ἐγκρατείας, νῦν τῷ καιρῷ κατατρυφῶντες, ἑστιῶντες ψυχὴν καὶ διάνοιαν.
ltx/gr_gr_cog/tr.d048:trMA.Ode5C12.incipit	Νοεραὶ στρατιαί σε, πᾶσαι περιέπουσι…
ltx/gr_gr_cog/tr.d048:trMA.Ode5C12.melody	@ltx/gr_gr_cog/he.h.m8:heHE.InaTiMeAposo.name
ltx/gr_gr_cog/tr.d048:trMA.Ode5C12.mode	@ltx/gr_gr_cog/miscellanea:misc.Mode6
ltx/gr_gr_cog/tr.d048:trMA.Ode5C12.ode	@ltx/gr_gr_cog/miscellanea:misc.Ode5
ltx/gr_gr_cog/tr.d048:trMA.Ode5C12.text	Νοεραὶ στρατιαί σε, πᾶσαι περιέπουσι, Σταυρὲ πανάγιε, καὶ βροτοὶ πηλίνοις, σοὶ προσψαύοντες χείλεσι σήμερον, ἀπαντλοῦμεν πόθῳ, ἁγιασμὸν καὶ εὐλογίαν, τὸν ἐν σοὶ προσπαγέντα δοξάζοντες.
ltx/gr_gr_cog/tr.d048:trMA.Ode5C13.incipit	Τῆς ψυχῆς μου τὰ πάθη…
ltx/gr_gr_cog/tr.d048:trMA.Ode5C13.melody	@ltx/gr_gr_cog/he.h.m8:heHE.InaTiMeAposo.name
ltx/gr_gr_cog/tr.d048:trMA.Ode5C13.mode	@ltx/gr_gr_cog/miscellanea:misc.Mode6
ltx/gr_gr_cog/tr.d048:trMA.Ode5C13.ode	@ltx/gr_gr_cog/miscellanea:misc.Ode5
ltx/gr_gr_cog/tr.d048:trMA.Ode5C13.text	Τῆς ψυχῆς μου τὰ πάθη, ἴασαι τὰ χρόνια, εὔσπλαγχνε Κύριε, καὶ προσκυνητήν με, τῶν ἁγίων Παθῶν σου ἀξίωσον, τῆς νηστείας χρόνῳ, βελτιωθέντα ἀναδεῖξαι, καὶ κακῶν ἀποσχεῖν ὑπεράγαθε.
ltx/gr_gr_cog/tr.d048:trMA.Ode5C1H.greekmelody	@ltx/gr_gr_cog/he.h.m8:heHE.InaTiMeAposo.greekname
ltx/gr_gr_cog/tr.d048:trMA.Ode5C1H.incipit	@ltx/gr_gr_cog/he.h.m8:heHE.InaTiMeAposo.incipit
ltx/gr_gr_cog/tr.d048:trMA.Ode5C1H.melody	@ltx/gr_gr_cog/he.h.m8:heHE.InaTiMeAposo.melody
ltx/gr_gr_cog/tr.d048:trMA.Ode5C1H.mode	@ltx/gr_gr_cog/miscellanea:misc.Mode8
ltx/gr_gr_cog/tr.d048:trMA.Ode5C1H.ode	@ltx/gr_gr_cog/miscellanea:misc.Ode5
ltx/gr_gr_cog/tr.d048:trMA.Ode5C1H.text	@ltx/gr_gr_cog/he.h.m8:heHE.InaTiMeAposo.text
ltx/gr_gr_cog/tr.d048:trMA.Ode5C1T.incipit	Ἐν Σταυρῷ καθορῶσα, τὸν διʹ…
ltx/gr_gr_cog/tr.d048:trMA.Ode5C1T.melody	@ltx/gr_gr_cog/he.h.m8:heHE.InaTiMeAposo.name
ltx/gr_gr_cog/tr.d048:trMA.Ode5C1T.mode	@ltx/gr_gr_cog/miscellanea:misc.Mode6
ltx/gr_gr_cog/tr.d048:trMA.Ode5C1T.ode	@ltx/gr_gr_cog/miscellanea:misc.Ode5
ltx/gr_gr_cog/tr.d048:trMA.Ode5C1T.text	Ἐν Σταυρῷ καθορῶσα, τὸν διʹ ἀγαθότητα, ἐκ σοῦ Πανάμωμε, ὑπὲρ νοῦν τεχθέντα, ἐτιτρώσκου τὰ σπλάγχνα, καὶ ἔλεγες· Οἴμοι θεῖον Τέκνον! πῶς ὑπὲρ πάντων ὀδυνᾶσαι; Προσκυνῶ σου τὸ εὔσπλαγχνον Κύριε.
ltx/gr_gr_cog/tr.d048:trMA.Ode5C21.greekmelody	@ltx/gr_gr_cog/he.h.m4:heHE.ExestiTaSympanta.greekname
ltx/gr_gr_cog/tr.d048:trMA.Ode5C21.incipit	Φωστῆρες ἀπέκρυπτον, τὸ φῶς αὐτῶν…
ltx/gr_gr_cog/tr.d048:trMA.Ode5C21.melody	@ltx/gr_gr_cog/he.h.m4:heHE.ExestiTaSympanta.name
ltx/gr_gr_cog/tr.d048:trMA.Ode5C21.mode	@ltx/gr_gr_cog/miscellanea:misc.Mode4
ltx/gr_gr_cog/tr.d048:trMA.Ode5C21.ode	@ltx/gr_gr_cog/miscellanea:misc.Ode5
ltx/gr_gr_cog/tr.d048:trMA.Ode5C21.text	Φωστῆρες ἀπέκρυπτον, τὸ φῶς αὐτῶν θεώμενοι, ξύλῳ προσηλούμενον ἀδίκως, δίκαιε μόνε, σὲ τὸν μακρόθυμον, καὶ τοῦ πονηροῦ τὰς ζοφεράς, Σῶτερ δειγματίζοντα, ἐξουσίας τῷ κράτει σου.
ltx/gr_gr_cog/tr.d048:trMA.Ode5C22.incipit	Νηστείας ἐν ὕδατι, τὰ πρόσωπα…
ltx/gr_gr_cog/tr.d048:trMA.Ode5C22.melody	@ltx/gr_gr_cog/he.h.m4:heHE.ExestiTaSympanta.name
ltx/gr_gr_cog/tr.d048:trMA.Ode5C22.mode	@ltx/gr_gr_cog/miscellanea:misc.Mode4
ltx/gr_gr_cog/tr.d048:trMA.Ode5C22.ode	@ltx/gr_gr_cog/miscellanea:misc.Ode5
ltx/gr_gr_cog/tr.d048:trMA.Ode5C22.text	Νηστείας ἐν ὕδατι, τὰ πρόσωπα νιψώμεθα, καὶ περιπτυξώμεθα τὸ Ξύλον, μόνος ὁ πάντων, ἐν ᾧ ὑψώθη Χριστός, σάρκα περικείμενος θνητήν, ὅπως θανατώσειε, τὸν ἡμᾶς θανατώσαντα.
ltx/gr_gr_cog/tr.d048:trMA.Ode5C23.incipit	Σταυρὲ πανσεβάσμιε, τῶν Ἀποστόλων καύχημα…
ltx/gr_gr_cog/tr.d048:trMA.Ode5C23.melody	@ltx/gr_gr_cog/he.h.m4:heHE.ExestiTaSympanta.name
ltx/gr_gr_cog/tr.d048:trMA.Ode5C23.mode	@ltx/gr_gr_cog/miscellanea:misc.Mode4
ltx/gr_gr_cog/tr.d048:trMA.Ode5C23.ode	@ltx/gr_gr_cog/miscellanea:misc.Ode5
ltx/gr_gr_cog/tr.d048:trMA.Ode5C23.text	Σταυρὲ πανσεβάσμιε, τῶν Ἀποστόλων καύχημα, ὅπλον Ἀθλοφόρων, Ἱερέων, δόξα Ὁσίων, περιχαράκωμα, πάντων τῶν πιστῶν ὁ φυλακτήρ, φρούρησον ἁγίασον, τοὺς πιστῶς προσκυνοῦντάς σε.
ltx/gr_gr_cog/tr.d048:trMA.Ode5C2T.incipit	Τὸν βότρυν ἡ ἄμπελος, Παρθένος…
ltx/gr_gr_cog/tr.d048:trMA.Ode5C2T.melody	@ltx/gr_gr_cog/he.h.m4:heHE.ExestiTaSympanta.name
ltx/gr_gr_cog/tr.d048:trMA.Ode5C2T.mode	@ltx/gr_gr_cog/miscellanea:misc.Mode4
ltx/gr_gr_cog/tr.d048:trMA.Ode5C2T.ode	@ltx/gr_gr_cog/miscellanea:misc.Ode5
ltx/gr_gr_cog/tr.d048:trMA.Ode5C2T.text	Τὸν βότρυν ἡ ἄμπελος, Παρθένος ὃν ἐβλάστησε, ξύλῳ κρεμασθέντα κατιδοῦσα, Τέκνον, ἐβόα, γλεῦκος ἀπόσταξον, μέθην ἀναστέλλων τῶν ἐχθρῶν, μάτην σταυρωσάντων σε, τὸν ἐν πᾶσι μακρόθυμον.
ltx/gr_gr_cog/tr.d048:trMA.Ode5C31.greekmelody	@ltx/gr_gr_cog/he.h.m4:heHE.EkNyktosOrthrizonta.greekname
ltx/gr_gr_cog/tr.d048:trMA.Ode5C31.incipit	Σήμερον προτίθεται ὁ Σταυρός σου…
ltx/gr_gr_cog/tr.d048:trMA.Ode5C31.melody	@ltx/gr_gr_cog/he.h.m4:heHE.EkNyktosOrthrizonta.name
ltx/gr_gr_cog/tr.d048:trMA.Ode5C31.mode	@ltx/gr_gr_cog/miscellanea:misc.Mode4
ltx/gr_gr_cog/tr.d048:trMA.Ode5C31.ode	@ltx/gr_gr_cog/miscellanea:misc.Ode5
ltx/gr_gr_cog/tr.d048:trMA.Ode5C31.text	Σήμερον προτίθεται ὁ Σταυρός σου, ξύλον ζωῆς προσκυνητόν, καὶ κόσμος ἀγάλλεται, φοιτήσει τῇ τοῦ Πνεύματος, αὐτὸν κατασπαζόμενος.
ltx/gr_gr_cog/tr.d048:trMA.Ode5C32.incipit	Προκείμενον βλέποντες τὸν Σταυρόν σου…
ltx/gr_gr_cog/tr.d048:trMA.Ode5C32.melody	@ltx/gr_gr_cog/he.h.m4:heHE.EkNyktosOrthrizonta.name
ltx/gr_gr_cog/tr.d048:trMA.Ode5C32.mode	@ltx/gr_gr_cog/miscellanea:misc.Mode4
ltx/gr_gr_cog/tr.d048:trMA.Ode5C32.ode	@ltx/gr_gr_cog/miscellanea:misc.Ode5
ltx/gr_gr_cog/tr.d048:trMA.Ode5C32.text	Προκείμενον βλέποντες τὸν Σταυρόν σου, οἱ Λειτουργοὶ τῶν οὐρανῶν, ὑμνοῦσί σε Κύριε, καὶ δαίμονες φρίττουσι, μὴ φέροντες τὸ κράτος σου.
ltx/gr_gr_cog/tr.d048:trMA.Ode5C3A1.incipit	Ἐν πεύκῃ καὶ κέδρῳ καὶ…
ltx/gr_gr_cog/tr.d048:trMA.Ode5C3A1.melody	@ltx/gr_gr_cog/he.h.m4:heHE.EkNyktosOrthrizonta.name
ltx/gr_gr_cog/tr.d048:trMA.Ode5C3A1.mode	@ltx/gr_gr_cog/miscellanea:misc.Mode4
ltx/gr_gr_cog/tr.d048:trMA.Ode5C3A1.ode	@ltx/gr_gr_cog/miscellanea:misc.Ode5
ltx/gr_gr_cog/tr.d048:trMA.Ode5C3A1.text	Ἐν πεύκῃ καὶ κέδρῳ καὶ κυπαρίσσῳ, ὁ σταυρωθεὶς Υἱὲ Θεοῦ, ἁγίασον πάντας ἡμᾶς, καὶ τὸ ζωηφόρον σου, καταξίωσον Πάθος ἰδεῖν.
ltx/gr_gr_cog/tr.d048:trMA.Ode5C3H.greekmelody	@ltx/gr_gr_cog/he.h.m4:heHE.EkNyktosOrthrizonta.greekname
ltx/gr_gr_cog/tr.d048:trMA.Ode5C3H.incipit	@ltx/gr_gr_cog/he.h.m4:heHE.EkNyktosOrthrizonta.incipit
ltx/gr_gr_cog/tr.d048:trMA.Ode5C3H.melody	@ltx/gr_gr_cog/he.h.m4:heHE.EkNyktosOrthrizonta.melody
ltx/gr_gr_cog/tr.d048:trMA.Ode5C3H.mode	@ltx/gr_gr_cog/miscellanea:misc.Mode4
ltx/gr_gr_cog/tr.d048:trMA.Ode5C3H.ode	@ltx/gr_gr_cog/miscellanea:misc.Ode5
ltx/gr_gr_cog/tr.d048:trMA.Ode5C3H.text	@ltx/gr_gr_cog/he.h.m4:heHE.EkNyktosOrthrizonta.text
ltx/gr_gr_cog/tr.d048:trMA.Ode5C3T.incipit	Μητέρα καὶ Παρθένον σὲ ὀρθοδόξως…
ltx/gr_gr_cog/tr.d048:trMA.Ode5C3T.melody	@ltx/gr_gr_cog/he.h.m4:heHE.EkNyktosOrthrizonta.name
ltx/gr_gr_cog/tr.d048:trMA.Ode5C3T.mode	@ltx/gr_gr_cog/miscellanea:misc.Mode4
ltx/gr_gr_cog/tr.d048:trMA.Ode5C3T.ode	@ltx/gr_gr_cog/miscellanea:misc.Ode5
ltx/gr_gr_cog/tr.d048:trMA.Ode5C3T.text	Μητέρα καὶ Παρθένον σὲ ὀρθοδόξως, ὁμολογοῦμεν οἱ πιστοί, ἀῤῥήτως κυήσασαν, Χριστὸν τὸν Θεὸν ἡμῶν, τὸν μόνον πολυέλεον.
ltx/gr_gr_cog/tr.d048:trMA.Ode5C3Tr.incipit	Τριάδα δοξάσωμεν ὀρθοδόξως, σὺν τῷ…
ltx/gr_gr_cog/tr.d048:trMA.Ode5C3Tr.melody	@ltx/gr_gr_cog/he.h.m4:heHE.EkNyktosOrthrizonta.name
ltx/gr_gr_cog/tr.d048:trMA.Ode5C3Tr.mode	@ltx/gr_gr_cog/miscellanea:misc.Mode4
ltx/gr_gr_cog/tr.d048:trMA.Ode5C3Tr.ode	@ltx/gr_gr_cog/miscellanea:misc.Ode5
ltx/gr_gr_cog/tr.d048:trMA.Ode5C3Tr.text	Τριάδα δοξάσωμεν ὀρθοδόξως, σὺν τῷ Πατρὶ καὶ τῷ Υἱῷ, καὶ Πνεῦμα τὸ ἅγιον τὴν μίαν Θεότητα, Μονάδα τρισυπόστατον
ltx/gr_gr_cog/tr.d048:trMA.Ode6C11.greekmelody	@ltx/gr_gr_cog/he.h.m8:heHE.IlasthitiMoiSotir.greekname
ltx/gr_gr_cog/tr.d048:trMA.Ode6C11.incipit	Σταυροῦ παγέντος ἐν γῇ, δαιμόνων…
ltx/gr_gr_cog/tr.d048:trMA.Ode6C11.melody	@ltx/gr_gr_cog/he.h.m8:heHE.IlasthitiMoiSotir.name
ltx/gr_gr_cog/tr.d048:trMA.Ode6C11.mode	@ltx/gr_gr_cog/miscellanea:misc.Mode4
ltx/gr_gr_cog/tr.d048:trMA.Ode6C11.ode	@ltx/gr_gr_cog/miscellanea:misc.Ode6
ltx/gr_gr_cog/tr.d048:trMA.Ode6C11.text	Σταυροῦ παγέντος ἐν γῇ, δαιμόνων πτῶσις ἐγένετο, ὃν νῦν ὁρῶντες ἡμεῖς, ἐνδόξως προκείμενον, καὶ κατασπαζόμενοι, ἀπὸ συμπτωμάτων, ἁμαρτίας ἀνιστάμεθα.
ltx/gr_gr_cog/tr.d048:trMA.Ode6C12.incipit	Ὑψοῦντές σε τὸν Χριστόν, ὡς…
ltx/gr_gr_cog/tr.d048:trMA.Ode6C12.melody	@ltx/gr_gr_cog/he.h.m8:heHE.IlasthitiMoiSotir.name
ltx/gr_gr_cog/tr.d048:trMA.Ode6C12.mode	@ltx/gr_gr_cog/miscellanea:misc.Mode4
ltx/gr_gr_cog/tr.d048:trMA.Ode6C12.ode	@ltx/gr_gr_cog/miscellanea:misc.Ode6
ltx/gr_gr_cog/tr.d048:trMA.Ode6C12.text	Ὑψοῦντές σε τὸν Χριστόν, ὡς Βασιλέα καὶ Κύριον, ὃν ἐδωρήσω ἡμῖν, Σταυρὸν τεῖχος ἄῤῥηκτον, ὅν περιπτυσσόμεθα, μεσασμῷ τῆς θείας, ἐγκρατείας ἀγαλλόμενοι.
ltx/gr_gr_cog/tr.d048:trMA.Ode6C13.incipit	Μεγάλα πᾶσιν ἡμῖν, δωρήματα παρεχόμενος…
ltx/gr_gr_cog/tr.d048:trMA.Ode6C13.melody	@ltx/gr_gr_cog/he.h.m8:heHE.IlasthitiMoiSotir.name
ltx/gr_gr_cog/tr.d048:trMA.Ode6C13.mode	@ltx/gr_gr_cog/miscellanea:misc.Mode4
ltx/gr_gr_cog/tr.d048:trMA.Ode6C13.ode	@ltx/gr_gr_cog/miscellanea:misc.Ode6
ltx/gr_gr_cog/tr.d048:trMA.Ode6C13.text	Μεγάλα πᾶσιν ἡμῖν, δωρήματα παρεχόμενος, ὁ τοῦ Κυρίου Σταυρός, ὁρᾶται προκείμενος, προσέλθωμεν ἄνθρωποι, φωτισμὸν καρδίας, καὶ ψυχῆς ἀπαρυσώμεθα.
ltx/gr_gr_cog/tr.d048:trMA.Ode6C1H.greekmelody	@ltx/gr_gr_cog/he.h.m8:heHE.IlasthitiMoiSotir.greekname
ltx/gr_gr_cog/tr.d048:trMA.Ode6C1H.incipit	@ltx/gr_gr_cog/he.h.m8:heHE.IlasthitiMoiSotir.incipit
ltx/gr_gr_cog/tr.d048:trMA.Ode6C1H.melody	@ltx/gr_gr_cog/he.h.m8:heHE.IlasthitiMoiSotir.melody
ltx/gr_gr_cog/tr.d048:trMA.Ode6C1H.mode	@ltx/gr_gr_cog/miscellanea:misc.Mode8
ltx/gr_gr_cog/tr.d048:trMA.Ode6C1H.ode	@ltx/gr_gr_cog/miscellanea:misc.Ode6
ltx/gr_gr_cog/tr.d048:trMA.Ode6C1H.text	@ltx/gr_gr_cog/he.h.m8:heHE.IlasthitiMoiSotir.text
ltx/gr_gr_cog/tr.d048:trMA.Ode6C1T.incipit	Νηστεύειν ἡμᾶς Ἁγνή, κακίας πάσης…
ltx/gr_gr_cog/tr.d048:trMA.Ode6C1T.melody	@ltx/gr_gr_cog/he.h.m8:heHE.IlasthitiMoiSotir.name
ltx/gr_gr_cog/tr.d048:trMA.Ode6C1T.mode	@ltx/gr_gr_cog/miscellanea:misc.Mode4
ltx/gr_gr_cog/tr.d048:trMA.Ode6C1T.ode	@ltx/gr_gr_cog/miscellanea:misc.Ode6
ltx/gr_gr_cog/tr.d048:trMA.Ode6C1T.text	Νηστεύειν ἡμᾶς Ἁγνή, κακίας πάσης ἐνίσχυσον, καὶ φαύλων καὶ πονηρῶν, ἀπέχεσθαι πράξεων, ἀεὶ ἐνδυνάμωσον, προστασία πάντων, τῶν ἀνθρώπων χρηματίζουσα.
ltx/gr_gr_cog/tr.d048:trMA.Ode7C11.greekmelody	@ltx/gr_gr_cog/he.h.m8:heHE.TheouSynkatavasin.greekname
ltx/gr_gr_cog/tr.d048:trMA.Ode7C11.incipit	Ὁ χρόνων ἐπέκεινα, ἐν χρόνῳ…
ltx/gr_gr_cog/tr.d048:trMA.Ode7C11.melody	@ltx/gr_gr_cog/he.h.m8:heHE.TheouSynkatavasin.name
ltx/gr_gr_cog/tr.d048:trMA.Ode7C11.mode	@ltx/gr_gr_cog/miscellanea:misc.Mode8
ltx/gr_gr_cog/tr.d048:trMA.Ode7C11.ode	@ltx/gr_gr_cog/miscellanea:misc.Ode7
ltx/gr_gr_cog/tr.d048:trMA.Ode7C11.text	Ὁ χρόνων ἐπέκεινα, ἐν χρόνῳ σάρκα φορέσας δείκνυται, καὶ τὰ χρόνια πάθη, ἡμῶν ἰᾶται διʹ ἀγαθότητα, τῆς ἐγκρατείας καιρῷ, ἐν ᾧ πρόκειται, ὁ θεῖος οὗτος Σταυρός, καθαγιάζων ἡμᾶς.
ltx/gr_gr_cog/tr.d048:trMA.Ode7C12.incipit	Ὑμνοῦμεν δοξάζομεν, καὶ προσκυνοῦμεν καὶ…
ltx/gr_gr_cog/tr.d048:trMA.Ode7C12.melody	@ltx/gr_gr_cog/he.h.m8:heHE.TheouSynkatavasin.name
ltx/gr_gr_cog/tr.d048:trMA.Ode7C12.mode	@ltx/gr_gr_cog/miscellanea:misc.Mode8
ltx/gr_gr_cog/tr.d048:trMA.Ode7C12.ode	@ltx/gr_gr_cog/miscellanea:misc.Ode7
ltx/gr_gr_cog/tr.d048:trMA.Ode7C12.text	Ὑμνοῦμεν δοξάζομεν, καὶ προσκυνοῦμεν καὶ μεγαλύνομεν, τὸ σὸν Κύριε κράτος, ὅτι παρέσχου ἡμῖν τοῖς δούλοις σου, Σταυρὸν τὸν θεῖον, τρυφὴν ἀδαπάνητον καὶ φύλακα τῶν ψυχῶν, καὶ τῶν σωμάτων ἡμῶν.
ltx/gr_gr_cog/tr.d048:trMA.Ode7C13.incipit	Μὴ δείξῃς με Κύριε, ἐν…
ltx/gr_gr_cog/tr.d048:trMA.Ode7C13.melody	@ltx/gr_gr_cog/he.h.m8:heHE.TheouSynkatavasin.name
ltx/gr_gr_cog/tr.d048:trMA.Ode7C13.mode	@ltx/gr_gr_cog/miscellanea:misc.Mode8
ltx/gr_gr_cog/tr.d048:trMA.Ode7C13.ode	@ltx/gr_gr_cog/miscellanea:misc.Ode7
ltx/gr_gr_cog/tr.d048:trMA.Ode7C13.text	Μὴ δείξῃς με Κύριε, ἐν τῇ ἡμέρᾳ τῆς διαγνώσεως, κακοῖς κατεγνωσμένον, μὴ ἀποῤῥίψῃς ἐκ τοῦ προσώπου σου, κατῃσχυμένον, ἀλλʹ οἴκτειρον σῶσόν με, τῷ σῷ τιμίῳ Σταυρῷ, ὡς ὑπεράγαθος.
ltx/gr_gr_cog/tr.d048:trMA.Ode7C14.incipit	Ἐτύπου τὴν χάριν σου, Σταυρὲ…
ltx/gr_gr_cog/tr.d048:trMA.Ode7C14.melody	@ltx/gr_gr_cog/he.h.m8:heHE.TheouSynkatavasin.name
ltx/gr_gr_cog/tr.d048:trMA.Ode7C14.mode	@ltx/gr_gr_cog/miscellanea:misc.Mode8
ltx/gr_gr_cog/tr.d048:trMA.Ode7C14.ode	@ltx/gr_gr_cog/miscellanea:misc.Ode7
ltx/gr_gr_cog/tr.d048:trMA.Ode7C14.text	Ἐτύπου τὴν χάριν σου, Σταυρὲ γλυκαίνων Μωσῆς τὰ ὕδατα, τὰ πικρότατα ξύλῳ· καὶ γὰρ πικρίας παθῶν ἐῤῥύσθημεν, τῇ σῇ δυνάμει· διὸ ἡμᾶς γλύκανον, ἀσπαζομένους σε νῦν, ἐν κατανύξει ψυχῆς.
ltx/gr_gr_cog/tr.d048:trMA.Ode7C1H.greekmelody	@ltx/gr_gr_cog/he.h.m8:heHE.TheouSynkatavasin.greekname
ltx/gr_gr_cog/tr.d048:trMA.Ode7C1H.incipit	@ltx/gr_gr_cog/he.h.m8:heHE.TheouSynkatavasin.incipit
ltx/gr_gr_cog/tr.d048:trMA.Ode7C1H.melody	@ltx/gr_gr_cog/he.h.m8:heHE.TheouSynkatavasin.melody
ltx/gr_gr_cog/tr.d048:trMA.Ode7C1H.mode	@ltx/gr_gr_cog/miscellanea:misc.Mode8
ltx/gr_gr_cog/tr.d048:trMA.Ode7C1H.ode	@ltx/gr_gr_cog/miscellanea:misc.Ode7
ltx/gr_gr_cog/tr.d048:trMA.Ode7C1H.text	@ltx/gr_gr_cog/he.h.m8:heHE.TheouSynkatavasin.text
ltx/gr_gr_cog/tr.d048:trMA.Ode7C1T.incipit	Νοός μου τὴν στένωσιν, τῇ…
ltx/gr_gr_cog/tr.d048:trMA.Ode7C1T.melody	@ltx/gr_gr_cog/he.h.m8:heHE.TheouSynkatavasin.name
ltx/gr_gr_cog/tr.d048:trMA.Ode7C1T.mode	@ltx/gr_gr_cog/miscellanea:misc.Mode8
ltx/gr_gr_cog/tr.d048:trMA.Ode7C1T.ode	@ltx/gr_gr_cog/miscellanea:misc.Ode7
ltx/gr_gr_cog/tr.d048:trMA.Ode7C1T.text	Νοός μου τὴν στένωσιν, τῇ σῇ πρεσβείᾳ πλάτυνον Δέσποινα, ἡ στενώσασα πάσας, τὰς μεθοδίας τοῦ πολεμήτορος, καὶ διʹ ὁδοῦ με στενῆς κατευόδωσον, πρὸς πλατυσμόν τῆς ζωῆς, βαδίζειν Μήτηρ Θεοῦ.
ltx/gr_gr_cog/tr.d048:trMA.Ode8C11.greekmelody	@ltx/gr_gr_cog/he.h.m8:heHE.EptaplasiosKaminon.greekname
ltx/gr_gr_cog/tr.d048:trMA.Ode8C11.incipit	Ξύλῳ ποτὲ ἀνείλκυσε, ποταμοῦ τὸ…
ltx/gr_gr_cog/tr.d048:trMA.Ode8C11.melody	@ltx/gr_gr_cog/he.h.m8:heHE.EptaplasiosKaminon.name
ltx/gr_gr_cog/tr.d048:trMA.Ode8C11.mode	@ltx/gr_gr_cog/miscellanea:misc.Mode8
ltx/gr_gr_cog/tr.d048:trMA.Ode8C11.ode	@ltx/gr_gr_cog/miscellanea:misc.Ode8
ltx/gr_gr_cog/tr.d048:trMA.Ode8C11.text	Ξύλῳ ποτὲ ἀνείλκυσε, ποταμοῦ τὸ σιδήριον, θεῖος Ἐλισσαῖος, ὁ σὲ προγράψας πόῤῥωθεν, Σταυρὲ πανσεβάσμιε, ἐκ τοῦ βυθοῦ τῆς πλάνης· καὶ γάρ, διὰ σοῦ πρὸς πίστιν ἀναχθέντες βεβαίαν, τὴν σήμερον ἡμέραν, ἀξιούμεθα βλέπειν, καὶ πίστει προσκυνεῖν σε, τρυγῶντες σωτηρίαν.
ltx/gr_gr_cog/tr.d048:trMA.Ode8C12.incipit	Ὑποσημαίνει πόῤῥωθεν, σὲ Σταυρὲ πανσεβάσμιε…
ltx/gr_gr_cog/tr.d048:trMA.Ode8C12.melody	@ltx/gr_gr_cog/he.h.m8:heHE.EptaplasiosKaminon.name
ltx/gr_gr_cog/tr.d048:trMA.Ode8C12.mode	@ltx/gr_gr_cog/miscellanea:misc.Mode8
ltx/gr_gr_cog/tr.d048:trMA.Ode8C12.ode	@ltx/gr_gr_cog/miscellanea:misc.Ode8
ltx/gr_gr_cog/tr.d048:trMA.Ode8C12.text	Ὑποσημαίνει πόῤῥωθεν, σὲ Σταυρὲ πανσεβάσμιε, ἐν ταῖς εὐλογίαις, Ἰακὼβ τρανώτατα, ἡμεῖς δὲ ἐν χάριτι, ἀξιωθέντες βλέπειν σε, πίστει ἀδιστάκτῳ, προσερχόμεθα πάντες, καὶ ψαύοντες πλουσίαν, εὐλογίαν τρυγῶμεν, καὶ φῶς καὶ σωτηρίαν, καὶ τῶν πταισμάτων λύσιν.
ltx/gr_gr_cog/tr.d048:trMA.Ode8C13.incipit	Λευχειμονοῦντες πράξεσιν, ἐναρέτοις προσέλθωμεν, τῷ…
ltx/gr_gr_cog/tr.d048:trMA.Ode8C13.melody	@ltx/gr_gr_cog/he.h.m8:heHE.EptaplasiosKaminon.name
ltx/gr_gr_cog/tr.d048:trMA.Ode8C13.mode	@ltx/gr_gr_cog/miscellanea:misc.Mode8
ltx/gr_gr_cog/tr.d048:trMA.Ode8C13.ode	@ltx/gr_gr_cog/miscellanea:misc.Ode8
ltx/gr_gr_cog/tr.d048:trMA.Ode8C13.text	Λευχειμονοῦντες πράξεσιν, ἐναρέτοις προσέλθωμεν, τῷ τῆς ἐγκρατείας μεσασμῷ γηθόμενοι, καὶ περιπτυξώμεθα, τὸν τοῦ Κυρίου πίστει Σταυρόν, ὅπως τῷ αὐτοῦ κατευοδούμενοι σθένει, τελέσωμεν τὸν δρόμον, ἐν καλῇ προθυμίᾳ, καὶ φθάσωμεν τὸ θεῖον, λελαμπρυσμένοι Πάθος.
ltx/gr_gr_cog/tr.d048:trMA.Ode8C1H.greekmelody	@ltx/gr_gr_cog/he.h.m8:heHE.EptaplasiosKaminon.greekname
ltx/gr_gr_cog/tr.d048:trMA.Ode8C1H.incipit	@ltx/gr_gr_cog/he.h.m8:heHE.EptaplasiosKaminon.incipit
ltx/gr_gr_cog/tr.d048:trMA.Ode8C1H.melody	@ltx/gr_gr_cog/he.h.m8:heHE.EptaplasiosKaminon.melody
ltx/gr_gr_cog/tr.d048:trMA.Ode8C1H.mode	@ltx/gr_gr_cog/miscellanea:misc.Mode8
ltx/gr_gr_cog/tr.d048:trMA.Ode8C1H.ode	@ltx/gr_gr_cog/miscellanea:misc.Ode8
ltx/gr_gr_cog/tr.d048:trMA.Ode8C1H.text	@ltx/gr_gr_cog/he.h.m8:heHE.EptaplasiosKaminon.text
ltx/gr_gr_cog/tr.d048:trMA.Ode8C1T.incipit	Νῦν ὡς ἀρνίον ἄκακον, καθορῶ…
ltx/gr_gr_cog/tr.d048:trMA.Ode8C1T.melody	@ltx/gr_gr_cog/he.h.m8:heHE.EptaplasiosKaminon.name
ltx/gr_gr_cog/tr.d048:trMA.Ode8C1T.mode	@ltx/gr_gr_cog/miscellanea:misc.Mode8
ltx/gr_gr_cog/tr.d048:trMA.Ode8C1T.ode	@ltx/gr_gr_cog/miscellanea:misc.Ode8
ltx/gr_gr_cog/tr.d048:trMA.Ode8C1T.text	Νῦν ὡς ἀρνίον ἄκακον, καθορῶ σε κρεμάμενον, καὶ ὑπὸ ἀνόμων, τῷ Σταυρῷ πηγνύμενον, Υἱέ μου προάναρχε, τοῖς ὀδυρμοῖς συγκόπτομαι, καὶ ταῖς μητρικαῖς περιστατοῦμαι ὀδύναις, ἡ Πάναγνος ἐβόα· ἣν φωναῖς ἀσιγήτοις, ὑμνοῦμεν καταχρέως, εἰς πάντας τοὺς αἰῶνας.
ltx/gr_gr_cog/tr.d048:trMA.Ode8C1Tr.incipit	Ὁμοφυῆ συνάναρχον, συναΐδιον σύνθρονον, φύσιν…
ltx/gr_gr_cog/tr.d048:trMA.Ode8C1Tr.melody	@ltx/gr_gr_cog/he.h.m8:heHE.EptaplasiosKaminon.name
ltx/gr_gr_cog/tr.d048:trMA.Ode8C1Tr.mode	@ltx/gr_gr_cog/miscellanea:misc.Mode8
ltx/gr_gr_cog/tr.d048:trMA.Ode8C1Tr.ode	@ltx/gr_gr_cog/miscellanea:misc.Ode8
ltx/gr_gr_cog/tr.d048:trMA.Ode8C1Tr.text	Ὁμοφυῆ συνάναρχον, συναΐδιον σύνθρονον, φύσιν μὲν ἁπλῆν, διαιρετὴν προσώποις δέ, Πατέρα ἀγέννητον Υἱὸν καὶ Πνεῦμα ἅγιον, ἄκτιστον οὐσίαν, καὶ Θεότητα πάντες, ὑμνοῦντες μελῳδοῦμεν· Ἱερεῖς εὐλογεῖτε, λαὸς ὑπερυψοῦτε, εἰς πάντας τοὺς αἰῶνας.
ltx/gr_gr_cog/tr.d048:trMA.Ode8C21.greekmelody	@ltx/gr_gr_cog/he.h.m4:heHE.PaidasEvageis.greekname
ltx/gr_gr_cog/tr.d048:trMA.Ode8C21.incipit	Πάθος σου τοῦ ἀπαθοῦς ὁρῶσα…
ltx/gr_gr_cog/tr.d048:trMA.Ode8C21.melody	@ltx/gr_gr_cog/he.h.m4:heHE.PaidasEvageis.name
ltx/gr_gr_cog/tr.d048:trMA.Ode8C21.mode	@ltx/gr_gr_cog/miscellanea:misc.Mode4
ltx/gr_gr_cog/tr.d048:trMA.Ode8C21.ode	@ltx/gr_gr_cog/miscellanea:misc.Ode8
ltx/gr_gr_cog/tr.d048:trMA.Ode8C21.text	Πάθος σου τοῦ ἀπαθοῦς ὁρῶσα, ἡ Κτίσις συνέπασχε Μακρόθυμε, ἥλιος ἐσβέννυτο, πέτραι δὲ ἐῤῥήγνυντο, πᾶσα ἡ γῆ ἐσείετο, φόβῳ κραυγάζουσα· τὸν Κύριον ὑμνεῖτε τὰ ἔργα, καὶ ὑπερυψοῦτε, εἰς πάντας τοὺς αἰῶνας.
ltx/gr_gr_cog/tr.d048:trMA.Ode8C22.incipit	Θηρίοις δεινοῖς τοῖς τοῦ καλάμου…
ltx/gr_gr_cog/tr.d048:trMA.Ode8C22.melody	@ltx/gr_gr_cog/he.h.m4:heHE.PaidasEvageis.name
ltx/gr_gr_cog/tr.d048:trMA.Ode8C22.mode	@ltx/gr_gr_cog/miscellanea:misc.Mode4
ltx/gr_gr_cog/tr.d048:trMA.Ode8C22.ode	@ltx/gr_gr_cog/miscellanea:misc.Ode8
ltx/gr_gr_cog/tr.d048:trMA.Ode8C22.text	Θηρίοις δεινοῖς τοῖς τοῦ καλάμου, Θεέ μου οἰκτίρμον ἐπιτίμησον, ἔνδον με συνθλίβουσι, Σῶτερ ὁ τὴν ἄτιμον, ὑπενεγκὼν τυπτόμενος, ὕβριν καλάμῳ Χριστέ, τιμῆσαι προελόμενος πάντας, τοὺς ἀτιμασθέντας, τῇ πάλαι παραβάσει.
ltx/gr_gr_cog/tr.d048:trMA.Ode8C23.incipit	Εἰς νοῦν τὸ φρικτόν σου…
ltx/gr_gr_cog/tr.d048:trMA.Ode8C23.melody	@ltx/gr_gr_cog/he.h.m4:heHE.PaidasEvageis.name
ltx/gr_gr_cog/tr.d048:trMA.Ode8C23.mode	@ltx/gr_gr_cog/miscellanea:misc.Mode4
ltx/gr_gr_cog/tr.d048:trMA.Ode8C23.ode	@ltx/gr_gr_cog/miscellanea:misc.Ode8
ltx/gr_gr_cog/tr.d048:trMA.Ode8C23.text	Εἰς νοῦν τὸ φρικτόν σου ὅταν λάβω, Κριτὰ δικαιότατε κριτήριον, τρέμω καὶ ἐξίσταμαι, φρίττω καὶ ὀδύρομαι, κατανοῶν τὰ ἔργα μου, δίκης ἐπάξια· διό σου τὴν πολλὴν εὐσπλαγχνίαν, Σῶτερ μὴ νικήσῃ, τὸ πλῆθος τῶν κακῶν μου.
ltx/gr_gr_cog/tr.d048:trMA.Ode8C2T.incipit	Τεκοῦσά σε ἄνευθεν ὠδίνων, ὀδύνας…
ltx/gr_gr_cog/tr.d048:trMA.Ode8C2T.melody	@ltx/gr_gr_cog/he.h.m4:heHE.PaidasEvageis.name
ltx/gr_gr_cog/tr.d048:trMA.Ode8C2T.mode	@ltx/gr_gr_cog/miscellanea:misc.Mode4
ltx/gr_gr_cog/tr.d048:trMA.Ode8C2T.ode	@ltx/gr_gr_cog/miscellanea:misc.Ode8
ltx/gr_gr_cog/tr.d048:trMA.Ode8C2T.text	Τεκοῦσά σε ἄνευθεν ὠδίνων, ὀδύνας τῇ σῇ σταυρώσει καθυφίσταμαι, φλέγονται τὰ σπλάγχνα μου· ἥλοις γὰρ προσήλωσαι, τὴν σὴν πλευρὰν Μακρόθυμε, ἐξορυττόμενος, ἡ πάναγνος ἐβόα Παρθένος, ἣν ὡς Θεοτόκον, συμφώνως ἀνυμνοῦμεν.
ltx/gr_gr_cog/tr.d048:trMA.Ode8C31.greekmelody	@ltx/gr_gr_cog/he.h.m4:heHE.PantaTaErgaTouTheou.greekname
ltx/gr_gr_cog/tr.d048:trMA.Ode8C31.incipit	Ῥηξάτωσαν τὰ ὄρη νοητῶς, δικαιοσύνην…
ltx/gr_gr_cog/tr.d048:trMA.Ode8C31.melody	@ltx/gr_gr_cog/he.h.m4:heHE.PantaTaErgaTouTheou.name
ltx/gr_gr_cog/tr.d048:trMA.Ode8C31.mode	@ltx/gr_gr_cog/miscellanea:misc.Mode4
ltx/gr_gr_cog/tr.d048:trMA.Ode8C31.ode	@ltx/gr_gr_cog/miscellanea:misc.Ode8
ltx/gr_gr_cog/tr.d048:trMA.Ode8C31.text	Ῥηξάτωσαν τὰ ὄρη νοητῶς, δικαιοσύνην καὶ βουνοὶ ἀγαλλίασιν, τὸ ξύλον τοῦ Σταυροῦ προσκυνούμενον βλέποντες, ὃν ὑπερυψοῦμεν, Χριστὲ εἰς τοὺς αἰῶνας.
ltx/gr_gr_cog/tr.d048:trMA.Ode8C32.incipit	Ἡ χάρις τοῦ Σταυροῦ σου…
ltx/gr_gr_cog/tr.d048:trMA.Ode8C32.melody	@ltx/gr_gr_cog/he.h.m4:heHE.PantaTaErgaTouTheou.name
ltx/gr_gr_cog/tr.d048:trMA.Ode8C32.mode	@ltx/gr_gr_cog/miscellanea:misc.Mode4
ltx/gr_gr_cog/tr.d048:trMA.Ode8C32.ode	@ltx/gr_gr_cog/miscellanea:misc.Ode8
ltx/gr_gr_cog/tr.d048:trMA.Ode8C32.text	Ἡ χάρις τοῦ Σταυροῦ σου φοβερά· καὶ γὰρ δαιμόνων ἐλαύνει τὰς φάλαγγας, ἀνθρώποις τῶν ἰαμάτων παρέχουσα νάματα· διό σε ἀνυμνοῦμεν, Χριστὲ εἰς τοὺς αἰῶνας.
ltx/gr_gr_cog/tr.d048:trMA.Ode8C3A1.incipit	Ἀγάλλεται τὰ πέρατα τῆς γῆς…
ltx/gr_gr_cog/tr.d048:trMA.Ode8C3A1.melody	@ltx/gr_gr_cog/he.h.m4:heHE.PantaTaErgaTouTheou.name
ltx/gr_gr_cog/tr.d048:trMA.Ode8C3A1.mode	@ltx/gr_gr_cog/miscellanea:misc.Mode4
ltx/gr_gr_cog/tr.d048:trMA.Ode8C3A1.ode	@ltx/gr_gr_cog/miscellanea:misc.Ode8
ltx/gr_gr_cog/tr.d048:trMA.Ode8C3A1.text	Ἀγάλλεται τὰ πέρατα τῆς γῆς, τῇ προσκυνήσει τοῦ Σταυροῦ σου φιλάνθρωπε. Ἄγγελοι ἐν οὐρανοῖς συγχορεύουσι σήμερον, σὺν ἡμῖν ὑμνοῦντες, σὲ Χριστὲ εἰς τοὺς αἰῶνας.
ltx/gr_gr_cog/tr.d048:trMA.Ode8C3H.greekmelody	@ltx/gr_gr_cog/he.h.m4:heHE.PantaTaErgaTouTheou.greekname
ltx/gr_gr_cog/tr.d048:trMA.Ode8C3H.incipit	@ltx/gr_gr_cog/he.h.m4:heHE.PantaTaErgaTouTheou.incipit
ltx/gr_gr_cog/tr.d048:trMA.Ode8C3H.melody	@ltx/gr_gr_cog/he.h.m4:heHE.PantaTaErgaTouTheou.melody
ltx/gr_gr_cog/tr.d048:trMA.Ode8C3H.mode	@ltx/gr_gr_cog/miscellanea:misc.Mode4
ltx/gr_gr_cog/tr.d048:trMA.Ode8C3H.ode	@ltx/gr_gr_cog/miscellanea:misc.Ode8
ltx/gr_gr_cog/tr.d048:trMA.Ode8C3H.text	@ltx/gr_gr_cog/he.h.m4:heHE.PantaTaErgaTouTheou.text
ltx/gr_gr_cog/tr.d048:trMA.Ode8C3T.incipit	Πᾶσα γλῶσσα γηγενῶν, ὑμνεῖ σὲ…
ltx/gr_gr_cog/tr.d048:trMA.Ode8C3T.melody	@ltx/gr_gr_cog/he.h.m4:heHE.PantaTaErgaTouTheou.name
ltx/gr_gr_cog/tr.d048:trMA.Ode8C3T.mode	@ltx/gr_gr_cog/miscellanea:misc.Mode4
ltx/gr_gr_cog/tr.d048:trMA.Ode8C3T.ode	@ltx/gr_gr_cog/miscellanea:misc.Ode8
ltx/gr_gr_cog/tr.d048:trMA.Ode8C3T.text	Πᾶσα γλῶσσα γηγενῶν, ὑμνεῖ σὲ Παρθένε, ὅτι φῶς τὸ ἀπρόσιτον, ηὔγασας φωταγωγοῦντα τὸν Κόσμον, Χριστὸν τὸν Θεόν, ὃν ὑπερυψοῦμεν, ἀεὶ εἰς τοὺς αἰῶνας.
ltx/gr_gr_cog/tr.d048:trMA.Ode8C3Tr.incipit	Τὸν ἄναρχον Πατέρα καὶ Υἱόν…
ltx/gr_gr_cog/tr.d048:trMA.Ode8C3Tr.melody	@ltx/gr_gr_cog/he.h.m4:heHE.PantaTaErgaTouTheou.name
ltx/gr_gr_cog/tr.d048:trMA.Ode8C3Tr.mode	@ltx/gr_gr_cog/miscellanea:misc.Mode4
ltx/gr_gr_cog/tr.d048:trMA.Ode8C3Tr.ode	@ltx/gr_gr_cog/miscellanea:misc.Ode8
ltx/gr_gr_cog/tr.d048:trMA.Ode8C3Tr.text	Τὸν ἄναρχον Πατέρα καὶ Υἱόν, σὺν τῷ ἁγίῳ ἀνυμνήσωμεν Πνεύματι, Τριάδα ὁμοούσιον, μίαν Ἀρχὴν καὶ Θεόν, αἰνοῦντες ὑμνοῦμεν, αὐτὴν εἰς τοὺς αἰῶνας.
ltx/gr_gr_cog/tr.d048:trMA.Ode9C11.greekmelody	@ltx/gr_gr_cog/he.h.m8:heHE.ExestiEpiTouto.greekname
ltx/gr_gr_cog/tr.d048:trMA.Ode9C11.incipit	Ἰάσω ὑπεράγαθε τὴν ἐμήν, συντριβὴν…
ltx/gr_gr_cog/tr.d048:trMA.Ode9C11.melody	@ltx/gr_gr_cog/he.h.m8:heHE.ExestiEpiTouto.name
ltx/gr_gr_cog/tr.d048:trMA.Ode9C11.mode	@ltx/gr_gr_cog/miscellanea:misc.Mode8
ltx/gr_gr_cog/tr.d048:trMA.Ode9C11.ode	@ltx/gr_gr_cog/miscellanea:misc.Ode9
ltx/gr_gr_cog/tr.d048:trMA.Ode9C11.text	Ἰάσω ὑπεράγαθε τὴν ἐμήν, συντριβὴν ἐν Σταυρῷ προσπηγνύμενος, ἥλοις ποτέ, χεῖράς σου καὶ πόδας Παμβασιλεῦ, καὶ τὴν πλευρὰν νυττόμενος, ὄξος ποτιζόμενος καὶ χολήν, ἡ πάντων εὐφροσύνη, ὁ γλυκασμὸς ἡ δόξα, ἡ αἰωνία ἀπολύτρωσις.
ltx/gr_gr_cog/tr.d048:trMA.Ode9C12.incipit	Ὡραῖος ὑπὲρ σάπφειρον καὶ χρυσόν…
ltx/gr_gr_cog/tr.d048:trMA.Ode9C12.melody	@ltx/gr_gr_cog/he.h.m8:heHE.ExestiEpiTouto.name
ltx/gr_gr_cog/tr.d048:trMA.Ode9C12.mode	@ltx/gr_gr_cog/miscellanea:misc.Mode8
ltx/gr_gr_cog/tr.d048:trMA.Ode9C12.ode	@ltx/gr_gr_cog/miscellanea:misc.Ode9
ltx/gr_gr_cog/tr.d048:trMA.Ode9C12.text	Ὡραῖος ὑπὲρ σάπφειρον καὶ χρυσόν, φωταυγὴς ὥσπερ ἥλιος πέφυκας, θεῖε Σταυρέ, κείμενος μὲν τόπῳ περιγραπτός, καὶ νοεραῖς Δυνάμεσι, πάντοτε κυκλούμενος φοβερῶς, ἀκτῖσι δέ σου θείας, δυνάμεως φωτίζων, τῆς Οἰκουμένης τὰ πληρώματα.
ltx/gr_gr_cog/tr.d048:trMA.Ode9C13.incipit	Σταυρὸς χειμαζομένων ἐστὶ λιμήν, ὁδηγὸς…
ltx/gr_gr_cog/tr.d048:trMA.Ode9C13.melody	@ltx/gr_gr_cog/he.h.m8:heHE.ExestiEpiTouto.name
ltx/gr_gr_cog/tr.d048:trMA.Ode9C13.mode	@ltx/gr_gr_cog/miscellanea:misc.Mode8
ltx/gr_gr_cog/tr.d048:trMA.Ode9C13.ode	@ltx/gr_gr_cog/miscellanea:misc.Ode9
ltx/gr_gr_cog/tr.d048:trMA.Ode9C13.text	Σταυρὸς χειμαζομένων ἐστὶ λιμήν, ὁδηγὸς πλανωμένων καὶ στήριγμα, δόξα Χριστοῦ, σθένος Ἀποστόλων καὶ Προφητῶν, τῶν Ἀθλητῶν κραταίωμα, πάντων τῶν ἀνθρώπων καταφυγή. Αὐτὸν ἐν μέσῳ πάντες, προκείμενον ὁρῶντες, τῇ ἐγκρατείᾳ ἀσπαζόμεθα.
ltx/gr_gr_cog/tr.d048:trMA.Ode9C14.incipit	Ἡνίκα μέλλῃς ἔρχεσθαι ἐπὶ γῆς…
ltx/gr_gr_cog/tr.d048:trMA.Ode9C14.melody	@ltx/gr_gr_cog/he.h.m8:heHE.ExestiEpiTouto.name
ltx/gr_gr_cog/tr.d048:trMA.Ode9C14.mode	@ltx/gr_gr_cog/miscellanea:misc.Mode8
ltx/gr_gr_cog/tr.d048:trMA.Ode9C14.ode	@ltx/gr_gr_cog/miscellanea:misc.Ode9
ltx/gr_gr_cog/tr.d048:trMA.Ode9C14.text	Ἡνίκα μέλλῃς ἔρχεσθαι ἐπὶ γῆς, κρῖναι Κόσμον, ὃν ἔπλασας Κύριε, Ἀγγελικῶν, προπορευομένων σου στρατιῶν, καὶ τοῦ Σταυροῦ προλάμποντος, ὑπὲρ τὰς αὐγὰς τὰς ἡλιακάς, τῇ τούτου δυναστείᾳ, οἰκτείρησόν με σῶσον, τὸν ὑπὲρ πάντας βροτοὺς πταίσαντα.
ltx/gr_gr_cog/tr.d048:trMA.Ode9C1H.greekmelody	@ltx/gr_gr_cog/he.h.m8:heHE.ExestiEpiTouto.greekname
ltx/gr_gr_cog/tr.d048:trMA.Ode9C1H.incipit	@ltx/gr_gr_cog/he.h.m8:heHE.ExestiEpiTouto.incipit
ltx/gr_gr_cog/tr.d048:trMA.Ode9C1H.melody	@ltx/gr_gr_cog/he.h.m8:heHE.ExestiEpiTouto.melody
ltx/gr_gr_cog/tr.d048:trMA.Ode9C1H.mode	@ltx/gr_gr_cog/miscellanea:misc.Mode8
ltx/gr_gr_cog/tr.d048:trMA.Ode9C1H.ode	@ltx/gr_gr_cog/miscellanea:misc.Ode9
ltx/gr_gr_cog/tr.d048:trMA.Ode9C1H.text	@ltx/gr_gr_cog/he.h.m8:heHE.ExestiEpiTouto.text
ltx/gr_gr_cog/tr.d048:trMA.Ode9C1T.incipit	Φθορᾶς σε δίχα τέτοκα ἐκ…
ltx/gr_gr_cog/tr.d048:trMA.Ode9C1T.melody	@ltx/gr_gr_cog/he.h.m8:heHE.ExestiEpiTouto.name
ltx/gr_gr_cog/tr.d048:trMA.Ode9C1T.mode	@ltx/gr_gr_cog/miscellanea:misc.Mode8
ltx/gr_gr_cog/tr.d048:trMA.Ode9C1T.ode	@ltx/gr_gr_cog/miscellanea:misc.Ode9
ltx/gr_gr_cog/tr.d048:trMA.Ode9C1T.text	Φθορᾶς σε δίχα τέτοκα ἐκ γαστρός, πρὸ αἰώνων Πατὴρ ὃν ἐγέννησε, καὶ πῶς φθορεῖς, ἄνθρωποι σπαράττουσί σε Υἱέ, καὶ τὴν πλευρὰν ὀρύττουσι, λόγχῃ καὶ τὰς χεῖρας σὺν τοῖς ποσίν, ἡλοῦσιν ἀπανθρώπως; ἡ Πάναγνος ἐβόα, ἣν ἐπαξίως μεγαλύνομεν.
ltx/gr_gr_cog/tr.d048:trMA.Ode9C21.greekmelody	@ltx/gr_gr_cog/he.h.m4:heHE.ApasGigenis.greekname
ltx/gr_gr_cog/tr.d048:trMA.Ode9C21.incipit	Ξύλῳ τοῦ Σταυροῦ, τὴν φλόγα…
ltx/gr_gr_cog/tr.d048:trMA.Ode9C21.melody	@ltx/gr_gr_cog/he.h.m4:heHE.ApasGigenis.name
ltx/gr_gr_cog/tr.d048:trMA.Ode9C21.mode	@ltx/gr_gr_cog/miscellanea:misc.Mode4
ltx/gr_gr_cog/tr.d048:trMA.Ode9C21.ode	@ltx/gr_gr_cog/miscellanea:misc.Ode9
ltx/gr_gr_cog/tr.d048:trMA.Ode9C21.text	Ξύλῳ τοῦ Σταυροῦ, τὴν φλόγα ἐμάρανας, τῆς ἁμαρτίας Χριστέ, χεῖρας πεπαρμένας δέ, χειρὸς ἐῤῥύσω τοῦ πολεμήτορος, τὸν ἀκρατῶς ἐκτείναντα, χεῖρας πρὸς βρῶσιν καρποῦ, οὗπερ μόνου, φεύγειν τὴν μετάληψιν, ἀπεφήνω Χριστὲ πολυέλεε.
ltx/gr_gr_cog/tr.d048:trMA.Ode9C22.incipit	Πάθος σου Χριστέ, τὸ πᾶσιν…
ltx/gr_gr_cog/tr.d048:trMA.Ode9C22.melody	@ltx/gr_gr_cog/he.h.m4:heHE.ApasGigenis.name
ltx/gr_gr_cog/tr.d048:trMA.Ode9C22.mode	@ltx/gr_gr_cog/miscellanea:misc.Mode4
ltx/gr_gr_cog/tr.d048:trMA.Ode9C22.ode	@ltx/gr_gr_cog/miscellanea:misc.Ode9
ltx/gr_gr_cog/tr.d048:trMA.Ode9C22.text	Πάθος σου Χριστέ, τὸ πᾶσιν ἀπάθειαν, βροτοῖς πηγάσαν σεπτῶς, βλέψαι καταξίωσον, ἐν ἀπαθείᾳ τοὺς προσκυνήσαντας, σοῦ τὸν Σταυρὸν τὸν τίμιον, τὰς ἁμαρτίας ἡμῶν, παραβλέπων, καὶ τῆς Ἀναστάσεως, ἀληθείας υἱοὺς ἐργαζόμενος.
ltx/gr_gr_cog/tr.d048:trMA.Ode9C23.incipit	Ὕψωσας ἡμᾶς, πεσόντας εἰς θάνατον…
ltx/gr_gr_cog/tr.d048:trMA.Ode9C23.melody	@ltx/gr_gr_cog/he.h.m4:heHE.ApasGigenis.name
ltx/gr_gr_cog/tr.d048:trMA.Ode9C23.mode	@ltx/gr_gr_cog/miscellanea:misc.Mode4
ltx/gr_gr_cog/tr.d048:trMA.Ode9C23.ode	@ltx/gr_gr_cog/miscellanea:misc.Ode9
ltx/gr_gr_cog/tr.d048:trMA.Ode9C23.text	Ὕψωσας ἡμᾶς, πεσόντας εἰς θάνατον, τῇ Ἀναστάσει σου, ἔλυσας τὸν θάνατον, καὶ τῷ Πατρί σου ἡμᾶς κατήλλαξας, ὑπὲρ ἡμῶν τὸ Αἷμά σου, καταβαλλόμενος, Εὐεργέτα· ὅθεν σε δοξάζομεν, ὡς Θεὸν λυτρωτὴν παντοδύναμον.
ltx/gr_gr_cog/tr.d048:trMA.Ode9C2T.incipit	Μόνη τοῦ Θεοῦ, σοφίαν κυήσασα…
ltx/gr_gr_cog/tr.d048:trMA.Ode9C2T.melody	@ltx/gr_gr_cog/he.h.m4:heHE.ApasGigenis.name
ltx/gr_gr_cog/tr.d048:trMA.Ode9C2T.mode	@ltx/gr_gr_cog/miscellanea:misc.Mode4
ltx/gr_gr_cog/tr.d048:trMA.Ode9C2T.ode	@ltx/gr_gr_cog/miscellanea:misc.Ode9
ltx/gr_gr_cog/tr.d048:trMA.Ode9C2T.text	Μόνη τοῦ Θεοῦ, σοφίαν κυήσασα, τὴν ἐνυπόστατον, σόφισόν με δέομαι, τοῦ τῆς κακίας διαφυγεῖν σοφιστοῦ, ἐπιβουλὰς καὶ ἔνεδρα, καὶ πανουργήματα, Θεοτόκε, Κόρη ἀπειρόγαμε, κραταιὸν τῶν πιστῶν καταφύγιον.
ltx/gr_gr_cog/tr.d048:trMA.Ode9C31.greekmelody	@ltx/gr_gr_cog/he.h.m4:heHE.TonAsporonTokonSou.greekname
ltx/gr_gr_cog/tr.d048:trMA.Ode9C31.incipit	Τὸν Σταυρὸν τὸν τίμιον, ὅν…
ltx/gr_gr_cog/tr.d048:trMA.Ode9C31.melody	@ltx/gr_gr_cog/he.h.m4:heHE.TonAsporonTokonSou.name
ltx/gr_gr_cog/tr.d048:trMA.Ode9C31.mode	@ltx/gr_gr_cog/miscellanea:misc.Mode4
ltx/gr_gr_cog/tr.d048:trMA.Ode9C31.ode	@ltx/gr_gr_cog/miscellanea:misc.Ode9
ltx/gr_gr_cog/tr.d048:trMA.Ode9C31.text	Τὸν Σταυρὸν τὸν τίμιον, ὅν περ περιέπουσιν, Ἀγγέλων στρατεύματα, καὶ ἡμεῖς προσκυνοῦντες μεγαλύνομεν.
ltx/gr_gr_cog/tr.d048:trMA.Ode9C32.incipit	Τὸ Ξύλον τὸ ἄχραντον, διʹ…
ltx/gr_gr_cog/tr.d048:trMA.Ode9C32.melody	@ltx/gr_gr_cog/he.h.m4:heHE.TonAsporonTokonSou.name
ltx/gr_gr_cog/tr.d048:trMA.Ode9C32.mode	@ltx/gr_gr_cog/miscellanea:misc.Mode4
ltx/gr_gr_cog/tr.d048:trMA.Ode9C32.ode	@ltx/gr_gr_cog/miscellanea:misc.Ode9
ltx/gr_gr_cog/tr.d048:trMA.Ode9C32.text	Τὸ Ξύλον τὸ ἄχραντον, διʹ οὗ μετελάβομεν ζωῆς, οἱ πρὶν θανέντες, τὸν Σταυρὸν τοῦ Σωτῆρος μεγαλύνομεν.
ltx/gr_gr_cog/tr.d048:trMA.Ode9C3A1.incipit	Τοὺς ἀξιωθέντας σε ἰδεῖν, καὶ…
ltx/gr_gr_cog/tr.d048:trMA.Ode9C3A1.melody	@ltx/gr_gr_cog/he.h.m4:heHE.TonAsporonTokonSou.name
ltx/gr_gr_cog/tr.d048:trMA.Ode9C3A1.mode	@ltx/gr_gr_cog/miscellanea:misc.Mode4
ltx/gr_gr_cog/tr.d048:trMA.Ode9C3A1.ode	@ltx/gr_gr_cog/miscellanea:misc.Ode9
ltx/gr_gr_cog/tr.d048:trMA.Ode9C3A1.text	Τοὺς ἀξιωθέντας σε ἰδεῖν, καὶ προσπτύξασθαι, εὐόδωσον προφθάσαι, τὸ πανάγιον Πάθος, ὁ Σταυρὸς τοῦ Χριστοῦ.
ltx/gr_gr_cog/tr.d048:trMA.Ode9C3H.greekmelody	@ltx/gr_gr_cog/he.h.m4:heHE.TonAsporonTokonSou.greekname
ltx/gr_gr_cog/tr.d048:trMA.Ode9C3H.incipit	@ltx/gr_gr_cog/he.h.m4:heHE.TonAsporonTokonSou.incipit
ltx/gr_gr_cog/tr.d048:trMA.Ode9C3H.melody	@ltx/gr_gr_cog/he.h.m4:heHE.TonAsporonTokonSou.melody
ltx/gr_gr_cog/tr.d048:trMA.Ode9C3H.mode	@ltx/gr_gr_cog/miscellanea:misc.Mode4
ltx/gr_gr_cog/tr.d048:trMA.Ode9C3H.ode	@ltx/gr_gr_cog/miscellanea:misc.Ode9
ltx/gr_gr_cog/tr.d048:trMA.Ode9C3H.text	@ltx/gr_gr_cog/he.h.m4:heHE.TonAsporonTokonSou.text
ltx/gr_gr_cog/tr.d048:trMA.Ode9C3T.incipit	Μητέρα ἀνύμφευτον, καὶ Παρθένον ἅπαντες…
ltx/gr_gr_cog/tr.d048:trMA.Ode9C3T.melody	@ltx/gr_gr_cog/he.h.m4:heHE.TonAsporonTokonSou.name
ltx/gr_gr_cog/tr.d048:trMA.Ode9C3T.mode	@ltx/gr_gr_cog/miscellanea:misc.Mode4
ltx/gr_gr_cog/tr.d048:trMA.Ode9C3T.ode	@ltx/gr_gr_cog/miscellanea:misc.Ode9
ltx/gr_gr_cog/tr.d048:trMA.Ode9C3T.text	Μητέρα ἀνύμφευτον, καὶ Παρθένον ἅπαντες, Σεμνὴ ἀνυμνοῦμέν σε· ἀσπόρως γὰρ τὸν κτίστην ἀπεκύησας.
ltx/gr_gr_cog/tr.d048:trMA.Ode9C3Tr.incipit	Πατέρα τὸν ἄναρχον, Υἱὸν τὸν…
ltx/gr_gr_cog/tr.d048:trMA.Ode9C3Tr.melody	@ltx/gr_gr_cog/he.h.m4:heHE.TonAsporonTokonSou.name
ltx/gr_gr_cog/tr.d048:trMA.Ode9C3Tr.mode	@ltx/gr_gr_cog/miscellanea:misc.Mode4
ltx/gr_gr_cog/tr.d048:trMA.Ode9C3Tr.ode	@ltx/gr_gr_cog/miscellanea:misc.Ode9
ltx/gr_gr_cog/tr.d048:trMA.Ode9C3Tr.text	Πατέρα τὸν ἄναρχον, Υἱὸν τὸν συνάναρχον, καὶ Πνεῦμα τὸ σύνθρονον, τὴν ἁγίαν Τριάδα μεγαλύνομεν.
ltx/gr_gr_cog/tr.d048:trTE.Troparion.incipit	@ltx/gr_gr_cog/ho.ho07:hoLI.TonStavronSou.incipit
ltx/gr_gr_cog/tr.d048:trTE.Troparion.melody	
ltx/gr_gr_cog/tr.d048:trTE.Troparion.mode	@ltx/gr_gr_cog/miscellanea:misc.Mode6
ltx/gr_gr_cog/tr.d048:trTE.Troparion.text	@ltx/gr_gr_cog/ho.ho07:hoLI.TonStavronSou.text
ltx/gr_gr_cog/tr.d048:trTE.Troparion2.incipit	
ltx/gr_gr_cog/tr.d048:trTE.Troparion2.text	
ltx/gr_gr_cog/tr.d048:trVE.AposIdiomelon1.incipit	Παρὰ Κυρίου, τοῦ ταπεινώσαντος ἑαυτόν…
ltx/gr_gr_cog/tr.d048:trVE.AposIdiomelon1.melody	@ltx/gr_gr_cog/miscellanea:misc.Idiomelon
ltx/gr_gr_cog/tr.d048:trVE.AposIdiomelon1.mode	@ltx/gr_gr_cog/miscellanea:misc.Mode6
ltx/gr_gr_cog/tr.d048:trVE.AposIdiomelon1.text	Παρὰ Κυρίου, τοῦ ταπεινώσαντος ἑαυτόν, μέχρι τοῦ διὰ σταυροῦ θανάτου, διὰ σὲ μαθοῦσα ψυχή μου, τὴν ἐξ ἐπάρσεως ταπείνωσιν, καὶ τὴν ἐκ ταπεινώσεως ὕψωσιν, ἐπʼ ἀρεταῖς μὴ ἐπαίρου, μηδὲ σαυτὴν δικαίαν ὑποπτεύσασα, τὸν πλησίον κατάκρινε, ὡς ὁ μεγάλαυχος Φαρισαῖος, ἀλλʹ ἐν φρονήματι καταβεβλημένῳ, τῶν σῶν ἁμαρτημάτων μνημονεύουσα μόνον, ὡς ὁ Τελώνης βόησον. Ὁ Θεός, ἱλάσθητί μοι τῷ ἁμαρτωλῷ, καὶ σῶσόν με.
ltx/gr_gr_cog/tr.d048:trVE.AposMartyric.incipit	@ltx/gr_gr_cog/oc.m6.d2:ocVE.Aposticha3.incipit
ltx/gr_gr_cog/tr.d048:trVE.AposMartyric.melody	
ltx/gr_gr_cog/tr.d048:trVE.AposMartyric.mode	@ltx/gr_gr_cog/miscellanea:misc.Mode6
ltx/gr_gr_cog/tr.d048:trVE.AposMartyric.text	@ltx/gr_gr_cog/oc.m6.d2:ocVE.Aposticha3.text
ltx/gr_gr_cog/tr.d048:trVE.AposTheotokion.greekmelody	@ltx/gr_gr_cog/he.a.m6:heAU.TriimerosAnestis.greekname
ltx/gr_gr_cog/tr.d048:trVE.AposTheotokion.incipit	Ἡ πάναγνος ὡς εἶδέ σε…
ltx/gr_gr_cog/tr.d048:trVE.AposTheotokion.melody	@ltx/gr_gr_cog/he.a.m6:heAU.TriimerosAnestis.name
ltx/gr_gr_cog/tr.d048:trVE.AposTheotokion.mode	@ltx/gr_gr_cog/miscellanea:misc.Mode6
ltx/gr_gr_cog/tr.d048:trVE.AposTheotokion.text	Ἡ πάναγνος ὡς εἶδέ σε, ἐπὶ Σταυροῦ κρεμάμενον, ἀνεβόα· τί τὸ ξένον ὃ ὁρῶ, μυστήριον Υἱέ μου; πῶς ἐπὶ ξύλου θνήσκεις, σαρκὶ κρεμάμενος ζωῆς χορηγέ;
ltx/gr_gr_cog/tr.d048:trVE.Stichera01.greekmelody	@ltx/gr_gr_cog/he.a.m4:heAU.EdokasSimeiosin.greekname
ltx/gr_gr_cog/tr.d048:trVE.Stichera01.incipit	Τὸν ἀειμακάριστον, ἀξιωθέντες ἀσπάσασθαι, οἱ…
ltx/gr_gr_cog/tr.d048:trVE.Stichera01.melody	@ltx/gr_gr_cog/he.a.m4:heAU.EdokasSimeiosin.name
ltx/gr_gr_cog/tr.d048:trVE.Stichera01.mode	@ltx/gr_gr_cog/miscellanea:misc.Mode4
ltx/gr_gr_cog/tr.d048:trVE.Stichera01.text	Τὸν ἀειμακάριστον, ἀξιωθέντες ἀσπάσασθαι, οἱ πιστοὶ Σταυρὸν Κύριε, διʹ οὗ ἡμᾶς ἔσωσας, ἀνυμνολογοῦμεν, τὴν σὴν εὐσπλαγχνίαν, καὶ δυσωποῦμεν ἐκτενῶς, πᾶσι παράσχου τὴν ἀγαλλίασιν, Σωτὴρ τοῦ σωτηρίου σου, ἐν μετανοίᾳ διδοὺς ἡμῖν, κατιδεῖν σου τὴν Ἔγερσιν, καὶ τὰ Πάθη τὰ τίμια.
ltx/gr_gr_cog/tr.d048:trVE.Stichera02.greekmelody	@ltx/gr_gr_cog/he.a.m4:heAU.EdokasSimeiosin.greekname
ltx/gr_gr_cog/tr.d048:trVE.Stichera02.incipit	Νέκρωσιν ὑπέμεινας, ἐπὶ Σταυροῦ ἐκτεινόμενος…
ltx/gr_gr_cog/tr.d048:trVE.Stichera02.melody	@ltx/gr_gr_cog/he.a.m4:heAU.EdokasSimeiosin.name
ltx/gr_gr_cog/tr.d048:trVE.Stichera02.mode	@ltx/gr_gr_cog/miscellanea:misc.Mode4
ltx/gr_gr_cog/tr.d048:trVE.Stichera02.text	Νέκρωσιν ὑπέμεινας, ἐπὶ Σταυροῦ ἐκτεινόμενος, ὁ νεκρώσας τὸν θάνατον, νεκροὺς ἀναστήσας δέ, ζωηφόρῳ λόγῳ· ὅθεν δυσωπῶ σε. Τὴν νεκρωθεῖσάν μου ψυχήν, τῇ ἁμαρτίᾳ ζώωσον Κύριε, παρέχων μοι κατάνυξιν, καὶ τῶν κακῶν ἀπολύτρωσιν, ἐν ἡμέραις ἁγίαις σου, τῆς Νηστείας φιλάνθρωπε.
ltx/gr_gr_cog/tr.d048:trVE.Stichera03.incipit	Τὸν σὸν Σταυρὸν τὸν ἅγιον…
ltx/gr_gr_cog/tr.d048:trVE.Stichera03.melody	Τὸν νοερὸν ἀδάμαντα.
ltx/gr_gr_cog/tr.d048:trVE.Stichera03.mode	@ltx/gr_gr_cog/miscellanea:misc.Mode4
ltx/gr_gr_cog/tr.d048:trVE.Stichera03.text	Τὸν σὸν Σταυρὸν τὸν ἅγιον, ἀξιωθέντες ἐν χαρᾷ, κατιδεῖν καὶ προσπτύξασθαι, αἰτοῦμέν σε ὁ Θεὸς ὁ Σωτὴρ ἡμῶν, ἵνα καὶ αὐτὰ τὰ ἄχραντα, προφθάσωμεν Πάθη σου, τῇ νηστείᾳ νευρούμενοι, προσκυνοῦντες ὑμνοῦντες τὴν Σταύρωσιν, τὴν λόγχην, τὸν σπόγγον τὸν κάλαμον, διʹ ὧν ἡμᾶς ἀπαθανατίσας, εἰς τὴν ἀρχαίαν πάλιν τρυφῆς ζωὴν ἐπανήγαγες, ὡς φιλάνθρωπος· διό σε εὐχαρίστως νῦν δοξάζομεν.
