ltx/gr_gr_cog/le.ep.mc.d322:lemcLI.Epistle.book_abbr	@ltx/gr_gr_cog/bible:Ephesians.abbr
ltx/gr_gr_cog/le.ep.mc.d322:lemcLI.Epistle.book_string	@ltx/gr_gr_cog/bible:Ephesians.text
ltx/gr_gr_cog/le.ep.mc.d322:lemcLI.Epistle.chapverse	2:11 – 13
ltx/gr_gr_cog/le.ep.mc.d322:lemcLI.Epistle.incipit	Μνημονεύετε ὅτι ὑμεῖς ποτε τὰ ἔθνη ἐν σαρκί…
ltx/gr_gr_cog/le.ep.mc.d322:lemcLI.Epistle.text	Ἀδελφοί, μνημονεύετε ὅτι ὑμεῖς ποτε τὰ ἔθνη ἐν σαρκί, οἱ λεγόμενοι ἀκροβυστία ὑπὸ τῆς λεγομένης περιτομῆς ἐν σαρκὶ χειροποιήτου, ὅτι ἦτε ἐν τῷ καιρῷ ἐκείνῳ χωρὶς Χριστοῦ, ἀπηλλοτριωμένοι τῆς πολιτείας τοῦ Ἰσραὴλ καὶ ξένοι τῶν διαθηκῶν τῆς ἐπαγγελίας, ἐλπίδα μὴ ἔχοντες καὶ ἄθεοι ἐν τῷ κόσμῳ. νυνὶ δὲ ἐν Χριστῷ Ἰησοῦ ὑμεῖς οἱ ποτὲ ὄντες μακρὰν ἐγγὺς ἐγενήθητε ἐν τῷ αἵματι τοῦ Χριστοῦ.
ltx/gr_gr_cog/le.ep.mc.d322:lemcLI.Epistle.title	Τῷ Σαββάτῳ τῆς ΚΘʹ Ἑβδομάδος
ltx/gr_gr_cog/le.ep.mc.d322:lemcLI.Epistle.title_abbr	Σαββάτῳ τῆς ΚΘʹ Ἑβδομάδος
ltx/gr_gr_cog/le.ep.mc.d322:lemcLI.Epistle.version	@ltx/gr_gr_cog/properties:version.designation
