ltx/en_us_unknown/he.h.m3:heHE.AnagageEkFthoras.greekname	
ltx/en_us_unknown/he.h.m3:heHE.AnagageEkFthoras.incipit	…
ltx/en_us_unknown/he.h.m3:heHE.AnagageEkFthoras.melody	@ltx/en_us_unknown/miscellanea:misc.Heirmos
ltx/en_us_unknown/he.h.m3:heHE.AnagageEkFthoras.mode	@ltx/en_us_unknown/miscellanea:misc.Mode3
ltx/en_us_unknown/he.h.m3:heHE.AnagageEkFthoras.name	
ltx/en_us_unknown/he.h.m3:heHE.AnagageEkFthoras.notmetered	N/M ()
ltx/en_us_unknown/he.h.m3:heHE.AnagageEkFthoras.ode	@ltx/en_us_unknown/miscellanea:misc.Ode6
ltx/en_us_unknown/he.h.m3:heHE.AnagageEkFthoras.text	
ltx/en_us_unknown/he.h.m3:heHE.AsmaKainon.greekname	
ltx/en_us_unknown/he.h.m3:heHE.AsmaKainon.incipit	…
ltx/en_us_unknown/he.h.m3:heHE.AsmaKainon.melody	@ltx/en_us_unknown/miscellanea:misc.Heirmos
ltx/en_us_unknown/he.h.m3:heHE.AsmaKainon.mode	@ltx/en_us_unknown/miscellanea:misc.Mode3
ltx/en_us_unknown/he.h.m3:heHE.AsmaKainon.name	
ltx/en_us_unknown/he.h.m3:heHE.AsmaKainon.notmetered	N/M ()
ltx/en_us_unknown/he.h.m3:heHE.AsmaKainon.ode	@ltx/en_us_unknown/miscellanea:misc.Ode1
ltx/en_us_unknown/he.h.m3:heHE.AsmaKainon.text	
ltx/en_us_unknown/he.h.m3:heHE.AsomenToKyrio.greekname	
ltx/en_us_unknown/he.h.m3:heHE.AsomenToKyrio.incipit	…
ltx/en_us_unknown/he.h.m3:heHE.AsomenToKyrio.melody	@ltx/en_us_unknown/miscellanea:misc.Heirmos
ltx/en_us_unknown/he.h.m3:heHE.AsomenToKyrio.mode	@ltx/en_us_unknown/miscellanea:misc.Mode3
ltx/en_us_unknown/he.h.m3:heHE.AsomenToKyrio.name	
ltx/en_us_unknown/he.h.m3:heHE.AsomenToKyrio.notmetered	N/M ()
ltx/en_us_unknown/he.h.m3:heHE.AsomenToKyrio.ode	@ltx/en_us_unknown/miscellanea:misc.Ode1
ltx/en_us_unknown/he.h.m3:heHE.AsomenToKyrio.text	
ltx/en_us_unknown/he.h.m3:heHE.AstektoPyri.greekname	
ltx/en_us_unknown/he.h.m3:heHE.AstektoPyri.incipit	Unharmed were the young men…
ltx/en_us_unknown/he.h.m3:heHE.AstektoPyri.melody	@ltx/en_us_unknown/miscellanea:misc.Heirmos
ltx/en_us_unknown/he.h.m3:heHE.AstektoPyri.mode	@ltx/en_us_unknown/miscellanea:misc.Mode3
ltx/en_us_unknown/he.h.m3:heHE.AstektoPyri.name	Unharmed were the young men.
ltx/en_us_unknown/he.h.m3:heHE.AstektoPyri.notmetered	N/M (Unharmed were the young men.)
ltx/en_us_unknown/he.h.m3:heHE.AstektoPyri.ode	@ltx/en_us_unknown/miscellanea:misc.Ode8
ltx/en_us_unknown/he.h.m3:heHE.AstektoPyri.text	
ltx/en_us_unknown/he.h.m3:heHE.AvyssosEschati.greekname	
ltx/en_us_unknown/he.h.m3:heHE.AvyssosEschati.incipit	…
ltx/en_us_unknown/he.h.m3:heHE.AvyssosEschati.melody	@ltx/en_us_unknown/miscellanea:misc.Heirmos
ltx/en_us_unknown/he.h.m3:heHE.AvyssosEschati.mode	@ltx/en_us_unknown/miscellanea:misc.Mode3
ltx/en_us_unknown/he.h.m3:heHE.AvyssosEschati.name	Sinfulness encircles me.
ltx/en_us_unknown/he.h.m3:heHE.AvyssosEschati.notmetered	N/M ()
ltx/en_us_unknown/he.h.m3:heHE.AvyssosEschati.ode	@ltx/en_us_unknown/miscellanea:misc.Ode6
ltx/en_us_unknown/he.h.m3:heHE.AvyssosEschati.text	
ltx/en_us_unknown/he.h.m3:heHE.ChersonAvyssotokon.greekname	
ltx/en_us_unknown/he.h.m3:heHE.ChersonAvyssotokon.incipit	Sunlight once hovered…
ltx/en_us_unknown/he.h.m3:heHE.ChersonAvyssotokon.melody	@ltx/en_us_unknown/miscellanea:misc.Heirmos
ltx/en_us_unknown/he.h.m3:heHE.ChersonAvyssotokon.mode	@ltx/en_us_unknown/miscellanea:misc.Mode3
ltx/en_us_unknown/he.h.m3:heHE.ChersonAvyssotokon.name	Sunlight once hovered.
ltx/en_us_unknown/he.h.m3:heHE.ChersonAvyssotokon.notmetered	N/M (Sunlight once hovered.)
ltx/en_us_unknown/he.h.m3:heHE.ChersonAvyssotokon.ode	@ltx/en_us_unknown/miscellanea:misc.Ode1
ltx/en_us_unknown/he.h.m3:heHE.ChersonAvyssotokon.text	
ltx/en_us_unknown/he.h.m3:heHE.EisakikoaTinAkoin.greekname	
ltx/en_us_unknown/he.h.m3:heHE.EisakikoaTinAkoin.incipit	…
ltx/en_us_unknown/he.h.m3:heHE.EisakikoaTinAkoin.melody	@ltx/en_us_unknown/miscellanea:misc.Heirmos
ltx/en_us_unknown/he.h.m3:heHE.EisakikoaTinAkoin.mode	@ltx/en_us_unknown/miscellanea:misc.Mode3
ltx/en_us_unknown/he.h.m3:heHE.EisakikoaTinAkoin.name	
ltx/en_us_unknown/he.h.m3:heHE.EisakikoaTinAkoin.notmetered	N/M ()
ltx/en_us_unknown/he.h.m3:heHE.EisakikoaTinAkoin.ode	@ltx/en_us_unknown/miscellanea:misc.Ode4
ltx/en_us_unknown/he.h.m3:heHE.EisakikoaTinAkoin.text	
ltx/en_us_unknown/he.h.m3:heHE.EkalypsenOuranous.greekname	
ltx/en_us_unknown/he.h.m3:heHE.EkalypsenOuranous.incipit	The heavens were covered…
ltx/en_us_unknown/he.h.m3:heHE.EkalypsenOuranous.melody	@ltx/en_us_unknown/miscellanea:misc.Heirmos
ltx/en_us_unknown/he.h.m3:heHE.EkalypsenOuranous.mode	@ltx/en_us_unknown/miscellanea:misc.Mode3
ltx/en_us_unknown/he.h.m3:heHE.EkalypsenOuranous.name	The heavens were covered.
ltx/en_us_unknown/he.h.m3:heHE.EkalypsenOuranous.notmetered	N/M (The heavens were covered.)
ltx/en_us_unknown/he.h.m3:heHE.EkalypsenOuranous.ode	@ltx/en_us_unknown/miscellanea:misc.Ode4
ltx/en_us_unknown/he.h.m3:heHE.EkalypsenOuranous.text	
ltx/en_us_unknown/he.h.m3:heHE.EnNomoSkia.greekname	
ltx/en_us_unknown/he.h.m3:heHE.EnNomoSkia.incipit	In the shadow and the letter…
ltx/en_us_unknown/he.h.m3:heHE.EnNomoSkia.melody	@ltx/en_us_unknown/miscellanea:misc.Heirmos
ltx/en_us_unknown/he.h.m3:heHE.EnNomoSkia.mode	@ltx/en_us_unknown/miscellanea:misc.Mode3
ltx/en_us_unknown/he.h.m3:heHE.EnNomoSkia.name	In the shadow and the letter.
ltx/en_us_unknown/he.h.m3:heHE.EnNomoSkia.notmetered	N/M (In the shadow and the letter.)
ltx/en_us_unknown/he.h.m3:heHE.EnNomoSkia.ode	@ltx/en_us_unknown/miscellanea:misc.Ode9
ltx/en_us_unknown/he.h.m3:heHE.EnNomoSkia.text	
ltx/en_us_unknown/he.h.m3:heHE.EnSinaioToOrei.greekname	Ἐν Σιναίῳ τῷ ὅρει.
ltx/en_us_unknown/he.h.m3:heHE.EnSinaioToOrei.incipit	…
ltx/en_us_unknown/he.h.m3:heHE.EnSinaioToOrei.melody	@ltx/en_us_unknown/miscellanea:misc.Heirmos
ltx/en_us_unknown/he.h.m3:heHE.EnSinaioToOrei.mode	@ltx/en_us_unknown/miscellanea:misc.Mode3
ltx/en_us_unknown/he.h.m3:heHE.EnSinaioToOrei.name	When the bush on Mt. Sinai.
ltx/en_us_unknown/he.h.m3:heHE.EnSinaioToOrei.notmetered	N/M (When the bush on Mt. Sinai.)
ltx/en_us_unknown/he.h.m3:heHE.EnSinaioToOrei.ode	@ltx/en_us_unknown/miscellanea:misc.Ode9
ltx/en_us_unknown/he.h.m3:heHE.EnSinaioToOrei.text	
ltx/en_us_unknown/he.h.m3:heHE.EnylouFlogaPyros.greekname	
ltx/en_us_unknown/he.h.m3:heHE.EnylouFlogaPyros.incipit	…
ltx/en_us_unknown/he.h.m3:heHE.EnylouFlogaPyros.melody	@ltx/en_us_unknown/miscellanea:misc.Heirmos
ltx/en_us_unknown/he.h.m3:heHE.EnylouFlogaPyros.mode	@ltx/en_us_unknown/miscellanea:misc.Mode3
ltx/en_us_unknown/he.h.m3:heHE.EnylouFlogaPyros.name	
ltx/en_us_unknown/he.h.m3:heHE.EnylouFlogaPyros.notmetered	N/M ()
ltx/en_us_unknown/he.h.m3:heHE.EnylouFlogaPyros.ode	@ltx/en_us_unknown/miscellanea:misc.Ode8
ltx/en_us_unknown/he.h.m3:heHE.EnylouFlogaPyros.text	
ltx/en_us_unknown/he.h.m3:heHE.EpiTisGis.greekname	
ltx/en_us_unknown/he.h.m3:heHE.EpiTisGis.incipit	…
ltx/en_us_unknown/he.h.m3:heHE.EpiTisGis.melody	@ltx/en_us_unknown/miscellanea:misc.Heirmos
ltx/en_us_unknown/he.h.m3:heHE.EpiTisGis.mode	@ltx/en_us_unknown/miscellanea:misc.Mode3
ltx/en_us_unknown/he.h.m3:heHE.EpiTisGis.name	Upon the earth.
ltx/en_us_unknown/he.h.m3:heHE.EpiTisGis.notmetered	N/M (Upon the earth.)
ltx/en_us_unknown/he.h.m3:heHE.EpiTisGis.ode	@ltx/en_us_unknown/miscellanea:misc.Ode5
ltx/en_us_unknown/he.h.m3:heHE.EpiTisGis.text	
ltx/en_us_unknown/he.h.m3:heHE.EstereothiIKardiaMou.greekname	
ltx/en_us_unknown/he.h.m3:heHE.EstereothiIKardiaMou.incipit	…
ltx/en_us_unknown/he.h.m3:heHE.EstereothiIKardiaMou.melody	@ltx/en_us_unknown/miscellanea:misc.Heirmos
ltx/en_us_unknown/he.h.m3:heHE.EstereothiIKardiaMou.mode	@ltx/en_us_unknown/miscellanea:misc.Mode3
ltx/en_us_unknown/he.h.m3:heHE.EstereothiIKardiaMou.name	
ltx/en_us_unknown/he.h.m3:heHE.EstereothiIKardiaMou.notmetered	N/M ()
ltx/en_us_unknown/he.h.m3:heHE.EstereothiIKardiaMou.ode	@ltx/en_us_unknown/miscellanea:misc.Ode3
ltx/en_us_unknown/he.h.m3:heHE.EstereothiIKardiaMou.text	
ltx/en_us_unknown/he.h.m3:heHE.EthouProsImas.greekname	
ltx/en_us_unknown/he.h.m3:heHE.EthouProsImas.incipit	…
ltx/en_us_unknown/he.h.m3:heHE.EthouProsImas.melody	@ltx/en_us_unknown/miscellanea:misc.Heirmos
ltx/en_us_unknown/he.h.m3:heHE.EthouProsImas.mode	@ltx/en_us_unknown/miscellanea:misc.Mode3
ltx/en_us_unknown/he.h.m3:heHE.EthouProsImas.name	Lord, You have established.
ltx/en_us_unknown/he.h.m3:heHE.EthouProsImas.notmetered	N/M ()
ltx/en_us_unknown/he.h.m3:heHE.EthouProsImas.ode	@ltx/en_us_unknown/miscellanea:misc.Ode4
ltx/en_us_unknown/he.h.m3:heHE.EthouProsImas.text	
ltx/en_us_unknown/he.h.m3:heHE.EvlogitosKyrios.greekname	
ltx/en_us_unknown/he.h.m3:heHE.EvlogitosKyrios.incipit	…
ltx/en_us_unknown/he.h.m3:heHE.EvlogitosKyrios.melody	@ltx/en_us_unknown/miscellanea:misc.Heirmos
ltx/en_us_unknown/he.h.m3:heHE.EvlogitosKyrios.mode	@ltx/en_us_unknown/miscellanea:misc.Mode3
ltx/en_us_unknown/he.h.m3:heHE.EvlogitosKyrios.name	
ltx/en_us_unknown/he.h.m3:heHE.EvlogitosKyrios.notmetered	N/M ()
ltx/en_us_unknown/he.h.m3:heHE.EvlogitosKyrios.ode	@ltx/en_us_unknown/miscellanea:misc.Ode9
ltx/en_us_unknown/he.h.m3:heHE.EvlogitosKyrios.text	
ltx/en_us_unknown/he.h.m3:heHE.EvoisaEnStenagmois.greekname	
ltx/en_us_unknown/he.h.m3:heHE.EvoisaEnStenagmois.incipit	…
ltx/en_us_unknown/he.h.m3:heHE.EvoisaEnStenagmois.melody	@ltx/en_us_unknown/miscellanea:misc.Heirmos
ltx/en_us_unknown/he.h.m3:heHE.EvoisaEnStenagmois.mode	@ltx/en_us_unknown/miscellanea:misc.Mode3
ltx/en_us_unknown/he.h.m3:heHE.EvoisaEnStenagmois.name	
ltx/en_us_unknown/he.h.m3:heHE.EvoisaEnStenagmois.notmetered	N/M ()
ltx/en_us_unknown/he.h.m3:heHE.EvoisaEnStenagmois.ode	@ltx/en_us_unknown/miscellanea:misc.Ode6
ltx/en_us_unknown/he.h.m3:heHE.EvoisaEnStenagmois.text	
ltx/en_us_unknown/he.h.m3:heHE.EvoiseSoi.greekname	
ltx/en_us_unknown/he.h.m3:heHE.EvoiseSoi.incipit	To You, the Elder…
ltx/en_us_unknown/he.h.m3:heHE.EvoiseSoi.melody	@ltx/en_us_unknown/miscellanea:misc.Heirmos
ltx/en_us_unknown/he.h.m3:heHE.EvoiseSoi.mode	@ltx/en_us_unknown/miscellanea:misc.Mode3
ltx/en_us_unknown/he.h.m3:heHE.EvoiseSoi.name	To You, the Elder.
ltx/en_us_unknown/he.h.m3:heHE.EvoiseSoi.notmetered	N/M (To You, the Elder.)
ltx/en_us_unknown/he.h.m3:heHE.EvoiseSoi.ode	@ltx/en_us_unknown/miscellanea:misc.Ode6
ltx/en_us_unknown/he.h.m3:heHE.EvoiseSoi.text	
ltx/en_us_unknown/he.h.m3:heHE.FaraoTaArmata.greekname	
ltx/en_us_unknown/he.h.m3:heHE.FaraoTaArmata.incipit	…
ltx/en_us_unknown/he.h.m3:heHE.FaraoTaArmata.melody	@ltx/en_us_unknown/miscellanea:misc.Heirmos
ltx/en_us_unknown/he.h.m3:heHE.FaraoTaArmata.mode	@ltx/en_us_unknown/miscellanea:misc.Mode3
ltx/en_us_unknown/he.h.m3:heHE.FaraoTaArmata.name	
ltx/en_us_unknown/he.h.m3:heHE.FaraoTaArmata.notmetered	N/M ()
ltx/en_us_unknown/he.h.m3:heHE.FaraoTaArmata.ode	@ltx/en_us_unknown/miscellanea:misc.Ode1
ltx/en_us_unknown/he.h.m3:heHE.FaraoTaArmata.text	
ltx/en_us_unknown/he.h.m3:heHE.FotiToAnespero.greekname	Φωτὶ τῷ ἀνεσπέρῳ.
ltx/en_us_unknown/he.h.m3:heHE.FotiToAnespero.incipit	…
ltx/en_us_unknown/he.h.m3:heHE.FotiToAnespero.melody	@ltx/en_us_unknown/miscellanea:misc.Heirmos
ltx/en_us_unknown/he.h.m3:heHE.FotiToAnespero.mode	@ltx/en_us_unknown/miscellanea:misc.Mode3
ltx/en_us_unknown/he.h.m3:heHE.FotiToAnespero.name	Illuminate my humble soul.
ltx/en_us_unknown/he.h.m3:heHE.FotiToAnespero.notmetered	N/M (Illuminate my humble soul.)
ltx/en_us_unknown/he.h.m3:heHE.FotiToAnespero.ode	@ltx/en_us_unknown/miscellanea:misc.Ode5
ltx/en_us_unknown/he.h.m3:heHE.FotiToAnespero.text	
ltx/en_us_unknown/he.h.m3:heHE.IdeteIdete.greekname	
ltx/en_us_unknown/he.h.m3:heHE.IdeteIdete.incipit	…
ltx/en_us_unknown/he.h.m3:heHE.IdeteIdete.melody	@ltx/en_us_unknown/miscellanea:misc.Heirmos
ltx/en_us_unknown/he.h.m3:heHE.IdeteIdete.mode	@ltx/en_us_unknown/miscellanea:misc.Mode3
ltx/en_us_unknown/he.h.m3:heHE.IdeteIdete.name	
ltx/en_us_unknown/he.h.m3:heHE.IdeteIdete.notmetered	N/M ()
ltx/en_us_unknown/he.h.m3:heHE.IdeteIdete.ode	@ltx/en_us_unknown/miscellanea:misc.Ode2
ltx/en_us_unknown/he.h.m3:heHE.IdeteIdete.text	
ltx/en_us_unknown/he.h.m3:heHE.KainonToThavma.greekname	
ltx/en_us_unknown/he.h.m3:heHE.KainonToThavma.incipit	…
ltx/en_us_unknown/he.h.m3:heHE.KainonToThavma.melody	@ltx/en_us_unknown/miscellanea:misc.Heirmos
ltx/en_us_unknown/he.h.m3:heHE.KainonToThavma.mode	@ltx/en_us_unknown/miscellanea:misc.Mode3
ltx/en_us_unknown/he.h.m3:heHE.KainonToThavma.name	
ltx/en_us_unknown/he.h.m3:heHE.KainonToThavma.notmetered	N/M ()
ltx/en_us_unknown/he.h.m3:heHE.KainonToThavma.ode	@ltx/en_us_unknown/miscellanea:misc.Ode9
ltx/en_us_unknown/he.h.m3:heHE.KainonToThavma.text	
ltx/en_us_unknown/he.h.m3:heHE.LatreveinZontiTheo.greekname	
ltx/en_us_unknown/he.h.m3:heHE.LatreveinZontiTheo.incipit	…
ltx/en_us_unknown/he.h.m3:heHE.LatreveinZontiTheo.melody	@ltx/en_us_unknown/miscellanea:misc.Heirmos
ltx/en_us_unknown/he.h.m3:heHE.LatreveinZontiTheo.mode	@ltx/en_us_unknown/miscellanea:misc.Mode3
ltx/en_us_unknown/he.h.m3:heHE.LatreveinZontiTheo.name	
ltx/en_us_unknown/he.h.m3:heHE.LatreveinZontiTheo.notmetered	N/M ()
ltx/en_us_unknown/he.h.m3:heHE.LatreveinZontiTheo.ode	@ltx/en_us_unknown/miscellanea:misc.Ode8
ltx/en_us_unknown/he.h.m3:heHE.LatreveinZontiTheo.text	
ltx/en_us_unknown/he.h.m3:heHE.MiEnPotamois.greekname	
ltx/en_us_unknown/he.h.m3:heHE.MiEnPotamois.incipit	…
ltx/en_us_unknown/he.h.m3:heHE.MiEnPotamois.melody	@ltx/en_us_unknown/miscellanea:misc.Heirmos
ltx/en_us_unknown/he.h.m3:heHE.MiEnPotamois.mode	@ltx/en_us_unknown/miscellanea:misc.Mode3
ltx/en_us_unknown/he.h.m3:heHE.MiEnPotamois.name	
ltx/en_us_unknown/he.h.m3:heHE.MiEnPotamois.notmetered	N/M ()
ltx/en_us_unknown/he.h.m3:heHE.MiEnPotamois.ode	@ltx/en_us_unknown/miscellanea:misc.Ode4
ltx/en_us_unknown/he.h.m3:heHE.MiEnPotamois.text	
ltx/en_us_unknown/he.h.m3:heHE.OEkMiOnton.greekname	
ltx/en_us_unknown/he.h.m3:heHE.OEkMiOnton.incipit	…
ltx/en_us_unknown/he.h.m3:heHE.OEkMiOnton.melody	@ltx/en_us_unknown/miscellanea:misc.Heirmos
ltx/en_us_unknown/he.h.m3:heHE.OEkMiOnton.mode	@ltx/en_us_unknown/miscellanea:misc.Mode3
ltx/en_us_unknown/he.h.m3:heHE.OEkMiOnton.name	
ltx/en_us_unknown/he.h.m3:heHE.OEkMiOnton.notmetered	N/M ()
ltx/en_us_unknown/he.h.m3:heHE.OEkMiOnton.ode	@ltx/en_us_unknown/miscellanea:misc.Ode3
ltx/en_us_unknown/he.h.m3:heHE.OEkMiOnton.text	
ltx/en_us_unknown/he.h.m3:heHE.OTaYdata.greekname	
ltx/en_us_unknown/he.h.m3:heHE.OTaYdata.incipit	…
ltx/en_us_unknown/he.h.m3:heHE.OTaYdata.melody	@ltx/en_us_unknown/miscellanea:misc.Heirmos
ltx/en_us_unknown/he.h.m3:heHE.OTaYdata.mode	@ltx/en_us_unknown/miscellanea:misc.Mode3
ltx/en_us_unknown/he.h.m3:heHE.OTaYdata.name	
ltx/en_us_unknown/he.h.m3:heHE.OTaYdata.notmetered	N/M ()
ltx/en_us_unknown/he.h.m3:heHE.OTaYdata.ode	@ltx/en_us_unknown/miscellanea:misc.Ode1
ltx/en_us_unknown/he.h.m3:heHE.OTaYdata.text	
ltx/en_us_unknown/he.h.m3:heHE.OTinFloga.greekname	Ὁ τὴν φλόγα.
ltx/en_us_unknown/he.h.m3:heHE.OTinFloga.incipit	…
ltx/en_us_unknown/he.h.m3:heHE.OTinFloga.melody	@ltx/en_us_unknown/miscellanea:misc.Heirmos
ltx/en_us_unknown/he.h.m3:heHE.OTinFloga.mode	@ltx/en_us_unknown/miscellanea:misc.Mode3
ltx/en_us_unknown/he.h.m3:heHE.OTinFloga.name	You made flame a dewy breeze.
ltx/en_us_unknown/he.h.m3:heHE.OTinFloga.notmetered	N/M (You made flame a dewy breeze.)
ltx/en_us_unknown/he.h.m3:heHE.OTinFloga.ode	@ltx/en_us_unknown/miscellanea:misc.Ode7
ltx/en_us_unknown/he.h.m3:heHE.OTinFloga.text	
ltx/en_us_unknown/he.h.m3:heHE.OiToGlykei.greekname	
ltx/en_us_unknown/he.h.m3:heHE.OiToGlykei.incipit	…
ltx/en_us_unknown/he.h.m3:heHE.OiToGlykei.melody	@ltx/en_us_unknown/miscellanea:misc.Heirmos
ltx/en_us_unknown/he.h.m3:heHE.OiToGlykei.mode	@ltx/en_us_unknown/miscellanea:misc.Mode3
ltx/en_us_unknown/he.h.m3:heHE.OiToGlykei.name	
ltx/en_us_unknown/he.h.m3:heHE.OiToGlykei.notmetered	N/M ()
ltx/en_us_unknown/he.h.m3:heHE.OiToGlykei.ode	@ltx/en_us_unknown/miscellanea:misc.Ode9
ltx/en_us_unknown/he.h.m3:heHE.OiToGlykei.text	
ltx/en_us_unknown/he.h.m3:heHE.OrthrizontesAnymnoumen.greekname	
ltx/en_us_unknown/he.h.m3:heHE.OrthrizontesAnymnoumen.incipit	…
ltx/en_us_unknown/he.h.m3:heHE.OrthrizontesAnymnoumen.melody	@ltx/en_us_unknown/miscellanea:misc.Heirmos
ltx/en_us_unknown/he.h.m3:heHE.OrthrizontesAnymnoumen.mode	@ltx/en_us_unknown/miscellanea:misc.Mode3
ltx/en_us_unknown/he.h.m3:heHE.OrthrizontesAnymnoumen.name	
ltx/en_us_unknown/he.h.m3:heHE.OrthrizontesAnymnoumen.notmetered	N/M ()
ltx/en_us_unknown/he.h.m3:heHE.OrthrizontesAnymnoumen.ode	@ltx/en_us_unknown/miscellanea:misc.Ode5
ltx/en_us_unknown/he.h.m3:heHE.OrthrizontesAnymnoumen.text	
ltx/en_us_unknown/he.h.m3:heHE.OsEidenIsaias.greekname	
ltx/en_us_unknown/he.h.m3:heHE.OsEidenIsaias.incipit	Isaiah had a mystical vision…
ltx/en_us_unknown/he.h.m3:heHE.OsEidenIsaias.melody	@ltx/en_us_unknown/miscellanea:misc.Heirmos
ltx/en_us_unknown/he.h.m3:heHE.OsEidenIsaias.mode	@ltx/en_us_unknown/miscellanea:misc.Mode3
ltx/en_us_unknown/he.h.m3:heHE.OsEidenIsaias.name	Isaiah had a mystical vision.
ltx/en_us_unknown/he.h.m3:heHE.OsEidenIsaias.notmetered	N/M (Isaiah had a mystical vision.)
ltx/en_us_unknown/he.h.m3:heHE.OsEidenIsaias.ode	@ltx/en_us_unknown/miscellanea:misc.Ode5
ltx/en_us_unknown/he.h.m3:heHE.OsEidenIsaias.text	
ltx/en_us_unknown/he.h.m3:heHE.OsOmvrosEpAgrostin.greekname	
ltx/en_us_unknown/he.h.m3:heHE.OsOmvrosEpAgrostin.incipit	…
ltx/en_us_unknown/he.h.m3:heHE.OsOmvrosEpAgrostin.melody	@ltx/en_us_unknown/miscellanea:misc.Heirmos
ltx/en_us_unknown/he.h.m3:heHE.OsOmvrosEpAgrostin.mode	@ltx/en_us_unknown/miscellanea:misc.Mode3
ltx/en_us_unknown/he.h.m3:heHE.OsOmvrosEpAgrostin.name	
ltx/en_us_unknown/he.h.m3:heHE.OsOmvrosEpAgrostin.notmetered	N/M ()
ltx/en_us_unknown/he.h.m3:heHE.OsOmvrosEpAgrostin.ode	@ltx/en_us_unknown/miscellanea:misc.Ode2
ltx/en_us_unknown/he.h.m3:heHE.OsOmvrosEpAgrostin.text	
ltx/en_us_unknown/he.h.m3:heHE.OsPalaiTousEfseveis.greekname	
ltx/en_us_unknown/he.h.m3:heHE.OsPalaiTousEfseveis.incipit	…
ltx/en_us_unknown/he.h.m3:heHE.OsPalaiTousEfseveis.melody	@ltx/en_us_unknown/miscellanea:misc.Heirmos
ltx/en_us_unknown/he.h.m3:heHE.OsPalaiTousEfseveis.mode	@ltx/en_us_unknown/miscellanea:misc.Mode3
ltx/en_us_unknown/he.h.m3:heHE.OsPalaiTousEfseveis.name	Of old You refreshed.
ltx/en_us_unknown/he.h.m3:heHE.OsPalaiTousEfseveis.notmetered	N/M ()
ltx/en_us_unknown/he.h.m3:heHE.OsPalaiTousEfseveis.ode	@ltx/en_us_unknown/miscellanea:misc.Ode7
ltx/en_us_unknown/he.h.m3:heHE.OsPalaiTousEfseveis.text	
ltx/en_us_unknown/he.h.m3:heHE.ProsSeOrthrizo.greekname	
ltx/en_us_unknown/he.h.m3:heHE.ProsSeOrthrizo.incipit	…
ltx/en_us_unknown/he.h.m3:heHE.ProsSeOrthrizo.melody	@ltx/en_us_unknown/miscellanea:misc.Heirmos
ltx/en_us_unknown/he.h.m3:heHE.ProsSeOrthrizo.mode	@ltx/en_us_unknown/miscellanea:misc.Mode3
ltx/en_us_unknown/he.h.m3:heHE.ProsSeOrthrizo.name	I rise early in the morning
ltx/en_us_unknown/he.h.m3:heHE.ProsSeOrthrizo.notmetered	N/M ()
ltx/en_us_unknown/he.h.m3:heHE.ProsSeOrthrizo.ode	@ltx/en_us_unknown/miscellanea:misc.Ode5
ltx/en_us_unknown/he.h.m3:heHE.ProsSeOrthrizo.text	
ltx/en_us_unknown/he.h.m3:heHE.ProsecheGiKaiOurane.greekname	
ltx/en_us_unknown/he.h.m3:heHE.ProsecheGiKaiOurane.incipit	…
ltx/en_us_unknown/he.h.m3:heHE.ProsecheGiKaiOurane.melody	@ltx/en_us_unknown/miscellanea:misc.Heirmos
ltx/en_us_unknown/he.h.m3:heHE.ProsecheGiKaiOurane.mode	@ltx/en_us_unknown/miscellanea:misc.Mode3
ltx/en_us_unknown/he.h.m3:heHE.ProsecheGiKaiOurane.name	
ltx/en_us_unknown/he.h.m3:heHE.ProsecheGiKaiOurane.notmetered	N/M ()
ltx/en_us_unknown/he.h.m3:heHE.ProsecheGiKaiOurane.ode	@ltx/en_us_unknown/miscellanea:misc.Ode2
ltx/en_us_unknown/he.h.m3:heHE.ProsecheGiKaiOurane.text	
ltx/en_us_unknown/he.h.m3:heHE.SeTinAkataflekton.greekname	
ltx/en_us_unknown/he.h.m3:heHE.SeTinAkataflekton.incipit	We, O holy Virgin, perceive you…
ltx/en_us_unknown/he.h.m3:heHE.SeTinAkataflekton.melody	@ltx/en_us_unknown/miscellanea:misc.Heirmos
ltx/en_us_unknown/he.h.m3:heHE.SeTinAkataflekton.mode	@ltx/en_us_unknown/miscellanea:misc.Mode3
ltx/en_us_unknown/he.h.m3:heHE.SeTinAkataflekton.name	We, O holy Virgin, perceive you.
ltx/en_us_unknown/he.h.m3:heHE.SeTinAkataflekton.notmetered	N/M (We, O holy Virgin, perceive you.)
ltx/en_us_unknown/he.h.m3:heHE.SeTinAkataflekton.ode	@ltx/en_us_unknown/miscellanea:misc.Ode9
ltx/en_us_unknown/he.h.m3:heHE.SeTinAkataflekton.text	
ltx/en_us_unknown/he.h.m3:heHE.SeTinAthanaton.greekname	
ltx/en_us_unknown/he.h.m3:heHE.SeTinAthanaton.incipit	We ever magnify you. (not metered)…
ltx/en_us_unknown/he.h.m3:heHE.SeTinAthanaton.melody	@ltx/en_us_unknown/miscellanea:misc.Heirmos
ltx/en_us_unknown/he.h.m3:heHE.SeTinAthanaton.mode	@ltx/en_us_unknown/miscellanea:misc.Mode3
ltx/en_us_unknown/he.h.m3:heHE.SeTinAthanaton.name	N/M (We ever magnify you. (not metered))
ltx/en_us_unknown/he.h.m3:heHE.SeTinAthanaton.notmetered	N/M (We ever magnify you. (not metered))
ltx/en_us_unknown/he.h.m3:heHE.SeTinAthanaton.ode	@ltx/en_us_unknown/miscellanea:misc.Ode9
ltx/en_us_unknown/he.h.m3:heHE.SeTinAthanaton.text	
ltx/en_us_unknown/he.h.m3:heHE.SeTonEnPyri.greekname	
ltx/en_us_unknown/he.h.m3:heHE.SeTonEnPyri.incipit	Servants in the furnace…
ltx/en_us_unknown/he.h.m3:heHE.SeTonEnPyri.melody	@ltx/en_us_unknown/miscellanea:misc.Heirmos
ltx/en_us_unknown/he.h.m3:heHE.SeTonEnPyri.mode	@ltx/en_us_unknown/miscellanea:misc.Mode3
ltx/en_us_unknown/he.h.m3:heHE.SeTonEnPyri.name	Servants in the furnace.
ltx/en_us_unknown/he.h.m3:heHE.SeTonEnPyri.notmetered	N/M (Servants in the furnace.)
ltx/en_us_unknown/he.h.m3:heHE.SeTonEnPyri.ode	@ltx/en_us_unknown/miscellanea:misc.Ode7
ltx/en_us_unknown/he.h.m3:heHE.SeTonEnPyri.text	
ltx/en_us_unknown/he.h.m3:heHE.SkinoseosIonas.greekname	
ltx/en_us_unknown/he.h.m3:heHE.SkinoseosIonas.incipit	…
ltx/en_us_unknown/he.h.m3:heHE.SkinoseosIonas.melody	@ltx/en_us_unknown/miscellanea:misc.Heirmos
ltx/en_us_unknown/he.h.m3:heHE.SkinoseosIonas.mode	@ltx/en_us_unknown/miscellanea:misc.Mode3
ltx/en_us_unknown/he.h.m3:heHE.SkinoseosIonas.name	
ltx/en_us_unknown/he.h.m3:heHE.SkinoseosIonas.notmetered	N/M ()
ltx/en_us_unknown/he.h.m3:heHE.SkinoseosIonas.ode	@ltx/en_us_unknown/miscellanea:misc.Ode6
ltx/en_us_unknown/he.h.m3:heHE.SkinoseosIonas.text	
ltx/en_us_unknown/he.h.m3:heHE.SovarosOTyrannos.greekname	
ltx/en_us_unknown/he.h.m3:heHE.SovarosOTyrannos.incipit	…
ltx/en_us_unknown/he.h.m3:heHE.SovarosOTyrannos.melody	@ltx/en_us_unknown/miscellanea:misc.Heirmos
ltx/en_us_unknown/he.h.m3:heHE.SovarosOTyrannos.mode	@ltx/en_us_unknown/miscellanea:misc.Mode3
ltx/en_us_unknown/he.h.m3:heHE.SovarosOTyrannos.name	
ltx/en_us_unknown/he.h.m3:heHE.SovarosOTyrannos.notmetered	N/M ()
ltx/en_us_unknown/he.h.m3:heHE.SovarosOTyrannos.ode	@ltx/en_us_unknown/miscellanea:misc.Ode7
ltx/en_us_unknown/he.h.m3:heHE.SovarosOTyrannos.text	
ltx/en_us_unknown/he.h.m3:heHE.SteiraPsychi.greekname	Στεῖρα ψυχή.
ltx/en_us_unknown/he.h.m3:heHE.SteiraPsychi.incipit	…
ltx/en_us_unknown/he.h.m3:heHE.SteiraPsychi.melody	@ltx/en_us_unknown/miscellanea:misc.Heirmos
ltx/en_us_unknown/he.h.m3:heHE.SteiraPsychi.mode	@ltx/en_us_unknown/miscellanea:misc.Mode3
ltx/en_us_unknown/he.h.m3:heHE.SteiraPsychi.name	Barren, unfruitful soul.
ltx/en_us_unknown/he.h.m3:heHE.SteiraPsychi.notmetered	N/M (Barren, unfruitful soul.)
ltx/en_us_unknown/he.h.m3:heHE.SteiraPsychi.ode	@ltx/en_us_unknown/miscellanea:misc.Ode3
ltx/en_us_unknown/he.h.m3:heHE.SteiraPsychi.text	
ltx/en_us_unknown/he.h.m3:heHE.StereosonKyrie.greekname	
ltx/en_us_unknown/he.h.m3:heHE.StereosonKyrie.incipit	…
ltx/en_us_unknown/he.h.m3:heHE.StereosonKyrie.melody	@ltx/en_us_unknown/miscellanea:misc.Heirmos
ltx/en_us_unknown/he.h.m3:heHE.StereosonKyrie.mode	@ltx/en_us_unknown/miscellanea:misc.Mode3
ltx/en_us_unknown/he.h.m3:heHE.StereosonKyrie.name	
ltx/en_us_unknown/he.h.m3:heHE.StereosonKyrie.notmetered	N/M ()
ltx/en_us_unknown/he.h.m3:heHE.StereosonKyrie.ode	@ltx/en_us_unknown/miscellanea:misc.Ode3
ltx/en_us_unknown/he.h.m3:heHE.StereosonKyrie.text	
ltx/en_us_unknown/he.h.m3:heHE.TemnomeninThalassan.greekname	
ltx/en_us_unknown/he.h.m3:heHE.TemnomeninThalassan.incipit	…
ltx/en_us_unknown/he.h.m3:heHE.TemnomeninThalassan.melody	@ltx/en_us_unknown/miscellanea:misc.Heirmos
ltx/en_us_unknown/he.h.m3:heHE.TemnomeninThalassan.mode	@ltx/en_us_unknown/miscellanea:misc.Mode3
ltx/en_us_unknown/he.h.m3:heHE.TemnomeninThalassan.name	
ltx/en_us_unknown/he.h.m3:heHE.TemnomeninThalassan.notmetered	N/M ()
ltx/en_us_unknown/he.h.m3:heHE.TemnomeninThalassan.ode	@ltx/en_us_unknown/miscellanea:misc.Ode1
ltx/en_us_unknown/he.h.m3:heHE.TemnomeninThalassan.text	
ltx/en_us_unknown/he.h.m3:heHE.ThavmastosEndoxos.greekname	Θαυμαστὸς ἐνδόξως.
ltx/en_us_unknown/he.h.m3:heHE.ThavmastosEndoxos.incipit	…
ltx/en_us_unknown/he.h.m3:heHE.ThavmastosEndoxos.melody	@ltx/en_us_unknown/miscellanea:misc.Heirmos
ltx/en_us_unknown/he.h.m3:heHE.ThavmastosEndoxos.mode	@ltx/en_us_unknown/miscellanea:misc.Mode3
ltx/en_us_unknown/he.h.m3:heHE.ThavmastosEndoxos.name	Marvelous in praises.
ltx/en_us_unknown/he.h.m3:heHE.ThavmastosEndoxos.notmetered	N/M (Marvelous in praises.)
ltx/en_us_unknown/he.h.m3:heHE.ThavmastosEndoxos.ode	@ltx/en_us_unknown/miscellanea:misc.Ode1
ltx/en_us_unknown/he.h.m3:heHE.ThavmastosEndoxos.text	
ltx/en_us_unknown/he.h.m3:heHE.TinEnVatoKaiPyri.greekname	
ltx/en_us_unknown/he.h.m3:heHE.TinEnVatoKaiPyri.incipit	…
ltx/en_us_unknown/he.h.m3:heHE.TinEnVatoKaiPyri.melody	@ltx/en_us_unknown/miscellanea:misc.Heirmos
ltx/en_us_unknown/he.h.m3:heHE.TinEnVatoKaiPyri.mode	@ltx/en_us_unknown/miscellanea:misc.Mode3
ltx/en_us_unknown/he.h.m3:heHE.TinEnVatoKaiPyri.name	
ltx/en_us_unknown/he.h.m3:heHE.TinEnVatoKaiPyri.notmetered	N/M ()
ltx/en_us_unknown/he.h.m3:heHE.TinEnVatoKaiPyri.ode	@ltx/en_us_unknown/miscellanea:misc.Ode9
ltx/en_us_unknown/he.h.m3:heHE.TinEnVatoKaiPyri.text	
ltx/en_us_unknown/he.h.m3:heHE.TinSinEirinin.greekname	
ltx/en_us_unknown/he.h.m3:heHE.TinSinEirinin.incipit	…
ltx/en_us_unknown/he.h.m3:heHE.TinSinEirinin.melody	@ltx/en_us_unknown/miscellanea:misc.Heirmos
ltx/en_us_unknown/he.h.m3:heHE.TinSinEirinin.mode	@ltx/en_us_unknown/miscellanea:misc.Mode3
ltx/en_us_unknown/he.h.m3:heHE.TinSinEirinin.name	
ltx/en_us_unknown/he.h.m3:heHE.TinSinEirinin.notmetered	N/M ()
ltx/en_us_unknown/he.h.m3:heHE.TinSinEirinin.ode	@ltx/en_us_unknown/miscellanea:misc.Ode5
ltx/en_us_unknown/he.h.m3:heHE.TinSinEirinin.text	
ltx/en_us_unknown/he.h.m3:heHE.ToFosSouToAnesperon.greekname	
ltx/en_us_unknown/he.h.m3:heHE.ToFosSouToAnesperon.incipit	…
ltx/en_us_unknown/he.h.m3:heHE.ToFosSouToAnesperon.melody	@ltx/en_us_unknown/miscellanea:misc.Heirmos
ltx/en_us_unknown/he.h.m3:heHE.ToFosSouToAnesperon.mode	@ltx/en_us_unknown/miscellanea:misc.Mode3
ltx/en_us_unknown/he.h.m3:heHE.ToFosSouToAnesperon.name	
ltx/en_us_unknown/he.h.m3:heHE.ToFosSouToAnesperon.notmetered	N/M ()
ltx/en_us_unknown/he.h.m3:heHE.ToFosSouToAnesperon.ode	@ltx/en_us_unknown/miscellanea:misc.Ode5
ltx/en_us_unknown/he.h.m3:heHE.ToFosSouToAnesperon.text	
ltx/en_us_unknown/he.h.m3:heHE.ToKataskionOros.greekname	Τὸ κατάσκιον ὄρος.
ltx/en_us_unknown/he.h.m3:heHE.ToKataskionOros.incipit	…
ltx/en_us_unknown/he.h.m3:heHE.ToKataskionOros.melody	@ltx/en_us_unknown/miscellanea:misc.Heirmos
ltx/en_us_unknown/he.h.m3:heHE.ToKataskionOros.mode	@ltx/en_us_unknown/miscellanea:misc.Mode3
ltx/en_us_unknown/he.h.m3:heHE.ToKataskionOros.name	When the Prophet Habbakuk.
ltx/en_us_unknown/he.h.m3:heHE.ToKataskionOros.notmetered	N/M (When the Prophet Habbakuk.)
ltx/en_us_unknown/he.h.m3:heHE.ToKataskionOros.ode	@ltx/en_us_unknown/miscellanea:misc.Ode4
ltx/en_us_unknown/he.h.m3:heHE.ToKataskionOros.text	
ltx/en_us_unknown/he.h.m3:heHE.ToPrinEikoni.greekname	
ltx/en_us_unknown/he.h.m3:heHE.ToPrinEikoni.incipit	…
ltx/en_us_unknown/he.h.m3:heHE.ToPrinEikoni.melody	@ltx/en_us_unknown/miscellanea:misc.Heirmos
ltx/en_us_unknown/he.h.m3:heHE.ToPrinEikoni.mode	@ltx/en_us_unknown/miscellanea:misc.Mode3
ltx/en_us_unknown/he.h.m3:heHE.ToPrinEikoni.name	
ltx/en_us_unknown/he.h.m3:heHE.ToPrinEikoni.notmetered	N/M ()
ltx/en_us_unknown/he.h.m3:heHE.ToPrinEikoni.ode	@ltx/en_us_unknown/miscellanea:misc.Ode7
ltx/en_us_unknown/he.h.m3:heHE.ToPrinEikoni.text	
ltx/en_us_unknown/he.h.m3:heHE.ToStereoma.greekname	
ltx/en_us_unknown/he.h.m3:heHE.ToStereoma.incipit	As the firm support…
ltx/en_us_unknown/he.h.m3:heHE.ToStereoma.melody	@ltx/en_us_unknown/miscellanea:misc.Heirmos
ltx/en_us_unknown/he.h.m3:heHE.ToStereoma.mode	@ltx/en_us_unknown/miscellanea:misc.Mode3
ltx/en_us_unknown/he.h.m3:heHE.ToStereoma.name	As the firm support.
ltx/en_us_unknown/he.h.m3:heHE.ToStereoma.notmetered	N/M (As the firm support.)
ltx/en_us_unknown/he.h.m3:heHE.ToStereoma.ode	@ltx/en_us_unknown/miscellanea:misc.Ode3
ltx/en_us_unknown/he.h.m3:heHE.ToStereoma.text	
ltx/en_us_unknown/he.h.m3:heHE.ToXenonKaiAporriton.greekname	
ltx/en_us_unknown/he.h.m3:heHE.ToXenonKaiAporriton.incipit	…
ltx/en_us_unknown/he.h.m3:heHE.ToXenonKaiAporriton.melody	@ltx/en_us_unknown/miscellanea:misc.Heirmos
ltx/en_us_unknown/he.h.m3:heHE.ToXenonKaiAporriton.mode	@ltx/en_us_unknown/miscellanea:misc.Mode3
ltx/en_us_unknown/he.h.m3:heHE.ToXenonKaiAporriton.name	
ltx/en_us_unknown/he.h.m3:heHE.ToXenonKaiAporriton.notmetered	N/M ()
ltx/en_us_unknown/he.h.m3:heHE.ToXenonKaiAporriton.ode	@ltx/en_us_unknown/miscellanea:misc.Ode4
ltx/en_us_unknown/he.h.m3:heHE.ToXenonKaiAporriton.text	
ltx/en_us_unknown/he.h.m3:heHE.TonEnFlogi.greekname	
ltx/en_us_unknown/he.h.m3:heHE.TonEnFlogi.incipit	…
ltx/en_us_unknown/he.h.m3:heHE.TonEnFlogi.melody	@ltx/en_us_unknown/miscellanea:misc.Heirmos
ltx/en_us_unknown/he.h.m3:heHE.TonEnFlogi.mode	@ltx/en_us_unknown/miscellanea:misc.Mode3
ltx/en_us_unknown/he.h.m3:heHE.TonEnFlogi.name	
ltx/en_us_unknown/he.h.m3:heHE.TonEnFlogi.notmetered	N/M ()
ltx/en_us_unknown/he.h.m3:heHE.TonEnFlogi.ode	@ltx/en_us_unknown/miscellanea:misc.Ode8
ltx/en_us_unknown/he.h.m3:heHE.TonEnFlogi.text	
ltx/en_us_unknown/he.h.m3:heHE.TonExAnarchou.greekname	
ltx/en_us_unknown/he.h.m3:heHE.TonExAnarchou.incipit	Extol Him who is God. (not metered)…
ltx/en_us_unknown/he.h.m3:heHE.TonExAnarchou.melody	@ltx/en_us_unknown/miscellanea:misc.Heirmos
ltx/en_us_unknown/he.h.m3:heHE.TonExAnarchou.mode	@ltx/en_us_unknown/miscellanea:misc.Mode3
ltx/en_us_unknown/he.h.m3:heHE.TonExAnarchou.name	N/M (Extol Him who is God. (not metered))
ltx/en_us_unknown/he.h.m3:heHE.TonExAnarchou.notmetered	N/M (Extol Him who is God. (not metered))
ltx/en_us_unknown/he.h.m3:heHE.TonExAnarchou.ode	@ltx/en_us_unknown/miscellanea:misc.Ode8
ltx/en_us_unknown/he.h.m3:heHE.TonExAnarchou.text	
ltx/en_us_unknown/he.h.m3:heHE.TonYpAngelon.greekname	Τὸν ὑπʼ Ἀγγέλων.
ltx/en_us_unknown/he.h.m3:heHE.TonYpAngelon.incipit	…
ltx/en_us_unknown/he.h.m3:heHE.TonYpAngelon.melody	@ltx/en_us_unknown/miscellanea:misc.Heirmos
ltx/en_us_unknown/he.h.m3:heHE.TonYpAngelon.mode	@ltx/en_us_unknown/miscellanea:misc.Mode3
ltx/en_us_unknown/he.h.m3:heHE.TonYpAngelon.name	To Him whom Angels.
ltx/en_us_unknown/he.h.m3:heHE.TonYpAngelon.notmetered	N/M (To Him whom Angels.)
ltx/en_us_unknown/he.h.m3:heHE.TonYpAngelon.ode	@ltx/en_us_unknown/miscellanea:misc.Ode8
ltx/en_us_unknown/he.h.m3:heHE.TonYpAngelon.text	
ltx/en_us_unknown/he.h.m3:heHE.TousEisTaTeli.greekname	
ltx/en_us_unknown/he.h.m3:heHE.TousEisTaTeli.incipit	…
ltx/en_us_unknown/he.h.m3:heHE.TousEisTaTeli.melody	@ltx/en_us_unknown/miscellanea:misc.Heirmos
ltx/en_us_unknown/he.h.m3:heHE.TousEisTaTeli.mode	@ltx/en_us_unknown/miscellanea:misc.Mode3
ltx/en_us_unknown/he.h.m3:heHE.TousEisTaTeli.name	
ltx/en_us_unknown/he.h.m3:heHE.TousEisTaTeli.notmetered	N/M ()
ltx/en_us_unknown/he.h.m3:heHE.TousEisTaTeli.ode	@ltx/en_us_unknown/miscellanea:misc.Ode6
ltx/en_us_unknown/he.h.m3:heHE.TousEisTaTeli.text	
ltx/en_us_unknown/he.h.m3:heHE.ToxonEthrafsasEchthron.greekname	
ltx/en_us_unknown/he.h.m3:heHE.ToxonEthrafsasEchthron.incipit	…
ltx/en_us_unknown/he.h.m3:heHE.ToxonEthrafsasEchthron.melody	@ltx/en_us_unknown/miscellanea:misc.Heirmos
ltx/en_us_unknown/he.h.m3:heHE.ToxonEthrafsasEchthron.mode	@ltx/en_us_unknown/miscellanea:misc.Mode3
ltx/en_us_unknown/he.h.m3:heHE.ToxonEthrafsasEchthron.name	
ltx/en_us_unknown/he.h.m3:heHE.ToxonEthrafsasEchthron.notmetered	N/M ()
ltx/en_us_unknown/he.h.m3:heHE.ToxonEthrafsasEchthron.ode	@ltx/en_us_unknown/miscellanea:misc.Ode3
ltx/en_us_unknown/he.h.m3:heHE.ToxonEthrafsasEchthron.text	
ltx/en_us_unknown/he.h.m3:heHE.TreisPaidesEnKamino.greekname	
ltx/en_us_unknown/he.h.m3:heHE.TreisPaidesEnKamino.incipit	…
ltx/en_us_unknown/he.h.m3:heHE.TreisPaidesEnKamino.melody	@ltx/en_us_unknown/miscellanea:misc.Heirmos
ltx/en_us_unknown/he.h.m3:heHE.TreisPaidesEnKamino.mode	@ltx/en_us_unknown/miscellanea:misc.Mode3
ltx/en_us_unknown/he.h.m3:heHE.TreisPaidesEnKamino.name	
ltx/en_us_unknown/he.h.m3:heHE.TreisPaidesEnKamino.notmetered	N/M ()
ltx/en_us_unknown/he.h.m3:heHE.TreisPaidesEnKamino.ode	@ltx/en_us_unknown/miscellanea:misc.Ode7
ltx/en_us_unknown/he.h.m3:heHE.TreisPaidesEnKamino.text	
ltx/en_us_unknown/he.h.m3:heHE.VavyloniaKaminos.greekname	
ltx/en_us_unknown/he.h.m3:heHE.VavyloniaKaminos.incipit	…
ltx/en_us_unknown/he.h.m3:heHE.VavyloniaKaminos.melody	@ltx/en_us_unknown/miscellanea:misc.Heirmos
ltx/en_us_unknown/he.h.m3:heHE.VavyloniaKaminos.mode	@ltx/en_us_unknown/miscellanea:misc.Mode3
ltx/en_us_unknown/he.h.m3:heHE.VavyloniaKaminos.name	
ltx/en_us_unknown/he.h.m3:heHE.VavyloniaKaminos.notmetered	N/M ()
ltx/en_us_unknown/he.h.m3:heHE.VavyloniaKaminos.ode	@ltx/en_us_unknown/miscellanea:misc.Ode8
ltx/en_us_unknown/he.h.m3:heHE.VavyloniaKaminos.text	
ltx/en_us_unknown/he.h.m3:heHE.VythosMoiTonPathon.greekname	Βυθός μοι τῶν παθῶν.
ltx/en_us_unknown/he.h.m3:heHE.VythosMoiTonPathon.incipit	…
ltx/en_us_unknown/he.h.m3:heHE.VythosMoiTonPathon.melody	@ltx/en_us_unknown/miscellanea:misc.Heirmos
ltx/en_us_unknown/he.h.m3:heHE.VythosMoiTonPathon.mode	@ltx/en_us_unknown/miscellanea:misc.Mode3
ltx/en_us_unknown/he.h.m3:heHE.VythosMoiTonPathon.name	The ocean of the passions.
ltx/en_us_unknown/he.h.m3:heHE.VythosMoiTonPathon.notmetered	N/M (The ocean of the passions.)
ltx/en_us_unknown/he.h.m3:heHE.VythosMoiTonPathon.ode	@ltx/en_us_unknown/miscellanea:misc.Ode6
ltx/en_us_unknown/he.h.m3:heHE.VythosMoiTonPathon.text	
