ltx/en_us_unknown/titles:ti.AdditionalForCanonOfSaint	Additional for the Canon of the Saint.
ltx/en_us_unknown/titles:ti.AdditionalForDead	Additional for the Dead.
ltx/en_us_unknown/titles:ti.AdditionalForTheotokos	Additional for the Theotokos.
ltx/en_us_unknown/titles:ti.AdditionalResurrectionalKathismata	Additional Resurrectional Kathismata.
ltx/en_us_unknown/titles:ti.AdditionalStichera	Additional Stichera.
ltx/en_us_unknown/titles:ti.AdditionalSticheraByAnatolios	Additional Stichera by Anatolios.
ltx/en_us_unknown/titles:ti.AdditionalSticheraForMaster	Additional Stichera for the Master
ltx/en_us_unknown/titles:ti.AfterChristmas	After Christmas
ltx/en_us_unknown/titles:ti.AfterChristmas.uc	AFTER CHRISTMAS
ltx/en_us_unknown/titles:ti.AfterCross	After the Elevation of the Cross
ltx/en_us_unknown/titles:ti.AfterCross.uc	AFTER THE ELEVATION OF THE CROSS
ltx/en_us_unknown/titles:ti.AfterEpiphany	After Epiphany
ltx/en_us_unknown/titles:ti.AfterEpiphany.uc	AFTER EPIPHANY
ltx/en_us_unknown/titles:ti.AfterPolyeleos	After the Polyelelos.
ltx/en_us_unknown/titles:ti.AfterPsalm118AndEvlogetaria	After Psalm 118 and the Evlogetaria:
ltx/en_us_unknown/titles:ti.AfterPsalter1	After the first Psalter reading.
ltx/en_us_unknown/titles:ti.AfterPsalter1Kathismata	After the first Psalter reading, Kathismata.
ltx/en_us_unknown/titles:ti.AfterPsalter2	After the second Psalter reading.
ltx/en_us_unknown/titles:ti.AfterPsalter2Kathismata	After the second Psalter reading, Kathismata.
ltx/en_us_unknown/titles:ti.AfterPsalter3Kathismata	After the third Psalter reading, Kathismata.
ltx/en_us_unknown/titles:ti.AfterTheFeast	After the Feast
ltx/en_us_unknown/titles:ti.AfterTheFeast.uc	AFTER THE FEAST
ltx/en_us_unknown/titles:ti.Akathist	For the Akathist.
ltx/en_us_unknown/titles:ti.Alleluia	Alleluia.
ltx/en_us_unknown/titles:ti.Alphabeticals	Alphabeticals.
ltx/en_us_unknown/titles:ti.Anavathmoi	Anavathmoi.
ltx/en_us_unknown/titles:ti.Anavathmoi41	Anavathmoi, Antiphon 1 of Mode 4.
ltx/en_us_unknown/titles:ti.AncestorsOfGod	For the Ancestors of God.
ltx/en_us_unknown/titles:ti.AndAlsoTheotokion	And also Theotokion.
ltx/en_us_unknown/titles:ti.AnotherApolytikion	Another Apolytikion.
ltx/en_us_unknown/titles:ti.AnotherCanon	Another Canon.
ltx/en_us_unknown/titles:ti.AnotherCanonForefeast	Another Canon of the Forefeast.
ltx/en_us_unknown/titles:ti.AnotherExtraHymn	Another Extra Hymn.
ltx/en_us_unknown/titles:ti.AnotherForFeast_1hymn	Another for the Feast.
ltx/en_us_unknown/titles:ti.AnotherForFeast_canon	Another for the Feast.
ltx/en_us_unknown/titles:ti.AnotherHeirmos	Another Heirmos.
ltx/en_us_unknown/titles:ti.AnotherKatavasia	Another Katavasia.
ltx/en_us_unknown/titles:ti.AnotherKontakion	Another Kontakion.
ltx/en_us_unknown/titles:ti.Another_1hymn	Another.
ltx/en_us_unknown/titles:ti.Another_canon_heirmos	Another.
ltx/en_us_unknown/titles:ti.Antiphon1	Antiphon I.
ltx/en_us_unknown/titles:ti.Antiphon2	Antiphon II.
ltx/en_us_unknown/titles:ti.Antiphon3	Antiphon III.
ltx/en_us_unknown/titles:ti.Antiphon4	Antiphon IV.
ltx/en_us_unknown/titles:ti.Apolytikia	Apolytikia.
ltx/en_us_unknown/titles:ti.Apolytikion	Apolytikion.
ltx/en_us_unknown/titles:ti.ApolytikionDay	Apolytikion for the Day.
ltx/en_us_unknown/titles:ti.ApolytikionFeast	Apolytikion of the Feast.
ltx/en_us_unknown/titles:ti.ApolytikionLocalChurch	
ltx/en_us_unknown/titles:ti.ApolytikionResurrectional	Resurrectional Apolytikion.
ltx/en_us_unknown/titles:ti.ApolytikionTriodion	Apolytikion from Triodion.
ltx/en_us_unknown/titles:ti.Aposticha	Aposticha.
ltx/en_us_unknown/titles:ti.ApostichaFeast	Aposticha of the Feast.
ltx/en_us_unknown/titles:ti.ApostichaForefeast	Aposticha of the Forefeast.
ltx/en_us_unknown/titles:ti.ApostichaLauds	Aposticha of Lauds.
ltx/en_us_unknown/titles:ti.ApostichaOctoechos	Aposticha of the Octoechos.
ltx/en_us_unknown/titles:ti.ApostichaResurrectional	Resurrectional Aposticha.
ltx/en_us_unknown/titles:ti.ApostichaStichera	Aposticha.
ltx/en_us_unknown/titles:ti.ApostichaTheotokos	Aposticha for the Theotokos.
ltx/en_us_unknown/titles:ti.Apostle	For the Apostle.
ltx/en_us_unknown/titles:ti.Apostles	For the Apostles.
ltx/en_us_unknown/titles:ti.Archangel	For the Archangel.
ltx/en_us_unknown/titles:ti.AtAposticha	At the Aposticha.
ltx/en_us_unknown/titles:ti.AtApostichaOfLauds	At the Aposticha of Lauds.
ltx/en_us_unknown/titles:ti.AtCompline.lc	at Compline.
ltx/en_us_unknown/titles:ti.AtCompline.uc	AT COMPLINE
ltx/en_us_unknown/titles:ti.AtLauds	At Lauds.
ltx/en_us_unknown/titles:ti.AtLiturgy.lc	as the Liturgy
ltx/en_us_unknown/titles:ti.AtLiturgy.uc	AT THE LITURGY
ltx/en_us_unknown/titles:ti.AtLity	At the Lity.
ltx/en_us_unknown/titles:ti.AtLordIHaveCried	At, Lord I Have Cried,
ltx/en_us_unknown/titles:ti.AtMatins.lc	at Matins
ltx/en_us_unknown/titles:ti.AtMatins.uc	AT MATINS
ltx/en_us_unknown/titles:ti.AtTrithekti.lc	at the Trithekti.
ltx/en_us_unknown/titles:ti.AtTrithekti.uc	AT THE SIXTH HOUR
ltx/en_us_unknown/titles:ti.AtVespers.lc	at Vespers
ltx/en_us_unknown/titles:ti.AtVespers.uc	AT VESPERS
ltx/en_us_unknown/titles:ti.Beatitudes	The Beatitudes.
ltx/en_us_unknown/titles:ti.BeforeChristmas	Before Christmas
ltx/en_us_unknown/titles:ti.BeforeChristmas.uc	BEFORE CHRISTMAS
ltx/en_us_unknown/titles:ti.BeforeCross	Before the Elevation of the Cross
ltx/en_us_unknown/titles:ti.BeforeCross.uc	BEFORE THE ELEVATION OF THE CROSS
ltx/en_us_unknown/titles:ti.BeforeEpiphany	Before Epiphany
ltx/en_us_unknown/titles:ti.BeforeEpiphany.uc	BEFORE EPIPHANY
ltx/en_us_unknown/titles:ti.BlessingOfLoaves	The Blessing of the Five Loaves.
ltx/en_us_unknown/titles:ti.Blindman	For the Blindman.
ltx/en_us_unknown/titles:ti.Bodiless	For the Angels.
ltx/en_us_unknown/titles:ti.BothNow	
ltx/en_us_unknown/titles:ti.Canon1	Canon 1.
ltx/en_us_unknown/titles:ti.Canon1Apostle	Canon 1 for the Apostle.
ltx/en_us_unknown/titles:ti.Canon1Bodiless	Canon 1 for the Bodiless Hosts.
ltx/en_us_unknown/titles:ti.Canon1DevoutM	Canon 1 for the Devout Man.
ltx/en_us_unknown/titles:ti.Canon1DevoutW	Canon 1 for the Devout Woman.
ltx/en_us_unknown/titles:ti.Canon1Fathers	Canon 1 for the Fathers.
ltx/en_us_unknown/titles:ti.Canon1Feast	Canon 1 of the Feast.
ltx/en_us_unknown/titles:ti.Canon1Forerunner	Canon 1 for the Forerunner.
ltx/en_us_unknown/titles:ti.Canon1MidPentecost	Canon 1 of Mid-Pentecost.
ltx/en_us_unknown/titles:ti.Canon1Prophet	Canon 1 for the Prophet.
ltx/en_us_unknown/titles:ti.Canon1SaintM	Canon 1 for the Saint.
ltx/en_us_unknown/titles:ti.Canon1SaintW	Canon 1 for the Holy Woman.
ltx/en_us_unknown/titles:ti.Canon1Saints	Canon 1 for the Saints.
ltx/en_us_unknown/titles:ti.Canon1Theotokos	Canon 1 for the Theotokos.
ltx/en_us_unknown/titles:ti.Canon1Triodion	Canon 1 from the Triodion.
ltx/en_us_unknown/titles:ti.Canon2	Canon 2.
ltx/en_us_unknown/titles:ti.Canon2Apostle	Canon 2 for the Apostle.
ltx/en_us_unknown/titles:ti.Canon2Bodiless	Canon 2 for the Bodiless Hosts.
ltx/en_us_unknown/titles:ti.Canon2DevoutM	Canon 2 for the Devout Man.
ltx/en_us_unknown/titles:ti.Canon2DevoutW	Canon 2 for the Devout Woman.
ltx/en_us_unknown/titles:ti.Canon2Fathers	Canon 2 for the Fathers.
ltx/en_us_unknown/titles:ti.Canon2Feast	Canon 2 of the Feast.
ltx/en_us_unknown/titles:ti.Canon2Forerunner	Canon 2 for the Forerunner.
ltx/en_us_unknown/titles:ti.Canon2MidPentecost	Canon 2 of Mid-Pentecost.
ltx/en_us_unknown/titles:ti.Canon2Prophet	Canon 2 for the Prophet.
ltx/en_us_unknown/titles:ti.Canon2SaintM	Canon 2 for the Saint.
ltx/en_us_unknown/titles:ti.Canon2SaintW	Canon 2 for the Holy Woman.
ltx/en_us_unknown/titles:ti.Canon2Saints	Canon 2 for the Saints.
ltx/en_us_unknown/titles:ti.Canon2Theotokos	Canon 2 for the Theotokos.
ltx/en_us_unknown/titles:ti.Canon2Triodion	Canon 2 from the Triodion.
ltx/en_us_unknown/titles:ti.Canon3	Canon 3.
ltx/en_us_unknown/titles:ti.Canon3Triodion	Canon 3 from the Triodion.
ltx/en_us_unknown/titles:ti.CanonAllSaints	Canon for all Saints.
ltx/en_us_unknown/titles:ti.CanonAncestorsOfGod	Canon for the Ancestors of God.
ltx/en_us_unknown/titles:ti.CanonApostle	Canon for the Apostle.
ltx/en_us_unknown/titles:ti.CanonApostles	Canon for the Apostles.
ltx/en_us_unknown/titles:ti.CanonArchangel	Canon for the Archangel.
ltx/en_us_unknown/titles:ti.CanonBlindman	Canon for the Blindman.
ltx/en_us_unknown/titles:ti.CanonBodiless	Canon for the Bodiless Hosts.
ltx/en_us_unknown/titles:ti.CanonCompline	Canon of Compline.
ltx/en_us_unknown/titles:ti.CanonCompunction	Canon of Compunction.
ltx/en_us_unknown/titles:ti.CanonConsecration	Canon of the Consecration.
ltx/en_us_unknown/titles:ti.CanonCross	Canon for the Cross.
ltx/en_us_unknown/titles:ti.CanonCrossResurrection	Canon for the Cross and Resurrection.
ltx/en_us_unknown/titles:ti.CanonCrucifixion	Canon for the Cross.
ltx/en_us_unknown/titles:ti.CanonDead	Canon for the Dead.
ltx/en_us_unknown/titles:ti.CanonDeceased	Canon for the Deceased.
ltx/en_us_unknown/titles:ti.CanonDevoutM	Canon for the Devout Man.
ltx/en_us_unknown/titles:ti.CanonDevoutMartyrM	Canon for the Devout Martyr.
ltx/en_us_unknown/titles:ti.CanonDevoutSaints	Canon for the Devout Saints.
ltx/en_us_unknown/titles:ti.CanonDevoutW	Canon for the Devout Woman.
ltx/en_us_unknown/titles:ti.CanonEvangelist	Canon for the Evangelist.
ltx/en_us_unknown/titles:ti.CanonFathers	Canon for the Fathers.
ltx/en_us_unknown/titles:ti.CanonFeast	Canon for the Feast.
ltx/en_us_unknown/titles:ti.CanonForefathers	Canon for the Forefathers.
ltx/en_us_unknown/titles:ti.CanonForefeast	Canon for the Forefeast.
ltx/en_us_unknown/titles:ti.CanonForerunner	Canon for the Forerunner.
ltx/en_us_unknown/titles:ti.CanonGreatMartyrM	Canon for the Great Martyr.
ltx/en_us_unknown/titles:ti.CanonHierarch	Canon for the Hierarch.
ltx/en_us_unknown/titles:ti.CanonHieromartyr	Canon for the Hieromartyr.
ltx/en_us_unknown/titles:ti.CanonHieromartyrs	Canon for the Hieromartyrs.
ltx/en_us_unknown/titles:ti.CanonHolyApostles	Canon for the Holy Apostles.
ltx/en_us_unknown/titles:ti.CanonMartyrM	Canon for the Martyr.
ltx/en_us_unknown/titles:ti.CanonMartyrW	Canon for the Woman Martyr.
ltx/en_us_unknown/titles:ti.CanonMartyrs	Canon for the Martyrs.
ltx/en_us_unknown/titles:ti.CanonMyrrhbearerW	Canon for the Myrrhbearer.
ltx/en_us_unknown/titles:ti.CanonMyrrhbearers	Canon for the Myrrhbearers.
ltx/en_us_unknown/titles:ti.CanonParalytic	Canon for the Paralytic.
ltx/en_us_unknown/titles:ti.CanonPascha	Canon of Pascha.
ltx/en_us_unknown/titles:ti.CanonPentecostarion	Canon from Pentecostarion.
ltx/en_us_unknown/titles:ti.CanonProphet	Canon for the Prophet.
ltx/en_us_unknown/titles:ti.CanonProphetsMartyrs	Canon for Prophets and Martyrs.
ltx/en_us_unknown/titles:ti.CanonProtomartyrM	Canon for the Protomartyr.
ltx/en_us_unknown/titles:ti.CanonResurrection	Canon for the Resurrection.
ltx/en_us_unknown/titles:ti.CanonSaintM	Canon for the Saint.
ltx/en_us_unknown/titles:ti.CanonSaintW	Canon for the Holy Woman.
ltx/en_us_unknown/titles:ti.CanonSaints	Canon for the Saints.
ltx/en_us_unknown/titles:ti.CanonSamaritanWoman	Canon for the Samaritan Woman.
ltx/en_us_unknown/titles:ti.CanonStNicholas	Canon for St. Nicholas.
ltx/en_us_unknown/titles:ti.CanonTheotokos	Canon for the Theotokos.
ltx/en_us_unknown/titles:ti.CanonTrinity	Canon for the Trinity.
ltx/en_us_unknown/titles:ti.CanonTriodion	Canon from the Triodion.
ltx/en_us_unknown/titles:ti.Commanders	For the Commanders.
ltx/en_us_unknown/titles:ti.CommunionHymn	Communion Hymn.
ltx/en_us_unknown/titles:ti.Consecration	For the Consecration.
ltx/en_us_unknown/titles:ti.ConsecrationOfAChurch	Consecration of a Church
ltx/en_us_unknown/titles:ti.Couplet	Couplet.
ltx/en_us_unknown/titles:ti.Cross	For the Cross.
ltx/en_us_unknown/titles:ti.Deceased	For the Deceased.
ltx/en_us_unknown/titles:ti.DevoutMartyrM	For the Devout Martyr.
ltx/en_us_unknown/titles:ti.DevoutMartyrW	For the Devout Martyr.
ltx/en_us_unknown/titles:ti.DevoutSaintM	For the Devout Man.
ltx/en_us_unknown/titles:ti.DevoutSaints	For the Devout Saints.
ltx/en_us_unknown/titles:ti.DevoutW	For the Devout Woman.
ltx/en_us_unknown/titles:ti.Dismissal.uc	DISMISSAL
ltx/en_us_unknown/titles:ti.DogmaticTheotokion	Dogmatic Theotokion.
ltx/en_us_unknown/titles:ti.Doxasticon	Doxasticon.
ltx/en_us_unknown/titles:ti.Earthquake	For the Earthquake.
ltx/en_us_unknown/titles:ti.Entrance.uc	THE ENTRANCE
ltx/en_us_unknown/titles:ti.EntranceHymn	Entrance Hymn.
ltx/en_us_unknown/titles:ti.Eothinon	Eothinon
ltx/en_us_unknown/titles:ti.EothinonDoxasticon	The Eothinon Doxasticon.
ltx/en_us_unknown/titles:ti.EothinonGospel	Eothinon Gospel
ltx/en_us_unknown/titles:ti.EothinonOfSunday	The Eothinon of the Sunday.
ltx/en_us_unknown/titles:ti.Epistle	The Epistle
ltx/en_us_unknown/titles:ti.EqualsOfApostles	For the Equals-to-the-Apostles.
ltx/en_us_unknown/titles:ti.Evangelist	For the Evangelist.
ltx/en_us_unknown/titles:ti.Evening	Evening
ltx/en_us_unknown/titles:ti.Evening.uc	EVENING
ltx/en_us_unknown/titles:ti.Evlogetaria	Evlogetaria.
ltx/en_us_unknown/titles:ti.Exaposteilaria	Exaposteilaria.
ltx/en_us_unknown/titles:ti.Exaposteilarion	Exaposteilarion.
ltx/en_us_unknown/titles:ti.ExaposteilarionOfDay	Exaposteilarion of the Day.
ltx/en_us_unknown/titles:ti.Fathers	For the Fathers.
ltx/en_us_unknown/titles:ti.Feast	For the Feast.
ltx/en_us_unknown/titles:ti.FifthSunday	Fifth Sunday
ltx/en_us_unknown/titles:ti.FifthSunday.uc	FIFTH SUNDAY
ltx/en_us_unknown/titles:ti.FirstSunday	First Sunday
ltx/en_us_unknown/titles:ti.FirstSunday.uc	FIRST SUNDAY
ltx/en_us_unknown/titles:ti.FirstTheotokion	The First Theotokion.
ltx/en_us_unknown/titles:ti.FirstTheotokionOfMode	The First Theotokion of the Mode.
ltx/en_us_unknown/titles:ti.ForApostle	For the Apostles.
ltx/en_us_unknown/titles:ti.ForApostles	For the Apostles.
ltx/en_us_unknown/titles:ti.ForCompunction_1hymn	For compunction.
ltx/en_us_unknown/titles:ti.ForCompunction_hymns	For compunction.
ltx/en_us_unknown/titles:ti.ForCross_1hymn	For the Cross.
ltx/en_us_unknown/titles:ti.ForCross_hymns	For the Cross.
ltx/en_us_unknown/titles:ti.ForDead_1hymn	For the Dead.
ltx/en_us_unknown/titles:ti.ForDead_hymns	For the Dead.
ltx/en_us_unknown/titles:ti.ForFriday	For Friday
ltx/en_us_unknown/titles:ti.ForMartyrs_1hymn	For the Martyrs.
ltx/en_us_unknown/titles:ti.ForMartyrs_hymns	For the Martyrs.
ltx/en_us_unknown/titles:ti.ForMonday	For Monday
ltx/en_us_unknown/titles:ti.ForSaturday	For Saturday
ltx/en_us_unknown/titles:ti.ForSunday	For Sunday
ltx/en_us_unknown/titles:ti.ForTheDay	For the Day
ltx/en_us_unknown/titles:ti.ForThursday	For Thursday
ltx/en_us_unknown/titles:ti.ForTuesday	For Tuesday
ltx/en_us_unknown/titles:ti.ForWednesday	For Wednesday
ltx/en_us_unknown/titles:ti.ForWeekday	For a Weekday
ltx/en_us_unknown/titles:ti.Forefathers	For the Forefathers.
ltx/en_us_unknown/titles:ti.Forefestal_1hymn	For the Forefeast.
ltx/en_us_unknown/titles:ti.Forefestal_Epistle	For the Forefeast.
ltx/en_us_unknown/titles:ti.Forefestal_Gospel	For the Forefeast.
ltx/en_us_unknown/titles:ti.Forefestal_hymns	For the Forefeast.
ltx/en_us_unknown/titles:ti.Forerunner	For the Forerunner.
ltx/en_us_unknown/titles:ti.FourthSunday	Fourth Sunday
ltx/en_us_unknown/titles:ti.FourthSunday.uc	FOURTH SUNDAY
ltx/en_us_unknown/titles:ti.FromMenaion	From the Menaion.
ltx/en_us_unknown/titles:ti.FromSmallVespers	From Small Vespers.
ltx/en_us_unknown/titles:ti.FromVespers	From Vespers.
ltx/en_us_unknown/titles:ti.Glory	
ltx/en_us_unknown/titles:ti.GloryBothNow	
ltx/en_us_unknown/titles:ti.Gospel	The Gospel
ltx/en_us_unknown/titles:ti.GreatDoxologyAndDismissal	Great Doxology and Dismissal.
ltx/en_us_unknown/titles:ti.GreatMartyr	For the Great Martyr.
ltx/en_us_unknown/titles:ti.GreatVespers.uc	GREAT VESPERS
ltx/en_us_unknown/titles:ti.Heirmos	Heirmos.
ltx/en_us_unknown/titles:ti.HeirmosAsKatavasia	The Heirmos as Katavasia.
ltx/en_us_unknown/titles:ti.HeirmosUsingMelody	The Heirmos, using Melody:
ltx/en_us_unknown/titles:ti.Hierarch	For the Hierarch.
ltx/en_us_unknown/titles:ti.Hierarchs	For the Hierarchs.
ltx/en_us_unknown/titles:ti.Hieromartyr	For the Hieromartyr.
ltx/en_us_unknown/titles:ti.Hieromartyrs	For the Hieromartyrs.
ltx/en_us_unknown/titles:ti.HolyGospel	The Holy Gospel
ltx/en_us_unknown/titles:ti.HolyNapkin	For the Holy Napkin.
ltx/en_us_unknown/titles:ti.HolyWomen	For the holy Women.
ltx/en_us_unknown/titles:ti.HymnToTheotokos	Hymn to the Theotokos.
ltx/en_us_unknown/titles:ti.HymnsAfterSmallEntrance	Hymns After the Small Entrance.
ltx/en_us_unknown/titles:ti.Hypakoe	Hypakoe.
ltx/en_us_unknown/titles:ti.Iambic	Iambic.
ltx/en_us_unknown/titles:ti.IambicCanon	Iambic Canon.
ltx/en_us_unknown/titles:ti.Idiomela	Idiomela.
ltx/en_us_unknown/titles:ti.IdiomelaMenaion	Idiomela from the Menaion.
ltx/en_us_unknown/titles:ti.IdiomelaOfAposticha	Idiomela of the Aposticha.
ltx/en_us_unknown/titles:ti.IdiomelaOfFeast	Idiomela of the Feast.
ltx/en_us_unknown/titles:ti.IdiomelaOfLity	Idiomela of the Lity.
ltx/en_us_unknown/titles:ti.IdiomelaPentecostarion	Idiomela from the Pentecostarion.
ltx/en_us_unknown/titles:ti.IdiomelaTriodion	Idiomela from the Triodion.
ltx/en_us_unknown/titles:ti.Idiomelon1	Idiomelon 1.
ltx/en_us_unknown/titles:ti.Idiomelon10	Idiomelon 10.
ltx/en_us_unknown/titles:ti.Idiomelon2	Idiomelon 2.
ltx/en_us_unknown/titles:ti.Idiomelon3	
ltx/en_us_unknown/titles:ti.Idiomelon4	Idiomelon 4.
ltx/en_us_unknown/titles:ti.Idiomelon5	Idiomelon 5.
ltx/en_us_unknown/titles:ti.Idiomelon6	Idiomelon 6.
ltx/en_us_unknown/titles:ti.Idiomelon7	Idiomelon 7.
ltx/en_us_unknown/titles:ti.Idiomelon8	Idiomelon 8.
ltx/en_us_unknown/titles:ti.Idiomelon9	Idiomelon 9.
ltx/en_us_unknown/titles:ti.Indiction	For the Indiction.
ltx/en_us_unknown/titles:ti.InsteadOfWeHaveSeen	Instead of “We have seen”:
ltx/en_us_unknown/titles:ti.IntermediateVersesOde1	Intermediate Verses of Ode One.
ltx/en_us_unknown/titles:ti.IntermediateVersesOde3	Intermediate Verses of Ode Three.
ltx/en_us_unknown/titles:ti.IntermediateVersesOde4	Intermediate Verses of Ode Four.
ltx/en_us_unknown/titles:ti.IntermediateVersesOde5	Intermediate Verses of Ode Five.
ltx/en_us_unknown/titles:ti.IntermediateVersesOde6	Intermediate Verses of Ode Six.
ltx/en_us_unknown/titles:ti.IntermediateVersesOde7	Intermediate Verses of Ode Seven.
ltx/en_us_unknown/titles:ti.IntermediateVersesOde8	Intermediate Verses of Ode Eight.
ltx/en_us_unknown/titles:ti.Joseph	For Joseph.
ltx/en_us_unknown/titles:ti.JosephTheBetrothed	For Joseph the Betrothed.
ltx/en_us_unknown/titles:ti.Katavasia	Katavasia.
ltx/en_us_unknown/titles:ti.Katavasias	Katavasias
ltx/en_us_unknown/titles:ti.Kathisma	Kathisma.
ltx/en_us_unknown/titles:ti.Kathisma1	Kathisma I.
ltx/en_us_unknown/titles:ti.Kathisma2	Kathisma II.
ltx/en_us_unknown/titles:ti.Kathisma3	Kathisma III.
ltx/en_us_unknown/titles:ti.KathismaMartyrs	Kathisma for the Martyrs.
ltx/en_us_unknown/titles:ti.Kathismata	Kathismata.
ltx/en_us_unknown/titles:ti.KathismataMartyrs	Kathismata for the Martyrs.
ltx/en_us_unknown/titles:ti.KathismataResurrectional	Resurrectional Kathismata.
ltx/en_us_unknown/titles:ti.Kontakia	Kontakia.
ltx/en_us_unknown/titles:ti.Kontakion	Kontakion.
ltx/en_us_unknown/titles:ti.KontakionDay	Kontakion for the Day.
ltx/en_us_unknown/titles:ti.KontakionFathers	Kontakion for the Fathers.
ltx/en_us_unknown/titles:ti.KontakionFeast	Kontakion of the Feast.
ltx/en_us_unknown/titles:ti.KontakionForefeast	Kontakion of the Forefest.
ltx/en_us_unknown/titles:ti.KontakionPascha	Kontakion of Pascha.
ltx/en_us_unknown/titles:ti.KontakionResurrectional	Resurrectional Kontakion.
ltx/en_us_unknown/titles:ti.KontakionTheotokos	Kontakion for the Theotokos.
ltx/en_us_unknown/titles:ti.KontakionTriodion	Kontakion from Triodion.
ltx/en_us_unknown/titles:ti.Lauds	Lauds.
ltx/en_us_unknown/titles:ti.Lazarus	For Lazarus.
ltx/en_us_unknown/titles:ti.LeavetakingOfFeast	Leave-taking of the Feast.
ltx/en_us_unknown/titles:ti.Litanies.uc	THE LITANIES
ltx/en_us_unknown/titles:ti.LitanyComp.uc	
ltx/en_us_unknown/titles:ti.LitanyFerv.uc	
ltx/en_us_unknown/titles:ti.LitanyGreat.uc	
ltx/en_us_unknown/titles:ti.Liturgy.uc	LITURGY
ltx/en_us_unknown/titles:ti.Lity	Procession and Litany.
ltx/en_us_unknown/titles:ti.LityAndLoaves	Litany and Blessing of Loaves.
ltx/en_us_unknown/titles:ti.LocalChurch	For the church.
ltx/en_us_unknown/titles:ti.LordsPrayer.uc	THE LORD’s PRAYER
ltx/en_us_unknown/titles:ti.Magnificat	The Magnificat.
ltx/en_us_unknown/titles:ti.Martyr	For the Martyr.
ltx/en_us_unknown/titles:ti.MartyrW	For the Martyr.
ltx/en_us_unknown/titles:ti.MartyricOfMode	Martyric of the Mode.
ltx/en_us_unknown/titles:ti.Martyrs	For the Martyrs.
ltx/en_us_unknown/titles:ti.Matins.uc	MATINS
ltx/en_us_unknown/titles:ti.Megalynaria	Megalynaria.
ltx/en_us_unknown/titles:ti.Megalynarion	Megalynarion.
ltx/en_us_unknown/titles:ti.Menaion	From the Menaion.
ltx/en_us_unknown/titles:ti.MidnightOffice.uc	MIDNIGHT OFFICE
ltx/en_us_unknown/titles:ti.Midpentecost	For Mid-Pentecost.
ltx/en_us_unknown/titles:ti.Mode	Mode
ltx/en_us_unknown/titles:ti.ModeOfWeek	Mode of the Week.
ltx/en_us_unknown/titles:ti.Morning	Morning
ltx/en_us_unknown/titles:ti.Morning.uc	MORNING
ltx/en_us_unknown/titles:ti.MyrrhbearerW	For the Myrrhbearer.
ltx/en_us_unknown/titles:ti.Myrrhbearers	For the Myrrhbearers.
ltx/en_us_unknown/titles:ti.Neomartyr	For the Neomartyr.
ltx/en_us_unknown/titles:ti.Octoechos	From the Octoechos.
ltx/en_us_unknown/titles:ti.Oikos	Oikos.
ltx/en_us_unknown/titles:ti.OnFriday	On Friday
ltx/en_us_unknown/titles:ti.OnFriday.uc	ON FRIDAY
ltx/en_us_unknown/titles:ti.OnMonday	On Monday
ltx/en_us_unknown/titles:ti.OnMonday.uc	ON MONDAY
ltx/en_us_unknown/titles:ti.OnSaturday	On Saturday
ltx/en_us_unknown/titles:ti.OnSaturday.uc	ON SATURDAY
ltx/en_us_unknown/titles:ti.OnSunday	On Sunday
ltx/en_us_unknown/titles:ti.OnSunday.uc	ON SUNDAY
ltx/en_us_unknown/titles:ti.OnThursday	On Thursday
ltx/en_us_unknown/titles:ti.OnThursday.uc	ON THURSDAY
ltx/en_us_unknown/titles:ti.OnTuesday	On Tuesday
ltx/en_us_unknown/titles:ti.OnTuesday.uc	ON TUESDAY
ltx/en_us_unknown/titles:ti.OnWednesday	On Wednesday
ltx/en_us_unknown/titles:ti.OnWednesday.uc	ON WEDNESDAY
ltx/en_us_unknown/titles:ti.OrModeOfWeek	(or the Mode of the week)
ltx/en_us_unknown/titles:ti.OrStavrotheotokion	Or Stavrotheotokion.
ltx/en_us_unknown/titles:ti.Paralytic	For the Paralytic.
ltx/en_us_unknown/titles:ti.Pascha	Of Pascha.
ltx/en_us_unknown/titles:ti.Pentecostarion	From the Pentecostarion.
ltx/en_us_unknown/titles:ti.PhotagogicHymns	Photagogic Hymns
ltx/en_us_unknown/titles:ti.Polyeleos	The Polyeleos.
ltx/en_us_unknown/titles:ti.PostFestal_Epistle	Post-festal.
ltx/en_us_unknown/titles:ti.PostFestal_Gospel	Post-festal.
ltx/en_us_unknown/titles:ti.PrayerBlessingLoaves	Blessing of the Loaves.
ltx/en_us_unknown/titles:ti.PrayerOfStEphraim	Prayer of St. Ephrem
ltx/en_us_unknown/titles:ti.PremierApostles	For Sts. Peter and Paul.
ltx/en_us_unknown/titles:ti.Prokeimenon	Prokeimenon.
ltx/en_us_unknown/titles:ti.ProkeimenonEpistle	Prokeimenon of the Epistle.
ltx/en_us_unknown/titles:ti.Prophet	For the Prophet.
ltx/en_us_unknown/titles:ti.Prosomia	Prosomia.
ltx/en_us_unknown/titles:ti.ProtomartyrM	For the Protomartyr.
ltx/en_us_unknown/titles:ti.PsalmOfDavid	
ltx/en_us_unknown/titles:ti.Readings	The Readings
ltx/en_us_unknown/titles:ti.ReadingsCommemoration	The Readings for the Commemoration
ltx/en_us_unknown/titles:ti.ReadingsLiturgy	The Readings from the Liturgy
ltx/en_us_unknown/titles:ti.ReadingsRegularCycle	The Readings from the Regular Cycle
ltx/en_us_unknown/titles:ti.ReadingsVespers	The Readings from Vespers
ltx/en_us_unknown/titles:ti.ReadingsVespersPreviousEvening	The Readings from Vespers the Previous Evening
ltx/en_us_unknown/titles:ti.RegularCycle	From the Regular Cycle.
ltx/en_us_unknown/titles:ti.Repeat	Repeat.
ltx/en_us_unknown/titles:ti.RepeatHymn	Repeat the same hymn.
ltx/en_us_unknown/titles:ti.Resurrectional_1hymn	Resurrectional.
ltx/en_us_unknown/titles:ti.Resurrectional_hymns	Resurrectional.
ltx/en_us_unknown/titles:ti.Righteous	For the Righteous.
ltx/en_us_unknown/titles:ti.RighteousM	For the Righteous Man.
ltx/en_us_unknown/titles:ti.SaintM	For the Saint.
ltx/en_us_unknown/titles:ti.SaintW	For the Holy Woman.
ltx/en_us_unknown/titles:ti.Saints	For the Saints.
ltx/en_us_unknown/titles:ti.Salutations	The Salutations.
ltx/en_us_unknown/titles:ti.SamaritanWoman	For the Samaritan Woman.
ltx/en_us_unknown/titles:ti.SameHeirmos	Same Heirmos.
ltx/en_us_unknown/titles:ti.SameMelody_1hymn	Same Melody.
ltx/en_us_unknown/titles:ti.SameMelody_hymns	Same Melody.
ltx/en_us_unknown/titles:ti.SameMode	Same Mode.
ltx/en_us_unknown/titles:ti.SecondSunday	Second Sunday
ltx/en_us_unknown/titles:ti.SecondSunday.uc	SECOND SUNDAY
ltx/en_us_unknown/titles:ti.SkippedEpistle	Previously skipped.
ltx/en_us_unknown/titles:ti.SkippedEpistleP	(Previously skipped.)
ltx/en_us_unknown/titles:ti.SkippedGospel	Previously skipped.
ltx/en_us_unknown/titles:ti.SkippedGospelP	(Previously skipped.)
ltx/en_us_unknown/titles:ti.SmallEntrance.uc	THE SMALL ENTRANCE
ltx/en_us_unknown/titles:ti.SmallVespers.uc	SMALL VESPERS
ltx/en_us_unknown/titles:ti.StNicholas	For St. Nicholas.
ltx/en_us_unknown/titles:ti.Stanza1	First Stanza.
ltx/en_us_unknown/titles:ti.Stanza2	Second Stanza.
ltx/en_us_unknown/titles:ti.Stanza3	Third Stanza.
ltx/en_us_unknown/titles:ti.Stanza4	Fourth Stanza.
ltx/en_us_unknown/titles:ti.Stavrotheotokion	Stavrotheotokion.
ltx/en_us_unknown/titles:ti.Stichera	Stichera.
ltx/en_us_unknown/titles:ti.SticheraApostles	Stichera for the Apostles.
ltx/en_us_unknown/titles:ti.SticheraConsecration	Stichera for the Consecration.
ltx/en_us_unknown/titles:ti.SticheraCross	Stichera for the Cross.
ltx/en_us_unknown/titles:ti.SticheraCrucifixion	Stichera for the Cross.
ltx/en_us_unknown/titles:ti.SticheraDeceased	Stichera for the Deceased.
ltx/en_us_unknown/titles:ti.SticheraFathers	Stichera for the Fathers.
ltx/en_us_unknown/titles:ti.SticheraFeast	Stichera for the Feast.
ltx/en_us_unknown/titles:ti.SticheraForerunner	Stichera for the Forerunner.
ltx/en_us_unknown/titles:ti.SticheraIdiomela	Stichera Idiomela.
ltx/en_us_unknown/titles:ti.SticheraIdiomelaFeast	Stichera Idiomela for the Feast.
ltx/en_us_unknown/titles:ti.SticheraLauds	Stichera of Lauds.
ltx/en_us_unknown/titles:ti.SticheraMartyrs	Stichera for the Martyrs.
ltx/en_us_unknown/titles:ti.SticheraMaster	Stichera for the Master.
ltx/en_us_unknown/titles:ti.SticheraMenaion	Stichera from the Menaion.
ltx/en_us_unknown/titles:ti.SticheraPascha	Stichera of Pascha.
ltx/en_us_unknown/titles:ti.SticheraPentecostarion	Stichera from the Pentecostarion.
ltx/en_us_unknown/titles:ti.SticheraProsomia	Stichera Prosomia.
ltx/en_us_unknown/titles:ti.SticheraProsomiaDevoutM	Stichera Prosomia for the Devout Man.
ltx/en_us_unknown/titles:ti.SticheraProsomiaSaintM	Stichera Prosomia for the Saint.
ltx/en_us_unknown/titles:ti.SticheraResurrectional	Resurrectional Stichera.
ltx/en_us_unknown/titles:ti.SticheraResurrectionalOctoechos	Resurrectional Stichera from the Octoechos.
ltx/en_us_unknown/titles:ti.SticheraStNicholas	Stichera for St. Nicholas.
ltx/en_us_unknown/titles:ti.SticheraTheotokos	Stichera for the Theotokos.
ltx/en_us_unknown/titles:ti.SticheraTriodion	Stichera from the Triodion.
ltx/en_us_unknown/titles:ti.Sticheron	Sticheron.
ltx/en_us_unknown/titles:ti.Sticheron1	Sticheron 1.
ltx/en_us_unknown/titles:ti.Sticheron10	Sticheron 10.
ltx/en_us_unknown/titles:ti.Sticheron2	Sticheron 2.
ltx/en_us_unknown/titles:ti.Sticheron3	Sticheron 3.
ltx/en_us_unknown/titles:ti.Sticheron4	Sticheron 4.
ltx/en_us_unknown/titles:ti.Sticheron5	Sticheron 5.
ltx/en_us_unknown/titles:ti.Sticheron6	Sticheron 6.
ltx/en_us_unknown/titles:ti.Sticheron7	Sticheron 7.
ltx/en_us_unknown/titles:ti.Sticheron8	Sticheron 8.
ltx/en_us_unknown/titles:ti.Sticheron9	Sticheron 9.
ltx/en_us_unknown/titles:ti.SticheronIdiomelon	Sticheron Idiomelon.
ltx/en_us_unknown/titles:ti.Stichologia	Stichologia.
ltx/en_us_unknown/titles:ti.SungInThisOde	Sung in this Ode.
ltx/en_us_unknown/titles:ti.Synaxarion	Synaxarion
ltx/en_us_unknown/titles:ti.TheCanon	The Canon
ltx/en_us_unknown/titles:ti.TheCanonFeast	The Canon for the Feast.
ltx/en_us_unknown/titles:ti.TheCanonGeneralMenaion	The Canon from the General Menaion.
ltx/en_us_unknown/titles:ti.TheCanonMenaion	The Canon from the Menaion.
ltx/en_us_unknown/titles:ti.TheCreed	The Creed
ltx/en_us_unknown/titles:ti.TheProphecy.uc	THE PROPHECY
ltx/en_us_unknown/titles:ti.TheResurrectional_1hymn	Resurrectional.
ltx/en_us_unknown/titles:ti.TheResurrectional_hymns	Resurrectional.
ltx/en_us_unknown/titles:ti.TheSameMode	The same Mode.
ltx/en_us_unknown/titles:ti.TheTwelve	For the Twelve Apostles.
ltx/en_us_unknown/titles:ti.Theotokia	Theotokia.
ltx/en_us_unknown/titles:ti.Theotokion	Theotokion.
ltx/en_us_unknown/titles:ti.Theotokos	For the Theotokos.
ltx/en_us_unknown/titles:ti.ThirdSunday	Third Sunday
ltx/en_us_unknown/titles:ti.ThirdSunday.uc	THIRD SUNDAY
ltx/en_us_unknown/titles:ti.Triadic	For the Trinity.
ltx/en_us_unknown/titles:ti.TriadicHymns	Triadic Hymns
ltx/en_us_unknown/titles:ti.Triodion	From the Triodion.
ltx/en_us_unknown/titles:ti.Trisagion	Trisagion Prayers.
ltx/en_us_unknown/titles:ti.TrisagiosHymn.uc	TRISAGIOS HYMN
ltx/en_us_unknown/titles:ti.Troparia	Troparia.
ltx/en_us_unknown/titles:ti.TropariaCompunction	Troparia of Compunction.
ltx/en_us_unknown/titles:ti.Troparion	Troparion.
ltx/en_us_unknown/titles:ti.TroparionOfProphecy	Troparion before the Prophecy.
ltx/en_us_unknown/titles:ti.TypikaAndBeatitudes	The Typika and Beatitudes.
ltx/en_us_unknown/titles:ti.Verses	Verses
ltx/en_us_unknown/titles:ti.VirginMartyrW	For the Virgin Martyr.
ltx/en_us_unknown/titles:ti.WithAcrostic	with the Acrostic:
ltx/en_us_unknown/titles:ti.beforeMeatFareSunday	before Meat-fare
ltx/en_us_unknown/titles:ti.dayFriday	Friday
ltx/en_us_unknown/titles:ti.dayFriday.uc	FRIDAY
ltx/en_us_unknown/titles:ti.dayMonday	Monday
ltx/en_us_unknown/titles:ti.dayMonday.uc	MONDAY
ltx/en_us_unknown/titles:ti.daySaturday	Saturday
ltx/en_us_unknown/titles:ti.daySaturday.uc	SATURDAY
ltx/en_us_unknown/titles:ti.daySunday	Sunday
ltx/en_us_unknown/titles:ti.daySunday.uc	SUNDAY
ltx/en_us_unknown/titles:ti.dayThursday	Thursday
ltx/en_us_unknown/titles:ti.dayThursday.uc	THURSDAY
ltx/en_us_unknown/titles:ti.dayTuesday	Tuesday
ltx/en_us_unknown/titles:ti.dayTuesday.uc	TUESDAY
ltx/en_us_unknown/titles:ti.dayWednesday	Wednesday
ltx/en_us_unknown/titles:ti.dayWednesday.uc	WEDNESDAY
ltx/en_us_unknown/titles:ti.eclog.Angels.title	for the Bodiless Hosts
ltx/en_us_unknown/titles:ti.eclog.Annunciation.title	for the Annunciation of the Theotokos
ltx/en_us_unknown/titles:ti.eclog.Apostles.title	for Apostles
ltx/en_us_unknown/titles:ti.eclog.Ascension.title	for Ascension
ltx/en_us_unknown/titles:ti.eclog.Christmas.title	for Christmas
ltx/en_us_unknown/titles:ti.eclog.Cross.title	for the Elevation of the Precious and Life-giving Cross
ltx/en_us_unknown/titles:ti.eclog.Dormition.title	for the Dormition of the Theotokos
ltx/en_us_unknown/titles:ti.eclog.Entry.title	for the Entry of the Theotokos
ltx/en_us_unknown/titles:ti.eclog.Epiphany.title	for Epiphany
ltx/en_us_unknown/titles:ti.eclog.Forerunner.title	for the Feast of the Holy Forerunner
ltx/en_us_unknown/titles:ti.eclog.Hierarchs.title	for Hierarchs
ltx/en_us_unknown/titles:ti.eclog.Martyrs.title	for Martyrs
ltx/en_us_unknown/titles:ti.eclog.Meatfare.title	on Meatfare and Cheesefare Sundays
ltx/en_us_unknown/titles:ti.eclog.Meeting.title	for the Meeting of the Lord
ltx/en_us_unknown/titles:ti.eclog.Monastics.title	for Monastic Saints
ltx/en_us_unknown/titles:ti.eclog.Palm.title	for Palm Sunday
ltx/en_us_unknown/titles:ti.eclog.Pentecost.title	for Pentecost
ltx/en_us_unknown/titles:ti.eclog.ProphetElias.title	for the Feast of the Prophet Elias
ltx/en_us_unknown/titles:ti.eclog.StAnne.title	for St. Anna the Grandmother of God
ltx/en_us_unknown/titles:ti.eclog.Theotokos.title	for the Feast of the Theotokos
ltx/en_us_unknown/titles:ti.eclog.TheotokosBirth.title	for the Birth of our Lady Theotokos
ltx/en_us_unknown/titles:ti.eclog.Thomas.title	for the Sunday of Thomas
ltx/en_us_unknown/titles:ti.eclog.Transfiguration.title	for Transfiguration
ltx/en_us_unknown/titles:ti.eclog.rubric1	
ltx/en_us_unknown/titles:ti.eclog.title1	Selected Psalm Verses
ltx/en_us_unknown/titles:ti.eclog.title2	
ltx/en_us_unknown/titles:ti.eclog.title3	
ltx/en_us_unknown/titles:ti.forAnnunciation	For Annunciation.
ltx/en_us_unknown/titles:ti.forChristmas	For Christmas.
ltx/en_us_unknown/titles:ti.forCross	For the Cross.
ltx/en_us_unknown/titles:ti.forDormition	For Dormition.
ltx/en_us_unknown/titles:ti.forEntry	For Entry of Theotokos.
ltx/en_us_unknown/titles:ti.forMeeting	For the Meeting.
ltx/en_us_unknown/titles:ti.forTheotokosBirth	For Birth of Theotokos.
ltx/en_us_unknown/titles:ti.forTransfiguration	For Transfiguration.
ltx/en_us_unknown/titles:ti.intheEvening	in the Evening
ltx/en_us_unknown/titles:ti.ofAscension	of Ascension
ltx/en_us_unknown/titles:ti.ofBrightWeek	of Bright Week
ltx/en_us_unknown/titles:ti.ofCheeseWeek	of Cheese Week
ltx/en_us_unknown/titles:ti.ofCheeseWeek.uc	OF CHEESE WEEK
ltx/en_us_unknown/titles:ti.ofHolyWeek	of Holy Week
ltx/en_us_unknown/titles:ti.ofLent	of Lent
ltx/en_us_unknown/titles:ti.ofLent.uc	OF LENT
ltx/en_us_unknown/titles:ti.ofPentecost	of Pentecost
ltx/en_us_unknown/titles:ti.ofWeek1	of the First Week
ltx/en_us_unknown/titles:ti.ofWeek1.uc	OF THE FIRST WEEK
ltx/en_us_unknown/titles:ti.ofWeek2	of the Second Week
ltx/en_us_unknown/titles:ti.ofWeek2.uc	OF THE SECOND WEEK
ltx/en_us_unknown/titles:ti.ofWeek3	of the Third Week
ltx/en_us_unknown/titles:ti.ofWeek3.uc	OF THE THIRD WEEK
ltx/en_us_unknown/titles:ti.ofWeek4	of the Fourth Week
ltx/en_us_unknown/titles:ti.ofWeek4.uc	OF THE FOURTH WEEK
ltx/en_us_unknown/titles:ti.ofWeek5	of the Fifth Week
ltx/en_us_unknown/titles:ti.ofWeek5.uc	OF THE FIFTH WEEK
ltx/en_us_unknown/titles:ti.ofWeek6_pe	of the Sixth Week
ltx/en_us_unknown/titles:ti.ofWeek6_pe.uc	OF THE SIXTH WEEK
ltx/en_us_unknown/titles:ti.ofWeek6_tr	Before Palm Sunday
ltx/en_us_unknown/titles:ti.ofWeek6_tr.uc	BEFORE PALM SUNDAY
ltx/en_us_unknown/titles:ti.ofWeek7	of the Seventh Week
ltx/en_us_unknown/titles:ti.ofWeek7.uc	OF THE SEVENTH WEEK
ltx/en_us_unknown/titles:ti.ofWeek8_pe	After Pentecost
ltx/en_us_unknown/titles:ti.ofWeek8_pe.uc	AFTER PENTECOST
ltx/en_us_unknown/titles:ti.sourceEuchologion	From Euchologion - - -
ltx/en_us_unknown/titles:ti.sourceHorologion	From Horologion - - -
ltx/en_us_unknown/titles:ti.sourceMeSupplement	Menaion Supplement - - -
ltx/en_us_unknown/titles:ti.sourceMenaion	From Menaion - - -
ltx/en_us_unknown/titles:ti.sourceOctoechos	From Octoechos - - -
ltx/en_us_unknown/titles:ti.sourcePeSupplement	Pentecostarion Supplement - - -
ltx/en_us_unknown/titles:ti.sourcePentecostarion	From Pentecostarion - - -
ltx/en_us_unknown/titles:ti.sourceTriodion	From Triodion - - -
