ltx/en_us_unknown/he.a.m2:heAU.EfsplagchniasYparchousa.greekname	
ltx/en_us_unknown/he.a.m2:heAU.EfsplagchniasYparchousa.incipit	Since you are the source…
ltx/en_us_unknown/he.a.m2:heAU.EfsplagchniasYparchousa.melody	@ltx/en_us_unknown/miscellanea:misc.Automelon
ltx/en_us_unknown/he.a.m2:heAU.EfsplagchniasYparchousa.mode	@ltx/en_us_unknown/miscellanea:misc.Mode2
ltx/en_us_unknown/he.a.m2:heAU.EfsplagchniasYparchousa.name	Since you are the source.
ltx/en_us_unknown/he.a.m2:heAU.EfsplagchniasYparchousa.notmetered	N/M (Since you are the source.)
ltx/en_us_unknown/he.a.m2:heAU.EfsplagchniasYparchousa.text	
ltx/en_us_unknown/he.a.m2:heAU.GynaikesAkoutisthite.greekname	
ltx/en_us_unknown/he.a.m2:heAU.GynaikesAkoutisthite.incipit	O Women, hearken…
ltx/en_us_unknown/he.a.m2:heAU.GynaikesAkoutisthite.melody	@ltx/en_us_unknown/miscellanea:misc.Automelon
ltx/en_us_unknown/he.a.m2:heAU.GynaikesAkoutisthite.mode	@ltx/en_us_unknown/miscellanea:misc.Mode2
ltx/en_us_unknown/he.a.m2:heAU.GynaikesAkoutisthite.name	O Women, hearken.
ltx/en_us_unknown/he.a.m2:heAU.GynaikesAkoutisthite.notmetered	N/M (O Women, hearken.)
ltx/en_us_unknown/he.a.m2:heAU.GynaikesAkoutisthite.text	
ltx/en_us_unknown/he.a.m2:heAU.OikosTouEfratha.greekname	
ltx/en_us_unknown/he.a.m2:heAU.OikosTouEfratha.incipit	O House of Ephratha…
ltx/en_us_unknown/he.a.m2:heAU.OikosTouEfratha.melody	@ltx/en_us_unknown/miscellanea:misc.Automelon
ltx/en_us_unknown/he.a.m2:heAU.OikosTouEfratha.mode	@ltx/en_us_unknown/miscellanea:misc.Mode2
ltx/en_us_unknown/he.a.m2:heAU.OikosTouEfratha.name	O House of Ephratha.
ltx/en_us_unknown/he.a.m2:heAU.OikosTouEfratha.notmetered	N/M (O House of Ephratha.)
ltx/en_us_unknown/he.a.m2:heAU.OikosTouEfratha.text	
ltx/en_us_unknown/he.a.m2:heAU.OteEkTouXylou.greekname	
ltx/en_us_unknown/he.a.m2:heAU.OteEkTouXylou.incipit	Joseph took You down…
ltx/en_us_unknown/he.a.m2:heAU.OteEkTouXylou.melody	@ltx/en_us_unknown/miscellanea:misc.Automelon
ltx/en_us_unknown/he.a.m2:heAU.OteEkTouXylou.mode	@ltx/en_us_unknown/miscellanea:misc.Mode2
ltx/en_us_unknown/he.a.m2:heAU.OteEkTouXylou.name	Joseph took You down.
ltx/en_us_unknown/he.a.m2:heAU.OteEkTouXylou.notmetered	N/M (Joseph took You.)
ltx/en_us_unknown/he.a.m2:heAU.OteEkTouXylou.text	
ltx/en_us_unknown/he.a.m2:heAU.PoioisEffimionStemmasin.greekname	
ltx/en_us_unknown/he.a.m2:heAU.PoioisEffimionStemmasin.incipit	Are there any worthy crowns…
ltx/en_us_unknown/he.a.m2:heAU.PoioisEffimionStemmasin.melody	@ltx/en_us_unknown/miscellanea:misc.Automelon
ltx/en_us_unknown/he.a.m2:heAU.PoioisEffimionStemmasin.mode	@ltx/en_us_unknown/miscellanea:misc.Mode2
ltx/en_us_unknown/he.a.m2:heAU.PoioisEffimionStemmasin.name	Are there any worthy crowns.
ltx/en_us_unknown/he.a.m2:heAU.PoioisEffimionStemmasin.notmetered	N/M (Are there any worthy crowns.)
ltx/en_us_unknown/he.a.m2:heAU.PoioisEffimionStemmasin.text	
ltx/en_us_unknown/he.a.m2:heAU.SarkiYpnosas.greekname	
ltx/en_us_unknown/he.a.m2:heAU.SarkiYpnosas.incipit	When You had slumbered…
ltx/en_us_unknown/he.a.m2:heAU.SarkiYpnosas.melody	@ltx/en_us_unknown/miscellanea:misc.Automelon
ltx/en_us_unknown/he.a.m2:heAU.SarkiYpnosas.mode	@ltx/en_us_unknown/miscellanea:misc.Mode2
ltx/en_us_unknown/he.a.m2:heAU.SarkiYpnosas.name	When You had slumbered.
ltx/en_us_unknown/he.a.m2:heAU.SarkiYpnosas.notmetered	N/M (When You had slumbered.)
ltx/en_us_unknown/he.a.m2:heAU.SarkiYpnosas.text	
ltx/en_us_unknown/he.a.m2:heAU.StavrosOFylax.greekname	
ltx/en_us_unknown/he.a.m2:heAU.StavrosOFylax.incipit	O Cross, you are the guardian…
ltx/en_us_unknown/he.a.m2:heAU.StavrosOFylax.melody	@ltx/en_us_unknown/miscellanea:misc.Automelon
ltx/en_us_unknown/he.a.m2:heAU.StavrosOFylax.mode	@ltx/en_us_unknown/miscellanea:misc.Mode2
ltx/en_us_unknown/he.a.m2:heAU.StavrosOFylax.name	O Cross, you are the guardian.
ltx/en_us_unknown/he.a.m2:heAU.StavrosOFylax.notmetered	N/M (O Cross, you are the guardian.)
ltx/en_us_unknown/he.a.m2:heAU.StavrosOFylax.text	
ltx/en_us_unknown/he.a.m2:heAU.TaAnoZiton.greekname	
ltx/en_us_unknown/he.a.m2:heAU.TaAnoZiton.incipit	In seeking the heights…
ltx/en_us_unknown/he.a.m2:heAU.TaAnoZiton.melody	@ltx/en_us_unknown/miscellanea:misc.Automelon
ltx/en_us_unknown/he.a.m2:heAU.TaAnoZiton.mode	@ltx/en_us_unknown/miscellanea:misc.Mode2
ltx/en_us_unknown/he.a.m2:heAU.TaAnoZiton.name	In seeking the heights.
ltx/en_us_unknown/he.a.m2:heAU.TaAnoZiton.notmetered	N/M (In seeking the heights.)
ltx/en_us_unknown/he.a.m2:heAU.TaAnoZiton.text	
ltx/en_us_unknown/he.a.m2:heAU.ToisMathitaisSynelthomen.greekname	
ltx/en_us_unknown/he.a.m2:heAU.ToisMathitaisSynelthomen.incipit	On the mountain…
ltx/en_us_unknown/he.a.m2:heAU.ToisMathitaisSynelthomen.melody	@ltx/en_us_unknown/miscellanea:misc.Automelon
ltx/en_us_unknown/he.a.m2:heAU.ToisMathitaisSynelthomen.mode	@ltx/en_us_unknown/miscellanea:misc.Mode2
ltx/en_us_unknown/he.a.m2:heAU.ToisMathitaisSynelthomen.name	Let us in faith.
ltx/en_us_unknown/he.a.m2:heAU.ToisMathitaisSynelthomen.notmetered	N/M (Let us in faith.)
ltx/en_us_unknown/he.a.m2:heAU.ToisMathitaisSynelthomen.text	
ltx/en_us_unknown/he.a.m2:heAU.ToisTonAimatonSou.greekname	
ltx/en_us_unknown/he.a.m2:heAU.ToisTonAimatonSou.incipit	In the pools of your blood…
ltx/en_us_unknown/he.a.m2:heAU.ToisTonAimatonSou.melody	@ltx/en_us_unknown/miscellanea:misc.Automelon
ltx/en_us_unknown/he.a.m2:heAU.ToisTonAimatonSou.mode	@ltx/en_us_unknown/miscellanea:misc.Mode2
ltx/en_us_unknown/he.a.m2:heAU.ToisTonAimatonSou.name	In the pools of your blood.
ltx/en_us_unknown/he.a.m2:heAU.ToisTonAimatonSou.notmetered	N/M (In the pools of your blood.)
ltx/en_us_unknown/he.a.m2:heAU.ToisTonAimatonSou.text	
ltx/en_us_unknown/he.a.m2:heAU.TonMathitonOrontonSe.greekname	
ltx/en_us_unknown/he.a.m2:heAU.TonMathitonOrontonSe.incipit	With the disciples…
ltx/en_us_unknown/he.a.m2:heAU.TonMathitonOrontonSe.melody	@ltx/en_us_unknown/miscellanea:misc.Automelon
ltx/en_us_unknown/he.a.m2:heAU.TonMathitonOrontonSe.mode	@ltx/en_us_unknown/miscellanea:misc.Mode2
ltx/en_us_unknown/he.a.m2:heAU.TonMathitonOrontonSe.name	With the disciples.
ltx/en_us_unknown/he.a.m2:heAU.TonMathitonOrontonSe.notmetered	N/M (With the disciples.)
ltx/en_us_unknown/he.a.m2:heAU.TonMathitonOrontonSe.text	
ltx/en_us_unknown/he.a.m2:heAU.TousAsfaleis.greekname	
ltx/en_us_unknown/he.a.m2:heAU.TousAsfaleis.incipit	You have taken…
ltx/en_us_unknown/he.a.m2:heAU.TousAsfaleis.melody	@ltx/en_us_unknown/miscellanea:misc.Automelon
ltx/en_us_unknown/he.a.m2:heAU.TousAsfaleis.mode	@ltx/en_us_unknown/miscellanea:misc.Mode2
ltx/en_us_unknown/he.a.m2:heAU.TousAsfaleis.name	You have taken.
ltx/en_us_unknown/he.a.m2:heAU.TousAsfaleis.notmetered	N/M (You have taken.)
ltx/en_us_unknown/he.a.m2:heAU.TousAsfaleis.text	
ltx/en_us_unknown/he.a.m2:heAU.title	
