ltx/en_us_saas/le.pr.me.r65:leprVE.reading.book_abbr	@ltx/en_us_saas/bible:Kings1.abbr
ltx/en_us_saas/le.pr.me.r65:leprVE.reading.book_string	@ltx/en_us_saas/bible:Kings1.text
ltx/en_us_saas/le.pr.me.r65:leprVE.reading.chapverse	18:1, 17 – 27, 29b-41a, 41c, 44b, 42b, 45; 19:1a, 2 – 4a, 5 – 10, 15a, 16b
ltx/en_us_saas/le.pr.me.r65:leprVE.reading.incipit	It came to pass many days later, in the…
ltx/en_us_saas/le.pr.me.r65:leprVE.reading.text	It came to pass many days later, in the third year, the word of the Lord came to Elijah, saying, “Go and appear to Ahab, and I will send rain on the earth.” When Ahab saw Elijah, Ahab said to him, “Are you the one who is troubling Israel?” Elijah answered, “I have not troubled Israel, but rather you and the house of your father, in that you forsook the Lord your God and followed after the Baals. Now therefore, send and gather all Israel to me on Mount Carmel, the four hundred and fifty prophets of shame, and the four hundred prophets of the sacred groves who eat at Jezebel’s table.” So Ahab went back to Israel and gathered all the prophets on Mount Carmel. Then Elijah came near to all of them and said, “How long will you be undecided between two opinions? If the Lord is God, follow Him, but if Baal, follow him.” But the people did not answer. Then Elijah said to the people, “I alone remain as a prophet of the Lord, but there are four hundred and fifty men who are prophets of Baal and four hundred prophets of the sacred groves. Let them give us two oxen. Then let them choose one bull for themselves, to be cut into pieces and laid on the wood; but they shall not light a fire under it. I will prepare the other bull and lay it on the wood; and I will not light a fire under it. Then you will call loudly on the name of your gods, and I will call on the name of the Lord, my God. So it shall come to pass that the God who answers by fire, He is God.” So all the people answered and said, “The word you have spoken is good.” “Choose one calf for yourselves and prepare it, for there are many of you. Then call on the name of your god, but do not put fire to the wood under it.” So they took a calf and prepared it, and called on the name of Baal from morning until noon, saying, “Hear us, O Baal, hear us.” But there was no voice, for no one answered, and they ran about the altar they had made. Then it came to pass at noon that Elijah the Tishbite mocked them and said, “Cry out with a loud voice, for he is a god; for either he is away meditating, or he is too busy, or preoccupied with other business. Perhaps he is sleeping and has need to be awakened from his nap.” So they cried aloud and […] prophesied until early evening, until the appointed time to offer the evening sacrifice, but even still, there was no voice. Finally, Elijah the Tishbite spoke to the prophets of the idols, saying, “Now remove yourselves from this place, for I will offer my whole burnt offering.” And they turned away and departed. Then Elijah said to the people, “Come near me.” So all the people came near to him. Elijah took twelve stones, according to the number of the tribes of Israel, for the Lord said, “Israel shall be your name.” Then he built an altar with the stones in the name of the Lord, and he repaired the altar of sacrifice that was scattered about, and around the altar he made a furrow holding two measures of seed. He piled the firewood on the altar he had made, divided the whole burnt offering, laid it on the firewood, and laid it in order on the altar. Then he said, “Bring me four pots of water, and pour it on the whole burnt offering and pour it on the unlit firewood.” They did so. Again Elijah said, “Do it a second time.” So they did it again. Again he said, “Do it a third time.” So they did it a third time. And the water ran all about the altar, and even the furrow became filled with water. After this, Elijah cried out to heaven and said, “O Lord God of Abraham, Isaac, and Israel, answer me, O Lord, answer me this day with fire, and let this people know You are the God of Israel, and I am Your servant; and for Your sake I do all these works. Hear me, O Lord, hear me with fire, and let these people know You are the Lord God, so as turn the heart of this people back.” Then fire fell from the Lord out of the heaven and consumed the whole burnt offering, the firewood, and the water in the furrow. The fire also licked up the stones and the soil. So all the people fell on their faces, and they said, “Truly, the Lord is God; He is God.” Elijah then said to the people, “Seize the prophets of Baal. Let not one of them escape.” So they seized them, and Elijah brought them down to the Brook Kishon, where he slaughtered them. After this, Elijah said to Ahab, “There is a sound of rain. Make ready your chariot and get down from here before the rain overcomes you.” But Elijah went up to the top of Carmel, where he bowed down on the ground and put his face between his knees. Thus it came to pass that the sky darkened with black clouds and wind, and there was a heavy downpour of rain. But Ahab mourned and went to Jezreel. Now Ahab told Jezebel his wife everything Elijah did. Then Jezebel sent to Elijah, saying, “If you are Elijah and I this Jezebel, may God do so to me and more also if at this hour tomorrow, I do not make your life like the life of one of them.” Elijah was fearful, and he arose and ran for his life. He came to Beersheba of Judah, where he left his servant. But Elijah himself went a day’s journey into the wilderness, and came and sat under a juniper tree. Then he lay down and slept under a tree. Unexpectedly, someone touched him and said to him, “Arise and eat.” Then Elijah looked, and there by his head was a cake made of wheat and a jar of water. So he ate and drank, and lay down again. Again the angel of the Lord came back a second time, touched him, and said, “Arise and eat, because the journey is a great many days for you.” So he arose, ate and drank; and he went with the strength of that food forty days and forty nights, as far as Mount Horeb. There he went into a cave and rested. Behold, the word of the Lord came to him and said to him, “Elijah, what are you doing here?” And Elijah said, “I have been very zealous for the Lord Almighty since the children of Israel have forsaken You. They tore down Your altars and killed Your prophets with the sword. I alone am left, and they seek to take my life.” Then the Lord said to him, “Go and return on your way to the desert of Damascus; and you shall anoint Elisha the son of Shaphat of Abel Meholah as prophet in your place.”
ltx/en_us_saas/le.pr.me.r65:leprVE.reading.title	
ltx/en_us_saas/le.pr.me.r65:leprVE.reading.title_abbr	
ltx/en_us_saas/le.pr.me.r65:leprVE.reading.version	@ltx/en_us_saas/properties:version.designation
