ltx/en_us_saas/le.pr.me.r98:leprVE.reading.book_abbr	@ltx/en_us_saas/le.pr.me.r49:leprVE.reading.book_abbr
ltx/en_us_saas/le.pr.me.r98:leprVE.reading.book_string	@ltx/en_us_saas/le.pr.me.r49:leprVE.reading.book_string
ltx/en_us_saas/le.pr.me.r98:leprVE.reading.chapverse	@ltx/en_us_saas/le.pr.me.r49:leprVE.reading.chapverse
ltx/en_us_saas/le.pr.me.r98:leprVE.reading.incipit	@ltx/en_us_saas/le.pr.me.r49:leprVE.reading.incipit
ltx/en_us_saas/le.pr.me.r98:leprVE.reading.text	@ltx/en_us_saas/le.pr.me.r49:leprVE.reading.text
ltx/en_us_saas/le.pr.me.r98:leprVE.reading.title	
ltx/en_us_saas/le.pr.me.r98:leprVE.reading.title_abbr	
ltx/en_us_saas/le.pr.me.r98:leprVE.reading.version	@ltx/en_us_saas/properties:version.designation
