ltx/en_us_rsv/le.ep.mc.d271:lemcLI.Epistle.book_abbr	@ltx/en_us_rsv/bible:Colossians.abbr
ltx/en_us_rsv/le.ep.mc.d271:lemcLI.Epistle.book_string	@ltx/en_us_rsv/bible:Colossians.text
ltx/en_us_rsv/le.ep.mc.d271:lemcLI.Epistle.chapverse	4:2 – 9
ltx/en_us_rsv/le.ep.mc.d271:lemcLI.Epistle.incipit	Continue steadfastly in prayer…
ltx/en_us_rsv/le.ep.mc.d271:lemcLI.Epistle.text	Brethren, continue steadfastly in prayer, being watchful in it with thanksgiving; and pray for us also, that God may open to us a door for the word, to declare the mystery of Christ, on account of which I am in prison, that I may make it clear, as I ought to speak. Conduct yourselves wisely toward outsiders, making the most of the time. Let your speech always be gracious, seasoned with salt, so that you may know how you ought to answer every one. Tychicus will tell you all about my affairs; he is a beloved brother and faithful minister and fellow servant in the Lord. I have sent him to you for this very purpose, that he may know how you are and that he may encourage your hearts, and with him Onesimus, the faithful and beloved brother, who is one of yourselves. They will tell you of everything that has taken place here.
ltx/en_us_rsv/le.ep.mc.d271:lemcLI.Epistle.title	Thursday of the 22nd Week
ltx/en_us_rsv/le.ep.mc.d271:lemcLI.Epistle.title_abbr	Thursday of the 22nd Week
ltx/en_us_rsv/le.ep.mc.d271:lemcLI.Epistle.version	@ltx/en_us_rsv/properties:version.designation
