ltx/en_us_rsv/le.ep.mc.d266:lemcLI.Epistle.book_abbr	@ltx/en_us_rsv/bible:Corinthians2.abbr
ltx/en_us_rsv/le.ep.mc.d266:lemcLI.Epistle.book_string	@ltx/en_us_rsv/bible:Corinthians2.text
ltx/en_us_rsv/le.ep.mc.d266:lemcLI.Epistle.chapverse	3:12 – 18
ltx/en_us_rsv/le.ep.mc.d266:lemcLI.Epistle.incipit	Since we have such a hope, we are very bold…
ltx/en_us_rsv/le.ep.mc.d266:lemcLI.Epistle.text	Brethren, since we have such a hope, we are very bold, not like Moses, who put a veil over his face so that the Israelites might not see the end of what was being set aside. But their minds were hardened; for to this day, when they read the old covenant, that same veil remains unlifted, because only through Christ is it taken away. Yes, to this day whenever Moses is read a veil lies over their heart; but when a man turns to the Lord the veil is removed. Now the Lord is the Spirit, and where the Spirit of the Lord is, there is freedom. And we all, with unveiled face, beholding the glory of the Lord as though reflected in a mirror, are being transformed into the same image from one degree of glory to another, for this comes from the Lord, the Spirit.
ltx/en_us_rsv/le.ep.mc.d266:lemcLI.Epistle.title	Saturday of the 21st Week
ltx/en_us_rsv/le.ep.mc.d266:lemcLI.Epistle.title_abbr	Saturday of the 21st Week
ltx/en_us_rsv/le.ep.mc.d266:lemcLI.Epistle.version	@ltx/en_us_rsv/properties:version.designation
