ltx/en_us_rsv/le.go.me.m07.d17:lemeLI.Gospel.book_abbr	@ltx/en_us_rsv/le.go.mc.d219:lemcLI.Gospel.book_abbr
ltx/en_us_rsv/le.go.me.m07.d17:lemeLI.Gospel.book_string	@ltx/en_us_rsv/le.go.mc.d219:lemcLI.Gospel.book_string
ltx/en_us_rsv/le.go.me.m07.d17:lemeLI.Gospel.chapverse	@ltx/en_us_rsv/le.go.mc.d219:lemcLI.Gospel.chapverse
ltx/en_us_rsv/le.go.me.m07.d17:lemeLI.Gospel.incipit	@ltx/en_us_rsv/le.go.mc.d219:lemcLI.Gospel.incipit
ltx/en_us_rsv/le.go.me.m07.d17:lemeLI.Gospel.text	@ltx/en_us_rsv/le.go.mc.d219:lemcLI.Gospel.text
ltx/en_us_rsv/le.go.me.m07.d17:lemeLI.Gospel.title	For the Saint
ltx/en_us_rsv/le.go.me.m07.d17:lemeLI.Gospel.title_abbr	For the Saint
ltx/en_us_rsv/le.go.me.m07.d17:lemeLI.Gospel.version	@ltx/en_us_rsv/le.go.mc.d219:lemcLI.Gospel.version
