ltx/en_us_rsv/le.ep.mc.d189:lemcLI.Epistle.book_abbr	@ltx/en_us_rsv/bible:Romans.abbr
ltx/en_us_rsv/le.ep.mc.d189:lemcLI.Epistle.book_string	@ltx/en_us_rsv/bible:Romans.text
ltx/en_us_rsv/le.ep.mc.d189:lemcLI.Epistle.chapverse	15:30 – 33
ltx/en_us_rsv/le.ep.mc.d189:lemcLI.Epistle.incipit	Brethren, I appeal to you, by our Lord Jesus Christ…
ltx/en_us_rsv/le.ep.mc.d189:lemcLI.Epistle.text	Brethren, I appeal to you, by our Lord Jesus Christ and by the love of the Spirit, to strive together with me in your prayers to God on my behalf, that I may be delivered from the unbelievers in Judea, and that my service for Jerusalem may be acceptable to the saints, so that by God’s will I may come to you with joy and be refreshed in your company. The God of peace be with you all. Amen.
ltx/en_us_rsv/le.ep.mc.d189:lemcLI.Epistle.title	Saturday of the 10th Week
ltx/en_us_rsv/le.ep.mc.d189:lemcLI.Epistle.title_abbr	Saturday of the 10th Week
ltx/en_us_rsv/le.ep.mc.d189:lemcLI.Epistle.version	@ltx/en_us_rsv/properties:version.designation
