ltx/en_us_rsv/le.ep.me.m04.d29:lemeLI.Epistle.book_abbr	@ltx/en_us_rsv/le.ep.mc.d190:lemcLI.Epistle.book_abbr
ltx/en_us_rsv/le.ep.me.m04.d29:lemeLI.Epistle.book_string	@ltx/en_us_rsv/le.ep.mc.d190:lemcLI.Epistle.book_string
ltx/en_us_rsv/le.ep.me.m04.d29:lemeLI.Epistle.chapverse	@ltx/en_us_rsv/le.ep.mc.d190:lemcLI.Epistle.chapverse
ltx/en_us_rsv/le.ep.me.m04.d29:lemeLI.Epistle.incipit	@ltx/en_us_rsv/le.ep.mc.d190:lemcLI.Epistle.incipit
ltx/en_us_rsv/le.ep.me.m04.d29:lemeLI.Epistle.text	@ltx/en_us_rsv/le.ep.mc.d190:lemcLI.Epistle.text
ltx/en_us_rsv/le.ep.me.m04.d29:lemeLI.Epistle.title	For the Apostles
ltx/en_us_rsv/le.ep.me.m04.d29:lemeLI.Epistle.title_abbr	For the Apostles
ltx/en_us_rsv/le.ep.me.m04.d29:lemeLI.Epistle.version	@ltx/en_us_rsv/le.ep.mc.d190:lemcLI.Epistle.version
