ltx/en_us_rsv/le.ep.mc.d331:lemcLI.Epistle.book_abbr	@ltx/en_us_rsv/bible:Hebrews.abbr
ltx/en_us_rsv/le.ep.mc.d331:lemcLI.Epistle.book_string	@ltx/en_us_rsv/bible:Hebrews.text
ltx/en_us_rsv/le.ep.mc.d331:lemcLI.Epistle.chapverse	11:17 – 31
ltx/en_us_rsv/le.ep.mc.d331:lemcLI.Epistle.incipit	By faith Abraham, when he was tested, offered up Isaac…
ltx/en_us_rsv/le.ep.mc.d331:lemcLI.Epistle.text	Brethren, by faith Abraham, when he was tested, offered up Isaac, and he who had received the promises was ready to offer up his only son, of whom it was said, “Through Isaac shall your descendants be named.” He considered that God was able to raise men even from the dead; hence, figuratively speaking, he did receive him back. By faith Isaac invoked future blessings on Jacob and Esau. By faith Jacob, when dying, blessed each of the sons of Joseph, bowing in worship over the head of his staff. By faith Joseph, at the end of his life, made mention of the exodus of the Israelites and gave directions concerning his bones. By faith Moses, when he was born, was hid for three months by his parents, because they saw that the child was beautiful; and they were not afraid of the king’s edict. By faith Moses, when he was grown up, refused to be called the son of the Pharaoh’s daughter, choosing rather to share ill-treatment with the people of God than to enjoy the fleeting pleasures of sin. He considered the reproach of Christ greater wealth than the treasures of Egypt, for he looked to the reward. By faith he left Egypt, not being afraid of the anger of the king; for he endured as seeing him who is invisible. By faith he kept the Passover and sprinkled the blood, so that the Destroyer of the first-born might not touch them. By faith the people crossed the Red Sea as if on dry land; but the Egyptians, when they attempted to do the same, were drowned. By faith the walls of Jericho fell down after they had been encircled for seven days. By faith Rahab the harlot did not perish with those who were disobedient, because she had given friendly welcome to the spies.
ltx/en_us_rsv/le.ep.mc.d331:lemcLI.Epistle.title	Monday of the 31st Week
ltx/en_us_rsv/le.ep.mc.d331:lemcLI.Epistle.title_abbr	Monday of the 31st Week
ltx/en_us_rsv/le.ep.mc.d331:lemcLI.Epistle.version	@ltx/en_us_rsv/properties:version.designation
