ltx/en_us_rsv/le.go.mc.d183:lemcLI.Gospel.book_abbr	@ltx/en_us_rsv/bible:Matthew.abbr
ltx/en_us_rsv/le.go.mc.d183:lemcLI.Gospel.book_string	@ltx/en_us_rsv/bible:Matthew.text
ltx/en_us_rsv/le.go.mc.d183:lemcLI.Gospel.chapverse	14:22 – 34
ltx/en_us_rsv/le.go.mc.d183:lemcLI.Gospel.incipit	Jesus made the disciples get into the boat…
ltx/en_us_rsv/le.go.mc.d183:lemcLI.Gospel.text	At that time, Jesus made the disciples get into the boat and go before him to the other side, while he dismissed the crowds. And after he had dismissed the crowds, he went up into the hills by himself to pray. When evening came, he was there alone, but the boat by this time was out on the sea, beaten by the waves; for the wind was against them. And in the fourth watch of the night he came to them, walking on the sea. But when the disciples saw him walking on the sea, they were terrified, saying, “It is a ghost!” And they cried out for fear. But immediately he spoke to them, saying, “Take heart, it is I; have no fear.” And Peter answered him, “Lord, if it is you, bid me come to you on the water.” He said, “Come.” So Peter got out of the boat and walked on the water and came to Jesus; but when he saw the strong wind, he was afraid, and beginning to sink he cried out, “Lord, save me.” Jesus immediately reached out his hand and caught him, saying to him, “O man of little faith, why did you doubt?” And when they entered the boat, the wind ceased. And those in the boat worshiped him, saying, “Truly you are the Son of God.” And when they had crossed over, they came to land at Gennesaret.
ltx/en_us_rsv/le.go.mc.d183:lemcLI.Gospel.title	Ninth Sunday of Matthew
ltx/en_us_rsv/le.go.mc.d183:lemcLI.Gospel.title_abbr	9th Sunday of Matthew
ltx/en_us_rsv/le.go.mc.d183:lemcLI.Gospel.version	@ltx/en_us_rsv/properties:version.designation
