ltx/en_us_rsv/le.go.lu.d103:leluLI.Gospel.book_abbr	@ltx/en_us_rsv/bible:Mark.abbr
ltx/en_us_rsv/le.go.lu.d103:leluLI.Gospel.book_string	@ltx/en_us_rsv/bible:Mark.text
ltx/en_us_rsv/le.go.lu.d103:leluLI.Gospel.chapverse	12:1 – 12
ltx/en_us_rsv/le.go.lu.d103:leluLI.Gospel.incipit	A man planted a vineyard…
ltx/en_us_rsv/le.go.lu.d103:leluLI.Gospel.text	The Lord said this parable, “A man planted a vineyard, and set a hedge around it, and dug a pit for the wine press, and built a tower, and let it out to tenants, and went into another country. When the time came, he sent a servant to the tenants, to get from them some of the fruit of the vineyard. And they took him and beat him, and sent him away empty handed. Again he sent to them another servant, and they wounded him in the head, and treated him shamefully. And he sent another, and him they killed; and so with many others, some they beat and some they killed. He had still one other, a beloved son; finally he sent him to them, saying, ‘They will respect my son.’ But those tenants said to one another, ‘This is the heir; come, let us kill him, and the inheritance will be ours.’ And they took him and killed him, and cast him out of the vineyard. What will the owner of the vineyard do? He will come and destroy the tenants, and give the vineyard to others. Have you not read this scripture: ‘The very stone which the builders rejected has become the head of the corner; this was the Lord’s doing, and it is marvelous in our eyes’?” And they tried to arrest him, but feared the multitude, for they perceived that he had told the parable against them; so they left him and went away.
ltx/en_us_rsv/le.go.lu.d103:leluLI.Gospel.title	Friday of the 15th Week of Luke
ltx/en_us_rsv/le.go.lu.d103:leluLI.Gospel.title_abbr	Friday of the 15th Week of Luke
ltx/en_us_rsv/le.go.lu.d103:leluLI.Gospel.version	@ltx/en_us_rsv/properties:version.designation
