ltx/en_us_rsv/le.ep.me.m06.d29:lemeLI.Epistle.book_abbr	@ltx/en_us_rsv/bible:Corinthians2.abbr
ltx/en_us_rsv/le.ep.me.m06.d29:lemeLI.Epistle.book_string	@ltx/en_us_rsv/bible:Corinthians2.text
ltx/en_us_rsv/le.ep.me.m06.d29:lemeLI.Epistle.chapverse	11:21 – 33; 12:1 – 9
ltx/en_us_rsv/le.ep.me.m06.d29:lemeLI.Epistle.incipit	Whatever anyone dares to boast of…
ltx/en_us_rsv/le.ep.me.m06.d29:lemeLI.Epistle.text	Brethren, whatever anyone dares to boast of — I am speaking as a fool — I also dare to boast of that. Are they Hebrews? So am I. Are they Israelites? So am I. Are they descendants of Abraham? So am I. Are they servants of Christ? I am a better one — I am talking like a madman — with far greater labors, far more imprisonments, with countless beatings, and often near death. Five times I have received at the hands of the Jews the forty lashes less one. Three times I have been beaten with rods; once I was stoned. Three times I have been shipwrecked; a night and a day I have been adrift at sea; on frequent journeys, in danger from rivers, danger from robbers, danger from my own people, danger from Gentiles, danger in the city, danger in the wilderness, danger at sea, danger from false brethren; in toil and hardship, through many a sleepless night, in hunger and thirst, often without food, in cold and exposure. And, apart from other things, there is the daily pressure upon me of my anxiety for all the churches. Who is weak, and I am not weak? Who is made to fall, and I am not indignant? If I must boast, I will boast of the things that show my weakness. The God and Father of the Lord Jesus, he who is blessed for ever, knows that I do not lie. At Damascus, the governor under King Aretas guarded the city of Damascus and wanted to seize me, but I was let down in a basket through a window in the wall, and escaped his hands. I must boast; there is nothing to be gained by it, but I will go on to visions and revelations of the Lord. I know a man in Christ who fourteen years ago was caught up to the third heaven — whether in the body or out of the body I do not know, God knows. And I know that this man was caught up into Paradise — whether in the body or out of the body I do not know, God knows — and he heard things that cannot be told, which man may not utter. On behalf of this man I will boast, but on my own behalf I will not boast, except of my weaknesses. Though if I wish to boast, I shall not be a fool, for I shall be speaking the truth. But I refrain from it, so that no one may think more of me than he sees in me or hears from me. And to keep me from being too elated by the abundance of revelations, a thorn was given me in the flesh, a messenger of Satan, to harass me, to keep me from being too elated. Three times I besought the Lord about this, that it should leave me; but he said to me, “My grace is sufficient for you, for my power is made perfect in weakness.” I will all the more gladly boast of my weaknesses, that the power of Christ may rest upon me.
ltx/en_us_rsv/le.ep.me.m06.d29:lemeLI.Epistle.title	For the Apostles
ltx/en_us_rsv/le.ep.me.m06.d29:lemeLI.Epistle.title_abbr	For the Apostles
ltx/en_us_rsv/le.ep.me.m06.d29:lemeLI.Epistle.version	@ltx/en_us_rsv/properties:version.designation
ltx/en_us_rsv/le.ep.me.m06.d29:lemeVE.Reading1.book_abbr	@ltx/en_us_rsv/bible:Peter1.abbr
ltx/en_us_rsv/le.ep.me.m06.d29:lemeVE.Reading1.book_string	@ltx/en_us_rsv/bible:Peter1.text
ltx/en_us_rsv/le.ep.me.m06.d29:lemeVE.Reading1.chapverse	1:3 – 9
ltx/en_us_rsv/le.ep.me.m06.d29:lemeVE.Reading1.incipit	Blessed be the God and Father…
ltx/en_us_rsv/le.ep.me.m06.d29:lemeVE.Reading1.text	Brethren, blessed be the God and Father of our Lord Jesus Christ! By his great mercy we have been born anew to a living hope through the resurrection of Jesus Christ from the dead, and to an inheritance which is imperishable, undefiled, and unfading, kept in heaven for you, who by God’s power are guarded through faith for a salvation ready to be revealed in the last time. In this you rejoice, though now for a little while you may have to suffer various trials, so that the genuineness of your faith, more precious than gold which though perishable is tested by fire, may result in praise and glory and honor at the revelation of Jesus Christ. Without having seen him you love him; though you do not now see him you believe in him and rejoice with unutterable and exalted joy. As the outcome of your faith you obtain the salvation of your souls.
ltx/en_us_rsv/le.ep.me.m06.d29:lemeVE.Reading1.title	For the Apostles
ltx/en_us_rsv/le.ep.me.m06.d29:lemeVE.Reading1.title_abbr	For the Apostles
ltx/en_us_rsv/le.ep.me.m06.d29:lemeVE.Reading1.version	@ltx/en_us_rsv/properties:version.designation
ltx/en_us_rsv/le.ep.me.m06.d29:lemeVE.Reading2.book_abbr	@ltx/en_us_rsv/bible:Peter1.abbr
ltx/en_us_rsv/le.ep.me.m06.d29:lemeVE.Reading2.book_string	@ltx/en_us_rsv/bible:Peter1.text
ltx/en_us_rsv/le.ep.me.m06.d29:lemeVE.Reading2.chapverse	1:13 – 19
ltx/en_us_rsv/le.ep.me.m06.d29:lemeVE.Reading2.incipit	Gird up the loins of your mind…
ltx/en_us_rsv/le.ep.me.m06.d29:lemeVE.Reading2.text	Beloved, gird up the loins of your mind, be sober, set your hope fully upon the grace that is coming to you at the revelation of Jesus Christ. As obedient children, do not be conformed to the passions of your former ignorance, but as he who called you is holy, be holy yourselves in all your conduct; since it is written, “You shall be holy, for I am holy.” And if you invoke as Father him who judges each one impartially according to his deeds, conduct yourselves with fear throughout the time of your exile. You know that you were ransomed from the futile ways inherited from your fathers, not with perishable things such as silver or gold, but with the precious blood of Christ, like that of a lamb without blemish or spot.
ltx/en_us_rsv/le.ep.me.m06.d29:lemeVE.Reading2.title	For the Apostles
ltx/en_us_rsv/le.ep.me.m06.d29:lemeVE.Reading2.title_abbr	For the Apostles
ltx/en_us_rsv/le.ep.me.m06.d29:lemeVE.Reading2.version	@ltx/en_us_rsv/properties:version.designation
ltx/en_us_rsv/le.ep.me.m06.d29:lemeVE.Reading3.book_abbr	@ltx/en_us_rsv/bible:Peter1.abbr
ltx/en_us_rsv/le.ep.me.m06.d29:lemeVE.Reading3.book_string	@ltx/en_us_rsv/bible:Peter1.text
ltx/en_us_rsv/le.ep.me.m06.d29:lemeVE.Reading3.chapverse	2:11 – 24
ltx/en_us_rsv/le.ep.me.m06.d29:lemeVE.Reading3.incipit	Beloved, I beseech you as aliens…
ltx/en_us_rsv/le.ep.me.m06.d29:lemeVE.Reading3.text	Beloved, I beseech you as aliens and exiles to abstain from the passions of the flesh that wage war against your soul. Maintain good conduct among the Gentiles, so that in case they speak against you as wrongdoers, they may see your good deeds and glorify God on the day of visitation. Be subject for the Lord’s sake to every human institution, whether it be to the emperor as supreme, or to governors as sent by him to punish those who do wrong and to praise those who do right. For it is God’s will that by doing right you should put to silence the ignorance of foolish men. Live as free men, yet without using your freedom as a pretext for evil; but live as servants of God. Honor all men. Love the brotherhood. Fear God. Honor the emperor. Servants, be submissive to your masters with all respect, not only to the kind and gentle but also to the overbearing. For one is approved if, mindful of God, he endures pain while suffering unjustly. For what credit is it, if when you do wrong and are beaten for it you take it patiently? But if when you do right and suffer for it you take it patiently, you have God’s approval. For to this you have been called, because Christ also suffered for you, leaving you an example, that you should follow in his steps. He committed no sin; no guile was found on his lips. When he was reviled, he did not revile in return; when he suffered, he did not threaten; but he trusted to him who judges justly. He himself bore our sins in his body on the tree, that we might die to sin and live to righteousness.
ltx/en_us_rsv/le.ep.me.m06.d29:lemeVE.Reading3.title	For the Apostles
ltx/en_us_rsv/le.ep.me.m06.d29:lemeVE.Reading3.title_abbr	For the Apostles
ltx/en_us_rsv/le.ep.me.m06.d29:lemeVE.Reading3.version	@ltx/en_us_rsv/properties:version.designation
