ltx/en_us_rsv/le.go.me.m01.d04:lemeLI.Gospel.book_abbr	@ltx/en_us_rsv/le.go.mc.d072:lemcLI.Gospel.book_abbr
ltx/en_us_rsv/le.go.me.m01.d04:lemeLI.Gospel.book_string	@ltx/en_us_rsv/le.go.mc.d072:lemcLI.Gospel.book_string
ltx/en_us_rsv/le.go.me.m01.d04:lemeLI.Gospel.chapverse	@ltx/en_us_rsv/le.go.mc.d072:lemcLI.Gospel.chapverse
ltx/en_us_rsv/le.go.me.m01.d04:lemeLI.Gospel.incipit	@ltx/en_us_rsv/le.go.mc.d072:lemcLI.Gospel.incipit
ltx/en_us_rsv/le.go.me.m01.d04:lemeLI.Gospel.text	@ltx/en_us_rsv/le.go.mc.d072:lemcLI.Gospel.text
ltx/en_us_rsv/le.go.me.m01.d04:lemeLI.Gospel.title	For the Apostles
ltx/en_us_rsv/le.go.me.m01.d04:lemeLI.Gospel.title_abbr	For the Apostles
ltx/en_us_rsv/le.go.me.m01.d04:lemeLI.Gospel.version	@ltx/en_us_rsv/le.go.mc.d072:lemcLI.Gospel.version
