ltx/en_us_rsv/le.go.lu.d040:leluLI.Gospel.book_abbr	@ltx/en_us_rsv/bible:Luke.abbr
ltx/en_us_rsv/le.go.lu.d040:leluLI.Gospel.book_string	@ltx/en_us_rsv/bible:Luke.text
ltx/en_us_rsv/le.go.lu.d040:leluLI.Gospel.chapverse	11:23 – 26
ltx/en_us_rsv/le.go.lu.d040:leluLI.Gospel.incipit	He who is not with me is against me…
ltx/en_us_rsv/le.go.lu.d040:leluLI.Gospel.text	The Lord said, “He who is not with me is against me, and he who does not gather with me scatters. When the unclean spirit has gone out of a man, he passes through waterless places seeking rest; and finding none he says, ‘I will return to my house from which I came.’ And when he comes he finds it swept and put in order. Then he goes and brings seven other spirits more evil than himself, and they enter and dwell there; and the last state of that man becomes worse than the first.”
ltx/en_us_rsv/le.go.lu.d040:leluLI.Gospel.title	Friday of the 6th Week of Luke
ltx/en_us_rsv/le.go.lu.d040:leluLI.Gospel.title_abbr	Friday of the 6th Week of Luke
ltx/en_us_rsv/le.go.lu.d040:leluLI.Gospel.version	@ltx/en_us_rsv/properties:version.designation
