ltx/en_us_rsv/le.ep.me.m10.d26:lemeLI.Epistle.book_abbr	@ltx/en_us_rsv/le.ep.ge.martyr:legeLI.Epistle.book_abbr
ltx/en_us_rsv/le.ep.me.m10.d26:lemeLI.Epistle.book_string	@ltx/en_us_rsv/le.ep.ge.martyr:legeLI.Epistle.book_string
ltx/en_us_rsv/le.ep.me.m10.d26:lemeLI.Epistle.chapverse	@ltx/en_us_rsv/le.ep.ge.martyr:legeLI.Epistle.chapverse
ltx/en_us_rsv/le.ep.me.m10.d26:lemeLI.Epistle.incipit	@ltx/en_us_rsv/le.ep.ge.martyr:legeLI.Epistle.incipit
ltx/en_us_rsv/le.ep.me.m10.d26:lemeLI.Epistle.text	@ltx/en_us_rsv/le.ep.ge.martyr:legeLI.Epistle.text
ltx/en_us_rsv/le.ep.me.m10.d26:lemeLI.Epistle.title	For the Saint
ltx/en_us_rsv/le.ep.me.m10.d26:lemeLI.Epistle.title_abbr	For the Saint
ltx/en_us_rsv/le.ep.me.m10.d26:lemeLI.Epistle.version	@ltx/en_us_rsv/le.ep.ge.martyr:legeLI.Epistle.version
