ltx/en_us_rsv/le.go.lu.d114:leluLI.Gospel.book_abbr	@ltx/en_us_rsv/bible:Mark.abbr
ltx/en_us_rsv/le.go.lu.d114:leluLI.Gospel.book_string	@ltx/en_us_rsv/bible:Mark.text
ltx/en_us_rsv/le.go.lu.d114:leluLI.Gospel.chapverse	13:14 – 23
ltx/en_us_rsv/le.go.lu.d114:leluLI.Gospel.incipit	When you see the desolating sacrilege…
ltx/en_us_rsv/le.go.lu.d114:leluLI.Gospel.text	The Lord said to his disciples, “When you see the desolating sacrilege spoken of by Daniel the prophet, set up where it ought not to be (let the reader understand), then let those who are in Judea flee to the mountains; let him who is on the housetop not go down, nor enter his house, to take anything away; and let him who is in the field not turn back to take his mantle. And alas for those who are with child and for those who give suck in those days! Pray that it may not happen in winter. For in those days there will be such tribulation as has not been from the beginning of the creation which God created until now, and never will be. And if the Lord had not shortened the days, no human being would be saved; but for the sake of the elect, whom he chose, he shortened the days. And then if any one says to you, ‘Look, here is the Christ!’ or ‘Look, there he is!’ do not believe it. False Christs and false prophets will arise and show signs and wonders, to lead astray, if possible, the elect. But take heed; I have told you all things beforehand.”
ltx/en_us_rsv/le.go.lu.d114:leluLI.Gospel.title	Tuesday of the 17th Week of Luke
ltx/en_us_rsv/le.go.lu.d114:leluLI.Gospel.title_abbr	Tuesday of the 17th Week of Luke
ltx/en_us_rsv/le.go.lu.d114:leluLI.Gospel.version	@ltx/en_us_rsv/properties:version.designation
