ltx/en_us_rsv/le.go.mc.d153:lemcLI.Gospel.book_abbr	@ltx/en_us_rsv/bible:Matthew.abbr
ltx/en_us_rsv/le.go.mc.d153:lemcLI.Gospel.book_string	@ltx/en_us_rsv/bible:Matthew.text
ltx/en_us_rsv/le.go.mc.d153:lemcLI.Gospel.chapverse	13:3 – 9
ltx/en_us_rsv/le.go.mc.d153:lemcLI.Gospel.incipit	A sower went out to sow…
ltx/en_us_rsv/le.go.mc.d153:lemcLI.Gospel.text	The Lord said this parable, “A sower went out to sow. And as he sowed, some seeds fell along the path, and the birds came and devoured them. Other seeds fell on rocky ground, where they had not much soil, and immediately they sprang up, since they had no depth of soil, but when the sun rose they were scorched; and since they had no root they withered away. Other seeds fell upon thorns, and the thorns grew up and choked them. Other seeds fell on good soil and brought forth grain, some a hundredfold, some sixty, some thirty. He who has ears to hear, let him hear.”
ltx/en_us_rsv/le.go.mc.d153:lemcLI.Gospel.title	Friday of the 5th Week of Matthew
ltx/en_us_rsv/le.go.mc.d153:lemcLI.Gospel.title_abbr	Friday of the 5th Week
ltx/en_us_rsv/le.go.mc.d153:lemcLI.Gospel.version	@ltx/en_us_rsv/properties:version.designation
