ltx/en_us_rsv/le.ep.me.m09.dSunAC:lemeLI.Epistle.book_abbr	@ltx/en_us_rsv/le.ep.mc.d267:lemcLI.Epistle.book_abbr
ltx/en_us_rsv/le.ep.me.m09.dSunAC:lemeLI.Epistle.book_string	@ltx/en_us_rsv/le.ep.mc.d267:lemcLI.Epistle.book_string
ltx/en_us_rsv/le.ep.me.m09.dSunAC:lemeLI.Epistle.chapverse	@ltx/en_us_rsv/le.ep.mc.d267:lemcLI.Epistle.chapverse
ltx/en_us_rsv/le.ep.me.m09.dSunAC:lemeLI.Epistle.incipit	@ltx/en_us_rsv/le.ep.mc.d267:lemcLI.Epistle.incipit
ltx/en_us_rsv/le.ep.me.m09.dSunAC:lemeLI.Epistle.text	@ltx/en_us_rsv/le.ep.mc.d267:lemcLI.Epistle.text
ltx/en_us_rsv/le.ep.me.m09.dSunAC:lemeLI.Epistle.title	Sunday after the Cross
ltx/en_us_rsv/le.ep.me.m09.dSunAC:lemeLI.Epistle.title_abbr	Sunday after the Cross
ltx/en_us_rsv/le.ep.me.m09.dSunAC:lemeLI.Epistle.version	@ltx/en_us_rsv/le.ep.mc.d267:lemcLI.Epistle.version
