ltx/en_us_rsv/le.ep.me.m01.d11:lemeLI.Epistle.book_abbr	@ltx/en_us_rsv/le.ep.ge.hierarch:legeLI.Epistle2.book_abbr
ltx/en_us_rsv/le.ep.me.m01.d11:lemeLI.Epistle.book_string	@ltx/en_us_rsv/le.ep.ge.hierarch:legeLI.Epistle2.book_string
ltx/en_us_rsv/le.ep.me.m01.d11:lemeLI.Epistle.chapverse	@ltx/en_us_rsv/le.ep.ge.hierarch:legeLI.Epistle2.chapverse
ltx/en_us_rsv/le.ep.me.m01.d11:lemeLI.Epistle.incipit	@ltx/en_us_rsv/le.ep.ge.hierarch:legeLI.Epistle2.incipit
ltx/en_us_rsv/le.ep.me.m01.d11:lemeLI.Epistle.text	@ltx/en_us_rsv/le.ep.ge.hierarch:legeLI.Epistle2.text
ltx/en_us_rsv/le.ep.me.m01.d11:lemeLI.Epistle.title	For the Saint
ltx/en_us_rsv/le.ep.me.m01.d11:lemeLI.Epistle.title_abbr	For the Saint
ltx/en_us_rsv/le.ep.me.m01.d11:lemeLI.Epistle.version	@ltx/en_us_rsv/le.ep.ge.hierarch:legeLI.Epistle2.version
