ltx/en_us_rsv/le.go.mc.d208:lemcLI.Gospel.book_abbr	@ltx/en_us_rsv/bible:Mark.abbr
ltx/en_us_rsv/le.go.mc.d208:lemcLI.Gospel.book_string	@ltx/en_us_rsv/bible:Mark.text
ltx/en_us_rsv/le.go.mc.d208:lemcLI.Gospel.chapverse	3:28 – 35
ltx/en_us_rsv/le.go.mc.d208:lemcLI.Gospel.incipit	Truly, I say to you, all sins will be forgiven…
ltx/en_us_rsv/le.go.mc.d208:lemcLI.Gospel.text	The Lord said, “Truly, I say to you, all sins will be forgiven the sons of men, and whatever blasphemies they utter; but whoever blasphemes against the Holy Spirit never has forgiveness, but is guilty of an eternal sin,” for they had said, “He has an unclean spirit.” And his mother and his brothers came; and standing outside they sent to him and called him. And a crowd was sitting about him; and they said to him, “Your mother and your brothers are outside, asking for you.” And he replied, “Who are my mother and my brothers?” And looking around on those who sat about him, he said, “Here are my mother and my brothers! Whoever does the will of God is my brother, and sister, and mother.”
ltx/en_us_rsv/le.go.mc.d208:lemcLI.Gospel.title	Thursday of the 13th Week of Matthew
ltx/en_us_rsv/le.go.mc.d208:lemcLI.Gospel.title_abbr	Thursday of the 13th Week
ltx/en_us_rsv/le.go.mc.d208:lemcLI.Gospel.version	@ltx/en_us_rsv/properties:version.designation
