ltx/en_us_rsv/le.go.me.m11.d17:lemeLI.Gospel.book_abbr	@ltx/en_us_rsv/le.go.ge.unmercenary:legeLI.Gospel.book_abbr
ltx/en_us_rsv/le.go.me.m11.d17:lemeLI.Gospel.book_string	@ltx/en_us_rsv/le.go.ge.unmercenary:legeLI.Gospel.book_string
ltx/en_us_rsv/le.go.me.m11.d17:lemeLI.Gospel.chapverse	@ltx/en_us_rsv/le.go.ge.unmercenary:legeLI.Gospel.chapverse
ltx/en_us_rsv/le.go.me.m11.d17:lemeLI.Gospel.incipit	@ltx/en_us_rsv/le.go.ge.unmercenary:legeLI.Gospel.incipit
ltx/en_us_rsv/le.go.me.m11.d17:lemeLI.Gospel.text	@ltx/en_us_rsv/le.go.ge.unmercenary:legeLI.Gospel.text
ltx/en_us_rsv/le.go.me.m11.d17:lemeLI.Gospel.title	For the Saint
ltx/en_us_rsv/le.go.me.m11.d17:lemeLI.Gospel.title_abbr	For the Saint
ltx/en_us_rsv/le.go.me.m11.d17:lemeLI.Gospel.version	@ltx/en_us_rsv/le.go.ge.unmercenary:legeLI.Gospel.version
