ltx/en_us_rsv/le.ep.mc.d160:lemcLI.Epistle.book_abbr	@ltx/en_us_rsv/bible:Corinthians1.abbr
ltx/en_us_rsv/le.ep.mc.d160:lemcLI.Epistle.book_string	@ltx/en_us_rsv/bible:Corinthians1.text
ltx/en_us_rsv/le.ep.mc.d160:lemcLI.Epistle.chapverse	4:5 – 8
ltx/en_us_rsv/le.ep.mc.d160:lemcLI.Epistle.incipit	Do not pronounce judgment before the time…
ltx/en_us_rsv/le.ep.mc.d160:lemcLI.Epistle.text	Brethren, do not pronounce judgment before the time, before the Lord comes, who will bring to light the things now hidden in darkness and will disclose the purposes of the heart. Then every man will receive his commendation from God. I have applied all this to myself and Apollos for your benefit, brethren, that you may learn by us not to go beyond what is written, that none of you may be puffed up in favor of one against another. For who sees anything different in you? What have you that you did not receive? If then you received it, why do you boast as if it were not a gift? Already you are filled! Already you have become rich! Without us you have become kings! And would that you did reign, so that we might share the rule with you!
ltx/en_us_rsv/le.ep.mc.d160:lemcLI.Epistle.title	Friday of the 6th Week
ltx/en_us_rsv/le.ep.mc.d160:lemcLI.Epistle.title_abbr	Friday of the 6th Week
ltx/en_us_rsv/le.ep.mc.d160:lemcLI.Epistle.version	@ltx/en_us_rsv/properties:version.designation
