ltx/en_us_rsv/le.ep.me.m10.d22:lemeLI.Epistle.book_abbr	@ltx/en_us_rsv/le.ep.ge.hierarch:legeLI.Epistle.book_abbr
ltx/en_us_rsv/le.ep.me.m10.d22:lemeLI.Epistle.book_string	@ltx/en_us_rsv/le.ep.ge.hierarch:legeLI.Epistle.book_string
ltx/en_us_rsv/le.ep.me.m10.d22:lemeLI.Epistle.chapverse	@ltx/en_us_rsv/le.ep.ge.hierarch:legeLI.Epistle.chapverse
ltx/en_us_rsv/le.ep.me.m10.d22:lemeLI.Epistle.incipit	@ltx/en_us_rsv/le.ep.ge.hierarch:legeLI.Epistle.incipit
ltx/en_us_rsv/le.ep.me.m10.d22:lemeLI.Epistle.text	@ltx/en_us_rsv/le.ep.ge.hierarch:legeLI.Epistle.text
ltx/en_us_rsv/le.ep.me.m10.d22:lemeLI.Epistle.title	For the Hierarch
ltx/en_us_rsv/le.ep.me.m10.d22:lemeLI.Epistle.title_abbr	For the Hierarch
ltx/en_us_rsv/le.ep.me.m10.d22:lemeLI.Epistle.version	@ltx/en_us_rsv/le.ep.ge.hierarch:legeLI.Epistle.version
ltx/en_us_rsv/le.ep.me.m10.d22:lemeLI.Epistle2.book_abbr	@ltx/en_us_rsv/le.ep.mc.d127:lemcLI.Epistle.book_abbr
ltx/en_us_rsv/le.ep.me.m10.d22:lemeLI.Epistle2.book_string	@ltx/en_us_rsv/le.ep.mc.d127:lemcLI.Epistle.book_string
ltx/en_us_rsv/le.ep.me.m10.d22:lemeLI.Epistle2.chapverse	@ltx/en_us_rsv/le.ep.mc.d127:lemcLI.Epistle.chapverse
ltx/en_us_rsv/le.ep.me.m10.d22:lemeLI.Epistle2.incipit	@ltx/en_us_rsv/le.ep.mc.d127:lemcLI.Epistle.incipit
ltx/en_us_rsv/le.ep.me.m10.d22:lemeLI.Epistle2.text	@ltx/en_us_rsv/le.ep.mc.d127:lemcLI.Epistle.text
ltx/en_us_rsv/le.ep.me.m10.d22:lemeLI.Epistle2.title	For the Holy Youths
ltx/en_us_rsv/le.ep.me.m10.d22:lemeLI.Epistle2.title_abbr	For the Holy Youths
ltx/en_us_rsv/le.ep.me.m10.d22:lemeLI.Epistle2.version	@ltx/en_us_rsv/le.ep.mc.d127:lemcLI.Epistle.version
