ltx/en_us_rsv/le.ep.mc.d184:lemcLI.Epistle.book_abbr	@ltx/en_us_rsv/bible:Corinthians1.abbr
ltx/en_us_rsv/le.ep.mc.d184:lemcLI.Epistle.book_string	@ltx/en_us_rsv/bible:Corinthians1.text
ltx/en_us_rsv/le.ep.mc.d184:lemcLI.Epistle.chapverse	15:12 – 19
ltx/en_us_rsv/le.ep.mc.d184:lemcLI.Epistle.incipit	If Christ is preached as raised from the dead…
ltx/en_us_rsv/le.ep.mc.d184:lemcLI.Epistle.text	Brethren, if Christ is preached as raised from the dead, how can some of you say that there is no resurrection of the dead? But if there is no resurrection of the dead, then Christ has not been raised; if Christ has not been raised, then our preaching is in vain. We are even found to be misrepresenting God, because we testified of God that he raised Christ, whom he did not raise if it is true that the dead are not raised. For if the dead are not raised, then Christ has not been raised. If Christ has not been raised, your faith is futile and you are still in your sins. Then those also who have fallen asleep in Christ have perished. If for this life only we have hoped in Christ, we are of all men most to be pitied.
ltx/en_us_rsv/le.ep.mc.d184:lemcLI.Epistle.title	Monday of the 10th Week
ltx/en_us_rsv/le.ep.mc.d184:lemcLI.Epistle.title_abbr	Monday of the 10th Week
ltx/en_us_rsv/le.ep.mc.d184:lemcLI.Epistle.version	@ltx/en_us_rsv/properties:version.designation
