ltx/en_us_rsv/le.go.mc.d180:lemcLI.Gospel.book_abbr	@ltx/en_us_rsv/bible:Matthew.abbr
ltx/en_us_rsv/le.go.mc.d180:lemcLI.Gospel.book_string	@ltx/en_us_rsv/bible:Matthew.text
ltx/en_us_rsv/le.go.mc.d180:lemcLI.Gospel.chapverse	20:17 – 28
ltx/en_us_rsv/le.go.mc.d180:lemcLI.Gospel.incipit	As Jesus was going up to Jerusalem…
ltx/en_us_rsv/le.go.mc.d180:lemcLI.Gospel.text	At that time, as Jesus was going up to Jerusalem, he took the twelve disciples aside, and on the way he said to them, “Behold, we are going up to Jerusalem; and the Son of man will be delivered to the chief priests and scribes, and they will condemn him to death, and deliver him to the Gentiles to be mocked and scourged and crucified, and he will be raised on the third day.” Then the mother of the sons of Zebedee came up to him, with her sons, and kneeling before him she asked him for something. And he said to her, “What do you want?” She said to him, “Command that these two sons of mine may sit, one at your right hand and one at your left, in your kingdom.” But Jesus answered, “You do not know what you are asking. Are you able to drink the cup that I am to drink or to be baptized with the baptism that I am baptized with?” They said to him, “We are able.” He said to them, “You will drink my cup, and you will be baptized with the baptism that I am baptized with, but to sit at my right hand and at my left is not mine to grant, but it is for those for whom it has been prepared by my Father.” And when the ten heard it, they were indignant at the two brothers. But Jesus called them to him and said, “You know that the rulers of the Gentiles lord it over them, and their great men exercise authority over them. It shall not be so among you; but whoever would be great among you must be your servant, and whoever would be first among you must be your slave; even as the Son of man came not to be served but to serve, and to give his life as a ransom for many.”
ltx/en_us_rsv/le.go.mc.d180:lemcLI.Gospel.title	Thursday of the 9th Week of Matthew
ltx/en_us_rsv/le.go.mc.d180:lemcLI.Gospel.title_abbr	Thursday of the 9th Week
ltx/en_us_rsv/le.go.mc.d180:lemcLI.Gospel.version	@ltx/en_us_rsv/properties:version.designation
