ltx/en_us_rsv/le.go.me.m01.d06:lemeLI.Gospel.book_abbr	@ltx/en_us_rsv/bible:Matthew.abbr
ltx/en_us_rsv/le.go.me.m01.d06:lemeLI.Gospel.book_string	@ltx/en_us_rsv/bible:Matthew.text
ltx/en_us_rsv/le.go.me.m01.d06:lemeLI.Gospel.chapverse	3:13 – 17
ltx/en_us_rsv/le.go.me.m01.d06:lemeLI.Gospel.incipit	Jesus came from Galilee to the Jordan…
ltx/en_us_rsv/le.go.me.m01.d06:lemeLI.Gospel.text	At that time, Jesus came from Galilee to the Jordan to John, to be baptized by him. John would have prevented him, saying, “I need to be baptized by you, and do you come to me?” But Jesus answered him, “Let it be so now; for thus it is fitting for us to fulfill all righteousness.” Then he consented. And when Jesus was baptized, he went up immediately from the water, and behold, the heavens were opened to him and he saw the Spirit of God descending like a dove, and alighting on him; and lo, a voice from heaven, saying, “This is my beloved Son, with whom I am well pleased.”
ltx/en_us_rsv/le.go.me.m01.d06:lemeLI.Gospel.title	For the Feast
ltx/en_us_rsv/le.go.me.m01.d06:lemeLI.Gospel.title_abbr	For the Feast
ltx/en_us_rsv/le.go.me.m01.d06:lemeLI.Gospel.version	@ltx/en_us_rsv/properties:version.designation
ltx/en_us_rsv/le.go.me.m01.d06:lemeMA.Gospel.book_abbr	@ltx/en_us_rsv/le.go.me.m01.d05:lemeH6.Gospel.book_abbr
ltx/en_us_rsv/le.go.me.m01.d06:lemeMA.Gospel.book_string	@ltx/en_us_rsv/le.go.me.m01.d05:lemeH6.Gospel.book_string
ltx/en_us_rsv/le.go.me.m01.d06:lemeMA.Gospel.chapverse	@ltx/en_us_rsv/le.go.me.m01.d05:lemeH6.Gospel.chapverse
ltx/en_us_rsv/le.go.me.m01.d06:lemeMA.Gospel.incipit	@ltx/en_us_rsv/le.go.me.m01.d05:lemeH6.Gospel.incipit
ltx/en_us_rsv/le.go.me.m01.d06:lemeMA.Gospel.text	@ltx/en_us_rsv/le.go.me.m01.d05:lemeH6.Gospel.text
ltx/en_us_rsv/le.go.me.m01.d06:lemeMA.Gospel.title	For the Feast
ltx/en_us_rsv/le.go.me.m01.d06:lemeMA.Gospel.title_abbr	For the Feast
ltx/en_us_rsv/le.go.me.m01.d06:lemeMA.Gospel.version	@ltx/en_us_rsv/le.go.me.m01.d05:lemeH6.Gospel.version
ltx/en_us_rsv/le.go.me.m01.d06:lemeVE.Gospel.book_abbr	@ltx/en_us_rsv/le.go.me.m01.d05:lemeH9.Gospel.book_abbr
ltx/en_us_rsv/le.go.me.m01.d06:lemeVE.Gospel.book_string	@ltx/en_us_rsv/le.go.me.m01.d05:lemeH9.Gospel.book_string
ltx/en_us_rsv/le.go.me.m01.d06:lemeVE.Gospel.chapverse	@ltx/en_us_rsv/le.go.me.m01.d05:lemeH9.Gospel.chapverse
ltx/en_us_rsv/le.go.me.m01.d06:lemeVE.Gospel.incipit	@ltx/en_us_rsv/le.go.me.m01.d05:lemeH9.Gospel.incipit
ltx/en_us_rsv/le.go.me.m01.d06:lemeVE.Gospel.text	@ltx/en_us_rsv/le.go.me.m01.d05:lemeH9.Gospel.text
ltx/en_us_rsv/le.go.me.m01.d06:lemeVE.Gospel.title	For the Feast
ltx/en_us_rsv/le.go.me.m01.d06:lemeVE.Gospel.title_abbr	For the Feast
ltx/en_us_rsv/le.go.me.m01.d06:lemeVE.Gospel.version	@ltx/en_us_rsv/le.go.me.m01.d05:lemeH9.Gospel.version
