ltx/en_us_rsv/le.ep.me.m02.d08:lemeLI.Epistle.book_abbr	@ltx/en_us_rsv/le.ep.mc.d281:lemcLI.Epistle.book_abbr
ltx/en_us_rsv/le.ep.me.m02.d08:lemeLI.Epistle.book_string	@ltx/en_us_rsv/le.ep.mc.d281:lemcLI.Epistle.book_string
ltx/en_us_rsv/le.ep.me.m02.d08:lemeLI.Epistle.chapverse	@ltx/en_us_rsv/le.ep.mc.d281:lemcLI.Epistle.chapverse
ltx/en_us_rsv/le.ep.me.m02.d08:lemeLI.Epistle.incipit	@ltx/en_us_rsv/le.ep.mc.d281:lemcLI.Epistle.incipit
ltx/en_us_rsv/le.ep.me.m02.d08:lemeLI.Epistle.text	@ltx/en_us_rsv/le.ep.mc.d281:lemcLI.Epistle.text
ltx/en_us_rsv/le.ep.me.m02.d08:lemeLI.Epistle.title	For the Saint
ltx/en_us_rsv/le.ep.me.m02.d08:lemeLI.Epistle.title_abbr	For the Saint
ltx/en_us_rsv/le.ep.me.m02.d08:lemeLI.Epistle.version	@ltx/en_us_rsv/le.ep.mc.d281:lemcLI.Epistle.version
