ltx/en_us_rsv/le.ep.mc.d254:lemcLI.Epistle.book_abbr	@ltx/en_us_rsv/bible:Philippians.abbr
ltx/en_us_rsv/le.ep.mc.d254:lemcLI.Epistle.book_string	@ltx/en_us_rsv/bible:Philippians.text
ltx/en_us_rsv/le.ep.mc.d254:lemcLI.Epistle.chapverse	2:12 – 16
ltx/en_us_rsv/le.ep.mc.d254:lemcLI.Epistle.incipit	As you have always obeyed…
ltx/en_us_rsv/le.ep.mc.d254:lemcLI.Epistle.text	Brethren, as you have always obeyed, so now, not only as in my presence but much more in my absence, work out your own salvation with fear and trembling; for God is at work in you, both to will and to work for his good pleasure. Do all things without grumbling or questioning, that you may be blameless and innocent, children of God without blemish in the midst of a crooked and perverse generation, among whom you shine as lights in the world, holding fast the word of life, so that in the day of Christ I may be proud.
ltx/en_us_rsv/le.ep.mc.d254:lemcLI.Epistle.title	Monday of the 20th Week
ltx/en_us_rsv/le.ep.mc.d254:lemcLI.Epistle.title_abbr	Monday of the 20th Week
ltx/en_us_rsv/le.ep.mc.d254:lemcLI.Epistle.version	@ltx/en_us_rsv/properties:version.designation
