ltx/en_us_rsv/le.go.lu.d005:leluLI.Gospel.book_abbr	@ltx/en_us_rsv/bible:Luke.abbr
ltx/en_us_rsv/le.go.lu.d005:leluLI.Gospel.book_string	@ltx/en_us_rsv/bible:Luke.text
ltx/en_us_rsv/le.go.lu.d005:leluLI.Gospel.chapverse	4:22 – 30
ltx/en_us_rsv/le.go.lu.d005:leluLI.Gospel.incipit	The crowds wondered at the gracious words…
ltx/en_us_rsv/le.go.lu.d005:leluLI.Gospel.text	At that time, the crowds wondered at the gracious words which proceeded out of Jesus'' mouth; and they said, “Is not this Joseph’s son?” And he said to them, “Doubtless you will quote to me this proverb, ‘Physician, heal yourself; what we have heard you did at Capernaum, do here also in your own country.’” And he said, “Truly, I say to you, no prophet is acceptable in his own country. But in truth, I tell you, there were many widows in Israel in the days of Elijah, when the heaven was shut up three years and six months, when there came a great famine over all the land; and Elijah was sent to none of them but only to Zarephath, in the land of Sidon, to a woman who was a widow. And there were many lepers in Israel in the time of the prophet Elisha; and none of them was cleansed but only Naaman the Syrian.” When they heard this, all in the synagogue were filled with wrath. And they rose up and put him out of the city, and led him to the brow of the hill on which their city was built, that they might throw him down headlong. But passing through the midst of them he went away.
ltx/en_us_rsv/le.go.lu.d005:leluLI.Gospel.title	Friday of the 1st Week of Luke
ltx/en_us_rsv/le.go.lu.d005:leluLI.Gospel.title_abbr	Friday of the 1st Week of Luke
ltx/en_us_rsv/le.go.lu.d005:leluLI.Gospel.version	@ltx/en_us_rsv/properties:version.designation
