ltx/en_us_rsv/le.go.lu.d115:leluLI.Gospel.book_abbr	@ltx/en_us_rsv/bible:Mark.abbr
ltx/en_us_rsv/le.go.lu.d115:leluLI.Gospel.book_string	@ltx/en_us_rsv/bible:Mark.text
ltx/en_us_rsv/le.go.lu.d115:leluLI.Gospel.chapverse	13:24 – 31
ltx/en_us_rsv/le.go.lu.d115:leluLI.Gospel.incipit	In those days, after that tribulation…
ltx/en_us_rsv/le.go.lu.d115:leluLI.Gospel.text	The Lord said to his disciples, “In those days, after that tribulation, the sun will be darkened, and the moon will not give its light, and the stars will be falling from heaven, and the powers in the heavens will be shaken. And then they will see the Son of man coming in clouds with great power and glory. And he will send out the angels, and gather his elect from the four winds, from the ends of the earth to the ends of heaven. From the fig tree learn its lesson: as soon as its branch becomes tender and puts forth its leaves, you know that summer is near. So also, when you see these things taking place, you know he is near, at the very gates. Truly, I say to you, this generation will not pass away before all these things take place. Heaven and earth will pass away, but my words will not pass away.”
ltx/en_us_rsv/le.go.lu.d115:leluLI.Gospel.title	Wednesday of the 17th Week of Luke
ltx/en_us_rsv/le.go.lu.d115:leluLI.Gospel.title_abbr	Wednesday of the 17th Week of Luke
ltx/en_us_rsv/le.go.lu.d115:leluLI.Gospel.version	@ltx/en_us_rsv/properties:version.designation
