ltx/en_us_rsv/le.go.me.m12.d27:lemeLI.Gospel.book_abbr	@ltx/en_us_rsv/le.go.mc.d211:lemcLI.Gospel.book_abbr
ltx/en_us_rsv/le.go.me.m12.d27:lemeLI.Gospel.book_string	@ltx/en_us_rsv/le.go.mc.d211:lemcLI.Gospel.book_string
ltx/en_us_rsv/le.go.me.m12.d27:lemeLI.Gospel.chapverse	@ltx/en_us_rsv/le.go.mc.d211:lemcLI.Gospel.chapverse
ltx/en_us_rsv/le.go.me.m12.d27:lemeLI.Gospel.incipit	@ltx/en_us_rsv/le.go.mc.d211:lemcLI.Gospel.incipit
ltx/en_us_rsv/le.go.me.m12.d27:lemeLI.Gospel.text	@ltx/en_us_rsv/le.go.mc.d211:lemcLI.Gospel.text
ltx/en_us_rsv/le.go.me.m12.d27:lemeLI.Gospel.title	For the Protomartyr
ltx/en_us_rsv/le.go.me.m12.d27:lemeLI.Gospel.title_abbr	For the Protomartyr
ltx/en_us_rsv/le.go.me.m12.d27:lemeLI.Gospel.version	@ltx/en_us_rsv/le.go.mc.d211:lemcLI.Gospel.version
