ltx/en_us_rsv/le.go.me.m08.d21:lemeLI.Gospel.book_abbr	@ltx/en_us_rsv/le.go.mc.d206:lemcLI.Gospel.book_abbr
ltx/en_us_rsv/le.go.me.m08.d21:lemeLI.Gospel.book_string	@ltx/en_us_rsv/le.go.mc.d206:lemcLI.Gospel.book_string
ltx/en_us_rsv/le.go.me.m08.d21:lemeLI.Gospel.chapverse	@ltx/en_us_rsv/le.go.mc.d206:lemcLI.Gospel.chapverse
ltx/en_us_rsv/le.go.me.m08.d21:lemeLI.Gospel.incipit	@ltx/en_us_rsv/le.go.mc.d206:lemcLI.Gospel.incipit
ltx/en_us_rsv/le.go.me.m08.d21:lemeLI.Gospel.text	@ltx/en_us_rsv/le.go.mc.d206:lemcLI.Gospel.text
ltx/en_us_rsv/le.go.me.m08.d21:lemeLI.Gospel.title	For the Apostle
ltx/en_us_rsv/le.go.me.m08.d21:lemeLI.Gospel.title_abbr	For the Apostle
ltx/en_us_rsv/le.go.me.m08.d21:lemeLI.Gospel.version	@ltx/en_us_rsv/le.go.mc.d206:lemcLI.Gospel.version
