ltx/en_us_rsv/le.ep.va.funeral:levaFUN.Epistle.book_abbr	@ltx/en_us_rsv/le.ep.va.deceased:levaDEC.Epistle1.book_abbr
ltx/en_us_rsv/le.ep.va.funeral:levaFUN.Epistle.book_string	@ltx/en_us_rsv/le.ep.va.deceased:levaDEC.Epistle1.book_string
ltx/en_us_rsv/le.ep.va.funeral:levaFUN.Epistle.chapverse	@ltx/en_us_rsv/le.ep.va.deceased:levaDEC.Epistle1.chapverse
ltx/en_us_rsv/le.ep.va.funeral:levaFUN.Epistle.incipit	@ltx/en_us_rsv/le.ep.va.deceased:levaDEC.Epistle1.incipit
ltx/en_us_rsv/le.ep.va.funeral:levaFUN.Epistle.text	@ltx/en_us_rsv/le.ep.va.deceased:levaDEC.Epistle1.text
ltx/en_us_rsv/le.ep.va.funeral:levaFUN.Epistle.title	At Funerals
ltx/en_us_rsv/le.ep.va.funeral:levaFUN.Epistle.title_abbr	At Funerals
ltx/en_us_rsv/le.ep.va.funeral:levaFUN.Epistle.version	@ltx/en_us_rsv/properties:version.designation
