ltx/en_us_rsv/le.ep.mc.d270:lemcLI.Epistle.book_abbr	@ltx/en_us_rsv/bible:Colossians.abbr
ltx/en_us_rsv/le.ep.mc.d270:lemcLI.Epistle.book_string	@ltx/en_us_rsv/bible:Colossians.text
ltx/en_us_rsv/le.ep.mc.d270:lemcLI.Epistle.chapverse	3:17 – 25; 4:1
ltx/en_us_rsv/le.ep.mc.d270:lemcLI.Epistle.incipit	Whatever you do, in word or deed…
ltx/en_us_rsv/le.ep.mc.d270:lemcLI.Epistle.text	Brethren, whatever you do, in word or deed, do everything in the name of the Lord Jesus, giving thanks to God the Father through him. Wives, be subject to your husbands, as is fitting in the Lord. Husbands, love your wives, and do not be harsh with them. Children, obey your parents in everything, for this pleases the Lord. Fathers, do not provoke your children, lest they become discouraged. Slaves, obey in everything those who are your earthly masters, not with eye-service, as men-pleasers, but in singleness of heart, fearing the Lord. Whatever your task, work heartily, as serving the Lord and not men, knowing that from the Lord you will receive the inheritance as your reward; you are serving the Lord Christ. For the wrongdoer will be paid back for the wrong he has done, and there is no partiality. Masters, treat your slaves justly and fairly, knowing that you also have a Master in heaven.
ltx/en_us_rsv/le.ep.mc.d270:lemcLI.Epistle.title	Wednesday of the 22nd Week
ltx/en_us_rsv/le.ep.mc.d270:lemcLI.Epistle.title_abbr	Wednesday of the 22nd Week
ltx/en_us_rsv/le.ep.mc.d270:lemcLI.Epistle.version	@ltx/en_us_rsv/properties:version.designation
