ltx/en_us_rsv/le.go.lu.d001:leluLI.Gospel.book_abbr	@ltx/en_us_rsv/bible:Luke.abbr
ltx/en_us_rsv/le.go.lu.d001:leluLI.Gospel.book_string	@ltx/en_us_rsv/bible:Luke.text
ltx/en_us_rsv/le.go.lu.d001:leluLI.Gospel.chapverse	3:19 – 22
ltx/en_us_rsv/le.go.lu.d001:leluLI.Gospel.incipit	Herod the tetrarch, who had been reproved…
ltx/en_us_rsv/le.go.lu.d001:leluLI.Gospel.text	At that time, Herod the tetrarch, who had been reproved by John for Herodias, his brother’s wife, and for all the evil things that Herod had done, added this to them all, that he shut up John in prison. Now when all the people were baptized, and when Jesus also had been baptized and was praying, the heaven was opened, and the Holy Spirit descended upon him in bodily form, as a dove, and a voice came from heaven. “You are my beloved Son; with you I am well pleased.”
ltx/en_us_rsv/le.go.lu.d001:leluLI.Gospel.title	Monday of the 1st Week of Luke
ltx/en_us_rsv/le.go.lu.d001:leluLI.Gospel.title_abbr	Monday of the 1st Week of Luke
ltx/en_us_rsv/le.go.lu.d001:leluLI.Gospel.version	@ltx/en_us_rsv/properties:version.designation
