ltx/en_us_rsv/le.go.mc.d172:lemcLI.Gospel.book_abbr	@ltx/en_us_rsv/bible:Matthew.abbr
ltx/en_us_rsv/le.go.mc.d172:lemcLI.Gospel.book_string	@ltx/en_us_rsv/bible:Matthew.text
ltx/en_us_rsv/le.go.mc.d172:lemcLI.Gospel.chapverse	16:20 – 24
ltx/en_us_rsv/le.go.mc.d172:lemcLI.Gospel.incipit	Jesus strictly charged the disciples…
ltx/en_us_rsv/le.go.mc.d172:lemcLI.Gospel.text	At that time, Jesus strictly charged the disciples to tell no one that he was the Christ. From that time Jesus began to show his disciples that he must go to Jerusalem and suffer many things from the elders and chief priests and scribes, and be killed, and on the third day be raised. And Peter took him and began to rebuke him, saying, “God forbid, Lord! This shall never happen to you.” But he turned and said to Peter, “Get behind me, Satan! You are a stumbling block to me; for you are not on the side of God, but of men.” Then Jesus told his disciples, “If any man would come after me, let him deny himself, and take up his cross and follow me.”
ltx/en_us_rsv/le.go.mc.d172:lemcLI.Gospel.title	Wednesday of the 8th Week of Matthew
ltx/en_us_rsv/le.go.mc.d172:lemcLI.Gospel.title_abbr	Wednesday of the 8th Week
ltx/en_us_rsv/le.go.mc.d172:lemcLI.Gospel.version	@ltx/en_us_rsv/properties:version.designation
