ltx/en_us_rsv/le.go.me.m06.d11:lemeLI.Gospel.book_abbr	@ltx/en_us_rsv/le.go.ge.apostle:legeLI.Gospel.book_abbr
ltx/en_us_rsv/le.go.me.m06.d11:lemeLI.Gospel.book_string	@ltx/en_us_rsv/le.go.ge.apostle:legeLI.Gospel.book_string
ltx/en_us_rsv/le.go.me.m06.d11:lemeLI.Gospel.chapverse	@ltx/en_us_rsv/le.go.ge.apostle:legeLI.Gospel.chapverse
ltx/en_us_rsv/le.go.me.m06.d11:lemeLI.Gospel.incipit	@ltx/en_us_rsv/le.go.ge.apostle:legeLI.Gospel.incipit
ltx/en_us_rsv/le.go.me.m06.d11:lemeLI.Gospel.text	@ltx/en_us_rsv/le.go.ge.apostle:legeLI.Gospel.text
ltx/en_us_rsv/le.go.me.m06.d11:lemeLI.Gospel.title	For the Apostles
ltx/en_us_rsv/le.go.me.m06.d11:lemeLI.Gospel.title_abbr	For the Apostles
ltx/en_us_rsv/le.go.me.m06.d11:lemeLI.Gospel.version	@ltx/en_us_rsv/le.go.ge.apostle:legeLI.Gospel.version
