ltx/en_us_rsv/le.go.lu.d084:leluLI.Gospel.book_abbr	@ltx/en_us_rsv/bible:Luke.abbr
ltx/en_us_rsv/le.go.lu.d084:leluLI.Gospel.book_string	@ltx/en_us_rsv/bible:Luke.text
ltx/en_us_rsv/le.go.lu.d084:leluLI.Gospel.chapverse	17:12 – 19
ltx/en_us_rsv/le.go.lu.d084:leluLI.Gospel.incipit	As Jesus entered a village…
ltx/en_us_rsv/le.go.lu.d084:leluLI.Gospel.text	At that time, as Jesus entered a village, he was met by ten lepers, who stood at a distance and lifted up their voices and said: “Jesus, Master, have mercy on us.” When he saw them he said to them, “Go and show yourselves to the priests.” And as they went they were cleansed. Then one of them, when he saw that he was healed, turned back, praising God with a loud voice; and he fell on his face at Jesus’s feet, giving him thanks. Now he was a Samaritan. Then said Jesus: “Were not ten cleansed? Where are the nine? Was no one found to return and give praise to God except this foreigner?” And he said to him: “Rise and go your way; your faith has made you well.”
ltx/en_us_rsv/le.go.lu.d084:leluLI.Gospel.title	Twelfth Sunday of Luke
ltx/en_us_rsv/le.go.lu.d084:leluLI.Gospel.title_abbr	12th Sunday of Luke
ltx/en_us_rsv/le.go.lu.d084:leluLI.Gospel.version	@ltx/en_us_rsv/properties:version.designation
