ltx/en_us_rsv/le.ep.mc.d244:lemcLI.Epistle.book_abbr	@ltx/en_us_rsv/bible:Ephesians.abbr
ltx/en_us_rsv/le.ep.mc.d244:lemcLI.Epistle.book_string	@ltx/en_us_rsv/bible:Ephesians.text
ltx/en_us_rsv/le.ep.mc.d244:lemcLI.Epistle.chapverse	6:18 – 24
ltx/en_us_rsv/le.ep.mc.d244:lemcLI.Epistle.incipit	Stand, and pray at all times in the Spirit…
ltx/en_us_rsv/le.ep.mc.d244:lemcLI.Epistle.text	Brethren, stand, and pray at all times in the Spirit, with all prayer and supplication. To that end keep alert with all perseverance, making supplication for all the saints, and also for me, that utterance may be given me in opening my mouth boldly to proclaim the mystery of the gospel, for which I am an ambassador in chains; that I may declare it boldly, as I ought to speak. Now that you also may know how I am and what I am doing, Tychicus the beloved brother and faithful minister in the Lord will tell you everything. I have sent him to you for this very purpose, that you may know how we are, and that he may encourage your hearts. Peace be to the brethren, and love with faith, from God the Father and the Lord Jesus Christ. Grace be with all who love our Lord Jesus Christ with love undying. Amen.
ltx/en_us_rsv/le.ep.mc.d244:lemcLI.Epistle.title	Friday of the 18th Week
ltx/en_us_rsv/le.ep.mc.d244:lemcLI.Epistle.title_abbr	Friday of the 18th Week
ltx/en_us_rsv/le.ep.mc.d244:lemcLI.Epistle.version	@ltx/en_us_rsv/properties:version.designation
