ltx/en_us_rsv/le.ep.mc.d124:lemcLI.Epistle.book_abbr	@ltx/en_us_rsv/bible:Romans.abbr
ltx/en_us_rsv/le.ep.mc.d124:lemcLI.Epistle.book_string	@ltx/en_us_rsv/bible:Romans.text
ltx/en_us_rsv/le.ep.mc.d124:lemcLI.Epistle.chapverse	1:28 – 32; 2:1 – 9
ltx/en_us_rsv/le.ep.mc.d124:lemcLI.Epistle.incipit	Since the ungodly did not see fit…
ltx/en_us_rsv/le.ep.mc.d124:lemcLI.Epistle.text	Brethren, since the ungodly did not see fit to acknowledge God, God gave them up to a base mind and to improper conduct. They were filled with all manner of wickedness, evil, covetousness, malice. Full of envy, murder, strife, deceit, malignity, they are gossips, slanderers, haters of God, insolent, haughty, boastful, inventors of evil, disobedient to parents, foolish, faithless, heartless, ruthless. Though they know God’s decree that those who do such things deserve to die, they not only do them but approve those who practice them. Therefore you have no excuse, O man, whoever you are, when you judge another; for in passing judgment upon him you condemn yourself, because you, the judge, are doing the very same things. We know that the judgment of God rightly falls upon those who do such things. Do you suppose, O man, that when you judge those who do such things and yet do them yourself, you will escape the judgment of God? Or do you presume upon the riches of his kindness and forbearance and patience? Do you not know that God’s kindness is meant to lead you to repentance? But by your hard and impenitent heart you are storing up wrath for yourself on the day of wrath when God’s righteous judgment will be revealed. For he will render to every man according to his works; to those who by patience in well-doing seek for glory and honor and immortality, he will give eternal life; but for those who are factious and do not obey the truth, but obey wickedness, there will be wrath and fury. There will be tribulation and distress for every human being who does evil, the Jew first and also the Greek.
ltx/en_us_rsv/le.ep.mc.d124:lemcLI.Epistle.title	Thursday of the 1st Week
ltx/en_us_rsv/le.ep.mc.d124:lemcLI.Epistle.title_abbr	Thursday of the 1st Week
ltx/en_us_rsv/le.ep.mc.d124:lemcLI.Epistle.version	@ltx/en_us_rsv/properties:version.designation
