ltx/en_us_rsv/le.ep.me.m12.d26:lemeLI.Epistle.book_abbr	@ltx/en_us_rsv/le.ep.me.m03.d25:lemeLI.Epistle.book_abbr
ltx/en_us_rsv/le.ep.me.m12.d26:lemeLI.Epistle.book_string	@ltx/en_us_rsv/le.ep.me.m03.d25:lemeLI.Epistle.book_string
ltx/en_us_rsv/le.ep.me.m12.d26:lemeLI.Epistle.chapverse	@ltx/en_us_rsv/le.ep.me.m03.d25:lemeLI.Epistle.chapverse
ltx/en_us_rsv/le.ep.me.m12.d26:lemeLI.Epistle.incipit	@ltx/en_us_rsv/le.ep.me.m03.d25:lemeLI.Epistle.incipit
ltx/en_us_rsv/le.ep.me.m12.d26:lemeLI.Epistle.text	@ltx/en_us_rsv/le.ep.me.m03.d25:lemeLI.Epistle.text
ltx/en_us_rsv/le.ep.me.m12.d26:lemeLI.Epistle.title	For the Theotokos
ltx/en_us_rsv/le.ep.me.m12.d26:lemeLI.Epistle.title_abbr	For the Theotokos
ltx/en_us_rsv/le.ep.me.m12.d26:lemeLI.Epistle.version	@ltx/en_us_rsv/properties:version.designation
