ltx/en_us_rsv/le.go.me.m01.d20:lemeLI.Gospel.book_abbr	@ltx/en_us_rsv/le.go.lu.d012:leluLI.Gospel.book_abbr
ltx/en_us_rsv/le.go.me.m01.d20:lemeLI.Gospel.book_string	@ltx/en_us_rsv/le.go.lu.d012:leluLI.Gospel.book_string
ltx/en_us_rsv/le.go.me.m01.d20:lemeLI.Gospel.chapverse	@ltx/en_us_rsv/le.go.lu.d012:leluLI.Gospel.chapverse
ltx/en_us_rsv/le.go.me.m01.d20:lemeLI.Gospel.incipit	@ltx/en_us_rsv/le.go.lu.d012:leluLI.Gospel.incipit
ltx/en_us_rsv/le.go.me.m01.d20:lemeLI.Gospel.text	@ltx/en_us_rsv/le.go.lu.d012:leluLI.Gospel.text
ltx/en_us_rsv/le.go.me.m01.d20:lemeLI.Gospel.title	For the Saint
ltx/en_us_rsv/le.go.me.m01.d20:lemeLI.Gospel.title_abbr	For the Saint
ltx/en_us_rsv/le.go.me.m01.d20:lemeLI.Gospel.version	@ltx/en_us_rsv/le.go.lu.d012:leluLI.Gospel.version
ltx/en_us_rsv/le.go.me.m01.d20:lemeMA.Gospel.book_abbr	@ltx/en_us_rsv/le.go.mc.d145:lemcLI.Gospel.book_abbr
ltx/en_us_rsv/le.go.me.m01.d20:lemeMA.Gospel.book_string	@ltx/en_us_rsv/le.go.mc.d145:lemcLI.Gospel.book_string
ltx/en_us_rsv/le.go.me.m01.d20:lemeMA.Gospel.chapverse	@ltx/en_us_rsv/le.go.mc.d145:lemcLI.Gospel.chapverse
ltx/en_us_rsv/le.go.me.m01.d20:lemeMA.Gospel.incipit	@ltx/en_us_rsv/le.go.mc.d145:lemcLI.Gospel.incipit
ltx/en_us_rsv/le.go.me.m01.d20:lemeMA.Gospel.text	@ltx/en_us_rsv/le.go.mc.d145:lemcLI.Gospel.text
ltx/en_us_rsv/le.go.me.m01.d20:lemeMA.Gospel.title	For the Saint
ltx/en_us_rsv/le.go.me.m01.d20:lemeMA.Gospel.title_abbr	For the Saint
ltx/en_us_rsv/le.go.me.m01.d20:lemeMA.Gospel.version	@ltx/en_us_rsv/le.go.mc.d145:lemcLI.Gospel.version
