ltx/en_us_rsv/le.go.mc.d133:lemcLI.Gospel.book_abbr	@ltx/en_us_rsv/bible:Matthew.abbr
ltx/en_us_rsv/le.go.mc.d133:lemcLI.Gospel.book_string	@ltx/en_us_rsv/bible:Matthew.text
ltx/en_us_rsv/le.go.mc.d133:lemcLI.Gospel.chapverse	7:1 – 8
ltx/en_us_rsv/le.go.mc.d133:lemcLI.Gospel.incipit	Judge not, that you be not judged…
ltx/en_us_rsv/le.go.mc.d133:lemcLI.Gospel.text	The Lord said, “Judge not, that you be not judged. For with the judgment you pronounce you will be judged, and the measure you give will be the measure you get. Why do you see the speck that is in your brother’s eye, but do not notice the log that is in your own eye? Or how can you say to your brother, ‘Let me take the speck out of your eye,’ when there is the log in your own eye? You hypocrite, first take the log out of your own eye, and then you will see clearly to take the speck out of your brother’s eye. Do not give dogs what is holy; and do not throw your pearls before swine, lest they trample them under foot and turn to attack you. Ask, and it will be given you; seek, and you will find; knock, and it will be opened to you. For every one who asks receives, and he who seeks finds, and to him who knocks it will be opened.”
ltx/en_us_rsv/le.go.mc.d133:lemcLI.Gospel.title	Saturday of the 2nd Week of Matthew
ltx/en_us_rsv/le.go.mc.d133:lemcLI.Gospel.title_abbr	Saturday of the 2nd Week
ltx/en_us_rsv/le.go.mc.d133:lemcLI.Gospel.version	@ltx/en_us_rsv/properties:version.designation
