ltx/en_us_rsv/le.ep.me.m08.d11:lemeLI.Epistle.book_abbr	@ltx/en_us_rsv/le.ep.me.m09.d02:lemeLI.Epistle.book_abbr
ltx/en_us_rsv/le.ep.me.m08.d11:lemeLI.Epistle.book_string	@ltx/en_us_rsv/le.ep.me.m09.d02:lemeLI.Epistle.book_string
ltx/en_us_rsv/le.ep.me.m08.d11:lemeLI.Epistle.chapverse	@ltx/en_us_rsv/le.ep.me.m09.d02:lemeLI.Epistle.chapverse
ltx/en_us_rsv/le.ep.me.m08.d11:lemeLI.Epistle.incipit	@ltx/en_us_rsv/le.ep.me.m09.d02:lemeLI.Epistle.incipit
ltx/en_us_rsv/le.ep.me.m08.d11:lemeLI.Epistle.text	@ltx/en_us_rsv/le.ep.me.m09.d02:lemeLI.Epistle.text
ltx/en_us_rsv/le.ep.me.m08.d11:lemeLI.Epistle.title	For the Martyr
ltx/en_us_rsv/le.ep.me.m08.d11:lemeLI.Epistle.title_abbr	For the Martyr
ltx/en_us_rsv/le.ep.me.m08.d11:lemeLI.Epistle.version	@ltx/en_us_rsv/le.ep.me.m09.d02:lemeLI.Epistle.version
