ltx/en_us_rsv/le.ep.mc.d350:lemcLI.Epistle.book_abbr	@ltx/en_us_rsv/bible:Timothy2.abbr
ltx/en_us_rsv/le.ep.mc.d350:lemcLI.Epistle.book_string	@ltx/en_us_rsv/bible:Timothy2.text
ltx/en_us_rsv/le.ep.mc.d350:lemcLI.Epistle.chapverse	2:11 – 19
ltx/en_us_rsv/le.ep.mc.d350:lemcLI.Epistle.incipit	The saying is sure: If we have died with him…
ltx/en_us_rsv/le.ep.mc.d350:lemcLI.Epistle.text	Timothy, my son, the saying is sure: If we have died with him, we shall also live with him; if we endure, we shall also reign with him; if we deny him, he also will deny us; if we are faithless, he remains faithful — for he cannot deny himself. Remind them of this, and charge them before the Lord to avoid disputing about words, which does no good, but only ruins the hearers. Do your best to present yourself to God as one approved, a workman who has no need to be ashamed, rightly handling the word of truth. Avoid such godless chatter, for they will advance into more and more ungodliness, and their talk will eat its way like gangrene. Among them are Hymenaeus and Philetus, who have swerved from the truth by holding that the resurrection is past already. They are upsetting the faith of some. But God’s firm foundation stands, bearing this seal: “The Lord knows those who are his,” and, “Let every one who names the name of the Lord depart from iniquity.”
ltx/en_us_rsv/le.ep.mc.d350:lemcLI.Epistle.title	Saturday of the 33rd Week
ltx/en_us_rsv/le.ep.mc.d350:lemcLI.Epistle.title_abbr	Saturday of the 33rd Week
ltx/en_us_rsv/le.ep.mc.d350:lemcLI.Epistle.version	@ltx/en_us_rsv/properties:version.designation
