ltx/en_us_rsv/le.ep.mc.d362:lemcLI.Epistle.book_abbr	@ltx/en_us_rsv/bible:John1.abbr
ltx/en_us_rsv/le.ep.mc.d362:lemcLI.Epistle.book_string	@ltx/en_us_rsv/bible:John1.text
ltx/en_us_rsv/le.ep.mc.d362:lemcLI.Epistle.chapverse	4:20 – 5:21
ltx/en_us_rsv/le.ep.mc.d362:lemcLI.Epistle.incipit	If any one says, “I love God”…
ltx/en_us_rsv/le.ep.mc.d362:lemcLI.Epistle.text	Beloved, if any one says, “I love God,” and hates his brother, he is a liar; for he who does not love his brother whom he has seen, how can he love God whom he has not seen? And this commandment we have from him, that he who loves God should love his brother also. Every one who believes that Jesus is the Christ is a child of God, and every one who loves the parent loves the child. By this we know that we love the children of God, when we love God and obey his commandments. For this is the love of God, that we keep his commandments. And his commandments are not burdensome. For whatever is born of God overcomes the world; and this is the victory that overcomes the world, our faith. Who is it that overcomes the world but he who believes that Jesus is the Son of God? This is he who came by water and blood, Jesus Christ, not with the water only but with the water and the blood. And the Spirit is the one that testifies, for the Spirit is the truth. There are three that testify in heaven, the Father, the Word, and the Holy Spirit, and these three are one. And there are three that testify on earth, the Spirit, the water, and the blood; and these three agree. If we receive the testimony of men, the testimony of God is greater; for this is the testimony of God that he has borne witness to his Son. He who believes in the Son of God has the testimony in himself. He who does not believe God has made him a liar, because he has not believed in the testimony that God has borne to his Son. And this is the testimony, that God gave us eternal life, and this life is in his Son. He who has the Son has life; he who has not the Son of God has not life. I write this to you who believe in the name of the Son of God, that you may know that you have eternal life and that you may believe in the name of the Son of God. And this is the confidence which we have in him, that if we ask anything according to his will he hears us. And if we know that he hears us in whatever we ask, we know that we have obtained the requests made of him. If any one sees his brother committing what is not a mortal sin, he will ask, and God will give him life for those whose sin is not mortal. There is sin which is mortal; I do not say that one is to pray for that. All wrongdoing is sin, but there is sin which is not mortal. We know that any one born of God does not sin, but he who was born of God protects himself, and the evil one does not touch him. We know that we are of God, and the whole world is in the power of the evil one. And we know that the Son of God has come and has given us understanding, to know him who is true; and we are in him who is true, in his Son Jesus Christ. He is the true God and eternal life. Little children, keep yourselves from idols. Amen.
ltx/en_us_rsv/le.ep.mc.d362:lemcLI.Epistle.title	Thursday of the 35th Week
ltx/en_us_rsv/le.ep.mc.d362:lemcLI.Epistle.title_abbr	Thursday of the 35th Week
ltx/en_us_rsv/le.ep.mc.d362:lemcLI.Epistle.version	@ltx/en_us_rsv/properties:version.designation
