ltx/en_us_rsv/le.go.me.m02.d19:lemeLI.Gospel.book_abbr	@ltx/en_us_rsv/bible:John.abbr
ltx/en_us_rsv/le.go.me.m02.d19:lemeLI.Gospel.book_string	@ltx/en_us_rsv/bible:John.text
ltx/en_us_rsv/le.go.me.m02.d19:lemeLI.Gospel.chapverse	15:12 – 13, 18 – 19
ltx/en_us_rsv/le.go.me.m02.d19:lemeLI.Gospel.incipit	This is my commandment, that you love one another…
ltx/en_us_rsv/le.go.me.m02.d19:lemeLI.Gospel.text	The Lord said to his disciples, “This is my commandment, that you love one another as I have loved you. Greater love has no man than this, that a man lay down his life for his friends. If the world hates you, know that it has hated me before it hated you. If you were of the world, the world would love its own; but because you are not of the world, but I chose you out of the world, therefore the world hates you.”
ltx/en_us_rsv/le.go.me.m02.d19:lemeLI.Gospel.title	For the Saint
ltx/en_us_rsv/le.go.me.m02.d19:lemeLI.Gospel.title_abbr	For the Saint
ltx/en_us_rsv/le.go.me.m02.d19:lemeLI.Gospel.version	@ltx/en_us_rsv/properties:version.designation
ltx/en_us_rsv/le.go.me.m02.d19:lemeMA.Gospel.book_abbr	@ltx/en_us_rsv/bible:Matthew.abbr
ltx/en_us_rsv/le.go.me.m02.d19:lemeMA.Gospel.book_string	@ltx/en_us_rsv/bible:Matthew.text
ltx/en_us_rsv/le.go.me.m02.d19:lemeMA.Gospel.chapverse	6:19 – 21
ltx/en_us_rsv/le.go.me.m02.d19:lemeMA.Gospel.incipit	Do not lay up for yourselves treasures on earth…
ltx/en_us_rsv/le.go.me.m02.d19:lemeMA.Gospel.text	The Lord said to his disciples, “Do not lay up for yourselves treasures on earth, where moth and rust consume and where thieves break in and steal, but lay up for yourselves treasures in heaven, where neither moth nor rust consumes and where thieves do not break in and steal. For where your treasure is, there will your heart be also.”
ltx/en_us_rsv/le.go.me.m02.d19:lemeMA.Gospel.title	For the Saint
ltx/en_us_rsv/le.go.me.m02.d19:lemeMA.Gospel.title_abbr	For the Saint
ltx/en_us_rsv/le.go.me.m02.d19:lemeMA.Gospel.version	@ltx/en_us_rsv/properties:version.designation
