ltx/en_us_rsv/le.go.mc.d203:lemcLI.Gospel.book_abbr	@ltx/en_us_rsv/bible:Matthew.abbr
ltx/en_us_rsv/le.go.mc.d203:lemcLI.Gospel.book_string	@ltx/en_us_rsv/bible:Matthew.text
ltx/en_us_rsv/le.go.mc.d203:lemcLI.Gospel.chapverse	20:29 – 34
ltx/en_us_rsv/le.go.mc.d203:lemcLI.Gospel.incipit	As Jesus went out of Jericho…
ltx/en_us_rsv/le.go.mc.d203:lemcLI.Gospel.text	At that time, as Jesus went out of Jericho, a great crowd followed him. And behold, two blind men sitting by the roadside, when they heard that Jesus was passing by, cried out, “Have mercy on us, Son of David!” The crowd rebuked them, telling them to be silent; but they cried out the more, “Lord, have mercy on us, Son of David!” And Jesus stopped and called them, saying, “What do you want me to do for you?” They said to him, “Lord, let our eyes be opened.” And Jesus in pity touched their eyes, and immediately they received their sight and followed him.
ltx/en_us_rsv/le.go.mc.d203:lemcLI.Gospel.title	Saturday of the 12th Week of Matthew
ltx/en_us_rsv/le.go.mc.d203:lemcLI.Gospel.title_abbr	Saturday of the 12th Week
ltx/en_us_rsv/le.go.mc.d203:lemcLI.Gospel.version	@ltx/en_us_rsv/properties:version.designation
