ltx/en_us_rsv/le.ep.me.m01.d23:lemeLI.Epistle.book_abbr	@ltx/en_us_rsv/le.ep.me.m11.d24:lemeLI.Epistle.book_abbr
ltx/en_us_rsv/le.ep.me.m01.d23:lemeLI.Epistle.book_string	@ltx/en_us_rsv/le.ep.me.m11.d24:lemeLI.Epistle.book_string
ltx/en_us_rsv/le.ep.me.m01.d23:lemeLI.Epistle.chapverse	@ltx/en_us_rsv/le.ep.me.m11.d24:lemeLI.Epistle.chapverse
ltx/en_us_rsv/le.ep.me.m01.d23:lemeLI.Epistle.incipit	@ltx/en_us_rsv/le.ep.me.m11.d24:lemeLI.Epistle.incipit
ltx/en_us_rsv/le.ep.me.m01.d23:lemeLI.Epistle.text	@ltx/en_us_rsv/le.ep.me.m11.d24:lemeLI.Epistle.text
ltx/en_us_rsv/le.ep.me.m01.d23:lemeLI.Epistle.title	For the Saint
ltx/en_us_rsv/le.ep.me.m01.d23:lemeLI.Epistle.title_abbr	For the Saint
ltx/en_us_rsv/le.ep.me.m01.d23:lemeLI.Epistle.version	@ltx/en_us_rsv/le.ep.me.m11.d24:lemeLI.Epistle.version
