ltx/en_us_rsv/le.go.lu.d051:leluLI.Gospel.book_abbr	@ltx/en_us_rsv/bible:Luke.abbr
ltx/en_us_rsv/le.go.lu.d051:leluLI.Gospel.book_string	@ltx/en_us_rsv/bible:Luke.text
ltx/en_us_rsv/le.go.lu.d051:leluLI.Gospel.chapverse	12:42 – 48
ltx/en_us_rsv/le.go.lu.d051:leluLI.Gospel.incipit	The Lord said, “Who then is the faithful and wise steward…
ltx/en_us_rsv/le.go.lu.d051:leluLI.Gospel.text	The Lord said, “Who then is the faithful and wise steward, whom his master will set over his household, to give them their portion of food at the proper time? Blessed is that servant whom his master when he comes will find so doing. Truly, I say to you, he will set him over all his possessions. But if that servant says to himself, ‘My master is delayed in coming,’ and begins to beat the menservants and the maidservants, and to eat and drink and get drunk, the master of that servant will come on a day when he does not expect him and at an hour he does not know, and will cut him in pieces him, and put him with the unfaithful. And that servant who knew his master’s will, but did not make ready or act according to his will, shall receive a severe beating. But he who did not know, and did what deserved a beating, shall receive a light beating. Every one to whom much is given, of him will much be required; and of him to whom men commit much they will demand the more.”
ltx/en_us_rsv/le.go.lu.d051:leluLI.Gospel.title	Tuesday of the 8th Week of Luke
ltx/en_us_rsv/le.go.lu.d051:leluLI.Gospel.title_abbr	Tuesday of the 8th Week of Luke
ltx/en_us_rsv/le.go.lu.d051:leluLI.Gospel.version	@ltx/en_us_rsv/properties:version.designation
