ltx/en_us_rsv/le.go.me.m09.d08:lemeLI.Gospel.book_abbr	@ltx/en_us_rsv/le.go.ge.theotokos:legeLI.Gospel.book_abbr
ltx/en_us_rsv/le.go.me.m09.d08:lemeLI.Gospel.book_string	@ltx/en_us_rsv/le.go.ge.theotokos:legeLI.Gospel.book_string
ltx/en_us_rsv/le.go.me.m09.d08:lemeLI.Gospel.chapverse	@ltx/en_us_rsv/le.go.ge.theotokos:legeLI.Gospel.chapverse
ltx/en_us_rsv/le.go.me.m09.d08:lemeLI.Gospel.incipit	@ltx/en_us_rsv/le.go.ge.theotokos:legeLI.Gospel.incipit
ltx/en_us_rsv/le.go.me.m09.d08:lemeLI.Gospel.text	@ltx/en_us_rsv/le.go.ge.theotokos:legeLI.Gospel.text
ltx/en_us_rsv/le.go.me.m09.d08:lemeLI.Gospel.title	For the Feast
ltx/en_us_rsv/le.go.me.m09.d08:lemeLI.Gospel.title_abbr	For the Feast
ltx/en_us_rsv/le.go.me.m09.d08:lemeLI.Gospel.version	@ltx/en_us_rsv/le.go.ge.theotokos:legeLI.Gospel.version
ltx/en_us_rsv/le.go.me.m09.d08:lemeMA.Gospel.book_abbr	@ltx/en_us_rsv/le.go.ge.theotokos:legeMA.Gospel.book_abbr
ltx/en_us_rsv/le.go.me.m09.d08:lemeMA.Gospel.book_string	@ltx/en_us_rsv/le.go.ge.theotokos:legeMA.Gospel.book_string
ltx/en_us_rsv/le.go.me.m09.d08:lemeMA.Gospel.chapverse	@ltx/en_us_rsv/le.go.ge.theotokos:legeMA.Gospel.chapverse
ltx/en_us_rsv/le.go.me.m09.d08:lemeMA.Gospel.incipit	@ltx/en_us_rsv/le.go.ge.theotokos:legeMA.Gospel.incipit
ltx/en_us_rsv/le.go.me.m09.d08:lemeMA.Gospel.text	@ltx/en_us_rsv/le.go.ge.theotokos:legeMA.Gospel.text
ltx/en_us_rsv/le.go.me.m09.d08:lemeMA.Gospel.title	For the Feast
ltx/en_us_rsv/le.go.me.m09.d08:lemeMA.Gospel.title_abbr	For the Feast
ltx/en_us_rsv/le.go.me.m09.d08:lemeMA.Gospel.version	@ltx/en_us_rsv/le.go.ge.theotokos:legeMA.Gospel.version
