ltx/en_us_rsv/le.ep.mc.d137:lemcLI.Epistle.book_abbr	@ltx/en_us_rsv/bible:Romans.abbr
ltx/en_us_rsv/le.ep.mc.d137:lemcLI.Epistle.book_string	@ltx/en_us_rsv/bible:Romans.text
ltx/en_us_rsv/le.ep.mc.d137:lemcLI.Epistle.chapverse	8:2 – 13
ltx/en_us_rsv/le.ep.mc.d137:lemcLI.Epistle.incipit	The law of the Spirit of life…
ltx/en_us_rsv/le.ep.mc.d137:lemcLI.Epistle.text	Brethren, the law of the Spirit of life in Christ Jesus has set me free from the law of sin and death. For God has done what the law, weakened by the flesh, could not do: sending his own Son in the likeness of sinful flesh and for sin, he condemned sin in the flesh, in order that the just requirement of the law might be fulfilled in us, who walk not according to the flesh but according to the Spirit. For those who live according to the flesh set their minds on the things of the flesh, but those who live according to the Spirit set their minds on the things of the Spirit. To set the mind on the flesh is death, but to set the mind on the Spirit is life and peace. For the mind that is set on the flesh is hostile to God; it does not submit to God’s law, indeed it cannot; and those who are in the flesh cannot please God. But you are not in the flesh, you are in the Spirit, if in fact the Spirit of God dwells in you. Any one who does not have the Spirit of Christ does not belong to him. But if Christ is in you, although your bodies are dead because of sin, your spirits are alive because of righteousness. If the Spirit of him who raised Jesus from the dead dwells in you, he who raised Christ Jesus from the dead will give life to your mortal bodies also through his Spirit which dwells in you. So then, brethren, we are debtors, not to the flesh, to live according to the flesh-for if you live according to the flesh you will die, but if by the Spirit you put to death the deeds of the body you will live.
ltx/en_us_rsv/le.ep.mc.d137:lemcLI.Epistle.title	Wednesday of the 3rd Week
ltx/en_us_rsv/le.ep.mc.d137:lemcLI.Epistle.title_abbr	Wednesday of the 3rd Week
ltx/en_us_rsv/le.ep.mc.d137:lemcLI.Epistle.version	@ltx/en_us_rsv/properties:version.designation
