ltx/en_us_rsv/le.go.me.m06.d29:lemeLI.Gospel.book_abbr	@ltx/en_us_rsv/bible:Matthew.abbr
ltx/en_us_rsv/le.go.me.m06.d29:lemeLI.Gospel.book_string	@ltx/en_us_rsv/bible:Matthew.text
ltx/en_us_rsv/le.go.me.m06.d29:lemeLI.Gospel.chapverse	16:13 – 19
ltx/en_us_rsv/le.go.me.m06.d29:lemeLI.Gospel.incipit	When Jesus came into the district off Caesarea Philippi…
ltx/en_us_rsv/le.go.me.m06.d29:lemeLI.Gospel.text	At that time, when Jesus came into the district of Caesarea Philippi, he asked his disciples, “Who do men say that the Son of man is?” And they said, “Some say John the Baptist, others say Elijah, and others Jeremiah or one of the prophets.” He said to them, “But who do you say that I am?” Simon Peter replied, “You are the Christ, the Son of the living God.” And Jesus answered him, “Blessed are you, Simon son of Jonah! For flesh and blood has not revealed this to you, but my Father who is in heaven. And I tell you, you are Peter, and on this rock I will build my church, and the gates of Hades shall not prevail against it. I will give you the keys of the kingdom of heaven, and whatever you bind on earth shall be bound in heaven, and whatever you loose on earth shall be loosed in heaven.”
ltx/en_us_rsv/le.go.me.m06.d29:lemeLI.Gospel.title	For the Apostles
ltx/en_us_rsv/le.go.me.m06.d29:lemeLI.Gospel.title_abbr	For the Apostles
ltx/en_us_rsv/le.go.me.m06.d29:lemeLI.Gospel.version	@ltx/en_us_rsv/properties:version.designation
ltx/en_us_rsv/le.go.me.m06.d29:lemeMA.Gospel.book_abbr	@ltx/en_us_rsv/le.go.eo.w11:leeoMA.Gospel.book_abbr
ltx/en_us_rsv/le.go.me.m06.d29:lemeMA.Gospel.book_string	@ltx/en_us_rsv/le.go.eo.w11:leeoMA.Gospel.book_string
ltx/en_us_rsv/le.go.me.m06.d29:lemeMA.Gospel.chapverse	@ltx/en_us_rsv/le.go.eo.w11:leeoMA.Gospel.chapverse
ltx/en_us_rsv/le.go.me.m06.d29:lemeMA.Gospel.incipit	@ltx/en_us_rsv/le.go.eo.w11:leeoMA.Gospel.incipit
ltx/en_us_rsv/le.go.me.m06.d29:lemeMA.Gospel.text	@ltx/en_us_rsv/le.go.eo.w11:leeoMA.Gospel.text
ltx/en_us_rsv/le.go.me.m06.d29:lemeMA.Gospel.title	For the Apostles
ltx/en_us_rsv/le.go.me.m06.d29:lemeMA.Gospel.title_abbr	For the Apostles
ltx/en_us_rsv/le.go.me.m06.d29:lemeMA.Gospel.version	@ltx/en_us_rsv/properties:version.designation
