ltx/en_us_rsv/le.go.me.m05.d08:lemeLI.Gospel.book_abbr	@ltx/en_us_rsv/bible:John.abbr
ltx/en_us_rsv/le.go.me.m05.d08:lemeLI.Gospel.book_string	@ltx/en_us_rsv/bible:John.text
ltx/en_us_rsv/le.go.me.m05.d08:lemeLI.Gospel.chapverse	19:25 – 27, 21:24 – 25
ltx/en_us_rsv/le.go.me.m05.d08:lemeLI.Gospel.incipit	Standing by the cross of Jesus…
ltx/en_us_rsv/le.go.me.m05.d08:lemeLI.Gospel.text	At that time, standing by the cross of Jesus were his mother, and his mother’s sister, Mary the wife of Clopas, and Mary Magdalene. When Jesus saw his mother, and the disciple whom he loved standing near, he said to his mother, “Woman, behold, your son!” Then he said to the disciple, “Behold, your mother!” And from that hour the disciple took her to his own home. This is the disciple who is bearing witness to these things, and who has written these things; and we know that his testimony is true. But there are also many other things which Jesus did; were every one of them to be written, I suppose that the world itself could not contain the books that would be written.
ltx/en_us_rsv/le.go.me.m05.d08:lemeLI.Gospel.title	For the Evangelist
ltx/en_us_rsv/le.go.me.m05.d08:lemeLI.Gospel.title_abbr	For the Evangelist
ltx/en_us_rsv/le.go.me.m05.d08:lemeLI.Gospel.version	@ltx/en_us_rsv/properties:version.designation
ltx/en_us_rsv/le.go.me.m05.d08:lemeLI.Gospel2.book_abbr	@ltx/en_us_rsv/le.go.mc.d145:lemcLI.Gospel.book_abbr
ltx/en_us_rsv/le.go.me.m05.d08:lemeLI.Gospel2.book_string	@ltx/en_us_rsv/le.go.mc.d145:lemcLI.Gospel.book_string
ltx/en_us_rsv/le.go.me.m05.d08:lemeLI.Gospel2.chapverse	@ltx/en_us_rsv/le.go.mc.d145:lemcLI.Gospel.chapverse
ltx/en_us_rsv/le.go.me.m05.d08:lemeLI.Gospel2.incipit	@ltx/en_us_rsv/le.go.mc.d145:lemcLI.Gospel.incipit
ltx/en_us_rsv/le.go.me.m05.d08:lemeLI.Gospel2.text	@ltx/en_us_rsv/le.go.mc.d145:lemcLI.Gospel.text
ltx/en_us_rsv/le.go.me.m05.d08:lemeLI.Gospel2.title	For the Saint
ltx/en_us_rsv/le.go.me.m05.d08:lemeLI.Gospel2.title_abbr	For the Saint
ltx/en_us_rsv/le.go.me.m05.d08:lemeLI.Gospel2.version	@ltx/en_us_rsv/le.go.mc.d145:lemcLI.Gospel.version
ltx/en_us_rsv/le.go.me.m05.d08:lemeMA.Gospel.book_abbr	@ltx/en_us_rsv/le.go.eo.w11:leeoMA.Gospel.book_abbr
ltx/en_us_rsv/le.go.me.m05.d08:lemeMA.Gospel.book_string	@ltx/en_us_rsv/le.go.eo.w11:leeoMA.Gospel.book_string
ltx/en_us_rsv/le.go.me.m05.d08:lemeMA.Gospel.chapverse	@ltx/en_us_rsv/le.go.eo.w11:leeoMA.Gospel.chapverse
ltx/en_us_rsv/le.go.me.m05.d08:lemeMA.Gospel.incipit	@ltx/en_us_rsv/le.go.eo.w11:leeoMA.Gospel.incipit
ltx/en_us_rsv/le.go.me.m05.d08:lemeMA.Gospel.text	@ltx/en_us_rsv/le.go.eo.w11:leeoMA.Gospel.text
ltx/en_us_rsv/le.go.me.m05.d08:lemeMA.Gospel.title	For the Evangelist
ltx/en_us_rsv/le.go.me.m05.d08:lemeMA.Gospel.title_abbr	For the Evangelist
ltx/en_us_rsv/le.go.me.m05.d08:lemeMA.Gospel.version	@ltx/en_us_rsv/le.go.eo.w11:leeoMA.Gospel.version
