ltx/en_us_rsv/le.go.me.m12.d16:lemeLI.Gospel.book_abbr	@ltx/en_us_rsv/le.go.ge.hierarch:legeLI.Gospel.book_abbr
ltx/en_us_rsv/le.go.me.m12.d16:lemeLI.Gospel.book_string	@ltx/en_us_rsv/le.go.ge.hierarch:legeLI.Gospel.book_string
ltx/en_us_rsv/le.go.me.m12.d16:lemeLI.Gospel.chapverse	@ltx/en_us_rsv/le.go.ge.hierarch:legeLI.Gospel.chapverse
ltx/en_us_rsv/le.go.me.m12.d16:lemeLI.Gospel.incipit	@ltx/en_us_rsv/le.go.ge.hierarch:legeLI.Gospel.incipit
ltx/en_us_rsv/le.go.me.m12.d16:lemeLI.Gospel.text	@ltx/en_us_rsv/le.go.ge.hierarch:legeLI.Gospel.text
ltx/en_us_rsv/le.go.me.m12.d16:lemeLI.Gospel.title	Liturgy. For the Saint
ltx/en_us_rsv/le.go.me.m12.d16:lemeLI.Gospel.title_abbr	Liturgy. For the Saint
ltx/en_us_rsv/le.go.me.m12.d16:lemeLI.Gospel.version	@ltx/en_us_rsv/le.go.ge.hierarch:legeLI.Gospel.version
ltx/en_us_rsv/le.go.me.m12.d16:lemeMA.Gospel.book_abbr	@ltx/en_us_rsv/le.go.ge.hierarch:legeMA.Gospel.book_abbr
ltx/en_us_rsv/le.go.me.m12.d16:lemeMA.Gospel.book_string	@ltx/en_us_rsv/le.go.ge.hierarch:legeMA.Gospel.book_string
ltx/en_us_rsv/le.go.me.m12.d16:lemeMA.Gospel.chapverse	@ltx/en_us_rsv/le.go.ge.hierarch:legeMA.Gospel.chapverse
ltx/en_us_rsv/le.go.me.m12.d16:lemeMA.Gospel.incipit	@ltx/en_us_rsv/le.go.ge.hierarch:legeMA.Gospel.incipit
ltx/en_us_rsv/le.go.me.m12.d16:lemeMA.Gospel.text	@ltx/en_us_rsv/le.go.ge.hierarch:legeMA.Gospel.text
ltx/en_us_rsv/le.go.me.m12.d16:lemeMA.Gospel.title	Orthros. For the Saint
ltx/en_us_rsv/le.go.me.m12.d16:lemeMA.Gospel.title_abbr	Orthros. For the Saint
ltx/en_us_rsv/le.go.me.m12.d16:lemeMA.Gospel.version	@ltx/en_us_rsv/le.go.ge.hierarch:legeMA.Gospel.version
