ltx/en_us_rsv/le.ep.me.m10.d17:lemeLI.Epistle.book_abbr	@ltx/en_us_rsv/le.ep.mc.d142:lemcLI.Epistle.book_abbr
ltx/en_us_rsv/le.ep.me.m10.d17:lemeLI.Epistle.book_string	@ltx/en_us_rsv/le.ep.mc.d142:lemcLI.Epistle.book_string
ltx/en_us_rsv/le.ep.me.m10.d17:lemeLI.Epistle.chapverse	@ltx/en_us_rsv/le.ep.mc.d142:lemcLI.Epistle.chapverse
ltx/en_us_rsv/le.ep.me.m10.d17:lemeLI.Epistle.incipit	@ltx/en_us_rsv/le.ep.mc.d142:lemcLI.Epistle.incipit
ltx/en_us_rsv/le.ep.me.m10.d17:lemeLI.Epistle.text	@ltx/en_us_rsv/le.ep.mc.d142:lemcLI.Epistle.text
ltx/en_us_rsv/le.ep.me.m10.d17:lemeLI.Epistle.title	For the Prophet
ltx/en_us_rsv/le.ep.me.m10.d17:lemeLI.Epistle.title_abbr	For the Prophet
ltx/en_us_rsv/le.ep.me.m10.d17:lemeLI.Epistle.version	@ltx/en_us_rsv/le.ep.mc.d142:lemcLI.Epistle.version
