ltx/en_us_rsv/le.go.me.m06.d26:lemeLI.Gospel.book_abbr	@ltx/en_us_rsv/le.go.lu.d012:leluLI.Gospel.book_abbr
ltx/en_us_rsv/le.go.me.m06.d26:lemeLI.Gospel.book_string	@ltx/en_us_rsv/le.go.lu.d012:leluLI.Gospel.book_string
ltx/en_us_rsv/le.go.me.m06.d26:lemeLI.Gospel.chapverse	@ltx/en_us_rsv/le.go.lu.d012:leluLI.Gospel.chapverse
ltx/en_us_rsv/le.go.me.m06.d26:lemeLI.Gospel.incipit	@ltx/en_us_rsv/le.go.lu.d012:leluLI.Gospel.incipit
ltx/en_us_rsv/le.go.me.m06.d26:lemeLI.Gospel.text	@ltx/en_us_rsv/le.go.lu.d012:leluLI.Gospel.text
ltx/en_us_rsv/le.go.me.m06.d26:lemeLI.Gospel.title	For the Saint
ltx/en_us_rsv/le.go.me.m06.d26:lemeLI.Gospel.title_abbr	For the Saint
ltx/en_us_rsv/le.go.me.m06.d26:lemeLI.Gospel.version	@ltx/en_us_rsv/le.go.lu.d012:leluLI.Gospel.version
