ltx/en_us_rsv/le.go.mc.d105:lemcLI.Gospel.book_abbr	@ltx/en_us_rsv/bible:John.abbr
ltx/en_us_rsv/le.go.mc.d105:lemcLI.Gospel.book_string	@ltx/en_us_rsv/bible:John.text
ltx/en_us_rsv/le.go.mc.d105:lemcLI.Gospel.chapverse	10:27 – 38
ltx/en_us_rsv/le.go.mc.d105:lemcLI.Gospel.incipit	My sheep hear my voice…
ltx/en_us_rsv/le.go.mc.d105:lemcLI.Gospel.text	The Lord said to the Jews who came to him, “My sheep hear my voice, and I know them, and they follow me; and I give them eternal life, and they shall never perish, and no one shall snatch them out of my hand. My Father, who has given them to me, is greater than all, and no one is able to snatch them out of the Father’s hand. I and the Father are one.” The Jews took up stones again to stone him. Jesus answered them, “I have shown you many good works from my Father; for which of these do you stone me?” The Jews answered him, “It is not for a good work that we stone you but for blasphemy; because you, being a man, make yourself God.” Jesus answered them, “Is it not written in your law, ‘I said, you are gods?’ If he called them gods to whom the word of God came (and scripture cannot be broken), do you say of him whom the Father consecrated and sent into the world, ‘You are blaspheming,’ because I said, ‘I am the Son of God’? If I am not doing the works of my Father, then do not believe me; but if I do them, even though you do not believe me, believe my works, that you may know and understand that the Father is in me, and I in him.”
ltx/en_us_rsv/le.go.mc.d105:lemcLI.Gospel.title	Saturday of the 5th Week
ltx/en_us_rsv/le.go.mc.d105:lemcLI.Gospel.title_abbr	Saturday of the 5th Week
ltx/en_us_rsv/le.go.mc.d105:lemcLI.Gospel.version	@ltx/en_us_rsv/properties:version.designation
