ltx/en_us_rsv/le.ep.mc.d135:lemcLI.Epistle.book_abbr	@ltx/en_us_rsv/bible:Romans.abbr
ltx/en_us_rsv/le.ep.mc.d135:lemcLI.Epistle.book_string	@ltx/en_us_rsv/bible:Romans.text
ltx/en_us_rsv/le.ep.mc.d135:lemcLI.Epistle.chapverse	7:1 – 13
ltx/en_us_rsv/le.ep.mc.d135:lemcLI.Epistle.incipit	Brethren, I am speaking to those who know the law…
ltx/en_us_rsv/le.ep.mc.d135:lemcLI.Epistle.text	Brethren, I am speaking to those who know the law. Do you not know that the law is binding on a person only during his life? Thus a married woman is bound by law to her husband as long as he lives; but if her husband dies she is discharged from the law concerning the husband. Accordingly, she will be called an adulteress if she lives with another man while her husband is alive. But if her husband dies she is free from that law, and if she marries another man she is not an adulteress. Likewise, my brethren, you have died to the law through the body of Christ, so that you may belong to another, to him who has been raised from the dead in order that we may bear fruit for God. While we were living in the flesh, our sinful passions, aroused by the law, were at work in our members to bear fruit for death. But now we are discharged from the law, dead to that which held us captive, so that we serve not under the old written code but in the new life of the Spirit. What then shall we say? That the law is sin? By no means! Yet, if it had not been for the law, I should not have known sin. I should not have known what it is to covet if the law had not said, “You shall not covet.” But sin, finding opportunity in the commandment, wrought in me all kinds of covetousness. Apart from the law sin lies dead. I was once alive apart from the law, but when the commandment came, sin revived and I died; the very commandment which promised life proved to be death to me. For sin, finding opportunity in the commandment, deceived me and by it killed me. So the law is holy, and the commandment is holy and just and good. Did that which is good, then, bring death to me? By no means! It was sin, working death in me through what is good, in order that sin might be shown to be sin, and through the commandment might become sinful beyond measure.
ltx/en_us_rsv/le.ep.mc.d135:lemcLI.Epistle.title	Monday of the 3rd Week
ltx/en_us_rsv/le.ep.mc.d135:lemcLI.Epistle.title_abbr	Monday of the 3rd Week
ltx/en_us_rsv/le.ep.mc.d135:lemcLI.Epistle.version	@ltx/en_us_rsv/properties:version.designation
