ltx/en_us_rsv/le.go.mc.d081:lemcLI.Gospel.book_abbr	@ltx/en_us_rsv/bible:John.abbr
ltx/en_us_rsv/le.go.mc.d081:lemcLI.Gospel.book_string	@ltx/en_us_rsv/bible:John.text
ltx/en_us_rsv/le.go.mc.d081:lemcLI.Gospel.chapverse	5:17 – 24
ltx/en_us_rsv/le.go.mc.d081:lemcLI.Gospel.incipit	My Father is working still…
ltx/en_us_rsv/le.go.mc.d081:lemcLI.Gospel.text	The Lord said to the Jews who came to him, “My Father is working still, and I am working.” This was why the Jews sought all the more to kill him, because he not only broke the sabbath but also called God his own Father, making himself equal with God. Jesus said to them, “Truly, truly, I say to you, the Son can do nothing of his own accord, but only what he sees the Father doing; for whatever he does, that the Son does likewise. For the Father loves the Son, and shows him all that he himself is doing; and greater works than these he will show him, that you may marvel. For as the Father raises the dead and gives them life, so also the Son gives life to whom he will. The Father judges no one, but has given all judgment to the Son, that all may honor the Son, even as they honor the Father. He who does not honor the Son does not honor the Father who sent him. Truly, truly, I say to you, he who hears my word and believes him who sent me, has eternal life; he does not come into judgment, but has passed from death to life.”
ltx/en_us_rsv/le.go.mc.d081:lemcLI.Gospel.title	Wednesday of the 2nd Week
ltx/en_us_rsv/le.go.mc.d081:lemcLI.Gospel.title_abbr	Wednesday of the 2nd Week
ltx/en_us_rsv/le.go.mc.d081:lemcLI.Gospel.version	@ltx/en_us_rsv/properties:version.designation
