ltx/en_us_rsv/le.go.mc.d187:lemcLI.Gospel.book_abbr	@ltx/en_us_rsv/bible:Matthew.abbr
ltx/en_us_rsv/le.go.mc.d187:lemcLI.Gospel.book_string	@ltx/en_us_rsv/bible:Matthew.text
ltx/en_us_rsv/le.go.mc.d187:lemcLI.Gospel.chapverse	21:43 – 46
ltx/en_us_rsv/le.go.mc.d187:lemcLI.Gospel.incipit	I tell you, the kingdom of God will be taken away…
ltx/en_us_rsv/le.go.mc.d187:lemcLI.Gospel.text	The Lord said to the Jews who had come to him: “I tell you, the kingdom of God will be taken away from you and given to a nation producing the fruits of it. And he who falls on this stone will be broken to pieces; but when it falls on any one, it will crush him.” When the chief priests and the Pharisees heard his parables, they perceived that he was speaking about them. But when they tried to arrest him, they feared the multitudes, because they held him to be a prophet.
ltx/en_us_rsv/le.go.mc.d187:lemcLI.Gospel.title	Thursday of the 10th Week of Matthew
ltx/en_us_rsv/le.go.mc.d187:lemcLI.Gospel.title_abbr	Thursday of the 10th Week
ltx/en_us_rsv/le.go.mc.d187:lemcLI.Gospel.version	@ltx/en_us_rsv/properties:version.designation
