ltx/en_us_rsv/le.ep.mc.d094:lemcLI.Epistle.book_abbr	@ltx/en_us_rsv/bible:Acts.abbr
ltx/en_us_rsv/le.ep.mc.d094:lemcLI.Epistle.book_string	@ltx/en_us_rsv/bible:Acts.text
ltx/en_us_rsv/le.ep.mc.d094:lemcLI.Epistle.chapverse	10:21 – 33
ltx/en_us_rsv/le.ep.mc.d094:lemcLI.Epistle.incipit	Peter went down to the men…
ltx/en_us_rsv/le.ep.mc.d094:lemcLI.Epistle.text	In those days, Peter went down to the men sent by Cornelius to him and said, “I am the one you are looking for; what is the reason for your coming?” And they said, “Cornelius, a centurion, an upright and God-fearing man, who is well-spoken of by the whole Jewish nation, was directed by a holy angel to send for you to come to his house, and to hear what you have to say.” So he called them in to be his guests. The next day he rose and went off with them, and some of the brethren from Joppa accompanied him. And on the following day they entered Caesarea. Cornelius was expecting them and had called together his kinsmen and close friends. When Peter entered, Cornelius met him and fell down at his feet and worshiped him. But Peter lifted him up, saying, “Stand up; I too am a man.” And as he talked with him, he went in and found many persons gathered; and he said to them, “You yourselves know how unlawful it is for a Jew to associate with or to visit any one of another nation; but God has shown me that I should not call any man common or unclean. So when I was sent for, I came without objection. I ask then why you sent for me.” And Cornelius said, “Four days ago, about this hour, I was keeping the ninth hour of prayer in my house; and behold, a man stood before me in bright apparel, saying, ‘Cornelius, your prayer has been heard and your alms have been remembered before God. Send therefore to Joppa and ask for Simon who is called Peter; he is lodging in the house of Simon, a tanner, by the seaside.’ So I sent to you at once, and you have been kind enough to come. Now therefore we are all here present in the sight of God, to hear all that you have been commanded by the Lord.”
ltx/en_us_rsv/le.ep.mc.d094:lemcLI.Epistle.title	Tuesday of the 4th Week
ltx/en_us_rsv/le.ep.mc.d094:lemcLI.Epistle.title_abbr	Tuesday of the 4th Week
ltx/en_us_rsv/le.ep.mc.d094:lemcLI.Epistle.version	@ltx/en_us_rsv/properties:version.designation
