ltx/en_us_rsv/le.ep.me.m03.d26:lemeLI.Epistle.book_abbr	@ltx/en_us_rsv/le.ep.me.m11.d08:lemeLI.Epistle.book_abbr
ltx/en_us_rsv/le.ep.me.m03.d26:lemeLI.Epistle.book_string	@ltx/en_us_rsv/le.ep.me.m11.d08:lemeLI.Epistle.book_string
ltx/en_us_rsv/le.ep.me.m03.d26:lemeLI.Epistle.chapverse	@ltx/en_us_rsv/le.ep.me.m11.d08:lemeLI.Epistle.chapverse
ltx/en_us_rsv/le.ep.me.m03.d26:lemeLI.Epistle.incipit	@ltx/en_us_rsv/le.ep.me.m11.d08:lemeLI.Epistle.incipit
ltx/en_us_rsv/le.ep.me.m03.d26:lemeLI.Epistle.text	@ltx/en_us_rsv/le.ep.me.m11.d08:lemeLI.Epistle.text
ltx/en_us_rsv/le.ep.me.m03.d26:lemeLI.Epistle.title	For the Archangel
ltx/en_us_rsv/le.ep.me.m03.d26:lemeLI.Epistle.title_abbr	For the Archangel
ltx/en_us_rsv/le.ep.me.m03.d26:lemeLI.Epistle.version	@ltx/en_us_rsv/le.ep.me.m11.d08:lemeLI.Epistle.version
