ltx/en_us_rsv/le.go.mc.d096:lemcLI.Gospel.book_abbr	@ltx/en_us_rsv/bible:John.abbr
ltx/en_us_rsv/le.go.mc.d096:lemcLI.Gospel.book_string	@ltx/en_us_rsv/bible:John.text
ltx/en_us_rsv/le.go.mc.d096:lemcLI.Gospel.chapverse	8:12 – 20
ltx/en_us_rsv/le.go.mc.d096:lemcLI.Gospel.incipit	I am the light of the world…
ltx/en_us_rsv/le.go.mc.d096:lemcLI.Gospel.text	The Lord said to the Jews who came to him, “I am the light of the world; he who follows me will not walk in darkness, but will have the light of life.” The Pharisees then said to him, “You are bearing witness to yourself; your testimony is not true.” Jesus answered, “Even if I do bear witness to myself, my testimony is true, for I know whence I have come and whither I am going, but you do not know whence I come or whither I am going. You judge according to the flesh, I judge no one. Yet even if I do judge, my judgment is true, for it is not I alone that judge, but I and the Father who sent me. In your law it is written that the testimony of two men is true; I bear witness to myself, and the Father who sent me bears witness to me.” They said to him therefore, “Where is your Father?” Jesus answered, “You know neither me nor my Father; if you knew me, you would know my Father also.” These words he spoke in the treasury, as he taught in the temple; but no one arrested him, because his hour had not yet come.
ltx/en_us_rsv/le.go.mc.d096:lemcLI.Gospel.title	Thursday of the 4th Week
ltx/en_us_rsv/le.go.mc.d096:lemcLI.Gospel.title_abbr	Thursday of the 4th Week
ltx/en_us_rsv/le.go.mc.d096:lemcLI.Gospel.version	@ltx/en_us_rsv/properties:version.designation
