ltx/en_us_roumas/miscellanea:misc.Automelon	Automelon.
ltx/en_us_roumas/miscellanea:misc.AutomelonNotMetered	
ltx/en_us_roumas/miscellanea:misc.FutureInstance	(The template is incomplete. This instance is far in the future.)
ltx/en_us_roumas/miscellanea:misc.Heirmologic	Heirmologic.
ltx/en_us_roumas/miscellanea:misc.Heirmos	Heirmos.
ltx/en_us_roumas/miscellanea:misc.HeirmosNotMetered	Heirmos (not metered).
ltx/en_us_roumas/miscellanea:misc.Idiomelon	Idiomelon.
ltx/en_us_roumas/miscellanea:misc.Mode0	Mode
ltx/en_us_roumas/miscellanea:misc.Mode1	Mode 1.
ltx/en_us_roumas/miscellanea:misc.Mode1.naked	Mode 1
ltx/en_us_roumas/miscellanea:misc.Mode2	Mode 2.
ltx/en_us_roumas/miscellanea:misc.Mode2.naked	Mode 2
ltx/en_us_roumas/miscellanea:misc.Mode3	Mode 3.
ltx/en_us_roumas/miscellanea:misc.Mode3.naked	Mode 3
ltx/en_us_roumas/miscellanea:misc.Mode4	Mode 4.
ltx/en_us_roumas/miscellanea:misc.Mode4.naked	Mode 4
ltx/en_us_roumas/miscellanea:misc.Mode5	Mode pl. 1.
ltx/en_us_roumas/miscellanea:misc.Mode5.naked	Mode pl. 1
ltx/en_us_roumas/miscellanea:misc.Mode6	Mode pl. 2.
ltx/en_us_roumas/miscellanea:misc.Mode6.naked	Mode pl. 2
ltx/en_us_roumas/miscellanea:misc.Mode7	Grave Mode.
ltx/en_us_roumas/miscellanea:misc.Mode7.naked	Grave Mode
ltx/en_us_roumas/miscellanea:misc.Mode8	Mode pl. 4.
ltx/en_us_roumas/miscellanea:misc.Mode8.naked	Mode pl. 4
ltx/en_us_roumas/miscellanea:misc.ModeNA	N/A
ltx/en_us_roumas/miscellanea:misc.ModeVariable	Mode of the first Sticheron.
ltx/en_us_roumas/miscellanea:misc.NotAvailable	(The English text of this hymn is missing, because it was either inaccessible at the time of publication or unavailable due to copyright restrictions.)
ltx/en_us_roumas/miscellanea:misc.NotMetered	(not metered)
ltx/en_us_roumas/miscellanea:misc.Ode1	Ode i.
ltx/en_us_roumas/miscellanea:misc.Ode2	Ode ii.
ltx/en_us_roumas/miscellanea:misc.Ode3	Ode iii.
ltx/en_us_roumas/miscellanea:misc.Ode4	Ode iv.
ltx/en_us_roumas/miscellanea:misc.Ode5	Ode v.
ltx/en_us_roumas/miscellanea:misc.Ode6	Ode vi.
ltx/en_us_roumas/miscellanea:misc.Ode7	Ode vii.
ltx/en_us_roumas/miscellanea:misc.Ode8	Ode viii.
ltx/en_us_roumas/miscellanea:misc.Ode9	Ode ix.
ltx/en_us_roumas/miscellanea:misc.Prosomoion	Prosomoion.
ltx/en_us_roumas/miscellanea:misc.Rnum1	I
ltx/en_us_roumas/miscellanea:misc.Rnum10	X
ltx/en_us_roumas/miscellanea:misc.Rnum2	II
ltx/en_us_roumas/miscellanea:misc.Rnum3	III
ltx/en_us_roumas/miscellanea:misc.Rnum4	IV
ltx/en_us_roumas/miscellanea:misc.Rnum5	V
ltx/en_us_roumas/miscellanea:misc.Rnum6	VI
ltx/en_us_roumas/miscellanea:misc.Rnum7	VII
ltx/en_us_roumas/miscellanea:misc.Rnum8	VIII
ltx/en_us_roumas/miscellanea:misc.Rnum9	IX
ltx/en_us_roumas/miscellanea:misc.anum1	1.
ltx/en_us_roumas/miscellanea:misc.anum10	10.
ltx/en_us_roumas/miscellanea:misc.anum11	11.
ltx/en_us_roumas/miscellanea:misc.anum12	12.
ltx/en_us_roumas/miscellanea:misc.anum13	13.
ltx/en_us_roumas/miscellanea:misc.anum14	14.
ltx/en_us_roumas/miscellanea:misc.anum15	15.
ltx/en_us_roumas/miscellanea:misc.anum16	16.
ltx/en_us_roumas/miscellanea:misc.anum17	17.
ltx/en_us_roumas/miscellanea:misc.anum18	18.
ltx/en_us_roumas/miscellanea:misc.anum19	19.
ltx/en_us_roumas/miscellanea:misc.anum2	2.
ltx/en_us_roumas/miscellanea:misc.anum20	20.
ltx/en_us_roumas/miscellanea:misc.anum21	21.
ltx/en_us_roumas/miscellanea:misc.anum22	22.
ltx/en_us_roumas/miscellanea:misc.anum23	23.
ltx/en_us_roumas/miscellanea:misc.anum24	24.
ltx/en_us_roumas/miscellanea:misc.anum25	25.
ltx/en_us_roumas/miscellanea:misc.anum26	26.
ltx/en_us_roumas/miscellanea:misc.anum27	27.
ltx/en_us_roumas/miscellanea:misc.anum28	28.
ltx/en_us_roumas/miscellanea:misc.anum29	29.
ltx/en_us_roumas/miscellanea:misc.anum3	3.
ltx/en_us_roumas/miscellanea:misc.anum30	30.
ltx/en_us_roumas/miscellanea:misc.anum31	31.
ltx/en_us_roumas/miscellanea:misc.anum32	32.
ltx/en_us_roumas/miscellanea:misc.anum33	33.
ltx/en_us_roumas/miscellanea:misc.anum4	4.
ltx/en_us_roumas/miscellanea:misc.anum5	5.
ltx/en_us_roumas/miscellanea:misc.anum6	6.
ltx/en_us_roumas/miscellanea:misc.anum7	7.
ltx/en_us_roumas/miscellanea:misc.anum8	8.
ltx/en_us_roumas/miscellanea:misc.anum9	9.
ltx/en_us_roumas/miscellanea:misc.book.BooksSources.title	Books - Sources
ltx/en_us_roumas/miscellanea:misc.book.Euchologion.name	Euchologion
ltx/en_us_roumas/miscellanea:misc.book.Heirmologion.name	Heirmologion
ltx/en_us_roumas/miscellanea:misc.book.Hieratikon.name	Hieratikon
ltx/en_us_roumas/miscellanea:misc.book.Horologion.name	Horologion
ltx/en_us_roumas/miscellanea:misc.book.MeSupplement.name	Menaion Supplement
ltx/en_us_roumas/miscellanea:misc.book.Menaion.name	Menaion
ltx/en_us_roumas/miscellanea:misc.book.Octoechos.name	Octoechos
ltx/en_us_roumas/miscellanea:misc.book.PeSupplement.name	Pentecostarion Supplement
ltx/en_us_roumas/miscellanea:misc.book.Pentecostarion.name	Pentecostarion
ltx/en_us_roumas/miscellanea:misc.book.Psalter.name	Psalter
ltx/en_us_roumas/miscellanea:misc.book.Synaxarion.name	Synaxarion
ltx/en_us_roumas/miscellanea:misc.book.Triodion.name	Triodion
ltx/en_us_roumas/miscellanea:misc.book.Typikon.name	Typikon
ltx/en_us_roumas/miscellanea:misc.bracket.close	]
ltx/en_us_roumas/miscellanea:misc.bracket.open	[
ltx/en_us_roumas/miscellanea:misc.greekquotation.left	«
ltx/en_us_roumas/miscellanea:misc.greekquotation.right	»
ltx/en_us_roumas/miscellanea:misc.horizontal_line.dash1	----------
ltx/en_us_roumas/miscellanea:misc.horizontal_line.solid1	__________
ltx/en_us_roumas/miscellanea:misc.parenthesis.close	)
ltx/en_us_roumas/miscellanea:misc.parenthesis.open	(
ltx/en_us_roumas/miscellanea:misc.punctuation.comma	,
ltx/en_us_roumas/miscellanea:misc.punctuation.ellipsis	…
ltx/en_us_roumas/miscellanea:misc.punctuation.period	.
ltx/en_us_roumas/miscellanea:misc.rnum1	i
ltx/en_us_roumas/miscellanea:misc.rnum10	x
ltx/en_us_roumas/miscellanea:misc.rnum2	ii
ltx/en_us_roumas/miscellanea:misc.rnum3	iii
ltx/en_us_roumas/miscellanea:misc.rnum4	iv
ltx/en_us_roumas/miscellanea:misc.rnum5	v
ltx/en_us_roumas/miscellanea:misc.rnum6	vi
ltx/en_us_roumas/miscellanea:misc.rnum7	vii
ltx/en_us_roumas/miscellanea:misc.rnum8	viii
ltx/en_us_roumas/miscellanea:misc.rnum9	ix
ltx/en_us_roumas/miscellanea:misc.separator.asterisk	 *
ltx/en_us_roumas/miscellanea:misc.separator.emdash	 —
ltx/en_us_roumas/miscellanea:misc.separator.endash	 –
ltx/en_us_roumas/miscellanea:misc.separator.hyphen	 -
ltx/en_us_roumas/miscellanea:misc.separator.pipe	 |
ltx/en_us_roumas/miscellanea:misc.separator.slash	 /
ltx/en_us_roumas/miscellanea:misc.vVerse	Verse:
ltx/en_us_roumas/miscellanea:misc.vVerse1	Verse 1:
ltx/en_us_roumas/miscellanea:misc.vVerse2	Verse 2:
ltx/en_us_roumas/miscellanea:misc.vVerse3	Verse 3:
ltx/en_us_roumas/miscellanea:misc.vVerse4	Verse 4:
