ltx/en_us_public/sy.m11.d30:syMA.commemoration01.couplet1.title	@ltx/en_us_dedes/sy.m11.d30:syMA.commemoration01.couplet1.title
ltx/en_us_public/sy.m11.d30:syMA.commemoration01.couplet1.verse1	@ltx/en_us_dedes/sy.m11.d30:syMA.commemoration01.couplet1.verse1
ltx/en_us_public/sy.m11.d30:syMA.commemoration01.couplet1.verse2	@ltx/en_us_dedes/sy.m11.d30:syMA.commemoration01.couplet1.verse2
ltx/en_us_public/sy.m11.d30:syMA.commemoration01.narration.p01	@ltx/en_us_dedes/sy.m11.d30:syMA.commemoration01.narration.p01
ltx/en_us_public/sy.m11.d30:syMA.commemoration01.narration.p02	@ltx/en_us_dedes/sy.m11.d30:syMA.commemoration01.narration.p02
ltx/en_us_public/sy.m11.d30:syMA.commemoration01.narration.p03	@ltx/en_us_dedes/sy.m11.d30:syMA.commemoration01.narration.p03
ltx/en_us_public/sy.m11.d30:syMA.commemoration01.narration.p04	@ltx/en_us_dedes/sy.m11.d30:syMA.commemoration01.narration.p04
ltx/en_us_public/sy.m11.d30:syMA.commemoration01.narration.p05	@ltx/en_us_dedes/sy.m11.d30:syMA.commemoration01.narration.p05
ltx/en_us_public/sy.m11.d30:syMA.commemoration01.narration.p06	@ltx/en_us_dedes/sy.m11.d30:syMA.commemoration01.narration.p06
ltx/en_us_public/sy.m11.d30:syMA.commemoration01.narration.p07	@ltx/en_us_dedes/sy.m11.d30:syMA.commemoration01.narration.p07
ltx/en_us_public/sy.m11.d30:syMA.commemoration01.narration.p08	@ltx/en_us_dedes/sy.m11.d30:syMA.commemoration01.narration.p08
ltx/en_us_public/sy.m11.d30:syMA.commemoration01.narration.p09	@ltx/en_us_dedes/sy.m11.d30:syMA.commemoration01.narration.p09
ltx/en_us_public/sy.m11.d30:syMA.commemoration01.narration.p10	@ltx/en_us_dedes/sy.m11.d30:syMA.commemoration01.narration.p10
ltx/en_us_public/sy.m11.d30:syMA.commemoration01.narration.p11	@ltx/en_us_dedes/sy.m11.d30:syMA.commemoration01.narration.p11
ltx/en_us_public/sy.m11.d30:syMA.commemoration01.narration.p12	@ltx/en_us_dedes/sy.m11.d30:syMA.commemoration01.narration.p12
ltx/en_us_public/sy.m11.d30:syMA.commemoration01.narration.p13	@ltx/en_us_dedes/sy.m11.d30:syMA.commemoration01.narration.p13
ltx/en_us_public/sy.m11.d30:syMA.commemoration01.narration.p14	@ltx/en_us_dedes/sy.m11.d30:syMA.commemoration01.narration.p14
ltx/en_us_public/sy.m11.d30:syMA.commemoration01.narration.p15	@ltx/en_us_dedes/sy.m11.d30:syMA.commemoration01.narration.p15
ltx/en_us_public/sy.m11.d30:syMA.commemoration01.narration.p16	@ltx/en_us_dedes/sy.m11.d30:syMA.commemoration01.narration.p16
ltx/en_us_public/sy.m11.d30:syMA.commemoration01.narration.p17	@ltx/en_us_dedes/sy.m11.d30:syMA.commemoration01.narration.p17
ltx/en_us_public/sy.m11.d30:syMA.commemoration01.narration.p18	@ltx/en_us_dedes/sy.m11.d30:syMA.commemoration01.narration.p18
ltx/en_us_public/sy.m11.d30:syMA.commemoration01.narration.p19	@ltx/en_us_dedes/sy.m11.d30:syMA.commemoration01.narration.p19
ltx/en_us_public/sy.m11.d30:syMA.commemoration01.narration.p20	@ltx/en_us_dedes/sy.m11.d30:syMA.commemoration01.narration.p20
ltx/en_us_public/sy.m11.d30:syMA.commemoration01.narration.p21	@ltx/en_us_dedes/sy.m11.d30:syMA.commemoration01.narration.p21
ltx/en_us_public/sy.m11.d30:syMA.commemoration01.narration.p22	@ltx/en_us_dedes/sy.m11.d30:syMA.commemoration01.narration.p22
ltx/en_us_public/sy.m11.d30:syMA.commemoration01.narration.p23	@ltx/en_us_dedes/sy.m11.d30:syMA.commemoration01.narration.p23
ltx/en_us_public/sy.m11.d30:syMA.commemoration01.single1	@ltx/en_us_dedes/sy.m11.d30:syMA.commemoration01.single1
ltx/en_us_public/sy.m11.d30:syMA.commemoration01.text	@ltx/en_us_dedes/sy.m11.d30:syMA.commemoration01.text
ltx/en_us_public/sy.m11.d30:syMA.commemoration02.couplet1.title	@ltx/en_us_dedes/sy.m11.d30:syMA.commemoration02.couplet1.title
ltx/en_us_public/sy.m11.d30:syMA.commemoration02.couplet1.verse1	@ltx/en_us_dedes/sy.m11.d30:syMA.commemoration02.couplet1.verse1
ltx/en_us_public/sy.m11.d30:syMA.commemoration02.couplet1.verse2	@ltx/en_us_dedes/sy.m11.d30:syMA.commemoration02.couplet1.verse2
ltx/en_us_public/sy.m11.d30:syMA.commemoration02.narration.p01	@ltx/en_us_dedes/sy.m11.d30:syMA.commemoration02.narration.p01
ltx/en_us_public/sy.m11.d30:syMA.commemoration02.narration.p02	@ltx/en_us_dedes/sy.m11.d30:syMA.commemoration02.narration.p02
ltx/en_us_public/sy.m11.d30:syMA.commemoration02.narration.p03	@ltx/en_us_dedes/sy.m11.d30:syMA.commemoration02.narration.p03
ltx/en_us_public/sy.m11.d30:syMA.commemoration02.narration.p04	@ltx/en_us_dedes/sy.m11.d30:syMA.commemoration02.narration.p04
ltx/en_us_public/sy.m11.d30:syMA.commemoration02.text	@ltx/en_us_dedes/sy.m11.d30:syMA.commemoration02.text
ltx/en_us_public/sy.m11.d30:syMA.lastline	@ltx/en_us_dedes/sy.m11.d30:syMA.lastline
