ltx/en_us_public/me.m01.d28:meDA.commemoration.first	@ltx/en_us_dedes/me.m01.d28:meDA.commemoration.first
ltx/en_us_public/me.m01.d28:meDA.commemoration.first_name	@ltx/en_us_dedes/me.m01.d28:meDA.commemoration.first_name
ltx/en_us_public/me.m01.d28:meDA.commemoration.first_short	@ltx/en_us_dedes/me.m01.d28:meDA.commemoration.first_short
ltx/en_us_public/me.m01.d28:meDA.commemoration.first_title	@ltx/en_us_dedes/me.m01.d28:meDA.commemoration.first_title
ltx/en_us_public/me.m01.d28:meDA.commemoration.full	@ltx/en_us_dedes/me.m01.d28:meDA.commemoration.full
ltx/en_us_public/me.m01.d28:meDA.commemoration.second_name	@ltx/en_us_dedes/me.m01.d28:meDA.commemoration.second_name
ltx/en_us_public/me.m01.d28:meDA.commemoration.second_title	@ltx/en_us_dedes/me.m01.d28:meDA.commemoration.second_title
ltx/en_us_public/me.m01.d28:meDA.date	@ltx/en_us_dedes/me.m01.d28:meDA.date
ltx/en_us_public/me.m01.d28:meDA.insert1	@ltx/en_us_dedes/me.m01.d28:meDA.insert1
ltx/en_us_public/me.m01.d28:meDA.insert2	@ltx/en_us_dedes/me.m01.d28:meDA.insert2
ltx/en_us_public/me.m01.d28:meDA.note	@ltx/en_us_dedes/me.m01.d28:meDA.note
ltx/en_us_public/me.m01.d28:meHO.commemorations	@ltx/en_us_dedes/me.m01.d28:meHO.commemorations
ltx/en_us_public/me.m01.d28:meHO.note1	@ltx/en_us_dedes/me.m01.d28:meHO.note1
ltx/en_us_public/me.m01.d28:meHO.note2	@ltx/en_us_dedes/me.m01.d28:meHO.note2
ltx/en_us_public/me.m01.d28:meHO.number	@ltx/en_us_dedes/me.m01.d28:meHO.number
ltx/en_us_public/me.m01.d28:meHO.rank	@ltx/en_us_dedes/me.m01.d28:meHO.rank
ltx/en_us_public/me.m01.d28:meLE.commemoration1	@ltx/en_us_dedes/me.m01.d28:meLE.commemoration1
ltx/en_us_public/me.m01.d28:meLE.commemoration2	@ltx/en_us_dedes/me.m01.d28:meLE.commemoration2
ltx/en_us_public/me.m01.d28:meLI.Kontakion1.greekmelody	@ltx/en_us_goadedes/me.m01.d28:meMA.Kontakion1.greekmelody
ltx/en_us_public/me.m01.d28:meLI.Kontakion1.incipit	@ltx/en_us_goadedes/me.m01.d28:meMA.Kontakion1.incipit
ltx/en_us_public/me.m01.d28:meLI.Kontakion1.melody	@ltx/en_us_goadedes/me.m01.d28:meMA.Kontakion1.melody
ltx/en_us_public/me.m01.d28:meLI.Kontakion1.mode	@ltx/en_us_goadedes/me.m01.d28:meMA.Kontakion1.mode
ltx/en_us_public/me.m01.d28:meLI.Kontakion1.text	@ltx/en_us_goadedes/me.m01.d28:meMA.Kontakion1.text
ltx/en_us_public/me.m01.d28:meLI.MM.CommunionHymn.text	@ltx/en_us_dedes/me.m01.d28:meLI.MM.CommunionHymn.text
ltx/en_us_public/me.m01.d28:meLI.Megalynarion.text	@ltx/en_us_dedes/me.m01.d28:meLI.Megalynarion.text
ltx/en_us_public/me.m01.d28:meMA.AposGlory.incipit	@ltx/en_us_oca/me.m01.d28:meMA.AposGlory.incipit
ltx/en_us_public/me.m01.d28:meMA.AposGlory.melody	@ltx/en_us_oca/me.m01.d28:meMA.AposGlory.melody
ltx/en_us_public/me.m01.d28:meMA.AposGlory.mode	@ltx/en_us_dedes/me.m01.d28:meMA.AposGlory.mode
ltx/en_us_public/me.m01.d28:meMA.AposGlory.poet	@ltx/en_us_dedes/me.m01.d28:meMA.AposGlory.poet
ltx/en_us_public/me.m01.d28:meMA.AposGlory.text	@ltx/en_us_oca/me.m01.d28:meMA.AposGlory.text
ltx/en_us_public/me.m01.d28:meMA.AposStavrotheotokion.greekmelody	@ltx/en_us_dedes/me.m01.d28:meMA.AposStavrotheotokion.greekmelody
ltx/en_us_public/me.m01.d28:meMA.AposStavrotheotokion.incipit	@ltx/en_us_goadedes/me.m01.d28:meMA.AposStavrotheotokion.incipit
ltx/en_us_public/me.m01.d28:meMA.AposStavrotheotokion.melody	@ltx/en_us_goadedes/me.m01.d28:meMA.AposStavrotheotokion.melody
ltx/en_us_public/me.m01.d28:meMA.AposStavrotheotokion.mode	@ltx/en_us_goadedes/me.m01.d28:meMA.AposStavrotheotokion.mode
ltx/en_us_public/me.m01.d28:meMA.AposStavrotheotokion.text	@ltx/en_us_goadedes/me.m01.d28:meMA.AposStavrotheotokion.text
ltx/en_us_public/me.m01.d28:meMA.AposTheotokion.greekmelody	@ltx/en_us_dedes/me.m01.d28:meMA.AposTheotokion.greekmelody
ltx/en_us_public/me.m01.d28:meMA.AposTheotokion.incipit	@ltx/en_us_dedes/me.m01.d28:meMA.AposTheotokion.incipit
ltx/en_us_public/me.m01.d28:meMA.AposTheotokion.melody	@ltx/en_us_dedes/me.m01.d28:meMA.AposTheotokion.melody
ltx/en_us_public/me.m01.d28:meMA.AposTheotokion.mode	@ltx/en_us_dedes/me.m01.d28:meMA.AposTheotokion.mode
ltx/en_us_public/me.m01.d28:meMA.AposTheotokion.text	@ltx/en_us_dedes/me.m01.d28:meMA.AposTheotokion.text
ltx/en_us_public/me.m01.d28:meMA.C1.acrostic.notice1	@ltx/en_us_dedes/me.m01.d28:meMA.C1.acrostic.notice1
ltx/en_us_public/me.m01.d28:meMA.C1.acrostic.text	@ltx/en_us_dedes/me.m01.d28:meMA.C1.acrostic.text
ltx/en_us_public/me.m01.d28:meMA.C1.acrostic.title	@ltx/en_us_dedes/me.m01.d28:meMA.C1.acrostic.title
ltx/en_us_public/me.m01.d28:meMA.C1.poet	@ltx/en_us_dedes/me.m01.d28:meMA.C1.poet
ltx/en_us_public/me.m01.d28:meMA.C1.title	@ltx/en_us_dedes/me.m01.d28:meMA.C1.title
ltx/en_us_public/me.m01.d28:meMA.C1.verse	@ltx/en_us_dedes/me.m01.d28:meMA.C1.verse
ltx/en_us_public/me.m01.d28:meMA.ExapTheotokion.incipit	@ltx/en_us_dedes/me.m01.d28:meMA.ExapTheotokion.incipit
ltx/en_us_public/me.m01.d28:meMA.ExapTheotokion.melody	@ltx/en_us_dedes/me.m01.d28:meMA.ExapTheotokion.melody
ltx/en_us_public/me.m01.d28:meMA.ExapTheotokion.mode	@ltx/en_us_dedes/me.m01.d28:meMA.ExapTheotokion.mode
ltx/en_us_public/me.m01.d28:meMA.ExapTheotokion.text	@ltx/en_us_dedes/me.m01.d28:meMA.ExapTheotokion.text
ltx/en_us_public/me.m01.d28:meMA.Exaposteilarion1.greekmelody	@ltx/en_us_dedes/me.m01.d28:meMA.Exaposteilarion1.greekmelody
ltx/en_us_public/me.m01.d28:meMA.Exaposteilarion1.incipit	@ltx/en_us_dedes/me.m01.d28:meMA.Exaposteilarion1.incipit
ltx/en_us_public/me.m01.d28:meMA.Exaposteilarion1.melody	@ltx/en_us_dedes/me.m01.d28:meMA.Exaposteilarion1.melody
ltx/en_us_public/me.m01.d28:meMA.Exaposteilarion1.mode	@ltx/en_us_dedes/me.m01.d28:meMA.Exaposteilarion1.mode
ltx/en_us_public/me.m01.d28:meMA.Exaposteilarion1.text	@ltx/en_us_dedes/me.m01.d28:meMA.Exaposteilarion1.text
ltx/en_us_public/me.m01.d28:meMA.Kontakion1.greekmelody	@ltx/en_us_goadedes/me.m01.d28:meMA.Kontakion1.greekmelody
ltx/en_us_public/me.m01.d28:meMA.Kontakion1.incipit	@ltx/en_us_goadedes/me.m01.d28:meMA.Kontakion1.incipit
ltx/en_us_public/me.m01.d28:meMA.Kontakion1.melody	@ltx/en_us_goadedes/me.m01.d28:meMA.Kontakion1.melody
ltx/en_us_public/me.m01.d28:meMA.Kontakion1.mode	@ltx/en_us_goadedes/me.m01.d28:meMA.Kontakion1.mode
ltx/en_us_public/me.m01.d28:meMA.Kontakion1.text	@ltx/en_us_goadedes/me.m01.d28:meMA.Kontakion1.text
ltx/en_us_public/me.m01.d28:meMA.Ode1C11.greekmelody	@ltx/en_us_dedes/me.m01.d28:meMA.Ode1C11.greekmelody
ltx/en_us_public/me.m01.d28:meMA.Ode1C11.incipit	@ltx/en_us_andronache/me.m01.d28:meMA.Ode1C11.incipit
ltx/en_us_public/me.m01.d28:meMA.Ode1C11.melody	@ltx/en_us_andronache/me.m01.d28:meMA.Ode1C11.melody
ltx/en_us_public/me.m01.d28:meMA.Ode1C11.mode	@ltx/en_us_dedes/me.m01.d28:meMA.Ode1C11.mode
ltx/en_us_public/me.m01.d28:meMA.Ode1C11.ode	@ltx/en_us_dedes/me.m01.d28:meMA.Ode1C11.ode
ltx/en_us_public/me.m01.d28:meMA.Ode1C11.text	@ltx/en_us_andronache/me.m01.d28:meMA.Ode1C11.text
ltx/en_us_public/me.m01.d28:meMA.Ode1C12.incipit	@ltx/en_us_andronache/me.m01.d28:meMA.Ode1C12.incipit
ltx/en_us_public/me.m01.d28:meMA.Ode1C12.melody	@ltx/en_us_andronache/me.m01.d28:meMA.Ode1C12.melody
ltx/en_us_public/me.m01.d28:meMA.Ode1C12.mode	@ltx/en_us_dedes/me.m01.d28:meMA.Ode1C12.mode
ltx/en_us_public/me.m01.d28:meMA.Ode1C12.ode	@ltx/en_us_dedes/me.m01.d28:meMA.Ode1C12.ode
ltx/en_us_public/me.m01.d28:meMA.Ode1C12.text	@ltx/en_us_andronache/me.m01.d28:meMA.Ode1C12.text
ltx/en_us_public/me.m01.d28:meMA.Ode1C13.incipit	@ltx/en_us_andronache/me.m01.d28:meMA.Ode1C13.incipit
ltx/en_us_public/me.m01.d28:meMA.Ode1C13.melody	@ltx/en_us_andronache/me.m01.d28:meMA.Ode1C13.melody
ltx/en_us_public/me.m01.d28:meMA.Ode1C13.mode	@ltx/en_us_dedes/me.m01.d28:meMA.Ode1C13.mode
ltx/en_us_public/me.m01.d28:meMA.Ode1C13.ode	@ltx/en_us_dedes/me.m01.d28:meMA.Ode1C13.ode
ltx/en_us_public/me.m01.d28:meMA.Ode1C13.text	@ltx/en_us_andronache/me.m01.d28:meMA.Ode1C13.text
ltx/en_us_public/me.m01.d28:meMA.Ode1C1T.incipit	@ltx/en_us_andronache/me.m01.d28:meMA.Ode1C1T.incipit
ltx/en_us_public/me.m01.d28:meMA.Ode1C1T.melody	@ltx/en_us_andronache/me.m01.d28:meMA.Ode1C1T.melody
ltx/en_us_public/me.m01.d28:meMA.Ode1C1T.mode	@ltx/en_us_dedes/me.m01.d28:meMA.Ode1C1T.mode
ltx/en_us_public/me.m01.d28:meMA.Ode1C1T.ode	@ltx/en_us_dedes/me.m01.d28:meMA.Ode1C1T.ode
ltx/en_us_public/me.m01.d28:meMA.Ode1C1T.text	@ltx/en_us_andronache/me.m01.d28:meMA.Ode1C1T.text
ltx/en_us_public/me.m01.d28:meMA.Ode3C11.greekmelody	@ltx/en_us_dedes/me.m01.d28:meMA.Ode3C11.greekmelody
ltx/en_us_public/me.m01.d28:meMA.Ode3C11.incipit	@ltx/en_us_andronache/me.m01.d28:meMA.Ode3C11.incipit
ltx/en_us_public/me.m01.d28:meMA.Ode3C11.melody	@ltx/en_us_andronache/me.m01.d28:meMA.Ode3C11.melody
ltx/en_us_public/me.m01.d28:meMA.Ode3C11.mode	@ltx/en_us_goadedes/me.m01.d28:meMA.Ode3C11.mode
ltx/en_us_public/me.m01.d28:meMA.Ode3C11.ode	@ltx/en_us_goadedes/me.m01.d28:meMA.Ode3C11.ode
ltx/en_us_public/me.m01.d28:meMA.Ode3C11.text	@ltx/en_us_andronache/me.m01.d28:meMA.Ode3C11.text
ltx/en_us_public/me.m01.d28:meMA.Ode3C12.incipit	@ltx/en_us_andronache/me.m01.d28:meMA.Ode3C12.incipit
ltx/en_us_public/me.m01.d28:meMA.Ode3C12.melody	@ltx/en_us_andronache/me.m01.d28:meMA.Ode3C12.melody
ltx/en_us_public/me.m01.d28:meMA.Ode3C12.mode	@ltx/en_us_goadedes/me.m01.d28:meMA.Ode3C12.mode
ltx/en_us_public/me.m01.d28:meMA.Ode3C12.ode	@ltx/en_us_goadedes/me.m01.d28:meMA.Ode3C12.ode
ltx/en_us_public/me.m01.d28:meMA.Ode3C12.text	@ltx/en_us_andronache/me.m01.d28:meMA.Ode3C12.text
ltx/en_us_public/me.m01.d28:meMA.Ode3C13.incipit	@ltx/en_us_andronache/me.m01.d28:meMA.Ode3C13.incipit
ltx/en_us_public/me.m01.d28:meMA.Ode3C13.melody	@ltx/en_us_andronache/me.m01.d28:meMA.Ode3C13.melody
ltx/en_us_public/me.m01.d28:meMA.Ode3C13.mode	@ltx/en_us_goadedes/me.m01.d28:meMA.Ode3C13.mode
ltx/en_us_public/me.m01.d28:meMA.Ode3C13.ode	@ltx/en_us_goadedes/me.m01.d28:meMA.Ode3C13.ode
ltx/en_us_public/me.m01.d28:meMA.Ode3C13.text	@ltx/en_us_andronache/me.m01.d28:meMA.Ode3C13.text
ltx/en_us_public/me.m01.d28:meMA.Ode3C1T.incipit	@ltx/en_us_andronache/me.m01.d28:meMA.Ode3C1T.incipit
ltx/en_us_public/me.m01.d28:meMA.Ode3C1T.melody	@ltx/en_us_andronache/me.m01.d28:meMA.Ode3C1T.melody
ltx/en_us_public/me.m01.d28:meMA.Ode3C1T.mode	@ltx/en_us_goadedes/me.m01.d28:meMA.Ode3C1T.mode
ltx/en_us_public/me.m01.d28:meMA.Ode3C1T.ode	@ltx/en_us_goadedes/me.m01.d28:meMA.Ode3C1T.ode
ltx/en_us_public/me.m01.d28:meMA.Ode3C1T.text	@ltx/en_us_andronache/me.m01.d28:meMA.Ode3C1T.text
ltx/en_us_public/me.m01.d28:meMA.Ode3H.greekmelody	@ltx/en_us_dedes/me.m01.d28:meMA.Ode3H.greekmelody
ltx/en_us_public/me.m01.d28:meMA.Ode3H.incipit	@ltx/en_us_dedes/me.m01.d28:meMA.Ode3H.incipit
ltx/en_us_public/me.m01.d28:meMA.Ode3H.melody	@ltx/en_us_dedes/me.m01.d28:meMA.Ode3H.melody
ltx/en_us_public/me.m01.d28:meMA.Ode3H.mode	@ltx/en_us_dedes/me.m01.d28:meMA.Ode3H.mode
ltx/en_us_public/me.m01.d28:meMA.Ode3H.ode	@ltx/en_us_dedes/me.m01.d28:meMA.Ode3H.ode
ltx/en_us_public/me.m01.d28:meMA.Ode3H.text	@ltx/en_us_dedes/me.m01.d28:meMA.Ode3H.text
ltx/en_us_public/me.m01.d28:meMA.Ode3Kathisma1.greekmelody	@ltx/en_us_dedes/me.m01.d28:meMA.Ode3Kathisma1.greekmelody
ltx/en_us_public/me.m01.d28:meMA.Ode3Kathisma1.incipit	@ltx/en_us_andronache/me.m01.d28:meMA.Ode3Kathisma1.incipit
ltx/en_us_public/me.m01.d28:meMA.Ode3Kathisma1.melody	@ltx/en_us_andronache/me.m01.d28:meMA.Ode3Kathisma1.melody
ltx/en_us_public/me.m01.d28:meMA.Ode3Kathisma1.mode	@ltx/en_us_dedes/me.m01.d28:meMA.Ode3Kathisma1.mode
ltx/en_us_public/me.m01.d28:meMA.Ode3Kathisma1.text	@ltx/en_us_andronache/me.m01.d28:meMA.Ode3Kathisma1.text
ltx/en_us_public/me.m01.d28:meMA.Ode3KathismaSt.incipit	@ltx/en_us_goadedes/me.m01.d28:meMA.Ode3KathismaSt.incipit
ltx/en_us_public/me.m01.d28:meMA.Ode3KathismaSt.melody	@ltx/en_us_goadedes/me.m01.d28:meMA.Ode3KathismaSt.melody
ltx/en_us_public/me.m01.d28:meMA.Ode3KathismaSt.mode	@ltx/en_us_goadedes/me.m01.d28:meMA.Ode3KathismaSt.mode
ltx/en_us_public/me.m01.d28:meMA.Ode3KathismaSt.text	@ltx/en_us_goadedes/me.m01.d28:meMA.Ode3KathismaSt.text
ltx/en_us_public/me.m01.d28:meMA.Ode3KathismaT.incipit	@ltx/en_us_dedes/me.m01.d28:meMA.Ode3KathismaT.incipit
ltx/en_us_public/me.m01.d28:meMA.Ode3KathismaT.melody	@ltx/en_us_dedes/me.m01.d28:meMA.Ode3KathismaT.melody
ltx/en_us_public/me.m01.d28:meMA.Ode3KathismaT.mode	@ltx/en_us_dedes/me.m01.d28:meMA.Ode3KathismaT.mode
ltx/en_us_public/me.m01.d28:meMA.Ode3KathismaT.text	@ltx/en_us_dedes/me.m01.d28:meMA.Ode3KathismaT.text
ltx/en_us_public/me.m01.d28:meMA.Ode4C11.greekmelody	@ltx/en_us_dedes/me.m01.d28:meMA.Ode4C11.greekmelody
ltx/en_us_public/me.m01.d28:meMA.Ode4C11.incipit	@ltx/en_us_andronache/me.m01.d28:meMA.Ode4C11.incipit
ltx/en_us_public/me.m01.d28:meMA.Ode4C11.melody	@ltx/en_us_andronache/me.m01.d28:meMA.Ode4C11.melody
ltx/en_us_public/me.m01.d28:meMA.Ode4C11.mode	@ltx/en_us_dedes/me.m01.d28:meMA.Ode4C11.mode
ltx/en_us_public/me.m01.d28:meMA.Ode4C11.ode	@ltx/en_us_dedes/me.m01.d28:meMA.Ode4C11.ode
ltx/en_us_public/me.m01.d28:meMA.Ode4C11.text	@ltx/en_us_andronache/me.m01.d28:meMA.Ode4C11.text
ltx/en_us_public/me.m01.d28:meMA.Ode4C12.incipit	@ltx/en_us_andronache/me.m01.d28:meMA.Ode4C12.incipit
ltx/en_us_public/me.m01.d28:meMA.Ode4C12.melody	@ltx/en_us_andronache/me.m01.d28:meMA.Ode4C12.melody
ltx/en_us_public/me.m01.d28:meMA.Ode4C12.mode	@ltx/en_us_dedes/me.m01.d28:meMA.Ode4C12.mode
ltx/en_us_public/me.m01.d28:meMA.Ode4C12.ode	@ltx/en_us_dedes/me.m01.d28:meMA.Ode4C12.ode
ltx/en_us_public/me.m01.d28:meMA.Ode4C12.text	@ltx/en_us_andronache/me.m01.d28:meMA.Ode4C12.text
ltx/en_us_public/me.m01.d28:meMA.Ode4C13.incipit	@ltx/en_us_andronache/me.m01.d28:meMA.Ode4C13.incipit
ltx/en_us_public/me.m01.d28:meMA.Ode4C13.melody	@ltx/en_us_andronache/me.m01.d28:meMA.Ode4C13.melody
ltx/en_us_public/me.m01.d28:meMA.Ode4C13.mode	@ltx/en_us_dedes/me.m01.d28:meMA.Ode4C13.mode
ltx/en_us_public/me.m01.d28:meMA.Ode4C13.ode	@ltx/en_us_dedes/me.m01.d28:meMA.Ode4C13.ode
ltx/en_us_public/me.m01.d28:meMA.Ode4C13.text	@ltx/en_us_andronache/me.m01.d28:meMA.Ode4C13.text
ltx/en_us_public/me.m01.d28:meMA.Ode4C14.incipit	@ltx/en_us_andronache/me.m01.d28:meMA.Ode4C14.incipit
ltx/en_us_public/me.m01.d28:meMA.Ode4C14.melody	@ltx/en_us_andronache/me.m01.d28:meMA.Ode4C14.melody
ltx/en_us_public/me.m01.d28:meMA.Ode4C14.mode	@ltx/en_us_dedes/me.m01.d28:meMA.Ode4C14.mode
ltx/en_us_public/me.m01.d28:meMA.Ode4C14.ode	@ltx/en_us_dedes/me.m01.d28:meMA.Ode4C14.ode
ltx/en_us_public/me.m01.d28:meMA.Ode4C14.text	@ltx/en_us_andronache/me.m01.d28:meMA.Ode4C14.text
ltx/en_us_public/me.m01.d28:meMA.Ode4C1T.incipit	@ltx/en_us_andronache/me.m01.d28:meMA.Ode4C1T.incipit
ltx/en_us_public/me.m01.d28:meMA.Ode4C1T.melody	@ltx/en_us_andronache/me.m01.d28:meMA.Ode4C1T.melody
ltx/en_us_public/me.m01.d28:meMA.Ode4C1T.mode	@ltx/en_us_dedes/me.m01.d28:meMA.Ode4C1T.mode
ltx/en_us_public/me.m01.d28:meMA.Ode4C1T.ode	@ltx/en_us_dedes/me.m01.d28:meMA.Ode4C1T.ode
ltx/en_us_public/me.m01.d28:meMA.Ode4C1T.text	@ltx/en_us_andronache/me.m01.d28:meMA.Ode4C1T.text
ltx/en_us_public/me.m01.d28:meMA.Ode5C11.greekmelody	@ltx/en_us_dedes/me.m01.d28:meMA.Ode5C11.greekmelody
ltx/en_us_public/me.m01.d28:meMA.Ode5C11.incipit	@ltx/en_us_andronache/me.m01.d28:meMA.Ode5C11.incipit
ltx/en_us_public/me.m01.d28:meMA.Ode5C11.melody	@ltx/en_us_andronache/me.m01.d28:meMA.Ode5C11.melody
ltx/en_us_public/me.m01.d28:meMA.Ode5C11.mode	@ltx/en_us_dedes/me.m01.d28:meMA.Ode5C11.mode
ltx/en_us_public/me.m01.d28:meMA.Ode5C11.ode	@ltx/en_us_dedes/me.m01.d28:meMA.Ode5C11.ode
ltx/en_us_public/me.m01.d28:meMA.Ode5C11.text	@ltx/en_us_andronache/me.m01.d28:meMA.Ode5C11.text
ltx/en_us_public/me.m01.d28:meMA.Ode5C12.incipit	@ltx/en_us_andronache/me.m01.d28:meMA.Ode5C12.incipit
ltx/en_us_public/me.m01.d28:meMA.Ode5C12.melody	@ltx/en_us_andronache/me.m01.d28:meMA.Ode5C12.melody
ltx/en_us_public/me.m01.d28:meMA.Ode5C12.mode	@ltx/en_us_dedes/me.m01.d28:meMA.Ode5C12.mode
ltx/en_us_public/me.m01.d28:meMA.Ode5C12.ode	@ltx/en_us_dedes/me.m01.d28:meMA.Ode5C12.ode
ltx/en_us_public/me.m01.d28:meMA.Ode5C12.text	@ltx/en_us_andronache/me.m01.d28:meMA.Ode5C12.text
ltx/en_us_public/me.m01.d28:meMA.Ode5C13.incipit	@ltx/en_us_andronache/me.m01.d28:meMA.Ode5C13.incipit
ltx/en_us_public/me.m01.d28:meMA.Ode5C13.melody	@ltx/en_us_andronache/me.m01.d28:meMA.Ode5C13.melody
ltx/en_us_public/me.m01.d28:meMA.Ode5C13.mode	@ltx/en_us_dedes/me.m01.d28:meMA.Ode5C13.mode
ltx/en_us_public/me.m01.d28:meMA.Ode5C13.ode	@ltx/en_us_dedes/me.m01.d28:meMA.Ode5C13.ode
ltx/en_us_public/me.m01.d28:meMA.Ode5C13.text	@ltx/en_us_andronache/me.m01.d28:meMA.Ode5C13.text
ltx/en_us_public/me.m01.d28:meMA.Ode5C1T.incipit	@ltx/en_us_andronache/me.m01.d28:meMA.Ode5C1T.incipit
ltx/en_us_public/me.m01.d28:meMA.Ode5C1T.melody	@ltx/en_us_andronache/me.m01.d28:meMA.Ode5C1T.melody
ltx/en_us_public/me.m01.d28:meMA.Ode5C1T.mode	@ltx/en_us_dedes/me.m01.d28:meMA.Ode5C1T.mode
ltx/en_us_public/me.m01.d28:meMA.Ode5C1T.ode	@ltx/en_us_dedes/me.m01.d28:meMA.Ode5C1T.ode
ltx/en_us_public/me.m01.d28:meMA.Ode5C1T.text	@ltx/en_us_andronache/me.m01.d28:meMA.Ode5C1T.text
ltx/en_us_public/me.m01.d28:meMA.Ode6C11.greekmelody	@ltx/en_us_dedes/me.m01.d28:meMA.Ode6C11.greekmelody
ltx/en_us_public/me.m01.d28:meMA.Ode6C11.incipit	@ltx/en_us_andronache/me.m01.d28:meMA.Ode6C11.incipit
ltx/en_us_public/me.m01.d28:meMA.Ode6C11.melody	@ltx/en_us_andronache/me.m01.d28:meMA.Ode6C11.melody
ltx/en_us_public/me.m01.d28:meMA.Ode6C11.mode	@ltx/en_us_goadedes/me.m01.d28:meMA.Ode6C11.mode
ltx/en_us_public/me.m01.d28:meMA.Ode6C11.ode	@ltx/en_us_goadedes/me.m01.d28:meMA.Ode6C11.ode
ltx/en_us_public/me.m01.d28:meMA.Ode6C11.text	@ltx/en_us_andronache/me.m01.d28:meMA.Ode6C11.text
ltx/en_us_public/me.m01.d28:meMA.Ode6C12.incipit	@ltx/en_us_andronache/me.m01.d28:meMA.Ode6C12.incipit
ltx/en_us_public/me.m01.d28:meMA.Ode6C12.melody	@ltx/en_us_andronache/me.m01.d28:meMA.Ode6C12.melody
ltx/en_us_public/me.m01.d28:meMA.Ode6C12.mode	@ltx/en_us_goadedes/me.m01.d28:meMA.Ode6C12.mode
ltx/en_us_public/me.m01.d28:meMA.Ode6C12.ode	@ltx/en_us_goadedes/me.m01.d28:meMA.Ode6C12.ode
ltx/en_us_public/me.m01.d28:meMA.Ode6C12.text	@ltx/en_us_andronache/me.m01.d28:meMA.Ode6C12.text
ltx/en_us_public/me.m01.d28:meMA.Ode6C13.incipit	@ltx/en_us_andronache/me.m01.d28:meMA.Ode6C13.incipit
ltx/en_us_public/me.m01.d28:meMA.Ode6C13.melody	@ltx/en_us_andronache/me.m01.d28:meMA.Ode6C13.melody
ltx/en_us_public/me.m01.d28:meMA.Ode6C13.mode	@ltx/en_us_goadedes/me.m01.d28:meMA.Ode6C13.mode
ltx/en_us_public/me.m01.d28:meMA.Ode6C13.ode	@ltx/en_us_goadedes/me.m01.d28:meMA.Ode6C13.ode
ltx/en_us_public/me.m01.d28:meMA.Ode6C13.text	@ltx/en_us_andronache/me.m01.d28:meMA.Ode6C13.text
ltx/en_us_public/me.m01.d28:meMA.Ode6C1T.incipit	@ltx/en_us_andronache/me.m01.d28:meMA.Ode6C1T.incipit
ltx/en_us_public/me.m01.d28:meMA.Ode6C1T.melody	@ltx/en_us_andronache/me.m01.d28:meMA.Ode6C1T.melody
ltx/en_us_public/me.m01.d28:meMA.Ode6C1T.mode	@ltx/en_us_goadedes/me.m01.d28:meMA.Ode6C1T.mode
ltx/en_us_public/me.m01.d28:meMA.Ode6C1T.ode	@ltx/en_us_goadedes/me.m01.d28:meMA.Ode6C1T.ode
ltx/en_us_public/me.m01.d28:meMA.Ode6C1T.text	@ltx/en_us_andronache/me.m01.d28:meMA.Ode6C1T.text
ltx/en_us_public/me.m01.d28:meMA.Ode6H.greekmelody	@ltx/en_us_dedes/me.m01.d28:meMA.Ode6H.greekmelody
ltx/en_us_public/me.m01.d28:meMA.Ode6H.incipit	@ltx/en_us_dedes/me.m01.d28:meMA.Ode6H.incipit
ltx/en_us_public/me.m01.d28:meMA.Ode6H.melody	@ltx/en_us_dedes/me.m01.d28:meMA.Ode6H.melody
ltx/en_us_public/me.m01.d28:meMA.Ode6H.mode	@ltx/en_us_dedes/me.m01.d28:meMA.Ode6H.mode
ltx/en_us_public/me.m01.d28:meMA.Ode6H.ode	@ltx/en_us_dedes/me.m01.d28:meMA.Ode6H.ode
ltx/en_us_public/me.m01.d28:meMA.Ode6H.text	@ltx/en_us_dedes/me.m01.d28:meMA.Ode6H.text
ltx/en_us_public/me.m01.d28:meMA.Ode7C11.greekmelody	@ltx/en_us_dedes/me.m01.d28:meMA.Ode7C11.greekmelody
ltx/en_us_public/me.m01.d28:meMA.Ode7C11.incipit	@ltx/en_us_andronache/me.m01.d28:meMA.Ode7C11.incipit
ltx/en_us_public/me.m01.d28:meMA.Ode7C11.melody	@ltx/en_us_andronache/me.m01.d28:meMA.Ode7C11.melody
ltx/en_us_public/me.m01.d28:meMA.Ode7C11.mode	@ltx/en_us_dedes/me.m01.d28:meMA.Ode7C11.mode
ltx/en_us_public/me.m01.d28:meMA.Ode7C11.ode	@ltx/en_us_dedes/me.m01.d28:meMA.Ode7C11.ode
ltx/en_us_public/me.m01.d28:meMA.Ode7C11.text	@ltx/en_us_andronache/me.m01.d28:meMA.Ode7C11.text
ltx/en_us_public/me.m01.d28:meMA.Ode7C12.incipit	@ltx/en_us_andronache/me.m01.d28:meMA.Ode7C12.incipit
ltx/en_us_public/me.m01.d28:meMA.Ode7C12.melody	@ltx/en_us_andronache/me.m01.d28:meMA.Ode7C12.melody
ltx/en_us_public/me.m01.d28:meMA.Ode7C12.mode	@ltx/en_us_dedes/me.m01.d28:meMA.Ode7C12.mode
ltx/en_us_public/me.m01.d28:meMA.Ode7C12.ode	@ltx/en_us_dedes/me.m01.d28:meMA.Ode7C12.ode
ltx/en_us_public/me.m01.d28:meMA.Ode7C12.text	@ltx/en_us_andronache/me.m01.d28:meMA.Ode7C12.text
ltx/en_us_public/me.m01.d28:meMA.Ode7C1T.incipit	@ltx/en_us_andronache/me.m01.d28:meMA.Ode7C1T.incipit
ltx/en_us_public/me.m01.d28:meMA.Ode7C1T.melody	@ltx/en_us_andronache/me.m01.d28:meMA.Ode7C1T.melody
ltx/en_us_public/me.m01.d28:meMA.Ode7C1T.mode	@ltx/en_us_dedes/me.m01.d28:meMA.Ode7C1T.mode
ltx/en_us_public/me.m01.d28:meMA.Ode7C1T.ode	@ltx/en_us_dedes/me.m01.d28:meMA.Ode7C1T.ode
ltx/en_us_public/me.m01.d28:meMA.Ode7C1T.text	@ltx/en_us_andronache/me.m01.d28:meMA.Ode7C1T.text
ltx/en_us_public/me.m01.d28:meMA.Ode8C11.greekmelody	@ltx/en_us_dedes/me.m01.d28:meMA.Ode8C11.greekmelody
ltx/en_us_public/me.m01.d28:meMA.Ode8C11.incipit	@ltx/en_us_andronache/me.m01.d28:meMA.Ode8C11.incipit
ltx/en_us_public/me.m01.d28:meMA.Ode8C11.melody	@ltx/en_us_andronache/me.m01.d28:meMA.Ode8C11.melody
ltx/en_us_public/me.m01.d28:meMA.Ode8C11.mode	@ltx/en_us_dedes/me.m01.d28:meMA.Ode8C11.mode
ltx/en_us_public/me.m01.d28:meMA.Ode8C11.ode	@ltx/en_us_dedes/me.m01.d28:meMA.Ode8C11.ode
ltx/en_us_public/me.m01.d28:meMA.Ode8C11.text	@ltx/en_us_andronache/me.m01.d28:meMA.Ode8C11.text
ltx/en_us_public/me.m01.d28:meMA.Ode8C12.incipit	@ltx/en_us_andronache/me.m01.d28:meMA.Ode8C12.incipit
ltx/en_us_public/me.m01.d28:meMA.Ode8C12.melody	@ltx/en_us_andronache/me.m01.d28:meMA.Ode8C12.melody
ltx/en_us_public/me.m01.d28:meMA.Ode8C12.mode	@ltx/en_us_dedes/me.m01.d28:meMA.Ode8C12.mode
ltx/en_us_public/me.m01.d28:meMA.Ode8C12.ode	@ltx/en_us_dedes/me.m01.d28:meMA.Ode8C12.ode
ltx/en_us_public/me.m01.d28:meMA.Ode8C12.text	@ltx/en_us_andronache/me.m01.d28:meMA.Ode8C12.text
ltx/en_us_public/me.m01.d28:meMA.Ode8C1T.incipit	@ltx/en_us_andronache/me.m01.d28:meMA.Ode8C1T.incipit
ltx/en_us_public/me.m01.d28:meMA.Ode8C1T.melody	@ltx/en_us_andronache/me.m01.d28:meMA.Ode8C1T.melody
ltx/en_us_public/me.m01.d28:meMA.Ode8C1T.mode	@ltx/en_us_dedes/me.m01.d28:meMA.Ode8C1T.mode
ltx/en_us_public/me.m01.d28:meMA.Ode8C1T.ode	@ltx/en_us_dedes/me.m01.d28:meMA.Ode8C1T.ode
ltx/en_us_public/me.m01.d28:meMA.Ode8C1T.text	@ltx/en_us_andronache/me.m01.d28:meMA.Ode8C1T.text
ltx/en_us_public/me.m01.d28:meMA.Ode8H.greekmelody	@ltx/en_us_dedes/me.m01.d28:meMA.Ode8H.greekmelody
ltx/en_us_public/me.m01.d28:meMA.Ode8H.incipit	@ltx/en_us_dedes/me.m01.d28:meMA.Ode8H.incipit
ltx/en_us_public/me.m01.d28:meMA.Ode8H.melody	@ltx/en_us_dedes/me.m01.d28:meMA.Ode8H.melody
ltx/en_us_public/me.m01.d28:meMA.Ode8H.mode	@ltx/en_us_dedes/me.m01.d28:meMA.Ode8H.mode
ltx/en_us_public/me.m01.d28:meMA.Ode8H.ode	@ltx/en_us_dedes/me.m01.d28:meMA.Ode8H.ode
ltx/en_us_public/me.m01.d28:meMA.Ode8H.text	@ltx/en_us_dedes/me.m01.d28:meMA.Ode8H.text
ltx/en_us_public/me.m01.d28:meMA.Ode9C11.greekmelody	@ltx/en_us_dedes/me.m01.d28:meMA.Ode9C11.greekmelody
ltx/en_us_public/me.m01.d28:meMA.Ode9C11.incipit	@ltx/en_us_andronache/me.m01.d28:meMA.Ode9C11.incipit
ltx/en_us_public/me.m01.d28:meMA.Ode9C11.melody	@ltx/en_us_andronache/me.m01.d28:meMA.Ode9C11.melody
ltx/en_us_public/me.m01.d28:meMA.Ode9C11.mode	@ltx/en_us_dedes/me.m01.d28:meMA.Ode9C11.mode
ltx/en_us_public/me.m01.d28:meMA.Ode9C11.ode	@ltx/en_us_dedes/me.m01.d28:meMA.Ode9C11.ode
ltx/en_us_public/me.m01.d28:meMA.Ode9C11.text	@ltx/en_us_andronache/me.m01.d28:meMA.Ode9C11.text
ltx/en_us_public/me.m01.d28:meMA.Ode9C12.incipit	@ltx/en_us_andronache/me.m01.d28:meMA.Ode9C12.incipit
ltx/en_us_public/me.m01.d28:meMA.Ode9C12.melody	@ltx/en_us_andronache/me.m01.d28:meMA.Ode9C12.melody
ltx/en_us_public/me.m01.d28:meMA.Ode9C12.mode	@ltx/en_us_dedes/me.m01.d28:meMA.Ode9C12.mode
ltx/en_us_public/me.m01.d28:meMA.Ode9C12.ode	@ltx/en_us_dedes/me.m01.d28:meMA.Ode9C12.ode
ltx/en_us_public/me.m01.d28:meMA.Ode9C12.text	@ltx/en_us_andronache/me.m01.d28:meMA.Ode9C12.text
ltx/en_us_public/me.m01.d28:meMA.Ode9C13.incipit	@ltx/en_us_andronache/me.m01.d28:meMA.Ode9C13.incipit
ltx/en_us_public/me.m01.d28:meMA.Ode9C13.melody	@ltx/en_us_andronache/me.m01.d28:meMA.Ode9C13.melody
ltx/en_us_public/me.m01.d28:meMA.Ode9C13.mode	@ltx/en_us_dedes/me.m01.d28:meMA.Ode9C13.mode
ltx/en_us_public/me.m01.d28:meMA.Ode9C13.ode	@ltx/en_us_dedes/me.m01.d28:meMA.Ode9C13.ode
ltx/en_us_public/me.m01.d28:meMA.Ode9C13.text	@ltx/en_us_andronache/me.m01.d28:meMA.Ode9C13.text
ltx/en_us_public/me.m01.d28:meMA.Ode9C1T.incipit	@ltx/en_us_andronache/me.m01.d28:meMA.Ode9C1T.incipit
ltx/en_us_public/me.m01.d28:meMA.Ode9C1T.melody	@ltx/en_us_andronache/me.m01.d28:meMA.Ode9C1T.melody
ltx/en_us_public/me.m01.d28:meMA.Ode9C1T.mode	@ltx/en_us_dedes/me.m01.d28:meMA.Ode9C1T.mode
ltx/en_us_public/me.m01.d28:meMA.Ode9C1T.ode	@ltx/en_us_dedes/me.m01.d28:meMA.Ode9C1T.ode
ltx/en_us_public/me.m01.d28:meMA.Ode9C1T.text	@ltx/en_us_andronache/me.m01.d28:meMA.Ode9C1T.text
ltx/en_us_public/me.m01.d28:meMA.Ode9H.greekmelody	@ltx/en_us_dedes/me.m01.d28:meMA.Ode9H.greekmelody
ltx/en_us_public/me.m01.d28:meMA.Ode9H.incipit	@ltx/en_us_dedes/me.m01.d28:meMA.Ode9H.incipit
ltx/en_us_public/me.m01.d28:meMA.Ode9H.melody	@ltx/en_us_dedes/me.m01.d28:meMA.Ode9H.melody
ltx/en_us_public/me.m01.d28:meMA.Ode9H.mode	@ltx/en_us_dedes/me.m01.d28:meMA.Ode9H.mode
ltx/en_us_public/me.m01.d28:meMA.Ode9H.ode	@ltx/en_us_dedes/me.m01.d28:meMA.Ode9H.ode
ltx/en_us_public/me.m01.d28:meMA.Ode9H.text	@ltx/en_us_dedes/me.m01.d28:meMA.Ode9H.text
ltx/en_us_public/me.m01.d28:meMA.Oikos1.text	@ltx/en_us_goadedes/me.m01.d28:meMA.Oikos1.text
ltx/en_us_public/me.m01.d28:meVE.Apolytikion1.melody	@ltx/en_us_dedes/me.m01.d28:meVE.Apolytikion1.melody
ltx/en_us_public/me.m01.d28:meVE.Apolytikion1.mode	@ltx/en_us_dedes/me.m01.d28:meVE.Apolytikion1.mode
ltx/en_us_public/me.m01.d28:meVE.AposGlory.incipit	@ltx/en_us_oca/me.m01.d28:meVE.AposGlory.incipit
ltx/en_us_public/me.m01.d28:meVE.AposGlory.melody	@ltx/en_us_oca/me.m01.d28:meVE.AposGlory.melody
ltx/en_us_public/me.m01.d28:meVE.AposGlory.mode	@ltx/en_us_dedes/me.m01.d28:meVE.AposGlory.mode
ltx/en_us_public/me.m01.d28:meVE.AposGlory.poet	@ltx/en_us_dedes/me.m01.d28:meVE.AposGlory.poet
ltx/en_us_public/me.m01.d28:meVE.AposGlory.text	@ltx/en_us_oca/me.m01.d28:meVE.AposGlory.text
ltx/en_us_public/me.m01.d28:meVE.AposStavrotheotokion.greekmelody	@ltx/en_us_dedes/me.m01.d28:meVE.AposStavrotheotokion.greekmelody
ltx/en_us_public/me.m01.d28:meVE.AposStavrotheotokion.incipit	@ltx/en_us_dedes/me.m01.d28:meVE.AposStavrotheotokion.incipit
ltx/en_us_public/me.m01.d28:meVE.AposStavrotheotokion.melody	@ltx/en_us_dedes/me.m01.d28:meVE.AposStavrotheotokion.melody
ltx/en_us_public/me.m01.d28:meVE.AposStavrotheotokion.mode	@ltx/en_us_dedes/me.m01.d28:meVE.AposStavrotheotokion.mode
ltx/en_us_public/me.m01.d28:meVE.AposStavrotheotokion.text	@ltx/en_us_dedes/me.m01.d28:meVE.AposStavrotheotokion.text
ltx/en_us_public/me.m01.d28:meVE.AposTheotokion.greekmelody	@ltx/en_us_dedes/me.m01.d28:meVE.AposTheotokion.greekmelody
ltx/en_us_public/me.m01.d28:meVE.AposTheotokion.incipit	@ltx/en_us_goadedes/me.m01.d28:meVE.AposTheotokion.incipit
ltx/en_us_public/me.m01.d28:meVE.AposTheotokion.melody	@ltx/en_us_goadedes/me.m01.d28:meVE.AposTheotokion.melody
ltx/en_us_public/me.m01.d28:meVE.AposTheotokion.mode	@ltx/en_us_goadedes/me.m01.d28:meVE.AposTheotokion.mode
ltx/en_us_public/me.m01.d28:meVE.AposTheotokion.text	@ltx/en_us_goadedes/me.m01.d28:meVE.AposTheotokion.text
ltx/en_us_public/me.m01.d28:meVE.GeneralApolytikion1.name	@ltx/en_us_dedes/me.m01.d28:meVE.GeneralApolytikion1.name
ltx/en_us_public/me.m01.d28:meVE.MM.GeneralApolytikion1.text	@ltx/en_us_dedes/me.m01.d28:meVE.MM.GeneralApolytikion1.text
ltx/en_us_public/me.m01.d28:meVE.SticGlory.incipit	@ltx/en_us_oca/me.m01.d28:meVE.SticGlory.incipit
ltx/en_us_public/me.m01.d28:meVE.SticGlory.melody	@ltx/en_us_oca/me.m01.d28:meVE.SticGlory.melody
ltx/en_us_public/me.m01.d28:meVE.SticGlory.mode	@ltx/en_us_dedes/me.m01.d28:meVE.SticGlory.mode
ltx/en_us_public/me.m01.d28:meVE.SticGlory.poet	@ltx/en_us_dedes/me.m01.d28:meVE.SticGlory.poet
ltx/en_us_public/me.m01.d28:meVE.SticGlory.text	@ltx/en_us_oca/me.m01.d28:meVE.SticGlory.text
ltx/en_us_public/me.m01.d28:meVE.SticStavrotheotokion.greekmelody	@ltx/en_us_dedes/me.m01.d28:meVE.SticStavrotheotokion.greekmelody
ltx/en_us_public/me.m01.d28:meVE.SticStavrotheotokion.incipit	@ltx/en_us_dedes/me.m01.d28:meVE.SticStavrotheotokion.incipit
ltx/en_us_public/me.m01.d28:meVE.SticStavrotheotokion.melody	@ltx/en_us_dedes/me.m01.d28:meVE.SticStavrotheotokion.melody
ltx/en_us_public/me.m01.d28:meVE.SticStavrotheotokion.mode	@ltx/en_us_dedes/me.m01.d28:meVE.SticStavrotheotokion.mode
ltx/en_us_public/me.m01.d28:meVE.SticStavrotheotokion.text	@ltx/en_us_dedes/me.m01.d28:meVE.SticStavrotheotokion.text
ltx/en_us_public/me.m01.d28:meVE.SticTheotokion.incipit	@ltx/en_us_dedes/me.m01.d28:meVE.SticTheotokion.incipit
ltx/en_us_public/me.m01.d28:meVE.SticTheotokion.melody	@ltx/en_us_dedes/me.m01.d28:meVE.SticTheotokion.melody
ltx/en_us_public/me.m01.d28:meVE.SticTheotokion.mode	@ltx/en_us_dedes/me.m01.d28:meVE.SticTheotokion.mode
ltx/en_us_public/me.m01.d28:meVE.SticTheotokion.text	@ltx/en_us_dedes/me.m01.d28:meVE.SticTheotokion.text
ltx/en_us_public/me.m01.d28:meVE.Stichera01.greekmelody	@ltx/en_us_dedes/me.m01.d28:meVE.Stichera01.greekmelody
ltx/en_us_public/me.m01.d28:meVE.Stichera01.incipit	@ltx/en_us_dedes/me.m01.d28:meVE.Stichera01.incipit
ltx/en_us_public/me.m01.d28:meVE.Stichera01.melody	@ltx/en_us_dedes/me.m01.d28:meVE.Stichera01.melody
ltx/en_us_public/me.m01.d28:meVE.Stichera01.mode	@ltx/en_us_dedes/me.m01.d28:meVE.Stichera01.mode
ltx/en_us_public/me.m01.d28:meVE.Stichera01.text	@ltx/en_us_dedes/me.m01.d28:meVE.Stichera01.text
ltx/en_us_public/me.m01.d28:meVE.Stichera02.incipit	@ltx/en_us_dedes/me.m01.d28:meVE.Stichera02.incipit
ltx/en_us_public/me.m01.d28:meVE.Stichera02.melody	@ltx/en_us_dedes/me.m01.d28:meVE.Stichera02.melody
ltx/en_us_public/me.m01.d28:meVE.Stichera02.mode	@ltx/en_us_dedes/me.m01.d28:meVE.Stichera02.mode
ltx/en_us_public/me.m01.d28:meVE.Stichera02.text	@ltx/en_us_dedes/me.m01.d28:meVE.Stichera02.text
ltx/en_us_public/me.m01.d28:meVE.Stichera03.incipit	@ltx/en_us_dedes/me.m01.d28:meVE.Stichera03.incipit
ltx/en_us_public/me.m01.d28:meVE.Stichera03.melody	@ltx/en_us_dedes/me.m01.d28:meVE.Stichera03.melody
ltx/en_us_public/me.m01.d28:meVE.Stichera03.mode	@ltx/en_us_dedes/me.m01.d28:meVE.Stichera03.mode
ltx/en_us_public/me.m01.d28:meVE.Stichera03.text	@ltx/en_us_dedes/me.m01.d28:meVE.Stichera03.text
