ltx/en_us_public/sy.m03.d14:syMA.commemoration01.couplet1.title	@ltx/en_us_dedes/sy.m03.d14:syMA.commemoration01.couplet1.title
ltx/en_us_public/sy.m03.d14:syMA.commemoration01.couplet1.verse1	@ltx/en_us_dedes/sy.m03.d14:syMA.commemoration01.couplet1.verse1
ltx/en_us_public/sy.m03.d14:syMA.commemoration01.couplet1.verse2	@ltx/en_us_dedes/sy.m03.d14:syMA.commemoration01.couplet1.verse2
ltx/en_us_public/sy.m03.d14:syMA.commemoration01.narration.p01	@ltx/en_us_dedes/sy.m03.d14:syMA.commemoration01.narration.p01
ltx/en_us_public/sy.m03.d14:syMA.commemoration01.narration.p02	@ltx/en_us_dedes/sy.m03.d14:syMA.commemoration01.narration.p02
ltx/en_us_public/sy.m03.d14:syMA.commemoration01.single1	@ltx/en_us_dedes/sy.m03.d14:syMA.commemoration01.single1
ltx/en_us_public/sy.m03.d14:syMA.commemoration01.text	@ltx/en_us_dedes/sy.m03.d14:syMA.commemoration01.text
ltx/en_us_public/sy.m03.d14:syMA.commemoration02.couplet1.title	@ltx/en_us_dedes/sy.m03.d14:syMA.commemoration02.couplet1.title
ltx/en_us_public/sy.m03.d14:syMA.commemoration02.couplet1.verse1	@ltx/en_us_dedes/sy.m03.d14:syMA.commemoration02.couplet1.verse1
ltx/en_us_public/sy.m03.d14:syMA.commemoration02.couplet1.verse2	@ltx/en_us_dedes/sy.m03.d14:syMA.commemoration02.couplet1.verse2
ltx/en_us_public/sy.m03.d14:syMA.commemoration02.narration.p01	@ltx/en_us_dedes/sy.m03.d14:syMA.commemoration02.narration.p01
ltx/en_us_public/sy.m03.d14:syMA.commemoration02.text	@ltx/en_us_dedes/sy.m03.d14:syMA.commemoration02.text
ltx/en_us_public/sy.m03.d14:syMA.commemoration03.couplet1.title	@ltx/en_us_dedes/sy.m03.d14:syMA.commemoration03.couplet1.title
ltx/en_us_public/sy.m03.d14:syMA.commemoration03.couplet1.verse1	@ltx/en_us_dedes/sy.m03.d14:syMA.commemoration03.couplet1.verse1
ltx/en_us_public/sy.m03.d14:syMA.commemoration03.couplet1.verse2	@ltx/en_us_dedes/sy.m03.d14:syMA.commemoration03.couplet1.verse2
ltx/en_us_public/sy.m03.d14:syMA.commemoration03.text	@ltx/en_us_dedes/sy.m03.d14:syMA.commemoration03.text
ltx/en_us_public/sy.m03.d14:syMA.lastline	@ltx/en_us_dedes/sy.m03.d14:syMA.lastline
