ltx/en_us_public/sy.m01.d07:syMA.commemoration01.couplet1.title	@ltx/en_us_dedes/sy.m01.d07:syMA.commemoration01.couplet1.title
ltx/en_us_public/sy.m01.d07:syMA.commemoration01.couplet1.verse1	@ltx/en_us_dedes/sy.m01.d07:syMA.commemoration01.couplet1.verse1
ltx/en_us_public/sy.m01.d07:syMA.commemoration01.couplet1.verse2	@ltx/en_us_dedes/sy.m01.d07:syMA.commemoration01.couplet1.verse2
ltx/en_us_public/sy.m01.d07:syMA.commemoration01.narration.p01	@ltx/en_us_dedes/sy.m01.d07:syMA.commemoration01.narration.p01
ltx/en_us_public/sy.m01.d07:syMA.commemoration01.narration.p02	@ltx/en_us_dedes/sy.m01.d07:syMA.commemoration01.narration.p02
ltx/en_us_public/sy.m01.d07:syMA.commemoration01.narration.p03	@ltx/en_us_dedes/sy.m01.d07:syMA.commemoration01.narration.p03
ltx/en_us_public/sy.m01.d07:syMA.commemoration01.narration.p04	@ltx/en_us_dedes/sy.m01.d07:syMA.commemoration01.narration.p04
ltx/en_us_public/sy.m01.d07:syMA.commemoration01.single1	@ltx/en_us_dedes/sy.m01.d07:syMA.commemoration01.single1
ltx/en_us_public/sy.m01.d07:syMA.commemoration01.text	@ltx/en_us_dedes/sy.m01.d07:syMA.commemoration01.text
ltx/en_us_public/sy.m01.d07:syMA.commemoration02.text	@ltx/en_us_dedes/sy.m01.d07:syMA.commemoration02.text
ltx/en_us_public/sy.m01.d07:syMA.commemoration03.text	@ltx/en_us_dedes/sy.m01.d07:syMA.commemoration03.text
ltx/en_us_public/sy.m01.d07:syMA.lastline	@ltx/en_us_dedes/sy.m01.d07:syMA.lastline
