ltx/en_us_public/hi.hi16:hiCE.Key_0000.title	@ltx/en_us_goa/hi.hi16:hiCE.Key_0000.title
ltx/en_us_public/hi.hi16:hiCE.Key_0100.title	@ltx/en_us_goa/hi.hi16:hiCE.Key_0100.title
ltx/en_us_public/hi.hi16:hiCE.Key_0101.rubric	@ltx/en_us_goa/hi.hi16:hiCE.Key_0101.rubric
ltx/en_us_public/hi.hi16:hiCE.Key_0101.title	@ltx/en_us_goa/hi.hi16:hiCE.Key_0101.title
ltx/en_us_public/hi.hi16:hiCE.Key_0102.text	@ltx/en_us_goa/hi.hi16:hiCE.Key_0102.text
ltx/en_us_public/hi.hi16:hiCE.Key_0103.poet	@ltx/en_us_goa/hi.hi16:hiCE.Key_0103.poet
ltx/en_us_public/hi.hi16:hiCE.Key_0103.text	@ltx/en_us_goa/hi.hi16:hiCE.Key_0103.text
ltx/en_us_public/hi.hi16:hiCE.Key_0103.title	@ltx/en_us_goa/hi.hi16:hiCE.Key_0103.title
ltx/en_us_public/hi.hi16:hiCE.Key_0200.title	@ltx/en_us_goa/hi.hi16:hiCE.Key_0200.title
ltx/en_us_public/hi.hi16:hiCE.Key_0201.title	@ltx/en_us_goa/hi.hi16:hiCE.Key_0201.title
ltx/en_us_public/hi.hi16:hiCE.Key_0202.title	@ltx/en_us_goa/hi.hi16:hiCE.Key_0202.title
ltx/en_us_public/hi.hi16:hiCE.Key_0203.rubric	@ltx/en_us_goa/hi.hi16:hiCE.Key_0203.rubric
ltx/en_us_public/hi.hi16:hiCE.Key_0204.text	@ltx/en_us_goa/hi.hi16:hiCE.Key_0204.text
ltx/en_us_public/hi.hi16:hiCE.Key_0205.text	@ltx/en_us_goa/hi.hi16:hiCE.Key_0205.text
ltx/en_us_public/hi.hi16:hiCE.Key_0206.rubric	@ltx/en_us_goa/hi.hi16:hiCE.Key_0206.rubric
ltx/en_us_public/hi.hi16:hiCE.Key_0207.text	@ltx/en_us_goa/hi.hi16:hiCE.Key_0207.text
ltx/en_us_public/hi.hi16:hiCE.Key_0207_bicentennial.text	@ltx/en_us_goa/hi.hi16:hiCE.Key_0207.text
ltx/en_us_public/hi.hi16:hiCE.Key_0300.title	@ltx/en_us_goa/hi.hi16:hiCE.Key_0300.title
ltx/en_us_public/hi.hi16:hiCE.Key_0301.title	@ltx/en_us_goa/hi.hi16:hiCE.Key_0301.title
ltx/en_us_public/hi.hi16:hiCE.Key_0302.title	@ltx/en_us_goa/hi.hi16:hiCE.Key_0302.title
ltx/en_us_public/hi.hi16:hiCE.Key_0303.rubric	@ltx/en_us_goa/hi.hi16:hiCE.Key_0303.rubric
ltx/en_us_public/hi.hi16:hiCE.Key_0304.rubric	@ltx/en_us_goa/hi.hi16:hiCE.Key_0304.rubric
ltx/en_us_public/hi.hi16:hiCE.Key_0305.rubric	@ltx/en_us_goa/hi.hi16:hiCE.Key_0305.rubric
ltx/en_us_public/hi.hi16:hiCE.Key_0306.text	@ltx/en_us_goa/hi.hi16:hiCE.Key_0306.text
ltx/en_us_public/hi.hi16:hiCE.Key_0307.text	@ltx/en_us_goa/hi.hi16:hiCE.Key_0307.text
ltx/en_us_public/hi.hi16:hiCE.Key_0308.text	@ltx/en_us_goa/hi.hi16:hiCE.Key_0308.text
ltx/en_us_public/hi.hi16:hiCE.Key_0309.text	@ltx/en_us_goa/hi.hi16:hiCE.Key_0309.text
ltx/en_us_public/hi.hi16:hiCE.Key_0310.text	@ltx/en_us_goa/hi.hi16:hiCE.Key_0310.text
ltx/en_us_public/hi.hi16:hiCE.Key_0311.text	@ltx/en_us_goa/hi.hi16:hiCE.Key_0311.text
ltx/en_us_public/hi.hi16:hiCE.Key_0312.text	@ltx/en_us_goa/hi.hi16:hiCE.Key_0312.text
ltx/en_us_public/hi.hi16:hiCE.Key_0313.text	@ltx/en_us_goa/hi.hi16:hiCE.Key_0313.text
ltx/en_us_public/hi.hi16:hiCE.Key_0314.rubric	@ltx/en_us_goa/hi.hi16:hiCE.Key_0314.rubric
ltx/en_us_public/hi.hi16:hiCE.Key_0315.title	@ltx/en_us_goa/hi.hi16:hiCE.Key_0315.title
ltx/en_us_public/hi.hi16:hiCE.Key_0316.text	@ltx/en_us_goa/hi.hi16:hiCE.Key_0316.text
ltx/en_us_public/hi.hi16:hiCE.Key_0317.rubric	@ltx/en_us_goa/hi.hi16:hiCE.Key_0317.rubric
ltx/en_us_public/hi.hi16:hiCE.Key_0400.title	@ltx/en_us_goa/hi.hi16:hiCE.Key_0400.title
ltx/en_us_public/hi.hi16:hiCE.Key_0401.title	@ltx/en_us_goa/hi.hi16:hiCE.Key_0401.title
ltx/en_us_public/hi.hi16:hiCE.Key_0402.text	@ltx/en_us_goa/hi.hi16:hiCE.Key_0402.text
ltx/en_us_public/hi.hi16:hiCE.Key_0402.title	@ltx/en_us_goa/hi.hi16:hiCE.Key_0402.title
ltx/en_us_public/hi.hi16:hiCE.Key_0403.rubric	@ltx/en_us_goa/hi.hi16:hiCE.Key_0403.rubric
ltx/en_us_public/hi.hi16:hiCE.Key_0404.text	@ltx/en_us_goa/hi.hi16:hiCE.Key_0404.text
ltx/en_us_public/hi.hi16:hiCE.Key_0405.text	@ltx/en_us_goa/hi.hi16:hiCE.Key_0405.text
ltx/en_us_public/hi.hi16:hiCE.Key_0406.rubric	@ltx/en_us_goa/hi.hi16:hiCE.Key_0406.rubric
ltx/en_us_public/hi.hi16:hiCE.Key_0407.text	@ltx/en_us_goa/hi.hi16:hiCE.Key_0407.text
ltx/en_us_public/hi.hi16:hiCE.Key_additional_petition.text	@ltx/en_us_goa/hi.hi16:hiCE.Key_additional_petition.text
