ltx/en_us_public/me.m01.d14:meDA.commemoration.first	@ltx/en_us_dedes/me.m01.d14:meDA.commemoration.first
ltx/en_us_public/me.m01.d14:meDA.commemoration.first_name	@ltx/en_us_dedes/me.m01.d14:meDA.commemoration.first_name
ltx/en_us_public/me.m01.d14:meDA.commemoration.first_short	@ltx/en_us_dedes/me.m01.d14:meDA.commemoration.first_short
ltx/en_us_public/me.m01.d14:meDA.commemoration.first_title	@ltx/en_us_dedes/me.m01.d14:meDA.commemoration.first_title
ltx/en_us_public/me.m01.d14:meDA.commemoration.full	@ltx/en_us_dedes/me.m01.d14:meDA.commemoration.full
ltx/en_us_public/me.m01.d14:meDA.commemoration.second_name	@ltx/en_us_dedes/me.m01.d14:meDA.commemoration.second_name
ltx/en_us_public/me.m01.d14:meDA.commemoration.second_title	@ltx/en_us_dedes/me.m01.d14:meDA.commemoration.second_title
ltx/en_us_public/me.m01.d14:meDA.date	@ltx/en_us_dedes/me.m01.d14:meDA.date
ltx/en_us_public/me.m01.d14:meDA.dismissal	@ltx/en_us_dedes/me.m01.d14:meDA.dismissal
ltx/en_us_public/me.m01.d14:meDA.insert1	@ltx/en_us_dedes/me.m01.d14:meDA.insert1
ltx/en_us_public/me.m01.d14:meDA.insert2	@ltx/en_us_dedes/me.m01.d14:meDA.insert2
ltx/en_us_public/me.m01.d14:meDA.note	@ltx/en_us_dedes/me.m01.d14:meDA.note
ltx/en_us_public/me.m01.d14:meHO.commemorations	@ltx/en_us_dedes/me.m01.d14:meHO.commemorations
ltx/en_us_public/me.m01.d14:meHO.note1	@ltx/en_us_dedes/me.m01.d14:meHO.note1
ltx/en_us_public/me.m01.d14:meHO.note2	@ltx/en_us_dedes/me.m01.d14:meHO.note2
ltx/en_us_public/me.m01.d14:meHO.number	@ltx/en_us_dedes/me.m01.d14:meHO.number
ltx/en_us_public/me.m01.d14:meHO.rank	@ltx/en_us_dedes/me.m01.d14:meHO.rank
ltx/en_us_public/me.m01.d14:meLE.commemoration1	@ltx/en_us_dedes/me.m01.d14:meLE.commemoration1
ltx/en_us_public/me.m01.d14:meLE.commemoration2	@ltx/en_us_dedes/me.m01.d14:meLE.commemoration2
