ltx/en_us_public/he.h.m5:heHE.AkikoaKyrieTinAkoin.greekname	@ltx/en_us_dedes/he.h.m5:heHE.AkikoaKyrieTinAkoin.greekname
ltx/en_us_public/he.h.m5:heHE.AkikoaKyrieTinAkoin.incipit	@ltx/en_us_dedes/he.h.m5:heHE.AkikoaKyrieTinAkoin.incipit
ltx/en_us_public/he.h.m5:heHE.AkikoaKyrieTinAkoin.melody	@ltx/en_us_dedes/he.h.m5:heHE.AkikoaKyrieTinAkoin.melody
ltx/en_us_public/he.h.m5:heHE.AkikoaKyrieTinAkoin.mode	@ltx/en_us_dedes/he.h.m5:heHE.AkikoaKyrieTinAkoin.mode
ltx/en_us_public/he.h.m5:heHE.AkikoaKyrieTinAkoin.name	@ltx/en_us_dedes/he.h.m5:heHE.AkikoaKyrieTinAkoin.name
ltx/en_us_public/he.h.m5:heHE.AkikoaKyrieTinAkoin.notmetered	@ltx/en_us_dedes/he.h.m5:heHE.AkikoaKyrieTinAkoin.notmetered
ltx/en_us_public/he.h.m5:heHE.AkikoaKyrieTinAkoin.ode	@ltx/en_us_dedes/he.h.m5:heHE.AkikoaKyrieTinAkoin.ode
ltx/en_us_public/he.h.m5:heHE.AkikoaKyrieTinAkoin.text	@ltx/en_us_dedes/he.h.m5:heHE.AkikoaKyrieTinAkoin.text
ltx/en_us_public/he.h.m5:heHE.AkikoaKyrieTinEkTouTafou.greekname	@ltx/en_us_dedes/he.h.m5:heHE.AkikoaKyrieTinEkTouTafou.greekname
ltx/en_us_public/he.h.m5:heHE.AkikoaKyrieTinEkTouTafou.incipit	@ltx/en_us_dedes/he.h.m5:heHE.AkikoaKyrieTinEkTouTafou.incipit
ltx/en_us_public/he.h.m5:heHE.AkikoaKyrieTinEkTouTafou.melody	@ltx/en_us_dedes/he.h.m5:heHE.AkikoaKyrieTinEkTouTafou.melody
ltx/en_us_public/he.h.m5:heHE.AkikoaKyrieTinEkTouTafou.mode	@ltx/en_us_dedes/he.h.m5:heHE.AkikoaKyrieTinEkTouTafou.mode
ltx/en_us_public/he.h.m5:heHE.AkikoaKyrieTinEkTouTafou.name	@ltx/en_us_dedes/he.h.m5:heHE.AkikoaKyrieTinEkTouTafou.name
ltx/en_us_public/he.h.m5:heHE.AkikoaKyrieTinEkTouTafou.notmetered	@ltx/en_us_dedes/he.h.m5:heHE.AkikoaKyrieTinEkTouTafou.notmetered
ltx/en_us_public/he.h.m5:heHE.AkikoaKyrieTinEkTouTafou.ode	@ltx/en_us_dedes/he.h.m5:heHE.AkikoaKyrieTinEkTouTafou.ode
ltx/en_us_public/he.h.m5:heHE.AkikoaKyrieTinEkTouTafou.text	@ltx/en_us_dedes/he.h.m5:heHE.AkikoaKyrieTinEkTouTafou.text
ltx/en_us_public/he.h.m5:heHE.AngelonSystima.greekname	@ltx/en_us_dedes/he.h.m5:heHE.AngelonSystima.greekname
ltx/en_us_public/he.h.m5:heHE.AngelonSystima.incipit	@ltx/en_us_dedes/he.h.m5:heHE.AngelonSystima.incipit
ltx/en_us_public/he.h.m5:heHE.AngelonSystima.melody	@ltx/en_us_dedes/he.h.m5:heHE.AngelonSystima.melody
ltx/en_us_public/he.h.m5:heHE.AngelonSystima.mode	@ltx/en_us_dedes/he.h.m5:heHE.AngelonSystima.mode
ltx/en_us_public/he.h.m5:heHE.AngelonSystima.name	@ltx/en_us_dedes/he.h.m5:heHE.AngelonSystima.name
ltx/en_us_public/he.h.m5:heHE.AngelonSystima.notmetered	@ltx/en_us_dedes/he.h.m5:heHE.AngelonSystima.notmetered
ltx/en_us_public/he.h.m5:heHE.AngelonSystima.ode	@ltx/en_us_dedes/he.h.m5:heHE.AngelonSystima.ode
ltx/en_us_public/he.h.m5:heHE.AngelonSystima.text	@ltx/en_us_dedes/he.h.m5:heHE.AngelonSystima.text
ltx/en_us_public/he.h.m5:heHE.AsomenToKyrio.greekname	@ltx/en_us_dedes/he.h.m5:heHE.AsomenToKyrio.greekname
ltx/en_us_public/he.h.m5:heHE.AsomenToKyrio.incipit	@ltx/en_us_dedes/he.h.m5:heHE.AsomenToKyrio.incipit
ltx/en_us_public/he.h.m5:heHE.AsomenToKyrio.melody	@ltx/en_us_dedes/he.h.m5:heHE.AsomenToKyrio.melody
ltx/en_us_public/he.h.m5:heHE.AsomenToKyrio.mode	@ltx/en_us_dedes/he.h.m5:heHE.AsomenToKyrio.mode
ltx/en_us_public/he.h.m5:heHE.AsomenToKyrio.name	@ltx/en_us_dedes/he.h.m5:heHE.AsomenToKyrio.name
ltx/en_us_public/he.h.m5:heHE.AsomenToKyrio.notmetered	@ltx/en_us_dedes/he.h.m5:heHE.AsomenToKyrio.notmetered
ltx/en_us_public/he.h.m5:heHE.AsomenToKyrio.ode	@ltx/en_us_dedes/he.h.m5:heHE.AsomenToKyrio.ode
ltx/en_us_public/he.h.m5:heHE.AsomenToKyrio.text	@ltx/en_us_dedes/he.h.m5:heHE.AsomenToKyrio.text
ltx/en_us_public/he.h.m5:heHE.DynameiTouStavrouSou.greekname	@ltx/en_us_dedes/he.h.m5:heHE.DynameiTouStavrouSou.greekname
ltx/en_us_public/he.h.m5:heHE.DynameiTouStavrouSou.incipit	@ltx/en_us_dedes/he.h.m5:heHE.DynameiTouStavrouSou.incipit
ltx/en_us_public/he.h.m5:heHE.DynameiTouStavrouSou.melody	@ltx/en_us_dedes/he.h.m5:heHE.DynameiTouStavrouSou.melody
ltx/en_us_public/he.h.m5:heHE.DynameiTouStavrouSou.mode	@ltx/en_us_dedes/he.h.m5:heHE.DynameiTouStavrouSou.mode
ltx/en_us_public/he.h.m5:heHE.DynameiTouStavrouSou.name	@ltx/en_us_dedes/he.h.m5:heHE.DynameiTouStavrouSou.name
ltx/en_us_public/he.h.m5:heHE.DynameiTouStavrouSou.notmetered	@ltx/en_us_dedes/he.h.m5:heHE.DynameiTouStavrouSou.notmetered
ltx/en_us_public/he.h.m5:heHE.DynameiTouStavrouSou.ode	@ltx/en_us_dedes/he.h.m5:heHE.DynameiTouStavrouSou.ode
ltx/en_us_public/he.h.m5:heHE.DynameiTouStavrouSou.text	@ltx/en_us_dedes/he.h.m5:heHE.DynameiTouStavrouSou.text
ltx/en_us_public/he.h.m5:heHE.EisakikoaTinAkoin.greekname	@ltx/en_us_dedes/he.h.m5:heHE.EisakikoaTinAkoin.greekname
ltx/en_us_public/he.h.m5:heHE.EisakikoaTinAkoin.incipit	@ltx/en_us_dedes/he.h.m5:heHE.EisakikoaTinAkoin.incipit
ltx/en_us_public/he.h.m5:heHE.EisakikoaTinAkoin.melody	@ltx/en_us_dedes/he.h.m5:heHE.EisakikoaTinAkoin.melody
ltx/en_us_public/he.h.m5:heHE.EisakikoaTinAkoin.mode	@ltx/en_us_dedes/he.h.m5:heHE.EisakikoaTinAkoin.mode
ltx/en_us_public/he.h.m5:heHE.EisakikoaTinAkoin.name	@ltx/en_us_dedes/he.h.m5:heHE.EisakikoaTinAkoin.name
ltx/en_us_public/he.h.m5:heHE.EisakikoaTinAkoin.notmetered	@ltx/en_us_dedes/he.h.m5:heHE.EisakikoaTinAkoin.notmetered
ltx/en_us_public/he.h.m5:heHE.EisakikoaTinAkoin.ode	@ltx/en_us_dedes/he.h.m5:heHE.EisakikoaTinAkoin.ode
ltx/en_us_public/he.h.m5:heHE.EisakikoaTinAkoin.text	@ltx/en_us_dedes/he.h.m5:heHE.EisakikoaTinAkoin.text
ltx/en_us_public/he.h.m5:heHE.EkNyktosOrthrizontes.greekname	@ltx/en_us_dedes/he.h.m5:heHE.EkNyktosOrthrizontes.greekname
ltx/en_us_public/he.h.m5:heHE.EkNyktosOrthrizontes.incipit	@ltx/en_us_dedes/he.h.m5:heHE.EkNyktosOrthrizontes.incipit
ltx/en_us_public/he.h.m5:heHE.EkNyktosOrthrizontes.melody	@ltx/en_us_dedes/he.h.m5:heHE.EkNyktosOrthrizontes.melody
ltx/en_us_public/he.h.m5:heHE.EkNyktosOrthrizontes.mode	@ltx/en_us_dedes/he.h.m5:heHE.EkNyktosOrthrizontes.mode
ltx/en_us_public/he.h.m5:heHE.EkNyktosOrthrizontes.name	@ltx/en_us_dedes/he.h.m5:heHE.EkNyktosOrthrizontes.name
ltx/en_us_public/he.h.m5:heHE.EkNyktosOrthrizontes.notmetered	@ltx/en_us_dedes/he.h.m5:heHE.EkNyktosOrthrizontes.notmetered
ltx/en_us_public/he.h.m5:heHE.EkNyktosOrthrizontes.ode	@ltx/en_us_dedes/he.h.m5:heHE.EkNyktosOrthrizontes.ode
ltx/en_us_public/he.h.m5:heHE.EkNyktosOrthrizontes.text	@ltx/en_us_dedes/he.h.m5:heHE.EkNyktosOrthrizontes.text
ltx/en_us_public/he.h.m5:heHE.EkykloseMeAvyssos.greekname	@ltx/en_us_dedes/he.h.m5:heHE.EkykloseMeAvyssos.greekname
ltx/en_us_public/he.h.m5:heHE.EkykloseMeAvyssos.incipit	@ltx/en_us_dedes/he.h.m5:heHE.EkykloseMeAvyssos.incipit
ltx/en_us_public/he.h.m5:heHE.EkykloseMeAvyssos.melody	@ltx/en_us_dedes/he.h.m5:heHE.EkykloseMeAvyssos.melody
ltx/en_us_public/he.h.m5:heHE.EkykloseMeAvyssos.mode	@ltx/en_us_dedes/he.h.m5:heHE.EkykloseMeAvyssos.mode
ltx/en_us_public/he.h.m5:heHE.EkykloseMeAvyssos.name	@ltx/en_us_dedes/he.h.m5:heHE.EkykloseMeAvyssos.name
ltx/en_us_public/he.h.m5:heHE.EkykloseMeAvyssos.notmetered	@ltx/en_us_dedes/he.h.m5:heHE.EkykloseMeAvyssos.notmetered
ltx/en_us_public/he.h.m5:heHE.EkykloseMeAvyssos.ode	@ltx/en_us_dedes/he.h.m5:heHE.EkykloseMeAvyssos.ode
ltx/en_us_public/he.h.m5:heHE.EkykloseMeAvyssos.text	@ltx/en_us_dedes/he.h.m5:heHE.EkykloseMeAvyssos.text
ltx/en_us_public/he.h.m5:heHE.EpiTaEthni.greekname	@ltx/en_us_dedes/he.h.m5:heHE.EpiTaEthni.greekname
ltx/en_us_public/he.h.m5:heHE.EpiTaEthni.incipit	@ltx/en_us_dedes/he.h.m5:heHE.EpiTaEthni.incipit
ltx/en_us_public/he.h.m5:heHE.EpiTaEthni.melody	@ltx/en_us_dedes/he.h.m5:heHE.EpiTaEthni.melody
ltx/en_us_public/he.h.m5:heHE.EpiTaEthni.mode	@ltx/en_us_dedes/he.h.m5:heHE.EpiTaEthni.mode
ltx/en_us_public/he.h.m5:heHE.EpiTaEthni.name	@ltx/en_us_dedes/he.h.m5:heHE.EpiTaEthni.name
ltx/en_us_public/he.h.m5:heHE.EpiTaEthni.notmetered	@ltx/en_us_dedes/he.h.m5:heHE.EpiTaEthni.notmetered
ltx/en_us_public/he.h.m5:heHE.EpiTaEthni.ode	@ltx/en_us_dedes/he.h.m5:heHE.EpiTaEthni.ode
ltx/en_us_public/he.h.m5:heHE.EpiTaEthni.text	@ltx/en_us_dedes/he.h.m5:heHE.EpiTaEthni.text
ltx/en_us_public/he.h.m5:heHE.EvlogitosEiOTheos.greekname	@ltx/en_us_dedes/he.h.m5:heHE.EvlogitosEiOTheos.greekname
ltx/en_us_public/he.h.m5:heHE.EvlogitosEiOTheos.incipit	@ltx/en_us_dedes/he.h.m5:heHE.EvlogitosEiOTheos.incipit
ltx/en_us_public/he.h.m5:heHE.EvlogitosEiOTheos.melody	@ltx/en_us_dedes/he.h.m5:heHE.EvlogitosEiOTheos.melody
ltx/en_us_public/he.h.m5:heHE.EvlogitosEiOTheos.mode	@ltx/en_us_dedes/he.h.m5:heHE.EvlogitosEiOTheos.mode
ltx/en_us_public/he.h.m5:heHE.EvlogitosEiOTheos.name	@ltx/en_us_dedes/he.h.m5:heHE.EvlogitosEiOTheos.name
ltx/en_us_public/he.h.m5:heHE.EvlogitosEiOTheos.notmetered	@ltx/en_us_dedes/he.h.m5:heHE.EvlogitosEiOTheos.notmetered
ltx/en_us_public/he.h.m5:heHE.EvlogitosEiOTheos.ode	@ltx/en_us_dedes/he.h.m5:heHE.EvlogitosEiOTheos.ode
ltx/en_us_public/he.h.m5:heHE.EvlogitosEiOTheos.text	@ltx/en_us_dedes/he.h.m5:heHE.EvlogitosEiOTheos.text
ltx/en_us_public/he.h.m5:heHE.GinEfInOukElampsen.greekname	@ltx/en_us_dedes/he.h.m5:heHE.GinEfInOukElampsen.greekname
ltx/en_us_public/he.h.m5:heHE.GinEfInOukElampsen.incipit	@ltx/en_us_dedes/he.h.m5:heHE.GinEfInOukElampsen.incipit
ltx/en_us_public/he.h.m5:heHE.GinEfInOukElampsen.melody	@ltx/en_us_dedes/he.h.m5:heHE.GinEfInOukElampsen.melody
ltx/en_us_public/he.h.m5:heHE.GinEfInOukElampsen.mode	@ltx/en_us_dedes/he.h.m5:heHE.GinEfInOukElampsen.mode
ltx/en_us_public/he.h.m5:heHE.GinEfInOukElampsen.name	@ltx/en_us_dedes/he.h.m5:heHE.GinEfInOukElampsen.name
ltx/en_us_public/he.h.m5:heHE.GinEfInOukElampsen.notmetered	@ltx/en_us_dedes/he.h.m5:heHE.GinEfInOukElampsen.notmetered
ltx/en_us_public/he.h.m5:heHE.GinEfInOukElampsen.ode	@ltx/en_us_dedes/he.h.m5:heHE.GinEfInOukElampsen.ode
ltx/en_us_public/he.h.m5:heHE.GinEfInOukElampsen.text	@ltx/en_us_dedes/he.h.m5:heHE.GinEfInOukElampsen.text
ltx/en_us_public/he.h.m5:heHE.IdeteIdete.greekname	@ltx/en_us_dedes/he.h.m5:heHE.IdeteIdete.greekname
ltx/en_us_public/he.h.m5:heHE.IdeteIdete.incipit	@ltx/en_us_dedes/he.h.m5:heHE.IdeteIdete.incipit
ltx/en_us_public/he.h.m5:heHE.IdeteIdete.melody	@ltx/en_us_dedes/he.h.m5:heHE.IdeteIdete.melody
ltx/en_us_public/he.h.m5:heHE.IdeteIdete.mode	@ltx/en_us_dedes/he.h.m5:heHE.IdeteIdete.mode
ltx/en_us_public/he.h.m5:heHE.IdeteIdete.name	@ltx/en_us_dedes/he.h.m5:heHE.IdeteIdete.name
ltx/en_us_public/he.h.m5:heHE.IdeteIdete.notmetered	@ltx/en_us_dedes/he.h.m5:heHE.IdeteIdete.notmetered
ltx/en_us_public/he.h.m5:heHE.IdeteIdete.ode	@ltx/en_us_dedes/he.h.m5:heHE.IdeteIdete.ode
ltx/en_us_public/he.h.m5:heHE.IdeteIdete.text	@ltx/en_us_dedes/he.h.m5:heHE.IdeteIdete.text
ltx/en_us_public/he.h.m5:heHE.IpponKaiAnavatin.greekname	@ltx/en_us_dedes/he.h.m5:heHE.IpponKaiAnavatin.greekname
ltx/en_us_public/he.h.m5:heHE.IpponKaiAnavatin.incipit	@ltx/en_us_dedes/he.h.m5:heHE.IpponKaiAnavatin.incipit
ltx/en_us_public/he.h.m5:heHE.IpponKaiAnavatin.melody	@ltx/en_us_dedes/he.h.m5:heHE.IpponKaiAnavatin.melody
ltx/en_us_public/he.h.m5:heHE.IpponKaiAnavatin.mode	@ltx/en_us_dedes/he.h.m5:heHE.IpponKaiAnavatin.mode
ltx/en_us_public/he.h.m5:heHE.IpponKaiAnavatin.name	@ltx/en_us_dedes/he.h.m5:heHE.IpponKaiAnavatin.name
ltx/en_us_public/he.h.m5:heHE.IpponKaiAnavatin.notmetered	@ltx/en_us_dedes/he.h.m5:heHE.IpponKaiAnavatin.notmetered
ltx/en_us_public/he.h.m5:heHE.IpponKaiAnavatin.ode	@ltx/en_us_dedes/he.h.m5:heHE.IpponKaiAnavatin.ode
ltx/en_us_public/he.h.m5:heHE.IpponKaiAnavatin.text	@ltx/en_us_dedes/he.h.m5:heHE.IpponKaiAnavatin.text
ltx/en_us_public/he.h.m5:heHE.IsaiaChoreve.greekname	@ltx/en_us_dedes/he.h.m5:heHE.IsaiaChoreve.greekname
ltx/en_us_public/he.h.m5:heHE.IsaiaChoreve.incipit	@ltx/en_us_dedes/he.h.m5:heHE.IsaiaChoreve.incipit
ltx/en_us_public/he.h.m5:heHE.IsaiaChoreve.melody	@ltx/en_us_dedes/he.h.m5:heHE.IsaiaChoreve.melody
ltx/en_us_public/he.h.m5:heHE.IsaiaChoreve.mode	@ltx/en_us_dedes/he.h.m5:heHE.IsaiaChoreve.mode
ltx/en_us_public/he.h.m5:heHE.IsaiaChoreve.name	@ltx/en_us_dedes/he.h.m5:heHE.IsaiaChoreve.name
ltx/en_us_public/he.h.m5:heHE.IsaiaChoreve.notmetered	@ltx/en_us_dedes/he.h.m5:heHE.IsaiaChoreve.notmetered
ltx/en_us_public/he.h.m5:heHE.IsaiaChoreve.ode	@ltx/en_us_dedes/he.h.m5:heHE.IsaiaChoreve.ode
ltx/en_us_public/he.h.m5:heHE.IsaiaChoreve.text	@ltx/en_us_dedes/he.h.m5:heHE.IsaiaChoreve.text
ltx/en_us_public/he.h.m5:heHE.MainomeninKlydoni.greekname	@ltx/en_us_dedes/he.h.m5:heHE.MainomeninKlydoni.greekname
ltx/en_us_public/he.h.m5:heHE.MainomeninKlydoni.incipit	@ltx/en_us_dedes/he.h.m5:heHE.MainomeninKlydoni.incipit
ltx/en_us_public/he.h.m5:heHE.MainomeninKlydoni.melody	@ltx/en_us_dedes/he.h.m5:heHE.MainomeninKlydoni.melody
ltx/en_us_public/he.h.m5:heHE.MainomeninKlydoni.mode	@ltx/en_us_dedes/he.h.m5:heHE.MainomeninKlydoni.mode
ltx/en_us_public/he.h.m5:heHE.MainomeninKlydoni.name	@ltx/en_us_dedes/he.h.m5:heHE.MainomeninKlydoni.name
ltx/en_us_public/he.h.m5:heHE.MainomeninKlydoni.notmetered	@ltx/en_us_dedes/he.h.m5:heHE.MainomeninKlydoni.notmetered
ltx/en_us_public/he.h.m5:heHE.MainomeninKlydoni.ode	@ltx/en_us_dedes/he.h.m5:heHE.MainomeninKlydoni.ode
ltx/en_us_public/he.h.m5:heHE.MainomeninKlydoni.text	@ltx/en_us_dedes/he.h.m5:heHE.MainomeninKlydoni.text
ltx/en_us_public/he.h.m5:heHE.MegalynomenChriste.greekname	@ltx/en_us_dedes/he.h.m5:heHE.MegalynomenChriste.greekname
ltx/en_us_public/he.h.m5:heHE.MegalynomenChriste.incipit	@ltx/en_us_dedes/he.h.m5:heHE.MegalynomenChriste.incipit
ltx/en_us_public/he.h.m5:heHE.MegalynomenChriste.melody	@ltx/en_us_dedes/he.h.m5:heHE.MegalynomenChriste.melody
ltx/en_us_public/he.h.m5:heHE.MegalynomenChriste.mode	@ltx/en_us_dedes/he.h.m5:heHE.MegalynomenChriste.mode
ltx/en_us_public/he.h.m5:heHE.MegalynomenChriste.name	@ltx/en_us_dedes/he.h.m5:heHE.MegalynomenChriste.name
ltx/en_us_public/he.h.m5:heHE.MegalynomenChriste.notmetered	@ltx/en_us_dedes/he.h.m5:heHE.MegalynomenChriste.notmetered
ltx/en_us_public/he.h.m5:heHE.MegalynomenChriste.ode	@ltx/en_us_dedes/he.h.m5:heHE.MegalynomenChriste.ode
ltx/en_us_public/he.h.m5:heHE.MegalynomenChriste.text	@ltx/en_us_dedes/he.h.m5:heHE.MegalynomenChriste.text
ltx/en_us_public/he.h.m5:heHE.OAnavallomenos.greekname	@ltx/en_us_dedes/he.h.m5:heHE.OAnavallomenos.greekname
ltx/en_us_public/he.h.m5:heHE.OAnavallomenos.incipit	@ltx/en_us_dedes/he.h.m5:heHE.OAnavallomenos.incipit
ltx/en_us_public/he.h.m5:heHE.OAnavallomenos.melody	@ltx/en_us_dedes/he.h.m5:heHE.OAnavallomenos.melody
ltx/en_us_public/he.h.m5:heHE.OAnavallomenos.mode	@ltx/en_us_dedes/he.h.m5:heHE.OAnavallomenos.mode
ltx/en_us_public/he.h.m5:heHE.OAnavallomenos.name	@ltx/en_us_dedes/he.h.m5:heHE.OAnavallomenos.name
ltx/en_us_public/he.h.m5:heHE.OAnavallomenos.notmetered	@ltx/en_us_dedes/he.h.m5:heHE.OAnavallomenos.notmetered
ltx/en_us_public/he.h.m5:heHE.OAnavallomenos.ode	@ltx/en_us_dedes/he.h.m5:heHE.OAnavallomenos.ode
ltx/en_us_public/he.h.m5:heHE.OAnavallomenos.text	@ltx/en_us_dedes/he.h.m5:heHE.OAnavallomenos.text
ltx/en_us_public/he.h.m5:heHE.OEnKaminoPyros.greekname	@ltx/en_us_dedes/he.h.m5:heHE.OEnKaminoPyros.greekname
ltx/en_us_public/he.h.m5:heHE.OEnKaminoPyros.incipit	@ltx/en_us_dedes/he.h.m5:heHE.OEnKaminoPyros.incipit
ltx/en_us_public/he.h.m5:heHE.OEnKaminoPyros.melody	@ltx/en_us_dedes/he.h.m5:heHE.OEnKaminoPyros.melody
ltx/en_us_public/he.h.m5:heHE.OEnKaminoPyros.mode	@ltx/en_us_dedes/he.h.m5:heHE.OEnKaminoPyros.mode
ltx/en_us_public/he.h.m5:heHE.OEnKaminoPyros.name	@ltx/en_us_dedes/he.h.m5:heHE.OEnKaminoPyros.name
ltx/en_us_public/he.h.m5:heHE.OEnKaminoPyros.notmetered	@ltx/en_us_dedes/he.h.m5:heHE.OEnKaminoPyros.notmetered
ltx/en_us_public/he.h.m5:heHE.OEnKaminoPyros.ode	@ltx/en_us_dedes/he.h.m5:heHE.OEnKaminoPyros.ode
ltx/en_us_public/he.h.m5:heHE.OEnKaminoPyros.text	@ltx/en_us_dedes/he.h.m5:heHE.OEnKaminoPyros.text
ltx/en_us_public/he.h.m5:heHE.OPixasEpOudenos.greekname	@ltx/en_us_dedes/he.h.m5:heHE.OPixasEpOudenos.greekname
ltx/en_us_public/he.h.m5:heHE.OPixasEpOudenos.incipit	@ltx/en_us_dedes/he.h.m5:heHE.OPixasEpOudenos.incipit
ltx/en_us_public/he.h.m5:heHE.OPixasEpOudenos.melody	@ltx/en_us_dedes/he.h.m5:heHE.OPixasEpOudenos.melody
ltx/en_us_public/he.h.m5:heHE.OPixasEpOudenos.mode	@ltx/en_us_dedes/he.h.m5:heHE.OPixasEpOudenos.mode
ltx/en_us_public/he.h.m5:heHE.OPixasEpOudenos.name	@ltx/en_us_dedes/he.h.m5:heHE.OPixasEpOudenos.name
ltx/en_us_public/he.h.m5:heHE.OPixasEpOudenos.notmetered	@ltx/en_us_dedes/he.h.m5:heHE.OPixasEpOudenos.notmetered
ltx/en_us_public/he.h.m5:heHE.OPixasEpOudenos.ode	@ltx/en_us_dedes/he.h.m5:heHE.OPixasEpOudenos.ode
ltx/en_us_public/he.h.m5:heHE.OPixasEpOudenos.text	@ltx/en_us_dedes/he.h.m5:heHE.OPixasEpOudenos.text
ltx/en_us_public/he.h.m5:heHE.OYperypsoumenos.greekname	@ltx/en_us_dedes/he.h.m5:heHE.OYperypsoumenos.greekname
ltx/en_us_public/he.h.m5:heHE.OYperypsoumenos.incipit	@ltx/en_us_dedes/he.h.m5:heHE.OYperypsoumenos.incipit
ltx/en_us_public/he.h.m5:heHE.OYperypsoumenos.melody	@ltx/en_us_dedes/he.h.m5:heHE.OYperypsoumenos.melody
ltx/en_us_public/he.h.m5:heHE.OYperypsoumenos.mode	@ltx/en_us_dedes/he.h.m5:heHE.OYperypsoumenos.mode
ltx/en_us_public/he.h.m5:heHE.OYperypsoumenos.name	@ltx/en_us_dedes/he.h.m5:heHE.OYperypsoumenos.name
ltx/en_us_public/he.h.m5:heHE.OYperypsoumenos.notmetered	@ltx/en_us_dedes/he.h.m5:heHE.OYperypsoumenos.notmetered
ltx/en_us_public/he.h.m5:heHE.OYperypsoumenos.ode	@ltx/en_us_dedes/he.h.m5:heHE.OYperypsoumenos.ode
ltx/en_us_public/he.h.m5:heHE.OYperypsoumenos.text	@ltx/en_us_dedes/he.h.m5:heHE.OYperypsoumenos.text
ltx/en_us_public/he.h.m5:heHE.OiOsioiSouPaides.greekname	@ltx/en_us_dedes/he.h.m5:heHE.OiOsioiSouPaides.greekname
ltx/en_us_public/he.h.m5:heHE.OiOsioiSouPaides.incipit	@ltx/en_us_dedes/he.h.m5:heHE.OiOsioiSouPaides.incipit
ltx/en_us_public/he.h.m5:heHE.OiOsioiSouPaides.melody	@ltx/en_us_dedes/he.h.m5:heHE.OiOsioiSouPaides.melody
ltx/en_us_public/he.h.m5:heHE.OiOsioiSouPaides.mode	@ltx/en_us_dedes/he.h.m5:heHE.OiOsioiSouPaides.mode
ltx/en_us_public/he.h.m5:heHE.OiOsioiSouPaides.name	@ltx/en_us_dedes/he.h.m5:heHE.OiOsioiSouPaides.name
ltx/en_us_public/he.h.m5:heHE.OiOsioiSouPaides.notmetered	@ltx/en_us_dedes/he.h.m5:heHE.OiOsioiSouPaides.notmetered
ltx/en_us_public/he.h.m5:heHE.OiOsioiSouPaides.ode	@ltx/en_us_dedes/he.h.m5:heHE.OiOsioiSouPaides.ode
ltx/en_us_public/he.h.m5:heHE.OiOsioiSouPaides.text	@ltx/en_us_dedes/he.h.m5:heHE.OiOsioiSouPaides.text
ltx/en_us_public/he.h.m5:heHE.OrthrizontesVoomenSoi.greekname	@ltx/en_us_dedes/he.h.m5:heHE.OrthrizontesVoomenSoi.greekname
ltx/en_us_public/he.h.m5:heHE.OrthrizontesVoomenSoi.incipit	@ltx/en_us_dedes/he.h.m5:heHE.OrthrizontesVoomenSoi.incipit
ltx/en_us_public/he.h.m5:heHE.OrthrizontesVoomenSoi.melody	@ltx/en_us_dedes/he.h.m5:heHE.OrthrizontesVoomenSoi.melody
ltx/en_us_public/he.h.m5:heHE.OrthrizontesVoomenSoi.mode	@ltx/en_us_dedes/he.h.m5:heHE.OrthrizontesVoomenSoi.mode
ltx/en_us_public/he.h.m5:heHE.OrthrizontesVoomenSoi.name	@ltx/en_us_dedes/he.h.m5:heHE.OrthrizontesVoomenSoi.name
ltx/en_us_public/he.h.m5:heHE.OrthrizontesVoomenSoi.notmetered	@ltx/en_us_dedes/he.h.m5:heHE.OrthrizontesVoomenSoi.notmetered
ltx/en_us_public/he.h.m5:heHE.OrthrizontesVoomenSoi.ode	@ltx/en_us_dedes/he.h.m5:heHE.OrthrizontesVoomenSoi.ode
ltx/en_us_public/he.h.m5:heHE.OrthrizontesVoomenSoi.text	@ltx/en_us_dedes/he.h.m5:heHE.OrthrizontesVoomenSoi.text
ltx/en_us_public/he.h.m5:heHE.OsTonProfitinTouThiros.greekname	@ltx/en_us_dedes/he.h.m5:heHE.OsTonProfitinTouThiros.greekname
ltx/en_us_public/he.h.m5:heHE.OsTonProfitinTouThiros.incipit	@ltx/en_us_dedes/he.h.m5:heHE.OsTonProfitinTouThiros.incipit
ltx/en_us_public/he.h.m5:heHE.OsTonProfitinTouThiros.melody	@ltx/en_us_dedes/he.h.m5:heHE.OsTonProfitinTouThiros.melody
ltx/en_us_public/he.h.m5:heHE.OsTonProfitinTouThiros.mode	@ltx/en_us_dedes/he.h.m5:heHE.OsTonProfitinTouThiros.mode
ltx/en_us_public/he.h.m5:heHE.OsTonProfitinTouThiros.name	@ltx/en_us_dedes/he.h.m5:heHE.OsTonProfitinTouThiros.name
ltx/en_us_public/he.h.m5:heHE.OsTonProfitinTouThiros.notmetered	@ltx/en_us_dedes/he.h.m5:heHE.OsTonProfitinTouThiros.notmetered
ltx/en_us_public/he.h.m5:heHE.OsTonProfitinTouThiros.ode	@ltx/en_us_dedes/he.h.m5:heHE.OsTonProfitinTouThiros.ode
ltx/en_us_public/he.h.m5:heHE.OsTonProfitinTouThiros.text	@ltx/en_us_dedes/he.h.m5:heHE.OsTonProfitinTouThiros.text
ltx/en_us_public/he.h.m5:heHE.OtiEpoiiseSoiMegaleia.greekname	@ltx/en_us_dedes/he.h.m5:heHE.OtiEpoiiseSoiMegaleia.greekname
ltx/en_us_public/he.h.m5:heHE.OtiEpoiiseSoiMegaleia.incipit	@ltx/en_us_dedes/he.h.m5:heHE.OtiEpoiiseSoiMegaleia.incipit
ltx/en_us_public/he.h.m5:heHE.OtiEpoiiseSoiMegaleia.melody	@ltx/en_us_dedes/he.h.m5:heHE.OtiEpoiiseSoiMegaleia.melody
ltx/en_us_public/he.h.m5:heHE.OtiEpoiiseSoiMegaleia.mode	@ltx/en_us_dedes/he.h.m5:heHE.OtiEpoiiseSoiMegaleia.mode
ltx/en_us_public/he.h.m5:heHE.OtiEpoiiseSoiMegaleia.name	@ltx/en_us_dedes/he.h.m5:heHE.OtiEpoiiseSoiMegaleia.name
ltx/en_us_public/he.h.m5:heHE.OtiEpoiiseSoiMegaleia.notmetered	@ltx/en_us_dedes/he.h.m5:heHE.OtiEpoiiseSoiMegaleia.notmetered
ltx/en_us_public/he.h.m5:heHE.OtiEpoiiseSoiMegaleia.ode	@ltx/en_us_dedes/he.h.m5:heHE.OtiEpoiiseSoiMegaleia.ode
ltx/en_us_public/he.h.m5:heHE.OtiEpoiiseSoiMegaleia.text	@ltx/en_us_dedes/he.h.m5:heHE.OtiEpoiiseSoiMegaleia.text
ltx/en_us_public/he.h.m5:heHE.PyrosSvestirion.greekname	@ltx/en_us_dedes/he.h.m5:heHE.PyrosSvestirion.greekname
ltx/en_us_public/he.h.m5:heHE.PyrosSvestirion.incipit	@ltx/en_us_dedes/he.h.m5:heHE.PyrosSvestirion.incipit
ltx/en_us_public/he.h.m5:heHE.PyrosSvestirion.melody	@ltx/en_us_dedes/he.h.m5:heHE.PyrosSvestirion.melody
ltx/en_us_public/he.h.m5:heHE.PyrosSvestirion.mode	@ltx/en_us_dedes/he.h.m5:heHE.PyrosSvestirion.mode
ltx/en_us_public/he.h.m5:heHE.PyrosSvestirion.name	@ltx/en_us_dedes/he.h.m5:heHE.PyrosSvestirion.name
ltx/en_us_public/he.h.m5:heHE.PyrosSvestirion.notmetered	@ltx/en_us_dedes/he.h.m5:heHE.PyrosSvestirion.notmetered
ltx/en_us_public/he.h.m5:heHE.PyrosSvestirion.ode	@ltx/en_us_dedes/he.h.m5:heHE.PyrosSvestirion.ode
ltx/en_us_public/he.h.m5:heHE.PyrosSvestirion.text	@ltx/en_us_dedes/he.h.m5:heHE.PyrosSvestirion.text
ltx/en_us_public/he.h.m5:heHE.SalevomeninTinKardian.greekname	@ltx/en_us_dedes/he.h.m5:heHE.SalevomeninTinKardian.greekname
ltx/en_us_public/he.h.m5:heHE.SalevomeninTinKardian.incipit	@ltx/en_us_dedes/he.h.m5:heHE.SalevomeninTinKardian.incipit
ltx/en_us_public/he.h.m5:heHE.SalevomeninTinKardian.melody	@ltx/en_us_dedes/he.h.m5:heHE.SalevomeninTinKardian.melody
ltx/en_us_public/he.h.m5:heHE.SalevomeninTinKardian.mode	@ltx/en_us_dedes/he.h.m5:heHE.SalevomeninTinKardian.mode
ltx/en_us_public/he.h.m5:heHE.SalevomeninTinKardian.name	@ltx/en_us_dedes/he.h.m5:heHE.SalevomeninTinKardian.name
ltx/en_us_public/he.h.m5:heHE.SalevomeninTinKardian.notmetered	@ltx/en_us_dedes/he.h.m5:heHE.SalevomeninTinKardian.notmetered
ltx/en_us_public/he.h.m5:heHE.SalevomeninTinKardian.ode	@ltx/en_us_dedes/he.h.m5:heHE.SalevomeninTinKardian.ode
ltx/en_us_public/he.h.m5:heHE.SalevomeninTinKardian.text	@ltx/en_us_dedes/he.h.m5:heHE.SalevomeninTinKardian.text
ltx/en_us_public/he.h.m5:heHE.SeTinMakarianEnGynaixi.greekname	@ltx/en_us_dedes/he.h.m5:heHE.SeTinMakarianEnGynaixi.greekname
ltx/en_us_public/he.h.m5:heHE.SeTinMakarianEnGynaixi.incipit	@ltx/en_us_dedes/he.h.m5:heHE.SeTinMakarianEnGynaixi.incipit
ltx/en_us_public/he.h.m5:heHE.SeTinMakarianEnGynaixi.melody	@ltx/en_us_dedes/he.h.m5:heHE.SeTinMakarianEnGynaixi.melody
ltx/en_us_public/he.h.m5:heHE.SeTinMakarianEnGynaixi.mode	@ltx/en_us_dedes/he.h.m5:heHE.SeTinMakarianEnGynaixi.mode
ltx/en_us_public/he.h.m5:heHE.SeTinMakarianEnGynaixi.name	@ltx/en_us_dedes/he.h.m5:heHE.SeTinMakarianEnGynaixi.name
ltx/en_us_public/he.h.m5:heHE.SeTinMakarianEnGynaixi.notmetered	@ltx/en_us_dedes/he.h.m5:heHE.SeTinMakarianEnGynaixi.notmetered
ltx/en_us_public/he.h.m5:heHE.SeTinMakarianEnGynaixi.ode	@ltx/en_us_dedes/he.h.m5:heHE.SeTinMakarianEnGynaixi.ode
ltx/en_us_public/he.h.m5:heHE.SeTinMakarianEnGynaixi.text	@ltx/en_us_dedes/he.h.m5:heHE.SeTinMakarianEnGynaixi.text
ltx/en_us_public/he.h.m5:heHE.SeTinYperNoun.greekname	@ltx/en_us_dedes/he.h.m5:heHE.SeTinYperNoun.greekname
ltx/en_us_public/he.h.m5:heHE.SeTinYperNoun.incipit	@ltx/en_us_dedes/he.h.m5:heHE.SeTinYperNoun.incipit
ltx/en_us_public/he.h.m5:heHE.SeTinYperNoun.melody	@ltx/en_us_dedes/he.h.m5:heHE.SeTinYperNoun.melody
ltx/en_us_public/he.h.m5:heHE.SeTinYperNoun.mode	@ltx/en_us_dedes/he.h.m5:heHE.SeTinYperNoun.mode
ltx/en_us_public/he.h.m5:heHE.SeTinYperNoun.name	@ltx/en_us_dedes/he.h.m5:heHE.SeTinYperNoun.name
ltx/en_us_public/he.h.m5:heHE.SeTinYperNoun.notmetered	@ltx/en_us_dedes/he.h.m5:heHE.SeTinYperNoun.notmetered
ltx/en_us_public/he.h.m5:heHE.SeTinYperNoun.ode	@ltx/en_us_dedes/he.h.m5:heHE.SeTinYperNoun.ode
ltx/en_us_public/he.h.m5:heHE.SeTinYperNoun.text	@ltx/en_us_dedes/he.h.m5:heHE.SeTinYperNoun.text
ltx/en_us_public/he.h.m5:heHE.SoiToPantourgo.greekname	@ltx/en_us_dedes/he.h.m5:heHE.SoiToPantourgo.greekname
ltx/en_us_public/he.h.m5:heHE.SoiToPantourgo.incipit	@ltx/en_us_dedes/he.h.m5:heHE.SoiToPantourgo.incipit
ltx/en_us_public/he.h.m5:heHE.SoiToPantourgo.melody	@ltx/en_us_dedes/he.h.m5:heHE.SoiToPantourgo.melody
ltx/en_us_public/he.h.m5:heHE.SoiToPantourgo.mode	@ltx/en_us_dedes/he.h.m5:heHE.SoiToPantourgo.mode
ltx/en_us_public/he.h.m5:heHE.SoiToPantourgo.name	@ltx/en_us_dedes/he.h.m5:heHE.SoiToPantourgo.name
ltx/en_us_public/he.h.m5:heHE.SoiToPantourgo.notmetered	@ltx/en_us_dedes/he.h.m5:heHE.SoiToPantourgo.notmetered
ltx/en_us_public/he.h.m5:heHE.SoiToPantourgo.ode	@ltx/en_us_dedes/he.h.m5:heHE.SoiToPantourgo.ode
ltx/en_us_public/he.h.m5:heHE.SoiToPantourgo.text	@ltx/en_us_dedes/he.h.m5:heHE.SoiToPantourgo.text
ltx/en_us_public/he.h.m5:heHE.StereosonImasOTheos.greekname	@ltx/en_us_dedes/he.h.m5:heHE.StereosonImasOTheos.greekname
ltx/en_us_public/he.h.m5:heHE.StereosonImasOTheos.incipit	@ltx/en_us_dedes/he.h.m5:heHE.StereosonImasOTheos.incipit
ltx/en_us_public/he.h.m5:heHE.StereosonImasOTheos.melody	@ltx/en_us_dedes/he.h.m5:heHE.StereosonImasOTheos.melody
ltx/en_us_public/he.h.m5:heHE.StereosonImasOTheos.mode	@ltx/en_us_dedes/he.h.m5:heHE.StereosonImasOTheos.mode
ltx/en_us_public/he.h.m5:heHE.StereosonImasOTheos.name	@ltx/en_us_dedes/he.h.m5:heHE.StereosonImasOTheos.name
ltx/en_us_public/he.h.m5:heHE.StereosonImasOTheos.notmetered	@ltx/en_us_dedes/he.h.m5:heHE.StereosonImasOTheos.notmetered
ltx/en_us_public/he.h.m5:heHE.StereosonImasOTheos.ode	@ltx/en_us_dedes/he.h.m5:heHE.StereosonImasOTheos.ode
ltx/en_us_public/he.h.m5:heHE.StereosonImasOTheos.text	@ltx/en_us_dedes/he.h.m5:heHE.StereosonImasOTheos.text
ltx/en_us_public/he.h.m5:heHE.TaErgaTisOikonomias.greekname	@ltx/en_us_dedes/he.h.m5:heHE.TaErgaTisOikonomias.greekname
ltx/en_us_public/he.h.m5:heHE.TaErgaTisOikonomias.incipit	@ltx/en_us_dedes/he.h.m5:heHE.TaErgaTisOikonomias.incipit
ltx/en_us_public/he.h.m5:heHE.TaErgaTisOikonomias.melody	@ltx/en_us_dedes/he.h.m5:heHE.TaErgaTisOikonomias.melody
ltx/en_us_public/he.h.m5:heHE.TaErgaTisOikonomias.mode	@ltx/en_us_dedes/he.h.m5:heHE.TaErgaTisOikonomias.mode
ltx/en_us_public/he.h.m5:heHE.TaErgaTisOikonomias.name	@ltx/en_us_dedes/he.h.m5:heHE.TaErgaTisOikonomias.name
ltx/en_us_public/he.h.m5:heHE.TaErgaTisOikonomias.notmetered	@ltx/en_us_dedes/he.h.m5:heHE.TaErgaTisOikonomias.notmetered
ltx/en_us_public/he.h.m5:heHE.TaErgaTisOikonomias.ode	@ltx/en_us_dedes/he.h.m5:heHE.TaErgaTisOikonomias.ode
ltx/en_us_public/he.h.m5:heHE.TaErgaTisOikonomias.text	@ltx/en_us_dedes/he.h.m5:heHE.TaErgaTisOikonomias.text
ltx/en_us_public/he.h.m5:heHE.TinTalainanPsychinMou.greekname	@ltx/en_us_dedes/he.h.m5:heHE.TinTalainanPsychinMou.greekname
ltx/en_us_public/he.h.m5:heHE.TinTalainanPsychinMou.incipit	@ltx/en_us_dedes/he.h.m5:heHE.TinTalainanPsychinMou.incipit
ltx/en_us_public/he.h.m5:heHE.TinTalainanPsychinMou.melody	@ltx/en_us_dedes/he.h.m5:heHE.TinTalainanPsychinMou.melody
ltx/en_us_public/he.h.m5:heHE.TinTalainanPsychinMou.mode	@ltx/en_us_dedes/he.h.m5:heHE.TinTalainanPsychinMou.mode
ltx/en_us_public/he.h.m5:heHE.TinTalainanPsychinMou.name	@ltx/en_us_dedes/he.h.m5:heHE.TinTalainanPsychinMou.name
ltx/en_us_public/he.h.m5:heHE.TinTalainanPsychinMou.notmetered	@ltx/en_us_dedes/he.h.m5:heHE.TinTalainanPsychinMou.notmetered
ltx/en_us_public/he.h.m5:heHE.TinTalainanPsychinMou.ode	@ltx/en_us_dedes/he.h.m5:heHE.TinTalainanPsychinMou.ode
ltx/en_us_public/he.h.m5:heHE.TinTalainanPsychinMou.text	@ltx/en_us_dedes/he.h.m5:heHE.TinTalainanPsychinMou.text
ltx/en_us_public/he.h.m5:heHE.TinTheianEnnoisas.greekname	@ltx/en_us_dedes/he.h.m5:heHE.TinTheianEnnoisas.greekname
ltx/en_us_public/he.h.m5:heHE.TinTheianEnnoisas.incipit	@ltx/en_us_dedes/he.h.m5:heHE.TinTheianEnnoisas.incipit
ltx/en_us_public/he.h.m5:heHE.TinTheianEnnoisas.melody	@ltx/en_us_dedes/he.h.m5:heHE.TinTheianEnnoisas.melody
ltx/en_us_public/he.h.m5:heHE.TinTheianEnnoisas.mode	@ltx/en_us_dedes/he.h.m5:heHE.TinTheianEnnoisas.mode
ltx/en_us_public/he.h.m5:heHE.TinTheianEnnoisas.name	@ltx/en_us_dedes/he.h.m5:heHE.TinTheianEnnoisas.name
ltx/en_us_public/he.h.m5:heHE.TinTheianEnnoisas.notmetered	@ltx/en_us_dedes/he.h.m5:heHE.TinTheianEnnoisas.notmetered
ltx/en_us_public/he.h.m5:heHE.TinTheianEnnoisas.ode	@ltx/en_us_dedes/he.h.m5:heHE.TinTheianEnnoisas.ode
ltx/en_us_public/he.h.m5:heHE.TinTheianEnnoisas.text	@ltx/en_us_dedes/he.h.m5:heHE.TinTheianEnnoisas.text
ltx/en_us_public/he.h.m5:heHE.ToFosToAlithinon.greekname	@ltx/en_us_dedes/he.h.m5:heHE.ToFosToAlithinon.greekname
ltx/en_us_public/he.h.m5:heHE.ToFosToAlithinon.incipit	@ltx/en_us_dedes/he.h.m5:heHE.ToFosToAlithinon.incipit
ltx/en_us_public/he.h.m5:heHE.ToFosToAlithinon.melody	@ltx/en_us_dedes/he.h.m5:heHE.ToFosToAlithinon.melody
ltx/en_us_public/he.h.m5:heHE.ToFosToAlithinon.mode	@ltx/en_us_dedes/he.h.m5:heHE.ToFosToAlithinon.mode
ltx/en_us_public/he.h.m5:heHE.ToFosToAlithinon.name	@ltx/en_us_dedes/he.h.m5:heHE.ToFosToAlithinon.name
ltx/en_us_public/he.h.m5:heHE.ToFosToAlithinon.notmetered	@ltx/en_us_dedes/he.h.m5:heHE.ToFosToAlithinon.notmetered
ltx/en_us_public/he.h.m5:heHE.ToFosToAlithinon.ode	@ltx/en_us_dedes/he.h.m5:heHE.ToFosToAlithinon.ode
ltx/en_us_public/he.h.m5:heHE.ToFosToAlithinon.text	@ltx/en_us_dedes/he.h.m5:heHE.ToFosToAlithinon.text
ltx/en_us_public/he.h.m5:heHE.ToSotiriTheo.greekname	@ltx/en_us_dedes/he.h.m5:heHE.ToSotiriTheo.greekname
ltx/en_us_public/he.h.m5:heHE.ToSotiriTheo.incipit	@ltx/en_us_dedes/he.h.m5:heHE.ToSotiriTheo.incipit
ltx/en_us_public/he.h.m5:heHE.ToSotiriTheo.melody	@ltx/en_us_dedes/he.h.m5:heHE.ToSotiriTheo.melody
ltx/en_us_public/he.h.m5:heHE.ToSotiriTheo.mode	@ltx/en_us_dedes/he.h.m5:heHE.ToSotiriTheo.mode
ltx/en_us_public/he.h.m5:heHE.ToSotiriTheo.name	@ltx/en_us_dedes/he.h.m5:heHE.ToSotiriTheo.name
ltx/en_us_public/he.h.m5:heHE.ToSotiriTheo.notmetered	@ltx/en_us_dedes/he.h.m5:heHE.ToSotiriTheo.notmetered
ltx/en_us_public/he.h.m5:heHE.ToSotiriTheo.ode	@ltx/en_us_dedes/he.h.m5:heHE.ToSotiriTheo.ode
ltx/en_us_public/he.h.m5:heHE.ToSotiriTheo.text	@ltx/en_us_dedes/he.h.m5:heHE.ToSotiriTheo.text
ltx/en_us_public/he.h.m5:heHE.TonEkPatrosProAionon.greekname	@ltx/en_us_dedes/he.h.m5:heHE.TonEkPatrosProAionon.greekname
ltx/en_us_public/he.h.m5:heHE.TonEkPatrosProAionon.incipit	@ltx/en_us_dedes/he.h.m5:heHE.TonEkPatrosProAionon.incipit
ltx/en_us_public/he.h.m5:heHE.TonEkPatrosProAionon.melody	@ltx/en_us_dedes/he.h.m5:heHE.TonEkPatrosProAionon.melody
ltx/en_us_public/he.h.m5:heHE.TonEkPatrosProAionon.mode	@ltx/en_us_dedes/he.h.m5:heHE.TonEkPatrosProAionon.mode
ltx/en_us_public/he.h.m5:heHE.TonEkPatrosProAionon.name	@ltx/en_us_dedes/he.h.m5:heHE.TonEkPatrosProAionon.name
ltx/en_us_public/he.h.m5:heHE.TonEkPatrosProAionon.notmetered	@ltx/en_us_dedes/he.h.m5:heHE.TonEkPatrosProAionon.notmetered
ltx/en_us_public/he.h.m5:heHE.TonEkPatrosProAionon.ode	@ltx/en_us_dedes/he.h.m5:heHE.TonEkPatrosProAionon.ode
ltx/en_us_public/he.h.m5:heHE.TonEkPatrosProAionon.text	@ltx/en_us_dedes/he.h.m5:heHE.TonEkPatrosProAionon.text
ltx/en_us_public/he.h.m5:heHE.TonPoiitinTisKtiseos.greekname	@ltx/en_us_dedes/he.h.m5:heHE.TonPoiitinTisKtiseos.greekname
ltx/en_us_public/he.h.m5:heHE.TonPoiitinTisKtiseos.incipit	@ltx/en_us_dedes/he.h.m5:heHE.TonPoiitinTisKtiseos.incipit
ltx/en_us_public/he.h.m5:heHE.TonPoiitinTisKtiseos.melody	@ltx/en_us_dedes/he.h.m5:heHE.TonPoiitinTisKtiseos.melody
ltx/en_us_public/he.h.m5:heHE.TonPoiitinTisKtiseos.mode	@ltx/en_us_dedes/he.h.m5:heHE.TonPoiitinTisKtiseos.mode
ltx/en_us_public/he.h.m5:heHE.TonPoiitinTisKtiseos.name	@ltx/en_us_dedes/he.h.m5:heHE.TonPoiitinTisKtiseos.name
ltx/en_us_public/he.h.m5:heHE.TonPoiitinTisKtiseos.notmetered	@ltx/en_us_dedes/he.h.m5:heHE.TonPoiitinTisKtiseos.notmetered
ltx/en_us_public/he.h.m5:heHE.TonPoiitinTisKtiseos.ode	@ltx/en_us_dedes/he.h.m5:heHE.TonPoiitinTisKtiseos.ode
ltx/en_us_public/he.h.m5:heHE.TonPoiitinTisKtiseos.text	@ltx/en_us_dedes/he.h.m5:heHE.TonPoiitinTisKtiseos.text
ltx/en_us_public/he.h.m5:heHE.TouKitousTonProfitin.greekname	@ltx/en_us_dedes/he.h.m5:heHE.TouKitousTonProfitin.greekname
ltx/en_us_public/he.h.m5:heHE.TouKitousTonProfitin.incipit	@ltx/en_us_dedes/he.h.m5:heHE.TouKitousTonProfitin.incipit
ltx/en_us_public/he.h.m5:heHE.TouKitousTonProfitin.melody	@ltx/en_us_dedes/he.h.m5:heHE.TouKitousTonProfitin.melody
ltx/en_us_public/he.h.m5:heHE.TouKitousTonProfitin.mode	@ltx/en_us_dedes/he.h.m5:heHE.TouKitousTonProfitin.mode
ltx/en_us_public/he.h.m5:heHE.TouKitousTonProfitin.name	@ltx/en_us_dedes/he.h.m5:heHE.TouKitousTonProfitin.name
ltx/en_us_public/he.h.m5:heHE.TouKitousTonProfitin.notmetered	@ltx/en_us_dedes/he.h.m5:heHE.TouKitousTonProfitin.notmetered
ltx/en_us_public/he.h.m5:heHE.TouKitousTonProfitin.ode	@ltx/en_us_dedes/he.h.m5:heHE.TouKitousTonProfitin.ode
ltx/en_us_public/he.h.m5:heHE.TouKitousTonProfitin.text	@ltx/en_us_dedes/he.h.m5:heHE.TouKitousTonProfitin.text
ltx/en_us_public/he.h.m5:heHE.TousEkNyktos.greekname	@ltx/en_us_dedes/he.h.m5:heHE.TousEkNyktos.greekname
ltx/en_us_public/he.h.m5:heHE.TousEkNyktos.incipit	@ltx/en_us_dedes/he.h.m5:heHE.TousEkNyktos.incipit
ltx/en_us_public/he.h.m5:heHE.TousEkNyktos.melody	@ltx/en_us_dedes/he.h.m5:heHE.TousEkNyktos.melody
ltx/en_us_public/he.h.m5:heHE.TousEkNyktos.mode	@ltx/en_us_dedes/he.h.m5:heHE.TousEkNyktos.mode
ltx/en_us_public/he.h.m5:heHE.TousEkNyktos.name	@ltx/en_us_dedes/he.h.m5:heHE.TousEkNyktos.name
ltx/en_us_public/he.h.m5:heHE.TousEkNyktos.notmetered	@ltx/en_us_dedes/he.h.m5:heHE.TousEkNyktos.notmetered
ltx/en_us_public/he.h.m5:heHE.TousEkNyktos.ode	@ltx/en_us_dedes/he.h.m5:heHE.TousEkNyktos.ode
ltx/en_us_public/he.h.m5:heHE.TousEkNyktos.text	@ltx/en_us_dedes/he.h.m5:heHE.TousEkNyktos.text
