ltx/en_us_public/sy.m06.d25:syMA.commemoration01.couplet1.title	@ltx/en_us_dedes/sy.m06.d25:syMA.commemoration01.couplet1.title
ltx/en_us_public/sy.m06.d25:syMA.commemoration01.couplet1.verse1	@ltx/en_us_dedes/sy.m06.d25:syMA.commemoration01.couplet1.verse1
ltx/en_us_public/sy.m06.d25:syMA.commemoration01.couplet1.verse2	@ltx/en_us_dedes/sy.m06.d25:syMA.commemoration01.couplet1.verse2
ltx/en_us_public/sy.m06.d25:syMA.commemoration01.narration.p01	@ltx/en_us_dedes/sy.m06.d25:syMA.commemoration01.narration.p01
ltx/en_us_public/sy.m06.d25:syMA.commemoration01.narration.p02	@ltx/en_us_dedes/sy.m06.d25:syMA.commemoration01.narration.p02
ltx/en_us_public/sy.m06.d25:syMA.commemoration01.narration.p03	@ltx/en_us_dedes/sy.m06.d25:syMA.commemoration01.narration.p03
ltx/en_us_public/sy.m06.d25:syMA.commemoration01.narration.p04	@ltx/en_us_dedes/sy.m06.d25:syMA.commemoration01.narration.p04
ltx/en_us_public/sy.m06.d25:syMA.commemoration01.narration.p05	@ltx/en_us_dedes/sy.m06.d25:syMA.commemoration01.narration.p05
ltx/en_us_public/sy.m06.d25:syMA.commemoration01.narration.p06	@ltx/en_us_dedes/sy.m06.d25:syMA.commemoration01.narration.p06
ltx/en_us_public/sy.m06.d25:syMA.commemoration01.single1	@ltx/en_us_dedes/sy.m06.d25:syMA.commemoration01.single1
ltx/en_us_public/sy.m06.d25:syMA.commemoration01.text	@ltx/en_us_dedes/sy.m06.d25:syMA.commemoration01.text
ltx/en_us_public/sy.m06.d25:syMA.commemoration02.couplet1.title	@ltx/en_us_dedes/sy.m06.d25:syMA.commemoration02.couplet1.title
ltx/en_us_public/sy.m06.d25:syMA.commemoration02.couplet1.verse1	@ltx/en_us_dedes/sy.m06.d25:syMA.commemoration02.couplet1.verse1
ltx/en_us_public/sy.m06.d25:syMA.commemoration02.couplet1.verse2	@ltx/en_us_dedes/sy.m06.d25:syMA.commemoration02.couplet1.verse2
ltx/en_us_public/sy.m06.d25:syMA.commemoration02.couplet2.title	@ltx/en_us_dedes/sy.m06.d25:syMA.commemoration02.couplet2.title
ltx/en_us_public/sy.m06.d25:syMA.commemoration02.couplet2.verse1	@ltx/en_us_dedes/sy.m06.d25:syMA.commemoration02.couplet2.verse1
ltx/en_us_public/sy.m06.d25:syMA.commemoration02.couplet2.verse2	@ltx/en_us_dedes/sy.m06.d25:syMA.commemoration02.couplet2.verse2
ltx/en_us_public/sy.m06.d25:syMA.commemoration02.couplet3.title	@ltx/en_us_dedes/sy.m06.d25:syMA.commemoration02.couplet3.title
ltx/en_us_public/sy.m06.d25:syMA.commemoration02.couplet3.verse1	@ltx/en_us_dedes/sy.m06.d25:syMA.commemoration02.couplet3.verse1
ltx/en_us_public/sy.m06.d25:syMA.commemoration02.couplet3.verse2	@ltx/en_us_dedes/sy.m06.d25:syMA.commemoration02.couplet3.verse2
ltx/en_us_public/sy.m06.d25:syMA.commemoration02.couplet4.title	@ltx/en_us_dedes/sy.m06.d25:syMA.commemoration02.couplet4.title
ltx/en_us_public/sy.m06.d25:syMA.commemoration02.couplet4.verse1	@ltx/en_us_dedes/sy.m06.d25:syMA.commemoration02.couplet4.verse1
ltx/en_us_public/sy.m06.d25:syMA.commemoration02.couplet4.verse2	@ltx/en_us_dedes/sy.m06.d25:syMA.commemoration02.couplet4.verse2
ltx/en_us_public/sy.m06.d25:syMA.commemoration02.couplet5.title	@ltx/en_us_dedes/sy.m06.d25:syMA.commemoration02.couplet5.title
ltx/en_us_public/sy.m06.d25:syMA.commemoration02.couplet5.verse1	@ltx/en_us_dedes/sy.m06.d25:syMA.commemoration02.couplet5.verse1
ltx/en_us_public/sy.m06.d25:syMA.commemoration02.couplet5.verse2	@ltx/en_us_dedes/sy.m06.d25:syMA.commemoration02.couplet5.verse2
ltx/en_us_public/sy.m06.d25:syMA.commemoration02.narration.p01	@ltx/en_us_dedes/sy.m06.d25:syMA.commemoration02.narration.p01
ltx/en_us_public/sy.m06.d25:syMA.commemoration02.narration.p02	@ltx/en_us_dedes/sy.m06.d25:syMA.commemoration02.narration.p02
ltx/en_us_public/sy.m06.d25:syMA.commemoration02.narration.p03	@ltx/en_us_dedes/sy.m06.d25:syMA.commemoration02.narration.p03
ltx/en_us_public/sy.m06.d25:syMA.commemoration02.narration.p04	@ltx/en_us_dedes/sy.m06.d25:syMA.commemoration02.narration.p04
ltx/en_us_public/sy.m06.d25:syMA.commemoration02.text	@ltx/en_us_dedes/sy.m06.d25:syMA.commemoration02.text
ltx/en_us_public/sy.m06.d25:syMA.commemoration03.text	@ltx/en_us_dedes/sy.m06.d25:syMA.commemoration03.text
ltx/en_us_public/sy.m06.d25:syMA.lastline	@ltx/en_us_dedes/sy.m06.d25:syMA.lastline
