ltx/en_us_public/other.anoixantaria:other.refrain1.text	@ltx/en_us_dedes/other.anoixantaria:other.refrain1.text
ltx/en_us_public/other.anoixantaria:other.refrain2.text	@ltx/en_us_dedes/other.anoixantaria:other.refrain2.text
ltx/en_us_public/other.anoixantaria:other.title	@ltx/en_us_dedes/other.anoixantaria:other.title
ltx/en_us_public/other.anoixantaria:other.verse28.text	@ltx/en_us_dedes/other.anoixantaria:other.verse28.text
ltx/en_us_public/other.anoixantaria:other.verse29.text	@ltx/en_us_dedes/other.anoixantaria:other.verse29.text
ltx/en_us_public/other.anoixantaria:other.verse30.text	@ltx/en_us_dedes/other.anoixantaria:other.verse30.text
ltx/en_us_public/other.anoixantaria:other.verse31.text	@ltx/en_us_dedes/other.anoixantaria:other.verse31.text
ltx/en_us_public/other.anoixantaria:other.verse32.text	@ltx/en_us_dedes/other.anoixantaria:other.verse32.text
ltx/en_us_public/other.anoixantaria:other.verse33.text	@ltx/en_us_dedes/other.anoixantaria:other.verse33.text
ltx/en_us_public/other.anoixantaria:other.verse34.text	@ltx/en_us_dedes/other.anoixantaria:other.verse34.text
ltx/en_us_public/other.anoixantaria:other.verse35.text	@ltx/en_us_dedes/other.anoixantaria:other.verse35.text
