ltx/en_us_public/me.m11.d21:meDA.commemoration.first	@ltx/en_us_dedes/me.m11.d21:meDA.commemoration.first
ltx/en_us_public/me.m11.d21:meDA.commemoration.first_name	@ltx/en_us_dedes/me.m11.d21:meDA.commemoration.first_name
ltx/en_us_public/me.m11.d21:meDA.commemoration.first_short	@ltx/en_us_dedes/me.m11.d21:meDA.commemoration.first_short
ltx/en_us_public/me.m11.d21:meDA.commemoration.first_title	@ltx/en_us_dedes/me.m11.d21:meDA.commemoration.first_title
ltx/en_us_public/me.m11.d21:meDA.commemoration.full	@ltx/en_us_dedes/me.m11.d21:meDA.commemoration.full
ltx/en_us_public/me.m11.d21:meDA.commemoration.second_name	@ltx/en_us_dedes/me.m11.d21:meDA.commemoration.second_name
ltx/en_us_public/me.m11.d21:meDA.commemoration.second_title	@ltx/en_us_dedes/me.m11.d21:meDA.commemoration.second_title
ltx/en_us_public/me.m11.d21:meDA.date	@ltx/en_us_dedes/me.m11.d21:meDA.date
ltx/en_us_public/me.m11.d21:meDA.insert1	@ltx/en_us_dedes/me.m11.d21:meDA.insert1
ltx/en_us_public/me.m11.d21:meDA.insert2	@ltx/en_us_dedes/me.m11.d21:meDA.insert2
ltx/en_us_public/me.m11.d21:meDA.note	@ltx/en_us_dedes/me.m11.d21:meDA.note
ltx/en_us_public/me.m11.d21:meHO.commemorations	@ltx/en_us_dedes/me.m11.d21:meHO.commemorations
ltx/en_us_public/me.m11.d21:meHO.note1	@ltx/en_us_dedes/me.m11.d21:meHO.note1
ltx/en_us_public/me.m11.d21:meHO.note2	@ltx/en_us_dedes/me.m11.d21:meHO.note2
ltx/en_us_public/me.m11.d21:meHO.number	@ltx/en_us_dedes/me.m11.d21:meHO.number
ltx/en_us_public/me.m11.d21:meHO.rank	@ltx/en_us_dedes/me.m11.d21:meHO.rank
ltx/en_us_public/me.m11.d21:meLE.commemoration1	@ltx/en_us_dedes/me.m11.d21:meLE.commemoration1
ltx/en_us_public/me.m11.d21:meLE.commemoration2	@ltx/en_us_dedes/me.m11.d21:meLE.commemoration2
ltx/en_us_public/me.m11.d21:meLI.Kontakion1.greekmelody	@ltx/en_us_dedes/me.m11.d21:meLI.Kontakion1.greekmelody
ltx/en_us_public/me.m11.d21:meLI.Kontakion1.incipit	@ltx/en_us_dedes/me.m11.d21:meLI.Kontakion1.incipit
ltx/en_us_public/me.m11.d21:meLI.Kontakion1.melody	@ltx/en_us_dedes/me.m11.d21:meLI.Kontakion1.melody
ltx/en_us_public/me.m11.d21:meLI.Kontakion1.mode	@ltx/en_us_dedes/me.m11.d21:meLI.Kontakion1.mode
ltx/en_us_public/me.m11.d21:meLI.Kontakion1.text	@ltx/en_us_dedes/me.m11.d21:meLI.Kontakion1.text
ltx/en_us_public/me.m11.d21:meLI.MM.CommunionHymn.text	@ltx/en_us_dedes/me.m11.d21:meLI.MM.CommunionHymn.text
ltx/en_us_public/me.m11.d21:meLI.MM.EntranceHymn.text	@ltx/en_us_dedes/me.m11.d21:meLI.MM.EntranceHymn.text
ltx/en_us_public/me.m11.d21:meLI.Megalynarion.text	@ltx/en_us_dedes/me.m11.d21:meLI.Megalynarion.text
ltx/en_us_public/me.m11.d21:meLI.TheotokosHymn.incipit	@ltx/en_us_dedes/me.m11.d21:meLI.TheotokosHymn.incipit
ltx/en_us_public/me.m11.d21:meLI.TheotokosHymn.mode	@ltx/en_us_dedes/me.m11.d21:meLI.TheotokosHymn.mode
ltx/en_us_public/me.m11.d21:meLI.TheotokosHymn.text	@ltx/en_us_dedes/me.m11.d21:meLI.TheotokosHymn.text
ltx/en_us_public/me.m11.d21:meLI.TheotokosHymnVerse.incipit	@ltx/en_us_dedes/me.m11.d21:meLI.TheotokosHymnVerse.incipit
ltx/en_us_public/me.m11.d21:meLI.TheotokosHymnVerse.text	@ltx/en_us_dedes/me.m11.d21:meLI.TheotokosHymnVerse.text
ltx/en_us_public/me.m11.d21:meMA.C1.acrostic.notice1	@ltx/en_us_dedes/me.m11.d21:meMA.C1.acrostic.notice1
ltx/en_us_public/me.m11.d21:meMA.C1.acrostic.text	@ltx/en_us_dedes/me.m11.d21:meMA.C1.acrostic.text
ltx/en_us_public/me.m11.d21:meMA.C1.acrostic.title	@ltx/en_us_oca/me.m11.d21:meMA.C1.acrostic.title
ltx/en_us_public/me.m11.d21:meMA.C1.poet	@ltx/en_us_dedes/me.m11.d21:meMA.C1.poet
ltx/en_us_public/me.m11.d21:meMA.C1.title	@ltx/en_us_dedes/me.m11.d21:meMA.C1.title
ltx/en_us_public/me.m11.d21:meMA.C1.verse	@ltx/en_us_dedes/me.m11.d21:meMA.C1.verse
ltx/en_us_public/me.m11.d21:meMA.C2.poet	@ltx/en_us_dedes/me.m11.d21:meMA.C2.poet
ltx/en_us_public/me.m11.d21:meMA.C2.title	@ltx/en_us_dedes/me.m11.d21:meMA.C2.title
ltx/en_us_public/me.m11.d21:meMA.C2.verse	@ltx/en_us_dedes/me.m11.d21:meMA.C2.verse
ltx/en_us_public/me.m11.d21:meMA.Exaposteilarion1.greekmelody	@ltx/en_us_dedes/me.m11.d21:meMA.Exaposteilarion1.greekmelody
ltx/en_us_public/me.m11.d21:meMA.Exaposteilarion1.incipit	@ltx/en_us_dedes/me.m11.d21:meMA.Exaposteilarion1.incipit
ltx/en_us_public/me.m11.d21:meMA.Exaposteilarion1.melody	@ltx/en_us_dedes/me.m11.d21:meMA.Exaposteilarion1.melody
ltx/en_us_public/me.m11.d21:meMA.Exaposteilarion1.mode	@ltx/en_us_dedes/me.m11.d21:meMA.Exaposteilarion1.mode
ltx/en_us_public/me.m11.d21:meMA.Exaposteilarion1.text	@ltx/en_us_dedes/me.m11.d21:meMA.Exaposteilarion1.text
ltx/en_us_public/me.m11.d21:meMA.Kathisma11.greekmelody	@ltx/en_us_dedes/me.m11.d21:meMA.Kathisma11.greekmelody
ltx/en_us_public/me.m11.d21:meMA.Kathisma11.incipit	@ltx/en_us_dedes/me.m11.d21:meMA.Kathisma11.incipit
ltx/en_us_public/me.m11.d21:meMA.Kathisma11.melody	@ltx/en_us_dedes/me.m11.d21:meMA.Kathisma11.melody
ltx/en_us_public/me.m11.d21:meMA.Kathisma11.mode	@ltx/en_us_dedes/me.m11.d21:meMA.Kathisma11.mode
ltx/en_us_public/me.m11.d21:meMA.Kathisma11.text	@ltx/en_us_dedes/me.m11.d21:meMA.Kathisma11.text
ltx/en_us_public/me.m11.d21:meMA.Kathisma21.greekmelody	@ltx/en_us_dedes/me.m11.d21:meMA.Kathisma21.greekmelody
ltx/en_us_public/me.m11.d21:meMA.Kathisma21.incipit	@ltx/en_us_dedes/me.m11.d21:meMA.Kathisma21.incipit
ltx/en_us_public/me.m11.d21:meMA.Kathisma21.melody	@ltx/en_us_dedes/me.m11.d21:meMA.Kathisma21.melody
ltx/en_us_public/me.m11.d21:meMA.Kathisma21.mode	@ltx/en_us_dedes/me.m11.d21:meMA.Kathisma21.mode
ltx/en_us_public/me.m11.d21:meMA.Kathisma21.text	@ltx/en_us_dedes/me.m11.d21:meMA.Kathisma21.text
ltx/en_us_public/me.m11.d21:meMA.Kathisma31.greekmelody	@ltx/en_us_dedes/me.m11.d21:meMA.Kathisma31.greekmelody
ltx/en_us_public/me.m11.d21:meMA.Kathisma31.incipit	@ltx/en_us_dedes/me.m11.d21:meMA.Kathisma31.incipit
ltx/en_us_public/me.m11.d21:meMA.Kathisma31.melody	@ltx/en_us_dedes/me.m11.d21:meMA.Kathisma31.melody
ltx/en_us_public/me.m11.d21:meMA.Kathisma31.mode	@ltx/en_us_dedes/me.m11.d21:meMA.Kathisma31.mode
ltx/en_us_public/me.m11.d21:meMA.Kathisma31.text	@ltx/en_us_dedes/me.m11.d21:meMA.Kathisma31.text
ltx/en_us_public/me.m11.d21:meMA.Kontakion1.greekmelody	@ltx/en_us_dedes/me.m11.d21:meMA.Kontakion1.greekmelody
ltx/en_us_public/me.m11.d21:meMA.Kontakion1.incipit	@ltx/en_us_dedes/me.m11.d21:meMA.Kontakion1.incipit
ltx/en_us_public/me.m11.d21:meMA.Kontakion1.melody	@ltx/en_us_dedes/me.m11.d21:meMA.Kontakion1.melody
ltx/en_us_public/me.m11.d21:meMA.Kontakion1.mode	@ltx/en_us_dedes/me.m11.d21:meMA.Kontakion1.mode
ltx/en_us_public/me.m11.d21:meMA.Kontakion1.text	@ltx/en_us_dedes/me.m11.d21:meMA.Kontakion1.text
ltx/en_us_public/me.m11.d21:meMA.Lauds1.greekmelody	@ltx/en_us_dedes/me.m11.d21:meMA.Lauds1.greekmelody
ltx/en_us_public/me.m11.d21:meMA.Lauds1.incipit	@ltx/en_us_dedes/me.m11.d21:meMA.Lauds1.incipit
ltx/en_us_public/me.m11.d21:meMA.Lauds1.melody	@ltx/en_us_dedes/me.m11.d21:meMA.Lauds1.melody
ltx/en_us_public/me.m11.d21:meMA.Lauds1.mode	@ltx/en_us_dedes/me.m11.d21:meMA.Lauds1.mode
ltx/en_us_public/me.m11.d21:meMA.Lauds1.text	@ltx/en_us_dedes/me.m11.d21:meMA.Lauds1.text
ltx/en_us_public/me.m11.d21:meMA.Lauds2.incipit	@ltx/en_us_dedes/me.m11.d21:meMA.Lauds2.incipit
ltx/en_us_public/me.m11.d21:meMA.Lauds2.melody	@ltx/en_us_dedes/me.m11.d21:meMA.Lauds2.melody
ltx/en_us_public/me.m11.d21:meMA.Lauds2.mode	@ltx/en_us_dedes/me.m11.d21:meMA.Lauds2.mode
ltx/en_us_public/me.m11.d21:meMA.Lauds2.text	@ltx/en_us_dedes/me.m11.d21:meMA.Lauds2.text
ltx/en_us_public/me.m11.d21:meMA.Lauds3.incipit	@ltx/en_us_dedes/me.m11.d21:meMA.Lauds3.incipit
ltx/en_us_public/me.m11.d21:meMA.Lauds3.melody	@ltx/en_us_dedes/me.m11.d21:meMA.Lauds3.melody
ltx/en_us_public/me.m11.d21:meMA.Lauds3.mode	@ltx/en_us_dedes/me.m11.d21:meMA.Lauds3.mode
ltx/en_us_public/me.m11.d21:meMA.Lauds3.text	@ltx/en_us_dedes/me.m11.d21:meMA.Lauds3.text
ltx/en_us_public/me.m11.d21:meMA.Lauds4.greekmelody	@ltx/en_us_dedes/me.m11.d21:meMA.Lauds4.greekmelody
ltx/en_us_public/me.m11.d21:meMA.Lauds4.incipit	@ltx/en_us_dedes/me.m11.d21:meMA.Lauds4.incipit
ltx/en_us_public/me.m11.d21:meMA.Lauds4.melody	@ltx/en_us_dedes/me.m11.d21:meMA.Lauds4.melody
ltx/en_us_public/me.m11.d21:meMA.Lauds4.mode	@ltx/en_us_dedes/me.m11.d21:meMA.Lauds4.mode
ltx/en_us_public/me.m11.d21:meMA.Lauds4.text	@ltx/en_us_dedes/me.m11.d21:meMA.Lauds4.text
ltx/en_us_public/me.m11.d21:meMA.LaudsGlory.incipit	@ltx/en_us_dedes/me.m11.d21:meMA.LaudsGlory.incipit
ltx/en_us_public/me.m11.d21:meMA.LaudsGlory.melody	@ltx/en_us_dedes/me.m11.d21:meMA.LaudsGlory.melody
ltx/en_us_public/me.m11.d21:meMA.LaudsGlory.mode	@ltx/en_us_dedes/me.m11.d21:meMA.LaudsGlory.mode
ltx/en_us_public/me.m11.d21:meMA.LaudsGlory.poet	@ltx/en_us_dedes/me.m11.d21:meMA.LaudsGlory.poet
ltx/en_us_public/me.m11.d21:meMA.LaudsGlory.text	@ltx/en_us_dedes/me.m11.d21:meMA.LaudsGlory.text
ltx/en_us_public/me.m11.d21:meMA.MM.Lauds1234as5678.text	@ltx/en_us_dedes/me.m11.d21:meMA.MM.Lauds1234as5678.text
ltx/en_us_public/me.m11.d21:meMA.MM.Ode9C2123TasMMMM.text	@ltx/en_us_dedes/me.m11.d21:meMA.MM.Ode9C2123TasMMMM.text
ltx/en_us_public/me.m11.d21:meMA.Ode1C11.greekmelody	@ltx/en_us_dedes/me.m11.d21:meMA.Ode1C11.greekmelody
ltx/en_us_public/me.m11.d21:meMA.Ode1C11.incipit	@ltx/en_us_dedes/me.m11.d21:meMA.Ode1C11.incipit
ltx/en_us_public/me.m11.d21:meMA.Ode1C11.melody	@ltx/en_us_dedes/me.m11.d21:meMA.Ode1C11.melody
ltx/en_us_public/me.m11.d21:meMA.Ode1C11.mode	@ltx/en_us_dedes/me.m11.d21:meMA.Ode1C11.mode
ltx/en_us_public/me.m11.d21:meMA.Ode1C11.ode	@ltx/en_us_dedes/me.m11.d21:meMA.Ode1C11.ode
ltx/en_us_public/me.m11.d21:meMA.Ode1C11.text	@ltx/en_us_dedes/me.m11.d21:meMA.Ode1C11.text
ltx/en_us_public/me.m11.d21:meMA.Ode1C12.incipit	@ltx/en_us_dedes/me.m11.d21:meMA.Ode1C12.incipit
ltx/en_us_public/me.m11.d21:meMA.Ode1C12.melody	@ltx/en_us_dedes/me.m11.d21:meMA.Ode1C12.melody
ltx/en_us_public/me.m11.d21:meMA.Ode1C12.mode	@ltx/en_us_dedes/me.m11.d21:meMA.Ode1C12.mode
ltx/en_us_public/me.m11.d21:meMA.Ode1C12.ode	@ltx/en_us_dedes/me.m11.d21:meMA.Ode1C12.ode
ltx/en_us_public/me.m11.d21:meMA.Ode1C12.text	@ltx/en_us_dedes/me.m11.d21:meMA.Ode1C12.text
ltx/en_us_public/me.m11.d21:meMA.Ode1C13.incipit	@ltx/en_us_dedes/me.m11.d21:meMA.Ode1C13.incipit
ltx/en_us_public/me.m11.d21:meMA.Ode1C13.melody	@ltx/en_us_dedes/me.m11.d21:meMA.Ode1C13.melody
ltx/en_us_public/me.m11.d21:meMA.Ode1C13.mode	@ltx/en_us_dedes/me.m11.d21:meMA.Ode1C13.mode
ltx/en_us_public/me.m11.d21:meMA.Ode1C13.ode	@ltx/en_us_dedes/me.m11.d21:meMA.Ode1C13.ode
ltx/en_us_public/me.m11.d21:meMA.Ode1C13.text	@ltx/en_us_dedes/me.m11.d21:meMA.Ode1C13.text
ltx/en_us_public/me.m11.d21:meMA.Ode1C14.incipit	@ltx/en_us_dedes/me.m11.d21:meMA.Ode1C14.incipit
ltx/en_us_public/me.m11.d21:meMA.Ode1C14.melody	@ltx/en_us_dedes/me.m11.d21:meMA.Ode1C14.melody
ltx/en_us_public/me.m11.d21:meMA.Ode1C14.mode	@ltx/en_us_dedes/me.m11.d21:meMA.Ode1C14.mode
ltx/en_us_public/me.m11.d21:meMA.Ode1C14.ode	@ltx/en_us_dedes/me.m11.d21:meMA.Ode1C14.ode
ltx/en_us_public/me.m11.d21:meMA.Ode1C14.text	@ltx/en_us_dedes/me.m11.d21:meMA.Ode1C14.text
ltx/en_us_public/me.m11.d21:meMA.Ode1C1H.greekmelody	@ltx/en_us_dedes/me.m11.d21:meMA.Ode1C1H.greekmelody
ltx/en_us_public/me.m11.d21:meMA.Ode1C1H.incipit	@ltx/en_us_dedes/me.m11.d21:meMA.Ode1C1H.incipit
ltx/en_us_public/me.m11.d21:meMA.Ode1C1H.melody	@ltx/en_us_dedes/me.m11.d21:meMA.Ode1C1H.melody
ltx/en_us_public/me.m11.d21:meMA.Ode1C1H.mode	@ltx/en_us_dedes/me.m11.d21:meMA.Ode1C1H.mode
ltx/en_us_public/me.m11.d21:meMA.Ode1C1H.ode	@ltx/en_us_dedes/me.m11.d21:meMA.Ode1C1H.ode
ltx/en_us_public/me.m11.d21:meMA.Ode1C1H.text	@ltx/en_us_dedes/me.m11.d21:meMA.Ode1C1H.text
ltx/en_us_public/me.m11.d21:meMA.Ode1C21.greekmelody	@ltx/en_us_dedes/me.m11.d21:meMA.Ode1C21.greekmelody
ltx/en_us_public/me.m11.d21:meMA.Ode1C21.incipit	@ltx/en_us_dedes/me.m11.d21:meMA.Ode1C21.incipit
ltx/en_us_public/me.m11.d21:meMA.Ode1C21.melody	@ltx/en_us_dedes/me.m11.d21:meMA.Ode1C21.melody
ltx/en_us_public/me.m11.d21:meMA.Ode1C21.mode	@ltx/en_us_dedes/me.m11.d21:meMA.Ode1C21.mode
ltx/en_us_public/me.m11.d21:meMA.Ode1C21.ode	@ltx/en_us_dedes/me.m11.d21:meMA.Ode1C21.ode
ltx/en_us_public/me.m11.d21:meMA.Ode1C21.text	@ltx/en_us_dedes/me.m11.d21:meMA.Ode1C21.text
ltx/en_us_public/me.m11.d21:meMA.Ode1C22.incipit	@ltx/en_us_dedes/me.m11.d21:meMA.Ode1C22.incipit
ltx/en_us_public/me.m11.d21:meMA.Ode1C22.melody	@ltx/en_us_dedes/me.m11.d21:meMA.Ode1C22.melody
ltx/en_us_public/me.m11.d21:meMA.Ode1C22.mode	@ltx/en_us_dedes/me.m11.d21:meMA.Ode1C22.mode
ltx/en_us_public/me.m11.d21:meMA.Ode1C22.ode	@ltx/en_us_dedes/me.m11.d21:meMA.Ode1C22.ode
ltx/en_us_public/me.m11.d21:meMA.Ode1C22.text	@ltx/en_us_dedes/me.m11.d21:meMA.Ode1C22.text
ltx/en_us_public/me.m11.d21:meMA.Ode1C23.incipit	@ltx/en_us_dedes/me.m11.d21:meMA.Ode1C23.incipit
ltx/en_us_public/me.m11.d21:meMA.Ode1C23.melody	@ltx/en_us_dedes/me.m11.d21:meMA.Ode1C23.melody
ltx/en_us_public/me.m11.d21:meMA.Ode1C23.mode	@ltx/en_us_dedes/me.m11.d21:meMA.Ode1C23.mode
ltx/en_us_public/me.m11.d21:meMA.Ode1C23.ode	@ltx/en_us_dedes/me.m11.d21:meMA.Ode1C23.ode
ltx/en_us_public/me.m11.d21:meMA.Ode1C23.text	@ltx/en_us_dedes/me.m11.d21:meMA.Ode1C23.text
ltx/en_us_public/me.m11.d21:meMA.Ode1C24.incipit	@ltx/en_us_dedes/me.m11.d21:meMA.Ode1C24.incipit
ltx/en_us_public/me.m11.d21:meMA.Ode1C24.melody	@ltx/en_us_dedes/me.m11.d21:meMA.Ode1C24.melody
ltx/en_us_public/me.m11.d21:meMA.Ode1C24.mode	@ltx/en_us_dedes/me.m11.d21:meMA.Ode1C24.mode
ltx/en_us_public/me.m11.d21:meMA.Ode1C24.ode	@ltx/en_us_dedes/me.m11.d21:meMA.Ode1C24.ode
ltx/en_us_public/me.m11.d21:meMA.Ode1C24.text	@ltx/en_us_dedes/me.m11.d21:meMA.Ode1C24.text
ltx/en_us_public/me.m11.d21:meMA.Ode1C25.incipit	@ltx/en_us_dedes/me.m11.d21:meMA.Ode1C25.incipit
ltx/en_us_public/me.m11.d21:meMA.Ode1C25.melody	@ltx/en_us_dedes/me.m11.d21:meMA.Ode1C25.melody
ltx/en_us_public/me.m11.d21:meMA.Ode1C25.mode	@ltx/en_us_dedes/me.m11.d21:meMA.Ode1C25.mode
ltx/en_us_public/me.m11.d21:meMA.Ode1C25.ode	@ltx/en_us_dedes/me.m11.d21:meMA.Ode1C25.ode
ltx/en_us_public/me.m11.d21:meMA.Ode1C25.text	@ltx/en_us_dedes/me.m11.d21:meMA.Ode1C25.text
ltx/en_us_public/me.m11.d21:meMA.Ode1C26.incipit	@ltx/en_us_dedes/me.m11.d21:meMA.Ode1C26.incipit
ltx/en_us_public/me.m11.d21:meMA.Ode1C26.melody	@ltx/en_us_dedes/me.m11.d21:meMA.Ode1C26.melody
ltx/en_us_public/me.m11.d21:meMA.Ode1C26.mode	@ltx/en_us_dedes/me.m11.d21:meMA.Ode1C26.mode
ltx/en_us_public/me.m11.d21:meMA.Ode1C26.ode	@ltx/en_us_dedes/me.m11.d21:meMA.Ode1C26.ode
ltx/en_us_public/me.m11.d21:meMA.Ode1C26.text	@ltx/en_us_dedes/me.m11.d21:meMA.Ode1C26.text
ltx/en_us_public/me.m11.d21:meMA.Ode1C2T.incipit	@ltx/en_us_dedes/me.m11.d21:meMA.Ode1C2T.incipit
ltx/en_us_public/me.m11.d21:meMA.Ode1C2T.melody	@ltx/en_us_dedes/me.m11.d21:meMA.Ode1C2T.melody
ltx/en_us_public/me.m11.d21:meMA.Ode1C2T.mode	@ltx/en_us_dedes/me.m11.d21:meMA.Ode1C2T.mode
ltx/en_us_public/me.m11.d21:meMA.Ode1C2T.ode	@ltx/en_us_dedes/me.m11.d21:meMA.Ode1C2T.ode
ltx/en_us_public/me.m11.d21:meMA.Ode1C2T.text	@ltx/en_us_dedes/me.m11.d21:meMA.Ode1C2T.text
ltx/en_us_public/me.m11.d21:meMA.Ode1C2Tr.incipit	@ltx/en_us_dedes/me.m11.d21:meMA.Ode1C2Tr.incipit
ltx/en_us_public/me.m11.d21:meMA.Ode1C2Tr.melody	@ltx/en_us_dedes/me.m11.d21:meMA.Ode1C2Tr.melody
ltx/en_us_public/me.m11.d21:meMA.Ode1C2Tr.mode	@ltx/en_us_dedes/me.m11.d21:meMA.Ode1C2Tr.mode
ltx/en_us_public/me.m11.d21:meMA.Ode1C2Tr.ode	@ltx/en_us_dedes/me.m11.d21:meMA.Ode1C2Tr.ode
ltx/en_us_public/me.m11.d21:meMA.Ode1C2Tr.text	@ltx/en_us_dedes/me.m11.d21:meMA.Ode1C2Tr.text
ltx/en_us_public/me.m11.d21:meMA.Ode3C11.greekmelody	@ltx/en_us_dedes/me.m11.d21:meMA.Ode3C11.greekmelody
ltx/en_us_public/me.m11.d21:meMA.Ode3C11.incipit	@ltx/en_us_barrett/me.m11.d21:meMA.Ode3C11.incipit
ltx/en_us_public/me.m11.d21:meMA.Ode3C11.melody	@ltx/en_us_barrett/me.m11.d21:meMA.Ode3C11.melody
ltx/en_us_public/me.m11.d21:meMA.Ode3C11.mode	@ltx/en_us_dedes/me.m11.d21:meMA.Ode3C11.mode
ltx/en_us_public/me.m11.d21:meMA.Ode3C11.ode	@ltx/en_us_dedes/me.m11.d21:meMA.Ode3C11.ode
ltx/en_us_public/me.m11.d21:meMA.Ode3C11.text	@ltx/en_us_barrett/me.m11.d21:meMA.Ode3C11.text
ltx/en_us_public/me.m11.d21:meMA.Ode3C12.incipit	@ltx/en_us_barrett/me.m11.d21:meMA.Ode3C12.incipit
ltx/en_us_public/me.m11.d21:meMA.Ode3C12.melody	@ltx/en_us_barrett/me.m11.d21:meMA.Ode3C12.melody
ltx/en_us_public/me.m11.d21:meMA.Ode3C12.mode	@ltx/en_us_dedes/me.m11.d21:meMA.Ode3C12.mode
ltx/en_us_public/me.m11.d21:meMA.Ode3C12.ode	@ltx/en_us_dedes/me.m11.d21:meMA.Ode3C12.ode
ltx/en_us_public/me.m11.d21:meMA.Ode3C12.text	@ltx/en_us_barrett/me.m11.d21:meMA.Ode3C12.text
ltx/en_us_public/me.m11.d21:meMA.Ode3C13.incipit	@ltx/en_us_barrett/me.m11.d21:meMA.Ode3C13.incipit
ltx/en_us_public/me.m11.d21:meMA.Ode3C13.melody	@ltx/en_us_barrett/me.m11.d21:meMA.Ode3C13.melody
ltx/en_us_public/me.m11.d21:meMA.Ode3C13.mode	@ltx/en_us_dedes/me.m11.d21:meMA.Ode3C13.mode
ltx/en_us_public/me.m11.d21:meMA.Ode3C13.ode	@ltx/en_us_dedes/me.m11.d21:meMA.Ode3C13.ode
ltx/en_us_public/me.m11.d21:meMA.Ode3C13.text	@ltx/en_us_barrett/me.m11.d21:meMA.Ode3C13.text
ltx/en_us_public/me.m11.d21:meMA.Ode3C14.incipit	@ltx/en_us_oca/me.m11.d21:meMA.Ode3C14.incipit
ltx/en_us_public/me.m11.d21:meMA.Ode3C14.melody	@ltx/en_us_oca/me.m11.d21:meMA.Ode3C14.melody
ltx/en_us_public/me.m11.d21:meMA.Ode3C14.mode	@ltx/en_us_dedes/me.m11.d21:meMA.Ode3C14.mode
ltx/en_us_public/me.m11.d21:meMA.Ode3C14.ode	@ltx/en_us_dedes/me.m11.d21:meMA.Ode3C14.ode
ltx/en_us_public/me.m11.d21:meMA.Ode3C14.text	@ltx/en_us_oca/me.m11.d21:meMA.Ode3C14.text
ltx/en_us_public/me.m11.d21:meMA.Ode3C1H.greekmelody	@ltx/en_us_dedes/me.m11.d21:meMA.Ode3C1H.greekmelody
ltx/en_us_public/me.m11.d21:meMA.Ode3C1H.incipit	@ltx/en_us_dedes/me.m11.d21:meMA.Ode3C1H.incipit
ltx/en_us_public/me.m11.d21:meMA.Ode3C1H.melody	@ltx/en_us_dedes/me.m11.d21:meMA.Ode3C1H.melody
ltx/en_us_public/me.m11.d21:meMA.Ode3C1H.mode	@ltx/en_us_dedes/me.m11.d21:meMA.Ode3C1H.mode
ltx/en_us_public/me.m11.d21:meMA.Ode3C1H.ode	@ltx/en_us_dedes/me.m11.d21:meMA.Ode3C1H.ode
ltx/en_us_public/me.m11.d21:meMA.Ode3C1H.text	@ltx/en_us_dedes/me.m11.d21:meMA.Ode3C1H.text
ltx/en_us_public/me.m11.d21:meMA.Ode3C21.greekmelody	@ltx/en_us_dedes/me.m11.d21:meMA.Ode3C21.greekmelody
ltx/en_us_public/me.m11.d21:meMA.Ode3C21.incipit	@ltx/en_us_barrett/me.m11.d21:meMA.Ode3C21.incipit
ltx/en_us_public/me.m11.d21:meMA.Ode3C21.melody	@ltx/en_us_barrett/me.m11.d21:meMA.Ode3C21.melody
ltx/en_us_public/me.m11.d21:meMA.Ode3C21.mode	@ltx/en_us_dedes/me.m11.d21:meMA.Ode3C21.mode
ltx/en_us_public/me.m11.d21:meMA.Ode3C21.ode	@ltx/en_us_dedes/me.m11.d21:meMA.Ode3C21.ode
ltx/en_us_public/me.m11.d21:meMA.Ode3C21.text	@ltx/en_us_barrett/me.m11.d21:meMA.Ode3C21.text
ltx/en_us_public/me.m11.d21:meMA.Ode3C22.incipit	@ltx/en_us_barrett/me.m11.d21:meMA.Ode3C22.incipit
ltx/en_us_public/me.m11.d21:meMA.Ode3C22.melody	@ltx/en_us_barrett/me.m11.d21:meMA.Ode3C22.melody
ltx/en_us_public/me.m11.d21:meMA.Ode3C22.mode	@ltx/en_us_dedes/me.m11.d21:meMA.Ode3C22.mode
ltx/en_us_public/me.m11.d21:meMA.Ode3C22.ode	@ltx/en_us_dedes/me.m11.d21:meMA.Ode3C22.ode
ltx/en_us_public/me.m11.d21:meMA.Ode3C22.text	@ltx/en_us_barrett/me.m11.d21:meMA.Ode3C22.text
ltx/en_us_public/me.m11.d21:meMA.Ode3C23.incipit	@ltx/en_us_oca/me.m11.d21:meMA.Ode3C23.incipit
ltx/en_us_public/me.m11.d21:meMA.Ode3C23.melody	@ltx/en_us_oca/me.m11.d21:meMA.Ode3C23.melody
ltx/en_us_public/me.m11.d21:meMA.Ode3C23.mode	@ltx/en_us_dedes/me.m11.d21:meMA.Ode3C23.mode
ltx/en_us_public/me.m11.d21:meMA.Ode3C23.ode	@ltx/en_us_dedes/me.m11.d21:meMA.Ode3C23.ode
ltx/en_us_public/me.m11.d21:meMA.Ode3C23.text	@ltx/en_us_oca/me.m11.d21:meMA.Ode3C23.text
ltx/en_us_public/me.m11.d21:meMA.Ode3C24.incipit	@ltx/en_us_oca/me.m11.d21:meMA.Ode3C24.incipit
ltx/en_us_public/me.m11.d21:meMA.Ode3C24.melody	@ltx/en_us_oca/me.m11.d21:meMA.Ode3C24.melody
ltx/en_us_public/me.m11.d21:meMA.Ode3C24.mode	@ltx/en_us_dedes/me.m11.d21:meMA.Ode3C24.mode
ltx/en_us_public/me.m11.d21:meMA.Ode3C24.ode	@ltx/en_us_dedes/me.m11.d21:meMA.Ode3C24.ode
ltx/en_us_public/me.m11.d21:meMA.Ode3C24.text	@ltx/en_us_oca/me.m11.d21:meMA.Ode3C24.text
ltx/en_us_public/me.m11.d21:meMA.Ode3C25.incipit	@ltx/en_us_oca/me.m11.d21:meMA.Ode3C25.incipit
ltx/en_us_public/me.m11.d21:meMA.Ode3C25.melody	@ltx/en_us_oca/me.m11.d21:meMA.Ode3C25.melody
ltx/en_us_public/me.m11.d21:meMA.Ode3C25.mode	@ltx/en_us_dedes/me.m11.d21:meMA.Ode3C25.mode
ltx/en_us_public/me.m11.d21:meMA.Ode3C25.ode	@ltx/en_us_dedes/me.m11.d21:meMA.Ode3C25.ode
ltx/en_us_public/me.m11.d21:meMA.Ode3C25.text	@ltx/en_us_oca/me.m11.d21:meMA.Ode3C25.text
ltx/en_us_public/me.m11.d21:meMA.Ode3C26.incipit	@ltx/en_us_oca/me.m11.d21:meMA.Ode3C26.incipit
ltx/en_us_public/me.m11.d21:meMA.Ode3C26.melody	@ltx/en_us_oca/me.m11.d21:meMA.Ode3C26.melody
ltx/en_us_public/me.m11.d21:meMA.Ode3C26.mode	@ltx/en_us_dedes/me.m11.d21:meMA.Ode3C26.mode
ltx/en_us_public/me.m11.d21:meMA.Ode3C26.ode	@ltx/en_us_dedes/me.m11.d21:meMA.Ode3C26.ode
ltx/en_us_public/me.m11.d21:meMA.Ode3C26.text	@ltx/en_us_oca/me.m11.d21:meMA.Ode3C26.text
ltx/en_us_public/me.m11.d21:meMA.Ode3C27.incipit	@ltx/en_us_oca/me.m11.d21:meMA.Ode3C27.incipit
ltx/en_us_public/me.m11.d21:meMA.Ode3C27.melody	@ltx/en_us_oca/me.m11.d21:meMA.Ode3C27.melody
ltx/en_us_public/me.m11.d21:meMA.Ode3C27.mode	@ltx/en_us_dedes/me.m11.d21:meMA.Ode3C27.mode
ltx/en_us_public/me.m11.d21:meMA.Ode3C27.ode	@ltx/en_us_dedes/me.m11.d21:meMA.Ode3C27.ode
ltx/en_us_public/me.m11.d21:meMA.Ode3C27.text	@ltx/en_us_oca/me.m11.d21:meMA.Ode3C27.text
ltx/en_us_public/me.m11.d21:meMA.Ode3C2T.incipit	@ltx/en_us_barrett/me.m11.d21:meMA.Ode3C2T.incipit
ltx/en_us_public/me.m11.d21:meMA.Ode3C2T.melody	@ltx/en_us_barrett/me.m11.d21:meMA.Ode3C2T.melody
ltx/en_us_public/me.m11.d21:meMA.Ode3C2T.mode	@ltx/en_us_dedes/me.m11.d21:meMA.Ode3C2T.mode
ltx/en_us_public/me.m11.d21:meMA.Ode3C2T.ode	@ltx/en_us_dedes/me.m11.d21:meMA.Ode3C2T.ode
ltx/en_us_public/me.m11.d21:meMA.Ode3C2T.text	@ltx/en_us_barrett/me.m11.d21:meMA.Ode3C2T.text
ltx/en_us_public/me.m11.d21:meMA.Ode3C2Tr.incipit	@ltx/en_us_barrett/me.m11.d21:meMA.Ode3C2Tr.incipit
ltx/en_us_public/me.m11.d21:meMA.Ode3C2Tr.melody	@ltx/en_us_barrett/me.m11.d21:meMA.Ode3C2Tr.melody
ltx/en_us_public/me.m11.d21:meMA.Ode3C2Tr.mode	@ltx/en_us_dedes/me.m11.d21:meMA.Ode3C2Tr.mode
ltx/en_us_public/me.m11.d21:meMA.Ode3C2Tr.ode	@ltx/en_us_dedes/me.m11.d21:meMA.Ode3C2Tr.ode
ltx/en_us_public/me.m11.d21:meMA.Ode3C2Tr.text	@ltx/en_us_barrett/me.m11.d21:meMA.Ode3C2Tr.text
ltx/en_us_public/me.m11.d21:meMA.Ode3Kathisma1.greekmelody	@ltx/en_us_dedes/me.m11.d21:meMA.Ode3Kathisma1.greekmelody
ltx/en_us_public/me.m11.d21:meMA.Ode3Kathisma1.incipit	@ltx/en_us_dedes/me.m11.d21:meMA.Ode3Kathisma1.incipit
ltx/en_us_public/me.m11.d21:meMA.Ode3Kathisma1.melody	@ltx/en_us_dedes/me.m11.d21:meMA.Ode3Kathisma1.melody
ltx/en_us_public/me.m11.d21:meMA.Ode3Kathisma1.mode	@ltx/en_us_dedes/me.m11.d21:meMA.Ode3Kathisma1.mode
ltx/en_us_public/me.m11.d21:meMA.Ode3Kathisma1.text	@ltx/en_us_dedes/me.m11.d21:meMA.Ode3Kathisma1.text
ltx/en_us_public/me.m11.d21:meMA.Ode4C11.greekmelody	@ltx/en_us_dedes/me.m11.d21:meMA.Ode4C11.greekmelody
ltx/en_us_public/me.m11.d21:meMA.Ode4C11.incipit	@ltx/en_us_barrett/me.m11.d21:meMA.Ode4C11.incipit
ltx/en_us_public/me.m11.d21:meMA.Ode4C11.melody	@ltx/en_us_barrett/me.m11.d21:meMA.Ode4C11.melody
ltx/en_us_public/me.m11.d21:meMA.Ode4C11.mode	@ltx/en_us_dedes/me.m11.d21:meMA.Ode4C11.mode
ltx/en_us_public/me.m11.d21:meMA.Ode4C11.ode	@ltx/en_us_dedes/me.m11.d21:meMA.Ode4C11.ode
ltx/en_us_public/me.m11.d21:meMA.Ode4C11.text	@ltx/en_us_barrett/me.m11.d21:meMA.Ode4C11.text
ltx/en_us_public/me.m11.d21:meMA.Ode4C12.incipit	@ltx/en_us_barrett/me.m11.d21:meMA.Ode4C12.incipit
ltx/en_us_public/me.m11.d21:meMA.Ode4C12.melody	@ltx/en_us_barrett/me.m11.d21:meMA.Ode4C12.melody
ltx/en_us_public/me.m11.d21:meMA.Ode4C12.mode	@ltx/en_us_dedes/me.m11.d21:meMA.Ode4C12.mode
ltx/en_us_public/me.m11.d21:meMA.Ode4C12.ode	@ltx/en_us_dedes/me.m11.d21:meMA.Ode4C12.ode
ltx/en_us_public/me.m11.d21:meMA.Ode4C12.text	@ltx/en_us_barrett/me.m11.d21:meMA.Ode4C12.text
ltx/en_us_public/me.m11.d21:meMA.Ode4C13.incipit	@ltx/en_us_barrett/me.m11.d21:meMA.Ode4C13.incipit
ltx/en_us_public/me.m11.d21:meMA.Ode4C13.melody	@ltx/en_us_barrett/me.m11.d21:meMA.Ode4C13.melody
ltx/en_us_public/me.m11.d21:meMA.Ode4C13.mode	@ltx/en_us_dedes/me.m11.d21:meMA.Ode4C13.mode
ltx/en_us_public/me.m11.d21:meMA.Ode4C13.ode	@ltx/en_us_dedes/me.m11.d21:meMA.Ode4C13.ode
ltx/en_us_public/me.m11.d21:meMA.Ode4C13.text	@ltx/en_us_barrett/me.m11.d21:meMA.Ode4C13.text
ltx/en_us_public/me.m11.d21:meMA.Ode4C14.incipit	@ltx/en_us_oca/me.m11.d21:meMA.Ode4C14.incipit
ltx/en_us_public/me.m11.d21:meMA.Ode4C14.melody	@ltx/en_us_oca/me.m11.d21:meMA.Ode4C14.melody
ltx/en_us_public/me.m11.d21:meMA.Ode4C14.mode	@ltx/en_us_dedes/me.m11.d21:meMA.Ode4C14.mode
ltx/en_us_public/me.m11.d21:meMA.Ode4C14.ode	@ltx/en_us_dedes/me.m11.d21:meMA.Ode4C14.ode
ltx/en_us_public/me.m11.d21:meMA.Ode4C14.text	@ltx/en_us_oca/me.m11.d21:meMA.Ode4C14.text
ltx/en_us_public/me.m11.d21:meMA.Ode4C1H.greekmelody	@ltx/en_us_dedes/me.m11.d21:meMA.Ode4C1H.greekmelody
ltx/en_us_public/me.m11.d21:meMA.Ode4C1H.incipit	@ltx/en_us_dedes/me.m11.d21:meMA.Ode4C1H.incipit
ltx/en_us_public/me.m11.d21:meMA.Ode4C1H.melody	@ltx/en_us_dedes/me.m11.d21:meMA.Ode4C1H.melody
ltx/en_us_public/me.m11.d21:meMA.Ode4C1H.mode	@ltx/en_us_dedes/me.m11.d21:meMA.Ode4C1H.mode
ltx/en_us_public/me.m11.d21:meMA.Ode4C1H.ode	@ltx/en_us_dedes/me.m11.d21:meMA.Ode4C1H.ode
ltx/en_us_public/me.m11.d21:meMA.Ode4C1H.text	@ltx/en_us_dedes/me.m11.d21:meMA.Ode4C1H.text
ltx/en_us_public/me.m11.d21:meMA.Ode4C21.greekmelody	@ltx/en_us_dedes/me.m11.d21:meMA.Ode4C21.greekmelody
ltx/en_us_public/me.m11.d21:meMA.Ode4C21.incipit	@ltx/en_us_barrett/me.m11.d21:meMA.Ode4C21.incipit
ltx/en_us_public/me.m11.d21:meMA.Ode4C21.melody	@ltx/en_us_barrett/me.m11.d21:meMA.Ode4C21.melody
ltx/en_us_public/me.m11.d21:meMA.Ode4C21.mode	@ltx/en_us_dedes/me.m11.d21:meMA.Ode4C21.mode
ltx/en_us_public/me.m11.d21:meMA.Ode4C21.ode	@ltx/en_us_dedes/me.m11.d21:meMA.Ode4C21.ode
ltx/en_us_public/me.m11.d21:meMA.Ode4C21.text	@ltx/en_us_barrett/me.m11.d21:meMA.Ode4C21.text
ltx/en_us_public/me.m11.d21:meMA.Ode4C22.incipit	@ltx/en_us_barrett/me.m11.d21:meMA.Ode4C22.incipit
ltx/en_us_public/me.m11.d21:meMA.Ode4C22.melody	@ltx/en_us_barrett/me.m11.d21:meMA.Ode4C22.melody
ltx/en_us_public/me.m11.d21:meMA.Ode4C22.mode	@ltx/en_us_dedes/me.m11.d21:meMA.Ode4C22.mode
ltx/en_us_public/me.m11.d21:meMA.Ode4C22.ode	@ltx/en_us_dedes/me.m11.d21:meMA.Ode4C22.ode
ltx/en_us_public/me.m11.d21:meMA.Ode4C22.text	@ltx/en_us_barrett/me.m11.d21:meMA.Ode4C22.text
ltx/en_us_public/me.m11.d21:meMA.Ode4C23.incipit	@ltx/en_us_oca/me.m11.d21:meMA.Ode4C23.incipit
ltx/en_us_public/me.m11.d21:meMA.Ode4C23.melody	@ltx/en_us_oca/me.m11.d21:meMA.Ode4C23.melody
ltx/en_us_public/me.m11.d21:meMA.Ode4C23.mode	@ltx/en_us_dedes/me.m11.d21:meMA.Ode4C23.mode
ltx/en_us_public/me.m11.d21:meMA.Ode4C23.ode	@ltx/en_us_dedes/me.m11.d21:meMA.Ode4C23.ode
ltx/en_us_public/me.m11.d21:meMA.Ode4C23.text	@ltx/en_us_oca/me.m11.d21:meMA.Ode4C23.text
ltx/en_us_public/me.m11.d21:meMA.Ode4C24.incipit	@ltx/en_us_oca/me.m11.d21:meMA.Ode4C24.incipit
ltx/en_us_public/me.m11.d21:meMA.Ode4C24.melody	@ltx/en_us_oca/me.m11.d21:meMA.Ode4C24.melody
ltx/en_us_public/me.m11.d21:meMA.Ode4C24.mode	@ltx/en_us_dedes/me.m11.d21:meMA.Ode4C24.mode
ltx/en_us_public/me.m11.d21:meMA.Ode4C24.ode	@ltx/en_us_dedes/me.m11.d21:meMA.Ode4C24.ode
ltx/en_us_public/me.m11.d21:meMA.Ode4C24.text	@ltx/en_us_oca/me.m11.d21:meMA.Ode4C24.text
ltx/en_us_public/me.m11.d21:meMA.Ode4C25.incipit	@ltx/en_us_oca/me.m11.d21:meMA.Ode4C25.incipit
ltx/en_us_public/me.m11.d21:meMA.Ode4C25.melody	@ltx/en_us_oca/me.m11.d21:meMA.Ode4C25.melody
ltx/en_us_public/me.m11.d21:meMA.Ode4C25.mode	@ltx/en_us_dedes/me.m11.d21:meMA.Ode4C25.mode
ltx/en_us_public/me.m11.d21:meMA.Ode4C25.ode	@ltx/en_us_dedes/me.m11.d21:meMA.Ode4C25.ode
ltx/en_us_public/me.m11.d21:meMA.Ode4C25.text	@ltx/en_us_oca/me.m11.d21:meMA.Ode4C25.text
ltx/en_us_public/me.m11.d21:meMA.Ode4C26.incipit	@ltx/en_us_oca/me.m11.d21:meMA.Ode4C26.incipit
ltx/en_us_public/me.m11.d21:meMA.Ode4C26.melody	@ltx/en_us_oca/me.m11.d21:meMA.Ode4C26.melody
ltx/en_us_public/me.m11.d21:meMA.Ode4C26.mode	@ltx/en_us_dedes/me.m11.d21:meMA.Ode4C26.mode
ltx/en_us_public/me.m11.d21:meMA.Ode4C26.ode	@ltx/en_us_dedes/me.m11.d21:meMA.Ode4C26.ode
ltx/en_us_public/me.m11.d21:meMA.Ode4C26.text	@ltx/en_us_oca/me.m11.d21:meMA.Ode4C26.text
ltx/en_us_public/me.m11.d21:meMA.Ode4C27.incipit	@ltx/en_us_oca/me.m11.d21:meMA.Ode4C27.incipit
ltx/en_us_public/me.m11.d21:meMA.Ode4C27.melody	@ltx/en_us_oca/me.m11.d21:meMA.Ode4C27.melody
ltx/en_us_public/me.m11.d21:meMA.Ode4C27.mode	@ltx/en_us_dedes/me.m11.d21:meMA.Ode4C27.mode
ltx/en_us_public/me.m11.d21:meMA.Ode4C27.ode	@ltx/en_us_dedes/me.m11.d21:meMA.Ode4C27.ode
ltx/en_us_public/me.m11.d21:meMA.Ode4C27.text	@ltx/en_us_oca/me.m11.d21:meMA.Ode4C27.text
ltx/en_us_public/me.m11.d21:meMA.Ode4C2T.incipit	@ltx/en_us_barrett/me.m11.d21:meMA.Ode4C2T.incipit
ltx/en_us_public/me.m11.d21:meMA.Ode4C2T.melody	@ltx/en_us_barrett/me.m11.d21:meMA.Ode4C2T.melody
ltx/en_us_public/me.m11.d21:meMA.Ode4C2T.mode	@ltx/en_us_dedes/me.m11.d21:meMA.Ode4C2T.mode
ltx/en_us_public/me.m11.d21:meMA.Ode4C2T.ode	@ltx/en_us_dedes/me.m11.d21:meMA.Ode4C2T.ode
ltx/en_us_public/me.m11.d21:meMA.Ode4C2T.text	@ltx/en_us_barrett/me.m11.d21:meMA.Ode4C2T.text
ltx/en_us_public/me.m11.d21:meMA.Ode4C2Tr.incipit	@ltx/en_us_barrett/me.m11.d21:meMA.Ode4C2Tr.incipit
ltx/en_us_public/me.m11.d21:meMA.Ode4C2Tr.melody	@ltx/en_us_barrett/me.m11.d21:meMA.Ode4C2Tr.melody
ltx/en_us_public/me.m11.d21:meMA.Ode4C2Tr.mode	@ltx/en_us_dedes/me.m11.d21:meMA.Ode4C2Tr.mode
ltx/en_us_public/me.m11.d21:meMA.Ode4C2Tr.ode	@ltx/en_us_dedes/me.m11.d21:meMA.Ode4C2Tr.ode
ltx/en_us_public/me.m11.d21:meMA.Ode4C2Tr.text	@ltx/en_us_barrett/me.m11.d21:meMA.Ode4C2Tr.text
ltx/en_us_public/me.m11.d21:meMA.Ode5C11.greekmelody	@ltx/en_us_dedes/me.m11.d21:meMA.Ode5C11.greekmelody
ltx/en_us_public/me.m11.d21:meMA.Ode5C11.incipit	@ltx/en_us_barrett/me.m11.d21:meMA.Ode5C11.incipit
ltx/en_us_public/me.m11.d21:meMA.Ode5C11.melody	@ltx/en_us_barrett/me.m11.d21:meMA.Ode5C11.melody
ltx/en_us_public/me.m11.d21:meMA.Ode5C11.mode	@ltx/en_us_dedes/me.m11.d21:meMA.Ode5C11.mode
ltx/en_us_public/me.m11.d21:meMA.Ode5C11.ode	@ltx/en_us_dedes/me.m11.d21:meMA.Ode5C11.ode
ltx/en_us_public/me.m11.d21:meMA.Ode5C11.text	@ltx/en_us_barrett/me.m11.d21:meMA.Ode5C11.text
ltx/en_us_public/me.m11.d21:meMA.Ode5C12.incipit	@ltx/en_us_barrett/me.m11.d21:meMA.Ode5C12.incipit
ltx/en_us_public/me.m11.d21:meMA.Ode5C12.melody	@ltx/en_us_barrett/me.m11.d21:meMA.Ode5C12.melody
ltx/en_us_public/me.m11.d21:meMA.Ode5C12.mode	@ltx/en_us_dedes/me.m11.d21:meMA.Ode5C12.mode
ltx/en_us_public/me.m11.d21:meMA.Ode5C12.ode	@ltx/en_us_dedes/me.m11.d21:meMA.Ode5C12.ode
ltx/en_us_public/me.m11.d21:meMA.Ode5C12.text	@ltx/en_us_barrett/me.m11.d21:meMA.Ode5C12.text
ltx/en_us_public/me.m11.d21:meMA.Ode5C13.incipit	@ltx/en_us_barrett/me.m11.d21:meMA.Ode5C13.incipit
ltx/en_us_public/me.m11.d21:meMA.Ode5C13.melody	@ltx/en_us_barrett/me.m11.d21:meMA.Ode5C13.melody
ltx/en_us_public/me.m11.d21:meMA.Ode5C13.mode	@ltx/en_us_dedes/me.m11.d21:meMA.Ode5C13.mode
ltx/en_us_public/me.m11.d21:meMA.Ode5C13.ode	@ltx/en_us_dedes/me.m11.d21:meMA.Ode5C13.ode
ltx/en_us_public/me.m11.d21:meMA.Ode5C13.text	@ltx/en_us_barrett/me.m11.d21:meMA.Ode5C13.text
ltx/en_us_public/me.m11.d21:meMA.Ode5C14.incipit	@ltx/en_us_oca/me.m11.d21:meMA.Ode5C14.incipit
ltx/en_us_public/me.m11.d21:meMA.Ode5C14.melody	@ltx/en_us_oca/me.m11.d21:meMA.Ode5C14.melody
ltx/en_us_public/me.m11.d21:meMA.Ode5C14.mode	@ltx/en_us_dedes/me.m11.d21:meMA.Ode5C14.mode
ltx/en_us_public/me.m11.d21:meMA.Ode5C14.ode	@ltx/en_us_dedes/me.m11.d21:meMA.Ode5C14.ode
ltx/en_us_public/me.m11.d21:meMA.Ode5C14.text	@ltx/en_us_oca/me.m11.d21:meMA.Ode5C14.text
ltx/en_us_public/me.m11.d21:meMA.Ode5C1H.greekmelody	@ltx/en_us_dedes/me.m11.d21:meMA.Ode5C1H.greekmelody
ltx/en_us_public/me.m11.d21:meMA.Ode5C1H.incipit	@ltx/en_us_dedes/me.m11.d21:meMA.Ode5C1H.incipit
ltx/en_us_public/me.m11.d21:meMA.Ode5C1H.melody	@ltx/en_us_dedes/me.m11.d21:meMA.Ode5C1H.melody
ltx/en_us_public/me.m11.d21:meMA.Ode5C1H.mode	@ltx/en_us_dedes/me.m11.d21:meMA.Ode5C1H.mode
ltx/en_us_public/me.m11.d21:meMA.Ode5C1H.ode	@ltx/en_us_dedes/me.m11.d21:meMA.Ode5C1H.ode
ltx/en_us_public/me.m11.d21:meMA.Ode5C1H.text	@ltx/en_us_dedes/me.m11.d21:meMA.Ode5C1H.text
ltx/en_us_public/me.m11.d21:meMA.Ode5C21.greekmelody	@ltx/en_us_dedes/me.m11.d21:meMA.Ode5C21.greekmelody
ltx/en_us_public/me.m11.d21:meMA.Ode5C21.incipit	@ltx/en_us_barrett/me.m11.d21:meMA.Ode5C21.incipit
ltx/en_us_public/me.m11.d21:meMA.Ode5C21.melody	@ltx/en_us_barrett/me.m11.d21:meMA.Ode5C21.melody
ltx/en_us_public/me.m11.d21:meMA.Ode5C21.mode	@ltx/en_us_dedes/me.m11.d21:meMA.Ode5C21.mode
ltx/en_us_public/me.m11.d21:meMA.Ode5C21.ode	@ltx/en_us_dedes/me.m11.d21:meMA.Ode5C21.ode
ltx/en_us_public/me.m11.d21:meMA.Ode5C21.text	@ltx/en_us_barrett/me.m11.d21:meMA.Ode5C21.text
ltx/en_us_public/me.m11.d21:meMA.Ode5C22.incipit	@ltx/en_us_oca/me.m11.d21:meMA.Ode5C22.incipit
ltx/en_us_public/me.m11.d21:meMA.Ode5C22.melody	@ltx/en_us_oca/me.m11.d21:meMA.Ode5C22.melody
ltx/en_us_public/me.m11.d21:meMA.Ode5C22.mode	@ltx/en_us_dedes/me.m11.d21:meMA.Ode5C22.mode
ltx/en_us_public/me.m11.d21:meMA.Ode5C22.ode	@ltx/en_us_dedes/me.m11.d21:meMA.Ode5C22.ode
ltx/en_us_public/me.m11.d21:meMA.Ode5C22.text	@ltx/en_us_oca/me.m11.d21:meMA.Ode5C22.text
ltx/en_us_public/me.m11.d21:meMA.Ode5C23.incipit	@ltx/en_us_oca/me.m11.d21:meMA.Ode5C23.incipit
ltx/en_us_public/me.m11.d21:meMA.Ode5C23.melody	@ltx/en_us_oca/me.m11.d21:meMA.Ode5C23.melody
ltx/en_us_public/me.m11.d21:meMA.Ode5C23.mode	@ltx/en_us_dedes/me.m11.d21:meMA.Ode5C23.mode
ltx/en_us_public/me.m11.d21:meMA.Ode5C23.ode	@ltx/en_us_dedes/me.m11.d21:meMA.Ode5C23.ode
ltx/en_us_public/me.m11.d21:meMA.Ode5C23.text	@ltx/en_us_oca/me.m11.d21:meMA.Ode5C23.text
ltx/en_us_public/me.m11.d21:meMA.Ode5C24.incipit	@ltx/en_us_oca/me.m11.d21:meMA.Ode5C24.incipit
ltx/en_us_public/me.m11.d21:meMA.Ode5C24.melody	@ltx/en_us_oca/me.m11.d21:meMA.Ode5C24.melody
ltx/en_us_public/me.m11.d21:meMA.Ode5C24.mode	@ltx/en_us_dedes/me.m11.d21:meMA.Ode5C24.mode
ltx/en_us_public/me.m11.d21:meMA.Ode5C24.ode	@ltx/en_us_dedes/me.m11.d21:meMA.Ode5C24.ode
ltx/en_us_public/me.m11.d21:meMA.Ode5C24.text	@ltx/en_us_oca/me.m11.d21:meMA.Ode5C24.text
ltx/en_us_public/me.m11.d21:meMA.Ode5C25.incipit	@ltx/en_us_oca/me.m11.d21:meMA.Ode5C25.incipit
ltx/en_us_public/me.m11.d21:meMA.Ode5C25.melody	@ltx/en_us_oca/me.m11.d21:meMA.Ode5C25.melody
ltx/en_us_public/me.m11.d21:meMA.Ode5C25.mode	@ltx/en_us_dedes/me.m11.d21:meMA.Ode5C25.mode
ltx/en_us_public/me.m11.d21:meMA.Ode5C25.ode	@ltx/en_us_dedes/me.m11.d21:meMA.Ode5C25.ode
ltx/en_us_public/me.m11.d21:meMA.Ode5C25.text	@ltx/en_us_oca/me.m11.d21:meMA.Ode5C25.text
ltx/en_us_public/me.m11.d21:meMA.Ode5C26.incipit	@ltx/en_us_oca/me.m11.d21:meMA.Ode5C26.incipit
ltx/en_us_public/me.m11.d21:meMA.Ode5C26.melody	@ltx/en_us_oca/me.m11.d21:meMA.Ode5C26.melody
ltx/en_us_public/me.m11.d21:meMA.Ode5C26.mode	@ltx/en_us_dedes/me.m11.d21:meMA.Ode5C26.mode
ltx/en_us_public/me.m11.d21:meMA.Ode5C26.ode	@ltx/en_us_dedes/me.m11.d21:meMA.Ode5C26.ode
ltx/en_us_public/me.m11.d21:meMA.Ode5C26.text	@ltx/en_us_oca/me.m11.d21:meMA.Ode5C26.text
ltx/en_us_public/me.m11.d21:meMA.Ode5C2T.incipit	@ltx/en_us_barrett/me.m11.d21:meMA.Ode5C2T.incipit
ltx/en_us_public/me.m11.d21:meMA.Ode5C2T.melody	@ltx/en_us_barrett/me.m11.d21:meMA.Ode5C2T.melody
ltx/en_us_public/me.m11.d21:meMA.Ode5C2T.mode	@ltx/en_us_dedes/me.m11.d21:meMA.Ode5C2T.mode
ltx/en_us_public/me.m11.d21:meMA.Ode5C2T.ode	@ltx/en_us_dedes/me.m11.d21:meMA.Ode5C2T.ode
ltx/en_us_public/me.m11.d21:meMA.Ode5C2T.text	@ltx/en_us_barrett/me.m11.d21:meMA.Ode5C2T.text
ltx/en_us_public/me.m11.d21:meMA.Ode5C2Tr.incipit	@ltx/en_us_barrett/me.m11.d21:meMA.Ode5C2Tr.incipit
ltx/en_us_public/me.m11.d21:meMA.Ode5C2Tr.melody	@ltx/en_us_barrett/me.m11.d21:meMA.Ode5C2Tr.melody
ltx/en_us_public/me.m11.d21:meMA.Ode5C2Tr.mode	@ltx/en_us_dedes/me.m11.d21:meMA.Ode5C2Tr.mode
ltx/en_us_public/me.m11.d21:meMA.Ode5C2Tr.ode	@ltx/en_us_dedes/me.m11.d21:meMA.Ode5C2Tr.ode
ltx/en_us_public/me.m11.d21:meMA.Ode5C2Tr.text	@ltx/en_us_barrett/me.m11.d21:meMA.Ode5C2Tr.text
ltx/en_us_public/me.m11.d21:meMA.Ode6C11.greekmelody	@ltx/en_us_dedes/me.m11.d21:meMA.Ode6C11.greekmelody
ltx/en_us_public/me.m11.d21:meMA.Ode6C11.incipit	@ltx/en_us_barrett/me.m11.d21:meMA.Ode6C11.incipit
ltx/en_us_public/me.m11.d21:meMA.Ode6C11.melody	@ltx/en_us_barrett/me.m11.d21:meMA.Ode6C11.melody
ltx/en_us_public/me.m11.d21:meMA.Ode6C11.mode	@ltx/en_us_dedes/me.m11.d21:meMA.Ode6C11.mode
ltx/en_us_public/me.m11.d21:meMA.Ode6C11.ode	@ltx/en_us_dedes/me.m11.d21:meMA.Ode6C11.ode
ltx/en_us_public/me.m11.d21:meMA.Ode6C11.text	@ltx/en_us_barrett/me.m11.d21:meMA.Ode6C11.text
ltx/en_us_public/me.m11.d21:meMA.Ode6C12.incipit	@ltx/en_us_barrett/me.m11.d21:meMA.Ode6C12.incipit
ltx/en_us_public/me.m11.d21:meMA.Ode6C12.melody	@ltx/en_us_barrett/me.m11.d21:meMA.Ode6C12.melody
ltx/en_us_public/me.m11.d21:meMA.Ode6C12.mode	@ltx/en_us_dedes/me.m11.d21:meMA.Ode6C12.mode
ltx/en_us_public/me.m11.d21:meMA.Ode6C12.ode	@ltx/en_us_dedes/me.m11.d21:meMA.Ode6C12.ode
ltx/en_us_public/me.m11.d21:meMA.Ode6C12.text	@ltx/en_us_barrett/me.m11.d21:meMA.Ode6C12.text
ltx/en_us_public/me.m11.d21:meMA.Ode6C13.incipit	@ltx/en_us_barrett/me.m11.d21:meMA.Ode6C13.incipit
ltx/en_us_public/me.m11.d21:meMA.Ode6C13.melody	@ltx/en_us_barrett/me.m11.d21:meMA.Ode6C13.melody
ltx/en_us_public/me.m11.d21:meMA.Ode6C13.mode	@ltx/en_us_dedes/me.m11.d21:meMA.Ode6C13.mode
ltx/en_us_public/me.m11.d21:meMA.Ode6C13.ode	@ltx/en_us_dedes/me.m11.d21:meMA.Ode6C13.ode
ltx/en_us_public/me.m11.d21:meMA.Ode6C13.text	@ltx/en_us_barrett/me.m11.d21:meMA.Ode6C13.text
ltx/en_us_public/me.m11.d21:meMA.Ode6C14.incipit	@ltx/en_us_oca/me.m11.d21:meMA.Ode6C14.incipit
ltx/en_us_public/me.m11.d21:meMA.Ode6C14.melody	@ltx/en_us_oca/me.m11.d21:meMA.Ode6C14.melody
ltx/en_us_public/me.m11.d21:meMA.Ode6C14.mode	@ltx/en_us_dedes/me.m11.d21:meMA.Ode6C14.mode
ltx/en_us_public/me.m11.d21:meMA.Ode6C14.ode	@ltx/en_us_dedes/me.m11.d21:meMA.Ode6C14.ode
ltx/en_us_public/me.m11.d21:meMA.Ode6C14.text	@ltx/en_us_oca/me.m11.d21:meMA.Ode6C14.text
ltx/en_us_public/me.m11.d21:meMA.Ode6C1H.greekmelody	@ltx/en_us_dedes/me.m11.d21:meMA.Ode6C1H.greekmelody
ltx/en_us_public/me.m11.d21:meMA.Ode6C1H.incipit	@ltx/en_us_dedes/me.m11.d21:meMA.Ode6C1H.incipit
ltx/en_us_public/me.m11.d21:meMA.Ode6C1H.melody	@ltx/en_us_dedes/me.m11.d21:meMA.Ode6C1H.melody
ltx/en_us_public/me.m11.d21:meMA.Ode6C1H.mode	@ltx/en_us_dedes/me.m11.d21:meMA.Ode6C1H.mode
ltx/en_us_public/me.m11.d21:meMA.Ode6C1H.ode	@ltx/en_us_dedes/me.m11.d21:meMA.Ode6C1H.ode
ltx/en_us_public/me.m11.d21:meMA.Ode6C1H.text	@ltx/en_us_dedes/me.m11.d21:meMA.Ode6C1H.text
ltx/en_us_public/me.m11.d21:meMA.Ode6C21.greekmelody	@ltx/en_us_dedes/me.m11.d21:meMA.Ode6C21.greekmelody
ltx/en_us_public/me.m11.d21:meMA.Ode6C21.incipit	@ltx/en_us_barrett/me.m11.d21:meMA.Ode6C21.incipit
ltx/en_us_public/me.m11.d21:meMA.Ode6C21.melody	@ltx/en_us_barrett/me.m11.d21:meMA.Ode6C21.melody
ltx/en_us_public/me.m11.d21:meMA.Ode6C21.mode	@ltx/en_us_dedes/me.m11.d21:meMA.Ode6C21.mode
ltx/en_us_public/me.m11.d21:meMA.Ode6C21.ode	@ltx/en_us_dedes/me.m11.d21:meMA.Ode6C21.ode
ltx/en_us_public/me.m11.d21:meMA.Ode6C21.text	@ltx/en_us_barrett/me.m11.d21:meMA.Ode6C21.text
ltx/en_us_public/me.m11.d21:meMA.Ode6C22.incipit	@ltx/en_us_barrett/me.m11.d21:meMA.Ode6C22.incipit
ltx/en_us_public/me.m11.d21:meMA.Ode6C22.melody	@ltx/en_us_barrett/me.m11.d21:meMA.Ode6C22.melody
ltx/en_us_public/me.m11.d21:meMA.Ode6C22.mode	@ltx/en_us_dedes/me.m11.d21:meMA.Ode6C22.mode
ltx/en_us_public/me.m11.d21:meMA.Ode6C22.ode	@ltx/en_us_dedes/me.m11.d21:meMA.Ode6C22.ode
ltx/en_us_public/me.m11.d21:meMA.Ode6C22.text	@ltx/en_us_barrett/me.m11.d21:meMA.Ode6C22.text
ltx/en_us_public/me.m11.d21:meMA.Ode6C23.incipit	@ltx/en_us_oca/me.m11.d21:meMA.Ode6C23.incipit
ltx/en_us_public/me.m11.d21:meMA.Ode6C23.melody	@ltx/en_us_oca/me.m11.d21:meMA.Ode6C23.melody
ltx/en_us_public/me.m11.d21:meMA.Ode6C23.mode	@ltx/en_us_dedes/me.m11.d21:meMA.Ode6C23.mode
ltx/en_us_public/me.m11.d21:meMA.Ode6C23.ode	@ltx/en_us_dedes/me.m11.d21:meMA.Ode6C23.ode
ltx/en_us_public/me.m11.d21:meMA.Ode6C23.text	@ltx/en_us_oca/me.m11.d21:meMA.Ode6C23.text
ltx/en_us_public/me.m11.d21:meMA.Ode6C24.incipit	@ltx/en_us_oca/me.m11.d21:meMA.Ode6C24.incipit
ltx/en_us_public/me.m11.d21:meMA.Ode6C24.melody	@ltx/en_us_oca/me.m11.d21:meMA.Ode6C24.melody
ltx/en_us_public/me.m11.d21:meMA.Ode6C24.mode	@ltx/en_us_dedes/me.m11.d21:meMA.Ode6C24.mode
ltx/en_us_public/me.m11.d21:meMA.Ode6C24.ode	@ltx/en_us_dedes/me.m11.d21:meMA.Ode6C24.ode
ltx/en_us_public/me.m11.d21:meMA.Ode6C24.text	@ltx/en_us_oca/me.m11.d21:meMA.Ode6C24.text
ltx/en_us_public/me.m11.d21:meMA.Ode6C25.incipit	@ltx/en_us_oca/me.m11.d21:meMA.Ode6C25.incipit
ltx/en_us_public/me.m11.d21:meMA.Ode6C25.melody	@ltx/en_us_oca/me.m11.d21:meMA.Ode6C25.melody
ltx/en_us_public/me.m11.d21:meMA.Ode6C25.mode	@ltx/en_us_dedes/me.m11.d21:meMA.Ode6C25.mode
ltx/en_us_public/me.m11.d21:meMA.Ode6C25.ode	@ltx/en_us_dedes/me.m11.d21:meMA.Ode6C25.ode
ltx/en_us_public/me.m11.d21:meMA.Ode6C25.text	@ltx/en_us_oca/me.m11.d21:meMA.Ode6C25.text
ltx/en_us_public/me.m11.d21:meMA.Ode6C26.incipit	@ltx/en_us_oca/me.m11.d21:meMA.Ode6C26.incipit
ltx/en_us_public/me.m11.d21:meMA.Ode6C26.melody	@ltx/en_us_oca/me.m11.d21:meMA.Ode6C26.melody
ltx/en_us_public/me.m11.d21:meMA.Ode6C26.mode	@ltx/en_us_dedes/me.m11.d21:meMA.Ode6C26.mode
ltx/en_us_public/me.m11.d21:meMA.Ode6C26.ode	@ltx/en_us_dedes/me.m11.d21:meMA.Ode6C26.ode
ltx/en_us_public/me.m11.d21:meMA.Ode6C26.text	@ltx/en_us_oca/me.m11.d21:meMA.Ode6C26.text
ltx/en_us_public/me.m11.d21:meMA.Ode6C2T.incipit	@ltx/en_us_barrett/me.m11.d21:meMA.Ode6C2T.incipit
ltx/en_us_public/me.m11.d21:meMA.Ode6C2T.melody	@ltx/en_us_barrett/me.m11.d21:meMA.Ode6C2T.melody
ltx/en_us_public/me.m11.d21:meMA.Ode6C2T.mode	@ltx/en_us_dedes/me.m11.d21:meMA.Ode6C2T.mode
ltx/en_us_public/me.m11.d21:meMA.Ode6C2T.ode	@ltx/en_us_dedes/me.m11.d21:meMA.Ode6C2T.ode
ltx/en_us_public/me.m11.d21:meMA.Ode6C2T.text	@ltx/en_us_barrett/me.m11.d21:meMA.Ode6C2T.text
ltx/en_us_public/me.m11.d21:meMA.Ode6C2Tr.incipit	@ltx/en_us_barrett/me.m11.d21:meMA.Ode6C2Tr.incipit
ltx/en_us_public/me.m11.d21:meMA.Ode6C2Tr.melody	@ltx/en_us_barrett/me.m11.d21:meMA.Ode6C2Tr.melody
ltx/en_us_public/me.m11.d21:meMA.Ode6C2Tr.mode	@ltx/en_us_dedes/me.m11.d21:meMA.Ode6C2Tr.mode
ltx/en_us_public/me.m11.d21:meMA.Ode6C2Tr.ode	@ltx/en_us_dedes/me.m11.d21:meMA.Ode6C2Tr.ode
ltx/en_us_public/me.m11.d21:meMA.Ode6C2Tr.text	@ltx/en_us_barrett/me.m11.d21:meMA.Ode6C2Tr.text
ltx/en_us_public/me.m11.d21:meMA.Ode7C11.greekmelody	@ltx/en_us_dedes/me.m11.d21:meMA.Ode7C11.greekmelody
ltx/en_us_public/me.m11.d21:meMA.Ode7C11.incipit	@ltx/en_us_barrett/me.m11.d21:meMA.Ode7C11.incipit
ltx/en_us_public/me.m11.d21:meMA.Ode7C11.melody	@ltx/en_us_barrett/me.m11.d21:meMA.Ode7C11.melody
ltx/en_us_public/me.m11.d21:meMA.Ode7C11.mode	@ltx/en_us_dedes/me.m11.d21:meMA.Ode7C11.mode
ltx/en_us_public/me.m11.d21:meMA.Ode7C11.ode	@ltx/en_us_dedes/me.m11.d21:meMA.Ode7C11.ode
ltx/en_us_public/me.m11.d21:meMA.Ode7C11.text	@ltx/en_us_barrett/me.m11.d21:meMA.Ode7C11.text
ltx/en_us_public/me.m11.d21:meMA.Ode7C12.incipit	@ltx/en_us_barrett/me.m11.d21:meMA.Ode7C12.incipit
ltx/en_us_public/me.m11.d21:meMA.Ode7C12.melody	@ltx/en_us_barrett/me.m11.d21:meMA.Ode7C12.melody
ltx/en_us_public/me.m11.d21:meMA.Ode7C12.mode	@ltx/en_us_dedes/me.m11.d21:meMA.Ode7C12.mode
ltx/en_us_public/me.m11.d21:meMA.Ode7C12.ode	@ltx/en_us_dedes/me.m11.d21:meMA.Ode7C12.ode
ltx/en_us_public/me.m11.d21:meMA.Ode7C12.text	@ltx/en_us_barrett/me.m11.d21:meMA.Ode7C12.text
ltx/en_us_public/me.m11.d21:meMA.Ode7C13.incipit	@ltx/en_us_barrett/me.m11.d21:meMA.Ode7C13.incipit
ltx/en_us_public/me.m11.d21:meMA.Ode7C13.melody	@ltx/en_us_barrett/me.m11.d21:meMA.Ode7C13.melody
ltx/en_us_public/me.m11.d21:meMA.Ode7C13.mode	@ltx/en_us_dedes/me.m11.d21:meMA.Ode7C13.mode
ltx/en_us_public/me.m11.d21:meMA.Ode7C13.ode	@ltx/en_us_dedes/me.m11.d21:meMA.Ode7C13.ode
ltx/en_us_public/me.m11.d21:meMA.Ode7C13.text	@ltx/en_us_barrett/me.m11.d21:meMA.Ode7C13.text
ltx/en_us_public/me.m11.d21:meMA.Ode7C14.incipit	@ltx/en_us_oca/me.m11.d21:meMA.Ode7C14.incipit
ltx/en_us_public/me.m11.d21:meMA.Ode7C14.melody	@ltx/en_us_oca/me.m11.d21:meMA.Ode7C14.melody
ltx/en_us_public/me.m11.d21:meMA.Ode7C14.mode	@ltx/en_us_dedes/me.m11.d21:meMA.Ode7C14.mode
ltx/en_us_public/me.m11.d21:meMA.Ode7C14.ode	@ltx/en_us_dedes/me.m11.d21:meMA.Ode7C14.ode
ltx/en_us_public/me.m11.d21:meMA.Ode7C14.text	@ltx/en_us_oca/me.m11.d21:meMA.Ode7C14.text
ltx/en_us_public/me.m11.d21:meMA.Ode7C1H.greekmelody	@ltx/en_us_dedes/me.m11.d21:meMA.Ode7C1H.greekmelody
ltx/en_us_public/me.m11.d21:meMA.Ode7C1H.incipit	@ltx/en_us_dedes/me.m11.d21:meMA.Ode7C1H.incipit
ltx/en_us_public/me.m11.d21:meMA.Ode7C1H.melody	@ltx/en_us_dedes/me.m11.d21:meMA.Ode7C1H.melody
ltx/en_us_public/me.m11.d21:meMA.Ode7C1H.mode	@ltx/en_us_dedes/me.m11.d21:meMA.Ode7C1H.mode
ltx/en_us_public/me.m11.d21:meMA.Ode7C1H.ode	@ltx/en_us_dedes/me.m11.d21:meMA.Ode7C1H.ode
ltx/en_us_public/me.m11.d21:meMA.Ode7C1H.text	@ltx/en_us_dedes/me.m11.d21:meMA.Ode7C1H.text
ltx/en_us_public/me.m11.d21:meMA.Ode7C21.greekmelody	@ltx/en_us_dedes/me.m11.d21:meMA.Ode7C21.greekmelody
ltx/en_us_public/me.m11.d21:meMA.Ode7C21.incipit	@ltx/en_us_barrett/me.m11.d21:meMA.Ode7C21.incipit
ltx/en_us_public/me.m11.d21:meMA.Ode7C21.melody	@ltx/en_us_barrett/me.m11.d21:meMA.Ode7C21.melody
ltx/en_us_public/me.m11.d21:meMA.Ode7C21.mode	@ltx/en_us_dedes/me.m11.d21:meMA.Ode7C21.mode
ltx/en_us_public/me.m11.d21:meMA.Ode7C21.ode	@ltx/en_us_dedes/me.m11.d21:meMA.Ode7C21.ode
ltx/en_us_public/me.m11.d21:meMA.Ode7C21.text	@ltx/en_us_barrett/me.m11.d21:meMA.Ode7C21.text
ltx/en_us_public/me.m11.d21:meMA.Ode7C22.incipit	@ltx/en_us_barrett/me.m11.d21:meMA.Ode7C22.incipit
ltx/en_us_public/me.m11.d21:meMA.Ode7C22.melody	@ltx/en_us_barrett/me.m11.d21:meMA.Ode7C22.melody
ltx/en_us_public/me.m11.d21:meMA.Ode7C22.mode	@ltx/en_us_dedes/me.m11.d21:meMA.Ode7C22.mode
ltx/en_us_public/me.m11.d21:meMA.Ode7C22.ode	@ltx/en_us_dedes/me.m11.d21:meMA.Ode7C22.ode
ltx/en_us_public/me.m11.d21:meMA.Ode7C22.text	@ltx/en_us_barrett/me.m11.d21:meMA.Ode7C22.text
ltx/en_us_public/me.m11.d21:meMA.Ode7C23.incipit	@ltx/en_us_oca/me.m11.d21:meMA.Ode7C23.incipit
ltx/en_us_public/me.m11.d21:meMA.Ode7C23.melody	@ltx/en_us_oca/me.m11.d21:meMA.Ode7C23.melody
ltx/en_us_public/me.m11.d21:meMA.Ode7C23.mode	@ltx/en_us_dedes/me.m11.d21:meMA.Ode7C23.mode
ltx/en_us_public/me.m11.d21:meMA.Ode7C23.ode	@ltx/en_us_dedes/me.m11.d21:meMA.Ode7C23.ode
ltx/en_us_public/me.m11.d21:meMA.Ode7C23.text	@ltx/en_us_oca/me.m11.d21:meMA.Ode7C23.text
ltx/en_us_public/me.m11.d21:meMA.Ode7C24.incipit	@ltx/en_us_oca/me.m11.d21:meMA.Ode7C24.incipit
ltx/en_us_public/me.m11.d21:meMA.Ode7C24.melody	@ltx/en_us_oca/me.m11.d21:meMA.Ode7C24.melody
ltx/en_us_public/me.m11.d21:meMA.Ode7C24.mode	@ltx/en_us_dedes/me.m11.d21:meMA.Ode7C24.mode
ltx/en_us_public/me.m11.d21:meMA.Ode7C24.ode	@ltx/en_us_dedes/me.m11.d21:meMA.Ode7C24.ode
ltx/en_us_public/me.m11.d21:meMA.Ode7C24.text	@ltx/en_us_oca/me.m11.d21:meMA.Ode7C24.text
ltx/en_us_public/me.m11.d21:meMA.Ode7C25.incipit	@ltx/en_us_oca/me.m11.d21:meMA.Ode7C25.incipit
ltx/en_us_public/me.m11.d21:meMA.Ode7C25.melody	@ltx/en_us_oca/me.m11.d21:meMA.Ode7C25.melody
ltx/en_us_public/me.m11.d21:meMA.Ode7C25.mode	@ltx/en_us_dedes/me.m11.d21:meMA.Ode7C25.mode
ltx/en_us_public/me.m11.d21:meMA.Ode7C25.ode	@ltx/en_us_dedes/me.m11.d21:meMA.Ode7C25.ode
ltx/en_us_public/me.m11.d21:meMA.Ode7C25.text	@ltx/en_us_oca/me.m11.d21:meMA.Ode7C25.text
ltx/en_us_public/me.m11.d21:meMA.Ode7C26.incipit	@ltx/en_us_oca/me.m11.d21:meMA.Ode7C26.incipit
ltx/en_us_public/me.m11.d21:meMA.Ode7C26.melody	@ltx/en_us_oca/me.m11.d21:meMA.Ode7C26.melody
ltx/en_us_public/me.m11.d21:meMA.Ode7C26.mode	@ltx/en_us_dedes/me.m11.d21:meMA.Ode7C26.mode
ltx/en_us_public/me.m11.d21:meMA.Ode7C26.ode	@ltx/en_us_dedes/me.m11.d21:meMA.Ode7C26.ode
ltx/en_us_public/me.m11.d21:meMA.Ode7C26.text	@ltx/en_us_oca/me.m11.d21:meMA.Ode7C26.text
ltx/en_us_public/me.m11.d21:meMA.Ode7C2T.incipit	@ltx/en_us_barrett/me.m11.d21:meMA.Ode7C2T.incipit
ltx/en_us_public/me.m11.d21:meMA.Ode7C2T.melody	@ltx/en_us_barrett/me.m11.d21:meMA.Ode7C2T.melody
ltx/en_us_public/me.m11.d21:meMA.Ode7C2T.mode	@ltx/en_us_dedes/me.m11.d21:meMA.Ode7C2T.mode
ltx/en_us_public/me.m11.d21:meMA.Ode7C2T.ode	@ltx/en_us_dedes/me.m11.d21:meMA.Ode7C2T.ode
ltx/en_us_public/me.m11.d21:meMA.Ode7C2T.text	@ltx/en_us_barrett/me.m11.d21:meMA.Ode7C2T.text
ltx/en_us_public/me.m11.d21:meMA.Ode7C2Tr.incipit	@ltx/en_us_barrett/me.m11.d21:meMA.Ode7C2Tr.incipit
ltx/en_us_public/me.m11.d21:meMA.Ode7C2Tr.melody	@ltx/en_us_barrett/me.m11.d21:meMA.Ode7C2Tr.melody
ltx/en_us_public/me.m11.d21:meMA.Ode7C2Tr.mode	@ltx/en_us_dedes/me.m11.d21:meMA.Ode7C2Tr.mode
ltx/en_us_public/me.m11.d21:meMA.Ode7C2Tr.ode	@ltx/en_us_dedes/me.m11.d21:meMA.Ode7C2Tr.ode
ltx/en_us_public/me.m11.d21:meMA.Ode7C2Tr.text	@ltx/en_us_barrett/me.m11.d21:meMA.Ode7C2Tr.text
ltx/en_us_public/me.m11.d21:meMA.Ode8C11.greekmelody	@ltx/en_us_dedes/me.m11.d21:meMA.Ode8C11.greekmelody
ltx/en_us_public/me.m11.d21:meMA.Ode8C11.incipit	@ltx/en_us_barrett/me.m11.d21:meMA.Ode8C11.incipit
ltx/en_us_public/me.m11.d21:meMA.Ode8C11.melody	@ltx/en_us_barrett/me.m11.d21:meMA.Ode8C11.melody
ltx/en_us_public/me.m11.d21:meMA.Ode8C11.mode	@ltx/en_us_dedes/me.m11.d21:meMA.Ode8C11.mode
ltx/en_us_public/me.m11.d21:meMA.Ode8C11.ode	@ltx/en_us_dedes/me.m11.d21:meMA.Ode8C11.ode
ltx/en_us_public/me.m11.d21:meMA.Ode8C11.text	@ltx/en_us_barrett/me.m11.d21:meMA.Ode8C11.text
ltx/en_us_public/me.m11.d21:meMA.Ode8C12.incipit	@ltx/en_us_barrett/me.m11.d21:meMA.Ode8C12.incipit
ltx/en_us_public/me.m11.d21:meMA.Ode8C12.melody	@ltx/en_us_barrett/me.m11.d21:meMA.Ode8C12.melody
ltx/en_us_public/me.m11.d21:meMA.Ode8C12.mode	@ltx/en_us_dedes/me.m11.d21:meMA.Ode8C12.mode
ltx/en_us_public/me.m11.d21:meMA.Ode8C12.ode	@ltx/en_us_dedes/me.m11.d21:meMA.Ode8C12.ode
ltx/en_us_public/me.m11.d21:meMA.Ode8C12.text	@ltx/en_us_barrett/me.m11.d21:meMA.Ode8C12.text
ltx/en_us_public/me.m11.d21:meMA.Ode8C13.incipit	@ltx/en_us_barrett/me.m11.d21:meMA.Ode8C13.incipit
ltx/en_us_public/me.m11.d21:meMA.Ode8C13.melody	@ltx/en_us_barrett/me.m11.d21:meMA.Ode8C13.melody
ltx/en_us_public/me.m11.d21:meMA.Ode8C13.mode	@ltx/en_us_dedes/me.m11.d21:meMA.Ode8C13.mode
ltx/en_us_public/me.m11.d21:meMA.Ode8C13.ode	@ltx/en_us_dedes/me.m11.d21:meMA.Ode8C13.ode
ltx/en_us_public/me.m11.d21:meMA.Ode8C13.text	@ltx/en_us_barrett/me.m11.d21:meMA.Ode8C13.text
ltx/en_us_public/me.m11.d21:meMA.Ode8C14.incipit	@ltx/en_us_oca/me.m11.d21:meMA.Ode8C14.incipit
ltx/en_us_public/me.m11.d21:meMA.Ode8C14.melody	@ltx/en_us_oca/me.m11.d21:meMA.Ode8C14.melody
ltx/en_us_public/me.m11.d21:meMA.Ode8C14.mode	@ltx/en_us_dedes/me.m11.d21:meMA.Ode8C14.mode
ltx/en_us_public/me.m11.d21:meMA.Ode8C14.ode	@ltx/en_us_dedes/me.m11.d21:meMA.Ode8C14.ode
ltx/en_us_public/me.m11.d21:meMA.Ode8C14.text	@ltx/en_us_oca/me.m11.d21:meMA.Ode8C14.text
ltx/en_us_public/me.m11.d21:meMA.Ode8C15.incipit	@ltx/en_us_oca/me.m11.d21:meMA.Ode8C15.incipit
ltx/en_us_public/me.m11.d21:meMA.Ode8C15.melody	@ltx/en_us_oca/me.m11.d21:meMA.Ode8C15.melody
ltx/en_us_public/me.m11.d21:meMA.Ode8C15.mode	@ltx/en_us_dedes/me.m11.d21:meMA.Ode8C15.mode
ltx/en_us_public/me.m11.d21:meMA.Ode8C15.ode	@ltx/en_us_dedes/me.m11.d21:meMA.Ode8C15.ode
ltx/en_us_public/me.m11.d21:meMA.Ode8C15.text	@ltx/en_us_oca/me.m11.d21:meMA.Ode8C15.text
ltx/en_us_public/me.m11.d21:meMA.Ode8C16.incipit	@ltx/en_us_oca/me.m11.d21:meMA.Ode8C16.incipit
ltx/en_us_public/me.m11.d21:meMA.Ode8C16.melody	@ltx/en_us_oca/me.m11.d21:meMA.Ode8C16.melody
ltx/en_us_public/me.m11.d21:meMA.Ode8C16.mode	@ltx/en_us_dedes/me.m11.d21:meMA.Ode8C16.mode
ltx/en_us_public/me.m11.d21:meMA.Ode8C16.ode	@ltx/en_us_dedes/me.m11.d21:meMA.Ode8C16.ode
ltx/en_us_public/me.m11.d21:meMA.Ode8C16.text	@ltx/en_us_oca/me.m11.d21:meMA.Ode8C16.text
ltx/en_us_public/me.m11.d21:meMA.Ode8C1H.greekmelody	@ltx/en_us_dedes/me.m11.d21:meMA.Ode8C1H.greekmelody
ltx/en_us_public/me.m11.d21:meMA.Ode8C1H.incipit	@ltx/en_us_dedes/me.m11.d21:meMA.Ode8C1H.incipit
ltx/en_us_public/me.m11.d21:meMA.Ode8C1H.melody	@ltx/en_us_dedes/me.m11.d21:meMA.Ode8C1H.melody
ltx/en_us_public/me.m11.d21:meMA.Ode8C1H.mode	@ltx/en_us_dedes/me.m11.d21:meMA.Ode8C1H.mode
ltx/en_us_public/me.m11.d21:meMA.Ode8C1H.ode	@ltx/en_us_dedes/me.m11.d21:meMA.Ode8C1H.ode
ltx/en_us_public/me.m11.d21:meMA.Ode8C1H.text	@ltx/en_us_dedes/me.m11.d21:meMA.Ode8C1H.text
ltx/en_us_public/me.m11.d21:meMA.Ode8C21.greekmelody	@ltx/en_us_dedes/me.m11.d21:meMA.Ode8C21.greekmelody
ltx/en_us_public/me.m11.d21:meMA.Ode8C21.incipit	@ltx/en_us_barrett/me.m11.d21:meMA.Ode8C21.incipit
ltx/en_us_public/me.m11.d21:meMA.Ode8C21.melody	@ltx/en_us_barrett/me.m11.d21:meMA.Ode8C21.melody
ltx/en_us_public/me.m11.d21:meMA.Ode8C21.mode	@ltx/en_us_dedes/me.m11.d21:meMA.Ode8C21.mode
ltx/en_us_public/me.m11.d21:meMA.Ode8C21.ode	@ltx/en_us_dedes/me.m11.d21:meMA.Ode8C21.ode
ltx/en_us_public/me.m11.d21:meMA.Ode8C21.text	@ltx/en_us_barrett/me.m11.d21:meMA.Ode8C21.text
ltx/en_us_public/me.m11.d21:meMA.Ode8C22.incipit	@ltx/en_us_barrett/me.m11.d21:meMA.Ode8C22.incipit
ltx/en_us_public/me.m11.d21:meMA.Ode8C22.melody	@ltx/en_us_barrett/me.m11.d21:meMA.Ode8C22.melody
ltx/en_us_public/me.m11.d21:meMA.Ode8C22.mode	@ltx/en_us_dedes/me.m11.d21:meMA.Ode8C22.mode
ltx/en_us_public/me.m11.d21:meMA.Ode8C22.ode	@ltx/en_us_dedes/me.m11.d21:meMA.Ode8C22.ode
ltx/en_us_public/me.m11.d21:meMA.Ode8C22.text	@ltx/en_us_barrett/me.m11.d21:meMA.Ode8C22.text
ltx/en_us_public/me.m11.d21:meMA.Ode8C23.incipit	@ltx/en_us_oca/me.m11.d21:meMA.Ode8C23.incipit
ltx/en_us_public/me.m11.d21:meMA.Ode8C23.melody	@ltx/en_us_oca/me.m11.d21:meMA.Ode8C23.melody
ltx/en_us_public/me.m11.d21:meMA.Ode8C23.mode	@ltx/en_us_dedes/me.m11.d21:meMA.Ode8C23.mode
ltx/en_us_public/me.m11.d21:meMA.Ode8C23.ode	@ltx/en_us_dedes/me.m11.d21:meMA.Ode8C23.ode
ltx/en_us_public/me.m11.d21:meMA.Ode8C23.text	@ltx/en_us_oca/me.m11.d21:meMA.Ode8C23.text
ltx/en_us_public/me.m11.d21:meMA.Ode8C24.incipit	@ltx/en_us_oca/me.m11.d21:meMA.Ode8C24.incipit
ltx/en_us_public/me.m11.d21:meMA.Ode8C24.melody	@ltx/en_us_oca/me.m11.d21:meMA.Ode8C24.melody
ltx/en_us_public/me.m11.d21:meMA.Ode8C24.mode	@ltx/en_us_dedes/me.m11.d21:meMA.Ode8C24.mode
ltx/en_us_public/me.m11.d21:meMA.Ode8C24.ode	@ltx/en_us_dedes/me.m11.d21:meMA.Ode8C24.ode
ltx/en_us_public/me.m11.d21:meMA.Ode8C24.text	@ltx/en_us_oca/me.m11.d21:meMA.Ode8C24.text
ltx/en_us_public/me.m11.d21:meMA.Ode8C25.incipit	@ltx/en_us_oca/me.m11.d21:meMA.Ode8C25.incipit
ltx/en_us_public/me.m11.d21:meMA.Ode8C25.melody	@ltx/en_us_oca/me.m11.d21:meMA.Ode8C25.melody
ltx/en_us_public/me.m11.d21:meMA.Ode8C25.mode	@ltx/en_us_dedes/me.m11.d21:meMA.Ode8C25.mode
ltx/en_us_public/me.m11.d21:meMA.Ode8C25.ode	@ltx/en_us_dedes/me.m11.d21:meMA.Ode8C25.ode
ltx/en_us_public/me.m11.d21:meMA.Ode8C25.text	@ltx/en_us_oca/me.m11.d21:meMA.Ode8C25.text
ltx/en_us_public/me.m11.d21:meMA.Ode8C26.incipit	@ltx/en_us_oca/me.m11.d21:meMA.Ode8C26.incipit
ltx/en_us_public/me.m11.d21:meMA.Ode8C26.melody	@ltx/en_us_oca/me.m11.d21:meMA.Ode8C26.melody
ltx/en_us_public/me.m11.d21:meMA.Ode8C26.mode	@ltx/en_us_dedes/me.m11.d21:meMA.Ode8C26.mode
ltx/en_us_public/me.m11.d21:meMA.Ode8C26.ode	@ltx/en_us_dedes/me.m11.d21:meMA.Ode8C26.ode
ltx/en_us_public/me.m11.d21:meMA.Ode8C26.text	@ltx/en_us_oca/me.m11.d21:meMA.Ode8C26.text
ltx/en_us_public/me.m11.d21:meMA.Ode8C2T.incipit	@ltx/en_us_barrett/me.m11.d21:meMA.Ode8C2T.incipit
ltx/en_us_public/me.m11.d21:meMA.Ode8C2T.melody	@ltx/en_us_barrett/me.m11.d21:meMA.Ode8C2T.melody
ltx/en_us_public/me.m11.d21:meMA.Ode8C2T.mode	@ltx/en_us_dedes/me.m11.d21:meMA.Ode8C2T.mode
ltx/en_us_public/me.m11.d21:meMA.Ode8C2T.ode	@ltx/en_us_dedes/me.m11.d21:meMA.Ode8C2T.ode
ltx/en_us_public/me.m11.d21:meMA.Ode8C2T.text	@ltx/en_us_barrett/me.m11.d21:meMA.Ode8C2T.text
ltx/en_us_public/me.m11.d21:meMA.Ode8C2Tr.incipit	@ltx/en_us_barrett/me.m11.d21:meMA.Ode8C2Tr.incipit
ltx/en_us_public/me.m11.d21:meMA.Ode8C2Tr.melody	@ltx/en_us_barrett/me.m11.d21:meMA.Ode8C2Tr.melody
ltx/en_us_public/me.m11.d21:meMA.Ode8C2Tr.mode	@ltx/en_us_dedes/me.m11.d21:meMA.Ode8C2Tr.mode
ltx/en_us_public/me.m11.d21:meMA.Ode8C2Tr.ode	@ltx/en_us_dedes/me.m11.d21:meMA.Ode8C2Tr.ode
ltx/en_us_public/me.m11.d21:meMA.Ode8C2Tr.text	@ltx/en_us_barrett/me.m11.d21:meMA.Ode8C2Tr.text
ltx/en_us_public/me.m11.d21:meMA.Ode9C11.greekmelody	@ltx/en_us_dedes/me.m11.d21:meMA.Ode9C11.greekmelody
ltx/en_us_public/me.m11.d21:meMA.Ode9C11.incipit	@ltx/en_us_dedes/me.m11.d21:meMA.Ode9C11.incipit
ltx/en_us_public/me.m11.d21:meMA.Ode9C11.melody	@ltx/en_us_dedes/me.m11.d21:meMA.Ode9C11.melody
ltx/en_us_public/me.m11.d21:meMA.Ode9C11.mode	@ltx/en_us_dedes/me.m11.d21:meMA.Ode9C11.mode
ltx/en_us_public/me.m11.d21:meMA.Ode9C11.ode	@ltx/en_us_dedes/me.m11.d21:meMA.Ode9C11.ode
ltx/en_us_public/me.m11.d21:meMA.Ode9C11.text	@ltx/en_us_dedes/me.m11.d21:meMA.Ode9C11.text
ltx/en_us_public/me.m11.d21:meMA.Ode9C12.incipit	@ltx/en_us_dedes/me.m11.d21:meMA.Ode9C12.incipit
ltx/en_us_public/me.m11.d21:meMA.Ode9C12.melody	@ltx/en_us_dedes/me.m11.d21:meMA.Ode9C12.melody
ltx/en_us_public/me.m11.d21:meMA.Ode9C12.mode	@ltx/en_us_dedes/me.m11.d21:meMA.Ode9C12.mode
ltx/en_us_public/me.m11.d21:meMA.Ode9C12.ode	@ltx/en_us_dedes/me.m11.d21:meMA.Ode9C12.ode
ltx/en_us_public/me.m11.d21:meMA.Ode9C12.text	@ltx/en_us_dedes/me.m11.d21:meMA.Ode9C12.text
ltx/en_us_public/me.m11.d21:meMA.Ode9C13.incipit	@ltx/en_us_dedes/me.m11.d21:meMA.Ode9C13.incipit
ltx/en_us_public/me.m11.d21:meMA.Ode9C13.melody	@ltx/en_us_dedes/me.m11.d21:meMA.Ode9C13.melody
ltx/en_us_public/me.m11.d21:meMA.Ode9C13.mode	@ltx/en_us_dedes/me.m11.d21:meMA.Ode9C13.mode
ltx/en_us_public/me.m11.d21:meMA.Ode9C13.ode	@ltx/en_us_dedes/me.m11.d21:meMA.Ode9C13.ode
ltx/en_us_public/me.m11.d21:meMA.Ode9C13.text	@ltx/en_us_dedes/me.m11.d21:meMA.Ode9C13.text
ltx/en_us_public/me.m11.d21:meMA.Ode9C14.incipit	@ltx/en_us_oca/me.m11.d21:meMA.Ode9C14.incipit
ltx/en_us_public/me.m11.d21:meMA.Ode9C14.melody	@ltx/en_us_oca/me.m11.d21:meMA.Ode9C14.melody
ltx/en_us_public/me.m11.d21:meMA.Ode9C14.mode	@ltx/en_us_dedes/me.m11.d21:meMA.Ode9C14.mode
ltx/en_us_public/me.m11.d21:meMA.Ode9C14.ode	@ltx/en_us_dedes/me.m11.d21:meMA.Ode9C14.ode
ltx/en_us_public/me.m11.d21:meMA.Ode9C14.text	@ltx/en_us_oca/me.m11.d21:meMA.Ode9C14.text
ltx/en_us_public/me.m11.d21:meMA.Ode9C15.incipit	@ltx/en_us_oca/me.m11.d21:meMA.Ode9C15.incipit
ltx/en_us_public/me.m11.d21:meMA.Ode9C15.melody	@ltx/en_us_oca/me.m11.d21:meMA.Ode9C15.melody
ltx/en_us_public/me.m11.d21:meMA.Ode9C15.mode	@ltx/en_us_dedes/me.m11.d21:meMA.Ode9C15.mode
ltx/en_us_public/me.m11.d21:meMA.Ode9C15.ode	@ltx/en_us_dedes/me.m11.d21:meMA.Ode9C15.ode
ltx/en_us_public/me.m11.d21:meMA.Ode9C15.text	@ltx/en_us_oca/me.m11.d21:meMA.Ode9C15.text
ltx/en_us_public/me.m11.d21:meMA.Ode9C16.incipit	@ltx/en_us_oca/me.m11.d21:meMA.Ode9C16.incipit
ltx/en_us_public/me.m11.d21:meMA.Ode9C16.melody	@ltx/en_us_oca/me.m11.d21:meMA.Ode9C16.melody
ltx/en_us_public/me.m11.d21:meMA.Ode9C16.mode	@ltx/en_us_dedes/me.m11.d21:meMA.Ode9C16.mode
ltx/en_us_public/me.m11.d21:meMA.Ode9C16.ode	@ltx/en_us_dedes/me.m11.d21:meMA.Ode9C16.ode
ltx/en_us_public/me.m11.d21:meMA.Ode9C16.text	@ltx/en_us_oca/me.m11.d21:meMA.Ode9C16.text
ltx/en_us_public/me.m11.d21:meMA.Ode9C1H.greekmelody	@ltx/en_us_dedes/me.m11.d21:meMA.Ode9C1H.greekmelody
ltx/en_us_public/me.m11.d21:meMA.Ode9C1H.incipit	@ltx/en_us_dedes/me.m11.d21:meMA.Ode9C1H.incipit
ltx/en_us_public/me.m11.d21:meMA.Ode9C1H.melody	@ltx/en_us_dedes/me.m11.d21:meMA.Ode9C1H.melody
ltx/en_us_public/me.m11.d21:meMA.Ode9C1H.mode	@ltx/en_us_dedes/me.m11.d21:meMA.Ode9C1H.mode
ltx/en_us_public/me.m11.d21:meMA.Ode9C1H.ode	@ltx/en_us_dedes/me.m11.d21:meMA.Ode9C1H.ode
ltx/en_us_public/me.m11.d21:meMA.Ode9C1H.text	@ltx/en_us_dedes/me.m11.d21:meMA.Ode9C1H.text
ltx/en_us_public/me.m11.d21:meMA.Ode9C1M01.incipit	@ltx/en_us_dedes/me.m11.d21:meMA.Ode9C1M01.incipit
ltx/en_us_public/me.m11.d21:meMA.Ode9C1M01.text	@ltx/en_us_dedes/me.m11.d21:meMA.Ode9C1M01.text
ltx/en_us_public/me.m11.d21:meMA.Ode9C1M02.incipit	@ltx/en_us_dedes/me.m11.d21:meMA.Ode9C1M02.incipit
ltx/en_us_public/me.m11.d21:meMA.Ode9C1M02.text	@ltx/en_us_dedes/me.m11.d21:meMA.Ode9C1M02.text
ltx/en_us_public/me.m11.d21:meMA.Ode9C1M03.incipit	@ltx/en_us_dedes/me.m11.d21:meMA.Ode9C1M03.incipit
ltx/en_us_public/me.m11.d21:meMA.Ode9C1M03.text	@ltx/en_us_dedes/me.m11.d21:meMA.Ode9C1M03.text
ltx/en_us_public/me.m11.d21:meMA.Ode9C1M04.incipit	@ltx/en_us_dedes/me.m11.d21:meMA.Ode9C1M04.incipit
ltx/en_us_public/me.m11.d21:meMA.Ode9C1M04.text	@ltx/en_us_dedes/me.m11.d21:meMA.Ode9C1M04.text
ltx/en_us_public/me.m11.d21:meMA.Ode9C1M05.incipit	@ltx/en_us_oca/me.m11.d21:meMA.Ode9C1M05.incipit
ltx/en_us_public/me.m11.d21:meMA.Ode9C1M05.text	@ltx/en_us_oca/me.m11.d21:meMA.Ode9C1M05.text
ltx/en_us_public/me.m11.d21:meMA.Ode9C1M06.incipit	@ltx/en_us_oca/me.m11.d21:meMA.Ode9C1M06.incipit
ltx/en_us_public/me.m11.d21:meMA.Ode9C1M06.text	@ltx/en_us_oca/me.m11.d21:meMA.Ode9C1M06.text
ltx/en_us_public/me.m11.d21:meMA.Ode9C1M07.incipit	@ltx/en_us_oca/me.m11.d21:meMA.Ode9C1M07.incipit
ltx/en_us_public/me.m11.d21:meMA.Ode9C1M07.text	@ltx/en_us_oca/me.m11.d21:meMA.Ode9C1M07.text
ltx/en_us_public/me.m11.d21:meMA.Ode9C21.greekmelody	@ltx/en_us_dedes/me.m11.d21:meMA.Ode9C21.greekmelody
ltx/en_us_public/me.m11.d21:meMA.Ode9C21.incipit	@ltx/en_us_dedes/me.m11.d21:meMA.Ode9C21.incipit
ltx/en_us_public/me.m11.d21:meMA.Ode9C21.melody	@ltx/en_us_dedes/me.m11.d21:meMA.Ode9C21.melody
ltx/en_us_public/me.m11.d21:meMA.Ode9C21.mode	@ltx/en_us_dedes/me.m11.d21:meMA.Ode9C21.mode
ltx/en_us_public/me.m11.d21:meMA.Ode9C21.ode	@ltx/en_us_dedes/me.m11.d21:meMA.Ode9C21.ode
ltx/en_us_public/me.m11.d21:meMA.Ode9C21.text	@ltx/en_us_dedes/me.m11.d21:meMA.Ode9C21.text
ltx/en_us_public/me.m11.d21:meMA.Ode9C22.incipit	@ltx/en_us_dedes/me.m11.d21:meMA.Ode9C22.incipit
ltx/en_us_public/me.m11.d21:meMA.Ode9C22.melody	@ltx/en_us_dedes/me.m11.d21:meMA.Ode9C22.melody
ltx/en_us_public/me.m11.d21:meMA.Ode9C22.mode	@ltx/en_us_dedes/me.m11.d21:meMA.Ode9C22.mode
ltx/en_us_public/me.m11.d21:meMA.Ode9C22.ode	@ltx/en_us_dedes/me.m11.d21:meMA.Ode9C22.ode
ltx/en_us_public/me.m11.d21:meMA.Ode9C22.text	@ltx/en_us_dedes/me.m11.d21:meMA.Ode9C22.text
ltx/en_us_public/me.m11.d21:meMA.Ode9C23.incipit	@ltx/en_us_dedes/me.m11.d21:meMA.Ode9C23.incipit
ltx/en_us_public/me.m11.d21:meMA.Ode9C23.melody	@ltx/en_us_dedes/me.m11.d21:meMA.Ode9C23.melody
ltx/en_us_public/me.m11.d21:meMA.Ode9C23.mode	@ltx/en_us_dedes/me.m11.d21:meMA.Ode9C23.mode
ltx/en_us_public/me.m11.d21:meMA.Ode9C23.ode	@ltx/en_us_dedes/me.m11.d21:meMA.Ode9C23.ode
ltx/en_us_public/me.m11.d21:meMA.Ode9C23.text	@ltx/en_us_dedes/me.m11.d21:meMA.Ode9C23.text
ltx/en_us_public/me.m11.d21:meMA.Ode9C24.incipit	@ltx/en_us_oca/me.m11.d21:meMA.Ode9C24.incipit
ltx/en_us_public/me.m11.d21:meMA.Ode9C24.melody	@ltx/en_us_oca/me.m11.d21:meMA.Ode9C24.melody
ltx/en_us_public/me.m11.d21:meMA.Ode9C24.mode	@ltx/en_us_dedes/me.m11.d21:meMA.Ode9C24.mode
ltx/en_us_public/me.m11.d21:meMA.Ode9C24.ode	@ltx/en_us_dedes/me.m11.d21:meMA.Ode9C24.ode
ltx/en_us_public/me.m11.d21:meMA.Ode9C24.text	@ltx/en_us_oca/me.m11.d21:meMA.Ode9C24.text
ltx/en_us_public/me.m11.d21:meMA.Ode9C25.incipit	@ltx/en_us_oca/me.m11.d21:meMA.Ode9C25.incipit
ltx/en_us_public/me.m11.d21:meMA.Ode9C25.melody	@ltx/en_us_oca/me.m11.d21:meMA.Ode9C25.melody
ltx/en_us_public/me.m11.d21:meMA.Ode9C25.mode	@ltx/en_us_dedes/me.m11.d21:meMA.Ode9C25.mode
ltx/en_us_public/me.m11.d21:meMA.Ode9C25.ode	@ltx/en_us_dedes/me.m11.d21:meMA.Ode9C25.ode
ltx/en_us_public/me.m11.d21:meMA.Ode9C25.text	@ltx/en_us_oca/me.m11.d21:meMA.Ode9C25.text
ltx/en_us_public/me.m11.d21:meMA.Ode9C26.incipit	@ltx/en_us_oca/me.m11.d21:meMA.Ode9C26.incipit
ltx/en_us_public/me.m11.d21:meMA.Ode9C26.melody	@ltx/en_us_oca/me.m11.d21:meMA.Ode9C26.melody
ltx/en_us_public/me.m11.d21:meMA.Ode9C26.mode	@ltx/en_us_dedes/me.m11.d21:meMA.Ode9C26.mode
ltx/en_us_public/me.m11.d21:meMA.Ode9C26.ode	@ltx/en_us_dedes/me.m11.d21:meMA.Ode9C26.ode
ltx/en_us_public/me.m11.d21:meMA.Ode9C26.text	@ltx/en_us_oca/me.m11.d21:meMA.Ode9C26.text
ltx/en_us_public/me.m11.d21:meMA.Ode9C2M01.incipit	@ltx/en_us_dedes/me.m11.d21:meMA.Ode9C2M01.incipit
ltx/en_us_public/me.m11.d21:meMA.Ode9C2M01.text	@ltx/en_us_dedes/me.m11.d21:meMA.Ode9C2M01.text
ltx/en_us_public/me.m11.d21:meMA.Ode9C2MTh.incipit	@ltx/en_us_dedes/me.m11.d21:meMA.Ode9C2MTh.incipit
ltx/en_us_public/me.m11.d21:meMA.Ode9C2MTh.text	@ltx/en_us_dedes/me.m11.d21:meMA.Ode9C2MTh.text
ltx/en_us_public/me.m11.d21:meMA.Ode9C2MTr.incipit	@ltx/en_us_dedes/me.m11.d21:meMA.Ode9C2MTr.incipit
ltx/en_us_public/me.m11.d21:meMA.Ode9C2MTr.text	@ltx/en_us_dedes/me.m11.d21:meMA.Ode9C2MTr.text
ltx/en_us_public/me.m11.d21:meMA.Ode9C2T.incipit	@ltx/en_us_dedes/me.m11.d21:meMA.Ode9C2T.incipit
ltx/en_us_public/me.m11.d21:meMA.Ode9C2T.melody	@ltx/en_us_dedes/me.m11.d21:meMA.Ode9C2T.melody
ltx/en_us_public/me.m11.d21:meMA.Ode9C2T.mode	@ltx/en_us_dedes/me.m11.d21:meMA.Ode9C2T.mode
ltx/en_us_public/me.m11.d21:meMA.Ode9C2T.ode	@ltx/en_us_dedes/me.m11.d21:meMA.Ode9C2T.ode
ltx/en_us_public/me.m11.d21:meMA.Ode9C2T.text	@ltx/en_us_dedes/me.m11.d21:meMA.Ode9C2T.text
ltx/en_us_public/me.m11.d21:meMA.Ode9C2Tr.incipit	@ltx/en_us_dedes/me.m11.d21:meMA.Ode9C2Tr.incipit
ltx/en_us_public/me.m11.d21:meMA.Ode9C2Tr.melody	@ltx/en_us_dedes/me.m11.d21:meMA.Ode9C2Tr.melody
ltx/en_us_public/me.m11.d21:meMA.Ode9C2Tr.mode	@ltx/en_us_dedes/me.m11.d21:meMA.Ode9C2Tr.mode
ltx/en_us_public/me.m11.d21:meMA.Ode9C2Tr.ode	@ltx/en_us_dedes/me.m11.d21:meMA.Ode9C2Tr.ode
ltx/en_us_public/me.m11.d21:meMA.Ode9C2Tr.text	@ltx/en_us_dedes/me.m11.d21:meMA.Ode9C2Tr.text
ltx/en_us_public/me.m11.d21:meMA.Oikos1.text	@ltx/en_us_dedes/me.m11.d21:meMA.Oikos1.text
ltx/en_us_public/me.m11.d21:meMA.PostGospelBoth.incipit	@ltx/en_us_dedes/me.m11.d21:meMA.PostGospelBoth.incipit
ltx/en_us_public/me.m11.d21:meMA.PostGospelBoth.melody	@ltx/en_us_dedes/me.m11.d21:meMA.PostGospelBoth.melody
ltx/en_us_public/me.m11.d21:meMA.PostGospelBoth.mode	@ltx/en_us_dedes/me.m11.d21:meMA.PostGospelBoth.mode
ltx/en_us_public/me.m11.d21:meMA.PostGospelBoth.text	@ltx/en_us_dedes/me.m11.d21:meMA.PostGospelBoth.text
ltx/en_us_public/me.m11.d21:meMA.PostGospelGlory.incipit	@ltx/en_us_dedes/me.m11.d21:meMA.PostGospelGlory.incipit
ltx/en_us_public/me.m11.d21:meMA.PostGospelGlory.melody	@ltx/en_us_dedes/me.m11.d21:meMA.PostGospelGlory.melody
ltx/en_us_public/me.m11.d21:meMA.PostGospelGlory.mode	@ltx/en_us_dedes/me.m11.d21:meMA.PostGospelGlory.mode
ltx/en_us_public/me.m11.d21:meMA.PostGospelGlory.text	@ltx/en_us_dedes/me.m11.d21:meMA.PostGospelGlory.text
ltx/en_us_public/me.m11.d21:meMA.PostGospelIdiomelon.incipit	@ltx/en_us_dedes/me.m11.d21:meMA.PostGospelIdiomelon.incipit
ltx/en_us_public/me.m11.d21:meMA.PostGospelIdiomelon.melody	@ltx/en_us_dedes/me.m11.d21:meMA.PostGospelIdiomelon.melody
ltx/en_us_public/me.m11.d21:meMA.PostGospelIdiomelon.mode	@ltx/en_us_dedes/me.m11.d21:meMA.PostGospelIdiomelon.mode
ltx/en_us_public/me.m11.d21:meMA.PostGospelIdiomelon.text	@ltx/en_us_dedes/me.m11.d21:meMA.PostGospelIdiomelon.text
ltx/en_us_public/me.m11.d21:meSV.AposGlory.incipit	@ltx/en_us_dedes/me.m11.d21:meSV.AposGlory.incipit
ltx/en_us_public/me.m11.d21:meSV.AposGlory.melody	@ltx/en_us_dedes/me.m11.d21:meSV.AposGlory.melody
ltx/en_us_public/me.m11.d21:meSV.AposGlory.mode	@ltx/en_us_dedes/me.m11.d21:meSV.AposGlory.mode
ltx/en_us_public/me.m11.d21:meSV.AposGlory.text	@ltx/en_us_dedes/me.m11.d21:meSV.AposGlory.text
ltx/en_us_public/me.m11.d21:meSV.Aposticha1.incipit	@ltx/en_us_dedes/me.m11.d21:meSV.Aposticha1.incipit
ltx/en_us_public/me.m11.d21:meSV.Aposticha1.melody	@ltx/en_us_dedes/me.m11.d21:meSV.Aposticha1.melody
ltx/en_us_public/me.m11.d21:meSV.Aposticha1.mode	@ltx/en_us_dedes/me.m11.d21:meSV.Aposticha1.mode
ltx/en_us_public/me.m11.d21:meSV.Aposticha1.text	@ltx/en_us_dedes/me.m11.d21:meSV.Aposticha1.text
ltx/en_us_public/me.m11.d21:meSV.Aposticha2.incipit	@ltx/en_us_dedes/me.m11.d21:meSV.Aposticha2.incipit
ltx/en_us_public/me.m11.d21:meSV.Aposticha2.melody	@ltx/en_us_dedes/me.m11.d21:meSV.Aposticha2.melody
ltx/en_us_public/me.m11.d21:meSV.Aposticha2.mode	@ltx/en_us_dedes/me.m11.d21:meSV.Aposticha2.mode
ltx/en_us_public/me.m11.d21:meSV.Aposticha2.text	@ltx/en_us_dedes/me.m11.d21:meSV.Aposticha2.text
ltx/en_us_public/me.m11.d21:meSV.Aposticha3.incipit	@ltx/en_us_dedes/me.m11.d21:meSV.Aposticha3.incipit
ltx/en_us_public/me.m11.d21:meSV.Aposticha3.melody	@ltx/en_us_dedes/me.m11.d21:meSV.Aposticha3.melody
ltx/en_us_public/me.m11.d21:meSV.Aposticha3.mode	@ltx/en_us_dedes/me.m11.d21:meSV.Aposticha3.mode
ltx/en_us_public/me.m11.d21:meSV.Aposticha3.text	@ltx/en_us_dedes/me.m11.d21:meSV.Aposticha3.text
ltx/en_us_public/me.m11.d21:meSV.SticGlory.incipit	@ltx/en_us_dedes/me.m11.d21:meSV.SticGlory.incipit
ltx/en_us_public/me.m11.d21:meSV.SticGlory.melody	@ltx/en_us_dedes/me.m11.d21:meSV.SticGlory.melody
ltx/en_us_public/me.m11.d21:meSV.SticGlory.mode	@ltx/en_us_dedes/me.m11.d21:meSV.SticGlory.mode
ltx/en_us_public/me.m11.d21:meSV.SticGlory.text	@ltx/en_us_dedes/me.m11.d21:meSV.SticGlory.text
ltx/en_us_public/me.m11.d21:meSV.Stichera1.incipit	@ltx/en_us_dedes/me.m11.d21:meSV.Stichera1.incipit
ltx/en_us_public/me.m11.d21:meSV.Stichera1.melody	@ltx/en_us_dedes/me.m11.d21:meSV.Stichera1.melody
ltx/en_us_public/me.m11.d21:meSV.Stichera1.mode	@ltx/en_us_dedes/me.m11.d21:meSV.Stichera1.mode
ltx/en_us_public/me.m11.d21:meSV.Stichera1.text	@ltx/en_us_dedes/me.m11.d21:meSV.Stichera1.text
ltx/en_us_public/me.m11.d21:meSV.Stichera2.incipit	@ltx/en_us_dedes/me.m11.d21:meSV.Stichera2.incipit
ltx/en_us_public/me.m11.d21:meSV.Stichera2.melody	@ltx/en_us_dedes/me.m11.d21:meSV.Stichera2.melody
ltx/en_us_public/me.m11.d21:meSV.Stichera2.mode	@ltx/en_us_dedes/me.m11.d21:meSV.Stichera2.mode
ltx/en_us_public/me.m11.d21:meSV.Stichera2.text	@ltx/en_us_dedes/me.m11.d21:meSV.Stichera2.text
ltx/en_us_public/me.m11.d21:meSV.Stichera3.incipit	@ltx/en_us_dedes/me.m11.d21:meSV.Stichera3.incipit
ltx/en_us_public/me.m11.d21:meSV.Stichera3.melody	@ltx/en_us_dedes/me.m11.d21:meSV.Stichera3.melody
ltx/en_us_public/me.m11.d21:meSV.Stichera3.mode	@ltx/en_us_dedes/me.m11.d21:meSV.Stichera3.mode
ltx/en_us_public/me.m11.d21:meSV.Stichera3.text	@ltx/en_us_dedes/me.m11.d21:meSV.Stichera3.text
ltx/en_us_public/me.m11.d21:meVE.Apolytikion1.incipit	@ltx/en_us_dedes/me.m11.d21:meVE.Apolytikion1.incipit
ltx/en_us_public/me.m11.d21:meVE.Apolytikion1.melody	@ltx/en_us_dedes/me.m11.d21:meVE.Apolytikion1.melody
ltx/en_us_public/me.m11.d21:meVE.Apolytikion1.mode	@ltx/en_us_dedes/me.m11.d21:meVE.Apolytikion1.mode
ltx/en_us_public/me.m11.d21:meVE.Apolytikion1.text	@ltx/en_us_dedes/me.m11.d21:meVE.Apolytikion1.text
ltx/en_us_public/me.m11.d21:meVE.AposGlory.incipit	@ltx/en_us_dedes/me.m11.d21:meVE.AposGlory.incipit
ltx/en_us_public/me.m11.d21:meVE.AposGlory.melody	@ltx/en_us_dedes/me.m11.d21:meVE.AposGlory.melody
ltx/en_us_public/me.m11.d21:meVE.AposGlory.mode	@ltx/en_us_dedes/me.m11.d21:meVE.AposGlory.mode
ltx/en_us_public/me.m11.d21:meVE.AposGlory.poet	@ltx/en_us_dedes/me.m11.d21:meVE.AposGlory.poet
ltx/en_us_public/me.m11.d21:meVE.AposGlory.text	@ltx/en_us_dedes/me.m11.d21:meVE.AposGlory.text
ltx/en_us_public/me.m11.d21:meVE.Aposticha1.greekmelody	@ltx/en_us_dedes/me.m11.d21:meVE.Aposticha1.greekmelody
ltx/en_us_public/me.m11.d21:meVE.Aposticha1.incipit	@ltx/en_us_dedes/me.m11.d21:meVE.Aposticha1.incipit
ltx/en_us_public/me.m11.d21:meVE.Aposticha1.melody	@ltx/en_us_dedes/me.m11.d21:meVE.Aposticha1.melody
ltx/en_us_public/me.m11.d21:meVE.Aposticha1.mode	@ltx/en_us_dedes/me.m11.d21:meVE.Aposticha1.mode
ltx/en_us_public/me.m11.d21:meVE.Aposticha1.text	@ltx/en_us_dedes/me.m11.d21:meVE.Aposticha1.text
ltx/en_us_public/me.m11.d21:meVE.Aposticha2.incipit	@ltx/en_us_dedes/me.m11.d21:meVE.Aposticha2.incipit
ltx/en_us_public/me.m11.d21:meVE.Aposticha2.melody	@ltx/en_us_dedes/me.m11.d21:meVE.Aposticha2.melody
ltx/en_us_public/me.m11.d21:meVE.Aposticha2.mode	@ltx/en_us_dedes/me.m11.d21:meVE.Aposticha2.mode
ltx/en_us_public/me.m11.d21:meVE.Aposticha2.text	@ltx/en_us_dedes/me.m11.d21:meVE.Aposticha2.text
ltx/en_us_public/me.m11.d21:meVE.Aposticha3.incipit	@ltx/en_us_dedes/me.m11.d21:meVE.Aposticha3.incipit
ltx/en_us_public/me.m11.d21:meVE.Aposticha3.melody	@ltx/en_us_dedes/me.m11.d21:meVE.Aposticha3.melody
ltx/en_us_public/me.m11.d21:meVE.Aposticha3.mode	@ltx/en_us_dedes/me.m11.d21:meVE.Aposticha3.mode
ltx/en_us_public/me.m11.d21:meVE.Aposticha3.text	@ltx/en_us_dedes/me.m11.d21:meVE.Aposticha3.text
ltx/en_us_public/me.m11.d21:meVE.Lity1.incipit	@ltx/en_us_dedes/me.m11.d21:meVE.Lity1.incipit
ltx/en_us_public/me.m11.d21:meVE.Lity1.melody	@ltx/en_us_dedes/me.m11.d21:meVE.Lity1.melody
ltx/en_us_public/me.m11.d21:meVE.Lity1.mode	@ltx/en_us_dedes/me.m11.d21:meVE.Lity1.mode
ltx/en_us_public/me.m11.d21:meVE.Lity1.poet	@ltx/en_us_dedes/me.m11.d21:meVE.Lity1.poet
ltx/en_us_public/me.m11.d21:meVE.Lity1.text	@ltx/en_us_dedes/me.m11.d21:meVE.Lity1.text
ltx/en_us_public/me.m11.d21:meVE.Lity2.incipit	@ltx/en_us_dedes/me.m11.d21:meVE.Lity2.incipit
ltx/en_us_public/me.m11.d21:meVE.Lity2.melody	@ltx/en_us_dedes/me.m11.d21:meVE.Lity2.melody
ltx/en_us_public/me.m11.d21:meVE.Lity2.mode	@ltx/en_us_dedes/me.m11.d21:meVE.Lity2.mode
ltx/en_us_public/me.m11.d21:meVE.Lity2.poet	@ltx/en_us_dedes/me.m11.d21:meVE.Lity2.poet
ltx/en_us_public/me.m11.d21:meVE.Lity2.text	@ltx/en_us_dedes/me.m11.d21:meVE.Lity2.text
ltx/en_us_public/me.m11.d21:meVE.Lity3.incipit	@ltx/en_us_dedes/me.m11.d21:meVE.Lity3.incipit
ltx/en_us_public/me.m11.d21:meVE.Lity3.melody	@ltx/en_us_dedes/me.m11.d21:meVE.Lity3.melody
ltx/en_us_public/me.m11.d21:meVE.Lity3.mode	@ltx/en_us_dedes/me.m11.d21:meVE.Lity3.mode
ltx/en_us_public/me.m11.d21:meVE.Lity3.text	@ltx/en_us_dedes/me.m11.d21:meVE.Lity3.text
ltx/en_us_public/me.m11.d21:meVE.LityGlory.incipit	@ltx/en_us_dedes/me.m11.d21:meVE.LityGlory.incipit
ltx/en_us_public/me.m11.d21:meVE.LityGlory.melody	@ltx/en_us_dedes/me.m11.d21:meVE.LityGlory.melody
ltx/en_us_public/me.m11.d21:meVE.LityGlory.mode	@ltx/en_us_dedes/me.m11.d21:meVE.LityGlory.mode
ltx/en_us_public/me.m11.d21:meVE.LityGlory.poet	@ltx/en_us_dedes/me.m11.d21:meVE.LityGlory.poet
ltx/en_us_public/me.m11.d21:meVE.LityGlory.text	@ltx/en_us_dedes/me.m11.d21:meVE.LityGlory.text
ltx/en_us_public/me.m11.d21:meVE.MM.Stichera1123as78910.text	@ltx/en_us_dedes/me.m11.d21:meVE.MM.Stichera1123as78910.text
ltx/en_us_public/me.m11.d21:meVE.SticGlory.incipit	@ltx/en_us_dedes/me.m11.d21:meVE.SticGlory.incipit
ltx/en_us_public/me.m11.d21:meVE.SticGlory.melody	@ltx/en_us_dedes/me.m11.d21:meVE.SticGlory.melody
ltx/en_us_public/me.m11.d21:meVE.SticGlory.mode	@ltx/en_us_dedes/me.m11.d21:meVE.SticGlory.mode
ltx/en_us_public/me.m11.d21:meVE.SticGlory.text	@ltx/en_us_dedes/me.m11.d21:meVE.SticGlory.text
ltx/en_us_public/me.m11.d21:meVE.Stichera01.greekmelody	@ltx/en_us_dedes/me.m11.d21:meVE.Stichera01.greekmelody
ltx/en_us_public/me.m11.d21:meVE.Stichera01.incipit	@ltx/en_us_dedes/me.m11.d21:meVE.Stichera01.incipit
ltx/en_us_public/me.m11.d21:meVE.Stichera01.melody	@ltx/en_us_dedes/me.m11.d21:meVE.Stichera01.melody
ltx/en_us_public/me.m11.d21:meVE.Stichera01.mode	@ltx/en_us_dedes/me.m11.d21:meVE.Stichera01.mode
ltx/en_us_public/me.m11.d21:meVE.Stichera01.text	@ltx/en_us_dedes/me.m11.d21:meVE.Stichera01.text
ltx/en_us_public/me.m11.d21:meVE.Stichera02.incipit	@ltx/en_us_dedes/me.m11.d21:meVE.Stichera02.incipit
ltx/en_us_public/me.m11.d21:meVE.Stichera02.melody	@ltx/en_us_dedes/me.m11.d21:meVE.Stichera02.melody
ltx/en_us_public/me.m11.d21:meVE.Stichera02.mode	@ltx/en_us_dedes/me.m11.d21:meVE.Stichera02.mode
ltx/en_us_public/me.m11.d21:meVE.Stichera02.text	@ltx/en_us_dedes/me.m11.d21:meVE.Stichera02.text
ltx/en_us_public/me.m11.d21:meVE.Stichera03.incipit	@ltx/en_us_dedes/me.m11.d21:meVE.Stichera03.incipit
ltx/en_us_public/me.m11.d21:meVE.Stichera03.melody	@ltx/en_us_dedes/me.m11.d21:meVE.Stichera03.melody
ltx/en_us_public/me.m11.d21:meVE.Stichera03.mode	@ltx/en_us_dedes/me.m11.d21:meVE.Stichera03.mode
ltx/en_us_public/me.m11.d21:meVE.Stichera03.text	@ltx/en_us_dedes/me.m11.d21:meVE.Stichera03.text
ltx/en_us_public/me.m11.d21:meVE.Stichera04.greekmelody	@ltx/en_us_dedes/me.m11.d21:meVE.Stichera04.greekmelody
ltx/en_us_public/me.m11.d21:meVE.Stichera04.incipit	@ltx/en_us_dedes/me.m11.d21:meVE.Stichera04.incipit
ltx/en_us_public/me.m11.d21:meVE.Stichera04.melody	@ltx/en_us_dedes/me.m11.d21:meVE.Stichera04.melody
ltx/en_us_public/me.m11.d21:meVE.Stichera04.mode	@ltx/en_us_dedes/me.m11.d21:meVE.Stichera04.mode
ltx/en_us_public/me.m11.d21:meVE.Stichera04.text	@ltx/en_us_dedes/me.m11.d21:meVE.Stichera04.text
ltx/en_us_public/me.m11.d21:meVE.Stichera05.incipit	@ltx/en_us_dedes/me.m11.d21:meVE.Stichera05.incipit
ltx/en_us_public/me.m11.d21:meVE.Stichera05.melody	@ltx/en_us_dedes/me.m11.d21:meVE.Stichera05.melody
ltx/en_us_public/me.m11.d21:meVE.Stichera05.mode	@ltx/en_us_dedes/me.m11.d21:meVE.Stichera05.mode
ltx/en_us_public/me.m11.d21:meVE.Stichera05.text	@ltx/en_us_dedes/me.m11.d21:meVE.Stichera05.text
ltx/en_us_public/me.m11.d21:meVE.Stichera06.incipit	@ltx/en_us_dedes/me.m11.d21:meVE.Stichera06.incipit
ltx/en_us_public/me.m11.d21:meVE.Stichera06.melody	@ltx/en_us_dedes/me.m11.d21:meVE.Stichera06.melody
ltx/en_us_public/me.m11.d21:meVE.Stichera06.mode	@ltx/en_us_dedes/me.m11.d21:meVE.Stichera06.mode
ltx/en_us_public/me.m11.d21:meVE.Stichera06.text	@ltx/en_us_dedes/me.m11.d21:meVE.Stichera06.text
