ltx/en_us_public/me.m08.d14:meDA.commemoration.first	@ltx/en_us_dedes/me.m08.d14:meDA.commemoration.first
ltx/en_us_public/me.m08.d14:meDA.commemoration.first_name	@ltx/en_us_dedes/me.m08.d14:meDA.commemoration.first_name
ltx/en_us_public/me.m08.d14:meDA.commemoration.first_short	@ltx/en_us_dedes/me.m08.d14:meDA.commemoration.first_short
ltx/en_us_public/me.m08.d14:meDA.commemoration.first_title	@ltx/en_us_dedes/me.m08.d14:meDA.commemoration.first_title
ltx/en_us_public/me.m08.d14:meDA.commemoration.full	@ltx/en_us_dedes/me.m08.d14:meDA.commemoration.full
ltx/en_us_public/me.m08.d14:meDA.commemoration.second_name	@ltx/en_us_dedes/me.m08.d14:meDA.commemoration.second_name
ltx/en_us_public/me.m08.d14:meDA.commemoration.second_title	@ltx/en_us_dedes/me.m08.d14:meDA.commemoration.second_title
ltx/en_us_public/me.m08.d14:meDA.date	@ltx/en_us_dedes/me.m08.d14:meDA.date
ltx/en_us_public/me.m08.d14:meDA.insert1	@ltx/en_us_dedes/me.m08.d14:meDA.insert1
ltx/en_us_public/me.m08.d14:meDA.insert2	@ltx/en_us_dedes/me.m08.d14:meDA.insert2
ltx/en_us_public/me.m08.d14:meDA.note	@ltx/en_us_dedes/me.m08.d14:meDA.note
ltx/en_us_public/me.m08.d14:meHO.commemorations	@ltx/en_us_dedes/me.m08.d14:meHO.commemorations
ltx/en_us_public/me.m08.d14:meHO.note1	@ltx/en_us_dedes/me.m08.d14:meHO.note1
ltx/en_us_public/me.m08.d14:meHO.note2	@ltx/en_us_dedes/me.m08.d14:meHO.note2
ltx/en_us_public/me.m08.d14:meHO.number	@ltx/en_us_dedes/me.m08.d14:meHO.number
ltx/en_us_public/me.m08.d14:meHO.rank	@ltx/en_us_dedes/me.m08.d14:meHO.rank
ltx/en_us_public/me.m08.d14:meLE.commemoration1	@ltx/en_us_dedes/me.m08.d14:meLE.commemoration1
ltx/en_us_public/me.m08.d14:meLE.commemoration2	@ltx/en_us_dedes/me.m08.d14:meLE.commemoration2
ltx/en_us_public/me.m08.d14:meLI.Kontakion1.greekmelody	@ltx/en_us_dedes/me.m08.d14:meLI.Kontakion1.greekmelody
ltx/en_us_public/me.m08.d14:meLI.Kontakion1.incipit	@ltx/en_us_dedes/me.m08.d14:meLI.Kontakion1.incipit
ltx/en_us_public/me.m08.d14:meLI.Kontakion1.melody	@ltx/en_us_dedes/me.m08.d14:meLI.Kontakion1.melody
ltx/en_us_public/me.m08.d14:meLI.Kontakion1.mode	@ltx/en_us_dedes/me.m08.d14:meLI.Kontakion1.mode
ltx/en_us_public/me.m08.d14:meLI.Kontakion1.text	@ltx/en_us_dedes/me.m08.d14:meLI.Kontakion1.text
ltx/en_us_public/me.m08.d14:meLI.Megalynarion.text	@ltx/en_us_dedes/me.m08.d14:meLI.Megalynarion.text
ltx/en_us_public/me.m08.d14:meMA.AposGlory.incipit	@ltx/en_us_dedes/me.m08.d14:meMA.AposGlory.incipit
ltx/en_us_public/me.m08.d14:meMA.AposGlory.melody	@ltx/en_us_dedes/me.m08.d14:meMA.AposGlory.melody
ltx/en_us_public/me.m08.d14:meMA.AposGlory.mode	@ltx/en_us_dedes/me.m08.d14:meMA.AposGlory.mode
ltx/en_us_public/me.m08.d14:meMA.AposGlory.text	@ltx/en_us_dedes/me.m08.d14:meMA.AposGlory.text
ltx/en_us_public/me.m08.d14:meMA.Aposticha1.greekmelody	@ltx/en_us_dedes/me.m08.d14:meMA.Aposticha1.greekmelody
ltx/en_us_public/me.m08.d14:meMA.Aposticha1.incipit	@ltx/en_us_dedes/me.m08.d14:meMA.Aposticha1.incipit
ltx/en_us_public/me.m08.d14:meMA.Aposticha1.melody	@ltx/en_us_dedes/me.m08.d14:meMA.Aposticha1.melody
ltx/en_us_public/me.m08.d14:meMA.Aposticha1.mode	@ltx/en_us_dedes/me.m08.d14:meMA.Aposticha1.mode
ltx/en_us_public/me.m08.d14:meMA.Aposticha1.text	@ltx/en_us_dedes/me.m08.d14:meMA.Aposticha1.text
ltx/en_us_public/me.m08.d14:meMA.Aposticha2.incipit	@ltx/en_us_dedes/me.m08.d14:meMA.Aposticha2.incipit
ltx/en_us_public/me.m08.d14:meMA.Aposticha2.melody	@ltx/en_us_dedes/me.m08.d14:meMA.Aposticha2.melody
ltx/en_us_public/me.m08.d14:meMA.Aposticha2.mode	@ltx/en_us_dedes/me.m08.d14:meMA.Aposticha2.mode
ltx/en_us_public/me.m08.d14:meMA.Aposticha2.text	@ltx/en_us_dedes/me.m08.d14:meMA.Aposticha2.text
ltx/en_us_public/me.m08.d14:meMA.Aposticha3.incipit	@ltx/en_us_dedes/me.m08.d14:meMA.Aposticha3.incipit
ltx/en_us_public/me.m08.d14:meMA.Aposticha3.melody	@ltx/en_us_dedes/me.m08.d14:meMA.Aposticha3.melody
ltx/en_us_public/me.m08.d14:meMA.Aposticha3.mode	@ltx/en_us_dedes/me.m08.d14:meMA.Aposticha3.mode
ltx/en_us_public/me.m08.d14:meMA.Aposticha3.text	@ltx/en_us_dedes/me.m08.d14:meMA.Aposticha3.text
ltx/en_us_public/me.m08.d14:meMA.C1.acrostic.notice1	@ltx/en_us_dedes/me.m08.d14:meMA.C1.acrostic.notice1
ltx/en_us_public/me.m08.d14:meMA.C1.acrostic.text	@ltx/en_us_dedes/me.m08.d14:meMA.C1.acrostic.text
ltx/en_us_public/me.m08.d14:meMA.C1.acrostic.title	@ltx/en_us_dedes/me.m08.d14:meMA.C1.acrostic.title
ltx/en_us_public/me.m08.d14:meMA.C1.title	@ltx/en_us_dedes/me.m08.d14:meMA.C1.title
ltx/en_us_public/me.m08.d14:meMA.C1.verse	@ltx/en_us_dedes/me.m08.d14:meMA.C1.verse
ltx/en_us_public/me.m08.d14:meMA.C2.acrostic.notice1	@ltx/en_us_dedes/me.m08.d14:meMA.C2.acrostic.notice1
ltx/en_us_public/me.m08.d14:meMA.C2.acrostic.text	@ltx/en_us_dedes/me.m08.d14:meMA.C2.acrostic.text
ltx/en_us_public/me.m08.d14:meMA.C2.acrostic.title	@ltx/en_us_dedes/me.m08.d14:meMA.C2.acrostic.title
ltx/en_us_public/me.m08.d14:meMA.C2.title	@ltx/en_us_dedes/me.m08.d14:meMA.C2.title
ltx/en_us_public/me.m08.d14:meMA.C2.verse	@ltx/en_us_dedes/me.m08.d14:meMA.C2.verse
ltx/en_us_public/me.m08.d14:meMA.Exaposteilarion1.greekmelody	@ltx/en_us_dedes/me.m08.d14:meMA.Exaposteilarion1.greekmelody
ltx/en_us_public/me.m08.d14:meMA.Exaposteilarion1.incipit	@ltx/en_us_dedes/me.m08.d14:meMA.Exaposteilarion1.incipit
ltx/en_us_public/me.m08.d14:meMA.Exaposteilarion1.melody	@ltx/en_us_dedes/me.m08.d14:meMA.Exaposteilarion1.melody
ltx/en_us_public/me.m08.d14:meMA.Exaposteilarion1.mode	@ltx/en_us_dedes/me.m08.d14:meMA.Exaposteilarion1.mode
ltx/en_us_public/me.m08.d14:meMA.Exaposteilarion1.text	@ltx/en_us_dedes/me.m08.d14:meMA.Exaposteilarion1.text
ltx/en_us_public/me.m08.d14:meMA.Exaposteilarion2.greekmelody	@ltx/en_us_dedes/me.m08.d14:meMA.Exaposteilarion2.greekmelody
ltx/en_us_public/me.m08.d14:meMA.Exaposteilarion2.incipit	@ltx/en_us_dedes/me.m08.d14:meMA.Exaposteilarion2.incipit
ltx/en_us_public/me.m08.d14:meMA.Exaposteilarion2.melody	@ltx/en_us_dedes/me.m08.d14:meMA.Exaposteilarion2.melody
ltx/en_us_public/me.m08.d14:meMA.Exaposteilarion2.mode	@ltx/en_us_dedes/me.m08.d14:meMA.Exaposteilarion2.mode
ltx/en_us_public/me.m08.d14:meMA.Exaposteilarion2.text	@ltx/en_us_dedes/me.m08.d14:meMA.Exaposteilarion2.text
ltx/en_us_public/me.m08.d14:meMA.Kathisma11.greekmelody	@ltx/en_us_dedes/me.m08.d14:meMA.Kathisma11.greekmelody
ltx/en_us_public/me.m08.d14:meMA.Kathisma11.incipit	@ltx/en_us_dedes/me.m08.d14:meMA.Kathisma11.incipit
ltx/en_us_public/me.m08.d14:meMA.Kathisma11.melody	@ltx/en_us_dedes/me.m08.d14:meMA.Kathisma11.melody
ltx/en_us_public/me.m08.d14:meMA.Kathisma11.mode	@ltx/en_us_dedes/me.m08.d14:meMA.Kathisma11.mode
ltx/en_us_public/me.m08.d14:meMA.Kathisma11.text	@ltx/en_us_dedes/me.m08.d14:meMA.Kathisma11.text
ltx/en_us_public/me.m08.d14:meMA.Kathisma21.greekmelody	@ltx/en_us_dedes/me.m08.d14:meMA.Kathisma21.greekmelody
ltx/en_us_public/me.m08.d14:meMA.Kathisma21.incipit	@ltx/en_us_dedes/me.m08.d14:meMA.Kathisma21.incipit
ltx/en_us_public/me.m08.d14:meMA.Kathisma21.melody	@ltx/en_us_dedes/me.m08.d14:meMA.Kathisma21.melody
ltx/en_us_public/me.m08.d14:meMA.Kathisma21.mode	@ltx/en_us_dedes/me.m08.d14:meMA.Kathisma21.mode
ltx/en_us_public/me.m08.d14:meMA.Kathisma21.text	@ltx/en_us_dedes/me.m08.d14:meMA.Kathisma21.text
ltx/en_us_public/me.m08.d14:meMA.Kontakion1.greekmelody	@ltx/en_us_dedes/me.m08.d14:meMA.Kontakion1.greekmelody
ltx/en_us_public/me.m08.d14:meMA.Kontakion1.incipit	@ltx/en_us_dedes/me.m08.d14:meMA.Kontakion1.incipit
ltx/en_us_public/me.m08.d14:meMA.Kontakion1.melody	@ltx/en_us_dedes/me.m08.d14:meMA.Kontakion1.melody
ltx/en_us_public/me.m08.d14:meMA.Kontakion1.mode	@ltx/en_us_dedes/me.m08.d14:meMA.Kontakion1.mode
ltx/en_us_public/me.m08.d14:meMA.Kontakion1.text	@ltx/en_us_dedes/me.m08.d14:meMA.Kontakion1.text
ltx/en_us_public/me.m08.d14:meMA.MM.Apos1123as5678.text	@ltx/en_us_dedes/me.m08.d14:meMA.MM.Apos1123as5678.text
ltx/en_us_public/me.m08.d14:meMA.Ode1C11.greekmelody	@ltx/en_us_dedes/me.m08.d14:meMA.Ode1C11.greekmelody
ltx/en_us_public/me.m08.d14:meMA.Ode1C11.incipit	@ltx/en_us_dedes/me.m08.d14:meMA.Ode1C11.incipit
ltx/en_us_public/me.m08.d14:meMA.Ode1C11.melody	@ltx/en_us_dedes/me.m08.d14:meMA.Ode1C11.melody
ltx/en_us_public/me.m08.d14:meMA.Ode1C11.mode	@ltx/en_us_dedes/me.m08.d14:meMA.Ode1C11.mode
ltx/en_us_public/me.m08.d14:meMA.Ode1C11.ode	@ltx/en_us_dedes/me.m08.d14:meMA.Ode1C11.ode
ltx/en_us_public/me.m08.d14:meMA.Ode1C11.text	@ltx/en_us_dedes/me.m08.d14:meMA.Ode1C11.text
ltx/en_us_public/me.m08.d14:meMA.Ode1C12.incipit	@ltx/en_us_dedes/me.m08.d14:meMA.Ode1C12.incipit
ltx/en_us_public/me.m08.d14:meMA.Ode1C12.melody	@ltx/en_us_dedes/me.m08.d14:meMA.Ode1C12.melody
ltx/en_us_public/me.m08.d14:meMA.Ode1C12.mode	@ltx/en_us_dedes/me.m08.d14:meMA.Ode1C12.mode
ltx/en_us_public/me.m08.d14:meMA.Ode1C12.ode	@ltx/en_us_dedes/me.m08.d14:meMA.Ode1C12.ode
ltx/en_us_public/me.m08.d14:meMA.Ode1C12.text	@ltx/en_us_dedes/me.m08.d14:meMA.Ode1C12.text
ltx/en_us_public/me.m08.d14:meMA.Ode1C13.incipit	@ltx/en_us_dedes/me.m08.d14:meMA.Ode1C13.incipit
ltx/en_us_public/me.m08.d14:meMA.Ode1C13.melody	@ltx/en_us_dedes/me.m08.d14:meMA.Ode1C13.melody
ltx/en_us_public/me.m08.d14:meMA.Ode1C13.mode	@ltx/en_us_dedes/me.m08.d14:meMA.Ode1C13.mode
ltx/en_us_public/me.m08.d14:meMA.Ode1C13.ode	@ltx/en_us_dedes/me.m08.d14:meMA.Ode1C13.ode
ltx/en_us_public/me.m08.d14:meMA.Ode1C13.text	@ltx/en_us_dedes/me.m08.d14:meMA.Ode1C13.text
ltx/en_us_public/me.m08.d14:meMA.Ode1C14.incipit	@ltx/en_us_dedes/me.m08.d14:meMA.Ode1C14.incipit
ltx/en_us_public/me.m08.d14:meMA.Ode1C14.melody	@ltx/en_us_dedes/me.m08.d14:meMA.Ode1C14.melody
ltx/en_us_public/me.m08.d14:meMA.Ode1C14.mode	@ltx/en_us_dedes/me.m08.d14:meMA.Ode1C14.mode
ltx/en_us_public/me.m08.d14:meMA.Ode1C14.ode	@ltx/en_us_dedes/me.m08.d14:meMA.Ode1C14.ode
ltx/en_us_public/me.m08.d14:meMA.Ode1C14.text	@ltx/en_us_dedes/me.m08.d14:meMA.Ode1C14.text
ltx/en_us_public/me.m08.d14:meMA.Ode1C1H.greekmelody	@ltx/en_us_dedes/me.m08.d14:meMA.Ode1C1H.greekmelody
ltx/en_us_public/me.m08.d14:meMA.Ode1C1H.incipit	@ltx/en_us_dedes/me.m08.d14:meMA.Ode1C1H.incipit
ltx/en_us_public/me.m08.d14:meMA.Ode1C1H.melody	@ltx/en_us_dedes/me.m08.d14:meMA.Ode1C1H.melody
ltx/en_us_public/me.m08.d14:meMA.Ode1C1H.mode	@ltx/en_us_dedes/me.m08.d14:meMA.Ode1C1H.mode
ltx/en_us_public/me.m08.d14:meMA.Ode1C1H.ode	@ltx/en_us_dedes/me.m08.d14:meMA.Ode1C1H.ode
ltx/en_us_public/me.m08.d14:meMA.Ode1C1H.text	@ltx/en_us_dedes/me.m08.d14:meMA.Ode1C1H.text
ltx/en_us_public/me.m08.d14:meMA.Ode1C21.greekmelody	@ltx/en_us_dedes/me.m08.d14:meMA.Ode1C21.greekmelody
ltx/en_us_public/me.m08.d14:meMA.Ode1C21.incipit	@ltx/en_us_dedes/me.m08.d14:meMA.Ode1C21.incipit
ltx/en_us_public/me.m08.d14:meMA.Ode1C21.melody	@ltx/en_us_dedes/me.m08.d14:meMA.Ode1C21.melody
ltx/en_us_public/me.m08.d14:meMA.Ode1C21.mode	@ltx/en_us_dedes/me.m08.d14:meMA.Ode1C21.mode
ltx/en_us_public/me.m08.d14:meMA.Ode1C21.ode	@ltx/en_us_dedes/me.m08.d14:meMA.Ode1C21.ode
ltx/en_us_public/me.m08.d14:meMA.Ode1C21.text	@ltx/en_us_dedes/me.m08.d14:meMA.Ode1C21.text
ltx/en_us_public/me.m08.d14:meMA.Ode1C22.incipit	@ltx/en_us_dedes/me.m08.d14:meMA.Ode1C22.incipit
ltx/en_us_public/me.m08.d14:meMA.Ode1C22.melody	@ltx/en_us_dedes/me.m08.d14:meMA.Ode1C22.melody
ltx/en_us_public/me.m08.d14:meMA.Ode1C22.mode	@ltx/en_us_dedes/me.m08.d14:meMA.Ode1C22.mode
ltx/en_us_public/me.m08.d14:meMA.Ode1C22.ode	@ltx/en_us_dedes/me.m08.d14:meMA.Ode1C22.ode
ltx/en_us_public/me.m08.d14:meMA.Ode1C22.text	@ltx/en_us_dedes/me.m08.d14:meMA.Ode1C22.text
ltx/en_us_public/me.m08.d14:meMA.Ode1C23.incipit	@ltx/en_us_dedes/me.m08.d14:meMA.Ode1C23.incipit
ltx/en_us_public/me.m08.d14:meMA.Ode1C23.melody	@ltx/en_us_dedes/me.m08.d14:meMA.Ode1C23.melody
ltx/en_us_public/me.m08.d14:meMA.Ode1C23.mode	@ltx/en_us_dedes/me.m08.d14:meMA.Ode1C23.mode
ltx/en_us_public/me.m08.d14:meMA.Ode1C23.ode	@ltx/en_us_dedes/me.m08.d14:meMA.Ode1C23.ode
ltx/en_us_public/me.m08.d14:meMA.Ode1C23.text	@ltx/en_us_dedes/me.m08.d14:meMA.Ode1C23.text
ltx/en_us_public/me.m08.d14:meMA.Ode1C2T.incipit	@ltx/en_us_dedes/me.m08.d14:meMA.Ode1C2T.incipit
ltx/en_us_public/me.m08.d14:meMA.Ode1C2T.melody	@ltx/en_us_dedes/me.m08.d14:meMA.Ode1C2T.melody
ltx/en_us_public/me.m08.d14:meMA.Ode1C2T.mode	@ltx/en_us_dedes/me.m08.d14:meMA.Ode1C2T.mode
ltx/en_us_public/me.m08.d14:meMA.Ode1C2T.ode	@ltx/en_us_dedes/me.m08.d14:meMA.Ode1C2T.ode
ltx/en_us_public/me.m08.d14:meMA.Ode1C2T.text	@ltx/en_us_dedes/me.m08.d14:meMA.Ode1C2T.text
ltx/en_us_public/me.m08.d14:meMA.Ode3C11.greekmelody	@ltx/en_us_dedes/me.m08.d14:meMA.Ode3C11.greekmelody
ltx/en_us_public/me.m08.d14:meMA.Ode3C11.incipit	@ltx/en_us_dedes/me.m08.d14:meMA.Ode3C11.incipit
ltx/en_us_public/me.m08.d14:meMA.Ode3C11.melody	@ltx/en_us_dedes/me.m08.d14:meMA.Ode3C11.melody
ltx/en_us_public/me.m08.d14:meMA.Ode3C11.mode	@ltx/en_us_dedes/me.m08.d14:meMA.Ode3C11.mode
ltx/en_us_public/me.m08.d14:meMA.Ode3C11.ode	@ltx/en_us_dedes/me.m08.d14:meMA.Ode3C11.ode
ltx/en_us_public/me.m08.d14:meMA.Ode3C11.text	@ltx/en_us_dedes/me.m08.d14:meMA.Ode3C11.text
ltx/en_us_public/me.m08.d14:meMA.Ode3C12.incipit	@ltx/en_us_dedes/me.m08.d14:meMA.Ode3C12.incipit
ltx/en_us_public/me.m08.d14:meMA.Ode3C12.melody	@ltx/en_us_dedes/me.m08.d14:meMA.Ode3C12.melody
ltx/en_us_public/me.m08.d14:meMA.Ode3C12.mode	@ltx/en_us_dedes/me.m08.d14:meMA.Ode3C12.mode
ltx/en_us_public/me.m08.d14:meMA.Ode3C12.ode	@ltx/en_us_dedes/me.m08.d14:meMA.Ode3C12.ode
ltx/en_us_public/me.m08.d14:meMA.Ode3C12.text	@ltx/en_us_dedes/me.m08.d14:meMA.Ode3C12.text
ltx/en_us_public/me.m08.d14:meMA.Ode3C13.incipit	@ltx/en_us_dedes/me.m08.d14:meMA.Ode3C13.incipit
ltx/en_us_public/me.m08.d14:meMA.Ode3C13.melody	@ltx/en_us_dedes/me.m08.d14:meMA.Ode3C13.melody
ltx/en_us_public/me.m08.d14:meMA.Ode3C13.mode	@ltx/en_us_dedes/me.m08.d14:meMA.Ode3C13.mode
ltx/en_us_public/me.m08.d14:meMA.Ode3C13.ode	@ltx/en_us_dedes/me.m08.d14:meMA.Ode3C13.ode
ltx/en_us_public/me.m08.d14:meMA.Ode3C13.text	@ltx/en_us_dedes/me.m08.d14:meMA.Ode3C13.text
ltx/en_us_public/me.m08.d14:meMA.Ode3C14.incipit	@ltx/en_us_dedes/me.m08.d14:meMA.Ode3C14.incipit
ltx/en_us_public/me.m08.d14:meMA.Ode3C14.melody	@ltx/en_us_dedes/me.m08.d14:meMA.Ode3C14.melody
ltx/en_us_public/me.m08.d14:meMA.Ode3C14.mode	@ltx/en_us_dedes/me.m08.d14:meMA.Ode3C14.mode
ltx/en_us_public/me.m08.d14:meMA.Ode3C14.ode	@ltx/en_us_dedes/me.m08.d14:meMA.Ode3C14.ode
ltx/en_us_public/me.m08.d14:meMA.Ode3C14.text	@ltx/en_us_dedes/me.m08.d14:meMA.Ode3C14.text
ltx/en_us_public/me.m08.d14:meMA.Ode3C1H.greekmelody	@ltx/en_us_dedes/me.m08.d14:meMA.Ode3C1H.greekmelody
ltx/en_us_public/me.m08.d14:meMA.Ode3C1H.incipit	@ltx/en_us_dedes/me.m08.d14:meMA.Ode3C1H.incipit
ltx/en_us_public/me.m08.d14:meMA.Ode3C1H.melody	@ltx/en_us_dedes/me.m08.d14:meMA.Ode3C1H.melody
ltx/en_us_public/me.m08.d14:meMA.Ode3C1H.mode	@ltx/en_us_dedes/me.m08.d14:meMA.Ode3C1H.mode
ltx/en_us_public/me.m08.d14:meMA.Ode3C1H.ode	@ltx/en_us_dedes/me.m08.d14:meMA.Ode3C1H.ode
ltx/en_us_public/me.m08.d14:meMA.Ode3C1H.text	@ltx/en_us_dedes/me.m08.d14:meMA.Ode3C1H.text
ltx/en_us_public/me.m08.d14:meMA.Ode3C21.greekmelody	@ltx/en_us_dedes/me.m08.d14:meMA.Ode3C21.greekmelody
ltx/en_us_public/me.m08.d14:meMA.Ode3C21.incipit	@ltx/en_us_dedes/me.m08.d14:meMA.Ode3C21.incipit
ltx/en_us_public/me.m08.d14:meMA.Ode3C21.melody	@ltx/en_us_dedes/me.m08.d14:meMA.Ode3C21.melody
ltx/en_us_public/me.m08.d14:meMA.Ode3C21.mode	@ltx/en_us_dedes/me.m08.d14:meMA.Ode3C21.mode
ltx/en_us_public/me.m08.d14:meMA.Ode3C21.ode	@ltx/en_us_dedes/me.m08.d14:meMA.Ode3C21.ode
ltx/en_us_public/me.m08.d14:meMA.Ode3C21.text	@ltx/en_us_dedes/me.m08.d14:meMA.Ode3C21.text
ltx/en_us_public/me.m08.d14:meMA.Ode3C22.incipit	@ltx/en_us_dedes/me.m08.d14:meMA.Ode3C22.incipit
ltx/en_us_public/me.m08.d14:meMA.Ode3C22.melody	@ltx/en_us_dedes/me.m08.d14:meMA.Ode3C22.melody
ltx/en_us_public/me.m08.d14:meMA.Ode3C22.mode	@ltx/en_us_dedes/me.m08.d14:meMA.Ode3C22.mode
ltx/en_us_public/me.m08.d14:meMA.Ode3C22.ode	@ltx/en_us_dedes/me.m08.d14:meMA.Ode3C22.ode
ltx/en_us_public/me.m08.d14:meMA.Ode3C22.text	@ltx/en_us_dedes/me.m08.d14:meMA.Ode3C22.text
ltx/en_us_public/me.m08.d14:meMA.Ode3C23.incipit	@ltx/en_us_dedes/me.m08.d14:meMA.Ode3C23.incipit
ltx/en_us_public/me.m08.d14:meMA.Ode3C23.melody	@ltx/en_us_dedes/me.m08.d14:meMA.Ode3C23.melody
ltx/en_us_public/me.m08.d14:meMA.Ode3C23.mode	@ltx/en_us_dedes/me.m08.d14:meMA.Ode3C23.mode
ltx/en_us_public/me.m08.d14:meMA.Ode3C23.ode	@ltx/en_us_dedes/me.m08.d14:meMA.Ode3C23.ode
ltx/en_us_public/me.m08.d14:meMA.Ode3C23.text	@ltx/en_us_dedes/me.m08.d14:meMA.Ode3C23.text
ltx/en_us_public/me.m08.d14:meMA.Ode3C2T.incipit	@ltx/en_us_dedes/me.m08.d14:meMA.Ode3C2T.incipit
ltx/en_us_public/me.m08.d14:meMA.Ode3C2T.melody	@ltx/en_us_dedes/me.m08.d14:meMA.Ode3C2T.melody
ltx/en_us_public/me.m08.d14:meMA.Ode3C2T.mode	@ltx/en_us_dedes/me.m08.d14:meMA.Ode3C2T.mode
ltx/en_us_public/me.m08.d14:meMA.Ode3C2T.ode	@ltx/en_us_dedes/me.m08.d14:meMA.Ode3C2T.ode
ltx/en_us_public/me.m08.d14:meMA.Ode3C2T.text	@ltx/en_us_dedes/me.m08.d14:meMA.Ode3C2T.text
ltx/en_us_public/me.m08.d14:meMA.Ode3H.greekmelody	@ltx/en_us_dedes/me.m08.d14:meMA.Ode3H.greekmelody
ltx/en_us_public/me.m08.d14:meMA.Ode3H.incipit	@ltx/en_us_dedes/me.m08.d14:meMA.Ode3H.incipit
ltx/en_us_public/me.m08.d14:meMA.Ode3H.melody	@ltx/en_us_dedes/me.m08.d14:meMA.Ode3H.melody
ltx/en_us_public/me.m08.d14:meMA.Ode3H.mode	@ltx/en_us_dedes/me.m08.d14:meMA.Ode3H.mode
ltx/en_us_public/me.m08.d14:meMA.Ode3H.ode	@ltx/en_us_dedes/me.m08.d14:meMA.Ode3H.ode
ltx/en_us_public/me.m08.d14:meMA.Ode3H.text	@ltx/en_us_dedes/me.m08.d14:meMA.Ode3H.text
ltx/en_us_public/me.m08.d14:meMA.Ode3Kathisma1.greekmelody	@ltx/en_us_dedes/me.m08.d14:meMA.Ode3Kathisma1.greekmelody
ltx/en_us_public/me.m08.d14:meMA.Ode3Kathisma1.incipit	@ltx/en_us_dedes/me.m08.d14:meMA.Ode3Kathisma1.incipit
ltx/en_us_public/me.m08.d14:meMA.Ode3Kathisma1.melody	@ltx/en_us_dedes/me.m08.d14:meMA.Ode3Kathisma1.melody
ltx/en_us_public/me.m08.d14:meMA.Ode3Kathisma1.mode	@ltx/en_us_dedes/me.m08.d14:meMA.Ode3Kathisma1.mode
ltx/en_us_public/me.m08.d14:meMA.Ode3Kathisma1.text	@ltx/en_us_dedes/me.m08.d14:meMA.Ode3Kathisma1.text
ltx/en_us_public/me.m08.d14:meMA.Ode3Kathisma2.greekmelody	@ltx/en_us_dedes/me.m08.d14:meMA.Ode3Kathisma2.greekmelody
ltx/en_us_public/me.m08.d14:meMA.Ode3Kathisma2.incipit	@ltx/en_us_dedes/me.m08.d14:meMA.Ode3Kathisma2.incipit
ltx/en_us_public/me.m08.d14:meMA.Ode3Kathisma2.melody	@ltx/en_us_dedes/me.m08.d14:meMA.Ode3Kathisma2.melody
ltx/en_us_public/me.m08.d14:meMA.Ode3Kathisma2.mode	@ltx/en_us_dedes/me.m08.d14:meMA.Ode3Kathisma2.mode
ltx/en_us_public/me.m08.d14:meMA.Ode3Kathisma2.text	@ltx/en_us_dedes/me.m08.d14:meMA.Ode3Kathisma2.text
ltx/en_us_public/me.m08.d14:meMA.Ode4C11.greekmelody	@ltx/en_us_dedes/me.m08.d14:meMA.Ode4C11.greekmelody
ltx/en_us_public/me.m08.d14:meMA.Ode4C11.incipit	@ltx/en_us_dedes/me.m08.d14:meMA.Ode4C11.incipit
ltx/en_us_public/me.m08.d14:meMA.Ode4C11.melody	@ltx/en_us_dedes/me.m08.d14:meMA.Ode4C11.melody
ltx/en_us_public/me.m08.d14:meMA.Ode4C11.mode	@ltx/en_us_dedes/me.m08.d14:meMA.Ode4C11.mode
ltx/en_us_public/me.m08.d14:meMA.Ode4C11.ode	@ltx/en_us_dedes/me.m08.d14:meMA.Ode4C11.ode
ltx/en_us_public/me.m08.d14:meMA.Ode4C11.text	@ltx/en_us_dedes/me.m08.d14:meMA.Ode4C11.text
ltx/en_us_public/me.m08.d14:meMA.Ode4C12.incipit	@ltx/en_us_dedes/me.m08.d14:meMA.Ode4C12.incipit
ltx/en_us_public/me.m08.d14:meMA.Ode4C12.melody	@ltx/en_us_dedes/me.m08.d14:meMA.Ode4C12.melody
ltx/en_us_public/me.m08.d14:meMA.Ode4C12.mode	@ltx/en_us_dedes/me.m08.d14:meMA.Ode4C12.mode
ltx/en_us_public/me.m08.d14:meMA.Ode4C12.ode	@ltx/en_us_dedes/me.m08.d14:meMA.Ode4C12.ode
ltx/en_us_public/me.m08.d14:meMA.Ode4C12.text	@ltx/en_us_dedes/me.m08.d14:meMA.Ode4C12.text
ltx/en_us_public/me.m08.d14:meMA.Ode4C13.incipit	@ltx/en_us_dedes/me.m08.d14:meMA.Ode4C13.incipit
ltx/en_us_public/me.m08.d14:meMA.Ode4C13.melody	@ltx/en_us_dedes/me.m08.d14:meMA.Ode4C13.melody
ltx/en_us_public/me.m08.d14:meMA.Ode4C13.mode	@ltx/en_us_dedes/me.m08.d14:meMA.Ode4C13.mode
ltx/en_us_public/me.m08.d14:meMA.Ode4C13.ode	@ltx/en_us_dedes/me.m08.d14:meMA.Ode4C13.ode
ltx/en_us_public/me.m08.d14:meMA.Ode4C13.text	@ltx/en_us_dedes/me.m08.d14:meMA.Ode4C13.text
ltx/en_us_public/me.m08.d14:meMA.Ode4C14.incipit	@ltx/en_us_dedes/me.m08.d14:meMA.Ode4C14.incipit
ltx/en_us_public/me.m08.d14:meMA.Ode4C14.melody	@ltx/en_us_dedes/me.m08.d14:meMA.Ode4C14.melody
ltx/en_us_public/me.m08.d14:meMA.Ode4C14.mode	@ltx/en_us_dedes/me.m08.d14:meMA.Ode4C14.mode
ltx/en_us_public/me.m08.d14:meMA.Ode4C14.ode	@ltx/en_us_dedes/me.m08.d14:meMA.Ode4C14.ode
ltx/en_us_public/me.m08.d14:meMA.Ode4C14.text	@ltx/en_us_dedes/me.m08.d14:meMA.Ode4C14.text
ltx/en_us_public/me.m08.d14:meMA.Ode4C1H.greekmelody	@ltx/en_us_dedes/me.m08.d14:meMA.Ode4C1H.greekmelody
ltx/en_us_public/me.m08.d14:meMA.Ode4C1H.incipit	@ltx/en_us_dedes/me.m08.d14:meMA.Ode4C1H.incipit
ltx/en_us_public/me.m08.d14:meMA.Ode4C1H.melody	@ltx/en_us_dedes/me.m08.d14:meMA.Ode4C1H.melody
ltx/en_us_public/me.m08.d14:meMA.Ode4C1H.mode	@ltx/en_us_dedes/me.m08.d14:meMA.Ode4C1H.mode
ltx/en_us_public/me.m08.d14:meMA.Ode4C1H.ode	@ltx/en_us_dedes/me.m08.d14:meMA.Ode4C1H.ode
ltx/en_us_public/me.m08.d14:meMA.Ode4C1H.text	@ltx/en_us_dedes/me.m08.d14:meMA.Ode4C1H.text
ltx/en_us_public/me.m08.d14:meMA.Ode4C21.greekmelody	@ltx/en_us_dedes/me.m08.d14:meMA.Ode4C21.greekmelody
ltx/en_us_public/me.m08.d14:meMA.Ode4C21.incipit	@ltx/en_us_dedes/me.m08.d14:meMA.Ode4C21.incipit
ltx/en_us_public/me.m08.d14:meMA.Ode4C21.melody	@ltx/en_us_dedes/me.m08.d14:meMA.Ode4C21.melody
ltx/en_us_public/me.m08.d14:meMA.Ode4C21.mode	@ltx/en_us_dedes/me.m08.d14:meMA.Ode4C21.mode
ltx/en_us_public/me.m08.d14:meMA.Ode4C21.ode	@ltx/en_us_dedes/me.m08.d14:meMA.Ode4C21.ode
ltx/en_us_public/me.m08.d14:meMA.Ode4C21.text	@ltx/en_us_dedes/me.m08.d14:meMA.Ode4C21.text
ltx/en_us_public/me.m08.d14:meMA.Ode4C22.incipit	@ltx/en_us_dedes/me.m08.d14:meMA.Ode4C22.incipit
ltx/en_us_public/me.m08.d14:meMA.Ode4C22.melody	@ltx/en_us_dedes/me.m08.d14:meMA.Ode4C22.melody
ltx/en_us_public/me.m08.d14:meMA.Ode4C22.mode	@ltx/en_us_dedes/me.m08.d14:meMA.Ode4C22.mode
ltx/en_us_public/me.m08.d14:meMA.Ode4C22.ode	@ltx/en_us_dedes/me.m08.d14:meMA.Ode4C22.ode
ltx/en_us_public/me.m08.d14:meMA.Ode4C22.text	@ltx/en_us_dedes/me.m08.d14:meMA.Ode4C22.text
ltx/en_us_public/me.m08.d14:meMA.Ode4C23.incipit	@ltx/en_us_dedes/me.m08.d14:meMA.Ode4C23.incipit
ltx/en_us_public/me.m08.d14:meMA.Ode4C23.melody	@ltx/en_us_dedes/me.m08.d14:meMA.Ode4C23.melody
ltx/en_us_public/me.m08.d14:meMA.Ode4C23.mode	@ltx/en_us_dedes/me.m08.d14:meMA.Ode4C23.mode
ltx/en_us_public/me.m08.d14:meMA.Ode4C23.ode	@ltx/en_us_dedes/me.m08.d14:meMA.Ode4C23.ode
ltx/en_us_public/me.m08.d14:meMA.Ode4C23.text	@ltx/en_us_dedes/me.m08.d14:meMA.Ode4C23.text
ltx/en_us_public/me.m08.d14:meMA.Ode4C2T.incipit	@ltx/en_us_dedes/me.m08.d14:meMA.Ode4C2T.incipit
ltx/en_us_public/me.m08.d14:meMA.Ode4C2T.melody	@ltx/en_us_dedes/me.m08.d14:meMA.Ode4C2T.melody
ltx/en_us_public/me.m08.d14:meMA.Ode4C2T.mode	@ltx/en_us_dedes/me.m08.d14:meMA.Ode4C2T.mode
ltx/en_us_public/me.m08.d14:meMA.Ode4C2T.ode	@ltx/en_us_dedes/me.m08.d14:meMA.Ode4C2T.ode
ltx/en_us_public/me.m08.d14:meMA.Ode4C2T.text	@ltx/en_us_dedes/me.m08.d14:meMA.Ode4C2T.text
ltx/en_us_public/me.m08.d14:meMA.Ode5C11.greekmelody	@ltx/en_us_dedes/me.m08.d14:meMA.Ode5C11.greekmelody
ltx/en_us_public/me.m08.d14:meMA.Ode5C11.incipit	@ltx/en_us_dedes/me.m08.d14:meMA.Ode5C11.incipit
ltx/en_us_public/me.m08.d14:meMA.Ode5C11.melody	@ltx/en_us_dedes/me.m08.d14:meMA.Ode5C11.melody
ltx/en_us_public/me.m08.d14:meMA.Ode5C11.mode	@ltx/en_us_dedes/me.m08.d14:meMA.Ode5C11.mode
ltx/en_us_public/me.m08.d14:meMA.Ode5C11.ode	@ltx/en_us_dedes/me.m08.d14:meMA.Ode5C11.ode
ltx/en_us_public/me.m08.d14:meMA.Ode5C11.text	@ltx/en_us_dedes/me.m08.d14:meMA.Ode5C11.text
ltx/en_us_public/me.m08.d14:meMA.Ode5C12.incipit	@ltx/en_us_dedes/me.m08.d14:meMA.Ode5C12.incipit
ltx/en_us_public/me.m08.d14:meMA.Ode5C12.melody	@ltx/en_us_dedes/me.m08.d14:meMA.Ode5C12.melody
ltx/en_us_public/me.m08.d14:meMA.Ode5C12.mode	@ltx/en_us_dedes/me.m08.d14:meMA.Ode5C12.mode
ltx/en_us_public/me.m08.d14:meMA.Ode5C12.ode	@ltx/en_us_dedes/me.m08.d14:meMA.Ode5C12.ode
ltx/en_us_public/me.m08.d14:meMA.Ode5C12.text	@ltx/en_us_dedes/me.m08.d14:meMA.Ode5C12.text
ltx/en_us_public/me.m08.d14:meMA.Ode5C13.incipit	@ltx/en_us_dedes/me.m08.d14:meMA.Ode5C13.incipit
ltx/en_us_public/me.m08.d14:meMA.Ode5C13.melody	@ltx/en_us_dedes/me.m08.d14:meMA.Ode5C13.melody
ltx/en_us_public/me.m08.d14:meMA.Ode5C13.mode	@ltx/en_us_dedes/me.m08.d14:meMA.Ode5C13.mode
ltx/en_us_public/me.m08.d14:meMA.Ode5C13.ode	@ltx/en_us_dedes/me.m08.d14:meMA.Ode5C13.ode
ltx/en_us_public/me.m08.d14:meMA.Ode5C13.text	@ltx/en_us_dedes/me.m08.d14:meMA.Ode5C13.text
ltx/en_us_public/me.m08.d14:meMA.Ode5C14.incipit	@ltx/en_us_dedes/me.m08.d14:meMA.Ode5C14.incipit
ltx/en_us_public/me.m08.d14:meMA.Ode5C14.melody	@ltx/en_us_dedes/me.m08.d14:meMA.Ode5C14.melody
ltx/en_us_public/me.m08.d14:meMA.Ode5C14.mode	@ltx/en_us_dedes/me.m08.d14:meMA.Ode5C14.mode
ltx/en_us_public/me.m08.d14:meMA.Ode5C14.ode	@ltx/en_us_dedes/me.m08.d14:meMA.Ode5C14.ode
ltx/en_us_public/me.m08.d14:meMA.Ode5C14.text	@ltx/en_us_dedes/me.m08.d14:meMA.Ode5C14.text
ltx/en_us_public/me.m08.d14:meMA.Ode5C1H.greekmelody	@ltx/en_us_dedes/me.m08.d14:meMA.Ode5C1H.greekmelody
ltx/en_us_public/me.m08.d14:meMA.Ode5C1H.incipit	@ltx/en_us_dedes/me.m08.d14:meMA.Ode5C1H.incipit
ltx/en_us_public/me.m08.d14:meMA.Ode5C1H.melody	@ltx/en_us_dedes/me.m08.d14:meMA.Ode5C1H.melody
ltx/en_us_public/me.m08.d14:meMA.Ode5C1H.mode	@ltx/en_us_dedes/me.m08.d14:meMA.Ode5C1H.mode
ltx/en_us_public/me.m08.d14:meMA.Ode5C1H.ode	@ltx/en_us_dedes/me.m08.d14:meMA.Ode5C1H.ode
ltx/en_us_public/me.m08.d14:meMA.Ode5C1H.text	@ltx/en_us_dedes/me.m08.d14:meMA.Ode5C1H.text
ltx/en_us_public/me.m08.d14:meMA.Ode5C21.greekmelody	@ltx/en_us_dedes/me.m08.d14:meMA.Ode5C21.greekmelody
ltx/en_us_public/me.m08.d14:meMA.Ode5C21.incipit	@ltx/en_us_dedes/me.m08.d14:meMA.Ode5C21.incipit
ltx/en_us_public/me.m08.d14:meMA.Ode5C21.melody	@ltx/en_us_dedes/me.m08.d14:meMA.Ode5C21.melody
ltx/en_us_public/me.m08.d14:meMA.Ode5C21.mode	@ltx/en_us_dedes/me.m08.d14:meMA.Ode5C21.mode
ltx/en_us_public/me.m08.d14:meMA.Ode5C21.ode	@ltx/en_us_dedes/me.m08.d14:meMA.Ode5C21.ode
ltx/en_us_public/me.m08.d14:meMA.Ode5C21.text	@ltx/en_us_dedes/me.m08.d14:meMA.Ode5C21.text
ltx/en_us_public/me.m08.d14:meMA.Ode5C22.incipit	@ltx/en_us_dedes/me.m08.d14:meMA.Ode5C22.incipit
ltx/en_us_public/me.m08.d14:meMA.Ode5C22.melody	@ltx/en_us_dedes/me.m08.d14:meMA.Ode5C22.melody
ltx/en_us_public/me.m08.d14:meMA.Ode5C22.mode	@ltx/en_us_dedes/me.m08.d14:meMA.Ode5C22.mode
ltx/en_us_public/me.m08.d14:meMA.Ode5C22.ode	@ltx/en_us_dedes/me.m08.d14:meMA.Ode5C22.ode
ltx/en_us_public/me.m08.d14:meMA.Ode5C22.text	@ltx/en_us_dedes/me.m08.d14:meMA.Ode5C22.text
ltx/en_us_public/me.m08.d14:meMA.Ode5C23.incipit	@ltx/en_us_dedes/me.m08.d14:meMA.Ode5C23.incipit
ltx/en_us_public/me.m08.d14:meMA.Ode5C23.melody	@ltx/en_us_dedes/me.m08.d14:meMA.Ode5C23.melody
ltx/en_us_public/me.m08.d14:meMA.Ode5C23.mode	@ltx/en_us_dedes/me.m08.d14:meMA.Ode5C23.mode
ltx/en_us_public/me.m08.d14:meMA.Ode5C23.ode	@ltx/en_us_dedes/me.m08.d14:meMA.Ode5C23.ode
ltx/en_us_public/me.m08.d14:meMA.Ode5C23.text	@ltx/en_us_dedes/me.m08.d14:meMA.Ode5C23.text
ltx/en_us_public/me.m08.d14:meMA.Ode5C2T.incipit	@ltx/en_us_dedes/me.m08.d14:meMA.Ode5C2T.incipit
ltx/en_us_public/me.m08.d14:meMA.Ode5C2T.melody	@ltx/en_us_dedes/me.m08.d14:meMA.Ode5C2T.melody
ltx/en_us_public/me.m08.d14:meMA.Ode5C2T.mode	@ltx/en_us_dedes/me.m08.d14:meMA.Ode5C2T.mode
ltx/en_us_public/me.m08.d14:meMA.Ode5C2T.ode	@ltx/en_us_dedes/me.m08.d14:meMA.Ode5C2T.ode
ltx/en_us_public/me.m08.d14:meMA.Ode5C2T.text	@ltx/en_us_dedes/me.m08.d14:meMA.Ode5C2T.text
ltx/en_us_public/me.m08.d14:meMA.Ode6C11.greekmelody	@ltx/en_us_dedes/me.m08.d14:meMA.Ode6C11.greekmelody
ltx/en_us_public/me.m08.d14:meMA.Ode6C11.incipit	@ltx/en_us_dedes/me.m08.d14:meMA.Ode6C11.incipit
ltx/en_us_public/me.m08.d14:meMA.Ode6C11.melody	@ltx/en_us_dedes/me.m08.d14:meMA.Ode6C11.melody
ltx/en_us_public/me.m08.d14:meMA.Ode6C11.mode	@ltx/en_us_dedes/me.m08.d14:meMA.Ode6C11.mode
ltx/en_us_public/me.m08.d14:meMA.Ode6C11.ode	@ltx/en_us_dedes/me.m08.d14:meMA.Ode6C11.ode
ltx/en_us_public/me.m08.d14:meMA.Ode6C11.text	@ltx/en_us_dedes/me.m08.d14:meMA.Ode6C11.text
ltx/en_us_public/me.m08.d14:meMA.Ode6C12.incipit	@ltx/en_us_dedes/me.m08.d14:meMA.Ode6C12.incipit
ltx/en_us_public/me.m08.d14:meMA.Ode6C12.melody	@ltx/en_us_dedes/me.m08.d14:meMA.Ode6C12.melody
ltx/en_us_public/me.m08.d14:meMA.Ode6C12.mode	@ltx/en_us_dedes/me.m08.d14:meMA.Ode6C12.mode
ltx/en_us_public/me.m08.d14:meMA.Ode6C12.ode	@ltx/en_us_dedes/me.m08.d14:meMA.Ode6C12.ode
ltx/en_us_public/me.m08.d14:meMA.Ode6C12.text	@ltx/en_us_dedes/me.m08.d14:meMA.Ode6C12.text
ltx/en_us_public/me.m08.d14:meMA.Ode6C13.incipit	@ltx/en_us_dedes/me.m08.d14:meMA.Ode6C13.incipit
ltx/en_us_public/me.m08.d14:meMA.Ode6C13.melody	@ltx/en_us_dedes/me.m08.d14:meMA.Ode6C13.melody
ltx/en_us_public/me.m08.d14:meMA.Ode6C13.mode	@ltx/en_us_dedes/me.m08.d14:meMA.Ode6C13.mode
ltx/en_us_public/me.m08.d14:meMA.Ode6C13.ode	@ltx/en_us_dedes/me.m08.d14:meMA.Ode6C13.ode
ltx/en_us_public/me.m08.d14:meMA.Ode6C13.text	@ltx/en_us_dedes/me.m08.d14:meMA.Ode6C13.text
ltx/en_us_public/me.m08.d14:meMA.Ode6C14.incipit	@ltx/en_us_dedes/me.m08.d14:meMA.Ode6C14.incipit
ltx/en_us_public/me.m08.d14:meMA.Ode6C14.melody	@ltx/en_us_dedes/me.m08.d14:meMA.Ode6C14.melody
ltx/en_us_public/me.m08.d14:meMA.Ode6C14.mode	@ltx/en_us_dedes/me.m08.d14:meMA.Ode6C14.mode
ltx/en_us_public/me.m08.d14:meMA.Ode6C14.ode	@ltx/en_us_dedes/me.m08.d14:meMA.Ode6C14.ode
ltx/en_us_public/me.m08.d14:meMA.Ode6C14.text	@ltx/en_us_dedes/me.m08.d14:meMA.Ode6C14.text
ltx/en_us_public/me.m08.d14:meMA.Ode6C1H.greekmelody	@ltx/en_us_dedes/me.m08.d14:meMA.Ode6C1H.greekmelody
ltx/en_us_public/me.m08.d14:meMA.Ode6C1H.incipit	@ltx/en_us_dedes/me.m08.d14:meMA.Ode6C1H.incipit
ltx/en_us_public/me.m08.d14:meMA.Ode6C1H.melody	@ltx/en_us_dedes/me.m08.d14:meMA.Ode6C1H.melody
ltx/en_us_public/me.m08.d14:meMA.Ode6C1H.mode	@ltx/en_us_dedes/me.m08.d14:meMA.Ode6C1H.mode
ltx/en_us_public/me.m08.d14:meMA.Ode6C1H.ode	@ltx/en_us_dedes/me.m08.d14:meMA.Ode6C1H.ode
ltx/en_us_public/me.m08.d14:meMA.Ode6C1H.text	@ltx/en_us_dedes/me.m08.d14:meMA.Ode6C1H.text
ltx/en_us_public/me.m08.d14:meMA.Ode6C21.greekmelody	@ltx/en_us_dedes/me.m08.d14:meMA.Ode6C21.greekmelody
ltx/en_us_public/me.m08.d14:meMA.Ode6C21.incipit	@ltx/en_us_dedes/me.m08.d14:meMA.Ode6C21.incipit
ltx/en_us_public/me.m08.d14:meMA.Ode6C21.melody	@ltx/en_us_dedes/me.m08.d14:meMA.Ode6C21.melody
ltx/en_us_public/me.m08.d14:meMA.Ode6C21.mode	@ltx/en_us_dedes/me.m08.d14:meMA.Ode6C21.mode
ltx/en_us_public/me.m08.d14:meMA.Ode6C21.ode	@ltx/en_us_dedes/me.m08.d14:meMA.Ode6C21.ode
ltx/en_us_public/me.m08.d14:meMA.Ode6C21.text	@ltx/en_us_dedes/me.m08.d14:meMA.Ode6C21.text
ltx/en_us_public/me.m08.d14:meMA.Ode6C22.incipit	@ltx/en_us_dedes/me.m08.d14:meMA.Ode6C22.incipit
ltx/en_us_public/me.m08.d14:meMA.Ode6C22.melody	@ltx/en_us_dedes/me.m08.d14:meMA.Ode6C22.melody
ltx/en_us_public/me.m08.d14:meMA.Ode6C22.mode	@ltx/en_us_dedes/me.m08.d14:meMA.Ode6C22.mode
ltx/en_us_public/me.m08.d14:meMA.Ode6C22.ode	@ltx/en_us_dedes/me.m08.d14:meMA.Ode6C22.ode
ltx/en_us_public/me.m08.d14:meMA.Ode6C22.text	@ltx/en_us_dedes/me.m08.d14:meMA.Ode6C22.text
ltx/en_us_public/me.m08.d14:meMA.Ode6C2T.incipit	@ltx/en_us_dedes/me.m08.d14:meMA.Ode6C2T.incipit
ltx/en_us_public/me.m08.d14:meMA.Ode6C2T.melody	@ltx/en_us_dedes/me.m08.d14:meMA.Ode6C2T.melody
ltx/en_us_public/me.m08.d14:meMA.Ode6C2T.mode	@ltx/en_us_dedes/me.m08.d14:meMA.Ode6C2T.mode
ltx/en_us_public/me.m08.d14:meMA.Ode6C2T.ode	@ltx/en_us_dedes/me.m08.d14:meMA.Ode6C2T.ode
ltx/en_us_public/me.m08.d14:meMA.Ode6C2T.text	@ltx/en_us_dedes/me.m08.d14:meMA.Ode6C2T.text
ltx/en_us_public/me.m08.d14:meMA.Ode6H.greekmelody	@ltx/en_us_dedes/me.m08.d14:meMA.Ode6H.greekmelody
ltx/en_us_public/me.m08.d14:meMA.Ode6H.incipit	@ltx/en_us_dedes/me.m08.d14:meMA.Ode6H.incipit
ltx/en_us_public/me.m08.d14:meMA.Ode6H.melody	@ltx/en_us_dedes/me.m08.d14:meMA.Ode6H.melody
ltx/en_us_public/me.m08.d14:meMA.Ode6H.mode	@ltx/en_us_dedes/me.m08.d14:meMA.Ode6H.mode
ltx/en_us_public/me.m08.d14:meMA.Ode6H.ode	@ltx/en_us_dedes/me.m08.d14:meMA.Ode6H.ode
ltx/en_us_public/me.m08.d14:meMA.Ode6H.text	@ltx/en_us_dedes/me.m08.d14:meMA.Ode6H.text
ltx/en_us_public/me.m08.d14:meMA.Ode7C11.greekmelody	@ltx/en_us_dedes/me.m08.d14:meMA.Ode7C11.greekmelody
ltx/en_us_public/me.m08.d14:meMA.Ode7C11.incipit	@ltx/en_us_dedes/me.m08.d14:meMA.Ode7C11.incipit
ltx/en_us_public/me.m08.d14:meMA.Ode7C11.melody	@ltx/en_us_dedes/me.m08.d14:meMA.Ode7C11.melody
ltx/en_us_public/me.m08.d14:meMA.Ode7C11.mode	@ltx/en_us_dedes/me.m08.d14:meMA.Ode7C11.mode
ltx/en_us_public/me.m08.d14:meMA.Ode7C11.ode	@ltx/en_us_dedes/me.m08.d14:meMA.Ode7C11.ode
ltx/en_us_public/me.m08.d14:meMA.Ode7C11.text	@ltx/en_us_dedes/me.m08.d14:meMA.Ode7C11.text
ltx/en_us_public/me.m08.d14:meMA.Ode7C12.incipit	@ltx/en_us_dedes/me.m08.d14:meMA.Ode7C12.incipit
ltx/en_us_public/me.m08.d14:meMA.Ode7C12.melody	@ltx/en_us_dedes/me.m08.d14:meMA.Ode7C12.melody
ltx/en_us_public/me.m08.d14:meMA.Ode7C12.mode	@ltx/en_us_dedes/me.m08.d14:meMA.Ode7C12.mode
ltx/en_us_public/me.m08.d14:meMA.Ode7C12.ode	@ltx/en_us_dedes/me.m08.d14:meMA.Ode7C12.ode
ltx/en_us_public/me.m08.d14:meMA.Ode7C12.text	@ltx/en_us_dedes/me.m08.d14:meMA.Ode7C12.text
ltx/en_us_public/me.m08.d14:meMA.Ode7C13.incipit	@ltx/en_us_dedes/me.m08.d14:meMA.Ode7C13.incipit
ltx/en_us_public/me.m08.d14:meMA.Ode7C13.melody	@ltx/en_us_dedes/me.m08.d14:meMA.Ode7C13.melody
ltx/en_us_public/me.m08.d14:meMA.Ode7C13.mode	@ltx/en_us_dedes/me.m08.d14:meMA.Ode7C13.mode
ltx/en_us_public/me.m08.d14:meMA.Ode7C13.ode	@ltx/en_us_dedes/me.m08.d14:meMA.Ode7C13.ode
ltx/en_us_public/me.m08.d14:meMA.Ode7C13.text	@ltx/en_us_dedes/me.m08.d14:meMA.Ode7C13.text
ltx/en_us_public/me.m08.d14:meMA.Ode7C14.incipit	@ltx/en_us_dedes/me.m08.d14:meMA.Ode7C14.incipit
ltx/en_us_public/me.m08.d14:meMA.Ode7C14.melody	@ltx/en_us_dedes/me.m08.d14:meMA.Ode7C14.melody
ltx/en_us_public/me.m08.d14:meMA.Ode7C14.mode	@ltx/en_us_dedes/me.m08.d14:meMA.Ode7C14.mode
ltx/en_us_public/me.m08.d14:meMA.Ode7C14.ode	@ltx/en_us_dedes/me.m08.d14:meMA.Ode7C14.ode
ltx/en_us_public/me.m08.d14:meMA.Ode7C14.text	@ltx/en_us_dedes/me.m08.d14:meMA.Ode7C14.text
ltx/en_us_public/me.m08.d14:meMA.Ode7C1H.greekmelody	@ltx/en_us_dedes/me.m08.d14:meMA.Ode7C1H.greekmelody
ltx/en_us_public/me.m08.d14:meMA.Ode7C1H.incipit	@ltx/en_us_dedes/me.m08.d14:meMA.Ode7C1H.incipit
ltx/en_us_public/me.m08.d14:meMA.Ode7C1H.melody	@ltx/en_us_dedes/me.m08.d14:meMA.Ode7C1H.melody
ltx/en_us_public/me.m08.d14:meMA.Ode7C1H.mode	@ltx/en_us_dedes/me.m08.d14:meMA.Ode7C1H.mode
ltx/en_us_public/me.m08.d14:meMA.Ode7C1H.ode	@ltx/en_us_dedes/me.m08.d14:meMA.Ode7C1H.ode
ltx/en_us_public/me.m08.d14:meMA.Ode7C1H.text	@ltx/en_us_dedes/me.m08.d14:meMA.Ode7C1H.text
ltx/en_us_public/me.m08.d14:meMA.Ode7C21.greekmelody	@ltx/en_us_dedes/me.m08.d14:meMA.Ode7C21.greekmelody
ltx/en_us_public/me.m08.d14:meMA.Ode7C21.incipit	@ltx/en_us_dedes/me.m08.d14:meMA.Ode7C21.incipit
ltx/en_us_public/me.m08.d14:meMA.Ode7C21.melody	@ltx/en_us_dedes/me.m08.d14:meMA.Ode7C21.melody
ltx/en_us_public/me.m08.d14:meMA.Ode7C21.mode	@ltx/en_us_dedes/me.m08.d14:meMA.Ode7C21.mode
ltx/en_us_public/me.m08.d14:meMA.Ode7C21.ode	@ltx/en_us_dedes/me.m08.d14:meMA.Ode7C21.ode
ltx/en_us_public/me.m08.d14:meMA.Ode7C21.text	@ltx/en_us_dedes/me.m08.d14:meMA.Ode7C21.text
ltx/en_us_public/me.m08.d14:meMA.Ode7C22.incipit	@ltx/en_us_dedes/me.m08.d14:meMA.Ode7C22.incipit
ltx/en_us_public/me.m08.d14:meMA.Ode7C22.melody	@ltx/en_us_dedes/me.m08.d14:meMA.Ode7C22.melody
ltx/en_us_public/me.m08.d14:meMA.Ode7C22.mode	@ltx/en_us_dedes/me.m08.d14:meMA.Ode7C22.mode
ltx/en_us_public/me.m08.d14:meMA.Ode7C22.ode	@ltx/en_us_dedes/me.m08.d14:meMA.Ode7C22.ode
ltx/en_us_public/me.m08.d14:meMA.Ode7C22.text	@ltx/en_us_dedes/me.m08.d14:meMA.Ode7C22.text
ltx/en_us_public/me.m08.d14:meMA.Ode7C2T.incipit	@ltx/en_us_dedes/me.m08.d14:meMA.Ode7C2T.incipit
ltx/en_us_public/me.m08.d14:meMA.Ode7C2T.melody	@ltx/en_us_dedes/me.m08.d14:meMA.Ode7C2T.melody
ltx/en_us_public/me.m08.d14:meMA.Ode7C2T.mode	@ltx/en_us_dedes/me.m08.d14:meMA.Ode7C2T.mode
ltx/en_us_public/me.m08.d14:meMA.Ode7C2T.ode	@ltx/en_us_dedes/me.m08.d14:meMA.Ode7C2T.ode
ltx/en_us_public/me.m08.d14:meMA.Ode7C2T.text	@ltx/en_us_dedes/me.m08.d14:meMA.Ode7C2T.text
ltx/en_us_public/me.m08.d14:meMA.Ode8C11.greekmelody	@ltx/en_us_dedes/me.m08.d14:meMA.Ode8C11.greekmelody
ltx/en_us_public/me.m08.d14:meMA.Ode8C11.incipit	@ltx/en_us_dedes/me.m08.d14:meMA.Ode8C11.incipit
ltx/en_us_public/me.m08.d14:meMA.Ode8C11.melody	@ltx/en_us_dedes/me.m08.d14:meMA.Ode8C11.melody
ltx/en_us_public/me.m08.d14:meMA.Ode8C11.mode	@ltx/en_us_dedes/me.m08.d14:meMA.Ode8C11.mode
ltx/en_us_public/me.m08.d14:meMA.Ode8C11.ode	@ltx/en_us_dedes/me.m08.d14:meMA.Ode8C11.ode
ltx/en_us_public/me.m08.d14:meMA.Ode8C11.text	@ltx/en_us_dedes/me.m08.d14:meMA.Ode8C11.text
ltx/en_us_public/me.m08.d14:meMA.Ode8C12.incipit	@ltx/en_us_dedes/me.m08.d14:meMA.Ode8C12.incipit
ltx/en_us_public/me.m08.d14:meMA.Ode8C12.melody	@ltx/en_us_dedes/me.m08.d14:meMA.Ode8C12.melody
ltx/en_us_public/me.m08.d14:meMA.Ode8C12.mode	@ltx/en_us_dedes/me.m08.d14:meMA.Ode8C12.mode
ltx/en_us_public/me.m08.d14:meMA.Ode8C12.ode	@ltx/en_us_dedes/me.m08.d14:meMA.Ode8C12.ode
ltx/en_us_public/me.m08.d14:meMA.Ode8C12.text	@ltx/en_us_dedes/me.m08.d14:meMA.Ode8C12.text
ltx/en_us_public/me.m08.d14:meMA.Ode8C13.incipit	@ltx/en_us_dedes/me.m08.d14:meMA.Ode8C13.incipit
ltx/en_us_public/me.m08.d14:meMA.Ode8C13.melody	@ltx/en_us_dedes/me.m08.d14:meMA.Ode8C13.melody
ltx/en_us_public/me.m08.d14:meMA.Ode8C13.mode	@ltx/en_us_dedes/me.m08.d14:meMA.Ode8C13.mode
ltx/en_us_public/me.m08.d14:meMA.Ode8C13.ode	@ltx/en_us_dedes/me.m08.d14:meMA.Ode8C13.ode
ltx/en_us_public/me.m08.d14:meMA.Ode8C13.text	@ltx/en_us_dedes/me.m08.d14:meMA.Ode8C13.text
ltx/en_us_public/me.m08.d14:meMA.Ode8C14.incipit	@ltx/en_us_dedes/me.m08.d14:meMA.Ode8C14.incipit
ltx/en_us_public/me.m08.d14:meMA.Ode8C14.melody	@ltx/en_us_dedes/me.m08.d14:meMA.Ode8C14.melody
ltx/en_us_public/me.m08.d14:meMA.Ode8C14.mode	@ltx/en_us_dedes/me.m08.d14:meMA.Ode8C14.mode
ltx/en_us_public/me.m08.d14:meMA.Ode8C14.ode	@ltx/en_us_dedes/me.m08.d14:meMA.Ode8C14.ode
ltx/en_us_public/me.m08.d14:meMA.Ode8C14.text	@ltx/en_us_dedes/me.m08.d14:meMA.Ode8C14.text
ltx/en_us_public/me.m08.d14:meMA.Ode8C1H.greekmelody	@ltx/en_us_dedes/me.m08.d14:meMA.Ode8C1H.greekmelody
ltx/en_us_public/me.m08.d14:meMA.Ode8C1H.incipit	@ltx/en_us_dedes/me.m08.d14:meMA.Ode8C1H.incipit
ltx/en_us_public/me.m08.d14:meMA.Ode8C1H.melody	@ltx/en_us_dedes/me.m08.d14:meMA.Ode8C1H.melody
ltx/en_us_public/me.m08.d14:meMA.Ode8C1H.mode	@ltx/en_us_dedes/me.m08.d14:meMA.Ode8C1H.mode
ltx/en_us_public/me.m08.d14:meMA.Ode8C1H.ode	@ltx/en_us_dedes/me.m08.d14:meMA.Ode8C1H.ode
ltx/en_us_public/me.m08.d14:meMA.Ode8C1H.text	@ltx/en_us_dedes/me.m08.d14:meMA.Ode8C1H.text
ltx/en_us_public/me.m08.d14:meMA.Ode8C21.greekmelody	@ltx/en_us_dedes/me.m08.d14:meMA.Ode8C21.greekmelody
ltx/en_us_public/me.m08.d14:meMA.Ode8C21.incipit	@ltx/en_us_dedes/me.m08.d14:meMA.Ode8C21.incipit
ltx/en_us_public/me.m08.d14:meMA.Ode8C21.melody	@ltx/en_us_dedes/me.m08.d14:meMA.Ode8C21.melody
ltx/en_us_public/me.m08.d14:meMA.Ode8C21.mode	@ltx/en_us_dedes/me.m08.d14:meMA.Ode8C21.mode
ltx/en_us_public/me.m08.d14:meMA.Ode8C21.ode	@ltx/en_us_dedes/me.m08.d14:meMA.Ode8C21.ode
ltx/en_us_public/me.m08.d14:meMA.Ode8C21.text	@ltx/en_us_dedes/me.m08.d14:meMA.Ode8C21.text
ltx/en_us_public/me.m08.d14:meMA.Ode8C22.incipit	@ltx/en_us_dedes/me.m08.d14:meMA.Ode8C22.incipit
ltx/en_us_public/me.m08.d14:meMA.Ode8C22.melody	@ltx/en_us_dedes/me.m08.d14:meMA.Ode8C22.melody
ltx/en_us_public/me.m08.d14:meMA.Ode8C22.mode	@ltx/en_us_dedes/me.m08.d14:meMA.Ode8C22.mode
ltx/en_us_public/me.m08.d14:meMA.Ode8C22.ode	@ltx/en_us_dedes/me.m08.d14:meMA.Ode8C22.ode
ltx/en_us_public/me.m08.d14:meMA.Ode8C22.text	@ltx/en_us_dedes/me.m08.d14:meMA.Ode8C22.text
ltx/en_us_public/me.m08.d14:meMA.Ode8C23.incipit	@ltx/en_us_dedes/me.m08.d14:meMA.Ode8C23.incipit
ltx/en_us_public/me.m08.d14:meMA.Ode8C23.melody	@ltx/en_us_dedes/me.m08.d14:meMA.Ode8C23.melody
ltx/en_us_public/me.m08.d14:meMA.Ode8C23.mode	@ltx/en_us_dedes/me.m08.d14:meMA.Ode8C23.mode
ltx/en_us_public/me.m08.d14:meMA.Ode8C23.ode	@ltx/en_us_dedes/me.m08.d14:meMA.Ode8C23.ode
ltx/en_us_public/me.m08.d14:meMA.Ode8C23.text	@ltx/en_us_dedes/me.m08.d14:meMA.Ode8C23.text
ltx/en_us_public/me.m08.d14:meMA.Ode8C2T.incipit	@ltx/en_us_dedes/me.m08.d14:meMA.Ode8C2T.incipit
ltx/en_us_public/me.m08.d14:meMA.Ode8C2T.melody	@ltx/en_us_dedes/me.m08.d14:meMA.Ode8C2T.melody
ltx/en_us_public/me.m08.d14:meMA.Ode8C2T.mode	@ltx/en_us_dedes/me.m08.d14:meMA.Ode8C2T.mode
ltx/en_us_public/me.m08.d14:meMA.Ode8C2T.ode	@ltx/en_us_dedes/me.m08.d14:meMA.Ode8C2T.ode
ltx/en_us_public/me.m08.d14:meMA.Ode8C2T.text	@ltx/en_us_dedes/me.m08.d14:meMA.Ode8C2T.text
ltx/en_us_public/me.m08.d14:meMA.Ode8H.greekmelody	@ltx/en_us_dedes/me.m08.d14:meMA.Ode8H.greekmelody
ltx/en_us_public/me.m08.d14:meMA.Ode8H.incipit	@ltx/en_us_dedes/me.m08.d14:meMA.Ode8H.incipit
ltx/en_us_public/me.m08.d14:meMA.Ode8H.melody	@ltx/en_us_dedes/me.m08.d14:meMA.Ode8H.melody
ltx/en_us_public/me.m08.d14:meMA.Ode8H.mode	@ltx/en_us_dedes/me.m08.d14:meMA.Ode8H.mode
ltx/en_us_public/me.m08.d14:meMA.Ode8H.ode	@ltx/en_us_dedes/me.m08.d14:meMA.Ode8H.ode
ltx/en_us_public/me.m08.d14:meMA.Ode8H.text	@ltx/en_us_dedes/me.m08.d14:meMA.Ode8H.text
ltx/en_us_public/me.m08.d14:meMA.Ode9C11.greekmelody	@ltx/en_us_dedes/me.m08.d14:meMA.Ode9C11.greekmelody
ltx/en_us_public/me.m08.d14:meMA.Ode9C11.incipit	@ltx/en_us_dedes/me.m08.d14:meMA.Ode9C11.incipit
ltx/en_us_public/me.m08.d14:meMA.Ode9C11.melody	@ltx/en_us_dedes/me.m08.d14:meMA.Ode9C11.melody
ltx/en_us_public/me.m08.d14:meMA.Ode9C11.mode	@ltx/en_us_dedes/me.m08.d14:meMA.Ode9C11.mode
ltx/en_us_public/me.m08.d14:meMA.Ode9C11.ode	@ltx/en_us_dedes/me.m08.d14:meMA.Ode9C11.ode
ltx/en_us_public/me.m08.d14:meMA.Ode9C11.text	@ltx/en_us_dedes/me.m08.d14:meMA.Ode9C11.text
ltx/en_us_public/me.m08.d14:meMA.Ode9C12.incipit	@ltx/en_us_dedes/me.m08.d14:meMA.Ode9C12.incipit
ltx/en_us_public/me.m08.d14:meMA.Ode9C12.melody	@ltx/en_us_dedes/me.m08.d14:meMA.Ode9C12.melody
ltx/en_us_public/me.m08.d14:meMA.Ode9C12.mode	@ltx/en_us_dedes/me.m08.d14:meMA.Ode9C12.mode
ltx/en_us_public/me.m08.d14:meMA.Ode9C12.ode	@ltx/en_us_dedes/me.m08.d14:meMA.Ode9C12.ode
ltx/en_us_public/me.m08.d14:meMA.Ode9C12.text	@ltx/en_us_dedes/me.m08.d14:meMA.Ode9C12.text
ltx/en_us_public/me.m08.d14:meMA.Ode9C13.incipit	@ltx/en_us_dedes/me.m08.d14:meMA.Ode9C13.incipit
ltx/en_us_public/me.m08.d14:meMA.Ode9C13.melody	@ltx/en_us_dedes/me.m08.d14:meMA.Ode9C13.melody
ltx/en_us_public/me.m08.d14:meMA.Ode9C13.mode	@ltx/en_us_dedes/me.m08.d14:meMA.Ode9C13.mode
ltx/en_us_public/me.m08.d14:meMA.Ode9C13.ode	@ltx/en_us_dedes/me.m08.d14:meMA.Ode9C13.ode
ltx/en_us_public/me.m08.d14:meMA.Ode9C13.text	@ltx/en_us_dedes/me.m08.d14:meMA.Ode9C13.text
ltx/en_us_public/me.m08.d14:meMA.Ode9C14.incipit	@ltx/en_us_dedes/me.m08.d14:meMA.Ode9C14.incipit
ltx/en_us_public/me.m08.d14:meMA.Ode9C14.melody	@ltx/en_us_dedes/me.m08.d14:meMA.Ode9C14.melody
ltx/en_us_public/me.m08.d14:meMA.Ode9C14.mode	@ltx/en_us_dedes/me.m08.d14:meMA.Ode9C14.mode
ltx/en_us_public/me.m08.d14:meMA.Ode9C14.ode	@ltx/en_us_dedes/me.m08.d14:meMA.Ode9C14.ode
ltx/en_us_public/me.m08.d14:meMA.Ode9C14.text	@ltx/en_us_dedes/me.m08.d14:meMA.Ode9C14.text
ltx/en_us_public/me.m08.d14:meMA.Ode9C1H.greekmelody	@ltx/en_us_dedes/me.m08.d14:meMA.Ode9C1H.greekmelody
ltx/en_us_public/me.m08.d14:meMA.Ode9C1H.incipit	@ltx/en_us_dedes/me.m08.d14:meMA.Ode9C1H.incipit
ltx/en_us_public/me.m08.d14:meMA.Ode9C1H.melody	@ltx/en_us_dedes/me.m08.d14:meMA.Ode9C1H.melody
ltx/en_us_public/me.m08.d14:meMA.Ode9C1H.mode	@ltx/en_us_dedes/me.m08.d14:meMA.Ode9C1H.mode
ltx/en_us_public/me.m08.d14:meMA.Ode9C1H.ode	@ltx/en_us_dedes/me.m08.d14:meMA.Ode9C1H.ode
ltx/en_us_public/me.m08.d14:meMA.Ode9C1H.text	@ltx/en_us_dedes/me.m08.d14:meMA.Ode9C1H.text
ltx/en_us_public/me.m08.d14:meMA.Ode9C21.greekmelody	@ltx/en_us_dedes/me.m08.d14:meMA.Ode9C21.greekmelody
ltx/en_us_public/me.m08.d14:meMA.Ode9C21.incipit	@ltx/en_us_dedes/me.m08.d14:meMA.Ode9C21.incipit
ltx/en_us_public/me.m08.d14:meMA.Ode9C21.melody	@ltx/en_us_dedes/me.m08.d14:meMA.Ode9C21.melody
ltx/en_us_public/me.m08.d14:meMA.Ode9C21.mode	@ltx/en_us_dedes/me.m08.d14:meMA.Ode9C21.mode
ltx/en_us_public/me.m08.d14:meMA.Ode9C21.ode	@ltx/en_us_dedes/me.m08.d14:meMA.Ode9C21.ode
ltx/en_us_public/me.m08.d14:meMA.Ode9C21.text	@ltx/en_us_dedes/me.m08.d14:meMA.Ode9C21.text
ltx/en_us_public/me.m08.d14:meMA.Ode9C22.incipit	@ltx/en_us_dedes/me.m08.d14:meMA.Ode9C22.incipit
ltx/en_us_public/me.m08.d14:meMA.Ode9C22.melody	@ltx/en_us_dedes/me.m08.d14:meMA.Ode9C22.melody
ltx/en_us_public/me.m08.d14:meMA.Ode9C22.mode	@ltx/en_us_dedes/me.m08.d14:meMA.Ode9C22.mode
ltx/en_us_public/me.m08.d14:meMA.Ode9C22.ode	@ltx/en_us_dedes/me.m08.d14:meMA.Ode9C22.ode
ltx/en_us_public/me.m08.d14:meMA.Ode9C22.text	@ltx/en_us_dedes/me.m08.d14:meMA.Ode9C22.text
ltx/en_us_public/me.m08.d14:meMA.Ode9C23.incipit	@ltx/en_us_dedes/me.m08.d14:meMA.Ode9C23.incipit
ltx/en_us_public/me.m08.d14:meMA.Ode9C23.melody	@ltx/en_us_dedes/me.m08.d14:meMA.Ode9C23.melody
ltx/en_us_public/me.m08.d14:meMA.Ode9C23.mode	@ltx/en_us_dedes/me.m08.d14:meMA.Ode9C23.mode
ltx/en_us_public/me.m08.d14:meMA.Ode9C23.ode	@ltx/en_us_dedes/me.m08.d14:meMA.Ode9C23.ode
ltx/en_us_public/me.m08.d14:meMA.Ode9C23.text	@ltx/en_us_dedes/me.m08.d14:meMA.Ode9C23.text
ltx/en_us_public/me.m08.d14:meMA.Ode9C2T.incipit	@ltx/en_us_dedes/me.m08.d14:meMA.Ode9C2T.incipit
ltx/en_us_public/me.m08.d14:meMA.Ode9C2T.melody	@ltx/en_us_dedes/me.m08.d14:meMA.Ode9C2T.melody
ltx/en_us_public/me.m08.d14:meMA.Ode9C2T.mode	@ltx/en_us_dedes/me.m08.d14:meMA.Ode9C2T.mode
ltx/en_us_public/me.m08.d14:meMA.Ode9C2T.ode	@ltx/en_us_dedes/me.m08.d14:meMA.Ode9C2T.ode
ltx/en_us_public/me.m08.d14:meMA.Ode9C2T.text	@ltx/en_us_dedes/me.m08.d14:meMA.Ode9C2T.text
ltx/en_us_public/me.m08.d14:meMA.Ode9H.greekmelody	@ltx/en_us_dedes/me.m08.d14:meMA.Ode9H.greekmelody
ltx/en_us_public/me.m08.d14:meMA.Ode9H.incipit	@ltx/en_us_dedes/me.m08.d14:meMA.Ode9H.incipit
ltx/en_us_public/me.m08.d14:meMA.Ode9H.melody	@ltx/en_us_dedes/me.m08.d14:meMA.Ode9H.melody
ltx/en_us_public/me.m08.d14:meMA.Ode9H.mode	@ltx/en_us_dedes/me.m08.d14:meMA.Ode9H.mode
ltx/en_us_public/me.m08.d14:meMA.Ode9H.ode	@ltx/en_us_dedes/me.m08.d14:meMA.Ode9H.ode
ltx/en_us_public/me.m08.d14:meMA.Ode9H.text	@ltx/en_us_dedes/me.m08.d14:meMA.Ode9H.text
ltx/en_us_public/me.m08.d14:meMA.Oikos1.text	@ltx/en_us_dedes/me.m08.d14:meMA.Oikos1.text
ltx/en_us_public/me.m08.d14:meVE.Apolytikion1.greekmelody	@ltx/en_us_dedes/me.m08.d14:meVE.Apolytikion1.greekmelody
ltx/en_us_public/me.m08.d14:meVE.Apolytikion1.incipit	@ltx/en_us_dedes/me.m08.d14:meVE.Apolytikion1.incipit
ltx/en_us_public/me.m08.d14:meVE.Apolytikion1.melody	@ltx/en_us_dedes/me.m08.d14:meVE.Apolytikion1.melody
ltx/en_us_public/me.m08.d14:meVE.Apolytikion1.mode	@ltx/en_us_dedes/me.m08.d14:meVE.Apolytikion1.mode
ltx/en_us_public/me.m08.d14:meVE.Apolytikion1.text	@ltx/en_us_dedes/me.m08.d14:meVE.Apolytikion1.text
ltx/en_us_public/me.m08.d14:meVE.AposGlory.incipit	@ltx/en_us_dedes/me.m08.d14:meVE.AposGlory.incipit
ltx/en_us_public/me.m08.d14:meVE.AposGlory.melody	@ltx/en_us_dedes/me.m08.d14:meVE.AposGlory.melody
ltx/en_us_public/me.m08.d14:meVE.AposGlory.mode	@ltx/en_us_dedes/me.m08.d14:meVE.AposGlory.mode
ltx/en_us_public/me.m08.d14:meVE.AposGlory.text	@ltx/en_us_dedes/me.m08.d14:meVE.AposGlory.text
ltx/en_us_public/me.m08.d14:meVE.Aposticha1.greekmelody	@ltx/en_us_dedes/me.m08.d14:meVE.Aposticha1.greekmelody
ltx/en_us_public/me.m08.d14:meVE.Aposticha1.incipit	@ltx/en_us_dedes/me.m08.d14:meVE.Aposticha1.incipit
ltx/en_us_public/me.m08.d14:meVE.Aposticha1.melody	@ltx/en_us_dedes/me.m08.d14:meVE.Aposticha1.melody
ltx/en_us_public/me.m08.d14:meVE.Aposticha1.mode	@ltx/en_us_dedes/me.m08.d14:meVE.Aposticha1.mode
ltx/en_us_public/me.m08.d14:meVE.Aposticha1.text	@ltx/en_us_dedes/me.m08.d14:meVE.Aposticha1.text
ltx/en_us_public/me.m08.d14:meVE.Aposticha2.incipit	@ltx/en_us_dedes/me.m08.d14:meVE.Aposticha2.incipit
ltx/en_us_public/me.m08.d14:meVE.Aposticha2.melody	@ltx/en_us_dedes/me.m08.d14:meVE.Aposticha2.melody
ltx/en_us_public/me.m08.d14:meVE.Aposticha2.mode	@ltx/en_us_dedes/me.m08.d14:meVE.Aposticha2.mode
ltx/en_us_public/me.m08.d14:meVE.Aposticha2.text	@ltx/en_us_dedes/me.m08.d14:meVE.Aposticha2.text
ltx/en_us_public/me.m08.d14:meVE.Aposticha3.incipit	@ltx/en_us_dedes/me.m08.d14:meVE.Aposticha3.incipit
ltx/en_us_public/me.m08.d14:meVE.Aposticha3.melody	@ltx/en_us_dedes/me.m08.d14:meVE.Aposticha3.melody
ltx/en_us_public/me.m08.d14:meVE.Aposticha3.mode	@ltx/en_us_dedes/me.m08.d14:meVE.Aposticha3.mode
ltx/en_us_public/me.m08.d14:meVE.Aposticha3.text	@ltx/en_us_dedes/me.m08.d14:meVE.Aposticha3.text
ltx/en_us_public/me.m08.d14:meVE.SticGlory.incipit	@ltx/en_us_dedes/me.m08.d14:meVE.SticGlory.incipit
ltx/en_us_public/me.m08.d14:meVE.SticGlory.melody	@ltx/en_us_dedes/me.m08.d14:meVE.SticGlory.melody
ltx/en_us_public/me.m08.d14:meVE.SticGlory.mode	@ltx/en_us_dedes/me.m08.d14:meVE.SticGlory.mode
ltx/en_us_public/me.m08.d14:meVE.SticGlory.text	@ltx/en_us_dedes/me.m08.d14:meVE.SticGlory.text
ltx/en_us_public/me.m08.d14:meVE.Stichera01.greekmelody	@ltx/en_us_dedes/me.m08.d14:meVE.Stichera01.greekmelody
ltx/en_us_public/me.m08.d14:meVE.Stichera01.incipit	@ltx/en_us_oca/me.m08.d14:meVE.Stichera01.incipit
ltx/en_us_public/me.m08.d14:meVE.Stichera01.melody	@ltx/en_us_oca/me.m08.d14:meVE.Stichera01.melody
ltx/en_us_public/me.m08.d14:meVE.Stichera01.mode	@ltx/en_us_dedes/me.m08.d14:meVE.Stichera01.mode
ltx/en_us_public/me.m08.d14:meVE.Stichera01.text	@ltx/en_us_oca/me.m08.d14:meVE.Stichera01.text
ltx/en_us_public/me.m08.d14:meVE.Stichera02.incipit	@ltx/en_us_oca/me.m08.d14:meVE.Stichera02.incipit
ltx/en_us_public/me.m08.d14:meVE.Stichera02.melody	@ltx/en_us_oca/me.m08.d14:meVE.Stichera02.melody
ltx/en_us_public/me.m08.d14:meVE.Stichera02.mode	@ltx/en_us_dedes/me.m08.d14:meVE.Stichera02.mode
ltx/en_us_public/me.m08.d14:meVE.Stichera02.text	@ltx/en_us_oca/me.m08.d14:meVE.Stichera02.text
ltx/en_us_public/me.m08.d14:meVE.Stichera03.incipit	@ltx/en_us_oca/me.m08.d14:meVE.Stichera03.incipit
ltx/en_us_public/me.m08.d14:meVE.Stichera03.melody	@ltx/en_us_oca/me.m08.d14:meVE.Stichera03.melody
ltx/en_us_public/me.m08.d14:meVE.Stichera03.mode	@ltx/en_us_dedes/me.m08.d14:meVE.Stichera03.mode
ltx/en_us_public/me.m08.d14:meVE.Stichera03.text	@ltx/en_us_oca/me.m08.d14:meVE.Stichera03.text
ltx/en_us_public/me.m08.d14:meVE.Stichera04.greekmelody	@ltx/en_us_dedes/me.m08.d14:meVE.Stichera04.greekmelody
ltx/en_us_public/me.m08.d14:meVE.Stichera04.incipit	@ltx/en_us_oca/me.m08.d14:meVE.Stichera04.incipit
ltx/en_us_public/me.m08.d14:meVE.Stichera04.melody	@ltx/en_us_oca/me.m08.d14:meVE.Stichera04.melody
ltx/en_us_public/me.m08.d14:meVE.Stichera04.mode	@ltx/en_us_dedes/me.m08.d14:meVE.Stichera04.mode
ltx/en_us_public/me.m08.d14:meVE.Stichera04.text	@ltx/en_us_oca/me.m08.d14:meVE.Stichera04.text
ltx/en_us_public/me.m08.d14:meVE.Stichera05.incipit	@ltx/en_us_oca/me.m08.d14:meVE.Stichera05.incipit
ltx/en_us_public/me.m08.d14:meVE.Stichera05.melody	@ltx/en_us_oca/me.m08.d14:meVE.Stichera05.melody
ltx/en_us_public/me.m08.d14:meVE.Stichera05.mode	@ltx/en_us_dedes/me.m08.d14:meVE.Stichera05.mode
ltx/en_us_public/me.m08.d14:meVE.Stichera05.text	@ltx/en_us_oca/me.m08.d14:meVE.Stichera05.text
ltx/en_us_public/me.m08.d14:meVE.Stichera06.incipit	@ltx/en_us_oca/me.m08.d14:meVE.Stichera06.incipit
ltx/en_us_public/me.m08.d14:meVE.Stichera06.melody	@ltx/en_us_oca/me.m08.d14:meVE.Stichera06.melody
ltx/en_us_public/me.m08.d14:meVE.Stichera06.mode	@ltx/en_us_dedes/me.m08.d14:meVE.Stichera06.mode
ltx/en_us_public/me.m08.d14:meVE.Stichera06.text	@ltx/en_us_oca/me.m08.d14:meVE.Stichera06.text
