ltx/en_us_public/sy.m09.d11:syMA.commemoration01.couplet1.title	@ltx/en_us_dedes/sy.m09.d11:syMA.commemoration01.couplet1.title
ltx/en_us_public/sy.m09.d11:syMA.commemoration01.couplet1.verse1	@ltx/en_us_dedes/sy.m09.d11:syMA.commemoration01.couplet1.verse1
ltx/en_us_public/sy.m09.d11:syMA.commemoration01.couplet1.verse2	@ltx/en_us_dedes/sy.m09.d11:syMA.commemoration01.couplet1.verse2
ltx/en_us_public/sy.m09.d11:syMA.commemoration01.poem.verse01	@ltx/en_us_dedes/sy.m09.d11:syMA.commemoration01.poem.verse01
ltx/en_us_public/sy.m09.d11:syMA.commemoration01.poem.verse02	@ltx/en_us_dedes/sy.m09.d11:syMA.commemoration01.poem.verse02
ltx/en_us_public/sy.m09.d11:syMA.commemoration01.poem.verse03	@ltx/en_us_dedes/sy.m09.d11:syMA.commemoration01.poem.verse03
ltx/en_us_public/sy.m09.d11:syMA.commemoration01.poem.verse04	@ltx/en_us_dedes/sy.m09.d11:syMA.commemoration01.poem.verse04
ltx/en_us_public/sy.m09.d11:syMA.commemoration01.poem.verse05	@ltx/en_us_dedes/sy.m09.d11:syMA.commemoration01.poem.verse05
ltx/en_us_public/sy.m09.d11:syMA.commemoration01.poem.verse06	@ltx/en_us_dedes/sy.m09.d11:syMA.commemoration01.poem.verse06
ltx/en_us_public/sy.m09.d11:syMA.commemoration01.poem.verse07	@ltx/en_us_dedes/sy.m09.d11:syMA.commemoration01.poem.verse07
ltx/en_us_public/sy.m09.d11:syMA.commemoration01.poem.verse08	@ltx/en_us_dedes/sy.m09.d11:syMA.commemoration01.poem.verse08
ltx/en_us_public/sy.m09.d11:syMA.commemoration01.poem.verse09	@ltx/en_us_dedes/sy.m09.d11:syMA.commemoration01.poem.verse09
ltx/en_us_public/sy.m09.d11:syMA.commemoration01.poem.verse10	@ltx/en_us_dedes/sy.m09.d11:syMA.commemoration01.poem.verse10
ltx/en_us_public/sy.m09.d11:syMA.commemoration01.poem.verse11	@ltx/en_us_dedes/sy.m09.d11:syMA.commemoration01.poem.verse11
ltx/en_us_public/sy.m09.d11:syMA.commemoration01.poem.verse12	@ltx/en_us_dedes/sy.m09.d11:syMA.commemoration01.poem.verse12
ltx/en_us_public/sy.m09.d11:syMA.commemoration01.poem.verse13	@ltx/en_us_dedes/sy.m09.d11:syMA.commemoration01.poem.verse13
ltx/en_us_public/sy.m09.d11:syMA.commemoration01.poem.verse14	@ltx/en_us_dedes/sy.m09.d11:syMA.commemoration01.poem.verse14
ltx/en_us_public/sy.m09.d11:syMA.commemoration01.poem.verse15	@ltx/en_us_dedes/sy.m09.d11:syMA.commemoration01.poem.verse15
ltx/en_us_public/sy.m09.d11:syMA.commemoration01.poem.verse16	@ltx/en_us_dedes/sy.m09.d11:syMA.commemoration01.poem.verse16
ltx/en_us_public/sy.m09.d11:syMA.commemoration01.poem.verse17	@ltx/en_us_dedes/sy.m09.d11:syMA.commemoration01.poem.verse17
ltx/en_us_public/sy.m09.d11:syMA.commemoration01.poem.verse18	@ltx/en_us_dedes/sy.m09.d11:syMA.commemoration01.poem.verse18
ltx/en_us_public/sy.m09.d11:syMA.commemoration01.poem.verse19	@ltx/en_us_dedes/sy.m09.d11:syMA.commemoration01.poem.verse19
ltx/en_us_public/sy.m09.d11:syMA.commemoration01.poem.verse20	@ltx/en_us_dedes/sy.m09.d11:syMA.commemoration01.poem.verse20
ltx/en_us_public/sy.m09.d11:syMA.commemoration01.poem.verse21	@ltx/en_us_dedes/sy.m09.d11:syMA.commemoration01.poem.verse21
ltx/en_us_public/sy.m09.d11:syMA.commemoration01.poem.verse22	@ltx/en_us_dedes/sy.m09.d11:syMA.commemoration01.poem.verse22
ltx/en_us_public/sy.m09.d11:syMA.commemoration01.poem.verse23	@ltx/en_us_dedes/sy.m09.d11:syMA.commemoration01.poem.verse23
ltx/en_us_public/sy.m09.d11:syMA.commemoration01.poem.verse24	@ltx/en_us_dedes/sy.m09.d11:syMA.commemoration01.poem.verse24
ltx/en_us_public/sy.m09.d11:syMA.commemoration01.poem.verse25	@ltx/en_us_dedes/sy.m09.d11:syMA.commemoration01.poem.verse25
ltx/en_us_public/sy.m09.d11:syMA.commemoration01.poem.verse26	@ltx/en_us_dedes/sy.m09.d11:syMA.commemoration01.poem.verse26
ltx/en_us_public/sy.m09.d11:syMA.commemoration01.poem.verse27	@ltx/en_us_dedes/sy.m09.d11:syMA.commemoration01.poem.verse27
ltx/en_us_public/sy.m09.d11:syMA.commemoration01.poem.verse28	@ltx/en_us_dedes/sy.m09.d11:syMA.commemoration01.poem.verse28
ltx/en_us_public/sy.m09.d11:syMA.commemoration01.poem.verse29	@ltx/en_us_dedes/sy.m09.d11:syMA.commemoration01.poem.verse29
ltx/en_us_public/sy.m09.d11:syMA.commemoration01.poem.verse30	@ltx/en_us_dedes/sy.m09.d11:syMA.commemoration01.poem.verse30
ltx/en_us_public/sy.m09.d11:syMA.commemoration01.poem.verse31	@ltx/en_us_dedes/sy.m09.d11:syMA.commemoration01.poem.verse31
ltx/en_us_public/sy.m09.d11:syMA.commemoration01.poem.verse32	@ltx/en_us_dedes/sy.m09.d11:syMA.commemoration01.poem.verse32
ltx/en_us_public/sy.m09.d11:syMA.commemoration01.poem.verse33	@ltx/en_us_dedes/sy.m09.d11:syMA.commemoration01.poem.verse33
ltx/en_us_public/sy.m09.d11:syMA.commemoration01.poem.verse34	@ltx/en_us_dedes/sy.m09.d11:syMA.commemoration01.poem.verse34
ltx/en_us_public/sy.m09.d11:syMA.commemoration01.poem.verse35	@ltx/en_us_dedes/sy.m09.d11:syMA.commemoration01.poem.verse35
ltx/en_us_public/sy.m09.d11:syMA.commemoration01.poem.verse36	@ltx/en_us_dedes/sy.m09.d11:syMA.commemoration01.poem.verse36
ltx/en_us_public/sy.m09.d11:syMA.commemoration01.poem.verse37	@ltx/en_us_dedes/sy.m09.d11:syMA.commemoration01.poem.verse37
ltx/en_us_public/sy.m09.d11:syMA.commemoration01.poem.verse38	@ltx/en_us_dedes/sy.m09.d11:syMA.commemoration01.poem.verse38
ltx/en_us_public/sy.m09.d11:syMA.commemoration01.poem.verse39	@ltx/en_us_dedes/sy.m09.d11:syMA.commemoration01.poem.verse39
ltx/en_us_public/sy.m09.d11:syMA.commemoration01.poem.verse40	@ltx/en_us_dedes/sy.m09.d11:syMA.commemoration01.poem.verse40
ltx/en_us_public/sy.m09.d11:syMA.commemoration01.poem.verse41	@ltx/en_us_dedes/sy.m09.d11:syMA.commemoration01.poem.verse41
ltx/en_us_public/sy.m09.d11:syMA.commemoration01.poem.verse42	@ltx/en_us_dedes/sy.m09.d11:syMA.commemoration01.poem.verse42
ltx/en_us_public/sy.m09.d11:syMA.commemoration01.poem.verse43	@ltx/en_us_dedes/sy.m09.d11:syMA.commemoration01.poem.verse43
ltx/en_us_public/sy.m09.d11:syMA.commemoration01.poem.verse44	@ltx/en_us_dedes/sy.m09.d11:syMA.commemoration01.poem.verse44
ltx/en_us_public/sy.m09.d11:syMA.commemoration01.poem.verse45	@ltx/en_us_dedes/sy.m09.d11:syMA.commemoration01.poem.verse45
ltx/en_us_public/sy.m09.d11:syMA.commemoration01.single1	@ltx/en_us_dedes/sy.m09.d11:syMA.commemoration01.single1
ltx/en_us_public/sy.m09.d11:syMA.commemoration01.text	@ltx/en_us_dedes/sy.m09.d11:syMA.commemoration01.text
ltx/en_us_public/sy.m09.d11:syMA.commemoration02.narration.p01	@ltx/en_us_dedes/sy.m09.d11:syMA.commemoration02.narration.p01
ltx/en_us_public/sy.m09.d11:syMA.commemoration02.narration.p02	@ltx/en_us_dedes/sy.m09.d11:syMA.commemoration02.narration.p02
ltx/en_us_public/sy.m09.d11:syMA.commemoration02.narration.p03	@ltx/en_us_dedes/sy.m09.d11:syMA.commemoration02.narration.p03
ltx/en_us_public/sy.m09.d11:syMA.commemoration02.narration.p04	@ltx/en_us_dedes/sy.m09.d11:syMA.commemoration02.narration.p04
ltx/en_us_public/sy.m09.d11:syMA.commemoration02.narration.p05	@ltx/en_us_dedes/sy.m09.d11:syMA.commemoration02.narration.p05
ltx/en_us_public/sy.m09.d11:syMA.commemoration02.text	@ltx/en_us_dedes/sy.m09.d11:syMA.commemoration02.text
ltx/en_us_public/sy.m09.d11:syMA.commemoration03.couplet1.title	@ltx/en_us_dedes/sy.m09.d11:syMA.commemoration03.couplet1.title
ltx/en_us_public/sy.m09.d11:syMA.commemoration03.couplet1.verse1	@ltx/en_us_dedes/sy.m09.d11:syMA.commemoration03.couplet1.verse1
ltx/en_us_public/sy.m09.d11:syMA.commemoration03.couplet1.verse2	@ltx/en_us_dedes/sy.m09.d11:syMA.commemoration03.couplet1.verse2
ltx/en_us_public/sy.m09.d11:syMA.commemoration03.narration.p01	@ltx/en_us_dedes/sy.m09.d11:syMA.commemoration03.narration.p01
ltx/en_us_public/sy.m09.d11:syMA.commemoration03.text	@ltx/en_us_dedes/sy.m09.d11:syMA.commemoration03.text
ltx/en_us_public/sy.m09.d11:syMA.commemoration04.couplet1.title	@ltx/en_us_dedes/sy.m09.d11:syMA.commemoration04.couplet1.title
ltx/en_us_public/sy.m09.d11:syMA.commemoration04.couplet1.verse1	@ltx/en_us_dedes/sy.m09.d11:syMA.commemoration04.couplet1.verse1
ltx/en_us_public/sy.m09.d11:syMA.commemoration04.couplet1.verse2	@ltx/en_us_dedes/sy.m09.d11:syMA.commemoration04.couplet1.verse2
ltx/en_us_public/sy.m09.d11:syMA.commemoration04.narration.p01	@ltx/en_us_dedes/sy.m09.d11:syMA.commemoration04.narration.p01
ltx/en_us_public/sy.m09.d11:syMA.commemoration04.text	@ltx/en_us_dedes/sy.m09.d11:syMA.commemoration04.text
ltx/en_us_public/sy.m09.d11:syMA.lastline	@ltx/en_us_dedes/sy.m09.d11:syMA.lastline
ltx/en_us_public/sy.m09.d11:syMA.note1	@ltx/en_us_dedes/sy.m09.d11:syMA.note1
