ltx/en_us_public/le.go.mc.d111:lemcLI.Gospel.book_abbr	@ltx/en_us_rsv/le.go.mc.d111:lemcLI.Gospel.book_abbr
ltx/en_us_public/le.go.mc.d111:lemcLI.Gospel.book_string	@ltx/en_us_rsv/le.go.mc.d111:lemcLI.Gospel.book_string
ltx/en_us_public/le.go.mc.d111:lemcLI.Gospel.chapverse	@ltx/en_us_rsv/le.go.mc.d111:lemcLI.Gospel.chapverse
ltx/en_us_public/le.go.mc.d111:lemcLI.Gospel.incipit	@ltx/en_us_rsv/le.go.mc.d111:lemcLI.Gospel.incipit
ltx/en_us_public/le.go.mc.d111:lemcLI.Gospel.text	@ltx/en_us_rsv/le.go.mc.d111:lemcLI.Gospel.text
ltx/en_us_public/le.go.mc.d111:lemcLI.Gospel.title	@ltx/en_us_rsv/le.go.mc.d111:lemcLI.Gospel.title
ltx/en_us_public/le.go.mc.d111:lemcLI.Gospel.title_abbr	@ltx/en_us_rsv/le.go.mc.d111:lemcLI.Gospel.title_abbr
ltx/en_us_public/le.go.mc.d111:lemcLI.Gospel.version	@ltx/en_us_rsv/le.go.mc.d111:lemcLI.Gospel.version
