ltx/en_us_public/le.ep.va.museum:levaMU.Epistle1.book_abbr	@ltx/en_us_rsv/le.ep.va.museum:levaMU.Epistle1.book_abbr
ltx/en_us_public/le.ep.va.museum:levaMU.Epistle1.book_string	@ltx/en_us_rsv/le.ep.va.museum:levaMU.Epistle1.book_string
ltx/en_us_public/le.ep.va.museum:levaMU.Epistle1.chapverse	@ltx/en_us_rsv/le.ep.va.museum:levaMU.Epistle1.chapverse
ltx/en_us_public/le.ep.va.museum:levaMU.Epistle1.incipit	@ltx/en_us_rsv/le.ep.va.museum:levaMU.Epistle1.incipit
ltx/en_us_public/le.ep.va.museum:levaMU.Epistle1.text	@ltx/en_us_rsv/le.ep.va.museum:levaMU.Epistle1.text
ltx/en_us_public/le.ep.va.museum:levaMU.Epistle1.title	@ltx/en_us_rsv/le.ep.va.museum:levaMU.Epistle1.title
ltx/en_us_public/le.ep.va.museum:levaMU.Epistle1.title_abbr	@ltx/en_us_rsv/le.ep.va.museum:levaMU.Epistle1.title_abbr
ltx/en_us_public/le.ep.va.museum:levaMU.Epistle1.version	@ltx/en_us_rsv/le.ep.va.museum:levaMU.Epistle1.version
