ltx/en_us_public/sy.m10.d30:syMA.commemoration01.couplet1.title	@ltx/en_us_dedes/sy.m10.d30:syMA.commemoration01.couplet1.title
ltx/en_us_public/sy.m10.d30:syMA.commemoration01.couplet1.verse1	@ltx/en_us_dedes/sy.m10.d30:syMA.commemoration01.couplet1.verse1
ltx/en_us_public/sy.m10.d30:syMA.commemoration01.couplet1.verse2	@ltx/en_us_dedes/sy.m10.d30:syMA.commemoration01.couplet1.verse2
ltx/en_us_public/sy.m10.d30:syMA.commemoration01.narration.p01	@ltx/en_us_dedes/sy.m10.d30:syMA.commemoration01.narration.p01
ltx/en_us_public/sy.m10.d30:syMA.commemoration01.single1	@ltx/en_us_dedes/sy.m10.d30:syMA.commemoration01.single1
ltx/en_us_public/sy.m10.d30:syMA.commemoration01.text	@ltx/en_us_dedes/sy.m10.d30:syMA.commemoration01.text
ltx/en_us_public/sy.m10.d30:syMA.commemoration02.couplet1.title	@ltx/en_us_dedes/sy.m10.d30:syMA.commemoration02.couplet1.title
ltx/en_us_public/sy.m10.d30:syMA.commemoration02.couplet1.verse1	@ltx/en_us_dedes/sy.m10.d30:syMA.commemoration02.couplet1.verse1
ltx/en_us_public/sy.m10.d30:syMA.commemoration02.couplet1.verse2	@ltx/en_us_dedes/sy.m10.d30:syMA.commemoration02.couplet1.verse2
ltx/en_us_public/sy.m10.d30:syMA.commemoration02.narration.p01	@ltx/en_us_dedes/sy.m10.d30:syMA.commemoration02.narration.p01
ltx/en_us_public/sy.m10.d30:syMA.commemoration02.text	@ltx/en_us_dedes/sy.m10.d30:syMA.commemoration02.text
ltx/en_us_public/sy.m10.d30:syMA.commemoration03.couplet1.title	@ltx/en_us_dedes/sy.m10.d30:syMA.commemoration03.couplet1.title
ltx/en_us_public/sy.m10.d30:syMA.commemoration03.couplet1.verse1	@ltx/en_us_dedes/sy.m10.d30:syMA.commemoration03.couplet1.verse1
ltx/en_us_public/sy.m10.d30:syMA.commemoration03.couplet1.verse2	@ltx/en_us_dedes/sy.m10.d30:syMA.commemoration03.couplet1.verse2
ltx/en_us_public/sy.m10.d30:syMA.commemoration03.couplet2.verse1	@ltx/en_us_dedes/sy.m10.d30:syMA.commemoration03.couplet2.verse1
ltx/en_us_public/sy.m10.d30:syMA.commemoration03.couplet2.verse2	@ltx/en_us_dedes/sy.m10.d30:syMA.commemoration03.couplet2.verse2
ltx/en_us_public/sy.m10.d30:syMA.commemoration03.couplet3.verse1	@ltx/en_us_dedes/sy.m10.d30:syMA.commemoration03.couplet3.verse1
ltx/en_us_public/sy.m10.d30:syMA.commemoration03.couplet3.verse2	@ltx/en_us_dedes/sy.m10.d30:syMA.commemoration03.couplet3.verse2
ltx/en_us_public/sy.m10.d30:syMA.commemoration03.narration.p01	@ltx/en_us_dedes/sy.m10.d30:syMA.commemoration03.narration.p01
ltx/en_us_public/sy.m10.d30:syMA.commemoration03.text	@ltx/en_us_dedes/sy.m10.d30:syMA.commemoration03.text
ltx/en_us_public/sy.m10.d30:syMA.commemoration04.couplet1.title	@ltx/en_us_dedes/sy.m10.d30:syMA.commemoration04.couplet1.title
ltx/en_us_public/sy.m10.d30:syMA.commemoration04.couplet1.verse1	@ltx/en_us_dedes/sy.m10.d30:syMA.commemoration04.couplet1.verse1
ltx/en_us_public/sy.m10.d30:syMA.commemoration04.couplet1.verse2	@ltx/en_us_dedes/sy.m10.d30:syMA.commemoration04.couplet1.verse2
ltx/en_us_public/sy.m10.d30:syMA.commemoration04.narration.p01	@ltx/en_us_dedes/sy.m10.d30:syMA.commemoration04.narration.p01
ltx/en_us_public/sy.m10.d30:syMA.commemoration04.text	@ltx/en_us_dedes/sy.m10.d30:syMA.commemoration04.text
ltx/en_us_public/sy.m10.d30:syMA.commemoration05.couplet1.title	@ltx/en_us_dedes/sy.m10.d30:syMA.commemoration05.couplet1.title
ltx/en_us_public/sy.m10.d30:syMA.commemoration05.couplet1.verse1	@ltx/en_us_dedes/sy.m10.d30:syMA.commemoration05.couplet1.verse1
ltx/en_us_public/sy.m10.d30:syMA.commemoration05.couplet1.verse2	@ltx/en_us_dedes/sy.m10.d30:syMA.commemoration05.couplet1.verse2
ltx/en_us_public/sy.m10.d30:syMA.commemoration05.couplet2.verse1	@ltx/en_us_dedes/sy.m10.d30:syMA.commemoration05.couplet2.verse1
ltx/en_us_public/sy.m10.d30:syMA.commemoration05.couplet2.verse2	@ltx/en_us_dedes/sy.m10.d30:syMA.commemoration05.couplet2.verse2
ltx/en_us_public/sy.m10.d30:syMA.commemoration05.couplet3.verse1	@ltx/en_us_dedes/sy.m10.d30:syMA.commemoration05.couplet3.verse1
ltx/en_us_public/sy.m10.d30:syMA.commemoration05.couplet3.verse2	@ltx/en_us_dedes/sy.m10.d30:syMA.commemoration05.couplet3.verse2
ltx/en_us_public/sy.m10.d30:syMA.commemoration05.couplet4.verse1	@ltx/en_us_dedes/sy.m10.d30:syMA.commemoration05.couplet4.verse1
ltx/en_us_public/sy.m10.d30:syMA.commemoration05.couplet4.verse2	@ltx/en_us_dedes/sy.m10.d30:syMA.commemoration05.couplet4.verse2
ltx/en_us_public/sy.m10.d30:syMA.commemoration05.narration.p01	@ltx/en_us_dedes/sy.m10.d30:syMA.commemoration05.narration.p01
ltx/en_us_public/sy.m10.d30:syMA.commemoration05.narration.p02	@ltx/en_us_dedes/sy.m10.d30:syMA.commemoration05.narration.p02
ltx/en_us_public/sy.m10.d30:syMA.commemoration05.narration.p03	@ltx/en_us_dedes/sy.m10.d30:syMA.commemoration05.narration.p03
ltx/en_us_public/sy.m10.d30:syMA.commemoration05.narration.p04	@ltx/en_us_dedes/sy.m10.d30:syMA.commemoration05.narration.p04
ltx/en_us_public/sy.m10.d30:syMA.commemoration05.narration.p05	@ltx/en_us_dedes/sy.m10.d30:syMA.commemoration05.narration.p05
ltx/en_us_public/sy.m10.d30:syMA.commemoration05.narration.p06	@ltx/en_us_dedes/sy.m10.d30:syMA.commemoration05.narration.p06
ltx/en_us_public/sy.m10.d30:syMA.commemoration05.narration.p07	@ltx/en_us_dedes/sy.m10.d30:syMA.commemoration05.narration.p07
ltx/en_us_public/sy.m10.d30:syMA.commemoration05.text	@ltx/en_us_dedes/sy.m10.d30:syMA.commemoration05.text
ltx/en_us_public/sy.m10.d30:syMA.commemoration06.couplet1.title	@ltx/en_us_dedes/sy.m10.d30:syMA.commemoration06.couplet1.title
ltx/en_us_public/sy.m10.d30:syMA.commemoration06.couplet1.verse1	@ltx/en_us_dedes/sy.m10.d30:syMA.commemoration06.couplet1.verse1
ltx/en_us_public/sy.m10.d30:syMA.commemoration06.couplet1.verse2	@ltx/en_us_dedes/sy.m10.d30:syMA.commemoration06.couplet1.verse2
ltx/en_us_public/sy.m10.d30:syMA.commemoration06.narration.p01	@ltx/en_us_dedes/sy.m10.d30:syMA.commemoration06.narration.p01
ltx/en_us_public/sy.m10.d30:syMA.commemoration06.narration.p02	@ltx/en_us_dedes/sy.m10.d30:syMA.commemoration06.narration.p02
ltx/en_us_public/sy.m10.d30:syMA.commemoration06.narration.p03	@ltx/en_us_dedes/sy.m10.d30:syMA.commemoration06.narration.p03
ltx/en_us_public/sy.m10.d30:syMA.commemoration06.narration.p04	@ltx/en_us_dedes/sy.m10.d30:syMA.commemoration06.narration.p04
ltx/en_us_public/sy.m10.d30:syMA.commemoration06.text	@ltx/en_us_dedes/sy.m10.d30:syMA.commemoration06.text
ltx/en_us_public/sy.m10.d30:syMA.lastline	@ltx/en_us_dedes/sy.m10.d30:syMA.lastline
