ltx/en_us_public/le.ep.me.m09.d03:lemeLI.Epistle.book_abbr	@ltx/en_us_rsv/le.ep.me.m09.d03:lemeLI.Epistle.book_abbr
ltx/en_us_public/le.ep.me.m09.d03:lemeLI.Epistle.book_string	@ltx/en_us_rsv/le.ep.me.m09.d03:lemeLI.Epistle.book_string
ltx/en_us_public/le.ep.me.m09.d03:lemeLI.Epistle.chapverse	@ltx/en_us_rsv/le.ep.me.m09.d03:lemeLI.Epistle.chapverse
ltx/en_us_public/le.ep.me.m09.d03:lemeLI.Epistle.incipit	@ltx/en_us_rsv/le.ep.me.m09.d03:lemeLI.Epistle.incipit
ltx/en_us_public/le.ep.me.m09.d03:lemeLI.Epistle.text	@ltx/en_us_rsv/le.ep.me.m09.d03:lemeLI.Epistle.text
ltx/en_us_public/le.ep.me.m09.d03:lemeLI.Epistle.title	@ltx/en_us_rsv/le.ep.me.m09.d03:lemeLI.Epistle.title
ltx/en_us_public/le.ep.me.m09.d03:lemeLI.Epistle.title_abbr	@ltx/en_us_rsv/le.ep.me.m09.d03:lemeLI.Epistle.title_abbr
ltx/en_us_public/le.ep.me.m09.d03:lemeLI.Epistle.version	@ltx/en_us_rsv/le.ep.me.m09.d03:lemeLI.Epistle.version
ltx/en_us_public/le.ep.me.m09.d03:lemeLI.Epistle2.book_abbr	@ltx/en_us_rsv/le.ep.me.m09.d03:lemeLI.Epistle2.book_abbr
ltx/en_us_public/le.ep.me.m09.d03:lemeLI.Epistle2.book_string	@ltx/en_us_rsv/le.ep.me.m09.d03:lemeLI.Epistle2.book_string
ltx/en_us_public/le.ep.me.m09.d03:lemeLI.Epistle2.chapverse	@ltx/en_us_rsv/le.ep.me.m09.d03:lemeLI.Epistle2.chapverse
ltx/en_us_public/le.ep.me.m09.d03:lemeLI.Epistle2.incipit	@ltx/en_us_rsv/le.ep.me.m09.d03:lemeLI.Epistle2.incipit
ltx/en_us_public/le.ep.me.m09.d03:lemeLI.Epistle2.text	@ltx/en_us_rsv/le.ep.me.m09.d03:lemeLI.Epistle2.text
ltx/en_us_public/le.ep.me.m09.d03:lemeLI.Epistle2.title	@ltx/en_us_rsv/le.ep.me.m09.d03:lemeLI.Epistle2.title
ltx/en_us_public/le.ep.me.m09.d03:lemeLI.Epistle2.title_abbr	@ltx/en_us_rsv/le.ep.me.m09.d03:lemeLI.Epistle2.title_abbr
ltx/en_us_public/le.ep.me.m09.d03:lemeLI.Epistle2.version	@ltx/en_us_rsv/le.ep.me.m09.d03:lemeLI.Epistle2.version
