ltx/en_us_public/sy.m06.d09:syMA.commemoration01.couplet1.title	@ltx/en_us_dedes/sy.m06.d09:syMA.commemoration01.couplet1.title
ltx/en_us_public/sy.m06.d09:syMA.commemoration01.couplet1.verse1	@ltx/en_us_dedes/sy.m06.d09:syMA.commemoration01.couplet1.verse1
ltx/en_us_public/sy.m06.d09:syMA.commemoration01.couplet1.verse2	@ltx/en_us_dedes/sy.m06.d09:syMA.commemoration01.couplet1.verse2
ltx/en_us_public/sy.m06.d09:syMA.commemoration01.single1	@ltx/en_us_dedes/sy.m06.d09:syMA.commemoration01.single1
ltx/en_us_public/sy.m06.d09:syMA.commemoration01.text	@ltx/en_us_dedes/sy.m06.d09:syMA.commemoration01.text
ltx/en_us_public/sy.m06.d09:syMA.lastline	@ltx/en_us_dedes/sy.m06.d09:syMA.lastline
