ltx/en_us_public/he.ga:heGA.ApostoleAgie.incipit	@ltx/en_us_dedes/he.ga:heGA.ApostoleAgie.incipit
ltx/en_us_public/he.ga:heGA.ApostoleAgie.melody	@ltx/en_us_dedes/he.ga:heGA.ApostoleAgie.melody
ltx/en_us_public/he.ga:heGA.ApostoleAgie.mode	@ltx/en_us_dedes/he.ga:heGA.ApostoleAgie.mode
ltx/en_us_public/he.ga:heGA.ApostoleAgie.name	@ltx/en_us_dedes/he.ga:heGA.ApostoleAgie.name
ltx/en_us_public/he.ga:heGA.ApostoleAgie.text1	@ltx/en_us_dedes/he.ga:heGA.ApostoleAgie.text1
ltx/en_us_public/he.ga:heGA.ApostoleAgie.text1a	@ltx/en_us_dedes/he.ga:heGA.ApostoleAgie.text1a
ltx/en_us_public/he.ga:heGA.ApostoleAgie.text2	@ltx/en_us_dedes/he.ga:heGA.ApostoleAgie.text2
ltx/en_us_public/he.ga:heGA.ApostoloiAgioi.incipit	@ltx/en_us_dedes/he.ga:heGA.ApostoloiAgioi.incipit
ltx/en_us_public/he.ga:heGA.ApostoloiAgioi.melody	@ltx/en_us_dedes/he.ga:heGA.ApostoloiAgioi.melody
ltx/en_us_public/he.ga:heGA.ApostoloiAgioi.mode	@ltx/en_us_dedes/he.ga:heGA.ApostoloiAgioi.mode
ltx/en_us_public/he.ga:heGA.ApostoloiAgioi.name	@ltx/en_us_dedes/he.ga:heGA.ApostoloiAgioi.name
ltx/en_us_public/he.ga:heGA.ApostoloiAgioi.text	@ltx/en_us_dedes/he.ga:heGA.ApostoloiAgioi.text
ltx/en_us_public/he.ga:heGA.ChristotitaEkdidachtheis.incipit	@ltx/en_us_dedes/he.ga:heGA.ChristotitaEkdidachtheis.incipit
ltx/en_us_public/he.ga:heGA.ChristotitaEkdidachtheis.melody	@ltx/en_us_dedes/he.ga:heGA.ChristotitaEkdidachtheis.melody
ltx/en_us_public/he.ga:heGA.ChristotitaEkdidachtheis.mode	@ltx/en_us_dedes/he.ga:heGA.ChristotitaEkdidachtheis.mode
ltx/en_us_public/he.ga:heGA.ChristotitaEkdidachtheis.name	@ltx/en_us_dedes/he.ga:heGA.ChristotitaEkdidachtheis.name
ltx/en_us_public/he.ga:heGA.ChristotitaEkdidachtheis.text1	@ltx/en_us_dedes/he.ga:heGA.ChristotitaEkdidachtheis.text1
ltx/en_us_public/he.ga:heGA.ChristotitaEkdidachtheis.text2	@ltx/en_us_dedes/he.ga:heGA.ChristotitaEkdidachtheis.text2
ltx/en_us_public/he.ga:heGA.EnSoiMiterAkrivos.incipit	@ltx/en_us_dedes/he.ga:heGA.EnSoiMiterAkrivos.incipit
ltx/en_us_public/he.ga:heGA.EnSoiMiterAkrivos.melody	@ltx/en_us_dedes/he.ga:heGA.EnSoiMiterAkrivos.melody
ltx/en_us_public/he.ga:heGA.EnSoiMiterAkrivos.mode	@ltx/en_us_dedes/he.ga:heGA.EnSoiMiterAkrivos.mode
ltx/en_us_public/he.ga:heGA.EnSoiMiterAkrivos.name	@ltx/en_us_dedes/he.ga:heGA.EnSoiMiterAkrivos.name
ltx/en_us_public/he.ga:heGA.EnSoiMiterAkrivos.text1	@ltx/en_us_dedes/he.ga:heGA.EnSoiMiterAkrivos.text1
ltx/en_us_public/he.ga:heGA.EnSoiMiterAkrivos.text2	@ltx/en_us_dedes/he.ga:heGA.EnSoiMiterAkrivos.text2
ltx/en_us_public/he.ga:heGA.EnSoiPaterAkrivos.incipit	@ltx/en_us_dedes/he.ga:heGA.EnSoiPaterAkrivos.incipit
ltx/en_us_public/he.ga:heGA.EnSoiPaterAkrivos.melody	@ltx/en_us_dedes/he.ga:heGA.EnSoiPaterAkrivos.melody
ltx/en_us_public/he.ga:heGA.EnSoiPaterAkrivos.mode	@ltx/en_us_dedes/he.ga:heGA.EnSoiPaterAkrivos.mode
ltx/en_us_public/he.ga:heGA.EnSoiPaterAkrivos.name	@ltx/en_us_dedes/he.ga:heGA.EnSoiPaterAkrivos.name
ltx/en_us_public/he.ga:heGA.EnSoiPaterAkrivos.text1	@ltx/en_us_dedes/he.ga:heGA.EnSoiPaterAkrivos.text1
ltx/en_us_public/he.ga:heGA.EnSoiPaterAkrivos.text2	@ltx/en_us_dedes/he.ga:heGA.EnSoiPaterAkrivos.text2
ltx/en_us_public/he.ga:heGA.IAmnasSou.greekmelody	@ltx/en_us_dedes/he.ga:heGA.IAmnasSou.greekmelody
ltx/en_us_public/he.ga:heGA.IAmnasSou.incipit	@ltx/en_us_dedes/he.ga:heGA.IAmnasSou.incipit
ltx/en_us_public/he.ga:heGA.IAmnasSou.melody	@ltx/en_us_dedes/he.ga:heGA.IAmnasSou.melody
ltx/en_us_public/he.ga:heGA.IAmnasSou.mode	@ltx/en_us_dedes/he.ga:heGA.IAmnasSou.mode
ltx/en_us_public/he.ga:heGA.IAmnasSou.name	@ltx/en_us_dedes/he.ga:heGA.IAmnasSou.name
ltx/en_us_public/he.ga:heGA.IAmnasSou.text	@ltx/en_us_dedes/he.ga:heGA.IAmnasSou.text
ltx/en_us_public/he.ga:heGA.KaiTroponMetochos.incipit	@ltx/en_us_dedes/he.ga:heGA.KaiTroponMetochos.incipit
ltx/en_us_public/he.ga:heGA.KaiTroponMetochos.melody	@ltx/en_us_dedes/he.ga:heGA.KaiTroponMetochos.melody
ltx/en_us_public/he.ga:heGA.KaiTroponMetochos.mode	@ltx/en_us_dedes/he.ga:heGA.KaiTroponMetochos.mode
ltx/en_us_public/he.ga:heGA.KaiTroponMetochos.name	@ltx/en_us_dedes/he.ga:heGA.KaiTroponMetochos.name
ltx/en_us_public/he.ga:heGA.KaiTroponMetochos.text1	@ltx/en_us_dedes/he.ga:heGA.KaiTroponMetochos.text1
ltx/en_us_public/he.ga:heGA.KaiTroponMetochos.text2	@ltx/en_us_dedes/he.ga:heGA.KaiTroponMetochos.text2
ltx/en_us_public/he.ga:heGA.KanonaPisteos.incipit	@ltx/en_us_dedes/he.ga:heGA.KanonaPisteos.incipit
ltx/en_us_public/he.ga:heGA.KanonaPisteos.melody	@ltx/en_us_dedes/he.ga:heGA.KanonaPisteos.melody
ltx/en_us_public/he.ga:heGA.KanonaPisteos.mode	@ltx/en_us_dedes/he.ga:heGA.KanonaPisteos.mode
ltx/en_us_public/he.ga:heGA.KanonaPisteos.name	@ltx/en_us_dedes/he.ga:heGA.KanonaPisteos.name
ltx/en_us_public/he.ga:heGA.KanonaPisteos.text1	@ltx/en_us_dedes/he.ga:heGA.KanonaPisteos.text1
ltx/en_us_public/he.ga:heGA.KanonaPisteos.text2	@ltx/en_us_dedes/he.ga:heGA.KanonaPisteos.text2
ltx/en_us_public/he.ga:heGA.OMartysSouKyrie.greekmelody	@ltx/en_us_dedes/he.ga:heGA.OMartysSouKyrie.greekmelody
ltx/en_us_public/he.ga:heGA.OMartysSouKyrie.incipit	@ltx/en_us_dedes/he.ga:heGA.OMartysSouKyrie.incipit
ltx/en_us_public/he.ga:heGA.OMartysSouKyrie.melody	@ltx/en_us_dedes/he.ga:heGA.OMartysSouKyrie.melody
ltx/en_us_public/he.ga:heGA.OMartysSouKyrie.mode	@ltx/en_us_dedes/he.ga:heGA.OMartysSouKyrie.mode
ltx/en_us_public/he.ga:heGA.OMartysSouKyrie.name	@ltx/en_us_dedes/he.ga:heGA.OMartysSouKyrie.name
ltx/en_us_public/he.ga:heGA.OMartysSouKyrie.text	@ltx/en_us_dedes/he.ga:heGA.OMartysSouKyrie.text
ltx/en_us_public/he.ga:heGA.OTheosTonPateronImon.incipit	@ltx/en_us_dedes/he.ga:heGA.OTheosTonPateronImon.incipit
ltx/en_us_public/he.ga:heGA.OTheosTonPateronImon.melody	@ltx/en_us_dedes/he.ga:heGA.OTheosTonPateronImon.melody
ltx/en_us_public/he.ga:heGA.OTheosTonPateronImon.mode	@ltx/en_us_dedes/he.ga:heGA.OTheosTonPateronImon.mode
ltx/en_us_public/he.ga:heGA.OTheosTonPateronImon.name	@ltx/en_us_dedes/he.ga:heGA.OTheosTonPateronImon.name
ltx/en_us_public/he.ga:heGA.OTheosTonPateronImon.text	@ltx/en_us_dedes/he.ga:heGA.OTheosTonPateronImon.text
ltx/en_us_public/he.ga:heGA.OiMartyresSouKyrie.greekmelody	@ltx/en_us_dedes/he.ga:heGA.OiMartyresSouKyrie.greekmelody
ltx/en_us_public/he.ga:heGA.OiMartyresSouKyrie.incipit	@ltx/en_us_dedes/he.ga:heGA.OiMartyresSouKyrie.incipit
ltx/en_us_public/he.ga:heGA.OiMartyresSouKyrie.melody	@ltx/en_us_dedes/he.ga:heGA.OiMartyresSouKyrie.melody
ltx/en_us_public/he.ga:heGA.OiMartyresSouKyrie.mode	@ltx/en_us_dedes/he.ga:heGA.OiMartyresSouKyrie.mode
ltx/en_us_public/he.ga:heGA.OiMartyresSouKyrie.name	@ltx/en_us_dedes/he.ga:heGA.OiMartyresSouKyrie.name
ltx/en_us_public/he.ga:heGA.OiMartyresSouKyrie.text	@ltx/en_us_dedes/he.ga:heGA.OiMartyresSouKyrie.text
ltx/en_us_public/he.ga:heGA.OrthodoxiasOdigeH.incipit	@ltx/en_us_dedes/he.ga:heGA.OrthodoxiasOdigeH.incipit
ltx/en_us_public/he.ga:heGA.OrthodoxiasOdigeH.melody	@ltx/en_us_dedes/he.ga:heGA.OrthodoxiasOdigeH.melody
ltx/en_us_public/he.ga:heGA.OrthodoxiasOdigeH.mode	@ltx/en_us_dedes/he.ga:heGA.OrthodoxiasOdigeH.mode
ltx/en_us_public/he.ga:heGA.OrthodoxiasOdigeH.name	@ltx/en_us_dedes/he.ga:heGA.OrthodoxiasOdigeH.name
ltx/en_us_public/he.ga:heGA.OrthodoxiasOdigeH.text1	@ltx/en_us_dedes/he.ga:heGA.OrthodoxiasOdigeH.text1
ltx/en_us_public/he.ga:heGA.OrthodoxiasOdigeH.text2	@ltx/en_us_dedes/he.ga:heGA.OrthodoxiasOdigeH.text2
ltx/en_us_public/he.ga:heGA.OrthodoxiasOdigeM.incipit	@ltx/en_us_dedes/he.ga:heGA.OrthodoxiasOdigeM.incipit
ltx/en_us_public/he.ga:heGA.OrthodoxiasOdigeM.melody	@ltx/en_us_dedes/he.ga:heGA.OrthodoxiasOdigeM.melody
ltx/en_us_public/he.ga:heGA.OrthodoxiasOdigeM.mode	@ltx/en_us_dedes/he.ga:heGA.OrthodoxiasOdigeM.mode
ltx/en_us_public/he.ga:heGA.OrthodoxiasOdigeM.name	@ltx/en_us_dedes/he.ga:heGA.OrthodoxiasOdigeM.name
ltx/en_us_public/he.ga:heGA.OrthodoxiasOdigeM.text1	@ltx/en_us_dedes/he.ga:heGA.OrthodoxiasOdigeM.text1
ltx/en_us_public/he.ga:heGA.OrthodoxiasOdigeM.text2	@ltx/en_us_dedes/he.ga:heGA.OrthodoxiasOdigeM.text2
ltx/en_us_public/he.ga:heGA.TaisTonDakryonSou.incipit	@ltx/en_us_dedes/he.ga:heGA.TaisTonDakryonSou.incipit
ltx/en_us_public/he.ga:heGA.TaisTonDakryonSou.melody	@ltx/en_us_dedes/he.ga:heGA.TaisTonDakryonSou.melody
ltx/en_us_public/he.ga:heGA.TaisTonDakryonSou.mode	@ltx/en_us_dedes/he.ga:heGA.TaisTonDakryonSou.mode
ltx/en_us_public/he.ga:heGA.TaisTonDakryonSou.name	@ltx/en_us_dedes/he.ga:heGA.TaisTonDakryonSou.name
ltx/en_us_public/he.ga:heGA.TaisTonDakryonSou.text1	@ltx/en_us_dedes/he.ga:heGA.TaisTonDakryonSou.text1
ltx/en_us_public/he.ga:heGA.TaisTonDakryonSou.text2	@ltx/en_us_dedes/he.ga:heGA.TaisTonDakryonSou.text2
ltx/en_us_public/he.ga:heGA.TasAlgidonas.incipit	@ltx/en_us_dedes/he.ga:heGA.TasAlgidonas.incipit
ltx/en_us_public/he.ga:heGA.TasAlgidonas.melody	@ltx/en_us_dedes/he.ga:heGA.TasAlgidonas.melody
ltx/en_us_public/he.ga:heGA.TasAlgidonas.mode	@ltx/en_us_dedes/he.ga:heGA.TasAlgidonas.mode
ltx/en_us_public/he.ga:heGA.TasAlgidonas.name	@ltx/en_us_dedes/he.ga:heGA.TasAlgidonas.name
ltx/en_us_public/he.ga:heGA.TasAlgidonas.text	@ltx/en_us_dedes/he.ga:heGA.TasAlgidonas.text
ltx/en_us_public/he.ga:heGA.TisErimouPolitis.greekmelody	@ltx/en_us_dedes/he.ga:heGA.TisErimouPolitis.greekmelody
ltx/en_us_public/he.ga:heGA.TisErimouPolitis.incipit	@ltx/en_us_dedes/he.ga:heGA.TisErimouPolitis.incipit
ltx/en_us_public/he.ga:heGA.TisErimouPolitis.melody	@ltx/en_us_dedes/he.ga:heGA.TisErimouPolitis.melody
ltx/en_us_public/he.ga:heGA.TisErimouPolitis.mode	@ltx/en_us_dedes/he.ga:heGA.TisErimouPolitis.mode
ltx/en_us_public/he.ga:heGA.TisErimouPolitis.name	@ltx/en_us_dedes/he.ga:heGA.TisErimouPolitis.name
ltx/en_us_public/he.ga:heGA.TisErimouPolitis.text1	@ltx/en_us_dedes/he.ga:heGA.TisErimouPolitis.text1
ltx/en_us_public/he.ga:heGA.TisErimouPolitis.text2	@ltx/en_us_dedes/he.ga:heGA.TisErimouPolitis.text2
ltx/en_us_public/he.ga:heGA.TouProfitouSou.incipit	@ltx/en_us_dedes/he.ga:heGA.TouProfitouSou.incipit
ltx/en_us_public/he.ga:heGA.TouProfitouSou.melody	@ltx/en_us_dedes/he.ga:heGA.TouProfitouSou.melody
ltx/en_us_public/he.ga:heGA.TouProfitouSou.mode	@ltx/en_us_dedes/he.ga:heGA.TouProfitouSou.mode
ltx/en_us_public/he.ga:heGA.TouProfitouSou.name	@ltx/en_us_dedes/he.ga:heGA.TouProfitouSou.name
ltx/en_us_public/he.ga:heGA.TouProfitouSou.text1	@ltx/en_us_dedes/he.ga:heGA.TouProfitouSou.text1
ltx/en_us_public/he.ga:heGA.TouProfitouSou.text2	@ltx/en_us_dedes/he.ga:heGA.TouProfitouSou.text2
ltx/en_us_public/he.ga:heGA.YpomonisStylos.incipit	@ltx/en_us_dedes/he.ga:heGA.YpomonisStylos.incipit
ltx/en_us_public/he.ga:heGA.YpomonisStylos.melody	@ltx/en_us_dedes/he.ga:heGA.YpomonisStylos.melody
ltx/en_us_public/he.ga:heGA.YpomonisStylos.mode	@ltx/en_us_dedes/he.ga:heGA.YpomonisStylos.mode
ltx/en_us_public/he.ga:heGA.YpomonisStylos.name	@ltx/en_us_dedes/he.ga:heGA.YpomonisStylos.name
ltx/en_us_public/he.ga:heGA.YpomonisStylos.text1	@ltx/en_us_dedes/he.ga:heGA.YpomonisStylos.text1
ltx/en_us_public/he.ga:heGA.YpomonisStylos.text2	@ltx/en_us_dedes/he.ga:heGA.YpomonisStylos.text2
ltx/en_us_public/he.ga:heGA.title	@ltx/en_us_dedes/he.ga:heGA.title
