ltx/en_us_public/hierarchs:archbishop.america.elpidophoros.away_fimi.text	@ltx/en_us_goa/hierarchs:archbishop.america.elpidophoros.away_fimi.text
ltx/en_us_public/hierarchs:archbishop.america.elpidophoros.commemoration.text	@ltx/en_us_goa/hierarchs:archbishop.america.elpidophoros.commemoration.text
ltx/en_us_public/hierarchs:archbishop.america.elpidophoros.entrance.text	@ltx/en_us_goa/hierarchs:archbishop.america.elpidophoros.entrance.text
ltx/en_us_public/hierarchs:archbishop.america.elpidophoros.fimi.text	@ltx/en_us_goa/hierarchs:archbishop.america.elpidophoros.fimi.text
ltx/en_us_public/hierarchs:archbishop.america.elpidophoros.pet06.text	@ltx/en_us_goa/hierarchs:archbishop.america.elpidophoros.pet06.text
ltx/en_us_public/hierarchs:archbishop.america.elpidophoros.pet19.text	@ltx/en_us_goa/hierarchs:archbishop.america.elpidophoros.pet19.text
ltx/en_us_public/hierarchs:archbishop.america.elpidophoros.petOrdination01a.text	@ltx/en_us_goa/hierarchs:archbishop.america.elpidophoros.petOrdination01a.text
ltx/en_us_public/hierarchs:bishop.constantine.commemoration.text	@ltx/en_us_goa/hierarchs:bishop.constantine.commemoration.text
ltx/en_us_public/hierarchs:bishop.constantine.denver.pet06.text	@ltx/en_us_goa/hierarchs:bishop.constantine.denver.pet06.text
ltx/en_us_public/hierarchs:bishop.constantine.denver.pet19.text	@ltx/en_us_goa/hierarchs:bishop.constantine.denver.pet19.text
ltx/en_us_public/hierarchs:bishop.constantine.denver.petOrdination01a.text	@ltx/en_us_goa/hierarchs:bishop.constantine.denver.petOrdination01a.text
ltx/en_us_public/hierarchs:bishop.joachim.commemoration.text	@ltx/en_us_goa/hierarchs:bishop.joachim.commemoration.text
ltx/en_us_public/hierarchs:bishop.joachim.dad.pet06.text	@ltx/en_us_goa/hierarchs:bishop.joachim.dad.pet06.text
ltx/en_us_public/hierarchs:bishop.joachim.dad.pet19.text	@ltx/en_us_goa/hierarchs:bishop.joachim.dad.pet19.text
ltx/en_us_public/hierarchs:bishop.joachim.dad.petOrdination01a.text	@ltx/en_us_goa/hierarchs:bishop.joachim.dad.petOrdination01a.text
ltx/en_us_public/hierarchs:bishop.timothy.chicago.pet06.text	@ltx/en_us_goa/hierarchs:bishop.timothy.chicago.pet06.text
ltx/en_us_public/hierarchs:bishop.timothy.chicago.pet19.text	@ltx/en_us_goa/hierarchs:bishop.timothy.chicago.pet19.text
ltx/en_us_public/hierarchs:bishop.timothy.chicago.petOrdination01a.text	@ltx/en_us_goa/hierarchs:bishop.timothy.chicago.petOrdination01a.text
ltx/en_us_public/hierarchs:bishop.timothy.commemoration.text	@ltx/en_us_goa/hierarchs:bishop.timothy.commemoration.text
ltx/en_us_public/hierarchs:metropolitan.atlanta.alexios.away_fimi.text	@ltx/en_us_goa/hierarchs:metropolitan.atlanta.alexios.away_fimi.text
ltx/en_us_public/hierarchs:metropolitan.atlanta.alexios.commemoration.text	@ltx/en_us_goa/hierarchs:metropolitan.atlanta.alexios.commemoration.text
ltx/en_us_public/hierarchs:metropolitan.atlanta.alexios.entrance.text	@ltx/en_us_goa/hierarchs:metropolitan.atlanta.alexios.entrance.text
ltx/en_us_public/hierarchs:metropolitan.atlanta.alexios.fimi.text	@ltx/en_us_goa/hierarchs:metropolitan.atlanta.alexios.fimi.text
ltx/en_us_public/hierarchs:metropolitan.atlanta.alexios.pet06.text	@ltx/en_us_goa/hierarchs:metropolitan.atlanta.alexios.pet06.text
ltx/en_us_public/hierarchs:metropolitan.atlanta.alexios.pet19.text	@ltx/en_us_goa/hierarchs:metropolitan.atlanta.alexios.pet19.text
ltx/en_us_public/hierarchs:metropolitan.atlanta.alexios.petOrdination01a.text	@ltx/en_us_goa/hierarchs:metropolitan.atlanta.alexios.petOrdination01a.text
ltx/en_us_public/hierarchs:metropolitan.boston.methodios.away_fimi.text	@ltx/en_us_goa/hierarchs:metropolitan.boston.methodios.away_fimi.text
ltx/en_us_public/hierarchs:metropolitan.boston.methodios.commemoration.text	@ltx/en_us_goa/hierarchs:metropolitan.boston.methodios.commemoration.text
ltx/en_us_public/hierarchs:metropolitan.boston.methodios.entrance.text	@ltx/en_us_goa/hierarchs:metropolitan.boston.methodios.entrance.text
ltx/en_us_public/hierarchs:metropolitan.boston.methodios.fimi.text	@ltx/en_us_goa/hierarchs:metropolitan.boston.methodios.fimi.text
ltx/en_us_public/hierarchs:metropolitan.boston.methodios.pet06.text	@ltx/en_us_goa/hierarchs:metropolitan.boston.methodios.pet06.text
ltx/en_us_public/hierarchs:metropolitan.boston.methodios.pet19.text	@ltx/en_us_goa/hierarchs:metropolitan.boston.methodios.pet19.text
ltx/en_us_public/hierarchs:metropolitan.boston.methodios.petOrdination01a.text	@ltx/en_us_goa/hierarchs:metropolitan.boston.methodios.petOrdination01a.text
ltx/en_us_public/hierarchs:metropolitan.chicago.nathanael.away_fimi.text	@ltx/en_us_goa/hierarchs:metropolitan.chicago.nathanael.away_fimi.text
ltx/en_us_public/hierarchs:metropolitan.chicago.nathanael.commemoration.text	@ltx/en_us_goa/hierarchs:metropolitan.chicago.nathanael.commemoration.text
ltx/en_us_public/hierarchs:metropolitan.chicago.nathanael.entrance.text	@ltx/en_us_goa/hierarchs:metropolitan.chicago.nathanael.entrance.text
ltx/en_us_public/hierarchs:metropolitan.chicago.nathanael.fimi.text	@ltx/en_us_goa/hierarchs:metropolitan.chicago.nathanael.fimi.text
ltx/en_us_public/hierarchs:metropolitan.chicago.nathanael.pet06.text	@ltx/en_us_goa/hierarchs:metropolitan.chicago.nathanael.pet06.text
ltx/en_us_public/hierarchs:metropolitan.chicago.nathanael.pet19.text	@ltx/en_us_goa/hierarchs:metropolitan.chicago.nathanael.pet19.text
ltx/en_us_public/hierarchs:metropolitan.chicago.nathanael.petOrdination01a.text	@ltx/en_us_goa/hierarchs:metropolitan.chicago.nathanael.petOrdination01a.text
ltx/en_us_public/hierarchs:metropolitan.denver.isaiah.away_fimi.text	@ltx/en_us_goa/hierarchs:metropolitan.denver.isaiah.away_fimi.text
ltx/en_us_public/hierarchs:metropolitan.denver.isaiah.commemoration.text	@ltx/en_us_goa/hierarchs:metropolitan.denver.isaiah.commemoration.text
ltx/en_us_public/hierarchs:metropolitan.denver.isaiah.entrance.text	@ltx/en_us_goa/hierarchs:metropolitan.denver.isaiah.entrance.text
ltx/en_us_public/hierarchs:metropolitan.denver.isaiah.fimi.text	@ltx/en_us_goa/hierarchs:metropolitan.denver.isaiah.fimi.text
ltx/en_us_public/hierarchs:metropolitan.denver.isaiah.pet06.text	@ltx/en_us_goa/hierarchs:metropolitan.denver.isaiah.pet06.text
ltx/en_us_public/hierarchs:metropolitan.denver.isaiah.pet19.text	@ltx/en_us_goa/hierarchs:metropolitan.denver.isaiah.pet19.text
ltx/en_us_public/hierarchs:metropolitan.denver.isaiah.petOrdination01a.text	@ltx/en_us_goa/hierarchs:metropolitan.denver.isaiah.petOrdination01a.text
ltx/en_us_public/hierarchs:metropolitan.detroit.nicholas.away_fimi.text	@ltx/en_us_goa/hierarchs:metropolitan.detroit.nicholas.away_fimi.text
ltx/en_us_public/hierarchs:metropolitan.detroit.nicholas.commemoration.text	@ltx/en_us_goa/hierarchs:metropolitan.detroit.nicholas.commemoration.text
ltx/en_us_public/hierarchs:metropolitan.detroit.nicholas.entrance.text	@ltx/en_us_goa/hierarchs:metropolitan.detroit.nicholas.entrance.text
ltx/en_us_public/hierarchs:metropolitan.detroit.nicholas.fimi.text	@ltx/en_us_goa/hierarchs:metropolitan.detroit.nicholas.fimi.text
ltx/en_us_public/hierarchs:metropolitan.detroit.nicholas.pet06.text	@ltx/en_us_goa/hierarchs:metropolitan.detroit.nicholas.pet06.text
ltx/en_us_public/hierarchs:metropolitan.detroit.nicholas.pet19.text	@ltx/en_us_goa/hierarchs:metropolitan.detroit.nicholas.pet19.text
ltx/en_us_public/hierarchs:metropolitan.detroit.nicholas.petOrdination01a.text	@ltx/en_us_goa/hierarchs:metropolitan.detroit.nicholas.petOrdination01a.text
ltx/en_us_public/hierarchs:metropolitan.newjersey.apostolos.away_fimi.text	@ltx/en_us_goa/hierarchs:metropolitan.newjersey.apostolos.away_fimi.text
ltx/en_us_public/hierarchs:metropolitan.newjersey.apostolos.commemoration.text	@ltx/en_us_goa/hierarchs:metropolitan.newjersey.apostolos.commemoration.text
ltx/en_us_public/hierarchs:metropolitan.newjersey.apostolos.entrance.text	@ltx/en_us_goa/hierarchs:metropolitan.newjersey.apostolos.entrance.text
ltx/en_us_public/hierarchs:metropolitan.newjersey.apostolos.fimi.text	@ltx/en_us_goa/hierarchs:metropolitan.newjersey.apostolos.fimi.text
ltx/en_us_public/hierarchs:metropolitan.newjersey.apostolos.pet06.text	@ltx/en_us_goa/hierarchs:metropolitan.newjersey.apostolos.pet06.text
ltx/en_us_public/hierarchs:metropolitan.newjersey.apostolos.pet19.text	@ltx/en_us_goa/hierarchs:metropolitan.newjersey.apostolos.pet19.text
ltx/en_us_public/hierarchs:metropolitan.newjersey.apostolos.petOrdination01a.text	@ltx/en_us_goa/hierarchs:metropolitan.newjersey.apostolos.petOrdination01a.text
ltx/en_us_public/hierarchs:metropolitan.pittsburgh.savas.away_fimi.text	@ltx/en_us_goa/hierarchs:metropolitan.pittsburgh.savas.away_fimi.text
ltx/en_us_public/hierarchs:metropolitan.pittsburgh.savas.commemoration.text	@ltx/en_us_goa/hierarchs:metropolitan.pittsburgh.savas.commemoration.text
ltx/en_us_public/hierarchs:metropolitan.pittsburgh.savas.entrance.text	@ltx/en_us_goa/hierarchs:metropolitan.pittsburgh.savas.entrance.text
ltx/en_us_public/hierarchs:metropolitan.pittsburgh.savas.fimi.text	@ltx/en_us_goa/hierarchs:metropolitan.pittsburgh.savas.fimi.text
ltx/en_us_public/hierarchs:metropolitan.pittsburgh.savas.pet06.text	@ltx/en_us_goa/hierarchs:metropolitan.pittsburgh.savas.pet06.text
ltx/en_us_public/hierarchs:metropolitan.pittsburgh.savas.pet19.text	@ltx/en_us_goa/hierarchs:metropolitan.pittsburgh.savas.pet19.text
ltx/en_us_public/hierarchs:metropolitan.pittsburgh.savas.petOrdination01a.text	@ltx/en_us_goa/hierarchs:metropolitan.pittsburgh.savas.petOrdination01a.text
ltx/en_us_public/hierarchs:metropolitan.sanfrancisco.gerasimos.away_fimi.text	@ltx/en_us_goa/hierarchs:metropolitan.sanfrancisco.gerasimos.away_fimi.text
ltx/en_us_public/hierarchs:metropolitan.sanfrancisco.gerasimos.commemoration.text	@ltx/en_us_goa/hierarchs:metropolitan.sanfrancisco.gerasimos.commemoration.text
ltx/en_us_public/hierarchs:metropolitan.sanfrancisco.gerasimos.entrance.text	@ltx/en_us_goa/hierarchs:metropolitan.sanfrancisco.gerasimos.entrance.text
ltx/en_us_public/hierarchs:metropolitan.sanfrancisco.gerasimos.fimi.text	@ltx/en_us_goa/hierarchs:metropolitan.sanfrancisco.gerasimos.fimi.text
ltx/en_us_public/hierarchs:metropolitan.sanfrancisco.gerasimos.pet06.text	@ltx/en_us_goa/hierarchs:metropolitan.sanfrancisco.gerasimos.pet06.text
ltx/en_us_public/hierarchs:metropolitan.sanfrancisco.gerasimos.pet19.text	@ltx/en_us_goa/hierarchs:metropolitan.sanfrancisco.gerasimos.pet19.text
ltx/en_us_public/hierarchs:metropolitan.sanfrancisco.gerasimos.petOrdination01a.text	@ltx/en_us_goa/hierarchs:metropolitan.sanfrancisco.gerasimos.petOrdination01a.text
ltx/en_us_public/hierarchs:ordinand.name.acc.text	@ltx/en_us_goa/hierarchs:ordinand.name.acc.text
ltx/en_us_public/hierarchs:ordinand.name.gen.text	@ltx/en_us_goa/hierarchs:ordinand.name.gen.text
ltx/en_us_public/hierarchs:patriarch.bartholomew.commemoration.text	@ltx/en_us_goa/hierarchs:patriarch.bartholomew.commemoration.text
ltx/en_us_public/hierarchs:patriarch.bartholomew.entrance.text	@ltx/en_us_goa/hierarchs:patriarch.bartholomew.entrance.text
ltx/en_us_public/hierarchs:patriarch.bartholomew.fimi.text	@ltx/en_us_goa/hierarchs:patriarch.bartholomew.fimi.text
