ltx/en_us_public/ho.ho15.m07:ho.Days	@ltx/en_us_dedes/ho.ho15.m07:ho.Days
ltx/en_us_public/ho.ho15.m07:ho.Hours	@ltx/en_us_dedes/ho.ho15.m07:ho.Hours
ltx/en_us_public/ho.ho15.m07:ho.Month	@ltx/en_us_dedes/ho.ho15.m07:ho.Month
ltx/en_us_public/ho.ho15.m07:hoD03.GeneralApolytikion3.name	@ltx/en_us_dedes/ho.ho15.m07:hoD03.GeneralApolytikion3.name
ltx/en_us_public/ho.ho15.m07:hoD04.GeneralApolytikion1.name	@ltx/en_us_dedes/ho.ho15.m07:hoD04.GeneralApolytikion1.name
ltx/en_us_public/ho.ho15.m07:hoD09.GeneralApolytikion1.name	@ltx/en_us_dedes/ho.ho15.m07:hoD09.GeneralApolytikion1.name
ltx/en_us_public/ho.ho15.m07:hoD17.Apolytikion3.greekmelody	@ltx/en_us_dedes/ho.ho15.m07:hoD17.Apolytikion3.greekmelody
ltx/en_us_public/ho.ho15.m07:hoD17.Apolytikion3.incipit	@ltx/en_us_dedes/ho.ho15.m07:hoD17.Apolytikion3.incipit
ltx/en_us_public/ho.ho15.m07:hoD17.Apolytikion3.melody	@ltx/en_us_dedes/ho.ho15.m07:hoD17.Apolytikion3.melody
ltx/en_us_public/ho.ho15.m07:hoD17.Apolytikion3.mode	@ltx/en_us_dedes/ho.ho15.m07:hoD17.Apolytikion3.mode
ltx/en_us_public/ho.ho15.m07:hoD17.Apolytikion3.poet	@ltx/en_us_dedes/ho.ho15.m07:hoD17.Apolytikion3.poet
ltx/en_us_public/ho.ho15.m07:hoD17.Apolytikion3.text	@ltx/en_us_dedes/ho.ho15.m07:hoD17.Apolytikion3.text
ltx/en_us_public/ho.ho15.m07:hoD17.Apolytikion3.title	@ltx/en_us_dedes/ho.ho15.m07:hoD17.Apolytikion3.title
ltx/en_us_public/ho.ho15.m07:hoD18.Apolytikion1.greekmelody	@ltx/en_us_dedes/ho.ho15.m07:hoD18.Apolytikion1.greekmelody
ltx/en_us_public/ho.ho15.m07:hoD18.Apolytikion1.incipit	@ltx/en_us_dedes/ho.ho15.m07:hoD18.Apolytikion1.incipit
ltx/en_us_public/ho.ho15.m07:hoD18.Apolytikion1.melody	@ltx/en_us_dedes/ho.ho15.m07:hoD18.Apolytikion1.melody
ltx/en_us_public/ho.ho15.m07:hoD18.Apolytikion1.mode	@ltx/en_us_dedes/ho.ho15.m07:hoD18.Apolytikion1.mode
ltx/en_us_public/ho.ho15.m07:hoD18.Apolytikion1.poet	@ltx/en_us_dedes/ho.ho15.m07:hoD18.Apolytikion1.poet
ltx/en_us_public/ho.ho15.m07:hoD18.Apolytikion1.text	@ltx/en_us_dedes/ho.ho15.m07:hoD18.Apolytikion1.text
ltx/en_us_public/ho.ho15.m07:hoD18.Apolytikion1.title	@ltx/en_us_dedes/ho.ho15.m07:hoD18.Apolytikion1.title
ltx/en_us_public/ho.ho15.m07:hoD18.Kontakion1.greekmelody	@ltx/en_us_dedes/ho.ho15.m07:hoD18.Kontakion1.greekmelody
ltx/en_us_public/ho.ho15.m07:hoD18.Kontakion1.incipit	@ltx/en_us_dedes/ho.ho15.m07:hoD18.Kontakion1.incipit
ltx/en_us_public/ho.ho15.m07:hoD18.Kontakion1.melody	@ltx/en_us_dedes/ho.ho15.m07:hoD18.Kontakion1.melody
ltx/en_us_public/ho.ho15.m07:hoD18.Kontakion1.mode	@ltx/en_us_dedes/ho.ho15.m07:hoD18.Kontakion1.mode
ltx/en_us_public/ho.ho15.m07:hoD18.Kontakion1.poet	@ltx/en_us_dedes/ho.ho15.m07:hoD18.Kontakion1.poet
ltx/en_us_public/ho.ho15.m07:hoD18.Kontakion1.text	@ltx/en_us_dedes/ho.ho15.m07:hoD18.Kontakion1.text
ltx/en_us_public/ho.ho15.m07:hoD18.Kontakion1.title	@ltx/en_us_dedes/ho.ho15.m07:hoD18.Kontakion1.title
ltx/en_us_public/ho.ho15.m07:hoD19.GeneralApolytikion1.name	@ltx/en_us_dedes/ho.ho15.m07:hoD19.GeneralApolytikion1.name
ltx/en_us_public/ho.ho15.m07:hoD19.GeneralApolytikion3.name	@ltx/en_us_dedes/ho.ho15.m07:hoD19.GeneralApolytikion3.name
ltx/en_us_public/ho.ho15.m07:hoD23.GeneralApolytikion3.name	@ltx/en_us_dedes/ho.ho15.m07:hoD23.GeneralApolytikion3.name
ltx/en_us_public/ho.ho15.m07:hoD28.Apolytikion5.greekmelody	@ltx/en_us_dedes/ho.ho15.m07:hoD28.Apolytikion5.greekmelody
ltx/en_us_public/ho.ho15.m07:hoD28.Apolytikion5.incipit	@ltx/en_us_dedes/ho.ho15.m07:hoD28.Apolytikion5.incipit
ltx/en_us_public/ho.ho15.m07:hoD28.Apolytikion5.melody	@ltx/en_us_dedes/ho.ho15.m07:hoD28.Apolytikion5.melody
ltx/en_us_public/ho.ho15.m07:hoD28.Apolytikion5.mode	@ltx/en_us_dedes/ho.ho15.m07:hoD28.Apolytikion5.mode
ltx/en_us_public/ho.ho15.m07:hoD28.Apolytikion5.poet	@ltx/en_us_dedes/ho.ho15.m07:hoD28.Apolytikion5.poet
ltx/en_us_public/ho.ho15.m07:hoD28.Apolytikion5.text	@ltx/en_us_dedes/ho.ho15.m07:hoD28.Apolytikion5.text
ltx/en_us_public/ho.ho15.m07:hoD28.Apolytikion5.title	@ltx/en_us_dedes/ho.ho15.m07:hoD28.Apolytikion5.title
