ltx/en_us_public/le.ep.mc.d317:lemcLI.Epistle.book_abbr	@ltx/en_us_rsv/le.ep.mc.d317:lemcLI.Epistle.book_abbr
ltx/en_us_public/le.ep.mc.d317:lemcLI.Epistle.book_string	@ltx/en_us_rsv/le.ep.mc.d317:lemcLI.Epistle.book_string
ltx/en_us_public/le.ep.mc.d317:lemcLI.Epistle.chapverse	@ltx/en_us_rsv/le.ep.mc.d317:lemcLI.Epistle.chapverse
ltx/en_us_public/le.ep.mc.d317:lemcLI.Epistle.incipit	@ltx/en_us_rsv/le.ep.mc.d317:lemcLI.Epistle.incipit
ltx/en_us_public/le.ep.mc.d317:lemcLI.Epistle.text	@ltx/en_us_rsv/le.ep.mc.d317:lemcLI.Epistle.text
ltx/en_us_public/le.ep.mc.d317:lemcLI.Epistle.title	@ltx/en_us_rsv/le.ep.mc.d317:lemcLI.Epistle.title
ltx/en_us_public/le.ep.mc.d317:lemcLI.Epistle.title_abbr	@ltx/en_us_rsv/le.ep.mc.d317:lemcLI.Epistle.title_abbr
ltx/en_us_public/le.ep.mc.d317:lemcLI.Epistle.version	@ltx/en_us_rsv/le.ep.mc.d317:lemcLI.Epistle.version
