ltx/en_us_public/le.go.me.m09.d02:lemeLI.Gospel.book_abbr	@ltx/en_us_rsv/le.go.me.m09.d02:lemeLI.Gospel.book_abbr
ltx/en_us_public/le.go.me.m09.d02:lemeLI.Gospel.book_string	@ltx/en_us_rsv/le.go.me.m09.d02:lemeLI.Gospel.book_string
ltx/en_us_public/le.go.me.m09.d02:lemeLI.Gospel.chapverse	@ltx/en_us_rsv/le.go.me.m09.d02:lemeLI.Gospel.chapverse
ltx/en_us_public/le.go.me.m09.d02:lemeLI.Gospel.incipit	@ltx/en_us_rsv/le.go.me.m09.d02:lemeLI.Gospel.incipit
ltx/en_us_public/le.go.me.m09.d02:lemeLI.Gospel.text	@ltx/en_us_rsv/le.go.me.m09.d02:lemeLI.Gospel.text
ltx/en_us_public/le.go.me.m09.d02:lemeLI.Gospel.title	@ltx/en_us_rsv/le.go.me.m09.d02:lemeLI.Gospel.title
ltx/en_us_public/le.go.me.m09.d02:lemeLI.Gospel.title_abbr	@ltx/en_us_rsv/le.go.me.m09.d02:lemeLI.Gospel.title_abbr
ltx/en_us_public/le.go.me.m09.d02:lemeLI.Gospel.version	@ltx/en_us_rsv/le.go.me.m09.d02:lemeLI.Gospel.version
ltx/en_us_public/le.go.me.m09.d02:lemeLI.Gospel2.book_abbr	@ltx/en_us_rsv/le.go.me.m09.d02:lemeLI.Gospel2.book_abbr
ltx/en_us_public/le.go.me.m09.d02:lemeLI.Gospel2.book_string	@ltx/en_us_rsv/le.go.me.m09.d02:lemeLI.Gospel2.book_string
ltx/en_us_public/le.go.me.m09.d02:lemeLI.Gospel2.chapverse	@ltx/en_us_rsv/le.go.me.m09.d02:lemeLI.Gospel2.chapverse
ltx/en_us_public/le.go.me.m09.d02:lemeLI.Gospel2.incipit	@ltx/en_us_rsv/le.go.me.m09.d02:lemeLI.Gospel2.incipit
ltx/en_us_public/le.go.me.m09.d02:lemeLI.Gospel2.text	@ltx/en_us_rsv/le.go.me.m09.d02:lemeLI.Gospel2.text
ltx/en_us_public/le.go.me.m09.d02:lemeLI.Gospel2.title	@ltx/en_us_rsv/le.go.me.m09.d02:lemeLI.Gospel2.title
ltx/en_us_public/le.go.me.m09.d02:lemeLI.Gospel2.title_abbr	@ltx/en_us_rsv/le.go.me.m09.d02:lemeLI.Gospel2.title_abbr
ltx/en_us_public/le.go.me.m09.d02:lemeLI.Gospel2.version	@ltx/en_us_rsv/le.go.me.m09.d02:lemeLI.Gospel2.version
