ltx/en_us_public/le.go.os:leos.prokeimenon.MM.ode92v8v1.text	@ltx/en_us_rsv/le.go.os:leos.prokeimenon.MM.ode92v8v1.text
ltx/en_us_public/le.go.os:leosCA.ParaklesisPandemic.Gospel.book_abbr	@ltx/en_us_rsv/le.go.os:leosCA.ParaklesisPandemic.Gospel.book_abbr
ltx/en_us_public/le.go.os:leosCA.ParaklesisPandemic.Gospel.book_string	@ltx/en_us_rsv/le.go.os:leosCA.ParaklesisPandemic.Gospel.book_string
ltx/en_us_public/le.go.os:leosCA.ParaklesisPandemic.Gospel.chapverse	@ltx/en_us_rsv/le.go.os:leosCA.ParaklesisPandemic.Gospel.chapverse
ltx/en_us_public/le.go.os:leosCA.ParaklesisPandemic.Gospel.text	@ltx/en_us_rsv/le.go.os:leosCA.ParaklesisPandemic.Gospel.text
ltx/en_us_public/le.go.os:leosCA.ParaklesisPandemic.Gospel.title	@ltx/en_us_rsv/le.go.os:leosCA.ParaklesisPandemic.Gospel.title
ltx/en_us_public/le.go.os:leosCA.ParaklesisPandemic.Gospel.version	@ltx/en_us_rsv/le.go.os:leosCA.ParaklesisPandemic.Gospel.version
ltx/en_us_public/le.go.os:leosLI.pe.d095.CommunionHymn.book_abbr	@ltx/en_us_rsv/le.go.os:leosLI.pe.d095.CommunionHymn.book_abbr
ltx/en_us_public/le.go.os:leosLI.pe.d095.CommunionHymn.book_string	@ltx/en_us_rsv/le.go.os:leosLI.pe.d095.CommunionHymn.book_string
ltx/en_us_public/le.go.os:leosLI.pe.d095.CommunionHymn.chapverse	@ltx/en_us_rsv/le.go.os:leosLI.pe.d095.CommunionHymn.chapverse
ltx/en_us_public/le.go.os:leosLI.pe.d095.CommunionHymn.text	@ltx/en_us_rsv/le.go.os:leosLI.pe.d095.CommunionHymn.text
ltx/en_us_public/le.go.os:leosLI.pe.d095.CommunionHymn.title	@ltx/en_us_rsv/le.go.os:leosLI.pe.d095.CommunionHymn.title
ltx/en_us_public/le.go.os:leosLI.pe.d095.CommunionHymn.title_abbr	@ltx/en_us_rsv/le.go.os:leosLI.pe.d095.CommunionHymn.title_abbr
ltx/en_us_public/le.go.os:leosLI.pe.d095.CommunionHymn.version	@ltx/en_us_rsv/le.go.os:leosLI.pe.d095.CommunionHymn.version
ltx/en_us_public/le.go.os:leosMA.SixPsalmsIntro1.book_abbr	@ltx/en_us_rsv/le.go.os:leosMA.SixPsalmsIntro1.book_abbr
ltx/en_us_public/le.go.os:leosMA.SixPsalmsIntro1.book_string	@ltx/en_us_rsv/le.go.os:leosMA.SixPsalmsIntro1.book_string
ltx/en_us_public/le.go.os:leosMA.SixPsalmsIntro1.chapverse	@ltx/en_us_rsv/le.go.os:leosMA.SixPsalmsIntro1.chapverse
ltx/en_us_public/le.go.os:leosMA.SixPsalmsIntro1.text	@ltx/en_us_rsv/le.go.os:leosMA.SixPsalmsIntro1.text
ltx/en_us_public/le.go.os:leosMA.SixPsalmsIntro1.title	@ltx/en_us_rsv/le.go.os:leosMA.SixPsalmsIntro1.title
ltx/en_us_public/le.go.os:leosMA.SixPsalmsIntro1.title_abbr	@ltx/en_us_rsv/le.go.os:leosMA.SixPsalmsIntro1.title_abbr
ltx/en_us_public/le.go.os:leosMA.SixPsalmsIntro1.version	@ltx/en_us_rsv/le.go.os:leosMA.SixPsalmsIntro1.version
ltx/en_us_public/le.go.os:leosTY.Beatitudes.book_abbr	@ltx/en_us_rsv/le.go.os:leosTY.Beatitudes.book_abbr
ltx/en_us_public/le.go.os:leosTY.Beatitudes.book_string	@ltx/en_us_rsv/le.go.os:leosTY.Beatitudes.book_string
ltx/en_us_public/le.go.os:leosTY.Beatitudes.chapverse	@ltx/en_us_rsv/le.go.os:leosTY.Beatitudes.chapverse
ltx/en_us_public/le.go.os:leosTY.Beatitudes.title	@ltx/en_us_rsv/le.go.os:leosTY.Beatitudes.title
ltx/en_us_public/le.go.os:leosTY.Beatitudes.title_abbr	@ltx/en_us_rsv/le.go.os:leosTY.Beatitudes.title_abbr
ltx/en_us_public/le.go.os:leosTY.Beatitudes.version	@ltx/en_us_rsv/le.go.os:leosTY.Beatitudes.version
ltx/en_us_public/le.go.os:leosTY.Beatitudes_Intro.text	@ltx/en_us_rsv/le.go.os:leosTY.Beatitudes_Intro.text
ltx/en_us_public/le.go.os:leosTY.Beatitudes_Refrain1.text	@ltx/en_us_rsv/le.go.os:leosTY.Beatitudes_Refrain1.text
ltx/en_us_public/le.go.os:leosTY.Beatitudes_Refrain2.text	@ltx/en_us_rsv/le.go.os:leosTY.Beatitudes_Refrain2.text
ltx/en_us_public/le.go.os:leosTY.Beatitudes_Refrain3.text	@ltx/en_us_rsv/le.go.os:leosTY.Beatitudes_Refrain3.text
ltx/en_us_public/le.go.os:leosTY.Beatitudes_v01.text	@ltx/en_us_rsv/le.go.os:leosTY.Beatitudes_v01.text
ltx/en_us_public/le.go.os:leosTY.Beatitudes_v02.text	@ltx/en_us_rsv/le.go.os:leosTY.Beatitudes_v02.text
ltx/en_us_public/le.go.os:leosTY.Beatitudes_v03.text	@ltx/en_us_rsv/le.go.os:leosTY.Beatitudes_v03.text
ltx/en_us_public/le.go.os:leosTY.Beatitudes_v04.text	@ltx/en_us_rsv/le.go.os:leosTY.Beatitudes_v04.text
ltx/en_us_public/le.go.os:leosTY.Beatitudes_v05.text	@ltx/en_us_rsv/le.go.os:leosTY.Beatitudes_v05.text
ltx/en_us_public/le.go.os:leosTY.Beatitudes_v06.text	@ltx/en_us_rsv/le.go.os:leosTY.Beatitudes_v06.text
ltx/en_us_public/le.go.os:leosTY.Beatitudes_v07.text	@ltx/en_us_rsv/le.go.os:leosTY.Beatitudes_v07.text
ltx/en_us_public/le.go.os:leosTY.Beatitudes_v08.text	@ltx/en_us_rsv/le.go.os:leosTY.Beatitudes_v08.text
ltx/en_us_public/le.go.os:leosTY.Beatitudes_v09.text	@ltx/en_us_rsv/le.go.os:leosTY.Beatitudes_v09.text
ltx/en_us_public/le.go.os:leosTY.Beatitudes_v10.text	@ltx/en_us_rsv/le.go.os:leosTY.Beatitudes_v10.text
ltx/en_us_public/le.go.os:leosVE.Prayer_NynApolyeis.book_abbr	@ltx/en_us_nkjv/le.go.os:leosVE.Prayer_NynApolyeis.book_abbr
ltx/en_us_public/le.go.os:leosVE.Prayer_NynApolyeis.book_string	@ltx/en_us_nkjv/le.go.os:leosVE.Prayer_NynApolyeis.book_string
ltx/en_us_public/le.go.os:leosVE.Prayer_NynApolyeis.chapverse	@ltx/en_us_nkjv/le.go.os:leosVE.Prayer_NynApolyeis.chapverse
ltx/en_us_public/le.go.os:leosVE.Prayer_NynApolyeis.text	@ltx/en_us_nkjv/le.go.os:leosVE.Prayer_NynApolyeis.text
ltx/en_us_public/le.go.os:leosVE.Prayer_NynApolyeis.title	@ltx/en_us_nkjv/le.go.os:leosVE.Prayer_NynApolyeis.title
ltx/en_us_public/le.go.os:leosVE.Prayer_NynApolyeis.title_abbr	@ltx/en_us_nkjv/le.go.os:leosVE.Prayer_NynApolyeis.title_abbr
ltx/en_us_public/le.go.os:leosVE.Prayer_NynApolyeis.version	@ltx/en_us_nkjv/le.go.os:leosVE.Prayer_NynApolyeis.version
ltx/en_us_public/le.go.os:leosVE.Prayer_NynApolyeis1.text	@ltx/en_us_nkjv/le.go.os:leosVE.Prayer_NynApolyeis1.text
ltx/en_us_public/le.go.os:leosVE.Prayer_NynApolyeis2.text	@ltx/en_us_nkjv/le.go.os:leosVE.Prayer_NynApolyeis2.text
