ltx/en_us_public/eu.smallwaterblessing:euSWB.Key0100.title	@ltx/en_us_dedes/eu.smallwaterblessing:euSWB.Key0100.title
ltx/en_us_public/eu.smallwaterblessing:euSWB.Key0201.incipit	@ltx/en_us_dedes/eu.smallwaterblessing:euSWB.Key0201.incipit
ltx/en_us_public/eu.smallwaterblessing:euSWB.Key0201.melody	@ltx/en_us_dedes/eu.smallwaterblessing:euSWB.Key0201.melody
ltx/en_us_public/eu.smallwaterblessing:euSWB.Key0201.mode	@ltx/en_us_dedes/eu.smallwaterblessing:euSWB.Key0201.mode
ltx/en_us_public/eu.smallwaterblessing:euSWB.Key0201.text	@ltx/en_us_dedes/eu.smallwaterblessing:euSWB.Key0201.text
ltx/en_us_public/eu.smallwaterblessing:euSWB.Key0202.incipit	@ltx/en_us_dedes/eu.smallwaterblessing:euSWB.Key0202.incipit
ltx/en_us_public/eu.smallwaterblessing:euSWB.Key0202.melody	@ltx/en_us_dedes/eu.smallwaterblessing:euSWB.Key0202.melody
ltx/en_us_public/eu.smallwaterblessing:euSWB.Key0202.mode	@ltx/en_us_dedes/eu.smallwaterblessing:euSWB.Key0202.mode
ltx/en_us_public/eu.smallwaterblessing:euSWB.Key0202.text	@ltx/en_us_dedes/eu.smallwaterblessing:euSWB.Key0202.text
ltx/en_us_public/eu.smallwaterblessing:euSWB.Key0203.incipit	@ltx/en_us_dedes/eu.smallwaterblessing:euSWB.Key0203.incipit
ltx/en_us_public/eu.smallwaterblessing:euSWB.Key0203.melody	@ltx/en_us_dedes/eu.smallwaterblessing:euSWB.Key0203.melody
ltx/en_us_public/eu.smallwaterblessing:euSWB.Key0203.mode	@ltx/en_us_dedes/eu.smallwaterblessing:euSWB.Key0203.mode
ltx/en_us_public/eu.smallwaterblessing:euSWB.Key0203.text	@ltx/en_us_dedes/eu.smallwaterblessing:euSWB.Key0203.text
ltx/en_us_public/eu.smallwaterblessing:euSWB.Key0204.incipit	@ltx/en_us_dedes/eu.smallwaterblessing:euSWB.Key0204.incipit
ltx/en_us_public/eu.smallwaterblessing:euSWB.Key0204.melody	@ltx/en_us_dedes/eu.smallwaterblessing:euSWB.Key0204.melody
ltx/en_us_public/eu.smallwaterblessing:euSWB.Key0204.mode	@ltx/en_us_dedes/eu.smallwaterblessing:euSWB.Key0204.mode
ltx/en_us_public/eu.smallwaterblessing:euSWB.Key0204.text	@ltx/en_us_dedes/eu.smallwaterblessing:euSWB.Key0204.text
ltx/en_us_public/eu.smallwaterblessing:euSWB.Key0205.incipit	@ltx/en_us_dedes/eu.smallwaterblessing:euSWB.Key0205.incipit
ltx/en_us_public/eu.smallwaterblessing:euSWB.Key0205.melody	@ltx/en_us_dedes/eu.smallwaterblessing:euSWB.Key0205.melody
ltx/en_us_public/eu.smallwaterblessing:euSWB.Key0205.mode	@ltx/en_us_dedes/eu.smallwaterblessing:euSWB.Key0205.mode
ltx/en_us_public/eu.smallwaterblessing:euSWB.Key0205.text	@ltx/en_us_dedes/eu.smallwaterblessing:euSWB.Key0205.text
ltx/en_us_public/eu.smallwaterblessing:euSWB.Key0206.incipit	@ltx/en_us_dedes/eu.smallwaterblessing:euSWB.Key0206.incipit
ltx/en_us_public/eu.smallwaterblessing:euSWB.Key0206.melody	@ltx/en_us_dedes/eu.smallwaterblessing:euSWB.Key0206.melody
ltx/en_us_public/eu.smallwaterblessing:euSWB.Key0206.mode	@ltx/en_us_dedes/eu.smallwaterblessing:euSWB.Key0206.mode
ltx/en_us_public/eu.smallwaterblessing:euSWB.Key0206.text	@ltx/en_us_dedes/eu.smallwaterblessing:euSWB.Key0206.text
ltx/en_us_public/eu.smallwaterblessing:euSWB.Key0207.incipit	@ltx/en_us_dedes/eu.smallwaterblessing:euSWB.Key0207.incipit
ltx/en_us_public/eu.smallwaterblessing:euSWB.Key0207.melody	@ltx/en_us_dedes/eu.smallwaterblessing:euSWB.Key0207.melody
ltx/en_us_public/eu.smallwaterblessing:euSWB.Key0207.mode	@ltx/en_us_dedes/eu.smallwaterblessing:euSWB.Key0207.mode
ltx/en_us_public/eu.smallwaterblessing:euSWB.Key0207.text	@ltx/en_us_dedes/eu.smallwaterblessing:euSWB.Key0207.text
ltx/en_us_public/eu.smallwaterblessing:euSWB.Key0208.incipit	@ltx/en_us_dedes/eu.smallwaterblessing:euSWB.Key0208.incipit
ltx/en_us_public/eu.smallwaterblessing:euSWB.Key0208.melody	@ltx/en_us_dedes/eu.smallwaterblessing:euSWB.Key0208.melody
ltx/en_us_public/eu.smallwaterblessing:euSWB.Key0208.mode	@ltx/en_us_dedes/eu.smallwaterblessing:euSWB.Key0208.mode
ltx/en_us_public/eu.smallwaterblessing:euSWB.Key0208.text	@ltx/en_us_dedes/eu.smallwaterblessing:euSWB.Key0208.text
ltx/en_us_public/eu.smallwaterblessing:euSWB.Key0209.incipit	@ltx/en_us_dedes/eu.smallwaterblessing:euSWB.Key0209.incipit
ltx/en_us_public/eu.smallwaterblessing:euSWB.Key0209.melody	@ltx/en_us_dedes/eu.smallwaterblessing:euSWB.Key0209.melody
ltx/en_us_public/eu.smallwaterblessing:euSWB.Key0209.mode	@ltx/en_us_dedes/eu.smallwaterblessing:euSWB.Key0209.mode
ltx/en_us_public/eu.smallwaterblessing:euSWB.Key0209.text	@ltx/en_us_dedes/eu.smallwaterblessing:euSWB.Key0209.text
ltx/en_us_public/eu.smallwaterblessing:euSWB.Key0210.incipit	@ltx/en_us_dedes/eu.smallwaterblessing:euSWB.Key0210.incipit
ltx/en_us_public/eu.smallwaterblessing:euSWB.Key0210.melody	@ltx/en_us_dedes/eu.smallwaterblessing:euSWB.Key0210.melody
ltx/en_us_public/eu.smallwaterblessing:euSWB.Key0210.mode	@ltx/en_us_dedes/eu.smallwaterblessing:euSWB.Key0210.mode
ltx/en_us_public/eu.smallwaterblessing:euSWB.Key0210.text	@ltx/en_us_dedes/eu.smallwaterblessing:euSWB.Key0210.text
ltx/en_us_public/eu.smallwaterblessing:euSWB.Key0211.incipit	@ltx/en_us_dedes/eu.smallwaterblessing:euSWB.Key0211.incipit
ltx/en_us_public/eu.smallwaterblessing:euSWB.Key0211.melody	@ltx/en_us_dedes/eu.smallwaterblessing:euSWB.Key0211.melody
ltx/en_us_public/eu.smallwaterblessing:euSWB.Key0211.mode	@ltx/en_us_dedes/eu.smallwaterblessing:euSWB.Key0211.mode
ltx/en_us_public/eu.smallwaterblessing:euSWB.Key0211.text	@ltx/en_us_dedes/eu.smallwaterblessing:euSWB.Key0211.text
ltx/en_us_public/eu.smallwaterblessing:euSWB.Key0212.incipit	@ltx/en_us_dedes/eu.smallwaterblessing:euSWB.Key0212.incipit
ltx/en_us_public/eu.smallwaterblessing:euSWB.Key0212.melody	@ltx/en_us_dedes/eu.smallwaterblessing:euSWB.Key0212.melody
ltx/en_us_public/eu.smallwaterblessing:euSWB.Key0212.mode	@ltx/en_us_dedes/eu.smallwaterblessing:euSWB.Key0212.mode
ltx/en_us_public/eu.smallwaterblessing:euSWB.Key0212.text	@ltx/en_us_dedes/eu.smallwaterblessing:euSWB.Key0212.text
ltx/en_us_public/eu.smallwaterblessing:euSWB.Key0213.incipit	@ltx/en_us_dedes/eu.smallwaterblessing:euSWB.Key0213.incipit
ltx/en_us_public/eu.smallwaterblessing:euSWB.Key0213.melody	@ltx/en_us_dedes/eu.smallwaterblessing:euSWB.Key0213.melody
ltx/en_us_public/eu.smallwaterblessing:euSWB.Key0213.mode	@ltx/en_us_dedes/eu.smallwaterblessing:euSWB.Key0213.mode
ltx/en_us_public/eu.smallwaterblessing:euSWB.Key0213.text	@ltx/en_us_dedes/eu.smallwaterblessing:euSWB.Key0213.text
ltx/en_us_public/eu.smallwaterblessing:euSWB.Key0214.incipit	@ltx/en_us_dedes/eu.smallwaterblessing:euSWB.Key0214.incipit
ltx/en_us_public/eu.smallwaterblessing:euSWB.Key0214.melody	@ltx/en_us_dedes/eu.smallwaterblessing:euSWB.Key0214.melody
ltx/en_us_public/eu.smallwaterblessing:euSWB.Key0214.mode	@ltx/en_us_dedes/eu.smallwaterblessing:euSWB.Key0214.mode
ltx/en_us_public/eu.smallwaterblessing:euSWB.Key0214.text	@ltx/en_us_dedes/eu.smallwaterblessing:euSWB.Key0214.text
ltx/en_us_public/eu.smallwaterblessing:euSWB.Key0215.incipit	@ltx/en_us_dedes/eu.smallwaterblessing:euSWB.Key0215.incipit
ltx/en_us_public/eu.smallwaterblessing:euSWB.Key0215.melody	@ltx/en_us_dedes/eu.smallwaterblessing:euSWB.Key0215.melody
ltx/en_us_public/eu.smallwaterblessing:euSWB.Key0215.mode	@ltx/en_us_dedes/eu.smallwaterblessing:euSWB.Key0215.mode
ltx/en_us_public/eu.smallwaterblessing:euSWB.Key0215.text	@ltx/en_us_dedes/eu.smallwaterblessing:euSWB.Key0215.text
ltx/en_us_public/eu.smallwaterblessing:euSWB.Key0216.incipit	@ltx/en_us_dedes/eu.smallwaterblessing:euSWB.Key0216.incipit
ltx/en_us_public/eu.smallwaterblessing:euSWB.Key0216.melody	@ltx/en_us_dedes/eu.smallwaterblessing:euSWB.Key0216.melody
ltx/en_us_public/eu.smallwaterblessing:euSWB.Key0216.mode	@ltx/en_us_dedes/eu.smallwaterblessing:euSWB.Key0216.mode
ltx/en_us_public/eu.smallwaterblessing:euSWB.Key0216.text	@ltx/en_us_dedes/eu.smallwaterblessing:euSWB.Key0216.text
ltx/en_us_public/eu.smallwaterblessing:euSWB.Key0217.incipit	@ltx/en_us_dedes/eu.smallwaterblessing:euSWB.Key0217.incipit
ltx/en_us_public/eu.smallwaterblessing:euSWB.Key0217.melody	@ltx/en_us_dedes/eu.smallwaterblessing:euSWB.Key0217.melody
ltx/en_us_public/eu.smallwaterblessing:euSWB.Key0217.mode	@ltx/en_us_dedes/eu.smallwaterblessing:euSWB.Key0217.mode
ltx/en_us_public/eu.smallwaterblessing:euSWB.Key0217.text	@ltx/en_us_dedes/eu.smallwaterblessing:euSWB.Key0217.text
ltx/en_us_public/eu.smallwaterblessing:euSWB.Key0218.incipit	@ltx/en_us_dedes/eu.smallwaterblessing:euSWB.Key0218.incipit
ltx/en_us_public/eu.smallwaterblessing:euSWB.Key0218.melody	@ltx/en_us_dedes/eu.smallwaterblessing:euSWB.Key0218.melody
ltx/en_us_public/eu.smallwaterblessing:euSWB.Key0218.mode	@ltx/en_us_dedes/eu.smallwaterblessing:euSWB.Key0218.mode
ltx/en_us_public/eu.smallwaterblessing:euSWB.Key0218.text	@ltx/en_us_dedes/eu.smallwaterblessing:euSWB.Key0218.text
ltx/en_us_public/eu.smallwaterblessing:euSWB.Key0219.incipit	@ltx/en_us_dedes/eu.smallwaterblessing:euSWB.Key0219.incipit
ltx/en_us_public/eu.smallwaterblessing:euSWB.Key0219.melody	@ltx/en_us_dedes/eu.smallwaterblessing:euSWB.Key0219.melody
ltx/en_us_public/eu.smallwaterblessing:euSWB.Key0219.mode	@ltx/en_us_dedes/eu.smallwaterblessing:euSWB.Key0219.mode
ltx/en_us_public/eu.smallwaterblessing:euSWB.Key0219.text	@ltx/en_us_dedes/eu.smallwaterblessing:euSWB.Key0219.text
ltx/en_us_public/eu.smallwaterblessing:euSWB.Key0220.incipit	@ltx/en_us_dedes/eu.smallwaterblessing:euSWB.Key0220.incipit
ltx/en_us_public/eu.smallwaterblessing:euSWB.Key0220.melody	@ltx/en_us_dedes/eu.smallwaterblessing:euSWB.Key0220.melody
ltx/en_us_public/eu.smallwaterblessing:euSWB.Key0220.mode	@ltx/en_us_dedes/eu.smallwaterblessing:euSWB.Key0220.mode
ltx/en_us_public/eu.smallwaterblessing:euSWB.Key0220.text	@ltx/en_us_dedes/eu.smallwaterblessing:euSWB.Key0220.text
ltx/en_us_public/eu.smallwaterblessing:euSWB.Key0221.incipit	@ltx/en_us_dedes/eu.smallwaterblessing:euSWB.Key0221.incipit
ltx/en_us_public/eu.smallwaterblessing:euSWB.Key0221.melody	@ltx/en_us_dedes/eu.smallwaterblessing:euSWB.Key0221.melody
ltx/en_us_public/eu.smallwaterblessing:euSWB.Key0221.mode	@ltx/en_us_dedes/eu.smallwaterblessing:euSWB.Key0221.mode
ltx/en_us_public/eu.smallwaterblessing:euSWB.Key0221.text	@ltx/en_us_dedes/eu.smallwaterblessing:euSWB.Key0221.text
ltx/en_us_public/eu.smallwaterblessing:euSWB.Key0222.incipit	@ltx/en_us_dedes/eu.smallwaterblessing:euSWB.Key0222.incipit
ltx/en_us_public/eu.smallwaterblessing:euSWB.Key0222.melody	@ltx/en_us_dedes/eu.smallwaterblessing:euSWB.Key0222.melody
ltx/en_us_public/eu.smallwaterblessing:euSWB.Key0222.mode	@ltx/en_us_dedes/eu.smallwaterblessing:euSWB.Key0222.mode
ltx/en_us_public/eu.smallwaterblessing:euSWB.Key0222.text	@ltx/en_us_dedes/eu.smallwaterblessing:euSWB.Key0222.text
ltx/en_us_public/eu.smallwaterblessing:euSWB.Key0223.incipit	@ltx/en_us_dedes/eu.smallwaterblessing:euSWB.Key0223.incipit
ltx/en_us_public/eu.smallwaterblessing:euSWB.Key0223.melody	@ltx/en_us_dedes/eu.smallwaterblessing:euSWB.Key0223.melody
ltx/en_us_public/eu.smallwaterblessing:euSWB.Key0223.mode	@ltx/en_us_dedes/eu.smallwaterblessing:euSWB.Key0223.mode
ltx/en_us_public/eu.smallwaterblessing:euSWB.Key0223.text	@ltx/en_us_dedes/eu.smallwaterblessing:euSWB.Key0223.text
ltx/en_us_public/eu.smallwaterblessing:euSWB.Key0224.incipit	@ltx/en_us_dedes/eu.smallwaterblessing:euSWB.Key0224.incipit
ltx/en_us_public/eu.smallwaterblessing:euSWB.Key0224.melody	@ltx/en_us_dedes/eu.smallwaterblessing:euSWB.Key0224.melody
ltx/en_us_public/eu.smallwaterblessing:euSWB.Key0224.mode	@ltx/en_us_dedes/eu.smallwaterblessing:euSWB.Key0224.mode
ltx/en_us_public/eu.smallwaterblessing:euSWB.Key0224.text	@ltx/en_us_dedes/eu.smallwaterblessing:euSWB.Key0224.text
ltx/en_us_public/eu.smallwaterblessing:euSWB.Key0225.incipit	@ltx/en_us_dedes/eu.smallwaterblessing:euSWB.Key0225.incipit
ltx/en_us_public/eu.smallwaterblessing:euSWB.Key0225.melody	@ltx/en_us_dedes/eu.smallwaterblessing:euSWB.Key0225.melody
ltx/en_us_public/eu.smallwaterblessing:euSWB.Key0225.mode	@ltx/en_us_dedes/eu.smallwaterblessing:euSWB.Key0225.mode
ltx/en_us_public/eu.smallwaterblessing:euSWB.Key0225.text	@ltx/en_us_dedes/eu.smallwaterblessing:euSWB.Key0225.text
ltx/en_us_public/eu.smallwaterblessing:euSWB.Key0226.incipit	@ltx/en_us_dedes/eu.smallwaterblessing:euSWB.Key0226.incipit
ltx/en_us_public/eu.smallwaterblessing:euSWB.Key0226.melody	@ltx/en_us_dedes/eu.smallwaterblessing:euSWB.Key0226.melody
ltx/en_us_public/eu.smallwaterblessing:euSWB.Key0226.mode	@ltx/en_us_dedes/eu.smallwaterblessing:euSWB.Key0226.mode
ltx/en_us_public/eu.smallwaterblessing:euSWB.Key0226.text	@ltx/en_us_dedes/eu.smallwaterblessing:euSWB.Key0226.text
ltx/en_us_public/eu.smallwaterblessing:euSWB.Key0227.incipit	@ltx/en_us_dedes/eu.smallwaterblessing:euSWB.Key0227.incipit
ltx/en_us_public/eu.smallwaterblessing:euSWB.Key0227.melody	@ltx/en_us_dedes/eu.smallwaterblessing:euSWB.Key0227.melody
ltx/en_us_public/eu.smallwaterblessing:euSWB.Key0227.mode	@ltx/en_us_dedes/eu.smallwaterblessing:euSWB.Key0227.mode
ltx/en_us_public/eu.smallwaterblessing:euSWB.Key0227.text	@ltx/en_us_dedes/eu.smallwaterblessing:euSWB.Key0227.text
ltx/en_us_public/eu.smallwaterblessing:euSWB.Key0228.incipit	@ltx/en_us_dedes/eu.smallwaterblessing:euSWB.Key0228.incipit
ltx/en_us_public/eu.smallwaterblessing:euSWB.Key0228.melody	@ltx/en_us_dedes/eu.smallwaterblessing:euSWB.Key0228.melody
ltx/en_us_public/eu.smallwaterblessing:euSWB.Key0228.mode	@ltx/en_us_dedes/eu.smallwaterblessing:euSWB.Key0228.mode
ltx/en_us_public/eu.smallwaterblessing:euSWB.Key0228.text	@ltx/en_us_dedes/eu.smallwaterblessing:euSWB.Key0228.text
ltx/en_us_public/eu.smallwaterblessing:euSWB.Key0229.incipit	@ltx/en_us_dedes/eu.smallwaterblessing:euSWB.Key0229.incipit
ltx/en_us_public/eu.smallwaterblessing:euSWB.Key0229.melody	@ltx/en_us_dedes/eu.smallwaterblessing:euSWB.Key0229.melody
ltx/en_us_public/eu.smallwaterblessing:euSWB.Key0229.mode	@ltx/en_us_dedes/eu.smallwaterblessing:euSWB.Key0229.mode
ltx/en_us_public/eu.smallwaterblessing:euSWB.Key0229.text	@ltx/en_us_dedes/eu.smallwaterblessing:euSWB.Key0229.text
ltx/en_us_public/eu.smallwaterblessing:euSWB.Key0230.incipit	@ltx/en_us_dedes/eu.smallwaterblessing:euSWB.Key0230.incipit
ltx/en_us_public/eu.smallwaterblessing:euSWB.Key0230.melody	@ltx/en_us_dedes/eu.smallwaterblessing:euSWB.Key0230.melody
ltx/en_us_public/eu.smallwaterblessing:euSWB.Key0230.mode	@ltx/en_us_dedes/eu.smallwaterblessing:euSWB.Key0230.mode
ltx/en_us_public/eu.smallwaterblessing:euSWB.Key0230.text	@ltx/en_us_dedes/eu.smallwaterblessing:euSWB.Key0230.text
ltx/en_us_public/eu.smallwaterblessing:euSWB.Key0231.incipit	@ltx/en_us_dedes/eu.smallwaterblessing:euSWB.Key0231.incipit
ltx/en_us_public/eu.smallwaterblessing:euSWB.Key0231.melody	@ltx/en_us_dedes/eu.smallwaterblessing:euSWB.Key0231.melody
ltx/en_us_public/eu.smallwaterblessing:euSWB.Key0231.mode	@ltx/en_us_dedes/eu.smallwaterblessing:euSWB.Key0231.mode
ltx/en_us_public/eu.smallwaterblessing:euSWB.Key0231.text	@ltx/en_us_dedes/eu.smallwaterblessing:euSWB.Key0231.text
ltx/en_us_public/eu.smallwaterblessing:euSWB.Key0232.incipit	@ltx/en_us_dedes/eu.smallwaterblessing:euSWB.Key0232.incipit
ltx/en_us_public/eu.smallwaterblessing:euSWB.Key0232.melody	@ltx/en_us_dedes/eu.smallwaterblessing:euSWB.Key0232.melody
ltx/en_us_public/eu.smallwaterblessing:euSWB.Key0232.mode	@ltx/en_us_dedes/eu.smallwaterblessing:euSWB.Key0232.mode
ltx/en_us_public/eu.smallwaterblessing:euSWB.Key0232.text	@ltx/en_us_dedes/eu.smallwaterblessing:euSWB.Key0232.text
ltx/en_us_public/eu.smallwaterblessing:euSWB.Key0233.incipit	@ltx/en_us_dedes/eu.smallwaterblessing:euSWB.Key0233.incipit
ltx/en_us_public/eu.smallwaterblessing:euSWB.Key0233.melody	@ltx/en_us_dedes/eu.smallwaterblessing:euSWB.Key0233.melody
ltx/en_us_public/eu.smallwaterblessing:euSWB.Key0233.mode	@ltx/en_us_dedes/eu.smallwaterblessing:euSWB.Key0233.mode
ltx/en_us_public/eu.smallwaterblessing:euSWB.Key0233.text	@ltx/en_us_dedes/eu.smallwaterblessing:euSWB.Key0233.text
ltx/en_us_public/eu.smallwaterblessing:euSWB.Key0234.incipit	@ltx/en_us_dedes/eu.smallwaterblessing:euSWB.Key0234.incipit
ltx/en_us_public/eu.smallwaterblessing:euSWB.Key0234.melody	@ltx/en_us_dedes/eu.smallwaterblessing:euSWB.Key0234.melody
ltx/en_us_public/eu.smallwaterblessing:euSWB.Key0234.mode	@ltx/en_us_dedes/eu.smallwaterblessing:euSWB.Key0234.mode
ltx/en_us_public/eu.smallwaterblessing:euSWB.Key0234.text	@ltx/en_us_dedes/eu.smallwaterblessing:euSWB.Key0234.text
ltx/en_us_public/eu.smallwaterblessing:euSWB.Key0235.incipit	@ltx/en_us_dedes/eu.smallwaterblessing:euSWB.Key0235.incipit
ltx/en_us_public/eu.smallwaterblessing:euSWB.Key0235.melody	@ltx/en_us_dedes/eu.smallwaterblessing:euSWB.Key0235.melody
ltx/en_us_public/eu.smallwaterblessing:euSWB.Key0235.mode	@ltx/en_us_dedes/eu.smallwaterblessing:euSWB.Key0235.mode
ltx/en_us_public/eu.smallwaterblessing:euSWB.Key0235.text	@ltx/en_us_dedes/eu.smallwaterblessing:euSWB.Key0235.text
ltx/en_us_public/eu.smallwaterblessing:euSWB.Key0236.incipit	@ltx/en_us_dedes/eu.smallwaterblessing:euSWB.Key0236.incipit
ltx/en_us_public/eu.smallwaterblessing:euSWB.Key0236.melody	@ltx/en_us_dedes/eu.smallwaterblessing:euSWB.Key0236.melody
ltx/en_us_public/eu.smallwaterblessing:euSWB.Key0236.mode	@ltx/en_us_dedes/eu.smallwaterblessing:euSWB.Key0236.mode
ltx/en_us_public/eu.smallwaterblessing:euSWB.Key0236.text	@ltx/en_us_dedes/eu.smallwaterblessing:euSWB.Key0236.text
ltx/en_us_public/eu.smallwaterblessing:euSWB.Key0237.incipit	@ltx/en_us_dedes/eu.smallwaterblessing:euSWB.Key0237.incipit
ltx/en_us_public/eu.smallwaterblessing:euSWB.Key0237.melody	@ltx/en_us_dedes/eu.smallwaterblessing:euSWB.Key0237.melody
ltx/en_us_public/eu.smallwaterblessing:euSWB.Key0237.mode	@ltx/en_us_dedes/eu.smallwaterblessing:euSWB.Key0237.mode
ltx/en_us_public/eu.smallwaterblessing:euSWB.Key0237.text	@ltx/en_us_dedes/eu.smallwaterblessing:euSWB.Key0237.text
ltx/en_us_public/eu.smallwaterblessing:euSWB.Key0238.incipit	@ltx/en_us_dedes/eu.smallwaterblessing:euSWB.Key0238.incipit
ltx/en_us_public/eu.smallwaterblessing:euSWB.Key0238.melody	@ltx/en_us_dedes/eu.smallwaterblessing:euSWB.Key0238.melody
ltx/en_us_public/eu.smallwaterblessing:euSWB.Key0238.mode	@ltx/en_us_dedes/eu.smallwaterblessing:euSWB.Key0238.mode
ltx/en_us_public/eu.smallwaterblessing:euSWB.Key0238.text	@ltx/en_us_dedes/eu.smallwaterblessing:euSWB.Key0238.text
ltx/en_us_public/eu.smallwaterblessing:euSWB.Key0239.incipit	@ltx/en_us_dedes/eu.smallwaterblessing:euSWB.Key0239.incipit
ltx/en_us_public/eu.smallwaterblessing:euSWB.Key0239.melody	@ltx/en_us_dedes/eu.smallwaterblessing:euSWB.Key0239.melody
ltx/en_us_public/eu.smallwaterblessing:euSWB.Key0239.mode	@ltx/en_us_dedes/eu.smallwaterblessing:euSWB.Key0239.mode
ltx/en_us_public/eu.smallwaterblessing:euSWB.Key0239.text	@ltx/en_us_dedes/eu.smallwaterblessing:euSWB.Key0239.text
ltx/en_us_public/eu.smallwaterblessing:euSWB.Key0240.incipit	@ltx/en_us_dedes/eu.smallwaterblessing:euSWB.Key0240.incipit
ltx/en_us_public/eu.smallwaterblessing:euSWB.Key0240.text	@ltx/en_us_dedes/eu.smallwaterblessing:euSWB.Key0240.text
ltx/en_us_public/eu.smallwaterblessing:euSWB.Key0301.incipit	@ltx/en_us_dedes/eu.smallwaterblessing:euSWB.Key0301.incipit
ltx/en_us_public/eu.smallwaterblessing:euSWB.Key0301.mode	@ltx/en_us_dedes/eu.smallwaterblessing:euSWB.Key0301.mode
ltx/en_us_public/eu.smallwaterblessing:euSWB.Key0301.text	@ltx/en_us_dedes/eu.smallwaterblessing:euSWB.Key0301.text
ltx/en_us_public/eu.smallwaterblessing:euSWB.Key0302.incipit	@ltx/en_us_dedes/eu.smallwaterblessing:euSWB.Key0302.incipit
ltx/en_us_public/eu.smallwaterblessing:euSWB.Key0302.mode	@ltx/en_us_dedes/eu.smallwaterblessing:euSWB.Key0302.mode
ltx/en_us_public/eu.smallwaterblessing:euSWB.Key0302.text	@ltx/en_us_dedes/eu.smallwaterblessing:euSWB.Key0302.text
ltx/en_us_public/eu.smallwaterblessing:euSWB.Key0303.incipit	@ltx/en_us_dedes/eu.smallwaterblessing:euSWB.Key0303.incipit
ltx/en_us_public/eu.smallwaterblessing:euSWB.Key0303.melody	@ltx/en_us_dedes/eu.smallwaterblessing:euSWB.Key0303.melody
ltx/en_us_public/eu.smallwaterblessing:euSWB.Key0303.mode	@ltx/en_us_dedes/eu.smallwaterblessing:euSWB.Key0303.mode
ltx/en_us_public/eu.smallwaterblessing:euSWB.Key0303.text	@ltx/en_us_dedes/eu.smallwaterblessing:euSWB.Key0303.text
ltx/en_us_public/eu.smallwaterblessing:euSWB.Key0304.incipit	@ltx/en_us_dedes/eu.smallwaterblessing:euSWB.Key0304.incipit
ltx/en_us_public/eu.smallwaterblessing:euSWB.Key0304.mode	@ltx/en_us_dedes/eu.smallwaterblessing:euSWB.Key0304.mode
ltx/en_us_public/eu.smallwaterblessing:euSWB.Key0304.text	@ltx/en_us_dedes/eu.smallwaterblessing:euSWB.Key0304.text
ltx/en_us_public/eu.smallwaterblessing:euSWB.Key0401a.text	@ltx/en_us_holycross/eu.smallwaterblessing:euSWB.Key0401a.text
ltx/en_us_public/eu.smallwaterblessing:euSWB.Key0401b.text	@ltx/en_us_holycross/eu.smallwaterblessing:euSWB.Key0401b.text
ltx/en_us_public/eu.smallwaterblessing:euSWB.Key0402.text	@ltx/en_us_holycross/eu.smallwaterblessing:euSWB.Key0402.text
ltx/en_us_public/eu.smallwaterblessing:euSWB.Key0403.text	@ltx/en_us_holycross/eu.smallwaterblessing:euSWB.Key0403.text
ltx/en_us_public/eu.smallwaterblessing:euSWB.Key0404.text	@ltx/en_us_holycross/eu.smallwaterblessing:euSWB.Key0404.text
ltx/en_us_public/eu.smallwaterblessing:euSWB.Key0501.text	@ltx/en_us_dedes/eu.smallwaterblessing:euSWB.Key0501.text
ltx/en_us_public/eu.smallwaterblessing:euSWB.Key0502.text	@ltx/en_us_goadedes/eu.smallwaterblessing:euSWB.Key0502.text
ltx/en_us_public/eu.smallwaterblessing:euSWB.Key0502.title	@ltx/en_us_goadedes/eu.smallwaterblessing:euSWB.Key0502.title
ltx/en_us_public/eu.smallwaterblessing:euSWB.Key0503.inicpit	@ltx/en_us_goadedes/eu.smallwaterblessing:euSWB.Key0503.inicpit
ltx/en_us_public/eu.smallwaterblessing:euSWB.Key0503.text	@ltx/en_us_goadedes/eu.smallwaterblessing:euSWB.Key0503.text
ltx/en_us_public/eu.smallwaterblessing:euSWB.Key0503.title	@ltx/en_us_goadedes/eu.smallwaterblessing:euSWB.Key0503.title
ltx/en_us_public/eu.smallwaterblessing:euSWB.Key0504.text	@ltx/en_us_goadedes/eu.smallwaterblessing:euSWB.Key0504.text
ltx/en_us_public/eu.smallwaterblessing:euSWB.Key0601.text	@ltx/en_us_holycross/eu.smallwaterblessing:euSWB.Key0601.text
ltx/en_us_public/eu.smallwaterblessing:euSWB.Key0602.mode	@ltx/en_us_dedes/eu.smallwaterblessing:euSWB.Key0602.mode
ltx/en_us_public/eu.smallwaterblessing:euSWB.Key0602.text	@ltx/en_us_dedes/eu.smallwaterblessing:euSWB.Key0602.text
ltx/en_us_public/eu.smallwaterblessing:euSWB.R101	@ltx/en_us_holycross/eu.smallwaterblessing:euSWB.R101
ltx/en_us_public/eu.smallwaterblessing:euSWB.R102	@ltx/en_us_dedes/eu.smallwaterblessing:euSWB.R102
ltx/en_us_public/eu.smallwaterblessing:euSWB.R201	@ltx/en_us_dedes/eu.smallwaterblessing:euSWB.R201
ltx/en_us_public/eu.smallwaterblessing:euSWB.R301	@ltx/en_us_dedes/eu.smallwaterblessing:euSWB.R301
ltx/en_us_public/eu.smallwaterblessing:euSWB.R401	@ltx/en_us_dedes/eu.smallwaterblessing:euSWB.R401
ltx/en_us_public/eu.smallwaterblessing:euSWB.R501	@ltx/en_us_dedes/eu.smallwaterblessing:euSWB.R501
ltx/en_us_public/eu.smallwaterblessing:euSWB.R601	@ltx/en_us_dedes/eu.smallwaterblessing:euSWB.R601
ltx/en_us_public/eu.smallwaterblessing:euSWB.R602	@ltx/en_us_dedes/eu.smallwaterblessing:euSWB.R602
ltx/en_us_public/eu.smallwaterblessing:euSWB.R603	@ltx/en_us_dedes/eu.smallwaterblessing:euSWB.R603
ltx/en_us_public/eu.smallwaterblessing:euSWB.R604	@ltx/en_us_dedes/eu.smallwaterblessing:euSWB.R604
ltx/en_us_public/eu.smallwaterblessing:euSWB.R605	@ltx/en_us_dedes/eu.smallwaterblessing:euSWB.R605
ltx/en_us_public/eu.smallwaterblessing:euSWB.translator1	@ltx/en_us_holycross/eu.smallwaterblessing:euSWB.translator1
ltx/en_us_public/eu.smallwaterblessing:euSWB.translator2	@ltx/en_us_dedes/eu.smallwaterblessing:euSWB.translator2
