ltx/en_us_public/other.giatrissaparaklesis1:hoCA.Apolytikion1.incipit	@ltx/en_us_goadedes/other.giatrissaparaklesis1:hoCA.Apolytikion1.incipit
ltx/en_us_public/other.giatrissaparaklesis1:hoCA.Apolytikion1.melody	@ltx/en_us_goadedes/other.giatrissaparaklesis1:hoCA.Apolytikion1.melody
ltx/en_us_public/other.giatrissaparaklesis1:hoCA.Apolytikion1.mode	@ltx/en_us_goadedes/other.giatrissaparaklesis1:hoCA.Apolytikion1.mode
ltx/en_us_public/other.giatrissaparaklesis1:hoCA.Apolytikion1.text	@ltx/en_us_goadedes/other.giatrissaparaklesis1:hoCA.Apolytikion1.text
ltx/en_us_public/other.giatrissaparaklesis1:hoCA.Apolytikion2.incipit	@ltx/en_us_goadedes/other.giatrissaparaklesis1:hoCA.Apolytikion2.incipit
ltx/en_us_public/other.giatrissaparaklesis1:hoCA.Apolytikion2.melody	@ltx/en_us_goadedes/other.giatrissaparaklesis1:hoCA.Apolytikion2.melody
ltx/en_us_public/other.giatrissaparaklesis1:hoCA.Apolytikion2.mode	@ltx/en_us_goadedes/other.giatrissaparaklesis1:hoCA.Apolytikion2.mode
ltx/en_us_public/other.giatrissaparaklesis1:hoCA.Apolytikion2.text	@ltx/en_us_goadedes/other.giatrissaparaklesis1:hoCA.Apolytikion2.text
ltx/en_us_public/other.giatrissaparaklesis1:hoCA.Insert1	@ltx/en_us_goadedes/other.giatrissaparaklesis1:hoCA.Insert1
ltx/en_us_public/other.giatrissaparaklesis1:hoCA.Kathisma11.incipit	@ltx/en_us_goadedes/other.giatrissaparaklesis1:hoCA.Kathisma11.incipit
ltx/en_us_public/other.giatrissaparaklesis1:hoCA.Kathisma11.melody	@ltx/en_us_goadedes/other.giatrissaparaklesis1:hoCA.Kathisma11.melody
ltx/en_us_public/other.giatrissaparaklesis1:hoCA.Kathisma11.mode	@ltx/en_us_goadedes/other.giatrissaparaklesis1:hoCA.Kathisma11.mode
ltx/en_us_public/other.giatrissaparaklesis1:hoCA.Kathisma11.text	@ltx/en_us_goadedes/other.giatrissaparaklesis1:hoCA.Kathisma11.text
ltx/en_us_public/other.giatrissaparaklesis1:hoCA.Kontakion.incipit	@ltx/en_us_goadedes/other.giatrissaparaklesis1:hoCA.Kontakion.incipit
ltx/en_us_public/other.giatrissaparaklesis1:hoCA.Kontakion.melody	@ltx/en_us_goadedes/other.giatrissaparaklesis1:hoCA.Kontakion.melody
ltx/en_us_public/other.giatrissaparaklesis1:hoCA.Kontakion.mode	@ltx/en_us_goadedes/other.giatrissaparaklesis1:hoCA.Kontakion.mode
ltx/en_us_public/other.giatrissaparaklesis1:hoCA.Kontakion.text	@ltx/en_us_goadedes/other.giatrissaparaklesis1:hoCA.Kontakion.text
ltx/en_us_public/other.giatrissaparaklesis1:hoCA.Meg02.incipit	@ltx/en_us_goadedes/other.giatrissaparaklesis1:hoCA.Meg02.incipit
ltx/en_us_public/other.giatrissaparaklesis1:hoCA.Meg02.melody	@ltx/en_us_goadedes/other.giatrissaparaklesis1:hoCA.Meg02.melody
ltx/en_us_public/other.giatrissaparaklesis1:hoCA.Meg02.text	@ltx/en_us_goadedes/other.giatrissaparaklesis1:hoCA.Meg02.text
ltx/en_us_public/other.giatrissaparaklesis1:hoCA.Meg03.incipit	@ltx/en_us_goadedes/other.giatrissaparaklesis1:hoCA.Meg03.incipit
ltx/en_us_public/other.giatrissaparaklesis1:hoCA.Meg03.melody	@ltx/en_us_goadedes/other.giatrissaparaklesis1:hoCA.Meg03.melody
ltx/en_us_public/other.giatrissaparaklesis1:hoCA.Meg03.text	@ltx/en_us_goadedes/other.giatrissaparaklesis1:hoCA.Meg03.text
ltx/en_us_public/other.giatrissaparaklesis1:hoCA.Meg04.incipit	@ltx/en_us_goadedes/other.giatrissaparaklesis1:hoCA.Meg04.incipit
ltx/en_us_public/other.giatrissaparaklesis1:hoCA.Meg04.melody	@ltx/en_us_goadedes/other.giatrissaparaklesis1:hoCA.Meg04.melody
ltx/en_us_public/other.giatrissaparaklesis1:hoCA.Meg04.text	@ltx/en_us_goadedes/other.giatrissaparaklesis1:hoCA.Meg04.text
ltx/en_us_public/other.giatrissaparaklesis1:hoCA.Meg05.incipit	@ltx/en_us_goadedes/other.giatrissaparaklesis1:hoCA.Meg05.incipit
ltx/en_us_public/other.giatrissaparaklesis1:hoCA.Meg05.melody	@ltx/en_us_goadedes/other.giatrissaparaklesis1:hoCA.Meg05.melody
ltx/en_us_public/other.giatrissaparaklesis1:hoCA.Meg05.text	@ltx/en_us_goadedes/other.giatrissaparaklesis1:hoCA.Meg05.text
ltx/en_us_public/other.giatrissaparaklesis1:hoCA.Meg06.incipit	@ltx/en_us_goadedes/other.giatrissaparaklesis1:hoCA.Meg06.incipit
ltx/en_us_public/other.giatrissaparaklesis1:hoCA.Meg06.melody	@ltx/en_us_goadedes/other.giatrissaparaklesis1:hoCA.Meg06.melody
ltx/en_us_public/other.giatrissaparaklesis1:hoCA.Meg06.text	@ltx/en_us_goadedes/other.giatrissaparaklesis1:hoCA.Meg06.text
ltx/en_us_public/other.giatrissaparaklesis1:hoCA.Ode11.incipit	@ltx/en_us_goadedes/other.giatrissaparaklesis1:hoCA.Ode11.incipit
ltx/en_us_public/other.giatrissaparaklesis1:hoCA.Ode11.melody	@ltx/en_us_goadedes/other.giatrissaparaklesis1:hoCA.Ode11.melody
ltx/en_us_public/other.giatrissaparaklesis1:hoCA.Ode11.mode	@ltx/en_us_goadedes/other.giatrissaparaklesis1:hoCA.Ode11.mode
ltx/en_us_public/other.giatrissaparaklesis1:hoCA.Ode11.ode	@ltx/en_us_goadedes/other.giatrissaparaklesis1:hoCA.Ode11.ode
ltx/en_us_public/other.giatrissaparaklesis1:hoCA.Ode11.text	@ltx/en_us_goadedes/other.giatrissaparaklesis1:hoCA.Ode11.text
ltx/en_us_public/other.giatrissaparaklesis1:hoCA.Ode12.incipit	@ltx/en_us_goadedes/other.giatrissaparaklesis1:hoCA.Ode12.incipit
ltx/en_us_public/other.giatrissaparaklesis1:hoCA.Ode12.melody	@ltx/en_us_goadedes/other.giatrissaparaklesis1:hoCA.Ode12.melody
ltx/en_us_public/other.giatrissaparaklesis1:hoCA.Ode12.mode	@ltx/en_us_goadedes/other.giatrissaparaklesis1:hoCA.Ode12.mode
ltx/en_us_public/other.giatrissaparaklesis1:hoCA.Ode12.ode	@ltx/en_us_goadedes/other.giatrissaparaklesis1:hoCA.Ode12.ode
ltx/en_us_public/other.giatrissaparaklesis1:hoCA.Ode12.text	@ltx/en_us_goadedes/other.giatrissaparaklesis1:hoCA.Ode12.text
ltx/en_us_public/other.giatrissaparaklesis1:hoCA.Ode13.incipit	@ltx/en_us_goadedes/other.giatrissaparaklesis1:hoCA.Ode13.incipit
ltx/en_us_public/other.giatrissaparaklesis1:hoCA.Ode13.melody	@ltx/en_us_goadedes/other.giatrissaparaklesis1:hoCA.Ode13.melody
ltx/en_us_public/other.giatrissaparaklesis1:hoCA.Ode13.mode	@ltx/en_us_goadedes/other.giatrissaparaklesis1:hoCA.Ode13.mode
ltx/en_us_public/other.giatrissaparaklesis1:hoCA.Ode13.ode	@ltx/en_us_goadedes/other.giatrissaparaklesis1:hoCA.Ode13.ode
ltx/en_us_public/other.giatrissaparaklesis1:hoCA.Ode13.text	@ltx/en_us_goadedes/other.giatrissaparaklesis1:hoCA.Ode13.text
ltx/en_us_public/other.giatrissaparaklesis1:hoCA.Ode14.incipit	@ltx/en_us_goadedes/other.giatrissaparaklesis1:hoCA.Ode14.incipit
ltx/en_us_public/other.giatrissaparaklesis1:hoCA.Ode14.melody	@ltx/en_us_goadedes/other.giatrissaparaklesis1:hoCA.Ode14.melody
ltx/en_us_public/other.giatrissaparaklesis1:hoCA.Ode14.mode	@ltx/en_us_goadedes/other.giatrissaparaklesis1:hoCA.Ode14.mode
ltx/en_us_public/other.giatrissaparaklesis1:hoCA.Ode14.ode	@ltx/en_us_goadedes/other.giatrissaparaklesis1:hoCA.Ode14.ode
ltx/en_us_public/other.giatrissaparaklesis1:hoCA.Ode14.text	@ltx/en_us_goadedes/other.giatrissaparaklesis1:hoCA.Ode14.text
ltx/en_us_public/other.giatrissaparaklesis1:hoCA.Ode1H.incipit	@ltx/en_us_goadedes/other.giatrissaparaklesis1:hoCA.Ode1H.incipit
ltx/en_us_public/other.giatrissaparaklesis1:hoCA.Ode1H.melody	@ltx/en_us_goadedes/other.giatrissaparaklesis1:hoCA.Ode1H.melody
ltx/en_us_public/other.giatrissaparaklesis1:hoCA.Ode1H.mode	@ltx/en_us_goadedes/other.giatrissaparaklesis1:hoCA.Ode1H.mode
ltx/en_us_public/other.giatrissaparaklesis1:hoCA.Ode1H.ode	@ltx/en_us_goadedes/other.giatrissaparaklesis1:hoCA.Ode1H.ode
ltx/en_us_public/other.giatrissaparaklesis1:hoCA.Ode1H.text	@ltx/en_us_goadedes/other.giatrissaparaklesis1:hoCA.Ode1H.text
ltx/en_us_public/other.giatrissaparaklesis1:hoCA.Ode31.incipit	@ltx/en_us_goadedes/other.giatrissaparaklesis1:hoCA.Ode31.incipit
ltx/en_us_public/other.giatrissaparaklesis1:hoCA.Ode31.melody	@ltx/en_us_goadedes/other.giatrissaparaklesis1:hoCA.Ode31.melody
ltx/en_us_public/other.giatrissaparaklesis1:hoCA.Ode31.mode	@ltx/en_us_goadedes/other.giatrissaparaklesis1:hoCA.Ode31.mode
ltx/en_us_public/other.giatrissaparaklesis1:hoCA.Ode31.ode	@ltx/en_us_goadedes/other.giatrissaparaklesis1:hoCA.Ode31.ode
ltx/en_us_public/other.giatrissaparaklesis1:hoCA.Ode31.text	@ltx/en_us_goadedes/other.giatrissaparaklesis1:hoCA.Ode31.text
ltx/en_us_public/other.giatrissaparaklesis1:hoCA.Ode32.incipit	@ltx/en_us_goadedes/other.giatrissaparaklesis1:hoCA.Ode32.incipit
ltx/en_us_public/other.giatrissaparaklesis1:hoCA.Ode32.melody	@ltx/en_us_goadedes/other.giatrissaparaklesis1:hoCA.Ode32.melody
ltx/en_us_public/other.giatrissaparaklesis1:hoCA.Ode32.mode	@ltx/en_us_goadedes/other.giatrissaparaklesis1:hoCA.Ode32.mode
ltx/en_us_public/other.giatrissaparaklesis1:hoCA.Ode32.ode	@ltx/en_us_goadedes/other.giatrissaparaklesis1:hoCA.Ode32.ode
ltx/en_us_public/other.giatrissaparaklesis1:hoCA.Ode32.text	@ltx/en_us_goadedes/other.giatrissaparaklesis1:hoCA.Ode32.text
ltx/en_us_public/other.giatrissaparaklesis1:hoCA.Ode33.incipit	@ltx/en_us_goadedes/other.giatrissaparaklesis1:hoCA.Ode33.incipit
ltx/en_us_public/other.giatrissaparaklesis1:hoCA.Ode33.melody	@ltx/en_us_goadedes/other.giatrissaparaklesis1:hoCA.Ode33.melody
ltx/en_us_public/other.giatrissaparaklesis1:hoCA.Ode33.mode	@ltx/en_us_goadedes/other.giatrissaparaklesis1:hoCA.Ode33.mode
ltx/en_us_public/other.giatrissaparaklesis1:hoCA.Ode33.ode	@ltx/en_us_goadedes/other.giatrissaparaklesis1:hoCA.Ode33.ode
ltx/en_us_public/other.giatrissaparaklesis1:hoCA.Ode33.text	@ltx/en_us_goadedes/other.giatrissaparaklesis1:hoCA.Ode33.text
ltx/en_us_public/other.giatrissaparaklesis1:hoCA.Ode34.incipit	@ltx/en_us_goadedes/other.giatrissaparaklesis1:hoCA.Ode34.incipit
ltx/en_us_public/other.giatrissaparaklesis1:hoCA.Ode34.melody	@ltx/en_us_goadedes/other.giatrissaparaklesis1:hoCA.Ode34.melody
ltx/en_us_public/other.giatrissaparaklesis1:hoCA.Ode34.mode	@ltx/en_us_goadedes/other.giatrissaparaklesis1:hoCA.Ode34.mode
ltx/en_us_public/other.giatrissaparaklesis1:hoCA.Ode34.ode	@ltx/en_us_goadedes/other.giatrissaparaklesis1:hoCA.Ode34.ode
ltx/en_us_public/other.giatrissaparaklesis1:hoCA.Ode34.text	@ltx/en_us_goadedes/other.giatrissaparaklesis1:hoCA.Ode34.text
ltx/en_us_public/other.giatrissaparaklesis1:hoCA.Ode3H.incipit	@ltx/en_us_goadedes/other.giatrissaparaklesis1:hoCA.Ode3H.incipit
ltx/en_us_public/other.giatrissaparaklesis1:hoCA.Ode3H.melody	@ltx/en_us_goadedes/other.giatrissaparaklesis1:hoCA.Ode3H.melody
ltx/en_us_public/other.giatrissaparaklesis1:hoCA.Ode3H.mode	@ltx/en_us_goadedes/other.giatrissaparaklesis1:hoCA.Ode3H.mode
ltx/en_us_public/other.giatrissaparaklesis1:hoCA.Ode3H.ode	@ltx/en_us_goadedes/other.giatrissaparaklesis1:hoCA.Ode3H.ode
ltx/en_us_public/other.giatrissaparaklesis1:hoCA.Ode3H.text	@ltx/en_us_goadedes/other.giatrissaparaklesis1:hoCA.Ode3H.text
ltx/en_us_public/other.giatrissaparaklesis1:hoCA.Ode41.incipit	@ltx/en_us_goadedes/other.giatrissaparaklesis1:hoCA.Ode41.incipit
ltx/en_us_public/other.giatrissaparaklesis1:hoCA.Ode41.melody	@ltx/en_us_goadedes/other.giatrissaparaklesis1:hoCA.Ode41.melody
ltx/en_us_public/other.giatrissaparaklesis1:hoCA.Ode41.mode	@ltx/en_us_goadedes/other.giatrissaparaklesis1:hoCA.Ode41.mode
ltx/en_us_public/other.giatrissaparaklesis1:hoCA.Ode41.ode	@ltx/en_us_goadedes/other.giatrissaparaklesis1:hoCA.Ode41.ode
ltx/en_us_public/other.giatrissaparaklesis1:hoCA.Ode41.text	@ltx/en_us_goadedes/other.giatrissaparaklesis1:hoCA.Ode41.text
ltx/en_us_public/other.giatrissaparaklesis1:hoCA.Ode42.incipit	@ltx/en_us_goadedes/other.giatrissaparaklesis1:hoCA.Ode42.incipit
ltx/en_us_public/other.giatrissaparaklesis1:hoCA.Ode42.melody	@ltx/en_us_goadedes/other.giatrissaparaklesis1:hoCA.Ode42.melody
ltx/en_us_public/other.giatrissaparaklesis1:hoCA.Ode42.mode	@ltx/en_us_goadedes/other.giatrissaparaklesis1:hoCA.Ode42.mode
ltx/en_us_public/other.giatrissaparaklesis1:hoCA.Ode42.ode	@ltx/en_us_goadedes/other.giatrissaparaklesis1:hoCA.Ode42.ode
ltx/en_us_public/other.giatrissaparaklesis1:hoCA.Ode42.text	@ltx/en_us_goadedes/other.giatrissaparaklesis1:hoCA.Ode42.text
ltx/en_us_public/other.giatrissaparaklesis1:hoCA.Ode43.incipit	@ltx/en_us_goadedes/other.giatrissaparaklesis1:hoCA.Ode43.incipit
ltx/en_us_public/other.giatrissaparaklesis1:hoCA.Ode43.melody	@ltx/en_us_goadedes/other.giatrissaparaklesis1:hoCA.Ode43.melody
ltx/en_us_public/other.giatrissaparaklesis1:hoCA.Ode43.mode	@ltx/en_us_goadedes/other.giatrissaparaklesis1:hoCA.Ode43.mode
ltx/en_us_public/other.giatrissaparaklesis1:hoCA.Ode43.ode	@ltx/en_us_goadedes/other.giatrissaparaklesis1:hoCA.Ode43.ode
ltx/en_us_public/other.giatrissaparaklesis1:hoCA.Ode43.text	@ltx/en_us_goadedes/other.giatrissaparaklesis1:hoCA.Ode43.text
ltx/en_us_public/other.giatrissaparaklesis1:hoCA.Ode44.incipit	@ltx/en_us_goadedes/other.giatrissaparaklesis1:hoCA.Ode44.incipit
ltx/en_us_public/other.giatrissaparaklesis1:hoCA.Ode44.melody	@ltx/en_us_goadedes/other.giatrissaparaklesis1:hoCA.Ode44.melody
ltx/en_us_public/other.giatrissaparaklesis1:hoCA.Ode44.mode	@ltx/en_us_goadedes/other.giatrissaparaklesis1:hoCA.Ode44.mode
ltx/en_us_public/other.giatrissaparaklesis1:hoCA.Ode44.ode	@ltx/en_us_goadedes/other.giatrissaparaklesis1:hoCA.Ode44.ode
ltx/en_us_public/other.giatrissaparaklesis1:hoCA.Ode44.text	@ltx/en_us_goadedes/other.giatrissaparaklesis1:hoCA.Ode44.text
ltx/en_us_public/other.giatrissaparaklesis1:hoCA.Ode4H.incipit	@ltx/en_us_goadedes/other.giatrissaparaklesis1:hoCA.Ode4H.incipit
ltx/en_us_public/other.giatrissaparaklesis1:hoCA.Ode4H.melody	@ltx/en_us_goadedes/other.giatrissaparaklesis1:hoCA.Ode4H.melody
ltx/en_us_public/other.giatrissaparaklesis1:hoCA.Ode4H.mode	@ltx/en_us_goadedes/other.giatrissaparaklesis1:hoCA.Ode4H.mode
ltx/en_us_public/other.giatrissaparaklesis1:hoCA.Ode4H.ode	@ltx/en_us_goadedes/other.giatrissaparaklesis1:hoCA.Ode4H.ode
ltx/en_us_public/other.giatrissaparaklesis1:hoCA.Ode4H.text	@ltx/en_us_goadedes/other.giatrissaparaklesis1:hoCA.Ode4H.text
ltx/en_us_public/other.giatrissaparaklesis1:hoCA.Ode51.incipit	@ltx/en_us_goadedes/other.giatrissaparaklesis1:hoCA.Ode51.incipit
ltx/en_us_public/other.giatrissaparaklesis1:hoCA.Ode51.melody	@ltx/en_us_goadedes/other.giatrissaparaklesis1:hoCA.Ode51.melody
ltx/en_us_public/other.giatrissaparaklesis1:hoCA.Ode51.mode	@ltx/en_us_goadedes/other.giatrissaparaklesis1:hoCA.Ode51.mode
ltx/en_us_public/other.giatrissaparaklesis1:hoCA.Ode51.ode	@ltx/en_us_goadedes/other.giatrissaparaklesis1:hoCA.Ode51.ode
ltx/en_us_public/other.giatrissaparaklesis1:hoCA.Ode51.text	@ltx/en_us_goadedes/other.giatrissaparaklesis1:hoCA.Ode51.text
ltx/en_us_public/other.giatrissaparaklesis1:hoCA.Ode52.incipit	@ltx/en_us_goadedes/other.giatrissaparaklesis1:hoCA.Ode52.incipit
ltx/en_us_public/other.giatrissaparaklesis1:hoCA.Ode52.melody	@ltx/en_us_goadedes/other.giatrissaparaklesis1:hoCA.Ode52.melody
ltx/en_us_public/other.giatrissaparaklesis1:hoCA.Ode52.mode	@ltx/en_us_goadedes/other.giatrissaparaklesis1:hoCA.Ode52.mode
ltx/en_us_public/other.giatrissaparaklesis1:hoCA.Ode52.ode	@ltx/en_us_goadedes/other.giatrissaparaklesis1:hoCA.Ode52.ode
ltx/en_us_public/other.giatrissaparaklesis1:hoCA.Ode52.text	@ltx/en_us_goadedes/other.giatrissaparaklesis1:hoCA.Ode52.text
ltx/en_us_public/other.giatrissaparaklesis1:hoCA.Ode53.incipit	@ltx/en_us_goadedes/other.giatrissaparaklesis1:hoCA.Ode53.incipit
ltx/en_us_public/other.giatrissaparaklesis1:hoCA.Ode53.melody	@ltx/en_us_goadedes/other.giatrissaparaklesis1:hoCA.Ode53.melody
ltx/en_us_public/other.giatrissaparaklesis1:hoCA.Ode53.mode	@ltx/en_us_goadedes/other.giatrissaparaklesis1:hoCA.Ode53.mode
ltx/en_us_public/other.giatrissaparaklesis1:hoCA.Ode53.ode	@ltx/en_us_goadedes/other.giatrissaparaklesis1:hoCA.Ode53.ode
ltx/en_us_public/other.giatrissaparaklesis1:hoCA.Ode53.text	@ltx/en_us_goadedes/other.giatrissaparaklesis1:hoCA.Ode53.text
ltx/en_us_public/other.giatrissaparaklesis1:hoCA.Ode54.incipit	@ltx/en_us_goadedes/other.giatrissaparaklesis1:hoCA.Ode54.incipit
ltx/en_us_public/other.giatrissaparaklesis1:hoCA.Ode54.melody	@ltx/en_us_goadedes/other.giatrissaparaklesis1:hoCA.Ode54.melody
ltx/en_us_public/other.giatrissaparaklesis1:hoCA.Ode54.mode	@ltx/en_us_goadedes/other.giatrissaparaklesis1:hoCA.Ode54.mode
ltx/en_us_public/other.giatrissaparaklesis1:hoCA.Ode54.ode	@ltx/en_us_goadedes/other.giatrissaparaklesis1:hoCA.Ode54.ode
ltx/en_us_public/other.giatrissaparaklesis1:hoCA.Ode54.text	@ltx/en_us_goadedes/other.giatrissaparaklesis1:hoCA.Ode54.text
ltx/en_us_public/other.giatrissaparaklesis1:hoCA.Ode5H.incipit	@ltx/en_us_goadedes/other.giatrissaparaklesis1:hoCA.Ode5H.incipit
ltx/en_us_public/other.giatrissaparaklesis1:hoCA.Ode5H.melody	@ltx/en_us_goadedes/other.giatrissaparaklesis1:hoCA.Ode5H.melody
ltx/en_us_public/other.giatrissaparaklesis1:hoCA.Ode5H.mode	@ltx/en_us_goadedes/other.giatrissaparaklesis1:hoCA.Ode5H.mode
ltx/en_us_public/other.giatrissaparaklesis1:hoCA.Ode5H.ode	@ltx/en_us_goadedes/other.giatrissaparaklesis1:hoCA.Ode5H.ode
ltx/en_us_public/other.giatrissaparaklesis1:hoCA.Ode5H.text	@ltx/en_us_goadedes/other.giatrissaparaklesis1:hoCA.Ode5H.text
ltx/en_us_public/other.giatrissaparaklesis1:hoCA.Ode61.incipit	@ltx/en_us_goadedes/other.giatrissaparaklesis1:hoCA.Ode61.incipit
ltx/en_us_public/other.giatrissaparaklesis1:hoCA.Ode61.melody	@ltx/en_us_goadedes/other.giatrissaparaklesis1:hoCA.Ode61.melody
ltx/en_us_public/other.giatrissaparaklesis1:hoCA.Ode61.mode	@ltx/en_us_goadedes/other.giatrissaparaklesis1:hoCA.Ode61.mode
ltx/en_us_public/other.giatrissaparaklesis1:hoCA.Ode61.ode	@ltx/en_us_goadedes/other.giatrissaparaklesis1:hoCA.Ode61.ode
ltx/en_us_public/other.giatrissaparaklesis1:hoCA.Ode61.text	@ltx/en_us_goadedes/other.giatrissaparaklesis1:hoCA.Ode61.text
ltx/en_us_public/other.giatrissaparaklesis1:hoCA.Ode62.incipit	@ltx/en_us_goadedes/other.giatrissaparaklesis1:hoCA.Ode62.incipit
ltx/en_us_public/other.giatrissaparaklesis1:hoCA.Ode62.melody	@ltx/en_us_goadedes/other.giatrissaparaklesis1:hoCA.Ode62.melody
ltx/en_us_public/other.giatrissaparaklesis1:hoCA.Ode62.mode	@ltx/en_us_goadedes/other.giatrissaparaklesis1:hoCA.Ode62.mode
ltx/en_us_public/other.giatrissaparaklesis1:hoCA.Ode62.ode	@ltx/en_us_goadedes/other.giatrissaparaklesis1:hoCA.Ode62.ode
ltx/en_us_public/other.giatrissaparaklesis1:hoCA.Ode62.text	@ltx/en_us_goadedes/other.giatrissaparaklesis1:hoCA.Ode62.text
ltx/en_us_public/other.giatrissaparaklesis1:hoCA.Ode63.incipit	@ltx/en_us_goadedes/other.giatrissaparaklesis1:hoCA.Ode63.incipit
ltx/en_us_public/other.giatrissaparaklesis1:hoCA.Ode63.melody	@ltx/en_us_goadedes/other.giatrissaparaklesis1:hoCA.Ode63.melody
ltx/en_us_public/other.giatrissaparaklesis1:hoCA.Ode63.mode	@ltx/en_us_goadedes/other.giatrissaparaklesis1:hoCA.Ode63.mode
ltx/en_us_public/other.giatrissaparaklesis1:hoCA.Ode63.ode	@ltx/en_us_goadedes/other.giatrissaparaklesis1:hoCA.Ode63.ode
ltx/en_us_public/other.giatrissaparaklesis1:hoCA.Ode63.text	@ltx/en_us_goadedes/other.giatrissaparaklesis1:hoCA.Ode63.text
ltx/en_us_public/other.giatrissaparaklesis1:hoCA.Ode64.incipit	@ltx/en_us_goadedes/other.giatrissaparaklesis1:hoCA.Ode64.incipit
ltx/en_us_public/other.giatrissaparaklesis1:hoCA.Ode64.melody	@ltx/en_us_goadedes/other.giatrissaparaklesis1:hoCA.Ode64.melody
ltx/en_us_public/other.giatrissaparaklesis1:hoCA.Ode64.mode	@ltx/en_us_goadedes/other.giatrissaparaklesis1:hoCA.Ode64.mode
ltx/en_us_public/other.giatrissaparaklesis1:hoCA.Ode64.ode	@ltx/en_us_goadedes/other.giatrissaparaklesis1:hoCA.Ode64.ode
ltx/en_us_public/other.giatrissaparaklesis1:hoCA.Ode64.text	@ltx/en_us_goadedes/other.giatrissaparaklesis1:hoCA.Ode64.text
ltx/en_us_public/other.giatrissaparaklesis1:hoCA.Ode6H.incipit	@ltx/en_us_goadedes/other.giatrissaparaklesis1:hoCA.Ode6H.incipit
ltx/en_us_public/other.giatrissaparaklesis1:hoCA.Ode6H.melody	@ltx/en_us_goadedes/other.giatrissaparaklesis1:hoCA.Ode6H.melody
ltx/en_us_public/other.giatrissaparaklesis1:hoCA.Ode6H.mode	@ltx/en_us_goadedes/other.giatrissaparaklesis1:hoCA.Ode6H.mode
ltx/en_us_public/other.giatrissaparaklesis1:hoCA.Ode6H.ode	@ltx/en_us_goadedes/other.giatrissaparaklesis1:hoCA.Ode6H.ode
ltx/en_us_public/other.giatrissaparaklesis1:hoCA.Ode6H.text	@ltx/en_us_goadedes/other.giatrissaparaklesis1:hoCA.Ode6H.text
ltx/en_us_public/other.giatrissaparaklesis1:hoCA.Ode71.incipit	@ltx/en_us_goadedes/other.giatrissaparaklesis1:hoCA.Ode71.incipit
ltx/en_us_public/other.giatrissaparaklesis1:hoCA.Ode71.melody	@ltx/en_us_goadedes/other.giatrissaparaklesis1:hoCA.Ode71.melody
ltx/en_us_public/other.giatrissaparaklesis1:hoCA.Ode71.mode	@ltx/en_us_goadedes/other.giatrissaparaklesis1:hoCA.Ode71.mode
ltx/en_us_public/other.giatrissaparaklesis1:hoCA.Ode71.ode	@ltx/en_us_goadedes/other.giatrissaparaklesis1:hoCA.Ode71.ode
ltx/en_us_public/other.giatrissaparaklesis1:hoCA.Ode71.text	@ltx/en_us_goadedes/other.giatrissaparaklesis1:hoCA.Ode71.text
ltx/en_us_public/other.giatrissaparaklesis1:hoCA.Ode72.incipit	@ltx/en_us_goadedes/other.giatrissaparaklesis1:hoCA.Ode72.incipit
ltx/en_us_public/other.giatrissaparaklesis1:hoCA.Ode72.melody	@ltx/en_us_goadedes/other.giatrissaparaklesis1:hoCA.Ode72.melody
ltx/en_us_public/other.giatrissaparaklesis1:hoCA.Ode72.mode	@ltx/en_us_goadedes/other.giatrissaparaklesis1:hoCA.Ode72.mode
ltx/en_us_public/other.giatrissaparaklesis1:hoCA.Ode72.ode	@ltx/en_us_goadedes/other.giatrissaparaklesis1:hoCA.Ode72.ode
ltx/en_us_public/other.giatrissaparaklesis1:hoCA.Ode72.text	@ltx/en_us_goadedes/other.giatrissaparaklesis1:hoCA.Ode72.text
ltx/en_us_public/other.giatrissaparaklesis1:hoCA.Ode73.incipit	@ltx/en_us_goadedes/other.giatrissaparaklesis1:hoCA.Ode73.incipit
ltx/en_us_public/other.giatrissaparaklesis1:hoCA.Ode73.melody	@ltx/en_us_goadedes/other.giatrissaparaklesis1:hoCA.Ode73.melody
ltx/en_us_public/other.giatrissaparaklesis1:hoCA.Ode73.mode	@ltx/en_us_goadedes/other.giatrissaparaklesis1:hoCA.Ode73.mode
ltx/en_us_public/other.giatrissaparaklesis1:hoCA.Ode73.ode	@ltx/en_us_goadedes/other.giatrissaparaklesis1:hoCA.Ode73.ode
ltx/en_us_public/other.giatrissaparaklesis1:hoCA.Ode73.text	@ltx/en_us_goadedes/other.giatrissaparaklesis1:hoCA.Ode73.text
ltx/en_us_public/other.giatrissaparaklesis1:hoCA.Ode74.incipit	@ltx/en_us_goadedes/other.giatrissaparaklesis1:hoCA.Ode74.incipit
ltx/en_us_public/other.giatrissaparaklesis1:hoCA.Ode74.melody	@ltx/en_us_goadedes/other.giatrissaparaklesis1:hoCA.Ode74.melody
ltx/en_us_public/other.giatrissaparaklesis1:hoCA.Ode74.mode	@ltx/en_us_goadedes/other.giatrissaparaklesis1:hoCA.Ode74.mode
ltx/en_us_public/other.giatrissaparaklesis1:hoCA.Ode74.ode	@ltx/en_us_goadedes/other.giatrissaparaklesis1:hoCA.Ode74.ode
ltx/en_us_public/other.giatrissaparaklesis1:hoCA.Ode74.text	@ltx/en_us_goadedes/other.giatrissaparaklesis1:hoCA.Ode74.text
ltx/en_us_public/other.giatrissaparaklesis1:hoCA.Ode7H.incipit	@ltx/en_us_goadedes/other.giatrissaparaklesis1:hoCA.Ode7H.incipit
ltx/en_us_public/other.giatrissaparaklesis1:hoCA.Ode7H.melody	@ltx/en_us_goadedes/other.giatrissaparaklesis1:hoCA.Ode7H.melody
ltx/en_us_public/other.giatrissaparaklesis1:hoCA.Ode7H.mode	@ltx/en_us_goadedes/other.giatrissaparaklesis1:hoCA.Ode7H.mode
ltx/en_us_public/other.giatrissaparaklesis1:hoCA.Ode7H.ode	@ltx/en_us_goadedes/other.giatrissaparaklesis1:hoCA.Ode7H.ode
ltx/en_us_public/other.giatrissaparaklesis1:hoCA.Ode7H.text	@ltx/en_us_goadedes/other.giatrissaparaklesis1:hoCA.Ode7H.text
ltx/en_us_public/other.giatrissaparaklesis1:hoCA.Ode81.incipit	@ltx/en_us_goadedes/other.giatrissaparaklesis1:hoCA.Ode81.incipit
ltx/en_us_public/other.giatrissaparaklesis1:hoCA.Ode81.melody	@ltx/en_us_goadedes/other.giatrissaparaklesis1:hoCA.Ode81.melody
ltx/en_us_public/other.giatrissaparaklesis1:hoCA.Ode81.mode	@ltx/en_us_goadedes/other.giatrissaparaklesis1:hoCA.Ode81.mode
ltx/en_us_public/other.giatrissaparaklesis1:hoCA.Ode81.ode	@ltx/en_us_goadedes/other.giatrissaparaklesis1:hoCA.Ode81.ode
ltx/en_us_public/other.giatrissaparaklesis1:hoCA.Ode81.text	@ltx/en_us_goadedes/other.giatrissaparaklesis1:hoCA.Ode81.text
ltx/en_us_public/other.giatrissaparaklesis1:hoCA.Ode82.incipit	@ltx/en_us_goadedes/other.giatrissaparaklesis1:hoCA.Ode82.incipit
ltx/en_us_public/other.giatrissaparaklesis1:hoCA.Ode82.melody	@ltx/en_us_goadedes/other.giatrissaparaklesis1:hoCA.Ode82.melody
ltx/en_us_public/other.giatrissaparaklesis1:hoCA.Ode82.mode	@ltx/en_us_goadedes/other.giatrissaparaklesis1:hoCA.Ode82.mode
ltx/en_us_public/other.giatrissaparaklesis1:hoCA.Ode82.ode	@ltx/en_us_goadedes/other.giatrissaparaklesis1:hoCA.Ode82.ode
ltx/en_us_public/other.giatrissaparaklesis1:hoCA.Ode82.text	@ltx/en_us_goadedes/other.giatrissaparaklesis1:hoCA.Ode82.text
ltx/en_us_public/other.giatrissaparaklesis1:hoCA.Ode83.incipit	@ltx/en_us_goadedes/other.giatrissaparaklesis1:hoCA.Ode83.incipit
ltx/en_us_public/other.giatrissaparaklesis1:hoCA.Ode83.melody	@ltx/en_us_goadedes/other.giatrissaparaklesis1:hoCA.Ode83.melody
ltx/en_us_public/other.giatrissaparaklesis1:hoCA.Ode83.mode	@ltx/en_us_goadedes/other.giatrissaparaklesis1:hoCA.Ode83.mode
ltx/en_us_public/other.giatrissaparaklesis1:hoCA.Ode83.ode	@ltx/en_us_goadedes/other.giatrissaparaklesis1:hoCA.Ode83.ode
ltx/en_us_public/other.giatrissaparaklesis1:hoCA.Ode83.text	@ltx/en_us_goadedes/other.giatrissaparaklesis1:hoCA.Ode83.text
ltx/en_us_public/other.giatrissaparaklesis1:hoCA.Ode84.incipit	@ltx/en_us_goadedes/other.giatrissaparaklesis1:hoCA.Ode84.incipit
ltx/en_us_public/other.giatrissaparaklesis1:hoCA.Ode84.melody	@ltx/en_us_goadedes/other.giatrissaparaklesis1:hoCA.Ode84.melody
ltx/en_us_public/other.giatrissaparaklesis1:hoCA.Ode84.mode	@ltx/en_us_goadedes/other.giatrissaparaklesis1:hoCA.Ode84.mode
ltx/en_us_public/other.giatrissaparaklesis1:hoCA.Ode84.ode	@ltx/en_us_goadedes/other.giatrissaparaklesis1:hoCA.Ode84.ode
ltx/en_us_public/other.giatrissaparaklesis1:hoCA.Ode84.text	@ltx/en_us_goadedes/other.giatrissaparaklesis1:hoCA.Ode84.text
ltx/en_us_public/other.giatrissaparaklesis1:hoCA.Ode8H.incipit	@ltx/en_us_goadedes/other.giatrissaparaklesis1:hoCA.Ode8H.incipit
ltx/en_us_public/other.giatrissaparaklesis1:hoCA.Ode8H.melody	@ltx/en_us_goadedes/other.giatrissaparaklesis1:hoCA.Ode8H.melody
ltx/en_us_public/other.giatrissaparaklesis1:hoCA.Ode8H.mode	@ltx/en_us_goadedes/other.giatrissaparaklesis1:hoCA.Ode8H.mode
ltx/en_us_public/other.giatrissaparaklesis1:hoCA.Ode8H.ode	@ltx/en_us_goadedes/other.giatrissaparaklesis1:hoCA.Ode8H.ode
ltx/en_us_public/other.giatrissaparaklesis1:hoCA.Ode8H.text	@ltx/en_us_goadedes/other.giatrissaparaklesis1:hoCA.Ode8H.text
ltx/en_us_public/other.giatrissaparaklesis1:hoCA.Ode91.incipit	@ltx/en_us_goadedes/other.giatrissaparaklesis1:hoCA.Ode91.incipit
ltx/en_us_public/other.giatrissaparaklesis1:hoCA.Ode91.melody	@ltx/en_us_goadedes/other.giatrissaparaklesis1:hoCA.Ode91.melody
ltx/en_us_public/other.giatrissaparaklesis1:hoCA.Ode91.mode	@ltx/en_us_goadedes/other.giatrissaparaklesis1:hoCA.Ode91.mode
ltx/en_us_public/other.giatrissaparaklesis1:hoCA.Ode91.ode	@ltx/en_us_goadedes/other.giatrissaparaklesis1:hoCA.Ode91.ode
ltx/en_us_public/other.giatrissaparaklesis1:hoCA.Ode91.text	@ltx/en_us_goadedes/other.giatrissaparaklesis1:hoCA.Ode91.text
ltx/en_us_public/other.giatrissaparaklesis1:hoCA.Ode92.incipit	@ltx/en_us_goadedes/other.giatrissaparaklesis1:hoCA.Ode92.incipit
ltx/en_us_public/other.giatrissaparaklesis1:hoCA.Ode92.melody	@ltx/en_us_goadedes/other.giatrissaparaklesis1:hoCA.Ode92.melody
ltx/en_us_public/other.giatrissaparaklesis1:hoCA.Ode92.mode	@ltx/en_us_goadedes/other.giatrissaparaklesis1:hoCA.Ode92.mode
ltx/en_us_public/other.giatrissaparaklesis1:hoCA.Ode92.ode	@ltx/en_us_goadedes/other.giatrissaparaklesis1:hoCA.Ode92.ode
ltx/en_us_public/other.giatrissaparaklesis1:hoCA.Ode92.text	@ltx/en_us_goadedes/other.giatrissaparaklesis1:hoCA.Ode92.text
ltx/en_us_public/other.giatrissaparaklesis1:hoCA.Ode93.incipit	@ltx/en_us_goadedes/other.giatrissaparaklesis1:hoCA.Ode93.incipit
ltx/en_us_public/other.giatrissaparaklesis1:hoCA.Ode93.melody	@ltx/en_us_goadedes/other.giatrissaparaklesis1:hoCA.Ode93.melody
ltx/en_us_public/other.giatrissaparaklesis1:hoCA.Ode93.mode	@ltx/en_us_goadedes/other.giatrissaparaklesis1:hoCA.Ode93.mode
ltx/en_us_public/other.giatrissaparaklesis1:hoCA.Ode93.ode	@ltx/en_us_goadedes/other.giatrissaparaklesis1:hoCA.Ode93.ode
ltx/en_us_public/other.giatrissaparaklesis1:hoCA.Ode93.text	@ltx/en_us_goadedes/other.giatrissaparaklesis1:hoCA.Ode93.text
ltx/en_us_public/other.giatrissaparaklesis1:hoCA.Ode94.incipit	@ltx/en_us_goadedes/other.giatrissaparaklesis1:hoCA.Ode94.incipit
ltx/en_us_public/other.giatrissaparaklesis1:hoCA.Ode94.melody	@ltx/en_us_goadedes/other.giatrissaparaklesis1:hoCA.Ode94.melody
ltx/en_us_public/other.giatrissaparaklesis1:hoCA.Ode94.mode	@ltx/en_us_goadedes/other.giatrissaparaklesis1:hoCA.Ode94.mode
ltx/en_us_public/other.giatrissaparaklesis1:hoCA.Ode94.ode	@ltx/en_us_goadedes/other.giatrissaparaklesis1:hoCA.Ode94.ode
ltx/en_us_public/other.giatrissaparaklesis1:hoCA.Ode94.text	@ltx/en_us_goadedes/other.giatrissaparaklesis1:hoCA.Ode94.text
ltx/en_us_public/other.giatrissaparaklesis1:hoCA.Ode9H.incipit	@ltx/en_us_goadedes/other.giatrissaparaklesis1:hoCA.Ode9H.incipit
ltx/en_us_public/other.giatrissaparaklesis1:hoCA.Ode9H.melody	@ltx/en_us_goadedes/other.giatrissaparaklesis1:hoCA.Ode9H.melody
ltx/en_us_public/other.giatrissaparaklesis1:hoCA.Ode9H.mode	@ltx/en_us_goadedes/other.giatrissaparaklesis1:hoCA.Ode9H.mode
ltx/en_us_public/other.giatrissaparaklesis1:hoCA.Ode9H.ode	@ltx/en_us_goadedes/other.giatrissaparaklesis1:hoCA.Ode9H.ode
ltx/en_us_public/other.giatrissaparaklesis1:hoCA.Ode9H.text	@ltx/en_us_goadedes/other.giatrissaparaklesis1:hoCA.Ode9H.text
ltx/en_us_public/other.giatrissaparaklesis1:hoCA.PostGospelGlory.incipit	@ltx/en_us_goadedes/other.giatrissaparaklesis1:hoCA.PostGospelGlory.incipit
ltx/en_us_public/other.giatrissaparaklesis1:hoCA.PostGospelGlory.melody	@ltx/en_us_goadedes/other.giatrissaparaklesis1:hoCA.PostGospelGlory.melody
ltx/en_us_public/other.giatrissaparaklesis1:hoCA.PostGospelGlory.mode	@ltx/en_us_goadedes/other.giatrissaparaklesis1:hoCA.PostGospelGlory.mode
ltx/en_us_public/other.giatrissaparaklesis1:hoCA.PostGospelGlory.text	@ltx/en_us_goadedes/other.giatrissaparaklesis1:hoCA.PostGospelGlory.text
ltx/en_us_public/other.giatrissaparaklesis1:hoCA.PostGospelHymn1.incipit	@ltx/en_us_goadedes/other.giatrissaparaklesis1:hoCA.PostGospelHymn1.incipit
ltx/en_us_public/other.giatrissaparaklesis1:hoCA.PostGospelHymn1.melody	@ltx/en_us_goadedes/other.giatrissaparaklesis1:hoCA.PostGospelHymn1.melody
ltx/en_us_public/other.giatrissaparaklesis1:hoCA.PostGospelHymn1.mode	@ltx/en_us_goadedes/other.giatrissaparaklesis1:hoCA.PostGospelHymn1.mode
ltx/en_us_public/other.giatrissaparaklesis1:hoCA.PostGospelHymn1.text	@ltx/en_us_goadedes/other.giatrissaparaklesis1:hoCA.PostGospelHymn1.text
ltx/en_us_public/other.giatrissaparaklesis1:hoCA.Troparion1.incipit	@ltx/en_us_goadedes/other.giatrissaparaklesis1:hoCA.Troparion1.incipit
ltx/en_us_public/other.giatrissaparaklesis1:hoCA.Troparion1.melody	@ltx/en_us_goadedes/other.giatrissaparaklesis1:hoCA.Troparion1.melody
ltx/en_us_public/other.giatrissaparaklesis1:hoCA.Troparion1.mode	@ltx/en_us_goadedes/other.giatrissaparaklesis1:hoCA.Troparion1.mode
ltx/en_us_public/other.giatrissaparaklesis1:hoCA.Troparion1.text	@ltx/en_us_goadedes/other.giatrissaparaklesis1:hoCA.Troparion1.text
ltx/en_us_public/other.giatrissaparaklesis1:hoCA.Troparion31.incipit	@ltx/en_us_goadedes/other.giatrissaparaklesis1:hoCA.Troparion31.incipit
ltx/en_us_public/other.giatrissaparaklesis1:hoCA.Troparion31.melody	@ltx/en_us_goadedes/other.giatrissaparaklesis1:hoCA.Troparion31.melody
ltx/en_us_public/other.giatrissaparaklesis1:hoCA.Troparion31.mode	@ltx/en_us_goadedes/other.giatrissaparaklesis1:hoCA.Troparion31.mode
ltx/en_us_public/other.giatrissaparaklesis1:hoCA.Troparion31.text	@ltx/en_us_goadedes/other.giatrissaparaklesis1:hoCA.Troparion31.text
ltx/en_us_public/other.giatrissaparaklesis1:hoCA.Troparion61.incipit	@ltx/en_us_goadedes/other.giatrissaparaklesis1:hoCA.Troparion61.incipit
ltx/en_us_public/other.giatrissaparaklesis1:hoCA.Troparion61.melody	@ltx/en_us_goadedes/other.giatrissaparaklesis1:hoCA.Troparion61.melody
ltx/en_us_public/other.giatrissaparaklesis1:hoCA.Troparion61.mode	@ltx/en_us_goadedes/other.giatrissaparaklesis1:hoCA.Troparion61.mode
ltx/en_us_public/other.giatrissaparaklesis1:hoCA.Troparion61.text	@ltx/en_us_goadedes/other.giatrissaparaklesis1:hoCA.Troparion61.text
ltx/en_us_public/other.giatrissaparaklesis1:hoCA.acrostic.notice1	@ltx/en_us_goadedes/other.giatrissaparaklesis1:hoCA.acrostic.notice1
ltx/en_us_public/other.giatrissaparaklesis1:hoCA.acrostic.text	@ltx/en_us_goadedes/other.giatrissaparaklesis1:hoCA.acrostic.text
ltx/en_us_public/other.giatrissaparaklesis1:hoCA.acrostic.title	@ltx/en_us_goadedes/other.giatrissaparaklesis1:hoCA.acrostic.title
ltx/en_us_public/other.giatrissaparaklesis1:hoCA.couplet1.title	@ltx/en_us_goadedes/other.giatrissaparaklesis1:hoCA.couplet1.title
ltx/en_us_public/other.giatrissaparaklesis1:hoCA.couplet1.verse1	@ltx/en_us_goadedes/other.giatrissaparaklesis1:hoCA.couplet1.verse1
ltx/en_us_public/other.giatrissaparaklesis1:hoCA.couplet1.verse2	@ltx/en_us_goadedes/other.giatrissaparaklesis1:hoCA.couplet1.verse2
ltx/en_us_public/other.giatrissaparaklesis1:hoCA.media.text	@ltx/en_us_goadedes/other.giatrissaparaklesis1:hoCA.media.text
ltx/en_us_public/other.giatrissaparaklesis1:hoCA.poet	@ltx/en_us_goadedes/other.giatrissaparaklesis1:hoCA.poet
ltx/en_us_public/other.giatrissaparaklesis1:hoCA.title	@ltx/en_us_goadedes/other.giatrissaparaklesis1:hoCA.title
ltx/en_us_public/other.giatrissaparaklesis1:hoCA.title2	@ltx/en_us_goadedes/other.giatrissaparaklesis1:hoCA.title2
ltx/en_us_public/other.giatrissaparaklesis1:hoCA.translation.name	@ltx/en_us_goadedes/other.giatrissaparaklesis1:hoCA.translation.name
ltx/en_us_public/other.giatrissaparaklesis1:hoCA.translation.year	@ltx/en_us_goadedes/other.giatrissaparaklesis1:hoCA.translation.year
ltx/en_us_public/other.giatrissaparaklesis1:hoCA.verse	@ltx/en_us_goadedes/other.giatrissaparaklesis1:hoCA.verse
