ltx/en_us_public/sy.m01.d02:syMA.commemoration01.couplet1.title	@ltx/en_us_dedes/sy.m01.d02:syMA.commemoration01.couplet1.title
ltx/en_us_public/sy.m01.d02:syMA.commemoration01.couplet1.verse1	@ltx/en_us_dedes/sy.m01.d02:syMA.commemoration01.couplet1.verse1
ltx/en_us_public/sy.m01.d02:syMA.commemoration01.couplet1.verse2	@ltx/en_us_dedes/sy.m01.d02:syMA.commemoration01.couplet1.verse2
ltx/en_us_public/sy.m01.d02:syMA.commemoration01.narration.p01	@ltx/en_us_dedes/sy.m01.d02:syMA.commemoration01.narration.p01
ltx/en_us_public/sy.m01.d02:syMA.commemoration01.single1	@ltx/en_us_dedes/sy.m01.d02:syMA.commemoration01.single1
ltx/en_us_public/sy.m01.d02:syMA.commemoration01.text	@ltx/en_us_dedes/sy.m01.d02:syMA.commemoration01.text
ltx/en_us_public/sy.m01.d02:syMA.commemoration02.couplet1.title	@ltx/en_us_dedes/sy.m01.d02:syMA.commemoration02.couplet1.title
ltx/en_us_public/sy.m01.d02:syMA.commemoration02.couplet1.verse1	@ltx/en_us_dedes/sy.m01.d02:syMA.commemoration02.couplet1.verse1
ltx/en_us_public/sy.m01.d02:syMA.commemoration02.couplet1.verse2	@ltx/en_us_dedes/sy.m01.d02:syMA.commemoration02.couplet1.verse2
ltx/en_us_public/sy.m01.d02:syMA.commemoration02.narration.p01	@ltx/en_us_dedes/sy.m01.d02:syMA.commemoration02.narration.p01
ltx/en_us_public/sy.m01.d02:syMA.commemoration02.text	@ltx/en_us_dedes/sy.m01.d02:syMA.commemoration02.text
ltx/en_us_public/sy.m01.d02:syMA.commemoration03.couplet1.title	@ltx/en_us_dedes/sy.m01.d02:syMA.commemoration03.couplet1.title
ltx/en_us_public/sy.m01.d02:syMA.commemoration03.couplet1.verse1	@ltx/en_us_dedes/sy.m01.d02:syMA.commemoration03.couplet1.verse1
ltx/en_us_public/sy.m01.d02:syMA.commemoration03.couplet1.verse2	@ltx/en_us_dedes/sy.m01.d02:syMA.commemoration03.couplet1.verse2
ltx/en_us_public/sy.m01.d02:syMA.commemoration03.couplet2.verse1	@ltx/en_us_dedes/sy.m01.d02:syMA.commemoration03.couplet2.verse1
ltx/en_us_public/sy.m01.d02:syMA.commemoration03.couplet2.verse2	@ltx/en_us_dedes/sy.m01.d02:syMA.commemoration03.couplet2.verse2
ltx/en_us_public/sy.m01.d02:syMA.commemoration03.text	@ltx/en_us_dedes/sy.m01.d02:syMA.commemoration03.text
ltx/en_us_public/sy.m01.d02:syMA.commemoration04.couplet1.title	@ltx/en_us_dedes/sy.m01.d02:syMA.commemoration04.couplet1.title
ltx/en_us_public/sy.m01.d02:syMA.commemoration04.couplet1.verse1	@ltx/en_us_dedes/sy.m01.d02:syMA.commemoration04.couplet1.verse1
ltx/en_us_public/sy.m01.d02:syMA.commemoration04.couplet1.verse2	@ltx/en_us_dedes/sy.m01.d02:syMA.commemoration04.couplet1.verse2
ltx/en_us_public/sy.m01.d02:syMA.commemoration04.text	@ltx/en_us_dedes/sy.m01.d02:syMA.commemoration04.text
ltx/en_us_public/sy.m01.d02:syMA.commemoration05.couplet1.title	@ltx/en_us_dedes/sy.m01.d02:syMA.commemoration05.couplet1.title
ltx/en_us_public/sy.m01.d02:syMA.commemoration05.couplet1.verse1	@ltx/en_us_dedes/sy.m01.d02:syMA.commemoration05.couplet1.verse1
ltx/en_us_public/sy.m01.d02:syMA.commemoration05.couplet1.verse2	@ltx/en_us_dedes/sy.m01.d02:syMA.commemoration05.couplet1.verse2
ltx/en_us_public/sy.m01.d02:syMA.commemoration05.narration.p01	@ltx/en_us_dedes/sy.m01.d02:syMA.commemoration05.narration.p01
ltx/en_us_public/sy.m01.d02:syMA.commemoration05.text	@ltx/en_us_dedes/sy.m01.d02:syMA.commemoration05.text
ltx/en_us_public/sy.m01.d02:syMA.commemoration06.couplet1.title	@ltx/en_us_dedes/sy.m01.d02:syMA.commemoration06.couplet1.title
ltx/en_us_public/sy.m01.d02:syMA.commemoration06.couplet1.verse1	@ltx/en_us_dedes/sy.m01.d02:syMA.commemoration06.couplet1.verse1
ltx/en_us_public/sy.m01.d02:syMA.commemoration06.couplet1.verse2	@ltx/en_us_dedes/sy.m01.d02:syMA.commemoration06.couplet1.verse2
ltx/en_us_public/sy.m01.d02:syMA.commemoration06.text	@ltx/en_us_dedes/sy.m01.d02:syMA.commemoration06.text
ltx/en_us_public/sy.m01.d02:syMA.commemoration07.couplet1.title	@ltx/en_us_dedes/sy.m01.d02:syMA.commemoration07.couplet1.title
ltx/en_us_public/sy.m01.d02:syMA.commemoration07.couplet1.verse1	@ltx/en_us_dedes/sy.m01.d02:syMA.commemoration07.couplet1.verse1
ltx/en_us_public/sy.m01.d02:syMA.commemoration07.couplet1.verse2	@ltx/en_us_dedes/sy.m01.d02:syMA.commemoration07.couplet1.verse2
ltx/en_us_public/sy.m01.d02:syMA.commemoration07.text	@ltx/en_us_dedes/sy.m01.d02:syMA.commemoration07.text
ltx/en_us_public/sy.m01.d02:syMA.commemoration08.couplet1.title	@ltx/en_us_dedes/sy.m01.d02:syMA.commemoration08.couplet1.title
ltx/en_us_public/sy.m01.d02:syMA.commemoration08.couplet1.verse1	@ltx/en_us_dedes/sy.m01.d02:syMA.commemoration08.couplet1.verse1
ltx/en_us_public/sy.m01.d02:syMA.commemoration08.couplet1.verse2	@ltx/en_us_dedes/sy.m01.d02:syMA.commemoration08.couplet1.verse2
ltx/en_us_public/sy.m01.d02:syMA.commemoration08.text	@ltx/en_us_dedes/sy.m01.d02:syMA.commemoration08.text
ltx/en_us_public/sy.m01.d02:syMA.commemoration09.couplet1.title	@ltx/en_us_dedes/sy.m01.d02:syMA.commemoration09.couplet1.title
ltx/en_us_public/sy.m01.d02:syMA.commemoration09.couplet1.verse1	@ltx/en_us_dedes/sy.m01.d02:syMA.commemoration09.couplet1.verse1
ltx/en_us_public/sy.m01.d02:syMA.commemoration09.couplet1.verse2	@ltx/en_us_dedes/sy.m01.d02:syMA.commemoration09.couplet1.verse2
ltx/en_us_public/sy.m01.d02:syMA.commemoration09.text	@ltx/en_us_dedes/sy.m01.d02:syMA.commemoration09.text
ltx/en_us_public/sy.m01.d02:syMA.lastline	@ltx/en_us_dedes/sy.m01.d02:syMA.lastline
