ltx/en_us_public/ho.ho06:hoH6.LentTroparion.incipit	@ltx/en_us_dedes/ho.ho06:hoH6.LentTroparion.incipit
ltx/en_us_public/ho.ho06:hoH6.LentTroparion.mode	@ltx/en_us_dedes/ho.ho06:hoH6.LentTroparion.mode
ltx/en_us_public/ho.ho06:hoH6.LentTroparion.text	@ltx/en_us_dedes/ho.ho06:hoH6.LentTroparion.text
ltx/en_us_public/ho.ho06:hoH6.Prayer.incipit	@ltx/en_us_dedes/ho.ho06:hoH6.Prayer.incipit
ltx/en_us_public/ho.ho06:hoH6.Prayer.text	@ltx/en_us_dedes/ho.ho06:hoH6.Prayer.text
ltx/en_us_public/ho.ho06:hoH6.Theotokion.incipit	@ltx/en_us_dedes/ho.ho06:hoH6.Theotokion.incipit
ltx/en_us_public/ho.ho06:hoH6.Theotokion.text	@ltx/en_us_dedes/ho.ho06:hoH6.Theotokion.text
ltx/en_us_public/ho.ho06:hoH6.Troparion1.incipit	@ltx/en_us_dedes/ho.ho06:hoH6.Troparion1.incipit
ltx/en_us_public/ho.ho06:hoH6.Troparion1.text	@ltx/en_us_dedes/ho.ho06:hoH6.Troparion1.text
ltx/en_us_public/ho.ho06:hoH6.Troparion2.incipit	@ltx/en_us_dedes/ho.ho06:hoH6.Troparion2.incipit
ltx/en_us_public/ho.ho06:hoH6.Troparion2.text	@ltx/en_us_dedes/ho.ho06:hoH6.Troparion2.text
ltx/en_us_public/ho.ho06:hoH6.Troparion3.incipit	@ltx/en_us_dedes/ho.ho06:hoH6.Troparion3.incipit
ltx/en_us_public/ho.ho06:hoH6.Troparion3.text	@ltx/en_us_dedes/ho.ho06:hoH6.Troparion3.text
ltx/en_us_public/ho.ho06:hoH6.Troparion4.incipit	@ltx/en_us_goadedes/ho.ho06:hoH6.Troparion4.incipit
ltx/en_us_public/ho.ho06:hoH6.Troparion4.text	@ltx/en_us_goadedes/ho.ho06:hoH6.Troparion4.text
ltx/en_us_public/ho.ho06:hoH6.title	@ltx/en_us_dedes/ho.ho06:hoH6.title
