ltx/en_us_public/pe.d076:peDA.commemoration.full	@ltx/en_us_dedes/pe.d076:peDA.commemoration.full
ltx/en_us_public/pe.d076:peDA.commemoration.name	@ltx/en_us_dedes/pe.d076:peDA.commemoration.name
ltx/en_us_public/pe.d076:peDA.commemoration.short	@ltx/en_us_dedes/pe.d076:peDA.commemoration.short
ltx/en_us_public/pe.d076:peDA.dismissal	@ltx/en_us_dedes/pe.d076:peDA.dismissal
ltx/en_us_public/pe.d076:peDA.insert1	@ltx/en_us_dedes/pe.d076:peDA.insert1
ltx/en_us_public/pe.d076:peDA.insert2	@ltx/en_us_dedes/pe.d076:peDA.insert2
ltx/en_us_public/pe.d076:peDA.note	@ltx/en_us_dedes/pe.d076:peDA.note
ltx/en_us_public/pe.d076:peHO.commemorations	@ltx/en_us_dedes/pe.d076:peHO.commemorations
ltx/en_us_public/pe.d076:peHO.daytitle	@ltx/en_us_dedes/pe.d076:peHO.daytitle
ltx/en_us_public/pe.d076:peHO.description1	@ltx/en_us_dedes/pe.d076:peHO.description1
ltx/en_us_public/pe.d076:peHO.description2	@ltx/en_us_dedes/pe.d076:peHO.description2
ltx/en_us_public/pe.d076:peHO.note1	@ltx/en_us_dedes/pe.d076:peHO.note1
ltx/en_us_public/pe.d076:peHO.note2	@ltx/en_us_dedes/pe.d076:peHO.note2
ltx/en_us_public/pe.d076:peLI.Megalynarion.text	@ltx/en_us_goadedes/pe.d076:peLI.Megalynarion.text
ltx/en_us_public/pe.d076:peMA.C1.title	@ltx/en_us_dedes/pe.d076:peMA.C1.title
ltx/en_us_public/pe.d076:peMA.C1.verse	@ltx/en_us_dedes/pe.d076:peMA.C1.verse
ltx/en_us_public/pe.d076:peMA.Exaposteilarion1.incipit	@ltx/en_us_dedes/pe.d076:peMA.Exaposteilarion1.incipit
ltx/en_us_public/pe.d076:peMA.Exaposteilarion1.melody	@ltx/en_us_dedes/pe.d076:peMA.Exaposteilarion1.melody
ltx/en_us_public/pe.d076:peMA.Exaposteilarion1.mode	@ltx/en_us_dedes/pe.d076:peMA.Exaposteilarion1.mode
ltx/en_us_public/pe.d076:peMA.Exaposteilarion1.text	@ltx/en_us_dedes/pe.d076:peMA.Exaposteilarion1.text
ltx/en_us_public/pe.d076:peMA.Exaposteilarion2.incipit	@ltx/en_us_dedes/pe.d076:peMA.Exaposteilarion2.incipit
ltx/en_us_public/pe.d076:peMA.Exaposteilarion2.melody	@ltx/en_us_dedes/pe.d076:peMA.Exaposteilarion2.melody
ltx/en_us_public/pe.d076:peMA.Exaposteilarion2.mode	@ltx/en_us_dedes/pe.d076:peMA.Exaposteilarion2.mode
ltx/en_us_public/pe.d076:peMA.Exaposteilarion2.text	@ltx/en_us_dedes/pe.d076:peMA.Exaposteilarion2.text
ltx/en_us_public/pe.d076:peMA.Kontakion1.incipit	@ltx/en_us_dedes/pe.d076:peMA.Kontakion1.incipit
ltx/en_us_public/pe.d076:peMA.Kontakion1.melody	@ltx/en_us_dedes/pe.d076:peMA.Kontakion1.melody
ltx/en_us_public/pe.d076:peMA.Kontakion1.mode	@ltx/en_us_dedes/pe.d076:peMA.Kontakion1.mode
ltx/en_us_public/pe.d076:peMA.Kontakion1.text	@ltx/en_us_dedes/pe.d076:peMA.Kontakion1.text
ltx/en_us_public/pe.d076:peMA.Lauds1.incipit	@ltx/en_us_goadedes/pe.d076:peMA.Lauds1.incipit
ltx/en_us_public/pe.d076:peMA.Lauds1.melody	@ltx/en_us_goadedes/pe.d076:peMA.Lauds1.melody
ltx/en_us_public/pe.d076:peMA.Lauds1.mode	@ltx/en_us_goadedes/pe.d076:peMA.Lauds1.mode
ltx/en_us_public/pe.d076:peMA.Lauds1.text	@ltx/en_us_goadedes/pe.d076:peMA.Lauds1.text
ltx/en_us_public/pe.d076:peMA.Lauds2.incipit	@ltx/en_us_goadedes/pe.d076:peMA.Lauds2.incipit
ltx/en_us_public/pe.d076:peMA.Lauds2.melody	@ltx/en_us_goadedes/pe.d076:peMA.Lauds2.melody
ltx/en_us_public/pe.d076:peMA.Lauds2.mode	@ltx/en_us_goadedes/pe.d076:peMA.Lauds2.mode
ltx/en_us_public/pe.d076:peMA.Lauds2.text	@ltx/en_us_goadedes/pe.d076:peMA.Lauds2.text
ltx/en_us_public/pe.d076:peMA.Lauds3.incipit	@ltx/en_us_goadedes/pe.d076:peMA.Lauds3.incipit
ltx/en_us_public/pe.d076:peMA.Lauds3.melody	@ltx/en_us_goadedes/pe.d076:peMA.Lauds3.melody
ltx/en_us_public/pe.d076:peMA.Lauds3.mode	@ltx/en_us_goadedes/pe.d076:peMA.Lauds3.mode
ltx/en_us_public/pe.d076:peMA.Lauds3.text	@ltx/en_us_goadedes/pe.d076:peMA.Lauds3.text
ltx/en_us_public/pe.d076:peMA.Lauds4.incipit	@ltx/en_us_goadedes/pe.d076:peMA.Lauds4.incipit
ltx/en_us_public/pe.d076:peMA.Lauds4.melody	@ltx/en_us_goadedes/pe.d076:peMA.Lauds4.melody
ltx/en_us_public/pe.d076:peMA.Lauds4.mode	@ltx/en_us_goadedes/pe.d076:peMA.Lauds4.mode
ltx/en_us_public/pe.d076:peMA.Lauds4.text	@ltx/en_us_goadedes/pe.d076:peMA.Lauds4.text
ltx/en_us_public/pe.d076:peMA.Lauds5.incipit	@ltx/en_us_dedes/pe.d076:peMA.Lauds5.incipit
ltx/en_us_public/pe.d076:peMA.Lauds5.melody	@ltx/en_us_dedes/pe.d076:peMA.Lauds5.melody
ltx/en_us_public/pe.d076:peMA.Lauds5.mode	@ltx/en_us_dedes/pe.d076:peMA.Lauds5.mode
ltx/en_us_public/pe.d076:peMA.Lauds5.text	@ltx/en_us_dedes/pe.d076:peMA.Lauds5.text
ltx/en_us_public/pe.d076:peMA.Lauds6.incipit	@ltx/en_us_dedes/pe.d076:peMA.Lauds6.incipit
ltx/en_us_public/pe.d076:peMA.Lauds6.melody	@ltx/en_us_dedes/pe.d076:peMA.Lauds6.melody
ltx/en_us_public/pe.d076:peMA.Lauds6.mode	@ltx/en_us_dedes/pe.d076:peMA.Lauds6.mode
ltx/en_us_public/pe.d076:peMA.Lauds6.text	@ltx/en_us_dedes/pe.d076:peMA.Lauds6.text
ltx/en_us_public/pe.d076:peMA.Lauds7.incipit	@ltx/en_us_dedes/pe.d076:peMA.Lauds7.incipit
ltx/en_us_public/pe.d076:peMA.Lauds7.melody	@ltx/en_us_dedes/pe.d076:peMA.Lauds7.melody
ltx/en_us_public/pe.d076:peMA.Lauds7.mode	@ltx/en_us_dedes/pe.d076:peMA.Lauds7.mode
ltx/en_us_public/pe.d076:peMA.Lauds7.text	@ltx/en_us_dedes/pe.d076:peMA.Lauds7.text
ltx/en_us_public/pe.d076:peMA.Lauds8.incipit	@ltx/en_us_dedes/pe.d076:peMA.Lauds8.incipit
ltx/en_us_public/pe.d076:peMA.Lauds8.melody	@ltx/en_us_dedes/pe.d076:peMA.Lauds8.melody
ltx/en_us_public/pe.d076:peMA.Lauds8.mode	@ltx/en_us_dedes/pe.d076:peMA.Lauds8.mode
ltx/en_us_public/pe.d076:peMA.Lauds8.text	@ltx/en_us_dedes/pe.d076:peMA.Lauds8.text
ltx/en_us_public/pe.d076:peMA.MM.Lauds1234as1234.text	@ltx/en_us_dedes/pe.d076:peMA.MM.Lauds1234as1234.text
ltx/en_us_public/pe.d076:peMA.MM.Lauds12as12.text	@ltx/en_us_dedes/pe.d076:peMA.MM.Lauds12as12.text
ltx/en_us_public/pe.d076:peMA.MM.Lauds5678as5678.text	@ltx/en_us_dedes/pe.d076:peMA.MM.Lauds5678as5678.text
ltx/en_us_public/pe.d076:peMA.Ode1C11.greekmelody	@ltx/en_us_dedes/pe.d076:peMA.Ode1C11.greekmelody
ltx/en_us_public/pe.d076:peMA.Ode1C11.incipit	@ltx/en_us_dedes/pe.d076:peMA.Ode1C11.incipit
ltx/en_us_public/pe.d076:peMA.Ode1C11.melody	@ltx/en_us_dedes/pe.d076:peMA.Ode1C11.melody
ltx/en_us_public/pe.d076:peMA.Ode1C11.mode	@ltx/en_us_dedes/pe.d076:peMA.Ode1C11.mode
ltx/en_us_public/pe.d076:peMA.Ode1C11.ode	@ltx/en_us_dedes/pe.d076:peMA.Ode1C11.ode
ltx/en_us_public/pe.d076:peMA.Ode1C11.text	@ltx/en_us_dedes/pe.d076:peMA.Ode1C11.text
ltx/en_us_public/pe.d076:peMA.Ode1C12.incipit	@ltx/en_us_dedes/pe.d076:peMA.Ode1C12.incipit
ltx/en_us_public/pe.d076:peMA.Ode1C12.melody	@ltx/en_us_dedes/pe.d076:peMA.Ode1C12.melody
ltx/en_us_public/pe.d076:peMA.Ode1C12.mode	@ltx/en_us_dedes/pe.d076:peMA.Ode1C12.mode
ltx/en_us_public/pe.d076:peMA.Ode1C12.ode	@ltx/en_us_dedes/pe.d076:peMA.Ode1C12.ode
ltx/en_us_public/pe.d076:peMA.Ode1C12.text	@ltx/en_us_dedes/pe.d076:peMA.Ode1C12.text
ltx/en_us_public/pe.d076:peMA.Ode1C13.incipit	@ltx/en_us_dedes/pe.d076:peMA.Ode1C13.incipit
ltx/en_us_public/pe.d076:peMA.Ode1C13.melody	@ltx/en_us_dedes/pe.d076:peMA.Ode1C13.melody
ltx/en_us_public/pe.d076:peMA.Ode1C13.mode	@ltx/en_us_dedes/pe.d076:peMA.Ode1C13.mode
ltx/en_us_public/pe.d076:peMA.Ode1C13.ode	@ltx/en_us_dedes/pe.d076:peMA.Ode1C13.ode
ltx/en_us_public/pe.d076:peMA.Ode1C13.text	@ltx/en_us_dedes/pe.d076:peMA.Ode1C13.text
ltx/en_us_public/pe.d076:peMA.Ode1C14.incipit	@ltx/en_us_dedes/pe.d076:peMA.Ode1C14.incipit
ltx/en_us_public/pe.d076:peMA.Ode1C14.melody	@ltx/en_us_dedes/pe.d076:peMA.Ode1C14.melody
ltx/en_us_public/pe.d076:peMA.Ode1C14.mode	@ltx/en_us_dedes/pe.d076:peMA.Ode1C14.mode
ltx/en_us_public/pe.d076:peMA.Ode1C14.ode	@ltx/en_us_dedes/pe.d076:peMA.Ode1C14.ode
ltx/en_us_public/pe.d076:peMA.Ode1C14.text	@ltx/en_us_dedes/pe.d076:peMA.Ode1C14.text
ltx/en_us_public/pe.d076:peMA.Ode3C11.greekmelody	@ltx/en_us_dedes/pe.d076:peMA.Ode3C11.greekmelody
ltx/en_us_public/pe.d076:peMA.Ode3C11.incipit	@ltx/en_us_dedes/pe.d076:peMA.Ode3C11.incipit
ltx/en_us_public/pe.d076:peMA.Ode3C11.melody	@ltx/en_us_dedes/pe.d076:peMA.Ode3C11.melody
ltx/en_us_public/pe.d076:peMA.Ode3C11.mode	@ltx/en_us_dedes/pe.d076:peMA.Ode3C11.mode
ltx/en_us_public/pe.d076:peMA.Ode3C11.ode	@ltx/en_us_dedes/pe.d076:peMA.Ode3C11.ode
ltx/en_us_public/pe.d076:peMA.Ode3C11.text	@ltx/en_us_dedes/pe.d076:peMA.Ode3C11.text
ltx/en_us_public/pe.d076:peMA.Ode3C12.incipit	@ltx/en_us_dedes/pe.d076:peMA.Ode3C12.incipit
ltx/en_us_public/pe.d076:peMA.Ode3C12.melody	@ltx/en_us_dedes/pe.d076:peMA.Ode3C12.melody
ltx/en_us_public/pe.d076:peMA.Ode3C12.mode	@ltx/en_us_dedes/pe.d076:peMA.Ode3C12.mode
ltx/en_us_public/pe.d076:peMA.Ode3C12.ode	@ltx/en_us_dedes/pe.d076:peMA.Ode3C12.ode
ltx/en_us_public/pe.d076:peMA.Ode3C12.text	@ltx/en_us_dedes/pe.d076:peMA.Ode3C12.text
ltx/en_us_public/pe.d076:peMA.Ode3C13.incipit	@ltx/en_us_dedes/pe.d076:peMA.Ode3C13.incipit
ltx/en_us_public/pe.d076:peMA.Ode3C13.melody	@ltx/en_us_dedes/pe.d076:peMA.Ode3C13.melody
ltx/en_us_public/pe.d076:peMA.Ode3C13.mode	@ltx/en_us_dedes/pe.d076:peMA.Ode3C13.mode
ltx/en_us_public/pe.d076:peMA.Ode3C13.ode	@ltx/en_us_dedes/pe.d076:peMA.Ode3C13.ode
ltx/en_us_public/pe.d076:peMA.Ode3C13.text	@ltx/en_us_dedes/pe.d076:peMA.Ode3C13.text
ltx/en_us_public/pe.d076:peMA.Ode3C14.incipit	@ltx/en_us_dedes/pe.d076:peMA.Ode3C14.incipit
ltx/en_us_public/pe.d076:peMA.Ode3C14.melody	@ltx/en_us_dedes/pe.d076:peMA.Ode3C14.melody
ltx/en_us_public/pe.d076:peMA.Ode3C14.mode	@ltx/en_us_dedes/pe.d076:peMA.Ode3C14.mode
ltx/en_us_public/pe.d076:peMA.Ode3C14.ode	@ltx/en_us_dedes/pe.d076:peMA.Ode3C14.ode
ltx/en_us_public/pe.d076:peMA.Ode3C14.text	@ltx/en_us_dedes/pe.d076:peMA.Ode3C14.text
ltx/en_us_public/pe.d076:peMA.Ode3Kathisma1.greekmelody	@ltx/en_us_dedes/pe.d076:peMA.Ode3Kathisma1.greekmelody
ltx/en_us_public/pe.d076:peMA.Ode3Kathisma1.incipit	@ltx/en_us_dedes/pe.d076:peMA.Ode3Kathisma1.incipit
ltx/en_us_public/pe.d076:peMA.Ode3Kathisma1.melody	@ltx/en_us_dedes/pe.d076:peMA.Ode3Kathisma1.melody
ltx/en_us_public/pe.d076:peMA.Ode3Kathisma1.mode	@ltx/en_us_dedes/pe.d076:peMA.Ode3Kathisma1.mode
ltx/en_us_public/pe.d076:peMA.Ode3Kathisma1.text	@ltx/en_us_dedes/pe.d076:peMA.Ode3Kathisma1.text
ltx/en_us_public/pe.d076:peMA.Ode4C11.greekmelody	@ltx/en_us_dedes/pe.d076:peMA.Ode4C11.greekmelody
ltx/en_us_public/pe.d076:peMA.Ode4C11.incipit	@ltx/en_us_dedes/pe.d076:peMA.Ode4C11.incipit
ltx/en_us_public/pe.d076:peMA.Ode4C11.melody	@ltx/en_us_dedes/pe.d076:peMA.Ode4C11.melody
ltx/en_us_public/pe.d076:peMA.Ode4C11.mode	@ltx/en_us_dedes/pe.d076:peMA.Ode4C11.mode
ltx/en_us_public/pe.d076:peMA.Ode4C11.ode	@ltx/en_us_dedes/pe.d076:peMA.Ode4C11.ode
ltx/en_us_public/pe.d076:peMA.Ode4C11.text	@ltx/en_us_dedes/pe.d076:peMA.Ode4C11.text
ltx/en_us_public/pe.d076:peMA.Ode4C12.incipit	@ltx/en_us_dedes/pe.d076:peMA.Ode4C12.incipit
ltx/en_us_public/pe.d076:peMA.Ode4C12.melody	@ltx/en_us_dedes/pe.d076:peMA.Ode4C12.melody
ltx/en_us_public/pe.d076:peMA.Ode4C12.mode	@ltx/en_us_dedes/pe.d076:peMA.Ode4C12.mode
ltx/en_us_public/pe.d076:peMA.Ode4C12.ode	@ltx/en_us_dedes/pe.d076:peMA.Ode4C12.ode
ltx/en_us_public/pe.d076:peMA.Ode4C12.text	@ltx/en_us_dedes/pe.d076:peMA.Ode4C12.text
ltx/en_us_public/pe.d076:peMA.Ode4C13.incipit	@ltx/en_us_dedes/pe.d076:peMA.Ode4C13.incipit
ltx/en_us_public/pe.d076:peMA.Ode4C13.melody	@ltx/en_us_dedes/pe.d076:peMA.Ode4C13.melody
ltx/en_us_public/pe.d076:peMA.Ode4C13.mode	@ltx/en_us_dedes/pe.d076:peMA.Ode4C13.mode
ltx/en_us_public/pe.d076:peMA.Ode4C13.ode	@ltx/en_us_dedes/pe.d076:peMA.Ode4C13.ode
ltx/en_us_public/pe.d076:peMA.Ode4C13.text	@ltx/en_us_dedes/pe.d076:peMA.Ode4C13.text
ltx/en_us_public/pe.d076:peMA.Ode4C14.incipit	@ltx/en_us_dedes/pe.d076:peMA.Ode4C14.incipit
ltx/en_us_public/pe.d076:peMA.Ode4C14.melody	@ltx/en_us_dedes/pe.d076:peMA.Ode4C14.melody
ltx/en_us_public/pe.d076:peMA.Ode4C14.mode	@ltx/en_us_dedes/pe.d076:peMA.Ode4C14.mode
ltx/en_us_public/pe.d076:peMA.Ode4C14.ode	@ltx/en_us_dedes/pe.d076:peMA.Ode4C14.ode
ltx/en_us_public/pe.d076:peMA.Ode4C14.text	@ltx/en_us_dedes/pe.d076:peMA.Ode4C14.text
ltx/en_us_public/pe.d076:peMA.Ode5C11.greekmelody	@ltx/en_us_dedes/pe.d076:peMA.Ode5C11.greekmelody
ltx/en_us_public/pe.d076:peMA.Ode5C11.incipit	@ltx/en_us_dedes/pe.d076:peMA.Ode5C11.incipit
ltx/en_us_public/pe.d076:peMA.Ode5C11.melody	@ltx/en_us_dedes/pe.d076:peMA.Ode5C11.melody
ltx/en_us_public/pe.d076:peMA.Ode5C11.mode	@ltx/en_us_dedes/pe.d076:peMA.Ode5C11.mode
ltx/en_us_public/pe.d076:peMA.Ode5C11.ode	@ltx/en_us_dedes/pe.d076:peMA.Ode5C11.ode
ltx/en_us_public/pe.d076:peMA.Ode5C11.text	@ltx/en_us_dedes/pe.d076:peMA.Ode5C11.text
ltx/en_us_public/pe.d076:peMA.Ode5C12.incipit	@ltx/en_us_dedes/pe.d076:peMA.Ode5C12.incipit
ltx/en_us_public/pe.d076:peMA.Ode5C12.melody	@ltx/en_us_dedes/pe.d076:peMA.Ode5C12.melody
ltx/en_us_public/pe.d076:peMA.Ode5C12.mode	@ltx/en_us_dedes/pe.d076:peMA.Ode5C12.mode
ltx/en_us_public/pe.d076:peMA.Ode5C12.ode	@ltx/en_us_dedes/pe.d076:peMA.Ode5C12.ode
ltx/en_us_public/pe.d076:peMA.Ode5C12.text	@ltx/en_us_dedes/pe.d076:peMA.Ode5C12.text
ltx/en_us_public/pe.d076:peMA.Ode5C13.incipit	@ltx/en_us_dedes/pe.d076:peMA.Ode5C13.incipit
ltx/en_us_public/pe.d076:peMA.Ode5C13.melody	@ltx/en_us_dedes/pe.d076:peMA.Ode5C13.melody
ltx/en_us_public/pe.d076:peMA.Ode5C13.mode	@ltx/en_us_dedes/pe.d076:peMA.Ode5C13.mode
ltx/en_us_public/pe.d076:peMA.Ode5C13.ode	@ltx/en_us_dedes/pe.d076:peMA.Ode5C13.ode
ltx/en_us_public/pe.d076:peMA.Ode5C13.text	@ltx/en_us_dedes/pe.d076:peMA.Ode5C13.text
ltx/en_us_public/pe.d076:peMA.Ode5C14.incipit	@ltx/en_us_dedes/pe.d076:peMA.Ode5C14.incipit
ltx/en_us_public/pe.d076:peMA.Ode5C14.melody	@ltx/en_us_dedes/pe.d076:peMA.Ode5C14.melody
ltx/en_us_public/pe.d076:peMA.Ode5C14.mode	@ltx/en_us_dedes/pe.d076:peMA.Ode5C14.mode
ltx/en_us_public/pe.d076:peMA.Ode5C14.ode	@ltx/en_us_dedes/pe.d076:peMA.Ode5C14.ode
ltx/en_us_public/pe.d076:peMA.Ode5C14.text	@ltx/en_us_dedes/pe.d076:peMA.Ode5C14.text
ltx/en_us_public/pe.d076:peMA.Ode6C11.greekmelody	@ltx/en_us_dedes/pe.d076:peMA.Ode6C11.greekmelody
ltx/en_us_public/pe.d076:peMA.Ode6C11.incipit	@ltx/en_us_dedes/pe.d076:peMA.Ode6C11.incipit
ltx/en_us_public/pe.d076:peMA.Ode6C11.melody	@ltx/en_us_dedes/pe.d076:peMA.Ode6C11.melody
ltx/en_us_public/pe.d076:peMA.Ode6C11.mode	@ltx/en_us_dedes/pe.d076:peMA.Ode6C11.mode
ltx/en_us_public/pe.d076:peMA.Ode6C11.ode	@ltx/en_us_dedes/pe.d076:peMA.Ode6C11.ode
ltx/en_us_public/pe.d076:peMA.Ode6C11.text	@ltx/en_us_dedes/pe.d076:peMA.Ode6C11.text
ltx/en_us_public/pe.d076:peMA.Ode6C12.incipit	@ltx/en_us_dedes/pe.d076:peMA.Ode6C12.incipit
ltx/en_us_public/pe.d076:peMA.Ode6C12.melody	@ltx/en_us_dedes/pe.d076:peMA.Ode6C12.melody
ltx/en_us_public/pe.d076:peMA.Ode6C12.mode	@ltx/en_us_dedes/pe.d076:peMA.Ode6C12.mode
ltx/en_us_public/pe.d076:peMA.Ode6C12.ode	@ltx/en_us_dedes/pe.d076:peMA.Ode6C12.ode
ltx/en_us_public/pe.d076:peMA.Ode6C12.text	@ltx/en_us_dedes/pe.d076:peMA.Ode6C12.text
ltx/en_us_public/pe.d076:peMA.Ode6C13.incipit	@ltx/en_us_dedes/pe.d076:peMA.Ode6C13.incipit
ltx/en_us_public/pe.d076:peMA.Ode6C13.melody	@ltx/en_us_dedes/pe.d076:peMA.Ode6C13.melody
ltx/en_us_public/pe.d076:peMA.Ode6C13.mode	@ltx/en_us_dedes/pe.d076:peMA.Ode6C13.mode
ltx/en_us_public/pe.d076:peMA.Ode6C13.ode	@ltx/en_us_dedes/pe.d076:peMA.Ode6C13.ode
ltx/en_us_public/pe.d076:peMA.Ode6C13.text	@ltx/en_us_dedes/pe.d076:peMA.Ode6C13.text
ltx/en_us_public/pe.d076:peMA.Ode6C14.incipit	@ltx/en_us_dedes/pe.d076:peMA.Ode6C14.incipit
ltx/en_us_public/pe.d076:peMA.Ode6C14.melody	@ltx/en_us_dedes/pe.d076:peMA.Ode6C14.melody
ltx/en_us_public/pe.d076:peMA.Ode6C14.mode	@ltx/en_us_dedes/pe.d076:peMA.Ode6C14.mode
ltx/en_us_public/pe.d076:peMA.Ode6C14.ode	@ltx/en_us_dedes/pe.d076:peMA.Ode6C14.ode
ltx/en_us_public/pe.d076:peMA.Ode6C14.text	@ltx/en_us_dedes/pe.d076:peMA.Ode6C14.text
ltx/en_us_public/pe.d076:peMA.Ode7C11.greekmelody	@ltx/en_us_dedes/pe.d076:peMA.Ode7C11.greekmelody
ltx/en_us_public/pe.d076:peMA.Ode7C11.incipit	@ltx/en_us_dedes/pe.d076:peMA.Ode7C11.incipit
ltx/en_us_public/pe.d076:peMA.Ode7C11.melody	@ltx/en_us_dedes/pe.d076:peMA.Ode7C11.melody
ltx/en_us_public/pe.d076:peMA.Ode7C11.mode	@ltx/en_us_dedes/pe.d076:peMA.Ode7C11.mode
ltx/en_us_public/pe.d076:peMA.Ode7C11.ode	@ltx/en_us_dedes/pe.d076:peMA.Ode7C11.ode
ltx/en_us_public/pe.d076:peMA.Ode7C11.text	@ltx/en_us_dedes/pe.d076:peMA.Ode7C11.text
ltx/en_us_public/pe.d076:peMA.Ode7C12.incipit	@ltx/en_us_dedes/pe.d076:peMA.Ode7C12.incipit
ltx/en_us_public/pe.d076:peMA.Ode7C12.melody	@ltx/en_us_dedes/pe.d076:peMA.Ode7C12.melody
ltx/en_us_public/pe.d076:peMA.Ode7C12.mode	@ltx/en_us_dedes/pe.d076:peMA.Ode7C12.mode
ltx/en_us_public/pe.d076:peMA.Ode7C12.ode	@ltx/en_us_dedes/pe.d076:peMA.Ode7C12.ode
ltx/en_us_public/pe.d076:peMA.Ode7C12.text	@ltx/en_us_dedes/pe.d076:peMA.Ode7C12.text
ltx/en_us_public/pe.d076:peMA.Ode7C13.incipit	@ltx/en_us_dedes/pe.d076:peMA.Ode7C13.incipit
ltx/en_us_public/pe.d076:peMA.Ode7C13.melody	@ltx/en_us_dedes/pe.d076:peMA.Ode7C13.melody
ltx/en_us_public/pe.d076:peMA.Ode7C13.mode	@ltx/en_us_dedes/pe.d076:peMA.Ode7C13.mode
ltx/en_us_public/pe.d076:peMA.Ode7C13.ode	@ltx/en_us_dedes/pe.d076:peMA.Ode7C13.ode
ltx/en_us_public/pe.d076:peMA.Ode7C13.text	@ltx/en_us_dedes/pe.d076:peMA.Ode7C13.text
ltx/en_us_public/pe.d076:peMA.Ode7C14.incipit	@ltx/en_us_dedes/pe.d076:peMA.Ode7C14.incipit
ltx/en_us_public/pe.d076:peMA.Ode7C14.melody	@ltx/en_us_dedes/pe.d076:peMA.Ode7C14.melody
ltx/en_us_public/pe.d076:peMA.Ode7C14.mode	@ltx/en_us_dedes/pe.d076:peMA.Ode7C14.mode
ltx/en_us_public/pe.d076:peMA.Ode7C14.ode	@ltx/en_us_dedes/pe.d076:peMA.Ode7C14.ode
ltx/en_us_public/pe.d076:peMA.Ode7C14.text	@ltx/en_us_dedes/pe.d076:peMA.Ode7C14.text
ltx/en_us_public/pe.d076:peMA.Ode8C11.greekmelody	@ltx/en_us_dedes/pe.d076:peMA.Ode8C11.greekmelody
ltx/en_us_public/pe.d076:peMA.Ode8C11.incipit	@ltx/en_us_dedes/pe.d076:peMA.Ode8C11.incipit
ltx/en_us_public/pe.d076:peMA.Ode8C11.melody	@ltx/en_us_dedes/pe.d076:peMA.Ode8C11.melody
ltx/en_us_public/pe.d076:peMA.Ode8C11.mode	@ltx/en_us_dedes/pe.d076:peMA.Ode8C11.mode
ltx/en_us_public/pe.d076:peMA.Ode8C11.ode	@ltx/en_us_dedes/pe.d076:peMA.Ode8C11.ode
ltx/en_us_public/pe.d076:peMA.Ode8C11.text	@ltx/en_us_dedes/pe.d076:peMA.Ode8C11.text
ltx/en_us_public/pe.d076:peMA.Ode8C12.incipit	@ltx/en_us_dedes/pe.d076:peMA.Ode8C12.incipit
ltx/en_us_public/pe.d076:peMA.Ode8C12.melody	@ltx/en_us_dedes/pe.d076:peMA.Ode8C12.melody
ltx/en_us_public/pe.d076:peMA.Ode8C12.mode	@ltx/en_us_dedes/pe.d076:peMA.Ode8C12.mode
ltx/en_us_public/pe.d076:peMA.Ode8C12.ode	@ltx/en_us_dedes/pe.d076:peMA.Ode8C12.ode
ltx/en_us_public/pe.d076:peMA.Ode8C12.text	@ltx/en_us_dedes/pe.d076:peMA.Ode8C12.text
ltx/en_us_public/pe.d076:peMA.Ode8C13.incipit	@ltx/en_us_dedes/pe.d076:peMA.Ode8C13.incipit
ltx/en_us_public/pe.d076:peMA.Ode8C13.melody	@ltx/en_us_dedes/pe.d076:peMA.Ode8C13.melody
ltx/en_us_public/pe.d076:peMA.Ode8C13.mode	@ltx/en_us_dedes/pe.d076:peMA.Ode8C13.mode
ltx/en_us_public/pe.d076:peMA.Ode8C13.ode	@ltx/en_us_dedes/pe.d076:peMA.Ode8C13.ode
ltx/en_us_public/pe.d076:peMA.Ode8C13.text	@ltx/en_us_dedes/pe.d076:peMA.Ode8C13.text
ltx/en_us_public/pe.d076:peMA.Ode8C14.incipit	@ltx/en_us_dedes/pe.d076:peMA.Ode8C14.incipit
ltx/en_us_public/pe.d076:peMA.Ode8C14.melody	@ltx/en_us_dedes/pe.d076:peMA.Ode8C14.melody
ltx/en_us_public/pe.d076:peMA.Ode8C14.mode	@ltx/en_us_dedes/pe.d076:peMA.Ode8C14.mode
ltx/en_us_public/pe.d076:peMA.Ode8C14.ode	@ltx/en_us_dedes/pe.d076:peMA.Ode8C14.ode
ltx/en_us_public/pe.d076:peMA.Ode8C14.text	@ltx/en_us_dedes/pe.d076:peMA.Ode8C14.text
ltx/en_us_public/pe.d076:peMA.Ode9C11.greekmelody	@ltx/en_us_dedes/pe.d076:peMA.Ode9C11.greekmelody
ltx/en_us_public/pe.d076:peMA.Ode9C11.incipit	@ltx/en_us_dedes/pe.d076:peMA.Ode9C11.incipit
ltx/en_us_public/pe.d076:peMA.Ode9C11.melody	@ltx/en_us_dedes/pe.d076:peMA.Ode9C11.melody
ltx/en_us_public/pe.d076:peMA.Ode9C11.mode	@ltx/en_us_dedes/pe.d076:peMA.Ode9C11.mode
ltx/en_us_public/pe.d076:peMA.Ode9C11.ode	@ltx/en_us_dedes/pe.d076:peMA.Ode9C11.ode
ltx/en_us_public/pe.d076:peMA.Ode9C11.text	@ltx/en_us_dedes/pe.d076:peMA.Ode9C11.text
ltx/en_us_public/pe.d076:peMA.Ode9C12.incipit	@ltx/en_us_dedes/pe.d076:peMA.Ode9C12.incipit
ltx/en_us_public/pe.d076:peMA.Ode9C12.melody	@ltx/en_us_dedes/pe.d076:peMA.Ode9C12.melody
ltx/en_us_public/pe.d076:peMA.Ode9C12.mode	@ltx/en_us_dedes/pe.d076:peMA.Ode9C12.mode
ltx/en_us_public/pe.d076:peMA.Ode9C12.ode	@ltx/en_us_dedes/pe.d076:peMA.Ode9C12.ode
ltx/en_us_public/pe.d076:peMA.Ode9C12.text	@ltx/en_us_dedes/pe.d076:peMA.Ode9C12.text
ltx/en_us_public/pe.d076:peMA.Ode9C13.incipit	@ltx/en_us_dedes/pe.d076:peMA.Ode9C13.incipit
ltx/en_us_public/pe.d076:peMA.Ode9C13.melody	@ltx/en_us_dedes/pe.d076:peMA.Ode9C13.melody
ltx/en_us_public/pe.d076:peMA.Ode9C13.mode	@ltx/en_us_dedes/pe.d076:peMA.Ode9C13.mode
ltx/en_us_public/pe.d076:peMA.Ode9C13.ode	@ltx/en_us_dedes/pe.d076:peMA.Ode9C13.ode
ltx/en_us_public/pe.d076:peMA.Ode9C13.text	@ltx/en_us_dedes/pe.d076:peMA.Ode9C13.text
ltx/en_us_public/pe.d076:peMA.Ode9C14.incipit	@ltx/en_us_dedes/pe.d076:peMA.Ode9C14.incipit
ltx/en_us_public/pe.d076:peMA.Ode9C14.melody	@ltx/en_us_dedes/pe.d076:peMA.Ode9C14.melody
ltx/en_us_public/pe.d076:peMA.Ode9C14.mode	@ltx/en_us_dedes/pe.d076:peMA.Ode9C14.mode
ltx/en_us_public/pe.d076:peMA.Ode9C14.ode	@ltx/en_us_dedes/pe.d076:peMA.Ode9C14.ode
ltx/en_us_public/pe.d076:peMA.Ode9C14.text	@ltx/en_us_dedes/pe.d076:peMA.Ode9C14.text
ltx/en_us_public/pe.d076:peMA.Ode9C15.incipit	@ltx/en_us_dedes/pe.d076:peMA.Ode9C15.incipit
ltx/en_us_public/pe.d076:peMA.Ode9C15.melody	@ltx/en_us_dedes/pe.d076:peMA.Ode9C15.melody
ltx/en_us_public/pe.d076:peMA.Ode9C15.mode	@ltx/en_us_dedes/pe.d076:peMA.Ode9C15.mode
ltx/en_us_public/pe.d076:peMA.Ode9C15.ode	@ltx/en_us_dedes/pe.d076:peMA.Ode9C15.ode
ltx/en_us_public/pe.d076:peMA.Ode9C15.text	@ltx/en_us_dedes/pe.d076:peMA.Ode9C15.text
ltx/en_us_public/pe.d076:peMA.Oikos1.text	@ltx/en_us_dedes/pe.d076:peMA.Oikos1.text
ltx/en_us_public/pe.d076:peMA.Oikos12.text	@ltx/en_us_dedes/pe.d076:peMA.Oikos12.text
ltx/en_us_public/pe.d076:peMA.Oikos13.text	@ltx/en_us_dedes/pe.d076:peMA.Oikos13.text
ltx/en_us_public/pe.d076:peMA.Oikos14.text	@ltx/en_us_dedes/pe.d076:peMA.Oikos14.text
ltx/en_us_public/pe.d076:peMA.Oikos15.text	@ltx/en_us_dedes/pe.d076:peMA.Oikos15.text
ltx/en_us_public/pe.d076:peMA.Oikos16.text	@ltx/en_us_dedes/pe.d076:peMA.Oikos16.text
ltx/en_us_public/pe.d076:peMA.Oikos17.text	@ltx/en_us_dedes/pe.d076:peMA.Oikos17.text
ltx/en_us_public/pe.d076:peMA.Oikos18.text	@ltx/en_us_dedes/pe.d076:peMA.Oikos18.text
ltx/en_us_public/pe.d076:peSY.commemoration.couplet1.title	@ltx/en_us_dedes/pe.d076:peSY.commemoration.couplet1.title
ltx/en_us_public/pe.d076:peSY.commemoration.couplet1.verse1	@ltx/en_us_dedes/pe.d076:peSY.commemoration.couplet1.verse1
ltx/en_us_public/pe.d076:peSY.commemoration.couplet1.verse2	@ltx/en_us_dedes/pe.d076:peSY.commemoration.couplet1.verse2
ltx/en_us_public/pe.d076:peSY.commemoration.narration.p01	@ltx/en_us_dedes/pe.d076:peSY.commemoration.narration.p01
ltx/en_us_public/pe.d076:peSY.commemoration.narration.p02	@ltx/en_us_dedes/pe.d076:peSY.commemoration.narration.p02
ltx/en_us_public/pe.d076:peSY.commemoration.narration.p03	@ltx/en_us_dedes/pe.d076:peSY.commemoration.narration.p03
ltx/en_us_public/pe.d076:peSY.commemoration.narration.p04	@ltx/en_us_dedes/pe.d076:peSY.commemoration.narration.p04
ltx/en_us_public/pe.d076:peSY.commemoration.narration.p05	@ltx/en_us_dedes/pe.d076:peSY.commemoration.narration.p05
ltx/en_us_public/pe.d076:peSY.commemoration.narration.p06	@ltx/en_us_dedes/pe.d076:peSY.commemoration.narration.p06
ltx/en_us_public/pe.d076:peSY.commemoration.narration.p07	@ltx/en_us_dedes/pe.d076:peSY.commemoration.narration.p07
ltx/en_us_public/pe.d076:peSY.commemoration.text	@ltx/en_us_dedes/pe.d076:peSY.commemoration.text
ltx/en_us_public/pe.d076:peSY.lastline	@ltx/en_us_dedes/pe.d076:peSY.lastline
ltx/en_us_public/pe.d076:peVE.Apolytikion1.incipit	@ltx/en_us_dedes/pe.d076:peVE.Apolytikion1.incipit
ltx/en_us_public/pe.d076:peVE.Apolytikion1.melody	@ltx/en_us_dedes/pe.d076:peVE.Apolytikion1.melody
ltx/en_us_public/pe.d076:peVE.Apolytikion1.mode	@ltx/en_us_dedes/pe.d076:peVE.Apolytikion1.mode
ltx/en_us_public/pe.d076:peVE.Apolytikion1.text	@ltx/en_us_dedes/pe.d076:peVE.Apolytikion1.text
ltx/en_us_public/pe.d076:peVE.AposGlory.incipit	@ltx/en_us_oca/pe.d076:peVE.AposGlory.incipit
ltx/en_us_public/pe.d076:peVE.AposGlory.melody	@ltx/en_us_oca/pe.d076:peVE.AposGlory.melody
ltx/en_us_public/pe.d076:peVE.AposGlory.mode	@ltx/en_us_dedes/pe.d076:peVE.AposGlory.mode
ltx/en_us_public/pe.d076:peVE.AposGlory.text	@ltx/en_us_oca/pe.d076:peVE.AposGlory.text
ltx/en_us_public/pe.d076:peVE.Aposticha1.incipit	@ltx/en_us_goadedes/pe.d076:peVE.Aposticha1.incipit
ltx/en_us_public/pe.d076:peVE.Aposticha1.melody	@ltx/en_us_goadedes/pe.d076:peVE.Aposticha1.melody
ltx/en_us_public/pe.d076:peVE.Aposticha1.mode	@ltx/en_us_goadedes/pe.d076:peVE.Aposticha1.mode
ltx/en_us_public/pe.d076:peVE.Aposticha1.text	@ltx/en_us_goadedes/pe.d076:peVE.Aposticha1.text
ltx/en_us_public/pe.d076:peVE.Aposticha2.incipit	@ltx/en_us_oca/pe.d076:peVE.Aposticha2.incipit
ltx/en_us_public/pe.d076:peVE.Aposticha2.melody	@ltx/en_us_oca/pe.d076:peVE.Aposticha2.melody
ltx/en_us_public/pe.d076:peVE.Aposticha2.mode	@ltx/en_us_dedes/pe.d076:peVE.Aposticha2.mode
ltx/en_us_public/pe.d076:peVE.Aposticha2.text	@ltx/en_us_oca/pe.d076:peVE.Aposticha2.text
ltx/en_us_public/pe.d076:peVE.Aposticha3.incipit	@ltx/en_us_oca/pe.d076:peVE.Aposticha3.incipit
ltx/en_us_public/pe.d076:peVE.Aposticha3.melody	@ltx/en_us_oca/pe.d076:peVE.Aposticha3.melody
ltx/en_us_public/pe.d076:peVE.Aposticha3.mode	@ltx/en_us_dedes/pe.d076:peVE.Aposticha3.mode
ltx/en_us_public/pe.d076:peVE.Aposticha3.text	@ltx/en_us_oca/pe.d076:peVE.Aposticha3.text
ltx/en_us_public/pe.d076:peVE.Aposticha4.incipit	@ltx/en_us_oca/pe.d076:peVE.Aposticha4.incipit
ltx/en_us_public/pe.d076:peVE.Aposticha4.melody	@ltx/en_us_oca/pe.d076:peVE.Aposticha4.melody
ltx/en_us_public/pe.d076:peVE.Aposticha4.mode	@ltx/en_us_dedes/pe.d076:peVE.Aposticha4.mode
ltx/en_us_public/pe.d076:peVE.Aposticha4.text	@ltx/en_us_oca/pe.d076:peVE.Aposticha4.text
ltx/en_us_public/pe.d076:peVE.MM.Stichera1234as3456.text	@ltx/en_us_goadedes/pe.d076:peVE.MM.Stichera1234as3456.text
ltx/en_us_public/pe.d076:peVE.MM.Stichera123as123.text	@ltx/en_us_goadedes/pe.d076:peVE.MM.Stichera123as123.text
ltx/en_us_public/pe.d076:peVE.MM.Stichera789as456.text	@ltx/en_us_dedes/pe.d076:peVE.MM.Stichera789as456.text
ltx/en_us_public/pe.d076:peVE.SticBoth.incipit	@ltx/en_us_goadedes/pe.d076:peVE.SticBoth.incipit
ltx/en_us_public/pe.d076:peVE.SticBoth.melody	@ltx/en_us_goadedes/pe.d076:peVE.SticBoth.melody
ltx/en_us_public/pe.d076:peVE.SticBoth.mode	@ltx/en_us_goadedes/pe.d076:peVE.SticBoth.mode
ltx/en_us_public/pe.d076:peVE.SticBoth.text	@ltx/en_us_goadedes/pe.d076:peVE.SticBoth.text
ltx/en_us_public/pe.d076:peVE.SticGlory.incipit	@ltx/en_us_oca/pe.d076:peVE.SticGlory.incipit
ltx/en_us_public/pe.d076:peVE.SticGlory.melody	@ltx/en_us_dedes/pe.d076:peVE.SticGlory.melody
ltx/en_us_public/pe.d076:peVE.SticGlory.mode	@ltx/en_us_dedes/pe.d076:peVE.SticGlory.mode
ltx/en_us_public/pe.d076:peVE.SticGlory.text	@ltx/en_us_oca/pe.d076:peVE.SticGlory.text
ltx/en_us_public/pe.d076:peVE.Stichera01.incipit	@ltx/en_us_goadedes/pe.d076:peVE.Stichera01.incipit
ltx/en_us_public/pe.d076:peVE.Stichera01.melody	@ltx/en_us_goadedes/pe.d076:peVE.Stichera01.melody
ltx/en_us_public/pe.d076:peVE.Stichera01.mode	@ltx/en_us_goadedes/pe.d076:peVE.Stichera01.mode
ltx/en_us_public/pe.d076:peVE.Stichera01.text	@ltx/en_us_goadedes/pe.d076:peVE.Stichera01.text
ltx/en_us_public/pe.d076:peVE.Stichera02.incipit	@ltx/en_us_goadedes/pe.d076:peVE.Stichera02.incipit
ltx/en_us_public/pe.d076:peVE.Stichera02.melody	@ltx/en_us_goadedes/pe.d076:peVE.Stichera02.melody
ltx/en_us_public/pe.d076:peVE.Stichera02.mode	@ltx/en_us_goadedes/pe.d076:peVE.Stichera02.mode
ltx/en_us_public/pe.d076:peVE.Stichera02.text	@ltx/en_us_goadedes/pe.d076:peVE.Stichera02.text
ltx/en_us_public/pe.d076:peVE.Stichera03.incipit	@ltx/en_us_goadedes/pe.d076:peVE.Stichera03.incipit
ltx/en_us_public/pe.d076:peVE.Stichera03.melody	@ltx/en_us_goadedes/pe.d076:peVE.Stichera03.melody
ltx/en_us_public/pe.d076:peVE.Stichera03.mode	@ltx/en_us_goadedes/pe.d076:peVE.Stichera03.mode
ltx/en_us_public/pe.d076:peVE.Stichera03.text	@ltx/en_us_goadedes/pe.d076:peVE.Stichera03.text
ltx/en_us_public/pe.d076:peVE.Stichera04.incipit	@ltx/en_us_goadedes/pe.d076:peVE.Stichera04.incipit
ltx/en_us_public/pe.d076:peVE.Stichera04.melody	@ltx/en_us_goadedes/pe.d076:peVE.Stichera04.melody
ltx/en_us_public/pe.d076:peVE.Stichera04.mode	@ltx/en_us_goadedes/pe.d076:peVE.Stichera04.mode
ltx/en_us_public/pe.d076:peVE.Stichera04.text	@ltx/en_us_goadedes/pe.d076:peVE.Stichera04.text
ltx/en_us_public/pe.d076:peVE.Stichera05.incipit	@ltx/en_us_goadedes/pe.d076:peVE.Stichera05.incipit
ltx/en_us_public/pe.d076:peVE.Stichera05.melody	@ltx/en_us_goadedes/pe.d076:peVE.Stichera05.melody
ltx/en_us_public/pe.d076:peVE.Stichera05.mode	@ltx/en_us_goadedes/pe.d076:peVE.Stichera05.mode
ltx/en_us_public/pe.d076:peVE.Stichera05.text	@ltx/en_us_goadedes/pe.d076:peVE.Stichera05.text
ltx/en_us_public/pe.d076:peVE.Stichera06.incipit	@ltx/en_us_goadedes/pe.d076:peVE.Stichera06.incipit
ltx/en_us_public/pe.d076:peVE.Stichera06.melody	@ltx/en_us_goadedes/pe.d076:peVE.Stichera06.melody
ltx/en_us_public/pe.d076:peVE.Stichera06.mode	@ltx/en_us_goadedes/pe.d076:peVE.Stichera06.mode
ltx/en_us_public/pe.d076:peVE.Stichera06.text	@ltx/en_us_goadedes/pe.d076:peVE.Stichera06.text
ltx/en_us_public/pe.d076:peVE.Stichera07.incipit	@ltx/en_us_oca/pe.d076:peVE.Stichera07.incipit
ltx/en_us_public/pe.d076:peVE.Stichera07.melody	@ltx/en_us_oca/pe.d076:peVE.Stichera07.melody
ltx/en_us_public/pe.d076:peVE.Stichera07.mode	@ltx/en_us_dedes/pe.d076:peVE.Stichera07.mode
ltx/en_us_public/pe.d076:peVE.Stichera07.text	@ltx/en_us_oca/pe.d076:peVE.Stichera07.text
ltx/en_us_public/pe.d076:peVE.Stichera08.incipit	@ltx/en_us_oca/pe.d076:peVE.Stichera08.incipit
ltx/en_us_public/pe.d076:peVE.Stichera08.melody	@ltx/en_us_oca/pe.d076:peVE.Stichera08.melody
ltx/en_us_public/pe.d076:peVE.Stichera08.mode	@ltx/en_us_dedes/pe.d076:peVE.Stichera08.mode
ltx/en_us_public/pe.d076:peVE.Stichera08.text	@ltx/en_us_oca/pe.d076:peVE.Stichera08.text
ltx/en_us_public/pe.d076:peVE.Stichera09.incipit	@ltx/en_us_oca/pe.d076:peVE.Stichera09.incipit
ltx/en_us_public/pe.d076:peVE.Stichera09.melody	@ltx/en_us_oca/pe.d076:peVE.Stichera09.melody
ltx/en_us_public/pe.d076:peVE.Stichera09.mode	@ltx/en_us_dedes/pe.d076:peVE.Stichera09.mode
ltx/en_us_public/pe.d076:peVE.Stichera09.text	@ltx/en_us_oca/pe.d076:peVE.Stichera09.text
