ltx/en_us_public/tr.d068:trCO.C1.poet	@ltx/en_us_dedes/tr.d068:trCO.C1.poet
ltx/en_us_public/tr.d068:trCO.Kathisma11.incipit	@ltx/en_uk_ware/tr.d068:trCO.Kathisma11.incipit
ltx/en_us_public/tr.d068:trCO.Kathisma11.melody	@ltx/en_uk_ware/tr.d068:trCO.Kathisma11.melody
ltx/en_us_public/tr.d068:trCO.Kathisma11.mode	@ltx/en_us_dedes/tr.d068:trCO.Kathisma11.mode
ltx/en_us_public/tr.d068:trCO.Kathisma11.text	@ltx/en_uk_ware/tr.d068:trCO.Kathisma11.text
ltx/en_us_public/tr.d068:trCO.Ode4C11.incipit	@ltx/en_uk_ware/tr.d068:trCO.Ode4C11.incipit
ltx/en_us_public/tr.d068:trCO.Ode4C11.melody	@ltx/en_uk_ware/tr.d068:trCO.Ode4C11.melody
ltx/en_us_public/tr.d068:trCO.Ode4C11.mode	@ltx/en_us_dedes/tr.d068:trCO.Ode4C11.mode
ltx/en_us_public/tr.d068:trCO.Ode4C11.ode	@ltx/en_us_dedes/tr.d068:trCO.Ode4C11.ode
ltx/en_us_public/tr.d068:trCO.Ode4C11.text	@ltx/en_uk_ware/tr.d068:trCO.Ode4C11.text
ltx/en_us_public/tr.d068:trCO.Ode4C12.incipit	@ltx/en_uk_ware/tr.d068:trCO.Ode4C12.incipit
ltx/en_us_public/tr.d068:trCO.Ode4C12.melody	@ltx/en_uk_ware/tr.d068:trCO.Ode4C12.melody
ltx/en_us_public/tr.d068:trCO.Ode4C12.mode	@ltx/en_us_dedes/tr.d068:trCO.Ode4C12.mode
ltx/en_us_public/tr.d068:trCO.Ode4C12.ode	@ltx/en_us_dedes/tr.d068:trCO.Ode4C12.ode
ltx/en_us_public/tr.d068:trCO.Ode4C12.text	@ltx/en_uk_ware/tr.d068:trCO.Ode4C12.text
ltx/en_us_public/tr.d068:trCO.Ode4C13.incipit	@ltx/en_uk_ware/tr.d068:trCO.Ode4C13.incipit
ltx/en_us_public/tr.d068:trCO.Ode4C13.melody	@ltx/en_uk_ware/tr.d068:trCO.Ode4C13.melody
ltx/en_us_public/tr.d068:trCO.Ode4C13.mode	@ltx/en_us_dedes/tr.d068:trCO.Ode4C13.mode
ltx/en_us_public/tr.d068:trCO.Ode4C13.ode	@ltx/en_us_dedes/tr.d068:trCO.Ode4C13.ode
ltx/en_us_public/tr.d068:trCO.Ode4C13.text	@ltx/en_uk_ware/tr.d068:trCO.Ode4C13.text
ltx/en_us_public/tr.d068:trCO.Ode4C14.incipit	@ltx/en_uk_ware/tr.d068:trCO.Ode4C14.incipit
ltx/en_us_public/tr.d068:trCO.Ode4C14.melody	@ltx/en_uk_ware/tr.d068:trCO.Ode4C14.melody
ltx/en_us_public/tr.d068:trCO.Ode4C14.mode	@ltx/en_us_dedes/tr.d068:trCO.Ode4C14.mode
ltx/en_us_public/tr.d068:trCO.Ode4C14.ode	@ltx/en_us_dedes/tr.d068:trCO.Ode4C14.ode
ltx/en_us_public/tr.d068:trCO.Ode4C14.text	@ltx/en_uk_ware/tr.d068:trCO.Ode4C14.text
ltx/en_us_public/tr.d068:trCO.Ode4C15.incipit	@ltx/en_uk_ware/tr.d068:trCO.Ode4C15.incipit
ltx/en_us_public/tr.d068:trCO.Ode4C15.melody	@ltx/en_uk_ware/tr.d068:trCO.Ode4C15.melody
ltx/en_us_public/tr.d068:trCO.Ode4C15.mode	@ltx/en_us_dedes/tr.d068:trCO.Ode4C15.mode
ltx/en_us_public/tr.d068:trCO.Ode4C15.ode	@ltx/en_us_dedes/tr.d068:trCO.Ode4C15.ode
ltx/en_us_public/tr.d068:trCO.Ode4C15.text	@ltx/en_uk_ware/tr.d068:trCO.Ode4C15.text
ltx/en_us_public/tr.d068:trCO.Ode4C16.incipit	@ltx/en_uk_ware/tr.d068:trCO.Ode4C16.incipit
ltx/en_us_public/tr.d068:trCO.Ode4C16.melody	@ltx/en_uk_ware/tr.d068:trCO.Ode4C16.melody
ltx/en_us_public/tr.d068:trCO.Ode4C16.mode	@ltx/en_us_dedes/tr.d068:trCO.Ode4C16.mode
ltx/en_us_public/tr.d068:trCO.Ode4C16.ode	@ltx/en_us_dedes/tr.d068:trCO.Ode4C16.ode
ltx/en_us_public/tr.d068:trCO.Ode4C16.text	@ltx/en_uk_ware/tr.d068:trCO.Ode4C16.text
ltx/en_us_public/tr.d068:trCO.Ode4C1H.incipit	@ltx/en_uk_ware/tr.d068:trCO.Ode4C1H.incipit
ltx/en_us_public/tr.d068:trCO.Ode4C1H.melody	@ltx/en_uk_ware/tr.d068:trCO.Ode4C1H.melody
ltx/en_us_public/tr.d068:trCO.Ode4C1H.mode	@ltx/en_us_dedes/tr.d068:trCO.Ode4C1H.mode
ltx/en_us_public/tr.d068:trCO.Ode4C1H.ode	@ltx/en_us_dedes/tr.d068:trCO.Ode4C1H.ode
ltx/en_us_public/tr.d068:trCO.Ode4C1H.text	@ltx/en_uk_ware/tr.d068:trCO.Ode4C1H.text
ltx/en_us_public/tr.d068:trCO.Ode4C1T.incipit	@ltx/en_uk_ware/tr.d068:trCO.Ode4C1T.incipit
ltx/en_us_public/tr.d068:trCO.Ode4C1T.melody	@ltx/en_uk_ware/tr.d068:trCO.Ode4C1T.melody
ltx/en_us_public/tr.d068:trCO.Ode4C1T.mode	@ltx/en_us_dedes/tr.d068:trCO.Ode4C1T.mode
ltx/en_us_public/tr.d068:trCO.Ode4C1T.ode	@ltx/en_us_dedes/tr.d068:trCO.Ode4C1T.ode
ltx/en_us_public/tr.d068:trCO.Ode4C1T.text	@ltx/en_uk_ware/tr.d068:trCO.Ode4C1T.text
ltx/en_us_public/tr.d068:trCO.Ode4C1Tr.incipit	@ltx/en_uk_ware/tr.d068:trCO.Ode4C1Tr.incipit
ltx/en_us_public/tr.d068:trCO.Ode4C1Tr.melody	@ltx/en_uk_ware/tr.d068:trCO.Ode4C1Tr.melody
ltx/en_us_public/tr.d068:trCO.Ode4C1Tr.mode	@ltx/en_us_dedes/tr.d068:trCO.Ode4C1Tr.mode
ltx/en_us_public/tr.d068:trCO.Ode4C1Tr.ode	@ltx/en_us_dedes/tr.d068:trCO.Ode4C1Tr.ode
ltx/en_us_public/tr.d068:trCO.Ode4C1Tr.text	@ltx/en_uk_ware/tr.d068:trCO.Ode4C1Tr.text
ltx/en_us_public/tr.d068:trCO.Ode8C11.incipit	@ltx/en_uk_ware/tr.d068:trCO.Ode8C11.incipit
ltx/en_us_public/tr.d068:trCO.Ode8C11.melody	@ltx/en_uk_ware/tr.d068:trCO.Ode8C11.melody
ltx/en_us_public/tr.d068:trCO.Ode8C11.mode	@ltx/en_us_dedes/tr.d068:trCO.Ode8C11.mode
ltx/en_us_public/tr.d068:trCO.Ode8C11.ode	@ltx/en_us_dedes/tr.d068:trCO.Ode8C11.ode
ltx/en_us_public/tr.d068:trCO.Ode8C11.text	@ltx/en_uk_ware/tr.d068:trCO.Ode8C11.text
ltx/en_us_public/tr.d068:trCO.Ode8C12.incipit	@ltx/en_uk_ware/tr.d068:trCO.Ode8C12.incipit
ltx/en_us_public/tr.d068:trCO.Ode8C12.melody	@ltx/en_uk_ware/tr.d068:trCO.Ode8C12.melody
ltx/en_us_public/tr.d068:trCO.Ode8C12.mode	@ltx/en_us_dedes/tr.d068:trCO.Ode8C12.mode
ltx/en_us_public/tr.d068:trCO.Ode8C12.ode	@ltx/en_us_dedes/tr.d068:trCO.Ode8C12.ode
ltx/en_us_public/tr.d068:trCO.Ode8C12.text	@ltx/en_uk_ware/tr.d068:trCO.Ode8C12.text
ltx/en_us_public/tr.d068:trCO.Ode8C13.incipit	@ltx/en_uk_ware/tr.d068:trCO.Ode8C13.incipit
ltx/en_us_public/tr.d068:trCO.Ode8C13.melody	@ltx/en_uk_ware/tr.d068:trCO.Ode8C13.melody
ltx/en_us_public/tr.d068:trCO.Ode8C13.mode	@ltx/en_us_dedes/tr.d068:trCO.Ode8C13.mode
ltx/en_us_public/tr.d068:trCO.Ode8C13.ode	@ltx/en_us_dedes/tr.d068:trCO.Ode8C13.ode
ltx/en_us_public/tr.d068:trCO.Ode8C13.text	@ltx/en_uk_ware/tr.d068:trCO.Ode8C13.text
ltx/en_us_public/tr.d068:trCO.Ode8C14.incipit	@ltx/en_uk_ware/tr.d068:trCO.Ode8C14.incipit
ltx/en_us_public/tr.d068:trCO.Ode8C14.melody	@ltx/en_uk_ware/tr.d068:trCO.Ode8C14.melody
ltx/en_us_public/tr.d068:trCO.Ode8C14.mode	@ltx/en_us_dedes/tr.d068:trCO.Ode8C14.mode
ltx/en_us_public/tr.d068:trCO.Ode8C14.ode	@ltx/en_us_dedes/tr.d068:trCO.Ode8C14.ode
ltx/en_us_public/tr.d068:trCO.Ode8C14.text	@ltx/en_uk_ware/tr.d068:trCO.Ode8C14.text
ltx/en_us_public/tr.d068:trCO.Ode8C15.incipit	@ltx/en_uk_ware/tr.d068:trCO.Ode8C15.incipit
ltx/en_us_public/tr.d068:trCO.Ode8C15.melody	@ltx/en_uk_ware/tr.d068:trCO.Ode8C15.melody
ltx/en_us_public/tr.d068:trCO.Ode8C15.mode	@ltx/en_us_dedes/tr.d068:trCO.Ode8C15.mode
ltx/en_us_public/tr.d068:trCO.Ode8C15.ode	@ltx/en_us_dedes/tr.d068:trCO.Ode8C15.ode
ltx/en_us_public/tr.d068:trCO.Ode8C15.text	@ltx/en_uk_ware/tr.d068:trCO.Ode8C15.text
ltx/en_us_public/tr.d068:trCO.Ode8C16.incipit	@ltx/en_uk_ware/tr.d068:trCO.Ode8C16.incipit
ltx/en_us_public/tr.d068:trCO.Ode8C16.melody	@ltx/en_uk_ware/tr.d068:trCO.Ode8C16.melody
ltx/en_us_public/tr.d068:trCO.Ode8C16.mode	@ltx/en_us_dedes/tr.d068:trCO.Ode8C16.mode
ltx/en_us_public/tr.d068:trCO.Ode8C16.ode	@ltx/en_us_dedes/tr.d068:trCO.Ode8C16.ode
ltx/en_us_public/tr.d068:trCO.Ode8C16.text	@ltx/en_uk_ware/tr.d068:trCO.Ode8C16.text
ltx/en_us_public/tr.d068:trCO.Ode8C17.incipit	@ltx/en_uk_ware/tr.d068:trCO.Ode8C17.incipit
ltx/en_us_public/tr.d068:trCO.Ode8C17.melody	@ltx/en_uk_ware/tr.d068:trCO.Ode8C17.melody
ltx/en_us_public/tr.d068:trCO.Ode8C17.mode	@ltx/en_us_dedes/tr.d068:trCO.Ode8C17.mode
ltx/en_us_public/tr.d068:trCO.Ode8C17.ode	@ltx/en_us_dedes/tr.d068:trCO.Ode8C17.ode
ltx/en_us_public/tr.d068:trCO.Ode8C17.text	@ltx/en_uk_ware/tr.d068:trCO.Ode8C17.text
ltx/en_us_public/tr.d068:trCO.Ode8C1H.incipit	@ltx/en_uk_ware/tr.d068:trCO.Ode8C1H.incipit
ltx/en_us_public/tr.d068:trCO.Ode8C1H.melody	@ltx/en_uk_ware/tr.d068:trCO.Ode8C1H.melody
ltx/en_us_public/tr.d068:trCO.Ode8C1H.mode	@ltx/en_us_dedes/tr.d068:trCO.Ode8C1H.mode
ltx/en_us_public/tr.d068:trCO.Ode8C1H.ode	@ltx/en_us_dedes/tr.d068:trCO.Ode8C1H.ode
ltx/en_us_public/tr.d068:trCO.Ode8C1H.text	@ltx/en_uk_ware/tr.d068:trCO.Ode8C1H.text
ltx/en_us_public/tr.d068:trCO.Ode8C1T.incipit	@ltx/en_uk_ware/tr.d068:trCO.Ode8C1T.incipit
ltx/en_us_public/tr.d068:trCO.Ode8C1T.melody	@ltx/en_uk_ware/tr.d068:trCO.Ode8C1T.melody
ltx/en_us_public/tr.d068:trCO.Ode8C1T.mode	@ltx/en_us_dedes/tr.d068:trCO.Ode8C1T.mode
ltx/en_us_public/tr.d068:trCO.Ode8C1T.ode	@ltx/en_us_dedes/tr.d068:trCO.Ode8C1T.ode
ltx/en_us_public/tr.d068:trCO.Ode8C1T.text	@ltx/en_uk_ware/tr.d068:trCO.Ode8C1T.text
ltx/en_us_public/tr.d068:trCO.Ode8C1Tr.incipit	@ltx/en_uk_ware/tr.d068:trCO.Ode8C1Tr.incipit
ltx/en_us_public/tr.d068:trCO.Ode8C1Tr.melody	@ltx/en_uk_ware/tr.d068:trCO.Ode8C1Tr.melody
ltx/en_us_public/tr.d068:trCO.Ode8C1Tr.mode	@ltx/en_us_dedes/tr.d068:trCO.Ode8C1Tr.mode
ltx/en_us_public/tr.d068:trCO.Ode8C1Tr.ode	@ltx/en_us_dedes/tr.d068:trCO.Ode8C1Tr.ode
ltx/en_us_public/tr.d068:trCO.Ode8C1Tr.text	@ltx/en_uk_ware/tr.d068:trCO.Ode8C1Tr.text
ltx/en_us_public/tr.d068:trCO.Ode9C11.incipit	@ltx/en_uk_ware/tr.d068:trCO.Ode9C11.incipit
ltx/en_us_public/tr.d068:trCO.Ode9C11.melody	@ltx/en_uk_ware/tr.d068:trCO.Ode9C11.melody
ltx/en_us_public/tr.d068:trCO.Ode9C11.mode	@ltx/en_us_dedes/tr.d068:trCO.Ode9C11.mode
ltx/en_us_public/tr.d068:trCO.Ode9C11.ode	@ltx/en_us_dedes/tr.d068:trCO.Ode9C11.ode
ltx/en_us_public/tr.d068:trCO.Ode9C11.text	@ltx/en_uk_ware/tr.d068:trCO.Ode9C11.text
ltx/en_us_public/tr.d068:trCO.Ode9C12.incipit	@ltx/en_uk_ware/tr.d068:trCO.Ode9C12.incipit
ltx/en_us_public/tr.d068:trCO.Ode9C12.melody	@ltx/en_uk_ware/tr.d068:trCO.Ode9C12.melody
ltx/en_us_public/tr.d068:trCO.Ode9C12.mode	@ltx/en_us_dedes/tr.d068:trCO.Ode9C12.mode
ltx/en_us_public/tr.d068:trCO.Ode9C12.ode	@ltx/en_us_dedes/tr.d068:trCO.Ode9C12.ode
ltx/en_us_public/tr.d068:trCO.Ode9C12.text	@ltx/en_uk_ware/tr.d068:trCO.Ode9C12.text
ltx/en_us_public/tr.d068:trCO.Ode9C13.incipit	@ltx/en_uk_ware/tr.d068:trCO.Ode9C13.incipit
ltx/en_us_public/tr.d068:trCO.Ode9C13.melody	@ltx/en_uk_ware/tr.d068:trCO.Ode9C13.melody
ltx/en_us_public/tr.d068:trCO.Ode9C13.mode	@ltx/en_us_dedes/tr.d068:trCO.Ode9C13.mode
ltx/en_us_public/tr.d068:trCO.Ode9C13.ode	@ltx/en_us_dedes/tr.d068:trCO.Ode9C13.ode
ltx/en_us_public/tr.d068:trCO.Ode9C13.text	@ltx/en_uk_ware/tr.d068:trCO.Ode9C13.text
ltx/en_us_public/tr.d068:trCO.Ode9C14.incipit	@ltx/en_uk_ware/tr.d068:trCO.Ode9C14.incipit
ltx/en_us_public/tr.d068:trCO.Ode9C14.melody	@ltx/en_uk_ware/tr.d068:trCO.Ode9C14.melody
ltx/en_us_public/tr.d068:trCO.Ode9C14.mode	@ltx/en_us_dedes/tr.d068:trCO.Ode9C14.mode
ltx/en_us_public/tr.d068:trCO.Ode9C14.ode	@ltx/en_us_dedes/tr.d068:trCO.Ode9C14.ode
ltx/en_us_public/tr.d068:trCO.Ode9C14.text	@ltx/en_uk_ware/tr.d068:trCO.Ode9C14.text
ltx/en_us_public/tr.d068:trCO.Ode9C15.incipit	@ltx/en_uk_ware/tr.d068:trCO.Ode9C15.incipit
ltx/en_us_public/tr.d068:trCO.Ode9C15.melody	@ltx/en_uk_ware/tr.d068:trCO.Ode9C15.melody
ltx/en_us_public/tr.d068:trCO.Ode9C15.mode	@ltx/en_us_dedes/tr.d068:trCO.Ode9C15.mode
ltx/en_us_public/tr.d068:trCO.Ode9C15.ode	@ltx/en_us_dedes/tr.d068:trCO.Ode9C15.ode
ltx/en_us_public/tr.d068:trCO.Ode9C15.text	@ltx/en_uk_ware/tr.d068:trCO.Ode9C15.text
ltx/en_us_public/tr.d068:trCO.Ode9C16.incipit	@ltx/en_uk_ware/tr.d068:trCO.Ode9C16.incipit
ltx/en_us_public/tr.d068:trCO.Ode9C16.melody	@ltx/en_uk_ware/tr.d068:trCO.Ode9C16.melody
ltx/en_us_public/tr.d068:trCO.Ode9C16.mode	@ltx/en_us_dedes/tr.d068:trCO.Ode9C16.mode
ltx/en_us_public/tr.d068:trCO.Ode9C16.ode	@ltx/en_us_dedes/tr.d068:trCO.Ode9C16.ode
ltx/en_us_public/tr.d068:trCO.Ode9C16.text	@ltx/en_uk_ware/tr.d068:trCO.Ode9C16.text
ltx/en_us_public/tr.d068:trCO.Ode9C17.incipit	@ltx/en_uk_ware/tr.d068:trCO.Ode9C17.incipit
ltx/en_us_public/tr.d068:trCO.Ode9C17.melody	@ltx/en_uk_ware/tr.d068:trCO.Ode9C17.melody
ltx/en_us_public/tr.d068:trCO.Ode9C17.mode	@ltx/en_us_dedes/tr.d068:trCO.Ode9C17.mode
ltx/en_us_public/tr.d068:trCO.Ode9C17.ode	@ltx/en_us_dedes/tr.d068:trCO.Ode9C17.ode
ltx/en_us_public/tr.d068:trCO.Ode9C17.text	@ltx/en_uk_ware/tr.d068:trCO.Ode9C17.text
ltx/en_us_public/tr.d068:trCO.Ode9C18.incipit	@ltx/en_uk_ware/tr.d068:trCO.Ode9C18.incipit
ltx/en_us_public/tr.d068:trCO.Ode9C18.melody	@ltx/en_uk_ware/tr.d068:trCO.Ode9C18.melody
ltx/en_us_public/tr.d068:trCO.Ode9C18.mode	@ltx/en_us_dedes/tr.d068:trCO.Ode9C18.mode
ltx/en_us_public/tr.d068:trCO.Ode9C18.ode	@ltx/en_us_dedes/tr.d068:trCO.Ode9C18.ode
ltx/en_us_public/tr.d068:trCO.Ode9C18.text	@ltx/en_uk_ware/tr.d068:trCO.Ode9C18.text
ltx/en_us_public/tr.d068:trCO.Ode9C1H.incipit	@ltx/en_uk_ware/tr.d068:trCO.Ode9C1H.incipit
ltx/en_us_public/tr.d068:trCO.Ode9C1H.melody	@ltx/en_uk_ware/tr.d068:trCO.Ode9C1H.melody
ltx/en_us_public/tr.d068:trCO.Ode9C1H.mode	@ltx/en_us_dedes/tr.d068:trCO.Ode9C1H.mode
ltx/en_us_public/tr.d068:trCO.Ode9C1H.ode	@ltx/en_us_dedes/tr.d068:trCO.Ode9C1H.ode
ltx/en_us_public/tr.d068:trCO.Ode9C1H.text	@ltx/en_uk_ware/tr.d068:trCO.Ode9C1H.text
ltx/en_us_public/tr.d068:trCO.Ode9C1T.incipit	@ltx/en_uk_ware/tr.d068:trCO.Ode9C1T.incipit
ltx/en_us_public/tr.d068:trCO.Ode9C1T.melody	@ltx/en_uk_ware/tr.d068:trCO.Ode9C1T.melody
ltx/en_us_public/tr.d068:trCO.Ode9C1T.mode	@ltx/en_us_dedes/tr.d068:trCO.Ode9C1T.mode
ltx/en_us_public/tr.d068:trCO.Ode9C1T.ode	@ltx/en_us_dedes/tr.d068:trCO.Ode9C1T.ode
ltx/en_us_public/tr.d068:trCO.Ode9C1T.text	@ltx/en_uk_ware/tr.d068:trCO.Ode9C1T.text
ltx/en_us_public/tr.d068:trCO.Ode9C1Tr.incipit	@ltx/en_uk_ware/tr.d068:trCO.Ode9C1Tr.incipit
ltx/en_us_public/tr.d068:trCO.Ode9C1Tr.melody	@ltx/en_uk_ware/tr.d068:trCO.Ode9C1Tr.melody
ltx/en_us_public/tr.d068:trCO.Ode9C1Tr.mode	@ltx/en_us_dedes/tr.d068:trCO.Ode9C1Tr.mode
ltx/en_us_public/tr.d068:trCO.Ode9C1Tr.ode	@ltx/en_us_dedes/tr.d068:trCO.Ode9C1Tr.ode
ltx/en_us_public/tr.d068:trCO.Ode9C1Tr.text	@ltx/en_uk_ware/tr.d068:trCO.Ode9C1Tr.text
ltx/en_us_public/tr.d068:trCO.header	@ltx/en_us_dedes/tr.d068:trCO.header
ltx/en_us_public/tr.d068:trDA.commemoration.full	@ltx/en_us_dedes/tr.d068:trDA.commemoration.full
ltx/en_us_public/tr.d068:trDA.commemoration.short	@ltx/en_us_dedes/tr.d068:trDA.commemoration.short
ltx/en_us_public/tr.d068:trDA.dismissal	@ltx/en_us_dedes/tr.d068:trDA.dismissal
ltx/en_us_public/tr.d068:trDA.insert1	@ltx/en_us_dedes/tr.d068:trDA.insert1
ltx/en_us_public/tr.d068:trDA.insert2	@ltx/en_us_dedes/tr.d068:trDA.insert2
ltx/en_us_public/tr.d068:trDA.note	@ltx/en_us_dedes/tr.d068:trDA.note
ltx/en_us_public/tr.d068:trDA.title	@ltx/en_us_dedes/tr.d068:trDA.title
ltx/en_us_public/tr.d068:trEM.header	@ltx/en_us_dedes/tr.d068:trEM.header
ltx/en_us_public/tr.d068:trHO.commemorations	@ltx/en_us_dedes/tr.d068:trHO.commemorations
ltx/en_us_public/tr.d068:trHO.daytitle	@ltx/en_us_dedes/tr.d068:trHO.daytitle
ltx/en_us_public/tr.d068:trHO.description1	@ltx/en_us_dedes/tr.d068:trHO.description1
ltx/en_us_public/tr.d068:trHO.description2	@ltx/en_us_dedes/tr.d068:trHO.description2
ltx/en_us_public/tr.d068:trHO.note1	@ltx/en_us_dedes/tr.d068:trHO.note1
ltx/en_us_public/tr.d068:trHO.note2	@ltx/en_us_dedes/tr.d068:trHO.note2
ltx/en_us_public/tr.d068:trMA.AposBoth.incipit	@ltx/en_us_dedes/tr.d068:trMA.AposBoth.incipit
ltx/en_us_public/tr.d068:trMA.AposBoth.melody	@ltx/en_us_dedes/tr.d068:trMA.AposBoth.melody
ltx/en_us_public/tr.d068:trMA.AposBoth.mode	@ltx/en_us_dedes/tr.d068:trMA.AposBoth.mode
ltx/en_us_public/tr.d068:trMA.AposBoth.text	@ltx/en_us_dedes/tr.d068:trMA.AposBoth.text
ltx/en_us_public/tr.d068:trMA.AposGlory.incipit	@ltx/en_us_dedes/tr.d068:trMA.AposGlory.incipit
ltx/en_us_public/tr.d068:trMA.AposGlory.melody	@ltx/en_us_dedes/tr.d068:trMA.AposGlory.melody
ltx/en_us_public/tr.d068:trMA.AposGlory.mode	@ltx/en_us_dedes/tr.d068:trMA.AposGlory.mode
ltx/en_us_public/tr.d068:trMA.AposGlory.text	@ltx/en_us_dedes/tr.d068:trMA.AposGlory.text
ltx/en_us_public/tr.d068:trMA.Aposticha1.incipit	@ltx/en_us_dedes/tr.d068:trMA.Aposticha1.incipit
ltx/en_us_public/tr.d068:trMA.Aposticha1.melody	@ltx/en_us_dedes/tr.d068:trMA.Aposticha1.melody
ltx/en_us_public/tr.d068:trMA.Aposticha1.mode	@ltx/en_us_dedes/tr.d068:trMA.Aposticha1.mode
ltx/en_us_public/tr.d068:trMA.Aposticha1.text	@ltx/en_us_dedes/tr.d068:trMA.Aposticha1.text
ltx/en_us_public/tr.d068:trMA.Aposticha2.incipit	@ltx/en_us_dedes/tr.d068:trMA.Aposticha2.incipit
ltx/en_us_public/tr.d068:trMA.Aposticha2.melody	@ltx/en_us_dedes/tr.d068:trMA.Aposticha2.melody
ltx/en_us_public/tr.d068:trMA.Aposticha2.mode	@ltx/en_us_dedes/tr.d068:trMA.Aposticha2.mode
ltx/en_us_public/tr.d068:trMA.Aposticha2.text	@ltx/en_us_dedes/tr.d068:trMA.Aposticha2.text
ltx/en_us_public/tr.d068:trMA.Aposticha3.incipit	@ltx/en_us_dedes/tr.d068:trMA.Aposticha3.incipit
ltx/en_us_public/tr.d068:trMA.Aposticha3.melody	@ltx/en_us_dedes/tr.d068:trMA.Aposticha3.melody
ltx/en_us_public/tr.d068:trMA.Aposticha3.mode	@ltx/en_us_dedes/tr.d068:trMA.Aposticha3.mode
ltx/en_us_public/tr.d068:trMA.Aposticha3.text	@ltx/en_us_dedes/tr.d068:trMA.Aposticha3.text
ltx/en_us_public/tr.d068:trMA.Aposticha4.incipit	@ltx/en_us_dedes/tr.d068:trMA.Aposticha4.incipit
ltx/en_us_public/tr.d068:trMA.Aposticha4.melody	@ltx/en_us_dedes/tr.d068:trMA.Aposticha4.melody
ltx/en_us_public/tr.d068:trMA.Aposticha4.mode	@ltx/en_us_dedes/tr.d068:trMA.Aposticha4.mode
ltx/en_us_public/tr.d068:trMA.Aposticha4.text	@ltx/en_us_dedes/tr.d068:trMA.Aposticha4.text
ltx/en_us_public/tr.d068:trMA.C1.acrostic.notice1	@ltx/en_us_dedes/tr.d068:trMA.C1.acrostic.notice1
ltx/en_us_public/tr.d068:trMA.C1.acrostic.text	@ltx/en_us_dedes/tr.d068:trMA.C1.acrostic.text
ltx/en_us_public/tr.d068:trMA.C1.acrostic.title	@ltx/en_us_dedes/tr.d068:trMA.C1.acrostic.title
ltx/en_us_public/tr.d068:trMA.C1.poet	@ltx/en_us_dedes/tr.d068:trMA.C1.poet
ltx/en_us_public/tr.d068:trMA.C1.verse	@ltx/en_us_dedes/tr.d068:trMA.C1.verse
ltx/en_us_public/tr.d068:trMA.Exaposteilarion1.greekmelody	@ltx/en_us_dedes/tr.d068:trMA.Exaposteilarion1.greekmelody
ltx/en_us_public/tr.d068:trMA.Exaposteilarion1.incipit	@ltx/en_us_dedes/tr.d068:trMA.Exaposteilarion1.incipit
ltx/en_us_public/tr.d068:trMA.Exaposteilarion1.melody	@ltx/en_us_dedes/tr.d068:trMA.Exaposteilarion1.melody
ltx/en_us_public/tr.d068:trMA.Exaposteilarion1.mode	@ltx/en_us_dedes/tr.d068:trMA.Exaposteilarion1.mode
ltx/en_us_public/tr.d068:trMA.Exaposteilarion1.text	@ltx/en_us_dedes/tr.d068:trMA.Exaposteilarion1.text
ltx/en_us_public/tr.d068:trMA.Kontakion1.incipit	@ltx/en_us_dedes/tr.d068:trMA.Kontakion1.incipit
ltx/en_us_public/tr.d068:trMA.Kontakion1.melody	@ltx/en_us_dedes/tr.d068:trMA.Kontakion1.melody
ltx/en_us_public/tr.d068:trMA.Kontakion1.mode	@ltx/en_us_dedes/tr.d068:trMA.Kontakion1.mode
ltx/en_us_public/tr.d068:trMA.Kontakion1.text	@ltx/en_us_dedes/tr.d068:trMA.Kontakion1.text
ltx/en_us_public/tr.d068:trMA.Lauds1.incipit	@ltx/en_us_dedes/tr.d068:trMA.Lauds1.incipit
ltx/en_us_public/tr.d068:trMA.Lauds1.melody	@ltx/en_us_dedes/tr.d068:trMA.Lauds1.melody
ltx/en_us_public/tr.d068:trMA.Lauds1.mode	@ltx/en_us_dedes/tr.d068:trMA.Lauds1.mode
ltx/en_us_public/tr.d068:trMA.Lauds1.text	@ltx/en_us_dedes/tr.d068:trMA.Lauds1.text
ltx/en_us_public/tr.d068:trMA.Lauds2.incipit	@ltx/en_us_dedes/tr.d068:trMA.Lauds2.incipit
ltx/en_us_public/tr.d068:trMA.Lauds2.melody	@ltx/en_us_dedes/tr.d068:trMA.Lauds2.melody
ltx/en_us_public/tr.d068:trMA.Lauds2.mode	@ltx/en_us_dedes/tr.d068:trMA.Lauds2.mode
ltx/en_us_public/tr.d068:trMA.Lauds2.text	@ltx/en_us_dedes/tr.d068:trMA.Lauds2.text
ltx/en_us_public/tr.d068:trMA.Lauds3.incipit	@ltx/en_us_dedes/tr.d068:trMA.Lauds3.incipit
ltx/en_us_public/tr.d068:trMA.Lauds3.melody	@ltx/en_us_dedes/tr.d068:trMA.Lauds3.melody
ltx/en_us_public/tr.d068:trMA.Lauds3.mode	@ltx/en_us_dedes/tr.d068:trMA.Lauds3.mode
ltx/en_us_public/tr.d068:trMA.Lauds3.text	@ltx/en_us_dedes/tr.d068:trMA.Lauds3.text
ltx/en_us_public/tr.d068:trMA.Lauds4.incipit	@ltx/en_us_dedes/tr.d068:trMA.Lauds4.incipit
ltx/en_us_public/tr.d068:trMA.Lauds4.melody	@ltx/en_us_dedes/tr.d068:trMA.Lauds4.melody
ltx/en_us_public/tr.d068:trMA.Lauds4.mode	@ltx/en_us_dedes/tr.d068:trMA.Lauds4.mode
ltx/en_us_public/tr.d068:trMA.Lauds4.text	@ltx/en_us_dedes/tr.d068:trMA.Lauds4.text
ltx/en_us_public/tr.d068:trMA.LaudsGlory.incipit	@ltx/en_us_dedes/tr.d068:trMA.LaudsGlory.incipit
ltx/en_us_public/tr.d068:trMA.LaudsGlory.melody	@ltx/en_us_dedes/tr.d068:trMA.LaudsGlory.melody
ltx/en_us_public/tr.d068:trMA.LaudsGlory.mode	@ltx/en_us_dedes/tr.d068:trMA.LaudsGlory.mode
ltx/en_us_public/tr.d068:trMA.LaudsGlory.text	@ltx/en_us_dedes/tr.d068:trMA.LaudsGlory.text
ltx/en_us_public/tr.d068:trMA.MM.Alleluia.text	@ltx/en_us_dedes/tr.d068:trMA.MM.Alleluia.text
ltx/en_us_public/tr.d068:trMA.Ode1C11.greekmelody	@ltx/en_us_dedes/tr.d068:trMA.Ode1C11.greekmelody
ltx/en_us_public/tr.d068:trMA.Ode1C11.incipit	@ltx/en_us_dedes/tr.d068:trMA.Ode1C11.incipit
ltx/en_us_public/tr.d068:trMA.Ode1C11.melody	@ltx/en_us_dedes/tr.d068:trMA.Ode1C11.melody
ltx/en_us_public/tr.d068:trMA.Ode1C11.mode	@ltx/en_us_dedes/tr.d068:trMA.Ode1C11.mode
ltx/en_us_public/tr.d068:trMA.Ode1C11.ode	@ltx/en_us_dedes/tr.d068:trMA.Ode1C11.ode
ltx/en_us_public/tr.d068:trMA.Ode1C11.text	@ltx/en_us_dedes/tr.d068:trMA.Ode1C11.text
ltx/en_us_public/tr.d068:trMA.Ode1C12.incipit	@ltx/en_us_dedes/tr.d068:trMA.Ode1C12.incipit
ltx/en_us_public/tr.d068:trMA.Ode1C12.melody	@ltx/en_us_dedes/tr.d068:trMA.Ode1C12.melody
ltx/en_us_public/tr.d068:trMA.Ode1C12.mode	@ltx/en_us_dedes/tr.d068:trMA.Ode1C12.mode
ltx/en_us_public/tr.d068:trMA.Ode1C12.ode	@ltx/en_us_dedes/tr.d068:trMA.Ode1C12.ode
ltx/en_us_public/tr.d068:trMA.Ode1C12.text	@ltx/en_us_dedes/tr.d068:trMA.Ode1C12.text
ltx/en_us_public/tr.d068:trMA.Ode1C13.incipit	@ltx/en_us_dedes/tr.d068:trMA.Ode1C13.incipit
ltx/en_us_public/tr.d068:trMA.Ode1C13.melody	@ltx/en_us_dedes/tr.d068:trMA.Ode1C13.melody
ltx/en_us_public/tr.d068:trMA.Ode1C13.mode	@ltx/en_us_dedes/tr.d068:trMA.Ode1C13.mode
ltx/en_us_public/tr.d068:trMA.Ode1C13.ode	@ltx/en_us_dedes/tr.d068:trMA.Ode1C13.ode
ltx/en_us_public/tr.d068:trMA.Ode1C13.text	@ltx/en_us_dedes/tr.d068:trMA.Ode1C13.text
ltx/en_us_public/tr.d068:trMA.Ode1C1H.greekmelody	@ltx/en_us_dedes/tr.d068:trMA.Ode1C1H.greekmelody
ltx/en_us_public/tr.d068:trMA.Ode1C1H.incipit	@ltx/en_us_dedes/tr.d068:trMA.Ode1C1H.incipit
ltx/en_us_public/tr.d068:trMA.Ode1C1H.melody	@ltx/en_us_dedes/tr.d068:trMA.Ode1C1H.melody
ltx/en_us_public/tr.d068:trMA.Ode1C1H.mode	@ltx/en_us_dedes/tr.d068:trMA.Ode1C1H.mode
ltx/en_us_public/tr.d068:trMA.Ode1C1H.ode	@ltx/en_us_dedes/tr.d068:trMA.Ode1C1H.ode
ltx/en_us_public/tr.d068:trMA.Ode1C1H.text	@ltx/en_us_dedes/tr.d068:trMA.Ode1C1H.text
ltx/en_us_public/tr.d068:trMA.Ode1K.incipit	@ltx/en_us_dedes/tr.d068:trMA.Ode1K.incipit
ltx/en_us_public/tr.d068:trMA.Ode1K.melody	@ltx/en_us_dedes/tr.d068:trMA.Ode1K.melody
ltx/en_us_public/tr.d068:trMA.Ode1K.mode	@ltx/en_us_dedes/tr.d068:trMA.Ode1K.mode
ltx/en_us_public/tr.d068:trMA.Ode1K.ode	@ltx/en_us_dedes/tr.d068:trMA.Ode1K.ode
ltx/en_us_public/tr.d068:trMA.Ode1K.text	@ltx/en_us_dedes/tr.d068:trMA.Ode1K.text
ltx/en_us_public/tr.d068:trMA.Ode3C11.greekmelody	@ltx/en_us_dedes/tr.d068:trMA.Ode3C11.greekmelody
ltx/en_us_public/tr.d068:trMA.Ode3C11.incipit	@ltx/en_us_dedes/tr.d068:trMA.Ode3C11.incipit
ltx/en_us_public/tr.d068:trMA.Ode3C11.melody	@ltx/en_us_dedes/tr.d068:trMA.Ode3C11.melody
ltx/en_us_public/tr.d068:trMA.Ode3C11.mode	@ltx/en_us_dedes/tr.d068:trMA.Ode3C11.mode
ltx/en_us_public/tr.d068:trMA.Ode3C11.ode	@ltx/en_us_dedes/tr.d068:trMA.Ode3C11.ode
ltx/en_us_public/tr.d068:trMA.Ode3C11.text	@ltx/en_us_dedes/tr.d068:trMA.Ode3C11.text
ltx/en_us_public/tr.d068:trMA.Ode3C12.incipit	@ltx/en_us_dedes/tr.d068:trMA.Ode3C12.incipit
ltx/en_us_public/tr.d068:trMA.Ode3C12.melody	@ltx/en_us_dedes/tr.d068:trMA.Ode3C12.melody
ltx/en_us_public/tr.d068:trMA.Ode3C12.mode	@ltx/en_us_dedes/tr.d068:trMA.Ode3C12.mode
ltx/en_us_public/tr.d068:trMA.Ode3C12.ode	@ltx/en_us_dedes/tr.d068:trMA.Ode3C12.ode
ltx/en_us_public/tr.d068:trMA.Ode3C12.text	@ltx/en_us_dedes/tr.d068:trMA.Ode3C12.text
ltx/en_us_public/tr.d068:trMA.Ode3C1H.greekmelody	@ltx/en_us_dedes/tr.d068:trMA.Ode3C1H.greekmelody
ltx/en_us_public/tr.d068:trMA.Ode3C1H.incipit	@ltx/en_us_dedes/tr.d068:trMA.Ode3C1H.incipit
ltx/en_us_public/tr.d068:trMA.Ode3C1H.melody	@ltx/en_us_dedes/tr.d068:trMA.Ode3C1H.melody
ltx/en_us_public/tr.d068:trMA.Ode3C1H.mode	@ltx/en_us_dedes/tr.d068:trMA.Ode3C1H.mode
ltx/en_us_public/tr.d068:trMA.Ode3C1H.ode	@ltx/en_us_dedes/tr.d068:trMA.Ode3C1H.ode
ltx/en_us_public/tr.d068:trMA.Ode3C1H.text	@ltx/en_us_dedes/tr.d068:trMA.Ode3C1H.text
ltx/en_us_public/tr.d068:trMA.Ode3K.incipit	@ltx/en_us_dedes/tr.d068:trMA.Ode3K.incipit
ltx/en_us_public/tr.d068:trMA.Ode3K.melody	@ltx/en_us_dedes/tr.d068:trMA.Ode3K.melody
ltx/en_us_public/tr.d068:trMA.Ode3K.mode	@ltx/en_us_dedes/tr.d068:trMA.Ode3K.mode
ltx/en_us_public/tr.d068:trMA.Ode3K.ode	@ltx/en_us_dedes/tr.d068:trMA.Ode3K.ode
ltx/en_us_public/tr.d068:trMA.Ode3K.text	@ltx/en_us_dedes/tr.d068:trMA.Ode3K.text
ltx/en_us_public/tr.d068:trMA.Ode3Kathisma1.greekmelody	@ltx/en_us_dedes/tr.d068:trMA.Ode3Kathisma1.greekmelody
ltx/en_us_public/tr.d068:trMA.Ode3Kathisma1.incipit	@ltx/en_us_dedes/tr.d068:trMA.Ode3Kathisma1.incipit
ltx/en_us_public/tr.d068:trMA.Ode3Kathisma1.melody	@ltx/en_us_dedes/tr.d068:trMA.Ode3Kathisma1.melody
ltx/en_us_public/tr.d068:trMA.Ode3Kathisma1.mode	@ltx/en_us_dedes/tr.d068:trMA.Ode3Kathisma1.mode
ltx/en_us_public/tr.d068:trMA.Ode3Kathisma1.text	@ltx/en_us_dedes/tr.d068:trMA.Ode3Kathisma1.text
ltx/en_us_public/tr.d068:trMA.Ode3Kathisma2.greekmelody	@ltx/en_us_dedes/tr.d068:trMA.Ode3Kathisma2.greekmelody
ltx/en_us_public/tr.d068:trMA.Ode3Kathisma2.incipit	@ltx/en_us_dedes/tr.d068:trMA.Ode3Kathisma2.incipit
ltx/en_us_public/tr.d068:trMA.Ode3Kathisma2.melody	@ltx/en_us_dedes/tr.d068:trMA.Ode3Kathisma2.melody
ltx/en_us_public/tr.d068:trMA.Ode3Kathisma2.mode	@ltx/en_us_dedes/tr.d068:trMA.Ode3Kathisma2.mode
ltx/en_us_public/tr.d068:trMA.Ode3Kathisma2.text	@ltx/en_us_dedes/tr.d068:trMA.Ode3Kathisma2.text
ltx/en_us_public/tr.d068:trMA.Ode3Kathisma3.greekmelody	@ltx/en_us_dedes/tr.d068:trMA.Ode3Kathisma3.greekmelody
ltx/en_us_public/tr.d068:trMA.Ode3Kathisma3.incipit	@ltx/en_us_dedes/tr.d068:trMA.Ode3Kathisma3.incipit
ltx/en_us_public/tr.d068:trMA.Ode3Kathisma3.melody	@ltx/en_us_dedes/tr.d068:trMA.Ode3Kathisma3.melody
ltx/en_us_public/tr.d068:trMA.Ode3Kathisma3.mode	@ltx/en_us_dedes/tr.d068:trMA.Ode3Kathisma3.mode
ltx/en_us_public/tr.d068:trMA.Ode3Kathisma3.text	@ltx/en_us_dedes/tr.d068:trMA.Ode3Kathisma3.text
ltx/en_us_public/tr.d068:trMA.Ode4C11.greekmelody	@ltx/en_us_dedes/tr.d068:trMA.Ode4C11.greekmelody
ltx/en_us_public/tr.d068:trMA.Ode4C11.incipit	@ltx/en_us_dedes/tr.d068:trMA.Ode4C11.incipit
ltx/en_us_public/tr.d068:trMA.Ode4C11.melody	@ltx/en_us_dedes/tr.d068:trMA.Ode4C11.melody
ltx/en_us_public/tr.d068:trMA.Ode4C11.mode	@ltx/en_us_dedes/tr.d068:trMA.Ode4C11.mode
ltx/en_us_public/tr.d068:trMA.Ode4C11.ode	@ltx/en_us_dedes/tr.d068:trMA.Ode4C11.ode
ltx/en_us_public/tr.d068:trMA.Ode4C11.text	@ltx/en_us_dedes/tr.d068:trMA.Ode4C11.text
ltx/en_us_public/tr.d068:trMA.Ode4C12.incipit	@ltx/en_us_dedes/tr.d068:trMA.Ode4C12.incipit
ltx/en_us_public/tr.d068:trMA.Ode4C12.melody	@ltx/en_us_dedes/tr.d068:trMA.Ode4C12.melody
ltx/en_us_public/tr.d068:trMA.Ode4C12.mode	@ltx/en_us_dedes/tr.d068:trMA.Ode4C12.mode
ltx/en_us_public/tr.d068:trMA.Ode4C12.ode	@ltx/en_us_dedes/tr.d068:trMA.Ode4C12.ode
ltx/en_us_public/tr.d068:trMA.Ode4C12.text	@ltx/en_us_dedes/tr.d068:trMA.Ode4C12.text
ltx/en_us_public/tr.d068:trMA.Ode4C13.incipit	@ltx/en_us_dedes/tr.d068:trMA.Ode4C13.incipit
ltx/en_us_public/tr.d068:trMA.Ode4C13.melody	@ltx/en_us_dedes/tr.d068:trMA.Ode4C13.melody
ltx/en_us_public/tr.d068:trMA.Ode4C13.mode	@ltx/en_us_dedes/tr.d068:trMA.Ode4C13.mode
ltx/en_us_public/tr.d068:trMA.Ode4C13.ode	@ltx/en_us_dedes/tr.d068:trMA.Ode4C13.ode
ltx/en_us_public/tr.d068:trMA.Ode4C13.text	@ltx/en_us_dedes/tr.d068:trMA.Ode4C13.text
ltx/en_us_public/tr.d068:trMA.Ode4C1H.greekmelody	@ltx/en_us_dedes/tr.d068:trMA.Ode4C1H.greekmelody
ltx/en_us_public/tr.d068:trMA.Ode4C1H.incipit	@ltx/en_us_dedes/tr.d068:trMA.Ode4C1H.incipit
ltx/en_us_public/tr.d068:trMA.Ode4C1H.melody	@ltx/en_us_dedes/tr.d068:trMA.Ode4C1H.melody
ltx/en_us_public/tr.d068:trMA.Ode4C1H.mode	@ltx/en_us_dedes/tr.d068:trMA.Ode4C1H.mode
ltx/en_us_public/tr.d068:trMA.Ode4C1H.ode	@ltx/en_us_dedes/tr.d068:trMA.Ode4C1H.ode
ltx/en_us_public/tr.d068:trMA.Ode4C1H.text	@ltx/en_us_dedes/tr.d068:trMA.Ode4C1H.text
ltx/en_us_public/tr.d068:trMA.Ode4K.incipit	@ltx/en_us_dedes/tr.d068:trMA.Ode4K.incipit
ltx/en_us_public/tr.d068:trMA.Ode4K.melody	@ltx/en_us_dedes/tr.d068:trMA.Ode4K.melody
ltx/en_us_public/tr.d068:trMA.Ode4K.mode	@ltx/en_us_dedes/tr.d068:trMA.Ode4K.mode
ltx/en_us_public/tr.d068:trMA.Ode4K.ode	@ltx/en_us_dedes/tr.d068:trMA.Ode4K.ode
ltx/en_us_public/tr.d068:trMA.Ode4K.text	@ltx/en_us_dedes/tr.d068:trMA.Ode4K.text
ltx/en_us_public/tr.d068:trMA.Ode5C11.greekmelody	@ltx/en_us_dedes/tr.d068:trMA.Ode5C11.greekmelody
ltx/en_us_public/tr.d068:trMA.Ode5C11.incipit	@ltx/en_us_dedes/tr.d068:trMA.Ode5C11.incipit
ltx/en_us_public/tr.d068:trMA.Ode5C11.melody	@ltx/en_us_dedes/tr.d068:trMA.Ode5C11.melody
ltx/en_us_public/tr.d068:trMA.Ode5C11.mode	@ltx/en_us_dedes/tr.d068:trMA.Ode5C11.mode
ltx/en_us_public/tr.d068:trMA.Ode5C11.ode	@ltx/en_us_dedes/tr.d068:trMA.Ode5C11.ode
ltx/en_us_public/tr.d068:trMA.Ode5C11.text	@ltx/en_us_dedes/tr.d068:trMA.Ode5C11.text
ltx/en_us_public/tr.d068:trMA.Ode5C12.incipit	@ltx/en_us_dedes/tr.d068:trMA.Ode5C12.incipit
ltx/en_us_public/tr.d068:trMA.Ode5C12.melody	@ltx/en_us_dedes/tr.d068:trMA.Ode5C12.melody
ltx/en_us_public/tr.d068:trMA.Ode5C12.mode	@ltx/en_us_dedes/tr.d068:trMA.Ode5C12.mode
ltx/en_us_public/tr.d068:trMA.Ode5C12.ode	@ltx/en_us_dedes/tr.d068:trMA.Ode5C12.ode
ltx/en_us_public/tr.d068:trMA.Ode5C12.text	@ltx/en_us_dedes/tr.d068:trMA.Ode5C12.text
ltx/en_us_public/tr.d068:trMA.Ode5C1H.greekmelody	@ltx/en_us_dedes/tr.d068:trMA.Ode5C1H.greekmelody
ltx/en_us_public/tr.d068:trMA.Ode5C1H.incipit	@ltx/en_us_dedes/tr.d068:trMA.Ode5C1H.incipit
ltx/en_us_public/tr.d068:trMA.Ode5C1H.melody	@ltx/en_us_dedes/tr.d068:trMA.Ode5C1H.melody
ltx/en_us_public/tr.d068:trMA.Ode5C1H.mode	@ltx/en_us_dedes/tr.d068:trMA.Ode5C1H.mode
ltx/en_us_public/tr.d068:trMA.Ode5C1H.ode	@ltx/en_us_dedes/tr.d068:trMA.Ode5C1H.ode
ltx/en_us_public/tr.d068:trMA.Ode5C1H.text	@ltx/en_us_dedes/tr.d068:trMA.Ode5C1H.text
ltx/en_us_public/tr.d068:trMA.Ode5K.incipit	@ltx/en_us_dedes/tr.d068:trMA.Ode5K.incipit
ltx/en_us_public/tr.d068:trMA.Ode5K.melody	@ltx/en_us_dedes/tr.d068:trMA.Ode5K.melody
ltx/en_us_public/tr.d068:trMA.Ode5K.mode	@ltx/en_us_dedes/tr.d068:trMA.Ode5K.mode
ltx/en_us_public/tr.d068:trMA.Ode5K.ode	@ltx/en_us_dedes/tr.d068:trMA.Ode5K.ode
ltx/en_us_public/tr.d068:trMA.Ode5K.text	@ltx/en_us_dedes/tr.d068:trMA.Ode5K.text
ltx/en_us_public/tr.d068:trMA.Ode6C11.greekmelody	@ltx/en_us_dedes/tr.d068:trMA.Ode6C11.greekmelody
ltx/en_us_public/tr.d068:trMA.Ode6C11.incipit	@ltx/en_us_dedes/tr.d068:trMA.Ode6C11.incipit
ltx/en_us_public/tr.d068:trMA.Ode6C11.melody	@ltx/en_us_dedes/tr.d068:trMA.Ode6C11.melody
ltx/en_us_public/tr.d068:trMA.Ode6C11.mode	@ltx/en_us_dedes/tr.d068:trMA.Ode6C11.mode
ltx/en_us_public/tr.d068:trMA.Ode6C11.ode	@ltx/en_us_dedes/tr.d068:trMA.Ode6C11.ode
ltx/en_us_public/tr.d068:trMA.Ode6C11.text	@ltx/en_us_dedes/tr.d068:trMA.Ode6C11.text
ltx/en_us_public/tr.d068:trMA.Ode6C12.incipit	@ltx/en_us_dedes/tr.d068:trMA.Ode6C12.incipit
ltx/en_us_public/tr.d068:trMA.Ode6C12.melody	@ltx/en_us_dedes/tr.d068:trMA.Ode6C12.melody
ltx/en_us_public/tr.d068:trMA.Ode6C12.mode	@ltx/en_us_dedes/tr.d068:trMA.Ode6C12.mode
ltx/en_us_public/tr.d068:trMA.Ode6C12.ode	@ltx/en_us_dedes/tr.d068:trMA.Ode6C12.ode
ltx/en_us_public/tr.d068:trMA.Ode6C12.text	@ltx/en_us_dedes/tr.d068:trMA.Ode6C12.text
ltx/en_us_public/tr.d068:trMA.Ode6C1H.greekmelody	@ltx/en_us_dedes/tr.d068:trMA.Ode6C1H.greekmelody
ltx/en_us_public/tr.d068:trMA.Ode6C1H.incipit	@ltx/en_us_dedes/tr.d068:trMA.Ode6C1H.incipit
ltx/en_us_public/tr.d068:trMA.Ode6C1H.melody	@ltx/en_us_dedes/tr.d068:trMA.Ode6C1H.melody
ltx/en_us_public/tr.d068:trMA.Ode6C1H.mode	@ltx/en_us_dedes/tr.d068:trMA.Ode6C1H.mode
ltx/en_us_public/tr.d068:trMA.Ode6C1H.ode	@ltx/en_us_dedes/tr.d068:trMA.Ode6C1H.ode
ltx/en_us_public/tr.d068:trMA.Ode6C1H.text	@ltx/en_us_dedes/tr.d068:trMA.Ode6C1H.text
ltx/en_us_public/tr.d068:trMA.Ode6K.incipit	@ltx/en_us_dedes/tr.d068:trMA.Ode6K.incipit
ltx/en_us_public/tr.d068:trMA.Ode6K.melody	@ltx/en_us_dedes/tr.d068:trMA.Ode6K.melody
ltx/en_us_public/tr.d068:trMA.Ode6K.mode	@ltx/en_us_dedes/tr.d068:trMA.Ode6K.mode
ltx/en_us_public/tr.d068:trMA.Ode6K.ode	@ltx/en_us_dedes/tr.d068:trMA.Ode6K.ode
ltx/en_us_public/tr.d068:trMA.Ode6K.text	@ltx/en_us_dedes/tr.d068:trMA.Ode6K.text
ltx/en_us_public/tr.d068:trMA.Ode7C11.greekmelody	@ltx/en_us_dedes/tr.d068:trMA.Ode7C11.greekmelody
ltx/en_us_public/tr.d068:trMA.Ode7C11.incipit	@ltx/en_us_dedes/tr.d068:trMA.Ode7C11.incipit
ltx/en_us_public/tr.d068:trMA.Ode7C11.melody	@ltx/en_us_dedes/tr.d068:trMA.Ode7C11.melody
ltx/en_us_public/tr.d068:trMA.Ode7C11.mode	@ltx/en_us_dedes/tr.d068:trMA.Ode7C11.mode
ltx/en_us_public/tr.d068:trMA.Ode7C11.ode	@ltx/en_us_dedes/tr.d068:trMA.Ode7C11.ode
ltx/en_us_public/tr.d068:trMA.Ode7C11.text	@ltx/en_us_dedes/tr.d068:trMA.Ode7C11.text
ltx/en_us_public/tr.d068:trMA.Ode7C12.incipit	@ltx/en_us_dedes/tr.d068:trMA.Ode7C12.incipit
ltx/en_us_public/tr.d068:trMA.Ode7C12.melody	@ltx/en_us_dedes/tr.d068:trMA.Ode7C12.melody
ltx/en_us_public/tr.d068:trMA.Ode7C12.mode	@ltx/en_us_dedes/tr.d068:trMA.Ode7C12.mode
ltx/en_us_public/tr.d068:trMA.Ode7C12.ode	@ltx/en_us_dedes/tr.d068:trMA.Ode7C12.ode
ltx/en_us_public/tr.d068:trMA.Ode7C12.text	@ltx/en_us_dedes/tr.d068:trMA.Ode7C12.text
ltx/en_us_public/tr.d068:trMA.Ode7C13.incipit	@ltx/en_us_dedes/tr.d068:trMA.Ode7C13.incipit
ltx/en_us_public/tr.d068:trMA.Ode7C13.melody	@ltx/en_us_dedes/tr.d068:trMA.Ode7C13.melody
ltx/en_us_public/tr.d068:trMA.Ode7C13.mode	@ltx/en_us_dedes/tr.d068:trMA.Ode7C13.mode
ltx/en_us_public/tr.d068:trMA.Ode7C13.ode	@ltx/en_us_dedes/tr.d068:trMA.Ode7C13.ode
ltx/en_us_public/tr.d068:trMA.Ode7C13.text	@ltx/en_us_dedes/tr.d068:trMA.Ode7C13.text
ltx/en_us_public/tr.d068:trMA.Ode7C1H.greekmelody	@ltx/en_us_dedes/tr.d068:trMA.Ode7C1H.greekmelody
ltx/en_us_public/tr.d068:trMA.Ode7C1H.incipit	@ltx/en_us_dedes/tr.d068:trMA.Ode7C1H.incipit
ltx/en_us_public/tr.d068:trMA.Ode7C1H.melody	@ltx/en_us_dedes/tr.d068:trMA.Ode7C1H.melody
ltx/en_us_public/tr.d068:trMA.Ode7C1H.mode	@ltx/en_us_dedes/tr.d068:trMA.Ode7C1H.mode
ltx/en_us_public/tr.d068:trMA.Ode7C1H.ode	@ltx/en_us_dedes/tr.d068:trMA.Ode7C1H.ode
ltx/en_us_public/tr.d068:trMA.Ode7C1H.text	@ltx/en_us_dedes/tr.d068:trMA.Ode7C1H.text
ltx/en_us_public/tr.d068:trMA.Ode7K.incipit	@ltx/en_us_dedes/tr.d068:trMA.Ode7K.incipit
ltx/en_us_public/tr.d068:trMA.Ode7K.melody	@ltx/en_us_dedes/tr.d068:trMA.Ode7K.melody
ltx/en_us_public/tr.d068:trMA.Ode7K.mode	@ltx/en_us_dedes/tr.d068:trMA.Ode7K.mode
ltx/en_us_public/tr.d068:trMA.Ode7K.ode	@ltx/en_us_dedes/tr.d068:trMA.Ode7K.ode
ltx/en_us_public/tr.d068:trMA.Ode7K.text	@ltx/en_us_dedes/tr.d068:trMA.Ode7K.text
ltx/en_us_public/tr.d068:trMA.Ode8C11.greekmelody	@ltx/en_us_dedes/tr.d068:trMA.Ode8C11.greekmelody
ltx/en_us_public/tr.d068:trMA.Ode8C11.incipit	@ltx/en_us_dedes/tr.d068:trMA.Ode8C11.incipit
ltx/en_us_public/tr.d068:trMA.Ode8C11.melody	@ltx/en_us_dedes/tr.d068:trMA.Ode8C11.melody
ltx/en_us_public/tr.d068:trMA.Ode8C11.mode	@ltx/en_us_dedes/tr.d068:trMA.Ode8C11.mode
ltx/en_us_public/tr.d068:trMA.Ode8C11.ode	@ltx/en_us_dedes/tr.d068:trMA.Ode8C11.ode
ltx/en_us_public/tr.d068:trMA.Ode8C11.text	@ltx/en_us_dedes/tr.d068:trMA.Ode8C11.text
ltx/en_us_public/tr.d068:trMA.Ode8C12.incipit	@ltx/en_us_dedes/tr.d068:trMA.Ode8C12.incipit
ltx/en_us_public/tr.d068:trMA.Ode8C12.melody	@ltx/en_us_dedes/tr.d068:trMA.Ode8C12.melody
ltx/en_us_public/tr.d068:trMA.Ode8C12.mode	@ltx/en_us_dedes/tr.d068:trMA.Ode8C12.mode
ltx/en_us_public/tr.d068:trMA.Ode8C12.ode	@ltx/en_us_dedes/tr.d068:trMA.Ode8C12.ode
ltx/en_us_public/tr.d068:trMA.Ode8C12.text	@ltx/en_us_dedes/tr.d068:trMA.Ode8C12.text
ltx/en_us_public/tr.d068:trMA.Ode8C13.incipit	@ltx/en_us_dedes/tr.d068:trMA.Ode8C13.incipit
ltx/en_us_public/tr.d068:trMA.Ode8C13.melody	@ltx/en_us_dedes/tr.d068:trMA.Ode8C13.melody
ltx/en_us_public/tr.d068:trMA.Ode8C13.mode	@ltx/en_us_dedes/tr.d068:trMA.Ode8C13.mode
ltx/en_us_public/tr.d068:trMA.Ode8C13.ode	@ltx/en_us_dedes/tr.d068:trMA.Ode8C13.ode
ltx/en_us_public/tr.d068:trMA.Ode8C13.text	@ltx/en_us_dedes/tr.d068:trMA.Ode8C13.text
ltx/en_us_public/tr.d068:trMA.Ode8C1H.greekmelody	@ltx/en_us_dedes/tr.d068:trMA.Ode8C1H.greekmelody
ltx/en_us_public/tr.d068:trMA.Ode8C1H.incipit	@ltx/en_us_dedes/tr.d068:trMA.Ode8C1H.incipit
ltx/en_us_public/tr.d068:trMA.Ode8C1H.melody	@ltx/en_us_dedes/tr.d068:trMA.Ode8C1H.melody
ltx/en_us_public/tr.d068:trMA.Ode8C1H.mode	@ltx/en_us_dedes/tr.d068:trMA.Ode8C1H.mode
ltx/en_us_public/tr.d068:trMA.Ode8C1H.ode	@ltx/en_us_dedes/tr.d068:trMA.Ode8C1H.ode
ltx/en_us_public/tr.d068:trMA.Ode8C1H.text	@ltx/en_us_dedes/tr.d068:trMA.Ode8C1H.text
ltx/en_us_public/tr.d068:trMA.Ode8K.incipit	@ltx/en_us_dedes/tr.d068:trMA.Ode8K.incipit
ltx/en_us_public/tr.d068:trMA.Ode8K.melody	@ltx/en_us_dedes/tr.d068:trMA.Ode8K.melody
ltx/en_us_public/tr.d068:trMA.Ode8K.mode	@ltx/en_us_dedes/tr.d068:trMA.Ode8K.mode
ltx/en_us_public/tr.d068:trMA.Ode8K.ode	@ltx/en_us_dedes/tr.d068:trMA.Ode8K.ode
ltx/en_us_public/tr.d068:trMA.Ode8K.text	@ltx/en_us_dedes/tr.d068:trMA.Ode8K.text
ltx/en_us_public/tr.d068:trMA.Ode9C11.greekmelody	@ltx/en_us_dedes/tr.d068:trMA.Ode9C11.greekmelody
ltx/en_us_public/tr.d068:trMA.Ode9C11.incipit	@ltx/en_us_dedes/tr.d068:trMA.Ode9C11.incipit
ltx/en_us_public/tr.d068:trMA.Ode9C11.melody	@ltx/en_us_dedes/tr.d068:trMA.Ode9C11.melody
ltx/en_us_public/tr.d068:trMA.Ode9C11.mode	@ltx/en_us_dedes/tr.d068:trMA.Ode9C11.mode
ltx/en_us_public/tr.d068:trMA.Ode9C11.ode	@ltx/en_us_dedes/tr.d068:trMA.Ode9C11.ode
ltx/en_us_public/tr.d068:trMA.Ode9C11.text	@ltx/en_us_dedes/tr.d068:trMA.Ode9C11.text
ltx/en_us_public/tr.d068:trMA.Ode9C12.incipit	@ltx/en_us_dedes/tr.d068:trMA.Ode9C12.incipit
ltx/en_us_public/tr.d068:trMA.Ode9C12.melody	@ltx/en_us_dedes/tr.d068:trMA.Ode9C12.melody
ltx/en_us_public/tr.d068:trMA.Ode9C12.mode	@ltx/en_us_dedes/tr.d068:trMA.Ode9C12.mode
ltx/en_us_public/tr.d068:trMA.Ode9C12.ode	@ltx/en_us_dedes/tr.d068:trMA.Ode9C12.ode
ltx/en_us_public/tr.d068:trMA.Ode9C12.text	@ltx/en_us_dedes/tr.d068:trMA.Ode9C12.text
ltx/en_us_public/tr.d068:trMA.Ode9C13.incipit	@ltx/en_us_dedes/tr.d068:trMA.Ode9C13.incipit
ltx/en_us_public/tr.d068:trMA.Ode9C13.melody	@ltx/en_us_dedes/tr.d068:trMA.Ode9C13.melody
ltx/en_us_public/tr.d068:trMA.Ode9C13.mode	@ltx/en_us_dedes/tr.d068:trMA.Ode9C13.mode
ltx/en_us_public/tr.d068:trMA.Ode9C13.ode	@ltx/en_us_dedes/tr.d068:trMA.Ode9C13.ode
ltx/en_us_public/tr.d068:trMA.Ode9C13.text	@ltx/en_us_dedes/tr.d068:trMA.Ode9C13.text
ltx/en_us_public/tr.d068:trMA.Ode9C1H.greekmelody	@ltx/en_us_dedes/tr.d068:trMA.Ode9C1H.greekmelody
ltx/en_us_public/tr.d068:trMA.Ode9C1H.incipit	@ltx/en_us_dedes/tr.d068:trMA.Ode9C1H.incipit
ltx/en_us_public/tr.d068:trMA.Ode9C1H.melody	@ltx/en_us_dedes/tr.d068:trMA.Ode9C1H.melody
ltx/en_us_public/tr.d068:trMA.Ode9C1H.mode	@ltx/en_us_dedes/tr.d068:trMA.Ode9C1H.mode
ltx/en_us_public/tr.d068:trMA.Ode9C1H.ode	@ltx/en_us_dedes/tr.d068:trMA.Ode9C1H.ode
ltx/en_us_public/tr.d068:trMA.Ode9C1H.text	@ltx/en_us_dedes/tr.d068:trMA.Ode9C1H.text
ltx/en_us_public/tr.d068:trMA.Ode9K.incipit	@ltx/en_us_dedes/tr.d068:trMA.Ode9K.incipit
ltx/en_us_public/tr.d068:trMA.Ode9K.melody	@ltx/en_us_dedes/tr.d068:trMA.Ode9K.melody
ltx/en_us_public/tr.d068:trMA.Ode9K.mode	@ltx/en_us_dedes/tr.d068:trMA.Ode9K.mode
ltx/en_us_public/tr.d068:trMA.Ode9K.ode	@ltx/en_us_dedes/tr.d068:trMA.Ode9K.ode
ltx/en_us_public/tr.d068:trMA.Ode9K.text	@ltx/en_us_dedes/tr.d068:trMA.Ode9K.text
ltx/en_us_public/tr.d068:trMA.Oikos1.text	@ltx/en_us_dedes/tr.d068:trMA.Oikos1.text
ltx/en_us_public/tr.d068:trMA.Troparion.incipit	@ltx/en_us_dedes/tr.d068:trMA.Troparion.incipit
ltx/en_us_public/tr.d068:trMA.Troparion.melody	@ltx/en_us_dedes/tr.d068:trMA.Troparion.melody
ltx/en_us_public/tr.d068:trMA.Troparion.mode	@ltx/en_us_dedes/tr.d068:trMA.Troparion.mode
ltx/en_us_public/tr.d068:trMA.Troparion.text	@ltx/en_us_dedes/tr.d068:trMA.Troparion.text
ltx/en_us_public/tr.d068:trSY.commemoration.couplet1.title	@ltx/en_us_dedes/tr.d068:trSY.commemoration.couplet1.title
ltx/en_us_public/tr.d068:trSY.commemoration.couplet1.verse1	@ltx/en_us_dedes/tr.d068:trSY.commemoration.couplet1.verse1
ltx/en_us_public/tr.d068:trSY.commemoration.couplet1.verse2	@ltx/en_us_dedes/tr.d068:trSY.commemoration.couplet1.verse2
ltx/en_us_public/tr.d068:trSY.commemoration.couplet2.title	@ltx/en_us_dedes/tr.d068:trSY.commemoration.couplet2.title
ltx/en_us_public/tr.d068:trSY.commemoration.couplet2.verse1	@ltx/en_us_dedes/tr.d068:trSY.commemoration.couplet2.verse1
ltx/en_us_public/tr.d068:trSY.commemoration.couplet2.verse2	@ltx/en_us_dedes/tr.d068:trSY.commemoration.couplet2.verse2
ltx/en_us_public/tr.d068:trSY.commemoration.couplet3.title	@ltx/en_us_dedes/tr.d068:trSY.commemoration.couplet3.title
ltx/en_us_public/tr.d068:trSY.commemoration.couplet3.verse1	@ltx/en_us_dedes/tr.d068:trSY.commemoration.couplet3.verse1
ltx/en_us_public/tr.d068:trSY.commemoration.couplet3.verse2	@ltx/en_us_dedes/tr.d068:trSY.commemoration.couplet3.verse2
ltx/en_us_public/tr.d068:trSY.commemoration.couplet3.verse3	@ltx/en_us_dedes/tr.d068:trSY.commemoration.couplet3.verse3
ltx/en_us_public/tr.d068:trSY.commemoration.couplet4.title	@ltx/en_us_dedes/tr.d068:trSY.commemoration.couplet4.title
ltx/en_us_public/tr.d068:trSY.commemoration.couplet4.verse1	@ltx/en_us_dedes/tr.d068:trSY.commemoration.couplet4.verse1
ltx/en_us_public/tr.d068:trSY.commemoration.couplet4.verse2	@ltx/en_us_dedes/tr.d068:trSY.commemoration.couplet4.verse2
ltx/en_us_public/tr.d068:trSY.commemoration.narration.p01	@ltx/en_us_dedes/tr.d068:trSY.commemoration.narration.p01
ltx/en_us_public/tr.d068:trSY.commemoration.narration.p02	@ltx/en_us_dedes/tr.d068:trSY.commemoration.narration.p02
ltx/en_us_public/tr.d068:trSY.commemoration.narration.p03	@ltx/en_us_dedes/tr.d068:trSY.commemoration.narration.p03
ltx/en_us_public/tr.d068:trSY.commemoration.narration.p04	@ltx/en_us_dedes/tr.d068:trSY.commemoration.narration.p04
ltx/en_us_public/tr.d068:trSY.commemoration.narration.p05	@ltx/en_us_dedes/tr.d068:trSY.commemoration.narration.p05
ltx/en_us_public/tr.d068:trSY.commemoration.narration.p06	@ltx/en_us_dedes/tr.d068:trSY.commemoration.narration.p06
ltx/en_us_public/tr.d068:trSY.commemoration.narration.p07	@ltx/en_us_dedes/tr.d068:trSY.commemoration.narration.p07
ltx/en_us_public/tr.d068:trSY.commemoration.text	@ltx/en_us_dedes/tr.d068:trSY.commemoration.text
ltx/en_us_public/tr.d068:trSY.lastline	@ltx/en_us_dedes/tr.d068:trSY.lastline
ltx/en_us_public/tr.d068:trTE.Troparion.incipit	@ltx/en_us_dedes/tr.d068:trTE.Troparion.incipit
ltx/en_us_public/tr.d068:trTE.Troparion.melody	@ltx/en_us_dedes/tr.d068:trTE.Troparion.melody
ltx/en_us_public/tr.d068:trTE.Troparion.mode	@ltx/en_us_dedes/tr.d068:trTE.Troparion.mode
ltx/en_us_public/tr.d068:trTE.Troparion.text	@ltx/en_us_dedes/tr.d068:trTE.Troparion.text
ltx/en_us_public/tr.d068:trVE.SticGlory.incipit	@ltx/en_us_dedes/tr.d068:trVE.SticGlory.incipit
ltx/en_us_public/tr.d068:trVE.SticGlory.melody	@ltx/en_us_dedes/tr.d068:trVE.SticGlory.melody
ltx/en_us_public/tr.d068:trVE.SticGlory.mode	@ltx/en_us_dedes/tr.d068:trVE.SticGlory.mode
ltx/en_us_public/tr.d068:trVE.SticGlory.text	@ltx/en_us_dedes/tr.d068:trVE.SticGlory.text
ltx/en_us_public/tr.d068:trVE.Stichera01.incipit	@ltx/en_us_dedes/tr.d068:trVE.Stichera01.incipit
ltx/en_us_public/tr.d068:trVE.Stichera01.melody	@ltx/en_us_dedes/tr.d068:trVE.Stichera01.melody
ltx/en_us_public/tr.d068:trVE.Stichera01.mode	@ltx/en_us_dedes/tr.d068:trVE.Stichera01.mode
ltx/en_us_public/tr.d068:trVE.Stichera01.text	@ltx/en_us_dedes/tr.d068:trVE.Stichera01.text
ltx/en_us_public/tr.d068:trVE.Stichera02.incipit	@ltx/en_us_dedes/tr.d068:trVE.Stichera02.incipit
ltx/en_us_public/tr.d068:trVE.Stichera02.melody	@ltx/en_us_dedes/tr.d068:trVE.Stichera02.melody
ltx/en_us_public/tr.d068:trVE.Stichera02.mode	@ltx/en_us_dedes/tr.d068:trVE.Stichera02.mode
ltx/en_us_public/tr.d068:trVE.Stichera02.text	@ltx/en_us_dedes/tr.d068:trVE.Stichera02.text
ltx/en_us_public/tr.d068:trVE.Stichera03.incipit	@ltx/en_us_dedes/tr.d068:trVE.Stichera03.incipit
ltx/en_us_public/tr.d068:trVE.Stichera03.melody	@ltx/en_us_dedes/tr.d068:trVE.Stichera03.melody
ltx/en_us_public/tr.d068:trVE.Stichera03.mode	@ltx/en_us_dedes/tr.d068:trVE.Stichera03.mode
ltx/en_us_public/tr.d068:trVE.Stichera03.text	@ltx/en_us_dedes/tr.d068:trVE.Stichera03.text
ltx/en_us_public/tr.d068:trVE.Stichera04.incipit	@ltx/en_us_dedes/tr.d068:trVE.Stichera04.incipit
ltx/en_us_public/tr.d068:trVE.Stichera04.melody	@ltx/en_us_dedes/tr.d068:trVE.Stichera04.melody
ltx/en_us_public/tr.d068:trVE.Stichera04.mode	@ltx/en_us_dedes/tr.d068:trVE.Stichera04.mode
ltx/en_us_public/tr.d068:trVE.Stichera04.text	@ltx/en_us_dedes/tr.d068:trVE.Stichera04.text
ltx/en_us_public/tr.d068:trVE.Stichera05.incipit	@ltx/en_us_dedes/tr.d068:trVE.Stichera05.incipit
ltx/en_us_public/tr.d068:trVE.Stichera05.melody	@ltx/en_us_dedes/tr.d068:trVE.Stichera05.melody
ltx/en_us_public/tr.d068:trVE.Stichera05.mode	@ltx/en_us_dedes/tr.d068:trVE.Stichera05.mode
ltx/en_us_public/tr.d068:trVE.Stichera05.text	@ltx/en_us_dedes/tr.d068:trVE.Stichera05.text
ltx/en_us_public/tr.d068:trVE.Stichera06.incipit	@ltx/en_us_dedes/tr.d068:trVE.Stichera06.incipit
ltx/en_us_public/tr.d068:trVE.Stichera06.melody	@ltx/en_us_dedes/tr.d068:trVE.Stichera06.melody
ltx/en_us_public/tr.d068:trVE.Stichera06.mode	@ltx/en_us_dedes/tr.d068:trVE.Stichera06.mode
ltx/en_us_public/tr.d068:trVE.Stichera06.text	@ltx/en_us_dedes/tr.d068:trVE.Stichera06.text
ltx/en_us_public/tr.d068:trVE.Stichera07.incipit	@ltx/en_us_dedes/tr.d068:trVE.Stichera07.incipit
ltx/en_us_public/tr.d068:trVE.Stichera07.melody	@ltx/en_us_dedes/tr.d068:trVE.Stichera07.melody
ltx/en_us_public/tr.d068:trVE.Stichera07.mode	@ltx/en_us_dedes/tr.d068:trVE.Stichera07.mode
ltx/en_us_public/tr.d068:trVE.Stichera07.text	@ltx/en_us_dedes/tr.d068:trVE.Stichera07.text
ltx/en_us_public/tr.d068:trVE.Stichera08.incipit	@ltx/en_us_dedes/tr.d068:trVE.Stichera08.incipit
ltx/en_us_public/tr.d068:trVE.Stichera08.melody	@ltx/en_us_dedes/tr.d068:trVE.Stichera08.melody
ltx/en_us_public/tr.d068:trVE.Stichera08.mode	@ltx/en_us_dedes/tr.d068:trVE.Stichera08.mode
ltx/en_us_public/tr.d068:trVE.Stichera08.text	@ltx/en_us_dedes/tr.d068:trVE.Stichera08.text
ltx/en_us_public/tr.d068:trVE.Stichera09.incipit	@ltx/en_us_dedes/tr.d068:trVE.Stichera09.incipit
ltx/en_us_public/tr.d068:trVE.Stichera09.melody	@ltx/en_us_dedes/tr.d068:trVE.Stichera09.melody
ltx/en_us_public/tr.d068:trVE.Stichera09.mode	@ltx/en_us_dedes/tr.d068:trVE.Stichera09.mode
ltx/en_us_public/tr.d068:trVE.Stichera09.text	@ltx/en_us_dedes/tr.d068:trVE.Stichera09.text
ltx/en_us_public/tr.d068:trVE.Stichera10.incipit	@ltx/en_us_dedes/tr.d068:trVE.Stichera10.incipit
ltx/en_us_public/tr.d068:trVE.Stichera10.melody	@ltx/en_us_dedes/tr.d068:trVE.Stichera10.melody
ltx/en_us_public/tr.d068:trVE.Stichera10.mode	@ltx/en_us_dedes/tr.d068:trVE.Stichera10.mode
ltx/en_us_public/tr.d068:trVE.Stichera10.text	@ltx/en_us_dedes/tr.d068:trVE.Stichera10.text
ltx/en_us_public/tr.d068:trVL.header	@ltx/en_us_dedes/tr.d068:trVL.header
