ltx/en_us_public/sy.m05.d16:syMA.commemoration01.couplet1.title	@ltx/en_us_dedes/sy.m05.d16:syMA.commemoration01.couplet1.title
ltx/en_us_public/sy.m05.d16:syMA.commemoration01.couplet1.verse1	@ltx/en_us_dedes/sy.m05.d16:syMA.commemoration01.couplet1.verse1
ltx/en_us_public/sy.m05.d16:syMA.commemoration01.couplet1.verse2	@ltx/en_us_dedes/sy.m05.d16:syMA.commemoration01.couplet1.verse2
ltx/en_us_public/sy.m05.d16:syMA.commemoration01.narration.p01	@ltx/en_us_dedes/sy.m05.d16:syMA.commemoration01.narration.p01
ltx/en_us_public/sy.m05.d16:syMA.commemoration01.single1	@ltx/en_us_dedes/sy.m05.d16:syMA.commemoration01.single1
ltx/en_us_public/sy.m05.d16:syMA.commemoration01.text	@ltx/en_us_dedes/sy.m05.d16:syMA.commemoration01.text
ltx/en_us_public/sy.m05.d16:syMA.commemoration02.couplet1.title	@ltx/en_us_dedes/sy.m05.d16:syMA.commemoration02.couplet1.title
ltx/en_us_public/sy.m05.d16:syMA.commemoration02.couplet1.verse1	@ltx/en_us_dedes/sy.m05.d16:syMA.commemoration02.couplet1.verse1
ltx/en_us_public/sy.m05.d16:syMA.commemoration02.couplet1.verse2	@ltx/en_us_dedes/sy.m05.d16:syMA.commemoration02.couplet1.verse2
ltx/en_us_public/sy.m05.d16:syMA.commemoration02.text	@ltx/en_us_dedes/sy.m05.d16:syMA.commemoration02.text
ltx/en_us_public/sy.m05.d16:syMA.commemoration03.couplet1.title	@ltx/en_us_dedes/sy.m05.d16:syMA.commemoration03.couplet1.title
ltx/en_us_public/sy.m05.d16:syMA.commemoration03.couplet1.verse1	@ltx/en_us_dedes/sy.m05.d16:syMA.commemoration03.couplet1.verse1
ltx/en_us_public/sy.m05.d16:syMA.commemoration03.couplet1.verse2	@ltx/en_us_dedes/sy.m05.d16:syMA.commemoration03.couplet1.verse2
ltx/en_us_public/sy.m05.d16:syMA.commemoration03.couplet2.title	@ltx/en_us_dedes/sy.m05.d16:syMA.commemoration03.couplet2.title
ltx/en_us_public/sy.m05.d16:syMA.commemoration03.couplet2.verse1	@ltx/en_us_dedes/sy.m05.d16:syMA.commemoration03.couplet2.verse1
ltx/en_us_public/sy.m05.d16:syMA.commemoration03.couplet2.verse2	@ltx/en_us_dedes/sy.m05.d16:syMA.commemoration03.couplet2.verse2
ltx/en_us_public/sy.m05.d16:syMA.commemoration03.couplet3.title	@ltx/en_us_dedes/sy.m05.d16:syMA.commemoration03.couplet3.title
ltx/en_us_public/sy.m05.d16:syMA.commemoration03.couplet3.verse1	@ltx/en_us_dedes/sy.m05.d16:syMA.commemoration03.couplet3.verse1
ltx/en_us_public/sy.m05.d16:syMA.commemoration03.couplet3.verse2	@ltx/en_us_dedes/sy.m05.d16:syMA.commemoration03.couplet3.verse2
ltx/en_us_public/sy.m05.d16:syMA.commemoration03.couplet4.title	@ltx/en_us_dedes/sy.m05.d16:syMA.commemoration03.couplet4.title
ltx/en_us_public/sy.m05.d16:syMA.commemoration03.couplet4.verse1	@ltx/en_us_dedes/sy.m05.d16:syMA.commemoration03.couplet4.verse1
ltx/en_us_public/sy.m05.d16:syMA.commemoration03.couplet4.verse2	@ltx/en_us_dedes/sy.m05.d16:syMA.commemoration03.couplet4.verse2
ltx/en_us_public/sy.m05.d16:syMA.commemoration03.couplet5.title	@ltx/en_us_dedes/sy.m05.d16:syMA.commemoration03.couplet5.title
ltx/en_us_public/sy.m05.d16:syMA.commemoration03.couplet5.verse1	@ltx/en_us_dedes/sy.m05.d16:syMA.commemoration03.couplet5.verse1
ltx/en_us_public/sy.m05.d16:syMA.commemoration03.couplet5.verse2	@ltx/en_us_dedes/sy.m05.d16:syMA.commemoration03.couplet5.verse2
ltx/en_us_public/sy.m05.d16:syMA.commemoration03.couplet6.title	@ltx/en_us_dedes/sy.m05.d16:syMA.commemoration03.couplet6.title
ltx/en_us_public/sy.m05.d16:syMA.commemoration03.couplet6.verse1	@ltx/en_us_dedes/sy.m05.d16:syMA.commemoration03.couplet6.verse1
ltx/en_us_public/sy.m05.d16:syMA.commemoration03.couplet6.verse2	@ltx/en_us_dedes/sy.m05.d16:syMA.commemoration03.couplet6.verse2
ltx/en_us_public/sy.m05.d16:syMA.commemoration03.text	@ltx/en_us_dedes/sy.m05.d16:syMA.commemoration03.text
ltx/en_us_public/sy.m05.d16:syMA.commemoration04.couplet1.title	@ltx/en_us_dedes/sy.m05.d16:syMA.commemoration04.couplet1.title
ltx/en_us_public/sy.m05.d16:syMA.commemoration04.couplet1.verse1	@ltx/en_us_dedes/sy.m05.d16:syMA.commemoration04.couplet1.verse1
ltx/en_us_public/sy.m05.d16:syMA.commemoration04.couplet1.verse2	@ltx/en_us_dedes/sy.m05.d16:syMA.commemoration04.couplet1.verse2
ltx/en_us_public/sy.m05.d16:syMA.commemoration04.text	@ltx/en_us_dedes/sy.m05.d16:syMA.commemoration04.text
ltx/en_us_public/sy.m05.d16:syMA.commemoration05.couplet1.title	@ltx/en_us_dedes/sy.m05.d16:syMA.commemoration05.couplet1.title
ltx/en_us_public/sy.m05.d16:syMA.commemoration05.couplet1.verse1	@ltx/en_us_dedes/sy.m05.d16:syMA.commemoration05.couplet1.verse1
ltx/en_us_public/sy.m05.d16:syMA.commemoration05.couplet1.verse2	@ltx/en_us_dedes/sy.m05.d16:syMA.commemoration05.couplet1.verse2
ltx/en_us_public/sy.m05.d16:syMA.commemoration05.text	@ltx/en_us_dedes/sy.m05.d16:syMA.commemoration05.text
ltx/en_us_public/sy.m05.d16:syMA.commemoration06.couplet1.title	@ltx/en_us_dedes/sy.m05.d16:syMA.commemoration06.couplet1.title
ltx/en_us_public/sy.m05.d16:syMA.commemoration06.couplet1.verse1	@ltx/en_us_dedes/sy.m05.d16:syMA.commemoration06.couplet1.verse1
ltx/en_us_public/sy.m05.d16:syMA.commemoration06.couplet1.verse2	@ltx/en_us_dedes/sy.m05.d16:syMA.commemoration06.couplet1.verse2
ltx/en_us_public/sy.m05.d16:syMA.commemoration06.text	@ltx/en_us_dedes/sy.m05.d16:syMA.commemoration06.text
ltx/en_us_public/sy.m05.d16:syMA.commemoration07.couplet1.title	@ltx/en_us_dedes/sy.m05.d16:syMA.commemoration07.couplet1.title
ltx/en_us_public/sy.m05.d16:syMA.commemoration07.couplet1.verse1	@ltx/en_us_dedes/sy.m05.d16:syMA.commemoration07.couplet1.verse1
ltx/en_us_public/sy.m05.d16:syMA.commemoration07.couplet1.verse2	@ltx/en_us_dedes/sy.m05.d16:syMA.commemoration07.couplet1.verse2
ltx/en_us_public/sy.m05.d16:syMA.commemoration07.text	@ltx/en_us_dedes/sy.m05.d16:syMA.commemoration07.text
ltx/en_us_public/sy.m05.d16:syMA.commemoration08.couplet1.title	@ltx/en_us_dedes/sy.m05.d16:syMA.commemoration08.couplet1.title
ltx/en_us_public/sy.m05.d16:syMA.commemoration08.couplet1.verse1	@ltx/en_us_dedes/sy.m05.d16:syMA.commemoration08.couplet1.verse1
ltx/en_us_public/sy.m05.d16:syMA.commemoration08.couplet1.verse2	@ltx/en_us_dedes/sy.m05.d16:syMA.commemoration08.couplet1.verse2
ltx/en_us_public/sy.m05.d16:syMA.commemoration08.text	@ltx/en_us_dedes/sy.m05.d16:syMA.commemoration08.text
ltx/en_us_public/sy.m05.d16:syMA.commemoration09.text	@ltx/en_us_dedes/sy.m05.d16:syMA.commemoration09.text
ltx/en_us_public/sy.m05.d16:syMA.commemoration10.couplet1.title	@ltx/en_us_dedes/sy.m05.d16:syMA.commemoration10.couplet1.title
ltx/en_us_public/sy.m05.d16:syMA.commemoration10.couplet1.verse1	@ltx/en_us_dedes/sy.m05.d16:syMA.commemoration10.couplet1.verse1
ltx/en_us_public/sy.m05.d16:syMA.commemoration10.couplet1.verse2	@ltx/en_us_dedes/sy.m05.d16:syMA.commemoration10.couplet1.verse2
ltx/en_us_public/sy.m05.d16:syMA.commemoration10.text	@ltx/en_us_dedes/sy.m05.d16:syMA.commemoration10.text
ltx/en_us_public/sy.m05.d16:syMA.lastline	@ltx/en_us_dedes/sy.m05.d16:syMA.lastline
