ltx/en_us_public/tr.d057:trCO.header	@ltx/en_us_dedes/tr.d057:trCO.header
ltx/en_us_public/tr.d057:trDA.commemoration.full	@ltx/en_us_dedes/tr.d057:trDA.commemoration.full
ltx/en_us_public/tr.d057:trDA.commemoration.short	@ltx/en_us_dedes/tr.d057:trDA.commemoration.short
ltx/en_us_public/tr.d057:trDA.dismissal	@ltx/en_us_dedes/tr.d057:trDA.dismissal
ltx/en_us_public/tr.d057:trDA.insert1	@ltx/en_us_dedes/tr.d057:trDA.insert1
ltx/en_us_public/tr.d057:trDA.insert2	@ltx/en_us_dedes/tr.d057:trDA.insert2
ltx/en_us_public/tr.d057:trDA.note	@ltx/en_us_dedes/tr.d057:trDA.note
ltx/en_us_public/tr.d057:trDA.title	@ltx/en_us_dedes/tr.d057:trDA.title
ltx/en_us_public/tr.d057:trHO.commemorations	@ltx/en_us_dedes/tr.d057:trHO.commemorations
ltx/en_us_public/tr.d057:trHO.daytitle	@ltx/en_us_dedes/tr.d057:trHO.daytitle
ltx/en_us_public/tr.d057:trHO.description1	@ltx/en_us_dedes/tr.d057:trHO.description1
ltx/en_us_public/tr.d057:trHO.description2	@ltx/en_us_dedes/tr.d057:trHO.description2
ltx/en_us_public/tr.d057:trHO.note1	@ltx/en_us_dedes/tr.d057:trHO.note1
ltx/en_us_public/tr.d057:trHO.note2	@ltx/en_us_dedes/tr.d057:trHO.note2
ltx/en_us_public/tr.d057:trLI.Megalynarion.text	@ltx/en_us_goadedes/tr.d057:trLI.Megalynarion.text
ltx/en_us_public/tr.d057:trMA.C1.title	@ltx/en_us_dedes/tr.d057:trMA.C1.title
ltx/en_us_public/tr.d057:trMA.C1.verse	@ltx/en_us_dedes/tr.d057:trMA.C1.verse
ltx/en_us_public/tr.d057:trMA.C2.notice1	@ltx/en_us_goadedes/tr.d057:trMA.C2.notice1
ltx/en_us_public/tr.d057:trMA.C2.title	@ltx/en_us_dedes/tr.d057:trMA.C2.title
ltx/en_us_public/tr.d057:trMA.C2.verse	@ltx/en_us_dedes/tr.d057:trMA.C2.verse
ltx/en_us_public/tr.d057:trMA.ExapTheotokion.greekmelody	@ltx/en_us_dedes/tr.d057:trMA.ExapTheotokion.greekmelody
ltx/en_us_public/tr.d057:trMA.ExapTheotokion.incipit	@ltx/en_us_dedes/tr.d057:trMA.ExapTheotokion.incipit
ltx/en_us_public/tr.d057:trMA.ExapTheotokion.melody	@ltx/en_us_dedes/tr.d057:trMA.ExapTheotokion.melody
ltx/en_us_public/tr.d057:trMA.ExapTheotokion.mode	@ltx/en_us_dedes/tr.d057:trMA.ExapTheotokion.mode
ltx/en_us_public/tr.d057:trMA.ExapTheotokion.text	@ltx/en_us_dedes/tr.d057:trMA.ExapTheotokion.text
ltx/en_us_public/tr.d057:trMA.Exaposteilarion1.greekmelody	@ltx/en_us_dedes/tr.d057:trMA.Exaposteilarion1.greekmelody
ltx/en_us_public/tr.d057:trMA.Exaposteilarion1.incipit	@ltx/en_us_dedes/tr.d057:trMA.Exaposteilarion1.incipit
ltx/en_us_public/tr.d057:trMA.Exaposteilarion1.melody	@ltx/en_us_dedes/tr.d057:trMA.Exaposteilarion1.melody
ltx/en_us_public/tr.d057:trMA.Exaposteilarion1.mode	@ltx/en_us_dedes/tr.d057:trMA.Exaposteilarion1.mode
ltx/en_us_public/tr.d057:trMA.Exaposteilarion1.text	@ltx/en_us_dedes/tr.d057:trMA.Exaposteilarion1.text
ltx/en_us_public/tr.d057:trMA.Kontakion1.incipit	@ltx/en_us_dedes/tr.d057:trMA.Kontakion1.incipit
ltx/en_us_public/tr.d057:trMA.Kontakion1.melody	@ltx/en_us_dedes/tr.d057:trMA.Kontakion1.melody
ltx/en_us_public/tr.d057:trMA.Kontakion1.mode	@ltx/en_us_dedes/tr.d057:trMA.Kontakion1.mode
ltx/en_us_public/tr.d057:trMA.Kontakion1.text	@ltx/en_us_dedes/tr.d057:trMA.Kontakion1.text
ltx/en_us_public/tr.d057:trMA.Lauds1.greekmelody	@ltx/en_us_dedes/tr.d057:trMA.Lauds1.greekmelody
ltx/en_us_public/tr.d057:trMA.Lauds1.incipit	@ltx/en_us_dedes/tr.d057:trMA.Lauds1.incipit
ltx/en_us_public/tr.d057:trMA.Lauds1.melody	@ltx/en_us_dedes/tr.d057:trMA.Lauds1.melody
ltx/en_us_public/tr.d057:trMA.Lauds1.mode	@ltx/en_us_dedes/tr.d057:trMA.Lauds1.mode
ltx/en_us_public/tr.d057:trMA.Lauds1.text	@ltx/en_us_dedes/tr.d057:trMA.Lauds1.text
ltx/en_us_public/tr.d057:trMA.Lauds2.incipit	@ltx/en_us_dedes/tr.d057:trMA.Lauds2.incipit
ltx/en_us_public/tr.d057:trMA.Lauds2.melody	@ltx/en_us_dedes/tr.d057:trMA.Lauds2.melody
ltx/en_us_public/tr.d057:trMA.Lauds2.mode	@ltx/en_us_dedes/tr.d057:trMA.Lauds2.mode
ltx/en_us_public/tr.d057:trMA.Lauds2.text	@ltx/en_us_dedes/tr.d057:trMA.Lauds2.text
ltx/en_us_public/tr.d057:trMA.Lauds3.incipit	@ltx/en_us_dedes/tr.d057:trMA.Lauds3.incipit
ltx/en_us_public/tr.d057:trMA.Lauds3.melody	@ltx/en_us_dedes/tr.d057:trMA.Lauds3.melody
ltx/en_us_public/tr.d057:trMA.Lauds3.mode	@ltx/en_us_dedes/tr.d057:trMA.Lauds3.mode
ltx/en_us_public/tr.d057:trMA.Lauds3.text	@ltx/en_us_dedes/tr.d057:trMA.Lauds3.text
ltx/en_us_public/tr.d057:trMA.LaudsGlory.incipit	@ltx/en_us_dedes/tr.d057:trMA.LaudsGlory.incipit
ltx/en_us_public/tr.d057:trMA.LaudsGlory.melody	@ltx/en_us_dedes/tr.d057:trMA.LaudsGlory.melody
ltx/en_us_public/tr.d057:trMA.LaudsGlory.mode	@ltx/en_us_dedes/tr.d057:trMA.LaudsGlory.mode
ltx/en_us_public/tr.d057:trMA.LaudsGlory.text	@ltx/en_us_dedes/tr.d057:trMA.LaudsGlory.text
ltx/en_us_public/tr.d057:trMA.Ode1C11.greekmelody	@ltx/en_us_dedes/tr.d057:trMA.Ode1C11.greekmelody
ltx/en_us_public/tr.d057:trMA.Ode1C11.incipit	@ltx/en_us_oca/tr.d057:trMA.Ode1C11.incipit
ltx/en_us_public/tr.d057:trMA.Ode1C11.melody	@ltx/en_us_oca/tr.d057:trMA.Ode1C11.melody
ltx/en_us_public/tr.d057:trMA.Ode1C11.mode	@ltx/en_us_dedes/tr.d057:trMA.Ode1C11.mode
ltx/en_us_public/tr.d057:trMA.Ode1C11.ode	@ltx/en_us_dedes/tr.d057:trMA.Ode1C11.ode
ltx/en_us_public/tr.d057:trMA.Ode1C11.text	@ltx/en_us_oca/tr.d057:trMA.Ode1C11.text
ltx/en_us_public/tr.d057:trMA.Ode1C12.incipit	@ltx/en_us_oca/tr.d057:trMA.Ode1C12.incipit
ltx/en_us_public/tr.d057:trMA.Ode1C12.melody	@ltx/en_us_oca/tr.d057:trMA.Ode1C12.melody
ltx/en_us_public/tr.d057:trMA.Ode1C12.mode	@ltx/en_us_dedes/tr.d057:trMA.Ode1C12.mode
ltx/en_us_public/tr.d057:trMA.Ode1C12.ode	@ltx/en_us_dedes/tr.d057:trMA.Ode1C12.ode
ltx/en_us_public/tr.d057:trMA.Ode1C12.text	@ltx/en_us_oca/tr.d057:trMA.Ode1C12.text
ltx/en_us_public/tr.d057:trMA.Ode1C13.incipit	@ltx/en_us_oca/tr.d057:trMA.Ode1C13.incipit
ltx/en_us_public/tr.d057:trMA.Ode1C13.melody	@ltx/en_us_oca/tr.d057:trMA.Ode1C13.melody
ltx/en_us_public/tr.d057:trMA.Ode1C13.mode	@ltx/en_us_dedes/tr.d057:trMA.Ode1C13.mode
ltx/en_us_public/tr.d057:trMA.Ode1C13.ode	@ltx/en_us_dedes/tr.d057:trMA.Ode1C13.ode
ltx/en_us_public/tr.d057:trMA.Ode1C13.text	@ltx/en_us_oca/tr.d057:trMA.Ode1C13.text
ltx/en_us_public/tr.d057:trMA.Ode1C1T.incipit	@ltx/en_us_oca/tr.d057:trMA.Ode1C1T.incipit
ltx/en_us_public/tr.d057:trMA.Ode1C1T.melody	@ltx/en_us_oca/tr.d057:trMA.Ode1C1T.melody
ltx/en_us_public/tr.d057:trMA.Ode1C1T.mode	@ltx/en_us_dedes/tr.d057:trMA.Ode1C1T.mode
ltx/en_us_public/tr.d057:trMA.Ode1C1T.ode	@ltx/en_us_dedes/tr.d057:trMA.Ode1C1T.ode
ltx/en_us_public/tr.d057:trMA.Ode1C1T.text	@ltx/en_us_oca/tr.d057:trMA.Ode1C1T.text
ltx/en_us_public/tr.d057:trMA.Ode1C21.greekmelody	@ltx/en_us_dedes/tr.d057:trMA.Ode1C21.greekmelody
ltx/en_us_public/tr.d057:trMA.Ode1C21.incipit	@ltx/en_us_oca/tr.d057:trMA.Ode1C21.incipit
ltx/en_us_public/tr.d057:trMA.Ode1C21.melody	@ltx/en_us_oca/tr.d057:trMA.Ode1C21.melody
ltx/en_us_public/tr.d057:trMA.Ode1C21.mode	@ltx/en_us_dedes/tr.d057:trMA.Ode1C21.mode
ltx/en_us_public/tr.d057:trMA.Ode1C21.ode	@ltx/en_us_dedes/tr.d057:trMA.Ode1C21.ode
ltx/en_us_public/tr.d057:trMA.Ode1C21.text	@ltx/en_us_oca/tr.d057:trMA.Ode1C21.text
ltx/en_us_public/tr.d057:trMA.Ode1C22.incipit	@ltx/en_us_oca/tr.d057:trMA.Ode1C22.incipit
ltx/en_us_public/tr.d057:trMA.Ode1C22.melody	@ltx/en_us_oca/tr.d057:trMA.Ode1C22.melody
ltx/en_us_public/tr.d057:trMA.Ode1C22.mode	@ltx/en_us_dedes/tr.d057:trMA.Ode1C22.mode
ltx/en_us_public/tr.d057:trMA.Ode1C22.ode	@ltx/en_us_dedes/tr.d057:trMA.Ode1C22.ode
ltx/en_us_public/tr.d057:trMA.Ode1C22.text	@ltx/en_us_oca/tr.d057:trMA.Ode1C22.text
ltx/en_us_public/tr.d057:trMA.Ode1C23.incipit	@ltx/en_us_oca/tr.d057:trMA.Ode1C23.incipit
ltx/en_us_public/tr.d057:trMA.Ode1C23.melody	@ltx/en_us_oca/tr.d057:trMA.Ode1C23.melody
ltx/en_us_public/tr.d057:trMA.Ode1C23.mode	@ltx/en_us_dedes/tr.d057:trMA.Ode1C23.mode
ltx/en_us_public/tr.d057:trMA.Ode1C23.ode	@ltx/en_us_dedes/tr.d057:trMA.Ode1C23.ode
ltx/en_us_public/tr.d057:trMA.Ode1C23.text	@ltx/en_us_oca/tr.d057:trMA.Ode1C23.text
ltx/en_us_public/tr.d057:trMA.Ode1C2T.incipit	@ltx/en_us_oca/tr.d057:trMA.Ode1C2T.incipit
ltx/en_us_public/tr.d057:trMA.Ode1C2T.melody	@ltx/en_us_oca/tr.d057:trMA.Ode1C2T.melody
ltx/en_us_public/tr.d057:trMA.Ode1C2T.mode	@ltx/en_us_dedes/tr.d057:trMA.Ode1C2T.mode
ltx/en_us_public/tr.d057:trMA.Ode1C2T.ode	@ltx/en_us_dedes/tr.d057:trMA.Ode1C2T.ode
ltx/en_us_public/tr.d057:trMA.Ode1C2T.text	@ltx/en_us_oca/tr.d057:trMA.Ode1C2T.text
ltx/en_us_public/tr.d057:trMA.Ode3C11.greekmelody	@ltx/en_us_dedes/tr.d057:trMA.Ode3C11.greekmelody
ltx/en_us_public/tr.d057:trMA.Ode3C11.incipit	@ltx/en_us_oca/tr.d057:trMA.Ode3C11.incipit
ltx/en_us_public/tr.d057:trMA.Ode3C11.melody	@ltx/en_us_oca/tr.d057:trMA.Ode3C11.melody
ltx/en_us_public/tr.d057:trMA.Ode3C11.mode	@ltx/en_us_dedes/tr.d057:trMA.Ode3C11.mode
ltx/en_us_public/tr.d057:trMA.Ode3C11.ode	@ltx/en_us_dedes/tr.d057:trMA.Ode3C11.ode
ltx/en_us_public/tr.d057:trMA.Ode3C11.text	@ltx/en_us_oca/tr.d057:trMA.Ode3C11.text
ltx/en_us_public/tr.d057:trMA.Ode3C12.incipit	@ltx/en_us_oca/tr.d057:trMA.Ode3C12.incipit
ltx/en_us_public/tr.d057:trMA.Ode3C12.melody	@ltx/en_us_oca/tr.d057:trMA.Ode3C12.melody
ltx/en_us_public/tr.d057:trMA.Ode3C12.mode	@ltx/en_us_dedes/tr.d057:trMA.Ode3C12.mode
ltx/en_us_public/tr.d057:trMA.Ode3C12.ode	@ltx/en_us_dedes/tr.d057:trMA.Ode3C12.ode
ltx/en_us_public/tr.d057:trMA.Ode3C12.text	@ltx/en_us_oca/tr.d057:trMA.Ode3C12.text
ltx/en_us_public/tr.d057:trMA.Ode3C13.incipit	@ltx/en_us_oca/tr.d057:trMA.Ode3C13.incipit
ltx/en_us_public/tr.d057:trMA.Ode3C13.melody	@ltx/en_us_oca/tr.d057:trMA.Ode3C13.melody
ltx/en_us_public/tr.d057:trMA.Ode3C13.mode	@ltx/en_us_dedes/tr.d057:trMA.Ode3C13.mode
ltx/en_us_public/tr.d057:trMA.Ode3C13.ode	@ltx/en_us_dedes/tr.d057:trMA.Ode3C13.ode
ltx/en_us_public/tr.d057:trMA.Ode3C13.text	@ltx/en_us_oca/tr.d057:trMA.Ode3C13.text
ltx/en_us_public/tr.d057:trMA.Ode3C1T.incipit	@ltx/en_us_oca/tr.d057:trMA.Ode3C1T.incipit
ltx/en_us_public/tr.d057:trMA.Ode3C1T.melody	@ltx/en_us_oca/tr.d057:trMA.Ode3C1T.melody
ltx/en_us_public/tr.d057:trMA.Ode3C1T.mode	@ltx/en_us_dedes/tr.d057:trMA.Ode3C1T.mode
ltx/en_us_public/tr.d057:trMA.Ode3C1T.ode	@ltx/en_us_dedes/tr.d057:trMA.Ode3C1T.ode
ltx/en_us_public/tr.d057:trMA.Ode3C1T.text	@ltx/en_us_oca/tr.d057:trMA.Ode3C1T.text
ltx/en_us_public/tr.d057:trMA.Ode3C21.greekmelody	@ltx/en_us_dedes/tr.d057:trMA.Ode3C21.greekmelody
ltx/en_us_public/tr.d057:trMA.Ode3C21.incipit	@ltx/en_us_oca/tr.d057:trMA.Ode3C21.incipit
ltx/en_us_public/tr.d057:trMA.Ode3C21.melody	@ltx/en_us_oca/tr.d057:trMA.Ode3C21.melody
ltx/en_us_public/tr.d057:trMA.Ode3C21.mode	@ltx/en_us_dedes/tr.d057:trMA.Ode3C21.mode
ltx/en_us_public/tr.d057:trMA.Ode3C21.ode	@ltx/en_us_dedes/tr.d057:trMA.Ode3C21.ode
ltx/en_us_public/tr.d057:trMA.Ode3C21.text	@ltx/en_us_oca/tr.d057:trMA.Ode3C21.text
ltx/en_us_public/tr.d057:trMA.Ode3C22.incipit	@ltx/en_us_oca/tr.d057:trMA.Ode3C22.incipit
ltx/en_us_public/tr.d057:trMA.Ode3C22.melody	@ltx/en_us_oca/tr.d057:trMA.Ode3C22.melody
ltx/en_us_public/tr.d057:trMA.Ode3C22.mode	@ltx/en_us_dedes/tr.d057:trMA.Ode3C22.mode
ltx/en_us_public/tr.d057:trMA.Ode3C22.ode	@ltx/en_us_dedes/tr.d057:trMA.Ode3C22.ode
ltx/en_us_public/tr.d057:trMA.Ode3C22.text	@ltx/en_us_oca/tr.d057:trMA.Ode3C22.text
ltx/en_us_public/tr.d057:trMA.Ode3C23.incipit	@ltx/en_us_oca/tr.d057:trMA.Ode3C23.incipit
ltx/en_us_public/tr.d057:trMA.Ode3C23.melody	@ltx/en_us_oca/tr.d057:trMA.Ode3C23.melody
ltx/en_us_public/tr.d057:trMA.Ode3C23.mode	@ltx/en_us_dedes/tr.d057:trMA.Ode3C23.mode
ltx/en_us_public/tr.d057:trMA.Ode3C23.ode	@ltx/en_us_dedes/tr.d057:trMA.Ode3C23.ode
ltx/en_us_public/tr.d057:trMA.Ode3C23.text	@ltx/en_us_oca/tr.d057:trMA.Ode3C23.text
ltx/en_us_public/tr.d057:trMA.Ode3C2T.incipit	@ltx/en_us_oca/tr.d057:trMA.Ode3C2T.incipit
ltx/en_us_public/tr.d057:trMA.Ode3C2T.melody	@ltx/en_us_oca/tr.d057:trMA.Ode3C2T.melody
ltx/en_us_public/tr.d057:trMA.Ode3C2T.mode	@ltx/en_us_dedes/tr.d057:trMA.Ode3C2T.mode
ltx/en_us_public/tr.d057:trMA.Ode3C2T.ode	@ltx/en_us_dedes/tr.d057:trMA.Ode3C2T.ode
ltx/en_us_public/tr.d057:trMA.Ode3C2T.text	@ltx/en_us_oca/tr.d057:trMA.Ode3C2T.text
ltx/en_us_public/tr.d057:trMA.Ode3Kathisma1.greekmelody	@ltx/en_us_dedes/tr.d057:trMA.Ode3Kathisma1.greekmelody
ltx/en_us_public/tr.d057:trMA.Ode3Kathisma1.incipit	@ltx/en_us_oca/tr.d057:trMA.Ode3Kathisma1.incipit
ltx/en_us_public/tr.d057:trMA.Ode3Kathisma1.melody	@ltx/en_us_oca/tr.d057:trMA.Ode3Kathisma1.melody
ltx/en_us_public/tr.d057:trMA.Ode3Kathisma1.mode	@ltx/en_us_dedes/tr.d057:trMA.Ode3Kathisma1.mode
ltx/en_us_public/tr.d057:trMA.Ode3Kathisma1.text	@ltx/en_us_oca/tr.d057:trMA.Ode3Kathisma1.text
ltx/en_us_public/tr.d057:trMA.Ode3Kathisma2.greekmelody	@ltx/en_us_dedes/tr.d057:trMA.Ode3Kathisma2.greekmelody
ltx/en_us_public/tr.d057:trMA.Ode3Kathisma2.incipit	@ltx/en_us_oca/tr.d057:trMA.Ode3Kathisma2.incipit
ltx/en_us_public/tr.d057:trMA.Ode3Kathisma2.melody	@ltx/en_us_oca/tr.d057:trMA.Ode3Kathisma2.melody
ltx/en_us_public/tr.d057:trMA.Ode3Kathisma2.mode	@ltx/en_us_dedes/tr.d057:trMA.Ode3Kathisma2.mode
ltx/en_us_public/tr.d057:trMA.Ode3Kathisma2.text	@ltx/en_us_oca/tr.d057:trMA.Ode3Kathisma2.text
ltx/en_us_public/tr.d057:trMA.Ode4C11.greekmelody	@ltx/en_us_dedes/tr.d057:trMA.Ode4C11.greekmelody
ltx/en_us_public/tr.d057:trMA.Ode4C11.incipit	@ltx/en_us_oca/tr.d057:trMA.Ode4C11.incipit
ltx/en_us_public/tr.d057:trMA.Ode4C11.melody	@ltx/en_us_oca/tr.d057:trMA.Ode4C11.melody
ltx/en_us_public/tr.d057:trMA.Ode4C11.mode	@ltx/en_us_dedes/tr.d057:trMA.Ode4C11.mode
ltx/en_us_public/tr.d057:trMA.Ode4C11.ode	@ltx/en_us_dedes/tr.d057:trMA.Ode4C11.ode
ltx/en_us_public/tr.d057:trMA.Ode4C11.text	@ltx/en_us_oca/tr.d057:trMA.Ode4C11.text
ltx/en_us_public/tr.d057:trMA.Ode4C12.incipit	@ltx/en_us_oca/tr.d057:trMA.Ode4C12.incipit
ltx/en_us_public/tr.d057:trMA.Ode4C12.melody	@ltx/en_us_oca/tr.d057:trMA.Ode4C12.melody
ltx/en_us_public/tr.d057:trMA.Ode4C12.mode	@ltx/en_us_dedes/tr.d057:trMA.Ode4C12.mode
ltx/en_us_public/tr.d057:trMA.Ode4C12.ode	@ltx/en_us_dedes/tr.d057:trMA.Ode4C12.ode
ltx/en_us_public/tr.d057:trMA.Ode4C12.text	@ltx/en_us_oca/tr.d057:trMA.Ode4C12.text
ltx/en_us_public/tr.d057:trMA.Ode4C13.incipit	@ltx/en_us_oca/tr.d057:trMA.Ode4C13.incipit
ltx/en_us_public/tr.d057:trMA.Ode4C13.melody	@ltx/en_us_oca/tr.d057:trMA.Ode4C13.melody
ltx/en_us_public/tr.d057:trMA.Ode4C13.mode	@ltx/en_us_dedes/tr.d057:trMA.Ode4C13.mode
ltx/en_us_public/tr.d057:trMA.Ode4C13.ode	@ltx/en_us_dedes/tr.d057:trMA.Ode4C13.ode
ltx/en_us_public/tr.d057:trMA.Ode4C13.text	@ltx/en_us_oca/tr.d057:trMA.Ode4C13.text
ltx/en_us_public/tr.d057:trMA.Ode4C1T.incipit	@ltx/en_us_oca/tr.d057:trMA.Ode4C1T.incipit
ltx/en_us_public/tr.d057:trMA.Ode4C1T.melody	@ltx/en_us_oca/tr.d057:trMA.Ode4C1T.melody
ltx/en_us_public/tr.d057:trMA.Ode4C1T.mode	@ltx/en_us_dedes/tr.d057:trMA.Ode4C1T.mode
ltx/en_us_public/tr.d057:trMA.Ode4C1T.ode	@ltx/en_us_dedes/tr.d057:trMA.Ode4C1T.ode
ltx/en_us_public/tr.d057:trMA.Ode4C1T.text	@ltx/en_us_oca/tr.d057:trMA.Ode4C1T.text
ltx/en_us_public/tr.d057:trMA.Ode4C21.greekmelody	@ltx/en_us_dedes/tr.d057:trMA.Ode4C21.greekmelody
ltx/en_us_public/tr.d057:trMA.Ode4C21.incipit	@ltx/en_us_oca/tr.d057:trMA.Ode4C21.incipit
ltx/en_us_public/tr.d057:trMA.Ode4C21.melody	@ltx/en_us_oca/tr.d057:trMA.Ode4C21.melody
ltx/en_us_public/tr.d057:trMA.Ode4C21.mode	@ltx/en_us_dedes/tr.d057:trMA.Ode4C21.mode
ltx/en_us_public/tr.d057:trMA.Ode4C21.ode	@ltx/en_us_dedes/tr.d057:trMA.Ode4C21.ode
ltx/en_us_public/tr.d057:trMA.Ode4C21.text	@ltx/en_us_oca/tr.d057:trMA.Ode4C21.text
ltx/en_us_public/tr.d057:trMA.Ode4C22.incipit	@ltx/en_us_oca/tr.d057:trMA.Ode4C22.incipit
ltx/en_us_public/tr.d057:trMA.Ode4C22.melody	@ltx/en_us_oca/tr.d057:trMA.Ode4C22.melody
ltx/en_us_public/tr.d057:trMA.Ode4C22.mode	@ltx/en_us_dedes/tr.d057:trMA.Ode4C22.mode
ltx/en_us_public/tr.d057:trMA.Ode4C22.ode	@ltx/en_us_dedes/tr.d057:trMA.Ode4C22.ode
ltx/en_us_public/tr.d057:trMA.Ode4C22.text	@ltx/en_us_oca/tr.d057:trMA.Ode4C22.text
ltx/en_us_public/tr.d057:trMA.Ode4C23.incipit	@ltx/en_us_oca/tr.d057:trMA.Ode4C23.incipit
ltx/en_us_public/tr.d057:trMA.Ode4C23.melody	@ltx/en_us_oca/tr.d057:trMA.Ode4C23.melody
ltx/en_us_public/tr.d057:trMA.Ode4C23.mode	@ltx/en_us_dedes/tr.d057:trMA.Ode4C23.mode
ltx/en_us_public/tr.d057:trMA.Ode4C23.ode	@ltx/en_us_dedes/tr.d057:trMA.Ode4C23.ode
ltx/en_us_public/tr.d057:trMA.Ode4C23.text	@ltx/en_us_oca/tr.d057:trMA.Ode4C23.text
ltx/en_us_public/tr.d057:trMA.Ode4C2T.incipit	@ltx/en_us_oca/tr.d057:trMA.Ode4C2T.incipit
ltx/en_us_public/tr.d057:trMA.Ode4C2T.melody	@ltx/en_us_oca/tr.d057:trMA.Ode4C2T.melody
ltx/en_us_public/tr.d057:trMA.Ode4C2T.mode	@ltx/en_us_dedes/tr.d057:trMA.Ode4C2T.mode
ltx/en_us_public/tr.d057:trMA.Ode4C2T.ode	@ltx/en_us_dedes/tr.d057:trMA.Ode4C2T.ode
ltx/en_us_public/tr.d057:trMA.Ode4C2T.text	@ltx/en_us_oca/tr.d057:trMA.Ode4C2T.text
ltx/en_us_public/tr.d057:trMA.Ode5C11.greekmelody	@ltx/en_us_dedes/tr.d057:trMA.Ode5C11.greekmelody
ltx/en_us_public/tr.d057:trMA.Ode5C11.incipit	@ltx/en_us_oca/tr.d057:trMA.Ode5C11.incipit
ltx/en_us_public/tr.d057:trMA.Ode5C11.melody	@ltx/en_us_oca/tr.d057:trMA.Ode5C11.melody
ltx/en_us_public/tr.d057:trMA.Ode5C11.mode	@ltx/en_us_dedes/tr.d057:trMA.Ode5C11.mode
ltx/en_us_public/tr.d057:trMA.Ode5C11.ode	@ltx/en_us_dedes/tr.d057:trMA.Ode5C11.ode
ltx/en_us_public/tr.d057:trMA.Ode5C11.text	@ltx/en_us_oca/tr.d057:trMA.Ode5C11.text
ltx/en_us_public/tr.d057:trMA.Ode5C12.incipit	@ltx/en_us_oca/tr.d057:trMA.Ode5C12.incipit
ltx/en_us_public/tr.d057:trMA.Ode5C12.melody	@ltx/en_us_oca/tr.d057:trMA.Ode5C12.melody
ltx/en_us_public/tr.d057:trMA.Ode5C12.mode	@ltx/en_us_dedes/tr.d057:trMA.Ode5C12.mode
ltx/en_us_public/tr.d057:trMA.Ode5C12.ode	@ltx/en_us_dedes/tr.d057:trMA.Ode5C12.ode
ltx/en_us_public/tr.d057:trMA.Ode5C12.text	@ltx/en_us_oca/tr.d057:trMA.Ode5C12.text
ltx/en_us_public/tr.d057:trMA.Ode5C13.incipit	@ltx/en_us_oca/tr.d057:trMA.Ode5C13.incipit
ltx/en_us_public/tr.d057:trMA.Ode5C13.melody	@ltx/en_us_oca/tr.d057:trMA.Ode5C13.melody
ltx/en_us_public/tr.d057:trMA.Ode5C13.mode	@ltx/en_us_dedes/tr.d057:trMA.Ode5C13.mode
ltx/en_us_public/tr.d057:trMA.Ode5C13.ode	@ltx/en_us_dedes/tr.d057:trMA.Ode5C13.ode
ltx/en_us_public/tr.d057:trMA.Ode5C13.text	@ltx/en_us_oca/tr.d057:trMA.Ode5C13.text
ltx/en_us_public/tr.d057:trMA.Ode5C1T.incipit	@ltx/en_us_oca/tr.d057:trMA.Ode5C1T.incipit
ltx/en_us_public/tr.d057:trMA.Ode5C1T.melody	@ltx/en_us_oca/tr.d057:trMA.Ode5C1T.melody
ltx/en_us_public/tr.d057:trMA.Ode5C1T.mode	@ltx/en_us_dedes/tr.d057:trMA.Ode5C1T.mode
ltx/en_us_public/tr.d057:trMA.Ode5C1T.ode	@ltx/en_us_dedes/tr.d057:trMA.Ode5C1T.ode
ltx/en_us_public/tr.d057:trMA.Ode5C1T.text	@ltx/en_us_oca/tr.d057:trMA.Ode5C1T.text
ltx/en_us_public/tr.d057:trMA.Ode5C21.greekmelody	@ltx/en_us_dedes/tr.d057:trMA.Ode5C21.greekmelody
ltx/en_us_public/tr.d057:trMA.Ode5C21.incipit	@ltx/en_us_oca/tr.d057:trMA.Ode5C21.incipit
ltx/en_us_public/tr.d057:trMA.Ode5C21.melody	@ltx/en_us_oca/tr.d057:trMA.Ode5C21.melody
ltx/en_us_public/tr.d057:trMA.Ode5C21.mode	@ltx/en_us_dedes/tr.d057:trMA.Ode5C21.mode
ltx/en_us_public/tr.d057:trMA.Ode5C21.ode	@ltx/en_us_dedes/tr.d057:trMA.Ode5C21.ode
ltx/en_us_public/tr.d057:trMA.Ode5C21.text	@ltx/en_us_oca/tr.d057:trMA.Ode5C21.text
ltx/en_us_public/tr.d057:trMA.Ode5C22.incipit	@ltx/en_us_oca/tr.d057:trMA.Ode5C22.incipit
ltx/en_us_public/tr.d057:trMA.Ode5C22.melody	@ltx/en_us_oca/tr.d057:trMA.Ode5C22.melody
ltx/en_us_public/tr.d057:trMA.Ode5C22.mode	@ltx/en_us_dedes/tr.d057:trMA.Ode5C22.mode
ltx/en_us_public/tr.d057:trMA.Ode5C22.ode	@ltx/en_us_dedes/tr.d057:trMA.Ode5C22.ode
ltx/en_us_public/tr.d057:trMA.Ode5C22.text	@ltx/en_us_oca/tr.d057:trMA.Ode5C22.text
ltx/en_us_public/tr.d057:trMA.Ode5C23.incipit	@ltx/en_us_oca/tr.d057:trMA.Ode5C23.incipit
ltx/en_us_public/tr.d057:trMA.Ode5C23.melody	@ltx/en_us_oca/tr.d057:trMA.Ode5C23.melody
ltx/en_us_public/tr.d057:trMA.Ode5C23.mode	@ltx/en_us_dedes/tr.d057:trMA.Ode5C23.mode
ltx/en_us_public/tr.d057:trMA.Ode5C23.ode	@ltx/en_us_dedes/tr.d057:trMA.Ode5C23.ode
ltx/en_us_public/tr.d057:trMA.Ode5C23.text	@ltx/en_us_oca/tr.d057:trMA.Ode5C23.text
ltx/en_us_public/tr.d057:trMA.Ode5C2T.incipit	@ltx/en_us_oca/tr.d057:trMA.Ode5C2T.incipit
ltx/en_us_public/tr.d057:trMA.Ode5C2T.melody	@ltx/en_us_oca/tr.d057:trMA.Ode5C2T.melody
ltx/en_us_public/tr.d057:trMA.Ode5C2T.mode	@ltx/en_us_dedes/tr.d057:trMA.Ode5C2T.mode
ltx/en_us_public/tr.d057:trMA.Ode5C2T.ode	@ltx/en_us_dedes/tr.d057:trMA.Ode5C2T.ode
ltx/en_us_public/tr.d057:trMA.Ode5C2T.text	@ltx/en_us_oca/tr.d057:trMA.Ode5C2T.text
ltx/en_us_public/tr.d057:trMA.Ode6C11.greekmelody	@ltx/en_us_dedes/tr.d057:trMA.Ode6C11.greekmelody
ltx/en_us_public/tr.d057:trMA.Ode6C11.incipit	@ltx/en_us_oca/tr.d057:trMA.Ode6C11.incipit
ltx/en_us_public/tr.d057:trMA.Ode6C11.melody	@ltx/en_us_oca/tr.d057:trMA.Ode6C11.melody
ltx/en_us_public/tr.d057:trMA.Ode6C11.mode	@ltx/en_us_dedes/tr.d057:trMA.Ode6C11.mode
ltx/en_us_public/tr.d057:trMA.Ode6C11.ode	@ltx/en_us_dedes/tr.d057:trMA.Ode6C11.ode
ltx/en_us_public/tr.d057:trMA.Ode6C11.text	@ltx/en_us_oca/tr.d057:trMA.Ode6C11.text
ltx/en_us_public/tr.d057:trMA.Ode6C12.incipit	@ltx/en_us_oca/tr.d057:trMA.Ode6C12.incipit
ltx/en_us_public/tr.d057:trMA.Ode6C12.melody	@ltx/en_us_oca/tr.d057:trMA.Ode6C12.melody
ltx/en_us_public/tr.d057:trMA.Ode6C12.mode	@ltx/en_us_dedes/tr.d057:trMA.Ode6C12.mode
ltx/en_us_public/tr.d057:trMA.Ode6C12.ode	@ltx/en_us_dedes/tr.d057:trMA.Ode6C12.ode
ltx/en_us_public/tr.d057:trMA.Ode6C12.text	@ltx/en_us_oca/tr.d057:trMA.Ode6C12.text
ltx/en_us_public/tr.d057:trMA.Ode6C13.incipit	@ltx/en_us_oca/tr.d057:trMA.Ode6C13.incipit
ltx/en_us_public/tr.d057:trMA.Ode6C13.melody	@ltx/en_us_oca/tr.d057:trMA.Ode6C13.melody
ltx/en_us_public/tr.d057:trMA.Ode6C13.mode	@ltx/en_us_dedes/tr.d057:trMA.Ode6C13.mode
ltx/en_us_public/tr.d057:trMA.Ode6C13.ode	@ltx/en_us_dedes/tr.d057:trMA.Ode6C13.ode
ltx/en_us_public/tr.d057:trMA.Ode6C13.text	@ltx/en_us_oca/tr.d057:trMA.Ode6C13.text
ltx/en_us_public/tr.d057:trMA.Ode6C1T.incipit	@ltx/en_us_oca/tr.d057:trMA.Ode6C1T.incipit
ltx/en_us_public/tr.d057:trMA.Ode6C1T.melody	@ltx/en_us_oca/tr.d057:trMA.Ode6C1T.melody
ltx/en_us_public/tr.d057:trMA.Ode6C1T.mode	@ltx/en_us_dedes/tr.d057:trMA.Ode6C1T.mode
ltx/en_us_public/tr.d057:trMA.Ode6C1T.ode	@ltx/en_us_dedes/tr.d057:trMA.Ode6C1T.ode
ltx/en_us_public/tr.d057:trMA.Ode6C1T.text	@ltx/en_us_oca/tr.d057:trMA.Ode6C1T.text
ltx/en_us_public/tr.d057:trMA.Ode6C21.greekmelody	@ltx/en_us_dedes/tr.d057:trMA.Ode6C21.greekmelody
ltx/en_us_public/tr.d057:trMA.Ode6C21.incipit	@ltx/en_us_oca/tr.d057:trMA.Ode6C21.incipit
ltx/en_us_public/tr.d057:trMA.Ode6C21.melody	@ltx/en_us_oca/tr.d057:trMA.Ode6C21.melody
ltx/en_us_public/tr.d057:trMA.Ode6C21.mode	@ltx/en_us_dedes/tr.d057:trMA.Ode6C21.mode
ltx/en_us_public/tr.d057:trMA.Ode6C21.ode	@ltx/en_us_dedes/tr.d057:trMA.Ode6C21.ode
ltx/en_us_public/tr.d057:trMA.Ode6C21.text	@ltx/en_us_oca/tr.d057:trMA.Ode6C21.text
ltx/en_us_public/tr.d057:trMA.Ode6C22.incipit	@ltx/en_us_oca/tr.d057:trMA.Ode6C22.incipit
ltx/en_us_public/tr.d057:trMA.Ode6C22.melody	@ltx/en_us_oca/tr.d057:trMA.Ode6C22.melody
ltx/en_us_public/tr.d057:trMA.Ode6C22.mode	@ltx/en_us_dedes/tr.d057:trMA.Ode6C22.mode
ltx/en_us_public/tr.d057:trMA.Ode6C22.ode	@ltx/en_us_dedes/tr.d057:trMA.Ode6C22.ode
ltx/en_us_public/tr.d057:trMA.Ode6C22.text	@ltx/en_us_oca/tr.d057:trMA.Ode6C22.text
ltx/en_us_public/tr.d057:trMA.Ode6C23.incipit	@ltx/en_us_oca/tr.d057:trMA.Ode6C23.incipit
ltx/en_us_public/tr.d057:trMA.Ode6C23.melody	@ltx/en_us_oca/tr.d057:trMA.Ode6C23.melody
ltx/en_us_public/tr.d057:trMA.Ode6C23.mode	@ltx/en_us_dedes/tr.d057:trMA.Ode6C23.mode
ltx/en_us_public/tr.d057:trMA.Ode6C23.ode	@ltx/en_us_dedes/tr.d057:trMA.Ode6C23.ode
ltx/en_us_public/tr.d057:trMA.Ode6C23.text	@ltx/en_us_oca/tr.d057:trMA.Ode6C23.text
ltx/en_us_public/tr.d057:trMA.Ode6C2T.incipit	@ltx/en_us_oca/tr.d057:trMA.Ode6C2T.incipit
ltx/en_us_public/tr.d057:trMA.Ode6C2T.melody	@ltx/en_us_oca/tr.d057:trMA.Ode6C2T.melody
ltx/en_us_public/tr.d057:trMA.Ode6C2T.mode	@ltx/en_us_dedes/tr.d057:trMA.Ode6C2T.mode
ltx/en_us_public/tr.d057:trMA.Ode6C2T.ode	@ltx/en_us_dedes/tr.d057:trMA.Ode6C2T.ode
ltx/en_us_public/tr.d057:trMA.Ode6C2T.text	@ltx/en_us_oca/tr.d057:trMA.Ode6C2T.text
ltx/en_us_public/tr.d057:trMA.Ode7C11.greekmelody	@ltx/en_us_dedes/tr.d057:trMA.Ode7C11.greekmelody
ltx/en_us_public/tr.d057:trMA.Ode7C11.incipit	@ltx/en_us_oca/tr.d057:trMA.Ode7C11.incipit
ltx/en_us_public/tr.d057:trMA.Ode7C11.melody	@ltx/en_us_oca/tr.d057:trMA.Ode7C11.melody
ltx/en_us_public/tr.d057:trMA.Ode7C11.mode	@ltx/en_us_dedes/tr.d057:trMA.Ode7C11.mode
ltx/en_us_public/tr.d057:trMA.Ode7C11.ode	@ltx/en_us_dedes/tr.d057:trMA.Ode7C11.ode
ltx/en_us_public/tr.d057:trMA.Ode7C11.text	@ltx/en_us_oca/tr.d057:trMA.Ode7C11.text
ltx/en_us_public/tr.d057:trMA.Ode7C12.incipit	@ltx/en_us_oca/tr.d057:trMA.Ode7C12.incipit
ltx/en_us_public/tr.d057:trMA.Ode7C12.melody	@ltx/en_us_oca/tr.d057:trMA.Ode7C12.melody
ltx/en_us_public/tr.d057:trMA.Ode7C12.mode	@ltx/en_us_dedes/tr.d057:trMA.Ode7C12.mode
ltx/en_us_public/tr.d057:trMA.Ode7C12.ode	@ltx/en_us_dedes/tr.d057:trMA.Ode7C12.ode
ltx/en_us_public/tr.d057:trMA.Ode7C12.text	@ltx/en_us_oca/tr.d057:trMA.Ode7C12.text
ltx/en_us_public/tr.d057:trMA.Ode7C13.incipit	@ltx/en_us_oca/tr.d057:trMA.Ode7C13.incipit
ltx/en_us_public/tr.d057:trMA.Ode7C13.melody	@ltx/en_us_oca/tr.d057:trMA.Ode7C13.melody
ltx/en_us_public/tr.d057:trMA.Ode7C13.mode	@ltx/en_us_dedes/tr.d057:trMA.Ode7C13.mode
ltx/en_us_public/tr.d057:trMA.Ode7C13.ode	@ltx/en_us_dedes/tr.d057:trMA.Ode7C13.ode
ltx/en_us_public/tr.d057:trMA.Ode7C13.text	@ltx/en_us_oca/tr.d057:trMA.Ode7C13.text
ltx/en_us_public/tr.d057:trMA.Ode7C1T.incipit	@ltx/en_us_oca/tr.d057:trMA.Ode7C1T.incipit
ltx/en_us_public/tr.d057:trMA.Ode7C1T.melody	@ltx/en_us_oca/tr.d057:trMA.Ode7C1T.melody
ltx/en_us_public/tr.d057:trMA.Ode7C1T.mode	@ltx/en_us_dedes/tr.d057:trMA.Ode7C1T.mode
ltx/en_us_public/tr.d057:trMA.Ode7C1T.ode	@ltx/en_us_dedes/tr.d057:trMA.Ode7C1T.ode
ltx/en_us_public/tr.d057:trMA.Ode7C1T.text	@ltx/en_us_oca/tr.d057:trMA.Ode7C1T.text
ltx/en_us_public/tr.d057:trMA.Ode7C21.greekmelody	@ltx/en_us_dedes/tr.d057:trMA.Ode7C21.greekmelody
ltx/en_us_public/tr.d057:trMA.Ode7C21.incipit	@ltx/en_us_oca/tr.d057:trMA.Ode7C21.incipit
ltx/en_us_public/tr.d057:trMA.Ode7C21.melody	@ltx/en_us_oca/tr.d057:trMA.Ode7C21.melody
ltx/en_us_public/tr.d057:trMA.Ode7C21.mode	@ltx/en_us_dedes/tr.d057:trMA.Ode7C21.mode
ltx/en_us_public/tr.d057:trMA.Ode7C21.ode	@ltx/en_us_dedes/tr.d057:trMA.Ode7C21.ode
ltx/en_us_public/tr.d057:trMA.Ode7C21.text	@ltx/en_us_oca/tr.d057:trMA.Ode7C21.text
ltx/en_us_public/tr.d057:trMA.Ode7C22.incipit	@ltx/en_us_oca/tr.d057:trMA.Ode7C22.incipit
ltx/en_us_public/tr.d057:trMA.Ode7C22.melody	@ltx/en_us_oca/tr.d057:trMA.Ode7C22.melody
ltx/en_us_public/tr.d057:trMA.Ode7C22.mode	@ltx/en_us_dedes/tr.d057:trMA.Ode7C22.mode
ltx/en_us_public/tr.d057:trMA.Ode7C22.ode	@ltx/en_us_dedes/tr.d057:trMA.Ode7C22.ode
ltx/en_us_public/tr.d057:trMA.Ode7C22.text	@ltx/en_us_oca/tr.d057:trMA.Ode7C22.text
ltx/en_us_public/tr.d057:trMA.Ode7C23.incipit	@ltx/en_us_oca/tr.d057:trMA.Ode7C23.incipit
ltx/en_us_public/tr.d057:trMA.Ode7C23.melody	@ltx/en_us_oca/tr.d057:trMA.Ode7C23.melody
ltx/en_us_public/tr.d057:trMA.Ode7C23.mode	@ltx/en_us_dedes/tr.d057:trMA.Ode7C23.mode
ltx/en_us_public/tr.d057:trMA.Ode7C23.ode	@ltx/en_us_dedes/tr.d057:trMA.Ode7C23.ode
ltx/en_us_public/tr.d057:trMA.Ode7C23.text	@ltx/en_us_oca/tr.d057:trMA.Ode7C23.text
ltx/en_us_public/tr.d057:trMA.Ode7C2T.incipit	@ltx/en_us_oca/tr.d057:trMA.Ode7C2T.incipit
ltx/en_us_public/tr.d057:trMA.Ode7C2T.melody	@ltx/en_us_oca/tr.d057:trMA.Ode7C2T.melody
ltx/en_us_public/tr.d057:trMA.Ode7C2T.mode	@ltx/en_us_dedes/tr.d057:trMA.Ode7C2T.mode
ltx/en_us_public/tr.d057:trMA.Ode7C2T.ode	@ltx/en_us_dedes/tr.d057:trMA.Ode7C2T.ode
ltx/en_us_public/tr.d057:trMA.Ode7C2T.text	@ltx/en_us_oca/tr.d057:trMA.Ode7C2T.text
ltx/en_us_public/tr.d057:trMA.Ode8C11.greekmelody	@ltx/en_us_dedes/tr.d057:trMA.Ode8C11.greekmelody
ltx/en_us_public/tr.d057:trMA.Ode8C11.incipit	@ltx/en_us_oca/tr.d057:trMA.Ode8C11.incipit
ltx/en_us_public/tr.d057:trMA.Ode8C11.melody	@ltx/en_us_oca/tr.d057:trMA.Ode8C11.melody
ltx/en_us_public/tr.d057:trMA.Ode8C11.mode	@ltx/en_us_dedes/tr.d057:trMA.Ode8C11.mode
ltx/en_us_public/tr.d057:trMA.Ode8C11.ode	@ltx/en_us_dedes/tr.d057:trMA.Ode8C11.ode
ltx/en_us_public/tr.d057:trMA.Ode8C11.text	@ltx/en_us_oca/tr.d057:trMA.Ode8C11.text
ltx/en_us_public/tr.d057:trMA.Ode8C12.incipit	@ltx/en_us_oca/tr.d057:trMA.Ode8C12.incipit
ltx/en_us_public/tr.d057:trMA.Ode8C12.melody	@ltx/en_us_oca/tr.d057:trMA.Ode8C12.melody
ltx/en_us_public/tr.d057:trMA.Ode8C12.mode	@ltx/en_us_dedes/tr.d057:trMA.Ode8C12.mode
ltx/en_us_public/tr.d057:trMA.Ode8C12.ode	@ltx/en_us_dedes/tr.d057:trMA.Ode8C12.ode
ltx/en_us_public/tr.d057:trMA.Ode8C12.text	@ltx/en_us_oca/tr.d057:trMA.Ode8C12.text
ltx/en_us_public/tr.d057:trMA.Ode8C13.incipit	@ltx/en_us_oca/tr.d057:trMA.Ode8C13.incipit
ltx/en_us_public/tr.d057:trMA.Ode8C13.melody	@ltx/en_us_oca/tr.d057:trMA.Ode8C13.melody
ltx/en_us_public/tr.d057:trMA.Ode8C13.mode	@ltx/en_us_dedes/tr.d057:trMA.Ode8C13.mode
ltx/en_us_public/tr.d057:trMA.Ode8C13.ode	@ltx/en_us_dedes/tr.d057:trMA.Ode8C13.ode
ltx/en_us_public/tr.d057:trMA.Ode8C13.text	@ltx/en_us_oca/tr.d057:trMA.Ode8C13.text
ltx/en_us_public/tr.d057:trMA.Ode8C1Tr.incipit	@ltx/en_us_oca/tr.d057:trMA.Ode8C1Tr.incipit
ltx/en_us_public/tr.d057:trMA.Ode8C1Tr.melody	@ltx/en_us_oca/tr.d057:trMA.Ode8C1Tr.melody
ltx/en_us_public/tr.d057:trMA.Ode8C1Tr.mode	@ltx/en_us_dedes/tr.d057:trMA.Ode8C1Tr.mode
ltx/en_us_public/tr.d057:trMA.Ode8C1Tr.ode	@ltx/en_us_dedes/tr.d057:trMA.Ode8C1Tr.ode
ltx/en_us_public/tr.d057:trMA.Ode8C1Tr.text	@ltx/en_us_oca/tr.d057:trMA.Ode8C1Tr.text
ltx/en_us_public/tr.d057:trMA.Ode8C21.greekmelody	@ltx/en_us_dedes/tr.d057:trMA.Ode8C21.greekmelody
ltx/en_us_public/tr.d057:trMA.Ode8C21.incipit	@ltx/en_us_oca/tr.d057:trMA.Ode8C21.incipit
ltx/en_us_public/tr.d057:trMA.Ode8C21.melody	@ltx/en_us_oca/tr.d057:trMA.Ode8C21.melody
ltx/en_us_public/tr.d057:trMA.Ode8C21.mode	@ltx/en_us_dedes/tr.d057:trMA.Ode8C21.mode
ltx/en_us_public/tr.d057:trMA.Ode8C21.ode	@ltx/en_us_dedes/tr.d057:trMA.Ode8C21.ode
ltx/en_us_public/tr.d057:trMA.Ode8C21.text	@ltx/en_us_oca/tr.d057:trMA.Ode8C21.text
ltx/en_us_public/tr.d057:trMA.Ode8C22.incipit	@ltx/en_us_oca/tr.d057:trMA.Ode8C22.incipit
ltx/en_us_public/tr.d057:trMA.Ode8C22.melody	@ltx/en_us_oca/tr.d057:trMA.Ode8C22.melody
ltx/en_us_public/tr.d057:trMA.Ode8C22.mode	@ltx/en_us_dedes/tr.d057:trMA.Ode8C22.mode
ltx/en_us_public/tr.d057:trMA.Ode8C22.ode	@ltx/en_us_dedes/tr.d057:trMA.Ode8C22.ode
ltx/en_us_public/tr.d057:trMA.Ode8C22.text	@ltx/en_us_oca/tr.d057:trMA.Ode8C22.text
ltx/en_us_public/tr.d057:trMA.Ode8C23.incipit	@ltx/en_us_oca/tr.d057:trMA.Ode8C23.incipit
ltx/en_us_public/tr.d057:trMA.Ode8C23.melody	@ltx/en_us_oca/tr.d057:trMA.Ode8C23.melody
ltx/en_us_public/tr.d057:trMA.Ode8C23.mode	@ltx/en_us_dedes/tr.d057:trMA.Ode8C23.mode
ltx/en_us_public/tr.d057:trMA.Ode8C23.ode	@ltx/en_us_dedes/tr.d057:trMA.Ode8C23.ode
ltx/en_us_public/tr.d057:trMA.Ode8C23.text	@ltx/en_us_oca/tr.d057:trMA.Ode8C23.text
ltx/en_us_public/tr.d057:trMA.Ode8C2T.incipit	@ltx/en_us_oca/tr.d057:trMA.Ode8C2T.incipit
ltx/en_us_public/tr.d057:trMA.Ode8C2T.melody	@ltx/en_us_oca/tr.d057:trMA.Ode8C2T.melody
ltx/en_us_public/tr.d057:trMA.Ode8C2T.mode	@ltx/en_us_dedes/tr.d057:trMA.Ode8C2T.mode
ltx/en_us_public/tr.d057:trMA.Ode8C2T.ode	@ltx/en_us_dedes/tr.d057:trMA.Ode8C2T.ode
ltx/en_us_public/tr.d057:trMA.Ode8C2T.text	@ltx/en_us_oca/tr.d057:trMA.Ode8C2T.text
ltx/en_us_public/tr.d057:trMA.Ode9C11.greekmelody	@ltx/en_us_dedes/tr.d057:trMA.Ode9C11.greekmelody
ltx/en_us_public/tr.d057:trMA.Ode9C11.incipit	@ltx/en_us_oca/tr.d057:trMA.Ode9C11.incipit
ltx/en_us_public/tr.d057:trMA.Ode9C11.melody	@ltx/en_us_oca/tr.d057:trMA.Ode9C11.melody
ltx/en_us_public/tr.d057:trMA.Ode9C11.mode	@ltx/en_us_dedes/tr.d057:trMA.Ode9C11.mode
ltx/en_us_public/tr.d057:trMA.Ode9C11.ode	@ltx/en_us_dedes/tr.d057:trMA.Ode9C11.ode
ltx/en_us_public/tr.d057:trMA.Ode9C11.text	@ltx/en_us_oca/tr.d057:trMA.Ode9C11.text
ltx/en_us_public/tr.d057:trMA.Ode9C12.incipit	@ltx/en_us_oca/tr.d057:trMA.Ode9C12.incipit
ltx/en_us_public/tr.d057:trMA.Ode9C12.melody	@ltx/en_us_oca/tr.d057:trMA.Ode9C12.melody
ltx/en_us_public/tr.d057:trMA.Ode9C12.mode	@ltx/en_us_dedes/tr.d057:trMA.Ode9C12.mode
ltx/en_us_public/tr.d057:trMA.Ode9C12.ode	@ltx/en_us_dedes/tr.d057:trMA.Ode9C12.ode
ltx/en_us_public/tr.d057:trMA.Ode9C12.text	@ltx/en_us_oca/tr.d057:trMA.Ode9C12.text
ltx/en_us_public/tr.d057:trMA.Ode9C13.incipit	@ltx/en_us_oca/tr.d057:trMA.Ode9C13.incipit
ltx/en_us_public/tr.d057:trMA.Ode9C13.melody	@ltx/en_us_oca/tr.d057:trMA.Ode9C13.melody
ltx/en_us_public/tr.d057:trMA.Ode9C13.mode	@ltx/en_us_dedes/tr.d057:trMA.Ode9C13.mode
ltx/en_us_public/tr.d057:trMA.Ode9C13.ode	@ltx/en_us_dedes/tr.d057:trMA.Ode9C13.ode
ltx/en_us_public/tr.d057:trMA.Ode9C13.text	@ltx/en_us_oca/tr.d057:trMA.Ode9C13.text
ltx/en_us_public/tr.d057:trMA.Ode9C1T.incipit	@ltx/en_us_oca/tr.d057:trMA.Ode9C1T.incipit
ltx/en_us_public/tr.d057:trMA.Ode9C1T.melody	@ltx/en_us_oca/tr.d057:trMA.Ode9C1T.melody
ltx/en_us_public/tr.d057:trMA.Ode9C1T.mode	@ltx/en_us_dedes/tr.d057:trMA.Ode9C1T.mode
ltx/en_us_public/tr.d057:trMA.Ode9C1T.ode	@ltx/en_us_dedes/tr.d057:trMA.Ode9C1T.ode
ltx/en_us_public/tr.d057:trMA.Ode9C1T.text	@ltx/en_us_oca/tr.d057:trMA.Ode9C1T.text
ltx/en_us_public/tr.d057:trMA.Ode9C21.greekmelody	@ltx/en_us_dedes/tr.d057:trMA.Ode9C21.greekmelody
ltx/en_us_public/tr.d057:trMA.Ode9C21.incipit	@ltx/en_us_oca/tr.d057:trMA.Ode9C21.incipit
ltx/en_us_public/tr.d057:trMA.Ode9C21.melody	@ltx/en_us_oca/tr.d057:trMA.Ode9C21.melody
ltx/en_us_public/tr.d057:trMA.Ode9C21.mode	@ltx/en_us_dedes/tr.d057:trMA.Ode9C21.mode
ltx/en_us_public/tr.d057:trMA.Ode9C21.ode	@ltx/en_us_dedes/tr.d057:trMA.Ode9C21.ode
ltx/en_us_public/tr.d057:trMA.Ode9C21.text	@ltx/en_us_oca/tr.d057:trMA.Ode9C21.text
ltx/en_us_public/tr.d057:trMA.Ode9C22.incipit	@ltx/en_us_oca/tr.d057:trMA.Ode9C22.incipit
ltx/en_us_public/tr.d057:trMA.Ode9C22.melody	@ltx/en_us_oca/tr.d057:trMA.Ode9C22.melody
ltx/en_us_public/tr.d057:trMA.Ode9C22.mode	@ltx/en_us_dedes/tr.d057:trMA.Ode9C22.mode
ltx/en_us_public/tr.d057:trMA.Ode9C22.ode	@ltx/en_us_dedes/tr.d057:trMA.Ode9C22.ode
ltx/en_us_public/tr.d057:trMA.Ode9C22.text	@ltx/en_us_oca/tr.d057:trMA.Ode9C22.text
ltx/en_us_public/tr.d057:trMA.Ode9C23.incipit	@ltx/en_us_oca/tr.d057:trMA.Ode9C23.incipit
ltx/en_us_public/tr.d057:trMA.Ode9C23.melody	@ltx/en_us_oca/tr.d057:trMA.Ode9C23.melody
ltx/en_us_public/tr.d057:trMA.Ode9C23.mode	@ltx/en_us_dedes/tr.d057:trMA.Ode9C23.mode
ltx/en_us_public/tr.d057:trMA.Ode9C23.ode	@ltx/en_us_dedes/tr.d057:trMA.Ode9C23.ode
ltx/en_us_public/tr.d057:trMA.Ode9C23.text	@ltx/en_us_oca/tr.d057:trMA.Ode9C23.text
ltx/en_us_public/tr.d057:trMA.Ode9C2T.incipit	@ltx/en_us_oca/tr.d057:trMA.Ode9C2T.incipit
ltx/en_us_public/tr.d057:trMA.Ode9C2T.melody	@ltx/en_us_oca/tr.d057:trMA.Ode9C2T.melody
ltx/en_us_public/tr.d057:trMA.Ode9C2T.mode	@ltx/en_us_dedes/tr.d057:trMA.Ode9C2T.mode
ltx/en_us_public/tr.d057:trMA.Ode9C2T.ode	@ltx/en_us_dedes/tr.d057:trMA.Ode9C2T.ode
ltx/en_us_public/tr.d057:trMA.Ode9C2T.text	@ltx/en_us_oca/tr.d057:trMA.Ode9C2T.text
ltx/en_us_public/tr.d057:trMA.Oikos1.text	@ltx/en_us_dedes/tr.d057:trMA.Oikos1.text
ltx/en_us_public/tr.d057:trMA.PostGospelBoth.incipit	@ltx/en_us_dedes/tr.d057:trMA.PostGospelBoth.incipit
ltx/en_us_public/tr.d057:trMA.PostGospelBoth.melody	@ltx/en_us_dedes/tr.d057:trMA.PostGospelBoth.melody
ltx/en_us_public/tr.d057:trMA.PostGospelBoth.mode	@ltx/en_us_dedes/tr.d057:trMA.PostGospelBoth.mode
ltx/en_us_public/tr.d057:trMA.PostGospelBoth.text	@ltx/en_us_dedes/tr.d057:trMA.PostGospelBoth.text
ltx/en_us_public/tr.d057:trMA.PostGospelGlory.incipit	@ltx/en_us_dedes/tr.d057:trMA.PostGospelGlory.incipit
ltx/en_us_public/tr.d057:trMA.PostGospelGlory.melody	@ltx/en_us_dedes/tr.d057:trMA.PostGospelGlory.melody
ltx/en_us_public/tr.d057:trMA.PostGospelGlory.mode	@ltx/en_us_dedes/tr.d057:trMA.PostGospelGlory.mode
ltx/en_us_public/tr.d057:trMA.PostGospelGlory.text	@ltx/en_us_dedes/tr.d057:trMA.PostGospelGlory.text
ltx/en_us_public/tr.d057:trMA.PostGospelIdiomelon.incipit	@ltx/en_us_dedes/tr.d057:trMA.PostGospelIdiomelon.incipit
ltx/en_us_public/tr.d057:trMA.PostGospelIdiomelon.melody	@ltx/en_us_dedes/tr.d057:trMA.PostGospelIdiomelon.melody
ltx/en_us_public/tr.d057:trMA.PostGospelIdiomelon.mode	@ltx/en_us_dedes/tr.d057:trMA.PostGospelIdiomelon.mode
ltx/en_us_public/tr.d057:trMA.PostGospelIdiomelon.text	@ltx/en_us_dedes/tr.d057:trMA.PostGospelIdiomelon.text
ltx/en_us_public/tr.d057:trSY.commemoration.couplet1.title	@ltx/en_us_dedes/tr.d057:trSY.commemoration.couplet1.title
ltx/en_us_public/tr.d057:trSY.commemoration.couplet1.verse1	@ltx/en_us_dedes/tr.d057:trSY.commemoration.couplet1.verse1
ltx/en_us_public/tr.d057:trSY.commemoration.couplet1.verse2	@ltx/en_us_dedes/tr.d057:trSY.commemoration.couplet1.verse2
ltx/en_us_public/tr.d057:trSY.commemoration.narration.p01	@ltx/en_us_dedes/tr.d057:trSY.commemoration.narration.p01
ltx/en_us_public/tr.d057:trSY.commemoration.narration.p02	@ltx/en_us_dedes/tr.d057:trSY.commemoration.narration.p02
ltx/en_us_public/tr.d057:trSY.commemoration.narration.p03	@ltx/en_us_dedes/tr.d057:trSY.commemoration.narration.p03
ltx/en_us_public/tr.d057:trSY.commemoration.narration.p04	@ltx/en_us_dedes/tr.d057:trSY.commemoration.narration.p04
ltx/en_us_public/tr.d057:trSY.commemoration.narration.p05	@ltx/en_us_dedes/tr.d057:trSY.commemoration.narration.p05
ltx/en_us_public/tr.d057:trSY.commemoration.narration.p06	@ltx/en_us_dedes/tr.d057:trSY.commemoration.narration.p06
ltx/en_us_public/tr.d057:trSY.commemoration.narration.p07	@ltx/en_us_dedes/tr.d057:trSY.commemoration.narration.p07
ltx/en_us_public/tr.d057:trSY.commemoration.onotherday.text	@ltx/en_us_dedes/tr.d057:trSY.commemoration.onotherday.text
ltx/en_us_public/tr.d057:trSY.commemoration.text	@ltx/en_us_dedes/tr.d057:trSY.commemoration.text
ltx/en_us_public/tr.d057:trSY.lastline	@ltx/en_us_dedes/tr.d057:trSY.lastline
ltx/en_us_public/tr.d057:trVE.ApolTheotokion.incipit	@ltx/en_us_goadedes/tr.d057:trVE.ApolTheotokion.incipit
ltx/en_us_public/tr.d057:trVE.ApolTheotokion.melody	@ltx/en_us_goadedes/tr.d057:trVE.ApolTheotokion.melody
ltx/en_us_public/tr.d057:trVE.ApolTheotokion.mode	@ltx/en_us_goadedes/tr.d057:trVE.ApolTheotokion.mode
ltx/en_us_public/tr.d057:trVE.ApolTheotokion.text	@ltx/en_us_goadedes/tr.d057:trVE.ApolTheotokion.text
ltx/en_us_public/tr.d057:trVE.Apolytikion1.melody	@ltx/en_us_dedes/tr.d057:trVE.Apolytikion1.melody
ltx/en_us_public/tr.d057:trVE.Apolytikion1.mode	@ltx/en_us_dedes/tr.d057:trVE.Apolytikion1.mode
ltx/en_us_public/tr.d057:trVE.Apolytikion1.text	@ltx/en_us_dedes/tr.d057:trVE.Apolytikion1.text
ltx/en_us_public/tr.d057:trVE.AposGlory.incipit	@ltx/en_us_dedes/tr.d057:trVE.AposGlory.incipit
ltx/en_us_public/tr.d057:trVE.AposGlory.melody	@ltx/en_us_dedes/tr.d057:trVE.AposGlory.melody
ltx/en_us_public/tr.d057:trVE.AposGlory.mode	@ltx/en_us_dedes/tr.d057:trVE.AposGlory.mode
ltx/en_us_public/tr.d057:trVE.AposGlory.text	@ltx/en_us_dedes/tr.d057:trVE.AposGlory.text
ltx/en_us_public/tr.d057:trVE.AposTheotokion.incipit	@ltx/en_us_goadedes/tr.d057:trVE.AposTheotokion.incipit
ltx/en_us_public/tr.d057:trVE.AposTheotokion.melody	@ltx/en_us_goadedes/tr.d057:trVE.AposTheotokion.melody
ltx/en_us_public/tr.d057:trVE.AposTheotokion.mode	@ltx/en_us_goadedes/tr.d057:trVE.AposTheotokion.mode
ltx/en_us_public/tr.d057:trVE.AposTheotokion.text	@ltx/en_us_goadedes/tr.d057:trVE.AposTheotokion.text
ltx/en_us_public/tr.d057:trVE.GeneralApolytikion1.name	@ltx/en_us_dedes/tr.d057:trVE.GeneralApolytikion1.name
ltx/en_us_public/tr.d057:trVE.MM.Stichera1123as78910.text	@ltx/en_us_dedes/tr.d057:trVE.MM.Stichera1123as78910.text
ltx/en_us_public/tr.d057:trVE.SticGlory.incipit	@ltx/en_us_dedes/tr.d057:trVE.SticGlory.incipit
ltx/en_us_public/tr.d057:trVE.SticGlory.melody	@ltx/en_us_dedes/tr.d057:trVE.SticGlory.melody
ltx/en_us_public/tr.d057:trVE.SticGlory.mode	@ltx/en_us_dedes/tr.d057:trVE.SticGlory.mode
ltx/en_us_public/tr.d057:trVE.SticGlory.text	@ltx/en_us_dedes/tr.d057:trVE.SticGlory.text
ltx/en_us_public/tr.d057:trVE.Stichera01.incipit	@ltx/en_us_dedes/tr.d057:trVE.Stichera01.incipit
ltx/en_us_public/tr.d057:trVE.Stichera01.melody	@ltx/en_us_dedes/tr.d057:trVE.Stichera01.melody
ltx/en_us_public/tr.d057:trVE.Stichera01.mode	@ltx/en_us_dedes/tr.d057:trVE.Stichera01.mode
ltx/en_us_public/tr.d057:trVE.Stichera01.text	@ltx/en_us_dedes/tr.d057:trVE.Stichera01.text
ltx/en_us_public/tr.d057:trVE.Stichera02.incipit	@ltx/en_us_dedes/tr.d057:trVE.Stichera02.incipit
ltx/en_us_public/tr.d057:trVE.Stichera02.melody	@ltx/en_us_dedes/tr.d057:trVE.Stichera02.melody
ltx/en_us_public/tr.d057:trVE.Stichera02.mode	@ltx/en_us_dedes/tr.d057:trVE.Stichera02.mode
ltx/en_us_public/tr.d057:trVE.Stichera02.text	@ltx/en_us_dedes/tr.d057:trVE.Stichera02.text
ltx/en_us_public/tr.d057:trVE.Stichera03.incipit	@ltx/en_us_dedes/tr.d057:trVE.Stichera03.incipit
ltx/en_us_public/tr.d057:trVE.Stichera03.melody	@ltx/en_us_dedes/tr.d057:trVE.Stichera03.melody
ltx/en_us_public/tr.d057:trVE.Stichera03.mode	@ltx/en_us_dedes/tr.d057:trVE.Stichera03.mode
ltx/en_us_public/tr.d057:trVE.Stichera03.text	@ltx/en_us_dedes/tr.d057:trVE.Stichera03.text
