ltx/en_us_public/le.ep.me.m09.d26:lemeLI.Epistle.book_abbr	@ltx/en_us_rsv/le.ep.me.m09.d26:lemeLI.Epistle.book_abbr
ltx/en_us_public/le.ep.me.m09.d26:lemeLI.Epistle.book_string	@ltx/en_us_rsv/le.ep.me.m09.d26:lemeLI.Epistle.book_string
ltx/en_us_public/le.ep.me.m09.d26:lemeLI.Epistle.chapverse	@ltx/en_us_rsv/le.ep.me.m09.d26:lemeLI.Epistle.chapverse
ltx/en_us_public/le.ep.me.m09.d26:lemeLI.Epistle.incipit	@ltx/en_us_rsv/le.ep.me.m09.d26:lemeLI.Epistle.incipit
ltx/en_us_public/le.ep.me.m09.d26:lemeLI.Epistle.text	@ltx/en_us_rsv/le.ep.me.m09.d26:lemeLI.Epistle.text
ltx/en_us_public/le.ep.me.m09.d26:lemeLI.Epistle.title	@ltx/en_us_rsv/le.ep.me.m09.d26:lemeLI.Epistle.title
ltx/en_us_public/le.ep.me.m09.d26:lemeLI.Epistle.title_abbr	@ltx/en_us_rsv/le.ep.me.m09.d26:lemeLI.Epistle.title_abbr
ltx/en_us_public/le.ep.me.m09.d26:lemeLI.Epistle.version	@ltx/en_us_rsv/le.ep.me.m09.d26:lemeLI.Epistle.version
ltx/en_us_public/le.ep.me.m09.d26:lemeVE.Reading1.book_string	@ltx/en_us_rsv/le.ep.me.m09.d26:lemeVE.Reading1.book_string
ltx/en_us_public/le.ep.me.m09.d26:lemeVE.Reading1.chapverse	@ltx/en_us_rsv/le.ep.me.m09.d26:lemeVE.Reading1.chapverse
ltx/en_us_public/le.ep.me.m09.d26:lemeVE.Reading1.incipit	@ltx/en_us_rsv/le.ep.me.m09.d26:lemeVE.Reading1.incipit
ltx/en_us_public/le.ep.me.m09.d26:lemeVE.Reading1.text	@ltx/en_us_rsv/le.ep.me.m09.d26:lemeVE.Reading1.text
ltx/en_us_public/le.ep.me.m09.d26:lemeVE.Reading1.title	@ltx/en_us_rsv/le.ep.me.m09.d26:lemeVE.Reading1.title
ltx/en_us_public/le.ep.me.m09.d26:lemeVE.Reading1.title_abbr	@ltx/en_us_rsv/le.ep.me.m09.d26:lemeVE.Reading1.title_abbr
ltx/en_us_public/le.ep.me.m09.d26:lemeVE.Reading1.version	@ltx/en_us_rsv/le.ep.me.m09.d26:lemeVE.Reading1.version
ltx/en_us_public/le.ep.me.m09.d26:lemeVE.Reading2.book_string	@ltx/en_us_rsv/le.ep.me.m09.d26:lemeVE.Reading2.book_string
ltx/en_us_public/le.ep.me.m09.d26:lemeVE.Reading2.chapverse	@ltx/en_us_rsv/le.ep.me.m09.d26:lemeVE.Reading2.chapverse
ltx/en_us_public/le.ep.me.m09.d26:lemeVE.Reading2.incipit	@ltx/en_us_rsv/le.ep.me.m09.d26:lemeVE.Reading2.incipit
ltx/en_us_public/le.ep.me.m09.d26:lemeVE.Reading2.text	@ltx/en_us_rsv/le.ep.me.m09.d26:lemeVE.Reading2.text
ltx/en_us_public/le.ep.me.m09.d26:lemeVE.Reading2.title	@ltx/en_us_rsv/le.ep.me.m09.d26:lemeVE.Reading2.title
ltx/en_us_public/le.ep.me.m09.d26:lemeVE.Reading2.title_abbr	@ltx/en_us_rsv/le.ep.me.m09.d26:lemeVE.Reading2.title_abbr
ltx/en_us_public/le.ep.me.m09.d26:lemeVE.Reading2.version	@ltx/en_us_rsv/le.ep.me.m09.d26:lemeVE.Reading2.version
ltx/en_us_public/le.ep.me.m09.d26:lemeVE.Reading3.book_string	@ltx/en_us_rsv/le.ep.me.m09.d26:lemeVE.Reading3.book_string
ltx/en_us_public/le.ep.me.m09.d26:lemeVE.Reading3.chapverse	@ltx/en_us_rsv/le.ep.me.m09.d26:lemeVE.Reading3.chapverse
ltx/en_us_public/le.ep.me.m09.d26:lemeVE.Reading3.incipit	@ltx/en_us_rsv/le.ep.me.m09.d26:lemeVE.Reading3.incipit
ltx/en_us_public/le.ep.me.m09.d26:lemeVE.Reading3.text	@ltx/en_us_rsv/le.ep.me.m09.d26:lemeVE.Reading3.text
ltx/en_us_public/le.ep.me.m09.d26:lemeVE.Reading3.title	@ltx/en_us_rsv/le.ep.me.m09.d26:lemeVE.Reading3.title
ltx/en_us_public/le.ep.me.m09.d26:lemeVE.Reading3.title_abbr	@ltx/en_us_rsv/le.ep.me.m09.d26:lemeVE.Reading3.title_abbr
ltx/en_us_public/le.ep.me.m09.d26:lemeVE.Reading3.version	@ltx/en_us_rsv/le.ep.me.m09.d26:lemeVE.Reading3.version
