ltx/en_us_public/rubrical:ru.AfterEachPetition	@ltx/en_us_dedes/rubrical:ru.AfterEachPetition
ltx/en_us_public/rubrical:ru.Aloud	@ltx/en_us_dedes/rubrical:ru.Aloud
ltx/en_us_public/rubrical:ru.And	@ltx/en_us_dedes/rubrical:ru.And
ltx/en_us_public/rubrical:ru.AndAgain	@ltx/en_us_dedes/rubrical:ru.AndAgain
ltx/en_us_public/rubrical:ru.AndTheFollowing	@ltx/en_us_dedes/rubrical:ru.AndTheFollowing
ltx/en_us_public/rubrical:ru.AndThen	@ltx/en_us_dedes/rubrical:ru.AndThen
ltx/en_us_public/rubrical:ru.Antiphon1OfMode4	@ltx/en_us_dedes/rubrical:ru.Antiphon1OfMode4
ltx/en_us_public/rubrical:ru.BeginMatins	@ltx/en_us_dedes/rubrical:ru.BeginMatins
ltx/en_us_public/rubrical:ru.BeginVespers	@ltx/en_us_dedes/rubrical:ru.BeginVespers
ltx/en_us_public/rubrical:ru.BlessingWithTheCross	@ltx/en_us_goa/rubrical:ru.BlessingWithTheCross
ltx/en_us_public/rubrical:ru.ChoirLeftBegins	@ltx/en_us_goa/rubrical:ru.ChoirLeftBegins
ltx/en_us_public/rubrical:ru.ChoirRightBegins	@ltx/en_us_goa/rubrical:ru.ChoirRightBegins
ltx/en_us_public/rubrical:ru.ContinueBasilLiturgy	@ltx/en_us_dedes/rubrical:ru.ContinueBasilLiturgy
ltx/en_us_public/rubrical:ru.ContinueLiturgy	@ltx/en_us_dedes/rubrical:ru.ContinueLiturgy
ltx/en_us_public/rubrical:ru.CrossLitany	@ltx/en_us_goa/rubrical:ru.CrossLitany
ltx/en_us_public/rubrical:ru.DifferentMenaionCanonInEnglish	@ltx/en_us_dedes/rubrical:ru.DifferentMenaionCanonInEnglish
ltx/en_us_public/rubrical:ru.DifferentMenaionOde9InEnglish	@ltx/en_us_dedes/rubrical:ru.DifferentMenaionOde9InEnglish
ltx/en_us_public/rubrical:ru.DifferentMenaionSticheraInEnglish	@ltx/en_us_dedes/rubrical:ru.DifferentMenaionSticheraInEnglish
ltx/en_us_public/rubrical:ru.EntranceWithGospel	@ltx/en_us_dedes/rubrical:ru.EntranceWithGospel
ltx/en_us_public/rubrical:ru.Extended	@ltx/en_us_goa/rubrical:ru.Extended
ltx/en_us_public/rubrical:ru.FacingThrone	@ltx/en_us_dedes/rubrical:ru.FacingThrone
ltx/en_us_public/rubrical:ru.FastButNotSaturday	@ltx/en_us_dedes/rubrical:ru.FastButNotSaturday
ltx/en_us_public/rubrical:ru.Forty	@ltx/en_us_dedes/rubrical:ru.Forty
ltx/en_us_public/rubrical:ru.FromTheAltarTable	@ltx/en_us_dedes/rubrical:ru.FromTheAltarTable
ltx/en_us_public/rubrical:ru.FromTheGate	@ltx/en_us_dedes/rubrical:ru.FromTheGate
ltx/en_us_public/rubrical:ru.HierarchicalKairosAtLauds	@ltx/en_us_dedes/rubrical:ru.HierarchicalKairosAtLauds
ltx/en_us_public/rubrical:ru.HolidayAll	@ltx/en_us_dedes/rubrical:ru.HolidayAll
ltx/en_us_public/rubrical:ru.HolidayChristmas	@ltx/en_us_dedes/rubrical:ru.HolidayChristmas
ltx/en_us_public/rubrical:ru.HolidayFast	@ltx/en_us_dedes/rubrical:ru.HolidayFast
ltx/en_us_public/rubrical:ru.HolidayFish	@ltx/en_us_dedes/rubrical:ru.HolidayFish
ltx/en_us_public/rubrical:ru.HolidayWineOil	@ltx/en_us_dedes/rubrical:ru.HolidayWineOil
ltx/en_us_public/rubrical:ru.IfExistsIfNot	@ltx/en_us_dedes/rubrical:ru.IfExistsIfNot
ltx/en_us_public/rubrical:ru.IfLityNotDoneAtVespers	@ltx/en_us_dedes/rubrical:ru.IfLityNotDoneAtVespers
ltx/en_us_public/rubrical:ru.InALowVoice	@ltx/en_us_dedes/rubrical:ru.InALowVoice
ltx/en_us_public/rubrical:ru.InALowVoiceFacingAltar	@ltx/en_us_dedes/rubrical:ru.InALowVoiceFacingAltar
ltx/en_us_public/rubrical:ru.InPlaceOfRightChoir	@ltx/en_us_dedes/rubrical:ru.InPlaceOfRightChoir
ltx/en_us_public/rubrical:ru.Inaudibly	@ltx/en_us_dedes/rubrical:ru.Inaudibly
ltx/en_us_public/rubrical:ru.Intoned	@ltx/en_us_dedes/rubrical:ru.Intoned
ltx/en_us_public/rubrical:ru.IntonedAfterEachPetition	@ltx/en_us_dedes/rubrical:ru.IntonedAfterEachPetition
ltx/en_us_public/rubrical:ru.LityLordHaveMercy101010103	@ltx/en_us_dedes/rubrical:ru.LityLordHaveMercy101010103
ltx/en_us_public/rubrical:ru.LocalChurchApolytikionSung	@ltx/en_us_dedes/rubrical:ru.LocalChurchApolytikionSung
ltx/en_us_public/rubrical:ru.MenaionSynaxarionNote	@ltx/en_us_dedes/rubrical:ru.MenaionSynaxarionNote
ltx/en_us_public/rubrical:ru.NoEntrance	@ltx/en_us_dedes/rubrical:ru.NoEntrance
ltx/en_us_public/rubrical:ru.NoEvlogetaria	@ltx/en_us_dedes/rubrical:ru.NoEvlogetaria
ltx/en_us_public/rubrical:ru.OmitMagnificat	@ltx/en_us_dedes/rubrical:ru.OmitMagnificat
ltx/en_us_public/rubrical:ru.Once	@ltx/en_us_dedes/rubrical:ru.Once
ltx/en_us_public/rubrical:ru.OnceOrThrice	@ltx/en_us_dedes/rubrical:ru.OnceOrThrice
ltx/en_us_public/rubrical:ru.Optional	@ltx/en_us_dedes/rubrical:ru.Optional
ltx/en_us_public/rubrical:ru.Or	@ltx/en_us_dedes/rubrical:ru.Or
ltx/en_us_public/rubrical:ru.OrAccordingToCommonPractice	@ltx/en_us_dedes/rubrical:ru.OrAccordingToCommonPractice
ltx/en_us_public/rubrical:ru.OrAccordingToOlderPractice	@ltx/en_us_dedes/rubrical:ru.OrAccordingToOlderPractice
ltx/en_us_public/rubrical:ru.Read	@ltx/en_us_dedes/rubrical:ru.Read
ltx/en_us_public/rubrical:ru.RelaxedFish	@ltx/en_us_dedes/rubrical:ru.RelaxedFish
ltx/en_us_public/rubrical:ru.SlowlyFromWithinTheAltar	@ltx/en_us_dedes/rubrical:ru.SlowlyFromWithinTheAltar
ltx/en_us_public/rubrical:ru.Sung	@ltx/en_us_dedes/rubrical:ru.Sung
ltx/en_us_public/rubrical:ru.SungSlowly	@ltx/en_us_dedes/rubrical:ru.SungSlowly
ltx/en_us_public/rubrical:ru.Then	@ltx/en_us_dedes/rubrical:ru.Then
ltx/en_us_public/rubrical:ru.ThenSingSlowly	@ltx/en_us_dedes/rubrical:ru.ThenSingSlowly
ltx/en_us_public/rubrical:ru.ThreeTimes	@ltx/en_us_dedes/rubrical:ru.ThreeTimes
ltx/en_us_public/rubrical:ru.ThreeTimesDayHoliday	@ltx/en_us_dedes/rubrical:ru.ThreeTimesDayHoliday
ltx/en_us_public/rubrical:ru.Thrice	@ltx/en_us_dedes/rubrical:ru.Thrice
ltx/en_us_public/rubrical:ru.TriodionSynaxarion	@ltx/en_us_dedes/rubrical:ru.TriodionSynaxarion
ltx/en_us_public/rubrical:ru.TwOrMorePriests	@ltx/en_us_dedes/rubrical:ru.TwOrMorePriests
ltx/en_us_public/rubrical:ru.Twelve	@ltx/en_us_dedes/rubrical:ru.Twelve
ltx/en_us_public/rubrical:ru.Twice	@ltx/en_us_dedes/rubrical:ru.Twice
ltx/en_us_public/rubrical:ru.TwiceWithNoVerse	@ltx/en_us_dedes/rubrical:ru.TwiceWithNoVerse
ltx/en_us_public/rubrical:ru.VigilEntry	@ltx/en_us_dedes/rubrical:ru.VigilEntry
ltx/en_us_public/rubrical:ru.WhenNoPriest	@ltx/en_us_dedes/rubrical:ru.WhenNoPriest
ltx/en_us_public/rubrical:ru.WineOil	@ltx/en_us_dedes/rubrical:ru.WineOil
ltx/en_us_public/rubrical:ru.WithoutVersesComingBefore	@ltx/en_us_dedes/rubrical:ru.WithoutVersesComingBefore
ltx/en_us_public/rubrical:ru.fasting.explanation.apostlesfast	@ltx/en_us_dedes/rubrical:ru.fasting.explanation.apostlesfast
ltx/en_us_public/rubrical:ru.fasting.explanation.christmas12days	@ltx/en_us_dedes/rubrical:ru.fasting.explanation.christmas12days
ltx/en_us_public/rubrical:ru.fasting.explanation.christmasfast	@ltx/en_us_dedes/rubrical:ru.fasting.explanation.christmasfast
ltx/en_us_public/rubrical:ru.fasting.explanation.dormitionfast	@ltx/en_us_dedes/rubrical:ru.fasting.explanation.dormitionfast
ltx/en_us_public/rubrical:ru.fasting.explanation.holyweek	@ltx/en_us_dedes/rubrical:ru.fasting.explanation.holyweek
ltx/en_us_public/rubrical:ru.fasting.explanation.lent	@ltx/en_us_dedes/rubrical:ru.fasting.explanation.lent
ltx/en_us_public/rubrical:ru.fasting.explanation.lentweekend	@ltx/en_us_dedes/rubrical:ru.fasting.explanation.lentweekend
ltx/en_us_public/rubrical:ru.fasting.explanation.majorfeast	@ltx/en_us_dedes/rubrical:ru.fasting.explanation.majorfeast
ltx/en_us_public/rubrical:ru.fasting.explanation.minorfeast	@ltx/en_us_dedes/rubrical:ru.fasting.explanation.minorfeast
ltx/en_us_public/rubrical:ru.fasting.explanation.paschal	@ltx/en_us_dedes/rubrical:ru.fasting.explanation.paschal
ltx/en_us_public/rubrical:ru.fasting.explanation.pentecost	@ltx/en_us_dedes/rubrical:ru.fasting.explanation.pentecost
ltx/en_us_public/rubrical:ru.fasting.explanation.title	@ltx/en_us_dedes/rubrical:ru.fasting.explanation.title
ltx/en_us_public/rubrical:ru.fasting.explanation.triodion1	@ltx/en_us_dedes/rubrical:ru.fasting.explanation.triodion1
ltx/en_us_public/rubrical:ru.fasting.explanation.triodion3	@ltx/en_us_dedes/rubrical:ru.fasting.explanation.triodion3
ltx/en_us_public/rubrical:ru.fasting.explanation.wedfri	@ltx/en_us_dedes/rubrical:ru.fasting.explanation.wedfri
ltx/en_us_public/rubrical:ru.fasting.rule.dairy	@ltx/en_us_goa/rubrical:ru.fasting.rule.dairy
ltx/en_us_public/rubrical:ru.fasting.rule.fish	@ltx/en_us_goa/rubrical:ru.fasting.rule.fish
ltx/en_us_public/rubrical:ru.fasting.rule.free	@ltx/en_us_goa/rubrical:ru.fasting.rule.free
ltx/en_us_public/rubrical:ru.fasting.rule.oil	@ltx/en_us_goa/rubrical:ru.fasting.rule.oil
ltx/en_us_public/rubrical:ru.fasting.rule.strict	@ltx/en_us_goa/rubrical:ru.fasting.rule.strict
ltx/en_us_public/rubrical:ru.fasting.rule.title	@ltx/en_us_goa/rubrical:ru.fasting.rule.title
ltx/en_us_public/rubrical:ru.standing.matins.gospel	@ltx/en_us_dedes/rubrical:ru.standing.matins.gospel
ltx/en_us_public/rubrical:ru.standing.matins.greatdoxology	@ltx/en_us_dedes/rubrical:ru.standing.matins.greatdoxology
ltx/en_us_public/rubrical:ru.standing.matins.ode9	@ltx/en_us_dedes/rubrical:ru.standing.matins.ode9
ltx/en_us_public/rubrical:ru.standing.matins.sixpsalms	@ltx/en_us_dedes/rubrical:ru.standing.matins.sixpsalms
ltx/en_us_public/rubrical:ru.standing.matins.smalldoxology	@ltx/en_us_dedes/rubrical:ru.standing.matins.smalldoxology
ltx/en_us_public/rubrical:ru.standing.matins.synaxarion	@ltx/en_us_dedes/rubrical:ru.standing.matins.synaxarion
ltx/en_us_public/rubrical:ru.standing.prefix	@ltx/en_us_dedes/rubrical:ru.standing.prefix
ltx/en_us_public/rubrical:ru.standing.vespers.entrance	@ltx/en_us_dedes/rubrical:ru.standing.vespers.entrance
ltx/en_us_public/rubrical:ru.standing.vespers.gladsomelight	@ltx/en_us_dedes/rubrical:ru.standing.vespers.gladsomelight
ltx/en_us_public/rubrical:ru.standing.vespers.introductorypsalm	@ltx/en_us_dedes/rubrical:ru.standing.vespers.introductorypsalm
ltx/en_us_public/rubrical:ru.standing.vespers.prayer	@ltx/en_us_dedes/rubrical:ru.standing.vespers.prayer
ltx/en_us_public/rubrical:ru.standing.vespers.simeonprayer	@ltx/en_us_dedes/rubrical:ru.standing.vespers.simeonprayer
ltx/en_us_public/rubrical:ru.transfer.service.date.apr23	@ltx/en_us_dedes/rubrical:ru.transfer.service.date.apr23
ltx/en_us_public/rubrical:ru.transfer.service.date.apr25	@ltx/en_us_dedes/rubrical:ru.transfer.service.date.apr25
ltx/en_us_public/rubrical:ru.transfer.service.date.feb23	@ltx/en_us_dedes/rubrical:ru.transfer.service.date.feb23
ltx/en_us_public/rubrical:ru.transfer.service.date.feb24	@ltx/en_us_dedes/rubrical:ru.transfer.service.date.feb24
ltx/en_us_public/rubrical:ru.transfer.service.date.jun04	@ltx/en_us_dedes/rubrical:ru.transfer.service.date.jun04
ltx/en_us_public/rubrical:ru.transfer.service.date.jun24	@ltx/en_us_dedes/rubrical:ru.transfer.service.date.jun24
ltx/en_us_public/rubrical:ru.transfer.service.date.mar09	@ltx/en_us_dedes/rubrical:ru.transfer.service.date.mar09
ltx/en_us_public/rubrical:ru.transfer.service.date.may02	@ltx/en_us_dedes/rubrical:ru.transfer.service.date.may02
ltx/en_us_public/rubrical:ru.transfer.service.date.may08	@ltx/en_us_dedes/rubrical:ru.transfer.service.date.may08
ltx/en_us_public/rubrical:ru.transfer.service.date.may21	@ltx/en_us_dedes/rubrical:ru.transfer.service.date.may21
ltx/en_us_public/rubrical:ru.transfer.service.date.may25	@ltx/en_us_dedes/rubrical:ru.transfer.service.date.may25
ltx/en_us_public/rubrical:ru.unavailable.octoechos	@ltx/en_us_goadedes/rubrical:ru.unavailable.octoechos
