ltx/en_us_public/le.go.lu.d014:leluLI.Gospel.book_abbr	@ltx/en_us_rsv/le.go.lu.d014:leluLI.Gospel.book_abbr
ltx/en_us_public/le.go.lu.d014:leluLI.Gospel.book_string	@ltx/en_us_rsv/le.go.lu.d014:leluLI.Gospel.book_string
ltx/en_us_public/le.go.lu.d014:leluLI.Gospel.chapverse	@ltx/en_us_rsv/le.go.lu.d014:leluLI.Gospel.chapverse
ltx/en_us_public/le.go.lu.d014:leluLI.Gospel.incipit	@ltx/en_us_rsv/le.go.lu.d014:leluLI.Gospel.incipit
ltx/en_us_public/le.go.lu.d014:leluLI.Gospel.text	@ltx/en_us_rsv/le.go.lu.d014:leluLI.Gospel.text
ltx/en_us_public/le.go.lu.d014:leluLI.Gospel.title	@ltx/en_us_rsv/le.go.lu.d014:leluLI.Gospel.title
ltx/en_us_public/le.go.lu.d014:leluLI.Gospel.title_abbr	@ltx/en_us_rsv/le.go.lu.d014:leluLI.Gospel.title_abbr
ltx/en_us_public/le.go.lu.d014:leluLI.Gospel.version	@ltx/en_us_rsv/le.go.lu.d014:leluLI.Gospel.version
