ltx/en_us_public/me.m01.d18:meDA.commemoration.first	@ltx/en_us_dedes/me.m01.d18:meDA.commemoration.first
ltx/en_us_public/me.m01.d18:meDA.commemoration.first_name	@ltx/en_us_dedes/me.m01.d18:meDA.commemoration.first_name
ltx/en_us_public/me.m01.d18:meDA.commemoration.first_short	@ltx/en_us_dedes/me.m01.d18:meDA.commemoration.first_short
ltx/en_us_public/me.m01.d18:meDA.commemoration.first_title	@ltx/en_us_dedes/me.m01.d18:meDA.commemoration.first_title
ltx/en_us_public/me.m01.d18:meDA.commemoration.full	@ltx/en_us_dedes/me.m01.d18:meDA.commemoration.full
ltx/en_us_public/me.m01.d18:meDA.commemoration.second_name	@ltx/en_us_dedes/me.m01.d18:meDA.commemoration.second_name
ltx/en_us_public/me.m01.d18:meDA.commemoration.second_title	@ltx/en_us_dedes/me.m01.d18:meDA.commemoration.second_title
ltx/en_us_public/me.m01.d18:meDA.date	@ltx/en_us_dedes/me.m01.d18:meDA.date
ltx/en_us_public/me.m01.d18:meDA.insert1	@ltx/en_us_dedes/me.m01.d18:meDA.insert1
ltx/en_us_public/me.m01.d18:meDA.insert2	@ltx/en_us_dedes/me.m01.d18:meDA.insert2
ltx/en_us_public/me.m01.d18:meDA.note	@ltx/en_us_dedes/me.m01.d18:meDA.note
ltx/en_us_public/me.m01.d18:meHO.commemorations	@ltx/en_us_dedes/me.m01.d18:meHO.commemorations
ltx/en_us_public/me.m01.d18:meHO.note1	@ltx/en_us_dedes/me.m01.d18:meHO.note1
ltx/en_us_public/me.m01.d18:meHO.note2	@ltx/en_us_dedes/me.m01.d18:meHO.note2
ltx/en_us_public/me.m01.d18:meHO.number	@ltx/en_us_dedes/me.m01.d18:meHO.number
ltx/en_us_public/me.m01.d18:meHO.rank	@ltx/en_us_dedes/me.m01.d18:meHO.rank
ltx/en_us_public/me.m01.d18:meLE.commemoration1	@ltx/en_us_dedes/me.m01.d18:meLE.commemoration1
ltx/en_us_public/me.m01.d18:meLE.commemoration2	@ltx/en_us_dedes/me.m01.d18:meLE.commemoration2
ltx/en_us_public/me.m01.d18:meLI.Kontakion1.greekmelody	@ltx/en_us_dedes/me.m01.d18:meMA.Kontakion1.greekmelody
ltx/en_us_public/me.m01.d18:meLI.Kontakion1.incipit	@ltx/en_us_dedes/me.m01.d18:meMA.Kontakion1.incipit
ltx/en_us_public/me.m01.d18:meLI.Kontakion1.melody	@ltx/en_us_dedes/me.m01.d18:meMA.Kontakion1.melody
ltx/en_us_public/me.m01.d18:meLI.Kontakion1.mode	@ltx/en_us_dedes/me.m01.d18:meMA.Kontakion1.mode
ltx/en_us_public/me.m01.d18:meLI.Kontakion1.text	@ltx/en_us_dedes/me.m01.d18:meMA.Kontakion1.text
ltx/en_us_public/me.m01.d18:meLI.MM.CommunionHymn.text	@ltx/en_us_dedes/me.m01.d18:meLI.MM.CommunionHymn.text
ltx/en_us_public/me.m01.d18:meLI.Megalynarion.text	@ltx/en_us_dedes/me.m01.d18:meLI.Megalynarion.text
ltx/en_us_public/me.m01.d18:meMA.C1.acrostic.notice1	@ltx/en_us_dedes/me.m01.d18:meMA.C1.acrostic.notice1
ltx/en_us_public/me.m01.d18:meMA.C1.acrostic.text	@ltx/en_us_dedes/me.m01.d18:meMA.C1.acrostic.text
ltx/en_us_public/me.m01.d18:meMA.C1.acrostic.title	@ltx/en_us_dedes/me.m01.d18:meMA.C1.acrostic.title
ltx/en_us_public/me.m01.d18:meMA.C1.title	@ltx/en_us_dedes/me.m01.d18:meMA.C1.title
ltx/en_us_public/me.m01.d18:meMA.C1.verse	@ltx/en_us_dedes/me.m01.d18:meMA.C1.verse
ltx/en_us_public/me.m01.d18:meMA.C2.acrostic.notice1	@ltx/en_us_dedes/me.m01.d18:meMA.C2.acrostic.notice1
ltx/en_us_public/me.m01.d18:meMA.C2.acrostic.text	@ltx/en_us_dedes/me.m01.d18:meMA.C2.acrostic.text
ltx/en_us_public/me.m01.d18:meMA.C2.acrostic.title	@ltx/en_us_dedes/me.m01.d18:meMA.C2.acrostic.title
ltx/en_us_public/me.m01.d18:meMA.C2.poet	@ltx/en_us_dedes/me.m01.d18:meMA.C2.poet
ltx/en_us_public/me.m01.d18:meMA.C2.title	@ltx/en_us_dedes/me.m01.d18:meMA.C2.title
ltx/en_us_public/me.m01.d18:meMA.C2.verse	@ltx/en_us_dedes/me.m01.d18:meMA.C2.verse
ltx/en_us_public/me.m01.d18:meMA.ExapTheotokion.incipit	@ltx/en_us_dedes/me.m01.d18:meMA.ExapTheotokion.incipit
ltx/en_us_public/me.m01.d18:meMA.ExapTheotokion.melody	@ltx/en_us_dedes/me.m01.d18:meMA.ExapTheotokion.melody
ltx/en_us_public/me.m01.d18:meMA.ExapTheotokion.mode	@ltx/en_us_dedes/me.m01.d18:meMA.ExapTheotokion.mode
ltx/en_us_public/me.m01.d18:meMA.ExapTheotokion.text	@ltx/en_us_dedes/me.m01.d18:meMA.ExapTheotokion.text
ltx/en_us_public/me.m01.d18:meMA.Exaposteilarion1.greekmelody	@ltx/en_us_dedes/me.m01.d18:meMA.Exaposteilarion1.greekmelody
ltx/en_us_public/me.m01.d18:meMA.Exaposteilarion1.incipit	@ltx/en_us_dedes/me.m01.d18:meMA.Exaposteilarion1.incipit
ltx/en_us_public/me.m01.d18:meMA.Exaposteilarion1.melody	@ltx/en_us_dedes/me.m01.d18:meMA.Exaposteilarion1.melody
ltx/en_us_public/me.m01.d18:meMA.Exaposteilarion1.mode	@ltx/en_us_dedes/me.m01.d18:meMA.Exaposteilarion1.mode
ltx/en_us_public/me.m01.d18:meMA.Exaposteilarion1.text	@ltx/en_us_dedes/me.m01.d18:meMA.Exaposteilarion1.text
ltx/en_us_public/me.m01.d18:meMA.Kathisma11.greekmelody	@ltx/en_us_dedes/me.m01.d18:meMA.Kathisma11.greekmelody
ltx/en_us_public/me.m01.d18:meMA.Kathisma11.incipit	@ltx/en_us_dedes/me.m01.d18:meMA.Kathisma11.incipit
ltx/en_us_public/me.m01.d18:meMA.Kathisma11.melody	@ltx/en_us_dedes/me.m01.d18:meMA.Kathisma11.melody
ltx/en_us_public/me.m01.d18:meMA.Kathisma11.mode	@ltx/en_us_dedes/me.m01.d18:meMA.Kathisma11.mode
ltx/en_us_public/me.m01.d18:meMA.Kathisma11.text	@ltx/en_us_dedes/me.m01.d18:meMA.Kathisma11.text
ltx/en_us_public/me.m01.d18:meMA.Kathisma1T.incipit	@ltx/en_us_goadedes/me.m01.d18:meMA.Kathisma1T.incipit
ltx/en_us_public/me.m01.d18:meMA.Kathisma1T.melody	@ltx/en_us_goadedes/me.m01.d18:meMA.Kathisma1T.melody
ltx/en_us_public/me.m01.d18:meMA.Kathisma1T.mode	@ltx/en_us_goadedes/me.m01.d18:meMA.Kathisma1T.mode
ltx/en_us_public/me.m01.d18:meMA.Kathisma1T.text	@ltx/en_us_goadedes/me.m01.d18:meMA.Kathisma1T.text
ltx/en_us_public/me.m01.d18:meMA.Kathisma21.greekmelody	@ltx/en_us_dedes/me.m01.d18:meMA.Kathisma21.greekmelody
ltx/en_us_public/me.m01.d18:meMA.Kathisma21.incipit	@ltx/en_us_dedes/me.m01.d18:meMA.Kathisma21.incipit
ltx/en_us_public/me.m01.d18:meMA.Kathisma21.melody	@ltx/en_us_dedes/me.m01.d18:meMA.Kathisma21.melody
ltx/en_us_public/me.m01.d18:meMA.Kathisma21.mode	@ltx/en_us_dedes/me.m01.d18:meMA.Kathisma21.mode
ltx/en_us_public/me.m01.d18:meMA.Kathisma21.text	@ltx/en_us_dedes/me.m01.d18:meMA.Kathisma21.text
ltx/en_us_public/me.m01.d18:meMA.Kathisma2T.incipit	@ltx/en_us_goadedes/me.m01.d18:meMA.Kathisma2T.incipit
ltx/en_us_public/me.m01.d18:meMA.Kathisma2T.melody	@ltx/en_us_goadedes/me.m01.d18:meMA.Kathisma2T.melody
ltx/en_us_public/me.m01.d18:meMA.Kathisma2T.mode	@ltx/en_us_goadedes/me.m01.d18:meMA.Kathisma2T.mode
ltx/en_us_public/me.m01.d18:meMA.Kathisma2T.text	@ltx/en_us_goadedes/me.m01.d18:meMA.Kathisma2T.text
ltx/en_us_public/me.m01.d18:meMA.Kathisma31.greekmelody	@ltx/en_us_dedes/me.m01.d18:meMA.Kathisma31.greekmelody
ltx/en_us_public/me.m01.d18:meMA.Kathisma31.incipit	@ltx/en_us_dedes/me.m01.d18:meMA.Kathisma31.incipit
ltx/en_us_public/me.m01.d18:meMA.Kathisma31.melody	@ltx/en_us_dedes/me.m01.d18:meMA.Kathisma31.melody
ltx/en_us_public/me.m01.d18:meMA.Kathisma31.mode	@ltx/en_us_dedes/me.m01.d18:meMA.Kathisma31.mode
ltx/en_us_public/me.m01.d18:meMA.Kathisma31.text	@ltx/en_us_dedes/me.m01.d18:meMA.Kathisma31.text
ltx/en_us_public/me.m01.d18:meMA.Kathisma3T.incipit	@ltx/en_us_goadedes/me.m01.d18:meMA.Kathisma3T.incipit
ltx/en_us_public/me.m01.d18:meMA.Kathisma3T.melody	@ltx/en_us_goadedes/me.m01.d18:meMA.Kathisma3T.melody
ltx/en_us_public/me.m01.d18:meMA.Kathisma3T.mode	@ltx/en_us_goadedes/me.m01.d18:meMA.Kathisma3T.mode
ltx/en_us_public/me.m01.d18:meMA.Kathisma3T.text	@ltx/en_us_goadedes/me.m01.d18:meMA.Kathisma3T.text
ltx/en_us_public/me.m01.d18:meMA.Kontakion1.greekmelody	@ltx/en_us_dedes/me.m01.d18:meMA.Kontakion1.greekmelody
ltx/en_us_public/me.m01.d18:meMA.Kontakion1.incipit	@ltx/en_us_dedes/me.m01.d18:meMA.Kontakion1.incipit
ltx/en_us_public/me.m01.d18:meMA.Kontakion1.melody	@ltx/en_us_dedes/me.m01.d18:meMA.Kontakion1.melody
ltx/en_us_public/me.m01.d18:meMA.Kontakion1.mode	@ltx/en_us_dedes/me.m01.d18:meMA.Kontakion1.mode
ltx/en_us_public/me.m01.d18:meMA.Kontakion1.text	@ltx/en_us_dedes/me.m01.d18:meMA.Kontakion1.text
ltx/en_us_public/me.m01.d18:meMA.Kontakion2.incipit	@ltx/en_us_dedes/me.m01.d18:meMA.Kontakion2.incipit
ltx/en_us_public/me.m01.d18:meMA.Kontakion2.melody	@ltx/en_us_dedes/me.m01.d18:meMA.Kontakion2.melody
ltx/en_us_public/me.m01.d18:meMA.Kontakion2.mode	@ltx/en_us_dedes/me.m01.d18:meMA.Kontakion2.mode
ltx/en_us_public/me.m01.d18:meMA.Kontakion2.text	@ltx/en_us_dedes/me.m01.d18:meMA.Kontakion2.text
ltx/en_us_public/me.m01.d18:meMA.Lauds1.greekmelody	@ltx/en_us_dedes/me.m01.d18:meMA.Lauds1.greekmelody
ltx/en_us_public/me.m01.d18:meMA.Lauds1.incipit	@ltx/en_us_dedes/me.m01.d18:meMA.Lauds1.incipit
ltx/en_us_public/me.m01.d18:meMA.Lauds1.melody	@ltx/en_us_dedes/me.m01.d18:meMA.Lauds1.melody
ltx/en_us_public/me.m01.d18:meMA.Lauds1.mode	@ltx/en_us_dedes/me.m01.d18:meMA.Lauds1.mode
ltx/en_us_public/me.m01.d18:meMA.Lauds1.text	@ltx/en_us_dedes/me.m01.d18:meMA.Lauds1.text
ltx/en_us_public/me.m01.d18:meMA.Lauds2.incipit	@ltx/en_us_dedes/me.m01.d18:meMA.Lauds2.incipit
ltx/en_us_public/me.m01.d18:meMA.Lauds2.melody	@ltx/en_us_dedes/me.m01.d18:meMA.Lauds2.melody
ltx/en_us_public/me.m01.d18:meMA.Lauds2.mode	@ltx/en_us_dedes/me.m01.d18:meMA.Lauds2.mode
ltx/en_us_public/me.m01.d18:meMA.Lauds2.text	@ltx/en_us_dedes/me.m01.d18:meMA.Lauds2.text
ltx/en_us_public/me.m01.d18:meMA.Lauds3.incipit	@ltx/en_us_dedes/me.m01.d18:meMA.Lauds3.incipit
ltx/en_us_public/me.m01.d18:meMA.Lauds3.melody	@ltx/en_us_dedes/me.m01.d18:meMA.Lauds3.melody
ltx/en_us_public/me.m01.d18:meMA.Lauds3.mode	@ltx/en_us_dedes/me.m01.d18:meMA.Lauds3.mode
ltx/en_us_public/me.m01.d18:meMA.Lauds3.text	@ltx/en_us_dedes/me.m01.d18:meMA.Lauds3.text
ltx/en_us_public/me.m01.d18:meMA.Lauds4.greekmelody	@ltx/en_us_dedes/me.m01.d18:meMA.Lauds4.greekmelody
ltx/en_us_public/me.m01.d18:meMA.Lauds4.incipit	@ltx/en_us_dedes/me.m01.d18:meMA.Lauds4.incipit
ltx/en_us_public/me.m01.d18:meMA.Lauds4.melody	@ltx/en_us_dedes/me.m01.d18:meMA.Lauds4.melody
ltx/en_us_public/me.m01.d18:meMA.Lauds4.mode	@ltx/en_us_dedes/me.m01.d18:meMA.Lauds4.mode
ltx/en_us_public/me.m01.d18:meMA.Lauds4.text	@ltx/en_us_dedes/me.m01.d18:meMA.Lauds4.text
ltx/en_us_public/me.m01.d18:meMA.LaudsGlory.incipit	@ltx/en_us_dedes/me.m01.d18:meMA.LaudsGlory.incipit
ltx/en_us_public/me.m01.d18:meMA.LaudsGlory.melody	@ltx/en_us_dedes/me.m01.d18:meMA.LaudsGlory.melody
ltx/en_us_public/me.m01.d18:meMA.LaudsGlory.mode	@ltx/en_us_dedes/me.m01.d18:meMA.LaudsGlory.mode
ltx/en_us_public/me.m01.d18:meMA.LaudsGlory.text	@ltx/en_us_dedes/me.m01.d18:meMA.LaudsGlory.text
ltx/en_us_public/me.m01.d18:meMA.LaudsTheotokion.incipit	@ltx/en_us_dedes/me.m01.d18:meMA.LaudsTheotokion.incipit
ltx/en_us_public/me.m01.d18:meMA.LaudsTheotokion.melody	@ltx/en_us_dedes/me.m01.d18:meMA.LaudsTheotokion.melody
ltx/en_us_public/me.m01.d18:meMA.LaudsTheotokion.mode	@ltx/en_us_dedes/me.m01.d18:meMA.LaudsTheotokion.mode
ltx/en_us_public/me.m01.d18:meMA.LaudsTheotokion.text	@ltx/en_us_dedes/me.m01.d18:meMA.LaudsTheotokion.text
ltx/en_us_public/me.m01.d18:meMA.MM.Lauds1234as5678.text	@ltx/en_us_dedes/me.m01.d18:meMA.MM.Lauds1234as5678.text
ltx/en_us_public/me.m01.d18:meMA.Ode1C11.greekmelody	@ltx/en_us_dedes/me.m01.d18:meMA.Ode1C11.greekmelody
ltx/en_us_public/me.m01.d18:meMA.Ode1C11.incipit	@ltx/en_us_dedes/me.m01.d18:meMA.Ode1C11.incipit
ltx/en_us_public/me.m01.d18:meMA.Ode1C11.melody	@ltx/en_us_dedes/me.m01.d18:meMA.Ode1C11.melody
ltx/en_us_public/me.m01.d18:meMA.Ode1C11.mode	@ltx/en_us_dedes/me.m01.d18:meMA.Ode1C11.mode
ltx/en_us_public/me.m01.d18:meMA.Ode1C11.ode	@ltx/en_us_dedes/me.m01.d18:meMA.Ode1C11.ode
ltx/en_us_public/me.m01.d18:meMA.Ode1C11.text	@ltx/en_us_dedes/me.m01.d18:meMA.Ode1C11.text
ltx/en_us_public/me.m01.d18:meMA.Ode1C12.incipit	@ltx/en_us_dedes/me.m01.d18:meMA.Ode1C12.incipit
ltx/en_us_public/me.m01.d18:meMA.Ode1C12.melody	@ltx/en_us_dedes/me.m01.d18:meMA.Ode1C12.melody
ltx/en_us_public/me.m01.d18:meMA.Ode1C12.mode	@ltx/en_us_dedes/me.m01.d18:meMA.Ode1C12.mode
ltx/en_us_public/me.m01.d18:meMA.Ode1C12.ode	@ltx/en_us_dedes/me.m01.d18:meMA.Ode1C12.ode
ltx/en_us_public/me.m01.d18:meMA.Ode1C12.text	@ltx/en_us_dedes/me.m01.d18:meMA.Ode1C12.text
ltx/en_us_public/me.m01.d18:meMA.Ode1C13.incipit	@ltx/en_us_dedes/me.m01.d18:meMA.Ode1C13.incipit
ltx/en_us_public/me.m01.d18:meMA.Ode1C13.melody	@ltx/en_us_dedes/me.m01.d18:meMA.Ode1C13.melody
ltx/en_us_public/me.m01.d18:meMA.Ode1C13.mode	@ltx/en_us_dedes/me.m01.d18:meMA.Ode1C13.mode
ltx/en_us_public/me.m01.d18:meMA.Ode1C13.ode	@ltx/en_us_dedes/me.m01.d18:meMA.Ode1C13.ode
ltx/en_us_public/me.m01.d18:meMA.Ode1C13.text	@ltx/en_us_dedes/me.m01.d18:meMA.Ode1C13.text
ltx/en_us_public/me.m01.d18:meMA.Ode1C14.incipit	@ltx/en_us_dedes/me.m01.d18:meMA.Ode1C14.incipit
ltx/en_us_public/me.m01.d18:meMA.Ode1C14.melody	@ltx/en_us_dedes/me.m01.d18:meMA.Ode1C14.melody
ltx/en_us_public/me.m01.d18:meMA.Ode1C14.mode	@ltx/en_us_dedes/me.m01.d18:meMA.Ode1C14.mode
ltx/en_us_public/me.m01.d18:meMA.Ode1C14.ode	@ltx/en_us_dedes/me.m01.d18:meMA.Ode1C14.ode
ltx/en_us_public/me.m01.d18:meMA.Ode1C14.text	@ltx/en_us_dedes/me.m01.d18:meMA.Ode1C14.text
ltx/en_us_public/me.m01.d18:meMA.Ode1C1T.incipit	@ltx/en_us_dedes/me.m01.d18:meMA.Ode1C1T.incipit
ltx/en_us_public/me.m01.d18:meMA.Ode1C1T.melody	@ltx/en_us_dedes/me.m01.d18:meMA.Ode1C1T.melody
ltx/en_us_public/me.m01.d18:meMA.Ode1C1T.mode	@ltx/en_us_dedes/me.m01.d18:meMA.Ode1C1T.mode
ltx/en_us_public/me.m01.d18:meMA.Ode1C1T.ode	@ltx/en_us_dedes/me.m01.d18:meMA.Ode1C1T.ode
ltx/en_us_public/me.m01.d18:meMA.Ode1C1T.text	@ltx/en_us_dedes/me.m01.d18:meMA.Ode1C1T.text
ltx/en_us_public/me.m01.d18:meMA.Ode1C21.greekmelody	@ltx/en_us_dedes/me.m01.d18:meMA.Ode1C21.greekmelody
ltx/en_us_public/me.m01.d18:meMA.Ode1C21.incipit	@ltx/en_us_dedes/me.m01.d18:meMA.Ode1C21.incipit
ltx/en_us_public/me.m01.d18:meMA.Ode1C21.melody	@ltx/en_us_dedes/me.m01.d18:meMA.Ode1C21.melody
ltx/en_us_public/me.m01.d18:meMA.Ode1C21.mode	@ltx/en_us_dedes/me.m01.d18:meMA.Ode1C21.mode
ltx/en_us_public/me.m01.d18:meMA.Ode1C21.ode	@ltx/en_us_dedes/me.m01.d18:meMA.Ode1C21.ode
ltx/en_us_public/me.m01.d18:meMA.Ode1C21.text	@ltx/en_us_dedes/me.m01.d18:meMA.Ode1C21.text
ltx/en_us_public/me.m01.d18:meMA.Ode1C22.incipit	@ltx/en_us_dedes/me.m01.d18:meMA.Ode1C22.incipit
ltx/en_us_public/me.m01.d18:meMA.Ode1C22.melody	@ltx/en_us_dedes/me.m01.d18:meMA.Ode1C22.melody
ltx/en_us_public/me.m01.d18:meMA.Ode1C22.mode	@ltx/en_us_dedes/me.m01.d18:meMA.Ode1C22.mode
ltx/en_us_public/me.m01.d18:meMA.Ode1C22.ode	@ltx/en_us_dedes/me.m01.d18:meMA.Ode1C22.ode
ltx/en_us_public/me.m01.d18:meMA.Ode1C22.text	@ltx/en_us_dedes/me.m01.d18:meMA.Ode1C22.text
ltx/en_us_public/me.m01.d18:meMA.Ode1C23.incipit	@ltx/en_us_dedes/me.m01.d18:meMA.Ode1C23.incipit
ltx/en_us_public/me.m01.d18:meMA.Ode1C23.melody	@ltx/en_us_dedes/me.m01.d18:meMA.Ode1C23.melody
ltx/en_us_public/me.m01.d18:meMA.Ode1C23.mode	@ltx/en_us_dedes/me.m01.d18:meMA.Ode1C23.mode
ltx/en_us_public/me.m01.d18:meMA.Ode1C23.ode	@ltx/en_us_dedes/me.m01.d18:meMA.Ode1C23.ode
ltx/en_us_public/me.m01.d18:meMA.Ode1C23.text	@ltx/en_us_dedes/me.m01.d18:meMA.Ode1C23.text
ltx/en_us_public/me.m01.d18:meMA.Ode1C2T.incipit	@ltx/en_us_dedes/me.m01.d18:meMA.Ode1C2T.incipit
ltx/en_us_public/me.m01.d18:meMA.Ode1C2T.melody	@ltx/en_us_dedes/me.m01.d18:meMA.Ode1C2T.melody
ltx/en_us_public/me.m01.d18:meMA.Ode1C2T.mode	@ltx/en_us_dedes/me.m01.d18:meMA.Ode1C2T.mode
ltx/en_us_public/me.m01.d18:meMA.Ode1C2T.ode	@ltx/en_us_dedes/me.m01.d18:meMA.Ode1C2T.ode
ltx/en_us_public/me.m01.d18:meMA.Ode1C2T.text	@ltx/en_us_dedes/me.m01.d18:meMA.Ode1C2T.text
ltx/en_us_public/me.m01.d18:meMA.Ode3C11.greekmelody	@ltx/en_us_dedes/me.m01.d18:meMA.Ode3C11.greekmelody
ltx/en_us_public/me.m01.d18:meMA.Ode3C11.incipit	@ltx/en_us_dedes/me.m01.d18:meMA.Ode3C11.incipit
ltx/en_us_public/me.m01.d18:meMA.Ode3C11.melody	@ltx/en_us_dedes/me.m01.d18:meMA.Ode3C11.melody
ltx/en_us_public/me.m01.d18:meMA.Ode3C11.mode	@ltx/en_us_dedes/me.m01.d18:meMA.Ode3C11.mode
ltx/en_us_public/me.m01.d18:meMA.Ode3C11.ode	@ltx/en_us_dedes/me.m01.d18:meMA.Ode3C11.ode
ltx/en_us_public/me.m01.d18:meMA.Ode3C11.text	@ltx/en_us_dedes/me.m01.d18:meMA.Ode3C11.text
ltx/en_us_public/me.m01.d18:meMA.Ode3C12.incipit	@ltx/en_us_dedes/me.m01.d18:meMA.Ode3C12.incipit
ltx/en_us_public/me.m01.d18:meMA.Ode3C12.melody	@ltx/en_us_dedes/me.m01.d18:meMA.Ode3C12.melody
ltx/en_us_public/me.m01.d18:meMA.Ode3C12.mode	@ltx/en_us_dedes/me.m01.d18:meMA.Ode3C12.mode
ltx/en_us_public/me.m01.d18:meMA.Ode3C12.ode	@ltx/en_us_dedes/me.m01.d18:meMA.Ode3C12.ode
ltx/en_us_public/me.m01.d18:meMA.Ode3C12.text	@ltx/en_us_dedes/me.m01.d18:meMA.Ode3C12.text
ltx/en_us_public/me.m01.d18:meMA.Ode3C13.incipit	@ltx/en_us_dedes/me.m01.d18:meMA.Ode3C13.incipit
ltx/en_us_public/me.m01.d18:meMA.Ode3C13.melody	@ltx/en_us_dedes/me.m01.d18:meMA.Ode3C13.melody
ltx/en_us_public/me.m01.d18:meMA.Ode3C13.mode	@ltx/en_us_dedes/me.m01.d18:meMA.Ode3C13.mode
ltx/en_us_public/me.m01.d18:meMA.Ode3C13.ode	@ltx/en_us_dedes/me.m01.d18:meMA.Ode3C13.ode
ltx/en_us_public/me.m01.d18:meMA.Ode3C13.text	@ltx/en_us_dedes/me.m01.d18:meMA.Ode3C13.text
ltx/en_us_public/me.m01.d18:meMA.Ode3C1T.incipit	@ltx/en_us_dedes/me.m01.d18:meMA.Ode3C1T.incipit
ltx/en_us_public/me.m01.d18:meMA.Ode3C1T.melody	@ltx/en_us_dedes/me.m01.d18:meMA.Ode3C1T.melody
ltx/en_us_public/me.m01.d18:meMA.Ode3C1T.mode	@ltx/en_us_dedes/me.m01.d18:meMA.Ode3C1T.mode
ltx/en_us_public/me.m01.d18:meMA.Ode3C1T.ode	@ltx/en_us_dedes/me.m01.d18:meMA.Ode3C1T.ode
ltx/en_us_public/me.m01.d18:meMA.Ode3C1T.text	@ltx/en_us_dedes/me.m01.d18:meMA.Ode3C1T.text
ltx/en_us_public/me.m01.d18:meMA.Ode3C21.greekmelody	@ltx/en_us_dedes/me.m01.d18:meMA.Ode3C21.greekmelody
ltx/en_us_public/me.m01.d18:meMA.Ode3C21.incipit	@ltx/en_us_dedes/me.m01.d18:meMA.Ode3C21.incipit
ltx/en_us_public/me.m01.d18:meMA.Ode3C21.melody	@ltx/en_us_dedes/me.m01.d18:meMA.Ode3C21.melody
ltx/en_us_public/me.m01.d18:meMA.Ode3C21.mode	@ltx/en_us_dedes/me.m01.d18:meMA.Ode3C21.mode
ltx/en_us_public/me.m01.d18:meMA.Ode3C21.ode	@ltx/en_us_dedes/me.m01.d18:meMA.Ode3C21.ode
ltx/en_us_public/me.m01.d18:meMA.Ode3C21.text	@ltx/en_us_dedes/me.m01.d18:meMA.Ode3C21.text
ltx/en_us_public/me.m01.d18:meMA.Ode3C22.incipit	@ltx/en_us_dedes/me.m01.d18:meMA.Ode3C22.incipit
ltx/en_us_public/me.m01.d18:meMA.Ode3C22.melody	@ltx/en_us_dedes/me.m01.d18:meMA.Ode3C22.melody
ltx/en_us_public/me.m01.d18:meMA.Ode3C22.mode	@ltx/en_us_dedes/me.m01.d18:meMA.Ode3C22.mode
ltx/en_us_public/me.m01.d18:meMA.Ode3C22.ode	@ltx/en_us_dedes/me.m01.d18:meMA.Ode3C22.ode
ltx/en_us_public/me.m01.d18:meMA.Ode3C22.text	@ltx/en_us_dedes/me.m01.d18:meMA.Ode3C22.text
ltx/en_us_public/me.m01.d18:meMA.Ode3C23.incipit	@ltx/en_us_dedes/me.m01.d18:meMA.Ode3C23.incipit
ltx/en_us_public/me.m01.d18:meMA.Ode3C23.melody	@ltx/en_us_dedes/me.m01.d18:meMA.Ode3C23.melody
ltx/en_us_public/me.m01.d18:meMA.Ode3C23.mode	@ltx/en_us_dedes/me.m01.d18:meMA.Ode3C23.mode
ltx/en_us_public/me.m01.d18:meMA.Ode3C23.ode	@ltx/en_us_dedes/me.m01.d18:meMA.Ode3C23.ode
ltx/en_us_public/me.m01.d18:meMA.Ode3C23.text	@ltx/en_us_dedes/me.m01.d18:meMA.Ode3C23.text
ltx/en_us_public/me.m01.d18:meMA.Ode3C2T.incipit	@ltx/en_us_dedes/me.m01.d18:meMA.Ode3C2T.incipit
ltx/en_us_public/me.m01.d18:meMA.Ode3C2T.melody	@ltx/en_us_dedes/me.m01.d18:meMA.Ode3C2T.melody
ltx/en_us_public/me.m01.d18:meMA.Ode3C2T.mode	@ltx/en_us_dedes/me.m01.d18:meMA.Ode3C2T.mode
ltx/en_us_public/me.m01.d18:meMA.Ode3C2T.ode	@ltx/en_us_dedes/me.m01.d18:meMA.Ode3C2T.ode
ltx/en_us_public/me.m01.d18:meMA.Ode3C2T.text	@ltx/en_us_dedes/me.m01.d18:meMA.Ode3C2T.text
ltx/en_us_public/me.m01.d18:meMA.Ode3Kathisma1.greekmelody	@ltx/en_us_dedes/me.m01.d18:meMA.Ode3Kathisma1.greekmelody
ltx/en_us_public/me.m01.d18:meMA.Ode3Kathisma1.incipit	@ltx/en_us_dedes/me.m01.d18:meMA.Ode3Kathisma1.incipit
ltx/en_us_public/me.m01.d18:meMA.Ode3Kathisma1.melody	@ltx/en_us_dedes/me.m01.d18:meMA.Ode3Kathisma1.melody
ltx/en_us_public/me.m01.d18:meMA.Ode3Kathisma1.mode	@ltx/en_us_dedes/me.m01.d18:meMA.Ode3Kathisma1.mode
ltx/en_us_public/me.m01.d18:meMA.Ode3Kathisma1.text	@ltx/en_us_dedes/me.m01.d18:meMA.Ode3Kathisma1.text
ltx/en_us_public/me.m01.d18:meMA.Ode3KathismaT.incipit	@ltx/en_us_dedes/me.m01.d18:meMA.Ode3KathismaT.incipit
ltx/en_us_public/me.m01.d18:meMA.Ode3KathismaT.melody	@ltx/en_us_dedes/me.m01.d18:meMA.Ode3KathismaT.melody
ltx/en_us_public/me.m01.d18:meMA.Ode3KathismaT.mode	@ltx/en_us_dedes/me.m01.d18:meMA.Ode3KathismaT.mode
ltx/en_us_public/me.m01.d18:meMA.Ode3KathismaT.text	@ltx/en_us_dedes/me.m01.d18:meMA.Ode3KathismaT.text
ltx/en_us_public/me.m01.d18:meMA.Ode4C11.greekmelody	@ltx/en_us_dedes/me.m01.d18:meMA.Ode4C11.greekmelody
ltx/en_us_public/me.m01.d18:meMA.Ode4C11.incipit	@ltx/en_us_dedes/me.m01.d18:meMA.Ode4C11.incipit
ltx/en_us_public/me.m01.d18:meMA.Ode4C11.melody	@ltx/en_us_dedes/me.m01.d18:meMA.Ode4C11.melody
ltx/en_us_public/me.m01.d18:meMA.Ode4C11.mode	@ltx/en_us_dedes/me.m01.d18:meMA.Ode4C11.mode
ltx/en_us_public/me.m01.d18:meMA.Ode4C11.ode	@ltx/en_us_dedes/me.m01.d18:meMA.Ode4C11.ode
ltx/en_us_public/me.m01.d18:meMA.Ode4C11.text	@ltx/en_us_dedes/me.m01.d18:meMA.Ode4C11.text
ltx/en_us_public/me.m01.d18:meMA.Ode4C12.incipit	@ltx/en_us_dedes/me.m01.d18:meMA.Ode4C12.incipit
ltx/en_us_public/me.m01.d18:meMA.Ode4C12.melody	@ltx/en_us_dedes/me.m01.d18:meMA.Ode4C12.melody
ltx/en_us_public/me.m01.d18:meMA.Ode4C12.mode	@ltx/en_us_dedes/me.m01.d18:meMA.Ode4C12.mode
ltx/en_us_public/me.m01.d18:meMA.Ode4C12.ode	@ltx/en_us_dedes/me.m01.d18:meMA.Ode4C12.ode
ltx/en_us_public/me.m01.d18:meMA.Ode4C12.text	@ltx/en_us_dedes/me.m01.d18:meMA.Ode4C12.text
ltx/en_us_public/me.m01.d18:meMA.Ode4C13.incipit	@ltx/en_us_dedes/me.m01.d18:meMA.Ode4C13.incipit
ltx/en_us_public/me.m01.d18:meMA.Ode4C13.melody	@ltx/en_us_dedes/me.m01.d18:meMA.Ode4C13.melody
ltx/en_us_public/me.m01.d18:meMA.Ode4C13.mode	@ltx/en_us_dedes/me.m01.d18:meMA.Ode4C13.mode
ltx/en_us_public/me.m01.d18:meMA.Ode4C13.ode	@ltx/en_us_dedes/me.m01.d18:meMA.Ode4C13.ode
ltx/en_us_public/me.m01.d18:meMA.Ode4C13.text	@ltx/en_us_dedes/me.m01.d18:meMA.Ode4C13.text
ltx/en_us_public/me.m01.d18:meMA.Ode4C14.incipit	@ltx/en_us_dedes/me.m01.d18:meMA.Ode4C14.incipit
ltx/en_us_public/me.m01.d18:meMA.Ode4C14.melody	@ltx/en_us_dedes/me.m01.d18:meMA.Ode4C14.melody
ltx/en_us_public/me.m01.d18:meMA.Ode4C14.mode	@ltx/en_us_dedes/me.m01.d18:meMA.Ode4C14.mode
ltx/en_us_public/me.m01.d18:meMA.Ode4C14.ode	@ltx/en_us_dedes/me.m01.d18:meMA.Ode4C14.ode
ltx/en_us_public/me.m01.d18:meMA.Ode4C14.text	@ltx/en_us_dedes/me.m01.d18:meMA.Ode4C14.text
ltx/en_us_public/me.m01.d18:meMA.Ode4C1T.incipit	@ltx/en_us_dedes/me.m01.d18:meMA.Ode4C1T.incipit
ltx/en_us_public/me.m01.d18:meMA.Ode4C1T.melody	@ltx/en_us_dedes/me.m01.d18:meMA.Ode4C1T.melody
ltx/en_us_public/me.m01.d18:meMA.Ode4C1T.mode	@ltx/en_us_dedes/me.m01.d18:meMA.Ode4C1T.mode
ltx/en_us_public/me.m01.d18:meMA.Ode4C1T.ode	@ltx/en_us_dedes/me.m01.d18:meMA.Ode4C1T.ode
ltx/en_us_public/me.m01.d18:meMA.Ode4C1T.text	@ltx/en_us_dedes/me.m01.d18:meMA.Ode4C1T.text
ltx/en_us_public/me.m01.d18:meMA.Ode4C21.greekmelody	@ltx/en_us_dedes/me.m01.d18:meMA.Ode4C21.greekmelody
ltx/en_us_public/me.m01.d18:meMA.Ode4C21.incipit	@ltx/en_us_dedes/me.m01.d18:meMA.Ode4C21.incipit
ltx/en_us_public/me.m01.d18:meMA.Ode4C21.melody	@ltx/en_us_dedes/me.m01.d18:meMA.Ode4C21.melody
ltx/en_us_public/me.m01.d18:meMA.Ode4C21.mode	@ltx/en_us_dedes/me.m01.d18:meMA.Ode4C21.mode
ltx/en_us_public/me.m01.d18:meMA.Ode4C21.ode	@ltx/en_us_dedes/me.m01.d18:meMA.Ode4C21.ode
ltx/en_us_public/me.m01.d18:meMA.Ode4C21.text	@ltx/en_us_dedes/me.m01.d18:meMA.Ode4C21.text
ltx/en_us_public/me.m01.d18:meMA.Ode4C22.incipit	@ltx/en_us_dedes/me.m01.d18:meMA.Ode4C22.incipit
ltx/en_us_public/me.m01.d18:meMA.Ode4C22.melody	@ltx/en_us_dedes/me.m01.d18:meMA.Ode4C22.melody
ltx/en_us_public/me.m01.d18:meMA.Ode4C22.mode	@ltx/en_us_dedes/me.m01.d18:meMA.Ode4C22.mode
ltx/en_us_public/me.m01.d18:meMA.Ode4C22.ode	@ltx/en_us_dedes/me.m01.d18:meMA.Ode4C22.ode
ltx/en_us_public/me.m01.d18:meMA.Ode4C22.text	@ltx/en_us_dedes/me.m01.d18:meMA.Ode4C22.text
ltx/en_us_public/me.m01.d18:meMA.Ode4C23.incipit	@ltx/en_us_dedes/me.m01.d18:meMA.Ode4C23.incipit
ltx/en_us_public/me.m01.d18:meMA.Ode4C23.melody	@ltx/en_us_dedes/me.m01.d18:meMA.Ode4C23.melody
ltx/en_us_public/me.m01.d18:meMA.Ode4C23.mode	@ltx/en_us_dedes/me.m01.d18:meMA.Ode4C23.mode
ltx/en_us_public/me.m01.d18:meMA.Ode4C23.ode	@ltx/en_us_dedes/me.m01.d18:meMA.Ode4C23.ode
ltx/en_us_public/me.m01.d18:meMA.Ode4C23.text	@ltx/en_us_dedes/me.m01.d18:meMA.Ode4C23.text
ltx/en_us_public/me.m01.d18:meMA.Ode4C2T.incipit	@ltx/en_us_dedes/me.m01.d18:meMA.Ode4C2T.incipit
ltx/en_us_public/me.m01.d18:meMA.Ode4C2T.melody	@ltx/en_us_dedes/me.m01.d18:meMA.Ode4C2T.melody
ltx/en_us_public/me.m01.d18:meMA.Ode4C2T.mode	@ltx/en_us_dedes/me.m01.d18:meMA.Ode4C2T.mode
ltx/en_us_public/me.m01.d18:meMA.Ode4C2T.ode	@ltx/en_us_dedes/me.m01.d18:meMA.Ode4C2T.ode
ltx/en_us_public/me.m01.d18:meMA.Ode4C2T.text	@ltx/en_us_dedes/me.m01.d18:meMA.Ode4C2T.text
ltx/en_us_public/me.m01.d18:meMA.Ode5C11.greekmelody	@ltx/en_us_dedes/me.m01.d18:meMA.Ode5C11.greekmelody
ltx/en_us_public/me.m01.d18:meMA.Ode5C11.incipit	@ltx/en_us_dedes/me.m01.d18:meMA.Ode5C11.incipit
ltx/en_us_public/me.m01.d18:meMA.Ode5C11.melody	@ltx/en_us_dedes/me.m01.d18:meMA.Ode5C11.melody
ltx/en_us_public/me.m01.d18:meMA.Ode5C11.mode	@ltx/en_us_dedes/me.m01.d18:meMA.Ode5C11.mode
ltx/en_us_public/me.m01.d18:meMA.Ode5C11.ode	@ltx/en_us_dedes/me.m01.d18:meMA.Ode5C11.ode
ltx/en_us_public/me.m01.d18:meMA.Ode5C11.text	@ltx/en_us_dedes/me.m01.d18:meMA.Ode5C11.text
ltx/en_us_public/me.m01.d18:meMA.Ode5C12.incipit	@ltx/en_us_dedes/me.m01.d18:meMA.Ode5C12.incipit
ltx/en_us_public/me.m01.d18:meMA.Ode5C12.melody	@ltx/en_us_dedes/me.m01.d18:meMA.Ode5C12.melody
ltx/en_us_public/me.m01.d18:meMA.Ode5C12.mode	@ltx/en_us_dedes/me.m01.d18:meMA.Ode5C12.mode
ltx/en_us_public/me.m01.d18:meMA.Ode5C12.ode	@ltx/en_us_dedes/me.m01.d18:meMA.Ode5C12.ode
ltx/en_us_public/me.m01.d18:meMA.Ode5C12.text	@ltx/en_us_dedes/me.m01.d18:meMA.Ode5C12.text
ltx/en_us_public/me.m01.d18:meMA.Ode5C13.incipit	@ltx/en_us_dedes/me.m01.d18:meMA.Ode5C13.incipit
ltx/en_us_public/me.m01.d18:meMA.Ode5C13.melody	@ltx/en_us_dedes/me.m01.d18:meMA.Ode5C13.melody
ltx/en_us_public/me.m01.d18:meMA.Ode5C13.mode	@ltx/en_us_dedes/me.m01.d18:meMA.Ode5C13.mode
ltx/en_us_public/me.m01.d18:meMA.Ode5C13.ode	@ltx/en_us_dedes/me.m01.d18:meMA.Ode5C13.ode
ltx/en_us_public/me.m01.d18:meMA.Ode5C13.text	@ltx/en_us_dedes/me.m01.d18:meMA.Ode5C13.text
ltx/en_us_public/me.m01.d18:meMA.Ode5C1T.incipit	@ltx/en_us_dedes/me.m01.d18:meMA.Ode5C1T.incipit
ltx/en_us_public/me.m01.d18:meMA.Ode5C1T.melody	@ltx/en_us_dedes/me.m01.d18:meMA.Ode5C1T.melody
ltx/en_us_public/me.m01.d18:meMA.Ode5C1T.mode	@ltx/en_us_dedes/me.m01.d18:meMA.Ode5C1T.mode
ltx/en_us_public/me.m01.d18:meMA.Ode5C1T.ode	@ltx/en_us_dedes/me.m01.d18:meMA.Ode5C1T.ode
ltx/en_us_public/me.m01.d18:meMA.Ode5C1T.text	@ltx/en_us_dedes/me.m01.d18:meMA.Ode5C1T.text
ltx/en_us_public/me.m01.d18:meMA.Ode5C21.greekmelody	@ltx/en_us_dedes/me.m01.d18:meMA.Ode5C21.greekmelody
ltx/en_us_public/me.m01.d18:meMA.Ode5C21.incipit	@ltx/en_us_dedes/me.m01.d18:meMA.Ode5C21.incipit
ltx/en_us_public/me.m01.d18:meMA.Ode5C21.melody	@ltx/en_us_dedes/me.m01.d18:meMA.Ode5C21.melody
ltx/en_us_public/me.m01.d18:meMA.Ode5C21.mode	@ltx/en_us_dedes/me.m01.d18:meMA.Ode5C21.mode
ltx/en_us_public/me.m01.d18:meMA.Ode5C21.ode	@ltx/en_us_dedes/me.m01.d18:meMA.Ode5C21.ode
ltx/en_us_public/me.m01.d18:meMA.Ode5C21.text	@ltx/en_us_dedes/me.m01.d18:meMA.Ode5C21.text
ltx/en_us_public/me.m01.d18:meMA.Ode5C22.incipit	@ltx/en_us_dedes/me.m01.d18:meMA.Ode5C22.incipit
ltx/en_us_public/me.m01.d18:meMA.Ode5C22.melody	@ltx/en_us_dedes/me.m01.d18:meMA.Ode5C22.melody
ltx/en_us_public/me.m01.d18:meMA.Ode5C22.mode	@ltx/en_us_dedes/me.m01.d18:meMA.Ode5C22.mode
ltx/en_us_public/me.m01.d18:meMA.Ode5C22.ode	@ltx/en_us_dedes/me.m01.d18:meMA.Ode5C22.ode
ltx/en_us_public/me.m01.d18:meMA.Ode5C22.text	@ltx/en_us_dedes/me.m01.d18:meMA.Ode5C22.text
ltx/en_us_public/me.m01.d18:meMA.Ode5C23.incipit	@ltx/en_us_dedes/me.m01.d18:meMA.Ode5C23.incipit
ltx/en_us_public/me.m01.d18:meMA.Ode5C23.melody	@ltx/en_us_dedes/me.m01.d18:meMA.Ode5C23.melody
ltx/en_us_public/me.m01.d18:meMA.Ode5C23.mode	@ltx/en_us_dedes/me.m01.d18:meMA.Ode5C23.mode
ltx/en_us_public/me.m01.d18:meMA.Ode5C23.ode	@ltx/en_us_dedes/me.m01.d18:meMA.Ode5C23.ode
ltx/en_us_public/me.m01.d18:meMA.Ode5C23.text	@ltx/en_us_dedes/me.m01.d18:meMA.Ode5C23.text
ltx/en_us_public/me.m01.d18:meMA.Ode5C2T.incipit	@ltx/en_us_dedes/me.m01.d18:meMA.Ode5C2T.incipit
ltx/en_us_public/me.m01.d18:meMA.Ode5C2T.melody	@ltx/en_us_dedes/me.m01.d18:meMA.Ode5C2T.melody
ltx/en_us_public/me.m01.d18:meMA.Ode5C2T.mode	@ltx/en_us_dedes/me.m01.d18:meMA.Ode5C2T.mode
ltx/en_us_public/me.m01.d18:meMA.Ode5C2T.ode	@ltx/en_us_dedes/me.m01.d18:meMA.Ode5C2T.ode
ltx/en_us_public/me.m01.d18:meMA.Ode5C2T.text	@ltx/en_us_dedes/me.m01.d18:meMA.Ode5C2T.text
ltx/en_us_public/me.m01.d18:meMA.Ode6C11.greekmelody	@ltx/en_us_dedes/me.m01.d18:meMA.Ode6C11.greekmelody
ltx/en_us_public/me.m01.d18:meMA.Ode6C11.incipit	@ltx/en_us_dedes/me.m01.d18:meMA.Ode6C11.incipit
ltx/en_us_public/me.m01.d18:meMA.Ode6C11.melody	@ltx/en_us_dedes/me.m01.d18:meMA.Ode6C11.melody
ltx/en_us_public/me.m01.d18:meMA.Ode6C11.mode	@ltx/en_us_dedes/me.m01.d18:meMA.Ode6C11.mode
ltx/en_us_public/me.m01.d18:meMA.Ode6C11.ode	@ltx/en_us_dedes/me.m01.d18:meMA.Ode6C11.ode
ltx/en_us_public/me.m01.d18:meMA.Ode6C11.text	@ltx/en_us_dedes/me.m01.d18:meMA.Ode6C11.text
ltx/en_us_public/me.m01.d18:meMA.Ode6C12.incipit	@ltx/en_us_dedes/me.m01.d18:meMA.Ode6C12.incipit
ltx/en_us_public/me.m01.d18:meMA.Ode6C12.melody	@ltx/en_us_dedes/me.m01.d18:meMA.Ode6C12.melody
ltx/en_us_public/me.m01.d18:meMA.Ode6C12.mode	@ltx/en_us_dedes/me.m01.d18:meMA.Ode6C12.mode
ltx/en_us_public/me.m01.d18:meMA.Ode6C12.ode	@ltx/en_us_dedes/me.m01.d18:meMA.Ode6C12.ode
ltx/en_us_public/me.m01.d18:meMA.Ode6C12.text	@ltx/en_us_dedes/me.m01.d18:meMA.Ode6C12.text
ltx/en_us_public/me.m01.d18:meMA.Ode6C13.incipit	@ltx/en_us_dedes/me.m01.d18:meMA.Ode6C13.incipit
ltx/en_us_public/me.m01.d18:meMA.Ode6C13.melody	@ltx/en_us_dedes/me.m01.d18:meMA.Ode6C13.melody
ltx/en_us_public/me.m01.d18:meMA.Ode6C13.mode	@ltx/en_us_dedes/me.m01.d18:meMA.Ode6C13.mode
ltx/en_us_public/me.m01.d18:meMA.Ode6C13.ode	@ltx/en_us_dedes/me.m01.d18:meMA.Ode6C13.ode
ltx/en_us_public/me.m01.d18:meMA.Ode6C13.text	@ltx/en_us_dedes/me.m01.d18:meMA.Ode6C13.text
ltx/en_us_public/me.m01.d18:meMA.Ode6C1T.incipit	@ltx/en_us_dedes/me.m01.d18:meMA.Ode6C1T.incipit
ltx/en_us_public/me.m01.d18:meMA.Ode6C1T.melody	@ltx/en_us_dedes/me.m01.d18:meMA.Ode6C1T.melody
ltx/en_us_public/me.m01.d18:meMA.Ode6C1T.mode	@ltx/en_us_dedes/me.m01.d18:meMA.Ode6C1T.mode
ltx/en_us_public/me.m01.d18:meMA.Ode6C1T.ode	@ltx/en_us_dedes/me.m01.d18:meMA.Ode6C1T.ode
ltx/en_us_public/me.m01.d18:meMA.Ode6C1T.text	@ltx/en_us_dedes/me.m01.d18:meMA.Ode6C1T.text
ltx/en_us_public/me.m01.d18:meMA.Ode6C21.greekmelody	@ltx/en_us_dedes/me.m01.d18:meMA.Ode6C21.greekmelody
ltx/en_us_public/me.m01.d18:meMA.Ode6C21.incipit	@ltx/en_us_dedes/me.m01.d18:meMA.Ode6C21.incipit
ltx/en_us_public/me.m01.d18:meMA.Ode6C21.melody	@ltx/en_us_dedes/me.m01.d18:meMA.Ode6C21.melody
ltx/en_us_public/me.m01.d18:meMA.Ode6C21.mode	@ltx/en_us_dedes/me.m01.d18:meMA.Ode6C21.mode
ltx/en_us_public/me.m01.d18:meMA.Ode6C21.ode	@ltx/en_us_dedes/me.m01.d18:meMA.Ode6C21.ode
ltx/en_us_public/me.m01.d18:meMA.Ode6C21.text	@ltx/en_us_dedes/me.m01.d18:meMA.Ode6C21.text
ltx/en_us_public/me.m01.d18:meMA.Ode6C22.incipit	@ltx/en_us_dedes/me.m01.d18:meMA.Ode6C22.incipit
ltx/en_us_public/me.m01.d18:meMA.Ode6C22.melody	@ltx/en_us_dedes/me.m01.d18:meMA.Ode6C22.melody
ltx/en_us_public/me.m01.d18:meMA.Ode6C22.mode	@ltx/en_us_dedes/me.m01.d18:meMA.Ode6C22.mode
ltx/en_us_public/me.m01.d18:meMA.Ode6C22.ode	@ltx/en_us_dedes/me.m01.d18:meMA.Ode6C22.ode
ltx/en_us_public/me.m01.d18:meMA.Ode6C22.text	@ltx/en_us_dedes/me.m01.d18:meMA.Ode6C22.text
ltx/en_us_public/me.m01.d18:meMA.Ode6C23.incipit	@ltx/en_us_dedes/me.m01.d18:meMA.Ode6C23.incipit
ltx/en_us_public/me.m01.d18:meMA.Ode6C23.melody	@ltx/en_us_dedes/me.m01.d18:meMA.Ode6C23.melody
ltx/en_us_public/me.m01.d18:meMA.Ode6C23.mode	@ltx/en_us_dedes/me.m01.d18:meMA.Ode6C23.mode
ltx/en_us_public/me.m01.d18:meMA.Ode6C23.ode	@ltx/en_us_dedes/me.m01.d18:meMA.Ode6C23.ode
ltx/en_us_public/me.m01.d18:meMA.Ode6C23.text	@ltx/en_us_dedes/me.m01.d18:meMA.Ode6C23.text
ltx/en_us_public/me.m01.d18:meMA.Ode6C2T.incipit	@ltx/en_us_dedes/me.m01.d18:meMA.Ode6C2T.incipit
ltx/en_us_public/me.m01.d18:meMA.Ode6C2T.melody	@ltx/en_us_dedes/me.m01.d18:meMA.Ode6C2T.melody
ltx/en_us_public/me.m01.d18:meMA.Ode6C2T.mode	@ltx/en_us_dedes/me.m01.d18:meMA.Ode6C2T.mode
ltx/en_us_public/me.m01.d18:meMA.Ode6C2T.ode	@ltx/en_us_dedes/me.m01.d18:meMA.Ode6C2T.ode
ltx/en_us_public/me.m01.d18:meMA.Ode6C2T.text	@ltx/en_us_dedes/me.m01.d18:meMA.Ode6C2T.text
ltx/en_us_public/me.m01.d18:meMA.Ode7C11.greekmelody	@ltx/en_us_dedes/me.m01.d18:meMA.Ode7C11.greekmelody
ltx/en_us_public/me.m01.d18:meMA.Ode7C11.incipit	@ltx/en_us_dedes/me.m01.d18:meMA.Ode7C11.incipit
ltx/en_us_public/me.m01.d18:meMA.Ode7C11.melody	@ltx/en_us_dedes/me.m01.d18:meMA.Ode7C11.melody
ltx/en_us_public/me.m01.d18:meMA.Ode7C11.mode	@ltx/en_us_dedes/me.m01.d18:meMA.Ode7C11.mode
ltx/en_us_public/me.m01.d18:meMA.Ode7C11.ode	@ltx/en_us_dedes/me.m01.d18:meMA.Ode7C11.ode
ltx/en_us_public/me.m01.d18:meMA.Ode7C11.text	@ltx/en_us_dedes/me.m01.d18:meMA.Ode7C11.text
ltx/en_us_public/me.m01.d18:meMA.Ode7C12.incipit	@ltx/en_us_dedes/me.m01.d18:meMA.Ode7C12.incipit
ltx/en_us_public/me.m01.d18:meMA.Ode7C12.melody	@ltx/en_us_dedes/me.m01.d18:meMA.Ode7C12.melody
ltx/en_us_public/me.m01.d18:meMA.Ode7C12.mode	@ltx/en_us_dedes/me.m01.d18:meMA.Ode7C12.mode
ltx/en_us_public/me.m01.d18:meMA.Ode7C12.ode	@ltx/en_us_dedes/me.m01.d18:meMA.Ode7C12.ode
ltx/en_us_public/me.m01.d18:meMA.Ode7C12.text	@ltx/en_us_dedes/me.m01.d18:meMA.Ode7C12.text
ltx/en_us_public/me.m01.d18:meMA.Ode7C13.incipit	@ltx/en_us_dedes/me.m01.d18:meMA.Ode7C13.incipit
ltx/en_us_public/me.m01.d18:meMA.Ode7C13.melody	@ltx/en_us_dedes/me.m01.d18:meMA.Ode7C13.melody
ltx/en_us_public/me.m01.d18:meMA.Ode7C13.mode	@ltx/en_us_dedes/me.m01.d18:meMA.Ode7C13.mode
ltx/en_us_public/me.m01.d18:meMA.Ode7C13.ode	@ltx/en_us_dedes/me.m01.d18:meMA.Ode7C13.ode
ltx/en_us_public/me.m01.d18:meMA.Ode7C13.text	@ltx/en_us_dedes/me.m01.d18:meMA.Ode7C13.text
ltx/en_us_public/me.m01.d18:meMA.Ode7C14.incipit	@ltx/en_us_dedes/me.m01.d18:meMA.Ode7C14.incipit
ltx/en_us_public/me.m01.d18:meMA.Ode7C14.melody	@ltx/en_us_dedes/me.m01.d18:meMA.Ode7C14.melody
ltx/en_us_public/me.m01.d18:meMA.Ode7C14.mode	@ltx/en_us_dedes/me.m01.d18:meMA.Ode7C14.mode
ltx/en_us_public/me.m01.d18:meMA.Ode7C14.ode	@ltx/en_us_dedes/me.m01.d18:meMA.Ode7C14.ode
ltx/en_us_public/me.m01.d18:meMA.Ode7C14.text	@ltx/en_us_dedes/me.m01.d18:meMA.Ode7C14.text
ltx/en_us_public/me.m01.d18:meMA.Ode7C1T.incipit	@ltx/en_us_dedes/me.m01.d18:meMA.Ode7C1T.incipit
ltx/en_us_public/me.m01.d18:meMA.Ode7C1T.melody	@ltx/en_us_dedes/me.m01.d18:meMA.Ode7C1T.melody
ltx/en_us_public/me.m01.d18:meMA.Ode7C1T.mode	@ltx/en_us_dedes/me.m01.d18:meMA.Ode7C1T.mode
ltx/en_us_public/me.m01.d18:meMA.Ode7C1T.ode	@ltx/en_us_dedes/me.m01.d18:meMA.Ode7C1T.ode
ltx/en_us_public/me.m01.d18:meMA.Ode7C1T.text	@ltx/en_us_dedes/me.m01.d18:meMA.Ode7C1T.text
ltx/en_us_public/me.m01.d18:meMA.Ode7C21.greekmelody	@ltx/en_us_dedes/me.m01.d18:meMA.Ode7C21.greekmelody
ltx/en_us_public/me.m01.d18:meMA.Ode7C21.incipit	@ltx/en_us_dedes/me.m01.d18:meMA.Ode7C21.incipit
ltx/en_us_public/me.m01.d18:meMA.Ode7C21.melody	@ltx/en_us_dedes/me.m01.d18:meMA.Ode7C21.melody
ltx/en_us_public/me.m01.d18:meMA.Ode7C21.mode	@ltx/en_us_dedes/me.m01.d18:meMA.Ode7C21.mode
ltx/en_us_public/me.m01.d18:meMA.Ode7C21.ode	@ltx/en_us_dedes/me.m01.d18:meMA.Ode7C21.ode
ltx/en_us_public/me.m01.d18:meMA.Ode7C21.text	@ltx/en_us_dedes/me.m01.d18:meMA.Ode7C21.text
ltx/en_us_public/me.m01.d18:meMA.Ode7C22.incipit	@ltx/en_us_dedes/me.m01.d18:meMA.Ode7C22.incipit
ltx/en_us_public/me.m01.d18:meMA.Ode7C22.melody	@ltx/en_us_dedes/me.m01.d18:meMA.Ode7C22.melody
ltx/en_us_public/me.m01.d18:meMA.Ode7C22.mode	@ltx/en_us_dedes/me.m01.d18:meMA.Ode7C22.mode
ltx/en_us_public/me.m01.d18:meMA.Ode7C22.ode	@ltx/en_us_dedes/me.m01.d18:meMA.Ode7C22.ode
ltx/en_us_public/me.m01.d18:meMA.Ode7C22.text	@ltx/en_us_dedes/me.m01.d18:meMA.Ode7C22.text
ltx/en_us_public/me.m01.d18:meMA.Ode7C23.incipit	@ltx/en_us_dedes/me.m01.d18:meMA.Ode7C23.incipit
ltx/en_us_public/me.m01.d18:meMA.Ode7C23.melody	@ltx/en_us_dedes/me.m01.d18:meMA.Ode7C23.melody
ltx/en_us_public/me.m01.d18:meMA.Ode7C23.mode	@ltx/en_us_dedes/me.m01.d18:meMA.Ode7C23.mode
ltx/en_us_public/me.m01.d18:meMA.Ode7C23.ode	@ltx/en_us_dedes/me.m01.d18:meMA.Ode7C23.ode
ltx/en_us_public/me.m01.d18:meMA.Ode7C23.text	@ltx/en_us_dedes/me.m01.d18:meMA.Ode7C23.text
ltx/en_us_public/me.m01.d18:meMA.Ode7C24.incipit	@ltx/en_us_dedes/me.m01.d18:meMA.Ode7C24.incipit
ltx/en_us_public/me.m01.d18:meMA.Ode7C24.melody	@ltx/en_us_dedes/me.m01.d18:meMA.Ode7C24.melody
ltx/en_us_public/me.m01.d18:meMA.Ode7C24.mode	@ltx/en_us_dedes/me.m01.d18:meMA.Ode7C24.mode
ltx/en_us_public/me.m01.d18:meMA.Ode7C24.ode	@ltx/en_us_dedes/me.m01.d18:meMA.Ode7C24.ode
ltx/en_us_public/me.m01.d18:meMA.Ode7C24.text	@ltx/en_us_dedes/me.m01.d18:meMA.Ode7C24.text
ltx/en_us_public/me.m01.d18:meMA.Ode7C2T.incipit	@ltx/en_us_dedes/me.m01.d18:meMA.Ode7C2T.incipit
ltx/en_us_public/me.m01.d18:meMA.Ode7C2T.melody	@ltx/en_us_dedes/me.m01.d18:meMA.Ode7C2T.melody
ltx/en_us_public/me.m01.d18:meMA.Ode7C2T.mode	@ltx/en_us_dedes/me.m01.d18:meMA.Ode7C2T.mode
ltx/en_us_public/me.m01.d18:meMA.Ode7C2T.ode	@ltx/en_us_dedes/me.m01.d18:meMA.Ode7C2T.ode
ltx/en_us_public/me.m01.d18:meMA.Ode7C2T.text	@ltx/en_us_dedes/me.m01.d18:meMA.Ode7C2T.text
ltx/en_us_public/me.m01.d18:meMA.Ode8C11.greekmelody	@ltx/en_us_dedes/me.m01.d18:meMA.Ode8C11.greekmelody
ltx/en_us_public/me.m01.d18:meMA.Ode8C11.incipit	@ltx/en_us_dedes/me.m01.d18:meMA.Ode8C11.incipit
ltx/en_us_public/me.m01.d18:meMA.Ode8C11.melody	@ltx/en_us_dedes/me.m01.d18:meMA.Ode8C11.melody
ltx/en_us_public/me.m01.d18:meMA.Ode8C11.mode	@ltx/en_us_dedes/me.m01.d18:meMA.Ode8C11.mode
ltx/en_us_public/me.m01.d18:meMA.Ode8C11.ode	@ltx/en_us_dedes/me.m01.d18:meMA.Ode8C11.ode
ltx/en_us_public/me.m01.d18:meMA.Ode8C11.text	@ltx/en_us_dedes/me.m01.d18:meMA.Ode8C11.text
ltx/en_us_public/me.m01.d18:meMA.Ode8C12.incipit	@ltx/en_us_dedes/me.m01.d18:meMA.Ode8C12.incipit
ltx/en_us_public/me.m01.d18:meMA.Ode8C12.melody	@ltx/en_us_dedes/me.m01.d18:meMA.Ode8C12.melody
ltx/en_us_public/me.m01.d18:meMA.Ode8C12.mode	@ltx/en_us_dedes/me.m01.d18:meMA.Ode8C12.mode
ltx/en_us_public/me.m01.d18:meMA.Ode8C12.ode	@ltx/en_us_dedes/me.m01.d18:meMA.Ode8C12.ode
ltx/en_us_public/me.m01.d18:meMA.Ode8C12.text	@ltx/en_us_dedes/me.m01.d18:meMA.Ode8C12.text
ltx/en_us_public/me.m01.d18:meMA.Ode8C13.incipit	@ltx/en_us_dedes/me.m01.d18:meMA.Ode8C13.incipit
ltx/en_us_public/me.m01.d18:meMA.Ode8C13.melody	@ltx/en_us_dedes/me.m01.d18:meMA.Ode8C13.melody
ltx/en_us_public/me.m01.d18:meMA.Ode8C13.mode	@ltx/en_us_dedes/me.m01.d18:meMA.Ode8C13.mode
ltx/en_us_public/me.m01.d18:meMA.Ode8C13.ode	@ltx/en_us_dedes/me.m01.d18:meMA.Ode8C13.ode
ltx/en_us_public/me.m01.d18:meMA.Ode8C13.text	@ltx/en_us_dedes/me.m01.d18:meMA.Ode8C13.text
ltx/en_us_public/me.m01.d18:meMA.Ode8C1T.incipit	@ltx/en_us_dedes/me.m01.d18:meMA.Ode8C1T.incipit
ltx/en_us_public/me.m01.d18:meMA.Ode8C1T.melody	@ltx/en_us_dedes/me.m01.d18:meMA.Ode8C1T.melody
ltx/en_us_public/me.m01.d18:meMA.Ode8C1T.mode	@ltx/en_us_dedes/me.m01.d18:meMA.Ode8C1T.mode
ltx/en_us_public/me.m01.d18:meMA.Ode8C1T.ode	@ltx/en_us_dedes/me.m01.d18:meMA.Ode8C1T.ode
ltx/en_us_public/me.m01.d18:meMA.Ode8C1T.text	@ltx/en_us_dedes/me.m01.d18:meMA.Ode8C1T.text
ltx/en_us_public/me.m01.d18:meMA.Ode8C21.greekmelody	@ltx/en_us_dedes/me.m01.d18:meMA.Ode8C21.greekmelody
ltx/en_us_public/me.m01.d18:meMA.Ode8C21.incipit	@ltx/en_us_dedes/me.m01.d18:meMA.Ode8C21.incipit
ltx/en_us_public/me.m01.d18:meMA.Ode8C21.melody	@ltx/en_us_dedes/me.m01.d18:meMA.Ode8C21.melody
ltx/en_us_public/me.m01.d18:meMA.Ode8C21.mode	@ltx/en_us_dedes/me.m01.d18:meMA.Ode8C21.mode
ltx/en_us_public/me.m01.d18:meMA.Ode8C21.ode	@ltx/en_us_dedes/me.m01.d18:meMA.Ode8C21.ode
ltx/en_us_public/me.m01.d18:meMA.Ode8C21.text	@ltx/en_us_dedes/me.m01.d18:meMA.Ode8C21.text
ltx/en_us_public/me.m01.d18:meMA.Ode8C22.incipit	@ltx/en_us_dedes/me.m01.d18:meMA.Ode8C22.incipit
ltx/en_us_public/me.m01.d18:meMA.Ode8C22.melody	@ltx/en_us_dedes/me.m01.d18:meMA.Ode8C22.melody
ltx/en_us_public/me.m01.d18:meMA.Ode8C22.mode	@ltx/en_us_dedes/me.m01.d18:meMA.Ode8C22.mode
ltx/en_us_public/me.m01.d18:meMA.Ode8C22.ode	@ltx/en_us_dedes/me.m01.d18:meMA.Ode8C22.ode
ltx/en_us_public/me.m01.d18:meMA.Ode8C22.text	@ltx/en_us_dedes/me.m01.d18:meMA.Ode8C22.text
ltx/en_us_public/me.m01.d18:meMA.Ode8C23.incipit	@ltx/en_us_dedes/me.m01.d18:meMA.Ode8C23.incipit
ltx/en_us_public/me.m01.d18:meMA.Ode8C23.melody	@ltx/en_us_dedes/me.m01.d18:meMA.Ode8C23.melody
ltx/en_us_public/me.m01.d18:meMA.Ode8C23.mode	@ltx/en_us_dedes/me.m01.d18:meMA.Ode8C23.mode
ltx/en_us_public/me.m01.d18:meMA.Ode8C23.ode	@ltx/en_us_dedes/me.m01.d18:meMA.Ode8C23.ode
ltx/en_us_public/me.m01.d18:meMA.Ode8C23.text	@ltx/en_us_dedes/me.m01.d18:meMA.Ode8C23.text
ltx/en_us_public/me.m01.d18:meMA.Ode8C2T.incipit	@ltx/en_us_dedes/me.m01.d18:meMA.Ode8C2T.incipit
ltx/en_us_public/me.m01.d18:meMA.Ode8C2T.melody	@ltx/en_us_dedes/me.m01.d18:meMA.Ode8C2T.melody
ltx/en_us_public/me.m01.d18:meMA.Ode8C2T.mode	@ltx/en_us_dedes/me.m01.d18:meMA.Ode8C2T.mode
ltx/en_us_public/me.m01.d18:meMA.Ode8C2T.ode	@ltx/en_us_dedes/me.m01.d18:meMA.Ode8C2T.ode
ltx/en_us_public/me.m01.d18:meMA.Ode8C2T.text	@ltx/en_us_dedes/me.m01.d18:meMA.Ode8C2T.text
ltx/en_us_public/me.m01.d18:meMA.Ode9C11.greekmelody	@ltx/en_us_dedes/me.m01.d18:meMA.Ode9C11.greekmelody
ltx/en_us_public/me.m01.d18:meMA.Ode9C11.incipit	@ltx/en_us_dedes/me.m01.d18:meMA.Ode9C11.incipit
ltx/en_us_public/me.m01.d18:meMA.Ode9C11.melody	@ltx/en_us_dedes/me.m01.d18:meMA.Ode9C11.melody
ltx/en_us_public/me.m01.d18:meMA.Ode9C11.mode	@ltx/en_us_dedes/me.m01.d18:meMA.Ode9C11.mode
ltx/en_us_public/me.m01.d18:meMA.Ode9C11.ode	@ltx/en_us_dedes/me.m01.d18:meMA.Ode9C11.ode
ltx/en_us_public/me.m01.d18:meMA.Ode9C11.text	@ltx/en_us_dedes/me.m01.d18:meMA.Ode9C11.text
ltx/en_us_public/me.m01.d18:meMA.Ode9C12.incipit	@ltx/en_us_dedes/me.m01.d18:meMA.Ode9C12.incipit
ltx/en_us_public/me.m01.d18:meMA.Ode9C12.melody	@ltx/en_us_dedes/me.m01.d18:meMA.Ode9C12.melody
ltx/en_us_public/me.m01.d18:meMA.Ode9C12.mode	@ltx/en_us_dedes/me.m01.d18:meMA.Ode9C12.mode
ltx/en_us_public/me.m01.d18:meMA.Ode9C12.ode	@ltx/en_us_dedes/me.m01.d18:meMA.Ode9C12.ode
ltx/en_us_public/me.m01.d18:meMA.Ode9C12.text	@ltx/en_us_dedes/me.m01.d18:meMA.Ode9C12.text
ltx/en_us_public/me.m01.d18:meMA.Ode9C13.incipit	@ltx/en_us_dedes/me.m01.d18:meMA.Ode9C13.incipit
ltx/en_us_public/me.m01.d18:meMA.Ode9C13.melody	@ltx/en_us_dedes/me.m01.d18:meMA.Ode9C13.melody
ltx/en_us_public/me.m01.d18:meMA.Ode9C13.mode	@ltx/en_us_dedes/me.m01.d18:meMA.Ode9C13.mode
ltx/en_us_public/me.m01.d18:meMA.Ode9C13.ode	@ltx/en_us_dedes/me.m01.d18:meMA.Ode9C13.ode
ltx/en_us_public/me.m01.d18:meMA.Ode9C13.text	@ltx/en_us_dedes/me.m01.d18:meMA.Ode9C13.text
ltx/en_us_public/me.m01.d18:meMA.Ode9C1T.incipit	@ltx/en_us_dedes/me.m01.d18:meMA.Ode9C1T.incipit
ltx/en_us_public/me.m01.d18:meMA.Ode9C1T.melody	@ltx/en_us_dedes/me.m01.d18:meMA.Ode9C1T.melody
ltx/en_us_public/me.m01.d18:meMA.Ode9C1T.mode	@ltx/en_us_dedes/me.m01.d18:meMA.Ode9C1T.mode
ltx/en_us_public/me.m01.d18:meMA.Ode9C1T.ode	@ltx/en_us_dedes/me.m01.d18:meMA.Ode9C1T.ode
ltx/en_us_public/me.m01.d18:meMA.Ode9C1T.text	@ltx/en_us_dedes/me.m01.d18:meMA.Ode9C1T.text
ltx/en_us_public/me.m01.d18:meMA.Ode9C21.greekmelody	@ltx/en_us_dedes/me.m01.d18:meMA.Ode9C21.greekmelody
ltx/en_us_public/me.m01.d18:meMA.Ode9C21.incipit	@ltx/en_us_dedes/me.m01.d18:meMA.Ode9C21.incipit
ltx/en_us_public/me.m01.d18:meMA.Ode9C21.melody	@ltx/en_us_dedes/me.m01.d18:meMA.Ode9C21.melody
ltx/en_us_public/me.m01.d18:meMA.Ode9C21.mode	@ltx/en_us_dedes/me.m01.d18:meMA.Ode9C21.mode
ltx/en_us_public/me.m01.d18:meMA.Ode9C21.ode	@ltx/en_us_dedes/me.m01.d18:meMA.Ode9C21.ode
ltx/en_us_public/me.m01.d18:meMA.Ode9C21.text	@ltx/en_us_dedes/me.m01.d18:meMA.Ode9C21.text
ltx/en_us_public/me.m01.d18:meMA.Ode9C22.incipit	@ltx/en_us_dedes/me.m01.d18:meMA.Ode9C22.incipit
ltx/en_us_public/me.m01.d18:meMA.Ode9C22.melody	@ltx/en_us_dedes/me.m01.d18:meMA.Ode9C22.melody
ltx/en_us_public/me.m01.d18:meMA.Ode9C22.mode	@ltx/en_us_dedes/me.m01.d18:meMA.Ode9C22.mode
ltx/en_us_public/me.m01.d18:meMA.Ode9C22.ode	@ltx/en_us_dedes/me.m01.d18:meMA.Ode9C22.ode
ltx/en_us_public/me.m01.d18:meMA.Ode9C22.text	@ltx/en_us_dedes/me.m01.d18:meMA.Ode9C22.text
ltx/en_us_public/me.m01.d18:meMA.Ode9C23.incipit	@ltx/en_us_dedes/me.m01.d18:meMA.Ode9C23.incipit
ltx/en_us_public/me.m01.d18:meMA.Ode9C23.melody	@ltx/en_us_dedes/me.m01.d18:meMA.Ode9C23.melody
ltx/en_us_public/me.m01.d18:meMA.Ode9C23.mode	@ltx/en_us_dedes/me.m01.d18:meMA.Ode9C23.mode
ltx/en_us_public/me.m01.d18:meMA.Ode9C23.ode	@ltx/en_us_dedes/me.m01.d18:meMA.Ode9C23.ode
ltx/en_us_public/me.m01.d18:meMA.Ode9C23.text	@ltx/en_us_dedes/me.m01.d18:meMA.Ode9C23.text
ltx/en_us_public/me.m01.d18:meMA.Ode9C2T.incipit	@ltx/en_us_dedes/me.m01.d18:meMA.Ode9C2T.incipit
ltx/en_us_public/me.m01.d18:meMA.Ode9C2T.melody	@ltx/en_us_dedes/me.m01.d18:meMA.Ode9C2T.melody
ltx/en_us_public/me.m01.d18:meMA.Ode9C2T.mode	@ltx/en_us_dedes/me.m01.d18:meMA.Ode9C2T.mode
ltx/en_us_public/me.m01.d18:meMA.Ode9C2T.ode	@ltx/en_us_dedes/me.m01.d18:meMA.Ode9C2T.ode
ltx/en_us_public/me.m01.d18:meMA.Ode9C2T.text	@ltx/en_us_dedes/me.m01.d18:meMA.Ode9C2T.text
ltx/en_us_public/me.m01.d18:meMA.Oikos2.text	@ltx/en_us_dedes/me.m01.d18:meMA.Oikos2.text
ltx/en_us_public/me.m01.d18:meMA.PostGospelBoth.incipit	@ltx/en_us_dedes/me.m01.d18:meMA.PostGospelBoth.incipit
ltx/en_us_public/me.m01.d18:meMA.PostGospelBoth.melody	@ltx/en_us_dedes/me.m01.d18:meMA.PostGospelBoth.melody
ltx/en_us_public/me.m01.d18:meMA.PostGospelBoth.mode	@ltx/en_us_dedes/me.m01.d18:meMA.PostGospelBoth.mode
ltx/en_us_public/me.m01.d18:meMA.PostGospelBoth.text	@ltx/en_us_dedes/me.m01.d18:meMA.PostGospelBoth.text
ltx/en_us_public/me.m01.d18:meMA.PostGospelGlory.incipit	@ltx/en_us_dedes/me.m01.d18:meMA.PostGospelGlory.incipit
ltx/en_us_public/me.m01.d18:meMA.PostGospelGlory.melody	@ltx/en_us_dedes/me.m01.d18:meMA.PostGospelGlory.melody
ltx/en_us_public/me.m01.d18:meMA.PostGospelGlory.mode	@ltx/en_us_dedes/me.m01.d18:meMA.PostGospelGlory.mode
ltx/en_us_public/me.m01.d18:meMA.PostGospelGlory.text	@ltx/en_us_dedes/me.m01.d18:meMA.PostGospelGlory.text
ltx/en_us_public/me.m01.d18:meMA.PostGospelIdiomelon.incipit	@ltx/en_us_dedes/me.m01.d18:meMA.PostGospelIdiomelon.incipit
ltx/en_us_public/me.m01.d18:meMA.PostGospelIdiomelon.melody	@ltx/en_us_dedes/me.m01.d18:meMA.PostGospelIdiomelon.melody
ltx/en_us_public/me.m01.d18:meMA.PostGospelIdiomelon.mode	@ltx/en_us_dedes/me.m01.d18:meMA.PostGospelIdiomelon.mode
ltx/en_us_public/me.m01.d18:meMA.PostGospelIdiomelon.text	@ltx/en_us_dedes/me.m01.d18:meMA.PostGospelIdiomelon.text
ltx/en_us_public/me.m01.d18:meVE.Apolytikion1.greekmelody	@ltx/en_us_dedes/me.m01.d18:meVE.Apolytikion1.greekmelody
ltx/en_us_public/me.m01.d18:meVE.Apolytikion1.incipit	@ltx/en_us_dedes/me.m01.d18:meVE.Apolytikion1.incipit
ltx/en_us_public/me.m01.d18:meVE.Apolytikion1.melody	@ltx/en_us_dedes/me.m01.d18:meVE.Apolytikion1.melody
ltx/en_us_public/me.m01.d18:meVE.Apolytikion1.mode	@ltx/en_us_dedes/me.m01.d18:meVE.Apolytikion1.mode
ltx/en_us_public/me.m01.d18:meVE.Apolytikion1.text	@ltx/en_us_dedes/me.m01.d18:meVE.Apolytikion1.text
ltx/en_us_public/me.m01.d18:meVE.AposGlory.incipit	@ltx/en_us_dedes/me.m01.d18:meVE.AposGlory.incipit
ltx/en_us_public/me.m01.d18:meVE.AposGlory.melody	@ltx/en_us_dedes/me.m01.d18:meVE.AposGlory.melody
ltx/en_us_public/me.m01.d18:meVE.AposGlory.mode	@ltx/en_us_dedes/me.m01.d18:meVE.AposGlory.mode
ltx/en_us_public/me.m01.d18:meVE.AposGlory.text	@ltx/en_us_dedes/me.m01.d18:meVE.AposGlory.text
ltx/en_us_public/me.m01.d18:meVE.AposTheotokion.incipit	@ltx/en_us_dedes/me.m01.d18:meVE.AposTheotokion.incipit
ltx/en_us_public/me.m01.d18:meVE.AposTheotokion.melody	@ltx/en_us_dedes/me.m01.d18:meVE.AposTheotokion.melody
ltx/en_us_public/me.m01.d18:meVE.AposTheotokion.mode	@ltx/en_us_dedes/me.m01.d18:meVE.AposTheotokion.mode
ltx/en_us_public/me.m01.d18:meVE.AposTheotokion.text	@ltx/en_us_dedes/me.m01.d18:meVE.AposTheotokion.text
ltx/en_us_public/me.m01.d18:meVE.Aposticha1.greekmelody	@ltx/en_us_dedes/me.m01.d18:meVE.Aposticha1.greekmelody
ltx/en_us_public/me.m01.d18:meVE.Aposticha1.incipit	@ltx/en_us_dedes/me.m01.d18:meVE.Aposticha1.incipit
ltx/en_us_public/me.m01.d18:meVE.Aposticha1.melody	@ltx/en_us_dedes/me.m01.d18:meVE.Aposticha1.melody
ltx/en_us_public/me.m01.d18:meVE.Aposticha1.mode	@ltx/en_us_dedes/me.m01.d18:meVE.Aposticha1.mode
ltx/en_us_public/me.m01.d18:meVE.Aposticha1.text	@ltx/en_us_dedes/me.m01.d18:meVE.Aposticha1.text
ltx/en_us_public/me.m01.d18:meVE.Aposticha2.incipit	@ltx/en_us_dedes/me.m01.d18:meVE.Aposticha2.incipit
ltx/en_us_public/me.m01.d18:meVE.Aposticha2.melody	@ltx/en_us_dedes/me.m01.d18:meVE.Aposticha2.melody
ltx/en_us_public/me.m01.d18:meVE.Aposticha2.mode	@ltx/en_us_dedes/me.m01.d18:meVE.Aposticha2.mode
ltx/en_us_public/me.m01.d18:meVE.Aposticha2.text	@ltx/en_us_dedes/me.m01.d18:meVE.Aposticha2.text
ltx/en_us_public/me.m01.d18:meVE.Aposticha3.incipit	@ltx/en_us_dedes/me.m01.d18:meVE.Aposticha3.incipit
ltx/en_us_public/me.m01.d18:meVE.Aposticha3.melody	@ltx/en_us_dedes/me.m01.d18:meVE.Aposticha3.melody
ltx/en_us_public/me.m01.d18:meVE.Aposticha3.mode	@ltx/en_us_dedes/me.m01.d18:meVE.Aposticha3.mode
ltx/en_us_public/me.m01.d18:meVE.Aposticha3.text	@ltx/en_us_dedes/me.m01.d18:meVE.Aposticha3.text
ltx/en_us_public/me.m01.d18:meVE.Lity1.incipit	@ltx/en_us_dedes/me.m01.d18:meVE.Lity1.incipit
ltx/en_us_public/me.m01.d18:meVE.Lity1.melody	@ltx/en_us_dedes/me.m01.d18:meVE.Lity1.melody
ltx/en_us_public/me.m01.d18:meVE.Lity1.mode	@ltx/en_us_dedes/me.m01.d18:meVE.Lity1.mode
ltx/en_us_public/me.m01.d18:meVE.Lity1.poet	@ltx/en_us_dedes/me.m01.d18:meVE.Lity1.poet
ltx/en_us_public/me.m01.d18:meVE.Lity1.text	@ltx/en_us_dedes/me.m01.d18:meVE.Lity1.text
ltx/en_us_public/me.m01.d18:meVE.Lity2.incipit	@ltx/en_us_dedes/me.m01.d18:meVE.Lity2.incipit
ltx/en_us_public/me.m01.d18:meVE.Lity2.melody	@ltx/en_us_dedes/me.m01.d18:meVE.Lity2.melody
ltx/en_us_public/me.m01.d18:meVE.Lity2.mode	@ltx/en_us_dedes/me.m01.d18:meVE.Lity2.mode
ltx/en_us_public/me.m01.d18:meVE.Lity2.text	@ltx/en_us_dedes/me.m01.d18:meVE.Lity2.text
ltx/en_us_public/me.m01.d18:meVE.Lity3.incipit	@ltx/en_us_dedes/me.m01.d18:meVE.Lity3.incipit
ltx/en_us_public/me.m01.d18:meVE.Lity3.melody	@ltx/en_us_dedes/me.m01.d18:meVE.Lity3.melody
ltx/en_us_public/me.m01.d18:meVE.Lity3.mode	@ltx/en_us_dedes/me.m01.d18:meVE.Lity3.mode
ltx/en_us_public/me.m01.d18:meVE.Lity3.text	@ltx/en_us_dedes/me.m01.d18:meVE.Lity3.text
ltx/en_us_public/me.m01.d18:meVE.Lity4.incipit	@ltx/en_us_dedes/me.m01.d18:meVE.Lity4.incipit
ltx/en_us_public/me.m01.d18:meVE.Lity4.melody	@ltx/en_us_dedes/me.m01.d18:meVE.Lity4.melody
ltx/en_us_public/me.m01.d18:meVE.Lity4.mode	@ltx/en_us_dedes/me.m01.d18:meVE.Lity4.mode
ltx/en_us_public/me.m01.d18:meVE.Lity4.poet	@ltx/en_us_dedes/me.m01.d18:meVE.Lity4.poet
ltx/en_us_public/me.m01.d18:meVE.Lity4.text	@ltx/en_us_dedes/me.m01.d18:meVE.Lity4.text
ltx/en_us_public/me.m01.d18:meVE.Lity5.incipit	@ltx/en_us_dedes/me.m01.d18:meVE.Lity5.incipit
ltx/en_us_public/me.m01.d18:meVE.Lity5.melody	@ltx/en_us_dedes/me.m01.d18:meVE.Lity5.melody
ltx/en_us_public/me.m01.d18:meVE.Lity5.mode	@ltx/en_us_dedes/me.m01.d18:meVE.Lity5.mode
ltx/en_us_public/me.m01.d18:meVE.Lity5.text	@ltx/en_us_dedes/me.m01.d18:meVE.Lity5.text
ltx/en_us_public/me.m01.d18:meVE.LityBoth.incipit	@ltx/en_us_dedes/me.m01.d18:meVE.LityBoth.incipit
ltx/en_us_public/me.m01.d18:meVE.LityBoth.melody	@ltx/en_us_dedes/me.m01.d18:meVE.LityBoth.melody
ltx/en_us_public/me.m01.d18:meVE.LityBoth.mode	@ltx/en_us_dedes/me.m01.d18:meVE.LityBoth.mode
ltx/en_us_public/me.m01.d18:meVE.LityBoth.text	@ltx/en_us_dedes/me.m01.d18:meVE.LityBoth.text
ltx/en_us_public/me.m01.d18:meVE.LityGlory.incipit	@ltx/en_us_dedes/me.m01.d18:meVE.LityGlory.incipit
ltx/en_us_public/me.m01.d18:meVE.LityGlory.melody	@ltx/en_us_dedes/me.m01.d18:meVE.LityGlory.melody
ltx/en_us_public/me.m01.d18:meVE.LityGlory.mode	@ltx/en_us_dedes/me.m01.d18:meVE.LityGlory.mode
ltx/en_us_public/me.m01.d18:meVE.LityGlory.poet	@ltx/en_us_dedes/me.m01.d18:meVE.LityGlory.poet
ltx/en_us_public/me.m01.d18:meVE.LityGlory.text	@ltx/en_us_dedes/me.m01.d18:meVE.LityGlory.text
ltx/en_us_public/me.m01.d18:meVE.SticGlory.incipit	@ltx/en_us_oca/me.m01.d18:meVE.SticGlory.incipit
ltx/en_us_public/me.m01.d18:meVE.SticGlory.melody	@ltx/en_us_dedes/me.m01.d18:meVE.SticGlory.melody
ltx/en_us_public/me.m01.d18:meVE.SticGlory.mode	@ltx/en_us_dedes/me.m01.d18:meVE.SticGlory.mode
ltx/en_us_public/me.m01.d18:meVE.SticGlory.poet	@ltx/en_us_dedes/me.m01.d18:meVE.SticGlory.poet
ltx/en_us_public/me.m01.d18:meVE.SticGlory.text	@ltx/en_us_oca/me.m01.d18:meVE.SticGlory.text
ltx/en_us_public/me.m01.d18:meVE.SticTheotokion.incipit	@ltx/en_us_goadedes/me.m01.d18:meVE.SticTheotokion.incipit
ltx/en_us_public/me.m01.d18:meVE.SticTheotokion.melody	@ltx/en_us_goadedes/me.m01.d18:meVE.SticTheotokion.melody
ltx/en_us_public/me.m01.d18:meVE.SticTheotokion.mode	@ltx/en_us_goadedes/me.m01.d18:meVE.SticTheotokion.mode
ltx/en_us_public/me.m01.d18:meVE.SticTheotokion.text	@ltx/en_us_goadedes/me.m01.d18:meVE.SticTheotokion.text
ltx/en_us_public/me.m01.d18:meVE.Stichera01.greekmelody	@ltx/en_us_dedes/me.m01.d18:meVE.Stichera01.greekmelody
ltx/en_us_public/me.m01.d18:meVE.Stichera01.incipit	@ltx/en_us_oca/me.m01.d18:meVE.Stichera01.incipit
ltx/en_us_public/me.m01.d18:meVE.Stichera01.melody	@ltx/en_us_oca/me.m01.d18:meVE.Stichera01.melody
ltx/en_us_public/me.m01.d18:meVE.Stichera01.mode	@ltx/en_us_dedes/me.m01.d18:meVE.Stichera01.mode
ltx/en_us_public/me.m01.d18:meVE.Stichera01.text	@ltx/en_us_oca/me.m01.d18:meVE.Stichera01.text
ltx/en_us_public/me.m01.d18:meVE.Stichera02.incipit	@ltx/en_us_oca/me.m01.d18:meVE.Stichera02.incipit
ltx/en_us_public/me.m01.d18:meVE.Stichera02.melody	@ltx/en_us_oca/me.m01.d18:meVE.Stichera02.melody
ltx/en_us_public/me.m01.d18:meVE.Stichera02.mode	@ltx/en_us_dedes/me.m01.d18:meVE.Stichera02.mode
ltx/en_us_public/me.m01.d18:meVE.Stichera02.text	@ltx/en_us_oca/me.m01.d18:meVE.Stichera02.text
ltx/en_us_public/me.m01.d18:meVE.Stichera03.incipit	@ltx/en_us_oca/me.m01.d18:meVE.Stichera03.incipit
ltx/en_us_public/me.m01.d18:meVE.Stichera03.melody	@ltx/en_us_oca/me.m01.d18:meVE.Stichera03.melody
ltx/en_us_public/me.m01.d18:meVE.Stichera03.mode	@ltx/en_us_dedes/me.m01.d18:meVE.Stichera03.mode
ltx/en_us_public/me.m01.d18:meVE.Stichera03.text	@ltx/en_us_oca/me.m01.d18:meVE.Stichera03.text
ltx/en_us_public/me.m01.d18:meVE.Stichera04.greekmelody	@ltx/en_us_dedes/me.m01.d18:meVE.Stichera04.greekmelody
ltx/en_us_public/me.m01.d18:meVE.Stichera04.incipit	@ltx/en_us_oca/me.m01.d18:meVE.Stichera04.incipit
ltx/en_us_public/me.m01.d18:meVE.Stichera04.melody	@ltx/en_us_oca/me.m01.d18:meVE.Stichera04.melody
ltx/en_us_public/me.m01.d18:meVE.Stichera04.mode	@ltx/en_us_dedes/me.m01.d18:meVE.Stichera04.mode
ltx/en_us_public/me.m01.d18:meVE.Stichera04.text	@ltx/en_us_oca/me.m01.d18:meVE.Stichera04.text
ltx/en_us_public/me.m01.d18:meVE.Stichera05.incipit	@ltx/en_us_oca/me.m01.d18:meVE.Stichera05.incipit
ltx/en_us_public/me.m01.d18:meVE.Stichera05.melody	@ltx/en_us_oca/me.m01.d18:meVE.Stichera05.melody
ltx/en_us_public/me.m01.d18:meVE.Stichera05.mode	@ltx/en_us_dedes/me.m01.d18:meVE.Stichera05.mode
ltx/en_us_public/me.m01.d18:meVE.Stichera05.text	@ltx/en_us_oca/me.m01.d18:meVE.Stichera05.text
ltx/en_us_public/me.m01.d18:meVE.Stichera06.incipit	@ltx/en_us_oca/me.m01.d18:meVE.Stichera06.incipit
ltx/en_us_public/me.m01.d18:meVE.Stichera06.melody	@ltx/en_us_oca/me.m01.d18:meVE.Stichera06.melody
ltx/en_us_public/me.m01.d18:meVE.Stichera06.mode	@ltx/en_us_dedes/me.m01.d18:meVE.Stichera06.mode
ltx/en_us_public/me.m01.d18:meVE.Stichera06.text	@ltx/en_us_oca/me.m01.d18:meVE.Stichera06.text
