ltx/en_us_public/eu.baptism:euBAP.Key0100.title	@ltx/en_us_holycross/eu.baptism:euBAP.Key0100.title
ltx/en_us_public/eu.baptism:euBAP.Key0101.text	@ltx/en_us_holycross/eu.baptism:euBAP.Key0101.text
ltx/en_us_public/eu.baptism:euBAP.Key0101.title	@ltx/en_us_holycross/eu.baptism:euBAP.Key0101.title
ltx/en_us_public/eu.baptism:euBAP.Key0102.text	@ltx/en_us_holycross/eu.baptism:euBAP.Key0102.text
ltx/en_us_public/eu.baptism:euBAP.Key0103.text	@ltx/en_us_holycross/eu.baptism:euBAP.Key0103.text
ltx/en_us_public/eu.baptism:euBAP.Key0103.title	@ltx/en_us_holycross/eu.baptism:euBAP.Key0103.title
ltx/en_us_public/eu.baptism:euBAP.Key0104.text	@ltx/en_us_holycross/eu.baptism:euBAP.Key0104.text
ltx/en_us_public/eu.baptism:euBAP.Key0104.title	@ltx/en_us_holycross/eu.baptism:euBAP.Key0104.title
ltx/en_us_public/eu.baptism:euBAP.Key0105.text	@ltx/en_us_holycross/eu.baptism:euBAP.Key0105.text
ltx/en_us_public/eu.baptism:euBAP.Key0105.title	@ltx/en_us_holycross/eu.baptism:euBAP.Key0105.title
ltx/en_us_public/eu.baptism:euBAP.Key0106.text	@ltx/en_us_holycross/eu.baptism:euBAP.Key0106.text
ltx/en_us_public/eu.baptism:euBAP.Key0106.title	@ltx/en_us_holycross/eu.baptism:euBAP.Key0106.title
ltx/en_us_public/eu.baptism:euBAP.Key0107.text	@ltx/en_us_holycross/eu.baptism:euBAP.Key0107.text
ltx/en_us_public/eu.baptism:euBAP.Key0108.text	@ltx/en_us_holycross/eu.baptism:euBAP.Key0108.text
ltx/en_us_public/eu.baptism:euBAP.Key0109.text	@ltx/en_us_holycross/eu.baptism:euBAP.Key0109.text
ltx/en_us_public/eu.baptism:euBAP.Key0110.text	@ltx/en_us_holycross/eu.baptism:euBAP.Key0110.text
ltx/en_us_public/eu.baptism:euBAP.Key0111.text	@ltx/en_us_holycross/eu.baptism:euBAP.Key0111.text
ltx/en_us_public/eu.baptism:euBAP.Key0112.text	@ltx/en_us_holycross/eu.baptism:euBAP.Key0112.text
ltx/en_us_public/eu.baptism:euBAP.Key0113.text	@ltx/en_us_holycross/eu.baptism:euBAP.Key0113.text
ltx/en_us_public/eu.baptism:euBAP.Key0114.text	@ltx/en_us_holycross/eu.baptism:euBAP.Key0114.text
ltx/en_us_public/eu.baptism:euBAP.Key0115.text	@ltx/en_us_holycross/eu.baptism:euBAP.Key0115.text
ltx/en_us_public/eu.baptism:euBAP.Key0116.text	@ltx/en_us_holycross/eu.baptism:euBAP.Key0116.text
ltx/en_us_public/eu.baptism:euBAP.Key0117.text	@ltx/en_us_holycross/eu.baptism:euBAP.Key0117.text
ltx/en_us_public/eu.baptism:euBAP.Key0118.text	@ltx/en_us_holycross/eu.baptism:euBAP.Key0118.text
ltx/en_us_public/eu.baptism:euBAP.Key0119.text	@ltx/en_us_holycross/eu.baptism:euBAP.Key0119.text
ltx/en_us_public/eu.baptism:euBAP.Key0120.text	@ltx/en_us_holycross/eu.baptism:euBAP.Key0120.text
ltx/en_us_public/eu.baptism:euBAP.Key0121.text	@ltx/en_us_holycross/eu.baptism:euBAP.Key0121.text
ltx/en_us_public/eu.baptism:euBAP.Key0122.text	@ltx/en_us_holycross/eu.baptism:euBAP.Key0122.text
ltx/en_us_public/eu.baptism:euBAP.Key0123.text	@ltx/en_us_holycross/eu.baptism:euBAP.Key0123.text
ltx/en_us_public/eu.baptism:euBAP.Key0124.text	@ltx/en_us_holycross/eu.baptism:euBAP.Key0124.text
ltx/en_us_public/eu.baptism:euBAP.Key0200.title	@ltx/en_us_holycross/eu.baptism:euBAP.Key0200.title
ltx/en_us_public/eu.baptism:euBAP.Key0201.text	@ltx/en_us_holycross/eu.baptism:euBAP.Key0201.text
ltx/en_us_public/eu.baptism:euBAP.Key0202.text	@ltx/en_us_holycross/eu.baptism:euBAP.Key0202.text
ltx/en_us_public/eu.baptism:euBAP.Key0202.title	@ltx/en_us_holycross/eu.baptism:euBAP.Key0202.title
ltx/en_us_public/eu.baptism:euBAP.Key0203.text	@ltx/en_us_holycross/prayers:pr.GloryToYouLord.text
ltx/en_us_public/eu.baptism:euBAP.Key0204.text	@ltx/en_us_holycross/eu.baptism:euBAP.Key0204.text
ltx/en_us_public/eu.baptism:euBAP.Key0205.text	@ltx/en_us_holycross/eu.baptism:euBAP.Key0205.text
ltx/en_us_public/eu.baptism:euBAP.Key0206.text	@ltx/en_us_holycross/eu.baptism:euBAP.Key0206.text
ltx/en_us_public/eu.baptism:euBAP.Key0207.text	@ltx/en_us_holycross/eu.baptism:euBAP.Key0207.text
ltx/en_us_public/eu.baptism:euBAP.Key0208.text	@ltx/en_us_holycross/eu.baptism:euBAP.Key0208.text
ltx/en_us_public/eu.baptism:euBAP.Key0209.text	@ltx/en_us_holycross/eu.baptism:euBAP.Key0209.text
ltx/en_us_public/eu.baptism:euBAP.Key0301.text	@ltx/en_us_holycross/eu.baptism:euBAP.Key0301.text
ltx/en_us_public/eu.baptism:euBAP.Key0301.title	@ltx/en_us_holycross/eu.baptism:euBAP.Key0301.title
ltx/en_us_public/eu.baptism:euBAP.Key0302.text	@ltx/en_us_holycross/eu.baptism:euBAP.Key0302.text
ltx/en_us_public/eu.baptism:euBAP.Key0303.text	@ltx/en_us_holycross/eu.baptism:euBAP.Key0303.text
ltx/en_us_public/eu.baptism:euBAP.Key0304.text	@ltx/en_us_holycross/eu.baptism:euBAP.Key0304.text
ltx/en_us_public/eu.baptism:euBAP.Key0305.text	@ltx/en_us_holycross/eu.baptism:euBAP.Key0305.text
ltx/en_us_public/eu.baptism:euBAP.Key0306.text	@ltx/en_us_holycross/eu.baptism:euBAP.Key0306.text
ltx/en_us_public/eu.baptism:euBAP.Key0307.text	@ltx/en_us_holycross/eu.baptism:euBAP.Key0307.text
ltx/en_us_public/eu.baptism:euBAP.Key0308.text	@ltx/en_us_holycross/eu.baptism:euBAP.Key0308.text
ltx/en_us_public/eu.baptism:euBAP.Key0309.text	@ltx/en_us_holycross/eu.baptism:euBAP.Key0309.text
ltx/en_us_public/eu.baptism:euBAP.Key0310.text	@ltx/en_us_holycross/eu.baptism:euBAP.Key0310.text
ltx/en_us_public/eu.baptism:euBAP.Key0311.text	@ltx/en_us_holycross/eu.baptism:euBAP.Key0311.text
ltx/en_us_public/eu.baptism:euBAP.Key0312.text	@ltx/en_us_holycross/eu.baptism:euBAP.Key0312.text
ltx/en_us_public/eu.baptism:euBAP.Key0313.text	@ltx/en_us_holycross/eu.baptism:euBAP.Key0313.text
ltx/en_us_public/eu.baptism:euBAP.Key0313.title	@ltx/en_us_holycross/eu.baptism:euBAP.Key0313.title
ltx/en_us_public/eu.baptism:euBAP.Key0314.text	@ltx/en_us_holycross/eu.baptism:euBAP.Key0314.text
ltx/en_us_public/eu.baptism:euBAP.Key0315.text	@ltx/en_us_holycross/eu.baptism:euBAP.Key0315.text
ltx/en_us_public/eu.baptism:euBAP.Key0316.mode	@ltx/en_us_goadedes/eu.baptism:euBAP.Key0316.mode
ltx/en_us_public/eu.baptism:euBAP.Key0316.text	@ltx/en_us_holycross/eu.baptism:euBAP.Key0316.text
ltx/en_us_public/eu.baptism:euBAP.Key0316.title	@ltx/en_us_holycross/eu.baptism:euBAP.Key0316.title
ltx/en_us_public/eu.baptism:euBAP.Key0317.text	@ltx/en_us_holycross/eu.baptism:euBAP.Key0317.text
ltx/en_us_public/eu.baptism:euBAP.Key0401.text	@ltx/en_us_holycross/eu.baptism:euBAP.Key0401.text
ltx/en_us_public/eu.baptism:euBAP.Key0401.title	@ltx/en_us_holycross/eu.baptism:euBAP.Key0401.title
ltx/en_us_public/eu.baptism:euBAP.Key0402.text	@ltx/en_us_holycross/eu.baptism:euBAP.Key0402.text
ltx/en_us_public/eu.baptism:euBAP.Key0403.text	@ltx/en_us_holycross/eu.baptism:euBAP.Key0403.text
ltx/en_us_public/eu.baptism:euBAP.Key0404.text	@ltx/en_us_holycross/eu.baptism:euBAP.Key0404.text
ltx/en_us_public/eu.baptism:euBAP.Key0405.mode	@ltx/en_us_goadedes/eu.baptism:euBAP.Key0405.mode
ltx/en_us_public/eu.baptism:euBAP.Key0405.text	@ltx/en_us_holycross/eu.baptism:euBAP.Key0405.text
ltx/en_us_public/eu.baptism:euBAP.Key0501.text	@ltx/en_us_holycross/eu.baptism:euBAP.Key0501.text
ltx/en_us_public/eu.baptism:euBAP.Key0501.title	@ltx/en_us_holycross/eu.baptism:euBAP.Key0501.title
ltx/en_us_public/eu.baptism:euBAP.Key0502.text	@ltx/en_us_holycross/eu.baptism:euBAP.Key0502.text
ltx/en_us_public/eu.baptism:euBAP.Key0503.text	@ltx/en_us_holycross/eu.baptism:euBAP.Key0503.text
ltx/en_us_public/eu.baptism:euBAP.Key0504.text	@ltx/en_us_holycross/eu.baptism:euBAP.Key0504.text
ltx/en_us_public/eu.baptism:euBAP.Key0505.text	@ltx/en_us_holycross/eu.baptism:euBAP.Key0505.text
ltx/en_us_public/eu.baptism:euBAP.Key0506.text	@ltx/en_us_holycross/eu.baptism:euBAP.Key0506.text
ltx/en_us_public/eu.baptism:euBAP.Key0507.text	@ltx/en_us_holycross/eu.baptism:euBAP.Key0507.text
ltx/en_us_public/eu.baptism:euBAP.Key0508.text	@ltx/en_us_holycross/eu.baptism:euBAP.Key0508.text
ltx/en_us_public/eu.baptism:euBAP.Key0601.text	@ltx/en_us_holycross/eu.baptism:euBAP.Key0601.text
ltx/en_us_public/eu.baptism:euBAP.Key0601.title	@ltx/en_us_holycross/eu.baptism:euBAP.Key0601.title
ltx/en_us_public/eu.baptism:euBAP.Key0602.text	@ltx/en_us_holycross/eu.baptism:euBAP.Key0602.text
ltx/en_us_public/eu.baptism:euBAP.Key0603.text	@ltx/en_us_holycross/eu.baptism:euBAP.Key0603.text
ltx/en_us_public/eu.baptism:euBAP.Key0604.text	@ltx/en_us_holycross/eu.baptism:euBAP.Key0604.text
ltx/en_us_public/eu.baptism:euBAP.Key0605.text	@ltx/en_us_holycross/eu.baptism:euBAP.Key0605.text
ltx/en_us_public/eu.baptism:euBAP.Key0606.text	@ltx/en_us_holycross/eu.baptism:euBAP.Key0606.text
ltx/en_us_public/eu.baptism:euBAP.Key0607.text	@ltx/en_us_holycross/eu.baptism:euBAP.Key0607.text
ltx/en_us_public/eu.baptism:euBAP.Key0700.title	@ltx/en_us_holycross/eu.baptism:euBAP.Key0700.title
ltx/en_us_public/eu.baptism:euBAP.Key0701.text	@ltx/en_us_holycross/eu.baptism:euBAP.Key0701.text
ltx/en_us_public/eu.baptism:euBAP.Key0800.title	@ltx/en_us_holycross/eu.baptism:euBAP.Key0800.title
ltx/en_us_public/eu.baptism:euBAP.Key0801.mode	@ltx/en_us_goadedes/eu.baptism:euBAP.Key0801.mode
ltx/en_us_public/eu.baptism:euBAP.Key0801.text	@ltx/en_us_dedes/da.d4:daLI.MM.CommunionHymn.text
ltx/en_us_public/eu.baptism:euBAP.Key0901.text	@ltx/en_us_holycross/eu.baptism:euBAP.Key0901.text
ltx/en_us_public/eu.baptism:euBAP.title	@ltx/en_us_holycross/eu.baptism:euBAP.title
ltx/en_us_public/eu.baptism:euBAP.translator	@ltx/en_us_holycross/eu.baptism:euBAP.translator
