ltx/en_us_public/sy.m07.d29:syMA.commemoration01.couplet1.title	@ltx/en_us_dedes/sy.m07.d29:syMA.commemoration01.couplet1.title
ltx/en_us_public/sy.m07.d29:syMA.commemoration01.couplet1.verse1	@ltx/en_us_dedes/sy.m07.d29:syMA.commemoration01.couplet1.verse1
ltx/en_us_public/sy.m07.d29:syMA.commemoration01.couplet1.verse2	@ltx/en_us_dedes/sy.m07.d29:syMA.commemoration01.couplet1.verse2
ltx/en_us_public/sy.m07.d29:syMA.commemoration01.narration.p01	@ltx/en_us_dedes/sy.m07.d29:syMA.commemoration01.narration.p01
ltx/en_us_public/sy.m07.d29:syMA.commemoration01.single1	@ltx/en_us_dedes/sy.m07.d29:syMA.commemoration01.single1
ltx/en_us_public/sy.m07.d29:syMA.commemoration01.text	@ltx/en_us_dedes/sy.m07.d29:syMA.commemoration01.text
ltx/en_us_public/sy.m07.d29:syMA.commemoration02.couplet1.title	@ltx/en_us_dedes/sy.m07.d29:syMA.commemoration02.couplet1.title
ltx/en_us_public/sy.m07.d29:syMA.commemoration02.couplet1.verse1	@ltx/en_us_dedes/sy.m07.d29:syMA.commemoration02.couplet1.verse1
ltx/en_us_public/sy.m07.d29:syMA.commemoration02.couplet1.verse2	@ltx/en_us_dedes/sy.m07.d29:syMA.commemoration02.couplet1.verse2
ltx/en_us_public/sy.m07.d29:syMA.commemoration02.narration.p01	@ltx/en_us_dedes/sy.m07.d29:syMA.commemoration02.narration.p01
ltx/en_us_public/sy.m07.d29:syMA.commemoration02.text	@ltx/en_us_dedes/sy.m07.d29:syMA.commemoration02.text
ltx/en_us_public/sy.m07.d29:syMA.commemoration03.couplet1.title	@ltx/en_us_dedes/sy.m07.d29:syMA.commemoration03.couplet1.title
ltx/en_us_public/sy.m07.d29:syMA.commemoration03.couplet1.verse1	@ltx/en_us_dedes/sy.m07.d29:syMA.commemoration03.couplet1.verse1
ltx/en_us_public/sy.m07.d29:syMA.commemoration03.couplet1.verse2	@ltx/en_us_dedes/sy.m07.d29:syMA.commemoration03.couplet1.verse2
ltx/en_us_public/sy.m07.d29:syMA.commemoration03.text	@ltx/en_us_dedes/sy.m07.d29:syMA.commemoration03.text
ltx/en_us_public/sy.m07.d29:syMA.commemoration04.couplet1.title	@ltx/en_us_dedes/sy.m07.d29:syMA.commemoration04.couplet1.title
ltx/en_us_public/sy.m07.d29:syMA.commemoration04.couplet1.verse1	@ltx/en_us_dedes/sy.m07.d29:syMA.commemoration04.couplet1.verse1
ltx/en_us_public/sy.m07.d29:syMA.commemoration04.couplet1.verse2	@ltx/en_us_dedes/sy.m07.d29:syMA.commemoration04.couplet1.verse2
ltx/en_us_public/sy.m07.d29:syMA.commemoration04.couplet2.verse1	@ltx/en_us_dedes/sy.m07.d29:syMA.commemoration04.couplet2.verse1
ltx/en_us_public/sy.m07.d29:syMA.commemoration04.couplet2.verse2	@ltx/en_us_dedes/sy.m07.d29:syMA.commemoration04.couplet2.verse2
ltx/en_us_public/sy.m07.d29:syMA.commemoration04.couplet3.verse1	@ltx/en_us_dedes/sy.m07.d29:syMA.commemoration04.couplet3.verse1
ltx/en_us_public/sy.m07.d29:syMA.commemoration04.couplet3.verse2	@ltx/en_us_dedes/sy.m07.d29:syMA.commemoration04.couplet3.verse2
ltx/en_us_public/sy.m07.d29:syMA.commemoration04.couplet4.verse1	@ltx/en_us_dedes/sy.m07.d29:syMA.commemoration04.couplet4.verse1
ltx/en_us_public/sy.m07.d29:syMA.commemoration04.couplet4.verse2	@ltx/en_us_dedes/sy.m07.d29:syMA.commemoration04.couplet4.verse2
ltx/en_us_public/sy.m07.d29:syMA.commemoration04.couplet5.verse1	@ltx/en_us_dedes/sy.m07.d29:syMA.commemoration04.couplet5.verse1
ltx/en_us_public/sy.m07.d29:syMA.commemoration04.couplet5.verse2	@ltx/en_us_dedes/sy.m07.d29:syMA.commemoration04.couplet5.verse2
ltx/en_us_public/sy.m07.d29:syMA.commemoration04.couplet6.verse1	@ltx/en_us_dedes/sy.m07.d29:syMA.commemoration04.couplet6.verse1
ltx/en_us_public/sy.m07.d29:syMA.commemoration04.couplet6.verse2	@ltx/en_us_dedes/sy.m07.d29:syMA.commemoration04.couplet6.verse2
ltx/en_us_public/sy.m07.d29:syMA.commemoration04.text	@ltx/en_us_dedes/sy.m07.d29:syMA.commemoration04.text
ltx/en_us_public/sy.m07.d29:syMA.lastline	@ltx/en_us_dedes/sy.m07.d29:syMA.lastline
