ltx/en_us_public/octoechos.rubrics:ocEO.R001	@ltx/en_us_dedes/octoechos.rubrics:ocEO.R001
ltx/en_us_public/octoechos.rubrics:ocEO.R002	@ltx/en_us_dedes/octoechos.rubrics:ocEO.R002
ltx/en_us_public/octoechos.rubrics:ocEO.R003	@ltx/en_us_dedes/octoechos.rubrics:ocEO.R003
ltx/en_us_public/octoechos.rubrics:ocEO.R004	@ltx/en_us_dedes/octoechos.rubrics:ocEO.R004
ltx/en_us_public/octoechos.rubrics:ocEO.R005	@ltx/en_us_dedes/octoechos.rubrics:ocEO.R005
ltx/en_us_public/octoechos.rubrics:ocEO.R006	@ltx/en_us_dedes/octoechos.rubrics:ocEO.R006
ltx/en_us_public/octoechos.rubrics:ocEO.R007	@ltx/en_us_dedes/octoechos.rubrics:ocEO.R007
ltx/en_us_public/octoechos.rubrics:ocEO.R008	@ltx/en_us_dedes/octoechos.rubrics:ocEO.R008
ltx/en_us_public/octoechos.rubrics:ocEO.R009	@ltx/en_us_dedes/octoechos.rubrics:ocEO.R009
ltx/en_us_public/octoechos.rubrics:ocEO.R010	@ltx/en_us_dedes/octoechos.rubrics:ocEO.R010
ltx/en_us_public/octoechos.rubrics:ocEO.R011	@ltx/en_us_dedes/octoechos.rubrics:ocEO.R011
ltx/en_us_public/octoechos.rubrics:ocEO.R012	@ltx/en_us_dedes/octoechos.rubrics:ocEO.R012
ltx/en_us_public/octoechos.rubrics:ocEO.R013	@ltx/en_us_dedes/octoechos.rubrics:ocEO.R013
ltx/en_us_public/octoechos.rubrics:ocEO.R014	@ltx/en_us_dedes/octoechos.rubrics:ocEO.R014
ltx/en_us_public/octoechos.rubrics:ocEO.R015	@ltx/en_us_dedes/octoechos.rubrics:ocEO.R015
ltx/en_us_public/octoechos.rubrics:ocEO.R016	@ltx/en_us_dedes/octoechos.rubrics:ocEO.R016
ltx/en_us_public/octoechos.rubrics:ocEO.R017	@ltx/en_us_dedes/octoechos.rubrics:ocEO.R017
ltx/en_us_public/octoechos.rubrics:ocEO.R018	@ltx/en_us_dedes/octoechos.rubrics:ocEO.R018
ltx/en_us_public/octoechos.rubrics:ocEO.R019	@ltx/en_us_dedes/octoechos.rubrics:ocEO.R019
ltx/en_us_public/octoechos.rubrics:ocEO.R020	@ltx/en_us_dedes/octoechos.rubrics:ocEO.R020
ltx/en_us_public/octoechos.rubrics:ocEO.R021	@ltx/en_us_dedes/octoechos.rubrics:ocEO.R021
ltx/en_us_public/octoechos.rubrics:ocEO.R022	@ltx/en_us_dedes/octoechos.rubrics:ocEO.R022
ltx/en_us_public/octoechos.rubrics:ocEO.R023	@ltx/en_us_dedes/octoechos.rubrics:ocEO.R023
ltx/en_us_public/octoechos.rubrics:ocEO.R024	@ltx/en_us_dedes/octoechos.rubrics:ocEO.R024
ltx/en_us_public/octoechos.rubrics:ocEO.R025	@ltx/en_us_dedes/octoechos.rubrics:ocEO.R025
ltx/en_us_public/octoechos.rubrics:ocEO.R026	@ltx/en_us_dedes/octoechos.rubrics:ocEO.R026
ltx/en_us_public/octoechos.rubrics:ocMA.R001	@ltx/en_us_dedes/octoechos.rubrics:ocMA.R001
ltx/en_us_public/octoechos.rubrics:ocMA.R002	@ltx/en_us_dedes/octoechos.rubrics:ocMA.R002
ltx/en_us_public/octoechos.rubrics:ocMA.R003	@ltx/en_us_dedes/octoechos.rubrics:ocMA.R003
ltx/en_us_public/octoechos.rubrics:ocMA.R004	@ltx/en_us_dedes/octoechos.rubrics:ocMA.R004
ltx/en_us_public/octoechos.rubrics:ocMA.R005	@ltx/en_us_dedes/octoechos.rubrics:ocMA.R005
ltx/en_us_public/octoechos.rubrics:ocMA.R006	@ltx/en_us_dedes/octoechos.rubrics:ocMA.R006
ltx/en_us_public/octoechos.rubrics:ocMA.R007	@ltx/en_us_dedes/octoechos.rubrics:ocMA.R007
ltx/en_us_public/octoechos.rubrics:ocMA.R008	@ltx/en_us_dedes/octoechos.rubrics:ocMA.R008
ltx/en_us_public/octoechos.rubrics:ocMA.R009	@ltx/en_us_dedes/octoechos.rubrics:ocMA.R009
ltx/en_us_public/octoechos.rubrics:ocMA.R010	@ltx/en_us_dedes/octoechos.rubrics:ocMA.R010
ltx/en_us_public/octoechos.rubrics:ocMA.R011	@ltx/en_us_dedes/octoechos.rubrics:ocMA.R011
ltx/en_us_public/octoechos.rubrics:ocMA.R012	@ltx/en_us_dedes/octoechos.rubrics:ocMA.R012
ltx/en_us_public/octoechos.rubrics:ocMA.R013	@ltx/en_us_dedes/octoechos.rubrics:ocMA.R013
ltx/en_us_public/octoechos.rubrics:ocMA.R014	@ltx/en_us_dedes/octoechos.rubrics:ocMA.R014
ltx/en_us_public/octoechos.rubrics:ocMO.R001	@ltx/en_us_dedes/octoechos.rubrics:ocMO.R001
ltx/en_us_public/octoechos.rubrics:ocPHOTAGOGIC.R001	@ltx/en_us_dedes/octoechos.rubrics:ocPHOTAGOGIC.R001
ltx/en_us_public/octoechos.rubrics:ocPHOTAGOGIC.R002	@ltx/en_us_dedes/octoechos.rubrics:ocPHOTAGOGIC.R002
ltx/en_us_public/octoechos.rubrics:ocPHOTAGOGIC.R003	@ltx/en_us_dedes/octoechos.rubrics:ocPHOTAGOGIC.R003
ltx/en_us_public/octoechos.rubrics:ocPHOTAGOGIC.R004	@ltx/en_us_dedes/octoechos.rubrics:ocPHOTAGOGIC.R004
ltx/en_us_public/octoechos.rubrics:ocPHOTAGOGIC.R005	@ltx/en_us_dedes/octoechos.rubrics:ocPHOTAGOGIC.R005
ltx/en_us_public/octoechos.rubrics:ocPHOTAGOGIC.R006	@ltx/en_us_dedes/octoechos.rubrics:ocPHOTAGOGIC.R006
ltx/en_us_public/octoechos.rubrics:ocPHOTAGOGIC.R007	@ltx/en_us_dedes/octoechos.rubrics:ocPHOTAGOGIC.R007
ltx/en_us_public/octoechos.rubrics:ocPHOTAGOGIC.R008	@ltx/en_us_dedes/octoechos.rubrics:ocPHOTAGOGIC.R008
ltx/en_us_public/octoechos.rubrics:ocPHOTAGOGIC.R009	@ltx/en_us_dedes/octoechos.rubrics:ocPHOTAGOGIC.R009
ltx/en_us_public/octoechos.rubrics:ocPHOTAGOGIC.R010	@ltx/en_us_dedes/octoechos.rubrics:ocPHOTAGOGIC.R010
ltx/en_us_public/octoechos.rubrics:ocPHOTAGOGIC.R011	@ltx/en_us_dedes/octoechos.rubrics:ocPHOTAGOGIC.R011
ltx/en_us_public/octoechos.rubrics:ocPHOTAGOGIC.R012	@ltx/en_us_dedes/octoechos.rubrics:ocPHOTAGOGIC.R012
ltx/en_us_public/octoechos.rubrics:ocPHOTAGOGIC.R013	@ltx/en_us_dedes/octoechos.rubrics:ocPHOTAGOGIC.R013
ltx/en_us_public/octoechos.rubrics:ocSV.R001	@ltx/en_us_dedes/octoechos.rubrics:ocSV.R001
ltx/en_us_public/octoechos.rubrics:ocSV.R002	@ltx/en_us_dedes/octoechos.rubrics:ocSV.R002
ltx/en_us_public/octoechos.rubrics:ocSV.R003	@ltx/en_us_dedes/octoechos.rubrics:ocSV.R003
ltx/en_us_public/octoechos.rubrics:ocSV.R004	@ltx/en_us_dedes/octoechos.rubrics:ocSV.R004
ltx/en_us_public/octoechos.rubrics:ocSV.R005	@ltx/en_us_dedes/octoechos.rubrics:ocSV.R005
ltx/en_us_public/octoechos.rubrics:ocSV.R006	@ltx/en_us_dedes/octoechos.rubrics:ocSV.R006
ltx/en_us_public/octoechos.rubrics:ocSV.R007	@ltx/en_us_dedes/octoechos.rubrics:ocSV.R007
ltx/en_us_public/octoechos.rubrics:ocSV.R008	@ltx/en_us_dedes/octoechos.rubrics:ocSV.R008
ltx/en_us_public/octoechos.rubrics:ocTHEOTOKIA.R001	@ltx/en_us_dedes/octoechos.rubrics:ocTHEOTOKIA.R001
ltx/en_us_public/octoechos.rubrics:ocTHEOTOKIA.R002	@ltx/en_us_dedes/octoechos.rubrics:ocTHEOTOKIA.R002
ltx/en_us_public/octoechos.rubrics:ocTHEOTOKIA.R003	@ltx/en_us_dedes/octoechos.rubrics:ocTHEOTOKIA.R003
ltx/en_us_public/octoechos.rubrics:ocTHEOTOKIA.R004	@ltx/en_us_dedes/octoechos.rubrics:ocTHEOTOKIA.R004
ltx/en_us_public/octoechos.rubrics:ocTHEOTOKIA.R005	@ltx/en_us_dedes/octoechos.rubrics:ocTHEOTOKIA.R005
ltx/en_us_public/octoechos.rubrics:ocTHEOTOKIA.R006	@ltx/en_us_dedes/octoechos.rubrics:ocTHEOTOKIA.R006
ltx/en_us_public/octoechos.rubrics:ocTHEOTOKIA.R007	@ltx/en_us_dedes/octoechos.rubrics:ocTHEOTOKIA.R007
ltx/en_us_public/octoechos.rubrics:ocTHEOTOKIA.R008	@ltx/en_us_dedes/octoechos.rubrics:ocTHEOTOKIA.R008
ltx/en_us_public/octoechos.rubrics:ocTHEOTOKIA.R009	@ltx/en_us_dedes/octoechos.rubrics:ocTHEOTOKIA.R009
ltx/en_us_public/octoechos.rubrics:ocTHEOTOKIA.R010	@ltx/en_us_dedes/octoechos.rubrics:ocTHEOTOKIA.R010
ltx/en_us_public/octoechos.rubrics:ocTHEOTOKIA.R011	@ltx/en_us_dedes/octoechos.rubrics:ocTHEOTOKIA.R011
ltx/en_us_public/octoechos.rubrics:ocTHEOTOKIA.R012	@ltx/en_us_dedes/octoechos.rubrics:ocTHEOTOKIA.R012
ltx/en_us_public/octoechos.rubrics:ocTHEOTOKIA.R013	@ltx/en_us_dedes/octoechos.rubrics:ocTHEOTOKIA.R013
ltx/en_us_public/octoechos.rubrics:ocTHEOTOKIA.R014	@ltx/en_us_dedes/octoechos.rubrics:ocTHEOTOKIA.R014
ltx/en_us_public/octoechos.rubrics:ocTHEOTOKIA.R015	@ltx/en_us_dedes/octoechos.rubrics:ocTHEOTOKIA.R015
ltx/en_us_public/octoechos.rubrics:ocTHEOTOKIA.R016	@ltx/en_us_dedes/octoechos.rubrics:ocTHEOTOKIA.R016
ltx/en_us_public/octoechos.rubrics:ocTHEOTOKIA.R017	@ltx/en_us_dedes/octoechos.rubrics:ocTHEOTOKIA.R017
ltx/en_us_public/octoechos.rubrics:ocTHEOTOKIA.R018	@ltx/en_us_dedes/octoechos.rubrics:ocTHEOTOKIA.R018
ltx/en_us_public/octoechos.rubrics:ocTHEOTOKIA.R019	@ltx/en_us_dedes/octoechos.rubrics:ocTHEOTOKIA.R019
ltx/en_us_public/octoechos.rubrics:ocTRIADIC.R001	@ltx/en_us_dedes/octoechos.rubrics:ocTRIADIC.R001
ltx/en_us_public/octoechos.rubrics:ocTRIADIC.R002	@ltx/en_us_dedes/octoechos.rubrics:ocTRIADIC.R002
ltx/en_us_public/octoechos.rubrics:ocTRIADIC.R003	@ltx/en_us_dedes/octoechos.rubrics:ocTRIADIC.R003
ltx/en_us_public/octoechos.rubrics:ocTRIADIC.R004	@ltx/en_us_dedes/octoechos.rubrics:ocTRIADIC.R004
ltx/en_us_public/octoechos.rubrics:ocTRIADIC.R005	@ltx/en_us_dedes/octoechos.rubrics:ocTRIADIC.R005
ltx/en_us_public/octoechos.rubrics:ocTRIADIC.R006	@ltx/en_us_dedes/octoechos.rubrics:ocTRIADIC.R006
ltx/en_us_public/octoechos.rubrics:ocTRIADIC.R007	@ltx/en_us_dedes/octoechos.rubrics:ocTRIADIC.R007
ltx/en_us_public/octoechos.rubrics:ocTRIADIC.R008	@ltx/en_us_dedes/octoechos.rubrics:ocTRIADIC.R008
ltx/en_us_public/octoechos.rubrics:ocTRIADIC.R009	@ltx/en_us_dedes/octoechos.rubrics:ocTRIADIC.R009
ltx/en_us_public/octoechos.rubrics:ocTRIADIC.R010	@ltx/en_us_dedes/octoechos.rubrics:ocTRIADIC.R010
ltx/en_us_public/octoechos.rubrics:ocTRIADIC.R011	@ltx/en_us_dedes/octoechos.rubrics:ocTRIADIC.R011
ltx/en_us_public/octoechos.rubrics:ocTRIADIC.R012	@ltx/en_us_dedes/octoechos.rubrics:ocTRIADIC.R012
ltx/en_us_public/octoechos.rubrics:ocTRIADIC.R013	@ltx/en_us_dedes/octoechos.rubrics:ocTRIADIC.R013
ltx/en_us_public/octoechos.rubrics:ocTRIADIC.R014	@ltx/en_us_dedes/octoechos.rubrics:ocTRIADIC.R014
ltx/en_us_public/octoechos.rubrics:ocVE.R001	@ltx/en_us_dedes/octoechos.rubrics:ocVE.R001
ltx/en_us_public/octoechos.rubrics:ocVE.R002	@ltx/en_us_dedes/octoechos.rubrics:ocVE.R002
ltx/en_us_public/octoechos.rubrics:ocVE.R003	@ltx/en_us_dedes/octoechos.rubrics:ocVE.R003
ltx/en_us_public/octoechos.rubrics:ocVE.R004	@ltx/en_us_dedes/octoechos.rubrics:ocVE.R004
ltx/en_us_public/octoechos.rubrics:ocVE.R005	@ltx/en_us_dedes/octoechos.rubrics:ocVE.R005
ltx/en_us_public/octoechos.rubrics:ocVE.R006	@ltx/en_us_dedes/octoechos.rubrics:ocVE.R006
ltx/en_us_public/octoechos.rubrics:ocVE.R007	@ltx/en_us_dedes/octoechos.rubrics:ocVE.R007
ltx/en_us_public/octoechos.rubrics:ocVE.R008	@ltx/en_us_dedes/octoechos.rubrics:ocVE.R008
ltx/en_us_public/octoechos.rubrics:ocVE.R009	@ltx/en_us_dedes/octoechos.rubrics:ocVE.R009
ltx/en_us_public/octoechos.rubrics:ocVE.R010	@ltx/en_us_dedes/octoechos.rubrics:ocVE.R010
ltx/en_us_public/octoechos.rubrics:ocVE.R011	@ltx/en_us_dedes/octoechos.rubrics:ocVE.R011
ltx/en_us_public/octoechos.rubrics:ocVE.R012	@ltx/en_us_dedes/octoechos.rubrics:ocVE.R012
ltx/en_us_public/octoechos.rubrics:ocVE.R013	@ltx/en_us_dedes/octoechos.rubrics:ocVE.R013
ltx/en_us_public/octoechos.rubrics:ocVE.R014	@ltx/en_us_dedes/octoechos.rubrics:ocVE.R014
ltx/en_us_public/octoechos.rubrics:ocVE.R015	@ltx/en_us_dedes/octoechos.rubrics:ocVE.R015
