ltx/en_us_public/le.ep.va.baptism:levaBAP.Epistle.book_abbr	@ltx/en_us_rsv/le.ep.va.baptism:levaBAP.Epistle.book_abbr
ltx/en_us_public/le.ep.va.baptism:levaBAP.Epistle.book_string	@ltx/en_us_rsv/le.ep.va.baptism:levaBAP.Epistle.book_string
ltx/en_us_public/le.ep.va.baptism:levaBAP.Epistle.chapverse	@ltx/en_us_rsv/le.ep.va.baptism:levaBAP.Epistle.chapverse
ltx/en_us_public/le.ep.va.baptism:levaBAP.Epistle.incipit	@ltx/en_us_rsv/le.ep.va.baptism:levaBAP.Epistle.incipit
ltx/en_us_public/le.ep.va.baptism:levaBAP.Epistle.text	@ltx/en_us_rsv/le.ep.va.baptism:levaBAP.Epistle.text
ltx/en_us_public/le.ep.va.baptism:levaBAP.Epistle.title	@ltx/en_us_rsv/le.ep.va.baptism:levaBAP.Epistle.title
ltx/en_us_public/le.ep.va.baptism:levaBAP.Epistle.title_abbr	@ltx/en_us_rsv/le.ep.va.baptism:levaBAP.Epistle.title_abbr
ltx/en_us_public/le.ep.va.baptism:levaBAP.Epistle.version	@ltx/en_us_rsv/le.ep.va.baptism:levaBAP.Epistle.version
