ltx/en_us_public/pe.d124:peDA.commemoration.full	@ltx/en_us_dedes/pe.d124:peDA.commemoration.full
ltx/en_us_public/pe.d124:peDA.commemoration.short	@ltx/en_us_dedes/pe.d124:peDA.commemoration.short
ltx/en_us_public/pe.d124:peDA.dismissal	@ltx/en_us_dedes/pe.d124:peDA.dismissal
ltx/en_us_public/pe.d124:peDA.insert1	@ltx/en_us_dedes/pe.d124:peDA.insert1
ltx/en_us_public/pe.d124:peDA.insert2	@ltx/en_us_dedes/pe.d124:peDA.insert2
ltx/en_us_public/pe.d124:peDA.note	@ltx/en_us_dedes/pe.d124:peDA.note
ltx/en_us_public/pe.d124:peHO.commemorations	@ltx/en_us_dedes/pe.d124:peHO.commemorations
ltx/en_us_public/pe.d124:peHO.daytitle	@ltx/en_us_dedes/pe.d124:peHO.daytitle
ltx/en_us_public/pe.d124:peHO.description1	@ltx/en_us_dedes/pe.d124:peHO.description1
ltx/en_us_public/pe.d124:peHO.description2	@ltx/en_us_dedes/pe.d124:peHO.description2
ltx/en_us_public/pe.d124:peHO.note1	@ltx/en_us_dedes/pe.d124:peHO.note1
ltx/en_us_public/pe.d124:peHO.note2	@ltx/en_us_dedes/pe.d124:peHO.note2
ltx/en_us_public/pe.d124:peMA.AposGlory.incipit	@ltx/en_us_dedes/pe.d124:peMA.AposGlory.incipit
ltx/en_us_public/pe.d124:peMA.AposGlory.melody	@ltx/en_us_dedes/pe.d124:peMA.AposGlory.melody
ltx/en_us_public/pe.d124:peMA.AposGlory.mode	@ltx/en_us_dedes/pe.d124:peMA.AposGlory.mode
ltx/en_us_public/pe.d124:peMA.AposGlory.text	@ltx/en_us_dedes/pe.d124:peMA.AposGlory.text
ltx/en_us_public/pe.d124:peMA.Aposticha1.incipit	@ltx/en_us_goadedes/pe.d124:peMA.Aposticha1.incipit
ltx/en_us_public/pe.d124:peMA.Aposticha1.melody	@ltx/en_us_goadedes/pe.d124:peMA.Aposticha1.melody
ltx/en_us_public/pe.d124:peMA.Aposticha1.mode	@ltx/en_us_goadedes/pe.d124:peMA.Aposticha1.mode
ltx/en_us_public/pe.d124:peMA.Aposticha1.text	@ltx/en_us_goadedes/pe.d124:peMA.Aposticha1.text
ltx/en_us_public/pe.d124:peMA.Aposticha2.incipit	@ltx/en_us_goadedes/pe.d124:peMA.Aposticha2.incipit
ltx/en_us_public/pe.d124:peMA.Aposticha2.melody	@ltx/en_us_goadedes/pe.d124:peMA.Aposticha2.melody
ltx/en_us_public/pe.d124:peMA.Aposticha2.mode	@ltx/en_us_goadedes/pe.d124:peMA.Aposticha2.mode
ltx/en_us_public/pe.d124:peMA.Aposticha2.text	@ltx/en_us_goadedes/pe.d124:peMA.Aposticha2.text
ltx/en_us_public/pe.d124:peMA.Aposticha3.incipit	@ltx/en_us_goadedes/pe.d124:peMA.Aposticha3.incipit
ltx/en_us_public/pe.d124:peMA.Aposticha3.melody	@ltx/en_us_goadedes/pe.d124:peMA.Aposticha3.melody
ltx/en_us_public/pe.d124:peMA.Aposticha3.mode	@ltx/en_us_goadedes/pe.d124:peMA.Aposticha3.mode
ltx/en_us_public/pe.d124:peMA.Aposticha3.text	@ltx/en_us_goadedes/pe.d124:peMA.Aposticha3.text
ltx/en_us_public/pe.d124:peMA.Kathisma11.greekmelody	@ltx/en_us_dedes/pe.d124:peMA.Kathisma11.greekmelody
ltx/en_us_public/pe.d124:peMA.Kathisma11.incipit	@ltx/en_us_dedes/pe.d124:peMA.Kathisma11.incipit
ltx/en_us_public/pe.d124:peMA.Kathisma11.melody	@ltx/en_us_dedes/pe.d124:peMA.Kathisma11.melody
ltx/en_us_public/pe.d124:peMA.Kathisma11.mode	@ltx/en_us_dedes/pe.d124:peMA.Kathisma11.mode
ltx/en_us_public/pe.d124:peMA.Kathisma11.text	@ltx/en_us_dedes/pe.d124:peMA.Kathisma11.text
ltx/en_us_public/pe.d124:peMA.Kathisma21.greekmelody	@ltx/en_us_dedes/pe.d124:peMA.Kathisma21.greekmelody
ltx/en_us_public/pe.d124:peMA.Kathisma21.incipit	@ltx/en_us_dedes/pe.d124:peMA.Kathisma21.incipit
ltx/en_us_public/pe.d124:peMA.Kathisma21.melody	@ltx/en_us_dedes/pe.d124:peMA.Kathisma21.melody
ltx/en_us_public/pe.d124:peMA.Kathisma21.mode	@ltx/en_us_dedes/pe.d124:peMA.Kathisma21.mode
ltx/en_us_public/pe.d124:peMA.Kathisma21.text	@ltx/en_us_dedes/pe.d124:peMA.Kathisma21.text
ltx/en_us_public/pe.d124:peVE.AposGlory.incipit	@ltx/en_us_dedes/pe.d124:peVE.AposGlory.incipit
ltx/en_us_public/pe.d124:peVE.AposGlory.melody	@ltx/en_us_dedes/pe.d124:peVE.AposGlory.melody
ltx/en_us_public/pe.d124:peVE.AposGlory.mode	@ltx/en_us_dedes/pe.d124:peVE.AposGlory.mode
ltx/en_us_public/pe.d124:peVE.AposGlory.text	@ltx/en_us_dedes/pe.d124:peVE.AposGlory.text
ltx/en_us_public/pe.d124:peVE.Aposticha1.greekmelody	@ltx/en_us_dedes/pe.d124:peVE.Aposticha1.greekmelody
ltx/en_us_public/pe.d124:peVE.Aposticha1.incipit	@ltx/en_us_goadedes/pe.d124:peVE.Aposticha1.incipit
ltx/en_us_public/pe.d124:peVE.Aposticha1.melody	@ltx/en_us_goadedes/pe.d124:peVE.Aposticha1.melody
ltx/en_us_public/pe.d124:peVE.Aposticha1.mode	@ltx/en_us_goadedes/pe.d124:peVE.Aposticha1.mode
ltx/en_us_public/pe.d124:peVE.Aposticha1.text	@ltx/en_us_goadedes/pe.d124:peVE.Aposticha1.text
ltx/en_us_public/pe.d124:peVE.Aposticha2.incipit	@ltx/en_us_goadedes/pe.d124:peVE.Aposticha2.incipit
ltx/en_us_public/pe.d124:peVE.Aposticha2.melody	@ltx/en_us_goadedes/pe.d124:peVE.Aposticha2.melody
ltx/en_us_public/pe.d124:peVE.Aposticha2.mode	@ltx/en_us_goadedes/pe.d124:peVE.Aposticha2.mode
ltx/en_us_public/pe.d124:peVE.Aposticha2.text	@ltx/en_us_goadedes/pe.d124:peVE.Aposticha2.text
ltx/en_us_public/pe.d124:peVE.Aposticha3.incipit	@ltx/en_us_goadedes/pe.d124:peVE.Aposticha3.incipit
ltx/en_us_public/pe.d124:peVE.Aposticha3.melody	@ltx/en_us_goadedes/pe.d124:peVE.Aposticha3.melody
ltx/en_us_public/pe.d124:peVE.Aposticha3.mode	@ltx/en_us_goadedes/pe.d124:peVE.Aposticha3.mode
ltx/en_us_public/pe.d124:peVE.Aposticha3.text	@ltx/en_us_goadedes/pe.d124:peVE.Aposticha3.text
ltx/en_us_public/pe.d124:peVE.SticGlory.incipit	@ltx/en_us_dedes/pe.d124:peVE.SticGlory.incipit
ltx/en_us_public/pe.d124:peVE.SticGlory.melody	@ltx/en_us_dedes/pe.d124:peVE.SticGlory.melody
ltx/en_us_public/pe.d124:peVE.SticGlory.mode	@ltx/en_us_dedes/pe.d124:peVE.SticGlory.mode
ltx/en_us_public/pe.d124:peVE.SticGlory.text	@ltx/en_us_dedes/pe.d124:peVE.SticGlory.text
ltx/en_us_public/pe.d124:peVE.Stichera01.greekmelody	@ltx/en_us_dedes/pe.d124:peVE.Stichera01.greekmelody
ltx/en_us_public/pe.d124:peVE.Stichera01.incipit	@ltx/en_us_goadedes/pe.d124:peVE.Stichera01.incipit
ltx/en_us_public/pe.d124:peVE.Stichera01.melody	@ltx/en_us_goadedes/pe.d124:peVE.Stichera01.melody
ltx/en_us_public/pe.d124:peVE.Stichera01.mode	@ltx/en_us_goadedes/pe.d124:peVE.Stichera01.mode
ltx/en_us_public/pe.d124:peVE.Stichera01.text	@ltx/en_us_goadedes/pe.d124:peVE.Stichera01.text
ltx/en_us_public/pe.d124:peVE.Stichera02.incipit	@ltx/en_us_goadedes/pe.d124:peVE.Stichera02.incipit
ltx/en_us_public/pe.d124:peVE.Stichera02.melody	@ltx/en_us_goadedes/pe.d124:peVE.Stichera02.melody
ltx/en_us_public/pe.d124:peVE.Stichera02.mode	@ltx/en_us_goadedes/pe.d124:peVE.Stichera02.mode
ltx/en_us_public/pe.d124:peVE.Stichera02.text	@ltx/en_us_goadedes/pe.d124:peVE.Stichera02.text
ltx/en_us_public/pe.d124:peVE.Stichera03.incipit	@ltx/en_us_goadedes/pe.d124:peVE.Stichera03.incipit
ltx/en_us_public/pe.d124:peVE.Stichera03.melody	@ltx/en_us_goadedes/pe.d124:peVE.Stichera03.melody
ltx/en_us_public/pe.d124:peVE.Stichera03.mode	@ltx/en_us_goadedes/pe.d124:peVE.Stichera03.mode
ltx/en_us_public/pe.d124:peVE.Stichera03.text	@ltx/en_us_goadedes/pe.d124:peVE.Stichera03.text
