ltx/en_us_public/sy.m02.d26:alt1.syMA.commemoration01.couplet1.title	@ltx/en_us_dedes/sy.m02.d26:alt1.syMA.commemoration01.couplet1.title
ltx/en_us_public/sy.m02.d26:alt1.syMA.commemoration01.couplet1.verse1	@ltx/en_us_dedes/sy.m02.d26:alt1.syMA.commemoration01.couplet1.verse1
ltx/en_us_public/sy.m02.d26:alt1.syMA.commemoration01.couplet1.verse2	@ltx/en_us_dedes/sy.m02.d26:alt1.syMA.commemoration01.couplet1.verse2
ltx/en_us_public/sy.m02.d26:alt1.syMA.commemoration01.text	@ltx/en_us_dedes/sy.m02.d26:alt1.syMA.commemoration01.text
ltx/en_us_public/sy.m02.d26:syMA.commemoration01.couplet1.title	@ltx/en_us_dedes/sy.m02.d26:syMA.commemoration01.couplet1.title
ltx/en_us_public/sy.m02.d26:syMA.commemoration01.couplet1.verse1	@ltx/en_us_dedes/sy.m02.d26:syMA.commemoration01.couplet1.verse1
ltx/en_us_public/sy.m02.d26:syMA.commemoration01.couplet1.verse2	@ltx/en_us_dedes/sy.m02.d26:syMA.commemoration01.couplet1.verse2
ltx/en_us_public/sy.m02.d26:syMA.commemoration01.narration.p01	@ltx/en_us_dedes/sy.m02.d26:syMA.commemoration01.narration.p01
ltx/en_us_public/sy.m02.d26:syMA.commemoration01.narration.p02	@ltx/en_us_dedes/sy.m02.d26:syMA.commemoration01.narration.p02
ltx/en_us_public/sy.m02.d26:syMA.commemoration01.narration.p03	@ltx/en_us_dedes/sy.m02.d26:syMA.commemoration01.narration.p03
ltx/en_us_public/sy.m02.d26:syMA.commemoration01.single1	@ltx/en_us_dedes/sy.m02.d26:syMA.commemoration01.single1
ltx/en_us_public/sy.m02.d26:syMA.commemoration01.text	@ltx/en_us_dedes/sy.m02.d26:syMA.commemoration01.text
ltx/en_us_public/sy.m02.d26:syMA.commemoration01as02.text	@ltx/en_us_dedes/sy.m02.d26:syMA.commemoration01as02.text
ltx/en_us_public/sy.m02.d26:syMA.commemoration02.couplet1.title	@ltx/en_us_dedes/sy.m02.d26:syMA.commemoration02.couplet1.title
ltx/en_us_public/sy.m02.d26:syMA.commemoration02.couplet1.verse1	@ltx/en_us_dedes/sy.m02.d26:syMA.commemoration02.couplet1.verse1
ltx/en_us_public/sy.m02.d26:syMA.commemoration02.couplet1.verse2	@ltx/en_us_dedes/sy.m02.d26:syMA.commemoration02.couplet1.verse2
ltx/en_us_public/sy.m02.d26:syMA.commemoration02.narration.p01	@ltx/en_us_dedes/sy.m02.d26:syMA.commemoration02.narration.p01
ltx/en_us_public/sy.m02.d26:syMA.commemoration02.narration.p02	@ltx/en_us_dedes/sy.m02.d26:syMA.commemoration02.narration.p02
ltx/en_us_public/sy.m02.d26:syMA.commemoration02.narration.p03	@ltx/en_us_dedes/sy.m02.d26:syMA.commemoration02.narration.p03
ltx/en_us_public/sy.m02.d26:syMA.commemoration02.narration.p04	@ltx/en_us_dedes/sy.m02.d26:syMA.commemoration02.narration.p04
ltx/en_us_public/sy.m02.d26:syMA.commemoration02.narration.p05	@ltx/en_us_dedes/sy.m02.d26:syMA.commemoration02.narration.p05
ltx/en_us_public/sy.m02.d26:syMA.commemoration02.narration.p06	@ltx/en_us_dedes/sy.m02.d26:syMA.commemoration02.narration.p06
ltx/en_us_public/sy.m02.d26:syMA.commemoration02.narration.p07	@ltx/en_us_dedes/sy.m02.d26:syMA.commemoration02.narration.p07
ltx/en_us_public/sy.m02.d26:syMA.commemoration02.narration.p08	@ltx/en_us_dedes/sy.m02.d26:syMA.commemoration02.narration.p08
ltx/en_us_public/sy.m02.d26:syMA.commemoration02.narration.p09	@ltx/en_us_dedes/sy.m02.d26:syMA.commemoration02.narration.p09
ltx/en_us_public/sy.m02.d26:syMA.commemoration02.narration.p10	@ltx/en_us_dedes/sy.m02.d26:syMA.commemoration02.narration.p10
ltx/en_us_public/sy.m02.d26:syMA.commemoration02.narration.p11	@ltx/en_us_dedes/sy.m02.d26:syMA.commemoration02.narration.p11
ltx/en_us_public/sy.m02.d26:syMA.commemoration02.narration.p12	@ltx/en_us_dedes/sy.m02.d26:syMA.commemoration02.narration.p12
ltx/en_us_public/sy.m02.d26:syMA.commemoration02.narration.p13	@ltx/en_us_dedes/sy.m02.d26:syMA.commemoration02.narration.p13
ltx/en_us_public/sy.m02.d26:syMA.commemoration02.narration.p14	@ltx/en_us_dedes/sy.m02.d26:syMA.commemoration02.narration.p14
ltx/en_us_public/sy.m02.d26:syMA.commemoration02.narration.p15	@ltx/en_us_dedes/sy.m02.d26:syMA.commemoration02.narration.p15
ltx/en_us_public/sy.m02.d26:syMA.commemoration02.narration.p16	@ltx/en_us_dedes/sy.m02.d26:syMA.commemoration02.narration.p16
ltx/en_us_public/sy.m02.d26:syMA.commemoration02.narration.p17	@ltx/en_us_dedes/sy.m02.d26:syMA.commemoration02.narration.p17
ltx/en_us_public/sy.m02.d26:syMA.commemoration02.text	@ltx/en_us_dedes/sy.m02.d26:syMA.commemoration02.text
ltx/en_us_public/sy.m02.d26:syMA.commemoration03.couplet1.title	@ltx/en_us_dedes/sy.m02.d26:syMA.commemoration03.couplet1.title
ltx/en_us_public/sy.m02.d26:syMA.commemoration03.couplet1.verse1	@ltx/en_us_dedes/sy.m02.d26:syMA.commemoration03.couplet1.verse1
ltx/en_us_public/sy.m02.d26:syMA.commemoration03.couplet1.verse2	@ltx/en_us_dedes/sy.m02.d26:syMA.commemoration03.couplet1.verse2
ltx/en_us_public/sy.m02.d26:syMA.commemoration03.text	@ltx/en_us_dedes/sy.m02.d26:syMA.commemoration03.text
ltx/en_us_public/sy.m02.d26:syMA.commemoration04.couplet1.title	@ltx/en_us_dedes/sy.m02.d26:syMA.commemoration04.couplet1.title
ltx/en_us_public/sy.m02.d26:syMA.commemoration04.couplet1.verse1	@ltx/en_us_dedes/sy.m02.d26:syMA.commemoration04.couplet1.verse1
ltx/en_us_public/sy.m02.d26:syMA.commemoration04.couplet1.verse2	@ltx/en_us_dedes/sy.m02.d26:syMA.commemoration04.couplet1.verse2
ltx/en_us_public/sy.m02.d26:syMA.commemoration04.text	@ltx/en_us_dedes/sy.m02.d26:syMA.commemoration04.text
ltx/en_us_public/sy.m02.d26:syMA.commemoration05.couplet1.title	@ltx/en_us_dedes/sy.m02.d26:syMA.commemoration05.couplet1.title
ltx/en_us_public/sy.m02.d26:syMA.commemoration05.couplet1.verse1	@ltx/en_us_dedes/sy.m02.d26:syMA.commemoration05.couplet1.verse1
ltx/en_us_public/sy.m02.d26:syMA.commemoration05.couplet1.verse2	@ltx/en_us_dedes/sy.m02.d26:syMA.commemoration05.couplet1.verse2
ltx/en_us_public/sy.m02.d26:syMA.commemoration05.text	@ltx/en_us_dedes/sy.m02.d26:syMA.commemoration05.text
ltx/en_us_public/sy.m02.d26:syMA.commemoration06.couplet1.title	@ltx/en_us_dedes/sy.m02.d26:syMA.commemoration06.couplet1.title
ltx/en_us_public/sy.m02.d26:syMA.commemoration06.couplet1.verse1	@ltx/en_us_dedes/sy.m02.d26:syMA.commemoration06.couplet1.verse1
ltx/en_us_public/sy.m02.d26:syMA.commemoration06.couplet1.verse2	@ltx/en_us_dedes/sy.m02.d26:syMA.commemoration06.couplet1.verse2
ltx/en_us_public/sy.m02.d26:syMA.commemoration06.text	@ltx/en_us_dedes/sy.m02.d26:syMA.commemoration06.text
ltx/en_us_public/sy.m02.d26:syMA.commemoration07.couplet1.title	@ltx/en_us_dedes/sy.m02.d26:syMA.commemoration07.couplet1.title
ltx/en_us_public/sy.m02.d26:syMA.commemoration07.couplet1.verse1	@ltx/en_us_dedes/sy.m02.d26:syMA.commemoration07.couplet1.verse1
ltx/en_us_public/sy.m02.d26:syMA.commemoration07.couplet1.verse2	@ltx/en_us_dedes/sy.m02.d26:syMA.commemoration07.couplet1.verse2
ltx/en_us_public/sy.m02.d26:syMA.commemoration07.text	@ltx/en_us_dedes/sy.m02.d26:syMA.commemoration07.text
ltx/en_us_public/sy.m02.d26:syMA.commemoration08.couplet1.title	@ltx/en_us_dedes/sy.m02.d26:syMA.commemoration08.couplet1.title
ltx/en_us_public/sy.m02.d26:syMA.commemoration08.couplet1.verse1	@ltx/en_us_dedes/sy.m02.d26:syMA.commemoration08.couplet1.verse1
ltx/en_us_public/sy.m02.d26:syMA.commemoration08.couplet1.verse2	@ltx/en_us_dedes/sy.m02.d26:syMA.commemoration08.couplet1.verse2
ltx/en_us_public/sy.m02.d26:syMA.commemoration08.text	@ltx/en_us_dedes/sy.m02.d26:syMA.commemoration08.text
ltx/en_us_public/sy.m02.d26:syMA.commemoration09.couplet1.title	@ltx/en_us_dedes/sy.m02.d26:syMA.commemoration09.couplet1.title
ltx/en_us_public/sy.m02.d26:syMA.commemoration09.couplet1.verse1	@ltx/en_us_dedes/sy.m02.d26:syMA.commemoration09.couplet1.verse1
ltx/en_us_public/sy.m02.d26:syMA.commemoration09.couplet1.verse2	@ltx/en_us_dedes/sy.m02.d26:syMA.commemoration09.couplet1.verse2
ltx/en_us_public/sy.m02.d26:syMA.commemoration09.text	@ltx/en_us_dedes/sy.m02.d26:syMA.commemoration09.text
ltx/en_us_public/sy.m02.d26:syMA.commemoration10.couplet1.title	@ltx/en_us_dedes/sy.m02.d26:syMA.commemoration10.couplet1.title
ltx/en_us_public/sy.m02.d26:syMA.commemoration10.couplet1.verse1	@ltx/en_us_dedes/sy.m02.d26:syMA.commemoration10.couplet1.verse1
ltx/en_us_public/sy.m02.d26:syMA.commemoration10.couplet1.verse2	@ltx/en_us_dedes/sy.m02.d26:syMA.commemoration10.couplet1.verse2
ltx/en_us_public/sy.m02.d26:syMA.commemoration10.text	@ltx/en_us_dedes/sy.m02.d26:syMA.commemoration10.text
ltx/en_us_public/sy.m02.d26:syMA.lastline	@ltx/en_us_dedes/sy.m02.d26:syMA.lastline
ltx/en_us_public/sy.m02.d26:syMA.note1	@ltx/en_us_dedes/sy.m02.d26:syMA.note1
