ltx/en_us_public/le.go.me.m12.d24:lemeH1.Gospel.book_abbr	@ltx/en_us_rsv/le.go.me.m12.d24:lemeH1.Gospel.book_abbr
ltx/en_us_public/le.go.me.m12.d24:lemeH1.Gospel.book_string	@ltx/en_us_rsv/le.go.me.m12.d24:lemeH1.Gospel.book_string
ltx/en_us_public/le.go.me.m12.d24:lemeH1.Gospel.chapverse	@ltx/en_us_rsv/le.go.me.m12.d24:lemeH1.Gospel.chapverse
ltx/en_us_public/le.go.me.m12.d24:lemeH1.Gospel.incipit	@ltx/en_us_rsv/le.go.me.m12.d24:lemeH1.Gospel.incipit
ltx/en_us_public/le.go.me.m12.d24:lemeH1.Gospel.text	@ltx/en_us_rsv/le.go.me.m12.d24:lemeH1.Gospel.text
ltx/en_us_public/le.go.me.m12.d24:lemeH1.Gospel.title	@ltx/en_us_rsv/le.go.me.m12.d24:lemeH1.Gospel.title
ltx/en_us_public/le.go.me.m12.d24:lemeH1.Gospel.title_abbr	@ltx/en_us_rsv/le.go.me.m12.d24:lemeH1.Gospel.title_abbr
ltx/en_us_public/le.go.me.m12.d24:lemeH1.Gospel.version	@ltx/en_us_rsv/le.go.me.m12.d24:lemeH1.Gospel.version
ltx/en_us_public/le.go.me.m12.d24:lemeH3.Gospel.book_abbr	@ltx/en_us_rsv/le.go.me.m12.d24:lemeH3.Gospel.book_abbr
ltx/en_us_public/le.go.me.m12.d24:lemeH3.Gospel.book_string	@ltx/en_us_rsv/le.go.me.m12.d24:lemeH3.Gospel.book_string
ltx/en_us_public/le.go.me.m12.d24:lemeH3.Gospel.chapverse	@ltx/en_us_rsv/le.go.me.m12.d24:lemeH3.Gospel.chapverse
ltx/en_us_public/le.go.me.m12.d24:lemeH3.Gospel.incipit	@ltx/en_us_rsv/le.go.me.m12.d24:lemeH3.Gospel.incipit
ltx/en_us_public/le.go.me.m12.d24:lemeH3.Gospel.text	@ltx/en_us_rsv/le.go.me.m12.d24:lemeH3.Gospel.text
ltx/en_us_public/le.go.me.m12.d24:lemeH3.Gospel.title	@ltx/en_us_rsv/le.go.me.m12.d24:lemeH3.Gospel.title
ltx/en_us_public/le.go.me.m12.d24:lemeH3.Gospel.title_abbr	@ltx/en_us_rsv/le.go.me.m12.d24:lemeH3.Gospel.title_abbr
ltx/en_us_public/le.go.me.m12.d24:lemeH3.Gospel.version	@ltx/en_us_rsv/le.go.me.m12.d24:lemeH3.Gospel.version
ltx/en_us_public/le.go.me.m12.d24:lemeH6.Gospel.book_abbr	@ltx/en_us_rsv/le.go.me.m12.d24:lemeH6.Gospel.book_abbr
ltx/en_us_public/le.go.me.m12.d24:lemeH6.Gospel.book_string	@ltx/en_us_rsv/le.go.me.m12.d24:lemeH6.Gospel.book_string
ltx/en_us_public/le.go.me.m12.d24:lemeH6.Gospel.chapverse	@ltx/en_us_rsv/le.go.me.m12.d24:lemeH6.Gospel.chapverse
ltx/en_us_public/le.go.me.m12.d24:lemeH6.Gospel.incipit	@ltx/en_us_rsv/le.go.me.m12.d24:lemeH6.Gospel.incipit
ltx/en_us_public/le.go.me.m12.d24:lemeH6.Gospel.text	@ltx/en_us_rsv/le.go.me.m12.d24:lemeH6.Gospel.text
ltx/en_us_public/le.go.me.m12.d24:lemeH6.Gospel.title	@ltx/en_us_rsv/le.go.me.m12.d24:lemeH6.Gospel.title
ltx/en_us_public/le.go.me.m12.d24:lemeH6.Gospel.title_abbr	@ltx/en_us_rsv/le.go.me.m12.d24:lemeH6.Gospel.title_abbr
ltx/en_us_public/le.go.me.m12.d24:lemeH6.Gospel.version	@ltx/en_us_rsv/le.go.me.m12.d24:lemeH6.Gospel.version
ltx/en_us_public/le.go.me.m12.d24:lemeH9.Gospel.book_abbr	@ltx/en_us_rsv/le.go.me.m12.d24:lemeH9.Gospel.book_abbr
ltx/en_us_public/le.go.me.m12.d24:lemeH9.Gospel.book_string	@ltx/en_us_rsv/le.go.me.m12.d24:lemeH9.Gospel.book_string
ltx/en_us_public/le.go.me.m12.d24:lemeH9.Gospel.chapverse	@ltx/en_us_rsv/le.go.me.m12.d24:lemeH9.Gospel.chapverse
ltx/en_us_public/le.go.me.m12.d24:lemeH9.Gospel.incipit	@ltx/en_us_rsv/le.go.me.m12.d24:lemeH9.Gospel.incipit
ltx/en_us_public/le.go.me.m12.d24:lemeH9.Gospel.text	@ltx/en_us_rsv/le.go.me.m12.d24:lemeH9.Gospel.text
ltx/en_us_public/le.go.me.m12.d24:lemeH9.Gospel.title	@ltx/en_us_rsv/le.go.me.m12.d24:lemeH9.Gospel.title
ltx/en_us_public/le.go.me.m12.d24:lemeH9.Gospel.title_abbr	@ltx/en_us_rsv/le.go.me.m12.d24:lemeH9.Gospel.title_abbr
ltx/en_us_public/le.go.me.m12.d24:lemeH9.Gospel.version	@ltx/en_us_rsv/le.go.me.m12.d24:lemeH9.Gospel.version
