ltx/en_us_public/miscellanea:misc.Automelon	@ltx/en_us_dedes/miscellanea:misc.Automelon
ltx/en_us_public/miscellanea:misc.AutomelonNotMetered	
ltx/en_us_public/miscellanea:misc.FutureInstance	@ltx/en_us_dedes/miscellanea:misc.FutureInstance
ltx/en_us_public/miscellanea:misc.Heirmologic	@ltx/en_us_dedes/miscellanea:misc.Heirmologic
ltx/en_us_public/miscellanea:misc.Heirmos	@ltx/en_us_dedes/miscellanea:misc.Heirmos
ltx/en_us_public/miscellanea:misc.HeirmosNotMetered	@ltx/en_us_dedes/miscellanea:misc.HeirmosNotMetered
ltx/en_us_public/miscellanea:misc.Idiomelon	@ltx/en_us_dedes/miscellanea:misc.Idiomelon
ltx/en_us_public/miscellanea:misc.Mode0	@ltx/en_us_dedes/miscellanea:misc.Mode0
ltx/en_us_public/miscellanea:misc.Mode1	@ltx/en_us_dedes/miscellanea:misc.Mode1
ltx/en_us_public/miscellanea:misc.Mode1.naked	@ltx/en_us_dedes/miscellanea:misc.Mode1.naked
ltx/en_us_public/miscellanea:misc.Mode2	@ltx/en_us_dedes/miscellanea:misc.Mode2
ltx/en_us_public/miscellanea:misc.Mode2.naked	@ltx/en_us_dedes/miscellanea:misc.Mode2.naked
ltx/en_us_public/miscellanea:misc.Mode3	@ltx/en_us_dedes/miscellanea:misc.Mode3
ltx/en_us_public/miscellanea:misc.Mode3.naked	@ltx/en_us_dedes/miscellanea:misc.Mode3.naked
ltx/en_us_public/miscellanea:misc.Mode4	@ltx/en_us_dedes/miscellanea:misc.Mode4
ltx/en_us_public/miscellanea:misc.Mode4.naked	@ltx/en_us_dedes/miscellanea:misc.Mode4.naked
ltx/en_us_public/miscellanea:misc.Mode5	@ltx/en_us_dedes/miscellanea:misc.Mode5
ltx/en_us_public/miscellanea:misc.Mode5.naked	@ltx/en_us_dedes/miscellanea:misc.Mode5.naked
ltx/en_us_public/miscellanea:misc.Mode6	@ltx/en_us_dedes/miscellanea:misc.Mode6
ltx/en_us_public/miscellanea:misc.Mode6.naked	@ltx/en_us_dedes/miscellanea:misc.Mode6.naked
ltx/en_us_public/miscellanea:misc.Mode7	@ltx/en_us_dedes/miscellanea:misc.Mode7
ltx/en_us_public/miscellanea:misc.Mode7.naked	@ltx/en_us_dedes/miscellanea:misc.Mode7.naked
ltx/en_us_public/miscellanea:misc.Mode8	@ltx/en_us_dedes/miscellanea:misc.Mode8
ltx/en_us_public/miscellanea:misc.Mode8.naked	@ltx/en_us_dedes/miscellanea:misc.Mode8.naked
ltx/en_us_public/miscellanea:misc.ModeNA	@ltx/en_us_dedes/miscellanea:misc.ModeNA
ltx/en_us_public/miscellanea:misc.ModeVariable	@ltx/en_us_dedes/miscellanea:misc.ModeVariable
ltx/en_us_public/miscellanea:misc.NotAvailable	@ltx/en_us_dedes/miscellanea:misc.NotAvailable
ltx/en_us_public/miscellanea:misc.NotMetered	@ltx/en_us_dedes/miscellanea:misc.NotMetered
ltx/en_us_public/miscellanea:misc.Ode1	@ltx/en_us_dedes/miscellanea:misc.Ode1
ltx/en_us_public/miscellanea:misc.Ode2	@ltx/en_us_dedes/miscellanea:misc.Ode2
ltx/en_us_public/miscellanea:misc.Ode3	@ltx/en_us_dedes/miscellanea:misc.Ode3
ltx/en_us_public/miscellanea:misc.Ode4	@ltx/en_us_dedes/miscellanea:misc.Ode4
ltx/en_us_public/miscellanea:misc.Ode5	@ltx/en_us_dedes/miscellanea:misc.Ode5
ltx/en_us_public/miscellanea:misc.Ode6	@ltx/en_us_dedes/miscellanea:misc.Ode6
ltx/en_us_public/miscellanea:misc.Ode7	@ltx/en_us_dedes/miscellanea:misc.Ode7
ltx/en_us_public/miscellanea:misc.Ode8	@ltx/en_us_dedes/miscellanea:misc.Ode8
ltx/en_us_public/miscellanea:misc.Ode9	@ltx/en_us_dedes/miscellanea:misc.Ode9
ltx/en_us_public/miscellanea:misc.Prosomoion	@ltx/en_us_dedes/miscellanea:misc.Prosomoion
ltx/en_us_public/miscellanea:misc.Rnum1	@ltx/en_us_dedes/miscellanea:misc.Rnum1
ltx/en_us_public/miscellanea:misc.Rnum10	@ltx/en_us_dedes/miscellanea:misc.Rnum10
ltx/en_us_public/miscellanea:misc.Rnum2	@ltx/en_us_dedes/miscellanea:misc.Rnum2
ltx/en_us_public/miscellanea:misc.Rnum3	@ltx/en_us_dedes/miscellanea:misc.Rnum3
ltx/en_us_public/miscellanea:misc.Rnum4	@ltx/en_us_dedes/miscellanea:misc.Rnum4
ltx/en_us_public/miscellanea:misc.Rnum5	@ltx/en_us_dedes/miscellanea:misc.Rnum5
ltx/en_us_public/miscellanea:misc.Rnum6	@ltx/en_us_dedes/miscellanea:misc.Rnum6
ltx/en_us_public/miscellanea:misc.Rnum7	@ltx/en_us_dedes/miscellanea:misc.Rnum7
ltx/en_us_public/miscellanea:misc.Rnum8	@ltx/en_us_dedes/miscellanea:misc.Rnum8
ltx/en_us_public/miscellanea:misc.Rnum9	@ltx/en_us_dedes/miscellanea:misc.Rnum9
ltx/en_us_public/miscellanea:misc.anum1	@ltx/en_us_dedes/miscellanea:misc.anum1
ltx/en_us_public/miscellanea:misc.anum10	@ltx/en_us_dedes/miscellanea:misc.anum10
ltx/en_us_public/miscellanea:misc.anum11	@ltx/en_us_dedes/miscellanea:misc.anum11
ltx/en_us_public/miscellanea:misc.anum12	@ltx/en_us_dedes/miscellanea:misc.anum12
ltx/en_us_public/miscellanea:misc.anum13	@ltx/en_us_dedes/miscellanea:misc.anum13
ltx/en_us_public/miscellanea:misc.anum14	@ltx/en_us_dedes/miscellanea:misc.anum14
ltx/en_us_public/miscellanea:misc.anum15	@ltx/en_us_dedes/miscellanea:misc.anum15
ltx/en_us_public/miscellanea:misc.anum16	@ltx/en_us_dedes/miscellanea:misc.anum16
ltx/en_us_public/miscellanea:misc.anum17	@ltx/en_us_dedes/miscellanea:misc.anum17
ltx/en_us_public/miscellanea:misc.anum18	@ltx/en_us_dedes/miscellanea:misc.anum18
ltx/en_us_public/miscellanea:misc.anum19	@ltx/en_us_dedes/miscellanea:misc.anum19
ltx/en_us_public/miscellanea:misc.anum2	@ltx/en_us_dedes/miscellanea:misc.anum2
ltx/en_us_public/miscellanea:misc.anum20	@ltx/en_us_dedes/miscellanea:misc.anum20
ltx/en_us_public/miscellanea:misc.anum21	@ltx/en_us_dedes/miscellanea:misc.anum21
ltx/en_us_public/miscellanea:misc.anum22	@ltx/en_us_dedes/miscellanea:misc.anum22
ltx/en_us_public/miscellanea:misc.anum23	@ltx/en_us_dedes/miscellanea:misc.anum23
ltx/en_us_public/miscellanea:misc.anum24	@ltx/en_us_dedes/miscellanea:misc.anum24
ltx/en_us_public/miscellanea:misc.anum25	@ltx/en_us_dedes/miscellanea:misc.anum25
ltx/en_us_public/miscellanea:misc.anum26	@ltx/en_us_dedes/miscellanea:misc.anum26
ltx/en_us_public/miscellanea:misc.anum27	@ltx/en_us_dedes/miscellanea:misc.anum27
ltx/en_us_public/miscellanea:misc.anum28	@ltx/en_us_dedes/miscellanea:misc.anum28
ltx/en_us_public/miscellanea:misc.anum29	@ltx/en_us_dedes/miscellanea:misc.anum29
ltx/en_us_public/miscellanea:misc.anum3	@ltx/en_us_dedes/miscellanea:misc.anum3
ltx/en_us_public/miscellanea:misc.anum30	@ltx/en_us_dedes/miscellanea:misc.anum30
ltx/en_us_public/miscellanea:misc.anum31	@ltx/en_us_dedes/miscellanea:misc.anum31
ltx/en_us_public/miscellanea:misc.anum32	@ltx/en_us_dedes/miscellanea:misc.anum32
ltx/en_us_public/miscellanea:misc.anum33	@ltx/en_us_dedes/miscellanea:misc.anum33
ltx/en_us_public/miscellanea:misc.anum4	@ltx/en_us_dedes/miscellanea:misc.anum4
ltx/en_us_public/miscellanea:misc.anum5	@ltx/en_us_dedes/miscellanea:misc.anum5
ltx/en_us_public/miscellanea:misc.anum6	@ltx/en_us_dedes/miscellanea:misc.anum6
ltx/en_us_public/miscellanea:misc.anum7	@ltx/en_us_dedes/miscellanea:misc.anum7
ltx/en_us_public/miscellanea:misc.anum8	@ltx/en_us_dedes/miscellanea:misc.anum8
ltx/en_us_public/miscellanea:misc.anum9	@ltx/en_us_dedes/miscellanea:misc.anum9
ltx/en_us_public/miscellanea:misc.book.BooksSources.title	@ltx/en_us_dedes/miscellanea:misc.book.BooksSources.title
ltx/en_us_public/miscellanea:misc.book.Euchologion.name	@ltx/en_us_dedes/miscellanea:misc.book.Euchologion.name
ltx/en_us_public/miscellanea:misc.book.Heirmologion.name	@ltx/en_us_dedes/miscellanea:misc.book.Heirmologion.name
ltx/en_us_public/miscellanea:misc.book.Hieratikon.name	@ltx/en_us_dedes/miscellanea:misc.book.Hieratikon.name
ltx/en_us_public/miscellanea:misc.book.Horologion.name	@ltx/en_us_dedes/miscellanea:misc.book.Horologion.name
ltx/en_us_public/miscellanea:misc.book.MeSupplement.name	@ltx/en_us_dedes/miscellanea:misc.book.MeSupplement.name
ltx/en_us_public/miscellanea:misc.book.Menaion.name	@ltx/en_us_dedes/miscellanea:misc.book.Menaion.name
ltx/en_us_public/miscellanea:misc.book.Octoechos.name	@ltx/en_us_dedes/miscellanea:misc.book.Octoechos.name
ltx/en_us_public/miscellanea:misc.book.PeSupplement.name	@ltx/en_us_dedes/miscellanea:misc.book.PeSupplement.name
ltx/en_us_public/miscellanea:misc.book.Pentecostarion.name	@ltx/en_us_dedes/miscellanea:misc.book.Pentecostarion.name
ltx/en_us_public/miscellanea:misc.book.Psalter.name	@ltx/en_us_dedes/miscellanea:misc.book.Psalter.name
ltx/en_us_public/miscellanea:misc.book.Synaxarion.name	@ltx/en_us_dedes/miscellanea:misc.book.Synaxarion.name
ltx/en_us_public/miscellanea:misc.book.Triodion.name	@ltx/en_us_dedes/miscellanea:misc.book.Triodion.name
ltx/en_us_public/miscellanea:misc.book.Typikon.name	@ltx/en_us_dedes/miscellanea:misc.book.Typikon.name
ltx/en_us_public/miscellanea:misc.bracket.close	@ltx/en_us_dedes/miscellanea:misc.bracket.close
ltx/en_us_public/miscellanea:misc.bracket.open	@ltx/en_us_dedes/miscellanea:misc.bracket.open
ltx/en_us_public/miscellanea:misc.greekquotation.left	@ltx/en_us_dedes/miscellanea:misc.greekquotation.left
ltx/en_us_public/miscellanea:misc.greekquotation.right	@ltx/en_us_dedes/miscellanea:misc.greekquotation.right
ltx/en_us_public/miscellanea:misc.horizontal_line.dash1	@ltx/en_us_dedes/miscellanea:misc.horizontal_line.dash1
ltx/en_us_public/miscellanea:misc.horizontal_line.solid1	@ltx/en_us_dedes/miscellanea:misc.horizontal_line.solid1
ltx/en_us_public/miscellanea:misc.parenthesis.close	@ltx/en_us_dedes/miscellanea:misc.parenthesis.close
ltx/en_us_public/miscellanea:misc.parenthesis.open	@ltx/en_us_dedes/miscellanea:misc.parenthesis.open
ltx/en_us_public/miscellanea:misc.punctuation.comma	@ltx/en_us_dedes/miscellanea:misc.punctuation.comma
ltx/en_us_public/miscellanea:misc.punctuation.ellipsis	@ltx/en_us_dedes/miscellanea:misc.punctuation.ellipsis
ltx/en_us_public/miscellanea:misc.punctuation.period	@ltx/en_us_dedes/miscellanea:misc.punctuation.period
ltx/en_us_public/miscellanea:misc.rnum1	@ltx/en_us_dedes/miscellanea:misc.rnum1
ltx/en_us_public/miscellanea:misc.rnum10	@ltx/en_us_dedes/miscellanea:misc.rnum10
ltx/en_us_public/miscellanea:misc.rnum2	@ltx/en_us_dedes/miscellanea:misc.rnum2
ltx/en_us_public/miscellanea:misc.rnum3	@ltx/en_us_dedes/miscellanea:misc.rnum3
ltx/en_us_public/miscellanea:misc.rnum4	@ltx/en_us_dedes/miscellanea:misc.rnum4
ltx/en_us_public/miscellanea:misc.rnum5	@ltx/en_us_dedes/miscellanea:misc.rnum5
ltx/en_us_public/miscellanea:misc.rnum6	@ltx/en_us_dedes/miscellanea:misc.rnum6
ltx/en_us_public/miscellanea:misc.rnum7	@ltx/en_us_dedes/miscellanea:misc.rnum7
ltx/en_us_public/miscellanea:misc.rnum8	@ltx/en_us_dedes/miscellanea:misc.rnum8
ltx/en_us_public/miscellanea:misc.rnum9	@ltx/en_us_dedes/miscellanea:misc.rnum9
ltx/en_us_public/miscellanea:misc.separator.asterisk	@ltx/en_us_dedes/miscellanea:misc.separator.asterisk
ltx/en_us_public/miscellanea:misc.separator.emdash	@ltx/en_us_dedes/miscellanea:misc.separator.emdash
ltx/en_us_public/miscellanea:misc.separator.endash	@ltx/en_us_dedes/miscellanea:misc.separator.endash
ltx/en_us_public/miscellanea:misc.separator.hyphen	@ltx/en_us_dedes/miscellanea:misc.separator.hyphen
ltx/en_us_public/miscellanea:misc.separator.pipe	@ltx/en_us_dedes/miscellanea:misc.separator.pipe
ltx/en_us_public/miscellanea:misc.separator.slash	@ltx/en_us_dedes/miscellanea:misc.separator.slash
ltx/en_us_public/miscellanea:misc.vVerse	@ltx/en_us_dedes/miscellanea:misc.vVerse
ltx/en_us_public/miscellanea:misc.vVerse1	@ltx/en_us_dedes/miscellanea:misc.vVerse1
ltx/en_us_public/miscellanea:misc.vVerse2	@ltx/en_us_dedes/miscellanea:misc.vVerse2
ltx/en_us_public/miscellanea:misc.vVerse3	@ltx/en_us_dedes/miscellanea:misc.vVerse3
ltx/en_us_public/miscellanea:misc.vVerse4	@ltx/en_us_dedes/miscellanea:misc.vVerse4
