ltx/en_us_public/le.go.mc.d068:lemcMA.Gospel.book_abbr	@ltx/en_us_rsv/le.go.mc.d068:lemcMA.Gospel.book_abbr
ltx/en_us_public/le.go.mc.d068:lemcMA.Gospel.book_string	@ltx/en_us_rsv/le.go.mc.d068:lemcMA.Gospel.book_string
ltx/en_us_public/le.go.mc.d068:lemcMA.Gospel.chapverse	@ltx/en_us_rsv/le.go.mc.d068:lemcMA.Gospel.chapverse
ltx/en_us_public/le.go.mc.d068:lemcMA.Gospel.incipit	@ltx/en_us_rsv/le.go.mc.d068:lemcMA.Gospel.incipit
ltx/en_us_public/le.go.mc.d068:lemcMA.Gospel.text	@ltx/en_us_rsv/le.go.mc.d068:lemcMA.Gospel.text
ltx/en_us_public/le.go.mc.d068:lemcMA.Gospel.title	@ltx/en_us_rsv/le.go.mc.d068:lemcMA.Gospel.title
ltx/en_us_public/le.go.mc.d068:lemcMA.Gospel.title_abbr	@ltx/en_us_rsv/le.go.mc.d068:lemcMA.Gospel.title_abbr
ltx/en_us_public/le.go.mc.d068:lemcMA.Gospel.version	@ltx/en_us_rsv/le.go.mc.d068:lemcMA.Gospel.version
ltx/en_us_public/le.go.mc.d068:lemcVE.Gospel.book_abbr	@ltx/en_us_rsv/le.go.mc.d068:lemcVE.Gospel.book_abbr
ltx/en_us_public/le.go.mc.d068:lemcVE.Gospel.book_string	@ltx/en_us_rsv/le.go.mc.d068:lemcVE.Gospel.book_string
ltx/en_us_public/le.go.mc.d068:lemcVE.Gospel.chapverse	@ltx/en_us_rsv/le.go.mc.d068:lemcVE.Gospel.chapverse
ltx/en_us_public/le.go.mc.d068:lemcVE.Gospel.incipit	@ltx/en_us_rsv/le.go.mc.d068:lemcVE.Gospel.incipit
ltx/en_us_public/le.go.mc.d068:lemcVE.Gospel.text	@ltx/en_us_rsv/le.go.mc.d068:lemcVE.Gospel.text
ltx/en_us_public/le.go.mc.d068:lemcVE.Gospel.title	@ltx/en_us_rsv/le.go.mc.d068:lemcVE.Gospel.title
ltx/en_us_public/le.go.mc.d068:lemcVE.Gospel.title_abbr	@ltx/en_us_rsv/le.go.mc.d068:lemcVE.Gospel.title_abbr
ltx/en_us_public/le.go.mc.d068:lemcVE.Gospel.version	@ltx/en_us_rsv/le.go.mc.d068:lemcVE.Gospel.version
