ltx/en_us_public/le.ep.me.m09.d28:lemeLI.Epistle.book_abbr	@ltx/en_us_rsv/le.ep.me.m09.d28:lemeLI.Epistle.book_abbr
ltx/en_us_public/le.ep.me.m09.d28:lemeLI.Epistle.book_string	@ltx/en_us_rsv/le.ep.me.m09.d28:lemeLI.Epistle.book_string
ltx/en_us_public/le.ep.me.m09.d28:lemeLI.Epistle.chapverse	@ltx/en_us_rsv/le.ep.me.m09.d28:lemeLI.Epistle.chapverse
ltx/en_us_public/le.ep.me.m09.d28:lemeLI.Epistle.incipit	@ltx/en_us_rsv/le.ep.me.m09.d28:lemeLI.Epistle.incipit
ltx/en_us_public/le.ep.me.m09.d28:lemeLI.Epistle.text	@ltx/en_us_rsv/le.ep.me.m09.d28:lemeLI.Epistle.text
ltx/en_us_public/le.ep.me.m09.d28:lemeLI.Epistle.title	@ltx/en_us_rsv/le.ep.me.m09.d28:lemeLI.Epistle.title
ltx/en_us_public/le.ep.me.m09.d28:lemeLI.Epistle.title_abbr	@ltx/en_us_rsv/le.ep.me.m09.d28:lemeLI.Epistle.title_abbr
ltx/en_us_public/le.ep.me.m09.d28:lemeLI.Epistle.version	@ltx/en_us_rsv/le.ep.me.m09.d28:lemeLI.Epistle.version
