ltx/en_us_public/da.d4:daCommemoration.text	@ltx/en_us_dedes/da.d4:daCommemoration.text
ltx/en_us_public/da.d4:daDay.text	@ltx/en_us_dedes/da.d4:daDay.text
ltx/en_us_public/da.d4:daLI.MM.CommunionHymn.text	@ltx/en_us_dedes/da.d4:daLI.MM.CommunionHymn.text
ltx/en_us_public/da.d4:daMA.ExapTheotokion1.greekmelody	@ltx/en_us_dedes/da.d4:daMA.ExapTheotokion1.greekmelody
ltx/en_us_public/da.d4:daMA.ExapTheotokion1.incipit	@ltx/en_us_dedes/da.d4:daMA.ExapTheotokion1.incipit
ltx/en_us_public/da.d4:daMA.ExapTheotokion1.melody	@ltx/en_us_dedes/da.d4:daMA.ExapTheotokion1.melody
ltx/en_us_public/da.d4:daMA.ExapTheotokion1.mode	@ltx/en_us_dedes/da.d4:daMA.ExapTheotokion1.mode
ltx/en_us_public/da.d4:daMA.ExapTheotokion1.text	@ltx/en_us_dedes/da.d4:daMA.ExapTheotokion1.text
ltx/en_us_public/da.d4:daMA.ExapTheotokion2.greekmelody	@ltx/en_us_dedes/da.d4:daMA.ExapTheotokion2.greekmelody
ltx/en_us_public/da.d4:daMA.ExapTheotokion2.incipit	@ltx/en_us_dedes/da.d4:daMA.ExapTheotokion2.incipit
ltx/en_us_public/da.d4:daMA.ExapTheotokion2.melody	@ltx/en_us_dedes/da.d4:daMA.ExapTheotokion2.melody
ltx/en_us_public/da.d4:daMA.ExapTheotokion2.mode	@ltx/en_us_dedes/da.d4:daMA.ExapTheotokion2.mode
ltx/en_us_public/da.d4:daMA.ExapTheotokion2.text	@ltx/en_us_dedes/da.d4:daMA.ExapTheotokion2.text
ltx/en_us_public/da.d4:daMA.Exaposteilarion1.greekmelody	@ltx/en_us_dedes/da.d4:daMA.Exaposteilarion1.greekmelody
ltx/en_us_public/da.d4:daMA.Exaposteilarion1.incipit	@ltx/en_us_dedes/da.d4:daMA.Exaposteilarion1.incipit
ltx/en_us_public/da.d4:daMA.Exaposteilarion1.melody	@ltx/en_us_dedes/da.d4:daMA.Exaposteilarion1.melody
ltx/en_us_public/da.d4:daMA.Exaposteilarion1.mode	@ltx/en_us_dedes/da.d4:daMA.Exaposteilarion1.mode
ltx/en_us_public/da.d4:daMA.Exaposteilarion1.text	@ltx/en_us_dedes/da.d4:daMA.Exaposteilarion1.text
ltx/en_us_public/da.d4:daMA.Exaposteilarion2.greekmelody	@ltx/en_us_dedes/da.d4:daMA.Exaposteilarion2.greekmelody
ltx/en_us_public/da.d4:daMA.Exaposteilarion2.incipit	@ltx/en_us_dedes/da.d4:daMA.Exaposteilarion2.incipit
ltx/en_us_public/da.d4:daMA.Exaposteilarion2.melody	@ltx/en_us_dedes/da.d4:daMA.Exaposteilarion2.melody
ltx/en_us_public/da.d4:daMA.Exaposteilarion2.mode	@ltx/en_us_dedes/da.d4:daMA.Exaposteilarion2.mode
ltx/en_us_public/da.d4:daMA.Exaposteilarion2.text	@ltx/en_us_dedes/da.d4:daMA.Exaposteilarion2.text
ltx/en_us_public/da.d4:daMA.Photagogic1Beginning.text	@ltx/en_us_dedes/da.d4:daMA.Photagogic1Beginning.text
ltx/en_us_public/da.d4:daMA.Photagogic1Ending.text	@ltx/en_us_dedes/da.d4:daMA.Photagogic1Ending.text
ltx/en_us_public/da.d4:daMA.Photagogic2Beginning.text	@ltx/en_us_dedes/da.d4:daMA.Photagogic2Beginning.text
ltx/en_us_public/da.d4:daMA.Photagogic2Ending.text	@ltx/en_us_dedes/da.d4:daMA.Photagogic2Ending.text
ltx/en_us_public/da.d4:daMA.Photagogic3Beginning.text	@ltx/en_us_dedes/da.d4:daMA.Photagogic3Beginning.text
ltx/en_us_public/da.d4:daMA.Photagogic3Ending.text	@ltx/en_us_dedes/da.d4:daMA.Photagogic3Ending.text
ltx/en_us_public/da.d4:daMA.Triadic1Ending.text	@ltx/en_us_dedes/da.d4:daMA.Triadic1Ending.text
ltx/en_us_public/da.d4:daMA.Triadic2Ending.text	@ltx/en_us_dedes/da.d4:daMA.Triadic2Ending.text
ltx/en_us_public/da.d4:daMA.Triadic3Ending.text	@ltx/en_us_dedes/da.d4:daMA.Triadic3Ending.text
ltx/en_us_public/da.d4:daVE.ApolTheotokion.incipit	@ltx/en_us_dedes/da.d4:daVE.ApolTheotokion.incipit
ltx/en_us_public/da.d4:daVE.ApolTheotokion.melody	@ltx/en_us_dedes/da.d4:daVE.ApolTheotokion.melody
ltx/en_us_public/da.d4:daVE.ApolTheotokion.mode	@ltx/en_us_dedes/da.d4:daVE.ApolTheotokion.mode
ltx/en_us_public/da.d4:daVE.ApolTheotokion.text	@ltx/en_us_dedes/da.d4:daVE.ApolTheotokion.text
ltx/en_us_public/da.d4:daVE.Apolytikion1.incipit	@ltx/en_us_dedes/da.d4:daVE.Apolytikion1.incipit
ltx/en_us_public/da.d4:daVE.Apolytikion1.melody	@ltx/en_us_dedes/da.d4:daVE.Apolytikion1.melody
ltx/en_us_public/da.d4:daVE.Apolytikion1.mode	@ltx/en_us_dedes/da.d4:daVE.Apolytikion1.mode
ltx/en_us_public/da.d4:daVE.Apolytikion1.text	@ltx/en_us_dedes/da.d4:daVE.Apolytikion1.text
ltx/en_us_public/da.d4:daVE.OnTheEveningBefore.text	@ltx/en_us_dedes/da.d4:daVE.OnTheEveningBefore.text
