ltx/en_us_public/ho.ho12:hoCO.Bookmark1.text	@ltx/en_us_dedes/ho.ho12:hoCO.Bookmark1.text
ltx/en_us_public/ho.ho12:hoCO.Bookmark20.text	@ltx/en_us_dedes/ho.ho12:hoCO.Bookmark20.text
ltx/en_us_public/ho.ho12:hoCO.Bookmark21.text	@ltx/en_us_dedes/ho.ho12:hoCO.Bookmark21.text
ltx/en_us_public/ho.ho12:hoCO.Bookmark3.text	@ltx/en_us_dedes/ho.ho12:hoCO.Bookmark3.text
ltx/en_us_public/ho.ho12:hoCO.BookmarkPage01.text	@ltx/en_us_dedes/ho.ho12:hoCO.BookmarkPage01.text
ltx/en_us_public/ho.ho12:hoCO.BookmarkPage07.text	@ltx/en_us_dedes/ho.ho12:hoCO.BookmarkPage07.text
ltx/en_us_public/ho.ho12:hoCO.BookmarkPage15.text	@ltx/en_us_dedes/ho.ho12:hoCO.BookmarkPage15.text
ltx/en_us_public/ho.ho12:hoCO.Key0100.rubric	@ltx/en_us_dedes/ho.ho12:hoCO.Key0100.rubric
ltx/en_us_public/ho.ho12:hoCO.Key0100.title	@ltx/en_us_dedes/ho.ho12:hoCO.Key0100.title
ltx/en_us_public/ho.ho12:hoCO.Key0101.title	@ltx/en_us_dedes/ho.ho12:hoCO.Key0101.title
ltx/en_us_public/ho.ho12:hoCO.Key0101a.rubric	@ltx/en_us_dedes/ho.ho12:hoCO.Key0101a.rubric
ltx/en_us_public/ho.ho12:hoCO.Key0101b.rubric	@ltx/en_us_dedes/ho.ho12:hoCO.Key0101b.rubric
ltx/en_us_public/ho.ho12:hoCO.Key0102.title	@ltx/en_us_dedes/ho.ho12:hoCO.Key0102.title
ltx/en_us_public/ho.ho12:hoCO.Key0103.title	@ltx/en_us_dedes/ho.ho12:hoCO.Key0103.title
ltx/en_us_public/ho.ho12:hoCO.Key0201.title	@ltx/en_us_dedes/ho.ho12:hoCO.Key0201.title
ltx/en_us_public/ho.ho12:hoCO.Key0202.title	@ltx/en_us_dedes/ho.ho12:hoCO.Key0202.title
ltx/en_us_public/ho.ho12:hoCO.Key0203.title	@ltx/en_us_dedes/ho.ho12:hoCO.Key0203.title
ltx/en_us_public/ho.ho12:hoCO.Key0300.mode	@ltx/en_us_dedes/ho.ho12:hoCO.Key0300.mode
ltx/en_us_public/ho.ho12:hoCO.Key0301.text	@ltx/en_us_dedes/ho.ho12:hoCO.Key0301.text
ltx/en_us_public/ho.ho12:hoCO.Key0401.text	@ltx/en_us_holycross/ho.ho12:hoCO.Key0401.text
ltx/en_us_public/ho.ho12:hoCO.Key0402.text	@ltx/en_us_holycross/ho.ho12:hoCO.Key0402.text
ltx/en_us_public/ho.ho12:hoCO.Key0403.text	@ltx/en_us_holycross/ho.ho12:hoCO.Key0403.text
ltx/en_us_public/ho.ho12:hoCO.Key0501.mode	@ltx/en_us_dedes/ho.ho12:hoCO.Key0501.mode
ltx/en_us_public/ho.ho12:hoCO.Key0501.text	@ltx/en_us_dedes/ho.ho12:hoCO.Key0501.text
ltx/en_us_public/ho.ho12:hoCO.Key0502.text	@ltx/en_us_dedes/ho.ho12:hoCO.Key0502.text
ltx/en_us_public/ho.ho12:hoCO.Key0503.text	@ltx/en_us_dedes/ho.ho12:hoCO.Key0503.text
ltx/en_us_public/ho.ho12:hoCO.Key0504.text	@ltx/en_us_dedes/ho.ho12:hoCO.Key0504.text
ltx/en_us_public/ho.ho12:hoCO.Key0505.text	@ltx/en_us_dedes/ho.ho12:hoCO.Key0505.text
ltx/en_us_public/ho.ho12:hoCO.Key0506.text	@ltx/en_us_dedes/ho.ho12:hoCO.Key0506.text
ltx/en_us_public/ho.ho12:hoCO.Key0507.text	@ltx/en_us_dedes/ho.ho12:hoCO.Key0507.text
ltx/en_us_public/ho.ho12:hoCO.Key0508.text	@ltx/en_us_dedes/ho.ho12:hoCO.Key0508.text
ltx/en_us_public/ho.ho12:hoCO.Key0509.text	@ltx/en_us_dedes/ho.ho12:hoCO.Key0509.text
ltx/en_us_public/ho.ho12:hoCO.Key0510.text	@ltx/en_us_dedes/ho.ho12:hoCO.Key0510.text
ltx/en_us_public/ho.ho12:hoCO.Key0511.text	@ltx/en_us_goa/prayers:pr.Creed.text
ltx/en_us_public/ho.ho12:hoCO.Key0511.title	@ltx/en_us_dedes/ho.ho12:hoCO.Key0511.title
ltx/en_us_public/ho.ho12:hoCO.Key0601.mode	@ltx/en_us_dedes/ho.ho12:hoCO.Key0601.mode
ltx/en_us_public/ho.ho12:hoCO.Key0601.text	@ltx/en_us_dedes/ho.ho12:hoCO.Key0601.text
ltx/en_us_public/ho.ho12:hoCO.Key0602.text	@ltx/en_us_dedes/ho.ho12:hoCO.Key0602.text
ltx/en_us_public/ho.ho12:hoCO.Key0603.text	@ltx/en_us_dedes/ho.ho12:hoCO.Key0603.text
ltx/en_us_public/ho.ho12:hoCO.Key0604.text	@ltx/en_us_dedes/ho.ho12:hoCO.Key0604.text
ltx/en_us_public/ho.ho12:hoCO.Key0605.text	@ltx/en_us_dedes/ho.ho12:hoCO.Key0605.text
ltx/en_us_public/ho.ho12:hoCO.Key0606.text	@ltx/en_us_dedes/ho.ho12:hoCO.Key0606.text
ltx/en_us_public/ho.ho12:hoCO.Key0607.text	@ltx/en_us_dedes/ho.ho12:hoCO.Key0607.text
ltx/en_us_public/ho.ho12:hoCO.Key0608.text	@ltx/en_us_dedes/ho.ho12:hoCO.Key0608.text
ltx/en_us_public/ho.ho12:hoCO.Key0609.text	@ltx/en_us_dedes/ho.ho12:hoCO.Key0609.text
ltx/en_us_public/ho.ho12:hoCO.Key0701.mode	@ltx/en_us_dedes/ho.ho12:hoCO.Key0701.mode
ltx/en_us_public/ho.ho12:hoCO.Key0701.rubric	@ltx/en_us_dedes/ho.ho12:hoCO.Key0701.rubric
ltx/en_us_public/ho.ho12:hoCO.Key0701.text	@ltx/en_us_holycross/ho.ho12:hoCO.Key0701.text
ltx/en_us_public/ho.ho12:hoCO.Key0702.text	@ltx/en_us_holycross/ho.ho12:hoCO.Key0702.text
ltx/en_us_public/ho.ho12:hoCO.Key0703.text	@ltx/en_us_holycross/ho.ho12:hoCO.Key0703.text
ltx/en_us_public/ho.ho12:hoCO.Key0704.mode	@ltx/en_us_dedes/ho.ho12:hoCO.Key0704.mode
ltx/en_us_public/ho.ho12:hoCO.Key0704.rubric	@ltx/en_us_dedes/ho.ho12:hoCO.Key0704.rubric
ltx/en_us_public/ho.ho12:hoCO.Key0704.text	@ltx/en_us_holycross/ho.ho12:hoCO.Key0704.text
ltx/en_us_public/ho.ho12:hoCO.Key0705.text	@ltx/en_us_holycross/ho.ho12:hoCO.Key0705.text
ltx/en_us_public/ho.ho12:hoCO.Key0706.text	@ltx/en_us_holycross/ho.ho12:hoCO.Key0706.text
ltx/en_us_public/ho.ho12:hoCO.Key0707.text	@ltx/en_us_holycross/ho.ho12:hoCO.Key0707.text
ltx/en_us_public/ho.ho12:hoCO.Key0708.text	@ltx/en_us_holycross/ho.ho12:hoCO.Key0708.text
ltx/en_us_public/ho.ho12:hoCO.Key0709.text	@ltx/en_us_holycross/ho.ho12:hoCO.Key0709.text
ltx/en_us_public/ho.ho12:hoCO.Key0709.title	@ltx/en_us_holycross/ho.ho12:hoCO.Key0709.title
ltx/en_us_public/ho.ho12:hoCO.Key0801.title	@ltx/en_us_dedes/ho.ho12:hoCO.Key0801.title
ltx/en_us_public/ho.ho12:hoCO.Key0802.title	@ltx/en_us_dedes/ho.ho12:hoCO.Key0802.title
ltx/en_us_public/ho.ho12:hoCO.Key0803.text	@ltx/en_us_holycross/ho.ho12:hoCO.Key0803.text
ltx/en_us_public/ho.ho12:hoCO.Key0803.title	@ltx/en_us_holycross/ho.ho12:hoCO.Key0803.title
ltx/en_us_public/ho.ho12:hoCO.Key0804.mode	@ltx/en_us_dedes/ho.ho12:hoCO.Key0804.mode
ltx/en_us_public/ho.ho12:hoCO.Key0804.rubric	@ltx/en_us_dedes/ho.ho12:hoCO.Key0804.rubric
ltx/en_us_public/ho.ho12:hoCO.Key0804.text	@ltx/en_us_dedes/ho.ho12:hoCO.Key0804.text
ltx/en_us_public/ho.ho12:hoCO.Key0805.text	@ltx/en_us_dedes/ho.ho12:hoCO.Key0805.text
ltx/en_us_public/ho.ho12:hoCO.Key0806.text	@ltx/en_us_dedes/ho.ho12:hoCO.Key0806.text
ltx/en_us_public/ho.ho12:hoCO.Key0807.text	@ltx/en_us_holycross/ho.ho12:hoCO.Key0807.text
ltx/en_us_public/ho.ho12:hoCO.Key0807.title	@ltx/en_us_dedes/ho.ho12:hoCO.Key0807.title
ltx/en_us_public/ho.ho12:hoCO.Key0901.title	@ltx/en_us_dedes/ho.ho12:hoCO.Key0901.title
ltx/en_us_public/ho.ho12:hoCO.Key0902.title	@ltx/en_us_dedes/ho.ho12:hoCO.Key0902.title
ltx/en_us_public/ho.ho12:hoCO.Key0903.text	@ltx/en_us_holycross/ho.ho12:hoCO.Key0903.text
ltx/en_us_public/ho.ho12:hoCO.Key0903.title	@ltx/en_us_holycross/ho.ho12:hoCO.Key0903.title
ltx/en_us_public/ho.ho12:hoCO.Key0904.text	@ltx/en_us_holycross/ho.ho12:hoCO.Key0904.text
ltx/en_us_public/ho.ho12:hoCO.Key0905.text	@ltx/en_us_holycross/ho.ho12:hoCO.Key0905.text
ltx/en_us_public/ho.ho12:hoCO.Key0906.text	@ltx/en_us_holycross/ho.ho12:hoCO.Key0906.text
ltx/en_us_public/ho.ho12:hoCO.Key0907.text	@ltx/en_us_holycross/ho.ho12:hoCO.Key0907.text
ltx/en_us_public/ho.ho12:hoCO.Key0908.rubric	@ltx/en_us_dedes/ho.ho12:hoCO.Key0908.rubric
ltx/en_us_public/ho.ho12:hoCO.Key0909.rubric	@ltx/en_us_dedes/ho.ho12:hoCO.Key0909.rubric
ltx/en_us_public/ho.ho12:hoCO.Key0910.rubric	@ltx/en_us_dedes/ho.ho12:hoCO.Key0910.rubric
ltx/en_us_public/ho.ho12:hoCO.Key1001.mode	@ltx/en_us_dedes/ho.ho12:hoCO.Key1001.mode
ltx/en_us_public/ho.ho12:hoCO.Key1001.text	@ltx/en_us_dedes/ho.ho12:hoCO.Key1001.text
ltx/en_us_public/ho.ho12:hoCO.Key1009.text	@ltx/en_us_dedes/ho.ho12:hoCO.Key1009.text
ltx/en_us_public/ho.ho12:hoCO.Key1010.text	@ltx/en_us_dedes/ho.ho12:hoCO.Key1010.text
ltx/en_us_public/ho.ho12:hoCO.Key1011.mode	@ltx/en_us_dedes/ho.ho12:hoCO.Key1011.mode
ltx/en_us_public/ho.ho12:hoCO.Key1011.text	@ltx/en_us_dedes/ho.ho12:hoCO.Key1011.text
ltx/en_us_public/ho.ho12:hoCO.Key1012.text	@ltx/en_us_dedes/ho.ho12:hoCO.Key1012.text
ltx/en_us_public/ho.ho12:hoCO.Key1013.mode	@ltx/en_us_dedes/ho.ho12:hoCO.Key1013.mode
ltx/en_us_public/ho.ho12:hoCO.Key1013.text	@ltx/en_us_dedes/ho.ho12:hoCO.Key1013.text
ltx/en_us_public/ho.ho12:hoCO.Key1014.text	@ltx/en_us_dedes/ho.ho12:hoCO.Key1014.text
ltx/en_us_public/ho.ho12:hoCO.Key1015.text	@ltx/en_us_holycross/ho.ho12:hoCO.Key1015.text
ltx/en_us_public/ho.ho12:hoCO.Key1016.text	@ltx/en_us_holycross/ho.ho12:hoCO.Key1016.text
ltx/en_us_public/ho.ho12:hoCO.Key1016.title	@ltx/en_us_holycross/ho.ho12:hoCO.Key1016.title
ltx/en_us_public/ho.ho12:hoCO.Key1017.text	@ltx/en_us_holycross/ho.ho12:hoCO.Key1017.text
ltx/en_us_public/ho.ho12:hoCO.Key1018.text	@ltx/en_us_holycross/ho.ho12:hoCO.Key1018.text
ltx/en_us_public/ho.ho12:hoCO.Key1019.text	@ltx/en_us_holycross/ho.ho12:hoCO.Key1019.text
ltx/en_us_public/ho.ho12:hoCO.Key1101.poet	@ltx/en_us_holycross/ho.ho12:hoCO.Key1101.poet
ltx/en_us_public/ho.ho12:hoCO.Key1101.text	@ltx/en_us_holycross/ho.ho12:hoCO.Key1101.text
ltx/en_us_public/ho.ho12:hoCO.Key1101.title	@ltx/en_us_holycross/ho.ho12:hoCO.Key1101.title
ltx/en_us_public/ho.ho12:hoCO.Key1102.poet	@ltx/en_us_holycross/ho.ho12:hoCO.Key1102.poet
ltx/en_us_public/ho.ho12:hoCO.Key1102.text	@ltx/en_us_holycross/ho.ho12:hoCO.Key1102.text
ltx/en_us_public/ho.ho12:hoCO.Key1102.title	@ltx/en_us_holycross/ho.ho12:hoCO.Key1102.title
ltx/en_us_public/ho.ho12:hoCO.Key1103.text	@ltx/en_us_holycross/ho.ho12:hoCO.Key1103.text
ltx/en_us_public/ho.ho12:hoCO.Key1104.text	@ltx/en_us_holycross/ho.ho12:hoCO.Key1104.text
ltx/en_us_public/ho.ho12:hoCO.Key1104.title	@ltx/en_us_holycross/ho.ho12:hoCO.Key1104.title
ltx/en_us_public/ho.ho12:hoCO.Key1105.text	@ltx/en_us_dedes/ho.ho12:hoCO.Key1105.text
ltx/en_us_public/ho.ho12:hoCO.Key1201.rubric	@ltx/en_us_dedes/ho.ho12:hoCO.Key1201.rubric
ltx/en_us_public/ho.ho12:hoCO.Key1202.rubric	@ltx/en_us_dedes/ho.ho12:hoCO.Key1202.rubric
ltx/en_us_public/ho.ho12:hoCO.Key1203.rubric	@ltx/en_us_dedes/ho.ho12:hoCO.Key1203.rubric
ltx/en_us_public/ho.ho12:hoCO.Key1204.text	@ltx/en_us_dedes/ho.ho12:hoCO.Key1204.text
ltx/en_us_public/ho.ho12:hoCO.Key1205.rubric	@ltx/en_us_dedes/ho.ho12:hoCO.Key1205.rubric
ltx/en_us_public/ho.ho12:hoCO.Key1206.text	@ltx/en_us_dedes/ho.ho12:hoCO.Key1206.text
ltx/en_us_public/ho.ho12:hoCO.Key1207.rubric	@ltx/en_us_dedes/ho.ho12:hoCO.Key1207.rubric
ltx/en_us_public/ho.ho12:hoCO.Key1300.rubric	@ltx/en_us_dedes/ho.ho12:hoCO.Key1300.rubric
ltx/en_us_public/ho.ho12:hoCO.Key1301.incipit	@ltx/en_us_dedes/ho.ho12:hoCO.Key1301.incipit
ltx/en_us_public/ho.ho12:hoCO.Key1301.melody	@ltx/en_us_dedes/ho.ho12:hoCO.Key1301.melody
ltx/en_us_public/ho.ho12:hoCO.Key1301.mode	@ltx/en_us_dedes/ho.ho12:hoCO.Key1301.mode
ltx/en_us_public/ho.ho12:hoCO.Key1301.rubric	@ltx/en_us_dedes/ho.ho12:hoCO.Key1301.rubric
ltx/en_us_public/ho.ho12:hoCO.Key1301.text	@ltx/en_us_dedes/ho.ho12:hoCO.Key1301.text
ltx/en_us_public/ho.ho12:hoCO.Key1302.incipit	@ltx/en_us_dedes/ho.ho12:hoCO.Key1302.incipit
ltx/en_us_public/ho.ho12:hoCO.Key1302.melody	@ltx/en_us_dedes/ho.ho12:hoCO.Key1302.melody
ltx/en_us_public/ho.ho12:hoCO.Key1302.mode	@ltx/en_us_dedes/ho.ho12:hoCO.Key1302.mode
ltx/en_us_public/ho.ho12:hoCO.Key1302.rubric	@ltx/en_us_dedes/ho.ho12:hoCO.Key1302.rubric
ltx/en_us_public/ho.ho12:hoCO.Key1302.text	@ltx/en_us_dedes/ho.ho12:hoCO.Key1302.text
ltx/en_us_public/ho.ho12:hoCO.Key1303.incipit	@ltx/en_us_dedes/ho.ho12:hoCO.Key1303.incipit
ltx/en_us_public/ho.ho12:hoCO.Key1303.melody	@ltx/en_us_dedes/ho.ho12:hoCO.Key1303.melody
ltx/en_us_public/ho.ho12:hoCO.Key1303.mode	@ltx/en_us_dedes/ho.ho12:hoCO.Key1303.mode
ltx/en_us_public/ho.ho12:hoCO.Key1303.rubric	@ltx/en_us_dedes/ho.ho12:hoCO.Key1303.rubric
ltx/en_us_public/ho.ho12:hoCO.Key1303.text	@ltx/en_us_dedes/ho.ho12:hoCO.Key1303.text
ltx/en_us_public/ho.ho12:hoCO.Key1304.rubric	@ltx/en_us_dedes/ho.ho12:hoCO.Key1304.rubric
ltx/en_us_public/ho.ho12:hoCO.Key1401.rubric	@ltx/en_us_dedes/ho.ho12:hoCO.Key1401.rubric
ltx/en_us_public/ho.ho12:hoCO.Key1401.text	@ltx/en_us_dedes/ho.ho12:hoCO.Key1401.text
ltx/en_us_public/ho.ho12:hoCO.title	@ltx/en_us_dedes/ho.ho12:hoCO.title
