ltx/en_us_public/le.ep.va.unction:levaUNC.Epistle1.book_abbr	@ltx/en_us_rsv/le.ep.va.unction:levaUNC.Epistle1.book_abbr
ltx/en_us_public/le.ep.va.unction:levaUNC.Epistle1.book_string	@ltx/en_us_rsv/le.ep.va.unction:levaUNC.Epistle1.book_string
ltx/en_us_public/le.ep.va.unction:levaUNC.Epistle1.chapverse	@ltx/en_us_rsv/le.ep.va.unction:levaUNC.Epistle1.chapverse
ltx/en_us_public/le.ep.va.unction:levaUNC.Epistle1.incipit	@ltx/en_us_rsv/le.ep.va.unction:levaUNC.Epistle1.incipit
ltx/en_us_public/le.ep.va.unction:levaUNC.Epistle1.text	@ltx/en_us_rsv/le.ep.va.unction:levaUNC.Epistle1.text
ltx/en_us_public/le.ep.va.unction:levaUNC.Epistle1.title	@ltx/en_us_rsv/le.ep.va.unction:levaUNC.Epistle1.title
ltx/en_us_public/le.ep.va.unction:levaUNC.Epistle1.title_abbr	@ltx/en_us_rsv/le.ep.va.unction:levaUNC.Epistle1.title_abbr
ltx/en_us_public/le.ep.va.unction:levaUNC.Epistle1.version	@ltx/en_us_rsv/le.ep.va.unction:levaUNC.Epistle1.version
ltx/en_us_public/le.ep.va.unction:levaUNC.Epistle2.book_abbr	@ltx/en_us_rsv/le.ep.va.unction:levaUNC.Epistle2.book_abbr
ltx/en_us_public/le.ep.va.unction:levaUNC.Epistle2.book_string	@ltx/en_us_rsv/le.ep.va.unction:levaUNC.Epistle2.book_string
ltx/en_us_public/le.ep.va.unction:levaUNC.Epistle2.chapverse	@ltx/en_us_rsv/le.ep.va.unction:levaUNC.Epistle2.chapverse
ltx/en_us_public/le.ep.va.unction:levaUNC.Epistle2.incipit	@ltx/en_us_rsv/le.ep.va.unction:levaUNC.Epistle2.incipit
ltx/en_us_public/le.ep.va.unction:levaUNC.Epistle2.text	@ltx/en_us_rsv/le.ep.va.unction:levaUNC.Epistle2.text
ltx/en_us_public/le.ep.va.unction:levaUNC.Epistle2.title	@ltx/en_us_rsv/le.ep.va.unction:levaUNC.Epistle2.title
ltx/en_us_public/le.ep.va.unction:levaUNC.Epistle2.title_abbr	@ltx/en_us_rsv/le.ep.va.unction:levaUNC.Epistle2.title_abbr
ltx/en_us_public/le.ep.va.unction:levaUNC.Epistle2.version	@ltx/en_us_rsv/le.ep.va.unction:levaUNC.Epistle2.version
ltx/en_us_public/le.ep.va.unction:levaUNC.Epistle3.book_abbr	@ltx/en_us_rsv/le.ep.va.unction:levaUNC.Epistle3.book_abbr
ltx/en_us_public/le.ep.va.unction:levaUNC.Epistle3.book_string	@ltx/en_us_rsv/le.ep.va.unction:levaUNC.Epistle3.book_string
ltx/en_us_public/le.ep.va.unction:levaUNC.Epistle3.chapverse	@ltx/en_us_rsv/le.ep.va.unction:levaUNC.Epistle3.chapverse
ltx/en_us_public/le.ep.va.unction:levaUNC.Epistle3.incipit	@ltx/en_us_rsv/le.ep.va.unction:levaUNC.Epistle3.incipit
ltx/en_us_public/le.ep.va.unction:levaUNC.Epistle3.text	@ltx/en_us_rsv/le.ep.va.unction:levaUNC.Epistle3.text
ltx/en_us_public/le.ep.va.unction:levaUNC.Epistle3.title	@ltx/en_us_rsv/le.ep.va.unction:levaUNC.Epistle3.title
ltx/en_us_public/le.ep.va.unction:levaUNC.Epistle3.title_abbr	@ltx/en_us_rsv/le.ep.va.unction:levaUNC.Epistle3.title_abbr
ltx/en_us_public/le.ep.va.unction:levaUNC.Epistle3.version	@ltx/en_us_rsv/le.ep.va.unction:levaUNC.Epistle3.version
ltx/en_us_public/le.ep.va.unction:levaUNC.Epistle4.book_abbr	@ltx/en_us_rsv/le.ep.va.unction:levaUNC.Epistle4.book_abbr
ltx/en_us_public/le.ep.va.unction:levaUNC.Epistle4.book_string	@ltx/en_us_rsv/le.ep.va.unction:levaUNC.Epistle4.book_string
ltx/en_us_public/le.ep.va.unction:levaUNC.Epistle4.chapverse	@ltx/en_us_rsv/le.ep.va.unction:levaUNC.Epistle4.chapverse
ltx/en_us_public/le.ep.va.unction:levaUNC.Epistle4.incipit	@ltx/en_us_rsv/le.ep.va.unction:levaUNC.Epistle4.incipit
ltx/en_us_public/le.ep.va.unction:levaUNC.Epistle4.text	@ltx/en_us_rsv/le.ep.va.unction:levaUNC.Epistle4.text
ltx/en_us_public/le.ep.va.unction:levaUNC.Epistle4.title	@ltx/en_us_rsv/le.ep.va.unction:levaUNC.Epistle4.title
ltx/en_us_public/le.ep.va.unction:levaUNC.Epistle4.title_abbr	@ltx/en_us_rsv/le.ep.va.unction:levaUNC.Epistle4.title_abbr
ltx/en_us_public/le.ep.va.unction:levaUNC.Epistle4.version	@ltx/en_us_rsv/le.ep.va.unction:levaUNC.Epistle4.version
ltx/en_us_public/le.ep.va.unction:levaUNC.Epistle5.book_abbr	@ltx/en_us_rsv/le.ep.va.unction:levaUNC.Epistle5.book_abbr
ltx/en_us_public/le.ep.va.unction:levaUNC.Epistle5.book_string	@ltx/en_us_rsv/le.ep.va.unction:levaUNC.Epistle5.book_string
ltx/en_us_public/le.ep.va.unction:levaUNC.Epistle5.chapverse	@ltx/en_us_rsv/le.ep.va.unction:levaUNC.Epistle5.chapverse
ltx/en_us_public/le.ep.va.unction:levaUNC.Epistle5.incipit	@ltx/en_us_rsv/le.ep.va.unction:levaUNC.Epistle5.incipit
ltx/en_us_public/le.ep.va.unction:levaUNC.Epistle5.text	@ltx/en_us_rsv/le.ep.va.unction:levaUNC.Epistle5.text
ltx/en_us_public/le.ep.va.unction:levaUNC.Epistle5.title	@ltx/en_us_rsv/le.ep.va.unction:levaUNC.Epistle5.title
ltx/en_us_public/le.ep.va.unction:levaUNC.Epistle5.title_abbr	@ltx/en_us_rsv/le.ep.va.unction:levaUNC.Epistle5.title_abbr
ltx/en_us_public/le.ep.va.unction:levaUNC.Epistle5.version	@ltx/en_us_rsv/le.ep.va.unction:levaUNC.Epistle5.version
ltx/en_us_public/le.ep.va.unction:levaUNC.Epistle6.book_abbr	@ltx/en_us_rsv/le.ep.va.unction:levaUNC.Epistle6.book_abbr
ltx/en_us_public/le.ep.va.unction:levaUNC.Epistle6.book_string	@ltx/en_us_rsv/le.ep.va.unction:levaUNC.Epistle6.book_string
ltx/en_us_public/le.ep.va.unction:levaUNC.Epistle6.chapverse	@ltx/en_us_rsv/le.ep.va.unction:levaUNC.Epistle6.chapverse
ltx/en_us_public/le.ep.va.unction:levaUNC.Epistle6.incipit	@ltx/en_us_rsv/le.ep.va.unction:levaUNC.Epistle6.incipit
ltx/en_us_public/le.ep.va.unction:levaUNC.Epistle6.text	@ltx/en_us_rsv/le.ep.va.unction:levaUNC.Epistle6.text
ltx/en_us_public/le.ep.va.unction:levaUNC.Epistle6.title	@ltx/en_us_rsv/le.ep.va.unction:levaUNC.Epistle6.title
ltx/en_us_public/le.ep.va.unction:levaUNC.Epistle6.title_abbr	@ltx/en_us_rsv/le.ep.va.unction:levaUNC.Epistle6.title_abbr
ltx/en_us_public/le.ep.va.unction:levaUNC.Epistle6.version	@ltx/en_us_rsv/le.ep.va.unction:levaUNC.Epistle6.version
ltx/en_us_public/le.ep.va.unction:levaUNC.Epistle7.book_abbr	@ltx/en_us_rsv/le.ep.va.unction:levaUNC.Epistle7.book_abbr
ltx/en_us_public/le.ep.va.unction:levaUNC.Epistle7.book_string	@ltx/en_us_rsv/le.ep.va.unction:levaUNC.Epistle7.book_string
ltx/en_us_public/le.ep.va.unction:levaUNC.Epistle7.chapverse	@ltx/en_us_rsv/le.ep.va.unction:levaUNC.Epistle7.chapverse
ltx/en_us_public/le.ep.va.unction:levaUNC.Epistle7.incipit	@ltx/en_us_rsv/le.ep.va.unction:levaUNC.Epistle7.incipit
ltx/en_us_public/le.ep.va.unction:levaUNC.Epistle7.text	@ltx/en_us_rsv/le.ep.va.unction:levaUNC.Epistle7.text
ltx/en_us_public/le.ep.va.unction:levaUNC.Epistle7.title	@ltx/en_us_rsv/le.ep.va.unction:levaUNC.Epistle7.title
ltx/en_us_public/le.ep.va.unction:levaUNC.Epistle7.title_abbr	@ltx/en_us_rsv/le.ep.va.unction:levaUNC.Epistle7.title_abbr
ltx/en_us_public/le.ep.va.unction:levaUNC.Epistle7.version	@ltx/en_us_rsv/le.ep.va.unction:levaUNC.Epistle7.version
