ltx/en_us_public/sy.m04.d06:syMA.commemoration01.couplet1.title	@ltx/en_us_dedes/sy.m04.d06:syMA.commemoration01.couplet1.title
ltx/en_us_public/sy.m04.d06:syMA.commemoration01.couplet1.verse1	@ltx/en_us_dedes/sy.m04.d06:syMA.commemoration01.couplet1.verse1
ltx/en_us_public/sy.m04.d06:syMA.commemoration01.couplet1.verse2	@ltx/en_us_dedes/sy.m04.d06:syMA.commemoration01.couplet1.verse2
ltx/en_us_public/sy.m04.d06:syMA.commemoration01.narration.p01	@ltx/en_us_dedes/sy.m04.d06:syMA.commemoration01.narration.p01
ltx/en_us_public/sy.m04.d06:syMA.commemoration01.narration.p02	@ltx/en_us_dedes/sy.m04.d06:syMA.commemoration01.narration.p02
ltx/en_us_public/sy.m04.d06:syMA.commemoration01.narration.p03	@ltx/en_us_dedes/sy.m04.d06:syMA.commemoration01.narration.p03
ltx/en_us_public/sy.m04.d06:syMA.commemoration01.narration.p04	@ltx/en_us_dedes/sy.m04.d06:syMA.commemoration01.narration.p04
ltx/en_us_public/sy.m04.d06:syMA.commemoration01.single1	@ltx/en_us_dedes/sy.m04.d06:syMA.commemoration01.single1
ltx/en_us_public/sy.m04.d06:syMA.commemoration01.text	@ltx/en_us_dedes/sy.m04.d06:syMA.commemoration01.text
ltx/en_us_public/sy.m04.d06:syMA.commemoration02.couplet1.title	@ltx/en_us_dedes/sy.m04.d06:syMA.commemoration02.couplet1.title
ltx/en_us_public/sy.m04.d06:syMA.commemoration02.couplet1.verse1	@ltx/en_us_dedes/sy.m04.d06:syMA.commemoration02.couplet1.verse1
ltx/en_us_public/sy.m04.d06:syMA.commemoration02.couplet1.verse2	@ltx/en_us_dedes/sy.m04.d06:syMA.commemoration02.couplet1.verse2
ltx/en_us_public/sy.m04.d06:syMA.commemoration02.text	@ltx/en_us_dedes/sy.m04.d06:syMA.commemoration02.text
ltx/en_us_public/sy.m04.d06:syMA.commemoration03.couplet1.title	@ltx/en_us_dedes/sy.m04.d06:syMA.commemoration03.couplet1.title
ltx/en_us_public/sy.m04.d06:syMA.commemoration03.couplet1.verse1	@ltx/en_us_dedes/sy.m04.d06:syMA.commemoration03.couplet1.verse1
ltx/en_us_public/sy.m04.d06:syMA.commemoration03.couplet1.verse2	@ltx/en_us_dedes/sy.m04.d06:syMA.commemoration03.couplet1.verse2
ltx/en_us_public/sy.m04.d06:syMA.commemoration03.text	@ltx/en_us_dedes/sy.m04.d06:syMA.commemoration03.text
ltx/en_us_public/sy.m04.d06:syMA.commemoration04.couplet1.title	@ltx/en_us_dedes/sy.m04.d06:syMA.commemoration04.couplet1.title
ltx/en_us_public/sy.m04.d06:syMA.commemoration04.couplet1.verse1	@ltx/en_us_dedes/sy.m04.d06:syMA.commemoration04.couplet1.verse1
ltx/en_us_public/sy.m04.d06:syMA.commemoration04.couplet1.verse2	@ltx/en_us_dedes/sy.m04.d06:syMA.commemoration04.couplet1.verse2
ltx/en_us_public/sy.m04.d06:syMA.commemoration04.text	@ltx/en_us_dedes/sy.m04.d06:syMA.commemoration04.text
ltx/en_us_public/sy.m04.d06:syMA.commemoration05.couplet1.title	@ltx/en_us_dedes/sy.m04.d06:syMA.commemoration05.couplet1.title
ltx/en_us_public/sy.m04.d06:syMA.commemoration05.couplet1.verse1	@ltx/en_us_dedes/sy.m04.d06:syMA.commemoration05.couplet1.verse1
ltx/en_us_public/sy.m04.d06:syMA.commemoration05.couplet1.verse2	@ltx/en_us_dedes/sy.m04.d06:syMA.commemoration05.couplet1.verse2
ltx/en_us_public/sy.m04.d06:syMA.commemoration05.text	@ltx/en_us_dedes/sy.m04.d06:syMA.commemoration05.text
ltx/en_us_public/sy.m04.d06:syMA.commemoration06.couplet1.title	@ltx/en_us_dedes/sy.m04.d06:syMA.commemoration06.couplet1.title
ltx/en_us_public/sy.m04.d06:syMA.commemoration06.couplet1.verse1	@ltx/en_us_dedes/sy.m04.d06:syMA.commemoration06.couplet1.verse1
ltx/en_us_public/sy.m04.d06:syMA.commemoration06.couplet1.verse2	@ltx/en_us_dedes/sy.m04.d06:syMA.commemoration06.couplet1.verse2
ltx/en_us_public/sy.m04.d06:syMA.commemoration06.text	@ltx/en_us_dedes/sy.m04.d06:syMA.commemoration06.text
ltx/en_us_public/sy.m04.d06:syMA.commemoration07.text	@ltx/en_us_dedes/sy.m04.d06:syMA.commemoration07.text
ltx/en_us_public/sy.m04.d06:syMA.commemoration08.couplet1.title	@ltx/en_us_dedes/sy.m04.d06:syMA.commemoration08.couplet1.title
ltx/en_us_public/sy.m04.d06:syMA.commemoration08.couplet1.verse1	@ltx/en_us_dedes/sy.m04.d06:syMA.commemoration08.couplet1.verse1
ltx/en_us_public/sy.m04.d06:syMA.commemoration08.couplet1.verse2	@ltx/en_us_dedes/sy.m04.d06:syMA.commemoration08.couplet1.verse2
ltx/en_us_public/sy.m04.d06:syMA.commemoration08.text	@ltx/en_us_dedes/sy.m04.d06:syMA.commemoration08.text
ltx/en_us_public/sy.m04.d06:syMA.lastline	@ltx/en_us_dedes/sy.m04.d06:syMA.lastline
