ltx/en_us_public/le.go.me.m11.d13:lemeLI.Gospel.book_abbr	@ltx/en_us_rsv/le.go.me.m11.d13:lemeLI.Gospel.book_abbr
ltx/en_us_public/le.go.me.m11.d13:lemeLI.Gospel.book_string	@ltx/en_us_rsv/le.go.me.m11.d13:lemeLI.Gospel.book_string
ltx/en_us_public/le.go.me.m11.d13:lemeLI.Gospel.chapverse	@ltx/en_us_rsv/le.go.me.m11.d13:lemeLI.Gospel.chapverse
ltx/en_us_public/le.go.me.m11.d13:lemeLI.Gospel.incipit	@ltx/en_us_rsv/le.go.me.m11.d13:lemeLI.Gospel.incipit
ltx/en_us_public/le.go.me.m11.d13:lemeLI.Gospel.text	@ltx/en_us_rsv/le.go.me.m11.d13:lemeLI.Gospel.text
ltx/en_us_public/le.go.me.m11.d13:lemeLI.Gospel.title	@ltx/en_us_rsv/le.go.me.m11.d13:lemeLI.Gospel.title
ltx/en_us_public/le.go.me.m11.d13:lemeLI.Gospel.title_abbr	@ltx/en_us_rsv/le.go.me.m11.d13:lemeLI.Gospel.title_abbr
ltx/en_us_public/le.go.me.m11.d13:lemeLI.Gospel.version	@ltx/en_us_rsv/le.go.me.m11.d13:lemeLI.Gospel.version
ltx/en_us_public/le.go.me.m11.d13:lemeMA.Gospel.book_abbr	@ltx/en_us_rsv/le.go.me.m11.d13:lemeMA.Gospel.book_abbr
ltx/en_us_public/le.go.me.m11.d13:lemeMA.Gospel.book_string	@ltx/en_us_rsv/le.go.me.m11.d13:lemeMA.Gospel.book_string
ltx/en_us_public/le.go.me.m11.d13:lemeMA.Gospel.chapverse	@ltx/en_us_rsv/le.go.me.m11.d13:lemeMA.Gospel.chapverse
ltx/en_us_public/le.go.me.m11.d13:lemeMA.Gospel.incipit	@ltx/en_us_rsv/le.go.me.m11.d13:lemeMA.Gospel.incipit
ltx/en_us_public/le.go.me.m11.d13:lemeMA.Gospel.text	@ltx/en_us_rsv/le.go.me.m11.d13:lemeMA.Gospel.text
ltx/en_us_public/le.go.me.m11.d13:lemeMA.Gospel.title	@ltx/en_us_rsv/le.go.me.m11.d13:lemeMA.Gospel.title
ltx/en_us_public/le.go.me.m11.d13:lemeMA.Gospel.title_abbr	@ltx/en_us_rsv/le.go.me.m11.d13:lemeMA.Gospel.title_abbr
ltx/en_us_public/le.go.me.m11.d13:lemeMA.Gospel.version	@ltx/en_us_rsv/le.go.me.m11.d13:lemeMA.Gospel.version
