ltx/en_us_public/me.m01.d12:meDA.commemoration.first	@ltx/en_us_dedes/me.m01.d12:meDA.commemoration.first
ltx/en_us_public/me.m01.d12:meDA.commemoration.first_name	@ltx/en_us_dedes/me.m01.d12:meDA.commemoration.first_name
ltx/en_us_public/me.m01.d12:meDA.commemoration.first_short	@ltx/en_us_dedes/me.m01.d12:meDA.commemoration.first_short
ltx/en_us_public/me.m01.d12:meDA.commemoration.first_title	@ltx/en_us_dedes/me.m01.d12:meDA.commemoration.first_title
ltx/en_us_public/me.m01.d12:meDA.commemoration.full	@ltx/en_us_dedes/me.m01.d12:meDA.commemoration.full
ltx/en_us_public/me.m01.d12:meDA.commemoration.second_name	@ltx/en_us_dedes/me.m01.d12:meDA.commemoration.second_name
ltx/en_us_public/me.m01.d12:meDA.commemoration.second_title	@ltx/en_us_dedes/me.m01.d12:meDA.commemoration.second_title
ltx/en_us_public/me.m01.d12:meDA.date	@ltx/en_us_dedes/me.m01.d12:meDA.date
ltx/en_us_public/me.m01.d12:meDA.dismissal	@ltx/en_us_dedes/me.m01.d12:meDA.dismissal
ltx/en_us_public/me.m01.d12:meDA.insert1	@ltx/en_us_dedes/me.m01.d12:meDA.insert1
ltx/en_us_public/me.m01.d12:meDA.insert2	@ltx/en_us_dedes/me.m01.d12:meDA.insert2
ltx/en_us_public/me.m01.d12:meDA.note	@ltx/en_us_dedes/me.m01.d12:meDA.note
ltx/en_us_public/me.m01.d12:meHO.commemorations	@ltx/en_us_dedes/me.m01.d12:meHO.commemorations
ltx/en_us_public/me.m01.d12:meHO.note1	@ltx/en_us_dedes/me.m01.d12:meHO.note1
ltx/en_us_public/me.m01.d12:meHO.note2	@ltx/en_us_dedes/me.m01.d12:meHO.note2
ltx/en_us_public/me.m01.d12:meHO.number	@ltx/en_us_dedes/me.m01.d12:meHO.number
ltx/en_us_public/me.m01.d12:meHO.rank	@ltx/en_us_dedes/me.m01.d12:meHO.rank
ltx/en_us_public/me.m01.d12:meLE.commemoration1	@ltx/en_us_dedes/me.m01.d12:meLE.commemoration1
ltx/en_us_public/me.m01.d12:meLE.commemoration2	@ltx/en_us_dedes/me.m01.d12:meLE.commemoration2
ltx/en_us_public/me.m01.d12:meLI.Kontakion1.incipit	…
ltx/en_us_public/me.m01.d12:meLI.Kontakion1.melody	
ltx/en_us_public/me.m01.d12:meLI.Kontakion1.mode	
ltx/en_us_public/me.m01.d12:meLI.Kontakion1.text	
ltx/en_us_public/me.m01.d12:meLI.Megalynarion.text	@ltx/en_us_dedes/me.m01.d12:meLI.Megalynarion.text
ltx/en_us_public/me.m01.d12:meMA.AposGlory.incipit	@ltx/en_us_oca/me.m01.d12:meMA.AposGlory.incipit
ltx/en_us_public/me.m01.d12:meMA.AposGlory.melody	@ltx/en_us_oca/me.m01.d12:meMA.AposGlory.melody
ltx/en_us_public/me.m01.d12:meMA.AposGlory.mode	@ltx/en_us_dedes/me.m01.d12:meMA.AposGlory.mode
ltx/en_us_public/me.m01.d12:meMA.AposGlory.text	@ltx/en_us_oca/me.m01.d12:meMA.AposGlory.text
ltx/en_us_public/me.m01.d12:meMA.Aposticha1.greekmelody	@ltx/en_us_dedes/me.m01.d12:meMA.Aposticha1.greekmelody
ltx/en_us_public/me.m01.d12:meMA.Aposticha1.incipit	@ltx/en_us_oca/me.m01.d12:meMA.Aposticha1.incipit
ltx/en_us_public/me.m01.d12:meMA.Aposticha1.melody	@ltx/en_us_oca/me.m01.d12:meMA.Aposticha1.melody
ltx/en_us_public/me.m01.d12:meMA.Aposticha1.mode	@ltx/en_us_dedes/me.m01.d12:meMA.Aposticha1.mode
ltx/en_us_public/me.m01.d12:meMA.Aposticha1.text	@ltx/en_us_oca/me.m01.d12:meMA.Aposticha1.text
ltx/en_us_public/me.m01.d12:meMA.Aposticha2.incipit	@ltx/en_us_oca/me.m01.d12:meMA.Aposticha2.incipit
ltx/en_us_public/me.m01.d12:meMA.Aposticha2.melody	@ltx/en_us_oca/me.m01.d12:meMA.Aposticha2.melody
ltx/en_us_public/me.m01.d12:meMA.Aposticha2.mode	@ltx/en_us_dedes/me.m01.d12:meMA.Aposticha2.mode
ltx/en_us_public/me.m01.d12:meMA.Aposticha2.text	@ltx/en_us_oca/me.m01.d12:meMA.Aposticha2.text
ltx/en_us_public/me.m01.d12:meMA.Aposticha3.incipit	@ltx/en_us_oca/me.m01.d12:meMA.Aposticha3.incipit
ltx/en_us_public/me.m01.d12:meMA.Aposticha3.melody	@ltx/en_us_oca/me.m01.d12:meMA.Aposticha3.melody
ltx/en_us_public/me.m01.d12:meMA.Aposticha3.mode	@ltx/en_us_dedes/me.m01.d12:meMA.Aposticha3.mode
ltx/en_us_public/me.m01.d12:meMA.Aposticha3.text	@ltx/en_us_oca/me.m01.d12:meMA.Aposticha3.text
ltx/en_us_public/me.m01.d12:meMA.C1.title	@ltx/en_us_dedes/me.m01.d12:meMA.C1.title
ltx/en_us_public/me.m01.d12:meMA.C1.verse	@ltx/en_us_dedes/me.m01.d12:meMA.C1.verse
ltx/en_us_public/me.m01.d12:meMA.Exaposteilarion1.greekmelody	@ltx/en_us_dedes/me.m01.d12:meMA.Exaposteilarion1.greekmelody
ltx/en_us_public/me.m01.d12:meMA.Exaposteilarion1.incipit	@ltx/en_us_dedes/me.m01.d12:meMA.Exaposteilarion1.incipit
ltx/en_us_public/me.m01.d12:meMA.Exaposteilarion1.melody	@ltx/en_us_dedes/me.m01.d12:meMA.Exaposteilarion1.melody
ltx/en_us_public/me.m01.d12:meMA.Exaposteilarion1.mode	@ltx/en_us_dedes/me.m01.d12:meMA.Exaposteilarion1.mode
ltx/en_us_public/me.m01.d12:meMA.Exaposteilarion1.text	@ltx/en_us_dedes/me.m01.d12:meMA.Exaposteilarion1.text
ltx/en_us_public/me.m01.d12:meMA.Exaposteilarion2.greekmelody	@ltx/en_us_dedes/me.m01.d12:meMA.Exaposteilarion2.greekmelody
ltx/en_us_public/me.m01.d12:meMA.Exaposteilarion2.incipit	@ltx/en_us_dedes/me.m01.d12:meMA.Exaposteilarion2.incipit
ltx/en_us_public/me.m01.d12:meMA.Exaposteilarion2.melody	@ltx/en_us_dedes/me.m01.d12:meMA.Exaposteilarion2.melody
ltx/en_us_public/me.m01.d12:meMA.Exaposteilarion2.mode	@ltx/en_us_dedes/me.m01.d12:meMA.Exaposteilarion2.mode
ltx/en_us_public/me.m01.d12:meMA.Exaposteilarion2.text	@ltx/en_us_dedes/me.m01.d12:meMA.Exaposteilarion2.text
ltx/en_us_public/me.m01.d12:meMA.Kathisma11.greekmelody	@ltx/en_us_dedes/me.m01.d12:meMA.Kathisma11.greekmelody
ltx/en_us_public/me.m01.d12:meMA.Kathisma11.incipit	@ltx/en_us_dedes/me.m01.d12:meMA.Kathisma11.incipit
ltx/en_us_public/me.m01.d12:meMA.Kathisma11.melody	@ltx/en_us_dedes/me.m01.d12:meMA.Kathisma11.melody
ltx/en_us_public/me.m01.d12:meMA.Kathisma11.mode	@ltx/en_us_dedes/me.m01.d12:meMA.Kathisma11.mode
ltx/en_us_public/me.m01.d12:meMA.Kathisma11.text	@ltx/en_us_dedes/me.m01.d12:meMA.Kathisma11.text
ltx/en_us_public/me.m01.d12:meMA.Kathisma21.greekmelody	@ltx/en_us_dedes/me.m01.d12:meMA.Kathisma21.greekmelody
ltx/en_us_public/me.m01.d12:meMA.Kathisma21.incipit	@ltx/en_us_oca/me.m01.d12:meMA.Kathisma21.incipit
ltx/en_us_public/me.m01.d12:meMA.Kathisma21.melody	@ltx/en_us_oca/me.m01.d12:meMA.Kathisma21.melody
ltx/en_us_public/me.m01.d12:meMA.Kathisma21.mode	@ltx/en_us_dedes/me.m01.d12:meMA.Kathisma21.mode
ltx/en_us_public/me.m01.d12:meMA.Kathisma21.text	@ltx/en_us_oca/me.m01.d12:meMA.Kathisma21.text
ltx/en_us_public/me.m01.d12:meMA.Ode1C11.greekmelody	@ltx/en_us_dedes/me.m01.d12:meMA.Ode1C11.greekmelody
ltx/en_us_public/me.m01.d12:meMA.Ode1C11.incipit	@ltx/en_us_dedes/me.m01.d12:meMA.Ode1C11.incipit
ltx/en_us_public/me.m01.d12:meMA.Ode1C11.melody	@ltx/en_us_dedes/me.m01.d12:meMA.Ode1C11.melody
ltx/en_us_public/me.m01.d12:meMA.Ode1C11.mode	@ltx/en_us_dedes/me.m01.d12:meMA.Ode1C11.mode
ltx/en_us_public/me.m01.d12:meMA.Ode1C11.ode	@ltx/en_us_dedes/me.m01.d12:meMA.Ode1C11.ode
ltx/en_us_public/me.m01.d12:meMA.Ode1C11.text	@ltx/en_us_dedes/me.m01.d12:meMA.Ode1C11.text
ltx/en_us_public/me.m01.d12:meMA.Ode1C12.incipit	@ltx/en_us_dedes/me.m01.d12:meMA.Ode1C12.incipit
ltx/en_us_public/me.m01.d12:meMA.Ode1C12.melody	@ltx/en_us_dedes/me.m01.d12:meMA.Ode1C12.melody
ltx/en_us_public/me.m01.d12:meMA.Ode1C12.mode	@ltx/en_us_dedes/me.m01.d12:meMA.Ode1C12.mode
ltx/en_us_public/me.m01.d12:meMA.Ode1C12.ode	@ltx/en_us_dedes/me.m01.d12:meMA.Ode1C12.ode
ltx/en_us_public/me.m01.d12:meMA.Ode1C12.text	@ltx/en_us_dedes/me.m01.d12:meMA.Ode1C12.text
ltx/en_us_public/me.m01.d12:meMA.Ode1C13.incipit	@ltx/en_us_dedes/me.m01.d12:meMA.Ode1C13.incipit
ltx/en_us_public/me.m01.d12:meMA.Ode1C13.melody	@ltx/en_us_dedes/me.m01.d12:meMA.Ode1C13.melody
ltx/en_us_public/me.m01.d12:meMA.Ode1C13.mode	@ltx/en_us_dedes/me.m01.d12:meMA.Ode1C13.mode
ltx/en_us_public/me.m01.d12:meMA.Ode1C13.ode	@ltx/en_us_dedes/me.m01.d12:meMA.Ode1C13.ode
ltx/en_us_public/me.m01.d12:meMA.Ode1C13.text	@ltx/en_us_dedes/me.m01.d12:meMA.Ode1C13.text
ltx/en_us_public/me.m01.d12:meMA.Ode1C1T.incipit	@ltx/en_us_dedes/me.m01.d12:meMA.Ode1C1T.incipit
ltx/en_us_public/me.m01.d12:meMA.Ode1C1T.melody	@ltx/en_us_dedes/me.m01.d12:meMA.Ode1C1T.melody
ltx/en_us_public/me.m01.d12:meMA.Ode1C1T.mode	@ltx/en_us_dedes/me.m01.d12:meMA.Ode1C1T.mode
ltx/en_us_public/me.m01.d12:meMA.Ode1C1T.ode	@ltx/en_us_dedes/me.m01.d12:meMA.Ode1C1T.ode
ltx/en_us_public/me.m01.d12:meMA.Ode1C1T.text	@ltx/en_us_dedes/me.m01.d12:meMA.Ode1C1T.text
ltx/en_us_public/me.m01.d12:meMA.Ode3C11.greekmelody	@ltx/en_us_dedes/me.m01.d12:meMA.Ode3C11.greekmelody
ltx/en_us_public/me.m01.d12:meMA.Ode3C11.incipit	@ltx/en_us_dedes/me.m01.d12:meMA.Ode3C11.incipit
ltx/en_us_public/me.m01.d12:meMA.Ode3C11.melody	@ltx/en_us_dedes/me.m01.d12:meMA.Ode3C11.melody
ltx/en_us_public/me.m01.d12:meMA.Ode3C11.mode	@ltx/en_us_dedes/me.m01.d12:meMA.Ode3C11.mode
ltx/en_us_public/me.m01.d12:meMA.Ode3C11.ode	@ltx/en_us_dedes/me.m01.d12:meMA.Ode3C11.ode
ltx/en_us_public/me.m01.d12:meMA.Ode3C11.text	@ltx/en_us_dedes/me.m01.d12:meMA.Ode3C11.text
ltx/en_us_public/me.m01.d12:meMA.Ode3C12.incipit	@ltx/en_us_dedes/me.m01.d12:meMA.Ode3C12.incipit
ltx/en_us_public/me.m01.d12:meMA.Ode3C12.melody	@ltx/en_us_dedes/me.m01.d12:meMA.Ode3C12.melody
ltx/en_us_public/me.m01.d12:meMA.Ode3C12.mode	@ltx/en_us_dedes/me.m01.d12:meMA.Ode3C12.mode
ltx/en_us_public/me.m01.d12:meMA.Ode3C12.ode	@ltx/en_us_dedes/me.m01.d12:meMA.Ode3C12.ode
ltx/en_us_public/me.m01.d12:meMA.Ode3C12.text	@ltx/en_us_dedes/me.m01.d12:meMA.Ode3C12.text
ltx/en_us_public/me.m01.d12:meMA.Ode3C13.incipit	@ltx/en_us_dedes/me.m01.d12:meMA.Ode3C13.incipit
ltx/en_us_public/me.m01.d12:meMA.Ode3C13.melody	@ltx/en_us_dedes/me.m01.d12:meMA.Ode3C13.melody
ltx/en_us_public/me.m01.d12:meMA.Ode3C13.mode	@ltx/en_us_dedes/me.m01.d12:meMA.Ode3C13.mode
ltx/en_us_public/me.m01.d12:meMA.Ode3C13.ode	@ltx/en_us_dedes/me.m01.d12:meMA.Ode3C13.ode
ltx/en_us_public/me.m01.d12:meMA.Ode3C13.text	@ltx/en_us_dedes/me.m01.d12:meMA.Ode3C13.text
ltx/en_us_public/me.m01.d12:meMA.Ode3C1T.incipit	@ltx/en_us_dedes/me.m01.d12:meMA.Ode3C1T.incipit
ltx/en_us_public/me.m01.d12:meMA.Ode3C1T.melody	@ltx/en_us_dedes/me.m01.d12:meMA.Ode3C1T.melody
ltx/en_us_public/me.m01.d12:meMA.Ode3C1T.mode	@ltx/en_us_dedes/me.m01.d12:meMA.Ode3C1T.mode
ltx/en_us_public/me.m01.d12:meMA.Ode3C1T.ode	@ltx/en_us_dedes/me.m01.d12:meMA.Ode3C1T.ode
ltx/en_us_public/me.m01.d12:meMA.Ode3C1T.text	@ltx/en_us_dedes/me.m01.d12:meMA.Ode3C1T.text
ltx/en_us_public/me.m01.d12:meMA.Ode3H.greekmelody	@ltx/en_us_dedes/me.m01.d12:meMA.Ode3H.greekmelody
ltx/en_us_public/me.m01.d12:meMA.Ode3H.incipit	@ltx/en_us_dedes/me.m01.d12:meMA.Ode3H.incipit
ltx/en_us_public/me.m01.d12:meMA.Ode3H.melody	@ltx/en_us_dedes/me.m01.d12:meMA.Ode3H.melody
ltx/en_us_public/me.m01.d12:meMA.Ode3H.mode	@ltx/en_us_dedes/me.m01.d12:meMA.Ode3H.mode
ltx/en_us_public/me.m01.d12:meMA.Ode3H.ode	@ltx/en_us_dedes/me.m01.d12:meMA.Ode3H.ode
ltx/en_us_public/me.m01.d12:meMA.Ode3H.text	@ltx/en_us_dedes/me.m01.d12:meMA.Ode3H.text
ltx/en_us_public/me.m01.d12:meMA.Ode3Kathisma1.greekmelody	@ltx/en_us_dedes/me.m01.d12:meMA.Ode3Kathisma1.greekmelody
ltx/en_us_public/me.m01.d12:meMA.Ode3Kathisma1.incipit	@ltx/en_us_dedes/me.m01.d12:meMA.Ode3Kathisma1.incipit
ltx/en_us_public/me.m01.d12:meMA.Ode3Kathisma1.melody	@ltx/en_us_dedes/me.m01.d12:meMA.Ode3Kathisma1.melody
ltx/en_us_public/me.m01.d12:meMA.Ode3Kathisma1.mode	@ltx/en_us_dedes/me.m01.d12:meMA.Ode3Kathisma1.mode
ltx/en_us_public/me.m01.d12:meMA.Ode3Kathisma1.text	@ltx/en_us_dedes/me.m01.d12:meMA.Ode3Kathisma1.text
ltx/en_us_public/me.m01.d12:meMA.Ode3Kathisma2.greekmelody	@ltx/en_us_dedes/me.m01.d12:meMA.Ode3Kathisma2.greekmelody
ltx/en_us_public/me.m01.d12:meMA.Ode3Kathisma2.incipit	@ltx/en_us_dedes/me.m01.d12:meMA.Ode3Kathisma2.incipit
ltx/en_us_public/me.m01.d12:meMA.Ode3Kathisma2.melody	@ltx/en_us_dedes/me.m01.d12:meMA.Ode3Kathisma2.melody
ltx/en_us_public/me.m01.d12:meMA.Ode3Kathisma2.mode	@ltx/en_us_dedes/me.m01.d12:meMA.Ode3Kathisma2.mode
ltx/en_us_public/me.m01.d12:meMA.Ode3Kathisma2.text	@ltx/en_us_dedes/me.m01.d12:meMA.Ode3Kathisma2.text
ltx/en_us_public/me.m01.d12:meMA.Ode4C11.greekmelody	@ltx/en_us_dedes/me.m01.d12:meMA.Ode4C11.greekmelody
ltx/en_us_public/me.m01.d12:meMA.Ode4C11.incipit	@ltx/en_us_dedes/me.m01.d12:meMA.Ode4C11.incipit
ltx/en_us_public/me.m01.d12:meMA.Ode4C11.melody	@ltx/en_us_dedes/me.m01.d12:meMA.Ode4C11.melody
ltx/en_us_public/me.m01.d12:meMA.Ode4C11.mode	@ltx/en_us_dedes/me.m01.d12:meMA.Ode4C11.mode
ltx/en_us_public/me.m01.d12:meMA.Ode4C11.ode	@ltx/en_us_dedes/me.m01.d12:meMA.Ode4C11.ode
ltx/en_us_public/me.m01.d12:meMA.Ode4C11.text	@ltx/en_us_dedes/me.m01.d12:meMA.Ode4C11.text
ltx/en_us_public/me.m01.d12:meMA.Ode4C12.incipit	@ltx/en_us_dedes/me.m01.d12:meMA.Ode4C12.incipit
ltx/en_us_public/me.m01.d12:meMA.Ode4C12.melody	@ltx/en_us_dedes/me.m01.d12:meMA.Ode4C12.melody
ltx/en_us_public/me.m01.d12:meMA.Ode4C12.mode	@ltx/en_us_dedes/me.m01.d12:meMA.Ode4C12.mode
ltx/en_us_public/me.m01.d12:meMA.Ode4C12.ode	@ltx/en_us_dedes/me.m01.d12:meMA.Ode4C12.ode
ltx/en_us_public/me.m01.d12:meMA.Ode4C12.text	@ltx/en_us_dedes/me.m01.d12:meMA.Ode4C12.text
ltx/en_us_public/me.m01.d12:meMA.Ode4C13.incipit	@ltx/en_us_dedes/me.m01.d12:meMA.Ode4C13.incipit
ltx/en_us_public/me.m01.d12:meMA.Ode4C13.melody	@ltx/en_us_dedes/me.m01.d12:meMA.Ode4C13.melody
ltx/en_us_public/me.m01.d12:meMA.Ode4C13.mode	@ltx/en_us_dedes/me.m01.d12:meMA.Ode4C13.mode
ltx/en_us_public/me.m01.d12:meMA.Ode4C13.ode	@ltx/en_us_dedes/me.m01.d12:meMA.Ode4C13.ode
ltx/en_us_public/me.m01.d12:meMA.Ode4C13.text	@ltx/en_us_dedes/me.m01.d12:meMA.Ode4C13.text
ltx/en_us_public/me.m01.d12:meMA.Ode4C1T.incipit	@ltx/en_us_dedes/me.m01.d12:meMA.Ode4C1T.incipit
ltx/en_us_public/me.m01.d12:meMA.Ode4C1T.melody	@ltx/en_us_dedes/me.m01.d12:meMA.Ode4C1T.melody
ltx/en_us_public/me.m01.d12:meMA.Ode4C1T.mode	@ltx/en_us_dedes/me.m01.d12:meMA.Ode4C1T.mode
ltx/en_us_public/me.m01.d12:meMA.Ode4C1T.ode	@ltx/en_us_dedes/me.m01.d12:meMA.Ode4C1T.ode
ltx/en_us_public/me.m01.d12:meMA.Ode4C1T.text	@ltx/en_us_dedes/me.m01.d12:meMA.Ode4C1T.text
ltx/en_us_public/me.m01.d12:meMA.Ode5C11.greekmelody	@ltx/en_us_dedes/me.m01.d12:meMA.Ode5C11.greekmelody
ltx/en_us_public/me.m01.d12:meMA.Ode5C11.incipit	@ltx/en_us_dedes/me.m01.d12:meMA.Ode5C11.incipit
ltx/en_us_public/me.m01.d12:meMA.Ode5C11.melody	@ltx/en_us_dedes/me.m01.d12:meMA.Ode5C11.melody
ltx/en_us_public/me.m01.d12:meMA.Ode5C11.mode	@ltx/en_us_dedes/me.m01.d12:meMA.Ode5C11.mode
ltx/en_us_public/me.m01.d12:meMA.Ode5C11.ode	@ltx/en_us_dedes/me.m01.d12:meMA.Ode5C11.ode
ltx/en_us_public/me.m01.d12:meMA.Ode5C11.text	@ltx/en_us_dedes/me.m01.d12:meMA.Ode5C11.text
ltx/en_us_public/me.m01.d12:meMA.Ode5C12.incipit	@ltx/en_us_dedes/me.m01.d12:meMA.Ode5C12.incipit
ltx/en_us_public/me.m01.d12:meMA.Ode5C12.melody	@ltx/en_us_dedes/me.m01.d12:meMA.Ode5C12.melody
ltx/en_us_public/me.m01.d12:meMA.Ode5C12.mode	@ltx/en_us_dedes/me.m01.d12:meMA.Ode5C12.mode
ltx/en_us_public/me.m01.d12:meMA.Ode5C12.ode	@ltx/en_us_dedes/me.m01.d12:meMA.Ode5C12.ode
ltx/en_us_public/me.m01.d12:meMA.Ode5C12.text	@ltx/en_us_dedes/me.m01.d12:meMA.Ode5C12.text
ltx/en_us_public/me.m01.d12:meMA.Ode5C13.incipit	@ltx/en_us_dedes/me.m01.d12:meMA.Ode5C13.incipit
ltx/en_us_public/me.m01.d12:meMA.Ode5C13.melody	@ltx/en_us_dedes/me.m01.d12:meMA.Ode5C13.melody
ltx/en_us_public/me.m01.d12:meMA.Ode5C13.mode	@ltx/en_us_dedes/me.m01.d12:meMA.Ode5C13.mode
ltx/en_us_public/me.m01.d12:meMA.Ode5C13.ode	@ltx/en_us_dedes/me.m01.d12:meMA.Ode5C13.ode
ltx/en_us_public/me.m01.d12:meMA.Ode5C13.text	@ltx/en_us_dedes/me.m01.d12:meMA.Ode5C13.text
ltx/en_us_public/me.m01.d12:meMA.Ode5C1T.incipit	@ltx/en_us_dedes/me.m01.d12:meMA.Ode5C1T.incipit
ltx/en_us_public/me.m01.d12:meMA.Ode5C1T.melody	@ltx/en_us_dedes/me.m01.d12:meMA.Ode5C1T.melody
ltx/en_us_public/me.m01.d12:meMA.Ode5C1T.mode	@ltx/en_us_dedes/me.m01.d12:meMA.Ode5C1T.mode
ltx/en_us_public/me.m01.d12:meMA.Ode5C1T.ode	@ltx/en_us_dedes/me.m01.d12:meMA.Ode5C1T.ode
ltx/en_us_public/me.m01.d12:meMA.Ode5C1T.text	@ltx/en_us_dedes/me.m01.d12:meMA.Ode5C1T.text
ltx/en_us_public/me.m01.d12:meMA.Ode6C11.greekmelody	@ltx/en_us_dedes/me.m01.d12:meMA.Ode6C11.greekmelody
ltx/en_us_public/me.m01.d12:meMA.Ode6C11.incipit	@ltx/en_us_dedes/me.m01.d12:meMA.Ode6C11.incipit
ltx/en_us_public/me.m01.d12:meMA.Ode6C11.melody	@ltx/en_us_dedes/me.m01.d12:meMA.Ode6C11.melody
ltx/en_us_public/me.m01.d12:meMA.Ode6C11.mode	@ltx/en_us_dedes/me.m01.d12:meMA.Ode6C11.mode
ltx/en_us_public/me.m01.d12:meMA.Ode6C11.ode	@ltx/en_us_dedes/me.m01.d12:meMA.Ode6C11.ode
ltx/en_us_public/me.m01.d12:meMA.Ode6C11.text	@ltx/en_us_dedes/me.m01.d12:meMA.Ode6C11.text
ltx/en_us_public/me.m01.d12:meMA.Ode6C12.incipit	@ltx/en_us_dedes/me.m01.d12:meMA.Ode6C12.incipit
ltx/en_us_public/me.m01.d12:meMA.Ode6C12.melody	@ltx/en_us_dedes/me.m01.d12:meMA.Ode6C12.melody
ltx/en_us_public/me.m01.d12:meMA.Ode6C12.mode	@ltx/en_us_dedes/me.m01.d12:meMA.Ode6C12.mode
ltx/en_us_public/me.m01.d12:meMA.Ode6C12.ode	@ltx/en_us_dedes/me.m01.d12:meMA.Ode6C12.ode
ltx/en_us_public/me.m01.d12:meMA.Ode6C12.text	@ltx/en_us_dedes/me.m01.d12:meMA.Ode6C12.text
ltx/en_us_public/me.m01.d12:meMA.Ode6C13.incipit	@ltx/en_us_dedes/me.m01.d12:meMA.Ode6C13.incipit
ltx/en_us_public/me.m01.d12:meMA.Ode6C13.melody	@ltx/en_us_dedes/me.m01.d12:meMA.Ode6C13.melody
ltx/en_us_public/me.m01.d12:meMA.Ode6C13.mode	@ltx/en_us_dedes/me.m01.d12:meMA.Ode6C13.mode
ltx/en_us_public/me.m01.d12:meMA.Ode6C13.ode	@ltx/en_us_dedes/me.m01.d12:meMA.Ode6C13.ode
ltx/en_us_public/me.m01.d12:meMA.Ode6C13.text	@ltx/en_us_dedes/me.m01.d12:meMA.Ode6C13.text
ltx/en_us_public/me.m01.d12:meMA.Ode6C1T.incipit	@ltx/en_us_dedes/me.m01.d12:meMA.Ode6C1T.incipit
ltx/en_us_public/me.m01.d12:meMA.Ode6C1T.melody	@ltx/en_us_dedes/me.m01.d12:meMA.Ode6C1T.melody
ltx/en_us_public/me.m01.d12:meMA.Ode6C1T.mode	@ltx/en_us_dedes/me.m01.d12:meMA.Ode6C1T.mode
ltx/en_us_public/me.m01.d12:meMA.Ode6C1T.ode	@ltx/en_us_dedes/me.m01.d12:meMA.Ode6C1T.ode
ltx/en_us_public/me.m01.d12:meMA.Ode6C1T.text	@ltx/en_us_dedes/me.m01.d12:meMA.Ode6C1T.text
ltx/en_us_public/me.m01.d12:meMA.Ode6H.greekmelody	@ltx/en_us_dedes/me.m01.d12:meMA.Ode6H.greekmelody
ltx/en_us_public/me.m01.d12:meMA.Ode6H.incipit	@ltx/en_us_dedes/me.m01.d12:meMA.Ode6H.incipit
ltx/en_us_public/me.m01.d12:meMA.Ode6H.melody	@ltx/en_us_dedes/me.m01.d12:meMA.Ode6H.melody
ltx/en_us_public/me.m01.d12:meMA.Ode6H.mode	@ltx/en_us_dedes/me.m01.d12:meMA.Ode6H.mode
ltx/en_us_public/me.m01.d12:meMA.Ode6H.ode	@ltx/en_us_dedes/me.m01.d12:meMA.Ode6H.ode
ltx/en_us_public/me.m01.d12:meMA.Ode6H.text	@ltx/en_us_dedes/me.m01.d12:meMA.Ode6H.text
ltx/en_us_public/me.m01.d12:meMA.Ode7C11.greekmelody	@ltx/en_us_dedes/me.m01.d12:meMA.Ode7C11.greekmelody
ltx/en_us_public/me.m01.d12:meMA.Ode7C11.incipit	@ltx/en_us_dedes/me.m01.d12:meMA.Ode7C11.incipit
ltx/en_us_public/me.m01.d12:meMA.Ode7C11.melody	@ltx/en_us_dedes/me.m01.d12:meMA.Ode7C11.melody
ltx/en_us_public/me.m01.d12:meMA.Ode7C11.mode	@ltx/en_us_dedes/me.m01.d12:meMA.Ode7C11.mode
ltx/en_us_public/me.m01.d12:meMA.Ode7C11.ode	@ltx/en_us_dedes/me.m01.d12:meMA.Ode7C11.ode
ltx/en_us_public/me.m01.d12:meMA.Ode7C11.text	@ltx/en_us_dedes/me.m01.d12:meMA.Ode7C11.text
ltx/en_us_public/me.m01.d12:meMA.Ode7C12.incipit	@ltx/en_us_dedes/me.m01.d12:meMA.Ode7C12.incipit
ltx/en_us_public/me.m01.d12:meMA.Ode7C12.melody	@ltx/en_us_dedes/me.m01.d12:meMA.Ode7C12.melody
ltx/en_us_public/me.m01.d12:meMA.Ode7C12.mode	@ltx/en_us_dedes/me.m01.d12:meMA.Ode7C12.mode
ltx/en_us_public/me.m01.d12:meMA.Ode7C12.ode	@ltx/en_us_dedes/me.m01.d12:meMA.Ode7C12.ode
ltx/en_us_public/me.m01.d12:meMA.Ode7C12.text	@ltx/en_us_dedes/me.m01.d12:meMA.Ode7C12.text
ltx/en_us_public/me.m01.d12:meMA.Ode7C13.incipit	@ltx/en_us_dedes/me.m01.d12:meMA.Ode7C13.incipit
ltx/en_us_public/me.m01.d12:meMA.Ode7C13.melody	@ltx/en_us_dedes/me.m01.d12:meMA.Ode7C13.melody
ltx/en_us_public/me.m01.d12:meMA.Ode7C13.mode	@ltx/en_us_dedes/me.m01.d12:meMA.Ode7C13.mode
ltx/en_us_public/me.m01.d12:meMA.Ode7C13.ode	@ltx/en_us_dedes/me.m01.d12:meMA.Ode7C13.ode
ltx/en_us_public/me.m01.d12:meMA.Ode7C13.text	@ltx/en_us_dedes/me.m01.d12:meMA.Ode7C13.text
ltx/en_us_public/me.m01.d12:meMA.Ode7C1T.incipit	@ltx/en_us_dedes/me.m01.d12:meMA.Ode7C1T.incipit
ltx/en_us_public/me.m01.d12:meMA.Ode7C1T.melody	@ltx/en_us_dedes/me.m01.d12:meMA.Ode7C1T.melody
ltx/en_us_public/me.m01.d12:meMA.Ode7C1T.mode	@ltx/en_us_dedes/me.m01.d12:meMA.Ode7C1T.mode
ltx/en_us_public/me.m01.d12:meMA.Ode7C1T.ode	@ltx/en_us_dedes/me.m01.d12:meMA.Ode7C1T.ode
ltx/en_us_public/me.m01.d12:meMA.Ode7C1T.text	@ltx/en_us_dedes/me.m01.d12:meMA.Ode7C1T.text
ltx/en_us_public/me.m01.d12:meMA.Ode8C11.greekmelody	@ltx/en_us_dedes/me.m01.d12:meMA.Ode8C11.greekmelody
ltx/en_us_public/me.m01.d12:meMA.Ode8C11.incipit	@ltx/en_us_dedes/me.m01.d12:meMA.Ode8C11.incipit
ltx/en_us_public/me.m01.d12:meMA.Ode8C11.melody	@ltx/en_us_dedes/me.m01.d12:meMA.Ode8C11.melody
ltx/en_us_public/me.m01.d12:meMA.Ode8C11.mode	@ltx/en_us_dedes/me.m01.d12:meMA.Ode8C11.mode
ltx/en_us_public/me.m01.d12:meMA.Ode8C11.ode	@ltx/en_us_dedes/me.m01.d12:meMA.Ode8C11.ode
ltx/en_us_public/me.m01.d12:meMA.Ode8C11.text	@ltx/en_us_dedes/me.m01.d12:meMA.Ode8C11.text
ltx/en_us_public/me.m01.d12:meMA.Ode8C12.incipit	@ltx/en_us_dedes/me.m01.d12:meMA.Ode8C12.incipit
ltx/en_us_public/me.m01.d12:meMA.Ode8C12.melody	@ltx/en_us_dedes/me.m01.d12:meMA.Ode8C12.melody
ltx/en_us_public/me.m01.d12:meMA.Ode8C12.mode	@ltx/en_us_dedes/me.m01.d12:meMA.Ode8C12.mode
ltx/en_us_public/me.m01.d12:meMA.Ode8C12.ode	@ltx/en_us_dedes/me.m01.d12:meMA.Ode8C12.ode
ltx/en_us_public/me.m01.d12:meMA.Ode8C12.text	@ltx/en_us_dedes/me.m01.d12:meMA.Ode8C12.text
ltx/en_us_public/me.m01.d12:meMA.Ode8C13.incipit	@ltx/en_us_dedes/me.m01.d12:meMA.Ode8C13.incipit
ltx/en_us_public/me.m01.d12:meMA.Ode8C13.melody	@ltx/en_us_dedes/me.m01.d12:meMA.Ode8C13.melody
ltx/en_us_public/me.m01.d12:meMA.Ode8C13.mode	@ltx/en_us_dedes/me.m01.d12:meMA.Ode8C13.mode
ltx/en_us_public/me.m01.d12:meMA.Ode8C13.ode	@ltx/en_us_dedes/me.m01.d12:meMA.Ode8C13.ode
ltx/en_us_public/me.m01.d12:meMA.Ode8C13.text	@ltx/en_us_dedes/me.m01.d12:meMA.Ode8C13.text
ltx/en_us_public/me.m01.d12:meMA.Ode8C1T.incipit	@ltx/en_us_dedes/me.m01.d12:meMA.Ode8C1T.incipit
ltx/en_us_public/me.m01.d12:meMA.Ode8C1T.melody	@ltx/en_us_dedes/me.m01.d12:meMA.Ode8C1T.melody
ltx/en_us_public/me.m01.d12:meMA.Ode8C1T.mode	@ltx/en_us_dedes/me.m01.d12:meMA.Ode8C1T.mode
ltx/en_us_public/me.m01.d12:meMA.Ode8C1T.ode	@ltx/en_us_dedes/me.m01.d12:meMA.Ode8C1T.ode
ltx/en_us_public/me.m01.d12:meMA.Ode8C1T.text	@ltx/en_us_dedes/me.m01.d12:meMA.Ode8C1T.text
ltx/en_us_public/me.m01.d12:meMA.Ode8H.greekmelody	@ltx/en_us_dedes/me.m01.d12:meMA.Ode8H.greekmelody
ltx/en_us_public/me.m01.d12:meMA.Ode8H.incipit	@ltx/en_us_dedes/me.m01.d12:meMA.Ode8H.incipit
ltx/en_us_public/me.m01.d12:meMA.Ode8H.melody	@ltx/en_us_dedes/me.m01.d12:meMA.Ode8H.melody
ltx/en_us_public/me.m01.d12:meMA.Ode8H.mode	@ltx/en_us_dedes/me.m01.d12:meMA.Ode8H.mode
ltx/en_us_public/me.m01.d12:meMA.Ode8H.ode	@ltx/en_us_dedes/me.m01.d12:meMA.Ode8H.ode
ltx/en_us_public/me.m01.d12:meMA.Ode8H.text	@ltx/en_us_dedes/me.m01.d12:meMA.Ode8H.text
ltx/en_us_public/me.m01.d12:meMA.Ode9C11.greekmelody	@ltx/en_us_dedes/me.m01.d12:meMA.Ode9C11.greekmelody
ltx/en_us_public/me.m01.d12:meMA.Ode9C11.incipit	@ltx/en_us_dedes/me.m01.d12:meMA.Ode9C11.incipit
ltx/en_us_public/me.m01.d12:meMA.Ode9C11.melody	@ltx/en_us_dedes/me.m01.d12:meMA.Ode9C11.melody
ltx/en_us_public/me.m01.d12:meMA.Ode9C11.mode	@ltx/en_us_dedes/me.m01.d12:meMA.Ode9C11.mode
ltx/en_us_public/me.m01.d12:meMA.Ode9C11.ode	@ltx/en_us_dedes/me.m01.d12:meMA.Ode9C11.ode
ltx/en_us_public/me.m01.d12:meMA.Ode9C11.text	@ltx/en_us_dedes/me.m01.d12:meMA.Ode9C11.text
ltx/en_us_public/me.m01.d12:meMA.Ode9C12.incipit	@ltx/en_us_dedes/me.m01.d12:meMA.Ode9C12.incipit
ltx/en_us_public/me.m01.d12:meMA.Ode9C12.melody	@ltx/en_us_dedes/me.m01.d12:meMA.Ode9C12.melody
ltx/en_us_public/me.m01.d12:meMA.Ode9C12.mode	@ltx/en_us_dedes/me.m01.d12:meMA.Ode9C12.mode
ltx/en_us_public/me.m01.d12:meMA.Ode9C12.ode	@ltx/en_us_dedes/me.m01.d12:meMA.Ode9C12.ode
ltx/en_us_public/me.m01.d12:meMA.Ode9C12.text	@ltx/en_us_dedes/me.m01.d12:meMA.Ode9C12.text
ltx/en_us_public/me.m01.d12:meMA.Ode9C13.incipit	@ltx/en_us_dedes/me.m01.d12:meMA.Ode9C13.incipit
ltx/en_us_public/me.m01.d12:meMA.Ode9C13.melody	@ltx/en_us_dedes/me.m01.d12:meMA.Ode9C13.melody
ltx/en_us_public/me.m01.d12:meMA.Ode9C13.mode	@ltx/en_us_dedes/me.m01.d12:meMA.Ode9C13.mode
ltx/en_us_public/me.m01.d12:meMA.Ode9C13.ode	@ltx/en_us_dedes/me.m01.d12:meMA.Ode9C13.ode
ltx/en_us_public/me.m01.d12:meMA.Ode9C13.text	@ltx/en_us_dedes/me.m01.d12:meMA.Ode9C13.text
ltx/en_us_public/me.m01.d12:meMA.Ode9C1T.incipit	@ltx/en_us_dedes/me.m01.d12:meMA.Ode9C1T.incipit
ltx/en_us_public/me.m01.d12:meMA.Ode9C1T.melody	@ltx/en_us_dedes/me.m01.d12:meMA.Ode9C1T.melody
ltx/en_us_public/me.m01.d12:meMA.Ode9C1T.mode	@ltx/en_us_dedes/me.m01.d12:meMA.Ode9C1T.mode
ltx/en_us_public/me.m01.d12:meMA.Ode9C1T.ode	@ltx/en_us_dedes/me.m01.d12:meMA.Ode9C1T.ode
ltx/en_us_public/me.m01.d12:meMA.Ode9C1T.text	@ltx/en_us_dedes/me.m01.d12:meMA.Ode9C1T.text
ltx/en_us_public/me.m01.d12:meMA.Ode9H.greekmelody	@ltx/en_us_dedes/me.m01.d12:meMA.Ode9H.greekmelody
ltx/en_us_public/me.m01.d12:meMA.Ode9H.incipit	@ltx/en_us_dedes/me.m01.d12:meMA.Ode9H.incipit
ltx/en_us_public/me.m01.d12:meMA.Ode9H.melody	@ltx/en_us_dedes/me.m01.d12:meMA.Ode9H.melody
ltx/en_us_public/me.m01.d12:meMA.Ode9H.mode	@ltx/en_us_dedes/me.m01.d12:meMA.Ode9H.mode
ltx/en_us_public/me.m01.d12:meMA.Ode9H.ode	@ltx/en_us_dedes/me.m01.d12:meMA.Ode9H.ode
ltx/en_us_public/me.m01.d12:meMA.Ode9H.text	@ltx/en_us_dedes/me.m01.d12:meMA.Ode9H.text
ltx/en_us_public/me.m01.d12:meVE.AposGlory.incipit	@ltx/en_us_dedes/me.m01.d12:meVE.AposGlory.incipit
ltx/en_us_public/me.m01.d12:meVE.AposGlory.melody	@ltx/en_us_dedes/me.m01.d12:meVE.AposGlory.melody
ltx/en_us_public/me.m01.d12:meVE.AposGlory.mode	@ltx/en_us_dedes/me.m01.d12:meVE.AposGlory.mode
ltx/en_us_public/me.m01.d12:meVE.AposGlory.poet	@ltx/en_us_dedes/me.m01.d12:meVE.AposGlory.poet
ltx/en_us_public/me.m01.d12:meVE.AposGlory.text	@ltx/en_us_dedes/me.m01.d12:meVE.AposGlory.text
ltx/en_us_public/me.m01.d12:meVE.Aposticha1.greekmelody	@ltx/en_us_dedes/me.m01.d12:meVE.Aposticha1.greekmelody
ltx/en_us_public/me.m01.d12:meVE.Aposticha1.incipit	@ltx/en_us_oca/me.m01.d12:meVE.Aposticha1.incipit
ltx/en_us_public/me.m01.d12:meVE.Aposticha1.melody	@ltx/en_us_oca/me.m01.d12:meVE.Aposticha1.melody
ltx/en_us_public/me.m01.d12:meVE.Aposticha1.mode	@ltx/en_us_dedes/me.m01.d12:meVE.Aposticha1.mode
ltx/en_us_public/me.m01.d12:meVE.Aposticha1.text	@ltx/en_us_oca/me.m01.d12:meVE.Aposticha1.text
ltx/en_us_public/me.m01.d12:meVE.Aposticha2.incipit	@ltx/en_us_oca/me.m01.d12:meVE.Aposticha2.incipit
ltx/en_us_public/me.m01.d12:meVE.Aposticha2.melody	@ltx/en_us_oca/me.m01.d12:meVE.Aposticha2.melody
ltx/en_us_public/me.m01.d12:meVE.Aposticha2.mode	@ltx/en_us_dedes/me.m01.d12:meVE.Aposticha2.mode
ltx/en_us_public/me.m01.d12:meVE.Aposticha2.text	@ltx/en_us_oca/me.m01.d12:meVE.Aposticha2.text
ltx/en_us_public/me.m01.d12:meVE.Aposticha3.incipit	@ltx/en_us_oca/me.m01.d12:meVE.Aposticha3.incipit
ltx/en_us_public/me.m01.d12:meVE.Aposticha3.melody	@ltx/en_us_oca/me.m01.d12:meVE.Aposticha3.melody
ltx/en_us_public/me.m01.d12:meVE.Aposticha3.mode	@ltx/en_us_dedes/me.m01.d12:meVE.Aposticha3.mode
ltx/en_us_public/me.m01.d12:meVE.Aposticha3.text	@ltx/en_us_oca/me.m01.d12:meVE.Aposticha3.text
ltx/en_us_public/me.m01.d12:meVE.SticGlory.incipit	@ltx/en_us_oca/me.m01.d12:meVE.SticGlory.incipit
ltx/en_us_public/me.m01.d12:meVE.SticGlory.melody	@ltx/en_us_dedes/me.m01.d12:meVE.SticGlory.melody
ltx/en_us_public/me.m01.d12:meVE.SticGlory.mode	@ltx/en_us_dedes/me.m01.d12:meVE.SticGlory.mode
ltx/en_us_public/me.m01.d12:meVE.SticGlory.poet	@ltx/en_us_dedes/me.m01.d12:meVE.SticGlory.poet
ltx/en_us_public/me.m01.d12:meVE.SticGlory.text	@ltx/en_us_oca/me.m01.d12:meVE.SticGlory.text
ltx/en_us_public/me.m01.d12:meVE.Stichera01.greekmelody	@ltx/en_us_dedes/me.m01.d12:meVE.Stichera01.greekmelody
ltx/en_us_public/me.m01.d12:meVE.Stichera01.incipit	@ltx/en_us_oca/me.m01.d12:meVE.Stichera01.incipit
ltx/en_us_public/me.m01.d12:meVE.Stichera01.melody	@ltx/en_us_oca/me.m01.d12:meVE.Stichera01.melody
ltx/en_us_public/me.m01.d12:meVE.Stichera01.mode	@ltx/en_us_dedes/me.m01.d12:meVE.Stichera01.mode
ltx/en_us_public/me.m01.d12:meVE.Stichera01.text	@ltx/en_us_oca/me.m01.d12:meVE.Stichera01.text
ltx/en_us_public/me.m01.d12:meVE.Stichera02.incipit	@ltx/en_us_oca/me.m01.d12:meVE.Stichera02.incipit
ltx/en_us_public/me.m01.d12:meVE.Stichera02.melody	@ltx/en_us_oca/me.m01.d12:meVE.Stichera02.melody
ltx/en_us_public/me.m01.d12:meVE.Stichera02.mode	@ltx/en_us_dedes/me.m01.d12:meVE.Stichera02.mode
ltx/en_us_public/me.m01.d12:meVE.Stichera02.text	@ltx/en_us_oca/me.m01.d12:meVE.Stichera02.text
ltx/en_us_public/me.m01.d12:meVE.Stichera03.incipit	@ltx/en_us_oca/me.m01.d12:meVE.Stichera03.incipit
ltx/en_us_public/me.m01.d12:meVE.Stichera03.melody	@ltx/en_us_oca/me.m01.d12:meVE.Stichera03.melody
ltx/en_us_public/me.m01.d12:meVE.Stichera03.mode	@ltx/en_us_dedes/me.m01.d12:meVE.Stichera03.mode
ltx/en_us_public/me.m01.d12:meVE.Stichera03.text	@ltx/en_us_oca/me.m01.d12:meVE.Stichera03.text
ltx/en_us_public/me.m01.d12:meVE.Stichera04.greekmelody	@ltx/en_us_dedes/me.m01.d12:meVE.Stichera04.greekmelody
ltx/en_us_public/me.m01.d12:meVE.Stichera04.incipit	@ltx/en_us_dedes/me.m01.d12:meVE.Stichera04.incipit
ltx/en_us_public/me.m01.d12:meVE.Stichera04.melody	@ltx/en_us_dedes/me.m01.d12:meVE.Stichera04.melody
ltx/en_us_public/me.m01.d12:meVE.Stichera04.mode	@ltx/en_us_dedes/me.m01.d12:meVE.Stichera04.mode
ltx/en_us_public/me.m01.d12:meVE.Stichera04.text	@ltx/en_us_dedes/me.m01.d12:meVE.Stichera04.text
ltx/en_us_public/me.m01.d12:meVE.Stichera05.incipit	@ltx/en_us_dedes/me.m01.d12:meVE.Stichera05.incipit
ltx/en_us_public/me.m01.d12:meVE.Stichera05.melody	@ltx/en_us_dedes/me.m01.d12:meVE.Stichera05.melody
ltx/en_us_public/me.m01.d12:meVE.Stichera05.mode	@ltx/en_us_dedes/me.m01.d12:meVE.Stichera05.mode
ltx/en_us_public/me.m01.d12:meVE.Stichera05.text	@ltx/en_us_dedes/me.m01.d12:meVE.Stichera05.text
ltx/en_us_public/me.m01.d12:meVE.Stichera06.incipit	@ltx/en_us_dedes/me.m01.d12:meVE.Stichera06.incipit
ltx/en_us_public/me.m01.d12:meVE.Stichera06.melody	@ltx/en_us_dedes/me.m01.d12:meVE.Stichera06.melody
ltx/en_us_public/me.m01.d12:meVE.Stichera06.mode	@ltx/en_us_dedes/me.m01.d12:meVE.Stichera06.mode
ltx/en_us_public/me.m01.d12:meVE.Stichera06.text	@ltx/en_us_dedes/me.m01.d12:meVE.Stichera06.text
