ltx/en_us_public/le.go.me.m02.d17:lemeLI.Gospel.book_abbr	@ltx/en_us_rsv/le.go.me.m02.d17:lemeLI.Gospel.book_abbr
ltx/en_us_public/le.go.me.m02.d17:lemeLI.Gospel.book_string	@ltx/en_us_rsv/le.go.me.m02.d17:lemeLI.Gospel.book_string
ltx/en_us_public/le.go.me.m02.d17:lemeLI.Gospel.chapverse	@ltx/en_us_rsv/le.go.me.m02.d17:lemeLI.Gospel.chapverse
ltx/en_us_public/le.go.me.m02.d17:lemeLI.Gospel.incipit	@ltx/en_us_rsv/le.go.me.m02.d17:lemeLI.Gospel.incipit
ltx/en_us_public/le.go.me.m02.d17:lemeLI.Gospel.text	@ltx/en_us_rsv/le.go.me.m02.d17:lemeLI.Gospel.text
ltx/en_us_public/le.go.me.m02.d17:lemeLI.Gospel.title	@ltx/en_us_rsv/le.go.me.m02.d17:lemeLI.Gospel.title
ltx/en_us_public/le.go.me.m02.d17:lemeLI.Gospel.title_abbr	@ltx/en_us_rsv/le.go.me.m02.d17:lemeLI.Gospel.title_abbr
ltx/en_us_public/le.go.me.m02.d17:lemeLI.Gospel.version	@ltx/en_us_rsv/le.go.me.m02.d17:lemeLI.Gospel.version
