ltx/en_us_public/tr.d014:trCO.header	@ltx/en_us_dedes/tr.d014:trCO.header
ltx/en_us_public/tr.d014:trDA.commemoration.full	@ltx/en_us_dedes/tr.d014:trDA.commemoration.full
ltx/en_us_public/tr.d014:trDA.commemoration.short	@ltx/en_us_dedes/tr.d014:trDA.commemoration.short
ltx/en_us_public/tr.d014:trDA.insert1	@ltx/en_us_dedes/tr.d014:trDA.insert1
ltx/en_us_public/tr.d014:trDA.insert2	@ltx/en_us_dedes/tr.d014:trDA.insert2
ltx/en_us_public/tr.d014:trDA.note	@ltx/en_us_dedes/tr.d014:trDA.note
ltx/en_us_public/tr.d014:trDA.title	@ltx/en_us_dedes/tr.d014:trDA.title
ltx/en_us_public/tr.d014:trHO.commemorations	@ltx/en_us_dedes/tr.d014:trHO.commemorations
ltx/en_us_public/tr.d014:trHO.daytitle	@ltx/en_us_dedes/tr.d014:trHO.daytitle
ltx/en_us_public/tr.d014:trHO.description1	@ltx/en_us_dedes/tr.d014:trHO.description1
ltx/en_us_public/tr.d014:trHO.description2	@ltx/en_us_dedes/tr.d014:trHO.description2
ltx/en_us_public/tr.d014:trHO.note1	@ltx/en_us_dedes/tr.d014:trHO.note1
ltx/en_us_public/tr.d014:trHO.note2	@ltx/en_us_dedes/tr.d014:trHO.note2
ltx/en_us_public/tr.d014:trLI.Kontakion1.incipit	@ltx/en_us_goa/tr.d014:trLI.Kontakion1.incipit
ltx/en_us_public/tr.d014:trLI.Kontakion1.melody	@ltx/en_us_dedes/tr.d014:trLI.Kontakion1.melody
ltx/en_us_public/tr.d014:trLI.Kontakion1.mode	@ltx/en_us_dedes/tr.d014:trLI.Kontakion1.mode
ltx/en_us_public/tr.d014:trLI.Kontakion1.text	@ltx/en_us_goa/tr.d014:trLI.Kontakion1.text
ltx/en_us_public/tr.d014:trLI.MM.CommunionHymn.text	@ltx/en_us_dedes/tr.d014:trLI.MM.CommunionHymn.text
ltx/en_us_public/tr.d014:trLI.Megalynarion.text	@ltx/en_us_dedes/tr.d014:trLI.Megalynarion.text
ltx/en_us_public/tr.d014:trMA.AposGlory.incipit	@ltx/en_us_dedes/tr.d014:trMA.AposGlory.incipit
ltx/en_us_public/tr.d014:trMA.AposGlory.melody	@ltx/en_us_dedes/tr.d014:trMA.AposGlory.melody
ltx/en_us_public/tr.d014:trMA.AposGlory.mode	@ltx/en_us_dedes/tr.d014:trMA.AposGlory.mode
ltx/en_us_public/tr.d014:trMA.AposGlory.text	@ltx/en_us_dedes/tr.d014:trMA.AposGlory.text
ltx/en_us_public/tr.d014:trMA.AposTheotokion.incipit	@ltx/en_us_dedes/tr.d014:trMA.AposTheotokion.incipit
ltx/en_us_public/tr.d014:trMA.AposTheotokion.melody	@ltx/en_us_dedes/tr.d014:trMA.AposTheotokion.melody
ltx/en_us_public/tr.d014:trMA.AposTheotokion.mode	@ltx/en_us_dedes/tr.d014:trMA.AposTheotokion.mode
ltx/en_us_public/tr.d014:trMA.AposTheotokion.text	@ltx/en_us_dedes/tr.d014:trMA.AposTheotokion.text
ltx/en_us_public/tr.d014:trMA.C1.acrostic.notice1	@ltx/en_us_dedes/tr.d014:trMA.C1.acrostic.notice1
ltx/en_us_public/tr.d014:trMA.C1.acrostic.text	@ltx/en_us_dedes/tr.d014:trMA.C1.acrostic.text
ltx/en_us_public/tr.d014:trMA.C1.acrostic.title	@ltx/en_us_dedes/tr.d014:trMA.C1.acrostic.title
ltx/en_us_public/tr.d014:trMA.C1.title	@ltx/en_us_dedes/tr.d014:trMA.C1.title
ltx/en_us_public/tr.d014:trMA.C1.verse	@ltx/en_us_dedes/tr.d014:trMA.C1.verse
ltx/en_us_public/tr.d014:trMA.ExapTheotokion.greekmelody	@ltx/en_us_dedes/tr.d014:trMA.ExapTheotokion.greekmelody
ltx/en_us_public/tr.d014:trMA.ExapTheotokion.incipit	@ltx/en_us_dedes/tr.d014:trMA.ExapTheotokion.incipit
ltx/en_us_public/tr.d014:trMA.ExapTheotokion.melody	@ltx/en_us_dedes/tr.d014:trMA.ExapTheotokion.melody
ltx/en_us_public/tr.d014:trMA.ExapTheotokion.mode	@ltx/en_us_dedes/tr.d014:trMA.ExapTheotokion.mode
ltx/en_us_public/tr.d014:trMA.ExapTheotokion.text	@ltx/en_us_dedes/tr.d014:trMA.ExapTheotokion.text
ltx/en_us_public/tr.d014:trMA.Exaposteilarion1.greekmelody	@ltx/en_us_dedes/tr.d014:trMA.Exaposteilarion1.greekmelody
ltx/en_us_public/tr.d014:trMA.Exaposteilarion1.incipit	@ltx/en_us_dedes/tr.d014:trMA.Exaposteilarion1.incipit
ltx/en_us_public/tr.d014:trMA.Exaposteilarion1.melody	@ltx/en_us_dedes/tr.d014:trMA.Exaposteilarion1.melody
ltx/en_us_public/tr.d014:trMA.Exaposteilarion1.mode	@ltx/en_us_dedes/tr.d014:trMA.Exaposteilarion1.mode
ltx/en_us_public/tr.d014:trMA.Exaposteilarion1.text	@ltx/en_us_dedes/tr.d014:trMA.Exaposteilarion1.text
ltx/en_us_public/tr.d014:trMA.Exaposteilarion2.greekmelody	@ltx/en_us_dedes/tr.d014:trMA.Exaposteilarion2.greekmelody
ltx/en_us_public/tr.d014:trMA.Exaposteilarion2.incipit	@ltx/en_us_dedes/tr.d014:trMA.Exaposteilarion2.incipit
ltx/en_us_public/tr.d014:trMA.Exaposteilarion2.melody	@ltx/en_us_dedes/tr.d014:trMA.Exaposteilarion2.melody
ltx/en_us_public/tr.d014:trMA.Exaposteilarion2.mode	@ltx/en_us_dedes/tr.d014:trMA.Exaposteilarion2.mode
ltx/en_us_public/tr.d014:trMA.Exaposteilarion2.text	@ltx/en_us_dedes/tr.d014:trMA.Exaposteilarion2.text
ltx/en_us_public/tr.d014:trMA.Kathisma21.incipit	@ltx/en_us_goadedes/tr.d014:trMA.Kathisma21.incipit
ltx/en_us_public/tr.d014:trMA.Kathisma21.melody	@ltx/en_us_goadedes/tr.d014:trMA.Kathisma21.melody
ltx/en_us_public/tr.d014:trMA.Kathisma21.mode	@ltx/en_us_goadedes/tr.d014:trMA.Kathisma21.mode
ltx/en_us_public/tr.d014:trMA.Kathisma21.text	@ltx/en_us_goadedes/tr.d014:trMA.Kathisma21.text
ltx/en_us_public/tr.d014:trMA.Kathisma21b.incipit	@ltx/en_us_goadedes/tr.d014:trMA.Kathisma21b.incipit
ltx/en_us_public/tr.d014:trMA.Kathisma21b.melody	@ltx/en_us_goadedes/tr.d014:trMA.Kathisma21b.melody
ltx/en_us_public/tr.d014:trMA.Kathisma21b.mode	@ltx/en_us_goadedes/tr.d014:trMA.Kathisma21b.mode
ltx/en_us_public/tr.d014:trMA.Kathisma21b.text	@ltx/en_us_goadedes/tr.d014:trMA.Kathisma21b.text
ltx/en_us_public/tr.d014:trMA.Kathisma22.incipit	@ltx/en_us_goadedes/tr.d014:trMA.Kathisma22.incipit
ltx/en_us_public/tr.d014:trMA.Kathisma22.melody	@ltx/en_us_goadedes/tr.d014:trMA.Kathisma22.melody
ltx/en_us_public/tr.d014:trMA.Kathisma22.mode	@ltx/en_us_goadedes/tr.d014:trMA.Kathisma22.mode
ltx/en_us_public/tr.d014:trMA.Kathisma22.text	@ltx/en_us_goadedes/tr.d014:trMA.Kathisma22.text
ltx/en_us_public/tr.d014:trMA.Kontakion1.incipit	@ltx/en_us_goa/tr.d014:trMA.Kontakion1.incipit
ltx/en_us_public/tr.d014:trMA.Kontakion1.melody	@ltx/en_us_goa/tr.d014:trMA.Kontakion1.melody
ltx/en_us_public/tr.d014:trMA.Kontakion1.mode	@ltx/en_us_dedes/tr.d014:trMA.Kontakion1.mode
ltx/en_us_public/tr.d014:trMA.Kontakion1.text	@ltx/en_us_goa/tr.d014:trMA.Kontakion1.text
ltx/en_us_public/tr.d014:trMA.Lauds1.incipit	@ltx/en_us_dedes/tr.d014:trMA.Lauds1.incipit
ltx/en_us_public/tr.d014:trMA.Lauds1.melody	@ltx/en_us_dedes/tr.d014:trMA.Lauds1.melody
ltx/en_us_public/tr.d014:trMA.Lauds1.mode	@ltx/en_us_dedes/tr.d014:trMA.Lauds1.mode
ltx/en_us_public/tr.d014:trMA.Lauds1.text	@ltx/en_us_dedes/tr.d014:trMA.Lauds1.text
ltx/en_us_public/tr.d014:trMA.Lauds2.incipit	@ltx/en_us_dedes/tr.d014:trMA.Lauds2.incipit
ltx/en_us_public/tr.d014:trMA.Lauds2.melody	@ltx/en_us_dedes/tr.d014:trMA.Lauds2.melody
ltx/en_us_public/tr.d014:trMA.Lauds2.mode	@ltx/en_us_dedes/tr.d014:trMA.Lauds2.mode
ltx/en_us_public/tr.d014:trMA.Lauds2.text	@ltx/en_us_dedes/tr.d014:trMA.Lauds2.text
ltx/en_us_public/tr.d014:trMA.Lauds3.incipit	@ltx/en_us_dedes/tr.d014:trMA.Lauds3.incipit
ltx/en_us_public/tr.d014:trMA.Lauds3.melody	@ltx/en_us_dedes/tr.d014:trMA.Lauds3.melody
ltx/en_us_public/tr.d014:trMA.Lauds3.mode	@ltx/en_us_dedes/tr.d014:trMA.Lauds3.mode
ltx/en_us_public/tr.d014:trMA.Lauds3.text	@ltx/en_us_dedes/tr.d014:trMA.Lauds3.text
ltx/en_us_public/tr.d014:trMA.Lauds4.incipit	@ltx/en_us_dedes/tr.d014:trMA.Lauds4.incipit
ltx/en_us_public/tr.d014:trMA.Lauds4.melody	@ltx/en_us_dedes/tr.d014:trMA.Lauds4.melody
ltx/en_us_public/tr.d014:trMA.Lauds4.mode	@ltx/en_us_dedes/tr.d014:trMA.Lauds4.mode
ltx/en_us_public/tr.d014:trMA.Lauds4.text	@ltx/en_us_dedes/tr.d014:trMA.Lauds4.text
ltx/en_us_public/tr.d014:trMA.LaudsGlory.incipit	@ltx/en_us_dedes/tr.d014:trMA.LaudsGlory.incipit
ltx/en_us_public/tr.d014:trMA.LaudsGlory.melody	@ltx/en_us_dedes/tr.d014:trMA.LaudsGlory.melody
ltx/en_us_public/tr.d014:trMA.LaudsGlory.mode	@ltx/en_us_dedes/tr.d014:trMA.LaudsGlory.mode
ltx/en_us_public/tr.d014:trMA.LaudsGlory.text	@ltx/en_us_dedes/tr.d014:trMA.LaudsGlory.text
ltx/en_us_public/tr.d014:trMA.LaudsTheotokion.incipit	@ltx/en_us_dedes/tr.d014:trMA.LaudsTheotokion.incipit
ltx/en_us_public/tr.d014:trMA.LaudsTheotokion.melody	@ltx/en_us_dedes/tr.d014:trMA.LaudsTheotokion.melody
ltx/en_us_public/tr.d014:trMA.LaudsTheotokion.mode	@ltx/en_us_dedes/tr.d014:trMA.LaudsTheotokion.mode
ltx/en_us_public/tr.d014:trMA.LaudsTheotokion.text	@ltx/en_us_dedes/tr.d014:trMA.LaudsTheotokion.text
ltx/en_us_public/tr.d014:trMA.Ode1C11.greekmelody	@ltx/en_us_dedes/tr.d014:trMA.Ode1C11.greekmelody
ltx/en_us_public/tr.d014:trMA.Ode1C11.incipit	@ltx/en_us_dedes/tr.d014:trMA.Ode1C11.incipit
ltx/en_us_public/tr.d014:trMA.Ode1C11.melody	@ltx/en_us_dedes/tr.d014:trMA.Ode1C11.melody
ltx/en_us_public/tr.d014:trMA.Ode1C11.mode	@ltx/en_us_dedes/tr.d014:trMA.Ode1C11.mode
ltx/en_us_public/tr.d014:trMA.Ode1C11.ode	@ltx/en_us_dedes/tr.d014:trMA.Ode1C11.ode
ltx/en_us_public/tr.d014:trMA.Ode1C11.text	@ltx/en_us_dedes/tr.d014:trMA.Ode1C11.text
ltx/en_us_public/tr.d014:trMA.Ode1C12.incipit	@ltx/en_us_dedes/tr.d014:trMA.Ode1C12.incipit
ltx/en_us_public/tr.d014:trMA.Ode1C12.melody	@ltx/en_us_dedes/tr.d014:trMA.Ode1C12.melody
ltx/en_us_public/tr.d014:trMA.Ode1C12.mode	@ltx/en_us_dedes/tr.d014:trMA.Ode1C12.mode
ltx/en_us_public/tr.d014:trMA.Ode1C12.ode	@ltx/en_us_dedes/tr.d014:trMA.Ode1C12.ode
ltx/en_us_public/tr.d014:trMA.Ode1C12.text	@ltx/en_us_dedes/tr.d014:trMA.Ode1C12.text
ltx/en_us_public/tr.d014:trMA.Ode1C13.incipit	@ltx/en_us_dedes/tr.d014:trMA.Ode1C13.incipit
ltx/en_us_public/tr.d014:trMA.Ode1C13.melody	@ltx/en_us_dedes/tr.d014:trMA.Ode1C13.melody
ltx/en_us_public/tr.d014:trMA.Ode1C13.mode	@ltx/en_us_dedes/tr.d014:trMA.Ode1C13.mode
ltx/en_us_public/tr.d014:trMA.Ode1C13.ode	@ltx/en_us_dedes/tr.d014:trMA.Ode1C13.ode
ltx/en_us_public/tr.d014:trMA.Ode1C13.text	@ltx/en_us_dedes/tr.d014:trMA.Ode1C13.text
ltx/en_us_public/tr.d014:trMA.Ode1C14.incipit	@ltx/en_us_dedes/tr.d014:trMA.Ode1C14.incipit
ltx/en_us_public/tr.d014:trMA.Ode1C14.melody	@ltx/en_us_dedes/tr.d014:trMA.Ode1C14.melody
ltx/en_us_public/tr.d014:trMA.Ode1C14.mode	@ltx/en_us_dedes/tr.d014:trMA.Ode1C14.mode
ltx/en_us_public/tr.d014:trMA.Ode1C14.ode	@ltx/en_us_dedes/tr.d014:trMA.Ode1C14.ode
ltx/en_us_public/tr.d014:trMA.Ode1C14.text	@ltx/en_us_dedes/tr.d014:trMA.Ode1C14.text
ltx/en_us_public/tr.d014:trMA.Ode1C15.incipit	@ltx/en_us_dedes/tr.d014:trMA.Ode1C15.incipit
ltx/en_us_public/tr.d014:trMA.Ode1C15.melody	@ltx/en_us_dedes/tr.d014:trMA.Ode1C15.melody
ltx/en_us_public/tr.d014:trMA.Ode1C15.mode	@ltx/en_us_dedes/tr.d014:trMA.Ode1C15.mode
ltx/en_us_public/tr.d014:trMA.Ode1C15.ode	@ltx/en_us_dedes/tr.d014:trMA.Ode1C15.ode
ltx/en_us_public/tr.d014:trMA.Ode1C15.text	@ltx/en_us_dedes/tr.d014:trMA.Ode1C15.text
ltx/en_us_public/tr.d014:trMA.Ode1C1H.greekmelody	@ltx/en_us_dedes/tr.d014:trMA.Ode1C1H.greekmelody
ltx/en_us_public/tr.d014:trMA.Ode1C1H.incipit	@ltx/en_us_dedes/tr.d014:trMA.Ode1C1H.incipit
ltx/en_us_public/tr.d014:trMA.Ode1C1H.melody	@ltx/en_us_dedes/tr.d014:trMA.Ode1C1H.melody
ltx/en_us_public/tr.d014:trMA.Ode1C1H.mode	@ltx/en_us_dedes/tr.d014:trMA.Ode1C1H.mode
ltx/en_us_public/tr.d014:trMA.Ode1C1H.ode	@ltx/en_us_dedes/tr.d014:trMA.Ode1C1H.ode
ltx/en_us_public/tr.d014:trMA.Ode1C1H.text	@ltx/en_us_dedes/tr.d014:trMA.Ode1C1H.text
ltx/en_us_public/tr.d014:trMA.Ode1C1T.incipit	@ltx/en_us_dedes/tr.d014:trMA.Ode1C1T.incipit
ltx/en_us_public/tr.d014:trMA.Ode1C1T.melody	@ltx/en_us_dedes/tr.d014:trMA.Ode1C1T.melody
ltx/en_us_public/tr.d014:trMA.Ode1C1T.mode	@ltx/en_us_dedes/tr.d014:trMA.Ode1C1T.mode
ltx/en_us_public/tr.d014:trMA.Ode1C1T.ode	@ltx/en_us_dedes/tr.d014:trMA.Ode1C1T.ode
ltx/en_us_public/tr.d014:trMA.Ode1C1T.text	@ltx/en_us_dedes/tr.d014:trMA.Ode1C1T.text
ltx/en_us_public/tr.d014:trMA.Ode1C1Tr.incipit	@ltx/en_us_dedes/tr.d014:trMA.Ode1C1Tr.incipit
ltx/en_us_public/tr.d014:trMA.Ode1C1Tr.melody	@ltx/en_us_dedes/tr.d014:trMA.Ode1C1Tr.melody
ltx/en_us_public/tr.d014:trMA.Ode1C1Tr.mode	@ltx/en_us_dedes/tr.d014:trMA.Ode1C1Tr.mode
ltx/en_us_public/tr.d014:trMA.Ode1C1Tr.ode	@ltx/en_us_dedes/tr.d014:trMA.Ode1C1Tr.ode
ltx/en_us_public/tr.d014:trMA.Ode1C1Tr.text	@ltx/en_us_dedes/tr.d014:trMA.Ode1C1Tr.text
ltx/en_us_public/tr.d014:trMA.Ode1K.incipit	@ltx/en_us_dedes/tr.d014:trMA.Ode1K.incipit
ltx/en_us_public/tr.d014:trMA.Ode1K.melody	@ltx/en_us_dedes/tr.d014:trMA.Ode1K.melody
ltx/en_us_public/tr.d014:trMA.Ode1K.mode	@ltx/en_us_dedes/tr.d014:trMA.Ode1K.mode
ltx/en_us_public/tr.d014:trMA.Ode1K.ode	@ltx/en_us_dedes/tr.d014:trMA.Ode1K.ode
ltx/en_us_public/tr.d014:trMA.Ode1K.text	@ltx/en_us_dedes/tr.d014:trMA.Ode1K.text
ltx/en_us_public/tr.d014:trMA.Ode2C11.greekmelody	@ltx/en_us_dedes/tr.d014:trMA.Ode2C11.greekmelody
ltx/en_us_public/tr.d014:trMA.Ode2C11.incipit	@ltx/en_us_dedes/tr.d014:trMA.Ode2C11.incipit
ltx/en_us_public/tr.d014:trMA.Ode2C11.melody	@ltx/en_us_dedes/tr.d014:trMA.Ode2C11.melody
ltx/en_us_public/tr.d014:trMA.Ode2C11.mode	@ltx/en_us_dedes/tr.d014:trMA.Ode2C11.mode
ltx/en_us_public/tr.d014:trMA.Ode2C11.ode	@ltx/en_us_dedes/tr.d014:trMA.Ode2C11.ode
ltx/en_us_public/tr.d014:trMA.Ode2C11.text	@ltx/en_us_dedes/tr.d014:trMA.Ode2C11.text
ltx/en_us_public/tr.d014:trMA.Ode2C12.incipit	@ltx/en_us_dedes/tr.d014:trMA.Ode2C12.incipit
ltx/en_us_public/tr.d014:trMA.Ode2C12.melody	@ltx/en_us_dedes/tr.d014:trMA.Ode2C12.melody
ltx/en_us_public/tr.d014:trMA.Ode2C12.mode	@ltx/en_us_dedes/tr.d014:trMA.Ode2C12.mode
ltx/en_us_public/tr.d014:trMA.Ode2C12.ode	@ltx/en_us_dedes/tr.d014:trMA.Ode2C12.ode
ltx/en_us_public/tr.d014:trMA.Ode2C12.text	@ltx/en_us_dedes/tr.d014:trMA.Ode2C12.text
ltx/en_us_public/tr.d014:trMA.Ode2C13.incipit	@ltx/en_us_dedes/tr.d014:trMA.Ode2C13.incipit
ltx/en_us_public/tr.d014:trMA.Ode2C13.melody	@ltx/en_us_dedes/tr.d014:trMA.Ode2C13.melody
ltx/en_us_public/tr.d014:trMA.Ode2C13.mode	@ltx/en_us_dedes/tr.d014:trMA.Ode2C13.mode
ltx/en_us_public/tr.d014:trMA.Ode2C13.ode	@ltx/en_us_dedes/tr.d014:trMA.Ode2C13.ode
ltx/en_us_public/tr.d014:trMA.Ode2C13.text	@ltx/en_us_dedes/tr.d014:trMA.Ode2C13.text
ltx/en_us_public/tr.d014:trMA.Ode2C14.incipit	@ltx/en_us_dedes/tr.d014:trMA.Ode2C14.incipit
ltx/en_us_public/tr.d014:trMA.Ode2C14.melody	@ltx/en_us_dedes/tr.d014:trMA.Ode2C14.melody
ltx/en_us_public/tr.d014:trMA.Ode2C14.mode	@ltx/en_us_dedes/tr.d014:trMA.Ode2C14.mode
ltx/en_us_public/tr.d014:trMA.Ode2C14.ode	@ltx/en_us_dedes/tr.d014:trMA.Ode2C14.ode
ltx/en_us_public/tr.d014:trMA.Ode2C14.text	@ltx/en_us_dedes/tr.d014:trMA.Ode2C14.text
ltx/en_us_public/tr.d014:trMA.Ode2C1H.greekmelody	@ltx/en_us_dedes/tr.d014:trMA.Ode2C1H.greekmelody
ltx/en_us_public/tr.d014:trMA.Ode2C1H.incipit	@ltx/en_us_dedes/tr.d014:trMA.Ode2C1H.incipit
ltx/en_us_public/tr.d014:trMA.Ode2C1H.melody	@ltx/en_us_dedes/tr.d014:trMA.Ode2C1H.melody
ltx/en_us_public/tr.d014:trMA.Ode2C1H.mode	@ltx/en_us_dedes/tr.d014:trMA.Ode2C1H.mode
ltx/en_us_public/tr.d014:trMA.Ode2C1H.ode	@ltx/en_us_dedes/tr.d014:trMA.Ode2C1H.ode
ltx/en_us_public/tr.d014:trMA.Ode2C1H.text	@ltx/en_us_dedes/tr.d014:trMA.Ode2C1H.text
ltx/en_us_public/tr.d014:trMA.Ode2C1T.incipit	@ltx/en_us_dedes/tr.d014:trMA.Ode2C1T.incipit
ltx/en_us_public/tr.d014:trMA.Ode2C1T.melody	@ltx/en_us_dedes/tr.d014:trMA.Ode2C1T.melody
ltx/en_us_public/tr.d014:trMA.Ode2C1T.mode	@ltx/en_us_dedes/tr.d014:trMA.Ode2C1T.mode
ltx/en_us_public/tr.d014:trMA.Ode2C1T.ode	@ltx/en_us_dedes/tr.d014:trMA.Ode2C1T.ode
ltx/en_us_public/tr.d014:trMA.Ode2C1T.text	@ltx/en_us_dedes/tr.d014:trMA.Ode2C1T.text
ltx/en_us_public/tr.d014:trMA.Ode2C1Tr.incipit	@ltx/en_us_dedes/tr.d014:trMA.Ode2C1Tr.incipit
ltx/en_us_public/tr.d014:trMA.Ode2C1Tr.melody	@ltx/en_us_dedes/tr.d014:trMA.Ode2C1Tr.melody
ltx/en_us_public/tr.d014:trMA.Ode2C1Tr.mode	@ltx/en_us_dedes/tr.d014:trMA.Ode2C1Tr.mode
ltx/en_us_public/tr.d014:trMA.Ode2C1Tr.ode	@ltx/en_us_dedes/tr.d014:trMA.Ode2C1Tr.ode
ltx/en_us_public/tr.d014:trMA.Ode2C1Tr.text	@ltx/en_us_dedes/tr.d014:trMA.Ode2C1Tr.text
ltx/en_us_public/tr.d014:trMA.Ode2K.incipit	@ltx/en_us_dedes/tr.d014:trMA.Ode2K.incipit
ltx/en_us_public/tr.d014:trMA.Ode2K.melody	@ltx/en_us_dedes/tr.d014:trMA.Ode2K.melody
ltx/en_us_public/tr.d014:trMA.Ode2K.mode	@ltx/en_us_dedes/tr.d014:trMA.Ode2K.mode
ltx/en_us_public/tr.d014:trMA.Ode2K.ode	@ltx/en_us_dedes/tr.d014:trMA.Ode2K.ode
ltx/en_us_public/tr.d014:trMA.Ode2K.text	@ltx/en_us_dedes/tr.d014:trMA.Ode2K.text
ltx/en_us_public/tr.d014:trMA.Ode3C11.greekmelody	@ltx/en_us_dedes/tr.d014:trMA.Ode3C11.greekmelody
ltx/en_us_public/tr.d014:trMA.Ode3C11.incipit	@ltx/en_us_dedes/tr.d014:trMA.Ode3C11.incipit
ltx/en_us_public/tr.d014:trMA.Ode3C11.melody	@ltx/en_us_dedes/tr.d014:trMA.Ode3C11.melody
ltx/en_us_public/tr.d014:trMA.Ode3C11.mode	@ltx/en_us_dedes/tr.d014:trMA.Ode3C11.mode
ltx/en_us_public/tr.d014:trMA.Ode3C11.ode	@ltx/en_us_dedes/tr.d014:trMA.Ode3C11.ode
ltx/en_us_public/tr.d014:trMA.Ode3C11.text	@ltx/en_us_dedes/tr.d014:trMA.Ode3C11.text
ltx/en_us_public/tr.d014:trMA.Ode3C12.incipit	@ltx/en_us_dedes/tr.d014:trMA.Ode3C12.incipit
ltx/en_us_public/tr.d014:trMA.Ode3C12.melody	@ltx/en_us_dedes/tr.d014:trMA.Ode3C12.melody
ltx/en_us_public/tr.d014:trMA.Ode3C12.mode	@ltx/en_us_dedes/tr.d014:trMA.Ode3C12.mode
ltx/en_us_public/tr.d014:trMA.Ode3C12.ode	@ltx/en_us_dedes/tr.d014:trMA.Ode3C12.ode
ltx/en_us_public/tr.d014:trMA.Ode3C12.text	@ltx/en_us_dedes/tr.d014:trMA.Ode3C12.text
ltx/en_us_public/tr.d014:trMA.Ode3C13.incipit	@ltx/en_us_dedes/tr.d014:trMA.Ode3C13.incipit
ltx/en_us_public/tr.d014:trMA.Ode3C13.melody	@ltx/en_us_dedes/tr.d014:trMA.Ode3C13.melody
ltx/en_us_public/tr.d014:trMA.Ode3C13.mode	@ltx/en_us_dedes/tr.d014:trMA.Ode3C13.mode
ltx/en_us_public/tr.d014:trMA.Ode3C13.ode	@ltx/en_us_dedes/tr.d014:trMA.Ode3C13.ode
ltx/en_us_public/tr.d014:trMA.Ode3C13.text	@ltx/en_us_dedes/tr.d014:trMA.Ode3C13.text
ltx/en_us_public/tr.d014:trMA.Ode3C14.incipit	@ltx/en_us_dedes/tr.d014:trMA.Ode3C14.incipit
ltx/en_us_public/tr.d014:trMA.Ode3C14.melody	@ltx/en_us_dedes/tr.d014:trMA.Ode3C14.melody
ltx/en_us_public/tr.d014:trMA.Ode3C14.mode	@ltx/en_us_dedes/tr.d014:trMA.Ode3C14.mode
ltx/en_us_public/tr.d014:trMA.Ode3C14.ode	@ltx/en_us_dedes/tr.d014:trMA.Ode3C14.ode
ltx/en_us_public/tr.d014:trMA.Ode3C14.text	@ltx/en_us_dedes/tr.d014:trMA.Ode3C14.text
ltx/en_us_public/tr.d014:trMA.Ode3C1H.greekmelody	@ltx/en_us_dedes/tr.d014:trMA.Ode3C1H.greekmelody
ltx/en_us_public/tr.d014:trMA.Ode3C1H.incipit	@ltx/en_us_dedes/tr.d014:trMA.Ode3C1H.incipit
ltx/en_us_public/tr.d014:trMA.Ode3C1H.melody	@ltx/en_us_dedes/tr.d014:trMA.Ode3C1H.melody
ltx/en_us_public/tr.d014:trMA.Ode3C1H.mode	@ltx/en_us_dedes/tr.d014:trMA.Ode3C1H.mode
ltx/en_us_public/tr.d014:trMA.Ode3C1H.ode	@ltx/en_us_dedes/tr.d014:trMA.Ode3C1H.ode
ltx/en_us_public/tr.d014:trMA.Ode3C1H.text	@ltx/en_us_dedes/tr.d014:trMA.Ode3C1H.text
ltx/en_us_public/tr.d014:trMA.Ode3C1T.incipit	@ltx/en_us_dedes/tr.d014:trMA.Ode3C1T.incipit
ltx/en_us_public/tr.d014:trMA.Ode3C1T.melody	@ltx/en_us_dedes/tr.d014:trMA.Ode3C1T.melody
ltx/en_us_public/tr.d014:trMA.Ode3C1T.mode	@ltx/en_us_dedes/tr.d014:trMA.Ode3C1T.mode
ltx/en_us_public/tr.d014:trMA.Ode3C1T.ode	@ltx/en_us_dedes/tr.d014:trMA.Ode3C1T.ode
ltx/en_us_public/tr.d014:trMA.Ode3C1T.text	@ltx/en_us_dedes/tr.d014:trMA.Ode3C1T.text
ltx/en_us_public/tr.d014:trMA.Ode3C1Tr.incipit	@ltx/en_us_dedes/tr.d014:trMA.Ode3C1Tr.incipit
ltx/en_us_public/tr.d014:trMA.Ode3C1Tr.melody	@ltx/en_us_dedes/tr.d014:trMA.Ode3C1Tr.melody
ltx/en_us_public/tr.d014:trMA.Ode3C1Tr.mode	@ltx/en_us_dedes/tr.d014:trMA.Ode3C1Tr.mode
ltx/en_us_public/tr.d014:trMA.Ode3C1Tr.ode	@ltx/en_us_dedes/tr.d014:trMA.Ode3C1Tr.ode
ltx/en_us_public/tr.d014:trMA.Ode3C1Tr.text	@ltx/en_us_dedes/tr.d014:trMA.Ode3C1Tr.text
ltx/en_us_public/tr.d014:trMA.Ode3K.incipit	@ltx/en_us_dedes/tr.d014:trMA.Ode3K.incipit
ltx/en_us_public/tr.d014:trMA.Ode3K.melody	@ltx/en_us_dedes/tr.d014:trMA.Ode3K.melody
ltx/en_us_public/tr.d014:trMA.Ode3K.mode	@ltx/en_us_dedes/tr.d014:trMA.Ode3K.mode
ltx/en_us_public/tr.d014:trMA.Ode3K.ode	@ltx/en_us_dedes/tr.d014:trMA.Ode3K.ode
ltx/en_us_public/tr.d014:trMA.Ode3K.text	@ltx/en_us_dedes/tr.d014:trMA.Ode3K.text
ltx/en_us_public/tr.d014:trMA.Ode3Kathisma1.greekmelody	@ltx/en_us_dedes/tr.d014:trMA.Ode3Kathisma1.greekmelody
ltx/en_us_public/tr.d014:trMA.Ode3Kathisma1.incipit	@ltx/en_us_dedes/tr.d014:trMA.Ode3Kathisma1.incipit
ltx/en_us_public/tr.d014:trMA.Ode3Kathisma1.melody	@ltx/en_us_dedes/tr.d014:trMA.Ode3Kathisma1.melody
ltx/en_us_public/tr.d014:trMA.Ode3Kathisma1.mode	@ltx/en_us_dedes/tr.d014:trMA.Ode3Kathisma1.mode
ltx/en_us_public/tr.d014:trMA.Ode3Kathisma1.text	@ltx/en_us_dedes/tr.d014:trMA.Ode3Kathisma1.text
ltx/en_us_public/tr.d014:trMA.Ode3Kathisma2.greekmelody	@ltx/en_us_dedes/tr.d014:trMA.Ode3Kathisma2.greekmelody
ltx/en_us_public/tr.d014:trMA.Ode3Kathisma2.incipit	@ltx/en_us_dedes/tr.d014:trMA.Ode3Kathisma2.incipit
ltx/en_us_public/tr.d014:trMA.Ode3Kathisma2.melody	@ltx/en_us_dedes/tr.d014:trMA.Ode3Kathisma2.melody
ltx/en_us_public/tr.d014:trMA.Ode3Kathisma2.mode	@ltx/en_us_dedes/tr.d014:trMA.Ode3Kathisma2.mode
ltx/en_us_public/tr.d014:trMA.Ode3Kathisma2.text	@ltx/en_us_dedes/tr.d014:trMA.Ode3Kathisma2.text
ltx/en_us_public/tr.d014:trMA.Ode4C11.greekmelody	@ltx/en_us_dedes/tr.d014:trMA.Ode4C11.greekmelody
ltx/en_us_public/tr.d014:trMA.Ode4C11.incipit	@ltx/en_us_dedes/tr.d014:trMA.Ode4C11.incipit
ltx/en_us_public/tr.d014:trMA.Ode4C11.melody	@ltx/en_us_dedes/tr.d014:trMA.Ode4C11.melody
ltx/en_us_public/tr.d014:trMA.Ode4C11.mode	@ltx/en_us_dedes/tr.d014:trMA.Ode4C11.mode
ltx/en_us_public/tr.d014:trMA.Ode4C11.ode	@ltx/en_us_dedes/tr.d014:trMA.Ode4C11.ode
ltx/en_us_public/tr.d014:trMA.Ode4C11.text	@ltx/en_us_dedes/tr.d014:trMA.Ode4C11.text
ltx/en_us_public/tr.d014:trMA.Ode4C12.incipit	@ltx/en_us_dedes/tr.d014:trMA.Ode4C12.incipit
ltx/en_us_public/tr.d014:trMA.Ode4C12.melody	@ltx/en_us_dedes/tr.d014:trMA.Ode4C12.melody
ltx/en_us_public/tr.d014:trMA.Ode4C12.mode	@ltx/en_us_dedes/tr.d014:trMA.Ode4C12.mode
ltx/en_us_public/tr.d014:trMA.Ode4C12.ode	@ltx/en_us_dedes/tr.d014:trMA.Ode4C12.ode
ltx/en_us_public/tr.d014:trMA.Ode4C12.text	@ltx/en_us_dedes/tr.d014:trMA.Ode4C12.text
ltx/en_us_public/tr.d014:trMA.Ode4C13.incipit	@ltx/en_us_dedes/tr.d014:trMA.Ode4C13.incipit
ltx/en_us_public/tr.d014:trMA.Ode4C13.melody	@ltx/en_us_dedes/tr.d014:trMA.Ode4C13.melody
ltx/en_us_public/tr.d014:trMA.Ode4C13.mode	@ltx/en_us_dedes/tr.d014:trMA.Ode4C13.mode
ltx/en_us_public/tr.d014:trMA.Ode4C13.ode	@ltx/en_us_dedes/tr.d014:trMA.Ode4C13.ode
ltx/en_us_public/tr.d014:trMA.Ode4C13.text	@ltx/en_us_dedes/tr.d014:trMA.Ode4C13.text
ltx/en_us_public/tr.d014:trMA.Ode4C14.incipit	@ltx/en_us_dedes/tr.d014:trMA.Ode4C14.incipit
ltx/en_us_public/tr.d014:trMA.Ode4C14.melody	@ltx/en_us_dedes/tr.d014:trMA.Ode4C14.melody
ltx/en_us_public/tr.d014:trMA.Ode4C14.mode	@ltx/en_us_dedes/tr.d014:trMA.Ode4C14.mode
ltx/en_us_public/tr.d014:trMA.Ode4C14.ode	@ltx/en_us_dedes/tr.d014:trMA.Ode4C14.ode
ltx/en_us_public/tr.d014:trMA.Ode4C14.text	@ltx/en_us_dedes/tr.d014:trMA.Ode4C14.text
ltx/en_us_public/tr.d014:trMA.Ode4C1H.greekmelody	@ltx/en_us_dedes/tr.d014:trMA.Ode4C1H.greekmelody
ltx/en_us_public/tr.d014:trMA.Ode4C1H.incipit	@ltx/en_us_dedes/tr.d014:trMA.Ode4C1H.incipit
ltx/en_us_public/tr.d014:trMA.Ode4C1H.melody	@ltx/en_us_dedes/tr.d014:trMA.Ode4C1H.melody
ltx/en_us_public/tr.d014:trMA.Ode4C1H.mode	@ltx/en_us_dedes/tr.d014:trMA.Ode4C1H.mode
ltx/en_us_public/tr.d014:trMA.Ode4C1H.ode	@ltx/en_us_dedes/tr.d014:trMA.Ode4C1H.ode
ltx/en_us_public/tr.d014:trMA.Ode4C1H.text	@ltx/en_us_dedes/tr.d014:trMA.Ode4C1H.text
ltx/en_us_public/tr.d014:trMA.Ode4C1T.incipit	@ltx/en_us_dedes/tr.d014:trMA.Ode4C1T.incipit
ltx/en_us_public/tr.d014:trMA.Ode4C1T.melody	@ltx/en_us_dedes/tr.d014:trMA.Ode4C1T.melody
ltx/en_us_public/tr.d014:trMA.Ode4C1T.mode	@ltx/en_us_dedes/tr.d014:trMA.Ode4C1T.mode
ltx/en_us_public/tr.d014:trMA.Ode4C1T.ode	@ltx/en_us_dedes/tr.d014:trMA.Ode4C1T.ode
ltx/en_us_public/tr.d014:trMA.Ode4C1T.text	@ltx/en_us_dedes/tr.d014:trMA.Ode4C1T.text
ltx/en_us_public/tr.d014:trMA.Ode4C1Tr.incipit	@ltx/en_us_dedes/tr.d014:trMA.Ode4C1Tr.incipit
ltx/en_us_public/tr.d014:trMA.Ode4C1Tr.melody	@ltx/en_us_dedes/tr.d014:trMA.Ode4C1Tr.melody
ltx/en_us_public/tr.d014:trMA.Ode4C1Tr.mode	@ltx/en_us_dedes/tr.d014:trMA.Ode4C1Tr.mode
ltx/en_us_public/tr.d014:trMA.Ode4C1Tr.ode	@ltx/en_us_dedes/tr.d014:trMA.Ode4C1Tr.ode
ltx/en_us_public/tr.d014:trMA.Ode4C1Tr.text	@ltx/en_us_dedes/tr.d014:trMA.Ode4C1Tr.text
ltx/en_us_public/tr.d014:trMA.Ode4K.incipit	@ltx/en_us_dedes/tr.d014:trMA.Ode4K.incipit
ltx/en_us_public/tr.d014:trMA.Ode4K.melody	@ltx/en_us_dedes/tr.d014:trMA.Ode4K.melody
ltx/en_us_public/tr.d014:trMA.Ode4K.mode	@ltx/en_us_dedes/tr.d014:trMA.Ode4K.mode
ltx/en_us_public/tr.d014:trMA.Ode4K.ode	@ltx/en_us_dedes/tr.d014:trMA.Ode4K.ode
ltx/en_us_public/tr.d014:trMA.Ode4K.text	@ltx/en_us_dedes/tr.d014:trMA.Ode4K.text
ltx/en_us_public/tr.d014:trMA.Ode5C11.greekmelody	@ltx/en_us_dedes/tr.d014:trMA.Ode5C11.greekmelody
ltx/en_us_public/tr.d014:trMA.Ode5C11.incipit	@ltx/en_us_dedes/tr.d014:trMA.Ode5C11.incipit
ltx/en_us_public/tr.d014:trMA.Ode5C11.melody	@ltx/en_us_dedes/tr.d014:trMA.Ode5C11.melody
ltx/en_us_public/tr.d014:trMA.Ode5C11.mode	@ltx/en_us_dedes/tr.d014:trMA.Ode5C11.mode
ltx/en_us_public/tr.d014:trMA.Ode5C11.ode	@ltx/en_us_dedes/tr.d014:trMA.Ode5C11.ode
ltx/en_us_public/tr.d014:trMA.Ode5C11.text	@ltx/en_us_dedes/tr.d014:trMA.Ode5C11.text
ltx/en_us_public/tr.d014:trMA.Ode5C12.incipit	@ltx/en_us_dedes/tr.d014:trMA.Ode5C12.incipit
ltx/en_us_public/tr.d014:trMA.Ode5C12.melody	@ltx/en_us_dedes/tr.d014:trMA.Ode5C12.melody
ltx/en_us_public/tr.d014:trMA.Ode5C12.mode	@ltx/en_us_dedes/tr.d014:trMA.Ode5C12.mode
ltx/en_us_public/tr.d014:trMA.Ode5C12.ode	@ltx/en_us_dedes/tr.d014:trMA.Ode5C12.ode
ltx/en_us_public/tr.d014:trMA.Ode5C12.text	@ltx/en_us_dedes/tr.d014:trMA.Ode5C12.text
ltx/en_us_public/tr.d014:trMA.Ode5C13.incipit	@ltx/en_us_dedes/tr.d014:trMA.Ode5C13.incipit
ltx/en_us_public/tr.d014:trMA.Ode5C13.melody	@ltx/en_us_dedes/tr.d014:trMA.Ode5C13.melody
ltx/en_us_public/tr.d014:trMA.Ode5C13.mode	@ltx/en_us_dedes/tr.d014:trMA.Ode5C13.mode
ltx/en_us_public/tr.d014:trMA.Ode5C13.ode	@ltx/en_us_dedes/tr.d014:trMA.Ode5C13.ode
ltx/en_us_public/tr.d014:trMA.Ode5C13.text	@ltx/en_us_dedes/tr.d014:trMA.Ode5C13.text
ltx/en_us_public/tr.d014:trMA.Ode5C14.incipit	@ltx/en_us_dedes/tr.d014:trMA.Ode5C14.incipit
ltx/en_us_public/tr.d014:trMA.Ode5C14.melody	@ltx/en_us_dedes/tr.d014:trMA.Ode5C14.melody
ltx/en_us_public/tr.d014:trMA.Ode5C14.mode	@ltx/en_us_dedes/tr.d014:trMA.Ode5C14.mode
ltx/en_us_public/tr.d014:trMA.Ode5C14.ode	@ltx/en_us_dedes/tr.d014:trMA.Ode5C14.ode
ltx/en_us_public/tr.d014:trMA.Ode5C14.text	@ltx/en_us_dedes/tr.d014:trMA.Ode5C14.text
ltx/en_us_public/tr.d014:trMA.Ode5C1H.greekmelody	@ltx/en_us_dedes/tr.d014:trMA.Ode5C1H.greekmelody
ltx/en_us_public/tr.d014:trMA.Ode5C1H.incipit	@ltx/en_us_dedes/tr.d014:trMA.Ode5C1H.incipit
ltx/en_us_public/tr.d014:trMA.Ode5C1H.melody	@ltx/en_us_dedes/tr.d014:trMA.Ode5C1H.melody
ltx/en_us_public/tr.d014:trMA.Ode5C1H.mode	@ltx/en_us_dedes/tr.d014:trMA.Ode5C1H.mode
ltx/en_us_public/tr.d014:trMA.Ode5C1H.ode	@ltx/en_us_dedes/tr.d014:trMA.Ode5C1H.ode
ltx/en_us_public/tr.d014:trMA.Ode5C1H.text	@ltx/en_us_dedes/tr.d014:trMA.Ode5C1H.text
ltx/en_us_public/tr.d014:trMA.Ode5C1T.incipit	@ltx/en_us_dedes/tr.d014:trMA.Ode5C1T.incipit
ltx/en_us_public/tr.d014:trMA.Ode5C1T.melody	@ltx/en_us_dedes/tr.d014:trMA.Ode5C1T.melody
ltx/en_us_public/tr.d014:trMA.Ode5C1T.mode	@ltx/en_us_dedes/tr.d014:trMA.Ode5C1T.mode
ltx/en_us_public/tr.d014:trMA.Ode5C1T.ode	@ltx/en_us_dedes/tr.d014:trMA.Ode5C1T.ode
ltx/en_us_public/tr.d014:trMA.Ode5C1T.text	@ltx/en_us_dedes/tr.d014:trMA.Ode5C1T.text
ltx/en_us_public/tr.d014:trMA.Ode5C1Tr.incipit	@ltx/en_us_dedes/tr.d014:trMA.Ode5C1Tr.incipit
ltx/en_us_public/tr.d014:trMA.Ode5C1Tr.melody	@ltx/en_us_dedes/tr.d014:trMA.Ode5C1Tr.melody
ltx/en_us_public/tr.d014:trMA.Ode5C1Tr.mode	@ltx/en_us_dedes/tr.d014:trMA.Ode5C1Tr.mode
ltx/en_us_public/tr.d014:trMA.Ode5C1Tr.ode	@ltx/en_us_dedes/tr.d014:trMA.Ode5C1Tr.ode
ltx/en_us_public/tr.d014:trMA.Ode5C1Tr.text	@ltx/en_us_dedes/tr.d014:trMA.Ode5C1Tr.text
ltx/en_us_public/tr.d014:trMA.Ode5K.incipit	@ltx/en_us_dedes/tr.d014:trMA.Ode5K.incipit
ltx/en_us_public/tr.d014:trMA.Ode5K.melody	@ltx/en_us_dedes/tr.d014:trMA.Ode5K.melody
ltx/en_us_public/tr.d014:trMA.Ode5K.mode	@ltx/en_us_dedes/tr.d014:trMA.Ode5K.mode
ltx/en_us_public/tr.d014:trMA.Ode5K.ode	@ltx/en_us_dedes/tr.d014:trMA.Ode5K.ode
ltx/en_us_public/tr.d014:trMA.Ode5K.text	@ltx/en_us_dedes/tr.d014:trMA.Ode5K.text
ltx/en_us_public/tr.d014:trMA.Ode6C11.greekmelody	@ltx/en_us_dedes/tr.d014:trMA.Ode6C11.greekmelody
ltx/en_us_public/tr.d014:trMA.Ode6C11.incipit	@ltx/en_us_dedes/tr.d014:trMA.Ode6C11.incipit
ltx/en_us_public/tr.d014:trMA.Ode6C11.melody	@ltx/en_us_dedes/tr.d014:trMA.Ode6C11.melody
ltx/en_us_public/tr.d014:trMA.Ode6C11.mode	@ltx/en_us_dedes/tr.d014:trMA.Ode6C11.mode
ltx/en_us_public/tr.d014:trMA.Ode6C11.ode	@ltx/en_us_dedes/tr.d014:trMA.Ode6C11.ode
ltx/en_us_public/tr.d014:trMA.Ode6C11.text	@ltx/en_us_dedes/tr.d014:trMA.Ode6C11.text
ltx/en_us_public/tr.d014:trMA.Ode6C12.incipit	@ltx/en_us_dedes/tr.d014:trMA.Ode6C12.incipit
ltx/en_us_public/tr.d014:trMA.Ode6C12.melody	@ltx/en_us_dedes/tr.d014:trMA.Ode6C12.melody
ltx/en_us_public/tr.d014:trMA.Ode6C12.mode	@ltx/en_us_dedes/tr.d014:trMA.Ode6C12.mode
ltx/en_us_public/tr.d014:trMA.Ode6C12.ode	@ltx/en_us_dedes/tr.d014:trMA.Ode6C12.ode
ltx/en_us_public/tr.d014:trMA.Ode6C12.text	@ltx/en_us_dedes/tr.d014:trMA.Ode6C12.text
ltx/en_us_public/tr.d014:trMA.Ode6C13.incipit	@ltx/en_us_dedes/tr.d014:trMA.Ode6C13.incipit
ltx/en_us_public/tr.d014:trMA.Ode6C13.melody	@ltx/en_us_dedes/tr.d014:trMA.Ode6C13.melody
ltx/en_us_public/tr.d014:trMA.Ode6C13.mode	@ltx/en_us_dedes/tr.d014:trMA.Ode6C13.mode
ltx/en_us_public/tr.d014:trMA.Ode6C13.ode	@ltx/en_us_dedes/tr.d014:trMA.Ode6C13.ode
ltx/en_us_public/tr.d014:trMA.Ode6C13.text	@ltx/en_us_dedes/tr.d014:trMA.Ode6C13.text
ltx/en_us_public/tr.d014:trMA.Ode6C14.incipit	@ltx/en_us_dedes/tr.d014:trMA.Ode6C14.incipit
ltx/en_us_public/tr.d014:trMA.Ode6C14.melody	@ltx/en_us_dedes/tr.d014:trMA.Ode6C14.melody
ltx/en_us_public/tr.d014:trMA.Ode6C14.mode	@ltx/en_us_dedes/tr.d014:trMA.Ode6C14.mode
ltx/en_us_public/tr.d014:trMA.Ode6C14.ode	@ltx/en_us_dedes/tr.d014:trMA.Ode6C14.ode
ltx/en_us_public/tr.d014:trMA.Ode6C14.text	@ltx/en_us_dedes/tr.d014:trMA.Ode6C14.text
ltx/en_us_public/tr.d014:trMA.Ode6C15.incipit	@ltx/en_us_dedes/tr.d014:trMA.Ode6C15.incipit
ltx/en_us_public/tr.d014:trMA.Ode6C15.melody	@ltx/en_us_dedes/tr.d014:trMA.Ode6C15.melody
ltx/en_us_public/tr.d014:trMA.Ode6C15.mode	@ltx/en_us_dedes/tr.d014:trMA.Ode6C15.mode
ltx/en_us_public/tr.d014:trMA.Ode6C15.ode	@ltx/en_us_dedes/tr.d014:trMA.Ode6C15.ode
ltx/en_us_public/tr.d014:trMA.Ode6C15.text	@ltx/en_us_dedes/tr.d014:trMA.Ode6C15.text
ltx/en_us_public/tr.d014:trMA.Ode6C1H.greekmelody	@ltx/en_us_dedes/tr.d014:trMA.Ode6C1H.greekmelody
ltx/en_us_public/tr.d014:trMA.Ode6C1H.incipit	@ltx/en_us_dedes/tr.d014:trMA.Ode6C1H.incipit
ltx/en_us_public/tr.d014:trMA.Ode6C1H.melody	@ltx/en_us_dedes/tr.d014:trMA.Ode6C1H.melody
ltx/en_us_public/tr.d014:trMA.Ode6C1H.mode	@ltx/en_us_dedes/tr.d014:trMA.Ode6C1H.mode
ltx/en_us_public/tr.d014:trMA.Ode6C1H.ode	@ltx/en_us_dedes/tr.d014:trMA.Ode6C1H.ode
ltx/en_us_public/tr.d014:trMA.Ode6C1H.text	@ltx/en_us_dedes/tr.d014:trMA.Ode6C1H.text
ltx/en_us_public/tr.d014:trMA.Ode6C1T.incipit	@ltx/en_us_dedes/tr.d014:trMA.Ode6C1T.incipit
ltx/en_us_public/tr.d014:trMA.Ode6C1T.melody	@ltx/en_us_dedes/tr.d014:trMA.Ode6C1T.melody
ltx/en_us_public/tr.d014:trMA.Ode6C1T.mode	@ltx/en_us_dedes/tr.d014:trMA.Ode6C1T.mode
ltx/en_us_public/tr.d014:trMA.Ode6C1T.ode	@ltx/en_us_dedes/tr.d014:trMA.Ode6C1T.ode
ltx/en_us_public/tr.d014:trMA.Ode6C1T.text	@ltx/en_us_dedes/tr.d014:trMA.Ode6C1T.text
ltx/en_us_public/tr.d014:trMA.Ode6C1Tr.incipit	@ltx/en_us_dedes/tr.d014:trMA.Ode6C1Tr.incipit
ltx/en_us_public/tr.d014:trMA.Ode6C1Tr.melody	@ltx/en_us_dedes/tr.d014:trMA.Ode6C1Tr.melody
ltx/en_us_public/tr.d014:trMA.Ode6C1Tr.mode	@ltx/en_us_dedes/tr.d014:trMA.Ode6C1Tr.mode
ltx/en_us_public/tr.d014:trMA.Ode6C1Tr.ode	@ltx/en_us_dedes/tr.d014:trMA.Ode6C1Tr.ode
ltx/en_us_public/tr.d014:trMA.Ode6C1Tr.text	@ltx/en_us_dedes/tr.d014:trMA.Ode6C1Tr.text
ltx/en_us_public/tr.d014:trMA.Ode6K.incipit	@ltx/en_us_dedes/tr.d014:trMA.Ode6K.incipit
ltx/en_us_public/tr.d014:trMA.Ode6K.melody	@ltx/en_us_dedes/tr.d014:trMA.Ode6K.melody
ltx/en_us_public/tr.d014:trMA.Ode6K.mode	@ltx/en_us_dedes/tr.d014:trMA.Ode6K.mode
ltx/en_us_public/tr.d014:trMA.Ode6K.ode	@ltx/en_us_dedes/tr.d014:trMA.Ode6K.ode
ltx/en_us_public/tr.d014:trMA.Ode6K.text	@ltx/en_us_dedes/tr.d014:trMA.Ode6K.text
ltx/en_us_public/tr.d014:trMA.Ode7C11.greekmelody	@ltx/en_us_dedes/tr.d014:trMA.Ode7C11.greekmelody
ltx/en_us_public/tr.d014:trMA.Ode7C11.incipit	@ltx/en_us_dedes/tr.d014:trMA.Ode7C11.incipit
ltx/en_us_public/tr.d014:trMA.Ode7C11.melody	@ltx/en_us_dedes/tr.d014:trMA.Ode7C11.melody
ltx/en_us_public/tr.d014:trMA.Ode7C11.mode	@ltx/en_us_dedes/tr.d014:trMA.Ode7C11.mode
ltx/en_us_public/tr.d014:trMA.Ode7C11.ode	@ltx/en_us_dedes/tr.d014:trMA.Ode7C11.ode
ltx/en_us_public/tr.d014:trMA.Ode7C11.text	@ltx/en_us_dedes/tr.d014:trMA.Ode7C11.text
ltx/en_us_public/tr.d014:trMA.Ode7C12.incipit	@ltx/en_us_dedes/tr.d014:trMA.Ode7C12.incipit
ltx/en_us_public/tr.d014:trMA.Ode7C12.melody	@ltx/en_us_dedes/tr.d014:trMA.Ode7C12.melody
ltx/en_us_public/tr.d014:trMA.Ode7C12.mode	@ltx/en_us_dedes/tr.d014:trMA.Ode7C12.mode
ltx/en_us_public/tr.d014:trMA.Ode7C12.ode	@ltx/en_us_dedes/tr.d014:trMA.Ode7C12.ode
ltx/en_us_public/tr.d014:trMA.Ode7C12.text	@ltx/en_us_dedes/tr.d014:trMA.Ode7C12.text
ltx/en_us_public/tr.d014:trMA.Ode7C13.incipit	@ltx/en_us_dedes/tr.d014:trMA.Ode7C13.incipit
ltx/en_us_public/tr.d014:trMA.Ode7C13.melody	@ltx/en_us_dedes/tr.d014:trMA.Ode7C13.melody
ltx/en_us_public/tr.d014:trMA.Ode7C13.mode	@ltx/en_us_dedes/tr.d014:trMA.Ode7C13.mode
ltx/en_us_public/tr.d014:trMA.Ode7C13.ode	@ltx/en_us_dedes/tr.d014:trMA.Ode7C13.ode
ltx/en_us_public/tr.d014:trMA.Ode7C13.text	@ltx/en_us_dedes/tr.d014:trMA.Ode7C13.text
ltx/en_us_public/tr.d014:trMA.Ode7C14.incipit	@ltx/en_us_dedes/tr.d014:trMA.Ode7C14.incipit
ltx/en_us_public/tr.d014:trMA.Ode7C14.melody	@ltx/en_us_dedes/tr.d014:trMA.Ode7C14.melody
ltx/en_us_public/tr.d014:trMA.Ode7C14.mode	@ltx/en_us_dedes/tr.d014:trMA.Ode7C14.mode
ltx/en_us_public/tr.d014:trMA.Ode7C14.ode	@ltx/en_us_dedes/tr.d014:trMA.Ode7C14.ode
ltx/en_us_public/tr.d014:trMA.Ode7C14.text	@ltx/en_us_dedes/tr.d014:trMA.Ode7C14.text
ltx/en_us_public/tr.d014:trMA.Ode7C15.incipit	@ltx/en_us_dedes/tr.d014:trMA.Ode7C15.incipit
ltx/en_us_public/tr.d014:trMA.Ode7C15.melody	@ltx/en_us_dedes/tr.d014:trMA.Ode7C15.melody
ltx/en_us_public/tr.d014:trMA.Ode7C15.mode	@ltx/en_us_dedes/tr.d014:trMA.Ode7C15.mode
ltx/en_us_public/tr.d014:trMA.Ode7C15.ode	@ltx/en_us_dedes/tr.d014:trMA.Ode7C15.ode
ltx/en_us_public/tr.d014:trMA.Ode7C15.text	@ltx/en_us_dedes/tr.d014:trMA.Ode7C15.text
ltx/en_us_public/tr.d014:trMA.Ode7C1H.greekmelody	@ltx/en_us_dedes/tr.d014:trMA.Ode7C1H.greekmelody
ltx/en_us_public/tr.d014:trMA.Ode7C1H.incipit	@ltx/en_us_dedes/tr.d014:trMA.Ode7C1H.incipit
ltx/en_us_public/tr.d014:trMA.Ode7C1H.melody	@ltx/en_us_dedes/tr.d014:trMA.Ode7C1H.melody
ltx/en_us_public/tr.d014:trMA.Ode7C1H.mode	@ltx/en_us_dedes/tr.d014:trMA.Ode7C1H.mode
ltx/en_us_public/tr.d014:trMA.Ode7C1H.ode	@ltx/en_us_dedes/tr.d014:trMA.Ode7C1H.ode
ltx/en_us_public/tr.d014:trMA.Ode7C1H.text	@ltx/en_us_dedes/tr.d014:trMA.Ode7C1H.text
ltx/en_us_public/tr.d014:trMA.Ode7C1T.incipit	@ltx/en_us_dedes/tr.d014:trMA.Ode7C1T.incipit
ltx/en_us_public/tr.d014:trMA.Ode7C1T.melody	@ltx/en_us_dedes/tr.d014:trMA.Ode7C1T.melody
ltx/en_us_public/tr.d014:trMA.Ode7C1T.mode	@ltx/en_us_dedes/tr.d014:trMA.Ode7C1T.mode
ltx/en_us_public/tr.d014:trMA.Ode7C1T.ode	@ltx/en_us_dedes/tr.d014:trMA.Ode7C1T.ode
ltx/en_us_public/tr.d014:trMA.Ode7C1T.text	@ltx/en_us_dedes/tr.d014:trMA.Ode7C1T.text
ltx/en_us_public/tr.d014:trMA.Ode7C1Tr.incipit	@ltx/en_us_dedes/tr.d014:trMA.Ode7C1Tr.incipit
ltx/en_us_public/tr.d014:trMA.Ode7C1Tr.melody	@ltx/en_us_dedes/tr.d014:trMA.Ode7C1Tr.melody
ltx/en_us_public/tr.d014:trMA.Ode7C1Tr.mode	@ltx/en_us_dedes/tr.d014:trMA.Ode7C1Tr.mode
ltx/en_us_public/tr.d014:trMA.Ode7C1Tr.ode	@ltx/en_us_dedes/tr.d014:trMA.Ode7C1Tr.ode
ltx/en_us_public/tr.d014:trMA.Ode7C1Tr.text	@ltx/en_us_dedes/tr.d014:trMA.Ode7C1Tr.text
ltx/en_us_public/tr.d014:trMA.Ode7K.incipit	@ltx/en_us_dedes/tr.d014:trMA.Ode7K.incipit
ltx/en_us_public/tr.d014:trMA.Ode7K.melody	@ltx/en_us_dedes/tr.d014:trMA.Ode7K.melody
ltx/en_us_public/tr.d014:trMA.Ode7K.mode	@ltx/en_us_dedes/tr.d014:trMA.Ode7K.mode
ltx/en_us_public/tr.d014:trMA.Ode7K.ode	@ltx/en_us_dedes/tr.d014:trMA.Ode7K.ode
ltx/en_us_public/tr.d014:trMA.Ode7K.text	@ltx/en_us_dedes/tr.d014:trMA.Ode7K.text
ltx/en_us_public/tr.d014:trMA.Ode8C11.greekmelody	@ltx/en_us_dedes/tr.d014:trMA.Ode8C11.greekmelody
ltx/en_us_public/tr.d014:trMA.Ode8C11.incipit	@ltx/en_us_dedes/tr.d014:trMA.Ode8C11.incipit
ltx/en_us_public/tr.d014:trMA.Ode8C11.melody	@ltx/en_us_dedes/tr.d014:trMA.Ode8C11.melody
ltx/en_us_public/tr.d014:trMA.Ode8C11.mode	@ltx/en_us_dedes/tr.d014:trMA.Ode8C11.mode
ltx/en_us_public/tr.d014:trMA.Ode8C11.ode	@ltx/en_us_dedes/tr.d014:trMA.Ode8C11.ode
ltx/en_us_public/tr.d014:trMA.Ode8C11.text	@ltx/en_us_dedes/tr.d014:trMA.Ode8C11.text
ltx/en_us_public/tr.d014:trMA.Ode8C12.incipit	@ltx/en_us_dedes/tr.d014:trMA.Ode8C12.incipit
ltx/en_us_public/tr.d014:trMA.Ode8C12.melody	@ltx/en_us_dedes/tr.d014:trMA.Ode8C12.melody
ltx/en_us_public/tr.d014:trMA.Ode8C12.mode	@ltx/en_us_dedes/tr.d014:trMA.Ode8C12.mode
ltx/en_us_public/tr.d014:trMA.Ode8C12.ode	@ltx/en_us_dedes/tr.d014:trMA.Ode8C12.ode
ltx/en_us_public/tr.d014:trMA.Ode8C12.text	@ltx/en_us_dedes/tr.d014:trMA.Ode8C12.text
ltx/en_us_public/tr.d014:trMA.Ode8C13.incipit	@ltx/en_us_dedes/tr.d014:trMA.Ode8C13.incipit
ltx/en_us_public/tr.d014:trMA.Ode8C13.melody	@ltx/en_us_dedes/tr.d014:trMA.Ode8C13.melody
ltx/en_us_public/tr.d014:trMA.Ode8C13.mode	@ltx/en_us_dedes/tr.d014:trMA.Ode8C13.mode
ltx/en_us_public/tr.d014:trMA.Ode8C13.ode	@ltx/en_us_dedes/tr.d014:trMA.Ode8C13.ode
ltx/en_us_public/tr.d014:trMA.Ode8C13.text	@ltx/en_us_dedes/tr.d014:trMA.Ode8C13.text
ltx/en_us_public/tr.d014:trMA.Ode8C14.incipit	@ltx/en_us_dedes/tr.d014:trMA.Ode8C14.incipit
ltx/en_us_public/tr.d014:trMA.Ode8C14.melody	@ltx/en_us_dedes/tr.d014:trMA.Ode8C14.melody
ltx/en_us_public/tr.d014:trMA.Ode8C14.mode	@ltx/en_us_dedes/tr.d014:trMA.Ode8C14.mode
ltx/en_us_public/tr.d014:trMA.Ode8C14.ode	@ltx/en_us_dedes/tr.d014:trMA.Ode8C14.ode
ltx/en_us_public/tr.d014:trMA.Ode8C14.text	@ltx/en_us_dedes/tr.d014:trMA.Ode8C14.text
ltx/en_us_public/tr.d014:trMA.Ode8C1H.greekmelody	@ltx/en_us_dedes/tr.d014:trMA.Ode8C1H.greekmelody
ltx/en_us_public/tr.d014:trMA.Ode8C1H.incipit	@ltx/en_us_dedes/tr.d014:trMA.Ode8C1H.incipit
ltx/en_us_public/tr.d014:trMA.Ode8C1H.melody	@ltx/en_us_dedes/tr.d014:trMA.Ode8C1H.melody
ltx/en_us_public/tr.d014:trMA.Ode8C1H.mode	@ltx/en_us_dedes/tr.d014:trMA.Ode8C1H.mode
ltx/en_us_public/tr.d014:trMA.Ode8C1H.ode	@ltx/en_us_dedes/tr.d014:trMA.Ode8C1H.ode
ltx/en_us_public/tr.d014:trMA.Ode8C1H.text	@ltx/en_us_dedes/tr.d014:trMA.Ode8C1H.text
ltx/en_us_public/tr.d014:trMA.Ode8C1T.incipit	@ltx/en_us_dedes/tr.d014:trMA.Ode8C1T.incipit
ltx/en_us_public/tr.d014:trMA.Ode8C1T.melody	@ltx/en_us_dedes/tr.d014:trMA.Ode8C1T.melody
ltx/en_us_public/tr.d014:trMA.Ode8C1T.mode	@ltx/en_us_dedes/tr.d014:trMA.Ode8C1T.mode
ltx/en_us_public/tr.d014:trMA.Ode8C1T.ode	@ltx/en_us_dedes/tr.d014:trMA.Ode8C1T.ode
ltx/en_us_public/tr.d014:trMA.Ode8C1T.text	@ltx/en_us_dedes/tr.d014:trMA.Ode8C1T.text
ltx/en_us_public/tr.d014:trMA.Ode8C1Tr.incipit	@ltx/en_us_dedes/tr.d014:trMA.Ode8C1Tr.incipit
ltx/en_us_public/tr.d014:trMA.Ode8C1Tr.melody	@ltx/en_us_dedes/tr.d014:trMA.Ode8C1Tr.melody
ltx/en_us_public/tr.d014:trMA.Ode8C1Tr.mode	@ltx/en_us_dedes/tr.d014:trMA.Ode8C1Tr.mode
ltx/en_us_public/tr.d014:trMA.Ode8C1Tr.ode	@ltx/en_us_dedes/tr.d014:trMA.Ode8C1Tr.ode
ltx/en_us_public/tr.d014:trMA.Ode8C1Tr.text	@ltx/en_us_dedes/tr.d014:trMA.Ode8C1Tr.text
ltx/en_us_public/tr.d014:trMA.Ode8K.incipit	@ltx/en_us_dedes/tr.d014:trMA.Ode8K.incipit
ltx/en_us_public/tr.d014:trMA.Ode8K.melody	@ltx/en_us_dedes/tr.d014:trMA.Ode8K.melody
ltx/en_us_public/tr.d014:trMA.Ode8K.mode	@ltx/en_us_dedes/tr.d014:trMA.Ode8K.mode
ltx/en_us_public/tr.d014:trMA.Ode8K.ode	@ltx/en_us_dedes/tr.d014:trMA.Ode8K.ode
ltx/en_us_public/tr.d014:trMA.Ode8K.text	@ltx/en_us_dedes/tr.d014:trMA.Ode8K.text
ltx/en_us_public/tr.d014:trMA.Ode9C11.incipit	@ltx/en_us_dedes/tr.d014:trMA.Ode9C11.incipit
ltx/en_us_public/tr.d014:trMA.Ode9C11.melody	@ltx/en_us_dedes/tr.d014:trMA.Ode9C11.melody
ltx/en_us_public/tr.d014:trMA.Ode9C11.mode	@ltx/en_us_dedes/tr.d014:trMA.Ode9C11.mode
ltx/en_us_public/tr.d014:trMA.Ode9C11.ode	@ltx/en_us_dedes/tr.d014:trMA.Ode9C11.ode
ltx/en_us_public/tr.d014:trMA.Ode9C11.text	@ltx/en_us_dedes/tr.d014:trMA.Ode9C11.text
ltx/en_us_public/tr.d014:trMA.Ode9C12.incipit	@ltx/en_us_dedes/tr.d014:trMA.Ode9C12.incipit
ltx/en_us_public/tr.d014:trMA.Ode9C12.melody	@ltx/en_us_dedes/tr.d014:trMA.Ode9C12.melody
ltx/en_us_public/tr.d014:trMA.Ode9C12.mode	@ltx/en_us_dedes/tr.d014:trMA.Ode9C12.mode
ltx/en_us_public/tr.d014:trMA.Ode9C12.ode	@ltx/en_us_dedes/tr.d014:trMA.Ode9C12.ode
ltx/en_us_public/tr.d014:trMA.Ode9C12.text	@ltx/en_us_dedes/tr.d014:trMA.Ode9C12.text
ltx/en_us_public/tr.d014:trMA.Ode9C13.incipit	@ltx/en_us_dedes/tr.d014:trMA.Ode9C13.incipit
ltx/en_us_public/tr.d014:trMA.Ode9C13.melody	@ltx/en_us_dedes/tr.d014:trMA.Ode9C13.melody
ltx/en_us_public/tr.d014:trMA.Ode9C13.mode	@ltx/en_us_dedes/tr.d014:trMA.Ode9C13.mode
ltx/en_us_public/tr.d014:trMA.Ode9C13.ode	@ltx/en_us_dedes/tr.d014:trMA.Ode9C13.ode
ltx/en_us_public/tr.d014:trMA.Ode9C13.text	@ltx/en_us_dedes/tr.d014:trMA.Ode9C13.text
ltx/en_us_public/tr.d014:trMA.Ode9C14.incipit	@ltx/en_us_dedes/tr.d014:trMA.Ode9C14.incipit
ltx/en_us_public/tr.d014:trMA.Ode9C14.melody	@ltx/en_us_dedes/tr.d014:trMA.Ode9C14.melody
ltx/en_us_public/tr.d014:trMA.Ode9C14.mode	@ltx/en_us_dedes/tr.d014:trMA.Ode9C14.mode
ltx/en_us_public/tr.d014:trMA.Ode9C14.ode	@ltx/en_us_dedes/tr.d014:trMA.Ode9C14.ode
ltx/en_us_public/tr.d014:trMA.Ode9C14.text	@ltx/en_us_dedes/tr.d014:trMA.Ode9C14.text
ltx/en_us_public/tr.d014:trMA.Ode9C15.incipit	@ltx/en_us_dedes/tr.d014:trMA.Ode9C15.incipit
ltx/en_us_public/tr.d014:trMA.Ode9C15.melody	@ltx/en_us_dedes/tr.d014:trMA.Ode9C15.melody
ltx/en_us_public/tr.d014:trMA.Ode9C15.mode	@ltx/en_us_dedes/tr.d014:trMA.Ode9C15.mode
ltx/en_us_public/tr.d014:trMA.Ode9C15.ode	@ltx/en_us_dedes/tr.d014:trMA.Ode9C15.ode
ltx/en_us_public/tr.d014:trMA.Ode9C15.text	@ltx/en_us_dedes/tr.d014:trMA.Ode9C15.text
ltx/en_us_public/tr.d014:trMA.Ode9C1H.greekmelody	@ltx/en_us_dedes/tr.d014:trMA.Ode9C1H.greekmelody
ltx/en_us_public/tr.d014:trMA.Ode9C1H.incipit	@ltx/en_us_dedes/tr.d014:trMA.Ode9C1H.incipit
ltx/en_us_public/tr.d014:trMA.Ode9C1H.melody	@ltx/en_us_dedes/tr.d014:trMA.Ode9C1H.melody
ltx/en_us_public/tr.d014:trMA.Ode9C1H.mode	@ltx/en_us_dedes/tr.d014:trMA.Ode9C1H.mode
ltx/en_us_public/tr.d014:trMA.Ode9C1H.ode	@ltx/en_us_dedes/tr.d014:trMA.Ode9C1H.ode
ltx/en_us_public/tr.d014:trMA.Ode9C1H.text	@ltx/en_us_dedes/tr.d014:trMA.Ode9C1H.text
ltx/en_us_public/tr.d014:trMA.Ode9C1T.incipit	@ltx/en_us_dedes/tr.d014:trMA.Ode9C1T.incipit
ltx/en_us_public/tr.d014:trMA.Ode9C1T.melody	@ltx/en_us_dedes/tr.d014:trMA.Ode9C1T.melody
ltx/en_us_public/tr.d014:trMA.Ode9C1T.mode	@ltx/en_us_dedes/tr.d014:trMA.Ode9C1T.mode
ltx/en_us_public/tr.d014:trMA.Ode9C1T.ode	@ltx/en_us_dedes/tr.d014:trMA.Ode9C1T.ode
ltx/en_us_public/tr.d014:trMA.Ode9C1T.text	@ltx/en_us_dedes/tr.d014:trMA.Ode9C1T.text
ltx/en_us_public/tr.d014:trMA.Ode9C1Tr.incipit	@ltx/en_us_dedes/tr.d014:trMA.Ode9C1Tr.incipit
ltx/en_us_public/tr.d014:trMA.Ode9C1Tr.melody	@ltx/en_us_dedes/tr.d014:trMA.Ode9C1Tr.melody
ltx/en_us_public/tr.d014:trMA.Ode9C1Tr.mode	@ltx/en_us_dedes/tr.d014:trMA.Ode9C1Tr.mode
ltx/en_us_public/tr.d014:trMA.Ode9C1Tr.ode	@ltx/en_us_dedes/tr.d014:trMA.Ode9C1Tr.ode
ltx/en_us_public/tr.d014:trMA.Ode9C1Tr.text	@ltx/en_us_dedes/tr.d014:trMA.Ode9C1Tr.text
ltx/en_us_public/tr.d014:trMA.Ode9K.incipit	@ltx/en_us_dedes/tr.d014:trMA.Ode9K.incipit
ltx/en_us_public/tr.d014:trMA.Ode9K.melody	@ltx/en_us_dedes/tr.d014:trMA.Ode9K.melody
ltx/en_us_public/tr.d014:trMA.Ode9K.mode	@ltx/en_us_dedes/tr.d014:trMA.Ode9K.mode
ltx/en_us_public/tr.d014:trMA.Ode9K.ode	@ltx/en_us_dedes/tr.d014:trMA.Ode9K.ode
ltx/en_us_public/tr.d014:trMA.Ode9K.text	@ltx/en_us_dedes/tr.d014:trMA.Ode9K.text
ltx/en_us_public/tr.d014:trMA.Oikos1.text	@ltx/en_us_dedes/tr.d014:trMA.Oikos1.text
ltx/en_us_public/tr.d014:trSY.commemoration.couplet1.title	@ltx/en_us_dedes/tr.d014:trSY.commemoration.couplet1.title
ltx/en_us_public/tr.d014:trSY.commemoration.couplet1.verse1	@ltx/en_us_dedes/tr.d014:trSY.commemoration.couplet1.verse1
ltx/en_us_public/tr.d014:trSY.commemoration.couplet1.verse2	@ltx/en_us_dedes/tr.d014:trSY.commemoration.couplet1.verse2
ltx/en_us_public/tr.d014:trSY.commemoration.narration.p01	@ltx/en_us_dedes/tr.d014:trSY.commemoration.narration.p01
ltx/en_us_public/tr.d014:trSY.commemoration.narration.p02	@ltx/en_us_dedes/tr.d014:trSY.commemoration.narration.p02
ltx/en_us_public/tr.d014:trSY.commemoration.narration.p03	@ltx/en_us_dedes/tr.d014:trSY.commemoration.narration.p03
ltx/en_us_public/tr.d014:trSY.commemoration.narration.p04	@ltx/en_us_dedes/tr.d014:trSY.commemoration.narration.p04
ltx/en_us_public/tr.d014:trSY.commemoration.narration.p05	@ltx/en_us_dedes/tr.d014:trSY.commemoration.narration.p05
ltx/en_us_public/tr.d014:trSY.commemoration.narration.p06	@ltx/en_us_dedes/tr.d014:trSY.commemoration.narration.p06
ltx/en_us_public/tr.d014:trSY.commemoration.narration.p07	@ltx/en_us_dedes/tr.d014:trSY.commemoration.narration.p07
ltx/en_us_public/tr.d014:trSY.commemoration.text	@ltx/en_us_dedes/tr.d014:trSY.commemoration.text
ltx/en_us_public/tr.d014:trSY.lastline	@ltx/en_us_dedes/tr.d014:trSY.lastline
ltx/en_us_public/tr.d014:trVE.ApolTheotokion.incipit	@ltx/en_us_dedes/tr.d014:trVE.ApolTheotokion.incipit
ltx/en_us_public/tr.d014:trVE.ApolTheotokion.melody	@ltx/en_us_dedes/tr.d014:trVE.ApolTheotokion.melody
ltx/en_us_public/tr.d014:trVE.ApolTheotokion.mode	@ltx/en_us_dedes/tr.d014:trVE.ApolTheotokion.mode
ltx/en_us_public/tr.d014:trVE.ApolTheotokion.text	@ltx/en_us_dedes/tr.d014:trVE.ApolTheotokion.text
ltx/en_us_public/tr.d014:trVE.Apolytikion1.incipit	@ltx/en_us_dedes/tr.d014:trVE.Apolytikion1.incipit
ltx/en_us_public/tr.d014:trVE.Apolytikion1.melody	@ltx/en_us_dedes/tr.d014:trVE.Apolytikion1.melody
ltx/en_us_public/tr.d014:trVE.Apolytikion1.mode	@ltx/en_us_dedes/tr.d014:trVE.Apolytikion1.mode
ltx/en_us_public/tr.d014:trVE.Apolytikion1.text	@ltx/en_us_dedes/tr.d014:trVE.Apolytikion1.text
ltx/en_us_public/tr.d014:trVE.Apolytikion2.incipit	@ltx/en_us_dedes/tr.d014:trVE.Apolytikion2.incipit
ltx/en_us_public/tr.d014:trVE.Apolytikion2.text	@ltx/en_us_dedes/tr.d014:trVE.Apolytikion2.text
ltx/en_us_public/tr.d014:trVE.AposBoth.incipit	@ltx/en_us_dedes/tr.d014:trVE.AposBoth.incipit
ltx/en_us_public/tr.d014:trVE.AposBoth.melody	@ltx/en_us_dedes/tr.d014:trVE.AposBoth.melody
ltx/en_us_public/tr.d014:trVE.AposBoth.mode	@ltx/en_us_dedes/tr.d014:trVE.AposBoth.mode
ltx/en_us_public/tr.d014:trVE.AposBoth.text	@ltx/en_us_dedes/tr.d014:trVE.AposBoth.text
ltx/en_us_public/tr.d014:trVE.AposGlory.incipit	@ltx/en_us_dedes/tr.d014:trVE.AposGlory.incipit
ltx/en_us_public/tr.d014:trVE.AposGlory.melody	@ltx/en_us_dedes/tr.d014:trVE.AposGlory.melody
ltx/en_us_public/tr.d014:trVE.AposGlory.mode	@ltx/en_us_dedes/tr.d014:trVE.AposGlory.mode
ltx/en_us_public/tr.d014:trVE.AposGlory.text	@ltx/en_us_dedes/tr.d014:trVE.AposGlory.text
ltx/en_us_public/tr.d014:trVE.SticGlory.incipit	@ltx/en_us_dedes/tr.d014:trVE.SticGlory.incipit
ltx/en_us_public/tr.d014:trVE.SticGlory.melody	@ltx/en_us_dedes/tr.d014:trVE.SticGlory.melody
ltx/en_us_public/tr.d014:trVE.SticGlory.mode	@ltx/en_us_dedes/tr.d014:trVE.SticGlory.mode
ltx/en_us_public/tr.d014:trVE.SticGlory.text	@ltx/en_us_dedes/tr.d014:trVE.SticGlory.text
ltx/en_us_public/tr.d014:trVE.Stichera01.incipit	@ltx/en_us_dedes/tr.d014:trVE.Stichera01.incipit
ltx/en_us_public/tr.d014:trVE.Stichera01.melody	@ltx/en_us_dedes/tr.d014:trVE.Stichera01.melody
ltx/en_us_public/tr.d014:trVE.Stichera01.mode	@ltx/en_us_dedes/tr.d014:trVE.Stichera01.mode
ltx/en_us_public/tr.d014:trVE.Stichera01.text	@ltx/en_us_dedes/tr.d014:trVE.Stichera01.text
ltx/en_us_public/tr.d014:trVE.Stichera02.incipit	@ltx/en_us_dedes/tr.d014:trVE.Stichera02.incipit
ltx/en_us_public/tr.d014:trVE.Stichera02.melody	@ltx/en_us_dedes/tr.d014:trVE.Stichera02.melody
ltx/en_us_public/tr.d014:trVE.Stichera02.mode	@ltx/en_us_dedes/tr.d014:trVE.Stichera02.mode
ltx/en_us_public/tr.d014:trVE.Stichera02.text	@ltx/en_us_dedes/tr.d014:trVE.Stichera02.text
ltx/en_us_public/tr.d014:trVE.Stichera03.incipit	@ltx/en_us_dedes/tr.d014:trVE.Stichera03.incipit
ltx/en_us_public/tr.d014:trVE.Stichera03.melody	@ltx/en_us_dedes/tr.d014:trVE.Stichera03.melody
ltx/en_us_public/tr.d014:trVE.Stichera03.mode	@ltx/en_us_dedes/tr.d014:trVE.Stichera03.mode
ltx/en_us_public/tr.d014:trVE.Stichera03.text	@ltx/en_us_dedes/tr.d014:trVE.Stichera03.text
