ltx/en_us_public/le.pr.me.r50:leprVE.reading.book_abbr	@ltx/en_us_saas/le.pr.me.r50:leprVE.reading.book_abbr
ltx/en_us_public/le.pr.me.r50:leprVE.reading.book_string	@ltx/en_us_saas/le.pr.me.r50:leprVE.reading.book_string
ltx/en_us_public/le.pr.me.r50:leprVE.reading.chapverse	@ltx/en_us_saas/le.pr.me.r50:leprVE.reading.chapverse
ltx/en_us_public/le.pr.me.r50:leprVE.reading.incipit	@ltx/en_us_saas/le.pr.me.r50:leprVE.reading.incipit
ltx/en_us_public/le.pr.me.r50:leprVE.reading.text	@ltx/en_us_saas/le.pr.me.r50:leprVE.reading.text
ltx/en_us_public/le.pr.me.r50:leprVE.reading.title	@ltx/en_us_saas/le.pr.me.r50:leprVE.reading.title
ltx/en_us_public/le.pr.me.r50:leprVE.reading.title_abbr	@ltx/en_us_saas/le.pr.me.r50:leprVE.reading.title_abbr
ltx/en_us_public/le.pr.me.r50:leprVE.reading.version	@ltx/en_us_saas/le.pr.me.r50:leprVE.reading.version
