ltx/en_us_public/tr.d029:tr.IconsProcession.title	@ltx/en_us_dedes/tr.d029:tr.IconsProcession.title
ltx/en_us_public/tr.d029:tr.Synodikon.title	@ltx/en_us_dedes/tr.d029:tr.Synodikon.title
ltx/en_us_public/tr.d029:tr.Synodikon1.text	@ltx/en_us_dedes/tr.d029:tr.Synodikon1.text
ltx/en_us_public/tr.d029:tr.Synodikon2.text	@ltx/en_us_dedes/tr.d029:tr.Synodikon2.text
ltx/en_us_public/tr.d029:tr.Synodikon3.text	@ltx/en_us_dedes/tr.d029:tr.Synodikon3.text
ltx/en_us_public/tr.d029:tr.Synodikon4.text	@ltx/en_us_dedes/tr.d029:tr.Synodikon4.text
ltx/en_us_public/tr.d029:tr.Synodikon5.text	@ltx/en_us_dedes/tr.d029:tr.Synodikon5.text
ltx/en_us_public/tr.d029:tr.Synodikon6.text	@ltx/en_us_dedes/tr.d029:tr.Synodikon6.text
ltx/en_us_public/tr.d029:trCA.Ode11.incipit	@ltx/en_us_dedes/tr.d029:trCA.Ode11.incipit
ltx/en_us_public/tr.d029:trCA.Ode11.melody	@ltx/en_us_dedes/tr.d029:trCA.Ode11.melody
ltx/en_us_public/tr.d029:trCA.Ode11.mode	@ltx/en_us_dedes/tr.d029:trCA.Ode11.mode
ltx/en_us_public/tr.d029:trCA.Ode11.ode	@ltx/en_us_dedes/tr.d029:trCA.Ode11.ode
ltx/en_us_public/tr.d029:trCA.Ode11.text	@ltx/en_us_dedes/tr.d029:trCA.Ode11.text
ltx/en_us_public/tr.d029:trCA.Ode12.incipit	@ltx/en_us_dedes/tr.d029:trCA.Ode12.incipit
ltx/en_us_public/tr.d029:trCA.Ode12.melody	@ltx/en_us_dedes/tr.d029:trCA.Ode12.melody
ltx/en_us_public/tr.d029:trCA.Ode12.mode	@ltx/en_us_dedes/tr.d029:trCA.Ode12.mode
ltx/en_us_public/tr.d029:trCA.Ode12.ode	@ltx/en_us_dedes/tr.d029:trCA.Ode12.ode
ltx/en_us_public/tr.d029:trCA.Ode12.text	@ltx/en_us_dedes/tr.d029:trCA.Ode12.text
ltx/en_us_public/tr.d029:trCA.Ode13.incipit	@ltx/en_us_dedes/tr.d029:trCA.Ode13.incipit
ltx/en_us_public/tr.d029:trCA.Ode13.melody	@ltx/en_us_dedes/tr.d029:trCA.Ode13.melody
ltx/en_us_public/tr.d029:trCA.Ode13.mode	@ltx/en_us_dedes/tr.d029:trCA.Ode13.mode
ltx/en_us_public/tr.d029:trCA.Ode13.ode	@ltx/en_us_dedes/tr.d029:trCA.Ode13.ode
ltx/en_us_public/tr.d029:trCA.Ode13.text	@ltx/en_us_dedes/tr.d029:trCA.Ode13.text
ltx/en_us_public/tr.d029:trCA.Ode14.incipit	@ltx/en_us_dedes/tr.d029:trCA.Ode14.incipit
ltx/en_us_public/tr.d029:trCA.Ode14.melody	@ltx/en_us_dedes/tr.d029:trCA.Ode14.melody
ltx/en_us_public/tr.d029:trCA.Ode14.mode	@ltx/en_us_dedes/tr.d029:trCA.Ode14.mode
ltx/en_us_public/tr.d029:trCA.Ode14.ode	@ltx/en_us_dedes/tr.d029:trCA.Ode14.ode
ltx/en_us_public/tr.d029:trCA.Ode14.text	@ltx/en_us_dedes/tr.d029:trCA.Ode14.text
ltx/en_us_public/tr.d029:trCA.Ode15.incipit	@ltx/en_us_dedes/tr.d029:trCA.Ode15.incipit
ltx/en_us_public/tr.d029:trCA.Ode15.melody	@ltx/en_us_dedes/tr.d029:trCA.Ode15.melody
ltx/en_us_public/tr.d029:trCA.Ode15.mode	@ltx/en_us_dedes/tr.d029:trCA.Ode15.mode
ltx/en_us_public/tr.d029:trCA.Ode15.ode	@ltx/en_us_dedes/tr.d029:trCA.Ode15.ode
ltx/en_us_public/tr.d029:trCA.Ode15.text	@ltx/en_us_dedes/tr.d029:trCA.Ode15.text
ltx/en_us_public/tr.d029:trCA.Ode16.incipit	@ltx/en_us_dedes/tr.d029:trCA.Ode16.incipit
ltx/en_us_public/tr.d029:trCA.Ode16.melody	@ltx/en_us_dedes/tr.d029:trCA.Ode16.melody
ltx/en_us_public/tr.d029:trCA.Ode16.mode	@ltx/en_us_dedes/tr.d029:trCA.Ode16.mode
ltx/en_us_public/tr.d029:trCA.Ode16.ode	@ltx/en_us_dedes/tr.d029:trCA.Ode16.ode
ltx/en_us_public/tr.d029:trCA.Ode16.text	@ltx/en_us_dedes/tr.d029:trCA.Ode16.text
ltx/en_us_public/tr.d029:trCA.Ode17.incipit	@ltx/en_us_dedes/tr.d029:trCA.Ode17.incipit
ltx/en_us_public/tr.d029:trCA.Ode17.melody	@ltx/en_us_dedes/tr.d029:trCA.Ode17.melody
ltx/en_us_public/tr.d029:trCA.Ode17.mode	@ltx/en_us_dedes/tr.d029:trCA.Ode17.mode
ltx/en_us_public/tr.d029:trCA.Ode17.ode	@ltx/en_us_dedes/tr.d029:trCA.Ode17.ode
ltx/en_us_public/tr.d029:trCA.Ode17.text	@ltx/en_us_dedes/tr.d029:trCA.Ode17.text
ltx/en_us_public/tr.d029:trCA.Ode1T.incipit	@ltx/en_us_dedes/tr.d029:trCA.Ode1T.incipit
ltx/en_us_public/tr.d029:trCA.Ode1T.melody	@ltx/en_us_dedes/tr.d029:trCA.Ode1T.melody
ltx/en_us_public/tr.d029:trCA.Ode1T.mode	@ltx/en_us_dedes/tr.d029:trCA.Ode1T.mode
ltx/en_us_public/tr.d029:trCA.Ode1T.ode	@ltx/en_us_dedes/tr.d029:trCA.Ode1T.ode
ltx/en_us_public/tr.d029:trCA.Ode1T.text	@ltx/en_us_dedes/tr.d029:trCA.Ode1T.text
ltx/en_us_public/tr.d029:trCA.Ode1Tr.incipit	@ltx/en_us_dedes/tr.d029:trCA.Ode1Tr.incipit
ltx/en_us_public/tr.d029:trCA.Ode1Tr.melody	@ltx/en_us_dedes/tr.d029:trCA.Ode1Tr.melody
ltx/en_us_public/tr.d029:trCA.Ode1Tr.mode	@ltx/en_us_dedes/tr.d029:trCA.Ode1Tr.mode
ltx/en_us_public/tr.d029:trCA.Ode1Tr.ode	@ltx/en_us_dedes/tr.d029:trCA.Ode1Tr.ode
ltx/en_us_public/tr.d029:trCA.Ode1Tr.text	@ltx/en_us_dedes/tr.d029:trCA.Ode1Tr.text
ltx/en_us_public/tr.d029:trCA.Ode31.incipit	@ltx/en_us_dedes/tr.d029:trCA.Ode31.incipit
ltx/en_us_public/tr.d029:trCA.Ode31.melody	@ltx/en_us_dedes/tr.d029:trCA.Ode31.melody
ltx/en_us_public/tr.d029:trCA.Ode31.mode	@ltx/en_us_dedes/tr.d029:trCA.Ode31.mode
ltx/en_us_public/tr.d029:trCA.Ode31.ode	@ltx/en_us_dedes/tr.d029:trCA.Ode31.ode
ltx/en_us_public/tr.d029:trCA.Ode31.text	@ltx/en_us_dedes/tr.d029:trCA.Ode31.text
ltx/en_us_public/tr.d029:trCA.Ode32.incipit	@ltx/en_us_dedes/tr.d029:trCA.Ode32.incipit
ltx/en_us_public/tr.d029:trCA.Ode32.melody	@ltx/en_us_dedes/tr.d029:trCA.Ode32.melody
ltx/en_us_public/tr.d029:trCA.Ode32.mode	@ltx/en_us_dedes/tr.d029:trCA.Ode32.mode
ltx/en_us_public/tr.d029:trCA.Ode32.ode	@ltx/en_us_dedes/tr.d029:trCA.Ode32.ode
ltx/en_us_public/tr.d029:trCA.Ode32.text	@ltx/en_us_dedes/tr.d029:trCA.Ode32.text
ltx/en_us_public/tr.d029:trCA.Ode33.incipit	@ltx/en_us_dedes/tr.d029:trCA.Ode33.incipit
ltx/en_us_public/tr.d029:trCA.Ode33.melody	@ltx/en_us_dedes/tr.d029:trCA.Ode33.melody
ltx/en_us_public/tr.d029:trCA.Ode33.mode	@ltx/en_us_dedes/tr.d029:trCA.Ode33.mode
ltx/en_us_public/tr.d029:trCA.Ode33.ode	@ltx/en_us_dedes/tr.d029:trCA.Ode33.ode
ltx/en_us_public/tr.d029:trCA.Ode33.text	@ltx/en_us_dedes/tr.d029:trCA.Ode33.text
ltx/en_us_public/tr.d029:trCA.Ode34.incipit	@ltx/en_us_dedes/tr.d029:trCA.Ode34.incipit
ltx/en_us_public/tr.d029:trCA.Ode34.melody	@ltx/en_us_dedes/tr.d029:trCA.Ode34.melody
ltx/en_us_public/tr.d029:trCA.Ode34.mode	@ltx/en_us_dedes/tr.d029:trCA.Ode34.mode
ltx/en_us_public/tr.d029:trCA.Ode34.ode	@ltx/en_us_dedes/tr.d029:trCA.Ode34.ode
ltx/en_us_public/tr.d029:trCA.Ode34.text	@ltx/en_us_dedes/tr.d029:trCA.Ode34.text
ltx/en_us_public/tr.d029:trCA.Ode35.incipit	@ltx/en_us_dedes/tr.d029:trCA.Ode35.incipit
ltx/en_us_public/tr.d029:trCA.Ode35.melody	@ltx/en_us_dedes/tr.d029:trCA.Ode35.melody
ltx/en_us_public/tr.d029:trCA.Ode35.mode	@ltx/en_us_dedes/tr.d029:trCA.Ode35.mode
ltx/en_us_public/tr.d029:trCA.Ode35.ode	@ltx/en_us_dedes/tr.d029:trCA.Ode35.ode
ltx/en_us_public/tr.d029:trCA.Ode35.text	@ltx/en_us_dedes/tr.d029:trCA.Ode35.text
ltx/en_us_public/tr.d029:trCA.Ode36.incipit	@ltx/en_us_dedes/tr.d029:trCA.Ode36.incipit
ltx/en_us_public/tr.d029:trCA.Ode36.melody	@ltx/en_us_dedes/tr.d029:trCA.Ode36.melody
ltx/en_us_public/tr.d029:trCA.Ode36.mode	@ltx/en_us_dedes/tr.d029:trCA.Ode36.mode
ltx/en_us_public/tr.d029:trCA.Ode36.ode	@ltx/en_us_dedes/tr.d029:trCA.Ode36.ode
ltx/en_us_public/tr.d029:trCA.Ode36.text	@ltx/en_us_dedes/tr.d029:trCA.Ode36.text
ltx/en_us_public/tr.d029:trCA.Ode37.incipit	@ltx/en_us_dedes/tr.d029:trCA.Ode37.incipit
ltx/en_us_public/tr.d029:trCA.Ode37.melody	@ltx/en_us_dedes/tr.d029:trCA.Ode37.melody
ltx/en_us_public/tr.d029:trCA.Ode37.mode	@ltx/en_us_dedes/tr.d029:trCA.Ode37.mode
ltx/en_us_public/tr.d029:trCA.Ode37.ode	@ltx/en_us_dedes/tr.d029:trCA.Ode37.ode
ltx/en_us_public/tr.d029:trCA.Ode37.text	@ltx/en_us_dedes/tr.d029:trCA.Ode37.text
ltx/en_us_public/tr.d029:trCA.Ode3T.incipit	@ltx/en_us_dedes/tr.d029:trCA.Ode3T.incipit
ltx/en_us_public/tr.d029:trCA.Ode3T.melody	@ltx/en_us_dedes/tr.d029:trCA.Ode3T.melody
ltx/en_us_public/tr.d029:trCA.Ode3T.mode	@ltx/en_us_dedes/tr.d029:trCA.Ode3T.mode
ltx/en_us_public/tr.d029:trCA.Ode3T.ode	@ltx/en_us_dedes/tr.d029:trCA.Ode3T.ode
ltx/en_us_public/tr.d029:trCA.Ode3T.text	@ltx/en_us_dedes/tr.d029:trCA.Ode3T.text
ltx/en_us_public/tr.d029:trCA.Ode3Tr.incipit	@ltx/en_us_dedes/tr.d029:trCA.Ode3Tr.incipit
ltx/en_us_public/tr.d029:trCA.Ode3Tr.melody	@ltx/en_us_dedes/tr.d029:trCA.Ode3Tr.melody
ltx/en_us_public/tr.d029:trCA.Ode3Tr.mode	@ltx/en_us_dedes/tr.d029:trCA.Ode3Tr.mode
ltx/en_us_public/tr.d029:trCA.Ode3Tr.ode	@ltx/en_us_dedes/tr.d029:trCA.Ode3Tr.ode
ltx/en_us_public/tr.d029:trCA.Ode3Tr.text	@ltx/en_us_dedes/tr.d029:trCA.Ode3Tr.text
ltx/en_us_public/tr.d029:trCA.Ode41.incipit	@ltx/en_us_dedes/tr.d029:trCA.Ode41.incipit
ltx/en_us_public/tr.d029:trCA.Ode41.melody	@ltx/en_us_dedes/tr.d029:trCA.Ode41.melody
ltx/en_us_public/tr.d029:trCA.Ode41.mode	@ltx/en_us_dedes/tr.d029:trCA.Ode41.mode
ltx/en_us_public/tr.d029:trCA.Ode41.ode	@ltx/en_us_dedes/tr.d029:trCA.Ode41.ode
ltx/en_us_public/tr.d029:trCA.Ode41.text	@ltx/en_us_dedes/tr.d029:trCA.Ode41.text
ltx/en_us_public/tr.d029:trCA.Ode42.incipit	@ltx/en_us_dedes/tr.d029:trCA.Ode42.incipit
ltx/en_us_public/tr.d029:trCA.Ode42.melody	@ltx/en_us_dedes/tr.d029:trCA.Ode42.melody
ltx/en_us_public/tr.d029:trCA.Ode42.mode	@ltx/en_us_dedes/tr.d029:trCA.Ode42.mode
ltx/en_us_public/tr.d029:trCA.Ode42.ode	@ltx/en_us_dedes/tr.d029:trCA.Ode42.ode
ltx/en_us_public/tr.d029:trCA.Ode42.text	@ltx/en_us_dedes/tr.d029:trCA.Ode42.text
ltx/en_us_public/tr.d029:trCA.Ode43.incipit	@ltx/en_us_dedes/tr.d029:trCA.Ode43.incipit
ltx/en_us_public/tr.d029:trCA.Ode43.melody	@ltx/en_us_dedes/tr.d029:trCA.Ode43.melody
ltx/en_us_public/tr.d029:trCA.Ode43.mode	@ltx/en_us_dedes/tr.d029:trCA.Ode43.mode
ltx/en_us_public/tr.d029:trCA.Ode43.ode	@ltx/en_us_dedes/tr.d029:trCA.Ode43.ode
ltx/en_us_public/tr.d029:trCA.Ode43.text	@ltx/en_us_dedes/tr.d029:trCA.Ode43.text
ltx/en_us_public/tr.d029:trCA.Ode44.incipit	@ltx/en_us_dedes/tr.d029:trCA.Ode44.incipit
ltx/en_us_public/tr.d029:trCA.Ode44.melody	@ltx/en_us_dedes/tr.d029:trCA.Ode44.melody
ltx/en_us_public/tr.d029:trCA.Ode44.mode	@ltx/en_us_dedes/tr.d029:trCA.Ode44.mode
ltx/en_us_public/tr.d029:trCA.Ode44.ode	@ltx/en_us_dedes/tr.d029:trCA.Ode44.ode
ltx/en_us_public/tr.d029:trCA.Ode44.text	@ltx/en_us_dedes/tr.d029:trCA.Ode44.text
ltx/en_us_public/tr.d029:trCA.Ode45.incipit	@ltx/en_us_dedes/tr.d029:trCA.Ode45.incipit
ltx/en_us_public/tr.d029:trCA.Ode45.melody	@ltx/en_us_dedes/tr.d029:trCA.Ode45.melody
ltx/en_us_public/tr.d029:trCA.Ode45.mode	@ltx/en_us_dedes/tr.d029:trCA.Ode45.mode
ltx/en_us_public/tr.d029:trCA.Ode45.ode	@ltx/en_us_dedes/tr.d029:trCA.Ode45.ode
ltx/en_us_public/tr.d029:trCA.Ode45.text	@ltx/en_us_dedes/tr.d029:trCA.Ode45.text
ltx/en_us_public/tr.d029:trCA.Ode46.incipit	@ltx/en_us_dedes/tr.d029:trCA.Ode46.incipit
ltx/en_us_public/tr.d029:trCA.Ode46.melody	@ltx/en_us_dedes/tr.d029:trCA.Ode46.melody
ltx/en_us_public/tr.d029:trCA.Ode46.mode	@ltx/en_us_dedes/tr.d029:trCA.Ode46.mode
ltx/en_us_public/tr.d029:trCA.Ode46.ode	@ltx/en_us_dedes/tr.d029:trCA.Ode46.ode
ltx/en_us_public/tr.d029:trCA.Ode46.text	@ltx/en_us_dedes/tr.d029:trCA.Ode46.text
ltx/en_us_public/tr.d029:trCA.Ode47.incipit	@ltx/en_us_dedes/tr.d029:trCA.Ode47.incipit
ltx/en_us_public/tr.d029:trCA.Ode47.melody	@ltx/en_us_dedes/tr.d029:trCA.Ode47.melody
ltx/en_us_public/tr.d029:trCA.Ode47.mode	@ltx/en_us_dedes/tr.d029:trCA.Ode47.mode
ltx/en_us_public/tr.d029:trCA.Ode47.ode	@ltx/en_us_dedes/tr.d029:trCA.Ode47.ode
ltx/en_us_public/tr.d029:trCA.Ode47.text	@ltx/en_us_dedes/tr.d029:trCA.Ode47.text
ltx/en_us_public/tr.d029:trCA.Ode4T.incipit	@ltx/en_us_dedes/tr.d029:trCA.Ode4T.incipit
ltx/en_us_public/tr.d029:trCA.Ode4T.melody	@ltx/en_us_dedes/tr.d029:trCA.Ode4T.melody
ltx/en_us_public/tr.d029:trCA.Ode4T.mode	@ltx/en_us_dedes/tr.d029:trCA.Ode4T.mode
ltx/en_us_public/tr.d029:trCA.Ode4T.ode	@ltx/en_us_dedes/tr.d029:trCA.Ode4T.ode
ltx/en_us_public/tr.d029:trCA.Ode4T.text	@ltx/en_us_dedes/tr.d029:trCA.Ode4T.text
ltx/en_us_public/tr.d029:trCA.Ode4Tr.incipit	@ltx/en_us_dedes/tr.d029:trCA.Ode4Tr.incipit
ltx/en_us_public/tr.d029:trCA.Ode4Tr.melody	@ltx/en_us_dedes/tr.d029:trCA.Ode4Tr.melody
ltx/en_us_public/tr.d029:trCA.Ode4Tr.mode	@ltx/en_us_dedes/tr.d029:trCA.Ode4Tr.mode
ltx/en_us_public/tr.d029:trCA.Ode4Tr.ode	@ltx/en_us_dedes/tr.d029:trCA.Ode4Tr.ode
ltx/en_us_public/tr.d029:trCA.Ode4Tr.text	@ltx/en_us_dedes/tr.d029:trCA.Ode4Tr.text
ltx/en_us_public/tr.d029:trCA.Ode51.incipit	@ltx/en_us_dedes/tr.d029:trCA.Ode51.incipit
ltx/en_us_public/tr.d029:trCA.Ode51.melody	@ltx/en_us_dedes/tr.d029:trCA.Ode51.melody
ltx/en_us_public/tr.d029:trCA.Ode51.mode	@ltx/en_us_dedes/tr.d029:trCA.Ode51.mode
ltx/en_us_public/tr.d029:trCA.Ode51.ode	@ltx/en_us_dedes/tr.d029:trCA.Ode51.ode
ltx/en_us_public/tr.d029:trCA.Ode51.text	@ltx/en_us_dedes/tr.d029:trCA.Ode51.text
ltx/en_us_public/tr.d029:trCA.Ode52.incipit	@ltx/en_us_dedes/tr.d029:trCA.Ode52.incipit
ltx/en_us_public/tr.d029:trCA.Ode52.melody	@ltx/en_us_dedes/tr.d029:trCA.Ode52.melody
ltx/en_us_public/tr.d029:trCA.Ode52.mode	@ltx/en_us_dedes/tr.d029:trCA.Ode52.mode
ltx/en_us_public/tr.d029:trCA.Ode52.ode	@ltx/en_us_dedes/tr.d029:trCA.Ode52.ode
ltx/en_us_public/tr.d029:trCA.Ode52.text	@ltx/en_us_dedes/tr.d029:trCA.Ode52.text
ltx/en_us_public/tr.d029:trCA.Ode53.incipit	@ltx/en_us_dedes/tr.d029:trCA.Ode53.incipit
ltx/en_us_public/tr.d029:trCA.Ode53.melody	@ltx/en_us_dedes/tr.d029:trCA.Ode53.melody
ltx/en_us_public/tr.d029:trCA.Ode53.mode	@ltx/en_us_dedes/tr.d029:trCA.Ode53.mode
ltx/en_us_public/tr.d029:trCA.Ode53.ode	@ltx/en_us_dedes/tr.d029:trCA.Ode53.ode
ltx/en_us_public/tr.d029:trCA.Ode53.text	@ltx/en_us_dedes/tr.d029:trCA.Ode53.text
ltx/en_us_public/tr.d029:trCA.Ode54.incipit	@ltx/en_us_dedes/tr.d029:trCA.Ode54.incipit
ltx/en_us_public/tr.d029:trCA.Ode54.melody	@ltx/en_us_dedes/tr.d029:trCA.Ode54.melody
ltx/en_us_public/tr.d029:trCA.Ode54.mode	@ltx/en_us_dedes/tr.d029:trCA.Ode54.mode
ltx/en_us_public/tr.d029:trCA.Ode54.ode	@ltx/en_us_dedes/tr.d029:trCA.Ode54.ode
ltx/en_us_public/tr.d029:trCA.Ode54.text	@ltx/en_us_dedes/tr.d029:trCA.Ode54.text
ltx/en_us_public/tr.d029:trCA.Ode55.incipit	@ltx/en_us_dedes/tr.d029:trCA.Ode55.incipit
ltx/en_us_public/tr.d029:trCA.Ode55.melody	@ltx/en_us_dedes/tr.d029:trCA.Ode55.melody
ltx/en_us_public/tr.d029:trCA.Ode55.mode	@ltx/en_us_dedes/tr.d029:trCA.Ode55.mode
ltx/en_us_public/tr.d029:trCA.Ode55.ode	@ltx/en_us_dedes/tr.d029:trCA.Ode55.ode
ltx/en_us_public/tr.d029:trCA.Ode55.text	@ltx/en_us_dedes/tr.d029:trCA.Ode55.text
ltx/en_us_public/tr.d029:trCA.Ode56.incipit	@ltx/en_us_dedes/tr.d029:trCA.Ode56.incipit
ltx/en_us_public/tr.d029:trCA.Ode56.melody	@ltx/en_us_dedes/tr.d029:trCA.Ode56.melody
ltx/en_us_public/tr.d029:trCA.Ode56.mode	@ltx/en_us_dedes/tr.d029:trCA.Ode56.mode
ltx/en_us_public/tr.d029:trCA.Ode56.ode	@ltx/en_us_dedes/tr.d029:trCA.Ode56.ode
ltx/en_us_public/tr.d029:trCA.Ode56.text	@ltx/en_us_dedes/tr.d029:trCA.Ode56.text
ltx/en_us_public/tr.d029:trCA.Ode57.incipit	@ltx/en_us_dedes/tr.d029:trCA.Ode57.incipit
ltx/en_us_public/tr.d029:trCA.Ode57.melody	@ltx/en_us_dedes/tr.d029:trCA.Ode57.melody
ltx/en_us_public/tr.d029:trCA.Ode57.mode	@ltx/en_us_dedes/tr.d029:trCA.Ode57.mode
ltx/en_us_public/tr.d029:trCA.Ode57.ode	@ltx/en_us_dedes/tr.d029:trCA.Ode57.ode
ltx/en_us_public/tr.d029:trCA.Ode57.text	@ltx/en_us_dedes/tr.d029:trCA.Ode57.text
ltx/en_us_public/tr.d029:trCA.Ode5T.incipit	@ltx/en_us_dedes/tr.d029:trCA.Ode5T.incipit
ltx/en_us_public/tr.d029:trCA.Ode5T.melody	@ltx/en_us_dedes/tr.d029:trCA.Ode5T.melody
ltx/en_us_public/tr.d029:trCA.Ode5T.mode	@ltx/en_us_dedes/tr.d029:trCA.Ode5T.mode
ltx/en_us_public/tr.d029:trCA.Ode5T.ode	@ltx/en_us_dedes/tr.d029:trCA.Ode5T.ode
ltx/en_us_public/tr.d029:trCA.Ode5T.text	@ltx/en_us_dedes/tr.d029:trCA.Ode5T.text
ltx/en_us_public/tr.d029:trCA.Ode5Tr.incipit	@ltx/en_us_dedes/tr.d029:trCA.Ode5Tr.incipit
ltx/en_us_public/tr.d029:trCA.Ode5Tr.melody	@ltx/en_us_dedes/tr.d029:trCA.Ode5Tr.melody
ltx/en_us_public/tr.d029:trCA.Ode5Tr.mode	@ltx/en_us_dedes/tr.d029:trCA.Ode5Tr.mode
ltx/en_us_public/tr.d029:trCA.Ode5Tr.ode	@ltx/en_us_dedes/tr.d029:trCA.Ode5Tr.ode
ltx/en_us_public/tr.d029:trCA.Ode5Tr.text	@ltx/en_us_dedes/tr.d029:trCA.Ode5Tr.text
ltx/en_us_public/tr.d029:trCA.Ode61.incipit	@ltx/en_us_dedes/tr.d029:trCA.Ode61.incipit
ltx/en_us_public/tr.d029:trCA.Ode61.melody	@ltx/en_us_dedes/tr.d029:trCA.Ode61.melody
ltx/en_us_public/tr.d029:trCA.Ode61.mode	@ltx/en_us_dedes/tr.d029:trCA.Ode61.mode
ltx/en_us_public/tr.d029:trCA.Ode61.ode	@ltx/en_us_dedes/tr.d029:trCA.Ode61.ode
ltx/en_us_public/tr.d029:trCA.Ode61.text	@ltx/en_us_dedes/tr.d029:trCA.Ode61.text
ltx/en_us_public/tr.d029:trCA.Ode62.incipit	@ltx/en_us_dedes/tr.d029:trCA.Ode62.incipit
ltx/en_us_public/tr.d029:trCA.Ode62.melody	@ltx/en_us_dedes/tr.d029:trCA.Ode62.melody
ltx/en_us_public/tr.d029:trCA.Ode62.mode	@ltx/en_us_dedes/tr.d029:trCA.Ode62.mode
ltx/en_us_public/tr.d029:trCA.Ode62.ode	@ltx/en_us_dedes/tr.d029:trCA.Ode62.ode
ltx/en_us_public/tr.d029:trCA.Ode62.text	@ltx/en_us_dedes/tr.d029:trCA.Ode62.text
ltx/en_us_public/tr.d029:trCA.Ode63.incipit	@ltx/en_us_dedes/tr.d029:trCA.Ode63.incipit
ltx/en_us_public/tr.d029:trCA.Ode63.melody	@ltx/en_us_dedes/tr.d029:trCA.Ode63.melody
ltx/en_us_public/tr.d029:trCA.Ode63.mode	@ltx/en_us_dedes/tr.d029:trCA.Ode63.mode
ltx/en_us_public/tr.d029:trCA.Ode63.ode	@ltx/en_us_dedes/tr.d029:trCA.Ode63.ode
ltx/en_us_public/tr.d029:trCA.Ode63.text	@ltx/en_us_dedes/tr.d029:trCA.Ode63.text
ltx/en_us_public/tr.d029:trCA.Ode64.incipit	@ltx/en_us_dedes/tr.d029:trCA.Ode64.incipit
ltx/en_us_public/tr.d029:trCA.Ode64.melody	@ltx/en_us_dedes/tr.d029:trCA.Ode64.melody
ltx/en_us_public/tr.d029:trCA.Ode64.mode	@ltx/en_us_dedes/tr.d029:trCA.Ode64.mode
ltx/en_us_public/tr.d029:trCA.Ode64.ode	@ltx/en_us_dedes/tr.d029:trCA.Ode64.ode
ltx/en_us_public/tr.d029:trCA.Ode64.text	@ltx/en_us_dedes/tr.d029:trCA.Ode64.text
ltx/en_us_public/tr.d029:trCA.Ode65.incipit	@ltx/en_us_dedes/tr.d029:trCA.Ode65.incipit
ltx/en_us_public/tr.d029:trCA.Ode65.melody	@ltx/en_us_dedes/tr.d029:trCA.Ode65.melody
ltx/en_us_public/tr.d029:trCA.Ode65.mode	@ltx/en_us_dedes/tr.d029:trCA.Ode65.mode
ltx/en_us_public/tr.d029:trCA.Ode65.ode	@ltx/en_us_dedes/tr.d029:trCA.Ode65.ode
ltx/en_us_public/tr.d029:trCA.Ode65.text	@ltx/en_us_dedes/tr.d029:trCA.Ode65.text
ltx/en_us_public/tr.d029:trCA.Ode66.incipit	@ltx/en_us_dedes/tr.d029:trCA.Ode66.incipit
ltx/en_us_public/tr.d029:trCA.Ode66.melody	@ltx/en_us_dedes/tr.d029:trCA.Ode66.melody
ltx/en_us_public/tr.d029:trCA.Ode66.mode	@ltx/en_us_dedes/tr.d029:trCA.Ode66.mode
ltx/en_us_public/tr.d029:trCA.Ode66.ode	@ltx/en_us_dedes/tr.d029:trCA.Ode66.ode
ltx/en_us_public/tr.d029:trCA.Ode66.text	@ltx/en_us_dedes/tr.d029:trCA.Ode66.text
ltx/en_us_public/tr.d029:trCA.Ode67.incipit	@ltx/en_us_dedes/tr.d029:trCA.Ode67.incipit
ltx/en_us_public/tr.d029:trCA.Ode67.melody	@ltx/en_us_dedes/tr.d029:trCA.Ode67.melody
ltx/en_us_public/tr.d029:trCA.Ode67.mode	@ltx/en_us_dedes/tr.d029:trCA.Ode67.mode
ltx/en_us_public/tr.d029:trCA.Ode67.ode	@ltx/en_us_dedes/tr.d029:trCA.Ode67.ode
ltx/en_us_public/tr.d029:trCA.Ode67.text	@ltx/en_us_dedes/tr.d029:trCA.Ode67.text
ltx/en_us_public/tr.d029:trCA.Ode6T.incipit	@ltx/en_us_dedes/tr.d029:trCA.Ode6T.incipit
ltx/en_us_public/tr.d029:trCA.Ode6T.melody	@ltx/en_us_dedes/tr.d029:trCA.Ode6T.melody
ltx/en_us_public/tr.d029:trCA.Ode6T.mode	@ltx/en_us_dedes/tr.d029:trCA.Ode6T.mode
ltx/en_us_public/tr.d029:trCA.Ode6T.ode	@ltx/en_us_dedes/tr.d029:trCA.Ode6T.ode
ltx/en_us_public/tr.d029:trCA.Ode6T.text	@ltx/en_us_dedes/tr.d029:trCA.Ode6T.text
ltx/en_us_public/tr.d029:trCA.Ode6Tr.incipit	@ltx/en_us_dedes/tr.d029:trCA.Ode6Tr.incipit
ltx/en_us_public/tr.d029:trCA.Ode6Tr.melody	@ltx/en_us_dedes/tr.d029:trCA.Ode6Tr.melody
ltx/en_us_public/tr.d029:trCA.Ode6Tr.mode	@ltx/en_us_dedes/tr.d029:trCA.Ode6Tr.mode
ltx/en_us_public/tr.d029:trCA.Ode6Tr.ode	@ltx/en_us_dedes/tr.d029:trCA.Ode6Tr.ode
ltx/en_us_public/tr.d029:trCA.Ode6Tr.text	@ltx/en_us_dedes/tr.d029:trCA.Ode6Tr.text
ltx/en_us_public/tr.d029:trCA.Ode71.incipit	@ltx/en_us_dedes/tr.d029:trCA.Ode71.incipit
ltx/en_us_public/tr.d029:trCA.Ode71.melody	@ltx/en_us_dedes/tr.d029:trCA.Ode71.melody
ltx/en_us_public/tr.d029:trCA.Ode71.mode	@ltx/en_us_dedes/tr.d029:trCA.Ode71.mode
ltx/en_us_public/tr.d029:trCA.Ode71.ode	@ltx/en_us_dedes/tr.d029:trCA.Ode71.ode
ltx/en_us_public/tr.d029:trCA.Ode71.text	@ltx/en_us_dedes/tr.d029:trCA.Ode71.text
ltx/en_us_public/tr.d029:trCA.Ode72.incipit	@ltx/en_us_dedes/tr.d029:trCA.Ode72.incipit
ltx/en_us_public/tr.d029:trCA.Ode72.melody	@ltx/en_us_dedes/tr.d029:trCA.Ode72.melody
ltx/en_us_public/tr.d029:trCA.Ode72.mode	@ltx/en_us_dedes/tr.d029:trCA.Ode72.mode
ltx/en_us_public/tr.d029:trCA.Ode72.ode	@ltx/en_us_dedes/tr.d029:trCA.Ode72.ode
ltx/en_us_public/tr.d029:trCA.Ode72.text	@ltx/en_us_dedes/tr.d029:trCA.Ode72.text
ltx/en_us_public/tr.d029:trCA.Ode73.incipit	@ltx/en_us_dedes/tr.d029:trCA.Ode73.incipit
ltx/en_us_public/tr.d029:trCA.Ode73.melody	@ltx/en_us_dedes/tr.d029:trCA.Ode73.melody
ltx/en_us_public/tr.d029:trCA.Ode73.mode	@ltx/en_us_dedes/tr.d029:trCA.Ode73.mode
ltx/en_us_public/tr.d029:trCA.Ode73.ode	@ltx/en_us_dedes/tr.d029:trCA.Ode73.ode
ltx/en_us_public/tr.d029:trCA.Ode73.text	@ltx/en_us_dedes/tr.d029:trCA.Ode73.text
ltx/en_us_public/tr.d029:trCA.Ode74.incipit	@ltx/en_us_dedes/tr.d029:trCA.Ode74.incipit
ltx/en_us_public/tr.d029:trCA.Ode74.melody	@ltx/en_us_dedes/tr.d029:trCA.Ode74.melody
ltx/en_us_public/tr.d029:trCA.Ode74.mode	@ltx/en_us_dedes/tr.d029:trCA.Ode74.mode
ltx/en_us_public/tr.d029:trCA.Ode74.ode	@ltx/en_us_dedes/tr.d029:trCA.Ode74.ode
ltx/en_us_public/tr.d029:trCA.Ode74.text	@ltx/en_us_dedes/tr.d029:trCA.Ode74.text
ltx/en_us_public/tr.d029:trCA.Ode75.incipit	@ltx/en_us_dedes/tr.d029:trCA.Ode75.incipit
ltx/en_us_public/tr.d029:trCA.Ode75.melody	@ltx/en_us_dedes/tr.d029:trCA.Ode75.melody
ltx/en_us_public/tr.d029:trCA.Ode75.mode	@ltx/en_us_dedes/tr.d029:trCA.Ode75.mode
ltx/en_us_public/tr.d029:trCA.Ode75.ode	@ltx/en_us_dedes/tr.d029:trCA.Ode75.ode
ltx/en_us_public/tr.d029:trCA.Ode75.text	@ltx/en_us_dedes/tr.d029:trCA.Ode75.text
ltx/en_us_public/tr.d029:trCA.Ode76.incipit	@ltx/en_us_dedes/tr.d029:trCA.Ode76.incipit
ltx/en_us_public/tr.d029:trCA.Ode76.melody	@ltx/en_us_dedes/tr.d029:trCA.Ode76.melody
ltx/en_us_public/tr.d029:trCA.Ode76.mode	@ltx/en_us_dedes/tr.d029:trCA.Ode76.mode
ltx/en_us_public/tr.d029:trCA.Ode76.ode	@ltx/en_us_dedes/tr.d029:trCA.Ode76.ode
ltx/en_us_public/tr.d029:trCA.Ode76.text	@ltx/en_us_dedes/tr.d029:trCA.Ode76.text
ltx/en_us_public/tr.d029:trCA.Ode77.incipit	@ltx/en_us_dedes/tr.d029:trCA.Ode77.incipit
ltx/en_us_public/tr.d029:trCA.Ode77.melody	@ltx/en_us_dedes/tr.d029:trCA.Ode77.melody
ltx/en_us_public/tr.d029:trCA.Ode77.mode	@ltx/en_us_dedes/tr.d029:trCA.Ode77.mode
ltx/en_us_public/tr.d029:trCA.Ode77.ode	@ltx/en_us_dedes/tr.d029:trCA.Ode77.ode
ltx/en_us_public/tr.d029:trCA.Ode77.text	@ltx/en_us_dedes/tr.d029:trCA.Ode77.text
ltx/en_us_public/tr.d029:trCA.Ode7T.incipit	@ltx/en_us_dedes/tr.d029:trCA.Ode7T.incipit
ltx/en_us_public/tr.d029:trCA.Ode7T.melody	@ltx/en_us_dedes/tr.d029:trCA.Ode7T.melody
ltx/en_us_public/tr.d029:trCA.Ode7T.mode	@ltx/en_us_dedes/tr.d029:trCA.Ode7T.mode
ltx/en_us_public/tr.d029:trCA.Ode7T.ode	@ltx/en_us_dedes/tr.d029:trCA.Ode7T.ode
ltx/en_us_public/tr.d029:trCA.Ode7T.text	@ltx/en_us_dedes/tr.d029:trCA.Ode7T.text
ltx/en_us_public/tr.d029:trCA.Ode7Tr.incipit	@ltx/en_us_dedes/tr.d029:trCA.Ode7Tr.incipit
ltx/en_us_public/tr.d029:trCA.Ode7Tr.melody	@ltx/en_us_dedes/tr.d029:trCA.Ode7Tr.melody
ltx/en_us_public/tr.d029:trCA.Ode7Tr.mode	@ltx/en_us_dedes/tr.d029:trCA.Ode7Tr.mode
ltx/en_us_public/tr.d029:trCA.Ode7Tr.ode	@ltx/en_us_dedes/tr.d029:trCA.Ode7Tr.ode
ltx/en_us_public/tr.d029:trCA.Ode7Tr.text	@ltx/en_us_dedes/tr.d029:trCA.Ode7Tr.text
ltx/en_us_public/tr.d029:trCA.Ode81.incipit	@ltx/en_us_dedes/tr.d029:trCA.Ode81.incipit
ltx/en_us_public/tr.d029:trCA.Ode81.melody	@ltx/en_us_dedes/tr.d029:trCA.Ode81.melody
ltx/en_us_public/tr.d029:trCA.Ode81.mode	@ltx/en_us_dedes/tr.d029:trCA.Ode81.mode
ltx/en_us_public/tr.d029:trCA.Ode81.ode	@ltx/en_us_dedes/tr.d029:trCA.Ode81.ode
ltx/en_us_public/tr.d029:trCA.Ode81.text	@ltx/en_us_dedes/tr.d029:trCA.Ode81.text
ltx/en_us_public/tr.d029:trCA.Ode82.incipit	@ltx/en_us_dedes/tr.d029:trCA.Ode82.incipit
ltx/en_us_public/tr.d029:trCA.Ode82.melody	@ltx/en_us_dedes/tr.d029:trCA.Ode82.melody
ltx/en_us_public/tr.d029:trCA.Ode82.mode	@ltx/en_us_dedes/tr.d029:trCA.Ode82.mode
ltx/en_us_public/tr.d029:trCA.Ode82.ode	@ltx/en_us_dedes/tr.d029:trCA.Ode82.ode
ltx/en_us_public/tr.d029:trCA.Ode82.text	@ltx/en_us_dedes/tr.d029:trCA.Ode82.text
ltx/en_us_public/tr.d029:trCA.Ode83.incipit	@ltx/en_us_dedes/tr.d029:trCA.Ode83.incipit
ltx/en_us_public/tr.d029:trCA.Ode83.melody	@ltx/en_us_dedes/tr.d029:trCA.Ode83.melody
ltx/en_us_public/tr.d029:trCA.Ode83.mode	@ltx/en_us_dedes/tr.d029:trCA.Ode83.mode
ltx/en_us_public/tr.d029:trCA.Ode83.ode	@ltx/en_us_dedes/tr.d029:trCA.Ode83.ode
ltx/en_us_public/tr.d029:trCA.Ode83.text	@ltx/en_us_dedes/tr.d029:trCA.Ode83.text
ltx/en_us_public/tr.d029:trCA.Ode84.incipit	@ltx/en_us_dedes/tr.d029:trCA.Ode84.incipit
ltx/en_us_public/tr.d029:trCA.Ode84.melody	@ltx/en_us_dedes/tr.d029:trCA.Ode84.melody
ltx/en_us_public/tr.d029:trCA.Ode84.mode	@ltx/en_us_dedes/tr.d029:trCA.Ode84.mode
ltx/en_us_public/tr.d029:trCA.Ode84.ode	@ltx/en_us_dedes/tr.d029:trCA.Ode84.ode
ltx/en_us_public/tr.d029:trCA.Ode84.text	@ltx/en_us_dedes/tr.d029:trCA.Ode84.text
ltx/en_us_public/tr.d029:trCA.Ode85.incipit	@ltx/en_us_dedes/tr.d029:trCA.Ode85.incipit
ltx/en_us_public/tr.d029:trCA.Ode85.melody	@ltx/en_us_dedes/tr.d029:trCA.Ode85.melody
ltx/en_us_public/tr.d029:trCA.Ode85.mode	@ltx/en_us_dedes/tr.d029:trCA.Ode85.mode
ltx/en_us_public/tr.d029:trCA.Ode85.ode	@ltx/en_us_dedes/tr.d029:trCA.Ode85.ode
ltx/en_us_public/tr.d029:trCA.Ode85.text	@ltx/en_us_dedes/tr.d029:trCA.Ode85.text
ltx/en_us_public/tr.d029:trCA.Ode86.incipit	@ltx/en_us_dedes/tr.d029:trCA.Ode86.incipit
ltx/en_us_public/tr.d029:trCA.Ode86.melody	@ltx/en_us_dedes/tr.d029:trCA.Ode86.melody
ltx/en_us_public/tr.d029:trCA.Ode86.mode	@ltx/en_us_dedes/tr.d029:trCA.Ode86.mode
ltx/en_us_public/tr.d029:trCA.Ode86.ode	@ltx/en_us_dedes/tr.d029:trCA.Ode86.ode
ltx/en_us_public/tr.d029:trCA.Ode86.text	@ltx/en_us_dedes/tr.d029:trCA.Ode86.text
ltx/en_us_public/tr.d029:trCA.Ode8T.incipit	@ltx/en_us_dedes/tr.d029:trCA.Ode8T.incipit
ltx/en_us_public/tr.d029:trCA.Ode8T.melody	@ltx/en_us_dedes/tr.d029:trCA.Ode8T.melody
ltx/en_us_public/tr.d029:trCA.Ode8T.mode	@ltx/en_us_dedes/tr.d029:trCA.Ode8T.mode
ltx/en_us_public/tr.d029:trCA.Ode8T.ode	@ltx/en_us_dedes/tr.d029:trCA.Ode8T.ode
ltx/en_us_public/tr.d029:trCA.Ode8T.text	@ltx/en_us_dedes/tr.d029:trCA.Ode8T.text
ltx/en_us_public/tr.d029:trCA.Ode8Tr.incipit	@ltx/en_us_dedes/tr.d029:trCA.Ode8Tr.incipit
ltx/en_us_public/tr.d029:trCA.Ode8Tr.melody	@ltx/en_us_dedes/tr.d029:trCA.Ode8Tr.melody
ltx/en_us_public/tr.d029:trCA.Ode8Tr.mode	@ltx/en_us_dedes/tr.d029:trCA.Ode8Tr.mode
ltx/en_us_public/tr.d029:trCA.Ode8Tr.ode	@ltx/en_us_dedes/tr.d029:trCA.Ode8Tr.ode
ltx/en_us_public/tr.d029:trCA.Ode8Tr.text	@ltx/en_us_dedes/tr.d029:trCA.Ode8Tr.text
ltx/en_us_public/tr.d029:trCA.Ode91.incipit	@ltx/en_us_dedes/tr.d029:trCA.Ode91.incipit
ltx/en_us_public/tr.d029:trCA.Ode91.melody	@ltx/en_us_dedes/tr.d029:trCA.Ode91.melody
ltx/en_us_public/tr.d029:trCA.Ode91.mode	@ltx/en_us_dedes/tr.d029:trCA.Ode91.mode
ltx/en_us_public/tr.d029:trCA.Ode91.ode	@ltx/en_us_dedes/tr.d029:trCA.Ode91.ode
ltx/en_us_public/tr.d029:trCA.Ode91.text	@ltx/en_us_dedes/tr.d029:trCA.Ode91.text
ltx/en_us_public/tr.d029:trCA.Ode92.incipit	@ltx/en_us_dedes/tr.d029:trCA.Ode92.incipit
ltx/en_us_public/tr.d029:trCA.Ode92.melody	@ltx/en_us_dedes/tr.d029:trCA.Ode92.melody
ltx/en_us_public/tr.d029:trCA.Ode92.mode	@ltx/en_us_dedes/tr.d029:trCA.Ode92.mode
ltx/en_us_public/tr.d029:trCA.Ode92.ode	@ltx/en_us_dedes/tr.d029:trCA.Ode92.ode
ltx/en_us_public/tr.d029:trCA.Ode92.text	@ltx/en_us_dedes/tr.d029:trCA.Ode92.text
ltx/en_us_public/tr.d029:trCA.Ode93.incipit	@ltx/en_us_dedes/tr.d029:trCA.Ode93.incipit
ltx/en_us_public/tr.d029:trCA.Ode93.melody	@ltx/en_us_dedes/tr.d029:trCA.Ode93.melody
ltx/en_us_public/tr.d029:trCA.Ode93.mode	@ltx/en_us_dedes/tr.d029:trCA.Ode93.mode
ltx/en_us_public/tr.d029:trCA.Ode93.ode	@ltx/en_us_dedes/tr.d029:trCA.Ode93.ode
ltx/en_us_public/tr.d029:trCA.Ode93.text	@ltx/en_us_dedes/tr.d029:trCA.Ode93.text
ltx/en_us_public/tr.d029:trCA.Ode94.incipit	@ltx/en_us_dedes/tr.d029:trCA.Ode94.incipit
ltx/en_us_public/tr.d029:trCA.Ode94.melody	@ltx/en_us_dedes/tr.d029:trCA.Ode94.melody
ltx/en_us_public/tr.d029:trCA.Ode94.mode	@ltx/en_us_dedes/tr.d029:trCA.Ode94.mode
ltx/en_us_public/tr.d029:trCA.Ode94.ode	@ltx/en_us_dedes/tr.d029:trCA.Ode94.ode
ltx/en_us_public/tr.d029:trCA.Ode94.text	@ltx/en_us_dedes/tr.d029:trCA.Ode94.text
ltx/en_us_public/tr.d029:trCA.Ode95.incipit	@ltx/en_us_dedes/tr.d029:trCA.Ode95.incipit
ltx/en_us_public/tr.d029:trCA.Ode95.melody	@ltx/en_us_dedes/tr.d029:trCA.Ode95.melody
ltx/en_us_public/tr.d029:trCA.Ode95.mode	@ltx/en_us_dedes/tr.d029:trCA.Ode95.mode
ltx/en_us_public/tr.d029:trCA.Ode95.ode	@ltx/en_us_dedes/tr.d029:trCA.Ode95.ode
ltx/en_us_public/tr.d029:trCA.Ode95.text	@ltx/en_us_dedes/tr.d029:trCA.Ode95.text
ltx/en_us_public/tr.d029:trCA.Ode96.incipit	@ltx/en_us_dedes/tr.d029:trCA.Ode96.incipit
ltx/en_us_public/tr.d029:trCA.Ode96.melody	@ltx/en_us_dedes/tr.d029:trCA.Ode96.melody
ltx/en_us_public/tr.d029:trCA.Ode96.mode	@ltx/en_us_dedes/tr.d029:trCA.Ode96.mode
ltx/en_us_public/tr.d029:trCA.Ode96.ode	@ltx/en_us_dedes/tr.d029:trCA.Ode96.ode
ltx/en_us_public/tr.d029:trCA.Ode96.text	@ltx/en_us_dedes/tr.d029:trCA.Ode96.text
ltx/en_us_public/tr.d029:trCA.Ode97.incipit	@ltx/en_us_dedes/tr.d029:trCA.Ode97.incipit
ltx/en_us_public/tr.d029:trCA.Ode97.melody	@ltx/en_us_dedes/tr.d029:trCA.Ode97.melody
ltx/en_us_public/tr.d029:trCA.Ode97.mode	@ltx/en_us_dedes/tr.d029:trCA.Ode97.mode
ltx/en_us_public/tr.d029:trCA.Ode97.ode	@ltx/en_us_dedes/tr.d029:trCA.Ode97.ode
ltx/en_us_public/tr.d029:trCA.Ode97.text	@ltx/en_us_dedes/tr.d029:trCA.Ode97.text
ltx/en_us_public/tr.d029:trCA.Ode9T.incipit	@ltx/en_us_dedes/tr.d029:trCA.Ode9T.incipit
ltx/en_us_public/tr.d029:trCA.Ode9T.melody	@ltx/en_us_dedes/tr.d029:trCA.Ode9T.melody
ltx/en_us_public/tr.d029:trCA.Ode9T.mode	@ltx/en_us_dedes/tr.d029:trCA.Ode9T.mode
ltx/en_us_public/tr.d029:trCA.Ode9T.ode	@ltx/en_us_dedes/tr.d029:trCA.Ode9T.ode
ltx/en_us_public/tr.d029:trCA.Ode9T.text	@ltx/en_us_dedes/tr.d029:trCA.Ode9T.text
ltx/en_us_public/tr.d029:trCA.Ode9Tr.incipit	@ltx/en_us_dedes/tr.d029:trCA.Ode9Tr.incipit
ltx/en_us_public/tr.d029:trCA.Ode9Tr.melody	@ltx/en_us_dedes/tr.d029:trCA.Ode9Tr.melody
ltx/en_us_public/tr.d029:trCA.Ode9Tr.mode	@ltx/en_us_dedes/tr.d029:trCA.Ode9Tr.mode
ltx/en_us_public/tr.d029:trCA.Ode9Tr.ode	@ltx/en_us_dedes/tr.d029:trCA.Ode9Tr.ode
ltx/en_us_public/tr.d029:trCA.Ode9Tr.text	@ltx/en_us_dedes/tr.d029:trCA.Ode9Tr.text
ltx/en_us_public/tr.d029:trCA.Troparion1.incipit	@ltx/en_us_dedes/tr.d029:trCA.Troparion1.incipit
ltx/en_us_public/tr.d029:trCA.Troparion1.melody	@ltx/en_us_dedes/tr.d029:trCA.Troparion1.melody
ltx/en_us_public/tr.d029:trCA.Troparion1.mode	@ltx/en_us_dedes/tr.d029:trCA.Troparion1.mode
ltx/en_us_public/tr.d029:trCA.Troparion1.text	@ltx/en_us_dedes/tr.d029:trCA.Troparion1.text
ltx/en_us_public/tr.d029:trCA.Troparion2.incipit	@ltx/en_us_dedes/tr.d029:trCA.Troparion2.incipit
ltx/en_us_public/tr.d029:trCA.Troparion2.melody	@ltx/en_us_dedes/tr.d029:trCA.Troparion2.melody
ltx/en_us_public/tr.d029:trCA.Troparion2.mode	@ltx/en_us_dedes/tr.d029:trCA.Troparion2.mode
ltx/en_us_public/tr.d029:trCA.Troparion2.text	@ltx/en_us_dedes/tr.d029:trCA.Troparion2.text
ltx/en_us_public/tr.d029:trCA.poet	@ltx/en_us_dedes/tr.d029:trCA.poet
ltx/en_us_public/tr.d029:trCO.header	@ltx/en_us_dedes/tr.d029:trCO.header
ltx/en_us_public/tr.d029:trDA.commemoration.full	@ltx/en_us_dedes/tr.d029:trDA.commemoration.full
ltx/en_us_public/tr.d029:trDA.commemoration.short	@ltx/en_us_dedes/tr.d029:trDA.commemoration.short
ltx/en_us_public/tr.d029:trDA.dismissal	@ltx/en_us_dedes/tr.d029:trDA.dismissal
ltx/en_us_public/tr.d029:trDA.insert1	@ltx/en_us_dedes/tr.d029:trDA.insert1
ltx/en_us_public/tr.d029:trDA.insert2	@ltx/en_us_dedes/tr.d029:trDA.insert2
ltx/en_us_public/tr.d029:trDA.note	@ltx/en_us_dedes/tr.d029:trDA.note
ltx/en_us_public/tr.d029:trDA.title	@ltx/en_us_dedes/tr.d029:trDA.title
ltx/en_us_public/tr.d029:trHO.commemorations	@ltx/en_us_dedes/tr.d029:trHO.commemorations
ltx/en_us_public/tr.d029:trHO.daytitle	@ltx/en_us_dedes/tr.d029:trHO.daytitle
ltx/en_us_public/tr.d029:trHO.description1	@ltx/en_us_dedes/tr.d029:trHO.description1
ltx/en_us_public/tr.d029:trHO.description2	@ltx/en_us_dedes/tr.d029:trHO.description2
ltx/en_us_public/tr.d029:trHO.note1	@ltx/en_us_dedes/tr.d029:trHO.note1
ltx/en_us_public/tr.d029:trHO.note2	@ltx/en_us_dedes/tr.d029:trHO.note2
ltx/en_us_public/tr.d029:trLI.Kontakion1.incipit	@ltx/en_us_duvall/tr.d029:trLI.Kontakion1.incipit
ltx/en_us_public/tr.d029:trLI.Kontakion1.melody	@ltx/en_us_duvall/tr.d029:trLI.Kontakion1.melody
ltx/en_us_public/tr.d029:trLI.Kontakion1.mode	@ltx/en_us_dedes/tr.d029:trLI.Kontakion1.mode
ltx/en_us_public/tr.d029:trLI.Kontakion1.text	@ltx/en_us_duvall/tr.d029:trLI.Kontakion1.text
ltx/en_us_public/tr.d029:trLI.MM.EntranceHymn.text	@ltx/en_us_dedes/tr.d029:trLI.MM.EntranceHymn.text
ltx/en_us_public/tr.d029:trLI.Megalynarion.text	@ltx/en_us_dedes/tr.d029:trLI.Megalynarion.text
ltx/en_us_public/tr.d029:trLI.TheotokosHymn.incipit	@ltx/en_us_goadedes/tr.d029:trLI.TheotokosHymn.incipit
ltx/en_us_public/tr.d029:trLI.TheotokosHymn.mode	@ltx/en_us_goadedes/tr.d029:trLI.TheotokosHymn.mode
ltx/en_us_public/tr.d029:trLI.TheotokosHymn.text	@ltx/en_us_goadedes/tr.d029:trLI.TheotokosHymn.text
ltx/en_us_public/tr.d029:trMA.C1.acrostic.notice1	@ltx/en_us_dedes/tr.d029:trMA.C1.acrostic.notice1
ltx/en_us_public/tr.d029:trMA.C1.acrostic.text	@ltx/en_us_dedes/tr.d029:trMA.C1.acrostic.text
ltx/en_us_public/tr.d029:trMA.C1.acrostic.title	@ltx/en_us_oca/tr.d029:trMA.C1.acrostic.title
ltx/en_us_public/tr.d029:trMA.C1.poet	@ltx/en_us_dedes/tr.d029:trMA.C1.poet
ltx/en_us_public/tr.d029:trMA.C1.title	@ltx/en_us_dedes/tr.d029:trMA.C1.title
ltx/en_us_public/tr.d029:trMA.C1.verse	@ltx/en_us_dedes/tr.d029:trMA.C1.verse
ltx/en_us_public/tr.d029:trMA.ExapTheotokion.greekmelody	@ltx/en_us_dedes/tr.d029:trMA.ExapTheotokion.greekmelody
ltx/en_us_public/tr.d029:trMA.ExapTheotokion.incipit	@ltx/en_us_dedes/tr.d029:trMA.ExapTheotokion.incipit
ltx/en_us_public/tr.d029:trMA.ExapTheotokion.melody	@ltx/en_us_dedes/tr.d029:trMA.ExapTheotokion.melody
ltx/en_us_public/tr.d029:trMA.ExapTheotokion.mode	@ltx/en_us_dedes/tr.d029:trMA.ExapTheotokion.mode
ltx/en_us_public/tr.d029:trMA.ExapTheotokion.text	@ltx/en_us_dedes/tr.d029:trMA.ExapTheotokion.text
ltx/en_us_public/tr.d029:trMA.Exaposteilarion1.greekmelody	@ltx/en_us_dedes/tr.d029:trMA.Exaposteilarion1.greekmelody
ltx/en_us_public/tr.d029:trMA.Exaposteilarion1.incipit	@ltx/en_us_dedes/tr.d029:trMA.Exaposteilarion1.incipit
ltx/en_us_public/tr.d029:trMA.Exaposteilarion1.melody	@ltx/en_us_dedes/tr.d029:trMA.Exaposteilarion1.melody
ltx/en_us_public/tr.d029:trMA.Exaposteilarion1.mode	@ltx/en_us_dedes/tr.d029:trMA.Exaposteilarion1.mode
ltx/en_us_public/tr.d029:trMA.Exaposteilarion1.text	@ltx/en_us_dedes/tr.d029:trMA.Exaposteilarion1.text
ltx/en_us_public/tr.d029:trMA.Kontakion1.incipit	@ltx/en_us_duvall/tr.d029:trMA.Kontakion1.incipit
ltx/en_us_public/tr.d029:trMA.Kontakion1.melody	@ltx/en_us_duvall/tr.d029:trMA.Kontakion1.melody
ltx/en_us_public/tr.d029:trMA.Kontakion1.mode	@ltx/en_us_dedes/tr.d029:trMA.Kontakion1.mode
ltx/en_us_public/tr.d029:trMA.Kontakion1.text	@ltx/en_us_duvall/tr.d029:trMA.Kontakion1.text
ltx/en_us_public/tr.d029:trMA.Lauds1.greekmelody	@ltx/en_us_dedes/tr.d029:trMA.Lauds1.greekmelody
ltx/en_us_public/tr.d029:trMA.Lauds1.incipit	@ltx/en_us_dedes/tr.d029:trMA.Lauds1.incipit
ltx/en_us_public/tr.d029:trMA.Lauds1.melody	@ltx/en_us_dedes/tr.d029:trMA.Lauds1.melody
ltx/en_us_public/tr.d029:trMA.Lauds1.mode	@ltx/en_us_dedes/tr.d029:trMA.Lauds1.mode
ltx/en_us_public/tr.d029:trMA.Lauds1.text	@ltx/en_us_dedes/tr.d029:trMA.Lauds1.text
ltx/en_us_public/tr.d029:trMA.Lauds2.incipit	@ltx/en_us_dedes/tr.d029:trMA.Lauds2.incipit
ltx/en_us_public/tr.d029:trMA.Lauds2.melody	@ltx/en_us_dedes/tr.d029:trMA.Lauds2.melody
ltx/en_us_public/tr.d029:trMA.Lauds2.mode	@ltx/en_us_dedes/tr.d029:trMA.Lauds2.mode
ltx/en_us_public/tr.d029:trMA.Lauds2.text	@ltx/en_us_dedes/tr.d029:trMA.Lauds2.text
ltx/en_us_public/tr.d029:trMA.Lauds3.incipit	@ltx/en_us_dedes/tr.d029:trMA.Lauds3.incipit
ltx/en_us_public/tr.d029:trMA.Lauds3.melody	@ltx/en_us_dedes/tr.d029:trMA.Lauds3.melody
ltx/en_us_public/tr.d029:trMA.Lauds3.mode	@ltx/en_us_dedes/tr.d029:trMA.Lauds3.mode
ltx/en_us_public/tr.d029:trMA.Lauds3.text	@ltx/en_us_dedes/tr.d029:trMA.Lauds3.text
ltx/en_us_public/tr.d029:trMA.LaudsGlory.incipit	@ltx/en_us_duvall/tr.d029:trMA.LaudsGlory.incipit
ltx/en_us_public/tr.d029:trMA.LaudsGlory.melody	@ltx/en_us_dedes/tr.d029:trMA.LaudsGlory.melody
ltx/en_us_public/tr.d029:trMA.LaudsGlory.mode	@ltx/en_us_dedes/tr.d029:trMA.LaudsGlory.mode
ltx/en_us_public/tr.d029:trMA.LaudsGlory.text	@ltx/en_us_duvall/tr.d029:trMA.LaudsGlory.text
ltx/en_us_public/tr.d029:trMA.LaudsTheotokion.incipit	@ltx/en_us_goadedes/tr.d029:trMA.LaudsTheotokion.incipit
ltx/en_us_public/tr.d029:trMA.LaudsTheotokion.melody	@ltx/en_us_goadedes/tr.d029:trMA.LaudsTheotokion.melody
ltx/en_us_public/tr.d029:trMA.LaudsTheotokion.mode	@ltx/en_us_goadedes/tr.d029:trMA.LaudsTheotokion.mode
ltx/en_us_public/tr.d029:trMA.LaudsTheotokion.text	@ltx/en_us_goadedes/tr.d029:trMA.LaudsTheotokion.text
ltx/en_us_public/tr.d029:trMA.MM.Lauds1123as5678.text	@ltx/en_us_dedes/tr.d029:trMA.MM.Lauds1123as5678.text
ltx/en_us_public/tr.d029:trMA.Ode1C11.greekmelody	@ltx/en_us_dedes/tr.d029:trMA.Ode1C11.greekmelody
ltx/en_us_public/tr.d029:trMA.Ode1C11.incipit	@ltx/en_us_oca/tr.d029:trMA.Ode1C11.incipit
ltx/en_us_public/tr.d029:trMA.Ode1C11.melody	@ltx/en_us_oca/tr.d029:trMA.Ode1C11.melody
ltx/en_us_public/tr.d029:trMA.Ode1C11.mode	@ltx/en_us_dedes/tr.d029:trMA.Ode1C11.mode
ltx/en_us_public/tr.d029:trMA.Ode1C11.ode	@ltx/en_us_dedes/tr.d029:trMA.Ode1C11.ode
ltx/en_us_public/tr.d029:trMA.Ode1C11.text	@ltx/en_us_oca/tr.d029:trMA.Ode1C11.text
ltx/en_us_public/tr.d029:trMA.Ode1C12.incipit	@ltx/en_us_oca/tr.d029:trMA.Ode1C12.incipit
ltx/en_us_public/tr.d029:trMA.Ode1C12.melody	@ltx/en_us_oca/tr.d029:trMA.Ode1C12.melody
ltx/en_us_public/tr.d029:trMA.Ode1C12.mode	@ltx/en_us_dedes/tr.d029:trMA.Ode1C12.mode
ltx/en_us_public/tr.d029:trMA.Ode1C12.ode	@ltx/en_us_dedes/tr.d029:trMA.Ode1C12.ode
ltx/en_us_public/tr.d029:trMA.Ode1C12.text	@ltx/en_us_oca/tr.d029:trMA.Ode1C12.text
ltx/en_us_public/tr.d029:trMA.Ode1C13.incipit	@ltx/en_us_oca/tr.d029:trMA.Ode1C13.incipit
ltx/en_us_public/tr.d029:trMA.Ode1C13.melody	@ltx/en_us_oca/tr.d029:trMA.Ode1C13.melody
ltx/en_us_public/tr.d029:trMA.Ode1C13.mode	@ltx/en_us_dedes/tr.d029:trMA.Ode1C13.mode
ltx/en_us_public/tr.d029:trMA.Ode1C13.ode	@ltx/en_us_dedes/tr.d029:trMA.Ode1C13.ode
ltx/en_us_public/tr.d029:trMA.Ode1C13.text	@ltx/en_us_oca/tr.d029:trMA.Ode1C13.text
ltx/en_us_public/tr.d029:trMA.Ode1C14.incipit	@ltx/en_us_oca/tr.d029:trMA.Ode1C14.incipit
ltx/en_us_public/tr.d029:trMA.Ode1C14.melody	@ltx/en_us_oca/tr.d029:trMA.Ode1C14.melody
ltx/en_us_public/tr.d029:trMA.Ode1C14.mode	@ltx/en_us_dedes/tr.d029:trMA.Ode1C14.mode
ltx/en_us_public/tr.d029:trMA.Ode1C14.ode	@ltx/en_us_dedes/tr.d029:trMA.Ode1C14.ode
ltx/en_us_public/tr.d029:trMA.Ode1C14.text	@ltx/en_us_oca/tr.d029:trMA.Ode1C14.text
ltx/en_us_public/tr.d029:trMA.Ode1C1T.incipit	@ltx/en_us_oca/tr.d029:trMA.Ode1C1T.incipit
ltx/en_us_public/tr.d029:trMA.Ode1C1T.melody	@ltx/en_us_oca/tr.d029:trMA.Ode1C1T.melody
ltx/en_us_public/tr.d029:trMA.Ode1C1T.mode	@ltx/en_us_dedes/tr.d029:trMA.Ode1C1T.mode
ltx/en_us_public/tr.d029:trMA.Ode1C1T.ode	@ltx/en_us_dedes/tr.d029:trMA.Ode1C1T.ode
ltx/en_us_public/tr.d029:trMA.Ode1C1T.text	@ltx/en_us_oca/tr.d029:trMA.Ode1C1T.text
ltx/en_us_public/tr.d029:trMA.Ode3C11.greekmelody	@ltx/en_us_dedes/tr.d029:trMA.Ode3C11.greekmelody
ltx/en_us_public/tr.d029:trMA.Ode3C11.incipit	@ltx/en_us_oca/tr.d029:trMA.Ode3C11.incipit
ltx/en_us_public/tr.d029:trMA.Ode3C11.melody	@ltx/en_us_oca/tr.d029:trMA.Ode3C11.melody
ltx/en_us_public/tr.d029:trMA.Ode3C11.mode	@ltx/en_us_dedes/tr.d029:trMA.Ode3C11.mode
ltx/en_us_public/tr.d029:trMA.Ode3C11.ode	@ltx/en_us_dedes/tr.d029:trMA.Ode3C11.ode
ltx/en_us_public/tr.d029:trMA.Ode3C11.text	@ltx/en_us_oca/tr.d029:trMA.Ode3C11.text
ltx/en_us_public/tr.d029:trMA.Ode3C12.incipit	@ltx/en_us_oca/tr.d029:trMA.Ode3C12.incipit
ltx/en_us_public/tr.d029:trMA.Ode3C12.melody	@ltx/en_us_oca/tr.d029:trMA.Ode3C12.melody
ltx/en_us_public/tr.d029:trMA.Ode3C12.mode	@ltx/en_us_dedes/tr.d029:trMA.Ode3C12.mode
ltx/en_us_public/tr.d029:trMA.Ode3C12.ode	@ltx/en_us_dedes/tr.d029:trMA.Ode3C12.ode
ltx/en_us_public/tr.d029:trMA.Ode3C12.text	@ltx/en_us_oca/tr.d029:trMA.Ode3C12.text
ltx/en_us_public/tr.d029:trMA.Ode3C13.incipit	@ltx/en_us_oca/tr.d029:trMA.Ode3C13.incipit
ltx/en_us_public/tr.d029:trMA.Ode3C13.melody	@ltx/en_us_oca/tr.d029:trMA.Ode3C13.melody
ltx/en_us_public/tr.d029:trMA.Ode3C13.mode	@ltx/en_us_dedes/tr.d029:trMA.Ode3C13.mode
ltx/en_us_public/tr.d029:trMA.Ode3C13.ode	@ltx/en_us_dedes/tr.d029:trMA.Ode3C13.ode
ltx/en_us_public/tr.d029:trMA.Ode3C13.text	@ltx/en_us_oca/tr.d029:trMA.Ode3C13.text
ltx/en_us_public/tr.d029:trMA.Ode3C14.incipit	@ltx/en_us_oca/tr.d029:trMA.Ode3C14.incipit
ltx/en_us_public/tr.d029:trMA.Ode3C14.melody	@ltx/en_us_oca/tr.d029:trMA.Ode3C14.melody
ltx/en_us_public/tr.d029:trMA.Ode3C14.mode	@ltx/en_us_dedes/tr.d029:trMA.Ode3C14.mode
ltx/en_us_public/tr.d029:trMA.Ode3C14.ode	@ltx/en_us_dedes/tr.d029:trMA.Ode3C14.ode
ltx/en_us_public/tr.d029:trMA.Ode3C14.text	@ltx/en_us_oca/tr.d029:trMA.Ode3C14.text
ltx/en_us_public/tr.d029:trMA.Ode3C1T.incipit	@ltx/en_us_oca/tr.d029:trMA.Ode3C1T.incipit
ltx/en_us_public/tr.d029:trMA.Ode3C1T.melody	@ltx/en_us_oca/tr.d029:trMA.Ode3C1T.melody
ltx/en_us_public/tr.d029:trMA.Ode3C1T.mode	@ltx/en_us_dedes/tr.d029:trMA.Ode3C1T.mode
ltx/en_us_public/tr.d029:trMA.Ode3C1T.ode	@ltx/en_us_dedes/tr.d029:trMA.Ode3C1T.ode
ltx/en_us_public/tr.d029:trMA.Ode3C1T.text	@ltx/en_us_oca/tr.d029:trMA.Ode3C1T.text
ltx/en_us_public/tr.d029:trMA.Ode3Kathisma1.greekmelody	@ltx/en_us_dedes/tr.d029:trMA.Ode3Kathisma1.greekmelody
ltx/en_us_public/tr.d029:trMA.Ode3Kathisma1.incipit	@ltx/en_us_oca/tr.d029:trMA.Ode3Kathisma1.incipit
ltx/en_us_public/tr.d029:trMA.Ode3Kathisma1.melody	@ltx/en_us_oca/tr.d029:trMA.Ode3Kathisma1.melody
ltx/en_us_public/tr.d029:trMA.Ode3Kathisma1.mode	@ltx/en_us_dedes/tr.d029:trMA.Ode3Kathisma1.mode
ltx/en_us_public/tr.d029:trMA.Ode3Kathisma1.text	@ltx/en_us_oca/tr.d029:trMA.Ode3Kathisma1.text
ltx/en_us_public/tr.d029:trMA.Ode3Kathisma2.greekmelody	@ltx/en_us_dedes/tr.d029:trMA.Ode3Kathisma2.greekmelody
ltx/en_us_public/tr.d029:trMA.Ode3Kathisma2.incipit	@ltx/en_us_oca/tr.d029:trMA.Ode3Kathisma2.incipit
ltx/en_us_public/tr.d029:trMA.Ode3Kathisma2.melody	@ltx/en_us_oca/tr.d029:trMA.Ode3Kathisma2.melody
ltx/en_us_public/tr.d029:trMA.Ode3Kathisma2.mode	@ltx/en_us_dedes/tr.d029:trMA.Ode3Kathisma2.mode
ltx/en_us_public/tr.d029:trMA.Ode3Kathisma2.text	@ltx/en_us_oca/tr.d029:trMA.Ode3Kathisma2.text
ltx/en_us_public/tr.d029:trMA.Ode3Kathisma3.greekmelody	@ltx/en_us_dedes/tr.d029:trMA.Ode3Kathisma3.greekmelody
ltx/en_us_public/tr.d029:trMA.Ode3Kathisma3.incipit	@ltx/en_us_oca/tr.d029:trMA.Ode3Kathisma3.incipit
ltx/en_us_public/tr.d029:trMA.Ode3Kathisma3.melody	@ltx/en_us_oca/tr.d029:trMA.Ode3Kathisma3.melody
ltx/en_us_public/tr.d029:trMA.Ode3Kathisma3.mode	@ltx/en_us_dedes/tr.d029:trMA.Ode3Kathisma3.mode
ltx/en_us_public/tr.d029:trMA.Ode3Kathisma3.text	@ltx/en_us_oca/tr.d029:trMA.Ode3Kathisma3.text
ltx/en_us_public/tr.d029:trMA.Ode4C11.greekmelody	@ltx/en_us_dedes/tr.d029:trMA.Ode4C11.greekmelody
ltx/en_us_public/tr.d029:trMA.Ode4C11.incipit	@ltx/en_us_oca/tr.d029:trMA.Ode4C11.incipit
ltx/en_us_public/tr.d029:trMA.Ode4C11.melody	@ltx/en_us_oca/tr.d029:trMA.Ode4C11.melody
ltx/en_us_public/tr.d029:trMA.Ode4C11.mode	@ltx/en_us_dedes/tr.d029:trMA.Ode4C11.mode
ltx/en_us_public/tr.d029:trMA.Ode4C11.ode	@ltx/en_us_dedes/tr.d029:trMA.Ode4C11.ode
ltx/en_us_public/tr.d029:trMA.Ode4C11.text	@ltx/en_us_oca/tr.d029:trMA.Ode4C11.text
ltx/en_us_public/tr.d029:trMA.Ode4C12.incipit	@ltx/en_us_oca/tr.d029:trMA.Ode4C12.incipit
ltx/en_us_public/tr.d029:trMA.Ode4C12.melody	@ltx/en_us_oca/tr.d029:trMA.Ode4C12.melody
ltx/en_us_public/tr.d029:trMA.Ode4C12.mode	@ltx/en_us_dedes/tr.d029:trMA.Ode4C12.mode
ltx/en_us_public/tr.d029:trMA.Ode4C12.ode	@ltx/en_us_dedes/tr.d029:trMA.Ode4C12.ode
ltx/en_us_public/tr.d029:trMA.Ode4C12.text	@ltx/en_us_oca/tr.d029:trMA.Ode4C12.text
ltx/en_us_public/tr.d029:trMA.Ode4C13.incipit	@ltx/en_us_oca/tr.d029:trMA.Ode4C13.incipit
ltx/en_us_public/tr.d029:trMA.Ode4C13.melody	@ltx/en_us_oca/tr.d029:trMA.Ode4C13.melody
ltx/en_us_public/tr.d029:trMA.Ode4C13.mode	@ltx/en_us_dedes/tr.d029:trMA.Ode4C13.mode
ltx/en_us_public/tr.d029:trMA.Ode4C13.ode	@ltx/en_us_dedes/tr.d029:trMA.Ode4C13.ode
ltx/en_us_public/tr.d029:trMA.Ode4C13.text	@ltx/en_us_oca/tr.d029:trMA.Ode4C13.text
ltx/en_us_public/tr.d029:trMA.Ode4C14.incipit	@ltx/en_us_oca/tr.d029:trMA.Ode4C14.incipit
ltx/en_us_public/tr.d029:trMA.Ode4C14.melody	@ltx/en_us_oca/tr.d029:trMA.Ode4C14.melody
ltx/en_us_public/tr.d029:trMA.Ode4C14.mode	@ltx/en_us_dedes/tr.d029:trMA.Ode4C14.mode
ltx/en_us_public/tr.d029:trMA.Ode4C14.ode	@ltx/en_us_dedes/tr.d029:trMA.Ode4C14.ode
ltx/en_us_public/tr.d029:trMA.Ode4C14.text	@ltx/en_us_oca/tr.d029:trMA.Ode4C14.text
ltx/en_us_public/tr.d029:trMA.Ode4C1T.incipit	@ltx/en_us_oca/tr.d029:trMA.Ode4C1T.incipit
ltx/en_us_public/tr.d029:trMA.Ode4C1T.melody	@ltx/en_us_oca/tr.d029:trMA.Ode4C1T.melody
ltx/en_us_public/tr.d029:trMA.Ode4C1T.mode	@ltx/en_us_dedes/tr.d029:trMA.Ode4C1T.mode
ltx/en_us_public/tr.d029:trMA.Ode4C1T.ode	@ltx/en_us_dedes/tr.d029:trMA.Ode4C1T.ode
ltx/en_us_public/tr.d029:trMA.Ode4C1T.text	@ltx/en_us_oca/tr.d029:trMA.Ode4C1T.text
ltx/en_us_public/tr.d029:trMA.Ode5C11.greekmelody	@ltx/en_us_dedes/tr.d029:trMA.Ode5C11.greekmelody
ltx/en_us_public/tr.d029:trMA.Ode5C11.incipit	@ltx/en_us_oca/tr.d029:trMA.Ode5C11.incipit
ltx/en_us_public/tr.d029:trMA.Ode5C11.melody	@ltx/en_us_oca/tr.d029:trMA.Ode5C11.melody
ltx/en_us_public/tr.d029:trMA.Ode5C11.mode	@ltx/en_us_dedes/tr.d029:trMA.Ode5C11.mode
ltx/en_us_public/tr.d029:trMA.Ode5C11.ode	@ltx/en_us_dedes/tr.d029:trMA.Ode5C11.ode
ltx/en_us_public/tr.d029:trMA.Ode5C11.text	@ltx/en_us_oca/tr.d029:trMA.Ode5C11.text
ltx/en_us_public/tr.d029:trMA.Ode5C12.incipit	@ltx/en_us_oca/tr.d029:trMA.Ode5C12.incipit
ltx/en_us_public/tr.d029:trMA.Ode5C12.melody	@ltx/en_us_oca/tr.d029:trMA.Ode5C12.melody
ltx/en_us_public/tr.d029:trMA.Ode5C12.mode	@ltx/en_us_dedes/tr.d029:trMA.Ode5C12.mode
ltx/en_us_public/tr.d029:trMA.Ode5C12.ode	@ltx/en_us_dedes/tr.d029:trMA.Ode5C12.ode
ltx/en_us_public/tr.d029:trMA.Ode5C12.text	@ltx/en_us_oca/tr.d029:trMA.Ode5C12.text
ltx/en_us_public/tr.d029:trMA.Ode5C13.incipit	@ltx/en_us_oca/tr.d029:trMA.Ode5C13.incipit
ltx/en_us_public/tr.d029:trMA.Ode5C13.melody	@ltx/en_us_oca/tr.d029:trMA.Ode5C13.melody
ltx/en_us_public/tr.d029:trMA.Ode5C13.mode	@ltx/en_us_dedes/tr.d029:trMA.Ode5C13.mode
ltx/en_us_public/tr.d029:trMA.Ode5C13.ode	@ltx/en_us_dedes/tr.d029:trMA.Ode5C13.ode
ltx/en_us_public/tr.d029:trMA.Ode5C13.text	@ltx/en_us_oca/tr.d029:trMA.Ode5C13.text
ltx/en_us_public/tr.d029:trMA.Ode5C14.incipit	@ltx/en_us_oca/tr.d029:trMA.Ode5C14.incipit
ltx/en_us_public/tr.d029:trMA.Ode5C14.melody	@ltx/en_us_oca/tr.d029:trMA.Ode5C14.melody
ltx/en_us_public/tr.d029:trMA.Ode5C14.mode	@ltx/en_us_dedes/tr.d029:trMA.Ode5C14.mode
ltx/en_us_public/tr.d029:trMA.Ode5C14.ode	@ltx/en_us_dedes/tr.d029:trMA.Ode5C14.ode
ltx/en_us_public/tr.d029:trMA.Ode5C14.text	@ltx/en_us_oca/tr.d029:trMA.Ode5C14.text
ltx/en_us_public/tr.d029:trMA.Ode5C1T.incipit	@ltx/en_us_oca/tr.d029:trMA.Ode5C1T.incipit
ltx/en_us_public/tr.d029:trMA.Ode5C1T.melody	@ltx/en_us_oca/tr.d029:trMA.Ode5C1T.melody
ltx/en_us_public/tr.d029:trMA.Ode5C1T.mode	@ltx/en_us_dedes/tr.d029:trMA.Ode5C1T.mode
ltx/en_us_public/tr.d029:trMA.Ode5C1T.ode	@ltx/en_us_dedes/tr.d029:trMA.Ode5C1T.ode
ltx/en_us_public/tr.d029:trMA.Ode5C1T.text	@ltx/en_us_oca/tr.d029:trMA.Ode5C1T.text
ltx/en_us_public/tr.d029:trMA.Ode6C11.greekmelody	@ltx/en_us_dedes/tr.d029:trMA.Ode6C11.greekmelody
ltx/en_us_public/tr.d029:trMA.Ode6C11.incipit	@ltx/en_us_oca/tr.d029:trMA.Ode6C11.incipit
ltx/en_us_public/tr.d029:trMA.Ode6C11.melody	@ltx/en_us_oca/tr.d029:trMA.Ode6C11.melody
ltx/en_us_public/tr.d029:trMA.Ode6C11.mode	@ltx/en_us_dedes/tr.d029:trMA.Ode6C11.mode
ltx/en_us_public/tr.d029:trMA.Ode6C11.ode	@ltx/en_us_dedes/tr.d029:trMA.Ode6C11.ode
ltx/en_us_public/tr.d029:trMA.Ode6C11.text	@ltx/en_us_oca/tr.d029:trMA.Ode6C11.text
ltx/en_us_public/tr.d029:trMA.Ode6C12.incipit	@ltx/en_us_oca/tr.d029:trMA.Ode6C12.incipit
ltx/en_us_public/tr.d029:trMA.Ode6C12.melody	@ltx/en_us_oca/tr.d029:trMA.Ode6C12.melody
ltx/en_us_public/tr.d029:trMA.Ode6C12.mode	@ltx/en_us_dedes/tr.d029:trMA.Ode6C12.mode
ltx/en_us_public/tr.d029:trMA.Ode6C12.ode	@ltx/en_us_dedes/tr.d029:trMA.Ode6C12.ode
ltx/en_us_public/tr.d029:trMA.Ode6C12.text	@ltx/en_us_oca/tr.d029:trMA.Ode6C12.text
ltx/en_us_public/tr.d029:trMA.Ode6C13.incipit	@ltx/en_us_oca/tr.d029:trMA.Ode6C13.incipit
ltx/en_us_public/tr.d029:trMA.Ode6C13.melody	@ltx/en_us_oca/tr.d029:trMA.Ode6C13.melody
ltx/en_us_public/tr.d029:trMA.Ode6C13.mode	@ltx/en_us_dedes/tr.d029:trMA.Ode6C13.mode
ltx/en_us_public/tr.d029:trMA.Ode6C13.ode	@ltx/en_us_dedes/tr.d029:trMA.Ode6C13.ode
ltx/en_us_public/tr.d029:trMA.Ode6C13.text	@ltx/en_us_oca/tr.d029:trMA.Ode6C13.text
ltx/en_us_public/tr.d029:trMA.Ode6C1T.incipit	@ltx/en_us_oca/tr.d029:trMA.Ode6C1T.incipit
ltx/en_us_public/tr.d029:trMA.Ode6C1T.melody	@ltx/en_us_oca/tr.d029:trMA.Ode6C1T.melody
ltx/en_us_public/tr.d029:trMA.Ode6C1T.mode	@ltx/en_us_dedes/tr.d029:trMA.Ode6C1T.mode
ltx/en_us_public/tr.d029:trMA.Ode6C1T.ode	@ltx/en_us_dedes/tr.d029:trMA.Ode6C1T.ode
ltx/en_us_public/tr.d029:trMA.Ode6C1T.text	@ltx/en_us_oca/tr.d029:trMA.Ode6C1T.text
ltx/en_us_public/tr.d029:trMA.Ode7C11.greekmelody	@ltx/en_us_dedes/tr.d029:trMA.Ode7C11.greekmelody
ltx/en_us_public/tr.d029:trMA.Ode7C11.incipit	@ltx/en_us_oca/tr.d029:trMA.Ode7C11.incipit
ltx/en_us_public/tr.d029:trMA.Ode7C11.melody	@ltx/en_us_oca/tr.d029:trMA.Ode7C11.melody
ltx/en_us_public/tr.d029:trMA.Ode7C11.mode	@ltx/en_us_dedes/tr.d029:trMA.Ode7C11.mode
ltx/en_us_public/tr.d029:trMA.Ode7C11.ode	@ltx/en_us_dedes/tr.d029:trMA.Ode7C11.ode
ltx/en_us_public/tr.d029:trMA.Ode7C11.text	@ltx/en_us_oca/tr.d029:trMA.Ode7C11.text
ltx/en_us_public/tr.d029:trMA.Ode7C12.incipit	@ltx/en_us_oca/tr.d029:trMA.Ode7C12.incipit
ltx/en_us_public/tr.d029:trMA.Ode7C12.melody	@ltx/en_us_oca/tr.d029:trMA.Ode7C12.melody
ltx/en_us_public/tr.d029:trMA.Ode7C12.mode	@ltx/en_us_dedes/tr.d029:trMA.Ode7C12.mode
ltx/en_us_public/tr.d029:trMA.Ode7C12.ode	@ltx/en_us_dedes/tr.d029:trMA.Ode7C12.ode
ltx/en_us_public/tr.d029:trMA.Ode7C12.text	@ltx/en_us_oca/tr.d029:trMA.Ode7C12.text
ltx/en_us_public/tr.d029:trMA.Ode7C13.incipit	@ltx/en_us_oca/tr.d029:trMA.Ode7C13.incipit
ltx/en_us_public/tr.d029:trMA.Ode7C13.melody	@ltx/en_us_oca/tr.d029:trMA.Ode7C13.melody
ltx/en_us_public/tr.d029:trMA.Ode7C13.mode	@ltx/en_us_dedes/tr.d029:trMA.Ode7C13.mode
ltx/en_us_public/tr.d029:trMA.Ode7C13.ode	@ltx/en_us_dedes/tr.d029:trMA.Ode7C13.ode
ltx/en_us_public/tr.d029:trMA.Ode7C13.text	@ltx/en_us_oca/tr.d029:trMA.Ode7C13.text
ltx/en_us_public/tr.d029:trMA.Ode7C1T.incipit	@ltx/en_us_oca/tr.d029:trMA.Ode7C1T.incipit
ltx/en_us_public/tr.d029:trMA.Ode7C1T.melody	@ltx/en_us_oca/tr.d029:trMA.Ode7C1T.melody
ltx/en_us_public/tr.d029:trMA.Ode7C1T.mode	@ltx/en_us_dedes/tr.d029:trMA.Ode7C1T.mode
ltx/en_us_public/tr.d029:trMA.Ode7C1T.ode	@ltx/en_us_dedes/tr.d029:trMA.Ode7C1T.ode
ltx/en_us_public/tr.d029:trMA.Ode7C1T.text	@ltx/en_us_oca/tr.d029:trMA.Ode7C1T.text
ltx/en_us_public/tr.d029:trMA.Ode8C11.greekmelody	@ltx/en_us_dedes/tr.d029:trMA.Ode8C11.greekmelody
ltx/en_us_public/tr.d029:trMA.Ode8C11.incipit	@ltx/en_us_oca/tr.d029:trMA.Ode8C11.incipit
ltx/en_us_public/tr.d029:trMA.Ode8C11.melody	@ltx/en_us_oca/tr.d029:trMA.Ode8C11.melody
ltx/en_us_public/tr.d029:trMA.Ode8C11.mode	@ltx/en_us_dedes/tr.d029:trMA.Ode8C11.mode
ltx/en_us_public/tr.d029:trMA.Ode8C11.ode	@ltx/en_us_dedes/tr.d029:trMA.Ode8C11.ode
ltx/en_us_public/tr.d029:trMA.Ode8C11.text	@ltx/en_us_oca/tr.d029:trMA.Ode8C11.text
ltx/en_us_public/tr.d029:trMA.Ode8C12.incipit	@ltx/en_us_oca/tr.d029:trMA.Ode8C12.incipit
ltx/en_us_public/tr.d029:trMA.Ode8C12.melody	@ltx/en_us_oca/tr.d029:trMA.Ode8C12.melody
ltx/en_us_public/tr.d029:trMA.Ode8C12.mode	@ltx/en_us_dedes/tr.d029:trMA.Ode8C12.mode
ltx/en_us_public/tr.d029:trMA.Ode8C12.ode	@ltx/en_us_dedes/tr.d029:trMA.Ode8C12.ode
ltx/en_us_public/tr.d029:trMA.Ode8C12.text	@ltx/en_us_oca/tr.d029:trMA.Ode8C12.text
ltx/en_us_public/tr.d029:trMA.Ode8C13.incipit	@ltx/en_us_oca/tr.d029:trMA.Ode8C13.incipit
ltx/en_us_public/tr.d029:trMA.Ode8C13.melody	@ltx/en_us_oca/tr.d029:trMA.Ode8C13.melody
ltx/en_us_public/tr.d029:trMA.Ode8C13.mode	@ltx/en_us_dedes/tr.d029:trMA.Ode8C13.mode
ltx/en_us_public/tr.d029:trMA.Ode8C13.ode	@ltx/en_us_dedes/tr.d029:trMA.Ode8C13.ode
ltx/en_us_public/tr.d029:trMA.Ode8C13.text	@ltx/en_us_oca/tr.d029:trMA.Ode8C13.text
ltx/en_us_public/tr.d029:trMA.Ode8C1T.incipit	@ltx/en_us_oca/tr.d029:trMA.Ode8C1T.incipit
ltx/en_us_public/tr.d029:trMA.Ode8C1T.melody	@ltx/en_us_oca/tr.d029:trMA.Ode8C1T.melody
ltx/en_us_public/tr.d029:trMA.Ode8C1T.mode	@ltx/en_us_dedes/tr.d029:trMA.Ode8C1T.mode
ltx/en_us_public/tr.d029:trMA.Ode8C1T.ode	@ltx/en_us_dedes/tr.d029:trMA.Ode8C1T.ode
ltx/en_us_public/tr.d029:trMA.Ode8C1T.text	@ltx/en_us_oca/tr.d029:trMA.Ode8C1T.text
ltx/en_us_public/tr.d029:trMA.Ode9C11.greekmelody	@ltx/en_us_dedes/tr.d029:trMA.Ode9C11.greekmelody
ltx/en_us_public/tr.d029:trMA.Ode9C11.incipit	@ltx/en_us_oca/tr.d029:trMA.Ode9C11.incipit
ltx/en_us_public/tr.d029:trMA.Ode9C11.melody	@ltx/en_us_oca/tr.d029:trMA.Ode9C11.melody
ltx/en_us_public/tr.d029:trMA.Ode9C11.mode	@ltx/en_us_dedes/tr.d029:trMA.Ode9C11.mode
ltx/en_us_public/tr.d029:trMA.Ode9C11.ode	@ltx/en_us_dedes/tr.d029:trMA.Ode9C11.ode
ltx/en_us_public/tr.d029:trMA.Ode9C11.text	@ltx/en_us_oca/tr.d029:trMA.Ode9C11.text
ltx/en_us_public/tr.d029:trMA.Ode9C12.incipit	@ltx/en_us_oca/tr.d029:trMA.Ode9C12.incipit
ltx/en_us_public/tr.d029:trMA.Ode9C12.melody	@ltx/en_us_oca/tr.d029:trMA.Ode9C12.melody
ltx/en_us_public/tr.d029:trMA.Ode9C12.mode	@ltx/en_us_dedes/tr.d029:trMA.Ode9C12.mode
ltx/en_us_public/tr.d029:trMA.Ode9C12.ode	@ltx/en_us_dedes/tr.d029:trMA.Ode9C12.ode
ltx/en_us_public/tr.d029:trMA.Ode9C12.text	@ltx/en_us_oca/tr.d029:trMA.Ode9C12.text
ltx/en_us_public/tr.d029:trMA.Ode9C13.incipit	@ltx/en_us_oca/tr.d029:trMA.Ode9C13.incipit
ltx/en_us_public/tr.d029:trMA.Ode9C13.melody	@ltx/en_us_oca/tr.d029:trMA.Ode9C13.melody
ltx/en_us_public/tr.d029:trMA.Ode9C13.mode	@ltx/en_us_dedes/tr.d029:trMA.Ode9C13.mode
ltx/en_us_public/tr.d029:trMA.Ode9C13.ode	@ltx/en_us_dedes/tr.d029:trMA.Ode9C13.ode
ltx/en_us_public/tr.d029:trMA.Ode9C13.text	@ltx/en_us_oca/tr.d029:trMA.Ode9C13.text
ltx/en_us_public/tr.d029:trMA.Ode9C1T.incipit	@ltx/en_us_oca/tr.d029:trMA.Ode9C1T.incipit
ltx/en_us_public/tr.d029:trMA.Ode9C1T.melody	@ltx/en_us_oca/tr.d029:trMA.Ode9C1T.melody
ltx/en_us_public/tr.d029:trMA.Ode9C1T.mode	@ltx/en_us_dedes/tr.d029:trMA.Ode9C1T.mode
ltx/en_us_public/tr.d029:trMA.Ode9C1T.ode	@ltx/en_us_dedes/tr.d029:trMA.Ode9C1T.ode
ltx/en_us_public/tr.d029:trMA.Ode9C1T.text	@ltx/en_us_oca/tr.d029:trMA.Ode9C1T.text
ltx/en_us_public/tr.d029:trMA.Oikos1.text	@ltx/en_us_duvall/tr.d029:trMA.Oikos1.text
ltx/en_us_public/tr.d029:trMA.PostGospelBoth.incipit	@ltx/en_us_dedes/tr.d029:trMA.PostGospelBoth.incipit
ltx/en_us_public/tr.d029:trMA.PostGospelBoth.melody	@ltx/en_us_dedes/tr.d029:trMA.PostGospelBoth.melody
ltx/en_us_public/tr.d029:trMA.PostGospelBoth.mode	@ltx/en_us_dedes/tr.d029:trMA.PostGospelBoth.mode
ltx/en_us_public/tr.d029:trMA.PostGospelBoth.text	@ltx/en_us_dedes/tr.d029:trMA.PostGospelBoth.text
ltx/en_us_public/tr.d029:trMA.PostGospelGlory.incipit	@ltx/en_us_dedes/tr.d029:trMA.PostGospelGlory.incipit
ltx/en_us_public/tr.d029:trMA.PostGospelGlory.melody	@ltx/en_us_dedes/tr.d029:trMA.PostGospelGlory.melody
ltx/en_us_public/tr.d029:trMA.PostGospelGlory.mode	@ltx/en_us_dedes/tr.d029:trMA.PostGospelGlory.mode
ltx/en_us_public/tr.d029:trMA.PostGospelGlory.text	@ltx/en_us_dedes/tr.d029:trMA.PostGospelGlory.text
ltx/en_us_public/tr.d029:trMA.PostGospelIdiomelon.incipit	@ltx/en_us_dedes/tr.d029:trMA.PostGospelIdiomelon.incipit
ltx/en_us_public/tr.d029:trMA.PostGospelIdiomelon.melody	@ltx/en_us_dedes/tr.d029:trMA.PostGospelIdiomelon.melody
ltx/en_us_public/tr.d029:trMA.PostGospelIdiomelon.mode	@ltx/en_us_dedes/tr.d029:trMA.PostGospelIdiomelon.mode
ltx/en_us_public/tr.d029:trMA.PostGospelIdiomelon.text	@ltx/en_us_dedes/tr.d029:trMA.PostGospelIdiomelon.text
ltx/en_us_public/tr.d029:trSV.AposGlory.incipit	@ltx/en_us_dedes/tr.d029:trSV.AposGlory.incipit
ltx/en_us_public/tr.d029:trSV.AposGlory.melody	@ltx/en_us_dedes/tr.d029:trSV.AposGlory.melody
ltx/en_us_public/tr.d029:trSV.AposGlory.mode	@ltx/en_us_dedes/tr.d029:trSV.AposGlory.mode
ltx/en_us_public/tr.d029:trSV.AposGlory.text	@ltx/en_us_dedes/tr.d029:trSV.AposGlory.text
ltx/en_us_public/tr.d029:trSV.Aposticha1.incipit	@ltx/en_us_dedes/tr.d029:trSV.Aposticha1.incipit
ltx/en_us_public/tr.d029:trSV.Aposticha1.melody	@ltx/en_us_dedes/tr.d029:trSV.Aposticha1.melody
ltx/en_us_public/tr.d029:trSV.Aposticha1.mode	@ltx/en_us_dedes/tr.d029:trSV.Aposticha1.mode
ltx/en_us_public/tr.d029:trSV.Aposticha1.text	@ltx/en_us_dedes/tr.d029:trSV.Aposticha1.text
ltx/en_us_public/tr.d029:trSV.Aposticha2.incipit	@ltx/en_us_dedes/tr.d029:trSV.Aposticha2.incipit
ltx/en_us_public/tr.d029:trSV.Aposticha2.melody	@ltx/en_us_dedes/tr.d029:trSV.Aposticha2.melody
ltx/en_us_public/tr.d029:trSV.Aposticha2.mode	@ltx/en_us_dedes/tr.d029:trSV.Aposticha2.mode
ltx/en_us_public/tr.d029:trSV.Aposticha2.text	@ltx/en_us_dedes/tr.d029:trSV.Aposticha2.text
ltx/en_us_public/tr.d029:trSV.Aposticha3.incipit	@ltx/en_us_dedes/tr.d029:trSV.Aposticha3.incipit
ltx/en_us_public/tr.d029:trSV.Aposticha3.melody	@ltx/en_us_dedes/tr.d029:trSV.Aposticha3.melody
ltx/en_us_public/tr.d029:trSV.Aposticha3.mode	@ltx/en_us_dedes/tr.d029:trSV.Aposticha3.mode
ltx/en_us_public/tr.d029:trSV.Aposticha3.text	@ltx/en_us_dedes/tr.d029:trSV.Aposticha3.text
ltx/en_us_public/tr.d029:trSV.SticGlory.incipit	@ltx/en_us_dedes/tr.d029:trSV.SticGlory.incipit
ltx/en_us_public/tr.d029:trSV.SticGlory.melody	@ltx/en_us_dedes/tr.d029:trSV.SticGlory.melody
ltx/en_us_public/tr.d029:trSV.SticGlory.mode	@ltx/en_us_dedes/tr.d029:trSV.SticGlory.mode
ltx/en_us_public/tr.d029:trSV.SticGlory.text	@ltx/en_us_dedes/tr.d029:trSV.SticGlory.text
ltx/en_us_public/tr.d029:trSV.Stichera1.incipit	@ltx/en_us_dedes/tr.d029:trSV.Stichera1.incipit
ltx/en_us_public/tr.d029:trSV.Stichera1.melody	@ltx/en_us_dedes/tr.d029:trSV.Stichera1.melody
ltx/en_us_public/tr.d029:trSV.Stichera1.mode	@ltx/en_us_dedes/tr.d029:trSV.Stichera1.mode
ltx/en_us_public/tr.d029:trSV.Stichera1.text	@ltx/en_us_dedes/tr.d029:trSV.Stichera1.text
ltx/en_us_public/tr.d029:trSV.Stichera2.incipit	@ltx/en_us_dedes/tr.d029:trSV.Stichera2.incipit
ltx/en_us_public/tr.d029:trSV.Stichera2.melody	@ltx/en_us_dedes/tr.d029:trSV.Stichera2.melody
ltx/en_us_public/tr.d029:trSV.Stichera2.mode	@ltx/en_us_dedes/tr.d029:trSV.Stichera2.mode
ltx/en_us_public/tr.d029:trSV.Stichera2.text	@ltx/en_us_dedes/tr.d029:trSV.Stichera2.text
ltx/en_us_public/tr.d029:trSV.Stichera3.incipit	@ltx/en_us_dedes/tr.d029:trSV.Stichera3.incipit
ltx/en_us_public/tr.d029:trSV.Stichera3.melody	@ltx/en_us_dedes/tr.d029:trSV.Stichera3.melody
ltx/en_us_public/tr.d029:trSV.Stichera3.mode	@ltx/en_us_dedes/tr.d029:trSV.Stichera3.mode
ltx/en_us_public/tr.d029:trSV.Stichera3.text	@ltx/en_us_dedes/tr.d029:trSV.Stichera3.text
ltx/en_us_public/tr.d029:trSV.Stichera4.incipit	@ltx/en_us_dedes/tr.d029:trSV.Stichera4.incipit
ltx/en_us_public/tr.d029:trSV.Stichera4.melody	@ltx/en_us_dedes/tr.d029:trSV.Stichera4.melody
ltx/en_us_public/tr.d029:trSV.Stichera4.mode	@ltx/en_us_dedes/tr.d029:trSV.Stichera4.mode
ltx/en_us_public/tr.d029:trSV.Stichera4.text	@ltx/en_us_dedes/tr.d029:trSV.Stichera4.text
ltx/en_us_public/tr.d029:trSV.poet	@ltx/en_us_dedes/tr.d029:trSV.poet
ltx/en_us_public/tr.d029:trSY.commemoration.couplet1.title	@ltx/en_us_dedes/tr.d029:trSY.commemoration.couplet1.title
ltx/en_us_public/tr.d029:trSY.commemoration.couplet1.verse1	@ltx/en_us_dedes/tr.d029:trSY.commemoration.couplet1.verse1
ltx/en_us_public/tr.d029:trSY.commemoration.couplet1.verse2	@ltx/en_us_dedes/tr.d029:trSY.commemoration.couplet1.verse2
ltx/en_us_public/tr.d029:trSY.commemoration.narration.p01	@ltx/en_us_dedes/tr.d029:trSY.commemoration.narration.p01
ltx/en_us_public/tr.d029:trSY.commemoration.narration.p02	@ltx/en_us_dedes/tr.d029:trSY.commemoration.narration.p02
ltx/en_us_public/tr.d029:trSY.commemoration.narration.p03	@ltx/en_us_dedes/tr.d029:trSY.commemoration.narration.p03
ltx/en_us_public/tr.d029:trSY.commemoration.narration.p04	@ltx/en_us_dedes/tr.d029:trSY.commemoration.narration.p04
ltx/en_us_public/tr.d029:trSY.commemoration.narration.p05	@ltx/en_us_dedes/tr.d029:trSY.commemoration.narration.p05
ltx/en_us_public/tr.d029:trSY.commemoration.narration.p06	@ltx/en_us_dedes/tr.d029:trSY.commemoration.narration.p06
ltx/en_us_public/tr.d029:trSY.commemoration.narration.p07	@ltx/en_us_dedes/tr.d029:trSY.commemoration.narration.p07
ltx/en_us_public/tr.d029:trSY.commemoration.text	@ltx/en_us_dedes/tr.d029:trSY.commemoration.text
ltx/en_us_public/tr.d029:trSY.lastline	@ltx/en_us_dedes/tr.d029:trSY.lastline
ltx/en_us_public/tr.d029:trVE.ApolTheotokion.incipit	@ltx/en_us_goadedes/tr.d029:trVE.ApolTheotokion.incipit
ltx/en_us_public/tr.d029:trVE.ApolTheotokion.melody	@ltx/en_us_goadedes/tr.d029:trVE.ApolTheotokion.melody
ltx/en_us_public/tr.d029:trVE.ApolTheotokion.mode	@ltx/en_us_goadedes/tr.d029:trVE.ApolTheotokion.mode
ltx/en_us_public/tr.d029:trVE.ApolTheotokion.text	@ltx/en_us_goadedes/tr.d029:trVE.ApolTheotokion.text
ltx/en_us_public/tr.d029:trVE.Apolytikion1.incipit	@ltx/en_us_dedes/tr.d029:trVE.Apolytikion1.incipit
ltx/en_us_public/tr.d029:trVE.Apolytikion1.melody	@ltx/en_us_dedes/tr.d029:trVE.Apolytikion1.melody
ltx/en_us_public/tr.d029:trVE.Apolytikion1.mode	@ltx/en_us_dedes/tr.d029:trVE.Apolytikion1.mode
ltx/en_us_public/tr.d029:trVE.Apolytikion1.text	@ltx/en_us_dedes/tr.d029:trVE.Apolytikion1.text
ltx/en_us_public/tr.d029:trVE.AposGlory.incipit	@ltx/en_us_dedes/tr.d029:trVE.AposGlory.incipit
ltx/en_us_public/tr.d029:trVE.AposGlory.melody	@ltx/en_us_dedes/tr.d029:trVE.AposGlory.melody
ltx/en_us_public/tr.d029:trVE.AposGlory.mode	@ltx/en_us_dedes/tr.d029:trVE.AposGlory.mode
ltx/en_us_public/tr.d029:trVE.AposGlory.text	@ltx/en_us_dedes/tr.d029:trVE.AposGlory.text
ltx/en_us_public/tr.d029:trVE.AposTheotokion.incipit	@ltx/en_us_goadedes/tr.d029:trVE.AposTheotokion.incipit
ltx/en_us_public/tr.d029:trVE.AposTheotokion.melody	@ltx/en_us_goadedes/tr.d029:trVE.AposTheotokion.melody
ltx/en_us_public/tr.d029:trVE.AposTheotokion.mode	@ltx/en_us_goadedes/tr.d029:trVE.AposTheotokion.mode
ltx/en_us_public/tr.d029:trVE.AposTheotokion.text	@ltx/en_us_goadedes/tr.d029:trVE.AposTheotokion.text
ltx/en_us_public/tr.d029:trVE.LityBoth.incipit	@ltx/en_us_dedes/tr.d029:trVE.LityBoth.incipit
ltx/en_us_public/tr.d029:trVE.LityBoth.melody	@ltx/en_us_dedes/tr.d029:trVE.LityBoth.melody
ltx/en_us_public/tr.d029:trVE.LityBoth.mode	@ltx/en_us_dedes/tr.d029:trVE.LityBoth.mode
ltx/en_us_public/tr.d029:trVE.LityBoth.text	@ltx/en_us_dedes/tr.d029:trVE.LityBoth.text
ltx/en_us_public/tr.d029:trVE.LityGlory.incipit	@ltx/en_us_dedes/tr.d029:trVE.LityGlory.incipit
ltx/en_us_public/tr.d029:trVE.LityGlory.melody	@ltx/en_us_dedes/tr.d029:trVE.LityGlory.melody
ltx/en_us_public/tr.d029:trVE.LityGlory.mode	@ltx/en_us_dedes/tr.d029:trVE.LityGlory.mode
ltx/en_us_public/tr.d029:trVE.LityGlory.text	@ltx/en_us_dedes/tr.d029:trVE.LityGlory.text
ltx/en_us_public/tr.d029:trVE.SticGlory.incipit	@ltx/en_us_dedes/tr.d029:trVE.SticGlory.incipit
ltx/en_us_public/tr.d029:trVE.SticGlory.melody	@ltx/en_us_dedes/tr.d029:trVE.SticGlory.melody
ltx/en_us_public/tr.d029:trVE.SticGlory.mode	@ltx/en_us_dedes/tr.d029:trVE.SticGlory.mode
ltx/en_us_public/tr.d029:trVE.SticGlory.text	@ltx/en_us_dedes/tr.d029:trVE.SticGlory.text
ltx/en_us_public/tr.d029:trVE.Stichera01.incipit	@ltx/en_us_dedes/tr.d029:trVE.Stichera01.incipit
ltx/en_us_public/tr.d029:trVE.Stichera01.melody	@ltx/en_us_dedes/tr.d029:trVE.Stichera01.melody
ltx/en_us_public/tr.d029:trVE.Stichera01.mode	@ltx/en_us_dedes/tr.d029:trVE.Stichera01.mode
ltx/en_us_public/tr.d029:trVE.Stichera01.text	@ltx/en_us_dedes/tr.d029:trVE.Stichera01.text
ltx/en_us_public/tr.d029:trVE.Stichera02.incipit	@ltx/en_us_dedes/tr.d029:trVE.Stichera02.incipit
ltx/en_us_public/tr.d029:trVE.Stichera02.melody	@ltx/en_us_dedes/tr.d029:trVE.Stichera02.melody
ltx/en_us_public/tr.d029:trVE.Stichera02.mode	@ltx/en_us_dedes/tr.d029:trVE.Stichera02.mode
ltx/en_us_public/tr.d029:trVE.Stichera02.text	@ltx/en_us_dedes/tr.d029:trVE.Stichera02.text
ltx/en_us_public/tr.d029:trVE.Stichera03.incipit	@ltx/en_us_dedes/tr.d029:trVE.Stichera03.incipit
ltx/en_us_public/tr.d029:trVE.Stichera03.melody	@ltx/en_us_dedes/tr.d029:trVE.Stichera03.melody
ltx/en_us_public/tr.d029:trVE.Stichera03.mode	@ltx/en_us_dedes/tr.d029:trVE.Stichera03.mode
ltx/en_us_public/tr.d029:trVE.Stichera03.text	@ltx/en_us_dedes/tr.d029:trVE.Stichera03.text
ltx/en_us_public/tr.d029:trVE.Stichera04.incipit	@ltx/en_us_goadedes/tr.d029:trVE.Stichera04.incipit
ltx/en_us_public/tr.d029:trVE.Stichera04.melody	@ltx/en_us_goadedes/tr.d029:trVE.Stichera04.melody
ltx/en_us_public/tr.d029:trVE.Stichera04.mode	@ltx/en_us_goadedes/tr.d029:trVE.Stichera04.mode
ltx/en_us_public/tr.d029:trVE.Stichera04.text	@ltx/en_us_goadedes/tr.d029:trVE.Stichera04.text
