ltx/en_us_public/ty.li.incipit:tyDAin.ChristmasEve.text	@ltx/en_us_dedes/ty.li.incipit:tyDAin.ChristmasEve.text
ltx/en_us_public/ty.li.incipit:tyDAin.EpiphanyEve.text	@ltx/en_us_dedes/ty.li.incipit:tyDAin.EpiphanyEve.text
ltx/en_us_public/ty.li.incipit:tyDAin.HolySaturday.text	@ltx/en_us_dedes/ty.li.incipit:tyDAin.HolySaturday.text
ltx/en_us_public/ty.li.incipit:tyDAin.HolyThursday.text	@ltx/en_us_dedes/ty.li.incipit:tyDAin.HolyThursday.text
ltx/en_us_public/ty.li.incipit:tyDAin.LeavetakingOfFeast.text	@ltx/en_us_dedes/ty.li.incipit:tyDAin.LeavetakingOfFeast.text
ltx/en_us_public/ty.li.incipit:tyDAin.SundayAfterChristmas.text	@ltx/en_us_dedes/ty.li.incipit:tyDAin.SundayAfterChristmas.text
ltx/en_us_public/ty.li.incipit:tyDAin.SundayAfterCross.text	@ltx/en_us_dedes/ty.li.incipit:tyDAin.SundayAfterCross.text
ltx/en_us_public/ty.li.incipit:tyDAin.SundayAfterDormition.text	@ltx/en_us_dedes/ty.li.incipit:tyDAin.SundayAfterDormition.text
ltx/en_us_public/ty.li.incipit:tyDAin.SundayAfterEntry.text	@ltx/en_us_dedes/ty.li.incipit:tyDAin.SundayAfterEntry.text
ltx/en_us_public/ty.li.incipit:tyDAin.SundayAfterEpiphany.text	@ltx/en_us_dedes/ty.li.incipit:tyDAin.SundayAfterEpiphany.text
ltx/en_us_public/ty.li.incipit:tyDAin.SundayAfterMeeting.text	@ltx/en_us_dedes/ty.li.incipit:tyDAin.SundayAfterMeeting.text
ltx/en_us_public/ty.li.incipit:tyDAin.SundayAfterTheotokosBirth.text	@ltx/en_us_dedes/ty.li.incipit:tyDAin.SundayAfterTheotokosBirth.text
ltx/en_us_public/ty.li.incipit:tyDAin.SundayAfterTransfiguration.text	@ltx/en_us_dedes/ty.li.incipit:tyDAin.SundayAfterTransfiguration.text
ltx/en_us_public/ty.li.incipit:tyDAin.SundayBeforeChristmas.text	@ltx/en_us_dedes/ty.li.incipit:tyDAin.SundayBeforeChristmas.text
ltx/en_us_public/ty.li.incipit:tyDAin.SundayOfForefathers.text	@ltx/en_us_dedes/ty.li.incipit:tyDAin.SundayOfForefathers.text
ltx/en_us_public/ty.li.incipit:tyDAin.SundayOfHolyFathers.text	@ltx/en_us_dedes/ty.li.incipit:tyDAin.SundayOfHolyFathers.text
ltx/en_us_public/ty.li.incipit:tyKOin.Aug05.Kontakion.text	@ltx/en_us_dedes/ty.li.incipit:tyKOin.Aug05.Kontakion.text
ltx/en_us_public/ty.li.incipit:tyKOin.Aug06.Kontakion.text	@ltx/en_us_dedes/ty.li.incipit:tyKOin.Aug06.Kontakion.text
ltx/en_us_public/ty.li.incipit:tyKOin.Aug06.Kontakion.title	@ltx/en_us_dedes/ty.li.incipit:tyKOin.Aug06.Kontakion.title
ltx/en_us_public/ty.li.incipit:tyKOin.Aug14.Kontakion.text	@ltx/en_us_dedes/ty.li.incipit:tyKOin.Aug14.Kontakion.text
ltx/en_us_public/ty.li.incipit:tyKOin.Aug15.Kontakion.text	@ltx/en_us_dedes/ty.li.incipit:tyKOin.Aug15.Kontakion.text
ltx/en_us_public/ty.li.incipit:tyKOin.Aug15.Kontakion.title	@ltx/en_us_dedes/ty.li.incipit:tyKOin.Aug15.Kontakion.title
ltx/en_us_public/ty.li.incipit:tyKOin.Aug31.Kontakion.text	@ltx/en_us_dedes/ty.li.incipit:tyKOin.Aug31.Kontakion.text
ltx/en_us_public/ty.li.incipit:tyKOin.Dec09.Kontakion.text	@ltx/en_us_dedes/ty.li.incipit:tyKOin.Dec09.Kontakion.text
ltx/en_us_public/ty.li.incipit:tyKOin.Dec20.Kontakion.text	@ltx/en_us_dedes/ty.li.incipit:tyKOin.Dec20.Kontakion.text
ltx/en_us_public/ty.li.incipit:tyKOin.Dec20.Kontakion.title	@ltx/en_us_dedes/ty.li.incipit:tyKOin.Dec20.Kontakion.title
ltx/en_us_public/ty.li.incipit:tyKOin.Dec25.Kontakion.text	@ltx/en_us_dedes/ty.li.incipit:tyKOin.Dec25.Kontakion.text
ltx/en_us_public/ty.li.incipit:tyKOin.Dec25.Kontakion.title	@ltx/en_us_dedes/ty.li.incipit:tyKOin.Dec25.Kontakion.title
ltx/en_us_public/ty.li.incipit:tyKOin.Feb01.Kontakion.text	@ltx/en_us_dedes/ty.li.incipit:tyKOin.Feb01.Kontakion.text
ltx/en_us_public/ty.li.incipit:tyKOin.Feb02.Kontakion.text	@ltx/en_us_dedes/ty.li.incipit:tyKOin.Feb02.Kontakion.text
ltx/en_us_public/ty.li.incipit:tyKOin.Feb02.Kontakion.title	@ltx/en_us_dedes/ty.li.incipit:tyKOin.Feb02.Kontakion.title
ltx/en_us_public/ty.li.incipit:tyKOin.Jan01.Kontakion.text	@ltx/en_us_dedes/ty.li.incipit:tyKOin.Jan01.Kontakion.text
ltx/en_us_public/ty.li.incipit:tyKOin.Jan02.Kontakion.text	@ltx/en_us_dedes/ty.li.incipit:tyKOin.Jan02.Kontakion.text
ltx/en_us_public/ty.li.incipit:tyKOin.Jan06.Kontakion.text	@ltx/en_us_dedes/ty.li.incipit:tyKOin.Jan06.Kontakion.text
ltx/en_us_public/ty.li.incipit:tyKOin.Jul02.Kontakion.text	@ltx/en_us_dedes/ty.li.incipit:tyKOin.Jul02.Kontakion.text
ltx/en_us_public/ty.li.incipit:tyKOin.Jul25.Kontakion.text	@ltx/en_us_dedes/ty.li.incipit:tyKOin.Jul25.Kontakion.text
ltx/en_us_public/ty.li.incipit:tyKOin.Kontakion.title	@ltx/en_us_dedes/ty.li.incipit:tyKOin.Kontakion.title
ltx/en_us_public/ty.li.incipit:tyKOin.Mar24.Kontakion.text	@ltx/en_us_dedes/ty.li.incipit:tyKOin.Mar24.Kontakion.text
ltx/en_us_public/ty.li.incipit:tyKOin.Mar25.Kontakion.text	@ltx/en_us_dedes/ty.li.incipit:tyKOin.Mar25.Kontakion.text
ltx/en_us_public/ty.li.incipit:tyKOin.Mar25.Kontakion.title	@ltx/en_us_dedes/ty.li.incipit:tyKOin.Mar25.Kontakion.title
ltx/en_us_public/ty.li.incipit:tyKOin.Nov20.Kontakion.text	@ltx/en_us_dedes/ty.li.incipit:tyKOin.Nov20.Kontakion.text
ltx/en_us_public/ty.li.incipit:tyKOin.Nov21.Kontakion.text	@ltx/en_us_dedes/ty.li.incipit:tyKOin.Nov21.Kontakion.text
ltx/en_us_public/ty.li.incipit:tyKOin.Nov21.Kontakion.title	@ltx/en_us_dedes/ty.li.incipit:tyKOin.Nov21.Kontakion.title
ltx/en_us_public/ty.li.incipit:tyKOin.Oct28.Kontakion.text	@ltx/en_us_dedes/ty.li.incipit:tyKOin.Oct28.Kontakion.text
ltx/en_us_public/ty.li.incipit:tyKOin.Sep01.Kontakion.text	@ltx/en_us_dedes/ty.li.incipit:tyKOin.Sep01.Kontakion.text
ltx/en_us_public/ty.li.incipit:tyKOin.Sep07.Kontakion.text	@ltx/en_us_dedes/ty.li.incipit:tyKOin.Sep07.Kontakion.text
ltx/en_us_public/ty.li.incipit:tyKOin.Sep08.Kontakion.text	@ltx/en_us_dedes/ty.li.incipit:tyKOin.Sep08.Kontakion.text
ltx/en_us_public/ty.li.incipit:tyKOin.Sep08.Kontakion.title	@ltx/en_us_dedes/ty.li.incipit:tyKOin.Sep08.Kontakion.title
ltx/en_us_public/ty.li.incipit:tyKOin.Sep13.Kontakion.text	@ltx/en_us_dedes/ty.li.incipit:tyKOin.Sep13.Kontakion.text
ltx/en_us_public/ty.li.incipit:tyKOin.Sep14.Kontakion.text	@ltx/en_us_dedes/ty.li.incipit:tyKOin.Sep14.Kontakion.text
ltx/en_us_public/ty.li.incipit:tyKOin.Sep14.Kontakion.title	@ltx/en_us_dedes/ty.li.incipit:tyKOin.Sep14.Kontakion.title
ltx/en_us_public/ty.li.incipit:tyKOin.d001.Kontakion.text	@ltx/en_us_dedes/ty.li.incipit:tyKOin.d001.Kontakion.text
ltx/en_us_public/ty.li.incipit:tyKOin.d008.Kontakion.text	@ltx/en_us_dedes/ty.li.incipit:tyKOin.d008.Kontakion.text
ltx/en_us_public/ty.li.incipit:tyKOin.d00P.Kontakion.text	@ltx/en_us_dedes/ty.li.incipit:tyKOin.d00P.Kontakion.text
ltx/en_us_public/ty.li.incipit:tyKOin.d014.Kontakion.text	@ltx/en_us_dedes/ty.li.incipit:tyKOin.d014.Kontakion.text
ltx/en_us_public/ty.li.incipit:tyKOin.d015.Kontakion.text	@ltx/en_us_dedes/ty.li.incipit:tyKOin.d015.Kontakion.text
ltx/en_us_public/ty.li.incipit:tyKOin.d022.Kontakion.text	@ltx/en_us_dedes/ty.li.incipit:tyKOin.d022.Kontakion.text
ltx/en_us_public/ty.li.incipit:tyKOin.d063.Kontakion.text	@ltx/en_us_dedes/ty.li.incipit:tyKOin.d063.Kontakion.text
ltx/en_us_public/ty.li.incipit:tyKOin.d064.Kontakion.text	@ltx/en_us_dedes/ty.li.incipit:tyKOin.d064.Kontakion.text
ltx/en_us_public/ty.li.incipit:tyKOin.d078.Kontakion.text	@ltx/en_us_dedes/ty.li.incipit:tyKOin.d078.Kontakion.text
ltx/en_us_public/ty.li.incipit:tyKOin.d085.Kontakion.text	@ltx/en_us_dedes/ty.li.incipit:tyKOin.d085.Kontakion.text
ltx/en_us_public/ty.li.incipit:tyKOin.d095.Kontakion.text	@ltx/en_us_dedes/ty.li.incipit:tyKOin.d095.Kontakion.text
ltx/en_us_public/ty.li.incipit:tyKOin.d110.Kontakion.text	@ltx/en_us_dedes/ty.li.incipit:tyKOin.d110.Kontakion.text
ltx/en_us_public/ty.li.incipit:tyKOin.d120.Kontakion.text	@ltx/en_us_dedes/ty.li.incipit:tyKOin.d120.Kontakion.text
ltx/en_us_public/ty.li.incipit:tyKOin.d127.Kontakion.text	@ltx/en_us_dedes/ty.li.incipit:tyKOin.d127.Kontakion.text
ltx/en_us_public/ty.li.incipit:tyKOin.default.text	@ltx/en_us_dedes/ty.li.incipit:tyKOin.default.text
ltx/en_us_public/ty.li.incipit:tyLIin.AfterEntrance.title	@ltx/en_us_dedes/ty.li.incipit:tyLIin.AfterEntrance.title
ltx/en_us_public/ty.li.incipit:tyLIin.Antiphon21.text	@ltx/en_us_dedes/ty.li.incipit:tyLIin.Antiphon21.text
ltx/en_us_public/ty.li.incipit:tyLIin.Antiphon22.text	@ltx/en_us_dedes/ty.li.incipit:tyLIin.Antiphon22.text
ltx/en_us_public/ty.li.incipit:tyLIin.ApApostle.title	@ltx/en_us_dedes/ty.li.incipit:tyLIin.ApApostle.title
ltx/en_us_public/ty.li.incipit:tyLIin.ApApostles.title	@ltx/en_us_dedes/ty.li.incipit:tyLIin.ApApostles.title
ltx/en_us_public/ty.li.incipit:tyLIin.ApCross.title	@ltx/en_us_dedes/ty.li.incipit:tyLIin.ApCross.title
ltx/en_us_public/ty.li.incipit:tyLIin.ApFeast.title	@ltx/en_us_dedes/ty.li.incipit:tyLIin.ApFeast.title
ltx/en_us_public/ty.li.incipit:tyLIin.ApForefeast.title	@ltx/en_us_dedes/ty.li.incipit:tyLIin.ApForefeast.title
ltx/en_us_public/ty.li.incipit:tyLIin.ApForerunner.title	@ltx/en_us_dedes/ty.li.incipit:tyLIin.ApForerunner.title
ltx/en_us_public/ty.li.incipit:tyLIin.ApSaintM.title	@ltx/en_us_dedes/ty.li.incipit:tyLIin.ApSaintM.title
ltx/en_us_public/ty.li.incipit:tyLIin.ApSaintW.title	@ltx/en_us_dedes/ty.li.incipit:tyLIin.ApSaintW.title
ltx/en_us_public/ty.li.incipit:tyLIin.ApSaints.title	@ltx/en_us_dedes/ty.li.incipit:tyLIin.ApSaints.title
ltx/en_us_public/ty.li.incipit:tyLIin.Basil.text	@ltx/en_us_dedes/ty.li.incipit:tyLIin.Basil.text
ltx/en_us_public/ty.li.incipit:tyLIin.Chrysostom.text	@ltx/en_us_dedes/ty.li.incipit:tyLIin.Chrysostom.text
ltx/en_us_public/ty.li.incipit:tyLIin.EntranceHymn.text	@ltx/en_us_dedes/ty.li.incipit:tyLIin.EntranceHymn.text
ltx/en_us_public/ty.li.incipit:tyLIin.EntranceHymn.title	@ltx/en_us_dedes/ty.li.incipit:tyLIin.EntranceHymn.title
ltx/en_us_public/ty.li.incipit:tyLIin.EntranceHymn1.text	@ltx/en_us_dedes/ty.li.incipit:tyLIin.EntranceHymn1.text
ltx/en_us_public/ty.li.incipit:tyLIin.EntranceHymn2s.text	@ltx/en_us_dedes/ty.li.incipit:tyLIin.EntranceHymn2s.text
ltx/en_us_public/ty.li.incipit:tyLIin.EntranceHymn2w.text	@ltx/en_us_dedes/ty.li.incipit:tyLIin.EntranceHymn2w.text
ltx/en_us_public/ty.li.incipit:tyLIin.Festal.title	@ltx/en_us_dedes/ty.li.incipit:tyLIin.Festal.title
ltx/en_us_public/ty.li.incipit:tyLIin.VesperalLiturgyBasil.text	@ltx/en_us_dedes/ty.li.incipit:tyLIin.VesperalLiturgyBasil.text
ltx/en_us_public/ty.li.incipit:tyLIin.aftercommunion.default	@ltx/en_us_dedes/ty.li.incipit:tyLIin.aftercommunion.default
ltx/en_us_public/ty.li.incipit:tyLIin.aftercommunion.holysaturday.text	@ltx/en_us_dedes/ty.li.incipit:tyLIin.aftercommunion.holysaturday.text
ltx/en_us_public/ty.li.incipit:tyLIin.aftercommunion.holythursday.text	@ltx/en_us_dedes/ty.li.incipit:tyLIin.aftercommunion.holythursday.text
ltx/en_us_public/ty.li.incipit:tyLIin.aftercommunion.title	@ltx/en_us_dedes/ty.li.incipit:tyLIin.aftercommunion.title
ltx/en_us_public/ty.li.incipit:tyLIin.antiphon1.text	@ltx/en_us_dedes/ty.li.incipit:tyLIin.antiphon1.text
ltx/en_us_public/ty.li.incipit:tyLIin.antiphon1.title	@ltx/en_us_dedes/ty.li.incipit:tyLIin.antiphon1.title
ltx/en_us_public/ty.li.incipit:tyLIin.antiphon2.aug06.text	@ltx/en_us_dedes/ty.li.incipit:tyLIin.antiphon2.aug06.text
ltx/en_us_public/ty.li.incipit:tyLIin.antiphon2.dec25.text	@ltx/en_us_dedes/ty.li.incipit:tyLIin.antiphon2.dec25.text
ltx/en_us_public/ty.li.incipit:tyLIin.antiphon2.feb02.text	@ltx/en_us_dedes/ty.li.incipit:tyLIin.antiphon2.feb02.text
ltx/en_us_public/ty.li.incipit:tyLIin.antiphon2.jan01.text	@ltx/en_us_dedes/ty.li.incipit:tyLIin.antiphon2.jan01.text
ltx/en_us_public/ty.li.incipit:tyLIin.antiphon2.jan06.text	@ltx/en_us_dedes/ty.li.incipit:tyLIin.antiphon2.jan06.text
ltx/en_us_public/ty.li.incipit:tyLIin.antiphon2.mar25.text	@ltx/en_us_dedes/ty.li.incipit:tyLIin.antiphon2.mar25.text
ltx/en_us_public/ty.li.incipit:tyLIin.antiphon2.sep14.text	@ltx/en_us_dedes/ty.li.incipit:tyLIin.antiphon2.sep14.text
ltx/en_us_public/ty.li.incipit:tyLIin.antiphon2.sunday.text	@ltx/en_us_dedes/ty.li.incipit:tyLIin.antiphon2.sunday.text
ltx/en_us_public/ty.li.incipit:tyLIin.antiphon2.title	@ltx/en_us_dedes/ty.li.incipit:tyLIin.antiphon2.title
ltx/en_us_public/ty.li.incipit:tyLIin.antiphon2.weekday.text	@ltx/en_us_dedes/ty.li.incipit:tyLIin.antiphon2.weekday.text
ltx/en_us_public/ty.li.incipit:tyLIin.antiphon3.title	@ltx/en_us_dedes/ty.li.incipit:tyLIin.antiphon3.title
ltx/en_us_public/ty.li.incipit:tyLIin.antiphon_verses.ascension.note	@ltx/en_us_dedes/ty.li.incipit:tyLIin.antiphon_verses.ascension.note
ltx/en_us_public/ty.li.incipit:tyLIin.antiphon_verses.ascension.title	@ltx/en_us_dedes/ty.li.incipit:tyLIin.antiphon_verses.ascension.title
ltx/en_us_public/ty.li.incipit:tyLIin.antiphon_verses.aug06.note	@ltx/en_us_dedes/ty.li.incipit:tyLIin.antiphon_verses.aug06.note
ltx/en_us_public/ty.li.incipit:tyLIin.antiphon_verses.aug06.title	@ltx/en_us_dedes/ty.li.incipit:tyLIin.antiphon_verses.aug06.title
ltx/en_us_public/ty.li.incipit:tyLIin.antiphon_verses.aug15.note	@ltx/en_us_dedes/ty.li.incipit:tyLIin.antiphon_verses.aug15.note
ltx/en_us_public/ty.li.incipit:tyLIin.antiphon_verses.aug15.title	@ltx/en_us_dedes/ty.li.incipit:tyLIin.antiphon_verses.aug15.title
ltx/en_us_public/ty.li.incipit:tyLIin.antiphon_verses.dec25.note	@ltx/en_us_dedes/ty.li.incipit:tyLIin.antiphon_verses.dec25.note
ltx/en_us_public/ty.li.incipit:tyLIin.antiphon_verses.dec25.title	@ltx/en_us_dedes/ty.li.incipit:tyLIin.antiphon_verses.dec25.title
ltx/en_us_public/ty.li.incipit:tyLIin.antiphon_verses.feb02.note	@ltx/en_us_dedes/ty.li.incipit:tyLIin.antiphon_verses.feb02.note
ltx/en_us_public/ty.li.incipit:tyLIin.antiphon_verses.feb02.title	@ltx/en_us_dedes/ty.li.incipit:tyLIin.antiphon_verses.feb02.title
ltx/en_us_public/ty.li.incipit:tyLIin.antiphon_verses.jan01.note	@ltx/en_us_dedes/ty.li.incipit:tyLIin.antiphon_verses.jan01.note
ltx/en_us_public/ty.li.incipit:tyLIin.antiphon_verses.jan01.title	@ltx/en_us_dedes/ty.li.incipit:tyLIin.antiphon_verses.jan01.title
ltx/en_us_public/ty.li.incipit:tyLIin.antiphon_verses.jan06.note	@ltx/en_us_dedes/ty.li.incipit:tyLIin.antiphon_verses.jan06.note
ltx/en_us_public/ty.li.incipit:tyLIin.antiphon_verses.jan06.title	@ltx/en_us_dedes/ty.li.incipit:tyLIin.antiphon_verses.jan06.title
ltx/en_us_public/ty.li.incipit:tyLIin.antiphon_verses.lent1.note	@ltx/en_us_dedes/ty.li.incipit:tyLIin.antiphon_verses.lent1.note
ltx/en_us_public/ty.li.incipit:tyLIin.antiphon_verses.lent1.title	@ltx/en_us_dedes/ty.li.incipit:tyLIin.antiphon_verses.lent1.title
ltx/en_us_public/ty.li.incipit:tyLIin.antiphon_verses.lent3.note	@ltx/en_us_dedes/ty.li.incipit:tyLIin.antiphon_verses.lent3.note
ltx/en_us_public/ty.li.incipit:tyLIin.antiphon_verses.lent3.title	@ltx/en_us_dedes/ty.li.incipit:tyLIin.antiphon_verses.lent3.title
ltx/en_us_public/ty.li.incipit:tyLIin.antiphon_verses.mar25.note	@ltx/en_us_dedes/ty.li.incipit:tyLIin.antiphon_verses.mar25.note
ltx/en_us_public/ty.li.incipit:tyLIin.antiphon_verses.mar25.title	@ltx/en_us_dedes/ty.li.incipit:tyLIin.antiphon_verses.mar25.title
ltx/en_us_public/ty.li.incipit:tyLIin.antiphon_verses.nov21.note	@ltx/en_us_dedes/ty.li.incipit:tyLIin.antiphon_verses.nov21.note
ltx/en_us_public/ty.li.incipit:tyLIin.antiphon_verses.nov21.title	@ltx/en_us_dedes/ty.li.incipit:tyLIin.antiphon_verses.nov21.title
ltx/en_us_public/ty.li.incipit:tyLIin.antiphon_verses.palm.note	@ltx/en_us_dedes/ty.li.incipit:tyLIin.antiphon_verses.palm.note
ltx/en_us_public/ty.li.incipit:tyLIin.antiphon_verses.palm.title	@ltx/en_us_dedes/ty.li.incipit:tyLIin.antiphon_verses.palm.title
ltx/en_us_public/ty.li.incipit:tyLIin.antiphon_verses.pascha.note	@ltx/en_us_dedes/ty.li.incipit:tyLIin.antiphon_verses.pascha.note
ltx/en_us_public/ty.li.incipit:tyLIin.antiphon_verses.pascha.title	@ltx/en_us_dedes/ty.li.incipit:tyLIin.antiphon_verses.pascha.title
ltx/en_us_public/ty.li.incipit:tyLIin.antiphon_verses.pentecost.note	@ltx/en_us_dedes/ty.li.incipit:tyLIin.antiphon_verses.pentecost.note
ltx/en_us_public/ty.li.incipit:tyLIin.antiphon_verses.pentecost.title	@ltx/en_us_dedes/ty.li.incipit:tyLIin.antiphon_verses.pentecost.title
ltx/en_us_public/ty.li.incipit:tyLIin.antiphon_verses.sep08.note	@ltx/en_us_dedes/ty.li.incipit:tyLIin.antiphon_verses.sep08.note
ltx/en_us_public/ty.li.incipit:tyLIin.antiphon_verses.sep08.title	@ltx/en_us_dedes/ty.li.incipit:tyLIin.antiphon_verses.sep08.title
ltx/en_us_public/ty.li.incipit:tyLIin.antiphon_verses.sep14.note	@ltx/en_us_dedes/ty.li.incipit:tyLIin.antiphon_verses.sep14.note
ltx/en_us_public/ty.li.incipit:tyLIin.antiphon_verses.sep14.title	@ltx/en_us_dedes/ty.li.incipit:tyLIin.antiphon_verses.sep14.title
ltx/en_us_public/ty.li.incipit:tyLIin.antiphon_verses.sunday.note	@ltx/en_us_dedes/ty.li.incipit:tyLIin.antiphon_verses.sunday.note
ltx/en_us_public/ty.li.incipit:tyLIin.antiphon_verses.sunday.title	@ltx/en_us_dedes/ty.li.incipit:tyLIin.antiphon_verses.sunday.title
ltx/en_us_public/ty.li.incipit:tyLIin.antiphon_verses.title	@ltx/en_us_dedes/ty.li.incipit:tyLIin.antiphon_verses.title
ltx/en_us_public/ty.li.incipit:tyLIin.cherubic.default.text	@ltx/en_us_dedes/ty.li.incipit:tyLIin.cherubic.default.text
ltx/en_us_public/ty.li.incipit:tyLIin.cherubic.holysaturday.text	@ltx/en_us_dedes/ty.li.incipit:tyLIin.cherubic.holysaturday.text
ltx/en_us_public/ty.li.incipit:tyLIin.cherubic.holythursday.text	@ltx/en_us_dedes/ty.li.incipit:tyLIin.cherubic.holythursday.text
ltx/en_us_public/ty.li.incipit:tyLIin.cherubichymn.title	@ltx/en_us_dedes/ty.li.incipit:tyLIin.cherubichymn.title
ltx/en_us_public/ty.li.incipit:tyLIin.client.Apolytikion.text	@ltx/en_us_dedes/ty.li.incipit:tyLIin.client.Apolytikion.text
ltx/en_us_public/ty.li.incipit:tyLIin.client.Apolytikion.title	@ltx/en_us_dedes/ty.li.incipit:tyLIin.client.Apolytikion.title
ltx/en_us_public/ty.li.incipit:tyLIin.client.OmitApolytikion.text	@ltx/en_us_dedes/ty.li.incipit:tyLIin.client.OmitApolytikion.text
ltx/en_us_public/ty.li.incipit:tyLIin.communionhymn.akathist.text	@ltx/en_us_dedes/ty.li.incipit:tyLIin.communionhymn.akathist.text
ltx/en_us_public/ty.li.incipit:tyLIin.communionhymn.angels.text	@ltx/en_us_dedes/ty.li.incipit:tyLIin.communionhymn.angels.text
ltx/en_us_public/ty.li.incipit:tyLIin.communionhymn.annunciation.text	@ltx/en_us_dedes/ty.li.incipit:tyLIin.communionhymn.annunciation.text
ltx/en_us_public/ty.li.incipit:tyLIin.communionhymn.apostle.text	@ltx/en_us_dedes/ty.li.incipit:tyLIin.communionhymn.apostle.text
ltx/en_us_public/ty.li.incipit:tyLIin.communionhymn.apostles.text	@ltx/en_us_dedes/ty.li.incipit:tyLIin.communionhymn.apostles.text
ltx/en_us_public/ty.li.incipit:tyLIin.communionhymn.ascension.text	@ltx/en_us_dedes/ty.li.incipit:tyLIin.communionhymn.ascension.text
ltx/en_us_public/ty.li.incipit:tyLIin.communionhymn.christmas.text	@ltx/en_us_dedes/ty.li.incipit:tyLIin.communionhymn.christmas.text
ltx/en_us_public/ty.li.incipit:tyLIin.communionhymn.consecration.text	@ltx/en_us_dedes/ty.li.incipit:tyLIin.communionhymn.consecration.text
ltx/en_us_public/ty.li.incipit:tyLIin.communionhymn.cross.text	@ltx/en_us_dedes/ty.li.incipit:tyLIin.communionhymn.cross.text
ltx/en_us_public/ty.li.incipit:tyLIin.communionhymn.deceased.text	@ltx/en_us_dedes/ty.li.incipit:tyLIin.communionhymn.deceased.text
ltx/en_us_public/ty.li.incipit:tyLIin.communionhymn.epiphany.text	@ltx/en_us_dedes/ty.li.incipit:tyLIin.communionhymn.epiphany.text
ltx/en_us_public/ty.li.incipit:tyLIin.communionhymn.holysaturday.text	@ltx/en_us_dedes/ty.li.incipit:tyLIin.communionhymn.holysaturday.text
ltx/en_us_public/ty.li.incipit:tyLIin.communionhymn.holyspirit.text	@ltx/en_us_dedes/ty.li.incipit:tyLIin.communionhymn.holyspirit.text
ltx/en_us_public/ty.li.incipit:tyLIin.communionhymn.holythursday.text	@ltx/en_us_dedes/ty.li.incipit:tyLIin.communionhymn.holythursday.text
ltx/en_us_public/ty.li.incipit:tyLIin.communionhymn.indiction.text	@ltx/en_us_dedes/ty.li.incipit:tyLIin.communionhymn.indiction.text
ltx/en_us_public/ty.li.incipit:tyLIin.communionhymn.lazarus.text	@ltx/en_us_dedes/ty.li.incipit:tyLIin.communionhymn.lazarus.text
ltx/en_us_public/ty.li.incipit:tyLIin.communionhymn.meeting.text	@ltx/en_us_dedes/ty.li.incipit:tyLIin.communionhymn.meeting.text
ltx/en_us_public/ty.li.incipit:tyLIin.communionhymn.midpentecost.text	@ltx/en_us_dedes/ty.li.incipit:tyLIin.communionhymn.midpentecost.text
ltx/en_us_public/ty.li.incipit:tyLIin.communionhymn.palm.text	@ltx/en_us_dedes/ty.li.incipit:tyLIin.communionhymn.palm.text
ltx/en_us_public/ty.li.incipit:tyLIin.communionhymn.pascha.text	@ltx/en_us_dedes/ty.li.incipit:tyLIin.communionhymn.pascha.text
ltx/en_us_public/ty.li.incipit:tyLIin.communionhymn.pentecost.text	@ltx/en_us_dedes/ty.li.incipit:tyLIin.communionhymn.pentecost.text
ltx/en_us_public/ty.li.incipit:tyLIin.communionhymn.righteous.text	@ltx/en_us_dedes/ty.li.incipit:tyLIin.communionhymn.righteous.text
ltx/en_us_public/ty.li.incipit:tyLIin.communionhymn.saints.text	@ltx/en_us_dedes/ty.li.incipit:tyLIin.communionhymn.saints.text
ltx/en_us_public/ty.li.incipit:tyLIin.communionhymn.sunday.text	@ltx/en_us_dedes/ty.li.incipit:tyLIin.communionhymn.sunday.text
ltx/en_us_public/ty.li.incipit:tyLIin.communionhymn.theotokos.text	@ltx/en_us_dedes/ty.li.incipit:tyLIin.communionhymn.theotokos.text
ltx/en_us_public/ty.li.incipit:tyLIin.communionhymn.thomas.text	@ltx/en_us_dedes/ty.li.incipit:tyLIin.communionhymn.thomas.text
ltx/en_us_public/ty.li.incipit:tyLIin.communionhymn.title	@ltx/en_us_dedes/ty.li.incipit:tyLIin.communionhymn.title
ltx/en_us_public/ty.li.incipit:tyLIin.communionhymn.transfiguration.text	@ltx/en_us_dedes/ty.li.incipit:tyLIin.communionhymn.transfiguration.text
ltx/en_us_public/ty.li.incipit:tyLIin.d064.Antiphon2.text	@ltx/en_us_dedes/ty.li.incipit:tyLIin.d064.Antiphon2.text
ltx/en_us_public/ty.li.incipit:tyLIin.d064.entrance.v1.text	@ltx/en_us_dedes/ty.li.incipit:tyLIin.d064.entrance.v1.text
ltx/en_us_public/ty.li.incipit:tyLIin.d071.entrance.v1.text	@ltx/en_us_dedes/ty.li.incipit:tyLIin.d071.entrance.v1.text
ltx/en_us_public/ty.li.incipit:tyLIin.d110.Antiphon2.text	@ltx/en_us_dedes/ty.li.incipit:tyLIin.d110.Antiphon2.text
ltx/en_us_public/ty.li.incipit:tyLIin.d110.entrance.v1.text	@ltx/en_us_dedes/ty.li.incipit:tyLIin.d110.entrance.v1.text
ltx/en_us_public/ty.li.incipit:tyLIin.d120.Antiphon2.text	@ltx/en_us_dedes/ty.li.incipit:tyLIin.d120.Antiphon2.text
ltx/en_us_public/ty.li.incipit:tyLIin.d120.entrance.v1.text	@ltx/en_us_dedes/ty.li.incipit:tyLIin.d120.entrance.v1.text
ltx/en_us_public/ty.li.incipit:tyLIin.dismissal.title	@ltx/en_us_dedes/ty.li.incipit:tyLIin.dismissal.title
ltx/en_us_public/ty.li.incipit:tyLIin.epistle.title	@ltx/en_us_dedes/ty.li.incipit:tyLIin.epistle.title
ltx/en_us_public/ty.li.incipit:tyLIin.gospel.title	@ltx/en_us_dedes/ty.li.incipit:tyLIin.gospel.title
ltx/en_us_public/ty.li.incipit:tyLIin.m01.d01.Antiphon2.text	@ltx/en_us_dedes/ty.li.incipit:tyLIin.m01.d01.Antiphon2.text
ltx/en_us_public/ty.li.incipit:tyLIin.m01.d06.Antiphon2.text	@ltx/en_us_dedes/ty.li.incipit:tyLIin.m01.d06.Antiphon2.text
ltx/en_us_public/ty.li.incipit:tyLIin.m01.d06.entrance.v1.text	@ltx/en_us_dedes/ty.li.incipit:tyLIin.m01.d06.entrance.v1.text
ltx/en_us_public/ty.li.incipit:tyLIin.m02.d02.Antiphon2.text	@ltx/en_us_dedes/ty.li.incipit:tyLIin.m02.d02.Antiphon2.text
ltx/en_us_public/ty.li.incipit:tyLIin.m02.d02.entrance.v1.text	@ltx/en_us_dedes/ty.li.incipit:tyLIin.m02.d02.entrance.v1.text
ltx/en_us_public/ty.li.incipit:tyLIin.m03.d25.Antiphon2.text	@ltx/en_us_dedes/ty.li.incipit:tyLIin.m03.d25.Antiphon2.text
ltx/en_us_public/ty.li.incipit:tyLIin.m03.d25.entrance.v1.text	@ltx/en_us_dedes/ty.li.incipit:tyLIin.m03.d25.entrance.v1.text
ltx/en_us_public/ty.li.incipit:tyLIin.m08.d06.Antiphon2.text	@ltx/en_us_dedes/ty.li.incipit:tyLIin.m08.d06.Antiphon2.text
ltx/en_us_public/ty.li.incipit:tyLIin.m08.d06.entrance1.v1.text	@ltx/en_us_dedes/ty.li.incipit:tyLIin.m08.d06.entrance1.v1.text
ltx/en_us_public/ty.li.incipit:tyLIin.m09.d14.Antiphon2.text	@ltx/en_us_dedes/ty.li.incipit:tyLIin.m09.d14.Antiphon2.text
ltx/en_us_public/ty.li.incipit:tyLIin.m09.d14.entrance.v1.text	@ltx/en_us_dedes/ty.li.incipit:tyLIin.m09.d14.entrance.v1.text
ltx/en_us_public/ty.li.incipit:tyLIin.m12.d25.Antiphon2.text	@ltx/en_us_dedes/ty.li.incipit:tyLIin.m12.d25.Antiphon2.text
ltx/en_us_public/ty.li.incipit:tyLIin.m12.d25.entrance.v1.text	@ltx/en_us_dedes/ty.li.incipit:tyLIin.m12.d25.entrance.v1.text
ltx/en_us_public/ty.li.incipit:tyLIin.pr.antiphon2.ascension.text	@ltx/en_us_dedes/ty.li.incipit:tyLIin.pr.antiphon2.ascension.text
ltx/en_us_public/ty.li.incipit:tyLIin.pr.antiphon2.palm.text	@ltx/en_us_dedes/ty.li.incipit:tyLIin.pr.antiphon2.palm.text
ltx/en_us_public/ty.li.incipit:tyLIin.pr.antiphon2.pentecost.text	@ltx/en_us_dedes/ty.li.incipit:tyLIin.pr.antiphon2.pentecost.text
ltx/en_us_public/ty.li.incipit:tyLIin.theotokoshymn.akathist.text	@ltx/en_us_dedes/ty.li.incipit:tyLIin.theotokoshymn.akathist.text
ltx/en_us_public/ty.li.incipit:tyLIin.theotokoshymn.annunciation.text	@ltx/en_us_dedes/ty.li.incipit:tyLIin.theotokoshymn.annunciation.text
ltx/en_us_public/ty.li.incipit:tyLIin.theotokoshymn.ascension.text	@ltx/en_us_dedes/ty.li.incipit:tyLIin.theotokoshymn.ascension.text
ltx/en_us_public/ty.li.incipit:tyLIin.theotokoshymn.basil.text	@ltx/en_us_dedes/ty.li.incipit:tyLIin.theotokoshymn.basil.text
ltx/en_us_public/ty.li.incipit:tyLIin.theotokoshymn.basil.title	@ltx/en_us_dedes/ty.li.incipit:tyLIin.theotokoshymn.basil.title
ltx/en_us_public/ty.li.incipit:tyLIin.theotokoshymn.christmas1.text	@ltx/en_us_dedes/ty.li.incipit:tyLIin.theotokoshymn.christmas1.text
ltx/en_us_public/ty.li.incipit:tyLIin.theotokoshymn.christmas2.text	@ltx/en_us_dedes/ty.li.incipit:tyLIin.theotokoshymn.christmas2.text
ltx/en_us_public/ty.li.incipit:tyLIin.theotokoshymn.cross1.text	@ltx/en_us_dedes/ty.li.incipit:tyLIin.theotokoshymn.cross1.text
ltx/en_us_public/ty.li.incipit:tyLIin.theotokoshymn.cross2.text	@ltx/en_us_dedes/ty.li.incipit:tyLIin.theotokoshymn.cross2.text
ltx/en_us_public/ty.li.incipit:tyLIin.theotokoshymn.default.text	@ltx/en_us_dedes/ty.li.incipit:tyLIin.theotokoshymn.default.text
ltx/en_us_public/ty.li.incipit:tyLIin.theotokoshymn.dormition.text	@ltx/en_us_dedes/ty.li.incipit:tyLIin.theotokoshymn.dormition.text
ltx/en_us_public/ty.li.incipit:tyLIin.theotokoshymn.entry.text	@ltx/en_us_dedes/ty.li.incipit:tyLIin.theotokoshymn.entry.text
ltx/en_us_public/ty.li.incipit:tyLIin.theotokoshymn.epiphany1.text	@ltx/en_us_dedes/ty.li.incipit:tyLIin.theotokoshymn.epiphany1.text
ltx/en_us_public/ty.li.incipit:tyLIin.theotokoshymn.epiphany2.text	@ltx/en_us_dedes/ty.li.incipit:tyLIin.theotokoshymn.epiphany2.text
ltx/en_us_public/ty.li.incipit:tyLIin.theotokoshymn.heirmos9.text	@ltx/en_us_dedes/ty.li.incipit:tyLIin.theotokoshymn.heirmos9.text
ltx/en_us_public/ty.li.incipit:tyLIin.theotokoshymn.heirmos91.text	@ltx/en_us_dedes/ty.li.incipit:tyLIin.theotokoshymn.heirmos91.text
ltx/en_us_public/ty.li.incipit:tyLIin.theotokoshymn.heirmos92.text	@ltx/en_us_dedes/ty.li.incipit:tyLIin.theotokoshymn.heirmos92.text
ltx/en_us_public/ty.li.incipit:tyLIin.theotokoshymn.lazarus.text	@ltx/en_us_dedes/ty.li.incipit:tyLIin.theotokoshymn.lazarus.text
ltx/en_us_public/ty.li.incipit:tyLIin.theotokoshymn.meeting.text	@ltx/en_us_dedes/ty.li.incipit:tyLIin.theotokoshymn.meeting.text
ltx/en_us_public/ty.li.incipit:tyLIin.theotokoshymn.midpentecost.text	@ltx/en_us_dedes/ty.li.incipit:tyLIin.theotokoshymn.midpentecost.text
ltx/en_us_public/ty.li.incipit:tyLIin.theotokoshymn.ode7C23.text	@ltx/en_us_dedes/ty.li.incipit:tyLIin.theotokoshymn.ode7C23.text
ltx/en_us_public/ty.li.incipit:tyLIin.theotokoshymn.palm.text	@ltx/en_us_dedes/ty.li.incipit:tyLIin.theotokoshymn.palm.text
ltx/en_us_public/ty.li.incipit:tyLIin.theotokoshymn.pascha.text	@ltx/en_us_dedes/ty.li.incipit:tyLIin.theotokoshymn.pascha.text
ltx/en_us_public/ty.li.incipit:tyLIin.theotokoshymn.pascha_t1.text	@ltx/en_us_dedes/ty.li.incipit:tyLIin.theotokoshymn.pascha_t1.text
ltx/en_us_public/ty.li.incipit:tyLIin.theotokoshymn.pascha_t2.text	@ltx/en_us_dedes/ty.li.incipit:tyLIin.theotokoshymn.pascha_t2.text
ltx/en_us_public/ty.li.incipit:tyLIin.theotokoshymn.pentecost1.text	@ltx/en_us_dedes/ty.li.incipit:tyLIin.theotokoshymn.pentecost1.text
ltx/en_us_public/ty.li.incipit:tyLIin.theotokoshymn.pentecost2.text	@ltx/en_us_dedes/ty.li.incipit:tyLIin.theotokoshymn.pentecost2.text
ltx/en_us_public/ty.li.incipit:tyLIin.theotokoshymn.theotokosbirth.text	@ltx/en_us_dedes/ty.li.incipit:tyLIin.theotokoshymn.theotokosbirth.text
ltx/en_us_public/ty.li.incipit:tyLIin.theotokoshymn.thomas.text	@ltx/en_us_dedes/ty.li.incipit:tyLIin.theotokoshymn.thomas.text
ltx/en_us_public/ty.li.incipit:tyLIin.theotokoshymn.title	@ltx/en_us_dedes/ty.li.incipit:tyLIin.theotokoshymn.title
ltx/en_us_public/ty.li.incipit:tyLIin.theotokoshymn.transfiguration1.text	@ltx/en_us_dedes/ty.li.incipit:tyLIin.theotokoshymn.transfiguration1.text
ltx/en_us_public/ty.li.incipit:tyLIin.theotokoshymn.transfiguration2.text	@ltx/en_us_dedes/ty.li.incipit:tyLIin.theotokoshymn.transfiguration2.text
ltx/en_us_public/ty.li.incipit:tyLIin.trisagios.title	@ltx/en_us_dedes/ty.li.incipit:tyLIin.trisagios.title
ltx/en_us_public/ty.li.incipit:tyLIin.trisagios_alt.title	@ltx/en_us_dedes/ty.li.incipit:tyLIin.trisagios_alt.title
ltx/en_us_public/ty.li.incipit:tyLIin.trisagios_baptized.text	@ltx/en_us_dedes/ty.li.incipit:tyLIin.trisagios_baptized.text
ltx/en_us_public/ty.li.incipit:tyLIin.trisagios_cross.text	@ltx/en_us_dedes/ty.li.incipit:tyLIin.trisagios_cross.text
ltx/en_us_public/ty.li.incipit:tyLIin.trisagios_default.text	@ltx/en_us_dedes/ty.li.incipit:tyLIin.trisagios_default.text
ltx/en_us_public/ty.li.incipit:tyMAin.afterdoxology.text	@ltx/en_us_dedes/ty.li.incipit:tyMAin.afterdoxology.text
ltx/en_us_public/ty.li.incipit:tyMAin.afterdoxology.title	@ltx/en_us_dedes/ty.li.incipit:tyMAin.afterdoxology.title
ltx/en_us_public/ty.li.incipit:tyMAin.enarxis.title	@ltx/en_us_dedes/ty.li.incipit:tyMAin.enarxis.title
ltx/en_us_public/ty.li.incipit:tyMAin.nodoxology.title	@ltx/en_us_dedes/ty.li.incipit:tyMAin.nodoxology.title
ltx/en_us_public/ty.li.incipit:tyMEin.m01.d01.Apolytikion1.text	@ltx/en_us_dedes/ty.li.incipit:tyMEin.m01.d01.Apolytikion1.text
ltx/en_us_public/ty.li.incipit:tyMEin.m01.d01.Apolytikion2.text	@ltx/en_us_dedes/ty.li.incipit:tyMEin.m01.d01.Apolytikion2.text
ltx/en_us_public/ty.li.incipit:tyMEin.m01.d02.Apolytikion1.text	@ltx/en_us_dedes/ty.li.incipit:tyMEin.m01.d02.Apolytikion1.text
ltx/en_us_public/ty.li.incipit:tyMEin.m01.d05.Apolytikion1.text	@ltx/en_us_dedes/ty.li.incipit:tyMEin.m01.d05.Apolytikion1.text
ltx/en_us_public/ty.li.incipit:tyMEin.m01.d06.Apolytikion1.text	@ltx/en_us_dedes/ty.li.incipit:tyMEin.m01.d06.Apolytikion1.text
ltx/en_us_public/ty.li.incipit:tyMEin.m01.d07.Apolytikion1.text	@ltx/en_us_dedes/ty.li.incipit:tyMEin.m01.d07.Apolytikion1.text
ltx/en_us_public/ty.li.incipit:tyMEin.m01.d17.Apolytikion1.text	@ltx/en_us_dedes/ty.li.incipit:tyMEin.m01.d17.Apolytikion1.text
ltx/en_us_public/ty.li.incipit:tyMEin.m01.d19.Apolytikion1.text	@ltx/en_us_dedes/ty.li.incipit:tyMEin.m01.d19.Apolytikion1.text
ltx/en_us_public/ty.li.incipit:tyMEin.m01.d20.Apolytikion1.text	@ltx/en_us_dedes/ty.li.incipit:tyMEin.m01.d20.Apolytikion1.text
ltx/en_us_public/ty.li.incipit:tyMEin.m01.d21.Apolytikion1.text	@ltx/en_us_dedes/ty.li.incipit:tyMEin.m01.d21.Apolytikion1.text
ltx/en_us_public/ty.li.incipit:tyMEin.m01.d27.Apolytikion1.text	@ltx/en_us_dedes/ty.li.incipit:tyMEin.m01.d27.Apolytikion1.text
ltx/en_us_public/ty.li.incipit:tyMEin.m01.d31.Apolytikion1.text	@ltx/en_us_dedes/ty.li.incipit:tyMEin.m01.d31.Apolytikion1.text
ltx/en_us_public/ty.li.incipit:tyMEin.m02.d02.Apolytikion1.text	@ltx/en_us_dedes/ty.li.incipit:tyMEin.m02.d02.Apolytikion1.text
ltx/en_us_public/ty.li.incipit:tyMEin.m02.d10.Apolytikion1.text	@ltx/en_us_dedes/ty.li.incipit:tyMEin.m02.d10.Apolytikion1.text
ltx/en_us_public/ty.li.incipit:tyMEin.m02.d14.Apolytikion1.text	@ltx/en_us_dedes/ty.li.incipit:tyMEin.m02.d14.Apolytikion1.text
ltx/en_us_public/ty.li.incipit:tyMEin.m02.d24.Apolytikion1.text	@ltx/en_us_dedes/ty.li.incipit:tyMEin.m02.d24.Apolytikion1.text
ltx/en_us_public/ty.li.incipit:tyMEin.m03.d24.Apolytikion1.text	@ltx/en_us_dedes/ty.li.incipit:tyMEin.m03.d24.Apolytikion1.text
ltx/en_us_public/ty.li.incipit:tyMEin.m03.d25.Apolytikion1.text	@ltx/en_us_dedes/ty.li.incipit:tyMEin.m03.d25.Apolytikion1.text
ltx/en_us_public/ty.li.incipit:tyMEin.m06.d24.Apolytikion1.text	@ltx/en_us_dedes/ty.li.incipit:tyMEin.m06.d24.Apolytikion1.text
ltx/en_us_public/ty.li.incipit:tyMEin.m06.d30.Apolytikion1.text	@ltx/en_us_dedes/ty.li.incipit:tyMEin.m06.d30.Apolytikion1.text
ltx/en_us_public/ty.li.incipit:tyMEin.m07.d05.Apolytikion1.text	@ltx/en_us_dedes/ty.li.incipit:tyMEin.m07.d05.Apolytikion1.text
ltx/en_us_public/ty.li.incipit:tyMEin.m07.d07.Apolytikion1.text	@ltx/en_us_dedes/ty.li.incipit:tyMEin.m07.d07.Apolytikion1.text
ltx/en_us_public/ty.li.incipit:tyMEin.m07.d11.Apolytikion1.text	@ltx/en_us_dedes/ty.li.incipit:tyMEin.m07.d11.Apolytikion1.text
ltx/en_us_public/ty.li.incipit:tyMEin.m07.d12.Apolytikion1.text	@ltx/en_us_dedes/ty.li.incipit:tyMEin.m07.d12.Apolytikion1.text
ltx/en_us_public/ty.li.incipit:tyMEin.m07.d21.Apolytikion1.text	@ltx/en_us_dedes/ty.li.incipit:tyMEin.m07.d21.Apolytikion1.text
ltx/en_us_public/ty.li.incipit:tyMEin.m07.d25.Apolytikion1.text	@ltx/en_us_dedes/ty.li.incipit:tyMEin.m07.d25.Apolytikion1.text
ltx/en_us_public/ty.li.incipit:tyMEin.m07.d26.Apolytikion1.text	@ltx/en_us_dedes/ty.li.incipit:tyMEin.m07.d26.Apolytikion1.text
ltx/en_us_public/ty.li.incipit:tyMEin.m07.d28.Apolytikion1.text	@ltx/en_us_dedes/ty.li.incipit:tyMEin.m07.d28.Apolytikion1.text
ltx/en_us_public/ty.li.incipit:tyMEin.m07.dHF.Apolytikion1.text	@ltx/en_us_dedes/ty.li.incipit:tyMEin.m07.dHF.Apolytikion1.text
ltx/en_us_public/ty.li.incipit:tyMEin.m08.d02.Apolytikion1.text	@ltx/en_us_dedes/ty.li.incipit:tyMEin.m08.d02.Apolytikion1.text
ltx/en_us_public/ty.li.incipit:tyMEin.m08.d04.Apolytikion1.text	@ltx/en_us_dedes/ty.li.incipit:tyMEin.m08.d04.Apolytikion1.text
ltx/en_us_public/ty.li.incipit:tyMEin.m08.d06.Apolytikion1.text	@ltx/en_us_dedes/ty.li.incipit:tyMEin.m08.d06.Apolytikion1.text
ltx/en_us_public/ty.li.incipit:tyMEin.m08.d11.Apolytikion1.text	@ltx/en_us_dedes/ty.li.incipit:tyMEin.m08.d11.Apolytikion1.text
ltx/en_us_public/ty.li.incipit:tyMEin.m08.d15.Apolytikion1.text	@ltx/en_us_dedes/ty.li.incipit:tyMEin.m08.d15.Apolytikion1.text
ltx/en_us_public/ty.li.incipit:tyMEin.m08.d16.Apolytikion1.text	@ltx/en_us_dedes/ty.li.incipit:tyMEin.m08.d16.Apolytikion1.text
ltx/en_us_public/ty.li.incipit:tyMEin.m08.d18.Apolytikion1.text	@ltx/en_us_dedes/ty.li.incipit:tyMEin.m08.d18.Apolytikion1.text
ltx/en_us_public/ty.li.incipit:tyMEin.m08.d25.Apolytikion1.text	@ltx/en_us_dedes/ty.li.incipit:tyMEin.m08.d25.Apolytikion1.text
ltx/en_us_public/ty.li.incipit:tyMEin.m08.d29.Apolytikion1.text	@ltx/en_us_dedes/ty.li.incipit:tyMEin.m08.d29.Apolytikion1.text
ltx/en_us_public/ty.li.incipit:tyMEin.m09.d01.Apolytikion1.text	@ltx/en_us_dedes/ty.li.incipit:tyMEin.m09.d01.Apolytikion1.text
ltx/en_us_public/ty.li.incipit:tyMEin.m09.d01.Apolytikion2.text	@ltx/en_us_dedes/ty.li.incipit:tyMEin.m09.d01.Apolytikion2.text
ltx/en_us_public/ty.li.incipit:tyMEin.m09.d01.Apolytikion3.text	@ltx/en_us_dedes/ty.li.incipit:tyMEin.m09.d01.Apolytikion3.text
ltx/en_us_public/ty.li.incipit:tyMEin.m09.d05.Apolytikion1.text	@ltx/en_us_dedes/ty.li.incipit:tyMEin.m09.d05.Apolytikion1.text
ltx/en_us_public/ty.li.incipit:tyMEin.m09.d06.Apolytikion1.text	@ltx/en_us_dedes/ty.li.incipit:tyMEin.m09.d06.Apolytikion1.text
ltx/en_us_public/ty.li.incipit:tyMEin.m09.d08.Apolytikion1.text	@ltx/en_us_dedes/ty.li.incipit:tyMEin.m09.d08.Apolytikion1.text
ltx/en_us_public/ty.li.incipit:tyMEin.m09.d13.Apolytikion1.text	@ltx/en_us_dedes/ty.li.incipit:tyMEin.m09.d13.Apolytikion1.text
ltx/en_us_public/ty.li.incipit:tyMEin.m09.d13.Apolytikion2.text	@ltx/en_us_dedes/ty.li.incipit:tyMEin.m09.d13.Apolytikion2.text
ltx/en_us_public/ty.li.incipit:tyMEin.m09.d14.Apolytikion1.text	@ltx/en_us_dedes/ty.li.incipit:tyMEin.m09.d14.Apolytikion1.text
ltx/en_us_public/ty.li.incipit:tyMEin.m09.d15.Apolytikion1.text	@ltx/en_us_dedes/ty.li.incipit:tyMEin.m09.d15.Apolytikion1.text
ltx/en_us_public/ty.li.incipit:tyMEin.m09.d16.Apolytikion1.text	@ltx/en_us_dedes/ty.li.incipit:tyMEin.m09.d16.Apolytikion1.text
ltx/en_us_public/ty.li.incipit:tyMEin.m09.d20.Apolytikion1.text	@ltx/en_us_dedes/ty.li.incipit:tyMEin.m09.d20.Apolytikion1.text
ltx/en_us_public/ty.li.incipit:tyMEin.m09.d22.Apolytikion1.text	@ltx/en_us_dedes/ty.li.incipit:tyMEin.m09.d22.Apolytikion1.text
ltx/en_us_public/ty.li.incipit:tyMEin.m09.d26.Apolytikion1.text	@ltx/en_us_dedes/ty.li.incipit:tyMEin.m09.d26.Apolytikion1.text
ltx/en_us_public/ty.li.incipit:tyMEin.m09.d27.Apolytikion1.text	@ltx/en_us_dedes/ty.li.incipit:tyMEin.m09.d27.Apolytikion1.text
ltx/en_us_public/ty.li.incipit:tyMEin.m09.d29.Apolytikion1.text	@ltx/en_us_dedes/ty.li.incipit:tyMEin.m09.d29.Apolytikion1.text
ltx/en_us_public/ty.li.incipit:tyMEin.m10.d03.Apolytikion1.text	@ltx/en_us_dedes/ty.li.incipit:tyMEin.m10.d03.Apolytikion1.text
ltx/en_us_public/ty.li.incipit:tyMEin.m10.d06.Apolytikion1.text	@ltx/en_us_dedes/ty.li.incipit:tyMEin.m10.d06.Apolytikion1.text
ltx/en_us_public/ty.li.incipit:tyMEin.m10.d10.Apolytikion1.text	@ltx/en_us_dedes/ty.li.incipit:tyMEin.m10.d10.Apolytikion1.text
ltx/en_us_public/ty.li.incipit:tyMEin.m10.d18.Apolytikion1.text	@ltx/en_us_dedes/ty.li.incipit:tyMEin.m10.d18.Apolytikion1.text
ltx/en_us_public/ty.li.incipit:tyMEin.m10.d20.Apolytikion1.text	@ltx/en_us_dedes/ty.li.incipit:tyMEin.m10.d20.Apolytikion1.text
ltx/en_us_public/ty.li.incipit:tyMEin.m10.d24.Apolytikion1.text	@ltx/en_us_dedes/ty.li.incipit:tyMEin.m10.d24.Apolytikion1.text
ltx/en_us_public/ty.li.incipit:tyMEin.m10.d27.Apolytikion1.text	@ltx/en_us_dedes/ty.li.incipit:tyMEin.m10.d27.Apolytikion1.text
ltx/en_us_public/ty.li.incipit:tyMEin.m10.dHF.Apolytikion1.text	@ltx/en_us_dedes/ty.li.incipit:tyMEin.m10.dHF.Apolytikion1.text
ltx/en_us_public/ty.li.incipit:tyMEin.m11.d01.Apolytikion1.text	@ltx/en_us_dedes/ty.li.incipit:tyMEin.m11.d01.Apolytikion1.text
ltx/en_us_public/ty.li.incipit:tyMEin.m11.d03.Apolytikion1.text	@ltx/en_us_dedes/ty.li.incipit:tyMEin.m11.d03.Apolytikion1.text
ltx/en_us_public/ty.li.incipit:tyMEin.m11.d03.Apolytikion2.text	@ltx/en_us_dedes/ty.li.incipit:tyMEin.m11.d03.Apolytikion2.text
ltx/en_us_public/ty.li.incipit:tyMEin.m11.d07.Apolytikion2.text	@ltx/en_us_dedes/ty.li.incipit:tyMEin.m11.d07.Apolytikion2.text
ltx/en_us_public/ty.li.incipit:tyMEin.m11.d08.Apolytikion1.text	@ltx/en_us_dedes/ty.li.incipit:tyMEin.m11.d08.Apolytikion1.text
ltx/en_us_public/ty.li.incipit:tyMEin.m11.d10.Apolytikion1.text	@ltx/en_us_dedes/ty.li.incipit:tyMEin.m11.d10.Apolytikion1.text
ltx/en_us_public/ty.li.incipit:tyMEin.m11.d14.Apolytikion1.text	@ltx/en_us_dedes/ty.li.incipit:tyMEin.m11.d14.Apolytikion1.text
ltx/en_us_public/ty.li.incipit:tyMEin.m11.d15.Apolytikion1.text	@ltx/en_us_dedes/ty.li.incipit:tyMEin.m11.d15.Apolytikion1.text
ltx/en_us_public/ty.li.incipit:tyMEin.m11.d17.Apolytikion1.text	@ltx/en_us_dedes/ty.li.incipit:tyMEin.m11.d17.Apolytikion1.text
ltx/en_us_public/ty.li.incipit:tyMEin.m11.d21.Apolytikion1.text	@ltx/en_us_dedes/ty.li.incipit:tyMEin.m11.d21.Apolytikion1.text
ltx/en_us_public/ty.li.incipit:tyMEin.m11.d24.Apolytikion1.text	@ltx/en_us_dedes/ty.li.incipit:tyMEin.m11.d24.Apolytikion1.text
ltx/en_us_public/ty.li.incipit:tyMEin.m11.d28.Apolytikion3.text	@ltx/en_us_dedes/ty.li.incipit:tyMEin.m11.d28.Apolytikion3.text
ltx/en_us_public/ty.li.incipit:tyMEin.m12.d01.Apolytikion1.text	@ltx/en_us_dedes/ty.li.incipit:tyMEin.m12.d01.Apolytikion1.text
ltx/en_us_public/ty.li.incipit:tyMEin.m12.d05.Apolytikion1.text	@ltx/en_us_dedes/ty.li.incipit:tyMEin.m12.d05.Apolytikion1.text
ltx/en_us_public/ty.li.incipit:tyMEin.m12.d06.Apolytikion1.text	@ltx/en_us_dedes/ty.li.incipit:tyMEin.m12.d06.Apolytikion1.text
ltx/en_us_public/ty.li.incipit:tyMEin.m12.d08.Apolytikion1.text	@ltx/en_us_dedes/ty.li.incipit:tyMEin.m12.d08.Apolytikion1.text
ltx/en_us_public/ty.li.incipit:tyMEin.m12.d12.Apolytikion1.text	@ltx/en_us_dedes/ty.li.incipit:tyMEin.m12.d12.Apolytikion1.text
ltx/en_us_public/ty.li.incipit:tyMEin.m12.d15.Apolytikion1.text	@ltx/en_us_dedes/ty.li.incipit:tyMEin.m12.d15.Apolytikion1.text
ltx/en_us_public/ty.li.incipit:tyMEin.m12.d20.Apolytikion1.text	@ltx/en_us_dedes/ty.li.incipit:tyMEin.m12.d20.Apolytikion1.text
ltx/en_us_public/ty.li.incipit:tyMEin.m12.d24.Apolytikion1.text	@ltx/en_us_dedes/ty.li.incipit:tyMEin.m12.d24.Apolytikion1.text
ltx/en_us_public/ty.li.incipit:tyMEin.m12.d25.Apolytikion1.text	@ltx/en_us_dedes/ty.li.incipit:tyMEin.m12.d25.Apolytikion1.text
ltx/en_us_public/ty.li.incipit:tyMEin.m12.dAC.Apolytikion1.text	@ltx/en_us_dedes/ty.li.incipit:tyMEin.m12.dAC.Apolytikion1.text
ltx/en_us_public/ty.li.incipit:tyMEin.m12.dBC.Apolytikion1.text	@ltx/en_us_dedes/ty.li.incipit:tyMEin.m12.dBC.Apolytikion1.text
ltx/en_us_public/ty.li.incipit:tyMEin.m12.dFF.Apolytikion1.text	@ltx/en_us_dedes/ty.li.incipit:tyMEin.m12.dFF.Apolytikion1.text
ltx/en_us_public/ty.li.incipit:tyOCin.ResApolytikion.title	@ltx/en_us_dedes/ty.li.incipit:tyOCin.ResApolytikion.title
ltx/en_us_public/ty.li.incipit:tyOCin.ResApolytikion1.text	@ltx/en_us_dedes/ty.li.incipit:tyOCin.ResApolytikion1.text
ltx/en_us_public/ty.li.incipit:tyOCin.ResApolytikion2.text	@ltx/en_us_dedes/ty.li.incipit:tyOCin.ResApolytikion2.text
ltx/en_us_public/ty.li.incipit:tyOCin.ResApolytikion3.text	@ltx/en_us_dedes/ty.li.incipit:tyOCin.ResApolytikion3.text
ltx/en_us_public/ty.li.incipit:tyOCin.ResApolytikion4.text	@ltx/en_us_dedes/ty.li.incipit:tyOCin.ResApolytikion4.text
ltx/en_us_public/ty.li.incipit:tyOCin.ResApolytikion5.text	@ltx/en_us_dedes/ty.li.incipit:tyOCin.ResApolytikion5.text
ltx/en_us_public/ty.li.incipit:tyOCin.ResApolytikion6.text	@ltx/en_us_dedes/ty.li.incipit:tyOCin.ResApolytikion6.text
ltx/en_us_public/ty.li.incipit:tyOCin.ResApolytikion7.text	@ltx/en_us_dedes/ty.li.incipit:tyOCin.ResApolytikion7.text
ltx/en_us_public/ty.li.incipit:tyOCin.ResApolytikion8.text	@ltx/en_us_dedes/ty.li.incipit:tyOCin.ResApolytikion8.text
ltx/en_us_public/ty.li.incipit:tyPEin.allsaints.Apolytikion.text	@ltx/en_us_dedes/ty.li.incipit:tyPEin.allsaints.Apolytikion.text
ltx/en_us_public/ty.li.incipit:tyPEin.ascension.Apolytikion.text	@ltx/en_us_dedes/ty.li.incipit:tyPEin.ascension.Apolytikion.text
ltx/en_us_public/ty.li.incipit:tyPEin.midpentecost.Apolytikion.text	@ltx/en_us_dedes/ty.li.incipit:tyPEin.midpentecost.Apolytikion.text
ltx/en_us_public/ty.li.incipit:tyPEin.myrrhbearers.Apolytikion1.text	@ltx/en_us_dedes/ty.li.incipit:tyPEin.myrrhbearers.Apolytikion1.text
ltx/en_us_public/ty.li.incipit:tyPEin.myrrhbearers.Apolytikion2.text	@ltx/en_us_dedes/ty.li.incipit:tyPEin.myrrhbearers.Apolytikion2.text
ltx/en_us_public/ty.li.incipit:tyPEin.myrrhbearers.Apolytikion3.text	@ltx/en_us_dedes/ty.li.incipit:tyPEin.myrrhbearers.Apolytikion3.text
ltx/en_us_public/ty.li.incipit:tyPEin.pascha.Apolytikion.text	@ltx/en_us_dedes/ty.li.incipit:tyPEin.pascha.Apolytikion.text
ltx/en_us_public/ty.li.incipit:tyPEin.pascha.Hypakoe.text	@ltx/en_us_dedes/ty.li.incipit:tyPEin.pascha.Hypakoe.text
ltx/en_us_public/ty.li.incipit:tyPEin.pentecost.Apolytikion.text	@ltx/en_us_dedes/ty.li.incipit:tyPEin.pentecost.Apolytikion.text
ltx/en_us_public/ty.li.incipit:tyPEin.souls.Apolytikion.text	@ltx/en_us_dedes/ty.li.incipit:tyPEin.souls.Apolytikion.text
ltx/en_us_public/ty.li.incipit:tyPEin.thomas.Apolytikion.text	@ltx/en_us_dedes/ty.li.incipit:tyPEin.thomas.Apolytikion.text
ltx/en_us_public/ty.li.incipit:tyTRin.holysaturday.Apolytikion.text	@ltx/en_us_dedes/ty.li.incipit:tyTRin.holysaturday.Apolytikion.text
ltx/en_us_public/ty.li.incipit:tyTRin.holythursday.hymn.text	@ltx/en_us_dedes/ty.li.incipit:tyTRin.holythursday.hymn.text
ltx/en_us_public/ty.li.incipit:tyTRin.lazarus.Apolytikion.text	@ltx/en_us_dedes/ty.li.incipit:tyTRin.lazarus.Apolytikion.text
ltx/en_us_public/ty.li.incipit:tyTRin.lent1.Apolytikion.text	@ltx/en_us_dedes/ty.li.incipit:tyTRin.lent1.Apolytikion.text
ltx/en_us_public/ty.li.incipit:tyTRin.lent2.Apolytikion.text	@ltx/en_us_dedes/ty.li.incipit:tyTRin.lent2.Apolytikion.text
ltx/en_us_public/ty.li.incipit:tyTRin.lent4.Apolytikion.text	@ltx/en_us_dedes/ty.li.incipit:tyTRin.lent4.Apolytikion.text
ltx/en_us_public/ty.li.incipit:tyTRin.lent5.Apolytikion.text	@ltx/en_us_dedes/ty.li.incipit:tyTRin.lent5.Apolytikion.text
ltx/en_us_public/ty.li.incipit:tyTRin.palm.Apolytikion.text	@ltx/en_us_dedes/ty.li.incipit:tyTRin.palm.Apolytikion.text
ltx/en_us_public/ty.li.incipit:tyVEin.VespersEntrance.text	@ltx/en_us_dedes/ty.li.incipit:tyVEin.VespersEntrance.text
ltx/en_us_public/ty.li.incipit:tyVLin.christmas.epistle.book	@ltx/en_us_dedes/ty.li.incipit:tyVLin.christmas.epistle.book
ltx/en_us_public/ty.li.incipit:tyVLin.christmas.epistle.chapverse	@ltx/en_us_dedes/ty.li.incipit:tyVLin.christmas.epistle.chapverse
ltx/en_us_public/ty.li.incipit:tyVLin.christmas.gospel.book	@ltx/en_us_dedes/ty.li.incipit:tyVLin.christmas.gospel.book
ltx/en_us_public/ty.li.incipit:tyVLin.christmas.gospel.chapverse	@ltx/en_us_dedes/ty.li.incipit:tyVLin.christmas.gospel.chapverse
ltx/en_us_public/ty.li.incipit:tyVLin.christmas.otreading_01.book	@ltx/en_us_dedes/ty.li.incipit:tyVLin.christmas.otreading_01.book
ltx/en_us_public/ty.li.incipit:tyVLin.christmas.otreading_01.chapverse	@ltx/en_us_dedes/ty.li.incipit:tyVLin.christmas.otreading_01.chapverse
ltx/en_us_public/ty.li.incipit:tyVLin.christmas.otreading_01.title	@ltx/en_us_dedes/ty.li.incipit:tyVLin.christmas.otreading_01.title
ltx/en_us_public/ty.li.incipit:tyVLin.christmas.otreading_07.book	@ltx/en_us_dedes/ty.li.incipit:tyVLin.christmas.otreading_07.book
ltx/en_us_public/ty.li.incipit:tyVLin.christmas.otreading_07.chapverse	@ltx/en_us_dedes/ty.li.incipit:tyVLin.christmas.otreading_07.chapverse
ltx/en_us_public/ty.li.incipit:tyVLin.christmas.otreading_07.title	@ltx/en_us_dedes/ty.li.incipit:tyVLin.christmas.otreading_07.title
ltx/en_us_public/ty.li.incipit:tyVLin.christmas.otreading_08.book	@ltx/en_us_dedes/ty.li.incipit:tyVLin.christmas.otreading_08.book
ltx/en_us_public/ty.li.incipit:tyVLin.christmas.otreading_08.chapverse	@ltx/en_us_dedes/ty.li.incipit:tyVLin.christmas.otreading_08.chapverse
ltx/en_us_public/ty.li.incipit:tyVLin.christmas.otreading_08.title	@ltx/en_us_dedes/ty.li.incipit:tyVLin.christmas.otreading_08.title
ltx/en_us_public/ty.li.incipit:tyVLin.christmas.troparion1.text	@ltx/en_us_dedes/ty.li.incipit:tyVLin.christmas.troparion1.text
ltx/en_us_public/ty.li.incipit:tyVLin.christmas.troparion1.title	@ltx/en_us_dedes/ty.li.incipit:tyVLin.christmas.troparion1.title
ltx/en_us_public/ty.li.incipit:tyVLin.christmas.troparion2.text	@ltx/en_us_dedes/ty.li.incipit:tyVLin.christmas.troparion2.text
ltx/en_us_public/ty.li.incipit:tyVLin.christmas.troparion2.title	@ltx/en_us_dedes/ty.li.incipit:tyVLin.christmas.troparion2.title
ltx/en_us_public/ty.li.incipit:tyVLin.epiphany.epistle.book	@ltx/en_us_dedes/ty.li.incipit:tyVLin.epiphany.epistle.book
ltx/en_us_public/ty.li.incipit:tyVLin.epiphany.epistle.chapverse	@ltx/en_us_dedes/ty.li.incipit:tyVLin.epiphany.epistle.chapverse
ltx/en_us_public/ty.li.incipit:tyVLin.epiphany.gospel.book	@ltx/en_us_dedes/ty.li.incipit:tyVLin.epiphany.gospel.book
ltx/en_us_public/ty.li.incipit:tyVLin.epiphany.gospel.chapverse	@ltx/en_us_dedes/ty.li.incipit:tyVLin.epiphany.gospel.chapverse
ltx/en_us_public/ty.li.incipit:tyVLin.epiphany.otreading_01.book	@ltx/en_us_dedes/ty.li.incipit:tyVLin.epiphany.otreading_01.book
ltx/en_us_public/ty.li.incipit:tyVLin.epiphany.otreading_01.chapverse	@ltx/en_us_dedes/ty.li.incipit:tyVLin.epiphany.otreading_01.chapverse
ltx/en_us_public/ty.li.incipit:tyVLin.epiphany.otreading_01.title	@ltx/en_us_dedes/ty.li.incipit:tyVLin.epiphany.otreading_01.title
ltx/en_us_public/ty.li.incipit:tyVLin.epiphany.otreading_05.book	@ltx/en_us_dedes/ty.li.incipit:tyVLin.epiphany.otreading_05.book
ltx/en_us_public/ty.li.incipit:tyVLin.epiphany.otreading_05.chapverse	@ltx/en_us_dedes/ty.li.incipit:tyVLin.epiphany.otreading_05.chapverse
ltx/en_us_public/ty.li.incipit:tyVLin.epiphany.otreading_05.title	@ltx/en_us_dedes/ty.li.incipit:tyVLin.epiphany.otreading_05.title
ltx/en_us_public/ty.li.incipit:tyVLin.epiphany.otreading_06.book	@ltx/en_us_dedes/ty.li.incipit:tyVLin.epiphany.otreading_06.book
ltx/en_us_public/ty.li.incipit:tyVLin.epiphany.otreading_06.chapverse	@ltx/en_us_dedes/ty.li.incipit:tyVLin.epiphany.otreading_06.chapverse
ltx/en_us_public/ty.li.incipit:tyVLin.epiphany.otreading_06.title	@ltx/en_us_dedes/ty.li.incipit:tyVLin.epiphany.otreading_06.title
ltx/en_us_public/ty.li.incipit:tyVLin.epiphany.troparion1.text	@ltx/en_us_dedes/ty.li.incipit:tyVLin.epiphany.troparion1.text
ltx/en_us_public/ty.li.incipit:tyVLin.epiphany.troparion1.title	@ltx/en_us_dedes/ty.li.incipit:tyVLin.epiphany.troparion1.title
ltx/en_us_public/ty.li.incipit:tyVLin.epiphany.troparion2.text	@ltx/en_us_dedes/ty.li.incipit:tyVLin.epiphany.troparion2.text
ltx/en_us_public/ty.li.incipit:tyVLin.epiphany.troparion2.title	@ltx/en_us_dedes/ty.li.incipit:tyVLin.epiphany.troparion2.title
ltx/en_us_public/ty.li.incipit:tyVLin.holysaturday.ariseogod.text	@ltx/en_us_dedes/ty.li.incipit:tyVLin.holysaturday.ariseogod.text
ltx/en_us_public/ty.li.incipit:tyVLin.holysaturday.epistle.book	@ltx/en_us_dedes/ty.li.incipit:tyVLin.holysaturday.epistle.book
ltx/en_us_public/ty.li.incipit:tyVLin.holysaturday.epistle.chapverse	@ltx/en_us_dedes/ty.li.incipit:tyVLin.holysaturday.epistle.chapverse
ltx/en_us_public/ty.li.incipit:tyVLin.holysaturday.gospel.book	@ltx/en_us_dedes/ty.li.incipit:tyVLin.holysaturday.gospel.book
ltx/en_us_public/ty.li.incipit:tyVLin.holysaturday.gospel.chapverse	@ltx/en_us_dedes/ty.li.incipit:tyVLin.holysaturday.gospel.chapverse
ltx/en_us_public/ty.li.incipit:tyVLin.holysaturday.hymnofthreeservants.text	@ltx/en_us_dedes/ty.li.incipit:tyVLin.holysaturday.hymnofthreeservants.text
ltx/en_us_public/ty.li.incipit:tyVLin.holysaturday.hymnofthreeservants.title	@ltx/en_us_dedes/ty.li.incipit:tyVLin.holysaturday.hymnofthreeservants.title
ltx/en_us_public/ty.li.incipit:tyVLin.holysaturday.insteadofalleluia.title	@ltx/en_us_dedes/ty.li.incipit:tyVLin.holysaturday.insteadofalleluia.title
ltx/en_us_public/ty.li.incipit:tyVLin.holysaturday.otreading_01.book	@ltx/en_us_dedes/ty.li.incipit:tyVLin.holysaturday.otreading_01.book
ltx/en_us_public/ty.li.incipit:tyVLin.holysaturday.otreading_01.chapverse	@ltx/en_us_dedes/ty.li.incipit:tyVLin.holysaturday.otreading_01.chapverse
ltx/en_us_public/ty.li.incipit:tyVLin.holysaturday.otreading_02.book	@ltx/en_us_dedes/ty.li.incipit:tyVLin.holysaturday.otreading_02.book
ltx/en_us_public/ty.li.incipit:tyVLin.holysaturday.otreading_02.chapverse	@ltx/en_us_dedes/ty.li.incipit:tyVLin.holysaturday.otreading_02.chapverse
ltx/en_us_public/ty.li.incipit:tyVLin.holysaturday.otreading_03.book	@ltx/en_us_dedes/ty.li.incipit:tyVLin.holysaturday.otreading_03.book
ltx/en_us_public/ty.li.incipit:tyVLin.holysaturday.otreading_03.chapverse	@ltx/en_us_dedes/ty.li.incipit:tyVLin.holysaturday.otreading_03.chapverse
ltx/en_us_public/ty.li.incipit:tyVLin.holythursday.epistle.book	@ltx/en_us_dedes/ty.li.incipit:tyVLin.holythursday.epistle.book
ltx/en_us_public/ty.li.incipit:tyVLin.holythursday.epistle.chapverse	@ltx/en_us_dedes/ty.li.incipit:tyVLin.holythursday.epistle.chapverse
ltx/en_us_public/ty.li.incipit:tyVLin.holythursday.gospel.book	@ltx/en_us_dedes/ty.li.incipit:tyVLin.holythursday.gospel.book
ltx/en_us_public/ty.li.incipit:tyVLin.holythursday.gospel.chapverse	@ltx/en_us_dedes/ty.li.incipit:tyVLin.holythursday.gospel.chapverse
ltx/en_us_public/ty.li.incipit:tyVLin.holythursday.otreading_01.book	@ltx/en_us_dedes/ty.li.incipit:tyVLin.holythursday.otreading_01.book
ltx/en_us_public/ty.li.incipit:tyVLin.holythursday.otreading_01.chapverse	@ltx/en_us_dedes/ty.li.incipit:tyVLin.holythursday.otreading_01.chapverse
ltx/en_us_public/ty.li.incipit:tyVLin.holythursday.otreading_02.book	@ltx/en_us_dedes/ty.li.incipit:tyVLin.holythursday.otreading_02.book
ltx/en_us_public/ty.li.incipit:tyVLin.holythursday.otreading_02.chapverse	@ltx/en_us_dedes/ty.li.incipit:tyVLin.holythursday.otreading_02.chapverse
ltx/en_us_public/ty.li.incipit:tyVLin.holythursday.otreading_03.book	@ltx/en_us_dedes/ty.li.incipit:tyVLin.holythursday.otreading_03.book
ltx/en_us_public/ty.li.incipit:tyVLin.holythursday.otreading_03.chapverse	@ltx/en_us_dedes/ty.li.incipit:tyVLin.holythursday.otreading_03.chapverse
ltx/en_us_public/ty.li.incipit:tyVLin.otreading_01.title	@ltx/en_us_dedes/ty.li.incipit:tyVLin.otreading_01.title
ltx/en_us_public/ty.li.incipit:tyVLin.otreading_02.title	@ltx/en_us_dedes/ty.li.incipit:tyVLin.otreading_02.title
ltx/en_us_public/ty.li.incipit:tyVLin.otreading_03.title	@ltx/en_us_dedes/ty.li.incipit:tyVLin.otreading_03.title
ltx/en_us_public/ty.li.incipit:tyVLin.vespershymns.menaion.title	@ltx/en_us_dedes/ty.li.incipit:tyVLin.vespershymns.menaion.title
ltx/en_us_public/ty.li.incipit:tyVLin.vespershymns.triodion.title	@ltx/en_us_dedes/ty.li.incipit:tyVLin.vespershymns.triodion.title
