ltx/en_us_public/ho.ho15.m02:ho.Days	@ltx/en_us_dedes/ho.ho15.m02:ho.Days
ltx/en_us_public/ho.ho15.m02:ho.Hours	@ltx/en_us_dedes/ho.ho15.m02:ho.Hours
ltx/en_us_public/ho.ho15.m02:ho.Month	@ltx/en_us_dedes/ho.ho15.m02:ho.Month
ltx/en_us_public/ho.ho15.m02:hoD01.Apolytikion2.greekmelody	@ltx/en_us_dedes/ho.ho15.m02:hoD01.Apolytikion2.greekmelody
ltx/en_us_public/ho.ho15.m02:hoD01.Apolytikion2.incipit	@ltx/en_us_dedes/ho.ho15.m02:hoD01.Apolytikion2.incipit
ltx/en_us_public/ho.ho15.m02:hoD01.Apolytikion2.melody	@ltx/en_us_dedes/ho.ho15.m02:hoD01.Apolytikion2.melody
ltx/en_us_public/ho.ho15.m02:hoD01.Apolytikion2.mode	@ltx/en_us_dedes/ho.ho15.m02:hoD01.Apolytikion2.mode
ltx/en_us_public/ho.ho15.m02:hoD01.Apolytikion2.poet	@ltx/en_us_dedes/ho.ho15.m02:hoD01.Apolytikion2.poet
ltx/en_us_public/ho.ho15.m02:hoD01.Apolytikion2.text	@ltx/en_us_dedes/ho.ho15.m02:hoD01.Apolytikion2.text
ltx/en_us_public/ho.ho15.m02:hoD01.Apolytikion2.title	@ltx/en_us_dedes/ho.ho15.m02:hoD01.Apolytikion2.title
ltx/en_us_public/ho.ho15.m02:hoD04.GeneralApolytikion1.name	@ltx/en_us_dedes/ho.ho15.m02:hoD04.GeneralApolytikion1.name
ltx/en_us_public/ho.ho15.m02:hoD06.GeneralApolytikion1.name	@ltx/en_us_dedes/ho.ho15.m02:hoD06.GeneralApolytikion1.name
ltx/en_us_public/ho.ho15.m02:hoD08.GeneralApolytikion2.name	@ltx/en_us_dedes/ho.ho15.m02:hoD08.GeneralApolytikion2.name
ltx/en_us_public/ho.ho15.m02:hoD08.GeneralApolytikion2.text	@ltx/en_us_dedes/ho.ho15.m02:hoD08.GeneralApolytikion2.text
ltx/en_us_public/ho.ho15.m02:hoD10.Kontakion1.greekmelody	@ltx/en_us_dedes/ho.ho15.m02:hoD10.Kontakion1.greekmelody
ltx/en_us_public/ho.ho15.m02:hoD10.Kontakion1.incipit	@ltx/en_us_dedes/ho.ho15.m02:hoD10.Kontakion1.incipit
ltx/en_us_public/ho.ho15.m02:hoD10.Kontakion1.melody	@ltx/en_us_dedes/ho.ho15.m02:hoD10.Kontakion1.melody
ltx/en_us_public/ho.ho15.m02:hoD10.Kontakion1.mode	@ltx/en_us_dedes/ho.ho15.m02:hoD10.Kontakion1.mode
ltx/en_us_public/ho.ho15.m02:hoD10.Kontakion1.poet	@ltx/en_us_dedes/ho.ho15.m02:hoD10.Kontakion1.poet
ltx/en_us_public/ho.ho15.m02:hoD10.Kontakion1.text	@ltx/en_us_dedes/ho.ho15.m02:hoD10.Kontakion1.text
ltx/en_us_public/ho.ho15.m02:hoD10.Kontakion1.title	@ltx/en_us_dedes/ho.ho15.m02:hoD10.Kontakion1.title
ltx/en_us_public/ho.ho15.m02:hoD11.GeneralApolytikion1.name	@ltx/en_us_dedes/ho.ho15.m02:hoD11.GeneralApolytikion1.name
ltx/en_us_public/ho.ho15.m02:hoD12.GeneralApolytikion1.name	@ltx/en_us_dedes/ho.ho15.m02:hoD12.GeneralApolytikion1.name
ltx/en_us_public/ho.ho15.m02:hoD14.GeneralApolytikion1.name	@ltx/en_us_dedes/ho.ho15.m02:hoD14.GeneralApolytikion1.name
ltx/en_us_public/ho.ho15.m02:hoD15.GeneralApolytikion1.name	@ltx/en_us_dedes/ho.ho15.m02:hoD15.GeneralApolytikion1.name
ltx/en_us_public/ho.ho15.m02:hoD18.GeneralApolytikion1.name	@ltx/en_us_dedes/ho.ho15.m02:hoD18.GeneralApolytikion1.name
ltx/en_us_public/ho.ho15.m02:hoD19.GeneralApolytikion1.name	@ltx/en_us_dedes/ho.ho15.m02:hoD19.GeneralApolytikion1.name
ltx/en_us_public/ho.ho15.m02:hoD20.GeneralApolytikion1.name	@ltx/en_us_dedes/ho.ho15.m02:hoD20.GeneralApolytikion1.name
ltx/en_us_public/ho.ho15.m02:hoD23.GeneralApolytikion1.name	@ltx/en_us_dedes/ho.ho15.m02:hoD23.GeneralApolytikion1.name
ltx/en_us_public/ho.ho15.m02:hoD25.GeneralApolytikion1.name	@ltx/en_us_dedes/ho.ho15.m02:hoD25.GeneralApolytikion1.name
ltx/en_us_public/ho.ho15.m02:hoD26.GeneralApolytikion1.name	@ltx/en_us_dedes/ho.ho15.m02:hoD26.GeneralApolytikion1.name
ltx/en_us_public/ho.ho15.m02:hoD27.GeneralApolytikion1.name	@ltx/en_us_dedes/ho.ho15.m02:hoD27.GeneralApolytikion1.name
ltx/en_us_public/ho.ho15.m02:hoD28.GeneralApolytikion1.name	@ltx/en_us_dedes/ho.ho15.m02:hoD28.GeneralApolytikion1.name
