ltx/en_us_public/le.pr.tr.d027:lemcTE.reading1.book_abbr	@ltx/en_us_saas/le.pr.tr.d027:lemcTE.reading1.book_abbr
ltx/en_us_public/le.pr.tr.d027:lemcTE.reading1.book_string	@ltx/en_us_saas/le.pr.tr.d027:lemcTE.reading1.book_string
ltx/en_us_public/le.pr.tr.d027:lemcTE.reading1.chapverse	@ltx/en_us_saas/le.pr.tr.d027:lemcTE.reading1.chapverse
ltx/en_us_public/le.pr.tr.d027:lemcTE.reading1.incipit	@ltx/en_us_saas/le.pr.tr.d027:lemcTE.reading1.incipit
ltx/en_us_public/le.pr.tr.d027:lemcTE.reading1.text	@ltx/en_us_saas/le.pr.tr.d027:lemcTE.reading1.text
ltx/en_us_public/le.pr.tr.d027:lemcTE.reading1.title	@ltx/en_us_saas/le.pr.tr.d027:lemcTE.reading1.title
ltx/en_us_public/le.pr.tr.d027:lemcTE.reading1.title_abbr	@ltx/en_us_saas/le.pr.tr.d027:lemcTE.reading1.title_abbr
ltx/en_us_public/le.pr.tr.d027:lemcTE.reading1.version	@ltx/en_us_saas/le.pr.tr.d027:lemcTE.reading1.version
ltx/en_us_public/le.pr.tr.d027:lemcVE.reading1.book_abbr	@ltx/en_us_saas/le.pr.tr.d027:lemcVE.reading1.book_abbr
ltx/en_us_public/le.pr.tr.d027:lemcVE.reading1.book_string	@ltx/en_us_saas/le.pr.tr.d027:lemcVE.reading1.book_string
ltx/en_us_public/le.pr.tr.d027:lemcVE.reading1.chapverse	@ltx/en_us_saas/le.pr.tr.d027:lemcVE.reading1.chapverse
ltx/en_us_public/le.pr.tr.d027:lemcVE.reading1.incipit	@ltx/en_us_saas/le.pr.tr.d027:lemcVE.reading1.incipit
ltx/en_us_public/le.pr.tr.d027:lemcVE.reading1.text	@ltx/en_us_saas/le.pr.tr.d027:lemcVE.reading1.text
ltx/en_us_public/le.pr.tr.d027:lemcVE.reading1.title	@ltx/en_us_saas/le.pr.tr.d027:lemcVE.reading1.title
ltx/en_us_public/le.pr.tr.d027:lemcVE.reading1.title_abbr	@ltx/en_us_saas/le.pr.tr.d027:lemcVE.reading1.title_abbr
ltx/en_us_public/le.pr.tr.d027:lemcVE.reading1.version	@ltx/en_us_saas/le.pr.tr.d027:lemcVE.reading1.version
ltx/en_us_public/le.pr.tr.d027:lemcVE.reading2.book_abbr	@ltx/en_us_saas/le.pr.tr.d027:lemcVE.reading2.book_abbr
ltx/en_us_public/le.pr.tr.d027:lemcVE.reading2.book_string	@ltx/en_us_saas/le.pr.tr.d027:lemcVE.reading2.book_string
ltx/en_us_public/le.pr.tr.d027:lemcVE.reading2.chapverse	@ltx/en_us_saas/le.pr.tr.d027:lemcVE.reading2.chapverse
ltx/en_us_public/le.pr.tr.d027:lemcVE.reading2.incipit	@ltx/en_us_saas/le.pr.tr.d027:lemcVE.reading2.incipit
ltx/en_us_public/le.pr.tr.d027:lemcVE.reading2.text	@ltx/en_us_saas/le.pr.tr.d027:lemcVE.reading2.text
ltx/en_us_public/le.pr.tr.d027:lemcVE.reading2.title	@ltx/en_us_saas/le.pr.tr.d027:lemcVE.reading2.title
ltx/en_us_public/le.pr.tr.d027:lemcVE.reading2.title_abbr	@ltx/en_us_saas/le.pr.tr.d027:lemcVE.reading2.title_abbr
ltx/en_us_public/le.pr.tr.d027:lemcVE.reading2.version	@ltx/en_us_saas/le.pr.tr.d027:lemcVE.reading2.version
