ltx/en_us_public/titles:ti.AdditionalForCanonOfSaint	@ltx/en_us_dedes/titles:ti.AdditionalForCanonOfSaint
ltx/en_us_public/titles:ti.AdditionalForDead	@ltx/en_us_dedes/titles:ti.AdditionalForDead
ltx/en_us_public/titles:ti.AdditionalForTheotokos	@ltx/en_us_dedes/titles:ti.AdditionalForTheotokos
ltx/en_us_public/titles:ti.AdditionalResurrectionalKathismata	@ltx/en_us_dedes/titles:ti.AdditionalResurrectionalKathismata
ltx/en_us_public/titles:ti.AdditionalStichera	@ltx/en_us_dedes/titles:ti.AdditionalStichera
ltx/en_us_public/titles:ti.AdditionalSticheraByAnatolios	@ltx/en_us_dedes/titles:ti.AdditionalSticheraByAnatolios
ltx/en_us_public/titles:ti.AdditionalSticheraForMaster	@ltx/en_us_dedes/titles:ti.AdditionalSticheraForMaster
ltx/en_us_public/titles:ti.AfterChristmas	@ltx/en_us_dedes/titles:ti.AfterChristmas
ltx/en_us_public/titles:ti.AfterChristmas.uc	@ltx/en_us_dedes/titles:ti.AfterChristmas.uc
ltx/en_us_public/titles:ti.AfterCross	@ltx/en_us_dedes/titles:ti.AfterCross
ltx/en_us_public/titles:ti.AfterCross.uc	@ltx/en_us_dedes/titles:ti.AfterCross.uc
ltx/en_us_public/titles:ti.AfterEpiphany	@ltx/en_us_dedes/titles:ti.AfterEpiphany
ltx/en_us_public/titles:ti.AfterEpiphany.uc	@ltx/en_us_dedes/titles:ti.AfterEpiphany.uc
ltx/en_us_public/titles:ti.AfterPolyeleos	@ltx/en_us_dedes/titles:ti.AfterPolyeleos
ltx/en_us_public/titles:ti.AfterPsalm118AndEvlogetaria	@ltx/en_us_dedes/titles:ti.AfterPsalm118AndEvlogetaria
ltx/en_us_public/titles:ti.AfterPsalter1	@ltx/en_us_dedes/titles:ti.AfterPsalter1
ltx/en_us_public/titles:ti.AfterPsalter1Kathismata	@ltx/en_us_dedes/titles:ti.AfterPsalter1Kathismata
ltx/en_us_public/titles:ti.AfterPsalter2	@ltx/en_us_dedes/titles:ti.AfterPsalter2
ltx/en_us_public/titles:ti.AfterPsalter2Kathismata	@ltx/en_us_dedes/titles:ti.AfterPsalter2Kathismata
ltx/en_us_public/titles:ti.AfterPsalter3Kathismata	@ltx/en_us_dedes/titles:ti.AfterPsalter3Kathismata
ltx/en_us_public/titles:ti.AfterTheFeast	@ltx/en_us_dedes/titles:ti.AfterTheFeast
ltx/en_us_public/titles:ti.AfterTheFeast.uc	@ltx/en_us_dedes/titles:ti.AfterTheFeast.uc
ltx/en_us_public/titles:ti.Akathist	@ltx/en_us_dedes/titles:ti.Akathist
ltx/en_us_public/titles:ti.Alleluia	@ltx/en_us_dedes/titles:ti.Alleluia
ltx/en_us_public/titles:ti.Alphabeticals	@ltx/en_us_dedes/titles:ti.Alphabeticals
ltx/en_us_public/titles:ti.Anavathmoi	@ltx/en_us_dedes/titles:ti.Anavathmoi
ltx/en_us_public/titles:ti.Anavathmoi41	@ltx/en_us_dedes/titles:ti.Anavathmoi41
ltx/en_us_public/titles:ti.AncestorsOfGod	@ltx/en_us_dedes/titles:ti.AncestorsOfGod
ltx/en_us_public/titles:ti.AndAlsoTheotokion	@ltx/en_us_dedes/titles:ti.AndAlsoTheotokion
ltx/en_us_public/titles:ti.AnotherApolytikion	@ltx/en_us_dedes/titles:ti.AnotherApolytikion
ltx/en_us_public/titles:ti.AnotherCanon	@ltx/en_us_dedes/titles:ti.AnotherCanon
ltx/en_us_public/titles:ti.AnotherCanonForefeast	@ltx/en_us_dedes/titles:ti.AnotherCanonForefeast
ltx/en_us_public/titles:ti.AnotherExtraHymn	@ltx/en_us_dedes/titles:ti.AnotherExtraHymn
ltx/en_us_public/titles:ti.AnotherForFeast_1hymn	@ltx/en_us_dedes/titles:ti.AnotherForFeast_1hymn
ltx/en_us_public/titles:ti.AnotherForFeast_canon	@ltx/en_us_dedes/titles:ti.AnotherForFeast_canon
ltx/en_us_public/titles:ti.AnotherHeirmos	@ltx/en_us_dedes/titles:ti.AnotherHeirmos
ltx/en_us_public/titles:ti.AnotherKatavasia	@ltx/en_us_dedes/titles:ti.AnotherKatavasia
ltx/en_us_public/titles:ti.AnotherKontakion	@ltx/en_us_dedes/titles:ti.AnotherKontakion
ltx/en_us_public/titles:ti.Another_1hymn	@ltx/en_us_dedes/titles:ti.Another_1hymn
ltx/en_us_public/titles:ti.Another_canon_heirmos	@ltx/en_us_dedes/titles:ti.Another_canon_heirmos
ltx/en_us_public/titles:ti.Antiphon1	@ltx/en_us_goadedes/titles:ti.Antiphon1
ltx/en_us_public/titles:ti.Antiphon2	@ltx/en_us_goadedes/titles:ti.Antiphon2
ltx/en_us_public/titles:ti.Antiphon3	@ltx/en_us_goadedes/titles:ti.Antiphon3
ltx/en_us_public/titles:ti.Antiphon4	@ltx/en_us_goadedes/titles:ti.Antiphon4
ltx/en_us_public/titles:ti.Apolytikia	@ltx/en_us_dedes/titles:ti.Apolytikia
ltx/en_us_public/titles:ti.Apolytikion	@ltx/en_us_dedes/titles:ti.Apolytikion
ltx/en_us_public/titles:ti.ApolytikionDay	@ltx/en_us_dedes/titles:ti.ApolytikionDay
ltx/en_us_public/titles:ti.ApolytikionFeast	@ltx/en_us_dedes/titles:ti.ApolytikionFeast
ltx/en_us_public/titles:ti.ApolytikionResurrectional	@ltx/en_us_dedes/titles:ti.ApolytikionResurrectional
ltx/en_us_public/titles:ti.ApolytikionTriodion	@ltx/en_us_dedes/titles:ti.ApolytikionTriodion
ltx/en_us_public/titles:ti.Aposticha	@ltx/en_us_dedes/titles:ti.Aposticha
ltx/en_us_public/titles:ti.ApostichaFeast	@ltx/en_us_dedes/titles:ti.ApostichaFeast
ltx/en_us_public/titles:ti.ApostichaForefeast	@ltx/en_us_dedes/titles:ti.ApostichaForefeast
ltx/en_us_public/titles:ti.ApostichaLauds	@ltx/en_us_dedes/titles:ti.ApostichaLauds
ltx/en_us_public/titles:ti.ApostichaOctoechos	@ltx/en_us_dedes/titles:ti.ApostichaOctoechos
ltx/en_us_public/titles:ti.ApostichaResurrectional	@ltx/en_us_dedes/titles:ti.ApostichaResurrectional
ltx/en_us_public/titles:ti.ApostichaStichera	@ltx/en_us_dedes/titles:ti.ApostichaStichera
ltx/en_us_public/titles:ti.ApostichaTheotokos	@ltx/en_us_dedes/titles:ti.ApostichaTheotokos
ltx/en_us_public/titles:ti.Apostle	@ltx/en_us_dedes/titles:ti.Apostle
ltx/en_us_public/titles:ti.Apostles	@ltx/en_us_dedes/titles:ti.Apostles
ltx/en_us_public/titles:ti.Archangel	@ltx/en_us_dedes/titles:ti.Archangel
ltx/en_us_public/titles:ti.AtAposticha	@ltx/en_us_dedes/titles:ti.AtAposticha
ltx/en_us_public/titles:ti.AtApostichaOfLauds	@ltx/en_us_dedes/titles:ti.AtApostichaOfLauds
ltx/en_us_public/titles:ti.AtCompline.lc	@ltx/en_us_dedes/titles:ti.AtCompline.lc
ltx/en_us_public/titles:ti.AtCompline.uc	@ltx/en_us_dedes/titles:ti.AtCompline.uc
ltx/en_us_public/titles:ti.AtLauds	@ltx/en_us_dedes/titles:ti.AtLauds
ltx/en_us_public/titles:ti.AtLiturgy.lc	@ltx/en_us_dedes/titles:ti.AtLiturgy.lc
ltx/en_us_public/titles:ti.AtLiturgy.uc	@ltx/en_us_dedes/titles:ti.AtLiturgy.uc
ltx/en_us_public/titles:ti.AtLity	@ltx/en_us_dedes/titles:ti.AtLity
ltx/en_us_public/titles:ti.AtLordIHaveCried	@ltx/en_us_dedes/titles:ti.AtLordIHaveCried
ltx/en_us_public/titles:ti.AtMatins.lc	@ltx/en_us_dedes/titles:ti.AtMatins.lc
ltx/en_us_public/titles:ti.AtMatins.uc	@ltx/en_us_dedes/titles:ti.AtMatins.uc
ltx/en_us_public/titles:ti.AtTrithekti.lc	@ltx/en_us_dedes/titles:ti.AtTrithekti.lc
ltx/en_us_public/titles:ti.AtTrithekti.uc	@ltx/en_us_dedes/titles:ti.AtTrithekti.uc
ltx/en_us_public/titles:ti.AtVespers.lc	@ltx/en_us_dedes/titles:ti.AtVespers.lc
ltx/en_us_public/titles:ti.AtVespers.uc	@ltx/en_us_dedes/titles:ti.AtVespers.uc
ltx/en_us_public/titles:ti.Beatitudes	@ltx/en_us_dedes/titles:ti.Beatitudes
ltx/en_us_public/titles:ti.BeforeChristmas	@ltx/en_us_dedes/titles:ti.BeforeChristmas
ltx/en_us_public/titles:ti.BeforeChristmas.uc	@ltx/en_us_dedes/titles:ti.BeforeChristmas.uc
ltx/en_us_public/titles:ti.BeforeCross	@ltx/en_us_dedes/titles:ti.BeforeCross
ltx/en_us_public/titles:ti.BeforeCross.uc	@ltx/en_us_dedes/titles:ti.BeforeCross.uc
ltx/en_us_public/titles:ti.BeforeEpiphany	@ltx/en_us_dedes/titles:ti.BeforeEpiphany
ltx/en_us_public/titles:ti.BeforeEpiphany.uc	@ltx/en_us_dedes/titles:ti.BeforeEpiphany.uc
ltx/en_us_public/titles:ti.BlessingOfLoaves	@ltx/en_us_dedes/titles:ti.BlessingOfLoaves
ltx/en_us_public/titles:ti.Blindman	@ltx/en_us_dedes/titles:ti.Blindman
ltx/en_us_public/titles:ti.Bodiless	@ltx/en_us_dedes/titles:ti.Bodiless
ltx/en_us_public/titles:ti.BothNow	@ltx/en_us_dedes/titles:ti.BothNow
ltx/en_us_public/titles:ti.Canon1	@ltx/en_us_dedes/titles:ti.Canon1
ltx/en_us_public/titles:ti.Canon1Apostle	@ltx/en_us_dedes/titles:ti.Canon1Apostle
ltx/en_us_public/titles:ti.Canon1Bodiless	@ltx/en_us_dedes/titles:ti.Canon1Bodiless
ltx/en_us_public/titles:ti.Canon1DevoutM	@ltx/en_us_dedes/titles:ti.Canon1DevoutM
ltx/en_us_public/titles:ti.Canon1DevoutW	@ltx/en_us_dedes/titles:ti.Canon1DevoutW
ltx/en_us_public/titles:ti.Canon1Fathers	@ltx/en_us_dedes/titles:ti.Canon1Fathers
ltx/en_us_public/titles:ti.Canon1Feast	@ltx/en_us_dedes/titles:ti.Canon1Feast
ltx/en_us_public/titles:ti.Canon1Forerunner	@ltx/en_us_dedes/titles:ti.Canon1Forerunner
ltx/en_us_public/titles:ti.Canon1MidPentecost	@ltx/en_us_dedes/titles:ti.Canon1MidPentecost
ltx/en_us_public/titles:ti.Canon1Prophet	@ltx/en_us_dedes/titles:ti.Canon1Prophet
ltx/en_us_public/titles:ti.Canon1SaintM	@ltx/en_us_dedes/titles:ti.Canon1SaintM
ltx/en_us_public/titles:ti.Canon1SaintW	@ltx/en_us_dedes/titles:ti.Canon1SaintW
ltx/en_us_public/titles:ti.Canon1Saints	@ltx/en_us_dedes/titles:ti.Canon1Saints
ltx/en_us_public/titles:ti.Canon1Theotokos	@ltx/en_us_dedes/titles:ti.Canon1Theotokos
ltx/en_us_public/titles:ti.Canon1Triodion	@ltx/en_us_dedes/titles:ti.Canon1Triodion
ltx/en_us_public/titles:ti.Canon2	@ltx/en_us_dedes/titles:ti.Canon2
ltx/en_us_public/titles:ti.Canon2Apostle	@ltx/en_us_dedes/titles:ti.Canon2Apostle
ltx/en_us_public/titles:ti.Canon2Bodiless	@ltx/en_us_dedes/titles:ti.Canon2Bodiless
ltx/en_us_public/titles:ti.Canon2DevoutM	@ltx/en_us_dedes/titles:ti.Canon2DevoutM
ltx/en_us_public/titles:ti.Canon2DevoutW	@ltx/en_us_dedes/titles:ti.Canon2DevoutW
ltx/en_us_public/titles:ti.Canon2Fathers	@ltx/en_us_dedes/titles:ti.Canon2Fathers
ltx/en_us_public/titles:ti.Canon2Feast	@ltx/en_us_dedes/titles:ti.Canon2Feast
ltx/en_us_public/titles:ti.Canon2Forerunner	@ltx/en_us_dedes/titles:ti.Canon2Forerunner
ltx/en_us_public/titles:ti.Canon2MidPentecost	@ltx/en_us_dedes/titles:ti.Canon2MidPentecost
ltx/en_us_public/titles:ti.Canon2Prophet	@ltx/en_us_dedes/titles:ti.Canon2Prophet
ltx/en_us_public/titles:ti.Canon2SaintM	@ltx/en_us_dedes/titles:ti.Canon2SaintM
ltx/en_us_public/titles:ti.Canon2SaintW	@ltx/en_us_dedes/titles:ti.Canon2SaintW
ltx/en_us_public/titles:ti.Canon2Saints	@ltx/en_us_dedes/titles:ti.Canon2Saints
ltx/en_us_public/titles:ti.Canon2Theotokos	@ltx/en_us_dedes/titles:ti.Canon2Theotokos
ltx/en_us_public/titles:ti.Canon2Triodion	@ltx/en_us_dedes/titles:ti.Canon2Triodion
ltx/en_us_public/titles:ti.Canon3	@ltx/en_us_dedes/titles:ti.Canon3
ltx/en_us_public/titles:ti.Canon3Triodion	@ltx/en_us_dedes/titles:ti.Canon3Triodion
ltx/en_us_public/titles:ti.CanonAllSaints	@ltx/en_us_dedes/titles:ti.CanonAllSaints
ltx/en_us_public/titles:ti.CanonAncestorsOfGod	@ltx/en_us_dedes/titles:ti.CanonAncestorsOfGod
ltx/en_us_public/titles:ti.CanonApostle	@ltx/en_us_dedes/titles:ti.CanonApostle
ltx/en_us_public/titles:ti.CanonApostles	@ltx/en_us_dedes/titles:ti.CanonApostles
ltx/en_us_public/titles:ti.CanonArchangel	@ltx/en_us_dedes/titles:ti.CanonArchangel
ltx/en_us_public/titles:ti.CanonBlindman	@ltx/en_us_dedes/titles:ti.CanonBlindman
ltx/en_us_public/titles:ti.CanonBodiless	@ltx/en_us_dedes/titles:ti.CanonBodiless
ltx/en_us_public/titles:ti.CanonCompline	@ltx/en_us_dedes/titles:ti.CanonCompline
ltx/en_us_public/titles:ti.CanonCompunction	@ltx/en_us_dedes/titles:ti.CanonCompunction
ltx/en_us_public/titles:ti.CanonConsecration	@ltx/en_us_dedes/titles:ti.CanonConsecration
ltx/en_us_public/titles:ti.CanonCross	@ltx/en_us_dedes/titles:ti.CanonCross
ltx/en_us_public/titles:ti.CanonCrossResurrection	@ltx/en_us_dedes/titles:ti.CanonCrossResurrection
ltx/en_us_public/titles:ti.CanonCrucifixion	@ltx/en_us_dedes/titles:ti.CanonCrucifixion
ltx/en_us_public/titles:ti.CanonDead	@ltx/en_us_dedes/titles:ti.CanonDead
ltx/en_us_public/titles:ti.CanonDeceased	@ltx/en_us_dedes/titles:ti.CanonDeceased
ltx/en_us_public/titles:ti.CanonDevoutM	@ltx/en_us_dedes/titles:ti.CanonDevoutM
ltx/en_us_public/titles:ti.CanonDevoutMartyrM	@ltx/en_us_dedes/titles:ti.CanonDevoutMartyrM
ltx/en_us_public/titles:ti.CanonDevoutSaints	@ltx/en_us_dedes/titles:ti.CanonDevoutSaints
ltx/en_us_public/titles:ti.CanonDevoutW	@ltx/en_us_dedes/titles:ti.CanonDevoutW
ltx/en_us_public/titles:ti.CanonEvangelist	@ltx/en_us_dedes/titles:ti.CanonEvangelist
ltx/en_us_public/titles:ti.CanonFathers	@ltx/en_us_dedes/titles:ti.CanonFathers
ltx/en_us_public/titles:ti.CanonFeast	@ltx/en_us_dedes/titles:ti.CanonFeast
ltx/en_us_public/titles:ti.CanonForefathers	@ltx/en_us_dedes/titles:ti.CanonForefathers
ltx/en_us_public/titles:ti.CanonForefeast	@ltx/en_us_dedes/titles:ti.CanonForefeast
ltx/en_us_public/titles:ti.CanonForerunner	@ltx/en_us_dedes/titles:ti.CanonForerunner
ltx/en_us_public/titles:ti.CanonGreatMartyrM	@ltx/en_us_dedes/titles:ti.CanonGreatMartyrM
ltx/en_us_public/titles:ti.CanonHierarch	@ltx/en_us_dedes/titles:ti.CanonHierarch
ltx/en_us_public/titles:ti.CanonHieromartyr	@ltx/en_us_dedes/titles:ti.CanonHieromartyr
ltx/en_us_public/titles:ti.CanonHieromartyrs	@ltx/en_us_dedes/titles:ti.CanonHieromartyrs
ltx/en_us_public/titles:ti.CanonHolyApostles	@ltx/en_us_dedes/titles:ti.CanonHolyApostles
ltx/en_us_public/titles:ti.CanonMartyrM	@ltx/en_us_dedes/titles:ti.CanonMartyrM
ltx/en_us_public/titles:ti.CanonMartyrW	@ltx/en_us_dedes/titles:ti.CanonMartyrW
ltx/en_us_public/titles:ti.CanonMartyrs	@ltx/en_us_dedes/titles:ti.CanonMartyrs
ltx/en_us_public/titles:ti.CanonMyrrhbearerW	@ltx/en_us_dedes/titles:ti.CanonMyrrhbearerW
ltx/en_us_public/titles:ti.CanonMyrrhbearers	@ltx/en_us_dedes/titles:ti.CanonMyrrhbearers
ltx/en_us_public/titles:ti.CanonParalytic	@ltx/en_us_dedes/titles:ti.CanonParalytic
ltx/en_us_public/titles:ti.CanonPascha	@ltx/en_us_dedes/titles:ti.CanonPascha
ltx/en_us_public/titles:ti.CanonPentecostarion	@ltx/en_us_dedes/titles:ti.CanonPentecostarion
ltx/en_us_public/titles:ti.CanonProphet	@ltx/en_us_dedes/titles:ti.CanonProphet
ltx/en_us_public/titles:ti.CanonProphetsMartyrs	@ltx/en_us_dedes/titles:ti.CanonProphetsMartyrs
ltx/en_us_public/titles:ti.CanonProtomartyrM	@ltx/en_us_dedes/titles:ti.CanonProtomartyrM
ltx/en_us_public/titles:ti.CanonResurrection	@ltx/en_us_dedes/titles:ti.CanonResurrection
ltx/en_us_public/titles:ti.CanonSaintM	@ltx/en_us_dedes/titles:ti.CanonSaintM
ltx/en_us_public/titles:ti.CanonSaintW	@ltx/en_us_dedes/titles:ti.CanonSaintW
ltx/en_us_public/titles:ti.CanonSaints	@ltx/en_us_dedes/titles:ti.CanonSaints
ltx/en_us_public/titles:ti.CanonSamaritanWoman	@ltx/en_us_dedes/titles:ti.CanonSamaritanWoman
ltx/en_us_public/titles:ti.CanonStNicholas	@ltx/en_us_dedes/titles:ti.CanonStNicholas
ltx/en_us_public/titles:ti.CanonTheotokos	@ltx/en_us_dedes/titles:ti.CanonTheotokos
ltx/en_us_public/titles:ti.CanonTrinity	@ltx/en_us_dedes/titles:ti.CanonTrinity
ltx/en_us_public/titles:ti.CanonTriodion	@ltx/en_us_dedes/titles:ti.CanonTriodion
ltx/en_us_public/titles:ti.Commanders	@ltx/en_us_dedes/titles:ti.Commanders
ltx/en_us_public/titles:ti.CommunionHymn	@ltx/en_us_dedes/titles:ti.CommunionHymn
ltx/en_us_public/titles:ti.Consecration	@ltx/en_us_dedes/titles:ti.Consecration
ltx/en_us_public/titles:ti.ConsecrationOfAChurch	@ltx/en_us_dedes/titles:ti.ConsecrationOfAChurch
ltx/en_us_public/titles:ti.Couplet	@ltx/en_us_dedes/titles:ti.Couplet
ltx/en_us_public/titles:ti.Cross	@ltx/en_us_dedes/titles:ti.Cross
ltx/en_us_public/titles:ti.Deceased	@ltx/en_us_dedes/titles:ti.Deceased
ltx/en_us_public/titles:ti.DevoutMartyrM	@ltx/en_us_dedes/titles:ti.DevoutMartyrM
ltx/en_us_public/titles:ti.DevoutMartyrW	@ltx/en_us_dedes/titles:ti.DevoutMartyrW
ltx/en_us_public/titles:ti.DevoutSaintM	@ltx/en_us_dedes/titles:ti.DevoutSaintM
ltx/en_us_public/titles:ti.DevoutSaints	@ltx/en_us_dedes/titles:ti.DevoutSaints
ltx/en_us_public/titles:ti.DevoutW	@ltx/en_us_dedes/titles:ti.DevoutW
ltx/en_us_public/titles:ti.Dismissal.uc	@ltx/en_us_dedes/titles:ti.Dismissal.uc
ltx/en_us_public/titles:ti.DogmaticTheotokion	@ltx/en_us_dedes/titles:ti.DogmaticTheotokion
ltx/en_us_public/titles:ti.Doxasticon	@ltx/en_us_dedes/titles:ti.Doxasticon
ltx/en_us_public/titles:ti.Earthquake	@ltx/en_us_dedes/titles:ti.Earthquake
ltx/en_us_public/titles:ti.Entrance.uc	@ltx/en_us_dedes/titles:ti.Entrance.uc
ltx/en_us_public/titles:ti.EntranceHymn	@ltx/en_us_dedes/titles:ti.EntranceHymn
ltx/en_us_public/titles:ti.Eothinon	@ltx/en_us_dedes/titles:ti.Eothinon
ltx/en_us_public/titles:ti.EothinonDoxasticon	@ltx/en_us_dedes/titles:ti.EothinonDoxasticon
ltx/en_us_public/titles:ti.EothinonGospel	@ltx/en_us_dedes/titles:ti.EothinonGospel
ltx/en_us_public/titles:ti.EothinonOfSunday	@ltx/en_us_dedes/titles:ti.EothinonOfSunday
ltx/en_us_public/titles:ti.Epistle	@ltx/en_us_dedes/titles:ti.Epistle
ltx/en_us_public/titles:ti.EqualsOfApostles	@ltx/en_us_dedes/titles:ti.EqualsOfApostles
ltx/en_us_public/titles:ti.Evangelist	@ltx/en_us_dedes/titles:ti.Evangelist
ltx/en_us_public/titles:ti.Evening	@ltx/en_us_dedes/titles:ti.Evening
ltx/en_us_public/titles:ti.Evening.uc	@ltx/en_us_dedes/titles:ti.Evening.uc
ltx/en_us_public/titles:ti.Evlogetaria	@ltx/en_us_dedes/titles:ti.Evlogetaria
ltx/en_us_public/titles:ti.Exaposteilaria	@ltx/en_us_dedes/titles:ti.Exaposteilaria
ltx/en_us_public/titles:ti.Exaposteilarion	@ltx/en_us_dedes/titles:ti.Exaposteilarion
ltx/en_us_public/titles:ti.ExaposteilarionOfDay	@ltx/en_us_dedes/titles:ti.ExaposteilarionOfDay
ltx/en_us_public/titles:ti.Fathers	@ltx/en_us_dedes/titles:ti.Fathers
ltx/en_us_public/titles:ti.Feast	@ltx/en_us_dedes/titles:ti.Feast
ltx/en_us_public/titles:ti.FifthSunday	@ltx/en_us_dedes/titles:ti.FifthSunday
ltx/en_us_public/titles:ti.FifthSunday.uc	@ltx/en_us_dedes/titles:ti.FifthSunday.uc
ltx/en_us_public/titles:ti.FirstSunday	@ltx/en_us_dedes/titles:ti.FirstSunday
ltx/en_us_public/titles:ti.FirstSunday.uc	@ltx/en_us_dedes/titles:ti.FirstSunday.uc
ltx/en_us_public/titles:ti.FirstTheotokion	@ltx/en_us_dedes/titles:ti.FirstTheotokion
ltx/en_us_public/titles:ti.FirstTheotokionOfMode	@ltx/en_us_dedes/titles:ti.FirstTheotokionOfMode
ltx/en_us_public/titles:ti.ForApostle	@ltx/en_us_dedes/titles:ti.ForApostle
ltx/en_us_public/titles:ti.ForApostles	@ltx/en_us_dedes/titles:ti.ForApostles
ltx/en_us_public/titles:ti.ForCompunction_1hymn	@ltx/en_us_dedes/titles:ti.ForCompunction_1hymn
ltx/en_us_public/titles:ti.ForCompunction_hymns	@ltx/en_us_dedes/titles:ti.ForCompunction_hymns
ltx/en_us_public/titles:ti.ForCross_1hymn	@ltx/en_us_dedes/titles:ti.ForCross_1hymn
ltx/en_us_public/titles:ti.ForCross_hymns	@ltx/en_us_dedes/titles:ti.ForCross_hymns
ltx/en_us_public/titles:ti.ForDead_1hymn	@ltx/en_us_dedes/titles:ti.ForDead_1hymn
ltx/en_us_public/titles:ti.ForDead_hymns	@ltx/en_us_dedes/titles:ti.ForDead_hymns
ltx/en_us_public/titles:ti.ForFriday	@ltx/en_us_dedes/titles:ti.ForFriday
ltx/en_us_public/titles:ti.ForMartyrs_1hymn	@ltx/en_us_dedes/titles:ti.ForMartyrs_1hymn
ltx/en_us_public/titles:ti.ForMartyrs_hymns	@ltx/en_us_dedes/titles:ti.ForMartyrs_hymns
ltx/en_us_public/titles:ti.ForMonday	@ltx/en_us_dedes/titles:ti.ForMonday
ltx/en_us_public/titles:ti.ForSaturday	@ltx/en_us_dedes/titles:ti.ForSaturday
ltx/en_us_public/titles:ti.ForSunday	@ltx/en_us_dedes/titles:ti.ForSunday
ltx/en_us_public/titles:ti.ForTheDay	@ltx/en_us_dedes/titles:ti.ForTheDay
ltx/en_us_public/titles:ti.ForThursday	@ltx/en_us_dedes/titles:ti.ForThursday
ltx/en_us_public/titles:ti.ForTuesday	@ltx/en_us_dedes/titles:ti.ForTuesday
ltx/en_us_public/titles:ti.ForWednesday	@ltx/en_us_dedes/titles:ti.ForWednesday
ltx/en_us_public/titles:ti.ForWeekday	@ltx/en_us_dedes/titles:ti.ForWeekday
ltx/en_us_public/titles:ti.Forefathers	@ltx/en_us_dedes/titles:ti.Forefathers
ltx/en_us_public/titles:ti.Forefestal_1hymn	@ltx/en_us_dedes/titles:ti.Forefestal_1hymn
ltx/en_us_public/titles:ti.Forefestal_Epistle	@ltx/en_us_dedes/titles:ti.Forefestal_Epistle
ltx/en_us_public/titles:ti.Forefestal_Gospel	@ltx/en_us_dedes/titles:ti.Forefestal_Gospel
ltx/en_us_public/titles:ti.Forefestal_hymns	@ltx/en_us_dedes/titles:ti.Forefestal_hymns
ltx/en_us_public/titles:ti.Forerunner	@ltx/en_us_dedes/titles:ti.Forerunner
ltx/en_us_public/titles:ti.FourthSunday	@ltx/en_us_dedes/titles:ti.FourthSunday
ltx/en_us_public/titles:ti.FourthSunday.uc	@ltx/en_us_dedes/titles:ti.FourthSunday.uc
ltx/en_us_public/titles:ti.FromMenaion	@ltx/en_us_dedes/titles:ti.FromMenaion
ltx/en_us_public/titles:ti.FromSmallVespers	@ltx/en_us_dedes/titles:ti.FromSmallVespers
ltx/en_us_public/titles:ti.FromVespers	@ltx/en_us_dedes/titles:ti.FromVespers
ltx/en_us_public/titles:ti.Glory	@ltx/en_us_dedes/titles:ti.Glory
ltx/en_us_public/titles:ti.GloryBothNow	@ltx/en_us_dedes/titles:ti.GloryBothNow
ltx/en_us_public/titles:ti.Gospel	@ltx/en_us_dedes/titles:ti.Gospel
ltx/en_us_public/titles:ti.GreatDoxologyAndDismissal	@ltx/en_us_dedes/titles:ti.GreatDoxologyAndDismissal
ltx/en_us_public/titles:ti.GreatMartyr	@ltx/en_us_dedes/titles:ti.GreatMartyr
ltx/en_us_public/titles:ti.GreatVespers.uc	@ltx/en_us_dedes/titles:ti.GreatVespers.uc
ltx/en_us_public/titles:ti.Heirmos	@ltx/en_us_dedes/titles:ti.Heirmos
ltx/en_us_public/titles:ti.HeirmosAsKatavasia	@ltx/en_us_dedes/titles:ti.HeirmosAsKatavasia
ltx/en_us_public/titles:ti.HeirmosUsingMelody	@ltx/en_us_dedes/titles:ti.HeirmosUsingMelody
ltx/en_us_public/titles:ti.Hierarch	@ltx/en_us_dedes/titles:ti.Hierarch
ltx/en_us_public/titles:ti.Hierarchs	@ltx/en_us_dedes/titles:ti.Hierarchs
ltx/en_us_public/titles:ti.Hieromartyr	@ltx/en_us_dedes/titles:ti.Hieromartyr
ltx/en_us_public/titles:ti.Hieromartyrs	@ltx/en_us_dedes/titles:ti.Hieromartyrs
ltx/en_us_public/titles:ti.HolyGospel	@ltx/en_us_dedes/titles:ti.HolyGospel
ltx/en_us_public/titles:ti.HolyNapkin	@ltx/en_us_dedes/titles:ti.HolyNapkin
ltx/en_us_public/titles:ti.HolyWomen	@ltx/en_us_dedes/titles:ti.HolyWomen
ltx/en_us_public/titles:ti.HymnToTheotokos	@ltx/en_us_dedes/titles:ti.HymnToTheotokos
ltx/en_us_public/titles:ti.HymnsAfterSmallEntrance	@ltx/en_us_dedes/titles:ti.HymnsAfterSmallEntrance
ltx/en_us_public/titles:ti.Hypakoe	@ltx/en_us_dedes/titles:ti.Hypakoe
ltx/en_us_public/titles:ti.Iambic	@ltx/en_us_dedes/titles:ti.Iambic
ltx/en_us_public/titles:ti.IambicCanon	@ltx/en_us_dedes/titles:ti.IambicCanon
ltx/en_us_public/titles:ti.Idiomela	@ltx/en_us_dedes/titles:ti.Idiomela
ltx/en_us_public/titles:ti.IdiomelaMenaion	@ltx/en_us_dedes/titles:ti.IdiomelaMenaion
ltx/en_us_public/titles:ti.IdiomelaOfAposticha	@ltx/en_us_dedes/titles:ti.IdiomelaOfAposticha
ltx/en_us_public/titles:ti.IdiomelaOfFeast	@ltx/en_us_dedes/titles:ti.IdiomelaOfFeast
ltx/en_us_public/titles:ti.IdiomelaOfLity	@ltx/en_us_dedes/titles:ti.IdiomelaOfLity
ltx/en_us_public/titles:ti.IdiomelaPentecostarion	@ltx/en_us_dedes/titles:ti.IdiomelaPentecostarion
ltx/en_us_public/titles:ti.IdiomelaTriodion	@ltx/en_us_dedes/titles:ti.IdiomelaTriodion
ltx/en_us_public/titles:ti.Idiomelon1	@ltx/en_us_dedes/titles:ti.Idiomelon1
ltx/en_us_public/titles:ti.Idiomelon10	@ltx/en_us_dedes/titles:ti.Idiomelon10
ltx/en_us_public/titles:ti.Idiomelon2	@ltx/en_us_dedes/titles:ti.Idiomelon2
ltx/en_us_public/titles:ti.Idiomelon3	@ltx/en_us_dedes/titles:ti.Idiomelon3
ltx/en_us_public/titles:ti.Idiomelon4	@ltx/en_us_dedes/titles:ti.Idiomelon4
ltx/en_us_public/titles:ti.Idiomelon5	@ltx/en_us_dedes/titles:ti.Idiomelon5
ltx/en_us_public/titles:ti.Idiomelon6	@ltx/en_us_dedes/titles:ti.Idiomelon6
ltx/en_us_public/titles:ti.Idiomelon7	@ltx/en_us_dedes/titles:ti.Idiomelon7
ltx/en_us_public/titles:ti.Idiomelon8	@ltx/en_us_dedes/titles:ti.Idiomelon8
ltx/en_us_public/titles:ti.Idiomelon9	@ltx/en_us_dedes/titles:ti.Idiomelon9
ltx/en_us_public/titles:ti.Indiction	@ltx/en_us_dedes/titles:ti.Indiction
ltx/en_us_public/titles:ti.InsteadOfWeHaveSeen	@ltx/en_us_dedes/titles:ti.InsteadOfWeHaveSeen
ltx/en_us_public/titles:ti.IntermediateVersesOde1	@ltx/en_us_dedes/titles:ti.IntermediateVersesOde1
ltx/en_us_public/titles:ti.IntermediateVersesOde3	@ltx/en_us_dedes/titles:ti.IntermediateVersesOde3
ltx/en_us_public/titles:ti.IntermediateVersesOde4	@ltx/en_us_dedes/titles:ti.IntermediateVersesOde4
ltx/en_us_public/titles:ti.IntermediateVersesOde5	@ltx/en_us_dedes/titles:ti.IntermediateVersesOde5
ltx/en_us_public/titles:ti.IntermediateVersesOde6	@ltx/en_us_dedes/titles:ti.IntermediateVersesOde6
ltx/en_us_public/titles:ti.IntermediateVersesOde7	@ltx/en_us_dedes/titles:ti.IntermediateVersesOde7
ltx/en_us_public/titles:ti.IntermediateVersesOde8	@ltx/en_us_dedes/titles:ti.IntermediateVersesOde8
ltx/en_us_public/titles:ti.Joseph	@ltx/en_us_dedes/titles:ti.Joseph
ltx/en_us_public/titles:ti.JosephTheBetrothed	@ltx/en_us_dedes/titles:ti.JosephTheBetrothed
ltx/en_us_public/titles:ti.Katavasia	@ltx/en_us_dedes/titles:ti.Katavasia
ltx/en_us_public/titles:ti.Katavasias	@ltx/en_us_dedes/titles:ti.Katavasias
ltx/en_us_public/titles:ti.Kathisma	@ltx/en_us_dedes/titles:ti.Kathisma
ltx/en_us_public/titles:ti.Kathisma1	@ltx/en_us_dedes/titles:ti.Kathisma1
ltx/en_us_public/titles:ti.Kathisma2	@ltx/en_us_dedes/titles:ti.Kathisma2
ltx/en_us_public/titles:ti.Kathisma3	@ltx/en_us_dedes/titles:ti.Kathisma3
ltx/en_us_public/titles:ti.KathismaMartyrs	@ltx/en_us_dedes/titles:ti.KathismaMartyrs
ltx/en_us_public/titles:ti.Kathismata	@ltx/en_us_dedes/titles:ti.Kathismata
ltx/en_us_public/titles:ti.KathismataMartyrs	@ltx/en_us_dedes/titles:ti.KathismataMartyrs
ltx/en_us_public/titles:ti.KathismataResurrectional	@ltx/en_us_dedes/titles:ti.KathismataResurrectional
ltx/en_us_public/titles:ti.Kontakia	@ltx/en_us_dedes/titles:ti.Kontakia
ltx/en_us_public/titles:ti.Kontakion	@ltx/en_us_dedes/titles:ti.Kontakion
ltx/en_us_public/titles:ti.KontakionDay	@ltx/en_us_dedes/titles:ti.KontakionDay
ltx/en_us_public/titles:ti.KontakionFathers	@ltx/en_us_dedes/titles:ti.KontakionFathers
ltx/en_us_public/titles:ti.KontakionFeast	@ltx/en_us_dedes/titles:ti.KontakionFeast
ltx/en_us_public/titles:ti.KontakionForefeast	@ltx/en_us_dedes/titles:ti.KontakionForefeast
ltx/en_us_public/titles:ti.KontakionPascha	@ltx/en_us_dedes/titles:ti.KontakionPascha
ltx/en_us_public/titles:ti.KontakionResurrectional	@ltx/en_us_dedes/titles:ti.KontakionResurrectional
ltx/en_us_public/titles:ti.KontakionTheotokos	@ltx/en_us_dedes/titles:ti.KontakionTheotokos
ltx/en_us_public/titles:ti.KontakionTriodion	@ltx/en_us_dedes/titles:ti.KontakionTriodion
ltx/en_us_public/titles:ti.Lauds	@ltx/en_us_dedes/titles:ti.Lauds
ltx/en_us_public/titles:ti.Lazarus	@ltx/en_us_dedes/titles:ti.Lazarus
ltx/en_us_public/titles:ti.LeavetakingOfFeast	@ltx/en_us_dedes/titles:ti.LeavetakingOfFeast
ltx/en_us_public/titles:ti.Litanies.uc	@ltx/en_us_dedes/titles:ti.Litanies.uc
ltx/en_us_public/titles:ti.LitanyComp.uc	@ltx/en_us_dedes/titles:ti.LitanyComp.uc
ltx/en_us_public/titles:ti.LitanyFerv.uc	@ltx/en_us_dedes/titles:ti.LitanyFerv.uc
ltx/en_us_public/titles:ti.LitanyGreat.uc	@ltx/en_us_dedes/titles:ti.LitanyGreat.uc
ltx/en_us_public/titles:ti.Liturgy.uc	@ltx/en_us_dedes/titles:ti.Liturgy.uc
ltx/en_us_public/titles:ti.Lity	@ltx/en_us_dedes/titles:ti.Lity
ltx/en_us_public/titles:ti.LityAndLoaves	@ltx/en_us_dedes/titles:ti.LityAndLoaves
ltx/en_us_public/titles:ti.LocalChurch	@ltx/en_us_dedes/titles:ti.LocalChurch
ltx/en_us_public/titles:ti.LordsPrayer.uc	@ltx/en_us_dedes/titles:ti.LordsPrayer.uc
ltx/en_us_public/titles:ti.Magnificat	@ltx/en_us_dedes/titles:ti.Magnificat
ltx/en_us_public/titles:ti.Martyr	@ltx/en_us_dedes/titles:ti.Martyr
ltx/en_us_public/titles:ti.MartyrW	@ltx/en_us_dedes/titles:ti.MartyrW
ltx/en_us_public/titles:ti.MartyricOfMode	@ltx/en_us_dedes/titles:ti.MartyricOfMode
ltx/en_us_public/titles:ti.Martyrs	@ltx/en_us_dedes/titles:ti.Martyrs
ltx/en_us_public/titles:ti.Matins.uc	@ltx/en_us_dedes/titles:ti.Matins.uc
ltx/en_us_public/titles:ti.Megalynaria	@ltx/en_us_dedes/titles:ti.Megalynaria
ltx/en_us_public/titles:ti.Megalynarion	@ltx/en_us_dedes/titles:ti.Megalynarion
ltx/en_us_public/titles:ti.Menaion	@ltx/en_us_dedes/titles:ti.Menaion
ltx/en_us_public/titles:ti.MidnightOffice.uc	@ltx/en_us_dedes/titles:ti.MidnightOffice.uc
ltx/en_us_public/titles:ti.Midpentecost	@ltx/en_us_dedes/titles:ti.Midpentecost
ltx/en_us_public/titles:ti.Mode	@ltx/en_us_dedes/titles:ti.Mode
ltx/en_us_public/titles:ti.ModeOfWeek	@ltx/en_us_dedes/titles:ti.ModeOfWeek
ltx/en_us_public/titles:ti.Morning	@ltx/en_us_dedes/titles:ti.Morning
ltx/en_us_public/titles:ti.Morning.uc	@ltx/en_us_dedes/titles:ti.Morning.uc
ltx/en_us_public/titles:ti.MyrrhbearerW	@ltx/en_us_dedes/titles:ti.MyrrhbearerW
ltx/en_us_public/titles:ti.Myrrhbearers	@ltx/en_us_dedes/titles:ti.Myrrhbearers
ltx/en_us_public/titles:ti.Neomartyr	@ltx/en_us_dedes/titles:ti.Neomartyr
ltx/en_us_public/titles:ti.Octoechos	@ltx/en_us_dedes/titles:ti.Octoechos
ltx/en_us_public/titles:ti.Oikos	@ltx/en_us_dedes/titles:ti.Oikos
ltx/en_us_public/titles:ti.OnFriday	@ltx/en_us_dedes/titles:ti.OnFriday
ltx/en_us_public/titles:ti.OnFriday.uc	@ltx/en_us_dedes/titles:ti.OnFriday.uc
ltx/en_us_public/titles:ti.OnMonday	@ltx/en_us_dedes/titles:ti.OnMonday
ltx/en_us_public/titles:ti.OnMonday.uc	@ltx/en_us_dedes/titles:ti.OnMonday.uc
ltx/en_us_public/titles:ti.OnSaturday	@ltx/en_us_dedes/titles:ti.OnSaturday
ltx/en_us_public/titles:ti.OnSaturday.uc	@ltx/en_us_dedes/titles:ti.OnSaturday.uc
ltx/en_us_public/titles:ti.OnSunday	@ltx/en_us_dedes/titles:ti.OnSunday
ltx/en_us_public/titles:ti.OnSunday.uc	@ltx/en_us_dedes/titles:ti.OnSunday.uc
ltx/en_us_public/titles:ti.OnThursday	@ltx/en_us_dedes/titles:ti.OnThursday
ltx/en_us_public/titles:ti.OnThursday.uc	@ltx/en_us_dedes/titles:ti.OnThursday.uc
ltx/en_us_public/titles:ti.OnTuesday	@ltx/en_us_dedes/titles:ti.OnTuesday
ltx/en_us_public/titles:ti.OnTuesday.uc	@ltx/en_us_dedes/titles:ti.OnTuesday.uc
ltx/en_us_public/titles:ti.OnWednesday	@ltx/en_us_dedes/titles:ti.OnWednesday
ltx/en_us_public/titles:ti.OnWednesday.uc	@ltx/en_us_dedes/titles:ti.OnWednesday.uc
ltx/en_us_public/titles:ti.OrModeOfWeek	@ltx/en_us_dedes/titles:ti.OrModeOfWeek
ltx/en_us_public/titles:ti.OrStavrotheotokion	@ltx/en_us_dedes/titles:ti.OrStavrotheotokion
ltx/en_us_public/titles:ti.Paralytic	@ltx/en_us_dedes/titles:ti.Paralytic
ltx/en_us_public/titles:ti.Pascha	@ltx/en_us_dedes/titles:ti.Pascha
ltx/en_us_public/titles:ti.Pentecostarion	@ltx/en_us_dedes/titles:ti.Pentecostarion
ltx/en_us_public/titles:ti.PhotagogicHymns	@ltx/en_us_dedes/titles:ti.PhotagogicHymns
ltx/en_us_public/titles:ti.Polyeleos	@ltx/en_us_dedes/titles:ti.Polyeleos
ltx/en_us_public/titles:ti.PostFestal_Epistle	@ltx/en_us_dedes/titles:ti.PostFestal_Epistle
ltx/en_us_public/titles:ti.PostFestal_Gospel	@ltx/en_us_dedes/titles:ti.PostFestal_Gospel
ltx/en_us_public/titles:ti.PrayerBlessingLoaves	@ltx/en_us_dedes/titles:ti.PrayerBlessingLoaves
ltx/en_us_public/titles:ti.PrayerOfStEphraim	@ltx/en_us_dedes/titles:ti.PrayerOfStEphraim
ltx/en_us_public/titles:ti.PremierApostles	@ltx/en_us_dedes/titles:ti.PremierApostles
ltx/en_us_public/titles:ti.Prokeimenon	@ltx/en_us_dedes/titles:ti.Prokeimenon
ltx/en_us_public/titles:ti.ProkeimenonEpistle	@ltx/en_us_dedes/titles:ti.ProkeimenonEpistle
ltx/en_us_public/titles:ti.Prophet	@ltx/en_us_dedes/titles:ti.Prophet
ltx/en_us_public/titles:ti.Prosomia	@ltx/en_us_dedes/titles:ti.Prosomia
ltx/en_us_public/titles:ti.ProtomartyrM	@ltx/en_us_dedes/titles:ti.ProtomartyrM
ltx/en_us_public/titles:ti.PsalmOfDavid	@ltx/en_us_dedes/titles:ti.PsalmOfDavid
ltx/en_us_public/titles:ti.Readings	@ltx/en_us_dedes/titles:ti.Readings
ltx/en_us_public/titles:ti.ReadingsCommemoration	@ltx/en_us_dedes/titles:ti.ReadingsCommemoration
ltx/en_us_public/titles:ti.ReadingsLiturgy	@ltx/en_us_dedes/titles:ti.ReadingsLiturgy
ltx/en_us_public/titles:ti.ReadingsRegularCycle	@ltx/en_us_dedes/titles:ti.ReadingsRegularCycle
ltx/en_us_public/titles:ti.ReadingsVespers	@ltx/en_us_dedes/titles:ti.ReadingsVespers
ltx/en_us_public/titles:ti.ReadingsVespersPreviousEvening	@ltx/en_us_dedes/titles:ti.ReadingsVespersPreviousEvening
ltx/en_us_public/titles:ti.RegularCycle	@ltx/en_us_dedes/titles:ti.RegularCycle
ltx/en_us_public/titles:ti.Repeat	@ltx/en_us_dedes/titles:ti.Repeat
ltx/en_us_public/titles:ti.RepeatHymn	@ltx/en_us_dedes/titles:ti.RepeatHymn
ltx/en_us_public/titles:ti.Resurrectional_1hymn	@ltx/en_us_dedes/titles:ti.Resurrectional_1hymn
ltx/en_us_public/titles:ti.Resurrectional_hymns	@ltx/en_us_dedes/titles:ti.Resurrectional_hymns
ltx/en_us_public/titles:ti.Righteous	@ltx/en_us_dedes/titles:ti.Righteous
ltx/en_us_public/titles:ti.RighteousM	@ltx/en_us_dedes/titles:ti.RighteousM
ltx/en_us_public/titles:ti.SaintM	@ltx/en_us_dedes/titles:ti.SaintM
ltx/en_us_public/titles:ti.SaintW	@ltx/en_us_dedes/titles:ti.SaintW
ltx/en_us_public/titles:ti.Saints	@ltx/en_us_dedes/titles:ti.Saints
ltx/en_us_public/titles:ti.Salutations	@ltx/en_us_dedes/titles:ti.Salutations
ltx/en_us_public/titles:ti.SamaritanWoman	@ltx/en_us_dedes/titles:ti.SamaritanWoman
ltx/en_us_public/titles:ti.SameHeirmos	@ltx/en_us_dedes/titles:ti.SameHeirmos
ltx/en_us_public/titles:ti.SameMelody_1hymn	@ltx/en_us_dedes/titles:ti.SameMelody_1hymn
ltx/en_us_public/titles:ti.SameMelody_hymns	@ltx/en_us_dedes/titles:ti.SameMelody_hymns
ltx/en_us_public/titles:ti.SameMode	@ltx/en_us_dedes/titles:ti.SameMode
ltx/en_us_public/titles:ti.SecondSunday	@ltx/en_us_dedes/titles:ti.SecondSunday
ltx/en_us_public/titles:ti.SecondSunday.uc	@ltx/en_us_dedes/titles:ti.SecondSunday.uc
ltx/en_us_public/titles:ti.SkippedEpistle	@ltx/en_us_dedes/titles:ti.SkippedEpistle
ltx/en_us_public/titles:ti.SkippedEpistleP	@ltx/en_us_dedes/titles:ti.SkippedEpistleP
ltx/en_us_public/titles:ti.SkippedGospel	@ltx/en_us_dedes/titles:ti.SkippedGospel
ltx/en_us_public/titles:ti.SkippedGospelP	@ltx/en_us_dedes/titles:ti.SkippedGospelP
ltx/en_us_public/titles:ti.SmallEntrance.uc	@ltx/en_us_dedes/titles:ti.SmallEntrance.uc
ltx/en_us_public/titles:ti.SmallVespers.uc	@ltx/en_us_dedes/titles:ti.SmallVespers.uc
ltx/en_us_public/titles:ti.StNicholas	@ltx/en_us_dedes/titles:ti.StNicholas
ltx/en_us_public/titles:ti.Stanza1	@ltx/en_us_dedes/titles:ti.Stanza1
ltx/en_us_public/titles:ti.Stanza2	@ltx/en_us_dedes/titles:ti.Stanza2
ltx/en_us_public/titles:ti.Stanza3	@ltx/en_us_dedes/titles:ti.Stanza3
ltx/en_us_public/titles:ti.Stanza4	@ltx/en_us_dedes/titles:ti.Stanza4
ltx/en_us_public/titles:ti.Stavrotheotokion	@ltx/en_us_dedes/titles:ti.Stavrotheotokion
ltx/en_us_public/titles:ti.Stichera	@ltx/en_us_dedes/titles:ti.Stichera
ltx/en_us_public/titles:ti.SticheraApostles	@ltx/en_us_dedes/titles:ti.SticheraApostles
ltx/en_us_public/titles:ti.SticheraConsecration	@ltx/en_us_dedes/titles:ti.SticheraConsecration
ltx/en_us_public/titles:ti.SticheraCross	@ltx/en_us_dedes/titles:ti.SticheraCross
ltx/en_us_public/titles:ti.SticheraCrucifixion	@ltx/en_us_dedes/titles:ti.SticheraCrucifixion
ltx/en_us_public/titles:ti.SticheraDeceased	@ltx/en_us_dedes/titles:ti.SticheraDeceased
ltx/en_us_public/titles:ti.SticheraFathers	@ltx/en_us_dedes/titles:ti.SticheraFathers
ltx/en_us_public/titles:ti.SticheraFeast	@ltx/en_us_dedes/titles:ti.SticheraFeast
ltx/en_us_public/titles:ti.SticheraForerunner	@ltx/en_us_dedes/titles:ti.SticheraForerunner
ltx/en_us_public/titles:ti.SticheraIdiomela	@ltx/en_us_dedes/titles:ti.SticheraIdiomela
ltx/en_us_public/titles:ti.SticheraIdiomelaFeast	@ltx/en_us_dedes/titles:ti.SticheraIdiomelaFeast
ltx/en_us_public/titles:ti.SticheraLauds	@ltx/en_us_dedes/titles:ti.SticheraLauds
ltx/en_us_public/titles:ti.SticheraMartyrs	@ltx/en_us_dedes/titles:ti.SticheraMartyrs
ltx/en_us_public/titles:ti.SticheraMaster	@ltx/en_us_dedes/titles:ti.SticheraMaster
ltx/en_us_public/titles:ti.SticheraMenaion	@ltx/en_us_dedes/titles:ti.SticheraMenaion
ltx/en_us_public/titles:ti.SticheraPascha	@ltx/en_us_dedes/titles:ti.SticheraPascha
ltx/en_us_public/titles:ti.SticheraPentecostarion	@ltx/en_us_dedes/titles:ti.SticheraPentecostarion
ltx/en_us_public/titles:ti.SticheraProsomia	@ltx/en_us_dedes/titles:ti.SticheraProsomia
ltx/en_us_public/titles:ti.SticheraProsomiaDevoutM	@ltx/en_us_dedes/titles:ti.SticheraProsomiaDevoutM
ltx/en_us_public/titles:ti.SticheraProsomiaSaintM	@ltx/en_us_dedes/titles:ti.SticheraProsomiaSaintM
ltx/en_us_public/titles:ti.SticheraResurrectional	@ltx/en_us_dedes/titles:ti.SticheraResurrectional
ltx/en_us_public/titles:ti.SticheraResurrectionalOctoechos	@ltx/en_us_dedes/titles:ti.SticheraResurrectionalOctoechos
ltx/en_us_public/titles:ti.SticheraStNicholas	@ltx/en_us_dedes/titles:ti.SticheraStNicholas
ltx/en_us_public/titles:ti.SticheraTheotokos	@ltx/en_us_dedes/titles:ti.SticheraTheotokos
ltx/en_us_public/titles:ti.SticheraTriodion	@ltx/en_us_dedes/titles:ti.SticheraTriodion
ltx/en_us_public/titles:ti.Sticheron	@ltx/en_us_dedes/titles:ti.Sticheron
ltx/en_us_public/titles:ti.Sticheron1	@ltx/en_us_dedes/titles:ti.Sticheron1
ltx/en_us_public/titles:ti.Sticheron10	@ltx/en_us_dedes/titles:ti.Sticheron10
ltx/en_us_public/titles:ti.Sticheron2	@ltx/en_us_dedes/titles:ti.Sticheron2
ltx/en_us_public/titles:ti.Sticheron3	@ltx/en_us_dedes/titles:ti.Sticheron3
ltx/en_us_public/titles:ti.Sticheron4	@ltx/en_us_dedes/titles:ti.Sticheron4
ltx/en_us_public/titles:ti.Sticheron5	@ltx/en_us_dedes/titles:ti.Sticheron5
ltx/en_us_public/titles:ti.Sticheron6	@ltx/en_us_dedes/titles:ti.Sticheron6
ltx/en_us_public/titles:ti.Sticheron7	@ltx/en_us_dedes/titles:ti.Sticheron7
ltx/en_us_public/titles:ti.Sticheron8	@ltx/en_us_dedes/titles:ti.Sticheron8
ltx/en_us_public/titles:ti.Sticheron9	@ltx/en_us_dedes/titles:ti.Sticheron9
ltx/en_us_public/titles:ti.SticheronIdiomelon	@ltx/en_us_dedes/titles:ti.SticheronIdiomelon
ltx/en_us_public/titles:ti.Stichologia	@ltx/en_us_dedes/titles:ti.Stichologia
ltx/en_us_public/titles:ti.SungInThisOde	@ltx/en_us_dedes/titles:ti.SungInThisOde
ltx/en_us_public/titles:ti.Synaxarion	@ltx/en_us_dedes/titles:ti.Synaxarion
ltx/en_us_public/titles:ti.TheCanon	@ltx/en_us_dedes/titles:ti.TheCanon
ltx/en_us_public/titles:ti.TheCanonFeast	@ltx/en_us_dedes/titles:ti.TheCanonFeast
ltx/en_us_public/titles:ti.TheCanonGeneralMenaion	@ltx/en_us_dedes/titles:ti.TheCanonGeneralMenaion
ltx/en_us_public/titles:ti.TheCanonMenaion	@ltx/en_us_dedes/titles:ti.TheCanonMenaion
ltx/en_us_public/titles:ti.TheProphecy.uc	@ltx/en_us_dedes/titles:ti.TheProphecy.uc
ltx/en_us_public/titles:ti.TheResurrectional_1hymn	@ltx/en_us_dedes/titles:ti.TheResurrectional_1hymn
ltx/en_us_public/titles:ti.TheResurrectional_hymns	@ltx/en_us_dedes/titles:ti.TheResurrectional_hymns
ltx/en_us_public/titles:ti.TheSameMode	@ltx/en_us_dedes/titles:ti.TheSameMode
ltx/en_us_public/titles:ti.TheTwelve	@ltx/en_us_dedes/titles:ti.TheTwelve
ltx/en_us_public/titles:ti.Theotokia	@ltx/en_us_dedes/titles:ti.Theotokia
ltx/en_us_public/titles:ti.Theotokion	@ltx/en_us_dedes/titles:ti.Theotokion
ltx/en_us_public/titles:ti.Theotokos	@ltx/en_us_dedes/titles:ti.Theotokos
ltx/en_us_public/titles:ti.ThirdSunday	@ltx/en_us_dedes/titles:ti.ThirdSunday
ltx/en_us_public/titles:ti.ThirdSunday.uc	@ltx/en_us_dedes/titles:ti.ThirdSunday.uc
ltx/en_us_public/titles:ti.Triadic	@ltx/en_us_dedes/titles:ti.Triadic
ltx/en_us_public/titles:ti.TriadicHymns	@ltx/en_us_dedes/titles:ti.TriadicHymns
ltx/en_us_public/titles:ti.Triodion	@ltx/en_us_dedes/titles:ti.Triodion
ltx/en_us_public/titles:ti.Trisagion	@ltx/en_us_dedes/titles:ti.Trisagion
ltx/en_us_public/titles:ti.TrisagiosHymn.uc	@ltx/en_us_dedes/titles:ti.TrisagiosHymn.uc
ltx/en_us_public/titles:ti.Troparia	@ltx/en_us_dedes/titles:ti.Troparia
ltx/en_us_public/titles:ti.TropariaCompunction	@ltx/en_us_dedes/titles:ti.TropariaCompunction
ltx/en_us_public/titles:ti.Troparion	@ltx/en_us_dedes/titles:ti.Troparion
ltx/en_us_public/titles:ti.TroparionOfProphecy	@ltx/en_us_dedes/titles:ti.TroparionOfProphecy
ltx/en_us_public/titles:ti.TypikaAndBeatitudes	@ltx/en_us_dedes/titles:ti.TypikaAndBeatitudes
ltx/en_us_public/titles:ti.Verses	@ltx/en_us_dedes/titles:ti.Verses
ltx/en_us_public/titles:ti.VirginMartyrW	@ltx/en_us_dedes/titles:ti.VirginMartyrW
ltx/en_us_public/titles:ti.WithAcrostic	@ltx/en_us_dedes/titles:ti.WithAcrostic
ltx/en_us_public/titles:ti.beforeMeatFareSunday	@ltx/en_us_dedes/titles:ti.beforeMeatFareSunday
ltx/en_us_public/titles:ti.dayFriday	@ltx/en_us_dedes/titles:ti.dayFriday
ltx/en_us_public/titles:ti.dayFriday.uc	@ltx/en_us_dedes/titles:ti.dayFriday.uc
ltx/en_us_public/titles:ti.dayMonday	@ltx/en_us_dedes/titles:ti.dayMonday
ltx/en_us_public/titles:ti.dayMonday.uc	@ltx/en_us_dedes/titles:ti.dayMonday.uc
ltx/en_us_public/titles:ti.daySaturday	@ltx/en_us_dedes/titles:ti.daySaturday
ltx/en_us_public/titles:ti.daySaturday.uc	@ltx/en_us_dedes/titles:ti.daySaturday.uc
ltx/en_us_public/titles:ti.daySunday	@ltx/en_us_dedes/titles:ti.daySunday
ltx/en_us_public/titles:ti.daySunday.uc	@ltx/en_us_dedes/titles:ti.daySunday.uc
ltx/en_us_public/titles:ti.dayThursday	@ltx/en_us_dedes/titles:ti.dayThursday
ltx/en_us_public/titles:ti.dayThursday.uc	@ltx/en_us_dedes/titles:ti.dayThursday.uc
ltx/en_us_public/titles:ti.dayTuesday	@ltx/en_us_dedes/titles:ti.dayTuesday
ltx/en_us_public/titles:ti.dayTuesday.uc	@ltx/en_us_dedes/titles:ti.dayTuesday.uc
ltx/en_us_public/titles:ti.dayWednesday	@ltx/en_us_dedes/titles:ti.dayWednesday
ltx/en_us_public/titles:ti.dayWednesday.uc	@ltx/en_us_dedes/titles:ti.dayWednesday.uc
ltx/en_us_public/titles:ti.eclog.Angels.title	@ltx/en_us_dedes/titles:ti.eclog.Angels.title
ltx/en_us_public/titles:ti.eclog.Annunciation.title	@ltx/en_us_dedes/titles:ti.eclog.Annunciation.title
ltx/en_us_public/titles:ti.eclog.Apostles.title	@ltx/en_us_dedes/titles:ti.eclog.Apostles.title
ltx/en_us_public/titles:ti.eclog.Ascension.title	@ltx/en_us_dedes/titles:ti.eclog.Ascension.title
ltx/en_us_public/titles:ti.eclog.Christmas.title	@ltx/en_us_dedes/titles:ti.eclog.Christmas.title
ltx/en_us_public/titles:ti.eclog.Cross.title	@ltx/en_us_dedes/titles:ti.eclog.Cross.title
ltx/en_us_public/titles:ti.eclog.Dormition.title	@ltx/en_us_dedes/titles:ti.eclog.Dormition.title
ltx/en_us_public/titles:ti.eclog.Entry.title	@ltx/en_us_dedes/titles:ti.eclog.Entry.title
ltx/en_us_public/titles:ti.eclog.Epiphany.title	@ltx/en_us_dedes/titles:ti.eclog.Epiphany.title
ltx/en_us_public/titles:ti.eclog.Forerunner.title	@ltx/en_us_dedes/titles:ti.eclog.Forerunner.title
ltx/en_us_public/titles:ti.eclog.Hierarchs.title	@ltx/en_us_dedes/titles:ti.eclog.Hierarchs.title
ltx/en_us_public/titles:ti.eclog.Martyrs.title	@ltx/en_us_dedes/titles:ti.eclog.Martyrs.title
ltx/en_us_public/titles:ti.eclog.Meatfare.title	@ltx/en_us_dedes/titles:ti.eclog.Meatfare.title
ltx/en_us_public/titles:ti.eclog.Meeting.title	@ltx/en_us_dedes/titles:ti.eclog.Meeting.title
ltx/en_us_public/titles:ti.eclog.Monastics.title	@ltx/en_us_dedes/titles:ti.eclog.Monastics.title
ltx/en_us_public/titles:ti.eclog.Palm.title	@ltx/en_us_dedes/titles:ti.eclog.Palm.title
ltx/en_us_public/titles:ti.eclog.Pentecost.title	@ltx/en_us_dedes/titles:ti.eclog.Pentecost.title
ltx/en_us_public/titles:ti.eclog.ProphetElias.title	@ltx/en_us_dedes/titles:ti.eclog.ProphetElias.title
ltx/en_us_public/titles:ti.eclog.StAnne.title	@ltx/en_us_dedes/titles:ti.eclog.StAnne.title
ltx/en_us_public/titles:ti.eclog.Theotokos.title	@ltx/en_us_dedes/titles:ti.eclog.Theotokos.title
ltx/en_us_public/titles:ti.eclog.TheotokosBirth.title	@ltx/en_us_dedes/titles:ti.eclog.TheotokosBirth.title
ltx/en_us_public/titles:ti.eclog.Thomas.title	@ltx/en_us_dedes/titles:ti.eclog.Thomas.title
ltx/en_us_public/titles:ti.eclog.Transfiguration.title	@ltx/en_us_dedes/titles:ti.eclog.Transfiguration.title
ltx/en_us_public/titles:ti.eclog.rubric1	@ltx/en_us_dedes/titles:ti.eclog.rubric1
ltx/en_us_public/titles:ti.eclog.title1	@ltx/en_us_dedes/titles:ti.eclog.title1
ltx/en_us_public/titles:ti.eclog.title2	@ltx/en_us_dedes/titles:ti.eclog.title2
ltx/en_us_public/titles:ti.eclog.title3	@ltx/en_us_dedes/titles:ti.eclog.title3
ltx/en_us_public/titles:ti.forAnnunciation	@ltx/en_us_dedes/titles:ti.forAnnunciation
ltx/en_us_public/titles:ti.forChristmas	@ltx/en_us_dedes/titles:ti.forChristmas
ltx/en_us_public/titles:ti.forCross	@ltx/en_us_dedes/titles:ti.forCross
ltx/en_us_public/titles:ti.forDormition	@ltx/en_us_dedes/titles:ti.forDormition
ltx/en_us_public/titles:ti.forEntry	@ltx/en_us_dedes/titles:ti.forEntry
ltx/en_us_public/titles:ti.forMeeting	@ltx/en_us_dedes/titles:ti.forMeeting
ltx/en_us_public/titles:ti.forTheotokosBirth	@ltx/en_us_dedes/titles:ti.forTheotokosBirth
ltx/en_us_public/titles:ti.forTransfiguration	@ltx/en_us_dedes/titles:ti.forTransfiguration
ltx/en_us_public/titles:ti.intheEvening	@ltx/en_us_dedes/titles:ti.intheEvening
ltx/en_us_public/titles:ti.ofAscension	@ltx/en_us_dedes/titles:ti.ofAscension
ltx/en_us_public/titles:ti.ofBrightWeek	@ltx/en_us_dedes/titles:ti.ofBrightWeek
ltx/en_us_public/titles:ti.ofCheeseWeek	@ltx/en_us_dedes/titles:ti.ofCheeseWeek
ltx/en_us_public/titles:ti.ofCheeseWeek.uc	@ltx/en_us_dedes/titles:ti.ofCheeseWeek.uc
ltx/en_us_public/titles:ti.ofHolyWeek	@ltx/en_us_dedes/titles:ti.ofHolyWeek
ltx/en_us_public/titles:ti.ofLent	@ltx/en_us_dedes/titles:ti.ofLent
ltx/en_us_public/titles:ti.ofLent.uc	@ltx/en_us_dedes/titles:ti.ofLent.uc
ltx/en_us_public/titles:ti.ofPentecost	@ltx/en_us_dedes/titles:ti.ofPentecost
ltx/en_us_public/titles:ti.ofWeek1	@ltx/en_us_dedes/titles:ti.ofWeek1
ltx/en_us_public/titles:ti.ofWeek1.uc	@ltx/en_us_dedes/titles:ti.ofWeek1.uc
ltx/en_us_public/titles:ti.ofWeek2	@ltx/en_us_dedes/titles:ti.ofWeek2
ltx/en_us_public/titles:ti.ofWeek2.uc	@ltx/en_us_dedes/titles:ti.ofWeek2.uc
ltx/en_us_public/titles:ti.ofWeek3	@ltx/en_us_dedes/titles:ti.ofWeek3
ltx/en_us_public/titles:ti.ofWeek3.uc	@ltx/en_us_dedes/titles:ti.ofWeek3.uc
ltx/en_us_public/titles:ti.ofWeek4	@ltx/en_us_dedes/titles:ti.ofWeek4
ltx/en_us_public/titles:ti.ofWeek4.uc	@ltx/en_us_dedes/titles:ti.ofWeek4.uc
ltx/en_us_public/titles:ti.ofWeek5	@ltx/en_us_dedes/titles:ti.ofWeek5
ltx/en_us_public/titles:ti.ofWeek5.uc	@ltx/en_us_dedes/titles:ti.ofWeek5.uc
ltx/en_us_public/titles:ti.ofWeek6_pe	@ltx/en_us_dedes/titles:ti.ofWeek6_pe
ltx/en_us_public/titles:ti.ofWeek6_pe.uc	@ltx/en_us_dedes/titles:ti.ofWeek6_pe.uc
ltx/en_us_public/titles:ti.ofWeek6_tr	@ltx/en_us_dedes/titles:ti.ofWeek6_tr
ltx/en_us_public/titles:ti.ofWeek6_tr.uc	@ltx/en_us_dedes/titles:ti.ofWeek6_tr.uc
ltx/en_us_public/titles:ti.ofWeek7	@ltx/en_us_dedes/titles:ti.ofWeek7
ltx/en_us_public/titles:ti.ofWeek7.uc	@ltx/en_us_dedes/titles:ti.ofWeek7.uc
ltx/en_us_public/titles:ti.ofWeek8_pe	@ltx/en_us_dedes/titles:ti.ofWeek8_pe
ltx/en_us_public/titles:ti.ofWeek8_pe.uc	@ltx/en_us_dedes/titles:ti.ofWeek8_pe.uc
ltx/en_us_public/titles:ti.sourceEuchologion	@ltx/en_us_dedes/titles:ti.sourceEuchologion
ltx/en_us_public/titles:ti.sourceHorologion	@ltx/en_us_dedes/titles:ti.sourceHorologion
ltx/en_us_public/titles:ti.sourceMeSupplement	@ltx/en_us_dedes/titles:ti.sourceMeSupplement
ltx/en_us_public/titles:ti.sourceMenaion	@ltx/en_us_dedes/titles:ti.sourceMenaion
ltx/en_us_public/titles:ti.sourceOctoechos	@ltx/en_us_dedes/titles:ti.sourceOctoechos
ltx/en_us_public/titles:ti.sourcePeSupplement	@ltx/en_us_dedes/titles:ti.sourcePeSupplement
ltx/en_us_public/titles:ti.sourcePentecostarion	@ltx/en_us_dedes/titles:ti.sourcePentecostarion
ltx/en_us_public/titles:ti.sourceTriodion	@ltx/en_us_dedes/titles:ti.sourceTriodion
