ltx/en_us_public/sy.m12.d24:syMA.commemoration01.couplet1.title	@ltx/en_us_dedes/sy.m12.d24:syMA.commemoration01.couplet1.title
ltx/en_us_public/sy.m12.d24:syMA.commemoration01.couplet1.verse1	@ltx/en_us_dedes/sy.m12.d24:syMA.commemoration01.couplet1.verse1
ltx/en_us_public/sy.m12.d24:syMA.commemoration01.couplet1.verse2	@ltx/en_us_dedes/sy.m12.d24:syMA.commemoration01.couplet1.verse2
ltx/en_us_public/sy.m12.d24:syMA.commemoration01.poem.verse01	@ltx/en_us_dedes/sy.m12.d24:syMA.commemoration01.poem.verse01
ltx/en_us_public/sy.m12.d24:syMA.commemoration01.poem.verse02	@ltx/en_us_dedes/sy.m12.d24:syMA.commemoration01.poem.verse02
ltx/en_us_public/sy.m12.d24:syMA.commemoration01.poem.verse03	@ltx/en_us_dedes/sy.m12.d24:syMA.commemoration01.poem.verse03
ltx/en_us_public/sy.m12.d24:syMA.commemoration01.poem.verse04	@ltx/en_us_dedes/sy.m12.d24:syMA.commemoration01.poem.verse04
ltx/en_us_public/sy.m12.d24:syMA.commemoration01.poem.verse05	@ltx/en_us_dedes/sy.m12.d24:syMA.commemoration01.poem.verse05
ltx/en_us_public/sy.m12.d24:syMA.commemoration01.poem.verse06	@ltx/en_us_dedes/sy.m12.d24:syMA.commemoration01.poem.verse06
ltx/en_us_public/sy.m12.d24:syMA.commemoration01.poem.verse07	@ltx/en_us_dedes/sy.m12.d24:syMA.commemoration01.poem.verse07
ltx/en_us_public/sy.m12.d24:syMA.commemoration01.poem.verse08	@ltx/en_us_dedes/sy.m12.d24:syMA.commemoration01.poem.verse08
ltx/en_us_public/sy.m12.d24:syMA.commemoration01.poem.verse09	@ltx/en_us_dedes/sy.m12.d24:syMA.commemoration01.poem.verse09
ltx/en_us_public/sy.m12.d24:syMA.commemoration01.poem.verse10	@ltx/en_us_dedes/sy.m12.d24:syMA.commemoration01.poem.verse10
ltx/en_us_public/sy.m12.d24:syMA.commemoration01.poem.verse11	@ltx/en_us_dedes/sy.m12.d24:syMA.commemoration01.poem.verse11
ltx/en_us_public/sy.m12.d24:syMA.commemoration01.poem.verse12	@ltx/en_us_dedes/sy.m12.d24:syMA.commemoration01.poem.verse12
ltx/en_us_public/sy.m12.d24:syMA.commemoration01.poem.verse13	@ltx/en_us_dedes/sy.m12.d24:syMA.commemoration01.poem.verse13
ltx/en_us_public/sy.m12.d24:syMA.commemoration01.poem.verse14	@ltx/en_us_dedes/sy.m12.d24:syMA.commemoration01.poem.verse14
ltx/en_us_public/sy.m12.d24:syMA.commemoration01.poem.verse15	@ltx/en_us_dedes/sy.m12.d24:syMA.commemoration01.poem.verse15
ltx/en_us_public/sy.m12.d24:syMA.commemoration01.poem.verse16	@ltx/en_us_dedes/sy.m12.d24:syMA.commemoration01.poem.verse16
ltx/en_us_public/sy.m12.d24:syMA.commemoration01.poem.verse17	@ltx/en_us_dedes/sy.m12.d24:syMA.commemoration01.poem.verse17
ltx/en_us_public/sy.m12.d24:syMA.commemoration01.poem.verse18	@ltx/en_us_dedes/sy.m12.d24:syMA.commemoration01.poem.verse18
ltx/en_us_public/sy.m12.d24:syMA.commemoration01.poem.verse19	@ltx/en_us_dedes/sy.m12.d24:syMA.commemoration01.poem.verse19
ltx/en_us_public/sy.m12.d24:syMA.commemoration01.poem.verse20	@ltx/en_us_dedes/sy.m12.d24:syMA.commemoration01.poem.verse20
ltx/en_us_public/sy.m12.d24:syMA.commemoration01.poem.verse21	@ltx/en_us_dedes/sy.m12.d24:syMA.commemoration01.poem.verse21
ltx/en_us_public/sy.m12.d24:syMA.commemoration01.poem.verse22	@ltx/en_us_dedes/sy.m12.d24:syMA.commemoration01.poem.verse22
ltx/en_us_public/sy.m12.d24:syMA.commemoration01.poem.verse23	@ltx/en_us_dedes/sy.m12.d24:syMA.commemoration01.poem.verse23
ltx/en_us_public/sy.m12.d24:syMA.commemoration01.poem.verse24	@ltx/en_us_dedes/sy.m12.d24:syMA.commemoration01.poem.verse24
ltx/en_us_public/sy.m12.d24:syMA.commemoration01.poem.verse25	@ltx/en_us_dedes/sy.m12.d24:syMA.commemoration01.poem.verse25
ltx/en_us_public/sy.m12.d24:syMA.commemoration01.poem.verse26	@ltx/en_us_dedes/sy.m12.d24:syMA.commemoration01.poem.verse26
ltx/en_us_public/sy.m12.d24:syMA.commemoration01.poem.verse27	@ltx/en_us_dedes/sy.m12.d24:syMA.commemoration01.poem.verse27
ltx/en_us_public/sy.m12.d24:syMA.commemoration01.poem.verse28	@ltx/en_us_dedes/sy.m12.d24:syMA.commemoration01.poem.verse28
ltx/en_us_public/sy.m12.d24:syMA.commemoration01.poem.verse29	@ltx/en_us_dedes/sy.m12.d24:syMA.commemoration01.poem.verse29
ltx/en_us_public/sy.m12.d24:syMA.commemoration01.poem.verse30	@ltx/en_us_dedes/sy.m12.d24:syMA.commemoration01.poem.verse30
ltx/en_us_public/sy.m12.d24:syMA.commemoration01.poem.verse31	@ltx/en_us_dedes/sy.m12.d24:syMA.commemoration01.poem.verse31
ltx/en_us_public/sy.m12.d24:syMA.commemoration01.poem.verse32	@ltx/en_us_dedes/sy.m12.d24:syMA.commemoration01.poem.verse32
ltx/en_us_public/sy.m12.d24:syMA.commemoration01.poem.verse33	@ltx/en_us_dedes/sy.m12.d24:syMA.commemoration01.poem.verse33
ltx/en_us_public/sy.m12.d24:syMA.commemoration01.poem.verse34	@ltx/en_us_dedes/sy.m12.d24:syMA.commemoration01.poem.verse34
ltx/en_us_public/sy.m12.d24:syMA.commemoration01.poem.verse35	@ltx/en_us_dedes/sy.m12.d24:syMA.commemoration01.poem.verse35
ltx/en_us_public/sy.m12.d24:syMA.commemoration01.poem.verse36	@ltx/en_us_dedes/sy.m12.d24:syMA.commemoration01.poem.verse36
ltx/en_us_public/sy.m12.d24:syMA.commemoration01.poem.verse37	@ltx/en_us_dedes/sy.m12.d24:syMA.commemoration01.poem.verse37
ltx/en_us_public/sy.m12.d24:syMA.commemoration01.poem.verse38	@ltx/en_us_dedes/sy.m12.d24:syMA.commemoration01.poem.verse38
ltx/en_us_public/sy.m12.d24:syMA.commemoration01.poem.verse39	@ltx/en_us_dedes/sy.m12.d24:syMA.commemoration01.poem.verse39
ltx/en_us_public/sy.m12.d24:syMA.commemoration01.poem.verse40	@ltx/en_us_dedes/sy.m12.d24:syMA.commemoration01.poem.verse40
ltx/en_us_public/sy.m12.d24:syMA.commemoration01.poem.verse41	@ltx/en_us_dedes/sy.m12.d24:syMA.commemoration01.poem.verse41
ltx/en_us_public/sy.m12.d24:syMA.commemoration01.poem.verse42	@ltx/en_us_dedes/sy.m12.d24:syMA.commemoration01.poem.verse42
ltx/en_us_public/sy.m12.d24:syMA.commemoration01.poem.verse43	@ltx/en_us_dedes/sy.m12.d24:syMA.commemoration01.poem.verse43
ltx/en_us_public/sy.m12.d24:syMA.commemoration01.poem.verse44	@ltx/en_us_dedes/sy.m12.d24:syMA.commemoration01.poem.verse44
ltx/en_us_public/sy.m12.d24:syMA.commemoration01.poem.verse45	@ltx/en_us_dedes/sy.m12.d24:syMA.commemoration01.poem.verse45
ltx/en_us_public/sy.m12.d24:syMA.commemoration01.poem.verse46	@ltx/en_us_dedes/sy.m12.d24:syMA.commemoration01.poem.verse46
ltx/en_us_public/sy.m12.d24:syMA.commemoration01.poem.verse47	@ltx/en_us_dedes/sy.m12.d24:syMA.commemoration01.poem.verse47
ltx/en_us_public/sy.m12.d24:syMA.commemoration01.poem.verse48	@ltx/en_us_dedes/sy.m12.d24:syMA.commemoration01.poem.verse48
ltx/en_us_public/sy.m12.d24:syMA.commemoration01.poem.verse49	@ltx/en_us_dedes/sy.m12.d24:syMA.commemoration01.poem.verse49
ltx/en_us_public/sy.m12.d24:syMA.commemoration01.poem.verse50	@ltx/en_us_dedes/sy.m12.d24:syMA.commemoration01.poem.verse50
ltx/en_us_public/sy.m12.d24:syMA.commemoration01.poem.verse51	@ltx/en_us_dedes/sy.m12.d24:syMA.commemoration01.poem.verse51
ltx/en_us_public/sy.m12.d24:syMA.commemoration01.poem.verse52	@ltx/en_us_dedes/sy.m12.d24:syMA.commemoration01.poem.verse52
ltx/en_us_public/sy.m12.d24:syMA.commemoration01.poem.verse53	@ltx/en_us_dedes/sy.m12.d24:syMA.commemoration01.poem.verse53
ltx/en_us_public/sy.m12.d24:syMA.commemoration01.poem.verse54	@ltx/en_us_dedes/sy.m12.d24:syMA.commemoration01.poem.verse54
ltx/en_us_public/sy.m12.d24:syMA.commemoration01.poem.verse55	@ltx/en_us_dedes/sy.m12.d24:syMA.commemoration01.poem.verse55
ltx/en_us_public/sy.m12.d24:syMA.commemoration01.poem.verse56	@ltx/en_us_dedes/sy.m12.d24:syMA.commemoration01.poem.verse56
ltx/en_us_public/sy.m12.d24:syMA.commemoration01.poem.verse57	@ltx/en_us_dedes/sy.m12.d24:syMA.commemoration01.poem.verse57
ltx/en_us_public/sy.m12.d24:syMA.commemoration01.poem.verse58	@ltx/en_us_dedes/sy.m12.d24:syMA.commemoration01.poem.verse58
ltx/en_us_public/sy.m12.d24:syMA.commemoration01.poem.verse59	@ltx/en_us_dedes/sy.m12.d24:syMA.commemoration01.poem.verse59
ltx/en_us_public/sy.m12.d24:syMA.commemoration01.poem.verse60	@ltx/en_us_dedes/sy.m12.d24:syMA.commemoration01.poem.verse60
ltx/en_us_public/sy.m12.d24:syMA.commemoration01.poem.verse61	@ltx/en_us_dedes/sy.m12.d24:syMA.commemoration01.poem.verse61
ltx/en_us_public/sy.m12.d24:syMA.commemoration01.poem.verse62	@ltx/en_us_dedes/sy.m12.d24:syMA.commemoration01.poem.verse62
ltx/en_us_public/sy.m12.d24:syMA.commemoration01.poem.verse63	@ltx/en_us_dedes/sy.m12.d24:syMA.commemoration01.poem.verse63
ltx/en_us_public/sy.m12.d24:syMA.commemoration01.poem.verse64	@ltx/en_us_dedes/sy.m12.d24:syMA.commemoration01.poem.verse64
ltx/en_us_public/sy.m12.d24:syMA.commemoration01.poem.verse65	@ltx/en_us_dedes/sy.m12.d24:syMA.commemoration01.poem.verse65
ltx/en_us_public/sy.m12.d24:syMA.commemoration01.poem.verse66	@ltx/en_us_dedes/sy.m12.d24:syMA.commemoration01.poem.verse66
ltx/en_us_public/sy.m12.d24:syMA.commemoration01.poem.verse67	@ltx/en_us_dedes/sy.m12.d24:syMA.commemoration01.poem.verse67
ltx/en_us_public/sy.m12.d24:syMA.commemoration01.poem.verse68	@ltx/en_us_dedes/sy.m12.d24:syMA.commemoration01.poem.verse68
ltx/en_us_public/sy.m12.d24:syMA.commemoration01.poem.verse69	@ltx/en_us_dedes/sy.m12.d24:syMA.commemoration01.poem.verse69
ltx/en_us_public/sy.m12.d24:syMA.commemoration01.poem.verse70	@ltx/en_us_dedes/sy.m12.d24:syMA.commemoration01.poem.verse70
ltx/en_us_public/sy.m12.d24:syMA.commemoration01.poem.verse71	@ltx/en_us_dedes/sy.m12.d24:syMA.commemoration01.poem.verse71
ltx/en_us_public/sy.m12.d24:syMA.commemoration01.poem.verse72	@ltx/en_us_dedes/sy.m12.d24:syMA.commemoration01.poem.verse72
ltx/en_us_public/sy.m12.d24:syMA.commemoration01.poem.verse73	@ltx/en_us_dedes/sy.m12.d24:syMA.commemoration01.poem.verse73
ltx/en_us_public/sy.m12.d24:syMA.commemoration01.poem.verse74	@ltx/en_us_dedes/sy.m12.d24:syMA.commemoration01.poem.verse74
ltx/en_us_public/sy.m12.d24:syMA.commemoration01.poem.verse75	@ltx/en_us_dedes/sy.m12.d24:syMA.commemoration01.poem.verse75
ltx/en_us_public/sy.m12.d24:syMA.commemoration01.poem.verse76	@ltx/en_us_dedes/sy.m12.d24:syMA.commemoration01.poem.verse76
ltx/en_us_public/sy.m12.d24:syMA.commemoration01.poem.verse77	@ltx/en_us_dedes/sy.m12.d24:syMA.commemoration01.poem.verse77
ltx/en_us_public/sy.m12.d24:syMA.commemoration01.poem.verse78	@ltx/en_us_dedes/sy.m12.d24:syMA.commemoration01.poem.verse78
ltx/en_us_public/sy.m12.d24:syMA.commemoration01.poem.verse79	@ltx/en_us_dedes/sy.m12.d24:syMA.commemoration01.poem.verse79
ltx/en_us_public/sy.m12.d24:syMA.commemoration01.poem.verse80	@ltx/en_us_dedes/sy.m12.d24:syMA.commemoration01.poem.verse80
ltx/en_us_public/sy.m12.d24:syMA.commemoration01.poem.verse81	@ltx/en_us_dedes/sy.m12.d24:syMA.commemoration01.poem.verse81
ltx/en_us_public/sy.m12.d24:syMA.commemoration01.poem.verse82	@ltx/en_us_dedes/sy.m12.d24:syMA.commemoration01.poem.verse82
ltx/en_us_public/sy.m12.d24:syMA.commemoration01.poem.verse83	@ltx/en_us_dedes/sy.m12.d24:syMA.commemoration01.poem.verse83
ltx/en_us_public/sy.m12.d24:syMA.commemoration01.poem.verse84	@ltx/en_us_dedes/sy.m12.d24:syMA.commemoration01.poem.verse84
ltx/en_us_public/sy.m12.d24:syMA.commemoration01.poem.verse85	@ltx/en_us_dedes/sy.m12.d24:syMA.commemoration01.poem.verse85
ltx/en_us_public/sy.m12.d24:syMA.commemoration01.poem.verse86	@ltx/en_us_dedes/sy.m12.d24:syMA.commemoration01.poem.verse86
ltx/en_us_public/sy.m12.d24:syMA.commemoration01.poem.verse87	@ltx/en_us_dedes/sy.m12.d24:syMA.commemoration01.poem.verse87
ltx/en_us_public/sy.m12.d24:syMA.commemoration01.poem.verse88	@ltx/en_us_dedes/sy.m12.d24:syMA.commemoration01.poem.verse88
ltx/en_us_public/sy.m12.d24:syMA.commemoration01.poem.verse89	@ltx/en_us_dedes/sy.m12.d24:syMA.commemoration01.poem.verse89
ltx/en_us_public/sy.m12.d24:syMA.commemoration01.poem.verse90	@ltx/en_us_dedes/sy.m12.d24:syMA.commemoration01.poem.verse90
ltx/en_us_public/sy.m12.d24:syMA.commemoration01.poem.verse91	@ltx/en_us_dedes/sy.m12.d24:syMA.commemoration01.poem.verse91
ltx/en_us_public/sy.m12.d24:syMA.commemoration01.poem.verse92	@ltx/en_us_dedes/sy.m12.d24:syMA.commemoration01.poem.verse92
ltx/en_us_public/sy.m12.d24:syMA.commemoration01.poem.verse93	@ltx/en_us_dedes/sy.m12.d24:syMA.commemoration01.poem.verse93
ltx/en_us_public/sy.m12.d24:syMA.commemoration01.poem.verse94	@ltx/en_us_dedes/sy.m12.d24:syMA.commemoration01.poem.verse94
ltx/en_us_public/sy.m12.d24:syMA.commemoration01.poem.verse95	@ltx/en_us_dedes/sy.m12.d24:syMA.commemoration01.poem.verse95
ltx/en_us_public/sy.m12.d24:syMA.commemoration01.poem.verse96	@ltx/en_us_dedes/sy.m12.d24:syMA.commemoration01.poem.verse96
ltx/en_us_public/sy.m12.d24:syMA.commemoration01.poem.verse97	@ltx/en_us_dedes/sy.m12.d24:syMA.commemoration01.poem.verse97
ltx/en_us_public/sy.m12.d24:syMA.commemoration01.single1	@ltx/en_us_dedes/sy.m12.d24:syMA.commemoration01.single1
ltx/en_us_public/sy.m12.d24:syMA.commemoration01.text	@ltx/en_us_dedes/sy.m12.d24:syMA.commemoration01.text
ltx/en_us_public/sy.m12.d24:syMA.commemoration02.couplet1.title	@ltx/en_us_dedes/sy.m12.d24:syMA.commemoration02.couplet1.title
ltx/en_us_public/sy.m12.d24:syMA.commemoration02.couplet1.verse1	@ltx/en_us_dedes/sy.m12.d24:syMA.commemoration02.couplet1.verse1
ltx/en_us_public/sy.m12.d24:syMA.commemoration02.couplet1.verse2	@ltx/en_us_dedes/sy.m12.d24:syMA.commemoration02.couplet1.verse2
ltx/en_us_public/sy.m12.d24:syMA.commemoration02.text	@ltx/en_us_dedes/sy.m12.d24:syMA.commemoration02.text
ltx/en_us_public/sy.m12.d24:syMA.commemoration03.couplet1.title	@ltx/en_us_dedes/sy.m12.d24:syMA.commemoration03.couplet1.title
ltx/en_us_public/sy.m12.d24:syMA.commemoration03.couplet1.verse1	@ltx/en_us_dedes/sy.m12.d24:syMA.commemoration03.couplet1.verse1
ltx/en_us_public/sy.m12.d24:syMA.commemoration03.couplet1.verse2	@ltx/en_us_dedes/sy.m12.d24:syMA.commemoration03.couplet1.verse2
ltx/en_us_public/sy.m12.d24:syMA.commemoration03.text	@ltx/en_us_dedes/sy.m12.d24:syMA.commemoration03.text
ltx/en_us_public/sy.m12.d24:syMA.commemoration04.couplet1.title	@ltx/en_us_dedes/sy.m12.d24:syMA.commemoration04.couplet1.title
ltx/en_us_public/sy.m12.d24:syMA.commemoration04.couplet1.verse1	@ltx/en_us_dedes/sy.m12.d24:syMA.commemoration04.couplet1.verse1
ltx/en_us_public/sy.m12.d24:syMA.commemoration04.couplet1.verse2	@ltx/en_us_dedes/sy.m12.d24:syMA.commemoration04.couplet1.verse2
ltx/en_us_public/sy.m12.d24:syMA.commemoration04.text	@ltx/en_us_dedes/sy.m12.d24:syMA.commemoration04.text
ltx/en_us_public/sy.m12.d24:syMA.commemoration05.narration.p01	@ltx/en_us_dedes/sy.m12.d24:syMA.commemoration05.narration.p01
ltx/en_us_public/sy.m12.d24:syMA.commemoration05.narration.p02	@ltx/en_us_dedes/sy.m12.d24:syMA.commemoration05.narration.p02
ltx/en_us_public/sy.m12.d24:syMA.commemoration05.narration.p03	@ltx/en_us_dedes/sy.m12.d24:syMA.commemoration05.narration.p03
ltx/en_us_public/sy.m12.d24:syMA.commemoration05.narration.p04	@ltx/en_us_dedes/sy.m12.d24:syMA.commemoration05.narration.p04
ltx/en_us_public/sy.m12.d24:syMA.commemoration05.narration.p05	@ltx/en_us_dedes/sy.m12.d24:syMA.commemoration05.narration.p05
ltx/en_us_public/sy.m12.d24:syMA.commemoration05.narration.p06	@ltx/en_us_dedes/sy.m12.d24:syMA.commemoration05.narration.p06
ltx/en_us_public/sy.m12.d24:syMA.commemoration05.text	@ltx/en_us_dedes/sy.m12.d24:syMA.commemoration05.text
ltx/en_us_public/sy.m12.d24:syMA.commemoration06.couplet1.title	@ltx/en_us_dedes/sy.m12.d24:syMA.commemoration06.couplet1.title
ltx/en_us_public/sy.m12.d24:syMA.commemoration06.couplet1.verse1	@ltx/en_us_dedes/sy.m12.d24:syMA.commemoration06.couplet1.verse1
ltx/en_us_public/sy.m12.d24:syMA.commemoration06.couplet1.verse2	@ltx/en_us_dedes/sy.m12.d24:syMA.commemoration06.couplet1.verse2
ltx/en_us_public/sy.m12.d24:syMA.commemoration06.text	@ltx/en_us_dedes/sy.m12.d24:syMA.commemoration06.text
ltx/en_us_public/sy.m12.d24:syMA.commemoration07.couplet1.title	@ltx/en_us_dedes/sy.m12.d24:syMA.commemoration07.couplet1.title
ltx/en_us_public/sy.m12.d24:syMA.commemoration07.couplet1.verse1	@ltx/en_us_dedes/sy.m12.d24:syMA.commemoration07.couplet1.verse1
ltx/en_us_public/sy.m12.d24:syMA.commemoration07.couplet1.verse2	@ltx/en_us_dedes/sy.m12.d24:syMA.commemoration07.couplet1.verse2
ltx/en_us_public/sy.m12.d24:syMA.commemoration07.text	@ltx/en_us_dedes/sy.m12.d24:syMA.commemoration07.text
ltx/en_us_public/sy.m12.d24:syMA.lastline	@ltx/en_us_dedes/sy.m12.d24:syMA.lastline
