ltx/en_us_public/le.pr.tr.d020:lemcTE.reading1.book_abbr	@ltx/en_us_saas/le.pr.tr.d020:lemcTE.reading1.book_abbr
ltx/en_us_public/le.pr.tr.d020:lemcTE.reading1.book_string	@ltx/en_us_saas/le.pr.tr.d020:lemcTE.reading1.book_string
ltx/en_us_public/le.pr.tr.d020:lemcTE.reading1.chapverse	@ltx/en_us_saas/le.pr.tr.d020:lemcTE.reading1.chapverse
ltx/en_us_public/le.pr.tr.d020:lemcTE.reading1.incipit	@ltx/en_us_saas/le.pr.tr.d020:lemcTE.reading1.incipit
ltx/en_us_public/le.pr.tr.d020:lemcTE.reading1.text	@ltx/en_us_saas/le.pr.tr.d020:lemcTE.reading1.text
ltx/en_us_public/le.pr.tr.d020:lemcTE.reading1.title	@ltx/en_us_saas/le.pr.tr.d020:lemcTE.reading1.title
ltx/en_us_public/le.pr.tr.d020:lemcTE.reading1.title_abbr	@ltx/en_us_saas/le.pr.tr.d020:lemcTE.reading1.title_abbr
ltx/en_us_public/le.pr.tr.d020:lemcTE.reading1.version	@ltx/en_us_saas/le.pr.tr.d020:lemcTE.reading1.version
