ltx/en_us_public/eo.e03:eo.Doxasticon.incipit	@ltx/en_us_goadedes/eo.e03:eo.Doxasticon.incipit
ltx/en_us_public/eo.e03:eo.Doxasticon.mode	@ltx/en_us_goadedes/eo.e03:eo.Doxasticon.mode
ltx/en_us_public/eo.e03:eo.Doxasticon.text	@ltx/en_us_goadedes/eo.e03:eo.Doxasticon.text
ltx/en_us_public/eo.e03:eo.Exaposteilarion.greekmelody	@ltx/en_us_goadedes/eo.e03:eo.Exaposteilarion.greekmelody
ltx/en_us_public/eo.e03:eo.Exaposteilarion.incipit	@ltx/en_us_goadedes/eo.e03:eo.Exaposteilarion.incipit
ltx/en_us_public/eo.e03:eo.Exaposteilarion.melody	@ltx/en_us_goadedes/eo.e03:eo.Exaposteilarion.melody
ltx/en_us_public/eo.e03:eo.Exaposteilarion.mode	@ltx/en_us_goadedes/eo.e03:eo.Exaposteilarion.mode
ltx/en_us_public/eo.e03:eo.Exaposteilarion.text	@ltx/en_us_goadedes/eo.e03:eo.Exaposteilarion.text
ltx/en_us_public/eo.e03:eo.Theotokion.incipit	@ltx/en_us_goadedes/eo.e03:eo.Theotokion.incipit
ltx/en_us_public/eo.e03:eo.Theotokion.melody	@ltx/en_us_goadedes/eo.e03:eo.Theotokion.melody
ltx/en_us_public/eo.e03:eo.Theotokion.mode	@ltx/en_us_goadedes/eo.e03:eo.Theotokion.mode
ltx/en_us_public/eo.e03:eo.Theotokion.text	@ltx/en_us_goadedes/eo.e03:eo.Theotokion.text
ltx/en_us_public/eo.e03:eo.title	@ltx/en_us_goadedes/eo.e03:eo.title
