ltx/en_us_public/sy.m12.d18:syMA.commemoration01.couplet1.title	@ltx/en_us_dedes/sy.m12.d18:syMA.commemoration01.couplet1.title
ltx/en_us_public/sy.m12.d18:syMA.commemoration01.couplet1.verse1	@ltx/en_us_dedes/sy.m12.d18:syMA.commemoration01.couplet1.verse1
ltx/en_us_public/sy.m12.d18:syMA.commemoration01.couplet1.verse2	@ltx/en_us_dedes/sy.m12.d18:syMA.commemoration01.couplet1.verse2
ltx/en_us_public/sy.m12.d18:syMA.commemoration01.couplet2.verse1	@ltx/en_us_dedes/sy.m12.d18:syMA.commemoration01.couplet2.verse1
ltx/en_us_public/sy.m12.d18:syMA.commemoration01.couplet2.verse2	@ltx/en_us_dedes/sy.m12.d18:syMA.commemoration01.couplet2.verse2
ltx/en_us_public/sy.m12.d18:syMA.commemoration01.couplet3.verse1	@ltx/en_us_dedes/sy.m12.d18:syMA.commemoration01.couplet3.verse1
ltx/en_us_public/sy.m12.d18:syMA.commemoration01.couplet3.verse2	@ltx/en_us_dedes/sy.m12.d18:syMA.commemoration01.couplet3.verse2
ltx/en_us_public/sy.m12.d18:syMA.commemoration01.couplet4.verse1	@ltx/en_us_dedes/sy.m12.d18:syMA.commemoration01.couplet4.verse1
ltx/en_us_public/sy.m12.d18:syMA.commemoration01.couplet4.verse2	@ltx/en_us_dedes/sy.m12.d18:syMA.commemoration01.couplet4.verse2
ltx/en_us_public/sy.m12.d18:syMA.commemoration01.couplet5.verse1	@ltx/en_us_dedes/sy.m12.d18:syMA.commemoration01.couplet5.verse1
ltx/en_us_public/sy.m12.d18:syMA.commemoration01.couplet5.verse2	@ltx/en_us_dedes/sy.m12.d18:syMA.commemoration01.couplet5.verse2
ltx/en_us_public/sy.m12.d18:syMA.commemoration01.couplet6.verse1	@ltx/en_us_dedes/sy.m12.d18:syMA.commemoration01.couplet6.verse1
ltx/en_us_public/sy.m12.d18:syMA.commemoration01.couplet6.verse2	@ltx/en_us_dedes/sy.m12.d18:syMA.commemoration01.couplet6.verse2
ltx/en_us_public/sy.m12.d18:syMA.commemoration01.couplet7.verse1	@ltx/en_us_dedes/sy.m12.d18:syMA.commemoration01.couplet7.verse1
ltx/en_us_public/sy.m12.d18:syMA.commemoration01.couplet7.verse2	@ltx/en_us_dedes/sy.m12.d18:syMA.commemoration01.couplet7.verse2
ltx/en_us_public/sy.m12.d18:syMA.commemoration01.narration.p01	@ltx/en_us_dedes/sy.m12.d18:syMA.commemoration01.narration.p01
ltx/en_us_public/sy.m12.d18:syMA.commemoration01.narration.p02	@ltx/en_us_dedes/sy.m12.d18:syMA.commemoration01.narration.p02
ltx/en_us_public/sy.m12.d18:syMA.commemoration01.narration.p03	@ltx/en_us_dedes/sy.m12.d18:syMA.commemoration01.narration.p03
ltx/en_us_public/sy.m12.d18:syMA.commemoration01.single1	@ltx/en_us_dedes/sy.m12.d18:syMA.commemoration01.single1
ltx/en_us_public/sy.m12.d18:syMA.commemoration01.text	@ltx/en_us_dedes/sy.m12.d18:syMA.commemoration01.text
ltx/en_us_public/sy.m12.d18:syMA.commemoration02.couplet1.title	@ltx/en_us_dedes/sy.m12.d18:syMA.commemoration02.couplet1.title
ltx/en_us_public/sy.m12.d18:syMA.commemoration02.couplet1.verse1	@ltx/en_us_dedes/sy.m12.d18:syMA.commemoration02.couplet1.verse1
ltx/en_us_public/sy.m12.d18:syMA.commemoration02.couplet1.verse2	@ltx/en_us_dedes/sy.m12.d18:syMA.commemoration02.couplet1.verse2
ltx/en_us_public/sy.m12.d18:syMA.commemoration02.narration.p01	@ltx/en_us_dedes/sy.m12.d18:syMA.commemoration02.narration.p01
ltx/en_us_public/sy.m12.d18:syMA.commemoration02.narration.p02	@ltx/en_us_dedes/sy.m12.d18:syMA.commemoration02.narration.p02
ltx/en_us_public/sy.m12.d18:syMA.commemoration02.text	@ltx/en_us_dedes/sy.m12.d18:syMA.commemoration02.text
ltx/en_us_public/sy.m12.d18:syMA.commemoration03.couplet1.title	@ltx/en_us_dedes/sy.m12.d18:syMA.commemoration03.couplet1.title
ltx/en_us_public/sy.m12.d18:syMA.commemoration03.couplet1.verse1	@ltx/en_us_dedes/sy.m12.d18:syMA.commemoration03.couplet1.verse1
ltx/en_us_public/sy.m12.d18:syMA.commemoration03.couplet1.verse2	@ltx/en_us_dedes/sy.m12.d18:syMA.commemoration03.couplet1.verse2
ltx/en_us_public/sy.m12.d18:syMA.commemoration03.narration.p01	@ltx/en_us_dedes/sy.m12.d18:syMA.commemoration03.narration.p01
ltx/en_us_public/sy.m12.d18:syMA.commemoration03.text	@ltx/en_us_dedes/sy.m12.d18:syMA.commemoration03.text
ltx/en_us_public/sy.m12.d18:syMA.commemoration04.couplet1.title	@ltx/en_us_dedes/sy.m12.d18:syMA.commemoration04.couplet1.title
ltx/en_us_public/sy.m12.d18:syMA.commemoration04.couplet1.verse1	@ltx/en_us_dedes/sy.m12.d18:syMA.commemoration04.couplet1.verse1
ltx/en_us_public/sy.m12.d18:syMA.commemoration04.couplet1.verse2	@ltx/en_us_dedes/sy.m12.d18:syMA.commemoration04.couplet1.verse2
ltx/en_us_public/sy.m12.d18:syMA.commemoration04.text	@ltx/en_us_dedes/sy.m12.d18:syMA.commemoration04.text
ltx/en_us_public/sy.m12.d18:syMA.commemoration05.couplet1.title	@ltx/en_us_dedes/sy.m12.d18:syMA.commemoration05.couplet1.title
ltx/en_us_public/sy.m12.d18:syMA.commemoration05.couplet1.verse1	@ltx/en_us_dedes/sy.m12.d18:syMA.commemoration05.couplet1.verse1
ltx/en_us_public/sy.m12.d18:syMA.commemoration05.couplet1.verse2	@ltx/en_us_dedes/sy.m12.d18:syMA.commemoration05.couplet1.verse2
ltx/en_us_public/sy.m12.d18:syMA.commemoration05.text	@ltx/en_us_dedes/sy.m12.d18:syMA.commemoration05.text
ltx/en_us_public/sy.m12.d18:syMA.commemoration06.text	@ltx/en_us_dedes/sy.m12.d18:syMA.commemoration06.text
ltx/en_us_public/sy.m12.d18:syMA.commemoration07.couplet1.title	@ltx/en_us_dedes/sy.m12.d18:syMA.commemoration07.couplet1.title
ltx/en_us_public/sy.m12.d18:syMA.commemoration07.couplet1.verse1	@ltx/en_us_dedes/sy.m12.d18:syMA.commemoration07.couplet1.verse1
ltx/en_us_public/sy.m12.d18:syMA.commemoration07.couplet1.verse2	@ltx/en_us_dedes/sy.m12.d18:syMA.commemoration07.couplet1.verse2
ltx/en_us_public/sy.m12.d18:syMA.commemoration07.narration.p01	@ltx/en_us_dedes/sy.m12.d18:syMA.commemoration07.narration.p01
ltx/en_us_public/sy.m12.d18:syMA.commemoration07.narration.p02	@ltx/en_us_dedes/sy.m12.d18:syMA.commemoration07.narration.p02
ltx/en_us_public/sy.m12.d18:syMA.commemoration07.narration.p03	@ltx/en_us_dedes/sy.m12.d18:syMA.commemoration07.narration.p03
ltx/en_us_public/sy.m12.d18:syMA.commemoration07.text	@ltx/en_us_dedes/sy.m12.d18:syMA.commemoration07.text
ltx/en_us_public/sy.m12.d18:syMA.lastline	@ltx/en_us_dedes/sy.m12.d18:syMA.lastline
