ltx/en_us_public/other.stciaranparaklesis:hoCA.Apolytikion1.incipit	@ltx/en_us_dedes/other.stciaranparaklesis:hoCA.Apolytikion1.incipit
ltx/en_us_public/other.stciaranparaklesis:hoCA.Apolytikion1.melody	@ltx/en_us_dedes/other.stciaranparaklesis:hoCA.Apolytikion1.melody
ltx/en_us_public/other.stciaranparaklesis:hoCA.Apolytikion1.mode	@ltx/en_us_dedes/other.stciaranparaklesis:hoCA.Apolytikion1.mode
ltx/en_us_public/other.stciaranparaklesis:hoCA.Apolytikion1.text	@ltx/en_us_dedes/other.stciaranparaklesis:hoCA.Apolytikion1.text
ltx/en_us_public/other.stciaranparaklesis:hoCA.Apolytikion2.incipit	@ltx/en_us_dedes/other.stciaranparaklesis:hoCA.Apolytikion2.incipit
ltx/en_us_public/other.stciaranparaklesis:hoCA.Apolytikion2.melody	@ltx/en_us_dedes/other.stciaranparaklesis:hoCA.Apolytikion2.melody
ltx/en_us_public/other.stciaranparaklesis:hoCA.Apolytikion2.mode	@ltx/en_us_dedes/other.stciaranparaklesis:hoCA.Apolytikion2.mode
ltx/en_us_public/other.stciaranparaklesis:hoCA.Apolytikion2.text	@ltx/en_us_dedes/other.stciaranparaklesis:hoCA.Apolytikion2.text
ltx/en_us_public/other.stciaranparaklesis:hoCA.Insert1	@ltx/en_us_dedes/other.stciaranparaklesis:hoCA.Insert1
ltx/en_us_public/other.stciaranparaklesis:hoCA.Kathisma11.incipit	@ltx/en_us_dedes/other.stciaranparaklesis:hoCA.Kathisma11.incipit
ltx/en_us_public/other.stciaranparaklesis:hoCA.Kathisma11.melody	@ltx/en_us_dedes/other.stciaranparaklesis:hoCA.Kathisma11.melody
ltx/en_us_public/other.stciaranparaklesis:hoCA.Kathisma11.mode	@ltx/en_us_dedes/other.stciaranparaklesis:hoCA.Kathisma11.mode
ltx/en_us_public/other.stciaranparaklesis:hoCA.Kathisma11.text	@ltx/en_us_dedes/other.stciaranparaklesis:hoCA.Kathisma11.text
ltx/en_us_public/other.stciaranparaklesis:hoCA.Kontakion.incipit	@ltx/en_us_dedes/other.stciaranparaklesis:hoCA.Kontakion.incipit
ltx/en_us_public/other.stciaranparaklesis:hoCA.Kontakion.melody	@ltx/en_us_dedes/other.stciaranparaklesis:hoCA.Kontakion.melody
ltx/en_us_public/other.stciaranparaklesis:hoCA.Kontakion.mode	@ltx/en_us_dedes/other.stciaranparaklesis:hoCA.Kontakion.mode
ltx/en_us_public/other.stciaranparaklesis:hoCA.Kontakion.text	@ltx/en_us_dedes/other.stciaranparaklesis:hoCA.Kontakion.text
ltx/en_us_public/other.stciaranparaklesis:hoCA.Meg00.incipit	@ltx/en_us_dedes/other.stciaranparaklesis:hoCA.Meg00.incipit
ltx/en_us_public/other.stciaranparaklesis:hoCA.Meg00.text	@ltx/en_us_dedes/other.stciaranparaklesis:hoCA.Meg00.text
ltx/en_us_public/other.stciaranparaklesis:hoCA.Meg01.incipit	@ltx/en_us_dedes/other.stciaranparaklesis:hoCA.Meg01.incipit
ltx/en_us_public/other.stciaranparaklesis:hoCA.Meg01.melody	@ltx/en_us_dedes/other.stciaranparaklesis:hoCA.Meg01.melody
ltx/en_us_public/other.stciaranparaklesis:hoCA.Meg01.text	@ltx/en_us_dedes/other.stciaranparaklesis:hoCA.Meg01.text
ltx/en_us_public/other.stciaranparaklesis:hoCA.Meg02.incipit	@ltx/en_us_dedes/other.stciaranparaklesis:hoCA.Meg02.incipit
ltx/en_us_public/other.stciaranparaklesis:hoCA.Meg02.melody	@ltx/en_us_dedes/other.stciaranparaklesis:hoCA.Meg02.melody
ltx/en_us_public/other.stciaranparaklesis:hoCA.Meg02.text	@ltx/en_us_dedes/other.stciaranparaklesis:hoCA.Meg02.text
ltx/en_us_public/other.stciaranparaklesis:hoCA.Meg03.incipit	@ltx/en_us_dedes/other.stciaranparaklesis:hoCA.Meg03.incipit
ltx/en_us_public/other.stciaranparaklesis:hoCA.Meg03.melody	@ltx/en_us_dedes/other.stciaranparaklesis:hoCA.Meg03.melody
ltx/en_us_public/other.stciaranparaklesis:hoCA.Meg03.text	@ltx/en_us_dedes/other.stciaranparaklesis:hoCA.Meg03.text
ltx/en_us_public/other.stciaranparaklesis:hoCA.Meg04.incipit	@ltx/en_us_dedes/other.stciaranparaklesis:hoCA.Meg04.incipit
ltx/en_us_public/other.stciaranparaklesis:hoCA.Meg04.melody	@ltx/en_us_dedes/other.stciaranparaklesis:hoCA.Meg04.melody
ltx/en_us_public/other.stciaranparaklesis:hoCA.Meg04.text	@ltx/en_us_dedes/other.stciaranparaklesis:hoCA.Meg04.text
ltx/en_us_public/other.stciaranparaklesis:hoCA.Meg05.incipit	@ltx/en_us_dedes/other.stciaranparaklesis:hoCA.Meg05.incipit
ltx/en_us_public/other.stciaranparaklesis:hoCA.Meg05.melody	@ltx/en_us_dedes/other.stciaranparaklesis:hoCA.Meg05.melody
ltx/en_us_public/other.stciaranparaklesis:hoCA.Meg05.text	@ltx/en_us_dedes/other.stciaranparaklesis:hoCA.Meg05.text
ltx/en_us_public/other.stciaranparaklesis:hoCA.Meg06.incipit	@ltx/en_us_dedes/other.stciaranparaklesis:hoCA.Meg06.incipit
ltx/en_us_public/other.stciaranparaklesis:hoCA.Meg06.melody	@ltx/en_us_dedes/other.stciaranparaklesis:hoCA.Meg06.melody
ltx/en_us_public/other.stciaranparaklesis:hoCA.Meg06.text	@ltx/en_us_dedes/other.stciaranparaklesis:hoCA.Meg06.text
ltx/en_us_public/other.stciaranparaklesis:hoCA.Meg0F.incipit	@ltx/en_us_dedes/other.stciaranparaklesis:hoCA.Meg0F.incipit
ltx/en_us_public/other.stciaranparaklesis:hoCA.Meg0F.melody	@ltx/en_us_dedes/other.stciaranparaklesis:hoCA.Meg0F.melody
ltx/en_us_public/other.stciaranparaklesis:hoCA.Meg0F.text	@ltx/en_us_dedes/other.stciaranparaklesis:hoCA.Meg0F.text
ltx/en_us_public/other.stciaranparaklesis:hoCA.Ode11.incipit	@ltx/en_us_dedes/other.stciaranparaklesis:hoCA.Ode11.incipit
ltx/en_us_public/other.stciaranparaklesis:hoCA.Ode11.melody	@ltx/en_us_dedes/other.stciaranparaklesis:hoCA.Ode11.melody
ltx/en_us_public/other.stciaranparaklesis:hoCA.Ode11.mode	@ltx/en_us_dedes/other.stciaranparaklesis:hoCA.Ode11.mode
ltx/en_us_public/other.stciaranparaklesis:hoCA.Ode11.ode	@ltx/en_us_dedes/other.stciaranparaklesis:hoCA.Ode11.ode
ltx/en_us_public/other.stciaranparaklesis:hoCA.Ode11.text	@ltx/en_us_dedes/other.stciaranparaklesis:hoCA.Ode11.text
ltx/en_us_public/other.stciaranparaklesis:hoCA.Ode12.incipit	@ltx/en_us_dedes/other.stciaranparaklesis:hoCA.Ode12.incipit
ltx/en_us_public/other.stciaranparaklesis:hoCA.Ode12.melody	@ltx/en_us_dedes/other.stciaranparaklesis:hoCA.Ode12.melody
ltx/en_us_public/other.stciaranparaklesis:hoCA.Ode12.mode	@ltx/en_us_dedes/other.stciaranparaklesis:hoCA.Ode12.mode
ltx/en_us_public/other.stciaranparaklesis:hoCA.Ode12.ode	@ltx/en_us_dedes/other.stciaranparaklesis:hoCA.Ode12.ode
ltx/en_us_public/other.stciaranparaklesis:hoCA.Ode12.text	@ltx/en_us_dedes/other.stciaranparaklesis:hoCA.Ode12.text
ltx/en_us_public/other.stciaranparaklesis:hoCA.Ode13.incipit	@ltx/en_us_dedes/other.stciaranparaklesis:hoCA.Ode13.incipit
ltx/en_us_public/other.stciaranparaklesis:hoCA.Ode13.melody	@ltx/en_us_dedes/other.stciaranparaklesis:hoCA.Ode13.melody
ltx/en_us_public/other.stciaranparaklesis:hoCA.Ode13.mode	@ltx/en_us_dedes/other.stciaranparaklesis:hoCA.Ode13.mode
ltx/en_us_public/other.stciaranparaklesis:hoCA.Ode13.ode	@ltx/en_us_dedes/other.stciaranparaklesis:hoCA.Ode13.ode
ltx/en_us_public/other.stciaranparaklesis:hoCA.Ode13.text	@ltx/en_us_dedes/other.stciaranparaklesis:hoCA.Ode13.text
ltx/en_us_public/other.stciaranparaklesis:hoCA.Ode1T.incipit	@ltx/en_us_dedes/other.stciaranparaklesis:hoCA.Ode1T.incipit
ltx/en_us_public/other.stciaranparaklesis:hoCA.Ode1T.melody	@ltx/en_us_dedes/other.stciaranparaklesis:hoCA.Ode1T.melody
ltx/en_us_public/other.stciaranparaklesis:hoCA.Ode1T.mode	@ltx/en_us_dedes/other.stciaranparaklesis:hoCA.Ode1T.mode
ltx/en_us_public/other.stciaranparaklesis:hoCA.Ode1T.ode	@ltx/en_us_dedes/other.stciaranparaklesis:hoCA.Ode1T.ode
ltx/en_us_public/other.stciaranparaklesis:hoCA.Ode1T.text	@ltx/en_us_dedes/other.stciaranparaklesis:hoCA.Ode1T.text
ltx/en_us_public/other.stciaranparaklesis:hoCA.Ode31.incipit	@ltx/en_us_dedes/other.stciaranparaklesis:hoCA.Ode31.incipit
ltx/en_us_public/other.stciaranparaklesis:hoCA.Ode31.melody	@ltx/en_us_dedes/other.stciaranparaklesis:hoCA.Ode31.melody
ltx/en_us_public/other.stciaranparaklesis:hoCA.Ode31.mode	@ltx/en_us_dedes/other.stciaranparaklesis:hoCA.Ode31.mode
ltx/en_us_public/other.stciaranparaklesis:hoCA.Ode31.ode	@ltx/en_us_dedes/other.stciaranparaklesis:hoCA.Ode31.ode
ltx/en_us_public/other.stciaranparaklesis:hoCA.Ode31.text	@ltx/en_us_dedes/other.stciaranparaklesis:hoCA.Ode31.text
ltx/en_us_public/other.stciaranparaklesis:hoCA.Ode32.incipit	@ltx/en_us_dedes/other.stciaranparaklesis:hoCA.Ode32.incipit
ltx/en_us_public/other.stciaranparaklesis:hoCA.Ode32.melody	@ltx/en_us_dedes/other.stciaranparaklesis:hoCA.Ode32.melody
ltx/en_us_public/other.stciaranparaklesis:hoCA.Ode32.mode	@ltx/en_us_dedes/other.stciaranparaklesis:hoCA.Ode32.mode
ltx/en_us_public/other.stciaranparaklesis:hoCA.Ode32.ode	@ltx/en_us_dedes/other.stciaranparaklesis:hoCA.Ode32.ode
ltx/en_us_public/other.stciaranparaklesis:hoCA.Ode32.text	@ltx/en_us_dedes/other.stciaranparaklesis:hoCA.Ode32.text
ltx/en_us_public/other.stciaranparaklesis:hoCA.Ode33.incipit	@ltx/en_us_dedes/other.stciaranparaklesis:hoCA.Ode33.incipit
ltx/en_us_public/other.stciaranparaklesis:hoCA.Ode33.melody	@ltx/en_us_dedes/other.stciaranparaklesis:hoCA.Ode33.melody
ltx/en_us_public/other.stciaranparaklesis:hoCA.Ode33.mode	@ltx/en_us_dedes/other.stciaranparaklesis:hoCA.Ode33.mode
ltx/en_us_public/other.stciaranparaklesis:hoCA.Ode33.ode	@ltx/en_us_dedes/other.stciaranparaklesis:hoCA.Ode33.ode
ltx/en_us_public/other.stciaranparaklesis:hoCA.Ode33.text	@ltx/en_us_dedes/other.stciaranparaklesis:hoCA.Ode33.text
ltx/en_us_public/other.stciaranparaklesis:hoCA.Ode3T.incipit	@ltx/en_us_dedes/other.stciaranparaklesis:hoCA.Ode3T.incipit
ltx/en_us_public/other.stciaranparaklesis:hoCA.Ode3T.melody	@ltx/en_us_dedes/other.stciaranparaklesis:hoCA.Ode3T.melody
ltx/en_us_public/other.stciaranparaklesis:hoCA.Ode3T.mode	@ltx/en_us_dedes/other.stciaranparaklesis:hoCA.Ode3T.mode
ltx/en_us_public/other.stciaranparaklesis:hoCA.Ode3T.ode	@ltx/en_us_dedes/other.stciaranparaklesis:hoCA.Ode3T.ode
ltx/en_us_public/other.stciaranparaklesis:hoCA.Ode3T.text	@ltx/en_us_dedes/other.stciaranparaklesis:hoCA.Ode3T.text
ltx/en_us_public/other.stciaranparaklesis:hoCA.Ode41.incipit	@ltx/en_us_dedes/other.stciaranparaklesis:hoCA.Ode41.incipit
ltx/en_us_public/other.stciaranparaklesis:hoCA.Ode41.melody	@ltx/en_us_dedes/other.stciaranparaklesis:hoCA.Ode41.melody
ltx/en_us_public/other.stciaranparaklesis:hoCA.Ode41.mode	@ltx/en_us_dedes/other.stciaranparaklesis:hoCA.Ode41.mode
ltx/en_us_public/other.stciaranparaklesis:hoCA.Ode41.ode	@ltx/en_us_dedes/other.stciaranparaklesis:hoCA.Ode41.ode
ltx/en_us_public/other.stciaranparaklesis:hoCA.Ode41.text	@ltx/en_us_dedes/other.stciaranparaklesis:hoCA.Ode41.text
ltx/en_us_public/other.stciaranparaklesis:hoCA.Ode42.incipit	@ltx/en_us_dedes/other.stciaranparaklesis:hoCA.Ode42.incipit
ltx/en_us_public/other.stciaranparaklesis:hoCA.Ode42.melody	@ltx/en_us_dedes/other.stciaranparaklesis:hoCA.Ode42.melody
ltx/en_us_public/other.stciaranparaklesis:hoCA.Ode42.mode	@ltx/en_us_dedes/other.stciaranparaklesis:hoCA.Ode42.mode
ltx/en_us_public/other.stciaranparaklesis:hoCA.Ode42.ode	@ltx/en_us_dedes/other.stciaranparaklesis:hoCA.Ode42.ode
ltx/en_us_public/other.stciaranparaklesis:hoCA.Ode42.text	@ltx/en_us_dedes/other.stciaranparaklesis:hoCA.Ode42.text
ltx/en_us_public/other.stciaranparaklesis:hoCA.Ode43.incipit	@ltx/en_us_dedes/other.stciaranparaklesis:hoCA.Ode43.incipit
ltx/en_us_public/other.stciaranparaklesis:hoCA.Ode43.melody	@ltx/en_us_dedes/other.stciaranparaklesis:hoCA.Ode43.melody
ltx/en_us_public/other.stciaranparaklesis:hoCA.Ode43.mode	@ltx/en_us_dedes/other.stciaranparaklesis:hoCA.Ode43.mode
ltx/en_us_public/other.stciaranparaklesis:hoCA.Ode43.ode	@ltx/en_us_dedes/other.stciaranparaklesis:hoCA.Ode43.ode
ltx/en_us_public/other.stciaranparaklesis:hoCA.Ode43.text	@ltx/en_us_dedes/other.stciaranparaklesis:hoCA.Ode43.text
ltx/en_us_public/other.stciaranparaklesis:hoCA.Ode4T.incipit	@ltx/en_us_dedes/other.stciaranparaklesis:hoCA.Ode4T.incipit
ltx/en_us_public/other.stciaranparaklesis:hoCA.Ode4T.melody	@ltx/en_us_dedes/other.stciaranparaklesis:hoCA.Ode4T.melody
ltx/en_us_public/other.stciaranparaklesis:hoCA.Ode4T.mode	@ltx/en_us_dedes/other.stciaranparaklesis:hoCA.Ode4T.mode
ltx/en_us_public/other.stciaranparaklesis:hoCA.Ode4T.ode	@ltx/en_us_dedes/other.stciaranparaklesis:hoCA.Ode4T.ode
ltx/en_us_public/other.stciaranparaklesis:hoCA.Ode4T.text	@ltx/en_us_dedes/other.stciaranparaklesis:hoCA.Ode4T.text
ltx/en_us_public/other.stciaranparaklesis:hoCA.Ode51.incipit	@ltx/en_us_dedes/other.stciaranparaklesis:hoCA.Ode51.incipit
ltx/en_us_public/other.stciaranparaklesis:hoCA.Ode51.melody	@ltx/en_us_dedes/other.stciaranparaklesis:hoCA.Ode51.melody
ltx/en_us_public/other.stciaranparaklesis:hoCA.Ode51.mode	@ltx/en_us_dedes/other.stciaranparaklesis:hoCA.Ode51.mode
ltx/en_us_public/other.stciaranparaklesis:hoCA.Ode51.ode	@ltx/en_us_dedes/other.stciaranparaklesis:hoCA.Ode51.ode
ltx/en_us_public/other.stciaranparaklesis:hoCA.Ode51.text	@ltx/en_us_dedes/other.stciaranparaklesis:hoCA.Ode51.text
ltx/en_us_public/other.stciaranparaklesis:hoCA.Ode52.incipit	@ltx/en_us_dedes/other.stciaranparaklesis:hoCA.Ode52.incipit
ltx/en_us_public/other.stciaranparaklesis:hoCA.Ode52.melody	@ltx/en_us_dedes/other.stciaranparaklesis:hoCA.Ode52.melody
ltx/en_us_public/other.stciaranparaklesis:hoCA.Ode52.mode	@ltx/en_us_dedes/other.stciaranparaklesis:hoCA.Ode52.mode
ltx/en_us_public/other.stciaranparaklesis:hoCA.Ode52.ode	@ltx/en_us_dedes/other.stciaranparaklesis:hoCA.Ode52.ode
ltx/en_us_public/other.stciaranparaklesis:hoCA.Ode52.text	@ltx/en_us_dedes/other.stciaranparaklesis:hoCA.Ode52.text
ltx/en_us_public/other.stciaranparaklesis:hoCA.Ode53.incipit	@ltx/en_us_dedes/other.stciaranparaklesis:hoCA.Ode53.incipit
ltx/en_us_public/other.stciaranparaklesis:hoCA.Ode53.melody	@ltx/en_us_dedes/other.stciaranparaklesis:hoCA.Ode53.melody
ltx/en_us_public/other.stciaranparaklesis:hoCA.Ode53.mode	@ltx/en_us_dedes/other.stciaranparaklesis:hoCA.Ode53.mode
ltx/en_us_public/other.stciaranparaklesis:hoCA.Ode53.ode	@ltx/en_us_dedes/other.stciaranparaklesis:hoCA.Ode53.ode
ltx/en_us_public/other.stciaranparaklesis:hoCA.Ode53.text	@ltx/en_us_dedes/other.stciaranparaklesis:hoCA.Ode53.text
ltx/en_us_public/other.stciaranparaklesis:hoCA.Ode5T.incipit	@ltx/en_us_dedes/other.stciaranparaklesis:hoCA.Ode5T.incipit
ltx/en_us_public/other.stciaranparaklesis:hoCA.Ode5T.melody	@ltx/en_us_dedes/other.stciaranparaklesis:hoCA.Ode5T.melody
ltx/en_us_public/other.stciaranparaklesis:hoCA.Ode5T.mode	@ltx/en_us_dedes/other.stciaranparaklesis:hoCA.Ode5T.mode
ltx/en_us_public/other.stciaranparaklesis:hoCA.Ode5T.ode	@ltx/en_us_dedes/other.stciaranparaklesis:hoCA.Ode5T.ode
ltx/en_us_public/other.stciaranparaklesis:hoCA.Ode5T.text	@ltx/en_us_dedes/other.stciaranparaklesis:hoCA.Ode5T.text
ltx/en_us_public/other.stciaranparaklesis:hoCA.Ode61.incipit	@ltx/en_us_dedes/other.stciaranparaklesis:hoCA.Ode61.incipit
ltx/en_us_public/other.stciaranparaklesis:hoCA.Ode61.melody	@ltx/en_us_dedes/other.stciaranparaklesis:hoCA.Ode61.melody
ltx/en_us_public/other.stciaranparaklesis:hoCA.Ode61.mode	@ltx/en_us_dedes/other.stciaranparaklesis:hoCA.Ode61.mode
ltx/en_us_public/other.stciaranparaklesis:hoCA.Ode61.ode	@ltx/en_us_dedes/other.stciaranparaklesis:hoCA.Ode61.ode
ltx/en_us_public/other.stciaranparaklesis:hoCA.Ode61.text	@ltx/en_us_dedes/other.stciaranparaklesis:hoCA.Ode61.text
ltx/en_us_public/other.stciaranparaklesis:hoCA.Ode62.incipit	@ltx/en_us_dedes/other.stciaranparaklesis:hoCA.Ode62.incipit
ltx/en_us_public/other.stciaranparaklesis:hoCA.Ode62.melody	@ltx/en_us_dedes/other.stciaranparaklesis:hoCA.Ode62.melody
ltx/en_us_public/other.stciaranparaklesis:hoCA.Ode62.mode	@ltx/en_us_dedes/other.stciaranparaklesis:hoCA.Ode62.mode
ltx/en_us_public/other.stciaranparaklesis:hoCA.Ode62.ode	@ltx/en_us_dedes/other.stciaranparaklesis:hoCA.Ode62.ode
ltx/en_us_public/other.stciaranparaklesis:hoCA.Ode62.text	@ltx/en_us_dedes/other.stciaranparaklesis:hoCA.Ode62.text
ltx/en_us_public/other.stciaranparaklesis:hoCA.Ode63.incipit	@ltx/en_us_dedes/other.stciaranparaklesis:hoCA.Ode63.incipit
ltx/en_us_public/other.stciaranparaklesis:hoCA.Ode63.melody	@ltx/en_us_dedes/other.stciaranparaklesis:hoCA.Ode63.melody
ltx/en_us_public/other.stciaranparaklesis:hoCA.Ode63.mode	@ltx/en_us_dedes/other.stciaranparaklesis:hoCA.Ode63.mode
ltx/en_us_public/other.stciaranparaklesis:hoCA.Ode63.ode	@ltx/en_us_dedes/other.stciaranparaklesis:hoCA.Ode63.ode
ltx/en_us_public/other.stciaranparaklesis:hoCA.Ode63.text	@ltx/en_us_dedes/other.stciaranparaklesis:hoCA.Ode63.text
ltx/en_us_public/other.stciaranparaklesis:hoCA.Ode6T.incipit	@ltx/en_us_dedes/other.stciaranparaklesis:hoCA.Ode6T.incipit
ltx/en_us_public/other.stciaranparaklesis:hoCA.Ode6T.melody	@ltx/en_us_dedes/other.stciaranparaklesis:hoCA.Ode6T.melody
ltx/en_us_public/other.stciaranparaklesis:hoCA.Ode6T.mode	@ltx/en_us_dedes/other.stciaranparaklesis:hoCA.Ode6T.mode
ltx/en_us_public/other.stciaranparaklesis:hoCA.Ode6T.ode	@ltx/en_us_dedes/other.stciaranparaklesis:hoCA.Ode6T.ode
ltx/en_us_public/other.stciaranparaklesis:hoCA.Ode6T.text	@ltx/en_us_dedes/other.stciaranparaklesis:hoCA.Ode6T.text
ltx/en_us_public/other.stciaranparaklesis:hoCA.Ode71.incipit	@ltx/en_us_dedes/other.stciaranparaklesis:hoCA.Ode71.incipit
ltx/en_us_public/other.stciaranparaklesis:hoCA.Ode71.melody	@ltx/en_us_dedes/other.stciaranparaklesis:hoCA.Ode71.melody
ltx/en_us_public/other.stciaranparaklesis:hoCA.Ode71.mode	@ltx/en_us_dedes/other.stciaranparaklesis:hoCA.Ode71.mode
ltx/en_us_public/other.stciaranparaklesis:hoCA.Ode71.ode	@ltx/en_us_dedes/other.stciaranparaklesis:hoCA.Ode71.ode
ltx/en_us_public/other.stciaranparaklesis:hoCA.Ode71.text	@ltx/en_us_dedes/other.stciaranparaklesis:hoCA.Ode71.text
ltx/en_us_public/other.stciaranparaklesis:hoCA.Ode72.incipit	@ltx/en_us_dedes/other.stciaranparaklesis:hoCA.Ode72.incipit
ltx/en_us_public/other.stciaranparaklesis:hoCA.Ode72.melody	@ltx/en_us_dedes/other.stciaranparaklesis:hoCA.Ode72.melody
ltx/en_us_public/other.stciaranparaklesis:hoCA.Ode72.mode	@ltx/en_us_dedes/other.stciaranparaklesis:hoCA.Ode72.mode
ltx/en_us_public/other.stciaranparaklesis:hoCA.Ode72.ode	@ltx/en_us_dedes/other.stciaranparaklesis:hoCA.Ode72.ode
ltx/en_us_public/other.stciaranparaklesis:hoCA.Ode72.text	@ltx/en_us_dedes/other.stciaranparaklesis:hoCA.Ode72.text
ltx/en_us_public/other.stciaranparaklesis:hoCA.Ode73.incipit	@ltx/en_us_dedes/other.stciaranparaklesis:hoCA.Ode73.incipit
ltx/en_us_public/other.stciaranparaklesis:hoCA.Ode73.melody	@ltx/en_us_dedes/other.stciaranparaklesis:hoCA.Ode73.melody
ltx/en_us_public/other.stciaranparaklesis:hoCA.Ode73.mode	@ltx/en_us_dedes/other.stciaranparaklesis:hoCA.Ode73.mode
ltx/en_us_public/other.stciaranparaklesis:hoCA.Ode73.ode	@ltx/en_us_dedes/other.stciaranparaklesis:hoCA.Ode73.ode
ltx/en_us_public/other.stciaranparaklesis:hoCA.Ode73.text	@ltx/en_us_dedes/other.stciaranparaklesis:hoCA.Ode73.text
ltx/en_us_public/other.stciaranparaklesis:hoCA.Ode7T.incipit	@ltx/en_us_dedes/other.stciaranparaklesis:hoCA.Ode7T.incipit
ltx/en_us_public/other.stciaranparaklesis:hoCA.Ode7T.melody	@ltx/en_us_dedes/other.stciaranparaklesis:hoCA.Ode7T.melody
ltx/en_us_public/other.stciaranparaklesis:hoCA.Ode7T.mode	@ltx/en_us_dedes/other.stciaranparaklesis:hoCA.Ode7T.mode
ltx/en_us_public/other.stciaranparaklesis:hoCA.Ode7T.ode	@ltx/en_us_dedes/other.stciaranparaklesis:hoCA.Ode7T.ode
ltx/en_us_public/other.stciaranparaklesis:hoCA.Ode7T.text	@ltx/en_us_dedes/other.stciaranparaklesis:hoCA.Ode7T.text
ltx/en_us_public/other.stciaranparaklesis:hoCA.Ode81.incipit	@ltx/en_us_dedes/other.stciaranparaklesis:hoCA.Ode81.incipit
ltx/en_us_public/other.stciaranparaklesis:hoCA.Ode81.melody	@ltx/en_us_dedes/other.stciaranparaklesis:hoCA.Ode81.melody
ltx/en_us_public/other.stciaranparaklesis:hoCA.Ode81.mode	@ltx/en_us_dedes/other.stciaranparaklesis:hoCA.Ode81.mode
ltx/en_us_public/other.stciaranparaklesis:hoCA.Ode81.ode	@ltx/en_us_dedes/other.stciaranparaklesis:hoCA.Ode81.ode
ltx/en_us_public/other.stciaranparaklesis:hoCA.Ode81.text	@ltx/en_us_dedes/other.stciaranparaklesis:hoCA.Ode81.text
ltx/en_us_public/other.stciaranparaklesis:hoCA.Ode82.incipit	@ltx/en_us_dedes/other.stciaranparaklesis:hoCA.Ode82.incipit
ltx/en_us_public/other.stciaranparaklesis:hoCA.Ode82.melody	@ltx/en_us_dedes/other.stciaranparaklesis:hoCA.Ode82.melody
ltx/en_us_public/other.stciaranparaklesis:hoCA.Ode82.mode	@ltx/en_us_dedes/other.stciaranparaklesis:hoCA.Ode82.mode
ltx/en_us_public/other.stciaranparaklesis:hoCA.Ode82.ode	@ltx/en_us_dedes/other.stciaranparaklesis:hoCA.Ode82.ode
ltx/en_us_public/other.stciaranparaklesis:hoCA.Ode82.text	@ltx/en_us_dedes/other.stciaranparaklesis:hoCA.Ode82.text
ltx/en_us_public/other.stciaranparaklesis:hoCA.Ode83.incipit	@ltx/en_us_dedes/other.stciaranparaklesis:hoCA.Ode83.incipit
ltx/en_us_public/other.stciaranparaklesis:hoCA.Ode83.melody	@ltx/en_us_dedes/other.stciaranparaklesis:hoCA.Ode83.melody
ltx/en_us_public/other.stciaranparaklesis:hoCA.Ode83.mode	@ltx/en_us_dedes/other.stciaranparaklesis:hoCA.Ode83.mode
ltx/en_us_public/other.stciaranparaklesis:hoCA.Ode83.ode	@ltx/en_us_dedes/other.stciaranparaklesis:hoCA.Ode83.ode
ltx/en_us_public/other.stciaranparaklesis:hoCA.Ode83.text	@ltx/en_us_dedes/other.stciaranparaklesis:hoCA.Ode83.text
ltx/en_us_public/other.stciaranparaklesis:hoCA.Ode8T.incipit	@ltx/en_us_dedes/other.stciaranparaklesis:hoCA.Ode8T.incipit
ltx/en_us_public/other.stciaranparaklesis:hoCA.Ode8T.melody	@ltx/en_us_dedes/other.stciaranparaklesis:hoCA.Ode8T.melody
ltx/en_us_public/other.stciaranparaklesis:hoCA.Ode8T.mode	@ltx/en_us_dedes/other.stciaranparaklesis:hoCA.Ode8T.mode
ltx/en_us_public/other.stciaranparaklesis:hoCA.Ode8T.ode	@ltx/en_us_dedes/other.stciaranparaklesis:hoCA.Ode8T.ode
ltx/en_us_public/other.stciaranparaklesis:hoCA.Ode8T.text	@ltx/en_us_dedes/other.stciaranparaklesis:hoCA.Ode8T.text
ltx/en_us_public/other.stciaranparaklesis:hoCA.Ode91.incipit	@ltx/en_us_dedes/other.stciaranparaklesis:hoCA.Ode91.incipit
ltx/en_us_public/other.stciaranparaklesis:hoCA.Ode91.melody	@ltx/en_us_dedes/other.stciaranparaklesis:hoCA.Ode91.melody
ltx/en_us_public/other.stciaranparaklesis:hoCA.Ode91.mode	@ltx/en_us_dedes/other.stciaranparaklesis:hoCA.Ode91.mode
ltx/en_us_public/other.stciaranparaklesis:hoCA.Ode91.ode	@ltx/en_us_dedes/other.stciaranparaklesis:hoCA.Ode91.ode
ltx/en_us_public/other.stciaranparaklesis:hoCA.Ode91.text	@ltx/en_us_dedes/other.stciaranparaklesis:hoCA.Ode91.text
ltx/en_us_public/other.stciaranparaklesis:hoCA.Ode92.incipit	@ltx/en_us_dedes/other.stciaranparaklesis:hoCA.Ode92.incipit
ltx/en_us_public/other.stciaranparaklesis:hoCA.Ode92.melody	@ltx/en_us_dedes/other.stciaranparaklesis:hoCA.Ode92.melody
ltx/en_us_public/other.stciaranparaklesis:hoCA.Ode92.mode	@ltx/en_us_dedes/other.stciaranparaklesis:hoCA.Ode92.mode
ltx/en_us_public/other.stciaranparaklesis:hoCA.Ode92.ode	@ltx/en_us_dedes/other.stciaranparaklesis:hoCA.Ode92.ode
ltx/en_us_public/other.stciaranparaklesis:hoCA.Ode92.text	@ltx/en_us_dedes/other.stciaranparaklesis:hoCA.Ode92.text
ltx/en_us_public/other.stciaranparaklesis:hoCA.Ode93.incipit	@ltx/en_us_dedes/other.stciaranparaklesis:hoCA.Ode93.incipit
ltx/en_us_public/other.stciaranparaklesis:hoCA.Ode93.melody	@ltx/en_us_dedes/other.stciaranparaklesis:hoCA.Ode93.melody
ltx/en_us_public/other.stciaranparaklesis:hoCA.Ode93.mode	@ltx/en_us_dedes/other.stciaranparaklesis:hoCA.Ode93.mode
ltx/en_us_public/other.stciaranparaklesis:hoCA.Ode93.ode	@ltx/en_us_dedes/other.stciaranparaklesis:hoCA.Ode93.ode
ltx/en_us_public/other.stciaranparaklesis:hoCA.Ode93.text	@ltx/en_us_dedes/other.stciaranparaklesis:hoCA.Ode93.text
ltx/en_us_public/other.stciaranparaklesis:hoCA.Ode94.incipit	@ltx/en_us_dedes/other.stciaranparaklesis:hoCA.Ode94.incipit
ltx/en_us_public/other.stciaranparaklesis:hoCA.Ode94.melody	@ltx/en_us_dedes/other.stciaranparaklesis:hoCA.Ode94.melody
ltx/en_us_public/other.stciaranparaklesis:hoCA.Ode94.mode	@ltx/en_us_dedes/other.stciaranparaklesis:hoCA.Ode94.mode
ltx/en_us_public/other.stciaranparaklesis:hoCA.Ode94.ode	@ltx/en_us_dedes/other.stciaranparaklesis:hoCA.Ode94.ode
ltx/en_us_public/other.stciaranparaklesis:hoCA.Ode94.text	@ltx/en_us_dedes/other.stciaranparaklesis:hoCA.Ode94.text
ltx/en_us_public/other.stciaranparaklesis:hoCA.Ode9H.incipit	@ltx/en_us_dedes/other.stciaranparaklesis:hoCA.Ode9H.incipit
ltx/en_us_public/other.stciaranparaklesis:hoCA.Ode9H.melody	@ltx/en_us_dedes/other.stciaranparaklesis:hoCA.Ode9H.melody
ltx/en_us_public/other.stciaranparaklesis:hoCA.Ode9H.mode	@ltx/en_us_dedes/other.stciaranparaklesis:hoCA.Ode9H.mode
ltx/en_us_public/other.stciaranparaklesis:hoCA.Ode9H.ode	@ltx/en_us_dedes/other.stciaranparaklesis:hoCA.Ode9H.ode
ltx/en_us_public/other.stciaranparaklesis:hoCA.Ode9H.text	@ltx/en_us_dedes/other.stciaranparaklesis:hoCA.Ode9H.text
ltx/en_us_public/other.stciaranparaklesis:hoCA.Ode9T.incipit	@ltx/en_us_dedes/other.stciaranparaklesis:hoCA.Ode9T.incipit
ltx/en_us_public/other.stciaranparaklesis:hoCA.Ode9T.melody	@ltx/en_us_dedes/other.stciaranparaklesis:hoCA.Ode9T.melody
ltx/en_us_public/other.stciaranparaklesis:hoCA.Ode9T.mode	@ltx/en_us_dedes/other.stciaranparaklesis:hoCA.Ode9T.mode
ltx/en_us_public/other.stciaranparaklesis:hoCA.Ode9T.ode	@ltx/en_us_dedes/other.stciaranparaklesis:hoCA.Ode9T.ode
ltx/en_us_public/other.stciaranparaklesis:hoCA.Ode9T.text	@ltx/en_us_dedes/other.stciaranparaklesis:hoCA.Ode9T.text
ltx/en_us_public/other.stciaranparaklesis:hoCA.PostGospelBoth.incipit	@ltx/en_us_dedes/other.stciaranparaklesis:hoCA.PostGospelBoth.incipit
ltx/en_us_public/other.stciaranparaklesis:hoCA.PostGospelBoth.melody	@ltx/en_us_dedes/other.stciaranparaklesis:hoCA.PostGospelBoth.melody
ltx/en_us_public/other.stciaranparaklesis:hoCA.PostGospelBoth.mode	@ltx/en_us_dedes/other.stciaranparaklesis:hoCA.PostGospelBoth.mode
ltx/en_us_public/other.stciaranparaklesis:hoCA.PostGospelBoth.text	@ltx/en_us_dedes/other.stciaranparaklesis:hoCA.PostGospelBoth.text
ltx/en_us_public/other.stciaranparaklesis:hoCA.PostGospelGlory.incipit	@ltx/en_us_dedes/other.stciaranparaklesis:hoCA.PostGospelGlory.incipit
ltx/en_us_public/other.stciaranparaklesis:hoCA.PostGospelGlory.melody	@ltx/en_us_dedes/other.stciaranparaklesis:hoCA.PostGospelGlory.melody
ltx/en_us_public/other.stciaranparaklesis:hoCA.PostGospelGlory.mode	@ltx/en_us_dedes/other.stciaranparaklesis:hoCA.PostGospelGlory.mode
ltx/en_us_public/other.stciaranparaklesis:hoCA.PostGospelGlory.text	@ltx/en_us_dedes/other.stciaranparaklesis:hoCA.PostGospelGlory.text
ltx/en_us_public/other.stciaranparaklesis:hoCA.PostGospelHymn1.incipit	@ltx/en_us_dedes/other.stciaranparaklesis:hoCA.PostGospelHymn1.incipit
ltx/en_us_public/other.stciaranparaklesis:hoCA.PostGospelHymn1.melody	@ltx/en_us_dedes/other.stciaranparaklesis:hoCA.PostGospelHymn1.melody
ltx/en_us_public/other.stciaranparaklesis:hoCA.PostGospelHymn1.mode	@ltx/en_us_dedes/other.stciaranparaklesis:hoCA.PostGospelHymn1.mode
ltx/en_us_public/other.stciaranparaklesis:hoCA.PostGospelHymn1.text	@ltx/en_us_dedes/other.stciaranparaklesis:hoCA.PostGospelHymn1.text
ltx/en_us_public/other.stciaranparaklesis:hoCA.Troparion1.incipit	@ltx/en_us_dedes/other.stciaranparaklesis:hoCA.Troparion1.incipit
ltx/en_us_public/other.stciaranparaklesis:hoCA.Troparion1.melody	@ltx/en_us_dedes/other.stciaranparaklesis:hoCA.Troparion1.melody
ltx/en_us_public/other.stciaranparaklesis:hoCA.Troparion1.mode	@ltx/en_us_dedes/other.stciaranparaklesis:hoCA.Troparion1.mode
ltx/en_us_public/other.stciaranparaklesis:hoCA.Troparion1.text	@ltx/en_us_dedes/other.stciaranparaklesis:hoCA.Troparion1.text
ltx/en_us_public/other.stciaranparaklesis:hoCA.Troparion2.incipit	@ltx/en_us_dedes/other.stciaranparaklesis:hoCA.Troparion2.incipit
ltx/en_us_public/other.stciaranparaklesis:hoCA.Troparion2.melody	@ltx/en_us_dedes/other.stciaranparaklesis:hoCA.Troparion2.melody
ltx/en_us_public/other.stciaranparaklesis:hoCA.Troparion2.mode	@ltx/en_us_dedes/other.stciaranparaklesis:hoCA.Troparion2.mode
ltx/en_us_public/other.stciaranparaklesis:hoCA.Troparion2.text	@ltx/en_us_dedes/other.stciaranparaklesis:hoCA.Troparion2.text
ltx/en_us_public/other.stciaranparaklesis:hoCA.Troparion3.incipit	@ltx/en_us_dedes/other.stciaranparaklesis:hoCA.Troparion3.incipit
ltx/en_us_public/other.stciaranparaklesis:hoCA.Troparion3.melody	@ltx/en_us_dedes/other.stciaranparaklesis:hoCA.Troparion3.melody
ltx/en_us_public/other.stciaranparaklesis:hoCA.Troparion3.mode	@ltx/en_us_dedes/other.stciaranparaklesis:hoCA.Troparion3.mode
ltx/en_us_public/other.stciaranparaklesis:hoCA.Troparion3.text	@ltx/en_us_dedes/other.stciaranparaklesis:hoCA.Troparion3.text
ltx/en_us_public/other.stciaranparaklesis:hoCA.Troparion31.incipit	@ltx/en_us_dedes/other.stciaranparaklesis:hoCA.Troparion31.incipit
ltx/en_us_public/other.stciaranparaklesis:hoCA.Troparion31.melody	@ltx/en_us_dedes/other.stciaranparaklesis:hoCA.Troparion31.melody
ltx/en_us_public/other.stciaranparaklesis:hoCA.Troparion31.mode	@ltx/en_us_dedes/other.stciaranparaklesis:hoCA.Troparion31.mode
ltx/en_us_public/other.stciaranparaklesis:hoCA.Troparion31.text	@ltx/en_us_dedes/other.stciaranparaklesis:hoCA.Troparion31.text
ltx/en_us_public/other.stciaranparaklesis:hoCA.Troparion32.incipit	@ltx/en_us_dedes/other.stciaranparaklesis:hoCA.Troparion32.incipit
ltx/en_us_public/other.stciaranparaklesis:hoCA.Troparion32.melody	@ltx/en_us_dedes/other.stciaranparaklesis:hoCA.Troparion32.melody
ltx/en_us_public/other.stciaranparaklesis:hoCA.Troparion32.mode	@ltx/en_us_dedes/other.stciaranparaklesis:hoCA.Troparion32.mode
ltx/en_us_public/other.stciaranparaklesis:hoCA.Troparion32.text	@ltx/en_us_dedes/other.stciaranparaklesis:hoCA.Troparion32.text
ltx/en_us_public/other.stciaranparaklesis:hoCA.Troparion61.incipit	@ltx/en_us_dedes/other.stciaranparaklesis:hoCA.Troparion61.incipit
ltx/en_us_public/other.stciaranparaklesis:hoCA.Troparion61.melody	@ltx/en_us_dedes/other.stciaranparaklesis:hoCA.Troparion61.melody
ltx/en_us_public/other.stciaranparaklesis:hoCA.Troparion61.mode	@ltx/en_us_dedes/other.stciaranparaklesis:hoCA.Troparion61.mode
ltx/en_us_public/other.stciaranparaklesis:hoCA.Troparion61.text	@ltx/en_us_dedes/other.stciaranparaklesis:hoCA.Troparion61.text
ltx/en_us_public/other.stciaranparaklesis:hoCA.Troparion62.incipit	@ltx/en_us_dedes/other.stciaranparaklesis:hoCA.Troparion62.incipit
ltx/en_us_public/other.stciaranparaklesis:hoCA.Troparion62.melody	@ltx/en_us_dedes/other.stciaranparaklesis:hoCA.Troparion62.melody
ltx/en_us_public/other.stciaranparaklesis:hoCA.Troparion62.mode	@ltx/en_us_dedes/other.stciaranparaklesis:hoCA.Troparion62.mode
ltx/en_us_public/other.stciaranparaklesis:hoCA.Troparion62.text	@ltx/en_us_dedes/other.stciaranparaklesis:hoCA.Troparion62.text
ltx/en_us_public/other.stciaranparaklesis:hoCA.acrostic	@ltx/en_us_dedes/other.stciaranparaklesis:hoCA.acrostic
ltx/en_us_public/other.stciaranparaklesis:hoCA.media.text	@ltx/en_us_dedes/other.stciaranparaklesis:hoCA.media.text
ltx/en_us_public/other.stciaranparaklesis:hoCA.poet	@ltx/en_us_dedes/other.stciaranparaklesis:hoCA.poet
ltx/en_us_public/other.stciaranparaklesis:hoCA.title	@ltx/en_us_dedes/other.stciaranparaklesis:hoCA.title
ltx/en_us_public/other.stciaranparaklesis:hoCA.title2	@ltx/en_us_dedes/other.stciaranparaklesis:hoCA.title2
ltx/en_us_public/other.stciaranparaklesis:hoCA.translator	@ltx/en_us_dedes/other.stciaranparaklesis:hoCA.translator
