ltx/en_us_public/tr.d064:trCO.header	@ltx/en_us_dedes/tr.d064:trCO.header
ltx/en_us_public/tr.d064:trDA.commemoration.full	@ltx/en_us_dedes/tr.d064:trDA.commemoration.full
ltx/en_us_public/tr.d064:trDA.commemoration.short	@ltx/en_us_dedes/tr.d064:trDA.commemoration.short
ltx/en_us_public/tr.d064:trDA.dismissal	@ltx/en_us_dedes/tr.d064:trDA.dismissal
ltx/en_us_public/tr.d064:trDA.insert1	@ltx/en_us_dedes/tr.d064:trDA.insert1
ltx/en_us_public/tr.d064:trDA.insert2	@ltx/en_us_dedes/tr.d064:trDA.insert2
ltx/en_us_public/tr.d064:trDA.note	@ltx/en_us_dedes/tr.d064:trDA.note
ltx/en_us_public/tr.d064:trDA.title	@ltx/en_us_dedes/tr.d064:trDA.title
ltx/en_us_public/tr.d064:trHO.commemorations	@ltx/en_us_dedes/tr.d064:trHO.commemorations
ltx/en_us_public/tr.d064:trHO.daytitle	@ltx/en_us_dedes/tr.d064:trHO.daytitle
ltx/en_us_public/tr.d064:trHO.description1	@ltx/en_us_dedes/tr.d064:trHO.description1
ltx/en_us_public/tr.d064:trHO.description2	@ltx/en_us_dedes/tr.d064:trHO.description2
ltx/en_us_public/tr.d064:trHO.note1	@ltx/en_us_dedes/tr.d064:trHO.note1
ltx/en_us_public/tr.d064:trHO.note2	@ltx/en_us_dedes/tr.d064:trHO.note2
ltx/en_us_public/tr.d064:trLI.AfterCommunion.incipit	@ltx/en_us_dedes/tr.d064:trLI.AfterCommunion.incipit
ltx/en_us_public/tr.d064:trLI.AfterCommunion.mode	@ltx/en_us_dedes/tr.d064:trLI.AfterCommunion.mode
ltx/en_us_public/tr.d064:trLI.AfterCommunion.text	@ltx/en_us_dedes/tr.d064:trLI.AfterCommunion.text
ltx/en_us_public/tr.d064:trLI.Kontakion1.incipit	@ltx/en_us_duvall/tr.d064:trLI.Kontakion1.incipit
ltx/en_us_public/tr.d064:trLI.Kontakion1.melody	@ltx/en_us_duvall/tr.d064:trLI.Kontakion1.melody
ltx/en_us_public/tr.d064:trLI.Kontakion1.mode	@ltx/en_us_dedes/tr.d064:trLI.Kontakion1.mode
ltx/en_us_public/tr.d064:trLI.Kontakion1.text	@ltx/en_us_duvall/tr.d064:trLI.Kontakion1.text
ltx/en_us_public/tr.d064:trLI.MM.Antiphon2.text	@ltx/en_us_dedes/tr.d064:trLI.MM.Antiphon2.text
ltx/en_us_public/tr.d064:trLI.MM.CommunionHymn.text	@ltx/en_us_dedes/tr.d064:trLI.MM.CommunionHymn.text
ltx/en_us_public/tr.d064:trLI.MM.EntranceHymn.text	@ltx/en_us_dedes/tr.d064:trLI.MM.EntranceHymn.text
ltx/en_us_public/tr.d064:trLI.Megalynarion.text	@ltx/en_us_dedes/tr.d064:trLI.Megalynarion.text
ltx/en_us_public/tr.d064:trLI.TheotokosHymn.incipit	@ltx/en_us_dedes/tr.d064:trLI.TheotokosHymn.incipit
ltx/en_us_public/tr.d064:trLI.TheotokosHymn.mode	@ltx/en_us_dedes/tr.d064:trLI.TheotokosHymn.mode
ltx/en_us_public/tr.d064:trLI.TheotokosHymn.text	@ltx/en_us_dedes/tr.d064:trLI.TheotokosHymn.text
ltx/en_us_public/tr.d064:trMA.C1.acrostic.notice1	@ltx/en_us_dedes/tr.d064:trMA.C1.acrostic.notice1
ltx/en_us_public/tr.d064:trMA.C1.acrostic.text	@ltx/en_us_dedes/tr.d064:trMA.C1.acrostic.text
ltx/en_us_public/tr.d064:trMA.C1.acrostic.title	@ltx/en_us_oca/tr.d064:trMA.C1.acrostic.title
ltx/en_us_public/tr.d064:trMA.C1.poet	@ltx/en_us_dedes/tr.d064:trMA.C1.poet
ltx/en_us_public/tr.d064:trMA.C1.title	@ltx/en_us_dedes/tr.d064:trMA.C1.title
ltx/en_us_public/tr.d064:trMA.C1.verse	@ltx/en_us_dedes/tr.d064:trMA.C1.verse
ltx/en_us_public/tr.d064:trMA.Exaposteilarion1.melody	@ltx/en_us_dedes/tr.d064:trMA.Exaposteilarion1.melody
ltx/en_us_public/tr.d064:trMA.Exaposteilarion1.mode	@ltx/en_us_dedes/tr.d064:trMA.Exaposteilarion1.mode
ltx/en_us_public/tr.d064:trMA.Exaposteilarion1.text	@ltx/en_us_dedes/tr.d064:trMA.Exaposteilarion1.text
ltx/en_us_public/tr.d064:trMA.Hypakoe.incipit	@ltx/en_us_duvall/tr.d064:trMA.Hypakoe.incipit
ltx/en_us_public/tr.d064:trMA.Hypakoe.melody	@ltx/en_us_duvall/tr.d064:trMA.Hypakoe.melody
ltx/en_us_public/tr.d064:trMA.Hypakoe.mode	@ltx/en_us_dedes/tr.d064:trMA.Hypakoe.mode
ltx/en_us_public/tr.d064:trMA.Hypakoe.text	@ltx/en_us_duvall/tr.d064:trMA.Hypakoe.text
ltx/en_us_public/tr.d064:trMA.Kathisma11.greekmelody	@ltx/en_us_dedes/tr.d064:trMA.Kathisma11.greekmelody
ltx/en_us_public/tr.d064:trMA.Kathisma11.incipit	@ltx/en_us_dedes/tr.d064:trMA.Kathisma11.incipit
ltx/en_us_public/tr.d064:trMA.Kathisma11.melody	@ltx/en_us_dedes/tr.d064:trMA.Kathisma11.melody
ltx/en_us_public/tr.d064:trMA.Kathisma11.mode	@ltx/en_us_dedes/tr.d064:trMA.Kathisma11.mode
ltx/en_us_public/tr.d064:trMA.Kathisma11.text	@ltx/en_us_dedes/tr.d064:trMA.Kathisma11.text
ltx/en_us_public/tr.d064:trMA.Kathisma12.greekmelody	@ltx/en_us_dedes/tr.d064:trMA.Kathisma12.greekmelody
ltx/en_us_public/tr.d064:trMA.Kathisma12.incipit	@ltx/en_us_dedes/tr.d064:trMA.Kathisma12.incipit
ltx/en_us_public/tr.d064:trMA.Kathisma12.melody	@ltx/en_us_dedes/tr.d064:trMA.Kathisma12.melody
ltx/en_us_public/tr.d064:trMA.Kathisma12.mode	@ltx/en_us_dedes/tr.d064:trMA.Kathisma12.mode
ltx/en_us_public/tr.d064:trMA.Kathisma12.text	@ltx/en_us_dedes/tr.d064:trMA.Kathisma12.text
ltx/en_us_public/tr.d064:trMA.Kathisma21.greekmelody	@ltx/en_us_dedes/tr.d064:trMA.Kathisma21.greekmelody
ltx/en_us_public/tr.d064:trMA.Kathisma21.incipit	@ltx/en_us_dedes/tr.d064:trMA.Kathisma21.incipit
ltx/en_us_public/tr.d064:trMA.Kathisma21.melody	@ltx/en_us_dedes/tr.d064:trMA.Kathisma21.melody
ltx/en_us_public/tr.d064:trMA.Kathisma21.mode	@ltx/en_us_dedes/tr.d064:trMA.Kathisma21.mode
ltx/en_us_public/tr.d064:trMA.Kathisma21.text	@ltx/en_us_dedes/tr.d064:trMA.Kathisma21.text
ltx/en_us_public/tr.d064:trMA.Kathisma22.greekmelody	@ltx/en_us_dedes/tr.d064:trMA.Kathisma22.greekmelody
ltx/en_us_public/tr.d064:trMA.Kathisma22.incipit	@ltx/en_us_dedes/tr.d064:trMA.Kathisma22.incipit
ltx/en_us_public/tr.d064:trMA.Kathisma22.melody	@ltx/en_us_dedes/tr.d064:trMA.Kathisma22.melody
ltx/en_us_public/tr.d064:trMA.Kathisma22.mode	@ltx/en_us_dedes/tr.d064:trMA.Kathisma22.mode
ltx/en_us_public/tr.d064:trMA.Kathisma22.text	@ltx/en_us_dedes/tr.d064:trMA.Kathisma22.text
ltx/en_us_public/tr.d064:trMA.Kathisma31.greekmelody	@ltx/en_us_dedes/tr.d064:trMA.Kathisma31.greekmelody
ltx/en_us_public/tr.d064:trMA.Kathisma31.incipit	@ltx/en_us_dedes/tr.d064:trMA.Kathisma31.incipit
ltx/en_us_public/tr.d064:trMA.Kathisma31.melody	@ltx/en_us_dedes/tr.d064:trMA.Kathisma31.melody
ltx/en_us_public/tr.d064:trMA.Kathisma31.mode	@ltx/en_us_dedes/tr.d064:trMA.Kathisma31.mode
ltx/en_us_public/tr.d064:trMA.Kathisma31.text	@ltx/en_us_dedes/tr.d064:trMA.Kathisma31.text
ltx/en_us_public/tr.d064:trMA.Kontakion1.incipit	@ltx/en_us_duvall/tr.d064:trMA.Kontakion1.incipit
ltx/en_us_public/tr.d064:trMA.Kontakion1.melody	@ltx/en_us_duvall/tr.d064:trMA.Kontakion1.melody
ltx/en_us_public/tr.d064:trMA.Kontakion1.mode	@ltx/en_us_dedes/tr.d064:trMA.Kontakion1.mode
ltx/en_us_public/tr.d064:trMA.Kontakion1.text	@ltx/en_us_duvall/tr.d064:trMA.Kontakion1.text
ltx/en_us_public/tr.d064:trMA.Lauds1.incipit	@ltx/en_us_dedes/tr.d064:trMA.Lauds1.incipit
ltx/en_us_public/tr.d064:trMA.Lauds1.melody	@ltx/en_us_dedes/tr.d064:trMA.Lauds1.melody
ltx/en_us_public/tr.d064:trMA.Lauds1.mode	@ltx/en_us_dedes/tr.d064:trMA.Lauds1.mode
ltx/en_us_public/tr.d064:trMA.Lauds1.text	@ltx/en_us_dedes/tr.d064:trMA.Lauds1.text
ltx/en_us_public/tr.d064:trMA.Lauds2.incipit	@ltx/en_us_dedes/tr.d064:trMA.Lauds2.incipit
ltx/en_us_public/tr.d064:trMA.Lauds2.melody	@ltx/en_us_dedes/tr.d064:trMA.Lauds2.melody
ltx/en_us_public/tr.d064:trMA.Lauds2.mode	@ltx/en_us_dedes/tr.d064:trMA.Lauds2.mode
ltx/en_us_public/tr.d064:trMA.Lauds2.text	@ltx/en_us_dedes/tr.d064:trMA.Lauds2.text
ltx/en_us_public/tr.d064:trMA.Lauds3.incipit	@ltx/en_us_dedes/tr.d064:trMA.Lauds3.incipit
ltx/en_us_public/tr.d064:trMA.Lauds3.melody	@ltx/en_us_dedes/tr.d064:trMA.Lauds3.melody
ltx/en_us_public/tr.d064:trMA.Lauds3.mode	@ltx/en_us_dedes/tr.d064:trMA.Lauds3.mode
ltx/en_us_public/tr.d064:trMA.Lauds3.text	@ltx/en_us_dedes/tr.d064:trMA.Lauds3.text
ltx/en_us_public/tr.d064:trMA.Lauds4.incipit	@ltx/en_us_dedes/tr.d064:trMA.Lauds4.incipit
ltx/en_us_public/tr.d064:trMA.Lauds4.melody	@ltx/en_us_dedes/tr.d064:trMA.Lauds4.melody
ltx/en_us_public/tr.d064:trMA.Lauds4.mode	@ltx/en_us_dedes/tr.d064:trMA.Lauds4.mode
ltx/en_us_public/tr.d064:trMA.Lauds4.text	@ltx/en_us_dedes/tr.d064:trMA.Lauds4.text
ltx/en_us_public/tr.d064:trMA.LaudsGlory.incipit	@ltx/en_us_dedes/tr.d064:trMA.LaudsGlory.incipit
ltx/en_us_public/tr.d064:trMA.LaudsGlory.melody	@ltx/en_us_dedes/tr.d064:trMA.LaudsGlory.melody
ltx/en_us_public/tr.d064:trMA.LaudsGlory.mode	@ltx/en_us_dedes/tr.d064:trMA.LaudsGlory.mode
ltx/en_us_public/tr.d064:trMA.LaudsGlory.text	@ltx/en_us_dedes/tr.d064:trMA.LaudsGlory.text
ltx/en_us_public/tr.d064:trMA.Ode1C11.greekmelody	@ltx/en_us_dedes/tr.d064:trMA.Ode1C11.greekmelody
ltx/en_us_public/tr.d064:trMA.Ode1C11.incipit	@ltx/en_us_oca/tr.d064:trMA.Ode1C11.incipit
ltx/en_us_public/tr.d064:trMA.Ode1C11.melody	@ltx/en_us_oca/tr.d064:trMA.Ode1C11.melody
ltx/en_us_public/tr.d064:trMA.Ode1C11.mode	@ltx/en_us_dedes/tr.d064:trMA.Ode1C11.mode
ltx/en_us_public/tr.d064:trMA.Ode1C11.ode	@ltx/en_us_dedes/tr.d064:trMA.Ode1C11.ode
ltx/en_us_public/tr.d064:trMA.Ode1C11.text	@ltx/en_us_oca/tr.d064:trMA.Ode1C11.text
ltx/en_us_public/tr.d064:trMA.Ode1C12.incipit	@ltx/en_us_oca/tr.d064:trMA.Ode1C12.incipit
ltx/en_us_public/tr.d064:trMA.Ode1C12.melody	@ltx/en_us_oca/tr.d064:trMA.Ode1C12.melody
ltx/en_us_public/tr.d064:trMA.Ode1C12.mode	@ltx/en_us_dedes/tr.d064:trMA.Ode1C12.mode
ltx/en_us_public/tr.d064:trMA.Ode1C12.ode	@ltx/en_us_dedes/tr.d064:trMA.Ode1C12.ode
ltx/en_us_public/tr.d064:trMA.Ode1C12.text	@ltx/en_us_oca/tr.d064:trMA.Ode1C12.text
ltx/en_us_public/tr.d064:trMA.Ode1C1H.greekmelody	@ltx/en_us_dedes/tr.d064:trMA.Ode1C1H.greekmelody
ltx/en_us_public/tr.d064:trMA.Ode1C1H.incipit	@ltx/en_us_dedes/tr.d064:trMA.Ode1C1H.incipit
ltx/en_us_public/tr.d064:trMA.Ode1C1H.melody	@ltx/en_us_dedes/tr.d064:trMA.Ode1C1H.melody
ltx/en_us_public/tr.d064:trMA.Ode1C1H.mode	@ltx/en_us_dedes/tr.d064:trMA.Ode1C1H.mode
ltx/en_us_public/tr.d064:trMA.Ode1C1H.ode	@ltx/en_us_dedes/tr.d064:trMA.Ode1C1H.ode
ltx/en_us_public/tr.d064:trMA.Ode1C1H.text	@ltx/en_us_dedes/tr.d064:trMA.Ode1C1H.text
ltx/en_us_public/tr.d064:trMA.Ode3C11.greekmelody	@ltx/en_us_dedes/tr.d064:trMA.Ode3C11.greekmelody
ltx/en_us_public/tr.d064:trMA.Ode3C11.incipit	@ltx/en_us_oca/tr.d064:trMA.Ode3C11.incipit
ltx/en_us_public/tr.d064:trMA.Ode3C11.melody	@ltx/en_us_oca/tr.d064:trMA.Ode3C11.melody
ltx/en_us_public/tr.d064:trMA.Ode3C11.mode	@ltx/en_us_dedes/tr.d064:trMA.Ode3C11.mode
ltx/en_us_public/tr.d064:trMA.Ode3C11.ode	@ltx/en_us_dedes/tr.d064:trMA.Ode3C11.ode
ltx/en_us_public/tr.d064:trMA.Ode3C11.text	@ltx/en_us_oca/tr.d064:trMA.Ode3C11.text
ltx/en_us_public/tr.d064:trMA.Ode3C12.incipit	@ltx/en_us_oca/tr.d064:trMA.Ode3C12.incipit
ltx/en_us_public/tr.d064:trMA.Ode3C12.melody	@ltx/en_us_oca/tr.d064:trMA.Ode3C12.melody
ltx/en_us_public/tr.d064:trMA.Ode3C12.mode	@ltx/en_us_dedes/tr.d064:trMA.Ode3C12.mode
ltx/en_us_public/tr.d064:trMA.Ode3C12.ode	@ltx/en_us_dedes/tr.d064:trMA.Ode3C12.ode
ltx/en_us_public/tr.d064:trMA.Ode3C12.text	@ltx/en_us_oca/tr.d064:trMA.Ode3C12.text
ltx/en_us_public/tr.d064:trMA.Ode3C1H.greekmelody	@ltx/en_us_dedes/tr.d064:trMA.Ode3C1H.greekmelody
ltx/en_us_public/tr.d064:trMA.Ode3C1H.incipit	@ltx/en_us_dedes/tr.d064:trMA.Ode3C1H.incipit
ltx/en_us_public/tr.d064:trMA.Ode3C1H.melody	@ltx/en_us_dedes/tr.d064:trMA.Ode3C1H.melody
ltx/en_us_public/tr.d064:trMA.Ode3C1H.mode	@ltx/en_us_dedes/tr.d064:trMA.Ode3C1H.mode
ltx/en_us_public/tr.d064:trMA.Ode3C1H.ode	@ltx/en_us_dedes/tr.d064:trMA.Ode3C1H.ode
ltx/en_us_public/tr.d064:trMA.Ode3C1H.text	@ltx/en_us_dedes/tr.d064:trMA.Ode3C1H.text
ltx/en_us_public/tr.d064:trMA.Ode4C11.greekmelody	@ltx/en_us_dedes/tr.d064:trMA.Ode4C11.greekmelody
ltx/en_us_public/tr.d064:trMA.Ode4C11.incipit	@ltx/en_us_oca/tr.d064:trMA.Ode4C11.incipit
ltx/en_us_public/tr.d064:trMA.Ode4C11.melody	@ltx/en_us_oca/tr.d064:trMA.Ode4C11.melody
ltx/en_us_public/tr.d064:trMA.Ode4C11.mode	@ltx/en_us_dedes/tr.d064:trMA.Ode4C11.mode
ltx/en_us_public/tr.d064:trMA.Ode4C11.ode	@ltx/en_us_dedes/tr.d064:trMA.Ode4C11.ode
ltx/en_us_public/tr.d064:trMA.Ode4C11.text	@ltx/en_us_oca/tr.d064:trMA.Ode4C11.text
ltx/en_us_public/tr.d064:trMA.Ode4C12.incipit	@ltx/en_us_oca/tr.d064:trMA.Ode4C12.incipit
ltx/en_us_public/tr.d064:trMA.Ode4C12.melody	@ltx/en_us_oca/tr.d064:trMA.Ode4C12.melody
ltx/en_us_public/tr.d064:trMA.Ode4C12.mode	@ltx/en_us_dedes/tr.d064:trMA.Ode4C12.mode
ltx/en_us_public/tr.d064:trMA.Ode4C12.ode	@ltx/en_us_dedes/tr.d064:trMA.Ode4C12.ode
ltx/en_us_public/tr.d064:trMA.Ode4C12.text	@ltx/en_us_oca/tr.d064:trMA.Ode4C12.text
ltx/en_us_public/tr.d064:trMA.Ode4C13.incipit	@ltx/en_us_oca/tr.d064:trMA.Ode4C13.incipit
ltx/en_us_public/tr.d064:trMA.Ode4C13.melody	@ltx/en_us_oca/tr.d064:trMA.Ode4C13.melody
ltx/en_us_public/tr.d064:trMA.Ode4C13.mode	@ltx/en_us_dedes/tr.d064:trMA.Ode4C13.mode
ltx/en_us_public/tr.d064:trMA.Ode4C13.ode	@ltx/en_us_dedes/tr.d064:trMA.Ode4C13.ode
ltx/en_us_public/tr.d064:trMA.Ode4C13.text	@ltx/en_us_oca/tr.d064:trMA.Ode4C13.text
ltx/en_us_public/tr.d064:trMA.Ode4C1H.greekmelody	@ltx/en_us_dedes/tr.d064:trMA.Ode4C1H.greekmelody
ltx/en_us_public/tr.d064:trMA.Ode4C1H.incipit	@ltx/en_us_dedes/tr.d064:trMA.Ode4C1H.incipit
ltx/en_us_public/tr.d064:trMA.Ode4C1H.melody	@ltx/en_us_dedes/tr.d064:trMA.Ode4C1H.melody
ltx/en_us_public/tr.d064:trMA.Ode4C1H.mode	@ltx/en_us_dedes/tr.d064:trMA.Ode4C1H.mode
ltx/en_us_public/tr.d064:trMA.Ode4C1H.ode	@ltx/en_us_dedes/tr.d064:trMA.Ode4C1H.ode
ltx/en_us_public/tr.d064:trMA.Ode4C1H.text	@ltx/en_us_dedes/tr.d064:trMA.Ode4C1H.text
ltx/en_us_public/tr.d064:trMA.Ode5C11.greekmelody	@ltx/en_us_dedes/tr.d064:trMA.Ode5C11.greekmelody
ltx/en_us_public/tr.d064:trMA.Ode5C11.incipit	@ltx/en_us_oca/tr.d064:trMA.Ode5C11.incipit
ltx/en_us_public/tr.d064:trMA.Ode5C11.melody	@ltx/en_us_oca/tr.d064:trMA.Ode5C11.melody
ltx/en_us_public/tr.d064:trMA.Ode5C11.mode	@ltx/en_us_dedes/tr.d064:trMA.Ode5C11.mode
ltx/en_us_public/tr.d064:trMA.Ode5C11.ode	@ltx/en_us_dedes/tr.d064:trMA.Ode5C11.ode
ltx/en_us_public/tr.d064:trMA.Ode5C11.text	@ltx/en_us_oca/tr.d064:trMA.Ode5C11.text
ltx/en_us_public/tr.d064:trMA.Ode5C12.incipit	@ltx/en_us_oca/tr.d064:trMA.Ode5C12.incipit
ltx/en_us_public/tr.d064:trMA.Ode5C12.melody	@ltx/en_us_oca/tr.d064:trMA.Ode5C12.melody
ltx/en_us_public/tr.d064:trMA.Ode5C12.mode	@ltx/en_us_dedes/tr.d064:trMA.Ode5C12.mode
ltx/en_us_public/tr.d064:trMA.Ode5C12.ode	@ltx/en_us_dedes/tr.d064:trMA.Ode5C12.ode
ltx/en_us_public/tr.d064:trMA.Ode5C12.text	@ltx/en_us_oca/tr.d064:trMA.Ode5C12.text
ltx/en_us_public/tr.d064:trMA.Ode5C1H.greekmelody	@ltx/en_us_dedes/tr.d064:trMA.Ode5C1H.greekmelody
ltx/en_us_public/tr.d064:trMA.Ode5C1H.incipit	@ltx/en_us_dedes/tr.d064:trMA.Ode5C1H.incipit
ltx/en_us_public/tr.d064:trMA.Ode5C1H.melody	@ltx/en_us_dedes/tr.d064:trMA.Ode5C1H.melody
ltx/en_us_public/tr.d064:trMA.Ode5C1H.mode	@ltx/en_us_dedes/tr.d064:trMA.Ode5C1H.mode
ltx/en_us_public/tr.d064:trMA.Ode5C1H.ode	@ltx/en_us_dedes/tr.d064:trMA.Ode5C1H.ode
ltx/en_us_public/tr.d064:trMA.Ode5C1H.text	@ltx/en_us_dedes/tr.d064:trMA.Ode5C1H.text
ltx/en_us_public/tr.d064:trMA.Ode6C11.greekmelody	@ltx/en_us_dedes/tr.d064:trMA.Ode6C11.greekmelody
ltx/en_us_public/tr.d064:trMA.Ode6C11.incipit	@ltx/en_us_oca/tr.d064:trMA.Ode6C11.incipit
ltx/en_us_public/tr.d064:trMA.Ode6C11.melody	@ltx/en_us_oca/tr.d064:trMA.Ode6C11.melody
ltx/en_us_public/tr.d064:trMA.Ode6C11.mode	@ltx/en_us_dedes/tr.d064:trMA.Ode6C11.mode
ltx/en_us_public/tr.d064:trMA.Ode6C11.ode	@ltx/en_us_dedes/tr.d064:trMA.Ode6C11.ode
ltx/en_us_public/tr.d064:trMA.Ode6C11.text	@ltx/en_us_oca/tr.d064:trMA.Ode6C11.text
ltx/en_us_public/tr.d064:trMA.Ode6C12.incipit	@ltx/en_us_oca/tr.d064:trMA.Ode6C12.incipit
ltx/en_us_public/tr.d064:trMA.Ode6C12.melody	@ltx/en_us_oca/tr.d064:trMA.Ode6C12.melody
ltx/en_us_public/tr.d064:trMA.Ode6C12.mode	@ltx/en_us_dedes/tr.d064:trMA.Ode6C12.mode
ltx/en_us_public/tr.d064:trMA.Ode6C12.ode	@ltx/en_us_dedes/tr.d064:trMA.Ode6C12.ode
ltx/en_us_public/tr.d064:trMA.Ode6C12.text	@ltx/en_us_oca/tr.d064:trMA.Ode6C12.text
ltx/en_us_public/tr.d064:trMA.Ode6C1H.greekmelody	@ltx/en_us_dedes/tr.d064:trMA.Ode6C1H.greekmelody
ltx/en_us_public/tr.d064:trMA.Ode6C1H.incipit	@ltx/en_us_dedes/tr.d064:trMA.Ode6C1H.incipit
ltx/en_us_public/tr.d064:trMA.Ode6C1H.melody	@ltx/en_us_dedes/tr.d064:trMA.Ode6C1H.melody
ltx/en_us_public/tr.d064:trMA.Ode6C1H.mode	@ltx/en_us_dedes/tr.d064:trMA.Ode6C1H.mode
ltx/en_us_public/tr.d064:trMA.Ode6C1H.ode	@ltx/en_us_dedes/tr.d064:trMA.Ode6C1H.ode
ltx/en_us_public/tr.d064:trMA.Ode6C1H.text	@ltx/en_us_dedes/tr.d064:trMA.Ode6C1H.text
ltx/en_us_public/tr.d064:trMA.Ode7C11.greekmelody	@ltx/en_us_dedes/tr.d064:trMA.Ode7C11.greekmelody
ltx/en_us_public/tr.d064:trMA.Ode7C11.incipit	@ltx/en_us_oca/tr.d064:trMA.Ode7C11.incipit
ltx/en_us_public/tr.d064:trMA.Ode7C11.melody	@ltx/en_us_oca/tr.d064:trMA.Ode7C11.melody
ltx/en_us_public/tr.d064:trMA.Ode7C11.mode	@ltx/en_us_dedes/tr.d064:trMA.Ode7C11.mode
ltx/en_us_public/tr.d064:trMA.Ode7C11.ode	@ltx/en_us_dedes/tr.d064:trMA.Ode7C11.ode
ltx/en_us_public/tr.d064:trMA.Ode7C11.text	@ltx/en_us_oca/tr.d064:trMA.Ode7C11.text
ltx/en_us_public/tr.d064:trMA.Ode7C12.incipit	@ltx/en_us_oca/tr.d064:trMA.Ode7C12.incipit
ltx/en_us_public/tr.d064:trMA.Ode7C12.melody	@ltx/en_us_oca/tr.d064:trMA.Ode7C12.melody
ltx/en_us_public/tr.d064:trMA.Ode7C12.mode	@ltx/en_us_dedes/tr.d064:trMA.Ode7C12.mode
ltx/en_us_public/tr.d064:trMA.Ode7C12.ode	@ltx/en_us_dedes/tr.d064:trMA.Ode7C12.ode
ltx/en_us_public/tr.d064:trMA.Ode7C12.text	@ltx/en_us_oca/tr.d064:trMA.Ode7C12.text
ltx/en_us_public/tr.d064:trMA.Ode7C13.incipit	@ltx/en_us_oca/tr.d064:trMA.Ode7C13.incipit
ltx/en_us_public/tr.d064:trMA.Ode7C13.melody	@ltx/en_us_oca/tr.d064:trMA.Ode7C13.melody
ltx/en_us_public/tr.d064:trMA.Ode7C13.mode	@ltx/en_us_dedes/tr.d064:trMA.Ode7C13.mode
ltx/en_us_public/tr.d064:trMA.Ode7C13.ode	@ltx/en_us_dedes/tr.d064:trMA.Ode7C13.ode
ltx/en_us_public/tr.d064:trMA.Ode7C13.text	@ltx/en_us_oca/tr.d064:trMA.Ode7C13.text
ltx/en_us_public/tr.d064:trMA.Ode7C1H.greekmelody	@ltx/en_us_dedes/tr.d064:trMA.Ode7C1H.greekmelody
ltx/en_us_public/tr.d064:trMA.Ode7C1H.incipit	@ltx/en_us_dedes/tr.d064:trMA.Ode7C1H.incipit
ltx/en_us_public/tr.d064:trMA.Ode7C1H.melody	@ltx/en_us_dedes/tr.d064:trMA.Ode7C1H.melody
ltx/en_us_public/tr.d064:trMA.Ode7C1H.mode	@ltx/en_us_dedes/tr.d064:trMA.Ode7C1H.mode
ltx/en_us_public/tr.d064:trMA.Ode7C1H.ode	@ltx/en_us_dedes/tr.d064:trMA.Ode7C1H.ode
ltx/en_us_public/tr.d064:trMA.Ode7C1H.text	@ltx/en_us_dedes/tr.d064:trMA.Ode7C1H.text
ltx/en_us_public/tr.d064:trMA.Ode8C11.greekmelody	@ltx/en_us_dedes/tr.d064:trMA.Ode8C11.greekmelody
ltx/en_us_public/tr.d064:trMA.Ode8C11.incipit	@ltx/en_us_oca/tr.d064:trMA.Ode8C11.incipit
ltx/en_us_public/tr.d064:trMA.Ode8C11.melody	@ltx/en_us_oca/tr.d064:trMA.Ode8C11.melody
ltx/en_us_public/tr.d064:trMA.Ode8C11.mode	@ltx/en_us_dedes/tr.d064:trMA.Ode8C11.mode
ltx/en_us_public/tr.d064:trMA.Ode8C11.ode	@ltx/en_us_dedes/tr.d064:trMA.Ode8C11.ode
ltx/en_us_public/tr.d064:trMA.Ode8C11.text	@ltx/en_us_oca/tr.d064:trMA.Ode8C11.text
ltx/en_us_public/tr.d064:trMA.Ode8C12.incipit	@ltx/en_us_oca/tr.d064:trMA.Ode8C12.incipit
ltx/en_us_public/tr.d064:trMA.Ode8C12.melody	@ltx/en_us_oca/tr.d064:trMA.Ode8C12.melody
ltx/en_us_public/tr.d064:trMA.Ode8C12.mode	@ltx/en_us_dedes/tr.d064:trMA.Ode8C12.mode
ltx/en_us_public/tr.d064:trMA.Ode8C12.ode	@ltx/en_us_dedes/tr.d064:trMA.Ode8C12.ode
ltx/en_us_public/tr.d064:trMA.Ode8C12.text	@ltx/en_us_oca/tr.d064:trMA.Ode8C12.text
ltx/en_us_public/tr.d064:trMA.Ode8C13.incipit	@ltx/en_us_oca/tr.d064:trMA.Ode8C13.incipit
ltx/en_us_public/tr.d064:trMA.Ode8C13.melody	@ltx/en_us_oca/tr.d064:trMA.Ode8C13.melody
ltx/en_us_public/tr.d064:trMA.Ode8C13.mode	@ltx/en_us_dedes/tr.d064:trMA.Ode8C13.mode
ltx/en_us_public/tr.d064:trMA.Ode8C13.ode	@ltx/en_us_dedes/tr.d064:trMA.Ode8C13.ode
ltx/en_us_public/tr.d064:trMA.Ode8C13.text	@ltx/en_us_oca/tr.d064:trMA.Ode8C13.text
ltx/en_us_public/tr.d064:trMA.Ode8C1H.greekmelody	@ltx/en_us_dedes/tr.d064:trMA.Ode8C1H.greekmelody
ltx/en_us_public/tr.d064:trMA.Ode8C1H.incipit	@ltx/en_us_dedes/tr.d064:trMA.Ode8C1H.incipit
ltx/en_us_public/tr.d064:trMA.Ode8C1H.melody	@ltx/en_us_dedes/tr.d064:trMA.Ode8C1H.melody
ltx/en_us_public/tr.d064:trMA.Ode8C1H.mode	@ltx/en_us_dedes/tr.d064:trMA.Ode8C1H.mode
ltx/en_us_public/tr.d064:trMA.Ode8C1H.ode	@ltx/en_us_dedes/tr.d064:trMA.Ode8C1H.ode
ltx/en_us_public/tr.d064:trMA.Ode8C1H.text	@ltx/en_us_dedes/tr.d064:trMA.Ode8C1H.text
ltx/en_us_public/tr.d064:trMA.Ode9C11.greekmelody	@ltx/en_us_dedes/tr.d064:trMA.Ode9C11.greekmelody
ltx/en_us_public/tr.d064:trMA.Ode9C11.incipit	@ltx/en_us_dedes/tr.d064:trMA.Ode9C11.incipit
ltx/en_us_public/tr.d064:trMA.Ode9C11.melody	@ltx/en_us_dedes/tr.d064:trMA.Ode9C11.melody
ltx/en_us_public/tr.d064:trMA.Ode9C11.mode	@ltx/en_us_dedes/tr.d064:trMA.Ode9C11.mode
ltx/en_us_public/tr.d064:trMA.Ode9C11.ode	@ltx/en_us_dedes/tr.d064:trMA.Ode9C11.ode
ltx/en_us_public/tr.d064:trMA.Ode9C11.text	@ltx/en_us_dedes/tr.d064:trMA.Ode9C11.text
ltx/en_us_public/tr.d064:trMA.Ode9C12.incipit	@ltx/en_us_dedes/tr.d064:trMA.Ode9C12.incipit
ltx/en_us_public/tr.d064:trMA.Ode9C12.melody	@ltx/en_us_dedes/tr.d064:trMA.Ode9C12.melody
ltx/en_us_public/tr.d064:trMA.Ode9C12.mode	@ltx/en_us_dedes/tr.d064:trMA.Ode9C12.mode
ltx/en_us_public/tr.d064:trMA.Ode9C12.ode	@ltx/en_us_dedes/tr.d064:trMA.Ode9C12.ode
ltx/en_us_public/tr.d064:trMA.Ode9C12.text	@ltx/en_us_dedes/tr.d064:trMA.Ode9C12.text
ltx/en_us_public/tr.d064:trMA.Ode9C13.incipit	@ltx/en_us_dedes/tr.d064:trMA.Ode9C13.incipit
ltx/en_us_public/tr.d064:trMA.Ode9C13.melody	@ltx/en_us_dedes/tr.d064:trMA.Ode9C13.melody
ltx/en_us_public/tr.d064:trMA.Ode9C13.mode	@ltx/en_us_dedes/tr.d064:trMA.Ode9C13.mode
ltx/en_us_public/tr.d064:trMA.Ode9C13.ode	@ltx/en_us_dedes/tr.d064:trMA.Ode9C13.ode
ltx/en_us_public/tr.d064:trMA.Ode9C13.text	@ltx/en_us_dedes/tr.d064:trMA.Ode9C13.text
ltx/en_us_public/tr.d064:trMA.Ode9C1H.greekmelody	@ltx/en_us_dedes/tr.d064:trMA.Ode9C1H.greekmelody
ltx/en_us_public/tr.d064:trMA.Ode9C1H.incipit	@ltx/en_us_dedes/tr.d064:trMA.Ode9C1H.incipit
ltx/en_us_public/tr.d064:trMA.Ode9C1H.melody	@ltx/en_us_dedes/tr.d064:trMA.Ode9C1H.melody
ltx/en_us_public/tr.d064:trMA.Ode9C1H.mode	@ltx/en_us_dedes/tr.d064:trMA.Ode9C1H.mode
ltx/en_us_public/tr.d064:trMA.Ode9C1H.ode	@ltx/en_us_dedes/tr.d064:trMA.Ode9C1H.ode
ltx/en_us_public/tr.d064:trMA.Ode9C1H.text	@ltx/en_us_dedes/tr.d064:trMA.Ode9C1H.text
ltx/en_us_public/tr.d064:trMA.Oikos1.text	@ltx/en_us_duvall/tr.d064:trMA.Oikos1.text
ltx/en_us_public/tr.d064:trMA.PostGospelBoth.incipit	@ltx/en_us_dedes/tr.d064:trMA.PostGospelBoth.incipit
ltx/en_us_public/tr.d064:trMA.PostGospelBoth.melody	@ltx/en_us_dedes/tr.d064:trMA.PostGospelBoth.melody
ltx/en_us_public/tr.d064:trMA.PostGospelBoth.mode	@ltx/en_us_dedes/tr.d064:trMA.PostGospelBoth.mode
ltx/en_us_public/tr.d064:trMA.PostGospelBoth.text	@ltx/en_us_dedes/tr.d064:trMA.PostGospelBoth.text
ltx/en_us_public/tr.d064:trMA.PostGospelGlory.incipit	@ltx/en_us_dedes/tr.d064:trMA.PostGospelGlory.incipit
ltx/en_us_public/tr.d064:trMA.PostGospelGlory.melody	@ltx/en_us_dedes/tr.d064:trMA.PostGospelGlory.melody
ltx/en_us_public/tr.d064:trMA.PostGospelGlory.mode	@ltx/en_us_dedes/tr.d064:trMA.PostGospelGlory.mode
ltx/en_us_public/tr.d064:trMA.PostGospelGlory.text	@ltx/en_us_dedes/tr.d064:trMA.PostGospelGlory.text
ltx/en_us_public/tr.d064:trMA.PostGospelIdiomelon.incipit	@ltx/en_us_dedes/tr.d064:trMA.PostGospelIdiomelon.incipit
ltx/en_us_public/tr.d064:trMA.PostGospelIdiomelon.melody	@ltx/en_us_dedes/tr.d064:trMA.PostGospelIdiomelon.melody
ltx/en_us_public/tr.d064:trMA.PostGospelIdiomelon.mode	@ltx/en_us_dedes/tr.d064:trMA.PostGospelIdiomelon.mode
ltx/en_us_public/tr.d064:trMA.PostGospelIdiomelon.text	@ltx/en_us_dedes/tr.d064:trMA.PostGospelIdiomelon.text
ltx/en_us_public/tr.d064:trSV.AposGlory.incipit	@ltx/en_us_dedes/tr.d064:trSV.AposGlory.incipit
ltx/en_us_public/tr.d064:trSV.AposGlory.melody	@ltx/en_us_dedes/tr.d064:trSV.AposGlory.melody
ltx/en_us_public/tr.d064:trSV.AposGlory.mode	@ltx/en_us_dedes/tr.d064:trSV.AposGlory.mode
ltx/en_us_public/tr.d064:trSV.AposGlory.text	@ltx/en_us_dedes/tr.d064:trSV.AposGlory.text
ltx/en_us_public/tr.d064:trSV.Aposticha1.incipit	@ltx/en_us_dedes/tr.d064:trSV.Aposticha1.incipit
ltx/en_us_public/tr.d064:trSV.Aposticha1.melody	@ltx/en_us_dedes/tr.d064:trSV.Aposticha1.melody
ltx/en_us_public/tr.d064:trSV.Aposticha1.mode	@ltx/en_us_dedes/tr.d064:trSV.Aposticha1.mode
ltx/en_us_public/tr.d064:trSV.Aposticha1.text	@ltx/en_us_dedes/tr.d064:trSV.Aposticha1.text
ltx/en_us_public/tr.d064:trSV.Aposticha2.incipit	@ltx/en_us_dedes/tr.d064:trSV.Aposticha2.incipit
ltx/en_us_public/tr.d064:trSV.Aposticha2.melody	@ltx/en_us_dedes/tr.d064:trSV.Aposticha2.melody
ltx/en_us_public/tr.d064:trSV.Aposticha2.mode	@ltx/en_us_dedes/tr.d064:trSV.Aposticha2.mode
ltx/en_us_public/tr.d064:trSV.Aposticha2.text	@ltx/en_us_dedes/tr.d064:trSV.Aposticha2.text
ltx/en_us_public/tr.d064:trSV.Aposticha3.incipit	@ltx/en_us_dedes/tr.d064:trSV.Aposticha3.incipit
ltx/en_us_public/tr.d064:trSV.Aposticha3.melody	@ltx/en_us_dedes/tr.d064:trSV.Aposticha3.melody
ltx/en_us_public/tr.d064:trSV.Aposticha3.mode	@ltx/en_us_dedes/tr.d064:trSV.Aposticha3.mode
ltx/en_us_public/tr.d064:trSV.Aposticha3.text	@ltx/en_us_dedes/tr.d064:trSV.Aposticha3.text
ltx/en_us_public/tr.d064:trSV.SticGlory.incipit	@ltx/en_us_dedes/tr.d064:trSV.SticGlory.incipit
ltx/en_us_public/tr.d064:trSV.SticGlory.melody	@ltx/en_us_dedes/tr.d064:trSV.SticGlory.melody
ltx/en_us_public/tr.d064:trSV.SticGlory.mode	@ltx/en_us_dedes/tr.d064:trSV.SticGlory.mode
ltx/en_us_public/tr.d064:trSV.SticGlory.text	@ltx/en_us_dedes/tr.d064:trSV.SticGlory.text
ltx/en_us_public/tr.d064:trSV.Stichera1.incipit	@ltx/en_us_dedes/tr.d064:trSV.Stichera1.incipit
ltx/en_us_public/tr.d064:trSV.Stichera1.melody	@ltx/en_us_dedes/tr.d064:trSV.Stichera1.melody
ltx/en_us_public/tr.d064:trSV.Stichera1.mode	@ltx/en_us_dedes/tr.d064:trSV.Stichera1.mode
ltx/en_us_public/tr.d064:trSV.Stichera1.text	@ltx/en_us_dedes/tr.d064:trSV.Stichera1.text
ltx/en_us_public/tr.d064:trSV.Stichera2.incipit	@ltx/en_us_dedes/tr.d064:trSV.Stichera2.incipit
ltx/en_us_public/tr.d064:trSV.Stichera2.melody	@ltx/en_us_dedes/tr.d064:trSV.Stichera2.melody
ltx/en_us_public/tr.d064:trSV.Stichera2.mode	@ltx/en_us_dedes/tr.d064:trSV.Stichera2.mode
ltx/en_us_public/tr.d064:trSV.Stichera2.text	@ltx/en_us_dedes/tr.d064:trSV.Stichera2.text
ltx/en_us_public/tr.d064:trSV.Stichera3.incipit	@ltx/en_us_dedes/tr.d064:trSV.Stichera3.incipit
ltx/en_us_public/tr.d064:trSV.Stichera3.melody	@ltx/en_us_dedes/tr.d064:trSV.Stichera3.melody
ltx/en_us_public/tr.d064:trSV.Stichera3.mode	@ltx/en_us_dedes/tr.d064:trSV.Stichera3.mode
ltx/en_us_public/tr.d064:trSV.Stichera3.text	@ltx/en_us_dedes/tr.d064:trSV.Stichera3.text
ltx/en_us_public/tr.d064:trSV.Stichera4.incipit	@ltx/en_us_dedes/tr.d064:trSV.Stichera4.incipit
ltx/en_us_public/tr.d064:trSV.Stichera4.melody	@ltx/en_us_dedes/tr.d064:trSV.Stichera4.melody
ltx/en_us_public/tr.d064:trSV.Stichera4.mode	@ltx/en_us_dedes/tr.d064:trSV.Stichera4.mode
ltx/en_us_public/tr.d064:trSV.Stichera4.text	@ltx/en_us_dedes/tr.d064:trSV.Stichera4.text
ltx/en_us_public/tr.d064:trSY.commemoration.couplet1.title	@ltx/en_us_dedes/tr.d064:trSY.commemoration.couplet1.title
ltx/en_us_public/tr.d064:trSY.commemoration.couplet1.verse1	@ltx/en_us_dedes/tr.d064:trSY.commemoration.couplet1.verse1
ltx/en_us_public/tr.d064:trSY.commemoration.couplet1.verse2	@ltx/en_us_dedes/tr.d064:trSY.commemoration.couplet1.verse2
ltx/en_us_public/tr.d064:trSY.commemoration.narration.p01	@ltx/en_us_dedes/tr.d064:trSY.commemoration.narration.p01
ltx/en_us_public/tr.d064:trSY.commemoration.narration.p02	@ltx/en_us_dedes/tr.d064:trSY.commemoration.narration.p02
ltx/en_us_public/tr.d064:trSY.commemoration.narration.p03	@ltx/en_us_dedes/tr.d064:trSY.commemoration.narration.p03
ltx/en_us_public/tr.d064:trSY.commemoration.narration.p04	@ltx/en_us_dedes/tr.d064:trSY.commemoration.narration.p04
ltx/en_us_public/tr.d064:trSY.commemoration.narration.p05	@ltx/en_us_dedes/tr.d064:trSY.commemoration.narration.p05
ltx/en_us_public/tr.d064:trSY.commemoration.narration.p06	@ltx/en_us_dedes/tr.d064:trSY.commemoration.narration.p06
ltx/en_us_public/tr.d064:trSY.commemoration.narration.p07	@ltx/en_us_dedes/tr.d064:trSY.commemoration.narration.p07
ltx/en_us_public/tr.d064:trSY.commemoration.text	@ltx/en_us_dedes/tr.d064:trSY.commemoration.text
ltx/en_us_public/tr.d064:trSY.lastline	@ltx/en_us_dedes/tr.d064:trSY.lastline
ltx/en_us_public/tr.d064:trVE.Apolytikion1.incipit	@ltx/en_us_dedes/tr.d064:trVE.Apolytikion1.incipit
ltx/en_us_public/tr.d064:trVE.Apolytikion1.melody	@ltx/en_us_dedes/tr.d064:trVE.Apolytikion1.melody
ltx/en_us_public/tr.d064:trVE.Apolytikion1.mode	@ltx/en_us_dedes/tr.d064:trVE.Apolytikion1.mode
ltx/en_us_public/tr.d064:trVE.Apolytikion1.text	@ltx/en_us_dedes/tr.d064:trVE.Apolytikion1.text
ltx/en_us_public/tr.d064:trVE.Apolytikion2.incipit	@ltx/en_us_dedes/tr.d064:trVE.Apolytikion2.incipit
ltx/en_us_public/tr.d064:trVE.Apolytikion2.melody	@ltx/en_us_dedes/tr.d064:trVE.Apolytikion2.melody
ltx/en_us_public/tr.d064:trVE.Apolytikion2.mode	@ltx/en_us_dedes/tr.d064:trVE.Apolytikion2.mode
ltx/en_us_public/tr.d064:trVE.Apolytikion2.text	@ltx/en_us_dedes/tr.d064:trVE.Apolytikion2.text
ltx/en_us_public/tr.d064:trVE.AposBoth.incipit	@ltx/en_us_dedes/tr.d064:trVE.AposBoth.incipit
ltx/en_us_public/tr.d064:trVE.AposBoth.melody	@ltx/en_us_dedes/tr.d064:trVE.AposBoth.melody
ltx/en_us_public/tr.d064:trVE.AposBoth.mode	@ltx/en_us_dedes/tr.d064:trVE.AposBoth.mode
ltx/en_us_public/tr.d064:trVE.AposBoth.text	@ltx/en_us_dedes/tr.d064:trVE.AposBoth.text
ltx/en_us_public/tr.d064:trVE.AposGlory.incipit	@ltx/en_us_dedes/tr.d064:trVE.AposGlory.incipit
ltx/en_us_public/tr.d064:trVE.AposGlory.melody	@ltx/en_us_dedes/tr.d064:trVE.AposGlory.melody
ltx/en_us_public/tr.d064:trVE.AposGlory.mode	@ltx/en_us_dedes/tr.d064:trVE.AposGlory.mode
ltx/en_us_public/tr.d064:trVE.AposGlory.text	@ltx/en_us_dedes/tr.d064:trVE.AposGlory.text
ltx/en_us_public/tr.d064:trVE.Aposticha1.incipit	@ltx/en_us_dedes/tr.d064:trVE.Aposticha1.incipit
ltx/en_us_public/tr.d064:trVE.Aposticha1.melody	@ltx/en_us_dedes/tr.d064:trVE.Aposticha1.melody
ltx/en_us_public/tr.d064:trVE.Aposticha1.mode	@ltx/en_us_dedes/tr.d064:trVE.Aposticha1.mode
ltx/en_us_public/tr.d064:trVE.Aposticha1.text	@ltx/en_us_dedes/tr.d064:trVE.Aposticha1.text
ltx/en_us_public/tr.d064:trVE.Aposticha2.incipit	@ltx/en_us_dedes/tr.d064:trVE.Aposticha2.incipit
ltx/en_us_public/tr.d064:trVE.Aposticha2.melody	@ltx/en_us_dedes/tr.d064:trVE.Aposticha2.melody
ltx/en_us_public/tr.d064:trVE.Aposticha2.mode	@ltx/en_us_dedes/tr.d064:trVE.Aposticha2.mode
ltx/en_us_public/tr.d064:trVE.Aposticha2.text	@ltx/en_us_dedes/tr.d064:trVE.Aposticha2.text
ltx/en_us_public/tr.d064:trVE.Aposticha3.incipit	@ltx/en_us_dedes/tr.d064:trVE.Aposticha3.incipit
ltx/en_us_public/tr.d064:trVE.Aposticha3.melody	@ltx/en_us_dedes/tr.d064:trVE.Aposticha3.melody
ltx/en_us_public/tr.d064:trVE.Aposticha3.mode	@ltx/en_us_dedes/tr.d064:trVE.Aposticha3.mode
ltx/en_us_public/tr.d064:trVE.Aposticha3.text	@ltx/en_us_dedes/tr.d064:trVE.Aposticha3.text
ltx/en_us_public/tr.d064:trVE.Lity1.incipit	@ltx/en_us_dedes/tr.d064:trVE.Lity1.incipit
ltx/en_us_public/tr.d064:trVE.Lity1.melody	@ltx/en_us_dedes/tr.d064:trVE.Lity1.melody
ltx/en_us_public/tr.d064:trVE.Lity1.mode	@ltx/en_us_dedes/tr.d064:trVE.Lity1.mode
ltx/en_us_public/tr.d064:trVE.Lity1.text	@ltx/en_us_dedes/tr.d064:trVE.Lity1.text
ltx/en_us_public/tr.d064:trVE.Lity2.incipit	@ltx/en_us_dedes/tr.d064:trVE.Lity2.incipit
ltx/en_us_public/tr.d064:trVE.Lity2.melody	@ltx/en_us_dedes/tr.d064:trVE.Lity2.melody
ltx/en_us_public/tr.d064:trVE.Lity2.mode	@ltx/en_us_dedes/tr.d064:trVE.Lity2.mode
ltx/en_us_public/tr.d064:trVE.Lity2.text	@ltx/en_us_dedes/tr.d064:trVE.Lity2.text
ltx/en_us_public/tr.d064:trVE.Lity3.incipit	@ltx/en_us_oca/tr.d064:trVE.Lity3.incipit
ltx/en_us_public/tr.d064:trVE.Lity3.melody	@ltx/en_us_dedes/tr.d064:trVE.Lity3.melody
ltx/en_us_public/tr.d064:trVE.Lity3.mode	@ltx/en_us_dedes/tr.d064:trVE.Lity3.mode
ltx/en_us_public/tr.d064:trVE.Lity3.text	@ltx/en_us_oca/tr.d064:trVE.Lity3.text
ltx/en_us_public/tr.d064:trVE.Lity4.incipit	@ltx/en_us_oca/tr.d064:trVE.Lity4.incipit
ltx/en_us_public/tr.d064:trVE.Lity4.melody	@ltx/en_us_dedes/tr.d064:trVE.Lity4.melody
ltx/en_us_public/tr.d064:trVE.Lity4.mode	@ltx/en_us_dedes/tr.d064:trVE.Lity4.mode
ltx/en_us_public/tr.d064:trVE.Lity4.text	@ltx/en_us_oca/tr.d064:trVE.Lity4.text
ltx/en_us_public/tr.d064:trVE.Lity5.incipit	@ltx/en_us_oca/tr.d064:trVE.Lity5.incipit
ltx/en_us_public/tr.d064:trVE.Lity5.melody	@ltx/en_us_dedes/tr.d064:trVE.Lity5.melody
ltx/en_us_public/tr.d064:trVE.Lity5.mode	@ltx/en_us_dedes/tr.d064:trVE.Lity5.mode
ltx/en_us_public/tr.d064:trVE.Lity5.text	@ltx/en_us_oca/tr.d064:trVE.Lity5.text
ltx/en_us_public/tr.d064:trVE.LityGlory.incipit	@ltx/en_us_dedes/tr.d064:trVE.LityGlory.incipit
ltx/en_us_public/tr.d064:trVE.LityGlory.melody	@ltx/en_us_dedes/tr.d064:trVE.LityGlory.melody
ltx/en_us_public/tr.d064:trVE.LityGlory.mode	@ltx/en_us_dedes/tr.d064:trVE.LityGlory.mode
ltx/en_us_public/tr.d064:trVE.LityGlory.text	@ltx/en_us_dedes/tr.d064:trVE.LityGlory.text
ltx/en_us_public/tr.d064:trVE.SticBoth.incipit	@ltx/en_us_dedes/tr.d064:trVE.SticBoth.incipit
ltx/en_us_public/tr.d064:trVE.SticBoth.melody	@ltx/en_us_dedes/tr.d064:trVE.SticBoth.melody
ltx/en_us_public/tr.d064:trVE.SticBoth.mode	@ltx/en_us_dedes/tr.d064:trVE.SticBoth.mode
ltx/en_us_public/tr.d064:trVE.SticBoth.text	@ltx/en_us_dedes/tr.d064:trVE.SticBoth.text
ltx/en_us_public/tr.d064:trVE.SticGlory.incipit	@ltx/en_us_dedes/tr.d064:trVE.SticGlory.incipit
ltx/en_us_public/tr.d064:trVE.SticGlory.melody	@ltx/en_us_dedes/tr.d064:trVE.SticGlory.melody
ltx/en_us_public/tr.d064:trVE.SticGlory.mode	@ltx/en_us_dedes/tr.d064:trVE.SticGlory.mode
ltx/en_us_public/tr.d064:trVE.SticGlory.text	@ltx/en_us_dedes/tr.d064:trVE.SticGlory.text
ltx/en_us_public/tr.d064:trVE.Stichera01.incipit	@ltx/en_us_dedes/tr.d064:trVE.Stichera01.incipit
ltx/en_us_public/tr.d064:trVE.Stichera01.melody	@ltx/en_us_dedes/tr.d064:trVE.Stichera01.melody
ltx/en_us_public/tr.d064:trVE.Stichera01.mode	@ltx/en_us_dedes/tr.d064:trVE.Stichera01.mode
ltx/en_us_public/tr.d064:trVE.Stichera01.text	@ltx/en_us_dedes/tr.d064:trVE.Stichera01.text
ltx/en_us_public/tr.d064:trVE.Stichera02.incipit	@ltx/en_us_dedes/tr.d064:trVE.Stichera02.incipit
ltx/en_us_public/tr.d064:trVE.Stichera02.melody	@ltx/en_us_dedes/tr.d064:trVE.Stichera02.melody
ltx/en_us_public/tr.d064:trVE.Stichera02.mode	@ltx/en_us_dedes/tr.d064:trVE.Stichera02.mode
ltx/en_us_public/tr.d064:trVE.Stichera02.text	@ltx/en_us_dedes/tr.d064:trVE.Stichera02.text
ltx/en_us_public/tr.d064:trVE.Stichera03.incipit	@ltx/en_us_dedes/tr.d064:trVE.Stichera03.incipit
ltx/en_us_public/tr.d064:trVE.Stichera03.melody	@ltx/en_us_dedes/tr.d064:trVE.Stichera03.melody
ltx/en_us_public/tr.d064:trVE.Stichera03.mode	@ltx/en_us_dedes/tr.d064:trVE.Stichera03.mode
ltx/en_us_public/tr.d064:trVE.Stichera03.text	@ltx/en_us_dedes/tr.d064:trVE.Stichera03.text
ltx/en_us_public/tr.d064:trVE.Stichera04.incipit	@ltx/en_us_dedes/tr.d064:trVE.Stichera04.incipit
ltx/en_us_public/tr.d064:trVE.Stichera04.melody	@ltx/en_us_dedes/tr.d064:trVE.Stichera04.melody
ltx/en_us_public/tr.d064:trVE.Stichera04.mode	@ltx/en_us_dedes/tr.d064:trVE.Stichera04.mode
ltx/en_us_public/tr.d064:trVE.Stichera04.text	@ltx/en_us_dedes/tr.d064:trVE.Stichera04.text
ltx/en_us_public/tr.d064:trVE.Stichera05.incipit	@ltx/en_us_dedes/tr.d064:trVE.Stichera05.incipit
ltx/en_us_public/tr.d064:trVE.Stichera05.melody	@ltx/en_us_dedes/tr.d064:trVE.Stichera05.melody
ltx/en_us_public/tr.d064:trVE.Stichera05.mode	@ltx/en_us_dedes/tr.d064:trVE.Stichera05.mode
ltx/en_us_public/tr.d064:trVE.Stichera05.text	@ltx/en_us_dedes/tr.d064:trVE.Stichera05.text
