ltx/en_us_oca/me.m06.d01:meDA.commemoration.first	
ltx/en_us_oca/me.m06.d01:meDA.commemoration.first_name	
ltx/en_us_oca/me.m06.d01:meDA.commemoration.first_short	
ltx/en_us_oca/me.m06.d01:meDA.commemoration.first_title	
ltx/en_us_oca/me.m06.d01:meDA.commemoration.full	
ltx/en_us_oca/me.m06.d01:meDA.commemoration.second_name	
ltx/en_us_oca/me.m06.d01:meDA.commemoration.second_title	
ltx/en_us_oca/me.m06.d01:meDA.date	
ltx/en_us_oca/me.m06.d01:meDA.dismissal	
ltx/en_us_oca/me.m06.d01:meDA.fordate	
ltx/en_us_oca/me.m06.d01:meDA.insert1	
ltx/en_us_oca/me.m06.d01:meDA.insert2	
ltx/en_us_oca/me.m06.d01:meDA.note	
ltx/en_us_oca/me.m06.d01:meDA.pdfcoverdate	
ltx/en_us_oca/me.m06.d01:meDA.pdfheaderdate	
ltx/en_us_oca/me.m06.d01:meHO.commemorations	
ltx/en_us_oca/me.m06.d01:meHO.note1	
ltx/en_us_oca/me.m06.d01:meHO.note2	
ltx/en_us_oca/me.m06.d01:meHO.number	
ltx/en_us_oca/me.m06.d01:meHO.rank	
ltx/en_us_oca/me.m06.d01:meLE.commemoration1	
ltx/en_us_oca/me.m06.d01:meLE.commemoration2	
ltx/en_us_oca/me.m06.d01:meLI.Kontakion1.incipit	@ltx/en_us_oca/me.m06.d01:meMA.Kontakion1ger.incipit
ltx/en_us_oca/me.m06.d01:meLI.Kontakion1.melody	@ltx/en_us_oca/me.m06.d01:meMA.Kontakion1ger.melody
ltx/en_us_oca/me.m06.d01:meLI.Kontakion1.mode	@ltx/en_us_oca/me.m06.d01:meMA.Kontakion1ger.mode
ltx/en_us_oca/me.m06.d01:meLI.Kontakion1.text	@ltx/en_us_oca/me.m06.d01:meMA.Kontakion1ger.text
ltx/en_us_oca/me.m06.d01:meLI.MM.CommunionHymn.text	@ltx/en_us_oca/properties:media.key
ltx/en_us_oca/me.m06.d01:meLI.Megalynarion.text	
ltx/en_us_oca/me.m06.d01:meMA.C1.title	@ltx/en_us_oca/titles:ti.CanonSaints
ltx/en_us_oca/me.m06.d01:meMA.C1.verse	@ltx/en_us_oca/prayers:pr.verse_SaintsM.text
ltx/en_us_oca/me.m06.d01:meMA.Kontakion1ger.incipit	…
ltx/en_us_oca/me.m06.d01:meMA.Kontakion1ger.melody	@ltx/en_us_oca/he.a.m2:heAU.TousAsfaleis.notmetered
ltx/en_us_oca/me.m06.d01:meMA.Kontakion1ger.mode	@ltx/en_us_oca/miscellanea:misc.Mode2
ltx/en_us_oca/me.m06.d01:meMA.Kontakion1ger.poet	@ltx/en_us_oca/poets:po.Gerasimou
ltx/en_us_oca/me.m06.d01:meMA.Kontakion1ger.text	
ltx/en_us_oca/me.m06.d01:meMA.Ode1C11.greekmelody	@ltx/en_us_oca/he.h.m2:heHE.DefteLaoi.greekname
ltx/en_us_oca/me.m06.d01:meMA.Ode1C11.incipit	…
ltx/en_us_oca/me.m06.d01:meMA.Ode1C11.melody	@ltx/en_us_oca/he.h.m2:heHE.DefteLaoi.notmetered
ltx/en_us_oca/me.m06.d01:meMA.Ode1C11.mode	@ltx/en_us_oca/miscellanea:misc.Mode2
ltx/en_us_oca/me.m06.d01:meMA.Ode1C11.ode	@ltx/en_us_oca/miscellanea:misc.Ode1
ltx/en_us_oca/me.m06.d01:meMA.Ode1C11.text	
ltx/en_us_oca/me.m06.d01:meMA.Ode1C12.incipit	…
ltx/en_us_oca/me.m06.d01:meMA.Ode1C12.melody	@ltx/en_us_oca/he.h.m2:heHE.DefteLaoi.notmetered
ltx/en_us_oca/me.m06.d01:meMA.Ode1C12.mode	@ltx/en_us_oca/miscellanea:misc.Mode2
ltx/en_us_oca/me.m06.d01:meMA.Ode1C12.ode	@ltx/en_us_oca/miscellanea:misc.Ode1
ltx/en_us_oca/me.m06.d01:meMA.Ode1C12.text	
ltx/en_us_oca/me.m06.d01:meMA.Ode1C13.incipit	…
ltx/en_us_oca/me.m06.d01:meMA.Ode1C13.melody	@ltx/en_us_oca/he.h.m2:heHE.DefteLaoi.notmetered
ltx/en_us_oca/me.m06.d01:meMA.Ode1C13.mode	@ltx/en_us_oca/miscellanea:misc.Mode2
ltx/en_us_oca/me.m06.d01:meMA.Ode1C13.ode	@ltx/en_us_oca/miscellanea:misc.Ode1
ltx/en_us_oca/me.m06.d01:meMA.Ode1C13.text	
ltx/en_us_oca/me.m06.d01:meMA.Ode1C1T.incipit	…
ltx/en_us_oca/me.m06.d01:meMA.Ode1C1T.melody	@ltx/en_us_oca/he.h.m2:heHE.DefteLaoi.notmetered
ltx/en_us_oca/me.m06.d01:meMA.Ode1C1T.mode	@ltx/en_us_oca/miscellanea:misc.Mode2
ltx/en_us_oca/me.m06.d01:meMA.Ode1C1T.ode	@ltx/en_us_oca/miscellanea:misc.Ode1
ltx/en_us_oca/me.m06.d01:meMA.Ode1C1T.text	
ltx/en_us_oca/me.m06.d01:meMA.Ode3C11.greekmelody	@ltx/en_us_oca/he.h.m2:heHE.StereosonImasEnSoiKyrie.greekname
ltx/en_us_oca/me.m06.d01:meMA.Ode3C11.incipit	…
ltx/en_us_oca/me.m06.d01:meMA.Ode3C11.melody	@ltx/en_us_oca/he.h.m2:heHE.StereosonImasEnSoiKyrie.notmetered
ltx/en_us_oca/me.m06.d01:meMA.Ode3C11.mode	@ltx/en_us_oca/miscellanea:misc.Mode2
ltx/en_us_oca/me.m06.d01:meMA.Ode3C11.ode	@ltx/en_us_oca/miscellanea:misc.Ode3
ltx/en_us_oca/me.m06.d01:meMA.Ode3C11.text	
ltx/en_us_oca/me.m06.d01:meMA.Ode3C12.incipit	…
ltx/en_us_oca/me.m06.d01:meMA.Ode3C12.melody	@ltx/en_us_oca/he.h.m2:heHE.StereosonImasEnSoiKyrie.notmetered
ltx/en_us_oca/me.m06.d01:meMA.Ode3C12.mode	@ltx/en_us_oca/miscellanea:misc.Mode2
ltx/en_us_oca/me.m06.d01:meMA.Ode3C12.ode	@ltx/en_us_oca/miscellanea:misc.Ode3
ltx/en_us_oca/me.m06.d01:meMA.Ode3C12.text	
ltx/en_us_oca/me.m06.d01:meMA.Ode3C13.incipit	…
ltx/en_us_oca/me.m06.d01:meMA.Ode3C13.melody	@ltx/en_us_oca/he.h.m2:heHE.StereosonImasEnSoiKyrie.notmetered
ltx/en_us_oca/me.m06.d01:meMA.Ode3C13.mode	@ltx/en_us_oca/miscellanea:misc.Mode2
ltx/en_us_oca/me.m06.d01:meMA.Ode3C13.ode	@ltx/en_us_oca/miscellanea:misc.Ode3
ltx/en_us_oca/me.m06.d01:meMA.Ode3C13.text	
ltx/en_us_oca/me.m06.d01:meMA.Ode3C1T.incipit	…
ltx/en_us_oca/me.m06.d01:meMA.Ode3C1T.melody	@ltx/en_us_oca/he.h.m2:heHE.StereosonImasEnSoiKyrie.notmetered
ltx/en_us_oca/me.m06.d01:meMA.Ode3C1T.mode	@ltx/en_us_oca/miscellanea:misc.Mode2
ltx/en_us_oca/me.m06.d01:meMA.Ode3C1T.ode	@ltx/en_us_oca/miscellanea:misc.Ode3
ltx/en_us_oca/me.m06.d01:meMA.Ode3C1T.text	
ltx/en_us_oca/me.m06.d01:meMA.Ode3H.greekmelody	@ltx/en_us_oca/he.h.m2:heHE.StereosonImasEnSoiKyrie.greekname
ltx/en_us_oca/me.m06.d01:meMA.Ode3H.incipit	@ltx/en_us_oca/he.h.m2:heHE.StereosonImasEnSoiKyrie.incipit
ltx/en_us_oca/me.m06.d01:meMA.Ode3H.melody	@ltx/en_us_oca/he.h.m2:heHE.StereosonImasEnSoiKyrie.melody
ltx/en_us_oca/me.m06.d01:meMA.Ode3H.mode	@ltx/en_us_oca/miscellanea:misc.Mode2
ltx/en_us_oca/me.m06.d01:meMA.Ode3H.ode	@ltx/en_us_oca/miscellanea:misc.Ode3
ltx/en_us_oca/me.m06.d01:meMA.Ode3H.text	@ltx/en_us_oca/he.h.m2:heHE.StereosonImasEnSoiKyrie.text
ltx/en_us_oca/me.m06.d01:meMA.Ode3Kathisma1.greekmelody	@ltx/en_us_oca/he.a.m5:heAU.TonSynanarchonLogon.greekname
ltx/en_us_oca/me.m06.d01:meMA.Ode3Kathisma1.incipit	…
ltx/en_us_oca/me.m06.d01:meMA.Ode3Kathisma1.melody	@ltx/en_us_oca/he.a.m5:heAU.TonSynanarchonLogon.notmetered
ltx/en_us_oca/me.m06.d01:meMA.Ode3Kathisma1.mode	@ltx/en_us_oca/miscellanea:misc.Mode5
ltx/en_us_oca/me.m06.d01:meMA.Ode3Kathisma1.text	
ltx/en_us_oca/me.m06.d01:meMA.Ode3KathismaSt.incipit	@ltx/en_us_oca/oc.m5.d4:ocMA.Kathisma13.incipit
ltx/en_us_oca/me.m06.d01:meMA.Ode3KathismaSt.melody	@ltx/en_us_oca/he.a.m5:heAU.TonSynanarchonLogon.notmetered
ltx/en_us_oca/me.m06.d01:meMA.Ode3KathismaSt.mode	@ltx/en_us_oca/miscellanea:misc.Mode5
ltx/en_us_oca/me.m06.d01:meMA.Ode3KathismaSt.text	@ltx/en_us_oca/oc.m5.d4:ocMA.Kathisma13.text
ltx/en_us_oca/me.m06.d01:meMA.Ode3KathismaT.incipit	@ltx/en_us_oca/oc.m5.d2:ocMA.Kathisma13.incipit
ltx/en_us_oca/me.m06.d01:meMA.Ode3KathismaT.melody	@ltx/en_us_oca/he.a.m5:heAU.TonSynanarchonLogon.notmetered
ltx/en_us_oca/me.m06.d01:meMA.Ode3KathismaT.mode	@ltx/en_us_oca/miscellanea:misc.Mode5
ltx/en_us_oca/me.m06.d01:meMA.Ode3KathismaT.text	@ltx/en_us_oca/oc.m5.d2:ocMA.Kathisma13.text
ltx/en_us_oca/me.m06.d01:meMA.Ode4C11.greekmelody	@ltx/en_us_oca/he.h.m2:heHE.EisakikoaKyrieTinAkoin.greekname
ltx/en_us_oca/me.m06.d01:meMA.Ode4C11.incipit	…
ltx/en_us_oca/me.m06.d01:meMA.Ode4C11.melody	@ltx/en_us_oca/he.h.m2:heHE.EisakikoaKyrieTinAkoin.name
ltx/en_us_oca/me.m06.d01:meMA.Ode4C11.mode	@ltx/en_us_oca/miscellanea:misc.Mode2
ltx/en_us_oca/me.m06.d01:meMA.Ode4C11.ode	@ltx/en_us_oca/miscellanea:misc.Ode4
ltx/en_us_oca/me.m06.d01:meMA.Ode4C11.text	
ltx/en_us_oca/me.m06.d01:meMA.Ode4C12.incipit	…
ltx/en_us_oca/me.m06.d01:meMA.Ode4C12.melody	@ltx/en_us_oca/he.h.m2:heHE.EisakikoaKyrieTinAkoin.name
ltx/en_us_oca/me.m06.d01:meMA.Ode4C12.mode	@ltx/en_us_oca/miscellanea:misc.Mode2
ltx/en_us_oca/me.m06.d01:meMA.Ode4C12.ode	@ltx/en_us_oca/miscellanea:misc.Ode4
ltx/en_us_oca/me.m06.d01:meMA.Ode4C12.text	
ltx/en_us_oca/me.m06.d01:meMA.Ode4C13.incipit	…
ltx/en_us_oca/me.m06.d01:meMA.Ode4C13.melody	@ltx/en_us_oca/he.h.m2:heHE.EisakikoaKyrieTinAkoin.name
ltx/en_us_oca/me.m06.d01:meMA.Ode4C13.mode	@ltx/en_us_oca/miscellanea:misc.Mode2
ltx/en_us_oca/me.m06.d01:meMA.Ode4C13.ode	@ltx/en_us_oca/miscellanea:misc.Ode4
ltx/en_us_oca/me.m06.d01:meMA.Ode4C13.text	
ltx/en_us_oca/me.m06.d01:meMA.Ode4C1T.incipit	…
ltx/en_us_oca/me.m06.d01:meMA.Ode4C1T.melody	@ltx/en_us_oca/he.h.m2:heHE.EisakikoaKyrieTinAkoin.name
ltx/en_us_oca/me.m06.d01:meMA.Ode4C1T.mode	@ltx/en_us_oca/miscellanea:misc.Mode2
ltx/en_us_oca/me.m06.d01:meMA.Ode4C1T.ode	@ltx/en_us_oca/miscellanea:misc.Ode4
ltx/en_us_oca/me.m06.d01:meMA.Ode4C1T.text	
ltx/en_us_oca/me.m06.d01:meMA.Ode5C11.greekmelody	@ltx/en_us_oca/he.h.m2:heHE.OTouFotosChorigos.greekname
ltx/en_us_oca/me.m06.d01:meMA.Ode5C11.incipit	…
ltx/en_us_oca/me.m06.d01:meMA.Ode5C11.melody	@ltx/en_us_oca/he.h.m2:heHE.OTouFotosChorigos.notmetered
ltx/en_us_oca/me.m06.d01:meMA.Ode5C11.mode	@ltx/en_us_oca/miscellanea:misc.Mode2
ltx/en_us_oca/me.m06.d01:meMA.Ode5C11.ode	@ltx/en_us_oca/miscellanea:misc.Ode5
ltx/en_us_oca/me.m06.d01:meMA.Ode5C11.text	
ltx/en_us_oca/me.m06.d01:meMA.Ode5C12.incipit	…
ltx/en_us_oca/me.m06.d01:meMA.Ode5C12.melody	@ltx/en_us_oca/he.h.m2:heHE.OTouFotosChorigos.notmetered
ltx/en_us_oca/me.m06.d01:meMA.Ode5C12.mode	@ltx/en_us_oca/miscellanea:misc.Mode2
ltx/en_us_oca/me.m06.d01:meMA.Ode5C12.ode	@ltx/en_us_oca/miscellanea:misc.Ode5
ltx/en_us_oca/me.m06.d01:meMA.Ode5C12.text	
ltx/en_us_oca/me.m06.d01:meMA.Ode5C13.incipit	…
ltx/en_us_oca/me.m06.d01:meMA.Ode5C13.melody	@ltx/en_us_oca/he.h.m2:heHE.OTouFotosChorigos.notmetered
ltx/en_us_oca/me.m06.d01:meMA.Ode5C13.mode	@ltx/en_us_oca/miscellanea:misc.Mode2
ltx/en_us_oca/me.m06.d01:meMA.Ode5C13.ode	@ltx/en_us_oca/miscellanea:misc.Ode5
ltx/en_us_oca/me.m06.d01:meMA.Ode5C13.text	
ltx/en_us_oca/me.m06.d01:meMA.Ode5C1T.incipit	…
ltx/en_us_oca/me.m06.d01:meMA.Ode5C1T.melody	@ltx/en_us_oca/he.h.m2:heHE.OTouFotosChorigos.notmetered
ltx/en_us_oca/me.m06.d01:meMA.Ode5C1T.mode	@ltx/en_us_oca/miscellanea:misc.Mode2
ltx/en_us_oca/me.m06.d01:meMA.Ode5C1T.ode	@ltx/en_us_oca/miscellanea:misc.Ode5
ltx/en_us_oca/me.m06.d01:meMA.Ode5C1T.text	
ltx/en_us_oca/me.m06.d01:meMA.Ode6C11.greekmelody	@ltx/en_us_oca/he.h.m2:heHE.EnAvyssoPtaismaton.greekname
ltx/en_us_oca/me.m06.d01:meMA.Ode6C11.incipit	…
ltx/en_us_oca/me.m06.d01:meMA.Ode6C11.melody	@ltx/en_us_oca/he.h.m2:heHE.EnAvyssoPtaismaton.notmetered
ltx/en_us_oca/me.m06.d01:meMA.Ode6C11.mode	@ltx/en_us_oca/miscellanea:misc.Mode2
ltx/en_us_oca/me.m06.d01:meMA.Ode6C11.ode	@ltx/en_us_oca/miscellanea:misc.Ode6
ltx/en_us_oca/me.m06.d01:meMA.Ode6C11.text	
ltx/en_us_oca/me.m06.d01:meMA.Ode6C12.incipit	…
ltx/en_us_oca/me.m06.d01:meMA.Ode6C12.melody	@ltx/en_us_oca/he.h.m2:heHE.EnAvyssoPtaismaton.notmetered
ltx/en_us_oca/me.m06.d01:meMA.Ode6C12.mode	@ltx/en_us_oca/miscellanea:misc.Mode2
ltx/en_us_oca/me.m06.d01:meMA.Ode6C12.ode	@ltx/en_us_oca/miscellanea:misc.Ode6
ltx/en_us_oca/me.m06.d01:meMA.Ode6C12.text	
ltx/en_us_oca/me.m06.d01:meMA.Ode6C13.incipit	…
ltx/en_us_oca/me.m06.d01:meMA.Ode6C13.melody	@ltx/en_us_oca/he.h.m2:heHE.EnAvyssoPtaismaton.notmetered
ltx/en_us_oca/me.m06.d01:meMA.Ode6C13.mode	@ltx/en_us_oca/miscellanea:misc.Mode2
ltx/en_us_oca/me.m06.d01:meMA.Ode6C13.ode	@ltx/en_us_oca/miscellanea:misc.Ode6
ltx/en_us_oca/me.m06.d01:meMA.Ode6C13.text	
ltx/en_us_oca/me.m06.d01:meMA.Ode6C1T.incipit	…
ltx/en_us_oca/me.m06.d01:meMA.Ode6C1T.melody	@ltx/en_us_oca/he.h.m2:heHE.EnAvyssoPtaismaton.notmetered
ltx/en_us_oca/me.m06.d01:meMA.Ode6C1T.mode	@ltx/en_us_oca/miscellanea:misc.Mode2
ltx/en_us_oca/me.m06.d01:meMA.Ode6C1T.ode	@ltx/en_us_oca/miscellanea:misc.Ode6
ltx/en_us_oca/me.m06.d01:meMA.Ode6C1T.text	
ltx/en_us_oca/me.m06.d01:meMA.Ode6H.greekmelody	@ltx/en_us_oca/he.h.m2:heHE.EnAvyssoPtaismaton.greekname
ltx/en_us_oca/me.m06.d01:meMA.Ode6H.incipit	@ltx/en_us_oca/he.h.m2:heHE.EnAvyssoPtaismaton.incipit
ltx/en_us_oca/me.m06.d01:meMA.Ode6H.melody	@ltx/en_us_oca/he.h.m2:heHE.EnAvyssoPtaismaton.melody
ltx/en_us_oca/me.m06.d01:meMA.Ode6H.mode	@ltx/en_us_oca/miscellanea:misc.Mode2
ltx/en_us_oca/me.m06.d01:meMA.Ode6H.ode	@ltx/en_us_oca/miscellanea:misc.Ode6
ltx/en_us_oca/me.m06.d01:meMA.Ode6H.text	@ltx/en_us_oca/he.h.m2:heHE.EnAvyssoPtaismaton.text
ltx/en_us_oca/me.m06.d01:meMA.Ode7C11.greekmelody	@ltx/en_us_oca/he.h.m2:heHE.EikonosChrysis.greekname
ltx/en_us_oca/me.m06.d01:meMA.Ode7C11.incipit	…
ltx/en_us_oca/me.m06.d01:meMA.Ode7C11.melody	@ltx/en_us_oca/he.h.m2:heHE.EikonosChrysis.notmetered
ltx/en_us_oca/me.m06.d01:meMA.Ode7C11.mode	@ltx/en_us_oca/miscellanea:misc.Mode2
ltx/en_us_oca/me.m06.d01:meMA.Ode7C11.ode	@ltx/en_us_oca/miscellanea:misc.Ode7
ltx/en_us_oca/me.m06.d01:meMA.Ode7C11.text	
ltx/en_us_oca/me.m06.d01:meMA.Ode7C12.incipit	…
ltx/en_us_oca/me.m06.d01:meMA.Ode7C12.melody	@ltx/en_us_oca/he.h.m2:heHE.EikonosChrysis.notmetered
ltx/en_us_oca/me.m06.d01:meMA.Ode7C12.mode	@ltx/en_us_oca/miscellanea:misc.Mode2
ltx/en_us_oca/me.m06.d01:meMA.Ode7C12.ode	@ltx/en_us_oca/miscellanea:misc.Ode7
ltx/en_us_oca/me.m06.d01:meMA.Ode7C12.text	
ltx/en_us_oca/me.m06.d01:meMA.Ode7C13.incipit	…
ltx/en_us_oca/me.m06.d01:meMA.Ode7C13.melody	@ltx/en_us_oca/he.h.m2:heHE.EikonosChrysis.notmetered
ltx/en_us_oca/me.m06.d01:meMA.Ode7C13.mode	@ltx/en_us_oca/miscellanea:misc.Mode2
ltx/en_us_oca/me.m06.d01:meMA.Ode7C13.ode	@ltx/en_us_oca/miscellanea:misc.Ode7
ltx/en_us_oca/me.m06.d01:meMA.Ode7C13.text	
ltx/en_us_oca/me.m06.d01:meMA.Ode7C1T.incipit	…
ltx/en_us_oca/me.m06.d01:meMA.Ode7C1T.melody	@ltx/en_us_oca/he.h.m2:heHE.EikonosChrysis.notmetered
ltx/en_us_oca/me.m06.d01:meMA.Ode7C1T.mode	@ltx/en_us_oca/miscellanea:misc.Mode2
ltx/en_us_oca/me.m06.d01:meMA.Ode7C1T.ode	@ltx/en_us_oca/miscellanea:misc.Ode7
ltx/en_us_oca/me.m06.d01:meMA.Ode7C1T.text	
ltx/en_us_oca/me.m06.d01:meMA.Ode8C11.greekmelody	@ltx/en_us_oca/he.h.m2:heHE.TonEnKaminoTouPyros.greekname
ltx/en_us_oca/me.m06.d01:meMA.Ode8C11.incipit	…
ltx/en_us_oca/me.m06.d01:meMA.Ode8C11.melody	@ltx/en_us_oca/he.h.m2:heHE.TonEnKaminoTouPyros.notmetered
ltx/en_us_oca/me.m06.d01:meMA.Ode8C11.mode	@ltx/en_us_oca/miscellanea:misc.Mode2
ltx/en_us_oca/me.m06.d01:meMA.Ode8C11.ode	@ltx/en_us_oca/miscellanea:misc.Ode8
ltx/en_us_oca/me.m06.d01:meMA.Ode8C11.text	
ltx/en_us_oca/me.m06.d01:meMA.Ode8C12.incipit	…
ltx/en_us_oca/me.m06.d01:meMA.Ode8C12.melody	@ltx/en_us_oca/he.h.m2:heHE.TonEnKaminoTouPyros.notmetered
ltx/en_us_oca/me.m06.d01:meMA.Ode8C12.mode	@ltx/en_us_oca/miscellanea:misc.Mode2
ltx/en_us_oca/me.m06.d01:meMA.Ode8C12.ode	@ltx/en_us_oca/miscellanea:misc.Ode8
ltx/en_us_oca/me.m06.d01:meMA.Ode8C12.text	
ltx/en_us_oca/me.m06.d01:meMA.Ode8C13.incipit	…
ltx/en_us_oca/me.m06.d01:meMA.Ode8C13.melody	@ltx/en_us_oca/he.h.m2:heHE.TonEnKaminoTouPyros.notmetered
ltx/en_us_oca/me.m06.d01:meMA.Ode8C13.mode	@ltx/en_us_oca/miscellanea:misc.Mode2
ltx/en_us_oca/me.m06.d01:meMA.Ode8C13.ode	@ltx/en_us_oca/miscellanea:misc.Ode8
ltx/en_us_oca/me.m06.d01:meMA.Ode8C13.text	
ltx/en_us_oca/me.m06.d01:meMA.Ode8C1T.incipit	…
ltx/en_us_oca/me.m06.d01:meMA.Ode8C1T.melody	@ltx/en_us_oca/he.h.m2:heHE.TonEnKaminoTouPyros.notmetered
ltx/en_us_oca/me.m06.d01:meMA.Ode8C1T.mode	@ltx/en_us_oca/miscellanea:misc.Mode2
ltx/en_us_oca/me.m06.d01:meMA.Ode8C1T.ode	@ltx/en_us_oca/miscellanea:misc.Ode8
ltx/en_us_oca/me.m06.d01:meMA.Ode8C1T.text	
ltx/en_us_oca/me.m06.d01:meMA.Ode8H.greekmelody	@ltx/en_us_oca/he.h.m2:heHE.TonEnKaminoTouPyros.greekname
ltx/en_us_oca/me.m06.d01:meMA.Ode8H.incipit	@ltx/en_us_oca/he.h.m2:heHE.TonEnKaminoTouPyros.incipit
ltx/en_us_oca/me.m06.d01:meMA.Ode8H.melody	@ltx/en_us_oca/he.h.m2:heHE.TonEnKaminoTouPyros.melody
ltx/en_us_oca/me.m06.d01:meMA.Ode8H.mode	@ltx/en_us_oca/miscellanea:misc.Mode2
ltx/en_us_oca/me.m06.d01:meMA.Ode8H.ode	@ltx/en_us_oca/miscellanea:misc.Ode8
ltx/en_us_oca/me.m06.d01:meMA.Ode8H.text	@ltx/en_us_oca/he.h.m2:heHE.TonEnKaminoTouPyros.text
ltx/en_us_oca/me.m06.d01:meMA.Ode9C11.greekmelody	@ltx/en_us_oca/he.h.m2:heHE.TonEkTheouTheonLogon.greekname
ltx/en_us_oca/me.m06.d01:meMA.Ode9C11.incipit	…
ltx/en_us_oca/me.m06.d01:meMA.Ode9C11.melody	@ltx/en_us_oca/he.h.m2:heHE.TonEkTheouTheonLogon.notmetered
ltx/en_us_oca/me.m06.d01:meMA.Ode9C11.mode	@ltx/en_us_oca/miscellanea:misc.Mode2
ltx/en_us_oca/me.m06.d01:meMA.Ode9C11.ode	@ltx/en_us_oca/miscellanea:misc.Ode9
ltx/en_us_oca/me.m06.d01:meMA.Ode9C11.text	
ltx/en_us_oca/me.m06.d01:meMA.Ode9C12.incipit	…
ltx/en_us_oca/me.m06.d01:meMA.Ode9C12.melody	@ltx/en_us_oca/he.h.m2:heHE.TonEkTheouTheonLogon.notmetered
ltx/en_us_oca/me.m06.d01:meMA.Ode9C12.mode	@ltx/en_us_oca/miscellanea:misc.Mode2
ltx/en_us_oca/me.m06.d01:meMA.Ode9C12.ode	@ltx/en_us_oca/miscellanea:misc.Ode9
ltx/en_us_oca/me.m06.d01:meMA.Ode9C12.text	
ltx/en_us_oca/me.m06.d01:meMA.Ode9C13.incipit	…
ltx/en_us_oca/me.m06.d01:meMA.Ode9C13.melody	@ltx/en_us_oca/he.h.m2:heHE.TonEkTheouTheonLogon.notmetered
ltx/en_us_oca/me.m06.d01:meMA.Ode9C13.mode	@ltx/en_us_oca/miscellanea:misc.Mode2
ltx/en_us_oca/me.m06.d01:meMA.Ode9C13.ode	@ltx/en_us_oca/miscellanea:misc.Ode9
ltx/en_us_oca/me.m06.d01:meMA.Ode9C13.text	
ltx/en_us_oca/me.m06.d01:meMA.Ode9C1T.incipit	…
ltx/en_us_oca/me.m06.d01:meMA.Ode9C1T.melody	@ltx/en_us_oca/he.h.m2:heHE.TonEkTheouTheonLogon.notmetered
ltx/en_us_oca/me.m06.d01:meMA.Ode9C1T.mode	@ltx/en_us_oca/miscellanea:misc.Mode2
ltx/en_us_oca/me.m06.d01:meMA.Ode9C1T.ode	@ltx/en_us_oca/miscellanea:misc.Ode9
ltx/en_us_oca/me.m06.d01:meMA.Ode9C1T.text	
ltx/en_us_oca/me.m06.d01:meMA.Ode9H.greekmelody	@ltx/en_us_oca/he.h.m2:heHE.TonEkTheouTheonLogon.greekname
ltx/en_us_oca/me.m06.d01:meMA.Ode9H.incipit	@ltx/en_us_oca/he.h.m2:heHE.TonEkTheouTheonLogon.incipit
ltx/en_us_oca/me.m06.d01:meMA.Ode9H.melody	@ltx/en_us_oca/he.h.m2:heHE.TonEkTheouTheonLogon.melody
ltx/en_us_oca/me.m06.d01:meMA.Ode9H.mode	@ltx/en_us_oca/miscellanea:misc.Mode2
ltx/en_us_oca/me.m06.d01:meMA.Ode9H.ode	@ltx/en_us_oca/miscellanea:misc.Ode9
ltx/en_us_oca/me.m06.d01:meMA.Ode9H.text	@ltx/en_us_oca/he.h.m2:heHE.TonEkTheouTheonLogon.text
ltx/en_us_oca/me.m06.d01:meVE.Apolytikion1ger.greekmelody	@ltx/en_us_oca/he.a.m4:heAU.OYpsotheisEnToStavro.greekname
ltx/en_us_oca/me.m06.d01:meVE.Apolytikion1ger.incipit	…
ltx/en_us_oca/me.m06.d01:meVE.Apolytikion1ger.melody	@ltx/en_us_oca/he.a.m4:heAU.OYpsotheisEnToStavro.notmetered
ltx/en_us_oca/me.m06.d01:meVE.Apolytikion1ger.mode	@ltx/en_us_oca/miscellanea:misc.Mode4
ltx/en_us_oca/me.m06.d01:meVE.Apolytikion1ger.poet	@ltx/en_us_oca/poets:po.Gerasimou
ltx/en_us_oca/me.m06.d01:meVE.Apolytikion1ger.text	
ltx/en_us_oca/me.m06.d01:meVE.SticStavrotheotokion.greekmelody	@ltx/en_us_oca/he.a.m2:heAU.OteEkTouXylou.greekname
ltx/en_us_oca/me.m06.d01:meVE.SticStavrotheotokion.incipit	…
ltx/en_us_oca/me.m06.d01:meVE.SticStavrotheotokion.melody	@ltx/en_us_oca/he.a.m2:heAU.OteEkTouXylou.notmetered
ltx/en_us_oca/me.m06.d01:meVE.SticStavrotheotokion.mode	@ltx/en_us_oca/miscellanea:misc.Mode2
ltx/en_us_oca/me.m06.d01:meVE.SticStavrotheotokion.text	
ltx/en_us_oca/me.m06.d01:meVE.SticTheotokion.greekmelody	@ltx/en_us_oca/he.a.m2:heAU.OteEkTouXylou.greekname
ltx/en_us_oca/me.m06.d01:meVE.SticTheotokion.incipit	@ltx/en_us_oca/me.m02.d13:meVE.SticTheotokion2.incipit
ltx/en_us_oca/me.m06.d01:meVE.SticTheotokion.melody	@ltx/en_us_oca/he.a.m2:heAU.OteEkTouXylou.notmetered
ltx/en_us_oca/me.m06.d01:meVE.SticTheotokion.mode	@ltx/en_us_oca/miscellanea:misc.Mode2
ltx/en_us_oca/me.m06.d01:meVE.SticTheotokion.text	@ltx/en_us_oca/me.m02.d13:meVE.SticTheotokion2.text
ltx/en_us_oca/me.m06.d01:meVE.Stichera01.greekmelody	@ltx/en_us_oca/he.a.m2:heAU.OteEkTouXylou.greekname
ltx/en_us_oca/me.m06.d01:meVE.Stichera01.incipit	When the icy cold of…
ltx/en_us_oca/me.m06.d01:meVE.Stichera01.melody	@ltx/en_us_oca/he.a.m2:heAU.OteEkTouXylou.notmetered
ltx/en_us_oca/me.m06.d01:meVE.Stichera01.mode	@ltx/en_us_oca/miscellanea:misc.Mode2
ltx/en_us_oca/me.m06.d01:meVE.Stichera01.text	When the icy cold of ignorance ruled over all creation, ⁄ and by the assaults of the enemy the many idols were served ⁄ then the glorious martyrs with eager hearts ⁄ in the fervor of divine faith poured out their blood with love for Him ⁄⁄ Who gloriously poured out His Own blood on the Cross!
ltx/en_us_oca/me.m06.d01:meVE.Stichera02.incipit	Justin, the noble champion ⁄…
ltx/en_us_oca/me.m06.d01:meVE.Stichera02.melody	@ltx/en_us_oca/he.a.m2:heAU.OteEkTouXylou.notmetered
ltx/en_us_oca/me.m06.d01:meVE.Stichera02.mode	@ltx/en_us_oca/miscellanea:misc.Mode2
ltx/en_us_oca/me.m06.d01:meVE.Stichera02.text	Justin, the noble champion ⁄ with his glorious companions, ⁄ following the example of his divine Master ⁄ put on his priestly garment stained with blood. ⁄ Now together with the angels they stand in heaven ⁄⁄ interceding before Christ the King of all.
ltx/en_us_oca/me.m06.d01:meVE.Stichera03.incipit	When by the assent of…
ltx/en_us_oca/me.m06.d01:meVE.Stichera03.melody	@ltx/en_us_oca/he.a.m2:heAU.OteEkTouXylou.notmetered
ltx/en_us_oca/me.m06.d01:meVE.Stichera03.mode	@ltx/en_us_oca/miscellanea:misc.Mode2
ltx/en_us_oca/me.m06.d01:meVE.Stichera03.text	When by the assent of God you went forth to struggles beyond nature, ⁄ as you denied the perishing body, ⁄ you were strengthened with the might of the all-powerful One: ⁄ You were not frightened by the fire or cutting sword! ⁄⁄ You bent your necks to God and accepted a blessed end in joy!
