ltx/en_us_oca/tr.d064:trCO.header	
ltx/en_us_oca/tr.d064:trDA.commemoration.full	
ltx/en_us_oca/tr.d064:trDA.commemoration.short	
ltx/en_us_oca/tr.d064:trDA.dismissal	@ltx/en_us_oca/dismissals:dis00.palm
ltx/en_us_oca/tr.d064:trDA.insert1	
ltx/en_us_oca/tr.d064:trDA.insert2	
ltx/en_us_oca/tr.d064:trDA.note	@ltx/en_us_oca/rubrical:ru.RelaxedFish
ltx/en_us_oca/tr.d064:trDA.title	
ltx/en_us_oca/tr.d064:trHO.commemorations	
ltx/en_us_oca/tr.d064:trHO.daytitle	
ltx/en_us_oca/tr.d064:trHO.description1	
ltx/en_us_oca/tr.d064:trHO.description2	
ltx/en_us_oca/tr.d064:trHO.note1	
ltx/en_us_oca/tr.d064:trHO.note2	
ltx/en_us_oca/tr.d064:trLI.AfterCommunion.incipit	@ltx/en_us_oca/tr.d064:trVE.Apolytikion1.incipit
ltx/en_us_oca/tr.d064:trLI.AfterCommunion.mode	@ltx/en_us_oca/miscellanea:misc.Mode1
ltx/en_us_oca/tr.d064:trLI.AfterCommunion.text	@ltx/en_us_oca/tr.d064:trVE.Apolytikion1.text
ltx/en_us_oca/tr.d064:trLI.Kontakion1.incipit	@ltx/en_us_oca/tr.d064:trMA.Kontakion1.incipit
ltx/en_us_oca/tr.d064:trLI.Kontakion1.melody	@ltx/en_us_oca/tr.d064:trMA.Kontakion1.melody
ltx/en_us_oca/tr.d064:trLI.Kontakion1.mode	@ltx/en_us_oca/tr.d064:trMA.Kontakion1.mode
ltx/en_us_oca/tr.d064:trLI.Kontakion1.text	@ltx/en_us_oca/tr.d064:trMA.Kontakion1.text
ltx/en_us_oca/tr.d064:trLI.MM.Antiphon2.text	@ltx/en_us_oca/properties:media.key
ltx/en_us_oca/tr.d064:trLI.MM.CommunionHymn.text	@ltx/en_us_oca/properties:media.key
ltx/en_us_oca/tr.d064:trLI.MM.EntranceHymn.text	@ltx/en_us_oca/properties:media.key
ltx/en_us_oca/tr.d064:trLI.Megalynarion.text	
ltx/en_us_oca/tr.d064:trLI.TheotokosHymn.incipit	@ltx/en_us_oca/tr.d064:trMA.Ode9C1H.incipit
ltx/en_us_oca/tr.d064:trLI.TheotokosHymn.mode	@ltx/en_us_oca/miscellanea:misc.Mode4
ltx/en_us_oca/tr.d064:trLI.TheotokosHymn.text	@ltx/en_us_oca/tr.d064:trMA.Ode9C1H.text
ltx/en_us_oca/tr.d064:trMA.C1.acrostic.notice1	
ltx/en_us_oca/tr.d064:trMA.C1.acrostic.text	
ltx/en_us_oca/tr.d064:trMA.C1.acrostic.title	The Canon.
ltx/en_us_oca/tr.d064:trMA.C1.poet	@ltx/en_us_oca/poets:po.KosmaMonachou
ltx/en_us_oca/tr.d064:trMA.C1.title	@ltx/en_us_oca/titles:ti.CanonFeast
ltx/en_us_oca/tr.d064:trMA.C1.verse	@ltx/en_us_oca/prayers:pr.verse_God.text
ltx/en_us_oca/tr.d064:trMA.Exaposteilarion1.melody	
ltx/en_us_oca/tr.d064:trMA.Exaposteilarion1.mode	@ltx/en_us_oca/miscellanea:misc.Mode2
ltx/en_us_oca/tr.d064:trMA.Exaposteilarion1.text	@ltx/en_us_oca/properties:media.key
ltx/en_us_oca/tr.d064:trMA.Hypakoe.incipit	…
ltx/en_us_oca/tr.d064:trMA.Hypakoe.melody	
ltx/en_us_oca/tr.d064:trMA.Hypakoe.mode	@ltx/en_us_oca/miscellanea:misc.Mode6
ltx/en_us_oca/tr.d064:trMA.Hypakoe.text	
ltx/en_us_oca/tr.d064:trMA.Kathisma11.greekmelody	@ltx/en_us_oca/he.a.m4:heAU.KateplagiIosif.greekname
ltx/en_us_oca/tr.d064:trMA.Kathisma11.incipit	…
ltx/en_us_oca/tr.d064:trMA.Kathisma11.melody	@ltx/en_us_oca/he.a.m4:heAU.KateplagiIosif.notmetered
ltx/en_us_oca/tr.d064:trMA.Kathisma11.mode	@ltx/en_us_oca/miscellanea:misc.Mode4
ltx/en_us_oca/tr.d064:trMA.Kathisma11.text	
ltx/en_us_oca/tr.d064:trMA.Kathisma12.greekmelody	@ltx/en_us_oca/he.a.m4:heAU.EpefanisSimeron.greekname
ltx/en_us_oca/tr.d064:trMA.Kathisma12.incipit	…
ltx/en_us_oca/tr.d064:trMA.Kathisma12.melody	@ltx/en_us_oca/he.a.m4:heAU.EpefanisSimeron.notmetered
ltx/en_us_oca/tr.d064:trMA.Kathisma12.mode	@ltx/en_us_oca/miscellanea:misc.Mode4
ltx/en_us_oca/tr.d064:trMA.Kathisma12.text	
ltx/en_us_oca/tr.d064:trMA.Kathisma21.greekmelody	@ltx/en_us_oca/he.a.m4:heAU.KateplagiIosif.greekname
ltx/en_us_oca/tr.d064:trMA.Kathisma21.incipit	…
ltx/en_us_oca/tr.d064:trMA.Kathisma21.melody	@ltx/en_us_oca/he.a.m4:heAU.KateplagiIosif.notmetered
ltx/en_us_oca/tr.d064:trMA.Kathisma21.mode	@ltx/en_us_oca/miscellanea:misc.Mode4
ltx/en_us_oca/tr.d064:trMA.Kathisma21.text	
ltx/en_us_oca/tr.d064:trMA.Kathisma22.greekmelody	@ltx/en_us_oca/he.a.m1:heAU.TouLithouSfragisthentos.greekname
ltx/en_us_oca/tr.d064:trMA.Kathisma22.incipit	…
ltx/en_us_oca/tr.d064:trMA.Kathisma22.melody	@ltx/en_us_oca/he.a.m1:heAU.TouLithouSfragisthentos.notmetered
ltx/en_us_oca/tr.d064:trMA.Kathisma22.mode	@ltx/en_us_oca/miscellanea:misc.Mode1
ltx/en_us_oca/tr.d064:trMA.Kathisma22.text	
ltx/en_us_oca/tr.d064:trMA.Kathisma31.greekmelody	@ltx/en_us_oca/he.a.m8:heAU.ToProstachthen.greekname
ltx/en_us_oca/tr.d064:trMA.Kathisma31.incipit	…
ltx/en_us_oca/tr.d064:trMA.Kathisma31.melody	@ltx/en_us_oca/he.a.m8:heAU.ToProstachthen.notmetered
ltx/en_us_oca/tr.d064:trMA.Kathisma31.mode	@ltx/en_us_oca/miscellanea:misc.Mode8
ltx/en_us_oca/tr.d064:trMA.Kathisma31.text	
ltx/en_us_oca/tr.d064:trMA.Kontakion1.incipit	…
ltx/en_us_oca/tr.d064:trMA.Kontakion1.melody	@ltx/en_us_oca/miscellanea:misc.Automelon
ltx/en_us_oca/tr.d064:trMA.Kontakion1.mode	@ltx/en_us_oca/miscellanea:misc.Mode6
ltx/en_us_oca/tr.d064:trMA.Kontakion1.text	
ltx/en_us_oca/tr.d064:trMA.Lauds1.incipit	…
ltx/en_us_oca/tr.d064:trMA.Lauds1.melody	@ltx/en_us_oca/miscellanea:misc.Idiomelon
ltx/en_us_oca/tr.d064:trMA.Lauds1.mode	@ltx/en_us_oca/miscellanea:misc.Mode4
ltx/en_us_oca/tr.d064:trMA.Lauds1.text	
ltx/en_us_oca/tr.d064:trMA.Lauds2.incipit	…
ltx/en_us_oca/tr.d064:trMA.Lauds2.melody	@ltx/en_us_oca/miscellanea:misc.Idiomelon
ltx/en_us_oca/tr.d064:trMA.Lauds2.mode	@ltx/en_us_oca/miscellanea:misc.Mode4
ltx/en_us_oca/tr.d064:trMA.Lauds2.text	
ltx/en_us_oca/tr.d064:trMA.Lauds3.incipit	…
ltx/en_us_oca/tr.d064:trMA.Lauds3.melody	@ltx/en_us_oca/miscellanea:misc.Idiomelon
ltx/en_us_oca/tr.d064:trMA.Lauds3.mode	@ltx/en_us_oca/miscellanea:misc.Mode4
ltx/en_us_oca/tr.d064:trMA.Lauds3.text	
ltx/en_us_oca/tr.d064:trMA.Lauds4.incipit	…
ltx/en_us_oca/tr.d064:trMA.Lauds4.melody	@ltx/en_us_oca/miscellanea:misc.Idiomelon
ltx/en_us_oca/tr.d064:trMA.Lauds4.mode	@ltx/en_us_oca/miscellanea:misc.Mode4
ltx/en_us_oca/tr.d064:trMA.Lauds4.text	
ltx/en_us_oca/tr.d064:trMA.LaudsGlory.incipit	@ltx/en_us_oca/tr.d064:trVE.Stichera05.incipit
ltx/en_us_oca/tr.d064:trMA.LaudsGlory.melody	@ltx/en_us_oca/miscellanea:misc.Idiomelon
ltx/en_us_oca/tr.d064:trMA.LaudsGlory.mode	@ltx/en_us_oca/miscellanea:misc.Mode6
ltx/en_us_oca/tr.d064:trMA.LaudsGlory.text	@ltx/en_us_oca/tr.d064:trVE.Stichera05.text
ltx/en_us_oca/tr.d064:trMA.Ode1C11.greekmelody	@ltx/en_us_oca/he.h.m4:heHE.OfthisanAiPigai.greekname
ltx/en_us_oca/tr.d064:trMA.Ode1C11.incipit	Out of the mouths…
ltx/en_us_oca/tr.d064:trMA.Ode1C11.melody	@ltx/en_us_oca/he.h.m4:heHE.OfthisanAiPigai.notmetered
ltx/en_us_oca/tr.d064:trMA.Ode1C11.mode	@ltx/en_us_oca/miscellanea:misc.Mode4
ltx/en_us_oca/tr.d064:trMA.Ode1C11.ode	@ltx/en_us_oca/miscellanea:misc.Ode1
ltx/en_us_oca/tr.d064:trMA.Ode1C11.text	Out of the mouths of the spotless babes and infants, ⁄ You have brought forth perfect praise. ⁄ By Your Cross and Passion destroy the enemy. ⁄ Avenge the fall of old Adam. ⁄ By the tree raise him up to his first splendor, ⁄ That he may sing You a song of victory!
ltx/en_us_oca/tr.d064:trMA.Ode1C12.incipit	…
ltx/en_us_oca/tr.d064:trMA.Ode1C12.melody	@ltx/en_us_oca/he.h.m4:heHE.OfthisanAiPigai.notmetered
ltx/en_us_oca/tr.d064:trMA.Ode1C12.mode	@ltx/en_us_oca/miscellanea:misc.Mode4
ltx/en_us_oca/tr.d064:trMA.Ode1C12.ode	@ltx/en_us_oca/miscellanea:misc.Ode1
ltx/en_us_oca/tr.d064:trMA.Ode1C12.text	The holy Church offers her praise to You, O Christ, ⁄ Who dwell in Zion. ⁄ Israel rejoices in You, her Creator. ⁄ The mountains, like the stony hearts of the Gentiles, ⁄ Exult before You, singing You a song of victory.
ltx/en_us_oca/tr.d064:trMA.Ode1C1H.greekmelody	@ltx/en_us_oca/he.h.m4:heHE.OfthisanAiPigai.greekname
ltx/en_us_oca/tr.d064:trMA.Ode1C1H.incipit	@ltx/en_us_oca/he.h.m4:heHE.OfthisanAiPigai.incipit
ltx/en_us_oca/tr.d064:trMA.Ode1C1H.melody	@ltx/en_us_oca/he.h.m4:heHE.OfthisanAiPigai.melody
ltx/en_us_oca/tr.d064:trMA.Ode1C1H.mode	@ltx/en_us_oca/miscellanea:misc.Mode4
ltx/en_us_oca/tr.d064:trMA.Ode1C1H.ode	@ltx/en_us_oca/miscellanea:misc.Ode1
ltx/en_us_oca/tr.d064:trMA.Ode1C1H.text	@ltx/en_us_oca/he.h.m4:heHE.OfthisanAiPigai.text
ltx/en_us_oca/tr.d064:trMA.Ode3C11.greekmelody	@ltx/en_us_oca/he.h.m4:heHE.NaousanAkrotomon.greekname
ltx/en_us_oca/tr.d064:trMA.Ode3C11.incipit	Lazarus had been dead…
ltx/en_us_oca/tr.d064:trMA.Ode3C11.melody	@ltx/en_us_oca/he.h.m4:heHE.NaousanAkrotomon.notmetered
ltx/en_us_oca/tr.d064:trMA.Ode3C11.mode	@ltx/en_us_oca/miscellanea:misc.Mode4
ltx/en_us_oca/tr.d064:trMA.Ode3C11.ode	@ltx/en_us_oca/miscellanea:misc.Ode3
ltx/en_us_oca/tr.d064:trMA.Ode3C11.text	Lazarus had been dead four days, ⁄ but hell trembled at Your command, and released him, ⁄ For You, O Christ, are the Resurrection and the Life. ⁄ Upon You the Church is established, crying out: ⁄ Hosanna! Blessed is He that comes in the Name of the Lord!
ltx/en_us_oca/tr.d064:trMA.Ode3C12.incipit	…
ltx/en_us_oca/tr.d064:trMA.Ode3C12.melody	@ltx/en_us_oca/he.h.m4:heHE.NaousanAkrotomon.notmetered
ltx/en_us_oca/tr.d064:trMA.Ode3C12.mode	@ltx/en_us_oca/miscellanea:misc.Mode4
ltx/en_us_oca/tr.d064:trMA.Ode3C12.ode	@ltx/en_us_oca/miscellanea:misc.Ode3
ltx/en_us_oca/tr.d064:trMA.Ode3C12.text	Come, O faithful, sing to God worthy hymns in Zion! ⁄ The Messiah has come to Jerusalem in glory and dominion. ⁄ Upon Him the Church is established, crying out: ⁄ Hosanna! Blessed is He that comes in the Name of the Lord!
ltx/en_us_oca/tr.d064:trMA.Ode3C1H.greekmelody	@ltx/en_us_oca/he.h.m4:heHE.NaousanAkrotomon.greekname
ltx/en_us_oca/tr.d064:trMA.Ode3C1H.incipit	@ltx/en_us_oca/he.h.m4:heHE.NaousanAkrotomon.incipit
ltx/en_us_oca/tr.d064:trMA.Ode3C1H.melody	@ltx/en_us_oca/he.h.m4:heHE.NaousanAkrotomon.melody
ltx/en_us_oca/tr.d064:trMA.Ode3C1H.mode	@ltx/en_us_oca/miscellanea:misc.Mode4
ltx/en_us_oca/tr.d064:trMA.Ode3C1H.ode	@ltx/en_us_oca/miscellanea:misc.Ode3
ltx/en_us_oca/tr.d064:trMA.Ode3C1H.text	@ltx/en_us_oca/he.h.m4:heHE.NaousanAkrotomon.text
ltx/en_us_oca/tr.d064:trMA.Ode4C11.greekmelody	@ltx/en_us_oca/he.h.m4:heHE.ChristosOErchomenos.greekname
ltx/en_us_oca/tr.d064:trMA.Ode4C11.incipit	Break forth in mighty gladness…
ltx/en_us_oca/tr.d064:trMA.Ode4C11.melody	@ltx/en_us_oca/he.h.m4:heHE.ChristosOErchomenos.notmetered
ltx/en_us_oca/tr.d064:trMA.Ode4C11.mode	@ltx/en_us_oca/miscellanea:misc.Mode4
ltx/en_us_oca/tr.d064:trMA.Ode4C11.ode	@ltx/en_us_oca/miscellanea:misc.Ode4
ltx/en_us_oca/tr.d064:trMA.Ode4C11.text	Break forth in mighty gladness, O mountains and all-hills! ⁄ Let the trees of the forest clap their hands for joy! ⁄ Praise Christ, all you nations! ⁄ Glorify Him, all you peoples, crying: ⁄ Glory, O Lord, to Your power!
ltx/en_us_oca/tr.d064:trMA.Ode4C12.incipit	…
ltx/en_us_oca/tr.d064:trMA.Ode4C12.melody	@ltx/en_us_oca/he.h.m4:heHE.ChristosOErchomenos.notmetered
ltx/en_us_oca/tr.d064:trMA.Ode4C12.mode	@ltx/en_us_oca/miscellanea:misc.Mode4
ltx/en_us_oca/tr.d064:trMA.Ode4C12.ode	@ltx/en_us_oca/miscellanea:misc.Ode4
ltx/en_us_oca/tr.d064:trMA.Ode4C12.text	The King of glory has come. ⁄ The Lord of the ages has entered. ⁄ The hour of His majesty is upon us. ⁄ His beauty in Zion is beyond compare. ⁄ Come, O faithful, let us fall down before Him, crying: ⁄ Glory, O Lord, to Your power!
ltx/en_us_oca/tr.d064:trMA.Ode4C13.incipit	…
ltx/en_us_oca/tr.d064:trMA.Ode4C13.melody	@ltx/en_us_oca/he.h.m4:heHE.ChristosOErchomenos.notmetered
ltx/en_us_oca/tr.d064:trMA.Ode4C13.mode	@ltx/en_us_oca/miscellanea:misc.Mode4
ltx/en_us_oca/tr.d064:trMA.Ode4C13.ode	@ltx/en_us_oca/miscellanea:misc.Ode4
ltx/en_us_oca/tr.d064:trMA.Ode4C13.text	The Lord comes! He holds the earth in His grasp. ⁄ He measures the heavens with the span of His hand. ⁄ He has chosen Zion; ⁄ In her He is well pleased to dwell, ⁄ Ruling the hearts of all who cry in faith: ⁄ Glory, O Lord, to Your power!
ltx/en_us_oca/tr.d064:trMA.Ode4C1H.greekmelody	@ltx/en_us_oca/he.h.m4:heHE.ChristosOErchomenos.greekname
ltx/en_us_oca/tr.d064:trMA.Ode4C1H.incipit	@ltx/en_us_oca/he.h.m4:heHE.ChristosOErchomenos.incipit
ltx/en_us_oca/tr.d064:trMA.Ode4C1H.melody	@ltx/en_us_oca/he.h.m4:heHE.ChristosOErchomenos.melody
ltx/en_us_oca/tr.d064:trMA.Ode4C1H.mode	@ltx/en_us_oca/miscellanea:misc.Mode4
ltx/en_us_oca/tr.d064:trMA.Ode4C1H.ode	@ltx/en_us_oca/miscellanea:misc.Ode4
ltx/en_us_oca/tr.d064:trMA.Ode4C1H.text	@ltx/en_us_oca/he.h.m4:heHE.ChristosOErchomenos.text
ltx/en_us_oca/tr.d064:trMA.Ode5C11.greekmelody	@ltx/en_us_oca/he.h.m4:heHE.TinSionEpOrous.greekname
ltx/en_us_oca/tr.d064:trMA.Ode5C11.incipit	God Almighty…
ltx/en_us_oca/tr.d064:trMA.Ode5C11.melody	@ltx/en_us_oca/he.h.m4:heHE.TinSionEpOrous.notmetered
ltx/en_us_oca/tr.d064:trMA.Ode5C11.mode	@ltx/en_us_oca/miscellanea:misc.Mode4
ltx/en_us_oca/tr.d064:trMA.Ode5C11.ode	@ltx/en_us_oca/miscellanea:misc.Ode5
ltx/en_us_oca/tr.d064:trMA.Ode5C11.text	God Almighty, enthroned upon the cherubim, ⁄ Has given heed to the lowly. ⁄ He has come in great glory and power. ⁄ The whole earth is filled with His praise. ⁄ Peace be to Israel and salvation to the gentiles!
ltx/en_us_oca/tr.d064:trMA.Ode5C12.incipit	…
ltx/en_us_oca/tr.d064:trMA.Ode5C12.melody	@ltx/en_us_oca/he.h.m4:heHE.TinSionEpOrous.notmetered
ltx/en_us_oca/tr.d064:trMA.Ode5C12.mode	@ltx/en_us_oca/miscellanea:misc.Mode4
ltx/en_us_oca/tr.d064:trMA.Ode5C12.ode	@ltx/en_us_oca/miscellanea:misc.Ode5
ltx/en_us_oca/tr.d064:trMA.Ode5C12.text	Jerusalem and holy Zion, mountain of God, ⁄ Lift your eyes round about and see! ⁄ Your children gather from afar. ⁄ They worship Him who reigns in you: ⁄ Peace be to Israel and salvation to the gentiles!
ltx/en_us_oca/tr.d064:trMA.Ode5C1H.greekmelody	@ltx/en_us_oca/he.h.m4:heHE.TinSionEpOrous.greekname
ltx/en_us_oca/tr.d064:trMA.Ode5C1H.incipit	@ltx/en_us_oca/he.h.m4:heHE.TinSionEpOrous.incipit
ltx/en_us_oca/tr.d064:trMA.Ode5C1H.melody	@ltx/en_us_oca/he.h.m4:heHE.TinSionEpOrous.melody
ltx/en_us_oca/tr.d064:trMA.Ode5C1H.mode	@ltx/en_us_oca/miscellanea:misc.Mode4
ltx/en_us_oca/tr.d064:trMA.Ode5C1H.ode	@ltx/en_us_oca/miscellanea:misc.Ode5
ltx/en_us_oca/tr.d064:trMA.Ode5C1H.text	@ltx/en_us_oca/he.h.m4:heHE.TinSionEpOrous.text
ltx/en_us_oca/tr.d064:trMA.Ode6C11.greekmelody	@ltx/en_us_oca/he.h.m4:heHE.EvoisanEnEffrosyni.greekname
ltx/en_us_oca/tr.d064:trMA.Ode6C11.incipit	Israel, receive God’s Kingdom…
ltx/en_us_oca/tr.d064:trMA.Ode6C11.melody	@ltx/en_us_oca/he.h.m4:heHE.EvoisanEnEffrosyni.notmetered
ltx/en_us_oca/tr.d064:trMA.Ode6C11.mode	@ltx/en_us_oca/miscellanea:misc.Mode4
ltx/en_us_oca/tr.d064:trMA.Ode6C11.ode	@ltx/en_us_oca/miscellanea:misc.Ode6
ltx/en_us_oca/tr.d064:trMA.Ode6C11.text	Israel, receive God’s Kingdom! ⁄ Behold, a great light is rising on those who dwell in the shadow of death. ⁄ Let the peoples be renewed through sprinkling with blood divine!
ltx/en_us_oca/tr.d064:trMA.Ode6C12.incipit	…
ltx/en_us_oca/tr.d064:trMA.Ode6C12.melody	@ltx/en_us_oca/he.h.m4:heHE.EvoisanEnEffrosyni.notmetered
ltx/en_us_oca/tr.d064:trMA.Ode6C12.mode	@ltx/en_us_oca/miscellanea:misc.Mode4
ltx/en_us_oca/tr.d064:trMA.Ode6C12.ode	@ltx/en_us_oca/miscellanea:misc.Ode6
ltx/en_us_oca/tr.d064:trMA.Ode6C12.text	Release your ransomed prisoners, O Zion! ⁄ Lead them up from the waterless pit of ignorance! ⁄ Let the peoples be renewed through sprinkling with blood divine!
ltx/en_us_oca/tr.d064:trMA.Ode6C1H.greekmelody	@ltx/en_us_oca/he.h.m4:heHE.EvoisanEnEffrosyni.greekname
ltx/en_us_oca/tr.d064:trMA.Ode6C1H.incipit	@ltx/en_us_oca/he.h.m4:heHE.EvoisanEnEffrosyni.incipit
ltx/en_us_oca/tr.d064:trMA.Ode6C1H.melody	@ltx/en_us_oca/he.h.m4:heHE.EvoisanEnEffrosyni.melody
ltx/en_us_oca/tr.d064:trMA.Ode6C1H.mode	@ltx/en_us_oca/miscellanea:misc.Mode4
ltx/en_us_oca/tr.d064:trMA.Ode6C1H.ode	@ltx/en_us_oca/miscellanea:misc.Ode6
ltx/en_us_oca/tr.d064:trMA.Ode6C1H.text	@ltx/en_us_oca/he.h.m4:heHE.EvoisanEnEffrosyni.text
ltx/en_us_oca/tr.d064:trMA.Ode7C11.greekmelody	@ltx/en_us_oca/he.h.m4:heHE.ODiasosasEnPyri.greekname
ltx/en_us_oca/tr.d064:trMA.Ode7C11.incipit	The people knelt…
ltx/en_us_oca/tr.d064:trMA.Ode7C11.melody	@ltx/en_us_oca/he.h.m4:heHE.ODiasosasEnPyri.notmetered
ltx/en_us_oca/tr.d064:trMA.Ode7C11.mode	@ltx/en_us_oca/miscellanea:misc.Mode4
ltx/en_us_oca/tr.d064:trMA.Ode7C11.ode	@ltx/en_us_oca/miscellanea:misc.Ode7
ltx/en_us_oca/tr.d064:trMA.Ode7C11.text	The people knelt before You with palms in their hands. ⁄ They rejoiced with the disciples, ⁄ rying: Hosanna to the Son of David! ⁄ Blessed are You, most praised Lord, ⁄ The God of our fathers!
ltx/en_us_oca/tr.d064:trMA.Ode7C12.incipit	The innocent children…
ltx/en_us_oca/tr.d064:trMA.Ode7C12.melody	@ltx/en_us_oca/he.h.m4:heHE.ODiasosasEnPyri.notmetered
ltx/en_us_oca/tr.d064:trMA.Ode7C12.mode	@ltx/en_us_oca/miscellanea:misc.Mode4
ltx/en_us_oca/tr.d064:trMA.Ode7C12.ode	@ltx/en_us_oca/miscellanea:misc.Ode7
ltx/en_us_oca/tr.d064:trMA.Ode7C12.text	The innocent children sang a hymn worthy for You, ⁄ King of Israel and King of angels. ⁄ Blessed are You, Most praised Lord, ⁄ The God of our fathers!
ltx/en_us_oca/tr.d064:trMA.Ode7C13.incipit	Bearing palms and branches…
ltx/en_us_oca/tr.d064:trMA.Ode7C13.melody	@ltx/en_us_oca/he.h.m4:heHE.ODiasosasEnPyri.notmetered
ltx/en_us_oca/tr.d064:trMA.Ode7C13.mode	@ltx/en_us_oca/miscellanea:misc.Mode4
ltx/en_us_oca/tr.d064:trMA.Ode7C13.ode	@ltx/en_us_oca/miscellanea:misc.Ode7
ltx/en_us_oca/tr.d064:trMA.Ode7C13.text	Bearing palms and branches, ⁄ The crowd hailed You, Son of David, crying out: ⁄ Blessed is the King of the new age to come! ⁄ Blessed are You, most praised Lord, ⁄ The God of our fathers!
ltx/en_us_oca/tr.d064:trMA.Ode7C1H.greekmelody	@ltx/en_us_oca/he.h.m4:heHE.ODiasosasEnPyri.greekname
ltx/en_us_oca/tr.d064:trMA.Ode7C1H.incipit	@ltx/en_us_oca/he.h.m4:heHE.ODiasosasEnPyri.incipit
ltx/en_us_oca/tr.d064:trMA.Ode7C1H.melody	@ltx/en_us_oca/he.h.m4:heHE.ODiasosasEnPyri.melody
ltx/en_us_oca/tr.d064:trMA.Ode7C1H.mode	@ltx/en_us_oca/miscellanea:misc.Mode4
ltx/en_us_oca/tr.d064:trMA.Ode7C1H.ode	@ltx/en_us_oca/miscellanea:misc.Ode7
ltx/en_us_oca/tr.d064:trMA.Ode7C1H.text	@ltx/en_us_oca/he.h.m4:heHE.ODiasosasEnPyri.text
ltx/en_us_oca/tr.d064:trMA.Ode8C11.greekmelody	@ltx/en_us_oca/he.h.m4:heHE.EffranthitiIerousalim.greekname
ltx/en_us_oca/tr.d064:trMA.Ode8C11.incipit	Christ your King…
ltx/en_us_oca/tr.d064:trMA.Ode8C11.melody	@ltx/en_us_oca/he.h.m4:heHE.EffranthitiIerousalim.notmetered
ltx/en_us_oca/tr.d064:trMA.Ode8C11.mode	@ltx/en_us_oca/miscellanea:misc.Mode4
ltx/en_us_oca/tr.d064:trMA.Ode8C11.ode	@ltx/en_us_oca/miscellanea:misc.Ode8
ltx/en_us_oca/tr.d064:trMA.Ode8C11.text	Christ your King is here, O Zion. ⁄ He has come to destroy the senselessness of idolatry, ⁄ And to restrain the untamed willfullness of the gentiles, ⁄ Teaching them to sing: ⁄ Bless the Lord, all you works of the Lord!
ltx/en_us_oca/tr.d064:trMA.Ode8C12.incipit	…
ltx/en_us_oca/tr.d064:trMA.Ode8C12.melody	@ltx/en_us_oca/he.h.m4:heHE.EffranthitiIerousalim.notmetered
ltx/en_us_oca/tr.d064:trMA.Ode8C12.mode	@ltx/en_us_oca/miscellanea:misc.Mode4
ltx/en_us_oca/tr.d064:trMA.Ode8C12.ode	@ltx/en_us_oca/miscellanea:misc.Ode8
ltx/en_us_oca/tr.d064:trMA.Ode8C12.text	Rejoice greatly, Zion! ⁄ Your Messiah, your God, will reign forever. ⁄ He is meek; He brings salvation, as it is written. ⁄ Our righteous Deliverer comes riding on a colt, ⁄ Destroying the proud arrogance of those who will not cry: ⁄ Bless the Lord, all you works of the Lord!
ltx/en_us_oca/tr.d064:trMA.Ode8C13.incipit	…
ltx/en_us_oca/tr.d064:trMA.Ode8C13.melody	@ltx/en_us_oca/he.h.m4:heHE.EffranthitiIerousalim.notmetered
ltx/en_us_oca/tr.d064:trMA.Ode8C13.mode	@ltx/en_us_oca/miscellanea:misc.Mode4
ltx/en_us_oca/tr.d064:trMA.Ode8C13.ode	@ltx/en_us_oca/miscellanea:misc.Ode8
ltx/en_us_oca/tr.d064:trMA.Ode8C13.text	The band of lawless extortioners was driven out of the temple. ⁄ They had made God’s house of prayer into a den of thieves. ⁄ They rejected the Redeemer, to whom we cry aloud: ⁄ Bless the Lord, all you works of the Lord!
ltx/en_us_oca/tr.d064:trMA.Ode8C1H.greekmelody	@ltx/en_us_oca/he.h.m4:heHE.EffranthitiIerousalim.greekname
ltx/en_us_oca/tr.d064:trMA.Ode8C1H.incipit	@ltx/en_us_oca/he.h.m4:heHE.EffranthitiIerousalim.incipit
ltx/en_us_oca/tr.d064:trMA.Ode8C1H.melody	@ltx/en_us_oca/he.h.m4:heHE.EffranthitiIerousalim.melody
ltx/en_us_oca/tr.d064:trMA.Ode8C1H.mode	@ltx/en_us_oca/miscellanea:misc.Mode4
ltx/en_us_oca/tr.d064:trMA.Ode8C1H.ode	@ltx/en_us_oca/miscellanea:misc.Ode8
ltx/en_us_oca/tr.d064:trMA.Ode8C1H.text	@ltx/en_us_oca/he.h.m4:heHE.EffranthitiIerousalim.text
ltx/en_us_oca/tr.d064:trMA.Ode9C11.greekmelody	@ltx/en_us_oca/he.h.m4:heHE.TheosKyriosKaiEpefanenImin.greekname
ltx/en_us_oca/tr.d064:trMA.Ode9C11.incipit	…
ltx/en_us_oca/tr.d064:trMA.Ode9C11.melody	@ltx/en_us_oca/he.h.m4:heHE.TheosKyriosKaiEpefanenImin.notmetered
ltx/en_us_oca/tr.d064:trMA.Ode9C11.mode	@ltx/en_us_oca/miscellanea:misc.Mode4
ltx/en_us_oca/tr.d064:trMA.Ode9C11.ode	@ltx/en_us_oca/miscellanea:misc.Ode9
ltx/en_us_oca/tr.d064:trMA.Ode9C11.text	
ltx/en_us_oca/tr.d064:trMA.Ode9C12.incipit	…
ltx/en_us_oca/tr.d064:trMA.Ode9C12.melody	@ltx/en_us_oca/he.h.m4:heHE.TheosKyriosKaiEpefanenImin.notmetered
ltx/en_us_oca/tr.d064:trMA.Ode9C12.mode	@ltx/en_us_oca/miscellanea:misc.Mode4
ltx/en_us_oca/tr.d064:trMA.Ode9C12.ode	@ltx/en_us_oca/miscellanea:misc.Ode9
ltx/en_us_oca/tr.d064:trMA.Ode9C12.text	
ltx/en_us_oca/tr.d064:trMA.Ode9C13.incipit	…
ltx/en_us_oca/tr.d064:trMA.Ode9C13.melody	@ltx/en_us_oca/he.h.m4:heHE.TheosKyriosKaiEpefanenImin.notmetered
ltx/en_us_oca/tr.d064:trMA.Ode9C13.mode	@ltx/en_us_oca/miscellanea:misc.Mode4
ltx/en_us_oca/tr.d064:trMA.Ode9C13.ode	@ltx/en_us_oca/miscellanea:misc.Ode9
ltx/en_us_oca/tr.d064:trMA.Ode9C13.text	
ltx/en_us_oca/tr.d064:trMA.Ode9C1H.greekmelody	@ltx/en_us_oca/he.h.m4:heHE.TheosKyriosKaiEpefanenImin.greekname
ltx/en_us_oca/tr.d064:trMA.Ode9C1H.incipit	@ltx/en_us_oca/he.h.m4:heHE.TheosKyriosKaiEpefanenImin.incipit
ltx/en_us_oca/tr.d064:trMA.Ode9C1H.melody	@ltx/en_us_oca/he.h.m4:heHE.TheosKyriosKaiEpefanenImin.melody
ltx/en_us_oca/tr.d064:trMA.Ode9C1H.mode	@ltx/en_us_oca/miscellanea:misc.Mode4
ltx/en_us_oca/tr.d064:trMA.Ode9C1H.ode	@ltx/en_us_oca/miscellanea:misc.Ode9
ltx/en_us_oca/tr.d064:trMA.Ode9C1H.text	@ltx/en_us_oca/he.h.m4:heHE.TheosKyriosKaiEpefanenImin.text
ltx/en_us_oca/tr.d064:trMA.Oikos1.text	
ltx/en_us_oca/tr.d064:trMA.PostGospelBoth.incipit	@ltx/en_us_oca/tr.d064:trMA.PostGospelGlory.incipit
ltx/en_us_oca/tr.d064:trMA.PostGospelBoth.melody	
ltx/en_us_oca/tr.d064:trMA.PostGospelBoth.mode	@ltx/en_us_oca/miscellanea:misc.Mode2
ltx/en_us_oca/tr.d064:trMA.PostGospelBoth.text	@ltx/en_us_oca/tr.d064:trMA.PostGospelGlory.text
ltx/en_us_oca/tr.d064:trMA.PostGospelGlory.incipit	…
ltx/en_us_oca/tr.d064:trMA.PostGospelGlory.melody	
ltx/en_us_oca/tr.d064:trMA.PostGospelGlory.mode	@ltx/en_us_oca/miscellanea:misc.Mode2
ltx/en_us_oca/tr.d064:trMA.PostGospelGlory.text	
ltx/en_us_oca/tr.d064:trMA.PostGospelIdiomelon.incipit	@ltx/en_us_oca/tr.d064:trVE.Stichera01.incipit
ltx/en_us_oca/tr.d064:trMA.PostGospelIdiomelon.melody	@ltx/en_us_oca/miscellanea:misc.Idiomelon
ltx/en_us_oca/tr.d064:trMA.PostGospelIdiomelon.mode	@ltx/en_us_oca/miscellanea:misc.Mode6
ltx/en_us_oca/tr.d064:trMA.PostGospelIdiomelon.text	@ltx/en_us_oca/tr.d064:trVE.Stichera01.text
ltx/en_us_oca/tr.d064:trSV.AposGlory.incipit	…
ltx/en_us_oca/tr.d064:trSV.AposGlory.melody	@ltx/en_us_oca/he.a.m2:heAU.OikosTouEfratha.notmetered
ltx/en_us_oca/tr.d064:trSV.AposGlory.mode	@ltx/en_us_oca/miscellanea:misc.Mode2
ltx/en_us_oca/tr.d064:trSV.AposGlory.text	
ltx/en_us_oca/tr.d064:trSV.Aposticha1.incipit	…
ltx/en_us_oca/tr.d064:trSV.Aposticha1.melody	@ltx/en_us_oca/he.a.m2:heAU.OikosTouEfratha.notmetered
ltx/en_us_oca/tr.d064:trSV.Aposticha1.mode	@ltx/en_us_oca/miscellanea:misc.Mode2
ltx/en_us_oca/tr.d064:trSV.Aposticha1.text	
ltx/en_us_oca/tr.d064:trSV.Aposticha2.incipit	…
ltx/en_us_oca/tr.d064:trSV.Aposticha2.melody	@ltx/en_us_oca/he.a.m2:heAU.OikosTouEfratha.notmetered
ltx/en_us_oca/tr.d064:trSV.Aposticha2.mode	@ltx/en_us_oca/miscellanea:misc.Mode2
ltx/en_us_oca/tr.d064:trSV.Aposticha2.text	
ltx/en_us_oca/tr.d064:trSV.Aposticha3.incipit	…
ltx/en_us_oca/tr.d064:trSV.Aposticha3.melody	@ltx/en_us_oca/he.a.m2:heAU.OikosTouEfratha.notmetered
ltx/en_us_oca/tr.d064:trSV.Aposticha3.mode	@ltx/en_us_oca/miscellanea:misc.Mode2
ltx/en_us_oca/tr.d064:trSV.Aposticha3.text	
ltx/en_us_oca/tr.d064:trSV.SticGlory.incipit	…
ltx/en_us_oca/tr.d064:trSV.SticGlory.melody	@ltx/en_us_oca/he.a.m6:heAU.TriimerosAnestis.notmetered
ltx/en_us_oca/tr.d064:trSV.SticGlory.mode	@ltx/en_us_oca/miscellanea:misc.Mode6
ltx/en_us_oca/tr.d064:trSV.SticGlory.text	
ltx/en_us_oca/tr.d064:trSV.Stichera1.incipit	…
ltx/en_us_oca/tr.d064:trSV.Stichera1.melody	@ltx/en_us_oca/he.a.m6:heAU.TriimerosAnestis.notmetered
ltx/en_us_oca/tr.d064:trSV.Stichera1.mode	@ltx/en_us_oca/miscellanea:misc.Mode6
ltx/en_us_oca/tr.d064:trSV.Stichera1.text	
ltx/en_us_oca/tr.d064:trSV.Stichera2.incipit	…
ltx/en_us_oca/tr.d064:trSV.Stichera2.melody	@ltx/en_us_oca/he.a.m6:heAU.TriimerosAnestis.notmetered
ltx/en_us_oca/tr.d064:trSV.Stichera2.mode	@ltx/en_us_oca/miscellanea:misc.Mode6
ltx/en_us_oca/tr.d064:trSV.Stichera2.text	
ltx/en_us_oca/tr.d064:trSV.Stichera3.incipit	…
ltx/en_us_oca/tr.d064:trSV.Stichera3.melody	@ltx/en_us_oca/he.a.m6:heAU.TriimerosAnestis.notmetered
ltx/en_us_oca/tr.d064:trSV.Stichera3.mode	@ltx/en_us_oca/miscellanea:misc.Mode6
ltx/en_us_oca/tr.d064:trSV.Stichera3.text	
ltx/en_us_oca/tr.d064:trSV.Stichera4.incipit	…
ltx/en_us_oca/tr.d064:trSV.Stichera4.melody	@ltx/en_us_oca/he.a.m6:heAU.TriimerosAnestis.notmetered
ltx/en_us_oca/tr.d064:trSV.Stichera4.mode	@ltx/en_us_oca/miscellanea:misc.Mode6
ltx/en_us_oca/tr.d064:trSV.Stichera4.text	
ltx/en_us_oca/tr.d064:trSY.commemoration.couplet1.title	@ltx/en_us_oca/titles:ti.Verses
ltx/en_us_oca/tr.d064:trSY.commemoration.couplet1.verse1	
ltx/en_us_oca/tr.d064:trSY.commemoration.couplet1.verse2	
ltx/en_us_oca/tr.d064:trSY.commemoration.narration.p01	
ltx/en_us_oca/tr.d064:trSY.commemoration.narration.p02	
ltx/en_us_oca/tr.d064:trSY.commemoration.narration.p03	
ltx/en_us_oca/tr.d064:trSY.commemoration.narration.p04	
ltx/en_us_oca/tr.d064:trSY.commemoration.narration.p05	
ltx/en_us_oca/tr.d064:trSY.commemoration.narration.p06	
ltx/en_us_oca/tr.d064:trSY.commemoration.narration.p07	
ltx/en_us_oca/tr.d064:trSY.commemoration.text	
ltx/en_us_oca/tr.d064:trSY.lastline	
ltx/en_us_oca/tr.d064:trVE.Apolytikion1.incipit	@ltx/en_us_oca/tr.d063:trVE.Apolytikion1.incipit
ltx/en_us_oca/tr.d064:trVE.Apolytikion1.melody	
ltx/en_us_oca/tr.d064:trVE.Apolytikion1.mode	@ltx/en_us_oca/miscellanea:misc.Mode1
ltx/en_us_oca/tr.d064:trVE.Apolytikion1.text	@ltx/en_us_oca/tr.d063:trVE.Apolytikion1.text
ltx/en_us_oca/tr.d064:trVE.Apolytikion2.incipit	…
ltx/en_us_oca/tr.d064:trVE.Apolytikion2.melody	
ltx/en_us_oca/tr.d064:trVE.Apolytikion2.mode	@ltx/en_us_oca/miscellanea:misc.Mode4
ltx/en_us_oca/tr.d064:trVE.Apolytikion2.text	
ltx/en_us_oca/tr.d064:trVE.AposBoth.incipit	@ltx/en_us_oca/tr.d064:trVE.Stichera01.incipit
ltx/en_us_oca/tr.d064:trVE.AposBoth.melody	@ltx/en_us_oca/miscellanea:misc.Idiomelon
ltx/en_us_oca/tr.d064:trVE.AposBoth.mode	@ltx/en_us_oca/miscellanea:misc.Mode6
ltx/en_us_oca/tr.d064:trVE.AposBoth.text	@ltx/en_us_oca/tr.d064:trVE.Stichera01.text
ltx/en_us_oca/tr.d064:trVE.AposGlory.incipit	@ltx/en_us_oca/tr.d064:trVE.Stichera01.incipit
ltx/en_us_oca/tr.d064:trVE.AposGlory.melody	@ltx/en_us_oca/miscellanea:misc.Idiomelon
ltx/en_us_oca/tr.d064:trVE.AposGlory.mode	@ltx/en_us_oca/miscellanea:misc.Mode6
ltx/en_us_oca/tr.d064:trVE.AposGlory.text	@ltx/en_us_oca/tr.d064:trVE.Stichera01.text
ltx/en_us_oca/tr.d064:trVE.Aposticha1.incipit	…
ltx/en_us_oca/tr.d064:trVE.Aposticha1.melody	@ltx/en_us_oca/miscellanea:misc.Idiomelon
ltx/en_us_oca/tr.d064:trVE.Aposticha1.mode	@ltx/en_us_oca/miscellanea:misc.Mode8
ltx/en_us_oca/tr.d064:trVE.Aposticha1.text	
ltx/en_us_oca/tr.d064:trVE.Aposticha2.incipit	…
ltx/en_us_oca/tr.d064:trVE.Aposticha2.melody	@ltx/en_us_oca/miscellanea:misc.Idiomelon
ltx/en_us_oca/tr.d064:trVE.Aposticha2.mode	@ltx/en_us_oca/miscellanea:misc.Mode8
ltx/en_us_oca/tr.d064:trVE.Aposticha2.text	
ltx/en_us_oca/tr.d064:trVE.Aposticha3.incipit	…
ltx/en_us_oca/tr.d064:trVE.Aposticha3.melody	@ltx/en_us_oca/miscellanea:misc.Idiomelon
ltx/en_us_oca/tr.d064:trVE.Aposticha3.mode	@ltx/en_us_oca/miscellanea:misc.Mode8
ltx/en_us_oca/tr.d064:trVE.Aposticha3.text	
ltx/en_us_oca/tr.d064:trVE.Lity1.incipit	…
ltx/en_us_oca/tr.d064:trVE.Lity1.melody	@ltx/en_us_oca/miscellanea:misc.Idiomelon
ltx/en_us_oca/tr.d064:trVE.Lity1.mode	@ltx/en_us_oca/miscellanea:misc.Mode1
ltx/en_us_oca/tr.d064:trVE.Lity1.text	
ltx/en_us_oca/tr.d064:trVE.Lity2.incipit	…
ltx/en_us_oca/tr.d064:trVE.Lity2.melody	@ltx/en_us_oca/miscellanea:misc.Idiomelon
ltx/en_us_oca/tr.d064:trVE.Lity2.mode	@ltx/en_us_oca/miscellanea:misc.Mode1
ltx/en_us_oca/tr.d064:trVE.Lity2.text	
ltx/en_us_oca/tr.d064:trVE.Lity3.incipit	Six days before the feast…
ltx/en_us_oca/tr.d064:trVE.Lity3.melody	@ltx/en_us_oca/miscellanea:misc.Idiomelon
ltx/en_us_oca/tr.d064:trVE.Lity3.mode	@ltx/en_us_oca/miscellanea:misc.Mode1
ltx/en_us_oca/tr.d064:trVE.Lity3.text	Six days before the feast of Passover, ⁄ your voice resounded in the depths of hell, Lord! ⁄ Raising Lazarus who had been dead four days! ⁄ Then the children of the Hebrews danced and sang: ⁄⁄ Hosanna to our God! Glory to you!
ltx/en_us_oca/tr.d064:trVE.Lity4.incipit	You have entered…
ltx/en_us_oca/tr.d064:trVE.Lity4.melody	@ltx/en_us_oca/miscellanea:misc.Idiomelon
ltx/en_us_oca/tr.d064:trVE.Lity4.mode	@ltx/en_us_oca/miscellanea:misc.Mode2
ltx/en_us_oca/tr.d064:trVE.Lity4.text	You have entered the holy city, Lord, ⁄ riding on the colt of an ass, ⁄ hastening to your Passion, ⁄ that the law and the prophets might be fulfilled. ⁄ The Hebrew children greeted you with palms and branches, ⁄ heralding your victorious resurrection. ⁄⁄ Blessed are you, O Savior! Have mercy on us!
ltx/en_us_oca/tr.d064:trVE.Lity5.incipit	Glory to you, O Christ…
ltx/en_us_oca/tr.d064:trVE.Lity5.melody	@ltx/en_us_oca/miscellanea:misc.Idiomelon
ltx/en_us_oca/tr.d064:trVE.Lity5.mode	@ltx/en_us_oca/miscellanea:misc.Mode2
ltx/en_us_oca/tr.d064:trVE.Lity5.text	Glory to you, O Christ, enthroned on high! ⁄ Today we lift up your precious cross, ⁄ as we await your coming in glory. ⁄ The daughter of Zion is glad; ⁄ all nations on earth rejoice; ⁄ the children wave branches; the disciples make a carpet of clothes! ⁄ All the ends of the earth learn to cry to you: ⁄⁄ Blessed are you, O Savior! Have mercy on us!
ltx/en_us_oca/tr.d064:trVE.LityGlory.incipit	…
ltx/en_us_oca/tr.d064:trVE.LityGlory.melody	@ltx/en_us_oca/miscellanea:misc.Idiomelon
ltx/en_us_oca/tr.d064:trVE.LityGlory.mode	@ltx/en_us_oca/miscellanea:misc.Mode3
ltx/en_us_oca/tr.d064:trVE.LityGlory.text	
ltx/en_us_oca/tr.d064:trVE.SticBoth.incipit	@ltx/en_us_oca/tr.d064:trVE.Stichera01.incipit
ltx/en_us_oca/tr.d064:trVE.SticBoth.melody	@ltx/en_us_oca/miscellanea:misc.Idiomelon
ltx/en_us_oca/tr.d064:trVE.SticBoth.mode	@ltx/en_us_oca/miscellanea:misc.Mode6
ltx/en_us_oca/tr.d064:trVE.SticBoth.text	@ltx/en_us_oca/tr.d064:trVE.Stichera01.text
ltx/en_us_oca/tr.d064:trVE.SticGlory.incipit	@ltx/en_us_oca/tr.d064:trVE.Stichera01.incipit
ltx/en_us_oca/tr.d064:trVE.SticGlory.melody	@ltx/en_us_oca/miscellanea:misc.Idiomelon
ltx/en_us_oca/tr.d064:trVE.SticGlory.mode	@ltx/en_us_oca/miscellanea:misc.Mode6
ltx/en_us_oca/tr.d064:trVE.SticGlory.text	@ltx/en_us_oca/tr.d064:trVE.Stichera01.text
ltx/en_us_oca/tr.d064:trVE.Stichera01.incipit	…
ltx/en_us_oca/tr.d064:trVE.Stichera01.melody	@ltx/en_us_oca/miscellanea:misc.Idiomelon
ltx/en_us_oca/tr.d064:trVE.Stichera01.mode	@ltx/en_us_oca/miscellanea:misc.Mode6
ltx/en_us_oca/tr.d064:trVE.Stichera01.text	
ltx/en_us_oca/tr.d064:trVE.Stichera02.incipit	…
ltx/en_us_oca/tr.d064:trVE.Stichera02.melody	@ltx/en_us_oca/miscellanea:misc.Idiomelon
ltx/en_us_oca/tr.d064:trVE.Stichera02.mode	@ltx/en_us_oca/miscellanea:misc.Mode6
ltx/en_us_oca/tr.d064:trVE.Stichera02.text	
ltx/en_us_oca/tr.d064:trVE.Stichera03.incipit	…
ltx/en_us_oca/tr.d064:trVE.Stichera03.melody	@ltx/en_us_oca/miscellanea:misc.Idiomelon
ltx/en_us_oca/tr.d064:trVE.Stichera03.mode	@ltx/en_us_oca/miscellanea:misc.Mode6
ltx/en_us_oca/tr.d064:trVE.Stichera03.text	
ltx/en_us_oca/tr.d064:trVE.Stichera04.incipit	…
ltx/en_us_oca/tr.d064:trVE.Stichera04.melody	@ltx/en_us_oca/miscellanea:misc.Idiomelon
ltx/en_us_oca/tr.d064:trVE.Stichera04.mode	@ltx/en_us_oca/miscellanea:misc.Mode6
ltx/en_us_oca/tr.d064:trVE.Stichera04.text	
ltx/en_us_oca/tr.d064:trVE.Stichera05.incipit	…
ltx/en_us_oca/tr.d064:trVE.Stichera05.melody	@ltx/en_us_oca/miscellanea:misc.Idiomelon
ltx/en_us_oca/tr.d064:trVE.Stichera05.mode	@ltx/en_us_oca/miscellanea:misc.Mode6
ltx/en_us_oca/tr.d064:trVE.Stichera05.text	
