ltx/en_us_oca/he.a.m8:heAU.AnestisEkNekron.greekname	
ltx/en_us_oca/he.a.m8:heAU.AnestisEkNekron.incipit	…
ltx/en_us_oca/he.a.m8:heAU.AnestisEkNekron.melody	@ltx/en_us_oca/miscellanea:misc.AutomelonNotMetered
ltx/en_us_oca/he.a.m8:heAU.AnestisEkNekron.mode	@ltx/en_us_oca/miscellanea:misc.Mode8
ltx/en_us_oca/he.a.m8:heAU.AnestisEkNekron.name	O Life of all, You rose.
ltx/en_us_oca/he.a.m8:heAU.AnestisEkNekron.notmetered	N/M (O Life of all, You rose.)
ltx/en_us_oca/he.a.m8:heAU.AnestisEkNekron.text	
ltx/en_us_oca/he.a.m8:heAU.AvlonPoimenikon.greekname	
ltx/en_us_oca/he.a.m8:heAU.AvlonPoimenikon.incipit	…
ltx/en_us_oca/he.a.m8:heAU.AvlonPoimenikon.melody	@ltx/en_us_oca/miscellanea:misc.AutomelonNotMetered
ltx/en_us_oca/he.a.m8:heAU.AvlonPoimenikon.mode	@ltx/en_us_oca/miscellanea:misc.Mode8
ltx/en_us_oca/he.a.m8:heAU.AvlonPoimenikon.name	N/M (The army of the Angels.)
ltx/en_us_oca/he.a.m8:heAU.AvlonPoimenikon.notmetered	N/M (The army of the Angels.)
ltx/en_us_oca/he.a.m8:heAU.AvlonPoimenikon.text	
ltx/en_us_oca/he.a.m8:heAU.DefteApantesPistoi.greekname	
ltx/en_us_oca/he.a.m8:heAU.DefteApantesPistoi.incipit	Come, all faithful…
ltx/en_us_oca/he.a.m8:heAU.DefteApantesPistoi.melody	@ltx/en_us_oca/miscellanea:misc.AutomelonNotMetered
ltx/en_us_oca/he.a.m8:heAU.DefteApantesPistoi.mode	@ltx/en_us_oca/miscellanea:misc.Mode8
ltx/en_us_oca/he.a.m8:heAU.DefteApantesPistoi.name	Come, all faithful.
ltx/en_us_oca/he.a.m8:heAU.DefteApantesPistoi.notmetered	N/M (O believers one and all.)
ltx/en_us_oca/he.a.m8:heAU.DefteApantesPistoi.text	Come, all faithful! ⁄ Let us praise the assemblies of holy fathers: ⁄ Anthony the Great, Euthymius the Great, and all of their company, ⁄ passing through their lives as through a paradise of sweetness! ⁄ Let us cry out with joy: ⁄ These are truly the trees which our God has planted! ⁄ These are the ripened fruits of eternal life, ⁄ offered to Christ, nourishing our souls. ⁄⁄ Blessed, God-bearing fathers, pray that we may be saved!
ltx/en_us_oca/he.a.m8:heAU.KyrieEiKaiKritirio.greekname	
ltx/en_us_oca/he.a.m8:heAU.KyrieEiKaiKritirio.incipit	…
ltx/en_us_oca/he.a.m8:heAU.KyrieEiKaiKritirio.melody	@ltx/en_us_oca/miscellanea:misc.AutomelonNotMetered
ltx/en_us_oca/he.a.m8:heAU.KyrieEiKaiKritirio.mode	@ltx/en_us_oca/miscellanea:misc.Mode8
ltx/en_us_oca/he.a.m8:heAU.KyrieEiKaiKritirio.name	N/M (Lord, even though.)
ltx/en_us_oca/he.a.m8:heAU.KyrieEiKaiKritirio.notmetered	N/M (Lord, even though.)
ltx/en_us_oca/he.a.m8:heAU.KyrieEiKaiKritirio.text	
ltx/en_us_oca/he.a.m8:heAU.OAngelosSouKyrie.greekname	
ltx/en_us_oca/he.a.m8:heAU.OAngelosSouKyrie.incipit	…
ltx/en_us_oca/he.a.m8:heAU.OAngelosSouKyrie.melody	@ltx/en_us_oca/miscellanea:misc.AutomelonNotMetered
ltx/en_us_oca/he.a.m8:heAU.OAngelosSouKyrie.mode	@ltx/en_us_oca/miscellanea:misc.Mode8
ltx/en_us_oca/he.a.m8:heAU.OAngelosSouKyrie.name	N/M (O Lord, Your angel.)
ltx/en_us_oca/he.a.m8:heAU.OAngelosSouKyrie.notmetered	N/M (O Lord, Your angel.)
ltx/en_us_oca/he.a.m8:heAU.OAngelosSouKyrie.text	
ltx/en_us_oca/he.a.m8:heAU.OEnEdemParadeisos.greekname	
ltx/en_us_oca/he.a.m8:heAU.OEnEdemParadeisos.incipit	…
ltx/en_us_oca/he.a.m8:heAU.OEnEdemParadeisos.melody	@ltx/en_us_oca/miscellanea:misc.AutomelonNotMetered
ltx/en_us_oca/he.a.m8:heAU.OEnEdemParadeisos.mode	@ltx/en_us_oca/miscellanea:misc.Mode8
ltx/en_us_oca/he.a.m8:heAU.OEnEdemParadeisos.name	N/M (The paradise of Eden.)
ltx/en_us_oca/he.a.m8:heAU.OEnEdemParadeisos.notmetered	N/M (The paradise of Eden.)
ltx/en_us_oca/he.a.m8:heAU.OEnEdemParadeisos.text	
ltx/en_us_oca/he.a.m8:heAU.OTouParadoxou.greekname	
ltx/en_us_oca/he.a.m8:heAU.OTouParadoxou.incipit	…
ltx/en_us_oca/he.a.m8:heAU.OTouParadoxou.melody	@ltx/en_us_oca/miscellanea:misc.AutomelonNotMetered
ltx/en_us_oca/he.a.m8:heAU.OTouParadoxou.mode	@ltx/en_us_oca/miscellanea:misc.Mode8
ltx/en_us_oca/he.a.m8:heAU.OTouParadoxou.name	N/M (What a paradoxal.)
ltx/en_us_oca/he.a.m8:heAU.OTouParadoxou.notmetered	N/M (What a paradoxal.)
ltx/en_us_oca/he.a.m8:heAU.OTouParadoxou.text	
ltx/en_us_oca/he.a.m8:heAU.OiMartyresSouKyrie.greekname	
ltx/en_us_oca/he.a.m8:heAU.OiMartyresSouKyrie.incipit	Your martyrs, Lord…
ltx/en_us_oca/he.a.m8:heAU.OiMartyresSouKyrie.melody	@ltx/en_us_oca/miscellanea:misc.AutomelonNotMetered
ltx/en_us_oca/he.a.m8:heAU.OiMartyresSouKyrie.mode	@ltx/en_us_oca/miscellanea:misc.Mode8
ltx/en_us_oca/he.a.m8:heAU.OiMartyresSouKyrie.name	Your martyrs, Lord.
ltx/en_us_oca/he.a.m8:heAU.OiMartyresSouKyrie.notmetered	N/M (Your martyr Saints.)
ltx/en_us_oca/he.a.m8:heAU.OiMartyresSouKyrie.text	Your martyrs, Lord, ⁄ forgetting the things of this life, ⁄ and enduring tortures for the sake of the life to come, ⁄ were shown to be its inheritors; ⁄ and now they rejoice with the angels! ⁄⁄ By their prayers grant your people great mercy!
ltx/en_us_oca/he.a.m8:heAU.OsAparchas.greekname	
ltx/en_us_oca/he.a.m8:heAU.OsAparchas.incipit	…
ltx/en_us_oca/he.a.m8:heAU.OsAparchas.melody	@ltx/en_us_oca/miscellanea:misc.AutomelonNotMetered
ltx/en_us_oca/he.a.m8:heAU.OsAparchas.mode	@ltx/en_us_oca/miscellanea:misc.Mode8
ltx/en_us_oca/he.a.m8:heAU.OsAparchas.name	N/M (O Planter.)
ltx/en_us_oca/he.a.m8:heAU.OsAparchas.notmetered	N/M (O Planter.)
ltx/en_us_oca/he.a.m8:heAU.OsAparchas.text	
ltx/en_us_oca/he.a.m8:heAU.TiYmasKalesomen.greekname	
ltx/en_us_oca/he.a.m8:heAU.TiYmasKalesomen.incipit	What shall we call you, saints?…
ltx/en_us_oca/he.a.m8:heAU.TiYmasKalesomen.melody	@ltx/en_us_oca/miscellanea:misc.AutomelonNotMetered
ltx/en_us_oca/he.a.m8:heAU.TiYmasKalesomen.mode	@ltx/en_us_oca/miscellanea:misc.Mode8
ltx/en_us_oca/he.a.m8:heAU.TiYmasKalesomen.name	N/M (What…to call you.)
ltx/en_us_oca/he.a.m8:heAU.TiYmasKalesomen.notmetered	N/M (What…to call you.)
ltx/en_us_oca/he.a.m8:heAU.TiYmasKalesomen.text	What shall we call you, saints? ⁄ Cherubim, for Christ rested in you? ⁄ Or seraphim, since you glorify him ceaselessly? ⁄ Angels, for you renounced the flesh? ⁄ Or powers, since you perform miracles? ⁄ Many are your names, and great are your gifts! ⁄⁄ pray that our souls may be saved.
ltx/en_us_oca/he.a.m8:heAU.TiYpermacho.greekname	
ltx/en_us_oca/he.a.m8:heAU.TiYpermacho.incipit	…
ltx/en_us_oca/he.a.m8:heAU.TiYpermacho.melody	@ltx/en_us_oca/miscellanea:misc.AutomelonNotMetered
ltx/en_us_oca/he.a.m8:heAU.TiYpermacho.mode	@ltx/en_us_oca/miscellanea:misc.Mode8
ltx/en_us_oca/he.a.m8:heAU.TiYpermacho.name	N/M (O Champion General.)
ltx/en_us_oca/he.a.m8:heAU.TiYpermacho.notmetered	N/M (O Champion General.)
ltx/en_us_oca/he.a.m8:heAU.TiYpermacho.text	
ltx/en_us_oca/he.a.m8:heAU.TinSofianKaiLogon.greekname	
ltx/en_us_oca/he.a.m8:heAU.TinSofianKaiLogon.incipit	…
ltx/en_us_oca/he.a.m8:heAU.TinSofianKaiLogon.melody	@ltx/en_us_oca/miscellanea:misc.AutomelonNotMetered
ltx/en_us_oca/he.a.m8:heAU.TinSofianKaiLogon.mode	@ltx/en_us_oca/miscellanea:misc.Mode8
ltx/en_us_oca/he.a.m8:heAU.TinSofianKaiLogon.name	N/M (By conceiving the wisdom.)
ltx/en_us_oca/he.a.m8:heAU.TinSofianKaiLogon.notmetered	N/M (By conceiving the wisdom.)
ltx/en_us_oca/he.a.m8:heAU.TinSofianKaiLogon.text	
ltx/en_us_oca/he.a.m8:heAU.ToProstachthen.greekname	
ltx/en_us_oca/he.a.m8:heAU.ToProstachthen.incipit	…
ltx/en_us_oca/he.a.m8:heAU.ToProstachthen.melody	@ltx/en_us_oca/miscellanea:misc.AutomelonNotMetered
ltx/en_us_oca/he.a.m8:heAU.ToProstachthen.mode	@ltx/en_us_oca/miscellanea:misc.Mode8
ltx/en_us_oca/he.a.m8:heAU.ToProstachthen.name	N/M (When he perceived.)
ltx/en_us_oca/he.a.m8:heAU.ToProstachthen.notmetered	N/M (When he perceived.)
ltx/en_us_oca/he.a.m8:heAU.ToProstachthen.text	
ltx/en_us_oca/he.a.m8:heAU.title	
