ltx/en_us_oca/me.m02.d06:alt1.meDA.commemoration.first_name	
ltx/en_us_oca/me.m02.d06:alt1.meDA.commemoration.first_short	
ltx/en_us_oca/me.m02.d06:alt1.meDA.commemoration.first_title	
ltx/en_us_oca/me.m02.d06:alt1.meDA.commemoration.full	
ltx/en_us_oca/me.m02.d06:alt1.meDA.commemoration.second_name	
ltx/en_us_oca/me.m02.d06:alt1.meDA.commemoration.second_title	
ltx/en_us_oca/me.m02.d06:alt1.meDA.date	
ltx/en_us_oca/me.m02.d06:alt1.meDA.dismissal	@ltx/en_us_oca/dismissals:dis00.meeting
ltx/en_us_oca/me.m02.d06:alt1.meDA.insert1	
ltx/en_us_oca/me.m02.d06:alt1.meDA.insert2	
ltx/en_us_oca/me.m02.d06:alt1.meDA.note	
ltx/en_us_oca/me.m02.d06:alt1.meHO.commemorations	
ltx/en_us_oca/me.m02.d06:alt1.meHO.note1	
ltx/en_us_oca/me.m02.d06:alt1.meHO.note2	
ltx/en_us_oca/me.m02.d06:alt1.meHO.number	
ltx/en_us_oca/me.m02.d06:alt1.meHO.rank	
ltx/en_us_oca/me.m02.d06:alt1.meLE.commemoration1	
ltx/en_us_oca/me.m02.d06:alt1.meLE.commemoration2	
ltx/en_us_oca/me.m02.d06:alt1.meLI.Kontakion1.incipit	@ltx/en_us_oca/me.m02.d06:alt1.meMA.Kontakion1.incipit
ltx/en_us_oca/me.m02.d06:alt1.meLI.Kontakion1.melody	@ltx/en_us_oca/me.m02.d06:alt1.meMA.Kontakion1.melody
ltx/en_us_oca/me.m02.d06:alt1.meLI.Kontakion1.mode	@ltx/en_us_oca/me.m02.d06:alt1.meMA.Kontakion1.mode
ltx/en_us_oca/me.m02.d06:alt1.meLI.Kontakion1.text	@ltx/en_us_oca/me.m02.d06:alt1.meMA.Kontakion1.text
ltx/en_us_oca/me.m02.d06:alt1.meLI.MM.CommunionHymn.text	@ltx/en_us_oca/properties:media.key
ltx/en_us_oca/me.m02.d06:alt1.meLI.MM.EntranceHymn.text	@ltx/en_us_oca/properties:media.key
ltx/en_us_oca/me.m02.d06:alt1.meLI.Megalynarion.text	
ltx/en_us_oca/me.m02.d06:alt1.meMA.C1.title	@ltx/en_us_oca/titles:ti.CanonSaintM
ltx/en_us_oca/me.m02.d06:alt1.meMA.C1.verse	@ltx/en_us_oca/prayers:pr.verse_SaintM.text
ltx/en_us_oca/me.m02.d06:alt1.meMA.Exaposteilarion1.greekmelody	@ltx/en_us_oca/he.a.m2:heAU.GynaikesAkoutisthite.greekname
ltx/en_us_oca/me.m02.d06:alt1.meMA.Exaposteilarion1.incipit	…
ltx/en_us_oca/me.m02.d06:alt1.meMA.Exaposteilarion1.melody	@ltx/en_us_oca/he.a.m2:heAU.GynaikesAkoutisthite.notmetered
ltx/en_us_oca/me.m02.d06:alt1.meMA.Exaposteilarion1.mode	@ltx/en_us_oca/miscellanea:misc.Mode2
ltx/en_us_oca/me.m02.d06:alt1.meMA.Exaposteilarion1.text	
ltx/en_us_oca/me.m02.d06:alt1.meMA.Exaposteilarion2.greekmelody	@ltx/en_us_oca/he.a.m3:heAU.EnPnevmatiToIero.greekname
ltx/en_us_oca/me.m02.d06:alt1.meMA.Exaposteilarion2.incipit	@ltx/en_us_oca/he.a.m3:heAU.EnPnevmatiToIero.incipit
ltx/en_us_oca/me.m02.d06:alt1.meMA.Exaposteilarion2.melody	@ltx/en_us_oca/he.a.m3:heAU.EnPnevmatiToIero.melody
ltx/en_us_oca/me.m02.d06:alt1.meMA.Exaposteilarion2.mode	@ltx/en_us_oca/miscellanea:misc.Mode3
ltx/en_us_oca/me.m02.d06:alt1.meMA.Exaposteilarion2.text	@ltx/en_us_oca/he.a.m3:heAU.EnPnevmatiToIero.text
ltx/en_us_oca/me.m02.d06:alt1.meMA.Kathisma11.greekmelody	@ltx/en_us_oca/he.a.m1:heAU.TonTafonSouSotir.greekname
ltx/en_us_oca/me.m02.d06:alt1.meMA.Kathisma11.incipit	…
ltx/en_us_oca/me.m02.d06:alt1.meMA.Kathisma11.melody	@ltx/en_us_oca/he.a.m1:heAU.TonTafonSouSotir.notmetered
ltx/en_us_oca/me.m02.d06:alt1.meMA.Kathisma11.mode	@ltx/en_us_oca/miscellanea:misc.Mode1
ltx/en_us_oca/me.m02.d06:alt1.meMA.Kathisma11.text	
ltx/en_us_oca/me.m02.d06:alt1.meMA.Kathisma12.greekmelody	@ltx/en_us_oca/he.a.m1:heAU.ChorosAngelikos.greekname
ltx/en_us_oca/me.m02.d06:alt1.meMA.Kathisma12.incipit	@ltx/en_us_oca/he.a.m1:heAU.ChorosAngelikos.incipit
ltx/en_us_oca/me.m02.d06:alt1.meMA.Kathisma12.melody	@ltx/en_us_oca/he.a.m1:heAU.ChorosAngelikos.melody
ltx/en_us_oca/me.m02.d06:alt1.meMA.Kathisma12.mode	@ltx/en_us_oca/miscellanea:misc.Mode1
ltx/en_us_oca/me.m02.d06:alt1.meMA.Kathisma12.text	@ltx/en_us_oca/he.a.m1:heAU.ChorosAngelikos.text
ltx/en_us_oca/me.m02.d06:alt1.meMA.Kathisma21.greekmelody	@ltx/en_us_oca/he.a.m3:heAU.TheiasPisteos.greekname
ltx/en_us_oca/me.m02.d06:alt1.meMA.Kathisma21.incipit	…
ltx/en_us_oca/me.m02.d06:alt1.meMA.Kathisma21.melody	@ltx/en_us_oca/he.a.m3:heAU.TheiasPisteos.notmetered
ltx/en_us_oca/me.m02.d06:alt1.meMA.Kathisma21.mode	@ltx/en_us_oca/miscellanea:misc.Mode3
ltx/en_us_oca/me.m02.d06:alt1.meMA.Kathisma21.text	
ltx/en_us_oca/me.m02.d06:alt1.meMA.Kathisma22.greekmelody	@ltx/en_us_oca/he.a.m1:heAU.TonTafonSouSotir.greekname
ltx/en_us_oca/me.m02.d06:alt1.meMA.Kathisma22.incipit	@ltx/en_us_oca/me.m02.d02:meMA.Kathisma21.incipit
ltx/en_us_oca/me.m02.d06:alt1.meMA.Kathisma22.melody	@ltx/en_us_oca/he.a.m1:heAU.TonTafonSouSotir.notmetered
ltx/en_us_oca/me.m02.d06:alt1.meMA.Kathisma22.mode	@ltx/en_us_oca/miscellanea:misc.Mode1
ltx/en_us_oca/me.m02.d06:alt1.meMA.Kathisma22.text	@ltx/en_us_oca/me.m02.d02:meMA.Kathisma21.text
ltx/en_us_oca/me.m02.d06:alt1.meMA.Kathisma31.greekmelody	@ltx/en_us_oca/he.a.m4:heAU.OYpsotheisEnToStavro.greekname
ltx/en_us_oca/me.m02.d06:alt1.meMA.Kathisma31.incipit	…
ltx/en_us_oca/me.m02.d06:alt1.meMA.Kathisma31.melody	@ltx/en_us_oca/he.a.m4:heAU.OYpsotheisEnToStavro.notmetered
ltx/en_us_oca/me.m02.d06:alt1.meMA.Kathisma31.mode	@ltx/en_us_oca/miscellanea:misc.Mode4
ltx/en_us_oca/me.m02.d06:alt1.meMA.Kathisma31.text	
ltx/en_us_oca/me.m02.d06:alt1.meMA.Kathisma32.greekmelody	@ltx/en_us_oca/he.a.m4:heAU.KateplagiIosif.greekname
ltx/en_us_oca/me.m02.d06:alt1.meMA.Kathisma32.incipit	@ltx/en_us_oca/me.m02.d02:meMA.Kathisma31.incipit
ltx/en_us_oca/me.m02.d06:alt1.meMA.Kathisma32.melody	@ltx/en_us_oca/he.a.m4:heAU.KateplagiIosif.notmetered
ltx/en_us_oca/me.m02.d06:alt1.meMA.Kathisma32.mode	@ltx/en_us_oca/miscellanea:misc.Mode4
ltx/en_us_oca/me.m02.d06:alt1.meMA.Kathisma32.text	@ltx/en_us_oca/me.m02.d02:meMA.Kathisma31.text
ltx/en_us_oca/me.m02.d06:alt1.meMA.Kontakion1.greekmelody	@ltx/en_us_oca/he.a.m8:heAU.TiYpermacho.greekname
ltx/en_us_oca/me.m02.d06:alt1.meMA.Kontakion1.incipit	…
ltx/en_us_oca/me.m02.d06:alt1.meMA.Kontakion1.melody	@ltx/en_us_oca/he.a.m8:heAU.TiYpermacho.notmetered
ltx/en_us_oca/me.m02.d06:alt1.meMA.Kontakion1.mode	@ltx/en_us_oca/miscellanea:misc.Mode8
ltx/en_us_oca/me.m02.d06:alt1.meMA.Kontakion1.text	
ltx/en_us_oca/me.m02.d06:alt1.meMA.Lauds1.greekmelody	@ltx/en_us_oca/he.a.m1:heAU.TonOuranionTagmaton.greekname
ltx/en_us_oca/me.m02.d06:alt1.meMA.Lauds1.incipit	…
ltx/en_us_oca/me.m02.d06:alt1.meMA.Lauds1.melody	@ltx/en_us_oca/he.a.m1:heAU.TonOuranionTagmaton.notmetered
ltx/en_us_oca/me.m02.d06:alt1.meMA.Lauds1.mode	@ltx/en_us_oca/miscellanea:misc.Mode1
ltx/en_us_oca/me.m02.d06:alt1.meMA.Lauds1.text	
ltx/en_us_oca/me.m02.d06:alt1.meMA.Lauds2.greekmelody	@ltx/en_us_oca/he.a.m1:heAU.TonOuranionTagmaton.greekname
ltx/en_us_oca/me.m02.d06:alt1.meMA.Lauds2.incipit	…
ltx/en_us_oca/me.m02.d06:alt1.meMA.Lauds2.melody	@ltx/en_us_oca/he.a.m1:heAU.TonOuranionTagmaton.notmetered
ltx/en_us_oca/me.m02.d06:alt1.meMA.Lauds2.mode	@ltx/en_us_oca/miscellanea:misc.Mode1
ltx/en_us_oca/me.m02.d06:alt1.meMA.Lauds2.text	
ltx/en_us_oca/me.m02.d06:alt1.meMA.Lauds3.greekmelody	@ltx/en_us_oca/he.a.m1:heAU.TonOuranionTagmaton.greekname
ltx/en_us_oca/me.m02.d06:alt1.meMA.Lauds3.incipit	…
ltx/en_us_oca/me.m02.d06:alt1.meMA.Lauds3.melody	@ltx/en_us_oca/he.a.m1:heAU.TonOuranionTagmaton.notmetered
ltx/en_us_oca/me.m02.d06:alt1.meMA.Lauds3.mode	@ltx/en_us_oca/miscellanea:misc.Mode1
ltx/en_us_oca/me.m02.d06:alt1.meMA.Lauds3.text	
ltx/en_us_oca/me.m02.d06:alt1.meMA.Lauds4.greekmelody	@ltx/en_us_oca/he.a.m1:heAU.TonOuranionTagmaton.greekname
ltx/en_us_oca/me.m02.d06:alt1.meMA.Lauds4.incipit	…
ltx/en_us_oca/me.m02.d06:alt1.meMA.Lauds4.melody	@ltx/en_us_oca/he.a.m1:heAU.TonOuranionTagmaton.notmetered
ltx/en_us_oca/me.m02.d06:alt1.meMA.Lauds4.mode	@ltx/en_us_oca/miscellanea:misc.Mode1
ltx/en_us_oca/me.m02.d06:alt1.meMA.Lauds4.text	
ltx/en_us_oca/me.m02.d06:alt1.meMA.LaudsBoth.incipit	@ltx/en_us_oca/me.m02.d02:meVE.LityGlory.incipit
ltx/en_us_oca/me.m02.d06:alt1.meMA.LaudsBoth.melody	
ltx/en_us_oca/me.m02.d06:alt1.meMA.LaudsBoth.mode	@ltx/en_us_oca/miscellanea:misc.Mode5
ltx/en_us_oca/me.m02.d06:alt1.meMA.LaudsBoth.poet	@ltx/en_us_oca/poets:po.AndreouKritis
ltx/en_us_oca/me.m02.d06:alt1.meMA.LaudsBoth.text	@ltx/en_us_oca/me.m02.d02:meVE.LityGlory.text
ltx/en_us_oca/me.m02.d06:alt1.meMA.LaudsGlory.incipit	…
ltx/en_us_oca/me.m02.d06:alt1.meMA.LaudsGlory.melody	
ltx/en_us_oca/me.m02.d06:alt1.meMA.LaudsGlory.mode	@ltx/en_us_oca/miscellanea:misc.Mode5
ltx/en_us_oca/me.m02.d06:alt1.meMA.LaudsGlory.text	
ltx/en_us_oca/me.m02.d06:alt1.meMA.MM.Lauds1234as5678.text	@ltx/en_us_oca/properties:media.key
ltx/en_us_oca/me.m02.d06:alt1.meMA.MM.Lauds123as123.text	@ltx/en_us_oca/properties:media.key
ltx/en_us_oca/me.m02.d06:alt1.meMA.Ode1C11.greekmelody	@ltx/en_us_oca/he.h.m4:heHE.AnoixoToStomaMou.greekname
ltx/en_us_oca/me.m02.d06:alt1.meMA.Ode1C11.incipit	…
ltx/en_us_oca/me.m02.d06:alt1.meMA.Ode1C11.melody	@ltx/en_us_oca/he.h.m4:heHE.AnoixoToStomaMou.notmetered
ltx/en_us_oca/me.m02.d06:alt1.meMA.Ode1C11.mode	@ltx/en_us_oca/miscellanea:misc.Mode4
ltx/en_us_oca/me.m02.d06:alt1.meMA.Ode1C11.ode	@ltx/en_us_oca/miscellanea:misc.Ode1
ltx/en_us_oca/me.m02.d06:alt1.meMA.Ode1C11.text	
ltx/en_us_oca/me.m02.d06:alt1.meMA.Ode1C12.incipit	…
ltx/en_us_oca/me.m02.d06:alt1.meMA.Ode1C12.melody	@ltx/en_us_oca/he.h.m4:heHE.AnoixoToStomaMou.notmetered
ltx/en_us_oca/me.m02.d06:alt1.meMA.Ode1C12.mode	@ltx/en_us_oca/miscellanea:misc.Mode4
ltx/en_us_oca/me.m02.d06:alt1.meMA.Ode1C12.ode	@ltx/en_us_oca/miscellanea:misc.Ode1
ltx/en_us_oca/me.m02.d06:alt1.meMA.Ode1C12.text	
ltx/en_us_oca/me.m02.d06:alt1.meMA.Ode1C13.incipit	…
ltx/en_us_oca/me.m02.d06:alt1.meMA.Ode1C13.melody	@ltx/en_us_oca/he.h.m4:heHE.AnoixoToStomaMou.notmetered
ltx/en_us_oca/me.m02.d06:alt1.meMA.Ode1C13.mode	@ltx/en_us_oca/miscellanea:misc.Mode4
ltx/en_us_oca/me.m02.d06:alt1.meMA.Ode1C13.ode	@ltx/en_us_oca/miscellanea:misc.Ode1
ltx/en_us_oca/me.m02.d06:alt1.meMA.Ode1C13.text	
ltx/en_us_oca/me.m02.d06:alt1.meMA.Ode1C1T.incipit	…
ltx/en_us_oca/me.m02.d06:alt1.meMA.Ode1C1T.melody	@ltx/en_us_oca/he.h.m4:heHE.AnoixoToStomaMou.notmetered
ltx/en_us_oca/me.m02.d06:alt1.meMA.Ode1C1T.mode	@ltx/en_us_oca/miscellanea:misc.Mode4
ltx/en_us_oca/me.m02.d06:alt1.meMA.Ode1C1T.ode	@ltx/en_us_oca/miscellanea:misc.Ode1
ltx/en_us_oca/me.m02.d06:alt1.meMA.Ode1C1T.text	
ltx/en_us_oca/me.m02.d06:alt1.meMA.Ode3C11.greekmelody	@ltx/en_us_oca/he.h.m4:heHE.TousSousYmnologous.greekname
ltx/en_us_oca/me.m02.d06:alt1.meMA.Ode3C11.incipit	…
ltx/en_us_oca/me.m02.d06:alt1.meMA.Ode3C11.melody	@ltx/en_us_oca/he.h.m4:heHE.TousSousYmnologous.notmetered
ltx/en_us_oca/me.m02.d06:alt1.meMA.Ode3C11.mode	@ltx/en_us_oca/miscellanea:misc.Mode4
ltx/en_us_oca/me.m02.d06:alt1.meMA.Ode3C11.ode	@ltx/en_us_oca/miscellanea:misc.Ode3
ltx/en_us_oca/me.m02.d06:alt1.meMA.Ode3C11.text	
ltx/en_us_oca/me.m02.d06:alt1.meMA.Ode3C12.incipit	…
ltx/en_us_oca/me.m02.d06:alt1.meMA.Ode3C12.melody	@ltx/en_us_oca/he.h.m4:heHE.TousSousYmnologous.notmetered
ltx/en_us_oca/me.m02.d06:alt1.meMA.Ode3C12.mode	@ltx/en_us_oca/miscellanea:misc.Mode4
ltx/en_us_oca/me.m02.d06:alt1.meMA.Ode3C12.ode	@ltx/en_us_oca/miscellanea:misc.Ode3
ltx/en_us_oca/me.m02.d06:alt1.meMA.Ode3C12.text	
ltx/en_us_oca/me.m02.d06:alt1.meMA.Ode3C13.incipit	…
ltx/en_us_oca/me.m02.d06:alt1.meMA.Ode3C13.melody	@ltx/en_us_oca/he.h.m4:heHE.TousSousYmnologous.notmetered
ltx/en_us_oca/me.m02.d06:alt1.meMA.Ode3C13.mode	@ltx/en_us_oca/miscellanea:misc.Mode4
ltx/en_us_oca/me.m02.d06:alt1.meMA.Ode3C13.ode	@ltx/en_us_oca/miscellanea:misc.Ode3
ltx/en_us_oca/me.m02.d06:alt1.meMA.Ode3C13.text	
ltx/en_us_oca/me.m02.d06:alt1.meMA.Ode3C1T.incipit	…
ltx/en_us_oca/me.m02.d06:alt1.meMA.Ode3C1T.melody	@ltx/en_us_oca/he.h.m4:heHE.TousSousYmnologous.notmetered
ltx/en_us_oca/me.m02.d06:alt1.meMA.Ode3C1T.mode	@ltx/en_us_oca/miscellanea:misc.Mode4
ltx/en_us_oca/me.m02.d06:alt1.meMA.Ode3C1T.ode	@ltx/en_us_oca/miscellanea:misc.Ode3
ltx/en_us_oca/me.m02.d06:alt1.meMA.Ode3C1T.text	
ltx/en_us_oca/me.m02.d06:alt1.meMA.Ode3Kathisma1.greekmelody	@ltx/en_us_oca/he.a.m8:heAU.TinSofianKaiLogon.greekname
ltx/en_us_oca/me.m02.d06:alt1.meMA.Ode3Kathisma1.incipit	…
ltx/en_us_oca/me.m02.d06:alt1.meMA.Ode3Kathisma1.melody	@ltx/en_us_oca/he.a.m8:heAU.TinSofianKaiLogon.notmetered
ltx/en_us_oca/me.m02.d06:alt1.meMA.Ode3Kathisma1.mode	@ltx/en_us_oca/miscellanea:misc.Mode8
ltx/en_us_oca/me.m02.d06:alt1.meMA.Ode3Kathisma1.text	
ltx/en_us_oca/me.m02.d06:alt1.meMA.Ode3Kathisma2.greekmelody	@ltx/en_us_oca/he.a.m4:heAU.KateplagiIosif.greekname
ltx/en_us_oca/me.m02.d06:alt1.meMA.Ode3Kathisma2.incipit	@ltx/en_us_oca/me.m02.d02:meMA.Ode3Kathisma1.incipit
ltx/en_us_oca/me.m02.d06:alt1.meMA.Ode3Kathisma2.melody	@ltx/en_us_oca/he.a.m4:heAU.KateplagiIosif.notmetered
ltx/en_us_oca/me.m02.d06:alt1.meMA.Ode3Kathisma2.mode	@ltx/en_us_oca/miscellanea:misc.Mode4
ltx/en_us_oca/me.m02.d06:alt1.meMA.Ode3Kathisma2.text	@ltx/en_us_oca/me.m02.d02:meMA.Ode3Kathisma1.text
ltx/en_us_oca/me.m02.d06:alt1.meMA.Ode4C11.greekmelody	@ltx/en_us_oca/he.h.m4:heHE.OKathimenosEnDoxi.greekname
ltx/en_us_oca/me.m02.d06:alt1.meMA.Ode4C11.incipit	…
ltx/en_us_oca/me.m02.d06:alt1.meMA.Ode4C11.melody	@ltx/en_us_oca/he.h.m4:heHE.OKathimenosEnDoxi.notmetered
ltx/en_us_oca/me.m02.d06:alt1.meMA.Ode4C11.mode	@ltx/en_us_oca/miscellanea:misc.Mode4
ltx/en_us_oca/me.m02.d06:alt1.meMA.Ode4C11.ode	@ltx/en_us_oca/miscellanea:misc.Ode4
ltx/en_us_oca/me.m02.d06:alt1.meMA.Ode4C11.text	
ltx/en_us_oca/me.m02.d06:alt1.meMA.Ode4C12.incipit	…
ltx/en_us_oca/me.m02.d06:alt1.meMA.Ode4C12.melody	@ltx/en_us_oca/he.h.m4:heHE.OKathimenosEnDoxi.notmetered
ltx/en_us_oca/me.m02.d06:alt1.meMA.Ode4C12.mode	@ltx/en_us_oca/miscellanea:misc.Mode4
ltx/en_us_oca/me.m02.d06:alt1.meMA.Ode4C12.ode	@ltx/en_us_oca/miscellanea:misc.Ode4
ltx/en_us_oca/me.m02.d06:alt1.meMA.Ode4C12.text	
ltx/en_us_oca/me.m02.d06:alt1.meMA.Ode4C13.incipit	…
ltx/en_us_oca/me.m02.d06:alt1.meMA.Ode4C13.melody	@ltx/en_us_oca/he.h.m4:heHE.OKathimenosEnDoxi.notmetered
ltx/en_us_oca/me.m02.d06:alt1.meMA.Ode4C13.mode	@ltx/en_us_oca/miscellanea:misc.Mode4
ltx/en_us_oca/me.m02.d06:alt1.meMA.Ode4C13.ode	@ltx/en_us_oca/miscellanea:misc.Ode4
ltx/en_us_oca/me.m02.d06:alt1.meMA.Ode4C13.text	
ltx/en_us_oca/me.m02.d06:alt1.meMA.Ode4C1T.incipit	…
ltx/en_us_oca/me.m02.d06:alt1.meMA.Ode4C1T.melody	@ltx/en_us_oca/he.h.m4:heHE.OKathimenosEnDoxi.notmetered
ltx/en_us_oca/me.m02.d06:alt1.meMA.Ode4C1T.mode	@ltx/en_us_oca/miscellanea:misc.Mode4
ltx/en_us_oca/me.m02.d06:alt1.meMA.Ode4C1T.ode	@ltx/en_us_oca/miscellanea:misc.Ode4
ltx/en_us_oca/me.m02.d06:alt1.meMA.Ode4C1T.text	
ltx/en_us_oca/me.m02.d06:alt1.meMA.Ode5C11.greekmelody	@ltx/en_us_oca/he.h.m4:heHE.ExestiTaSympanta.greekname
ltx/en_us_oca/me.m02.d06:alt1.meMA.Ode5C11.incipit	…
ltx/en_us_oca/me.m02.d06:alt1.meMA.Ode5C11.melody	@ltx/en_us_oca/he.h.m4:heHE.ExestiTaSympanta.notmetered
ltx/en_us_oca/me.m02.d06:alt1.meMA.Ode5C11.mode	@ltx/en_us_oca/miscellanea:misc.Mode4
ltx/en_us_oca/me.m02.d06:alt1.meMA.Ode5C11.ode	@ltx/en_us_oca/miscellanea:misc.Ode5
ltx/en_us_oca/me.m02.d06:alt1.meMA.Ode5C11.text	
ltx/en_us_oca/me.m02.d06:alt1.meMA.Ode5C12.incipit	…
ltx/en_us_oca/me.m02.d06:alt1.meMA.Ode5C12.melody	@ltx/en_us_oca/he.h.m4:heHE.ExestiTaSympanta.notmetered
ltx/en_us_oca/me.m02.d06:alt1.meMA.Ode5C12.mode	@ltx/en_us_oca/miscellanea:misc.Mode4
ltx/en_us_oca/me.m02.d06:alt1.meMA.Ode5C12.ode	@ltx/en_us_oca/miscellanea:misc.Ode5
ltx/en_us_oca/me.m02.d06:alt1.meMA.Ode5C12.text	
ltx/en_us_oca/me.m02.d06:alt1.meMA.Ode5C13.incipit	…
ltx/en_us_oca/me.m02.d06:alt1.meMA.Ode5C13.melody	@ltx/en_us_oca/he.h.m4:heHE.ExestiTaSympanta.notmetered
ltx/en_us_oca/me.m02.d06:alt1.meMA.Ode5C13.mode	@ltx/en_us_oca/miscellanea:misc.Mode4
ltx/en_us_oca/me.m02.d06:alt1.meMA.Ode5C13.ode	@ltx/en_us_oca/miscellanea:misc.Ode5
ltx/en_us_oca/me.m02.d06:alt1.meMA.Ode5C13.text	
ltx/en_us_oca/me.m02.d06:alt1.meMA.Ode5C1T.incipit	…
ltx/en_us_oca/me.m02.d06:alt1.meMA.Ode5C1T.melody	@ltx/en_us_oca/he.h.m4:heHE.ExestiTaSympanta.notmetered
ltx/en_us_oca/me.m02.d06:alt1.meMA.Ode5C1T.mode	@ltx/en_us_oca/miscellanea:misc.Mode4
ltx/en_us_oca/me.m02.d06:alt1.meMA.Ode5C1T.ode	@ltx/en_us_oca/miscellanea:misc.Ode5
ltx/en_us_oca/me.m02.d06:alt1.meMA.Ode5C1T.text	
ltx/en_us_oca/me.m02.d06:alt1.meMA.Ode6C11.greekmelody	@ltx/en_us_oca/he.h.m4:heHE.TinTheianTaftin.greekname
ltx/en_us_oca/me.m02.d06:alt1.meMA.Ode6C11.incipit	…
ltx/en_us_oca/me.m02.d06:alt1.meMA.Ode6C11.melody	@ltx/en_us_oca/he.h.m4:heHE.TinTheianTaftin.notmetered
ltx/en_us_oca/me.m02.d06:alt1.meMA.Ode6C11.mode	@ltx/en_us_oca/miscellanea:misc.Mode4
ltx/en_us_oca/me.m02.d06:alt1.meMA.Ode6C11.ode	@ltx/en_us_oca/miscellanea:misc.Ode6
ltx/en_us_oca/me.m02.d06:alt1.meMA.Ode6C11.text	
ltx/en_us_oca/me.m02.d06:alt1.meMA.Ode6C12.incipit	…
ltx/en_us_oca/me.m02.d06:alt1.meMA.Ode6C12.melody	@ltx/en_us_oca/he.h.m4:heHE.TinTheianTaftin.notmetered
ltx/en_us_oca/me.m02.d06:alt1.meMA.Ode6C12.mode	@ltx/en_us_oca/miscellanea:misc.Mode4
ltx/en_us_oca/me.m02.d06:alt1.meMA.Ode6C12.ode	@ltx/en_us_oca/miscellanea:misc.Ode6
ltx/en_us_oca/me.m02.d06:alt1.meMA.Ode6C12.text	
ltx/en_us_oca/me.m02.d06:alt1.meMA.Ode6C13.incipit	…
ltx/en_us_oca/me.m02.d06:alt1.meMA.Ode6C13.melody	@ltx/en_us_oca/he.h.m4:heHE.TinTheianTaftin.notmetered
ltx/en_us_oca/me.m02.d06:alt1.meMA.Ode6C13.mode	@ltx/en_us_oca/miscellanea:misc.Mode4
ltx/en_us_oca/me.m02.d06:alt1.meMA.Ode6C13.ode	@ltx/en_us_oca/miscellanea:misc.Ode6
ltx/en_us_oca/me.m02.d06:alt1.meMA.Ode6C13.text	
ltx/en_us_oca/me.m02.d06:alt1.meMA.Ode6C1T.incipit	…
ltx/en_us_oca/me.m02.d06:alt1.meMA.Ode6C1T.melody	@ltx/en_us_oca/he.h.m4:heHE.TinTheianTaftin.notmetered
ltx/en_us_oca/me.m02.d06:alt1.meMA.Ode6C1T.mode	@ltx/en_us_oca/miscellanea:misc.Mode4
ltx/en_us_oca/me.m02.d06:alt1.meMA.Ode6C1T.ode	@ltx/en_us_oca/miscellanea:misc.Ode6
ltx/en_us_oca/me.m02.d06:alt1.meMA.Ode6C1T.text	
ltx/en_us_oca/me.m02.d06:alt1.meMA.Ode7C11.greekmelody	@ltx/en_us_oca/he.h.m4:heHE.OukElatrefsan.greekname
ltx/en_us_oca/me.m02.d06:alt1.meMA.Ode7C11.incipit	…
ltx/en_us_oca/me.m02.d06:alt1.meMA.Ode7C11.melody	@ltx/en_us_oca/he.h.m4:heHE.OukElatrefsan.notmetered
ltx/en_us_oca/me.m02.d06:alt1.meMA.Ode7C11.mode	@ltx/en_us_oca/miscellanea:misc.Mode4
ltx/en_us_oca/me.m02.d06:alt1.meMA.Ode7C11.ode	@ltx/en_us_oca/miscellanea:misc.Ode7
ltx/en_us_oca/me.m02.d06:alt1.meMA.Ode7C11.text	
ltx/en_us_oca/me.m02.d06:alt1.meMA.Ode7C12.incipit	…
ltx/en_us_oca/me.m02.d06:alt1.meMA.Ode7C12.melody	@ltx/en_us_oca/he.h.m4:heHE.OukElatrefsan.notmetered
ltx/en_us_oca/me.m02.d06:alt1.meMA.Ode7C12.mode	@ltx/en_us_oca/miscellanea:misc.Mode4
ltx/en_us_oca/me.m02.d06:alt1.meMA.Ode7C12.ode	@ltx/en_us_oca/miscellanea:misc.Ode7
ltx/en_us_oca/me.m02.d06:alt1.meMA.Ode7C12.text	
ltx/en_us_oca/me.m02.d06:alt1.meMA.Ode7C13.incipit	…
ltx/en_us_oca/me.m02.d06:alt1.meMA.Ode7C13.melody	@ltx/en_us_oca/he.h.m4:heHE.OukElatrefsan.notmetered
ltx/en_us_oca/me.m02.d06:alt1.meMA.Ode7C13.mode	@ltx/en_us_oca/miscellanea:misc.Mode4
ltx/en_us_oca/me.m02.d06:alt1.meMA.Ode7C13.ode	@ltx/en_us_oca/miscellanea:misc.Ode7
ltx/en_us_oca/me.m02.d06:alt1.meMA.Ode7C13.text	
ltx/en_us_oca/me.m02.d06:alt1.meMA.Ode7C1T.incipit	…
ltx/en_us_oca/me.m02.d06:alt1.meMA.Ode7C1T.melody	@ltx/en_us_oca/he.h.m4:heHE.OukElatrefsan.notmetered
ltx/en_us_oca/me.m02.d06:alt1.meMA.Ode7C1T.mode	@ltx/en_us_oca/miscellanea:misc.Mode4
ltx/en_us_oca/me.m02.d06:alt1.meMA.Ode7C1T.ode	@ltx/en_us_oca/miscellanea:misc.Ode7
ltx/en_us_oca/me.m02.d06:alt1.meMA.Ode7C1T.text	
ltx/en_us_oca/me.m02.d06:alt1.meMA.Ode8C11.greekmelody	@ltx/en_us_oca/he.h.m4:heHE.PaidasEvageis.greekname
ltx/en_us_oca/me.m02.d06:alt1.meMA.Ode8C11.incipit	…
ltx/en_us_oca/me.m02.d06:alt1.meMA.Ode8C11.melody	@ltx/en_us_oca/he.h.m4:heHE.PaidasEvageis.notmetered
ltx/en_us_oca/me.m02.d06:alt1.meMA.Ode8C11.mode	@ltx/en_us_oca/miscellanea:misc.Mode4
ltx/en_us_oca/me.m02.d06:alt1.meMA.Ode8C11.ode	@ltx/en_us_oca/miscellanea:misc.Ode8
ltx/en_us_oca/me.m02.d06:alt1.meMA.Ode8C11.text	
ltx/en_us_oca/me.m02.d06:alt1.meMA.Ode8C12.incipit	…
ltx/en_us_oca/me.m02.d06:alt1.meMA.Ode8C12.melody	@ltx/en_us_oca/he.h.m4:heHE.PaidasEvageis.notmetered
ltx/en_us_oca/me.m02.d06:alt1.meMA.Ode8C12.mode	@ltx/en_us_oca/miscellanea:misc.Mode4
ltx/en_us_oca/me.m02.d06:alt1.meMA.Ode8C12.ode	@ltx/en_us_oca/miscellanea:misc.Ode8
ltx/en_us_oca/me.m02.d06:alt1.meMA.Ode8C12.text	
ltx/en_us_oca/me.m02.d06:alt1.meMA.Ode8C13.incipit	…
ltx/en_us_oca/me.m02.d06:alt1.meMA.Ode8C13.melody	@ltx/en_us_oca/he.h.m4:heHE.PaidasEvageis.notmetered
ltx/en_us_oca/me.m02.d06:alt1.meMA.Ode8C13.mode	@ltx/en_us_oca/miscellanea:misc.Mode4
ltx/en_us_oca/me.m02.d06:alt1.meMA.Ode8C13.ode	@ltx/en_us_oca/miscellanea:misc.Ode8
ltx/en_us_oca/me.m02.d06:alt1.meMA.Ode8C13.text	
ltx/en_us_oca/me.m02.d06:alt1.meMA.Ode8C1T.incipit	…
ltx/en_us_oca/me.m02.d06:alt1.meMA.Ode8C1T.melody	@ltx/en_us_oca/he.h.m4:heHE.PaidasEvageis.notmetered
ltx/en_us_oca/me.m02.d06:alt1.meMA.Ode8C1T.mode	@ltx/en_us_oca/miscellanea:misc.Mode4
ltx/en_us_oca/me.m02.d06:alt1.meMA.Ode8C1T.ode	@ltx/en_us_oca/miscellanea:misc.Ode8
ltx/en_us_oca/me.m02.d06:alt1.meMA.Ode8C1T.text	
ltx/en_us_oca/me.m02.d06:alt1.meMA.Ode9C11.greekmelody	@ltx/en_us_oca/he.h.m4:heHE.ApasGigenis.greekname
ltx/en_us_oca/me.m02.d06:alt1.meMA.Ode9C11.incipit	…
ltx/en_us_oca/me.m02.d06:alt1.meMA.Ode9C11.melody	@ltx/en_us_oca/he.h.m4:heHE.ApasGigenis.notmetered
ltx/en_us_oca/me.m02.d06:alt1.meMA.Ode9C11.mode	@ltx/en_us_oca/miscellanea:misc.Mode4
ltx/en_us_oca/me.m02.d06:alt1.meMA.Ode9C11.ode	@ltx/en_us_oca/miscellanea:misc.Ode9
ltx/en_us_oca/me.m02.d06:alt1.meMA.Ode9C11.text	
ltx/en_us_oca/me.m02.d06:alt1.meMA.Ode9C12.incipit	…
ltx/en_us_oca/me.m02.d06:alt1.meMA.Ode9C12.melody	@ltx/en_us_oca/he.h.m4:heHE.ApasGigenis.notmetered
ltx/en_us_oca/me.m02.d06:alt1.meMA.Ode9C12.mode	@ltx/en_us_oca/miscellanea:misc.Mode4
ltx/en_us_oca/me.m02.d06:alt1.meMA.Ode9C12.ode	@ltx/en_us_oca/miscellanea:misc.Ode9
ltx/en_us_oca/me.m02.d06:alt1.meMA.Ode9C12.text	
ltx/en_us_oca/me.m02.d06:alt1.meMA.Ode9C13.incipit	…
ltx/en_us_oca/me.m02.d06:alt1.meMA.Ode9C13.melody	@ltx/en_us_oca/he.h.m4:heHE.ApasGigenis.notmetered
ltx/en_us_oca/me.m02.d06:alt1.meMA.Ode9C13.mode	@ltx/en_us_oca/miscellanea:misc.Mode4
ltx/en_us_oca/me.m02.d06:alt1.meMA.Ode9C13.ode	@ltx/en_us_oca/miscellanea:misc.Ode9
ltx/en_us_oca/me.m02.d06:alt1.meMA.Ode9C13.text	
ltx/en_us_oca/me.m02.d06:alt1.meMA.Ode9C1M01.text	
ltx/en_us_oca/me.m02.d06:alt1.meMA.Ode9C1M02.text	
ltx/en_us_oca/me.m02.d06:alt1.meMA.Ode9C1MTh.text	
ltx/en_us_oca/me.m02.d06:alt1.meMA.Ode9C1MTr.text	
ltx/en_us_oca/me.m02.d06:alt1.meMA.Ode9C1T.incipit	…
ltx/en_us_oca/me.m02.d06:alt1.meMA.Ode9C1T.melody	@ltx/en_us_oca/he.h.m4:heHE.ApasGigenis.notmetered
ltx/en_us_oca/me.m02.d06:alt1.meMA.Ode9C1T.mode	@ltx/en_us_oca/miscellanea:misc.Mode4
ltx/en_us_oca/me.m02.d06:alt1.meMA.Ode9C1T.ode	@ltx/en_us_oca/miscellanea:misc.Ode9
ltx/en_us_oca/me.m02.d06:alt1.meMA.Ode9C1T.text	
ltx/en_us_oca/me.m02.d06:alt1.meMA.Oikos1.text	
ltx/en_us_oca/me.m02.d06:alt1.meMA.Oikos12.text	
ltx/en_us_oca/me.m02.d06:alt1.meMA.Oikos13.text	
ltx/en_us_oca/me.m02.d06:alt1.meMA.Oikos14.text	
ltx/en_us_oca/me.m02.d06:alt1.meMA.Oikos15.text	
ltx/en_us_oca/me.m02.d06:alt1.meMA.Oikos16.text	
ltx/en_us_oca/me.m02.d06:alt1.meMA.Oikos17.text	
ltx/en_us_oca/me.m02.d06:alt1.meMA.Oikos18.text	
ltx/en_us_oca/me.m02.d06:alt1.meMA.PostGospelBoth.incipit	@ltx/en_us_oca/ho.ho03:hoMA.PostGospelTheotokos.incipit
ltx/en_us_oca/me.m02.d06:alt1.meMA.PostGospelBoth.melody	
ltx/en_us_oca/me.m02.d06:alt1.meMA.PostGospelBoth.mode	@ltx/en_us_oca/miscellanea:misc.Mode2
ltx/en_us_oca/me.m02.d06:alt1.meMA.PostGospelBoth.text	@ltx/en_us_oca/ho.ho03:hoMA.PostGospelTheotokos.text
ltx/en_us_oca/me.m02.d06:alt1.meMA.PostGospelGlory.incipit	@ltx/en_us_oca/ho.ho03:hoMA.PostGospelHierarch.incipit
ltx/en_us_oca/me.m02.d06:alt1.meMA.PostGospelGlory.melody	
ltx/en_us_oca/me.m02.d06:alt1.meMA.PostGospelGlory.mode	@ltx/en_us_oca/miscellanea:misc.Mode2
ltx/en_us_oca/me.m02.d06:alt1.meMA.PostGospelGlory.text	@ltx/en_us_oca/ho.ho03:hoMA.PostGospelHierarch.text
ltx/en_us_oca/me.m02.d06:alt1.meMA.PostGospelIdiomelon.incipit	@ltx/en_us_oca/me.m01.d01:meVE.LityGlory.incipit
ltx/en_us_oca/me.m02.d06:alt1.meMA.PostGospelIdiomelon.melody	
ltx/en_us_oca/me.m02.d06:alt1.meMA.PostGospelIdiomelon.mode	@ltx/en_us_oca/miscellanea:misc.Mode6
ltx/en_us_oca/me.m02.d06:alt1.meMA.PostGospelIdiomelon.text	@ltx/en_us_oca/me.m01.d01:meVE.LityGlory.text
ltx/en_us_oca/me.m02.d06:alt1.meSV.AposBoth.incipit	…
ltx/en_us_oca/me.m02.d06:alt1.meSV.AposBoth.melody	
ltx/en_us_oca/me.m02.d06:alt1.meSV.AposBoth.mode	@ltx/en_us_oca/miscellanea:misc.Mode2
ltx/en_us_oca/me.m02.d06:alt1.meSV.AposBoth.text	
ltx/en_us_oca/me.m02.d06:alt1.meSV.AposGlory.incipit	…
ltx/en_us_oca/me.m02.d06:alt1.meSV.AposGlory.melody	
ltx/en_us_oca/me.m02.d06:alt1.meSV.AposGlory.mode	@ltx/en_us_oca/miscellanea:misc.Mode2
ltx/en_us_oca/me.m02.d06:alt1.meSV.AposGlory.text	
ltx/en_us_oca/me.m02.d06:alt1.meSV.Aposticha1.greekmelody	@ltx/en_us_oca/he.a.m2:heAU.OikosTouEfratha.greekname
ltx/en_us_oca/me.m02.d06:alt1.meSV.Aposticha1.incipit	…
ltx/en_us_oca/me.m02.d06:alt1.meSV.Aposticha1.melody	@ltx/en_us_oca/he.a.m2:heAU.OikosTouEfratha.notmetered
ltx/en_us_oca/me.m02.d06:alt1.meSV.Aposticha1.mode	@ltx/en_us_oca/miscellanea:misc.Mode2
ltx/en_us_oca/me.m02.d06:alt1.meSV.Aposticha1.text	
ltx/en_us_oca/me.m02.d06:alt1.meSV.Aposticha2.greekmelody	@ltx/en_us_oca/he.a.m2:heAU.OikosTouEfratha.greekname
ltx/en_us_oca/me.m02.d06:alt1.meSV.Aposticha2.incipit	…
ltx/en_us_oca/me.m02.d06:alt1.meSV.Aposticha2.melody	@ltx/en_us_oca/he.a.m2:heAU.OikosTouEfratha.notmetered
ltx/en_us_oca/me.m02.d06:alt1.meSV.Aposticha2.mode	@ltx/en_us_oca/miscellanea:misc.Mode2
ltx/en_us_oca/me.m02.d06:alt1.meSV.Aposticha2.text	
ltx/en_us_oca/me.m02.d06:alt1.meSV.Aposticha3.greekmelody	@ltx/en_us_oca/he.a.m2:heAU.OikosTouEfratha.greekname
ltx/en_us_oca/me.m02.d06:alt1.meSV.Aposticha3.incipit	…
ltx/en_us_oca/me.m02.d06:alt1.meSV.Aposticha3.melody	@ltx/en_us_oca/he.a.m2:heAU.OikosTouEfratha.notmetered
ltx/en_us_oca/me.m02.d06:alt1.meSV.Aposticha3.mode	@ltx/en_us_oca/miscellanea:misc.Mode2
ltx/en_us_oca/me.m02.d06:alt1.meSV.Aposticha3.text	
ltx/en_us_oca/me.m02.d06:alt1.meSV.SticBoth.incipit	…
ltx/en_us_oca/me.m02.d06:alt1.meSV.SticBoth.melody	
ltx/en_us_oca/me.m02.d06:alt1.meSV.SticBoth.mode	@ltx/en_us_oca/miscellanea:misc.Mode8
ltx/en_us_oca/me.m02.d06:alt1.meSV.SticBoth.text	
ltx/en_us_oca/me.m02.d06:alt1.meSV.SticGlory.incipit	…
ltx/en_us_oca/me.m02.d06:alt1.meSV.SticGlory.melody	
ltx/en_us_oca/me.m02.d06:alt1.meSV.SticGlory.mode	@ltx/en_us_oca/miscellanea:misc.Mode8
ltx/en_us_oca/me.m02.d06:alt1.meSV.SticGlory.text	
ltx/en_us_oca/me.m02.d06:alt1.meSV.Stichera1.greekmelody	@ltx/en_us_oca/he.a.m1:heAU.TonOuranionTagmaton.greekname
ltx/en_us_oca/me.m02.d06:alt1.meSV.Stichera1.incipit	…
ltx/en_us_oca/me.m02.d06:alt1.meSV.Stichera1.melody	@ltx/en_us_oca/he.a.m1:heAU.TonOuranionTagmaton.notmetered
ltx/en_us_oca/me.m02.d06:alt1.meSV.Stichera1.mode	@ltx/en_us_oca/miscellanea:misc.Mode1
ltx/en_us_oca/me.m02.d06:alt1.meSV.Stichera1.text	
ltx/en_us_oca/me.m02.d06:alt1.meSV.Stichera2.incipit	…
ltx/en_us_oca/me.m02.d06:alt1.meSV.Stichera2.melody	@ltx/en_us_oca/he.a.m1:heAU.TonOuranionTagmaton.notmetered
ltx/en_us_oca/me.m02.d06:alt1.meSV.Stichera2.mode	@ltx/en_us_oca/miscellanea:misc.Mode1
ltx/en_us_oca/me.m02.d06:alt1.meSV.Stichera2.text	
ltx/en_us_oca/me.m02.d06:alt1.meSV.Stichera3.incipit	…
ltx/en_us_oca/me.m02.d06:alt1.meSV.Stichera3.melody	@ltx/en_us_oca/he.a.m1:heAU.TonOuranionTagmaton.notmetered
ltx/en_us_oca/me.m02.d06:alt1.meSV.Stichera3.mode	@ltx/en_us_oca/miscellanea:misc.Mode1
ltx/en_us_oca/me.m02.d06:alt1.meSV.Stichera3.text	
ltx/en_us_oca/me.m02.d06:alt1.meSV.Stichera4.incipit	…
ltx/en_us_oca/me.m02.d06:alt1.meSV.Stichera4.melody	@ltx/en_us_oca/he.a.m1:heAU.TonOuranionTagmaton.notmetered
ltx/en_us_oca/me.m02.d06:alt1.meSV.Stichera4.mode	@ltx/en_us_oca/miscellanea:misc.Mode1
ltx/en_us_oca/me.m02.d06:alt1.meSV.Stichera4.text	
ltx/en_us_oca/me.m02.d06:alt1.meVE.Apolytikion1.incipit	…
ltx/en_us_oca/me.m02.d06:alt1.meVE.Apolytikion1.melody	
ltx/en_us_oca/me.m02.d06:alt1.meVE.Apolytikion1.mode	@ltx/en_us_oca/miscellanea:misc.Mode4
ltx/en_us_oca/me.m02.d06:alt1.meVE.Apolytikion1.text	
ltx/en_us_oca/me.m02.d06:alt1.meVE.Apolytikion2.greekmelody	@ltx/en_us_oca/he.a.m5:heAU.TonSynanarchonLogon.greekname
ltx/en_us_oca/me.m02.d06:alt1.meVE.Apolytikion2.incipit	…
ltx/en_us_oca/me.m02.d06:alt1.meVE.Apolytikion2.melody	@ltx/en_us_oca/he.a.m5:heAU.TonSynanarchonLogon.notmetered
ltx/en_us_oca/me.m02.d06:alt1.meVE.Apolytikion2.mode	@ltx/en_us_oca/miscellanea:misc.Mode5
ltx/en_us_oca/me.m02.d06:alt1.meVE.Apolytikion2.text	
ltx/en_us_oca/me.m02.d06:alt1.meVE.AposBoth.incipit	@ltx/en_us_oca/me.m02.d02:meVE.Lity8.incipit
ltx/en_us_oca/me.m02.d06:alt1.meVE.AposBoth.melody	
ltx/en_us_oca/me.m02.d06:alt1.meVE.AposBoth.mode	@ltx/en_us_oca/miscellanea:misc.Mode4
ltx/en_us_oca/me.m02.d06:alt1.meVE.AposBoth.poet	@ltx/en_us_oca/poets:po.AndreouKritis
ltx/en_us_oca/me.m02.d06:alt1.meVE.AposBoth.text	@ltx/en_us_oca/me.m02.d02:meVE.Lity8.text
ltx/en_us_oca/me.m02.d06:alt1.meVE.AposGlory.incipit	…
ltx/en_us_oca/me.m02.d06:alt1.meVE.AposGlory.melody	
ltx/en_us_oca/me.m02.d06:alt1.meVE.AposGlory.mode	@ltx/en_us_oca/miscellanea:misc.Mode4
ltx/en_us_oca/me.m02.d06:alt1.meVE.AposGlory.text	
ltx/en_us_oca/me.m02.d06:alt1.meVE.Aposticha1.greekmelody	@ltx/en_us_oca/he.a.m5:heAU.ChairoisAskitikon.greekname
ltx/en_us_oca/me.m02.d06:alt1.meVE.Aposticha1.incipit	…
ltx/en_us_oca/me.m02.d06:alt1.meVE.Aposticha1.melody	@ltx/en_us_oca/he.a.m5:heAU.ChairoisAskitikon.notmetered
ltx/en_us_oca/me.m02.d06:alt1.meVE.Aposticha1.mode	@ltx/en_us_oca/miscellanea:misc.Mode5
ltx/en_us_oca/me.m02.d06:alt1.meVE.Aposticha1.text	
ltx/en_us_oca/me.m02.d06:alt1.meVE.Aposticha2.greekmelody	@ltx/en_us_oca/he.a.m5:heAU.ChairoisAskitikon.greekname
ltx/en_us_oca/me.m02.d06:alt1.meVE.Aposticha2.incipit	…
ltx/en_us_oca/me.m02.d06:alt1.meVE.Aposticha2.melody	@ltx/en_us_oca/he.a.m5:heAU.ChairoisAskitikon.notmetered
ltx/en_us_oca/me.m02.d06:alt1.meVE.Aposticha2.mode	@ltx/en_us_oca/miscellanea:misc.Mode5
ltx/en_us_oca/me.m02.d06:alt1.meVE.Aposticha2.text	
ltx/en_us_oca/me.m02.d06:alt1.meVE.Aposticha3.greekmelody	@ltx/en_us_oca/he.a.m5:heAU.ChairoisAskitikon.greekname
ltx/en_us_oca/me.m02.d06:alt1.meVE.Aposticha3.incipit	…
ltx/en_us_oca/me.m02.d06:alt1.meVE.Aposticha3.melody	@ltx/en_us_oca/he.a.m5:heAU.ChairoisAskitikon.notmetered
ltx/en_us_oca/me.m02.d06:alt1.meVE.Aposticha3.mode	@ltx/en_us_oca/miscellanea:misc.Mode5
ltx/en_us_oca/me.m02.d06:alt1.meVE.Aposticha3.text	
ltx/en_us_oca/me.m02.d06:alt1.meVE.Lity1.incipit	…
ltx/en_us_oca/me.m02.d06:alt1.meVE.Lity1.melody	
ltx/en_us_oca/me.m02.d06:alt1.meVE.Lity1.mode	@ltx/en_us_oca/miscellanea:misc.Mode1
ltx/en_us_oca/me.m02.d06:alt1.meVE.Lity1.text	
ltx/en_us_oca/me.m02.d06:alt1.meVE.Lity2.incipit	…
ltx/en_us_oca/me.m02.d06:alt1.meVE.Lity2.melody	
ltx/en_us_oca/me.m02.d06:alt1.meVE.Lity2.mode	@ltx/en_us_oca/miscellanea:misc.Mode2
ltx/en_us_oca/me.m02.d06:alt1.meVE.Lity2.text	
ltx/en_us_oca/me.m02.d06:alt1.meVE.Lity3.incipit	…
ltx/en_us_oca/me.m02.d06:alt1.meVE.Lity3.melody	
ltx/en_us_oca/me.m02.d06:alt1.meVE.Lity3.mode	@ltx/en_us_oca/miscellanea:misc.Mode6
ltx/en_us_oca/me.m02.d06:alt1.meVE.Lity3.text	
ltx/en_us_oca/me.m02.d06:alt1.meVE.LityBoth.incipit	@ltx/en_us_oca/me.m02.d02:meVE.LityBoth.incipit
ltx/en_us_oca/me.m02.d06:alt1.meVE.LityBoth.melody	
ltx/en_us_oca/me.m02.d06:alt1.meVE.LityBoth.mode	@ltx/en_us_oca/miscellanea:misc.Mode2
ltx/en_us_oca/me.m02.d06:alt1.meVE.LityBoth.poet	@ltx/en_us_oca/poets:po.GermanouOiDeAnatoliou
ltx/en_us_oca/me.m02.d06:alt1.meVE.LityBoth.text	@ltx/en_us_oca/me.m02.d02:meVE.LityBoth.text
ltx/en_us_oca/me.m02.d06:alt1.meVE.LityGlory.incipit	…
ltx/en_us_oca/me.m02.d06:alt1.meVE.LityGlory.melody	
ltx/en_us_oca/me.m02.d06:alt1.meVE.LityGlory.mode	@ltx/en_us_oca/miscellanea:misc.Mode6
ltx/en_us_oca/me.m02.d06:alt1.meVE.LityGlory.text	
ltx/en_us_oca/me.m02.d06:alt1.meVE.SticBoth.incipit	@ltx/en_us_oca/me.m02.d02:meVE.SticGlory.incipit
ltx/en_us_oca/me.m02.d06:alt1.meVE.SticBoth.melody	
ltx/en_us_oca/me.m02.d06:alt1.meVE.SticBoth.mode	@ltx/en_us_oca/miscellanea:misc.Mode6
ltx/en_us_oca/me.m02.d06:alt1.meVE.SticBoth.poet	@ltx/en_us_oca/poets:po.IoannouMonachou
ltx/en_us_oca/me.m02.d06:alt1.meVE.SticBoth.text	@ltx/en_us_oca/me.m02.d02:meVE.SticGlory.text
ltx/en_us_oca/me.m02.d06:alt1.meVE.SticGlory.incipit	…
ltx/en_us_oca/me.m02.d06:alt1.meVE.SticGlory.melody	
ltx/en_us_oca/me.m02.d06:alt1.meVE.SticGlory.mode	@ltx/en_us_oca/miscellanea:misc.Mode6
ltx/en_us_oca/me.m02.d06:alt1.meVE.SticGlory.text	
ltx/en_us_oca/me.m02.d06:alt1.meVE.Stichera01.greekmelody	@ltx/en_us_oca/he.a.m2:heAU.OteEkTouXylou.greekname
ltx/en_us_oca/me.m02.d06:alt1.meVE.Stichera01.incipit	…
ltx/en_us_oca/me.m02.d06:alt1.meVE.Stichera01.melody	@ltx/en_us_oca/he.a.m2:heAU.OteEkTouXylou.notmetered
ltx/en_us_oca/me.m02.d06:alt1.meVE.Stichera01.mode	@ltx/en_us_oca/miscellanea:misc.Mode2
ltx/en_us_oca/me.m02.d06:alt1.meVE.Stichera01.text	
ltx/en_us_oca/me.m02.d06:alt1.meVE.Stichera02.incipit	…
ltx/en_us_oca/me.m02.d06:alt1.meVE.Stichera02.melody	@ltx/en_us_oca/he.a.m2:heAU.OteEkTouXylou.notmetered
ltx/en_us_oca/me.m02.d06:alt1.meVE.Stichera02.mode	@ltx/en_us_oca/miscellanea:misc.Mode2
ltx/en_us_oca/me.m02.d06:alt1.meVE.Stichera02.text	
ltx/en_us_oca/me.m02.d06:alt1.meVE.Stichera03.incipit	…
ltx/en_us_oca/me.m02.d06:alt1.meVE.Stichera03.melody	@ltx/en_us_oca/he.a.m2:heAU.OteEkTouXylou.notmetered
ltx/en_us_oca/me.m02.d06:alt1.meVE.Stichera03.mode	@ltx/en_us_oca/miscellanea:misc.Mode2
ltx/en_us_oca/me.m02.d06:alt1.meVE.Stichera03.text	
ltx/en_us_oca/me.m02.d06:alt1.meVE.Stichera04.greekmelody	@ltx/en_us_oca/he.a.m4:heAU.OsGennaionEnMartysi.greekname
ltx/en_us_oca/me.m02.d06:alt1.meVE.Stichera04.incipit	…
ltx/en_us_oca/me.m02.d06:alt1.meVE.Stichera04.melody	@ltx/en_us_oca/he.a.m4:heAU.OsGennaionEnMartysi.notmetered
ltx/en_us_oca/me.m02.d06:alt1.meVE.Stichera04.mode	@ltx/en_us_oca/miscellanea:misc.Mode4
ltx/en_us_oca/me.m02.d06:alt1.meVE.Stichera04.text	
ltx/en_us_oca/me.m02.d06:alt1.meVE.Stichera05.greekmelody	@ltx/en_us_oca/he.a.m4:heAU.OsGennaionEnMartysi.greekname
ltx/en_us_oca/me.m02.d06:alt1.meVE.Stichera05.incipit	…
ltx/en_us_oca/me.m02.d06:alt1.meVE.Stichera05.melody	@ltx/en_us_oca/he.a.m4:heAU.OsGennaionEnMartysi.notmetered
ltx/en_us_oca/me.m02.d06:alt1.meVE.Stichera05.mode	@ltx/en_us_oca/miscellanea:misc.Mode4
ltx/en_us_oca/me.m02.d06:alt1.meVE.Stichera05.text	
ltx/en_us_oca/me.m02.d06:alt1.meVE.Stichera06.incipit	…
ltx/en_us_oca/me.m02.d06:alt1.meVE.Stichera06.melody	@ltx/en_us_oca/he.a.m4:heAU.OsGennaionEnMartysi.notmetered
ltx/en_us_oca/me.m02.d06:alt1.meVE.Stichera06.mode	@ltx/en_us_oca/miscellanea:misc.Mode4
ltx/en_us_oca/me.m02.d06:alt1.meVE.Stichera06.text	
ltx/en_us_oca/me.m02.d06:alt2.meCoupletv1.text	
ltx/en_us_oca/me.m02.d06:alt2.meCoupletv2.text	
ltx/en_us_oca/me.m02.d06:alt2.meDA.commemoration.first_name	
ltx/en_us_oca/me.m02.d06:alt2.meDA.commemoration.first_short	
ltx/en_us_oca/me.m02.d06:alt2.meDA.commemoration.first_title	
ltx/en_us_oca/me.m02.d06:alt2.meDA.commemoration.full	
ltx/en_us_oca/me.m02.d06:alt2.meDA.commemoration.second_name	
ltx/en_us_oca/me.m02.d06:alt2.meDA.commemoration.second_title	
ltx/en_us_oca/me.m02.d06:alt2.meDA.date	
ltx/en_us_oca/me.m02.d06:alt2.meDA.dismissal	@ltx/en_us_oca/dismissals:dis00.meeting
ltx/en_us_oca/me.m02.d06:alt2.meDA.insert1	
ltx/en_us_oca/me.m02.d06:alt2.meDA.insert2	
ltx/en_us_oca/me.m02.d06:alt2.meDA.note	
ltx/en_us_oca/me.m02.d06:alt2.meHO.commemorations	
ltx/en_us_oca/me.m02.d06:alt2.meHO.note1	
ltx/en_us_oca/me.m02.d06:alt2.meHO.note2	
ltx/en_us_oca/me.m02.d06:alt2.meHO.number	
ltx/en_us_oca/me.m02.d06:alt2.meHO.rank	
ltx/en_us_oca/me.m02.d06:alt2.meLE.commemoration1	
ltx/en_us_oca/me.m02.d06:alt2.meLE.commemoration2	
ltx/en_us_oca/me.m02.d06:alt2.meLI.Kontakion1.incipit	@ltx/en_us_oca/me.m02.d06:alt2.meMA.Kontakion1.incipit
ltx/en_us_oca/me.m02.d06:alt2.meLI.Kontakion1.melody	@ltx/en_us_oca/me.m02.d06:alt2.meMA.Kontakion1.melody
ltx/en_us_oca/me.m02.d06:alt2.meLI.Kontakion1.mode	@ltx/en_us_oca/me.m02.d06:alt2.meMA.Kontakion1.mode
ltx/en_us_oca/me.m02.d06:alt2.meLI.Kontakion1.text	@ltx/en_us_oca/me.m02.d06:alt2.meMA.Kontakion1.text
ltx/en_us_oca/me.m02.d06:alt2.meLI.MM.CommunionHymn.text	@ltx/en_us_oca/properties:media.key
ltx/en_us_oca/me.m02.d06:alt2.meLI.MM.EntranceHymn.text	@ltx/en_us_oca/properties:media.key
ltx/en_us_oca/me.m02.d06:alt2.meLI.Megalynarion.text	
ltx/en_us_oca/me.m02.d06:alt2.meMA.C1.acrostic.notice1	
ltx/en_us_oca/me.m02.d06:alt2.meMA.C1.acrostic.text	
ltx/en_us_oca/me.m02.d06:alt2.meMA.C1.acrostic.title	
ltx/en_us_oca/me.m02.d06:alt2.meMA.C1.poet	@ltx/en_us_oca/poets:po.GerasimouMonachouMikragiannanitou
ltx/en_us_oca/me.m02.d06:alt2.meMA.C1.title	@ltx/en_us_oca/titles:ti.CanonSaints
ltx/en_us_oca/me.m02.d06:alt2.meMA.C1.verse	@ltx/en_us_oca/prayers:pr.verse_DevoutMen.text
ltx/en_us_oca/me.m02.d06:alt2.meMA.Exaposteilarion1.greekmelody	@ltx/en_us_oca/he.a.m2:heAU.GynaikesAkoutisthite.greekname
ltx/en_us_oca/me.m02.d06:alt2.meMA.Exaposteilarion1.incipit	…
ltx/en_us_oca/me.m02.d06:alt2.meMA.Exaposteilarion1.melody	@ltx/en_us_oca/he.a.m2:heAU.GynaikesAkoutisthite.notmetered
ltx/en_us_oca/me.m02.d06:alt2.meMA.Exaposteilarion1.mode	@ltx/en_us_oca/miscellanea:misc.Mode2
ltx/en_us_oca/me.m02.d06:alt2.meMA.Exaposteilarion1.text	
ltx/en_us_oca/me.m02.d06:alt2.meMA.Exaposteilarion2.greekmelody	@ltx/en_us_oca/he.a.m2:heAU.GynaikesAkoutisthite.greekname
ltx/en_us_oca/me.m02.d06:alt2.meMA.Exaposteilarion2.incipit	…
ltx/en_us_oca/me.m02.d06:alt2.meMA.Exaposteilarion2.melody	@ltx/en_us_oca/he.a.m2:heAU.GynaikesAkoutisthite.notmetered
ltx/en_us_oca/me.m02.d06:alt2.meMA.Exaposteilarion2.mode	@ltx/en_us_oca/miscellanea:misc.Mode2
ltx/en_us_oca/me.m02.d06:alt2.meMA.Exaposteilarion2.text	
ltx/en_us_oca/me.m02.d06:alt2.meMA.Kathisma11.greekmelody	@ltx/en_us_oca/he.a.m1:heAU.TonTafonSouSotir.greekname
ltx/en_us_oca/me.m02.d06:alt2.meMA.Kathisma11.incipit	…
ltx/en_us_oca/me.m02.d06:alt2.meMA.Kathisma11.melody	@ltx/en_us_oca/he.a.m1:heAU.TonTafonSouSotir.notmetered
ltx/en_us_oca/me.m02.d06:alt2.meMA.Kathisma11.mode	@ltx/en_us_oca/miscellanea:misc.Mode1
ltx/en_us_oca/me.m02.d06:alt2.meMA.Kathisma11.text	
ltx/en_us_oca/me.m02.d06:alt2.meMA.Kathisma12.greekmelody	@ltx/en_us_oca/he.a.m1:heAU.TonTafonSouSotir.greekname
ltx/en_us_oca/me.m02.d06:alt2.meMA.Kathisma12.incipit	…
ltx/en_us_oca/me.m02.d06:alt2.meMA.Kathisma12.melody	@ltx/en_us_oca/he.a.m1:heAU.TonTafonSouSotir.notmetered
ltx/en_us_oca/me.m02.d06:alt2.meMA.Kathisma12.mode	@ltx/en_us_oca/miscellanea:misc.Mode1
ltx/en_us_oca/me.m02.d06:alt2.meMA.Kathisma12.text	
ltx/en_us_oca/me.m02.d06:alt2.meMA.Kathisma21.greekmelody	@ltx/en_us_oca/he.a.m3:heAU.TheiasPisteos.greekname
ltx/en_us_oca/me.m02.d06:alt2.meMA.Kathisma21.incipit	…
ltx/en_us_oca/me.m02.d06:alt2.meMA.Kathisma21.melody	@ltx/en_us_oca/he.a.m3:heAU.TheiasPisteos.notmetered
ltx/en_us_oca/me.m02.d06:alt2.meMA.Kathisma21.mode	@ltx/en_us_oca/miscellanea:misc.Mode3
ltx/en_us_oca/me.m02.d06:alt2.meMA.Kathisma21.text	
ltx/en_us_oca/me.m02.d06:alt2.meMA.Kathisma22.greekmelody	@ltx/en_us_oca/he.a.m3:heAU.TheiasPisteos.greekname
ltx/en_us_oca/me.m02.d06:alt2.meMA.Kathisma22.incipit	…
ltx/en_us_oca/me.m02.d06:alt2.meMA.Kathisma22.melody	@ltx/en_us_oca/he.a.m3:heAU.TheiasPisteos.notmetered
ltx/en_us_oca/me.m02.d06:alt2.meMA.Kathisma22.mode	@ltx/en_us_oca/miscellanea:misc.Mode3
ltx/en_us_oca/me.m02.d06:alt2.meMA.Kathisma22.text	
ltx/en_us_oca/me.m02.d06:alt2.meMA.Kathisma31.greekmelody	@ltx/en_us_oca/he.a.m4:heAU.OYpsotheisEnToStavro.greekname
ltx/en_us_oca/me.m02.d06:alt2.meMA.Kathisma31.incipit	…
ltx/en_us_oca/me.m02.d06:alt2.meMA.Kathisma31.melody	@ltx/en_us_oca/he.a.m4:heAU.OYpsotheisEnToStavro.notmetered
ltx/en_us_oca/me.m02.d06:alt2.meMA.Kathisma31.mode	@ltx/en_us_oca/miscellanea:misc.Mode4
ltx/en_us_oca/me.m02.d06:alt2.meMA.Kathisma31.text	
ltx/en_us_oca/me.m02.d06:alt2.meMA.Kathisma32.greekmelody	@ltx/en_us_oca/he.a.m4:heAU.OYpsotheisEnToStavro.greekname
ltx/en_us_oca/me.m02.d06:alt2.meMA.Kathisma32.incipit	…
ltx/en_us_oca/me.m02.d06:alt2.meMA.Kathisma32.melody	@ltx/en_us_oca/he.a.m4:heAU.OYpsotheisEnToStavro.notmetered
ltx/en_us_oca/me.m02.d06:alt2.meMA.Kathisma32.mode	@ltx/en_us_oca/miscellanea:misc.Mode4
ltx/en_us_oca/me.m02.d06:alt2.meMA.Kathisma32.text	
ltx/en_us_oca/me.m02.d06:alt2.meMA.Kontakion1.greekmelody	@ltx/en_us_oca/he.a.m3:heAU.IParthenosSimeron.greekname
ltx/en_us_oca/me.m02.d06:alt2.meMA.Kontakion1.incipit	…
ltx/en_us_oca/me.m02.d06:alt2.meMA.Kontakion1.melody	@ltx/en_us_oca/he.a.m3:heAU.IParthenosSimeron.notmetered
ltx/en_us_oca/me.m02.d06:alt2.meMA.Kontakion1.mode	@ltx/en_us_oca/miscellanea:misc.Mode3
ltx/en_us_oca/me.m02.d06:alt2.meMA.Kontakion1.text	
ltx/en_us_oca/me.m02.d06:alt2.meMA.Lauds1.greekmelody	@ltx/en_us_oca/he.a.m8:heAU.OTouParadoxou.greekname
ltx/en_us_oca/me.m02.d06:alt2.meMA.Lauds1.incipit	…
ltx/en_us_oca/me.m02.d06:alt2.meMA.Lauds1.melody	@ltx/en_us_oca/he.a.m8:heAU.OTouParadoxou.notmetered
ltx/en_us_oca/me.m02.d06:alt2.meMA.Lauds1.mode	@ltx/en_us_oca/miscellanea:misc.Mode8
ltx/en_us_oca/me.m02.d06:alt2.meMA.Lauds1.text	
ltx/en_us_oca/me.m02.d06:alt2.meMA.Lauds2.greekmelody	@ltx/en_us_oca/he.a.m8:heAU.OTouParadoxou.greekname
ltx/en_us_oca/me.m02.d06:alt2.meMA.Lauds2.incipit	…
ltx/en_us_oca/me.m02.d06:alt2.meMA.Lauds2.melody	@ltx/en_us_oca/he.a.m8:heAU.OTouParadoxou.notmetered
ltx/en_us_oca/me.m02.d06:alt2.meMA.Lauds2.mode	@ltx/en_us_oca/miscellanea:misc.Mode8
ltx/en_us_oca/me.m02.d06:alt2.meMA.Lauds2.text	
ltx/en_us_oca/me.m02.d06:alt2.meMA.Lauds3.greekmelody	@ltx/en_us_oca/he.a.m8:heAU.OTouParadoxou.greekname
ltx/en_us_oca/me.m02.d06:alt2.meMA.Lauds3.incipit	…
ltx/en_us_oca/me.m02.d06:alt2.meMA.Lauds3.melody	@ltx/en_us_oca/he.a.m8:heAU.OTouParadoxou.notmetered
ltx/en_us_oca/me.m02.d06:alt2.meMA.Lauds3.mode	@ltx/en_us_oca/miscellanea:misc.Mode8
ltx/en_us_oca/me.m02.d06:alt2.meMA.Lauds3.text	
ltx/en_us_oca/me.m02.d06:alt2.meMA.Lauds4.greekmelody	@ltx/en_us_oca/he.a.m8:heAU.OTouParadoxou.greekname
ltx/en_us_oca/me.m02.d06:alt2.meMA.Lauds4.incipit	…
ltx/en_us_oca/me.m02.d06:alt2.meMA.Lauds4.melody	@ltx/en_us_oca/he.a.m8:heAU.OTouParadoxou.notmetered
ltx/en_us_oca/me.m02.d06:alt2.meMA.Lauds4.mode	@ltx/en_us_oca/miscellanea:misc.Mode8
ltx/en_us_oca/me.m02.d06:alt2.meMA.Lauds4.text	
ltx/en_us_oca/me.m02.d06:alt2.meMA.LaudsGlory.incipit	…
ltx/en_us_oca/me.m02.d06:alt2.meMA.LaudsGlory.melody	
ltx/en_us_oca/me.m02.d06:alt2.meMA.LaudsGlory.mode	@ltx/en_us_oca/miscellanea:misc.Mode8
ltx/en_us_oca/me.m02.d06:alt2.meMA.LaudsGlory.text	
ltx/en_us_oca/me.m02.d06:alt2.meMA.MM.LaudsSunday.text	@ltx/en_us_oca/properties:media.key
ltx/en_us_oca/me.m02.d06:alt2.meMA.Ode1C11.greekmelody	@ltx/en_us_oca/he.h.m8:heHE.ArmatilatinFarao.greekname
ltx/en_us_oca/me.m02.d06:alt2.meMA.Ode1C11.incipit	…
ltx/en_us_oca/me.m02.d06:alt2.meMA.Ode1C11.melody	@ltx/en_us_oca/he.h.m8:heHE.ArmatilatinFarao.notmetered
ltx/en_us_oca/me.m02.d06:alt2.meMA.Ode1C11.mode	@ltx/en_us_oca/miscellanea:misc.Mode8
ltx/en_us_oca/me.m02.d06:alt2.meMA.Ode1C11.ode	@ltx/en_us_oca/miscellanea:misc.Ode1
ltx/en_us_oca/me.m02.d06:alt2.meMA.Ode1C11.text	
ltx/en_us_oca/me.m02.d06:alt2.meMA.Ode1C12.incipit	…
ltx/en_us_oca/me.m02.d06:alt2.meMA.Ode1C12.melody	@ltx/en_us_oca/he.h.m8:heHE.ArmatilatinFarao.notmetered
ltx/en_us_oca/me.m02.d06:alt2.meMA.Ode1C12.mode	@ltx/en_us_oca/miscellanea:misc.Mode8
ltx/en_us_oca/me.m02.d06:alt2.meMA.Ode1C12.ode	@ltx/en_us_oca/miscellanea:misc.Ode1
ltx/en_us_oca/me.m02.d06:alt2.meMA.Ode1C12.text	
ltx/en_us_oca/me.m02.d06:alt2.meMA.Ode1C13.incipit	…
ltx/en_us_oca/me.m02.d06:alt2.meMA.Ode1C13.melody	@ltx/en_us_oca/he.h.m8:heHE.ArmatilatinFarao.notmetered
ltx/en_us_oca/me.m02.d06:alt2.meMA.Ode1C13.mode	@ltx/en_us_oca/miscellanea:misc.Mode8
ltx/en_us_oca/me.m02.d06:alt2.meMA.Ode1C13.ode	@ltx/en_us_oca/miscellanea:misc.Ode1
ltx/en_us_oca/me.m02.d06:alt2.meMA.Ode1C13.text	
ltx/en_us_oca/me.m02.d06:alt2.meMA.Ode1C1T.incipit	…
ltx/en_us_oca/me.m02.d06:alt2.meMA.Ode1C1T.melody	@ltx/en_us_oca/he.h.m8:heHE.ArmatilatinFarao.notmetered
ltx/en_us_oca/me.m02.d06:alt2.meMA.Ode1C1T.mode	@ltx/en_us_oca/miscellanea:misc.Mode8
ltx/en_us_oca/me.m02.d06:alt2.meMA.Ode1C1T.ode	@ltx/en_us_oca/miscellanea:misc.Ode1
ltx/en_us_oca/me.m02.d06:alt2.meMA.Ode1C1T.text	
ltx/en_us_oca/me.m02.d06:alt2.meMA.Ode3C11.greekmelody	@ltx/en_us_oca/he.h.m8:heHE.OStereosasKatArchas.greekname
ltx/en_us_oca/me.m02.d06:alt2.meMA.Ode3C11.incipit	…
ltx/en_us_oca/me.m02.d06:alt2.meMA.Ode3C11.melody	@ltx/en_us_oca/he.h.m8:heHE.OStereosasKatArchas.notmetered
ltx/en_us_oca/me.m02.d06:alt2.meMA.Ode3C11.mode	@ltx/en_us_oca/miscellanea:misc.Mode8
ltx/en_us_oca/me.m02.d06:alt2.meMA.Ode3C11.ode	@ltx/en_us_oca/miscellanea:misc.Ode3
ltx/en_us_oca/me.m02.d06:alt2.meMA.Ode3C11.text	
ltx/en_us_oca/me.m02.d06:alt2.meMA.Ode3C12.incipit	…
ltx/en_us_oca/me.m02.d06:alt2.meMA.Ode3C12.melody	@ltx/en_us_oca/he.h.m8:heHE.OStereosasKatArchas.notmetered
ltx/en_us_oca/me.m02.d06:alt2.meMA.Ode3C12.mode	@ltx/en_us_oca/miscellanea:misc.Mode8
ltx/en_us_oca/me.m02.d06:alt2.meMA.Ode3C12.ode	@ltx/en_us_oca/miscellanea:misc.Ode3
ltx/en_us_oca/me.m02.d06:alt2.meMA.Ode3C12.text	
ltx/en_us_oca/me.m02.d06:alt2.meMA.Ode3C13.incipit	…
ltx/en_us_oca/me.m02.d06:alt2.meMA.Ode3C13.melody	@ltx/en_us_oca/he.h.m8:heHE.OStereosasKatArchas.notmetered
ltx/en_us_oca/me.m02.d06:alt2.meMA.Ode3C13.mode	@ltx/en_us_oca/miscellanea:misc.Mode8
ltx/en_us_oca/me.m02.d06:alt2.meMA.Ode3C13.ode	@ltx/en_us_oca/miscellanea:misc.Ode3
ltx/en_us_oca/me.m02.d06:alt2.meMA.Ode3C13.text	
ltx/en_us_oca/me.m02.d06:alt2.meMA.Ode3C1T.incipit	…
ltx/en_us_oca/me.m02.d06:alt2.meMA.Ode3C1T.melody	@ltx/en_us_oca/he.h.m8:heHE.OStereosasKatArchas.notmetered
ltx/en_us_oca/me.m02.d06:alt2.meMA.Ode3C1T.mode	@ltx/en_us_oca/miscellanea:misc.Mode8
ltx/en_us_oca/me.m02.d06:alt2.meMA.Ode3C1T.ode	@ltx/en_us_oca/miscellanea:misc.Ode3
ltx/en_us_oca/me.m02.d06:alt2.meMA.Ode3C1T.text	
ltx/en_us_oca/me.m02.d06:alt2.meMA.Ode3Kathisma1.greekmelody	@ltx/en_us_oca/he.a.m4:heAU.TachyProkatalave.greekname
ltx/en_us_oca/me.m02.d06:alt2.meMA.Ode3Kathisma1.incipit	…
ltx/en_us_oca/me.m02.d06:alt2.meMA.Ode3Kathisma1.melody	@ltx/en_us_oca/he.a.m4:heAU.TachyProkatalave.notmetered
ltx/en_us_oca/me.m02.d06:alt2.meMA.Ode3Kathisma1.mode	@ltx/en_us_oca/miscellanea:misc.Mode4
ltx/en_us_oca/me.m02.d06:alt2.meMA.Ode3Kathisma1.text	
ltx/en_us_oca/me.m02.d06:alt2.meMA.Ode3Kathisma2.greekmelody	@ltx/en_us_oca/he.a.m4:heAU.TachyProkatalave.greekname
ltx/en_us_oca/me.m02.d06:alt2.meMA.Ode3Kathisma2.incipit	…
ltx/en_us_oca/me.m02.d06:alt2.meMA.Ode3Kathisma2.melody	@ltx/en_us_oca/he.a.m4:heAU.TachyProkatalave.notmetered
ltx/en_us_oca/me.m02.d06:alt2.meMA.Ode3Kathisma2.mode	@ltx/en_us_oca/miscellanea:misc.Mode4
ltx/en_us_oca/me.m02.d06:alt2.meMA.Ode3Kathisma2.text	
ltx/en_us_oca/me.m02.d06:alt2.meMA.Ode4C11.greekmelody	@ltx/en_us_oca/he.h.m8:heHE.SyMouIschys.greekname
ltx/en_us_oca/me.m02.d06:alt2.meMA.Ode4C11.incipit	…
ltx/en_us_oca/me.m02.d06:alt2.meMA.Ode4C11.melody	@ltx/en_us_oca/he.h.m8:heHE.SyMouIschys.notmetered
ltx/en_us_oca/me.m02.d06:alt2.meMA.Ode4C11.mode	@ltx/en_us_oca/miscellanea:misc.Mode8
ltx/en_us_oca/me.m02.d06:alt2.meMA.Ode4C11.ode	@ltx/en_us_oca/miscellanea:misc.Ode4
ltx/en_us_oca/me.m02.d06:alt2.meMA.Ode4C11.text	
ltx/en_us_oca/me.m02.d06:alt2.meMA.Ode4C12.incipit	…
ltx/en_us_oca/me.m02.d06:alt2.meMA.Ode4C12.melody	@ltx/en_us_oca/he.h.m8:heHE.SyMouIschys.notmetered
ltx/en_us_oca/me.m02.d06:alt2.meMA.Ode4C12.mode	@ltx/en_us_oca/miscellanea:misc.Mode8
ltx/en_us_oca/me.m02.d06:alt2.meMA.Ode4C12.ode	@ltx/en_us_oca/miscellanea:misc.Ode4
ltx/en_us_oca/me.m02.d06:alt2.meMA.Ode4C12.text	
ltx/en_us_oca/me.m02.d06:alt2.meMA.Ode4C13.incipit	…
ltx/en_us_oca/me.m02.d06:alt2.meMA.Ode4C13.melody	@ltx/en_us_oca/he.h.m8:heHE.SyMouIschys.notmetered
ltx/en_us_oca/me.m02.d06:alt2.meMA.Ode4C13.mode	@ltx/en_us_oca/miscellanea:misc.Mode8
ltx/en_us_oca/me.m02.d06:alt2.meMA.Ode4C13.ode	@ltx/en_us_oca/miscellanea:misc.Ode4
ltx/en_us_oca/me.m02.d06:alt2.meMA.Ode4C13.text	
ltx/en_us_oca/me.m02.d06:alt2.meMA.Ode4C14.incipit	…
ltx/en_us_oca/me.m02.d06:alt2.meMA.Ode4C14.melody	@ltx/en_us_oca/he.h.m8:heHE.SyMouIschys.notmetered
ltx/en_us_oca/me.m02.d06:alt2.meMA.Ode4C14.mode	@ltx/en_us_oca/miscellanea:misc.Mode8
ltx/en_us_oca/me.m02.d06:alt2.meMA.Ode4C14.ode	@ltx/en_us_oca/miscellanea:misc.Ode4
ltx/en_us_oca/me.m02.d06:alt2.meMA.Ode4C14.text	
ltx/en_us_oca/me.m02.d06:alt2.meMA.Ode4C1T.incipit	…
ltx/en_us_oca/me.m02.d06:alt2.meMA.Ode4C1T.melody	@ltx/en_us_oca/he.h.m8:heHE.SyMouIschys.notmetered
ltx/en_us_oca/me.m02.d06:alt2.meMA.Ode4C1T.mode	@ltx/en_us_oca/miscellanea:misc.Mode8
ltx/en_us_oca/me.m02.d06:alt2.meMA.Ode4C1T.ode	@ltx/en_us_oca/miscellanea:misc.Ode4
ltx/en_us_oca/me.m02.d06:alt2.meMA.Ode4C1T.text	
ltx/en_us_oca/me.m02.d06:alt2.meMA.Ode5C11.greekmelody	@ltx/en_us_oca/he.h.m8:heHE.InaTiMeAposo.greekname
ltx/en_us_oca/me.m02.d06:alt2.meMA.Ode5C11.incipit	…
ltx/en_us_oca/me.m02.d06:alt2.meMA.Ode5C11.melody	@ltx/en_us_oca/he.h.m8:heHE.InaTiMeAposo.notmetered
ltx/en_us_oca/me.m02.d06:alt2.meMA.Ode5C11.mode	@ltx/en_us_oca/miscellanea:misc.Mode8
ltx/en_us_oca/me.m02.d06:alt2.meMA.Ode5C11.ode	@ltx/en_us_oca/miscellanea:misc.Ode5
ltx/en_us_oca/me.m02.d06:alt2.meMA.Ode5C11.text	
ltx/en_us_oca/me.m02.d06:alt2.meMA.Ode5C12.incipit	…
ltx/en_us_oca/me.m02.d06:alt2.meMA.Ode5C12.melody	@ltx/en_us_oca/he.h.m8:heHE.InaTiMeAposo.notmetered
ltx/en_us_oca/me.m02.d06:alt2.meMA.Ode5C12.mode	@ltx/en_us_oca/miscellanea:misc.Mode8
ltx/en_us_oca/me.m02.d06:alt2.meMA.Ode5C12.ode	@ltx/en_us_oca/miscellanea:misc.Ode5
ltx/en_us_oca/me.m02.d06:alt2.meMA.Ode5C12.text	
ltx/en_us_oca/me.m02.d06:alt2.meMA.Ode5C13.incipit	…
ltx/en_us_oca/me.m02.d06:alt2.meMA.Ode5C13.melody	@ltx/en_us_oca/he.h.m8:heHE.InaTiMeAposo.notmetered
ltx/en_us_oca/me.m02.d06:alt2.meMA.Ode5C13.mode	@ltx/en_us_oca/miscellanea:misc.Mode8
ltx/en_us_oca/me.m02.d06:alt2.meMA.Ode5C13.ode	@ltx/en_us_oca/miscellanea:misc.Ode5
ltx/en_us_oca/me.m02.d06:alt2.meMA.Ode5C13.text	
ltx/en_us_oca/me.m02.d06:alt2.meMA.Ode5C1T.incipit	…
ltx/en_us_oca/me.m02.d06:alt2.meMA.Ode5C1T.melody	@ltx/en_us_oca/he.h.m8:heHE.InaTiMeAposo.notmetered
ltx/en_us_oca/me.m02.d06:alt2.meMA.Ode5C1T.mode	@ltx/en_us_oca/miscellanea:misc.Mode8
ltx/en_us_oca/me.m02.d06:alt2.meMA.Ode5C1T.ode	@ltx/en_us_oca/miscellanea:misc.Ode5
ltx/en_us_oca/me.m02.d06:alt2.meMA.Ode5C1T.text	
ltx/en_us_oca/me.m02.d06:alt2.meMA.Ode6C11.greekmelody	@ltx/en_us_oca/he.h.m8:heHE.IlasthitiMoiSotir.greekname
ltx/en_us_oca/me.m02.d06:alt2.meMA.Ode6C11.incipit	…
ltx/en_us_oca/me.m02.d06:alt2.meMA.Ode6C11.melody	@ltx/en_us_oca/he.h.m8:heHE.IlasthitiMoiSotir.notmetered
ltx/en_us_oca/me.m02.d06:alt2.meMA.Ode6C11.mode	@ltx/en_us_oca/miscellanea:misc.Mode8
ltx/en_us_oca/me.m02.d06:alt2.meMA.Ode6C11.ode	@ltx/en_us_oca/miscellanea:misc.Ode6
ltx/en_us_oca/me.m02.d06:alt2.meMA.Ode6C11.text	
ltx/en_us_oca/me.m02.d06:alt2.meMA.Ode6C12.incipit	…
ltx/en_us_oca/me.m02.d06:alt2.meMA.Ode6C12.melody	@ltx/en_us_oca/he.h.m8:heHE.IlasthitiMoiSotir.notmetered
ltx/en_us_oca/me.m02.d06:alt2.meMA.Ode6C12.mode	@ltx/en_us_oca/miscellanea:misc.Mode8
ltx/en_us_oca/me.m02.d06:alt2.meMA.Ode6C12.ode	@ltx/en_us_oca/miscellanea:misc.Ode6
ltx/en_us_oca/me.m02.d06:alt2.meMA.Ode6C12.text	
ltx/en_us_oca/me.m02.d06:alt2.meMA.Ode6C13.incipit	…
ltx/en_us_oca/me.m02.d06:alt2.meMA.Ode6C13.melody	@ltx/en_us_oca/he.h.m8:heHE.IlasthitiMoiSotir.notmetered
ltx/en_us_oca/me.m02.d06:alt2.meMA.Ode6C13.mode	@ltx/en_us_oca/miscellanea:misc.Mode8
ltx/en_us_oca/me.m02.d06:alt2.meMA.Ode6C13.ode	@ltx/en_us_oca/miscellanea:misc.Ode6
ltx/en_us_oca/me.m02.d06:alt2.meMA.Ode6C13.text	
ltx/en_us_oca/me.m02.d06:alt2.meMA.Ode6C1T.incipit	…
ltx/en_us_oca/me.m02.d06:alt2.meMA.Ode6C1T.melody	@ltx/en_us_oca/he.h.m8:heHE.IlasthitiMoiSotir.notmetered
ltx/en_us_oca/me.m02.d06:alt2.meMA.Ode6C1T.mode	@ltx/en_us_oca/miscellanea:misc.Mode8
ltx/en_us_oca/me.m02.d06:alt2.meMA.Ode6C1T.ode	@ltx/en_us_oca/miscellanea:misc.Ode6
ltx/en_us_oca/me.m02.d06:alt2.meMA.Ode6C1T.text	
ltx/en_us_oca/me.m02.d06:alt2.meMA.Ode7C11.greekmelody	@ltx/en_us_oca/he.h.m8:heHE.TheouSynkatavasin.greekname
ltx/en_us_oca/me.m02.d06:alt2.meMA.Ode7C11.incipit	…
ltx/en_us_oca/me.m02.d06:alt2.meMA.Ode7C11.melody	@ltx/en_us_oca/he.h.m8:heHE.TheouSynkatavasin.notmetered
ltx/en_us_oca/me.m02.d06:alt2.meMA.Ode7C11.mode	@ltx/en_us_oca/miscellanea:misc.Mode8
ltx/en_us_oca/me.m02.d06:alt2.meMA.Ode7C11.ode	@ltx/en_us_oca/miscellanea:misc.Ode7
ltx/en_us_oca/me.m02.d06:alt2.meMA.Ode7C11.text	
ltx/en_us_oca/me.m02.d06:alt2.meMA.Ode7C12.incipit	…
ltx/en_us_oca/me.m02.d06:alt2.meMA.Ode7C12.melody	@ltx/en_us_oca/he.h.m8:heHE.TheouSynkatavasin.notmetered
ltx/en_us_oca/me.m02.d06:alt2.meMA.Ode7C12.mode	@ltx/en_us_oca/miscellanea:misc.Mode8
ltx/en_us_oca/me.m02.d06:alt2.meMA.Ode7C12.ode	@ltx/en_us_oca/miscellanea:misc.Ode7
ltx/en_us_oca/me.m02.d06:alt2.meMA.Ode7C12.text	
ltx/en_us_oca/me.m02.d06:alt2.meMA.Ode7C13.incipit	…
ltx/en_us_oca/me.m02.d06:alt2.meMA.Ode7C13.melody	@ltx/en_us_oca/he.h.m8:heHE.TheouSynkatavasin.notmetered
ltx/en_us_oca/me.m02.d06:alt2.meMA.Ode7C13.mode	@ltx/en_us_oca/miscellanea:misc.Mode8
ltx/en_us_oca/me.m02.d06:alt2.meMA.Ode7C13.ode	@ltx/en_us_oca/miscellanea:misc.Ode7
ltx/en_us_oca/me.m02.d06:alt2.meMA.Ode7C13.text	
ltx/en_us_oca/me.m02.d06:alt2.meMA.Ode7C1T.incipit	…
ltx/en_us_oca/me.m02.d06:alt2.meMA.Ode7C1T.melody	@ltx/en_us_oca/he.h.m8:heHE.TheouSynkatavasin.notmetered
ltx/en_us_oca/me.m02.d06:alt2.meMA.Ode7C1T.mode	@ltx/en_us_oca/miscellanea:misc.Mode8
ltx/en_us_oca/me.m02.d06:alt2.meMA.Ode7C1T.ode	@ltx/en_us_oca/miscellanea:misc.Ode7
ltx/en_us_oca/me.m02.d06:alt2.meMA.Ode7C1T.text	
ltx/en_us_oca/me.m02.d06:alt2.meMA.Ode8C11.greekmelody	@ltx/en_us_oca/he.h.m8:heHE.EptaplasiosKaminon.greekname
ltx/en_us_oca/me.m02.d06:alt2.meMA.Ode8C11.incipit	…
ltx/en_us_oca/me.m02.d06:alt2.meMA.Ode8C11.melody	@ltx/en_us_oca/he.h.m8:heHE.EptaplasiosKaminon.notmetered
ltx/en_us_oca/me.m02.d06:alt2.meMA.Ode8C11.mode	@ltx/en_us_oca/miscellanea:misc.Mode8
ltx/en_us_oca/me.m02.d06:alt2.meMA.Ode8C11.ode	@ltx/en_us_oca/miscellanea:misc.Ode8
ltx/en_us_oca/me.m02.d06:alt2.meMA.Ode8C11.text	
ltx/en_us_oca/me.m02.d06:alt2.meMA.Ode8C12.incipit	…
ltx/en_us_oca/me.m02.d06:alt2.meMA.Ode8C12.melody	@ltx/en_us_oca/he.h.m8:heHE.EptaplasiosKaminon.notmetered
ltx/en_us_oca/me.m02.d06:alt2.meMA.Ode8C12.mode	@ltx/en_us_oca/miscellanea:misc.Mode8
ltx/en_us_oca/me.m02.d06:alt2.meMA.Ode8C12.ode	@ltx/en_us_oca/miscellanea:misc.Ode8
ltx/en_us_oca/me.m02.d06:alt2.meMA.Ode8C12.text	
ltx/en_us_oca/me.m02.d06:alt2.meMA.Ode8C13.incipit	…
ltx/en_us_oca/me.m02.d06:alt2.meMA.Ode8C13.melody	@ltx/en_us_oca/he.h.m8:heHE.EptaplasiosKaminon.notmetered
ltx/en_us_oca/me.m02.d06:alt2.meMA.Ode8C13.mode	@ltx/en_us_oca/miscellanea:misc.Mode8
ltx/en_us_oca/me.m02.d06:alt2.meMA.Ode8C13.ode	@ltx/en_us_oca/miscellanea:misc.Ode8
ltx/en_us_oca/me.m02.d06:alt2.meMA.Ode8C13.text	
ltx/en_us_oca/me.m02.d06:alt2.meMA.Ode8C1T.incipit	…
ltx/en_us_oca/me.m02.d06:alt2.meMA.Ode8C1T.melody	@ltx/en_us_oca/he.h.m8:heHE.EptaplasiosKaminon.notmetered
ltx/en_us_oca/me.m02.d06:alt2.meMA.Ode8C1T.mode	@ltx/en_us_oca/miscellanea:misc.Mode8
ltx/en_us_oca/me.m02.d06:alt2.meMA.Ode8C1T.ode	@ltx/en_us_oca/miscellanea:misc.Ode8
ltx/en_us_oca/me.m02.d06:alt2.meMA.Ode8C1T.text	
ltx/en_us_oca/me.m02.d06:alt2.meMA.Ode9C11.greekmelody	@ltx/en_us_oca/he.h.m8:heHE.ExestiEpiTouto.greekname
ltx/en_us_oca/me.m02.d06:alt2.meMA.Ode9C11.incipit	…
ltx/en_us_oca/me.m02.d06:alt2.meMA.Ode9C11.melody	@ltx/en_us_oca/he.h.m8:heHE.ExestiEpiTouto.notmetered
ltx/en_us_oca/me.m02.d06:alt2.meMA.Ode9C11.mode	@ltx/en_us_oca/miscellanea:misc.Mode8
ltx/en_us_oca/me.m02.d06:alt2.meMA.Ode9C11.ode	@ltx/en_us_oca/miscellanea:misc.Ode9
ltx/en_us_oca/me.m02.d06:alt2.meMA.Ode9C11.text	
ltx/en_us_oca/me.m02.d06:alt2.meMA.Ode9C12.incipit	…
ltx/en_us_oca/me.m02.d06:alt2.meMA.Ode9C12.melody	@ltx/en_us_oca/he.h.m8:heHE.ExestiEpiTouto.notmetered
ltx/en_us_oca/me.m02.d06:alt2.meMA.Ode9C12.mode	@ltx/en_us_oca/miscellanea:misc.Mode8
ltx/en_us_oca/me.m02.d06:alt2.meMA.Ode9C12.ode	@ltx/en_us_oca/miscellanea:misc.Ode9
ltx/en_us_oca/me.m02.d06:alt2.meMA.Ode9C12.text	
ltx/en_us_oca/me.m02.d06:alt2.meMA.Ode9C13.incipit	…
ltx/en_us_oca/me.m02.d06:alt2.meMA.Ode9C13.melody	@ltx/en_us_oca/he.h.m8:heHE.ExestiEpiTouto.notmetered
ltx/en_us_oca/me.m02.d06:alt2.meMA.Ode9C13.mode	@ltx/en_us_oca/miscellanea:misc.Mode8
ltx/en_us_oca/me.m02.d06:alt2.meMA.Ode9C13.ode	@ltx/en_us_oca/miscellanea:misc.Ode9
ltx/en_us_oca/me.m02.d06:alt2.meMA.Ode9C13.text	
ltx/en_us_oca/me.m02.d06:alt2.meMA.Ode9C14.incipit	…
ltx/en_us_oca/me.m02.d06:alt2.meMA.Ode9C14.melody	@ltx/en_us_oca/he.h.m8:heHE.ExestiEpiTouto.notmetered
ltx/en_us_oca/me.m02.d06:alt2.meMA.Ode9C14.mode	@ltx/en_us_oca/miscellanea:misc.Mode8
ltx/en_us_oca/me.m02.d06:alt2.meMA.Ode9C14.ode	@ltx/en_us_oca/miscellanea:misc.Ode9
ltx/en_us_oca/me.m02.d06:alt2.meMA.Ode9C14.text	
ltx/en_us_oca/me.m02.d06:alt2.meMA.Ode9C1T.incipit	…
ltx/en_us_oca/me.m02.d06:alt2.meMA.Ode9C1T.melody	@ltx/en_us_oca/he.h.m8:heHE.ExestiEpiTouto.notmetered
ltx/en_us_oca/me.m02.d06:alt2.meMA.Ode9C1T.mode	@ltx/en_us_oca/miscellanea:misc.Mode8
ltx/en_us_oca/me.m02.d06:alt2.meMA.Ode9C1T.ode	@ltx/en_us_oca/miscellanea:misc.Ode9
ltx/en_us_oca/me.m02.d06:alt2.meMA.Ode9C1T.text	
ltx/en_us_oca/me.m02.d06:alt2.meMA.Oikos1.text	
ltx/en_us_oca/me.m02.d06:alt2.meMA.PostGospelBoth.incipit	@ltx/en_us_oca/ho.ho03:hoMA.PostGospelTheotokos.incipit
ltx/en_us_oca/me.m02.d06:alt2.meMA.PostGospelBoth.melody	
ltx/en_us_oca/me.m02.d06:alt2.meMA.PostGospelBoth.mode	@ltx/en_us_oca/miscellanea:misc.Mode2
ltx/en_us_oca/me.m02.d06:alt2.meMA.PostGospelBoth.text	@ltx/en_us_oca/ho.ho03:hoMA.PostGospelTheotokos.text
ltx/en_us_oca/me.m02.d06:alt2.meMA.PostGospelGlory.incipit	@ltx/en_us_oca/ho.ho03:hoMA.PostGospelMonastics.incipit
ltx/en_us_oca/me.m02.d06:alt2.meMA.PostGospelGlory.melody	
ltx/en_us_oca/me.m02.d06:alt2.meMA.PostGospelGlory.mode	@ltx/en_us_oca/miscellanea:misc.Mode2
ltx/en_us_oca/me.m02.d06:alt2.meMA.PostGospelGlory.text	@ltx/en_us_oca/ho.ho03:hoMA.PostGospelMonastics.text
ltx/en_us_oca/me.m02.d06:alt2.meMA.PostGospelIdiomelon.incipit	…
ltx/en_us_oca/me.m02.d06:alt2.meMA.PostGospelIdiomelon.melody	
ltx/en_us_oca/me.m02.d06:alt2.meMA.PostGospelIdiomelon.mode	@ltx/en_us_oca/miscellanea:misc.Mode6
ltx/en_us_oca/me.m02.d06:alt2.meMA.PostGospelIdiomelon.text	
ltx/en_us_oca/me.m02.d06:alt2.meSV.AposBoth.incipit	…
ltx/en_us_oca/me.m02.d06:alt2.meSV.AposBoth.melody	@ltx/en_us_oca/he.a.m2:heAU.OikosTouEfratha.notmetered
ltx/en_us_oca/me.m02.d06:alt2.meSV.AposBoth.mode	@ltx/en_us_oca/miscellanea:misc.Mode2
ltx/en_us_oca/me.m02.d06:alt2.meSV.AposBoth.text	
ltx/en_us_oca/me.m02.d06:alt2.meSV.AposGlory.incipit	…
ltx/en_us_oca/me.m02.d06:alt2.meSV.AposGlory.melody	@ltx/en_us_oca/he.a.m2:heAU.OikosTouEfratha.notmetered
ltx/en_us_oca/me.m02.d06:alt2.meSV.AposGlory.mode	@ltx/en_us_oca/miscellanea:misc.Mode2
ltx/en_us_oca/me.m02.d06:alt2.meSV.AposGlory.text	
ltx/en_us_oca/me.m02.d06:alt2.meSV.Aposticha1.greekmelody	@ltx/en_us_oca/he.a.m2:heAU.OikosTouEfratha.greekname
ltx/en_us_oca/me.m02.d06:alt2.meSV.Aposticha1.incipit	…
ltx/en_us_oca/me.m02.d06:alt2.meSV.Aposticha1.melody	@ltx/en_us_oca/he.a.m2:heAU.OikosTouEfratha.notmetered
ltx/en_us_oca/me.m02.d06:alt2.meSV.Aposticha1.mode	@ltx/en_us_oca/miscellanea:misc.Mode2
ltx/en_us_oca/me.m02.d06:alt2.meSV.Aposticha1.text	
ltx/en_us_oca/me.m02.d06:alt2.meSV.Aposticha2.greekmelody	@ltx/en_us_oca/he.a.m2:heAU.OikosTouEfratha.greekname
ltx/en_us_oca/me.m02.d06:alt2.meSV.Aposticha2.incipit	…
ltx/en_us_oca/me.m02.d06:alt2.meSV.Aposticha2.melody	@ltx/en_us_oca/he.a.m2:heAU.OikosTouEfratha.notmetered
ltx/en_us_oca/me.m02.d06:alt2.meSV.Aposticha2.mode	@ltx/en_us_oca/miscellanea:misc.Mode2
ltx/en_us_oca/me.m02.d06:alt2.meSV.Aposticha2.text	
ltx/en_us_oca/me.m02.d06:alt2.meSV.Aposticha3.greekmelody	@ltx/en_us_oca/he.a.m2:heAU.OikosTouEfratha.greekname
ltx/en_us_oca/me.m02.d06:alt2.meSV.Aposticha3.incipit	…
ltx/en_us_oca/me.m02.d06:alt2.meSV.Aposticha3.melody	@ltx/en_us_oca/he.a.m2:heAU.OikosTouEfratha.notmetered
ltx/en_us_oca/me.m02.d06:alt2.meSV.Aposticha3.mode	@ltx/en_us_oca/miscellanea:misc.Mode2
ltx/en_us_oca/me.m02.d06:alt2.meSV.Aposticha3.text	
ltx/en_us_oca/me.m02.d06:alt2.meSV.SticBoth.incipit	@ltx/en_us_oca/me.m02.d02:meVE.Lity8.incipit
ltx/en_us_oca/me.m02.d06:alt2.meSV.SticBoth.melody	
ltx/en_us_oca/me.m02.d06:alt2.meSV.SticBoth.mode	@ltx/en_us_oca/miscellanea:misc.Mode4
ltx/en_us_oca/me.m02.d06:alt2.meSV.SticBoth.text	@ltx/en_us_oca/me.m02.d02:meVE.Lity8.text
ltx/en_us_oca/me.m02.d06:alt2.meSV.SticGlory.incipit	…
ltx/en_us_oca/me.m02.d06:alt2.meSV.SticGlory.melody	
ltx/en_us_oca/me.m02.d06:alt2.meSV.SticGlory.mode	@ltx/en_us_oca/miscellanea:misc.Mode4
ltx/en_us_oca/me.m02.d06:alt2.meSV.SticGlory.text	
ltx/en_us_oca/me.m02.d06:alt2.meSV.Stichera1.greekmelody	@ltx/en_us_oca/he.a.m1:heAU.TonOuranionTagmaton.greekname
ltx/en_us_oca/me.m02.d06:alt2.meSV.Stichera1.incipit	…
ltx/en_us_oca/me.m02.d06:alt2.meSV.Stichera1.melody	@ltx/en_us_oca/he.a.m1:heAU.TonOuranionTagmaton.notmetered
ltx/en_us_oca/me.m02.d06:alt2.meSV.Stichera1.mode	@ltx/en_us_oca/miscellanea:misc.Mode1
ltx/en_us_oca/me.m02.d06:alt2.meSV.Stichera1.text	
ltx/en_us_oca/me.m02.d06:alt2.meSV.Stichera2.incipit	…
ltx/en_us_oca/me.m02.d06:alt2.meSV.Stichera2.melody	@ltx/en_us_oca/he.a.m1:heAU.TonOuranionTagmaton.notmetered
ltx/en_us_oca/me.m02.d06:alt2.meSV.Stichera2.mode	@ltx/en_us_oca/miscellanea:misc.Mode1
ltx/en_us_oca/me.m02.d06:alt2.meSV.Stichera2.text	
ltx/en_us_oca/me.m02.d06:alt2.meSV.Stichera3.incipit	…
ltx/en_us_oca/me.m02.d06:alt2.meSV.Stichera3.melody	@ltx/en_us_oca/he.a.m1:heAU.TonOuranionTagmaton.notmetered
ltx/en_us_oca/me.m02.d06:alt2.meSV.Stichera3.mode	@ltx/en_us_oca/miscellanea:misc.Mode1
ltx/en_us_oca/me.m02.d06:alt2.meSV.Stichera3.text	
ltx/en_us_oca/me.m02.d06:alt2.meSV.Stichera4.incipit	…
ltx/en_us_oca/me.m02.d06:alt2.meSV.Stichera4.melody	@ltx/en_us_oca/he.a.m1:heAU.TonOuranionTagmaton.notmetered
ltx/en_us_oca/me.m02.d06:alt2.meSV.Stichera4.mode	@ltx/en_us_oca/miscellanea:misc.Mode1
ltx/en_us_oca/me.m02.d06:alt2.meSV.Stichera4.text	
ltx/en_us_oca/me.m02.d06:alt2.meVE.Apolytikion1.greekmelody	@ltx/en_us_oca/he.a.m5:heAU.TonSynanarchonLogon.greekname
ltx/en_us_oca/me.m02.d06:alt2.meVE.Apolytikion1.incipit	…
ltx/en_us_oca/me.m02.d06:alt2.meVE.Apolytikion1.melody	@ltx/en_us_oca/he.a.m5:heAU.TonSynanarchonLogon.notmetered
ltx/en_us_oca/me.m02.d06:alt2.meVE.Apolytikion1.mode	@ltx/en_us_oca/miscellanea:misc.Mode5
ltx/en_us_oca/me.m02.d06:alt2.meVE.Apolytikion1.text	
ltx/en_us_oca/me.m02.d06:alt2.meVE.AposBoth.incipit	@ltx/en_us_oca/me.m02.d02:meVE.AposGlory.incipit
ltx/en_us_oca/me.m02.d06:alt2.meVE.AposBoth.melody	
ltx/en_us_oca/me.m02.d06:alt2.meVE.AposBoth.mode	@ltx/en_us_oca/miscellanea:misc.Mode8
ltx/en_us_oca/me.m02.d06:alt2.meVE.AposBoth.text	@ltx/en_us_oca/me.m02.d02:meVE.AposGlory.text
ltx/en_us_oca/me.m02.d06:alt2.meVE.AposGlory.incipit	…
ltx/en_us_oca/me.m02.d06:alt2.meVE.AposGlory.melody	
ltx/en_us_oca/me.m02.d06:alt2.meVE.AposGlory.mode	@ltx/en_us_oca/miscellanea:misc.Mode8
ltx/en_us_oca/me.m02.d06:alt2.meVE.AposGlory.text	
ltx/en_us_oca/me.m02.d06:alt2.meVE.Aposticha1.greekmelody	@ltx/en_us_oca/he.a.m5:heAU.ChairoisAskitikon.greekname
ltx/en_us_oca/me.m02.d06:alt2.meVE.Aposticha1.incipit	…
ltx/en_us_oca/me.m02.d06:alt2.meVE.Aposticha1.melody	@ltx/en_us_oca/he.a.m5:heAU.ChairoisAskitikon.notmetered
ltx/en_us_oca/me.m02.d06:alt2.meVE.Aposticha1.mode	@ltx/en_us_oca/miscellanea:misc.Mode5
ltx/en_us_oca/me.m02.d06:alt2.meVE.Aposticha1.text	
ltx/en_us_oca/me.m02.d06:alt2.meVE.Aposticha2.greekmelody	@ltx/en_us_oca/he.a.m5:heAU.ChairoisAskitikon.greekname
ltx/en_us_oca/me.m02.d06:alt2.meVE.Aposticha2.incipit	…
ltx/en_us_oca/me.m02.d06:alt2.meVE.Aposticha2.melody	@ltx/en_us_oca/he.a.m5:heAU.ChairoisAskitikon.notmetered
ltx/en_us_oca/me.m02.d06:alt2.meVE.Aposticha2.mode	@ltx/en_us_oca/miscellanea:misc.Mode5
ltx/en_us_oca/me.m02.d06:alt2.meVE.Aposticha2.text	
ltx/en_us_oca/me.m02.d06:alt2.meVE.Aposticha3.greekmelody	@ltx/en_us_oca/he.a.m5:heAU.ChairoisAskitikon.greekname
ltx/en_us_oca/me.m02.d06:alt2.meVE.Aposticha3.incipit	…
ltx/en_us_oca/me.m02.d06:alt2.meVE.Aposticha3.melody	@ltx/en_us_oca/he.a.m5:heAU.ChairoisAskitikon.notmetered
ltx/en_us_oca/me.m02.d06:alt2.meVE.Aposticha3.mode	@ltx/en_us_oca/miscellanea:misc.Mode5
ltx/en_us_oca/me.m02.d06:alt2.meVE.Aposticha3.text	
ltx/en_us_oca/me.m02.d06:alt2.meVE.Lity1.incipit	…
ltx/en_us_oca/me.m02.d06:alt2.meVE.Lity1.melody	
ltx/en_us_oca/me.m02.d06:alt2.meVE.Lity1.mode	@ltx/en_us_oca/miscellanea:misc.Mode1
ltx/en_us_oca/me.m02.d06:alt2.meVE.Lity1.text	
ltx/en_us_oca/me.m02.d06:alt2.meVE.Lity2.incipit	…
ltx/en_us_oca/me.m02.d06:alt2.meVE.Lity2.melody	
ltx/en_us_oca/me.m02.d06:alt2.meVE.Lity2.mode	@ltx/en_us_oca/miscellanea:misc.Mode2
ltx/en_us_oca/me.m02.d06:alt2.meVE.Lity2.text	
ltx/en_us_oca/me.m02.d06:alt2.meVE.Lity3.incipit	…
ltx/en_us_oca/me.m02.d06:alt2.meVE.Lity3.melody	
ltx/en_us_oca/me.m02.d06:alt2.meVE.Lity3.mode	@ltx/en_us_oca/miscellanea:misc.Mode3
ltx/en_us_oca/me.m02.d06:alt2.meVE.Lity3.text	
ltx/en_us_oca/me.m02.d06:alt2.meVE.Lity4.incipit	…
ltx/en_us_oca/me.m02.d06:alt2.meVE.Lity4.melody	
ltx/en_us_oca/me.m02.d06:alt2.meVE.Lity4.mode	@ltx/en_us_oca/miscellanea:misc.Mode4
ltx/en_us_oca/me.m02.d06:alt2.meVE.Lity4.text	
ltx/en_us_oca/me.m02.d06:alt2.meVE.LityBoth.incipit	@ltx/en_us_oca/me.m02.d02:meVE.Lity6.incipit
ltx/en_us_oca/me.m02.d06:alt2.meVE.LityBoth.melody	
ltx/en_us_oca/me.m02.d06:alt2.meVE.LityBoth.mode	@ltx/en_us_oca/miscellanea:misc.Mode4
ltx/en_us_oca/me.m02.d06:alt2.meVE.LityBoth.text	@ltx/en_us_oca/me.m02.d02:meVE.Lity6.text
ltx/en_us_oca/me.m02.d06:alt2.meVE.LityGlory.incipit	…
ltx/en_us_oca/me.m02.d06:alt2.meVE.LityGlory.melody	
ltx/en_us_oca/me.m02.d06:alt2.meVE.LityGlory.mode	@ltx/en_us_oca/miscellanea:misc.Mode4
ltx/en_us_oca/me.m02.d06:alt2.meVE.LityGlory.text	
ltx/en_us_oca/me.m02.d06:alt2.meVE.SticBoth.incipit	@ltx/en_us_oca/me.m02.d02:meVE.SticGlory.incipit
ltx/en_us_oca/me.m02.d06:alt2.meVE.SticBoth.melody	
ltx/en_us_oca/me.m02.d06:alt2.meVE.SticBoth.mode	@ltx/en_us_oca/miscellanea:misc.Mode6
ltx/en_us_oca/me.m02.d06:alt2.meVE.SticBoth.text	@ltx/en_us_oca/me.m02.d02:meVE.SticGlory.text
ltx/en_us_oca/me.m02.d06:alt2.meVE.SticGlory.incipit	…
ltx/en_us_oca/me.m02.d06:alt2.meVE.SticGlory.melody	
ltx/en_us_oca/me.m02.d06:alt2.meVE.SticGlory.mode	@ltx/en_us_oca/miscellanea:misc.Mode6
ltx/en_us_oca/me.m02.d06:alt2.meVE.SticGlory.text	
ltx/en_us_oca/me.m02.d06:alt2.meVE.Stichera01.greekmelody	@ltx/en_us_oca/he.a.m2:heAU.PoioisEffimionStemmasin.greekname
ltx/en_us_oca/me.m02.d06:alt2.meVE.Stichera01.incipit	…
ltx/en_us_oca/me.m02.d06:alt2.meVE.Stichera01.melody	@ltx/en_us_oca/he.a.m2:heAU.PoioisEffimionStemmasin.notmetered
ltx/en_us_oca/me.m02.d06:alt2.meVE.Stichera01.mode	@ltx/en_us_oca/miscellanea:misc.Mode2
ltx/en_us_oca/me.m02.d06:alt2.meVE.Stichera01.text	
ltx/en_us_oca/me.m02.d06:alt2.meVE.Stichera02.incipit	…
ltx/en_us_oca/me.m02.d06:alt2.meVE.Stichera02.melody	@ltx/en_us_oca/he.a.m2:heAU.PoioisEffimionStemmasin.notmetered
ltx/en_us_oca/me.m02.d06:alt2.meVE.Stichera02.mode	@ltx/en_us_oca/miscellanea:misc.Mode2
ltx/en_us_oca/me.m02.d06:alt2.meVE.Stichera02.text	
ltx/en_us_oca/me.m02.d06:alt2.meVE.Stichera03.incipit	…
ltx/en_us_oca/me.m02.d06:alt2.meVE.Stichera03.melody	@ltx/en_us_oca/he.a.m2:heAU.PoioisEffimionStemmasin.notmetered
ltx/en_us_oca/me.m02.d06:alt2.meVE.Stichera03.mode	@ltx/en_us_oca/miscellanea:misc.Mode2
ltx/en_us_oca/me.m02.d06:alt2.meVE.Stichera03.text	
ltx/en_us_oca/me.m02.d06:alt2.meVE.Stichera04.greekmelody	@ltx/en_us_oca/he.a.m6:heAU.OlinApothemenoi.greekname
ltx/en_us_oca/me.m02.d06:alt2.meVE.Stichera04.incipit	…
ltx/en_us_oca/me.m02.d06:alt2.meVE.Stichera04.melody	@ltx/en_us_oca/he.a.m6:heAU.OlinApothemenoi.notmetered
ltx/en_us_oca/me.m02.d06:alt2.meVE.Stichera04.mode	@ltx/en_us_oca/miscellanea:misc.Mode6
ltx/en_us_oca/me.m02.d06:alt2.meVE.Stichera04.text	
ltx/en_us_oca/me.m02.d06:alt2.meVE.Stichera05.greekmelody	@ltx/en_us_oca/he.a.m6:heAU.OlinApothemenoi.greekname
ltx/en_us_oca/me.m02.d06:alt2.meVE.Stichera05.incipit	…
ltx/en_us_oca/me.m02.d06:alt2.meVE.Stichera05.melody	@ltx/en_us_oca/he.a.m6:heAU.OlinApothemenoi.notmetered
ltx/en_us_oca/me.m02.d06:alt2.meVE.Stichera05.mode	@ltx/en_us_oca/miscellanea:misc.Mode6
ltx/en_us_oca/me.m02.d06:alt2.meVE.Stichera05.text	
ltx/en_us_oca/me.m02.d06:alt2.meVE.Stichera06.incipit	…
ltx/en_us_oca/me.m02.d06:alt2.meVE.Stichera06.melody	@ltx/en_us_oca/he.a.m6:heAU.OlinApothemenoi.notmetered
ltx/en_us_oca/me.m02.d06:alt2.meVE.Stichera06.mode	@ltx/en_us_oca/miscellanea:misc.Mode6
ltx/en_us_oca/me.m02.d06:alt2.meVE.Stichera06.text	
ltx/en_us_oca/me.m02.d06:meDA.commemoration.first	
ltx/en_us_oca/me.m02.d06:meDA.commemoration.first_name	
ltx/en_us_oca/me.m02.d06:meDA.commemoration.first_short	
ltx/en_us_oca/me.m02.d06:meDA.commemoration.first_title	
ltx/en_us_oca/me.m02.d06:meDA.commemoration.full	
ltx/en_us_oca/me.m02.d06:meDA.commemoration.second_name	
ltx/en_us_oca/me.m02.d06:meDA.commemoration.second_title	
ltx/en_us_oca/me.m02.d06:meDA.date	
ltx/en_us_oca/me.m02.d06:meDA.dismissal	@ltx/en_us_oca/dismissals:dis00.meeting
ltx/en_us_oca/me.m02.d06:meDA.fordate	
ltx/en_us_oca/me.m02.d06:meDA.insert1	
ltx/en_us_oca/me.m02.d06:meDA.insert2	
ltx/en_us_oca/me.m02.d06:meDA.note	
ltx/en_us_oca/me.m02.d06:meDA.pdfcoverdate	
ltx/en_us_oca/me.m02.d06:meDA.pdfheaderdate	
ltx/en_us_oca/me.m02.d06:meHO.commemorations	
ltx/en_us_oca/me.m02.d06:meHO.note1	
ltx/en_us_oca/me.m02.d06:meHO.note2	
ltx/en_us_oca/me.m02.d06:meHO.number	
ltx/en_us_oca/me.m02.d06:meHO.rank	
ltx/en_us_oca/me.m02.d06:meLE.commemoration1	
ltx/en_us_oca/me.m02.d06:meLE.commemoration2	
ltx/en_us_oca/me.m02.d06:meLI.Kontakion1.incipit	…
ltx/en_us_oca/me.m02.d06:meLI.Kontakion1.melody	
ltx/en_us_oca/me.m02.d06:meLI.Kontakion1.mode	
ltx/en_us_oca/me.m02.d06:meLI.Kontakion1.text	
ltx/en_us_oca/me.m02.d06:meLI.Megalynarion.text	
ltx/en_us_oca/me.m02.d06:meMA.AposGlory.incipit	@ltx/en_us_oca/me.m02.d04:meVE.Aposticha3.incipit
ltx/en_us_oca/me.m02.d06:meMA.AposGlory.melody	@ltx/en_us_oca/he.a.m2:heAU.OikosTouEfratha.notmetered
ltx/en_us_oca/me.m02.d06:meMA.AposGlory.mode	@ltx/en_us_oca/miscellanea:misc.Mode2
ltx/en_us_oca/me.m02.d06:meMA.AposGlory.text	@ltx/en_us_oca/me.m02.d04:meVE.Aposticha3.text
ltx/en_us_oca/me.m02.d06:meMA.Aposticha1.greekmelody	@ltx/en_us_oca/he.a.m2:heAU.OikosTouEfratha.greekname
ltx/en_us_oca/me.m02.d06:meMA.Aposticha1.incipit	@ltx/en_us_oca/me.m02.d02:meSV.Aposticha1.incipit
ltx/en_us_oca/me.m02.d06:meMA.Aposticha1.melody	@ltx/en_us_oca/he.a.m2:heAU.OikosTouEfratha.notmetered
ltx/en_us_oca/me.m02.d06:meMA.Aposticha1.mode	@ltx/en_us_oca/miscellanea:misc.Mode2
ltx/en_us_oca/me.m02.d06:meMA.Aposticha1.text	@ltx/en_us_oca/me.m02.d02:meSV.Aposticha1.text
ltx/en_us_oca/me.m02.d06:meMA.Aposticha2.incipit	@ltx/en_us_oca/me.m02.d03:meVE.Aposticha2.incipit
ltx/en_us_oca/me.m02.d06:meMA.Aposticha2.melody	@ltx/en_us_oca/he.a.m2:heAU.OikosTouEfratha.notmetered
ltx/en_us_oca/me.m02.d06:meMA.Aposticha2.mode	@ltx/en_us_oca/miscellanea:misc.Mode2
ltx/en_us_oca/me.m02.d06:meMA.Aposticha2.text	@ltx/en_us_oca/me.m02.d03:meVE.Aposticha2.text
ltx/en_us_oca/me.m02.d06:meMA.Aposticha3.incipit	@ltx/en_us_oca/me.m02.d02:meSV.AposGlory.incipit
ltx/en_us_oca/me.m02.d06:meMA.Aposticha3.melody	@ltx/en_us_oca/he.a.m2:heAU.OikosTouEfratha.notmetered
ltx/en_us_oca/me.m02.d06:meMA.Aposticha3.mode	@ltx/en_us_oca/miscellanea:misc.Mode2
ltx/en_us_oca/me.m02.d06:meMA.Aposticha3.text	@ltx/en_us_oca/me.m02.d02:meSV.AposGlory.text
ltx/en_us_oca/me.m02.d06:meMA.C1.acrostic.notice1	
ltx/en_us_oca/me.m02.d06:meMA.C1.acrostic.text	
ltx/en_us_oca/me.m02.d06:meMA.C1.acrostic.title	
ltx/en_us_oca/me.m02.d06:meMA.C1.title	@ltx/en_us_oca/titles:ti.CanonSaintM
ltx/en_us_oca/me.m02.d06:meMA.C1.verse	@ltx/en_us_oca/prayers:pr.verse_SaintM.text
ltx/en_us_oca/me.m02.d06:meMA.Exaposteilarion1.greekmelody	@ltx/en_us_oca/he.a.m2:heAU.ToisMathitaisSynelthomen.greekname
ltx/en_us_oca/me.m02.d06:meMA.Exaposteilarion1.incipit	…
ltx/en_us_oca/me.m02.d06:meMA.Exaposteilarion1.melody	@ltx/en_us_oca/he.a.m2:heAU.ToisMathitaisSynelthomen.notmetered
ltx/en_us_oca/me.m02.d06:meMA.Exaposteilarion1.mode	@ltx/en_us_oca/miscellanea:misc.Mode2
ltx/en_us_oca/me.m02.d06:meMA.Exaposteilarion1.text	
ltx/en_us_oca/me.m02.d06:meMA.Exaposteilarion2.greekmelody	@ltx/en_us_oca/he.a.m2:heAU.ToisMathitaisSynelthomen.greekname
ltx/en_us_oca/me.m02.d06:meMA.Exaposteilarion2.incipit	…
ltx/en_us_oca/me.m02.d06:meMA.Exaposteilarion2.melody	@ltx/en_us_oca/he.a.m2:heAU.ToisMathitaisSynelthomen.notmetered
ltx/en_us_oca/me.m02.d06:meMA.Exaposteilarion2.mode	@ltx/en_us_oca/miscellanea:misc.Mode2
ltx/en_us_oca/me.m02.d06:meMA.Exaposteilarion2.text	
ltx/en_us_oca/me.m02.d06:meMA.Kathisma11.greekmelody	@ltx/en_us_oca/he.a.m1:heAU.TouLithouSfragisthentos.greekname
ltx/en_us_oca/me.m02.d06:meMA.Kathisma11.incipit	Having become an Infant for…
ltx/en_us_oca/me.m02.d06:meMA.Kathisma11.melody	@ltx/en_us_oca/he.a.m1:heAU.TouLithouSfragisthentos.notmetered
ltx/en_us_oca/me.m02.d06:meMA.Kathisma11.mode	@ltx/en_us_oca/miscellanea:misc.Mode1
ltx/en_us_oca/me.m02.d06:meMA.Kathisma11.text	Having become an Infant for my sake, ⁄ You were carried into the Temple, Life of all. ⁄ Having of old engraved the Law on stone tablets on Mount Sinai, ⁄ You have placed Yourself under the Law ⁄ that You might set all free from the ancient bondage to the Law. ⁄ Glory to your compassion, Savior! ⁄ Glory to Your Kingdom! ⁄⁄ Glory to Your dispensation, only Lover of mankind!
ltx/en_us_oca/me.m02.d06:meMA.Kathisma21.greekmelody	@ltx/en_us_oca/he.a.m5:heAU.TonSynanarchonLogon.greekname
ltx/en_us_oca/me.m02.d06:meMA.Kathisma21.incipit	@ltx/en_us_oca/me.m02.d03:meMA.Kathisma21.incipit
ltx/en_us_oca/me.m02.d06:meMA.Kathisma21.melody	@ltx/en_us_oca/he.a.m5:heAU.TonSynanarchonLogon.notmetered
ltx/en_us_oca/me.m02.d06:meMA.Kathisma21.mode	@ltx/en_us_oca/miscellanea:misc.Mode5
ltx/en_us_oca/me.m02.d06:meMA.Kathisma21.text	@ltx/en_us_oca/me.m02.d03:meMA.Kathisma21.text
ltx/en_us_oca/me.m02.d06:meMA.Ode1C11.greekmelody	@ltx/en_us_oca/he.h.m6:heHE.OsEnIpeiroPezefsas.greekname
ltx/en_us_oca/me.m02.d06:meMA.Ode1C11.incipit	…
ltx/en_us_oca/me.m02.d06:meMA.Ode1C11.melody	@ltx/en_us_oca/he.h.m6:heHE.OsEnIpeiroPezefsas.notmetered
ltx/en_us_oca/me.m02.d06:meMA.Ode1C11.mode	@ltx/en_us_oca/miscellanea:misc.Mode6
ltx/en_us_oca/me.m02.d06:meMA.Ode1C11.ode	@ltx/en_us_oca/miscellanea:misc.Ode1
ltx/en_us_oca/me.m02.d06:meMA.Ode1C11.text	
ltx/en_us_oca/me.m02.d06:meMA.Ode1C12.incipit	…
ltx/en_us_oca/me.m02.d06:meMA.Ode1C12.melody	@ltx/en_us_oca/he.h.m6:heHE.OsEnIpeiroPezefsas.notmetered
ltx/en_us_oca/me.m02.d06:meMA.Ode1C12.mode	@ltx/en_us_oca/miscellanea:misc.Mode6
ltx/en_us_oca/me.m02.d06:meMA.Ode1C12.ode	@ltx/en_us_oca/miscellanea:misc.Ode1
ltx/en_us_oca/me.m02.d06:meMA.Ode1C12.text	
ltx/en_us_oca/me.m02.d06:meMA.Ode1C13.incipit	…
ltx/en_us_oca/me.m02.d06:meMA.Ode1C13.melody	@ltx/en_us_oca/he.h.m6:heHE.OsEnIpeiroPezefsas.notmetered
ltx/en_us_oca/me.m02.d06:meMA.Ode1C13.mode	@ltx/en_us_oca/miscellanea:misc.Mode6
ltx/en_us_oca/me.m02.d06:meMA.Ode1C13.ode	@ltx/en_us_oca/miscellanea:misc.Ode1
ltx/en_us_oca/me.m02.d06:meMA.Ode1C13.text	
ltx/en_us_oca/me.m02.d06:meMA.Ode1C1H.greekmelody	@ltx/en_us_oca/he.h.m6:heHE.OsEnIpeiroPezefsas.greekname
ltx/en_us_oca/me.m02.d06:meMA.Ode1C1H.incipit	@ltx/en_us_oca/he.h.m6:heHE.OsEnIpeiroPezefsas.incipit
ltx/en_us_oca/me.m02.d06:meMA.Ode1C1H.melody	@ltx/en_us_oca/he.h.m6:heHE.OsEnIpeiroPezefsas.melody
ltx/en_us_oca/me.m02.d06:meMA.Ode1C1H.mode	@ltx/en_us_oca/miscellanea:misc.Mode6
ltx/en_us_oca/me.m02.d06:meMA.Ode1C1H.ode	@ltx/en_us_oca/miscellanea:misc.Ode1
ltx/en_us_oca/me.m02.d06:meMA.Ode1C1H.text	@ltx/en_us_oca/he.h.m6:heHE.OsEnIpeiroPezefsas.text
ltx/en_us_oca/me.m02.d06:meMA.Ode1C1T.incipit	…
ltx/en_us_oca/me.m02.d06:meMA.Ode1C1T.melody	@ltx/en_us_oca/he.h.m6:heHE.OsEnIpeiroPezefsas.notmetered
ltx/en_us_oca/me.m02.d06:meMA.Ode1C1T.mode	@ltx/en_us_oca/miscellanea:misc.Mode6
ltx/en_us_oca/me.m02.d06:meMA.Ode1C1T.ode	@ltx/en_us_oca/miscellanea:misc.Ode1
ltx/en_us_oca/me.m02.d06:meMA.Ode1C1T.text	
ltx/en_us_oca/me.m02.d06:meMA.Ode3C11.greekmelody	@ltx/en_us_oca/he.h.m6:heHE.OukEstinAgios.greekname
ltx/en_us_oca/me.m02.d06:meMA.Ode3C11.incipit	…
ltx/en_us_oca/me.m02.d06:meMA.Ode3C11.melody	@ltx/en_us_oca/he.h.m6:heHE.OukEstinAgios.notmetered
ltx/en_us_oca/me.m02.d06:meMA.Ode3C11.mode	@ltx/en_us_oca/miscellanea:misc.Mode6
ltx/en_us_oca/me.m02.d06:meMA.Ode3C11.ode	@ltx/en_us_oca/miscellanea:misc.Ode3
ltx/en_us_oca/me.m02.d06:meMA.Ode3C11.text	
ltx/en_us_oca/me.m02.d06:meMA.Ode3C12.incipit	…
ltx/en_us_oca/me.m02.d06:meMA.Ode3C12.melody	@ltx/en_us_oca/he.h.m6:heHE.OukEstinAgios.notmetered
ltx/en_us_oca/me.m02.d06:meMA.Ode3C12.mode	@ltx/en_us_oca/miscellanea:misc.Mode6
ltx/en_us_oca/me.m02.d06:meMA.Ode3C12.ode	@ltx/en_us_oca/miscellanea:misc.Ode3
ltx/en_us_oca/me.m02.d06:meMA.Ode3C12.text	
ltx/en_us_oca/me.m02.d06:meMA.Ode3C13.incipit	…
ltx/en_us_oca/me.m02.d06:meMA.Ode3C13.melody	@ltx/en_us_oca/he.h.m6:heHE.OukEstinAgios.notmetered
ltx/en_us_oca/me.m02.d06:meMA.Ode3C13.mode	@ltx/en_us_oca/miscellanea:misc.Mode6
ltx/en_us_oca/me.m02.d06:meMA.Ode3C13.ode	@ltx/en_us_oca/miscellanea:misc.Ode3
ltx/en_us_oca/me.m02.d06:meMA.Ode3C13.text	
ltx/en_us_oca/me.m02.d06:meMA.Ode3C1H.greekmelody	@ltx/en_us_oca/he.h.m6:heHE.OukEstinAgios.greekname
ltx/en_us_oca/me.m02.d06:meMA.Ode3C1H.incipit	@ltx/en_us_oca/he.h.m6:heHE.OukEstinAgios.incipit
ltx/en_us_oca/me.m02.d06:meMA.Ode3C1H.melody	@ltx/en_us_oca/he.h.m6:heHE.OukEstinAgios.melody
ltx/en_us_oca/me.m02.d06:meMA.Ode3C1H.mode	@ltx/en_us_oca/miscellanea:misc.Mode6
ltx/en_us_oca/me.m02.d06:meMA.Ode3C1H.ode	@ltx/en_us_oca/miscellanea:misc.Ode3
ltx/en_us_oca/me.m02.d06:meMA.Ode3C1H.text	@ltx/en_us_oca/he.h.m6:heHE.OukEstinAgios.text
ltx/en_us_oca/me.m02.d06:meMA.Ode3C1T.incipit	…
ltx/en_us_oca/me.m02.d06:meMA.Ode3C1T.melody	@ltx/en_us_oca/he.h.m6:heHE.OukEstinAgios.notmetered
ltx/en_us_oca/me.m02.d06:meMA.Ode3C1T.mode	@ltx/en_us_oca/miscellanea:misc.Mode6
ltx/en_us_oca/me.m02.d06:meMA.Ode3C1T.ode	@ltx/en_us_oca/miscellanea:misc.Ode3
ltx/en_us_oca/me.m02.d06:meMA.Ode3C1T.text	
ltx/en_us_oca/me.m02.d06:meMA.Ode3Kathisma1.greekmelody	@ltx/en_us_oca/he.a.m4:heAU.OYpsotheisEnToStavro.greekname
ltx/en_us_oca/me.m02.d06:meMA.Ode3Kathisma1.incipit	…
ltx/en_us_oca/me.m02.d06:meMA.Ode3Kathisma1.melody	@ltx/en_us_oca/he.a.m4:heAU.OYpsotheisEnToStavro.notmetered
ltx/en_us_oca/me.m02.d06:meMA.Ode3Kathisma1.mode	@ltx/en_us_oca/miscellanea:misc.Mode4
ltx/en_us_oca/me.m02.d06:meMA.Ode3Kathisma1.text	
ltx/en_us_oca/me.m02.d06:meMA.Ode3Kathisma2.greekmelody	@ltx/en_us_oca/he.a.m4:heAU.KateplagiIosif.greekname
ltx/en_us_oca/me.m02.d06:meMA.Ode3Kathisma2.incipit	@ltx/en_us_oca/me.m02.d02:meMA.Kathisma31.incipit
ltx/en_us_oca/me.m02.d06:meMA.Ode3Kathisma2.melody	@ltx/en_us_oca/he.a.m4:heAU.KateplagiIosif.notmetered
ltx/en_us_oca/me.m02.d06:meMA.Ode3Kathisma2.mode	@ltx/en_us_oca/miscellanea:misc.Mode4
ltx/en_us_oca/me.m02.d06:meMA.Ode3Kathisma2.text	@ltx/en_us_oca/me.m02.d02:meMA.Kathisma31.text
ltx/en_us_oca/me.m02.d06:meMA.Ode3KathismaSt.incipit	…
ltx/en_us_oca/me.m02.d06:meMA.Ode3KathismaSt.melody	@ltx/en_us_oca/he.a.m4:heAU.OYpsotheisEnToStavro.notmetered
ltx/en_us_oca/me.m02.d06:meMA.Ode3KathismaSt.mode	@ltx/en_us_oca/miscellanea:misc.Mode4
ltx/en_us_oca/me.m02.d06:meMA.Ode3KathismaSt.text	
ltx/en_us_oca/me.m02.d06:meMA.Ode3KathismaT.incipit	…
ltx/en_us_oca/me.m02.d06:meMA.Ode3KathismaT.melody	@ltx/en_us_oca/he.a.m4:heAU.OYpsotheisEnToStavro.notmetered
ltx/en_us_oca/me.m02.d06:meMA.Ode3KathismaT.mode	@ltx/en_us_oca/miscellanea:misc.Mode4
ltx/en_us_oca/me.m02.d06:meMA.Ode3KathismaT.text	
ltx/en_us_oca/me.m02.d06:meMA.Ode4C11.greekmelody	@ltx/en_us_oca/he.h.m6:heHE.ChristosMouDynamis.greekname
ltx/en_us_oca/me.m02.d06:meMA.Ode4C11.incipit	…
ltx/en_us_oca/me.m02.d06:meMA.Ode4C11.melody	@ltx/en_us_oca/he.h.m6:heHE.ChristosMouDynamis.notmetered
ltx/en_us_oca/me.m02.d06:meMA.Ode4C11.mode	@ltx/en_us_oca/miscellanea:misc.Mode6
ltx/en_us_oca/me.m02.d06:meMA.Ode4C11.ode	@ltx/en_us_oca/miscellanea:misc.Ode4
ltx/en_us_oca/me.m02.d06:meMA.Ode4C11.text	
ltx/en_us_oca/me.m02.d06:meMA.Ode4C12.incipit	…
ltx/en_us_oca/me.m02.d06:meMA.Ode4C12.melody	@ltx/en_us_oca/he.h.m6:heHE.ChristosMouDynamis.notmetered
ltx/en_us_oca/me.m02.d06:meMA.Ode4C12.mode	@ltx/en_us_oca/miscellanea:misc.Mode6
ltx/en_us_oca/me.m02.d06:meMA.Ode4C12.ode	@ltx/en_us_oca/miscellanea:misc.Ode4
ltx/en_us_oca/me.m02.d06:meMA.Ode4C12.text	
ltx/en_us_oca/me.m02.d06:meMA.Ode4C13.incipit	…
ltx/en_us_oca/me.m02.d06:meMA.Ode4C13.melody	@ltx/en_us_oca/he.h.m6:heHE.ChristosMouDynamis.notmetered
ltx/en_us_oca/me.m02.d06:meMA.Ode4C13.mode	@ltx/en_us_oca/miscellanea:misc.Mode6
ltx/en_us_oca/me.m02.d06:meMA.Ode4C13.ode	@ltx/en_us_oca/miscellanea:misc.Ode4
ltx/en_us_oca/me.m02.d06:meMA.Ode4C13.text	
ltx/en_us_oca/me.m02.d06:meMA.Ode4C14.incipit	…
ltx/en_us_oca/me.m02.d06:meMA.Ode4C14.melody	@ltx/en_us_oca/he.h.m6:heHE.ChristosMouDynamis.notmetered
ltx/en_us_oca/me.m02.d06:meMA.Ode4C14.mode	@ltx/en_us_oca/miscellanea:misc.Mode6
ltx/en_us_oca/me.m02.d06:meMA.Ode4C14.ode	@ltx/en_us_oca/miscellanea:misc.Ode4
ltx/en_us_oca/me.m02.d06:meMA.Ode4C14.text	
ltx/en_us_oca/me.m02.d06:meMA.Ode4C1H.greekmelody	@ltx/en_us_oca/he.h.m6:heHE.ChristosMouDynamis.greekname
ltx/en_us_oca/me.m02.d06:meMA.Ode4C1H.incipit	@ltx/en_us_oca/he.h.m6:heHE.ChristosMouDynamis.incipit
ltx/en_us_oca/me.m02.d06:meMA.Ode4C1H.melody	@ltx/en_us_oca/he.h.m6:heHE.ChristosMouDynamis.melody
ltx/en_us_oca/me.m02.d06:meMA.Ode4C1H.mode	@ltx/en_us_oca/miscellanea:misc.Mode6
ltx/en_us_oca/me.m02.d06:meMA.Ode4C1H.ode	@ltx/en_us_oca/miscellanea:misc.Ode4
ltx/en_us_oca/me.m02.d06:meMA.Ode4C1H.text	@ltx/en_us_oca/he.h.m6:heHE.ChristosMouDynamis.text
ltx/en_us_oca/me.m02.d06:meMA.Ode4C1T.incipit	…
ltx/en_us_oca/me.m02.d06:meMA.Ode4C1T.melody	@ltx/en_us_oca/he.h.m6:heHE.ChristosMouDynamis.notmetered
ltx/en_us_oca/me.m02.d06:meMA.Ode4C1T.mode	@ltx/en_us_oca/miscellanea:misc.Mode6
ltx/en_us_oca/me.m02.d06:meMA.Ode4C1T.ode	@ltx/en_us_oca/miscellanea:misc.Ode4
ltx/en_us_oca/me.m02.d06:meMA.Ode4C1T.text	
ltx/en_us_oca/me.m02.d06:meMA.Ode5C11.greekmelody	@ltx/en_us_oca/he.h.m6:heHE.ToTheioFengeiSou.greekname
ltx/en_us_oca/me.m02.d06:meMA.Ode5C11.incipit	…
ltx/en_us_oca/me.m02.d06:meMA.Ode5C11.melody	@ltx/en_us_oca/he.h.m6:heHE.ToTheioFengeiSou.notmetered
ltx/en_us_oca/me.m02.d06:meMA.Ode5C11.mode	@ltx/en_us_oca/miscellanea:misc.Mode6
ltx/en_us_oca/me.m02.d06:meMA.Ode5C11.ode	@ltx/en_us_oca/miscellanea:misc.Ode5
ltx/en_us_oca/me.m02.d06:meMA.Ode5C11.text	
ltx/en_us_oca/me.m02.d06:meMA.Ode5C12.incipit	…
ltx/en_us_oca/me.m02.d06:meMA.Ode5C12.melody	@ltx/en_us_oca/he.h.m6:heHE.ToTheioFengeiSou.notmetered
ltx/en_us_oca/me.m02.d06:meMA.Ode5C12.mode	@ltx/en_us_oca/miscellanea:misc.Mode6
ltx/en_us_oca/me.m02.d06:meMA.Ode5C12.ode	@ltx/en_us_oca/miscellanea:misc.Ode5
ltx/en_us_oca/me.m02.d06:meMA.Ode5C12.text	
ltx/en_us_oca/me.m02.d06:meMA.Ode5C13.incipit	…
ltx/en_us_oca/me.m02.d06:meMA.Ode5C13.melody	@ltx/en_us_oca/he.h.m6:heHE.ToTheioFengeiSou.notmetered
ltx/en_us_oca/me.m02.d06:meMA.Ode5C13.mode	@ltx/en_us_oca/miscellanea:misc.Mode6
ltx/en_us_oca/me.m02.d06:meMA.Ode5C13.ode	@ltx/en_us_oca/miscellanea:misc.Ode5
ltx/en_us_oca/me.m02.d06:meMA.Ode5C13.text	
ltx/en_us_oca/me.m02.d06:meMA.Ode5C14.incipit	…
ltx/en_us_oca/me.m02.d06:meMA.Ode5C14.melody	@ltx/en_us_oca/he.h.m6:heHE.ToTheioFengeiSou.notmetered
ltx/en_us_oca/me.m02.d06:meMA.Ode5C14.mode	@ltx/en_us_oca/miscellanea:misc.Mode6
ltx/en_us_oca/me.m02.d06:meMA.Ode5C14.ode	@ltx/en_us_oca/miscellanea:misc.Ode5
ltx/en_us_oca/me.m02.d06:meMA.Ode5C14.text	
ltx/en_us_oca/me.m02.d06:meMA.Ode5C1H.greekmelody	@ltx/en_us_oca/he.h.m6:heHE.ToTheioFengeiSou.greekname
ltx/en_us_oca/me.m02.d06:meMA.Ode5C1H.incipit	@ltx/en_us_oca/he.h.m6:heHE.ToTheioFengeiSou.incipit
ltx/en_us_oca/me.m02.d06:meMA.Ode5C1H.melody	@ltx/en_us_oca/he.h.m6:heHE.ToTheioFengeiSou.melody
ltx/en_us_oca/me.m02.d06:meMA.Ode5C1H.mode	@ltx/en_us_oca/miscellanea:misc.Mode6
ltx/en_us_oca/me.m02.d06:meMA.Ode5C1H.ode	@ltx/en_us_oca/miscellanea:misc.Ode5
ltx/en_us_oca/me.m02.d06:meMA.Ode5C1H.text	@ltx/en_us_oca/he.h.m6:heHE.ToTheioFengeiSou.text
ltx/en_us_oca/me.m02.d06:meMA.Ode5C1T.incipit	…
ltx/en_us_oca/me.m02.d06:meMA.Ode5C1T.melody	@ltx/en_us_oca/he.h.m6:heHE.ToTheioFengeiSou.notmetered
ltx/en_us_oca/me.m02.d06:meMA.Ode5C1T.mode	@ltx/en_us_oca/miscellanea:misc.Mode6
ltx/en_us_oca/me.m02.d06:meMA.Ode5C1T.ode	@ltx/en_us_oca/miscellanea:misc.Ode5
ltx/en_us_oca/me.m02.d06:meMA.Ode5C1T.text	
ltx/en_us_oca/me.m02.d06:meMA.Ode6C11.greekmelody	@ltx/en_us_oca/he.h.m6:heHE.TouViouTinThalassan.greekname
ltx/en_us_oca/me.m02.d06:meMA.Ode6C11.incipit	…
ltx/en_us_oca/me.m02.d06:meMA.Ode6C11.melody	@ltx/en_us_oca/he.h.m6:heHE.TouViouTinThalassan.notmetered
ltx/en_us_oca/me.m02.d06:meMA.Ode6C11.mode	@ltx/en_us_oca/miscellanea:misc.Mode6
ltx/en_us_oca/me.m02.d06:meMA.Ode6C11.ode	@ltx/en_us_oca/miscellanea:misc.Ode6
ltx/en_us_oca/me.m02.d06:meMA.Ode6C11.text	
ltx/en_us_oca/me.m02.d06:meMA.Ode6C12.incipit	…
ltx/en_us_oca/me.m02.d06:meMA.Ode6C12.melody	@ltx/en_us_oca/he.h.m6:heHE.TouViouTinThalassan.notmetered
ltx/en_us_oca/me.m02.d06:meMA.Ode6C12.mode	@ltx/en_us_oca/miscellanea:misc.Mode6
ltx/en_us_oca/me.m02.d06:meMA.Ode6C12.ode	@ltx/en_us_oca/miscellanea:misc.Ode6
ltx/en_us_oca/me.m02.d06:meMA.Ode6C12.text	
ltx/en_us_oca/me.m02.d06:meMA.Ode6C13.incipit	…
ltx/en_us_oca/me.m02.d06:meMA.Ode6C13.melody	@ltx/en_us_oca/he.h.m6:heHE.TouViouTinThalassan.notmetered
ltx/en_us_oca/me.m02.d06:meMA.Ode6C13.mode	@ltx/en_us_oca/miscellanea:misc.Mode6
ltx/en_us_oca/me.m02.d06:meMA.Ode6C13.ode	@ltx/en_us_oca/miscellanea:misc.Ode6
ltx/en_us_oca/me.m02.d06:meMA.Ode6C13.text	
ltx/en_us_oca/me.m02.d06:meMA.Ode6C1H.greekmelody	@ltx/en_us_oca/he.h.m6:heHE.TouViouTinThalassan.greekname
ltx/en_us_oca/me.m02.d06:meMA.Ode6C1H.incipit	@ltx/en_us_oca/he.h.m6:heHE.TouViouTinThalassan.incipit
ltx/en_us_oca/me.m02.d06:meMA.Ode6C1H.melody	@ltx/en_us_oca/he.h.m6:heHE.TouViouTinThalassan.melody
ltx/en_us_oca/me.m02.d06:meMA.Ode6C1H.mode	@ltx/en_us_oca/miscellanea:misc.Mode6
ltx/en_us_oca/me.m02.d06:meMA.Ode6C1H.ode	@ltx/en_us_oca/miscellanea:misc.Ode6
ltx/en_us_oca/me.m02.d06:meMA.Ode6C1H.text	@ltx/en_us_oca/he.h.m6:heHE.TouViouTinThalassan.text
ltx/en_us_oca/me.m02.d06:meMA.Ode6C1T.incipit	…
ltx/en_us_oca/me.m02.d06:meMA.Ode6C1T.melody	@ltx/en_us_oca/he.h.m6:heHE.TouViouTinThalassan.notmetered
ltx/en_us_oca/me.m02.d06:meMA.Ode6C1T.mode	@ltx/en_us_oca/miscellanea:misc.Mode6
ltx/en_us_oca/me.m02.d06:meMA.Ode6C1T.ode	@ltx/en_us_oca/miscellanea:misc.Ode6
ltx/en_us_oca/me.m02.d06:meMA.Ode6C1T.text	
ltx/en_us_oca/me.m02.d06:meMA.Ode7C11.greekmelody	@ltx/en_us_oca/he.h.m6:heHE.DrosovolonMenTinKaminon.greekname
ltx/en_us_oca/me.m02.d06:meMA.Ode7C11.incipit	…
ltx/en_us_oca/me.m02.d06:meMA.Ode7C11.melody	@ltx/en_us_oca/he.h.m6:heHE.DrosovolonMenTinKaminon.notmetered
ltx/en_us_oca/me.m02.d06:meMA.Ode7C11.mode	@ltx/en_us_oca/miscellanea:misc.Mode6
ltx/en_us_oca/me.m02.d06:meMA.Ode7C11.ode	@ltx/en_us_oca/miscellanea:misc.Ode7
ltx/en_us_oca/me.m02.d06:meMA.Ode7C11.text	
ltx/en_us_oca/me.m02.d06:meMA.Ode7C12.incipit	…
ltx/en_us_oca/me.m02.d06:meMA.Ode7C12.melody	@ltx/en_us_oca/he.h.m6:heHE.DrosovolonMenTinKaminon.notmetered
ltx/en_us_oca/me.m02.d06:meMA.Ode7C12.mode	@ltx/en_us_oca/miscellanea:misc.Mode6
ltx/en_us_oca/me.m02.d06:meMA.Ode7C12.ode	@ltx/en_us_oca/miscellanea:misc.Ode7
ltx/en_us_oca/me.m02.d06:meMA.Ode7C12.text	
ltx/en_us_oca/me.m02.d06:meMA.Ode7C13.incipit	…
ltx/en_us_oca/me.m02.d06:meMA.Ode7C13.melody	@ltx/en_us_oca/he.h.m6:heHE.DrosovolonMenTinKaminon.notmetered
ltx/en_us_oca/me.m02.d06:meMA.Ode7C13.mode	@ltx/en_us_oca/miscellanea:misc.Mode6
ltx/en_us_oca/me.m02.d06:meMA.Ode7C13.ode	@ltx/en_us_oca/miscellanea:misc.Ode7
ltx/en_us_oca/me.m02.d06:meMA.Ode7C13.text	
ltx/en_us_oca/me.m02.d06:meMA.Ode7C1H.greekmelody	@ltx/en_us_oca/he.h.m6:heHE.DrosovolonMenTinKaminon.greekname
ltx/en_us_oca/me.m02.d06:meMA.Ode7C1H.incipit	@ltx/en_us_oca/he.h.m6:heHE.DrosovolonMenTinKaminon.incipit
ltx/en_us_oca/me.m02.d06:meMA.Ode7C1H.melody	@ltx/en_us_oca/he.h.m6:heHE.DrosovolonMenTinKaminon.melody
ltx/en_us_oca/me.m02.d06:meMA.Ode7C1H.mode	@ltx/en_us_oca/miscellanea:misc.Mode6
ltx/en_us_oca/me.m02.d06:meMA.Ode7C1H.ode	@ltx/en_us_oca/miscellanea:misc.Ode7
ltx/en_us_oca/me.m02.d06:meMA.Ode7C1H.text	@ltx/en_us_oca/he.h.m6:heHE.DrosovolonMenTinKaminon.text
ltx/en_us_oca/me.m02.d06:meMA.Ode7C1T.incipit	…
ltx/en_us_oca/me.m02.d06:meMA.Ode7C1T.melody	@ltx/en_us_oca/he.h.m6:heHE.DrosovolonMenTinKaminon.notmetered
ltx/en_us_oca/me.m02.d06:meMA.Ode7C1T.mode	@ltx/en_us_oca/miscellanea:misc.Mode6
ltx/en_us_oca/me.m02.d06:meMA.Ode7C1T.ode	@ltx/en_us_oca/miscellanea:misc.Ode7
ltx/en_us_oca/me.m02.d06:meMA.Ode7C1T.text	
ltx/en_us_oca/me.m02.d06:meMA.Ode8C11.greekmelody	@ltx/en_us_oca/he.h.m6:heHE.EkFlogosToisOsiois.greekname
ltx/en_us_oca/me.m02.d06:meMA.Ode8C11.incipit	…
ltx/en_us_oca/me.m02.d06:meMA.Ode8C11.melody	@ltx/en_us_oca/he.h.m6:heHE.EkFlogosToisOsiois.notmetered
ltx/en_us_oca/me.m02.d06:meMA.Ode8C11.mode	@ltx/en_us_oca/miscellanea:misc.Mode6
ltx/en_us_oca/me.m02.d06:meMA.Ode8C11.ode	@ltx/en_us_oca/miscellanea:misc.Ode8
ltx/en_us_oca/me.m02.d06:meMA.Ode8C11.text	
ltx/en_us_oca/me.m02.d06:meMA.Ode8C12.incipit	…
ltx/en_us_oca/me.m02.d06:meMA.Ode8C12.melody	@ltx/en_us_oca/he.h.m6:heHE.EkFlogosToisOsiois.notmetered
ltx/en_us_oca/me.m02.d06:meMA.Ode8C12.mode	@ltx/en_us_oca/miscellanea:misc.Mode6
ltx/en_us_oca/me.m02.d06:meMA.Ode8C12.ode	@ltx/en_us_oca/miscellanea:misc.Ode8
ltx/en_us_oca/me.m02.d06:meMA.Ode8C12.text	
ltx/en_us_oca/me.m02.d06:meMA.Ode8C13.incipit	…
ltx/en_us_oca/me.m02.d06:meMA.Ode8C13.melody	@ltx/en_us_oca/he.h.m6:heHE.EkFlogosToisOsiois.notmetered
ltx/en_us_oca/me.m02.d06:meMA.Ode8C13.mode	@ltx/en_us_oca/miscellanea:misc.Mode6
ltx/en_us_oca/me.m02.d06:meMA.Ode8C13.ode	@ltx/en_us_oca/miscellanea:misc.Ode8
ltx/en_us_oca/me.m02.d06:meMA.Ode8C13.text	
ltx/en_us_oca/me.m02.d06:meMA.Ode8C1H.greekmelody	@ltx/en_us_oca/he.h.m6:heHE.EkFlogosToisOsiois.greekname
ltx/en_us_oca/me.m02.d06:meMA.Ode8C1H.incipit	@ltx/en_us_oca/he.h.m6:heHE.EkFlogosToisOsiois.incipit
ltx/en_us_oca/me.m02.d06:meMA.Ode8C1H.melody	@ltx/en_us_oca/he.h.m6:heHE.EkFlogosToisOsiois.melody
ltx/en_us_oca/me.m02.d06:meMA.Ode8C1H.mode	@ltx/en_us_oca/miscellanea:misc.Mode6
ltx/en_us_oca/me.m02.d06:meMA.Ode8C1H.ode	@ltx/en_us_oca/miscellanea:misc.Ode8
ltx/en_us_oca/me.m02.d06:meMA.Ode8C1H.text	@ltx/en_us_oca/he.h.m6:heHE.EkFlogosToisOsiois.text
ltx/en_us_oca/me.m02.d06:meMA.Ode8C1T.incipit	…
ltx/en_us_oca/me.m02.d06:meMA.Ode8C1T.melody	@ltx/en_us_oca/he.h.m6:heHE.EkFlogosToisOsiois.notmetered
ltx/en_us_oca/me.m02.d06:meMA.Ode8C1T.mode	@ltx/en_us_oca/miscellanea:misc.Mode6
ltx/en_us_oca/me.m02.d06:meMA.Ode8C1T.ode	@ltx/en_us_oca/miscellanea:misc.Ode8
ltx/en_us_oca/me.m02.d06:meMA.Ode8C1T.text	
ltx/en_us_oca/me.m02.d06:meMA.Ode9C11.greekmelody	@ltx/en_us_oca/he.h.m6:heHE.TheonAnthropois.greekname
ltx/en_us_oca/me.m02.d06:meMA.Ode9C11.incipit	…
ltx/en_us_oca/me.m02.d06:meMA.Ode9C11.melody	@ltx/en_us_oca/he.h.m6:heHE.TheonAnthropois.notmetered
ltx/en_us_oca/me.m02.d06:meMA.Ode9C11.mode	@ltx/en_us_oca/miscellanea:misc.Mode6
ltx/en_us_oca/me.m02.d06:meMA.Ode9C11.ode	@ltx/en_us_oca/miscellanea:misc.Ode9
ltx/en_us_oca/me.m02.d06:meMA.Ode9C11.text	
ltx/en_us_oca/me.m02.d06:meMA.Ode9C12.incipit	…
ltx/en_us_oca/me.m02.d06:meMA.Ode9C12.melody	@ltx/en_us_oca/he.h.m6:heHE.TheonAnthropois.notmetered
ltx/en_us_oca/me.m02.d06:meMA.Ode9C12.mode	@ltx/en_us_oca/miscellanea:misc.Mode6
ltx/en_us_oca/me.m02.d06:meMA.Ode9C12.ode	@ltx/en_us_oca/miscellanea:misc.Ode9
ltx/en_us_oca/me.m02.d06:meMA.Ode9C12.text	
ltx/en_us_oca/me.m02.d06:meMA.Ode9C13.incipit	…
ltx/en_us_oca/me.m02.d06:meMA.Ode9C13.melody	@ltx/en_us_oca/he.h.m6:heHE.TheonAnthropois.notmetered
ltx/en_us_oca/me.m02.d06:meMA.Ode9C13.mode	@ltx/en_us_oca/miscellanea:misc.Mode6
ltx/en_us_oca/me.m02.d06:meMA.Ode9C13.ode	@ltx/en_us_oca/miscellanea:misc.Ode9
ltx/en_us_oca/me.m02.d06:meMA.Ode9C13.text	
ltx/en_us_oca/me.m02.d06:meMA.Ode9C1H.greekmelody	@ltx/en_us_oca/he.h.m6:heHE.TheonAnthropois.greekname
ltx/en_us_oca/me.m02.d06:meMA.Ode9C1H.incipit	@ltx/en_us_oca/he.h.m6:heHE.TheonAnthropois.incipit
ltx/en_us_oca/me.m02.d06:meMA.Ode9C1H.melody	@ltx/en_us_oca/he.h.m6:heHE.TheonAnthropois.melody
ltx/en_us_oca/me.m02.d06:meMA.Ode9C1H.mode	@ltx/en_us_oca/miscellanea:misc.Mode6
ltx/en_us_oca/me.m02.d06:meMA.Ode9C1H.ode	@ltx/en_us_oca/miscellanea:misc.Ode9
ltx/en_us_oca/me.m02.d06:meMA.Ode9C1H.text	@ltx/en_us_oca/he.h.m6:heHE.TheonAnthropois.text
ltx/en_us_oca/me.m02.d06:meMA.Ode9C1T.incipit	…
ltx/en_us_oca/me.m02.d06:meMA.Ode9C1T.melody	@ltx/en_us_oca/he.h.m6:heHE.TheonAnthropois.notmetered
ltx/en_us_oca/me.m02.d06:meMA.Ode9C1T.mode	@ltx/en_us_oca/miscellanea:misc.Mode6
ltx/en_us_oca/me.m02.d06:meMA.Ode9C1T.ode	@ltx/en_us_oca/miscellanea:misc.Ode9
ltx/en_us_oca/me.m02.d06:meMA.Ode9C1T.text	
ltx/en_us_oca/me.m02.d06:meVE.Apolytikion1.incipit	@ltx/en_us_oca/me.m02.d02:meVE.Apolytikion1.incipit
ltx/en_us_oca/me.m02.d06:meVE.Apolytikion1.melody	
ltx/en_us_oca/me.m02.d06:meVE.Apolytikion1.mode	@ltx/en_us_oca/miscellanea:misc.Mode1
ltx/en_us_oca/me.m02.d06:meVE.Apolytikion1.text	@ltx/en_us_oca/me.m02.d02:meVE.Apolytikion1.text
ltx/en_us_oca/me.m02.d06:meVE.Apolytikion2ger.greekmelody	@ltx/en_us_oca/he.a.m4:heAU.OYpsotheisEnToStavro.greekname
ltx/en_us_oca/me.m02.d06:meVE.Apolytikion2ger.incipit	…
ltx/en_us_oca/me.m02.d06:meVE.Apolytikion2ger.melody	@ltx/en_us_oca/he.a.m4:heAU.OYpsotheisEnToStavro.notmetered
ltx/en_us_oca/me.m02.d06:meVE.Apolytikion2ger.mode	@ltx/en_us_oca/miscellanea:misc.Mode4
ltx/en_us_oca/me.m02.d06:meVE.Apolytikion2ger.poet	@ltx/en_us_oca/poets:po.Gerasimou
ltx/en_us_oca/me.m02.d06:meVE.Apolytikion2ger.text	
ltx/en_us_oca/me.m02.d06:meVE.Apolytikion3ger.greekmelody	@ltx/en_us_oca/he.a.m5:heAU.TonSynanarchonLogon.greekname
ltx/en_us_oca/me.m02.d06:meVE.Apolytikion3ger.incipit	…
ltx/en_us_oca/me.m02.d06:meVE.Apolytikion3ger.melody	@ltx/en_us_oca/he.a.m5:heAU.TonSynanarchonLogon.notmetered
ltx/en_us_oca/me.m02.d06:meVE.Apolytikion3ger.mode	@ltx/en_us_oca/miscellanea:misc.Mode5
ltx/en_us_oca/me.m02.d06:meVE.Apolytikion3ger.poet	@ltx/en_us_oca/poets:po.Gerasimou
ltx/en_us_oca/me.m02.d06:meVE.Apolytikion3ger.text	
ltx/en_us_oca/me.m02.d06:meVE.AposGlory.incipit	@ltx/en_us_oca/me.m02.d05:meMA.Aposticha2.incipit
ltx/en_us_oca/me.m02.d06:meVE.AposGlory.melody	@ltx/en_us_oca/he.a.m2:heAU.OikosTouEfratha.notmetered
ltx/en_us_oca/me.m02.d06:meVE.AposGlory.mode	@ltx/en_us_oca/miscellanea:misc.Mode2
ltx/en_us_oca/me.m02.d06:meVE.AposGlory.text	@ltx/en_us_oca/me.m02.d05:meMA.Aposticha2.text
ltx/en_us_oca/me.m02.d06:meVE.Aposticha1.greekmelody	@ltx/en_us_oca/he.a.m2:heAU.OikosTouEfratha.greekname
ltx/en_us_oca/me.m02.d06:meVE.Aposticha1.incipit	@ltx/en_us_oca/me.m02.d04:meVE.Aposticha2.incipit
ltx/en_us_oca/me.m02.d06:meVE.Aposticha1.melody	@ltx/en_us_oca/he.a.m2:heAU.OikosTouEfratha.notmetered
ltx/en_us_oca/me.m02.d06:meVE.Aposticha1.mode	@ltx/en_us_oca/miscellanea:misc.Mode2
ltx/en_us_oca/me.m02.d06:meVE.Aposticha1.text	@ltx/en_us_oca/me.m02.d04:meVE.Aposticha2.text
ltx/en_us_oca/me.m02.d06:meVE.Aposticha2.incipit	@ltx/en_us_oca/me.m02.d01:meMA.Aposticha3.incipit
ltx/en_us_oca/me.m02.d06:meVE.Aposticha2.melody	@ltx/en_us_oca/he.a.m2:heAU.OikosTouEfratha.notmetered
ltx/en_us_oca/me.m02.d06:meVE.Aposticha2.mode	@ltx/en_us_oca/miscellanea:misc.Mode2
ltx/en_us_oca/me.m02.d06:meVE.Aposticha2.text	@ltx/en_us_oca/me.m02.d01:meMA.Aposticha3.text
ltx/en_us_oca/me.m02.d06:meVE.Aposticha3.incipit	Now I have beheld You…
ltx/en_us_oca/me.m02.d06:meVE.Aposticha3.melody	@ltx/en_us_oca/he.a.m2:heAU.OikosTouEfratha.notmetered
ltx/en_us_oca/me.m02.d06:meVE.Aposticha3.mode	@ltx/en_us_oca/miscellanea:misc.Mode2
ltx/en_us_oca/me.m02.d06:meVE.Aposticha3.text	Now I have beheld You ⁄ with my eyes, good God. ⁄ As You have promised me, ⁄ now dismiss Your servant quickly, ⁄⁄ O Lover of mankind!
ltx/en_us_oca/me.m02.d06:meVE.SticGlory.incipit	@ltx/en_us_oca/me.m02.d02:meVE.LityGlory.incipit
ltx/en_us_oca/me.m02.d06:meVE.SticGlory.melody	
ltx/en_us_oca/me.m02.d06:meVE.SticGlory.mode	@ltx/en_us_oca/miscellanea:misc.Mode5
ltx/en_us_oca/me.m02.d06:meVE.SticGlory.poet	@ltx/en_us_oca/poets:po.AndreouKritis
ltx/en_us_oca/me.m02.d06:meVE.SticGlory.text	@ltx/en_us_oca/me.m02.d02:meVE.LityGlory.text
ltx/en_us_oca/me.m02.d06:meVE.SticStavrotheotokion.greekmelody	@ltx/en_us_oca/he.a.m6:heAU.TriimerosAnestis.greekname
ltx/en_us_oca/me.m02.d06:meVE.SticStavrotheotokion.incipit	@ltx/en_us_oca/oc.m6.d4:ocMA.AposTheotokion.incipit
ltx/en_us_oca/me.m02.d06:meVE.SticStavrotheotokion.melody	@ltx/en_us_oca/he.a.m6:heAU.TriimerosAnestis.notmetered
ltx/en_us_oca/me.m02.d06:meVE.SticStavrotheotokion.mode	@ltx/en_us_oca/miscellanea:misc.Mode6
ltx/en_us_oca/me.m02.d06:meVE.SticStavrotheotokion.text	@ltx/en_us_oca/oc.m6.d4:ocMA.AposTheotokion.text
ltx/en_us_oca/me.m02.d06:meVE.SticTheotokion.greekmelody	@ltx/en_us_oca/he.a.m6:heAU.TriimerosAnestis.greekname
ltx/en_us_oca/me.m02.d06:meVE.SticTheotokion.incipit	@ltx/en_us_oca/oc.m6.d5:ocVE.SticTheotokion.incipit
ltx/en_us_oca/me.m02.d06:meVE.SticTheotokion.melody	@ltx/en_us_oca/he.a.m6:heAU.TriimerosAnestis.notmetered
ltx/en_us_oca/me.m02.d06:meVE.SticTheotokion.mode	@ltx/en_us_oca/miscellanea:misc.Mode6
ltx/en_us_oca/me.m02.d06:meVE.SticTheotokion.text	@ltx/en_us_oca/oc.m6.d5:ocVE.SticTheotokion.text
ltx/en_us_oca/me.m02.d06:meVE.Stichera01.greekmelody	@ltx/en_us_oca/he.a.m1:heAU.TonOuranionTagmaton.greekname
ltx/en_us_oca/me.m02.d06:meVE.Stichera01.incipit	…
ltx/en_us_oca/me.m02.d06:meVE.Stichera01.melody	@ltx/en_us_oca/he.a.m1:heAU.TonOuranionTagmaton.notmetered
ltx/en_us_oca/me.m02.d06:meVE.Stichera01.mode	@ltx/en_us_oca/miscellanea:misc.Mode1
ltx/en_us_oca/me.m02.d06:meVE.Stichera01.text	
ltx/en_us_oca/me.m02.d06:meVE.Stichera02.incipit	…
ltx/en_us_oca/me.m02.d06:meVE.Stichera02.melody	@ltx/en_us_oca/he.a.m1:heAU.TonOuranionTagmaton.notmetered
ltx/en_us_oca/me.m02.d06:meVE.Stichera02.mode	@ltx/en_us_oca/miscellanea:misc.Mode1
ltx/en_us_oca/me.m02.d06:meVE.Stichera02.text	
ltx/en_us_oca/me.m02.d06:meVE.Stichera03.incipit	…
ltx/en_us_oca/me.m02.d06:meVE.Stichera03.melody	@ltx/en_us_oca/he.a.m1:heAU.TonOuranionTagmaton.notmetered
ltx/en_us_oca/me.m02.d06:meVE.Stichera03.mode	@ltx/en_us_oca/miscellanea:misc.Mode1
ltx/en_us_oca/me.m02.d06:meVE.Stichera03.text	
ltx/en_us_oca/me.m02.d06:meVE.Stichera04.greekmelody	@ltx/en_us_oca/he.a.m6:heAU.TriimerosAnestis.greekname
ltx/en_us_oca/me.m02.d06:meVE.Stichera04.incipit	…
ltx/en_us_oca/me.m02.d06:meVE.Stichera04.melody	@ltx/en_us_oca/he.a.m6:heAU.TriimerosAnestis.notmetered
ltx/en_us_oca/me.m02.d06:meVE.Stichera04.mode	@ltx/en_us_oca/miscellanea:misc.Mode6
ltx/en_us_oca/me.m02.d06:meVE.Stichera04.text	
ltx/en_us_oca/me.m02.d06:meVE.Stichera05.incipit	…
ltx/en_us_oca/me.m02.d06:meVE.Stichera05.melody	@ltx/en_us_oca/he.a.m6:heAU.TriimerosAnestis.notmetered
ltx/en_us_oca/me.m02.d06:meVE.Stichera05.mode	@ltx/en_us_oca/miscellanea:misc.Mode6
ltx/en_us_oca/me.m02.d06:meVE.Stichera05.text	
ltx/en_us_oca/me.m02.d06:meVE.Stichera06.incipit	…
ltx/en_us_oca/me.m02.d06:meVE.Stichera06.melody	@ltx/en_us_oca/he.a.m6:heAU.TriimerosAnestis.notmetered
ltx/en_us_oca/me.m02.d06:meVE.Stichera06.mode	@ltx/en_us_oca/miscellanea:misc.Mode6
ltx/en_us_oca/me.m02.d06:meVE.Stichera06.text	
