ltx/en_us_oca/miscellanea:misc.Automelon	
ltx/en_us_oca/miscellanea:misc.AutomelonNotMetered	Automelon (not metered).
ltx/en_us_oca/miscellanea:misc.FutureInstance	(The template is incomplete. This instance is far in the future.)
ltx/en_us_oca/miscellanea:misc.Heirmologic	
ltx/en_us_oca/miscellanea:misc.Heirmos	
ltx/en_us_oca/miscellanea:misc.HeirmosNotMetered	Heirmos (not metered).
ltx/en_us_oca/miscellanea:misc.Idiomelon	
ltx/en_us_oca/miscellanea:misc.Mode0	Tone
ltx/en_us_oca/miscellanea:misc.Mode1	Tone 1.
ltx/en_us_oca/miscellanea:misc.Mode1.naked	Tone 1
ltx/en_us_oca/miscellanea:misc.Mode2	Tone 2.
ltx/en_us_oca/miscellanea:misc.Mode2.naked	Tone 2
ltx/en_us_oca/miscellanea:misc.Mode3	Tone 3.
ltx/en_us_oca/miscellanea:misc.Mode3.naked	Tone 3
ltx/en_us_oca/miscellanea:misc.Mode4	Tone 4.
ltx/en_us_oca/miscellanea:misc.Mode4.naked	Tone 4
ltx/en_us_oca/miscellanea:misc.Mode5	Tone 5.
ltx/en_us_oca/miscellanea:misc.Mode5.naked	Tone 5
ltx/en_us_oca/miscellanea:misc.Mode6	Tone 6.
ltx/en_us_oca/miscellanea:misc.Mode6.naked	Tone 6
ltx/en_us_oca/miscellanea:misc.Mode7	Tone 7.
ltx/en_us_oca/miscellanea:misc.Mode7.naked	Tone 7
ltx/en_us_oca/miscellanea:misc.Mode8	Tone 8.
ltx/en_us_oca/miscellanea:misc.Mode8.naked	Tone 8
ltx/en_us_oca/miscellanea:misc.ModeNA	
ltx/en_us_oca/miscellanea:misc.ModeVariable	
ltx/en_us_oca/miscellanea:misc.NotAvailable	
ltx/en_us_oca/miscellanea:misc.NotMetered	(not metered)
ltx/en_us_oca/miscellanea:misc.Ode1	
ltx/en_us_oca/miscellanea:misc.Ode2	
ltx/en_us_oca/miscellanea:misc.Ode3	
ltx/en_us_oca/miscellanea:misc.Ode4	
ltx/en_us_oca/miscellanea:misc.Ode5	
ltx/en_us_oca/miscellanea:misc.Ode6	
ltx/en_us_oca/miscellanea:misc.Ode7	
ltx/en_us_oca/miscellanea:misc.Ode8	
ltx/en_us_oca/miscellanea:misc.Ode9	
ltx/en_us_oca/miscellanea:misc.Prosomoion	
ltx/en_us_oca/miscellanea:misc.Rnum1	I
ltx/en_us_oca/miscellanea:misc.Rnum10	X
ltx/en_us_oca/miscellanea:misc.Rnum2	II
ltx/en_us_oca/miscellanea:misc.Rnum3	III
ltx/en_us_oca/miscellanea:misc.Rnum4	IV
ltx/en_us_oca/miscellanea:misc.Rnum5	V
ltx/en_us_oca/miscellanea:misc.Rnum6	VI
ltx/en_us_oca/miscellanea:misc.Rnum7	VII
ltx/en_us_oca/miscellanea:misc.Rnum8	VIII
ltx/en_us_oca/miscellanea:misc.Rnum9	IX
ltx/en_us_oca/miscellanea:misc.anum1	1.
ltx/en_us_oca/miscellanea:misc.anum10	10.
ltx/en_us_oca/miscellanea:misc.anum11	11.
ltx/en_us_oca/miscellanea:misc.anum12	12.
ltx/en_us_oca/miscellanea:misc.anum13	13.
ltx/en_us_oca/miscellanea:misc.anum14	14.
ltx/en_us_oca/miscellanea:misc.anum15	15.
ltx/en_us_oca/miscellanea:misc.anum16	16.
ltx/en_us_oca/miscellanea:misc.anum17	17.
ltx/en_us_oca/miscellanea:misc.anum18	18.
ltx/en_us_oca/miscellanea:misc.anum19	19.
ltx/en_us_oca/miscellanea:misc.anum2	2.
ltx/en_us_oca/miscellanea:misc.anum20	20.
ltx/en_us_oca/miscellanea:misc.anum21	21.
ltx/en_us_oca/miscellanea:misc.anum22	22.
ltx/en_us_oca/miscellanea:misc.anum23	23.
ltx/en_us_oca/miscellanea:misc.anum24	24.
ltx/en_us_oca/miscellanea:misc.anum25	25.
ltx/en_us_oca/miscellanea:misc.anum26	26.
ltx/en_us_oca/miscellanea:misc.anum27	27.
ltx/en_us_oca/miscellanea:misc.anum28	28.
ltx/en_us_oca/miscellanea:misc.anum29	29.
ltx/en_us_oca/miscellanea:misc.anum3	3.
ltx/en_us_oca/miscellanea:misc.anum30	30.
ltx/en_us_oca/miscellanea:misc.anum31	31.
ltx/en_us_oca/miscellanea:misc.anum32	32.
ltx/en_us_oca/miscellanea:misc.anum33	33.
ltx/en_us_oca/miscellanea:misc.anum4	4.
ltx/en_us_oca/miscellanea:misc.anum5	5.
ltx/en_us_oca/miscellanea:misc.anum6	6.
ltx/en_us_oca/miscellanea:misc.anum7	7.
ltx/en_us_oca/miscellanea:misc.anum8	8.
ltx/en_us_oca/miscellanea:misc.anum9	9.
ltx/en_us_oca/miscellanea:misc.book.BooksSources.title	
ltx/en_us_oca/miscellanea:misc.book.Euchologion.name	
ltx/en_us_oca/miscellanea:misc.book.Heirmologion.name	
ltx/en_us_oca/miscellanea:misc.book.Hieratikon.name	
ltx/en_us_oca/miscellanea:misc.book.Horologion.name	
ltx/en_us_oca/miscellanea:misc.book.MeSupplement.name	
ltx/en_us_oca/miscellanea:misc.book.Menaion.name	
ltx/en_us_oca/miscellanea:misc.book.Octoechos.name	
ltx/en_us_oca/miscellanea:misc.book.PeSupplement.name	
ltx/en_us_oca/miscellanea:misc.book.Pentecostarion.name	
ltx/en_us_oca/miscellanea:misc.book.Psalter.name	
ltx/en_us_oca/miscellanea:misc.book.Synaxarion.name	
ltx/en_us_oca/miscellanea:misc.book.Triodion.name	
ltx/en_us_oca/miscellanea:misc.book.Typikon.name	
ltx/en_us_oca/miscellanea:misc.bracket.close	]
ltx/en_us_oca/miscellanea:misc.bracket.open	[
ltx/en_us_oca/miscellanea:misc.greekquotation.left	«
ltx/en_us_oca/miscellanea:misc.greekquotation.right	»
ltx/en_us_oca/miscellanea:misc.horizontal_line.dash1	----------
ltx/en_us_oca/miscellanea:misc.horizontal_line.solid1	__________
ltx/en_us_oca/miscellanea:misc.parenthesis.close	)
ltx/en_us_oca/miscellanea:misc.parenthesis.open	(
ltx/en_us_oca/miscellanea:misc.punctuation.comma	,
ltx/en_us_oca/miscellanea:misc.punctuation.ellipsis	…
ltx/en_us_oca/miscellanea:misc.punctuation.period	.
ltx/en_us_oca/miscellanea:misc.rnum1	i
ltx/en_us_oca/miscellanea:misc.rnum10	x
ltx/en_us_oca/miscellanea:misc.rnum2	ii
ltx/en_us_oca/miscellanea:misc.rnum3	iii
ltx/en_us_oca/miscellanea:misc.rnum4	iv
ltx/en_us_oca/miscellanea:misc.rnum5	v
ltx/en_us_oca/miscellanea:misc.rnum6	vi
ltx/en_us_oca/miscellanea:misc.rnum7	vii
ltx/en_us_oca/miscellanea:misc.rnum8	viii
ltx/en_us_oca/miscellanea:misc.rnum9	ix
ltx/en_us_oca/miscellanea:misc.separator.asterisk	 ⁄
ltx/en_us_oca/miscellanea:misc.separator.emdash	 —
ltx/en_us_oca/miscellanea:misc.separator.endash	 –
ltx/en_us_oca/miscellanea:misc.separator.hyphen	 -
ltx/en_us_oca/miscellanea:misc.separator.pipe	 |
ltx/en_us_oca/miscellanea:misc.separator.slash	 /
ltx/en_us_oca/miscellanea:misc.vVerse	
ltx/en_us_oca/miscellanea:misc.vVerse1	
ltx/en_us_oca/miscellanea:misc.vVerse2	
ltx/en_us_oca/miscellanea:misc.vVerse3	
ltx/en_us_oca/miscellanea:misc.vVerse4	
