ltx/en_us_oca/tr.d053:trCO.header	
ltx/en_us_oca/tr.d053:trDA.commemoration.full	
ltx/en_us_oca/tr.d053:trDA.commemoration.short	
ltx/en_us_oca/tr.d053:trDA.insert1	
ltx/en_us_oca/tr.d053:trDA.insert2	
ltx/en_us_oca/tr.d053:trDA.note	
ltx/en_us_oca/tr.d053:trDA.title	
ltx/en_us_oca/tr.d053:trHO.commemorations	
ltx/en_us_oca/tr.d053:trHO.daytitle	
ltx/en_us_oca/tr.d053:trHO.description1	
ltx/en_us_oca/tr.d053:trHO.description2	
ltx/en_us_oca/tr.d053:trHO.note1	
ltx/en_us_oca/tr.d053:trHO.note2	
ltx/en_us_oca/tr.d053:trMA.AposIdiomelon1.incipit	…
ltx/en_us_oca/tr.d053:trMA.AposIdiomelon1.melody	@ltx/en_us_oca/miscellanea:misc.Idiomelon
ltx/en_us_oca/tr.d053:trMA.AposIdiomelon1.mode	@ltx/en_us_oca/miscellanea:misc.Mode3
ltx/en_us_oca/tr.d053:trMA.AposIdiomelon1.text	
ltx/en_us_oca/tr.d053:trMA.AposIdiomelon2.incipit	…
ltx/en_us_oca/tr.d053:trMA.AposIdiomelon2.melody	@ltx/en_us_oca/miscellanea:misc.Idiomelon
ltx/en_us_oca/tr.d053:trMA.AposIdiomelon2.mode	@ltx/en_us_oca/miscellanea:misc.Mode8
ltx/en_us_oca/tr.d053:trMA.AposIdiomelon2.text	
ltx/en_us_oca/tr.d053:trMA.AposMartyric.incipit	…
ltx/en_us_oca/tr.d053:trMA.AposMartyric.melody	
ltx/en_us_oca/tr.d053:trMA.AposMartyric.mode	@ltx/en_us_oca/miscellanea:misc.Mode8
ltx/en_us_oca/tr.d053:trMA.AposMartyric.text	
ltx/en_us_oca/tr.d053:trMA.AposTheotokion.incipit	…
ltx/en_us_oca/tr.d053:trMA.AposTheotokion.melody	
ltx/en_us_oca/tr.d053:trMA.AposTheotokion.mode	@ltx/en_us_oca/miscellanea:misc.Mode8
ltx/en_us_oca/tr.d053:trMA.AposTheotokion.text	
ltx/en_us_oca/tr.d053:trMA.C1.poet	@ltx/en_us_oca/poets:po.Iosif
ltx/en_us_oca/tr.d053:trMA.C2.poet	@ltx/en_us_oca/poets:po.Theodorou
ltx/en_us_oca/tr.d053:trMA.Kathisma21.greekmelody	@ltx/en_us_oca/he.a.m8:heAU.ToProstachthen.greekname
ltx/en_us_oca/tr.d053:trMA.Kathisma21.incipit	…
ltx/en_us_oca/tr.d053:trMA.Kathisma21.melody	@ltx/en_us_oca/he.a.m8:heAU.ToProstachthen.notmetered
ltx/en_us_oca/tr.d053:trMA.Kathisma21.mode	@ltx/en_us_oca/miscellanea:misc.Mode8
ltx/en_us_oca/tr.d053:trMA.Kathisma21.text	
ltx/en_us_oca/tr.d053:trMA.Kathisma22.greekmelody	@ltx/en_us_oca/he.a.m8:heAU.ToProstachthen.greekname
ltx/en_us_oca/tr.d053:trMA.Kathisma22.incipit	…
ltx/en_us_oca/tr.d053:trMA.Kathisma22.melody	@ltx/en_us_oca/he.a.m8:heAU.ToProstachthen.notmetered
ltx/en_us_oca/tr.d053:trMA.Kathisma22.mode	@ltx/en_us_oca/miscellanea:misc.Mode8
ltx/en_us_oca/tr.d053:trMA.Kathisma22.text	
ltx/en_us_oca/tr.d053:trMA.Kathisma31.incipit	…
ltx/en_us_oca/tr.d053:trMA.Kathisma31.melody	
ltx/en_us_oca/tr.d053:trMA.Kathisma31.mode	@ltx/en_us_oca/miscellanea:misc.Mode2
ltx/en_us_oca/tr.d053:trMA.Kathisma31.text	
ltx/en_us_oca/tr.d053:trMA.Kathisma32.incipit	…
ltx/en_us_oca/tr.d053:trMA.Kathisma32.melody	
ltx/en_us_oca/tr.d053:trMA.Kathisma32.mode	@ltx/en_us_oca/miscellanea:misc.Mode2
ltx/en_us_oca/tr.d053:trMA.Kathisma32.text	
ltx/en_us_oca/tr.d053:trMA.Ode3C11.greekmelody	@ltx/en_us_oca/he.h.m8:heHE.OuraniasApsidos.greekname
ltx/en_us_oca/tr.d053:trMA.Ode3C11.incipit	…
ltx/en_us_oca/tr.d053:trMA.Ode3C11.melody	@ltx/en_us_oca/he.h.m8:heHE.OuraniasApsidos.notmetered
ltx/en_us_oca/tr.d053:trMA.Ode3C11.mode	@ltx/en_us_oca/miscellanea:misc.Mode8
ltx/en_us_oca/tr.d053:trMA.Ode3C11.ode	@ltx/en_us_oca/miscellanea:misc.Ode3
ltx/en_us_oca/tr.d053:trMA.Ode3C11.text	
ltx/en_us_oca/tr.d053:trMA.Ode3C12.incipit	…
ltx/en_us_oca/tr.d053:trMA.Ode3C12.melody	@ltx/en_us_oca/he.h.m8:heHE.OuraniasApsidos.notmetered
ltx/en_us_oca/tr.d053:trMA.Ode3C12.mode	@ltx/en_us_oca/miscellanea:misc.Mode8
ltx/en_us_oca/tr.d053:trMA.Ode3C12.ode	@ltx/en_us_oca/miscellanea:misc.Ode3
ltx/en_us_oca/tr.d053:trMA.Ode3C12.text	
ltx/en_us_oca/tr.d053:trMA.Ode3C13.incipit	…
ltx/en_us_oca/tr.d053:trMA.Ode3C13.melody	@ltx/en_us_oca/he.h.m8:heHE.OuraniasApsidos.notmetered
ltx/en_us_oca/tr.d053:trMA.Ode3C13.mode	@ltx/en_us_oca/miscellanea:misc.Mode8
ltx/en_us_oca/tr.d053:trMA.Ode3C13.ode	@ltx/en_us_oca/miscellanea:misc.Ode3
ltx/en_us_oca/tr.d053:trMA.Ode3C13.text	
ltx/en_us_oca/tr.d053:trMA.Ode3C1T.incipit	…
ltx/en_us_oca/tr.d053:trMA.Ode3C1T.melody	@ltx/en_us_oca/he.h.m8:heHE.OuraniasApsidos.notmetered
ltx/en_us_oca/tr.d053:trMA.Ode3C1T.mode	@ltx/en_us_oca/miscellanea:misc.Mode8
ltx/en_us_oca/tr.d053:trMA.Ode3C1T.ode	@ltx/en_us_oca/miscellanea:misc.Ode3
ltx/en_us_oca/tr.d053:trMA.Ode3C1T.text	
ltx/en_us_oca/tr.d053:trMA.Ode3C21.greekmelody	@ltx/en_us_oca/he.h.m2:heHE.SteirothentaMouTonNoun.greekname
ltx/en_us_oca/tr.d053:trMA.Ode3C21.incipit	…
ltx/en_us_oca/tr.d053:trMA.Ode3C21.melody	@ltx/en_us_oca/he.h.m2:heHE.SteirothentaMouTonNoun.notmetered
ltx/en_us_oca/tr.d053:trMA.Ode3C21.mode	@ltx/en_us_oca/miscellanea:misc.Mode2
ltx/en_us_oca/tr.d053:trMA.Ode3C21.ode	@ltx/en_us_oca/miscellanea:misc.Ode3
ltx/en_us_oca/tr.d053:trMA.Ode3C21.text	
ltx/en_us_oca/tr.d053:trMA.Ode3C22.incipit	…
ltx/en_us_oca/tr.d053:trMA.Ode3C22.melody	@ltx/en_us_oca/he.h.m2:heHE.SteirothentaMouTonNoun.notmetered
ltx/en_us_oca/tr.d053:trMA.Ode3C22.mode	@ltx/en_us_oca/miscellanea:misc.Mode2
ltx/en_us_oca/tr.d053:trMA.Ode3C22.ode	@ltx/en_us_oca/miscellanea:misc.Ode3
ltx/en_us_oca/tr.d053:trMA.Ode3C22.text	
ltx/en_us_oca/tr.d053:trMA.Ode3C2A1.incipit	…
ltx/en_us_oca/tr.d053:trMA.Ode3C2A1.melody	@ltx/en_us_oca/he.h.m2:heHE.SteirothentaMouTonNoun.notmetered
ltx/en_us_oca/tr.d053:trMA.Ode3C2A1.mode	@ltx/en_us_oca/miscellanea:misc.Mode2
ltx/en_us_oca/tr.d053:trMA.Ode3C2A1.ode	@ltx/en_us_oca/miscellanea:misc.Ode3
ltx/en_us_oca/tr.d053:trMA.Ode3C2A1.text	
ltx/en_us_oca/tr.d053:trMA.Ode3C2H.greekmelody	@ltx/en_us_oca/he.h.m2:heHE.SteirothentaMouTonNoun.greekname
ltx/en_us_oca/tr.d053:trMA.Ode3C2H.incipit	@ltx/en_us_oca/he.h.m2:heHE.SteirothentaMouTonNoun.incipit
ltx/en_us_oca/tr.d053:trMA.Ode3C2H.melody	@ltx/en_us_oca/he.h.m2:heHE.SteirothentaMouTonNoun.melody
ltx/en_us_oca/tr.d053:trMA.Ode3C2H.mode	@ltx/en_us_oca/miscellanea:misc.Mode2
ltx/en_us_oca/tr.d053:trMA.Ode3C2H.ode	@ltx/en_us_oca/miscellanea:misc.Ode3
ltx/en_us_oca/tr.d053:trMA.Ode3C2H.text	@ltx/en_us_oca/he.h.m2:heHE.SteirothentaMouTonNoun.text
ltx/en_us_oca/tr.d053:trMA.Ode3C2T.incipit	…
ltx/en_us_oca/tr.d053:trMA.Ode3C2T.melody	@ltx/en_us_oca/he.h.m2:heHE.SteirothentaMouTonNoun.notmetered
ltx/en_us_oca/tr.d053:trMA.Ode3C2T.mode	@ltx/en_us_oca/miscellanea:misc.Mode2
ltx/en_us_oca/tr.d053:trMA.Ode3C2T.ode	@ltx/en_us_oca/miscellanea:misc.Ode3
ltx/en_us_oca/tr.d053:trMA.Ode3C2T.text	
ltx/en_us_oca/tr.d053:trMA.Ode3C2Tr.incipit	…
ltx/en_us_oca/tr.d053:trMA.Ode3C2Tr.melody	@ltx/en_us_oca/he.h.m2:heHE.SteirothentaMouTonNoun.notmetered
ltx/en_us_oca/tr.d053:trMA.Ode3C2Tr.mode	@ltx/en_us_oca/miscellanea:misc.Mode2
ltx/en_us_oca/tr.d053:trMA.Ode3C2Tr.ode	@ltx/en_us_oca/miscellanea:misc.Ode3
ltx/en_us_oca/tr.d053:trMA.Ode3C2Tr.text	
ltx/en_us_oca/tr.d053:trMA.Ode8C11.greekmelody	@ltx/en_us_oca/he.h.m8:heHE.EptaplasiosKaminon.greekname
ltx/en_us_oca/tr.d053:trMA.Ode8C11.incipit	…
ltx/en_us_oca/tr.d053:trMA.Ode8C11.melody	@ltx/en_us_oca/he.h.m8:heHE.EptaplasiosKaminon.notmetered
ltx/en_us_oca/tr.d053:trMA.Ode8C11.mode	@ltx/en_us_oca/miscellanea:misc.Mode8
ltx/en_us_oca/tr.d053:trMA.Ode8C11.ode	@ltx/en_us_oca/miscellanea:misc.Ode8
ltx/en_us_oca/tr.d053:trMA.Ode8C11.text	
ltx/en_us_oca/tr.d053:trMA.Ode8C12.incipit	…
ltx/en_us_oca/tr.d053:trMA.Ode8C12.melody	@ltx/en_us_oca/he.h.m8:heHE.EptaplasiosKaminon.notmetered
ltx/en_us_oca/tr.d053:trMA.Ode8C12.mode	@ltx/en_us_oca/miscellanea:misc.Mode8
ltx/en_us_oca/tr.d053:trMA.Ode8C12.ode	@ltx/en_us_oca/miscellanea:misc.Ode8
ltx/en_us_oca/tr.d053:trMA.Ode8C12.text	
ltx/en_us_oca/tr.d053:trMA.Ode8C13.incipit	…
ltx/en_us_oca/tr.d053:trMA.Ode8C13.melody	@ltx/en_us_oca/he.h.m8:heHE.EptaplasiosKaminon.notmetered
ltx/en_us_oca/tr.d053:trMA.Ode8C13.mode	@ltx/en_us_oca/miscellanea:misc.Mode8
ltx/en_us_oca/tr.d053:trMA.Ode8C13.ode	@ltx/en_us_oca/miscellanea:misc.Ode8
ltx/en_us_oca/tr.d053:trMA.Ode8C13.text	
ltx/en_us_oca/tr.d053:trMA.Ode8C1T.incipit	…
ltx/en_us_oca/tr.d053:trMA.Ode8C1T.melody	@ltx/en_us_oca/he.h.m8:heHE.EptaplasiosKaminon.notmetered
ltx/en_us_oca/tr.d053:trMA.Ode8C1T.mode	@ltx/en_us_oca/miscellanea:misc.Mode8
ltx/en_us_oca/tr.d053:trMA.Ode8C1T.ode	@ltx/en_us_oca/miscellanea:misc.Ode8
ltx/en_us_oca/tr.d053:trMA.Ode8C1T.text	
ltx/en_us_oca/tr.d053:trMA.Ode8C21.greekmelody	@ltx/en_us_oca/he.h.m2:heHE.TonEnFonaisAngelikais.greekname
ltx/en_us_oca/tr.d053:trMA.Ode8C21.incipit	…
ltx/en_us_oca/tr.d053:trMA.Ode8C21.melody	@ltx/en_us_oca/he.h.m2:heHE.TonEnFonaisAngelikais.notmetered
ltx/en_us_oca/tr.d053:trMA.Ode8C21.mode	@ltx/en_us_oca/miscellanea:misc.Mode2
ltx/en_us_oca/tr.d053:trMA.Ode8C21.ode	@ltx/en_us_oca/miscellanea:misc.Ode8
ltx/en_us_oca/tr.d053:trMA.Ode8C21.text	
ltx/en_us_oca/tr.d053:trMA.Ode8C22.incipit	…
ltx/en_us_oca/tr.d053:trMA.Ode8C22.melody	@ltx/en_us_oca/he.h.m2:heHE.TonEnFonaisAngelikais.notmetered
ltx/en_us_oca/tr.d053:trMA.Ode8C22.mode	@ltx/en_us_oca/miscellanea:misc.Mode2
ltx/en_us_oca/tr.d053:trMA.Ode8C22.ode	@ltx/en_us_oca/miscellanea:misc.Ode8
ltx/en_us_oca/tr.d053:trMA.Ode8C22.text	
ltx/en_us_oca/tr.d053:trMA.Ode8C2A1.incipit	…
ltx/en_us_oca/tr.d053:trMA.Ode8C2A1.melody	@ltx/en_us_oca/he.h.m2:heHE.TonEnFonaisAngelikais.notmetered
ltx/en_us_oca/tr.d053:trMA.Ode8C2A1.mode	@ltx/en_us_oca/miscellanea:misc.Mode2
ltx/en_us_oca/tr.d053:trMA.Ode8C2A1.ode	@ltx/en_us_oca/miscellanea:misc.Ode8
ltx/en_us_oca/tr.d053:trMA.Ode8C2A1.text	
ltx/en_us_oca/tr.d053:trMA.Ode8C2H.greekmelody	@ltx/en_us_oca/he.h.m2:heHE.TonEnFonaisAngelikais.greekname
ltx/en_us_oca/tr.d053:trMA.Ode8C2H.incipit	@ltx/en_us_oca/he.h.m2:heHE.TonEnFonaisAngelikais.incipit
ltx/en_us_oca/tr.d053:trMA.Ode8C2H.melody	@ltx/en_us_oca/he.h.m2:heHE.TonEnFonaisAngelikais.melody
ltx/en_us_oca/tr.d053:trMA.Ode8C2H.mode	@ltx/en_us_oca/miscellanea:misc.Mode2
ltx/en_us_oca/tr.d053:trMA.Ode8C2H.ode	@ltx/en_us_oca/miscellanea:misc.Ode8
ltx/en_us_oca/tr.d053:trMA.Ode8C2H.text	@ltx/en_us_oca/he.h.m2:heHE.TonEnFonaisAngelikais.text
ltx/en_us_oca/tr.d053:trMA.Ode8C2T.incipit	…
ltx/en_us_oca/tr.d053:trMA.Ode8C2T.melody	@ltx/en_us_oca/he.h.m2:heHE.TonEnFonaisAngelikais.notmetered
ltx/en_us_oca/tr.d053:trMA.Ode8C2T.mode	@ltx/en_us_oca/miscellanea:misc.Mode2
ltx/en_us_oca/tr.d053:trMA.Ode8C2T.ode	@ltx/en_us_oca/miscellanea:misc.Ode8
ltx/en_us_oca/tr.d053:trMA.Ode8C2T.text	
ltx/en_us_oca/tr.d053:trMA.Ode8C2Tr.incipit	…
ltx/en_us_oca/tr.d053:trMA.Ode8C2Tr.melody	@ltx/en_us_oca/he.h.m2:heHE.TonEnFonaisAngelikais.notmetered
ltx/en_us_oca/tr.d053:trMA.Ode8C2Tr.mode	@ltx/en_us_oca/miscellanea:misc.Mode2
ltx/en_us_oca/tr.d053:trMA.Ode8C2Tr.ode	@ltx/en_us_oca/miscellanea:misc.Ode8
ltx/en_us_oca/tr.d053:trMA.Ode8C2Tr.text	
ltx/en_us_oca/tr.d053:trMA.Ode9C11.greekmelody	@ltx/en_us_oca/he.h.m8:heHE.ExestiEpiTouto.greekname
ltx/en_us_oca/tr.d053:trMA.Ode9C11.incipit	…
ltx/en_us_oca/tr.d053:trMA.Ode9C11.melody	@ltx/en_us_oca/he.h.m8:heHE.ExestiEpiTouto.notmetered
ltx/en_us_oca/tr.d053:trMA.Ode9C11.mode	@ltx/en_us_oca/miscellanea:misc.Mode8
ltx/en_us_oca/tr.d053:trMA.Ode9C11.ode	@ltx/en_us_oca/miscellanea:misc.Ode9
ltx/en_us_oca/tr.d053:trMA.Ode9C11.text	
ltx/en_us_oca/tr.d053:trMA.Ode9C12.incipit	…
ltx/en_us_oca/tr.d053:trMA.Ode9C12.melody	@ltx/en_us_oca/he.h.m8:heHE.ExestiEpiTouto.notmetered
ltx/en_us_oca/tr.d053:trMA.Ode9C12.mode	@ltx/en_us_oca/miscellanea:misc.Mode8
ltx/en_us_oca/tr.d053:trMA.Ode9C12.ode	@ltx/en_us_oca/miscellanea:misc.Ode9
ltx/en_us_oca/tr.d053:trMA.Ode9C12.text	
ltx/en_us_oca/tr.d053:trMA.Ode9C13.incipit	…
ltx/en_us_oca/tr.d053:trMA.Ode9C13.melody	@ltx/en_us_oca/he.h.m8:heHE.ExestiEpiTouto.notmetered
ltx/en_us_oca/tr.d053:trMA.Ode9C13.mode	@ltx/en_us_oca/miscellanea:misc.Mode8
ltx/en_us_oca/tr.d053:trMA.Ode9C13.ode	@ltx/en_us_oca/miscellanea:misc.Ode9
ltx/en_us_oca/tr.d053:trMA.Ode9C13.text	
ltx/en_us_oca/tr.d053:trMA.Ode9C1T.incipit	…
ltx/en_us_oca/tr.d053:trMA.Ode9C1T.melody	@ltx/en_us_oca/he.h.m8:heHE.ExestiEpiTouto.notmetered
ltx/en_us_oca/tr.d053:trMA.Ode9C1T.mode	@ltx/en_us_oca/miscellanea:misc.Mode8
ltx/en_us_oca/tr.d053:trMA.Ode9C1T.ode	@ltx/en_us_oca/miscellanea:misc.Ode9
ltx/en_us_oca/tr.d053:trMA.Ode9C1T.text	
ltx/en_us_oca/tr.d053:trMA.Ode9C21.greekmelody	@ltx/en_us_oca/he.h.m2:heHE.TinParthenianSou.greekname
ltx/en_us_oca/tr.d053:trMA.Ode9C21.incipit	…
ltx/en_us_oca/tr.d053:trMA.Ode9C21.melody	@ltx/en_us_oca/he.h.m2:heHE.TinParthenianSou.notmetered
ltx/en_us_oca/tr.d053:trMA.Ode9C21.mode	@ltx/en_us_oca/miscellanea:misc.Mode2
ltx/en_us_oca/tr.d053:trMA.Ode9C21.ode	@ltx/en_us_oca/miscellanea:misc.Ode9
ltx/en_us_oca/tr.d053:trMA.Ode9C21.text	
ltx/en_us_oca/tr.d053:trMA.Ode9C22.incipit	…
ltx/en_us_oca/tr.d053:trMA.Ode9C22.melody	@ltx/en_us_oca/he.h.m2:heHE.TinParthenianSou.notmetered
ltx/en_us_oca/tr.d053:trMA.Ode9C22.mode	@ltx/en_us_oca/miscellanea:misc.Mode2
ltx/en_us_oca/tr.d053:trMA.Ode9C22.ode	@ltx/en_us_oca/miscellanea:misc.Ode9
ltx/en_us_oca/tr.d053:trMA.Ode9C22.text	
ltx/en_us_oca/tr.d053:trMA.Ode9C2A1.incipit	…
ltx/en_us_oca/tr.d053:trMA.Ode9C2A1.melody	@ltx/en_us_oca/he.h.m2:heHE.TinParthenianSou.notmetered
ltx/en_us_oca/tr.d053:trMA.Ode9C2A1.mode	@ltx/en_us_oca/miscellanea:misc.Mode2
ltx/en_us_oca/tr.d053:trMA.Ode9C2A1.ode	@ltx/en_us_oca/miscellanea:misc.Ode9
ltx/en_us_oca/tr.d053:trMA.Ode9C2A1.text	
ltx/en_us_oca/tr.d053:trMA.Ode9C2H.greekmelody	@ltx/en_us_oca/he.h.m2:heHE.TinParthenianSou.greekname
ltx/en_us_oca/tr.d053:trMA.Ode9C2H.incipit	@ltx/en_us_oca/he.h.m2:heHE.TinParthenianSou.incipit
ltx/en_us_oca/tr.d053:trMA.Ode9C2H.melody	@ltx/en_us_oca/he.h.m2:heHE.TinParthenianSou.melody
ltx/en_us_oca/tr.d053:trMA.Ode9C2H.mode	@ltx/en_us_oca/miscellanea:misc.Mode2
ltx/en_us_oca/tr.d053:trMA.Ode9C2H.ode	@ltx/en_us_oca/miscellanea:misc.Ode9
ltx/en_us_oca/tr.d053:trMA.Ode9C2H.text	@ltx/en_us_oca/he.h.m2:heHE.TinParthenianSou.text
ltx/en_us_oca/tr.d053:trMA.Ode9C2T.incipit	…
ltx/en_us_oca/tr.d053:trMA.Ode9C2T.melody	@ltx/en_us_oca/he.h.m2:heHE.TinParthenianSou.notmetered
ltx/en_us_oca/tr.d053:trMA.Ode9C2T.mode	@ltx/en_us_oca/miscellanea:misc.Mode2
ltx/en_us_oca/tr.d053:trMA.Ode9C2T.ode	@ltx/en_us_oca/miscellanea:misc.Ode9
ltx/en_us_oca/tr.d053:trMA.Ode9C2T.text	
ltx/en_us_oca/tr.d053:trMA.Ode9C2Tr.incipit	…
ltx/en_us_oca/tr.d053:trMA.Ode9C2Tr.melody	@ltx/en_us_oca/he.h.m2:heHE.TinParthenianSou.notmetered
ltx/en_us_oca/tr.d053:trMA.Ode9C2Tr.mode	@ltx/en_us_oca/miscellanea:misc.Mode2
ltx/en_us_oca/tr.d053:trMA.Ode9C2Tr.ode	@ltx/en_us_oca/miscellanea:misc.Ode9
ltx/en_us_oca/tr.d053:trMA.Ode9C2Tr.text	
ltx/en_us_oca/tr.d053:trTE.Troparion.incipit	@ltx/en_us_oca/he.ga:heGA.TasAlgidonas.incipit
ltx/en_us_oca/tr.d053:trTE.Troparion.melody	
ltx/en_us_oca/tr.d053:trTE.Troparion.mode	@ltx/en_us_oca/miscellanea:misc.Mode1
ltx/en_us_oca/tr.d053:trTE.Troparion.text	@ltx/en_us_oca/he.ga:heGA.TasAlgidonas.text
ltx/en_us_oca/tr.d053:trTE.Troparion2.incipit	…
ltx/en_us_oca/tr.d053:trTE.Troparion2.text	
ltx/en_us_oca/tr.d053:trVE.AposIdiomelon1.incipit	…
ltx/en_us_oca/tr.d053:trVE.AposIdiomelon1.melody	@ltx/en_us_oca/miscellanea:misc.Idiomelon
ltx/en_us_oca/tr.d053:trVE.AposIdiomelon1.mode	@ltx/en_us_oca/miscellanea:misc.Mode5
ltx/en_us_oca/tr.d053:trVE.AposIdiomelon1.text	
ltx/en_us_oca/tr.d053:trVE.AposIdiomelon2.incipit	…
ltx/en_us_oca/tr.d053:trVE.AposIdiomelon2.melody	@ltx/en_us_oca/miscellanea:misc.Idiomelon
ltx/en_us_oca/tr.d053:trVE.AposIdiomelon2.mode	@ltx/en_us_oca/miscellanea:misc.Mode8
ltx/en_us_oca/tr.d053:trVE.AposIdiomelon2.text	
ltx/en_us_oca/tr.d053:trVE.AposMartyric.incipit	…
ltx/en_us_oca/tr.d053:trVE.AposMartyric.melody	
ltx/en_us_oca/tr.d053:trVE.AposMartyric.mode	@ltx/en_us_oca/miscellanea:misc.Mode8
ltx/en_us_oca/tr.d053:trVE.AposMartyric.text	
ltx/en_us_oca/tr.d053:trVE.AposTheotokion.greekmelody	@ltx/en_us_oca/he.a.m8:heAU.KyrieEiKaiKritirio.greekname
ltx/en_us_oca/tr.d053:trVE.AposTheotokion.incipit	…
ltx/en_us_oca/tr.d053:trVE.AposTheotokion.melody	@ltx/en_us_oca/he.a.m8:heAU.KyrieEiKaiKritirio.notmetered
ltx/en_us_oca/tr.d053:trVE.AposTheotokion.mode	@ltx/en_us_oca/miscellanea:misc.Mode8
ltx/en_us_oca/tr.d053:trVE.AposTheotokion.text	
ltx/en_us_oca/tr.d053:trVE.Stichera01.greekmelody	@ltx/en_us_oca/he.a.m8:heAU.TiYmasKalesomen.greekname
ltx/en_us_oca/tr.d053:trVE.Stichera01.incipit	…
ltx/en_us_oca/tr.d053:trVE.Stichera01.melody	@ltx/en_us_oca/he.a.m8:heAU.TiYmasKalesomen.notmetered
ltx/en_us_oca/tr.d053:trVE.Stichera01.mode	@ltx/en_us_oca/miscellanea:misc.Mode8
ltx/en_us_oca/tr.d053:trVE.Stichera01.text	
ltx/en_us_oca/tr.d053:trVE.Stichera02.greekmelody	@ltx/en_us_oca/he.a.m8:heAU.TiYmasKalesomen.greekname
ltx/en_us_oca/tr.d053:trVE.Stichera02.incipit	…
ltx/en_us_oca/tr.d053:trVE.Stichera02.melody	@ltx/en_us_oca/he.a.m8:heAU.TiYmasKalesomen.notmetered
ltx/en_us_oca/tr.d053:trVE.Stichera02.mode	@ltx/en_us_oca/miscellanea:misc.Mode8
ltx/en_us_oca/tr.d053:trVE.Stichera02.text	
ltx/en_us_oca/tr.d053:trVE.Stichera03.incipit	…
ltx/en_us_oca/tr.d053:trVE.Stichera03.melody	
ltx/en_us_oca/tr.d053:trVE.Stichera03.mode	@ltx/en_us_oca/miscellanea:misc.Mode2
ltx/en_us_oca/tr.d053:trVE.Stichera03.text	
