ltx/en_us_oca/oc.m3.d2:ocBK.ModeNaked	@ltx/en_us_oca/miscellanea:misc.Mode3.naked
ltx/en_us_oca/oc.m3.d2:ocLI.Beatitudes1.incipit	@ltx/en_us_oca/oc.m3.d1:ocLI.Beatitudes1.incipit
ltx/en_us_oca/oc.m3.d2:ocLI.Beatitudes1.melody	
ltx/en_us_oca/oc.m3.d2:ocLI.Beatitudes1.mode	@ltx/en_us_oca/miscellanea:misc.Mode3
ltx/en_us_oca/oc.m3.d2:ocLI.Beatitudes1.text	@ltx/en_us_oca/oc.m3.d1:ocLI.Beatitudes1.text
ltx/en_us_oca/oc.m3.d2:ocLI.Beatitudes2.incipit	…
ltx/en_us_oca/oc.m3.d2:ocLI.Beatitudes2.melody	
ltx/en_us_oca/oc.m3.d2:ocLI.Beatitudes2.mode	@ltx/en_us_oca/miscellanea:misc.Mode3
ltx/en_us_oca/oc.m3.d2:ocLI.Beatitudes2.text	
ltx/en_us_oca/oc.m3.d2:ocLI.Beatitudes3.incipit	…
ltx/en_us_oca/oc.m3.d2:ocLI.Beatitudes3.melody	
ltx/en_us_oca/oc.m3.d2:ocLI.Beatitudes3.mode	@ltx/en_us_oca/miscellanea:misc.Mode3
ltx/en_us_oca/oc.m3.d2:ocLI.Beatitudes3.text	
ltx/en_us_oca/oc.m3.d2:ocLI.Beatitudes4.incipit	…
ltx/en_us_oca/oc.m3.d2:ocLI.Beatitudes4.melody	
ltx/en_us_oca/oc.m3.d2:ocLI.Beatitudes4.mode	@ltx/en_us_oca/miscellanea:misc.Mode3
ltx/en_us_oca/oc.m3.d2:ocLI.Beatitudes4.text	
ltx/en_us_oca/oc.m3.d2:ocLI.BeatitudesT.incipit	…
ltx/en_us_oca/oc.m3.d2:ocLI.BeatitudesT.melody	
ltx/en_us_oca/oc.m3.d2:ocLI.BeatitudesT.mode	@ltx/en_us_oca/miscellanea:misc.Mode3
ltx/en_us_oca/oc.m3.d2:ocLI.BeatitudesT.text	
ltx/en_us_oca/oc.m3.d2:ocLI.BeatitudesTr.incipit	…
ltx/en_us_oca/oc.m3.d2:ocLI.BeatitudesTr.melody	
ltx/en_us_oca/oc.m3.d2:ocLI.BeatitudesTr.mode	@ltx/en_us_oca/miscellanea:misc.Mode3
ltx/en_us_oca/oc.m3.d2:ocLI.BeatitudesTr.text	
ltx/en_us_oca/oc.m3.d2:ocMA.ApolTheotokion.incipit	@ltx/en_us_oca/oc.m3.d3:ocMA.Kathisma33.incipit
ltx/en_us_oca/oc.m3.d2:ocMA.ApolTheotokion.melody	
ltx/en_us_oca/oc.m3.d2:ocMA.ApolTheotokion.mode	@ltx/en_us_oca/miscellanea:misc.Mode3
ltx/en_us_oca/oc.m3.d2:ocMA.ApolTheotokion.text	@ltx/en_us_oca/oc.m3.d3:ocMA.Kathisma33.text
ltx/en_us_oca/oc.m3.d2:ocMA.AposTheotokion.greekmelody	@ltx/en_us_oca/he.a.m3:heAU.MegaliTouStavrouSou.greekname
ltx/en_us_oca/oc.m3.d2:ocMA.AposTheotokion.incipit	…
ltx/en_us_oca/oc.m3.d2:ocMA.AposTheotokion.melody	@ltx/en_us_oca/he.a.m3:heAU.MegaliTouStavrouSou.notmetered
ltx/en_us_oca/oc.m3.d2:ocMA.AposTheotokion.mode	@ltx/en_us_oca/miscellanea:misc.Mode3
ltx/en_us_oca/oc.m3.d2:ocMA.AposTheotokion.text	
ltx/en_us_oca/oc.m3.d2:ocMA.Aposticha1.incipit	…
ltx/en_us_oca/oc.m3.d2:ocMA.Aposticha1.melody	
ltx/en_us_oca/oc.m3.d2:ocMA.Aposticha1.mode	@ltx/en_us_oca/miscellanea:misc.Mode3
ltx/en_us_oca/oc.m3.d2:ocMA.Aposticha1.text	
ltx/en_us_oca/oc.m3.d2:ocMA.Aposticha2.incipit	…
ltx/en_us_oca/oc.m3.d2:ocMA.Aposticha2.melody	
ltx/en_us_oca/oc.m3.d2:ocMA.Aposticha2.mode	@ltx/en_us_oca/miscellanea:misc.Mode3
ltx/en_us_oca/oc.m3.d2:ocMA.Aposticha2.text	
ltx/en_us_oca/oc.m3.d2:ocMA.Aposticha3.incipit	…
ltx/en_us_oca/oc.m3.d2:ocMA.Aposticha3.melody	
ltx/en_us_oca/oc.m3.d2:ocMA.Aposticha3.mode	@ltx/en_us_oca/miscellanea:misc.Mode3
ltx/en_us_oca/oc.m3.d2:ocMA.Aposticha3.text	
ltx/en_us_oca/oc.m3.d2:ocMA.C1.acrostic.notice1	
ltx/en_us_oca/oc.m3.d2:ocMA.C1.acrostic.text	
ltx/en_us_oca/oc.m3.d2:ocMA.C1.acrostic.title	Canon of Compunction.
ltx/en_us_oca/oc.m3.d2:ocMA.C2.acrostic.notice1	
ltx/en_us_oca/oc.m3.d2:ocMA.C2.acrostic.text	
ltx/en_us_oca/oc.m3.d2:ocMA.C2.acrostic.title	Canon for the Bodiless Hosts.
ltx/en_us_oca/oc.m3.d2:ocMA.Kathisma11.incipit	…
ltx/en_us_oca/oc.m3.d2:ocMA.Kathisma11.melody	
ltx/en_us_oca/oc.m3.d2:ocMA.Kathisma11.mode	@ltx/en_us_oca/miscellanea:misc.Mode3
ltx/en_us_oca/oc.m3.d2:ocMA.Kathisma11.text	
ltx/en_us_oca/oc.m3.d2:ocMA.Kathisma12.incipit	…
ltx/en_us_oca/oc.m3.d2:ocMA.Kathisma12.melody	
ltx/en_us_oca/oc.m3.d2:ocMA.Kathisma12.mode	@ltx/en_us_oca/miscellanea:misc.Mode3
ltx/en_us_oca/oc.m3.d2:ocMA.Kathisma12.text	
ltx/en_us_oca/oc.m3.d2:ocMA.Kathisma13.incipit	…
ltx/en_us_oca/oc.m3.d2:ocMA.Kathisma13.melody	
ltx/en_us_oca/oc.m3.d2:ocMA.Kathisma13.mode	@ltx/en_us_oca/miscellanea:misc.Mode3
ltx/en_us_oca/oc.m3.d2:ocMA.Kathisma13.text	
ltx/en_us_oca/oc.m3.d2:ocMA.Kathisma21.incipit	…
ltx/en_us_oca/oc.m3.d2:ocMA.Kathisma21.melody	
ltx/en_us_oca/oc.m3.d2:ocMA.Kathisma21.mode	@ltx/en_us_oca/miscellanea:misc.Mode3
ltx/en_us_oca/oc.m3.d2:ocMA.Kathisma21.text	
ltx/en_us_oca/oc.m3.d2:ocMA.Kathisma22.incipit	…
ltx/en_us_oca/oc.m3.d2:ocMA.Kathisma22.melody	
ltx/en_us_oca/oc.m3.d2:ocMA.Kathisma22.mode	@ltx/en_us_oca/miscellanea:misc.Mode3
ltx/en_us_oca/oc.m3.d2:ocMA.Kathisma22.text	
ltx/en_us_oca/oc.m3.d2:ocMA.Kathisma23.greekmelody	@ltx/en_us_oca/he.a.m3:heAU.TheiasPisteos.greekname
ltx/en_us_oca/oc.m3.d2:ocMA.Kathisma23.incipit	…
ltx/en_us_oca/oc.m3.d2:ocMA.Kathisma23.melody	@ltx/en_us_oca/he.a.m3:heAU.TheiasPisteos.notmetered
ltx/en_us_oca/oc.m3.d2:ocMA.Kathisma23.mode	@ltx/en_us_oca/miscellanea:misc.Mode3
ltx/en_us_oca/oc.m3.d2:ocMA.Kathisma23.text	
ltx/en_us_oca/oc.m3.d2:ocMA.Kathisma31.greekmelody	@ltx/en_us_oca/he.a.m3:heAU.TinOraiotita.greekname
ltx/en_us_oca/oc.m3.d2:ocMA.Kathisma31.incipit	As almighty…
ltx/en_us_oca/oc.m3.d2:ocMA.Kathisma31.melody	@ltx/en_us_oca/he.a.m3:heAU.TinOraiotita.notmetered
ltx/en_us_oca/oc.m3.d2:ocMA.Kathisma31.mode	@ltx/en_us_oca/miscellanea:misc.Mode3
ltx/en_us_oca/oc.m3.d2:ocMA.Kathisma31.text	As almighty, you have brought all things in heaven and on ⁄ earth into being by a word: ⁄ the choirs of angels stand by in awe ⁄ and offer ceaseless praise to you, O Master. ⁄ You make the ends of the earth shine with your light. ⁄ We join them, crying out to you: ⁄⁄ In your compassion, save us.
ltx/en_us_oca/oc.m3.d2:ocMA.Kathisma32.incipit	Your brave endurance…
ltx/en_us_oca/oc.m3.d2:ocMA.Kathisma32.melody	
ltx/en_us_oca/oc.m3.d2:ocMA.Kathisma32.mode	@ltx/en_us_oca/miscellanea:misc.Mode3
ltx/en_us_oca/oc.m3.d2:ocMA.Kathisma32.text	Your brave endurance, O Glorious martyrs, ⁄ defeated the craft of the enemy, the source of all evil: ⁄ therefore, you were counted worthy of eternal blessedness. ⁄ Intercede, then, with the Lord, O witnesses of the truth, ⁄⁄ for the salvation of Christ’s faithful flock. 
ltx/en_us_oca/oc.m3.d2:ocMA.Kathisma33.greekmelody	@ltx/en_us_oca/he.a.m3:heAU.TinOraiotita.greekname
ltx/en_us_oca/oc.m3.d2:ocMA.Kathisma33.incipit	When the pure voice came…
ltx/en_us_oca/oc.m3.d2:ocMA.Kathisma33.melody	@ltx/en_us_oca/he.a.m3:heAU.TinOraiotita.notmetered
ltx/en_us_oca/oc.m3.d2:ocMA.Kathisma33.mode	@ltx/en_us_oca/miscellanea:misc.Mode3
ltx/en_us_oca/oc.m3.d2:ocMA.Kathisma33.text	When the pure voice came to you, ⁄ the things of heaven rejoiced in fear ⁄ and the things of earth celebrated with awe. ⁄ The same feast dawned for them both as the Master saved the first-formed man. ⁄ Therefore, together with the Angel we cry out to you: ⁄⁄ Rejoice, for you have found favor with God.
ltx/en_us_oca/oc.m3.d2:ocMA.OdeW1C11.incipit	…
ltx/en_us_oca/oc.m3.d2:ocMA.OdeW1C11.melody	@ltx/en_us_oca/he.h.m3:heHE.FaraoTaArmata.name
ltx/en_us_oca/oc.m3.d2:ocMA.OdeW1C11.mode	@ltx/en_us_oca/miscellanea:misc.Mode3
ltx/en_us_oca/oc.m3.d2:ocMA.OdeW1C11.ode	@ltx/en_us_oca/miscellanea:misc.Ode1
ltx/en_us_oca/oc.m3.d2:ocMA.OdeW1C11.text	
ltx/en_us_oca/oc.m3.d2:ocMA.OdeW1C12.incipit	…
ltx/en_us_oca/oc.m3.d2:ocMA.OdeW1C12.melody	@ltx/en_us_oca/he.h.m3:heHE.FaraoTaArmata.name
ltx/en_us_oca/oc.m3.d2:ocMA.OdeW1C12.mode	@ltx/en_us_oca/miscellanea:misc.Mode3
ltx/en_us_oca/oc.m3.d2:ocMA.OdeW1C12.ode	@ltx/en_us_oca/miscellanea:misc.Ode1
ltx/en_us_oca/oc.m3.d2:ocMA.OdeW1C12.text	
ltx/en_us_oca/oc.m3.d2:ocMA.OdeW1C13.incipit	…
ltx/en_us_oca/oc.m3.d2:ocMA.OdeW1C13.melody	@ltx/en_us_oca/he.h.m3:heHE.FaraoTaArmata.name
ltx/en_us_oca/oc.m3.d2:ocMA.OdeW1C13.mode	@ltx/en_us_oca/miscellanea:misc.Mode3
ltx/en_us_oca/oc.m3.d2:ocMA.OdeW1C13.ode	@ltx/en_us_oca/miscellanea:misc.Ode1
ltx/en_us_oca/oc.m3.d2:ocMA.OdeW1C13.text	
ltx/en_us_oca/oc.m3.d2:ocMA.OdeW1C14.incipit	…
ltx/en_us_oca/oc.m3.d2:ocMA.OdeW1C14.melody	@ltx/en_us_oca/he.h.m3:heHE.FaraoTaArmata.name
ltx/en_us_oca/oc.m3.d2:ocMA.OdeW1C14.mode	@ltx/en_us_oca/miscellanea:misc.Mode3
ltx/en_us_oca/oc.m3.d2:ocMA.OdeW1C14.ode	@ltx/en_us_oca/miscellanea:misc.Ode1
ltx/en_us_oca/oc.m3.d2:ocMA.OdeW1C14.text	
ltx/en_us_oca/oc.m3.d2:ocMA.OdeW1C1H.greekmelody	@ltx/en_us_oca/he.h.m3:heHE.FaraoTaArmata.greekname
ltx/en_us_oca/oc.m3.d2:ocMA.OdeW1C1H.incipit	@ltx/en_us_oca/he.h.m3:heHE.FaraoTaArmata.incipit
ltx/en_us_oca/oc.m3.d2:ocMA.OdeW1C1H.melody	@ltx/en_us_oca/he.h.m3:heHE.FaraoTaArmata.melody
ltx/en_us_oca/oc.m3.d2:ocMA.OdeW1C1H.mode	@ltx/en_us_oca/miscellanea:misc.Mode3
ltx/en_us_oca/oc.m3.d2:ocMA.OdeW1C1H.ode	@ltx/en_us_oca/miscellanea:misc.Ode1
ltx/en_us_oca/oc.m3.d2:ocMA.OdeW1C1H.text	@ltx/en_us_oca/he.h.m3:heHE.FaraoTaArmata.text
ltx/en_us_oca/oc.m3.d2:ocMA.OdeW1C1T.incipit	…
ltx/en_us_oca/oc.m3.d2:ocMA.OdeW1C1T.melody	@ltx/en_us_oca/he.h.m3:heHE.FaraoTaArmata.name
ltx/en_us_oca/oc.m3.d2:ocMA.OdeW1C1T.mode	@ltx/en_us_oca/miscellanea:misc.Mode3
ltx/en_us_oca/oc.m3.d2:ocMA.OdeW1C1T.ode	@ltx/en_us_oca/miscellanea:misc.Ode1
ltx/en_us_oca/oc.m3.d2:ocMA.OdeW1C1T.text	
ltx/en_us_oca/oc.m3.d2:ocMA.OdeW1C21.greekmelody	@ltx/en_us_oca/he.h.m3:heHE.AsmaKainon.greekname
ltx/en_us_oca/oc.m3.d2:ocMA.OdeW1C21.incipit	…
ltx/en_us_oca/oc.m3.d2:ocMA.OdeW1C21.melody	@ltx/en_us_oca/he.h.m3:heHE.AsmaKainon.name
ltx/en_us_oca/oc.m3.d2:ocMA.OdeW1C21.mode	@ltx/en_us_oca/miscellanea:misc.Mode3
ltx/en_us_oca/oc.m3.d2:ocMA.OdeW1C21.ode	@ltx/en_us_oca/miscellanea:misc.Ode1
ltx/en_us_oca/oc.m3.d2:ocMA.OdeW1C21.text	
ltx/en_us_oca/oc.m3.d2:ocMA.OdeW1C22.incipit	…
ltx/en_us_oca/oc.m3.d2:ocMA.OdeW1C22.melody	@ltx/en_us_oca/he.h.m3:heHE.AsmaKainon.name
ltx/en_us_oca/oc.m3.d2:ocMA.OdeW1C22.mode	@ltx/en_us_oca/miscellanea:misc.Mode3
ltx/en_us_oca/oc.m3.d2:ocMA.OdeW1C22.ode	@ltx/en_us_oca/miscellanea:misc.Ode1
ltx/en_us_oca/oc.m3.d2:ocMA.OdeW1C22.text	
ltx/en_us_oca/oc.m3.d2:ocMA.OdeW1C23.incipit	…
ltx/en_us_oca/oc.m3.d2:ocMA.OdeW1C23.melody	@ltx/en_us_oca/he.h.m3:heHE.AsmaKainon.name
ltx/en_us_oca/oc.m3.d2:ocMA.OdeW1C23.mode	@ltx/en_us_oca/miscellanea:misc.Mode3
ltx/en_us_oca/oc.m3.d2:ocMA.OdeW1C23.ode	@ltx/en_us_oca/miscellanea:misc.Ode1
ltx/en_us_oca/oc.m3.d2:ocMA.OdeW1C23.text	
ltx/en_us_oca/oc.m3.d2:ocMA.OdeW1C2T.incipit	…
ltx/en_us_oca/oc.m3.d2:ocMA.OdeW1C2T.melody	@ltx/en_us_oca/he.h.m3:heHE.AsmaKainon.name
ltx/en_us_oca/oc.m3.d2:ocMA.OdeW1C2T.mode	@ltx/en_us_oca/miscellanea:misc.Mode3
ltx/en_us_oca/oc.m3.d2:ocMA.OdeW1C2T.ode	@ltx/en_us_oca/miscellanea:misc.Ode1
ltx/en_us_oca/oc.m3.d2:ocMA.OdeW1C2T.text	
ltx/en_us_oca/oc.m3.d2:ocMA.OdeW3C11.incipit	…
ltx/en_us_oca/oc.m3.d2:ocMA.OdeW3C11.melody	@ltx/en_us_oca/he.h.m3:heHE.StereosonKyrie.name
ltx/en_us_oca/oc.m3.d2:ocMA.OdeW3C11.mode	@ltx/en_us_oca/miscellanea:misc.Mode3
ltx/en_us_oca/oc.m3.d2:ocMA.OdeW3C11.ode	@ltx/en_us_oca/miscellanea:misc.Ode3
ltx/en_us_oca/oc.m3.d2:ocMA.OdeW3C11.text	
ltx/en_us_oca/oc.m3.d2:ocMA.OdeW3C12.incipit	…
ltx/en_us_oca/oc.m3.d2:ocMA.OdeW3C12.melody	@ltx/en_us_oca/he.h.m3:heHE.StereosonKyrie.name
ltx/en_us_oca/oc.m3.d2:ocMA.OdeW3C12.mode	@ltx/en_us_oca/miscellanea:misc.Mode3
ltx/en_us_oca/oc.m3.d2:ocMA.OdeW3C12.ode	@ltx/en_us_oca/miscellanea:misc.Ode3
ltx/en_us_oca/oc.m3.d2:ocMA.OdeW3C12.text	
ltx/en_us_oca/oc.m3.d2:ocMA.OdeW3C13.incipit	…
ltx/en_us_oca/oc.m3.d2:ocMA.OdeW3C13.melody	@ltx/en_us_oca/he.h.m3:heHE.StereosonKyrie.name
ltx/en_us_oca/oc.m3.d2:ocMA.OdeW3C13.mode	@ltx/en_us_oca/miscellanea:misc.Mode3
ltx/en_us_oca/oc.m3.d2:ocMA.OdeW3C13.ode	@ltx/en_us_oca/miscellanea:misc.Ode3
ltx/en_us_oca/oc.m3.d2:ocMA.OdeW3C13.text	
ltx/en_us_oca/oc.m3.d2:ocMA.OdeW3C14.incipit	…
ltx/en_us_oca/oc.m3.d2:ocMA.OdeW3C14.melody	@ltx/en_us_oca/he.h.m3:heHE.StereosonKyrie.name
ltx/en_us_oca/oc.m3.d2:ocMA.OdeW3C14.mode	@ltx/en_us_oca/miscellanea:misc.Mode3
ltx/en_us_oca/oc.m3.d2:ocMA.OdeW3C14.ode	@ltx/en_us_oca/miscellanea:misc.Ode3
ltx/en_us_oca/oc.m3.d2:ocMA.OdeW3C14.text	
ltx/en_us_oca/oc.m3.d2:ocMA.OdeW3C1H.greekmelody	@ltx/en_us_oca/he.h.m3:heHE.StereosonKyrie.greekname
ltx/en_us_oca/oc.m3.d2:ocMA.OdeW3C1H.incipit	@ltx/en_us_oca/he.h.m3:heHE.StereosonKyrie.incipit
ltx/en_us_oca/oc.m3.d2:ocMA.OdeW3C1H.melody	@ltx/en_us_oca/he.h.m3:heHE.StereosonKyrie.melody
ltx/en_us_oca/oc.m3.d2:ocMA.OdeW3C1H.mode	@ltx/en_us_oca/miscellanea:misc.Mode3
ltx/en_us_oca/oc.m3.d2:ocMA.OdeW3C1H.ode	@ltx/en_us_oca/miscellanea:misc.Ode3
ltx/en_us_oca/oc.m3.d2:ocMA.OdeW3C1H.text	@ltx/en_us_oca/he.h.m3:heHE.StereosonKyrie.text
ltx/en_us_oca/oc.m3.d2:ocMA.OdeW3C1T.incipit	…
ltx/en_us_oca/oc.m3.d2:ocMA.OdeW3C1T.melody	@ltx/en_us_oca/he.h.m3:heHE.StereosonKyrie.name
ltx/en_us_oca/oc.m3.d2:ocMA.OdeW3C1T.mode	@ltx/en_us_oca/miscellanea:misc.Mode3
ltx/en_us_oca/oc.m3.d2:ocMA.OdeW3C1T.ode	@ltx/en_us_oca/miscellanea:misc.Ode3
ltx/en_us_oca/oc.m3.d2:ocMA.OdeW3C1T.text	
ltx/en_us_oca/oc.m3.d2:ocMA.OdeW3C21.greekmelody	@ltx/en_us_oca/he.h.m3:heHE.ToxonEthrafsasEchthron.greekname
ltx/en_us_oca/oc.m3.d2:ocMA.OdeW3C21.incipit	…
ltx/en_us_oca/oc.m3.d2:ocMA.OdeW3C21.melody	@ltx/en_us_oca/he.h.m3:heHE.ToxonEthrafsasEchthron.name
ltx/en_us_oca/oc.m3.d2:ocMA.OdeW3C21.mode	@ltx/en_us_oca/miscellanea:misc.Mode3
ltx/en_us_oca/oc.m3.d2:ocMA.OdeW3C21.ode	@ltx/en_us_oca/miscellanea:misc.Ode3
ltx/en_us_oca/oc.m3.d2:ocMA.OdeW3C21.text	
ltx/en_us_oca/oc.m3.d2:ocMA.OdeW3C22.incipit	…
ltx/en_us_oca/oc.m3.d2:ocMA.OdeW3C22.melody	@ltx/en_us_oca/he.h.m3:heHE.ToxonEthrafsasEchthron.name
ltx/en_us_oca/oc.m3.d2:ocMA.OdeW3C22.mode	@ltx/en_us_oca/miscellanea:misc.Mode3
ltx/en_us_oca/oc.m3.d2:ocMA.OdeW3C22.ode	@ltx/en_us_oca/miscellanea:misc.Ode3
ltx/en_us_oca/oc.m3.d2:ocMA.OdeW3C22.text	
ltx/en_us_oca/oc.m3.d2:ocMA.OdeW3C23.incipit	…
ltx/en_us_oca/oc.m3.d2:ocMA.OdeW3C23.melody	@ltx/en_us_oca/he.h.m3:heHE.ToxonEthrafsasEchthron.name
ltx/en_us_oca/oc.m3.d2:ocMA.OdeW3C23.mode	@ltx/en_us_oca/miscellanea:misc.Mode3
ltx/en_us_oca/oc.m3.d2:ocMA.OdeW3C23.ode	@ltx/en_us_oca/miscellanea:misc.Ode3
ltx/en_us_oca/oc.m3.d2:ocMA.OdeW3C23.text	
ltx/en_us_oca/oc.m3.d2:ocMA.OdeW3C2T.incipit	…
ltx/en_us_oca/oc.m3.d2:ocMA.OdeW3C2T.melody	@ltx/en_us_oca/he.h.m3:heHE.ToxonEthrafsasEchthron.name
ltx/en_us_oca/oc.m3.d2:ocMA.OdeW3C2T.mode	@ltx/en_us_oca/miscellanea:misc.Mode3
ltx/en_us_oca/oc.m3.d2:ocMA.OdeW3C2T.ode	@ltx/en_us_oca/miscellanea:misc.Ode3
ltx/en_us_oca/oc.m3.d2:ocMA.OdeW3C2T.text	
ltx/en_us_oca/oc.m3.d2:ocMA.OdeW4C11.incipit	…
ltx/en_us_oca/oc.m3.d2:ocMA.OdeW4C11.melody	@ltx/en_us_oca/he.h.m3:heHE.MiEnPotamois.name
ltx/en_us_oca/oc.m3.d2:ocMA.OdeW4C11.mode	@ltx/en_us_oca/miscellanea:misc.Mode3
ltx/en_us_oca/oc.m3.d2:ocMA.OdeW4C11.ode	@ltx/en_us_oca/miscellanea:misc.Ode4
ltx/en_us_oca/oc.m3.d2:ocMA.OdeW4C11.text	
ltx/en_us_oca/oc.m3.d2:ocMA.OdeW4C12.incipit	…
ltx/en_us_oca/oc.m3.d2:ocMA.OdeW4C12.melody	@ltx/en_us_oca/he.h.m3:heHE.MiEnPotamois.name
ltx/en_us_oca/oc.m3.d2:ocMA.OdeW4C12.mode	@ltx/en_us_oca/miscellanea:misc.Mode3
ltx/en_us_oca/oc.m3.d2:ocMA.OdeW4C12.ode	@ltx/en_us_oca/miscellanea:misc.Ode4
ltx/en_us_oca/oc.m3.d2:ocMA.OdeW4C12.text	
ltx/en_us_oca/oc.m3.d2:ocMA.OdeW4C13.incipit	…
ltx/en_us_oca/oc.m3.d2:ocMA.OdeW4C13.melody	@ltx/en_us_oca/he.h.m3:heHE.MiEnPotamois.name
ltx/en_us_oca/oc.m3.d2:ocMA.OdeW4C13.mode	@ltx/en_us_oca/miscellanea:misc.Mode3
ltx/en_us_oca/oc.m3.d2:ocMA.OdeW4C13.ode	@ltx/en_us_oca/miscellanea:misc.Ode4
ltx/en_us_oca/oc.m3.d2:ocMA.OdeW4C13.text	
ltx/en_us_oca/oc.m3.d2:ocMA.OdeW4C14.incipit	…
ltx/en_us_oca/oc.m3.d2:ocMA.OdeW4C14.melody	@ltx/en_us_oca/he.h.m3:heHE.MiEnPotamois.name
ltx/en_us_oca/oc.m3.d2:ocMA.OdeW4C14.mode	@ltx/en_us_oca/miscellanea:misc.Mode3
ltx/en_us_oca/oc.m3.d2:ocMA.OdeW4C14.ode	@ltx/en_us_oca/miscellanea:misc.Ode4
ltx/en_us_oca/oc.m3.d2:ocMA.OdeW4C14.text	
ltx/en_us_oca/oc.m3.d2:ocMA.OdeW4C1H.greekmelody	@ltx/en_us_oca/he.h.m3:heHE.MiEnPotamois.greekname
ltx/en_us_oca/oc.m3.d2:ocMA.OdeW4C1H.incipit	@ltx/en_us_oca/he.h.m3:heHE.MiEnPotamois.incipit
ltx/en_us_oca/oc.m3.d2:ocMA.OdeW4C1H.melody	@ltx/en_us_oca/he.h.m3:heHE.MiEnPotamois.melody
ltx/en_us_oca/oc.m3.d2:ocMA.OdeW4C1H.mode	@ltx/en_us_oca/miscellanea:misc.Mode3
ltx/en_us_oca/oc.m3.d2:ocMA.OdeW4C1H.ode	@ltx/en_us_oca/miscellanea:misc.Ode4
ltx/en_us_oca/oc.m3.d2:ocMA.OdeW4C1H.text	@ltx/en_us_oca/he.h.m3:heHE.MiEnPotamois.text
ltx/en_us_oca/oc.m3.d2:ocMA.OdeW4C1T.incipit	…
ltx/en_us_oca/oc.m3.d2:ocMA.OdeW4C1T.melody	@ltx/en_us_oca/he.h.m3:heHE.MiEnPotamois.name
ltx/en_us_oca/oc.m3.d2:ocMA.OdeW4C1T.mode	@ltx/en_us_oca/miscellanea:misc.Mode3
ltx/en_us_oca/oc.m3.d2:ocMA.OdeW4C1T.ode	@ltx/en_us_oca/miscellanea:misc.Ode4
ltx/en_us_oca/oc.m3.d2:ocMA.OdeW4C1T.text	
ltx/en_us_oca/oc.m3.d2:ocMA.OdeW4C21.greekmelody	@ltx/en_us_oca/he.h.m3:heHE.ToXenonKaiAporriton.greekname
ltx/en_us_oca/oc.m3.d2:ocMA.OdeW4C21.incipit	…
ltx/en_us_oca/oc.m3.d2:ocMA.OdeW4C21.melody	@ltx/en_us_oca/he.h.m3:heHE.ToXenonKaiAporriton.name
ltx/en_us_oca/oc.m3.d2:ocMA.OdeW4C21.mode	@ltx/en_us_oca/miscellanea:misc.Mode3
ltx/en_us_oca/oc.m3.d2:ocMA.OdeW4C21.ode	@ltx/en_us_oca/miscellanea:misc.Ode4
ltx/en_us_oca/oc.m3.d2:ocMA.OdeW4C21.text	
ltx/en_us_oca/oc.m3.d2:ocMA.OdeW4C22.incipit	…
ltx/en_us_oca/oc.m3.d2:ocMA.OdeW4C22.melody	@ltx/en_us_oca/he.h.m3:heHE.ToXenonKaiAporriton.name
ltx/en_us_oca/oc.m3.d2:ocMA.OdeW4C22.mode	@ltx/en_us_oca/miscellanea:misc.Mode3
ltx/en_us_oca/oc.m3.d2:ocMA.OdeW4C22.ode	@ltx/en_us_oca/miscellanea:misc.Ode4
ltx/en_us_oca/oc.m3.d2:ocMA.OdeW4C22.text	
ltx/en_us_oca/oc.m3.d2:ocMA.OdeW4C23.incipit	…
ltx/en_us_oca/oc.m3.d2:ocMA.OdeW4C23.melody	@ltx/en_us_oca/he.h.m3:heHE.ToXenonKaiAporriton.name
ltx/en_us_oca/oc.m3.d2:ocMA.OdeW4C23.mode	@ltx/en_us_oca/miscellanea:misc.Mode3
ltx/en_us_oca/oc.m3.d2:ocMA.OdeW4C23.ode	@ltx/en_us_oca/miscellanea:misc.Ode4
ltx/en_us_oca/oc.m3.d2:ocMA.OdeW4C23.text	
ltx/en_us_oca/oc.m3.d2:ocMA.OdeW4C24.incipit	…
ltx/en_us_oca/oc.m3.d2:ocMA.OdeW4C24.melody	@ltx/en_us_oca/he.h.m3:heHE.ToXenonKaiAporriton.name
ltx/en_us_oca/oc.m3.d2:ocMA.OdeW4C24.mode	@ltx/en_us_oca/miscellanea:misc.Mode3
ltx/en_us_oca/oc.m3.d2:ocMA.OdeW4C24.ode	@ltx/en_us_oca/miscellanea:misc.Ode4
ltx/en_us_oca/oc.m3.d2:ocMA.OdeW4C24.text	
ltx/en_us_oca/oc.m3.d2:ocMA.OdeW4C2T.incipit	…
ltx/en_us_oca/oc.m3.d2:ocMA.OdeW4C2T.melody	@ltx/en_us_oca/he.h.m3:heHE.ToXenonKaiAporriton.name
ltx/en_us_oca/oc.m3.d2:ocMA.OdeW4C2T.mode	@ltx/en_us_oca/miscellanea:misc.Mode3
ltx/en_us_oca/oc.m3.d2:ocMA.OdeW4C2T.ode	@ltx/en_us_oca/miscellanea:misc.Ode4
ltx/en_us_oca/oc.m3.d2:ocMA.OdeW4C2T.text	
ltx/en_us_oca/oc.m3.d2:ocMA.OdeW5C11.incipit	…
ltx/en_us_oca/oc.m3.d2:ocMA.OdeW5C11.melody	@ltx/en_us_oca/he.h.m3:heHE.ToFosSouToAnesperon.name
ltx/en_us_oca/oc.m3.d2:ocMA.OdeW5C11.mode	@ltx/en_us_oca/miscellanea:misc.Mode3
ltx/en_us_oca/oc.m3.d2:ocMA.OdeW5C11.ode	@ltx/en_us_oca/miscellanea:misc.Ode5
ltx/en_us_oca/oc.m3.d2:ocMA.OdeW5C11.text	
ltx/en_us_oca/oc.m3.d2:ocMA.OdeW5C12.incipit	…
ltx/en_us_oca/oc.m3.d2:ocMA.OdeW5C12.melody	@ltx/en_us_oca/he.h.m3:heHE.ToFosSouToAnesperon.name
ltx/en_us_oca/oc.m3.d2:ocMA.OdeW5C12.mode	@ltx/en_us_oca/miscellanea:misc.Mode3
ltx/en_us_oca/oc.m3.d2:ocMA.OdeW5C12.ode	@ltx/en_us_oca/miscellanea:misc.Ode5
ltx/en_us_oca/oc.m3.d2:ocMA.OdeW5C12.text	
ltx/en_us_oca/oc.m3.d2:ocMA.OdeW5C13.incipit	…
ltx/en_us_oca/oc.m3.d2:ocMA.OdeW5C13.melody	@ltx/en_us_oca/he.h.m3:heHE.ToFosSouToAnesperon.name
ltx/en_us_oca/oc.m3.d2:ocMA.OdeW5C13.mode	@ltx/en_us_oca/miscellanea:misc.Mode3
ltx/en_us_oca/oc.m3.d2:ocMA.OdeW5C13.ode	@ltx/en_us_oca/miscellanea:misc.Ode5
ltx/en_us_oca/oc.m3.d2:ocMA.OdeW5C13.text	
ltx/en_us_oca/oc.m3.d2:ocMA.OdeW5C14.incipit	…
ltx/en_us_oca/oc.m3.d2:ocMA.OdeW5C14.melody	@ltx/en_us_oca/he.h.m3:heHE.ToFosSouToAnesperon.name
ltx/en_us_oca/oc.m3.d2:ocMA.OdeW5C14.mode	@ltx/en_us_oca/miscellanea:misc.Mode3
ltx/en_us_oca/oc.m3.d2:ocMA.OdeW5C14.ode	@ltx/en_us_oca/miscellanea:misc.Ode5
ltx/en_us_oca/oc.m3.d2:ocMA.OdeW5C14.text	
ltx/en_us_oca/oc.m3.d2:ocMA.OdeW5C1H.greekmelody	@ltx/en_us_oca/he.h.m3:heHE.ToFosSouToAnesperon.greekname
ltx/en_us_oca/oc.m3.d2:ocMA.OdeW5C1H.incipit	@ltx/en_us_oca/he.h.m3:heHE.ToFosSouToAnesperon.incipit
ltx/en_us_oca/oc.m3.d2:ocMA.OdeW5C1H.melody	@ltx/en_us_oca/he.h.m3:heHE.ToFosSouToAnesperon.melody
ltx/en_us_oca/oc.m3.d2:ocMA.OdeW5C1H.mode	@ltx/en_us_oca/miscellanea:misc.Mode3
ltx/en_us_oca/oc.m3.d2:ocMA.OdeW5C1H.ode	@ltx/en_us_oca/miscellanea:misc.Ode5
ltx/en_us_oca/oc.m3.d2:ocMA.OdeW5C1H.text	@ltx/en_us_oca/he.h.m3:heHE.ToFosSouToAnesperon.text
ltx/en_us_oca/oc.m3.d2:ocMA.OdeW5C1T.incipit	…
ltx/en_us_oca/oc.m3.d2:ocMA.OdeW5C1T.melody	@ltx/en_us_oca/he.h.m3:heHE.ToFosSouToAnesperon.name
ltx/en_us_oca/oc.m3.d2:ocMA.OdeW5C1T.mode	@ltx/en_us_oca/miscellanea:misc.Mode3
ltx/en_us_oca/oc.m3.d2:ocMA.OdeW5C1T.ode	@ltx/en_us_oca/miscellanea:misc.Ode5
ltx/en_us_oca/oc.m3.d2:ocMA.OdeW5C1T.text	
ltx/en_us_oca/oc.m3.d2:ocMA.OdeW5C21.greekmelody	@ltx/en_us_oca/he.h.m3:heHE.EpiTisGis.greekname
ltx/en_us_oca/oc.m3.d2:ocMA.OdeW5C21.incipit	…
ltx/en_us_oca/oc.m3.d2:ocMA.OdeW5C21.melody	@ltx/en_us_oca/he.h.m3:heHE.EpiTisGis.name
ltx/en_us_oca/oc.m3.d2:ocMA.OdeW5C21.mode	@ltx/en_us_oca/miscellanea:misc.Mode3
ltx/en_us_oca/oc.m3.d2:ocMA.OdeW5C21.ode	@ltx/en_us_oca/miscellanea:misc.Ode5
ltx/en_us_oca/oc.m3.d2:ocMA.OdeW5C21.text	
ltx/en_us_oca/oc.m3.d2:ocMA.OdeW5C22.incipit	…
ltx/en_us_oca/oc.m3.d2:ocMA.OdeW5C22.melody	@ltx/en_us_oca/he.h.m3:heHE.EpiTisGis.name
ltx/en_us_oca/oc.m3.d2:ocMA.OdeW5C22.mode	@ltx/en_us_oca/miscellanea:misc.Mode3
ltx/en_us_oca/oc.m3.d2:ocMA.OdeW5C22.ode	@ltx/en_us_oca/miscellanea:misc.Ode5
ltx/en_us_oca/oc.m3.d2:ocMA.OdeW5C22.text	
ltx/en_us_oca/oc.m3.d2:ocMA.OdeW5C2T.incipit	…
ltx/en_us_oca/oc.m3.d2:ocMA.OdeW5C2T.melody	@ltx/en_us_oca/he.h.m3:heHE.EpiTisGis.name
ltx/en_us_oca/oc.m3.d2:ocMA.OdeW5C2T.mode	@ltx/en_us_oca/miscellanea:misc.Mode3
ltx/en_us_oca/oc.m3.d2:ocMA.OdeW5C2T.ode	@ltx/en_us_oca/miscellanea:misc.Ode5
ltx/en_us_oca/oc.m3.d2:ocMA.OdeW5C2T.text	
ltx/en_us_oca/oc.m3.d2:ocMA.OdeW6C11.incipit	…
ltx/en_us_oca/oc.m3.d2:ocMA.OdeW6C11.melody	@ltx/en_us_oca/he.h.m3:heHE.TousEisTaTeli.name
ltx/en_us_oca/oc.m3.d2:ocMA.OdeW6C11.mode	@ltx/en_us_oca/miscellanea:misc.Mode3
ltx/en_us_oca/oc.m3.d2:ocMA.OdeW6C11.ode	@ltx/en_us_oca/miscellanea:misc.Ode6
ltx/en_us_oca/oc.m3.d2:ocMA.OdeW6C11.text	
ltx/en_us_oca/oc.m3.d2:ocMA.OdeW6C12.incipit	…
ltx/en_us_oca/oc.m3.d2:ocMA.OdeW6C12.melody	@ltx/en_us_oca/he.h.m3:heHE.TousEisTaTeli.name
ltx/en_us_oca/oc.m3.d2:ocMA.OdeW6C12.mode	@ltx/en_us_oca/miscellanea:misc.Mode3
ltx/en_us_oca/oc.m3.d2:ocMA.OdeW6C12.ode	@ltx/en_us_oca/miscellanea:misc.Ode6
ltx/en_us_oca/oc.m3.d2:ocMA.OdeW6C12.text	
ltx/en_us_oca/oc.m3.d2:ocMA.OdeW6C13.incipit	…
ltx/en_us_oca/oc.m3.d2:ocMA.OdeW6C13.melody	@ltx/en_us_oca/he.h.m3:heHE.TousEisTaTeli.name
ltx/en_us_oca/oc.m3.d2:ocMA.OdeW6C13.mode	@ltx/en_us_oca/miscellanea:misc.Mode3
ltx/en_us_oca/oc.m3.d2:ocMA.OdeW6C13.ode	@ltx/en_us_oca/miscellanea:misc.Ode6
ltx/en_us_oca/oc.m3.d2:ocMA.OdeW6C13.text	
ltx/en_us_oca/oc.m3.d2:ocMA.OdeW6C14.incipit	…
ltx/en_us_oca/oc.m3.d2:ocMA.OdeW6C14.melody	@ltx/en_us_oca/he.h.m3:heHE.TousEisTaTeli.name
ltx/en_us_oca/oc.m3.d2:ocMA.OdeW6C14.mode	@ltx/en_us_oca/miscellanea:misc.Mode3
ltx/en_us_oca/oc.m3.d2:ocMA.OdeW6C14.ode	@ltx/en_us_oca/miscellanea:misc.Ode6
ltx/en_us_oca/oc.m3.d2:ocMA.OdeW6C14.text	
ltx/en_us_oca/oc.m3.d2:ocMA.OdeW6C1H.greekmelody	@ltx/en_us_oca/he.h.m3:heHE.TousEisTaTeli.greekname
ltx/en_us_oca/oc.m3.d2:ocMA.OdeW6C1H.incipit	@ltx/en_us_oca/he.h.m3:heHE.TousEisTaTeli.incipit
ltx/en_us_oca/oc.m3.d2:ocMA.OdeW6C1H.melody	@ltx/en_us_oca/he.h.m3:heHE.TousEisTaTeli.melody
ltx/en_us_oca/oc.m3.d2:ocMA.OdeW6C1H.mode	@ltx/en_us_oca/miscellanea:misc.Mode3
ltx/en_us_oca/oc.m3.d2:ocMA.OdeW6C1H.ode	@ltx/en_us_oca/miscellanea:misc.Ode6
ltx/en_us_oca/oc.m3.d2:ocMA.OdeW6C1H.text	@ltx/en_us_oca/he.h.m3:heHE.TousEisTaTeli.text
ltx/en_us_oca/oc.m3.d2:ocMA.OdeW6C1T.incipit	…
ltx/en_us_oca/oc.m3.d2:ocMA.OdeW6C1T.melody	@ltx/en_us_oca/he.h.m3:heHE.TousEisTaTeli.name
ltx/en_us_oca/oc.m3.d2:ocMA.OdeW6C1T.mode	@ltx/en_us_oca/miscellanea:misc.Mode3
ltx/en_us_oca/oc.m3.d2:ocMA.OdeW6C1T.ode	@ltx/en_us_oca/miscellanea:misc.Ode6
ltx/en_us_oca/oc.m3.d2:ocMA.OdeW6C1T.text	
ltx/en_us_oca/oc.m3.d2:ocMA.OdeW6C21.greekmelody	@ltx/en_us_oca/he.h.m3:heHE.SkinoseosIonas.greekname
ltx/en_us_oca/oc.m3.d2:ocMA.OdeW6C21.incipit	…
ltx/en_us_oca/oc.m3.d2:ocMA.OdeW6C21.melody	@ltx/en_us_oca/he.h.m3:heHE.SkinoseosIonas.name
ltx/en_us_oca/oc.m3.d2:ocMA.OdeW6C21.mode	@ltx/en_us_oca/miscellanea:misc.Mode3
ltx/en_us_oca/oc.m3.d2:ocMA.OdeW6C21.ode	@ltx/en_us_oca/miscellanea:misc.Ode6
ltx/en_us_oca/oc.m3.d2:ocMA.OdeW6C21.text	
ltx/en_us_oca/oc.m3.d2:ocMA.OdeW6C22.incipit	…
ltx/en_us_oca/oc.m3.d2:ocMA.OdeW6C22.melody	@ltx/en_us_oca/he.h.m3:heHE.SkinoseosIonas.name
ltx/en_us_oca/oc.m3.d2:ocMA.OdeW6C22.mode	@ltx/en_us_oca/miscellanea:misc.Mode3
ltx/en_us_oca/oc.m3.d2:ocMA.OdeW6C22.ode	@ltx/en_us_oca/miscellanea:misc.Ode6
ltx/en_us_oca/oc.m3.d2:ocMA.OdeW6C22.text	
ltx/en_us_oca/oc.m3.d2:ocMA.OdeW6C2T.incipit	…
ltx/en_us_oca/oc.m3.d2:ocMA.OdeW6C2T.melody	@ltx/en_us_oca/he.h.m3:heHE.SkinoseosIonas.name
ltx/en_us_oca/oc.m3.d2:ocMA.OdeW6C2T.mode	@ltx/en_us_oca/miscellanea:misc.Mode3
ltx/en_us_oca/oc.m3.d2:ocMA.OdeW6C2T.ode	@ltx/en_us_oca/miscellanea:misc.Ode6
ltx/en_us_oca/oc.m3.d2:ocMA.OdeW6C2T.text	
ltx/en_us_oca/oc.m3.d2:ocMA.OdeW7C11.incipit	…
ltx/en_us_oca/oc.m3.d2:ocMA.OdeW7C11.melody	@ltx/en_us_oca/he.h.m3:heHE.TreisPaidesEnKamino.name
ltx/en_us_oca/oc.m3.d2:ocMA.OdeW7C11.mode	@ltx/en_us_oca/miscellanea:misc.Mode3
ltx/en_us_oca/oc.m3.d2:ocMA.OdeW7C11.ode	@ltx/en_us_oca/miscellanea:misc.Ode7
ltx/en_us_oca/oc.m3.d2:ocMA.OdeW7C11.text	
ltx/en_us_oca/oc.m3.d2:ocMA.OdeW7C12.incipit	…
ltx/en_us_oca/oc.m3.d2:ocMA.OdeW7C12.melody	@ltx/en_us_oca/he.h.m3:heHE.TreisPaidesEnKamino.name
ltx/en_us_oca/oc.m3.d2:ocMA.OdeW7C12.mode	@ltx/en_us_oca/miscellanea:misc.Mode3
ltx/en_us_oca/oc.m3.d2:ocMA.OdeW7C12.ode	@ltx/en_us_oca/miscellanea:misc.Ode7
ltx/en_us_oca/oc.m3.d2:ocMA.OdeW7C12.text	
ltx/en_us_oca/oc.m3.d2:ocMA.OdeW7C13.incipit	…
ltx/en_us_oca/oc.m3.d2:ocMA.OdeW7C13.melody	@ltx/en_us_oca/he.h.m3:heHE.TreisPaidesEnKamino.name
ltx/en_us_oca/oc.m3.d2:ocMA.OdeW7C13.mode	@ltx/en_us_oca/miscellanea:misc.Mode3
ltx/en_us_oca/oc.m3.d2:ocMA.OdeW7C13.ode	@ltx/en_us_oca/miscellanea:misc.Ode7
ltx/en_us_oca/oc.m3.d2:ocMA.OdeW7C13.text	
ltx/en_us_oca/oc.m3.d2:ocMA.OdeW7C14.incipit	…
ltx/en_us_oca/oc.m3.d2:ocMA.OdeW7C14.melody	@ltx/en_us_oca/he.h.m3:heHE.TreisPaidesEnKamino.name
ltx/en_us_oca/oc.m3.d2:ocMA.OdeW7C14.mode	@ltx/en_us_oca/miscellanea:misc.Mode3
ltx/en_us_oca/oc.m3.d2:ocMA.OdeW7C14.ode	@ltx/en_us_oca/miscellanea:misc.Ode7
ltx/en_us_oca/oc.m3.d2:ocMA.OdeW7C14.text	
ltx/en_us_oca/oc.m3.d2:ocMA.OdeW7C1H.greekmelody	@ltx/en_us_oca/he.h.m3:heHE.TreisPaidesEnKamino.greekname
ltx/en_us_oca/oc.m3.d2:ocMA.OdeW7C1H.incipit	@ltx/en_us_oca/he.h.m3:heHE.TreisPaidesEnKamino.incipit
ltx/en_us_oca/oc.m3.d2:ocMA.OdeW7C1H.melody	@ltx/en_us_oca/he.h.m3:heHE.TreisPaidesEnKamino.melody
ltx/en_us_oca/oc.m3.d2:ocMA.OdeW7C1H.mode	@ltx/en_us_oca/miscellanea:misc.Mode3
ltx/en_us_oca/oc.m3.d2:ocMA.OdeW7C1H.ode	@ltx/en_us_oca/miscellanea:misc.Ode7
ltx/en_us_oca/oc.m3.d2:ocMA.OdeW7C1H.text	@ltx/en_us_oca/he.h.m3:heHE.TreisPaidesEnKamino.text
ltx/en_us_oca/oc.m3.d2:ocMA.OdeW7C1T.incipit	…
ltx/en_us_oca/oc.m3.d2:ocMA.OdeW7C1T.melody	@ltx/en_us_oca/he.h.m3:heHE.TreisPaidesEnKamino.name
ltx/en_us_oca/oc.m3.d2:ocMA.OdeW7C1T.mode	@ltx/en_us_oca/miscellanea:misc.Mode3
ltx/en_us_oca/oc.m3.d2:ocMA.OdeW7C1T.ode	@ltx/en_us_oca/miscellanea:misc.Ode7
ltx/en_us_oca/oc.m3.d2:ocMA.OdeW7C1T.text	
ltx/en_us_oca/oc.m3.d2:ocMA.OdeW7C21.greekmelody	@ltx/en_us_oca/he.h.m3:heHE.SovarosOTyrannos.greekname
ltx/en_us_oca/oc.m3.d2:ocMA.OdeW7C21.incipit	…
ltx/en_us_oca/oc.m3.d2:ocMA.OdeW7C21.melody	@ltx/en_us_oca/he.h.m3:heHE.SovarosOTyrannos.name
ltx/en_us_oca/oc.m3.d2:ocMA.OdeW7C21.mode	@ltx/en_us_oca/miscellanea:misc.Mode3
ltx/en_us_oca/oc.m3.d2:ocMA.OdeW7C21.ode	@ltx/en_us_oca/miscellanea:misc.Ode7
ltx/en_us_oca/oc.m3.d2:ocMA.OdeW7C21.text	
ltx/en_us_oca/oc.m3.d2:ocMA.OdeW7C22.incipit	…
ltx/en_us_oca/oc.m3.d2:ocMA.OdeW7C22.melody	@ltx/en_us_oca/he.h.m3:heHE.SovarosOTyrannos.name
ltx/en_us_oca/oc.m3.d2:ocMA.OdeW7C22.mode	@ltx/en_us_oca/miscellanea:misc.Mode3
ltx/en_us_oca/oc.m3.d2:ocMA.OdeW7C22.ode	@ltx/en_us_oca/miscellanea:misc.Ode7
ltx/en_us_oca/oc.m3.d2:ocMA.OdeW7C22.text	
ltx/en_us_oca/oc.m3.d2:ocMA.OdeW7C2T.incipit	…
ltx/en_us_oca/oc.m3.d2:ocMA.OdeW7C2T.melody	@ltx/en_us_oca/he.h.m3:heHE.SovarosOTyrannos.name
ltx/en_us_oca/oc.m3.d2:ocMA.OdeW7C2T.mode	@ltx/en_us_oca/miscellanea:misc.Mode3
ltx/en_us_oca/oc.m3.d2:ocMA.OdeW7C2T.ode	@ltx/en_us_oca/miscellanea:misc.Ode7
ltx/en_us_oca/oc.m3.d2:ocMA.OdeW7C2T.text	
ltx/en_us_oca/oc.m3.d2:ocMA.OdeW8C11.incipit	…
ltx/en_us_oca/oc.m3.d2:ocMA.OdeW8C11.melody	@ltx/en_us_oca/he.h.m3:heHE.TonEnFlogi.name
ltx/en_us_oca/oc.m3.d2:ocMA.OdeW8C11.mode	@ltx/en_us_oca/miscellanea:misc.Mode3
ltx/en_us_oca/oc.m3.d2:ocMA.OdeW8C11.ode	@ltx/en_us_oca/miscellanea:misc.Ode8
ltx/en_us_oca/oc.m3.d2:ocMA.OdeW8C11.text	
ltx/en_us_oca/oc.m3.d2:ocMA.OdeW8C12.incipit	…
ltx/en_us_oca/oc.m3.d2:ocMA.OdeW8C12.melody	@ltx/en_us_oca/he.h.m3:heHE.TonEnFlogi.name
ltx/en_us_oca/oc.m3.d2:ocMA.OdeW8C12.mode	@ltx/en_us_oca/miscellanea:misc.Mode3
ltx/en_us_oca/oc.m3.d2:ocMA.OdeW8C12.ode	@ltx/en_us_oca/miscellanea:misc.Ode8
ltx/en_us_oca/oc.m3.d2:ocMA.OdeW8C12.text	
ltx/en_us_oca/oc.m3.d2:ocMA.OdeW8C13.incipit	…
ltx/en_us_oca/oc.m3.d2:ocMA.OdeW8C13.melody	@ltx/en_us_oca/he.h.m3:heHE.TonEnFlogi.name
ltx/en_us_oca/oc.m3.d2:ocMA.OdeW8C13.mode	@ltx/en_us_oca/miscellanea:misc.Mode3
ltx/en_us_oca/oc.m3.d2:ocMA.OdeW8C13.ode	@ltx/en_us_oca/miscellanea:misc.Ode8
ltx/en_us_oca/oc.m3.d2:ocMA.OdeW8C13.text	
ltx/en_us_oca/oc.m3.d2:ocMA.OdeW8C14.incipit	…
ltx/en_us_oca/oc.m3.d2:ocMA.OdeW8C14.melody	@ltx/en_us_oca/he.h.m3:heHE.TonEnFlogi.name
ltx/en_us_oca/oc.m3.d2:ocMA.OdeW8C14.mode	@ltx/en_us_oca/miscellanea:misc.Mode3
ltx/en_us_oca/oc.m3.d2:ocMA.OdeW8C14.ode	@ltx/en_us_oca/miscellanea:misc.Ode8
ltx/en_us_oca/oc.m3.d2:ocMA.OdeW8C14.text	
ltx/en_us_oca/oc.m3.d2:ocMA.OdeW8C1H.greekmelody	@ltx/en_us_oca/he.h.m3:heHE.TonEnFlogi.greekname
ltx/en_us_oca/oc.m3.d2:ocMA.OdeW8C1H.incipit	@ltx/en_us_oca/he.h.m3:heHE.TonEnFlogi.incipit
ltx/en_us_oca/oc.m3.d2:ocMA.OdeW8C1H.melody	@ltx/en_us_oca/he.h.m3:heHE.TonEnFlogi.melody
ltx/en_us_oca/oc.m3.d2:ocMA.OdeW8C1H.mode	@ltx/en_us_oca/miscellanea:misc.Mode3
ltx/en_us_oca/oc.m3.d2:ocMA.OdeW8C1H.ode	@ltx/en_us_oca/miscellanea:misc.Ode8
ltx/en_us_oca/oc.m3.d2:ocMA.OdeW8C1H.text	@ltx/en_us_oca/he.h.m3:heHE.TonEnFlogi.text
ltx/en_us_oca/oc.m3.d2:ocMA.OdeW8C1T.incipit	…
ltx/en_us_oca/oc.m3.d2:ocMA.OdeW8C1T.melody	@ltx/en_us_oca/he.h.m3:heHE.TonEnFlogi.name
ltx/en_us_oca/oc.m3.d2:ocMA.OdeW8C1T.mode	@ltx/en_us_oca/miscellanea:misc.Mode3
ltx/en_us_oca/oc.m3.d2:ocMA.OdeW8C1T.ode	@ltx/en_us_oca/miscellanea:misc.Ode8
ltx/en_us_oca/oc.m3.d2:ocMA.OdeW8C1T.text	
ltx/en_us_oca/oc.m3.d2:ocMA.OdeW8C21.greekmelody	@ltx/en_us_oca/he.h.m3:heHE.EnylouFlogaPyros.greekname
ltx/en_us_oca/oc.m3.d2:ocMA.OdeW8C21.incipit	…
ltx/en_us_oca/oc.m3.d2:ocMA.OdeW8C21.melody	@ltx/en_us_oca/he.h.m3:heHE.EnylouFlogaPyros.name
ltx/en_us_oca/oc.m3.d2:ocMA.OdeW8C21.mode	@ltx/en_us_oca/miscellanea:misc.Mode3
ltx/en_us_oca/oc.m3.d2:ocMA.OdeW8C21.ode	@ltx/en_us_oca/miscellanea:misc.Ode8
ltx/en_us_oca/oc.m3.d2:ocMA.OdeW8C21.text	
ltx/en_us_oca/oc.m3.d2:ocMA.OdeW8C22.incipit	…
ltx/en_us_oca/oc.m3.d2:ocMA.OdeW8C22.melody	@ltx/en_us_oca/he.h.m3:heHE.EnylouFlogaPyros.name
ltx/en_us_oca/oc.m3.d2:ocMA.OdeW8C22.mode	@ltx/en_us_oca/miscellanea:misc.Mode3
ltx/en_us_oca/oc.m3.d2:ocMA.OdeW8C22.ode	@ltx/en_us_oca/miscellanea:misc.Ode8
ltx/en_us_oca/oc.m3.d2:ocMA.OdeW8C22.text	
ltx/en_us_oca/oc.m3.d2:ocMA.OdeW8C23.incipit	…
ltx/en_us_oca/oc.m3.d2:ocMA.OdeW8C23.melody	@ltx/en_us_oca/he.h.m3:heHE.EnylouFlogaPyros.name
ltx/en_us_oca/oc.m3.d2:ocMA.OdeW8C23.mode	@ltx/en_us_oca/miscellanea:misc.Mode3
ltx/en_us_oca/oc.m3.d2:ocMA.OdeW8C23.ode	@ltx/en_us_oca/miscellanea:misc.Ode8
ltx/en_us_oca/oc.m3.d2:ocMA.OdeW8C23.text	
ltx/en_us_oca/oc.m3.d2:ocMA.OdeW8C2T.incipit	…
ltx/en_us_oca/oc.m3.d2:ocMA.OdeW8C2T.melody	@ltx/en_us_oca/he.h.m3:heHE.EnylouFlogaPyros.name
ltx/en_us_oca/oc.m3.d2:ocMA.OdeW8C2T.mode	@ltx/en_us_oca/miscellanea:misc.Mode3
ltx/en_us_oca/oc.m3.d2:ocMA.OdeW8C2T.ode	@ltx/en_us_oca/miscellanea:misc.Ode8
ltx/en_us_oca/oc.m3.d2:ocMA.OdeW8C2T.text	
ltx/en_us_oca/oc.m3.d2:ocMA.OdeW9C11.incipit	…
ltx/en_us_oca/oc.m3.d2:ocMA.OdeW9C11.melody	@ltx/en_us_oca/he.h.m3:heHE.EnSinaioToOrei.name
ltx/en_us_oca/oc.m3.d2:ocMA.OdeW9C11.mode	@ltx/en_us_oca/miscellanea:misc.Mode3
ltx/en_us_oca/oc.m3.d2:ocMA.OdeW9C11.ode	@ltx/en_us_oca/miscellanea:misc.Ode9
ltx/en_us_oca/oc.m3.d2:ocMA.OdeW9C11.text	
ltx/en_us_oca/oc.m3.d2:ocMA.OdeW9C12.incipit	…
ltx/en_us_oca/oc.m3.d2:ocMA.OdeW9C12.melody	@ltx/en_us_oca/he.h.m3:heHE.EnSinaioToOrei.name
ltx/en_us_oca/oc.m3.d2:ocMA.OdeW9C12.mode	@ltx/en_us_oca/miscellanea:misc.Mode3
ltx/en_us_oca/oc.m3.d2:ocMA.OdeW9C12.ode	@ltx/en_us_oca/miscellanea:misc.Ode9
ltx/en_us_oca/oc.m3.d2:ocMA.OdeW9C12.text	
ltx/en_us_oca/oc.m3.d2:ocMA.OdeW9C13.incipit	…
ltx/en_us_oca/oc.m3.d2:ocMA.OdeW9C13.melody	@ltx/en_us_oca/he.h.m3:heHE.EnSinaioToOrei.name
ltx/en_us_oca/oc.m3.d2:ocMA.OdeW9C13.mode	@ltx/en_us_oca/miscellanea:misc.Mode3
ltx/en_us_oca/oc.m3.d2:ocMA.OdeW9C13.ode	@ltx/en_us_oca/miscellanea:misc.Ode9
ltx/en_us_oca/oc.m3.d2:ocMA.OdeW9C13.text	
ltx/en_us_oca/oc.m3.d2:ocMA.OdeW9C14.incipit	…
ltx/en_us_oca/oc.m3.d2:ocMA.OdeW9C14.melody	@ltx/en_us_oca/he.h.m3:heHE.EnSinaioToOrei.name
ltx/en_us_oca/oc.m3.d2:ocMA.OdeW9C14.mode	@ltx/en_us_oca/miscellanea:misc.Mode3
ltx/en_us_oca/oc.m3.d2:ocMA.OdeW9C14.ode	@ltx/en_us_oca/miscellanea:misc.Ode9
ltx/en_us_oca/oc.m3.d2:ocMA.OdeW9C14.text	
ltx/en_us_oca/oc.m3.d2:ocMA.OdeW9C1H.greekmelody	@ltx/en_us_oca/he.h.m3:heHE.EnSinaioToOrei.greekname
ltx/en_us_oca/oc.m3.d2:ocMA.OdeW9C1H.incipit	@ltx/en_us_oca/he.h.m3:heHE.EnSinaioToOrei.incipit
ltx/en_us_oca/oc.m3.d2:ocMA.OdeW9C1H.melody	@ltx/en_us_oca/he.h.m3:heHE.EnSinaioToOrei.melody
ltx/en_us_oca/oc.m3.d2:ocMA.OdeW9C1H.mode	@ltx/en_us_oca/miscellanea:misc.Mode3
ltx/en_us_oca/oc.m3.d2:ocMA.OdeW9C1H.ode	@ltx/en_us_oca/miscellanea:misc.Ode9
ltx/en_us_oca/oc.m3.d2:ocMA.OdeW9C1H.text	@ltx/en_us_oca/he.h.m3:heHE.EnSinaioToOrei.text
ltx/en_us_oca/oc.m3.d2:ocMA.OdeW9C1T.incipit	…
ltx/en_us_oca/oc.m3.d2:ocMA.OdeW9C1T.melody	@ltx/en_us_oca/he.h.m3:heHE.EnSinaioToOrei.name
ltx/en_us_oca/oc.m3.d2:ocMA.OdeW9C1T.mode	@ltx/en_us_oca/miscellanea:misc.Mode3
ltx/en_us_oca/oc.m3.d2:ocMA.OdeW9C1T.ode	@ltx/en_us_oca/miscellanea:misc.Ode9
ltx/en_us_oca/oc.m3.d2:ocMA.OdeW9C1T.text	
ltx/en_us_oca/oc.m3.d2:ocMA.OdeW9C21.greekmelody	@ltx/en_us_oca/he.h.m3:heHE.OiToGlykei.greekname
ltx/en_us_oca/oc.m3.d2:ocMA.OdeW9C21.incipit	…
ltx/en_us_oca/oc.m3.d2:ocMA.OdeW9C21.melody	@ltx/en_us_oca/he.h.m3:heHE.OiToGlykei.name
ltx/en_us_oca/oc.m3.d2:ocMA.OdeW9C21.mode	@ltx/en_us_oca/miscellanea:misc.Mode3
ltx/en_us_oca/oc.m3.d2:ocMA.OdeW9C21.ode	@ltx/en_us_oca/miscellanea:misc.Ode9
ltx/en_us_oca/oc.m3.d2:ocMA.OdeW9C21.text	
ltx/en_us_oca/oc.m3.d2:ocMA.OdeW9C22.incipit	…
ltx/en_us_oca/oc.m3.d2:ocMA.OdeW9C22.melody	@ltx/en_us_oca/he.h.m3:heHE.OiToGlykei.name
ltx/en_us_oca/oc.m3.d2:ocMA.OdeW9C22.mode	@ltx/en_us_oca/miscellanea:misc.Mode3
ltx/en_us_oca/oc.m3.d2:ocMA.OdeW9C22.ode	@ltx/en_us_oca/miscellanea:misc.Ode9
ltx/en_us_oca/oc.m3.d2:ocMA.OdeW9C22.text	
ltx/en_us_oca/oc.m3.d2:ocMA.OdeW9C2T.incipit	…
ltx/en_us_oca/oc.m3.d2:ocMA.OdeW9C2T.melody	@ltx/en_us_oca/he.h.m3:heHE.OiToGlykei.name
ltx/en_us_oca/oc.m3.d2:ocMA.OdeW9C2T.mode	@ltx/en_us_oca/miscellanea:misc.Mode3
ltx/en_us_oca/oc.m3.d2:ocMA.OdeW9C2T.ode	@ltx/en_us_oca/miscellanea:misc.Ode9
ltx/en_us_oca/oc.m3.d2:ocMA.OdeW9C2T.text	
ltx/en_us_oca/oc.m3.d2:ocVE.ApolTheotokionVM.incipit	@ltx/en_us_oca/he.a.m3:heAU.TinOraiotita.incipit
ltx/en_us_oca/oc.m3.d2:ocVE.ApolTheotokionVM.melody	@ltx/en_us_oca/he.a.m3:heAU.TinOraiotita.melody
ltx/en_us_oca/oc.m3.d2:ocVE.ApolTheotokionVM.mode	@ltx/en_us_oca/miscellanea:misc.Mode3
ltx/en_us_oca/oc.m3.d2:ocVE.ApolTheotokionVM.text	@ltx/en_us_oca/he.a.m3:heAU.TinOraiotita.text
ltx/en_us_oca/oc.m3.d2:ocVE.AposTheotokion.incipit	…
ltx/en_us_oca/oc.m3.d2:ocVE.AposTheotokion.melody	
ltx/en_us_oca/oc.m3.d2:ocVE.AposTheotokion.mode	@ltx/en_us_oca/miscellanea:misc.Mode3
ltx/en_us_oca/oc.m3.d2:ocVE.AposTheotokion.text	
ltx/en_us_oca/oc.m3.d2:ocVE.Aposticha1.incipit	…
ltx/en_us_oca/oc.m3.d2:ocVE.Aposticha1.melody	
ltx/en_us_oca/oc.m3.d2:ocVE.Aposticha1.mode	@ltx/en_us_oca/miscellanea:misc.Mode3
ltx/en_us_oca/oc.m3.d2:ocVE.Aposticha1.text	
ltx/en_us_oca/oc.m3.d2:ocVE.Aposticha2.greekmelody	@ltx/en_us_oca/he.a.m3:heAU.SosonMeKyrie.greekname
ltx/en_us_oca/oc.m3.d2:ocVE.Aposticha2.incipit	@ltx/en_us_oca/he.a.m3:heAU.SosonMeKyrie.incipit
ltx/en_us_oca/oc.m3.d2:ocVE.Aposticha2.melody	@ltx/en_us_oca/he.a.m3:heAU.SosonMeKyrie.melody
ltx/en_us_oca/oc.m3.d2:ocVE.Aposticha2.mode	@ltx/en_us_oca/miscellanea:misc.Mode3
ltx/en_us_oca/oc.m3.d2:ocVE.Aposticha2.text	@ltx/en_us_oca/he.a.m3:heAU.SosonMeKyrie.text
ltx/en_us_oca/oc.m3.d2:ocVE.Aposticha3.greekmelody	@ltx/en_us_oca/he.a.m3:heAU.MegaliTouStavrouSou.greekname
ltx/en_us_oca/oc.m3.d2:ocVE.Aposticha3.incipit	@ltx/en_us_oca/he.a.m3:heAU.MegaliTouStavrouSou.incipit
ltx/en_us_oca/oc.m3.d2:ocVE.Aposticha3.melody	@ltx/en_us_oca/he.a.m3:heAU.MegaliTouStavrouSou.melody
ltx/en_us_oca/oc.m3.d2:ocVE.Aposticha3.mode	@ltx/en_us_oca/miscellanea:misc.Mode3
ltx/en_us_oca/oc.m3.d2:ocVE.Aposticha3.text	@ltx/en_us_oca/he.a.m3:heAU.MegaliTouStavrouSou.text
ltx/en_us_oca/oc.m3.d2:ocVE.SticTheotokion.greekmelody	@ltx/en_us_oca/he.a.m3:heAU.MegaliTouStavrouSou.greekname
ltx/en_us_oca/oc.m3.d2:ocVE.SticTheotokion.incipit	…
ltx/en_us_oca/oc.m3.d2:ocVE.SticTheotokion.melody	@ltx/en_us_oca/he.a.m3:heAU.MegaliTouStavrouSou.notmetered
ltx/en_us_oca/oc.m3.d2:ocVE.SticTheotokion.mode	@ltx/en_us_oca/miscellanea:misc.Mode3
ltx/en_us_oca/oc.m3.d2:ocVE.SticTheotokion.text	
ltx/en_us_oca/oc.m3.d2:ocVE.Stichera1.greekmelody	@ltx/en_us_oca/he.a.m3:heAU.SosonMeKyrie.greekname
ltx/en_us_oca/oc.m3.d2:ocVE.Stichera1.incipit	…
ltx/en_us_oca/oc.m3.d2:ocVE.Stichera1.melody	@ltx/en_us_oca/he.a.m3:heAU.SosonMeKyrie.notmetered
ltx/en_us_oca/oc.m3.d2:ocVE.Stichera1.mode	@ltx/en_us_oca/miscellanea:misc.Mode3
ltx/en_us_oca/oc.m3.d2:ocVE.Stichera1.text	
ltx/en_us_oca/oc.m3.d2:ocVE.Stichera2.incipit	…
ltx/en_us_oca/oc.m3.d2:ocVE.Stichera2.melody	@ltx/en_us_oca/he.a.m3:heAU.SosonMeKyrie.notmetered
ltx/en_us_oca/oc.m3.d2:ocVE.Stichera2.mode	@ltx/en_us_oca/miscellanea:misc.Mode3
ltx/en_us_oca/oc.m3.d2:ocVE.Stichera2.text	
ltx/en_us_oca/oc.m3.d2:ocVE.Stichera3.incipit	…
ltx/en_us_oca/oc.m3.d2:ocVE.Stichera3.melody	@ltx/en_us_oca/he.a.m3:heAU.SosonMeKyrie.notmetered
ltx/en_us_oca/oc.m3.d2:ocVE.Stichera3.mode	@ltx/en_us_oca/miscellanea:misc.Mode3
ltx/en_us_oca/oc.m3.d2:ocVE.Stichera3.text	
ltx/en_us_oca/oc.m3.d2:ocVE.Stichera4.greekmelody	@ltx/en_us_oca/he.a.m3:heAU.MegaliTouStavrouSou.greekname
ltx/en_us_oca/oc.m3.d2:ocVE.Stichera4.incipit	…
ltx/en_us_oca/oc.m3.d2:ocVE.Stichera4.melody	@ltx/en_us_oca/he.a.m3:heAU.MegaliTouStavrouSou.notmetered
ltx/en_us_oca/oc.m3.d2:ocVE.Stichera4.mode	@ltx/en_us_oca/miscellanea:misc.Mode3
ltx/en_us_oca/oc.m3.d2:ocVE.Stichera4.text	
ltx/en_us_oca/oc.m3.d2:ocVE.Stichera5.incipit	…
ltx/en_us_oca/oc.m3.d2:ocVE.Stichera5.melody	@ltx/en_us_oca/he.a.m3:heAU.MegaliTouStavrouSou.notmetered
ltx/en_us_oca/oc.m3.d2:ocVE.Stichera5.mode	@ltx/en_us_oca/miscellanea:misc.Mode3
ltx/en_us_oca/oc.m3.d2:ocVE.Stichera5.text	
ltx/en_us_oca/oc.m3.d2:ocVE.Stichera6.incipit	…
ltx/en_us_oca/oc.m3.d2:ocVE.Stichera6.melody	@ltx/en_us_oca/he.a.m3:heAU.MegaliTouStavrouSou.notmetered
ltx/en_us_oca/oc.m3.d2:ocVE.Stichera6.mode	@ltx/en_us_oca/miscellanea:misc.Mode3
ltx/en_us_oca/oc.m3.d2:ocVE.Stichera6.text	
ltx/en_us_oca/oc.m3.d2:octrMA.Kathisma11.incipit	@ltx/en_us_oca/oc.m3.d2:ocMA.Kathisma21.incipit
ltx/en_us_oca/oc.m3.d2:octrMA.Kathisma11.melody	
ltx/en_us_oca/oc.m3.d2:octrMA.Kathisma11.mode	@ltx/en_us_oca/miscellanea:misc.Mode3
ltx/en_us_oca/oc.m3.d2:octrMA.Kathisma11.text	@ltx/en_us_oca/oc.m3.d2:ocMA.Kathisma21.text
ltx/en_us_oca/oc.m3.d2:octrMA.Kathisma12.incipit	@ltx/en_us_oca/oc.m3.d2:ocMA.Kathisma12.incipit
ltx/en_us_oca/oc.m3.d2:octrMA.Kathisma12.melody	
ltx/en_us_oca/oc.m3.d2:octrMA.Kathisma12.mode	@ltx/en_us_oca/miscellanea:misc.Mode3
ltx/en_us_oca/oc.m3.d2:octrMA.Kathisma12.text	@ltx/en_us_oca/oc.m3.d2:ocMA.Kathisma12.text
ltx/en_us_oca/oc.m3.d2:octrMA.Kathisma1T.incipit	@ltx/en_us_oca/oc.m3.d3:ocMA.Kathisma33.incipit
ltx/en_us_oca/oc.m3.d2:octrMA.Kathisma1T.melody	
ltx/en_us_oca/oc.m3.d2:octrMA.Kathisma1T.mode	@ltx/en_us_oca/miscellanea:misc.Mode3
ltx/en_us_oca/oc.m3.d2:octrMA.Kathisma1T.text	@ltx/en_us_oca/oc.m3.d3:ocMA.Kathisma33.text
ltx/en_us_oca/oc.m3.d2:octrMA.Ode7Martyricon.incipit	…
ltx/en_us_oca/oc.m3.d2:octrMA.Ode7Martyricon.melody	
ltx/en_us_oca/oc.m3.d2:octrMA.Ode7Martyricon.mode	@ltx/en_us_oca/miscellanea:misc.Mode3
ltx/en_us_oca/oc.m3.d2:octrMA.Ode7Martyricon.text	
ltx/en_us_oca/oc.m3.d2:octrMA.Photagogic.incipit	…
ltx/en_us_oca/oc.m3.d2:octrMA.Photagogic.mode	@ltx/en_us_oca/miscellanea:misc.Mode3
ltx/en_us_oca/oc.m3.d2:octrMA.Photagogic.text	
ltx/en_us_oca/oc.m3.d2:octrMA.Triadic1.incipit	…
ltx/en_us_oca/oc.m3.d2:octrMA.Triadic1.mode	@ltx/en_us_oca/miscellanea:misc.Mode3
ltx/en_us_oca/oc.m3.d2:octrMA.Triadic1.text	
ltx/en_us_oca/oc.m3.d2:octrMA.Triadic2.incipit	…
ltx/en_us_oca/oc.m3.d2:octrMA.Triadic2.mode	@ltx/en_us_oca/miscellanea:misc.Mode3
ltx/en_us_oca/oc.m3.d2:octrMA.Triadic2.text	
ltx/en_us_oca/oc.m3.d2:octrMA.Triadic3.incipit	…
ltx/en_us_oca/oc.m3.d2:octrMA.Triadic3.mode	@ltx/en_us_oca/miscellanea:misc.Mode3
ltx/en_us_oca/oc.m3.d2:octrMA.Triadic3.text	
ltx/en_us_oca/oc.m3.d2:octrVE.Stichera1.incipit	@ltx/en_us_oca/oc.m3.d2:ocVE.Aposticha1.incipit
ltx/en_us_oca/oc.m3.d2:octrVE.Stichera1.melody	
ltx/en_us_oca/oc.m3.d2:octrVE.Stichera1.mode	@ltx/en_us_oca/miscellanea:misc.Mode3
ltx/en_us_oca/oc.m3.d2:octrVE.Stichera1.text	@ltx/en_us_oca/oc.m3.d2:ocVE.Aposticha1.text
ltx/en_us_oca/oc.m3.d2:octrVE.Stichera2.incipit	@ltx/en_us_oca/oc.m3.d2:ocVE.Aposticha2.incipit
ltx/en_us_oca/oc.m3.d2:octrVE.Stichera2.melody	
ltx/en_us_oca/oc.m3.d2:octrVE.Stichera2.mode	@ltx/en_us_oca/miscellanea:misc.Mode3
ltx/en_us_oca/oc.m3.d2:octrVE.Stichera2.text	@ltx/en_us_oca/oc.m3.d2:ocVE.Aposticha2.text
ltx/en_us_oca/oc.m3.d2:octrVE.Stichera3.incipit	@ltx/en_us_oca/oc.m3.d2:ocMA.Aposticha1.incipit
ltx/en_us_oca/oc.m3.d2:octrVE.Stichera3.melody	
ltx/en_us_oca/oc.m3.d2:octrVE.Stichera3.mode	@ltx/en_us_oca/miscellanea:misc.Mode3
ltx/en_us_oca/oc.m3.d2:octrVE.Stichera3.text	@ltx/en_us_oca/oc.m3.d2:ocMA.Aposticha1.text
ltx/en_us_oca/oc.m3.d2:octrVE.Stichera4.incipit	@ltx/en_us_oca/oc.m3.d2:ocMA.Aposticha2.incipit
ltx/en_us_oca/oc.m3.d2:octrVE.Stichera4.melody	
ltx/en_us_oca/oc.m3.d2:octrVE.Stichera4.mode	@ltx/en_us_oca/miscellanea:misc.Mode3
ltx/en_us_oca/oc.m3.d2:octrVE.Stichera4.text	@ltx/en_us_oca/oc.m3.d2:ocMA.Aposticha2.text
