ltx/en_us_oca/me.m06.d09:meDA.commemoration.first	
ltx/en_us_oca/me.m06.d09:meDA.commemoration.first_name	
ltx/en_us_oca/me.m06.d09:meDA.commemoration.first_short	
ltx/en_us_oca/me.m06.d09:meDA.commemoration.first_title	
ltx/en_us_oca/me.m06.d09:meDA.commemoration.full	
ltx/en_us_oca/me.m06.d09:meDA.commemoration.second_name	
ltx/en_us_oca/me.m06.d09:meDA.commemoration.second_title	
ltx/en_us_oca/me.m06.d09:meDA.date	
ltx/en_us_oca/me.m06.d09:meDA.dismissal	
ltx/en_us_oca/me.m06.d09:meDA.fordate	
ltx/en_us_oca/me.m06.d09:meDA.insert1	
ltx/en_us_oca/me.m06.d09:meDA.insert2	
ltx/en_us_oca/me.m06.d09:meDA.note	
ltx/en_us_oca/me.m06.d09:meDA.pdfcoverdate	
ltx/en_us_oca/me.m06.d09:meDA.pdfheaderdate	
ltx/en_us_oca/me.m06.d09:meHO.commemorations	
ltx/en_us_oca/me.m06.d09:meHO.note1	
ltx/en_us_oca/me.m06.d09:meHO.note2	
ltx/en_us_oca/me.m06.d09:meHO.number	
ltx/en_us_oca/me.m06.d09:meHO.rank	
ltx/en_us_oca/me.m06.d09:meLE.commemoration1	
ltx/en_us_oca/me.m06.d09:meLE.commemoration2	
ltx/en_us_oca/me.m06.d09:meLI.Kontakion1.greekmelody	@ltx/en_us_oca/me.m06.d09:meMA.Kontakion1.greekmelody
ltx/en_us_oca/me.m06.d09:meLI.Kontakion1.incipit	@ltx/en_us_oca/me.m06.d09:meMA.Kontakion1.incipit
ltx/en_us_oca/me.m06.d09:meLI.Kontakion1.melody	@ltx/en_us_oca/me.m06.d09:meMA.Kontakion1.melody
ltx/en_us_oca/me.m06.d09:meLI.Kontakion1.mode	@ltx/en_us_oca/me.m06.d09:meMA.Kontakion1.mode
ltx/en_us_oca/me.m06.d09:meLI.Kontakion1.text	@ltx/en_us_oca/me.m06.d09:meMA.Kontakion1.text
ltx/en_us_oca/me.m06.d09:meLI.MM.CommunionHymn.text	@ltx/en_us_oca/properties:media.key
ltx/en_us_oca/me.m06.d09:meLI.Megalynarion.text	
ltx/en_us_oca/me.m06.d09:meMA.C1.acrostic.notice1	
ltx/en_us_oca/me.m06.d09:meMA.C1.acrostic.text	
ltx/en_us_oca/me.m06.d09:meMA.C1.acrostic.title	
ltx/en_us_oca/me.m06.d09:meMA.C1.poet	@ltx/en_us_oca/poets:po.Theofanous
ltx/en_us_oca/me.m06.d09:meMA.C1.title	@ltx/en_us_oca/titles:ti.CanonSaintM
ltx/en_us_oca/me.m06.d09:meMA.C1.verse	@ltx/en_us_oca/prayers:pr.verse_SaintM.text
ltx/en_us_oca/me.m06.d09:meMA.Kontakion1.greekmelody	@ltx/en_us_oca/he.a.m6:heAU.TinYperImon.greekname
ltx/en_us_oca/me.m06.d09:meMA.Kontakion1.incipit	From the well-springs of the…
ltx/en_us_oca/me.m06.d09:meMA.Kontakion1.melody	@ltx/en_us_oca/he.a.m6:heAU.TinYperImon.notmetered
ltx/en_us_oca/me.m06.d09:meMA.Kontakion1.mode	@ltx/en_us_oca/miscellanea:misc.Mode6
ltx/en_us_oca/me.m06.d09:meMA.Kontakion1.text	From the well-springs of the Savior, ⁄ you have openly poured on us a depth of the teachings of theology, ⁄ drowning heresies and saving your flock unharmed by triple waves, ⁄ blessed and venerable Cyril. ⁄ You are shown to be a guide for all lands, ⁄⁄ revealing things divine!
ltx/en_us_oca/me.m06.d09:meMA.Ode1C11.greekmelody	@ltx/en_us_oca/he.h.m4:heHE.ThalassisToErythraion.greekname
ltx/en_us_oca/me.m06.d09:meMA.Ode1C11.incipit	…
ltx/en_us_oca/me.m06.d09:meMA.Ode1C11.melody	@ltx/en_us_oca/he.h.m4:heHE.ThalassisToErythraion.notmetered
ltx/en_us_oca/me.m06.d09:meMA.Ode1C11.mode	@ltx/en_us_oca/miscellanea:misc.Mode4
ltx/en_us_oca/me.m06.d09:meMA.Ode1C11.ode	@ltx/en_us_oca/miscellanea:misc.Ode1
ltx/en_us_oca/me.m06.d09:meMA.Ode1C11.text	
ltx/en_us_oca/me.m06.d09:meMA.Ode1C12.incipit	…
ltx/en_us_oca/me.m06.d09:meMA.Ode1C12.melody	@ltx/en_us_oca/he.h.m4:heHE.ThalassisToErythraion.notmetered
ltx/en_us_oca/me.m06.d09:meMA.Ode1C12.mode	@ltx/en_us_oca/miscellanea:misc.Mode4
ltx/en_us_oca/me.m06.d09:meMA.Ode1C12.ode	@ltx/en_us_oca/miscellanea:misc.Ode1
ltx/en_us_oca/me.m06.d09:meMA.Ode1C12.text	
ltx/en_us_oca/me.m06.d09:meMA.Ode1C13.incipit	…
ltx/en_us_oca/me.m06.d09:meMA.Ode1C13.melody	@ltx/en_us_oca/he.h.m4:heHE.ThalassisToErythraion.notmetered
ltx/en_us_oca/me.m06.d09:meMA.Ode1C13.mode	@ltx/en_us_oca/miscellanea:misc.Mode4
ltx/en_us_oca/me.m06.d09:meMA.Ode1C13.ode	@ltx/en_us_oca/miscellanea:misc.Ode1
ltx/en_us_oca/me.m06.d09:meMA.Ode1C13.text	
ltx/en_us_oca/me.m06.d09:meMA.Ode1C1T.incipit	…
ltx/en_us_oca/me.m06.d09:meMA.Ode1C1T.melody	@ltx/en_us_oca/he.h.m4:heHE.ThalassisToErythraion.notmetered
ltx/en_us_oca/me.m06.d09:meMA.Ode1C1T.mode	@ltx/en_us_oca/miscellanea:misc.Mode4
ltx/en_us_oca/me.m06.d09:meMA.Ode1C1T.ode	@ltx/en_us_oca/miscellanea:misc.Ode1
ltx/en_us_oca/me.m06.d09:meMA.Ode1C1T.text	
ltx/en_us_oca/me.m06.d09:meMA.Ode3C11.greekmelody	@ltx/en_us_oca/he.h.m4:heHE.EffrainetaiEpiSoi.greekname
ltx/en_us_oca/me.m06.d09:meMA.Ode3C11.incipit	…
ltx/en_us_oca/me.m06.d09:meMA.Ode3C11.melody	@ltx/en_us_oca/he.h.m4:heHE.EffrainetaiEpiSoi.notmetered
ltx/en_us_oca/me.m06.d09:meMA.Ode3C11.mode	@ltx/en_us_oca/miscellanea:misc.Mode4
ltx/en_us_oca/me.m06.d09:meMA.Ode3C11.ode	@ltx/en_us_oca/miscellanea:misc.Ode3
ltx/en_us_oca/me.m06.d09:meMA.Ode3C11.text	
ltx/en_us_oca/me.m06.d09:meMA.Ode3C12.incipit	…
ltx/en_us_oca/me.m06.d09:meMA.Ode3C12.melody	@ltx/en_us_oca/he.h.m4:heHE.EffrainetaiEpiSoi.notmetered
ltx/en_us_oca/me.m06.d09:meMA.Ode3C12.mode	@ltx/en_us_oca/miscellanea:misc.Mode4
ltx/en_us_oca/me.m06.d09:meMA.Ode3C12.ode	@ltx/en_us_oca/miscellanea:misc.Ode3
ltx/en_us_oca/me.m06.d09:meMA.Ode3C12.text	
ltx/en_us_oca/me.m06.d09:meMA.Ode3C13.incipit	…
ltx/en_us_oca/me.m06.d09:meMA.Ode3C13.melody	@ltx/en_us_oca/he.h.m4:heHE.EffrainetaiEpiSoi.notmetered
ltx/en_us_oca/me.m06.d09:meMA.Ode3C13.mode	@ltx/en_us_oca/miscellanea:misc.Mode4
ltx/en_us_oca/me.m06.d09:meMA.Ode3C13.ode	@ltx/en_us_oca/miscellanea:misc.Ode3
ltx/en_us_oca/me.m06.d09:meMA.Ode3C13.text	
ltx/en_us_oca/me.m06.d09:meMA.Ode3C1T.incipit	…
ltx/en_us_oca/me.m06.d09:meMA.Ode3C1T.melody	@ltx/en_us_oca/he.h.m4:heHE.EffrainetaiEpiSoi.notmetered
ltx/en_us_oca/me.m06.d09:meMA.Ode3C1T.mode	@ltx/en_us_oca/miscellanea:misc.Mode4
ltx/en_us_oca/me.m06.d09:meMA.Ode3C1T.ode	@ltx/en_us_oca/miscellanea:misc.Ode3
ltx/en_us_oca/me.m06.d09:meMA.Ode3C1T.text	
ltx/en_us_oca/me.m06.d09:meMA.Ode3H.greekmelody	@ltx/en_us_oca/he.h.m4:heHE.EffrainetaiEpiSoi.greekname
ltx/en_us_oca/me.m06.d09:meMA.Ode3H.incipit	@ltx/en_us_oca/he.h.m4:heHE.EffrainetaiEpiSoi.incipit
ltx/en_us_oca/me.m06.d09:meMA.Ode3H.melody	@ltx/en_us_oca/he.h.m4:heHE.EffrainetaiEpiSoi.melody
ltx/en_us_oca/me.m06.d09:meMA.Ode3H.mode	@ltx/en_us_oca/miscellanea:misc.Mode4
ltx/en_us_oca/me.m06.d09:meMA.Ode3H.ode	@ltx/en_us_oca/miscellanea:misc.Ode3
ltx/en_us_oca/me.m06.d09:meMA.Ode3H.text	@ltx/en_us_oca/he.h.m4:heHE.EffrainetaiEpiSoi.text
ltx/en_us_oca/me.m06.d09:meMA.Ode3Kathisma1.greekmelody	@ltx/en_us_oca/he.a.m8:heAU.TinSofianKaiLogon.greekname
ltx/en_us_oca/me.m06.d09:meMA.Ode3Kathisma1.incipit	…
ltx/en_us_oca/me.m06.d09:meMA.Ode3Kathisma1.melody	@ltx/en_us_oca/he.a.m8:heAU.TinSofianKaiLogon.notmetered
ltx/en_us_oca/me.m06.d09:meMA.Ode3Kathisma1.mode	@ltx/en_us_oca/miscellanea:misc.Mode8
ltx/en_us_oca/me.m06.d09:meMA.Ode3Kathisma1.text	
ltx/en_us_oca/me.m06.d09:meMA.Ode3KathismaSt.incipit	@ltx/en_us_oca/me.m01.d24:meMA.Ode3KathismaSt.incipit
ltx/en_us_oca/me.m06.d09:meMA.Ode3KathismaSt.melody	@ltx/en_us_oca/he.a.m8:heAU.TinSofianKaiLogon.notmetered
ltx/en_us_oca/me.m06.d09:meMA.Ode3KathismaSt.mode	@ltx/en_us_oca/miscellanea:misc.Mode8
ltx/en_us_oca/me.m06.d09:meMA.Ode3KathismaSt.text	@ltx/en_us_oca/me.m01.d24:meMA.Ode3KathismaSt.text
ltx/en_us_oca/me.m06.d09:meMA.Ode3KathismaT.incipit	…
ltx/en_us_oca/me.m06.d09:meMA.Ode3KathismaT.melody	@ltx/en_us_oca/he.a.m8:heAU.TinSofianKaiLogon.notmetered
ltx/en_us_oca/me.m06.d09:meMA.Ode3KathismaT.mode	@ltx/en_us_oca/miscellanea:misc.Mode8
ltx/en_us_oca/me.m06.d09:meMA.Ode3KathismaT.text	
ltx/en_us_oca/me.m06.d09:meMA.Ode4C11.greekmelody	@ltx/en_us_oca/he.h.m4:heHE.EparthentaSeIdousa.greekname
ltx/en_us_oca/me.m06.d09:meMA.Ode4C11.incipit	…
ltx/en_us_oca/me.m06.d09:meMA.Ode4C11.melody	@ltx/en_us_oca/he.h.m4:heHE.EparthentaSeIdousa.notmetered
ltx/en_us_oca/me.m06.d09:meMA.Ode4C11.mode	@ltx/en_us_oca/miscellanea:misc.Mode4
ltx/en_us_oca/me.m06.d09:meMA.Ode4C11.ode	@ltx/en_us_oca/miscellanea:misc.Ode4
ltx/en_us_oca/me.m06.d09:meMA.Ode4C11.text	
ltx/en_us_oca/me.m06.d09:meMA.Ode4C12.incipit	…
ltx/en_us_oca/me.m06.d09:meMA.Ode4C12.melody	@ltx/en_us_oca/he.h.m4:heHE.EparthentaSeIdousa.notmetered
ltx/en_us_oca/me.m06.d09:meMA.Ode4C12.mode	@ltx/en_us_oca/miscellanea:misc.Mode4
ltx/en_us_oca/me.m06.d09:meMA.Ode4C12.ode	@ltx/en_us_oca/miscellanea:misc.Ode4
ltx/en_us_oca/me.m06.d09:meMA.Ode4C12.text	
ltx/en_us_oca/me.m06.d09:meMA.Ode4C13.incipit	…
ltx/en_us_oca/me.m06.d09:meMA.Ode4C13.melody	@ltx/en_us_oca/he.h.m4:heHE.EparthentaSeIdousa.notmetered
ltx/en_us_oca/me.m06.d09:meMA.Ode4C13.mode	@ltx/en_us_oca/miscellanea:misc.Mode4
ltx/en_us_oca/me.m06.d09:meMA.Ode4C13.ode	@ltx/en_us_oca/miscellanea:misc.Ode4
ltx/en_us_oca/me.m06.d09:meMA.Ode4C13.text	
ltx/en_us_oca/me.m06.d09:meMA.Ode4C1T.incipit	…
ltx/en_us_oca/me.m06.d09:meMA.Ode4C1T.melody	@ltx/en_us_oca/he.h.m4:heHE.EparthentaSeIdousa.notmetered
ltx/en_us_oca/me.m06.d09:meMA.Ode4C1T.mode	@ltx/en_us_oca/miscellanea:misc.Mode4
ltx/en_us_oca/me.m06.d09:meMA.Ode4C1T.ode	@ltx/en_us_oca/miscellanea:misc.Ode4
ltx/en_us_oca/me.m06.d09:meMA.Ode4C1T.text	
ltx/en_us_oca/me.m06.d09:meMA.Ode5C11.greekmelody	@ltx/en_us_oca/he.h.m4:heHE.SyKyrieMouFos.greekname
ltx/en_us_oca/me.m06.d09:meMA.Ode5C11.incipit	…
ltx/en_us_oca/me.m06.d09:meMA.Ode5C11.melody	@ltx/en_us_oca/he.h.m4:heHE.SyKyrieMouFos.notmetered
ltx/en_us_oca/me.m06.d09:meMA.Ode5C11.mode	@ltx/en_us_oca/miscellanea:misc.Mode4
ltx/en_us_oca/me.m06.d09:meMA.Ode5C11.ode	@ltx/en_us_oca/miscellanea:misc.Ode5
ltx/en_us_oca/me.m06.d09:meMA.Ode5C11.text	
ltx/en_us_oca/me.m06.d09:meMA.Ode5C12.incipit	…
ltx/en_us_oca/me.m06.d09:meMA.Ode5C12.melody	@ltx/en_us_oca/he.h.m4:heHE.SyKyrieMouFos.notmetered
ltx/en_us_oca/me.m06.d09:meMA.Ode5C12.mode	@ltx/en_us_oca/miscellanea:misc.Mode4
ltx/en_us_oca/me.m06.d09:meMA.Ode5C12.ode	@ltx/en_us_oca/miscellanea:misc.Ode5
ltx/en_us_oca/me.m06.d09:meMA.Ode5C12.text	
ltx/en_us_oca/me.m06.d09:meMA.Ode5C13.incipit	…
ltx/en_us_oca/me.m06.d09:meMA.Ode5C13.melody	@ltx/en_us_oca/he.h.m4:heHE.SyKyrieMouFos.notmetered
ltx/en_us_oca/me.m06.d09:meMA.Ode5C13.mode	@ltx/en_us_oca/miscellanea:misc.Mode4
ltx/en_us_oca/me.m06.d09:meMA.Ode5C13.ode	@ltx/en_us_oca/miscellanea:misc.Ode5
ltx/en_us_oca/me.m06.d09:meMA.Ode5C13.text	
ltx/en_us_oca/me.m06.d09:meMA.Ode5C1T.incipit	…
ltx/en_us_oca/me.m06.d09:meMA.Ode5C1T.melody	@ltx/en_us_oca/he.h.m4:heHE.SyKyrieMouFos.notmetered
ltx/en_us_oca/me.m06.d09:meMA.Ode5C1T.mode	@ltx/en_us_oca/miscellanea:misc.Mode4
ltx/en_us_oca/me.m06.d09:meMA.Ode5C1T.ode	@ltx/en_us_oca/miscellanea:misc.Ode5
ltx/en_us_oca/me.m06.d09:meMA.Ode5C1T.text	
ltx/en_us_oca/me.m06.d09:meMA.Ode6C11.greekmelody	@ltx/en_us_oca/he.h.m4:heHE.ThysoSoiMetaFonis.greekname
ltx/en_us_oca/me.m06.d09:meMA.Ode6C11.incipit	…
ltx/en_us_oca/me.m06.d09:meMA.Ode6C11.melody	@ltx/en_us_oca/he.h.m4:heHE.ThysoSoiMetaFonis.notmetered
ltx/en_us_oca/me.m06.d09:meMA.Ode6C11.mode	@ltx/en_us_oca/miscellanea:misc.Mode4
ltx/en_us_oca/me.m06.d09:meMA.Ode6C11.ode	@ltx/en_us_oca/miscellanea:misc.Ode6
ltx/en_us_oca/me.m06.d09:meMA.Ode6C11.text	
ltx/en_us_oca/me.m06.d09:meMA.Ode6C12.incipit	…
ltx/en_us_oca/me.m06.d09:meMA.Ode6C12.melody	@ltx/en_us_oca/he.h.m4:heHE.ThysoSoiMetaFonis.notmetered
ltx/en_us_oca/me.m06.d09:meMA.Ode6C12.mode	@ltx/en_us_oca/miscellanea:misc.Mode4
ltx/en_us_oca/me.m06.d09:meMA.Ode6C12.ode	@ltx/en_us_oca/miscellanea:misc.Ode6
ltx/en_us_oca/me.m06.d09:meMA.Ode6C12.text	
ltx/en_us_oca/me.m06.d09:meMA.Ode6C13.incipit	…
ltx/en_us_oca/me.m06.d09:meMA.Ode6C13.melody	@ltx/en_us_oca/he.h.m4:heHE.ThysoSoiMetaFonis.notmetered
ltx/en_us_oca/me.m06.d09:meMA.Ode6C13.mode	@ltx/en_us_oca/miscellanea:misc.Mode4
ltx/en_us_oca/me.m06.d09:meMA.Ode6C13.ode	@ltx/en_us_oca/miscellanea:misc.Ode6
ltx/en_us_oca/me.m06.d09:meMA.Ode6C13.text	
ltx/en_us_oca/me.m06.d09:meMA.Ode6C1T.incipit	…
ltx/en_us_oca/me.m06.d09:meMA.Ode6C1T.melody	@ltx/en_us_oca/he.h.m4:heHE.ThysoSoiMetaFonis.notmetered
ltx/en_us_oca/me.m06.d09:meMA.Ode6C1T.mode	@ltx/en_us_oca/miscellanea:misc.Mode4
ltx/en_us_oca/me.m06.d09:meMA.Ode6C1T.ode	@ltx/en_us_oca/miscellanea:misc.Ode6
ltx/en_us_oca/me.m06.d09:meMA.Ode6C1T.text	
ltx/en_us_oca/me.m06.d09:meMA.Ode6H.greekmelody	@ltx/en_us_oca/he.h.m4:heHE.ThysoSoiMetaFonis.greekname
ltx/en_us_oca/me.m06.d09:meMA.Ode6H.incipit	@ltx/en_us_oca/he.h.m4:heHE.ThysoSoiMetaFonis.incipit
ltx/en_us_oca/me.m06.d09:meMA.Ode6H.melody	@ltx/en_us_oca/he.h.m4:heHE.ThysoSoiMetaFonis.melody
ltx/en_us_oca/me.m06.d09:meMA.Ode6H.mode	@ltx/en_us_oca/miscellanea:misc.Mode4
ltx/en_us_oca/me.m06.d09:meMA.Ode6H.ode	@ltx/en_us_oca/miscellanea:misc.Ode6
ltx/en_us_oca/me.m06.d09:meMA.Ode6H.text	@ltx/en_us_oca/he.h.m4:heHE.ThysoSoiMetaFonis.text
ltx/en_us_oca/me.m06.d09:meMA.Ode7C11.greekmelody	@ltx/en_us_oca/he.h.m4:heHE.EnTiKaminoAvramiaioi.greekname
ltx/en_us_oca/me.m06.d09:meMA.Ode7C11.incipit	…
ltx/en_us_oca/me.m06.d09:meMA.Ode7C11.melody	@ltx/en_us_oca/he.h.m4:heHE.EnTiKaminoAvramiaioi.notmetered
ltx/en_us_oca/me.m06.d09:meMA.Ode7C11.mode	@ltx/en_us_oca/miscellanea:misc.Mode4
ltx/en_us_oca/me.m06.d09:meMA.Ode7C11.ode	@ltx/en_us_oca/miscellanea:misc.Ode7
ltx/en_us_oca/me.m06.d09:meMA.Ode7C11.text	
ltx/en_us_oca/me.m06.d09:meMA.Ode7C12.incipit	…
ltx/en_us_oca/me.m06.d09:meMA.Ode7C12.melody	@ltx/en_us_oca/he.h.m4:heHE.EnTiKaminoAvramiaioi.notmetered
ltx/en_us_oca/me.m06.d09:meMA.Ode7C12.mode	@ltx/en_us_oca/miscellanea:misc.Mode4
ltx/en_us_oca/me.m06.d09:meMA.Ode7C12.ode	@ltx/en_us_oca/miscellanea:misc.Ode7
ltx/en_us_oca/me.m06.d09:meMA.Ode7C12.text	
ltx/en_us_oca/me.m06.d09:meMA.Ode7C13.incipit	…
ltx/en_us_oca/me.m06.d09:meMA.Ode7C13.melody	@ltx/en_us_oca/he.h.m4:heHE.EnTiKaminoAvramiaioi.notmetered
ltx/en_us_oca/me.m06.d09:meMA.Ode7C13.mode	@ltx/en_us_oca/miscellanea:misc.Mode4
ltx/en_us_oca/me.m06.d09:meMA.Ode7C13.ode	@ltx/en_us_oca/miscellanea:misc.Ode7
ltx/en_us_oca/me.m06.d09:meMA.Ode7C13.text	
ltx/en_us_oca/me.m06.d09:meMA.Ode7C14.incipit	…
ltx/en_us_oca/me.m06.d09:meMA.Ode7C14.melody	@ltx/en_us_oca/he.h.m4:heHE.EnTiKaminoAvramiaioi.notmetered
ltx/en_us_oca/me.m06.d09:meMA.Ode7C14.mode	@ltx/en_us_oca/miscellanea:misc.Mode4
ltx/en_us_oca/me.m06.d09:meMA.Ode7C14.ode	@ltx/en_us_oca/miscellanea:misc.Ode7
ltx/en_us_oca/me.m06.d09:meMA.Ode7C14.text	
ltx/en_us_oca/me.m06.d09:meMA.Ode7C1T.incipit	…
ltx/en_us_oca/me.m06.d09:meMA.Ode7C1T.melody	@ltx/en_us_oca/he.h.m4:heHE.EnTiKaminoAvramiaioi.notmetered
ltx/en_us_oca/me.m06.d09:meMA.Ode7C1T.mode	@ltx/en_us_oca/miscellanea:misc.Mode4
ltx/en_us_oca/me.m06.d09:meMA.Ode7C1T.ode	@ltx/en_us_oca/miscellanea:misc.Ode7
ltx/en_us_oca/me.m06.d09:meMA.Ode7C1T.text	
ltx/en_us_oca/me.m06.d09:meMA.Ode8C11.greekmelody	@ltx/en_us_oca/he.h.m4:heHE.CheirasEkpetasasDaniil.greekname
ltx/en_us_oca/me.m06.d09:meMA.Ode8C11.incipit	…
ltx/en_us_oca/me.m06.d09:meMA.Ode8C11.melody	@ltx/en_us_oca/he.h.m4:heHE.CheirasEkpetasasDaniil.notmetered
ltx/en_us_oca/me.m06.d09:meMA.Ode8C11.mode	@ltx/en_us_oca/miscellanea:misc.Mode4
ltx/en_us_oca/me.m06.d09:meMA.Ode8C11.ode	@ltx/en_us_oca/miscellanea:misc.Ode8
ltx/en_us_oca/me.m06.d09:meMA.Ode8C11.text	
ltx/en_us_oca/me.m06.d09:meMA.Ode8C12.incipit	…
ltx/en_us_oca/me.m06.d09:meMA.Ode8C12.melody	@ltx/en_us_oca/he.h.m4:heHE.CheirasEkpetasasDaniil.notmetered
ltx/en_us_oca/me.m06.d09:meMA.Ode8C12.mode	@ltx/en_us_oca/miscellanea:misc.Mode4
ltx/en_us_oca/me.m06.d09:meMA.Ode8C12.ode	@ltx/en_us_oca/miscellanea:misc.Ode8
ltx/en_us_oca/me.m06.d09:meMA.Ode8C12.text	
ltx/en_us_oca/me.m06.d09:meMA.Ode8C13.incipit	…
ltx/en_us_oca/me.m06.d09:meMA.Ode8C13.melody	@ltx/en_us_oca/he.h.m4:heHE.CheirasEkpetasasDaniil.notmetered
ltx/en_us_oca/me.m06.d09:meMA.Ode8C13.mode	@ltx/en_us_oca/miscellanea:misc.Mode4
ltx/en_us_oca/me.m06.d09:meMA.Ode8C13.ode	@ltx/en_us_oca/miscellanea:misc.Ode8
ltx/en_us_oca/me.m06.d09:meMA.Ode8C13.text	
ltx/en_us_oca/me.m06.d09:meMA.Ode8C1T.incipit	…
ltx/en_us_oca/me.m06.d09:meMA.Ode8C1T.melody	@ltx/en_us_oca/he.h.m4:heHE.CheirasEkpetasasDaniil.notmetered
ltx/en_us_oca/me.m06.d09:meMA.Ode8C1T.mode	@ltx/en_us_oca/miscellanea:misc.Mode4
ltx/en_us_oca/me.m06.d09:meMA.Ode8C1T.ode	@ltx/en_us_oca/miscellanea:misc.Ode8
ltx/en_us_oca/me.m06.d09:meMA.Ode8C1T.text	
ltx/en_us_oca/me.m06.d09:meMA.Ode8H.greekmelody	@ltx/en_us_oca/he.h.m4:heHE.CheirasEkpetasasDaniil.greekname
ltx/en_us_oca/me.m06.d09:meMA.Ode8H.incipit	@ltx/en_us_oca/he.h.m4:heHE.CheirasEkpetasasDaniil.incipit
ltx/en_us_oca/me.m06.d09:meMA.Ode8H.melody	@ltx/en_us_oca/he.h.m4:heHE.CheirasEkpetasasDaniil.melody
ltx/en_us_oca/me.m06.d09:meMA.Ode8H.mode	@ltx/en_us_oca/miscellanea:misc.Mode4
ltx/en_us_oca/me.m06.d09:meMA.Ode8H.ode	@ltx/en_us_oca/miscellanea:misc.Ode8
ltx/en_us_oca/me.m06.d09:meMA.Ode8H.text	@ltx/en_us_oca/he.h.m4:heHE.CheirasEkpetasasDaniil.text
ltx/en_us_oca/me.m06.d09:meMA.Ode9C11.greekmelody	@ltx/en_us_oca/he.h.m4:heHE.EvaMenToTisParakois.greekname
ltx/en_us_oca/me.m06.d09:meMA.Ode9C11.incipit	…
ltx/en_us_oca/me.m06.d09:meMA.Ode9C11.melody	@ltx/en_us_oca/he.h.m4:heHE.EvaMenToTisParakois.notmetered
ltx/en_us_oca/me.m06.d09:meMA.Ode9C11.mode	@ltx/en_us_oca/miscellanea:misc.Mode4
ltx/en_us_oca/me.m06.d09:meMA.Ode9C11.ode	@ltx/en_us_oca/miscellanea:misc.Ode9
ltx/en_us_oca/me.m06.d09:meMA.Ode9C11.text	
ltx/en_us_oca/me.m06.d09:meMA.Ode9C12.incipit	…
ltx/en_us_oca/me.m06.d09:meMA.Ode9C12.melody	@ltx/en_us_oca/he.h.m4:heHE.EvaMenToTisParakois.notmetered
ltx/en_us_oca/me.m06.d09:meMA.Ode9C12.mode	@ltx/en_us_oca/miscellanea:misc.Mode4
ltx/en_us_oca/me.m06.d09:meMA.Ode9C12.ode	@ltx/en_us_oca/miscellanea:misc.Ode9
ltx/en_us_oca/me.m06.d09:meMA.Ode9C12.text	
ltx/en_us_oca/me.m06.d09:meMA.Ode9C13.incipit	…
ltx/en_us_oca/me.m06.d09:meMA.Ode9C13.melody	@ltx/en_us_oca/he.h.m4:heHE.EvaMenToTisParakois.notmetered
ltx/en_us_oca/me.m06.d09:meMA.Ode9C13.mode	@ltx/en_us_oca/miscellanea:misc.Mode4
ltx/en_us_oca/me.m06.d09:meMA.Ode9C13.ode	@ltx/en_us_oca/miscellanea:misc.Ode9
ltx/en_us_oca/me.m06.d09:meMA.Ode9C13.text	
ltx/en_us_oca/me.m06.d09:meMA.Ode9C1T.incipit	…
ltx/en_us_oca/me.m06.d09:meMA.Ode9C1T.melody	@ltx/en_us_oca/he.h.m4:heHE.EvaMenToTisParakois.notmetered
ltx/en_us_oca/me.m06.d09:meMA.Ode9C1T.mode	@ltx/en_us_oca/miscellanea:misc.Mode4
ltx/en_us_oca/me.m06.d09:meMA.Ode9C1T.ode	@ltx/en_us_oca/miscellanea:misc.Ode9
ltx/en_us_oca/me.m06.d09:meMA.Ode9C1T.text	
ltx/en_us_oca/me.m06.d09:meMA.Ode9H.greekmelody	@ltx/en_us_oca/he.h.m4:heHE.EvaMenToTisParakois.greekname
ltx/en_us_oca/me.m06.d09:meMA.Ode9H.incipit	@ltx/en_us_oca/he.h.m4:heHE.EvaMenToTisParakois.incipit
ltx/en_us_oca/me.m06.d09:meMA.Ode9H.melody	@ltx/en_us_oca/he.h.m4:heHE.EvaMenToTisParakois.melody
ltx/en_us_oca/me.m06.d09:meMA.Ode9H.mode	@ltx/en_us_oca/miscellanea:misc.Mode4
ltx/en_us_oca/me.m06.d09:meMA.Ode9H.ode	@ltx/en_us_oca/miscellanea:misc.Ode9
ltx/en_us_oca/me.m06.d09:meMA.Ode9H.text	@ltx/en_us_oca/he.h.m4:heHE.EvaMenToTisParakois.text
ltx/en_us_oca/me.m06.d09:meVE.Apolytikion1.melody	@ltx/en_us_oca/he.ga:heGA.OrthodoxiasOdigeH.name
ltx/en_us_oca/me.m06.d09:meVE.Apolytikion1.mode	@ltx/en_us_oca/miscellanea:misc.Mode8
ltx/en_us_oca/me.m06.d09:meVE.GeneralApolytikion1.name	
ltx/en_us_oca/me.m06.d09:meVE.SticStavrotheotokion.greekmelody	@ltx/en_us_oca/he.a.m4:heAU.OsGennaionEnMartysi.greekname
ltx/en_us_oca/me.m06.d09:meVE.SticStavrotheotokion.incipit	@ltx/en_us_oca/me.m02.d11:meVE.AposStavrotheotokion.incipit
ltx/en_us_oca/me.m06.d09:meVE.SticStavrotheotokion.melody	@ltx/en_us_oca/he.a.m4:heAU.OsGennaionEnMartysi.notmetered
ltx/en_us_oca/me.m06.d09:meVE.SticStavrotheotokion.mode	@ltx/en_us_oca/miscellanea:misc.Mode4
ltx/en_us_oca/me.m06.d09:meVE.SticStavrotheotokion.text	@ltx/en_us_oca/me.m02.d11:meVE.AposStavrotheotokion.text
ltx/en_us_oca/me.m06.d09:meVE.SticTheotokion.greekmelody	@ltx/en_us_oca/he.a.m4:heAU.OsGennaionEnMartysi.greekname
ltx/en_us_oca/me.m06.d09:meVE.SticTheotokion.incipit	…
ltx/en_us_oca/me.m06.d09:meVE.SticTheotokion.melody	@ltx/en_us_oca/he.a.m4:heAU.OsGennaionEnMartysi.notmetered
ltx/en_us_oca/me.m06.d09:meVE.SticTheotokion.mode	@ltx/en_us_oca/miscellanea:misc.Mode4
ltx/en_us_oca/me.m06.d09:meVE.SticTheotokion.text	
ltx/en_us_oca/me.m06.d09:meVE.Stichera01.greekmelody	@ltx/en_us_oca/he.a.m4:heAU.OsGennaionEnMartysi.greekname
ltx/en_us_oca/me.m06.d09:meVE.Stichera01.incipit	You enlightened your mind with…
ltx/en_us_oca/me.m06.d09:meVE.Stichera01.melody	@ltx/en_us_oca/he.a.m4:heAU.OsGennaionEnMartysi.notmetered
ltx/en_us_oca/me.m06.d09:meVE.Stichera01.mode	@ltx/en_us_oca/miscellanea:misc.Mode4
ltx/en_us_oca/me.m06.d09:meVE.Stichera01.text	You enlightened your mind with the radiance of the Spirit, ⁄ becoming a shining sun! ⁄ You extended the rays of your teachings to the ends of the earth, ⁄ enlightening the fullness of the faithful, ⁄ driving away the darkness of heresies, all-blest Godbearer, ⁄⁄ with the power of Him Who shone forth from the Virgin!
ltx/en_us_oca/me.m06.d09:meVE.Stichera02.incipit	The whole Church is adorned…
ltx/en_us_oca/me.m06.d09:meVE.Stichera02.melody	@ltx/en_us_oca/he.a.m4:heAU.OsGennaionEnMartysi.notmetered
ltx/en_us_oca/me.m06.d09:meVE.Stichera02.mode	@ltx/en_us_oca/miscellanea:misc.Mode4
ltx/en_us_oca/me.m06.d09:meVE.Stichera02.text	The whole Church is adorned, holy Cyril, ⁄ with the good words of your preaching, ⁄ and arrayed with devotion in fitting beauty. ⁄ She honors your holy and venerable memory in a holy manner, ⁄ boast of the Orthodox, height of the fathers, ⁄⁄ champion of the most holy Virgin at the council!
ltx/en_us_oca/me.m06.d09:meVE.Stichera03.incipit	All the tinder of heresies…
ltx/en_us_oca/me.m06.d09:meVE.Stichera03.melody	@ltx/en_us_oca/he.a.m4:heAU.OsGennaionEnMartysi.notmetered
ltx/en_us_oca/me.m06.d09:meVE.Stichera03.mode	@ltx/en_us_oca/miscellanea:misc.Mode4
ltx/en_us_oca/me.m06.d09:meVE.Stichera03.text	All the tinder of heresies ⁄ is burned with your fiery teachings, all-wise one! ⁄ The army of the impious who would not submit to the truth ⁄ is drowned in the depths of your understanding, holy Cyril! ⁄ The Church of the faithful is ever adorned with your doctrines, ⁄⁄ honoring you with mighty voices!
