ltx/en_us_oca/me.m05.d14:meDA.commemoration.first	
ltx/en_us_oca/me.m05.d14:meDA.commemoration.first_name	
ltx/en_us_oca/me.m05.d14:meDA.commemoration.first_short	
ltx/en_us_oca/me.m05.d14:meDA.commemoration.first_title	
ltx/en_us_oca/me.m05.d14:meDA.commemoration.full	
ltx/en_us_oca/me.m05.d14:meDA.commemoration.second_name	
ltx/en_us_oca/me.m05.d14:meDA.commemoration.second_title	
ltx/en_us_oca/me.m05.d14:meDA.date	
ltx/en_us_oca/me.m05.d14:meDA.fordate	
ltx/en_us_oca/me.m05.d14:meDA.insert1	
ltx/en_us_oca/me.m05.d14:meDA.insert2	
ltx/en_us_oca/me.m05.d14:meDA.note	
ltx/en_us_oca/me.m05.d14:meDA.pdfcoverdate	
ltx/en_us_oca/me.m05.d14:meDA.pdfheaderdate	
ltx/en_us_oca/me.m05.d14:meHO.commemorations	
ltx/en_us_oca/me.m05.d14:meHO.note1	
ltx/en_us_oca/me.m05.d14:meHO.note2	
ltx/en_us_oca/me.m05.d14:meHO.number	
ltx/en_us_oca/me.m05.d14:meHO.rank	
ltx/en_us_oca/me.m05.d14:meLE.commemoration1	
ltx/en_us_oca/me.m05.d14:meLE.commemoration2	
ltx/en_us_oca/me.m05.d14:meLI.Kontakion1.greekmelody	@ltx/en_us_oca/me.m05.d14:meMA.Kontakion1.greekmelody
ltx/en_us_oca/me.m05.d14:meLI.Kontakion1.incipit	@ltx/en_us_oca/me.m05.d14:meMA.Kontakion1.incipit
ltx/en_us_oca/me.m05.d14:meLI.Kontakion1.melody	@ltx/en_us_oca/me.m05.d14:meMA.Kontakion1.melody
ltx/en_us_oca/me.m05.d14:meLI.Kontakion1.mode	@ltx/en_us_oca/me.m05.d14:meMA.Kontakion1.mode
ltx/en_us_oca/me.m05.d14:meLI.Kontakion1.text	@ltx/en_us_oca/me.m05.d14:meMA.Kontakion1.text
ltx/en_us_oca/me.m05.d14:meLI.MM.CommunionHymn.text	@ltx/en_us_oca/properties:media.key
ltx/en_us_oca/me.m05.d14:meLI.Megalynarion.text	
ltx/en_us_oca/me.m05.d14:meMA.C1.acrostic.notice1	
ltx/en_us_oca/me.m05.d14:meMA.C1.acrostic.text	
ltx/en_us_oca/me.m05.d14:meMA.C1.acrostic.title	
ltx/en_us_oca/me.m05.d14:meMA.C1.poet	@ltx/en_us_oca/poets:po.Theofanous
ltx/en_us_oca/me.m05.d14:meMA.C1.title	@ltx/en_us_oca/titles:ti.CanonSaintM
ltx/en_us_oca/me.m05.d14:meMA.C1.verse	@ltx/en_us_oca/prayers:pr.verse_SaintM.text
ltx/en_us_oca/me.m05.d14:meMA.Kontakion1.greekmelody	@ltx/en_us_oca/he.a.m4:heAU.EpefanisSimeron.greekname
ltx/en_us_oca/me.m05.d14:meMA.Kontakion1.incipit	In your supplications to God…
ltx/en_us_oca/me.m05.d14:meMA.Kontakion1.melody	@ltx/en_us_oca/he.a.m4:heAU.EpefanisSimeron.notmetered
ltx/en_us_oca/me.m05.d14:meMA.Kontakion1.mode	@ltx/en_us_oca/miscellanea:misc.Mode4
ltx/en_us_oca/me.m05.d14:meMA.Kontakion1.text	In your supplications to God, holy one, ⁄ you were shown to be an outstanding guide for the whole world! ⁄⁄ Therefore we sing hymns to you today, divinely-wise and all-glorious martyr Isidore!
ltx/en_us_oca/me.m05.d14:meMA.Ode1C11.greekmelody	@ltx/en_us_oca/he.h.m8:heHE.YgranDiodefsas.greekname
ltx/en_us_oca/me.m05.d14:meMA.Ode1C11.incipit	…
ltx/en_us_oca/me.m05.d14:meMA.Ode1C11.melody	@ltx/en_us_oca/he.h.m8:heHE.YgranDiodefsas.notmetered
ltx/en_us_oca/me.m05.d14:meMA.Ode1C11.mode	@ltx/en_us_oca/miscellanea:misc.Mode8
ltx/en_us_oca/me.m05.d14:meMA.Ode1C11.ode	@ltx/en_us_oca/miscellanea:misc.Ode1
ltx/en_us_oca/me.m05.d14:meMA.Ode1C11.text	
ltx/en_us_oca/me.m05.d14:meMA.Ode1C12.incipit	…
ltx/en_us_oca/me.m05.d14:meMA.Ode1C12.melody	@ltx/en_us_oca/he.h.m8:heHE.YgranDiodefsas.notmetered
ltx/en_us_oca/me.m05.d14:meMA.Ode1C12.mode	@ltx/en_us_oca/miscellanea:misc.Mode8
ltx/en_us_oca/me.m05.d14:meMA.Ode1C12.ode	@ltx/en_us_oca/miscellanea:misc.Ode1
ltx/en_us_oca/me.m05.d14:meMA.Ode1C12.text	
ltx/en_us_oca/me.m05.d14:meMA.Ode1C13.incipit	…
ltx/en_us_oca/me.m05.d14:meMA.Ode1C13.melody	@ltx/en_us_oca/he.h.m8:heHE.YgranDiodefsas.notmetered
ltx/en_us_oca/me.m05.d14:meMA.Ode1C13.mode	@ltx/en_us_oca/miscellanea:misc.Mode8
ltx/en_us_oca/me.m05.d14:meMA.Ode1C13.ode	@ltx/en_us_oca/miscellanea:misc.Ode1
ltx/en_us_oca/me.m05.d14:meMA.Ode1C13.text	
ltx/en_us_oca/me.m05.d14:meMA.Ode1C1T.incipit	…
ltx/en_us_oca/me.m05.d14:meMA.Ode1C1T.melody	@ltx/en_us_oca/he.h.m8:heHE.YgranDiodefsas.notmetered
ltx/en_us_oca/me.m05.d14:meMA.Ode1C1T.mode	@ltx/en_us_oca/miscellanea:misc.Mode8
ltx/en_us_oca/me.m05.d14:meMA.Ode1C1T.ode	@ltx/en_us_oca/miscellanea:misc.Ode1
ltx/en_us_oca/me.m05.d14:meMA.Ode1C1T.text	
ltx/en_us_oca/me.m05.d14:meMA.Ode3C11.greekmelody	@ltx/en_us_oca/he.h.m8:heHE.SyEiToStereoma.greekname
ltx/en_us_oca/me.m05.d14:meMA.Ode3C11.incipit	…
ltx/en_us_oca/me.m05.d14:meMA.Ode3C11.melody	@ltx/en_us_oca/he.h.m8:heHE.SyEiToStereoma.notmetered
ltx/en_us_oca/me.m05.d14:meMA.Ode3C11.mode	@ltx/en_us_oca/miscellanea:misc.Mode8
ltx/en_us_oca/me.m05.d14:meMA.Ode3C11.ode	@ltx/en_us_oca/miscellanea:misc.Ode3
ltx/en_us_oca/me.m05.d14:meMA.Ode3C11.text	
ltx/en_us_oca/me.m05.d14:meMA.Ode3C12.incipit	…
ltx/en_us_oca/me.m05.d14:meMA.Ode3C12.melody	@ltx/en_us_oca/he.h.m8:heHE.SyEiToStereoma.notmetered
ltx/en_us_oca/me.m05.d14:meMA.Ode3C12.mode	@ltx/en_us_oca/miscellanea:misc.Mode8
ltx/en_us_oca/me.m05.d14:meMA.Ode3C12.ode	@ltx/en_us_oca/miscellanea:misc.Ode3
ltx/en_us_oca/me.m05.d14:meMA.Ode3C12.text	
ltx/en_us_oca/me.m05.d14:meMA.Ode3C13.incipit	…
ltx/en_us_oca/me.m05.d14:meMA.Ode3C13.melody	@ltx/en_us_oca/he.h.m8:heHE.SyEiToStereoma.notmetered
ltx/en_us_oca/me.m05.d14:meMA.Ode3C13.mode	@ltx/en_us_oca/miscellanea:misc.Mode8
ltx/en_us_oca/me.m05.d14:meMA.Ode3C13.ode	@ltx/en_us_oca/miscellanea:misc.Ode3
ltx/en_us_oca/me.m05.d14:meMA.Ode3C13.text	
ltx/en_us_oca/me.m05.d14:meMA.Ode3C1T.incipit	…
ltx/en_us_oca/me.m05.d14:meMA.Ode3C1T.melody	@ltx/en_us_oca/he.h.m8:heHE.SyEiToStereoma.notmetered
ltx/en_us_oca/me.m05.d14:meMA.Ode3C1T.mode	@ltx/en_us_oca/miscellanea:misc.Mode8
ltx/en_us_oca/me.m05.d14:meMA.Ode3C1T.ode	@ltx/en_us_oca/miscellanea:misc.Ode3
ltx/en_us_oca/me.m05.d14:meMA.Ode3C1T.text	
ltx/en_us_oca/me.m05.d14:meMA.Ode3H.greekmelody	@ltx/en_us_oca/he.h.m8:heHE.SyEiToStereoma.greekname
ltx/en_us_oca/me.m05.d14:meMA.Ode3H.incipit	@ltx/en_us_oca/he.h.m8:heHE.SyEiToStereoma.incipit
ltx/en_us_oca/me.m05.d14:meMA.Ode3H.melody	@ltx/en_us_oca/he.h.m8:heHE.SyEiToStereoma.melody
ltx/en_us_oca/me.m05.d14:meMA.Ode3H.mode	@ltx/en_us_oca/miscellanea:misc.Mode8
ltx/en_us_oca/me.m05.d14:meMA.Ode3H.ode	@ltx/en_us_oca/miscellanea:misc.Ode3
ltx/en_us_oca/me.m05.d14:meMA.Ode3H.text	@ltx/en_us_oca/he.h.m8:heHE.SyEiToStereoma.text
ltx/en_us_oca/me.m05.d14:meMA.Ode3Kathisma1.greekmelody	@ltx/en_us_oca/he.a.m3:heAU.TinOraiotita.greekname
ltx/en_us_oca/me.m05.d14:meMA.Ode3Kathisma1.incipit	…
ltx/en_us_oca/me.m05.d14:meMA.Ode3Kathisma1.melody	@ltx/en_us_oca/he.a.m3:heAU.TinOraiotita.notmetered
ltx/en_us_oca/me.m05.d14:meMA.Ode3Kathisma1.mode	@ltx/en_us_oca/miscellanea:misc.Mode3
ltx/en_us_oca/me.m05.d14:meMA.Ode3Kathisma1.text	
ltx/en_us_oca/me.m05.d14:meMA.Ode4C11.greekmelody	@ltx/en_us_oca/he.h.m8:heHE.SyMouIschys.greekname
ltx/en_us_oca/me.m05.d14:meMA.Ode4C11.incipit	…
ltx/en_us_oca/me.m05.d14:meMA.Ode4C11.melody	@ltx/en_us_oca/he.h.m8:heHE.SyMouIschys.notmetered
ltx/en_us_oca/me.m05.d14:meMA.Ode4C11.mode	@ltx/en_us_oca/miscellanea:misc.Mode8
ltx/en_us_oca/me.m05.d14:meMA.Ode4C11.ode	@ltx/en_us_oca/miscellanea:misc.Ode4
ltx/en_us_oca/me.m05.d14:meMA.Ode4C11.text	
ltx/en_us_oca/me.m05.d14:meMA.Ode4C12.incipit	…
ltx/en_us_oca/me.m05.d14:meMA.Ode4C12.melody	@ltx/en_us_oca/he.h.m8:heHE.SyMouIschys.notmetered
ltx/en_us_oca/me.m05.d14:meMA.Ode4C12.mode	@ltx/en_us_oca/miscellanea:misc.Mode8
ltx/en_us_oca/me.m05.d14:meMA.Ode4C12.ode	@ltx/en_us_oca/miscellanea:misc.Ode4
ltx/en_us_oca/me.m05.d14:meMA.Ode4C12.text	
ltx/en_us_oca/me.m05.d14:meMA.Ode4C13.incipit	…
ltx/en_us_oca/me.m05.d14:meMA.Ode4C13.melody	@ltx/en_us_oca/he.h.m8:heHE.SyMouIschys.notmetered
ltx/en_us_oca/me.m05.d14:meMA.Ode4C13.mode	@ltx/en_us_oca/miscellanea:misc.Mode8
ltx/en_us_oca/me.m05.d14:meMA.Ode4C13.ode	@ltx/en_us_oca/miscellanea:misc.Ode4
ltx/en_us_oca/me.m05.d14:meMA.Ode4C13.text	
ltx/en_us_oca/me.m05.d14:meMA.Ode4C1T.incipit	…
ltx/en_us_oca/me.m05.d14:meMA.Ode4C1T.melody	@ltx/en_us_oca/he.h.m8:heHE.SyMouIschys.notmetered
ltx/en_us_oca/me.m05.d14:meMA.Ode4C1T.mode	@ltx/en_us_oca/miscellanea:misc.Mode8
ltx/en_us_oca/me.m05.d14:meMA.Ode4C1T.ode	@ltx/en_us_oca/miscellanea:misc.Ode4
ltx/en_us_oca/me.m05.d14:meMA.Ode4C1T.text	
ltx/en_us_oca/me.m05.d14:meMA.Ode5C11.greekmelody	@ltx/en_us_oca/he.h.m8:heHE.InaTiMeAposo.greekname
ltx/en_us_oca/me.m05.d14:meMA.Ode5C11.incipit	…
ltx/en_us_oca/me.m05.d14:meMA.Ode5C11.melody	@ltx/en_us_oca/he.h.m8:heHE.InaTiMeAposo.notmetered
ltx/en_us_oca/me.m05.d14:meMA.Ode5C11.mode	@ltx/en_us_oca/miscellanea:misc.Mode8
ltx/en_us_oca/me.m05.d14:meMA.Ode5C11.ode	@ltx/en_us_oca/miscellanea:misc.Ode5
ltx/en_us_oca/me.m05.d14:meMA.Ode5C11.text	
ltx/en_us_oca/me.m05.d14:meMA.Ode5C12.incipit	…
ltx/en_us_oca/me.m05.d14:meMA.Ode5C12.melody	@ltx/en_us_oca/he.h.m8:heHE.InaTiMeAposo.notmetered
ltx/en_us_oca/me.m05.d14:meMA.Ode5C12.mode	@ltx/en_us_oca/miscellanea:misc.Mode8
ltx/en_us_oca/me.m05.d14:meMA.Ode5C12.ode	@ltx/en_us_oca/miscellanea:misc.Ode5
ltx/en_us_oca/me.m05.d14:meMA.Ode5C12.text	
ltx/en_us_oca/me.m05.d14:meMA.Ode5C13.incipit	…
ltx/en_us_oca/me.m05.d14:meMA.Ode5C13.melody	@ltx/en_us_oca/he.h.m8:heHE.InaTiMeAposo.notmetered
ltx/en_us_oca/me.m05.d14:meMA.Ode5C13.mode	@ltx/en_us_oca/miscellanea:misc.Mode8
ltx/en_us_oca/me.m05.d14:meMA.Ode5C13.ode	@ltx/en_us_oca/miscellanea:misc.Ode5
ltx/en_us_oca/me.m05.d14:meMA.Ode5C13.text	
ltx/en_us_oca/me.m05.d14:meMA.Ode5C1T.incipit	…
ltx/en_us_oca/me.m05.d14:meMA.Ode5C1T.melody	@ltx/en_us_oca/he.h.m8:heHE.InaTiMeAposo.notmetered
ltx/en_us_oca/me.m05.d14:meMA.Ode5C1T.mode	@ltx/en_us_oca/miscellanea:misc.Mode8
ltx/en_us_oca/me.m05.d14:meMA.Ode5C1T.ode	@ltx/en_us_oca/miscellanea:misc.Ode5
ltx/en_us_oca/me.m05.d14:meMA.Ode5C1T.text	
ltx/en_us_oca/me.m05.d14:meMA.Ode6C11.greekmelody	@ltx/en_us_oca/he.h.m8:heHE.TinDeisinEkcheo.greekname
ltx/en_us_oca/me.m05.d14:meMA.Ode6C11.incipit	…
ltx/en_us_oca/me.m05.d14:meMA.Ode6C11.melody	@ltx/en_us_oca/he.h.m8:heHE.TinDeisinEkcheo.notmetered
ltx/en_us_oca/me.m05.d14:meMA.Ode6C11.mode	@ltx/en_us_oca/miscellanea:misc.Mode8
ltx/en_us_oca/me.m05.d14:meMA.Ode6C11.ode	@ltx/en_us_oca/miscellanea:misc.Ode6
ltx/en_us_oca/me.m05.d14:meMA.Ode6C11.text	
ltx/en_us_oca/me.m05.d14:meMA.Ode6C12.incipit	…
ltx/en_us_oca/me.m05.d14:meMA.Ode6C12.melody	@ltx/en_us_oca/he.h.m8:heHE.TinDeisinEkcheo.notmetered
ltx/en_us_oca/me.m05.d14:meMA.Ode6C12.mode	@ltx/en_us_oca/miscellanea:misc.Mode8
ltx/en_us_oca/me.m05.d14:meMA.Ode6C12.ode	@ltx/en_us_oca/miscellanea:misc.Ode6
ltx/en_us_oca/me.m05.d14:meMA.Ode6C12.text	
ltx/en_us_oca/me.m05.d14:meMA.Ode6C13.incipit	…
ltx/en_us_oca/me.m05.d14:meMA.Ode6C13.melody	@ltx/en_us_oca/he.h.m8:heHE.TinDeisinEkcheo.notmetered
ltx/en_us_oca/me.m05.d14:meMA.Ode6C13.mode	@ltx/en_us_oca/miscellanea:misc.Mode8
ltx/en_us_oca/me.m05.d14:meMA.Ode6C13.ode	@ltx/en_us_oca/miscellanea:misc.Ode6
ltx/en_us_oca/me.m05.d14:meMA.Ode6C13.text	
ltx/en_us_oca/me.m05.d14:meMA.Ode6C1T.incipit	…
ltx/en_us_oca/me.m05.d14:meMA.Ode6C1T.melody	@ltx/en_us_oca/he.h.m8:heHE.TinDeisinEkcheo.notmetered
ltx/en_us_oca/me.m05.d14:meMA.Ode6C1T.mode	@ltx/en_us_oca/miscellanea:misc.Mode8
ltx/en_us_oca/me.m05.d14:meMA.Ode6C1T.ode	@ltx/en_us_oca/miscellanea:misc.Ode6
ltx/en_us_oca/me.m05.d14:meMA.Ode6C1T.text	
ltx/en_us_oca/me.m05.d14:meMA.Ode6H.greekmelody	@ltx/en_us_oca/he.h.m8:heHE.TinDeisinEkcheo.greekname
ltx/en_us_oca/me.m05.d14:meMA.Ode6H.incipit	@ltx/en_us_oca/he.h.m8:heHE.TinDeisinEkcheo.incipit
ltx/en_us_oca/me.m05.d14:meMA.Ode6H.melody	@ltx/en_us_oca/he.h.m8:heHE.TinDeisinEkcheo.melody
ltx/en_us_oca/me.m05.d14:meMA.Ode6H.mode	@ltx/en_us_oca/miscellanea:misc.Mode8
ltx/en_us_oca/me.m05.d14:meMA.Ode6H.ode	@ltx/en_us_oca/miscellanea:misc.Ode6
ltx/en_us_oca/me.m05.d14:meMA.Ode6H.text	@ltx/en_us_oca/he.h.m8:heHE.TinDeisinEkcheo.text
ltx/en_us_oca/me.m05.d14:meMA.Ode7C11.greekmelody	@ltx/en_us_oca/he.h.m8:heHE.PaidesEvraion.greekname
ltx/en_us_oca/me.m05.d14:meMA.Ode7C11.incipit	…
ltx/en_us_oca/me.m05.d14:meMA.Ode7C11.melody	@ltx/en_us_oca/he.h.m8:heHE.PaidesEvraion.notmetered
ltx/en_us_oca/me.m05.d14:meMA.Ode7C11.mode	@ltx/en_us_oca/miscellanea:misc.Mode8
ltx/en_us_oca/me.m05.d14:meMA.Ode7C11.ode	@ltx/en_us_oca/miscellanea:misc.Ode7
ltx/en_us_oca/me.m05.d14:meMA.Ode7C11.text	
ltx/en_us_oca/me.m05.d14:meMA.Ode7C12.incipit	…
ltx/en_us_oca/me.m05.d14:meMA.Ode7C12.melody	@ltx/en_us_oca/he.h.m8:heHE.PaidesEvraion.notmetered
ltx/en_us_oca/me.m05.d14:meMA.Ode7C12.mode	@ltx/en_us_oca/miscellanea:misc.Mode8
ltx/en_us_oca/me.m05.d14:meMA.Ode7C12.ode	@ltx/en_us_oca/miscellanea:misc.Ode7
ltx/en_us_oca/me.m05.d14:meMA.Ode7C12.text	
ltx/en_us_oca/me.m05.d14:meMA.Ode7C1T.incipit	…
ltx/en_us_oca/me.m05.d14:meMA.Ode7C1T.melody	@ltx/en_us_oca/he.h.m8:heHE.PaidesEvraion.notmetered
ltx/en_us_oca/me.m05.d14:meMA.Ode7C1T.mode	@ltx/en_us_oca/miscellanea:misc.Mode8
ltx/en_us_oca/me.m05.d14:meMA.Ode7C1T.ode	@ltx/en_us_oca/miscellanea:misc.Ode7
ltx/en_us_oca/me.m05.d14:meMA.Ode7C1T.text	
ltx/en_us_oca/me.m05.d14:meMA.Ode8C11.greekmelody	@ltx/en_us_oca/he.h.m8:heHE.EptaplasiosKaminon.greekname
ltx/en_us_oca/me.m05.d14:meMA.Ode8C11.incipit	…
ltx/en_us_oca/me.m05.d14:meMA.Ode8C11.melody	@ltx/en_us_oca/he.h.m8:heHE.EptaplasiosKaminon.notmetered
ltx/en_us_oca/me.m05.d14:meMA.Ode8C11.mode	@ltx/en_us_oca/miscellanea:misc.Mode8
ltx/en_us_oca/me.m05.d14:meMA.Ode8C11.ode	@ltx/en_us_oca/miscellanea:misc.Ode8
ltx/en_us_oca/me.m05.d14:meMA.Ode8C11.text	
ltx/en_us_oca/me.m05.d14:meMA.Ode8C12.incipit	…
ltx/en_us_oca/me.m05.d14:meMA.Ode8C12.melody	@ltx/en_us_oca/he.h.m8:heHE.EptaplasiosKaminon.notmetered
ltx/en_us_oca/me.m05.d14:meMA.Ode8C12.mode	@ltx/en_us_oca/miscellanea:misc.Mode8
ltx/en_us_oca/me.m05.d14:meMA.Ode8C12.ode	@ltx/en_us_oca/miscellanea:misc.Ode8
ltx/en_us_oca/me.m05.d14:meMA.Ode8C12.text	
ltx/en_us_oca/me.m05.d14:meMA.Ode8C13.incipit	…
ltx/en_us_oca/me.m05.d14:meMA.Ode8C13.melody	@ltx/en_us_oca/he.h.m8:heHE.EptaplasiosKaminon.notmetered
ltx/en_us_oca/me.m05.d14:meMA.Ode8C13.mode	@ltx/en_us_oca/miscellanea:misc.Mode8
ltx/en_us_oca/me.m05.d14:meMA.Ode8C13.ode	@ltx/en_us_oca/miscellanea:misc.Ode8
ltx/en_us_oca/me.m05.d14:meMA.Ode8C13.text	
ltx/en_us_oca/me.m05.d14:meMA.Ode8C1T.incipit	…
ltx/en_us_oca/me.m05.d14:meMA.Ode8C1T.melody	@ltx/en_us_oca/he.h.m8:heHE.EptaplasiosKaminon.notmetered
ltx/en_us_oca/me.m05.d14:meMA.Ode8C1T.mode	@ltx/en_us_oca/miscellanea:misc.Mode8
ltx/en_us_oca/me.m05.d14:meMA.Ode8C1T.ode	@ltx/en_us_oca/miscellanea:misc.Ode8
ltx/en_us_oca/me.m05.d14:meMA.Ode8C1T.text	
ltx/en_us_oca/me.m05.d14:meMA.Ode8H.greekmelody	@ltx/en_us_oca/he.h.m8:heHE.EptaplasiosKaminon.greekname
ltx/en_us_oca/me.m05.d14:meMA.Ode8H.incipit	@ltx/en_us_oca/he.h.m8:heHE.EptaplasiosKaminon.incipit
ltx/en_us_oca/me.m05.d14:meMA.Ode8H.melody	@ltx/en_us_oca/he.h.m8:heHE.EptaplasiosKaminon.melody
ltx/en_us_oca/me.m05.d14:meMA.Ode8H.mode	@ltx/en_us_oca/miscellanea:misc.Mode8
ltx/en_us_oca/me.m05.d14:meMA.Ode8H.ode	@ltx/en_us_oca/miscellanea:misc.Ode8
ltx/en_us_oca/me.m05.d14:meMA.Ode8H.text	@ltx/en_us_oca/he.h.m8:heHE.EptaplasiosKaminon.text
ltx/en_us_oca/me.m05.d14:meMA.Ode9C11.greekmelody	@ltx/en_us_oca/he.h.m8:heHE.ExestiEpiTouto.greekname
ltx/en_us_oca/me.m05.d14:meMA.Ode9C11.incipit	…
ltx/en_us_oca/me.m05.d14:meMA.Ode9C11.melody	@ltx/en_us_oca/he.h.m8:heHE.ExestiEpiTouto.notmetered
ltx/en_us_oca/me.m05.d14:meMA.Ode9C11.mode	@ltx/en_us_oca/miscellanea:misc.Mode8
ltx/en_us_oca/me.m05.d14:meMA.Ode9C11.ode	@ltx/en_us_oca/miscellanea:misc.Ode9
ltx/en_us_oca/me.m05.d14:meMA.Ode9C11.text	
ltx/en_us_oca/me.m05.d14:meMA.Ode9C12.incipit	…
ltx/en_us_oca/me.m05.d14:meMA.Ode9C12.melody	@ltx/en_us_oca/he.h.m8:heHE.ExestiEpiTouto.notmetered
ltx/en_us_oca/me.m05.d14:meMA.Ode9C12.mode	@ltx/en_us_oca/miscellanea:misc.Mode8
ltx/en_us_oca/me.m05.d14:meMA.Ode9C12.ode	@ltx/en_us_oca/miscellanea:misc.Ode9
ltx/en_us_oca/me.m05.d14:meMA.Ode9C12.text	
ltx/en_us_oca/me.m05.d14:meMA.Ode9C13.incipit	…
ltx/en_us_oca/me.m05.d14:meMA.Ode9C13.melody	@ltx/en_us_oca/he.h.m8:heHE.ExestiEpiTouto.notmetered
ltx/en_us_oca/me.m05.d14:meMA.Ode9C13.mode	@ltx/en_us_oca/miscellanea:misc.Mode8
ltx/en_us_oca/me.m05.d14:meMA.Ode9C13.ode	@ltx/en_us_oca/miscellanea:misc.Ode9
ltx/en_us_oca/me.m05.d14:meMA.Ode9C13.text	
ltx/en_us_oca/me.m05.d14:meMA.Ode9C1T.incipit	…
ltx/en_us_oca/me.m05.d14:meMA.Ode9C1T.melody	@ltx/en_us_oca/he.h.m8:heHE.ExestiEpiTouto.notmetered
ltx/en_us_oca/me.m05.d14:meMA.Ode9C1T.mode	@ltx/en_us_oca/miscellanea:misc.Mode8
ltx/en_us_oca/me.m05.d14:meMA.Ode9C1T.ode	@ltx/en_us_oca/miscellanea:misc.Ode9
ltx/en_us_oca/me.m05.d14:meMA.Ode9C1T.text	
ltx/en_us_oca/me.m05.d14:meMA.Ode9H.greekmelody	@ltx/en_us_oca/he.h.m8:heHE.ExestiEpiTouto.greekname
ltx/en_us_oca/me.m05.d14:meMA.Ode9H.incipit	@ltx/en_us_oca/he.h.m8:heHE.ExestiEpiTouto.incipit
ltx/en_us_oca/me.m05.d14:meMA.Ode9H.melody	@ltx/en_us_oca/he.h.m8:heHE.ExestiEpiTouto.melody
ltx/en_us_oca/me.m05.d14:meMA.Ode9H.mode	@ltx/en_us_oca/miscellanea:misc.Mode8
ltx/en_us_oca/me.m05.d14:meMA.Ode9H.ode	@ltx/en_us_oca/miscellanea:misc.Ode9
ltx/en_us_oca/me.m05.d14:meMA.Ode9H.text	@ltx/en_us_oca/he.h.m8:heHE.ExestiEpiTouto.text
ltx/en_us_oca/me.m05.d14:meVE.Apolytikion1ger.greekmelody	@ltx/en_us_oca/he.a.m4:heAU.OYpsotheisEnToStavro.greekname
ltx/en_us_oca/me.m05.d14:meVE.Apolytikion1ger.incipit	…
ltx/en_us_oca/me.m05.d14:meVE.Apolytikion1ger.melody	@ltx/en_us_oca/he.a.m4:heAU.OYpsotheisEnToStavro.notmetered
ltx/en_us_oca/me.m05.d14:meVE.Apolytikion1ger.mode	@ltx/en_us_oca/miscellanea:misc.Mode4
ltx/en_us_oca/me.m05.d14:meVE.Apolytikion1ger.poet	@ltx/en_us_oca/poets:po.Gerasimou
ltx/en_us_oca/me.m05.d14:meVE.Apolytikion1ger.text	
ltx/en_us_oca/me.m05.d14:meVE.Stichera01.greekmelody	@ltx/en_us_oca/he.a.m4:heAU.EdokasSimeiosin.greekname
ltx/en_us_oca/me.m05.d14:meVE.Stichera01.incipit	Burning with the zeal of…
ltx/en_us_oca/me.m05.d14:meVE.Stichera01.melody	@ltx/en_us_oca/he.a.m4:heAU.EdokasSimeiosin.notmetered
ltx/en_us_oca/me.m05.d14:meVE.Stichera01.mode	@ltx/en_us_oca/miscellanea:misc.Mode4
ltx/en_us_oca/me.m05.d14:meVE.Stichera01.text	Burning with the zeal of piety, martyr Isidore, ⁄ you entered into the tribunal. ⁄ You accepted suffering with ardor ⁄ and received the crown of victory! ⁄ Adorned with divine teachings against falsehood ⁄ and strengthened by the armor of the Cross ⁄ you cast down the lying tyrant, ⁄⁄ revealing yourself to be a crown-bearer!
ltx/en_us_oca/me.m05.d14:meVE.Stichera02.incipit	You were torn with wounds…
ltx/en_us_oca/me.m05.d14:meVE.Stichera02.melody	@ltx/en_us_oca/he.a.m4:heAU.EdokasSimeiosin.notmetered
ltx/en_us_oca/me.m05.d14:meVE.Stichera02.mode	@ltx/en_us_oca/miscellanea:misc.Mode4
ltx/en_us_oca/me.m05.d14:meVE.Stichera02.text	You were torn with wounds ⁄ stripping away the skin garments of mortality. ⁄ Arrayed in the vesture and splendid purple robe of incorruption, ⁄ you hastened to approach the tree of life. ⁄ Glorious one, you indeed received indestructible and endless life! ⁄⁄ Now as you delight in it, preserve those who sing your praise.
ltx/en_us_oca/me.m05.d14:meVE.Stichera03.incipit	The sufferings of the martyrs…
ltx/en_us_oca/me.m05.d14:meVE.Stichera03.melody	@ltx/en_us_oca/he.a.m4:heAU.EdokasSimeiosin.notmetered
ltx/en_us_oca/me.m05.d14:meVE.Stichera03.mode	@ltx/en_us_oca/miscellanea:misc.Mode4
ltx/en_us_oca/me.m05.d14:meVE.Stichera03.text	The sufferings of the martyrs have indeed transcended ⁄ all praise, all words and thought! ⁄ They were steadfast pillars of piety. ⁄ Though clad like us in mortal and passion-plagued bodies, ⁄ the glorious ones braved the fire and triumphed over wounds, ⁄⁄ suffering as if in the bodies of others!
