ltx/en_us_oca/me.m11.d02:meDA.commemoration.first	
ltx/en_us_oca/me.m11.d02:meDA.commemoration.first_name	
ltx/en_us_oca/me.m11.d02:meDA.commemoration.first_short	
ltx/en_us_oca/me.m11.d02:meDA.commemoration.first_title	
ltx/en_us_oca/me.m11.d02:meDA.commemoration.full	
ltx/en_us_oca/me.m11.d02:meDA.commemoration.second_name	
ltx/en_us_oca/me.m11.d02:meDA.commemoration.second_title	
ltx/en_us_oca/me.m11.d02:meDA.date	
ltx/en_us_oca/me.m11.d02:meDA.fordate	
ltx/en_us_oca/me.m11.d02:meDA.insert1	
ltx/en_us_oca/me.m11.d02:meDA.insert2	
ltx/en_us_oca/me.m11.d02:meDA.note	
ltx/en_us_oca/me.m11.d02:meDA.pdfcoverdate	
ltx/en_us_oca/me.m11.d02:meDA.pdfheaderdate	
ltx/en_us_oca/me.m11.d02:meHO.commemorations	
ltx/en_us_oca/me.m11.d02:meHO.note1	
ltx/en_us_oca/me.m11.d02:meHO.note2	
ltx/en_us_oca/me.m11.d02:meHO.number	
ltx/en_us_oca/me.m11.d02:meHO.rank	
ltx/en_us_oca/me.m11.d02:meLE.commemoration1	
ltx/en_us_oca/me.m11.d02:meLE.commemoration2	
ltx/en_us_oca/me.m11.d02:meLI.Kontakion1.greekmelody	@ltx/en_us_oca/me.m11.d02:meMA.Kontakion1.greekmelody
ltx/en_us_oca/me.m11.d02:meLI.Kontakion1.incipit	@ltx/en_us_oca/me.m11.d02:meMA.Kontakion1.incipit
ltx/en_us_oca/me.m11.d02:meLI.Kontakion1.melody	@ltx/en_us_oca/me.m11.d02:meMA.Kontakion1.melody
ltx/en_us_oca/me.m11.d02:meLI.Kontakion1.mode	@ltx/en_us_oca/me.m11.d02:meMA.Kontakion1.mode
ltx/en_us_oca/me.m11.d02:meLI.Kontakion1.text	@ltx/en_us_oca/me.m11.d02:meMA.Kontakion1.text
ltx/en_us_oca/me.m11.d02:meLI.Megalynarion.text	
ltx/en_us_oca/me.m11.d02:meMA.AposGlory.incipit	The five-lighted lamp of the…
ltx/en_us_oca/me.m11.d02:meMA.AposGlory.melody	
ltx/en_us_oca/me.m11.d02:meMA.AposGlory.mode	@ltx/en_us_oca/miscellanea:misc.Mode4
ltx/en_us_oca/me.m11.d02:meMA.AposGlory.text	The five-lighted lamp of the athletes ⁄ cut down the deceit of the enemy ⁄ like an ax in a grove of trees, as David foretold! ⁄ Having confessed Christ before the emperor ⁄⁄ they ever pray on behalf of our souls!
ltx/en_us_oca/me.m11.d02:meMA.AposStavrotheotokion.greekmelody	@ltx/en_us_oca/he.a.m4:heAU.OsGennaionEnMartysi.greekname
ltx/en_us_oca/me.m11.d02:meMA.AposStavrotheotokion.incipit	@ltx/en_us_oca/me.m02.d27:meVE.SticStavrotheotokion.incipit
ltx/en_us_oca/me.m11.d02:meMA.AposStavrotheotokion.melody	@ltx/en_us_oca/he.a.m4:heAU.OsGennaionEnMartysi.notmetered
ltx/en_us_oca/me.m11.d02:meMA.AposStavrotheotokion.mode	@ltx/en_us_oca/miscellanea:misc.Mode4
ltx/en_us_oca/me.m11.d02:meMA.AposStavrotheotokion.text	@ltx/en_us_oca/me.m02.d27:meVE.SticStavrotheotokion.text
ltx/en_us_oca/me.m11.d02:meMA.AposTheotokion.greekmelody	@ltx/en_us_oca/he.a.m4:heAU.OsGennaionEnMartysi.greekname
ltx/en_us_oca/me.m11.d02:meMA.AposTheotokion.incipit	@ltx/en_us_oca/me.m06.d02:meVE.SticTheotokion.incipit
ltx/en_us_oca/me.m11.d02:meMA.AposTheotokion.melody	@ltx/en_us_oca/he.a.m4:heAU.OsGennaionEnMartysi.notmetered
ltx/en_us_oca/me.m11.d02:meMA.AposTheotokion.mode	@ltx/en_us_oca/miscellanea:misc.Mode4
ltx/en_us_oca/me.m11.d02:meMA.AposTheotokion.text	@ltx/en_us_oca/me.m06.d02:meVE.SticTheotokion.text
ltx/en_us_oca/me.m11.d02:meMA.Aposticha4.incipit	Your body was purple with…
ltx/en_us_oca/me.m11.d02:meMA.Aposticha4.melody	
ltx/en_us_oca/me.m11.d02:meMA.Aposticha4.mode	@ltx/en_us_oca/miscellanea:misc.Mode2
ltx/en_us_oca/me.m11.d02:meMA.Aposticha4.text	Your body was purple with streams of your blood ⁄ as you trod the path of martyrdom without faltering! ⁄ Therefore, athlete Acindynus, ⁄ you were given the armor of divine strength, ⁄ cutting down the weapons of the enemy! ⁄⁄ Entreat Christ God on our behalf, that our souls may be saved!
ltx/en_us_oca/me.m11.d02:meMA.C1.acrostic.notice1	
ltx/en_us_oca/me.m11.d02:meMA.C1.acrostic.text	
ltx/en_us_oca/me.m11.d02:meMA.C1.acrostic.title	
ltx/en_us_oca/me.m11.d02:meMA.C1.poet	@ltx/en_us_oca/poets:po.Theofanous
ltx/en_us_oca/me.m11.d02:meMA.C1.title	@ltx/en_us_oca/titles:ti.CanonSaints
ltx/en_us_oca/me.m11.d02:meMA.C1.verse	@ltx/en_us_oca/prayers:pr.verse_SaintsM.text
ltx/en_us_oca/me.m11.d02:meMA.ExapTheotokion.incipit	…
ltx/en_us_oca/me.m11.d02:meMA.ExapTheotokion.melody	@ltx/en_us_oca/he.a.m2:heAU.GynaikesAkoutisthite.notmetered
ltx/en_us_oca/me.m11.d02:meMA.ExapTheotokion.mode	@ltx/en_us_oca/miscellanea:misc.Mode2
ltx/en_us_oca/me.m11.d02:meMA.ExapTheotokion.text	
ltx/en_us_oca/me.m11.d02:meMA.Exaposteilarion1.greekmelody	@ltx/en_us_oca/he.a.m2:heAU.GynaikesAkoutisthite.greekname
ltx/en_us_oca/me.m11.d02:meMA.Exaposteilarion1.incipit	…
ltx/en_us_oca/me.m11.d02:meMA.Exaposteilarion1.melody	@ltx/en_us_oca/he.a.m2:heAU.GynaikesAkoutisthite.notmetered
ltx/en_us_oca/me.m11.d02:meMA.Exaposteilarion1.mode	@ltx/en_us_oca/miscellanea:misc.Mode2
ltx/en_us_oca/me.m11.d02:meMA.Exaposteilarion1.text	
ltx/en_us_oca/me.m11.d02:meMA.Kontakion1.greekmelody	@ltx/en_us_oca/he.a.m4:heAU.OYpsotheisEnToStavro.greekname
ltx/en_us_oca/me.m11.d02:meMA.Kontakion1.incipit	…
ltx/en_us_oca/me.m11.d02:meMA.Kontakion1.melody	@ltx/en_us_oca/he.a.m4:heAU.OYpsotheisEnToStavro.notmetered
ltx/en_us_oca/me.m11.d02:meMA.Kontakion1.mode	@ltx/en_us_oca/miscellanea:misc.Mode4
ltx/en_us_oca/me.m11.d02:meMA.Kontakion1.text	
ltx/en_us_oca/me.m11.d02:meMA.Ode1C11.greekmelody	@ltx/en_us_oca/he.h.m4:heHE.AnoixoToStomaMou.greekname
ltx/en_us_oca/me.m11.d02:meMA.Ode1C11.incipit	…
ltx/en_us_oca/me.m11.d02:meMA.Ode1C11.melody	@ltx/en_us_oca/he.h.m4:heHE.AnoixoToStomaMou.notmetered
ltx/en_us_oca/me.m11.d02:meMA.Ode1C11.mode	@ltx/en_us_oca/miscellanea:misc.Mode4
ltx/en_us_oca/me.m11.d02:meMA.Ode1C11.ode	@ltx/en_us_oca/miscellanea:misc.Ode1
ltx/en_us_oca/me.m11.d02:meMA.Ode1C11.text	
ltx/en_us_oca/me.m11.d02:meMA.Ode1C12.incipit	…
ltx/en_us_oca/me.m11.d02:meMA.Ode1C12.melody	@ltx/en_us_oca/he.h.m4:heHE.AnoixoToStomaMou.notmetered
ltx/en_us_oca/me.m11.d02:meMA.Ode1C12.mode	@ltx/en_us_oca/miscellanea:misc.Mode4
ltx/en_us_oca/me.m11.d02:meMA.Ode1C12.ode	@ltx/en_us_oca/miscellanea:misc.Ode1
ltx/en_us_oca/me.m11.d02:meMA.Ode1C12.text	
ltx/en_us_oca/me.m11.d02:meMA.Ode1C13.incipit	…
ltx/en_us_oca/me.m11.d02:meMA.Ode1C13.melody	@ltx/en_us_oca/he.h.m4:heHE.AnoixoToStomaMou.notmetered
ltx/en_us_oca/me.m11.d02:meMA.Ode1C13.mode	@ltx/en_us_oca/miscellanea:misc.Mode4
ltx/en_us_oca/me.m11.d02:meMA.Ode1C13.ode	@ltx/en_us_oca/miscellanea:misc.Ode1
ltx/en_us_oca/me.m11.d02:meMA.Ode1C13.text	
ltx/en_us_oca/me.m11.d02:meMA.Ode1C1T.incipit	…
ltx/en_us_oca/me.m11.d02:meMA.Ode1C1T.melody	@ltx/en_us_oca/he.h.m4:heHE.AnoixoToStomaMou.notmetered
ltx/en_us_oca/me.m11.d02:meMA.Ode1C1T.mode	@ltx/en_us_oca/miscellanea:misc.Mode4
ltx/en_us_oca/me.m11.d02:meMA.Ode1C1T.ode	@ltx/en_us_oca/miscellanea:misc.Ode1
ltx/en_us_oca/me.m11.d02:meMA.Ode1C1T.text	
ltx/en_us_oca/me.m11.d02:meMA.Ode3C11.greekmelody	@ltx/en_us_oca/he.h.m4:heHE.OukEnSofia.greekname
ltx/en_us_oca/me.m11.d02:meMA.Ode3C11.incipit	…
ltx/en_us_oca/me.m11.d02:meMA.Ode3C11.melody	@ltx/en_us_oca/he.h.m4:heHE.OukEnSofia.notmetered
ltx/en_us_oca/me.m11.d02:meMA.Ode3C11.mode	@ltx/en_us_oca/miscellanea:misc.Mode4
ltx/en_us_oca/me.m11.d02:meMA.Ode3C11.ode	@ltx/en_us_oca/miscellanea:misc.Ode3
ltx/en_us_oca/me.m11.d02:meMA.Ode3C11.text	
ltx/en_us_oca/me.m11.d02:meMA.Ode3C12.incipit	…
ltx/en_us_oca/me.m11.d02:meMA.Ode3C12.melody	@ltx/en_us_oca/he.h.m4:heHE.OukEnSofia.notmetered
ltx/en_us_oca/me.m11.d02:meMA.Ode3C12.mode	@ltx/en_us_oca/miscellanea:misc.Mode4
ltx/en_us_oca/me.m11.d02:meMA.Ode3C12.ode	@ltx/en_us_oca/miscellanea:misc.Ode3
ltx/en_us_oca/me.m11.d02:meMA.Ode3C12.text	
ltx/en_us_oca/me.m11.d02:meMA.Ode3C13.incipit	…
ltx/en_us_oca/me.m11.d02:meMA.Ode3C13.melody	@ltx/en_us_oca/he.h.m4:heHE.OukEnSofia.notmetered
ltx/en_us_oca/me.m11.d02:meMA.Ode3C13.mode	@ltx/en_us_oca/miscellanea:misc.Mode4
ltx/en_us_oca/me.m11.d02:meMA.Ode3C13.ode	@ltx/en_us_oca/miscellanea:misc.Ode3
ltx/en_us_oca/me.m11.d02:meMA.Ode3C13.text	
ltx/en_us_oca/me.m11.d02:meMA.Ode3C1T.incipit	…
ltx/en_us_oca/me.m11.d02:meMA.Ode3C1T.melody	@ltx/en_us_oca/he.h.m4:heHE.OukEnSofia.notmetered
ltx/en_us_oca/me.m11.d02:meMA.Ode3C1T.mode	@ltx/en_us_oca/miscellanea:misc.Mode4
ltx/en_us_oca/me.m11.d02:meMA.Ode3C1T.ode	@ltx/en_us_oca/miscellanea:misc.Ode3
ltx/en_us_oca/me.m11.d02:meMA.Ode3C1T.text	
ltx/en_us_oca/me.m11.d02:meMA.Ode3H.greekmelody	@ltx/en_us_oca/he.h.m4:heHE.OukEnSofia.greekname
ltx/en_us_oca/me.m11.d02:meMA.Ode3H.incipit	@ltx/en_us_oca/he.h.m4:heHE.OukEnSofia.incipit
ltx/en_us_oca/me.m11.d02:meMA.Ode3H.melody	@ltx/en_us_oca/he.h.m4:heHE.OukEnSofia.melody
ltx/en_us_oca/me.m11.d02:meMA.Ode3H.mode	@ltx/en_us_oca/miscellanea:misc.Mode4
ltx/en_us_oca/me.m11.d02:meMA.Ode3H.ode	@ltx/en_us_oca/miscellanea:misc.Ode3
ltx/en_us_oca/me.m11.d02:meMA.Ode3H.text	@ltx/en_us_oca/he.h.m4:heHE.OukEnSofia.text
ltx/en_us_oca/me.m11.d02:meMA.Ode3Kathisma1.greekmelody	@ltx/en_us_oca/he.a.m4:heAU.KateplagiIosif.greekname
ltx/en_us_oca/me.m11.d02:meMA.Ode3Kathisma1.incipit	…
ltx/en_us_oca/me.m11.d02:meMA.Ode3Kathisma1.melody	@ltx/en_us_oca/he.a.m4:heAU.KateplagiIosif.notmetered
ltx/en_us_oca/me.m11.d02:meMA.Ode3Kathisma1.mode	@ltx/en_us_oca/miscellanea:misc.Mode4
ltx/en_us_oca/me.m11.d02:meMA.Ode3Kathisma1.text	
ltx/en_us_oca/me.m11.d02:meMA.Ode3Kathisma2.greekmelody	@ltx/en_us_oca/he.a.m8:heAU.TinSofianKaiLogon.greekname
ltx/en_us_oca/me.m11.d02:meMA.Ode3Kathisma2.incipit	…
ltx/en_us_oca/me.m11.d02:meMA.Ode3Kathisma2.melody	@ltx/en_us_oca/he.a.m8:heAU.TinSofianKaiLogon.notmetered
ltx/en_us_oca/me.m11.d02:meMA.Ode3Kathisma2.mode	@ltx/en_us_oca/miscellanea:misc.Mode8
ltx/en_us_oca/me.m11.d02:meMA.Ode3Kathisma2.text	
ltx/en_us_oca/me.m11.d02:meMA.Ode3KathismaSt.incipit	@ltx/en_us_oca/oc.m8.d4:ocMA.Kathisma13.incipit
ltx/en_us_oca/me.m11.d02:meMA.Ode3KathismaSt.melody	@ltx/en_us_oca/he.a.m8:heAU.TinSofianKaiLogon.notmetered
ltx/en_us_oca/me.m11.d02:meMA.Ode3KathismaSt.mode	@ltx/en_us_oca/miscellanea:misc.Mode8
ltx/en_us_oca/me.m11.d02:meMA.Ode3KathismaSt.text	@ltx/en_us_oca/oc.m8.d4:ocMA.Kathisma13.text
ltx/en_us_oca/me.m11.d02:meMA.Ode3KathismaT.incipit	@ltx/en_us_oca/he.a.m8:heAU.TinSofianKaiLogon.incipit
ltx/en_us_oca/me.m11.d02:meMA.Ode3KathismaT.melody	@ltx/en_us_oca/he.a.m8:heAU.TinSofianKaiLogon.melody
ltx/en_us_oca/me.m11.d02:meMA.Ode3KathismaT.mode	@ltx/en_us_oca/miscellanea:misc.Mode8
ltx/en_us_oca/me.m11.d02:meMA.Ode3KathismaT.text	@ltx/en_us_oca/he.a.m8:heAU.TinSofianKaiLogon.text
ltx/en_us_oca/me.m11.d02:meMA.Ode4C11.greekmelody	@ltx/en_us_oca/he.h.m4:heHE.OKathimenosEnDoxi.greekname
ltx/en_us_oca/me.m11.d02:meMA.Ode4C11.incipit	…
ltx/en_us_oca/me.m11.d02:meMA.Ode4C11.melody	@ltx/en_us_oca/he.h.m4:heHE.OKathimenosEnDoxi.notmetered
ltx/en_us_oca/me.m11.d02:meMA.Ode4C11.mode	@ltx/en_us_oca/miscellanea:misc.Mode4
ltx/en_us_oca/me.m11.d02:meMA.Ode4C11.ode	@ltx/en_us_oca/miscellanea:misc.Ode4
ltx/en_us_oca/me.m11.d02:meMA.Ode4C11.text	
ltx/en_us_oca/me.m11.d02:meMA.Ode4C12.incipit	…
ltx/en_us_oca/me.m11.d02:meMA.Ode4C12.melody	@ltx/en_us_oca/he.h.m4:heHE.OKathimenosEnDoxi.notmetered
ltx/en_us_oca/me.m11.d02:meMA.Ode4C12.mode	@ltx/en_us_oca/miscellanea:misc.Mode4
ltx/en_us_oca/me.m11.d02:meMA.Ode4C12.ode	@ltx/en_us_oca/miscellanea:misc.Ode4
ltx/en_us_oca/me.m11.d02:meMA.Ode4C12.text	
ltx/en_us_oca/me.m11.d02:meMA.Ode4C13.incipit	…
ltx/en_us_oca/me.m11.d02:meMA.Ode4C13.melody	@ltx/en_us_oca/he.h.m4:heHE.OKathimenosEnDoxi.notmetered
ltx/en_us_oca/me.m11.d02:meMA.Ode4C13.mode	@ltx/en_us_oca/miscellanea:misc.Mode4
ltx/en_us_oca/me.m11.d02:meMA.Ode4C13.ode	@ltx/en_us_oca/miscellanea:misc.Ode4
ltx/en_us_oca/me.m11.d02:meMA.Ode4C13.text	
ltx/en_us_oca/me.m11.d02:meMA.Ode4C14.incipit	…
ltx/en_us_oca/me.m11.d02:meMA.Ode4C14.melody	@ltx/en_us_oca/he.h.m4:heHE.OKathimenosEnDoxi.notmetered
ltx/en_us_oca/me.m11.d02:meMA.Ode4C14.mode	@ltx/en_us_oca/miscellanea:misc.Mode4
ltx/en_us_oca/me.m11.d02:meMA.Ode4C14.ode	@ltx/en_us_oca/miscellanea:misc.Ode4
ltx/en_us_oca/me.m11.d02:meMA.Ode4C14.text	
ltx/en_us_oca/me.m11.d02:meMA.Ode4C1T.incipit	…
ltx/en_us_oca/me.m11.d02:meMA.Ode4C1T.melody	@ltx/en_us_oca/he.h.m4:heHE.OKathimenosEnDoxi.notmetered
ltx/en_us_oca/me.m11.d02:meMA.Ode4C1T.mode	@ltx/en_us_oca/miscellanea:misc.Mode4
ltx/en_us_oca/me.m11.d02:meMA.Ode4C1T.ode	@ltx/en_us_oca/miscellanea:misc.Ode4
ltx/en_us_oca/me.m11.d02:meMA.Ode4C1T.text	
ltx/en_us_oca/me.m11.d02:meMA.Ode5C11.greekmelody	@ltx/en_us_oca/he.h.m4:heHE.AseveisOukOpsontai.greekname
ltx/en_us_oca/me.m11.d02:meMA.Ode5C11.incipit	…
ltx/en_us_oca/me.m11.d02:meMA.Ode5C11.melody	@ltx/en_us_oca/he.h.m4:heHE.AseveisOukOpsontai.notmetered
ltx/en_us_oca/me.m11.d02:meMA.Ode5C11.mode	@ltx/en_us_oca/miscellanea:misc.Mode4
ltx/en_us_oca/me.m11.d02:meMA.Ode5C11.ode	@ltx/en_us_oca/miscellanea:misc.Ode5
ltx/en_us_oca/me.m11.d02:meMA.Ode5C11.text	
ltx/en_us_oca/me.m11.d02:meMA.Ode5C12.incipit	…
ltx/en_us_oca/me.m11.d02:meMA.Ode5C12.melody	@ltx/en_us_oca/he.h.m4:heHE.AseveisOukOpsontai.notmetered
ltx/en_us_oca/me.m11.d02:meMA.Ode5C12.mode	@ltx/en_us_oca/miscellanea:misc.Mode4
ltx/en_us_oca/me.m11.d02:meMA.Ode5C12.ode	@ltx/en_us_oca/miscellanea:misc.Ode5
ltx/en_us_oca/me.m11.d02:meMA.Ode5C12.text	
ltx/en_us_oca/me.m11.d02:meMA.Ode5C13.incipit	…
ltx/en_us_oca/me.m11.d02:meMA.Ode5C13.melody	@ltx/en_us_oca/he.h.m4:heHE.AseveisOukOpsontai.notmetered
ltx/en_us_oca/me.m11.d02:meMA.Ode5C13.mode	@ltx/en_us_oca/miscellanea:misc.Mode4
ltx/en_us_oca/me.m11.d02:meMA.Ode5C13.ode	@ltx/en_us_oca/miscellanea:misc.Ode5
ltx/en_us_oca/me.m11.d02:meMA.Ode5C13.text	
ltx/en_us_oca/me.m11.d02:meMA.Ode5C14.incipit	…
ltx/en_us_oca/me.m11.d02:meMA.Ode5C14.melody	@ltx/en_us_oca/he.h.m4:heHE.AseveisOukOpsontai.notmetered
ltx/en_us_oca/me.m11.d02:meMA.Ode5C14.mode	@ltx/en_us_oca/miscellanea:misc.Mode4
ltx/en_us_oca/me.m11.d02:meMA.Ode5C14.ode	@ltx/en_us_oca/miscellanea:misc.Ode5
ltx/en_us_oca/me.m11.d02:meMA.Ode5C14.text	
ltx/en_us_oca/me.m11.d02:meMA.Ode5C1T.incipit	…
ltx/en_us_oca/me.m11.d02:meMA.Ode5C1T.melody	@ltx/en_us_oca/he.h.m4:heHE.AseveisOukOpsontai.notmetered
ltx/en_us_oca/me.m11.d02:meMA.Ode5C1T.mode	@ltx/en_us_oca/miscellanea:misc.Mode4
ltx/en_us_oca/me.m11.d02:meMA.Ode5C1T.ode	@ltx/en_us_oca/miscellanea:misc.Ode5
ltx/en_us_oca/me.m11.d02:meMA.Ode5C1T.text	
ltx/en_us_oca/me.m11.d02:meMA.Ode6C11.greekmelody	@ltx/en_us_oca/he.h.m4:heHE.ThysoSoiMetaFonis.greekname
ltx/en_us_oca/me.m11.d02:meMA.Ode6C11.incipit	…
ltx/en_us_oca/me.m11.d02:meMA.Ode6C11.melody	@ltx/en_us_oca/he.h.m4:heHE.ThysoSoiMetaFonis.notmetered
ltx/en_us_oca/me.m11.d02:meMA.Ode6C11.mode	@ltx/en_us_oca/miscellanea:misc.Mode4
ltx/en_us_oca/me.m11.d02:meMA.Ode6C11.ode	@ltx/en_us_oca/miscellanea:misc.Ode6
ltx/en_us_oca/me.m11.d02:meMA.Ode6C11.text	
ltx/en_us_oca/me.m11.d02:meMA.Ode6C12.incipit	…
ltx/en_us_oca/me.m11.d02:meMA.Ode6C12.melody	@ltx/en_us_oca/he.h.m4:heHE.ThysoSoiMetaFonis.notmetered
ltx/en_us_oca/me.m11.d02:meMA.Ode6C12.mode	@ltx/en_us_oca/miscellanea:misc.Mode4
ltx/en_us_oca/me.m11.d02:meMA.Ode6C12.ode	@ltx/en_us_oca/miscellanea:misc.Ode6
ltx/en_us_oca/me.m11.d02:meMA.Ode6C12.text	
ltx/en_us_oca/me.m11.d02:meMA.Ode6C13.incipit	…
ltx/en_us_oca/me.m11.d02:meMA.Ode6C13.melody	@ltx/en_us_oca/he.h.m4:heHE.ThysoSoiMetaFonis.notmetered
ltx/en_us_oca/me.m11.d02:meMA.Ode6C13.mode	@ltx/en_us_oca/miscellanea:misc.Mode4
ltx/en_us_oca/me.m11.d02:meMA.Ode6C13.ode	@ltx/en_us_oca/miscellanea:misc.Ode6
ltx/en_us_oca/me.m11.d02:meMA.Ode6C13.text	
ltx/en_us_oca/me.m11.d02:meMA.Ode6C1T.incipit	…
ltx/en_us_oca/me.m11.d02:meMA.Ode6C1T.melody	@ltx/en_us_oca/he.h.m4:heHE.ThysoSoiMetaFonis.notmetered
ltx/en_us_oca/me.m11.d02:meMA.Ode6C1T.mode	@ltx/en_us_oca/miscellanea:misc.Mode4
ltx/en_us_oca/me.m11.d02:meMA.Ode6C1T.ode	@ltx/en_us_oca/miscellanea:misc.Ode6
ltx/en_us_oca/me.m11.d02:meMA.Ode6C1T.text	
ltx/en_us_oca/me.m11.d02:meMA.Ode6H.greekmelody	@ltx/en_us_oca/he.h.m4:heHE.ThysoSoiMetaFonis.greekname
ltx/en_us_oca/me.m11.d02:meMA.Ode6H.incipit	@ltx/en_us_oca/he.h.m4:heHE.ThysoSoiMetaFonis.incipit
ltx/en_us_oca/me.m11.d02:meMA.Ode6H.melody	@ltx/en_us_oca/he.h.m4:heHE.ThysoSoiMetaFonis.melody
ltx/en_us_oca/me.m11.d02:meMA.Ode6H.mode	@ltx/en_us_oca/miscellanea:misc.Mode4
ltx/en_us_oca/me.m11.d02:meMA.Ode6H.ode	@ltx/en_us_oca/miscellanea:misc.Ode6
ltx/en_us_oca/me.m11.d02:meMA.Ode6H.text	@ltx/en_us_oca/he.h.m4:heHE.ThysoSoiMetaFonis.text
ltx/en_us_oca/me.m11.d02:meMA.Ode7C11.greekmelody	@ltx/en_us_oca/he.h.m4:heHE.ODiasosasEnPyri.greekname
ltx/en_us_oca/me.m11.d02:meMA.Ode7C11.incipit	…
ltx/en_us_oca/me.m11.d02:meMA.Ode7C11.melody	@ltx/en_us_oca/he.h.m4:heHE.ODiasosasEnPyri.notmetered
ltx/en_us_oca/me.m11.d02:meMA.Ode7C11.mode	@ltx/en_us_oca/miscellanea:misc.Mode4
ltx/en_us_oca/me.m11.d02:meMA.Ode7C11.ode	@ltx/en_us_oca/miscellanea:misc.Ode7
ltx/en_us_oca/me.m11.d02:meMA.Ode7C11.text	
ltx/en_us_oca/me.m11.d02:meMA.Ode7C12.incipit	…
ltx/en_us_oca/me.m11.d02:meMA.Ode7C12.melody	@ltx/en_us_oca/he.h.m4:heHE.ODiasosasEnPyri.notmetered
ltx/en_us_oca/me.m11.d02:meMA.Ode7C12.mode	@ltx/en_us_oca/miscellanea:misc.Mode4
ltx/en_us_oca/me.m11.d02:meMA.Ode7C12.ode	@ltx/en_us_oca/miscellanea:misc.Ode7
ltx/en_us_oca/me.m11.d02:meMA.Ode7C12.text	
ltx/en_us_oca/me.m11.d02:meMA.Ode7C13.incipit	…
ltx/en_us_oca/me.m11.d02:meMA.Ode7C13.melody	@ltx/en_us_oca/he.h.m4:heHE.ODiasosasEnPyri.notmetered
ltx/en_us_oca/me.m11.d02:meMA.Ode7C13.mode	@ltx/en_us_oca/miscellanea:misc.Mode4
ltx/en_us_oca/me.m11.d02:meMA.Ode7C13.ode	@ltx/en_us_oca/miscellanea:misc.Ode7
ltx/en_us_oca/me.m11.d02:meMA.Ode7C13.text	
ltx/en_us_oca/me.m11.d02:meMA.Ode7C1T.incipit	…
ltx/en_us_oca/me.m11.d02:meMA.Ode7C1T.melody	@ltx/en_us_oca/he.h.m4:heHE.ODiasosasEnPyri.notmetered
ltx/en_us_oca/me.m11.d02:meMA.Ode7C1T.mode	@ltx/en_us_oca/miscellanea:misc.Mode4
ltx/en_us_oca/me.m11.d02:meMA.Ode7C1T.ode	@ltx/en_us_oca/miscellanea:misc.Ode7
ltx/en_us_oca/me.m11.d02:meMA.Ode7C1T.text	
ltx/en_us_oca/me.m11.d02:meMA.Ode8C11.greekmelody	@ltx/en_us_oca/he.h.m4:heHE.PaidasEvageis.greekname
ltx/en_us_oca/me.m11.d02:meMA.Ode8C11.incipit	…
ltx/en_us_oca/me.m11.d02:meMA.Ode8C11.melody	@ltx/en_us_oca/he.h.m4:heHE.PaidasEvageis.notmetered
ltx/en_us_oca/me.m11.d02:meMA.Ode8C11.mode	@ltx/en_us_oca/miscellanea:misc.Mode4
ltx/en_us_oca/me.m11.d02:meMA.Ode8C11.ode	@ltx/en_us_oca/miscellanea:misc.Ode8
ltx/en_us_oca/me.m11.d02:meMA.Ode8C11.text	
ltx/en_us_oca/me.m11.d02:meMA.Ode8C12.incipit	…
ltx/en_us_oca/me.m11.d02:meMA.Ode8C12.melody	@ltx/en_us_oca/he.h.m4:heHE.PaidasEvageis.notmetered
ltx/en_us_oca/me.m11.d02:meMA.Ode8C12.mode	@ltx/en_us_oca/miscellanea:misc.Mode4
ltx/en_us_oca/me.m11.d02:meMA.Ode8C12.ode	@ltx/en_us_oca/miscellanea:misc.Ode8
ltx/en_us_oca/me.m11.d02:meMA.Ode8C12.text	
ltx/en_us_oca/me.m11.d02:meMA.Ode8C13.incipit	…
ltx/en_us_oca/me.m11.d02:meMA.Ode8C13.melody	@ltx/en_us_oca/he.h.m4:heHE.PaidasEvageis.notmetered
ltx/en_us_oca/me.m11.d02:meMA.Ode8C13.mode	@ltx/en_us_oca/miscellanea:misc.Mode4
ltx/en_us_oca/me.m11.d02:meMA.Ode8C13.ode	@ltx/en_us_oca/miscellanea:misc.Ode8
ltx/en_us_oca/me.m11.d02:meMA.Ode8C13.text	
ltx/en_us_oca/me.m11.d02:meMA.Ode8C14.incipit	…
ltx/en_us_oca/me.m11.d02:meMA.Ode8C14.melody	@ltx/en_us_oca/he.h.m4:heHE.PaidasEvageis.notmetered
ltx/en_us_oca/me.m11.d02:meMA.Ode8C14.mode	@ltx/en_us_oca/miscellanea:misc.Mode4
ltx/en_us_oca/me.m11.d02:meMA.Ode8C14.ode	@ltx/en_us_oca/miscellanea:misc.Ode8
ltx/en_us_oca/me.m11.d02:meMA.Ode8C14.text	
ltx/en_us_oca/me.m11.d02:meMA.Ode8C1T.incipit	…
ltx/en_us_oca/me.m11.d02:meMA.Ode8C1T.melody	@ltx/en_us_oca/he.h.m4:heHE.PaidasEvageis.notmetered
ltx/en_us_oca/me.m11.d02:meMA.Ode8C1T.mode	@ltx/en_us_oca/miscellanea:misc.Mode4
ltx/en_us_oca/me.m11.d02:meMA.Ode8C1T.ode	@ltx/en_us_oca/miscellanea:misc.Ode8
ltx/en_us_oca/me.m11.d02:meMA.Ode8C1T.text	
ltx/en_us_oca/me.m11.d02:meMA.Ode8H.greekmelody	@ltx/en_us_oca/he.h.m4:heHE.PaidasEvageis.greekname
ltx/en_us_oca/me.m11.d02:meMA.Ode8H.incipit	@ltx/en_us_oca/he.h.m4:heHE.PaidasEvageis.incipit
ltx/en_us_oca/me.m11.d02:meMA.Ode8H.melody	@ltx/en_us_oca/he.h.m4:heHE.PaidasEvageis.melody
ltx/en_us_oca/me.m11.d02:meMA.Ode8H.mode	@ltx/en_us_oca/miscellanea:misc.Mode4
ltx/en_us_oca/me.m11.d02:meMA.Ode8H.ode	@ltx/en_us_oca/miscellanea:misc.Ode8
ltx/en_us_oca/me.m11.d02:meMA.Ode8H.text	@ltx/en_us_oca/he.h.m4:heHE.PaidasEvageis.text
ltx/en_us_oca/me.m11.d02:meMA.Ode9C11.greekmelody	@ltx/en_us_oca/he.h.m4:heHE.EvaMenToTisParakois.greekname
ltx/en_us_oca/me.m11.d02:meMA.Ode9C11.incipit	…
ltx/en_us_oca/me.m11.d02:meMA.Ode9C11.melody	@ltx/en_us_oca/he.h.m4:heHE.EvaMenToTisParakois.notmetered
ltx/en_us_oca/me.m11.d02:meMA.Ode9C11.mode	@ltx/en_us_oca/miscellanea:misc.Mode4
ltx/en_us_oca/me.m11.d02:meMA.Ode9C11.ode	@ltx/en_us_oca/miscellanea:misc.Ode9
ltx/en_us_oca/me.m11.d02:meMA.Ode9C11.text	
ltx/en_us_oca/me.m11.d02:meMA.Ode9C12.incipit	…
ltx/en_us_oca/me.m11.d02:meMA.Ode9C12.melody	@ltx/en_us_oca/he.h.m4:heHE.EvaMenToTisParakois.notmetered
ltx/en_us_oca/me.m11.d02:meMA.Ode9C12.mode	@ltx/en_us_oca/miscellanea:misc.Mode4
ltx/en_us_oca/me.m11.d02:meMA.Ode9C12.ode	@ltx/en_us_oca/miscellanea:misc.Ode9
ltx/en_us_oca/me.m11.d02:meMA.Ode9C12.text	
ltx/en_us_oca/me.m11.d02:meMA.Ode9C13.incipit	…
ltx/en_us_oca/me.m11.d02:meMA.Ode9C13.melody	@ltx/en_us_oca/he.h.m4:heHE.EvaMenToTisParakois.notmetered
ltx/en_us_oca/me.m11.d02:meMA.Ode9C13.mode	@ltx/en_us_oca/miscellanea:misc.Mode4
ltx/en_us_oca/me.m11.d02:meMA.Ode9C13.ode	@ltx/en_us_oca/miscellanea:misc.Ode9
ltx/en_us_oca/me.m11.d02:meMA.Ode9C13.text	
ltx/en_us_oca/me.m11.d02:meMA.Ode9C1T.incipit	…
ltx/en_us_oca/me.m11.d02:meMA.Ode9C1T.melody	@ltx/en_us_oca/he.h.m4:heHE.EvaMenToTisParakois.notmetered
ltx/en_us_oca/me.m11.d02:meMA.Ode9C1T.mode	@ltx/en_us_oca/miscellanea:misc.Mode4
ltx/en_us_oca/me.m11.d02:meMA.Ode9C1T.ode	@ltx/en_us_oca/miscellanea:misc.Ode9
ltx/en_us_oca/me.m11.d02:meMA.Ode9C1T.text	
ltx/en_us_oca/me.m11.d02:meMA.Ode9H.greekmelody	@ltx/en_us_oca/he.h.m4:heHE.EvaMenToTisParakois.greekname
ltx/en_us_oca/me.m11.d02:meMA.Ode9H.incipit	@ltx/en_us_oca/he.h.m4:heHE.EvaMenToTisParakois.incipit
ltx/en_us_oca/me.m11.d02:meMA.Ode9H.melody	@ltx/en_us_oca/he.h.m4:heHE.EvaMenToTisParakois.melody
ltx/en_us_oca/me.m11.d02:meMA.Ode9H.mode	@ltx/en_us_oca/miscellanea:misc.Mode4
ltx/en_us_oca/me.m11.d02:meMA.Ode9H.ode	@ltx/en_us_oca/miscellanea:misc.Ode9
ltx/en_us_oca/me.m11.d02:meMA.Ode9H.text	@ltx/en_us_oca/he.h.m4:heHE.EvaMenToTisParakois.text
ltx/en_us_oca/me.m11.d02:meMA.Oikos1.text	
ltx/en_us_oca/me.m11.d02:meVE.Apolytikion1.incipit	@ltx/en_us_oca/oc.m2.d4:ocMA.Kathisma32.incipit
ltx/en_us_oca/me.m11.d02:meVE.Apolytikion1.melody	
ltx/en_us_oca/me.m11.d02:meVE.Apolytikion1.mode	@ltx/en_us_oca/miscellanea:misc.Mode2
ltx/en_us_oca/me.m11.d02:meVE.Apolytikion1.text	@ltx/en_us_oca/oc.m2.d4:ocMA.Kathisma32.text
ltx/en_us_oca/me.m11.d02:meVE.Apolytikion2ger.greekmelody	@ltx/en_us_oca/he.a.m4:heAU.TachyProkatalave.greekname
ltx/en_us_oca/me.m11.d02:meVE.Apolytikion2ger.incipit	…
ltx/en_us_oca/me.m11.d02:meVE.Apolytikion2ger.melody	@ltx/en_us_oca/he.a.m4:heAU.TachyProkatalave.notmetered
ltx/en_us_oca/me.m11.d02:meVE.Apolytikion2ger.mode	@ltx/en_us_oca/miscellanea:misc.Mode4
ltx/en_us_oca/me.m11.d02:meVE.Apolytikion2ger.poet	@ltx/en_us_oca/poets:po.Gerasimou
ltx/en_us_oca/me.m11.d02:meVE.Apolytikion2ger.text	
ltx/en_us_oca/me.m11.d02:meVE.AposGlory.incipit	Come, let us rejoice in…
ltx/en_us_oca/me.m11.d02:meVE.AposGlory.melody	
ltx/en_us_oca/me.m11.d02:meVE.AposGlory.mode	@ltx/en_us_oca/miscellanea:misc.Mode2
ltx/en_us_oca/me.m11.d02:meVE.AposGlory.text	Come, let us rejoice in the Lord today: ⁄ The day of the commemoration of the passion-bearers! ⁄ Come, all who love the feasts of the Church! ⁄ Let us give glory, offering them mystical praise: ⁄ Rejoice, Acindynus! ⁄ Rejoice, Pegasus and Anempodistus! ⁄ Rejoice, Elpidephorus! ⁄ Rejoice, Apthonius! ⁄ You drowned the deceits of idolotry in the depths of the sea; ⁄ you preached Christ the Lord openly in the arena! ⁄ Therefore, most blessed, greatly suffering ones, ⁄⁄ ever intercede for our souls!
ltx/en_us_oca/me.m11.d02:meVE.AposStavrotheotokion.greekmelody	@ltx/en_us_oca/he.a.m2:heAU.OteEkTouXylou.greekname
ltx/en_us_oca/me.m11.d02:meVE.AposStavrotheotokion.incipit	@ltx/en_us_oca/me.m10.d02:meVE.SticStavrotheotokion.incipit
ltx/en_us_oca/me.m11.d02:meVE.AposStavrotheotokion.melody	@ltx/en_us_oca/he.a.m2:heAU.OteEkTouXylou.notmetered
ltx/en_us_oca/me.m11.d02:meVE.AposStavrotheotokion.mode	@ltx/en_us_oca/miscellanea:misc.Mode2
ltx/en_us_oca/me.m11.d02:meVE.AposStavrotheotokion.text	@ltx/en_us_oca/me.m10.d02:meVE.SticStavrotheotokion.text
ltx/en_us_oca/me.m11.d02:meVE.AposTheotokion.incipit	@ltx/en_us_oca/ho.ho23:hoCA.Troparion7.incipit
ltx/en_us_oca/me.m11.d02:meVE.AposTheotokion.melody	
ltx/en_us_oca/me.m11.d02:meVE.AposTheotokion.mode	@ltx/en_us_oca/miscellanea:misc.Mode2
ltx/en_us_oca/me.m11.d02:meVE.AposTheotokion.text	@ltx/en_us_oca/ho.ho23:hoCA.Troparion7.text
ltx/en_us_oca/me.m11.d02:meVE.MM.Stichera1123as78910.text	
ltx/en_us_oca/me.m11.d02:meVE.SticGlory.incipit	Today the martyrs’ choir of…
ltx/en_us_oca/me.m11.d02:meVE.SticGlory.melody	
ltx/en_us_oca/me.m11.d02:meVE.SticGlory.mode	@ltx/en_us_oca/miscellanea:misc.Mode6
ltx/en_us_oca/me.m11.d02:meVE.SticGlory.poet	@ltx/en_us_oca/poets:po.Antoniou
ltx/en_us_oca/me.m11.d02:meVE.SticGlory.text	Today the martyrs’ choir of fivefold splendor ⁄ illumines the faithful like a constellation of stars! ⁄ It summons all to mystical joy! ⁄ Today the servants of the spiritual Sun ⁄ lead all to righteousness: ⁄ They destroyed the traditions of the Persians ⁄ who adored the material sun and worshipped fire! ⁄ They filled to overflowing the cup of their suffering; ⁄ they have been crowned with their blood shed for the sake of Christ! ⁄ They call us, lovers of piety, saying: ⁄ Come, feast as you behold our sufferings: ⁄ Look upon our crowns and honors! ⁄ For Christ has truly said: ⁄ He who endures to the end is saved! ⁄⁄ Come, share our crowns and take us as intercessors before the Lord!
ltx/en_us_oca/me.m11.d02:meVE.SticStavrotheotokion.greekmelody	@ltx/en_us_oca/he.a.m6:heAU.OlinApothemenoi.greekname
ltx/en_us_oca/me.m11.d02:meVE.SticStavrotheotokion.incipit	@ltx/en_us_oca/me.m02.d17:meMA.LaudsStavrotheotokion.incipit
ltx/en_us_oca/me.m11.d02:meVE.SticStavrotheotokion.melody	@ltx/en_us_oca/he.a.m6:heAU.OlinApothemenoi.notmetered
ltx/en_us_oca/me.m11.d02:meVE.SticStavrotheotokion.mode	@ltx/en_us_oca/miscellanea:misc.Mode6
ltx/en_us_oca/me.m11.d02:meVE.SticStavrotheotokion.text	@ltx/en_us_oca/me.m02.d17:meMA.LaudsStavrotheotokion.text
ltx/en_us_oca/me.m11.d02:meVE.SticTheotokion.greekmelody	@ltx/en_us_oca/he.a.m6:heAU.OlinApothemenoi.greekname
ltx/en_us_oca/me.m11.d02:meVE.SticTheotokion.incipit	…
ltx/en_us_oca/me.m11.d02:meVE.SticTheotokion.melody	@ltx/en_us_oca/he.a.m6:heAU.OlinApothemenoi.notmetered
ltx/en_us_oca/me.m11.d02:meVE.SticTheotokion.mode	@ltx/en_us_oca/miscellanea:misc.Mode6
ltx/en_us_oca/me.m11.d02:meVE.SticTheotokion.text	
ltx/en_us_oca/me.m11.d02:meVE.Stichera01.greekmelody	@ltx/en_us_oca/he.a.m4:heAU.OsGennaionEnMartysi.greekname
ltx/en_us_oca/me.m11.d02:meVE.Stichera01.incipit	Let us hymn the company…
ltx/en_us_oca/me.m11.d02:meVE.Stichera01.melody	@ltx/en_us_oca/he.a.m4:heAU.OsGennaionEnMartysi.notmetered
ltx/en_us_oca/me.m11.d02:meVE.Stichera01.mode	@ltx/en_us_oca/miscellanea:misc.Mode4
ltx/en_us_oca/me.m11.d02:meVE.Stichera01.text	Let us hymn the company of the five martyrs: ⁄ The wise Acindynus ⁄ with Pegasus and Elpidephorus, ⁄ Aphthonius and Anempodistus! ⁄ They are valiant athletes and fervent protectors. ⁄ They pour forth abundant grace and unfailing hope, ⁄ granting them freely to the faithful!
ltx/en_us_oca/me.m11.d02:meVE.Stichera02.incipit	Neither hunger, nor tribulation, ⁄…
ltx/en_us_oca/me.m11.d02:meVE.Stichera02.melody	@ltx/en_us_oca/he.a.m4:heAU.OsGennaionEnMartysi.notmetered
ltx/en_us_oca/me.m11.d02:meVE.Stichera02.mode	@ltx/en_us_oca/miscellanea:misc.Mode4
ltx/en_us_oca/me.m11.d02:meVE.Stichera02.text	Neither hunger, nor tribulation, ⁄ nor boiling cauldrons nor the depths of the earth, ⁄ neither life nor death ⁄ nor even the mouths of wild beasts ⁄ could separate your brave deeds of patient endurance from the love of Christ! ⁄ You continually directed your gaze towards Him: ⁄⁄ Desiring Him alone, you vanquished the enemy!
ltx/en_us_oca/me.m11.d02:meVE.Stichera03.incipit	As you delight in sweetness…
ltx/en_us_oca/me.m11.d02:meVE.Stichera03.melody	@ltx/en_us_oca/he.a.m4:heAU.OsGennaionEnMartysi.notmetered
ltx/en_us_oca/me.m11.d02:meVE.Stichera03.mode	@ltx/en_us_oca/miscellanea:misc.Mode4
ltx/en_us_oca/me.m11.d02:meVE.Stichera03.text	As you delight in sweetness and are filled with light, ⁄ inheriting eternal life, divinely wise ones, ⁄ deliver those who pray to you and honor your place of martyrdom ⁄ from misfortunes, bondage and imprisonment! ⁄ For you have boldness before God and great mercy ⁄⁄ as true imitators and followers of Christ!
