ltx/en_us_oca/me.m01.d12:meDA.commemoration.first	
ltx/en_us_oca/me.m01.d12:meDA.commemoration.first_name	
ltx/en_us_oca/me.m01.d12:meDA.commemoration.first_short	
ltx/en_us_oca/me.m01.d12:meDA.commemoration.first_title	
ltx/en_us_oca/me.m01.d12:meDA.commemoration.full	
ltx/en_us_oca/me.m01.d12:meDA.commemoration.second_name	
ltx/en_us_oca/me.m01.d12:meDA.commemoration.second_title	
ltx/en_us_oca/me.m01.d12:meDA.date	
ltx/en_us_oca/me.m01.d12:meDA.dismissal	@ltx/en_us_oca/dismissals:dis00.epiphany
ltx/en_us_oca/me.m01.d12:meDA.fordate	
ltx/en_us_oca/me.m01.d12:meDA.insert1	
ltx/en_us_oca/me.m01.d12:meDA.insert2	
ltx/en_us_oca/me.m01.d12:meDA.note	
ltx/en_us_oca/me.m01.d12:meDA.pdfcoverdate	
ltx/en_us_oca/me.m01.d12:meDA.pdfheaderdate	
ltx/en_us_oca/me.m01.d12:meHO.commemorations	
ltx/en_us_oca/me.m01.d12:meHO.note1	
ltx/en_us_oca/me.m01.d12:meHO.note2	
ltx/en_us_oca/me.m01.d12:meHO.number	
ltx/en_us_oca/me.m01.d12:meHO.rank	
ltx/en_us_oca/me.m01.d12:meLE.commemoration1	
ltx/en_us_oca/me.m01.d12:meLE.commemoration2	
ltx/en_us_oca/me.m01.d12:meLI.Kontakion1.incipit	…
ltx/en_us_oca/me.m01.d12:meLI.Kontakion1.melody	
ltx/en_us_oca/me.m01.d12:meLI.Kontakion1.mode	
ltx/en_us_oca/me.m01.d12:meLI.Kontakion1.text	
ltx/en_us_oca/me.m01.d12:meLI.Megalynarion.text	
ltx/en_us_oca/me.m01.d12:meMA.AposGlory.incipit	What goodness of God, beyond…
ltx/en_us_oca/me.m01.d12:meMA.AposGlory.melody	@ltx/en_us_oca/he.a.m6:heAU.AiAngelikai.notmetered
ltx/en_us_oca/me.m01.d12:meMA.AposGlory.mode	@ltx/en_us_oca/miscellanea:misc.Mode6
ltx/en_us_oca/me.m01.d12:meMA.AposGlory.text	What goodness of God, beyond words and understanding! ⁄ How can the Creator come to bow His head beneath the creature? ⁄ He teaches humility by example ⁄ to us who desire illumination of soul! ⁄ Therefore we sing to Him: ⁄⁄ Blessed is our God made manifest! Glory to You!
ltx/en_us_oca/me.m01.d12:meMA.Aposticha1.greekmelody	@ltx/en_us_oca/he.a.m6:heAU.AiAngelikai.greekname
ltx/en_us_oca/me.m01.d12:meMA.Aposticha1.incipit	My Jesus, You are Light…
ltx/en_us_oca/me.m01.d12:meMA.Aposticha1.melody	@ltx/en_us_oca/he.a.m6:heAU.AiAngelikai.notmetered
ltx/en_us_oca/me.m01.d12:meMA.Aposticha1.mode	@ltx/en_us_oca/miscellanea:misc.Mode6
ltx/en_us_oca/me.m01.d12:meMA.Aposticha1.text	My Jesus, You are Light shining from light. ⁄ You have enlightened us with an ineffable radiance! ⁄ We were blinded in Eden by the serpent long ago, ⁄ but now the dazzling light in Jordan has opened our eyes. ⁄ We sing to You in faith: ⁄⁄ Blessed is our God made manifest! Glory to You!
ltx/en_us_oca/me.m01.d12:meMA.Aposticha2.incipit	To you were disclosed the…
ltx/en_us_oca/me.m01.d12:meMA.Aposticha2.melody	@ltx/en_us_oca/he.a.m6:heAU.AiAngelikai.notmetered
ltx/en_us_oca/me.m01.d12:meMA.Aposticha2.mode	@ltx/en_us_oca/miscellanea:misc.Mode6
ltx/en_us_oca/me.m01.d12:meMA.Aposticha2.text	To you were disclosed the secrets of God, ⁄ steward of mysteries, Forerunner of joy. ⁄ You spoke with the Holy Spirit; ⁄ by you the Word was baptized, in His good will! ⁄ He has granted eternal redemption from sin ⁄ to those who sing to Him: ⁄⁄ Blessed is our God made manifest! Glory to You!
ltx/en_us_oca/me.m01.d12:meMA.Aposticha3.incipit	Come, faithful; let us seek…
ltx/en_us_oca/me.m01.d12:meMA.Aposticha3.melody	@ltx/en_us_oca/he.a.m6:heAU.AiAngelikai.notmetered
ltx/en_us_oca/me.m01.d12:meMA.Aposticha3.mode	@ltx/en_us_oca/miscellanea:misc.Mode6
ltx/en_us_oca/me.m01.d12:meMA.Aposticha3.text	Come, faithful; let us seek wisdom of heart! ⁄ Let us run in haste to the streams of Jordan! ⁄ Let us see the Creator baptized in the flesh by John the Forerunner; ⁄ let us join Him with thoughts of things divine ⁄⁄ singing: Blessed is our God made manifest! Glory to You!
ltx/en_us_oca/me.m01.d12:meMA.C1.title	@ltx/en_us_oca/titles:ti.CanonSaintW
ltx/en_us_oca/me.m01.d12:meMA.C1.verse	@ltx/en_us_oca/prayers:pr.verse_SaintW.text
ltx/en_us_oca/me.m01.d12:meMA.Exaposteilarion1.greekmelody	@ltx/en_us_oca/he.a.m3:heAU.EpefaniOSotir.greekname
ltx/en_us_oca/me.m01.d12:meMA.Exaposteilarion1.incipit	…
ltx/en_us_oca/me.m01.d12:meMA.Exaposteilarion1.melody	@ltx/en_us_oca/he.a.m3:heAU.EpefaniOSotir.notmetered
ltx/en_us_oca/me.m01.d12:meMA.Exaposteilarion1.mode	@ltx/en_us_oca/miscellanea:misc.Mode3
ltx/en_us_oca/me.m01.d12:meMA.Exaposteilarion1.text	
ltx/en_us_oca/me.m01.d12:meMA.Exaposteilarion2.greekmelody	@ltx/en_us_oca/he.a.m3:heAU.EpefaniOSotir.greekname
ltx/en_us_oca/me.m01.d12:meMA.Exaposteilarion2.incipit	@ltx/en_us_oca/he.a.m3:heAU.EpefaniOSotir.incipit
ltx/en_us_oca/me.m01.d12:meMA.Exaposteilarion2.melody	@ltx/en_us_oca/he.a.m3:heAU.EpefaniOSotir.melody
ltx/en_us_oca/me.m01.d12:meMA.Exaposteilarion2.mode	@ltx/en_us_oca/miscellanea:misc.Mode3
ltx/en_us_oca/me.m01.d12:meMA.Exaposteilarion2.text	@ltx/en_us_oca/he.a.m3:heAU.EpefaniOSotir.text
ltx/en_us_oca/me.m01.d12:meMA.Kathisma11.greekmelody	@ltx/en_us_oca/he.a.m4:heAU.KateplagiIosif.greekname
ltx/en_us_oca/me.m01.d12:meMA.Kathisma11.incipit	@ltx/en_us_oca/me.m01.d06:meMA.Kathisma21.incipit
ltx/en_us_oca/me.m01.d12:meMA.Kathisma11.melody	@ltx/en_us_oca/he.a.m4:heAU.KateplagiIosif.notmetered
ltx/en_us_oca/me.m01.d12:meMA.Kathisma11.mode	@ltx/en_us_oca/miscellanea:misc.Mode4
ltx/en_us_oca/me.m01.d12:meMA.Kathisma11.text	@ltx/en_us_oca/me.m01.d06:meMA.Kathisma21.text
ltx/en_us_oca/me.m01.d12:meMA.Kathisma21.greekmelody	@ltx/en_us_oca/he.a.m8:heAU.AnestisEkNekron.greekname
ltx/en_us_oca/me.m01.d12:meMA.Kathisma21.incipit	@ltx/en_us_oca/me.m01.d08:meMA.Kathisma21.incipit
ltx/en_us_oca/me.m01.d12:meMA.Kathisma21.melody	@ltx/en_us_oca/he.a.m8:heAU.AnestisEkNekron.notmetered
ltx/en_us_oca/me.m01.d12:meMA.Kathisma21.mode	@ltx/en_us_oca/miscellanea:misc.Mode8
ltx/en_us_oca/me.m01.d12:meMA.Kathisma21.text	@ltx/en_us_oca/me.m01.d08:meMA.Kathisma21.text
ltx/en_us_oca/me.m01.d12:meMA.Ode1C11.greekmelody	@ltx/en_us_oca/he.h.m2:heHE.DefteLaoi.greekname
ltx/en_us_oca/me.m01.d12:meMA.Ode1C11.incipit	…
ltx/en_us_oca/me.m01.d12:meMA.Ode1C11.melody	@ltx/en_us_oca/he.h.m2:heHE.DefteLaoi.notmetered
ltx/en_us_oca/me.m01.d12:meMA.Ode1C11.mode	@ltx/en_us_oca/miscellanea:misc.Mode2
ltx/en_us_oca/me.m01.d12:meMA.Ode1C11.ode	@ltx/en_us_oca/miscellanea:misc.Ode1
ltx/en_us_oca/me.m01.d12:meMA.Ode1C11.text	
ltx/en_us_oca/me.m01.d12:meMA.Ode1C12.incipit	…
ltx/en_us_oca/me.m01.d12:meMA.Ode1C12.melody	@ltx/en_us_oca/he.h.m2:heHE.DefteLaoi.notmetered
ltx/en_us_oca/me.m01.d12:meMA.Ode1C12.mode	@ltx/en_us_oca/miscellanea:misc.Mode2
ltx/en_us_oca/me.m01.d12:meMA.Ode1C12.ode	@ltx/en_us_oca/miscellanea:misc.Ode1
ltx/en_us_oca/me.m01.d12:meMA.Ode1C12.text	
ltx/en_us_oca/me.m01.d12:meMA.Ode1C13.incipit	…
ltx/en_us_oca/me.m01.d12:meMA.Ode1C13.melody	@ltx/en_us_oca/he.h.m2:heHE.DefteLaoi.notmetered
ltx/en_us_oca/me.m01.d12:meMA.Ode1C13.mode	@ltx/en_us_oca/miscellanea:misc.Mode2
ltx/en_us_oca/me.m01.d12:meMA.Ode1C13.ode	@ltx/en_us_oca/miscellanea:misc.Ode1
ltx/en_us_oca/me.m01.d12:meMA.Ode1C13.text	
ltx/en_us_oca/me.m01.d12:meMA.Ode1C1T.incipit	…
ltx/en_us_oca/me.m01.d12:meMA.Ode1C1T.melody	@ltx/en_us_oca/he.h.m2:heHE.DefteLaoi.notmetered
ltx/en_us_oca/me.m01.d12:meMA.Ode1C1T.mode	@ltx/en_us_oca/miscellanea:misc.Mode2
ltx/en_us_oca/me.m01.d12:meMA.Ode1C1T.ode	@ltx/en_us_oca/miscellanea:misc.Ode1
ltx/en_us_oca/me.m01.d12:meMA.Ode1C1T.text	
ltx/en_us_oca/me.m01.d12:meMA.Ode3C11.greekmelody	@ltx/en_us_oca/he.h.m2:heHE.EnPetraMeTisPisteos.greekname
ltx/en_us_oca/me.m01.d12:meMA.Ode3C11.incipit	…
ltx/en_us_oca/me.m01.d12:meMA.Ode3C11.melody	@ltx/en_us_oca/he.h.m2:heHE.EnPetraMeTisPisteos.notmetered
ltx/en_us_oca/me.m01.d12:meMA.Ode3C11.mode	@ltx/en_us_oca/miscellanea:misc.Mode2
ltx/en_us_oca/me.m01.d12:meMA.Ode3C11.ode	@ltx/en_us_oca/miscellanea:misc.Ode3
ltx/en_us_oca/me.m01.d12:meMA.Ode3C11.text	
ltx/en_us_oca/me.m01.d12:meMA.Ode3C12.incipit	…
ltx/en_us_oca/me.m01.d12:meMA.Ode3C12.melody	@ltx/en_us_oca/he.h.m2:heHE.EnPetraMeTisPisteos.notmetered
ltx/en_us_oca/me.m01.d12:meMA.Ode3C12.mode	@ltx/en_us_oca/miscellanea:misc.Mode2
ltx/en_us_oca/me.m01.d12:meMA.Ode3C12.ode	@ltx/en_us_oca/miscellanea:misc.Ode3
ltx/en_us_oca/me.m01.d12:meMA.Ode3C12.text	
ltx/en_us_oca/me.m01.d12:meMA.Ode3C13.incipit	…
ltx/en_us_oca/me.m01.d12:meMA.Ode3C13.melody	@ltx/en_us_oca/he.h.m2:heHE.EnPetraMeTisPisteos.notmetered
ltx/en_us_oca/me.m01.d12:meMA.Ode3C13.mode	@ltx/en_us_oca/miscellanea:misc.Mode2
ltx/en_us_oca/me.m01.d12:meMA.Ode3C13.ode	@ltx/en_us_oca/miscellanea:misc.Ode3
ltx/en_us_oca/me.m01.d12:meMA.Ode3C13.text	
ltx/en_us_oca/me.m01.d12:meMA.Ode3C1T.incipit	…
ltx/en_us_oca/me.m01.d12:meMA.Ode3C1T.melody	@ltx/en_us_oca/he.h.m2:heHE.EnPetraMeTisPisteos.notmetered
ltx/en_us_oca/me.m01.d12:meMA.Ode3C1T.mode	@ltx/en_us_oca/miscellanea:misc.Mode2
ltx/en_us_oca/me.m01.d12:meMA.Ode3C1T.ode	@ltx/en_us_oca/miscellanea:misc.Ode3
ltx/en_us_oca/me.m01.d12:meMA.Ode3C1T.text	
ltx/en_us_oca/me.m01.d12:meMA.Ode3H.greekmelody	@ltx/en_us_oca/he.h.m2:heHE.EnPetraMeTisPisteos.greekname
ltx/en_us_oca/me.m01.d12:meMA.Ode3H.incipit	@ltx/en_us_oca/he.h.m2:heHE.EnPetraMeTisPisteos.incipit
ltx/en_us_oca/me.m01.d12:meMA.Ode3H.melody	@ltx/en_us_oca/he.h.m2:heHE.EnPetraMeTisPisteos.melody
ltx/en_us_oca/me.m01.d12:meMA.Ode3H.mode	@ltx/en_us_oca/miscellanea:misc.Mode2
ltx/en_us_oca/me.m01.d12:meMA.Ode3H.ode	@ltx/en_us_oca/miscellanea:misc.Ode3
ltx/en_us_oca/me.m01.d12:meMA.Ode3H.text	@ltx/en_us_oca/he.h.m2:heHE.EnPetraMeTisPisteos.text
ltx/en_us_oca/me.m01.d12:meMA.Ode3Kathisma1.greekmelody	@ltx/en_us_oca/he.a.m1:heAU.TonTafonSouSotir.greekname
ltx/en_us_oca/me.m01.d12:meMA.Ode3Kathisma1.incipit	…
ltx/en_us_oca/me.m01.d12:meMA.Ode3Kathisma1.melody	@ltx/en_us_oca/he.a.m1:heAU.TonTafonSouSotir.notmetered
ltx/en_us_oca/me.m01.d12:meMA.Ode3Kathisma1.mode	@ltx/en_us_oca/miscellanea:misc.Mode1
ltx/en_us_oca/me.m01.d12:meMA.Ode3Kathisma1.text	
ltx/en_us_oca/me.m01.d12:meMA.Ode3Kathisma2.greekmelody	@ltx/en_us_oca/he.a.m1:heAU.TonTafonSouSotir.greekname
ltx/en_us_oca/me.m01.d12:meMA.Ode3Kathisma2.incipit	…
ltx/en_us_oca/me.m01.d12:meMA.Ode3Kathisma2.melody	@ltx/en_us_oca/he.a.m1:heAU.TonTafonSouSotir.notmetered
ltx/en_us_oca/me.m01.d12:meMA.Ode3Kathisma2.mode	@ltx/en_us_oca/miscellanea:misc.Mode1
ltx/en_us_oca/me.m01.d12:meMA.Ode3Kathisma2.text	
ltx/en_us_oca/me.m01.d12:meMA.Ode4C11.greekmelody	@ltx/en_us_oca/he.h.m2:heHE.YmnoSeAkoi.greekname
ltx/en_us_oca/me.m01.d12:meMA.Ode4C11.incipit	…
ltx/en_us_oca/me.m01.d12:meMA.Ode4C11.melody	@ltx/en_us_oca/he.h.m2:heHE.YmnoSeAkoi.notmetered
ltx/en_us_oca/me.m01.d12:meMA.Ode4C11.mode	@ltx/en_us_oca/miscellanea:misc.Mode2
ltx/en_us_oca/me.m01.d12:meMA.Ode4C11.ode	@ltx/en_us_oca/miscellanea:misc.Ode4
ltx/en_us_oca/me.m01.d12:meMA.Ode4C11.text	
ltx/en_us_oca/me.m01.d12:meMA.Ode4C12.incipit	…
ltx/en_us_oca/me.m01.d12:meMA.Ode4C12.melody	@ltx/en_us_oca/he.h.m2:heHE.YmnoSeAkoi.notmetered
ltx/en_us_oca/me.m01.d12:meMA.Ode4C12.mode	@ltx/en_us_oca/miscellanea:misc.Mode2
ltx/en_us_oca/me.m01.d12:meMA.Ode4C12.ode	@ltx/en_us_oca/miscellanea:misc.Ode4
ltx/en_us_oca/me.m01.d12:meMA.Ode4C12.text	
ltx/en_us_oca/me.m01.d12:meMA.Ode4C13.incipit	…
ltx/en_us_oca/me.m01.d12:meMA.Ode4C13.melody	@ltx/en_us_oca/he.h.m2:heHE.YmnoSeAkoi.notmetered
ltx/en_us_oca/me.m01.d12:meMA.Ode4C13.mode	@ltx/en_us_oca/miscellanea:misc.Mode2
ltx/en_us_oca/me.m01.d12:meMA.Ode4C13.ode	@ltx/en_us_oca/miscellanea:misc.Ode4
ltx/en_us_oca/me.m01.d12:meMA.Ode4C13.text	
ltx/en_us_oca/me.m01.d12:meMA.Ode4C1T.incipit	…
ltx/en_us_oca/me.m01.d12:meMA.Ode4C1T.melody	@ltx/en_us_oca/he.h.m2:heHE.YmnoSeAkoi.notmetered
ltx/en_us_oca/me.m01.d12:meMA.Ode4C1T.mode	@ltx/en_us_oca/miscellanea:misc.Mode2
ltx/en_us_oca/me.m01.d12:meMA.Ode4C1T.ode	@ltx/en_us_oca/miscellanea:misc.Ode4
ltx/en_us_oca/me.m01.d12:meMA.Ode4C1T.text	
ltx/en_us_oca/me.m01.d12:meMA.Ode5C11.greekmelody	@ltx/en_us_oca/he.h.m2:heHE.OFotismos.greekname
ltx/en_us_oca/me.m01.d12:meMA.Ode5C11.incipit	…
ltx/en_us_oca/me.m01.d12:meMA.Ode5C11.melody	@ltx/en_us_oca/he.h.m2:heHE.OFotismos.notmetered
ltx/en_us_oca/me.m01.d12:meMA.Ode5C11.mode	@ltx/en_us_oca/miscellanea:misc.Mode2
ltx/en_us_oca/me.m01.d12:meMA.Ode5C11.ode	@ltx/en_us_oca/miscellanea:misc.Ode5
ltx/en_us_oca/me.m01.d12:meMA.Ode5C11.text	
ltx/en_us_oca/me.m01.d12:meMA.Ode5C12.incipit	…
ltx/en_us_oca/me.m01.d12:meMA.Ode5C12.melody	@ltx/en_us_oca/he.h.m2:heHE.OFotismos.notmetered
ltx/en_us_oca/me.m01.d12:meMA.Ode5C12.mode	@ltx/en_us_oca/miscellanea:misc.Mode2
ltx/en_us_oca/me.m01.d12:meMA.Ode5C12.ode	@ltx/en_us_oca/miscellanea:misc.Ode5
ltx/en_us_oca/me.m01.d12:meMA.Ode5C12.text	
ltx/en_us_oca/me.m01.d12:meMA.Ode5C13.incipit	…
ltx/en_us_oca/me.m01.d12:meMA.Ode5C13.melody	@ltx/en_us_oca/he.h.m2:heHE.OFotismos.notmetered
ltx/en_us_oca/me.m01.d12:meMA.Ode5C13.mode	@ltx/en_us_oca/miscellanea:misc.Mode2
ltx/en_us_oca/me.m01.d12:meMA.Ode5C13.ode	@ltx/en_us_oca/miscellanea:misc.Ode5
ltx/en_us_oca/me.m01.d12:meMA.Ode5C13.text	
ltx/en_us_oca/me.m01.d12:meMA.Ode5C1T.incipit	…
ltx/en_us_oca/me.m01.d12:meMA.Ode5C1T.melody	@ltx/en_us_oca/he.h.m2:heHE.OFotismos.notmetered
ltx/en_us_oca/me.m01.d12:meMA.Ode5C1T.mode	@ltx/en_us_oca/miscellanea:misc.Mode2
ltx/en_us_oca/me.m01.d12:meMA.Ode5C1T.ode	@ltx/en_us_oca/miscellanea:misc.Ode5
ltx/en_us_oca/me.m01.d12:meMA.Ode5C1T.text	
ltx/en_us_oca/me.m01.d12:meMA.Ode6C11.greekmelody	@ltx/en_us_oca/he.h.m2:heHE.EnAvyssoPtaismaton.greekname
ltx/en_us_oca/me.m01.d12:meMA.Ode6C11.incipit	…
ltx/en_us_oca/me.m01.d12:meMA.Ode6C11.melody	@ltx/en_us_oca/he.h.m2:heHE.EnAvyssoPtaismaton.notmetered
ltx/en_us_oca/me.m01.d12:meMA.Ode6C11.mode	@ltx/en_us_oca/miscellanea:misc.Mode2
ltx/en_us_oca/me.m01.d12:meMA.Ode6C11.ode	@ltx/en_us_oca/miscellanea:misc.Ode6
ltx/en_us_oca/me.m01.d12:meMA.Ode6C11.text	
ltx/en_us_oca/me.m01.d12:meMA.Ode6C12.incipit	…
ltx/en_us_oca/me.m01.d12:meMA.Ode6C12.melody	@ltx/en_us_oca/he.h.m2:heHE.EnAvyssoPtaismaton.notmetered
ltx/en_us_oca/me.m01.d12:meMA.Ode6C12.mode	@ltx/en_us_oca/miscellanea:misc.Mode2
ltx/en_us_oca/me.m01.d12:meMA.Ode6C12.ode	@ltx/en_us_oca/miscellanea:misc.Ode6
ltx/en_us_oca/me.m01.d12:meMA.Ode6C12.text	
ltx/en_us_oca/me.m01.d12:meMA.Ode6C13.incipit	…
ltx/en_us_oca/me.m01.d12:meMA.Ode6C13.melody	@ltx/en_us_oca/he.h.m2:heHE.EnAvyssoPtaismaton.notmetered
ltx/en_us_oca/me.m01.d12:meMA.Ode6C13.mode	@ltx/en_us_oca/miscellanea:misc.Mode2
ltx/en_us_oca/me.m01.d12:meMA.Ode6C13.ode	@ltx/en_us_oca/miscellanea:misc.Ode6
ltx/en_us_oca/me.m01.d12:meMA.Ode6C13.text	
ltx/en_us_oca/me.m01.d12:meMA.Ode6C1T.incipit	…
ltx/en_us_oca/me.m01.d12:meMA.Ode6C1T.melody	@ltx/en_us_oca/he.h.m2:heHE.EnAvyssoPtaismaton.notmetered
ltx/en_us_oca/me.m01.d12:meMA.Ode6C1T.mode	@ltx/en_us_oca/miscellanea:misc.Mode2
ltx/en_us_oca/me.m01.d12:meMA.Ode6C1T.ode	@ltx/en_us_oca/miscellanea:misc.Ode6
ltx/en_us_oca/me.m01.d12:meMA.Ode6C1T.text	
ltx/en_us_oca/me.m01.d12:meMA.Ode6H.greekmelody	@ltx/en_us_oca/he.h.m2:heHE.EnAvyssoPtaismaton.greekname
ltx/en_us_oca/me.m01.d12:meMA.Ode6H.incipit	@ltx/en_us_oca/he.h.m2:heHE.EnAvyssoPtaismaton.incipit
ltx/en_us_oca/me.m01.d12:meMA.Ode6H.melody	@ltx/en_us_oca/he.h.m2:heHE.EnAvyssoPtaismaton.melody
ltx/en_us_oca/me.m01.d12:meMA.Ode6H.mode	@ltx/en_us_oca/miscellanea:misc.Mode2
ltx/en_us_oca/me.m01.d12:meMA.Ode6H.ode	@ltx/en_us_oca/miscellanea:misc.Ode6
ltx/en_us_oca/me.m01.d12:meMA.Ode6H.text	@ltx/en_us_oca/he.h.m2:heHE.EnAvyssoPtaismaton.text
ltx/en_us_oca/me.m01.d12:meMA.Ode7C11.greekmelody	@ltx/en_us_oca/he.h.m2:heHE.AntitheonProstagma.greekname
ltx/en_us_oca/me.m01.d12:meMA.Ode7C11.incipit	…
ltx/en_us_oca/me.m01.d12:meMA.Ode7C11.melody	@ltx/en_us_oca/he.h.m2:heHE.AntitheonProstagma.notmetered
ltx/en_us_oca/me.m01.d12:meMA.Ode7C11.mode	@ltx/en_us_oca/miscellanea:misc.Mode2
ltx/en_us_oca/me.m01.d12:meMA.Ode7C11.ode	@ltx/en_us_oca/miscellanea:misc.Ode7
ltx/en_us_oca/me.m01.d12:meMA.Ode7C11.text	
ltx/en_us_oca/me.m01.d12:meMA.Ode7C12.incipit	…
ltx/en_us_oca/me.m01.d12:meMA.Ode7C12.melody	@ltx/en_us_oca/he.h.m2:heHE.AntitheonProstagma.notmetered
ltx/en_us_oca/me.m01.d12:meMA.Ode7C12.mode	@ltx/en_us_oca/miscellanea:misc.Mode2
ltx/en_us_oca/me.m01.d12:meMA.Ode7C12.ode	@ltx/en_us_oca/miscellanea:misc.Ode7
ltx/en_us_oca/me.m01.d12:meMA.Ode7C12.text	
ltx/en_us_oca/me.m01.d12:meMA.Ode7C13.incipit	…
ltx/en_us_oca/me.m01.d12:meMA.Ode7C13.melody	@ltx/en_us_oca/he.h.m2:heHE.AntitheonProstagma.notmetered
ltx/en_us_oca/me.m01.d12:meMA.Ode7C13.mode	@ltx/en_us_oca/miscellanea:misc.Mode2
ltx/en_us_oca/me.m01.d12:meMA.Ode7C13.ode	@ltx/en_us_oca/miscellanea:misc.Ode7
ltx/en_us_oca/me.m01.d12:meMA.Ode7C13.text	
ltx/en_us_oca/me.m01.d12:meMA.Ode7C1T.incipit	…
ltx/en_us_oca/me.m01.d12:meMA.Ode7C1T.melody	@ltx/en_us_oca/he.h.m2:heHE.AntitheonProstagma.notmetered
ltx/en_us_oca/me.m01.d12:meMA.Ode7C1T.mode	@ltx/en_us_oca/miscellanea:misc.Mode2
ltx/en_us_oca/me.m01.d12:meMA.Ode7C1T.ode	@ltx/en_us_oca/miscellanea:misc.Ode7
ltx/en_us_oca/me.m01.d12:meMA.Ode7C1T.text	
ltx/en_us_oca/me.m01.d12:meMA.Ode8C11.greekmelody	@ltx/en_us_oca/he.h.m2:heHE.TonEnKaminoTouPyros.greekname
ltx/en_us_oca/me.m01.d12:meMA.Ode8C11.incipit	…
ltx/en_us_oca/me.m01.d12:meMA.Ode8C11.melody	@ltx/en_us_oca/he.h.m2:heHE.TonEnKaminoTouPyros.notmetered
ltx/en_us_oca/me.m01.d12:meMA.Ode8C11.mode	@ltx/en_us_oca/miscellanea:misc.Mode2
ltx/en_us_oca/me.m01.d12:meMA.Ode8C11.ode	@ltx/en_us_oca/miscellanea:misc.Ode8
ltx/en_us_oca/me.m01.d12:meMA.Ode8C11.text	
ltx/en_us_oca/me.m01.d12:meMA.Ode8C12.incipit	…
ltx/en_us_oca/me.m01.d12:meMA.Ode8C12.melody	@ltx/en_us_oca/he.h.m2:heHE.TonEnKaminoTouPyros.notmetered
ltx/en_us_oca/me.m01.d12:meMA.Ode8C12.mode	@ltx/en_us_oca/miscellanea:misc.Mode2
ltx/en_us_oca/me.m01.d12:meMA.Ode8C12.ode	@ltx/en_us_oca/miscellanea:misc.Ode8
ltx/en_us_oca/me.m01.d12:meMA.Ode8C12.text	
ltx/en_us_oca/me.m01.d12:meMA.Ode8C13.incipit	…
ltx/en_us_oca/me.m01.d12:meMA.Ode8C13.melody	@ltx/en_us_oca/he.h.m2:heHE.TonEnKaminoTouPyros.notmetered
ltx/en_us_oca/me.m01.d12:meMA.Ode8C13.mode	@ltx/en_us_oca/miscellanea:misc.Mode2
ltx/en_us_oca/me.m01.d12:meMA.Ode8C13.ode	@ltx/en_us_oca/miscellanea:misc.Ode8
ltx/en_us_oca/me.m01.d12:meMA.Ode8C13.text	
ltx/en_us_oca/me.m01.d12:meMA.Ode8C1T.incipit	…
ltx/en_us_oca/me.m01.d12:meMA.Ode8C1T.melody	@ltx/en_us_oca/he.h.m2:heHE.TonEnKaminoTouPyros.notmetered
ltx/en_us_oca/me.m01.d12:meMA.Ode8C1T.mode	@ltx/en_us_oca/miscellanea:misc.Mode2
ltx/en_us_oca/me.m01.d12:meMA.Ode8C1T.ode	@ltx/en_us_oca/miscellanea:misc.Ode8
ltx/en_us_oca/me.m01.d12:meMA.Ode8C1T.text	
ltx/en_us_oca/me.m01.d12:meMA.Ode8H.greekmelody	@ltx/en_us_oca/he.h.m2:heHE.TonEnKaminoTouPyros.greekname
ltx/en_us_oca/me.m01.d12:meMA.Ode8H.incipit	@ltx/en_us_oca/he.h.m2:heHE.TonEnKaminoTouPyros.incipit
ltx/en_us_oca/me.m01.d12:meMA.Ode8H.melody	@ltx/en_us_oca/he.h.m2:heHE.TonEnKaminoTouPyros.melody
ltx/en_us_oca/me.m01.d12:meMA.Ode8H.mode	@ltx/en_us_oca/miscellanea:misc.Mode2
ltx/en_us_oca/me.m01.d12:meMA.Ode8H.ode	@ltx/en_us_oca/miscellanea:misc.Ode8
ltx/en_us_oca/me.m01.d12:meMA.Ode8H.text	@ltx/en_us_oca/he.h.m2:heHE.TonEnKaminoTouPyros.text
ltx/en_us_oca/me.m01.d12:meMA.Ode9C11.greekmelody	@ltx/en_us_oca/he.h.m2:heHE.TonEkTheouTheonLogon.greekname
ltx/en_us_oca/me.m01.d12:meMA.Ode9C11.incipit	…
ltx/en_us_oca/me.m01.d12:meMA.Ode9C11.melody	@ltx/en_us_oca/he.h.m2:heHE.TonEkTheouTheonLogon.notmetered
ltx/en_us_oca/me.m01.d12:meMA.Ode9C11.mode	@ltx/en_us_oca/miscellanea:misc.Mode2
ltx/en_us_oca/me.m01.d12:meMA.Ode9C11.ode	@ltx/en_us_oca/miscellanea:misc.Ode9
ltx/en_us_oca/me.m01.d12:meMA.Ode9C11.text	
ltx/en_us_oca/me.m01.d12:meMA.Ode9C12.incipit	…
ltx/en_us_oca/me.m01.d12:meMA.Ode9C12.melody	@ltx/en_us_oca/he.h.m2:heHE.TonEkTheouTheonLogon.notmetered
ltx/en_us_oca/me.m01.d12:meMA.Ode9C12.mode	@ltx/en_us_oca/miscellanea:misc.Mode2
ltx/en_us_oca/me.m01.d12:meMA.Ode9C12.ode	@ltx/en_us_oca/miscellanea:misc.Ode9
ltx/en_us_oca/me.m01.d12:meMA.Ode9C12.text	
ltx/en_us_oca/me.m01.d12:meMA.Ode9C13.incipit	…
ltx/en_us_oca/me.m01.d12:meMA.Ode9C13.melody	@ltx/en_us_oca/he.h.m2:heHE.TonEkTheouTheonLogon.notmetered
ltx/en_us_oca/me.m01.d12:meMA.Ode9C13.mode	@ltx/en_us_oca/miscellanea:misc.Mode2
ltx/en_us_oca/me.m01.d12:meMA.Ode9C13.ode	@ltx/en_us_oca/miscellanea:misc.Ode9
ltx/en_us_oca/me.m01.d12:meMA.Ode9C13.text	
ltx/en_us_oca/me.m01.d12:meMA.Ode9C1T.incipit	…
ltx/en_us_oca/me.m01.d12:meMA.Ode9C1T.melody	@ltx/en_us_oca/he.h.m2:heHE.TonEkTheouTheonLogon.notmetered
ltx/en_us_oca/me.m01.d12:meMA.Ode9C1T.mode	@ltx/en_us_oca/miscellanea:misc.Mode2
ltx/en_us_oca/me.m01.d12:meMA.Ode9C1T.ode	@ltx/en_us_oca/miscellanea:misc.Ode9
ltx/en_us_oca/me.m01.d12:meMA.Ode9C1T.text	
ltx/en_us_oca/me.m01.d12:meMA.Ode9H.greekmelody	@ltx/en_us_oca/he.h.m2:heHE.TonEkTheouTheonLogon.greekname
ltx/en_us_oca/me.m01.d12:meMA.Ode9H.incipit	@ltx/en_us_oca/he.h.m2:heHE.TonEkTheouTheonLogon.incipit
ltx/en_us_oca/me.m01.d12:meMA.Ode9H.melody	@ltx/en_us_oca/he.h.m2:heHE.TonEkTheouTheonLogon.melody
ltx/en_us_oca/me.m01.d12:meMA.Ode9H.mode	@ltx/en_us_oca/miscellanea:misc.Mode2
ltx/en_us_oca/me.m01.d12:meMA.Ode9H.ode	@ltx/en_us_oca/miscellanea:misc.Ode9
ltx/en_us_oca/me.m01.d12:meMA.Ode9H.text	@ltx/en_us_oca/he.h.m2:heHE.TonEkTheouTheonLogon.text
ltx/en_us_oca/me.m01.d12:meVE.AposGlory.incipit	Faithful, let us praise God’s…
ltx/en_us_oca/me.m01.d12:meVE.AposGlory.melody	
ltx/en_us_oca/me.m01.d12:meVE.AposGlory.mode	@ltx/en_us_oca/miscellanea:misc.Mode6
ltx/en_us_oca/me.m01.d12:meVE.AposGlory.poet	@ltx/en_us_oca/poets:po.Theofanous
ltx/en_us_oca/me.m01.d12:meVE.AposGlory.text	Faithful, let us praise God’s great goodness to us! ⁄ He became man because of our transgressions! ⁄ He alone is clean and undefiled, ⁄ yet He is cleansed in the Jordan, to make us clean! ⁄ He has sanctified both us and the waters! ⁄ He has crushed the heads of the dragons in the waters! ⁄ Let us draw water with gladness, brethren! ⁄ for those who draw with faith, ⁄ the grace of the Holy Spirit is invisibly given by Christ. ⁄⁄ He is our God and the Savior of our souls!
ltx/en_us_oca/me.m01.d12:meVE.Aposticha1.greekmelody	@ltx/en_us_oca/he.a.m6:heAU.AiAngelikai.greekname
ltx/en_us_oca/me.m01.d12:meVE.Aposticha1.incipit	Having seen the prophecies fulfilled…
ltx/en_us_oca/me.m01.d12:meVE.Aposticha1.melody	@ltx/en_us_oca/he.a.m6:heAU.AiAngelikai.notmetered
ltx/en_us_oca/me.m01.d12:meVE.Aposticha1.mode	@ltx/en_us_oca/miscellanea:misc.Mode6
ltx/en_us_oca/me.m01.d12:meVE.Aposticha1.text	Having seen the prophecies fulfilled, ⁄ let us cry to the Lord: ⁄ You have revealed Yourself to us, Creator and Savior! ⁄ in Your compassion, Word! ⁄ You have crushed the mouths of the demons in the Jordan; ⁄ You have enlightened our blindness with Your light, O Christ. ⁄⁄ Blessed is our God made manifest! Glory to You!
ltx/en_us_oca/me.m01.d12:meVE.Aposticha2.incipit	We worship You in love…
ltx/en_us_oca/me.m01.d12:meVE.Aposticha2.melody	@ltx/en_us_oca/he.a.m6:heAU.AiAngelikai.notmetered
ltx/en_us_oca/me.m01.d12:meVE.Aposticha2.mode	@ltx/en_us_oca/miscellanea:misc.Mode6
ltx/en_us_oca/me.m01.d12:meVE.Aposticha2.text	We worship You in love, O Lord! ⁄ You have given us power over the enemy by Your baptism! ⁄ You have willingly fulfilled Your plan for our salvation, ⁄ loosing mortal men from the condemnation ⁄ which expelled us from Eden. ⁄ Therefore we sing to You: ⁄⁄ Blessed is our God made manifest! Glory to You!
ltx/en_us_oca/me.m01.d12:meVE.Aposticha3.incipit	In ancient days we fell…
ltx/en_us_oca/me.m01.d12:meVE.Aposticha3.melody	@ltx/en_us_oca/he.a.m6:heAU.AiAngelikai.notmetered
ltx/en_us_oca/me.m01.d12:meVE.Aposticha3.mode	@ltx/en_us_oca/miscellanea:misc.Mode6
ltx/en_us_oca/me.m01.d12:meVE.Aposticha3.text	In ancient days we fell in Adam, ⁄ and were clothed in corruptible garments of sin; ⁄ today at the streams of Jordan, ⁄ we lay them aside, for the Lord is baptized! ⁄ We converse with the angels, shouting to Him: ⁄⁄ Blessed is our God made manifest! Glory to You!
ltx/en_us_oca/me.m01.d12:meVE.SticGlory.incipit	Seeing You, the Creator, naked…
ltx/en_us_oca/me.m01.d12:meVE.SticGlory.melody	
ltx/en_us_oca/me.m01.d12:meVE.SticGlory.mode	@ltx/en_us_oca/miscellanea:misc.Mode5
ltx/en_us_oca/me.m01.d12:meVE.SticGlory.poet	@ltx/en_us_oca/poets:po.KosmaAgiopolitou
ltx/en_us_oca/me.m01.d12:meVE.SticGlory.text	Seeing You, the Creator, naked in the waters, asking to be baptized, ⁄ the whole created order was struck with confusion and fear! ⁄ The Forerunner was paralyzed, and dared not approach You! ⁄ The sea fled, and the Jordan was driven back! ⁄ The mountains skipped like lambs, beholding You! ⁄ The host of angels surrounding You cried out: ⁄ Wonder! the Savior is stripped naked, ⁄⁄ in His desire to clothe, to save, and to refashion mankind!
ltx/en_us_oca/me.m01.d12:meVE.Stichera01.greekmelody	@ltx/en_us_oca/he.a.m2:heAU.OteEkTouXylou.greekname
ltx/en_us_oca/me.m01.d12:meVE.Stichera01.incipit	In the middle of the…
ltx/en_us_oca/me.m01.d12:meVE.Stichera01.melody	@ltx/en_us_oca/he.a.m2:heAU.OteEkTouXylou.notmetered
ltx/en_us_oca/me.m01.d12:meVE.Stichera01.mode	@ltx/en_us_oca/miscellanea:misc.Mode2
ltx/en_us_oca/me.m01.d12:meVE.Stichera01.text	In the middle of the feast, O faithful, ⁄ let us sing, with purified minds, ⁄ a hymn to the baptism of Christ! ⁄ He came to the Jordan in the flesh! ⁄ He always exists with the Father and the Spirit, by reason of His divinity, ⁄ but now He cries to John: ⁄ Come, Baptist, and baptize Me! ⁄ I want to wash away the filth of the human race, ⁄⁄ as the Lover of mankind!
ltx/en_us_oca/me.m01.d12:meVE.Stichera02.incipit	All the hosts of angels…
ltx/en_us_oca/me.m01.d12:meVE.Stichera02.melody	@ltx/en_us_oca/he.a.m2:heAU.OteEkTouXylou.notmetered
ltx/en_us_oca/me.m01.d12:meVE.Stichera02.mode	@ltx/en_us_oca/miscellanea:misc.Mode2
ltx/en_us_oca/me.m01.d12:meVE.Stichera02.text	All the hosts of angels serve You in fear, O Christ; ⁄ the cherubim dare not gaze on You, their King and God! ⁄ How can You command me to touch Your divine head? ⁄ I am a mere mortal, paralyzed with fear! ⁄⁄ Let not Your terrible divinity burn me, O Christ!
ltx/en_us_oca/me.m01.d12:meVE.Stichera03.incipit	Incarnate of the Virgin, I…
ltx/en_us_oca/me.m01.d12:meVE.Stichera03.melody	@ltx/en_us_oca/he.a.m2:heAU.OteEkTouXylou.notmetered
ltx/en_us_oca/me.m01.d12:meVE.Stichera03.mode	@ltx/en_us_oca/miscellanea:misc.Mode2
ltx/en_us_oca/me.m01.d12:meVE.Stichera03.text	Incarnate of the Virgin, I have come to Jordan’s stream, ⁄ to refashion Adam anew, ⁄ God the Redeemer said to the Forerunner; ⁄ Draw near to Me, the Messiah! Baptize Me in the flesh! ⁄ I was born to share your nature, John! ⁄ How else can I crush the dragon’s heads? ⁄⁄ I am the Lord, Who takes away the sins of the world!
ltx/en_us_oca/me.m01.d12:meVE.Stichera04.greekmelody	@ltx/en_us_oca/he.a.m2:heAU.OteEkTouXylou.greekname
ltx/en_us_oca/me.m01.d12:meVE.Stichera04.incipit	…
ltx/en_us_oca/me.m01.d12:meVE.Stichera04.melody	@ltx/en_us_oca/he.a.m2:heAU.OteEkTouXylou.notmetered
ltx/en_us_oca/me.m01.d12:meVE.Stichera04.mode	@ltx/en_us_oca/miscellanea:misc.Mode2
ltx/en_us_oca/me.m01.d12:meVE.Stichera04.text	
ltx/en_us_oca/me.m01.d12:meVE.Stichera05.incipit	…
ltx/en_us_oca/me.m01.d12:meVE.Stichera05.melody	@ltx/en_us_oca/he.a.m2:heAU.OteEkTouXylou.notmetered
ltx/en_us_oca/me.m01.d12:meVE.Stichera05.mode	@ltx/en_us_oca/miscellanea:misc.Mode2
ltx/en_us_oca/me.m01.d12:meVE.Stichera05.text	
ltx/en_us_oca/me.m01.d12:meVE.Stichera06.incipit	…
ltx/en_us_oca/me.m01.d12:meVE.Stichera06.melody	@ltx/en_us_oca/he.a.m2:heAU.OteEkTouXylou.notmetered
ltx/en_us_oca/me.m01.d12:meVE.Stichera06.mode	@ltx/en_us_oca/miscellanea:misc.Mode2
ltx/en_us_oca/me.m01.d12:meVE.Stichera06.text	
