ltx/en_us_oca/tr.d067:trCO.C1.poet	@ltx/en_us_oca/poets:po.AndreouKritis
ltx/en_us_oca/tr.d067:trCO.Kathisma11.incipit	…
ltx/en_us_oca/tr.d067:trCO.Kathisma11.melody	@ltx/en_us_oca/he.a.m1:heAU.ChorosAngelikos.notmetered
ltx/en_us_oca/tr.d067:trCO.Kathisma11.mode	@ltx/en_us_oca/miscellanea:misc.Mode1
ltx/en_us_oca/tr.d067:trCO.Kathisma11.text	
ltx/en_us_oca/tr.d067:trCO.Ode3C11.incipit	…
ltx/en_us_oca/tr.d067:trCO.Ode3C11.melody	@ltx/en_us_oca/he.h.m2:heHE.SteirothentaMouTonNoun.notmetered
ltx/en_us_oca/tr.d067:trCO.Ode3C11.mode	@ltx/en_us_oca/miscellanea:misc.Mode2
ltx/en_us_oca/tr.d067:trCO.Ode3C11.ode	@ltx/en_us_oca/miscellanea:misc.Ode3
ltx/en_us_oca/tr.d067:trCO.Ode3C11.text	
ltx/en_us_oca/tr.d067:trCO.Ode3C12.incipit	…
ltx/en_us_oca/tr.d067:trCO.Ode3C12.melody	@ltx/en_us_oca/he.h.m2:heHE.SteirothentaMouTonNoun.notmetered
ltx/en_us_oca/tr.d067:trCO.Ode3C12.mode	@ltx/en_us_oca/miscellanea:misc.Mode2
ltx/en_us_oca/tr.d067:trCO.Ode3C12.ode	@ltx/en_us_oca/miscellanea:misc.Ode3
ltx/en_us_oca/tr.d067:trCO.Ode3C12.text	
ltx/en_us_oca/tr.d067:trCO.Ode3C13.incipit	…
ltx/en_us_oca/tr.d067:trCO.Ode3C13.melody	@ltx/en_us_oca/he.h.m2:heHE.SteirothentaMouTonNoun.notmetered
ltx/en_us_oca/tr.d067:trCO.Ode3C13.mode	@ltx/en_us_oca/miscellanea:misc.Mode2
ltx/en_us_oca/tr.d067:trCO.Ode3C13.ode	@ltx/en_us_oca/miscellanea:misc.Ode3
ltx/en_us_oca/tr.d067:trCO.Ode3C13.text	
ltx/en_us_oca/tr.d067:trCO.Ode3C14.incipit	…
ltx/en_us_oca/tr.d067:trCO.Ode3C14.melody	@ltx/en_us_oca/he.h.m2:heHE.SteirothentaMouTonNoun.notmetered
ltx/en_us_oca/tr.d067:trCO.Ode3C14.mode	@ltx/en_us_oca/miscellanea:misc.Mode2
ltx/en_us_oca/tr.d067:trCO.Ode3C14.ode	@ltx/en_us_oca/miscellanea:misc.Ode3
ltx/en_us_oca/tr.d067:trCO.Ode3C14.text	
ltx/en_us_oca/tr.d067:trCO.Ode3C15.incipit	…
ltx/en_us_oca/tr.d067:trCO.Ode3C15.melody	@ltx/en_us_oca/he.h.m2:heHE.SteirothentaMouTonNoun.notmetered
ltx/en_us_oca/tr.d067:trCO.Ode3C15.mode	@ltx/en_us_oca/miscellanea:misc.Mode2
ltx/en_us_oca/tr.d067:trCO.Ode3C15.ode	@ltx/en_us_oca/miscellanea:misc.Ode3
ltx/en_us_oca/tr.d067:trCO.Ode3C15.text	
ltx/en_us_oca/tr.d067:trCO.Ode3C16.incipit	…
ltx/en_us_oca/tr.d067:trCO.Ode3C16.melody	@ltx/en_us_oca/he.h.m2:heHE.SteirothentaMouTonNoun.notmetered
ltx/en_us_oca/tr.d067:trCO.Ode3C16.mode	@ltx/en_us_oca/miscellanea:misc.Mode2
ltx/en_us_oca/tr.d067:trCO.Ode3C16.ode	@ltx/en_us_oca/miscellanea:misc.Ode3
ltx/en_us_oca/tr.d067:trCO.Ode3C16.text	
ltx/en_us_oca/tr.d067:trCO.Ode3C17.incipit	…
ltx/en_us_oca/tr.d067:trCO.Ode3C17.melody	@ltx/en_us_oca/he.h.m2:heHE.SteirothentaMouTonNoun.notmetered
ltx/en_us_oca/tr.d067:trCO.Ode3C17.mode	@ltx/en_us_oca/miscellanea:misc.Mode2
ltx/en_us_oca/tr.d067:trCO.Ode3C17.ode	@ltx/en_us_oca/miscellanea:misc.Ode3
ltx/en_us_oca/tr.d067:trCO.Ode3C17.text	
ltx/en_us_oca/tr.d067:trCO.Ode3C1H.incipit	@ltx/en_us_oca/he.h.m2:heHE.SteirothentaMouTonNoun.incipit
ltx/en_us_oca/tr.d067:trCO.Ode3C1H.melody	@ltx/en_us_oca/he.h.m2:heHE.SteirothentaMouTonNoun.melody
ltx/en_us_oca/tr.d067:trCO.Ode3C1H.mode	@ltx/en_us_oca/miscellanea:misc.Mode2
ltx/en_us_oca/tr.d067:trCO.Ode3C1H.ode	@ltx/en_us_oca/miscellanea:misc.Ode3
ltx/en_us_oca/tr.d067:trCO.Ode3C1H.text	@ltx/en_us_oca/he.h.m2:heHE.SteirothentaMouTonNoun.text
ltx/en_us_oca/tr.d067:trCO.Ode3C1T.incipit	…
ltx/en_us_oca/tr.d067:trCO.Ode3C1T.melody	@ltx/en_us_oca/he.h.m2:heHE.SteirothentaMouTonNoun.notmetered
ltx/en_us_oca/tr.d067:trCO.Ode3C1T.mode	@ltx/en_us_oca/miscellanea:misc.Mode2
ltx/en_us_oca/tr.d067:trCO.Ode3C1T.ode	@ltx/en_us_oca/miscellanea:misc.Ode3
ltx/en_us_oca/tr.d067:trCO.Ode3C1T.text	
ltx/en_us_oca/tr.d067:trCO.Ode3C1Tr.incipit	…
ltx/en_us_oca/tr.d067:trCO.Ode3C1Tr.melody	@ltx/en_us_oca/he.h.m2:heHE.SteirothentaMouTonNoun.notmetered
ltx/en_us_oca/tr.d067:trCO.Ode3C1Tr.mode	@ltx/en_us_oca/miscellanea:misc.Mode2
ltx/en_us_oca/tr.d067:trCO.Ode3C1Tr.ode	@ltx/en_us_oca/miscellanea:misc.Ode3
ltx/en_us_oca/tr.d067:trCO.Ode3C1Tr.text	
ltx/en_us_oca/tr.d067:trCO.Ode8C11.incipit	…
ltx/en_us_oca/tr.d067:trCO.Ode8C11.melody	@ltx/en_us_oca/he.h.m2:heHE.TonEnTiVatoMosi.notmetered
ltx/en_us_oca/tr.d067:trCO.Ode8C11.mode	@ltx/en_us_oca/miscellanea:misc.Mode2
ltx/en_us_oca/tr.d067:trCO.Ode8C11.ode	@ltx/en_us_oca/miscellanea:misc.Ode8
ltx/en_us_oca/tr.d067:trCO.Ode8C11.text	
ltx/en_us_oca/tr.d067:trCO.Ode8C12.incipit	…
ltx/en_us_oca/tr.d067:trCO.Ode8C12.melody	@ltx/en_us_oca/he.h.m2:heHE.TonEnTiVatoMosi.notmetered
ltx/en_us_oca/tr.d067:trCO.Ode8C12.mode	@ltx/en_us_oca/miscellanea:misc.Mode2
ltx/en_us_oca/tr.d067:trCO.Ode8C12.ode	@ltx/en_us_oca/miscellanea:misc.Ode8
ltx/en_us_oca/tr.d067:trCO.Ode8C12.text	
ltx/en_us_oca/tr.d067:trCO.Ode8C13.incipit	…
ltx/en_us_oca/tr.d067:trCO.Ode8C13.melody	@ltx/en_us_oca/he.h.m2:heHE.TonEnTiVatoMosi.notmetered
ltx/en_us_oca/tr.d067:trCO.Ode8C13.mode	@ltx/en_us_oca/miscellanea:misc.Mode2
ltx/en_us_oca/tr.d067:trCO.Ode8C13.ode	@ltx/en_us_oca/miscellanea:misc.Ode8
ltx/en_us_oca/tr.d067:trCO.Ode8C13.text	
ltx/en_us_oca/tr.d067:trCO.Ode8C14.incipit	…
ltx/en_us_oca/tr.d067:trCO.Ode8C14.melody	@ltx/en_us_oca/he.h.m2:heHE.TonEnTiVatoMosi.notmetered
ltx/en_us_oca/tr.d067:trCO.Ode8C14.mode	@ltx/en_us_oca/miscellanea:misc.Mode2
ltx/en_us_oca/tr.d067:trCO.Ode8C14.ode	@ltx/en_us_oca/miscellanea:misc.Ode8
ltx/en_us_oca/tr.d067:trCO.Ode8C14.text	
ltx/en_us_oca/tr.d067:trCO.Ode8C15.incipit	…
ltx/en_us_oca/tr.d067:trCO.Ode8C15.melody	@ltx/en_us_oca/he.h.m2:heHE.TonEnTiVatoMosi.notmetered
ltx/en_us_oca/tr.d067:trCO.Ode8C15.mode	@ltx/en_us_oca/miscellanea:misc.Mode2
ltx/en_us_oca/tr.d067:trCO.Ode8C15.ode	@ltx/en_us_oca/miscellanea:misc.Ode8
ltx/en_us_oca/tr.d067:trCO.Ode8C15.text	
ltx/en_us_oca/tr.d067:trCO.Ode8C16.incipit	…
ltx/en_us_oca/tr.d067:trCO.Ode8C16.melody	@ltx/en_us_oca/he.h.m2:heHE.TonEnTiVatoMosi.notmetered
ltx/en_us_oca/tr.d067:trCO.Ode8C16.mode	@ltx/en_us_oca/miscellanea:misc.Mode2
ltx/en_us_oca/tr.d067:trCO.Ode8C16.ode	@ltx/en_us_oca/miscellanea:misc.Ode8
ltx/en_us_oca/tr.d067:trCO.Ode8C16.text	
ltx/en_us_oca/tr.d067:trCO.Ode8C17.incipit	…
ltx/en_us_oca/tr.d067:trCO.Ode8C17.melody	@ltx/en_us_oca/he.h.m2:heHE.TonEnTiVatoMosi.notmetered
ltx/en_us_oca/tr.d067:trCO.Ode8C17.mode	@ltx/en_us_oca/miscellanea:misc.Mode2
ltx/en_us_oca/tr.d067:trCO.Ode8C17.ode	@ltx/en_us_oca/miscellanea:misc.Ode8
ltx/en_us_oca/tr.d067:trCO.Ode8C17.text	
ltx/en_us_oca/tr.d067:trCO.Ode8C18.incipit	…
ltx/en_us_oca/tr.d067:trCO.Ode8C18.melody	@ltx/en_us_oca/he.h.m2:heHE.TonEnTiVatoMosi.notmetered
ltx/en_us_oca/tr.d067:trCO.Ode8C18.mode	@ltx/en_us_oca/miscellanea:misc.Mode2
ltx/en_us_oca/tr.d067:trCO.Ode8C18.ode	@ltx/en_us_oca/miscellanea:misc.Ode8
ltx/en_us_oca/tr.d067:trCO.Ode8C18.text	
ltx/en_us_oca/tr.d067:trCO.Ode8C1H.incipit	@ltx/en_us_oca/he.h.m2:heHE.TonEnTiVatoMosi.incipit
ltx/en_us_oca/tr.d067:trCO.Ode8C1H.melody	@ltx/en_us_oca/he.h.m2:heHE.TonEnTiVatoMosi.melody
ltx/en_us_oca/tr.d067:trCO.Ode8C1H.mode	@ltx/en_us_oca/miscellanea:misc.Mode2
ltx/en_us_oca/tr.d067:trCO.Ode8C1H.ode	@ltx/en_us_oca/miscellanea:misc.Ode8
ltx/en_us_oca/tr.d067:trCO.Ode8C1H.text	@ltx/en_us_oca/he.h.m2:heHE.TonEnTiVatoMosi.text
ltx/en_us_oca/tr.d067:trCO.Ode8C1T.incipit	…
ltx/en_us_oca/tr.d067:trCO.Ode8C1T.melody	@ltx/en_us_oca/he.h.m2:heHE.TonEnTiVatoMosi.notmetered
ltx/en_us_oca/tr.d067:trCO.Ode8C1T.mode	@ltx/en_us_oca/miscellanea:misc.Mode2
ltx/en_us_oca/tr.d067:trCO.Ode8C1T.ode	@ltx/en_us_oca/miscellanea:misc.Ode8
ltx/en_us_oca/tr.d067:trCO.Ode8C1T.text	
ltx/en_us_oca/tr.d067:trCO.Ode8C1Tr.incipit	…
ltx/en_us_oca/tr.d067:trCO.Ode8C1Tr.melody	@ltx/en_us_oca/he.h.m2:heHE.TonEnTiVatoMosi.notmetered
ltx/en_us_oca/tr.d067:trCO.Ode8C1Tr.mode	@ltx/en_us_oca/miscellanea:misc.Mode2
ltx/en_us_oca/tr.d067:trCO.Ode8C1Tr.ode	@ltx/en_us_oca/miscellanea:misc.Ode8
ltx/en_us_oca/tr.d067:trCO.Ode8C1Tr.text	
ltx/en_us_oca/tr.d067:trCO.Ode9C11.incipit	…
ltx/en_us_oca/tr.d067:trCO.Ode9C11.melody	@ltx/en_us_oca/he.h.m2:heHE.TinYperfyosSarki.notmetered
ltx/en_us_oca/tr.d067:trCO.Ode9C11.mode	@ltx/en_us_oca/miscellanea:misc.Mode2
ltx/en_us_oca/tr.d067:trCO.Ode9C11.ode	@ltx/en_us_oca/miscellanea:misc.Ode9
ltx/en_us_oca/tr.d067:trCO.Ode9C11.text	
ltx/en_us_oca/tr.d067:trCO.Ode9C12.incipit	…
ltx/en_us_oca/tr.d067:trCO.Ode9C12.melody	@ltx/en_us_oca/he.h.m2:heHE.TinYperfyosSarki.notmetered
ltx/en_us_oca/tr.d067:trCO.Ode9C12.mode	@ltx/en_us_oca/miscellanea:misc.Mode2
ltx/en_us_oca/tr.d067:trCO.Ode9C12.ode	@ltx/en_us_oca/miscellanea:misc.Ode9
ltx/en_us_oca/tr.d067:trCO.Ode9C12.text	
ltx/en_us_oca/tr.d067:trCO.Ode9C13.incipit	…
ltx/en_us_oca/tr.d067:trCO.Ode9C13.melody	@ltx/en_us_oca/he.h.m2:heHE.TinYperfyosSarki.notmetered
ltx/en_us_oca/tr.d067:trCO.Ode9C13.mode	@ltx/en_us_oca/miscellanea:misc.Mode2
ltx/en_us_oca/tr.d067:trCO.Ode9C13.ode	@ltx/en_us_oca/miscellanea:misc.Ode9
ltx/en_us_oca/tr.d067:trCO.Ode9C13.text	
ltx/en_us_oca/tr.d067:trCO.Ode9C14.incipit	…
ltx/en_us_oca/tr.d067:trCO.Ode9C14.melody	@ltx/en_us_oca/he.h.m2:heHE.TinYperfyosSarki.notmetered
ltx/en_us_oca/tr.d067:trCO.Ode9C14.mode	@ltx/en_us_oca/miscellanea:misc.Mode2
ltx/en_us_oca/tr.d067:trCO.Ode9C14.ode	@ltx/en_us_oca/miscellanea:misc.Ode9
ltx/en_us_oca/tr.d067:trCO.Ode9C14.text	
ltx/en_us_oca/tr.d067:trCO.Ode9C15.incipit	…
ltx/en_us_oca/tr.d067:trCO.Ode9C15.melody	@ltx/en_us_oca/he.h.m2:heHE.TinYperfyosSarki.notmetered
ltx/en_us_oca/tr.d067:trCO.Ode9C15.mode	@ltx/en_us_oca/miscellanea:misc.Mode2
ltx/en_us_oca/tr.d067:trCO.Ode9C15.ode	@ltx/en_us_oca/miscellanea:misc.Ode9
ltx/en_us_oca/tr.d067:trCO.Ode9C15.text	
ltx/en_us_oca/tr.d067:trCO.Ode9C16.incipit	…
ltx/en_us_oca/tr.d067:trCO.Ode9C16.melody	@ltx/en_us_oca/he.h.m2:heHE.TinYperfyosSarki.notmetered
ltx/en_us_oca/tr.d067:trCO.Ode9C16.mode	@ltx/en_us_oca/miscellanea:misc.Mode2
ltx/en_us_oca/tr.d067:trCO.Ode9C16.ode	@ltx/en_us_oca/miscellanea:misc.Ode9
ltx/en_us_oca/tr.d067:trCO.Ode9C16.text	
ltx/en_us_oca/tr.d067:trCO.Ode9C17.incipit	…
ltx/en_us_oca/tr.d067:trCO.Ode9C17.melody	@ltx/en_us_oca/he.h.m2:heHE.TinYperfyosSarki.notmetered
ltx/en_us_oca/tr.d067:trCO.Ode9C17.mode	@ltx/en_us_oca/miscellanea:misc.Mode2
ltx/en_us_oca/tr.d067:trCO.Ode9C17.ode	@ltx/en_us_oca/miscellanea:misc.Ode9
ltx/en_us_oca/tr.d067:trCO.Ode9C17.text	
ltx/en_us_oca/tr.d067:trCO.Ode9C18.incipit	…
ltx/en_us_oca/tr.d067:trCO.Ode9C18.melody	@ltx/en_us_oca/he.h.m2:heHE.TinYperfyosSarki.notmetered
ltx/en_us_oca/tr.d067:trCO.Ode9C18.mode	@ltx/en_us_oca/miscellanea:misc.Mode2
ltx/en_us_oca/tr.d067:trCO.Ode9C18.ode	@ltx/en_us_oca/miscellanea:misc.Ode9
ltx/en_us_oca/tr.d067:trCO.Ode9C18.text	
ltx/en_us_oca/tr.d067:trCO.Ode9C1H.incipit	@ltx/en_us_oca/he.h.m2:heHE.TinYperfyosSarki.incipit
ltx/en_us_oca/tr.d067:trCO.Ode9C1H.melody	@ltx/en_us_oca/he.h.m2:heHE.TinYperfyosSarki.melody
ltx/en_us_oca/tr.d067:trCO.Ode9C1H.mode	@ltx/en_us_oca/miscellanea:misc.Mode2
ltx/en_us_oca/tr.d067:trCO.Ode9C1H.ode	@ltx/en_us_oca/miscellanea:misc.Ode9
ltx/en_us_oca/tr.d067:trCO.Ode9C1H.text	@ltx/en_us_oca/he.h.m2:heHE.TinYperfyosSarki.text
ltx/en_us_oca/tr.d067:trCO.Ode9C1T.incipit	…
ltx/en_us_oca/tr.d067:trCO.Ode9C1T.melody	@ltx/en_us_oca/he.h.m2:heHE.TinYperfyosSarki.notmetered
ltx/en_us_oca/tr.d067:trCO.Ode9C1T.mode	@ltx/en_us_oca/miscellanea:misc.Mode2
ltx/en_us_oca/tr.d067:trCO.Ode9C1T.ode	@ltx/en_us_oca/miscellanea:misc.Ode9
ltx/en_us_oca/tr.d067:trCO.Ode9C1T.text	
ltx/en_us_oca/tr.d067:trCO.Ode9C1Tr.incipit	…
ltx/en_us_oca/tr.d067:trCO.Ode9C1Tr.melody	@ltx/en_us_oca/he.h.m2:heHE.TinYperfyosSarki.notmetered
ltx/en_us_oca/tr.d067:trCO.Ode9C1Tr.mode	@ltx/en_us_oca/miscellanea:misc.Mode2
ltx/en_us_oca/tr.d067:trCO.Ode9C1Tr.ode	@ltx/en_us_oca/miscellanea:misc.Ode9
ltx/en_us_oca/tr.d067:trCO.Ode9C1Tr.text	
ltx/en_us_oca/tr.d067:trCO.header	
ltx/en_us_oca/tr.d067:trDA.commemoration.full	
ltx/en_us_oca/tr.d067:trDA.commemoration.short	
ltx/en_us_oca/tr.d067:trDA.dismissal	@ltx/en_us_oca/dismissals:dis00.bridegroom
ltx/en_us_oca/tr.d067:trDA.insert1	
ltx/en_us_oca/tr.d067:trDA.insert2	
ltx/en_us_oca/tr.d067:trDA.note	
ltx/en_us_oca/tr.d067:trDA.title	
ltx/en_us_oca/tr.d067:trEM.header	
ltx/en_us_oca/tr.d067:trHO.commemorations	
ltx/en_us_oca/tr.d067:trHO.daytitle	
ltx/en_us_oca/tr.d067:trHO.description1	
ltx/en_us_oca/tr.d067:trHO.description2	
ltx/en_us_oca/tr.d067:trHO.note1	
ltx/en_us_oca/tr.d067:trHO.note2	
ltx/en_us_oca/tr.d067:trMA.AposGlory.incipit	…
ltx/en_us_oca/tr.d067:trMA.AposGlory.melody	@ltx/en_us_oca/miscellanea:misc.Idiomelon
ltx/en_us_oca/tr.d067:trMA.AposGlory.mode	@ltx/en_us_oca/miscellanea:misc.Mode8
ltx/en_us_oca/tr.d067:trMA.AposGlory.text	
ltx/en_us_oca/tr.d067:trMA.Aposticha1.incipit	…
ltx/en_us_oca/tr.d067:trMA.Aposticha1.melody	@ltx/en_us_oca/miscellanea:misc.Idiomelon
ltx/en_us_oca/tr.d067:trMA.Aposticha1.mode	@ltx/en_us_oca/miscellanea:misc.Mode6
ltx/en_us_oca/tr.d067:trMA.Aposticha1.text	
ltx/en_us_oca/tr.d067:trMA.Aposticha2.incipit	…
ltx/en_us_oca/tr.d067:trMA.Aposticha2.melody	@ltx/en_us_oca/miscellanea:misc.Idiomelon
ltx/en_us_oca/tr.d067:trMA.Aposticha2.mode	@ltx/en_us_oca/miscellanea:misc.Mode6
ltx/en_us_oca/tr.d067:trMA.Aposticha2.text	
ltx/en_us_oca/tr.d067:trMA.Aposticha3.incipit	…
ltx/en_us_oca/tr.d067:trMA.Aposticha3.melody	@ltx/en_us_oca/miscellanea:misc.Idiomelon
ltx/en_us_oca/tr.d067:trMA.Aposticha3.mode	@ltx/en_us_oca/miscellanea:misc.Mode6
ltx/en_us_oca/tr.d067:trMA.Aposticha3.text	
ltx/en_us_oca/tr.d067:trMA.Aposticha4.incipit	…
ltx/en_us_oca/tr.d067:trMA.Aposticha4.melody	@ltx/en_us_oca/miscellanea:misc.Idiomelon
ltx/en_us_oca/tr.d067:trMA.Aposticha4.mode	@ltx/en_us_oca/miscellanea:misc.Mode6
ltx/en_us_oca/tr.d067:trMA.Aposticha4.text	
ltx/en_us_oca/tr.d067:trMA.C1.acrostic.notice1	
ltx/en_us_oca/tr.d067:trMA.C1.acrostic.text	
ltx/en_us_oca/tr.d067:trMA.C1.acrostic.title	
ltx/en_us_oca/tr.d067:trMA.C1.poet	@ltx/en_us_oca/poets:po.KosmaMonachou
ltx/en_us_oca/tr.d067:trMA.C1.verse	@ltx/en_us_oca/prayers:pr.verse_God.text
ltx/en_us_oca/tr.d067:trMA.Exaposteilarion1.greekmelody	@ltx/en_us_oca/he.a.m3:heAU.TonNymfonaSouVlepo.greekname
ltx/en_us_oca/tr.d067:trMA.Exaposteilarion1.incipit	@ltx/en_us_oca/he.a.m3:heAU.TonNymfonaSouVlepo.incipit
ltx/en_us_oca/tr.d067:trMA.Exaposteilarion1.melody	@ltx/en_us_oca/he.a.m3:heAU.TonNymfonaSouVlepo.melody
ltx/en_us_oca/tr.d067:trMA.Exaposteilarion1.mode	@ltx/en_us_oca/miscellanea:misc.Mode3
ltx/en_us_oca/tr.d067:trMA.Exaposteilarion1.text	@ltx/en_us_oca/he.a.m3:heAU.TonNymfonaSouVlepo.text
ltx/en_us_oca/tr.d067:trMA.Kathisma11.greekmelody	@ltx/en_us_oca/he.a.m3:heAU.TinOraiotita.greekname
ltx/en_us_oca/tr.d067:trMA.Kathisma11.incipit	…
ltx/en_us_oca/tr.d067:trMA.Kathisma11.melody	@ltx/en_us_oca/he.a.m3:heAU.TinOraiotita.notmetered
ltx/en_us_oca/tr.d067:trMA.Kathisma11.mode	@ltx/en_us_oca/miscellanea:misc.Mode3
ltx/en_us_oca/tr.d067:trMA.Kathisma11.text	
ltx/en_us_oca/tr.d067:trMA.Kathisma21.greekmelody	@ltx/en_us_oca/he.a.m4:heAU.TachyProkatalave.greekname
ltx/en_us_oca/tr.d067:trMA.Kathisma21.incipit	…
ltx/en_us_oca/tr.d067:trMA.Kathisma21.melody	@ltx/en_us_oca/he.a.m4:heAU.TachyProkatalave.notmetered
ltx/en_us_oca/tr.d067:trMA.Kathisma21.mode	@ltx/en_us_oca/miscellanea:misc.Mode4
ltx/en_us_oca/tr.d067:trMA.Kathisma21.text	
ltx/en_us_oca/tr.d067:trMA.Kathisma31.greekmelody	@ltx/en_us_oca/he.a.m1:heAU.TonTafonSouSotir.greekname
ltx/en_us_oca/tr.d067:trMA.Kathisma31.incipit	…
ltx/en_us_oca/tr.d067:trMA.Kathisma31.melody	@ltx/en_us_oca/he.a.m1:heAU.TonTafonSouSotir.notmetered
ltx/en_us_oca/tr.d067:trMA.Kathisma31.mode	@ltx/en_us_oca/miscellanea:misc.Mode1
ltx/en_us_oca/tr.d067:trMA.Kathisma31.text	
ltx/en_us_oca/tr.d067:trMA.Kontakion1.incipit	…
ltx/en_us_oca/tr.d067:trMA.Kontakion1.melody	@ltx/en_us_oca/he.a.m4:heAU.OYpsotheisEnToStavro.notmetered
ltx/en_us_oca/tr.d067:trMA.Kontakion1.mode	@ltx/en_us_oca/miscellanea:misc.Mode4
ltx/en_us_oca/tr.d067:trMA.Kontakion1.text	
ltx/en_us_oca/tr.d067:trMA.Lauds1.incipit	…
ltx/en_us_oca/tr.d067:trMA.Lauds1.melody	@ltx/en_us_oca/miscellanea:misc.Idiomelon
ltx/en_us_oca/tr.d067:trMA.Lauds1.mode	@ltx/en_us_oca/miscellanea:misc.Mode1
ltx/en_us_oca/tr.d067:trMA.Lauds1.text	
ltx/en_us_oca/tr.d067:trMA.Lauds2.incipit	…
ltx/en_us_oca/tr.d067:trMA.Lauds2.melody	@ltx/en_us_oca/miscellanea:misc.Idiomelon
ltx/en_us_oca/tr.d067:trMA.Lauds2.mode	@ltx/en_us_oca/miscellanea:misc.Mode1
ltx/en_us_oca/tr.d067:trMA.Lauds2.text	
ltx/en_us_oca/tr.d067:trMA.Lauds3.incipit	…
ltx/en_us_oca/tr.d067:trMA.Lauds3.melody	@ltx/en_us_oca/miscellanea:misc.Idiomelon
ltx/en_us_oca/tr.d067:trMA.Lauds3.mode	@ltx/en_us_oca/miscellanea:misc.Mode1
ltx/en_us_oca/tr.d067:trMA.Lauds3.text	
ltx/en_us_oca/tr.d067:trMA.Lauds4.incipit	…
ltx/en_us_oca/tr.d067:trMA.Lauds4.melody	@ltx/en_us_oca/miscellanea:misc.Idiomelon
ltx/en_us_oca/tr.d067:trMA.Lauds4.mode	@ltx/en_us_oca/miscellanea:misc.Mode1
ltx/en_us_oca/tr.d067:trMA.Lauds4.text	
ltx/en_us_oca/tr.d067:trMA.LaudsBoth.incipit	…
ltx/en_us_oca/tr.d067:trMA.LaudsBoth.melody	@ltx/en_us_oca/miscellanea:misc.Idiomelon
ltx/en_us_oca/tr.d067:trMA.LaudsBoth.mode	@ltx/en_us_oca/miscellanea:misc.Mode6
ltx/en_us_oca/tr.d067:trMA.LaudsBoth.text	
ltx/en_us_oca/tr.d067:trMA.LaudsGlory.incipit	…
ltx/en_us_oca/tr.d067:trMA.LaudsGlory.melody	@ltx/en_us_oca/miscellanea:misc.Idiomelon
ltx/en_us_oca/tr.d067:trMA.LaudsGlory.mode	@ltx/en_us_oca/miscellanea:misc.Mode2
ltx/en_us_oca/tr.d067:trMA.LaudsGlory.text	
ltx/en_us_oca/tr.d067:trMA.MM.Alleluia.text	
ltx/en_us_oca/tr.d067:trMA.Ode3C11.greekmelody	@ltx/en_us_oca/he.h.m2:heHE.TisPisteosEnPetra.greekname
ltx/en_us_oca/tr.d067:trMA.Ode3C11.incipit	…
ltx/en_us_oca/tr.d067:trMA.Ode3C11.melody	@ltx/en_us_oca/he.h.m2:heHE.TisPisteosEnPetra.notmetered
ltx/en_us_oca/tr.d067:trMA.Ode3C11.mode	@ltx/en_us_oca/miscellanea:misc.Mode2
ltx/en_us_oca/tr.d067:trMA.Ode3C11.ode	@ltx/en_us_oca/miscellanea:misc.Ode3
ltx/en_us_oca/tr.d067:trMA.Ode3C11.text	
ltx/en_us_oca/tr.d067:trMA.Ode3C12.incipit	…
ltx/en_us_oca/tr.d067:trMA.Ode3C12.melody	@ltx/en_us_oca/he.h.m2:heHE.TisPisteosEnPetra.notmetered
ltx/en_us_oca/tr.d067:trMA.Ode3C12.mode	@ltx/en_us_oca/miscellanea:misc.Mode2
ltx/en_us_oca/tr.d067:trMA.Ode3C12.ode	@ltx/en_us_oca/miscellanea:misc.Ode3
ltx/en_us_oca/tr.d067:trMA.Ode3C12.text	
ltx/en_us_oca/tr.d067:trMA.Ode3C1H.greekmelody	@ltx/en_us_oca/he.h.m2:heHE.TisPisteosEnPetra.greekname
ltx/en_us_oca/tr.d067:trMA.Ode3C1H.incipit	@ltx/en_us_oca/he.h.m2:heHE.TisPisteosEnPetra.incipit
ltx/en_us_oca/tr.d067:trMA.Ode3C1H.melody	@ltx/en_us_oca/he.h.m2:heHE.TisPisteosEnPetra.melody
ltx/en_us_oca/tr.d067:trMA.Ode3C1H.mode	@ltx/en_us_oca/miscellanea:misc.Mode2
ltx/en_us_oca/tr.d067:trMA.Ode3C1H.ode	@ltx/en_us_oca/miscellanea:misc.Ode3
ltx/en_us_oca/tr.d067:trMA.Ode3C1H.text	@ltx/en_us_oca/he.h.m2:heHE.TisPisteosEnPetra.text
ltx/en_us_oca/tr.d067:trMA.Ode3K.incipit	@ltx/en_us_oca/he.h.m2:heHE.TisPisteosEnPetra.incipit
ltx/en_us_oca/tr.d067:trMA.Ode3K.melody	@ltx/en_us_oca/he.h.m2:heHE.TisPisteosEnPetra.melody
ltx/en_us_oca/tr.d067:trMA.Ode3K.mode	@ltx/en_us_oca/miscellanea:misc.Mode2
ltx/en_us_oca/tr.d067:trMA.Ode3K.ode	@ltx/en_us_oca/miscellanea:misc.Ode3
ltx/en_us_oca/tr.d067:trMA.Ode3K.text	@ltx/en_us_oca/he.h.m2:heHE.TisPisteosEnPetra.text
ltx/en_us_oca/tr.d067:trMA.Ode8C11.greekmelody	@ltx/en_us_oca/he.h.m2:heHE.RimaTyrannou.greekname
ltx/en_us_oca/tr.d067:trMA.Ode8C11.incipit	…
ltx/en_us_oca/tr.d067:trMA.Ode8C11.melody	@ltx/en_us_oca/he.h.m2:heHE.RimaTyrannou.notmetered
ltx/en_us_oca/tr.d067:trMA.Ode8C11.mode	@ltx/en_us_oca/miscellanea:misc.Mode2
ltx/en_us_oca/tr.d067:trMA.Ode8C11.ode	@ltx/en_us_oca/miscellanea:misc.Ode8
ltx/en_us_oca/tr.d067:trMA.Ode8C11.text	
ltx/en_us_oca/tr.d067:trMA.Ode8C12.incipit	…
ltx/en_us_oca/tr.d067:trMA.Ode8C12.melody	@ltx/en_us_oca/he.h.m2:heHE.RimaTyrannou.notmetered
ltx/en_us_oca/tr.d067:trMA.Ode8C12.mode	@ltx/en_us_oca/miscellanea:misc.Mode2
ltx/en_us_oca/tr.d067:trMA.Ode8C12.ode	@ltx/en_us_oca/miscellanea:misc.Ode8
ltx/en_us_oca/tr.d067:trMA.Ode8C12.text	
ltx/en_us_oca/tr.d067:trMA.Ode8C13.incipit	…
ltx/en_us_oca/tr.d067:trMA.Ode8C13.melody	@ltx/en_us_oca/he.h.m2:heHE.RimaTyrannou.notmetered
ltx/en_us_oca/tr.d067:trMA.Ode8C13.mode	@ltx/en_us_oca/miscellanea:misc.Mode2
ltx/en_us_oca/tr.d067:trMA.Ode8C13.ode	@ltx/en_us_oca/miscellanea:misc.Ode8
ltx/en_us_oca/tr.d067:trMA.Ode8C13.text	
ltx/en_us_oca/tr.d067:trMA.Ode8C1H.greekmelody	@ltx/en_us_oca/he.h.m2:heHE.RimaTyrannou.greekname
ltx/en_us_oca/tr.d067:trMA.Ode8C1H.incipit	@ltx/en_us_oca/he.h.m2:heHE.RimaTyrannou.incipit
ltx/en_us_oca/tr.d067:trMA.Ode8C1H.melody	@ltx/en_us_oca/he.h.m2:heHE.RimaTyrannou.melody
ltx/en_us_oca/tr.d067:trMA.Ode8C1H.mode	@ltx/en_us_oca/miscellanea:misc.Mode2
ltx/en_us_oca/tr.d067:trMA.Ode8C1H.ode	@ltx/en_us_oca/miscellanea:misc.Ode8
ltx/en_us_oca/tr.d067:trMA.Ode8C1H.text	@ltx/en_us_oca/he.h.m2:heHE.RimaTyrannou.text
ltx/en_us_oca/tr.d067:trMA.Ode8K.incipit	@ltx/en_us_oca/he.h.m2:heHE.RimaTyrannou.incipit
ltx/en_us_oca/tr.d067:trMA.Ode8K.melody	@ltx/en_us_oca/he.h.m2:heHE.RimaTyrannou.melody
ltx/en_us_oca/tr.d067:trMA.Ode8K.mode	@ltx/en_us_oca/miscellanea:misc.Mode2
ltx/en_us_oca/tr.d067:trMA.Ode8K.ode	@ltx/en_us_oca/miscellanea:misc.Ode8
ltx/en_us_oca/tr.d067:trMA.Ode8K.text	@ltx/en_us_oca/he.h.m2:heHE.RimaTyrannou.text
ltx/en_us_oca/tr.d067:trMA.Ode9C11.greekmelody	@ltx/en_us_oca/he.h.m2:heHE.PsychaisKatharais.greekname
ltx/en_us_oca/tr.d067:trMA.Ode9C11.incipit	…
ltx/en_us_oca/tr.d067:trMA.Ode9C11.melody	@ltx/en_us_oca/he.h.m2:heHE.PsychaisKatharais.notmetered
ltx/en_us_oca/tr.d067:trMA.Ode9C11.mode	@ltx/en_us_oca/miscellanea:misc.Mode2
ltx/en_us_oca/tr.d067:trMA.Ode9C11.ode	@ltx/en_us_oca/miscellanea:misc.Ode9
ltx/en_us_oca/tr.d067:trMA.Ode9C11.text	
ltx/en_us_oca/tr.d067:trMA.Ode9C12.incipit	…
ltx/en_us_oca/tr.d067:trMA.Ode9C12.melody	@ltx/en_us_oca/he.h.m2:heHE.PsychaisKatharais.notmetered
ltx/en_us_oca/tr.d067:trMA.Ode9C12.mode	@ltx/en_us_oca/miscellanea:misc.Mode2
ltx/en_us_oca/tr.d067:trMA.Ode9C12.ode	@ltx/en_us_oca/miscellanea:misc.Ode9
ltx/en_us_oca/tr.d067:trMA.Ode9C12.text	
ltx/en_us_oca/tr.d067:trMA.Ode9C13.incipit	…
ltx/en_us_oca/tr.d067:trMA.Ode9C13.melody	@ltx/en_us_oca/he.h.m2:heHE.PsychaisKatharais.notmetered
ltx/en_us_oca/tr.d067:trMA.Ode9C13.mode	@ltx/en_us_oca/miscellanea:misc.Mode2
ltx/en_us_oca/tr.d067:trMA.Ode9C13.ode	@ltx/en_us_oca/miscellanea:misc.Ode9
ltx/en_us_oca/tr.d067:trMA.Ode9C13.text	
ltx/en_us_oca/tr.d067:trMA.Ode9C1H.greekmelody	@ltx/en_us_oca/he.h.m2:heHE.PsychaisKatharais.greekname
ltx/en_us_oca/tr.d067:trMA.Ode9C1H.incipit	@ltx/en_us_oca/he.h.m2:heHE.PsychaisKatharais.incipit
ltx/en_us_oca/tr.d067:trMA.Ode9C1H.melody	@ltx/en_us_oca/he.h.m2:heHE.PsychaisKatharais.melody
ltx/en_us_oca/tr.d067:trMA.Ode9C1H.mode	@ltx/en_us_oca/miscellanea:misc.Mode2
ltx/en_us_oca/tr.d067:trMA.Ode9C1H.ode	@ltx/en_us_oca/miscellanea:misc.Ode9
ltx/en_us_oca/tr.d067:trMA.Ode9C1H.text	@ltx/en_us_oca/he.h.m2:heHE.PsychaisKatharais.text
ltx/en_us_oca/tr.d067:trMA.Ode9K.incipit	@ltx/en_us_oca/he.h.m2:heHE.PsychaisKatharais.incipit
ltx/en_us_oca/tr.d067:trMA.Ode9K.melody	@ltx/en_us_oca/he.h.m2:heHE.PsychaisKatharais.melody
ltx/en_us_oca/tr.d067:trMA.Ode9K.mode	@ltx/en_us_oca/miscellanea:misc.Mode2
ltx/en_us_oca/tr.d067:trMA.Ode9K.ode	@ltx/en_us_oca/miscellanea:misc.Ode9
ltx/en_us_oca/tr.d067:trMA.Ode9K.text	@ltx/en_us_oca/he.h.m2:heHE.PsychaisKatharais.text
ltx/en_us_oca/tr.d067:trMA.Oikos1.text	
ltx/en_us_oca/tr.d067:trMA.Troparion.incipit	@ltx/en_us_oca/tr.d065:trMA.Troparion.incipit
ltx/en_us_oca/tr.d067:trMA.Troparion.melody	
ltx/en_us_oca/tr.d067:trMA.Troparion.mode	@ltx/en_us_oca/miscellanea:misc.Mode8
ltx/en_us_oca/tr.d067:trMA.Troparion.text	@ltx/en_us_oca/tr.d065:trMA.Troparion.text
ltx/en_us_oca/tr.d067:trSY.commemoration.couplet1.title	@ltx/en_us_oca/titles:ti.Verses
ltx/en_us_oca/tr.d067:trSY.commemoration.couplet1.verse1	
ltx/en_us_oca/tr.d067:trSY.commemoration.couplet1.verse2	
ltx/en_us_oca/tr.d067:trSY.commemoration.narration.p01	
ltx/en_us_oca/tr.d067:trSY.commemoration.narration.p02	
ltx/en_us_oca/tr.d067:trSY.commemoration.narration.p03	
ltx/en_us_oca/tr.d067:trSY.commemoration.narration.p04	
ltx/en_us_oca/tr.d067:trSY.commemoration.narration.p05	
ltx/en_us_oca/tr.d067:trSY.commemoration.narration.p06	
ltx/en_us_oca/tr.d067:trSY.commemoration.narration.p07	
ltx/en_us_oca/tr.d067:trSY.commemoration.text	
ltx/en_us_oca/tr.d067:trSY.lastline	
ltx/en_us_oca/tr.d067:trTE.Troparion.incipit	…
ltx/en_us_oca/tr.d067:trTE.Troparion.melody	
ltx/en_us_oca/tr.d067:trTE.Troparion.mode	@ltx/en_us_oca/miscellanea:misc.Mode2
ltx/en_us_oca/tr.d067:trTE.Troparion.text	Today, the evil assembly has gathered and plots against you. ⁄ Today Judas received condemnation from the agreement: ⁄ Caiaphas confesses unknowingly. ⁄ For the sake of all you will accept death freely; ⁄⁄ Christ God, our Redeemer: Glory to you!
ltx/en_us_oca/tr.d067:trTE.Troparion2.incipit	…
ltx/en_us_oca/tr.d067:trTE.Troparion2.text	
ltx/en_us_oca/tr.d067:trVE.SticGlory.incipit	@ltx/en_us_oca/tr.d066:trMA.AposGlory.incipit
ltx/en_us_oca/tr.d067:trVE.SticGlory.melody	@ltx/en_us_oca/miscellanea:misc.Idiomelon
ltx/en_us_oca/tr.d067:trVE.SticGlory.mode	@ltx/en_us_oca/miscellanea:misc.Mode7
ltx/en_us_oca/tr.d067:trVE.SticGlory.text	@ltx/en_us_oca/tr.d066:trMA.AposGlory.text
ltx/en_us_oca/tr.d067:trVE.Stichera01.incipit	@ltx/en_us_oca/tr.d066:trMA.Lauds1.incipit
ltx/en_us_oca/tr.d067:trVE.Stichera01.melody	@ltx/en_us_oca/miscellanea:misc.Idiomelon
ltx/en_us_oca/tr.d067:trVE.Stichera01.mode	@ltx/en_us_oca/miscellanea:misc.Mode1
ltx/en_us_oca/tr.d067:trVE.Stichera01.text	@ltx/en_us_oca/tr.d066:trMA.Lauds1.text
ltx/en_us_oca/tr.d067:trVE.Stichera02.incipit	@ltx/en_us_oca/tr.d066:trMA.Lauds2.incipit
ltx/en_us_oca/tr.d067:trVE.Stichera02.melody	@ltx/en_us_oca/miscellanea:misc.Idiomelon
ltx/en_us_oca/tr.d067:trVE.Stichera02.mode	@ltx/en_us_oca/miscellanea:misc.Mode2
ltx/en_us_oca/tr.d067:trVE.Stichera02.text	@ltx/en_us_oca/tr.d066:trMA.Lauds2.text
ltx/en_us_oca/tr.d067:trVE.Stichera03.incipit	@ltx/en_us_oca/tr.d066:trMA.LaudsGlory.incipit
ltx/en_us_oca/tr.d067:trVE.Stichera03.melody	@ltx/en_us_oca/miscellanea:misc.Idiomelon
ltx/en_us_oca/tr.d067:trVE.Stichera03.mode	@ltx/en_us_oca/miscellanea:misc.Mode4
ltx/en_us_oca/tr.d067:trVE.Stichera03.text	@ltx/en_us_oca/tr.d066:trMA.LaudsGlory.text
ltx/en_us_oca/tr.d067:trVE.Stichera04.incipit	@ltx/en_us_oca/tr.d066:trMA.Aposticha1.incipit
ltx/en_us_oca/tr.d067:trVE.Stichera04.melody	@ltx/en_us_oca/miscellanea:misc.Idiomelon
ltx/en_us_oca/tr.d067:trVE.Stichera04.mode	@ltx/en_us_oca/miscellanea:misc.Mode6
ltx/en_us_oca/tr.d067:trVE.Stichera04.text	@ltx/en_us_oca/tr.d066:trMA.Aposticha1.text
ltx/en_us_oca/tr.d067:trVE.Stichera05.incipit	@ltx/en_us_oca/tr.d066:trMA.Aposticha2.incipit
ltx/en_us_oca/tr.d067:trVE.Stichera05.melody	@ltx/en_us_oca/miscellanea:misc.Idiomelon
ltx/en_us_oca/tr.d067:trVE.Stichera05.mode	@ltx/en_us_oca/miscellanea:misc.Mode6
ltx/en_us_oca/tr.d067:trVE.Stichera05.text	@ltx/en_us_oca/tr.d066:trMA.Aposticha2.text
ltx/en_us_oca/tr.d067:trVE.Stichera06.incipit	@ltx/en_us_oca/tr.d066:trMA.Aposticha3.incipit
ltx/en_us_oca/tr.d067:trVE.Stichera06.melody	@ltx/en_us_oca/miscellanea:misc.Idiomelon
ltx/en_us_oca/tr.d067:trVE.Stichera06.mode	@ltx/en_us_oca/miscellanea:misc.Mode6
ltx/en_us_oca/tr.d067:trVE.Stichera06.text	@ltx/en_us_oca/tr.d066:trMA.Aposticha3.text
ltx/en_us_oca/tr.d067:trVL.header	
