ltx/en_us_oca/me.m09.d14:meDA.commemoration.first	
ltx/en_us_oca/me.m09.d14:meDA.commemoration.first_name	
ltx/en_us_oca/me.m09.d14:meDA.commemoration.first_short	
ltx/en_us_oca/me.m09.d14:meDA.commemoration.first_title	
ltx/en_us_oca/me.m09.d14:meDA.commemoration.full	
ltx/en_us_oca/me.m09.d14:meDA.commemoration.second_name	
ltx/en_us_oca/me.m09.d14:meDA.commemoration.second_title	
ltx/en_us_oca/me.m09.d14:meDA.date	
ltx/en_us_oca/me.m09.d14:meDA.dismissal	@ltx/en_us_oca/dismissals:dis00.resurrection
ltx/en_us_oca/me.m09.d14:meDA.fordate	
ltx/en_us_oca/me.m09.d14:meDA.insert1	
ltx/en_us_oca/me.m09.d14:meDA.insert2	
ltx/en_us_oca/me.m09.d14:meDA.note	
ltx/en_us_oca/me.m09.d14:meDA.pdfcoverdate	
ltx/en_us_oca/me.m09.d14:meDA.pdfheaderdate	
ltx/en_us_oca/me.m09.d14:meHO.commemorations	
ltx/en_us_oca/me.m09.d14:meHO.note1	
ltx/en_us_oca/me.m09.d14:meHO.note2	
ltx/en_us_oca/me.m09.d14:meHO.number	
ltx/en_us_oca/me.m09.d14:meHO.rank	
ltx/en_us_oca/me.m09.d14:meLE.commemoration1	
ltx/en_us_oca/me.m09.d14:meLE.commemoration2	
ltx/en_us_oca/me.m09.d14:meLI.Kontakion1.greekmelody	@ltx/en_us_oca/me.m09.d14:meMA.Kontakion1.greekmelody
ltx/en_us_oca/me.m09.d14:meLI.Kontakion1.incipit	@ltx/en_us_oca/me.m09.d14:meMA.Kontakion1.incipit
ltx/en_us_oca/me.m09.d14:meLI.Kontakion1.melody	@ltx/en_us_oca/me.m09.d14:meMA.Kontakion1.melody
ltx/en_us_oca/me.m09.d14:meLI.Kontakion1.mode	@ltx/en_us_oca/me.m09.d14:meMA.Kontakion1.mode
ltx/en_us_oca/me.m09.d14:meLI.Kontakion1.text	@ltx/en_us_oca/me.m09.d14:meMA.Kontakion1.text
ltx/en_us_oca/me.m09.d14:meLI.MM.CommunionHymn.text	
ltx/en_us_oca/me.m09.d14:meLI.MM.EntranceHymn.text	
ltx/en_us_oca/me.m09.d14:meLI.Megalynarion.text	
ltx/en_us_oca/me.m09.d14:meLI.TheotokosHymn.incipit	@ltx/en_us_oca/me.m09.d14:meMA.Ode9C1H.incipit
ltx/en_us_oca/me.m09.d14:meLI.TheotokosHymn.mode	@ltx/en_us_oca/me.m09.d14:meMA.Ode9C1H.mode
ltx/en_us_oca/me.m09.d14:meLI.TheotokosHymn.text	@ltx/en_us_oca/me.m09.d14:meMA.Ode9C1H.text
ltx/en_us_oca/me.m09.d14:meMA.AdditionalIdiomelon1.incipit	…
ltx/en_us_oca/me.m09.d14:meMA.AdditionalIdiomelon1.melody	
ltx/en_us_oca/me.m09.d14:meMA.AdditionalIdiomelon1.mode	@ltx/en_us_oca/miscellanea:misc.Mode2
ltx/en_us_oca/me.m09.d14:meMA.AdditionalIdiomelon1.text	
ltx/en_us_oca/me.m09.d14:meMA.AdditionalIdiomelon2.incipit	…
ltx/en_us_oca/me.m09.d14:meMA.AdditionalIdiomelon2.melody	
ltx/en_us_oca/me.m09.d14:meMA.AdditionalIdiomelon2.mode	@ltx/en_us_oca/miscellanea:misc.Mode5
ltx/en_us_oca/me.m09.d14:meMA.AdditionalIdiomelon2.text	
ltx/en_us_oca/me.m09.d14:meMA.AdditionalIdiomelon3.incipit	…
ltx/en_us_oca/me.m09.d14:meMA.AdditionalIdiomelon3.melody	
ltx/en_us_oca/me.m09.d14:meMA.AdditionalIdiomelon3.mode	@ltx/en_us_oca/miscellanea:misc.Mode5
ltx/en_us_oca/me.m09.d14:meMA.AdditionalIdiomelon3.text	
ltx/en_us_oca/me.m09.d14:meMA.AdditionalIdiomelon4.incipit	Today the shoot of life…
ltx/en_us_oca/me.m09.d14:meMA.AdditionalIdiomelon4.melody	
ltx/en_us_oca/me.m09.d14:meMA.AdditionalIdiomelon4.mode	@ltx/en_us_oca/miscellanea:misc.Mode6
ltx/en_us_oca/me.m09.d14:meMA.AdditionalIdiomelon4.text	Today the shoot of life springs forth ⁄ from the hardened bosom of the earth, ⁄ announcing the Resurrection of Christ who was nailed to it! ⁄ Lifted up by priestly hands, ⁄ the Cross proclaims His Ascension to heaven, ⁄ by which our nature, bound to earth by the fall, ⁄ dwells now in the heavens! ⁄ Therefore we cry out in thanksgiving: ⁄ You were lifted up on the Cross, Lord, ⁄ raising us up with Yourself: ⁄⁄ Grant us Your heavenly joy as the Lover of mankind!
ltx/en_us_oca/me.m09.d14:meMA.AdditionalIdiomelon5.incipit	Today the four ends of…
ltx/en_us_oca/me.m09.d14:meMA.AdditionalIdiomelon5.melody	
ltx/en_us_oca/me.m09.d14:meMA.AdditionalIdiomelon5.mode	@ltx/en_us_oca/miscellanea:misc.Mode6
ltx/en_us_oca/me.m09.d14:meMA.AdditionalIdiomelon5.text	Today the four ends of the earth are sanctified ⁄ by the exaltation of the four arms of Your Cross, Christ our God. ⁄ Your faithful people are exalted in strength ⁄ and dash in pieces the devil’s might. ⁄ You are great, and wonderful are Your works! ⁄⁄ Glory to You, O Lord!
ltx/en_us_oca/me.m09.d14:meMA.AdditionalIdiomelon6.incipit	Prophetic words foretold the holy…
ltx/en_us_oca/me.m09.d14:meMA.AdditionalIdiomelon6.melody	
ltx/en_us_oca/me.m09.d14:meMA.AdditionalIdiomelon6.mode	@ltx/en_us_oca/miscellanea:misc.Mode6
ltx/en_us_oca/me.m09.d14:meMA.AdditionalIdiomelon6.text	Prophetic words foretold the holy wood ⁄ by which Adam was freed from death’s ancient curse. ⁄ Today, at its exaltation, all creation raises its voice, ⁄ begging from God great mercy. ⁄ Master, boundless in compassion, ⁄⁄ redeem us and save our souls!
ltx/en_us_oca/me.m09.d14:meMA.AdditionalIdiomelonGlory.incipit	The words of Moses the…
ltx/en_us_oca/me.m09.d14:meMA.AdditionalIdiomelonGlory.melody	
ltx/en_us_oca/me.m09.d14:meMA.AdditionalIdiomelonGlory.mode	@ltx/en_us_oca/miscellanea:misc.Mode8
ltx/en_us_oca/me.m09.d14:meMA.AdditionalIdiomelonGlory.text	The words of Moses the prophet have been fulfilled, O God! ⁄ You will see your life hang before your eyes! ⁄ Today the Cross is exalted and the world is freed from error! ⁄ Today the Resurrection of Christ is renewed! ⁄ The ends of the earth greatly rejoice! ⁄ They sing You David’s psalms with loud clashing cymbals: ⁄ You have accomplished salvation in the midst of the earth, O God! ⁄ You have saved us through Your Cross and Resurrection, ⁄ for You are good and the Lover of mankind! ⁄⁄ Glory to You, all-powerful Lord!
ltx/en_us_oca/me.m09.d14:meMA.C1.acrostic.notice1	·
ltx/en_us_oca/me.m09.d14:meMA.C1.acrostic.text	
ltx/en_us_oca/me.m09.d14:meMA.C1.acrostic.title	
ltx/en_us_oca/me.m09.d14:meMA.C1.poet	@ltx/en_us_oca/poets:po.KyriouKosma
ltx/en_us_oca/me.m09.d14:meMA.C1.title	@ltx/en_us_oca/titles:ti.CanonFeast
ltx/en_us_oca/me.m09.d14:meMA.C1.verse	@ltx/en_us_oca/prayers:pr.verse_Cross.text
ltx/en_us_oca/me.m09.d14:meMA.Exaposteilarion1.greekmelody	@ltx/en_us_oca/he.a.m2:heAU.TonMathitonOrontonSe.greekname
ltx/en_us_oca/me.m09.d14:meMA.Exaposteilarion1.incipit	…
ltx/en_us_oca/me.m09.d14:meMA.Exaposteilarion1.melody	@ltx/en_us_oca/he.a.m2:heAU.TonMathitonOrontonSe.notmetered
ltx/en_us_oca/me.m09.d14:meMA.Exaposteilarion1.mode	@ltx/en_us_oca/miscellanea:misc.Mode2
ltx/en_us_oca/me.m09.d14:meMA.Exaposteilarion1.text	
ltx/en_us_oca/me.m09.d14:meMA.Exaposteilarion2.greekmelody	@ltx/en_us_oca/he.a.m2:heAU.GynaikesAkoutisthite.greekname
ltx/en_us_oca/me.m09.d14:meMA.Exaposteilarion2.incipit	…
ltx/en_us_oca/me.m09.d14:meMA.Exaposteilarion2.melody	@ltx/en_us_oca/he.a.m2:heAU.GynaikesAkoutisthite.notmetered
ltx/en_us_oca/me.m09.d14:meMA.Exaposteilarion2.mode	@ltx/en_us_oca/miscellanea:misc.Mode2
ltx/en_us_oca/me.m09.d14:meMA.Exaposteilarion2.text	
ltx/en_us_oca/me.m09.d14:meMA.Kathisma11.greekmelody	@ltx/en_us_oca/he.a.m1:heAU.TouLithouSfragisthentos.greekname
ltx/en_us_oca/me.m09.d14:meMA.Kathisma11.incipit	…
ltx/en_us_oca/me.m09.d14:meMA.Kathisma11.melody	@ltx/en_us_oca/he.a.m1:heAU.TouLithouSfragisthentos.notmetered
ltx/en_us_oca/me.m09.d14:meMA.Kathisma11.mode	@ltx/en_us_oca/miscellanea:misc.Mode1
ltx/en_us_oca/me.m09.d14:meMA.Kathisma11.text	
ltx/en_us_oca/me.m09.d14:meMA.Kathisma21.incipit	@ltx/en_us_oca/oc.m6.d4:ocMA.Kathisma11.incipit
ltx/en_us_oca/me.m09.d14:meMA.Kathisma21.melody	
ltx/en_us_oca/me.m09.d14:meMA.Kathisma21.mode	@ltx/en_us_oca/miscellanea:misc.Mode6
ltx/en_us_oca/me.m09.d14:meMA.Kathisma21.text	@ltx/en_us_oca/oc.m6.d4:ocMA.Kathisma11.text
ltx/en_us_oca/me.m09.d14:meMA.Kathisma31.greekmelody	@ltx/en_us_oca/he.a.m8:heAU.ToProstachthen.greekname
ltx/en_us_oca/me.m09.d14:meMA.Kathisma31.incipit	…
ltx/en_us_oca/me.m09.d14:meMA.Kathisma31.melody	@ltx/en_us_oca/he.a.m8:heAU.ToProstachthen.notmetered
ltx/en_us_oca/me.m09.d14:meMA.Kathisma31.mode	@ltx/en_us_oca/miscellanea:misc.Mode8
ltx/en_us_oca/me.m09.d14:meMA.Kathisma31.text	
ltx/en_us_oca/me.m09.d14:meMA.Kontakion1.greekmelody	@ltx/en_us_oca/he.a.m4:heAU.OYpsotheisEnToStavro.greekname
ltx/en_us_oca/me.m09.d14:meMA.Kontakion1.incipit	@ltx/en_us_oca/he.a.m4:heAU.OYpsotheisEnToStavro.incipit
ltx/en_us_oca/me.m09.d14:meMA.Kontakion1.melody	@ltx/en_us_oca/he.a.m4:heAU.OYpsotheisEnToStavro.melody
ltx/en_us_oca/me.m09.d14:meMA.Kontakion1.mode	@ltx/en_us_oca/miscellanea:misc.Mode4
ltx/en_us_oca/me.m09.d14:meMA.Kontakion1.text	@ltx/en_us_oca/he.a.m4:heAU.OYpsotheisEnToStavro.text
ltx/en_us_oca/me.m09.d14:meMA.Lauds1.greekmelody	@ltx/en_us_oca/he.a.m8:heAU.OTouParadoxou.greekname
ltx/en_us_oca/me.m09.d14:meMA.Lauds1.incipit	…
ltx/en_us_oca/me.m09.d14:meMA.Lauds1.melody	@ltx/en_us_oca/he.a.m8:heAU.OTouParadoxou.notmetered
ltx/en_us_oca/me.m09.d14:meMA.Lauds1.mode	@ltx/en_us_oca/miscellanea:misc.Mode8
ltx/en_us_oca/me.m09.d14:meMA.Lauds1.text	
ltx/en_us_oca/me.m09.d14:meMA.Lauds2.incipit	…
ltx/en_us_oca/me.m09.d14:meMA.Lauds2.melody	@ltx/en_us_oca/he.a.m8:heAU.OTouParadoxou.notmetered
ltx/en_us_oca/me.m09.d14:meMA.Lauds2.mode	@ltx/en_us_oca/miscellanea:misc.Mode8
ltx/en_us_oca/me.m09.d14:meMA.Lauds2.text	
ltx/en_us_oca/me.m09.d14:meMA.Lauds3.incipit	…
ltx/en_us_oca/me.m09.d14:meMA.Lauds3.melody	@ltx/en_us_oca/he.a.m8:heAU.OTouParadoxou.notmetered
ltx/en_us_oca/me.m09.d14:meMA.Lauds3.mode	@ltx/en_us_oca/miscellanea:misc.Mode8
ltx/en_us_oca/me.m09.d14:meMA.Lauds3.text	
ltx/en_us_oca/me.m09.d14:meMA.LaudsGlory.incipit	…
ltx/en_us_oca/me.m09.d14:meMA.LaudsGlory.melody	
ltx/en_us_oca/me.m09.d14:meMA.LaudsGlory.mode	@ltx/en_us_oca/miscellanea:misc.Mode6
ltx/en_us_oca/me.m09.d14:meMA.LaudsGlory.text	
ltx/en_us_oca/me.m09.d14:meMA.MM.Lauds1123as5678.text	@ltx/en_us_oca/properties:media.key
ltx/en_us_oca/me.m09.d14:meMA.Ode1C11.greekmelody	@ltx/en_us_oca/he.h.m8:heHE.StavronCharaxasMosis.greekname
ltx/en_us_oca/me.m09.d14:meMA.Ode1C11.incipit	In days of old, as…
ltx/en_us_oca/me.m09.d14:meMA.Ode1C11.melody	@ltx/en_us_oca/he.h.m8:heHE.StavronCharaxasMosis.notmetered
ltx/en_us_oca/me.m09.d14:meMA.Ode1C11.mode	@ltx/en_us_oca/miscellanea:misc.Mode8
ltx/en_us_oca/me.m09.d14:meMA.Ode1C11.ode	@ltx/en_us_oca/miscellanea:misc.Ode1
ltx/en_us_oca/me.m09.d14:meMA.Ode1C11.text	In days of old, as he stood between the two men of God, ⁄ Moses prefigured the undefiled Passion: ⁄ Forming a Cross with his outstretched hands, ⁄ he raised a standard of victory ⁄ and overthrew the power of the all-destroying Amalek. ⁄ Therefore let us sing to Christ our God, for He has been glorified!
ltx/en_us_oca/me.m09.d14:meMA.Ode1C12.incipit	Moses set up on a…
ltx/en_us_oca/me.m09.d14:meMA.Ode1C12.melody	@ltx/en_us_oca/he.h.m8:heHE.StavronCharaxasMosis.notmetered
ltx/en_us_oca/me.m09.d14:meMA.Ode1C12.mode	@ltx/en_us_oca/miscellanea:misc.Mode8
ltx/en_us_oca/me.m09.d14:meMA.Ode1C12.ode	@ltx/en_us_oca/miscellanea:misc.Ode1
ltx/en_us_oca/me.m09.d14:meMA.Ode1C12.text	Moses set up on a wooden pole ⁄ a cure against the deadly, poisonous bite of the serpents ⁄ as crosswise upon the wood - in a symbol of the Cross - ⁄ he placed a serpent that creeps upon the earth, ⁄ and thus he triumphed over the calamity. ⁄ Therefore let us sing to Christ our God, for He has been glorified.
ltx/en_us_oca/me.m09.d14:meMA.Ode1C13.incipit	Heaven revealed the Cross as…
ltx/en_us_oca/me.m09.d14:meMA.Ode1C13.melody	@ltx/en_us_oca/he.h.m8:heHE.StavronCharaxasMosis.notmetered
ltx/en_us_oca/me.m09.d14:meMA.Ode1C13.mode	@ltx/en_us_oca/miscellanea:misc.Mode8
ltx/en_us_oca/me.m09.d14:meMA.Ode1C13.ode	@ltx/en_us_oca/miscellanea:misc.Ode1
ltx/en_us_oca/me.m09.d14:meMA.Ode1C13.text	Heaven revealed the Cross as a sign of victory ⁄ to Constantine, the holy king and upholder of the faith. ⁄ The proud insolence of his enemies was cast down through it, ⁄ deceit was overthrown, ⁄ and the divine faith was spread to the ends of the earth. ⁄ Therefore let us sing to Christ our God, for He has been glorified!
ltx/en_us_oca/me.m09.d14:meMA.Ode1C1H.greekmelody	@ltx/en_us_oca/he.h.m8:heHE.StavronCharaxasMosis.greekname
ltx/en_us_oca/me.m09.d14:meMA.Ode1C1H.incipit	@ltx/en_us_oca/he.h.m8:heHE.StavronCharaxasMosis.incipit
ltx/en_us_oca/me.m09.d14:meMA.Ode1C1H.melody	@ltx/en_us_oca/he.h.m8:heHE.StavronCharaxasMosis.melody
ltx/en_us_oca/me.m09.d14:meMA.Ode1C1H.mode	@ltx/en_us_oca/miscellanea:misc.Mode8
ltx/en_us_oca/me.m09.d14:meMA.Ode1C1H.ode	@ltx/en_us_oca/miscellanea:misc.Ode1
ltx/en_us_oca/me.m09.d14:meMA.Ode1C1H.text	@ltx/en_us_oca/he.h.m8:heHE.StavronCharaxasMosis.text
ltx/en_us_oca/me.m09.d14:meMA.Ode3C11.greekmelody	@ltx/en_us_oca/he.h.m8:heHE.RavdosEisTypon.greekname
ltx/en_us_oca/me.m09.d14:meMA.Ode3C11.incipit	The rock that was struck…
ltx/en_us_oca/me.m09.d14:meMA.Ode3C11.melody	@ltx/en_us_oca/he.h.m8:heHE.RavdosEisTypon.notmetered
ltx/en_us_oca/me.m09.d14:meMA.Ode3C11.mode	@ltx/en_us_oca/miscellanea:misc.Mode8
ltx/en_us_oca/me.m09.d14:meMA.Ode3C11.ode	@ltx/en_us_oca/miscellanea:misc.Ode3
ltx/en_us_oca/me.m09.d14:meMA.Ode3C11.text	The rock that was struck, gushing forth water ⁄ for a hard-hearted and disobedient people, ⁄ made manifest the mystery of the divinely chosen Church, ⁄ for the Cross is her strength and steadfastness.
ltx/en_us_oca/me.m09.d14:meMA.Ode3C12.incipit	When the spear pierced Your…
ltx/en_us_oca/me.m09.d14:meMA.Ode3C12.melody	@ltx/en_us_oca/he.h.m8:heHE.RavdosEisTypon.notmetered
ltx/en_us_oca/me.m09.d14:meMA.Ode3C12.mode	@ltx/en_us_oca/miscellanea:misc.Mode8
ltx/en_us_oca/me.m09.d14:meMA.Ode3C12.ode	@ltx/en_us_oca/miscellanea:misc.Ode3
ltx/en_us_oca/me.m09.d14:meMA.Ode3C12.text	When the spear pierced Your immaculate side, ⁄ water came forth together with blood, ⁄ for the cleansing of sin and establishing of Your New Testament. ⁄ For the Cross is the glory of the faithful, ⁄ the strength and steadfastness of kings.
ltx/en_us_oca/me.m09.d14:meMA.Ode3C1H.greekmelody	@ltx/en_us_oca/he.h.m8:heHE.RavdosEisTypon.greekname
ltx/en_us_oca/me.m09.d14:meMA.Ode3C1H.incipit	@ltx/en_us_oca/he.h.m8:heHE.RavdosEisTypon.incipit
ltx/en_us_oca/me.m09.d14:meMA.Ode3C1H.melody	@ltx/en_us_oca/he.h.m8:heHE.RavdosEisTypon.melody
ltx/en_us_oca/me.m09.d14:meMA.Ode3C1H.mode	@ltx/en_us_oca/miscellanea:misc.Mode8
ltx/en_us_oca/me.m09.d14:meMA.Ode3C1H.ode	@ltx/en_us_oca/miscellanea:misc.Ode3
ltx/en_us_oca/me.m09.d14:meMA.Ode3C1H.text	@ltx/en_us_oca/he.h.m8:heHE.RavdosEisTypon.text
ltx/en_us_oca/me.m09.d14:meMA.Ode3Kathisma1.greekmelody	@ltx/en_us_oca/he.a.m8:heAU.ToProstachthen.greekname
ltx/en_us_oca/me.m09.d14:meMA.Ode3Kathisma1.incipit	@ltx/en_us_oca/oc.m8.d4:ocMA.Kathisma22.incipit
ltx/en_us_oca/me.m09.d14:meMA.Ode3Kathisma1.melody	@ltx/en_us_oca/he.a.m8:heAU.ToProstachthen.notmetered
ltx/en_us_oca/me.m09.d14:meMA.Ode3Kathisma1.mode	@ltx/en_us_oca/miscellanea:misc.Mode8
ltx/en_us_oca/me.m09.d14:meMA.Ode3Kathisma1.text	@ltx/en_us_oca/oc.m8.d4:ocMA.Kathisma22.text
ltx/en_us_oca/me.m09.d14:meMA.Ode4C11.greekmelody	@ltx/en_us_oca/he.h.m8:heHE.EisakikoaKyrie.greekname
ltx/en_us_oca/me.m09.d14:meMA.Ode4C11.incipit	In days of old, Moses…
ltx/en_us_oca/me.m09.d14:meMA.Ode4C11.melody	@ltx/en_us_oca/he.h.m8:heHE.EisakikoaKyrie.notmetered
ltx/en_us_oca/me.m09.d14:meMA.Ode4C11.mode	@ltx/en_us_oca/miscellanea:misc.Mode8
ltx/en_us_oca/me.m09.d14:meMA.Ode4C11.ode	@ltx/en_us_oca/miscellanea:misc.Ode4
ltx/en_us_oca/me.m09.d14:meMA.Ode4C11.text	In days of old, Moses transformed with wood ⁄ the bitter wells in the wilderness, ⁄ prefiguring the bringing of the gentiles ⁄ to the true faith through the Cross.
ltx/en_us_oca/me.m09.d14:meMA.Ode4C12.incipit	Jordan received a sharpened ax…
ltx/en_us_oca/me.m09.d14:meMA.Ode4C12.melody	@ltx/en_us_oca/he.h.m8:heHE.EisakikoaKyrie.notmetered
ltx/en_us_oca/me.m09.d14:meMA.Ode4C12.mode	@ltx/en_us_oca/miscellanea:misc.Mode8
ltx/en_us_oca/me.m09.d14:meMA.Ode4C12.ode	@ltx/en_us_oca/miscellanea:misc.Ode4
ltx/en_us_oca/me.m09.d14:meMA.Ode4C12.text	Jordan received a sharpened ax into its deep bosom, ⁄ and was forced by a stick of wood to give it up again, ⁄ as a token of the cutting of error by the Cross and baptism.
ltx/en_us_oca/me.m09.d14:meMA.Ode4C13.incipit	The people of Israel, ⁄…
ltx/en_us_oca/me.m09.d14:meMA.Ode4C13.melody	@ltx/en_us_oca/he.h.m8:heHE.EisakikoaKyrie.notmetered
ltx/en_us_oca/me.m09.d14:meMA.Ode4C13.mode	@ltx/en_us_oca/miscellanea:misc.Mode8
ltx/en_us_oca/me.m09.d14:meMA.Ode4C13.ode	@ltx/en_us_oca/miscellanea:misc.Ode4
ltx/en_us_oca/me.m09.d14:meMA.Ode4C13.text	The people of Israel, ⁄ a sacred army drawn up in four divisions, ⁄ marched in this figure before the Ark of the testimony, ⁄ gaining glory by their ranks formed in the sign of the Cross.
ltx/en_us_oca/me.m09.d14:meMA.Ode4C14.incipit	Stretched out in wondrous fashion…
ltx/en_us_oca/me.m09.d14:meMA.Ode4C14.melody	@ltx/en_us_oca/he.h.m8:heHE.EisakikoaKyrie.notmetered
ltx/en_us_oca/me.m09.d14:meMA.Ode4C14.mode	@ltx/en_us_oca/miscellanea:misc.Mode8
ltx/en_us_oca/me.m09.d14:meMA.Ode4C14.ode	@ltx/en_us_oca/miscellanea:misc.Ode4
ltx/en_us_oca/me.m09.d14:meMA.Ode4C14.text	Stretched out in wondrous fashion, ⁄ the Cross sent forth rays as the sun, ⁄ and the heavens declared the glory of God!
ltx/en_us_oca/me.m09.d14:meMA.Ode4C1H.greekmelody	@ltx/en_us_oca/he.h.m8:heHE.EisakikoaKyrie.greekname
ltx/en_us_oca/me.m09.d14:meMA.Ode4C1H.incipit	@ltx/en_us_oca/he.h.m8:heHE.EisakikoaKyrie.incipit
ltx/en_us_oca/me.m09.d14:meMA.Ode4C1H.melody	@ltx/en_us_oca/he.h.m8:heHE.EisakikoaKyrie.melody
ltx/en_us_oca/me.m09.d14:meMA.Ode4C1H.mode	@ltx/en_us_oca/miscellanea:misc.Mode8
ltx/en_us_oca/me.m09.d14:meMA.Ode4C1H.ode	@ltx/en_us_oca/miscellanea:misc.Ode4
ltx/en_us_oca/me.m09.d14:meMA.Ode4C1H.text	@ltx/en_us_oca/he.h.m8:heHE.EisakikoaKyrie.text
ltx/en_us_oca/me.m09.d14:meMA.Ode5C11.greekmelody	@ltx/en_us_oca/he.h.m8:heHE.OTrismakaristonXylon.greekname
ltx/en_us_oca/me.m09.d14:meMA.Ode5C11.incipit	O Wood, made famous in…
ltx/en_us_oca/me.m09.d14:meMA.Ode5C11.melody	@ltx/en_us_oca/he.h.m8:heHE.OTrismakaristonXylon.notmetered
ltx/en_us_oca/me.m09.d14:meMA.Ode5C11.mode	@ltx/en_us_oca/miscellanea:misc.Mode8
ltx/en_us_oca/me.m09.d14:meMA.Ode5C11.ode	@ltx/en_us_oca/miscellanea:misc.Ode5
ltx/en_us_oca/me.m09.d14:meMA.Ode5C11.text	O Wood, made famous in song, ⁄ Cross on which Christ was outstretched: ⁄ the whirling sword that guarded Eden was afraid of you, ⁄ and the dread cherubim gave way before Christ crucified on you ⁄ granting peace to our souls.
ltx/en_us_oca/me.m09.d14:meMA.Ode5C12.incipit	Our adversaries, the powers from…
ltx/en_us_oca/me.m09.d14:meMA.Ode5C12.melody	@ltx/en_us_oca/he.h.m8:heHE.OTrismakaristonXylon.notmetered
ltx/en_us_oca/me.m09.d14:meMA.Ode5C12.mode	@ltx/en_us_oca/miscellanea:misc.Mode8
ltx/en_us_oca/me.m09.d14:meMA.Ode5C12.ode	@ltx/en_us_oca/miscellanea:misc.Ode5
ltx/en_us_oca/me.m09.d14:meMA.Ode5C12.text	Our adversaries, the powers from beneath the earth, ⁄ tremble when they see the sign of the Cross ⁄ displayed in the air where they dwell; ⁄ and the ranks of those who dwell in heaven ⁄ together with those born on earth ⁄ bow the knee before Christ Who grants peace to our souls.
ltx/en_us_oca/me.m09.d14:meMA.Ode5C13.incipit	Shining with pure rays, the…
ltx/en_us_oca/me.m09.d14:meMA.Ode5C13.melody	@ltx/en_us_oca/he.h.m8:heHE.OTrismakaristonXylon.notmetered
ltx/en_us_oca/me.m09.d14:meMA.Ode5C13.mode	@ltx/en_us_oca/miscellanea:misc.Mode8
ltx/en_us_oca/me.m09.d14:meMA.Ode5C13.ode	@ltx/en_us_oca/miscellanea:misc.Ode5
ltx/en_us_oca/me.m09.d14:meMA.Ode5C13.text	Shining with pure rays, the Holy Cross sheds its divine light ⁄ upon the nations darkened by beguiling error, ⁄ and it reconciles them to Christ Who was crucified on it ⁄ granting peace to our souls.
ltx/en_us_oca/me.m09.d14:meMA.Ode5C1H.greekmelody	@ltx/en_us_oca/he.h.m8:heHE.OTrismakaristonXylon.greekname
ltx/en_us_oca/me.m09.d14:meMA.Ode5C1H.incipit	@ltx/en_us_oca/he.h.m8:heHE.OTrismakaristonXylon.incipit
ltx/en_us_oca/me.m09.d14:meMA.Ode5C1H.melody	@ltx/en_us_oca/he.h.m8:heHE.OTrismakaristonXylon.melody
ltx/en_us_oca/me.m09.d14:meMA.Ode5C1H.mode	@ltx/en_us_oca/miscellanea:misc.Mode8
ltx/en_us_oca/me.m09.d14:meMA.Ode5C1H.ode	@ltx/en_us_oca/miscellanea:misc.Ode5
ltx/en_us_oca/me.m09.d14:meMA.Ode5C1H.text	@ltx/en_us_oca/he.h.m8:heHE.OTrismakaristonXylon.text
ltx/en_us_oca/me.m09.d14:meMA.Ode6C11.greekmelody	@ltx/en_us_oca/he.h.m8:heHE.NotiouThiros.greekname
ltx/en_us_oca/me.m09.d14:meMA.Ode6C11.incipit	Bent with age and wasted…
ltx/en_us_oca/me.m09.d14:meMA.Ode6C11.melody	@ltx/en_us_oca/he.h.m8:heHE.NotiouThiros.notmetered
ltx/en_us_oca/me.m09.d14:meMA.Ode6C11.mode	@ltx/en_us_oca/miscellanea:misc.Mode8
ltx/en_us_oca/me.m09.d14:meMA.Ode6C11.ode	@ltx/en_us_oca/miscellanea:misc.Ode6
ltx/en_us_oca/me.m09.d14:meMA.Ode6C11.text	Bent with age and wasted by sickness, ⁄ Jacob was straightened when he crossed his hands, ⁄ thus showing the power of the life-giving Cross. ⁄ For God Who was crucified on it in the flesh ⁄ thus rewrote the letter of the old law that was in shadows, ⁄ and drove away the soul-destroying disease of error.
ltx/en_us_oca/me.m09.d14:meMA.Ode6C12.incipit	By laying his hands crosswise…
ltx/en_us_oca/me.m09.d14:meMA.Ode6C12.melody	@ltx/en_us_oca/he.h.m8:heHE.NotiouThiros.notmetered
ltx/en_us_oca/me.m09.d14:meMA.Ode6C12.mode	@ltx/en_us_oca/miscellanea:misc.Mode6
ltx/en_us_oca/me.m09.d14:meMA.Ode6C12.ode	@ltx/en_us_oca/miscellanea:misc.Ode8
ltx/en_us_oca/me.m09.d14:meMA.Ode6C12.text	By laying his hands crosswise on the heads of the young ⁄ holy Israel signified that the people serving under the law ⁄ should for a time have the honor due to the first born. ⁄ When suspected of error in this, he did not change the life-giving figure: ⁄ For, he cried, the newly-planted people of Christ our God ⁄ shall take the higher place, strengthened by the Cross!
ltx/en_us_oca/me.m09.d14:meMA.Ode6C1H.greekmelody	@ltx/en_us_oca/he.h.m8:heHE.NotiouThiros.greekname
ltx/en_us_oca/me.m09.d14:meMA.Ode6C1H.incipit	@ltx/en_us_oca/he.h.m8:heHE.NotiouThiros.incipit
ltx/en_us_oca/me.m09.d14:meMA.Ode6C1H.melody	@ltx/en_us_oca/he.h.m8:heHE.NotiouThiros.melody
ltx/en_us_oca/me.m09.d14:meMA.Ode6C1H.mode	@ltx/en_us_oca/miscellanea:misc.Mode8
ltx/en_us_oca/me.m09.d14:meMA.Ode6C1H.ode	@ltx/en_us_oca/miscellanea:misc.Ode6
ltx/en_us_oca/me.m09.d14:meMA.Ode6C1H.text	@ltx/en_us_oca/he.h.m8:heHE.NotiouThiros.text
ltx/en_us_oca/me.m09.d14:meMA.Ode7C11.greekmelody	@ltx/en_us_oca/he.h.m8:heHE.EknoonProstagma.greekname
ltx/en_us_oca/me.m09.d14:meMA.Ode7C11.incipit	The first man went to…
ltx/en_us_oca/me.m09.d14:meMA.Ode7C11.melody	@ltx/en_us_oca/he.h.m8:heHE.EknoonProstagma.notmetered
ltx/en_us_oca/me.m09.d14:meMA.Ode7C11.mode	@ltx/en_us_oca/miscellanea:misc.Mode8
ltx/en_us_oca/me.m09.d14:meMA.Ode7C11.ode	@ltx/en_us_oca/miscellanea:misc.Ode7
ltx/en_us_oca/me.m09.d14:meMA.Ode7C11.text	The first man went to dwell in corruption ⁄ from eating of the tree. ⁄ Condemned to shameful banishment from life, ⁄ he fell prey to bodily corruption ⁄ which he transmitted to all our kind like some pollution from disease. ⁄ But finding restoration in the wood of the Cross, ⁄ those who dwell on earth cry out: ⁄ Blessed are You and praised above all, ⁄ our God and the God of our fathers!
ltx/en_us_oca/me.m09.d14:meMA.Ode7C12.incipit	The breaking of the law…
ltx/en_us_oca/me.m09.d14:meMA.Ode7C12.melody	@ltx/en_us_oca/he.h.m8:heHE.EknoonProstagma.notmetered
ltx/en_us_oca/me.m09.d14:meMA.Ode7C12.mode	@ltx/en_us_oca/miscellanea:misc.Mode8
ltx/en_us_oca/me.m09.d14:meMA.Ode7C12.ode	@ltx/en_us_oca/miscellanea:misc.Ode7
ltx/en_us_oca/me.m09.d14:meMA.Ode7C12.text	The breaking of the law of God came through disobedience, ⁄ and the untimely partaking of the fruit of the tree ⁄ brought death to mortals. ⁄ From that time, the tree of precious life was guarded, ⁄ until the confession of the good thief opened the way to it once more ⁄ as he perished in agony crying: ⁄ Blessed are You and praised above all, ⁄ our God and the God of our fathers!
ltx/en_us_oca/me.m09.d14:meMA.Ode7C13.incipit	Foreseeing the future, ⁄ Israel…
ltx/en_us_oca/me.m09.d14:meMA.Ode7C13.melody	@ltx/en_us_oca/he.h.m8:heHE.EknoonProstagma.notmetered
ltx/en_us_oca/me.m09.d14:meMA.Ode7C13.mode	@ltx/en_us_oca/miscellanea:misc.Mode8
ltx/en_us_oca/me.m09.d14:meMA.Ode7C13.ode	@ltx/en_us_oca/miscellanea:misc.Ode7
ltx/en_us_oca/me.m09.d14:meMA.Ode7C13.text	Foreseeing the future, ⁄ Israel reverenced the top of Joseph’s staff, ⁄ revealing how in times to come the most glorious Cross ⁄ should be the safe-guard of royal power. ⁄ For it is a triumphal glory to kings, ⁄ and a light to those who cry with faith: ⁄ Blessed are You and praised above all, ⁄ our God and the God of our fathers.
ltx/en_us_oca/me.m09.d14:meMA.Ode7C1H.greekmelody	@ltx/en_us_oca/he.h.m8:heHE.EknoonProstagma.greekname
ltx/en_us_oca/me.m09.d14:meMA.Ode7C1H.incipit	@ltx/en_us_oca/he.h.m8:heHE.EknoonProstagma.incipit
ltx/en_us_oca/me.m09.d14:meMA.Ode7C1H.melody	@ltx/en_us_oca/he.h.m8:heHE.EknoonProstagma.melody
ltx/en_us_oca/me.m09.d14:meMA.Ode7C1H.mode	@ltx/en_us_oca/miscellanea:misc.Mode8
ltx/en_us_oca/me.m09.d14:meMA.Ode7C1H.ode	@ltx/en_us_oca/miscellanea:misc.Ode7
ltx/en_us_oca/me.m09.d14:meMA.Ode7C1H.text	@ltx/en_us_oca/he.h.m8:heHE.EknoonProstagma.text
ltx/en_us_oca/me.m09.d14:meMA.Ode8C11.greekmelody	@ltx/en_us_oca/he.h.m8:heHE.EvlogeitePaides.greekname
ltx/en_us_oca/me.m09.d14:meMA.Ode8C11.incipit	Sing praises, powers of heaven…
ltx/en_us_oca/me.m09.d14:meMA.Ode8C11.melody	@ltx/en_us_oca/he.h.m8:heHE.EvlogeitePaides.notmetered
ltx/en_us_oca/me.m09.d14:meMA.Ode8C11.mode	@ltx/en_us_oca/miscellanea:misc.Mode8
ltx/en_us_oca/me.m09.d14:meMA.Ode8C11.ode	@ltx/en_us_oca/miscellanea:misc.Ode8
ltx/en_us_oca/me.m09.d14:meMA.Ode8C11.text	Sing praises, powers of heaven, ⁄ at the exaltation of the Wood ⁄ sprinkled with the blood of the Incarnate Word of God, ⁄ celebrating the restoration of mortals. ⁄ Venerate the Cross of Christ, O people, ⁄ by which Resurrection is granted to the world throughout all ages.
ltx/en_us_oca/me.m09.d14:meMA.Ode8C12.incipit	Earthly instruments of grace, with…
ltx/en_us_oca/me.m09.d14:meMA.Ode8C12.melody	@ltx/en_us_oca/he.h.m8:heHE.EvlogeitePaides.notmetered
ltx/en_us_oca/me.m09.d14:meMA.Ode8C12.mode	@ltx/en_us_oca/miscellanea:misc.Mode8
ltx/en_us_oca/me.m09.d14:meMA.Ode8C12.ode	@ltx/en_us_oca/miscellanea:misc.Ode8
ltx/en_us_oca/me.m09.d14:meMA.Ode8C12.text	Earthly instruments of grace, with reverent hands ⁄ lift up the Cross on which Christ our God hung, ⁄ and the lance that pierced the body of God the Word. ⁄ Let all nations see the salvation of God ⁄ and glorify Him throughout all ages.
ltx/en_us_oca/me.m09.d14:meMA.Ode8C13.incipit	Rejoice, faithful Christians, ⁄ forechosen…
ltx/en_us_oca/me.m09.d14:meMA.Ode8C13.melody	@ltx/en_us_oca/he.h.m8:heHE.EvlogeitePaides.notmetered
ltx/en_us_oca/me.m09.d14:meMA.Ode8C13.mode	@ltx/en_us_oca/miscellanea:misc.Mode8
ltx/en_us_oca/me.m09.d14:meMA.Ode8C13.ode	@ltx/en_us_oca/miscellanea:misc.Ode8
ltx/en_us_oca/me.m09.d14:meMA.Ode8C13.text	Rejoice, faithful Christians, ⁄ forechosen by divine decree! ⁄ Receiving the precious Cross from God, ⁄ make this victorious weapon your glory, ⁄ for by it the enemy that rashly seeks battle ⁄ is scattered throughout all ages.
ltx/en_us_oca/me.m09.d14:meMA.Ode8C1H.greekmelody	@ltx/en_us_oca/he.h.m8:heHE.EvlogeitePaides.greekname
ltx/en_us_oca/me.m09.d14:meMA.Ode8C1H.incipit	@ltx/en_us_oca/he.h.m8:heHE.EvlogeitePaides.incipit
ltx/en_us_oca/me.m09.d14:meMA.Ode8C1H.melody	@ltx/en_us_oca/he.h.m8:heHE.EvlogeitePaides.melody
ltx/en_us_oca/me.m09.d14:meMA.Ode8C1H.mode	@ltx/en_us_oca/miscellanea:misc.Mode8
ltx/en_us_oca/me.m09.d14:meMA.Ode8C1H.ode	@ltx/en_us_oca/miscellanea:misc.Ode8
ltx/en_us_oca/me.m09.d14:meMA.Ode8C1H.text	@ltx/en_us_oca/he.h.m8:heHE.EvlogeitePaides.text
ltx/en_us_oca/me.m09.d14:meMA.Ode9C11.greekmelody	@ltx/en_us_oca/he.h.m8:heHE.MystikosEiTheotoke.greekname
ltx/en_us_oca/me.m09.d14:meMA.Ode9C11.incipit	Let all the trees of…
ltx/en_us_oca/me.m09.d14:meMA.Ode9C11.melody	@ltx/en_us_oca/he.h.m8:heHE.MystikosEiTheotoke.notmetered
ltx/en_us_oca/me.m09.d14:meMA.Ode9C11.mode	@ltx/en_us_oca/miscellanea:misc.Mode8
ltx/en_us_oca/me.m09.d14:meMA.Ode9C11.ode	@ltx/en_us_oca/miscellanea:misc.Ode9
ltx/en_us_oca/me.m09.d14:meMA.Ode9C11.text	Let all the trees of the wood rejoice, ⁄ for their nature is sanctified by Christ. ⁄ He planted them in the beginning, ⁄ and on a tree was outstretched. ⁄ At its exaltation on this day, we worship Him and magnify you.
ltx/en_us_oca/me.m09.d14:meMA.Ode9C12.incipit	The Cross is raised up…
ltx/en_us_oca/me.m09.d14:meMA.Ode9C12.melody	@ltx/en_us_oca/he.h.m8:heHE.MystikosEiTheotoke.notmetered
ltx/en_us_oca/me.m09.d14:meMA.Ode9C12.mode	@ltx/en_us_oca/miscellanea:misc.Mode8
ltx/en_us_oca/me.m09.d14:meMA.Ode9C12.ode	@ltx/en_us_oca/miscellanea:misc.Ode9
ltx/en_us_oca/me.m09.d14:meMA.Ode9C12.text	The Cross is raised up as a sacred horn of strength to all God’s people, ⁄ whose foreheads are marked with it. ⁄ By this, all the horns of the spiritual powers of wickedness are crushed. ⁄ At its exaltation on this day, we worship Him and magnify you!
ltx/en_us_oca/me.m09.d14:meMA.Ode9C1H.greekmelody	@ltx/en_us_oca/he.h.m8:heHE.MystikosEiTheotoke.greekname
ltx/en_us_oca/me.m09.d14:meMA.Ode9C1H.incipit	@ltx/en_us_oca/he.h.m8:heHE.MystikosEiTheotoke.incipit
ltx/en_us_oca/me.m09.d14:meMA.Ode9C1H.melody	@ltx/en_us_oca/he.h.m8:heHE.MystikosEiTheotoke.melody
ltx/en_us_oca/me.m09.d14:meMA.Ode9C1H.mode	@ltx/en_us_oca/miscellanea:misc.Mode8
ltx/en_us_oca/me.m09.d14:meMA.Ode9C1H.ode	@ltx/en_us_oca/miscellanea:misc.Ode9
ltx/en_us_oca/me.m09.d14:meMA.Ode9C1H.text	@ltx/en_us_oca/he.h.m8:heHE.MystikosEiTheotoke.text
ltx/en_us_oca/me.m09.d14:meMA.Ode9C21.greekmelody	@ltx/en_us_oca/he.h.m8:heHE.ODiaVroseos.greekname
ltx/en_us_oca/me.m09.d14:meMA.Ode9C21.incipit	Not allowing the deadly bitterness…
ltx/en_us_oca/me.m09.d14:meMA.Ode9C21.melody	@ltx/en_us_oca/he.h.m8:heHE.ODiaVroseos.notmetered
ltx/en_us_oca/me.m09.d14:meMA.Ode9C21.mode	@ltx/en_us_oca/miscellanea:misc.Mode8
ltx/en_us_oca/me.m09.d14:meMA.Ode9C21.ode	@ltx/en_us_oca/miscellanea:misc.Ode9
ltx/en_us_oca/me.m09.d14:meMA.Ode9C21.text	Not allowing the deadly bitterness of the tree to remain, ⁄ You utterly destroyed it with the Cross, ⁄ as of old the wood once destroyed the bitterness of the waters of Marah, ⁄ prefiguring the strength of the Cross ⁄ which all the powers of heaven magnify.
ltx/en_us_oca/me.m09.d14:meMA.Ode9C22.incipit	Today You raise us up…
ltx/en_us_oca/me.m09.d14:meMA.Ode9C22.melody	@ltx/en_us_oca/he.h.m8:heHE.ODiaVroseos.notmetered
ltx/en_us_oca/me.m09.d14:meMA.Ode9C22.mode	@ltx/en_us_oca/miscellanea:misc.Mode8
ltx/en_us_oca/me.m09.d14:meMA.Ode9C22.ode	@ltx/en_us_oca/miscellanea:misc.Ode9
ltx/en_us_oca/me.m09.d14:meMA.Ode9C22.text	Today You raise us up again through the Cross, O Lord. ⁄ For we were plunged forever into the gloom of our forefather; ⁄ unrestrained greed thrust our nature down into delusion: ⁄ but now we have been restored to our full inheritance ⁄ by the light of Your Cross which we faithful magnify.
ltx/en_us_oca/me.m09.d14:meMA.Ode9C23.incipit	You formed the figure of…
ltx/en_us_oca/me.m09.d14:meMA.Ode9C23.melody	@ltx/en_us_oca/he.h.m8:heHE.ODiaVroseos.notmetered
ltx/en_us_oca/me.m09.d14:meMA.Ode9C23.mode	@ltx/en_us_oca/miscellanea:misc.Mode8
ltx/en_us_oca/me.m09.d14:meMA.Ode9C23.ode	@ltx/en_us_oca/miscellanea:misc.Ode9
ltx/en_us_oca/me.m09.d14:meMA.Ode9C23.text	You formed the figure of the Cross in the heavens, Lord, ⁄ to show it to the world, ⁄ reverenced everywhere as most glorious, ⁄ shining with infinite light. ⁄ It was invincible armor offered the king. ⁄ It is the holy Cross that all the powers of heaven magnify.
ltx/en_us_oca/me.m09.d14:meMA.Ode9C2H.greekmelody	@ltx/en_us_oca/he.h.m8:heHE.ODiaVroseos.greekname
ltx/en_us_oca/me.m09.d14:meMA.Ode9C2H.incipit	@ltx/en_us_oca/he.h.m8:heHE.ODiaVroseos.incipit
ltx/en_us_oca/me.m09.d14:meMA.Ode9C2H.melody	@ltx/en_us_oca/he.h.m8:heHE.ODiaVroseos.melody
ltx/en_us_oca/me.m09.d14:meMA.Ode9C2H.mode	@ltx/en_us_oca/miscellanea:misc.Mode8
ltx/en_us_oca/me.m09.d14:meMA.Ode9C2H.ode	@ltx/en_us_oca/miscellanea:misc.Ode9
ltx/en_us_oca/me.m09.d14:meMA.Ode9C2H.text	@ltx/en_us_oca/he.h.m8:heHE.ODiaVroseos.text
ltx/en_us_oca/me.m09.d14:meMA.Oikos1.text	The one who was caught up in the third heaven to paradise, and heard ineffable and divine words which it is not lawful for the human tongue to speak, wrote to the Galatians (as lovers of the Scriptures, you have read his words and know) “But God forbid,” he said, “that I should glory except in the Cross of our Lord Jesus Christ,” on which He killed our passions by His Passion. Let us, then, firmly hold fast to the Cross of the Lord, which is the glory of all of us. For this wood is our salvation, ⁄⁄ The invincible trophy, Your weapon of peace!
ltx/en_us_oca/me.m09.d14:meMA.PostGospelBoth.incipit	@ltx/en_us_oca/me.m09.d14:meSV.SticGlory.incipit
ltx/en_us_oca/me.m09.d14:meMA.PostGospelBoth.melody	
ltx/en_us_oca/me.m09.d14:meMA.PostGospelBoth.mode	@ltx/en_us_oca/miscellanea:misc.Mode2
ltx/en_us_oca/me.m09.d14:meMA.PostGospelBoth.text	@ltx/en_us_oca/me.m09.d14:meSV.SticGlory.text
ltx/en_us_oca/me.m09.d14:meMA.PostGospelGlory.incipit	@ltx/en_us_oca/me.m09.d14:meSV.SticGlory.incipit
ltx/en_us_oca/me.m09.d14:meMA.PostGospelGlory.melody	
ltx/en_us_oca/me.m09.d14:meMA.PostGospelGlory.mode	@ltx/en_us_oca/miscellanea:misc.Mode2
ltx/en_us_oca/me.m09.d14:meMA.PostGospelGlory.text	@ltx/en_us_oca/me.m09.d14:meSV.SticGlory.text
ltx/en_us_oca/me.m09.d14:meMA.PostGospelIdiomelon.incipit	…
ltx/en_us_oca/me.m09.d14:meMA.PostGospelIdiomelon.melody	
ltx/en_us_oca/me.m09.d14:meMA.PostGospelIdiomelon.mode	@ltx/en_us_oca/miscellanea:misc.Mode6
ltx/en_us_oca/me.m09.d14:meMA.PostGospelIdiomelon.text	
ltx/en_us_oca/me.m09.d14:meSV.AposGlory.incipit	Come in gladness! ⁄ let…
ltx/en_us_oca/me.m09.d14:meSV.AposGlory.melody	@ltx/en_us_oca/he.a.m2:heAU.OikosTouEfratha.notmetered
ltx/en_us_oca/me.m09.d14:meSV.AposGlory.mode	@ltx/en_us_oca/miscellanea:misc.Mode2
ltx/en_us_oca/me.m09.d14:meSV.AposGlory.text	Come in gladness! ⁄ let us all venerate ⁄ the life-bearing Tree ⁄ upon which was stretched ⁄⁄ Christ our Deliverer!
ltx/en_us_oca/me.m09.d14:meSV.Aposticha1.incipit	The Cross of Christ ⁄…
ltx/en_us_oca/me.m09.d14:meSV.Aposticha1.melody	@ltx/en_us_oca/he.a.m2:heAU.OikosTouEfratha.notmetered
ltx/en_us_oca/me.m09.d14:meSV.Aposticha1.mode	@ltx/en_us_oca/miscellanea:misc.Mode2
ltx/en_us_oca/me.m09.d14:meSV.Aposticha1.text	The Cross of Christ ⁄ is exalted today! ⁄ It is the life-bearing Tree ⁄ upon which ⁄⁄ He was nailed in the flesh.
ltx/en_us_oca/me.m09.d14:meSV.Aposticha2.incipit	…
ltx/en_us_oca/me.m09.d14:meSV.Aposticha2.melody	@ltx/en_us_oca/he.a.m2:heAU.OikosTouEfratha.notmetered
ltx/en_us_oca/me.m09.d14:meSV.Aposticha2.mode	@ltx/en_us_oca/miscellanea:misc.Mode2
ltx/en_us_oca/me.m09.d14:meSV.Aposticha2.text	
ltx/en_us_oca/me.m09.d14:meSV.Aposticha3.incipit	Rejoice, divine salvation ⁄ for…
ltx/en_us_oca/me.m09.d14:meSV.Aposticha3.melody	@ltx/en_us_oca/he.a.m2:heAU.OikosTouEfratha.notmetered
ltx/en_us_oca/me.m09.d14:meSV.Aposticha3.mode	@ltx/en_us_oca/miscellanea:misc.Mode2
ltx/en_us_oca/me.m09.d14:meSV.Aposticha3.text	Rejoice, divine salvation ⁄ for the faithful! ⁄ O Cross of the Lord, ⁄ You are the unassailable rampart, ⁄⁄ exalting us above the earth!
ltx/en_us_oca/me.m09.d14:meSV.SticGlory.incipit	Three-branched Cross of Christ, ⁄…
ltx/en_us_oca/me.m09.d14:meSV.SticGlory.melody	
ltx/en_us_oca/me.m09.d14:meSV.SticGlory.mode	@ltx/en_us_oca/miscellanea:misc.Mode2
ltx/en_us_oca/me.m09.d14:meSV.SticGlory.text	Three-branched Cross of Christ, ⁄ you are my strong protection. ⁄ Sanctify me by your might, ⁄⁄ that I may venerate and glorify you in faith and love.
ltx/en_us_oca/me.m09.d14:meSV.Stichera1.incipit	…
ltx/en_us_oca/me.m09.d14:meSV.Stichera1.melody	@ltx/en_us_oca/he.a.m4:heAU.OsGennaionEnMartysi.notmetered
ltx/en_us_oca/me.m09.d14:meSV.Stichera1.mode	@ltx/en_us_oca/miscellanea:misc.Mode4
ltx/en_us_oca/me.m09.d14:meSV.Stichera1.text	
ltx/en_us_oca/me.m09.d14:meSV.Stichera2.incipit	…
ltx/en_us_oca/me.m09.d14:meSV.Stichera2.melody	@ltx/en_us_oca/he.a.m4:heAU.OsGennaionEnMartysi.notmetered
ltx/en_us_oca/me.m09.d14:meSV.Stichera2.mode	@ltx/en_us_oca/miscellanea:misc.Mode4
ltx/en_us_oca/me.m09.d14:meSV.Stichera2.text	
ltx/en_us_oca/me.m09.d14:meSV.Stichera3.incipit	…
ltx/en_us_oca/me.m09.d14:meSV.Stichera3.melody	@ltx/en_us_oca/he.a.m4:heAU.OsGennaionEnMartysi.notmetered
ltx/en_us_oca/me.m09.d14:meSV.Stichera3.mode	@ltx/en_us_oca/miscellanea:misc.Mode4
ltx/en_us_oca/me.m09.d14:meSV.Stichera3.text	
ltx/en_us_oca/me.m09.d14:meVE.Apolytikion1.incipit	…
ltx/en_us_oca/me.m09.d14:meVE.Apolytikion1.melody	
ltx/en_us_oca/me.m09.d14:meVE.Apolytikion1.mode	@ltx/en_us_oca/miscellanea:misc.Mode1
ltx/en_us_oca/me.m09.d14:meVE.Apolytikion1.text	
ltx/en_us_oca/me.m09.d14:meVE.AposGlory.incipit	…
ltx/en_us_oca/me.m09.d14:meVE.AposGlory.melody	
ltx/en_us_oca/me.m09.d14:meVE.AposGlory.mode	@ltx/en_us_oca/miscellanea:misc.Mode8
ltx/en_us_oca/me.m09.d14:meVE.AposGlory.poet	@ltx/en_us_oca/poets:po.IoannouMonachou
ltx/en_us_oca/me.m09.d14:meVE.AposGlory.text	
ltx/en_us_oca/me.m09.d14:meVE.Aposticha1.greekmelody	@ltx/en_us_oca/he.a.m5:heAU.ChairoisAskitikon.greekname
ltx/en_us_oca/me.m09.d14:meVE.Aposticha1.incipit	@ltx/en_us_oca/me.m09.d13:meVE.Aposticha1.incipit
ltx/en_us_oca/me.m09.d14:meVE.Aposticha1.melody	@ltx/en_us_oca/he.a.m5:heAU.ChairoisAskitikon.name
ltx/en_us_oca/me.m09.d14:meVE.Aposticha1.mode	@ltx/en_us_oca/miscellanea:misc.Mode5
ltx/en_us_oca/me.m09.d14:meVE.Aposticha1.text	@ltx/en_us_oca/me.m09.d13:meVE.Aposticha1.text
ltx/en_us_oca/me.m09.d14:meVE.Aposticha2.incipit	@ltx/en_us_oca/me.m09.d13:meVE.Aposticha2.incipit
ltx/en_us_oca/me.m09.d14:meVE.Aposticha2.melody	@ltx/en_us_oca/he.a.m5:heAU.ChairoisAskitikon.name
ltx/en_us_oca/me.m09.d14:meVE.Aposticha2.mode	@ltx/en_us_oca/miscellanea:misc.Mode5
ltx/en_us_oca/me.m09.d14:meVE.Aposticha2.text	@ltx/en_us_oca/me.m09.d13:meVE.Aposticha2.text
ltx/en_us_oca/me.m09.d14:meVE.Aposticha3.incipit	@ltx/en_us_oca/me.m09.d13:meVE.Aposticha3.incipit
ltx/en_us_oca/me.m09.d14:meVE.Aposticha3.melody	@ltx/en_us_oca/he.a.m5:heAU.ChairoisAskitikon.name
ltx/en_us_oca/me.m09.d14:meVE.Aposticha3.mode	@ltx/en_us_oca/miscellanea:misc.Mode5
ltx/en_us_oca/me.m09.d14:meVE.Aposticha3.text	@ltx/en_us_oca/me.m09.d13:meVE.Aposticha3.text
ltx/en_us_oca/me.m09.d14:meVE.Lity1.incipit	Today the holy words of…
ltx/en_us_oca/me.m09.d14:meVE.Lity1.melody	
ltx/en_us_oca/me.m09.d14:meVE.Lity1.mode	@ltx/en_us_oca/miscellanea:misc.Mode1
ltx/en_us_oca/me.m09.d14:meVE.Lity1.poet	@ltx/en_us_oca/poets:po.AndreouIerosolymitou
ltx/en_us_oca/me.m09.d14:meVE.Lity1.text	Today the holy words of David have indeed received fulfillment, ⁄ for behold, in the sight of all the world ⁄ we venerate the footstool of Your undefiled feet ⁄ and putting our hope in the shadow of Your wings ⁄ we cry aloud to You, all-compassionate Lord: ⁄ May the light of Your countenance be marked as a sign upon us ⁄ and exalt the horn of Your Orthodox people ⁄ by the exaltation of Your precious Cross, ⁄⁄ Christ of many mercies!
ltx/en_us_oca/me.m09.d14:meVE.Lity2.incipit	The Tree of true life…
ltx/en_us_oca/me.m09.d14:meVE.Lity2.melody	
ltx/en_us_oca/me.m09.d14:meVE.Lity2.mode	@ltx/en_us_oca/miscellanea:misc.Mode1
ltx/en_us_oca/me.m09.d14:meVE.Lity2.text	The Tree of true life was planted in the place of the skull ⁄ and upon it, eternal King, You have worked salvation in the midst of the earth! ⁄ Exalted today, it sanctifies the ends of the world, ⁄ angels in heaven greatly rejoice ⁄ and men upon earth make glad, ⁄ crying aloud with David and saying: ⁄ Exalt the Lord our God and worship at His footstool, ⁄⁄ for He is holy and grants the world great mercy!
ltx/en_us_oca/me.m09.d14:meVE.Lity3.incipit	Prefiguring Your Cross, O Christ…
ltx/en_us_oca/me.m09.d14:meVE.Lity3.melody	
ltx/en_us_oca/me.m09.d14:meVE.Lity3.mode	@ltx/en_us_oca/miscellanea:misc.Mode1
ltx/en_us_oca/me.m09.d14:meVE.Lity3.text	Prefiguring Your Cross, O Christ, ⁄ the patriarch Jacob blessing his descendants, ⁄ laid his hands crosswise upon their heads. ⁄ And today as we exult Your Cross, Savior, we cry: ⁄ Give victory to the Orthodox Christians as You did to Constantine.
ltx/en_us_oca/me.m09.d14:meVE.Lity4.incipit	@ltx/en_us_oca/me.m09.d13:meVE.AposBoth.incipit
ltx/en_us_oca/me.m09.d14:meVE.Lity4.melody	
ltx/en_us_oca/me.m09.d14:meVE.Lity4.mode	@ltx/en_us_oca/miscellanea:misc.Mode2
ltx/en_us_oca/me.m09.d14:meVE.Lity4.poet	@ltx/en_us_oca/poets:po.Theofanous
ltx/en_us_oca/me.m09.d14:meVE.Lity4.text	@ltx/en_us_oca/me.m09.d13:meVE.AposBoth.text
ltx/en_us_oca/me.m09.d14:meVE.Lity5.incipit	The crossing of his hands…
ltx/en_us_oca/me.m09.d14:meVE.Lity5.melody	
ltx/en_us_oca/me.m09.d14:meVE.Lity5.mode	@ltx/en_us_oca/miscellanea:misc.Mode2
ltx/en_us_oca/me.m09.d14:meVE.Lity5.poet	@ltx/en_us_oca/poets:po.Kyprianou
ltx/en_us_oca/me.m09.d14:meVE.Lity5.text	The crossing of his hands by the patriarch Jacob ⁄ at the blessing of his children ⁄ foreshadowed the mighty token of Your Cross. ⁄ Having it as our safeguard which cannot be overthrown, ⁄ we drive out with invincible strength the hosts of demons; ⁄ and casting down the arrogance of Belial, ⁄ we put to flight the all-destroying power of hateful Amalek. ⁄ And now that it is lifted on high, ⁄ we the faithful offer it to Your goodness for the cleansing of our sins, ⁄ crying aloud with full voices: ⁄ Lord, made flesh of the Virgin, have mercy on us; ⁄ good One, take pity on Your creation, ⁄⁄ which You have fashioned in Your wisdom!
ltx/en_us_oca/me.m09.d14:meVE.Lity6.incipit	@ltx/en_us_oca/me.m09.d14:meSV.SticGlory.incipit
ltx/en_us_oca/me.m09.d14:meVE.Lity6.melody	
ltx/en_us_oca/me.m09.d14:meVE.Lity6.mode	@ltx/en_us_oca/miscellanea:misc.Mode2
ltx/en_us_oca/me.m09.d14:meVE.Lity6.poet	@ltx/en_us_oca/poets:po.LeontosDespotou
ltx/en_us_oca/me.m09.d14:meVE.Lity6.text	@ltx/en_us_oca/me.m09.d14:meSV.SticGlory.text
ltx/en_us_oca/me.m09.d14:meVE.Lity7.incipit	Let us make glad today…
ltx/en_us_oca/me.m09.d14:meVE.Lity7.melody	
ltx/en_us_oca/me.m09.d14:meVE.Lity7.mode	@ltx/en_us_oca/miscellanea:misc.Mode4
ltx/en_us_oca/me.m09.d14:meVE.Lity7.text	Let us make glad today and sing in honor of the feast, ⁄ and cry out openly with joyful faces and tongues: ⁄ O Christ, You have accepted condemnation for us, ⁄ being spat upon, scourged, and robed in purple, ⁄ You have gone up upon the Cross. ⁄ Seeing You, the sun and moon hid their light, ⁄ the earth quaked in fear, ⁄ and the veil of the temple was torn in two. ⁄ Grant us Yourself Your precious Cross as guardian and protector ⁄ the driver away of demons, ⁄ that embracing it we may cry aloud: ⁄ Save us, Cross, by your might! ⁄ Make us holy in your splendor, precious Cross, ⁄ and strengthen us through your exaltation: ⁄⁄ For you have been given to us as the light and salvation of our souls!
ltx/en_us_oca/me.m09.d14:meVE.Lity8.incipit	Cross, sign radiant with light…
ltx/en_us_oca/me.m09.d14:meVE.Lity8.melody	
ltx/en_us_oca/me.m09.d14:meVE.Lity8.mode	@ltx/en_us_oca/miscellanea:misc.Mode4
ltx/en_us_oca/me.m09.d14:meVE.Lity8.poet	@ltx/en_us_oca/poets:po.Anatoliou
ltx/en_us_oca/me.m09.d14:meVE.Lity8.text	Cross, sign radiant with light among the stars, ⁄ in prophecy you revealed a trophy of victory to the godly king; ⁄ and when his mother Helen found you, ⁄ she displayed you in the sight of the world. ⁄ And today the choirs of faithful shout aloud as they raise you on high: ⁄ Enlighten us with your brightness, life-giving and all-venerable Cross: ⁄ make us holy by your might ⁄ and lifted on high before your warriors, ⁄⁄ strengthen us through your exaltation!
ltx/en_us_oca/me.m09.d14:meVE.LityGlory.incipit	Moses prefigured the power of…
ltx/en_us_oca/me.m09.d14:meVE.LityGlory.melody	
ltx/en_us_oca/me.m09.d14:meVE.LityGlory.mode	@ltx/en_us_oca/miscellanea:misc.Mode4
ltx/en_us_oca/me.m09.d14:meVE.LityGlory.poet	@ltx/en_us_oca/poets:po.Anatoliou
ltx/en_us_oca/me.m09.d14:meVE.LityGlory.text	Moses prefigured the power of the precious Cross, O Christ ⁄ when he put to flight Amalek, his adversary in the wilderness of Sinai. ⁄ For when he stretched out his arms in the form of a cross ⁄ the people became strong again. ⁄ Now the fulfillment of these images has come to pass for us. ⁄ Today the Cross is exalted and the devils put to flight. ⁄ Today all creation is set free from corruption. ⁄ For through the Cross every gift of grace shines upon us ⁄ so we all fall before You rejoicing and crying: ⁄⁄ How wonderful are Your works, Lord: glory to You!
ltx/en_us_oca/me.m09.d14:meVE.MM.Stichera1123as78910.text	@ltx/en_us_oca/properties:media.key
ltx/en_us_oca/me.m09.d14:meVE.SticGlory.incipit	…
ltx/en_us_oca/me.m09.d14:meVE.SticGlory.melody	
ltx/en_us_oca/me.m09.d14:meVE.SticGlory.mode	@ltx/en_us_oca/miscellanea:misc.Mode2
ltx/en_us_oca/me.m09.d14:meVE.SticGlory.text	
ltx/en_us_oca/me.m09.d14:meVE.Stichera01.greekmelody	@ltx/en_us_oca/he.a.m6:heAU.OlinApothemenoi.greekname
ltx/en_us_oca/me.m09.d14:meVE.Stichera01.incipit	…
ltx/en_us_oca/me.m09.d14:meVE.Stichera01.melody	@ltx/en_us_oca/he.a.m6:heAU.OlinApothemenoi.notmetered
ltx/en_us_oca/me.m09.d14:meVE.Stichera01.mode	@ltx/en_us_oca/miscellanea:misc.Mode6
ltx/en_us_oca/me.m09.d14:meVE.Stichera01.text	
ltx/en_us_oca/me.m09.d14:meVE.Stichera02.incipit	…
ltx/en_us_oca/me.m09.d14:meVE.Stichera02.melody	@ltx/en_us_oca/he.a.m6:heAU.OlinApothemenoi.notmetered
ltx/en_us_oca/me.m09.d14:meVE.Stichera02.mode	@ltx/en_us_oca/miscellanea:misc.Mode6
ltx/en_us_oca/me.m09.d14:meVE.Stichera02.text	
ltx/en_us_oca/me.m09.d14:meVE.Stichera03.incipit	…
ltx/en_us_oca/me.m09.d14:meVE.Stichera03.melody	@ltx/en_us_oca/he.a.m6:heAU.OlinApothemenoi.notmetered
ltx/en_us_oca/me.m09.d14:meVE.Stichera03.mode	@ltx/en_us_oca/miscellanea:misc.Mode6
ltx/en_us_oca/me.m09.d14:meVE.Stichera03.text	
