ltx/en_us_oca/me.m08.d04:meDA.commemoration.first	
ltx/en_us_oca/me.m08.d04:meDA.commemoration.first_name	
ltx/en_us_oca/me.m08.d04:meDA.commemoration.first_short	
ltx/en_us_oca/me.m08.d04:meDA.commemoration.first_title	
ltx/en_us_oca/me.m08.d04:meDA.commemoration.full	
ltx/en_us_oca/me.m08.d04:meDA.commemoration.second_name	
ltx/en_us_oca/me.m08.d04:meDA.commemoration.second_title	
ltx/en_us_oca/me.m08.d04:meDA.date	
ltx/en_us_oca/me.m08.d04:meDA.fordate	
ltx/en_us_oca/me.m08.d04:meDA.insert1	
ltx/en_us_oca/me.m08.d04:meDA.insert2	
ltx/en_us_oca/me.m08.d04:meDA.note	
ltx/en_us_oca/me.m08.d04:meDA.pdfcoverdate	
ltx/en_us_oca/me.m08.d04:meDA.pdfheaderdate	
ltx/en_us_oca/me.m08.d04:meHO.commemorations	
ltx/en_us_oca/me.m08.d04:meHO.note1	
ltx/en_us_oca/me.m08.d04:meHO.note2	
ltx/en_us_oca/me.m08.d04:meHO.number	
ltx/en_us_oca/me.m08.d04:meHO.rank	
ltx/en_us_oca/me.m08.d04:meLE.commemoration1	
ltx/en_us_oca/me.m08.d04:meLE.commemoration2	
ltx/en_us_oca/me.m08.d04:meLI.Kontakion1.greekmelody	@ltx/en_us_oca/me.m08.d04:meMA.Kontakion1.greekmelody
ltx/en_us_oca/me.m08.d04:meLI.Kontakion1.incipit	@ltx/en_us_oca/me.m08.d04:meMA.Kontakion1.incipit
ltx/en_us_oca/me.m08.d04:meLI.Kontakion1.melody	@ltx/en_us_oca/me.m08.d04:meMA.Kontakion1.melody
ltx/en_us_oca/me.m08.d04:meLI.Kontakion1.mode	@ltx/en_us_oca/me.m08.d04:meMA.Kontakion1.mode
ltx/en_us_oca/me.m08.d04:meLI.Kontakion1.text	@ltx/en_us_oca/me.m08.d04:meMA.Kontakion1.text
ltx/en_us_oca/me.m08.d04:meLI.Megalynarion.text	
ltx/en_us_oca/me.m08.d04:meMA.C1.acrostic.notice1	
ltx/en_us_oca/me.m08.d04:meMA.C1.acrostic.notice2	
ltx/en_us_oca/me.m08.d04:meMA.C1.acrostic.text	
ltx/en_us_oca/me.m08.d04:meMA.C1.acrostic.title	
ltx/en_us_oca/me.m08.d04:meMA.C1.title	@ltx/en_us_oca/titles:ti.CanonSaints
ltx/en_us_oca/me.m08.d04:meMA.C1.verse	@ltx/en_us_oca/prayers:pr.verse_SaintsM.text
ltx/en_us_oca/me.m08.d04:meMA.ExapTheotokion.incipit	…
ltx/en_us_oca/me.m08.d04:meMA.ExapTheotokion.melody	@ltx/en_us_oca/he.a.m2:heAU.ToisMathitaisSynelthomen.notmetered
ltx/en_us_oca/me.m08.d04:meMA.ExapTheotokion.mode	@ltx/en_us_oca/miscellanea:misc.Mode2
ltx/en_us_oca/me.m08.d04:meMA.ExapTheotokion.text	
ltx/en_us_oca/me.m08.d04:meMA.Exaposteilarion1.greekmelody	@ltx/en_us_oca/he.a.m2:heAU.ToisMathitaisSynelthomen.greekname
ltx/en_us_oca/me.m08.d04:meMA.Exaposteilarion1.incipit	…
ltx/en_us_oca/me.m08.d04:meMA.Exaposteilarion1.melody	@ltx/en_us_oca/he.a.m2:heAU.ToisMathitaisSynelthomen.notmetered
ltx/en_us_oca/me.m08.d04:meMA.Exaposteilarion1.mode	@ltx/en_us_oca/miscellanea:misc.Mode2
ltx/en_us_oca/me.m08.d04:meMA.Exaposteilarion1.text	
ltx/en_us_oca/me.m08.d04:meMA.Kontakion1.greekmelody	@ltx/en_us_oca/he.a.m4:heAU.OYpsotheisEnToStavro.greekname
ltx/en_us_oca/me.m08.d04:meMA.Kontakion1.incipit	…
ltx/en_us_oca/me.m08.d04:meMA.Kontakion1.melody	@ltx/en_us_oca/he.a.m4:heAU.OYpsotheisEnToStavro.notmetered
ltx/en_us_oca/me.m08.d04:meMA.Kontakion1.mode	@ltx/en_us_oca/miscellanea:misc.Mode4
ltx/en_us_oca/me.m08.d04:meMA.Kontakion1.text	
ltx/en_us_oca/me.m08.d04:meMA.Ode1C11.greekmelody	@ltx/en_us_oca/he.h.m2:heHE.DefteLaoi.greekname
ltx/en_us_oca/me.m08.d04:meMA.Ode1C11.incipit	…
ltx/en_us_oca/me.m08.d04:meMA.Ode1C11.melody	@ltx/en_us_oca/he.h.m2:heHE.DefteLaoi.notmetered
ltx/en_us_oca/me.m08.d04:meMA.Ode1C11.mode	@ltx/en_us_oca/miscellanea:misc.Mode2
ltx/en_us_oca/me.m08.d04:meMA.Ode1C11.ode	@ltx/en_us_oca/miscellanea:misc.Ode1
ltx/en_us_oca/me.m08.d04:meMA.Ode1C11.text	
ltx/en_us_oca/me.m08.d04:meMA.Ode1C12.incipit	…
ltx/en_us_oca/me.m08.d04:meMA.Ode1C12.melody	@ltx/en_us_oca/he.h.m2:heHE.DefteLaoi.notmetered
ltx/en_us_oca/me.m08.d04:meMA.Ode1C12.mode	@ltx/en_us_oca/miscellanea:misc.Mode2
ltx/en_us_oca/me.m08.d04:meMA.Ode1C12.ode	@ltx/en_us_oca/miscellanea:misc.Ode1
ltx/en_us_oca/me.m08.d04:meMA.Ode1C12.text	
ltx/en_us_oca/me.m08.d04:meMA.Ode1C13.incipit	…
ltx/en_us_oca/me.m08.d04:meMA.Ode1C13.melody	@ltx/en_us_oca/he.h.m2:heHE.DefteLaoi.notmetered
ltx/en_us_oca/me.m08.d04:meMA.Ode1C13.mode	@ltx/en_us_oca/miscellanea:misc.Mode2
ltx/en_us_oca/me.m08.d04:meMA.Ode1C13.ode	@ltx/en_us_oca/miscellanea:misc.Ode1
ltx/en_us_oca/me.m08.d04:meMA.Ode1C13.text	
ltx/en_us_oca/me.m08.d04:meMA.Ode1C14.incipit	…
ltx/en_us_oca/me.m08.d04:meMA.Ode1C14.melody	@ltx/en_us_oca/he.h.m2:heHE.DefteLaoi.notmetered
ltx/en_us_oca/me.m08.d04:meMA.Ode1C14.mode	@ltx/en_us_oca/miscellanea:misc.Mode2
ltx/en_us_oca/me.m08.d04:meMA.Ode1C14.ode	@ltx/en_us_oca/miscellanea:misc.Ode1
ltx/en_us_oca/me.m08.d04:meMA.Ode1C14.text	
ltx/en_us_oca/me.m08.d04:meMA.Ode1C1T.incipit	…
ltx/en_us_oca/me.m08.d04:meMA.Ode1C1T.melody	@ltx/en_us_oca/he.h.m2:heHE.DefteLaoi.notmetered
ltx/en_us_oca/me.m08.d04:meMA.Ode1C1T.mode	@ltx/en_us_oca/miscellanea:misc.Mode2
ltx/en_us_oca/me.m08.d04:meMA.Ode1C1T.ode	@ltx/en_us_oca/miscellanea:misc.Ode1
ltx/en_us_oca/me.m08.d04:meMA.Ode1C1T.text	
ltx/en_us_oca/me.m08.d04:meMA.Ode3C11.greekmelody	@ltx/en_us_oca/he.h.m2:heHE.StereosonImasEnSoiKyrie.greekname
ltx/en_us_oca/me.m08.d04:meMA.Ode3C11.incipit	…
ltx/en_us_oca/me.m08.d04:meMA.Ode3C11.melody	@ltx/en_us_oca/he.h.m2:heHE.StereosonImasEnSoiKyrie.notmetered
ltx/en_us_oca/me.m08.d04:meMA.Ode3C11.mode	@ltx/en_us_oca/miscellanea:misc.Mode2
ltx/en_us_oca/me.m08.d04:meMA.Ode3C11.ode	@ltx/en_us_oca/miscellanea:misc.Ode3
ltx/en_us_oca/me.m08.d04:meMA.Ode3C11.text	
ltx/en_us_oca/me.m08.d04:meMA.Ode3C12.incipit	…
ltx/en_us_oca/me.m08.d04:meMA.Ode3C12.melody	@ltx/en_us_oca/he.h.m2:heHE.StereosonImasEnSoiKyrie.notmetered
ltx/en_us_oca/me.m08.d04:meMA.Ode3C12.mode	@ltx/en_us_oca/miscellanea:misc.Mode2
ltx/en_us_oca/me.m08.d04:meMA.Ode3C12.ode	@ltx/en_us_oca/miscellanea:misc.Ode3
ltx/en_us_oca/me.m08.d04:meMA.Ode3C12.text	
ltx/en_us_oca/me.m08.d04:meMA.Ode3C13.incipit	…
ltx/en_us_oca/me.m08.d04:meMA.Ode3C13.melody	@ltx/en_us_oca/he.h.m2:heHE.StereosonImasEnSoiKyrie.notmetered
ltx/en_us_oca/me.m08.d04:meMA.Ode3C13.mode	@ltx/en_us_oca/miscellanea:misc.Mode2
ltx/en_us_oca/me.m08.d04:meMA.Ode3C13.ode	@ltx/en_us_oca/miscellanea:misc.Ode3
ltx/en_us_oca/me.m08.d04:meMA.Ode3C13.text	
ltx/en_us_oca/me.m08.d04:meMA.Ode3C1T.incipit	…
ltx/en_us_oca/me.m08.d04:meMA.Ode3C1T.melody	@ltx/en_us_oca/he.h.m2:heHE.StereosonImasEnSoiKyrie.notmetered
ltx/en_us_oca/me.m08.d04:meMA.Ode3C1T.mode	@ltx/en_us_oca/miscellanea:misc.Mode2
ltx/en_us_oca/me.m08.d04:meMA.Ode3C1T.ode	@ltx/en_us_oca/miscellanea:misc.Ode3
ltx/en_us_oca/me.m08.d04:meMA.Ode3C1T.text	
ltx/en_us_oca/me.m08.d04:meMA.Ode3H.greekmelody	@ltx/en_us_oca/he.h.m2:heHE.StereosonImasEnSoiKyrie.greekname
ltx/en_us_oca/me.m08.d04:meMA.Ode3H.incipit	@ltx/en_us_oca/he.h.m2:heHE.StereosonImasEnSoiKyrie.incipit
ltx/en_us_oca/me.m08.d04:meMA.Ode3H.melody	@ltx/en_us_oca/he.h.m2:heHE.StereosonImasEnSoiKyrie.melody
ltx/en_us_oca/me.m08.d04:meMA.Ode3H.mode	@ltx/en_us_oca/miscellanea:misc.Mode2
ltx/en_us_oca/me.m08.d04:meMA.Ode3H.ode	@ltx/en_us_oca/miscellanea:misc.Ode3
ltx/en_us_oca/me.m08.d04:meMA.Ode3H.text	@ltx/en_us_oca/he.h.m2:heHE.StereosonImasEnSoiKyrie.text
ltx/en_us_oca/me.m08.d04:meMA.Ode3Kathisma1.greekmelody	@ltx/en_us_oca/he.a.m4:heAU.OYpsotheisEnToStavro.greekname
ltx/en_us_oca/me.m08.d04:meMA.Ode3Kathisma1.incipit	…
ltx/en_us_oca/me.m08.d04:meMA.Ode3Kathisma1.melody	@ltx/en_us_oca/he.a.m4:heAU.OYpsotheisEnToStavro.notmetered
ltx/en_us_oca/me.m08.d04:meMA.Ode3Kathisma1.mode	@ltx/en_us_oca/miscellanea:misc.Mode4
ltx/en_us_oca/me.m08.d04:meMA.Ode3Kathisma1.text	
ltx/en_us_oca/me.m08.d04:meMA.Ode3KathismaSt.incipit	…
ltx/en_us_oca/me.m08.d04:meMA.Ode3KathismaSt.melody	@ltx/en_us_oca/he.a.m4:heAU.OYpsotheisEnToStavro.notmetered
ltx/en_us_oca/me.m08.d04:meMA.Ode3KathismaSt.mode	@ltx/en_us_oca/miscellanea:misc.Mode4
ltx/en_us_oca/me.m08.d04:meMA.Ode3KathismaSt.text	
ltx/en_us_oca/me.m08.d04:meMA.Ode3KathismaT.incipit	…
ltx/en_us_oca/me.m08.d04:meMA.Ode3KathismaT.melody	@ltx/en_us_oca/he.a.m4:heAU.OYpsotheisEnToStavro.notmetered
ltx/en_us_oca/me.m08.d04:meMA.Ode3KathismaT.mode	@ltx/en_us_oca/miscellanea:misc.Mode4
ltx/en_us_oca/me.m08.d04:meMA.Ode3KathismaT.text	
ltx/en_us_oca/me.m08.d04:meMA.Ode4C11.greekmelody	@ltx/en_us_oca/he.h.m2:heHE.EisakikoaKyrieTinAkoin.greekname
ltx/en_us_oca/me.m08.d04:meMA.Ode4C11.incipit	…
ltx/en_us_oca/me.m08.d04:meMA.Ode4C11.melody	@ltx/en_us_oca/he.h.m2:heHE.EisakikoaKyrieTinAkoin.notmetered
ltx/en_us_oca/me.m08.d04:meMA.Ode4C11.mode	@ltx/en_us_oca/miscellanea:misc.Mode2
ltx/en_us_oca/me.m08.d04:meMA.Ode4C11.ode	@ltx/en_us_oca/miscellanea:misc.Ode4
ltx/en_us_oca/me.m08.d04:meMA.Ode4C11.text	
ltx/en_us_oca/me.m08.d04:meMA.Ode4C12.incipit	…
ltx/en_us_oca/me.m08.d04:meMA.Ode4C12.melody	@ltx/en_us_oca/he.h.m2:heHE.EisakikoaKyrieTinAkoin.notmetered
ltx/en_us_oca/me.m08.d04:meMA.Ode4C12.mode	@ltx/en_us_oca/miscellanea:misc.Mode2
ltx/en_us_oca/me.m08.d04:meMA.Ode4C12.ode	@ltx/en_us_oca/miscellanea:misc.Ode4
ltx/en_us_oca/me.m08.d04:meMA.Ode4C12.text	
ltx/en_us_oca/me.m08.d04:meMA.Ode4C13.incipit	…
ltx/en_us_oca/me.m08.d04:meMA.Ode4C13.melody	@ltx/en_us_oca/he.h.m2:heHE.EisakikoaKyrieTinAkoin.notmetered
ltx/en_us_oca/me.m08.d04:meMA.Ode4C13.mode	@ltx/en_us_oca/miscellanea:misc.Mode2
ltx/en_us_oca/me.m08.d04:meMA.Ode4C13.ode	@ltx/en_us_oca/miscellanea:misc.Ode4
ltx/en_us_oca/me.m08.d04:meMA.Ode4C13.text	
ltx/en_us_oca/me.m08.d04:meMA.Ode4C14.incipit	…
ltx/en_us_oca/me.m08.d04:meMA.Ode4C14.melody	@ltx/en_us_oca/he.h.m2:heHE.EisakikoaKyrieTinAkoin.notmetered
ltx/en_us_oca/me.m08.d04:meMA.Ode4C14.mode	@ltx/en_us_oca/miscellanea:misc.Mode2
ltx/en_us_oca/me.m08.d04:meMA.Ode4C14.ode	@ltx/en_us_oca/miscellanea:misc.Ode4
ltx/en_us_oca/me.m08.d04:meMA.Ode4C14.text	
ltx/en_us_oca/me.m08.d04:meMA.Ode4C1T.incipit	…
ltx/en_us_oca/me.m08.d04:meMA.Ode4C1T.melody	@ltx/en_us_oca/he.h.m2:heHE.EisakikoaKyrieTinAkoin.notmetered
ltx/en_us_oca/me.m08.d04:meMA.Ode4C1T.mode	@ltx/en_us_oca/miscellanea:misc.Mode2
ltx/en_us_oca/me.m08.d04:meMA.Ode4C1T.ode	@ltx/en_us_oca/miscellanea:misc.Ode4
ltx/en_us_oca/me.m08.d04:meMA.Ode4C1T.text	
ltx/en_us_oca/me.m08.d04:meMA.Ode5C11.greekmelody	@ltx/en_us_oca/he.h.m2:heHE.OTouFotosChorigos.greekname
ltx/en_us_oca/me.m08.d04:meMA.Ode5C11.incipit	…
ltx/en_us_oca/me.m08.d04:meMA.Ode5C11.melody	@ltx/en_us_oca/he.h.m2:heHE.OTouFotosChorigos.notmetered
ltx/en_us_oca/me.m08.d04:meMA.Ode5C11.mode	@ltx/en_us_oca/miscellanea:misc.Mode2
ltx/en_us_oca/me.m08.d04:meMA.Ode5C11.ode	@ltx/en_us_oca/miscellanea:misc.Ode5
ltx/en_us_oca/me.m08.d04:meMA.Ode5C11.text	
ltx/en_us_oca/me.m08.d04:meMA.Ode5C12.incipit	…
ltx/en_us_oca/me.m08.d04:meMA.Ode5C12.melody	@ltx/en_us_oca/he.h.m2:heHE.OTouFotosChorigos.notmetered
ltx/en_us_oca/me.m08.d04:meMA.Ode5C12.mode	@ltx/en_us_oca/miscellanea:misc.Mode2
ltx/en_us_oca/me.m08.d04:meMA.Ode5C12.ode	@ltx/en_us_oca/miscellanea:misc.Ode5
ltx/en_us_oca/me.m08.d04:meMA.Ode5C12.text	
ltx/en_us_oca/me.m08.d04:meMA.Ode5C13.incipit	…
ltx/en_us_oca/me.m08.d04:meMA.Ode5C13.melody	@ltx/en_us_oca/he.h.m2:heHE.OTouFotosChorigos.notmetered
ltx/en_us_oca/me.m08.d04:meMA.Ode5C13.mode	@ltx/en_us_oca/miscellanea:misc.Mode2
ltx/en_us_oca/me.m08.d04:meMA.Ode5C13.ode	@ltx/en_us_oca/miscellanea:misc.Ode5
ltx/en_us_oca/me.m08.d04:meMA.Ode5C13.text	
ltx/en_us_oca/me.m08.d04:meMA.Ode5C1T.incipit	…
ltx/en_us_oca/me.m08.d04:meMA.Ode5C1T.melody	@ltx/en_us_oca/he.h.m2:heHE.OTouFotosChorigos.notmetered
ltx/en_us_oca/me.m08.d04:meMA.Ode5C1T.mode	@ltx/en_us_oca/miscellanea:misc.Mode2
ltx/en_us_oca/me.m08.d04:meMA.Ode5C1T.ode	@ltx/en_us_oca/miscellanea:misc.Ode5
ltx/en_us_oca/me.m08.d04:meMA.Ode5C1T.text	
ltx/en_us_oca/me.m08.d04:meMA.Ode6C11.greekmelody	@ltx/en_us_oca/he.h.m2:heHE.EnAvyssoPtaismaton.greekname
ltx/en_us_oca/me.m08.d04:meMA.Ode6C11.incipit	…
ltx/en_us_oca/me.m08.d04:meMA.Ode6C11.melody	@ltx/en_us_oca/he.h.m2:heHE.EnAvyssoPtaismaton.notmetered
ltx/en_us_oca/me.m08.d04:meMA.Ode6C11.mode	@ltx/en_us_oca/miscellanea:misc.Mode2
ltx/en_us_oca/me.m08.d04:meMA.Ode6C11.ode	@ltx/en_us_oca/miscellanea:misc.Ode6
ltx/en_us_oca/me.m08.d04:meMA.Ode6C11.text	
ltx/en_us_oca/me.m08.d04:meMA.Ode6C12.incipit	…
ltx/en_us_oca/me.m08.d04:meMA.Ode6C12.melody	@ltx/en_us_oca/he.h.m2:heHE.EnAvyssoPtaismaton.notmetered
ltx/en_us_oca/me.m08.d04:meMA.Ode6C12.mode	@ltx/en_us_oca/miscellanea:misc.Mode2
ltx/en_us_oca/me.m08.d04:meMA.Ode6C12.ode	@ltx/en_us_oca/miscellanea:misc.Ode6
ltx/en_us_oca/me.m08.d04:meMA.Ode6C12.text	
ltx/en_us_oca/me.m08.d04:meMA.Ode6C13.incipit	…
ltx/en_us_oca/me.m08.d04:meMA.Ode6C13.melody	@ltx/en_us_oca/he.h.m2:heHE.EnAvyssoPtaismaton.notmetered
ltx/en_us_oca/me.m08.d04:meMA.Ode6C13.mode	@ltx/en_us_oca/miscellanea:misc.Mode2
ltx/en_us_oca/me.m08.d04:meMA.Ode6C13.ode	@ltx/en_us_oca/miscellanea:misc.Ode6
ltx/en_us_oca/me.m08.d04:meMA.Ode6C13.text	
ltx/en_us_oca/me.m08.d04:meMA.Ode6C1T.incipit	…
ltx/en_us_oca/me.m08.d04:meMA.Ode6C1T.melody	@ltx/en_us_oca/he.h.m2:heHE.EnAvyssoPtaismaton.notmetered
ltx/en_us_oca/me.m08.d04:meMA.Ode6C1T.mode	@ltx/en_us_oca/miscellanea:misc.Mode2
ltx/en_us_oca/me.m08.d04:meMA.Ode6C1T.ode	@ltx/en_us_oca/miscellanea:misc.Ode6
ltx/en_us_oca/me.m08.d04:meMA.Ode6C1T.text	
ltx/en_us_oca/me.m08.d04:meMA.Ode6H.greekmelody	@ltx/en_us_oca/he.h.m2:heHE.EnAvyssoPtaismaton.greekname
ltx/en_us_oca/me.m08.d04:meMA.Ode6H.incipit	@ltx/en_us_oca/he.h.m2:heHE.EnAvyssoPtaismaton.incipit
ltx/en_us_oca/me.m08.d04:meMA.Ode6H.melody	@ltx/en_us_oca/he.h.m2:heHE.EnAvyssoPtaismaton.melody
ltx/en_us_oca/me.m08.d04:meMA.Ode6H.mode	@ltx/en_us_oca/miscellanea:misc.Mode2
ltx/en_us_oca/me.m08.d04:meMA.Ode6H.ode	@ltx/en_us_oca/miscellanea:misc.Ode6
ltx/en_us_oca/me.m08.d04:meMA.Ode6H.text	@ltx/en_us_oca/he.h.m2:heHE.EnAvyssoPtaismaton.text
ltx/en_us_oca/me.m08.d04:meMA.Ode7C11.greekmelody	@ltx/en_us_oca/he.h.m2:heHE.EikonosChrysis.greekname
ltx/en_us_oca/me.m08.d04:meMA.Ode7C11.incipit	…
ltx/en_us_oca/me.m08.d04:meMA.Ode7C11.melody	@ltx/en_us_oca/he.h.m2:heHE.EikonosChrysis.notmetered
ltx/en_us_oca/me.m08.d04:meMA.Ode7C11.mode	@ltx/en_us_oca/miscellanea:misc.Mode2
ltx/en_us_oca/me.m08.d04:meMA.Ode7C11.ode	@ltx/en_us_oca/miscellanea:misc.Ode7
ltx/en_us_oca/me.m08.d04:meMA.Ode7C11.text	
ltx/en_us_oca/me.m08.d04:meMA.Ode7C12.incipit	…
ltx/en_us_oca/me.m08.d04:meMA.Ode7C12.melody	@ltx/en_us_oca/he.h.m2:heHE.EikonosChrysis.notmetered
ltx/en_us_oca/me.m08.d04:meMA.Ode7C12.mode	@ltx/en_us_oca/miscellanea:misc.Mode2
ltx/en_us_oca/me.m08.d04:meMA.Ode7C12.ode	@ltx/en_us_oca/miscellanea:misc.Ode7
ltx/en_us_oca/me.m08.d04:meMA.Ode7C12.text	
ltx/en_us_oca/me.m08.d04:meMA.Ode7C13.incipit	…
ltx/en_us_oca/me.m08.d04:meMA.Ode7C13.melody	@ltx/en_us_oca/he.h.m2:heHE.EikonosChrysis.notmetered
ltx/en_us_oca/me.m08.d04:meMA.Ode7C13.mode	@ltx/en_us_oca/miscellanea:misc.Mode2
ltx/en_us_oca/me.m08.d04:meMA.Ode7C13.ode	@ltx/en_us_oca/miscellanea:misc.Ode7
ltx/en_us_oca/me.m08.d04:meMA.Ode7C13.text	
ltx/en_us_oca/me.m08.d04:meMA.Ode7C1T.incipit	…
ltx/en_us_oca/me.m08.d04:meMA.Ode7C1T.melody	@ltx/en_us_oca/he.h.m2:heHE.EikonosChrysis.notmetered
ltx/en_us_oca/me.m08.d04:meMA.Ode7C1T.mode	@ltx/en_us_oca/miscellanea:misc.Mode2
ltx/en_us_oca/me.m08.d04:meMA.Ode7C1T.ode	@ltx/en_us_oca/miscellanea:misc.Ode7
ltx/en_us_oca/me.m08.d04:meMA.Ode7C1T.text	
ltx/en_us_oca/me.m08.d04:meMA.Ode8C11.greekmelody	@ltx/en_us_oca/he.h.m2:heHE.TonEnKaminoTouPyros.greekname
ltx/en_us_oca/me.m08.d04:meMA.Ode8C11.incipit	…
ltx/en_us_oca/me.m08.d04:meMA.Ode8C11.melody	@ltx/en_us_oca/he.h.m2:heHE.TonEnKaminoTouPyros.notmetered
ltx/en_us_oca/me.m08.d04:meMA.Ode8C11.mode	@ltx/en_us_oca/miscellanea:misc.Mode2
ltx/en_us_oca/me.m08.d04:meMA.Ode8C11.ode	@ltx/en_us_oca/miscellanea:misc.Ode8
ltx/en_us_oca/me.m08.d04:meMA.Ode8C11.text	
ltx/en_us_oca/me.m08.d04:meMA.Ode8C12.incipit	…
ltx/en_us_oca/me.m08.d04:meMA.Ode8C12.melody	@ltx/en_us_oca/he.h.m2:heHE.TonEnKaminoTouPyros.notmetered
ltx/en_us_oca/me.m08.d04:meMA.Ode8C12.mode	@ltx/en_us_oca/miscellanea:misc.Mode2
ltx/en_us_oca/me.m08.d04:meMA.Ode8C12.ode	@ltx/en_us_oca/miscellanea:misc.Ode8
ltx/en_us_oca/me.m08.d04:meMA.Ode8C12.text	
ltx/en_us_oca/me.m08.d04:meMA.Ode8C13.incipit	…
ltx/en_us_oca/me.m08.d04:meMA.Ode8C13.melody	@ltx/en_us_oca/he.h.m2:heHE.TonEnKaminoTouPyros.notmetered
ltx/en_us_oca/me.m08.d04:meMA.Ode8C13.mode	@ltx/en_us_oca/miscellanea:misc.Mode2
ltx/en_us_oca/me.m08.d04:meMA.Ode8C13.ode	@ltx/en_us_oca/miscellanea:misc.Ode8
ltx/en_us_oca/me.m08.d04:meMA.Ode8C13.text	
ltx/en_us_oca/me.m08.d04:meMA.Ode8C14.incipit	…
ltx/en_us_oca/me.m08.d04:meMA.Ode8C14.melody	@ltx/en_us_oca/he.h.m2:heHE.TonEnKaminoTouPyros.notmetered
ltx/en_us_oca/me.m08.d04:meMA.Ode8C14.mode	@ltx/en_us_oca/miscellanea:misc.Mode2
ltx/en_us_oca/me.m08.d04:meMA.Ode8C14.ode	@ltx/en_us_oca/miscellanea:misc.Ode8
ltx/en_us_oca/me.m08.d04:meMA.Ode8C14.text	
ltx/en_us_oca/me.m08.d04:meMA.Ode8C1T.incipit	…
ltx/en_us_oca/me.m08.d04:meMA.Ode8C1T.melody	@ltx/en_us_oca/he.h.m2:heHE.TonEnKaminoTouPyros.notmetered
ltx/en_us_oca/me.m08.d04:meMA.Ode8C1T.mode	@ltx/en_us_oca/miscellanea:misc.Mode2
ltx/en_us_oca/me.m08.d04:meMA.Ode8C1T.ode	@ltx/en_us_oca/miscellanea:misc.Ode8
ltx/en_us_oca/me.m08.d04:meMA.Ode8C1T.text	
ltx/en_us_oca/me.m08.d04:meMA.Ode8H.greekmelody	@ltx/en_us_oca/he.h.m2:heHE.TonEnKaminoTouPyros.greekname
ltx/en_us_oca/me.m08.d04:meMA.Ode8H.incipit	@ltx/en_us_oca/he.h.m2:heHE.TonEnKaminoTouPyros.incipit
ltx/en_us_oca/me.m08.d04:meMA.Ode8H.melody	@ltx/en_us_oca/he.h.m2:heHE.TonEnKaminoTouPyros.melody
ltx/en_us_oca/me.m08.d04:meMA.Ode8H.mode	@ltx/en_us_oca/miscellanea:misc.Mode2
ltx/en_us_oca/me.m08.d04:meMA.Ode8H.ode	@ltx/en_us_oca/miscellanea:misc.Ode8
ltx/en_us_oca/me.m08.d04:meMA.Ode8H.text	@ltx/en_us_oca/he.h.m2:heHE.TonEnKaminoTouPyros.text
ltx/en_us_oca/me.m08.d04:meMA.Ode9C11.greekmelody	@ltx/en_us_oca/he.h.m2:heHE.ITonProIliouFostira.greekname
ltx/en_us_oca/me.m08.d04:meMA.Ode9C11.incipit	…
ltx/en_us_oca/me.m08.d04:meMA.Ode9C11.melody	@ltx/en_us_oca/he.h.m2:heHE.ITonProIliouFostira.notmetered
ltx/en_us_oca/me.m08.d04:meMA.Ode9C11.mode	@ltx/en_us_oca/miscellanea:misc.Mode2
ltx/en_us_oca/me.m08.d04:meMA.Ode9C11.ode	@ltx/en_us_oca/miscellanea:misc.Ode9
ltx/en_us_oca/me.m08.d04:meMA.Ode9C11.text	
ltx/en_us_oca/me.m08.d04:meMA.Ode9C12.incipit	…
ltx/en_us_oca/me.m08.d04:meMA.Ode9C12.melody	@ltx/en_us_oca/he.h.m2:heHE.ITonProIliouFostira.notmetered
ltx/en_us_oca/me.m08.d04:meMA.Ode9C12.mode	@ltx/en_us_oca/miscellanea:misc.Mode2
ltx/en_us_oca/me.m08.d04:meMA.Ode9C12.ode	@ltx/en_us_oca/miscellanea:misc.Ode9
ltx/en_us_oca/me.m08.d04:meMA.Ode9C12.text	
ltx/en_us_oca/me.m08.d04:meMA.Ode9C13.incipit	…
ltx/en_us_oca/me.m08.d04:meMA.Ode9C13.melody	@ltx/en_us_oca/he.h.m2:heHE.ITonProIliouFostira.notmetered
ltx/en_us_oca/me.m08.d04:meMA.Ode9C13.mode	@ltx/en_us_oca/miscellanea:misc.Mode2
ltx/en_us_oca/me.m08.d04:meMA.Ode9C13.ode	@ltx/en_us_oca/miscellanea:misc.Ode9
ltx/en_us_oca/me.m08.d04:meMA.Ode9C13.text	
ltx/en_us_oca/me.m08.d04:meMA.Ode9C14.incipit	…
ltx/en_us_oca/me.m08.d04:meMA.Ode9C14.melody	@ltx/en_us_oca/he.h.m2:heHE.ITonProIliouFostira.notmetered
ltx/en_us_oca/me.m08.d04:meMA.Ode9C14.mode	@ltx/en_us_oca/miscellanea:misc.Mode2
ltx/en_us_oca/me.m08.d04:meMA.Ode9C14.ode	@ltx/en_us_oca/miscellanea:misc.Ode9
ltx/en_us_oca/me.m08.d04:meMA.Ode9C14.text	
ltx/en_us_oca/me.m08.d04:meMA.Ode9C1T.incipit	…
ltx/en_us_oca/me.m08.d04:meMA.Ode9C1T.melody	@ltx/en_us_oca/he.h.m2:heHE.ITonProIliouFostira.notmetered
ltx/en_us_oca/me.m08.d04:meMA.Ode9C1T.mode	@ltx/en_us_oca/miscellanea:misc.Mode2
ltx/en_us_oca/me.m08.d04:meMA.Ode9C1T.ode	@ltx/en_us_oca/miscellanea:misc.Ode9
ltx/en_us_oca/me.m08.d04:meMA.Ode9C1T.text	
ltx/en_us_oca/me.m08.d04:meMA.Ode9H.greekmelody	@ltx/en_us_oca/he.h.m2:heHE.ITonProIliouFostira.greekname
ltx/en_us_oca/me.m08.d04:meMA.Ode9H.incipit	@ltx/en_us_oca/he.h.m2:heHE.ITonProIliouFostira.incipit
ltx/en_us_oca/me.m08.d04:meMA.Ode9H.melody	@ltx/en_us_oca/he.h.m2:heHE.ITonProIliouFostira.melody
ltx/en_us_oca/me.m08.d04:meMA.Ode9H.mode	@ltx/en_us_oca/miscellanea:misc.Mode2
ltx/en_us_oca/me.m08.d04:meMA.Ode9H.ode	@ltx/en_us_oca/miscellanea:misc.Ode9
ltx/en_us_oca/me.m08.d04:meMA.Ode9H.text	@ltx/en_us_oca/he.h.m2:heHE.ITonProIliouFostira.text
ltx/en_us_oca/me.m08.d04:meVE.Apolytikion1ger.greekmelody	@ltx/en_us_oca/he.a.m3:heAU.TheiasPisteos.greekname
ltx/en_us_oca/me.m08.d04:meVE.Apolytikion1ger.incipit	…
ltx/en_us_oca/me.m08.d04:meVE.Apolytikion1ger.melody	@ltx/en_us_oca/he.a.m3:heAU.TheiasPisteos.notmetered
ltx/en_us_oca/me.m08.d04:meVE.Apolytikion1ger.mode	@ltx/en_us_oca/miscellanea:misc.Mode3
ltx/en_us_oca/me.m08.d04:meVE.Apolytikion1ger.poet	@ltx/en_us_oca/poets:po.Gerasimou
ltx/en_us_oca/me.m08.d04:meVE.Apolytikion1ger.text	
ltx/en_us_oca/me.m08.d04:meVE.SticStavrotheotokion.greekmelody	@ltx/en_us_oca/he.a.m4:heAU.OsGennaionEnMartysi.greekname
ltx/en_us_oca/me.m08.d04:meVE.SticStavrotheotokion.incipit	@ltx/en_us_oca/me.m01.d19:meMA.AposStavrotheotokion.incipit
ltx/en_us_oca/me.m08.d04:meVE.SticStavrotheotokion.melody	@ltx/en_us_oca/he.a.m4:heAU.OsGennaionEnMartysi.notmetered
ltx/en_us_oca/me.m08.d04:meVE.SticStavrotheotokion.mode	@ltx/en_us_oca/miscellanea:misc.Mode4
ltx/en_us_oca/me.m08.d04:meVE.SticStavrotheotokion.text	@ltx/en_us_oca/me.m01.d19:meMA.AposStavrotheotokion.text
ltx/en_us_oca/me.m08.d04:meVE.SticTheotokion.greekmelody	@ltx/en_us_oca/he.a.m4:heAU.OsGennaionEnMartysi.greekname
ltx/en_us_oca/me.m08.d04:meVE.SticTheotokion.incipit	@ltx/en_us_oca/me.m02.d15:meVE.SticTheotokion.incipit
ltx/en_us_oca/me.m08.d04:meVE.SticTheotokion.melody	@ltx/en_us_oca/he.a.m4:heAU.OsGennaionEnMartysi.notmetered
ltx/en_us_oca/me.m08.d04:meVE.SticTheotokion.mode	@ltx/en_us_oca/miscellanea:misc.Mode4
ltx/en_us_oca/me.m08.d04:meVE.SticTheotokion.text	@ltx/en_us_oca/me.m02.d15:meVE.SticTheotokion.text
ltx/en_us_oca/me.m08.d04:meVE.Stichera01.greekmelody	@ltx/en_us_oca/he.a.m4:heAU.OsGennaionEnMartysi.greekname
ltx/en_us_oca/me.m08.d04:meVE.Stichera01.incipit	The blessed youths spurned the…
ltx/en_us_oca/me.m08.d04:meVE.Stichera01.melody	@ltx/en_us_oca/he.a.m4:heAU.OsGennaionEnMartysi.notmetered
ltx/en_us_oca/me.m08.d04:meVE.Stichera01.mode	@ltx/en_us_oca/miscellanea:misc.Mode4
ltx/en_us_oca/me.m08.d04:meVE.Stichera01.text	The blessed youths spurned the evil commands: ⁄ submitting to God, they were bound, breaking the bonds of falsehood! ⁄ Rejecting worldly rank they have received the glory of perfection ⁄⁄ which won for them the joy of the heavenly Kingdom!
ltx/en_us_oca/me.m08.d04:meVE.Stichera02.incipit	You trained yourselves mightily for…
ltx/en_us_oca/me.m08.d04:meVE.Stichera02.melody	@ltx/en_us_oca/he.a.m4:heAU.OsGennaionEnMartysi.notmetered
ltx/en_us_oca/me.m08.d04:meVE.Stichera02.mode	@ltx/en_us_oca/miscellanea:misc.Mode4
ltx/en_us_oca/me.m08.d04:meVE.Stichera02.text	You trained yourselves mightily for the struggles of suffering, Saints. ⁄ You hid in a cave, entreating the Lord. ⁄ With unceasing supplications you sought power and might from Him ⁄ through His wisdom and judgments as the Lover of mankind. ⁄⁄ In a godly manner He commanded all of you to fall asleep in peace!
ltx/en_us_oca/me.m08.d04:meVE.Stichera03.incipit	Come, people, let us earnestly…
ltx/en_us_oca/me.m08.d04:meVE.Stichera03.melody	@ltx/en_us_oca/he.a.m4:heAU.OsGennaionEnMartysi.notmetered
ltx/en_us_oca/me.m08.d04:meVE.Stichera03.mode	@ltx/en_us_oca/miscellanea:misc.Mode4
ltx/en_us_oca/me.m08.d04:meVE.Stichera03.text	Come, people, let us earnestly hymn the witnesses of piety, ⁄ The divinely assembled regiment, ⁄ The blessed choir, the invincible company of martyrs, ⁄ The beautiful triumph of the Church of God, ⁄ The indivisible assembly, ⁄⁄ The unvanquished army and unshakable foundation of piety!
