ltx/en_us_oca/me.m12.d16:meDA.commemoration.first	
ltx/en_us_oca/me.m12.d16:meDA.commemoration.first_name	
ltx/en_us_oca/me.m12.d16:meDA.commemoration.first_short	
ltx/en_us_oca/me.m12.d16:meDA.commemoration.first_title	
ltx/en_us_oca/me.m12.d16:meDA.commemoration.full	
ltx/en_us_oca/me.m12.d16:meDA.commemoration.second_name	
ltx/en_us_oca/me.m12.d16:meDA.commemoration.second_title	
ltx/en_us_oca/me.m12.d16:meDA.date	
ltx/en_us_oca/me.m12.d16:meDA.fordate	
ltx/en_us_oca/me.m12.d16:meDA.insert1	
ltx/en_us_oca/me.m12.d16:meDA.insert2	
ltx/en_us_oca/me.m12.d16:meDA.note	
ltx/en_us_oca/me.m12.d16:meDA.pdfcoverdate	
ltx/en_us_oca/me.m12.d16:meDA.pdfheaderdate	
ltx/en_us_oca/me.m12.d16:meHO.commemorations	
ltx/en_us_oca/me.m12.d16:meHO.note1	
ltx/en_us_oca/me.m12.d16:meHO.note2	
ltx/en_us_oca/me.m12.d16:meHO.number	
ltx/en_us_oca/me.m12.d16:meHO.rank	
ltx/en_us_oca/me.m12.d16:meLE.commemoration1	
ltx/en_us_oca/me.m12.d16:meLE.commemoration2	
ltx/en_us_oca/me.m12.d16:meLI.Kontakion1.incipit	…
ltx/en_us_oca/me.m12.d16:meLI.Kontakion1.melody	
ltx/en_us_oca/me.m12.d16:meLI.Kontakion1.mode	
ltx/en_us_oca/me.m12.d16:meLI.Kontakion1.text	
ltx/en_us_oca/me.m12.d16:meLI.Megalynarion.text	
ltx/en_us_oca/me.m12.d16:meMA.C1.acrostic.notice1	
ltx/en_us_oca/me.m12.d16:meMA.C1.acrostic.text	
ltx/en_us_oca/me.m12.d16:meMA.C1.acrostic.title	
ltx/en_us_oca/me.m12.d16:meMA.C1.poet	@ltx/en_us_oca/poets:po.Theofanous
ltx/en_us_oca/me.m12.d16:meMA.C1.title	@ltx/en_us_oca/titles:ti.CanonProphet
ltx/en_us_oca/me.m12.d16:meMA.C1.verse	@ltx/en_us_oca/prayers:pr.verse_Prophet.text
ltx/en_us_oca/me.m12.d16:meMA.Ode1C11.greekmelody	@ltx/en_us_oca/he.h.m7:heHE.ToEktinaxantiTheo.greekname
ltx/en_us_oca/me.m12.d16:meMA.Ode1C11.incipit	…
ltx/en_us_oca/me.m12.d16:meMA.Ode1C11.melody	@ltx/en_us_oca/he.h.m7:heHE.ToEktinaxantiTheo.notmetered
ltx/en_us_oca/me.m12.d16:meMA.Ode1C11.mode	@ltx/en_us_oca/miscellanea:misc.Mode7
ltx/en_us_oca/me.m12.d16:meMA.Ode1C11.ode	@ltx/en_us_oca/miscellanea:misc.Ode1
ltx/en_us_oca/me.m12.d16:meMA.Ode1C11.text	
ltx/en_us_oca/me.m12.d16:meMA.Ode1C12.incipit	…
ltx/en_us_oca/me.m12.d16:meMA.Ode1C12.melody	@ltx/en_us_oca/he.h.m7:heHE.ToEktinaxantiTheo.notmetered
ltx/en_us_oca/me.m12.d16:meMA.Ode1C12.mode	@ltx/en_us_oca/miscellanea:misc.Mode7
ltx/en_us_oca/me.m12.d16:meMA.Ode1C12.ode	@ltx/en_us_oca/miscellanea:misc.Ode1
ltx/en_us_oca/me.m12.d16:meMA.Ode1C12.text	
ltx/en_us_oca/me.m12.d16:meMA.Ode1C13.incipit	…
ltx/en_us_oca/me.m12.d16:meMA.Ode1C13.melody	@ltx/en_us_oca/he.h.m7:heHE.ToEktinaxantiTheo.notmetered
ltx/en_us_oca/me.m12.d16:meMA.Ode1C13.mode	@ltx/en_us_oca/miscellanea:misc.Mode7
ltx/en_us_oca/me.m12.d16:meMA.Ode1C13.ode	@ltx/en_us_oca/miscellanea:misc.Ode1
ltx/en_us_oca/me.m12.d16:meMA.Ode1C13.text	
ltx/en_us_oca/me.m12.d16:meMA.Ode1C1T.incipit	…
ltx/en_us_oca/me.m12.d16:meMA.Ode1C1T.melody	@ltx/en_us_oca/he.h.m7:heHE.ToEktinaxantiTheo.notmetered
ltx/en_us_oca/me.m12.d16:meMA.Ode1C1T.mode	@ltx/en_us_oca/miscellanea:misc.Mode7
ltx/en_us_oca/me.m12.d16:meMA.Ode1C1T.ode	@ltx/en_us_oca/miscellanea:misc.Ode1
ltx/en_us_oca/me.m12.d16:meMA.Ode1C1T.text	
ltx/en_us_oca/me.m12.d16:meMA.Ode3C11.greekmelody	@ltx/en_us_oca/he.h.m7:heHE.EstereothiTiPistei.greekname
ltx/en_us_oca/me.m12.d16:meMA.Ode3C11.incipit	…
ltx/en_us_oca/me.m12.d16:meMA.Ode3C11.melody	@ltx/en_us_oca/he.h.m7:heHE.EstereothiTiPistei.notmetered
ltx/en_us_oca/me.m12.d16:meMA.Ode3C11.mode	@ltx/en_us_oca/miscellanea:misc.Mode7
ltx/en_us_oca/me.m12.d16:meMA.Ode3C11.ode	@ltx/en_us_oca/miscellanea:misc.Ode3
ltx/en_us_oca/me.m12.d16:meMA.Ode3C11.text	
ltx/en_us_oca/me.m12.d16:meMA.Ode3C12.incipit	…
ltx/en_us_oca/me.m12.d16:meMA.Ode3C12.melody	@ltx/en_us_oca/he.h.m7:heHE.EstereothiTiPistei.notmetered
ltx/en_us_oca/me.m12.d16:meMA.Ode3C12.mode	@ltx/en_us_oca/miscellanea:misc.Mode7
ltx/en_us_oca/me.m12.d16:meMA.Ode3C12.ode	@ltx/en_us_oca/miscellanea:misc.Ode3
ltx/en_us_oca/me.m12.d16:meMA.Ode3C12.text	
ltx/en_us_oca/me.m12.d16:meMA.Ode3C13.incipit	…
ltx/en_us_oca/me.m12.d16:meMA.Ode3C13.melody	@ltx/en_us_oca/he.h.m7:heHE.EstereothiTiPistei.notmetered
ltx/en_us_oca/me.m12.d16:meMA.Ode3C13.mode	@ltx/en_us_oca/miscellanea:misc.Mode7
ltx/en_us_oca/me.m12.d16:meMA.Ode3C13.ode	@ltx/en_us_oca/miscellanea:misc.Ode3
ltx/en_us_oca/me.m12.d16:meMA.Ode3C13.text	
ltx/en_us_oca/me.m12.d16:meMA.Ode3C1T.incipit	…
ltx/en_us_oca/me.m12.d16:meMA.Ode3C1T.melody	@ltx/en_us_oca/he.h.m7:heHE.EstereothiTiPistei.notmetered
ltx/en_us_oca/me.m12.d16:meMA.Ode3C1T.mode	@ltx/en_us_oca/miscellanea:misc.Mode7
ltx/en_us_oca/me.m12.d16:meMA.Ode3C1T.ode	@ltx/en_us_oca/miscellanea:misc.Ode3
ltx/en_us_oca/me.m12.d16:meMA.Ode3C1T.text	
ltx/en_us_oca/me.m12.d16:meMA.Ode3H.greekmelody	@ltx/en_us_oca/he.h.m7:heHE.EstereothiTiPistei.greekname
ltx/en_us_oca/me.m12.d16:meMA.Ode3H.incipit	@ltx/en_us_oca/he.h.m7:heHE.EstereothiTiPistei.incipit
ltx/en_us_oca/me.m12.d16:meMA.Ode3H.melody	@ltx/en_us_oca/he.h.m7:heHE.EstereothiTiPistei.melody
ltx/en_us_oca/me.m12.d16:meMA.Ode3H.mode	@ltx/en_us_oca/miscellanea:misc.Mode7
ltx/en_us_oca/me.m12.d16:meMA.Ode3H.ode	@ltx/en_us_oca/miscellanea:misc.Ode3
ltx/en_us_oca/me.m12.d16:meMA.Ode3H.text	@ltx/en_us_oca/he.h.m7:heHE.EstereothiTiPistei.text
ltx/en_us_oca/me.m12.d16:meMA.Ode3Kathisma1.greekmelody	@ltx/en_us_oca/he.a.m1:heAU.TonTafonSouSotir.greekname
ltx/en_us_oca/me.m12.d16:meMA.Ode3Kathisma1.incipit	…
ltx/en_us_oca/me.m12.d16:meMA.Ode3Kathisma1.melody	@ltx/en_us_oca/he.a.m1:heAU.TonTafonSouSotir.notmetered
ltx/en_us_oca/me.m12.d16:meMA.Ode3Kathisma1.mode	@ltx/en_us_oca/miscellanea:misc.Mode1
ltx/en_us_oca/me.m12.d16:meMA.Ode3Kathisma1.text	
ltx/en_us_oca/me.m12.d16:meMA.Ode3Kathisma2.greekmelody	@ltx/en_us_oca/he.a.m3:heAU.TheiasPisteos.greekname
ltx/en_us_oca/me.m12.d16:meMA.Ode3Kathisma2.incipit	…
ltx/en_us_oca/me.m12.d16:meMA.Ode3Kathisma2.melody	@ltx/en_us_oca/he.a.m3:heAU.TheiasPisteos.notmetered
ltx/en_us_oca/me.m12.d16:meMA.Ode3Kathisma2.mode	@ltx/en_us_oca/miscellanea:misc.Mode3
ltx/en_us_oca/me.m12.d16:meMA.Ode3Kathisma2.text	
ltx/en_us_oca/me.m12.d16:meMA.Ode3KathismaSt.melody	@ltx/en_us_oca/he.a.m3:heAU.TheiasPisteos.notmetered
ltx/en_us_oca/me.m12.d16:meMA.Ode3KathismaSt.mode	@ltx/en_us_oca/miscellanea:misc.Mode3
ltx/en_us_oca/me.m12.d16:meMA.Ode3KathismaSt.text	
ltx/en_us_oca/me.m12.d16:meMA.Ode3KathismaT.incipit	@ltx/en_us_oca/oc.m3.d2:ocMA.Kathisma23.incipit
ltx/en_us_oca/me.m12.d16:meMA.Ode3KathismaT.melody	@ltx/en_us_oca/he.a.m3:heAU.TheiasPisteos.notmetered
ltx/en_us_oca/me.m12.d16:meMA.Ode3KathismaT.mode	@ltx/en_us_oca/miscellanea:misc.Mode3
ltx/en_us_oca/me.m12.d16:meMA.Ode3KathismaT.text	@ltx/en_us_oca/oc.m3.d2:ocMA.Kathisma23.text
ltx/en_us_oca/me.m12.d16:meMA.Ode4C11.greekmelody	@ltx/en_us_oca/he.h.m7:heHE.AkikoaTinAkoinSou.greekname
ltx/en_us_oca/me.m12.d16:meMA.Ode4C11.incipit	…
ltx/en_us_oca/me.m12.d16:meMA.Ode4C11.melody	@ltx/en_us_oca/he.h.m7:heHE.AkikoaTinAkoinSou.notmetered
ltx/en_us_oca/me.m12.d16:meMA.Ode4C11.mode	@ltx/en_us_oca/miscellanea:misc.Mode7
ltx/en_us_oca/me.m12.d16:meMA.Ode4C11.ode	@ltx/en_us_oca/miscellanea:misc.Ode4
ltx/en_us_oca/me.m12.d16:meMA.Ode4C11.text	
ltx/en_us_oca/me.m12.d16:meMA.Ode4C12.incipit	…
ltx/en_us_oca/me.m12.d16:meMA.Ode4C12.melody	@ltx/en_us_oca/he.h.m7:heHE.AkikoaTinAkoinSou.notmetered
ltx/en_us_oca/me.m12.d16:meMA.Ode4C12.mode	@ltx/en_us_oca/miscellanea:misc.Mode7
ltx/en_us_oca/me.m12.d16:meMA.Ode4C12.ode	@ltx/en_us_oca/miscellanea:misc.Ode4
ltx/en_us_oca/me.m12.d16:meMA.Ode4C12.text	
ltx/en_us_oca/me.m12.d16:meMA.Ode4C13.incipit	…
ltx/en_us_oca/me.m12.d16:meMA.Ode4C13.melody	@ltx/en_us_oca/he.h.m7:heHE.AkikoaTinAkoinSou.notmetered
ltx/en_us_oca/me.m12.d16:meMA.Ode4C13.mode	@ltx/en_us_oca/miscellanea:misc.Mode7
ltx/en_us_oca/me.m12.d16:meMA.Ode4C13.ode	@ltx/en_us_oca/miscellanea:misc.Ode4
ltx/en_us_oca/me.m12.d16:meMA.Ode4C13.text	
ltx/en_us_oca/me.m12.d16:meMA.Ode4C1T.incipit	…
ltx/en_us_oca/me.m12.d16:meMA.Ode4C1T.melody	@ltx/en_us_oca/he.h.m7:heHE.AkikoaTinAkoinSou.notmetered
ltx/en_us_oca/me.m12.d16:meMA.Ode4C1T.mode	@ltx/en_us_oca/miscellanea:misc.Mode7
ltx/en_us_oca/me.m12.d16:meMA.Ode4C1T.ode	@ltx/en_us_oca/miscellanea:misc.Ode4
ltx/en_us_oca/me.m12.d16:meMA.Ode4C1T.text	
ltx/en_us_oca/me.m12.d16:meMA.Ode5C11.greekmelody	@ltx/en_us_oca/he.h.m7:heHE.ProsSeOrthrizo.greekname
ltx/en_us_oca/me.m12.d16:meMA.Ode5C11.incipit	…
ltx/en_us_oca/me.m12.d16:meMA.Ode5C11.melody	@ltx/en_us_oca/he.h.m7:heHE.ProsSeOrthrizo.notmetered
ltx/en_us_oca/me.m12.d16:meMA.Ode5C11.mode	@ltx/en_us_oca/miscellanea:misc.Mode7
ltx/en_us_oca/me.m12.d16:meMA.Ode5C11.ode	@ltx/en_us_oca/miscellanea:misc.Ode5
ltx/en_us_oca/me.m12.d16:meMA.Ode5C11.text	
ltx/en_us_oca/me.m12.d16:meMA.Ode5C12.incipit	…
ltx/en_us_oca/me.m12.d16:meMA.Ode5C12.melody	@ltx/en_us_oca/he.h.m7:heHE.ProsSeOrthrizo.notmetered
ltx/en_us_oca/me.m12.d16:meMA.Ode5C12.mode	@ltx/en_us_oca/miscellanea:misc.Mode7
ltx/en_us_oca/me.m12.d16:meMA.Ode5C12.ode	@ltx/en_us_oca/miscellanea:misc.Ode5
ltx/en_us_oca/me.m12.d16:meMA.Ode5C12.text	
ltx/en_us_oca/me.m12.d16:meMA.Ode5C13.incipit	…
ltx/en_us_oca/me.m12.d16:meMA.Ode5C13.melody	@ltx/en_us_oca/he.h.m7:heHE.ProsSeOrthrizo.notmetered
ltx/en_us_oca/me.m12.d16:meMA.Ode5C13.mode	@ltx/en_us_oca/miscellanea:misc.Mode7
ltx/en_us_oca/me.m12.d16:meMA.Ode5C13.ode	@ltx/en_us_oca/miscellanea:misc.Ode5
ltx/en_us_oca/me.m12.d16:meMA.Ode5C13.text	
ltx/en_us_oca/me.m12.d16:meMA.Ode5C1T.incipit	…
ltx/en_us_oca/me.m12.d16:meMA.Ode5C1T.melody	@ltx/en_us_oca/he.h.m7:heHE.ProsSeOrthrizo.notmetered
ltx/en_us_oca/me.m12.d16:meMA.Ode5C1T.mode	@ltx/en_us_oca/miscellanea:misc.Mode7
ltx/en_us_oca/me.m12.d16:meMA.Ode5C1T.ode	@ltx/en_us_oca/miscellanea:misc.Ode5
ltx/en_us_oca/me.m12.d16:meMA.Ode5C1T.text	
ltx/en_us_oca/me.m12.d16:meMA.Ode6C11.greekmelody	@ltx/en_us_oca/he.h.m7:heHE.OIonasEkKoilias.greekname
ltx/en_us_oca/me.m12.d16:meMA.Ode6C11.incipit	…
ltx/en_us_oca/me.m12.d16:meMA.Ode6C11.melody	@ltx/en_us_oca/he.h.m7:heHE.OIonasEkKoilias.notmetered
ltx/en_us_oca/me.m12.d16:meMA.Ode6C11.mode	@ltx/en_us_oca/miscellanea:misc.Mode7
ltx/en_us_oca/me.m12.d16:meMA.Ode6C11.ode	@ltx/en_us_oca/miscellanea:misc.Ode6
ltx/en_us_oca/me.m12.d16:meMA.Ode6C11.text	
ltx/en_us_oca/me.m12.d16:meMA.Ode6C12.incipit	…
ltx/en_us_oca/me.m12.d16:meMA.Ode6C12.melody	@ltx/en_us_oca/he.h.m7:heHE.OIonasEkKoilias.notmetered
ltx/en_us_oca/me.m12.d16:meMA.Ode6C12.mode	@ltx/en_us_oca/miscellanea:misc.Mode7
ltx/en_us_oca/me.m12.d16:meMA.Ode6C12.ode	@ltx/en_us_oca/miscellanea:misc.Ode6
ltx/en_us_oca/me.m12.d16:meMA.Ode6C12.text	
ltx/en_us_oca/me.m12.d16:meMA.Ode6C13.incipit	…
ltx/en_us_oca/me.m12.d16:meMA.Ode6C13.melody	@ltx/en_us_oca/he.h.m7:heHE.OIonasEkKoilias.notmetered
ltx/en_us_oca/me.m12.d16:meMA.Ode6C13.mode	@ltx/en_us_oca/miscellanea:misc.Mode7
ltx/en_us_oca/me.m12.d16:meMA.Ode6C13.ode	@ltx/en_us_oca/miscellanea:misc.Ode6
ltx/en_us_oca/me.m12.d16:meMA.Ode6C13.text	
ltx/en_us_oca/me.m12.d16:meMA.Ode6C1T.incipit	…
ltx/en_us_oca/me.m12.d16:meMA.Ode6C1T.melody	@ltx/en_us_oca/he.h.m7:heHE.OIonasEkKoilias.notmetered
ltx/en_us_oca/me.m12.d16:meMA.Ode6C1T.mode	@ltx/en_us_oca/miscellanea:misc.Mode7
ltx/en_us_oca/me.m12.d16:meMA.Ode6C1T.ode	@ltx/en_us_oca/miscellanea:misc.Ode6
ltx/en_us_oca/me.m12.d16:meMA.Ode6C1T.text	
ltx/en_us_oca/me.m12.d16:meMA.Ode6H.greekmelody	@ltx/en_us_oca/he.h.m7:heHE.OIonasEkKoilias.greekname
ltx/en_us_oca/me.m12.d16:meMA.Ode6H.incipit	@ltx/en_us_oca/he.h.m7:heHE.OIonasEkKoilias.incipit
ltx/en_us_oca/me.m12.d16:meMA.Ode6H.melody	@ltx/en_us_oca/he.h.m7:heHE.OIonasEkKoilias.melody
ltx/en_us_oca/me.m12.d16:meMA.Ode6H.mode	@ltx/en_us_oca/miscellanea:misc.Mode7
ltx/en_us_oca/me.m12.d16:meMA.Ode6H.ode	@ltx/en_us_oca/miscellanea:misc.Ode6
ltx/en_us_oca/me.m12.d16:meMA.Ode6H.text	@ltx/en_us_oca/he.h.m7:heHE.OIonasEkKoilias.text
ltx/en_us_oca/me.m12.d16:meMA.Ode7C11.greekmelody	@ltx/en_us_oca/he.h.m7:heHE.OiEnKaminoTouPyros.greekname
ltx/en_us_oca/me.m12.d16:meMA.Ode7C11.incipit	…
ltx/en_us_oca/me.m12.d16:meMA.Ode7C11.melody	@ltx/en_us_oca/he.h.m7:heHE.OiEnKaminoTouPyros.notmetered
ltx/en_us_oca/me.m12.d16:meMA.Ode7C11.mode	@ltx/en_us_oca/miscellanea:misc.Mode7
ltx/en_us_oca/me.m12.d16:meMA.Ode7C11.ode	@ltx/en_us_oca/miscellanea:misc.Ode7
ltx/en_us_oca/me.m12.d16:meMA.Ode7C11.text	
ltx/en_us_oca/me.m12.d16:meMA.Ode7C12.incipit	…
ltx/en_us_oca/me.m12.d16:meMA.Ode7C12.melody	@ltx/en_us_oca/he.h.m7:heHE.OiEnKaminoTouPyros.notmetered
ltx/en_us_oca/me.m12.d16:meMA.Ode7C12.mode	@ltx/en_us_oca/miscellanea:misc.Mode7
ltx/en_us_oca/me.m12.d16:meMA.Ode7C12.ode	@ltx/en_us_oca/miscellanea:misc.Ode7
ltx/en_us_oca/me.m12.d16:meMA.Ode7C12.text	
ltx/en_us_oca/me.m12.d16:meMA.Ode7C1T.incipit	…
ltx/en_us_oca/me.m12.d16:meMA.Ode7C1T.melody	@ltx/en_us_oca/he.h.m7:heHE.OiEnKaminoTouPyros.notmetered
ltx/en_us_oca/me.m12.d16:meMA.Ode7C1T.mode	@ltx/en_us_oca/miscellanea:misc.Mode7
ltx/en_us_oca/me.m12.d16:meMA.Ode7C1T.ode	@ltx/en_us_oca/miscellanea:misc.Ode7
ltx/en_us_oca/me.m12.d16:meMA.Ode7C1T.text	
ltx/en_us_oca/me.m12.d16:meMA.Ode8C11.greekmelody	@ltx/en_us_oca/he.h.m7:heHE.TonMononAnarchon.greekname
ltx/en_us_oca/me.m12.d16:meMA.Ode8C11.incipit	…
ltx/en_us_oca/me.m12.d16:meMA.Ode8C11.melody	@ltx/en_us_oca/he.h.m7:heHE.TonMononAnarchon.notmetered
ltx/en_us_oca/me.m12.d16:meMA.Ode8C11.mode	@ltx/en_us_oca/miscellanea:misc.Mode7
ltx/en_us_oca/me.m12.d16:meMA.Ode8C11.ode	@ltx/en_us_oca/miscellanea:misc.Ode8
ltx/en_us_oca/me.m12.d16:meMA.Ode8C11.text	
ltx/en_us_oca/me.m12.d16:meMA.Ode8C12.incipit	…
ltx/en_us_oca/me.m12.d16:meMA.Ode8C12.melody	@ltx/en_us_oca/he.h.m7:heHE.TonMononAnarchon.notmetered
ltx/en_us_oca/me.m12.d16:meMA.Ode8C12.mode	@ltx/en_us_oca/miscellanea:misc.Mode7
ltx/en_us_oca/me.m12.d16:meMA.Ode8C12.ode	@ltx/en_us_oca/miscellanea:misc.Ode8
ltx/en_us_oca/me.m12.d16:meMA.Ode8C12.text	
ltx/en_us_oca/me.m12.d16:meMA.Ode8C1T.incipit	…
ltx/en_us_oca/me.m12.d16:meMA.Ode8C1T.melody	@ltx/en_us_oca/he.h.m7:heHE.TonMononAnarchon.notmetered
ltx/en_us_oca/me.m12.d16:meMA.Ode8C1T.mode	@ltx/en_us_oca/miscellanea:misc.Mode7
ltx/en_us_oca/me.m12.d16:meMA.Ode8C1T.ode	@ltx/en_us_oca/miscellanea:misc.Ode8
ltx/en_us_oca/me.m12.d16:meMA.Ode8C1T.text	
ltx/en_us_oca/me.m12.d16:meMA.Ode8H.greekmelody	@ltx/en_us_oca/he.h.m7:heHE.TonMononAnarchon.greekname
ltx/en_us_oca/me.m12.d16:meMA.Ode8H.incipit	@ltx/en_us_oca/he.h.m7:heHE.TonMononAnarchon.incipit
ltx/en_us_oca/me.m12.d16:meMA.Ode8H.melody	@ltx/en_us_oca/he.h.m7:heHE.TonMononAnarchon.melody
ltx/en_us_oca/me.m12.d16:meMA.Ode8H.mode	@ltx/en_us_oca/miscellanea:misc.Mode7
ltx/en_us_oca/me.m12.d16:meMA.Ode8H.ode	@ltx/en_us_oca/miscellanea:misc.Ode8
ltx/en_us_oca/me.m12.d16:meMA.Ode8H.text	@ltx/en_us_oca/he.h.m7:heHE.TonMononAnarchon.text
ltx/en_us_oca/me.m12.d16:meMA.Ode9C11.greekmelody	@ltx/en_us_oca/he.h.m7:heHE.PanymniteTonOuranonYpsilotera.greekname
ltx/en_us_oca/me.m12.d16:meMA.Ode9C11.incipit	…
ltx/en_us_oca/me.m12.d16:meMA.Ode9C11.melody	@ltx/en_us_oca/he.h.m7:heHE.PanymniteTonOuranonYpsilotera.notmetered
ltx/en_us_oca/me.m12.d16:meMA.Ode9C11.mode	@ltx/en_us_oca/miscellanea:misc.Mode7
ltx/en_us_oca/me.m12.d16:meMA.Ode9C11.ode	@ltx/en_us_oca/miscellanea:misc.Ode9
ltx/en_us_oca/me.m12.d16:meMA.Ode9C11.text	
ltx/en_us_oca/me.m12.d16:meMA.Ode9C12.incipit	…
ltx/en_us_oca/me.m12.d16:meMA.Ode9C12.melody	@ltx/en_us_oca/he.h.m7:heHE.PanymniteTonOuranonYpsilotera.notmetered
ltx/en_us_oca/me.m12.d16:meMA.Ode9C12.mode	@ltx/en_us_oca/miscellanea:misc.Mode7
ltx/en_us_oca/me.m12.d16:meMA.Ode9C12.ode	@ltx/en_us_oca/miscellanea:misc.Ode9
ltx/en_us_oca/me.m12.d16:meMA.Ode9C12.text	
ltx/en_us_oca/me.m12.d16:meMA.Ode9C13.incipit	…
ltx/en_us_oca/me.m12.d16:meMA.Ode9C13.melody	@ltx/en_us_oca/he.h.m7:heHE.PanymniteTonOuranonYpsilotera.notmetered
ltx/en_us_oca/me.m12.d16:meMA.Ode9C13.mode	@ltx/en_us_oca/miscellanea:misc.Mode7
ltx/en_us_oca/me.m12.d16:meMA.Ode9C13.ode	@ltx/en_us_oca/miscellanea:misc.Ode9
ltx/en_us_oca/me.m12.d16:meMA.Ode9C13.text	
ltx/en_us_oca/me.m12.d16:meMA.Ode9C1T.incipit	…
ltx/en_us_oca/me.m12.d16:meMA.Ode9C1T.melody	@ltx/en_us_oca/he.h.m7:heHE.PanymniteTonOuranonYpsilotera.notmetered
ltx/en_us_oca/me.m12.d16:meMA.Ode9C1T.mode	@ltx/en_us_oca/miscellanea:misc.Mode7
ltx/en_us_oca/me.m12.d16:meMA.Ode9C1T.ode	@ltx/en_us_oca/miscellanea:misc.Ode9
ltx/en_us_oca/me.m12.d16:meMA.Ode9C1T.text	
ltx/en_us_oca/me.m12.d16:meMA.Ode9H.greekmelody	@ltx/en_us_oca/he.h.m7:heHE.PanymniteTonOuranonYpsilotera.greekname
ltx/en_us_oca/me.m12.d16:meMA.Ode9H.incipit	@ltx/en_us_oca/he.h.m7:heHE.PanymniteTonOuranonYpsilotera.incipit
ltx/en_us_oca/me.m12.d16:meMA.Ode9H.melody	@ltx/en_us_oca/he.h.m7:heHE.PanymniteTonOuranonYpsilotera.melody
ltx/en_us_oca/me.m12.d16:meMA.Ode9H.mode	@ltx/en_us_oca/miscellanea:misc.Mode7
ltx/en_us_oca/me.m12.d16:meMA.Ode9H.ode	@ltx/en_us_oca/miscellanea:misc.Ode9
ltx/en_us_oca/me.m12.d16:meMA.Ode9H.text	@ltx/en_us_oca/he.h.m7:heHE.PanymniteTonOuranonYpsilotera.text
ltx/en_us_oca/me.m12.d16:meVE.Apolytikion1ger.greekmelody	@ltx/en_us_oca/he.a.m4:heAU.TachyProkatalave.greekname
ltx/en_us_oca/me.m12.d16:meVE.Apolytikion1ger.incipit	…
ltx/en_us_oca/me.m12.d16:meVE.Apolytikion1ger.melody	@ltx/en_us_oca/he.a.m4:heAU.TachyProkatalave.notmetered
ltx/en_us_oca/me.m12.d16:meVE.Apolytikion1ger.mode	@ltx/en_us_oca/miscellanea:misc.Mode4
ltx/en_us_oca/me.m12.d16:meVE.Apolytikion1ger.poet	@ltx/en_us_oca/poets:po.Gerasimou
ltx/en_us_oca/me.m12.d16:meVE.Apolytikion1ger.text	
ltx/en_us_oca/me.m12.d16:meVE.Apolytikion2ger.greekmelody	@ltx/en_us_oca/he.a.m3:heAU.TheiasPisteos.greekname
ltx/en_us_oca/me.m12.d16:meVE.Apolytikion2ger.incipit	…
ltx/en_us_oca/me.m12.d16:meVE.Apolytikion2ger.melody	@ltx/en_us_oca/he.a.m3:heAU.TheiasPisteos.notmetered
ltx/en_us_oca/me.m12.d16:meVE.Apolytikion2ger.mode	@ltx/en_us_oca/miscellanea:misc.Mode3
ltx/en_us_oca/me.m12.d16:meVE.Apolytikion2ger.poet	@ltx/en_us_oca/poets:po.Gerasimou
ltx/en_us_oca/me.m12.d16:meVE.Apolytikion2ger.text	
ltx/en_us_oca/me.m12.d16:meVE.SticStavrotheotokion.greekmelody	@ltx/en_us_oca/he.a.m8:heAU.OiMartyresSouKyrie.greekname
ltx/en_us_oca/me.m12.d16:meVE.SticStavrotheotokion.incipit	@ltx/en_us_oca/me.m01.d23:meVE.SticStavrotheotokion.incipit
ltx/en_us_oca/me.m12.d16:meVE.SticStavrotheotokion.melody	@ltx/en_us_oca/he.a.m8:heAU.OiMartyresSouKyrie.notmetered
ltx/en_us_oca/me.m12.d16:meVE.SticStavrotheotokion.mode	@ltx/en_us_oca/miscellanea:misc.Mode8
ltx/en_us_oca/me.m12.d16:meVE.SticStavrotheotokion.text	@ltx/en_us_oca/me.m01.d23:meVE.SticStavrotheotokion.text
ltx/en_us_oca/me.m12.d16:meVE.SticTheotokion.greekmelody	@ltx/en_us_oca/he.a.m8:heAU.OiMartyresSouKyrie.greekname
ltx/en_us_oca/me.m12.d16:meVE.SticTheotokion.incipit	@ltx/en_us_oca/me.m02.d19:meVE.SticTheotokion.incipit
ltx/en_us_oca/me.m12.d16:meVE.SticTheotokion.melody	@ltx/en_us_oca/he.a.m8:heAU.OiMartyresSouKyrie.notmetered
ltx/en_us_oca/me.m12.d16:meVE.SticTheotokion.mode	@ltx/en_us_oca/miscellanea:misc.Mode8
ltx/en_us_oca/me.m12.d16:meVE.SticTheotokion.text	@ltx/en_us_oca/me.m02.d19:meVE.SticTheotokion.text
ltx/en_us_oca/me.m12.d16:meVE.Stichera01.greekmelody	@ltx/en_us_oca/he.a.m8:heAU.OiMartyresSouKyrie.greekname
ltx/en_us_oca/me.m12.d16:meVE.Stichera01.incipit	You became a tabernacle of…
ltx/en_us_oca/me.m12.d16:meVE.Stichera01.melody	@ltx/en_us_oca/he.a.m8:heAU.OiMartyresSouKyrie.notmetered
ltx/en_us_oca/me.m12.d16:meVE.Stichera01.mode	@ltx/en_us_oca/miscellanea:misc.Mode8
ltx/en_us_oca/me.m12.d16:meVE.Stichera01.text	You became a tabernacle of God, glorious one; ⁄ a living temple! ⁄ By the splendor of your life and deeds, most honored one, ⁄ you raised up to Him Who reigns over all the world ⁄ the Temple that had fallen of old. ⁄⁄ By your prayers, entreat Him to grant us great mercy!
ltx/en_us_oca/me.m12.d16:meVE.Stichera02.incipit	You were a vessel of…
ltx/en_us_oca/me.m12.d16:meVE.Stichera02.melody	@ltx/en_us_oca/he.a.m8:heAU.OiMartyresSouKyrie.notmetered
ltx/en_us_oca/me.m12.d16:meVE.Stichera02.mode	@ltx/en_us_oca/miscellanea:misc.Mode8
ltx/en_us_oca/me.m12.d16:meVE.Stichera02.text	You were a vessel of the Spirit, ⁄ receiving the outpouring of light granted you from heaven. ⁄ Therefore you prophesied the redemption of all people by the Savior! ⁄⁄ By your prayers, entreat Him to grant us great mercy!
ltx/en_us_oca/me.m12.d16:meVE.Stichera03.incipit	You are surrounded with the…
ltx/en_us_oca/me.m12.d16:meVE.Stichera03.melody	@ltx/en_us_oca/he.a.m8:heAU.OiMartyresSouKyrie.notmetered
ltx/en_us_oca/me.m12.d16:meVE.Stichera03.mode	@ltx/en_us_oca/miscellanea:misc.Mode8
ltx/en_us_oca/me.m12.d16:meVE.Stichera03.text	You are surrounded with the radiance of divine grace ⁄ and granted contemplation. ⁄ You are revealed to be filled with never-fading enlightenment. ⁄ Therefore, blessed one, protect those who sing your praises, ⁄⁄ entreating the one Lord to grant us great mercy!
