ltx/en_us_oca/tr.d001:trCO.header	
ltx/en_us_oca/tr.d001:trDA.commemoration.full	
ltx/en_us_oca/tr.d001:trDA.commemoration.short	
ltx/en_us_oca/tr.d001:trDA.dismissal	@ltx/en_us_oca/dismissals:dis00.resurrection
ltx/en_us_oca/tr.d001:trDA.insert1	
ltx/en_us_oca/tr.d001:trDA.insert2	
ltx/en_us_oca/tr.d001:trDA.note	
ltx/en_us_oca/tr.d001:trDA.title	
ltx/en_us_oca/tr.d001:trHO.commemorations	
ltx/en_us_oca/tr.d001:trHO.daytitle	
ltx/en_us_oca/tr.d001:trHO.description1	
ltx/en_us_oca/tr.d001:trHO.description2	
ltx/en_us_oca/tr.d001:trHO.note1	
ltx/en_us_oca/tr.d001:trHO.note2	
ltx/en_us_oca/tr.d001:trLI.Kontakion1.incipit	@ltx/en_us_oca/tr.d001:trMA.Kontakion0.incipit
ltx/en_us_oca/tr.d001:trLI.Kontakion1.melody	@ltx/en_us_oca/tr.d001:trMA.Kontakion0.melody
ltx/en_us_oca/tr.d001:trLI.Kontakion1.mode	@ltx/en_us_oca/tr.d001:trMA.Kontakion0.mode
ltx/en_us_oca/tr.d001:trLI.Kontakion1.text	@ltx/en_us_oca/tr.d001:trMA.Kontakion0.text
ltx/en_us_oca/tr.d001:trLI.MM.CommunionHymn.text	@ltx/en_us_oca/properties:media.key
ltx/en_us_oca/tr.d001:trLI.Megalynarion.text	
ltx/en_us_oca/tr.d001:trMA.C1.acrostic.notice1	
ltx/en_us_oca/tr.d001:trMA.C1.acrostic.text	
ltx/en_us_oca/tr.d001:trMA.C1.acrostic.title	Canon of the Triodion.
ltx/en_us_oca/tr.d001:trMA.C1.poet	@ltx/en_us_oca/poets:po.Georgiou
ltx/en_us_oca/tr.d001:trMA.C1.title	@ltx/en_us_oca/titles:ti.CanonTriodion
ltx/en_us_oca/tr.d001:trMA.C1.verse	@ltx/en_us_oca/prayers:pr.verse_God.text
ltx/en_us_oca/tr.d001:trMA.ExapTheotokion.greekmelody	@ltx/en_us_oca/he.a.m2:heAU.ToisMathitaisSynelthomen.greekname
ltx/en_us_oca/tr.d001:trMA.ExapTheotokion.incipit	…
ltx/en_us_oca/tr.d001:trMA.ExapTheotokion.melody	@ltx/en_us_oca/he.a.m2:heAU.ToisMathitaisSynelthomen.notmetered
ltx/en_us_oca/tr.d001:trMA.ExapTheotokion.mode	@ltx/en_us_oca/miscellanea:misc.Mode2
ltx/en_us_oca/tr.d001:trMA.ExapTheotokion.text	
ltx/en_us_oca/tr.d001:trMA.Exaposteilarion1.greekmelody	@ltx/en_us_oca/he.a.m2:heAU.ToisMathitaisSynelthomen.greekname
ltx/en_us_oca/tr.d001:trMA.Exaposteilarion1.incipit	…
ltx/en_us_oca/tr.d001:trMA.Exaposteilarion1.melody	@ltx/en_us_oca/he.a.m2:heAU.ToisMathitaisSynelthomen.notmetered
ltx/en_us_oca/tr.d001:trMA.Exaposteilarion1.mode	@ltx/en_us_oca/miscellanea:misc.Mode2
ltx/en_us_oca/tr.d001:trMA.Exaposteilarion1.text	
ltx/en_us_oca/tr.d001:trMA.Kontakion0.incipit	Let us flee from the…
ltx/en_us_oca/tr.d001:trMA.Kontakion0.melody	@ltx/en_us_oca/he.a.m4:heAU.EpefanisSimeron.notmetered
ltx/en_us_oca/tr.d001:trMA.Kontakion0.mode	@ltx/en_us_oca/miscellanea:misc.Mode4
ltx/en_us_oca/tr.d001:trMA.Kontakion0.text	Let us flee from the pride of the Pharisee! ⁄ And learn humility from the publican’s tears! ⁄ Let us cry to our Savior, ⁄ Have mercy on us, ⁄⁄ only merciful One!
ltx/en_us_oca/tr.d001:trMA.Kontakion1.incipit	As the Publican, let us…
ltx/en_us_oca/tr.d001:trMA.Kontakion1.melody	@ltx/en_us_oca/he.a.m3:heAU.IParthenosSimeron.notmetered
ltx/en_us_oca/tr.d001:trMA.Kontakion1.mode	@ltx/en_us_oca/miscellanea:misc.Mode3
ltx/en_us_oca/tr.d001:trMA.Kontakion1.text	As the Publican, let us bring tears of repentance to the Lord, ⁄ falling before him as sinners before the feet of our Master. ⁄ For he desires the salvation of all men, ⁄ granting forgiveness to all who repent and taking flesh for our sake ⁄⁄ though he is God, co-eternal with the Father!
ltx/en_us_oca/tr.d001:trMA.Lauds1.incipit	@ltx/en_us_oca/tr.d001:trVE.Stichera01.incipit
ltx/en_us_oca/tr.d001:trMA.Lauds1.melody	@ltx/en_us_oca/miscellanea:misc.Idiomelon
ltx/en_us_oca/tr.d001:trMA.Lauds1.mode	@ltx/en_us_oca/miscellanea:misc.Mode1
ltx/en_us_oca/tr.d001:trMA.Lauds1.text	@ltx/en_us_oca/tr.d001:trVE.Stichera01.text
ltx/en_us_oca/tr.d001:trMA.Lauds2.incipit	@ltx/en_us_oca/tr.d001:trVE.Stichera02.incipit
ltx/en_us_oca/tr.d001:trMA.Lauds2.melody	@ltx/en_us_oca/miscellanea:misc.Idiomelon
ltx/en_us_oca/tr.d001:trMA.Lauds2.mode	@ltx/en_us_oca/miscellanea:misc.Mode1
ltx/en_us_oca/tr.d001:trMA.Lauds2.text	@ltx/en_us_oca/tr.d001:trVE.Stichera02.text
ltx/en_us_oca/tr.d001:trMA.Lauds3.incipit	…
ltx/en_us_oca/tr.d001:trMA.Lauds3.melody	@ltx/en_us_oca/miscellanea:misc.Idiomelon
ltx/en_us_oca/tr.d001:trMA.Lauds3.mode	@ltx/en_us_oca/miscellanea:misc.Mode3
ltx/en_us_oca/tr.d001:trMA.Lauds3.text	
ltx/en_us_oca/tr.d001:trMA.Lauds4.incipit	…
ltx/en_us_oca/tr.d001:trMA.Lauds4.melody	@ltx/en_us_oca/miscellanea:misc.Idiomelon
ltx/en_us_oca/tr.d001:trMA.Lauds4.mode	@ltx/en_us_oca/miscellanea:misc.Mode3
ltx/en_us_oca/tr.d001:trMA.Lauds4.text	
ltx/en_us_oca/tr.d001:trMA.LaudsGlory.incipit	…
ltx/en_us_oca/tr.d001:trMA.LaudsGlory.melody	@ltx/en_us_oca/miscellanea:misc.Idiomelon
ltx/en_us_oca/tr.d001:trMA.LaudsGlory.mode	@ltx/en_us_oca/miscellanea:misc.Mode8
ltx/en_us_oca/tr.d001:trMA.LaudsGlory.text	
ltx/en_us_oca/tr.d001:trMA.LaudsTheotokion.incipit	@ltx/en_us_oca/oc.m2.d1:ocMA.Kathisma23.incipit
ltx/en_us_oca/tr.d001:trMA.LaudsTheotokion.melody	
ltx/en_us_oca/tr.d001:trMA.LaudsTheotokion.mode	
ltx/en_us_oca/tr.d001:trMA.LaudsTheotokion.text	@ltx/en_us_oca/oc.m2.d1:ocMA.Kathisma23.text
ltx/en_us_oca/tr.d001:trMA.MM.Lauds12as45.text	@ltx/en_us_oca/properties:media.key
ltx/en_us_oca/tr.d001:trMA.Ode1C11.greekmelody	@ltx/en_us_oca/he.h.m6:heHE.OsEnIpeiroPezefsas.greekname
ltx/en_us_oca/tr.d001:trMA.Ode1C11.incipit	Through parables leading all mankind…
ltx/en_us_oca/tr.d001:trMA.Ode1C11.melody	@ltx/en_us_oca/he.h.m6:heHE.OsEnIpeiroPezefsas.notmetered
ltx/en_us_oca/tr.d001:trMA.Ode1C11.mode	@ltx/en_us_oca/miscellanea:misc.Mode6
ltx/en_us_oca/tr.d001:trMA.Ode1C11.ode	@ltx/en_us_oca/miscellanea:misc.Ode1
ltx/en_us_oca/tr.d001:trMA.Ode1C11.text	Through parables leading all mankind ⁄ to seek amendment of life, ⁄ Christ raises up the Publican from his abasement ⁄ and humbles the Pharisee in his pride.
ltx/en_us_oca/tr.d001:trMA.Ode1C12.incipit	We see the exalted honor…
ltx/en_us_oca/tr.d001:trMA.Ode1C12.melody	@ltx/en_us_oca/he.h.m6:heHE.OsEnIpeiroPezefsas.notmetered
ltx/en_us_oca/tr.d001:trMA.Ode1C12.mode	@ltx/en_us_oca/miscellanea:misc.Mode6
ltx/en_us_oca/tr.d001:trMA.Ode1C12.ode	@ltx/en_us_oca/miscellanea:misc.Ode1
ltx/en_us_oca/tr.d001:trMA.Ode1C12.text	We see the exalted honor that comes through humility, ⁄ and the grievous fall that comes through pride. ⁄ Let us, then, emulate the good actions of the Publican ⁄ and hate the evil sin of the Pharisee!
ltx/en_us_oca/tr.d001:trMA.Ode1C13.incipit	Every good deed is made…
ltx/en_us_oca/tr.d001:trMA.Ode1C13.melody	@ltx/en_us_oca/he.h.m6:heHE.OsEnIpeiroPezefsas.notmetered
ltx/en_us_oca/tr.d001:trMA.Ode1C13.mode	@ltx/en_us_oca/miscellanea:misc.Mode6
ltx/en_us_oca/tr.d001:trMA.Ode1C13.ode	@ltx/en_us_oca/miscellanea:misc.Ode1
ltx/en_us_oca/tr.d001:trMA.Ode1C13.text	Every good deed is made of no effect through foolish pride, ⁄ while every evil is cleansed by humility. ⁄ In faith let us embrace humility ⁄ and utterly abhor the ways of vainglory.
ltx/en_us_oca/tr.d001:trMA.Ode1C14.incipit	The King of all, in…
ltx/en_us_oca/tr.d001:trMA.Ode1C14.melody	@ltx/en_us_oca/he.h.m6:heHE.OsEnIpeiroPezefsas.notmetered
ltx/en_us_oca/tr.d001:trMA.Ode1C14.mode	@ltx/en_us_oca/miscellanea:misc.Mode6
ltx/en_us_oca/tr.d001:trMA.Ode1C14.ode	@ltx/en_us_oca/miscellanea:misc.Ode1
ltx/en_us_oca/tr.d001:trMA.Ode1C14.text	The King of all, in His desire ⁄ that His own disciples be humble in mind, ⁄ taught them to emulate the groaning of the Publican ⁄ together with his humility.
ltx/en_us_oca/tr.d001:trMA.Ode1C15.incipit	I groan as the Publican…
ltx/en_us_oca/tr.d001:trMA.Ode1C15.melody	@ltx/en_us_oca/he.h.m6:heHE.OsEnIpeiroPezefsas.notmetered
ltx/en_us_oca/tr.d001:trMA.Ode1C15.mode	@ltx/en_us_oca/miscellanea:misc.Mode6
ltx/en_us_oca/tr.d001:trMA.Ode1C15.ode	@ltx/en_us_oca/miscellanea:misc.Ode1
ltx/en_us_oca/tr.d001:trMA.Ode1C15.text	I groan as the Publican, ⁄ and with unceasing lamentations I now draw near to Your compassion, Lord. ⁄ Be merciful also to me, ⁄ for now I live out my days in humility.
ltx/en_us_oca/tr.d001:trMA.Ode1C1T.incipit	I dedicate my understanding and…
ltx/en_us_oca/tr.d001:trMA.Ode1C1T.melody	@ltx/en_us_oca/he.h.m6:heHE.OsEnIpeiroPezefsas.notmetered
ltx/en_us_oca/tr.d001:trMA.Ode1C1T.mode	@ltx/en_us_oca/miscellanea:misc.Mode6
ltx/en_us_oca/tr.d001:trMA.Ode1C1T.ode	@ltx/en_us_oca/miscellanea:misc.Ode1
ltx/en_us_oca/tr.d001:trMA.Ode1C1T.text	I dedicate my understanding and my counsel to you, Lady, ⁄ my expectation, my body, soul and spirit. ⁄ Deliver and save me from dangerous adversaries and temptations, ⁄ and from every threat that lies before me!
ltx/en_us_oca/tr.d001:trMA.Ode3C11.greekmelody	@ltx/en_us_oca/he.h.m6:heHE.OukEstinAgios.greekname
ltx/en_us_oca/tr.d001:trMA.Ode3C11.incipit	The humble is lifted up…
ltx/en_us_oca/tr.d001:trMA.Ode3C11.melody	@ltx/en_us_oca/he.h.m6:heHE.OukEstinAgios.notmetered
ltx/en_us_oca/tr.d001:trMA.Ode3C11.mode	@ltx/en_us_oca/miscellanea:misc.Mode6
ltx/en_us_oca/tr.d001:trMA.Ode3C11.ode	@ltx/en_us_oca/miscellanea:misc.Ode3
ltx/en_us_oca/tr.d001:trMA.Ode3C11.text	The humble is lifted up on high ⁄ from the dung-hill of the passions, ⁄ while the proudhearted suffers a great: fall from the height of the virtues. ⁄ Let us flee from his evil ways.
ltx/en_us_oca/tr.d001:trMA.Ode3C12.incipit	Vainglory disperses the treasures of…
ltx/en_us_oca/tr.d001:trMA.Ode3C12.melody	@ltx/en_us_oca/he.h.m6:heHE.OukEstinAgios.notmetered
ltx/en_us_oca/tr.d001:trMA.Ode3C12.mode	@ltx/en_us_oca/miscellanea:misc.Mode6
ltx/en_us_oca/tr.d001:trMA.Ode3C12.ode	@ltx/en_us_oca/miscellanea:misc.Ode3
ltx/en_us_oca/tr.d001:trMA.Ode3C12.text	Vainglory disperses the treasures of righteousness, ⁄ but humility scatters the multitude of passions. ⁄ Then grant that we may seek humility, O Savior, ⁄ and bestow on us the portion of the Publican.
ltx/en_us_oca/tr.d001:trMA.Ode3C13.incipit	As the Publican, let us…
ltx/en_us_oca/tr.d001:trMA.Ode3C13.melody	@ltx/en_us_oca/he.h.m6:heHE.OukEstinAgios.notmetered
ltx/en_us_oca/tr.d001:trMA.Ode3C13.mode	@ltx/en_us_oca/miscellanea:misc.Mode6
ltx/en_us_oca/tr.d001:trMA.Ode3C13.ode	@ltx/en_us_oca/miscellanea:misc.Ode3
ltx/en_us_oca/tr.d001:trMA.Ode3C13.text	As the Publican, let us beat our breasts, ⁄ crying out in compunction: ⁄ O God, be merciful to us sinners, ⁄ that like him, we may receive forgiveness.
ltx/en_us_oca/tr.d001:trMA.Ode3C14.incipit	Faithful, let us increase in…
ltx/en_us_oca/tr.d001:trMA.Ode3C14.melody	@ltx/en_us_oca/he.h.m6:heHE.OukEstinAgios.notmetered
ltx/en_us_oca/tr.d001:trMA.Ode3C14.mode	@ltx/en_us_oca/miscellanea:misc.Mode6
ltx/en_us_oca/tr.d001:trMA.Ode3C14.ode	@ltx/en_us_oca/miscellanea:misc.Ode3
ltx/en_us_oca/tr.d001:trMA.Ode3C14.text	Faithful, let us increase in zeal and meekness, ⁄ passing our days in humility, ⁄ with cries of sorrow from our heart, weeping and prayer, ⁄ that we may receive forgiveness from God.
ltx/en_us_oca/tr.d001:trMA.Ode3C15.incipit	Faithful, let us cast away…
ltx/en_us_oca/tr.d001:trMA.Ode3C15.melody	@ltx/en_us_oca/he.h.m6:heHE.OukEstinAgios.notmetered
ltx/en_us_oca/tr.d001:trMA.Ode3C15.mode	@ltx/en_us_oca/miscellanea:misc.Mode6
ltx/en_us_oca/tr.d001:trMA.Ode3C15.ode	@ltx/en_us_oca/miscellanea:misc.Ode3
ltx/en_us_oca/tr.d001:trMA.Ode3C15.text	Faithful, let us cast away ⁄ the swollen boasting and evil folly of the Pharisee, ⁄ his loathsome pride and wicked cruelty, ⁄ and all that is hateful to God.
ltx/en_us_oca/tr.d001:trMA.Ode3C1T.incipit	I have set my trust…
ltx/en_us_oca/tr.d001:trMA.Ode3C1T.melody	@ltx/en_us_oca/he.h.m6:heHE.OukEstinAgios.notmetered
ltx/en_us_oca/tr.d001:trMA.Ode3C1T.mode	@ltx/en_us_oca/miscellanea:misc.Mode6
ltx/en_us_oca/tr.d001:trMA.Ode3C1T.ode	@ltx/en_us_oca/miscellanea:misc.Ode3
ltx/en_us_oca/tr.d001:trMA.Ode3C1T.text	I have set my trust in you, my only refuge: ⁄ Do not let me fall away from my good hope, ⁄ but grant me your protection, pure Virgin, ⁄ and deliver me from every assault by my enemies!
ltx/en_us_oca/tr.d001:trMA.Ode3Kathisma1.greekmelody	@ltx/en_us_oca/he.a.m4:heAU.TachyProkatalave.greekname
ltx/en_us_oca/tr.d001:trMA.Ode3Kathisma1.incipit	Overcome with shame and sorrow…
ltx/en_us_oca/tr.d001:trMA.Ode3Kathisma1.melody	@ltx/en_us_oca/he.a.m4:heAU.TachyProkatalave.notmetered
ltx/en_us_oca/tr.d001:trMA.Ode3Kathisma1.mode	@ltx/en_us_oca/miscellanea:misc.Mode4
ltx/en_us_oca/tr.d001:trMA.Ode3Kathisma1.text	Overcome with shame and sorrow at his evil deeds, ⁄ humility exalted the Publican: ⁄ he cried out to the Creator: Be merciful! ⁄ But the unhappy Pharisee who spoke in pride ⁄ was brought down from righteousness by his exaltation! ⁄ Therefore let us earnestly desire what is good, ⁄⁄ and avoid all that is evil.
ltx/en_us_oca/tr.d001:trMA.Ode3Kathisma2.greekmelody	@ltx/en_us_oca/he.a.m4:heAU.TachyProkatalave.greekname
ltx/en_us_oca/tr.d001:trMA.Ode3Kathisma2.incipit	In days of old, humility…
ltx/en_us_oca/tr.d001:trMA.Ode3Kathisma2.melody	@ltx/en_us_oca/he.a.m4:heAU.TachyProkatalave.notmetered
ltx/en_us_oca/tr.d001:trMA.Ode3Kathisma2.mode	@ltx/en_us_oca/miscellanea:misc.Mode4
ltx/en_us_oca/tr.d001:trMA.Ode3Kathisma2.text	In days of old, humility exalted the Publican, ⁄ who cried out, lamenting: Be merciful! And was justified. ⁄ Let us all follow his example, ⁄ for we have fallen to the depths of evil. ⁄ Let us cry to the Savior from the depths of our hearts: ⁄ We have sinned; be merciful, ⁄⁄ as the only Lover of mankind!
ltx/en_us_oca/tr.d001:trMA.Ode3Kathisma3.greekmelody	@ltx/en_us_oca/he.a.m4:heAU.TachyProkatalave.greekname
ltx/en_us_oca/tr.d001:trMA.Ode3Kathisma3.incipit	@ltx/en_us_oca/me.m12.d06:meMA.Kathisma3T.incipit
ltx/en_us_oca/tr.d001:trMA.Ode3Kathisma3.melody	@ltx/en_us_oca/he.a.m4:heAU.TachyProkatalave.notmetered
ltx/en_us_oca/tr.d001:trMA.Ode3Kathisma3.mode	@ltx/en_us_oca/miscellanea:misc.Mode4
ltx/en_us_oca/tr.d001:trMA.Ode3Kathisma3.text	@ltx/en_us_oca/me.m12.d06:meMA.Kathisma3T.text
ltx/en_us_oca/tr.d001:trMA.Ode4C11.greekmelody	@ltx/en_us_oca/he.h.m6:heHE.ChristosMouDynamis.greekname
ltx/en_us_oca/tr.d001:trMA.Ode4C11.incipit	The Word humbled Himself to…
ltx/en_us_oca/tr.d001:trMA.Ode4C11.melody	@ltx/en_us_oca/he.h.m6:heHE.ChristosMouDynamis.notmetered
ltx/en_us_oca/tr.d001:trMA.Ode4C11.mode	@ltx/en_us_oca/miscellanea:misc.Mode6
ltx/en_us_oca/tr.d001:trMA.Ode4C11.ode	@ltx/en_us_oca/miscellanea:misc.Ode4
ltx/en_us_oca/tr.d001:trMA.Ode4C11.text	The Word humbled Himself to the form of a servant, ⁄ showing that humility is the path to exaltation. ⁄ Every man, then, who humbles himself after the Lord’s example, ⁄ is exalted on high.
ltx/en_us_oca/tr.d001:trMA.Ode4C12.incipit	The Pharisee fell, exalted in…
ltx/en_us_oca/tr.d001:trMA.Ode4C12.melody	@ltx/en_us_oca/he.h.m6:heHE.ChristosMouDynamis.notmetered
ltx/en_us_oca/tr.d001:trMA.Ode4C12.mode	@ltx/en_us_oca/miscellanea:misc.Mode6
ltx/en_us_oca/tr.d001:trMA.Ode4C12.ode	@ltx/en_us_oca/miscellanea:misc.Ode4
ltx/en_us_oca/tr.d001:trMA.Ode4C12.text	The Pharisee fell, exalted in his righteousness, ⁄ while the Publican was abased, defiled by many sins; ⁄ yet against all expectation, he was exalted, ⁄ and so was justified.
ltx/en_us_oca/tr.d001:trMA.Ode4C13.incipit	Though he was rich in…
ltx/en_us_oca/tr.d001:trMA.Ode4C13.melody	@ltx/en_us_oca/he.h.m6:heHE.ChristosMouDynamis.notmetered
ltx/en_us_oca/tr.d001:trMA.Ode4C13.mode	@ltx/en_us_oca/miscellanea:misc.Mode6
ltx/en_us_oca/tr.d001:trMA.Ode4C13.ode	@ltx/en_us_oca/miscellanea:misc.Ode4
ltx/en_us_oca/tr.d001:trMA.Ode4C13.text	Though he was rich in virtues, ⁄ foolish pride brought the Pharisee to poverty, ⁄ but in his great need the Publican was justified through humility. ⁄ Let us also gain this humility.
ltx/en_us_oca/tr.d001:trMA.Ode4C14.incipit	You have warned us that…
ltx/en_us_oca/tr.d001:trMA.Ode4C14.melody	@ltx/en_us_oca/he.h.m6:heHE.ChristosMouDynamis.notmetered
ltx/en_us_oca/tr.d001:trMA.Ode4C14.mode	@ltx/en_us_oca/miscellanea:misc.Mode6
ltx/en_us_oca/tr.d001:trMA.Ode4C14.ode	@ltx/en_us_oca/miscellanea:misc.Ode4
ltx/en_us_oca/tr.d001:trMA.Ode4C14.text	You have warned us that You resist the proud, Master and Savior, ⁄ but give grace to the humble. ⁄ We pray You to send Your grace upon us now, ⁄ for we have humbled ourselves.
ltx/en_us_oca/tr.d001:trMA.Ode4C15.incipit	Ever leading us to divine…
ltx/en_us_oca/tr.d001:trMA.Ode4C15.melody	@ltx/en_us_oca/he.h.m6:heHE.ChristosMouDynamis.notmetered
ltx/en_us_oca/tr.d001:trMA.Ode4C15.mode	@ltx/en_us_oca/miscellanea:misc.Mode6
ltx/en_us_oca/tr.d001:trMA.Ode4C15.ode	@ltx/en_us_oca/miscellanea:misc.Ode4
ltx/en_us_oca/tr.d001:trMA.Ode4C15.text	Ever leading us to divine exaltation, ⁄ our Savior and Master, by His own deeds ⁄ revealed to us the humility that exalts us, ⁄ with His own hands, washing the feet of the disciples.
ltx/en_us_oca/tr.d001:trMA.Ode4C1T.incipit	You have borne the Light…
ltx/en_us_oca/tr.d001:trMA.Ode4C1T.melody	@ltx/en_us_oca/he.h.m6:heHE.ChristosMouDynamis.notmetered
ltx/en_us_oca/tr.d001:trMA.Ode4C1T.mode	@ltx/en_us_oca/miscellanea:misc.Mode6
ltx/en_us_oca/tr.d001:trMA.Ode4C1T.ode	@ltx/en_us_oca/miscellanea:misc.Ode4
ltx/en_us_oca/tr.d001:trMA.Ode4C1T.text	You have borne the Light unapproachable, Virgin; ⁄ disperse the darkness of my soul with your light-giving radiance: ⁄ Take me by the hand, ⁄ and guide my life to the paths of salvation!
ltx/en_us_oca/tr.d001:trMA.Ode5C11.greekmelody	@ltx/en_us_oca/he.h.m6:heHE.ToTheioFengeiSou.greekname
ltx/en_us_oca/tr.d001:trMA.Ode5C11.incipit	Let us hasten to follow…
ltx/en_us_oca/tr.d001:trMA.Ode5C11.melody	@ltx/en_us_oca/he.h.m6:heHE.ToTheioFengeiSou.notmetered
ltx/en_us_oca/tr.d001:trMA.Ode5C11.mode	@ltx/en_us_oca/miscellanea:misc.Mode6
ltx/en_us_oca/tr.d001:trMA.Ode5C11.ode	@ltx/en_us_oca/miscellanea:misc.Ode5
ltx/en_us_oca/tr.d001:trMA.Ode5C11.text	Let us hasten to follow the Pharisee in his virtues ⁄ and to emulate the Publican in his humility. ⁄ Let us hate what is wrong in each of them: ⁄ foolish pride and the defilement of transgressions.
ltx/en_us_oca/tr.d001:trMA.Ode5C12.incipit	The righteousness of the Pharisee…
ltx/en_us_oca/tr.d001:trMA.Ode5C12.melody	@ltx/en_us_oca/he.h.m6:heHE.ToTheioFengeiSou.notmetered
ltx/en_us_oca/tr.d001:trMA.Ode5C12.mode	@ltx/en_us_oca/miscellanea:misc.Mode6
ltx/en_us_oca/tr.d001:trMA.Ode5C12.ode	@ltx/en_us_oca/miscellanea:misc.Ode5
ltx/en_us_oca/tr.d001:trMA.Ode5C12.text	The righteousness of the Pharisee proved to be vanity, ⁄ and was condemned, for it was yoked to pride; ⁄ but the Publican gained humility, ⁄ which goes with the virtue exalting men on high.
ltx/en_us_oca/tr.d001:trMA.Ode5C13.incipit	The Pharisee thought to drive…
ltx/en_us_oca/tr.d001:trMA.Ode5C13.melody	@ltx/en_us_oca/he.h.m6:heHE.ToTheioFengeiSou.notmetered
ltx/en_us_oca/tr.d001:trMA.Ode5C13.mode	@ltx/en_us_oca/miscellanea:misc.Mode6
ltx/en_us_oca/tr.d001:trMA.Ode5C13.ode	@ltx/en_us_oca/miscellanea:misc.Ode5
ltx/en_us_oca/tr.d001:trMA.Ode5C13.text	The Pharisee thought to drive swiftly ⁄ in the chariot of the virtues; ⁄ but the Publican on foot outran him, ⁄ for he yoked humility with compassion.
ltx/en_us_oca/tr.d001:trMA.Ode5C14.incipit	Pondering with our minds the…
ltx/en_us_oca/tr.d001:trMA.Ode5C14.melody	@ltx/en_us_oca/he.h.m6:heHE.ToTheioFengeiSou.notmetered
ltx/en_us_oca/tr.d001:trMA.Ode5C14.mode	@ltx/en_us_oca/miscellanea:misc.Mode6
ltx/en_us_oca/tr.d001:trMA.Ode5C14.ode	@ltx/en_us_oca/miscellanea:misc.Ode5
ltx/en_us_oca/tr.d001:trMA.Ode5C14.text	Pondering with our minds the parable of the Publican, ⁄ let us all emulate him with tears, ⁄ offering God a contrite spirit ⁄ and seeking the remission of our sins.
ltx/en_us_oca/tr.d001:trMA.Ode5C15.incipit	Let us in all wisdom…
ltx/en_us_oca/tr.d001:trMA.Ode5C15.melody	@ltx/en_us_oca/he.h.m6:heHE.ToTheioFengeiSou.notmetered
ltx/en_us_oca/tr.d001:trMA.Ode5C15.mode	@ltx/en_us_oca/miscellanea:misc.Mode6
ltx/en_us_oca/tr.d001:trMA.Ode5C15.ode	@ltx/en_us_oca/miscellanea:misc.Ode5
ltx/en_us_oca/tr.d001:trMA.Ode5C15.text	Let us in all wisdom ⁄ cast far away from ourselves ⁄ the wicked arrogance and boasting of the Pharisee, ⁄ that we may not be stripped of divine grace!
ltx/en_us_oca/tr.d001:trMA.Ode5C1T.incipit	Give a staff of strength…
ltx/en_us_oca/tr.d001:trMA.Ode5C1T.melody	@ltx/en_us_oca/he.h.m6:heHE.ToTheioFengeiSou.notmetered
ltx/en_us_oca/tr.d001:trMA.Ode5C1T.mode	@ltx/en_us_oca/miscellanea:misc.Mode6
ltx/en_us_oca/tr.d001:trMA.Ode5C1T.ode	@ltx/en_us_oca/miscellanea:misc.Ode5
ltx/en_us_oca/tr.d001:trMA.Ode5C1T.text	Give a staff of strength, loving Virgin, ⁄ to all of us who run to you for refuge: ⁄ Give us victory in the midst of all our enemies, ⁄ and deliver us from all harm.
ltx/en_us_oca/tr.d001:trMA.Ode6C11.greekmelody	@ltx/en_us_oca/he.h.m6:heHE.TouViouTinThalassan.greekname
ltx/en_us_oca/tr.d001:trMA.Ode6C11.incipit	The Publican and Pharisee both…
ltx/en_us_oca/tr.d001:trMA.Ode6C11.melody	@ltx/en_us_oca/he.h.m6:heHE.TouViouTinThalassan.notmetered
ltx/en_us_oca/tr.d001:trMA.Ode6C11.mode	@ltx/en_us_oca/miscellanea:misc.Mode6
ltx/en_us_oca/tr.d001:trMA.Ode6C11.ode	@ltx/en_us_oca/miscellanea:misc.Ode6
ltx/en_us_oca/tr.d001:trMA.Ode6C11.text	The Publican and Pharisee both ran in the race of life, ⁄ but the one was overcome by foolish pride: ⁄ He was brought to a shameful shipwreck, ⁄ while the other was saved by humility.
ltx/en_us_oca/tr.d001:trMA.Ode6C12.incipit	Changing to a righteous course…
ltx/en_us_oca/tr.d001:trMA.Ode6C12.melody	@ltx/en_us_oca/he.h.m6:heHE.TouViouTinThalassan.notmetered
ltx/en_us_oca/tr.d001:trMA.Ode6C12.mode	@ltx/en_us_oca/miscellanea:misc.Mode6
ltx/en_us_oca/tr.d001:trMA.Ode6C12.ode	@ltx/en_us_oca/miscellanea:misc.Ode6
ltx/en_us_oca/tr.d001:trMA.Ode6C12.text	Changing to a righteous course of life, ⁄ let us emulate the wisdom of the Publican: ⁄ Let us run from the hateful conceit of the Pharisee, ⁄ so letting ourselves attain to life.
ltx/en_us_oca/tr.d001:trMA.Ode6C13.incipit	Let us eagerly follow the…
ltx/en_us_oca/tr.d001:trMA.Ode6C13.melody	@ltx/en_us_oca/he.h.m6:heHE.TouViouTinThalassan.notmetered
ltx/en_us_oca/tr.d001:trMA.Ode6C13.mode	@ltx/en_us_oca/miscellanea:misc.Mode6
ltx/en_us_oca/tr.d001:trMA.Ode6C13.ode	@ltx/en_us_oca/miscellanea:misc.Ode6
ltx/en_us_oca/tr.d001:trMA.Ode6C13.text	Let us eagerly follow the ways of Jesus the Savior, ⁄ and His humility, ⁄ in our desire to attain the eternal dwelling of joy, ⁄ and to find rest in the land of the living.
ltx/en_us_oca/tr.d001:trMA.Ode6C14.incipit	You have shown Your disciples…
ltx/en_us_oca/tr.d001:trMA.Ode6C14.melody	@ltx/en_us_oca/he.h.m6:heHE.TouViouTinThalassan.notmetered
ltx/en_us_oca/tr.d001:trMA.Ode6C14.mode	@ltx/en_us_oca/miscellanea:misc.Mode6
ltx/en_us_oca/tr.d001:trMA.Ode6C14.ode	@ltx/en_us_oca/miscellanea:misc.Ode6
ltx/en_us_oca/tr.d001:trMA.Ode6C14.text	You have shown Your disciples, Master, ⁄ the humility that raises men on high: ⁄ girding Your loins with a towel, You washed their feet, ⁄ preparing them to follow Your example.
ltx/en_us_oca/tr.d001:trMA.Ode6C15.incipit	The Pharisee spent his life…
ltx/en_us_oca/tr.d001:trMA.Ode6C15.melody	@ltx/en_us_oca/he.h.m6:heHE.TouViouTinThalassan.notmetered
ltx/en_us_oca/tr.d001:trMA.Ode6C15.mode	@ltx/en_us_oca/miscellanea:misc.Mode6
ltx/en_us_oca/tr.d001:trMA.Ode6C15.ode	@ltx/en_us_oca/miscellanea:misc.Ode6
ltx/en_us_oca/tr.d001:trMA.Ode6C15.text	The Pharisee spent his life in virtue, and the Publican in sin; ⁄ but the one was foolishly brought low through his pride, ⁄ while the other in his humility of mind ⁄ was raised up to the heights.
ltx/en_us_oca/tr.d001:trMA.Ode6C1T.incipit	I was created naked in…
ltx/en_us_oca/tr.d001:trMA.Ode6C1T.melody	@ltx/en_us_oca/he.h.m6:heHE.TouViouTinThalassan.notmetered
ltx/en_us_oca/tr.d001:trMA.Ode6C1T.mode	@ltx/en_us_oca/miscellanea:misc.Mode6
ltx/en_us_oca/tr.d001:trMA.Ode6C1T.ode	@ltx/en_us_oca/miscellanea:misc.Ode6
ltx/en_us_oca/tr.d001:trMA.Ode6C1T.text	I was created naked in innocence and simplicity; ⁄ then the enemy clothed me with the garment of sin and passionate flesh. ⁄ But now I am saved, Maiden, through your intercession.
ltx/en_us_oca/tr.d001:trMA.Ode7C11.greekmelody	@ltx/en_us_oca/he.h.m6:heHE.DrosovolonMenTinKaminon.greekname
ltx/en_us_oca/tr.d001:trMA.Ode7C11.incipit	Exalted by the works of…
ltx/en_us_oca/tr.d001:trMA.Ode7C11.melody	@ltx/en_us_oca/he.h.m6:heHE.DrosovolonMenTinKaminon.notmetered
ltx/en_us_oca/tr.d001:trMA.Ode7C11.mode	@ltx/en_us_oca/miscellanea:misc.Mode6
ltx/en_us_oca/tr.d001:trMA.Ode7C11.ode	@ltx/en_us_oca/miscellanea:misc.Ode7
ltx/en_us_oca/tr.d001:trMA.Ode7C11.text	Exalted by the works of justification and great boasting, ⁄ the Pharisee was deeply entangled in the nets of pride; ⁄ but the Publican was lifted on the rising wing of humility ⁄ and thus he drew near to God.
ltx/en_us_oca/tr.d001:trMA.Ode7C12.incipit	The Publican used humility as…
ltx/en_us_oca/tr.d001:trMA.Ode7C12.melody	@ltx/en_us_oca/he.h.m6:heHE.DrosovolonMenTinKaminon.notmetered
ltx/en_us_oca/tr.d001:trMA.Ode7C12.mode	@ltx/en_us_oca/miscellanea:misc.Mode6
ltx/en_us_oca/tr.d001:trMA.Ode7C12.ode	@ltx/en_us_oca/miscellanea:misc.Ode7
ltx/en_us_oca/tr.d001:trMA.Ode7C12.text	The Publican used humility as a ladder ⁄ and was raised to the height of heaven; ⁄ but the wretched Pharisee was lifted by pride onto rotten emptiness, ⁄ and fell into the trap of hell.
ltx/en_us_oca/tr.d001:trMA.Ode7C13.incipit	The crafty enemy lies in…
ltx/en_us_oca/tr.d001:trMA.Ode7C13.melody	@ltx/en_us_oca/he.h.m6:heHE.DrosovolonMenTinKaminon.notmetered
ltx/en_us_oca/tr.d001:trMA.Ode7C13.mode	@ltx/en_us_oca/miscellanea:misc.Mode6
ltx/en_us_oca/tr.d001:trMA.Ode7C13.ode	@ltx/en_us_oca/miscellanea:misc.Ode7
ltx/en_us_oca/tr.d001:trMA.Ode7C13.text	The crafty enemy lies in wait for the righteous, ⁄ despoiling them through pride, ⁄ while binding sinners fast with the ropes of despair, ⁄ but let us emulate the Publican, ⁄ and with haste, escape both these evils!
ltx/en_us_oca/tr.d001:trMA.Ode7C14.incipit	Let us fall before God…
ltx/en_us_oca/tr.d001:trMA.Ode7C14.melody	@ltx/en_us_oca/he.h.m6:heHE.DrosovolonMenTinKaminon.notmetered
ltx/en_us_oca/tr.d001:trMA.Ode7C14.mode	@ltx/en_us_oca/miscellanea:misc.Mode6
ltx/en_us_oca/tr.d001:trMA.Ode7C14.ode	@ltx/en_us_oca/miscellanea:misc.Ode7
ltx/en_us_oca/tr.d001:trMA.Ode7C14.text	Let us fall before God in prayer with fervent tears of repentance, ⁄ emulating the Publican in the humility which raised him on high, ⁄ and let us sing in faith: ⁄ Blessed are You, O God of our fathers!
ltx/en_us_oca/tr.d001:trMA.Ode7C15.incipit	You have warned Your disciples…
ltx/en_us_oca/tr.d001:trMA.Ode7C15.melody	@ltx/en_us_oca/he.h.m6:heHE.DrosovolonMenTinKaminon.notmetered
ltx/en_us_oca/tr.d001:trMA.Ode7C15.mode	@ltx/en_us_oca/miscellanea:misc.Mode6
ltx/en_us_oca/tr.d001:trMA.Ode7C15.ode	@ltx/en_us_oca/miscellanea:misc.Ode7
ltx/en_us_oca/tr.d001:trMA.Ode7C15.text	You have warned Your disciples, Master, ⁄ teaching them not to think proud thoughts but to be numbered with the humble. ⁄ Therefore, Savior, we cry aloud to You in faith: ⁄ Blessed are You, O God of our fathers!
ltx/en_us_oca/tr.d001:trMA.Ode7C1T.incipit	You are the beauty of…
ltx/en_us_oca/tr.d001:trMA.Ode7C1T.melody	@ltx/en_us_oca/he.h.m6:heHE.DrosovolonMenTinKaminon.notmetered
ltx/en_us_oca/tr.d001:trMA.Ode7C1T.mode	@ltx/en_us_oca/miscellanea:misc.Mode6
ltx/en_us_oca/tr.d001:trMA.Ode7C1T.ode	@ltx/en_us_oca/miscellanea:misc.Ode7
ltx/en_us_oca/tr.d001:trMA.Ode7C1T.text	You are the beauty of Jacob, holy Virgin; ⁄ the divine ladder he saw in days of old, stretching from earth to heaven, ⁄ for you bring down the Incarnate God from on high, ⁄ and bring mortal men up to heaven.
ltx/en_us_oca/tr.d001:trMA.Ode8C11.greekmelody	@ltx/en_us_oca/he.h.m6:heHE.EkFlogosToisOsiois.greekname
ltx/en_us_oca/tr.d001:trMA.Ode8C11.incipit	The Publican groaned aloud, and…
ltx/en_us_oca/tr.d001:trMA.Ode8C11.melody	@ltx/en_us_oca/he.h.m6:heHE.EkFlogosToisOsiois.notmetered
ltx/en_us_oca/tr.d001:trMA.Ode8C11.mode	@ltx/en_us_oca/miscellanea:misc.Mode6
ltx/en_us_oca/tr.d001:trMA.Ode8C11.ode	@ltx/en_us_oca/miscellanea:misc.Ode8
ltx/en_us_oca/tr.d001:trMA.Ode8C11.text	The Publican groaned aloud, and was saved, ⁄ for he found the Lord merciful to him in his humility, ⁄ but the Pharisee fell from righteousness ⁄ by his evil boasting.
ltx/en_us_oca/tr.d001:trMA.Ode8C12.incipit	Faithful, let us avoid the…
ltx/en_us_oca/tr.d001:trMA.Ode8C12.melody	@ltx/en_us_oca/he.h.m6:heHE.EkFlogosToisOsiois.notmetered
ltx/en_us_oca/tr.d001:trMA.Ode8C12.mode	@ltx/en_us_oca/miscellanea:misc.Mode6
ltx/en_us_oca/tr.d001:trMA.Ode8C12.ode	@ltx/en_us_oca/miscellanea:misc.Ode8
ltx/en_us_oca/tr.d001:trMA.Ode8C12.text	Faithful, let us avoid the pride of the Pharisee: ⁄ Let us not say: We are pure! as he did; ⁄ but let us rightly follow the Publican in his humble thoughts ⁄ which gained for him God’s mercy.
ltx/en_us_oca/tr.d001:trMA.Ode8C13.incipit	Faithful, let us speak the…
ltx/en_us_oca/tr.d001:trMA.Ode8C13.melody	@ltx/en_us_oca/he.h.m6:heHE.EkFlogosToisOsiois.notmetered
ltx/en_us_oca/tr.d001:trMA.Ode8C13.mode	@ltx/en_us_oca/miscellanea:misc.Mode6
ltx/en_us_oca/tr.d001:trMA.Ode8C13.ode	@ltx/en_us_oca/miscellanea:misc.Ode8
ltx/en_us_oca/tr.d001:trMA.Ode8C13.text	Faithful, let us speak the words of the Publican in the holy temple: ⁄ God, be merciful to me! ⁄ That with him we may obtain forgiveness ⁄ and be delivered from the evil boasting of the Pharisee.
ltx/en_us_oca/tr.d001:trMA.Ode8C14.incipit	Let us all emulate the…
ltx/en_us_oca/tr.d001:trMA.Ode8C14.melody	@ltx/en_us_oca/he.h.m6:heHE.EkFlogosToisOsiois.notmetered
ltx/en_us_oca/tr.d001:trMA.Ode8C14.mode	@ltx/en_us_oca/miscellanea:misc.Mode6
ltx/en_us_oca/tr.d001:trMA.Ode8C14.ode	@ltx/en_us_oca/miscellanea:misc.Ode8
ltx/en_us_oca/tr.d001:trMA.Ode8C14.text	Let us all emulate the groaning of the Publican, ⁄ and cry out to God with fervent tears: ⁄ We have sinned, Lover of mankind. ⁄ In Your compassion, be merciful to us and save us!
ltx/en_us_oca/tr.d001:trMA.Ode8C15.incipit	God accepted the groaning of…
ltx/en_us_oca/tr.d001:trMA.Ode8C15.melody	@ltx/en_us_oca/he.h.m6:heHE.EkFlogosToisOsiois.notmetered
ltx/en_us_oca/tr.d001:trMA.Ode8C15.mode	@ltx/en_us_oca/miscellanea:misc.Mode6
ltx/en_us_oca/tr.d001:trMA.Ode8C15.ode	@ltx/en_us_oca/miscellanea:misc.Ode8
ltx/en_us_oca/tr.d001:trMA.Ode8C15.text	God accepted the groaning of the Publican, ⁄ justifying him, and showing us all ⁄ that He is turned to mercy by the groans and tears ⁄ of those who beg forgiveness of sins.
ltx/en_us_oca/tr.d001:trMA.Ode8C1T.incipit	I offer you, pure and…
ltx/en_us_oca/tr.d001:trMA.Ode8C1T.melody	@ltx/en_us_oca/he.h.m6:heHE.EkFlogosToisOsiois.notmetered
ltx/en_us_oca/tr.d001:trMA.Ode8C1T.mode	@ltx/en_us_oca/miscellanea:misc.Mode6
ltx/en_us_oca/tr.d001:trMA.Ode8C1T.ode	@ltx/en_us_oca/miscellanea:misc.Ode8
ltx/en_us_oca/tr.d001:trMA.Ode8C1T.text	I offer you, pure and blameless Virgin, ⁄ as my intercessor and mediator with Him whom you bore, ⁄ for I have no other help but you! ⁄ Set me free from all tribulation.
ltx/en_us_oca/tr.d001:trMA.Ode9C11.greekmelody	@ltx/en_us_oca/he.h.m6:heHE.TheonAnthropois.greekname
ltx/en_us_oca/tr.d001:trMA.Ode9C11.incipit	Christ has set before us…
ltx/en_us_oca/tr.d001:trMA.Ode9C11.melody	@ltx/en_us_oca/he.h.m6:heHE.TheonAnthropois.notmetered
ltx/en_us_oca/tr.d001:trMA.Ode9C11.mode	@ltx/en_us_oca/miscellanea:misc.Mode6
ltx/en_us_oca/tr.d001:trMA.Ode9C11.ode	@ltx/en_us_oca/miscellanea:misc.Ode9
ltx/en_us_oca/tr.d001:trMA.Ode9C11.text	Christ has set before us the abasement of the Publican ⁄ as a path to exaltation and a pattern of salvation: ⁄ Let us follow his example and reject disdainful pride, ⁄ and gain God’s mercy through our humility.
ltx/en_us_oca/tr.d001:trMA.Ode9C12.incipit	Let us cast foolish pride…
ltx/en_us_oca/tr.d001:trMA.Ode9C12.melody	@ltx/en_us_oca/he.h.m6:heHE.TheonAnthropois.notmetered
ltx/en_us_oca/tr.d001:trMA.Ode9C12.mode	@ltx/en_us_oca/miscellanea:misc.Mode6
ltx/en_us_oca/tr.d001:trMA.Ode9C12.ode	@ltx/en_us_oca/miscellanea:misc.Ode9
ltx/en_us_oca/tr.d001:trMA.Ode9C12.text	Let us cast foolish pride from our souls, ⁄ learning to think with truth and humility; ⁄ let us not try to justify ourselves, but to hate pride’s delusion, ⁄ and so with the Publican, obtain God’s mercy.
ltx/en_us_oca/tr.d001:trMA.Ode9C13.incipit	As the Publican, let us…
ltx/en_us_oca/tr.d001:trMA.Ode9C13.melody	@ltx/en_us_oca/he.h.m6:heHE.TheonAnthropois.notmetered
ltx/en_us_oca/tr.d001:trMA.Ode9C13.mode	@ltx/en_us_oca/miscellanea:misc.Mode6
ltx/en_us_oca/tr.d001:trMA.Ode9C13.ode	@ltx/en_us_oca/miscellanea:misc.Ode9
ltx/en_us_oca/tr.d001:trMA.Ode9C13.text	As the Publican, let us offer the Creator prayers for mercy. ⁄ Let us avoid the ungrateful prayers of the Pharisee ⁄ and the boasting words with which he judged his neighbor, ⁄ that we may gain God’s mercy and enlightenment.
ltx/en_us_oca/tr.d001:trMA.Ode9C14.incipit	Weighed down by the great…
ltx/en_us_oca/tr.d001:trMA.Ode9C14.melody	@ltx/en_us_oca/he.h.m6:heHE.TheonAnthropois.notmetered
ltx/en_us_oca/tr.d001:trMA.Ode9C14.mode	@ltx/en_us_oca/miscellanea:misc.Mode6
ltx/en_us_oca/tr.d001:trMA.Ode9C14.ode	@ltx/en_us_oca/miscellanea:misc.Ode9
ltx/en_us_oca/tr.d001:trMA.Ode9C14.text	Weighed down by the great number of my sins, ⁄ I have surpassed the Publican in an excess of evil, ⁄ I have also made the boasting delusion of the Pharisee my own: ⁄ I utterly lack all good things: O Lord, spare me!
ltx/en_us_oca/tr.d001:trMA.Ode9C15.incipit	Bestow Your blessedness on those…
ltx/en_us_oca/tr.d001:trMA.Ode9C15.melody	@ltx/en_us_oca/he.h.m6:heHE.TheonAnthropois.notmetered
ltx/en_us_oca/tr.d001:trMA.Ode9C15.mode	@ltx/en_us_oca/miscellanea:misc.Mode6
ltx/en_us_oca/tr.d001:trMA.Ode9C15.ode	@ltx/en_us_oca/miscellanea:misc.Ode9
ltx/en_us_oca/tr.d001:trMA.Ode9C15.text	Bestow Your blessedness on those who are poor in spirit for Your sake! ⁄ We offer You a contrite spirit in obedience to Your command: ⁄ Accept out sacrifice, O Savior, ⁄ and save those who worship You.
ltx/en_us_oca/tr.d001:trMA.Ode9C16.incipit	A Publican once went up…
ltx/en_us_oca/tr.d001:trMA.Ode9C16.melody	@ltx/en_us_oca/he.h.m6:heHE.TheonAnthropois.notmetered
ltx/en_us_oca/tr.d001:trMA.Ode9C16.mode	@ltx/en_us_oca/miscellanea:misc.Mode6
ltx/en_us_oca/tr.d001:trMA.Ode9C16.ode	@ltx/en_us_oca/miscellanea:misc.Ode9
ltx/en_us_oca/tr.d001:trMA.Ode9C16.text	A Publican once went up into the temple with faith, ⁄ and was justified as he prayed to God. ⁄ For he drew near in contrition of heart, with tears and cries of sorrow, ⁄ and obtaining mercy, he laid aside all the burden of his sin.
ltx/en_us_oca/tr.d001:trMA.Ode9C1T.incipit	We honor you, all-pure Virgin…
ltx/en_us_oca/tr.d001:trMA.Ode9C1T.melody	@ltx/en_us_oca/he.h.m6:heHE.TheonAnthropois.notmetered
ltx/en_us_oca/tr.d001:trMA.Ode9C1T.mode	@ltx/en_us_oca/miscellanea:misc.Mode6
ltx/en_us_oca/tr.d001:trMA.Ode9C1T.ode	@ltx/en_us_oca/miscellanea:misc.Ode9
ltx/en_us_oca/tr.d001:trMA.Ode9C1T.text	We honor you, all-pure Virgin, and magnify your child-bearing! ⁄ Grant us to praise, bless, and glorify you worthily, ⁄ for you alone are blessed. ⁄ You are the boast of Christians, and an acceptable intercessor before God!
ltx/en_us_oca/tr.d001:trMA.Oikos1.text	Let us all humble ourselves, brethren; groaning and lamenting and beating our conscience, that at the eternal Judgment we may receive forgiveness, and be numbered with the faithful and righteous. Let us pray to see the true peace of the age to come, where there is no more sorrow or sighing, in the glorious Eden fashioned by Christ, ⁄⁄ For he is God, co-eternal with the Father!
ltx/en_us_oca/tr.d001:trMA.PostGospelBoth.incipit	…
ltx/en_us_oca/tr.d001:trMA.PostGospelBoth.melody	
ltx/en_us_oca/tr.d001:trMA.PostGospelBoth.mode	@ltx/en_us_oca/miscellanea:misc.Mode8
ltx/en_us_oca/tr.d001:trMA.PostGospelBoth.text	
ltx/en_us_oca/tr.d001:trMA.PostGospelGlory.incipit	…
ltx/en_us_oca/tr.d001:trMA.PostGospelGlory.melody	
ltx/en_us_oca/tr.d001:trMA.PostGospelGlory.mode	@ltx/en_us_oca/miscellanea:misc.Mode8
ltx/en_us_oca/tr.d001:trMA.PostGospelGlory.text	
ltx/en_us_oca/tr.d001:trMA.PostGospelIdiomelon.incipit	…
ltx/en_us_oca/tr.d001:trMA.PostGospelIdiomelon.melody	
ltx/en_us_oca/tr.d001:trMA.PostGospelIdiomelon.mode	@ltx/en_us_oca/miscellanea:misc.Mode6
ltx/en_us_oca/tr.d001:trMA.PostGospelIdiomelon.text	
ltx/en_us_oca/tr.d001:trSY.commemoration.couplet1.title	@ltx/en_us_oca/titles:ti.Verses
ltx/en_us_oca/tr.d001:trSY.commemoration.couplet1.verse1	
ltx/en_us_oca/tr.d001:trSY.commemoration.couplet1.verse2	
ltx/en_us_oca/tr.d001:trSY.commemoration.couplet2.title	
ltx/en_us_oca/tr.d001:trSY.commemoration.couplet2.verse1	
ltx/en_us_oca/tr.d001:trSY.commemoration.couplet2.verse2	
ltx/en_us_oca/tr.d001:trSY.commemoration.couplet2.verse3	
ltx/en_us_oca/tr.d001:trSY.commemoration.narration.p01	
ltx/en_us_oca/tr.d001:trSY.commemoration.narration.p02	
ltx/en_us_oca/tr.d001:trSY.commemoration.narration.p03	
ltx/en_us_oca/tr.d001:trSY.commemoration.narration.p04	
ltx/en_us_oca/tr.d001:trSY.commemoration.narration.p05	
ltx/en_us_oca/tr.d001:trSY.commemoration.narration.p06	
ltx/en_us_oca/tr.d001:trSY.commemoration.narration.p07	
ltx/en_us_oca/tr.d001:trSY.commemoration.text	
ltx/en_us_oca/tr.d001:trSY.lastline	
ltx/en_us_oca/tr.d001:trVE.AposGlory.incipit	…
ltx/en_us_oca/tr.d001:trVE.AposGlory.melody	@ltx/en_us_oca/miscellanea:misc.Idiomelon
ltx/en_us_oca/tr.d001:trVE.AposGlory.mode	@ltx/en_us_oca/miscellanea:misc.Mode5
ltx/en_us_oca/tr.d001:trVE.AposGlory.text	
ltx/en_us_oca/tr.d001:trVE.AposTheotokion.incipit	@ltx/en_us_oca/oc.m5.d1:ocVE.AposTheotokion.incipit
ltx/en_us_oca/tr.d001:trVE.AposTheotokion.melody	
ltx/en_us_oca/tr.d001:trVE.AposTheotokion.mode	@ltx/en_us_oca/oc.m5.d1:ocVE.AposTheotokion.mode
ltx/en_us_oca/tr.d001:trVE.AposTheotokion.text	@ltx/en_us_oca/oc.m5.d1:ocVE.AposTheotokion.text
ltx/en_us_oca/tr.d001:trVE.MM.Stichera112as567.text	@ltx/en_us_oca/properties:media.key
ltx/en_us_oca/tr.d001:trVE.MM.Stichera112as8910.text	@ltx/en_us_oca/properties:media.key
ltx/en_us_oca/tr.d001:trVE.MM.Stichera12as56.text	@ltx/en_us_oca/properties:media.key
ltx/en_us_oca/tr.d001:trVE.SticGlory.incipit	…
ltx/en_us_oca/tr.d001:trVE.SticGlory.melody	@ltx/en_us_oca/miscellanea:misc.Idiomelon
ltx/en_us_oca/tr.d001:trVE.SticGlory.mode	@ltx/en_us_oca/miscellanea:misc.Mode8
ltx/en_us_oca/tr.d001:trVE.SticGlory.text	
ltx/en_us_oca/tr.d001:trVE.Stichera01.incipit	…
ltx/en_us_oca/tr.d001:trVE.Stichera01.melody	@ltx/en_us_oca/miscellanea:misc.Idiomelon
ltx/en_us_oca/tr.d001:trVE.Stichera01.mode	@ltx/en_us_oca/miscellanea:misc.Mode1
ltx/en_us_oca/tr.d001:trVE.Stichera01.text	
ltx/en_us_oca/tr.d001:trVE.Stichera02.incipit	…
ltx/en_us_oca/tr.d001:trVE.Stichera02.melody	@ltx/en_us_oca/miscellanea:misc.Idiomelon
ltx/en_us_oca/tr.d001:trVE.Stichera02.mode	@ltx/en_us_oca/miscellanea:misc.Mode1
ltx/en_us_oca/tr.d001:trVE.Stichera02.text	
