ltx/en_us_oca/me.m03.d14:meDA.commemoration.first	
ltx/en_us_oca/me.m03.d14:meDA.commemoration.first_name	
ltx/en_us_oca/me.m03.d14:meDA.commemoration.first_short	
ltx/en_us_oca/me.m03.d14:meDA.commemoration.first_title	
ltx/en_us_oca/me.m03.d14:meDA.commemoration.full	
ltx/en_us_oca/me.m03.d14:meDA.commemoration.second_name	
ltx/en_us_oca/me.m03.d14:meDA.commemoration.second_title	
ltx/en_us_oca/me.m03.d14:meDA.date	
ltx/en_us_oca/me.m03.d14:meDA.fordate	
ltx/en_us_oca/me.m03.d14:meDA.insert1	
ltx/en_us_oca/me.m03.d14:meDA.insert2	
ltx/en_us_oca/me.m03.d14:meDA.note	
ltx/en_us_oca/me.m03.d14:meDA.pdfcoverdate	
ltx/en_us_oca/me.m03.d14:meDA.pdfheaderdate	
ltx/en_us_oca/me.m03.d14:meHO.commemorations	
ltx/en_us_oca/me.m03.d14:meHO.note1	
ltx/en_us_oca/me.m03.d14:meHO.note2	
ltx/en_us_oca/me.m03.d14:meHO.number	
ltx/en_us_oca/me.m03.d14:meHO.rank	
ltx/en_us_oca/me.m03.d14:meLE.commemoration1	
ltx/en_us_oca/me.m03.d14:meLE.commemoration2	
ltx/en_us_oca/me.m03.d14:meLI.Kontakion1.incipit	@ltx/en_us_oca/me.m03.d14:meMA.Kontakion1ger.incipit
ltx/en_us_oca/me.m03.d14:meLI.Kontakion1.melody	@ltx/en_us_oca/me.m03.d14:meMA.Kontakion1ger.melody
ltx/en_us_oca/me.m03.d14:meLI.Kontakion1.mode	@ltx/en_us_oca/me.m03.d14:meMA.Kontakion1ger.mode
ltx/en_us_oca/me.m03.d14:meLI.Kontakion1.text	@ltx/en_us_oca/me.m03.d14:meMA.Kontakion1ger.text
ltx/en_us_oca/me.m03.d14:meLI.Megalynarion.text	
ltx/en_us_oca/me.m03.d14:meMA.C1.acrostic.notice1	
ltx/en_us_oca/me.m03.d14:meMA.C1.acrostic.text	
ltx/en_us_oca/me.m03.d14:meMA.C1.acrostic.title	
ltx/en_us_oca/me.m03.d14:meMA.C1.title	@ltx/en_us_oca/titles:ti.CanonSaintM
ltx/en_us_oca/me.m03.d14:meMA.C1.verse	@ltx/en_us_oca/prayers:pr.verse_DevoutMan.text
ltx/en_us_oca/me.m03.d14:meMA.Kontakion1ger.incipit	…
ltx/en_us_oca/me.m03.d14:meMA.Kontakion1ger.melody	@ltx/en_us_oca/he.a.m8:heAU.TiYpermacho.notmetered
ltx/en_us_oca/me.m03.d14:meMA.Kontakion1ger.mode	@ltx/en_us_oca/miscellanea:misc.Mode8
ltx/en_us_oca/me.m03.d14:meMA.Kontakion1ger.poet	@ltx/en_us_oca/poets:po.Gerasimou
ltx/en_us_oca/me.m03.d14:meMA.Kontakion1ger.text	
ltx/en_us_oca/me.m03.d14:meMA.Ode1C11.greekmelody	@ltx/en_us_oca/he.h.m2:heHE.DefteLaoi.greekname
ltx/en_us_oca/me.m03.d14:meMA.Ode1C11.incipit	…
ltx/en_us_oca/me.m03.d14:meMA.Ode1C11.melody	@ltx/en_us_oca/he.h.m2:heHE.DefteLaoi.notmetered
ltx/en_us_oca/me.m03.d14:meMA.Ode1C11.mode	@ltx/en_us_oca/miscellanea:misc.Mode2
ltx/en_us_oca/me.m03.d14:meMA.Ode1C11.ode	@ltx/en_us_oca/miscellanea:misc.Ode1
ltx/en_us_oca/me.m03.d14:meMA.Ode1C11.text	
ltx/en_us_oca/me.m03.d14:meMA.Ode1C12.incipit	…
ltx/en_us_oca/me.m03.d14:meMA.Ode1C12.melody	@ltx/en_us_oca/he.h.m2:heHE.DefteLaoi.notmetered
ltx/en_us_oca/me.m03.d14:meMA.Ode1C12.mode	@ltx/en_us_oca/miscellanea:misc.Mode2
ltx/en_us_oca/me.m03.d14:meMA.Ode1C12.ode	@ltx/en_us_oca/miscellanea:misc.Ode1
ltx/en_us_oca/me.m03.d14:meMA.Ode1C12.text	
ltx/en_us_oca/me.m03.d14:meMA.Ode1C13.incipit	…
ltx/en_us_oca/me.m03.d14:meMA.Ode1C13.melody	@ltx/en_us_oca/he.h.m2:heHE.DefteLaoi.notmetered
ltx/en_us_oca/me.m03.d14:meMA.Ode1C13.mode	@ltx/en_us_oca/miscellanea:misc.Mode2
ltx/en_us_oca/me.m03.d14:meMA.Ode1C13.ode	@ltx/en_us_oca/miscellanea:misc.Ode1
ltx/en_us_oca/me.m03.d14:meMA.Ode1C13.text	
ltx/en_us_oca/me.m03.d14:meMA.Ode1C1H.greekmelody	@ltx/en_us_oca/he.h.m2:heHE.DefteLaoi.greekname
ltx/en_us_oca/me.m03.d14:meMA.Ode1C1H.incipit	@ltx/en_us_oca/he.h.m2:heHE.DefteLaoi.incipit
ltx/en_us_oca/me.m03.d14:meMA.Ode1C1H.melody	@ltx/en_us_oca/he.h.m2:heHE.DefteLaoi.melody
ltx/en_us_oca/me.m03.d14:meMA.Ode1C1H.mode	@ltx/en_us_oca/miscellanea:misc.Mode2
ltx/en_us_oca/me.m03.d14:meMA.Ode1C1H.ode	@ltx/en_us_oca/miscellanea:misc.Ode1
ltx/en_us_oca/me.m03.d14:meMA.Ode1C1H.text	@ltx/en_us_oca/he.h.m2:heHE.DefteLaoi.text
ltx/en_us_oca/me.m03.d14:meMA.Ode1C1T.incipit	…
ltx/en_us_oca/me.m03.d14:meMA.Ode1C1T.melody	@ltx/en_us_oca/he.h.m2:heHE.DefteLaoi.notmetered
ltx/en_us_oca/me.m03.d14:meMA.Ode1C1T.mode	@ltx/en_us_oca/miscellanea:misc.Mode2
ltx/en_us_oca/me.m03.d14:meMA.Ode1C1T.ode	@ltx/en_us_oca/miscellanea:misc.Ode1
ltx/en_us_oca/me.m03.d14:meMA.Ode1C1T.text	
ltx/en_us_oca/me.m03.d14:meMA.Ode3C11.greekmelody	@ltx/en_us_oca/he.h.m2:heHE.StereosonImasEnSoiKyrie.greekname
ltx/en_us_oca/me.m03.d14:meMA.Ode3C11.incipit	…
ltx/en_us_oca/me.m03.d14:meMA.Ode3C11.melody	@ltx/en_us_oca/he.h.m2:heHE.StereosonImasEnSoiKyrie.notmetered
ltx/en_us_oca/me.m03.d14:meMA.Ode3C11.mode	@ltx/en_us_oca/miscellanea:misc.Mode2
ltx/en_us_oca/me.m03.d14:meMA.Ode3C11.ode	@ltx/en_us_oca/miscellanea:misc.Ode3
ltx/en_us_oca/me.m03.d14:meMA.Ode3C11.text	
ltx/en_us_oca/me.m03.d14:meMA.Ode3C12.incipit	…
ltx/en_us_oca/me.m03.d14:meMA.Ode3C12.melody	@ltx/en_us_oca/he.h.m2:heHE.StereosonImasEnSoiKyrie.notmetered
ltx/en_us_oca/me.m03.d14:meMA.Ode3C12.mode	@ltx/en_us_oca/miscellanea:misc.Mode2
ltx/en_us_oca/me.m03.d14:meMA.Ode3C12.ode	@ltx/en_us_oca/miscellanea:misc.Ode3
ltx/en_us_oca/me.m03.d14:meMA.Ode3C12.text	
ltx/en_us_oca/me.m03.d14:meMA.Ode3C13.incipit	…
ltx/en_us_oca/me.m03.d14:meMA.Ode3C13.melody	@ltx/en_us_oca/he.h.m2:heHE.StereosonImasEnSoiKyrie.notmetered
ltx/en_us_oca/me.m03.d14:meMA.Ode3C13.mode	@ltx/en_us_oca/miscellanea:misc.Mode2
ltx/en_us_oca/me.m03.d14:meMA.Ode3C13.ode	@ltx/en_us_oca/miscellanea:misc.Ode3
ltx/en_us_oca/me.m03.d14:meMA.Ode3C13.text	
ltx/en_us_oca/me.m03.d14:meMA.Ode3C1H.greekmelody	@ltx/en_us_oca/he.h.m2:heHE.StereosonImasEnSoiKyrie.greekname
ltx/en_us_oca/me.m03.d14:meMA.Ode3C1H.incipit	@ltx/en_us_oca/he.h.m2:heHE.StereosonImasEnSoiKyrie.incipit
ltx/en_us_oca/me.m03.d14:meMA.Ode3C1H.melody	@ltx/en_us_oca/he.h.m2:heHE.StereosonImasEnSoiKyrie.melody
ltx/en_us_oca/me.m03.d14:meMA.Ode3C1H.mode	@ltx/en_us_oca/miscellanea:misc.Mode2
ltx/en_us_oca/me.m03.d14:meMA.Ode3C1H.ode	@ltx/en_us_oca/miscellanea:misc.Ode3
ltx/en_us_oca/me.m03.d14:meMA.Ode3C1H.text	@ltx/en_us_oca/he.h.m2:heHE.StereosonImasEnSoiKyrie.text
ltx/en_us_oca/me.m03.d14:meMA.Ode3C1T.incipit	…
ltx/en_us_oca/me.m03.d14:meMA.Ode3C1T.melody	@ltx/en_us_oca/he.h.m2:heHE.StereosonImasEnSoiKyrie.notmetered
ltx/en_us_oca/me.m03.d14:meMA.Ode3C1T.mode	@ltx/en_us_oca/miscellanea:misc.Mode2
ltx/en_us_oca/me.m03.d14:meMA.Ode3C1T.ode	@ltx/en_us_oca/miscellanea:misc.Ode3
ltx/en_us_oca/me.m03.d14:meMA.Ode3C1T.text	
ltx/en_us_oca/me.m03.d14:meMA.Ode3Kathisma1.greekmelody	@ltx/en_us_oca/he.a.m1:heAU.TouLithouSfragisthentos.greekname
ltx/en_us_oca/me.m03.d14:meMA.Ode3Kathisma1.incipit	…
ltx/en_us_oca/me.m03.d14:meMA.Ode3Kathisma1.melody	@ltx/en_us_oca/he.a.m1:heAU.TouLithouSfragisthentos.notmetered
ltx/en_us_oca/me.m03.d14:meMA.Ode3Kathisma1.mode	@ltx/en_us_oca/miscellanea:misc.Mode1
ltx/en_us_oca/me.m03.d14:meMA.Ode3Kathisma1.text	
ltx/en_us_oca/me.m03.d14:meMA.Ode3KathismaSt.incipit	…
ltx/en_us_oca/me.m03.d14:meMA.Ode3KathismaSt.melody	@ltx/en_us_oca/he.a.m1:heAU.TouLithouSfragisthentos.notmetered
ltx/en_us_oca/me.m03.d14:meMA.Ode3KathismaSt.mode	@ltx/en_us_oca/miscellanea:misc.Mode1
ltx/en_us_oca/me.m03.d14:meMA.Ode3KathismaSt.text	
ltx/en_us_oca/me.m03.d14:meMA.Ode3KathismaT.incipit	@ltx/en_us_oca/me.m02.d13:meMA.Ode3KathismaT.incipit
ltx/en_us_oca/me.m03.d14:meMA.Ode3KathismaT.melody	@ltx/en_us_oca/he.a.m1:heAU.TouLithouSfragisthentos.notmetered
ltx/en_us_oca/me.m03.d14:meMA.Ode3KathismaT.mode	@ltx/en_us_oca/miscellanea:misc.Mode1
ltx/en_us_oca/me.m03.d14:meMA.Ode3KathismaT.text	@ltx/en_us_oca/me.m02.d13:meMA.Ode3KathismaT.text
ltx/en_us_oca/me.m03.d14:meMA.Ode4C11.greekmelody	@ltx/en_us_oca/he.h.m2:heHE.YmnoSeAkoi.greekname
ltx/en_us_oca/me.m03.d14:meMA.Ode4C11.incipit	…
ltx/en_us_oca/me.m03.d14:meMA.Ode4C11.melody	@ltx/en_us_oca/he.h.m2:heHE.YmnoSeAkoi.notmetered
ltx/en_us_oca/me.m03.d14:meMA.Ode4C11.mode	@ltx/en_us_oca/miscellanea:misc.Mode2
ltx/en_us_oca/me.m03.d14:meMA.Ode4C11.ode	@ltx/en_us_oca/miscellanea:misc.Ode4
ltx/en_us_oca/me.m03.d14:meMA.Ode4C11.text	
ltx/en_us_oca/me.m03.d14:meMA.Ode4C12.incipit	…
ltx/en_us_oca/me.m03.d14:meMA.Ode4C12.melody	@ltx/en_us_oca/he.h.m2:heHE.YmnoSeAkoi.notmetered
ltx/en_us_oca/me.m03.d14:meMA.Ode4C12.mode	@ltx/en_us_oca/miscellanea:misc.Mode2
ltx/en_us_oca/me.m03.d14:meMA.Ode4C12.ode	@ltx/en_us_oca/miscellanea:misc.Ode4
ltx/en_us_oca/me.m03.d14:meMA.Ode4C12.text	
ltx/en_us_oca/me.m03.d14:meMA.Ode4C13.incipit	…
ltx/en_us_oca/me.m03.d14:meMA.Ode4C13.melody	@ltx/en_us_oca/he.h.m2:heHE.YmnoSeAkoi.notmetered
ltx/en_us_oca/me.m03.d14:meMA.Ode4C13.mode	@ltx/en_us_oca/miscellanea:misc.Mode2
ltx/en_us_oca/me.m03.d14:meMA.Ode4C13.ode	@ltx/en_us_oca/miscellanea:misc.Ode4
ltx/en_us_oca/me.m03.d14:meMA.Ode4C13.text	
ltx/en_us_oca/me.m03.d14:meMA.Ode4C1H.greekmelody	@ltx/en_us_oca/he.h.m2:heHE.YmnoSeAkoi.greekname
ltx/en_us_oca/me.m03.d14:meMA.Ode4C1H.incipit	@ltx/en_us_oca/he.h.m2:heHE.YmnoSeAkoi.incipit
ltx/en_us_oca/me.m03.d14:meMA.Ode4C1H.melody	@ltx/en_us_oca/he.h.m2:heHE.YmnoSeAkoi.melody
ltx/en_us_oca/me.m03.d14:meMA.Ode4C1H.mode	@ltx/en_us_oca/miscellanea:misc.Mode2
ltx/en_us_oca/me.m03.d14:meMA.Ode4C1H.ode	@ltx/en_us_oca/miscellanea:misc.Ode4
ltx/en_us_oca/me.m03.d14:meMA.Ode4C1H.text	@ltx/en_us_oca/he.h.m2:heHE.YmnoSeAkoi.text
ltx/en_us_oca/me.m03.d14:meMA.Ode4C1T.incipit	…
ltx/en_us_oca/me.m03.d14:meMA.Ode4C1T.melody	@ltx/en_us_oca/he.h.m2:heHE.YmnoSeAkoi.notmetered
ltx/en_us_oca/me.m03.d14:meMA.Ode4C1T.mode	@ltx/en_us_oca/miscellanea:misc.Mode2
ltx/en_us_oca/me.m03.d14:meMA.Ode4C1T.ode	@ltx/en_us_oca/miscellanea:misc.Ode4
ltx/en_us_oca/me.m03.d14:meMA.Ode4C1T.text	
ltx/en_us_oca/me.m03.d14:meMA.Ode5C11.greekmelody	@ltx/en_us_oca/he.h.m2:heHE.OTouFotosChorigos.greekname
ltx/en_us_oca/me.m03.d14:meMA.Ode5C11.incipit	…
ltx/en_us_oca/me.m03.d14:meMA.Ode5C11.melody	@ltx/en_us_oca/he.h.m2:heHE.OTouFotosChorigos.notmetered
ltx/en_us_oca/me.m03.d14:meMA.Ode5C11.mode	@ltx/en_us_oca/miscellanea:misc.Mode2
ltx/en_us_oca/me.m03.d14:meMA.Ode5C11.ode	@ltx/en_us_oca/miscellanea:misc.Ode5
ltx/en_us_oca/me.m03.d14:meMA.Ode5C11.text	
ltx/en_us_oca/me.m03.d14:meMA.Ode5C12.incipit	…
ltx/en_us_oca/me.m03.d14:meMA.Ode5C12.melody	@ltx/en_us_oca/he.h.m2:heHE.OTouFotosChorigos.notmetered
ltx/en_us_oca/me.m03.d14:meMA.Ode5C12.mode	@ltx/en_us_oca/miscellanea:misc.Mode2
ltx/en_us_oca/me.m03.d14:meMA.Ode5C12.ode	@ltx/en_us_oca/miscellanea:misc.Ode5
ltx/en_us_oca/me.m03.d14:meMA.Ode5C12.text	
ltx/en_us_oca/me.m03.d14:meMA.Ode5C13.incipit	…
ltx/en_us_oca/me.m03.d14:meMA.Ode5C13.melody	@ltx/en_us_oca/he.h.m2:heHE.OTouFotosChorigos.notmetered
ltx/en_us_oca/me.m03.d14:meMA.Ode5C13.mode	@ltx/en_us_oca/miscellanea:misc.Mode2
ltx/en_us_oca/me.m03.d14:meMA.Ode5C13.ode	@ltx/en_us_oca/miscellanea:misc.Ode5
ltx/en_us_oca/me.m03.d14:meMA.Ode5C13.text	
ltx/en_us_oca/me.m03.d14:meMA.Ode5C1H.greekmelody	@ltx/en_us_oca/he.h.m2:heHE.OTouFotosChorigos.greekname
ltx/en_us_oca/me.m03.d14:meMA.Ode5C1H.incipit	@ltx/en_us_oca/he.h.m2:heHE.OTouFotosChorigos.incipit
ltx/en_us_oca/me.m03.d14:meMA.Ode5C1H.melody	@ltx/en_us_oca/he.h.m2:heHE.OTouFotosChorigos.melody
ltx/en_us_oca/me.m03.d14:meMA.Ode5C1H.mode	@ltx/en_us_oca/miscellanea:misc.Mode2
ltx/en_us_oca/me.m03.d14:meMA.Ode5C1H.ode	@ltx/en_us_oca/miscellanea:misc.Ode5
ltx/en_us_oca/me.m03.d14:meMA.Ode5C1H.text	@ltx/en_us_oca/he.h.m2:heHE.OTouFotosChorigos.text
ltx/en_us_oca/me.m03.d14:meMA.Ode5C1T.incipit	…
ltx/en_us_oca/me.m03.d14:meMA.Ode5C1T.melody	@ltx/en_us_oca/he.h.m2:heHE.OTouFotosChorigos.notmetered
ltx/en_us_oca/me.m03.d14:meMA.Ode5C1T.mode	@ltx/en_us_oca/miscellanea:misc.Mode2
ltx/en_us_oca/me.m03.d14:meMA.Ode5C1T.ode	@ltx/en_us_oca/miscellanea:misc.Ode5
ltx/en_us_oca/me.m03.d14:meMA.Ode5C1T.text	
ltx/en_us_oca/me.m03.d14:meMA.Ode6C11.greekmelody	@ltx/en_us_oca/he.h.m2:heHE.EnAvyssoPtaismaton.greekname
ltx/en_us_oca/me.m03.d14:meMA.Ode6C11.incipit	…
ltx/en_us_oca/me.m03.d14:meMA.Ode6C11.melody	@ltx/en_us_oca/he.h.m2:heHE.EnAvyssoPtaismaton.notmetered
ltx/en_us_oca/me.m03.d14:meMA.Ode6C11.mode	@ltx/en_us_oca/miscellanea:misc.Mode2
ltx/en_us_oca/me.m03.d14:meMA.Ode6C11.ode	@ltx/en_us_oca/miscellanea:misc.Ode6
ltx/en_us_oca/me.m03.d14:meMA.Ode6C11.text	
ltx/en_us_oca/me.m03.d14:meMA.Ode6C12.incipit	…
ltx/en_us_oca/me.m03.d14:meMA.Ode6C12.melody	@ltx/en_us_oca/he.h.m2:heHE.EnAvyssoPtaismaton.notmetered
ltx/en_us_oca/me.m03.d14:meMA.Ode6C12.mode	@ltx/en_us_oca/miscellanea:misc.Mode2
ltx/en_us_oca/me.m03.d14:meMA.Ode6C12.ode	@ltx/en_us_oca/miscellanea:misc.Ode6
ltx/en_us_oca/me.m03.d14:meMA.Ode6C12.text	
ltx/en_us_oca/me.m03.d14:meMA.Ode6C13.incipit	…
ltx/en_us_oca/me.m03.d14:meMA.Ode6C13.melody	@ltx/en_us_oca/he.h.m2:heHE.EnAvyssoPtaismaton.notmetered
ltx/en_us_oca/me.m03.d14:meMA.Ode6C13.mode	@ltx/en_us_oca/miscellanea:misc.Mode2
ltx/en_us_oca/me.m03.d14:meMA.Ode6C13.ode	@ltx/en_us_oca/miscellanea:misc.Ode6
ltx/en_us_oca/me.m03.d14:meMA.Ode6C13.text	
ltx/en_us_oca/me.m03.d14:meMA.Ode6C1H.greekmelody	@ltx/en_us_oca/he.h.m2:heHE.EnAvyssoPtaismaton.greekname
ltx/en_us_oca/me.m03.d14:meMA.Ode6C1H.incipit	@ltx/en_us_oca/he.h.m2:heHE.EnAvyssoPtaismaton.incipit
ltx/en_us_oca/me.m03.d14:meMA.Ode6C1H.melody	@ltx/en_us_oca/he.h.m2:heHE.EnAvyssoPtaismaton.melody
ltx/en_us_oca/me.m03.d14:meMA.Ode6C1H.mode	@ltx/en_us_oca/miscellanea:misc.Mode2
ltx/en_us_oca/me.m03.d14:meMA.Ode6C1H.ode	@ltx/en_us_oca/miscellanea:misc.Ode6
ltx/en_us_oca/me.m03.d14:meMA.Ode6C1H.text	@ltx/en_us_oca/he.h.m2:heHE.EnAvyssoPtaismaton.text
ltx/en_us_oca/me.m03.d14:meMA.Ode6C1T.incipit	…
ltx/en_us_oca/me.m03.d14:meMA.Ode6C1T.melody	@ltx/en_us_oca/he.h.m2:heHE.EnAvyssoPtaismaton.notmetered
ltx/en_us_oca/me.m03.d14:meMA.Ode6C1T.mode	@ltx/en_us_oca/miscellanea:misc.Mode2
ltx/en_us_oca/me.m03.d14:meMA.Ode6C1T.ode	@ltx/en_us_oca/miscellanea:misc.Ode6
ltx/en_us_oca/me.m03.d14:meMA.Ode6C1T.text	
ltx/en_us_oca/me.m03.d14:meMA.Ode7C11.greekmelody	@ltx/en_us_oca/he.h.m2:heHE.RitoresAnedeichthisanPaides.greekname
ltx/en_us_oca/me.m03.d14:meMA.Ode7C11.incipit	…
ltx/en_us_oca/me.m03.d14:meMA.Ode7C11.melody	@ltx/en_us_oca/he.h.m2:heHE.RitoresAnedeichthisanPaides.notmetered
ltx/en_us_oca/me.m03.d14:meMA.Ode7C11.mode	@ltx/en_us_oca/miscellanea:misc.Mode2
ltx/en_us_oca/me.m03.d14:meMA.Ode7C11.ode	@ltx/en_us_oca/miscellanea:misc.Ode7
ltx/en_us_oca/me.m03.d14:meMA.Ode7C11.text	
ltx/en_us_oca/me.m03.d14:meMA.Ode7C12.incipit	…
ltx/en_us_oca/me.m03.d14:meMA.Ode7C12.melody	@ltx/en_us_oca/he.h.m2:heHE.RitoresAnedeichthisanPaides.notmetered
ltx/en_us_oca/me.m03.d14:meMA.Ode7C12.mode	@ltx/en_us_oca/miscellanea:misc.Mode2
ltx/en_us_oca/me.m03.d14:meMA.Ode7C12.ode	@ltx/en_us_oca/miscellanea:misc.Ode7
ltx/en_us_oca/me.m03.d14:meMA.Ode7C12.text	
ltx/en_us_oca/me.m03.d14:meMA.Ode7C13.incipit	…
ltx/en_us_oca/me.m03.d14:meMA.Ode7C13.melody	@ltx/en_us_oca/he.h.m2:heHE.RitoresAnedeichthisanPaides.notmetered
ltx/en_us_oca/me.m03.d14:meMA.Ode7C13.mode	@ltx/en_us_oca/miscellanea:misc.Mode2
ltx/en_us_oca/me.m03.d14:meMA.Ode7C13.ode	@ltx/en_us_oca/miscellanea:misc.Ode7
ltx/en_us_oca/me.m03.d14:meMA.Ode7C13.text	
ltx/en_us_oca/me.m03.d14:meMA.Ode7C1H.greekmelody	@ltx/en_us_oca/he.h.m2:heHE.RitoresAnedeichthisanPaides.greekname
ltx/en_us_oca/me.m03.d14:meMA.Ode7C1H.incipit	@ltx/en_us_oca/he.h.m2:heHE.RitoresAnedeichthisanPaides.incipit
ltx/en_us_oca/me.m03.d14:meMA.Ode7C1H.melody	@ltx/en_us_oca/he.h.m2:heHE.RitoresAnedeichthisanPaides.melody
ltx/en_us_oca/me.m03.d14:meMA.Ode7C1H.mode	@ltx/en_us_oca/miscellanea:misc.Mode2
ltx/en_us_oca/me.m03.d14:meMA.Ode7C1H.ode	@ltx/en_us_oca/miscellanea:misc.Ode7
ltx/en_us_oca/me.m03.d14:meMA.Ode7C1H.text	@ltx/en_us_oca/he.h.m2:heHE.RitoresAnedeichthisanPaides.text
ltx/en_us_oca/me.m03.d14:meMA.Ode7C1T.incipit	…
ltx/en_us_oca/me.m03.d14:meMA.Ode7C1T.melody	@ltx/en_us_oca/he.h.m2:heHE.RitoresAnedeichthisanPaides.notmetered
ltx/en_us_oca/me.m03.d14:meMA.Ode7C1T.mode	@ltx/en_us_oca/miscellanea:misc.Mode2
ltx/en_us_oca/me.m03.d14:meMA.Ode7C1T.ode	@ltx/en_us_oca/miscellanea:misc.Ode7
ltx/en_us_oca/me.m03.d14:meMA.Ode7C1T.text	
ltx/en_us_oca/me.m03.d14:meMA.Ode8C11.greekmelody	@ltx/en_us_oca/he.h.m2:heHE.TonEnKaminoTouPyros.greekname
ltx/en_us_oca/me.m03.d14:meMA.Ode8C11.incipit	…
ltx/en_us_oca/me.m03.d14:meMA.Ode8C11.melody	@ltx/en_us_oca/he.h.m2:heHE.TonEnKaminoTouPyros.notmetered
ltx/en_us_oca/me.m03.d14:meMA.Ode8C11.mode	@ltx/en_us_oca/miscellanea:misc.Mode2
ltx/en_us_oca/me.m03.d14:meMA.Ode8C11.ode	@ltx/en_us_oca/miscellanea:misc.Ode8
ltx/en_us_oca/me.m03.d14:meMA.Ode8C11.text	
ltx/en_us_oca/me.m03.d14:meMA.Ode8C12.incipit	…
ltx/en_us_oca/me.m03.d14:meMA.Ode8C12.melody	@ltx/en_us_oca/he.h.m2:heHE.TonEnKaminoTouPyros.notmetered
ltx/en_us_oca/me.m03.d14:meMA.Ode8C12.mode	@ltx/en_us_oca/miscellanea:misc.Mode2
ltx/en_us_oca/me.m03.d14:meMA.Ode8C12.ode	@ltx/en_us_oca/miscellanea:misc.Ode8
ltx/en_us_oca/me.m03.d14:meMA.Ode8C12.text	
ltx/en_us_oca/me.m03.d14:meMA.Ode8C13.incipit	…
ltx/en_us_oca/me.m03.d14:meMA.Ode8C13.melody	@ltx/en_us_oca/he.h.m2:heHE.TonEnKaminoTouPyros.notmetered
ltx/en_us_oca/me.m03.d14:meMA.Ode8C13.mode	@ltx/en_us_oca/miscellanea:misc.Mode2
ltx/en_us_oca/me.m03.d14:meMA.Ode8C13.ode	@ltx/en_us_oca/miscellanea:misc.Ode8
ltx/en_us_oca/me.m03.d14:meMA.Ode8C13.text	
ltx/en_us_oca/me.m03.d14:meMA.Ode8C1H.greekmelody	@ltx/en_us_oca/he.h.m2:heHE.TonEnKaminoTouPyros.greekname
ltx/en_us_oca/me.m03.d14:meMA.Ode8C1H.incipit	@ltx/en_us_oca/he.h.m2:heHE.TonEnKaminoTouPyros.incipit
ltx/en_us_oca/me.m03.d14:meMA.Ode8C1H.melody	@ltx/en_us_oca/he.h.m2:heHE.TonEnKaminoTouPyros.melody
ltx/en_us_oca/me.m03.d14:meMA.Ode8C1H.mode	@ltx/en_us_oca/miscellanea:misc.Mode2
ltx/en_us_oca/me.m03.d14:meMA.Ode8C1H.ode	@ltx/en_us_oca/miscellanea:misc.Ode8
ltx/en_us_oca/me.m03.d14:meMA.Ode8C1H.text	@ltx/en_us_oca/he.h.m2:heHE.TonEnKaminoTouPyros.text
ltx/en_us_oca/me.m03.d14:meMA.Ode8C1T.incipit	…
ltx/en_us_oca/me.m03.d14:meMA.Ode8C1T.melody	@ltx/en_us_oca/he.h.m2:heHE.TonEnKaminoTouPyros.notmetered
ltx/en_us_oca/me.m03.d14:meMA.Ode8C1T.mode	@ltx/en_us_oca/miscellanea:misc.Mode2
ltx/en_us_oca/me.m03.d14:meMA.Ode8C1T.ode	@ltx/en_us_oca/miscellanea:misc.Ode8
ltx/en_us_oca/me.m03.d14:meMA.Ode8C1T.text	
ltx/en_us_oca/me.m03.d14:meMA.Ode9C11.greekmelody	@ltx/en_us_oca/he.h.m2:heHE.TonEkTheouTheonLogon.greekname
ltx/en_us_oca/me.m03.d14:meMA.Ode9C11.incipit	…
ltx/en_us_oca/me.m03.d14:meMA.Ode9C11.melody	@ltx/en_us_oca/he.h.m2:heHE.TonEkTheouTheonLogon.notmetered
ltx/en_us_oca/me.m03.d14:meMA.Ode9C11.mode	@ltx/en_us_oca/miscellanea:misc.Mode2
ltx/en_us_oca/me.m03.d14:meMA.Ode9C11.ode	@ltx/en_us_oca/miscellanea:misc.Ode9
ltx/en_us_oca/me.m03.d14:meMA.Ode9C11.text	
ltx/en_us_oca/me.m03.d14:meMA.Ode9C12.incipit	…
ltx/en_us_oca/me.m03.d14:meMA.Ode9C12.melody	@ltx/en_us_oca/he.h.m2:heHE.TonEkTheouTheonLogon.notmetered
ltx/en_us_oca/me.m03.d14:meMA.Ode9C12.mode	@ltx/en_us_oca/miscellanea:misc.Mode2
ltx/en_us_oca/me.m03.d14:meMA.Ode9C12.ode	@ltx/en_us_oca/miscellanea:misc.Ode9
ltx/en_us_oca/me.m03.d14:meMA.Ode9C12.text	
ltx/en_us_oca/me.m03.d14:meMA.Ode9C13.incipit	…
ltx/en_us_oca/me.m03.d14:meMA.Ode9C13.melody	@ltx/en_us_oca/he.h.m2:heHE.TonEkTheouTheonLogon.notmetered
ltx/en_us_oca/me.m03.d14:meMA.Ode9C13.mode	@ltx/en_us_oca/miscellanea:misc.Mode2
ltx/en_us_oca/me.m03.d14:meMA.Ode9C13.ode	@ltx/en_us_oca/miscellanea:misc.Ode9
ltx/en_us_oca/me.m03.d14:meMA.Ode9C13.text	
ltx/en_us_oca/me.m03.d14:meMA.Ode9C1H.greekmelody	@ltx/en_us_oca/he.h.m2:heHE.TonEkTheouTheonLogon.greekname
ltx/en_us_oca/me.m03.d14:meMA.Ode9C1H.incipit	@ltx/en_us_oca/he.h.m2:heHE.TonEkTheouTheonLogon.incipit
ltx/en_us_oca/me.m03.d14:meMA.Ode9C1H.melody	@ltx/en_us_oca/he.h.m2:heHE.TonEkTheouTheonLogon.melody
ltx/en_us_oca/me.m03.d14:meMA.Ode9C1H.mode	@ltx/en_us_oca/miscellanea:misc.Mode2
ltx/en_us_oca/me.m03.d14:meMA.Ode9C1H.ode	@ltx/en_us_oca/miscellanea:misc.Ode9
ltx/en_us_oca/me.m03.d14:meMA.Ode9C1H.text	@ltx/en_us_oca/he.h.m2:heHE.TonEkTheouTheonLogon.text
ltx/en_us_oca/me.m03.d14:meMA.Ode9C1T.incipit	…
ltx/en_us_oca/me.m03.d14:meMA.Ode9C1T.melody	@ltx/en_us_oca/he.h.m2:heHE.TonEkTheouTheonLogon.notmetered
ltx/en_us_oca/me.m03.d14:meMA.Ode9C1T.mode	@ltx/en_us_oca/miscellanea:misc.Mode2
ltx/en_us_oca/me.m03.d14:meMA.Ode9C1T.ode	@ltx/en_us_oca/miscellanea:misc.Ode9
ltx/en_us_oca/me.m03.d14:meMA.Ode9C1T.text	
ltx/en_us_oca/me.m03.d14:meVE.Apolytikion1ger.greekmelody	@ltx/en_us_oca/he.a.m1:heAU.TisErimouPolitis.greekname
ltx/en_us_oca/me.m03.d14:meVE.Apolytikion1ger.incipit	…
ltx/en_us_oca/me.m03.d14:meVE.Apolytikion1ger.melody	@ltx/en_us_oca/he.a.m1:heAU.TisErimouPolitis.notmetered
ltx/en_us_oca/me.m03.d14:meVE.Apolytikion1ger.mode	@ltx/en_us_oca/miscellanea:misc.Mode1
ltx/en_us_oca/me.m03.d14:meVE.Apolytikion1ger.poet	@ltx/en_us_oca/poets:po.Gerasimou
ltx/en_us_oca/me.m03.d14:meVE.Apolytikion1ger.text	
ltx/en_us_oca/me.m03.d14:meVE.SticStavrotheotokion.greekmelody	@ltx/en_us_oca/he.a.m2:heAU.OteEkTouXylou.greekname
ltx/en_us_oca/me.m03.d14:meVE.SticStavrotheotokion.incipit	@ltx/en_us_oca/oc.m2.d6:ocMA.AposTheotokion.incipit
ltx/en_us_oca/me.m03.d14:meVE.SticStavrotheotokion.melody	@ltx/en_us_oca/he.a.m2:heAU.OteEkTouXylou.notmetered
ltx/en_us_oca/me.m03.d14:meVE.SticStavrotheotokion.mode	@ltx/en_us_oca/miscellanea:misc.Mode2
ltx/en_us_oca/me.m03.d14:meVE.SticStavrotheotokion.text	@ltx/en_us_oca/oc.m2.d6:ocMA.AposTheotokion.text
ltx/en_us_oca/me.m03.d14:meVE.SticTheotokion.greekmelody	@ltx/en_us_oca/he.a.m2:heAU.OteEkTouXylou.greekname
ltx/en_us_oca/me.m03.d14:meVE.SticTheotokion.incipit	…
ltx/en_us_oca/me.m03.d14:meVE.SticTheotokion.melody	@ltx/en_us_oca/he.a.m2:heAU.OteEkTouXylou.notmetered
ltx/en_us_oca/me.m03.d14:meVE.SticTheotokion.mode	@ltx/en_us_oca/miscellanea:misc.Mode2
ltx/en_us_oca/me.m03.d14:meVE.SticTheotokion.text	
ltx/en_us_oca/me.m03.d14:meVE.Stichera01.greekmelody	@ltx/en_us_oca/he.a.m2:heAU.OteEkTouXylou.greekname
ltx/en_us_oca/me.m03.d14:meVE.Stichera01.incipit	Father, you denied the world…
ltx/en_us_oca/me.m03.d14:meVE.Stichera01.melody	@ltx/en_us_oca/he.a.m2:heAU.OteEkTouXylou.notmetered
ltx/en_us_oca/me.m03.d14:meVE.Stichera01.mode	@ltx/en_us_oca/miscellanea:misc.Mode2
ltx/en_us_oca/me.m03.d14:meVE.Stichera01.text	Father, you denied the world from your youth. ⁄ You were joyful with true faith and love ⁄ as you followed the crucified Christ! ⁄ You mortified your flesh through many tasks of obedience ⁄ and received richly the gift of healing: ⁄ You alleviated various illnesses and drove out evil spirits ⁄⁄ to their great astonishment!
ltx/en_us_oca/me.m03.d14:meVE.Stichera02.incipit	You were the adornment of…
ltx/en_us_oca/me.m03.d14:meVE.Stichera02.melody	@ltx/en_us_oca/he.a.m2:heAU.OteEkTouXylou.notmetered
ltx/en_us_oca/me.m03.d14:meVE.Stichera02.mode	@ltx/en_us_oca/miscellanea:misc.Mode2
ltx/en_us_oca/me.m03.d14:meVE.Stichera02.text	You were the adornment of monastics, Benedict, ⁄ assembling a countless multitude to hymn the Lord. ⁄ You guided the steps of all to heaven ⁄ who rightly followed your divine teachings ⁄ and imitated your virtuous life, Father! ⁄ With them, we fittingly honor you, ⁄⁄ rejoicing in your dormition.
ltx/en_us_oca/me.m03.d14:meVE.Stichera03.incipit	You called down rain from…
ltx/en_us_oca/me.m03.d14:meVE.Stichera03.melody	@ltx/en_us_oca/he.a.m2:heAU.OteEkTouXylou.notmetered
ltx/en_us_oca/me.m03.d14:meVE.Stichera03.mode	@ltx/en_us_oca/miscellanea:misc.Mode2
ltx/en_us_oca/me.m03.d14:meVE.Stichera03.text	You called down rain from the skies, Father, by your divine prayers, ⁄ like Elijah of old! ⁄ You caused a vessel to pour forth with oil, venerable one; ⁄ you raised the dead and worked many other miracles ⁄ to the glory of the God and Savior of all! ⁄⁄ Therefore with love we celebrate your glorious memory, Benedict!
