ltx/en_us_oca/me.m02.d02:meDA.commemoration.first	
ltx/en_us_oca/me.m02.d02:meDA.commemoration.first_name	
ltx/en_us_oca/me.m02.d02:meDA.commemoration.first_short	
ltx/en_us_oca/me.m02.d02:meDA.commemoration.first_title	
ltx/en_us_oca/me.m02.d02:meDA.commemoration.full	
ltx/en_us_oca/me.m02.d02:meDA.commemoration.second_name	
ltx/en_us_oca/me.m02.d02:meDA.commemoration.second_title	
ltx/en_us_oca/me.m02.d02:meDA.date	
ltx/en_us_oca/me.m02.d02:meDA.dismissal	@ltx/en_us_oca/dismissals:dis00.meeting
ltx/en_us_oca/me.m02.d02:meDA.fordate	
ltx/en_us_oca/me.m02.d02:meDA.insert1	
ltx/en_us_oca/me.m02.d02:meDA.insert2	
ltx/en_us_oca/me.m02.d02:meDA.note	
ltx/en_us_oca/me.m02.d02:meDA.pdfcoverdate	
ltx/en_us_oca/me.m02.d02:meDA.pdfheaderdate	
ltx/en_us_oca/me.m02.d02:meHO.commemorations	
ltx/en_us_oca/me.m02.d02:meHO.note1	
ltx/en_us_oca/me.m02.d02:meHO.note2	
ltx/en_us_oca/me.m02.d02:meHO.number	
ltx/en_us_oca/me.m02.d02:meHO.rank	
ltx/en_us_oca/me.m02.d02:meLE.commemoration1	
ltx/en_us_oca/me.m02.d02:meLE.commemoration2	
ltx/en_us_oca/me.m02.d02:meLI.Kontakion1.incipit	@ltx/en_us_oca/me.m02.d02:meMA.Kontakion1.incipit
ltx/en_us_oca/me.m02.d02:meLI.Kontakion1.melody	@ltx/en_us_oca/me.m02.d02:meMA.Kontakion1.melody
ltx/en_us_oca/me.m02.d02:meLI.Kontakion1.mode	@ltx/en_us_oca/me.m02.d02:meMA.Kontakion1.mode
ltx/en_us_oca/me.m02.d02:meLI.Kontakion1.text	@ltx/en_us_oca/me.m02.d02:meMA.Kontakion1.text
ltx/en_us_oca/me.m02.d02:meLI.MM.EntranceHymn.text	
ltx/en_us_oca/me.m02.d02:meLI.MM.EntranceHymnSunday.text	
ltx/en_us_oca/me.m02.d02:meLI.Megalynarion.text	
ltx/en_us_oca/me.m02.d02:meLI.TheotokosHymn.incipit	@ltx/en_us_oca/he.h.m3:heHE.EnNomoSkia.incipit
ltx/en_us_oca/me.m02.d02:meLI.TheotokosHymn.mode	@ltx/en_us_oca/miscellanea:misc.Mode3
ltx/en_us_oca/me.m02.d02:meLI.TheotokosHymn.text	@ltx/en_us_oca/he.h.m3:heHE.EnNomoSkia.text
ltx/en_us_oca/me.m02.d02:meLI.TheotokosHymnVerse.incipit	@ltx/en_us_oca/me.m02.d02:meMA.Ode9C1MTh.incipit
ltx/en_us_oca/me.m02.d02:meLI.TheotokosHymnVerse.text	@ltx/en_us_oca/me.m02.d02:meMA.Ode9C1MTh.text
ltx/en_us_oca/me.m02.d02:meMA.C1.acrostic.notice1	
ltx/en_us_oca/me.m02.d02:meMA.C1.acrostic.text	
ltx/en_us_oca/me.m02.d02:meMA.C1.acrostic.title	
ltx/en_us_oca/me.m02.d02:meMA.C1.poet	@ltx/en_us_oca/poets:po.KosmaMonachou
ltx/en_us_oca/me.m02.d02:meMA.C1.title	@ltx/en_us_oca/titles:ti.CanonFeast
ltx/en_us_oca/me.m02.d02:meMA.C1.verse	@ltx/en_us_oca/prayers:pr.verse_God.text
ltx/en_us_oca/me.m02.d02:meMA.Exaposteilarion1.greekmelody	@ltx/en_us_oca/he.a.m3:heAU.EnPnevmatiToIero.greekname
ltx/en_us_oca/me.m02.d02:meMA.Exaposteilarion1.incipit	@ltx/en_us_oca/he.a.m3:heAU.EnPnevmatiToIero.incipit
ltx/en_us_oca/me.m02.d02:meMA.Exaposteilarion1.melody	@ltx/en_us_oca/he.a.m3:heAU.EnPnevmatiToIero.melody
ltx/en_us_oca/me.m02.d02:meMA.Exaposteilarion1.mode	@ltx/en_us_oca/miscellanea:misc.Mode3
ltx/en_us_oca/me.m02.d02:meMA.Exaposteilarion1.text	@ltx/en_us_oca/he.a.m3:heAU.EnPnevmatiToIero.text
ltx/en_us_oca/me.m02.d02:meMA.Kathisma11.greekmelody	@ltx/en_us_oca/he.a.m1:heAU.ChorosAngelikos.greekname
ltx/en_us_oca/me.m02.d02:meMA.Kathisma11.incipit	@ltx/en_us_oca/he.a.m1:heAU.ChorosAngelikos.incipit
ltx/en_us_oca/me.m02.d02:meMA.Kathisma11.melody	@ltx/en_us_oca/he.a.m1:heAU.ChorosAngelikos.name
ltx/en_us_oca/me.m02.d02:meMA.Kathisma11.mode	@ltx/en_us_oca/miscellanea:misc.Mode1
ltx/en_us_oca/me.m02.d02:meMA.Kathisma11.text	@ltx/en_us_oca/he.a.m1:heAU.ChorosAngelikos.text
ltx/en_us_oca/me.m02.d02:meMA.Kathisma21.greekmelody	@ltx/en_us_oca/he.a.m1:heAU.TonTafonSouSotir.greekname
ltx/en_us_oca/me.m02.d02:meMA.Kathisma21.incipit	…
ltx/en_us_oca/me.m02.d02:meMA.Kathisma21.melody	@ltx/en_us_oca/he.a.m1:heAU.TonTafonSouSotir.notmetered
ltx/en_us_oca/me.m02.d02:meMA.Kathisma21.mode	@ltx/en_us_oca/miscellanea:misc.Mode1
ltx/en_us_oca/me.m02.d02:meMA.Kathisma21.text	
ltx/en_us_oca/me.m02.d02:meMA.Kathisma31.greekmelody	@ltx/en_us_oca/he.a.m4:heAU.KateplagiIosif.greekname
ltx/en_us_oca/me.m02.d02:meMA.Kathisma31.incipit	…
ltx/en_us_oca/me.m02.d02:meMA.Kathisma31.melody	@ltx/en_us_oca/he.a.m4:heAU.KateplagiIosif.notmetered
ltx/en_us_oca/me.m02.d02:meMA.Kathisma31.mode	@ltx/en_us_oca/miscellanea:misc.Mode4
ltx/en_us_oca/me.m02.d02:meMA.Kathisma31.text	
ltx/en_us_oca/me.m02.d02:meMA.Kontakion1.incipit	By Your Nativity…
ltx/en_us_oca/me.m02.d02:meMA.Kontakion1.melody	
ltx/en_us_oca/me.m02.d02:meMA.Kontakion1.mode	@ltx/en_us_oca/miscellanea:misc.Mode1
ltx/en_us_oca/me.m02.d02:meMA.Kontakion1.text	By Your Nativity, You sanctified the Virgin’s womb, ⁄ and blessed Simeon’s hands, O Christ God. ⁄ Now You have come and saved us through love. ⁄⁄ Grant peace to all Orthodox Christians, only Lover of mankind!
ltx/en_us_oca/me.m02.d02:meMA.Lauds1.greekmelody	@ltx/en_us_oca/he.a.m4:heAU.EdokasSimeiosin.greekname
ltx/en_us_oca/me.m02.d02:meMA.Lauds1.incipit	…
ltx/en_us_oca/me.m02.d02:meMA.Lauds1.melody	@ltx/en_us_oca/he.a.m4:heAU.EdokasSimeiosin.notmetered
ltx/en_us_oca/me.m02.d02:meMA.Lauds1.mode	@ltx/en_us_oca/miscellanea:misc.Mode4
ltx/en_us_oca/me.m02.d02:meMA.Lauds1.text	
ltx/en_us_oca/me.m02.d02:meMA.Lauds2.incipit	…
ltx/en_us_oca/me.m02.d02:meMA.Lauds2.melody	@ltx/en_us_oca/he.a.m4:heAU.EdokasSimeiosin.notmetered
ltx/en_us_oca/me.m02.d02:meMA.Lauds2.mode	@ltx/en_us_oca/miscellanea:misc.Mode4
ltx/en_us_oca/me.m02.d02:meMA.Lauds2.text	
ltx/en_us_oca/me.m02.d02:meMA.Lauds3.incipit	…
ltx/en_us_oca/me.m02.d02:meMA.Lauds3.melody	@ltx/en_us_oca/he.a.m4:heAU.EdokasSimeiosin.notmetered
ltx/en_us_oca/me.m02.d02:meMA.Lauds3.mode	@ltx/en_us_oca/miscellanea:misc.Mode4
ltx/en_us_oca/me.m02.d02:meMA.Lauds3.text	
ltx/en_us_oca/me.m02.d02:meMA.LaudsGlory.incipit	…
ltx/en_us_oca/me.m02.d02:meMA.LaudsGlory.melody	
ltx/en_us_oca/me.m02.d02:meMA.LaudsGlory.mode	@ltx/en_us_oca/miscellanea:misc.Mode6
ltx/en_us_oca/me.m02.d02:meMA.LaudsGlory.poet	@ltx/en_us_oca/poets:po.Germanou
ltx/en_us_oca/me.m02.d02:meMA.LaudsGlory.text	
ltx/en_us_oca/me.m02.d02:meMA.MM.Lauds1123as5678.text	@ltx/en_us_oca/properties:media.key
ltx/en_us_oca/me.m02.d02:meMA.Ode1C11.greekmelody	@ltx/en_us_oca/he.h.m3:heHE.ChersonAvyssotokon.greekname
ltx/en_us_oca/me.m02.d02:meMA.Ode1C11.incipit	Let the clouds…
ltx/en_us_oca/me.m02.d02:meMA.Ode1C11.melody	@ltx/en_us_oca/he.h.m3:heHE.ChersonAvyssotokon.notmetered
ltx/en_us_oca/me.m02.d02:meMA.Ode1C11.mode	@ltx/en_us_oca/miscellanea:misc.Mode3
ltx/en_us_oca/me.m02.d02:meMA.Ode1C11.ode	@ltx/en_us_oca/miscellanea:misc.Ode1
ltx/en_us_oca/me.m02.d02:meMA.Ode1C11.text	Let the clouds drop down dew! ⁄ Christ the Sun, riding as if on a swift cloud, ⁄ is carried by pure hands as a Babe into the Temple. ⁄ Therefore let us, the faithful, cry aloud: ⁄ Let us sing to the Lord, for He has been greatly glorified!
ltx/en_us_oca/me.m02.d02:meMA.Ode1C12.incipit	Be strong, hands of Simeon…
ltx/en_us_oca/me.m02.d02:meMA.Ode1C12.melody	@ltx/en_us_oca/he.h.m3:heHE.ChersonAvyssotokon.notmetered
ltx/en_us_oca/me.m02.d02:meMA.Ode1C12.mode	@ltx/en_us_oca/miscellanea:misc.Mode3
ltx/en_us_oca/me.m02.d02:meMA.Ode1C12.ode	@ltx/en_us_oca/miscellanea:misc.Ode1
ltx/en_us_oca/me.m02.d02:meMA.Ode1C12.text	Be strong, hands of Simeon, weakened by age! ⁄ Feeble legs of the Elder, run straight to meet Christ! ⁄ And as we form a choir with the bodiless hosts, ⁄ Let us sing to the Lord, for He has been greatly glorified!
ltx/en_us_oca/me.m02.d02:meMA.Ode1C13.incipit	Rejoice, heavens…
ltx/en_us_oca/me.m02.d02:meMA.Ode1C13.melody	@ltx/en_us_oca/he.h.m3:heHE.ChersonAvyssotokon.notmetered
ltx/en_us_oca/me.m02.d02:meMA.Ode1C13.mode	@ltx/en_us_oca/miscellanea:misc.Mode3
ltx/en_us_oca/me.m02.d02:meMA.Ode1C13.ode	@ltx/en_us_oca/miscellanea:misc.Ode1
ltx/en_us_oca/me.m02.d02:meMA.Ode1C13.text	Rejoice, heavens, established in wisdom, and be glad, O earth! ⁄ For Christ the Artificer, Who came forth from the bosom of the Godhead; ⁄ He Who is the pre-existing One, ⁄ is offered to God His Father as a newborn Child ⁄ by His Mother the Virgin in the Temple: ⁄ for He has been greatly glorified!
ltx/en_us_oca/me.m02.d02:meMA.Ode1C1H.greekmelody	@ltx/en_us_oca/he.h.m3:heHE.ChersonAvyssotokon.greekname
ltx/en_us_oca/me.m02.d02:meMA.Ode1C1H.incipit	@ltx/en_us_oca/he.h.m3:heHE.ChersonAvyssotokon.incipit
ltx/en_us_oca/me.m02.d02:meMA.Ode1C1H.melody	@ltx/en_us_oca/he.h.m3:heHE.ChersonAvyssotokon.melody
ltx/en_us_oca/me.m02.d02:meMA.Ode1C1H.mode	@ltx/en_us_oca/miscellanea:misc.Mode3
ltx/en_us_oca/me.m02.d02:meMA.Ode1C1H.ode	@ltx/en_us_oca/miscellanea:misc.Ode1
ltx/en_us_oca/me.m02.d02:meMA.Ode1C1H.text	@ltx/en_us_oca/he.h.m3:heHE.ChersonAvyssotokon.text
ltx/en_us_oca/me.m02.d02:meMA.Ode3C11.greekmelody	@ltx/en_us_oca/he.h.m3:heHE.ToStereoma.greekname
ltx/en_us_oca/me.m02.d02:meMA.Ode3C11.incipit	The Firstborn…
ltx/en_us_oca/me.m02.d02:meMA.Ode3C11.melody	@ltx/en_us_oca/he.h.m3:heHE.ToStereoma.notmetered
ltx/en_us_oca/me.m02.d02:meMA.Ode3C11.mode	@ltx/en_us_oca/miscellanea:misc.Mode3
ltx/en_us_oca/me.m02.d02:meMA.Ode3C11.ode	@ltx/en_us_oca/miscellanea:misc.Ode3
ltx/en_us_oca/me.m02.d02:meMA.Ode3C11.text	The Firstborn of the Father before all ages ⁄ has appeared as a firstborn Child from an undefiled Maiden, ⁄ stretching out His hands to Adam.
ltx/en_us_oca/me.m02.d02:meMA.Ode3C12.incipit	God the Word…
ltx/en_us_oca/me.m02.d02:meMA.Ode3C12.melody	@ltx/en_us_oca/he.h.m3:heHE.ToStereoma.notmetered
ltx/en_us_oca/me.m02.d02:meMA.Ode3C12.mode	@ltx/en_us_oca/miscellanea:misc.Mode3
ltx/en_us_oca/me.m02.d02:meMA.Ode3C12.ode	@ltx/en_us_oca/miscellanea:misc.Ode3
ltx/en_us_oca/me.m02.d02:meMA.Ode3C12.text	God the Word has appeared as a Child ⁄ that He might restore the first-formed man ⁄ who had become a child in reason through delusion.
ltx/en_us_oca/me.m02.d02:meMA.Ode3C13.incipit	The Creator…
ltx/en_us_oca/me.m02.d02:meMA.Ode3C13.melody	@ltx/en_us_oca/he.h.m3:heHE.ToStereoma.notmetered
ltx/en_us_oca/me.m02.d02:meMA.Ode3C13.mode	@ltx/en_us_oca/miscellanea:misc.Mode3
ltx/en_us_oca/me.m02.d02:meMA.Ode3C13.ode	@ltx/en_us_oca/miscellanea:misc.Ode3
ltx/en_us_oca/me.m02.d02:meMA.Ode3C13.text	The Creator, become a young Child ⁄ without undergoing change in His divinity, ⁄ has reshaped our nature taken from the earth, ⁄ and destined to return to earth once more.
ltx/en_us_oca/me.m02.d02:meMA.Ode3C1H.greekmelody	@ltx/en_us_oca/he.h.m3:heHE.ToStereoma.greekname
ltx/en_us_oca/me.m02.d02:meMA.Ode3C1H.incipit	@ltx/en_us_oca/he.h.m3:heHE.ToStereoma.incipit
ltx/en_us_oca/me.m02.d02:meMA.Ode3C1H.melody	@ltx/en_us_oca/he.h.m3:heHE.ToStereoma.melody
ltx/en_us_oca/me.m02.d02:meMA.Ode3C1H.mode	@ltx/en_us_oca/miscellanea:misc.Mode3
ltx/en_us_oca/me.m02.d02:meMA.Ode3C1H.ode	@ltx/en_us_oca/miscellanea:misc.Ode3
ltx/en_us_oca/me.m02.d02:meMA.Ode3C1H.text	@ltx/en_us_oca/he.h.m3:heHE.ToStereoma.text
ltx/en_us_oca/me.m02.d02:meMA.Ode3Kathisma1.greekmelody	@ltx/en_us_oca/he.a.m4:heAU.KateplagiIosif.greekname
ltx/en_us_oca/me.m02.d02:meMA.Ode3Kathisma1.incipit	In days of old on…
ltx/en_us_oca/me.m02.d02:meMA.Ode3Kathisma1.melody	@ltx/en_us_oca/he.a.m4:heAU.KateplagiIosif.notmetered
ltx/en_us_oca/me.m02.d02:meMA.Ode3Kathisma1.mode	@ltx/en_us_oca/miscellanea:misc.Mode4
ltx/en_us_oca/me.m02.d02:meMA.Ode3Kathisma1.text	In days of old on Mount Sinai, ⁄ Moses saw the back of God ⁄ and was counted worthy in darkness and a storm of wind ⁄ to hear faintly the divine voice. ⁄ But now Simeon has taken God in his arms, ⁄ Who for our sakes took flesh without change! ⁄ Joyfully he hastens to depart to the life eternal, ⁄ and therefore he cries aloud: ⁄⁄ Lord, now let Your servant depart in peace!
ltx/en_us_oca/me.m02.d02:meMA.Ode4C11.greekmelody	@ltx/en_us_oca/he.h.m3:heHE.EkalypsenOuranous.greekname
ltx/en_us_oca/me.m02.d02:meMA.Ode4C11.incipit	The Theotokos cried…
ltx/en_us_oca/me.m02.d02:meMA.Ode4C11.melody	@ltx/en_us_oca/he.h.m3:heHE.EkalypsenOuranous.notmetered
ltx/en_us_oca/me.m02.d02:meMA.Ode4C11.mode	@ltx/en_us_oca/miscellanea:misc.Mode3
ltx/en_us_oca/me.m02.d02:meMA.Ode4C11.ode	@ltx/en_us_oca/miscellanea:misc.Ode4
ltx/en_us_oca/me.m02.d02:meMA.Ode4C11.text	The Theotokos cried to Simeon: ⁄ You know ineffable mysteries! ⁄ Take Christ the Word become a Child into your arms with rejoicing, ⁄ for you were told of Him long ago by the Holy Spirit, ⁄ and shout aloud to Him: ⁄ The whole world has been filled with Your praise!
ltx/en_us_oca/me.m02.d02:meMA.Ode4C12.incipit	Simeon, joyfully receive…
ltx/en_us_oca/me.m02.d02:meMA.Ode4C12.melody	@ltx/en_us_oca/he.h.m3:heHE.EkalypsenOuranous.notmetered
ltx/en_us_oca/me.m02.d02:meMA.Ode4C12.mode	@ltx/en_us_oca/miscellanea:misc.Mode3
ltx/en_us_oca/me.m02.d02:meMA.Ode4C12.ode	@ltx/en_us_oca/miscellanea:misc.Ode4
ltx/en_us_oca/me.m02.d02:meMA.Ode4C12.text	Simeon, joyfully receive Christ, an Infant in age, ⁄ the consolation of God’s Israel for which you have hoped! ⁄ He is the Maker and Master of the Law Who fulfills the order of the Law! ⁄ cry out to Him: The whole world has been filled with Your praise!
ltx/en_us_oca/me.m02.d02:meMA.Ode4C13.incipit	Simeon was amazed…
ltx/en_us_oca/me.m02.d02:meMA.Ode4C13.melody	@ltx/en_us_oca/he.h.m3:heHE.EkalypsenOuranous.notmetered
ltx/en_us_oca/me.m02.d02:meMA.Ode4C13.mode	@ltx/en_us_oca/miscellanea:misc.Mode3
ltx/en_us_oca/me.m02.d02:meMA.Ode4C13.ode	@ltx/en_us_oca/miscellanea:misc.Ode4
ltx/en_us_oca/me.m02.d02:meMA.Ode4C13.text	Simeon was amazed when he beheld incarnate ⁄ the Word that is without beginning, ⁄ carried by the Virgin as on the throne of the cherubim; ⁄ the Cause of all being, Himself become a Babe; ⁄ and he cried aloud to Him: ⁄ The whole world has been filled with Your praise!
ltx/en_us_oca/me.m02.d02:meMA.Ode4C1H.greekmelody	@ltx/en_us_oca/he.h.m3:heHE.EkalypsenOuranous.greekname
ltx/en_us_oca/me.m02.d02:meMA.Ode4C1H.incipit	@ltx/en_us_oca/he.h.m3:heHE.EkalypsenOuranous.incipit
ltx/en_us_oca/me.m02.d02:meMA.Ode4C1H.melody	@ltx/en_us_oca/he.h.m3:heHE.EkalypsenOuranous.melody
ltx/en_us_oca/me.m02.d02:meMA.Ode4C1H.mode	@ltx/en_us_oca/miscellanea:misc.Mode3
ltx/en_us_oca/me.m02.d02:meMA.Ode4C1H.ode	@ltx/en_us_oca/miscellanea:misc.Ode4
ltx/en_us_oca/me.m02.d02:meMA.Ode4C1H.text	@ltx/en_us_oca/he.h.m3:heHE.EkalypsenOuranous.text
ltx/en_us_oca/me.m02.d02:meMA.Ode5C11.greekmelody	@ltx/en_us_oca/he.h.m3:heHE.OsEidenIsaias.greekname
ltx/en_us_oca/me.m02.d02:meMA.Ode5C11.incipit	Seeing before him…
ltx/en_us_oca/me.m02.d02:meMA.Ode5C11.melody	@ltx/en_us_oca/he.h.m3:heHE.OsEidenIsaias.notmetered
ltx/en_us_oca/me.m02.d02:meMA.Ode5C11.mode	@ltx/en_us_oca/miscellanea:misc.Mode3
ltx/en_us_oca/me.m02.d02:meMA.Ode5C11.ode	@ltx/en_us_oca/miscellanea:misc.Ode5
ltx/en_us_oca/me.m02.d02:meMA.Ode5C11.text	Seeing before him the Word held in the arms of His Mother, ⁄ the aged servant of God understood this to be the Glory manifested of old to the Prophet; ⁄ and he cried: Rejoice, holy Lady, ⁄ for you carry God as a throne: ⁄ Lord of the light that knows no evening, and King of peace!
ltx/en_us_oca/me.m02.d02:meMA.Ode5C12.incipit	The Elder bent down…
ltx/en_us_oca/me.m02.d02:meMA.Ode5C12.melody	@ltx/en_us_oca/he.h.m3:heHE.OsEidenIsaias.notmetered
ltx/en_us_oca/me.m02.d02:meMA.Ode5C12.mode	@ltx/en_us_oca/miscellanea:misc.Mode3
ltx/en_us_oca/me.m02.d02:meMA.Ode5C12.ode	@ltx/en_us_oca/miscellanea:misc.Ode5
ltx/en_us_oca/me.m02.d02:meMA.Ode5C12.text	The Elder bent down and reverently touched the footprints of the unwedded Mother of God, ⁄ and he said: Pure Lady, you are carrying Fire! ⁄ I am afraid to take God in my arms as a Babe: ⁄ Lord of the light that knows no evening, and King of peace!
ltx/en_us_oca/me.m02.d02:meMA.Ode5C13.incipit	Isaiah was cleansed…
ltx/en_us_oca/me.m02.d02:meMA.Ode5C13.melody	@ltx/en_us_oca/he.h.m3:heHE.OsEidenIsaias.notmetered
ltx/en_us_oca/me.m02.d02:meMA.Ode5C13.mode	@ltx/en_us_oca/miscellanea:misc.Mode3
ltx/en_us_oca/me.m02.d02:meMA.Ode5C13.ode	@ltx/en_us_oca/miscellanea:misc.Ode5
ltx/en_us_oca/me.m02.d02:meMA.Ode5C13.text	Isaiah was cleansed by receiving the coal from the seraphim! ⁄ Cried the old man to the Mother of God. ⁄ You fill me with light, entrusting to me with your hands ⁄ as with tongs, the One Whom you hold: ⁄ Lord of the light that knows no evening, and King of peace!
ltx/en_us_oca/me.m02.d02:meMA.Ode5C1H.greekmelody	@ltx/en_us_oca/he.h.m3:heHE.OsEidenIsaias.greekname
ltx/en_us_oca/me.m02.d02:meMA.Ode5C1H.incipit	@ltx/en_us_oca/he.h.m3:heHE.OsEidenIsaias.incipit
ltx/en_us_oca/me.m02.d02:meMA.Ode5C1H.melody	@ltx/en_us_oca/he.h.m3:heHE.OsEidenIsaias.melody
ltx/en_us_oca/me.m02.d02:meMA.Ode5C1H.mode	@ltx/en_us_oca/miscellanea:misc.Mode3
ltx/en_us_oca/me.m02.d02:meMA.Ode5C1H.ode	@ltx/en_us_oca/miscellanea:misc.Ode5
ltx/en_us_oca/me.m02.d02:meMA.Ode5C1H.text	@ltx/en_us_oca/he.h.m3:heHE.OsEidenIsaias.text
ltx/en_us_oca/me.m02.d02:meMA.Ode6C11.greekmelody	@ltx/en_us_oca/he.h.m3:heHE.EvoiseSoi.greekname
ltx/en_us_oca/me.m02.d02:meMA.Ode6C11.incipit	You have been set up…
ltx/en_us_oca/me.m02.d02:meMA.Ode6C11.melody	@ltx/en_us_oca/he.h.m3:heHE.EvoiseSoi.notmetered
ltx/en_us_oca/me.m02.d02:meMA.Ode6C11.mode	@ltx/en_us_oca/miscellanea:misc.Mode3
ltx/en_us_oca/me.m02.d02:meMA.Ode6C11.ode	@ltx/en_us_oca/miscellanea:misc.Ode6
ltx/en_us_oca/me.m02.d02:meMA.Ode6C11.text	You have been set up in Zion as a stone of stumbling ⁄ and a rock of offense for the disobedient. ⁄ But to the faithful You are unbreakable salvation!
ltx/en_us_oca/me.m02.d02:meMA.Ode6C12.incipit	You faithfully bear…
ltx/en_us_oca/me.m02.d02:meMA.Ode6C12.melody	@ltx/en_us_oca/he.h.m3:heHE.EvoiseSoi.notmetered
ltx/en_us_oca/me.m02.d02:meMA.Ode6C12.mode	@ltx/en_us_oca/miscellanea:misc.Mode3
ltx/en_us_oca/me.m02.d02:meMA.Ode6C12.ode	@ltx/en_us_oca/miscellanea:misc.Ode6
ltx/en_us_oca/me.m02.d02:meMA.Ode6C12.text	You faithfully bear the image ⁄ of the One Who begot You before all ages, ⁄ and in compassion You have put on the weakness of mortal man.
ltx/en_us_oca/me.m02.d02:meMA.Ode6C13.incipit	Now let him depart…
ltx/en_us_oca/me.m02.d02:meMA.Ode6C13.melody	@ltx/en_us_oca/he.h.m3:heHE.EvoiseSoi.notmetered
ltx/en_us_oca/me.m02.d02:meMA.Ode6C13.mode	@ltx/en_us_oca/miscellanea:misc.Mode3
ltx/en_us_oca/me.m02.d02:meMA.Ode6C13.ode	@ltx/en_us_oca/miscellanea:misc.Ode6
ltx/en_us_oca/me.m02.d02:meMA.Ode6C13.text	Now let him depart in peace ⁄ who worships You as Son of the Most high and Son of the Virgin: ⁄ God Who has become a Child.
ltx/en_us_oca/me.m02.d02:meMA.Ode6C1H.greekmelody	@ltx/en_us_oca/he.h.m3:heHE.EvoiseSoi.greekname
ltx/en_us_oca/me.m02.d02:meMA.Ode6C1H.incipit	@ltx/en_us_oca/he.h.m3:heHE.EvoiseSoi.incipit
ltx/en_us_oca/me.m02.d02:meMA.Ode6C1H.melody	@ltx/en_us_oca/he.h.m3:heHE.EvoiseSoi.melody
ltx/en_us_oca/me.m02.d02:meMA.Ode6C1H.mode	@ltx/en_us_oca/miscellanea:misc.Mode3
ltx/en_us_oca/me.m02.d02:meMA.Ode6C1H.ode	@ltx/en_us_oca/miscellanea:misc.Ode6
ltx/en_us_oca/me.m02.d02:meMA.Ode6C1H.text	@ltx/en_us_oca/he.h.m3:heHE.EvoiseSoi.text
ltx/en_us_oca/me.m02.d02:meMA.Ode7C11.greekmelody	@ltx/en_us_oca/he.h.m3:heHE.SeTonEnPyri.greekname
ltx/en_us_oca/me.m02.d02:meMA.Ode7C11.incipit	I depart…
ltx/en_us_oca/me.m02.d02:meMA.Ode7C11.melody	@ltx/en_us_oca/he.h.m3:heHE.SeTonEnPyri.notmetered
ltx/en_us_oca/me.m02.d02:meMA.Ode7C11.mode	@ltx/en_us_oca/miscellanea:misc.Mode3
ltx/en_us_oca/me.m02.d02:meMA.Ode7C11.ode	@ltx/en_us_oca/miscellanea:misc.Ode7
ltx/en_us_oca/me.m02.d02:meMA.Ode7C11.text	I depart, cried Simeon, to declare the good tidings ⁄ to Adam abiding in hell, and to Eve! ⁄ And he sang, rejoicing with the prophets: ⁄ Blessed are You, O God of our fathers!
ltx/en_us_oca/me.m02.d02:meMA.Ode7C12.incipit	God will go…
ltx/en_us_oca/me.m02.d02:meMA.Ode7C12.melody	@ltx/en_us_oca/he.h.m3:heHE.SeTonEnPyri.notmetered
ltx/en_us_oca/me.m02.d02:meMA.Ode7C12.mode	@ltx/en_us_oca/miscellanea:misc.Mode3
ltx/en_us_oca/me.m02.d02:meMA.Ode7C12.ode	@ltx/en_us_oca/miscellanea:misc.Ode7
ltx/en_us_oca/me.m02.d02:meMA.Ode7C12.text	God will go down even to hell to deliver mankind formed from dust: ⁄ He will give freedom to all the captives and sight to the blind. ⁄ He will grant the dumb to cry aloud: ⁄ Blessed are You, O God of our fathers!
ltx/en_us_oca/me.m02.d02:meMA.Ode7C13.incipit	And a sword…
ltx/en_us_oca/me.m02.d02:meMA.Ode7C13.melody	@ltx/en_us_oca/he.h.m3:heHE.SeTonEnPyri.notmetered
ltx/en_us_oca/me.m02.d02:meMA.Ode7C13.mode	@ltx/en_us_oca/miscellanea:misc.Mode3
ltx/en_us_oca/me.m02.d02:meMA.Ode7C13.ode	@ltx/en_us_oca/miscellanea:misc.Ode7
ltx/en_us_oca/me.m02.d02:meMA.Ode7C13.text	And a sword shall pierce your heart, all-pure Virgin, ⁄ Simeon foretold to the Theotokos, ⁄ when you shall see your Son upon the Cross, ⁄ the One to Whom we cry aloud: ⁄ Blessed are You, O God of our fathers!
ltx/en_us_oca/me.m02.d02:meMA.Ode7C1H.greekmelody	@ltx/en_us_oca/he.h.m3:heHE.SeTonEnPyri.greekname
ltx/en_us_oca/me.m02.d02:meMA.Ode7C1H.incipit	@ltx/en_us_oca/he.h.m3:heHE.SeTonEnPyri.incipit
ltx/en_us_oca/me.m02.d02:meMA.Ode7C1H.melody	@ltx/en_us_oca/he.h.m3:heHE.SeTonEnPyri.melody
ltx/en_us_oca/me.m02.d02:meMA.Ode7C1H.mode	@ltx/en_us_oca/miscellanea:misc.Mode3
ltx/en_us_oca/me.m02.d02:meMA.Ode7C1H.ode	@ltx/en_us_oca/miscellanea:misc.Ode7
ltx/en_us_oca/me.m02.d02:meMA.Ode7C1H.text	@ltx/en_us_oca/he.h.m3:heHE.SeTonEnPyri.text
ltx/en_us_oca/me.m02.d02:meMA.Ode8C11.greekmelody	@ltx/en_us_oca/he.h.m3:heHE.AstektoPyri.greekname
ltx/en_us_oca/me.m02.d02:meMA.Ode8C11.incipit	People of Israel…
ltx/en_us_oca/me.m02.d02:meMA.Ode8C11.melody	@ltx/en_us_oca/he.h.m3:heHE.AstektoPyri.notmetered
ltx/en_us_oca/me.m02.d02:meMA.Ode8C11.mode	@ltx/en_us_oca/miscellanea:misc.Mode3
ltx/en_us_oca/me.m02.d02:meMA.Ode8C11.ode	@ltx/en_us_oca/miscellanea:misc.Ode8
ltx/en_us_oca/me.m02.d02:meMA.Ode8C11.text	People of Israel, as you behold your Glory, ⁄ offered before the Ark of God: ⁄ Emanuel, the Child of the Virgin, ⁄ dance now and sing together: ⁄ All works of the Lord, bless the Lord, ⁄ and exalt Him above all forever!
ltx/en_us_oca/me.m02.d02:meMA.Ode8C12.incipit	Behold! cried Simeon…
ltx/en_us_oca/me.m02.d02:meMA.Ode8C12.melody	@ltx/en_us_oca/he.h.m3:heHE.AstektoPyri.notmetered
ltx/en_us_oca/me.m02.d02:meMA.Ode8C12.mode	@ltx/en_us_oca/miscellanea:misc.Mode3
ltx/en_us_oca/me.m02.d02:meMA.Ode8C12.ode	@ltx/en_us_oca/miscellanea:misc.Ode8
ltx/en_us_oca/me.m02.d02:meMA.Ode8C12.text	Behold! cried Simeon: This is He Who is at once God and a Child; ⁄ Who shall become a sign that is spoken against. ⁄ Let us sing to Him in faith: ⁄ All works of the Lord, bless the Lord, ⁄ and exalt Him above all forever!
ltx/en_us_oca/me.m02.d02:meMA.Ode8C13.incipit	God the Word…
ltx/en_us_oca/me.m02.d02:meMA.Ode8C13.melody	@ltx/en_us_oca/he.h.m3:heHE.AstektoPyri.notmetered
ltx/en_us_oca/me.m02.d02:meMA.Ode8C13.mode	@ltx/en_us_oca/miscellanea:misc.Mode3
ltx/en_us_oca/me.m02.d02:meMA.Ode8C13.ode	@ltx/en_us_oca/miscellanea:misc.Ode8
ltx/en_us_oca/me.m02.d02:meMA.Ode8C13.text	God the Word, Who is Life, has here become a small Child: ⁄ He shall be the fall of the disobedient, ⁄ and the rising again of all those who sing with faith: ⁄ All works of the Lord, bless the Lord, ⁄ and exalt Him above all forever!
ltx/en_us_oca/me.m02.d02:meMA.Ode8C1H.greekmelody	@ltx/en_us_oca/he.h.m3:heHE.AstektoPyri.greekname
ltx/en_us_oca/me.m02.d02:meMA.Ode8C1H.incipit	@ltx/en_us_oca/he.h.m3:heHE.AstektoPyri.incipit
ltx/en_us_oca/me.m02.d02:meMA.Ode8C1H.melody	@ltx/en_us_oca/he.h.m3:heHE.AstektoPyri.melody
ltx/en_us_oca/me.m02.d02:meMA.Ode8C1H.mode	@ltx/en_us_oca/miscellanea:misc.Mode3
ltx/en_us_oca/me.m02.d02:meMA.Ode8C1H.ode	@ltx/en_us_oca/miscellanea:misc.Ode8
ltx/en_us_oca/me.m02.d02:meMA.Ode8C1H.text	@ltx/en_us_oca/he.h.m3:heHE.AstektoPyri.text
ltx/en_us_oca/me.m02.d02:meMA.Ode9C11.greekmelody	@ltx/en_us_oca/he.h.m3:heHE.EnNomoSkia.greekname
ltx/en_us_oca/me.m02.d02:meMA.Ode9C11.incipit	…
ltx/en_us_oca/me.m02.d02:meMA.Ode9C11.melody	@ltx/en_us_oca/he.h.m3:heHE.EnNomoSkia.notmetered
ltx/en_us_oca/me.m02.d02:meMA.Ode9C11.mode	@ltx/en_us_oca/miscellanea:misc.Mode3
ltx/en_us_oca/me.m02.d02:meMA.Ode9C11.ode	@ltx/en_us_oca/miscellanea:misc.Ode9
ltx/en_us_oca/me.m02.d02:meMA.Ode9C11.text	
ltx/en_us_oca/me.m02.d02:meMA.Ode9C12.incipit	…
ltx/en_us_oca/me.m02.d02:meMA.Ode9C12.melody	@ltx/en_us_oca/he.h.m3:heHE.EnNomoSkia.notmetered
ltx/en_us_oca/me.m02.d02:meMA.Ode9C12.mode	@ltx/en_us_oca/miscellanea:misc.Mode3
ltx/en_us_oca/me.m02.d02:meMA.Ode9C12.ode	@ltx/en_us_oca/miscellanea:misc.Ode9
ltx/en_us_oca/me.m02.d02:meMA.Ode9C12.text	
ltx/en_us_oca/me.m02.d02:meMA.Ode9C13.incipit	…
ltx/en_us_oca/me.m02.d02:meMA.Ode9C13.melody	@ltx/en_us_oca/he.h.m3:heHE.EnNomoSkia.notmetered
ltx/en_us_oca/me.m02.d02:meMA.Ode9C13.mode	@ltx/en_us_oca/miscellanea:misc.Mode3
ltx/en_us_oca/me.m02.d02:meMA.Ode9C13.ode	@ltx/en_us_oca/miscellanea:misc.Ode9
ltx/en_us_oca/me.m02.d02:meMA.Ode9C13.text	
ltx/en_us_oca/me.m02.d02:meMA.Ode9C1H.greekmelody	@ltx/en_us_oca/he.h.m3:heHE.EnNomoSkia.greekname
ltx/en_us_oca/me.m02.d02:meMA.Ode9C1H.incipit	@ltx/en_us_oca/he.h.m3:heHE.EnNomoSkia.incipit
ltx/en_us_oca/me.m02.d02:meMA.Ode9C1H.melody	@ltx/en_us_oca/he.h.m3:heHE.EnNomoSkia.melody
ltx/en_us_oca/me.m02.d02:meMA.Ode9C1H.mode	@ltx/en_us_oca/miscellanea:misc.Mode3
ltx/en_us_oca/me.m02.d02:meMA.Ode9C1H.ode	@ltx/en_us_oca/miscellanea:misc.Ode9
ltx/en_us_oca/me.m02.d02:meMA.Ode9C1H.text	@ltx/en_us_oca/he.h.m3:heHE.EnNomoSkia.text
ltx/en_us_oca/me.m02.d02:meMA.Ode9C1M01.incipit	…
ltx/en_us_oca/me.m02.d02:meMA.Ode9C1M01.text	
ltx/en_us_oca/me.m02.d02:meMA.Ode9C1M02.incipit	…
ltx/en_us_oca/me.m02.d02:meMA.Ode9C1M02.text	
ltx/en_us_oca/me.m02.d02:meMA.Ode9C1M03.incipit	…
ltx/en_us_oca/me.m02.d02:meMA.Ode9C1M03.text	
ltx/en_us_oca/me.m02.d02:meMA.Ode9C1M04.incipit	…
ltx/en_us_oca/me.m02.d02:meMA.Ode9C1M04.text	
ltx/en_us_oca/me.m02.d02:meMA.Ode9C1M05.incipit	…
ltx/en_us_oca/me.m02.d02:meMA.Ode9C1M05.text	
ltx/en_us_oca/me.m02.d02:meMA.Ode9C1M06.incipit	…
ltx/en_us_oca/me.m02.d02:meMA.Ode9C1M06.text	
ltx/en_us_oca/me.m02.d02:meMA.Ode9C1M07.incipit	…
ltx/en_us_oca/me.m02.d02:meMA.Ode9C1M07.text	
ltx/en_us_oca/me.m02.d02:meMA.Ode9C1M08.incipit	…
ltx/en_us_oca/me.m02.d02:meMA.Ode9C1M08.text	
ltx/en_us_oca/me.m02.d02:meMA.Ode9C1M09.incipit	…
ltx/en_us_oca/me.m02.d02:meMA.Ode9C1M09.text	
ltx/en_us_oca/me.m02.d02:meMA.Ode9C1M10.incipit	…
ltx/en_us_oca/me.m02.d02:meMA.Ode9C1M10.text	
ltx/en_us_oca/me.m02.d02:meMA.Ode9C1M11.incipit	…
ltx/en_us_oca/me.m02.d02:meMA.Ode9C1M11.text	
ltx/en_us_oca/me.m02.d02:meMA.Ode9C1M12.incipit	…
ltx/en_us_oca/me.m02.d02:meMA.Ode9C1M12.text	
ltx/en_us_oca/me.m02.d02:meMA.Ode9C1M13.incipit	…
ltx/en_us_oca/me.m02.d02:meMA.Ode9C1M13.text	
ltx/en_us_oca/me.m02.d02:meMA.Ode9C1M14.incipit	…
ltx/en_us_oca/me.m02.d02:meMA.Ode9C1M14.text	
ltx/en_us_oca/me.m02.d02:meMA.Ode9C1MTh.incipit	…
ltx/en_us_oca/me.m02.d02:meMA.Ode9C1MTh.text	
ltx/en_us_oca/me.m02.d02:meMA.Ode9C1MTr.incipit	…
ltx/en_us_oca/me.m02.d02:meMA.Ode9C1MTr.text	
ltx/en_us_oca/me.m02.d02:meMA.Oikos1.text	Let us run to the Theotokos in our desire to behold her Son being brought to Simeon. The bodiless powers, looking at Him from on high, were filled with amazement, saying: Now we see wonderful and marvelous things, past all understanding and telling! The One Who created Adam is carried as an Infant! He Who cannot be contained is embraced by the arms of the Elder. He Who rests uncircumscribed in the bosom of His Father, is voluntarily circumscribed in flesh, but not in divinity, ⁄⁄ As the only Lover of mankind!
ltx/en_us_oca/me.m02.d02:meMA.PostGospelBoth.incipit	@ltx/en_us_oca/ho.ho03:hoMA.PostGospelTheotokos.incipit
ltx/en_us_oca/me.m02.d02:meMA.PostGospelBoth.melody	
ltx/en_us_oca/me.m02.d02:meMA.PostGospelBoth.mode	@ltx/en_us_oca/miscellanea:misc.Mode2
ltx/en_us_oca/me.m02.d02:meMA.PostGospelBoth.text	@ltx/en_us_oca/ho.ho03:hoMA.PostGospelTheotokos.text
ltx/en_us_oca/me.m02.d02:meMA.PostGospelGlory.incipit	@ltx/en_us_oca/ho.ho03:hoMA.PostGospelTheotokos.incipit
ltx/en_us_oca/me.m02.d02:meMA.PostGospelGlory.melody	
ltx/en_us_oca/me.m02.d02:meMA.PostGospelGlory.mode	@ltx/en_us_oca/miscellanea:misc.Mode2
ltx/en_us_oca/me.m02.d02:meMA.PostGospelGlory.text	@ltx/en_us_oca/ho.ho03:hoMA.PostGospelTheotokos.text
ltx/en_us_oca/me.m02.d02:meMA.PostGospelIdiomelon.incipit	@ltx/en_us_oca/me.m02.d02:meVE.SticGlory.incipit
ltx/en_us_oca/me.m02.d02:meMA.PostGospelIdiomelon.melody	
ltx/en_us_oca/me.m02.d02:meMA.PostGospelIdiomelon.mode	@ltx/en_us_oca/miscellanea:misc.Mode6
ltx/en_us_oca/me.m02.d02:meMA.PostGospelIdiomelon.poet	@ltx/en_us_oca/poets:po.IoannouMonachou
ltx/en_us_oca/me.m02.d02:meMA.PostGospelIdiomelon.text	@ltx/en_us_oca/me.m02.d02:meVE.SticGlory.text
ltx/en_us_oca/me.m02.d02:meSV.AposGlory.incipit	Receive Him, O Simeon, ⁄…
ltx/en_us_oca/me.m02.d02:meSV.AposGlory.melody	@ltx/en_us_oca/he.a.m2:heAU.OikosTouEfratha.notmetered
ltx/en_us_oca/me.m02.d02:meSV.AposGlory.mode	@ltx/en_us_oca/miscellanea:misc.Mode2
ltx/en_us_oca/me.m02.d02:meSV.AposGlory.text	Receive Him, O Simeon, ⁄ Cried the all-pure Virgin. ⁄ Bear Him in your arms: ⁄ He is the Lord of glory, ⁄⁄ and the Salvation of the world!
ltx/en_us_oca/me.m02.d02:meSV.Aposticha1.incipit	Today the Savior, ⁄ carried…
ltx/en_us_oca/me.m02.d02:meSV.Aposticha1.melody	@ltx/en_us_oca/he.a.m2:heAU.OikosTouEfratha.notmetered
ltx/en_us_oca/me.m02.d02:meSV.Aposticha1.mode	@ltx/en_us_oca/miscellanea:misc.Mode2
ltx/en_us_oca/me.m02.d02:meSV.Aposticha1.text	Today the Savior, ⁄ carried as an Infant, ⁄ is brought into the Temple of the Lord, ⁄ and with aged arms, ⁄⁄ the Elder receives Him.
ltx/en_us_oca/me.m02.d02:meSV.Aposticha2.incipit	Christ, the Coal of fire…
ltx/en_us_oca/me.m02.d02:meSV.Aposticha2.melody	@ltx/en_us_oca/he.a.m2:heAU.OikosTouEfratha.notmetered
ltx/en_us_oca/me.m02.d02:meSV.Aposticha2.mode	@ltx/en_us_oca/miscellanea:misc.Mode2
ltx/en_us_oca/me.m02.d02:meSV.Aposticha2.text	Christ, the Coal of fire ⁄ whom holy Isaiah foresaw, ⁄ now rests in the arms of the Theotokos ⁄ as in a pair of tongs. ⁄⁄ Now He is given to the Elder!
ltx/en_us_oca/me.m02.d02:meSV.Aposticha3.incipit	In fear and joy, Simeon…
ltx/en_us_oca/me.m02.d02:meSV.Aposticha3.melody	@ltx/en_us_oca/he.a.m2:heAU.OikosTouEfratha.notmetered
ltx/en_us_oca/me.m02.d02:meSV.Aposticha3.mode	@ltx/en_us_oca/miscellanea:misc.Mode2
ltx/en_us_oca/me.m02.d02:meSV.Aposticha3.text	In fear and joy, Simeon ⁄ held the Master in his arms ⁄ and asked release from life ⁄ singing the praises ⁄⁄ of the Mother of God!
ltx/en_us_oca/me.m02.d02:meSV.SticGlory.incipit	@ltx/en_us_oca/me.m02.d02:meVE.Lity8.incipit
ltx/en_us_oca/me.m02.d02:meSV.SticGlory.melody	
ltx/en_us_oca/me.m02.d02:meSV.SticGlory.mode	@ltx/en_us_oca/miscellanea:misc.Mode4
ltx/en_us_oca/me.m02.d02:meSV.SticGlory.poet	@ltx/en_us_oca/poets:po.AndreouKritis
ltx/en_us_oca/me.m02.d02:meSV.SticGlory.text	@ltx/en_us_oca/me.m02.d02:meVE.Lity8.text
ltx/en_us_oca/me.m02.d02:meSV.Stichera1.incipit	…
ltx/en_us_oca/me.m02.d02:meSV.Stichera1.melody	@ltx/en_us_oca/he.a.m1:heAU.TonOuranionTagmaton.notmetered
ltx/en_us_oca/me.m02.d02:meSV.Stichera1.mode	@ltx/en_us_oca/miscellanea:misc.Mode1
ltx/en_us_oca/me.m02.d02:meSV.Stichera1.text	
ltx/en_us_oca/me.m02.d02:meSV.Stichera2.incipit	…
ltx/en_us_oca/me.m02.d02:meSV.Stichera2.melody	@ltx/en_us_oca/he.a.m1:heAU.TonOuranionTagmaton.notmetered
ltx/en_us_oca/me.m02.d02:meSV.Stichera2.mode	@ltx/en_us_oca/miscellanea:misc.Mode1
ltx/en_us_oca/me.m02.d02:meSV.Stichera2.text	
ltx/en_us_oca/me.m02.d02:meSV.Stichera3.incipit	…
ltx/en_us_oca/me.m02.d02:meSV.Stichera3.melody	@ltx/en_us_oca/he.a.m1:heAU.TonOuranionTagmaton.notmetered
ltx/en_us_oca/me.m02.d02:meSV.Stichera3.mode	@ltx/en_us_oca/miscellanea:misc.Mode1
ltx/en_us_oca/me.m02.d02:meSV.Stichera3.text	
ltx/en_us_oca/me.m02.d02:meVE.Apolytikion1.incipit	…
ltx/en_us_oca/me.m02.d02:meVE.Apolytikion1.melody	
ltx/en_us_oca/me.m02.d02:meVE.Apolytikion1.mode	@ltx/en_us_oca/miscellanea:misc.Mode1
ltx/en_us_oca/me.m02.d02:meVE.Apolytikion1.text	
ltx/en_us_oca/me.m02.d02:meVE.AposGlory.incipit	…
ltx/en_us_oca/me.m02.d02:meVE.AposGlory.melody	
ltx/en_us_oca/me.m02.d02:meVE.AposGlory.mode	@ltx/en_us_oca/miscellanea:misc.Mode8
ltx/en_us_oca/me.m02.d02:meVE.AposGlory.poet	@ltx/en_us_oca/poets:po.AndreouKritis
ltx/en_us_oca/me.m02.d02:meVE.AposGlory.text	
ltx/en_us_oca/me.m02.d02:meVE.Aposticha1.incipit	…
ltx/en_us_oca/me.m02.d02:meVE.Aposticha1.melody	
ltx/en_us_oca/me.m02.d02:meVE.Aposticha1.mode	@ltx/en_us_oca/miscellanea:misc.Mode7
ltx/en_us_oca/me.m02.d02:meVE.Aposticha1.poet	@ltx/en_us_oca/poets:po.KosmaMonachou
ltx/en_us_oca/me.m02.d02:meVE.Aposticha1.text	
ltx/en_us_oca/me.m02.d02:meVE.Aposticha2.incipit	…
ltx/en_us_oca/me.m02.d02:meVE.Aposticha2.melody	
ltx/en_us_oca/me.m02.d02:meVE.Aposticha2.mode	@ltx/en_us_oca/miscellanea:misc.Mode7
ltx/en_us_oca/me.m02.d02:meVE.Aposticha2.text	
ltx/en_us_oca/me.m02.d02:meVE.Aposticha3.incipit	…
ltx/en_us_oca/me.m02.d02:meVE.Aposticha3.melody	
ltx/en_us_oca/me.m02.d02:meVE.Aposticha3.mode	@ltx/en_us_oca/miscellanea:misc.Mode7
ltx/en_us_oca/me.m02.d02:meVE.Aposticha3.text	
ltx/en_us_oca/me.m02.d02:meVE.Lity1.incipit	The ancient of days…
ltx/en_us_oca/me.m02.d02:meVE.Lity1.melody	
ltx/en_us_oca/me.m02.d02:meVE.Lity1.mode	@ltx/en_us_oca/miscellanea:misc.Mode1
ltx/en_us_oca/me.m02.d02:meVE.Lity1.poet	@ltx/en_us_oca/poets:po.Anatoliou
ltx/en_us_oca/me.m02.d02:meVE.Lity1.text	The ancient of days, Who gave Moses the law on Sinai in former times, ⁄ today appears as a Child. ⁄ As Maker of the law, He fulfills the law! ⁄ He is brought into the Temple according to the law, ⁄ and given over to the Elder. ⁄ Simeon the righteous receives Him. ⁄ Beholding the fulfillment of the divine order now brought to pass, ⁄ rejoicing aloud, he cries: ⁄ My eyes have seen the mystery hidden from the ages ⁄ made manifest in these latter days, ⁄ the Light that disperses the foolishness of the faithless gentiles, ⁄ and the glory of the newly-chosen Israel! ⁄ Therefore let Your servant depart from the bonds of this flesh ⁄ to the life filled with wonder that knows no age or end, ⁄⁄ for You grant the world great mercy!
ltx/en_us_oca/me.m02.d02:meVE.Lity2.incipit	Today He Who once gave…
ltx/en_us_oca/me.m02.d02:meVE.Lity2.melody	
ltx/en_us_oca/me.m02.d02:meVE.Lity2.mode	@ltx/en_us_oca/miscellanea:misc.Mode1
ltx/en_us_oca/me.m02.d02:meVE.Lity2.poet	@ltx/en_us_oca/poets:po.IoannouMonachou
ltx/en_us_oca/me.m02.d02:meVE.Lity2.text	Today He Who once gave the law to Moses on Sinai ⁄ submits Himself to the commandments of the law, ⁄ for our sakes, becoming as we are in His compassion. ⁄ Now the God of purity as a holy Child has opened a pure womb, ⁄ and as God, He is brought as an offering to Himself, ⁄ setting us free from the curse of the law, ⁄⁄ and granting Light to our souls!
ltx/en_us_oca/me.m02.d02:meVE.Lity3.incipit	Simeon now receives …
ltx/en_us_oca/me.m02.d02:meVE.Lity3.melody	
ltx/en_us_oca/me.m02.d02:meVE.Lity3.mode	@ltx/en_us_oca/miscellanea:misc.Mode2
ltx/en_us_oca/me.m02.d02:meVE.Lity3.poet	@ltx/en_us_oca/poets:po.AndreouPyrou
ltx/en_us_oca/me.m02.d02:meVE.Lity3.text	Simeon now receives below in his earthly arms ⁄ the One Whom the ministers entreat with trembling in the heavenly liturgy on high. ⁄ He proclaims the union of God with mankind. ⁄ He sees the heavenly God as mortal Man! ⁄ He prepares to withdraw from earthly things, ⁄ and raises his cry in joy: ⁄ Glory to You, Lord, for You have revealed to those in darkness ⁄⁄ the Light that knows no evening!
ltx/en_us_oca/me.m02.d02:meVE.Lity4.incipit	@ltx/en_us_oca/me.m02.d01:meVE.SticBoth.incipit
ltx/en_us_oca/me.m02.d02:meVE.Lity4.melody	
ltx/en_us_oca/me.m02.d02:meVE.Lity4.mode	@ltx/en_us_oca/miscellanea:misc.Mode2
ltx/en_us_oca/me.m02.d02:meVE.Lity4.poet	@ltx/en_us_oca/poets:po.Germanou
ltx/en_us_oca/me.m02.d02:meVE.Lity4.text	@ltx/en_us_oca/me.m02.d01:meVE.SticBoth.text
ltx/en_us_oca/me.m02.d02:meVE.Lity5.incipit	@ltx/en_us_oca/me.m02.d01:meVE.AposGlory.incipit
ltx/en_us_oca/me.m02.d02:meVE.Lity5.melody	
ltx/en_us_oca/me.m02.d02:meVE.Lity5.mode	@ltx/en_us_oca/miscellanea:misc.Mode2
ltx/en_us_oca/me.m02.d02:meVE.Lity5.poet	@ltx/en_us_oca/poets:po.GermanouOiDeIoannouMonachou
ltx/en_us_oca/me.m02.d02:meVE.Lity5.text	@ltx/en_us_oca/me.m02.d01:meVE.AposGlory.text
ltx/en_us_oca/me.m02.d02:meVE.Lity6.incipit	@ltx/en_us_oca/me.m02.d01:meMA.AposGlory.incipit
ltx/en_us_oca/me.m02.d02:meVE.Lity6.melody	
ltx/en_us_oca/me.m02.d02:meVE.Lity6.mode	@ltx/en_us_oca/miscellanea:misc.Mode2
ltx/en_us_oca/me.m02.d02:meVE.Lity6.poet	@ltx/en_us_oca/poets:po.GermanouOiDeIoannouMonachou
ltx/en_us_oca/me.m02.d02:meVE.Lity6.text	@ltx/en_us_oca/me.m02.d01:meMA.AposGlory.text
ltx/en_us_oca/me.m02.d02:meVE.Lity7.incipit	…
ltx/en_us_oca/me.m02.d02:meVE.Lity7.melody	
ltx/en_us_oca/me.m02.d02:meVE.Lity7.mode	@ltx/en_us_oca/miscellanea:misc.Mode2
ltx/en_us_oca/me.m02.d02:meVE.Lity7.poet	@ltx/en_us_oca/poets:po.AnatoliouOiDeAndreouIerosolymitou
ltx/en_us_oca/me.m02.d02:meVE.Lity7.text	
ltx/en_us_oca/me.m02.d02:meVE.Lity8.incipit	…
ltx/en_us_oca/me.m02.d02:meVE.Lity8.melody	
ltx/en_us_oca/me.m02.d02:meVE.Lity8.mode	@ltx/en_us_oca/miscellanea:misc.Mode4
ltx/en_us_oca/me.m02.d02:meVE.Lity8.poet	@ltx/en_us_oca/poets:po.AndreouKritis
ltx/en_us_oca/me.m02.d02:meVE.Lity8.text	
ltx/en_us_oca/me.m02.d02:meVE.LityBoth.incipit	…
ltx/en_us_oca/me.m02.d02:meVE.LityBoth.melody	
ltx/en_us_oca/me.m02.d02:meVE.LityBoth.mode	@ltx/en_us_oca/miscellanea:misc.Mode5
ltx/en_us_oca/me.m02.d02:meVE.LityBoth.poet	@ltx/en_us_oca/poets:po.GermanouOiDeAnatoliou
ltx/en_us_oca/me.m02.d02:meVE.LityBoth.text	
ltx/en_us_oca/me.m02.d02:meVE.LityGlory.incipit	…
ltx/en_us_oca/me.m02.d02:meVE.LityGlory.melody	
ltx/en_us_oca/me.m02.d02:meVE.LityGlory.mode	@ltx/en_us_oca/miscellanea:misc.Mode5
ltx/en_us_oca/me.m02.d02:meVE.LityGlory.poet	@ltx/en_us_oca/poets:po.AndreouKritis
ltx/en_us_oca/me.m02.d02:meVE.LityGlory.text	
ltx/en_us_oca/me.m02.d02:meVE.MM.Stichera123as567.text	
ltx/en_us_oca/me.m02.d02:meVE.MM.Stichera123as8910.text	
ltx/en_us_oca/me.m02.d02:meVE.SticGlory.incipit	…
ltx/en_us_oca/me.m02.d02:meVE.SticGlory.melody	
ltx/en_us_oca/me.m02.d02:meVE.SticGlory.mode	@ltx/en_us_oca/miscellanea:misc.Mode6
ltx/en_us_oca/me.m02.d02:meVE.SticGlory.poet	@ltx/en_us_oca/poets:po.IoannouMonachou
ltx/en_us_oca/me.m02.d02:meVE.SticGlory.text	
ltx/en_us_oca/me.m02.d02:meVE.Stichera01.incipit	…
ltx/en_us_oca/me.m02.d02:meVE.Stichera01.melody	
ltx/en_us_oca/me.m02.d02:meVE.Stichera01.mode	@ltx/en_us_oca/miscellanea:misc.Mode1
ltx/en_us_oca/me.m02.d02:meVE.Stichera01.poet	@ltx/en_us_oca/poets:po.GermanouPatriarchou
ltx/en_us_oca/me.m02.d02:meVE.Stichera01.text	
ltx/en_us_oca/me.m02.d02:meVE.Stichera02.incipit	…
ltx/en_us_oca/me.m02.d02:meVE.Stichera02.melody	
ltx/en_us_oca/me.m02.d02:meVE.Stichera02.mode	@ltx/en_us_oca/miscellanea:misc.Mode1
ltx/en_us_oca/me.m02.d02:meVE.Stichera02.text	
ltx/en_us_oca/me.m02.d02:meVE.Stichera03.incipit	…
ltx/en_us_oca/me.m02.d02:meVE.Stichera03.melody	
ltx/en_us_oca/me.m02.d02:meVE.Stichera03.mode	@ltx/en_us_oca/miscellanea:misc.Mode1
ltx/en_us_oca/me.m02.d02:meVE.Stichera03.text	
