ltx/en_us_oca/me.m07.d29:meDA.commemoration.first	
ltx/en_us_oca/me.m07.d29:meDA.commemoration.first_name	
ltx/en_us_oca/me.m07.d29:meDA.commemoration.first_short	
ltx/en_us_oca/me.m07.d29:meDA.commemoration.first_title	
ltx/en_us_oca/me.m07.d29:meDA.commemoration.full	
ltx/en_us_oca/me.m07.d29:meDA.commemoration.second_name	
ltx/en_us_oca/me.m07.d29:meDA.commemoration.second_title	
ltx/en_us_oca/me.m07.d29:meDA.date	
ltx/en_us_oca/me.m07.d29:meDA.fordate	
ltx/en_us_oca/me.m07.d29:meDA.insert1	
ltx/en_us_oca/me.m07.d29:meDA.insert2	
ltx/en_us_oca/me.m07.d29:meDA.note	
ltx/en_us_oca/me.m07.d29:meDA.pdfcoverdate	
ltx/en_us_oca/me.m07.d29:meDA.pdfheaderdate	
ltx/en_us_oca/me.m07.d29:meHO.commemorations	
ltx/en_us_oca/me.m07.d29:meHO.note1	
ltx/en_us_oca/me.m07.d29:meHO.note2	
ltx/en_us_oca/me.m07.d29:meHO.number	
ltx/en_us_oca/me.m07.d29:meHO.rank	
ltx/en_us_oca/me.m07.d29:meLE.commemoration1	
ltx/en_us_oca/me.m07.d29:meLE.commemoration2	
ltx/en_us_oca/me.m07.d29:meLI.Kontakion1.incipit	…
ltx/en_us_oca/me.m07.d29:meLI.Kontakion1.melody	
ltx/en_us_oca/me.m07.d29:meLI.Kontakion1.mode	
ltx/en_us_oca/me.m07.d29:meLI.Kontakion1.text	
ltx/en_us_oca/me.m07.d29:meLI.Megalynarion.text	
ltx/en_us_oca/me.m07.d29:meMA.C1.acrostic.notice1	
ltx/en_us_oca/me.m07.d29:meMA.C1.acrostic.text	
ltx/en_us_oca/me.m07.d29:meMA.C1.acrostic.title	
ltx/en_us_oca/me.m07.d29:meMA.C1.title	@ltx/en_us_oca/titles:ti.CanonSaintM
ltx/en_us_oca/me.m07.d29:meMA.C1.verse	@ltx/en_us_oca/prayers:pr.verse_SaintM.text
ltx/en_us_oca/me.m07.d29:meMA.C2.acrostic.notice1	
ltx/en_us_oca/me.m07.d29:meMA.C2.acrostic.text	
ltx/en_us_oca/me.m07.d29:meMA.C2.acrostic.title	
ltx/en_us_oca/me.m07.d29:meMA.C2.title	@ltx/en_us_oca/titles:ti.CanonSaintW
ltx/en_us_oca/me.m07.d29:meMA.C2.verse	@ltx/en_us_oca/prayers:pr.verse_SaintW.text
ltx/en_us_oca/me.m07.d29:meMA.ExapTheotokion.incipit	…
ltx/en_us_oca/me.m07.d29:meMA.ExapTheotokion.melody	@ltx/en_us_oca/he.a.m3:heAU.EpeskepsatoImas.notmetered
ltx/en_us_oca/me.m07.d29:meMA.ExapTheotokion.mode	@ltx/en_us_oca/miscellanea:misc.Mode3
ltx/en_us_oca/me.m07.d29:meMA.ExapTheotokion.text	
ltx/en_us_oca/me.m07.d29:meMA.Exaposteilarion1.greekmelody	@ltx/en_us_oca/he.a.m3:heAU.EpeskepsatoImas.greekname
ltx/en_us_oca/me.m07.d29:meMA.Exaposteilarion1.incipit	…
ltx/en_us_oca/me.m07.d29:meMA.Exaposteilarion1.melody	@ltx/en_us_oca/he.a.m3:heAU.EpeskepsatoImas.notmetered
ltx/en_us_oca/me.m07.d29:meMA.Exaposteilarion1.mode	@ltx/en_us_oca/miscellanea:misc.Mode3
ltx/en_us_oca/me.m07.d29:meMA.Exaposteilarion1.text	
ltx/en_us_oca/me.m07.d29:meMA.Ode1C11.greekmelody	@ltx/en_us_oca/he.h.m4:heHE.ArmataFarao.greekname
ltx/en_us_oca/me.m07.d29:meMA.Ode1C11.incipit	…
ltx/en_us_oca/me.m07.d29:meMA.Ode1C11.melody	@ltx/en_us_oca/he.h.m4:heHE.ArmataFarao.notmetered
ltx/en_us_oca/me.m07.d29:meMA.Ode1C11.mode	@ltx/en_us_oca/miscellanea:misc.Mode4
ltx/en_us_oca/me.m07.d29:meMA.Ode1C11.ode	@ltx/en_us_oca/miscellanea:misc.Ode1
ltx/en_us_oca/me.m07.d29:meMA.Ode1C11.text	
ltx/en_us_oca/me.m07.d29:meMA.Ode1C12.incipit	…
ltx/en_us_oca/me.m07.d29:meMA.Ode1C12.melody	@ltx/en_us_oca/he.h.m4:heHE.ArmataFarao.notmetered
ltx/en_us_oca/me.m07.d29:meMA.Ode1C12.mode	@ltx/en_us_oca/miscellanea:misc.Mode4
ltx/en_us_oca/me.m07.d29:meMA.Ode1C12.ode	@ltx/en_us_oca/miscellanea:misc.Ode1
ltx/en_us_oca/me.m07.d29:meMA.Ode1C12.text	
ltx/en_us_oca/me.m07.d29:meMA.Ode1C13.incipit	…
ltx/en_us_oca/me.m07.d29:meMA.Ode1C13.melody	@ltx/en_us_oca/he.h.m4:heHE.ArmataFarao.notmetered
ltx/en_us_oca/me.m07.d29:meMA.Ode1C13.mode	@ltx/en_us_oca/miscellanea:misc.Mode4
ltx/en_us_oca/me.m07.d29:meMA.Ode1C13.ode	@ltx/en_us_oca/miscellanea:misc.Ode1
ltx/en_us_oca/me.m07.d29:meMA.Ode1C13.text	
ltx/en_us_oca/me.m07.d29:meMA.Ode1C1T.incipit	…
ltx/en_us_oca/me.m07.d29:meMA.Ode1C1T.melody	@ltx/en_us_oca/he.h.m4:heHE.ArmataFarao.notmetered
ltx/en_us_oca/me.m07.d29:meMA.Ode1C1T.mode	@ltx/en_us_oca/miscellanea:misc.Mode4
ltx/en_us_oca/me.m07.d29:meMA.Ode1C1T.ode	@ltx/en_us_oca/miscellanea:misc.Ode1
ltx/en_us_oca/me.m07.d29:meMA.Ode1C1T.text	
ltx/en_us_oca/me.m07.d29:meMA.Ode1C21.greekmelody	@ltx/en_us_oca/he.h.m4:heHE.ThalassisToErythraion.greekname
ltx/en_us_oca/me.m07.d29:meMA.Ode1C21.incipit	…
ltx/en_us_oca/me.m07.d29:meMA.Ode1C21.melody	@ltx/en_us_oca/he.h.m4:heHE.ThalassisToErythraion.notmetered
ltx/en_us_oca/me.m07.d29:meMA.Ode1C21.mode	@ltx/en_us_oca/miscellanea:misc.Mode4
ltx/en_us_oca/me.m07.d29:meMA.Ode1C21.ode	@ltx/en_us_oca/miscellanea:misc.Ode1
ltx/en_us_oca/me.m07.d29:meMA.Ode1C21.text	
ltx/en_us_oca/me.m07.d29:meMA.Ode1C22.incipit	…
ltx/en_us_oca/me.m07.d29:meMA.Ode1C22.melody	@ltx/en_us_oca/he.h.m4:heHE.ThalassisToErythraion.notmetered
ltx/en_us_oca/me.m07.d29:meMA.Ode1C22.mode	@ltx/en_us_oca/miscellanea:misc.Mode4
ltx/en_us_oca/me.m07.d29:meMA.Ode1C22.ode	@ltx/en_us_oca/miscellanea:misc.Ode1
ltx/en_us_oca/me.m07.d29:meMA.Ode1C22.text	
ltx/en_us_oca/me.m07.d29:meMA.Ode1C23.incipit	…
ltx/en_us_oca/me.m07.d29:meMA.Ode1C23.melody	@ltx/en_us_oca/he.h.m4:heHE.ThalassisToErythraion.notmetered
ltx/en_us_oca/me.m07.d29:meMA.Ode1C23.mode	@ltx/en_us_oca/miscellanea:misc.Mode4
ltx/en_us_oca/me.m07.d29:meMA.Ode1C23.ode	@ltx/en_us_oca/miscellanea:misc.Ode1
ltx/en_us_oca/me.m07.d29:meMA.Ode1C23.text	
ltx/en_us_oca/me.m07.d29:meMA.Ode1C2T.incipit	…
ltx/en_us_oca/me.m07.d29:meMA.Ode1C2T.melody	@ltx/en_us_oca/he.h.m4:heHE.ThalassisToErythraion.notmetered
ltx/en_us_oca/me.m07.d29:meMA.Ode1C2T.mode	@ltx/en_us_oca/miscellanea:misc.Mode4
ltx/en_us_oca/me.m07.d29:meMA.Ode1C2T.ode	@ltx/en_us_oca/miscellanea:misc.Ode1
ltx/en_us_oca/me.m07.d29:meMA.Ode1C2T.text	
ltx/en_us_oca/me.m07.d29:meMA.Ode3C11.greekmelody	@ltx/en_us_oca/he.h.m4:heHE.OStereonVrontin.greekname
ltx/en_us_oca/me.m07.d29:meMA.Ode3C11.incipit	…
ltx/en_us_oca/me.m07.d29:meMA.Ode3C11.melody	@ltx/en_us_oca/he.h.m4:heHE.OStereonVrontin.notmetered
ltx/en_us_oca/me.m07.d29:meMA.Ode3C11.mode	@ltx/en_us_oca/miscellanea:misc.Mode4
ltx/en_us_oca/me.m07.d29:meMA.Ode3C11.ode	@ltx/en_us_oca/miscellanea:misc.Ode3
ltx/en_us_oca/me.m07.d29:meMA.Ode3C11.text	
ltx/en_us_oca/me.m07.d29:meMA.Ode3C12.incipit	…
ltx/en_us_oca/me.m07.d29:meMA.Ode3C12.melody	@ltx/en_us_oca/he.h.m4:heHE.OStereonVrontin.notmetered
ltx/en_us_oca/me.m07.d29:meMA.Ode3C12.mode	@ltx/en_us_oca/miscellanea:misc.Mode4
ltx/en_us_oca/me.m07.d29:meMA.Ode3C12.ode	@ltx/en_us_oca/miscellanea:misc.Ode3
ltx/en_us_oca/me.m07.d29:meMA.Ode3C12.text	
ltx/en_us_oca/me.m07.d29:meMA.Ode3C13.incipit	…
ltx/en_us_oca/me.m07.d29:meMA.Ode3C13.melody	@ltx/en_us_oca/he.h.m4:heHE.OStereonVrontin.notmetered
ltx/en_us_oca/me.m07.d29:meMA.Ode3C13.mode	@ltx/en_us_oca/miscellanea:misc.Mode4
ltx/en_us_oca/me.m07.d29:meMA.Ode3C13.ode	@ltx/en_us_oca/miscellanea:misc.Ode3
ltx/en_us_oca/me.m07.d29:meMA.Ode3C13.text	
ltx/en_us_oca/me.m07.d29:meMA.Ode3C1T.incipit	…
ltx/en_us_oca/me.m07.d29:meMA.Ode3C1T.melody	@ltx/en_us_oca/he.h.m4:heHE.OStereonVrontin.notmetered
ltx/en_us_oca/me.m07.d29:meMA.Ode3C1T.mode	@ltx/en_us_oca/miscellanea:misc.Mode4
ltx/en_us_oca/me.m07.d29:meMA.Ode3C1T.ode	@ltx/en_us_oca/miscellanea:misc.Ode3
ltx/en_us_oca/me.m07.d29:meMA.Ode3C1T.text	
ltx/en_us_oca/me.m07.d29:meMA.Ode3C21.greekmelody	@ltx/en_us_oca/he.h.m4:heHE.EffrainetaiEpiSoi.greekname
ltx/en_us_oca/me.m07.d29:meMA.Ode3C21.incipit	…
ltx/en_us_oca/me.m07.d29:meMA.Ode3C21.melody	@ltx/en_us_oca/he.h.m4:heHE.EffrainetaiEpiSoi.notmetered
ltx/en_us_oca/me.m07.d29:meMA.Ode3C21.mode	@ltx/en_us_oca/miscellanea:misc.Mode4
ltx/en_us_oca/me.m07.d29:meMA.Ode3C21.ode	@ltx/en_us_oca/miscellanea:misc.Ode3
ltx/en_us_oca/me.m07.d29:meMA.Ode3C21.text	
ltx/en_us_oca/me.m07.d29:meMA.Ode3C22.incipit	…
ltx/en_us_oca/me.m07.d29:meMA.Ode3C22.melody	@ltx/en_us_oca/he.h.m4:heHE.EffrainetaiEpiSoi.notmetered
ltx/en_us_oca/me.m07.d29:meMA.Ode3C22.mode	@ltx/en_us_oca/miscellanea:misc.Mode4
ltx/en_us_oca/me.m07.d29:meMA.Ode3C22.ode	@ltx/en_us_oca/miscellanea:misc.Ode3
ltx/en_us_oca/me.m07.d29:meMA.Ode3C22.text	
ltx/en_us_oca/me.m07.d29:meMA.Ode3C23.incipit	…
ltx/en_us_oca/me.m07.d29:meMA.Ode3C23.melody	@ltx/en_us_oca/he.h.m4:heHE.EffrainetaiEpiSoi.notmetered
ltx/en_us_oca/me.m07.d29:meMA.Ode3C23.mode	@ltx/en_us_oca/miscellanea:misc.Mode4
ltx/en_us_oca/me.m07.d29:meMA.Ode3C23.ode	@ltx/en_us_oca/miscellanea:misc.Ode3
ltx/en_us_oca/me.m07.d29:meMA.Ode3C23.text	
ltx/en_us_oca/me.m07.d29:meMA.Ode3C2T.incipit	…
ltx/en_us_oca/me.m07.d29:meMA.Ode3C2T.melody	@ltx/en_us_oca/he.h.m4:heHE.EffrainetaiEpiSoi.notmetered
ltx/en_us_oca/me.m07.d29:meMA.Ode3C2T.mode	@ltx/en_us_oca/miscellanea:misc.Mode4
ltx/en_us_oca/me.m07.d29:meMA.Ode3C2T.ode	@ltx/en_us_oca/miscellanea:misc.Ode3
ltx/en_us_oca/me.m07.d29:meMA.Ode3C2T.text	
ltx/en_us_oca/me.m07.d29:meMA.Ode3H.greekmelody	@ltx/en_us_oca/he.h.m4:heHE.EffrainetaiEpiSoi.greekname
ltx/en_us_oca/me.m07.d29:meMA.Ode3H.incipit	@ltx/en_us_oca/he.h.m4:heHE.EffrainetaiEpiSoi.incipit
ltx/en_us_oca/me.m07.d29:meMA.Ode3H.melody	@ltx/en_us_oca/he.h.m4:heHE.EffrainetaiEpiSoi.melody
ltx/en_us_oca/me.m07.d29:meMA.Ode3H.mode	@ltx/en_us_oca/miscellanea:misc.Mode4
ltx/en_us_oca/me.m07.d29:meMA.Ode3H.ode	@ltx/en_us_oca/miscellanea:misc.Ode3
ltx/en_us_oca/me.m07.d29:meMA.Ode3H.text	@ltx/en_us_oca/he.h.m4:heHE.EffrainetaiEpiSoi.text
ltx/en_us_oca/me.m07.d29:meMA.Ode3Kathisma1.greekmelody	@ltx/en_us_oca/he.a.m3:heAU.TheiasPisteos.greekname
ltx/en_us_oca/me.m07.d29:meMA.Ode3Kathisma1.incipit	…
ltx/en_us_oca/me.m07.d29:meMA.Ode3Kathisma1.melody	@ltx/en_us_oca/he.a.m3:heAU.TheiasPisteos.notmetered
ltx/en_us_oca/me.m07.d29:meMA.Ode3Kathisma1.mode	@ltx/en_us_oca/miscellanea:misc.Mode3
ltx/en_us_oca/me.m07.d29:meMA.Ode3Kathisma1.text	
ltx/en_us_oca/me.m07.d29:meMA.Ode3Kathisma2.greekmelody	@ltx/en_us_oca/he.a.m4:heAU.OYpsotheisEnToStavro.greekname
ltx/en_us_oca/me.m07.d29:meMA.Ode3Kathisma2.incipit	…
ltx/en_us_oca/me.m07.d29:meMA.Ode3Kathisma2.melody	@ltx/en_us_oca/he.a.m4:heAU.OYpsotheisEnToStavro.notmetered
ltx/en_us_oca/me.m07.d29:meMA.Ode3Kathisma2.mode	@ltx/en_us_oca/miscellanea:misc.Mode4
ltx/en_us_oca/me.m07.d29:meMA.Ode3Kathisma2.text	
ltx/en_us_oca/me.m07.d29:meMA.Ode3KathismaSt.incipit	…
ltx/en_us_oca/me.m07.d29:meMA.Ode3KathismaSt.melody	@ltx/en_us_oca/he.a.m4:heAU.OYpsotheisEnToStavro.notmetered
ltx/en_us_oca/me.m07.d29:meMA.Ode3KathismaSt.mode	@ltx/en_us_oca/miscellanea:misc.Mode4
ltx/en_us_oca/me.m07.d29:meMA.Ode3KathismaSt.text	
ltx/en_us_oca/me.m07.d29:meMA.Ode3KathismaT.incipit	@ltx/en_us_oca/oc.m4.d3:ocVE.ApolTheotokionVM.incipit
ltx/en_us_oca/me.m07.d29:meMA.Ode3KathismaT.melody	@ltx/en_us_oca/he.a.m4:heAU.OYpsotheisEnToStavro.notmetered
ltx/en_us_oca/me.m07.d29:meMA.Ode3KathismaT.mode	@ltx/en_us_oca/miscellanea:misc.Mode4
ltx/en_us_oca/me.m07.d29:meMA.Ode3KathismaT.text	@ltx/en_us_oca/oc.m4.d3:ocVE.ApolTheotokionVM.text
ltx/en_us_oca/me.m07.d29:meMA.Ode4C11.greekmelody	@ltx/en_us_oca/he.h.m4:heHE.EisakikoaOTheos.greekname
ltx/en_us_oca/me.m07.d29:meMA.Ode4C11.incipit	…
ltx/en_us_oca/me.m07.d29:meMA.Ode4C11.melody	@ltx/en_us_oca/he.h.m4:heHE.EisakikoaOTheos.notmetered
ltx/en_us_oca/me.m07.d29:meMA.Ode4C11.mode	@ltx/en_us_oca/miscellanea:misc.Mode4
ltx/en_us_oca/me.m07.d29:meMA.Ode4C11.ode	@ltx/en_us_oca/miscellanea:misc.Ode4
ltx/en_us_oca/me.m07.d29:meMA.Ode4C11.text	
ltx/en_us_oca/me.m07.d29:meMA.Ode4C12.incipit	…
ltx/en_us_oca/me.m07.d29:meMA.Ode4C12.melody	@ltx/en_us_oca/he.h.m4:heHE.EisakikoaOTheos.notmetered
ltx/en_us_oca/me.m07.d29:meMA.Ode4C12.mode	@ltx/en_us_oca/miscellanea:misc.Mode4
ltx/en_us_oca/me.m07.d29:meMA.Ode4C12.ode	@ltx/en_us_oca/miscellanea:misc.Ode4
ltx/en_us_oca/me.m07.d29:meMA.Ode4C12.text	
ltx/en_us_oca/me.m07.d29:meMA.Ode4C13.incipit	…
ltx/en_us_oca/me.m07.d29:meMA.Ode4C13.melody	@ltx/en_us_oca/he.h.m4:heHE.EisakikoaOTheos.notmetered
ltx/en_us_oca/me.m07.d29:meMA.Ode4C13.mode	@ltx/en_us_oca/miscellanea:misc.Mode4
ltx/en_us_oca/me.m07.d29:meMA.Ode4C13.ode	@ltx/en_us_oca/miscellanea:misc.Ode4
ltx/en_us_oca/me.m07.d29:meMA.Ode4C13.text	
ltx/en_us_oca/me.m07.d29:meMA.Ode4C1T.incipit	…
ltx/en_us_oca/me.m07.d29:meMA.Ode4C1T.melody	@ltx/en_us_oca/he.h.m4:heHE.EisakikoaOTheos.notmetered
ltx/en_us_oca/me.m07.d29:meMA.Ode4C1T.mode	@ltx/en_us_oca/miscellanea:misc.Mode4
ltx/en_us_oca/me.m07.d29:meMA.Ode4C1T.ode	@ltx/en_us_oca/miscellanea:misc.Ode4
ltx/en_us_oca/me.m07.d29:meMA.Ode4C1T.text	
ltx/en_us_oca/me.m07.d29:meMA.Ode4C21.greekmelody	@ltx/en_us_oca/he.h.m4:heHE.DiAgapisinOiktirmon.greekname
ltx/en_us_oca/me.m07.d29:meMA.Ode4C21.incipit	…
ltx/en_us_oca/me.m07.d29:meMA.Ode4C21.melody	@ltx/en_us_oca/he.h.m4:heHE.DiAgapisinOiktirmon.notmetered
ltx/en_us_oca/me.m07.d29:meMA.Ode4C21.mode	@ltx/en_us_oca/miscellanea:misc.Mode4
ltx/en_us_oca/me.m07.d29:meMA.Ode4C21.ode	@ltx/en_us_oca/miscellanea:misc.Ode4
ltx/en_us_oca/me.m07.d29:meMA.Ode4C21.text	
ltx/en_us_oca/me.m07.d29:meMA.Ode4C22.incipit	…
ltx/en_us_oca/me.m07.d29:meMA.Ode4C22.melody	@ltx/en_us_oca/he.h.m4:heHE.DiAgapisinOiktirmon.notmetered
ltx/en_us_oca/me.m07.d29:meMA.Ode4C22.mode	@ltx/en_us_oca/miscellanea:misc.Mode4
ltx/en_us_oca/me.m07.d29:meMA.Ode4C22.ode	@ltx/en_us_oca/miscellanea:misc.Ode4
ltx/en_us_oca/me.m07.d29:meMA.Ode4C22.text	
ltx/en_us_oca/me.m07.d29:meMA.Ode4C23.incipit	…
ltx/en_us_oca/me.m07.d29:meMA.Ode4C23.melody	@ltx/en_us_oca/he.h.m4:heHE.DiAgapisinOiktirmon.notmetered
ltx/en_us_oca/me.m07.d29:meMA.Ode4C23.mode	@ltx/en_us_oca/miscellanea:misc.Mode4
ltx/en_us_oca/me.m07.d29:meMA.Ode4C23.ode	@ltx/en_us_oca/miscellanea:misc.Ode4
ltx/en_us_oca/me.m07.d29:meMA.Ode4C23.text	
ltx/en_us_oca/me.m07.d29:meMA.Ode4C2T.incipit	…
ltx/en_us_oca/me.m07.d29:meMA.Ode4C2T.melody	@ltx/en_us_oca/he.h.m4:heHE.DiAgapisinOiktirmon.notmetered
ltx/en_us_oca/me.m07.d29:meMA.Ode4C2T.mode	@ltx/en_us_oca/miscellanea:misc.Mode4
ltx/en_us_oca/me.m07.d29:meMA.Ode4C2T.ode	@ltx/en_us_oca/miscellanea:misc.Ode4
ltx/en_us_oca/me.m07.d29:meMA.Ode4C2T.text	
ltx/en_us_oca/me.m07.d29:meMA.Ode5C11.greekmelody	@ltx/en_us_oca/he.h.m4:heHE.AnateilonMoiKyrie.greekname
ltx/en_us_oca/me.m07.d29:meMA.Ode5C11.incipit	…
ltx/en_us_oca/me.m07.d29:meMA.Ode5C11.melody	@ltx/en_us_oca/he.h.m4:heHE.AnateilonMoiKyrie.notmetered
ltx/en_us_oca/me.m07.d29:meMA.Ode5C11.mode	@ltx/en_us_oca/miscellanea:misc.Mode4
ltx/en_us_oca/me.m07.d29:meMA.Ode5C11.ode	@ltx/en_us_oca/miscellanea:misc.Ode5
ltx/en_us_oca/me.m07.d29:meMA.Ode5C11.text	
ltx/en_us_oca/me.m07.d29:meMA.Ode5C12.incipit	…
ltx/en_us_oca/me.m07.d29:meMA.Ode5C12.melody	@ltx/en_us_oca/he.h.m4:heHE.AnateilonMoiKyrie.notmetered
ltx/en_us_oca/me.m07.d29:meMA.Ode5C12.mode	@ltx/en_us_oca/miscellanea:misc.Mode4
ltx/en_us_oca/me.m07.d29:meMA.Ode5C12.ode	@ltx/en_us_oca/miscellanea:misc.Ode5
ltx/en_us_oca/me.m07.d29:meMA.Ode5C12.text	
ltx/en_us_oca/me.m07.d29:meMA.Ode5C13.incipit	…
ltx/en_us_oca/me.m07.d29:meMA.Ode5C13.melody	@ltx/en_us_oca/he.h.m4:heHE.AnateilonMoiKyrie.notmetered
ltx/en_us_oca/me.m07.d29:meMA.Ode5C13.mode	@ltx/en_us_oca/miscellanea:misc.Mode4
ltx/en_us_oca/me.m07.d29:meMA.Ode5C13.ode	@ltx/en_us_oca/miscellanea:misc.Ode5
ltx/en_us_oca/me.m07.d29:meMA.Ode5C13.text	
ltx/en_us_oca/me.m07.d29:meMA.Ode5C1T.incipit	…
ltx/en_us_oca/me.m07.d29:meMA.Ode5C1T.melody	@ltx/en_us_oca/he.h.m4:heHE.AnateilonMoiKyrie.notmetered
ltx/en_us_oca/me.m07.d29:meMA.Ode5C1T.mode	@ltx/en_us_oca/miscellanea:misc.Mode4
ltx/en_us_oca/me.m07.d29:meMA.Ode5C1T.ode	@ltx/en_us_oca/miscellanea:misc.Ode5
ltx/en_us_oca/me.m07.d29:meMA.Ode5C1T.text	
ltx/en_us_oca/me.m07.d29:meMA.Ode5C21.greekmelody	@ltx/en_us_oca/he.h.m4:heHE.SyKyrieMouFos.greekname
ltx/en_us_oca/me.m07.d29:meMA.Ode5C21.incipit	…
ltx/en_us_oca/me.m07.d29:meMA.Ode5C21.melody	@ltx/en_us_oca/he.h.m4:heHE.SyKyrieMouFos.notmetered
ltx/en_us_oca/me.m07.d29:meMA.Ode5C21.mode	@ltx/en_us_oca/miscellanea:misc.Mode4
ltx/en_us_oca/me.m07.d29:meMA.Ode5C21.ode	@ltx/en_us_oca/miscellanea:misc.Ode5
ltx/en_us_oca/me.m07.d29:meMA.Ode5C21.text	
ltx/en_us_oca/me.m07.d29:meMA.Ode5C22.incipit	…
ltx/en_us_oca/me.m07.d29:meMA.Ode5C22.melody	@ltx/en_us_oca/he.h.m4:heHE.SyKyrieMouFos.notmetered
ltx/en_us_oca/me.m07.d29:meMA.Ode5C22.mode	@ltx/en_us_oca/miscellanea:misc.Mode4
ltx/en_us_oca/me.m07.d29:meMA.Ode5C22.ode	@ltx/en_us_oca/miscellanea:misc.Ode5
ltx/en_us_oca/me.m07.d29:meMA.Ode5C22.text	
ltx/en_us_oca/me.m07.d29:meMA.Ode5C23.incipit	…
ltx/en_us_oca/me.m07.d29:meMA.Ode5C23.melody	@ltx/en_us_oca/he.h.m4:heHE.SyKyrieMouFos.notmetered
ltx/en_us_oca/me.m07.d29:meMA.Ode5C23.mode	@ltx/en_us_oca/miscellanea:misc.Mode4
ltx/en_us_oca/me.m07.d29:meMA.Ode5C23.ode	@ltx/en_us_oca/miscellanea:misc.Ode5
ltx/en_us_oca/me.m07.d29:meMA.Ode5C23.text	
ltx/en_us_oca/me.m07.d29:meMA.Ode5C2T.incipit	…
ltx/en_us_oca/me.m07.d29:meMA.Ode5C2T.melody	@ltx/en_us_oca/he.h.m4:heHE.SyKyrieMouFos.notmetered
ltx/en_us_oca/me.m07.d29:meMA.Ode5C2T.mode	@ltx/en_us_oca/miscellanea:misc.Mode4
ltx/en_us_oca/me.m07.d29:meMA.Ode5C2T.ode	@ltx/en_us_oca/miscellanea:misc.Ode5
ltx/en_us_oca/me.m07.d29:meMA.Ode5C2T.text	
ltx/en_us_oca/me.m07.d29:meMA.Ode6C11.greekmelody	@ltx/en_us_oca/he.h.m4:heHE.TonPtaismatonTiZali.greekname
ltx/en_us_oca/me.m07.d29:meMA.Ode6C11.incipit	…
ltx/en_us_oca/me.m07.d29:meMA.Ode6C11.melody	@ltx/en_us_oca/he.h.m4:heHE.TonPtaismatonTiZali.notmetered
ltx/en_us_oca/me.m07.d29:meMA.Ode6C11.mode	@ltx/en_us_oca/miscellanea:misc.Mode4
ltx/en_us_oca/me.m07.d29:meMA.Ode6C11.ode	@ltx/en_us_oca/miscellanea:misc.Ode6
ltx/en_us_oca/me.m07.d29:meMA.Ode6C11.text	
ltx/en_us_oca/me.m07.d29:meMA.Ode6C12.incipit	…
ltx/en_us_oca/me.m07.d29:meMA.Ode6C12.melody	@ltx/en_us_oca/he.h.m4:heHE.TonPtaismatonTiZali.notmetered
ltx/en_us_oca/me.m07.d29:meMA.Ode6C12.mode	@ltx/en_us_oca/miscellanea:misc.Mode4
ltx/en_us_oca/me.m07.d29:meMA.Ode6C12.ode	@ltx/en_us_oca/miscellanea:misc.Ode6
ltx/en_us_oca/me.m07.d29:meMA.Ode6C12.text	
ltx/en_us_oca/me.m07.d29:meMA.Ode6C13.incipit	…
ltx/en_us_oca/me.m07.d29:meMA.Ode6C13.melody	@ltx/en_us_oca/he.h.m4:heHE.TonPtaismatonTiZali.notmetered
ltx/en_us_oca/me.m07.d29:meMA.Ode6C13.mode	@ltx/en_us_oca/miscellanea:misc.Mode4
ltx/en_us_oca/me.m07.d29:meMA.Ode6C13.ode	@ltx/en_us_oca/miscellanea:misc.Ode6
ltx/en_us_oca/me.m07.d29:meMA.Ode6C13.text	
ltx/en_us_oca/me.m07.d29:meMA.Ode6C1T.incipit	…
ltx/en_us_oca/me.m07.d29:meMA.Ode6C1T.melody	@ltx/en_us_oca/he.h.m4:heHE.TonPtaismatonTiZali.notmetered
ltx/en_us_oca/me.m07.d29:meMA.Ode6C1T.mode	@ltx/en_us_oca/miscellanea:misc.Mode4
ltx/en_us_oca/me.m07.d29:meMA.Ode6C1T.ode	@ltx/en_us_oca/miscellanea:misc.Ode6
ltx/en_us_oca/me.m07.d29:meMA.Ode6C1T.text	
ltx/en_us_oca/me.m07.d29:meMA.Ode6C21.greekmelody	@ltx/en_us_oca/he.h.m4:heHE.ThysoSoiMetaFonis.greekname
ltx/en_us_oca/me.m07.d29:meMA.Ode6C21.incipit	…
ltx/en_us_oca/me.m07.d29:meMA.Ode6C21.melody	@ltx/en_us_oca/he.h.m4:heHE.ThysoSoiMetaFonis.notmetered
ltx/en_us_oca/me.m07.d29:meMA.Ode6C21.mode	@ltx/en_us_oca/miscellanea:misc.Mode4
ltx/en_us_oca/me.m07.d29:meMA.Ode6C21.ode	@ltx/en_us_oca/miscellanea:misc.Ode6
ltx/en_us_oca/me.m07.d29:meMA.Ode6C21.text	
ltx/en_us_oca/me.m07.d29:meMA.Ode6C22.incipit	…
ltx/en_us_oca/me.m07.d29:meMA.Ode6C22.melody	@ltx/en_us_oca/he.h.m4:heHE.ThysoSoiMetaFonis.notmetered
ltx/en_us_oca/me.m07.d29:meMA.Ode6C22.mode	@ltx/en_us_oca/miscellanea:misc.Mode4
ltx/en_us_oca/me.m07.d29:meMA.Ode6C22.ode	@ltx/en_us_oca/miscellanea:misc.Ode6
ltx/en_us_oca/me.m07.d29:meMA.Ode6C22.text	
ltx/en_us_oca/me.m07.d29:meMA.Ode6C23.incipit	…
ltx/en_us_oca/me.m07.d29:meMA.Ode6C23.melody	@ltx/en_us_oca/he.h.m4:heHE.ThysoSoiMetaFonis.notmetered
ltx/en_us_oca/me.m07.d29:meMA.Ode6C23.mode	@ltx/en_us_oca/miscellanea:misc.Mode4
ltx/en_us_oca/me.m07.d29:meMA.Ode6C23.ode	@ltx/en_us_oca/miscellanea:misc.Ode6
ltx/en_us_oca/me.m07.d29:meMA.Ode6C23.text	
ltx/en_us_oca/me.m07.d29:meMA.Ode6C2T.incipit	…
ltx/en_us_oca/me.m07.d29:meMA.Ode6C2T.melody	@ltx/en_us_oca/he.h.m4:heHE.ThysoSoiMetaFonis.notmetered
ltx/en_us_oca/me.m07.d29:meMA.Ode6C2T.mode	@ltx/en_us_oca/miscellanea:misc.Mode4
ltx/en_us_oca/me.m07.d29:meMA.Ode6C2T.ode	@ltx/en_us_oca/miscellanea:misc.Ode6
ltx/en_us_oca/me.m07.d29:meMA.Ode6C2T.text	
ltx/en_us_oca/me.m07.d29:meMA.Ode6H.greekmelody	@ltx/en_us_oca/he.h.m4:heHE.ThysoSoiMetaFonis.greekname
ltx/en_us_oca/me.m07.d29:meMA.Ode6H.incipit	@ltx/en_us_oca/he.h.m4:heHE.ThysoSoiMetaFonis.incipit
ltx/en_us_oca/me.m07.d29:meMA.Ode6H.melody	@ltx/en_us_oca/he.h.m4:heHE.ThysoSoiMetaFonis.melody
ltx/en_us_oca/me.m07.d29:meMA.Ode6H.mode	@ltx/en_us_oca/miscellanea:misc.Mode4
ltx/en_us_oca/me.m07.d29:meMA.Ode6H.ode	@ltx/en_us_oca/miscellanea:misc.Ode6
ltx/en_us_oca/me.m07.d29:meMA.Ode6H.text	@ltx/en_us_oca/he.h.m4:heHE.ThysoSoiMetaFonis.text
ltx/en_us_oca/me.m07.d29:meMA.Ode7C11.greekmelody	@ltx/en_us_oca/he.h.m4:heHE.PyrFlegonEnKamino.greekname
ltx/en_us_oca/me.m07.d29:meMA.Ode7C11.incipit	…
ltx/en_us_oca/me.m07.d29:meMA.Ode7C11.melody	@ltx/en_us_oca/he.h.m4:heHE.PyrFlegonEnKamino.notmetered
ltx/en_us_oca/me.m07.d29:meMA.Ode7C11.mode	@ltx/en_us_oca/miscellanea:misc.Mode4
ltx/en_us_oca/me.m07.d29:meMA.Ode7C11.ode	@ltx/en_us_oca/miscellanea:misc.Ode7
ltx/en_us_oca/me.m07.d29:meMA.Ode7C11.text	
ltx/en_us_oca/me.m07.d29:meMA.Ode7C12.incipit	…
ltx/en_us_oca/me.m07.d29:meMA.Ode7C12.melody	@ltx/en_us_oca/he.h.m4:heHE.PyrFlegonEnKamino.notmetered
ltx/en_us_oca/me.m07.d29:meMA.Ode7C12.mode	@ltx/en_us_oca/miscellanea:misc.Mode4
ltx/en_us_oca/me.m07.d29:meMA.Ode7C12.ode	@ltx/en_us_oca/miscellanea:misc.Ode7
ltx/en_us_oca/me.m07.d29:meMA.Ode7C12.text	
ltx/en_us_oca/me.m07.d29:meMA.Ode7C13.incipit	…
ltx/en_us_oca/me.m07.d29:meMA.Ode7C13.melody	@ltx/en_us_oca/he.h.m4:heHE.PyrFlegonEnKamino.notmetered
ltx/en_us_oca/me.m07.d29:meMA.Ode7C13.mode	@ltx/en_us_oca/miscellanea:misc.Mode4
ltx/en_us_oca/me.m07.d29:meMA.Ode7C13.ode	@ltx/en_us_oca/miscellanea:misc.Ode7
ltx/en_us_oca/me.m07.d29:meMA.Ode7C13.text	
ltx/en_us_oca/me.m07.d29:meMA.Ode7C1T.incipit	…
ltx/en_us_oca/me.m07.d29:meMA.Ode7C1T.melody	@ltx/en_us_oca/he.h.m4:heHE.PyrFlegonEnKamino.notmetered
ltx/en_us_oca/me.m07.d29:meMA.Ode7C1T.mode	@ltx/en_us_oca/miscellanea:misc.Mode4
ltx/en_us_oca/me.m07.d29:meMA.Ode7C1T.ode	@ltx/en_us_oca/miscellanea:misc.Ode7
ltx/en_us_oca/me.m07.d29:meMA.Ode7C1T.text	
ltx/en_us_oca/me.m07.d29:meMA.Ode7C21.greekmelody	@ltx/en_us_oca/he.h.m4:heHE.EnTiKaminoAvramiaioi.greekname
ltx/en_us_oca/me.m07.d29:meMA.Ode7C21.incipit	…
ltx/en_us_oca/me.m07.d29:meMA.Ode7C21.melody	@ltx/en_us_oca/he.h.m4:heHE.EnTiKaminoAvramiaioi.notmetered
ltx/en_us_oca/me.m07.d29:meMA.Ode7C21.mode	@ltx/en_us_oca/miscellanea:misc.Mode4
ltx/en_us_oca/me.m07.d29:meMA.Ode7C21.ode	@ltx/en_us_oca/miscellanea:misc.Ode7
ltx/en_us_oca/me.m07.d29:meMA.Ode7C21.text	
ltx/en_us_oca/me.m07.d29:meMA.Ode7C22.incipit	…
ltx/en_us_oca/me.m07.d29:meMA.Ode7C22.melody	@ltx/en_us_oca/he.h.m4:heHE.EnTiKaminoAvramiaioi.notmetered
ltx/en_us_oca/me.m07.d29:meMA.Ode7C22.mode	@ltx/en_us_oca/miscellanea:misc.Mode4
ltx/en_us_oca/me.m07.d29:meMA.Ode7C22.ode	@ltx/en_us_oca/miscellanea:misc.Ode7
ltx/en_us_oca/me.m07.d29:meMA.Ode7C22.text	
ltx/en_us_oca/me.m07.d29:meMA.Ode7C23.incipit	…
ltx/en_us_oca/me.m07.d29:meMA.Ode7C23.melody	@ltx/en_us_oca/he.h.m4:heHE.EnTiKaminoAvramiaioi.notmetered
ltx/en_us_oca/me.m07.d29:meMA.Ode7C23.mode	@ltx/en_us_oca/miscellanea:misc.Mode4
ltx/en_us_oca/me.m07.d29:meMA.Ode7C23.ode	@ltx/en_us_oca/miscellanea:misc.Ode7
ltx/en_us_oca/me.m07.d29:meMA.Ode7C23.text	
ltx/en_us_oca/me.m07.d29:meMA.Ode7C2T.incipit	…
ltx/en_us_oca/me.m07.d29:meMA.Ode7C2T.melody	@ltx/en_us_oca/he.h.m4:heHE.EnTiKaminoAvramiaioi.notmetered
ltx/en_us_oca/me.m07.d29:meMA.Ode7C2T.mode	@ltx/en_us_oca/miscellanea:misc.Mode4
ltx/en_us_oca/me.m07.d29:meMA.Ode7C2T.ode	@ltx/en_us_oca/miscellanea:misc.Ode7
ltx/en_us_oca/me.m07.d29:meMA.Ode7C2T.text	
ltx/en_us_oca/me.m07.d29:meMA.Ode8C11.greekmelody	@ltx/en_us_oca/he.h.m4:heHE.TaSympantaDespota.greekname
ltx/en_us_oca/me.m07.d29:meMA.Ode8C11.incipit	…
ltx/en_us_oca/me.m07.d29:meMA.Ode8C11.melody	@ltx/en_us_oca/he.h.m4:heHE.TaSympantaDespota.notmetered
ltx/en_us_oca/me.m07.d29:meMA.Ode8C11.mode	@ltx/en_us_oca/miscellanea:misc.Mode4
ltx/en_us_oca/me.m07.d29:meMA.Ode8C11.ode	@ltx/en_us_oca/miscellanea:misc.Ode8
ltx/en_us_oca/me.m07.d29:meMA.Ode8C11.text	
ltx/en_us_oca/me.m07.d29:meMA.Ode8C12.incipit	…
ltx/en_us_oca/me.m07.d29:meMA.Ode8C12.melody	@ltx/en_us_oca/he.h.m4:heHE.TaSympantaDespota.notmetered
ltx/en_us_oca/me.m07.d29:meMA.Ode8C12.mode	@ltx/en_us_oca/miscellanea:misc.Mode4
ltx/en_us_oca/me.m07.d29:meMA.Ode8C12.ode	@ltx/en_us_oca/miscellanea:misc.Ode8
ltx/en_us_oca/me.m07.d29:meMA.Ode8C12.text	
ltx/en_us_oca/me.m07.d29:meMA.Ode8C13.incipit	…
ltx/en_us_oca/me.m07.d29:meMA.Ode8C13.melody	@ltx/en_us_oca/he.h.m4:heHE.TaSympantaDespota.notmetered
ltx/en_us_oca/me.m07.d29:meMA.Ode8C13.mode	@ltx/en_us_oca/miscellanea:misc.Mode4
ltx/en_us_oca/me.m07.d29:meMA.Ode8C13.ode	@ltx/en_us_oca/miscellanea:misc.Ode8
ltx/en_us_oca/me.m07.d29:meMA.Ode8C13.text	
ltx/en_us_oca/me.m07.d29:meMA.Ode8C1T.incipit	…
ltx/en_us_oca/me.m07.d29:meMA.Ode8C1T.melody	@ltx/en_us_oca/he.h.m4:heHE.TaSympantaDespota.notmetered
ltx/en_us_oca/me.m07.d29:meMA.Ode8C1T.mode	@ltx/en_us_oca/miscellanea:misc.Mode4
ltx/en_us_oca/me.m07.d29:meMA.Ode8C1T.ode	@ltx/en_us_oca/miscellanea:misc.Ode8
ltx/en_us_oca/me.m07.d29:meMA.Ode8C1T.text	
ltx/en_us_oca/me.m07.d29:meMA.Ode8C21.greekmelody	@ltx/en_us_oca/he.h.m4:heHE.CheirasEkpetasasDaniil.greekname
ltx/en_us_oca/me.m07.d29:meMA.Ode8C21.incipit	…
ltx/en_us_oca/me.m07.d29:meMA.Ode8C21.melody	@ltx/en_us_oca/he.h.m4:heHE.CheirasEkpetasasDaniil.notmetered
ltx/en_us_oca/me.m07.d29:meMA.Ode8C21.mode	@ltx/en_us_oca/miscellanea:misc.Mode4
ltx/en_us_oca/me.m07.d29:meMA.Ode8C21.ode	@ltx/en_us_oca/miscellanea:misc.Ode8
ltx/en_us_oca/me.m07.d29:meMA.Ode8C21.text	
ltx/en_us_oca/me.m07.d29:meMA.Ode8C22.incipit	…
ltx/en_us_oca/me.m07.d29:meMA.Ode8C22.melody	@ltx/en_us_oca/he.h.m4:heHE.CheirasEkpetasasDaniil.notmetered
ltx/en_us_oca/me.m07.d29:meMA.Ode8C22.mode	@ltx/en_us_oca/miscellanea:misc.Mode4
ltx/en_us_oca/me.m07.d29:meMA.Ode8C22.ode	@ltx/en_us_oca/miscellanea:misc.Ode8
ltx/en_us_oca/me.m07.d29:meMA.Ode8C22.text	
ltx/en_us_oca/me.m07.d29:meMA.Ode8C23.incipit	…
ltx/en_us_oca/me.m07.d29:meMA.Ode8C23.melody	@ltx/en_us_oca/he.h.m4:heHE.CheirasEkpetasasDaniil.notmetered
ltx/en_us_oca/me.m07.d29:meMA.Ode8C23.mode	@ltx/en_us_oca/miscellanea:misc.Mode4
ltx/en_us_oca/me.m07.d29:meMA.Ode8C23.ode	@ltx/en_us_oca/miscellanea:misc.Ode8
ltx/en_us_oca/me.m07.d29:meMA.Ode8C23.text	
ltx/en_us_oca/me.m07.d29:meMA.Ode8C2T.incipit	…
ltx/en_us_oca/me.m07.d29:meMA.Ode8C2T.melody	@ltx/en_us_oca/he.h.m4:heHE.CheirasEkpetasasDaniil.notmetered
ltx/en_us_oca/me.m07.d29:meMA.Ode8C2T.mode	@ltx/en_us_oca/miscellanea:misc.Mode4
ltx/en_us_oca/me.m07.d29:meMA.Ode8C2T.ode	@ltx/en_us_oca/miscellanea:misc.Ode8
ltx/en_us_oca/me.m07.d29:meMA.Ode8C2T.text	
ltx/en_us_oca/me.m07.d29:meMA.Ode8H.greekmelody	@ltx/en_us_oca/he.h.m4:heHE.CheirasEkpetasasDaniil.greekname
ltx/en_us_oca/me.m07.d29:meMA.Ode8H.incipit	@ltx/en_us_oca/he.h.m4:heHE.CheirasEkpetasasDaniil.incipit
ltx/en_us_oca/me.m07.d29:meMA.Ode8H.melody	@ltx/en_us_oca/he.h.m4:heHE.CheirasEkpetasasDaniil.melody
ltx/en_us_oca/me.m07.d29:meMA.Ode8H.mode	@ltx/en_us_oca/miscellanea:misc.Mode4
ltx/en_us_oca/me.m07.d29:meMA.Ode8H.ode	@ltx/en_us_oca/miscellanea:misc.Ode8
ltx/en_us_oca/me.m07.d29:meMA.Ode8H.text	@ltx/en_us_oca/he.h.m4:heHE.CheirasEkpetasasDaniil.text
ltx/en_us_oca/me.m07.d29:meMA.Ode9C11.greekmelody	@ltx/en_us_oca/he.h.m4:heHE.TonAsporonTokonSou.greekname
ltx/en_us_oca/me.m07.d29:meMA.Ode9C11.incipit	…
ltx/en_us_oca/me.m07.d29:meMA.Ode9C11.melody	@ltx/en_us_oca/he.h.m4:heHE.TonAsporonTokonSou.notmetered
ltx/en_us_oca/me.m07.d29:meMA.Ode9C11.mode	@ltx/en_us_oca/miscellanea:misc.Mode4
ltx/en_us_oca/me.m07.d29:meMA.Ode9C11.ode	@ltx/en_us_oca/miscellanea:misc.Ode9
ltx/en_us_oca/me.m07.d29:meMA.Ode9C11.text	
ltx/en_us_oca/me.m07.d29:meMA.Ode9C12.incipit	…
ltx/en_us_oca/me.m07.d29:meMA.Ode9C12.melody	@ltx/en_us_oca/he.h.m4:heHE.TonAsporonTokonSou.notmetered
ltx/en_us_oca/me.m07.d29:meMA.Ode9C12.mode	@ltx/en_us_oca/miscellanea:misc.Mode4
ltx/en_us_oca/me.m07.d29:meMA.Ode9C12.ode	@ltx/en_us_oca/miscellanea:misc.Ode9
ltx/en_us_oca/me.m07.d29:meMA.Ode9C12.text	
ltx/en_us_oca/me.m07.d29:meMA.Ode9C13.incipit	…
ltx/en_us_oca/me.m07.d29:meMA.Ode9C13.melody	@ltx/en_us_oca/he.h.m4:heHE.TonAsporonTokonSou.notmetered
ltx/en_us_oca/me.m07.d29:meMA.Ode9C13.mode	@ltx/en_us_oca/miscellanea:misc.Mode4
ltx/en_us_oca/me.m07.d29:meMA.Ode9C13.ode	@ltx/en_us_oca/miscellanea:misc.Ode9
ltx/en_us_oca/me.m07.d29:meMA.Ode9C13.text	
ltx/en_us_oca/me.m07.d29:meMA.Ode9C14.incipit	…
ltx/en_us_oca/me.m07.d29:meMA.Ode9C14.melody	@ltx/en_us_oca/he.h.m4:heHE.TonAsporonTokonSou.notmetered
ltx/en_us_oca/me.m07.d29:meMA.Ode9C14.mode	@ltx/en_us_oca/miscellanea:misc.Mode4
ltx/en_us_oca/me.m07.d29:meMA.Ode9C14.ode	@ltx/en_us_oca/miscellanea:misc.Ode9
ltx/en_us_oca/me.m07.d29:meMA.Ode9C14.text	
ltx/en_us_oca/me.m07.d29:meMA.Ode9C1T.incipit	…
ltx/en_us_oca/me.m07.d29:meMA.Ode9C1T.melody	@ltx/en_us_oca/he.h.m4:heHE.TonAsporonTokonSou.notmetered
ltx/en_us_oca/me.m07.d29:meMA.Ode9C1T.mode	@ltx/en_us_oca/miscellanea:misc.Mode4
ltx/en_us_oca/me.m07.d29:meMA.Ode9C1T.ode	@ltx/en_us_oca/miscellanea:misc.Ode9
ltx/en_us_oca/me.m07.d29:meMA.Ode9C1T.text	
ltx/en_us_oca/me.m07.d29:meMA.Ode9C21.greekmelody	@ltx/en_us_oca/he.h.m4:heHE.LithosAcheirotmitos.greekname
ltx/en_us_oca/me.m07.d29:meMA.Ode9C21.incipit	…
ltx/en_us_oca/me.m07.d29:meMA.Ode9C21.melody	@ltx/en_us_oca/he.h.m4:heHE.LithosAcheirotmitos.notmetered
ltx/en_us_oca/me.m07.d29:meMA.Ode9C21.mode	@ltx/en_us_oca/miscellanea:misc.Mode4
ltx/en_us_oca/me.m07.d29:meMA.Ode9C21.ode	@ltx/en_us_oca/miscellanea:misc.Ode9
ltx/en_us_oca/me.m07.d29:meMA.Ode9C21.text	
ltx/en_us_oca/me.m07.d29:meMA.Ode9C22.incipit	…
ltx/en_us_oca/me.m07.d29:meMA.Ode9C22.melody	@ltx/en_us_oca/he.h.m4:heHE.LithosAcheirotmitos.notmetered
ltx/en_us_oca/me.m07.d29:meMA.Ode9C22.mode	@ltx/en_us_oca/miscellanea:misc.Mode4
ltx/en_us_oca/me.m07.d29:meMA.Ode9C22.ode	@ltx/en_us_oca/miscellanea:misc.Ode9
ltx/en_us_oca/me.m07.d29:meMA.Ode9C22.text	
ltx/en_us_oca/me.m07.d29:meMA.Ode9C23.incipit	…
ltx/en_us_oca/me.m07.d29:meMA.Ode9C23.melody	@ltx/en_us_oca/he.h.m4:heHE.LithosAcheirotmitos.notmetered
ltx/en_us_oca/me.m07.d29:meMA.Ode9C23.mode	@ltx/en_us_oca/miscellanea:misc.Mode4
ltx/en_us_oca/me.m07.d29:meMA.Ode9C23.ode	@ltx/en_us_oca/miscellanea:misc.Ode9
ltx/en_us_oca/me.m07.d29:meMA.Ode9C23.text	
ltx/en_us_oca/me.m07.d29:meMA.Ode9C2T.incipit	…
ltx/en_us_oca/me.m07.d29:meMA.Ode9C2T.melody	@ltx/en_us_oca/he.h.m4:heHE.LithosAcheirotmitos.notmetered
ltx/en_us_oca/me.m07.d29:meMA.Ode9C2T.mode	@ltx/en_us_oca/miscellanea:misc.Mode4
ltx/en_us_oca/me.m07.d29:meMA.Ode9C2T.ode	@ltx/en_us_oca/miscellanea:misc.Ode9
ltx/en_us_oca/me.m07.d29:meMA.Ode9C2T.text	
ltx/en_us_oca/me.m07.d29:meMA.Ode9H.greekmelody	@ltx/en_us_oca/he.h.m4:heHE.LithosAcheirotmitos.greekname
ltx/en_us_oca/me.m07.d29:meMA.Ode9H.incipit	@ltx/en_us_oca/he.h.m4:heHE.LithosAcheirotmitos.incipit
ltx/en_us_oca/me.m07.d29:meMA.Ode9H.melody	@ltx/en_us_oca/he.h.m4:heHE.LithosAcheirotmitos.melody
ltx/en_us_oca/me.m07.d29:meMA.Ode9H.mode	@ltx/en_us_oca/miscellanea:misc.Mode4
ltx/en_us_oca/me.m07.d29:meMA.Ode9H.ode	@ltx/en_us_oca/miscellanea:misc.Ode9
ltx/en_us_oca/me.m07.d29:meMA.Ode9H.text	@ltx/en_us_oca/he.h.m4:heHE.LithosAcheirotmitos.text
ltx/en_us_oca/me.m07.d29:meVE.Apolytikion1ger.greekmelody	@ltx/en_us_oca/he.a.m3:heAU.TheiasPisteos.greekname
ltx/en_us_oca/me.m07.d29:meVE.Apolytikion1ger.incipit	…
ltx/en_us_oca/me.m07.d29:meVE.Apolytikion1ger.melody	@ltx/en_us_oca/he.a.m3:heAU.TheiasPisteos.notmetered
ltx/en_us_oca/me.m07.d29:meVE.Apolytikion1ger.mode	@ltx/en_us_oca/miscellanea:misc.Mode3
ltx/en_us_oca/me.m07.d29:meVE.Apolytikion1ger.poet	@ltx/en_us_oca/poets:po.Gerasimou
ltx/en_us_oca/me.m07.d29:meVE.Apolytikion1ger.text	
ltx/en_us_oca/me.m07.d29:meVE.Apolytikion2ger.greekmelody	@ltx/en_us_oca/he.a.m1:heAU.TonTafonSouSotir.greekname
ltx/en_us_oca/me.m07.d29:meVE.Apolytikion2ger.incipit	…
ltx/en_us_oca/me.m07.d29:meVE.Apolytikion2ger.melody	@ltx/en_us_oca/he.a.m1:heAU.TonTafonSouSotir.notmetered
ltx/en_us_oca/me.m07.d29:meVE.Apolytikion2ger.mode	@ltx/en_us_oca/miscellanea:misc.Mode1
ltx/en_us_oca/me.m07.d29:meVE.Apolytikion2ger.poet	@ltx/en_us_oca/poets:po.Gerasimou
ltx/en_us_oca/me.m07.d29:meVE.Apolytikion2ger.text	
ltx/en_us_oca/me.m07.d29:meVE.SticStavrotheotokion.greekmelody	@ltx/en_us_oca/he.a.m4:heAU.OsGennaionEnMartysi.greekname
ltx/en_us_oca/me.m07.d29:meVE.SticStavrotheotokion.incipit	…
ltx/en_us_oca/me.m07.d29:meVE.SticStavrotheotokion.melody	@ltx/en_us_oca/he.a.m4:heAU.OsGennaionEnMartysi.notmetered
ltx/en_us_oca/me.m07.d29:meVE.SticStavrotheotokion.mode	@ltx/en_us_oca/miscellanea:misc.Mode4
ltx/en_us_oca/me.m07.d29:meVE.SticStavrotheotokion.text	
ltx/en_us_oca/me.m07.d29:meVE.SticTheotokion.greekmelody	@ltx/en_us_oca/he.a.m4:heAU.OsGennaionEnMartysi.greekname
ltx/en_us_oca/me.m07.d29:meVE.SticTheotokion.incipit	…
ltx/en_us_oca/me.m07.d29:meVE.SticTheotokion.melody	@ltx/en_us_oca/he.a.m4:heAU.OsGennaionEnMartysi.notmetered
ltx/en_us_oca/me.m07.d29:meVE.SticTheotokion.mode	@ltx/en_us_oca/miscellanea:misc.Mode4
ltx/en_us_oca/me.m07.d29:meVE.SticTheotokion.text	
ltx/en_us_oca/me.m07.d29:meVE.Stichera01.greekmelody	@ltx/en_us_oca/he.a.m8:heAU.OTouParadoxou.greekname
ltx/en_us_oca/me.m07.d29:meVE.Stichera01.incipit	Godly minded martyr Callinicus, ⁄…
ltx/en_us_oca/me.m07.d29:meVE.Stichera01.melody	@ltx/en_us_oca/he.a.m8:heAU.OTouParadoxou.notmetered
ltx/en_us_oca/me.m07.d29:meVE.Stichera01.mode	@ltx/en_us_oca/miscellanea:misc.Mode8
ltx/en_us_oca/me.m07.d29:meVE.Stichera01.text	Godly minded martyr Callinicus, ⁄ you devoutly preferred death above life: ⁄ You revealed a faithful image of the death of Christ! ⁄ Therefore you obtained immortality and unending joy! ⁄ You have made your dwelling with the ranks of angels, glorious one, ⁄⁄ where all the champions rejoice!
ltx/en_us_oca/me.m07.d29:meVE.Stichera02.incipit	All-blessed martyr Callinicus, ⁄ you…
ltx/en_us_oca/me.m07.d29:meVE.Stichera02.melody	@ltx/en_us_oca/he.a.m8:heAU.OTouParadoxou.notmetered
ltx/en_us_oca/me.m07.d29:meVE.Stichera02.mode	@ltx/en_us_oca/miscellanea:misc.Mode8
ltx/en_us_oca/me.m07.d29:meVE.Stichera02.text	All-blessed martyr Callinicus, ⁄ you obtained the unseen Lord as an invincible ally against unseen enemies! ⁄ You raised up great trophies of immortality! ⁄ By the first of your contests ⁄ you overthrew him who boasts that he would blot out the earth and the sea. ⁄⁄ You drowned him in the streams of your blood!
ltx/en_us_oca/me.m07.d29:meVE.Stichera03.incipit	Let us honor Callinicus in…
ltx/en_us_oca/me.m07.d29:meVE.Stichera03.melody	@ltx/en_us_oca/he.a.m8:heAU.OTouParadoxou.notmetered
ltx/en_us_oca/me.m07.d29:meVE.Stichera03.mode	@ltx/en_us_oca/miscellanea:misc.Mode8
ltx/en_us_oca/me.m07.d29:meVE.Stichera03.text	Let us honor Callinicus in hymns today! ⁄ He is the foremost fighter for piety; ⁄ a destroyer of the enemy, ⁄ the constant companion of the martyrs! ⁄ He is a temple of the Holy Spirit ⁄ who became a soldier of Christ the King! ⁄ He is truly the inexhaustible treasury of healings, ⁄⁄ and the wonderful support of the faithful!
ltx/en_us_oca/me.m07.d29:meVE.Stichera04.greekmelody	@ltx/en_us_oca/he.a.m4:heAU.OsGennaionEnMartysi.greekname
ltx/en_us_oca/me.m07.d29:meVE.Stichera04.incipit	…
ltx/en_us_oca/me.m07.d29:meVE.Stichera04.melody	@ltx/en_us_oca/he.a.m4:heAU.OsGennaionEnMartysi.notmetered
ltx/en_us_oca/me.m07.d29:meVE.Stichera04.mode	@ltx/en_us_oca/miscellanea:misc.Mode4
ltx/en_us_oca/me.m07.d29:meVE.Stichera04.text	
ltx/en_us_oca/me.m07.d29:meVE.Stichera05.incipit	…
ltx/en_us_oca/me.m07.d29:meVE.Stichera05.melody	@ltx/en_us_oca/he.a.m4:heAU.OsGennaionEnMartysi.notmetered
ltx/en_us_oca/me.m07.d29:meVE.Stichera05.mode	@ltx/en_us_oca/miscellanea:misc.Mode4
ltx/en_us_oca/me.m07.d29:meVE.Stichera05.text	
ltx/en_us_oca/me.m07.d29:meVE.Stichera06.incipit	…
ltx/en_us_oca/me.m07.d29:meVE.Stichera06.melody	@ltx/en_us_oca/he.a.m4:heAU.OsGennaionEnMartysi.notmetered
ltx/en_us_oca/me.m07.d29:meVE.Stichera06.mode	@ltx/en_us_oca/miscellanea:misc.Mode4
ltx/en_us_oca/me.m07.d29:meVE.Stichera06.text	
