ltx/en_us_oca/me.m11.d03:meDA.commemoration.first	
ltx/en_us_oca/me.m11.d03:meDA.commemoration.first_name	
ltx/en_us_oca/me.m11.d03:meDA.commemoration.first_short	
ltx/en_us_oca/me.m11.d03:meDA.commemoration.first_title	
ltx/en_us_oca/me.m11.d03:meDA.commemoration.full	
ltx/en_us_oca/me.m11.d03:meDA.commemoration.second_name	
ltx/en_us_oca/me.m11.d03:meDA.commemoration.second_short	
ltx/en_us_oca/me.m11.d03:meDA.commemoration.second_title	
ltx/en_us_oca/me.m11.d03:meDA.date	
ltx/en_us_oca/me.m11.d03:meDA.fordate	
ltx/en_us_oca/me.m11.d03:meDA.insert1	
ltx/en_us_oca/me.m11.d03:meDA.insert2	
ltx/en_us_oca/me.m11.d03:meDA.note	
ltx/en_us_oca/me.m11.d03:meDA.pdfcoverdate	
ltx/en_us_oca/me.m11.d03:meDA.pdfheaderdate	
ltx/en_us_oca/me.m11.d03:meHO.commemorations	
ltx/en_us_oca/me.m11.d03:meHO.note1	
ltx/en_us_oca/me.m11.d03:meHO.note2	
ltx/en_us_oca/me.m11.d03:meHO.number	
ltx/en_us_oca/me.m11.d03:meHO.rank	
ltx/en_us_oca/me.m11.d03:meLE.commemoration1	
ltx/en_us_oca/me.m11.d03:meLE.commemoration2	
ltx/en_us_oca/me.m11.d03:meLI.Kontakion1.greekmelody	@ltx/en_us_oca/me.m11.d03:meMA.Kontakion1.greekmelody
ltx/en_us_oca/me.m11.d03:meLI.Kontakion1.incipit	@ltx/en_us_oca/me.m11.d03:meMA.Kontakion1.incipit
ltx/en_us_oca/me.m11.d03:meLI.Kontakion1.melody	@ltx/en_us_oca/me.m11.d03:meMA.Kontakion1.melody
ltx/en_us_oca/me.m11.d03:meLI.Kontakion1.mode	@ltx/en_us_oca/me.m11.d03:meMA.Kontakion1.mode
ltx/en_us_oca/me.m11.d03:meLI.Kontakion1.text	@ltx/en_us_oca/me.m11.d03:meMA.Kontakion1.text
ltx/en_us_oca/me.m11.d03:meLI.Megalynarion.text	
ltx/en_us_oca/me.m11.d03:meLI.Megalynarion2.text	
ltx/en_us_oca/me.m11.d03:meMA.C1.acrostic.notice1	
ltx/en_us_oca/me.m11.d03:meMA.C1.acrostic.text	
ltx/en_us_oca/me.m11.d03:meMA.C1.acrostic.title	
ltx/en_us_oca/me.m11.d03:meMA.C1.title	@ltx/en_us_oca/titles:ti.CanonSaints
ltx/en_us_oca/me.m11.d03:meMA.C1.verse	@ltx/en_us_oca/prayers:pr.verse_SaintsM.text
ltx/en_us_oca/me.m11.d03:meMA.C2.acrostic.notice1	
ltx/en_us_oca/me.m11.d03:meMA.C2.acrostic.text	
ltx/en_us_oca/me.m11.d03:meMA.C2.acrostic.title	
ltx/en_us_oca/me.m11.d03:meMA.C2.title	@ltx/en_us_oca/titles:ti.CanonSaintM
ltx/en_us_oca/me.m11.d03:meMA.C2.verse	@ltx/en_us_oca/prayers:pr.verse_SaintM.text
ltx/en_us_oca/me.m11.d03:meMA.ExapTheotokion.incipit	…
ltx/en_us_oca/me.m11.d03:meMA.ExapTheotokion.melody	@ltx/en_us_oca/he.a.m3:heAU.EnPnevmatiToIero.notmetered
ltx/en_us_oca/me.m11.d03:meMA.ExapTheotokion.mode	@ltx/en_us_oca/miscellanea:misc.Mode3
ltx/en_us_oca/me.m11.d03:meMA.ExapTheotokion.text	
ltx/en_us_oca/me.m11.d03:meMA.Exaposteilarion1.greekmelody	@ltx/en_us_oca/he.a.m2:heAU.ToisMathitaisSynelthomen.greekname
ltx/en_us_oca/me.m11.d03:meMA.Exaposteilarion1.incipit	…
ltx/en_us_oca/me.m11.d03:meMA.Exaposteilarion1.melody	@ltx/en_us_oca/he.a.m2:heAU.ToisMathitaisSynelthomen.notmetered
ltx/en_us_oca/me.m11.d03:meMA.Exaposteilarion1.mode	@ltx/en_us_oca/miscellanea:misc.Mode2
ltx/en_us_oca/me.m11.d03:meMA.Exaposteilarion1.text	
ltx/en_us_oca/me.m11.d03:meMA.Exaposteilarion2.greekmelody	@ltx/en_us_oca/he.a.m3:heAU.EnPnevmatiToIero.greekname
ltx/en_us_oca/me.m11.d03:meMA.Exaposteilarion2.incipit	…
ltx/en_us_oca/me.m11.d03:meMA.Exaposteilarion2.melody	@ltx/en_us_oca/he.a.m3:heAU.EnPnevmatiToIero.notmetered
ltx/en_us_oca/me.m11.d03:meMA.Exaposteilarion2.mode	@ltx/en_us_oca/miscellanea:misc.Mode3
ltx/en_us_oca/me.m11.d03:meMA.Exaposteilarion2.text	
ltx/en_us_oca/me.m11.d03:meMA.Kontakion1.greekmelody	@ltx/en_us_oca/he.a.m2:heAU.TaAnoZiton.greekname
ltx/en_us_oca/me.m11.d03:meMA.Kontakion1.incipit	…
ltx/en_us_oca/me.m11.d03:meMA.Kontakion1.melody	@ltx/en_us_oca/he.a.m2:heAU.TaAnoZiton.notmetered
ltx/en_us_oca/me.m11.d03:meMA.Kontakion1.mode	@ltx/en_us_oca/miscellanea:misc.Mode2
ltx/en_us_oca/me.m11.d03:meMA.Kontakion1.text	
ltx/en_us_oca/me.m11.d03:meMA.Kontakion2.greekmelody	@ltx/en_us_oca/he.a.m8:heAU.TiYpermacho.greekname
ltx/en_us_oca/me.m11.d03:meMA.Kontakion2.incipit	…
ltx/en_us_oca/me.m11.d03:meMA.Kontakion2.melody	@ltx/en_us_oca/he.a.m8:heAU.TiYpermacho.notmetered
ltx/en_us_oca/me.m11.d03:meMA.Kontakion2.mode	@ltx/en_us_oca/miscellanea:misc.Mode8
ltx/en_us_oca/me.m11.d03:meMA.Kontakion2.text	
ltx/en_us_oca/me.m11.d03:meMA.Lauds1.greekmelody	@ltx/en_us_oca/he.a.m4:heAU.OsGennaionEnMartysi.greekname
ltx/en_us_oca/me.m11.d03:meMA.Lauds1.incipit	…
ltx/en_us_oca/me.m11.d03:meMA.Lauds1.melody	@ltx/en_us_oca/he.a.m4:heAU.OsGennaionEnMartysi.notmetered
ltx/en_us_oca/me.m11.d03:meMA.Lauds1.mode	@ltx/en_us_oca/miscellanea:misc.Mode4
ltx/en_us_oca/me.m11.d03:meMA.Lauds1.text	
ltx/en_us_oca/me.m11.d03:meMA.Lauds2.incipit	…
ltx/en_us_oca/me.m11.d03:meMA.Lauds2.melody	@ltx/en_us_oca/he.a.m4:heAU.OsGennaionEnMartysi.notmetered
ltx/en_us_oca/me.m11.d03:meMA.Lauds2.mode	@ltx/en_us_oca/miscellanea:misc.Mode4
ltx/en_us_oca/me.m11.d03:meMA.Lauds2.text	
ltx/en_us_oca/me.m11.d03:meMA.Lauds3.incipit	…
ltx/en_us_oca/me.m11.d03:meMA.Lauds3.melody	@ltx/en_us_oca/he.a.m4:heAU.OsGennaionEnMartysi.notmetered
ltx/en_us_oca/me.m11.d03:meMA.Lauds3.mode	@ltx/en_us_oca/miscellanea:misc.Mode4
ltx/en_us_oca/me.m11.d03:meMA.Lauds3.text	
ltx/en_us_oca/me.m11.d03:meMA.LaudsGlory.incipit	…
ltx/en_us_oca/me.m11.d03:meMA.LaudsGlory.melody	
ltx/en_us_oca/me.m11.d03:meMA.LaudsGlory.mode	@ltx/en_us_oca/miscellanea:misc.Mode4
ltx/en_us_oca/me.m11.d03:meMA.LaudsGlory.text	
ltx/en_us_oca/me.m11.d03:meMA.LaudsTheotokion.greekmelody	@ltx/en_us_oca/he.a.m4:heAU.EdokasSimeiosin.greekname
ltx/en_us_oca/me.m11.d03:meMA.LaudsTheotokion.incipit	@ltx/en_us_oca/oc.m4.d4:ocVE.Stichera6.incipit
ltx/en_us_oca/me.m11.d03:meMA.LaudsTheotokion.melody	@ltx/en_us_oca/he.a.m4:heAU.EdokasSimeiosin.notmetered
ltx/en_us_oca/me.m11.d03:meMA.LaudsTheotokion.mode	@ltx/en_us_oca/miscellanea:misc.Mode4
ltx/en_us_oca/me.m11.d03:meMA.LaudsTheotokion.text	@ltx/en_us_oca/oc.m4.d4:ocVE.Stichera6.text
ltx/en_us_oca/me.m11.d03:meMA.MM.Lauds1123as5678.text	@ltx/en_us_oca/properties:media.key
ltx/en_us_oca/me.m11.d03:meMA.Ode1C11.greekmelody	@ltx/en_us_oca/he.h.m1:heHE.SouITropaiouchos.greekname
ltx/en_us_oca/me.m11.d03:meMA.Ode1C11.incipit	…
ltx/en_us_oca/me.m11.d03:meMA.Ode1C11.melody	@ltx/en_us_oca/he.h.m1:heHE.SouITropaiouchos.notmetered
ltx/en_us_oca/me.m11.d03:meMA.Ode1C11.mode	@ltx/en_us_oca/miscellanea:misc.Mode1
ltx/en_us_oca/me.m11.d03:meMA.Ode1C11.ode	@ltx/en_us_oca/miscellanea:misc.Ode1
ltx/en_us_oca/me.m11.d03:meMA.Ode1C11.text	
ltx/en_us_oca/me.m11.d03:meMA.Ode1C12.incipit	…
ltx/en_us_oca/me.m11.d03:meMA.Ode1C12.melody	@ltx/en_us_oca/he.h.m1:heHE.SouITropaiouchos.notmetered
ltx/en_us_oca/me.m11.d03:meMA.Ode1C12.mode	@ltx/en_us_oca/miscellanea:misc.Mode1
ltx/en_us_oca/me.m11.d03:meMA.Ode1C12.ode	@ltx/en_us_oca/miscellanea:misc.Ode1
ltx/en_us_oca/me.m11.d03:meMA.Ode1C12.text	
ltx/en_us_oca/me.m11.d03:meMA.Ode1C13.incipit	…
ltx/en_us_oca/me.m11.d03:meMA.Ode1C13.melody	@ltx/en_us_oca/he.h.m1:heHE.SouITropaiouchos.notmetered
ltx/en_us_oca/me.m11.d03:meMA.Ode1C13.mode	@ltx/en_us_oca/miscellanea:misc.Mode1
ltx/en_us_oca/me.m11.d03:meMA.Ode1C13.ode	@ltx/en_us_oca/miscellanea:misc.Ode1
ltx/en_us_oca/me.m11.d03:meMA.Ode1C13.text	
ltx/en_us_oca/me.m11.d03:meMA.Ode1C1T.incipit	…
ltx/en_us_oca/me.m11.d03:meMA.Ode1C1T.melody	@ltx/en_us_oca/he.h.m1:heHE.SouITropaiouchos.notmetered
ltx/en_us_oca/me.m11.d03:meMA.Ode1C1T.mode	@ltx/en_us_oca/miscellanea:misc.Mode1
ltx/en_us_oca/me.m11.d03:meMA.Ode1C1T.ode	@ltx/en_us_oca/miscellanea:misc.Ode1
ltx/en_us_oca/me.m11.d03:meMA.Ode1C1T.text	
ltx/en_us_oca/me.m11.d03:meMA.Ode1C21.greekmelody	@ltx/en_us_oca/he.h.m4:heHE.ToOdigisantiPalai.greekname
ltx/en_us_oca/me.m11.d03:meMA.Ode1C21.incipit	…
ltx/en_us_oca/me.m11.d03:meMA.Ode1C21.melody	@ltx/en_us_oca/he.h.m4:heHE.ToOdigisantiPalai.notmetered
ltx/en_us_oca/me.m11.d03:meMA.Ode1C21.mode	@ltx/en_us_oca/miscellanea:misc.Mode4
ltx/en_us_oca/me.m11.d03:meMA.Ode1C21.ode	@ltx/en_us_oca/miscellanea:misc.Ode1
ltx/en_us_oca/me.m11.d03:meMA.Ode1C21.text	
ltx/en_us_oca/me.m11.d03:meMA.Ode1C22.incipit	…
ltx/en_us_oca/me.m11.d03:meMA.Ode1C22.melody	@ltx/en_us_oca/he.h.m4:heHE.ToOdigisantiPalai.notmetered
ltx/en_us_oca/me.m11.d03:meMA.Ode1C22.mode	@ltx/en_us_oca/miscellanea:misc.Mode4
ltx/en_us_oca/me.m11.d03:meMA.Ode1C22.ode	@ltx/en_us_oca/miscellanea:misc.Ode1
ltx/en_us_oca/me.m11.d03:meMA.Ode1C22.text	
ltx/en_us_oca/me.m11.d03:meMA.Ode1C23.incipit	…
ltx/en_us_oca/me.m11.d03:meMA.Ode1C23.melody	@ltx/en_us_oca/he.h.m4:heHE.ToOdigisantiPalai.notmetered
ltx/en_us_oca/me.m11.d03:meMA.Ode1C23.mode	@ltx/en_us_oca/miscellanea:misc.Mode4
ltx/en_us_oca/me.m11.d03:meMA.Ode1C23.ode	@ltx/en_us_oca/miscellanea:misc.Ode1
ltx/en_us_oca/me.m11.d03:meMA.Ode1C23.text	
ltx/en_us_oca/me.m11.d03:meMA.Ode1C2T.incipit	…
ltx/en_us_oca/me.m11.d03:meMA.Ode1C2T.melody	@ltx/en_us_oca/he.h.m4:heHE.ToOdigisantiPalai.notmetered
ltx/en_us_oca/me.m11.d03:meMA.Ode1C2T.mode	@ltx/en_us_oca/miscellanea:misc.Mode4
ltx/en_us_oca/me.m11.d03:meMA.Ode1C2T.ode	@ltx/en_us_oca/miscellanea:misc.Ode1
ltx/en_us_oca/me.m11.d03:meMA.Ode1C2T.text	
ltx/en_us_oca/me.m11.d03:meMA.Ode3C11.greekmelody	@ltx/en_us_oca/he.h.m1:heHE.OMonosEidos.greekname
ltx/en_us_oca/me.m11.d03:meMA.Ode3C11.incipit	…
ltx/en_us_oca/me.m11.d03:meMA.Ode3C11.melody	@ltx/en_us_oca/he.h.m1:heHE.OMonosEidos.notmetered
ltx/en_us_oca/me.m11.d03:meMA.Ode3C11.mode	@ltx/en_us_oca/miscellanea:misc.Mode1
ltx/en_us_oca/me.m11.d03:meMA.Ode3C11.ode	@ltx/en_us_oca/miscellanea:misc.Ode3
ltx/en_us_oca/me.m11.d03:meMA.Ode3C11.text	
ltx/en_us_oca/me.m11.d03:meMA.Ode3C12.incipit	…
ltx/en_us_oca/me.m11.d03:meMA.Ode3C12.melody	@ltx/en_us_oca/he.h.m1:heHE.OMonosEidos.notmetered
ltx/en_us_oca/me.m11.d03:meMA.Ode3C12.mode	@ltx/en_us_oca/miscellanea:misc.Mode1
ltx/en_us_oca/me.m11.d03:meMA.Ode3C12.ode	@ltx/en_us_oca/miscellanea:misc.Ode3
ltx/en_us_oca/me.m11.d03:meMA.Ode3C12.text	
ltx/en_us_oca/me.m11.d03:meMA.Ode3C13.incipit	…
ltx/en_us_oca/me.m11.d03:meMA.Ode3C13.melody	@ltx/en_us_oca/he.h.m1:heHE.OMonosEidos.notmetered
ltx/en_us_oca/me.m11.d03:meMA.Ode3C13.mode	@ltx/en_us_oca/miscellanea:misc.Mode1
ltx/en_us_oca/me.m11.d03:meMA.Ode3C13.ode	@ltx/en_us_oca/miscellanea:misc.Ode3
ltx/en_us_oca/me.m11.d03:meMA.Ode3C13.text	
ltx/en_us_oca/me.m11.d03:meMA.Ode3C1T.incipit	…
ltx/en_us_oca/me.m11.d03:meMA.Ode3C1T.melody	@ltx/en_us_oca/he.h.m1:heHE.OMonosEidos.notmetered
ltx/en_us_oca/me.m11.d03:meMA.Ode3C1T.mode	@ltx/en_us_oca/miscellanea:misc.Mode1
ltx/en_us_oca/me.m11.d03:meMA.Ode3C1T.ode	@ltx/en_us_oca/miscellanea:misc.Ode3
ltx/en_us_oca/me.m11.d03:meMA.Ode3C1T.text	
ltx/en_us_oca/me.m11.d03:meMA.Ode3C21.greekmelody	@ltx/en_us_oca/he.h.m4:heHE.OStereonVrontin.greekname
ltx/en_us_oca/me.m11.d03:meMA.Ode3C21.incipit	…
ltx/en_us_oca/me.m11.d03:meMA.Ode3C21.melody	@ltx/en_us_oca/he.h.m4:heHE.OStereonVrontin.notmetered
ltx/en_us_oca/me.m11.d03:meMA.Ode3C21.mode	@ltx/en_us_oca/miscellanea:misc.Mode4
ltx/en_us_oca/me.m11.d03:meMA.Ode3C21.ode	@ltx/en_us_oca/miscellanea:misc.Ode3
ltx/en_us_oca/me.m11.d03:meMA.Ode3C21.text	
ltx/en_us_oca/me.m11.d03:meMA.Ode3C22.incipit	…
ltx/en_us_oca/me.m11.d03:meMA.Ode3C22.melody	@ltx/en_us_oca/he.h.m4:heHE.OStereonVrontin.notmetered
ltx/en_us_oca/me.m11.d03:meMA.Ode3C22.mode	@ltx/en_us_oca/miscellanea:misc.Mode4
ltx/en_us_oca/me.m11.d03:meMA.Ode3C22.ode	@ltx/en_us_oca/miscellanea:misc.Ode3
ltx/en_us_oca/me.m11.d03:meMA.Ode3C22.text	
ltx/en_us_oca/me.m11.d03:meMA.Ode3C23.incipit	…
ltx/en_us_oca/me.m11.d03:meMA.Ode3C23.melody	@ltx/en_us_oca/he.h.m4:heHE.OStereonVrontin.notmetered
ltx/en_us_oca/me.m11.d03:meMA.Ode3C23.mode	@ltx/en_us_oca/miscellanea:misc.Mode4
ltx/en_us_oca/me.m11.d03:meMA.Ode3C23.ode	@ltx/en_us_oca/miscellanea:misc.Ode3
ltx/en_us_oca/me.m11.d03:meMA.Ode3C23.text	
ltx/en_us_oca/me.m11.d03:meMA.Ode3C2T.incipit	…
ltx/en_us_oca/me.m11.d03:meMA.Ode3C2T.melody	@ltx/en_us_oca/he.h.m4:heHE.OStereonVrontin.notmetered
ltx/en_us_oca/me.m11.d03:meMA.Ode3C2T.mode	@ltx/en_us_oca/miscellanea:misc.Mode4
ltx/en_us_oca/me.m11.d03:meMA.Ode3C2T.ode	@ltx/en_us_oca/miscellanea:misc.Ode3
ltx/en_us_oca/me.m11.d03:meMA.Ode3C2T.text	
ltx/en_us_oca/me.m11.d03:meMA.Ode3H.greekmelody	@ltx/en_us_oca/he.h.m4:heHE.OStereonVrontin.greekname
ltx/en_us_oca/me.m11.d03:meMA.Ode3H.incipit	@ltx/en_us_oca/he.h.m4:heHE.OStereonVrontin.incipit
ltx/en_us_oca/me.m11.d03:meMA.Ode3H.melody	@ltx/en_us_oca/he.h.m4:heHE.OStereonVrontin.melody
ltx/en_us_oca/me.m11.d03:meMA.Ode3H.mode	@ltx/en_us_oca/miscellanea:misc.Mode4
ltx/en_us_oca/me.m11.d03:meMA.Ode3H.ode	@ltx/en_us_oca/miscellanea:misc.Ode3
ltx/en_us_oca/me.m11.d03:meMA.Ode3H.text	@ltx/en_us_oca/he.h.m4:heHE.OStereonVrontin.text
ltx/en_us_oca/me.m11.d03:meMA.Ode3Kathisma1.greekmelody	@ltx/en_us_oca/he.a.m8:heAU.TinSofianKaiLogon.greekname
ltx/en_us_oca/me.m11.d03:meMA.Ode3Kathisma1.incipit	…
ltx/en_us_oca/me.m11.d03:meMA.Ode3Kathisma1.melody	@ltx/en_us_oca/he.a.m8:heAU.TinSofianKaiLogon.notmetered
ltx/en_us_oca/me.m11.d03:meMA.Ode3Kathisma1.mode	@ltx/en_us_oca/miscellanea:misc.Mode8
ltx/en_us_oca/me.m11.d03:meMA.Ode3Kathisma1.text	
ltx/en_us_oca/me.m11.d03:meMA.Ode3Kathisma2.greekmelody	@ltx/en_us_oca/he.a.m8:heAU.TinSofianKaiLogon.greekname
ltx/en_us_oca/me.m11.d03:meMA.Ode3Kathisma2.incipit	…
ltx/en_us_oca/me.m11.d03:meMA.Ode3Kathisma2.melody	@ltx/en_us_oca/he.a.m8:heAU.TinSofianKaiLogon.notmetered
ltx/en_us_oca/me.m11.d03:meMA.Ode3Kathisma2.mode	@ltx/en_us_oca/miscellanea:misc.Mode8
ltx/en_us_oca/me.m11.d03:meMA.Ode3Kathisma2.text	
ltx/en_us_oca/me.m11.d03:meMA.Ode3KathismaSt.incipit	@ltx/en_us_oca/oc.m8.d4:ocMA.Kathisma13.incipit
ltx/en_us_oca/me.m11.d03:meMA.Ode3KathismaSt.melody	@ltx/en_us_oca/he.a.m8:heAU.TinSofianKaiLogon.notmetered
ltx/en_us_oca/me.m11.d03:meMA.Ode3KathismaSt.mode	@ltx/en_us_oca/miscellanea:misc.Mode8
ltx/en_us_oca/me.m11.d03:meMA.Ode3KathismaSt.text	@ltx/en_us_oca/oc.m8.d4:ocMA.Kathisma13.text
ltx/en_us_oca/me.m11.d03:meMA.Ode3KathismaT.incipit	@ltx/en_us_oca/me.m06.d29:meMA.Kathisma2T.incipit
ltx/en_us_oca/me.m11.d03:meMA.Ode3KathismaT.melody	@ltx/en_us_oca/he.a.m8:heAU.TinSofianKaiLogon.notmetered
ltx/en_us_oca/me.m11.d03:meMA.Ode3KathismaT.mode	@ltx/en_us_oca/miscellanea:misc.Mode8
ltx/en_us_oca/me.m11.d03:meMA.Ode3KathismaT.text	@ltx/en_us_oca/me.m06.d29:meMA.Kathisma2T.text
ltx/en_us_oca/me.m11.d03:meMA.Ode4C11.greekmelody	@ltx/en_us_oca/he.h.m1:heHE.OrosSeTiChariti.greekname
ltx/en_us_oca/me.m11.d03:meMA.Ode4C11.incipit	…
ltx/en_us_oca/me.m11.d03:meMA.Ode4C11.melody	@ltx/en_us_oca/he.h.m1:heHE.OrosSeTiChariti.notmetered
ltx/en_us_oca/me.m11.d03:meMA.Ode4C11.mode	@ltx/en_us_oca/miscellanea:misc.Mode1
ltx/en_us_oca/me.m11.d03:meMA.Ode4C11.ode	@ltx/en_us_oca/miscellanea:misc.Ode4
ltx/en_us_oca/me.m11.d03:meMA.Ode4C11.text	
ltx/en_us_oca/me.m11.d03:meMA.Ode4C12.incipit	…
ltx/en_us_oca/me.m11.d03:meMA.Ode4C12.melody	@ltx/en_us_oca/he.h.m1:heHE.OrosSeTiChariti.notmetered
ltx/en_us_oca/me.m11.d03:meMA.Ode4C12.mode	@ltx/en_us_oca/miscellanea:misc.Mode1
ltx/en_us_oca/me.m11.d03:meMA.Ode4C12.ode	@ltx/en_us_oca/miscellanea:misc.Ode4
ltx/en_us_oca/me.m11.d03:meMA.Ode4C12.text	
ltx/en_us_oca/me.m11.d03:meMA.Ode4C13.incipit	…
ltx/en_us_oca/me.m11.d03:meMA.Ode4C13.melody	@ltx/en_us_oca/he.h.m1:heHE.OrosSeTiChariti.notmetered
ltx/en_us_oca/me.m11.d03:meMA.Ode4C13.mode	@ltx/en_us_oca/miscellanea:misc.Mode1
ltx/en_us_oca/me.m11.d03:meMA.Ode4C13.ode	@ltx/en_us_oca/miscellanea:misc.Ode4
ltx/en_us_oca/me.m11.d03:meMA.Ode4C13.text	
ltx/en_us_oca/me.m11.d03:meMA.Ode4C1T.incipit	…
ltx/en_us_oca/me.m11.d03:meMA.Ode4C1T.melody	@ltx/en_us_oca/he.h.m1:heHE.OrosSeTiChariti.notmetered
ltx/en_us_oca/me.m11.d03:meMA.Ode4C1T.mode	@ltx/en_us_oca/miscellanea:misc.Mode1
ltx/en_us_oca/me.m11.d03:meMA.Ode4C1T.ode	@ltx/en_us_oca/miscellanea:misc.Ode4
ltx/en_us_oca/me.m11.d03:meMA.Ode4C1T.text	
ltx/en_us_oca/me.m11.d03:meMA.Ode4C21.greekmelody	@ltx/en_us_oca/he.h.m4:heHE.EisakikoaKyrie.greekname
ltx/en_us_oca/me.m11.d03:meMA.Ode4C21.incipit	…
ltx/en_us_oca/me.m11.d03:meMA.Ode4C21.melody	@ltx/en_us_oca/he.h.m4:heHE.EisakikoaKyrie.notmetered
ltx/en_us_oca/me.m11.d03:meMA.Ode4C21.mode	@ltx/en_us_oca/miscellanea:misc.Mode4
ltx/en_us_oca/me.m11.d03:meMA.Ode4C21.ode	@ltx/en_us_oca/miscellanea:misc.Ode4
ltx/en_us_oca/me.m11.d03:meMA.Ode4C21.text	
ltx/en_us_oca/me.m11.d03:meMA.Ode4C22.incipit	…
ltx/en_us_oca/me.m11.d03:meMA.Ode4C22.melody	@ltx/en_us_oca/he.h.m4:heHE.EisakikoaKyrie.notmetered
ltx/en_us_oca/me.m11.d03:meMA.Ode4C22.mode	@ltx/en_us_oca/miscellanea:misc.Mode4
ltx/en_us_oca/me.m11.d03:meMA.Ode4C22.ode	@ltx/en_us_oca/miscellanea:misc.Ode4
ltx/en_us_oca/me.m11.d03:meMA.Ode4C22.text	
ltx/en_us_oca/me.m11.d03:meMA.Ode4C23.incipit	…
ltx/en_us_oca/me.m11.d03:meMA.Ode4C23.melody	@ltx/en_us_oca/he.h.m4:heHE.EisakikoaKyrie.notmetered
ltx/en_us_oca/me.m11.d03:meMA.Ode4C23.mode	@ltx/en_us_oca/miscellanea:misc.Mode4
ltx/en_us_oca/me.m11.d03:meMA.Ode4C23.ode	@ltx/en_us_oca/miscellanea:misc.Ode4
ltx/en_us_oca/me.m11.d03:meMA.Ode4C23.text	
ltx/en_us_oca/me.m11.d03:meMA.Ode4C2T.incipit	…
ltx/en_us_oca/me.m11.d03:meMA.Ode4C2T.melody	@ltx/en_us_oca/he.h.m4:heHE.EisakikoaKyrie.notmetered
ltx/en_us_oca/me.m11.d03:meMA.Ode4C2T.mode	@ltx/en_us_oca/miscellanea:misc.Mode4
ltx/en_us_oca/me.m11.d03:meMA.Ode4C2T.ode	@ltx/en_us_oca/miscellanea:misc.Ode4
ltx/en_us_oca/me.m11.d03:meMA.Ode4C2T.text	
ltx/en_us_oca/me.m11.d03:meMA.Ode5C11.greekmelody	@ltx/en_us_oca/he.h.m1:heHE.OFotisasTiEllampsei.greekname
ltx/en_us_oca/me.m11.d03:meMA.Ode5C11.incipit	…
ltx/en_us_oca/me.m11.d03:meMA.Ode5C11.melody	@ltx/en_us_oca/he.h.m1:heHE.OFotisasTiEllampsei.notmetered
ltx/en_us_oca/me.m11.d03:meMA.Ode5C11.mode	@ltx/en_us_oca/miscellanea:misc.Mode1
ltx/en_us_oca/me.m11.d03:meMA.Ode5C11.ode	@ltx/en_us_oca/miscellanea:misc.Ode5
ltx/en_us_oca/me.m11.d03:meMA.Ode5C11.text	
ltx/en_us_oca/me.m11.d03:meMA.Ode5C12.incipit	…
ltx/en_us_oca/me.m11.d03:meMA.Ode5C12.melody	@ltx/en_us_oca/he.h.m1:heHE.OFotisasTiEllampsei.notmetered
ltx/en_us_oca/me.m11.d03:meMA.Ode5C12.mode	@ltx/en_us_oca/miscellanea:misc.Mode1
ltx/en_us_oca/me.m11.d03:meMA.Ode5C12.ode	@ltx/en_us_oca/miscellanea:misc.Ode5
ltx/en_us_oca/me.m11.d03:meMA.Ode5C12.text	
ltx/en_us_oca/me.m11.d03:meMA.Ode5C13.incipit	…
ltx/en_us_oca/me.m11.d03:meMA.Ode5C13.melody	@ltx/en_us_oca/he.h.m1:heHE.OFotisasTiEllampsei.notmetered
ltx/en_us_oca/me.m11.d03:meMA.Ode5C13.mode	@ltx/en_us_oca/miscellanea:misc.Mode1
ltx/en_us_oca/me.m11.d03:meMA.Ode5C13.ode	@ltx/en_us_oca/miscellanea:misc.Ode5
ltx/en_us_oca/me.m11.d03:meMA.Ode5C13.text	
ltx/en_us_oca/me.m11.d03:meMA.Ode5C1T.incipit	…
ltx/en_us_oca/me.m11.d03:meMA.Ode5C1T.melody	@ltx/en_us_oca/he.h.m1:heHE.OFotisasTiEllampsei.notmetered
ltx/en_us_oca/me.m11.d03:meMA.Ode5C1T.mode	@ltx/en_us_oca/miscellanea:misc.Mode1
ltx/en_us_oca/me.m11.d03:meMA.Ode5C1T.ode	@ltx/en_us_oca/miscellanea:misc.Ode5
ltx/en_us_oca/me.m11.d03:meMA.Ode5C1T.text	
ltx/en_us_oca/me.m11.d03:meMA.Ode5C21.greekmelody	@ltx/en_us_oca/he.h.m4:heHE.AnateilonMoiKyrie.greekname
ltx/en_us_oca/me.m11.d03:meMA.Ode5C21.incipit	…
ltx/en_us_oca/me.m11.d03:meMA.Ode5C21.melody	@ltx/en_us_oca/he.h.m4:heHE.AnateilonMoiKyrie.notmetered
ltx/en_us_oca/me.m11.d03:meMA.Ode5C21.mode	@ltx/en_us_oca/miscellanea:misc.Mode4
ltx/en_us_oca/me.m11.d03:meMA.Ode5C21.ode	@ltx/en_us_oca/miscellanea:misc.Ode5
ltx/en_us_oca/me.m11.d03:meMA.Ode5C21.text	
ltx/en_us_oca/me.m11.d03:meMA.Ode5C22.incipit	…
ltx/en_us_oca/me.m11.d03:meMA.Ode5C22.melody	@ltx/en_us_oca/he.h.m4:heHE.AnateilonMoiKyrie.notmetered
ltx/en_us_oca/me.m11.d03:meMA.Ode5C22.mode	@ltx/en_us_oca/miscellanea:misc.Mode4
ltx/en_us_oca/me.m11.d03:meMA.Ode5C22.ode	@ltx/en_us_oca/miscellanea:misc.Ode5
ltx/en_us_oca/me.m11.d03:meMA.Ode5C22.text	
ltx/en_us_oca/me.m11.d03:meMA.Ode5C23.incipit	…
ltx/en_us_oca/me.m11.d03:meMA.Ode5C23.melody	@ltx/en_us_oca/he.h.m4:heHE.AnateilonMoiKyrie.notmetered
ltx/en_us_oca/me.m11.d03:meMA.Ode5C23.mode	@ltx/en_us_oca/miscellanea:misc.Mode4
ltx/en_us_oca/me.m11.d03:meMA.Ode5C23.ode	@ltx/en_us_oca/miscellanea:misc.Ode5
ltx/en_us_oca/me.m11.d03:meMA.Ode5C23.text	
ltx/en_us_oca/me.m11.d03:meMA.Ode5C2T.incipit	…
ltx/en_us_oca/me.m11.d03:meMA.Ode5C2T.melody	@ltx/en_us_oca/he.h.m4:heHE.AnateilonMoiKyrie.notmetered
ltx/en_us_oca/me.m11.d03:meMA.Ode5C2T.mode	@ltx/en_us_oca/miscellanea:misc.Mode4
ltx/en_us_oca/me.m11.d03:meMA.Ode5C2T.ode	@ltx/en_us_oca/miscellanea:misc.Ode5
ltx/en_us_oca/me.m11.d03:meMA.Ode5C2T.text	
ltx/en_us_oca/me.m11.d03:meMA.Ode6C11.greekmelody	@ltx/en_us_oca/he.h.m1:heHE.EkyklosenImas.greekname
ltx/en_us_oca/me.m11.d03:meMA.Ode6C11.incipit	…
ltx/en_us_oca/me.m11.d03:meMA.Ode6C11.melody	@ltx/en_us_oca/he.h.m1:heHE.EkyklosenImas.notmetered
ltx/en_us_oca/me.m11.d03:meMA.Ode6C11.mode	@ltx/en_us_oca/miscellanea:misc.Mode1
ltx/en_us_oca/me.m11.d03:meMA.Ode6C11.ode	@ltx/en_us_oca/miscellanea:misc.Ode6
ltx/en_us_oca/me.m11.d03:meMA.Ode6C11.text	
ltx/en_us_oca/me.m11.d03:meMA.Ode6C12.incipit	…
ltx/en_us_oca/me.m11.d03:meMA.Ode6C12.melody	@ltx/en_us_oca/he.h.m1:heHE.EkyklosenImas.notmetered
ltx/en_us_oca/me.m11.d03:meMA.Ode6C12.mode	@ltx/en_us_oca/miscellanea:misc.Mode1
ltx/en_us_oca/me.m11.d03:meMA.Ode6C12.ode	@ltx/en_us_oca/miscellanea:misc.Ode6
ltx/en_us_oca/me.m11.d03:meMA.Ode6C12.text	
ltx/en_us_oca/me.m11.d03:meMA.Ode6C13.incipit	…
ltx/en_us_oca/me.m11.d03:meMA.Ode6C13.melody	@ltx/en_us_oca/he.h.m1:heHE.EkyklosenImas.notmetered
ltx/en_us_oca/me.m11.d03:meMA.Ode6C13.mode	@ltx/en_us_oca/miscellanea:misc.Mode1
ltx/en_us_oca/me.m11.d03:meMA.Ode6C13.ode	@ltx/en_us_oca/miscellanea:misc.Ode6
ltx/en_us_oca/me.m11.d03:meMA.Ode6C13.text	
ltx/en_us_oca/me.m11.d03:meMA.Ode6C1T.incipit	…
ltx/en_us_oca/me.m11.d03:meMA.Ode6C1T.melody	@ltx/en_us_oca/he.h.m1:heHE.EkyklosenImas.notmetered
ltx/en_us_oca/me.m11.d03:meMA.Ode6C1T.mode	@ltx/en_us_oca/miscellanea:misc.Mode1
ltx/en_us_oca/me.m11.d03:meMA.Ode6C1T.ode	@ltx/en_us_oca/miscellanea:misc.Ode6
ltx/en_us_oca/me.m11.d03:meMA.Ode6C1T.text	
ltx/en_us_oca/me.m11.d03:meMA.Ode6C21.greekmelody	@ltx/en_us_oca/he.h.m4:heHE.ZaliMeLogismon.greekname
ltx/en_us_oca/me.m11.d03:meMA.Ode6C21.incipit	…
ltx/en_us_oca/me.m11.d03:meMA.Ode6C21.melody	@ltx/en_us_oca/he.h.m4:heHE.ZaliMeLogismon.notmetered
ltx/en_us_oca/me.m11.d03:meMA.Ode6C21.mode	@ltx/en_us_oca/miscellanea:misc.Mode4
ltx/en_us_oca/me.m11.d03:meMA.Ode6C21.ode	@ltx/en_us_oca/miscellanea:misc.Ode6
ltx/en_us_oca/me.m11.d03:meMA.Ode6C21.text	
ltx/en_us_oca/me.m11.d03:meMA.Ode6C22.incipit	…
ltx/en_us_oca/me.m11.d03:meMA.Ode6C22.melody	@ltx/en_us_oca/he.h.m4:heHE.ZaliMeLogismon.notmetered
ltx/en_us_oca/me.m11.d03:meMA.Ode6C22.mode	@ltx/en_us_oca/miscellanea:misc.Mode4
ltx/en_us_oca/me.m11.d03:meMA.Ode6C22.ode	@ltx/en_us_oca/miscellanea:misc.Ode6
ltx/en_us_oca/me.m11.d03:meMA.Ode6C22.text	
ltx/en_us_oca/me.m11.d03:meMA.Ode6C23.incipit	…
ltx/en_us_oca/me.m11.d03:meMA.Ode6C23.melody	@ltx/en_us_oca/he.h.m4:heHE.ZaliMeLogismon.notmetered
ltx/en_us_oca/me.m11.d03:meMA.Ode6C23.mode	@ltx/en_us_oca/miscellanea:misc.Mode4
ltx/en_us_oca/me.m11.d03:meMA.Ode6C23.ode	@ltx/en_us_oca/miscellanea:misc.Ode6
ltx/en_us_oca/me.m11.d03:meMA.Ode6C23.text	
ltx/en_us_oca/me.m11.d03:meMA.Ode6C2T.incipit	…
ltx/en_us_oca/me.m11.d03:meMA.Ode6C2T.melody	@ltx/en_us_oca/he.h.m4:heHE.ZaliMeLogismon.notmetered
ltx/en_us_oca/me.m11.d03:meMA.Ode6C2T.mode	@ltx/en_us_oca/miscellanea:misc.Mode4
ltx/en_us_oca/me.m11.d03:meMA.Ode6C2T.ode	@ltx/en_us_oca/miscellanea:misc.Ode6
ltx/en_us_oca/me.m11.d03:meMA.Ode6C2T.text	
ltx/en_us_oca/me.m11.d03:meMA.Ode6H.greekmelody	@ltx/en_us_oca/he.h.m4:heHE.ZaliMeLogismon.greekname
ltx/en_us_oca/me.m11.d03:meMA.Ode6H.incipit	@ltx/en_us_oca/he.h.m4:heHE.ZaliMeLogismon.incipit
ltx/en_us_oca/me.m11.d03:meMA.Ode6H.melody	@ltx/en_us_oca/he.h.m4:heHE.ZaliMeLogismon.melody
ltx/en_us_oca/me.m11.d03:meMA.Ode6H.mode	@ltx/en_us_oca/miscellanea:misc.Mode4
ltx/en_us_oca/me.m11.d03:meMA.Ode6H.ode	@ltx/en_us_oca/miscellanea:misc.Ode6
ltx/en_us_oca/me.m11.d03:meMA.Ode6H.text	@ltx/en_us_oca/he.h.m4:heHE.ZaliMeLogismon.text
ltx/en_us_oca/me.m11.d03:meMA.Ode7C11.greekmelody	@ltx/en_us_oca/he.h.m1:heHE.SeNoitin.greekname
ltx/en_us_oca/me.m11.d03:meMA.Ode7C11.incipit	…
ltx/en_us_oca/me.m11.d03:meMA.Ode7C11.melody	@ltx/en_us_oca/he.h.m1:heHE.SeNoitin.notmetered
ltx/en_us_oca/me.m11.d03:meMA.Ode7C11.mode	@ltx/en_us_oca/miscellanea:misc.Mode1
ltx/en_us_oca/me.m11.d03:meMA.Ode7C11.ode	@ltx/en_us_oca/miscellanea:misc.Ode7
ltx/en_us_oca/me.m11.d03:meMA.Ode7C11.text	
ltx/en_us_oca/me.m11.d03:meMA.Ode7C12.incipit	…
ltx/en_us_oca/me.m11.d03:meMA.Ode7C12.melody	@ltx/en_us_oca/he.h.m1:heHE.SeNoitin.notmetered
ltx/en_us_oca/me.m11.d03:meMA.Ode7C12.mode	@ltx/en_us_oca/miscellanea:misc.Mode1
ltx/en_us_oca/me.m11.d03:meMA.Ode7C12.ode	@ltx/en_us_oca/miscellanea:misc.Ode7
ltx/en_us_oca/me.m11.d03:meMA.Ode7C12.text	
ltx/en_us_oca/me.m11.d03:meMA.Ode7C13.incipit	…
ltx/en_us_oca/me.m11.d03:meMA.Ode7C13.melody	@ltx/en_us_oca/he.h.m1:heHE.SeNoitin.notmetered
ltx/en_us_oca/me.m11.d03:meMA.Ode7C13.mode	@ltx/en_us_oca/miscellanea:misc.Mode1
ltx/en_us_oca/me.m11.d03:meMA.Ode7C13.ode	@ltx/en_us_oca/miscellanea:misc.Ode7
ltx/en_us_oca/me.m11.d03:meMA.Ode7C13.text	
ltx/en_us_oca/me.m11.d03:meMA.Ode7C1T.incipit	…
ltx/en_us_oca/me.m11.d03:meMA.Ode7C1T.melody	@ltx/en_us_oca/he.h.m1:heHE.SeNoitin.notmetered
ltx/en_us_oca/me.m11.d03:meMA.Ode7C1T.mode	@ltx/en_us_oca/miscellanea:misc.Mode1
ltx/en_us_oca/me.m11.d03:meMA.Ode7C1T.ode	@ltx/en_us_oca/miscellanea:misc.Ode7
ltx/en_us_oca/me.m11.d03:meMA.Ode7C1T.text	
ltx/en_us_oca/me.m11.d03:meMA.Ode7C21.greekmelody	@ltx/en_us_oca/he.h.m4:heHE.ODiasosasEnPyri.greekname
ltx/en_us_oca/me.m11.d03:meMA.Ode7C21.incipit	…
ltx/en_us_oca/me.m11.d03:meMA.Ode7C21.melody	@ltx/en_us_oca/he.h.m4:heHE.ODiasosasEnPyri.notmetered
ltx/en_us_oca/me.m11.d03:meMA.Ode7C21.mode	@ltx/en_us_oca/miscellanea:misc.Mode4
ltx/en_us_oca/me.m11.d03:meMA.Ode7C21.ode	@ltx/en_us_oca/miscellanea:misc.Ode7
ltx/en_us_oca/me.m11.d03:meMA.Ode7C21.text	
ltx/en_us_oca/me.m11.d03:meMA.Ode7C22.incipit	…
ltx/en_us_oca/me.m11.d03:meMA.Ode7C22.melody	@ltx/en_us_oca/he.h.m4:heHE.ODiasosasEnPyri.notmetered
ltx/en_us_oca/me.m11.d03:meMA.Ode7C22.mode	@ltx/en_us_oca/miscellanea:misc.Mode4
ltx/en_us_oca/me.m11.d03:meMA.Ode7C22.ode	@ltx/en_us_oca/miscellanea:misc.Ode7
ltx/en_us_oca/me.m11.d03:meMA.Ode7C22.text	
ltx/en_us_oca/me.m11.d03:meMA.Ode7C23.incipit	…
ltx/en_us_oca/me.m11.d03:meMA.Ode7C23.melody	@ltx/en_us_oca/he.h.m4:heHE.ODiasosasEnPyri.notmetered
ltx/en_us_oca/me.m11.d03:meMA.Ode7C23.mode	@ltx/en_us_oca/miscellanea:misc.Mode4
ltx/en_us_oca/me.m11.d03:meMA.Ode7C23.ode	@ltx/en_us_oca/miscellanea:misc.Ode7
ltx/en_us_oca/me.m11.d03:meMA.Ode7C23.text	
ltx/en_us_oca/me.m11.d03:meMA.Ode7C2T.incipit	…
ltx/en_us_oca/me.m11.d03:meMA.Ode7C2T.melody	@ltx/en_us_oca/he.h.m4:heHE.ODiasosasEnPyri.notmetered
ltx/en_us_oca/me.m11.d03:meMA.Ode7C2T.mode	@ltx/en_us_oca/miscellanea:misc.Mode4
ltx/en_us_oca/me.m11.d03:meMA.Ode7C2T.ode	@ltx/en_us_oca/miscellanea:misc.Ode7
ltx/en_us_oca/me.m11.d03:meMA.Ode7C2T.text	
ltx/en_us_oca/me.m11.d03:meMA.Ode8C11.greekmelody	@ltx/en_us_oca/he.h.m1:heHE.EnKaminoPaides.greekname
ltx/en_us_oca/me.m11.d03:meMA.Ode8C11.incipit	…
ltx/en_us_oca/me.m11.d03:meMA.Ode8C11.melody	@ltx/en_us_oca/he.h.m1:heHE.EnKaminoPaides.notmetered
ltx/en_us_oca/me.m11.d03:meMA.Ode8C11.mode	@ltx/en_us_oca/miscellanea:misc.Mode1
ltx/en_us_oca/me.m11.d03:meMA.Ode8C11.ode	@ltx/en_us_oca/miscellanea:misc.Ode8
ltx/en_us_oca/me.m11.d03:meMA.Ode8C11.text	
ltx/en_us_oca/me.m11.d03:meMA.Ode8C12.incipit	…
ltx/en_us_oca/me.m11.d03:meMA.Ode8C12.melody	@ltx/en_us_oca/he.h.m1:heHE.EnKaminoPaides.notmetered
ltx/en_us_oca/me.m11.d03:meMA.Ode8C12.mode	@ltx/en_us_oca/miscellanea:misc.Mode1
ltx/en_us_oca/me.m11.d03:meMA.Ode8C12.ode	@ltx/en_us_oca/miscellanea:misc.Ode8
ltx/en_us_oca/me.m11.d03:meMA.Ode8C12.text	
ltx/en_us_oca/me.m11.d03:meMA.Ode8C13.incipit	…
ltx/en_us_oca/me.m11.d03:meMA.Ode8C13.melody	@ltx/en_us_oca/he.h.m1:heHE.EnKaminoPaides.notmetered
ltx/en_us_oca/me.m11.d03:meMA.Ode8C13.mode	@ltx/en_us_oca/miscellanea:misc.Mode1
ltx/en_us_oca/me.m11.d03:meMA.Ode8C13.ode	@ltx/en_us_oca/miscellanea:misc.Ode8
ltx/en_us_oca/me.m11.d03:meMA.Ode8C13.text	
ltx/en_us_oca/me.m11.d03:meMA.Ode8C1T.incipit	…
ltx/en_us_oca/me.m11.d03:meMA.Ode8C1T.melody	@ltx/en_us_oca/he.h.m1:heHE.EnKaminoPaides.notmetered
ltx/en_us_oca/me.m11.d03:meMA.Ode8C1T.mode	@ltx/en_us_oca/miscellanea:misc.Mode1
ltx/en_us_oca/me.m11.d03:meMA.Ode8C1T.ode	@ltx/en_us_oca/miscellanea:misc.Ode8
ltx/en_us_oca/me.m11.d03:meMA.Ode8C1T.text	
ltx/en_us_oca/me.m11.d03:meMA.Ode8C1Tr.incipit	…
ltx/en_us_oca/me.m11.d03:meMA.Ode8C1Tr.melody	@ltx/en_us_oca/he.h.m1:heHE.EnKaminoPaides.notmetered
ltx/en_us_oca/me.m11.d03:meMA.Ode8C1Tr.mode	@ltx/en_us_oca/miscellanea:misc.Mode1
ltx/en_us_oca/me.m11.d03:meMA.Ode8C1Tr.ode	@ltx/en_us_oca/miscellanea:misc.Ode8
ltx/en_us_oca/me.m11.d03:meMA.Ode8C1Tr.text	
ltx/en_us_oca/me.m11.d03:meMA.Ode8C21.greekmelody	@ltx/en_us_oca/he.h.m4:heHE.GiKaiPantaTaEnAfti.greekname
ltx/en_us_oca/me.m11.d03:meMA.Ode8C21.incipit	…
ltx/en_us_oca/me.m11.d03:meMA.Ode8C21.melody	@ltx/en_us_oca/he.h.m4:heHE.GiKaiPantaTaEnAfti.notmetered
ltx/en_us_oca/me.m11.d03:meMA.Ode8C21.mode	@ltx/en_us_oca/miscellanea:misc.Mode4
ltx/en_us_oca/me.m11.d03:meMA.Ode8C21.ode	@ltx/en_us_oca/miscellanea:misc.Ode8
ltx/en_us_oca/me.m11.d03:meMA.Ode8C21.text	
ltx/en_us_oca/me.m11.d03:meMA.Ode8C22.incipit	…
ltx/en_us_oca/me.m11.d03:meMA.Ode8C22.melody	@ltx/en_us_oca/he.h.m4:heHE.GiKaiPantaTaEnAfti.notmetered
ltx/en_us_oca/me.m11.d03:meMA.Ode8C22.mode	@ltx/en_us_oca/miscellanea:misc.Mode4
ltx/en_us_oca/me.m11.d03:meMA.Ode8C22.ode	@ltx/en_us_oca/miscellanea:misc.Ode8
ltx/en_us_oca/me.m11.d03:meMA.Ode8C22.text	
ltx/en_us_oca/me.m11.d03:meMA.Ode8C23.incipit	…
ltx/en_us_oca/me.m11.d03:meMA.Ode8C23.melody	@ltx/en_us_oca/he.h.m4:heHE.GiKaiPantaTaEnAfti.notmetered
ltx/en_us_oca/me.m11.d03:meMA.Ode8C23.mode	@ltx/en_us_oca/miscellanea:misc.Mode4
ltx/en_us_oca/me.m11.d03:meMA.Ode8C23.ode	@ltx/en_us_oca/miscellanea:misc.Ode8
ltx/en_us_oca/me.m11.d03:meMA.Ode8C23.text	
ltx/en_us_oca/me.m11.d03:meMA.Ode8C2T.incipit	…
ltx/en_us_oca/me.m11.d03:meMA.Ode8C2T.melody	@ltx/en_us_oca/he.h.m4:heHE.GiKaiPantaTaEnAfti.notmetered
ltx/en_us_oca/me.m11.d03:meMA.Ode8C2T.mode	@ltx/en_us_oca/miscellanea:misc.Mode4
ltx/en_us_oca/me.m11.d03:meMA.Ode8C2T.ode	@ltx/en_us_oca/miscellanea:misc.Ode8
ltx/en_us_oca/me.m11.d03:meMA.Ode8C2T.text	
ltx/en_us_oca/me.m11.d03:meMA.Ode8H.greekmelody	@ltx/en_us_oca/he.h.m4:heHE.GiKaiPantaTaEnAfti.greekname
ltx/en_us_oca/me.m11.d03:meMA.Ode8H.incipit	@ltx/en_us_oca/he.h.m4:heHE.GiKaiPantaTaEnAfti.incipit
ltx/en_us_oca/me.m11.d03:meMA.Ode8H.melody	@ltx/en_us_oca/he.h.m4:heHE.GiKaiPantaTaEnAfti.melody
ltx/en_us_oca/me.m11.d03:meMA.Ode8H.mode	@ltx/en_us_oca/miscellanea:misc.Mode4
ltx/en_us_oca/me.m11.d03:meMA.Ode8H.ode	@ltx/en_us_oca/miscellanea:misc.Ode8
ltx/en_us_oca/me.m11.d03:meMA.Ode8H.text	@ltx/en_us_oca/he.h.m4:heHE.GiKaiPantaTaEnAfti.text
ltx/en_us_oca/me.m11.d03:meMA.Ode9C11.greekmelody	@ltx/en_us_oca/he.h.m1:heHE.TyponTisAgnis.greekname
ltx/en_us_oca/me.m11.d03:meMA.Ode9C11.incipit	…
ltx/en_us_oca/me.m11.d03:meMA.Ode9C11.melody	@ltx/en_us_oca/he.h.m1:heHE.TyponTisAgnis.notmetered
ltx/en_us_oca/me.m11.d03:meMA.Ode9C11.mode	@ltx/en_us_oca/miscellanea:misc.Mode1
ltx/en_us_oca/me.m11.d03:meMA.Ode9C11.ode	@ltx/en_us_oca/miscellanea:misc.Ode9
ltx/en_us_oca/me.m11.d03:meMA.Ode9C11.text	
ltx/en_us_oca/me.m11.d03:meMA.Ode9C12.incipit	…
ltx/en_us_oca/me.m11.d03:meMA.Ode9C12.melody	@ltx/en_us_oca/he.h.m1:heHE.TyponTisAgnis.notmetered
ltx/en_us_oca/me.m11.d03:meMA.Ode9C12.mode	@ltx/en_us_oca/miscellanea:misc.Mode1
ltx/en_us_oca/me.m11.d03:meMA.Ode9C12.ode	@ltx/en_us_oca/miscellanea:misc.Ode9
ltx/en_us_oca/me.m11.d03:meMA.Ode9C12.text	
ltx/en_us_oca/me.m11.d03:meMA.Ode9C13.incipit	…
ltx/en_us_oca/me.m11.d03:meMA.Ode9C13.melody	@ltx/en_us_oca/he.h.m1:heHE.TyponTisAgnis.notmetered
ltx/en_us_oca/me.m11.d03:meMA.Ode9C13.mode	@ltx/en_us_oca/miscellanea:misc.Mode1
ltx/en_us_oca/me.m11.d03:meMA.Ode9C13.ode	@ltx/en_us_oca/miscellanea:misc.Ode9
ltx/en_us_oca/me.m11.d03:meMA.Ode9C13.text	
ltx/en_us_oca/me.m11.d03:meMA.Ode9C1T.incipit	…
ltx/en_us_oca/me.m11.d03:meMA.Ode9C1T.melody	@ltx/en_us_oca/he.h.m1:heHE.TyponTisAgnis.notmetered
ltx/en_us_oca/me.m11.d03:meMA.Ode9C1T.mode	@ltx/en_us_oca/miscellanea:misc.Mode1
ltx/en_us_oca/me.m11.d03:meMA.Ode9C1T.ode	@ltx/en_us_oca/miscellanea:misc.Ode9
ltx/en_us_oca/me.m11.d03:meMA.Ode9C1T.text	
ltx/en_us_oca/me.m11.d03:meMA.Ode9C21.greekmelody	@ltx/en_us_oca/he.h.m4:heHE.OTokosSouAfthoros.greekname
ltx/en_us_oca/me.m11.d03:meMA.Ode9C21.incipit	…
ltx/en_us_oca/me.m11.d03:meMA.Ode9C21.melody	@ltx/en_us_oca/he.h.m4:heHE.OTokosSouAfthoros.notmetered
ltx/en_us_oca/me.m11.d03:meMA.Ode9C21.mode	@ltx/en_us_oca/miscellanea:misc.Mode4
ltx/en_us_oca/me.m11.d03:meMA.Ode9C21.ode	@ltx/en_us_oca/miscellanea:misc.Ode9
ltx/en_us_oca/me.m11.d03:meMA.Ode9C21.text	
ltx/en_us_oca/me.m11.d03:meMA.Ode9C22.incipit	…
ltx/en_us_oca/me.m11.d03:meMA.Ode9C22.melody	@ltx/en_us_oca/he.h.m4:heHE.OTokosSouAfthoros.notmetered
ltx/en_us_oca/me.m11.d03:meMA.Ode9C22.mode	@ltx/en_us_oca/miscellanea:misc.Mode4
ltx/en_us_oca/me.m11.d03:meMA.Ode9C22.ode	@ltx/en_us_oca/miscellanea:misc.Ode9
ltx/en_us_oca/me.m11.d03:meMA.Ode9C22.text	
ltx/en_us_oca/me.m11.d03:meMA.Ode9C23.incipit	…
ltx/en_us_oca/me.m11.d03:meMA.Ode9C23.melody	@ltx/en_us_oca/he.h.m4:heHE.OTokosSouAfthoros.notmetered
ltx/en_us_oca/me.m11.d03:meMA.Ode9C23.mode	@ltx/en_us_oca/miscellanea:misc.Mode4
ltx/en_us_oca/me.m11.d03:meMA.Ode9C23.ode	@ltx/en_us_oca/miscellanea:misc.Ode9
ltx/en_us_oca/me.m11.d03:meMA.Ode9C23.text	
ltx/en_us_oca/me.m11.d03:meMA.Ode9C2T.incipit	…
ltx/en_us_oca/me.m11.d03:meMA.Ode9C2T.melody	@ltx/en_us_oca/he.h.m4:heHE.OTokosSouAfthoros.notmetered
ltx/en_us_oca/me.m11.d03:meMA.Ode9C2T.mode	@ltx/en_us_oca/miscellanea:misc.Mode4
ltx/en_us_oca/me.m11.d03:meMA.Ode9C2T.ode	@ltx/en_us_oca/miscellanea:misc.Ode9
ltx/en_us_oca/me.m11.d03:meMA.Ode9C2T.text	
ltx/en_us_oca/me.m11.d03:meMA.Ode9H.greekmelody	@ltx/en_us_oca/he.h.m4:heHE.OTokosSouAfthoros.greekname
ltx/en_us_oca/me.m11.d03:meMA.Ode9H.incipit	@ltx/en_us_oca/he.h.m4:heHE.OTokosSouAfthoros.incipit
ltx/en_us_oca/me.m11.d03:meMA.Ode9H.melody	@ltx/en_us_oca/he.h.m4:heHE.OTokosSouAfthoros.melody
ltx/en_us_oca/me.m11.d03:meMA.Ode9H.mode	@ltx/en_us_oca/miscellanea:misc.Mode4
ltx/en_us_oca/me.m11.d03:meMA.Ode9H.ode	@ltx/en_us_oca/miscellanea:misc.Ode9
ltx/en_us_oca/me.m11.d03:meMA.Ode9H.text	@ltx/en_us_oca/he.h.m4:heHE.OTokosSouAfthoros.text
ltx/en_us_oca/me.m11.d03:meMA.Oikos1.text	
ltx/en_us_oca/me.m11.d03:meMA.Oikos2.text	
ltx/en_us_oca/me.m11.d03:meMA.Oikos22.text	
ltx/en_us_oca/me.m11.d03:meMA.Oikos23.text	
ltx/en_us_oca/me.m11.d03:meMA.Oikos24.text	
ltx/en_us_oca/me.m11.d03:meMA.Oikos25.text	
ltx/en_us_oca/me.m11.d03:meMA.Oikos26.text	
ltx/en_us_oca/me.m11.d03:meMA.Oikos27.text	
ltx/en_us_oca/me.m11.d03:meMA.Oikos28.text	
ltx/en_us_oca/me.m11.d03:meVE.Apolytikion1ger.greekmelody	@ltx/en_us_oca/he.a.m3:heAU.TheiasPisteos.greekname
ltx/en_us_oca/me.m11.d03:meVE.Apolytikion1ger.incipit	…
ltx/en_us_oca/me.m11.d03:meVE.Apolytikion1ger.melody	@ltx/en_us_oca/he.a.m3:heAU.TheiasPisteos.notmetered
ltx/en_us_oca/me.m11.d03:meVE.Apolytikion1ger.mode	@ltx/en_us_oca/miscellanea:misc.Mode3
ltx/en_us_oca/me.m11.d03:meVE.Apolytikion1ger.poet	@ltx/en_us_oca/poets:po.Gerasimou
ltx/en_us_oca/me.m11.d03:meVE.Apolytikion1ger.text	
ltx/en_us_oca/me.m11.d03:meVE.Apolytikion2ger.greekmelody	@ltx/en_us_oca/he.a.m4:heAU.TachyProkatalave.greekname
ltx/en_us_oca/me.m11.d03:meVE.Apolytikion2ger.incipit	…
ltx/en_us_oca/me.m11.d03:meVE.Apolytikion2ger.melody	@ltx/en_us_oca/he.a.m4:heAU.TachyProkatalave.notmetered
ltx/en_us_oca/me.m11.d03:meVE.Apolytikion2ger.mode	@ltx/en_us_oca/miscellanea:misc.Mode4
ltx/en_us_oca/me.m11.d03:meVE.Apolytikion2ger.poet	@ltx/en_us_oca/poets:po.Gerasimou
ltx/en_us_oca/me.m11.d03:meVE.Apolytikion2ger.text	
ltx/en_us_oca/me.m11.d03:meVE.AposGlory.incipit	The three children preserved unharmed…
ltx/en_us_oca/me.m11.d03:meVE.AposGlory.melody	
ltx/en_us_oca/me.m11.d03:meVE.AposGlory.mode	@ltx/en_us_oca/miscellanea:misc.Mode6
ltx/en_us_oca/me.m11.d03:meVE.AposGlory.poet	@ltx/en_us_oca/poets:po.EfraimKarias
ltx/en_us_oca/me.m11.d03:meVE.AposGlory.text	The three children preserved unharmed by the Persian fire ⁄ mystically foreshadowed your thrice-radiant unity of mind ⁄ and your martyrdom in Christ! ⁄ Athletes of the ineffable Trinity and supernatural Unity, ⁄ as they stood in the midst of the flames and did not cry out against God, ⁄ so also you did not refuse to die ⁄ when your lives were not spared by the love of Christ. ⁄ As in their midst, a fourth appeared who sprinkled them with dew, ⁄ so also Christ, one of the Trinity, ⁄ received you into a place of refreshment! ⁄ Acepsimus, Joseph and Aithalas, chosen by God, ⁄⁄ ever pray for our souls!
ltx/en_us_oca/me.m11.d03:meVE.AposStavrotheotokion.greekmelody	@ltx/en_us_oca/he.a.m6:heAU.TriimerosAnestis.greekname
ltx/en_us_oca/me.m11.d03:meVE.AposStavrotheotokion.incipit	@ltx/en_us_oca/oc.m6.d4:ocMA.AposTheotokion.incipit
ltx/en_us_oca/me.m11.d03:meVE.AposStavrotheotokion.melody	@ltx/en_us_oca/he.a.m6:heAU.TriimerosAnestis.notmetered
ltx/en_us_oca/me.m11.d03:meVE.AposStavrotheotokion.mode	@ltx/en_us_oca/miscellanea:misc.Mode6
ltx/en_us_oca/me.m11.d03:meVE.AposStavrotheotokion.text	@ltx/en_us_oca/oc.m6.d4:ocMA.AposTheotokion.text
ltx/en_us_oca/me.m11.d03:meVE.AposTheotokion.incipit	…
ltx/en_us_oca/me.m11.d03:meVE.AposTheotokion.melody	
ltx/en_us_oca/me.m11.d03:meVE.AposTheotokion.mode	@ltx/en_us_oca/miscellanea:misc.Mode6
ltx/en_us_oca/me.m11.d03:meVE.AposTheotokion.text	
ltx/en_us_oca/me.m11.d03:meVE.Aposticha1.greekmelody	@ltx/en_us_oca/he.a.m4:heAU.OsGennaionEnMartysi.greekname
ltx/en_us_oca/me.m11.d03:meVE.Aposticha1.incipit	…
ltx/en_us_oca/me.m11.d03:meVE.Aposticha1.melody	@ltx/en_us_oca/he.a.m4:heAU.OsGennaionEnMartysi.notmetered
ltx/en_us_oca/me.m11.d03:meVE.Aposticha1.mode	@ltx/en_us_oca/miscellanea:misc.Mode4
ltx/en_us_oca/me.m11.d03:meVE.Aposticha1.text	
ltx/en_us_oca/me.m11.d03:meVE.Aposticha2.incipit	…
ltx/en_us_oca/me.m11.d03:meVE.Aposticha2.melody	@ltx/en_us_oca/he.a.m4:heAU.OsGennaionEnMartysi.notmetered
ltx/en_us_oca/me.m11.d03:meVE.Aposticha2.mode	@ltx/en_us_oca/miscellanea:misc.Mode4
ltx/en_us_oca/me.m11.d03:meVE.Aposticha2.text	
ltx/en_us_oca/me.m11.d03:meVE.Aposticha3.incipit	…
ltx/en_us_oca/me.m11.d03:meVE.Aposticha3.melody	@ltx/en_us_oca/he.a.m4:heAU.OsGennaionEnMartysi.notmetered
ltx/en_us_oca/me.m11.d03:meVE.Aposticha3.mode	@ltx/en_us_oca/miscellanea:misc.Mode4
ltx/en_us_oca/me.m11.d03:meVE.Aposticha3.text	
ltx/en_us_oca/me.m11.d03:meVE.SticGlory.incipit	…
ltx/en_us_oca/me.m11.d03:meVE.SticGlory.melody	
ltx/en_us_oca/me.m11.d03:meVE.SticGlory.mode	@ltx/en_us_oca/miscellanea:misc.Mode6
ltx/en_us_oca/me.m11.d03:meVE.SticGlory.text	
ltx/en_us_oca/me.m11.d03:meVE.SticStavrotheotokion.greekmelody	@ltx/en_us_oca/he.a.m6:heAU.TriimerosAnestis.greekname
ltx/en_us_oca/me.m11.d03:meVE.SticStavrotheotokion.incipit	@ltx/en_us_oca/oc.m6.d4:ocVE.AposTheotokion.incipit
ltx/en_us_oca/me.m11.d03:meVE.SticStavrotheotokion.melody	@ltx/en_us_oca/he.a.m6:heAU.TriimerosAnestis.notmetered
ltx/en_us_oca/me.m11.d03:meVE.SticStavrotheotokion.mode	@ltx/en_us_oca/miscellanea:misc.Mode6
ltx/en_us_oca/me.m11.d03:meVE.SticStavrotheotokion.text	@ltx/en_us_oca/oc.m6.d4:ocVE.AposTheotokion.text
ltx/en_us_oca/me.m11.d03:meVE.SticTheotokion.incipit	@ltx/en_us_oca/he.o:heOT.TheotokeSyEi.incipit
ltx/en_us_oca/me.m11.d03:meVE.SticTheotokion.melody	@ltx/en_us_oca/he.o:heOT.TheotokeSyEi.text
ltx/en_us_oca/me.m11.d03:meVE.SticTheotokion.mode	@ltx/en_us_oca/miscellanea:misc.Mode6
ltx/en_us_oca/me.m11.d03:meVE.SticTheotokion.text	@ltx/en_us_oca/he.o:heOT.TheotokeSyEiAthloforou.text
ltx/en_us_oca/me.m11.d03:meVE.Stichera01.greekmelody	@ltx/en_us_oca/he.a.m5:heAU.ChairoisAskitikon.greekname
ltx/en_us_oca/me.m11.d03:meVE.Stichera01.incipit	…
ltx/en_us_oca/me.m11.d03:meVE.Stichera01.melody	@ltx/en_us_oca/he.a.m5:heAU.ChairoisAskitikon.notmetered
ltx/en_us_oca/me.m11.d03:meVE.Stichera01.mode	@ltx/en_us_oca/miscellanea:misc.Mode5
ltx/en_us_oca/me.m11.d03:meVE.Stichera01.text	
ltx/en_us_oca/me.m11.d03:meVE.Stichera02.incipit	…
ltx/en_us_oca/me.m11.d03:meVE.Stichera02.melody	@ltx/en_us_oca/he.a.m5:heAU.ChairoisAskitikon.notmetered
ltx/en_us_oca/me.m11.d03:meVE.Stichera02.mode	@ltx/en_us_oca/miscellanea:misc.Mode5
ltx/en_us_oca/me.m11.d03:meVE.Stichera02.text	
ltx/en_us_oca/me.m11.d03:meVE.Stichera03.incipit	…
ltx/en_us_oca/me.m11.d03:meVE.Stichera03.melody	@ltx/en_us_oca/he.a.m5:heAU.ChairoisAskitikon.notmetered
ltx/en_us_oca/me.m11.d03:meVE.Stichera03.mode	@ltx/en_us_oca/miscellanea:misc.Mode5
ltx/en_us_oca/me.m11.d03:meVE.Stichera03.text	
ltx/en_us_oca/me.m11.d03:meVE.Stichera04.greekmelody	@ltx/en_us_oca/he.a.m5:heAU.ChairoisAskitikon.greekname
ltx/en_us_oca/me.m11.d03:meVE.Stichera04.incipit	…
ltx/en_us_oca/me.m11.d03:meVE.Stichera04.melody	@ltx/en_us_oca/he.a.m5:heAU.ChairoisAskitikon.notmetered
ltx/en_us_oca/me.m11.d03:meVE.Stichera04.mode	@ltx/en_us_oca/miscellanea:misc.Mode5
ltx/en_us_oca/me.m11.d03:meVE.Stichera04.text	
ltx/en_us_oca/me.m11.d03:meVE.Stichera05.incipit	…
ltx/en_us_oca/me.m11.d03:meVE.Stichera05.melody	@ltx/en_us_oca/he.a.m5:heAU.ChairoisAskitikon.notmetered
ltx/en_us_oca/me.m11.d03:meVE.Stichera05.mode	@ltx/en_us_oca/miscellanea:misc.Mode5
ltx/en_us_oca/me.m11.d03:meVE.Stichera05.text	
ltx/en_us_oca/me.m11.d03:meVE.Stichera06.incipit	…
ltx/en_us_oca/me.m11.d03:meVE.Stichera06.melody	@ltx/en_us_oca/he.a.m5:heAU.ChairoisAskitikon.notmetered
ltx/en_us_oca/me.m11.d03:meVE.Stichera06.mode	@ltx/en_us_oca/miscellanea:misc.Mode5
ltx/en_us_oca/me.m11.d03:meVE.Stichera06.text	
