ltx/en_us_oca/he.a.m3:heAU.ApostoloiEkPeraton.greekname	
ltx/en_us_oca/he.a.m3:heAU.ApostoloiEkPeraton.incipit	…
ltx/en_us_oca/he.a.m3:heAU.ApostoloiEkPeraton.melody	@ltx/en_us_oca/miscellanea:misc.AutomelonNotMetered
ltx/en_us_oca/he.a.m3:heAU.ApostoloiEkPeraton.mode	@ltx/en_us_oca/miscellanea:misc.Mode3
ltx/en_us_oca/he.a.m3:heAU.ApostoloiEkPeraton.name	N/M (Apostles assembled.)
ltx/en_us_oca/he.a.m3:heAU.ApostoloiEkPeraton.notmetered	N/M (Apostles assembled.)
ltx/en_us_oca/he.a.m3:heAU.ApostoloiEkPeraton.text	
ltx/en_us_oca/he.a.m3:heAU.EnPnevmatiToIero.greekname	
ltx/en_us_oca/he.a.m3:heAU.EnPnevmatiToIero.incipit	…
ltx/en_us_oca/he.a.m3:heAU.EnPnevmatiToIero.melody	@ltx/en_us_oca/miscellanea:misc.AutomelonNotMetered
ltx/en_us_oca/he.a.m3:heAU.EnPnevmatiToIero.mode	@ltx/en_us_oca/miscellanea:misc.Mode3
ltx/en_us_oca/he.a.m3:heAU.EnPnevmatiToIero.name	N/M (The Elder.)
ltx/en_us_oca/he.a.m3:heAU.EnPnevmatiToIero.notmetered	N/M (The Elder.)
ltx/en_us_oca/he.a.m3:heAU.EnPnevmatiToIero.text	
ltx/en_us_oca/he.a.m3:heAU.EpefaniOSotir.greekname	
ltx/en_us_oca/he.a.m3:heAU.EpefaniOSotir.incipit	Our Savior is grace and truth…
ltx/en_us_oca/he.a.m3:heAU.EpefaniOSotir.melody	@ltx/en_us_oca/miscellanea:misc.AutomelonNotMetered
ltx/en_us_oca/he.a.m3:heAU.EpefaniOSotir.mode	@ltx/en_us_oca/miscellanea:misc.Mode3
ltx/en_us_oca/he.a.m3:heAU.EpefaniOSotir.name	Our Savior is grace and truth.
ltx/en_us_oca/he.a.m3:heAU.EpefaniOSotir.notmetered	N/M (Our Savior, grace and truth.)
ltx/en_us_oca/he.a.m3:heAU.EpefaniOSotir.text	Our Savior is grace and truth! ⁄ He has appeared in the streams of the Jordan, ⁄ enlightening those sleeping in darkness and shadow. ⁄ For the Light no one can approach has come and is made manifest.
ltx/en_us_oca/he.a.m3:heAU.EpeskepsatoImas.greekname	
ltx/en_us_oca/he.a.m3:heAU.EpeskepsatoImas.incipit	…
ltx/en_us_oca/he.a.m3:heAU.EpeskepsatoImas.melody	@ltx/en_us_oca/miscellanea:misc.AutomelonNotMetered
ltx/en_us_oca/he.a.m3:heAU.EpeskepsatoImas.mode	@ltx/en_us_oca/miscellanea:misc.Mode3
ltx/en_us_oca/he.a.m3:heAU.EpeskepsatoImas.name	N/M (Our Savior, grace and truth.)
ltx/en_us_oca/he.a.m3:heAU.EpeskepsatoImas.notmetered	N/M (Our Savior, grace and truth.)
ltx/en_us_oca/he.a.m3:heAU.EpeskepsatoImas.text	
ltx/en_us_oca/he.a.m3:heAU.FosAnalloioton.greekname	
ltx/en_us_oca/he.a.m3:heAU.FosAnalloioton.incipit	…
ltx/en_us_oca/he.a.m3:heAU.FosAnalloioton.melody	@ltx/en_us_oca/miscellanea:misc.AutomelonNotMetered
ltx/en_us_oca/he.a.m3:heAU.FosAnalloioton.mode	@ltx/en_us_oca/miscellanea:misc.Mode3
ltx/en_us_oca/he.a.m3:heAU.FosAnalloioton.name	N/M (O Logos, light unaltered.)
ltx/en_us_oca/he.a.m3:heAU.FosAnalloioton.notmetered	N/M (O Logos, light unaltered.)
ltx/en_us_oca/he.a.m3:heAU.FosAnalloioton.text	
ltx/en_us_oca/he.a.m3:heAU.IParthenosSimeron.greekname	
ltx/en_us_oca/he.a.m3:heAU.IParthenosSimeron.incipit	…
ltx/en_us_oca/he.a.m3:heAU.IParthenosSimeron.melody	@ltx/en_us_oca/miscellanea:misc.AutomelonNotMetered
ltx/en_us_oca/he.a.m3:heAU.IParthenosSimeron.mode	@ltx/en_us_oca/miscellanea:misc.Mode3
ltx/en_us_oca/he.a.m3:heAU.IParthenosSimeron.name	N/M (On this day.)
ltx/en_us_oca/he.a.m3:heAU.IParthenosSimeron.notmetered	N/M (On this day.)
ltx/en_us_oca/he.a.m3:heAU.IParthenosSimeron.text	
ltx/en_us_oca/he.a.m3:heAU.MegaliTonMartyronSou.greekname	
ltx/en_us_oca/he.a.m3:heAU.MegaliTonMartyronSou.incipit	Great is the might of your martyrs…
ltx/en_us_oca/he.a.m3:heAU.MegaliTonMartyronSou.melody	@ltx/en_us_oca/miscellanea:misc.AutomelonNotMetered
ltx/en_us_oca/he.a.m3:heAU.MegaliTonMartyronSou.mode	@ltx/en_us_oca/miscellanea:misc.Mode3
ltx/en_us_oca/he.a.m3:heAU.MegaliTonMartyronSou.name	Great is the might of your martyrs.
ltx/en_us_oca/he.a.m3:heAU.MegaliTonMartyronSou.notmetered	N/M (The power of Your martyr Saints.)
ltx/en_us_oca/he.a.m3:heAU.MegaliTonMartyronSou.text	Great is the might of your martyrs, O Christ, ⁄ for though they lie in their tombs they drive away demons ⁄ and defeat the power of the enemy. ⁄ They have lived their lives in battle for piety ⁄⁄ by faith in the Trinity.
ltx/en_us_oca/he.a.m3:heAU.MegaliTouStavrouSou.greekname	
ltx/en_us_oca/he.a.m3:heAU.MegaliTouStavrouSou.incipit	…
ltx/en_us_oca/he.a.m3:heAU.MegaliTouStavrouSou.melody	@ltx/en_us_oca/miscellanea:misc.AutomelonNotMetered
ltx/en_us_oca/he.a.m3:heAU.MegaliTouStavrouSou.mode	@ltx/en_us_oca/miscellanea:misc.Mode3
ltx/en_us_oca/he.a.m3:heAU.MegaliTouStavrouSou.name	N/M (The power of Your holy Cross.)
ltx/en_us_oca/he.a.m3:heAU.MegaliTouStavrouSou.notmetered	N/M (The power of Your holy Cross.)
ltx/en_us_oca/he.a.m3:heAU.MegaliTouStavrouSou.text	
ltx/en_us_oca/he.a.m3:heAU.OOuranonToisAstrois.greekname	
ltx/en_us_oca/he.a.m3:heAU.OOuranonToisAstrois.incipit	…
ltx/en_us_oca/he.a.m3:heAU.OOuranonToisAstrois.melody	@ltx/en_us_oca/miscellanea:misc.AutomelonNotMetered
ltx/en_us_oca/he.a.m3:heAU.OOuranonToisAstrois.mode	@ltx/en_us_oca/miscellanea:misc.Mode3
ltx/en_us_oca/he.a.m3:heAU.OOuranonToisAstrois.name	N/M (Having embellished.)
ltx/en_us_oca/he.a.m3:heAU.OOuranonToisAstrois.notmetered	N/M (Having embellished.)
ltx/en_us_oca/he.a.m3:heAU.OOuranonToisAstrois.text	
ltx/en_us_oca/he.a.m3:heAU.SosonMeKyrie.greekname	
ltx/en_us_oca/he.a.m3:heAU.SosonMeKyrie.incipit	…
ltx/en_us_oca/he.a.m3:heAU.SosonMeKyrie.melody	@ltx/en_us_oca/miscellanea:misc.AutomelonNotMetered
ltx/en_us_oca/he.a.m3:heAU.SosonMeKyrie.mode	@ltx/en_us_oca/miscellanea:misc.Mode3
ltx/en_us_oca/he.a.m3:heAU.SosonMeKyrie.name	N/M (Save me, O Lord.)
ltx/en_us_oca/he.a.m3:heAU.SosonMeKyrie.notmetered	N/M (Save me, O Lord.)
ltx/en_us_oca/he.a.m3:heAU.SosonMeKyrie.text	
ltx/en_us_oca/he.a.m3:heAU.StavrofanosMoysis.greekname	
ltx/en_us_oca/he.a.m3:heAU.StavrofanosMoysis.incipit	…
ltx/en_us_oca/he.a.m3:heAU.StavrofanosMoysis.melody	@ltx/en_us_oca/miscellanea:misc.AutomelonNotMetered
ltx/en_us_oca/he.a.m3:heAU.StavrofanosMoysis.mode	@ltx/en_us_oca/miscellanea:misc.Mode3
ltx/en_us_oca/he.a.m3:heAU.StavrofanosMoysis.name	N/M (When Moses stood.)
ltx/en_us_oca/he.a.m3:heAU.StavrofanosMoysis.notmetered	N/M (When Moses stood.)
ltx/en_us_oca/he.a.m3:heAU.StavrofanosMoysis.text	
ltx/en_us_oca/he.a.m3:heAU.TheiasPisteos.greekname	
ltx/en_us_oca/he.a.m3:heAU.TheiasPisteos.incipit	…
ltx/en_us_oca/he.a.m3:heAU.TheiasPisteos.melody	@ltx/en_us_oca/miscellanea:misc.AutomelonNotMetered
ltx/en_us_oca/he.a.m3:heAU.TheiasPisteos.mode	@ltx/en_us_oca/miscellanea:misc.Mode3
ltx/en_us_oca/he.a.m3:heAU.TheiasPisteos.name	N/M (Your confession.)
ltx/en_us_oca/he.a.m3:heAU.TheiasPisteos.notmetered	N/M (Your confession.)
ltx/en_us_oca/he.a.m3:heAU.TheiasPisteos.text	
ltx/en_us_oca/he.a.m3:heAU.TinOraiotita.greekname	
ltx/en_us_oca/he.a.m3:heAU.TinOraiotita.incipit	…
ltx/en_us_oca/he.a.m3:heAU.TinOraiotita.melody	@ltx/en_us_oca/miscellanea:misc.AutomelonNotMetered
ltx/en_us_oca/he.a.m3:heAU.TinOraiotita.mode	@ltx/en_us_oca/miscellanea:misc.Mode3
ltx/en_us_oca/he.a.m3:heAU.TinOraiotita.name	N/M (You were so beautiful.)
ltx/en_us_oca/he.a.m3:heAU.TinOraiotita.notmetered	N/M (You were so beautiful.)
ltx/en_us_oca/he.a.m3:heAU.TinOraiotita.text	
ltx/en_us_oca/he.a.m3:heAU.ToTypoTouStavrou.greekname	
ltx/en_us_oca/he.a.m3:heAU.ToTypoTouStavrou.incipit	…
ltx/en_us_oca/he.a.m3:heAU.ToTypoTouStavrou.melody	@ltx/en_us_oca/miscellanea:misc.AutomelonNotMetered
ltx/en_us_oca/he.a.m3:heAU.ToTypoTouStavrou.mode	@ltx/en_us_oca/miscellanea:misc.Mode3
ltx/en_us_oca/he.a.m3:heAU.ToTypoTouStavrou.name	
ltx/en_us_oca/he.a.m3:heAU.ToTypoTouStavrou.notmetered	N/M ()
ltx/en_us_oca/he.a.m3:heAU.ToTypoTouStavrou.text	
ltx/en_us_oca/he.a.m3:heAU.TonListinAfthimeron.greekname	
ltx/en_us_oca/he.a.m3:heAU.TonListinAfthimeron.incipit	…
ltx/en_us_oca/he.a.m3:heAU.TonListinAfthimeron.melody	@ltx/en_us_oca/miscellanea:misc.AutomelonNotMetered
ltx/en_us_oca/he.a.m3:heAU.TonListinAfthimeron.mode	@ltx/en_us_oca/miscellanea:misc.Mode3
ltx/en_us_oca/he.a.m3:heAU.TonListinAfthimeron.name	N/M (On the very same day.)
ltx/en_us_oca/he.a.m3:heAU.TonListinAfthimeron.notmetered	N/M (On the very same day.)
ltx/en_us_oca/he.a.m3:heAU.TonListinAfthimeron.text	
ltx/en_us_oca/he.a.m3:heAU.TonNymfonaSouVlepo.greekname	
ltx/en_us_oca/he.a.m3:heAU.TonNymfonaSouVlepo.incipit	…
ltx/en_us_oca/he.a.m3:heAU.TonNymfonaSouVlepo.melody	@ltx/en_us_oca/miscellanea:misc.AutomelonNotMetered
ltx/en_us_oca/he.a.m3:heAU.TonNymfonaSouVlepo.mode	@ltx/en_us_oca/miscellanea:misc.Mode3
ltx/en_us_oca/he.a.m3:heAU.TonNymfonaSouVlepo.name	N/M (O my Savior, now I see.)
ltx/en_us_oca/he.a.m3:heAU.TonNymfonaSouVlepo.notmetered	N/M (O my Savior, now I see.)
ltx/en_us_oca/he.a.m3:heAU.TonNymfonaSouVlepo.text	
ltx/en_us_oca/he.a.m3:heAU.title	
