ltx/en_us_oca/me.m01.d05:meCO.C1.acrostic.notice1	
ltx/en_us_oca/me.m01.d05:meCO.C1.acrostic.text	
ltx/en_us_oca/me.m01.d05:meCO.C1.acrostic.title	Canon.
ltx/en_us_oca/me.m01.d05:meCO.C1.title	@ltx/en_us_oca/titles:ti.TheCanon
ltx/en_us_oca/me.m01.d05:meCO.C1.verse	@ltx/en_us_oca/prayers:pr.verse_God.text
ltx/en_us_oca/me.m01.d05:meCO.Ode1C11.incipit	Lord my God, I sing…
ltx/en_us_oca/me.m01.d05:meCO.Ode1C11.melody	@ltx/en_us_oca/he.h.m6:heHE.KymatiThalassisEpiphany.notmetered
ltx/en_us_oca/me.m01.d05:meCO.Ode1C11.mode	@ltx/en_us_oca/miscellanea:misc.Mode6
ltx/en_us_oca/me.m01.d05:meCO.Ode1C11.ode	@ltx/en_us_oca/miscellanea:misc.Ode1
ltx/en_us_oca/me.m01.d05:meCO.Ode1C11.text	Lord my God, I sing to You a hymn of light, ⁄ rejoicing in the vigil of the feast, ⁄ for by Your Theophany You have given me divine rebirth, ⁄ raising me up to divine brightness.
ltx/en_us_oca/me.m01.d05:meCO.Ode1C12.incipit	All things in heaven and…
ltx/en_us_oca/me.m01.d05:meCO.Ode1C12.melody	@ltx/en_us_oca/he.h.m6:heHE.KymatiThalassisEpiphany.notmetered
ltx/en_us_oca/me.m01.d05:meCO.Ode1C12.mode	@ltx/en_us_oca/miscellanea:misc.Mode6
ltx/en_us_oca/me.m01.d05:meCO.Ode1C12.ode	@ltx/en_us_oca/miscellanea:misc.Ode1
ltx/en_us_oca/me.m01.d05:meCO.Ode1C12.text	All things in heaven and on earth were amazed, ⁄ beholding You manifest above before the ages ⁄ and now newly manifest below! ⁄ They sing praises to your ineffable condescension!
ltx/en_us_oca/me.m01.d05:meCO.Ode1C13.incipit	Wishing to fill all things…
ltx/en_us_oca/me.m01.d05:meCO.Ode1C13.melody	@ltx/en_us_oca/he.h.m6:heHE.KymatiThalassisEpiphany.notmetered
ltx/en_us_oca/me.m01.d05:meCO.Ode1C13.mode	@ltx/en_us_oca/miscellanea:misc.Mode6
ltx/en_us_oca/me.m01.d05:meCO.Ode1C13.ode	@ltx/en_us_oca/miscellanea:misc.Ode1
ltx/en_us_oca/me.m01.d05:meCO.Ode1C13.text	Wishing to fill all things with Your glory, ⁄ You have emptied Yourself and taken the form of a servant! ⁄ Now as a Servant You bow Your head beneath the servant’s hand; ⁄ to cleanse me and restore me!
ltx/en_us_oca/me.m01.d05:meCO.Ode1C1H.incipit	@ltx/en_us_oca/he.h.m6:heHE.KymatiThalassisEpiphany.incipit
ltx/en_us_oca/me.m01.d05:meCO.Ode1C1H.melody	@ltx/en_us_oca/he.h.m6:heHE.KymatiThalassisEpiphany.melody
ltx/en_us_oca/me.m01.d05:meCO.Ode1C1H.mode	@ltx/en_us_oca/miscellanea:misc.Mode6
ltx/en_us_oca/me.m01.d05:meCO.Ode1C1H.ode	@ltx/en_us_oca/miscellanea:misc.Ode1
ltx/en_us_oca/me.m01.d05:meCO.Ode1C1H.text	@ltx/en_us_oca/he.h.m6:heHE.KymatiThalassisEpiphany.text
ltx/en_us_oca/me.m01.d05:meCO.Ode3C11.incipit	Manifesting the signs of Your…
ltx/en_us_oca/me.m01.d05:meCO.Ode3C11.melody	@ltx/en_us_oca/he.h.m6:heHE.SeTonEpiYdatonEpiphany.notmetered
ltx/en_us_oca/me.m01.d05:meCO.Ode3C11.mode	@ltx/en_us_oca/miscellanea:misc.Mode6
ltx/en_us_oca/me.m01.d05:meCO.Ode3C11.ode	@ltx/en_us_oca/miscellanea:misc.Ode3
ltx/en_us_oca/me.m01.d05:meCO.Ode3C11.text	Manifesting the signs of Your Theophany, merciful Lord, ⁄ You have unfolded visions and breathed forth prophecies. ⁄ Now You have come, fulfilling them all: ⁄ revealing Yourself today to men and granting them a new rebirth.
ltx/en_us_oca/me.m01.d05:meCO.Ode3C12.incipit	Jordan has spread out its…
ltx/en_us_oca/me.m01.d05:meCO.Ode3C12.melody	@ltx/en_us_oca/he.h.m6:heHE.SeTonEpiYdatonEpiphany.notmetered
ltx/en_us_oca/me.m01.d05:meCO.Ode3C12.mode	@ltx/en_us_oca/miscellanea:misc.Mode6
ltx/en_us_oca/me.m01.d05:meCO.Ode3C12.ode	@ltx/en_us_oca/miscellanea:misc.Ode3
ltx/en_us_oca/me.m01.d05:meCO.Ode3C12.text	Jordan has spread out its waters to receive the Creator; ⁄ He is baptized in the flesh to sanctify all who cry: ⁄ None is holy but You, O Lord!
ltx/en_us_oca/me.m01.d05:meCO.Ode3C13.incipit	By Baptism Christ grants salvation…
ltx/en_us_oca/me.m01.d05:meCO.Ode3C13.melody	@ltx/en_us_oca/he.h.m6:heHE.SeTonEpiYdatonEpiphany.notmetered
ltx/en_us_oca/me.m01.d05:meCO.Ode3C13.mode	@ltx/en_us_oca/miscellanea:misc.Mode6
ltx/en_us_oca/me.m01.d05:meCO.Ode3C13.ode	@ltx/en_us_oca/miscellanea:misc.Ode3
ltx/en_us_oca/me.m01.d05:meCO.Ode3C13.text	By Baptism Christ grants salvation ⁄ to all who behold His divine brightness and sing in joy: ⁄ None is holy but You, Lord and Lover of mankind!
ltx/en_us_oca/me.m01.d05:meCO.Ode3C1H.incipit	@ltx/en_us_oca/he.h.m6:heHE.SeTonEpiYdatonEpiphany.incipit
ltx/en_us_oca/me.m01.d05:meCO.Ode3C1H.melody	@ltx/en_us_oca/he.h.m6:heHE.SeTonEpiYdatonEpiphany.melody
ltx/en_us_oca/me.m01.d05:meCO.Ode3C1H.mode	@ltx/en_us_oca/miscellanea:misc.Mode6
ltx/en_us_oca/me.m01.d05:meCO.Ode3C1H.ode	@ltx/en_us_oca/miscellanea:misc.Ode3
ltx/en_us_oca/me.m01.d05:meCO.Ode3C1H.text	@ltx/en_us_oca/he.h.m6:heHE.SeTonEpiYdatonEpiphany.text
ltx/en_us_oca/me.m01.d05:meCO.Ode4C11.incipit	At Your manifestation in the…
ltx/en_us_oca/me.m01.d05:meCO.Ode4C11.melody	@ltx/en_us_oca/he.h.m6:heHE.TinProsToBaptismaSou.notmetered
ltx/en_us_oca/me.m01.d05:meCO.Ode4C11.mode	@ltx/en_us_oca/miscellanea:misc.Mode6
ltx/en_us_oca/me.m01.d05:meCO.Ode4C11.ode	@ltx/en_us_oca/miscellanea:misc.Ode4
ltx/en_us_oca/me.m01.d05:meCO.Ode4C11.text	At Your manifestation in the flesh, ⁄ the earth was sanctified, and the waters were blessed. ⁄ Heaven was enlightened ⁄ and mankind was set free from the oppression of the enemy!
ltx/en_us_oca/me.m01.d05:meCO.Ode4C12.incipit	The Forerunner now comes from…
ltx/en_us_oca/me.m01.d05:meCO.Ode4C12.melody	@ltx/en_us_oca/he.h.m6:heHE.TinProsToBaptismaSou.notmetered
ltx/en_us_oca/me.m01.d05:meCO.Ode4C12.mode	@ltx/en_us_oca/miscellanea:misc.Mode6
ltx/en_us_oca/me.m01.d05:meCO.Ode4C12.ode	@ltx/en_us_oca/miscellanea:misc.Ode4
ltx/en_us_oca/me.m01.d05:meCO.Ode4C12.text	The Forerunner now comes from the wilderness to the Jordan ⁄ at a divine command. ⁄ He cries: Repent, for the Kingdom of heaven is at hand! ⁄ Calling all to the glory of God!
ltx/en_us_oca/me.m01.d05:meCO.Ode4C13.incipit	He Who turned the sea…
ltx/en_us_oca/me.m01.d05:meCO.Ode4C13.melody	@ltx/en_us_oca/he.h.m6:heHE.TinProsToBaptismaSou.notmetered
ltx/en_us_oca/me.m01.d05:meCO.Ode4C13.mode	@ltx/en_us_oca/miscellanea:misc.Mode6
ltx/en_us_oca/me.m01.d05:meCO.Ode4C13.ode	@ltx/en_us_oca/miscellanea:misc.Ode4
ltx/en_us_oca/me.m01.d05:meCO.Ode4C13.text	He Who turned the sea into dry land ⁄ and caused springs of water to flow from the rock, ⁄ now makes Jordan’s stream a flaming furnace ⁄ and burns our sins with the fire of the Spirit!
ltx/en_us_oca/me.m01.d05:meCO.Ode4C1H.incipit	@ltx/en_us_oca/he.h.m6:heHE.TinProsToBaptismaSou.incipit
ltx/en_us_oca/me.m01.d05:meCO.Ode4C1H.melody	@ltx/en_us_oca/he.h.m6:heHE.TinProsToBaptismaSou.melody
ltx/en_us_oca/me.m01.d05:meCO.Ode4C1H.mode	@ltx/en_us_oca/miscellanea:misc.Mode6
ltx/en_us_oca/me.m01.d05:meCO.Ode4C1H.ode	@ltx/en_us_oca/miscellanea:misc.Ode4
ltx/en_us_oca/me.m01.d05:meCO.Ode4C1H.text	@ltx/en_us_oca/he.h.m6:heHE.TinProsToBaptismaSou.text
ltx/en_us_oca/me.m01.d05:meCO.Ode5C11.incipit	You are the new Adam…
ltx/en_us_oca/me.m01.d05:meCO.Ode5C11.melody	@ltx/en_us_oca/he.h.m6:heHE.TheofaneiasSouChristeEpiphany.notmetered
ltx/en_us_oca/me.m01.d05:meCO.Ode5C11.mode	@ltx/en_us_oca/miscellanea:misc.Mode6
ltx/en_us_oca/me.m01.d05:meCO.Ode5C11.ode	@ltx/en_us_oca/miscellanea:misc.Ode5
ltx/en_us_oca/me.m01.d05:meCO.Ode5C11.text	You are the new Adam, Creator; ⁄ You renewed those born on earth! ⁄ You show a mysterious regeneration ⁄ and wonderful restoration by fire, the Spirit and water! ⁄ Without destruction or confusion ⁄ You renew mankind through the sacrament of Baptism!
ltx/en_us_oca/me.m01.d05:meCO.Ode5C12.incipit	You renew our souls through…
ltx/en_us_oca/me.m01.d05:meCO.Ode5C12.melody	@ltx/en_us_oca/he.h.m6:heHE.TheofaneiasSouChristeEpiphany.notmetered
ltx/en_us_oca/me.m01.d05:meCO.Ode5C12.mode	@ltx/en_us_oca/miscellanea:misc.Mode6
ltx/en_us_oca/me.m01.d05:meCO.Ode5C12.ode	@ltx/en_us_oca/miscellanea:misc.Ode5
ltx/en_us_oca/me.m01.d05:meCO.Ode5C12.text	You renew our souls through the Spirit ⁄ and sanctify our body through the element of water: ⁄ You refashion man as a living being! ⁄ For in Your wisdom and knowledge, as the Physician of souls and bodies, ⁄ You provide remedies that are good and fitting for both.
ltx/en_us_oca/me.m01.d05:meCO.Ode5C13.incipit	You came forth from a…
ltx/en_us_oca/me.m01.d05:meCO.Ode5C13.melody	@ltx/en_us_oca/he.h.m6:heHE.TheofaneiasSouChristeEpiphany.notmetered
ltx/en_us_oca/me.m01.d05:meCO.Ode5C13.mode	@ltx/en_us_oca/miscellanea:misc.Mode6
ltx/en_us_oca/me.m01.d05:meCO.Ode5C13.ode	@ltx/en_us_oca/miscellanea:misc.Ode5
ltx/en_us_oca/me.m01.d05:meCO.Ode5C13.text	You came forth from a painless birth, ⁄ Word co-eternal with the Father. ⁄ You approach a man born from a barren mother ⁄ and as Man You ask him for Baptism. ⁄ Through water and the Spirit, Savior, ⁄ You make the barren Church mystically the Mother of many children!
ltx/en_us_oca/me.m01.d05:meCO.Ode5C1H.incipit	@ltx/en_us_oca/he.h.m6:heHE.TheofaneiasSouChristeEpiphany.incipit
ltx/en_us_oca/me.m01.d05:meCO.Ode5C1H.melody	@ltx/en_us_oca/he.h.m6:heHE.TheofaneiasSouChristeEpiphany.melody
ltx/en_us_oca/me.m01.d05:meCO.Ode5C1H.mode	@ltx/en_us_oca/miscellanea:misc.Mode6
ltx/en_us_oca/me.m01.d05:meCO.Ode5C1H.ode	@ltx/en_us_oca/miscellanea:misc.Ode5
ltx/en_us_oca/me.m01.d05:meCO.Ode5C1H.text	@ltx/en_us_oca/he.h.m6:heHE.TheofaneiasSouChristeEpiphany.text
ltx/en_us_oca/me.m01.d05:meCO.Ode6C11.incipit	Obeying the decree of Caesar…
ltx/en_us_oca/me.m01.d05:meCO.Ode6C11.melody	@ltx/en_us_oca/he.h.m6:heHE.SyneschethiAllOuKateschethiEpiphany.notmetered
ltx/en_us_oca/me.m01.d05:meCO.Ode6C11.mode	@ltx/en_us_oca/miscellanea:misc.Mode6
ltx/en_us_oca/me.m01.d05:meCO.Ode6C11.ode	@ltx/en_us_oca/miscellanea:misc.Ode6
ltx/en_us_oca/me.m01.d05:meCO.Ode6C11.text	Obeying the decree of Caesar, ⁄ You were enrolled but You were not enslaved. ⁄ You give us comfort in our captivity, ⁄ for You freely submitted Yourself and paid tribute. ⁄ Now You have set free those sold under the law of sin, ⁄ making us worthy to be sons by adoption.
ltx/en_us_oca/me.m01.d05:meCO.Ode6C12.incipit	You reign, but not in…
ltx/en_us_oca/me.m01.d05:meCO.Ode6C12.melody	@ltx/en_us_oca/he.h.m6:heHE.SyneschethiAllOuKateschethiEpiphany.notmetered
ltx/en_us_oca/me.m01.d05:meCO.Ode6C12.mode	@ltx/en_us_oca/miscellanea:misc.Mode6
ltx/en_us_oca/me.m01.d05:meCO.Ode6C12.ode	@ltx/en_us_oca/miscellanea:misc.Ode6
ltx/en_us_oca/me.m01.d05:meCO.Ode6C12.text	You reign, but not in conformity to the world, ⁄ for You are King by nature! ⁄ You are born in the flesh from the tribe of David; ⁄ You have inherited the throne of his kingdom, Deliverer. ⁄ You are vested with eternal power: ⁄ You shall reign to all ages with the Father and the Spirit!
ltx/en_us_oca/me.m01.d05:meCO.Ode6C13.incipit	Of old, the prince of…
ltx/en_us_oca/me.m01.d05:meCO.Ode6C13.melody	@ltx/en_us_oca/he.h.m6:heHE.SyneschethiAllOuKateschethiEpiphany.notmetered
ltx/en_us_oca/me.m01.d05:meCO.Ode6C13.mode	@ltx/en_us_oca/miscellanea:misc.Mode6
ltx/en_us_oca/me.m01.d05:meCO.Ode6C13.ode	@ltx/en_us_oca/miscellanea:misc.Ode6
ltx/en_us_oca/me.m01.d05:meCO.Ode6C13.text	Of old, the prince of this world ⁄ was also named king of all within the waters: ⁄ but by Your cleansing he is strangled and destroyed ⁄ like the legion of demons in the sea! ⁄ With Your mighty arm, Savior, ⁄ You grant freedom to Your creation which he had enslaved!
ltx/en_us_oca/me.m01.d05:meCO.Ode6C1H.incipit	@ltx/en_us_oca/he.h.m6:heHE.SyneschethiAllOuKateschethiEpiphany.incipit
ltx/en_us_oca/me.m01.d05:meCO.Ode6C1H.melody	@ltx/en_us_oca/he.h.m6:heHE.SyneschethiAllOuKateschethiEpiphany.melody
ltx/en_us_oca/me.m01.d05:meCO.Ode6C1H.mode	@ltx/en_us_oca/miscellanea:misc.Mode6
ltx/en_us_oca/me.m01.d05:meCO.Ode6C1H.ode	@ltx/en_us_oca/miscellanea:misc.Ode6
ltx/en_us_oca/me.m01.d05:meCO.Ode6C1H.text	@ltx/en_us_oca/he.h.m6:heHE.SyneschethiAllOuKateschethiEpiphany.text
ltx/en_us_oca/me.m01.d05:meCO.Ode7C11.incipit	Of old the stream of…
ltx/en_us_oca/me.m01.d05:meCO.Ode7C11.melody	@ltx/en_us_oca/he.h.m6:heHE.AfrastonThavma.notmetered
ltx/en_us_oca/me.m01.d05:meCO.Ode7C11.mode	@ltx/en_us_oca/miscellanea:misc.Mode6
ltx/en_us_oca/me.m01.d05:meCO.Ode7C11.ode	@ltx/en_us_oca/miscellanea:misc.Ode7
ltx/en_us_oca/me.m01.d05:meCO.Ode7C11.text	Of old the stream of Jordan was cut in two by Elijah’s mantle. ⁄ This foreshadowed the cutting of the passions by Your Baptism; ⁄ You wove a mantle of incorruption for those who sing: ⁄ Blessed are You, O God, our Redeemer!
ltx/en_us_oca/me.m01.d05:meCO.Ode7C12.incipit	Happy River! ⁄ Receiving the…
ltx/en_us_oca/me.m01.d05:meCO.Ode7C12.melody	@ltx/en_us_oca/he.h.m6:heHE.AfrastonThavma.notmetered
ltx/en_us_oca/me.m01.d05:meCO.Ode7C12.mode	@ltx/en_us_oca/miscellanea:misc.Mode6
ltx/en_us_oca/me.m01.d05:meCO.Ode7C12.ode	@ltx/en_us_oca/miscellanea:misc.Ode7
ltx/en_us_oca/me.m01.d05:meCO.Ode7C12.text	Happy River! ⁄ Receiving the Creator at His Baptism, ⁄ you are made a fountain of life-giving water, ⁄ for the salvation of us who sing: ⁄ Blessed are You, O God, our Redeemer!
ltx/en_us_oca/me.m01.d05:meCO.Ode7C13.incipit	Prefiguring a divine death by…
ltx/en_us_oca/me.m01.d05:meCO.Ode7C13.melody	@ltx/en_us_oca/he.h.m6:heHE.AfrastonThavma.notmetered
ltx/en_us_oca/me.m01.d05:meCO.Ode7C13.mode	@ltx/en_us_oca/miscellanea:misc.Mode6
ltx/en_us_oca/me.m01.d05:meCO.Ode7C13.ode	@ltx/en_us_oca/miscellanea:misc.Ode7
ltx/en_us_oca/me.m01.d05:meCO.Ode7C13.text	Prefiguring a divine death by triple immersion in water, ⁄ we are buried with Christ in Baptism: ⁄ United with His Resurrection on the third day, we cry aloud: ⁄ Blessed are You, O God, our Redeemer!
ltx/en_us_oca/me.m01.d05:meCO.Ode7C14.incipit	Those who in faith desire…
ltx/en_us_oca/me.m01.d05:meCO.Ode7C14.melody	@ltx/en_us_oca/he.h.m6:heHE.AfrastonThavma.notmetered
ltx/en_us_oca/me.m01.d05:meCO.Ode7C14.mode	@ltx/en_us_oca/miscellanea:misc.Mode6
ltx/en_us_oca/me.m01.d05:meCO.Ode7C14.ode	@ltx/en_us_oca/miscellanea:misc.Ode7
ltx/en_us_oca/me.m01.d05:meCO.Ode7C14.text	Those who in faith desire the gift of divine Baptism, ⁄ are made perfect by the one grace of the Father, Son and Spirit. ⁄ They receive the power of adoption as sons as they sing: ⁄ Blessed are You, O God, our Redeemer!
ltx/en_us_oca/me.m01.d05:meCO.Ode7C1H.incipit	@ltx/en_us_oca/he.h.m6:heHE.AfrastonThavmaEpiphany.incipit
ltx/en_us_oca/me.m01.d05:meCO.Ode7C1H.melody	@ltx/en_us_oca/he.h.m6:heHE.AfrastonThavmaEpiphany.melody
ltx/en_us_oca/me.m01.d05:meCO.Ode7C1H.mode	@ltx/en_us_oca/miscellanea:misc.Mode6
ltx/en_us_oca/me.m01.d05:meCO.Ode7C1H.ode	@ltx/en_us_oca/miscellanea:misc.Ode7
ltx/en_us_oca/me.m01.d05:meCO.Ode7C1H.text	@ltx/en_us_oca/he.h.m6:heHE.AfrastonThavmaEpiphany.text
ltx/en_us_oca/me.m01.d05:meCO.Ode8C11.incipit	Fallen Adam is cleansed and…
ltx/en_us_oca/me.m01.d05:meCO.Ode8C11.melody	@ltx/en_us_oca/he.h.m6:heHE.EkstithiFrittonOuraneEpiphany.notmetered
ltx/en_us_oca/me.m01.d05:meCO.Ode8C11.mode	@ltx/en_us_oca/miscellanea:misc.Mode6
ltx/en_us_oca/me.m01.d05:meCO.Ode8C11.ode	@ltx/en_us_oca/miscellanea:misc.Ode8
ltx/en_us_oca/me.m01.d05:meCO.Ode8C11.text	Fallen Adam is cleansed and lifted up; ⁄ deliverance is given to all the faithful through Baptism, ⁄ for Christ comes to shame the destroying tyrant! ⁄ He opens the heavens and sends down the divine Spirit, ⁄ granting mankind a share in incorruption.
ltx/en_us_oca/me.m01.d05:meCO.Ode8C12.incipit	The error of the enemy…
ltx/en_us_oca/me.m01.d05:meCO.Ode8C12.melody	@ltx/en_us_oca/he.h.m6:heHE.EkstithiFrittonOuraneEpiphany.notmetered
ltx/en_us_oca/me.m01.d05:meCO.Ode8C12.mode	@ltx/en_us_oca/miscellanea:misc.Mode6
ltx/en_us_oca/me.m01.d05:meCO.Ode8C12.ode	@ltx/en_us_oca/miscellanea:misc.Ode8
ltx/en_us_oca/me.m01.d05:meCO.Ode8C12.text	The error of the enemy shall cease, ⁄ for the voice of one crying in the wilderness calls out: ⁄ Prepare the way of the Lord; make straight His paths! ⁄ The humble nature of mortal man is exalted ⁄ while the mountains and hills of the adversary are brought low!
ltx/en_us_oca/me.m01.d05:meCO.Ode8C13.incipit	O strange wonder! ⁄ Goodness…
ltx/en_us_oca/me.m01.d05:meCO.Ode8C13.melody	@ltx/en_us_oca/he.h.m6:heHE.EkstithiFrittonOuraneEpiphany.notmetered
ltx/en_us_oca/me.m01.d05:meCO.Ode8C13.mode	@ltx/en_us_oca/miscellanea:misc.Mode6
ltx/en_us_oca/me.m01.d05:meCO.Ode8C13.ode	@ltx/en_us_oca/miscellanea:misc.Ode8
ltx/en_us_oca/me.m01.d05:meCO.Ode8C13.text	O strange wonder! ⁄ Goodness and boundless forbearance! ⁄ The Creator and Master now wears my nature in the Jordan; ⁄ Yet He is without sin. ⁄ He cleanses me through water and enlightens me through fire! ⁄ He perfects me through the divine Spirit!
ltx/en_us_oca/me.m01.d05:meCO.Ode8C1H.incipit	@ltx/en_us_oca/he.h.m6:heHE.EkstithiFrittonOuraneEpiphany.incipit
ltx/en_us_oca/me.m01.d05:meCO.Ode8C1H.melody	@ltx/en_us_oca/he.h.m6:heHE.EkstithiFrittonOuraneEpiphany.melody
ltx/en_us_oca/me.m01.d05:meCO.Ode8C1H.mode	@ltx/en_us_oca/miscellanea:misc.Mode6
ltx/en_us_oca/me.m01.d05:meCO.Ode8C1H.ode	@ltx/en_us_oca/miscellanea:misc.Ode8
ltx/en_us_oca/me.m01.d05:meCO.Ode8C1H.text	@ltx/en_us_oca/he.h.m6:heHE.EkstithiFrittonOuraneEpiphany.text
ltx/en_us_oca/me.m01.d05:meCO.Ode9C11.incipit	You have filled us with…
ltx/en_us_oca/me.m01.d05:meCO.Ode9C11.melody	@ltx/en_us_oca/he.h.m6:heHE.MiEpodyrestheMatin.notmetered
ltx/en_us_oca/me.m01.d05:meCO.Ode9C11.mode	@ltx/en_us_oca/miscellanea:misc.Mode6
ltx/en_us_oca/me.m01.d05:meCO.Ode9C11.ode	@ltx/en_us_oca/miscellanea:misc.Ode9
ltx/en_us_oca/me.m01.d05:meCO.Ode9C11.text	You have filled us with wonder ⁄ by Your strange birth beyond nature from a Virgin, Word of God; ⁄ now You exalt a great mystery: ⁄ By Your holy participation in the waters of Baptism, ⁄ You enrich the font with children through the divine Spirit!
ltx/en_us_oca/me.m01.d05:meCO.Ode9C12.incipit	The earth has been sanctified…
ltx/en_us_oca/me.m01.d05:meCO.Ode9C12.melody	@ltx/en_us_oca/he.h.m6:heHE.MiEpodyrestheMatin.notmetered
ltx/en_us_oca/me.m01.d05:meCO.Ode9C12.mode	@ltx/en_us_oca/miscellanea:misc.Mode6
ltx/en_us_oca/me.m01.d05:meCO.Ode9C12.ode	@ltx/en_us_oca/miscellanea:misc.Ode9
ltx/en_us_oca/me.m01.d05:meCO.Ode9C12.text	The earth has been sanctified, O Word, ⁄ by Your holy Birth. ⁄ The heavens with stars declared Your glory; ⁄ now the nature of the waters is blessed by Your Baptism in the flesh, ⁄ and human nature is restored once more to its first nobility! ⁄ Let the creation rejoice exceedingly!
ltx/en_us_oca/me.m01.d05:meCO.Ode9C13.incipit	Let the heavens be glad…
ltx/en_us_oca/me.m01.d05:meCO.Ode9C13.melody	@ltx/en_us_oca/he.h.m6:heHE.MiEpodyrestheMatin.notmetered
ltx/en_us_oca/me.m01.d05:meCO.Ode9C13.mode	@ltx/en_us_oca/miscellanea:misc.Mode6
ltx/en_us_oca/me.m01.d05:meCO.Ode9C13.ode	@ltx/en_us_oca/miscellanea:misc.Ode9
ltx/en_us_oca/me.m01.d05:meCO.Ode9C13.text	Let the heavens be glad and the earth leap for joy! ⁄ Let the rivers clap their hands and rejoice ⁄ with the springs, the lakes and depths of the sea! ⁄ For Christ comes to cleanse and save Adam by divine Baptism!
ltx/en_us_oca/me.m01.d05:meCO.Ode9C1H.incipit	@ltx/en_us_oca/he.h.m6:heHE.MiEpodyrestheMatin.incipit
ltx/en_us_oca/me.m01.d05:meCO.Ode9C1H.melody	@ltx/en_us_oca/he.h.m6:heHE.MiEpodyrestheMatin.melody
ltx/en_us_oca/me.m01.d05:meCO.Ode9C1H.mode	@ltx/en_us_oca/miscellanea:misc.Mode6
ltx/en_us_oca/me.m01.d05:meCO.Ode9C1H.ode	@ltx/en_us_oca/miscellanea:misc.Ode9
ltx/en_us_oca/me.m01.d05:meCO.Ode9C1H.text	@ltx/en_us_oca/he.h.m6:heHE.MiEpodyrestheMatin.text
ltx/en_us_oca/me.m01.d05:meDA.commemoration.first	
ltx/en_us_oca/me.m01.d05:meDA.commemoration.first_name	
ltx/en_us_oca/me.m01.d05:meDA.commemoration.first_short	
ltx/en_us_oca/me.m01.d05:meDA.commemoration.first_title	
ltx/en_us_oca/me.m01.d05:meDA.commemoration.full	
ltx/en_us_oca/me.m01.d05:meDA.commemoration.second_name	
ltx/en_us_oca/me.m01.d05:meDA.commemoration.second_title	
ltx/en_us_oca/me.m01.d05:meDA.date	
ltx/en_us_oca/me.m01.d05:meDA.fordate	
ltx/en_us_oca/me.m01.d05:meDA.insert1	
ltx/en_us_oca/me.m01.d05:meDA.insert2	
ltx/en_us_oca/me.m01.d05:meDA.note	
ltx/en_us_oca/me.m01.d05:meDA.pdfcoverdate	
ltx/en_us_oca/me.m01.d05:meDA.pdfheaderdate	
ltx/en_us_oca/me.m01.d05:meH.title	This key is deprecated
ltx/en_us_oca/me.m01.d05:meH.translation	This key is deprecated
ltx/en_us_oca/me.m01.d05:meH1.Idiomelon1.incipit	Today the nature of the…
ltx/en_us_oca/me.m01.d05:meH1.Idiomelon1.mode	@ltx/en_us_oca/miscellanea:misc.Mode8
ltx/en_us_oca/me.m01.d05:meH1.Idiomelon1.text	Today the nature of the waters is sanctified; ⁄ Jordan is divided and holds back its own stream, ⁄⁄ seeing the washing of the Master.
ltx/en_us_oca/me.m01.d05:meH1.Idiomelon2.incipit	Christ the King, You have…
ltx/en_us_oca/me.m01.d05:meH1.Idiomelon2.mode	@ltx/en_us_oca/miscellanea:misc.Mode8
ltx/en_us_oca/me.m01.d05:meH1.Idiomelon2.text	Christ the King, You have come to the river as a Man. ⁄ because of our sins, in Your goodness, Lover of mankind, ⁄ You hasten to receive the Baptism of a servant ⁄⁄ at the hands of the Forerunner!
ltx/en_us_oca/me.m01.d05:meH1.Idiomelon3.incipit	At the voice of one…
ltx/en_us_oca/me.m01.d05:meH1.Idiomelon3.mode	@ltx/en_us_oca/miscellanea:misc.Mode8
ltx/en_us_oca/me.m01.d05:meH1.Idiomelon3.text	At the voice of one crying in the wilderness: ⁄ prepare the way of the Lord! ⁄ You have come, Lord, in the form of a servant. ⁄ You are free from sin, yet You desire to be baptized by John! ⁄ The waters saw You and were afraid; ⁄ the Forerunner cried out with trembling, and said: ⁄ How shall the lamp illumine the Light? ⁄ How shall the servant place his hand on the Master? ⁄ Savior, as You take away the sin of the world, ⁄⁄ sanctify both me and the waters.
ltx/en_us_oca/me.m01.d05:meH1.Kontakion.incipit	@ltx/en_us_oca/me.m01.d02:meMA.Kontakion1.incipit
ltx/en_us_oca/me.m01.d05:meH1.Kontakion.text	@ltx/en_us_oca/me.m01.d02:meMA.Kontakion1.text
ltx/en_us_oca/me.m01.d05:meH1.Troparion.incipit	@ltx/en_us_oca/me.m01.d05:meVE.Apolytikion1.incipit
ltx/en_us_oca/me.m01.d05:meH1.Troparion.text	@ltx/en_us_oca/me.m01.d05:meVE.Apolytikion1.text
ltx/en_us_oca/me.m01.d05:meH1.title	
ltx/en_us_oca/me.m01.d05:meH3.Idiomelon1.incipit	The right hand of the…
ltx/en_us_oca/me.m01.d05:meH3.Idiomelon1.mode	@ltx/en_us_oca/miscellanea:misc.Mode8
ltx/en_us_oca/me.m01.d05:meH3.Idiomelon1.text	The right hand of the Forerunner and Baptist, ⁄ the prophet honored above all the prophets, ⁄ trembled as he beheld You, ⁄ for You are the Lamb of God Who cleanses the sins of the world! ⁄ He was seized with fear and he cried: ⁄ I dare not touch your head, O Word! ⁄ In your mercy, sanctify and enlighten me: ⁄⁄ for You are the life and the light and the peace of the world.
ltx/en_us_oca/me.m01.d05:meH3.Idiomelon2.incipit	Today the Trinity, our God…
ltx/en_us_oca/me.m01.d05:meH3.Idiomelon2.mode	@ltx/en_us_oca/miscellanea:misc.Mode4
ltx/en_us_oca/me.m01.d05:meH3.Idiomelon2.text	Today the Trinity, our God without division, ⁄ has made Itself manifest to us. ⁄ For the Father in a loud voice bore clear witness to His Son; ⁄ the Spirit in the form of a dove came down from the sky; ⁄ while the Son bent His immaculate head before the Forerunner. ⁄⁄ By receiving Baptism He delivered us from bondage, in His love for mankind!
ltx/en_us_oca/me.m01.d05:meH3.Idiomelon3.incipit	In your desire to receive…
ltx/en_us_oca/me.m01.d05:meH3.Idiomelon3.mode	@ltx/en_us_oca/miscellanea:misc.Mode5
ltx/en_us_oca/me.m01.d05:meH3.Idiomelon3.text	In your desire to receive Baptism, Lord and Giver of life, ⁄ You have come with Your flesh in man’s form to the Jordan ⁄ to enlighten us when we had gone astray. ⁄ You deliver us in Your compassion from every delusion and snare of the dragon. ⁄ Then the Father bore witness to You, ⁄ and the divine Spirit in the form of a dove came down upon You. ⁄⁄ Make Your dwelling in our souls, Lover of mankind!
ltx/en_us_oca/me.m01.d05:meH3.Kontakion.incipit	@ltx/en_us_oca/me.m01.d02:meMA.Kontakion1.incipit
ltx/en_us_oca/me.m01.d05:meH3.Kontakion.text	@ltx/en_us_oca/me.m01.d02:meMA.Kontakion1.text
ltx/en_us_oca/me.m01.d05:meH3.Troparion.incipit	@ltx/en_us_oca/me.m01.d05:meVE.Apolytikion1.incipit
ltx/en_us_oca/me.m01.d05:meH3.Troparion.text	@ltx/en_us_oca/me.m01.d05:meVE.Apolytikion1.text
ltx/en_us_oca/me.m01.d05:meH3.title	
ltx/en_us_oca/me.m01.d05:meH6.Idiomelon1.incipit	The Lord spoke to John…
ltx/en_us_oca/me.m01.d05:meH6.Idiomelon1.mode	@ltx/en_us_oca/miscellanea:misc.Mode8
ltx/en_us_oca/me.m01.d05:meH6.Idiomelon1.text	The Lord spoke to John and said: ⁄ Prophet, come and baptize Me, your Creator! ⁄ For by grace I enlighten and cleanse all men. ⁄ Touch my divine head and do not doubt. ⁄ Prophet, let it be so now: ⁄ For I have come to fulfill all righteousness. ⁄ Do not have any doubt at all, ⁄ for I hasten to slay the enemy, ⁄ the prince of darkness hidden in the waters, ⁄ that I may now deliver the world from his snares, ⁄⁄ granting eternal life in My love for mankind!
ltx/en_us_oca/me.m01.d05:meH6.Idiomelon2.incipit	Today the prophecy of the…
ltx/en_us_oca/me.m01.d05:meH6.Idiomelon2.mode	@ltx/en_us_oca/miscellanea:misc.Mode6
ltx/en_us_oca/me.m01.d05:meH6.Idiomelon2.text	Today the prophecy of the psalms swiftly approaches its fulfillment: ⁄ the sea looked and fled: ⁄ Jordan was driven back ⁄ before the face of the Lord, ⁄ before the face of the God of Jacob! ⁄ He came to receive Baptism from His servant, ⁄ so that our souls washed clean from the defilement of idolatry, ⁄⁄ might be enlightened through Him!
ltx/en_us_oca/me.m01.d05:meH6.Idiomelon3.incipit	Jordan, why do you turn…
ltx/en_us_oca/me.m01.d05:meH6.Idiomelon3.mode	@ltx/en_us_oca/miscellanea:misc.Mode5
ltx/en_us_oca/me.m01.d05:meH6.Idiomelon3.text	Jordan, why do you turn back your waters? ⁄ Why do you stop your streams? ⁄ Why do you no longer flow in your natural course? ⁄ I cannot bear the Fire that consumes me, he said. ⁄ Before His great condescension I am filled with wonder and dread. ⁄ For I am not used to washing One Who is clean: ⁄ I have learned to cleanse filthy vessels, ⁄ but not to bathe sinless! ⁄ Christ Who is baptized in me teaches me to burn the thorns of sin. ⁄ John, the voice of the Word, bears witness with me and cries: ⁄ Behold the Lamb of God, Who takes away the sin of the world! ⁄ Let us, the faithful cry aloud to Him: ⁄⁄ O God, You are manifest for our salvation; glory to You!
ltx/en_us_oca/me.m01.d05:meH6.Kontakion.incipit	@ltx/en_us_oca/me.m01.d02:meMA.Kontakion1.incipit
ltx/en_us_oca/me.m01.d05:meH6.Kontakion.text	@ltx/en_us_oca/me.m01.d02:meMA.Kontakion1.text
ltx/en_us_oca/me.m01.d05:meH6.Troparion.incipit	@ltx/en_us_oca/me.m01.d05:meVE.Apolytikion1.incipit
ltx/en_us_oca/me.m01.d05:meH6.Troparion.text	@ltx/en_us_oca/me.m01.d05:meVE.Apolytikion1.text
ltx/en_us_oca/me.m01.d05:meH6.title	
ltx/en_us_oca/me.m01.d05:meH9.Idiomelon1.incipit	What strange wonder to see…
ltx/en_us_oca/me.m01.d05:meH9.Idiomelon1.mode	@ltx/en_us_oca/miscellanea:misc.Mode7
ltx/en_us_oca/me.m01.d05:meH9.Idiomelon1.text	What strange wonder to see the Maker of heaven and earth ⁄ stand naked in the river! ⁄ As a servant He receives Baptism from a servant for our salvation! ⁄ The choirs of angels were filled with amazement, fear and joy. ⁄⁄ Joining with them, we worship You: O Lord, save us.
ltx/en_us_oca/me.m01.d05:meH9.Idiomelon2.incipit	When he saw the Lord…
ltx/en_us_oca/me.m01.d05:meH9.Idiomelon2.mode	@ltx/en_us_oca/miscellanea:misc.Mode2
ltx/en_us_oca/me.m01.d05:meH9.Idiomelon2.text	When he saw the Lord of glory draw near to him ⁄ the Forerunner cried out: ⁄ Behold the One Who redeems the world from corruption. ⁄ Behold the One Who delivers us from affliction! ⁄ Behold the One Who in His mercy has come forth upon earth from a pure Virgin, ⁄ granting remission of sins. ⁄ Instead of servants, He makes us the sons of God; ⁄ instead of darkness He gives light to mankind ⁄ Through the water of His divine Baptism. ⁄⁄ Come, let us glorify Him together with the Father and the Holy Spirit!
ltx/en_us_oca/me.m01.d05:meH9.Idiomelon3.incipit	With your hand you touched…
ltx/en_us_oca/me.m01.d05:meH9.Idiomelon3.mode	@ltx/en_us_oca/miscellanea:misc.Mode5
ltx/en_us_oca/me.m01.d05:meH9.Idiomelon3.rubric	
ltx/en_us_oca/me.m01.d05:meH9.Idiomelon3.text	With your hand you touched the immaculate head of the Master. (3 Times) ⁄ And pointing, you have shown Him to us. ⁄ Stretch out that same hand over Him, Baptist, on our behalf, ⁄ for you have great boldness before Him. ⁄ He bore witness to you, that you are greater than all the prophets. ⁄ With your own eyes you have seen the Holy Spirit descend in the form of a dove. ⁄ Lift up those eyes towards Him, Baptist, ⁄ and let Him be merciful to us. ⁄ Come and stand with us. ⁄ Come and stand with us. ⁄ Come and stand with us. ⁄⁄ Setting the seal upon our song and beginning our feast!
ltx/en_us_oca/me.m01.d05:meH9.Kontakion.incipit	@ltx/en_us_oca/me.m01.d02:meMA.Kontakion1.incipit
ltx/en_us_oca/me.m01.d05:meH9.Kontakion.text	@ltx/en_us_oca/me.m01.d02:meMA.Kontakion1.text
ltx/en_us_oca/me.m01.d05:meH9.Troparion.incipit	@ltx/en_us_oca/me.m01.d05:meVE.Apolytikion1.incipit
ltx/en_us_oca/me.m01.d05:meH9.Troparion.text	@ltx/en_us_oca/me.m01.d05:meVE.Apolytikion1.text
ltx/en_us_oca/me.m01.d05:meH9.title	
ltx/en_us_oca/me.m01.d05:meHO.commemorations	
ltx/en_us_oca/me.m01.d05:meHO.note1	@ltx/en_us_oca/rubrical:ru.FastButNotSaturday
ltx/en_us_oca/me.m01.d05:meHO.note2	
ltx/en_us_oca/me.m01.d05:meHO.number	
ltx/en_us_oca/me.m01.d05:meHO.rank	
ltx/en_us_oca/me.m01.d05:meHR.title	
ltx/en_us_oca/me.m01.d05:meHR.translation	
ltx/en_us_oca/me.m01.d05:meLE.commemoration1	
ltx/en_us_oca/me.m01.d05:meLE.commemoration2	
ltx/en_us_oca/me.m01.d05:meLI.Kontakion1.greekmelody	@ltx/en_us_oca/me.m01.d05:meMA.Kontakion1.greekmelody
ltx/en_us_oca/me.m01.d05:meLI.Kontakion1.incipit	@ltx/en_us_oca/me.m01.d05:meMA.Kontakion1.incipit
ltx/en_us_oca/me.m01.d05:meLI.Kontakion1.melody	@ltx/en_us_oca/me.m01.d05:meMA.Kontakion1.melody
ltx/en_us_oca/me.m01.d05:meLI.Kontakion1.mode	@ltx/en_us_oca/me.m01.d05:meMA.Kontakion1.mode
ltx/en_us_oca/me.m01.d05:meLI.Kontakion1.text	@ltx/en_us_oca/me.m01.d05:meMA.Kontakion1.text
ltx/en_us_oca/me.m01.d05:meLI.Megalynarion.text	
ltx/en_us_oca/me.m01.d05:meMA.AposGlory.incipit	@ltx/en_us_oca/me.m01.d02:meMA.AposGlory.incipit
ltx/en_us_oca/me.m01.d05:meMA.AposGlory.melody	
ltx/en_us_oca/me.m01.d05:meMA.AposGlory.mode	@ltx/en_us_oca/miscellanea:misc.Mode8
ltx/en_us_oca/me.m01.d05:meMA.AposGlory.poet	@ltx/en_us_oca/poets:po.Anatoliou
ltx/en_us_oca/me.m01.d05:meMA.AposGlory.text	@ltx/en_us_oca/me.m01.d02:meMA.AposGlory.text
ltx/en_us_oca/me.m01.d05:meMA.Aposticha1.greekmelody	@ltx/en_us_oca/he.a.m2:heAU.OikosTouEfratha.greekname
ltx/en_us_oca/me.m01.d05:meMA.Aposticha1.incipit	…
ltx/en_us_oca/me.m01.d05:meMA.Aposticha1.melody	@ltx/en_us_oca/he.a.m2:heAU.OikosTouEfratha.notmetered
ltx/en_us_oca/me.m01.d05:meMA.Aposticha1.mode	@ltx/en_us_oca/miscellanea:misc.Mode2
ltx/en_us_oca/me.m01.d05:meMA.Aposticha1.text	
ltx/en_us_oca/me.m01.d05:meMA.Aposticha2.incipit	…
ltx/en_us_oca/me.m01.d05:meMA.Aposticha2.melody	@ltx/en_us_oca/he.a.m2:heAU.OikosTouEfratha.notmetered
ltx/en_us_oca/me.m01.d05:meMA.Aposticha2.mode	@ltx/en_us_oca/miscellanea:misc.Mode2
ltx/en_us_oca/me.m01.d05:meMA.Aposticha2.text	
ltx/en_us_oca/me.m01.d05:meMA.Aposticha3.incipit	…
ltx/en_us_oca/me.m01.d05:meMA.Aposticha3.melody	@ltx/en_us_oca/he.a.m2:heAU.OikosTouEfratha.notmetered
ltx/en_us_oca/me.m01.d05:meMA.Aposticha3.mode	@ltx/en_us_oca/miscellanea:misc.Mode2
ltx/en_us_oca/me.m01.d05:meMA.Aposticha3.text	
ltx/en_us_oca/me.m01.d05:meMA.C1.poet	@ltx/en_us_oca/poets:po.Iosif
ltx/en_us_oca/me.m01.d05:meMA.C1.title	@ltx/en_us_oca/titles:ti.CanonForefeast
ltx/en_us_oca/me.m01.d05:meMA.C1.verse	@ltx/en_us_oca/prayers:pr.verse_God.text
ltx/en_us_oca/me.m01.d05:meMA.C2.title	@ltx/en_us_oca/titles:ti.CanonDevoutW
ltx/en_us_oca/me.m01.d05:meMA.C2.verse	@ltx/en_us_oca/prayers:pr.verse_DevoutWoman.text
ltx/en_us_oca/me.m01.d05:meMA.C3.title	@ltx/en_us_oca/titles:ti.CanonMartyrs
ltx/en_us_oca/me.m01.d05:meMA.C3.verse	@ltx/en_us_oca/prayers:pr.verse_SaintsM.text
ltx/en_us_oca/me.m01.d05:meMA.Exaposteilarion1.greekmelody	@ltx/en_us_oca/he.a.m3:heAU.OOuranonToisAstrois.greekname
ltx/en_us_oca/me.m01.d05:meMA.Exaposteilarion1.incipit	…
ltx/en_us_oca/me.m01.d05:meMA.Exaposteilarion1.melody	@ltx/en_us_oca/he.a.m3:heAU.OOuranonToisAstrois.notmetered
ltx/en_us_oca/me.m01.d05:meMA.Exaposteilarion1.mode	@ltx/en_us_oca/miscellanea:misc.Mode3
ltx/en_us_oca/me.m01.d05:meMA.Exaposteilarion1.text	
ltx/en_us_oca/me.m01.d05:meMA.Exaposteilarion2.greekmelody	@ltx/en_us_oca/he.a.m3:heAU.OOuranonToisAstrois.greekname
ltx/en_us_oca/me.m01.d05:meMA.Exaposteilarion2.incipit	You have shone forth in…
ltx/en_us_oca/me.m01.d05:meMA.Exaposteilarion2.melody	@ltx/en_us_oca/he.a.m3:heAU.OOuranonToisAstrois.notmetered
ltx/en_us_oca/me.m01.d05:meMA.Exaposteilarion2.mode	@ltx/en_us_oca/miscellanea:misc.Mode3
ltx/en_us_oca/me.m01.d05:meMA.Exaposteilarion2.text	You have shone forth in the flesh from a Virgin in Bethlehem; ⁄ now You hasten towards the Jordan. ⁄ You will wash clean through holy Baptism ⁄ the filth of all the earth-born. ⁄⁄ You lead them out of darkness to the light!
ltx/en_us_oca/me.m01.d05:meMA.Kathisma11.greekmelody	@ltx/en_us_oca/he.a.m1:heAU.ChorosAngelikos.greekname
ltx/en_us_oca/me.m01.d05:meMA.Kathisma11.incipit	Rejoice, river Jordan, for the…
ltx/en_us_oca/me.m01.d05:meMA.Kathisma11.melody	@ltx/en_us_oca/he.a.m1:heAU.ChorosAngelikos.notmetered
ltx/en_us_oca/me.m01.d05:meMA.Kathisma11.mode	@ltx/en_us_oca/miscellanea:misc.Mode1
ltx/en_us_oca/me.m01.d05:meMA.Kathisma11.text	Rejoice, river Jordan, for the Maker of all draws near! ⁄ In His compassion, He desires to receive Baptism in your streams from a servant. ⁄ Rejoice and be glad Adam, and Eve the mother of mankind! ⁄⁄ For the Redeemer of all has come: God, supreme in goodness!
ltx/en_us_oca/me.m01.d05:meMA.Kathisma12.greekmelody	@ltx/en_us_oca/he.a.m1:heAU.ChorosAngelikos.greekname
ltx/en_us_oca/me.m01.d05:meMA.Kathisma12.incipit	The mighty Rain comes forth…
ltx/en_us_oca/me.m01.d05:meMA.Kathisma12.melody	@ltx/en_us_oca/he.a.m1:heAU.ChorosAngelikos.notmetered
ltx/en_us_oca/me.m01.d05:meMA.Kathisma12.mode	@ltx/en_us_oca/miscellanea:misc.Mode1
ltx/en_us_oca/me.m01.d05:meMA.Kathisma12.text	The mighty Rain comes forth to the streams of the River, ⁄ desiring Baptism in the flesh. ⁄ Filled with amazement, the divine Forerunner said to Him: ⁄ How shall I baptize You, immaculate One? ⁄ How shall I stretch out my right hand upon Your head, ⁄⁄ for all things tremble before You?
ltx/en_us_oca/me.m01.d05:meMA.Kathisma21.greekmelody	@ltx/en_us_oca/he.a.m3:heAU.TinOraiotita.greekname
ltx/en_us_oca/me.m01.d05:meMA.Kathisma21.incipit	Together let us sing the…
ltx/en_us_oca/me.m01.d05:meMA.Kathisma21.melody	@ltx/en_us_oca/he.a.m3:heAU.TinOraiotita.notmetered
ltx/en_us_oca/me.m01.d05:meMA.Kathisma21.mode	@ltx/en_us_oca/miscellanea:misc.Mode3
ltx/en_us_oca/me.m01.d05:meMA.Kathisma21.text	Together let us sing the praises of Him Who is beyond understanding: ⁄ In the flesh, He was made poor and came to Baptism ⁄ thus working our restoration, for He is God, rich in mercy! ⁄ Let us magnify His condescension, crying aloud with thankful hearts: ⁄⁄ Glory to Your Epiphany, O Christ!
ltx/en_us_oca/me.m01.d05:meMA.Kathisma22.greekmelody	@ltx/en_us_oca/he.a.m3:heAU.TinOraiotita.greekname
ltx/en_us_oca/me.m01.d05:meMA.Kathisma22.incipit	…
ltx/en_us_oca/me.m01.d05:meMA.Kathisma22.melody	@ltx/en_us_oca/he.a.m3:heAU.TinOraiotita.notmetered
ltx/en_us_oca/me.m01.d05:meMA.Kathisma22.mode	@ltx/en_us_oca/miscellanea:misc.Mode3
ltx/en_us_oca/me.m01.d05:meMA.Kathisma22.text	
ltx/en_us_oca/me.m01.d05:meMA.Kontakion1.greekmelody	@ltx/en_us_oca/he.a.m4:heAU.EpefanisSimeron.greekname
ltx/en_us_oca/me.m01.d05:meMA.Kontakion1.incipit	@ltx/en_us_oca/me.m01.d02:meMA.Kontakion1.incipit
ltx/en_us_oca/me.m01.d05:meMA.Kontakion1.melody	@ltx/en_us_oca/he.a.m4:heAU.EpefanisSimeron.notmetered
ltx/en_us_oca/me.m01.d05:meMA.Kontakion1.mode	@ltx/en_us_oca/miscellanea:misc.Mode4
ltx/en_us_oca/me.m01.d05:meMA.Kontakion1.text	@ltx/en_us_oca/me.m01.d02:meMA.Kontakion1.text
ltx/en_us_oca/me.m01.d05:meMA.Lauds1.greekmelody	@ltx/en_us_oca/he.a.m6:heAU.AiAngelikai.greekname
ltx/en_us_oca/me.m01.d05:meMA.Lauds1.incipit	Baptist, why do you doubt…
ltx/en_us_oca/me.m01.d05:meMA.Lauds1.melody	@ltx/en_us_oca/he.a.m6:heAU.AiAngelikai.notmetered
ltx/en_us_oca/me.m01.d05:meMA.Lauds1.mode	@ltx/en_us_oca/miscellanea:misc.Mode6
ltx/en_us_oca/me.m01.d05:meMA.Lauds1.text	Baptist, why do you doubt the dispensation ⁄ that I fulfill for the salvation of all? ⁄ Set aside the old now and believe in the new! ⁄ Believe in God Who has come down to earth! ⁄ Draw near and obey me, ⁄⁄ for as God, I have come to cleanse fallen Adam in My compassion.
ltx/en_us_oca/me.m01.d05:meMA.Lauds2.incipit	Taking our sins upon Your…
ltx/en_us_oca/me.m01.d05:meMA.Lauds2.melody	@ltx/en_us_oca/he.a.m6:heAU.AiAngelikai.notmetered
ltx/en_us_oca/me.m01.d05:meMA.Lauds2.mode	@ltx/en_us_oca/miscellanea:misc.Mode6
ltx/en_us_oca/me.m01.d05:meMA.Lauds2.text	Taking our sins upon Your shoulders, Jesus, ⁄ You have come to the streams of Jordan. ⁄ I am afraid at Your awesome appearing! ⁄ How do You ask me to baptize You? ⁄ You have come to cleanse me; ⁄⁄ how do You, the Cleanser of all, seek Baptism from me?
ltx/en_us_oca/me.m01.d05:meMA.Lauds3.incipit	My nature is beyond all…
ltx/en_us_oca/me.m01.d05:meMA.Lauds3.melody	@ltx/en_us_oca/he.a.m6:heAU.AiAngelikai.notmetered
ltx/en_us_oca/me.m01.d05:meMA.Lauds3.mode	@ltx/en_us_oca/miscellanea:misc.Mode6
ltx/en_us_oca/me.m01.d05:meMA.Lauds3.text	My nature is beyond all understanding: ⁄ clothed in the form of a servant I have come to Jordan. ⁄ Do not doubt at all concerning Me. ⁄ Come to Me and do not fear! ⁄ Place your right hand on My head and cry aloud: ⁄⁄ Blessed are You, our God made manifest: Glory to You!
ltx/en_us_oca/me.m01.d05:meMA.Lauds4.greekmelody	@ltx/en_us_oca/he.a.m6:heAU.AiAngelikai.greekname
ltx/en_us_oca/me.m01.d05:meMA.Lauds4.incipit	Your poverty is beyond all…
ltx/en_us_oca/me.m01.d05:meMA.Lauds4.melody	@ltx/en_us_oca/he.a.m6:heAU.AiAngelikai.notmetered
ltx/en_us_oca/me.m01.d05:meMA.Lauds4.mode	@ltx/en_us_oca/miscellanea:misc.Mode6
ltx/en_us_oca/me.m01.d05:meMA.Lauds4.text	Your poverty is beyond all thought and without measure, Word of God! ⁄ I know that in pity for my fallen sake, ⁄ You have clothed yourself in Adam; ⁄ You renew all the seed of Adam. ⁄ Obeying Your command I cry to You in faith: ⁄⁄ Blessed are You, our God made manifest: Glory to You!
ltx/en_us_oca/me.m01.d05:meMA.LaudsBoth.incipit	Peoples, let us sing to…
ltx/en_us_oca/me.m01.d05:meMA.LaudsBoth.melody	@ltx/en_us_oca/he.a.m6:heAU.AiAngelikai.notmetered
ltx/en_us_oca/me.m01.d05:meMA.LaudsBoth.mode	@ltx/en_us_oca/miscellanea:misc.Mode6
ltx/en_us_oca/me.m01.d05:meMA.LaudsBoth.text	Peoples, let us sing to the One born of a Virgin! ⁄ He was baptized in the river Jordan! ⁄ Let us cry aloud to Him: ⁄ King of all creation, ⁄ grant us in faith, that with clear conscience and uncondemned, ⁄⁄ We may reach Your holy Resurrection from the dead on the third day.
ltx/en_us_oca/me.m01.d05:meMA.LaudsGlory.incipit	John, minister in trembling to…
ltx/en_us_oca/me.m01.d05:meMA.LaudsGlory.melody	@ltx/en_us_oca/he.a.m6:heAU.AiAngelikai.notmetered
ltx/en_us_oca/me.m01.d05:meMA.LaudsGlory.mode	@ltx/en_us_oca/miscellanea:misc.Mode6
ltx/en_us_oca/me.m01.d05:meMA.LaudsGlory.text	John, minister in trembling to the Master! ⁄ Rejoice in soul and cry with gladness: ⁄ Rejoice with me, all generations of Adam the forefather! ⁄ Our Expectation has come: ⁄ He is filled with loving kindness! ⁄⁄ Christ has come to Jordan to cleanse all from the sin of Adam!
ltx/en_us_oca/me.m01.d05:meMA.MM.Apos1123as5678.text	@ltx/en_us_oca/properties:media.key
ltx/en_us_oca/me.m01.d05:meMA.Ode1C11.greekmelody	@ltx/en_us_oca/he.h.m1:heHE.ChristosGennatai.greekname
ltx/en_us_oca/me.m01.d05:meMA.Ode1C11.incipit	…
ltx/en_us_oca/me.m01.d05:meMA.Ode1C11.melody	@ltx/en_us_oca/he.h.m1:heHE.ChristosGennatai.notmetered
ltx/en_us_oca/me.m01.d05:meMA.Ode1C11.mode	@ltx/en_us_oca/miscellanea:misc.Mode1
ltx/en_us_oca/me.m01.d05:meMA.Ode1C11.ode	@ltx/en_us_oca/miscellanea:misc.Ode1
ltx/en_us_oca/me.m01.d05:meMA.Ode1C11.text	
ltx/en_us_oca/me.m01.d05:meMA.Ode1C12.incipit	…
ltx/en_us_oca/me.m01.d05:meMA.Ode1C12.melody	@ltx/en_us_oca/he.h.m1:heHE.ChristosGennatai.notmetered
ltx/en_us_oca/me.m01.d05:meMA.Ode1C12.mode	@ltx/en_us_oca/miscellanea:misc.Mode1
ltx/en_us_oca/me.m01.d05:meMA.Ode1C12.ode	@ltx/en_us_oca/miscellanea:misc.Ode1
ltx/en_us_oca/me.m01.d05:meMA.Ode1C12.text	
ltx/en_us_oca/me.m01.d05:meMA.Ode1C13.incipit	…
ltx/en_us_oca/me.m01.d05:meMA.Ode1C13.melody	@ltx/en_us_oca/he.h.m1:heHE.ChristosGennatai.notmetered
ltx/en_us_oca/me.m01.d05:meMA.Ode1C13.mode	@ltx/en_us_oca/miscellanea:misc.Mode1
ltx/en_us_oca/me.m01.d05:meMA.Ode1C13.ode	@ltx/en_us_oca/miscellanea:misc.Ode1
ltx/en_us_oca/me.m01.d05:meMA.Ode1C13.text	
ltx/en_us_oca/me.m01.d05:meMA.Ode1C1H.incipit	…
ltx/en_us_oca/me.m01.d05:meMA.Ode1C1H.melody	@ltx/en_us_oca/miscellanea:misc.HeirmosNotMetered
ltx/en_us_oca/me.m01.d05:meMA.Ode1C1H.mode	@ltx/en_us_oca/miscellanea:misc.Mode1
ltx/en_us_oca/me.m01.d05:meMA.Ode1C1H.ode	@ltx/en_us_oca/miscellanea:misc.Ode1
ltx/en_us_oca/me.m01.d05:meMA.Ode1C1H.text	
ltx/en_us_oca/me.m01.d05:meMA.Ode1C21.greekmelody	@ltx/en_us_oca/he.h.m2:heHE.DefteLaoi.greekname
ltx/en_us_oca/me.m01.d05:meMA.Ode1C21.incipit	…
ltx/en_us_oca/me.m01.d05:meMA.Ode1C21.melody	@ltx/en_us_oca/he.h.m2:heHE.DefteLaoi.notmetered
ltx/en_us_oca/me.m01.d05:meMA.Ode1C21.mode	@ltx/en_us_oca/miscellanea:misc.Mode2
ltx/en_us_oca/me.m01.d05:meMA.Ode1C21.ode	@ltx/en_us_oca/miscellanea:misc.Ode1
ltx/en_us_oca/me.m01.d05:meMA.Ode1C21.text	
ltx/en_us_oca/me.m01.d05:meMA.Ode1C22.incipit	…
ltx/en_us_oca/me.m01.d05:meMA.Ode1C22.melody	@ltx/en_us_oca/he.h.m2:heHE.DefteLaoi.notmetered
ltx/en_us_oca/me.m01.d05:meMA.Ode1C22.mode	@ltx/en_us_oca/miscellanea:misc.Mode2
ltx/en_us_oca/me.m01.d05:meMA.Ode1C22.ode	@ltx/en_us_oca/miscellanea:misc.Ode1
ltx/en_us_oca/me.m01.d05:meMA.Ode1C22.text	
ltx/en_us_oca/me.m01.d05:meMA.Ode1C23.incipit	…
ltx/en_us_oca/me.m01.d05:meMA.Ode1C23.melody	@ltx/en_us_oca/he.h.m2:heHE.DefteLaoi.notmetered
ltx/en_us_oca/me.m01.d05:meMA.Ode1C23.mode	@ltx/en_us_oca/miscellanea:misc.Mode2
ltx/en_us_oca/me.m01.d05:meMA.Ode1C23.ode	@ltx/en_us_oca/miscellanea:misc.Ode1
ltx/en_us_oca/me.m01.d05:meMA.Ode1C23.text	
ltx/en_us_oca/me.m01.d05:meMA.Ode1C2T.incipit	…
ltx/en_us_oca/me.m01.d05:meMA.Ode1C2T.melody	@ltx/en_us_oca/he.h.m2:heHE.DefteLaoi.notmetered
ltx/en_us_oca/me.m01.d05:meMA.Ode1C2T.mode	@ltx/en_us_oca/miscellanea:misc.Mode2
ltx/en_us_oca/me.m01.d05:meMA.Ode1C2T.ode	@ltx/en_us_oca/miscellanea:misc.Ode1
ltx/en_us_oca/me.m01.d05:meMA.Ode1C2T.text	
ltx/en_us_oca/me.m01.d05:meMA.Ode1C31.greekmelody	@ltx/en_us_oca/he.h.m7:heHE.AsomenToKyrio.greekname
ltx/en_us_oca/me.m01.d05:meMA.Ode1C31.incipit	…
ltx/en_us_oca/me.m01.d05:meMA.Ode1C31.melody	@ltx/en_us_oca/he.h.m7:heHE.AsomenToKyrio.notmetered
ltx/en_us_oca/me.m01.d05:meMA.Ode1C31.mode	@ltx/en_us_oca/miscellanea:misc.Mode7
ltx/en_us_oca/me.m01.d05:meMA.Ode1C31.ode	@ltx/en_us_oca/miscellanea:misc.Ode1
ltx/en_us_oca/me.m01.d05:meMA.Ode1C31.text	
ltx/en_us_oca/me.m01.d05:meMA.Ode1C32.incipit	…
ltx/en_us_oca/me.m01.d05:meMA.Ode1C32.melody	@ltx/en_us_oca/he.h.m7:heHE.AsomenToKyrio.notmetered
ltx/en_us_oca/me.m01.d05:meMA.Ode1C32.mode	@ltx/en_us_oca/miscellanea:misc.Mode7
ltx/en_us_oca/me.m01.d05:meMA.Ode1C32.ode	@ltx/en_us_oca/miscellanea:misc.Ode1
ltx/en_us_oca/me.m01.d05:meMA.Ode1C32.text	
ltx/en_us_oca/me.m01.d05:meMA.Ode1C33.incipit	…
ltx/en_us_oca/me.m01.d05:meMA.Ode1C33.melody	@ltx/en_us_oca/he.h.m7:heHE.AsomenToKyrio.notmetered
ltx/en_us_oca/me.m01.d05:meMA.Ode1C33.mode	@ltx/en_us_oca/miscellanea:misc.Mode7
ltx/en_us_oca/me.m01.d05:meMA.Ode1C33.ode	@ltx/en_us_oca/miscellanea:misc.Ode1
ltx/en_us_oca/me.m01.d05:meMA.Ode1C33.text	
ltx/en_us_oca/me.m01.d05:meMA.Ode1C3T.incipit	…
ltx/en_us_oca/me.m01.d05:meMA.Ode1C3T.melody	@ltx/en_us_oca/he.h.m7:heHE.AsomenToKyrio.notmetered
ltx/en_us_oca/me.m01.d05:meMA.Ode1C3T.mode	@ltx/en_us_oca/miscellanea:misc.Mode7
ltx/en_us_oca/me.m01.d05:meMA.Ode1C3T.ode	@ltx/en_us_oca/miscellanea:misc.Ode1
ltx/en_us_oca/me.m01.d05:meMA.Ode1C3T.text	
ltx/en_us_oca/me.m01.d05:meMA.Ode3C11.greekmelody	@ltx/en_us_oca/he.h.m1:heHE.ToProTonAionon.greekname
ltx/en_us_oca/me.m01.d05:meMA.Ode3C11.incipit	…
ltx/en_us_oca/me.m01.d05:meMA.Ode3C11.melody	@ltx/en_us_oca/he.h.m1:heHE.ToProTonAionon.notmetered
ltx/en_us_oca/me.m01.d05:meMA.Ode3C11.mode	@ltx/en_us_oca/miscellanea:misc.Mode1
ltx/en_us_oca/me.m01.d05:meMA.Ode3C11.ode	@ltx/en_us_oca/miscellanea:misc.Ode3
ltx/en_us_oca/me.m01.d05:meMA.Ode3C11.text	
ltx/en_us_oca/me.m01.d05:meMA.Ode3C12.incipit	…
ltx/en_us_oca/me.m01.d05:meMA.Ode3C12.melody	@ltx/en_us_oca/he.h.m1:heHE.ToProTonAionon.notmetered
ltx/en_us_oca/me.m01.d05:meMA.Ode3C12.mode	@ltx/en_us_oca/miscellanea:misc.Mode1
ltx/en_us_oca/me.m01.d05:meMA.Ode3C12.ode	@ltx/en_us_oca/miscellanea:misc.Ode3
ltx/en_us_oca/me.m01.d05:meMA.Ode3C12.text	
ltx/en_us_oca/me.m01.d05:meMA.Ode3C13.incipit	…
ltx/en_us_oca/me.m01.d05:meMA.Ode3C13.melody	@ltx/en_us_oca/he.h.m1:heHE.ToProTonAionon.notmetered
ltx/en_us_oca/me.m01.d05:meMA.Ode3C13.mode	@ltx/en_us_oca/miscellanea:misc.Mode1
ltx/en_us_oca/me.m01.d05:meMA.Ode3C13.ode	@ltx/en_us_oca/miscellanea:misc.Ode3
ltx/en_us_oca/me.m01.d05:meMA.Ode3C13.text	
ltx/en_us_oca/me.m01.d05:meMA.Ode3C1H.incipit	…
ltx/en_us_oca/me.m01.d05:meMA.Ode3C1H.melody	@ltx/en_us_oca/miscellanea:misc.HeirmosNotMetered
ltx/en_us_oca/me.m01.d05:meMA.Ode3C1H.mode	@ltx/en_us_oca/miscellanea:misc.Mode1
ltx/en_us_oca/me.m01.d05:meMA.Ode3C1H.ode	@ltx/en_us_oca/miscellanea:misc.Ode3
ltx/en_us_oca/me.m01.d05:meMA.Ode3C1H.text	
ltx/en_us_oca/me.m01.d05:meMA.Ode3C21.greekmelody	@ltx/en_us_oca/he.h.m2:heHE.StereosonImasEnSoiKyrie.greekname
ltx/en_us_oca/me.m01.d05:meMA.Ode3C21.incipit	…
ltx/en_us_oca/me.m01.d05:meMA.Ode3C21.melody	@ltx/en_us_oca/he.h.m2:heHE.StereosonImasEnSoiKyrie.notmetered
ltx/en_us_oca/me.m01.d05:meMA.Ode3C21.mode	@ltx/en_us_oca/miscellanea:misc.Mode2
ltx/en_us_oca/me.m01.d05:meMA.Ode3C21.ode	@ltx/en_us_oca/miscellanea:misc.Ode3
ltx/en_us_oca/me.m01.d05:meMA.Ode3C21.text	
ltx/en_us_oca/me.m01.d05:meMA.Ode3C22.incipit	…
ltx/en_us_oca/me.m01.d05:meMA.Ode3C22.melody	@ltx/en_us_oca/he.h.m2:heHE.StereosonImasEnSoiKyrie.notmetered
ltx/en_us_oca/me.m01.d05:meMA.Ode3C22.mode	@ltx/en_us_oca/miscellanea:misc.Mode2
ltx/en_us_oca/me.m01.d05:meMA.Ode3C22.ode	@ltx/en_us_oca/miscellanea:misc.Ode3
ltx/en_us_oca/me.m01.d05:meMA.Ode3C22.text	
ltx/en_us_oca/me.m01.d05:meMA.Ode3C23.incipit	…
ltx/en_us_oca/me.m01.d05:meMA.Ode3C23.melody	@ltx/en_us_oca/he.h.m2:heHE.StereosonImasEnSoiKyrie.notmetered
ltx/en_us_oca/me.m01.d05:meMA.Ode3C23.mode	@ltx/en_us_oca/miscellanea:misc.Mode2
ltx/en_us_oca/me.m01.d05:meMA.Ode3C23.ode	@ltx/en_us_oca/miscellanea:misc.Ode3
ltx/en_us_oca/me.m01.d05:meMA.Ode3C23.text	
ltx/en_us_oca/me.m01.d05:meMA.Ode3C2T.incipit	…
ltx/en_us_oca/me.m01.d05:meMA.Ode3C2T.melody	@ltx/en_us_oca/he.h.m2:heHE.StereosonImasEnSoiKyrie.notmetered
ltx/en_us_oca/me.m01.d05:meMA.Ode3C2T.mode	@ltx/en_us_oca/miscellanea:misc.Mode2
ltx/en_us_oca/me.m01.d05:meMA.Ode3C2T.ode	@ltx/en_us_oca/miscellanea:misc.Ode3
ltx/en_us_oca/me.m01.d05:meMA.Ode3C2T.text	
ltx/en_us_oca/me.m01.d05:meMA.Ode3C31.greekmelody	@ltx/en_us_oca/he.h.m7:heHE.EstereothiIKardiaMou.greekname
ltx/en_us_oca/me.m01.d05:meMA.Ode3C31.incipit	…
ltx/en_us_oca/me.m01.d05:meMA.Ode3C31.melody	@ltx/en_us_oca/he.h.m7:heHE.EstereothiIKardiaMou.notmetered
ltx/en_us_oca/me.m01.d05:meMA.Ode3C31.mode	@ltx/en_us_oca/miscellanea:misc.Mode7
ltx/en_us_oca/me.m01.d05:meMA.Ode3C31.ode	@ltx/en_us_oca/miscellanea:misc.Ode3
ltx/en_us_oca/me.m01.d05:meMA.Ode3C31.text	
ltx/en_us_oca/me.m01.d05:meMA.Ode3C32.incipit	…
ltx/en_us_oca/me.m01.d05:meMA.Ode3C32.melody	@ltx/en_us_oca/he.h.m7:heHE.EstereothiIKardiaMou.notmetered
ltx/en_us_oca/me.m01.d05:meMA.Ode3C32.mode	@ltx/en_us_oca/miscellanea:misc.Mode7
ltx/en_us_oca/me.m01.d05:meMA.Ode3C32.ode	@ltx/en_us_oca/miscellanea:misc.Ode3
ltx/en_us_oca/me.m01.d05:meMA.Ode3C32.text	
ltx/en_us_oca/me.m01.d05:meMA.Ode3C33.incipit	…
ltx/en_us_oca/me.m01.d05:meMA.Ode3C33.melody	@ltx/en_us_oca/he.h.m7:heHE.EstereothiIKardiaMou.notmetered
ltx/en_us_oca/me.m01.d05:meMA.Ode3C33.mode	@ltx/en_us_oca/miscellanea:misc.Mode7
ltx/en_us_oca/me.m01.d05:meMA.Ode3C33.ode	@ltx/en_us_oca/miscellanea:misc.Ode3
ltx/en_us_oca/me.m01.d05:meMA.Ode3C33.text	
ltx/en_us_oca/me.m01.d05:meMA.Ode3C3T.incipit	…
ltx/en_us_oca/me.m01.d05:meMA.Ode3C3T.melody	@ltx/en_us_oca/he.h.m7:heHE.EstereothiIKardiaMou.notmetered
ltx/en_us_oca/me.m01.d05:meMA.Ode3C3T.mode	@ltx/en_us_oca/miscellanea:misc.Mode7
ltx/en_us_oca/me.m01.d05:meMA.Ode3C3T.ode	@ltx/en_us_oca/miscellanea:misc.Ode3
ltx/en_us_oca/me.m01.d05:meMA.Ode3C3T.text	
ltx/en_us_oca/me.m01.d05:meMA.Ode3H.greekmelody	@ltx/en_us_oca/he.h.m7:heHE.EstereothiIKardiaMou.greekname
ltx/en_us_oca/me.m01.d05:meMA.Ode3H.incipit	@ltx/en_us_oca/he.h.m7:heHE.EstereothiIKardiaMou.incipit
ltx/en_us_oca/me.m01.d05:meMA.Ode3H.melody	@ltx/en_us_oca/he.h.m7:heHE.EstereothiIKardiaMou.melody
ltx/en_us_oca/me.m01.d05:meMA.Ode3H.mode	@ltx/en_us_oca/miscellanea:misc.Mode7
ltx/en_us_oca/me.m01.d05:meMA.Ode3H.ode	@ltx/en_us_oca/miscellanea:misc.Ode3
ltx/en_us_oca/me.m01.d05:meMA.Ode3H.text	@ltx/en_us_oca/he.h.m7:heHE.EstereothiIKardiaMou.text
ltx/en_us_oca/me.m01.d05:meMA.Ode3Kathisma1.greekmelody	@ltx/en_us_oca/he.a.m5:heAU.TonSynanarchonLogon.greekname
ltx/en_us_oca/me.m01.d05:meMA.Ode3Kathisma1.incipit	…
ltx/en_us_oca/me.m01.d05:meMA.Ode3Kathisma1.melody	@ltx/en_us_oca/he.a.m5:heAU.TonSynanarchonLogon.notmetered
ltx/en_us_oca/me.m01.d05:meMA.Ode3Kathisma1.mode	@ltx/en_us_oca/miscellanea:misc.Mode5
ltx/en_us_oca/me.m01.d05:meMA.Ode3Kathisma1.text	
ltx/en_us_oca/me.m01.d05:meMA.Ode3Kathisma2.greekmelody	@ltx/en_us_oca/he.a.m1:heAU.TonTafonSouSotir.greekname
ltx/en_us_oca/me.m01.d05:meMA.Ode3Kathisma2.incipit	…
ltx/en_us_oca/me.m01.d05:meMA.Ode3Kathisma2.melody	@ltx/en_us_oca/he.a.m1:heAU.TonTafonSouSotir.notmetered
ltx/en_us_oca/me.m01.d05:meMA.Ode3Kathisma2.mode	@ltx/en_us_oca/miscellanea:misc.Mode1
ltx/en_us_oca/me.m01.d05:meMA.Ode3Kathisma2.text	
ltx/en_us_oca/me.m01.d05:meMA.Ode3Kathisma3.greekmelody	@ltx/en_us_oca/he.a.m1:heAU.TonTafonSouSotir.greekname
ltx/en_us_oca/me.m01.d05:meMA.Ode3Kathisma3.incipit	…
ltx/en_us_oca/me.m01.d05:meMA.Ode3Kathisma3.melody	@ltx/en_us_oca/he.a.m1:heAU.TonTafonSouSotir.notmetered
ltx/en_us_oca/me.m01.d05:meMA.Ode3Kathisma3.mode	@ltx/en_us_oca/miscellanea:misc.Mode1
ltx/en_us_oca/me.m01.d05:meMA.Ode3Kathisma3.text	
ltx/en_us_oca/me.m01.d05:meMA.Ode4C11.greekmelody	@ltx/en_us_oca/he.h.m1:heHE.RavdosEkTisRizis.greekname
ltx/en_us_oca/me.m01.d05:meMA.Ode4C11.incipit	…
ltx/en_us_oca/me.m01.d05:meMA.Ode4C11.melody	@ltx/en_us_oca/he.h.m1:heHE.RavdosEkTisRizis.notmetered
ltx/en_us_oca/me.m01.d05:meMA.Ode4C11.mode	@ltx/en_us_oca/miscellanea:misc.Mode1
ltx/en_us_oca/me.m01.d05:meMA.Ode4C11.ode	@ltx/en_us_oca/miscellanea:misc.Ode4
ltx/en_us_oca/me.m01.d05:meMA.Ode4C11.text	
ltx/en_us_oca/me.m01.d05:meMA.Ode4C12.incipit	…
ltx/en_us_oca/me.m01.d05:meMA.Ode4C12.melody	@ltx/en_us_oca/he.h.m1:heHE.RavdosEkTisRizis.notmetered
ltx/en_us_oca/me.m01.d05:meMA.Ode4C12.mode	@ltx/en_us_oca/miscellanea:misc.Mode1
ltx/en_us_oca/me.m01.d05:meMA.Ode4C12.ode	@ltx/en_us_oca/miscellanea:misc.Ode4
ltx/en_us_oca/me.m01.d05:meMA.Ode4C12.text	
ltx/en_us_oca/me.m01.d05:meMA.Ode4C13.incipit	…
ltx/en_us_oca/me.m01.d05:meMA.Ode4C13.melody	@ltx/en_us_oca/he.h.m1:heHE.RavdosEkTisRizis.notmetered
ltx/en_us_oca/me.m01.d05:meMA.Ode4C13.mode	@ltx/en_us_oca/miscellanea:misc.Mode1
ltx/en_us_oca/me.m01.d05:meMA.Ode4C13.ode	@ltx/en_us_oca/miscellanea:misc.Ode4
ltx/en_us_oca/me.m01.d05:meMA.Ode4C13.text	
ltx/en_us_oca/me.m01.d05:meMA.Ode4C1H.incipit	…
ltx/en_us_oca/me.m01.d05:meMA.Ode4C1H.melody	@ltx/en_us_oca/miscellanea:misc.HeirmosNotMetered
ltx/en_us_oca/me.m01.d05:meMA.Ode4C1H.mode	@ltx/en_us_oca/miscellanea:misc.Mode1
ltx/en_us_oca/me.m01.d05:meMA.Ode4C1H.ode	@ltx/en_us_oca/miscellanea:misc.Ode4
ltx/en_us_oca/me.m01.d05:meMA.Ode4C1H.text	
ltx/en_us_oca/me.m01.d05:meMA.Ode4C21.greekmelody	@ltx/en_us_oca/he.h.m2:heHE.ElilythasEkParthenou.greekname
ltx/en_us_oca/me.m01.d05:meMA.Ode4C21.incipit	…
ltx/en_us_oca/me.m01.d05:meMA.Ode4C21.melody	@ltx/en_us_oca/he.h.m2:heHE.ElilythasEkParthenou.notmetered
ltx/en_us_oca/me.m01.d05:meMA.Ode4C21.mode	@ltx/en_us_oca/miscellanea:misc.Mode2
ltx/en_us_oca/me.m01.d05:meMA.Ode4C21.ode	@ltx/en_us_oca/miscellanea:misc.Ode4
ltx/en_us_oca/me.m01.d05:meMA.Ode4C21.text	
ltx/en_us_oca/me.m01.d05:meMA.Ode4C22.incipit	…
ltx/en_us_oca/me.m01.d05:meMA.Ode4C22.melody	@ltx/en_us_oca/he.h.m2:heHE.ElilythasEkParthenou.notmetered
ltx/en_us_oca/me.m01.d05:meMA.Ode4C22.mode	@ltx/en_us_oca/miscellanea:misc.Mode2
ltx/en_us_oca/me.m01.d05:meMA.Ode4C22.ode	@ltx/en_us_oca/miscellanea:misc.Ode4
ltx/en_us_oca/me.m01.d05:meMA.Ode4C22.text	
ltx/en_us_oca/me.m01.d05:meMA.Ode4C23.incipit	…
ltx/en_us_oca/me.m01.d05:meMA.Ode4C23.melody	@ltx/en_us_oca/he.h.m2:heHE.ElilythasEkParthenou.notmetered
ltx/en_us_oca/me.m01.d05:meMA.Ode4C23.mode	@ltx/en_us_oca/miscellanea:misc.Mode2
ltx/en_us_oca/me.m01.d05:meMA.Ode4C23.ode	@ltx/en_us_oca/miscellanea:misc.Ode4
ltx/en_us_oca/me.m01.d05:meMA.Ode4C23.text	
ltx/en_us_oca/me.m01.d05:meMA.Ode4C2T.incipit	…
ltx/en_us_oca/me.m01.d05:meMA.Ode4C2T.melody	@ltx/en_us_oca/he.h.m2:heHE.ElilythasEkParthenou.notmetered
ltx/en_us_oca/me.m01.d05:meMA.Ode4C2T.mode	@ltx/en_us_oca/miscellanea:misc.Mode2
ltx/en_us_oca/me.m01.d05:meMA.Ode4C2T.ode	@ltx/en_us_oca/miscellanea:misc.Ode4
ltx/en_us_oca/me.m01.d05:meMA.Ode4C2T.text	
ltx/en_us_oca/me.m01.d05:meMA.Ode4C31.greekmelody	@ltx/en_us_oca/he.h.m7:heHE.EisakikoaTinAkoin.greekname
ltx/en_us_oca/me.m01.d05:meMA.Ode4C31.incipit	…
ltx/en_us_oca/me.m01.d05:meMA.Ode4C31.melody	@ltx/en_us_oca/he.h.m7:heHE.EisakikoaTinAkoin.notmetered
ltx/en_us_oca/me.m01.d05:meMA.Ode4C31.mode	@ltx/en_us_oca/miscellanea:misc.Mode7
ltx/en_us_oca/me.m01.d05:meMA.Ode4C31.ode	@ltx/en_us_oca/miscellanea:misc.Ode4
ltx/en_us_oca/me.m01.d05:meMA.Ode4C31.text	
ltx/en_us_oca/me.m01.d05:meMA.Ode4C32.incipit	…
ltx/en_us_oca/me.m01.d05:meMA.Ode4C32.melody	@ltx/en_us_oca/he.h.m7:heHE.EisakikoaTinAkoin.notmetered
ltx/en_us_oca/me.m01.d05:meMA.Ode4C32.mode	@ltx/en_us_oca/miscellanea:misc.Mode7
ltx/en_us_oca/me.m01.d05:meMA.Ode4C32.ode	@ltx/en_us_oca/miscellanea:misc.Ode4
ltx/en_us_oca/me.m01.d05:meMA.Ode4C32.text	
ltx/en_us_oca/me.m01.d05:meMA.Ode4C33.incipit	…
ltx/en_us_oca/me.m01.d05:meMA.Ode4C33.melody	@ltx/en_us_oca/he.h.m7:heHE.EisakikoaTinAkoin.notmetered
ltx/en_us_oca/me.m01.d05:meMA.Ode4C33.mode	@ltx/en_us_oca/miscellanea:misc.Mode7
ltx/en_us_oca/me.m01.d05:meMA.Ode4C33.ode	@ltx/en_us_oca/miscellanea:misc.Ode4
ltx/en_us_oca/me.m01.d05:meMA.Ode4C33.text	
ltx/en_us_oca/me.m01.d05:meMA.Ode4C3T.incipit	…
ltx/en_us_oca/me.m01.d05:meMA.Ode4C3T.melody	@ltx/en_us_oca/he.h.m7:heHE.EisakikoaTinAkoin.notmetered
ltx/en_us_oca/me.m01.d05:meMA.Ode4C3T.mode	@ltx/en_us_oca/miscellanea:misc.Mode7
ltx/en_us_oca/me.m01.d05:meMA.Ode4C3T.ode	@ltx/en_us_oca/miscellanea:misc.Ode4
ltx/en_us_oca/me.m01.d05:meMA.Ode4C3T.text	
ltx/en_us_oca/me.m01.d05:meMA.Ode5C11.greekmelody	@ltx/en_us_oca/he.h.m1:heHE.TheosOnEirinis.greekname
ltx/en_us_oca/me.m01.d05:meMA.Ode5C11.incipit	…
ltx/en_us_oca/me.m01.d05:meMA.Ode5C11.melody	@ltx/en_us_oca/he.h.m1:heHE.TheosOnEirinis.notmetered
ltx/en_us_oca/me.m01.d05:meMA.Ode5C11.mode	@ltx/en_us_oca/miscellanea:misc.Mode1
ltx/en_us_oca/me.m01.d05:meMA.Ode5C11.ode	@ltx/en_us_oca/miscellanea:misc.Ode5
ltx/en_us_oca/me.m01.d05:meMA.Ode5C11.text	
ltx/en_us_oca/me.m01.d05:meMA.Ode5C12.incipit	…
ltx/en_us_oca/me.m01.d05:meMA.Ode5C12.melody	@ltx/en_us_oca/he.h.m1:heHE.TheosOnEirinis.notmetered
ltx/en_us_oca/me.m01.d05:meMA.Ode5C12.mode	@ltx/en_us_oca/miscellanea:misc.Mode1
ltx/en_us_oca/me.m01.d05:meMA.Ode5C12.ode	@ltx/en_us_oca/miscellanea:misc.Ode5
ltx/en_us_oca/me.m01.d05:meMA.Ode5C12.text	
ltx/en_us_oca/me.m01.d05:meMA.Ode5C13.incipit	…
ltx/en_us_oca/me.m01.d05:meMA.Ode5C13.melody	@ltx/en_us_oca/he.h.m1:heHE.TheosOnEirinis.notmetered
ltx/en_us_oca/me.m01.d05:meMA.Ode5C13.mode	@ltx/en_us_oca/miscellanea:misc.Mode1
ltx/en_us_oca/me.m01.d05:meMA.Ode5C13.ode	@ltx/en_us_oca/miscellanea:misc.Ode5
ltx/en_us_oca/me.m01.d05:meMA.Ode5C13.text	
ltx/en_us_oca/me.m01.d05:meMA.Ode5C1H.incipit	…
ltx/en_us_oca/me.m01.d05:meMA.Ode5C1H.melody	@ltx/en_us_oca/miscellanea:misc.HeirmosNotMetered
ltx/en_us_oca/me.m01.d05:meMA.Ode5C1H.mode	@ltx/en_us_oca/miscellanea:misc.Mode1
ltx/en_us_oca/me.m01.d05:meMA.Ode5C1H.ode	@ltx/en_us_oca/miscellanea:misc.Ode5
ltx/en_us_oca/me.m01.d05:meMA.Ode5C1H.text	
ltx/en_us_oca/me.m01.d05:meMA.Ode5C21.greekmelody	@ltx/en_us_oca/he.h.m2:heHE.OTouFotosChorigos.greekname
ltx/en_us_oca/me.m01.d05:meMA.Ode5C21.incipit	…
ltx/en_us_oca/me.m01.d05:meMA.Ode5C21.melody	@ltx/en_us_oca/he.h.m2:heHE.OTouFotosChorigos.notmetered
ltx/en_us_oca/me.m01.d05:meMA.Ode5C21.mode	@ltx/en_us_oca/miscellanea:misc.Mode2
ltx/en_us_oca/me.m01.d05:meMA.Ode5C21.ode	@ltx/en_us_oca/miscellanea:misc.Ode5
ltx/en_us_oca/me.m01.d05:meMA.Ode5C21.text	
ltx/en_us_oca/me.m01.d05:meMA.Ode5C22.incipit	…
ltx/en_us_oca/me.m01.d05:meMA.Ode5C22.melody	@ltx/en_us_oca/he.h.m2:heHE.OTouFotosChorigos.notmetered
ltx/en_us_oca/me.m01.d05:meMA.Ode5C22.mode	@ltx/en_us_oca/miscellanea:misc.Mode2
ltx/en_us_oca/me.m01.d05:meMA.Ode5C22.ode	@ltx/en_us_oca/miscellanea:misc.Ode5
ltx/en_us_oca/me.m01.d05:meMA.Ode5C22.text	
ltx/en_us_oca/me.m01.d05:meMA.Ode5C23.incipit	…
ltx/en_us_oca/me.m01.d05:meMA.Ode5C23.melody	@ltx/en_us_oca/he.h.m2:heHE.OTouFotosChorigos.notmetered
ltx/en_us_oca/me.m01.d05:meMA.Ode5C23.mode	@ltx/en_us_oca/miscellanea:misc.Mode2
ltx/en_us_oca/me.m01.d05:meMA.Ode5C23.ode	@ltx/en_us_oca/miscellanea:misc.Ode5
ltx/en_us_oca/me.m01.d05:meMA.Ode5C23.text	
ltx/en_us_oca/me.m01.d05:meMA.Ode5C2T.incipit	…
ltx/en_us_oca/me.m01.d05:meMA.Ode5C2T.melody	@ltx/en_us_oca/he.h.m2:heHE.OTouFotosChorigos.notmetered
ltx/en_us_oca/me.m01.d05:meMA.Ode5C2T.mode	@ltx/en_us_oca/miscellanea:misc.Mode2
ltx/en_us_oca/me.m01.d05:meMA.Ode5C2T.ode	@ltx/en_us_oca/miscellanea:misc.Ode5
ltx/en_us_oca/me.m01.d05:meMA.Ode5C2T.text	
ltx/en_us_oca/me.m01.d05:meMA.Ode5C31.greekmelody	@ltx/en_us_oca/he.h.m7:heHE.OiOrthrizontesLoge.greekname
ltx/en_us_oca/me.m01.d05:meMA.Ode5C31.incipit	…
ltx/en_us_oca/me.m01.d05:meMA.Ode5C31.melody	@ltx/en_us_oca/he.h.m7:heHE.OiOrthrizontesLoge.notmetered
ltx/en_us_oca/me.m01.d05:meMA.Ode5C31.mode	@ltx/en_us_oca/miscellanea:misc.Mode7
ltx/en_us_oca/me.m01.d05:meMA.Ode5C31.ode	@ltx/en_us_oca/miscellanea:misc.Ode5
ltx/en_us_oca/me.m01.d05:meMA.Ode5C31.text	
ltx/en_us_oca/me.m01.d05:meMA.Ode5C32.incipit	…
ltx/en_us_oca/me.m01.d05:meMA.Ode5C32.melody	@ltx/en_us_oca/he.h.m7:heHE.OiOrthrizontesLoge.notmetered
ltx/en_us_oca/me.m01.d05:meMA.Ode5C32.mode	@ltx/en_us_oca/miscellanea:misc.Mode7
ltx/en_us_oca/me.m01.d05:meMA.Ode5C32.ode	@ltx/en_us_oca/miscellanea:misc.Ode5
ltx/en_us_oca/me.m01.d05:meMA.Ode5C32.text	
ltx/en_us_oca/me.m01.d05:meMA.Ode5C33.incipit	…
ltx/en_us_oca/me.m01.d05:meMA.Ode5C33.melody	@ltx/en_us_oca/he.h.m7:heHE.OiOrthrizontesLoge.notmetered
ltx/en_us_oca/me.m01.d05:meMA.Ode5C33.mode	@ltx/en_us_oca/miscellanea:misc.Mode7
ltx/en_us_oca/me.m01.d05:meMA.Ode5C33.ode	@ltx/en_us_oca/miscellanea:misc.Ode5
ltx/en_us_oca/me.m01.d05:meMA.Ode5C33.text	
ltx/en_us_oca/me.m01.d05:meMA.Ode5C3T.incipit	…
ltx/en_us_oca/me.m01.d05:meMA.Ode5C3T.melody	@ltx/en_us_oca/he.h.m7:heHE.OiOrthrizontesLoge.notmetered
ltx/en_us_oca/me.m01.d05:meMA.Ode5C3T.mode	@ltx/en_us_oca/miscellanea:misc.Mode7
ltx/en_us_oca/me.m01.d05:meMA.Ode5C3T.ode	@ltx/en_us_oca/miscellanea:misc.Ode5
ltx/en_us_oca/me.m01.d05:meMA.Ode5C3T.text	
ltx/en_us_oca/me.m01.d05:meMA.Ode6C11.greekmelody	@ltx/en_us_oca/he.h.m1:heHE.SplanchnonIonan.greekname
ltx/en_us_oca/me.m01.d05:meMA.Ode6C11.incipit	…
ltx/en_us_oca/me.m01.d05:meMA.Ode6C11.melody	@ltx/en_us_oca/he.h.m1:heHE.SplanchnonIonan.notmetered
ltx/en_us_oca/me.m01.d05:meMA.Ode6C11.mode	@ltx/en_us_oca/miscellanea:misc.Mode1
ltx/en_us_oca/me.m01.d05:meMA.Ode6C11.ode	@ltx/en_us_oca/miscellanea:misc.Ode6
ltx/en_us_oca/me.m01.d05:meMA.Ode6C11.text	
ltx/en_us_oca/me.m01.d05:meMA.Ode6C12.incipit	…
ltx/en_us_oca/me.m01.d05:meMA.Ode6C12.melody	@ltx/en_us_oca/he.h.m1:heHE.SplanchnonIonan.notmetered
ltx/en_us_oca/me.m01.d05:meMA.Ode6C12.mode	@ltx/en_us_oca/miscellanea:misc.Mode1
ltx/en_us_oca/me.m01.d05:meMA.Ode6C12.ode	@ltx/en_us_oca/miscellanea:misc.Ode6
ltx/en_us_oca/me.m01.d05:meMA.Ode6C12.text	
ltx/en_us_oca/me.m01.d05:meMA.Ode6C13.incipit	…
ltx/en_us_oca/me.m01.d05:meMA.Ode6C13.melody	@ltx/en_us_oca/he.h.m1:heHE.SplanchnonIonan.notmetered
ltx/en_us_oca/me.m01.d05:meMA.Ode6C13.mode	@ltx/en_us_oca/miscellanea:misc.Mode1
ltx/en_us_oca/me.m01.d05:meMA.Ode6C13.ode	@ltx/en_us_oca/miscellanea:misc.Ode6
ltx/en_us_oca/me.m01.d05:meMA.Ode6C13.text	
ltx/en_us_oca/me.m01.d05:meMA.Ode6C1H.incipit	…
ltx/en_us_oca/me.m01.d05:meMA.Ode6C1H.melody	@ltx/en_us_oca/miscellanea:misc.HeirmosNotMetered
ltx/en_us_oca/me.m01.d05:meMA.Ode6C1H.mode	@ltx/en_us_oca/miscellanea:misc.Mode1
ltx/en_us_oca/me.m01.d05:meMA.Ode6C1H.ode	@ltx/en_us_oca/miscellanea:misc.Ode6
ltx/en_us_oca/me.m01.d05:meMA.Ode6C1H.text	
ltx/en_us_oca/me.m01.d05:meMA.Ode6C21.greekmelody	@ltx/en_us_oca/he.h.m2:heHE.EnAvyssoPtaismaton.greekname
ltx/en_us_oca/me.m01.d05:meMA.Ode6C21.incipit	…
ltx/en_us_oca/me.m01.d05:meMA.Ode6C21.melody	@ltx/en_us_oca/he.h.m2:heHE.EnAvyssoPtaismaton.notmetered
ltx/en_us_oca/me.m01.d05:meMA.Ode6C21.mode	@ltx/en_us_oca/miscellanea:misc.Mode2
ltx/en_us_oca/me.m01.d05:meMA.Ode6C21.ode	@ltx/en_us_oca/miscellanea:misc.Ode6
ltx/en_us_oca/me.m01.d05:meMA.Ode6C21.text	
ltx/en_us_oca/me.m01.d05:meMA.Ode6C22.incipit	…
ltx/en_us_oca/me.m01.d05:meMA.Ode6C22.melody	@ltx/en_us_oca/he.h.m2:heHE.EnAvyssoPtaismaton.notmetered
ltx/en_us_oca/me.m01.d05:meMA.Ode6C22.mode	@ltx/en_us_oca/miscellanea:misc.Mode2
ltx/en_us_oca/me.m01.d05:meMA.Ode6C22.ode	@ltx/en_us_oca/miscellanea:misc.Ode6
ltx/en_us_oca/me.m01.d05:meMA.Ode6C22.text	
ltx/en_us_oca/me.m01.d05:meMA.Ode6C23.incipit	…
ltx/en_us_oca/me.m01.d05:meMA.Ode6C23.melody	@ltx/en_us_oca/he.h.m2:heHE.EnAvyssoPtaismaton.notmetered
ltx/en_us_oca/me.m01.d05:meMA.Ode6C23.mode	@ltx/en_us_oca/miscellanea:misc.Mode2
ltx/en_us_oca/me.m01.d05:meMA.Ode6C23.ode	@ltx/en_us_oca/miscellanea:misc.Ode6
ltx/en_us_oca/me.m01.d05:meMA.Ode6C23.text	
ltx/en_us_oca/me.m01.d05:meMA.Ode6C2T.incipit	…
ltx/en_us_oca/me.m01.d05:meMA.Ode6C2T.melody	@ltx/en_us_oca/he.h.m2:heHE.EnAvyssoPtaismaton.notmetered
ltx/en_us_oca/me.m01.d05:meMA.Ode6C2T.mode	@ltx/en_us_oca/miscellanea:misc.Mode2
ltx/en_us_oca/me.m01.d05:meMA.Ode6C2T.ode	@ltx/en_us_oca/miscellanea:misc.Ode6
ltx/en_us_oca/me.m01.d05:meMA.Ode6C2T.text	
ltx/en_us_oca/me.m01.d05:meMA.Ode6C31.greekmelody	@ltx/en_us_oca/he.h.m7:heHE.OIonasEkKoilias.greekname
ltx/en_us_oca/me.m01.d05:meMA.Ode6C31.incipit	…
ltx/en_us_oca/me.m01.d05:meMA.Ode6C31.melody	@ltx/en_us_oca/he.h.m7:heHE.OIonasEkKoilias.notmetered
ltx/en_us_oca/me.m01.d05:meMA.Ode6C31.mode	@ltx/en_us_oca/miscellanea:misc.Mode7
ltx/en_us_oca/me.m01.d05:meMA.Ode6C31.ode	@ltx/en_us_oca/miscellanea:misc.Ode6
ltx/en_us_oca/me.m01.d05:meMA.Ode6C31.text	
ltx/en_us_oca/me.m01.d05:meMA.Ode6C32.incipit	…
ltx/en_us_oca/me.m01.d05:meMA.Ode6C32.melody	@ltx/en_us_oca/he.h.m7:heHE.OIonasEkKoilias.notmetered
ltx/en_us_oca/me.m01.d05:meMA.Ode6C32.mode	@ltx/en_us_oca/miscellanea:misc.Mode7
ltx/en_us_oca/me.m01.d05:meMA.Ode6C32.ode	@ltx/en_us_oca/miscellanea:misc.Ode6
ltx/en_us_oca/me.m01.d05:meMA.Ode6C32.text	
ltx/en_us_oca/me.m01.d05:meMA.Ode6C33.incipit	…
ltx/en_us_oca/me.m01.d05:meMA.Ode6C33.melody	@ltx/en_us_oca/he.h.m7:heHE.OIonasEkKoilias.notmetered
ltx/en_us_oca/me.m01.d05:meMA.Ode6C33.mode	@ltx/en_us_oca/miscellanea:misc.Mode7
ltx/en_us_oca/me.m01.d05:meMA.Ode6C33.ode	@ltx/en_us_oca/miscellanea:misc.Ode6
ltx/en_us_oca/me.m01.d05:meMA.Ode6C33.text	
ltx/en_us_oca/me.m01.d05:meMA.Ode6C3T.incipit	…
ltx/en_us_oca/me.m01.d05:meMA.Ode6C3T.melody	@ltx/en_us_oca/he.h.m7:heHE.OIonasEkKoilias.notmetered
ltx/en_us_oca/me.m01.d05:meMA.Ode6C3T.mode	@ltx/en_us_oca/miscellanea:misc.Mode7
ltx/en_us_oca/me.m01.d05:meMA.Ode6C3T.ode	@ltx/en_us_oca/miscellanea:misc.Ode6
ltx/en_us_oca/me.m01.d05:meMA.Ode6C3T.text	
ltx/en_us_oca/me.m01.d05:meMA.Ode6H.greekmelody	@ltx/en_us_oca/he.h.m7:heHE.OIonasEkKoilias.greekname
ltx/en_us_oca/me.m01.d05:meMA.Ode6H.incipit	@ltx/en_us_oca/he.h.m7:heHE.OIonasEkKoilias.incipit
ltx/en_us_oca/me.m01.d05:meMA.Ode6H.melody	@ltx/en_us_oca/he.h.m7:heHE.OIonasEkKoilias.melody
ltx/en_us_oca/me.m01.d05:meMA.Ode6H.mode	@ltx/en_us_oca/miscellanea:misc.Mode7
ltx/en_us_oca/me.m01.d05:meMA.Ode6H.ode	@ltx/en_us_oca/miscellanea:misc.Ode6
ltx/en_us_oca/me.m01.d05:meMA.Ode6H.text	@ltx/en_us_oca/he.h.m7:heHE.OIonasEkKoilias.text
ltx/en_us_oca/me.m01.d05:meMA.Ode7C11.greekmelody	@ltx/en_us_oca/he.h.m1:heHE.OiPaidesEfseveia.greekname
ltx/en_us_oca/me.m01.d05:meMA.Ode7C11.incipit	…
ltx/en_us_oca/me.m01.d05:meMA.Ode7C11.melody	@ltx/en_us_oca/he.h.m1:heHE.OiPaidesEfseveia.notmetered
ltx/en_us_oca/me.m01.d05:meMA.Ode7C11.mode	@ltx/en_us_oca/miscellanea:misc.Mode1
ltx/en_us_oca/me.m01.d05:meMA.Ode7C11.ode	@ltx/en_us_oca/miscellanea:misc.Ode7
ltx/en_us_oca/me.m01.d05:meMA.Ode7C11.text	
ltx/en_us_oca/me.m01.d05:meMA.Ode7C12.incipit	…
ltx/en_us_oca/me.m01.d05:meMA.Ode7C12.melody	@ltx/en_us_oca/he.h.m1:heHE.OiPaidesEfseveia.notmetered
ltx/en_us_oca/me.m01.d05:meMA.Ode7C12.mode	@ltx/en_us_oca/miscellanea:misc.Mode1
ltx/en_us_oca/me.m01.d05:meMA.Ode7C12.ode	@ltx/en_us_oca/miscellanea:misc.Ode7
ltx/en_us_oca/me.m01.d05:meMA.Ode7C12.text	
ltx/en_us_oca/me.m01.d05:meMA.Ode7C13.incipit	…
ltx/en_us_oca/me.m01.d05:meMA.Ode7C13.melody	@ltx/en_us_oca/he.h.m1:heHE.OiPaidesEfseveia.notmetered
ltx/en_us_oca/me.m01.d05:meMA.Ode7C13.mode	@ltx/en_us_oca/miscellanea:misc.Mode1
ltx/en_us_oca/me.m01.d05:meMA.Ode7C13.ode	@ltx/en_us_oca/miscellanea:misc.Ode7
ltx/en_us_oca/me.m01.d05:meMA.Ode7C13.text	
ltx/en_us_oca/me.m01.d05:meMA.Ode7C1H.incipit	…
ltx/en_us_oca/me.m01.d05:meMA.Ode7C1H.melody	@ltx/en_us_oca/miscellanea:misc.HeirmosNotMetered
ltx/en_us_oca/me.m01.d05:meMA.Ode7C1H.mode	@ltx/en_us_oca/miscellanea:misc.Mode1
ltx/en_us_oca/me.m01.d05:meMA.Ode7C1H.ode	@ltx/en_us_oca/miscellanea:misc.Ode7
ltx/en_us_oca/me.m01.d05:meMA.Ode7C1H.text	
ltx/en_us_oca/me.m01.d05:meMA.Ode7C21.greekmelody	@ltx/en_us_oca/he.h.m2:heHE.AntitheonProstagma.greekname
ltx/en_us_oca/me.m01.d05:meMA.Ode7C21.incipit	…
ltx/en_us_oca/me.m01.d05:meMA.Ode7C21.melody	@ltx/en_us_oca/he.h.m2:heHE.AntitheonProstagma.notmetered
ltx/en_us_oca/me.m01.d05:meMA.Ode7C21.mode	@ltx/en_us_oca/miscellanea:misc.Mode2
ltx/en_us_oca/me.m01.d05:meMA.Ode7C21.ode	@ltx/en_us_oca/miscellanea:misc.Ode7
ltx/en_us_oca/me.m01.d05:meMA.Ode7C21.text	
ltx/en_us_oca/me.m01.d05:meMA.Ode7C22.incipit	…
ltx/en_us_oca/me.m01.d05:meMA.Ode7C22.melody	@ltx/en_us_oca/he.h.m2:heHE.AntitheonProstagma.notmetered
ltx/en_us_oca/me.m01.d05:meMA.Ode7C22.mode	@ltx/en_us_oca/miscellanea:misc.Mode2
ltx/en_us_oca/me.m01.d05:meMA.Ode7C22.ode	@ltx/en_us_oca/miscellanea:misc.Ode7
ltx/en_us_oca/me.m01.d05:meMA.Ode7C22.text	
ltx/en_us_oca/me.m01.d05:meMA.Ode7C23.incipit	…
ltx/en_us_oca/me.m01.d05:meMA.Ode7C23.melody	@ltx/en_us_oca/he.h.m2:heHE.AntitheonProstagma.notmetered
ltx/en_us_oca/me.m01.d05:meMA.Ode7C23.mode	@ltx/en_us_oca/miscellanea:misc.Mode2
ltx/en_us_oca/me.m01.d05:meMA.Ode7C23.ode	@ltx/en_us_oca/miscellanea:misc.Ode7
ltx/en_us_oca/me.m01.d05:meMA.Ode7C23.text	
ltx/en_us_oca/me.m01.d05:meMA.Ode7C2T.incipit	…
ltx/en_us_oca/me.m01.d05:meMA.Ode7C2T.melody	@ltx/en_us_oca/he.h.m2:heHE.AntitheonProstagma.notmetered
ltx/en_us_oca/me.m01.d05:meMA.Ode7C2T.mode	@ltx/en_us_oca/miscellanea:misc.Mode2
ltx/en_us_oca/me.m01.d05:meMA.Ode7C2T.ode	@ltx/en_us_oca/miscellanea:misc.Ode7
ltx/en_us_oca/me.m01.d05:meMA.Ode7C2T.text	
ltx/en_us_oca/me.m01.d05:meMA.Ode7C31.greekmelody	@ltx/en_us_oca/he.h.m7:heHE.KaminonKaiomenin.greekname
ltx/en_us_oca/me.m01.d05:meMA.Ode7C31.incipit	…
ltx/en_us_oca/me.m01.d05:meMA.Ode7C31.melody	@ltx/en_us_oca/he.h.m7:heHE.KaminonKaiomenin.notmetered
ltx/en_us_oca/me.m01.d05:meMA.Ode7C31.mode	@ltx/en_us_oca/miscellanea:misc.Mode7
ltx/en_us_oca/me.m01.d05:meMA.Ode7C31.ode	@ltx/en_us_oca/miscellanea:misc.Ode7
ltx/en_us_oca/me.m01.d05:meMA.Ode7C31.text	
ltx/en_us_oca/me.m01.d05:meMA.Ode7C32.incipit	…
ltx/en_us_oca/me.m01.d05:meMA.Ode7C32.melody	@ltx/en_us_oca/he.h.m7:heHE.KaminonKaiomenin.notmetered
ltx/en_us_oca/me.m01.d05:meMA.Ode7C32.mode	@ltx/en_us_oca/miscellanea:misc.Mode7
ltx/en_us_oca/me.m01.d05:meMA.Ode7C32.ode	@ltx/en_us_oca/miscellanea:misc.Ode7
ltx/en_us_oca/me.m01.d05:meMA.Ode7C32.text	
ltx/en_us_oca/me.m01.d05:meMA.Ode7C33.incipit	…
ltx/en_us_oca/me.m01.d05:meMA.Ode7C33.melody	@ltx/en_us_oca/he.h.m7:heHE.KaminonKaiomenin.notmetered
ltx/en_us_oca/me.m01.d05:meMA.Ode7C33.mode	@ltx/en_us_oca/miscellanea:misc.Mode7
ltx/en_us_oca/me.m01.d05:meMA.Ode7C33.ode	@ltx/en_us_oca/miscellanea:misc.Ode7
ltx/en_us_oca/me.m01.d05:meMA.Ode7C33.text	
ltx/en_us_oca/me.m01.d05:meMA.Ode7C3T.incipit	…
ltx/en_us_oca/me.m01.d05:meMA.Ode7C3T.melody	@ltx/en_us_oca/he.h.m7:heHE.KaminonKaiomenin.notmetered
ltx/en_us_oca/me.m01.d05:meMA.Ode7C3T.mode	@ltx/en_us_oca/miscellanea:misc.Mode7
ltx/en_us_oca/me.m01.d05:meMA.Ode7C3T.ode	@ltx/en_us_oca/miscellanea:misc.Ode7
ltx/en_us_oca/me.m01.d05:meMA.Ode7C3T.text	
ltx/en_us_oca/me.m01.d05:meMA.Ode8C11.greekmelody	@ltx/en_us_oca/he.h.m1:heHE.ThavmatosYperfyous.greekname
ltx/en_us_oca/me.m01.d05:meMA.Ode8C11.incipit	…
ltx/en_us_oca/me.m01.d05:meMA.Ode8C11.melody	@ltx/en_us_oca/he.h.m1:heHE.ThavmatosYperfyous.notmetered
ltx/en_us_oca/me.m01.d05:meMA.Ode8C11.mode	@ltx/en_us_oca/miscellanea:misc.Mode1
ltx/en_us_oca/me.m01.d05:meMA.Ode8C11.ode	@ltx/en_us_oca/miscellanea:misc.Ode8
ltx/en_us_oca/me.m01.d05:meMA.Ode8C11.text	
ltx/en_us_oca/me.m01.d05:meMA.Ode8C12.incipit	…
ltx/en_us_oca/me.m01.d05:meMA.Ode8C12.melody	@ltx/en_us_oca/he.h.m1:heHE.ThavmatosYperfyous.notmetered
ltx/en_us_oca/me.m01.d05:meMA.Ode8C12.mode	@ltx/en_us_oca/miscellanea:misc.Mode1
ltx/en_us_oca/me.m01.d05:meMA.Ode8C12.ode	@ltx/en_us_oca/miscellanea:misc.Ode8
ltx/en_us_oca/me.m01.d05:meMA.Ode8C12.text	
ltx/en_us_oca/me.m01.d05:meMA.Ode8C13.incipit	…
ltx/en_us_oca/me.m01.d05:meMA.Ode8C13.melody	@ltx/en_us_oca/he.h.m1:heHE.ThavmatosYperfyous.notmetered
ltx/en_us_oca/me.m01.d05:meMA.Ode8C13.mode	@ltx/en_us_oca/miscellanea:misc.Mode1
ltx/en_us_oca/me.m01.d05:meMA.Ode8C13.ode	@ltx/en_us_oca/miscellanea:misc.Ode8
ltx/en_us_oca/me.m01.d05:meMA.Ode8C13.text	
ltx/en_us_oca/me.m01.d05:meMA.Ode8C1H.incipit	…
ltx/en_us_oca/me.m01.d05:meMA.Ode8C1H.melody	@ltx/en_us_oca/miscellanea:misc.HeirmosNotMetered
ltx/en_us_oca/me.m01.d05:meMA.Ode8C1H.mode	@ltx/en_us_oca/miscellanea:misc.Mode1
ltx/en_us_oca/me.m01.d05:meMA.Ode8C1H.ode	@ltx/en_us_oca/miscellanea:misc.Ode8
ltx/en_us_oca/me.m01.d05:meMA.Ode8C1H.text	
ltx/en_us_oca/me.m01.d05:meMA.Ode8C21.greekmelody	@ltx/en_us_oca/he.h.m2:heHE.TonEnKaminoTouPyros.greekname
ltx/en_us_oca/me.m01.d05:meMA.Ode8C21.incipit	…
ltx/en_us_oca/me.m01.d05:meMA.Ode8C21.melody	@ltx/en_us_oca/he.h.m2:heHE.TonEnKaminoTouPyros.notmetered
ltx/en_us_oca/me.m01.d05:meMA.Ode8C21.mode	@ltx/en_us_oca/miscellanea:misc.Mode2
ltx/en_us_oca/me.m01.d05:meMA.Ode8C21.ode	@ltx/en_us_oca/miscellanea:misc.Ode8
ltx/en_us_oca/me.m01.d05:meMA.Ode8C21.text	
ltx/en_us_oca/me.m01.d05:meMA.Ode8C22.incipit	…
ltx/en_us_oca/me.m01.d05:meMA.Ode8C22.melody	@ltx/en_us_oca/he.h.m2:heHE.TonEnKaminoTouPyros.notmetered
ltx/en_us_oca/me.m01.d05:meMA.Ode8C22.mode	@ltx/en_us_oca/miscellanea:misc.Mode2
ltx/en_us_oca/me.m01.d05:meMA.Ode8C22.ode	@ltx/en_us_oca/miscellanea:misc.Ode8
ltx/en_us_oca/me.m01.d05:meMA.Ode8C22.text	
ltx/en_us_oca/me.m01.d05:meMA.Ode8C23.incipit	…
ltx/en_us_oca/me.m01.d05:meMA.Ode8C23.melody	@ltx/en_us_oca/he.h.m2:heHE.TonEnKaminoTouPyros.notmetered
ltx/en_us_oca/me.m01.d05:meMA.Ode8C23.mode	@ltx/en_us_oca/miscellanea:misc.Mode2
ltx/en_us_oca/me.m01.d05:meMA.Ode8C23.ode	@ltx/en_us_oca/miscellanea:misc.Ode8
ltx/en_us_oca/me.m01.d05:meMA.Ode8C23.text	
ltx/en_us_oca/me.m01.d05:meMA.Ode8C2T.incipit	…
ltx/en_us_oca/me.m01.d05:meMA.Ode8C2T.melody	@ltx/en_us_oca/he.h.m2:heHE.TonEnKaminoTouPyros.notmetered
ltx/en_us_oca/me.m01.d05:meMA.Ode8C2T.mode	@ltx/en_us_oca/miscellanea:misc.Mode2
ltx/en_us_oca/me.m01.d05:meMA.Ode8C2T.ode	@ltx/en_us_oca/miscellanea:misc.Ode8
ltx/en_us_oca/me.m01.d05:meMA.Ode8C2T.text	
ltx/en_us_oca/me.m01.d05:meMA.Ode8C31.greekmelody	@ltx/en_us_oca/he.h.m7:heHE.TonMononAnarchon.greekname
ltx/en_us_oca/me.m01.d05:meMA.Ode8C31.incipit	…
ltx/en_us_oca/me.m01.d05:meMA.Ode8C31.melody	@ltx/en_us_oca/he.h.m7:heHE.TonMononAnarchon.notmetered
ltx/en_us_oca/me.m01.d05:meMA.Ode8C31.mode	@ltx/en_us_oca/miscellanea:misc.Mode7
ltx/en_us_oca/me.m01.d05:meMA.Ode8C31.ode	@ltx/en_us_oca/miscellanea:misc.Ode8
ltx/en_us_oca/me.m01.d05:meMA.Ode8C31.text	
ltx/en_us_oca/me.m01.d05:meMA.Ode8C32.incipit	…
ltx/en_us_oca/me.m01.d05:meMA.Ode8C32.melody	@ltx/en_us_oca/he.h.m7:heHE.TonMononAnarchon.notmetered
ltx/en_us_oca/me.m01.d05:meMA.Ode8C32.mode	@ltx/en_us_oca/miscellanea:misc.Mode7
ltx/en_us_oca/me.m01.d05:meMA.Ode8C32.ode	@ltx/en_us_oca/miscellanea:misc.Ode8
ltx/en_us_oca/me.m01.d05:meMA.Ode8C32.text	
ltx/en_us_oca/me.m01.d05:meMA.Ode8C33.incipit	…
ltx/en_us_oca/me.m01.d05:meMA.Ode8C33.melody	@ltx/en_us_oca/he.h.m7:heHE.TonMononAnarchon.notmetered
ltx/en_us_oca/me.m01.d05:meMA.Ode8C33.mode	@ltx/en_us_oca/miscellanea:misc.Mode7
ltx/en_us_oca/me.m01.d05:meMA.Ode8C33.ode	@ltx/en_us_oca/miscellanea:misc.Ode8
ltx/en_us_oca/me.m01.d05:meMA.Ode8C33.text	
ltx/en_us_oca/me.m01.d05:meMA.Ode8C3T.incipit	…
ltx/en_us_oca/me.m01.d05:meMA.Ode8C3T.melody	@ltx/en_us_oca/he.h.m7:heHE.TonMononAnarchon.notmetered
ltx/en_us_oca/me.m01.d05:meMA.Ode8C3T.mode	@ltx/en_us_oca/miscellanea:misc.Mode7
ltx/en_us_oca/me.m01.d05:meMA.Ode8C3T.ode	@ltx/en_us_oca/miscellanea:misc.Ode8
ltx/en_us_oca/me.m01.d05:meMA.Ode8C3T.text	
ltx/en_us_oca/me.m01.d05:meMA.Ode8H.greekmelody	@ltx/en_us_oca/he.h.m7:heHE.TonMononAnarchon.greekname
ltx/en_us_oca/me.m01.d05:meMA.Ode8H.incipit	@ltx/en_us_oca/he.h.m7:heHE.TonMononAnarchon.incipit
ltx/en_us_oca/me.m01.d05:meMA.Ode8H.melody	@ltx/en_us_oca/he.h.m7:heHE.TonMononAnarchon.melody
ltx/en_us_oca/me.m01.d05:meMA.Ode8H.mode	@ltx/en_us_oca/miscellanea:misc.Mode7
ltx/en_us_oca/me.m01.d05:meMA.Ode8H.ode	@ltx/en_us_oca/miscellanea:misc.Ode8
ltx/en_us_oca/me.m01.d05:meMA.Ode8H.text	@ltx/en_us_oca/he.h.m7:heHE.TonMononAnarchon.text
ltx/en_us_oca/me.m01.d05:meMA.Ode9C11.greekmelody	@ltx/en_us_oca/he.h.m1:heHE.MystirionXenon.greekname
ltx/en_us_oca/me.m01.d05:meMA.Ode9C11.incipit	…
ltx/en_us_oca/me.m01.d05:meMA.Ode9C11.melody	@ltx/en_us_oca/he.h.m1:heHE.MystirionXenon.notmetered
ltx/en_us_oca/me.m01.d05:meMA.Ode9C11.mode	@ltx/en_us_oca/miscellanea:misc.Mode1
ltx/en_us_oca/me.m01.d05:meMA.Ode9C11.ode	@ltx/en_us_oca/miscellanea:misc.Ode9
ltx/en_us_oca/me.m01.d05:meMA.Ode9C11.text	
ltx/en_us_oca/me.m01.d05:meMA.Ode9C12.incipit	…
ltx/en_us_oca/me.m01.d05:meMA.Ode9C12.melody	@ltx/en_us_oca/he.h.m1:heHE.MystirionXenon.notmetered
ltx/en_us_oca/me.m01.d05:meMA.Ode9C12.mode	@ltx/en_us_oca/miscellanea:misc.Mode1
ltx/en_us_oca/me.m01.d05:meMA.Ode9C12.ode	@ltx/en_us_oca/miscellanea:misc.Ode9
ltx/en_us_oca/me.m01.d05:meMA.Ode9C12.text	
ltx/en_us_oca/me.m01.d05:meMA.Ode9C13.incipit	…
ltx/en_us_oca/me.m01.d05:meMA.Ode9C13.melody	@ltx/en_us_oca/he.h.m1:heHE.MystirionXenon.notmetered
ltx/en_us_oca/me.m01.d05:meMA.Ode9C13.mode	@ltx/en_us_oca/miscellanea:misc.Mode1
ltx/en_us_oca/me.m01.d05:meMA.Ode9C13.ode	@ltx/en_us_oca/miscellanea:misc.Ode9
ltx/en_us_oca/me.m01.d05:meMA.Ode9C13.text	
ltx/en_us_oca/me.m01.d05:meMA.Ode9C1H.incipit	…
ltx/en_us_oca/me.m01.d05:meMA.Ode9C1H.melody	@ltx/en_us_oca/miscellanea:misc.HeirmosNotMetered
ltx/en_us_oca/me.m01.d05:meMA.Ode9C1H.mode	@ltx/en_us_oca/miscellanea:misc.Mode1
ltx/en_us_oca/me.m01.d05:meMA.Ode9C1H.ode	@ltx/en_us_oca/miscellanea:misc.Ode9
ltx/en_us_oca/me.m01.d05:meMA.Ode9C1H.text	
ltx/en_us_oca/me.m01.d05:meMA.Ode9C1T.incipit	…
ltx/en_us_oca/me.m01.d05:meMA.Ode9C1T.melody	@ltx/en_us_oca/he.h.m1:heHE.MystirionXenon.notmetered
ltx/en_us_oca/me.m01.d05:meMA.Ode9C1T.mode	@ltx/en_us_oca/miscellanea:misc.Mode1
ltx/en_us_oca/me.m01.d05:meMA.Ode9C1T.ode	@ltx/en_us_oca/miscellanea:misc.Ode9
ltx/en_us_oca/me.m01.d05:meMA.Ode9C1T.text	
ltx/en_us_oca/me.m01.d05:meMA.Ode9C21.greekmelody	@ltx/en_us_oca/he.h.m2:heHE.AnarchouGennitoros.greekname
ltx/en_us_oca/me.m01.d05:meMA.Ode9C21.incipit	…
ltx/en_us_oca/me.m01.d05:meMA.Ode9C21.melody	@ltx/en_us_oca/he.h.m2:heHE.AnarchouGennitoros.notmetered
ltx/en_us_oca/me.m01.d05:meMA.Ode9C21.mode	@ltx/en_us_oca/miscellanea:misc.Mode2
ltx/en_us_oca/me.m01.d05:meMA.Ode9C21.ode	@ltx/en_us_oca/miscellanea:misc.Ode9
ltx/en_us_oca/me.m01.d05:meMA.Ode9C21.text	
ltx/en_us_oca/me.m01.d05:meMA.Ode9C22.incipit	…
ltx/en_us_oca/me.m01.d05:meMA.Ode9C22.melody	@ltx/en_us_oca/he.h.m2:heHE.AnarchouGennitoros.notmetered
ltx/en_us_oca/me.m01.d05:meMA.Ode9C22.mode	@ltx/en_us_oca/miscellanea:misc.Mode2
ltx/en_us_oca/me.m01.d05:meMA.Ode9C22.ode	@ltx/en_us_oca/miscellanea:misc.Ode9
ltx/en_us_oca/me.m01.d05:meMA.Ode9C22.text	
ltx/en_us_oca/me.m01.d05:meMA.Ode9C23.incipit	…
ltx/en_us_oca/me.m01.d05:meMA.Ode9C23.melody	@ltx/en_us_oca/he.h.m2:heHE.AnarchouGennitoros.notmetered
ltx/en_us_oca/me.m01.d05:meMA.Ode9C23.mode	@ltx/en_us_oca/miscellanea:misc.Mode2
ltx/en_us_oca/me.m01.d05:meMA.Ode9C23.ode	@ltx/en_us_oca/miscellanea:misc.Ode9
ltx/en_us_oca/me.m01.d05:meMA.Ode9C23.text	
ltx/en_us_oca/me.m01.d05:meMA.Ode9C2T.incipit	…
ltx/en_us_oca/me.m01.d05:meMA.Ode9C2T.melody	@ltx/en_us_oca/he.h.m2:heHE.AnarchouGennitoros.notmetered
ltx/en_us_oca/me.m01.d05:meMA.Ode9C2T.mode	@ltx/en_us_oca/miscellanea:misc.Mode2
ltx/en_us_oca/me.m01.d05:meMA.Ode9C2T.ode	@ltx/en_us_oca/miscellanea:misc.Ode9
ltx/en_us_oca/me.m01.d05:meMA.Ode9C2T.text	
ltx/en_us_oca/me.m01.d05:meMA.Ode9C31.greekmelody	@ltx/en_us_oca/he.h.m7:heHE.TinYperFysinMitera.greekname
ltx/en_us_oca/me.m01.d05:meMA.Ode9C31.incipit	…
ltx/en_us_oca/me.m01.d05:meMA.Ode9C31.melody	@ltx/en_us_oca/he.h.m7:heHE.TinYperFysinMitera.notmetered
ltx/en_us_oca/me.m01.d05:meMA.Ode9C31.mode	@ltx/en_us_oca/miscellanea:misc.Mode7
ltx/en_us_oca/me.m01.d05:meMA.Ode9C31.ode	@ltx/en_us_oca/miscellanea:misc.Ode9
ltx/en_us_oca/me.m01.d05:meMA.Ode9C31.text	
ltx/en_us_oca/me.m01.d05:meMA.Ode9C32.incipit	…
ltx/en_us_oca/me.m01.d05:meMA.Ode9C32.melody	@ltx/en_us_oca/he.h.m7:heHE.TinYperFysinMitera.notmetered
ltx/en_us_oca/me.m01.d05:meMA.Ode9C32.mode	@ltx/en_us_oca/miscellanea:misc.Mode7
ltx/en_us_oca/me.m01.d05:meMA.Ode9C32.ode	@ltx/en_us_oca/miscellanea:misc.Ode9
ltx/en_us_oca/me.m01.d05:meMA.Ode9C32.text	
ltx/en_us_oca/me.m01.d05:meMA.Ode9C33.incipit	…
ltx/en_us_oca/me.m01.d05:meMA.Ode9C33.melody	@ltx/en_us_oca/he.h.m7:heHE.TinYperFysinMitera.notmetered
ltx/en_us_oca/me.m01.d05:meMA.Ode9C33.mode	@ltx/en_us_oca/miscellanea:misc.Mode7
ltx/en_us_oca/me.m01.d05:meMA.Ode9C33.ode	@ltx/en_us_oca/miscellanea:misc.Ode9
ltx/en_us_oca/me.m01.d05:meMA.Ode9C33.text	
ltx/en_us_oca/me.m01.d05:meMA.Ode9C3T.incipit	…
ltx/en_us_oca/me.m01.d05:meMA.Ode9C3T.melody	@ltx/en_us_oca/he.h.m7:heHE.TinYperFysinMitera.notmetered
ltx/en_us_oca/me.m01.d05:meMA.Ode9C3T.mode	@ltx/en_us_oca/miscellanea:misc.Mode7
ltx/en_us_oca/me.m01.d05:meMA.Ode9C3T.ode	@ltx/en_us_oca/miscellanea:misc.Ode9
ltx/en_us_oca/me.m01.d05:meMA.Ode9C3T.text	
ltx/en_us_oca/me.m01.d05:meMA.Ode9H.greekmelody	@ltx/en_us_oca/he.h.m7:heHE.TinYperFysinMitera.greekname
ltx/en_us_oca/me.m01.d05:meMA.Ode9H.incipit	@ltx/en_us_oca/he.h.m7:heHE.TinYperFysinMitera.incipit
ltx/en_us_oca/me.m01.d05:meMA.Ode9H.melody	@ltx/en_us_oca/he.h.m7:heHE.TinYperFysinMitera.melody
ltx/en_us_oca/me.m01.d05:meMA.Ode9H.mode	@ltx/en_us_oca/miscellanea:misc.Mode7
ltx/en_us_oca/me.m01.d05:meMA.Ode9H.ode	@ltx/en_us_oca/miscellanea:misc.Ode9
ltx/en_us_oca/me.m01.d05:meMA.Ode9H.text	@ltx/en_us_oca/he.h.m7:heHE.TinYperFysinMitera.text
ltx/en_us_oca/me.m01.d05:meMA.Oikos1.text	@ltx/en_us_oca/me.m01.d02:meMA.Oikos1.text
ltx/en_us_oca/me.m01.d05:meVE.Apolytikion1.greekmelody	@ltx/en_us_oca/he.a.m4:heAU.KateplagiIosif.greekname
ltx/en_us_oca/me.m01.d05:meVE.Apolytikion1.incipit	…
ltx/en_us_oca/me.m01.d05:meVE.Apolytikion1.melody	@ltx/en_us_oca/he.a.m4:heAU.KateplagiIosif.notmetered
ltx/en_us_oca/me.m01.d05:meVE.Apolytikion1.mode	@ltx/en_us_oca/miscellanea:misc.Mode4
ltx/en_us_oca/me.m01.d05:meVE.Apolytikion1.text	
ltx/en_us_oca/me.m01.d05:meVE.AposGlory.incipit	@ltx/en_us_oca/me.m01.d02:meMA.Aposticha3.incipit
ltx/en_us_oca/me.m01.d05:meVE.AposGlory.melody	
ltx/en_us_oca/me.m01.d05:meVE.AposGlory.mode	@ltx/en_us_oca/miscellanea:misc.Mode6
ltx/en_us_oca/me.m01.d05:meVE.AposGlory.poet	@ltx/en_us_oca/poets:po.Vyzantiou
ltx/en_us_oca/me.m01.d05:meVE.AposGlory.text	@ltx/en_us_oca/me.m01.d02:meMA.Aposticha3.text
ltx/en_us_oca/me.m01.d05:meVE.Aposticha1.greekmelody	@ltx/en_us_oca/he.a.m6:heAU.TriimerosAnestis.greekname
ltx/en_us_oca/me.m01.d05:meVE.Aposticha1.incipit	…
ltx/en_us_oca/me.m01.d05:meVE.Aposticha1.melody	@ltx/en_us_oca/he.a.m6:heAU.TriimerosAnestis.notmetered
ltx/en_us_oca/me.m01.d05:meVE.Aposticha1.mode	@ltx/en_us_oca/miscellanea:misc.Mode6
ltx/en_us_oca/me.m01.d05:meVE.Aposticha1.text	
ltx/en_us_oca/me.m01.d05:meVE.Aposticha2.incipit	…
ltx/en_us_oca/me.m01.d05:meVE.Aposticha2.melody	@ltx/en_us_oca/he.a.m6:heAU.TriimerosAnestis.notmetered
ltx/en_us_oca/me.m01.d05:meVE.Aposticha2.mode	@ltx/en_us_oca/miscellanea:misc.Mode6
ltx/en_us_oca/me.m01.d05:meVE.Aposticha2.text	
ltx/en_us_oca/me.m01.d05:meVE.Aposticha3.incipit	…
ltx/en_us_oca/me.m01.d05:meVE.Aposticha3.melody	@ltx/en_us_oca/he.a.m6:heAU.TriimerosAnestis.notmetered
ltx/en_us_oca/me.m01.d05:meVE.Aposticha3.mode	@ltx/en_us_oca/miscellanea:misc.Mode6
ltx/en_us_oca/me.m01.d05:meVE.Aposticha3.text	
ltx/en_us_oca/me.m01.d05:meVE.SticGlory.incipit	@ltx/en_us_oca/me.m01.d02:meMA.Aposticha2.incipit
ltx/en_us_oca/me.m01.d05:meVE.SticGlory.melody	
ltx/en_us_oca/me.m01.d05:meVE.SticGlory.mode	@ltx/en_us_oca/miscellanea:misc.Mode6
ltx/en_us_oca/me.m01.d05:meVE.SticGlory.poet	@ltx/en_us_oca/poets:po.Germanou
ltx/en_us_oca/me.m01.d05:meVE.SticGlory.text	@ltx/en_us_oca/me.m01.d02:meMA.Aposticha2.text
ltx/en_us_oca/me.m01.d05:meVE.Stichera01.greekmelody	@ltx/en_us_oca/he.a.m4:heAU.OsGennaionEnMartysi.greekname
ltx/en_us_oca/me.m01.d05:meVE.Stichera01.incipit	…
ltx/en_us_oca/me.m01.d05:meVE.Stichera01.melody	@ltx/en_us_oca/he.a.m4:heAU.OsGennaionEnMartysi.notmetered
ltx/en_us_oca/me.m01.d05:meVE.Stichera01.mode	@ltx/en_us_oca/miscellanea:misc.Mode4
ltx/en_us_oca/me.m01.d05:meVE.Stichera01.text	
ltx/en_us_oca/me.m01.d05:meVE.Stichera02.incipit	…
ltx/en_us_oca/me.m01.d05:meVE.Stichera02.melody	@ltx/en_us_oca/he.a.m4:heAU.OsGennaionEnMartysi.notmetered
ltx/en_us_oca/me.m01.d05:meVE.Stichera02.mode	@ltx/en_us_oca/miscellanea:misc.Mode4
ltx/en_us_oca/me.m01.d05:meVE.Stichera02.text	
ltx/en_us_oca/me.m01.d05:meVE.Stichera03.incipit	…
ltx/en_us_oca/me.m01.d05:meVE.Stichera03.melody	@ltx/en_us_oca/he.a.m4:heAU.OsGennaionEnMartysi.notmetered
ltx/en_us_oca/me.m01.d05:meVE.Stichera03.mode	@ltx/en_us_oca/miscellanea:misc.Mode4
ltx/en_us_oca/me.m01.d05:meVE.Stichera03.text	
ltx/en_us_oca/me.m01.d05:meVE.Stichera04.greekmelody	@ltx/en_us_oca/he.a.m1:heAU.TonOuranionTagmaton.greekname
ltx/en_us_oca/me.m01.d05:meVE.Stichera04.incipit	…
ltx/en_us_oca/me.m01.d05:meVE.Stichera04.melody	@ltx/en_us_oca/he.a.m1:heAU.TonOuranionTagmaton.notmetered
ltx/en_us_oca/me.m01.d05:meVE.Stichera04.mode	@ltx/en_us_oca/miscellanea:misc.Mode1
ltx/en_us_oca/me.m01.d05:meVE.Stichera04.text	
ltx/en_us_oca/me.m01.d05:meVE.Stichera05.incipit	…
ltx/en_us_oca/me.m01.d05:meVE.Stichera05.melody	@ltx/en_us_oca/he.a.m1:heAU.TonOuranionTagmaton.notmetered
ltx/en_us_oca/me.m01.d05:meVE.Stichera05.mode	@ltx/en_us_oca/miscellanea:misc.Mode1
ltx/en_us_oca/me.m01.d05:meVE.Stichera05.text	
ltx/en_us_oca/me.m01.d05:meVE.Stichera06.incipit	…
ltx/en_us_oca/me.m01.d05:meVE.Stichera06.melody	@ltx/en_us_oca/he.a.m1:heAU.TonOuranionTagmaton.notmetered
ltx/en_us_oca/me.m01.d05:meVE.Stichera06.mode	@ltx/en_us_oca/miscellanea:misc.Mode1
ltx/en_us_oca/me.m01.d05:meVE.Stichera06.text	
