ltx/en_us_oca/me.m08.d17:meDA.commemoration.first	
ltx/en_us_oca/me.m08.d17:meDA.commemoration.first_name	
ltx/en_us_oca/me.m08.d17:meDA.commemoration.first_short	
ltx/en_us_oca/me.m08.d17:meDA.commemoration.first_title	
ltx/en_us_oca/me.m08.d17:meDA.commemoration.full	
ltx/en_us_oca/me.m08.d17:meDA.commemoration.second_name	
ltx/en_us_oca/me.m08.d17:meDA.commemoration.second_title	
ltx/en_us_oca/me.m08.d17:meDA.date	
ltx/en_us_oca/me.m08.d17:meDA.fordate	
ltx/en_us_oca/me.m08.d17:meDA.insert1	
ltx/en_us_oca/me.m08.d17:meDA.insert2	
ltx/en_us_oca/me.m08.d17:meDA.note	
ltx/en_us_oca/me.m08.d17:meDA.pdfcoverdate	
ltx/en_us_oca/me.m08.d17:meDA.pdfheaderdate	
ltx/en_us_oca/me.m08.d17:meHO.commemorations	
ltx/en_us_oca/me.m08.d17:meHO.note1	
ltx/en_us_oca/me.m08.d17:meHO.note2	
ltx/en_us_oca/me.m08.d17:meHO.number	
ltx/en_us_oca/me.m08.d17:meHO.rank	
ltx/en_us_oca/me.m08.d17:meLE.commemoration1	
ltx/en_us_oca/me.m08.d17:meLE.commemoration2	
ltx/en_us_oca/me.m08.d17:meLI.Kontakion1.greekmelody	@ltx/en_us_oca/me.m08.d17:meMA.Kontakion1.greekmelody
ltx/en_us_oca/me.m08.d17:meLI.Kontakion1.incipit	@ltx/en_us_oca/me.m08.d17:meMA.Kontakion1.incipit
ltx/en_us_oca/me.m08.d17:meLI.Kontakion1.melody	@ltx/en_us_oca/me.m08.d17:meMA.Kontakion1.melody
ltx/en_us_oca/me.m08.d17:meLI.Kontakion1.mode	@ltx/en_us_oca/me.m08.d17:meMA.Kontakion1.mode
ltx/en_us_oca/me.m08.d17:meLI.Kontakion1.text	@ltx/en_us_oca/me.m08.d17:meMA.Kontakion1.text
ltx/en_us_oca/me.m08.d17:meLI.Megalynarion.text	
ltx/en_us_oca/me.m08.d17:meMA.AposGlory.incipit	Jesus, your Son and our…
ltx/en_us_oca/me.m08.d17:meMA.AposGlory.melody	
ltx/en_us_oca/me.m08.d17:meMA.AposGlory.mode	@ltx/en_us_oca/miscellanea:misc.Mode8
ltx/en_us_oca/me.m08.d17:meMA.AposGlory.poet	@ltx/en_us_oca/poets:po.LeontosDespotou
ltx/en_us_oca/me.m08.d17:meMA.AposGlory.text	Jesus, your Son and our God, Theotokos, ⁄ confirming His two natures, ⁄ dies as a Man and arises as God! ⁄ It was His good pleasure, Mother of God, ⁄ that you also die lest unbelievers consider His dispensation a fantasy! ⁄ You were translated to the Kingdom of heaven, celestial Bride ⁄ taken up from the earth as from your dwelling chamber. ⁄ The air was sanctified by your passage ⁄ as the earth was illumined by your giving of birth. ⁄ The apostles send you forth and the angels bear you up. ⁄ As they buried your all-pure body, singing funeral hymns for you ⁄ they gazed in awe and spoke with fear: ⁄ This change is from the right hand of the Most High, ⁄ for He dwelt within you, ⁄ and you shall never be shaken! ⁄ All-hymned Mother, do not cease to watch over us, ⁄ for we are your people and the sheep of your pasture: ⁄ We call on your name, ⁄⁄ asking salvation and great mercy for your sake.
ltx/en_us_oca/me.m08.d17:meMA.Aposticha1.greekmelody	@ltx/en_us_oca/he.a.m2:heAU.OikosTouEfratha.greekname
ltx/en_us_oca/me.m08.d17:meMA.Aposticha1.incipit	…
ltx/en_us_oca/me.m08.d17:meMA.Aposticha1.melody	@ltx/en_us_oca/he.a.m2:heAU.OikosTouEfratha.notmetered
ltx/en_us_oca/me.m08.d17:meMA.Aposticha1.mode	@ltx/en_us_oca/miscellanea:misc.Mode2
ltx/en_us_oca/me.m08.d17:meMA.Aposticha1.text	
ltx/en_us_oca/me.m08.d17:meMA.Aposticha2.incipit	…
ltx/en_us_oca/me.m08.d17:meMA.Aposticha2.melody	@ltx/en_us_oca/he.a.m2:heAU.OikosTouEfratha.notmetered
ltx/en_us_oca/me.m08.d17:meMA.Aposticha2.mode	@ltx/en_us_oca/miscellanea:misc.Mode2
ltx/en_us_oca/me.m08.d17:meMA.Aposticha2.text	
ltx/en_us_oca/me.m08.d17:meMA.Aposticha3.incipit	…
ltx/en_us_oca/me.m08.d17:meMA.Aposticha3.melody	@ltx/en_us_oca/he.a.m2:heAU.OikosTouEfratha.notmetered
ltx/en_us_oca/me.m08.d17:meMA.Aposticha3.mode	@ltx/en_us_oca/miscellanea:misc.Mode2
ltx/en_us_oca/me.m08.d17:meMA.Aposticha3.text	
ltx/en_us_oca/me.m08.d17:meMA.C1.acrostic.notice1	
ltx/en_us_oca/me.m08.d17:meMA.C1.acrostic.text	
ltx/en_us_oca/me.m08.d17:meMA.C1.acrostic.title	
ltx/en_us_oca/me.m08.d17:meMA.C1.title	@ltx/en_us_oca/titles:ti.CanonSaintM
ltx/en_us_oca/me.m08.d17:meMA.C1.verse	@ltx/en_us_oca/prayers:pr.verse_SaintM.text
ltx/en_us_oca/me.m08.d17:meMA.Exaposteilarion1.greekmelody	@ltx/en_us_oca/he.a.m2:heAU.GynaikesAkoutisthite.greekname
ltx/en_us_oca/me.m08.d17:meMA.Exaposteilarion1.incipit	…
ltx/en_us_oca/me.m08.d17:meMA.Exaposteilarion1.melody	@ltx/en_us_oca/he.a.m2:heAU.GynaikesAkoutisthite.notmetered
ltx/en_us_oca/me.m08.d17:meMA.Exaposteilarion1.mode	@ltx/en_us_oca/miscellanea:misc.Mode2
ltx/en_us_oca/me.m08.d17:meMA.Exaposteilarion1.text	
ltx/en_us_oca/me.m08.d17:meMA.Exaposteilarion2.greekmelody	@ltx/en_us_oca/he.a.m3:heAU.OOuranonToisAstrois.greekname
ltx/en_us_oca/me.m08.d17:meMA.Exaposteilarion2.incipit	…
ltx/en_us_oca/me.m08.d17:meMA.Exaposteilarion2.melody	@ltx/en_us_oca/he.a.m3:heAU.OOuranonToisAstrois.notmetered
ltx/en_us_oca/me.m08.d17:meMA.Exaposteilarion2.mode	@ltx/en_us_oca/miscellanea:misc.Mode3
ltx/en_us_oca/me.m08.d17:meMA.Exaposteilarion2.text	
ltx/en_us_oca/me.m08.d17:meMA.Kathisma11.greekmelody	@ltx/en_us_oca/he.a.m3:heAU.TinOraiotita.greekname
ltx/en_us_oca/me.m08.d17:meMA.Kathisma11.incipit	…
ltx/en_us_oca/me.m08.d17:meMA.Kathisma11.melody	@ltx/en_us_oca/he.a.m3:heAU.TinOraiotita.notmetered
ltx/en_us_oca/me.m08.d17:meMA.Kathisma11.mode	@ltx/en_us_oca/miscellanea:misc.Mode3
ltx/en_us_oca/me.m08.d17:meMA.Kathisma11.text	
ltx/en_us_oca/me.m08.d17:meMA.Kathisma21.greekmelody	@ltx/en_us_oca/he.a.m4:heAU.KateplagiIosif.greekname
ltx/en_us_oca/me.m08.d17:meMA.Kathisma21.incipit	…
ltx/en_us_oca/me.m08.d17:meMA.Kathisma21.melody	@ltx/en_us_oca/he.a.m4:heAU.KateplagiIosif.notmetered
ltx/en_us_oca/me.m08.d17:meMA.Kathisma21.mode	@ltx/en_us_oca/miscellanea:misc.Mode4
ltx/en_us_oca/me.m08.d17:meMA.Kathisma21.text	
ltx/en_us_oca/me.m08.d17:meMA.Kontakion1.greekmelody	@ltx/en_us_oca/he.a.m2:heAU.TaAnoZiton.greekname
ltx/en_us_oca/me.m08.d17:meMA.Kontakion1.incipit	…
ltx/en_us_oca/me.m08.d17:meMA.Kontakion1.melody	@ltx/en_us_oca/he.a.m2:heAU.TaAnoZiton.notmetered
ltx/en_us_oca/me.m08.d17:meMA.Kontakion1.mode	@ltx/en_us_oca/miscellanea:misc.Mode2
ltx/en_us_oca/me.m08.d17:meMA.Kontakion1.text	
ltx/en_us_oca/me.m08.d17:meMA.Ode1C11.greekmelody	@ltx/en_us_oca/he.h.m2:heHE.DefteLaoi.greekname
ltx/en_us_oca/me.m08.d17:meMA.Ode1C11.incipit	…
ltx/en_us_oca/me.m08.d17:meMA.Ode1C11.melody	@ltx/en_us_oca/he.h.m2:heHE.DefteLaoi.notmetered
ltx/en_us_oca/me.m08.d17:meMA.Ode1C11.mode	@ltx/en_us_oca/miscellanea:misc.Mode2
ltx/en_us_oca/me.m08.d17:meMA.Ode1C11.ode	@ltx/en_us_oca/miscellanea:misc.Ode1
ltx/en_us_oca/me.m08.d17:meMA.Ode1C11.text	
ltx/en_us_oca/me.m08.d17:meMA.Ode1C12.incipit	…
ltx/en_us_oca/me.m08.d17:meMA.Ode1C12.melody	@ltx/en_us_oca/he.h.m2:heHE.DefteLaoi.notmetered
ltx/en_us_oca/me.m08.d17:meMA.Ode1C12.mode	@ltx/en_us_oca/miscellanea:misc.Mode2
ltx/en_us_oca/me.m08.d17:meMA.Ode1C12.ode	@ltx/en_us_oca/miscellanea:misc.Ode1
ltx/en_us_oca/me.m08.d17:meMA.Ode1C12.text	
ltx/en_us_oca/me.m08.d17:meMA.Ode1C13.incipit	…
ltx/en_us_oca/me.m08.d17:meMA.Ode1C13.melody	@ltx/en_us_oca/he.h.m2:heHE.DefteLaoi.notmetered
ltx/en_us_oca/me.m08.d17:meMA.Ode1C13.mode	@ltx/en_us_oca/miscellanea:misc.Mode2
ltx/en_us_oca/me.m08.d17:meMA.Ode1C13.ode	@ltx/en_us_oca/miscellanea:misc.Ode1
ltx/en_us_oca/me.m08.d17:meMA.Ode1C13.text	
ltx/en_us_oca/me.m08.d17:meMA.Ode1C1T.incipit	…
ltx/en_us_oca/me.m08.d17:meMA.Ode1C1T.melody	@ltx/en_us_oca/he.h.m2:heHE.DefteLaoi.notmetered
ltx/en_us_oca/me.m08.d17:meMA.Ode1C1T.mode	@ltx/en_us_oca/miscellanea:misc.Mode2
ltx/en_us_oca/me.m08.d17:meMA.Ode1C1T.ode	@ltx/en_us_oca/miscellanea:misc.Ode1
ltx/en_us_oca/me.m08.d17:meMA.Ode1C1T.text	
ltx/en_us_oca/me.m08.d17:meMA.Ode3C11.greekmelody	@ltx/en_us_oca/he.h.m2:heHE.EnPetraMeTisPisteos.greekname
ltx/en_us_oca/me.m08.d17:meMA.Ode3C11.incipit	…
ltx/en_us_oca/me.m08.d17:meMA.Ode3C11.melody	@ltx/en_us_oca/he.h.m2:heHE.EnPetraMeTisPisteos.notmetered
ltx/en_us_oca/me.m08.d17:meMA.Ode3C11.mode	@ltx/en_us_oca/miscellanea:misc.Mode2
ltx/en_us_oca/me.m08.d17:meMA.Ode3C11.ode	@ltx/en_us_oca/miscellanea:misc.Ode3
ltx/en_us_oca/me.m08.d17:meMA.Ode3C11.text	
ltx/en_us_oca/me.m08.d17:meMA.Ode3C12.incipit	…
ltx/en_us_oca/me.m08.d17:meMA.Ode3C12.melody	@ltx/en_us_oca/he.h.m2:heHE.EnPetraMeTisPisteos.notmetered
ltx/en_us_oca/me.m08.d17:meMA.Ode3C12.mode	@ltx/en_us_oca/miscellanea:misc.Mode2
ltx/en_us_oca/me.m08.d17:meMA.Ode3C12.ode	@ltx/en_us_oca/miscellanea:misc.Ode3
ltx/en_us_oca/me.m08.d17:meMA.Ode3C12.text	
ltx/en_us_oca/me.m08.d17:meMA.Ode3C13.incipit	…
ltx/en_us_oca/me.m08.d17:meMA.Ode3C13.melody	@ltx/en_us_oca/he.h.m2:heHE.EnPetraMeTisPisteos.notmetered
ltx/en_us_oca/me.m08.d17:meMA.Ode3C13.mode	@ltx/en_us_oca/miscellanea:misc.Mode2
ltx/en_us_oca/me.m08.d17:meMA.Ode3C13.ode	@ltx/en_us_oca/miscellanea:misc.Ode3
ltx/en_us_oca/me.m08.d17:meMA.Ode3C13.text	
ltx/en_us_oca/me.m08.d17:meMA.Ode3C1T.incipit	…
ltx/en_us_oca/me.m08.d17:meMA.Ode3C1T.melody	@ltx/en_us_oca/he.h.m2:heHE.EnPetraMeTisPisteos.notmetered
ltx/en_us_oca/me.m08.d17:meMA.Ode3C1T.mode	@ltx/en_us_oca/miscellanea:misc.Mode2
ltx/en_us_oca/me.m08.d17:meMA.Ode3C1T.ode	@ltx/en_us_oca/miscellanea:misc.Ode3
ltx/en_us_oca/me.m08.d17:meMA.Ode3C1T.text	
ltx/en_us_oca/me.m08.d17:meMA.Ode3H.greekmelody	@ltx/en_us_oca/he.h.m2:heHE.EnPetraMeTisPisteos.greekname
ltx/en_us_oca/me.m08.d17:meMA.Ode3H.incipit	@ltx/en_us_oca/he.h.m2:heHE.EnPetraMeTisPisteos.incipit
ltx/en_us_oca/me.m08.d17:meMA.Ode3H.melody	@ltx/en_us_oca/he.h.m2:heHE.EnPetraMeTisPisteos.melody
ltx/en_us_oca/me.m08.d17:meMA.Ode3H.mode	@ltx/en_us_oca/miscellanea:misc.Mode2
ltx/en_us_oca/me.m08.d17:meMA.Ode3H.ode	@ltx/en_us_oca/miscellanea:misc.Ode3
ltx/en_us_oca/me.m08.d17:meMA.Ode3H.text	@ltx/en_us_oca/he.h.m2:heHE.EnPetraMeTisPisteos.text
ltx/en_us_oca/me.m08.d17:meMA.Ode3Kathisma1.greekmelody	@ltx/en_us_oca/he.a.m4:heAU.EpefanisSimeron.greekname
ltx/en_us_oca/me.m08.d17:meMA.Ode3Kathisma1.incipit	…
ltx/en_us_oca/me.m08.d17:meMA.Ode3Kathisma1.melody	@ltx/en_us_oca/he.a.m4:heAU.EpefanisSimeron.notmetered
ltx/en_us_oca/me.m08.d17:meMA.Ode3Kathisma1.mode	@ltx/en_us_oca/miscellanea:misc.Mode6
ltx/en_us_oca/me.m08.d17:meMA.Ode3Kathisma1.text	
ltx/en_us_oca/me.m08.d17:meMA.Ode3Kathisma2.greekmelody	@ltx/en_us_oca/he.a.m4:heAU.EpefanisSimeron.greekname
ltx/en_us_oca/me.m08.d17:meMA.Ode3Kathisma2.incipit	…
ltx/en_us_oca/me.m08.d17:meMA.Ode3Kathisma2.melody	@ltx/en_us_oca/he.a.m4:heAU.EpefanisSimeron.notmetered
ltx/en_us_oca/me.m08.d17:meMA.Ode3Kathisma2.mode	@ltx/en_us_oca/miscellanea:misc.Mode4
ltx/en_us_oca/me.m08.d17:meMA.Ode3Kathisma2.text	
ltx/en_us_oca/me.m08.d17:meMA.Ode4C11.greekmelody	@ltx/en_us_oca/he.h.m2:heHE.YmnoSeAkoi.greekname
ltx/en_us_oca/me.m08.d17:meMA.Ode4C11.incipit	…
ltx/en_us_oca/me.m08.d17:meMA.Ode4C11.melody	@ltx/en_us_oca/he.h.m2:heHE.YmnoSeAkoi.notmetered
ltx/en_us_oca/me.m08.d17:meMA.Ode4C11.mode	@ltx/en_us_oca/miscellanea:misc.Mode2
ltx/en_us_oca/me.m08.d17:meMA.Ode4C11.ode	@ltx/en_us_oca/miscellanea:misc.Ode4
ltx/en_us_oca/me.m08.d17:meMA.Ode4C11.text	
ltx/en_us_oca/me.m08.d17:meMA.Ode4C12.incipit	…
ltx/en_us_oca/me.m08.d17:meMA.Ode4C12.melody	@ltx/en_us_oca/he.h.m2:heHE.YmnoSeAkoi.notmetered
ltx/en_us_oca/me.m08.d17:meMA.Ode4C12.mode	@ltx/en_us_oca/miscellanea:misc.Mode2
ltx/en_us_oca/me.m08.d17:meMA.Ode4C12.ode	@ltx/en_us_oca/miscellanea:misc.Ode4
ltx/en_us_oca/me.m08.d17:meMA.Ode4C12.text	
ltx/en_us_oca/me.m08.d17:meMA.Ode4C13.incipit	…
ltx/en_us_oca/me.m08.d17:meMA.Ode4C13.melody	@ltx/en_us_oca/he.h.m2:heHE.YmnoSeAkoi.notmetered
ltx/en_us_oca/me.m08.d17:meMA.Ode4C13.mode	@ltx/en_us_oca/miscellanea:misc.Mode2
ltx/en_us_oca/me.m08.d17:meMA.Ode4C13.ode	@ltx/en_us_oca/miscellanea:misc.Ode4
ltx/en_us_oca/me.m08.d17:meMA.Ode4C13.text	
ltx/en_us_oca/me.m08.d17:meMA.Ode4C1T.incipit	…
ltx/en_us_oca/me.m08.d17:meMA.Ode4C1T.melody	@ltx/en_us_oca/he.h.m2:heHE.YmnoSeAkoi.notmetered
ltx/en_us_oca/me.m08.d17:meMA.Ode4C1T.mode	@ltx/en_us_oca/miscellanea:misc.Mode2
ltx/en_us_oca/me.m08.d17:meMA.Ode4C1T.ode	@ltx/en_us_oca/miscellanea:misc.Ode4
ltx/en_us_oca/me.m08.d17:meMA.Ode4C1T.text	
ltx/en_us_oca/me.m08.d17:meMA.Ode5C11.greekmelody	@ltx/en_us_oca/he.h.m2:heHE.OFotismos.greekname
ltx/en_us_oca/me.m08.d17:meMA.Ode5C11.incipit	…
ltx/en_us_oca/me.m08.d17:meMA.Ode5C11.melody	@ltx/en_us_oca/he.h.m2:heHE.OFotismos.notmetered
ltx/en_us_oca/me.m08.d17:meMA.Ode5C11.mode	@ltx/en_us_oca/miscellanea:misc.Mode2
ltx/en_us_oca/me.m08.d17:meMA.Ode5C11.ode	@ltx/en_us_oca/miscellanea:misc.Ode5
ltx/en_us_oca/me.m08.d17:meMA.Ode5C11.text	
ltx/en_us_oca/me.m08.d17:meMA.Ode5C12.incipit	…
ltx/en_us_oca/me.m08.d17:meMA.Ode5C12.melody	@ltx/en_us_oca/he.h.m2:heHE.OFotismos.notmetered
ltx/en_us_oca/me.m08.d17:meMA.Ode5C12.mode	@ltx/en_us_oca/miscellanea:misc.Mode2
ltx/en_us_oca/me.m08.d17:meMA.Ode5C12.ode	@ltx/en_us_oca/miscellanea:misc.Ode5
ltx/en_us_oca/me.m08.d17:meMA.Ode5C12.text	
ltx/en_us_oca/me.m08.d17:meMA.Ode5C13.incipit	…
ltx/en_us_oca/me.m08.d17:meMA.Ode5C13.melody	@ltx/en_us_oca/he.h.m2:heHE.OFotismos.notmetered
ltx/en_us_oca/me.m08.d17:meMA.Ode5C13.mode	@ltx/en_us_oca/miscellanea:misc.Mode2
ltx/en_us_oca/me.m08.d17:meMA.Ode5C13.ode	@ltx/en_us_oca/miscellanea:misc.Ode5
ltx/en_us_oca/me.m08.d17:meMA.Ode5C13.text	
ltx/en_us_oca/me.m08.d17:meMA.Ode5C1T.incipit	…
ltx/en_us_oca/me.m08.d17:meMA.Ode5C1T.melody	@ltx/en_us_oca/he.h.m2:heHE.OFotismos.notmetered
ltx/en_us_oca/me.m08.d17:meMA.Ode5C1T.mode	@ltx/en_us_oca/miscellanea:misc.Mode2
ltx/en_us_oca/me.m08.d17:meMA.Ode5C1T.ode	@ltx/en_us_oca/miscellanea:misc.Ode5
ltx/en_us_oca/me.m08.d17:meMA.Ode5C1T.text	
ltx/en_us_oca/me.m08.d17:meMA.Ode6C11.greekmelody	@ltx/en_us_oca/he.h.m2:heHE.ProsKyrionEkKitous.greekname
ltx/en_us_oca/me.m08.d17:meMA.Ode6C11.incipit	…
ltx/en_us_oca/me.m08.d17:meMA.Ode6C11.melody	@ltx/en_us_oca/he.h.m2:heHE.ProsKyrionEkKitous.notmetered
ltx/en_us_oca/me.m08.d17:meMA.Ode6C11.mode	@ltx/en_us_oca/miscellanea:misc.Mode2
ltx/en_us_oca/me.m08.d17:meMA.Ode6C11.ode	@ltx/en_us_oca/miscellanea:misc.Ode6
ltx/en_us_oca/me.m08.d17:meMA.Ode6C11.text	
ltx/en_us_oca/me.m08.d17:meMA.Ode6C12.incipit	…
ltx/en_us_oca/me.m08.d17:meMA.Ode6C12.melody	@ltx/en_us_oca/he.h.m2:heHE.ProsKyrionEkKitous.notmetered
ltx/en_us_oca/me.m08.d17:meMA.Ode6C12.mode	@ltx/en_us_oca/miscellanea:misc.Mode2
ltx/en_us_oca/me.m08.d17:meMA.Ode6C12.ode	@ltx/en_us_oca/miscellanea:misc.Ode6
ltx/en_us_oca/me.m08.d17:meMA.Ode6C12.text	
ltx/en_us_oca/me.m08.d17:meMA.Ode6C13.incipit	…
ltx/en_us_oca/me.m08.d17:meMA.Ode6C13.melody	@ltx/en_us_oca/he.h.m2:heHE.ProsKyrionEkKitous.notmetered
ltx/en_us_oca/me.m08.d17:meMA.Ode6C13.mode	@ltx/en_us_oca/miscellanea:misc.Mode2
ltx/en_us_oca/me.m08.d17:meMA.Ode6C13.ode	@ltx/en_us_oca/miscellanea:misc.Ode6
ltx/en_us_oca/me.m08.d17:meMA.Ode6C13.text	
ltx/en_us_oca/me.m08.d17:meMA.Ode6C1T.incipit	…
ltx/en_us_oca/me.m08.d17:meMA.Ode6C1T.melody	@ltx/en_us_oca/he.h.m2:heHE.ProsKyrionEkKitous.notmetered
ltx/en_us_oca/me.m08.d17:meMA.Ode6C1T.mode	@ltx/en_us_oca/miscellanea:misc.Mode2
ltx/en_us_oca/me.m08.d17:meMA.Ode6C1T.ode	@ltx/en_us_oca/miscellanea:misc.Ode6
ltx/en_us_oca/me.m08.d17:meMA.Ode6C1T.text	
ltx/en_us_oca/me.m08.d17:meMA.Ode6H.greekmelody	@ltx/en_us_oca/he.h.m2:heHE.ProsKyrionEkKitous.greekname
ltx/en_us_oca/me.m08.d17:meMA.Ode6H.incipit	@ltx/en_us_oca/he.h.m2:heHE.ProsKyrionEkKitous.incipit
ltx/en_us_oca/me.m08.d17:meMA.Ode6H.melody	@ltx/en_us_oca/he.h.m2:heHE.ProsKyrionEkKitous.melody
ltx/en_us_oca/me.m08.d17:meMA.Ode6H.mode	@ltx/en_us_oca/miscellanea:misc.Mode2
ltx/en_us_oca/me.m08.d17:meMA.Ode6H.ode	@ltx/en_us_oca/miscellanea:misc.Ode6
ltx/en_us_oca/me.m08.d17:meMA.Ode6H.text	@ltx/en_us_oca/he.h.m2:heHE.ProsKyrionEkKitous.text
ltx/en_us_oca/me.m08.d17:meMA.Ode7C11.greekmelody	@ltx/en_us_oca/he.h.m2:heHE.EikonosChrysis.greekname
ltx/en_us_oca/me.m08.d17:meMA.Ode7C11.incipit	…
ltx/en_us_oca/me.m08.d17:meMA.Ode7C11.melody	@ltx/en_us_oca/he.h.m2:heHE.EikonosChrysis.notmetered
ltx/en_us_oca/me.m08.d17:meMA.Ode7C11.mode	@ltx/en_us_oca/miscellanea:misc.Mode2
ltx/en_us_oca/me.m08.d17:meMA.Ode7C11.ode	@ltx/en_us_oca/miscellanea:misc.Ode7
ltx/en_us_oca/me.m08.d17:meMA.Ode7C11.text	
ltx/en_us_oca/me.m08.d17:meMA.Ode7C12.incipit	…
ltx/en_us_oca/me.m08.d17:meMA.Ode7C12.melody	@ltx/en_us_oca/he.h.m2:heHE.EikonosChrysis.notmetered
ltx/en_us_oca/me.m08.d17:meMA.Ode7C12.mode	@ltx/en_us_oca/miscellanea:misc.Mode2
ltx/en_us_oca/me.m08.d17:meMA.Ode7C12.ode	@ltx/en_us_oca/miscellanea:misc.Ode7
ltx/en_us_oca/me.m08.d17:meMA.Ode7C12.text	
ltx/en_us_oca/me.m08.d17:meMA.Ode7C13.incipit	…
ltx/en_us_oca/me.m08.d17:meMA.Ode7C13.melody	@ltx/en_us_oca/he.h.m2:heHE.EikonosChrysis.notmetered
ltx/en_us_oca/me.m08.d17:meMA.Ode7C13.mode	@ltx/en_us_oca/miscellanea:misc.Mode2
ltx/en_us_oca/me.m08.d17:meMA.Ode7C13.ode	@ltx/en_us_oca/miscellanea:misc.Ode7
ltx/en_us_oca/me.m08.d17:meMA.Ode7C13.text	
ltx/en_us_oca/me.m08.d17:meMA.Ode7C1T.incipit	…
ltx/en_us_oca/me.m08.d17:meMA.Ode7C1T.melody	@ltx/en_us_oca/he.h.m2:heHE.EikonosChrysis.notmetered
ltx/en_us_oca/me.m08.d17:meMA.Ode7C1T.mode	@ltx/en_us_oca/miscellanea:misc.Mode2
ltx/en_us_oca/me.m08.d17:meMA.Ode7C1T.ode	@ltx/en_us_oca/miscellanea:misc.Ode7
ltx/en_us_oca/me.m08.d17:meMA.Ode7C1T.text	
ltx/en_us_oca/me.m08.d17:meMA.Ode8C11.greekmelody	@ltx/en_us_oca/he.h.m2:heHE.TonEnKaminoTouPyros.greekname
ltx/en_us_oca/me.m08.d17:meMA.Ode8C11.incipit	…
ltx/en_us_oca/me.m08.d17:meMA.Ode8C11.melody	@ltx/en_us_oca/he.h.m2:heHE.TonEnKaminoTouPyros.notmetered
ltx/en_us_oca/me.m08.d17:meMA.Ode8C11.mode	@ltx/en_us_oca/miscellanea:misc.Mode2
ltx/en_us_oca/me.m08.d17:meMA.Ode8C11.ode	@ltx/en_us_oca/miscellanea:misc.Ode8
ltx/en_us_oca/me.m08.d17:meMA.Ode8C11.text	
ltx/en_us_oca/me.m08.d17:meMA.Ode8C12.incipit	…
ltx/en_us_oca/me.m08.d17:meMA.Ode8C12.melody	@ltx/en_us_oca/he.h.m2:heHE.TonEnKaminoTouPyros.notmetered
ltx/en_us_oca/me.m08.d17:meMA.Ode8C12.mode	@ltx/en_us_oca/miscellanea:misc.Mode2
ltx/en_us_oca/me.m08.d17:meMA.Ode8C12.ode	@ltx/en_us_oca/miscellanea:misc.Ode8
ltx/en_us_oca/me.m08.d17:meMA.Ode8C12.text	
ltx/en_us_oca/me.m08.d17:meMA.Ode8C13.incipit	…
ltx/en_us_oca/me.m08.d17:meMA.Ode8C13.melody	@ltx/en_us_oca/he.h.m2:heHE.TonEnKaminoTouPyros.notmetered
ltx/en_us_oca/me.m08.d17:meMA.Ode8C13.mode	@ltx/en_us_oca/miscellanea:misc.Mode2
ltx/en_us_oca/me.m08.d17:meMA.Ode8C13.ode	@ltx/en_us_oca/miscellanea:misc.Ode8
ltx/en_us_oca/me.m08.d17:meMA.Ode8C13.text	
ltx/en_us_oca/me.m08.d17:meMA.Ode8C1T.incipit	…
ltx/en_us_oca/me.m08.d17:meMA.Ode8C1T.melody	@ltx/en_us_oca/he.h.m2:heHE.TonEnKaminoTouPyros.notmetered
ltx/en_us_oca/me.m08.d17:meMA.Ode8C1T.mode	@ltx/en_us_oca/miscellanea:misc.Mode2
ltx/en_us_oca/me.m08.d17:meMA.Ode8C1T.ode	@ltx/en_us_oca/miscellanea:misc.Ode8
ltx/en_us_oca/me.m08.d17:meMA.Ode8C1T.text	
ltx/en_us_oca/me.m08.d17:meMA.Ode8H.greekmelody	@ltx/en_us_oca/he.h.m2:heHE.TonEnKaminoTouPyros.greekname
ltx/en_us_oca/me.m08.d17:meMA.Ode8H.incipit	@ltx/en_us_oca/he.h.m2:heHE.TonEnKaminoTouPyros.incipit
ltx/en_us_oca/me.m08.d17:meMA.Ode8H.melody	@ltx/en_us_oca/he.h.m2:heHE.TonEnKaminoTouPyros.melody
ltx/en_us_oca/me.m08.d17:meMA.Ode8H.mode	@ltx/en_us_oca/miscellanea:misc.Mode2
ltx/en_us_oca/me.m08.d17:meMA.Ode8H.ode	@ltx/en_us_oca/miscellanea:misc.Ode8
ltx/en_us_oca/me.m08.d17:meMA.Ode8H.text	@ltx/en_us_oca/he.h.m2:heHE.TonEnKaminoTouPyros.text
ltx/en_us_oca/me.m08.d17:meMA.Ode9C11.greekmelody	@ltx/en_us_oca/he.h.m2:heHE.TonEkTheouTheonLogon.greekname
ltx/en_us_oca/me.m08.d17:meMA.Ode9C11.incipit	…
ltx/en_us_oca/me.m08.d17:meMA.Ode9C11.melody	@ltx/en_us_oca/he.h.m2:heHE.TonEkTheouTheonLogon.notmetered
ltx/en_us_oca/me.m08.d17:meMA.Ode9C11.mode	@ltx/en_us_oca/miscellanea:misc.Mode2
ltx/en_us_oca/me.m08.d17:meMA.Ode9C11.ode	@ltx/en_us_oca/miscellanea:misc.Ode9
ltx/en_us_oca/me.m08.d17:meMA.Ode9C11.text	
ltx/en_us_oca/me.m08.d17:meMA.Ode9C12.incipit	…
ltx/en_us_oca/me.m08.d17:meMA.Ode9C12.melody	@ltx/en_us_oca/he.h.m2:heHE.TonEkTheouTheonLogon.notmetered
ltx/en_us_oca/me.m08.d17:meMA.Ode9C12.mode	@ltx/en_us_oca/miscellanea:misc.Mode2
ltx/en_us_oca/me.m08.d17:meMA.Ode9C12.ode	@ltx/en_us_oca/miscellanea:misc.Ode9
ltx/en_us_oca/me.m08.d17:meMA.Ode9C12.text	
ltx/en_us_oca/me.m08.d17:meMA.Ode9C13.incipit	…
ltx/en_us_oca/me.m08.d17:meMA.Ode9C13.melody	@ltx/en_us_oca/he.h.m2:heHE.TonEkTheouTheonLogon.notmetered
ltx/en_us_oca/me.m08.d17:meMA.Ode9C13.mode	@ltx/en_us_oca/miscellanea:misc.Mode2
ltx/en_us_oca/me.m08.d17:meMA.Ode9C13.ode	@ltx/en_us_oca/miscellanea:misc.Ode9
ltx/en_us_oca/me.m08.d17:meMA.Ode9C13.text	
ltx/en_us_oca/me.m08.d17:meMA.Ode9C14.incipit	…
ltx/en_us_oca/me.m08.d17:meMA.Ode9C14.melody	@ltx/en_us_oca/he.h.m2:heHE.TonEkTheouTheonLogon.notmetered
ltx/en_us_oca/me.m08.d17:meMA.Ode9C14.mode	@ltx/en_us_oca/miscellanea:misc.Mode2
ltx/en_us_oca/me.m08.d17:meMA.Ode9C14.ode	@ltx/en_us_oca/miscellanea:misc.Ode9
ltx/en_us_oca/me.m08.d17:meMA.Ode9C14.text	
ltx/en_us_oca/me.m08.d17:meMA.Ode9C1T.incipit	…
ltx/en_us_oca/me.m08.d17:meMA.Ode9C1T.melody	@ltx/en_us_oca/he.h.m2:heHE.TonEkTheouTheonLogon.notmetered
ltx/en_us_oca/me.m08.d17:meMA.Ode9C1T.mode	@ltx/en_us_oca/miscellanea:misc.Mode2
ltx/en_us_oca/me.m08.d17:meMA.Ode9C1T.ode	@ltx/en_us_oca/miscellanea:misc.Ode9
ltx/en_us_oca/me.m08.d17:meMA.Ode9C1T.text	
ltx/en_us_oca/me.m08.d17:meMA.Ode9H.greekmelody	@ltx/en_us_oca/he.h.m2:heHE.TonEkTheouTheonLogon.greekname
ltx/en_us_oca/me.m08.d17:meMA.Ode9H.incipit	@ltx/en_us_oca/he.h.m2:heHE.TonEkTheouTheonLogon.incipit
ltx/en_us_oca/me.m08.d17:meMA.Ode9H.melody	@ltx/en_us_oca/he.h.m2:heHE.TonEkTheouTheonLogon.melody
ltx/en_us_oca/me.m08.d17:meMA.Ode9H.mode	@ltx/en_us_oca/miscellanea:misc.Mode2
ltx/en_us_oca/me.m08.d17:meMA.Ode9H.ode	@ltx/en_us_oca/miscellanea:misc.Ode9
ltx/en_us_oca/me.m08.d17:meMA.Ode9H.text	@ltx/en_us_oca/he.h.m2:heHE.TonEkTheouTheonLogon.text
ltx/en_us_oca/me.m08.d17:meMA.Oikos1.text	
ltx/en_us_oca/me.m08.d17:meVE.Apolytikion1ger.greekmelody	@ltx/en_us_oca/he.a.m4:heAU.TachyProkatalave.greekname
ltx/en_us_oca/me.m08.d17:meVE.Apolytikion1ger.incipit	…
ltx/en_us_oca/me.m08.d17:meVE.Apolytikion1ger.melody	@ltx/en_us_oca/he.a.m4:heAU.TachyProkatalave.notmetered
ltx/en_us_oca/me.m08.d17:meVE.Apolytikion1ger.mode	@ltx/en_us_oca/miscellanea:misc.Mode2
ltx/en_us_oca/me.m08.d17:meVE.Apolytikion1ger.poet	@ltx/en_us_oca/poets:po.Gerasimou
ltx/en_us_oca/me.m08.d17:meVE.Apolytikion1ger.text	
ltx/en_us_oca/me.m08.d17:meVE.AposGlory.incipit	…
ltx/en_us_oca/me.m08.d17:meVE.AposGlory.melody	
ltx/en_us_oca/me.m08.d17:meVE.AposGlory.mode	@ltx/en_us_oca/miscellanea:misc.Mode2
ltx/en_us_oca/me.m08.d17:meVE.AposGlory.text	
ltx/en_us_oca/me.m08.d17:meVE.Aposticha1.greekmelody	@ltx/en_us_oca/he.a.m2:heAU.OikosTouEfratha.greekname
ltx/en_us_oca/me.m08.d17:meVE.Aposticha1.incipit	…
ltx/en_us_oca/me.m08.d17:meVE.Aposticha1.melody	@ltx/en_us_oca/he.a.m2:heAU.OikosTouEfratha.notmetered
ltx/en_us_oca/me.m08.d17:meVE.Aposticha1.mode	@ltx/en_us_oca/miscellanea:misc.Mode2
ltx/en_us_oca/me.m08.d17:meVE.Aposticha1.text	
ltx/en_us_oca/me.m08.d17:meVE.Aposticha2.incipit	…
ltx/en_us_oca/me.m08.d17:meVE.Aposticha2.melody	@ltx/en_us_oca/he.a.m2:heAU.OikosTouEfratha.notmetered
ltx/en_us_oca/me.m08.d17:meVE.Aposticha2.mode	@ltx/en_us_oca/miscellanea:misc.Mode2
ltx/en_us_oca/me.m08.d17:meVE.Aposticha2.text	
ltx/en_us_oca/me.m08.d17:meVE.Aposticha3.incipit	…
ltx/en_us_oca/me.m08.d17:meVE.Aposticha3.melody	@ltx/en_us_oca/he.a.m2:heAU.OikosTouEfratha.notmetered
ltx/en_us_oca/me.m08.d17:meVE.Aposticha3.mode	@ltx/en_us_oca/miscellanea:misc.Mode2
ltx/en_us_oca/me.m08.d17:meVE.Aposticha3.text	
ltx/en_us_oca/me.m08.d17:meVE.SticGlory.incipit	…
ltx/en_us_oca/me.m08.d17:meVE.SticGlory.melody	
ltx/en_us_oca/me.m08.d17:meVE.SticGlory.mode	@ltx/en_us_oca/miscellanea:misc.Mode2
ltx/en_us_oca/me.m08.d17:meVE.SticGlory.text	
ltx/en_us_oca/me.m08.d17:meVE.Stichera01.greekmelody	@ltx/en_us_oca/he.a.m2:heAU.PoioisEffimionStemmasin.greekname
ltx/en_us_oca/me.m08.d17:meVE.Stichera01.incipit	…
ltx/en_us_oca/me.m08.d17:meVE.Stichera01.melody	@ltx/en_us_oca/he.a.m2:heAU.PoioisEffimionStemmasin.notmetered
ltx/en_us_oca/me.m08.d17:meVE.Stichera01.mode	@ltx/en_us_oca/miscellanea:misc.Mode2
ltx/en_us_oca/me.m08.d17:meVE.Stichera01.text	
ltx/en_us_oca/me.m08.d17:meVE.Stichera02.incipit	…
ltx/en_us_oca/me.m08.d17:meVE.Stichera02.melody	@ltx/en_us_oca/he.a.m2:heAU.PoioisEffimionStemmasin.notmetered
ltx/en_us_oca/me.m08.d17:meVE.Stichera02.mode	@ltx/en_us_oca/miscellanea:misc.Mode2
ltx/en_us_oca/me.m08.d17:meVE.Stichera02.text	
ltx/en_us_oca/me.m08.d17:meVE.Stichera03.incipit	…
ltx/en_us_oca/me.m08.d17:meVE.Stichera03.melody	@ltx/en_us_oca/he.a.m2:heAU.PoioisEffimionStemmasin.notmetered
ltx/en_us_oca/me.m08.d17:meVE.Stichera03.mode	@ltx/en_us_oca/miscellanea:misc.Mode2
ltx/en_us_oca/me.m08.d17:meVE.Stichera03.text	
ltx/en_us_oca/me.m08.d17:meVE.Stichera04.greekmelody	@ltx/en_us_oca/he.a.m2:heAU.OteEkTouXylou.greekname
ltx/en_us_oca/me.m08.d17:meVE.Stichera04.incipit	When the conflagration set by…
ltx/en_us_oca/me.m08.d17:meVE.Stichera04.melody	@ltx/en_us_oca/he.a.m2:heAU.OteEkTouXylou.notmetered
ltx/en_us_oca/me.m08.d17:meVE.Stichera04.mode	@ltx/en_us_oca/miscellanea:misc.Mode2
ltx/en_us_oca/me.m08.d17:meVE.Stichera04.text	When the conflagration set by the godless was consuming every land ⁄ you were set ablaze, blessed one, by the burning of the Spirit. ⁄ You preached the Word, Who in His goodness, ⁄ wrapped himself in flesh taken from the divine Virgin Maiden! ⁄ Therefore, strengthened by the might of grace, ⁄⁄ you endured fire, torments and cruel persecutions.
ltx/en_us_oca/me.m08.d17:meVE.Stichera05.incipit	When the shameful enemy strove…
ltx/en_us_oca/me.m08.d17:meVE.Stichera05.melody	@ltx/en_us_oca/he.a.m2:heAU.OteEkTouXylou.notmetered
ltx/en_us_oca/me.m08.d17:meVE.Stichera05.mode	@ltx/en_us_oca/miscellanea:misc.Mode2
ltx/en_us_oca/me.m08.d17:meVE.Stichera05.text	When the shameful enemy strove with flatteries ⁄ to sway you from your intention, ⁄ adorned with courage you opposed him steadfastly! ⁄ You endured the pains which brought you to a painless rest: ⁄ To the Kingdom of heaven and everlasting delight, ⁄⁄ all-praised Martyr Myron!
ltx/en_us_oca/me.m08.d17:meVE.Stichera06.incipit	Martyr, when the enemy flogged…
ltx/en_us_oca/me.m08.d17:meVE.Stichera06.melody	@ltx/en_us_oca/he.a.m2:heAU.OteEkTouXylou.notmetered
ltx/en_us_oca/me.m08.d17:meVE.Stichera06.mode	@ltx/en_us_oca/miscellanea:misc.Mode2
ltx/en_us_oca/me.m08.d17:meVE.Stichera06.text	Martyr, when the enemy flogged you with thongs of hide, ⁄ destroying your holy flesh with constant lashings, ⁄ you turned your gaze to Christ, the contest’s Judge. ⁄ He stretched out His hand of divine might to you! ⁄ Therefore, having completed the race, ⁄⁄ you received great honors, all-courageous athlete Myron!
