ltx/en_us_oca/me.m10.d03:meDA.commemoration.first	
ltx/en_us_oca/me.m10.d03:meDA.commemoration.first_name	
ltx/en_us_oca/me.m10.d03:meDA.commemoration.first_short	
ltx/en_us_oca/me.m10.d03:meDA.commemoration.first_title	
ltx/en_us_oca/me.m10.d03:meDA.commemoration.full	
ltx/en_us_oca/me.m10.d03:meDA.commemoration.second_name	
ltx/en_us_oca/me.m10.d03:meDA.commemoration.second_title	
ltx/en_us_oca/me.m10.d03:meDA.date	
ltx/en_us_oca/me.m10.d03:meDA.fordate	
ltx/en_us_oca/me.m10.d03:meDA.insert1	
ltx/en_us_oca/me.m10.d03:meDA.insert2	
ltx/en_us_oca/me.m10.d03:meDA.note	
ltx/en_us_oca/me.m10.d03:meDA.pdfcoverdate	
ltx/en_us_oca/me.m10.d03:meDA.pdfheaderdate	
ltx/en_us_oca/me.m10.d03:meHO.commemorations	
ltx/en_us_oca/me.m10.d03:meHO.note1	
ltx/en_us_oca/me.m10.d03:meHO.note2	
ltx/en_us_oca/me.m10.d03:meHO.number	
ltx/en_us_oca/me.m10.d03:meHO.rank	
ltx/en_us_oca/me.m10.d03:meLE.commemoration1	
ltx/en_us_oca/me.m10.d03:meLE.commemoration2	
ltx/en_us_oca/me.m10.d03:meLI.Kontakion1.greekmelody	@ltx/en_us_oca/me.m10.d03:meMA.Kontakion1.greekmelody
ltx/en_us_oca/me.m10.d03:meLI.Kontakion1.incipit	@ltx/en_us_oca/me.m10.d03:meMA.Kontakion1.incipit
ltx/en_us_oca/me.m10.d03:meLI.Kontakion1.melody	@ltx/en_us_oca/me.m10.d03:meMA.Kontakion1.melody
ltx/en_us_oca/me.m10.d03:meLI.Kontakion1.mode	@ltx/en_us_oca/me.m10.d03:meMA.Kontakion1.mode
ltx/en_us_oca/me.m10.d03:meLI.Kontakion1.text	@ltx/en_us_oca/me.m10.d03:meMA.Kontakion1.text
ltx/en_us_oca/me.m10.d03:meLI.Megalynarion.text	
ltx/en_us_oca/me.m10.d03:meMA.AposGlory.incipit	Excelling among hierarchs and martyrs…
ltx/en_us_oca/me.m10.d03:meMA.AposGlory.melody	
ltx/en_us_oca/me.m10.d03:meMA.AposGlory.mode	@ltx/en_us_oca/miscellanea:misc.Mode8
ltx/en_us_oca/me.m10.d03:meMA.AposGlory.poet	@ltx/en_us_oca/poets:po.Germanou
ltx/en_us_oca/me.m10.d03:meMA.AposGlory.text	Excelling among hierarchs and martyrs, venerable one, ⁄ you were revealed to be a faithful pastor, ⁄ having drunk of the cup of Christ! ⁄ Therefore, having pleased Him in both those ways, ⁄⁄ since you now dwell in light with the ministers of heaven, intercede for us!
ltx/en_us_oca/me.m10.d03:meMA.AposStavrotheotokion.greekmelody	@ltx/en_us_oca/he.a.m8:heAU.KyrieEiKaiKritirio.greekname
ltx/en_us_oca/me.m10.d03:meMA.AposStavrotheotokion.incipit	…
ltx/en_us_oca/me.m10.d03:meMA.AposStavrotheotokion.melody	@ltx/en_us_oca/he.a.m8:heAU.KyrieEiKaiKritirio.notmetered
ltx/en_us_oca/me.m10.d03:meMA.AposStavrotheotokion.mode	@ltx/en_us_oca/miscellanea:misc.Mode8
ltx/en_us_oca/me.m10.d03:meMA.AposStavrotheotokion.text	
ltx/en_us_oca/me.m10.d03:meMA.AposTheotokion.greekmelody	@ltx/en_us_oca/he.a.m8:heAU.OTouParadoxou.greekname
ltx/en_us_oca/me.m10.d03:meMA.AposTheotokion.incipit	…
ltx/en_us_oca/me.m10.d03:meMA.AposTheotokion.melody	@ltx/en_us_oca/he.a.m8:heAU.OTouParadoxou.notmetered
ltx/en_us_oca/me.m10.d03:meMA.AposTheotokion.mode	@ltx/en_us_oca/miscellanea:misc.Mode8
ltx/en_us_oca/me.m10.d03:meMA.AposTheotokion.text	
ltx/en_us_oca/me.m10.d03:meMA.C1.acrostic.notice1	
ltx/en_us_oca/me.m10.d03:meMA.C1.acrostic.text	
ltx/en_us_oca/me.m10.d03:meMA.C1.acrostic.title	
ltx/en_us_oca/me.m10.d03:meMA.C1.poet	@ltx/en_us_oca/poets:po.Theofanous
ltx/en_us_oca/me.m10.d03:meMA.C1.title	@ltx/en_us_oca/titles:ti.CanonSaintM
ltx/en_us_oca/me.m10.d03:meMA.C1.verse	@ltx/en_us_oca/prayers:pr.verse_SaintM.text
ltx/en_us_oca/me.m10.d03:meMA.ExapTheotokion.incipit	…
ltx/en_us_oca/me.m10.d03:meMA.ExapTheotokion.melody	@ltx/en_us_oca/he.a.m2:heAU.ToisMathitaisSynelthomen.notmetered
ltx/en_us_oca/me.m10.d03:meMA.ExapTheotokion.mode	@ltx/en_us_oca/miscellanea:misc.Mode2
ltx/en_us_oca/me.m10.d03:meMA.ExapTheotokion.text	
ltx/en_us_oca/me.m10.d03:meMA.Exaposteilarion1.greekmelody	@ltx/en_us_oca/he.a.m2:heAU.ToisMathitaisSynelthomen.greekname
ltx/en_us_oca/me.m10.d03:meMA.Exaposteilarion1.incipit	…
ltx/en_us_oca/me.m10.d03:meMA.Exaposteilarion1.melody	@ltx/en_us_oca/he.a.m2:heAU.ToisMathitaisSynelthomen.notmetered
ltx/en_us_oca/me.m10.d03:meMA.Exaposteilarion1.mode	@ltx/en_us_oca/miscellanea:misc.Mode2
ltx/en_us_oca/me.m10.d03:meMA.Exaposteilarion1.text	
ltx/en_us_oca/me.m10.d03:meMA.Kontakion1.greekmelody	@ltx/en_us_oca/he.a.m8:heAU.TiYpermacho.greekname
ltx/en_us_oca/me.m10.d03:meMA.Kontakion1.incipit	When you spiritually entered the…
ltx/en_us_oca/me.m10.d03:meMA.Kontakion1.melody	@ltx/en_us_oca/he.a.m8:heAU.TiYpermacho.notmetered
ltx/en_us_oca/me.m10.d03:meMA.Kontakion1.mode	@ltx/en_us_oca/miscellanea:misc.Mode8
ltx/en_us_oca/me.m10.d03:meMA.Kontakion1.text	When you spiritually entered the heavenly gateway, ⁄ as a disciple of the apostle taken up beyond the third heaven, ⁄ you were enriched, Dionysius, with understanding of ineffable mysteries ⁄ and enlightened those walking in the darkness of ignorance! ⁄⁄ Therefore we cry out to you: Rejoice, most holy Father!
ltx/en_us_oca/me.m10.d03:meMA.MM.Ve1123as5678.text	@ltx/en_us_oca/properties:media.key
ltx/en_us_oca/me.m10.d03:meMA.Ode1C11.greekmelody	@ltx/en_us_oca/he.h.m8:heHE.YgranDiodefsas.greekname
ltx/en_us_oca/me.m10.d03:meMA.Ode1C11.incipit	…
ltx/en_us_oca/me.m10.d03:meMA.Ode1C11.melody	@ltx/en_us_oca/he.h.m8:heHE.YgranDiodefsas.notmetered
ltx/en_us_oca/me.m10.d03:meMA.Ode1C11.mode	@ltx/en_us_oca/miscellanea:misc.Mode8
ltx/en_us_oca/me.m10.d03:meMA.Ode1C11.ode	@ltx/en_us_oca/miscellanea:misc.Ode1
ltx/en_us_oca/me.m10.d03:meMA.Ode1C11.text	
ltx/en_us_oca/me.m10.d03:meMA.Ode1C12.incipit	…
ltx/en_us_oca/me.m10.d03:meMA.Ode1C12.melody	@ltx/en_us_oca/he.h.m8:heHE.YgranDiodefsas.notmetered
ltx/en_us_oca/me.m10.d03:meMA.Ode1C12.mode	@ltx/en_us_oca/miscellanea:misc.Mode8
ltx/en_us_oca/me.m10.d03:meMA.Ode1C12.ode	@ltx/en_us_oca/miscellanea:misc.Ode1
ltx/en_us_oca/me.m10.d03:meMA.Ode1C12.text	
ltx/en_us_oca/me.m10.d03:meMA.Ode1C13.incipit	…
ltx/en_us_oca/me.m10.d03:meMA.Ode1C13.melody	@ltx/en_us_oca/he.h.m8:heHE.YgranDiodefsas.notmetered
ltx/en_us_oca/me.m10.d03:meMA.Ode1C13.mode	@ltx/en_us_oca/miscellanea:misc.Mode8
ltx/en_us_oca/me.m10.d03:meMA.Ode1C13.ode	@ltx/en_us_oca/miscellanea:misc.Ode1
ltx/en_us_oca/me.m10.d03:meMA.Ode1C13.text	
ltx/en_us_oca/me.m10.d03:meMA.Ode1C1T.incipit	…
ltx/en_us_oca/me.m10.d03:meMA.Ode1C1T.melody	@ltx/en_us_oca/he.h.m8:heHE.YgranDiodefsas.notmetered
ltx/en_us_oca/me.m10.d03:meMA.Ode1C1T.mode	@ltx/en_us_oca/miscellanea:misc.Mode8
ltx/en_us_oca/me.m10.d03:meMA.Ode1C1T.ode	@ltx/en_us_oca/miscellanea:misc.Ode1
ltx/en_us_oca/me.m10.d03:meMA.Ode1C1T.text	
ltx/en_us_oca/me.m10.d03:meMA.Ode3C11.greekmelody	@ltx/en_us_oca/he.h.m8:heHE.OuraniasApsidos.greekname
ltx/en_us_oca/me.m10.d03:meMA.Ode3C11.incipit	…
ltx/en_us_oca/me.m10.d03:meMA.Ode3C11.melody	@ltx/en_us_oca/he.h.m8:heHE.OuraniasApsidos.notmetered
ltx/en_us_oca/me.m10.d03:meMA.Ode3C11.mode	@ltx/en_us_oca/miscellanea:misc.Mode8
ltx/en_us_oca/me.m10.d03:meMA.Ode3C11.ode	@ltx/en_us_oca/miscellanea:misc.Ode3
ltx/en_us_oca/me.m10.d03:meMA.Ode3C11.text	
ltx/en_us_oca/me.m10.d03:meMA.Ode3C12.incipit	…
ltx/en_us_oca/me.m10.d03:meMA.Ode3C12.melody	@ltx/en_us_oca/he.h.m8:heHE.OuraniasApsidos.notmetered
ltx/en_us_oca/me.m10.d03:meMA.Ode3C12.mode	@ltx/en_us_oca/miscellanea:misc.Mode8
ltx/en_us_oca/me.m10.d03:meMA.Ode3C12.ode	@ltx/en_us_oca/miscellanea:misc.Ode3
ltx/en_us_oca/me.m10.d03:meMA.Ode3C12.text	
ltx/en_us_oca/me.m10.d03:meMA.Ode3C13.incipit	…
ltx/en_us_oca/me.m10.d03:meMA.Ode3C13.melody	@ltx/en_us_oca/he.h.m8:heHE.OuraniasApsidos.notmetered
ltx/en_us_oca/me.m10.d03:meMA.Ode3C13.mode	@ltx/en_us_oca/miscellanea:misc.Mode8
ltx/en_us_oca/me.m10.d03:meMA.Ode3C13.ode	@ltx/en_us_oca/miscellanea:misc.Ode3
ltx/en_us_oca/me.m10.d03:meMA.Ode3C13.text	
ltx/en_us_oca/me.m10.d03:meMA.Ode3C1T.incipit	…
ltx/en_us_oca/me.m10.d03:meMA.Ode3C1T.melody	@ltx/en_us_oca/he.h.m8:heHE.OuraniasApsidos.notmetered
ltx/en_us_oca/me.m10.d03:meMA.Ode3C1T.mode	@ltx/en_us_oca/miscellanea:misc.Mode8
ltx/en_us_oca/me.m10.d03:meMA.Ode3C1T.ode	@ltx/en_us_oca/miscellanea:misc.Ode3
ltx/en_us_oca/me.m10.d03:meMA.Ode3C1T.text	
ltx/en_us_oca/me.m10.d03:meMA.Ode3H.greekmelody	@ltx/en_us_oca/he.h.m8:heHE.OuraniasApsidos.greekname
ltx/en_us_oca/me.m10.d03:meMA.Ode3H.incipit	@ltx/en_us_oca/he.h.m8:heHE.OuraniasApsidos.incipit
ltx/en_us_oca/me.m10.d03:meMA.Ode3H.melody	@ltx/en_us_oca/he.h.m8:heHE.OuraniasApsidos.melody
ltx/en_us_oca/me.m10.d03:meMA.Ode3H.mode	@ltx/en_us_oca/miscellanea:misc.Mode8
ltx/en_us_oca/me.m10.d03:meMA.Ode3H.ode	@ltx/en_us_oca/miscellanea:misc.Ode3
ltx/en_us_oca/me.m10.d03:meMA.Ode3H.text	@ltx/en_us_oca/he.h.m8:heHE.OuraniasApsidos.text
ltx/en_us_oca/me.m10.d03:meMA.Ode3Kathisma1.greekmelody	@ltx/en_us_oca/he.a.m8:heAU.TinSofianKaiLogon.greekname
ltx/en_us_oca/me.m10.d03:meMA.Ode3Kathisma1.incipit	…
ltx/en_us_oca/me.m10.d03:meMA.Ode3Kathisma1.melody	@ltx/en_us_oca/he.a.m8:heAU.TinSofianKaiLogon.notmetered
ltx/en_us_oca/me.m10.d03:meMA.Ode3Kathisma1.mode	@ltx/en_us_oca/miscellanea:misc.Mode8
ltx/en_us_oca/me.m10.d03:meMA.Ode3Kathisma1.text	
ltx/en_us_oca/me.m10.d03:meMA.Ode3KathismaSt.incipit	…
ltx/en_us_oca/me.m10.d03:meMA.Ode3KathismaSt.melody	@ltx/en_us_oca/he.a.m8:heAU.TinSofianKaiLogon.notmetered
ltx/en_us_oca/me.m10.d03:meMA.Ode3KathismaSt.mode	@ltx/en_us_oca/miscellanea:misc.Mode8
ltx/en_us_oca/me.m10.d03:meMA.Ode3KathismaSt.text	
ltx/en_us_oca/me.m10.d03:meMA.Ode3KathismaT.incipit	…
ltx/en_us_oca/me.m10.d03:meMA.Ode3KathismaT.melody	@ltx/en_us_oca/he.a.m8:heAU.TinSofianKaiLogon.notmetered
ltx/en_us_oca/me.m10.d03:meMA.Ode3KathismaT.mode	@ltx/en_us_oca/miscellanea:misc.Mode8
ltx/en_us_oca/me.m10.d03:meMA.Ode3KathismaT.text	
ltx/en_us_oca/me.m10.d03:meMA.Ode4C11.greekmelody	@ltx/en_us_oca/he.h.m8:heHE.SyMouIschys.greekname
ltx/en_us_oca/me.m10.d03:meMA.Ode4C11.incipit	…
ltx/en_us_oca/me.m10.d03:meMA.Ode4C11.melody	@ltx/en_us_oca/he.h.m8:heHE.SyMouIschys.notmetered
ltx/en_us_oca/me.m10.d03:meMA.Ode4C11.mode	@ltx/en_us_oca/miscellanea:misc.Mode8
ltx/en_us_oca/me.m10.d03:meMA.Ode4C11.ode	@ltx/en_us_oca/miscellanea:misc.Ode4
ltx/en_us_oca/me.m10.d03:meMA.Ode4C11.text	
ltx/en_us_oca/me.m10.d03:meMA.Ode4C12.incipit	…
ltx/en_us_oca/me.m10.d03:meMA.Ode4C12.melody	@ltx/en_us_oca/he.h.m8:heHE.SyMouIschys.notmetered
ltx/en_us_oca/me.m10.d03:meMA.Ode4C12.mode	@ltx/en_us_oca/miscellanea:misc.Mode8
ltx/en_us_oca/me.m10.d03:meMA.Ode4C12.ode	@ltx/en_us_oca/miscellanea:misc.Ode4
ltx/en_us_oca/me.m10.d03:meMA.Ode4C12.text	
ltx/en_us_oca/me.m10.d03:meMA.Ode4C13.incipit	…
ltx/en_us_oca/me.m10.d03:meMA.Ode4C13.melody	@ltx/en_us_oca/he.h.m8:heHE.SyMouIschys.notmetered
ltx/en_us_oca/me.m10.d03:meMA.Ode4C13.mode	@ltx/en_us_oca/miscellanea:misc.Mode8
ltx/en_us_oca/me.m10.d03:meMA.Ode4C13.ode	@ltx/en_us_oca/miscellanea:misc.Ode4
ltx/en_us_oca/me.m10.d03:meMA.Ode4C13.text	
ltx/en_us_oca/me.m10.d03:meMA.Ode4C1T.incipit	…
ltx/en_us_oca/me.m10.d03:meMA.Ode4C1T.melody	@ltx/en_us_oca/he.h.m8:heHE.SyMouIschys.notmetered
ltx/en_us_oca/me.m10.d03:meMA.Ode4C1T.mode	@ltx/en_us_oca/miscellanea:misc.Mode8
ltx/en_us_oca/me.m10.d03:meMA.Ode4C1T.ode	@ltx/en_us_oca/miscellanea:misc.Ode4
ltx/en_us_oca/me.m10.d03:meMA.Ode4C1T.text	
ltx/en_us_oca/me.m10.d03:meMA.Ode5C11.greekmelody	@ltx/en_us_oca/he.h.m8:heHE.InaTiMeAposo.greekname
ltx/en_us_oca/me.m10.d03:meMA.Ode5C11.incipit	…
ltx/en_us_oca/me.m10.d03:meMA.Ode5C11.melody	@ltx/en_us_oca/he.h.m8:heHE.InaTiMeAposo.notmetered
ltx/en_us_oca/me.m10.d03:meMA.Ode5C11.mode	@ltx/en_us_oca/miscellanea:misc.Mode8
ltx/en_us_oca/me.m10.d03:meMA.Ode5C11.ode	@ltx/en_us_oca/miscellanea:misc.Ode5
ltx/en_us_oca/me.m10.d03:meMA.Ode5C11.text	
ltx/en_us_oca/me.m10.d03:meMA.Ode5C12.incipit	…
ltx/en_us_oca/me.m10.d03:meMA.Ode5C12.melody	@ltx/en_us_oca/he.h.m8:heHE.InaTiMeAposo.notmetered
ltx/en_us_oca/me.m10.d03:meMA.Ode5C12.mode	@ltx/en_us_oca/miscellanea:misc.Mode8
ltx/en_us_oca/me.m10.d03:meMA.Ode5C12.ode	@ltx/en_us_oca/miscellanea:misc.Ode5
ltx/en_us_oca/me.m10.d03:meMA.Ode5C12.text	
ltx/en_us_oca/me.m10.d03:meMA.Ode5C13.incipit	…
ltx/en_us_oca/me.m10.d03:meMA.Ode5C13.melody	@ltx/en_us_oca/he.h.m8:heHE.InaTiMeAposo.notmetered
ltx/en_us_oca/me.m10.d03:meMA.Ode5C13.mode	@ltx/en_us_oca/miscellanea:misc.Mode8
ltx/en_us_oca/me.m10.d03:meMA.Ode5C13.ode	@ltx/en_us_oca/miscellanea:misc.Ode5
ltx/en_us_oca/me.m10.d03:meMA.Ode5C13.text	
ltx/en_us_oca/me.m10.d03:meMA.Ode5C1T.incipit	…
ltx/en_us_oca/me.m10.d03:meMA.Ode5C1T.melody	@ltx/en_us_oca/he.h.m8:heHE.InaTiMeAposo.notmetered
ltx/en_us_oca/me.m10.d03:meMA.Ode5C1T.mode	@ltx/en_us_oca/miscellanea:misc.Mode8
ltx/en_us_oca/me.m10.d03:meMA.Ode5C1T.ode	@ltx/en_us_oca/miscellanea:misc.Ode5
ltx/en_us_oca/me.m10.d03:meMA.Ode5C1T.text	
ltx/en_us_oca/me.m10.d03:meMA.Ode6C11.greekmelody	@ltx/en_us_oca/he.h.m8:heHE.IlasthitiMoiSotir.greekname
ltx/en_us_oca/me.m10.d03:meMA.Ode6C11.incipit	…
ltx/en_us_oca/me.m10.d03:meMA.Ode6C11.melody	@ltx/en_us_oca/he.h.m8:heHE.IlasthitiMoiSotir.notmetered
ltx/en_us_oca/me.m10.d03:meMA.Ode6C11.mode	@ltx/en_us_oca/miscellanea:misc.Mode8
ltx/en_us_oca/me.m10.d03:meMA.Ode6C11.ode	@ltx/en_us_oca/miscellanea:misc.Ode6
ltx/en_us_oca/me.m10.d03:meMA.Ode6C11.text	
ltx/en_us_oca/me.m10.d03:meMA.Ode6C12.incipit	…
ltx/en_us_oca/me.m10.d03:meMA.Ode6C12.melody	@ltx/en_us_oca/he.h.m8:heHE.IlasthitiMoiSotir.notmetered
ltx/en_us_oca/me.m10.d03:meMA.Ode6C12.mode	@ltx/en_us_oca/miscellanea:misc.Mode8
ltx/en_us_oca/me.m10.d03:meMA.Ode6C12.ode	@ltx/en_us_oca/miscellanea:misc.Ode6
ltx/en_us_oca/me.m10.d03:meMA.Ode6C12.text	
ltx/en_us_oca/me.m10.d03:meMA.Ode6C13.incipit	…
ltx/en_us_oca/me.m10.d03:meMA.Ode6C13.melody	@ltx/en_us_oca/he.h.m8:heHE.IlasthitiMoiSotir.notmetered
ltx/en_us_oca/me.m10.d03:meMA.Ode6C13.mode	@ltx/en_us_oca/miscellanea:misc.Mode8
ltx/en_us_oca/me.m10.d03:meMA.Ode6C13.ode	@ltx/en_us_oca/miscellanea:misc.Ode6
ltx/en_us_oca/me.m10.d03:meMA.Ode6C13.text	
ltx/en_us_oca/me.m10.d03:meMA.Ode6C1T.incipit	…
ltx/en_us_oca/me.m10.d03:meMA.Ode6C1T.melody	@ltx/en_us_oca/he.h.m8:heHE.IlasthitiMoiSotir.notmetered
ltx/en_us_oca/me.m10.d03:meMA.Ode6C1T.mode	@ltx/en_us_oca/miscellanea:misc.Mode8
ltx/en_us_oca/me.m10.d03:meMA.Ode6C1T.ode	@ltx/en_us_oca/miscellanea:misc.Ode6
ltx/en_us_oca/me.m10.d03:meMA.Ode6C1T.text	
ltx/en_us_oca/me.m10.d03:meMA.Ode6H.greekmelody	@ltx/en_us_oca/he.h.m8:heHE.IlasthitiMoiSotir.greekname
ltx/en_us_oca/me.m10.d03:meMA.Ode6H.incipit	@ltx/en_us_oca/he.h.m8:heHE.IlasthitiMoiSotir.incipit
ltx/en_us_oca/me.m10.d03:meMA.Ode6H.melody	@ltx/en_us_oca/he.h.m8:heHE.IlasthitiMoiSotir.melody
ltx/en_us_oca/me.m10.d03:meMA.Ode6H.mode	@ltx/en_us_oca/miscellanea:misc.Mode8
ltx/en_us_oca/me.m10.d03:meMA.Ode6H.ode	@ltx/en_us_oca/miscellanea:misc.Ode6
ltx/en_us_oca/me.m10.d03:meMA.Ode6H.text	@ltx/en_us_oca/he.h.m8:heHE.IlasthitiMoiSotir.text
ltx/en_us_oca/me.m10.d03:meMA.Ode7C11.greekmelody	@ltx/en_us_oca/he.h.m8:heHE.TheouSynkatavasin.greekname
ltx/en_us_oca/me.m10.d03:meMA.Ode7C11.incipit	…
ltx/en_us_oca/me.m10.d03:meMA.Ode7C11.melody	@ltx/en_us_oca/he.h.m8:heHE.TheouSynkatavasin.notmetered
ltx/en_us_oca/me.m10.d03:meMA.Ode7C11.mode	@ltx/en_us_oca/miscellanea:misc.Mode8
ltx/en_us_oca/me.m10.d03:meMA.Ode7C11.ode	@ltx/en_us_oca/miscellanea:misc.Ode7
ltx/en_us_oca/me.m10.d03:meMA.Ode7C11.text	
ltx/en_us_oca/me.m10.d03:meMA.Ode7C12.incipit	…
ltx/en_us_oca/me.m10.d03:meMA.Ode7C12.melody	@ltx/en_us_oca/he.h.m8:heHE.TheouSynkatavasin.notmetered
ltx/en_us_oca/me.m10.d03:meMA.Ode7C12.mode	@ltx/en_us_oca/miscellanea:misc.Mode8
ltx/en_us_oca/me.m10.d03:meMA.Ode7C12.ode	@ltx/en_us_oca/miscellanea:misc.Ode7
ltx/en_us_oca/me.m10.d03:meMA.Ode7C12.text	
ltx/en_us_oca/me.m10.d03:meMA.Ode7C13.incipit	…
ltx/en_us_oca/me.m10.d03:meMA.Ode7C13.melody	@ltx/en_us_oca/he.h.m8:heHE.TheouSynkatavasin.notmetered
ltx/en_us_oca/me.m10.d03:meMA.Ode7C13.mode	@ltx/en_us_oca/miscellanea:misc.Mode8
ltx/en_us_oca/me.m10.d03:meMA.Ode7C13.ode	@ltx/en_us_oca/miscellanea:misc.Ode7
ltx/en_us_oca/me.m10.d03:meMA.Ode7C13.text	
ltx/en_us_oca/me.m10.d03:meMA.Ode7C1T.incipit	…
ltx/en_us_oca/me.m10.d03:meMA.Ode7C1T.melody	@ltx/en_us_oca/he.h.m8:heHE.TheouSynkatavasin.notmetered
ltx/en_us_oca/me.m10.d03:meMA.Ode7C1T.mode	@ltx/en_us_oca/miscellanea:misc.Mode8
ltx/en_us_oca/me.m10.d03:meMA.Ode7C1T.ode	@ltx/en_us_oca/miscellanea:misc.Ode7
ltx/en_us_oca/me.m10.d03:meMA.Ode7C1T.text	
ltx/en_us_oca/me.m10.d03:meMA.Ode8C11.greekmelody	@ltx/en_us_oca/he.h.m8:heHE.EptaplasiosKaminon.greekname
ltx/en_us_oca/me.m10.d03:meMA.Ode8C11.incipit	…
ltx/en_us_oca/me.m10.d03:meMA.Ode8C11.melody	@ltx/en_us_oca/he.h.m8:heHE.EptaplasiosKaminon.notmetered
ltx/en_us_oca/me.m10.d03:meMA.Ode8C11.mode	@ltx/en_us_oca/miscellanea:misc.Mode8
ltx/en_us_oca/me.m10.d03:meMA.Ode8C11.ode	@ltx/en_us_oca/miscellanea:misc.Ode8
ltx/en_us_oca/me.m10.d03:meMA.Ode8C11.text	
ltx/en_us_oca/me.m10.d03:meMA.Ode8C12.incipit	…
ltx/en_us_oca/me.m10.d03:meMA.Ode8C12.melody	@ltx/en_us_oca/he.h.m8:heHE.EptaplasiosKaminon.notmetered
ltx/en_us_oca/me.m10.d03:meMA.Ode8C12.mode	@ltx/en_us_oca/miscellanea:misc.Mode8
ltx/en_us_oca/me.m10.d03:meMA.Ode8C12.ode	@ltx/en_us_oca/miscellanea:misc.Ode8
ltx/en_us_oca/me.m10.d03:meMA.Ode8C12.text	
ltx/en_us_oca/me.m10.d03:meMA.Ode8C13.incipit	…
ltx/en_us_oca/me.m10.d03:meMA.Ode8C13.melody	@ltx/en_us_oca/he.h.m8:heHE.EptaplasiosKaminon.notmetered
ltx/en_us_oca/me.m10.d03:meMA.Ode8C13.mode	@ltx/en_us_oca/miscellanea:misc.Mode8
ltx/en_us_oca/me.m10.d03:meMA.Ode8C13.ode	@ltx/en_us_oca/miscellanea:misc.Ode8
ltx/en_us_oca/me.m10.d03:meMA.Ode8C13.text	
ltx/en_us_oca/me.m10.d03:meMA.Ode8C1T.incipit	…
ltx/en_us_oca/me.m10.d03:meMA.Ode8C1T.melody	@ltx/en_us_oca/he.h.m8:heHE.EptaplasiosKaminon.notmetered
ltx/en_us_oca/me.m10.d03:meMA.Ode8C1T.mode	@ltx/en_us_oca/miscellanea:misc.Mode8
ltx/en_us_oca/me.m10.d03:meMA.Ode8C1T.ode	@ltx/en_us_oca/miscellanea:misc.Ode8
ltx/en_us_oca/me.m10.d03:meMA.Ode8C1T.text	
ltx/en_us_oca/me.m10.d03:meMA.Ode8H.greekmelody	@ltx/en_us_oca/he.h.m8:heHE.EptaplasiosKaminon.greekname
ltx/en_us_oca/me.m10.d03:meMA.Ode8H.incipit	@ltx/en_us_oca/he.h.m8:heHE.EptaplasiosKaminon.incipit
ltx/en_us_oca/me.m10.d03:meMA.Ode8H.melody	@ltx/en_us_oca/he.h.m8:heHE.EptaplasiosKaminon.melody
ltx/en_us_oca/me.m10.d03:meMA.Ode8H.mode	@ltx/en_us_oca/miscellanea:misc.Mode8
ltx/en_us_oca/me.m10.d03:meMA.Ode8H.ode	@ltx/en_us_oca/miscellanea:misc.Ode8
ltx/en_us_oca/me.m10.d03:meMA.Ode8H.text	@ltx/en_us_oca/he.h.m8:heHE.EptaplasiosKaminon.text
ltx/en_us_oca/me.m10.d03:meMA.Ode9C11.greekmelody	@ltx/en_us_oca/he.h.m8:heHE.ExestiEpiTouto.greekname
ltx/en_us_oca/me.m10.d03:meMA.Ode9C11.incipit	…
ltx/en_us_oca/me.m10.d03:meMA.Ode9C11.melody	@ltx/en_us_oca/he.h.m8:heHE.ExestiEpiTouto.notmetered
ltx/en_us_oca/me.m10.d03:meMA.Ode9C11.mode	@ltx/en_us_oca/miscellanea:misc.Mode8
ltx/en_us_oca/me.m10.d03:meMA.Ode9C11.ode	@ltx/en_us_oca/miscellanea:misc.Ode9
ltx/en_us_oca/me.m10.d03:meMA.Ode9C11.text	
ltx/en_us_oca/me.m10.d03:meMA.Ode9C12.incipit	…
ltx/en_us_oca/me.m10.d03:meMA.Ode9C12.melody	@ltx/en_us_oca/he.h.m8:heHE.ExestiEpiTouto.notmetered
ltx/en_us_oca/me.m10.d03:meMA.Ode9C12.mode	@ltx/en_us_oca/miscellanea:misc.Mode8
ltx/en_us_oca/me.m10.d03:meMA.Ode9C12.ode	@ltx/en_us_oca/miscellanea:misc.Ode9
ltx/en_us_oca/me.m10.d03:meMA.Ode9C12.text	
ltx/en_us_oca/me.m10.d03:meMA.Ode9C13.incipit	…
ltx/en_us_oca/me.m10.d03:meMA.Ode9C13.melody	@ltx/en_us_oca/he.h.m8:heHE.ExestiEpiTouto.notmetered
ltx/en_us_oca/me.m10.d03:meMA.Ode9C13.mode	@ltx/en_us_oca/miscellanea:misc.Mode8
ltx/en_us_oca/me.m10.d03:meMA.Ode9C13.ode	@ltx/en_us_oca/miscellanea:misc.Ode9
ltx/en_us_oca/me.m10.d03:meMA.Ode9C13.text	
ltx/en_us_oca/me.m10.d03:meMA.Ode9C1T.incipit	…
ltx/en_us_oca/me.m10.d03:meMA.Ode9C1T.melody	@ltx/en_us_oca/he.h.m8:heHE.ExestiEpiTouto.notmetered
ltx/en_us_oca/me.m10.d03:meMA.Ode9C1T.mode	@ltx/en_us_oca/miscellanea:misc.Mode8
ltx/en_us_oca/me.m10.d03:meMA.Ode9C1T.ode	@ltx/en_us_oca/miscellanea:misc.Ode9
ltx/en_us_oca/me.m10.d03:meMA.Ode9C1T.text	
ltx/en_us_oca/me.m10.d03:meMA.Ode9H.greekmelody	@ltx/en_us_oca/he.h.m8:heHE.ExestiEpiTouto.greekname
ltx/en_us_oca/me.m10.d03:meMA.Ode9H.incipit	@ltx/en_us_oca/he.h.m8:heHE.ExestiEpiTouto.incipit
ltx/en_us_oca/me.m10.d03:meMA.Ode9H.melody	@ltx/en_us_oca/he.h.m8:heHE.ExestiEpiTouto.melody
ltx/en_us_oca/me.m10.d03:meMA.Ode9H.mode	@ltx/en_us_oca/miscellanea:misc.Mode8
ltx/en_us_oca/me.m10.d03:meMA.Ode9H.ode	@ltx/en_us_oca/miscellanea:misc.Ode9
ltx/en_us_oca/me.m10.d03:meMA.Ode9H.text	@ltx/en_us_oca/he.h.m8:heHE.ExestiEpiTouto.text
ltx/en_us_oca/me.m10.d03:meMA.Oikos1.text	
ltx/en_us_oca/me.m10.d03:meMA.Oikos12.text	
ltx/en_us_oca/me.m10.d03:meMA.Oikos13.text	
ltx/en_us_oca/me.m10.d03:meMA.Oikos14.text	
ltx/en_us_oca/me.m10.d03:meMA.Oikos15.text	
ltx/en_us_oca/me.m10.d03:meMA.Oikos16.text	
ltx/en_us_oca/me.m10.d03:meMA.Oikos17.text	
ltx/en_us_oca/me.m10.d03:meMA.Oikos18.text	
ltx/en_us_oca/me.m10.d03:meVE.AposGlory.incipit	We call you the unseen…
ltx/en_us_oca/me.m10.d03:meVE.AposGlory.melody	
ltx/en_us_oca/me.m10.d03:meVE.AposGlory.mode	@ltx/en_us_oca/miscellanea:misc.Mode4
ltx/en_us_oca/me.m10.d03:meVE.AposGlory.text	We call you the unseen depth of heavenly knowledge, ⁄ most splendid martyr of Christ! ⁄ We hymn you as a warrior and steadfast champion of the Church, wise one, ⁄ for you shone with most pure fire! ⁄ You were counted worthy to wear the garment of light with the armies on high, ⁄ having enlightened your mind with the radiance of the Holy Spirit, Dionysius! ⁄ Therefore with faith we celebrate your universal memorial, ⁄⁄ glorifying the Lord Who glorified you!
ltx/en_us_oca/me.m10.d03:meVE.AposStavrotheotokion.greekmelody	@ltx/en_us_oca/he.a.m4:heAU.OsGennaionEnMartysi.greekname
ltx/en_us_oca/me.m10.d03:meVE.AposStavrotheotokion.incipit	…
ltx/en_us_oca/me.m10.d03:meVE.AposStavrotheotokion.melody	@ltx/en_us_oca/he.a.m4:heAU.OsGennaionEnMartysi.notmetered
ltx/en_us_oca/me.m10.d03:meVE.AposStavrotheotokion.mode	@ltx/en_us_oca/miscellanea:misc.Mode4
ltx/en_us_oca/me.m10.d03:meVE.AposStavrotheotokion.text	
ltx/en_us_oca/me.m10.d03:meVE.AposTheotokion.greekmelody	@ltx/en_us_oca/he.a.m4:heAU.OsGennaionEnMartysi.greekname
ltx/en_us_oca/me.m10.d03:meVE.AposTheotokion.incipit	…
ltx/en_us_oca/me.m10.d03:meVE.AposTheotokion.melody	@ltx/en_us_oca/he.a.m4:heAU.OsGennaionEnMartysi.notmetered
ltx/en_us_oca/me.m10.d03:meVE.AposTheotokion.mode	@ltx/en_us_oca/miscellanea:misc.Mode4
ltx/en_us_oca/me.m10.d03:meVE.AposTheotokion.text	
ltx/en_us_oca/me.m10.d03:meVE.GeneralApolytikion1.melody	
ltx/en_us_oca/me.m10.d03:meVE.GeneralApolytikion1.mode	@ltx/en_us_oca/miscellanea:misc.Mode4
ltx/en_us_oca/me.m10.d03:meVE.GeneralApolytikion1.name	
ltx/en_us_oca/me.m10.d03:meVE.MM.GeneralApolytikion1.text	@ltx/en_us_oca/properties:media.key
ltx/en_us_oca/me.m10.d03:meVE.SticGlory.incipit	Come, let us the faithful…
ltx/en_us_oca/me.m10.d03:meVE.SticGlory.melody	
ltx/en_us_oca/me.m10.d03:meVE.SticGlory.mode	@ltx/en_us_oca/miscellanea:misc.Mode2
ltx/en_us_oca/me.m10.d03:meVE.SticGlory.poet	@ltx/en_us_oca/poets:po.AndreouIerosolymitou
ltx/en_us_oca/me.m10.d03:meVE.SticGlory.text	Come, let us the faithful ⁄ praise the annual celebration of the hierarch Dionysius, with Cyprian! ⁄ When Dionysius had rejected the stoic philosophers, ⁄ he became an initiate of the gnostic hidden mysteries. ⁄ [And Cyprian] enlightened by the holy virgin Justina, ⁄ fled the treachery of demons! ⁄ After destroying books of sorcery, ⁄ he became a herald of the Gospel! ⁄ Therefore, as we sinners celebrate their glory, ⁄ we give glory to the Savior: ⁄ Christ God, You crowned your victors with glory: ⁄⁄ Through their supplications, save our souls!
ltx/en_us_oca/me.m10.d03:meVE.SticStavrotheotokion.greekmelody	@ltx/en_us_oca/he.a.m2:heAU.OteEkTouXylou.greekname
ltx/en_us_oca/me.m10.d03:meVE.SticStavrotheotokion.incipit	@ltx/en_us_oca/oc.m4.d6:ocMA.AposTheotokion.incipit
ltx/en_us_oca/me.m10.d03:meVE.SticStavrotheotokion.melody	@ltx/en_us_oca/he.a.m2:heAU.OteEkTouXylou.notmetered
ltx/en_us_oca/me.m10.d03:meVE.SticStavrotheotokion.mode	@ltx/en_us_oca/miscellanea:misc.Mode2
ltx/en_us_oca/me.m10.d03:meVE.SticStavrotheotokion.text	@ltx/en_us_oca/oc.m4.d6:ocMA.AposTheotokion.text
ltx/en_us_oca/me.m10.d03:meVE.SticTheotokion.greekmelody	@ltx/en_us_oca/he.a.m2:heAU.OteEkTouXylou.greekname
ltx/en_us_oca/me.m10.d03:meVE.SticTheotokion.incipit	…
ltx/en_us_oca/me.m10.d03:meVE.SticTheotokion.melody	@ltx/en_us_oca/he.a.m2:heAU.OteEkTouXylou.notmetered
ltx/en_us_oca/me.m10.d03:meVE.SticTheotokion.mode	@ltx/en_us_oca/miscellanea:misc.Mode2
ltx/en_us_oca/me.m10.d03:meVE.SticTheotokion.text	
ltx/en_us_oca/me.m10.d03:meVE.Stichera01.greekmelody	@ltx/en_us_oca/he.a.m1:heAU.PaneffimoiMartyres.greekname
ltx/en_us_oca/me.m10.d03:meVE.Stichera01.incipit	…
ltx/en_us_oca/me.m10.d03:meVE.Stichera01.melody	@ltx/en_us_oca/he.a.m1:heAU.PaneffimoiMartyres.notmetered
ltx/en_us_oca/me.m10.d03:meVE.Stichera01.mode	@ltx/en_us_oca/miscellanea:misc.Mode1
ltx/en_us_oca/me.m10.d03:meVE.Stichera01.text	
ltx/en_us_oca/me.m10.d03:meVE.Stichera02.incipit	…
ltx/en_us_oca/me.m10.d03:meVE.Stichera02.melody	@ltx/en_us_oca/he.a.m1:heAU.PaneffimoiMartyres.notmetered
ltx/en_us_oca/me.m10.d03:meVE.Stichera02.mode	@ltx/en_us_oca/miscellanea:misc.Mode1
ltx/en_us_oca/me.m10.d03:meVE.Stichera02.text	
ltx/en_us_oca/me.m10.d03:meVE.Stichera03.incipit	…
ltx/en_us_oca/me.m10.d03:meVE.Stichera03.melody	@ltx/en_us_oca/he.a.m1:heAU.PaneffimoiMartyres.notmetered
ltx/en_us_oca/me.m10.d03:meVE.Stichera03.mode	@ltx/en_us_oca/miscellanea:misc.Mode1
ltx/en_us_oca/me.m10.d03:meVE.Stichera03.text	
