ltx/en_us_oca/me.m05.d06:meDA.commemoration.first	
ltx/en_us_oca/me.m05.d06:meDA.commemoration.first_name	
ltx/en_us_oca/me.m05.d06:meDA.commemoration.first_short	
ltx/en_us_oca/me.m05.d06:meDA.commemoration.first_title	
ltx/en_us_oca/me.m05.d06:meDA.commemoration.full	
ltx/en_us_oca/me.m05.d06:meDA.commemoration.second_name	
ltx/en_us_oca/me.m05.d06:meDA.commemoration.second_title	
ltx/en_us_oca/me.m05.d06:meDA.date	
ltx/en_us_oca/me.m05.d06:meDA.fordate	
ltx/en_us_oca/me.m05.d06:meDA.insert1	
ltx/en_us_oca/me.m05.d06:meDA.insert2	
ltx/en_us_oca/me.m05.d06:meDA.note	
ltx/en_us_oca/me.m05.d06:meDA.pdfcoverdate	
ltx/en_us_oca/me.m05.d06:meDA.pdfheaderdate	
ltx/en_us_oca/me.m05.d06:meHO.commemorations	
ltx/en_us_oca/me.m05.d06:meHO.note1	
ltx/en_us_oca/me.m05.d06:meHO.note2	
ltx/en_us_oca/me.m05.d06:meHO.number	
ltx/en_us_oca/me.m05.d06:meHO.rank	
ltx/en_us_oca/me.m05.d06:meLE.commemoration1	
ltx/en_us_oca/me.m05.d06:meLE.commemoration2	
ltx/en_us_oca/me.m05.d06:meLI.Kontakion1.greekmelody	@ltx/en_us_oca/me.m05.d06:meMA.Kontakion1.greekmelody
ltx/en_us_oca/me.m05.d06:meLI.Kontakion1.incipit	@ltx/en_us_oca/me.m05.d06:meMA.Kontakion1.incipit
ltx/en_us_oca/me.m05.d06:meLI.Kontakion1.melody	@ltx/en_us_oca/me.m05.d06:meMA.Kontakion1.melody
ltx/en_us_oca/me.m05.d06:meLI.Kontakion1.mode	@ltx/en_us_oca/me.m05.d06:meMA.Kontakion1.mode
ltx/en_us_oca/me.m05.d06:meLI.Kontakion1.text	@ltx/en_us_oca/me.m05.d06:meMA.Kontakion1.text
ltx/en_us_oca/me.m05.d06:meLI.Megalynarion.text	
ltx/en_us_oca/me.m05.d06:meLI.Megalynarion2.text	
ltx/en_us_oca/me.m05.d06:meMA.C1.acrostic.notice1	
ltx/en_us_oca/me.m05.d06:meMA.C1.acrostic.text	
ltx/en_us_oca/me.m05.d06:meMA.C1.acrostic.title	
ltx/en_us_oca/me.m05.d06:meMA.C1.poet	@ltx/en_us_oca/poets:po.AgiouKosmaOiDeIoannouMonachou
ltx/en_us_oca/me.m05.d06:meMA.C1.title	@ltx/en_us_oca/titles:ti.CanonSaintM
ltx/en_us_oca/me.m05.d06:meMA.C1.verse	@ltx/en_us_oca/prayers:pr.verse_SaintM.text
ltx/en_us_oca/me.m05.d06:meMA.Kontakion1.greekmelody	@ltx/en_us_oca/he.a.m8:heAU.OsAparchas.greekname
ltx/en_us_oca/me.m05.d06:meMA.Kontakion1.incipit	Job, the faithful and celebrated…
ltx/en_us_oca/me.m05.d06:meMA.Kontakion1.melody	@ltx/en_us_oca/he.a.m8:heAU.OsAparchas.notmetered
ltx/en_us_oca/me.m05.d06:meMA.Kontakion1.mode	@ltx/en_us_oca/miscellanea:misc.Mode8
ltx/en_us_oca/me.m05.d06:meMA.Kontakion1.text	Job, the faithful and celebrated servant of God, ⁄ you were His sincere worshiper and a deeply just man. ⁄ By your patient suffering you gave the world an inspiring lesson. ⁄⁄ Therefore we sing a hymn of praise to your memory and honor you!
ltx/en_us_oca/me.m05.d06:meMA.Ode1C11.greekmelody	@ltx/en_us_oca/he.h.m4:heHE.ChoroiIsrail.greekname
ltx/en_us_oca/me.m05.d06:meMA.Ode1C11.incipit	…
ltx/en_us_oca/me.m05.d06:meMA.Ode1C11.melody	@ltx/en_us_oca/he.h.m4:heHE.ChoroiIsrail.notmetered
ltx/en_us_oca/me.m05.d06:meMA.Ode1C11.mode	@ltx/en_us_oca/miscellanea:misc.Mode4
ltx/en_us_oca/me.m05.d06:meMA.Ode1C11.ode	@ltx/en_us_oca/miscellanea:misc.Ode1
ltx/en_us_oca/me.m05.d06:meMA.Ode1C11.text	
ltx/en_us_oca/me.m05.d06:meMA.Ode1C12.incipit	…
ltx/en_us_oca/me.m05.d06:meMA.Ode1C12.melody	@ltx/en_us_oca/he.h.m4:heHE.ChoroiIsrail.notmetered
ltx/en_us_oca/me.m05.d06:meMA.Ode1C12.mode	@ltx/en_us_oca/miscellanea:misc.Mode4
ltx/en_us_oca/me.m05.d06:meMA.Ode1C12.ode	@ltx/en_us_oca/miscellanea:misc.Ode1
ltx/en_us_oca/me.m05.d06:meMA.Ode1C12.text	
ltx/en_us_oca/me.m05.d06:meMA.Ode1C13.incipit	…
ltx/en_us_oca/me.m05.d06:meMA.Ode1C13.melody	@ltx/en_us_oca/he.h.m4:heHE.ChoroiIsrail.notmetered
ltx/en_us_oca/me.m05.d06:meMA.Ode1C13.mode	@ltx/en_us_oca/miscellanea:misc.Mode4
ltx/en_us_oca/me.m05.d06:meMA.Ode1C13.ode	@ltx/en_us_oca/miscellanea:misc.Ode1
ltx/en_us_oca/me.m05.d06:meMA.Ode1C13.text	
ltx/en_us_oca/me.m05.d06:meMA.Ode1C1T.incipit	…
ltx/en_us_oca/me.m05.d06:meMA.Ode1C1T.melody	@ltx/en_us_oca/he.h.m4:heHE.ChoroiIsrail.notmetered
ltx/en_us_oca/me.m05.d06:meMA.Ode1C1T.mode	@ltx/en_us_oca/miscellanea:misc.Mode4
ltx/en_us_oca/me.m05.d06:meMA.Ode1C1T.ode	@ltx/en_us_oca/miscellanea:misc.Ode1
ltx/en_us_oca/me.m05.d06:meMA.Ode1C1T.text	
ltx/en_us_oca/me.m05.d06:meMA.Ode3C11.greekmelody	@ltx/en_us_oca/he.h.m4:heHE.ToxonDynatonIsthenise.greekname
ltx/en_us_oca/me.m05.d06:meMA.Ode3C11.incipit	…
ltx/en_us_oca/me.m05.d06:meMA.Ode3C11.melody	@ltx/en_us_oca/he.h.m4:heHE.ToxonDynatonIsthenise.notmetered
ltx/en_us_oca/me.m05.d06:meMA.Ode3C11.mode	@ltx/en_us_oca/miscellanea:misc.Mode4
ltx/en_us_oca/me.m05.d06:meMA.Ode3C11.ode	@ltx/en_us_oca/miscellanea:misc.Ode3
ltx/en_us_oca/me.m05.d06:meMA.Ode3C11.text	
ltx/en_us_oca/me.m05.d06:meMA.Ode3C12.incipit	…
ltx/en_us_oca/me.m05.d06:meMA.Ode3C12.melody	@ltx/en_us_oca/he.h.m4:heHE.ToxonDynatonIsthenise.notmetered
ltx/en_us_oca/me.m05.d06:meMA.Ode3C12.mode	@ltx/en_us_oca/miscellanea:misc.Mode4
ltx/en_us_oca/me.m05.d06:meMA.Ode3C12.ode	@ltx/en_us_oca/miscellanea:misc.Ode3
ltx/en_us_oca/me.m05.d06:meMA.Ode3C12.text	
ltx/en_us_oca/me.m05.d06:meMA.Ode3C13.incipit	…
ltx/en_us_oca/me.m05.d06:meMA.Ode3C13.melody	@ltx/en_us_oca/he.h.m4:heHE.ToxonDynatonIsthenise.notmetered
ltx/en_us_oca/me.m05.d06:meMA.Ode3C13.mode	@ltx/en_us_oca/miscellanea:misc.Mode4
ltx/en_us_oca/me.m05.d06:meMA.Ode3C13.ode	@ltx/en_us_oca/miscellanea:misc.Ode3
ltx/en_us_oca/me.m05.d06:meMA.Ode3C13.text	
ltx/en_us_oca/me.m05.d06:meMA.Ode3C1T.incipit	…
ltx/en_us_oca/me.m05.d06:meMA.Ode3C1T.melody	@ltx/en_us_oca/he.h.m4:heHE.ToxonDynatonIsthenise.notmetered
ltx/en_us_oca/me.m05.d06:meMA.Ode3C1T.mode	@ltx/en_us_oca/miscellanea:misc.Mode4
ltx/en_us_oca/me.m05.d06:meMA.Ode3C1T.ode	@ltx/en_us_oca/miscellanea:misc.Ode3
ltx/en_us_oca/me.m05.d06:meMA.Ode3C1T.text	
ltx/en_us_oca/me.m05.d06:meMA.Ode3H.greekmelody	@ltx/en_us_oca/he.h.m4:heHE.ToxonDynatonIsthenise.greekname
ltx/en_us_oca/me.m05.d06:meMA.Ode3H.incipit	@ltx/en_us_oca/he.h.m4:heHE.ToxonDynatonIsthenise.incipit
ltx/en_us_oca/me.m05.d06:meMA.Ode3H.melody	@ltx/en_us_oca/he.h.m4:heHE.ToxonDynatonIsthenise.melody
ltx/en_us_oca/me.m05.d06:meMA.Ode3H.mode	@ltx/en_us_oca/miscellanea:misc.Mode4
ltx/en_us_oca/me.m05.d06:meMA.Ode3H.ode	@ltx/en_us_oca/miscellanea:misc.Ode3
ltx/en_us_oca/me.m05.d06:meMA.Ode3H.text	@ltx/en_us_oca/he.h.m4:heHE.ToxonDynatonIsthenise.text
ltx/en_us_oca/me.m05.d06:meMA.Ode3Kathisma1.greekmelody	@ltx/en_us_oca/he.a.m3:heAU.TinOraiotita.greekname
ltx/en_us_oca/me.m05.d06:meMA.Ode3Kathisma1.incipit	…
ltx/en_us_oca/me.m05.d06:meMA.Ode3Kathisma1.melody	@ltx/en_us_oca/he.a.m3:heAU.TinOraiotita.notmetered
ltx/en_us_oca/me.m05.d06:meMA.Ode3Kathisma1.mode	@ltx/en_us_oca/miscellanea:misc.Mode3
ltx/en_us_oca/me.m05.d06:meMA.Ode3Kathisma1.text	
ltx/en_us_oca/me.m05.d06:meMA.Ode4C11.greekmelody	@ltx/en_us_oca/he.h.m4:heHE.EisakikoaTinEndoxon.greekname
ltx/en_us_oca/me.m05.d06:meMA.Ode4C11.incipit	…
ltx/en_us_oca/me.m05.d06:meMA.Ode4C11.melody	@ltx/en_us_oca/he.h.m4:heHE.EisakikoaTinEndoxon.notmetered
ltx/en_us_oca/me.m05.d06:meMA.Ode4C11.mode	@ltx/en_us_oca/miscellanea:misc.Mode4
ltx/en_us_oca/me.m05.d06:meMA.Ode4C11.ode	@ltx/en_us_oca/miscellanea:misc.Ode4
ltx/en_us_oca/me.m05.d06:meMA.Ode4C11.text	
ltx/en_us_oca/me.m05.d06:meMA.Ode4C12.incipit	…
ltx/en_us_oca/me.m05.d06:meMA.Ode4C12.melody	@ltx/en_us_oca/he.h.m4:heHE.EisakikoaTinEndoxon.notmetered
ltx/en_us_oca/me.m05.d06:meMA.Ode4C12.mode	@ltx/en_us_oca/miscellanea:misc.Mode4
ltx/en_us_oca/me.m05.d06:meMA.Ode4C12.ode	@ltx/en_us_oca/miscellanea:misc.Ode4
ltx/en_us_oca/me.m05.d06:meMA.Ode4C12.text	
ltx/en_us_oca/me.m05.d06:meMA.Ode4C13.incipit	…
ltx/en_us_oca/me.m05.d06:meMA.Ode4C13.melody	@ltx/en_us_oca/he.h.m4:heHE.EisakikoaTinEndoxon.notmetered
ltx/en_us_oca/me.m05.d06:meMA.Ode4C13.mode	@ltx/en_us_oca/miscellanea:misc.Mode4
ltx/en_us_oca/me.m05.d06:meMA.Ode4C13.ode	@ltx/en_us_oca/miscellanea:misc.Ode4
ltx/en_us_oca/me.m05.d06:meMA.Ode4C13.text	
ltx/en_us_oca/me.m05.d06:meMA.Ode4C14.incipit	…
ltx/en_us_oca/me.m05.d06:meMA.Ode4C14.melody	@ltx/en_us_oca/he.h.m4:heHE.EisakikoaTinEndoxon.notmetered
ltx/en_us_oca/me.m05.d06:meMA.Ode4C14.mode	@ltx/en_us_oca/miscellanea:misc.Mode4
ltx/en_us_oca/me.m05.d06:meMA.Ode4C14.ode	@ltx/en_us_oca/miscellanea:misc.Ode4
ltx/en_us_oca/me.m05.d06:meMA.Ode4C14.text	
ltx/en_us_oca/me.m05.d06:meMA.Ode4C1T.incipit	…
ltx/en_us_oca/me.m05.d06:meMA.Ode4C1T.melody	@ltx/en_us_oca/he.h.m4:heHE.EisakikoaTinEndoxon.notmetered
ltx/en_us_oca/me.m05.d06:meMA.Ode4C1T.mode	@ltx/en_us_oca/miscellanea:misc.Mode4
ltx/en_us_oca/me.m05.d06:meMA.Ode4C1T.ode	@ltx/en_us_oca/miscellanea:misc.Ode4
ltx/en_us_oca/me.m05.d06:meMA.Ode4C1T.text	
ltx/en_us_oca/me.m05.d06:meMA.Ode5C11.greekmelody	@ltx/en_us_oca/he.h.m4:heHE.OAnateilasToFos.greekname
ltx/en_us_oca/me.m05.d06:meMA.Ode5C11.incipit	…
ltx/en_us_oca/me.m05.d06:meMA.Ode5C11.melody	@ltx/en_us_oca/he.h.m4:heHE.OAnateilasToFos.notmetered
ltx/en_us_oca/me.m05.d06:meMA.Ode5C11.mode	@ltx/en_us_oca/miscellanea:misc.Mode4
ltx/en_us_oca/me.m05.d06:meMA.Ode5C11.ode	@ltx/en_us_oca/miscellanea:misc.Ode5
ltx/en_us_oca/me.m05.d06:meMA.Ode5C11.text	
ltx/en_us_oca/me.m05.d06:meMA.Ode5C12.incipit	…
ltx/en_us_oca/me.m05.d06:meMA.Ode5C12.melody	@ltx/en_us_oca/he.h.m4:heHE.OAnateilasToFos.notmetered
ltx/en_us_oca/me.m05.d06:meMA.Ode5C12.mode	@ltx/en_us_oca/miscellanea:misc.Mode4
ltx/en_us_oca/me.m05.d06:meMA.Ode5C12.ode	@ltx/en_us_oca/miscellanea:misc.Ode5
ltx/en_us_oca/me.m05.d06:meMA.Ode5C12.text	
ltx/en_us_oca/me.m05.d06:meMA.Ode5C13.incipit	…
ltx/en_us_oca/me.m05.d06:meMA.Ode5C13.melody	@ltx/en_us_oca/he.h.m4:heHE.OAnateilasToFos.notmetered
ltx/en_us_oca/me.m05.d06:meMA.Ode5C13.mode	@ltx/en_us_oca/miscellanea:misc.Mode4
ltx/en_us_oca/me.m05.d06:meMA.Ode5C13.ode	@ltx/en_us_oca/miscellanea:misc.Ode5
ltx/en_us_oca/me.m05.d06:meMA.Ode5C13.text	
ltx/en_us_oca/me.m05.d06:meMA.Ode5C1T.incipit	…
ltx/en_us_oca/me.m05.d06:meMA.Ode5C1T.melody	@ltx/en_us_oca/he.h.m4:heHE.OAnateilasToFos.notmetered
ltx/en_us_oca/me.m05.d06:meMA.Ode5C1T.mode	@ltx/en_us_oca/miscellanea:misc.Mode4
ltx/en_us_oca/me.m05.d06:meMA.Ode5C1T.ode	@ltx/en_us_oca/miscellanea:misc.Ode5
ltx/en_us_oca/me.m05.d06:meMA.Ode5C1T.text	
ltx/en_us_oca/me.m05.d06:meMA.Ode6C11.greekmelody	@ltx/en_us_oca/he.h.m4:heHE.EvoiseProtypon.greekname
ltx/en_us_oca/me.m05.d06:meMA.Ode6C11.incipit	…
ltx/en_us_oca/me.m05.d06:meMA.Ode6C11.melody	@ltx/en_us_oca/he.h.m4:heHE.EvoiseProtypon.notmetered
ltx/en_us_oca/me.m05.d06:meMA.Ode6C11.mode	@ltx/en_us_oca/miscellanea:misc.Mode4
ltx/en_us_oca/me.m05.d06:meMA.Ode6C11.ode	@ltx/en_us_oca/miscellanea:misc.Ode6
ltx/en_us_oca/me.m05.d06:meMA.Ode6C11.text	
ltx/en_us_oca/me.m05.d06:meMA.Ode6C12.incipit	…
ltx/en_us_oca/me.m05.d06:meMA.Ode6C12.melody	@ltx/en_us_oca/he.h.m4:heHE.EvoiseProtypon.notmetered
ltx/en_us_oca/me.m05.d06:meMA.Ode6C12.mode	@ltx/en_us_oca/miscellanea:misc.Mode4
ltx/en_us_oca/me.m05.d06:meMA.Ode6C12.ode	@ltx/en_us_oca/miscellanea:misc.Ode6
ltx/en_us_oca/me.m05.d06:meMA.Ode6C12.text	
ltx/en_us_oca/me.m05.d06:meMA.Ode6C13.incipit	…
ltx/en_us_oca/me.m05.d06:meMA.Ode6C13.melody	@ltx/en_us_oca/he.h.m4:heHE.EvoiseProtypon.notmetered
ltx/en_us_oca/me.m05.d06:meMA.Ode6C13.mode	@ltx/en_us_oca/miscellanea:misc.Mode4
ltx/en_us_oca/me.m05.d06:meMA.Ode6C13.ode	@ltx/en_us_oca/miscellanea:misc.Ode6
ltx/en_us_oca/me.m05.d06:meMA.Ode6C13.text	
ltx/en_us_oca/me.m05.d06:meMA.Ode6C1T.incipit	…
ltx/en_us_oca/me.m05.d06:meMA.Ode6C1T.melody	@ltx/en_us_oca/he.h.m4:heHE.EvoiseProtypon.notmetered
ltx/en_us_oca/me.m05.d06:meMA.Ode6C1T.mode	@ltx/en_us_oca/miscellanea:misc.Mode4
ltx/en_us_oca/me.m05.d06:meMA.Ode6C1T.ode	@ltx/en_us_oca/miscellanea:misc.Ode6
ltx/en_us_oca/me.m05.d06:meMA.Ode6C1T.text	
ltx/en_us_oca/me.m05.d06:meMA.Ode6H.greekmelody	@ltx/en_us_oca/he.h.m4:heHE.EvoiseProtypon.greekname
ltx/en_us_oca/me.m05.d06:meMA.Ode6H.incipit	@ltx/en_us_oca/he.h.m4:heHE.EvoiseProtypon.incipit
ltx/en_us_oca/me.m05.d06:meMA.Ode6H.melody	@ltx/en_us_oca/he.h.m4:heHE.EvoiseProtypon.melody
ltx/en_us_oca/me.m05.d06:meMA.Ode6H.mode	@ltx/en_us_oca/miscellanea:misc.Mode4
ltx/en_us_oca/me.m05.d06:meMA.Ode6H.ode	@ltx/en_us_oca/miscellanea:misc.Ode6
ltx/en_us_oca/me.m05.d06:meMA.Ode6H.text	@ltx/en_us_oca/he.h.m4:heHE.EvoiseProtypon.text
ltx/en_us_oca/me.m05.d06:meMA.Ode7C11.greekmelody	@ltx/en_us_oca/he.h.m4:heHE.ODiasosasEnPyri.greekname
ltx/en_us_oca/me.m05.d06:meMA.Ode7C11.incipit	…
ltx/en_us_oca/me.m05.d06:meMA.Ode7C11.melody	@ltx/en_us_oca/he.h.m4:heHE.ODiasosasEnPyri.notmetered
ltx/en_us_oca/me.m05.d06:meMA.Ode7C11.mode	@ltx/en_us_oca/miscellanea:misc.Mode4
ltx/en_us_oca/me.m05.d06:meMA.Ode7C11.ode	@ltx/en_us_oca/miscellanea:misc.Ode7
ltx/en_us_oca/me.m05.d06:meMA.Ode7C11.text	
ltx/en_us_oca/me.m05.d06:meMA.Ode7C12.incipit	…
ltx/en_us_oca/me.m05.d06:meMA.Ode7C12.melody	@ltx/en_us_oca/he.h.m4:heHE.ODiasosasEnPyri.notmetered
ltx/en_us_oca/me.m05.d06:meMA.Ode7C12.mode	@ltx/en_us_oca/miscellanea:misc.Mode4
ltx/en_us_oca/me.m05.d06:meMA.Ode7C12.ode	@ltx/en_us_oca/miscellanea:misc.Ode7
ltx/en_us_oca/me.m05.d06:meMA.Ode7C12.text	
ltx/en_us_oca/me.m05.d06:meMA.Ode7C13.incipit	…
ltx/en_us_oca/me.m05.d06:meMA.Ode7C13.melody	@ltx/en_us_oca/he.h.m4:heHE.ODiasosasEnPyri.notmetered
ltx/en_us_oca/me.m05.d06:meMA.Ode7C13.mode	@ltx/en_us_oca/miscellanea:misc.Mode4
ltx/en_us_oca/me.m05.d06:meMA.Ode7C13.ode	@ltx/en_us_oca/miscellanea:misc.Ode7
ltx/en_us_oca/me.m05.d06:meMA.Ode7C13.text	
ltx/en_us_oca/me.m05.d06:meMA.Ode7C1T.incipit	…
ltx/en_us_oca/me.m05.d06:meMA.Ode7C1T.melody	@ltx/en_us_oca/he.h.m4:heHE.ODiasosasEnPyri.notmetered
ltx/en_us_oca/me.m05.d06:meMA.Ode7C1T.mode	@ltx/en_us_oca/miscellanea:misc.Mode4
ltx/en_us_oca/me.m05.d06:meMA.Ode7C1T.ode	@ltx/en_us_oca/miscellanea:misc.Ode7
ltx/en_us_oca/me.m05.d06:meMA.Ode7C1T.text	
ltx/en_us_oca/me.m05.d06:meMA.Ode7C1Tr.incipit	…
ltx/en_us_oca/me.m05.d06:meMA.Ode7C1Tr.melody	@ltx/en_us_oca/he.h.m4:heHE.ODiasosasEnPyri.notmetered
ltx/en_us_oca/me.m05.d06:meMA.Ode7C1Tr.mode	@ltx/en_us_oca/miscellanea:misc.Mode4
ltx/en_us_oca/me.m05.d06:meMA.Ode7C1Tr.ode	@ltx/en_us_oca/miscellanea:misc.Ode7
ltx/en_us_oca/me.m05.d06:meMA.Ode7C1Tr.text	
ltx/en_us_oca/me.m05.d06:meMA.Ode8C11.greekmelody	@ltx/en_us_oca/he.h.m4:heHE.TonEnMorfiAngelou.greekname
ltx/en_us_oca/me.m05.d06:meMA.Ode8C11.incipit	…
ltx/en_us_oca/me.m05.d06:meMA.Ode8C11.melody	@ltx/en_us_oca/he.h.m4:heHE.TonEnMorfiAngelou.notmetered
ltx/en_us_oca/me.m05.d06:meMA.Ode8C11.mode	@ltx/en_us_oca/miscellanea:misc.Mode4
ltx/en_us_oca/me.m05.d06:meMA.Ode8C11.ode	@ltx/en_us_oca/miscellanea:misc.Ode8
ltx/en_us_oca/me.m05.d06:meMA.Ode8C11.text	
ltx/en_us_oca/me.m05.d06:meMA.Ode8C12.incipit	…
ltx/en_us_oca/me.m05.d06:meMA.Ode8C12.melody	@ltx/en_us_oca/he.h.m4:heHE.TonEnMorfiAngelou.notmetered
ltx/en_us_oca/me.m05.d06:meMA.Ode8C12.mode	@ltx/en_us_oca/miscellanea:misc.Mode4
ltx/en_us_oca/me.m05.d06:meMA.Ode8C12.ode	@ltx/en_us_oca/miscellanea:misc.Ode8
ltx/en_us_oca/me.m05.d06:meMA.Ode8C12.text	
ltx/en_us_oca/me.m05.d06:meMA.Ode8C13.incipit	…
ltx/en_us_oca/me.m05.d06:meMA.Ode8C13.melody	@ltx/en_us_oca/he.h.m4:heHE.TonEnMorfiAngelou.notmetered
ltx/en_us_oca/me.m05.d06:meMA.Ode8C13.mode	@ltx/en_us_oca/miscellanea:misc.Mode4
ltx/en_us_oca/me.m05.d06:meMA.Ode8C13.ode	@ltx/en_us_oca/miscellanea:misc.Ode8
ltx/en_us_oca/me.m05.d06:meMA.Ode8C13.text	
ltx/en_us_oca/me.m05.d06:meMA.Ode8C14.incipit	…
ltx/en_us_oca/me.m05.d06:meMA.Ode8C14.melody	@ltx/en_us_oca/he.h.m4:heHE.TonEnMorfiAngelou.notmetered
ltx/en_us_oca/me.m05.d06:meMA.Ode8C14.mode	@ltx/en_us_oca/miscellanea:misc.Mode4
ltx/en_us_oca/me.m05.d06:meMA.Ode8C14.ode	@ltx/en_us_oca/miscellanea:misc.Ode8
ltx/en_us_oca/me.m05.d06:meMA.Ode8C14.text	
ltx/en_us_oca/me.m05.d06:meMA.Ode8C1T.incipit	…
ltx/en_us_oca/me.m05.d06:meMA.Ode8C1T.melody	@ltx/en_us_oca/he.h.m4:heHE.TonEnMorfiAngelou.notmetered
ltx/en_us_oca/me.m05.d06:meMA.Ode8C1T.mode	@ltx/en_us_oca/miscellanea:misc.Mode4
ltx/en_us_oca/me.m05.d06:meMA.Ode8C1T.ode	@ltx/en_us_oca/miscellanea:misc.Ode8
ltx/en_us_oca/me.m05.d06:meMA.Ode8C1T.text	
ltx/en_us_oca/me.m05.d06:meMA.Ode8H.greekmelody	@ltx/en_us_oca/he.h.m4:heHE.TonEnMorfiAngelou.greekname
ltx/en_us_oca/me.m05.d06:meMA.Ode8H.incipit	@ltx/en_us_oca/he.h.m4:heHE.TonEnMorfiAngelou.incipit
ltx/en_us_oca/me.m05.d06:meMA.Ode8H.melody	@ltx/en_us_oca/he.h.m4:heHE.TonEnMorfiAngelou.melody
ltx/en_us_oca/me.m05.d06:meMA.Ode8H.mode	@ltx/en_us_oca/miscellanea:misc.Mode4
ltx/en_us_oca/me.m05.d06:meMA.Ode8H.ode	@ltx/en_us_oca/miscellanea:misc.Ode8
ltx/en_us_oca/me.m05.d06:meMA.Ode8H.text	@ltx/en_us_oca/he.h.m4:heHE.TonEnMorfiAngelou.text
ltx/en_us_oca/me.m05.d06:meMA.Ode9C11.greekmelody	@ltx/en_us_oca/he.h.m4:heHE.EvaMenToTisParakois.greekname
ltx/en_us_oca/me.m05.d06:meMA.Ode9C11.incipit	…
ltx/en_us_oca/me.m05.d06:meMA.Ode9C11.melody	@ltx/en_us_oca/he.h.m4:heHE.EvaMenToTisParakois.notmetered
ltx/en_us_oca/me.m05.d06:meMA.Ode9C11.mode	@ltx/en_us_oca/miscellanea:misc.Mode4
ltx/en_us_oca/me.m05.d06:meMA.Ode9C11.ode	@ltx/en_us_oca/miscellanea:misc.Ode9
ltx/en_us_oca/me.m05.d06:meMA.Ode9C11.text	
ltx/en_us_oca/me.m05.d06:meMA.Ode9C12.incipit	…
ltx/en_us_oca/me.m05.d06:meMA.Ode9C12.melody	@ltx/en_us_oca/he.h.m4:heHE.EvaMenToTisParakois.notmetered
ltx/en_us_oca/me.m05.d06:meMA.Ode9C12.mode	@ltx/en_us_oca/miscellanea:misc.Mode4
ltx/en_us_oca/me.m05.d06:meMA.Ode9C12.ode	@ltx/en_us_oca/miscellanea:misc.Ode9
ltx/en_us_oca/me.m05.d06:meMA.Ode9C12.text	
ltx/en_us_oca/me.m05.d06:meMA.Ode9C13.incipit	…
ltx/en_us_oca/me.m05.d06:meMA.Ode9C13.melody	@ltx/en_us_oca/he.h.m4:heHE.EvaMenToTisParakois.notmetered
ltx/en_us_oca/me.m05.d06:meMA.Ode9C13.mode	@ltx/en_us_oca/miscellanea:misc.Mode4
ltx/en_us_oca/me.m05.d06:meMA.Ode9C13.ode	@ltx/en_us_oca/miscellanea:misc.Ode9
ltx/en_us_oca/me.m05.d06:meMA.Ode9C13.text	
ltx/en_us_oca/me.m05.d06:meMA.Ode9C1T.incipit	…
ltx/en_us_oca/me.m05.d06:meMA.Ode9C1T.melody	@ltx/en_us_oca/he.h.m4:heHE.EvaMenToTisParakois.notmetered
ltx/en_us_oca/me.m05.d06:meMA.Ode9C1T.mode	@ltx/en_us_oca/miscellanea:misc.Mode4
ltx/en_us_oca/me.m05.d06:meMA.Ode9C1T.ode	@ltx/en_us_oca/miscellanea:misc.Ode9
ltx/en_us_oca/me.m05.d06:meMA.Ode9C1T.text	
ltx/en_us_oca/me.m05.d06:meMA.Ode9H.greekmelody	@ltx/en_us_oca/he.h.m4:heHE.EvaMenToTisParakois.greekname
ltx/en_us_oca/me.m05.d06:meMA.Ode9H.incipit	@ltx/en_us_oca/he.h.m4:heHE.EvaMenToTisParakois.incipit
ltx/en_us_oca/me.m05.d06:meMA.Ode9H.melody	@ltx/en_us_oca/he.h.m4:heHE.EvaMenToTisParakois.melody
ltx/en_us_oca/me.m05.d06:meMA.Ode9H.mode	@ltx/en_us_oca/miscellanea:misc.Mode4
ltx/en_us_oca/me.m05.d06:meMA.Ode9H.ode	@ltx/en_us_oca/miscellanea:misc.Ode9
ltx/en_us_oca/me.m05.d06:meMA.Ode9H.text	@ltx/en_us_oca/he.h.m4:heHE.EvaMenToTisParakois.text
ltx/en_us_oca/me.m05.d06:meMA.Oikos1.text	
ltx/en_us_oca/me.m05.d06:meVE.Apolytikion1.incipit	…
ltx/en_us_oca/me.m05.d06:meVE.Apolytikion1.melody	@ltx/en_us_oca/he.ga:heGA.TouProfitouSou.name
ltx/en_us_oca/me.m05.d06:meVE.Apolytikion1.mode	@ltx/en_us_oca/miscellanea:misc.Mode2
ltx/en_us_oca/me.m05.d06:meVE.Apolytikion1.text	
ltx/en_us_oca/me.m05.d06:meVE.Apolytikion2ger.greekmelody	@ltx/en_us_oca/he.a.m3:heAU.TheiasPisteos.greekname
ltx/en_us_oca/me.m05.d06:meVE.Apolytikion2ger.incipit	…
ltx/en_us_oca/me.m05.d06:meVE.Apolytikion2ger.melody	@ltx/en_us_oca/he.a.m3:heAU.TheiasPisteos.notmetered
ltx/en_us_oca/me.m05.d06:meVE.Apolytikion2ger.mode	@ltx/en_us_oca/miscellanea:misc.Mode3
ltx/en_us_oca/me.m05.d06:meVE.Apolytikion2ger.poet	@ltx/en_us_oca/poets:po.Gerasimou
ltx/en_us_oca/me.m05.d06:meVE.Apolytikion2ger.text	
ltx/en_us_oca/me.m05.d06:meVE.Apolytikion3.greekmelody	@ltx/en_us_oca/he.a.m4:heAU.KateplagiIosif.greekname
ltx/en_us_oca/me.m05.d06:meVE.Apolytikion3.incipit	…
ltx/en_us_oca/me.m05.d06:meVE.Apolytikion3.melody	@ltx/en_us_oca/he.a.m4:heAU.KateplagiIosif.notmetered
ltx/en_us_oca/me.m05.d06:meVE.Apolytikion3.mode	@ltx/en_us_oca/miscellanea:misc.Mode4
ltx/en_us_oca/me.m05.d06:meVE.Apolytikion3.text	
ltx/en_us_oca/me.m05.d06:meVE.SticGlory.incipit	…
ltx/en_us_oca/me.m05.d06:meVE.SticGlory.melody	
ltx/en_us_oca/me.m05.d06:meVE.SticGlory.mode	@ltx/en_us_oca/miscellanea:misc.Mode6
ltx/en_us_oca/me.m05.d06:meVE.SticGlory.text	
ltx/en_us_oca/me.m05.d06:meVE.Stichera01.greekmelody	@ltx/en_us_oca/he.a.m4:heAU.EdokasSimeiosin.greekname
ltx/en_us_oca/me.m05.d06:meVE.Stichera01.incipit	…
ltx/en_us_oca/me.m05.d06:meVE.Stichera01.melody	@ltx/en_us_oca/he.a.m4:heAU.EdokasSimeiosin.notmetered
ltx/en_us_oca/me.m05.d06:meVE.Stichera01.mode	@ltx/en_us_oca/miscellanea:misc.Mode4
ltx/en_us_oca/me.m05.d06:meVE.Stichera01.text	
ltx/en_us_oca/me.m05.d06:meVE.Stichera02.incipit	Righteous Job, you were known…
ltx/en_us_oca/me.m05.d06:meVE.Stichera02.melody	@ltx/en_us_oca/he.a.m4:heAU.EdokasSimeiosin.notmetered
ltx/en_us_oca/me.m05.d06:meVE.Stichera02.mode	@ltx/en_us_oca/miscellanea:misc.Mode4
ltx/en_us_oca/me.m05.d06:meVE.Stichera02.text	Righteous Job, you were known as righteous and guileless, ⁄ truthful, blameless and faithful. ⁄ You abstained from all evil ⁄ and were truly adorned with the virtues and resplendent in righteousness. ⁄⁄ Therefore we rejoice today as we celebrate your holy and honored feast!
ltx/en_us_oca/me.m05.d06:meVE.Stichera03.incipit	You were clothed in the…
ltx/en_us_oca/me.m05.d06:meVE.Stichera03.melody	@ltx/en_us_oca/he.a.m4:heAU.EdokasSimeiosin.notmetered
ltx/en_us_oca/me.m05.d06:meVE.Stichera03.mode	@ltx/en_us_oca/miscellanea:misc.Mode4
ltx/en_us_oca/me.m05.d06:meVE.Stichera03.text	You were clothed in the wealth of faith as in a costly purple robe. ⁄ You were adorned with mercy and righteousness as with a godly crown. ⁄ You ruled over the tyranny of the passions, blameless Job. ⁄ Therefore you have passed over to the spiritual kingdom ⁄⁄ where you stand before the eternal King, all-glorious one.
