ltx/en_us_oca/me.m10.d16:meDA.commemoration.first	
ltx/en_us_oca/me.m10.d16:meDA.commemoration.first_name	
ltx/en_us_oca/me.m10.d16:meDA.commemoration.first_short	
ltx/en_us_oca/me.m10.d16:meDA.commemoration.first_title	
ltx/en_us_oca/me.m10.d16:meDA.commemoration.full	
ltx/en_us_oca/me.m10.d16:meDA.commemoration.second_name	
ltx/en_us_oca/me.m10.d16:meDA.commemoration.second_title	
ltx/en_us_oca/me.m10.d16:meDA.date	
ltx/en_us_oca/me.m10.d16:meDA.fordate	
ltx/en_us_oca/me.m10.d16:meDA.insert1	
ltx/en_us_oca/me.m10.d16:meDA.insert2	
ltx/en_us_oca/me.m10.d16:meDA.note	
ltx/en_us_oca/me.m10.d16:meDA.pdfcoverdate	
ltx/en_us_oca/me.m10.d16:meDA.pdfheaderdate	
ltx/en_us_oca/me.m10.d16:meHO.commemorations	
ltx/en_us_oca/me.m10.d16:meHO.note1	
ltx/en_us_oca/me.m10.d16:meHO.note2	
ltx/en_us_oca/me.m10.d16:meHO.number	
ltx/en_us_oca/me.m10.d16:meHO.rank	
ltx/en_us_oca/me.m10.d16:meLE.commemoration1	
ltx/en_us_oca/me.m10.d16:meLE.commemoration2	
ltx/en_us_oca/me.m10.d16:meLI.Kontakion1.greekmelody	@ltx/en_us_oca/me.m10.d16:meMA.Kontakion1.greekmelody
ltx/en_us_oca/me.m10.d16:meLI.Kontakion1.incipit	@ltx/en_us_oca/me.m10.d16:meMA.Kontakion1.incipit
ltx/en_us_oca/me.m10.d16:meLI.Kontakion1.melody	@ltx/en_us_oca/me.m10.d16:meMA.Kontakion1.melody
ltx/en_us_oca/me.m10.d16:meLI.Kontakion1.mode	@ltx/en_us_oca/me.m10.d16:meMA.Kontakion1.mode
ltx/en_us_oca/me.m10.d16:meLI.Kontakion1.text	@ltx/en_us_oca/me.m10.d16:meMA.Kontakion1.text
ltx/en_us_oca/me.m10.d16:meLI.Megalynarion.text	
ltx/en_us_oca/me.m10.d16:meMA.C1.acrostic.notice1	
ltx/en_us_oca/me.m10.d16:meMA.C1.acrostic.text	
ltx/en_us_oca/me.m10.d16:meMA.C1.acrostic.title	
ltx/en_us_oca/me.m10.d16:meMA.C1.title	@ltx/en_us_oca/titles:ti.CanonSaintM
ltx/en_us_oca/me.m10.d16:meMA.C1.verse	@ltx/en_us_oca/prayers:pr.verse_SaintM.text
ltx/en_us_oca/me.m10.d16:meMA.ExapTheotokion.incipit	…
ltx/en_us_oca/me.m10.d16:meMA.ExapTheotokion.melody	@ltx/en_us_oca/he.a.m2:heAU.ToisMathitaisSynelthomen.notmetered
ltx/en_us_oca/me.m10.d16:meMA.ExapTheotokion.mode	@ltx/en_us_oca/miscellanea:misc.Mode2
ltx/en_us_oca/me.m10.d16:meMA.ExapTheotokion.text	
ltx/en_us_oca/me.m10.d16:meMA.Exaposteilarion1.greekmelody	@ltx/en_us_oca/he.a.m2:heAU.ToisMathitaisSynelthomen.greekname
ltx/en_us_oca/me.m10.d16:meMA.Exaposteilarion1.incipit	…
ltx/en_us_oca/me.m10.d16:meMA.Exaposteilarion1.melody	@ltx/en_us_oca/he.a.m2:heAU.ToisMathitaisSynelthomen.notmetered
ltx/en_us_oca/me.m10.d16:meMA.Exaposteilarion1.mode	@ltx/en_us_oca/miscellanea:misc.Mode2
ltx/en_us_oca/me.m10.d16:meMA.Exaposteilarion1.text	
ltx/en_us_oca/me.m10.d16:meMA.Kontakion1.greekmelody	@ltx/en_us_oca/he.a.m4:heAU.EpefanisSimeron.greekname
ltx/en_us_oca/me.m10.d16:meMA.Kontakion1.incipit	The Church rejoices in gladness…
ltx/en_us_oca/me.m10.d16:meMA.Kontakion1.melody	@ltx/en_us_oca/he.a.m4:heAU.EpefanisSimeron.notmetered
ltx/en_us_oca/me.m10.d16:meMA.Kontakion1.mode	@ltx/en_us_oca/miscellanea:misc.Mode4
ltx/en_us_oca/me.m10.d16:meMA.Kontakion1.text	The Church rejoices in gladness ⁄ on the day of the commemoration of the ever-memorable athlete Longinus! ⁄⁄ She cries out: You are my strength and support, O Christ!
ltx/en_us_oca/me.m10.d16:meMA.Ode1C11.greekmelody	@ltx/en_us_oca/he.h.m4:heHE.ThalassisToErythraion.greekname
ltx/en_us_oca/me.m10.d16:meMA.Ode1C11.incipit	…
ltx/en_us_oca/me.m10.d16:meMA.Ode1C11.melody	@ltx/en_us_oca/he.h.m4:heHE.ThalassisToErythraion.notmetered
ltx/en_us_oca/me.m10.d16:meMA.Ode1C11.mode	@ltx/en_us_oca/miscellanea:misc.Mode4
ltx/en_us_oca/me.m10.d16:meMA.Ode1C11.ode	@ltx/en_us_oca/miscellanea:misc.Ode1
ltx/en_us_oca/me.m10.d16:meMA.Ode1C11.text	
ltx/en_us_oca/me.m10.d16:meMA.Ode1C12.incipit	…
ltx/en_us_oca/me.m10.d16:meMA.Ode1C12.melody	@ltx/en_us_oca/he.h.m4:heHE.ThalassisToErythraion.notmetered
ltx/en_us_oca/me.m10.d16:meMA.Ode1C12.mode	@ltx/en_us_oca/miscellanea:misc.Mode4
ltx/en_us_oca/me.m10.d16:meMA.Ode1C12.ode	@ltx/en_us_oca/miscellanea:misc.Ode1
ltx/en_us_oca/me.m10.d16:meMA.Ode1C12.text	
ltx/en_us_oca/me.m10.d16:meMA.Ode1C13.incipit	…
ltx/en_us_oca/me.m10.d16:meMA.Ode1C13.melody	@ltx/en_us_oca/he.h.m4:heHE.ThalassisToErythraion.notmetered
ltx/en_us_oca/me.m10.d16:meMA.Ode1C13.mode	@ltx/en_us_oca/miscellanea:misc.Mode4
ltx/en_us_oca/me.m10.d16:meMA.Ode1C13.ode	@ltx/en_us_oca/miscellanea:misc.Ode1
ltx/en_us_oca/me.m10.d16:meMA.Ode1C13.text	
ltx/en_us_oca/me.m10.d16:meMA.Ode1C1T.incipit	…
ltx/en_us_oca/me.m10.d16:meMA.Ode1C1T.melody	@ltx/en_us_oca/he.h.m4:heHE.ThalassisToErythraion.notmetered
ltx/en_us_oca/me.m10.d16:meMA.Ode1C1T.mode	@ltx/en_us_oca/miscellanea:misc.Mode4
ltx/en_us_oca/me.m10.d16:meMA.Ode1C1T.ode	@ltx/en_us_oca/miscellanea:misc.Ode1
ltx/en_us_oca/me.m10.d16:meMA.Ode1C1T.text	
ltx/en_us_oca/me.m10.d16:meMA.Ode3C11.greekmelody	@ltx/en_us_oca/he.h.m4:heHE.EffrainetaiEpiSoi.greekname
ltx/en_us_oca/me.m10.d16:meMA.Ode3C11.incipit	…
ltx/en_us_oca/me.m10.d16:meMA.Ode3C11.melody	@ltx/en_us_oca/he.h.m4:heHE.EffrainetaiEpiSoi.notmetered
ltx/en_us_oca/me.m10.d16:meMA.Ode3C11.mode	@ltx/en_us_oca/miscellanea:misc.Mode4
ltx/en_us_oca/me.m10.d16:meMA.Ode3C11.ode	@ltx/en_us_oca/miscellanea:misc.Ode3
ltx/en_us_oca/me.m10.d16:meMA.Ode3C11.text	
ltx/en_us_oca/me.m10.d16:meMA.Ode3C12.incipit	…
ltx/en_us_oca/me.m10.d16:meMA.Ode3C12.melody	@ltx/en_us_oca/he.h.m4:heHE.EffrainetaiEpiSoi.notmetered
ltx/en_us_oca/me.m10.d16:meMA.Ode3C12.mode	@ltx/en_us_oca/miscellanea:misc.Mode4
ltx/en_us_oca/me.m10.d16:meMA.Ode3C12.ode	@ltx/en_us_oca/miscellanea:misc.Ode3
ltx/en_us_oca/me.m10.d16:meMA.Ode3C12.text	
ltx/en_us_oca/me.m10.d16:meMA.Ode3C13.incipit	…
ltx/en_us_oca/me.m10.d16:meMA.Ode3C13.melody	@ltx/en_us_oca/he.h.m4:heHE.EffrainetaiEpiSoi.notmetered
ltx/en_us_oca/me.m10.d16:meMA.Ode3C13.mode	@ltx/en_us_oca/miscellanea:misc.Mode4
ltx/en_us_oca/me.m10.d16:meMA.Ode3C13.ode	@ltx/en_us_oca/miscellanea:misc.Ode3
ltx/en_us_oca/me.m10.d16:meMA.Ode3C13.text	
ltx/en_us_oca/me.m10.d16:meMA.Ode3C1T.incipit	…
ltx/en_us_oca/me.m10.d16:meMA.Ode3C1T.melody	@ltx/en_us_oca/he.h.m4:heHE.EffrainetaiEpiSoi.notmetered
ltx/en_us_oca/me.m10.d16:meMA.Ode3C1T.mode	@ltx/en_us_oca/miscellanea:misc.Mode4
ltx/en_us_oca/me.m10.d16:meMA.Ode3C1T.ode	@ltx/en_us_oca/miscellanea:misc.Ode3
ltx/en_us_oca/me.m10.d16:meMA.Ode3C1T.text	
ltx/en_us_oca/me.m10.d16:meMA.Ode3H.greekmelody	@ltx/en_us_oca/he.h.m4:heHE.EffrainetaiEpiSoi.greekname
ltx/en_us_oca/me.m10.d16:meMA.Ode3H.incipit	@ltx/en_us_oca/he.h.m4:heHE.EffrainetaiEpiSoi.incipit
ltx/en_us_oca/me.m10.d16:meMA.Ode3H.melody	@ltx/en_us_oca/he.h.m4:heHE.EffrainetaiEpiSoi.melody
ltx/en_us_oca/me.m10.d16:meMA.Ode3H.mode	@ltx/en_us_oca/miscellanea:misc.Mode4
ltx/en_us_oca/me.m10.d16:meMA.Ode3H.ode	@ltx/en_us_oca/miscellanea:misc.Ode3
ltx/en_us_oca/me.m10.d16:meMA.Ode3H.text	@ltx/en_us_oca/he.h.m4:heHE.EffrainetaiEpiSoi.text
ltx/en_us_oca/me.m10.d16:meMA.Ode3Kathisma1.greekmelody	@ltx/en_us_oca/he.a.m8:heAU.TinSofianKaiLogon.greekname
ltx/en_us_oca/me.m10.d16:meMA.Ode3Kathisma1.incipit	…
ltx/en_us_oca/me.m10.d16:meMA.Ode3Kathisma1.melody	@ltx/en_us_oca/he.a.m8:heAU.TinSofianKaiLogon.notmetered
ltx/en_us_oca/me.m10.d16:meMA.Ode3Kathisma1.mode	@ltx/en_us_oca/miscellanea:misc.Mode8
ltx/en_us_oca/me.m10.d16:meMA.Ode3Kathisma1.text	
ltx/en_us_oca/me.m10.d16:meMA.Ode3KathismaSt.incipit	@ltx/en_us_oca/oc.m8.d4:ocMA.Kathisma13.incipit
ltx/en_us_oca/me.m10.d16:meMA.Ode3KathismaSt.melody	@ltx/en_us_oca/he.a.m8:heAU.TinSofianKaiLogon.notmetered
ltx/en_us_oca/me.m10.d16:meMA.Ode3KathismaSt.mode	@ltx/en_us_oca/miscellanea:misc.Mode8
ltx/en_us_oca/me.m10.d16:meMA.Ode3KathismaSt.text	@ltx/en_us_oca/oc.m8.d4:ocMA.Kathisma13.text
ltx/en_us_oca/me.m10.d16:meMA.Ode3KathismaT.incipit	…
ltx/en_us_oca/me.m10.d16:meMA.Ode3KathismaT.melody	@ltx/en_us_oca/he.a.m8:heAU.TinSofianKaiLogon.notmetered
ltx/en_us_oca/me.m10.d16:meMA.Ode3KathismaT.mode	@ltx/en_us_oca/miscellanea:misc.Mode8
ltx/en_us_oca/me.m10.d16:meMA.Ode3KathismaT.text	
ltx/en_us_oca/me.m10.d16:meMA.Ode4C11.greekmelody	@ltx/en_us_oca/he.h.m4:heHE.EparthentaSeIdousa.greekname
ltx/en_us_oca/me.m10.d16:meMA.Ode4C11.incipit	…
ltx/en_us_oca/me.m10.d16:meMA.Ode4C11.melody	@ltx/en_us_oca/he.h.m4:heHE.EparthentaSeIdousa.notmetered
ltx/en_us_oca/me.m10.d16:meMA.Ode4C11.mode	@ltx/en_us_oca/miscellanea:misc.Mode4
ltx/en_us_oca/me.m10.d16:meMA.Ode4C11.ode	@ltx/en_us_oca/miscellanea:misc.Ode4
ltx/en_us_oca/me.m10.d16:meMA.Ode4C11.text	
ltx/en_us_oca/me.m10.d16:meMA.Ode4C12.incipit	…
ltx/en_us_oca/me.m10.d16:meMA.Ode4C12.melody	@ltx/en_us_oca/he.h.m4:heHE.EparthentaSeIdousa.notmetered
ltx/en_us_oca/me.m10.d16:meMA.Ode4C12.mode	@ltx/en_us_oca/miscellanea:misc.Mode4
ltx/en_us_oca/me.m10.d16:meMA.Ode4C12.ode	@ltx/en_us_oca/miscellanea:misc.Ode4
ltx/en_us_oca/me.m10.d16:meMA.Ode4C12.text	
ltx/en_us_oca/me.m10.d16:meMA.Ode4C13.incipit	…
ltx/en_us_oca/me.m10.d16:meMA.Ode4C13.melody	@ltx/en_us_oca/he.h.m4:heHE.EparthentaSeIdousa.notmetered
ltx/en_us_oca/me.m10.d16:meMA.Ode4C13.mode	@ltx/en_us_oca/miscellanea:misc.Mode4
ltx/en_us_oca/me.m10.d16:meMA.Ode4C13.ode	@ltx/en_us_oca/miscellanea:misc.Ode4
ltx/en_us_oca/me.m10.d16:meMA.Ode4C13.text	
ltx/en_us_oca/me.m10.d16:meMA.Ode4C1T.incipit	…
ltx/en_us_oca/me.m10.d16:meMA.Ode4C1T.melody	@ltx/en_us_oca/he.h.m4:heHE.EparthentaSeIdousa.notmetered
ltx/en_us_oca/me.m10.d16:meMA.Ode4C1T.mode	@ltx/en_us_oca/miscellanea:misc.Mode4
ltx/en_us_oca/me.m10.d16:meMA.Ode4C1T.ode	@ltx/en_us_oca/miscellanea:misc.Ode4
ltx/en_us_oca/me.m10.d16:meMA.Ode4C1T.text	
ltx/en_us_oca/me.m10.d16:meMA.Ode5C11.greekmelody	@ltx/en_us_oca/he.h.m4:heHE.SyKyrieMouFos.greekname
ltx/en_us_oca/me.m10.d16:meMA.Ode5C11.incipit	…
ltx/en_us_oca/me.m10.d16:meMA.Ode5C11.melody	@ltx/en_us_oca/he.h.m4:heHE.SyKyrieMouFos.notmetered
ltx/en_us_oca/me.m10.d16:meMA.Ode5C11.mode	@ltx/en_us_oca/miscellanea:misc.Mode4
ltx/en_us_oca/me.m10.d16:meMA.Ode5C11.ode	@ltx/en_us_oca/miscellanea:misc.Ode5
ltx/en_us_oca/me.m10.d16:meMA.Ode5C11.text	
ltx/en_us_oca/me.m10.d16:meMA.Ode5C12.incipit	…
ltx/en_us_oca/me.m10.d16:meMA.Ode5C12.melody	@ltx/en_us_oca/he.h.m4:heHE.SyKyrieMouFos.notmetered
ltx/en_us_oca/me.m10.d16:meMA.Ode5C12.mode	@ltx/en_us_oca/miscellanea:misc.Mode4
ltx/en_us_oca/me.m10.d16:meMA.Ode5C12.ode	@ltx/en_us_oca/miscellanea:misc.Ode5
ltx/en_us_oca/me.m10.d16:meMA.Ode5C12.text	
ltx/en_us_oca/me.m10.d16:meMA.Ode5C13.incipit	…
ltx/en_us_oca/me.m10.d16:meMA.Ode5C13.melody	@ltx/en_us_oca/he.h.m4:heHE.SyKyrieMouFos.notmetered
ltx/en_us_oca/me.m10.d16:meMA.Ode5C13.mode	@ltx/en_us_oca/miscellanea:misc.Mode4
ltx/en_us_oca/me.m10.d16:meMA.Ode5C13.ode	@ltx/en_us_oca/miscellanea:misc.Ode5
ltx/en_us_oca/me.m10.d16:meMA.Ode5C13.text	
ltx/en_us_oca/me.m10.d16:meMA.Ode5C1T.incipit	…
ltx/en_us_oca/me.m10.d16:meMA.Ode5C1T.melody	@ltx/en_us_oca/he.h.m4:heHE.SyKyrieMouFos.notmetered
ltx/en_us_oca/me.m10.d16:meMA.Ode5C1T.mode	@ltx/en_us_oca/miscellanea:misc.Mode4
ltx/en_us_oca/me.m10.d16:meMA.Ode5C1T.ode	@ltx/en_us_oca/miscellanea:misc.Ode5
ltx/en_us_oca/me.m10.d16:meMA.Ode5C1T.text	
ltx/en_us_oca/me.m10.d16:meMA.Ode6C11.greekmelody	@ltx/en_us_oca/he.h.m4:heHE.ThysoSoiMetaFonis.greekname
ltx/en_us_oca/me.m10.d16:meMA.Ode6C11.incipit	…
ltx/en_us_oca/me.m10.d16:meMA.Ode6C11.melody	@ltx/en_us_oca/he.h.m4:heHE.ThysoSoiMetaFonis.notmetered
ltx/en_us_oca/me.m10.d16:meMA.Ode6C11.mode	@ltx/en_us_oca/miscellanea:misc.Mode4
ltx/en_us_oca/me.m10.d16:meMA.Ode6C11.ode	@ltx/en_us_oca/miscellanea:misc.Ode6
ltx/en_us_oca/me.m10.d16:meMA.Ode6C11.text	
ltx/en_us_oca/me.m10.d16:meMA.Ode6C12.incipit	…
ltx/en_us_oca/me.m10.d16:meMA.Ode6C12.melody	@ltx/en_us_oca/he.h.m4:heHE.ThysoSoiMetaFonis.notmetered
ltx/en_us_oca/me.m10.d16:meMA.Ode6C12.mode	@ltx/en_us_oca/miscellanea:misc.Mode4
ltx/en_us_oca/me.m10.d16:meMA.Ode6C12.ode	@ltx/en_us_oca/miscellanea:misc.Ode6
ltx/en_us_oca/me.m10.d16:meMA.Ode6C12.text	
ltx/en_us_oca/me.m10.d16:meMA.Ode6C13.incipit	…
ltx/en_us_oca/me.m10.d16:meMA.Ode6C13.melody	@ltx/en_us_oca/he.h.m4:heHE.ThysoSoiMetaFonis.notmetered
ltx/en_us_oca/me.m10.d16:meMA.Ode6C13.mode	@ltx/en_us_oca/miscellanea:misc.Mode4
ltx/en_us_oca/me.m10.d16:meMA.Ode6C13.ode	@ltx/en_us_oca/miscellanea:misc.Ode6
ltx/en_us_oca/me.m10.d16:meMA.Ode6C13.text	
ltx/en_us_oca/me.m10.d16:meMA.Ode6C1T.incipit	…
ltx/en_us_oca/me.m10.d16:meMA.Ode6C1T.melody	@ltx/en_us_oca/he.h.m4:heHE.ThysoSoiMetaFonis.notmetered
ltx/en_us_oca/me.m10.d16:meMA.Ode6C1T.mode	@ltx/en_us_oca/miscellanea:misc.Mode4
ltx/en_us_oca/me.m10.d16:meMA.Ode6C1T.ode	@ltx/en_us_oca/miscellanea:misc.Ode6
ltx/en_us_oca/me.m10.d16:meMA.Ode6C1T.text	
ltx/en_us_oca/me.m10.d16:meMA.Ode6H.greekmelody	@ltx/en_us_oca/he.h.m4:heHE.ThysoSoiMetaFonis.greekname
ltx/en_us_oca/me.m10.d16:meMA.Ode6H.incipit	@ltx/en_us_oca/he.h.m4:heHE.ThysoSoiMetaFonis.incipit
ltx/en_us_oca/me.m10.d16:meMA.Ode6H.melody	@ltx/en_us_oca/he.h.m4:heHE.ThysoSoiMetaFonis.melody
ltx/en_us_oca/me.m10.d16:meMA.Ode6H.mode	@ltx/en_us_oca/miscellanea:misc.Mode4
ltx/en_us_oca/me.m10.d16:meMA.Ode6H.ode	@ltx/en_us_oca/miscellanea:misc.Ode6
ltx/en_us_oca/me.m10.d16:meMA.Ode6H.text	@ltx/en_us_oca/he.h.m4:heHE.ThysoSoiMetaFonis.text
ltx/en_us_oca/me.m10.d16:meMA.Ode7C11.greekmelody	@ltx/en_us_oca/he.h.m4:heHE.EnTiKaminoAvramiaioi.greekname
ltx/en_us_oca/me.m10.d16:meMA.Ode7C11.incipit	…
ltx/en_us_oca/me.m10.d16:meMA.Ode7C11.melody	@ltx/en_us_oca/he.h.m4:heHE.EnTiKaminoAvramiaioi.name
ltx/en_us_oca/me.m10.d16:meMA.Ode7C11.mode	@ltx/en_us_oca/miscellanea:misc.Mode4
ltx/en_us_oca/me.m10.d16:meMA.Ode7C11.ode	@ltx/en_us_oca/miscellanea:misc.Ode7
ltx/en_us_oca/me.m10.d16:meMA.Ode7C11.text	
ltx/en_us_oca/me.m10.d16:meMA.Ode7C12.incipit	…
ltx/en_us_oca/me.m10.d16:meMA.Ode7C12.melody	@ltx/en_us_oca/he.h.m4:heHE.EnTiKaminoAvramiaioi.name
ltx/en_us_oca/me.m10.d16:meMA.Ode7C12.mode	@ltx/en_us_oca/miscellanea:misc.Mode4
ltx/en_us_oca/me.m10.d16:meMA.Ode7C12.ode	@ltx/en_us_oca/miscellanea:misc.Ode7
ltx/en_us_oca/me.m10.d16:meMA.Ode7C12.text	
ltx/en_us_oca/me.m10.d16:meMA.Ode7C13.incipit	…
ltx/en_us_oca/me.m10.d16:meMA.Ode7C13.melody	@ltx/en_us_oca/he.h.m4:heHE.EnTiKaminoAvramiaioi.name
ltx/en_us_oca/me.m10.d16:meMA.Ode7C13.mode	@ltx/en_us_oca/miscellanea:misc.Mode4
ltx/en_us_oca/me.m10.d16:meMA.Ode7C13.ode	@ltx/en_us_oca/miscellanea:misc.Ode7
ltx/en_us_oca/me.m10.d16:meMA.Ode7C13.text	
ltx/en_us_oca/me.m10.d16:meMA.Ode7C1T.incipit	…
ltx/en_us_oca/me.m10.d16:meMA.Ode7C1T.melody	@ltx/en_us_oca/he.h.m4:heHE.EnTiKaminoAvramiaioi.name
ltx/en_us_oca/me.m10.d16:meMA.Ode7C1T.mode	@ltx/en_us_oca/miscellanea:misc.Mode4
ltx/en_us_oca/me.m10.d16:meMA.Ode7C1T.ode	@ltx/en_us_oca/miscellanea:misc.Ode7
ltx/en_us_oca/me.m10.d16:meMA.Ode7C1T.text	
ltx/en_us_oca/me.m10.d16:meMA.Ode8C11.greekmelody	@ltx/en_us_oca/he.h.m4:heHE.CheirasEkpetasasDaniil.greekname
ltx/en_us_oca/me.m10.d16:meMA.Ode8C11.incipit	…
ltx/en_us_oca/me.m10.d16:meMA.Ode8C11.melody	@ltx/en_us_oca/he.h.m4:heHE.CheirasEkpetasasDaniil.notmetered
ltx/en_us_oca/me.m10.d16:meMA.Ode8C11.mode	@ltx/en_us_oca/miscellanea:misc.Mode4
ltx/en_us_oca/me.m10.d16:meMA.Ode8C11.ode	@ltx/en_us_oca/miscellanea:misc.Ode8
ltx/en_us_oca/me.m10.d16:meMA.Ode8C11.text	
ltx/en_us_oca/me.m10.d16:meMA.Ode8C12.incipit	…
ltx/en_us_oca/me.m10.d16:meMA.Ode8C12.melody	@ltx/en_us_oca/he.h.m4:heHE.CheirasEkpetasasDaniil.notmetered
ltx/en_us_oca/me.m10.d16:meMA.Ode8C12.mode	@ltx/en_us_oca/miscellanea:misc.Mode4
ltx/en_us_oca/me.m10.d16:meMA.Ode8C12.ode	@ltx/en_us_oca/miscellanea:misc.Ode8
ltx/en_us_oca/me.m10.d16:meMA.Ode8C12.text	
ltx/en_us_oca/me.m10.d16:meMA.Ode8C13.incipit	…
ltx/en_us_oca/me.m10.d16:meMA.Ode8C13.melody	@ltx/en_us_oca/he.h.m4:heHE.CheirasEkpetasasDaniil.notmetered
ltx/en_us_oca/me.m10.d16:meMA.Ode8C13.mode	@ltx/en_us_oca/miscellanea:misc.Mode4
ltx/en_us_oca/me.m10.d16:meMA.Ode8C13.ode	@ltx/en_us_oca/miscellanea:misc.Ode8
ltx/en_us_oca/me.m10.d16:meMA.Ode8C13.text	
ltx/en_us_oca/me.m10.d16:meMA.Ode8C14.incipit	…
ltx/en_us_oca/me.m10.d16:meMA.Ode8C14.melody	@ltx/en_us_oca/he.h.m4:heHE.CheirasEkpetasasDaniil.notmetered
ltx/en_us_oca/me.m10.d16:meMA.Ode8C14.mode	@ltx/en_us_oca/miscellanea:misc.Mode4
ltx/en_us_oca/me.m10.d16:meMA.Ode8C14.ode	@ltx/en_us_oca/miscellanea:misc.Ode8
ltx/en_us_oca/me.m10.d16:meMA.Ode8C14.text	
ltx/en_us_oca/me.m10.d16:meMA.Ode8C1T.incipit	…
ltx/en_us_oca/me.m10.d16:meMA.Ode8C1T.melody	@ltx/en_us_oca/he.h.m4:heHE.CheirasEkpetasasDaniil.notmetered
ltx/en_us_oca/me.m10.d16:meMA.Ode8C1T.mode	@ltx/en_us_oca/miscellanea:misc.Mode4
ltx/en_us_oca/me.m10.d16:meMA.Ode8C1T.ode	@ltx/en_us_oca/miscellanea:misc.Ode8
ltx/en_us_oca/me.m10.d16:meMA.Ode8C1T.text	
ltx/en_us_oca/me.m10.d16:meMA.Ode8H.greekmelody	@ltx/en_us_oca/he.h.m4:heHE.CheirasEkpetasasDaniil.greekname
ltx/en_us_oca/me.m10.d16:meMA.Ode8H.incipit	@ltx/en_us_oca/he.h.m4:heHE.CheirasEkpetasasDaniil.incipit
ltx/en_us_oca/me.m10.d16:meMA.Ode8H.melody	@ltx/en_us_oca/he.h.m4:heHE.CheirasEkpetasasDaniil.melody
ltx/en_us_oca/me.m10.d16:meMA.Ode8H.mode	@ltx/en_us_oca/miscellanea:misc.Mode4
ltx/en_us_oca/me.m10.d16:meMA.Ode8H.ode	@ltx/en_us_oca/miscellanea:misc.Ode8
ltx/en_us_oca/me.m10.d16:meMA.Ode8H.text	@ltx/en_us_oca/he.h.m4:heHE.CheirasEkpetasasDaniil.text
ltx/en_us_oca/me.m10.d16:meMA.Ode9C11.greekmelody	@ltx/en_us_oca/he.h.m4:heHE.LithosAcheirotmitos.greekname
ltx/en_us_oca/me.m10.d16:meMA.Ode9C11.incipit	…
ltx/en_us_oca/me.m10.d16:meMA.Ode9C11.melody	@ltx/en_us_oca/he.h.m4:heHE.LithosAcheirotmitos.notmetered
ltx/en_us_oca/me.m10.d16:meMA.Ode9C11.mode	@ltx/en_us_oca/miscellanea:misc.Mode4
ltx/en_us_oca/me.m10.d16:meMA.Ode9C11.ode	@ltx/en_us_oca/miscellanea:misc.Ode9
ltx/en_us_oca/me.m10.d16:meMA.Ode9C11.text	
ltx/en_us_oca/me.m10.d16:meMA.Ode9C12.incipit	…
ltx/en_us_oca/me.m10.d16:meMA.Ode9C12.melody	@ltx/en_us_oca/he.h.m4:heHE.LithosAcheirotmitos.notmetered
ltx/en_us_oca/me.m10.d16:meMA.Ode9C12.mode	@ltx/en_us_oca/miscellanea:misc.Mode4
ltx/en_us_oca/me.m10.d16:meMA.Ode9C12.ode	@ltx/en_us_oca/miscellanea:misc.Ode9
ltx/en_us_oca/me.m10.d16:meMA.Ode9C12.text	
ltx/en_us_oca/me.m10.d16:meMA.Ode9C13.incipit	…
ltx/en_us_oca/me.m10.d16:meMA.Ode9C13.melody	@ltx/en_us_oca/he.h.m4:heHE.LithosAcheirotmitos.notmetered
ltx/en_us_oca/me.m10.d16:meMA.Ode9C13.mode	@ltx/en_us_oca/miscellanea:misc.Mode4
ltx/en_us_oca/me.m10.d16:meMA.Ode9C13.ode	@ltx/en_us_oca/miscellanea:misc.Ode9
ltx/en_us_oca/me.m10.d16:meMA.Ode9C13.text	
ltx/en_us_oca/me.m10.d16:meMA.Ode9C14.incipit	…
ltx/en_us_oca/me.m10.d16:meMA.Ode9C14.melody	@ltx/en_us_oca/he.h.m4:heHE.LithosAcheirotmitos.notmetered
ltx/en_us_oca/me.m10.d16:meMA.Ode9C14.mode	@ltx/en_us_oca/miscellanea:misc.Mode4
ltx/en_us_oca/me.m10.d16:meMA.Ode9C14.ode	@ltx/en_us_oca/miscellanea:misc.Ode9
ltx/en_us_oca/me.m10.d16:meMA.Ode9C14.text	
ltx/en_us_oca/me.m10.d16:meMA.Ode9C1T.incipit	…
ltx/en_us_oca/me.m10.d16:meMA.Ode9C1T.melody	@ltx/en_us_oca/he.h.m4:heHE.LithosAcheirotmitos.notmetered
ltx/en_us_oca/me.m10.d16:meMA.Ode9C1T.mode	@ltx/en_us_oca/miscellanea:misc.Mode4
ltx/en_us_oca/me.m10.d16:meMA.Ode9C1T.ode	@ltx/en_us_oca/miscellanea:misc.Ode9
ltx/en_us_oca/me.m10.d16:meMA.Ode9C1T.text	
ltx/en_us_oca/me.m10.d16:meMA.Ode9H.greekmelody	@ltx/en_us_oca/he.h.m4:heHE.LithosAcheirotmitos.greekname
ltx/en_us_oca/me.m10.d16:meMA.Ode9H.incipit	@ltx/en_us_oca/he.h.m4:heHE.LithosAcheirotmitos.incipit
ltx/en_us_oca/me.m10.d16:meMA.Ode9H.melody	@ltx/en_us_oca/he.h.m4:heHE.LithosAcheirotmitos.melody
ltx/en_us_oca/me.m10.d16:meMA.Ode9H.mode	@ltx/en_us_oca/miscellanea:misc.Mode4
ltx/en_us_oca/me.m10.d16:meMA.Ode9H.ode	@ltx/en_us_oca/miscellanea:misc.Ode9
ltx/en_us_oca/me.m10.d16:meMA.Ode9H.text	@ltx/en_us_oca/he.h.m4:heHE.LithosAcheirotmitos.text
ltx/en_us_oca/me.m10.d16:meMA.Oikos1.text	
ltx/en_us_oca/me.m10.d16:meVE.Apolytikion1ger.greekmelody	@ltx/en_us_oca/he.a.m1:heAU.TouLithouSfragisthentos.greekname
ltx/en_us_oca/me.m10.d16:meVE.Apolytikion1ger.incipit	…
ltx/en_us_oca/me.m10.d16:meVE.Apolytikion1ger.melody	@ltx/en_us_oca/he.a.m1:heAU.TouLithouSfragisthentos.notmetered
ltx/en_us_oca/me.m10.d16:meVE.Apolytikion1ger.mode	@ltx/en_us_oca/miscellanea:misc.Mode1
ltx/en_us_oca/me.m10.d16:meVE.Apolytikion1ger.poet	@ltx/en_us_oca/poets:po.Gerasimou
ltx/en_us_oca/me.m10.d16:meVE.Apolytikion1ger.text	
ltx/en_us_oca/me.m10.d16:meVE.AposGlory.incipit	As you stood at the…
ltx/en_us_oca/me.m10.d16:meVE.AposGlory.melody	
ltx/en_us_oca/me.m10.d16:meVE.AposGlory.mode	@ltx/en_us_oca/miscellanea:misc.Mode6
ltx/en_us_oca/me.m10.d16:meVE.AposGlory.poet	@ltx/en_us_oca/poets:po.IoannouMonachou
ltx/en_us_oca/me.m10.d16:meVE.AposGlory.text	As you stood at the Cross, ⁄ seeing what had taken place ⁄ and beholding the One Who was crucified, both God and Man, ⁄ you cried out to Him: ⁄ Remember me in Your kingdom, Lord! ⁄ Therefore the Savior said to you: ⁄⁄ Your memory will be blessed with you, Longinus, throughout all ages!
ltx/en_us_oca/me.m10.d16:meVE.AposStavrotheotokion.greekmelody	@ltx/en_us_oca/he.a.m6:heAU.TriimerosAnestis.greekname
ltx/en_us_oca/me.m10.d16:meVE.AposStavrotheotokion.incipit	@ltx/en_us_oca/me.m01.d16:meVE.SticStavrotheotokion.incipit
ltx/en_us_oca/me.m10.d16:meVE.AposStavrotheotokion.melody	@ltx/en_us_oca/he.a.m6:heAU.TriimerosAnestis.notmetered
ltx/en_us_oca/me.m10.d16:meVE.AposStavrotheotokion.mode	@ltx/en_us_oca/miscellanea:misc.Mode6
ltx/en_us_oca/me.m10.d16:meVE.AposStavrotheotokion.text	@ltx/en_us_oca/me.m01.d16:meVE.SticStavrotheotokion.text
ltx/en_us_oca/me.m10.d16:meVE.AposTheotokion.greekmelody	@ltx/en_us_oca/he.a.m6:heAU.TriimerosAnestis.greekname
ltx/en_us_oca/me.m10.d16:meVE.AposTheotokion.incipit	@ltx/en_us_oca/me.m09.d30:meVE.SticTheotokion.incipit
ltx/en_us_oca/me.m10.d16:meVE.AposTheotokion.melody	@ltx/en_us_oca/he.a.m6:heAU.TriimerosAnestis.notmetered
ltx/en_us_oca/me.m10.d16:meVE.AposTheotokion.mode	@ltx/en_us_oca/miscellanea:misc.Mode6
ltx/en_us_oca/me.m10.d16:meVE.AposTheotokion.text	@ltx/en_us_oca/me.m09.d30:meVE.SticTheotokion.text
ltx/en_us_oca/me.m10.d16:meVE.SticGlory.incipit	Longinus the Centurian ⁄ saw…
ltx/en_us_oca/me.m10.d16:meVE.SticGlory.melody	
ltx/en_us_oca/me.m10.d16:meVE.SticGlory.mode	@ltx/en_us_oca/miscellanea:misc.Mode6
ltx/en_us_oca/me.m10.d16:meVE.SticGlory.poet	@ltx/en_us_oca/poets:po.IoannouMonachou
ltx/en_us_oca/me.m10.d16:meVE.SticGlory.text	Longinus the Centurian ⁄ saw the Temple torn asunder at your passion, O Christ. ⁄ He proclaimed you to be the Son of God to the Jews. ⁄ He was beheaded, and cast out on a dung heap. ⁄ A woman who found him there had her vision restored. ⁄ With her, we cry out to You, as You crowned him in his contest: ⁄ By his intercessions illumine the eyes of our hearts ⁄⁄ that we may glorify You as God crucified for us.
ltx/en_us_oca/me.m10.d16:meVE.SticStavrotheotokion.greekmelody	@ltx/en_us_oca/he.a.m6:heAU.OlinApothemenoi.greekname
ltx/en_us_oca/me.m10.d16:meVE.SticStavrotheotokion.incipit	@ltx/en_us_oca/me.m01.d15:meVE.AposStavrotheotokion.incipit
ltx/en_us_oca/me.m10.d16:meVE.SticStavrotheotokion.melody	@ltx/en_us_oca/he.a.m6:heAU.OlinApothemenoi.notmetered
ltx/en_us_oca/me.m10.d16:meVE.SticStavrotheotokion.mode	@ltx/en_us_oca/miscellanea:misc.Mode6
ltx/en_us_oca/me.m10.d16:meVE.SticStavrotheotokion.text	@ltx/en_us_oca/me.m01.d15:meVE.AposStavrotheotokion.text
ltx/en_us_oca/me.m10.d16:meVE.SticTheotokion.greekmelody	@ltx/en_us_oca/he.a.m6:heAU.OlinApothemenoi.greekname
ltx/en_us_oca/me.m10.d16:meVE.SticTheotokion.incipit	…
ltx/en_us_oca/me.m10.d16:meVE.SticTheotokion.melody	@ltx/en_us_oca/he.a.m6:heAU.OlinApothemenoi.notmetered
ltx/en_us_oca/me.m10.d16:meVE.SticTheotokion.mode	@ltx/en_us_oca/miscellanea:misc.Mode6
ltx/en_us_oca/me.m10.d16:meVE.SticTheotokion.text	
ltx/en_us_oca/me.m10.d16:meVE.Stichera01.greekmelody	@ltx/en_us_oca/he.a.m4:heAU.OsGennaionEnMartysi.greekname
ltx/en_us_oca/me.m10.d16:meVE.Stichera01.incipit	As you beheld the One…
ltx/en_us_oca/me.m10.d16:meVE.Stichera01.melody	@ltx/en_us_oca/he.a.m4:heAU.OsGennaionEnMartysi.notmetered
ltx/en_us_oca/me.m10.d16:meVE.Stichera01.mode	@ltx/en_us_oca/miscellanea:misc.Mode4
ltx/en_us_oca/me.m10.d16:meVE.Stichera01.text	As you beheld the One Who took upon Himself mortal nature ⁄ and came to the Cross, ⁄ when the light of the sun was darkened, ⁄ and saving remission gushed forth from His side, ⁄ then together with the wise thief, glorious one, ⁄ you confessed Him as God and Master, ⁄⁄ Who freely endured the suffering in His infinite compassion.
ltx/en_us_oca/me.m10.d16:meVE.Stichera02.incipit	As you beheld the fruitful…
ltx/en_us_oca/me.m10.d16:meVE.Stichera02.melody	@ltx/en_us_oca/he.a.m4:heAU.OsGennaionEnMartysi.notmetered
ltx/en_us_oca/me.m10.d16:meVE.Stichera02.mode	@ltx/en_us_oca/miscellanea:misc.Mode4
ltx/en_us_oca/me.m10.d16:meVE.Stichera02.text	As you beheld the fruitful Vine hanging upon the Tree, glorious one, ⁄ gushing forth the wine of life for the remission of sins, ⁄ you opened the lips of your heart beneath Him to drink. ⁄ You were filled with gladness, ⁄ purging out bitter unbelief, ⁄⁄ preferring with your mind the better things.
ltx/en_us_oca/me.m10.d16:meVE.Stichera03.incipit	You put to death the…
ltx/en_us_oca/me.m10.d16:meVE.Stichera03.melody	@ltx/en_us_oca/he.a.m4:heAU.OsGennaionEnMartysi.notmetered
ltx/en_us_oca/me.m10.d16:meVE.Stichera03.mode	@ltx/en_us_oca/miscellanea:misc.Mode4
ltx/en_us_oca/me.m10.d16:meVE.Stichera03.text	You put to death the tyrant ⁄ with the boldness of your words! ⁄ Of your own accord you went to the slaughter, ⁄ not fearing the death which bought for you eternal life ⁄ all-praised Longinus! ⁄ Therefore we celebrate your all-holy commemoration, ⁄⁄ and beseech you to intercede for us before the Lord.
