ltx/en_us_oca/me.m06.d29:meDA.commemoration.first	
ltx/en_us_oca/me.m06.d29:meDA.commemoration.first_name	
ltx/en_us_oca/me.m06.d29:meDA.commemoration.first_short	
ltx/en_us_oca/me.m06.d29:meDA.commemoration.first_title	
ltx/en_us_oca/me.m06.d29:meDA.commemoration.full	
ltx/en_us_oca/me.m06.d29:meDA.commemoration.second_name	
ltx/en_us_oca/me.m06.d29:meDA.commemoration.second_title	
ltx/en_us_oca/me.m06.d29:meDA.date	
ltx/en_us_oca/me.m06.d29:meDA.dismissal	
ltx/en_us_oca/me.m06.d29:meDA.fordate	
ltx/en_us_oca/me.m06.d29:meDA.insert1	
ltx/en_us_oca/me.m06.d29:meDA.insert2	
ltx/en_us_oca/me.m06.d29:meDA.note	
ltx/en_us_oca/me.m06.d29:meDA.pdfcoverdate	
ltx/en_us_oca/me.m06.d29:meDA.pdfheaderdate	
ltx/en_us_oca/me.m06.d29:meHO.commemorations	
ltx/en_us_oca/me.m06.d29:meHO.note1	
ltx/en_us_oca/me.m06.d29:meHO.note2	
ltx/en_us_oca/me.m06.d29:meHO.number	
ltx/en_us_oca/me.m06.d29:meHO.rank	
ltx/en_us_oca/me.m06.d29:meLE.commemoration1	
ltx/en_us_oca/me.m06.d29:meLE.commemoration2	
ltx/en_us_oca/me.m06.d29:meLI.Kontakion1.greekmelody	@ltx/en_us_oca/me.m06.d29:meMA.Kontakion1.greekmelody
ltx/en_us_oca/me.m06.d29:meLI.Kontakion1.incipit	@ltx/en_us_oca/me.m06.d29:meMA.Kontakion1.incipit
ltx/en_us_oca/me.m06.d29:meLI.Kontakion1.melody	@ltx/en_us_oca/me.m06.d29:meMA.Kontakion1.melody
ltx/en_us_oca/me.m06.d29:meLI.Kontakion1.mode	@ltx/en_us_oca/me.m06.d29:meMA.Kontakion1.mode
ltx/en_us_oca/me.m06.d29:meLI.Kontakion1.text	@ltx/en_us_oca/me.m06.d29:meMA.Kontakion1.text
ltx/en_us_oca/me.m06.d29:meLI.MM.CommunionHymn.text	@ltx/en_us_oca/da.d5:daLI.MM.CommunionHymn.text
ltx/en_us_oca/me.m06.d29:meLI.Megalynarion.text	
ltx/en_us_oca/me.m06.d29:meLI.Megalynarion2.text	
ltx/en_us_oca/me.m06.d29:meMA.AdditionalIdiomelon1.incipit	…
ltx/en_us_oca/me.m06.d29:meMA.AdditionalIdiomelon1.melody	@ltx/en_us_oca/miscellanea:misc.Idiomelon
ltx/en_us_oca/me.m06.d29:meMA.AdditionalIdiomelon1.mode	@ltx/en_us_oca/miscellanea:misc.Mode4
ltx/en_us_oca/me.m06.d29:meMA.AdditionalIdiomelon1.text	
ltx/en_us_oca/me.m06.d29:meMA.AdditionalIdiomelon2.incipit	…
ltx/en_us_oca/me.m06.d29:meMA.AdditionalIdiomelon2.melody	@ltx/en_us_oca/miscellanea:misc.Idiomelon
ltx/en_us_oca/me.m06.d29:meMA.AdditionalIdiomelon2.mode	@ltx/en_us_oca/miscellanea:misc.Mode4
ltx/en_us_oca/me.m06.d29:meMA.AdditionalIdiomelon2.poet	@ltx/en_us_oca/poets:po.IoannouMonachou
ltx/en_us_oca/me.m06.d29:meMA.AdditionalIdiomelon2.text	
ltx/en_us_oca/me.m06.d29:meMA.AdditionalIdiomelon3.incipit	…
ltx/en_us_oca/me.m06.d29:meMA.AdditionalIdiomelon3.melody	@ltx/en_us_oca/miscellanea:misc.Idiomelon
ltx/en_us_oca/me.m06.d29:meMA.AdditionalIdiomelon3.mode	@ltx/en_us_oca/miscellanea:misc.Mode4
ltx/en_us_oca/me.m06.d29:meMA.AdditionalIdiomelon3.poet	@ltx/en_us_oca/poets:po.Theofanous
ltx/en_us_oca/me.m06.d29:meMA.AdditionalIdiomelon3.text	
ltx/en_us_oca/me.m06.d29:meMA.AdditionalIdiomelonGlory.incipit	…
ltx/en_us_oca/me.m06.d29:meMA.AdditionalIdiomelonGlory.melody	@ltx/en_us_oca/miscellanea:misc.Idiomelon
ltx/en_us_oca/me.m06.d29:meMA.AdditionalIdiomelonGlory.mode	@ltx/en_us_oca/miscellanea:misc.Mode4
ltx/en_us_oca/me.m06.d29:meMA.AdditionalIdiomelonGlory.poet	@ltx/en_us_oca/poets:po.IoannouMonachou
ltx/en_us_oca/me.m06.d29:meMA.AdditionalIdiomelonGlory.text	
ltx/en_us_oca/me.m06.d29:meMA.C1.poet	@ltx/en_us_oca/poets:po.IoannouMonachou
ltx/en_us_oca/me.m06.d29:meMA.C1.title	Canon for St. Peter.
ltx/en_us_oca/me.m06.d29:meMA.C1.verse	@ltx/en_us_oca/prayers:pr.verse_Apostle.text
ltx/en_us_oca/me.m06.d29:meMA.C2.poet	@ltx/en_us_oca/poets:po.IoannouMonachou
ltx/en_us_oca/me.m06.d29:meMA.C2.title	Canon for St. Paul.
ltx/en_us_oca/me.m06.d29:meMA.C2.verse	@ltx/en_us_oca/prayers:pr.verse_Apostle.text
ltx/en_us_oca/me.m06.d29:meMA.ExapTheotokion.incipit	…
ltx/en_us_oca/me.m06.d29:meMA.ExapTheotokion.melody	@ltx/en_us_oca/he.a.m2:heAU.GynaikesAkoutisthite.notmetered
ltx/en_us_oca/me.m06.d29:meMA.ExapTheotokion.mode	@ltx/en_us_oca/miscellanea:misc.Mode2
ltx/en_us_oca/me.m06.d29:meMA.ExapTheotokion.text	
ltx/en_us_oca/me.m06.d29:meMA.Exaposteilarion1.greekmelody	@ltx/en_us_oca/he.a.m2:heAU.GynaikesAkoutisthite.greekname
ltx/en_us_oca/me.m06.d29:meMA.Exaposteilarion1.incipit	…
ltx/en_us_oca/me.m06.d29:meMA.Exaposteilarion1.melody	@ltx/en_us_oca/he.a.m2:heAU.GynaikesAkoutisthite.notmetered
ltx/en_us_oca/me.m06.d29:meMA.Exaposteilarion1.mode	@ltx/en_us_oca/miscellanea:misc.Mode2
ltx/en_us_oca/me.m06.d29:meMA.Exaposteilarion1.text	
ltx/en_us_oca/me.m06.d29:meMA.Hypakoe.incipit	What guard did not hold…
ltx/en_us_oca/me.m06.d29:meMA.Hypakoe.melody	
ltx/en_us_oca/me.m06.d29:meMA.Hypakoe.mode	@ltx/en_us_oca/miscellanea:misc.Mode8
ltx/en_us_oca/me.m06.d29:meMA.Hypakoe.text	What guard did not hold you prisoner? ⁄ What Church has not had you as a preacher? ⁄ Damascus esteems you, Paul, for it beheld you blinded. ⁄ Rome received your blood, and through it has gained great renown, ⁄ and Tarsus greatly rejoices in the precious relics of your beloved grave clothes. ⁄ Even so establish us, Apostle Paul, ⁄⁄ the boast of the whole universe!
ltx/en_us_oca/me.m06.d29:meMA.Kathisma11.greekmelody	@ltx/en_us_oca/he.a.m8:heAU.TinSofianKaiLogon.greekname
ltx/en_us_oca/me.m06.d29:meMA.Kathisma11.incipit	…
ltx/en_us_oca/me.m06.d29:meMA.Kathisma11.melody	@ltx/en_us_oca/he.a.m8:heAU.TinSofianKaiLogon.notmetered
ltx/en_us_oca/me.m06.d29:meMA.Kathisma11.mode	@ltx/en_us_oca/miscellanea:misc.Mode8
ltx/en_us_oca/me.m06.d29:meMA.Kathisma11.text	
ltx/en_us_oca/me.m06.d29:meMA.Kathisma1T.incipit	…
ltx/en_us_oca/me.m06.d29:meMA.Kathisma1T.melody	@ltx/en_us_oca/he.a.m8:heAU.TinSofianKaiLogon.notmetered
ltx/en_us_oca/me.m06.d29:meMA.Kathisma1T.mode	@ltx/en_us_oca/miscellanea:misc.Mode8
ltx/en_us_oca/me.m06.d29:meMA.Kathisma1T.text	
ltx/en_us_oca/me.m06.d29:meMA.Kathisma21.greekmelody	@ltx/en_us_oca/he.a.m8:heAU.TinSofianKaiLogon.greekname
ltx/en_us_oca/me.m06.d29:meMA.Kathisma21.incipit	…
ltx/en_us_oca/me.m06.d29:meMA.Kathisma21.melody	@ltx/en_us_oca/he.a.m8:heAU.TinSofianKaiLogon.notmetered
ltx/en_us_oca/me.m06.d29:meMA.Kathisma21.mode	@ltx/en_us_oca/miscellanea:misc.Mode8
ltx/en_us_oca/me.m06.d29:meMA.Kathisma21.text	
ltx/en_us_oca/me.m06.d29:meMA.Kathisma2T.incipit	…
ltx/en_us_oca/me.m06.d29:meMA.Kathisma2T.melody	@ltx/en_us_oca/he.a.m8:heAU.TinSofianKaiLogon.notmetered
ltx/en_us_oca/me.m06.d29:meMA.Kathisma2T.mode	@ltx/en_us_oca/miscellanea:misc.Mode8
ltx/en_us_oca/me.m06.d29:meMA.Kathisma2T.text	
ltx/en_us_oca/me.m06.d29:meMA.Kathisma31.greekmelody	@ltx/en_us_oca/he.a.m8:heAU.TinSofianKaiLogon.greekname
ltx/en_us_oca/me.m06.d29:meMA.Kathisma31.incipit	…
ltx/en_us_oca/me.m06.d29:meMA.Kathisma31.melody	@ltx/en_us_oca/he.a.m8:heAU.TinSofianKaiLogon.notmetered
ltx/en_us_oca/me.m06.d29:meMA.Kathisma31.mode	@ltx/en_us_oca/miscellanea:misc.Mode8
ltx/en_us_oca/me.m06.d29:meMA.Kathisma31.text	
ltx/en_us_oca/me.m06.d29:meMA.Kathisma3T.incipit	@ltx/en_us_oca/he.a.m8:heAU.TinSofianKaiLogon.incipit
ltx/en_us_oca/me.m06.d29:meMA.Kathisma3T.melody	@ltx/en_us_oca/he.a.m8:heAU.TinSofianKaiLogon.melody
ltx/en_us_oca/me.m06.d29:meMA.Kathisma3T.mode	@ltx/en_us_oca/miscellanea:misc.Mode8
ltx/en_us_oca/me.m06.d29:meMA.Kathisma3T.text	@ltx/en_us_oca/he.a.m8:heAU.TinSofianKaiLogon.text
ltx/en_us_oca/me.m06.d29:meMA.Kontakion1.greekmelody	@ltx/en_us_oca/he.a.m2:heAU.TousAsfaleis.greekname
ltx/en_us_oca/me.m06.d29:meMA.Kontakion1.incipit	@ltx/en_us_oca/he.a.m2:heAU.TousAsfaleis.incipit
ltx/en_us_oca/me.m06.d29:meMA.Kontakion1.melody	@ltx/en_us_oca/he.a.m2:heAU.TousAsfaleis.melody
ltx/en_us_oca/me.m06.d29:meMA.Kontakion1.mode	@ltx/en_us_oca/miscellanea:misc.Mode2
ltx/en_us_oca/me.m06.d29:meMA.Kontakion1.text	@ltx/en_us_oca/he.a.m2:heAU.TousAsfaleis.text
ltx/en_us_oca/me.m06.d29:meMA.Lauds1.greekmelody	@ltx/en_us_oca/he.a.m4:heAU.OExYpsistouKlitheis.greekname
ltx/en_us_oca/me.m06.d29:meMA.Lauds1.incipit	@ltx/en_us_oca/he.a.m4:heAU.OExYpsistouKlitheis.incipit
ltx/en_us_oca/me.m06.d29:meMA.Lauds1.melody	@ltx/en_us_oca/he.a.m4:heAU.OExYpsistouKlitheis.melody
ltx/en_us_oca/me.m06.d29:meMA.Lauds1.mode	@ltx/en_us_oca/miscellanea:misc.Mode4
ltx/en_us_oca/me.m06.d29:meMA.Lauds1.text	@ltx/en_us_oca/he.a.m4:heAU.OExYpsistouKlitheis.text
ltx/en_us_oca/me.m06.d29:meMA.Lauds2.incipit	When the Savior asked the…
ltx/en_us_oca/me.m06.d29:meMA.Lauds2.melody	@ltx/en_us_oca/he.a.m4:heAU.OExYpsistouKlitheis.notmetered
ltx/en_us_oca/me.m06.d29:meMA.Lauds2.mode	@ltx/en_us_oca/miscellanea:misc.Mode4
ltx/en_us_oca/me.m06.d29:meMA.Lauds2.text	When the Savior asked the twelve apostles, ⁄ Who do men say that I am? ⁄ Peter the leader of the disciples, received heavenly grace. ⁄ He cried out in a clear voice: ⁄ You are the Messiah, the Son of the living God! ⁄ He is worthy of our highest praise, ⁄ for he was given this revelation from the Father in heaven! ⁄⁄ He has justly won the power of binding and loosing.
ltx/en_us_oca/me.m06.d29:meMA.Lauds3.incipit	Peter, it is right to…
ltx/en_us_oca/me.m06.d29:meMA.Lauds3.melody	@ltx/en_us_oca/he.a.m4:heAU.OExYpsistouKlitheis.notmetered
ltx/en_us_oca/me.m06.d29:meMA.Lauds3.mode	@ltx/en_us_oca/miscellanea:misc.Mode4
ltx/en_us_oca/me.m06.d29:meMA.Lauds3.text	Peter, it is right to call you the rock! ⁄ The Lord established the unshaken faith of the Church on you. ⁄ He made you the chief shepherd of his reasonable sheep. ⁄ He has entrusted you with the keys of the heavenly gates. ⁄ In His goodness, He commanded you to open to all who draw near in faith. ⁄ Your Master counted you worthy to be crucified. ⁄⁄ Plead with Him to enlighten and save our souls!
ltx/en_us_oca/me.m06.d29:meMA.Lauds4.greekmelody	@ltx/en_us_oca/he.a.m4:heAU.OExYpsistouKlitheis.greekname
ltx/en_us_oca/me.m06.d29:meMA.Lauds4.incipit	…
ltx/en_us_oca/me.m06.d29:meMA.Lauds4.melody	@ltx/en_us_oca/he.a.m4:heAU.OExYpsistouKlitheis.notmetered
ltx/en_us_oca/me.m06.d29:meMA.Lauds4.mode	@ltx/en_us_oca/miscellanea:misc.Mode4
ltx/en_us_oca/me.m06.d29:meMA.Lauds4.text	
ltx/en_us_oca/me.m06.d29:meMA.LaudsGlory.incipit	Assemble, chosen members of Christ’s…
ltx/en_us_oca/me.m06.d29:meMA.LaudsGlory.melody	@ltx/en_us_oca/miscellanea:misc.Idiomelon
ltx/en_us_oca/me.m06.d29:meMA.LaudsGlory.mode	@ltx/en_us_oca/miscellanea:misc.Mode6
ltx/en_us_oca/me.m06.d29:meMA.LaudsGlory.poet	@ltx/en_us_oca/poets:po.KosmaMonachou
ltx/en_us_oca/me.m06.d29:meMA.LaudsGlory.text	Assemble, chosen members of Christ’s holy Church! ⁄ The feast of the honorable apostles dawns upon the earth, ⁄ bringing salvation for us all! ⁄ Clap your hands, all peoples; ⁄ cry out in exultation: ⁄ Rejoice, twin rays of the sun, enlightening us who sit in darkness! ⁄ Rejoice, Peter and Paul, unshakable pillars of divine doctrine! ⁄ Rejoice, friends of Christ and chosen vessels! ⁄ Come, and be present with us in spirit: ⁄⁄ Grant us spiritual gifts as we celebrate your sacred memory in song!
ltx/en_us_oca/me.m06.d29:meMA.LaudsTheotokion.incipit	…
ltx/en_us_oca/me.m06.d29:meMA.LaudsTheotokion.melody	
ltx/en_us_oca/me.m06.d29:meMA.LaudsTheotokion.mode	@ltx/en_us_oca/miscellanea:misc.Mode6
ltx/en_us_oca/me.m06.d29:meMA.LaudsTheotokion.text	
ltx/en_us_oca/me.m06.d29:meMA.MM.Lauds1234as5678.text	@ltx/en_us_oca/properties:media.key
ltx/en_us_oca/me.m06.d29:meMA.MM.Lauds123as456.text	
ltx/en_us_oca/me.m06.d29:meMA.Ode1C11.greekmelody	@ltx/en_us_oca/he.h.m4:heHE.OukEstiSoiOmoios.greekname
ltx/en_us_oca/me.m06.d29:meMA.Ode1C11.incipit	Today let us worthily praise…
ltx/en_us_oca/me.m06.d29:meMA.Ode1C11.melody	@ltx/en_us_oca/he.h.m4:heHE.OukEstiSoiOmoios.notmetered
ltx/en_us_oca/me.m06.d29:meMA.Ode1C11.mode	@ltx/en_us_oca/miscellanea:misc.Mode4
ltx/en_us_oca/me.m06.d29:meMA.Ode1C11.ode	@ltx/en_us_oca/miscellanea:misc.Ode1
ltx/en_us_oca/me.m06.d29:meMA.Ode1C11.text	Today let us worthily praise in inspired songs ⁄ the greatest wonder-worker of the apostles, ⁄ brother of the first-called disciple.
ltx/en_us_oca/me.m06.d29:meMA.Ode1C12.incipit	Most blessed Peter, ⁄ the…
ltx/en_us_oca/me.m06.d29:meMA.Ode1C12.melody	@ltx/en_us_oca/he.h.m4:heHE.OukEstiSoiOmoios.notmetered
ltx/en_us_oca/me.m06.d29:meMA.Ode1C12.mode	@ltx/en_us_oca/miscellanea:misc.Mode4
ltx/en_us_oca/me.m06.d29:meMA.Ode1C12.ode	@ltx/en_us_oca/miscellanea:misc.Ode1
ltx/en_us_oca/me.m06.d29:meMA.Ode1C12.text	Most blessed Peter, ⁄ the Eternal One foresaw you as a prince and a rock, ⁄ the first bishop of the Church.
ltx/en_us_oca/me.m06.d29:meMA.Ode1C13.incipit	Neither flesh nor blood, but…
ltx/en_us_oca/me.m06.d29:meMA.Ode1C13.melody	@ltx/en_us_oca/he.h.m4:heHE.OukEstiSoiOmoios.notmetered
ltx/en_us_oca/me.m06.d29:meMA.Ode1C13.mode	@ltx/en_us_oca/miscellanea:misc.Mode4
ltx/en_us_oca/me.m06.d29:meMA.Ode1C13.ode	@ltx/en_us_oca/miscellanea:misc.Ode1
ltx/en_us_oca/me.m06.d29:meMA.Ode1C13.text	Neither flesh nor blood, but the Father, Apostle, ⁄ inspired you to speak of Christ ⁄ the true Son of the Most High God.
ltx/en_us_oca/me.m06.d29:meMA.Ode1C1H.greekmelody	@ltx/en_us_oca/he.h.m4:heHE.OukEstiSoiOmoios.greekname
ltx/en_us_oca/me.m06.d29:meMA.Ode1C1H.incipit	@ltx/en_us_oca/he.h.m4:heHE.OukEstiSoiOmoios.incipit
ltx/en_us_oca/me.m06.d29:meMA.Ode1C1H.melody	@ltx/en_us_oca/he.h.m4:heHE.OukEstiSoiOmoios.melody
ltx/en_us_oca/me.m06.d29:meMA.Ode1C1H.mode	@ltx/en_us_oca/miscellanea:misc.Mode4
ltx/en_us_oca/me.m06.d29:meMA.Ode1C1H.ode	@ltx/en_us_oca/miscellanea:misc.Ode1
ltx/en_us_oca/me.m06.d29:meMA.Ode1C1H.text	@ltx/en_us_oca/he.h.m4:heHE.OukEstiSoiOmoios.text
ltx/en_us_oca/me.m06.d29:meMA.Ode1C1T.incipit	Let us praise in song…
ltx/en_us_oca/me.m06.d29:meMA.Ode1C1T.melody	@ltx/en_us_oca/he.h.m4:heHE.OukEstiSoiOmoios.notmetered
ltx/en_us_oca/me.m06.d29:meMA.Ode1C1T.mode	@ltx/en_us_oca/miscellanea:misc.Mode4
ltx/en_us_oca/me.m06.d29:meMA.Ode1C1T.ode	@ltx/en_us_oca/miscellanea:misc.Ode1
ltx/en_us_oca/me.m06.d29:meMA.Ode1C1T.text	Let us praise in song the holy Mountain, ⁄ the ineffable chariot, ⁄ the Theotokos who was truly Virgin after giving birth.
ltx/en_us_oca/me.m06.d29:meMA.Ode1C21.greekmelody	@ltx/en_us_oca/he.h.m8:heHE.IKekommeni.greekname
ltx/en_us_oca/me.m06.d29:meMA.Ode1C21.incipit	Christ chose you from your…
ltx/en_us_oca/me.m06.d29:meMA.Ode1C21.melody	@ltx/en_us_oca/he.h.m8:heHE.IKekommeni.notmetered
ltx/en_us_oca/me.m06.d29:meMA.Ode1C21.mode	@ltx/en_us_oca/miscellanea:misc.Mode8
ltx/en_us_oca/me.m06.d29:meMA.Ode1C21.ode	@ltx/en_us_oca/miscellanea:misc.Ode1
ltx/en_us_oca/me.m06.d29:meMA.Ode1C21.text	Christ chose you from your Mother’s womb ⁄ by divine knowledge, most blessed Paul. ⁄ He whose excellence had not been preached ⁄ sent you to carry His holy name above all names to the gentiles, ⁄ for gloriously has He been glorified!
ltx/en_us_oca/me.m06.d29:meMA.Ode1C22.incipit	Christ, against whom you raged…
ltx/en_us_oca/me.m06.d29:meMA.Ode1C22.melody	@ltx/en_us_oca/he.h.m8:heHE.IKekommeni.notmetered
ltx/en_us_oca/me.m06.d29:meMA.Ode1C22.mode	@ltx/en_us_oca/miscellanea:misc.Mode8
ltx/en_us_oca/me.m06.d29:meMA.Ode1C22.ode	@ltx/en_us_oca/miscellanea:misc.Ode1
ltx/en_us_oca/me.m06.d29:meMA.Ode1C22.text	Christ, against whom you raged, O Paul, ⁄ appeared to you in divine brightness cleansing your error, ⁄ His form flashing forth as upon the mountain, ⁄ He darkened your flesh while He gave understanding to your soul ⁄ in the knowledge of the Trinity, ⁄ for gloriously has He been glorified!
ltx/en_us_oca/me.m06.d29:meMA.Ode1C23.incipit	You yielded yourself to the…
ltx/en_us_oca/me.m06.d29:meMA.Ode1C23.melody	@ltx/en_us_oca/he.h.m8:heHE.IKekommeni.notmetered
ltx/en_us_oca/me.m06.d29:meMA.Ode1C23.mode	@ltx/en_us_oca/miscellanea:misc.Mode8
ltx/en_us_oca/me.m06.d29:meMA.Ode1C23.ode	@ltx/en_us_oca/miscellanea:misc.Ode1
ltx/en_us_oca/me.m06.d29:meMA.Ode1C23.text	You yielded yourself to the fulfillment of the eighth day circumcision, ⁄ and were a zealous advocate, Paul: ⁄ a Hebrew of the seed of Benjamin, ⁄ a Pharisee after the law. ⁄ You were manifestly driven to reject all these things as dung, ⁄ and thus you gained Christ ⁄ for gloriously has He been glorified!
ltx/en_us_oca/me.m06.d29:meMA.Ode1C2T.incipit	Undefiled Mother of the Almighty…
ltx/en_us_oca/me.m06.d29:meMA.Ode1C2T.melody	@ltx/en_us_oca/he.h.m8:heHE.IKekommeni.notmetered
ltx/en_us_oca/me.m06.d29:meMA.Ode1C2T.mode	@ltx/en_us_oca/miscellanea:misc.Mode8
ltx/en_us_oca/me.m06.d29:meMA.Ode1C2T.ode	@ltx/en_us_oca/miscellanea:misc.Ode1
ltx/en_us_oca/me.m06.d29:meMA.Ode1C2T.text	Undefiled Mother of the Almighty God ⁄ and Queen of the nations, ⁄ Lady who alone has brought forth God the Lord of all, ⁄ giving birth to Him in the flesh beyond nature: ⁄ preserve me as I sing to your Son, ⁄ for gloriously has He been glorified!
ltx/en_us_oca/me.m06.d29:meMA.Ode3C11.greekmelody	@ltx/en_us_oca/he.h.m4:heHE.OukEnSofia.greekname
ltx/en_us_oca/me.m06.d29:meMA.Ode3C11.incipit	Christ showed you to be…
ltx/en_us_oca/me.m06.d29:meMA.Ode3C11.melody	@ltx/en_us_oca/he.h.m4:heHE.OukEnSofia.notmetered
ltx/en_us_oca/me.m06.d29:meMA.Ode3C11.mode	@ltx/en_us_oca/miscellanea:misc.Mode4
ltx/en_us_oca/me.m06.d29:meMA.Ode3C11.ode	@ltx/en_us_oca/miscellanea:misc.Ode3
ltx/en_us_oca/me.m06.d29:meMA.Ode3C11.text	Christ showed you to be blessed, ⁄ sweetest spokesman of Christ our God ⁄ and the safe-keeper of the Kingdom. ⁄ Therefore we sing your praises, Peter the Apostle!
ltx/en_us_oca/me.m06.d29:meMA.Ode3C12.incipit	The Master Christ has built…
ltx/en_us_oca/me.m06.d29:meMA.Ode3C12.melody	@ltx/en_us_oca/he.h.m4:heHE.OukEnSofia.notmetered
ltx/en_us_oca/me.m06.d29:meMA.Ode3C12.mode	@ltx/en_us_oca/miscellanea:misc.Mode4
ltx/en_us_oca/me.m06.d29:meMA.Ode3C12.ode	@ltx/en_us_oca/miscellanea:misc.Ode3
ltx/en_us_oca/me.m06.d29:meMA.Ode3C12.text	The Master Christ has built the unshakable Church ⁄ on the rock of your Divine teaching ⁄ in which we glorify you, Peter.
ltx/en_us_oca/me.m06.d29:meMA.Ode3C13.incipit	As Peter in the flesh…
ltx/en_us_oca/me.m06.d29:meMA.Ode3C13.melody	@ltx/en_us_oca/he.h.m4:heHE.OukEnSofia.notmetered
ltx/en_us_oca/me.m06.d29:meMA.Ode3C13.mode	@ltx/en_us_oca/miscellanea:misc.Mode4
ltx/en_us_oca/me.m06.d29:meMA.Ode3C13.ode	@ltx/en_us_oca/miscellanea:misc.Ode3
ltx/en_us_oca/me.m06.d29:meMA.Ode3C13.text	As Peter in the flesh is above the angels ⁄ so Christ in His visible coming told him ⁄ that he would sit as a judge with Him.
ltx/en_us_oca/me.m06.d29:meMA.Ode3C1H.greekmelody	@ltx/en_us_oca/he.h.m4:heHE.OukEnSofia.greekname
ltx/en_us_oca/me.m06.d29:meMA.Ode3C1H.incipit	@ltx/en_us_oca/he.h.m4:heHE.OukEnSofia.incipit
ltx/en_us_oca/me.m06.d29:meMA.Ode3C1H.melody	@ltx/en_us_oca/he.h.m4:heHE.OukEnSofia.melody
ltx/en_us_oca/me.m06.d29:meMA.Ode3C1H.mode	@ltx/en_us_oca/miscellanea:misc.Mode4
ltx/en_us_oca/me.m06.d29:meMA.Ode3C1H.ode	@ltx/en_us_oca/miscellanea:misc.Ode3
ltx/en_us_oca/me.m06.d29:meMA.Ode3C1H.text	@ltx/en_us_oca/he.h.m4:heHE.OukEnSofia.text
ltx/en_us_oca/me.m06.d29:meMA.Ode3C1T.incipit	Unwedded, pure One, ⁄ you…
ltx/en_us_oca/me.m06.d29:meMA.Ode3C1T.melody	@ltx/en_us_oca/he.h.m4:heHE.OukEnSofia.notmetered
ltx/en_us_oca/me.m06.d29:meMA.Ode3C1T.mode	@ltx/en_us_oca/miscellanea:misc.Mode4
ltx/en_us_oca/me.m06.d29:meMA.Ode3C1T.ode	@ltx/en_us_oca/miscellanea:misc.Ode3
ltx/en_us_oca/me.m06.d29:meMA.Ode3C1T.text	Unwedded, pure One, ⁄ you conceived the Incarnate God: ⁄ Strengthen me, for I am tossed about by the play of the passions, ⁄ for there is no help but you.
ltx/en_us_oca/me.m06.d29:meMA.Ode3C21.greekmelody	@ltx/en_us_oca/he.h.m8:heHE.SyEiToStereoma.greekname
ltx/en_us_oca/me.m06.d29:meMA.Ode3C21.incipit	You are the foundation stone…
ltx/en_us_oca/me.m06.d29:meMA.Ode3C21.melody	@ltx/en_us_oca/he.h.m8:heHE.SyEiToStereoma.notmetered
ltx/en_us_oca/me.m06.d29:meMA.Ode3C21.mode	@ltx/en_us_oca/miscellanea:misc.Mode8
ltx/en_us_oca/me.m06.d29:meMA.Ode3C21.ode	@ltx/en_us_oca/miscellanea:misc.Ode3
ltx/en_us_oca/me.m06.d29:meMA.Ode3C21.text	You are the foundation stone ⁄ set up for the souls of the faithful. ⁄ One of great price: ⁄ You are the cornerstone of the Savior and Lord.
ltx/en_us_oca/me.m06.d29:meMA.Ode3C22.incipit	Most blessed Paul, ⁄…
ltx/en_us_oca/me.m06.d29:meMA.Ode3C22.melody	@ltx/en_us_oca/he.h.m8:heHE.SyEiToStereoma.notmetered
ltx/en_us_oca/me.m06.d29:meMA.Ode3C22.mode	@ltx/en_us_oca/miscellanea:misc.Mode8
ltx/en_us_oca/me.m06.d29:meMA.Ode3C22.ode	@ltx/en_us_oca/miscellanea:misc.Ode3
ltx/en_us_oca/me.m06.d29:meMA.Ode3C22.text	Most blessed Paul, ⁄ pray that the illumination of the virtues ⁄ may be established on your foundation.
ltx/en_us_oca/me.m06.d29:meMA.Ode3C23.incipit	You, Paul, who bear truthfully…
ltx/en_us_oca/me.m06.d29:meMA.Ode3C23.melody	@ltx/en_us_oca/he.h.m8:heHE.SyEiToStereoma.notmetered
ltx/en_us_oca/me.m06.d29:meMA.Ode3C23.mode	@ltx/en_us_oca/miscellanea:misc.Mode8
ltx/en_us_oca/me.m06.d29:meMA.Ode3C23.ode	@ltx/en_us_oca/miscellanea:misc.Ode3
ltx/en_us_oca/me.m06.d29:meMA.Ode3C23.text	You, Paul, who bear truthfully in your body ⁄ the death of Jesus at all times, ⁄ have been counted worthy of Life.
ltx/en_us_oca/me.m06.d29:meMA.Ode3C2T.incipit	All the generations now saved…
ltx/en_us_oca/me.m06.d29:meMA.Ode3C2T.melody	@ltx/en_us_oca/he.h.m8:heHE.SyEiToStereoma.notmetered
ltx/en_us_oca/me.m06.d29:meMA.Ode3C2T.mode	@ltx/en_us_oca/miscellanea:misc.Mode8
ltx/en_us_oca/me.m06.d29:meMA.Ode3C2T.ode	@ltx/en_us_oca/miscellanea:misc.Ode3
ltx/en_us_oca/me.m06.d29:meMA.Ode3C2T.text	All the generations now saved through you, ⁄ call you blessed, as was prophesied, O pure One!
ltx/en_us_oca/me.m06.d29:meMA.Ode4C11.greekmelody	@ltx/en_us_oca/he.h.m4:heHE.OutosOTheosImon.greekname
ltx/en_us_oca/me.m06.d29:meMA.Ode4C11.incipit	You were a fisher of…
ltx/en_us_oca/me.m06.d29:meMA.Ode4C11.melody	@ltx/en_us_oca/he.h.m4:heHE.OutosOTheosImon.notmetered
ltx/en_us_oca/me.m06.d29:meMA.Ode4C11.mode	@ltx/en_us_oca/miscellanea:misc.Mode4
ltx/en_us_oca/me.m06.d29:meMA.Ode4C11.ode	@ltx/en_us_oca/miscellanea:misc.Ode4
ltx/en_us_oca/me.m06.d29:meMA.Ode4C11.text	You were a fisher of mortal persons, as Christ promised you. ⁄ He made you divine for His Church, ⁄ for even at the start He entrusted you with its guidance.
ltx/en_us_oca/me.m06.d29:meMA.Ode4C12.incipit	Jesus, the Giver of Life…
ltx/en_us_oca/me.m06.d29:meMA.Ode4C12.melody	@ltx/en_us_oca/he.h.m4:heHE.OutosOTheosImon.notmetered
ltx/en_us_oca/me.m06.d29:meMA.Ode4C12.mode	@ltx/en_us_oca/miscellanea:misc.Mode4
ltx/en_us_oca/me.m06.d29:meMA.Ode4C12.ode	@ltx/en_us_oca/miscellanea:misc.Ode4
ltx/en_us_oca/me.m06.d29:meMA.Ode4C12.text	Jesus, the Giver of Life to whom you intercede, ⁄ gave you the right to bind and loose: ⁄ Peter, may He be gracious to me!
ltx/en_us_oca/me.m06.d29:meMA.Ode4C13.incipit	Pray earnestly, Peter, ⁄ that…
ltx/en_us_oca/me.m06.d29:meMA.Ode4C13.melody	@ltx/en_us_oca/he.h.m4:heHE.OutosOTheosImon.notmetered
ltx/en_us_oca/me.m06.d29:meMA.Ode4C13.mode	@ltx/en_us_oca/miscellanea:misc.Mode4
ltx/en_us_oca/me.m06.d29:meMA.Ode4C13.ode	@ltx/en_us_oca/miscellanea:misc.Ode4
ltx/en_us_oca/me.m06.d29:meMA.Ode4C13.text	Pray earnestly, Peter, ⁄ that the kingdom of heaven may be opened ⁄ for those who honor your memory in unswerving faith.
ltx/en_us_oca/me.m06.d29:meMA.Ode4C1H.greekmelody	@ltx/en_us_oca/he.h.m4:heHE.OutosOTheosImon.greekname
ltx/en_us_oca/me.m06.d29:meMA.Ode4C1H.incipit	@ltx/en_us_oca/he.h.m4:heHE.OutosOTheosImon.incipit
ltx/en_us_oca/me.m06.d29:meMA.Ode4C1H.melody	@ltx/en_us_oca/he.h.m4:heHE.OutosOTheosImon.melody
ltx/en_us_oca/me.m06.d29:meMA.Ode4C1H.mode	@ltx/en_us_oca/miscellanea:misc.Mode4
ltx/en_us_oca/me.m06.d29:meMA.Ode4C1H.ode	@ltx/en_us_oca/miscellanea:misc.Ode4
ltx/en_us_oca/me.m06.d29:meMA.Ode4C1H.text	@ltx/en_us_oca/he.h.m4:heHE.OutosOTheosImon.text
ltx/en_us_oca/me.m06.d29:meMA.Ode4C1T.incipit	Honored Queen who conceived God…
ltx/en_us_oca/me.m06.d29:meMA.Ode4C1T.melody	@ltx/en_us_oca/he.h.m4:heHE.OutosOTheosImon.notmetered
ltx/en_us_oca/me.m06.d29:meMA.Ode4C1T.mode	@ltx/en_us_oca/miscellanea:misc.Mode4
ltx/en_us_oca/me.m06.d29:meMA.Ode4C1T.ode	@ltx/en_us_oca/miscellanea:misc.Ode4
ltx/en_us_oca/me.m06.d29:meMA.Ode4C1T.text	Honored Queen who conceived God, ⁄ cleanse our thoughts by your intercessions, ⁄ and show me to be fruitful, ⁄ Mother of the God of all.
ltx/en_us_oca/me.m06.d29:meMA.Ode4C21.greekmelody	@ltx/en_us_oca/he.h.m8:heHE.EpevisEfIppous.greekname
ltx/en_us_oca/me.m06.d29:meMA.Ode4C21.incipit	Once Saul crouched as a…
ltx/en_us_oca/me.m06.d29:meMA.Ode4C21.melody	@ltx/en_us_oca/he.h.m8:heHE.EpevisEfIppous.notmetered
ltx/en_us_oca/me.m06.d29:meMA.Ode4C21.mode	@ltx/en_us_oca/miscellanea:misc.Mode8
ltx/en_us_oca/me.m06.d29:meMA.Ode4C21.ode	@ltx/en_us_oca/miscellanea:misc.Ode4
ltx/en_us_oca/me.m06.d29:meMA.Ode4C21.text	Once Saul crouched as a lion, ⁄ vigilantly destroying the Church of Christ. ⁄ He was seized by the divine voice of the Lamb of God, ⁄ the One whom he had been persecuting. ⁄ He was given charge of the flock, ⁄ entrusted as a preeminent shepherd.
ltx/en_us_oca/me.m06.d29:meMA.Ode4C22.incipit	He who was to enlighten…
ltx/en_us_oca/me.m06.d29:meMA.Ode4C22.melody	@ltx/en_us_oca/he.h.m8:heHE.EpevisEfIppous.notmetered
ltx/en_us_oca/me.m06.d29:meMA.Ode4C22.mode	@ltx/en_us_oca/miscellanea:misc.Mode8
ltx/en_us_oca/me.m06.d29:meMA.Ode4C22.ode	@ltx/en_us_oca/miscellanea:misc.Ode4
ltx/en_us_oca/me.m06.d29:meMA.Ode4C22.text	He who was to enlighten the universe was put in darkness, ⁄ and Ananias was sent to him. ⁄ By Your divine appearing You brought light to his soul and body, ⁄ showing him to be a chosen vessel.
ltx/en_us_oca/me.m06.d29:meMA.Ode4C23.incipit	Damascus was worthily tended by…
ltx/en_us_oca/me.m06.d29:meMA.Ode4C23.melody	@ltx/en_us_oca/he.h.m8:heHE.EpevisEfIppous.notmetered
ltx/en_us_oca/me.m06.d29:meMA.Ode4C23.mode	@ltx/en_us_oca/miscellanea:misc.Mode8
ltx/en_us_oca/me.m06.d29:meMA.Ode4C23.ode	@ltx/en_us_oca/miscellanea:misc.Ode4
ltx/en_us_oca/me.m06.d29:meMA.Ode4C23.text	Damascus was worthily tended by Paul, ⁄ as once from Paradise ⁄ a great river of divine waters flowed, ⁄ moistening the whole earth with the knowledge of God.
ltx/en_us_oca/me.m06.d29:meMA.Ode4C2T.incipit	The Virgin and Mother, as…
ltx/en_us_oca/me.m06.d29:meMA.Ode4C2T.melody	@ltx/en_us_oca/he.h.m8:heHE.EpevisEfIppous.notmetered
ltx/en_us_oca/me.m06.d29:meMA.Ode4C2T.mode	@ltx/en_us_oca/miscellanea:misc.Mode8
ltx/en_us_oca/me.m06.d29:meMA.Ode4C2T.ode	@ltx/en_us_oca/miscellanea:misc.Ode4
ltx/en_us_oca/me.m06.d29:meMA.Ode4C2T.text	The Virgin and Mother, as God had revealed ⁄ put down the mighty from their thrones, ⁄ exalting those of low degree, who sing in faith: ⁄ Glory to Your might, O Lord!
ltx/en_us_oca/me.m06.d29:meMA.Ode5C11.greekmelody	@ltx/en_us_oca/he.h.m4:heHE.OKtisamenosImas.greekname
ltx/en_us_oca/me.m06.d29:meMA.Ode5C11.incipit	The rays of the sun…
ltx/en_us_oca/me.m06.d29:meMA.Ode5C11.melody	@ltx/en_us_oca/he.h.m4:heHE.OKtisamenosImas.notmetered
ltx/en_us_oca/me.m06.d29:meMA.Ode5C11.mode	@ltx/en_us_oca/miscellanea:misc.Mode4
ltx/en_us_oca/me.m06.d29:meMA.Ode5C11.ode	@ltx/en_us_oca/miscellanea:misc.Ode5
ltx/en_us_oca/me.m06.d29:meMA.Ode5C11.text	The rays of the sun were rightly struck with awe, ⁄ before your boldness towards God, springing from love, ⁄ most glorious fisherman who worked wonders through grace!
ltx/en_us_oca/me.m06.d29:meMA.Ode5C12.incipit	Your divine Apostle, O Christ…
ltx/en_us_oca/me.m06.d29:meMA.Ode5C12.melody	@ltx/en_us_oca/he.h.m4:heHE.OKtisamenosImas.notmetered
ltx/en_us_oca/me.m06.d29:meMA.Ode5C12.mode	@ltx/en_us_oca/miscellanea:misc.Mode4
ltx/en_us_oca/me.m06.d29:meMA.Ode5C12.ode	@ltx/en_us_oca/miscellanea:misc.Ode5
ltx/en_us_oca/me.m06.d29:meMA.Ode5C12.text	Your divine Apostle, O Christ, ⁄ did not gain gold or money for You, ⁄ but by the creation of virtue, ⁄ he was rich in the might of wonders.
ltx/en_us_oca/me.m06.d29:meMA.Ode5C13.incipit	People have endured torture…
ltx/en_us_oca/me.m06.d29:meMA.Ode5C13.melody	@ltx/en_us_oca/he.h.m4:heHE.OKtisamenosImas.notmetered
ltx/en_us_oca/me.m06.d29:meMA.Ode5C13.mode	@ltx/en_us_oca/miscellanea:misc.Mode4
ltx/en_us_oca/me.m06.d29:meMA.Ode5C13.ode	@ltx/en_us_oca/miscellanea:misc.Ode5
ltx/en_us_oca/me.m06.d29:meMA.Ode5C13.text	People have endured torture, ⁄ the hammer and the rack, because of your words, ⁄ for through the Spirit of God, ⁄ you have brought new and miraculous things to perfection.
ltx/en_us_oca/me.m06.d29:meMA.Ode5C1H.greekmelody	@ltx/en_us_oca/he.h.m4:heHE.OKtisamenosImas.greekname
ltx/en_us_oca/me.m06.d29:meMA.Ode5C1H.incipit	@ltx/en_us_oca/he.h.m4:heHE.OKtisamenosImas.incipit
ltx/en_us_oca/me.m06.d29:meMA.Ode5C1H.melody	@ltx/en_us_oca/he.h.m4:heHE.OKtisamenosImas.melody
ltx/en_us_oca/me.m06.d29:meMA.Ode5C1H.mode	@ltx/en_us_oca/miscellanea:misc.Mode4
ltx/en_us_oca/me.m06.d29:meMA.Ode5C1H.ode	@ltx/en_us_oca/miscellanea:misc.Ode5
ltx/en_us_oca/me.m06.d29:meMA.Ode5C1H.text	@ltx/en_us_oca/he.h.m4:heHE.OKtisamenosImas.text
ltx/en_us_oca/me.m06.d29:meMA.Ode5C1T.incipit	The Incarnate God has united…
ltx/en_us_oca/me.m06.d29:meMA.Ode5C1T.melody	@ltx/en_us_oca/he.h.m4:heHE.OKtisamenosImas.notmetered
ltx/en_us_oca/me.m06.d29:meMA.Ode5C1T.mode	@ltx/en_us_oca/miscellanea:misc.Mode4
ltx/en_us_oca/me.m06.d29:meMA.Ode5C1T.ode	@ltx/en_us_oca/miscellanea:misc.Ode5
ltx/en_us_oca/me.m06.d29:meMA.Ode5C1T.text	The Incarnate God has united Himself to flesh in His Person ⁄ through you, pure One, ⁄ while remaining unchanged in His bodiless Divine Nature.
ltx/en_us_oca/me.m06.d29:meMA.Ode5C21.greekmelody	@ltx/en_us_oca/he.h.m8:heHE.FotisonImas.greekname
ltx/en_us_oca/me.m06.d29:meMA.Ode5C21.incipit	Paul, you chose the Cross…
ltx/en_us_oca/me.m06.d29:meMA.Ode5C21.melody	@ltx/en_us_oca/he.h.m8:heHE.FotisonImas.notmetered
ltx/en_us_oca/me.m06.d29:meMA.Ode5C21.mode	@ltx/en_us_oca/miscellanea:misc.Mode8
ltx/en_us_oca/me.m06.d29:meMA.Ode5C21.ode	@ltx/en_us_oca/miscellanea:misc.Ode5
ltx/en_us_oca/me.m06.d29:meMA.Ode5C21.text	Paul, you chose the Cross of the Lord Christ ⁄ as your true boast, ⁄ always carrying it, apostle, as a sign of victory.
ltx/en_us_oca/me.m06.d29:meMA.Ode5C22.incipit	For you, to live is…
ltx/en_us_oca/me.m06.d29:meMA.Ode5C22.melody	@ltx/en_us_oca/he.h.m8:heHE.FotisonImas.notmetered
ltx/en_us_oca/me.m06.d29:meMA.Ode5C22.mode	@ltx/en_us_oca/miscellanea:misc.Mode8
ltx/en_us_oca/me.m06.d29:meMA.Ode5C22.ode	@ltx/en_us_oca/miscellanea:misc.Ode5
ltx/en_us_oca/me.m06.d29:meMA.Ode5C22.text	For you, to live is Christ, and to die, great gain. ⁄ for by love you were crucified ⁄ to the One who was crucified for us, ⁄ most glorious Paul.
ltx/en_us_oca/me.m06.d29:meMA.Ode5C23.incipit	You rejoice indeed in the…
ltx/en_us_oca/me.m06.d29:meMA.Ode5C23.melody	@ltx/en_us_oca/he.h.m8:heHE.FotisonImas.notmetered
ltx/en_us_oca/me.m06.d29:meMA.Ode5C23.mode	@ltx/en_us_oca/miscellanea:misc.Mode8
ltx/en_us_oca/me.m06.d29:meMA.Ode5C23.ode	@ltx/en_us_oca/miscellanea:misc.Ode5
ltx/en_us_oca/me.m06.d29:meMA.Ode5C23.text	You rejoice indeed in the Lord, ⁄ honorable Paul, ⁄ for you have put off the body and gone to Christ, ⁄ our God and the Giver of Life.
ltx/en_us_oca/me.m06.d29:meMA.Ode5C2T.incipit	We truly greet you with…
ltx/en_us_oca/me.m06.d29:meMA.Ode5C2T.melody	@ltx/en_us_oca/he.h.m8:heHE.FotisonImas.notmetered
ltx/en_us_oca/me.m06.d29:meMA.Ode5C2T.mode	@ltx/en_us_oca/miscellanea:misc.Mode8
ltx/en_us_oca/me.m06.d29:meMA.Ode5C2T.ode	@ltx/en_us_oca/miscellanea:misc.Ode5
ltx/en_us_oca/me.m06.d29:meMA.Ode5C2T.text	We truly greet you with joy, ⁄ storehouse of virginity, ⁄ recall of our first Mother Eve, ⁄ destroyer of the curse of Adam.
ltx/en_us_oca/me.m06.d29:meMA.Ode6C11.greekmelody	@ltx/en_us_oca/he.h.m4:heHE.EnKiteiChriste.greekname
ltx/en_us_oca/me.m06.d29:meMA.Ode6C11.incipit	In days of old, You…
ltx/en_us_oca/me.m06.d29:meMA.Ode6C11.melody	@ltx/en_us_oca/he.h.m4:heHE.EnKiteiChriste.notmetered
ltx/en_us_oca/me.m06.d29:meMA.Ode6C11.mode	@ltx/en_us_oca/miscellanea:misc.Mode4
ltx/en_us_oca/me.m06.d29:meMA.Ode6C11.ode	@ltx/en_us_oca/miscellanea:misc.Ode6
ltx/en_us_oca/me.m06.d29:meMA.Ode6C11.text	In days of old, You saved Peter, O Christ, ⁄ stretching out Your hand as he walked upon the waters. ⁄ Lead me up as I sink in a storm of great temptations!
ltx/en_us_oca/me.m06.d29:meMA.Ode6C12.incipit	You forsook things that were…
ltx/en_us_oca/me.m06.d29:meMA.Ode6C12.melody	@ltx/en_us_oca/he.h.m4:heHE.EnKiteiChriste.notmetered
ltx/en_us_oca/me.m06.d29:meMA.Ode6C12.mode	@ltx/en_us_oca/miscellanea:misc.Mode4
ltx/en_us_oca/me.m06.d29:meMA.Ode6C12.ode	@ltx/en_us_oca/miscellanea:misc.Ode6
ltx/en_us_oca/me.m06.d29:meMA.Ode6C12.text	You forsook things that were worthless, Peter, ⁄ and as a merchant found what is reality. ⁄ You clearly caught Christ, the Pearl of great price.
ltx/en_us_oca/me.m06.d29:meMA.Ode6C13.incipit	Yet, Peter, senselessly trying to…
ltx/en_us_oca/me.m06.d29:meMA.Ode6C13.melody	@ltx/en_us_oca/he.h.m4:heHE.EnKiteiChriste.notmetered
ltx/en_us_oca/me.m06.d29:meMA.Ode6C13.mode	@ltx/en_us_oca/miscellanea:misc.Mode4
ltx/en_us_oca/me.m06.d29:meMA.Ode6C13.ode	@ltx/en_us_oca/miscellanea:misc.Ode6
ltx/en_us_oca/me.m06.d29:meMA.Ode6C13.text	Yet, Peter, senselessly trying to tempt the Holy Spirit, ⁄ you put to death the One who blessed you as first ⁄ when you clearly confessed God, O blessed one.
ltx/en_us_oca/me.m06.d29:meMA.Ode6C1H.greekmelody	@ltx/en_us_oca/he.h.m4:heHE.EnKiteiChriste.greekname
ltx/en_us_oca/me.m06.d29:meMA.Ode6C1H.incipit	@ltx/en_us_oca/he.h.m4:heHE.EnKiteiChriste.incipit
ltx/en_us_oca/me.m06.d29:meMA.Ode6C1H.melody	@ltx/en_us_oca/he.h.m4:heHE.EnKiteiChriste.melody
ltx/en_us_oca/me.m06.d29:meMA.Ode6C1H.mode	@ltx/en_us_oca/miscellanea:misc.Mode4
ltx/en_us_oca/me.m06.d29:meMA.Ode6C1H.ode	@ltx/en_us_oca/miscellanea:misc.Ode6
ltx/en_us_oca/me.m06.d29:meMA.Ode6C1H.text	@ltx/en_us_oca/he.h.m4:heHE.EnKiteiChriste.text
ltx/en_us_oca/me.m06.d29:meMA.Ode6C1T.incipit	You brought forth the Word…
ltx/en_us_oca/me.m06.d29:meMA.Ode6C1T.melody	@ltx/en_us_oca/he.h.m4:heHE.EnKiteiChriste.notmetered
ltx/en_us_oca/me.m06.d29:meMA.Ode6C1T.mode	@ltx/en_us_oca/miscellanea:misc.Mode4
ltx/en_us_oca/me.m06.d29:meMA.Ode6C1T.ode	@ltx/en_us_oca/miscellanea:misc.Ode6
ltx/en_us_oca/me.m06.d29:meMA.Ode6C1T.text	You brought forth the Word of God, ⁄ Who beyond all nature was made flesh for us. ⁄ Therefore with heart and voice we proclaim you as the Theotokos.
ltx/en_us_oca/me.m06.d29:meMA.Ode6C21.greekmelody	@ltx/en_us_oca/he.h.m8:heHE.TinDeisinEkcheo.greekname
ltx/en_us_oca/me.m06.d29:meMA.Ode6C21.incipit	You turned from created beauty…
ltx/en_us_oca/me.m06.d29:meMA.Ode6C21.melody	@ltx/en_us_oca/he.h.m8:heHE.TinDeisinEkcheo.notmetered
ltx/en_us_oca/me.m06.d29:meMA.Ode6C21.mode	@ltx/en_us_oca/miscellanea:misc.Mode8
ltx/en_us_oca/me.m06.d29:meMA.Ode6C21.ode	@ltx/en_us_oca/miscellanea:misc.Ode6
ltx/en_us_oca/me.m06.d29:meMA.Ode6C21.text	You turned from created beauty, ⁄ struck by love for the Master ⁄ and your desire that all be saved. ⁄ You determined to bear witness to this, blessed Paul, ⁄ and now you pray for the world.
ltx/en_us_oca/me.m06.d29:meMA.Ode6C22.incipit	You nobly imitated the Master…
ltx/en_us_oca/me.m06.d29:meMA.Ode6C22.melody	@ltx/en_us_oca/he.h.m8:heHE.TinDeisinEkcheo.notmetered
ltx/en_us_oca/me.m06.d29:meMA.Ode6C22.mode	@ltx/en_us_oca/miscellanea:misc.Mode8
ltx/en_us_oca/me.m06.d29:meMA.Ode6C22.ode	@ltx/en_us_oca/miscellanea:misc.Ode6
ltx/en_us_oca/me.m06.d29:meMA.Ode6C22.text	You nobly imitated the Master, ⁄ and put Him on as a garment, Paul. ⁄ You were truly all things to all men ⁄ so that you might gain all and save people, ⁄ and truly you netted the ends of the earth for Christ!
ltx/en_us_oca/me.m06.d29:meMA.Ode6C23.incipit	Christ worthily gave you life…
ltx/en_us_oca/me.m06.d29:meMA.Ode6C23.melody	@ltx/en_us_oca/he.h.m8:heHE.TinDeisinEkcheo.notmetered
ltx/en_us_oca/me.m06.d29:meMA.Ode6C23.mode	@ltx/en_us_oca/miscellanea:misc.Mode8
ltx/en_us_oca/me.m06.d29:meMA.Ode6C23.ode	@ltx/en_us_oca/miscellanea:misc.Ode6
ltx/en_us_oca/me.m06.d29:meMA.Ode6C23.text	Christ worthily gave you life in heaven, Apostle Paul: ⁄ for while remaining here, you did not desire an earthly city, blessed one, ⁄ but you were a faithful servant and builder of His mysteries.
ltx/en_us_oca/me.m06.d29:meMA.Ode6C2T.incipit	The Almighty Lord looked down…
ltx/en_us_oca/me.m06.d29:meMA.Ode6C2T.melody	@ltx/en_us_oca/he.h.m8:heHE.TinDeisinEkcheo.notmetered
ltx/en_us_oca/me.m06.d29:meMA.Ode6C2T.mode	@ltx/en_us_oca/miscellanea:misc.Mode8
ltx/en_us_oca/me.m06.d29:meMA.Ode6C2T.ode	@ltx/en_us_oca/miscellanea:misc.Ode6
ltx/en_us_oca/me.m06.d29:meMA.Ode6C2T.text	The Almighty Lord looked down on you. ⁄ He renewed my being as He did great things for you ⁄ as He foretold, all-blameless Mother of God. ⁄ Through you, He saved me from corruption ⁄ as the compassionate One, Theotokos.
ltx/en_us_oca/me.m06.d29:meMA.Ode7C11.greekmelody	@ltx/en_us_oca/he.h.m4:heHE.OEnArchiAnarchos.greekname
ltx/en_us_oca/me.m06.d29:meMA.Ode7C11.incipit	Raised up by the divine…
ltx/en_us_oca/me.m06.d29:meMA.Ode7C11.melody	@ltx/en_us_oca/he.h.m4:heHE.OEnArchiAnarchos.notmetered
ltx/en_us_oca/me.m06.d29:meMA.Ode7C11.mode	@ltx/en_us_oca/miscellanea:misc.Mode4
ltx/en_us_oca/me.m06.d29:meMA.Ode7C11.ode	@ltx/en_us_oca/miscellanea:misc.Ode7
ltx/en_us_oca/me.m06.d29:meMA.Ode7C11.text	Raised up by the divine providence of Christ, Peter, ⁄ you were allowed to imitate Him fully, ⁄ yet also to fall before His Passion beneath the flood of denial.
ltx/en_us_oca/me.m06.d29:meMA.Ode7C12.incipit	Christ who is risen from…
ltx/en_us_oca/me.m06.d29:meMA.Ode7C12.melody	@ltx/en_us_oca/he.h.m4:heHE.OEnArchiAnarchos.notmetered
ltx/en_us_oca/me.m06.d29:meMA.Ode7C12.mode	@ltx/en_us_oca/miscellanea:misc.Mode4
ltx/en_us_oca/me.m06.d29:meMA.Ode7C12.ode	@ltx/en_us_oca/miscellanea:misc.Ode7
ltx/en_us_oca/me.m06.d29:meMA.Ode7C12.text	Christ who is risen from the tomb ⁄ appeared first to you, first-named one: ⁄ the greatly-loved leader of the apostles.
ltx/en_us_oca/me.m06.d29:meMA.Ode7C13.incipit	By His three-fold command, Peter…
ltx/en_us_oca/me.m06.d29:meMA.Ode7C13.melody	@ltx/en_us_oca/he.h.m4:heHE.OEnArchiAnarchos.notmetered
ltx/en_us_oca/me.m06.d29:meMA.Ode7C13.mode	@ltx/en_us_oca/miscellanea:misc.Mode4
ltx/en_us_oca/me.m06.d29:meMA.Ode7C13.ode	@ltx/en_us_oca/miscellanea:misc.Ode7
ltx/en_us_oca/me.m06.d29:meMA.Ode7C13.text	By His three-fold command, Peter, ⁄ the Master strengthens your love, ⁄ healing the three-fold denial that came before the Passion.
ltx/en_us_oca/me.m06.d29:meMA.Ode7C14.incipit	You set a witness of…
ltx/en_us_oca/me.m06.d29:meMA.Ode7C14.melody	@ltx/en_us_oca/he.h.m4:heHE.OEnArchiAnarchos.notmetered
ltx/en_us_oca/me.m06.d29:meMA.Ode7C14.mode	@ltx/en_us_oca/miscellanea:misc.Mode4
ltx/en_us_oca/me.m06.d29:meMA.Ode7C14.ode	@ltx/en_us_oca/miscellanea:misc.Ode7
ltx/en_us_oca/me.m06.d29:meMA.Ode7C14.text	You set a witness of love, Peter, ⁄ before Christ God, the all-seeing Word. ⁄ Therefore He entrusted you with His beloved flock.
ltx/en_us_oca/me.m06.d29:meMA.Ode7C1H.greekmelody	@ltx/en_us_oca/he.h.m4:heHE.OEnArchiAnarchos.greekname
ltx/en_us_oca/me.m06.d29:meMA.Ode7C1H.incipit	@ltx/en_us_oca/he.h.m4:heHE.OEnArchiAnarchos.incipit
ltx/en_us_oca/me.m06.d29:meMA.Ode7C1H.melody	@ltx/en_us_oca/he.h.m4:heHE.OEnArchiAnarchos.melody
ltx/en_us_oca/me.m06.d29:meMA.Ode7C1H.mode	@ltx/en_us_oca/miscellanea:misc.Mode4
ltx/en_us_oca/me.m06.d29:meMA.Ode7C1H.ode	@ltx/en_us_oca/miscellanea:misc.Ode7
ltx/en_us_oca/me.m06.d29:meMA.Ode7C1H.text	@ltx/en_us_oca/he.h.m4:heHE.OEnArchiAnarchos.text
ltx/en_us_oca/me.m06.d29:meMA.Ode7C1T.incipit	We all bless you as…
ltx/en_us_oca/me.m06.d29:meMA.Ode7C1T.melody	@ltx/en_us_oca/he.h.m4:heHE.OEnArchiAnarchos.notmetered
ltx/en_us_oca/me.m06.d29:meMA.Ode7C1T.mode	@ltx/en_us_oca/miscellanea:misc.Mode4
ltx/en_us_oca/me.m06.d29:meMA.Ode7C1T.ode	@ltx/en_us_oca/miscellanea:misc.Ode7
ltx/en_us_oca/me.m06.d29:meMA.Ode7C1T.text	We all bless you as Mother of the God of all ⁄ for you conceived the Incarnate God the Word ⁄ Who shone forth from the pre-eternal Father.
ltx/en_us_oca/me.m06.d29:meMA.Ode7C21.greekmelody	@ltx/en_us_oca/he.h.m8:heHE.EnPedioDeeira.greekname
ltx/en_us_oca/me.m06.d29:meMA.Ode7C21.incipit	You are the Seal and…
ltx/en_us_oca/me.m06.d29:meMA.Ode7C21.melody	@ltx/en_us_oca/he.h.m8:heHE.EnPedioDeeira.notmetered
ltx/en_us_oca/me.m06.d29:meMA.Ode7C21.mode	@ltx/en_us_oca/miscellanea:misc.Mode8
ltx/en_us_oca/me.m06.d29:meMA.Ode7C21.ode	@ltx/en_us_oca/miscellanea:misc.Ode7
ltx/en_us_oca/me.m06.d29:meMA.Ode7C21.text	You are the Seal and Crown of Your Apostles, O Christ, ⁄ and he who was called last of all was before them all in zeal. ⁄ With him, the people of the Church sing to You: ⁄ Blessed are You, the God of our fathers!
ltx/en_us_oca/me.m06.d29:meMA.Ode7C22.incipit	If Your bound servant Paul…
ltx/en_us_oca/me.m06.d29:meMA.Ode7C22.melody	@ltx/en_us_oca/he.h.m8:heHE.EnPedioDeeira.notmetered
ltx/en_us_oca/me.m06.d29:meMA.Ode7C22.mode	@ltx/en_us_oca/miscellanea:misc.Mode8
ltx/en_us_oca/me.m06.d29:meMA.Ode7C22.ode	@ltx/en_us_oca/miscellanea:misc.Ode7
ltx/en_us_oca/me.m06.d29:meMA.Ode7C22.text	If Your bound servant Paul formerly persecuted the Church, ⁄ yet he changed his old impudence by his lasting zeal for You. ⁄ For he gathered together, O Christ, the gentiles who cried: ⁄ Blessed are You, the God of our fathers.
ltx/en_us_oca/me.m06.d29:meMA.Ode7C23.incipit	You preached the Gospel to…
ltx/en_us_oca/me.m06.d29:meMA.Ode7C23.melody	@ltx/en_us_oca/he.h.m8:heHE.EnPedioDeeira.notmetered
ltx/en_us_oca/me.m06.d29:meMA.Ode7C23.mode	@ltx/en_us_oca/miscellanea:misc.Mode8
ltx/en_us_oca/me.m06.d29:meMA.Ode7C23.ode	@ltx/en_us_oca/miscellanea:misc.Ode7
ltx/en_us_oca/me.m06.d29:meMA.Ode7C23.text	You preached the Gospel to all, Paul, ⁄ beginning from Jerusalem to the ends of the earth. ⁄ You reached even the bounds of Illyrium ⁄ where you raised your cry: ⁄ Blessed are You, the God of our fathers!
ltx/en_us_oca/me.m06.d29:meMA.Ode7C24.incipit	You were taken up in…
ltx/en_us_oca/me.m06.d29:meMA.Ode7C24.melody	@ltx/en_us_oca/he.h.m8:heHE.EnPedioDeeira.notmetered
ltx/en_us_oca/me.m06.d29:meMA.Ode7C24.mode	@ltx/en_us_oca/miscellanea:misc.Mode8
ltx/en_us_oca/me.m06.d29:meMA.Ode7C24.ode	@ltx/en_us_oca/miscellanea:misc.Ode7
ltx/en_us_oca/me.m06.d29:meMA.Ode7C24.text	You were taken up in a vision; ⁄ you reached the third heaven, gifted one! ⁄ You heard ineffable words, and cried aloud: ⁄ Glory to the Father most High, and to the Son, ⁄ one throne in brightness, ⁄ for you clearly felt the depth of the Spirit of God.
ltx/en_us_oca/me.m06.d29:meMA.Ode7C2T.incipit	Christ our God came down…
ltx/en_us_oca/me.m06.d29:meMA.Ode7C2T.melody	@ltx/en_us_oca/he.h.m8:heHE.EnPedioDeeira.notmetered
ltx/en_us_oca/me.m06.d29:meMA.Ode7C2T.mode	@ltx/en_us_oca/miscellanea:misc.Mode8
ltx/en_us_oca/me.m06.d29:meMA.Ode7C2T.ode	@ltx/en_us_oca/miscellanea:misc.Ode7
ltx/en_us_oca/me.m06.d29:meMA.Ode7C2T.text	Christ our God came down on you ⁄ as dew on the fleece of wool. ⁄ He came forth from you clothed in flesh, ⁄ uniting that which had been scattered. ⁄ He gave peace on earth and in heaven: ⁄ Blessed are You, the God of our fathers!
ltx/en_us_oca/me.m06.d29:meMA.Ode8C11.greekmelody	@ltx/en_us_oca/he.h.m4:heHE.OTaSympantaFeron.greekname
ltx/en_us_oca/me.m06.d29:meMA.Ode8C11.incipit	The Master foretold, Peter…
ltx/en_us_oca/me.m06.d29:meMA.Ode8C11.melody	@ltx/en_us_oca/he.h.m4:heHE.OTaSympantaFeron.notmetered
ltx/en_us_oca/me.m06.d29:meMA.Ode8C11.mode	@ltx/en_us_oca/miscellanea:misc.Mode4
ltx/en_us_oca/me.m06.d29:meMA.Ode8C11.ode	@ltx/en_us_oca/miscellanea:misc.Ode8
ltx/en_us_oca/me.m06.d29:meMA.Ode8C11.text	The Master foretold, Peter, ⁄ that you would stretch out your hands ⁄ and they would bind you to the Cross. ⁄ He commanded you to follow Him and cry: ⁄ All works of the Lord, bless the Lord!
ltx/en_us_oca/me.m06.d29:meMA.Ode8C12.incipit	Working wonders by the word…
ltx/en_us_oca/me.m06.d29:meMA.Ode8C12.melody	@ltx/en_us_oca/he.h.m4:heHE.OTaSympantaFeron.notmetered
ltx/en_us_oca/me.m06.d29:meMA.Ode8C12.mode	@ltx/en_us_oca/miscellanea:misc.Mode4
ltx/en_us_oca/me.m06.d29:meMA.Ode8C12.ode	@ltx/en_us_oca/miscellanea:misc.Ode8
ltx/en_us_oca/me.m06.d29:meMA.Ode8C12.text	Working wonders by the word of grace, ⁄ you raised Aeneas, greatly stricken with palsy ⁄ and Tabitha who was dead, and who cried: ⁄ All works of the Lord, bless the Lord!
ltx/en_us_oca/me.m06.d29:meMA.Ode8C13.incipit	Christ, who plainly taught Peter…
ltx/en_us_oca/me.m06.d29:meMA.Ode8C13.melody	@ltx/en_us_oca/he.h.m4:heHE.OTaSympantaFeron.notmetered
ltx/en_us_oca/me.m06.d29:meMA.Ode8C13.mode	@ltx/en_us_oca/miscellanea:misc.Mode4
ltx/en_us_oca/me.m06.d29:meMA.Ode8C13.ode	@ltx/en_us_oca/miscellanea:misc.Ode8
ltx/en_us_oca/me.m06.d29:meMA.Ode8C13.text	Christ, who plainly taught Peter that the gentiles were clean, ⁄ cleanse my thoughts also by the radiance of the Spirit as I cry: ⁄ All works of the Lord, bless the Lord!
ltx/en_us_oca/me.m06.d29:meMA.Ode8C1H.greekmelody	@ltx/en_us_oca/he.h.m4:heHE.OTaSympantaFeron.greekname
ltx/en_us_oca/me.m06.d29:meMA.Ode8C1H.incipit	@ltx/en_us_oca/he.h.m4:heHE.OTaSympantaFeron.incipit
ltx/en_us_oca/me.m06.d29:meMA.Ode8C1H.melody	@ltx/en_us_oca/he.h.m4:heHE.OTaSympantaFeron.melody
ltx/en_us_oca/me.m06.d29:meMA.Ode8C1H.mode	@ltx/en_us_oca/miscellanea:misc.Mode4
ltx/en_us_oca/me.m06.d29:meMA.Ode8C1H.ode	@ltx/en_us_oca/miscellanea:misc.Ode8
ltx/en_us_oca/me.m06.d29:meMA.Ode8C1H.text	@ltx/en_us_oca/he.h.m4:heHE.OTaSympantaFeron.text
ltx/en_us_oca/me.m06.d29:meMA.Ode8C1T.incipit	One of the holy Persons…
ltx/en_us_oca/me.m06.d29:meMA.Ode8C1T.melody	@ltx/en_us_oca/he.h.m4:heHE.OTaSympantaFeron.notmetered
ltx/en_us_oca/me.m06.d29:meMA.Ode8C1T.mode	@ltx/en_us_oca/miscellanea:misc.Mode4
ltx/en_us_oca/me.m06.d29:meMA.Ode8C1T.ode	@ltx/en_us_oca/miscellanea:misc.Ode8
ltx/en_us_oca/me.m06.d29:meMA.Ode8C1T.text	One of the holy Persons has dwelt in you, Virgin, ⁄ and the Godhead has been entirely united with my being. ⁄ Therefore we bless you as the Theotokos.
ltx/en_us_oca/me.m06.d29:meMA.Ode8C21.greekmelody	@ltx/en_us_oca/he.h.m8:heHE.TonEnOreiAgio.greekname
ltx/en_us_oca/me.m06.d29:meMA.Ode8C21.incipit	You were stirred by your…
ltx/en_us_oca/me.m06.d29:meMA.Ode8C21.melody	@ltx/en_us_oca/he.h.m8:heHE.TonEnOreiAgio.notmetered
ltx/en_us_oca/me.m06.d29:meMA.Ode8C21.mode	@ltx/en_us_oca/miscellanea:misc.Mode8
ltx/en_us_oca/me.m06.d29:meMA.Ode8C21.ode	@ltx/en_us_oca/miscellanea:misc.Ode8
ltx/en_us_oca/me.m06.d29:meMA.Ode8C21.text	You were stirred by your love, Paul, ⁄ and left behind a good exchange: ⁄ for you did not live for yourself, glorious one, ⁄ but had the compassionate One living in you forever.
ltx/en_us_oca/me.m06.d29:meMA.Ode8C22.incipit	You betrothed the Church…
ltx/en_us_oca/me.m06.d29:meMA.Ode8C22.melody	@ltx/en_us_oca/he.h.m8:heHE.TonEnOreiAgio.notmetered
ltx/en_us_oca/me.m06.d29:meMA.Ode8C22.mode	@ltx/en_us_oca/miscellanea:misc.Mode8
ltx/en_us_oca/me.m06.d29:meMA.Ode8C22.ode	@ltx/en_us_oca/miscellanea:misc.Ode8
ltx/en_us_oca/me.m06.d29:meMA.Ode8C22.text	You betrothed the Church ⁄ as a Bride presented to the Bridegroom Christ, ⁄ for you, Paul, showed yourself as the leader of the Bride! ⁄ Therefore you are honored forever.
ltx/en_us_oca/me.m06.d29:meMA.Ode8C23.incipit	You fought the good fight…
ltx/en_us_oca/me.m06.d29:meMA.Ode8C23.melody	@ltx/en_us_oca/he.h.m8:heHE.TonEnOreiAgio.notmetered
ltx/en_us_oca/me.m06.d29:meMA.Ode8C23.mode	@ltx/en_us_oca/miscellanea:misc.Mode8
ltx/en_us_oca/me.m06.d29:meMA.Ode8C23.ode	@ltx/en_us_oca/miscellanea:misc.Ode8
ltx/en_us_oca/me.m06.d29:meMA.Ode8C23.text	You fought the good fight and fairly finished the course; ⁄ you kept the treasures of the faith, ⁄ and so you have gone rejoicing to Christ, leading one, ⁄ counted worthy of the crowns of righteousness, O Paul.
ltx/en_us_oca/me.m06.d29:meMA.Ode8C2T.incipit	Rejoice, fiery Throne of the…
ltx/en_us_oca/me.m06.d29:meMA.Ode8C2T.melody	@ltx/en_us_oca/he.h.m8:heHE.TonEnOreiAgio.notmetered
ltx/en_us_oca/me.m06.d29:meMA.Ode8C2T.mode	@ltx/en_us_oca/miscellanea:misc.Mode8
ltx/en_us_oca/me.m06.d29:meMA.Ode8C2T.ode	@ltx/en_us_oca/miscellanea:misc.Ode8
ltx/en_us_oca/me.m06.d29:meMA.Ode8C2T.text	Rejoice, fiery Throne of the Lord, ⁄ Rejoice, unwedded Bride! ⁄ Rejoice, radiant Cloud bringing forth the Sun of righteousness ⁄ Whom we exalt above all forever.
ltx/en_us_oca/me.m06.d29:meMA.Ode9C11.greekmelody	@ltx/en_us_oca/he.h.m4:heHE.SeTinYperendoxonNymfin.greekname
ltx/en_us_oca/me.m06.d29:meMA.Ode9C11.incipit	Your eminent grace is manifested…
ltx/en_us_oca/me.m06.d29:meMA.Ode9C11.melody	@ltx/en_us_oca/he.h.m4:heHE.SeTinYperendoxonNymfin.notmetered
ltx/en_us_oca/me.m06.d29:meMA.Ode9C11.mode	@ltx/en_us_oca/miscellanea:misc.Mode4
ltx/en_us_oca/me.m06.d29:meMA.Ode9C11.ode	@ltx/en_us_oca/miscellanea:misc.Ode9
ltx/en_us_oca/me.m06.d29:meMA.Ode9C11.text	Your eminent grace is manifested worthily, Peter, ⁄ and it banishes the suffering of the shadow of your weaknesses. ⁄ Therefore we magnify you.
ltx/en_us_oca/me.m06.d29:meMA.Ode9C12.incipit	Simon the magician was puffed…
ltx/en_us_oca/me.m06.d29:meMA.Ode9C12.melody	@ltx/en_us_oca/he.h.m4:heHE.SeTinYperendoxonNymfin.notmetered
ltx/en_us_oca/me.m06.d29:meMA.Ode9C12.mode	@ltx/en_us_oca/miscellanea:misc.Mode4
ltx/en_us_oca/me.m06.d29:meMA.Ode9C12.ode	@ltx/en_us_oca/miscellanea:misc.Ode9
ltx/en_us_oca/me.m06.d29:meMA.Ode9C12.text	Simon the magician was puffed up with his mysteries, ⁄ but Peter brought him down ineffably with divine might and is blessed.
ltx/en_us_oca/me.m06.d29:meMA.Ode9C13.incipit	By your prayers, Apostle…
ltx/en_us_oca/me.m06.d29:meMA.Ode9C13.melody	@ltx/en_us_oca/he.h.m4:heHE.SeTinYperendoxonNymfin.notmetered
ltx/en_us_oca/me.m06.d29:meMA.Ode9C13.mode	@ltx/en_us_oca/miscellanea:misc.Mode4
ltx/en_us_oca/me.m06.d29:meMA.Ode9C13.ode	@ltx/en_us_oca/miscellanea:misc.Ode9
ltx/en_us_oca/me.m06.d29:meMA.Ode9C13.text	By your prayers, Apostle, ⁄ grant remission of sins and enlightenment of heart ⁄ with gladness of spirit to those who sing your memorial.
ltx/en_us_oca/me.m06.d29:meMA.Ode9C1H.greekmelody	@ltx/en_us_oca/he.h.m4:heHE.SeTinYperendoxonNymfin.greekname
ltx/en_us_oca/me.m06.d29:meMA.Ode9C1H.incipit	@ltx/en_us_oca/he.h.m4:heHE.SeTinYperendoxonNymfin.incipit
ltx/en_us_oca/me.m06.d29:meMA.Ode9C1H.melody	@ltx/en_us_oca/he.h.m4:heHE.SeTinYperendoxonNymfin.melody
ltx/en_us_oca/me.m06.d29:meMA.Ode9C1H.mode	@ltx/en_us_oca/miscellanea:misc.Mode4
ltx/en_us_oca/me.m06.d29:meMA.Ode9C1H.ode	@ltx/en_us_oca/miscellanea:misc.Ode9
ltx/en_us_oca/me.m06.d29:meMA.Ode9C1H.text	@ltx/en_us_oca/he.h.m4:heHE.SeTinYperendoxonNymfin.text
ltx/en_us_oca/me.m06.d29:meMA.Ode9C1T.incipit	Virgin who conceived God…
ltx/en_us_oca/me.m06.d29:meMA.Ode9C1T.melody	@ltx/en_us_oca/he.h.m4:heHE.SeTinYperendoxonNymfin.notmetered
ltx/en_us_oca/me.m06.d29:meMA.Ode9C1T.mode	@ltx/en_us_oca/miscellanea:misc.Mode4
ltx/en_us_oca/me.m06.d29:meMA.Ode9C1T.ode	@ltx/en_us_oca/miscellanea:misc.Ode9
ltx/en_us_oca/me.m06.d29:meMA.Ode9C1T.text	Virgin who conceived God, ⁄ you are named Theotokos. ⁄ Therefore the faithful rightly glorify you together, ⁄ and magnify you in songs.
ltx/en_us_oca/me.m06.d29:meMA.Ode9C21.greekmelody	@ltx/en_us_oca/he.h.m8:heHE.OrousParilthes.greekname
ltx/en_us_oca/me.m06.d29:meMA.Ode9C21.incipit	We venerate the chains you…
ltx/en_us_oca/me.m06.d29:meMA.Ode9C21.melody	@ltx/en_us_oca/he.h.m8:heHE.OrousParilthes.notmetered
ltx/en_us_oca/me.m06.d29:meMA.Ode9C21.mode	@ltx/en_us_oca/miscellanea:misc.Mode8
ltx/en_us_oca/me.m06.d29:meMA.Ode9C21.ode	@ltx/en_us_oca/miscellanea:misc.Ode9
ltx/en_us_oca/me.m06.d29:meMA.Ode9C21.text	We venerate the chains you wore ⁄ as a criminal for the sake of Christ, ⁄ and with our lips we honor the marks you bear ⁄ on your glorious and triumphant body.
ltx/en_us_oca/me.m06.d29:meMA.Ode9C22.incipit	Now you are set free…
ltx/en_us_oca/me.m06.d29:meMA.Ode9C22.melody	@ltx/en_us_oca/he.h.m8:heHE.OrousParilthes.notmetered
ltx/en_us_oca/me.m06.d29:meMA.Ode9C22.mode	@ltx/en_us_oca/miscellanea:misc.Mode8
ltx/en_us_oca/me.m06.d29:meMA.Ode9C22.ode	@ltx/en_us_oca/miscellanea:misc.Ode9
ltx/en_us_oca/me.m06.d29:meMA.Ode9C22.text	Now you are set free, Apostle, ⁄ to the One whom you desired from eternity. ⁄ Now you dwell with Him as His servant, ⁄ drawing your servants by your prayers.
ltx/en_us_oca/me.m06.d29:meMA.Ode9C23.incipit	Christ is no longer seen…
ltx/en_us_oca/me.m06.d29:meMA.Ode9C23.melody	@ltx/en_us_oca/he.h.m8:heHE.OrousParilthes.notmetered
ltx/en_us_oca/me.m06.d29:meMA.Ode9C23.mode	@ltx/en_us_oca/miscellanea:misc.Mode8
ltx/en_us_oca/me.m06.d29:meMA.Ode9C23.ode	@ltx/en_us_oca/miscellanea:misc.Ode9
ltx/en_us_oca/me.m06.d29:meMA.Ode9C23.text	Christ is no longer seen by you in hidden sayings ⁄ or in a dark glass, ⁄ but face to face you behold Him ⁄ revealing perfect understanding of the divine Nature to you.
ltx/en_us_oca/me.m06.d29:meMA.Ode9C2T.incipit	Virgin, you bore the Incarnate…
ltx/en_us_oca/me.m06.d29:meMA.Ode9C2T.melody	@ltx/en_us_oca/he.h.m8:heHE.OrousParilthes.notmetered
ltx/en_us_oca/me.m06.d29:meMA.Ode9C2T.mode	@ltx/en_us_oca/miscellanea:misc.Mode8
ltx/en_us_oca/me.m06.d29:meMA.Ode9C2T.ode	@ltx/en_us_oca/miscellanea:misc.Ode9
ltx/en_us_oca/me.m06.d29:meMA.Ode9C2T.text	Virgin, you bore the Incarnate Word, ⁄ Who as the Word without flesh desired to renew my nature. ⁄ Therefore we magnify you without ceasing, Theotokos!
ltx/en_us_oca/me.m06.d29:meMA.Oikos1.text	Open my mouth, my Savior, and let my tongue speak plainly. Fill me full and give my heart compunction, that I may follow the things I say and first do the things I teach. For Paul has said that whoever does what he teaches is great, but if I say things and do not follow them, I am counted as sounding brass. Therefore teach me what to speak, and let me do what is right, ⁄⁄ Only Searcher of the hearts of men.
ltx/en_us_oca/me.m06.d29:meMA.PostGospelBoth.incipit	@ltx/en_us_oca/ho.ho03:hoMA.PostGospelTheotokos.incipit
ltx/en_us_oca/me.m06.d29:meMA.PostGospelBoth.melody	
ltx/en_us_oca/me.m06.d29:meMA.PostGospelBoth.mode	@ltx/en_us_oca/miscellanea:misc.Mode2
ltx/en_us_oca/me.m06.d29:meMA.PostGospelBoth.text	@ltx/en_us_oca/ho.ho03:hoMA.PostGospelTheotokos.text
ltx/en_us_oca/me.m06.d29:meMA.PostGospelGlory.incipit	@ltx/en_us_oca/ho.ho03:hoMA.PostGospelApostles.incipit
ltx/en_us_oca/me.m06.d29:meMA.PostGospelGlory.melody	
ltx/en_us_oca/me.m06.d29:meMA.PostGospelGlory.mode	@ltx/en_us_oca/miscellanea:misc.Mode2
ltx/en_us_oca/me.m06.d29:meMA.PostGospelGlory.text	@ltx/en_us_oca/ho.ho03:hoMA.PostGospelApostles.text
ltx/en_us_oca/me.m06.d29:meMA.PostGospelIdiomelon.incipit	@ltx/en_us_oca/me.m06.d29:meVE.Lity3.incipit
ltx/en_us_oca/me.m06.d29:meMA.PostGospelIdiomelon.melody	@ltx/en_us_oca/miscellanea:misc.Idiomelon
ltx/en_us_oca/me.m06.d29:meMA.PostGospelIdiomelon.mode	@ltx/en_us_oca/miscellanea:misc.Mode2
ltx/en_us_oca/me.m06.d29:meMA.PostGospelIdiomelon.text	@ltx/en_us_oca/me.m06.d29:meVE.Lity3.text
ltx/en_us_oca/me.m06.d29:meSV.AposGlory.incipit	…
ltx/en_us_oca/me.m06.d29:meSV.AposGlory.melody	@ltx/en_us_oca/he.a.m6:heAU.TriimerosAnestis.notmetered
ltx/en_us_oca/me.m06.d29:meSV.AposGlory.mode	@ltx/en_us_oca/miscellanea:misc.Mode6
ltx/en_us_oca/me.m06.d29:meSV.AposGlory.text	
ltx/en_us_oca/me.m06.d29:meSV.Aposticha1.incipit	…
ltx/en_us_oca/me.m06.d29:meSV.Aposticha1.melody	@ltx/en_us_oca/he.a.m6:heAU.TriimerosAnestis.notmetered
ltx/en_us_oca/me.m06.d29:meSV.Aposticha1.mode	@ltx/en_us_oca/miscellanea:misc.Mode6
ltx/en_us_oca/me.m06.d29:meSV.Aposticha1.text	
ltx/en_us_oca/me.m06.d29:meSV.Aposticha2.incipit	…
ltx/en_us_oca/me.m06.d29:meSV.Aposticha2.melody	@ltx/en_us_oca/he.a.m6:heAU.TriimerosAnestis.notmetered
ltx/en_us_oca/me.m06.d29:meSV.Aposticha2.mode	@ltx/en_us_oca/miscellanea:misc.Mode6
ltx/en_us_oca/me.m06.d29:meSV.Aposticha2.text	
ltx/en_us_oca/me.m06.d29:meSV.Aposticha3.incipit	…
ltx/en_us_oca/me.m06.d29:meSV.Aposticha3.melody	@ltx/en_us_oca/he.a.m6:heAU.TriimerosAnestis.notmetered
ltx/en_us_oca/me.m06.d29:meSV.Aposticha3.mode	@ltx/en_us_oca/miscellanea:misc.Mode6
ltx/en_us_oca/me.m06.d29:meSV.Aposticha3.text	
ltx/en_us_oca/me.m06.d29:meSV.SticBoth.incipit	…
ltx/en_us_oca/me.m06.d29:meSV.SticBoth.melody	
ltx/en_us_oca/me.m06.d29:meSV.SticBoth.mode	@ltx/en_us_oca/miscellanea:misc.Mode2
ltx/en_us_oca/me.m06.d29:meSV.SticBoth.text	
ltx/en_us_oca/me.m06.d29:meSV.SticGlory.incipit	…
ltx/en_us_oca/me.m06.d29:meSV.SticGlory.melody	@ltx/en_us_oca/miscellanea:misc.Idiomelon
ltx/en_us_oca/me.m06.d29:meSV.SticGlory.mode	@ltx/en_us_oca/miscellanea:misc.Mode2
ltx/en_us_oca/me.m06.d29:meSV.SticGlory.poet	@ltx/en_us_oca/poets:po.Germanou
ltx/en_us_oca/me.m06.d29:meSV.SticGlory.text	
ltx/en_us_oca/me.m06.d29:meSV.Stichera1.incipit	…
ltx/en_us_oca/me.m06.d29:meSV.Stichera1.melody	@ltx/en_us_oca/he.a.m4:heAU.EdokasSimeiosin.notmetered
ltx/en_us_oca/me.m06.d29:meSV.Stichera1.mode	@ltx/en_us_oca/miscellanea:misc.Mode4
ltx/en_us_oca/me.m06.d29:meSV.Stichera1.text	
ltx/en_us_oca/me.m06.d29:meSV.Stichera2.incipit	…
ltx/en_us_oca/me.m06.d29:meSV.Stichera2.melody	@ltx/en_us_oca/he.a.m4:heAU.EdokasSimeiosin.notmetered
ltx/en_us_oca/me.m06.d29:meSV.Stichera2.mode	@ltx/en_us_oca/miscellanea:misc.Mode4
ltx/en_us_oca/me.m06.d29:meSV.Stichera2.text	
ltx/en_us_oca/me.m06.d29:meSV.Stichera3.incipit	…
ltx/en_us_oca/me.m06.d29:meSV.Stichera3.melody	@ltx/en_us_oca/he.a.m4:heAU.EdokasSimeiosin.notmetered
ltx/en_us_oca/me.m06.d29:meSV.Stichera3.mode	@ltx/en_us_oca/miscellanea:misc.Mode4
ltx/en_us_oca/me.m06.d29:meSV.Stichera3.text	
ltx/en_us_oca/me.m06.d29:meVE.Apolytikion1.incipit	@ltx/en_us_oca/oc.m4.d5:ocMA.Kathisma11.incipit
ltx/en_us_oca/me.m06.d29:meVE.Apolytikion1.melody	
ltx/en_us_oca/me.m06.d29:meVE.Apolytikion1.mode	@ltx/en_us_oca/miscellanea:misc.Mode4
ltx/en_us_oca/me.m06.d29:meVE.Apolytikion1.text	@ltx/en_us_oca/oc.m4.d5:ocMA.Kathisma11.text
ltx/en_us_oca/me.m06.d29:meVE.AposGlory.incipit	A joyful feast dawns upon…
ltx/en_us_oca/me.m06.d29:meVE.AposGlory.melody	@ltx/en_us_oca/miscellanea:misc.Idiomelon
ltx/en_us_oca/me.m06.d29:meVE.AposGlory.mode	@ltx/en_us_oca/miscellanea:misc.Mode6
ltx/en_us_oca/me.m06.d29:meVE.AposGlory.poet	@ltx/en_us_oca/poets:po.EfraimKarias
ltx/en_us_oca/me.m06.d29:meVE.AposGlory.text	A joyful feast dawns upon the earth today: ⁄ The memorial of Peter and Paul, ⁄ the wise leaders of the apostles. ⁄ Let Rome rejoice and be glad with us! ⁄ Let us keep feast, brethren, in songs and hymns, ⁄ Rejoice, apostle Peter, true friend of Christ our God! ⁄ Rejoice, beloved Paul, herald of the faith and teacher of the universe! ⁄ You have boldness before Him, chosen pair: ⁄⁄ Pray unceasingly that our souls may be saved!
ltx/en_us_oca/me.m06.d29:meVE.AposTheotokion.incipit	…
ltx/en_us_oca/me.m06.d29:meVE.AposTheotokion.melody	
ltx/en_us_oca/me.m06.d29:meVE.AposTheotokion.mode	@ltx/en_us_oca/miscellanea:misc.Mode6
ltx/en_us_oca/me.m06.d29:meVE.AposTheotokion.text	
ltx/en_us_oca/me.m06.d29:meVE.Aposticha1.incipit	Glorious apostle Paul…
ltx/en_us_oca/me.m06.d29:meVE.Aposticha1.melody	@ltx/en_us_oca/miscellanea:misc.Idiomelon
ltx/en_us_oca/me.m06.d29:meVE.Aposticha1.mode	@ltx/en_us_oca/miscellanea:misc.Mode1
ltx/en_us_oca/me.m06.d29:meVE.Aposticha1.poet	@ltx/en_us_oca/poets:po.AndreouKritis
ltx/en_us_oca/me.m06.d29:meVE.Aposticha1.text	Glorious apostle Paul, ⁄ who can describe your bondage and tribulations in the cities? ⁄ Who can speak of your endless toil and effort for the gospel of Christ? ⁄ You labored to gain all mankind, ⁄ and lead them into Christ’s holy Church. ⁄ Pray that she may guard your true confession to the ends of the world, ⁄⁄ Paul, apostle and teacher of the churches!
ltx/en_us_oca/me.m06.d29:meVE.Aposticha2.incipit	Glorious apostle…
ltx/en_us_oca/me.m06.d29:meVE.Aposticha2.melody	@ltx/en_us_oca/miscellanea:misc.Idiomelon
ltx/en_us_oca/me.m06.d29:meVE.Aposticha2.mode	@ltx/en_us_oca/miscellanea:misc.Mode1
ltx/en_us_oca/me.m06.d29:meVE.Aposticha2.text	Glorious apostle Paul, ⁄ who can describe your bondage and tribulations in the cities? ⁄ You kept vigil in hunger and thirst; cold, naked and weary; ⁄ you fled Damascus for your life, let down in a basket through the wall. ⁄ Your back was torn by rods of iron, ⁄ you were stoned, you were kept a prisoner under guard. ⁄ You were shipwrecked, cast adrift in the open sea. ⁄ Truly you are a spectacle for angels and for mankind! ⁄ You endured all these things for Jesus Christ, your Lord and your strength, ⁄ that you might win the whole world for Him! ⁄ We entreat you, as we faithfully keep your memory: ⁄⁄ Pray unceasingly that our souls may be saved.
ltx/en_us_oca/me.m06.d29:meVE.Aposticha3.incipit	Let us praise Peter and Paul…
ltx/en_us_oca/me.m06.d29:meVE.Aposticha3.melody	@ltx/en_us_oca/miscellanea:misc.Idiomelon
ltx/en_us_oca/me.m06.d29:meVE.Aposticha3.mode	@ltx/en_us_oca/miscellanea:misc.Mode1
ltx/en_us_oca/me.m06.d29:meVE.Aposticha3.text	Let us praise Peter and Paul, ⁄ the two great stars of the Church. ⁄ They shine brighter than the sun in the sky of faith. ⁄ Let the nations follow the rays of their preaching, ⁄ and be led from ignorance to knowledge divine. ⁄ One was nailed to the Cross: ⁄ He received the keys of the Kingdom from Christ in heaven. ⁄ The other, beheaded by the sword, departed to the Savior. ⁄ He is worthily counted blessed. ⁄ Together they proclaim to Israel: ⁄ He Who was stretched out on the Cross is the Lord of all! ⁄ By their prayers, Christ our God, ⁄ strengthen the Orthodox Faith and destroy our enemies, ⁄⁄ as you are the Lover of mankind!
ltx/en_us_oca/me.m06.d29:meVE.Lity1.incipit	Let us come today…
ltx/en_us_oca/me.m06.d29:meVE.Lity1.melody	@ltx/en_us_oca/miscellanea:misc.Idiomelon
ltx/en_us_oca/me.m06.d29:meVE.Lity1.mode	@ltx/en_us_oca/miscellanea:misc.Mode2
ltx/en_us_oca/me.m06.d29:meVE.Lity1.poet	@ltx/en_us_oca/poets:po.AndreouIerosolymitou
ltx/en_us_oca/me.m06.d29:meVE.Lity1.text	Let us come today and gather in chorus, ⁄ live offering of the faithful! ⁄ Let us exalt the apostles Peter and Paul, ⁄ the two vessels of grace. ⁄ Let us worthily crown them with praises! ⁄ For they bountifully spread the seed of the Word, ⁄ giving all mankind its rich harvest. ⁄ Filled with the grace of the Spirit ⁄ they were branches of the true vine ⁄ who tended the fruit that gladdens our hearts. ⁄ Let us sing to them with unveiled faces and pure hearts: ⁄ Rejoice, guides of those without reason, ⁄ who cared for those who gained wisdom! ⁄ Rejoice, chosen friends of the Creator! ⁄ Rejoice, stewards of bounty and foes of illusion! ⁄ Let us ever pray to them ⁄ that they may intercede with their Creator and Master ⁄ that He may grant peace to the world ⁄⁄ and great mercy to our souls!
ltx/en_us_oca/me.m06.d29:meVE.Lity2.incipit	Let us praise as champions…
ltx/en_us_oca/me.m06.d29:meVE.Lity2.melody	@ltx/en_us_oca/miscellanea:misc.Idiomelon
ltx/en_us_oca/me.m06.d29:meVE.Lity2.mode	@ltx/en_us_oca/miscellanea:misc.Mode2
ltx/en_us_oca/me.m06.d29:meVE.Lity2.poet	@ltx/en_us_oca/poets:po.Arseniou
ltx/en_us_oca/me.m06.d29:meVE.Lity2.text	Let us praise as champions of all the world ⁄ those leaders Peter and Paul: ⁄ The disciples of Christ, and founders of the Church, ⁄ true foundations, pillars and trumpets of inspiration ⁄ sounding forth the teachings and sufferings of Christ! ⁄ They indeed went out into all the earth ⁄ as husbandmen spreading the seed of the faith, ⁄ planting for all mankind divine understanding, ⁄ revealing the Word of the Trinity. ⁄ Peter, rock and foundation! ⁄ And Paul, the chosen vessel! ⁄ You were Christ’s yoke of oxen, drawing all to the knowledge of God: ⁄ The gentiles, men of the cities and islands, ⁄ and returning the Jewish people to Christ. ⁄⁄ Now you both intercede that our souls may be saved!
ltx/en_us_oca/me.m06.d29:meVE.Lity3.incipit	Peter, leader of the glorious apostles…
ltx/en_us_oca/me.m06.d29:meVE.Lity3.melody	@ltx/en_us_oca/miscellanea:misc.Idiomelon
ltx/en_us_oca/me.m06.d29:meVE.Lity3.mode	@ltx/en_us_oca/miscellanea:misc.Mode2
ltx/en_us_oca/me.m06.d29:meVE.Lity3.poet	@ltx/en_us_oca/poets:po.Germanou
ltx/en_us_oca/me.m06.d29:meVE.Lity3.text	Peter, leader of the glorious apostles and rock of the faith! ⁄ And Paul, divinely inspired orator and light of the holy churches, ⁄ as you stand before the throne of God, ⁄⁄ you intercede with Christ for our souls.
ltx/en_us_oca/me.m06.d29:meVE.Lity4.incipit	Paul, the spokesman…
ltx/en_us_oca/me.m06.d29:meVE.Lity4.melody	@ltx/en_us_oca/miscellanea:misc.Idiomelon
ltx/en_us_oca/me.m06.d29:meVE.Lity4.mode	@ltx/en_us_oca/miscellanea:misc.Mode2
ltx/en_us_oca/me.m06.d29:meVE.Lity4.text	Paul, the spokesman of Christ and founder of His teachings, ⁄ who before persecuted Jesus the Savior, ⁄ now you fill the first throne of the apostles, blessed one. ⁄ Thus you saw things which cannot be spoken, ⁄ and ascending to the third heaven you cried: ⁄⁄ ome with me, and be filled with good things!
ltx/en_us_oca/me.m06.d29:meVE.Lity5.incipit	Citizens of heavenly Jerusalem…
ltx/en_us_oca/me.m06.d29:meVE.Lity5.melody	@ltx/en_us_oca/miscellanea:misc.Idiomelon
ltx/en_us_oca/me.m06.d29:meVE.Lity5.mode	@ltx/en_us_oca/miscellanea:misc.Mode3
ltx/en_us_oca/me.m06.d29:meVE.Lity5.poet	@ltx/en_us_oca/poets:po.IoannouMonachou
ltx/en_us_oca/me.m06.d29:meVE.Lity5.text	Citizens of heavenly Jerusalem, ⁄ Peter, the rock of faith, ⁄ and Paul the orator of Christ’s holy Church! ⁄ You were an invincible team for the Trinity. ⁄ You have caught the whole world in your net; ⁄ you have endured the contest of suffering. ⁄ Today you depart this world for the throne of God: ⁄ as you stand before him with boldness, ⁄⁄ pray that our souls may be saved!
ltx/en_us_oca/me.m06.d29:meVE.LityBoth.incipit	@ltx/en_us_oca/oc.m5.d3:ocVE.AposTheotokion.incipit
ltx/en_us_oca/me.m06.d29:meVE.LityBoth.melody	
ltx/en_us_oca/me.m06.d29:meVE.LityBoth.mode	@ltx/en_us_oca/miscellanea:misc.Mode5
ltx/en_us_oca/me.m06.d29:meVE.LityBoth.text	@ltx/en_us_oca/oc.m5.d3:ocVE.AposTheotokion.text
ltx/en_us_oca/me.m06.d29:meVE.LityGlory.incipit	Apostles, praised throughout…
ltx/en_us_oca/me.m06.d29:meVE.LityGlory.melody	@ltx/en_us_oca/miscellanea:misc.Idiomelon
ltx/en_us_oca/me.m06.d29:meVE.LityGlory.mode	@ltx/en_us_oca/miscellanea:misc.Mode5
ltx/en_us_oca/me.m06.d29:meVE.LityGlory.poet	@ltx/en_us_oca/poets:po.Vyzantiou
ltx/en_us_oca/me.m06.d29:meVE.LityGlory.text	Apostles, praised throughout the world, ⁄ the Wisdom of God, the Word of the Father, ⁄ foretold in His Gospel that you would be His true vines. ⁄ You carried in your branches the sweet-tasting fruit of life. ⁄ We faithful partake and are filled with gladness! ⁄ Peter, the rock of faith, ⁄ and Paul, the pride of all the earth, ⁄⁄ strengthen the flock established by your teachings!
ltx/en_us_oca/me.m06.d29:meVE.SticGlory.incipit	Three times Christ asked Peter:…
ltx/en_us_oca/me.m06.d29:meVE.SticGlory.melody	@ltx/en_us_oca/miscellanea:misc.Idiomelon
ltx/en_us_oca/me.m06.d29:meVE.SticGlory.mode	@ltx/en_us_oca/miscellanea:misc.Mode4
ltx/en_us_oca/me.m06.d29:meVE.SticGlory.poet	@ltx/en_us_oca/poets:po.IoannouMonachou
ltx/en_us_oca/me.m06.d29:meVE.SticGlory.text	Three times Christ asked Peter: Do you love me? ⁄ In this way He reversed the threefold denial of Himself. ⁄ Henceforth Simon was to lead those who had witnessed God’s mysteries. ⁄ He cried out to the Lord: ⁄ You know all things; You know that I love You! ⁄ feed my sheep, tend my chosen ones, the Savior said. ⁄ feed my lambs, whose salvation I bought with my own blood! ⁄⁄ blessed apostle, pray that he may grant us great mercy!
ltx/en_us_oca/me.m06.d29:meVE.SticTheotokion.incipit	@ltx/en_us_oca/oc.m4.d1:ocVE.SticTheotokion.incipit
ltx/en_us_oca/me.m06.d29:meVE.SticTheotokion.melody	
ltx/en_us_oca/me.m06.d29:meVE.SticTheotokion.mode	@ltx/en_us_oca/miscellanea:misc.Mode4
ltx/en_us_oca/me.m06.d29:meVE.SticTheotokion.text	@ltx/en_us_oca/oc.m4.d1:ocVE.SticTheotokion.text
ltx/en_us_oca/me.m06.d29:meVE.Stichera01.incipit	@ltx/en_us_oca/he.a.m2:heAU.PoioisEffimionStemmasin.incipit
ltx/en_us_oca/me.m06.d29:meVE.Stichera01.melody	@ltx/en_us_oca/he.a.m2:heAU.PoioisEffimionStemmasin.melody
ltx/en_us_oca/me.m06.d29:meVE.Stichera01.mode	@ltx/en_us_oca/miscellanea:misc.Mode2
ltx/en_us_oca/me.m06.d29:meVE.Stichera01.poet	@ltx/en_us_oca/poets:po.AndreouPyrou
ltx/en_us_oca/me.m06.d29:meVE.Stichera01.text	@ltx/en_us_oca/he.a.m2:heAU.PoioisEffimionStemmasin.text
ltx/en_us_oca/me.m06.d29:meVE.Stichera02.incipit	How shall we worthily sing…
ltx/en_us_oca/me.m06.d29:meVE.Stichera02.melody	@ltx/en_us_oca/he.a.m2:heAU.PoioisEffimionStemmasin.notmetered
ltx/en_us_oca/me.m06.d29:meVE.Stichera02.mode	@ltx/en_us_oca/miscellanea:misc.Mode2
ltx/en_us_oca/me.m06.d29:meVE.Stichera02.text	How shall we worthily sing hymns to honor Peter and Paul? ⁄ Their hands were filled with grace and truth; ⁄ their feet carried them to the ends of the earth, ⁄ preaching the Gospel of peace. ⁄ Once driven by the wind of the Spirit, ⁄ they are now carried up to heaven! ⁄ Truly they are rivers of wisdom and upholders of the Cross! ⁄ Through them Christ our God, Who has great mercy, ⁄⁄ has cast down the arrogance of demons!
ltx/en_us_oca/me.m06.d29:meVE.Stichera03.incipit	What spiritual songs shall we…
ltx/en_us_oca/me.m06.d29:meVE.Stichera03.melody	@ltx/en_us_oca/he.a.m2:heAU.PoioisEffimionStemmasin.notmetered
ltx/en_us_oca/me.m06.d29:meVE.Stichera03.mode	@ltx/en_us_oca/miscellanea:misc.Mode2
ltx/en_us_oca/me.m06.d29:meVE.Stichera03.text	What spiritual songs shall we sing for Peter and Paul? ⁄ They have silenced the sharp tongues of the godless. ⁄ They are awesome swords of the Spirit. ⁄ They are the adornment of Rome; ⁄ they have nourished the whole world with the Word of God. ⁄ They are the living tablets of the New Testament ⁄ written by the hand of God: ⁄ Christ, Who has great and rich mercy, ⁄⁄ has exalted them in Zion.
