ltx/en_us_oca/me.m09.d07:meDA.commemoration.first	
ltx/en_us_oca/me.m09.d07:meDA.commemoration.first_name	
ltx/en_us_oca/me.m09.d07:meDA.commemoration.first_short	
ltx/en_us_oca/me.m09.d07:meDA.commemoration.first_title	
ltx/en_us_oca/me.m09.d07:meDA.commemoration.full	
ltx/en_us_oca/me.m09.d07:meDA.commemoration.second_name	
ltx/en_us_oca/me.m09.d07:meDA.commemoration.second_title	
ltx/en_us_oca/me.m09.d07:meDA.date	
ltx/en_us_oca/me.m09.d07:meDA.fordate	
ltx/en_us_oca/me.m09.d07:meDA.insert1	
ltx/en_us_oca/me.m09.d07:meDA.insert2	
ltx/en_us_oca/me.m09.d07:meDA.note	
ltx/en_us_oca/me.m09.d07:meDA.pdfcoverdate	
ltx/en_us_oca/me.m09.d07:meDA.pdfheaderdate	
ltx/en_us_oca/me.m09.d07:meHO.commemorations	
ltx/en_us_oca/me.m09.d07:meHO.note1	
ltx/en_us_oca/me.m09.d07:meHO.note2	
ltx/en_us_oca/me.m09.d07:meHO.number	
ltx/en_us_oca/me.m09.d07:meHO.rank	
ltx/en_us_oca/me.m09.d07:meLE.commemoration1	
ltx/en_us_oca/me.m09.d07:meLE.commemoration2	
ltx/en_us_oca/me.m09.d07:meLI.Kontakion1.greekmelody	@ltx/en_us_oca/me.m09.d07:meMA.Kontakion1.greekmelody
ltx/en_us_oca/me.m09.d07:meLI.Kontakion1.incipit	@ltx/en_us_oca/me.m09.d07:meMA.Kontakion1.incipit
ltx/en_us_oca/me.m09.d07:meLI.Kontakion1.melody	@ltx/en_us_oca/me.m09.d07:meMA.Kontakion1.melody
ltx/en_us_oca/me.m09.d07:meLI.Kontakion1.mode	@ltx/en_us_oca/me.m09.d07:meMA.Kontakion1.mode
ltx/en_us_oca/me.m09.d07:meLI.Kontakion1.text	@ltx/en_us_oca/me.m09.d07:meMA.Kontakion1.text
ltx/en_us_oca/me.m09.d07:meLI.MM.CommunionHymn.text	
ltx/en_us_oca/me.m09.d07:meLI.Megalynarion.text	
ltx/en_us_oca/me.m09.d07:meLI.Megalynarion2.text	
ltx/en_us_oca/me.m09.d07:meMA.AposGlory.incipit	She who was foreordained Queen…
ltx/en_us_oca/me.m09.d07:meMA.AposGlory.melody	
ltx/en_us_oca/me.m09.d07:meMA.AposGlory.mode	@ltx/en_us_oca/miscellanea:misc.Mode2
ltx/en_us_oca/me.m09.d07:meMA.AposGlory.text	She who was foreordained Queen of all ⁄ and the habitation of God, ⁄ has come forth today from the barren womb of joyful Anna. ⁄ She is the divine sanctuary of the eternal Essence; ⁄ through her cruel hell has been trampled underfoot, ⁄ and Eve with all her line is established secure in life. ⁄ It is fitting and right that we should cry aloud to her: ⁄ Blessed are you among women, ⁄⁄ and blessed is the Fruit of your womb!
ltx/en_us_oca/me.m09.d07:meMA.Aposticha1.greekmelody	@ltx/en_us_oca/he.a.m2:heAU.OikosTouEfratha.greekname
ltx/en_us_oca/me.m09.d07:meMA.Aposticha1.incipit	…
ltx/en_us_oca/me.m09.d07:meMA.Aposticha1.melody	@ltx/en_us_oca/he.a.m2:heAU.OikosTouEfratha.notmetered
ltx/en_us_oca/me.m09.d07:meMA.Aposticha1.mode	@ltx/en_us_oca/miscellanea:misc.Mode2
ltx/en_us_oca/me.m09.d07:meMA.Aposticha1.text	
ltx/en_us_oca/me.m09.d07:meMA.Aposticha2.incipit	…
ltx/en_us_oca/me.m09.d07:meMA.Aposticha2.melody	@ltx/en_us_oca/he.a.m2:heAU.OikosTouEfratha.notmetered
ltx/en_us_oca/me.m09.d07:meMA.Aposticha2.mode	@ltx/en_us_oca/miscellanea:misc.Mode2
ltx/en_us_oca/me.m09.d07:meMA.Aposticha2.text	
ltx/en_us_oca/me.m09.d07:meMA.Aposticha3.incipit	…
ltx/en_us_oca/me.m09.d07:meMA.Aposticha3.melody	@ltx/en_us_oca/he.a.m2:heAU.OikosTouEfratha.notmetered
ltx/en_us_oca/me.m09.d07:meMA.Aposticha3.mode	@ltx/en_us_oca/miscellanea:misc.Mode2
ltx/en_us_oca/me.m09.d07:meMA.Aposticha3.text	
ltx/en_us_oca/me.m09.d07:meMA.C1.acrostic.notice1	
ltx/en_us_oca/me.m09.d07:meMA.C1.acrostic.text	
ltx/en_us_oca/me.m09.d07:meMA.C1.acrostic.title	
ltx/en_us_oca/me.m09.d07:meMA.C1.title	@ltx/en_us_oca/titles:ti.CanonForefeast
ltx/en_us_oca/me.m09.d07:meMA.C1.verse	@ltx/en_us_oca/prayers:pr.verse_Theotokos.text
ltx/en_us_oca/me.m09.d07:meMA.C2.poet	@ltx/en_us_oca/poets:po.Theofanous
ltx/en_us_oca/me.m09.d07:meMA.C2.title	@ltx/en_us_oca/titles:ti.CanonSaintM
ltx/en_us_oca/me.m09.d07:meMA.C2.verse	@ltx/en_us_oca/prayers:pr.verse_SaintM.text
ltx/en_us_oca/me.m09.d07:meMA.ExapTheotokion.incipit	…
ltx/en_us_oca/me.m09.d07:meMA.ExapTheotokion.melody	@ltx/en_us_oca/he.a.m2:heAU.ToisMathitaisSynelthomen.notmetered
ltx/en_us_oca/me.m09.d07:meMA.ExapTheotokion.mode	@ltx/en_us_oca/miscellanea:misc.Mode2
ltx/en_us_oca/me.m09.d07:meMA.ExapTheotokion.text	
ltx/en_us_oca/me.m09.d07:meMA.Exaposteilarion1.greekmelody	@ltx/en_us_oca/he.a.m2:heAU.GynaikesAkoutisthite.greekname
ltx/en_us_oca/me.m09.d07:meMA.Exaposteilarion1.incipit	Armed with the weapon of…
ltx/en_us_oca/me.m09.d07:meMA.Exaposteilarion1.melody	@ltx/en_us_oca/he.a.m2:heAU.GynaikesAkoutisthite.notmetered
ltx/en_us_oca/me.m09.d07:meMA.Exaposteilarion1.mode	@ltx/en_us_oca/miscellanea:misc.Mode2
ltx/en_us_oca/me.m09.d07:meMA.Exaposteilarion1.text	Armed with the weapon of Your precious cross, Word, ⁄ Your athlete wholly conquered the hosts of the enemy ⁄ and put the tyrants to shame! ⁄ He suffered for You, my Christ, the King of all, ⁄⁄ and ever reigns with You forever!
ltx/en_us_oca/me.m09.d07:meMA.Kathisma11.greekmelody	@ltx/en_us_oca/he.a.m1:heAU.TouLithouSfragisthentos.greekname
ltx/en_us_oca/me.m09.d07:meMA.Kathisma11.incipit	…
ltx/en_us_oca/me.m09.d07:meMA.Kathisma11.melody	@ltx/en_us_oca/he.a.m1:heAU.TouLithouSfragisthentos.notmetered
ltx/en_us_oca/me.m09.d07:meMA.Kathisma11.mode	@ltx/en_us_oca/miscellanea:misc.Mode1
ltx/en_us_oca/me.m09.d07:meMA.Kathisma11.text	
ltx/en_us_oca/me.m09.d07:meMA.Kathisma21.greekmelody	@ltx/en_us_oca/he.a.m5:heAU.TonSynanarchonLogon.greekname
ltx/en_us_oca/me.m09.d07:meMA.Kathisma21.incipit	…
ltx/en_us_oca/me.m09.d07:meMA.Kathisma21.melody	@ltx/en_us_oca/he.a.m5:heAU.TonSynanarchonLogon.notmetered
ltx/en_us_oca/me.m09.d07:meMA.Kathisma21.mode	@ltx/en_us_oca/miscellanea:misc.Mode5
ltx/en_us_oca/me.m09.d07:meMA.Kathisma21.text	
ltx/en_us_oca/me.m09.d07:meMA.Kontakion1.greekmelody	@ltx/en_us_oca/he.a.m3:heAU.IParthenosSimeron.greekname
ltx/en_us_oca/me.m09.d07:meMA.Kontakion1.incipit	…
ltx/en_us_oca/me.m09.d07:meMA.Kontakion1.melody	@ltx/en_us_oca/he.a.m3:heAU.IParthenosSimeron.notmetered
ltx/en_us_oca/me.m09.d07:meMA.Kontakion1.mode	@ltx/en_us_oca/miscellanea:misc.Mode3
ltx/en_us_oca/me.m09.d07:meMA.Kontakion1.text	
ltx/en_us_oca/me.m09.d07:meMA.Ode1C11.greekmelody	@ltx/en_us_oca/he.h.m4:heHE.AnoixoToStomaMou.greekname
ltx/en_us_oca/me.m09.d07:meMA.Ode1C11.incipit	…
ltx/en_us_oca/me.m09.d07:meMA.Ode1C11.melody	@ltx/en_us_oca/he.h.m4:heHE.AnoixoToStomaMou.notmetered
ltx/en_us_oca/me.m09.d07:meMA.Ode1C11.mode	@ltx/en_us_oca/miscellanea:misc.Mode4
ltx/en_us_oca/me.m09.d07:meMA.Ode1C11.ode	@ltx/en_us_oca/miscellanea:misc.Ode1
ltx/en_us_oca/me.m09.d07:meMA.Ode1C11.text	
ltx/en_us_oca/me.m09.d07:meMA.Ode1C12.incipit	…
ltx/en_us_oca/me.m09.d07:meMA.Ode1C12.melody	@ltx/en_us_oca/he.h.m4:heHE.AnoixoToStomaMou.notmetered
ltx/en_us_oca/me.m09.d07:meMA.Ode1C12.mode	@ltx/en_us_oca/miscellanea:misc.Mode4
ltx/en_us_oca/me.m09.d07:meMA.Ode1C12.ode	@ltx/en_us_oca/miscellanea:misc.Ode1
ltx/en_us_oca/me.m09.d07:meMA.Ode1C12.text	
ltx/en_us_oca/me.m09.d07:meMA.Ode1C13.incipit	…
ltx/en_us_oca/me.m09.d07:meMA.Ode1C13.melody	@ltx/en_us_oca/he.h.m4:heHE.AnoixoToStomaMou.notmetered
ltx/en_us_oca/me.m09.d07:meMA.Ode1C13.mode	@ltx/en_us_oca/miscellanea:misc.Mode4
ltx/en_us_oca/me.m09.d07:meMA.Ode1C13.ode	@ltx/en_us_oca/miscellanea:misc.Ode1
ltx/en_us_oca/me.m09.d07:meMA.Ode1C13.text	
ltx/en_us_oca/me.m09.d07:meMA.Ode1C14.incipit	…
ltx/en_us_oca/me.m09.d07:meMA.Ode1C14.melody	@ltx/en_us_oca/he.h.m4:heHE.AnoixoToStomaMou.notmetered
ltx/en_us_oca/me.m09.d07:meMA.Ode1C14.mode	@ltx/en_us_oca/miscellanea:misc.Mode4
ltx/en_us_oca/me.m09.d07:meMA.Ode1C14.ode	@ltx/en_us_oca/miscellanea:misc.Ode1
ltx/en_us_oca/me.m09.d07:meMA.Ode1C14.text	
ltx/en_us_oca/me.m09.d07:meMA.Ode1C21.greekmelody	@ltx/en_us_oca/he.h.m4:heHE.ThalassisToErythraion.greekname
ltx/en_us_oca/me.m09.d07:meMA.Ode1C21.incipit	…
ltx/en_us_oca/me.m09.d07:meMA.Ode1C21.melody	@ltx/en_us_oca/he.h.m4:heHE.ThalassisToErythraion.notmetered
ltx/en_us_oca/me.m09.d07:meMA.Ode1C21.mode	@ltx/en_us_oca/miscellanea:misc.Mode4
ltx/en_us_oca/me.m09.d07:meMA.Ode1C21.ode	@ltx/en_us_oca/miscellanea:misc.Ode1
ltx/en_us_oca/me.m09.d07:meMA.Ode1C21.text	
ltx/en_us_oca/me.m09.d07:meMA.Ode1C22.incipit	…
ltx/en_us_oca/me.m09.d07:meMA.Ode1C22.melody	@ltx/en_us_oca/he.h.m4:heHE.ThalassisToErythraion.notmetered
ltx/en_us_oca/me.m09.d07:meMA.Ode1C22.mode	@ltx/en_us_oca/miscellanea:misc.Mode4
ltx/en_us_oca/me.m09.d07:meMA.Ode1C22.ode	@ltx/en_us_oca/miscellanea:misc.Ode1
ltx/en_us_oca/me.m09.d07:meMA.Ode1C22.text	
ltx/en_us_oca/me.m09.d07:meMA.Ode1C23.incipit	…
ltx/en_us_oca/me.m09.d07:meMA.Ode1C23.melody	@ltx/en_us_oca/he.h.m4:heHE.ThalassisToErythraion.notmetered
ltx/en_us_oca/me.m09.d07:meMA.Ode1C23.mode	@ltx/en_us_oca/miscellanea:misc.Mode4
ltx/en_us_oca/me.m09.d07:meMA.Ode1C23.ode	@ltx/en_us_oca/miscellanea:misc.Ode1
ltx/en_us_oca/me.m09.d07:meMA.Ode1C23.text	
ltx/en_us_oca/me.m09.d07:meMA.Ode1C2T.incipit	…
ltx/en_us_oca/me.m09.d07:meMA.Ode1C2T.melody	@ltx/en_us_oca/he.h.m4:heHE.ThalassisToErythraion.notmetered
ltx/en_us_oca/me.m09.d07:meMA.Ode1C2T.mode	@ltx/en_us_oca/miscellanea:misc.Mode4
ltx/en_us_oca/me.m09.d07:meMA.Ode1C2T.ode	@ltx/en_us_oca/miscellanea:misc.Ode1
ltx/en_us_oca/me.m09.d07:meMA.Ode1C2T.text	
ltx/en_us_oca/me.m09.d07:meMA.Ode3C11.greekmelody	@ltx/en_us_oca/he.h.m4:heHE.OtiSteiraEteken.greekname
ltx/en_us_oca/me.m09.d07:meMA.Ode3C11.incipit	…
ltx/en_us_oca/me.m09.d07:meMA.Ode3C11.melody	@ltx/en_us_oca/he.h.m4:heHE.OtiSteiraEteken.notmetered
ltx/en_us_oca/me.m09.d07:meMA.Ode3C11.mode	@ltx/en_us_oca/miscellanea:misc.Mode4
ltx/en_us_oca/me.m09.d07:meMA.Ode3C11.ode	@ltx/en_us_oca/miscellanea:misc.Ode3
ltx/en_us_oca/me.m09.d07:meMA.Ode3C11.text	
ltx/en_us_oca/me.m09.d07:meMA.Ode3C12.incipit	…
ltx/en_us_oca/me.m09.d07:meMA.Ode3C12.melody	@ltx/en_us_oca/he.h.m4:heHE.OtiSteiraEteken.notmetered
ltx/en_us_oca/me.m09.d07:meMA.Ode3C12.mode	@ltx/en_us_oca/miscellanea:misc.Mode4
ltx/en_us_oca/me.m09.d07:meMA.Ode3C12.ode	@ltx/en_us_oca/miscellanea:misc.Ode3
ltx/en_us_oca/me.m09.d07:meMA.Ode3C12.text	
ltx/en_us_oca/me.m09.d07:meMA.Ode3C13.incipit	…
ltx/en_us_oca/me.m09.d07:meMA.Ode3C13.melody	@ltx/en_us_oca/he.h.m4:heHE.OtiSteiraEteken.notmetered
ltx/en_us_oca/me.m09.d07:meMA.Ode3C13.mode	@ltx/en_us_oca/miscellanea:misc.Mode4
ltx/en_us_oca/me.m09.d07:meMA.Ode3C13.ode	@ltx/en_us_oca/miscellanea:misc.Ode3
ltx/en_us_oca/me.m09.d07:meMA.Ode3C13.text	
ltx/en_us_oca/me.m09.d07:meMA.Ode3C14.incipit	…
ltx/en_us_oca/me.m09.d07:meMA.Ode3C14.melody	@ltx/en_us_oca/he.h.m4:heHE.OtiSteiraEteken.notmetered
ltx/en_us_oca/me.m09.d07:meMA.Ode3C14.mode	@ltx/en_us_oca/miscellanea:misc.Mode4
ltx/en_us_oca/me.m09.d07:meMA.Ode3C14.ode	@ltx/en_us_oca/miscellanea:misc.Ode3
ltx/en_us_oca/me.m09.d07:meMA.Ode3C14.text	
ltx/en_us_oca/me.m09.d07:meMA.Ode3C21.greekmelody	@ltx/en_us_oca/he.h.m4:heHE.EffrainetaiEpiSoi.greekname
ltx/en_us_oca/me.m09.d07:meMA.Ode3C21.incipit	…
ltx/en_us_oca/me.m09.d07:meMA.Ode3C21.melody	@ltx/en_us_oca/he.h.m4:heHE.EffrainetaiEpiSoi.notmetered
ltx/en_us_oca/me.m09.d07:meMA.Ode3C21.mode	@ltx/en_us_oca/miscellanea:misc.Mode4
ltx/en_us_oca/me.m09.d07:meMA.Ode3C21.ode	@ltx/en_us_oca/miscellanea:misc.Ode3
ltx/en_us_oca/me.m09.d07:meMA.Ode3C21.text	
ltx/en_us_oca/me.m09.d07:meMA.Ode3C22.incipit	…
ltx/en_us_oca/me.m09.d07:meMA.Ode3C22.melody	@ltx/en_us_oca/he.h.m4:heHE.EffrainetaiEpiSoi.notmetered
ltx/en_us_oca/me.m09.d07:meMA.Ode3C22.mode	@ltx/en_us_oca/miscellanea:misc.Mode4
ltx/en_us_oca/me.m09.d07:meMA.Ode3C22.ode	@ltx/en_us_oca/miscellanea:misc.Ode3
ltx/en_us_oca/me.m09.d07:meMA.Ode3C22.text	
ltx/en_us_oca/me.m09.d07:meMA.Ode3C23.incipit	…
ltx/en_us_oca/me.m09.d07:meMA.Ode3C23.melody	@ltx/en_us_oca/he.h.m4:heHE.EffrainetaiEpiSoi.notmetered
ltx/en_us_oca/me.m09.d07:meMA.Ode3C23.mode	@ltx/en_us_oca/miscellanea:misc.Mode4
ltx/en_us_oca/me.m09.d07:meMA.Ode3C23.ode	@ltx/en_us_oca/miscellanea:misc.Ode3
ltx/en_us_oca/me.m09.d07:meMA.Ode3C23.text	
ltx/en_us_oca/me.m09.d07:meMA.Ode3C2T.incipit	…
ltx/en_us_oca/me.m09.d07:meMA.Ode3C2T.melody	@ltx/en_us_oca/he.h.m4:heHE.EffrainetaiEpiSoi.notmetered
ltx/en_us_oca/me.m09.d07:meMA.Ode3C2T.mode	@ltx/en_us_oca/miscellanea:misc.Mode4
ltx/en_us_oca/me.m09.d07:meMA.Ode3C2T.ode	@ltx/en_us_oca/miscellanea:misc.Ode3
ltx/en_us_oca/me.m09.d07:meMA.Ode3C2T.text	
ltx/en_us_oca/me.m09.d07:meMA.Ode3H.greekmelody	@ltx/en_us_oca/he.h.m4:heHE.EffrainetaiEpiSoi.greekname
ltx/en_us_oca/me.m09.d07:meMA.Ode3H.incipit	@ltx/en_us_oca/he.h.m4:heHE.EffrainetaiEpiSoi.incipit
ltx/en_us_oca/me.m09.d07:meMA.Ode3H.melody	@ltx/en_us_oca/he.h.m4:heHE.EffrainetaiEpiSoi.melody
ltx/en_us_oca/me.m09.d07:meMA.Ode3H.mode	@ltx/en_us_oca/miscellanea:misc.Mode4
ltx/en_us_oca/me.m09.d07:meMA.Ode3H.ode	@ltx/en_us_oca/miscellanea:misc.Ode3
ltx/en_us_oca/me.m09.d07:meMA.Ode3H.text	@ltx/en_us_oca/he.h.m4:heHE.EffrainetaiEpiSoi.text
ltx/en_us_oca/me.m09.d07:meMA.Ode3Kathisma1.greekmelody	@ltx/en_us_oca/he.a.m4:heAU.TachyProkatalave.greekname
ltx/en_us_oca/me.m09.d07:meMA.Ode3Kathisma1.incipit	…
ltx/en_us_oca/me.m09.d07:meMA.Ode3Kathisma1.melody	@ltx/en_us_oca/he.a.m4:heAU.TachyProkatalave.notmetered
ltx/en_us_oca/me.m09.d07:meMA.Ode3Kathisma1.mode	@ltx/en_us_oca/miscellanea:misc.Mode4
ltx/en_us_oca/me.m09.d07:meMA.Ode3Kathisma1.text	
ltx/en_us_oca/me.m09.d07:meMA.Ode3Kathisma2.greekmelody	@ltx/en_us_oca/he.a.m8:heAU.ToProstachthen.greekname
ltx/en_us_oca/me.m09.d07:meMA.Ode3Kathisma2.incipit	…
ltx/en_us_oca/me.m09.d07:meMA.Ode3Kathisma2.melody	@ltx/en_us_oca/he.a.m8:heAU.ToProstachthen.notmetered
ltx/en_us_oca/me.m09.d07:meMA.Ode3Kathisma2.mode	@ltx/en_us_oca/miscellanea:misc.Mode8
ltx/en_us_oca/me.m09.d07:meMA.Ode3Kathisma2.text	
ltx/en_us_oca/me.m09.d07:meMA.Ode4C11.greekmelody	@ltx/en_us_oca/he.h.m4:heHE.OKathimenosEnDoxi.greekname
ltx/en_us_oca/me.m09.d07:meMA.Ode4C11.incipit	…
ltx/en_us_oca/me.m09.d07:meMA.Ode4C11.melody	@ltx/en_us_oca/he.h.m4:heHE.OKathimenosEnDoxi.notmetered
ltx/en_us_oca/me.m09.d07:meMA.Ode4C11.mode	@ltx/en_us_oca/miscellanea:misc.Mode4
ltx/en_us_oca/me.m09.d07:meMA.Ode4C11.ode	@ltx/en_us_oca/miscellanea:misc.Ode4
ltx/en_us_oca/me.m09.d07:meMA.Ode4C11.text	
ltx/en_us_oca/me.m09.d07:meMA.Ode4C12.incipit	…
ltx/en_us_oca/me.m09.d07:meMA.Ode4C12.melody	@ltx/en_us_oca/he.h.m4:heHE.OKathimenosEnDoxi.notmetered
ltx/en_us_oca/me.m09.d07:meMA.Ode4C12.mode	@ltx/en_us_oca/miscellanea:misc.Mode4
ltx/en_us_oca/me.m09.d07:meMA.Ode4C12.ode	@ltx/en_us_oca/miscellanea:misc.Ode4
ltx/en_us_oca/me.m09.d07:meMA.Ode4C12.text	
ltx/en_us_oca/me.m09.d07:meMA.Ode4C13.incipit	…
ltx/en_us_oca/me.m09.d07:meMA.Ode4C13.melody	@ltx/en_us_oca/he.h.m4:heHE.OKathimenosEnDoxi.notmetered
ltx/en_us_oca/me.m09.d07:meMA.Ode4C13.mode	@ltx/en_us_oca/miscellanea:misc.Mode4
ltx/en_us_oca/me.m09.d07:meMA.Ode4C13.ode	@ltx/en_us_oca/miscellanea:misc.Ode4
ltx/en_us_oca/me.m09.d07:meMA.Ode4C13.text	
ltx/en_us_oca/me.m09.d07:meMA.Ode4C14.incipit	…
ltx/en_us_oca/me.m09.d07:meMA.Ode4C14.melody	@ltx/en_us_oca/he.h.m4:heHE.OKathimenosEnDoxi.notmetered
ltx/en_us_oca/me.m09.d07:meMA.Ode4C14.mode	@ltx/en_us_oca/miscellanea:misc.Mode4
ltx/en_us_oca/me.m09.d07:meMA.Ode4C14.ode	@ltx/en_us_oca/miscellanea:misc.Ode4
ltx/en_us_oca/me.m09.d07:meMA.Ode4C14.text	
ltx/en_us_oca/me.m09.d07:meMA.Ode4C21.greekmelody	@ltx/en_us_oca/he.h.m4:heHE.EparthentaSeIdousa.greekname
ltx/en_us_oca/me.m09.d07:meMA.Ode4C21.incipit	…
ltx/en_us_oca/me.m09.d07:meMA.Ode4C21.melody	@ltx/en_us_oca/he.h.m4:heHE.EparthentaSeIdousa.notmetered
ltx/en_us_oca/me.m09.d07:meMA.Ode4C21.mode	@ltx/en_us_oca/miscellanea:misc.Mode4
ltx/en_us_oca/me.m09.d07:meMA.Ode4C21.ode	@ltx/en_us_oca/miscellanea:misc.Ode4
ltx/en_us_oca/me.m09.d07:meMA.Ode4C21.text	
ltx/en_us_oca/me.m09.d07:meMA.Ode4C22.incipit	…
ltx/en_us_oca/me.m09.d07:meMA.Ode4C22.melody	@ltx/en_us_oca/he.h.m4:heHE.EparthentaSeIdousa.notmetered
ltx/en_us_oca/me.m09.d07:meMA.Ode4C22.mode	@ltx/en_us_oca/miscellanea:misc.Mode4
ltx/en_us_oca/me.m09.d07:meMA.Ode4C22.ode	@ltx/en_us_oca/miscellanea:misc.Ode4
ltx/en_us_oca/me.m09.d07:meMA.Ode4C22.text	
ltx/en_us_oca/me.m09.d07:meMA.Ode4C23.incipit	…
ltx/en_us_oca/me.m09.d07:meMA.Ode4C23.melody	@ltx/en_us_oca/he.h.m4:heHE.EparthentaSeIdousa.notmetered
ltx/en_us_oca/me.m09.d07:meMA.Ode4C23.mode	@ltx/en_us_oca/miscellanea:misc.Mode4
ltx/en_us_oca/me.m09.d07:meMA.Ode4C23.ode	@ltx/en_us_oca/miscellanea:misc.Ode4
ltx/en_us_oca/me.m09.d07:meMA.Ode4C23.text	
ltx/en_us_oca/me.m09.d07:meMA.Ode4C2T.incipit	…
ltx/en_us_oca/me.m09.d07:meMA.Ode4C2T.melody	@ltx/en_us_oca/he.h.m4:heHE.EparthentaSeIdousa.notmetered
ltx/en_us_oca/me.m09.d07:meMA.Ode4C2T.mode	@ltx/en_us_oca/miscellanea:misc.Mode4
ltx/en_us_oca/me.m09.d07:meMA.Ode4C2T.ode	@ltx/en_us_oca/miscellanea:misc.Ode4
ltx/en_us_oca/me.m09.d07:meMA.Ode4C2T.text	
ltx/en_us_oca/me.m09.d07:meMA.Ode5C11.greekmelody	@ltx/en_us_oca/he.h.m4:heHE.ExestiTaSympanta.greekname
ltx/en_us_oca/me.m09.d07:meMA.Ode5C11.incipit	…
ltx/en_us_oca/me.m09.d07:meMA.Ode5C11.melody	@ltx/en_us_oca/he.h.m4:heHE.ExestiTaSympanta.notmetered
ltx/en_us_oca/me.m09.d07:meMA.Ode5C11.mode	@ltx/en_us_oca/miscellanea:misc.Mode4
ltx/en_us_oca/me.m09.d07:meMA.Ode5C11.ode	@ltx/en_us_oca/miscellanea:misc.Ode5
ltx/en_us_oca/me.m09.d07:meMA.Ode5C11.text	
ltx/en_us_oca/me.m09.d07:meMA.Ode5C12.incipit	…
ltx/en_us_oca/me.m09.d07:meMA.Ode5C12.melody	@ltx/en_us_oca/he.h.m4:heHE.ExestiTaSympanta.notmetered
ltx/en_us_oca/me.m09.d07:meMA.Ode5C12.mode	@ltx/en_us_oca/miscellanea:misc.Mode4
ltx/en_us_oca/me.m09.d07:meMA.Ode5C12.ode	@ltx/en_us_oca/miscellanea:misc.Ode5
ltx/en_us_oca/me.m09.d07:meMA.Ode5C12.text	
ltx/en_us_oca/me.m09.d07:meMA.Ode5C13.incipit	…
ltx/en_us_oca/me.m09.d07:meMA.Ode5C13.melody	@ltx/en_us_oca/he.h.m4:heHE.ExestiTaSympanta.notmetered
ltx/en_us_oca/me.m09.d07:meMA.Ode5C13.mode	@ltx/en_us_oca/miscellanea:misc.Mode4
ltx/en_us_oca/me.m09.d07:meMA.Ode5C13.ode	@ltx/en_us_oca/miscellanea:misc.Ode5
ltx/en_us_oca/me.m09.d07:meMA.Ode5C13.text	
ltx/en_us_oca/me.m09.d07:meMA.Ode5C14.incipit	…
ltx/en_us_oca/me.m09.d07:meMA.Ode5C14.melody	@ltx/en_us_oca/he.h.m4:heHE.ExestiTaSympanta.notmetered
ltx/en_us_oca/me.m09.d07:meMA.Ode5C14.mode	@ltx/en_us_oca/miscellanea:misc.Mode4
ltx/en_us_oca/me.m09.d07:meMA.Ode5C14.ode	@ltx/en_us_oca/miscellanea:misc.Ode5
ltx/en_us_oca/me.m09.d07:meMA.Ode5C14.text	
ltx/en_us_oca/me.m09.d07:meMA.Ode5C21.greekmelody	@ltx/en_us_oca/he.h.m4:heHE.SyKyrieMouFos.greekname
ltx/en_us_oca/me.m09.d07:meMA.Ode5C21.incipit	…
ltx/en_us_oca/me.m09.d07:meMA.Ode5C21.melody	@ltx/en_us_oca/he.h.m4:heHE.SyKyrieMouFos.notmetered
ltx/en_us_oca/me.m09.d07:meMA.Ode5C21.mode	@ltx/en_us_oca/miscellanea:misc.Mode4
ltx/en_us_oca/me.m09.d07:meMA.Ode5C21.ode	@ltx/en_us_oca/miscellanea:misc.Ode5
ltx/en_us_oca/me.m09.d07:meMA.Ode5C21.text	
ltx/en_us_oca/me.m09.d07:meMA.Ode5C22.incipit	…
ltx/en_us_oca/me.m09.d07:meMA.Ode5C22.melody	@ltx/en_us_oca/he.h.m4:heHE.SyKyrieMouFos.notmetered
ltx/en_us_oca/me.m09.d07:meMA.Ode5C22.mode	@ltx/en_us_oca/miscellanea:misc.Mode4
ltx/en_us_oca/me.m09.d07:meMA.Ode5C22.ode	@ltx/en_us_oca/miscellanea:misc.Ode5
ltx/en_us_oca/me.m09.d07:meMA.Ode5C22.text	
ltx/en_us_oca/me.m09.d07:meMA.Ode5C23.incipit	…
ltx/en_us_oca/me.m09.d07:meMA.Ode5C23.melody	@ltx/en_us_oca/he.h.m4:heHE.SyKyrieMouFos.notmetered
ltx/en_us_oca/me.m09.d07:meMA.Ode5C23.mode	@ltx/en_us_oca/miscellanea:misc.Mode4
ltx/en_us_oca/me.m09.d07:meMA.Ode5C23.ode	@ltx/en_us_oca/miscellanea:misc.Ode5
ltx/en_us_oca/me.m09.d07:meMA.Ode5C23.text	
ltx/en_us_oca/me.m09.d07:meMA.Ode5C2T.incipit	…
ltx/en_us_oca/me.m09.d07:meMA.Ode5C2T.melody	@ltx/en_us_oca/he.h.m4:heHE.SyKyrieMouFos.notmetered
ltx/en_us_oca/me.m09.d07:meMA.Ode5C2T.mode	@ltx/en_us_oca/miscellanea:misc.Mode4
ltx/en_us_oca/me.m09.d07:meMA.Ode5C2T.ode	@ltx/en_us_oca/miscellanea:misc.Ode5
ltx/en_us_oca/me.m09.d07:meMA.Ode5C2T.text	
ltx/en_us_oca/me.m09.d07:meMA.Ode6C11.greekmelody	@ltx/en_us_oca/he.h.m4:heHE.TinTheianTaftin.greekname
ltx/en_us_oca/me.m09.d07:meMA.Ode6C11.incipit	…
ltx/en_us_oca/me.m09.d07:meMA.Ode6C11.melody	@ltx/en_us_oca/he.h.m4:heHE.TinTheianTaftin.notmetered
ltx/en_us_oca/me.m09.d07:meMA.Ode6C11.mode	@ltx/en_us_oca/miscellanea:misc.Mode4
ltx/en_us_oca/me.m09.d07:meMA.Ode6C11.ode	@ltx/en_us_oca/miscellanea:misc.Ode6
ltx/en_us_oca/me.m09.d07:meMA.Ode6C11.text	
ltx/en_us_oca/me.m09.d07:meMA.Ode6C12.incipit	…
ltx/en_us_oca/me.m09.d07:meMA.Ode6C12.melody	@ltx/en_us_oca/he.h.m4:heHE.TinTheianTaftin.notmetered
ltx/en_us_oca/me.m09.d07:meMA.Ode6C12.mode	@ltx/en_us_oca/miscellanea:misc.Mode4
ltx/en_us_oca/me.m09.d07:meMA.Ode6C12.ode	@ltx/en_us_oca/miscellanea:misc.Ode6
ltx/en_us_oca/me.m09.d07:meMA.Ode6C12.text	
ltx/en_us_oca/me.m09.d07:meMA.Ode6C13.incipit	…
ltx/en_us_oca/me.m09.d07:meMA.Ode6C13.melody	@ltx/en_us_oca/he.h.m4:heHE.TinTheianTaftin.notmetered
ltx/en_us_oca/me.m09.d07:meMA.Ode6C13.mode	@ltx/en_us_oca/miscellanea:misc.Mode4
ltx/en_us_oca/me.m09.d07:meMA.Ode6C13.ode	@ltx/en_us_oca/miscellanea:misc.Ode6
ltx/en_us_oca/me.m09.d07:meMA.Ode6C13.text	
ltx/en_us_oca/me.m09.d07:meMA.Ode6C14.incipit	…
ltx/en_us_oca/me.m09.d07:meMA.Ode6C14.melody	@ltx/en_us_oca/he.h.m4:heHE.TinTheianTaftin.notmetered
ltx/en_us_oca/me.m09.d07:meMA.Ode6C14.mode	@ltx/en_us_oca/miscellanea:misc.Mode4
ltx/en_us_oca/me.m09.d07:meMA.Ode6C14.ode	@ltx/en_us_oca/miscellanea:misc.Ode6
ltx/en_us_oca/me.m09.d07:meMA.Ode6C14.text	
ltx/en_us_oca/me.m09.d07:meMA.Ode6C21.greekmelody	@ltx/en_us_oca/he.h.m4:heHE.ThysoSoiMetaFonis.greekname
ltx/en_us_oca/me.m09.d07:meMA.Ode6C21.incipit	…
ltx/en_us_oca/me.m09.d07:meMA.Ode6C21.melody	@ltx/en_us_oca/he.h.m4:heHE.ThysoSoiMetaFonis.notmetered
ltx/en_us_oca/me.m09.d07:meMA.Ode6C21.mode	@ltx/en_us_oca/miscellanea:misc.Mode4
ltx/en_us_oca/me.m09.d07:meMA.Ode6C21.ode	@ltx/en_us_oca/miscellanea:misc.Ode6
ltx/en_us_oca/me.m09.d07:meMA.Ode6C21.text	
ltx/en_us_oca/me.m09.d07:meMA.Ode6C22.incipit	…
ltx/en_us_oca/me.m09.d07:meMA.Ode6C22.melody	@ltx/en_us_oca/he.h.m4:heHE.ThysoSoiMetaFonis.notmetered
ltx/en_us_oca/me.m09.d07:meMA.Ode6C22.mode	@ltx/en_us_oca/miscellanea:misc.Mode4
ltx/en_us_oca/me.m09.d07:meMA.Ode6C22.ode	@ltx/en_us_oca/miscellanea:misc.Ode6
ltx/en_us_oca/me.m09.d07:meMA.Ode6C22.text	
ltx/en_us_oca/me.m09.d07:meMA.Ode6C23.incipit	…
ltx/en_us_oca/me.m09.d07:meMA.Ode6C23.melody	@ltx/en_us_oca/he.h.m4:heHE.ThysoSoiMetaFonis.notmetered
ltx/en_us_oca/me.m09.d07:meMA.Ode6C23.mode	@ltx/en_us_oca/miscellanea:misc.Mode4
ltx/en_us_oca/me.m09.d07:meMA.Ode6C23.ode	@ltx/en_us_oca/miscellanea:misc.Ode6
ltx/en_us_oca/me.m09.d07:meMA.Ode6C23.text	
ltx/en_us_oca/me.m09.d07:meMA.Ode6C2T.incipit	…
ltx/en_us_oca/me.m09.d07:meMA.Ode6C2T.melody	@ltx/en_us_oca/he.h.m4:heHE.ThysoSoiMetaFonis.notmetered
ltx/en_us_oca/me.m09.d07:meMA.Ode6C2T.mode	@ltx/en_us_oca/miscellanea:misc.Mode4
ltx/en_us_oca/me.m09.d07:meMA.Ode6C2T.ode	@ltx/en_us_oca/miscellanea:misc.Ode6
ltx/en_us_oca/me.m09.d07:meMA.Ode6C2T.text	
ltx/en_us_oca/me.m09.d07:meMA.Ode6H.greekmelody	@ltx/en_us_oca/he.h.m4:heHE.ThysoSoiMetaFonis.greekname
ltx/en_us_oca/me.m09.d07:meMA.Ode6H.incipit	@ltx/en_us_oca/he.h.m4:heHE.ThysoSoiMetaFonis.incipit
ltx/en_us_oca/me.m09.d07:meMA.Ode6H.melody	@ltx/en_us_oca/he.h.m4:heHE.ThysoSoiMetaFonis.melody
ltx/en_us_oca/me.m09.d07:meMA.Ode6H.mode	@ltx/en_us_oca/miscellanea:misc.Mode4
ltx/en_us_oca/me.m09.d07:meMA.Ode6H.ode	@ltx/en_us_oca/miscellanea:misc.Ode6
ltx/en_us_oca/me.m09.d07:meMA.Ode6H.text	@ltx/en_us_oca/he.h.m4:heHE.ThysoSoiMetaFonis.text
ltx/en_us_oca/me.m09.d07:meMA.Ode7C11.greekmelody	@ltx/en_us_oca/he.h.m4:heHE.OukElatrefsan.greekname
ltx/en_us_oca/me.m09.d07:meMA.Ode7C11.incipit	…
ltx/en_us_oca/me.m09.d07:meMA.Ode7C11.melody	@ltx/en_us_oca/he.h.m4:heHE.OukElatrefsan.notmetered
ltx/en_us_oca/me.m09.d07:meMA.Ode7C11.mode	@ltx/en_us_oca/miscellanea:misc.Mode4
ltx/en_us_oca/me.m09.d07:meMA.Ode7C11.ode	@ltx/en_us_oca/miscellanea:misc.Ode7
ltx/en_us_oca/me.m09.d07:meMA.Ode7C11.text	
ltx/en_us_oca/me.m09.d07:meMA.Ode7C12.incipit	…
ltx/en_us_oca/me.m09.d07:meMA.Ode7C12.melody	@ltx/en_us_oca/he.h.m4:heHE.OukElatrefsan.notmetered
ltx/en_us_oca/me.m09.d07:meMA.Ode7C12.mode	@ltx/en_us_oca/miscellanea:misc.Mode4
ltx/en_us_oca/me.m09.d07:meMA.Ode7C12.ode	@ltx/en_us_oca/miscellanea:misc.Ode7
ltx/en_us_oca/me.m09.d07:meMA.Ode7C12.text	
ltx/en_us_oca/me.m09.d07:meMA.Ode7C13.incipit	…
ltx/en_us_oca/me.m09.d07:meMA.Ode7C13.melody	@ltx/en_us_oca/he.h.m4:heHE.OukElatrefsan.notmetered
ltx/en_us_oca/me.m09.d07:meMA.Ode7C13.mode	@ltx/en_us_oca/miscellanea:misc.Mode4
ltx/en_us_oca/me.m09.d07:meMA.Ode7C13.ode	@ltx/en_us_oca/miscellanea:misc.Ode7
ltx/en_us_oca/me.m09.d07:meMA.Ode7C13.text	
ltx/en_us_oca/me.m09.d07:meMA.Ode7C14.incipit	…
ltx/en_us_oca/me.m09.d07:meMA.Ode7C14.melody	@ltx/en_us_oca/he.h.m4:heHE.OukElatrefsan.notmetered
ltx/en_us_oca/me.m09.d07:meMA.Ode7C14.mode	@ltx/en_us_oca/miscellanea:misc.Mode4
ltx/en_us_oca/me.m09.d07:meMA.Ode7C14.ode	@ltx/en_us_oca/miscellanea:misc.Ode7
ltx/en_us_oca/me.m09.d07:meMA.Ode7C14.text	
ltx/en_us_oca/me.m09.d07:meMA.Ode7C21.greekmelody	@ltx/en_us_oca/he.h.m4:heHE.EnTiKaminoAvramiaioi.greekname
ltx/en_us_oca/me.m09.d07:meMA.Ode7C21.incipit	…
ltx/en_us_oca/me.m09.d07:meMA.Ode7C21.melody	@ltx/en_us_oca/he.h.m4:heHE.EnTiKaminoAvramiaioi.notmetered
ltx/en_us_oca/me.m09.d07:meMA.Ode7C21.mode	@ltx/en_us_oca/miscellanea:misc.Mode4
ltx/en_us_oca/me.m09.d07:meMA.Ode7C21.ode	@ltx/en_us_oca/miscellanea:misc.Ode7
ltx/en_us_oca/me.m09.d07:meMA.Ode7C21.text	
ltx/en_us_oca/me.m09.d07:meMA.Ode7C22.incipit	…
ltx/en_us_oca/me.m09.d07:meMA.Ode7C22.melody	@ltx/en_us_oca/he.h.m4:heHE.EnTiKaminoAvramiaioi.notmetered
ltx/en_us_oca/me.m09.d07:meMA.Ode7C22.mode	@ltx/en_us_oca/miscellanea:misc.Mode4
ltx/en_us_oca/me.m09.d07:meMA.Ode7C22.ode	@ltx/en_us_oca/miscellanea:misc.Ode7
ltx/en_us_oca/me.m09.d07:meMA.Ode7C22.text	
ltx/en_us_oca/me.m09.d07:meMA.Ode7C23.incipit	…
ltx/en_us_oca/me.m09.d07:meMA.Ode7C23.melody	@ltx/en_us_oca/he.h.m4:heHE.EnTiKaminoAvramiaioi.notmetered
ltx/en_us_oca/me.m09.d07:meMA.Ode7C23.mode	@ltx/en_us_oca/miscellanea:misc.Mode4
ltx/en_us_oca/me.m09.d07:meMA.Ode7C23.ode	@ltx/en_us_oca/miscellanea:misc.Ode7
ltx/en_us_oca/me.m09.d07:meMA.Ode7C23.text	
ltx/en_us_oca/me.m09.d07:meMA.Ode7C2T.incipit	…
ltx/en_us_oca/me.m09.d07:meMA.Ode7C2T.melody	@ltx/en_us_oca/he.h.m4:heHE.EnTiKaminoAvramiaioi.notmetered
ltx/en_us_oca/me.m09.d07:meMA.Ode7C2T.mode	@ltx/en_us_oca/miscellanea:misc.Mode4
ltx/en_us_oca/me.m09.d07:meMA.Ode7C2T.ode	@ltx/en_us_oca/miscellanea:misc.Ode7
ltx/en_us_oca/me.m09.d07:meMA.Ode7C2T.text	
ltx/en_us_oca/me.m09.d07:meMA.Ode8C11.greekmelody	@ltx/en_us_oca/he.h.m4:heHE.PaidasEvageis.greekname
ltx/en_us_oca/me.m09.d07:meMA.Ode8C11.incipit	…
ltx/en_us_oca/me.m09.d07:meMA.Ode8C11.melody	@ltx/en_us_oca/he.h.m4:heHE.PaidasEvageis.notmetered
ltx/en_us_oca/me.m09.d07:meMA.Ode8C11.mode	@ltx/en_us_oca/miscellanea:misc.Mode4
ltx/en_us_oca/me.m09.d07:meMA.Ode8C11.ode	@ltx/en_us_oca/miscellanea:misc.Ode8
ltx/en_us_oca/me.m09.d07:meMA.Ode8C11.text	
ltx/en_us_oca/me.m09.d07:meMA.Ode8C12.incipit	…
ltx/en_us_oca/me.m09.d07:meMA.Ode8C12.melody	@ltx/en_us_oca/he.h.m4:heHE.PaidasEvageis.notmetered
ltx/en_us_oca/me.m09.d07:meMA.Ode8C12.mode	@ltx/en_us_oca/miscellanea:misc.Mode4
ltx/en_us_oca/me.m09.d07:meMA.Ode8C12.ode	@ltx/en_us_oca/miscellanea:misc.Ode8
ltx/en_us_oca/me.m09.d07:meMA.Ode8C12.text	
ltx/en_us_oca/me.m09.d07:meMA.Ode8C13.incipit	…
ltx/en_us_oca/me.m09.d07:meMA.Ode8C13.melody	@ltx/en_us_oca/he.h.m4:heHE.PaidasEvageis.notmetered
ltx/en_us_oca/me.m09.d07:meMA.Ode8C13.mode	@ltx/en_us_oca/miscellanea:misc.Mode4
ltx/en_us_oca/me.m09.d07:meMA.Ode8C13.ode	@ltx/en_us_oca/miscellanea:misc.Ode8
ltx/en_us_oca/me.m09.d07:meMA.Ode8C13.text	
ltx/en_us_oca/me.m09.d07:meMA.Ode8C14.incipit	…
ltx/en_us_oca/me.m09.d07:meMA.Ode8C14.melody	@ltx/en_us_oca/he.h.m4:heHE.PaidasEvageis.notmetered
ltx/en_us_oca/me.m09.d07:meMA.Ode8C14.mode	@ltx/en_us_oca/miscellanea:misc.Mode4
ltx/en_us_oca/me.m09.d07:meMA.Ode8C14.ode	@ltx/en_us_oca/miscellanea:misc.Ode8
ltx/en_us_oca/me.m09.d07:meMA.Ode8C14.text	
ltx/en_us_oca/me.m09.d07:meMA.Ode8C15.incipit	…
ltx/en_us_oca/me.m09.d07:meMA.Ode8C15.melody	@ltx/en_us_oca/he.h.m4:heHE.PaidasEvageis.notmetered
ltx/en_us_oca/me.m09.d07:meMA.Ode8C15.mode	@ltx/en_us_oca/miscellanea:misc.Mode4
ltx/en_us_oca/me.m09.d07:meMA.Ode8C15.ode	@ltx/en_us_oca/miscellanea:misc.Ode8
ltx/en_us_oca/me.m09.d07:meMA.Ode8C15.text	
ltx/en_us_oca/me.m09.d07:meMA.Ode8C21.greekmelody	@ltx/en_us_oca/he.h.m4:heHE.CheirasEkpetasasDaniil.greekname
ltx/en_us_oca/me.m09.d07:meMA.Ode8C21.incipit	…
ltx/en_us_oca/me.m09.d07:meMA.Ode8C21.melody	@ltx/en_us_oca/he.h.m4:heHE.CheirasEkpetasasDaniil.notmetered
ltx/en_us_oca/me.m09.d07:meMA.Ode8C21.mode	@ltx/en_us_oca/miscellanea:misc.Mode4
ltx/en_us_oca/me.m09.d07:meMA.Ode8C21.ode	@ltx/en_us_oca/miscellanea:misc.Ode8
ltx/en_us_oca/me.m09.d07:meMA.Ode8C21.text	
ltx/en_us_oca/me.m09.d07:meMA.Ode8C22.incipit	…
ltx/en_us_oca/me.m09.d07:meMA.Ode8C22.melody	@ltx/en_us_oca/he.h.m4:heHE.CheirasEkpetasasDaniil.notmetered
ltx/en_us_oca/me.m09.d07:meMA.Ode8C22.mode	@ltx/en_us_oca/miscellanea:misc.Mode4
ltx/en_us_oca/me.m09.d07:meMA.Ode8C22.ode	@ltx/en_us_oca/miscellanea:misc.Ode8
ltx/en_us_oca/me.m09.d07:meMA.Ode8C22.text	
ltx/en_us_oca/me.m09.d07:meMA.Ode8C23.incipit	…
ltx/en_us_oca/me.m09.d07:meMA.Ode8C23.melody	@ltx/en_us_oca/he.h.m4:heHE.CheirasEkpetasasDaniil.notmetered
ltx/en_us_oca/me.m09.d07:meMA.Ode8C23.mode	@ltx/en_us_oca/miscellanea:misc.Mode4
ltx/en_us_oca/me.m09.d07:meMA.Ode8C23.ode	@ltx/en_us_oca/miscellanea:misc.Ode8
ltx/en_us_oca/me.m09.d07:meMA.Ode8C23.text	
ltx/en_us_oca/me.m09.d07:meMA.Ode8C2T.incipit	…
ltx/en_us_oca/me.m09.d07:meMA.Ode8C2T.melody	@ltx/en_us_oca/he.h.m4:heHE.CheirasEkpetasasDaniil.notmetered
ltx/en_us_oca/me.m09.d07:meMA.Ode8C2T.mode	@ltx/en_us_oca/miscellanea:misc.Mode4
ltx/en_us_oca/me.m09.d07:meMA.Ode8C2T.ode	@ltx/en_us_oca/miscellanea:misc.Ode8
ltx/en_us_oca/me.m09.d07:meMA.Ode8C2T.text	
ltx/en_us_oca/me.m09.d07:meMA.Ode8H.greekmelody	@ltx/en_us_oca/he.h.m4:heHE.CheirasEkpetasasDaniil.greekname
ltx/en_us_oca/me.m09.d07:meMA.Ode8H.incipit	@ltx/en_us_oca/he.h.m4:heHE.CheirasEkpetasasDaniil.incipit
ltx/en_us_oca/me.m09.d07:meMA.Ode8H.melody	@ltx/en_us_oca/he.h.m4:heHE.CheirasEkpetasasDaniil.melody
ltx/en_us_oca/me.m09.d07:meMA.Ode8H.mode	@ltx/en_us_oca/miscellanea:misc.Mode4
ltx/en_us_oca/me.m09.d07:meMA.Ode8H.ode	@ltx/en_us_oca/miscellanea:misc.Ode8
ltx/en_us_oca/me.m09.d07:meMA.Ode8H.text	@ltx/en_us_oca/he.h.m4:heHE.CheirasEkpetasasDaniil.text
ltx/en_us_oca/me.m09.d07:meMA.Ode9C11.greekmelody	@ltx/en_us_oca/he.h.m4:heHE.ApasGigenis.greekname
ltx/en_us_oca/me.m09.d07:meMA.Ode9C11.incipit	…
ltx/en_us_oca/me.m09.d07:meMA.Ode9C11.melody	@ltx/en_us_oca/he.h.m4:heHE.ApasGigenis.notmetered
ltx/en_us_oca/me.m09.d07:meMA.Ode9C11.mode	@ltx/en_us_oca/miscellanea:misc.Mode4
ltx/en_us_oca/me.m09.d07:meMA.Ode9C11.ode	@ltx/en_us_oca/miscellanea:misc.Ode9
ltx/en_us_oca/me.m09.d07:meMA.Ode9C11.text	
ltx/en_us_oca/me.m09.d07:meMA.Ode9C12.incipit	…
ltx/en_us_oca/me.m09.d07:meMA.Ode9C12.melody	@ltx/en_us_oca/he.h.m4:heHE.ApasGigenis.notmetered
ltx/en_us_oca/me.m09.d07:meMA.Ode9C12.mode	@ltx/en_us_oca/miscellanea:misc.Mode4
ltx/en_us_oca/me.m09.d07:meMA.Ode9C12.ode	@ltx/en_us_oca/miscellanea:misc.Ode9
ltx/en_us_oca/me.m09.d07:meMA.Ode9C12.text	
ltx/en_us_oca/me.m09.d07:meMA.Ode9C13.incipit	…
ltx/en_us_oca/me.m09.d07:meMA.Ode9C13.melody	@ltx/en_us_oca/he.h.m4:heHE.ApasGigenis.notmetered
ltx/en_us_oca/me.m09.d07:meMA.Ode9C13.mode	@ltx/en_us_oca/miscellanea:misc.Mode4
ltx/en_us_oca/me.m09.d07:meMA.Ode9C13.ode	@ltx/en_us_oca/miscellanea:misc.Ode9
ltx/en_us_oca/me.m09.d07:meMA.Ode9C13.text	
ltx/en_us_oca/me.m09.d07:meMA.Ode9C14.incipit	…
ltx/en_us_oca/me.m09.d07:meMA.Ode9C14.melody	@ltx/en_us_oca/he.h.m4:heHE.ApasGigenis.notmetered
ltx/en_us_oca/me.m09.d07:meMA.Ode9C14.mode	@ltx/en_us_oca/miscellanea:misc.Mode4
ltx/en_us_oca/me.m09.d07:meMA.Ode9C14.ode	@ltx/en_us_oca/miscellanea:misc.Ode9
ltx/en_us_oca/me.m09.d07:meMA.Ode9C14.text	
ltx/en_us_oca/me.m09.d07:meMA.Ode9C15.incipit	…
ltx/en_us_oca/me.m09.d07:meMA.Ode9C15.melody	@ltx/en_us_oca/he.h.m4:heHE.ApasGigenis.notmetered
ltx/en_us_oca/me.m09.d07:meMA.Ode9C15.mode	@ltx/en_us_oca/miscellanea:misc.Mode4
ltx/en_us_oca/me.m09.d07:meMA.Ode9C15.ode	@ltx/en_us_oca/miscellanea:misc.Ode9
ltx/en_us_oca/me.m09.d07:meMA.Ode9C15.text	
ltx/en_us_oca/me.m09.d07:meMA.Ode9C21.greekmelody	@ltx/en_us_oca/he.h.m4:heHE.LithosAcheirotmitos.greekname
ltx/en_us_oca/me.m09.d07:meMA.Ode9C21.incipit	…
ltx/en_us_oca/me.m09.d07:meMA.Ode9C21.melody	@ltx/en_us_oca/he.h.m4:heHE.LithosAcheirotmitos.notmetered
ltx/en_us_oca/me.m09.d07:meMA.Ode9C21.mode	@ltx/en_us_oca/miscellanea:misc.Mode4
ltx/en_us_oca/me.m09.d07:meMA.Ode9C21.ode	@ltx/en_us_oca/miscellanea:misc.Ode9
ltx/en_us_oca/me.m09.d07:meMA.Ode9C21.text	
ltx/en_us_oca/me.m09.d07:meMA.Ode9C22.incipit	…
ltx/en_us_oca/me.m09.d07:meMA.Ode9C22.melody	@ltx/en_us_oca/he.h.m4:heHE.LithosAcheirotmitos.notmetered
ltx/en_us_oca/me.m09.d07:meMA.Ode9C22.mode	@ltx/en_us_oca/miscellanea:misc.Mode4
ltx/en_us_oca/me.m09.d07:meMA.Ode9C22.ode	@ltx/en_us_oca/miscellanea:misc.Ode9
ltx/en_us_oca/me.m09.d07:meMA.Ode9C22.text	
ltx/en_us_oca/me.m09.d07:meMA.Ode9C23.incipit	…
ltx/en_us_oca/me.m09.d07:meMA.Ode9C23.melody	@ltx/en_us_oca/he.h.m4:heHE.LithosAcheirotmitos.notmetered
ltx/en_us_oca/me.m09.d07:meMA.Ode9C23.mode	@ltx/en_us_oca/miscellanea:misc.Mode4
ltx/en_us_oca/me.m09.d07:meMA.Ode9C23.ode	@ltx/en_us_oca/miscellanea:misc.Ode9
ltx/en_us_oca/me.m09.d07:meMA.Ode9C23.text	
ltx/en_us_oca/me.m09.d07:meMA.Ode9C2T.incipit	…
ltx/en_us_oca/me.m09.d07:meMA.Ode9C2T.melody	@ltx/en_us_oca/he.h.m4:heHE.LithosAcheirotmitos.notmetered
ltx/en_us_oca/me.m09.d07:meMA.Ode9C2T.mode	@ltx/en_us_oca/miscellanea:misc.Mode4
ltx/en_us_oca/me.m09.d07:meMA.Ode9C2T.ode	@ltx/en_us_oca/miscellanea:misc.Ode9
ltx/en_us_oca/me.m09.d07:meMA.Ode9C2T.text	
ltx/en_us_oca/me.m09.d07:meMA.Ode9H.greekmelody	@ltx/en_us_oca/he.h.m4:heHE.LithosAcheirotmitos.greekname
ltx/en_us_oca/me.m09.d07:meMA.Ode9H.incipit	@ltx/en_us_oca/he.h.m4:heHE.LithosAcheirotmitos.incipit
ltx/en_us_oca/me.m09.d07:meMA.Ode9H.melody	@ltx/en_us_oca/he.h.m4:heHE.LithosAcheirotmitos.melody
ltx/en_us_oca/me.m09.d07:meMA.Ode9H.mode	@ltx/en_us_oca/miscellanea:misc.Mode4
ltx/en_us_oca/me.m09.d07:meMA.Ode9H.ode	@ltx/en_us_oca/miscellanea:misc.Ode9
ltx/en_us_oca/me.m09.d07:meMA.Ode9H.text	@ltx/en_us_oca/he.h.m4:heHE.LithosAcheirotmitos.text
ltx/en_us_oca/me.m09.d07:meMA.Oikos1.text	
ltx/en_us_oca/me.m09.d07:meVE.Apolytikion1.greekmelody	@ltx/en_us_oca/he.a.m4:heAU.KateplagiIosif.greekname
ltx/en_us_oca/me.m09.d07:meVE.Apolytikion1.incipit	…
ltx/en_us_oca/me.m09.d07:meVE.Apolytikion1.melody	@ltx/en_us_oca/he.a.m4:heAU.KateplagiIosif.notmetered
ltx/en_us_oca/me.m09.d07:meVE.Apolytikion1.mode	@ltx/en_us_oca/miscellanea:misc.Mode4
ltx/en_us_oca/me.m09.d07:meVE.Apolytikion1.text	
ltx/en_us_oca/me.m09.d07:meVE.AposGlory.incipit	The joy of the world…
ltx/en_us_oca/me.m09.d07:meVE.AposGlory.melody	
ltx/en_us_oca/me.m09.d07:meVE.AposGlory.mode	@ltx/en_us_oca/miscellanea:misc.Mode4
ltx/en_us_oca/me.m09.d07:meVE.AposGlory.poet	@ltx/en_us_oca/poets:po.Germanou
ltx/en_us_oca/me.m09.d07:meVE.AposGlory.text	The joy of the world has appeared: ⁄ The glorified Virgin sprung from Joachim and Anna. ⁄ Because of her purity she became the living temple of God. ⁄ Only she is called the Theotokos. ⁄ Through her prayers, Christ God, send peace to the world, ⁄⁄ and to our souls great mercy!
ltx/en_us_oca/me.m09.d07:meVE.Aposticha1.greekmelody	@ltx/en_us_oca/he.a.m8:heAU.OTouParadoxou.greekname
ltx/en_us_oca/me.m09.d07:meVE.Aposticha1.incipit	Most strange wonder! ⁄ From…
ltx/en_us_oca/me.m09.d07:meVE.Aposticha1.melody	@ltx/en_us_oca/he.a.m8:heAU.OTouParadoxou.notmetered
ltx/en_us_oca/me.m09.d07:meVE.Aposticha1.mode	@ltx/en_us_oca/miscellanea:misc.Mode8
ltx/en_us_oca/me.m09.d07:meVE.Aposticha1.text	Most strange wonder! ⁄ From the fruitless womb of a barren mother ⁄ the root has borne a flower! ⁄ The Virgin Mother of God is born today ⁄ from the righteous Joachim and Anna. ⁄ Rejoice, ranks of patriarchs and prophets! ⁄⁄ Let everyone assemble in joy at her birth!
ltx/en_us_oca/me.m09.d07:meVE.Aposticha2.incipit	Today David exults and Jesse…
ltx/en_us_oca/me.m09.d07:meVE.Aposticha2.melody	@ltx/en_us_oca/he.a.m8:heAU.OTouParadoxou.notmetered
ltx/en_us_oca/me.m09.d07:meVE.Aposticha2.mode	@ltx/en_us_oca/miscellanea:misc.Mode8
ltx/en_us_oca/me.m09.d07:meVE.Aposticha2.text	Today David exults and Jesse leaps for joy! ⁄ Levi is exalted and rejoices in spirit! ⁄ Righteous Joachim and Anna are free from barrenness ⁄ by the birth of Mary, pure and full of grace, ⁄⁄ whom the assembly of angels and mortal men magnify.
ltx/en_us_oca/me.m09.d07:meVE.Aposticha3.incipit	The human race praises you…
ltx/en_us_oca/me.m09.d07:meVE.Aposticha3.melody	@ltx/en_us_oca/he.a.m8:heAU.OTouParadoxou.notmetered
ltx/en_us_oca/me.m09.d07:meVE.Aposticha3.mode	@ltx/en_us_oca/miscellanea:misc.Mode8
ltx/en_us_oca/me.m09.d07:meVE.Aposticha3.text	The human race praises you in joy: ⁄ Rejoice, temple of God and holy mountain! ⁄ Rejoice, divine throne and brilliant star! ⁄ Rejoice, glory of the Orthodox! ⁄ Rejoice, Mary, Mother of Christ our God! ⁄ Rejoice, pillar of fire and cloud of light! ⁄ Rejoice, burning bush that is never consumed! ⁄⁄ Rejoice, hope of all!
ltx/en_us_oca/me.m09.d07:meVE.MM.Stichera1123as78910.text	
ltx/en_us_oca/me.m09.d07:meVE.SticGlory.incipit	The angelic host of heaven…
ltx/en_us_oca/me.m09.d07:meVE.SticGlory.melody	
ltx/en_us_oca/me.m09.d07:meVE.SticGlory.mode	@ltx/en_us_oca/miscellanea:misc.Mode4
ltx/en_us_oca/me.m09.d07:meVE.SticGlory.text	The angelic host of heaven and we mortals on earth, ⁄ bless your honorable birth, most holy Virgin, ⁄ for you became the Mother of Christ our God, the Creator of all. ⁄ Never cease to pray for us unwedded Theotokos: ⁄⁄ Bring our hopes before your Son!
ltx/en_us_oca/me.m09.d07:meVE.Stichera01.greekmelody	@ltx/en_us_oca/he.a.m1:heAU.TonOuranionTagmaton.greekname
ltx/en_us_oca/me.m09.d07:meVE.Stichera01.incipit	By your birth, O pure…
ltx/en_us_oca/me.m09.d07:meVE.Stichera01.melody	@ltx/en_us_oca/he.a.m1:heAU.TonOuranionTagmaton.notmetered
ltx/en_us_oca/me.m09.d07:meVE.Stichera01.mode	@ltx/en_us_oca/miscellanea:misc.Mode1
ltx/en_us_oca/me.m09.d07:meVE.Stichera01.text	By your birth, O pure one, ⁄ beams of joy shine on all the universe, ⁄ announcing Christ our God to all. ⁄ He is the Sun of glory! ⁄ You will give birth to Him for us: ⁄⁄ He brings us gladness, grace and truth!
ltx/en_us_oca/me.m09.d07:meVE.Stichera02.incipit	We anticipate your glorious feast…
ltx/en_us_oca/me.m09.d07:meVE.Stichera02.melody	@ltx/en_us_oca/he.a.m1:heAU.TonOuranionTagmaton.notmetered
ltx/en_us_oca/me.m09.d07:meVE.Stichera02.mode	@ltx/en_us_oca/miscellanea:misc.Mode1
ltx/en_us_oca/me.m09.d07:meVE.Stichera02.text	We anticipate your glorious feast, O pure one! ⁄ It proclaims to all the good will of our Benefactor. ⁄ Now you have become the cause of our joy, ⁄ the herald of promised grace ⁄⁄ and the fruit of divine gladness!
ltx/en_us_oca/me.m09.d07:meVE.Stichera03.incipit	The child of God, the…
ltx/en_us_oca/me.m09.d07:meVE.Stichera03.melody	@ltx/en_us_oca/he.a.m1:heAU.TonOuranionTagmaton.notmetered
ltx/en_us_oca/me.m09.d07:meVE.Stichera03.mode	@ltx/en_us_oca/miscellanea:misc.Mode1
ltx/en_us_oca/me.m09.d07:meVE.Stichera03.text	The child of God, the holy Theotokos, ⁄ the promise of the prophets, the daughter of David, ⁄ today is born from wise Joachim and Anna. ⁄ She has overthrown the curse of Adam for us ⁄⁄ by her holy childbearing.
ltx/en_us_oca/me.m09.d07:meVE.Stichera04.greekmelody	@ltx/en_us_oca/he.a.m4:heAU.EdokasSimeiosin.greekname
ltx/en_us_oca/me.m09.d07:meVE.Stichera04.incipit	When He Who of His…
ltx/en_us_oca/me.m09.d07:meVE.Stichera04.melody	@ltx/en_us_oca/he.a.m4:heAU.EdokasSimeiosin.notmetered
ltx/en_us_oca/me.m09.d07:meVE.Stichera04.mode	@ltx/en_us_oca/miscellanea:misc.Mode4
ltx/en_us_oca/me.m09.d07:meVE.Stichera04.text	When He Who of His own will took our weakness upon Himself ⁄ strengthened your weakness with power, blessed one, ⁄ you ran the race of martyrdom for His sake with joy. ⁄ You crushed the impotent enemy with your most beautiful feet. ⁄ Therefore, Jesus, the Lover of mankind and Savior of our souls, ⁄⁄ has woven wreaths of victory for you!
ltx/en_us_oca/me.m09.d07:meVE.Stichera05.incipit	When you were wounded, glorious…
ltx/en_us_oca/me.m09.d07:meVE.Stichera05.melody	@ltx/en_us_oca/he.a.m4:heAU.EdokasSimeiosin.notmetered
ltx/en_us_oca/me.m09.d07:meVE.Stichera05.mode	@ltx/en_us_oca/miscellanea:misc.Mode4
ltx/en_us_oca/me.m09.d07:meVE.Stichera05.text	When you were wounded, glorious one, ⁄ you wounded your enemies ⁄ and armed with the cross, you threw them down to the ground! ⁄ You were openly arrayed in invincible armor ⁄ and made steady by the love of Him ⁄ Who has translated you to the spiritual kingdoms ⁄⁄ as an unconquered martyr and heavenly man!
ltx/en_us_oca/me.m09.d07:meVE.Stichera06.incipit	You openly imitated the Savior…
ltx/en_us_oca/me.m09.d07:meVE.Stichera06.melody	@ltx/en_us_oca/he.a.m4:heAU.EdokasSimeiosin.notmetered
ltx/en_us_oca/me.m09.d07:meVE.Stichera06.mode	@ltx/en_us_oca/miscellanea:misc.Mode4
ltx/en_us_oca/me.m09.d07:meVE.Stichera06.text	You openly imitated the Savior and Lord ⁄ Who for your sake endured voluntary sufferings. ⁄ Of your own will, athlete Sozon, you gave yourself ⁄ to wounds and beatings and unbearable torments. ⁄ Therefore, He has honored you with heavenly gifts ⁄⁄ and revealed you to be a source of healings for those who love you!
