ltx/en_us_oca/me.m10.d19:meDA.commemoration.first	
ltx/en_us_oca/me.m10.d19:meDA.commemoration.first_name	
ltx/en_us_oca/me.m10.d19:meDA.commemoration.first_short	
ltx/en_us_oca/me.m10.d19:meDA.commemoration.first_title	
ltx/en_us_oca/me.m10.d19:meDA.commemoration.full	
ltx/en_us_oca/me.m10.d19:meDA.commemoration.second_name	
ltx/en_us_oca/me.m10.d19:meDA.commemoration.second_title	
ltx/en_us_oca/me.m10.d19:meDA.date	
ltx/en_us_oca/me.m10.d19:meDA.fordate	
ltx/en_us_oca/me.m10.d19:meDA.insert1	
ltx/en_us_oca/me.m10.d19:meDA.insert2	
ltx/en_us_oca/me.m10.d19:meDA.note	
ltx/en_us_oca/me.m10.d19:meDA.pdfcoverdate	
ltx/en_us_oca/me.m10.d19:meDA.pdfheaderdate	
ltx/en_us_oca/me.m10.d19:meHO.commemorations	
ltx/en_us_oca/me.m10.d19:meHO.note1	
ltx/en_us_oca/me.m10.d19:meHO.note2	
ltx/en_us_oca/me.m10.d19:meHO.number	
ltx/en_us_oca/me.m10.d19:meHO.rank	
ltx/en_us_oca/me.m10.d19:meLE.commemoration1	
ltx/en_us_oca/me.m10.d19:meLE.commemoration2	
ltx/en_us_oca/me.m10.d19:meLI.Kontakion1.incipit	…
ltx/en_us_oca/me.m10.d19:meLI.Kontakion1.melody	
ltx/en_us_oca/me.m10.d19:meLI.Kontakion1.mode	
ltx/en_us_oca/me.m10.d19:meLI.Kontakion1.text	
ltx/en_us_oca/me.m10.d19:meLI.Megalynarion.text	
ltx/en_us_oca/me.m10.d19:meMA.C1.acrostic.notice1	
ltx/en_us_oca/me.m10.d19:meMA.C1.acrostic.text	
ltx/en_us_oca/me.m10.d19:meMA.C1.acrostic.title	
ltx/en_us_oca/me.m10.d19:meMA.C1.poet	@ltx/en_us_oca/poets:po.Theofanous
ltx/en_us_oca/me.m10.d19:meMA.C1.title	@ltx/en_us_oca/titles:ti.CanonProphet
ltx/en_us_oca/me.m10.d19:meMA.C1.verse	@ltx/en_us_oca/prayers:pr.verse_Prophet.text
ltx/en_us_oca/me.m10.d19:meMA.C2.acrostic.notice1	
ltx/en_us_oca/me.m10.d19:meMA.C2.acrostic.text	
ltx/en_us_oca/me.m10.d19:meMA.C2.acrostic.title	
ltx/en_us_oca/me.m10.d19:meMA.C2.title	@ltx/en_us_oca/titles:ti.CanonMartyrM
ltx/en_us_oca/me.m10.d19:meMA.C2.verse	@ltx/en_us_oca/prayers:pr.verse_SaintM.text
ltx/en_us_oca/me.m10.d19:meMA.Ode1C11.greekmelody	@ltx/en_us_oca/he.h.m2:heHE.DefteLaoi.greekname
ltx/en_us_oca/me.m10.d19:meMA.Ode1C11.incipit	…
ltx/en_us_oca/me.m10.d19:meMA.Ode1C11.melody	@ltx/en_us_oca/he.h.m2:heHE.DefteLaoi.notmetered
ltx/en_us_oca/me.m10.d19:meMA.Ode1C11.mode	@ltx/en_us_oca/miscellanea:misc.Mode2
ltx/en_us_oca/me.m10.d19:meMA.Ode1C11.ode	@ltx/en_us_oca/miscellanea:misc.Ode1
ltx/en_us_oca/me.m10.d19:meMA.Ode1C11.text	
ltx/en_us_oca/me.m10.d19:meMA.Ode1C12.incipit	…
ltx/en_us_oca/me.m10.d19:meMA.Ode1C12.melody	@ltx/en_us_oca/he.h.m2:heHE.DefteLaoi.notmetered
ltx/en_us_oca/me.m10.d19:meMA.Ode1C12.mode	@ltx/en_us_oca/miscellanea:misc.Mode2
ltx/en_us_oca/me.m10.d19:meMA.Ode1C12.ode	@ltx/en_us_oca/miscellanea:misc.Ode1
ltx/en_us_oca/me.m10.d19:meMA.Ode1C12.text	
ltx/en_us_oca/me.m10.d19:meMA.Ode1C13.incipit	…
ltx/en_us_oca/me.m10.d19:meMA.Ode1C13.melody	@ltx/en_us_oca/he.h.m2:heHE.DefteLaoi.notmetered
ltx/en_us_oca/me.m10.d19:meMA.Ode1C13.mode	@ltx/en_us_oca/miscellanea:misc.Mode2
ltx/en_us_oca/me.m10.d19:meMA.Ode1C13.ode	@ltx/en_us_oca/miscellanea:misc.Ode1
ltx/en_us_oca/me.m10.d19:meMA.Ode1C13.text	
ltx/en_us_oca/me.m10.d19:meMA.Ode1C1T.incipit	…
ltx/en_us_oca/me.m10.d19:meMA.Ode1C1T.melody	@ltx/en_us_oca/he.h.m2:heHE.DefteLaoi.notmetered
ltx/en_us_oca/me.m10.d19:meMA.Ode1C1T.mode	@ltx/en_us_oca/miscellanea:misc.Mode2
ltx/en_us_oca/me.m10.d19:meMA.Ode1C1T.ode	@ltx/en_us_oca/miscellanea:misc.Ode1
ltx/en_us_oca/me.m10.d19:meMA.Ode1C1T.text	
ltx/en_us_oca/me.m10.d19:meMA.Ode1C21.greekmelody	@ltx/en_us_oca/he.h.m6:heHE.OsEnIpeiroPezefsas.greekname
ltx/en_us_oca/me.m10.d19:meMA.Ode1C21.incipit	…
ltx/en_us_oca/me.m10.d19:meMA.Ode1C21.melody	@ltx/en_us_oca/he.h.m6:heHE.OsEnIpeiroPezefsas.notmetered
ltx/en_us_oca/me.m10.d19:meMA.Ode1C21.mode	@ltx/en_us_oca/miscellanea:misc.Mode6
ltx/en_us_oca/me.m10.d19:meMA.Ode1C21.ode	@ltx/en_us_oca/miscellanea:misc.Ode1
ltx/en_us_oca/me.m10.d19:meMA.Ode1C21.text	
ltx/en_us_oca/me.m10.d19:meMA.Ode1C22.incipit	…
ltx/en_us_oca/me.m10.d19:meMA.Ode1C22.melody	@ltx/en_us_oca/he.h.m6:heHE.OsEnIpeiroPezefsas.notmetered
ltx/en_us_oca/me.m10.d19:meMA.Ode1C22.mode	@ltx/en_us_oca/miscellanea:misc.Mode6
ltx/en_us_oca/me.m10.d19:meMA.Ode1C22.ode	@ltx/en_us_oca/miscellanea:misc.Ode1
ltx/en_us_oca/me.m10.d19:meMA.Ode1C22.text	
ltx/en_us_oca/me.m10.d19:meMA.Ode1C23.incipit	…
ltx/en_us_oca/me.m10.d19:meMA.Ode1C23.melody	@ltx/en_us_oca/he.h.m6:heHE.OsEnIpeiroPezefsas.notmetered
ltx/en_us_oca/me.m10.d19:meMA.Ode1C23.mode	@ltx/en_us_oca/miscellanea:misc.Mode6
ltx/en_us_oca/me.m10.d19:meMA.Ode1C23.ode	@ltx/en_us_oca/miscellanea:misc.Ode1
ltx/en_us_oca/me.m10.d19:meMA.Ode1C23.text	
ltx/en_us_oca/me.m10.d19:meMA.Ode1C2T.incipit	…
ltx/en_us_oca/me.m10.d19:meMA.Ode1C2T.melody	@ltx/en_us_oca/he.h.m6:heHE.OsEnIpeiroPezefsas.notmetered
ltx/en_us_oca/me.m10.d19:meMA.Ode1C2T.mode	@ltx/en_us_oca/miscellanea:misc.Mode6
ltx/en_us_oca/me.m10.d19:meMA.Ode1C2T.ode	@ltx/en_us_oca/miscellanea:misc.Ode1
ltx/en_us_oca/me.m10.d19:meMA.Ode1C2T.text	
ltx/en_us_oca/me.m10.d19:meMA.Ode3C11.greekmelody	@ltx/en_us_oca/he.h.m2:heHE.StereosonImasEnSoiKyrie.greekname
ltx/en_us_oca/me.m10.d19:meMA.Ode3C11.incipit	…
ltx/en_us_oca/me.m10.d19:meMA.Ode3C11.melody	@ltx/en_us_oca/he.h.m2:heHE.StereosonImasEnSoiKyrie.notmetered
ltx/en_us_oca/me.m10.d19:meMA.Ode3C11.mode	@ltx/en_us_oca/miscellanea:misc.Mode2
ltx/en_us_oca/me.m10.d19:meMA.Ode3C11.ode	@ltx/en_us_oca/miscellanea:misc.Ode3
ltx/en_us_oca/me.m10.d19:meMA.Ode3C11.text	
ltx/en_us_oca/me.m10.d19:meMA.Ode3C12.incipit	…
ltx/en_us_oca/me.m10.d19:meMA.Ode3C12.melody	@ltx/en_us_oca/he.h.m2:heHE.StereosonImasEnSoiKyrie.notmetered
ltx/en_us_oca/me.m10.d19:meMA.Ode3C12.mode	@ltx/en_us_oca/miscellanea:misc.Mode2
ltx/en_us_oca/me.m10.d19:meMA.Ode3C12.ode	@ltx/en_us_oca/miscellanea:misc.Ode3
ltx/en_us_oca/me.m10.d19:meMA.Ode3C12.text	
ltx/en_us_oca/me.m10.d19:meMA.Ode3C13.incipit	…
ltx/en_us_oca/me.m10.d19:meMA.Ode3C13.melody	@ltx/en_us_oca/he.h.m2:heHE.StereosonImasEnSoiKyrie.notmetered
ltx/en_us_oca/me.m10.d19:meMA.Ode3C13.mode	@ltx/en_us_oca/miscellanea:misc.Mode2
ltx/en_us_oca/me.m10.d19:meMA.Ode3C13.ode	@ltx/en_us_oca/miscellanea:misc.Ode3
ltx/en_us_oca/me.m10.d19:meMA.Ode3C13.text	
ltx/en_us_oca/me.m10.d19:meMA.Ode3C1T.incipit	…
ltx/en_us_oca/me.m10.d19:meMA.Ode3C1T.melody	@ltx/en_us_oca/he.h.m2:heHE.StereosonImasEnSoiKyrie.notmetered
ltx/en_us_oca/me.m10.d19:meMA.Ode3C1T.mode	@ltx/en_us_oca/miscellanea:misc.Mode2
ltx/en_us_oca/me.m10.d19:meMA.Ode3C1T.ode	@ltx/en_us_oca/miscellanea:misc.Ode3
ltx/en_us_oca/me.m10.d19:meMA.Ode3C1T.text	
ltx/en_us_oca/me.m10.d19:meMA.Ode3C21.greekmelody	@ltx/en_us_oca/he.h.m6:heHE.OukEstinAgios.greekname
ltx/en_us_oca/me.m10.d19:meMA.Ode3C21.incipit	…
ltx/en_us_oca/me.m10.d19:meMA.Ode3C21.melody	@ltx/en_us_oca/he.h.m6:heHE.OukEstinAgios.notmetered
ltx/en_us_oca/me.m10.d19:meMA.Ode3C21.mode	@ltx/en_us_oca/miscellanea:misc.Mode6
ltx/en_us_oca/me.m10.d19:meMA.Ode3C21.ode	@ltx/en_us_oca/miscellanea:misc.Ode3
ltx/en_us_oca/me.m10.d19:meMA.Ode3C21.text	
ltx/en_us_oca/me.m10.d19:meMA.Ode3C22.incipit	…
ltx/en_us_oca/me.m10.d19:meMA.Ode3C22.melody	@ltx/en_us_oca/he.h.m6:heHE.OukEstinAgios.notmetered
ltx/en_us_oca/me.m10.d19:meMA.Ode3C22.mode	@ltx/en_us_oca/miscellanea:misc.Mode6
ltx/en_us_oca/me.m10.d19:meMA.Ode3C22.ode	@ltx/en_us_oca/miscellanea:misc.Ode3
ltx/en_us_oca/me.m10.d19:meMA.Ode3C22.text	
ltx/en_us_oca/me.m10.d19:meMA.Ode3C23.incipit	…
ltx/en_us_oca/me.m10.d19:meMA.Ode3C23.melody	@ltx/en_us_oca/he.h.m6:heHE.OukEstinAgios.notmetered
ltx/en_us_oca/me.m10.d19:meMA.Ode3C23.mode	@ltx/en_us_oca/miscellanea:misc.Mode6
ltx/en_us_oca/me.m10.d19:meMA.Ode3C23.ode	@ltx/en_us_oca/miscellanea:misc.Ode3
ltx/en_us_oca/me.m10.d19:meMA.Ode3C23.text	
ltx/en_us_oca/me.m10.d19:meMA.Ode3C2T.incipit	…
ltx/en_us_oca/me.m10.d19:meMA.Ode3C2T.melody	@ltx/en_us_oca/he.h.m6:heHE.OukEstinAgios.notmetered
ltx/en_us_oca/me.m10.d19:meMA.Ode3C2T.mode	@ltx/en_us_oca/miscellanea:misc.Mode6
ltx/en_us_oca/me.m10.d19:meMA.Ode3C2T.ode	@ltx/en_us_oca/miscellanea:misc.Ode3
ltx/en_us_oca/me.m10.d19:meMA.Ode3C2T.text	
ltx/en_us_oca/me.m10.d19:meMA.Ode3H.greekmelody	@ltx/en_us_oca/he.h.m6:heHE.OukEstinAgios.greekname
ltx/en_us_oca/me.m10.d19:meMA.Ode3H.incipit	@ltx/en_us_oca/he.h.m6:heHE.OukEstinAgios.incipit
ltx/en_us_oca/me.m10.d19:meMA.Ode3H.melody	@ltx/en_us_oca/he.h.m6:heHE.OukEstinAgios.melody
ltx/en_us_oca/me.m10.d19:meMA.Ode3H.mode	@ltx/en_us_oca/miscellanea:misc.Mode6
ltx/en_us_oca/me.m10.d19:meMA.Ode3H.ode	@ltx/en_us_oca/miscellanea:misc.Ode3
ltx/en_us_oca/me.m10.d19:meMA.Ode3H.text	@ltx/en_us_oca/he.h.m6:heHE.OukEstinAgios.text
ltx/en_us_oca/me.m10.d19:meMA.Ode3Kathisma1.greekmelody	@ltx/en_us_oca/he.a.m4:heAU.OYpsotheisEnToStavro.greekname
ltx/en_us_oca/me.m10.d19:meMA.Ode3Kathisma1.incipit	…
ltx/en_us_oca/me.m10.d19:meMA.Ode3Kathisma1.melody	@ltx/en_us_oca/he.a.m4:heAU.OYpsotheisEnToStavro.notmetered
ltx/en_us_oca/me.m10.d19:meMA.Ode3Kathisma1.mode	@ltx/en_us_oca/miscellanea:misc.Mode4
ltx/en_us_oca/me.m10.d19:meMA.Ode3Kathisma1.text	
ltx/en_us_oca/me.m10.d19:meMA.Ode3Kathisma2.greekmelody	@ltx/en_us_oca/he.a.m1:heAU.TonTafonSouSotir.greekname
ltx/en_us_oca/me.m10.d19:meMA.Ode3Kathisma2.incipit	…
ltx/en_us_oca/me.m10.d19:meMA.Ode3Kathisma2.melody	@ltx/en_us_oca/he.a.m1:heAU.TonTafonSouSotir.notmetered
ltx/en_us_oca/me.m10.d19:meMA.Ode3Kathisma2.mode	@ltx/en_us_oca/miscellanea:misc.Mode1
ltx/en_us_oca/me.m10.d19:meMA.Ode3Kathisma2.text	
ltx/en_us_oca/me.m10.d19:meMA.Ode3KathismaSt.incipit	…
ltx/en_us_oca/me.m10.d19:meMA.Ode3KathismaSt.melody	@ltx/en_us_oca/he.a.m1:heAU.TonTafonSouSotir.notmetered
ltx/en_us_oca/me.m10.d19:meMA.Ode3KathismaSt.mode	@ltx/en_us_oca/miscellanea:misc.Mode1
ltx/en_us_oca/me.m10.d19:meMA.Ode3KathismaSt.text	
ltx/en_us_oca/me.m10.d19:meMA.Ode3KathismaT.incipit	…
ltx/en_us_oca/me.m10.d19:meMA.Ode3KathismaT.melody	@ltx/en_us_oca/he.a.m1:heAU.TonTafonSouSotir.notmetered
ltx/en_us_oca/me.m10.d19:meMA.Ode3KathismaT.mode	@ltx/en_us_oca/miscellanea:misc.Mode1
ltx/en_us_oca/me.m10.d19:meMA.Ode3KathismaT.text	
ltx/en_us_oca/me.m10.d19:meMA.Ode4C11.greekmelody	@ltx/en_us_oca/he.h.m2:heHE.EisakikoaKyrieTinAkoin.greekname
ltx/en_us_oca/me.m10.d19:meMA.Ode4C11.incipit	…
ltx/en_us_oca/me.m10.d19:meMA.Ode4C11.melody	@ltx/en_us_oca/he.h.m2:heHE.EisakikoaKyrieTinAkoin.notmetered
ltx/en_us_oca/me.m10.d19:meMA.Ode4C11.mode	@ltx/en_us_oca/miscellanea:misc.Mode2
ltx/en_us_oca/me.m10.d19:meMA.Ode4C11.ode	@ltx/en_us_oca/miscellanea:misc.Ode4
ltx/en_us_oca/me.m10.d19:meMA.Ode4C11.text	
ltx/en_us_oca/me.m10.d19:meMA.Ode4C12.incipit	…
ltx/en_us_oca/me.m10.d19:meMA.Ode4C12.melody	@ltx/en_us_oca/he.h.m2:heHE.EisakikoaKyrieTinAkoin.notmetered
ltx/en_us_oca/me.m10.d19:meMA.Ode4C12.mode	@ltx/en_us_oca/miscellanea:misc.Mode2
ltx/en_us_oca/me.m10.d19:meMA.Ode4C12.ode	@ltx/en_us_oca/miscellanea:misc.Ode4
ltx/en_us_oca/me.m10.d19:meMA.Ode4C12.text	
ltx/en_us_oca/me.m10.d19:meMA.Ode4C13.incipit	…
ltx/en_us_oca/me.m10.d19:meMA.Ode4C13.melody	@ltx/en_us_oca/he.h.m2:heHE.EisakikoaKyrieTinAkoin.notmetered
ltx/en_us_oca/me.m10.d19:meMA.Ode4C13.mode	@ltx/en_us_oca/miscellanea:misc.Mode2
ltx/en_us_oca/me.m10.d19:meMA.Ode4C13.ode	@ltx/en_us_oca/miscellanea:misc.Ode4
ltx/en_us_oca/me.m10.d19:meMA.Ode4C13.text	
ltx/en_us_oca/me.m10.d19:meMA.Ode4C1T.incipit	…
ltx/en_us_oca/me.m10.d19:meMA.Ode4C1T.melody	@ltx/en_us_oca/he.h.m2:heHE.EisakikoaKyrieTinAkoin.notmetered
ltx/en_us_oca/me.m10.d19:meMA.Ode4C1T.mode	@ltx/en_us_oca/miscellanea:misc.Mode2
ltx/en_us_oca/me.m10.d19:meMA.Ode4C1T.ode	@ltx/en_us_oca/miscellanea:misc.Ode4
ltx/en_us_oca/me.m10.d19:meMA.Ode4C1T.text	
ltx/en_us_oca/me.m10.d19:meMA.Ode4C21.greekmelody	@ltx/en_us_oca/he.h.m6:heHE.ChristosMouDynamis.greekname
ltx/en_us_oca/me.m10.d19:meMA.Ode4C21.incipit	…
ltx/en_us_oca/me.m10.d19:meMA.Ode4C21.melody	@ltx/en_us_oca/he.h.m6:heHE.ChristosMouDynamis.notmetered
ltx/en_us_oca/me.m10.d19:meMA.Ode4C21.mode	@ltx/en_us_oca/miscellanea:misc.Mode6
ltx/en_us_oca/me.m10.d19:meMA.Ode4C21.ode	@ltx/en_us_oca/miscellanea:misc.Ode4
ltx/en_us_oca/me.m10.d19:meMA.Ode4C21.text	
ltx/en_us_oca/me.m10.d19:meMA.Ode4C22.incipit	…
ltx/en_us_oca/me.m10.d19:meMA.Ode4C22.melody	@ltx/en_us_oca/he.h.m6:heHE.ChristosMouDynamis.notmetered
ltx/en_us_oca/me.m10.d19:meMA.Ode4C22.mode	@ltx/en_us_oca/miscellanea:misc.Mode6
ltx/en_us_oca/me.m10.d19:meMA.Ode4C22.ode	@ltx/en_us_oca/miscellanea:misc.Ode4
ltx/en_us_oca/me.m10.d19:meMA.Ode4C22.text	
ltx/en_us_oca/me.m10.d19:meMA.Ode4C23.incipit	…
ltx/en_us_oca/me.m10.d19:meMA.Ode4C23.melody	@ltx/en_us_oca/he.h.m6:heHE.ChristosMouDynamis.notmetered
ltx/en_us_oca/me.m10.d19:meMA.Ode4C23.mode	@ltx/en_us_oca/miscellanea:misc.Mode6
ltx/en_us_oca/me.m10.d19:meMA.Ode4C23.ode	@ltx/en_us_oca/miscellanea:misc.Ode4
ltx/en_us_oca/me.m10.d19:meMA.Ode4C23.text	
ltx/en_us_oca/me.m10.d19:meMA.Ode4C2T.incipit	…
ltx/en_us_oca/me.m10.d19:meMA.Ode4C2T.melody	@ltx/en_us_oca/he.h.m6:heHE.ChristosMouDynamis.notmetered
ltx/en_us_oca/me.m10.d19:meMA.Ode4C2T.mode	@ltx/en_us_oca/miscellanea:misc.Mode6
ltx/en_us_oca/me.m10.d19:meMA.Ode4C2T.ode	@ltx/en_us_oca/miscellanea:misc.Ode4
ltx/en_us_oca/me.m10.d19:meMA.Ode4C2T.text	
ltx/en_us_oca/me.m10.d19:meMA.Ode5C11.greekmelody	@ltx/en_us_oca/he.h.m2:heHE.TisNyktosDielthousis.greekname
ltx/en_us_oca/me.m10.d19:meMA.Ode5C11.incipit	…
ltx/en_us_oca/me.m10.d19:meMA.Ode5C11.melody	@ltx/en_us_oca/he.h.m2:heHE.TisNyktosDielthousis.notmetered
ltx/en_us_oca/me.m10.d19:meMA.Ode5C11.mode	@ltx/en_us_oca/miscellanea:misc.Mode2
ltx/en_us_oca/me.m10.d19:meMA.Ode5C11.ode	@ltx/en_us_oca/miscellanea:misc.Ode5
ltx/en_us_oca/me.m10.d19:meMA.Ode5C11.text	
ltx/en_us_oca/me.m10.d19:meMA.Ode5C12.incipit	…
ltx/en_us_oca/me.m10.d19:meMA.Ode5C12.melody	@ltx/en_us_oca/he.h.m2:heHE.TisNyktosDielthousis.notmetered
ltx/en_us_oca/me.m10.d19:meMA.Ode5C12.mode	@ltx/en_us_oca/miscellanea:misc.Mode2
ltx/en_us_oca/me.m10.d19:meMA.Ode5C12.ode	@ltx/en_us_oca/miscellanea:misc.Ode5
ltx/en_us_oca/me.m10.d19:meMA.Ode5C12.text	
ltx/en_us_oca/me.m10.d19:meMA.Ode5C13.incipit	…
ltx/en_us_oca/me.m10.d19:meMA.Ode5C13.melody	@ltx/en_us_oca/he.h.m2:heHE.TisNyktosDielthousis.notmetered
ltx/en_us_oca/me.m10.d19:meMA.Ode5C13.mode	@ltx/en_us_oca/miscellanea:misc.Mode2
ltx/en_us_oca/me.m10.d19:meMA.Ode5C13.ode	@ltx/en_us_oca/miscellanea:misc.Ode5
ltx/en_us_oca/me.m10.d19:meMA.Ode5C13.text	
ltx/en_us_oca/me.m10.d19:meMA.Ode5C1T.incipit	…
ltx/en_us_oca/me.m10.d19:meMA.Ode5C1T.melody	@ltx/en_us_oca/he.h.m2:heHE.TisNyktosDielthousis.notmetered
ltx/en_us_oca/me.m10.d19:meMA.Ode5C1T.mode	@ltx/en_us_oca/miscellanea:misc.Mode2
ltx/en_us_oca/me.m10.d19:meMA.Ode5C1T.ode	@ltx/en_us_oca/miscellanea:misc.Ode5
ltx/en_us_oca/me.m10.d19:meMA.Ode5C1T.text	
ltx/en_us_oca/me.m10.d19:meMA.Ode5C21.greekmelody	@ltx/en_us_oca/he.h.m6:heHE.ToTheioFengeiSou.greekname
ltx/en_us_oca/me.m10.d19:meMA.Ode5C21.incipit	…
ltx/en_us_oca/me.m10.d19:meMA.Ode5C21.melody	@ltx/en_us_oca/he.h.m6:heHE.ToTheioFengeiSou.notmetered
ltx/en_us_oca/me.m10.d19:meMA.Ode5C21.mode	@ltx/en_us_oca/miscellanea:misc.Mode6
ltx/en_us_oca/me.m10.d19:meMA.Ode5C21.ode	@ltx/en_us_oca/miscellanea:misc.Ode5
ltx/en_us_oca/me.m10.d19:meMA.Ode5C21.text	
ltx/en_us_oca/me.m10.d19:meMA.Ode5C22.incipit	…
ltx/en_us_oca/me.m10.d19:meMA.Ode5C22.melody	@ltx/en_us_oca/he.h.m6:heHE.ToTheioFengeiSou.notmetered
ltx/en_us_oca/me.m10.d19:meMA.Ode5C22.mode	@ltx/en_us_oca/miscellanea:misc.Mode6
ltx/en_us_oca/me.m10.d19:meMA.Ode5C22.ode	@ltx/en_us_oca/miscellanea:misc.Ode5
ltx/en_us_oca/me.m10.d19:meMA.Ode5C22.text	
ltx/en_us_oca/me.m10.d19:meMA.Ode5C23.incipit	…
ltx/en_us_oca/me.m10.d19:meMA.Ode5C23.melody	@ltx/en_us_oca/he.h.m6:heHE.ToTheioFengeiSou.notmetered
ltx/en_us_oca/me.m10.d19:meMA.Ode5C23.mode	@ltx/en_us_oca/miscellanea:misc.Mode6
ltx/en_us_oca/me.m10.d19:meMA.Ode5C23.ode	@ltx/en_us_oca/miscellanea:misc.Ode5
ltx/en_us_oca/me.m10.d19:meMA.Ode5C23.text	
ltx/en_us_oca/me.m10.d19:meMA.Ode5C2T.incipit	…
ltx/en_us_oca/me.m10.d19:meMA.Ode5C2T.melody	@ltx/en_us_oca/he.h.m6:heHE.ToTheioFengeiSou.notmetered
ltx/en_us_oca/me.m10.d19:meMA.Ode5C2T.mode	@ltx/en_us_oca/miscellanea:misc.Mode6
ltx/en_us_oca/me.m10.d19:meMA.Ode5C2T.ode	@ltx/en_us_oca/miscellanea:misc.Ode5
ltx/en_us_oca/me.m10.d19:meMA.Ode5C2T.text	
ltx/en_us_oca/me.m10.d19:meMA.Ode6C11.greekmelody	@ltx/en_us_oca/he.h.m2:heHE.AvyssosAmartimaton.greekname
ltx/en_us_oca/me.m10.d19:meMA.Ode6C11.incipit	…
ltx/en_us_oca/me.m10.d19:meMA.Ode6C11.melody	@ltx/en_us_oca/he.h.m2:heHE.AvyssosAmartimaton.notmetered
ltx/en_us_oca/me.m10.d19:meMA.Ode6C11.mode	@ltx/en_us_oca/miscellanea:misc.Mode2
ltx/en_us_oca/me.m10.d19:meMA.Ode6C11.ode	@ltx/en_us_oca/miscellanea:misc.Ode6
ltx/en_us_oca/me.m10.d19:meMA.Ode6C11.text	
ltx/en_us_oca/me.m10.d19:meMA.Ode6C12.incipit	…
ltx/en_us_oca/me.m10.d19:meMA.Ode6C12.melody	@ltx/en_us_oca/he.h.m2:heHE.AvyssosAmartimaton.notmetered
ltx/en_us_oca/me.m10.d19:meMA.Ode6C12.mode	@ltx/en_us_oca/miscellanea:misc.Mode2
ltx/en_us_oca/me.m10.d19:meMA.Ode6C12.ode	@ltx/en_us_oca/miscellanea:misc.Ode6
ltx/en_us_oca/me.m10.d19:meMA.Ode6C12.text	
ltx/en_us_oca/me.m10.d19:meMA.Ode6C13.incipit	…
ltx/en_us_oca/me.m10.d19:meMA.Ode6C13.melody	@ltx/en_us_oca/he.h.m2:heHE.AvyssosAmartimaton.notmetered
ltx/en_us_oca/me.m10.d19:meMA.Ode6C13.mode	@ltx/en_us_oca/miscellanea:misc.Mode2
ltx/en_us_oca/me.m10.d19:meMA.Ode6C13.ode	@ltx/en_us_oca/miscellanea:misc.Ode6
ltx/en_us_oca/me.m10.d19:meMA.Ode6C13.text	
ltx/en_us_oca/me.m10.d19:meMA.Ode6C1T.incipit	…
ltx/en_us_oca/me.m10.d19:meMA.Ode6C1T.melody	@ltx/en_us_oca/he.h.m2:heHE.AvyssosAmartimaton.notmetered
ltx/en_us_oca/me.m10.d19:meMA.Ode6C1T.mode	@ltx/en_us_oca/miscellanea:misc.Mode2
ltx/en_us_oca/me.m10.d19:meMA.Ode6C1T.ode	@ltx/en_us_oca/miscellanea:misc.Ode6
ltx/en_us_oca/me.m10.d19:meMA.Ode6C1T.text	
ltx/en_us_oca/me.m10.d19:meMA.Ode6C21.greekmelody	@ltx/en_us_oca/he.h.m6:heHE.TouViouTinThalassan.greekname
ltx/en_us_oca/me.m10.d19:meMA.Ode6C21.incipit	…
ltx/en_us_oca/me.m10.d19:meMA.Ode6C21.melody	@ltx/en_us_oca/he.h.m6:heHE.TouViouTinThalassan.notmetered
ltx/en_us_oca/me.m10.d19:meMA.Ode6C21.mode	@ltx/en_us_oca/miscellanea:misc.Mode6
ltx/en_us_oca/me.m10.d19:meMA.Ode6C21.ode	@ltx/en_us_oca/miscellanea:misc.Ode6
ltx/en_us_oca/me.m10.d19:meMA.Ode6C21.text	
ltx/en_us_oca/me.m10.d19:meMA.Ode6C22.incipit	…
ltx/en_us_oca/me.m10.d19:meMA.Ode6C22.melody	@ltx/en_us_oca/he.h.m6:heHE.TouViouTinThalassan.notmetered
ltx/en_us_oca/me.m10.d19:meMA.Ode6C22.mode	@ltx/en_us_oca/miscellanea:misc.Mode6
ltx/en_us_oca/me.m10.d19:meMA.Ode6C22.ode	@ltx/en_us_oca/miscellanea:misc.Ode6
ltx/en_us_oca/me.m10.d19:meMA.Ode6C22.text	
ltx/en_us_oca/me.m10.d19:meMA.Ode6C23.incipit	…
ltx/en_us_oca/me.m10.d19:meMA.Ode6C23.melody	@ltx/en_us_oca/he.h.m6:heHE.TouViouTinThalassan.notmetered
ltx/en_us_oca/me.m10.d19:meMA.Ode6C23.mode	@ltx/en_us_oca/miscellanea:misc.Mode6
ltx/en_us_oca/me.m10.d19:meMA.Ode6C23.ode	@ltx/en_us_oca/miscellanea:misc.Ode6
ltx/en_us_oca/me.m10.d19:meMA.Ode6C23.text	
ltx/en_us_oca/me.m10.d19:meMA.Ode6C2T.incipit	…
ltx/en_us_oca/me.m10.d19:meMA.Ode6C2T.melody	@ltx/en_us_oca/he.h.m6:heHE.TouViouTinThalassan.notmetered
ltx/en_us_oca/me.m10.d19:meMA.Ode6C2T.mode	@ltx/en_us_oca/miscellanea:misc.Mode6
ltx/en_us_oca/me.m10.d19:meMA.Ode6C2T.ode	@ltx/en_us_oca/miscellanea:misc.Ode6
ltx/en_us_oca/me.m10.d19:meMA.Ode6C2T.text	
ltx/en_us_oca/me.m10.d19:meMA.Ode6H.greekmelody	@ltx/en_us_oca/he.h.m6:heHE.TouViouTinThalassan.greekname
ltx/en_us_oca/me.m10.d19:meMA.Ode6H.incipit	@ltx/en_us_oca/he.h.m6:heHE.TouViouTinThalassan.incipit
ltx/en_us_oca/me.m10.d19:meMA.Ode6H.melody	@ltx/en_us_oca/he.h.m6:heHE.TouViouTinThalassan.melody
ltx/en_us_oca/me.m10.d19:meMA.Ode6H.mode	@ltx/en_us_oca/miscellanea:misc.Mode6
ltx/en_us_oca/me.m10.d19:meMA.Ode6H.ode	@ltx/en_us_oca/miscellanea:misc.Ode6
ltx/en_us_oca/me.m10.d19:meMA.Ode6H.text	@ltx/en_us_oca/he.h.m6:heHE.TouViouTinThalassan.text
ltx/en_us_oca/me.m10.d19:meMA.Ode7C11.greekmelody	@ltx/en_us_oca/he.h.m2:heHE.OTinKaminonPalai.greekname
ltx/en_us_oca/me.m10.d19:meMA.Ode7C11.incipit	…
ltx/en_us_oca/me.m10.d19:meMA.Ode7C11.melody	@ltx/en_us_oca/he.h.m2:heHE.OTinKaminonPalai.notmetered
ltx/en_us_oca/me.m10.d19:meMA.Ode7C11.mode	@ltx/en_us_oca/miscellanea:misc.Mode2
ltx/en_us_oca/me.m10.d19:meMA.Ode7C11.ode	@ltx/en_us_oca/miscellanea:misc.Ode7
ltx/en_us_oca/me.m10.d19:meMA.Ode7C11.text	
ltx/en_us_oca/me.m10.d19:meMA.Ode7C12.incipit	…
ltx/en_us_oca/me.m10.d19:meMA.Ode7C12.melody	@ltx/en_us_oca/he.h.m2:heHE.OTinKaminonPalai.notmetered
ltx/en_us_oca/me.m10.d19:meMA.Ode7C12.mode	@ltx/en_us_oca/miscellanea:misc.Mode2
ltx/en_us_oca/me.m10.d19:meMA.Ode7C12.ode	@ltx/en_us_oca/miscellanea:misc.Ode7
ltx/en_us_oca/me.m10.d19:meMA.Ode7C12.text	
ltx/en_us_oca/me.m10.d19:meMA.Ode7C1T.incipit	…
ltx/en_us_oca/me.m10.d19:meMA.Ode7C1T.melody	@ltx/en_us_oca/he.h.m2:heHE.OTinKaminonPalai.notmetered
ltx/en_us_oca/me.m10.d19:meMA.Ode7C1T.mode	@ltx/en_us_oca/miscellanea:misc.Mode2
ltx/en_us_oca/me.m10.d19:meMA.Ode7C1T.ode	@ltx/en_us_oca/miscellanea:misc.Ode7
ltx/en_us_oca/me.m10.d19:meMA.Ode7C1T.text	
ltx/en_us_oca/me.m10.d19:meMA.Ode7C21.greekmelody	@ltx/en_us_oca/he.h.m6:heHE.DrosovolonMenTinKaminon.greekname
ltx/en_us_oca/me.m10.d19:meMA.Ode7C21.incipit	…
ltx/en_us_oca/me.m10.d19:meMA.Ode7C21.melody	@ltx/en_us_oca/he.h.m6:heHE.DrosovolonMenTinKaminon.notmetered
ltx/en_us_oca/me.m10.d19:meMA.Ode7C21.mode	@ltx/en_us_oca/miscellanea:misc.Mode6
ltx/en_us_oca/me.m10.d19:meMA.Ode7C21.ode	@ltx/en_us_oca/miscellanea:misc.Ode7
ltx/en_us_oca/me.m10.d19:meMA.Ode7C21.text	
ltx/en_us_oca/me.m10.d19:meMA.Ode7C22.incipit	…
ltx/en_us_oca/me.m10.d19:meMA.Ode7C22.melody	@ltx/en_us_oca/he.h.m6:heHE.DrosovolonMenTinKaminon.notmetered
ltx/en_us_oca/me.m10.d19:meMA.Ode7C22.mode	@ltx/en_us_oca/miscellanea:misc.Mode6
ltx/en_us_oca/me.m10.d19:meMA.Ode7C22.ode	@ltx/en_us_oca/miscellanea:misc.Ode7
ltx/en_us_oca/me.m10.d19:meMA.Ode7C22.text	
ltx/en_us_oca/me.m10.d19:meMA.Ode7C23.incipit	…
ltx/en_us_oca/me.m10.d19:meMA.Ode7C23.melody	@ltx/en_us_oca/he.h.m6:heHE.DrosovolonMenTinKaminon.notmetered
ltx/en_us_oca/me.m10.d19:meMA.Ode7C23.mode	@ltx/en_us_oca/miscellanea:misc.Mode6
ltx/en_us_oca/me.m10.d19:meMA.Ode7C23.ode	@ltx/en_us_oca/miscellanea:misc.Ode7
ltx/en_us_oca/me.m10.d19:meMA.Ode7C23.text	
ltx/en_us_oca/me.m10.d19:meMA.Ode7C2T.incipit	…
ltx/en_us_oca/me.m10.d19:meMA.Ode7C2T.melody	@ltx/en_us_oca/he.h.m6:heHE.DrosovolonMenTinKaminon.notmetered
ltx/en_us_oca/me.m10.d19:meMA.Ode7C2T.mode	@ltx/en_us_oca/miscellanea:misc.Mode6
ltx/en_us_oca/me.m10.d19:meMA.Ode7C2T.ode	@ltx/en_us_oca/miscellanea:misc.Ode7
ltx/en_us_oca/me.m10.d19:meMA.Ode7C2T.text	
ltx/en_us_oca/me.m10.d19:meMA.Ode8C11.greekmelody	@ltx/en_us_oca/he.h.m2:heHE.TonPalaiDrosisanta.greekname
ltx/en_us_oca/me.m10.d19:meMA.Ode8C11.incipit	…
ltx/en_us_oca/me.m10.d19:meMA.Ode8C11.melody	@ltx/en_us_oca/he.h.m2:heHE.TonPalaiDrosisanta.notmetered
ltx/en_us_oca/me.m10.d19:meMA.Ode8C11.mode	@ltx/en_us_oca/miscellanea:misc.Mode2
ltx/en_us_oca/me.m10.d19:meMA.Ode8C11.ode	@ltx/en_us_oca/miscellanea:misc.Ode8
ltx/en_us_oca/me.m10.d19:meMA.Ode8C11.text	
ltx/en_us_oca/me.m10.d19:meMA.Ode8C12.incipit	…
ltx/en_us_oca/me.m10.d19:meMA.Ode8C12.melody	@ltx/en_us_oca/he.h.m2:heHE.TonPalaiDrosisanta.notmetered
ltx/en_us_oca/me.m10.d19:meMA.Ode8C12.mode	@ltx/en_us_oca/miscellanea:misc.Mode2
ltx/en_us_oca/me.m10.d19:meMA.Ode8C12.ode	@ltx/en_us_oca/miscellanea:misc.Ode8
ltx/en_us_oca/me.m10.d19:meMA.Ode8C12.text	
ltx/en_us_oca/me.m10.d19:meMA.Ode8C13.incipit	…
ltx/en_us_oca/me.m10.d19:meMA.Ode8C13.melody	@ltx/en_us_oca/he.h.m2:heHE.TonPalaiDrosisanta.notmetered
ltx/en_us_oca/me.m10.d19:meMA.Ode8C13.mode	@ltx/en_us_oca/miscellanea:misc.Mode2
ltx/en_us_oca/me.m10.d19:meMA.Ode8C13.ode	@ltx/en_us_oca/miscellanea:misc.Ode8
ltx/en_us_oca/me.m10.d19:meMA.Ode8C13.text	
ltx/en_us_oca/me.m10.d19:meMA.Ode8C1T.incipit	…
ltx/en_us_oca/me.m10.d19:meMA.Ode8C1T.melody	@ltx/en_us_oca/he.h.m2:heHE.TonPalaiDrosisanta.notmetered
ltx/en_us_oca/me.m10.d19:meMA.Ode8C1T.mode	@ltx/en_us_oca/miscellanea:misc.Mode2
ltx/en_us_oca/me.m10.d19:meMA.Ode8C1T.ode	@ltx/en_us_oca/miscellanea:misc.Ode8
ltx/en_us_oca/me.m10.d19:meMA.Ode8C1T.text	
ltx/en_us_oca/me.m10.d19:meMA.Ode8C21.greekmelody	@ltx/en_us_oca/he.h.m6:heHE.EkFlogosToisOsiois.greekname
ltx/en_us_oca/me.m10.d19:meMA.Ode8C21.incipit	…
ltx/en_us_oca/me.m10.d19:meMA.Ode8C21.melody	@ltx/en_us_oca/he.h.m6:heHE.EkFlogosToisOsiois.notmetered
ltx/en_us_oca/me.m10.d19:meMA.Ode8C21.mode	@ltx/en_us_oca/miscellanea:misc.Mode6
ltx/en_us_oca/me.m10.d19:meMA.Ode8C21.ode	@ltx/en_us_oca/miscellanea:misc.Ode8
ltx/en_us_oca/me.m10.d19:meMA.Ode8C21.text	
ltx/en_us_oca/me.m10.d19:meMA.Ode8C22.incipit	…
ltx/en_us_oca/me.m10.d19:meMA.Ode8C22.melody	@ltx/en_us_oca/he.h.m6:heHE.EkFlogosToisOsiois.notmetered
ltx/en_us_oca/me.m10.d19:meMA.Ode8C22.mode	@ltx/en_us_oca/miscellanea:misc.Mode6
ltx/en_us_oca/me.m10.d19:meMA.Ode8C22.ode	@ltx/en_us_oca/miscellanea:misc.Ode8
ltx/en_us_oca/me.m10.d19:meMA.Ode8C22.text	
ltx/en_us_oca/me.m10.d19:meMA.Ode8C23.incipit	…
ltx/en_us_oca/me.m10.d19:meMA.Ode8C23.melody	@ltx/en_us_oca/he.h.m6:heHE.EkFlogosToisOsiois.notmetered
ltx/en_us_oca/me.m10.d19:meMA.Ode8C23.mode	@ltx/en_us_oca/miscellanea:misc.Mode6
ltx/en_us_oca/me.m10.d19:meMA.Ode8C23.ode	@ltx/en_us_oca/miscellanea:misc.Ode8
ltx/en_us_oca/me.m10.d19:meMA.Ode8C23.text	
ltx/en_us_oca/me.m10.d19:meMA.Ode8C2T.incipit	…
ltx/en_us_oca/me.m10.d19:meMA.Ode8C2T.melody	@ltx/en_us_oca/he.h.m6:heHE.EkFlogosToisOsiois.notmetered
ltx/en_us_oca/me.m10.d19:meMA.Ode8C2T.mode	@ltx/en_us_oca/miscellanea:misc.Mode6
ltx/en_us_oca/me.m10.d19:meMA.Ode8C2T.ode	@ltx/en_us_oca/miscellanea:misc.Ode8
ltx/en_us_oca/me.m10.d19:meMA.Ode8C2T.text	
ltx/en_us_oca/me.m10.d19:meMA.Ode8H.greekmelody	@ltx/en_us_oca/he.h.m6:heHE.EkFlogosToisOsiois.greekname
ltx/en_us_oca/me.m10.d19:meMA.Ode8H.incipit	@ltx/en_us_oca/he.h.m6:heHE.EkFlogosToisOsiois.incipit
ltx/en_us_oca/me.m10.d19:meMA.Ode8H.melody	@ltx/en_us_oca/he.h.m6:heHE.EkFlogosToisOsiois.melody
ltx/en_us_oca/me.m10.d19:meMA.Ode8H.mode	@ltx/en_us_oca/miscellanea:misc.Mode6
ltx/en_us_oca/me.m10.d19:meMA.Ode8H.ode	@ltx/en_us_oca/miscellanea:misc.Ode8
ltx/en_us_oca/me.m10.d19:meMA.Ode8H.text	@ltx/en_us_oca/he.h.m6:heHE.EkFlogosToisOsiois.text
ltx/en_us_oca/me.m10.d19:meMA.Ode9C11.greekmelody	@ltx/en_us_oca/he.h.m2:heHE.IEnOuranois.greekname
ltx/en_us_oca/me.m10.d19:meMA.Ode9C11.incipit	…
ltx/en_us_oca/me.m10.d19:meMA.Ode9C11.melody	@ltx/en_us_oca/he.h.m2:heHE.IEnOuranois.notmetered
ltx/en_us_oca/me.m10.d19:meMA.Ode9C11.mode	@ltx/en_us_oca/miscellanea:misc.Mode2
ltx/en_us_oca/me.m10.d19:meMA.Ode9C11.ode	@ltx/en_us_oca/miscellanea:misc.Ode9
ltx/en_us_oca/me.m10.d19:meMA.Ode9C11.text	
ltx/en_us_oca/me.m10.d19:meMA.Ode9C12.incipit	…
ltx/en_us_oca/me.m10.d19:meMA.Ode9C12.melody	@ltx/en_us_oca/he.h.m2:heHE.IEnOuranois.notmetered
ltx/en_us_oca/me.m10.d19:meMA.Ode9C12.mode	@ltx/en_us_oca/miscellanea:misc.Mode2
ltx/en_us_oca/me.m10.d19:meMA.Ode9C12.ode	@ltx/en_us_oca/miscellanea:misc.Ode9
ltx/en_us_oca/me.m10.d19:meMA.Ode9C12.text	
ltx/en_us_oca/me.m10.d19:meMA.Ode9C13.incipit	…
ltx/en_us_oca/me.m10.d19:meMA.Ode9C13.melody	@ltx/en_us_oca/he.h.m2:heHE.IEnOuranois.notmetered
ltx/en_us_oca/me.m10.d19:meMA.Ode9C13.mode	@ltx/en_us_oca/miscellanea:misc.Mode2
ltx/en_us_oca/me.m10.d19:meMA.Ode9C13.ode	@ltx/en_us_oca/miscellanea:misc.Ode9
ltx/en_us_oca/me.m10.d19:meMA.Ode9C13.text	
ltx/en_us_oca/me.m10.d19:meMA.Ode9C1T.incipit	…
ltx/en_us_oca/me.m10.d19:meMA.Ode9C1T.melody	@ltx/en_us_oca/he.h.m2:heHE.IEnOuranois.notmetered
ltx/en_us_oca/me.m10.d19:meMA.Ode9C1T.mode	@ltx/en_us_oca/miscellanea:misc.Mode2
ltx/en_us_oca/me.m10.d19:meMA.Ode9C1T.ode	@ltx/en_us_oca/miscellanea:misc.Ode9
ltx/en_us_oca/me.m10.d19:meMA.Ode9C1T.text	
ltx/en_us_oca/me.m10.d19:meMA.Ode9C21.greekmelody	@ltx/en_us_oca/he.h.m6:heHE.TheonAnthropois.greekname
ltx/en_us_oca/me.m10.d19:meMA.Ode9C21.incipit	…
ltx/en_us_oca/me.m10.d19:meMA.Ode9C21.melody	@ltx/en_us_oca/he.h.m6:heHE.TheonAnthropois.notmetered
ltx/en_us_oca/me.m10.d19:meMA.Ode9C21.mode	@ltx/en_us_oca/miscellanea:misc.Mode6
ltx/en_us_oca/me.m10.d19:meMA.Ode9C21.ode	@ltx/en_us_oca/miscellanea:misc.Ode9
ltx/en_us_oca/me.m10.d19:meMA.Ode9C21.text	
ltx/en_us_oca/me.m10.d19:meMA.Ode9C22.incipit	…
ltx/en_us_oca/me.m10.d19:meMA.Ode9C22.melody	@ltx/en_us_oca/he.h.m6:heHE.TheonAnthropois.notmetered
ltx/en_us_oca/me.m10.d19:meMA.Ode9C22.mode	@ltx/en_us_oca/miscellanea:misc.Mode6
ltx/en_us_oca/me.m10.d19:meMA.Ode9C22.ode	@ltx/en_us_oca/miscellanea:misc.Ode9
ltx/en_us_oca/me.m10.d19:meMA.Ode9C22.text	
ltx/en_us_oca/me.m10.d19:meMA.Ode9C23.incipit	…
ltx/en_us_oca/me.m10.d19:meMA.Ode9C23.melody	@ltx/en_us_oca/he.h.m6:heHE.TheonAnthropois.notmetered
ltx/en_us_oca/me.m10.d19:meMA.Ode9C23.mode	@ltx/en_us_oca/miscellanea:misc.Mode6
ltx/en_us_oca/me.m10.d19:meMA.Ode9C23.ode	@ltx/en_us_oca/miscellanea:misc.Ode9
ltx/en_us_oca/me.m10.d19:meMA.Ode9C23.text	
ltx/en_us_oca/me.m10.d19:meMA.Ode9C24.incipit	…
ltx/en_us_oca/me.m10.d19:meMA.Ode9C24.melody	@ltx/en_us_oca/he.h.m6:heHE.TheonAnthropois.notmetered
ltx/en_us_oca/me.m10.d19:meMA.Ode9C24.mode	@ltx/en_us_oca/miscellanea:misc.Mode6
ltx/en_us_oca/me.m10.d19:meMA.Ode9C24.ode	@ltx/en_us_oca/miscellanea:misc.Ode9
ltx/en_us_oca/me.m10.d19:meMA.Ode9C24.text	
ltx/en_us_oca/me.m10.d19:meMA.Ode9C2T.incipit	…
ltx/en_us_oca/me.m10.d19:meMA.Ode9C2T.melody	@ltx/en_us_oca/he.h.m6:heHE.TheonAnthropois.notmetered
ltx/en_us_oca/me.m10.d19:meMA.Ode9C2T.mode	@ltx/en_us_oca/miscellanea:misc.Mode6
ltx/en_us_oca/me.m10.d19:meMA.Ode9C2T.ode	@ltx/en_us_oca/miscellanea:misc.Ode9
ltx/en_us_oca/me.m10.d19:meMA.Ode9C2T.text	
ltx/en_us_oca/me.m10.d19:meMA.Ode9H.greekmelody	@ltx/en_us_oca/he.h.m6:heHE.TheonAnthropois.greekname
ltx/en_us_oca/me.m10.d19:meMA.Ode9H.incipit	@ltx/en_us_oca/he.h.m6:heHE.TheonAnthropois.incipit
ltx/en_us_oca/me.m10.d19:meMA.Ode9H.melody	@ltx/en_us_oca/he.h.m6:heHE.TheonAnthropois.melody
ltx/en_us_oca/me.m10.d19:meMA.Ode9H.mode	@ltx/en_us_oca/miscellanea:misc.Mode6
ltx/en_us_oca/me.m10.d19:meMA.Ode9H.ode	@ltx/en_us_oca/miscellanea:misc.Ode9
ltx/en_us_oca/me.m10.d19:meMA.Ode9H.text	@ltx/en_us_oca/he.h.m6:heHE.TheonAnthropois.text
ltx/en_us_oca/me.m10.d19:meVE.Apolytikion1ger.greekmelody	@ltx/en_us_oca/he.a.m4:heAU.TachyProkatalave.greekname
ltx/en_us_oca/me.m10.d19:meVE.Apolytikion1ger.incipit	…
ltx/en_us_oca/me.m10.d19:meVE.Apolytikion1ger.melody	@ltx/en_us_oca/he.a.m4:heAU.TachyProkatalave.notmetered
ltx/en_us_oca/me.m10.d19:meVE.Apolytikion1ger.mode	@ltx/en_us_oca/miscellanea:misc.Mode4
ltx/en_us_oca/me.m10.d19:meVE.Apolytikion1ger.poet	@ltx/en_us_oca/poets:po.Gerasimou
ltx/en_us_oca/me.m10.d19:meVE.Apolytikion1ger.text	
ltx/en_us_oca/me.m10.d19:meVE.Apolytikion2ger.greekmelody	@ltx/en_us_oca/he.a.m5:heAU.TonSynanarchonLogon.greekname
ltx/en_us_oca/me.m10.d19:meVE.Apolytikion2ger.incipit	…
ltx/en_us_oca/me.m10.d19:meVE.Apolytikion2ger.melody	@ltx/en_us_oca/he.a.m5:heAU.TonSynanarchonLogon.notmetered
ltx/en_us_oca/me.m10.d19:meVE.Apolytikion2ger.mode	@ltx/en_us_oca/miscellanea:misc.Mode5
ltx/en_us_oca/me.m10.d19:meVE.Apolytikion2ger.poet	@ltx/en_us_oca/poets:po.Gerasimou
ltx/en_us_oca/me.m10.d19:meVE.Apolytikion2ger.text	
ltx/en_us_oca/me.m10.d19:meVE.SticStavrotheotokion.greekmelody	@ltx/en_us_oca/he.a.m6:heAU.OlinApothemenoi.greekname
ltx/en_us_oca/me.m10.d19:meVE.SticStavrotheotokion.incipit	@ltx/en_us_oca/me.m01.d15:meVE.AposStavrotheotokion.incipit
ltx/en_us_oca/me.m10.d19:meVE.SticStavrotheotokion.melody	@ltx/en_us_oca/he.a.m6:heAU.OlinApothemenoi.notmetered
ltx/en_us_oca/me.m10.d19:meVE.SticStavrotheotokion.mode	@ltx/en_us_oca/miscellanea:misc.Mode6
ltx/en_us_oca/me.m10.d19:meVE.SticStavrotheotokion.text	@ltx/en_us_oca/me.m01.d15:meVE.AposStavrotheotokion.text
ltx/en_us_oca/me.m10.d19:meVE.SticTheotokion.greekmelody	@ltx/en_us_oca/he.a.m6:heAU.OlinApothemenoi.greekname
ltx/en_us_oca/me.m10.d19:meVE.SticTheotokion.incipit	@ltx/en_us_oca/me.m10.d16:meVE.SticTheotokion.incipit
ltx/en_us_oca/me.m10.d19:meVE.SticTheotokion.melody	@ltx/en_us_oca/he.a.m6:heAU.OlinApothemenoi.notmetered
ltx/en_us_oca/me.m10.d19:meVE.SticTheotokion.mode	@ltx/en_us_oca/miscellanea:misc.Mode6
ltx/en_us_oca/me.m10.d19:meVE.SticTheotokion.text	@ltx/en_us_oca/me.m10.d16:meVE.SticTheotokion.text
ltx/en_us_oca/me.m10.d19:meVE.Stichera01.greekmelody	@ltx/en_us_oca/he.a.m8:heAU.OTouParadoxou.greekname
ltx/en_us_oca/me.m10.d19:meVE.Stichera01.incipit	The Spirit of God has…
ltx/en_us_oca/me.m10.d19:meVE.Stichera01.melody	@ltx/en_us_oca/he.a.m8:heAU.OTouParadoxou.notmetered
ltx/en_us_oca/me.m10.d19:meVE.Stichera01.mode	@ltx/en_us_oca/miscellanea:misc.Mode8
ltx/en_us_oca/me.m10.d19:meVE.Stichera01.text	The Spirit of God has been poured out on us, faithful, ⁄ as the honored Joel prophesied, moved by the same Spirit! ⁄ He opens the revelation of divine mysteries ⁄ in prophetic words. ⁄ We who have received his works are enlightened with divine radiance ⁄⁄ and with the grace of God!
ltx/en_us_oca/me.m10.d19:meVE.Stichera02.incipit	Master, filled with divine eloquence…
ltx/en_us_oca/me.m10.d19:meVE.Stichera02.melody	@ltx/en_us_oca/he.a.m8:heAU.OTouParadoxou.notmetered
ltx/en_us_oca/me.m10.d19:meVE.Stichera02.mode	@ltx/en_us_oca/miscellanea:misc.Mode8
ltx/en_us_oca/me.m10.d19:meVE.Stichera02.text	Master, filled with divine eloquence, ⁄ the wondrous Joel comes forth from your house ⁄ like a stream of water giving life to the souls of men! ⁄ He lets fall on us the sweetness that delights our thoughts ⁄ for he has been exalted by the Spirit; ⁄⁄ raised by virtue to divine heights!
ltx/en_us_oca/me.m10.d19:meVE.Stichera03.incipit	With your boldness as a…
ltx/en_us_oca/me.m10.d19:meVE.Stichera03.melody	@ltx/en_us_oca/he.a.m8:heAU.OTouParadoxou.notmetered
ltx/en_us_oca/me.m10.d19:meVE.Stichera03.mode	@ltx/en_us_oca/miscellanea:misc.Mode8
ltx/en_us_oca/me.m10.d19:meVE.Stichera03.text	With your boldness as a prophet, Joel, ⁄ and your spiritual closeness to God, ⁄ you behold heavenly visions. ⁄ Move Him, glorious one, to compassion for us ⁄ who celebrate your memory with faith, ⁄ asking remission of sins, ⁄⁄ a share in divine joy and great mercy!
ltx/en_us_oca/me.m10.d19:meVE.Stichera04.greekmelody	@ltx/en_us_oca/he.a.m6:heAU.OlinApothemenoi.greekname
ltx/en_us_oca/me.m10.d19:meVE.Stichera04.incipit	…
ltx/en_us_oca/me.m10.d19:meVE.Stichera04.melody	@ltx/en_us_oca/he.a.m6:heAU.OlinApothemenoi.notmetered
ltx/en_us_oca/me.m10.d19:meVE.Stichera04.mode	@ltx/en_us_oca/miscellanea:misc.Mode6
ltx/en_us_oca/me.m10.d19:meVE.Stichera04.text	
ltx/en_us_oca/me.m10.d19:meVE.Stichera05.incipit	…
ltx/en_us_oca/me.m10.d19:meVE.Stichera05.melody	@ltx/en_us_oca/he.a.m6:heAU.OlinApothemenoi.notmetered
ltx/en_us_oca/me.m10.d19:meVE.Stichera05.mode	@ltx/en_us_oca/miscellanea:misc.Mode6
ltx/en_us_oca/me.m10.d19:meVE.Stichera05.text	
ltx/en_us_oca/me.m10.d19:meVE.Stichera06.incipit	…
ltx/en_us_oca/me.m10.d19:meVE.Stichera06.melody	@ltx/en_us_oca/he.a.m6:heAU.OlinApothemenoi.notmetered
ltx/en_us_oca/me.m10.d19:meVE.Stichera06.mode	@ltx/en_us_oca/miscellanea:misc.Mode6
ltx/en_us_oca/me.m10.d19:meVE.Stichera06.text	
