ltx/en_us_oca/me.m06.d21:meDA.commemoration.first	
ltx/en_us_oca/me.m06.d21:meDA.commemoration.first_name	
ltx/en_us_oca/me.m06.d21:meDA.commemoration.first_short	
ltx/en_us_oca/me.m06.d21:meDA.commemoration.first_title	
ltx/en_us_oca/me.m06.d21:meDA.commemoration.full	
ltx/en_us_oca/me.m06.d21:meDA.commemoration.second_name	
ltx/en_us_oca/me.m06.d21:meDA.commemoration.second_title	
ltx/en_us_oca/me.m06.d21:meDA.date	
ltx/en_us_oca/me.m06.d21:meDA.dismissal	
ltx/en_us_oca/me.m06.d21:meDA.fordate	
ltx/en_us_oca/me.m06.d21:meDA.insert1	
ltx/en_us_oca/me.m06.d21:meDA.insert2	
ltx/en_us_oca/me.m06.d21:meDA.note	
ltx/en_us_oca/me.m06.d21:meDA.pdfcoverdate	
ltx/en_us_oca/me.m06.d21:meDA.pdfheaderdate	
ltx/en_us_oca/me.m06.d21:meHO.commemorations	
ltx/en_us_oca/me.m06.d21:meHO.note1	
ltx/en_us_oca/me.m06.d21:meHO.note2	
ltx/en_us_oca/me.m06.d21:meHO.number	
ltx/en_us_oca/me.m06.d21:meHO.rank	
ltx/en_us_oca/me.m06.d21:meLE.commemoration1	
ltx/en_us_oca/me.m06.d21:meLE.commemoration2	
ltx/en_us_oca/me.m06.d21:meLI.Kontakion1.incipit	…
ltx/en_us_oca/me.m06.d21:meLI.Kontakion1.melody	
ltx/en_us_oca/me.m06.d21:meLI.Kontakion1.mode	
ltx/en_us_oca/me.m06.d21:meLI.Kontakion1.text	
ltx/en_us_oca/me.m06.d21:meLI.MM.CommunionHymn.text	
ltx/en_us_oca/me.m06.d21:meLI.Megalynarion.text	
ltx/en_us_oca/me.m06.d21:meMA.C1.acrostic.notice1	
ltx/en_us_oca/me.m06.d21:meMA.C1.acrostic.text	
ltx/en_us_oca/me.m06.d21:meMA.C1.acrostic.title	
ltx/en_us_oca/me.m06.d21:meMA.C1.poet	@ltx/en_us_oca/poets:po.IoannouMonachou
ltx/en_us_oca/me.m06.d21:meMA.C1.title	@ltx/en_us_oca/titles:ti.CanonSaintM
ltx/en_us_oca/me.m06.d21:meMA.C1.verse	@ltx/en_us_oca/prayers:pr.verse_SaintM.text
ltx/en_us_oca/me.m06.d21:meMA.Ode1C11.greekmelody	@ltx/en_us_oca/he.h.m8:heHE.AsomenToKyrio.greekname
ltx/en_us_oca/me.m06.d21:meMA.Ode1C11.incipit	…
ltx/en_us_oca/me.m06.d21:meMA.Ode1C11.melody	@ltx/en_us_oca/he.h.m8:heHE.AsomenToKyrio.notmetered
ltx/en_us_oca/me.m06.d21:meMA.Ode1C11.mode	@ltx/en_us_oca/miscellanea:misc.Mode8
ltx/en_us_oca/me.m06.d21:meMA.Ode1C11.ode	@ltx/en_us_oca/miscellanea:misc.Ode1
ltx/en_us_oca/me.m06.d21:meMA.Ode1C11.text	
ltx/en_us_oca/me.m06.d21:meMA.Ode1C12.incipit	…
ltx/en_us_oca/me.m06.d21:meMA.Ode1C12.melody	@ltx/en_us_oca/he.h.m8:heHE.AsomenToKyrio.notmetered
ltx/en_us_oca/me.m06.d21:meMA.Ode1C12.mode	@ltx/en_us_oca/miscellanea:misc.Mode8
ltx/en_us_oca/me.m06.d21:meMA.Ode1C12.ode	@ltx/en_us_oca/miscellanea:misc.Ode1
ltx/en_us_oca/me.m06.d21:meMA.Ode1C12.text	
ltx/en_us_oca/me.m06.d21:meMA.Ode1C13.incipit	…
ltx/en_us_oca/me.m06.d21:meMA.Ode1C13.melody	@ltx/en_us_oca/he.h.m8:heHE.AsomenToKyrio.notmetered
ltx/en_us_oca/me.m06.d21:meMA.Ode1C13.mode	@ltx/en_us_oca/miscellanea:misc.Mode8
ltx/en_us_oca/me.m06.d21:meMA.Ode1C13.ode	@ltx/en_us_oca/miscellanea:misc.Ode1
ltx/en_us_oca/me.m06.d21:meMA.Ode1C13.text	
ltx/en_us_oca/me.m06.d21:meMA.Ode1C1T.incipit	…
ltx/en_us_oca/me.m06.d21:meMA.Ode1C1T.melody	@ltx/en_us_oca/he.h.m8:heHE.AsomenToKyrio.notmetered
ltx/en_us_oca/me.m06.d21:meMA.Ode1C1T.mode	@ltx/en_us_oca/miscellanea:misc.Mode8
ltx/en_us_oca/me.m06.d21:meMA.Ode1C1T.ode	@ltx/en_us_oca/miscellanea:misc.Ode1
ltx/en_us_oca/me.m06.d21:meMA.Ode1C1T.text	
ltx/en_us_oca/me.m06.d21:meMA.Ode3C11.greekmelody	@ltx/en_us_oca/he.h.m8:heHE.SyEiToStereoma.greekname
ltx/en_us_oca/me.m06.d21:meMA.Ode3C11.incipit	…
ltx/en_us_oca/me.m06.d21:meMA.Ode3C11.melody	@ltx/en_us_oca/he.h.m8:heHE.SyEiToStereoma.notmetered
ltx/en_us_oca/me.m06.d21:meMA.Ode3C11.mode	@ltx/en_us_oca/miscellanea:misc.Mode8
ltx/en_us_oca/me.m06.d21:meMA.Ode3C11.ode	@ltx/en_us_oca/miscellanea:misc.Ode3
ltx/en_us_oca/me.m06.d21:meMA.Ode3C11.text	
ltx/en_us_oca/me.m06.d21:meMA.Ode3C12.incipit	…
ltx/en_us_oca/me.m06.d21:meMA.Ode3C12.melody	@ltx/en_us_oca/he.h.m8:heHE.SyEiToStereoma.notmetered
ltx/en_us_oca/me.m06.d21:meMA.Ode3C12.mode	@ltx/en_us_oca/miscellanea:misc.Mode8
ltx/en_us_oca/me.m06.d21:meMA.Ode3C12.ode	@ltx/en_us_oca/miscellanea:misc.Ode3
ltx/en_us_oca/me.m06.d21:meMA.Ode3C12.text	
ltx/en_us_oca/me.m06.d21:meMA.Ode3C13.incipit	…
ltx/en_us_oca/me.m06.d21:meMA.Ode3C13.melody	@ltx/en_us_oca/he.h.m8:heHE.SyEiToStereoma.notmetered
ltx/en_us_oca/me.m06.d21:meMA.Ode3C13.mode	@ltx/en_us_oca/miscellanea:misc.Mode8
ltx/en_us_oca/me.m06.d21:meMA.Ode3C13.ode	@ltx/en_us_oca/miscellanea:misc.Ode3
ltx/en_us_oca/me.m06.d21:meMA.Ode3C13.text	
ltx/en_us_oca/me.m06.d21:meMA.Ode3C1T.incipit	…
ltx/en_us_oca/me.m06.d21:meMA.Ode3C1T.melody	@ltx/en_us_oca/he.h.m8:heHE.SyEiToStereoma.notmetered
ltx/en_us_oca/me.m06.d21:meMA.Ode3C1T.mode	@ltx/en_us_oca/miscellanea:misc.Mode8
ltx/en_us_oca/me.m06.d21:meMA.Ode3C1T.ode	@ltx/en_us_oca/miscellanea:misc.Ode3
ltx/en_us_oca/me.m06.d21:meMA.Ode3C1T.text	
ltx/en_us_oca/me.m06.d21:meMA.Ode3H.greekmelody	@ltx/en_us_oca/he.h.m8:heHE.SyEiToStereoma.greekname
ltx/en_us_oca/me.m06.d21:meMA.Ode3H.incipit	@ltx/en_us_oca/he.h.m8:heHE.SyEiToStereoma.incipit
ltx/en_us_oca/me.m06.d21:meMA.Ode3H.melody	@ltx/en_us_oca/he.h.m8:heHE.SyEiToStereoma.melody
ltx/en_us_oca/me.m06.d21:meMA.Ode3H.mode	@ltx/en_us_oca/miscellanea:misc.Mode8
ltx/en_us_oca/me.m06.d21:meMA.Ode3H.ode	@ltx/en_us_oca/miscellanea:misc.Ode3
ltx/en_us_oca/me.m06.d21:meMA.Ode3H.text	@ltx/en_us_oca/he.h.m8:heHE.SyEiToStereoma.text
ltx/en_us_oca/me.m06.d21:meMA.Ode3Kathisma1.greekmelody	@ltx/en_us_oca/he.a.m1:heAU.TonTafonSouSotir.greekname
ltx/en_us_oca/me.m06.d21:meMA.Ode3Kathisma1.incipit	…
ltx/en_us_oca/me.m06.d21:meMA.Ode3Kathisma1.melody	@ltx/en_us_oca/he.a.m1:heAU.TonTafonSouSotir.notmetered
ltx/en_us_oca/me.m06.d21:meMA.Ode3Kathisma1.mode	@ltx/en_us_oca/miscellanea:misc.Mode1
ltx/en_us_oca/me.m06.d21:meMA.Ode3Kathisma1.text	
ltx/en_us_oca/me.m06.d21:meMA.Ode3KathismaSt.incipit	…
ltx/en_us_oca/me.m06.d21:meMA.Ode3KathismaSt.melody	@ltx/en_us_oca/he.a.m1:heAU.TonTafonSouSotir.notmetered
ltx/en_us_oca/me.m06.d21:meMA.Ode3KathismaSt.mode	@ltx/en_us_oca/miscellanea:misc.Mode1
ltx/en_us_oca/me.m06.d21:meMA.Ode3KathismaSt.text	
ltx/en_us_oca/me.m06.d21:meMA.Ode3KathismaT.incipit	
ltx/en_us_oca/me.m06.d21:meMA.Ode3KathismaT.melody	@ltx/en_us_oca/he.a.m1:heAU.TonTafonSouSotir.notmetered
ltx/en_us_oca/me.m06.d21:meMA.Ode3KathismaT.mode	@ltx/en_us_oca/miscellanea:misc.Mode1
ltx/en_us_oca/me.m06.d21:meMA.Ode3KathismaT.text	
ltx/en_us_oca/me.m06.d21:meMA.Ode4C11.greekmelody	@ltx/en_us_oca/he.h.m8:heHE.EisakikoaKyrie.greekname
ltx/en_us_oca/me.m06.d21:meMA.Ode4C11.incipit	…
ltx/en_us_oca/me.m06.d21:meMA.Ode4C11.melody	@ltx/en_us_oca/he.h.m8:heHE.EisakikoaKyrie.notmetered
ltx/en_us_oca/me.m06.d21:meMA.Ode4C11.mode	@ltx/en_us_oca/miscellanea:misc.Mode8
ltx/en_us_oca/me.m06.d21:meMA.Ode4C11.ode	@ltx/en_us_oca/miscellanea:misc.Ode4
ltx/en_us_oca/me.m06.d21:meMA.Ode4C11.text	
ltx/en_us_oca/me.m06.d21:meMA.Ode4C12.incipit	…
ltx/en_us_oca/me.m06.d21:meMA.Ode4C12.melody	@ltx/en_us_oca/he.h.m8:heHE.EisakikoaKyrie.notmetered
ltx/en_us_oca/me.m06.d21:meMA.Ode4C12.mode	@ltx/en_us_oca/miscellanea:misc.Mode8
ltx/en_us_oca/me.m06.d21:meMA.Ode4C12.ode	@ltx/en_us_oca/miscellanea:misc.Ode4
ltx/en_us_oca/me.m06.d21:meMA.Ode4C12.text	
ltx/en_us_oca/me.m06.d21:meMA.Ode4C13.incipit	…
ltx/en_us_oca/me.m06.d21:meMA.Ode4C13.melody	@ltx/en_us_oca/he.h.m8:heHE.EisakikoaKyrie.notmetered
ltx/en_us_oca/me.m06.d21:meMA.Ode4C13.mode	@ltx/en_us_oca/miscellanea:misc.Mode8
ltx/en_us_oca/me.m06.d21:meMA.Ode4C13.ode	@ltx/en_us_oca/miscellanea:misc.Ode4
ltx/en_us_oca/me.m06.d21:meMA.Ode4C13.text	
ltx/en_us_oca/me.m06.d21:meMA.Ode4C14.incipit	…
ltx/en_us_oca/me.m06.d21:meMA.Ode4C14.melody	@ltx/en_us_oca/he.h.m8:heHE.EisakikoaKyrie.notmetered
ltx/en_us_oca/me.m06.d21:meMA.Ode4C14.mode	@ltx/en_us_oca/miscellanea:misc.Mode8
ltx/en_us_oca/me.m06.d21:meMA.Ode4C14.ode	@ltx/en_us_oca/miscellanea:misc.Ode4
ltx/en_us_oca/me.m06.d21:meMA.Ode4C14.text	
ltx/en_us_oca/me.m06.d21:meMA.Ode4C1T.incipit	…
ltx/en_us_oca/me.m06.d21:meMA.Ode4C1T.melody	@ltx/en_us_oca/he.h.m8:heHE.EisakikoaKyrie.notmetered
ltx/en_us_oca/me.m06.d21:meMA.Ode4C1T.mode	@ltx/en_us_oca/miscellanea:misc.Mode8
ltx/en_us_oca/me.m06.d21:meMA.Ode4C1T.ode	@ltx/en_us_oca/miscellanea:misc.Ode4
ltx/en_us_oca/me.m06.d21:meMA.Ode4C1T.text	
ltx/en_us_oca/me.m06.d21:meMA.Ode5C11.greekmelody	@ltx/en_us_oca/he.h.m8:heHE.OrthrizontesVoomenSoi.greekname
ltx/en_us_oca/me.m06.d21:meMA.Ode5C11.incipit	…
ltx/en_us_oca/me.m06.d21:meMA.Ode5C11.melody	@ltx/en_us_oca/he.h.m8:heHE.OrthrizontesVoomenSoi.notmetered
ltx/en_us_oca/me.m06.d21:meMA.Ode5C11.mode	@ltx/en_us_oca/miscellanea:misc.Mode8
ltx/en_us_oca/me.m06.d21:meMA.Ode5C11.ode	@ltx/en_us_oca/miscellanea:misc.Ode5
ltx/en_us_oca/me.m06.d21:meMA.Ode5C11.text	
ltx/en_us_oca/me.m06.d21:meMA.Ode5C12.incipit	…
ltx/en_us_oca/me.m06.d21:meMA.Ode5C12.melody	@ltx/en_us_oca/he.h.m8:heHE.OrthrizontesVoomenSoi.notmetered
ltx/en_us_oca/me.m06.d21:meMA.Ode5C12.mode	@ltx/en_us_oca/miscellanea:misc.Mode8
ltx/en_us_oca/me.m06.d21:meMA.Ode5C12.ode	@ltx/en_us_oca/miscellanea:misc.Ode5
ltx/en_us_oca/me.m06.d21:meMA.Ode5C12.text	
ltx/en_us_oca/me.m06.d21:meMA.Ode5C13.incipit	…
ltx/en_us_oca/me.m06.d21:meMA.Ode5C13.melody	@ltx/en_us_oca/he.h.m8:heHE.OrthrizontesVoomenSoi.notmetered
ltx/en_us_oca/me.m06.d21:meMA.Ode5C13.mode	@ltx/en_us_oca/miscellanea:misc.Mode8
ltx/en_us_oca/me.m06.d21:meMA.Ode5C13.ode	@ltx/en_us_oca/miscellanea:misc.Ode5
ltx/en_us_oca/me.m06.d21:meMA.Ode5C13.text	
ltx/en_us_oca/me.m06.d21:meMA.Ode5C1T.incipit	…
ltx/en_us_oca/me.m06.d21:meMA.Ode5C1T.melody	@ltx/en_us_oca/he.h.m8:heHE.OrthrizontesVoomenSoi.notmetered
ltx/en_us_oca/me.m06.d21:meMA.Ode5C1T.mode	@ltx/en_us_oca/miscellanea:misc.Mode8
ltx/en_us_oca/me.m06.d21:meMA.Ode5C1T.ode	@ltx/en_us_oca/miscellanea:misc.Ode5
ltx/en_us_oca/me.m06.d21:meMA.Ode5C1T.text	
ltx/en_us_oca/me.m06.d21:meMA.Ode6C11.greekmelody	@ltx/en_us_oca/he.h.m8:heHE.ChitonaMoiParaschou.greekname
ltx/en_us_oca/me.m06.d21:meMA.Ode6C11.incipit	…
ltx/en_us_oca/me.m06.d21:meMA.Ode6C11.melody	@ltx/en_us_oca/he.h.m8:heHE.ChitonaMoiParaschou.notmetered
ltx/en_us_oca/me.m06.d21:meMA.Ode6C11.mode	@ltx/en_us_oca/miscellanea:misc.Mode8
ltx/en_us_oca/me.m06.d21:meMA.Ode6C11.ode	@ltx/en_us_oca/miscellanea:misc.Ode6
ltx/en_us_oca/me.m06.d21:meMA.Ode6C11.text	
ltx/en_us_oca/me.m06.d21:meMA.Ode6C12.incipit	…
ltx/en_us_oca/me.m06.d21:meMA.Ode6C12.melody	@ltx/en_us_oca/he.h.m8:heHE.ChitonaMoiParaschou.notmetered
ltx/en_us_oca/me.m06.d21:meMA.Ode6C12.mode	@ltx/en_us_oca/miscellanea:misc.Mode8
ltx/en_us_oca/me.m06.d21:meMA.Ode6C12.ode	@ltx/en_us_oca/miscellanea:misc.Ode6
ltx/en_us_oca/me.m06.d21:meMA.Ode6C12.text	
ltx/en_us_oca/me.m06.d21:meMA.Ode6C13.incipit	…
ltx/en_us_oca/me.m06.d21:meMA.Ode6C13.melody	@ltx/en_us_oca/he.h.m8:heHE.ChitonaMoiParaschou.notmetered
ltx/en_us_oca/me.m06.d21:meMA.Ode6C13.mode	@ltx/en_us_oca/miscellanea:misc.Mode8
ltx/en_us_oca/me.m06.d21:meMA.Ode6C13.ode	@ltx/en_us_oca/miscellanea:misc.Ode6
ltx/en_us_oca/me.m06.d21:meMA.Ode6C13.text	
ltx/en_us_oca/me.m06.d21:meMA.Ode6C1T.incipit	…
ltx/en_us_oca/me.m06.d21:meMA.Ode6C1T.melody	@ltx/en_us_oca/he.h.m8:heHE.ChitonaMoiParaschou.notmetered
ltx/en_us_oca/me.m06.d21:meMA.Ode6C1T.mode	@ltx/en_us_oca/miscellanea:misc.Mode8
ltx/en_us_oca/me.m06.d21:meMA.Ode6C1T.ode	@ltx/en_us_oca/miscellanea:misc.Ode6
ltx/en_us_oca/me.m06.d21:meMA.Ode6C1T.text	
ltx/en_us_oca/me.m06.d21:meMA.Ode6H.greekmelody	@ltx/en_us_oca/he.h.m8:heHE.ChitonaMoiParaschou.greekname
ltx/en_us_oca/me.m06.d21:meMA.Ode6H.incipit	@ltx/en_us_oca/he.h.m8:heHE.ChitonaMoiParaschou.incipit
ltx/en_us_oca/me.m06.d21:meMA.Ode6H.melody	@ltx/en_us_oca/he.h.m8:heHE.ChitonaMoiParaschou.melody
ltx/en_us_oca/me.m06.d21:meMA.Ode6H.mode	@ltx/en_us_oca/miscellanea:misc.Mode8
ltx/en_us_oca/me.m06.d21:meMA.Ode6H.ode	@ltx/en_us_oca/miscellanea:misc.Ode6
ltx/en_us_oca/me.m06.d21:meMA.Ode6H.text	@ltx/en_us_oca/he.h.m8:heHE.ChitonaMoiParaschou.text
ltx/en_us_oca/me.m06.d21:meMA.Ode7C11.greekmelody	@ltx/en_us_oca/he.h.m8:heHE.PaidesEvraion.greekname
ltx/en_us_oca/me.m06.d21:meMA.Ode7C11.incipit	…
ltx/en_us_oca/me.m06.d21:meMA.Ode7C11.melody	@ltx/en_us_oca/he.h.m8:heHE.PaidesEvraion.notmetered
ltx/en_us_oca/me.m06.d21:meMA.Ode7C11.mode	@ltx/en_us_oca/miscellanea:misc.Mode8
ltx/en_us_oca/me.m06.d21:meMA.Ode7C11.ode	@ltx/en_us_oca/miscellanea:misc.Ode7
ltx/en_us_oca/me.m06.d21:meMA.Ode7C11.text	
ltx/en_us_oca/me.m06.d21:meMA.Ode7C12.incipit	…
ltx/en_us_oca/me.m06.d21:meMA.Ode7C12.melody	@ltx/en_us_oca/he.h.m8:heHE.PaidesEvraion.notmetered
ltx/en_us_oca/me.m06.d21:meMA.Ode7C12.mode	@ltx/en_us_oca/miscellanea:misc.Mode8
ltx/en_us_oca/me.m06.d21:meMA.Ode7C12.ode	@ltx/en_us_oca/miscellanea:misc.Ode7
ltx/en_us_oca/me.m06.d21:meMA.Ode7C12.text	
ltx/en_us_oca/me.m06.d21:meMA.Ode7C13.incipit	…
ltx/en_us_oca/me.m06.d21:meMA.Ode7C13.melody	@ltx/en_us_oca/he.h.m8:heHE.PaidesEvraion.notmetered
ltx/en_us_oca/me.m06.d21:meMA.Ode7C13.mode	@ltx/en_us_oca/miscellanea:misc.Mode8
ltx/en_us_oca/me.m06.d21:meMA.Ode7C13.ode	@ltx/en_us_oca/miscellanea:misc.Ode7
ltx/en_us_oca/me.m06.d21:meMA.Ode7C13.text	
ltx/en_us_oca/me.m06.d21:meMA.Ode7C14.incipit	…
ltx/en_us_oca/me.m06.d21:meMA.Ode7C14.melody	@ltx/en_us_oca/he.h.m8:heHE.PaidesEvraion.notmetered
ltx/en_us_oca/me.m06.d21:meMA.Ode7C14.mode	@ltx/en_us_oca/miscellanea:misc.Mode8
ltx/en_us_oca/me.m06.d21:meMA.Ode7C14.ode	@ltx/en_us_oca/miscellanea:misc.Ode7
ltx/en_us_oca/me.m06.d21:meMA.Ode7C14.text	
ltx/en_us_oca/me.m06.d21:meMA.Ode7C1T.incipit	…
ltx/en_us_oca/me.m06.d21:meMA.Ode7C1T.melody	@ltx/en_us_oca/he.h.m8:heHE.PaidesEvraion.notmetered
ltx/en_us_oca/me.m06.d21:meMA.Ode7C1T.mode	@ltx/en_us_oca/miscellanea:misc.Mode8
ltx/en_us_oca/me.m06.d21:meMA.Ode7C1T.ode	@ltx/en_us_oca/miscellanea:misc.Ode7
ltx/en_us_oca/me.m06.d21:meMA.Ode7C1T.text	
ltx/en_us_oca/me.m06.d21:meMA.Ode8C11.greekmelody	@ltx/en_us_oca/he.h.m8:heHE.MousikonOrganon.greekname
ltx/en_us_oca/me.m06.d21:meMA.Ode8C11.incipit	…
ltx/en_us_oca/me.m06.d21:meMA.Ode8C11.melody	@ltx/en_us_oca/he.h.m8:heHE.MousikonOrganon.notmetered
ltx/en_us_oca/me.m06.d21:meMA.Ode8C11.mode	@ltx/en_us_oca/miscellanea:misc.Mode8
ltx/en_us_oca/me.m06.d21:meMA.Ode8C11.ode	@ltx/en_us_oca/miscellanea:misc.Ode8
ltx/en_us_oca/me.m06.d21:meMA.Ode8C11.text	
ltx/en_us_oca/me.m06.d21:meMA.Ode8C12.incipit	…
ltx/en_us_oca/me.m06.d21:meMA.Ode8C12.melody	@ltx/en_us_oca/he.h.m8:heHE.MousikonOrganon.notmetered
ltx/en_us_oca/me.m06.d21:meMA.Ode8C12.mode	@ltx/en_us_oca/miscellanea:misc.Mode8
ltx/en_us_oca/me.m06.d21:meMA.Ode8C12.ode	@ltx/en_us_oca/miscellanea:misc.Ode8
ltx/en_us_oca/me.m06.d21:meMA.Ode8C12.text	
ltx/en_us_oca/me.m06.d21:meMA.Ode8C13.incipit	…
ltx/en_us_oca/me.m06.d21:meMA.Ode8C13.melody	@ltx/en_us_oca/he.h.m8:heHE.MousikonOrganon.notmetered
ltx/en_us_oca/me.m06.d21:meMA.Ode8C13.mode	@ltx/en_us_oca/miscellanea:misc.Mode8
ltx/en_us_oca/me.m06.d21:meMA.Ode8C13.ode	@ltx/en_us_oca/miscellanea:misc.Ode8
ltx/en_us_oca/me.m06.d21:meMA.Ode8C13.text	
ltx/en_us_oca/me.m06.d21:meMA.Ode8C14.incipit	…
ltx/en_us_oca/me.m06.d21:meMA.Ode8C14.melody	@ltx/en_us_oca/he.h.m8:heHE.MousikonOrganon.notmetered
ltx/en_us_oca/me.m06.d21:meMA.Ode8C14.mode	@ltx/en_us_oca/miscellanea:misc.Mode8
ltx/en_us_oca/me.m06.d21:meMA.Ode8C14.ode	@ltx/en_us_oca/miscellanea:misc.Ode8
ltx/en_us_oca/me.m06.d21:meMA.Ode8C14.text	
ltx/en_us_oca/me.m06.d21:meMA.Ode8C1T.incipit	…
ltx/en_us_oca/me.m06.d21:meMA.Ode8C1T.melody	@ltx/en_us_oca/he.h.m8:heHE.MousikonOrganon.notmetered
ltx/en_us_oca/me.m06.d21:meMA.Ode8C1T.mode	@ltx/en_us_oca/miscellanea:misc.Mode8
ltx/en_us_oca/me.m06.d21:meMA.Ode8C1T.ode	@ltx/en_us_oca/miscellanea:misc.Ode8
ltx/en_us_oca/me.m06.d21:meMA.Ode8C1T.text	
ltx/en_us_oca/me.m06.d21:meMA.Ode8H.greekmelody	@ltx/en_us_oca/he.h.m8:heHE.MousikonOrganon.greekname
ltx/en_us_oca/me.m06.d21:meMA.Ode8H.incipit	@ltx/en_us_oca/he.h.m8:heHE.MousikonOrganon.incipit
ltx/en_us_oca/me.m06.d21:meMA.Ode8H.melody	@ltx/en_us_oca/he.h.m8:heHE.MousikonOrganon.melody
ltx/en_us_oca/me.m06.d21:meMA.Ode8H.mode	@ltx/en_us_oca/miscellanea:misc.Mode8
ltx/en_us_oca/me.m06.d21:meMA.Ode8H.ode	@ltx/en_us_oca/miscellanea:misc.Ode8
ltx/en_us_oca/me.m06.d21:meMA.Ode8H.text	@ltx/en_us_oca/he.h.m8:heHE.MousikonOrganon.text
ltx/en_us_oca/me.m06.d21:meMA.Ode9C11.greekmelody	@ltx/en_us_oca/he.h.m8:heHE.TinAgninEndoxos.greekname
ltx/en_us_oca/me.m06.d21:meMA.Ode9C11.incipit	…
ltx/en_us_oca/me.m06.d21:meMA.Ode9C11.melody	@ltx/en_us_oca/he.h.m8:heHE.TinAgninEndoxos.notmetered
ltx/en_us_oca/me.m06.d21:meMA.Ode9C11.mode	@ltx/en_us_oca/miscellanea:misc.Mode8
ltx/en_us_oca/me.m06.d21:meMA.Ode9C11.ode	@ltx/en_us_oca/miscellanea:misc.Ode9
ltx/en_us_oca/me.m06.d21:meMA.Ode9C11.text	
ltx/en_us_oca/me.m06.d21:meMA.Ode9C12.incipit	…
ltx/en_us_oca/me.m06.d21:meMA.Ode9C12.melody	@ltx/en_us_oca/he.h.m8:heHE.TinAgninEndoxos.notmetered
ltx/en_us_oca/me.m06.d21:meMA.Ode9C12.mode	@ltx/en_us_oca/miscellanea:misc.Mode8
ltx/en_us_oca/me.m06.d21:meMA.Ode9C12.ode	@ltx/en_us_oca/miscellanea:misc.Ode9
ltx/en_us_oca/me.m06.d21:meMA.Ode9C12.text	
ltx/en_us_oca/me.m06.d21:meMA.Ode9C13.incipit	…
ltx/en_us_oca/me.m06.d21:meMA.Ode9C13.melody	@ltx/en_us_oca/he.h.m8:heHE.TinAgninEndoxos.notmetered
ltx/en_us_oca/me.m06.d21:meMA.Ode9C13.mode	@ltx/en_us_oca/miscellanea:misc.Mode8
ltx/en_us_oca/me.m06.d21:meMA.Ode9C13.ode	@ltx/en_us_oca/miscellanea:misc.Ode9
ltx/en_us_oca/me.m06.d21:meMA.Ode9C13.text	
ltx/en_us_oca/me.m06.d21:meMA.Ode9C14.incipit	…
ltx/en_us_oca/me.m06.d21:meMA.Ode9C14.melody	@ltx/en_us_oca/he.h.m8:heHE.TinAgninEndoxos.notmetered
ltx/en_us_oca/me.m06.d21:meMA.Ode9C14.mode	@ltx/en_us_oca/miscellanea:misc.Mode8
ltx/en_us_oca/me.m06.d21:meMA.Ode9C14.ode	@ltx/en_us_oca/miscellanea:misc.Ode9
ltx/en_us_oca/me.m06.d21:meMA.Ode9C14.text	
ltx/en_us_oca/me.m06.d21:meMA.Ode9C1T.incipit	…
ltx/en_us_oca/me.m06.d21:meMA.Ode9C1T.melody	@ltx/en_us_oca/he.h.m8:heHE.TinAgninEndoxos.notmetered
ltx/en_us_oca/me.m06.d21:meMA.Ode9C1T.mode	@ltx/en_us_oca/miscellanea:misc.Mode8
ltx/en_us_oca/me.m06.d21:meMA.Ode9C1T.ode	@ltx/en_us_oca/miscellanea:misc.Ode9
ltx/en_us_oca/me.m06.d21:meMA.Ode9C1T.text	
ltx/en_us_oca/me.m06.d21:meMA.Ode9H.greekmelody	@ltx/en_us_oca/he.h.m8:heHE.TinAgninEndoxos.greekname
ltx/en_us_oca/me.m06.d21:meMA.Ode9H.incipit	@ltx/en_us_oca/he.h.m8:heHE.TinAgninEndoxos.incipit
ltx/en_us_oca/me.m06.d21:meMA.Ode9H.melody	@ltx/en_us_oca/he.h.m8:heHE.TinAgninEndoxos.melody
ltx/en_us_oca/me.m06.d21:meMA.Ode9H.mode	@ltx/en_us_oca/miscellanea:misc.Mode8
ltx/en_us_oca/me.m06.d21:meMA.Ode9H.ode	@ltx/en_us_oca/miscellanea:misc.Ode9
ltx/en_us_oca/me.m06.d21:meMA.Ode9H.text	@ltx/en_us_oca/he.h.m8:heHE.TinAgninEndoxos.text
ltx/en_us_oca/me.m06.d21:meVE.Apolytikion1ger.greekmelody	@ltx/en_us_oca/he.a.m5:heAU.TonSynanarchonLogon.greekname
ltx/en_us_oca/me.m06.d21:meVE.Apolytikion1ger.incipit	…
ltx/en_us_oca/me.m06.d21:meVE.Apolytikion1ger.melody	@ltx/en_us_oca/he.a.m5:heAU.TonSynanarchonLogon.notmetered
ltx/en_us_oca/me.m06.d21:meVE.Apolytikion1ger.mode	@ltx/en_us_oca/miscellanea:misc.Mode5
ltx/en_us_oca/me.m06.d21:meVE.Apolytikion1ger.poet	@ltx/en_us_oca/poets:po.Gerasimou
ltx/en_us_oca/me.m06.d21:meVE.Apolytikion1ger.text	
ltx/en_us_oca/me.m06.d21:meVE.SticStavrotheotokion.greekmelody	@ltx/en_us_oca/he.a.m4:heAU.OsGennaionEnMartysi.greekname
ltx/en_us_oca/me.m06.d21:meVE.SticStavrotheotokion.incipit	…
ltx/en_us_oca/me.m06.d21:meVE.SticStavrotheotokion.melody	@ltx/en_us_oca/he.a.m4:heAU.OsGennaionEnMartysi.notmetered
ltx/en_us_oca/me.m06.d21:meVE.SticStavrotheotokion.mode	@ltx/en_us_oca/miscellanea:misc.Mode4
ltx/en_us_oca/me.m06.d21:meVE.SticStavrotheotokion.text	
ltx/en_us_oca/me.m06.d21:meVE.SticTheotokion.greekmelody	@ltx/en_us_oca/he.a.m4:heAU.OsGennaionEnMartysi.greekname
ltx/en_us_oca/me.m06.d21:meVE.SticTheotokion.incipit	@ltx/en_us_oca/me.m06.d09:meVE.SticTheotokion.incipit
ltx/en_us_oca/me.m06.d21:meVE.SticTheotokion.melody	@ltx/en_us_oca/he.a.m4:heAU.OsGennaionEnMartysi.notmetered
ltx/en_us_oca/me.m06.d21:meVE.SticTheotokion.mode	@ltx/en_us_oca/miscellanea:misc.Mode4
ltx/en_us_oca/me.m06.d21:meVE.SticTheotokion.text	@ltx/en_us_oca/me.m06.d09:meVE.SticTheotokion.text
ltx/en_us_oca/me.m06.d21:meVE.Stichera01.greekmelody	@ltx/en_us_oca/he.a.m4:heAU.OsGennaionEnMartysi.greekname
ltx/en_us_oca/me.m06.d21:meVE.Stichera01.incipit	Blessed Martyr Julian, ⁄ we…
ltx/en_us_oca/me.m06.d21:meVE.Stichera01.melody	@ltx/en_us_oca/he.a.m4:heAU.OsGennaionEnMartysi.notmetered
ltx/en_us_oca/me.m06.d21:meVE.Stichera01.mode	@ltx/en_us_oca/miscellanea:misc.Mode4
ltx/en_us_oca/me.m06.d21:meVE.Stichera01.text	Blessed Martyr Julian, ⁄ we celebrate your divine and light-bearing memorial: ⁄ We know you as a radiant sun, ⁄ shining on the whole world with the brilliance of your mind; ⁄ casting out the night of disbelief in the true God! ⁄⁄ As we venerate the dust of your relics, we gain strength of soul.
ltx/en_us_oca/me.m06.d21:meVE.Stichera02.incipit	You were lashed with a…
ltx/en_us_oca/me.m06.d21:meVE.Stichera02.melody	@ltx/en_us_oca/he.a.m4:heAU.OsGennaionEnMartysi.notmetered
ltx/en_us_oca/me.m06.d21:meVE.Stichera02.mode	@ltx/en_us_oca/miscellanea:misc.Mode4
ltx/en_us_oca/me.m06.d21:meVE.Stichera02.text	You were lashed with a whip, blessed one, ⁄ kicked frightfully and confined in prison. ⁄ While in affliction, you transcended your surroundings: ⁄ You were encompassed by wild beasts; ⁄ you entered into the deep and were drowned by the sea. ⁄ You received your holy end without denying the Master of all! ⁄⁄ You are greatly blessed, the glory of the martyrs!
ltx/en_us_oca/me.m06.d21:meVE.Stichera03.incipit	Your most holy and beloved…
ltx/en_us_oca/me.m06.d21:meVE.Stichera03.melody	@ltx/en_us_oca/he.a.m4:heAU.OsGennaionEnMartysi.notmetered
ltx/en_us_oca/me.m06.d21:meVE.Stichera03.mode	@ltx/en_us_oca/miscellanea:misc.Mode4
ltx/en_us_oca/me.m06.d21:meVE.Stichera03.text	Your most holy and beloved mother ⁄ saw you drift from the waves of the sea to dry land. ⁄ By the direction of the Spirit, ⁄ she faithfully welcomed you, Martyr Julian. ⁄ She entrusted your blameless and sorely-tried body to the tomb: ⁄⁄ The body victorious through grace over the devil’s tyranny!
