ltx/en_us_oca/bible:Acts.abbr	
ltx/en_us_oca/bible:Acts.text	
ltx/en_us_oca/bible:Amos.abbr	
ltx/en_us_oca/bible:Amos.text	
ltx/en_us_oca/bible:Chronicles1.abbr	
ltx/en_us_oca/bible:Chronicles1.text	
ltx/en_us_oca/bible:Chronicles2.abbr	
ltx/en_us_oca/bible:Chronicles2.text	
ltx/en_us_oca/bible:Colossians.abbr	
ltx/en_us_oca/bible:Colossians.text	
ltx/en_us_oca/bible:Corinthians1.abbr	
ltx/en_us_oca/bible:Corinthians1.text	
ltx/en_us_oca/bible:Corinthians2.abbr	
ltx/en_us_oca/bible:Corinthians2.text	
ltx/en_us_oca/bible:Daniel.abbr	
ltx/en_us_oca/bible:Daniel.text	
ltx/en_us_oca/bible:Deuteronomy.abbr	
ltx/en_us_oca/bible:Deuteronomy.text	
ltx/en_us_oca/bible:Ecclesiastes.abbr	
ltx/en_us_oca/bible:Ecclesiastes.text	
ltx/en_us_oca/bible:Ephesians.abbr	
ltx/en_us_oca/bible:Ephesians.text	
ltx/en_us_oca/bible:Esther.abbr	
ltx/en_us_oca/bible:Esther.text	
ltx/en_us_oca/bible:Exodus.abbr	
ltx/en_us_oca/bible:Exodus.text	
ltx/en_us_oca/bible:Ezekiel.abbr	
ltx/en_us_oca/bible:Ezekiel.text	
ltx/en_us_oca/bible:Ezra.abbr	
ltx/en_us_oca/bible:Ezra.text	
ltx/en_us_oca/bible:Galatians.abbr	
ltx/en_us_oca/bible:Galatians.text	
ltx/en_us_oca/bible:Genesis.abbr	
ltx/en_us_oca/bible:Genesis.text	
ltx/en_us_oca/bible:Habakkuk.abbr	
ltx/en_us_oca/bible:Habakkuk.text	
ltx/en_us_oca/bible:Haggai.abbr	
ltx/en_us_oca/bible:Haggai.text	
ltx/en_us_oca/bible:Hebrews.abbr	
ltx/en_us_oca/bible:Hebrews.text	
ltx/en_us_oca/bible:Hosea.abbr	
ltx/en_us_oca/bible:Hosea.text	
ltx/en_us_oca/bible:Isaiah.abbr	
ltx/en_us_oca/bible:Isaiah.text	
ltx/en_us_oca/bible:James.abbr	
ltx/en_us_oca/bible:James.text	
ltx/en_us_oca/bible:Jeremiah.abbr	
ltx/en_us_oca/bible:Jeremiah.text	
ltx/en_us_oca/bible:Job.abbr	
ltx/en_us_oca/bible:Job.text	
ltx/en_us_oca/bible:Joel.abbr	
ltx/en_us_oca/bible:Joel.text	
ltx/en_us_oca/bible:John.abbr	
ltx/en_us_oca/bible:John.text	
ltx/en_us_oca/bible:John1.abbr	
ltx/en_us_oca/bible:John1.text	
ltx/en_us_oca/bible:John2.abbr	
ltx/en_us_oca/bible:John2.text	
ltx/en_us_oca/bible:John3.abbr	
ltx/en_us_oca/bible:John3.text	
ltx/en_us_oca/bible:Jonah.abbr	
ltx/en_us_oca/bible:Jonah.text	
ltx/en_us_oca/bible:Joshua.abbr	
ltx/en_us_oca/bible:Joshua.text	
ltx/en_us_oca/bible:Jude.abbr	
ltx/en_us_oca/bible:Jude.text	
ltx/en_us_oca/bible:Judges.abbr	
ltx/en_us_oca/bible:Judges.text	
ltx/en_us_oca/bible:Kings1.abbr	
ltx/en_us_oca/bible:Kings1.text	
ltx/en_us_oca/bible:Kings2.abbr	
ltx/en_us_oca/bible:Kings2.text	
ltx/en_us_oca/bible:Lamentations.abbr	
ltx/en_us_oca/bible:Lamentations.text	
ltx/en_us_oca/bible:Leviticus.abbr	
ltx/en_us_oca/bible:Leviticus.text	
ltx/en_us_oca/bible:Luke.abbr	
ltx/en_us_oca/bible:Luke.text	
ltx/en_us_oca/bible:Malachi.abbr	
ltx/en_us_oca/bible:Malachi.text	
ltx/en_us_oca/bible:Mark.abbr	
ltx/en_us_oca/bible:Mark.text	
ltx/en_us_oca/bible:Matthew.abbr	
ltx/en_us_oca/bible:Matthew.text	
ltx/en_us_oca/bible:Micah.abbr	
ltx/en_us_oca/bible:Micah.text	
ltx/en_us_oca/bible:Nahum.abbr	
ltx/en_us_oca/bible:Nahum.text	
ltx/en_us_oca/bible:Nehemiah.abbr	
ltx/en_us_oca/bible:Nehemiah.text	
ltx/en_us_oca/bible:Numbers.abbr	
ltx/en_us_oca/bible:Numbers.text	
ltx/en_us_oca/bible:Obadiah.abbr	
ltx/en_us_oca/bible:Obadiah.text	
ltx/en_us_oca/bible:Peter1.abbr	
ltx/en_us_oca/bible:Peter1.text	
ltx/en_us_oca/bible:Peter2.abbr	
ltx/en_us_oca/bible:Peter2.text	
ltx/en_us_oca/bible:Philemon.abbr	
ltx/en_us_oca/bible:Philemon.text	
ltx/en_us_oca/bible:Philippians.abbr	
ltx/en_us_oca/bible:Philippians.text	
ltx/en_us_oca/bible:Proverbs.abbr	
ltx/en_us_oca/bible:Proverbs.text	
ltx/en_us_oca/bible:Psalms.abbr	
ltx/en_us_oca/bible:Psalms.text	
ltx/en_us_oca/bible:Romans.abbr	
ltx/en_us_oca/bible:Romans.text	
ltx/en_us_oca/bible:Ruth.abbr	
ltx/en_us_oca/bible:Ruth.text	
ltx/en_us_oca/bible:Samuel1.abbr	
ltx/en_us_oca/bible:Samuel1.text	
ltx/en_us_oca/bible:Samuel2.abbr	
ltx/en_us_oca/bible:Samuel2.text	
ltx/en_us_oca/bible:Song.abbr	
ltx/en_us_oca/bible:Song.text	
ltx/en_us_oca/bible:Thessalonians1.abbr	
ltx/en_us_oca/bible:Thessalonians1.text	
ltx/en_us_oca/bible:Thessalonians2.abbr	
ltx/en_us_oca/bible:Thessalonians2.text	
ltx/en_us_oca/bible:Timothy1.abbr	
ltx/en_us_oca/bible:Timothy1.text	
ltx/en_us_oca/bible:Timothy2.abbr	
ltx/en_us_oca/bible:Timothy2.text	
ltx/en_us_oca/bible:Titus.abbr	
ltx/en_us_oca/bible:Titus.text	
ltx/en_us_oca/bible:Wisdom.abbr	
ltx/en_us_oca/bible:Wisdom.text	
ltx/en_us_oca/bible:Zechariah.abbr	
ltx/en_us_oca/bible:Zechariah.text	
ltx/en_us_oca/bible:Zephaniah.abbr	
ltx/en_us_oca/bible:Zephaniah.text	
