ltx/en_us_oca/me.m01.d20:meDA.commemoration.first	
ltx/en_us_oca/me.m01.d20:meDA.commemoration.first_name	
ltx/en_us_oca/me.m01.d20:meDA.commemoration.first_short	
ltx/en_us_oca/me.m01.d20:meDA.commemoration.first_title	
ltx/en_us_oca/me.m01.d20:meDA.commemoration.full	
ltx/en_us_oca/me.m01.d20:meDA.commemoration.second_name	
ltx/en_us_oca/me.m01.d20:meDA.commemoration.second_title	
ltx/en_us_oca/me.m01.d20:meDA.date	
ltx/en_us_oca/me.m01.d20:meDA.fordate	
ltx/en_us_oca/me.m01.d20:meDA.insert1	
ltx/en_us_oca/me.m01.d20:meDA.insert2	
ltx/en_us_oca/me.m01.d20:meDA.note	
ltx/en_us_oca/me.m01.d20:meDA.pdfcoverdate	
ltx/en_us_oca/me.m01.d20:meDA.pdfheaderdate	
ltx/en_us_oca/me.m01.d20:meHO.commemorations	
ltx/en_us_oca/me.m01.d20:meHO.note1	@ltx/en_us_oca/rubrical:ru.HolidayWineOil
ltx/en_us_oca/me.m01.d20:meHO.note2	
ltx/en_us_oca/me.m01.d20:meHO.number	
ltx/en_us_oca/me.m01.d20:meHO.rank	
ltx/en_us_oca/me.m01.d20:meLE.commemoration1	
ltx/en_us_oca/me.m01.d20:meLE.commemoration2	
ltx/en_us_oca/me.m01.d20:meLI.Kontakion1.greekmelody	@ltx/en_us_oca/me.m01.d20:meMA.Kontakion1.greekmelody
ltx/en_us_oca/me.m01.d20:meLI.Kontakion1.incipit	@ltx/en_us_oca/me.m01.d20:meMA.Kontakion1.incipit
ltx/en_us_oca/me.m01.d20:meLI.Kontakion1.melody	@ltx/en_us_oca/me.m01.d20:meMA.Kontakion1.melody
ltx/en_us_oca/me.m01.d20:meLI.Kontakion1.mode	@ltx/en_us_oca/me.m01.d20:meMA.Kontakion1.mode
ltx/en_us_oca/me.m01.d20:meLI.Kontakion1.text	@ltx/en_us_oca/me.m01.d20:meMA.Kontakion1.text
ltx/en_us_oca/me.m01.d20:meLI.MM.CommunionHymn.text	@ltx/en_us_oca/properties:media.key
ltx/en_us_oca/me.m01.d20:meLI.Megalynarion.text	
ltx/en_us_oca/me.m01.d20:meMA.C1.acrostic.notice1	
ltx/en_us_oca/me.m01.d20:meMA.C1.acrostic.text	
ltx/en_us_oca/me.m01.d20:meMA.C1.acrostic.title	First Canon for the Saint.
ltx/en_us_oca/me.m01.d20:meMA.C1.poet	@ltx/en_us_oca/poets:po.IoannouTouDamaskinou
ltx/en_us_oca/me.m01.d20:meMA.C1.title	@ltx/en_us_oca/titles:ti.Canon1DevoutM
ltx/en_us_oca/me.m01.d20:meMA.C1.verse	@ltx/en_us_oca/prayers:pr.verse_DevoutMan.text
ltx/en_us_oca/me.m01.d20:meMA.C2.acrostic.notice1	
ltx/en_us_oca/me.m01.d20:meMA.C2.acrostic.text	
ltx/en_us_oca/me.m01.d20:meMA.C2.acrostic.title	Second Canon.
ltx/en_us_oca/me.m01.d20:meMA.C2.poet	@ltx/en_us_oca/poets:po.Theofanous
ltx/en_us_oca/me.m01.d20:meMA.C2.title	@ltx/en_us_oca/titles:ti.Canon2DevoutM
ltx/en_us_oca/me.m01.d20:meMA.C2.verse	@ltx/en_us_oca/prayers:pr.verse_DevoutMan.text
ltx/en_us_oca/me.m01.d20:meMA.ExapTheotokion.incipit	…
ltx/en_us_oca/me.m01.d20:meMA.ExapTheotokion.melody	@ltx/en_us_oca/he.a.m2:heAU.GynaikesAkoutisthite.notmetered
ltx/en_us_oca/me.m01.d20:meMA.ExapTheotokion.mode	@ltx/en_us_oca/miscellanea:misc.Mode2
ltx/en_us_oca/me.m01.d20:meMA.ExapTheotokion.text	
ltx/en_us_oca/me.m01.d20:meMA.Exaposteilarion1.greekmelody	@ltx/en_us_oca/he.a.m2:heAU.GynaikesAkoutisthite.greekname
ltx/en_us_oca/me.m01.d20:meMA.Exaposteilarion1.incipit	God sanctified you from your…
ltx/en_us_oca/me.m01.d20:meMA.Exaposteilarion1.melody	@ltx/en_us_oca/he.a.m2:heAU.GynaikesAkoutisthite.notmetered
ltx/en_us_oca/me.m01.d20:meMA.Exaposteilarion1.mode	@ltx/en_us_oca/miscellanea:misc.Mode2
ltx/en_us_oca/me.m01.d20:meMA.Exaposteilarion1.text	God sanctified you from your mother’s womb, ⁄ venerable Father, ⁄ showing you to be a divine prophet, ⁄ like Jeremiah and Samuel of old. ⁄ Together with them, wonder-working and God-bearing Euthymius, ⁄ as you dwell with the angels, ⁄⁄ remember those who hymn you with faith.
ltx/en_us_oca/me.m01.d20:meMA.Exaposteilarion2.greekmelody	@ltx/en_us_oca/he.a.m2:heAU.GynaikesAkoutisthite.greekname
ltx/en_us_oca/me.m01.d20:meMA.Exaposteilarion2.incipit	…
ltx/en_us_oca/me.m01.d20:meMA.Exaposteilarion2.melody	@ltx/en_us_oca/he.a.m2:heAU.GynaikesAkoutisthite.notmetered
ltx/en_us_oca/me.m01.d20:meMA.Exaposteilarion2.mode	@ltx/en_us_oca/miscellanea:misc.Mode2
ltx/en_us_oca/me.m01.d20:meMA.Exaposteilarion2.text	
ltx/en_us_oca/me.m01.d20:meMA.Kathisma11.greekmelody	@ltx/en_us_oca/he.a.m4:heAU.EpefanisSimeron.greekname
ltx/en_us_oca/me.m01.d20:meMA.Kathisma11.incipit	Shining with unapproachable light, ⁄…
ltx/en_us_oca/me.m01.d20:meMA.Kathisma11.melody	@ltx/en_us_oca/he.a.m4:heAU.EpefanisSimeron.notmetered
ltx/en_us_oca/me.m01.d20:meMA.Kathisma11.mode	@ltx/en_us_oca/miscellanea:misc.Mode4
ltx/en_us_oca/me.m01.d20:meMA.Kathisma11.text	Shining with unapproachable light, ⁄ you are radiant like a star in the deserts, ⁄ enlightening with your teachings ⁄ those who approach you with firmness of soul, ⁄⁄ Father Euthymius.
ltx/en_us_oca/me.m01.d20:meMA.Kathisma12.greekmelody	@ltx/en_us_oca/he.a.m4:heAU.EpefanisSimeron.greekname
ltx/en_us_oca/me.m01.d20:meMA.Kathisma12.incipit	…
ltx/en_us_oca/me.m01.d20:meMA.Kathisma12.melody	@ltx/en_us_oca/he.a.m4:heAU.EpefanisSimeron.notmetered
ltx/en_us_oca/me.m01.d20:meMA.Kathisma12.mode	@ltx/en_us_oca/miscellanea:misc.Mode4
ltx/en_us_oca/me.m01.d20:meMA.Kathisma12.text	
ltx/en_us_oca/me.m01.d20:meMA.Kathisma1T.incipit	Accept our entreaty as we…
ltx/en_us_oca/me.m01.d20:meMA.Kathisma1T.melody	@ltx/en_us_oca/he.a.m4:heAU.EpefanisSimeron.notmetered
ltx/en_us_oca/me.m01.d20:meMA.Kathisma1T.mode	@ltx/en_us_oca/miscellanea:misc.Mode4
ltx/en_us_oca/me.m01.d20:meMA.Kathisma1T.text	Accept our entreaty as we turn to your protection, Virgin, ⁄ and never cease to pray to the Lover of mankind, ⁄⁄ that He may save His servants.
ltx/en_us_oca/me.m01.d20:meMA.Kathisma21.greekmelody	@ltx/en_us_oca/he.a.m5:heAU.TonSynanarchonLogon.greekname
ltx/en_us_oca/me.m01.d20:meMA.Kathisma21.incipit	You rejected the cares of…
ltx/en_us_oca/me.m01.d20:meMA.Kathisma21.melody	@ltx/en_us_oca/he.a.m5:heAU.TonSynanarchonLogon.notmetered
ltx/en_us_oca/me.m01.d20:meMA.Kathisma21.mode	@ltx/en_us_oca/miscellanea:misc.Mode5
ltx/en_us_oca/me.m01.d20:meMA.Kathisma21.text	You rejected the cares of life ⁄ and embraced the angelic life, ⁄ adorning your soul with abstinence. ⁄ You richly received grace from God, God-bearing Euthymius. ⁄⁄ Pray on behalf of us who praise you with devotion.
ltx/en_us_oca/me.m01.d20:meMA.Kathisma2T.incipit	Have mercy, most holy Virgin…
ltx/en_us_oca/me.m01.d20:meMA.Kathisma2T.melody	@ltx/en_us_oca/he.a.m5:heAU.TonSynanarchonLogon.notmetered
ltx/en_us_oca/me.m01.d20:meMA.Kathisma2T.mode	@ltx/en_us_oca/miscellanea:misc.Mode5
ltx/en_us_oca/me.m01.d20:meMA.Kathisma2T.text	Have mercy, most holy Virgin, ⁄ on us who turn to you with faith, ⁄ for we ask for your fervent help, compassionate one. ⁄ As the good Mother of God most high, ⁄ you are filled with the grace of God. ⁄ You ever pray with the supplications of a Mother ⁄⁄ that He may save us all!
ltx/en_us_oca/me.m01.d20:meMA.Kathisma31.greekmelody	@ltx/en_us_oca/he.a.m8:heAU.TinSofianKaiLogon.greekname
ltx/en_us_oca/me.m01.d20:meMA.Kathisma31.incipit	…
ltx/en_us_oca/me.m01.d20:meMA.Kathisma31.melody	@ltx/en_us_oca/he.a.m8:heAU.TinSofianKaiLogon.notmetered
ltx/en_us_oca/me.m01.d20:meMA.Kathisma31.mode	@ltx/en_us_oca/miscellanea:misc.Mode8
ltx/en_us_oca/me.m01.d20:meMA.Kathisma31.text	
ltx/en_us_oca/me.m01.d20:meMA.Kathisma3T.incipit	…
ltx/en_us_oca/me.m01.d20:meMA.Kathisma3T.melody	@ltx/en_us_oca/he.a.m8:heAU.TinSofianKaiLogon.notmetered
ltx/en_us_oca/me.m01.d20:meMA.Kathisma3T.mode	@ltx/en_us_oca/miscellanea:misc.Mode8
ltx/en_us_oca/me.m01.d20:meMA.Kathisma3T.text	
ltx/en_us_oca/me.m01.d20:meMA.Kontakion1.greekmelody	@ltx/en_us_oca/he.a.m8:heAU.OsAparchas.greekname
ltx/en_us_oca/me.m01.d20:meMA.Kontakion1.incipit	The wilderness rejoiced at your…
ltx/en_us_oca/me.m01.d20:meMA.Kontakion1.melody	@ltx/en_us_oca/he.a.m8:heAU.OsAparchas.notmetered
ltx/en_us_oca/me.m01.d20:meMA.Kontakion1.mode	@ltx/en_us_oca/miscellanea:misc.Mode8
ltx/en_us_oca/me.m01.d20:meMA.Kontakion1.text	The wilderness rejoiced at your birth, holy Father Euthymius. ⁄ In your memory, it brings a harvest of joy through your many miracles! ⁄ Pour the wonders on our souls as well and cleanse us from our sins, ⁄⁄ that we may sing: Alleluia!
ltx/en_us_oca/me.m01.d20:meMA.Lauds1.greekmelody	@ltx/en_us_oca/he.a.m8:heAU.OTouParadoxou.greekname
ltx/en_us_oca/me.m01.d20:meMA.Lauds1.incipit	Venerable Father Euthymius, ⁄ you…
ltx/en_us_oca/me.m01.d20:meMA.Lauds1.melody	@ltx/en_us_oca/he.a.m8:heAU.OTouParadoxou.notmetered
ltx/en_us_oca/me.m01.d20:meMA.Lauds1.mode	@ltx/en_us_oca/miscellanea:misc.Mode8
ltx/en_us_oca/me.m01.d20:meMA.Lauds1.text	Venerable Father Euthymius, ⁄ you forsook earthly things to follow after Christ. ⁄ You did not prefer corruptible things to those which are to come. ⁄ You lived in the desert as in a city, glorious one, ⁄ destroying hordes of the demons. ⁄⁄ Ever glorious one, who can help but retell your soul’s true zeal for the Lord!
ltx/en_us_oca/me.m01.d20:meMA.Lauds2.incipit	Venerable Father Euthymius, ⁄ you…
ltx/en_us_oca/me.m01.d20:meMA.Lauds2.melody	@ltx/en_us_oca/he.a.m8:heAU.OTouParadoxou.notmetered
ltx/en_us_oca/me.m01.d20:meMA.Lauds2.mode	@ltx/en_us_oca/miscellanea:misc.Mode8
ltx/en_us_oca/me.m01.d20:meMA.Lauds2.text	Venerable Father Euthymius, ⁄ you were revealed as a rule for monastics and their pride, ⁄ the delight of the Orthodox ⁄ and a beacon shining for the whole world! ⁄ You were not afraid of the terrors of the deceitful enemy ⁄ when you were living in the cave. ⁄ How great are the gifts that fill you, blessed one, ⁄ by which you openly trample underfoot ⁄⁄ all the arrogance of the demons!
ltx/en_us_oca/me.m01.d20:meMA.Lauds3.incipit	Venerable Father Euthymius, ⁄ you…
ltx/en_us_oca/me.m01.d20:meMA.Lauds3.melody	@ltx/en_us_oca/he.a.m8:heAU.OTouParadoxou.notmetered
ltx/en_us_oca/me.m01.d20:meMA.Lauds3.mode	@ltx/en_us_oca/miscellanea:misc.Mode8
ltx/en_us_oca/me.m01.d20:meMA.Lauds3.text	Venerable Father Euthymius, ⁄ you indeed took flight, soaring aloft to God. ⁄ Having purified your senses, holy one, ⁄ by fasting and unceasing prayer, ⁄ you were counted worthy of immortal life, most blessed one. ⁄ Christ has received you, rejoicing, ⁄ all-glorious adornment of ascetics, ⁄⁄ into the spiritual mansions.
ltx/en_us_oca/me.m01.d20:meMA.LaudsGlory.incipit	We honor you, Euthymius our…
ltx/en_us_oca/me.m01.d20:meMA.LaudsGlory.melody	
ltx/en_us_oca/me.m01.d20:meMA.LaudsGlory.mode	@ltx/en_us_oca/miscellanea:misc.Mode8
ltx/en_us_oca/me.m01.d20:meMA.LaudsGlory.poet	@ltx/en_us_oca/poets:po.Sykeotou
ltx/en_us_oca/me.m01.d20:meMA.LaudsGlory.text	We honor you, Euthymius our Father, ⁄ the instructor of a multitude of monks! ⁄ We have indeed learned to walk rightly in your footsteps! ⁄ You are blest, for having labored for Christ, ⁄ you denounced the power of the enemy! ⁄ Conversor with the angels, ⁄ companion of the venerable and righteous ones! ⁄⁄ Together with them, entreat the Lord that He may grant mercy to our souls!
ltx/en_us_oca/me.m01.d20:meMA.LaudsTheotokion.incipit	@ltx/en_us_oca/oc.m8.d5:ocMA.AposTheotokion.incipit
ltx/en_us_oca/me.m01.d20:meMA.LaudsTheotokion.melody	
ltx/en_us_oca/me.m01.d20:meMA.LaudsTheotokion.mode	@ltx/en_us_oca/miscellanea:misc.Mode8
ltx/en_us_oca/me.m01.d20:meMA.LaudsTheotokion.text	@ltx/en_us_oca/oc.m8.d5:ocMA.AposTheotokion.text
ltx/en_us_oca/me.m01.d20:meMA.MM.Lauds1123as5678.text	@ltx/en_us_oca/properties:media.key
ltx/en_us_oca/me.m01.d20:meMA.Ode1C11.greekmelody	@ltx/en_us_oca/he.h.m4:heHE.OukEstiSoiOmoios.greekname
ltx/en_us_oca/me.m01.d20:meMA.Ode1C11.incipit	You most gloriously loosed the…
ltx/en_us_oca/me.m01.d20:meMA.Ode1C11.melody	@ltx/en_us_oca/he.h.m4:heHE.OukEstiSoiOmoios.notmetered
ltx/en_us_oca/me.m01.d20:meMA.Ode1C11.mode	@ltx/en_us_oca/miscellanea:misc.Mode4
ltx/en_us_oca/me.m01.d20:meMA.Ode1C11.ode	@ltx/en_us_oca/miscellanea:misc.Ode1
ltx/en_us_oca/me.m01.d20:meMA.Ode1C11.text	You most gloriously loosed the grief of your parents, ⁄ namesake of good courage, ⁄ for you were promised to them by God as a gift before birth.
ltx/en_us_oca/me.m01.d20:meMA.Ode1C12.incipit	The Church chants a hymn…
ltx/en_us_oca/me.m01.d20:meMA.Ode1C12.melody	@ltx/en_us_oca/he.h.m4:heHE.OukEstiSoiOmoios.notmetered
ltx/en_us_oca/me.m01.d20:meMA.Ode1C12.mode	@ltx/en_us_oca/miscellanea:misc.Mode4
ltx/en_us_oca/me.m01.d20:meMA.Ode1C12.ode	@ltx/en_us_oca/miscellanea:misc.Ode1
ltx/en_us_oca/me.m01.d20:meMA.Ode1C12.text	The Church chants a hymn of thanksgiving, venerable one, ⁄ having received you from God as foretold, ⁄ an offspring of peaceful and goodly courage!
ltx/en_us_oca/me.m01.d20:meMA.Ode1C1H.greekmelody	@ltx/en_us_oca/he.h.m4:heHE.OukEstiSoiOmoios.greekname
ltx/en_us_oca/me.m01.d20:meMA.Ode1C1H.incipit	@ltx/en_us_oca/he.h.m4:heHE.OukEstiSoiOmoios.incipit
ltx/en_us_oca/me.m01.d20:meMA.Ode1C1H.melody	@ltx/en_us_oca/he.h.m4:heHE.OukEstiSoiOmoios.melody
ltx/en_us_oca/me.m01.d20:meMA.Ode1C1H.mode	@ltx/en_us_oca/miscellanea:misc.Mode4
ltx/en_us_oca/me.m01.d20:meMA.Ode1C1H.ode	@ltx/en_us_oca/miscellanea:misc.Ode1
ltx/en_us_oca/me.m01.d20:meMA.Ode1C1H.text	@ltx/en_us_oca/he.h.m4:heHE.OukEstiSoiOmoios.text
ltx/en_us_oca/me.m01.d20:meMA.Ode1C21.greekmelody	@ltx/en_us_oca/he.h.m8:heHE.ArmatilatinFarao.greekname
ltx/en_us_oca/me.m01.d20:meMA.Ode1C21.incipit	Beseech God with your prayers…
ltx/en_us_oca/me.m01.d20:meMA.Ode1C21.melody	@ltx/en_us_oca/he.h.m8:heHE.ArmatilatinFarao.notmetered
ltx/en_us_oca/me.m01.d20:meMA.Ode1C21.mode	@ltx/en_us_oca/miscellanea:misc.Mode8
ltx/en_us_oca/me.m01.d20:meMA.Ode1C21.ode	@ltx/en_us_oca/miscellanea:misc.Ode1
ltx/en_us_oca/me.m01.d20:meMA.Ode1C21.text	Beseech God with your prayers and entreaties, most blessed one, ⁄ dispel the gloomy cloud of my despondency, ⁄ for you are full of good cheer and consolation ⁄ as you stand before the King of all!
ltx/en_us_oca/me.m01.d20:meMA.Ode1C22.incipit	Even before you were conceived…
ltx/en_us_oca/me.m01.d20:meMA.Ode1C22.melody	@ltx/en_us_oca/he.h.m8:heHE.ArmatilatinFarao.notmetered
ltx/en_us_oca/me.m01.d20:meMA.Ode1C22.mode	@ltx/en_us_oca/miscellanea:misc.Mode8
ltx/en_us_oca/me.m01.d20:meMA.Ode1C22.ode	@ltx/en_us_oca/miscellanea:misc.Ode1
ltx/en_us_oca/me.m01.d20:meMA.Ode1C22.text	Even before you were conceived, venerable Father, ⁄ you were promised and given by God like a new Samuel. ⁄ You have been revealed to all the Churches by the splendor of your good courage, ⁄ in accordance with your name.
ltx/en_us_oca/me.m01.d20:meMA.Ode1C23.incipit	Having made supplication and entreaty…
ltx/en_us_oca/me.m01.d20:meMA.Ode1C23.melody	@ltx/en_us_oca/he.h.m8:heHE.ArmatilatinFarao.notmetered
ltx/en_us_oca/me.m01.d20:meMA.Ode1C23.mode	@ltx/en_us_oca/miscellanea:misc.Mode8
ltx/en_us_oca/me.m01.d20:meMA.Ode1C23.ode	@ltx/en_us_oca/miscellanea:misc.Ode1
ltx/en_us_oca/me.m01.d20:meMA.Ode1C23.text	Having made supplication and entreaty to God, ⁄ your parents received you as a divine gift and radiant child. ⁄ By your birth you declare the splendor of devotion ⁄ and the denunciation of heresy.
ltx/en_us_oca/me.m01.d20:meMA.Ode1C24.incipit	From childhood you were dedicated…
ltx/en_us_oca/me.m01.d20:meMA.Ode1C24.melody	@ltx/en_us_oca/he.h.m8:heHE.ArmatilatinFarao.notmetered
ltx/en_us_oca/me.m01.d20:meMA.Ode1C24.mode	@ltx/en_us_oca/miscellanea:misc.Mode8
ltx/en_us_oca/me.m01.d20:meMA.Ode1C24.ode	@ltx/en_us_oca/miscellanea:misc.Ode1
ltx/en_us_oca/me.m01.d20:meMA.Ode1C24.text	From childhood you were dedicated to God ⁄ Who had given you life, venerable one. ⁄ You looked to Him and were guided by His life-creating precepts. ⁄ By faith, you ascended, God-bearer, to the highest summit of the virtues.
ltx/en_us_oca/me.m01.d20:meMA.Ode1C2T.incipit	Having you as our intercessor…
ltx/en_us_oca/me.m01.d20:meMA.Ode1C2T.melody	@ltx/en_us_oca/he.h.m8:heHE.ArmatilatinFarao.notmetered
ltx/en_us_oca/me.m01.d20:meMA.Ode1C2T.mode	@ltx/en_us_oca/miscellanea:misc.Mode8
ltx/en_us_oca/me.m01.d20:meMA.Ode1C2T.ode	@ltx/en_us_oca/miscellanea:misc.Ode1
ltx/en_us_oca/me.m01.d20:meMA.Ode1C2T.text	Having you as our intercessor, Mother of God, ⁄ we do not fear the hordes of the enemy ⁄ which attack those who glorify the God and Lord of all who was born of you. ⁄ Entreat Him on our behalf.
ltx/en_us_oca/me.m01.d20:meMA.Ode3C11.greekmelody	@ltx/en_us_oca/he.h.m4:heHE.OukEnSofia.greekname
ltx/en_us_oca/me.m01.d20:meMA.Ode3C11.incipit	Emulating Hannah, she who gave…
ltx/en_us_oca/me.m01.d20:meMA.Ode3C11.melody	@ltx/en_us_oca/he.h.m4:heHE.OukEnSofia.notmetered
ltx/en_us_oca/me.m01.d20:meMA.Ode3C11.mode	@ltx/en_us_oca/miscellanea:misc.Mode4
ltx/en_us_oca/me.m01.d20:meMA.Ode3C11.ode	@ltx/en_us_oca/miscellanea:misc.Ode3
ltx/en_us_oca/me.m01.d20:meMA.Ode3C11.text	Emulating Hannah, she who gave you birth, ⁄ brought you, like the venerable Samuel of old, ⁄ as a living sacrifice to God, ⁄ Who glorified you even before you were conceived!
ltx/en_us_oca/me.m01.d20:meMA.Ode3C12.incipit	Burning with fruitful love for…
ltx/en_us_oca/me.m01.d20:meMA.Ode3C12.melody	@ltx/en_us_oca/he.h.m4:heHE.OukEnSofia.notmetered
ltx/en_us_oca/me.m01.d20:meMA.Ode3C12.mode	@ltx/en_us_oca/miscellanea:misc.Mode4
ltx/en_us_oca/me.m01.d20:meMA.Ode3C12.ode	@ltx/en_us_oca/miscellanea:misc.Ode3
ltx/en_us_oca/me.m01.d20:meMA.Ode3C12.text	Burning with fruitful love for God, venerable one, ⁄ you mastered the passions with devoted resolve. ⁄ Therefore the grace of God rested upon you!
ltx/en_us_oca/me.m01.d20:meMA.Ode3C1H.greekmelody	@ltx/en_us_oca/he.h.m4:heHE.OukEnSofia.greekname
ltx/en_us_oca/me.m01.d20:meMA.Ode3C1H.incipit	@ltx/en_us_oca/he.h.m4:heHE.OukEnSofia.incipit
ltx/en_us_oca/me.m01.d20:meMA.Ode3C1H.melody	@ltx/en_us_oca/he.h.m4:heHE.OukEnSofia.melody
ltx/en_us_oca/me.m01.d20:meMA.Ode3C1H.mode	@ltx/en_us_oca/miscellanea:misc.Mode4
ltx/en_us_oca/me.m01.d20:meMA.Ode3C1H.ode	@ltx/en_us_oca/miscellanea:misc.Ode3
ltx/en_us_oca/me.m01.d20:meMA.Ode3C1H.text	@ltx/en_us_oca/he.h.m4:heHE.OukEnSofia.text
ltx/en_us_oca/me.m01.d20:meMA.Ode3C21.greekmelody	@ltx/en_us_oca/he.h.m8:heHE.OStereosasKatArchas.greekname
ltx/en_us_oca/me.m01.d20:meMA.Ode3C21.incipit	Born of a barren woman…
ltx/en_us_oca/me.m01.d20:meMA.Ode3C21.melody	@ltx/en_us_oca/he.h.m8:heHE.OStereosasKatArchas.notmetered
ltx/en_us_oca/me.m01.d20:meMA.Ode3C21.mode	@ltx/en_us_oca/miscellanea:misc.Mode8
ltx/en_us_oca/me.m01.d20:meMA.Ode3C21.ode	@ltx/en_us_oca/miscellanea:misc.Ode3
ltx/en_us_oca/me.m01.d20:meMA.Ode3C21.text	Born of a barren woman, you were revealed, venerable one, ⁄ to be a most skillful husbandman of spiritual fertility, ⁄ cutting down the weeds of impiety ⁄ and scattering the seeds of devotion.
ltx/en_us_oca/me.m01.d20:meMA.Ode3C22.incipit	As a holy minister of…
ltx/en_us_oca/me.m01.d20:meMA.Ode3C22.melody	@ltx/en_us_oca/he.h.m8:heHE.OStereosasKatArchas.notmetered
ltx/en_us_oca/me.m01.d20:meMA.Ode3C22.mode	@ltx/en_us_oca/miscellanea:misc.Mode8
ltx/en_us_oca/me.m01.d20:meMA.Ode3C22.ode	@ltx/en_us_oca/miscellanea:misc.Ode3
ltx/en_us_oca/me.m01.d20:meMA.Ode3C22.text	As a holy minister of supernatural and mystic visions, ⁄ by your teachings, God-bearing Father, ⁄ you divinely led unbelievers to Christ ⁄ as believers instructed in higher things.
ltx/en_us_oca/me.m01.d20:meMA.Ode3C23.incipit	You mortified the flesh with…
ltx/en_us_oca/me.m01.d20:meMA.Ode3C23.melody	@ltx/en_us_oca/he.h.m8:heHE.OStereosasKatArchas.notmetered
ltx/en_us_oca/me.m01.d20:meMA.Ode3C23.mode	@ltx/en_us_oca/miscellanea:misc.Mode8
ltx/en_us_oca/me.m01.d20:meMA.Ode3C23.ode	@ltx/en_us_oca/miscellanea:misc.Ode3
ltx/en_us_oca/me.m01.d20:meMA.Ode3C23.text	You mortified the flesh with extreme abstinence, Euthymius, ⁄ holding fast to the thought of chastity and devotion. ⁄ You at once preferred everlasting life and sweetness ⁄ to things which are passing and corruptible.
ltx/en_us_oca/me.m01.d20:meMA.Ode3C24.incipit	You eluded the fiery pursuit…
ltx/en_us_oca/me.m01.d20:meMA.Ode3C24.melody	@ltx/en_us_oca/he.h.m8:heHE.OStereosasKatArchas.notmetered
ltx/en_us_oca/me.m01.d20:meMA.Ode3C24.mode	@ltx/en_us_oca/miscellanea:misc.Mode8
ltx/en_us_oca/me.m01.d20:meMA.Ode3C24.ode	@ltx/en_us_oca/miscellanea:misc.Ode3
ltx/en_us_oca/me.m01.d20:meMA.Ode3C24.text	You eluded the fiery pursuit of the demons ⁄ by a soul aflame and wounded with the love of Christ. ⁄ You were illumined with dew-bearing grace, Father, ⁄ becoming a bearer of the sign of the Cross.
ltx/en_us_oca/me.m01.d20:meMA.Ode3C2T.incipit	You sealed the sayings of…
ltx/en_us_oca/me.m01.d20:meMA.Ode3C2T.melody	@ltx/en_us_oca/he.h.m8:heHE.OStereosasKatArchas.notmetered
ltx/en_us_oca/me.m01.d20:meMA.Ode3C2T.mode	@ltx/en_us_oca/miscellanea:misc.Mode8
ltx/en_us_oca/me.m01.d20:meMA.Ode3C2T.ode	@ltx/en_us_oca/miscellanea:misc.Ode3
ltx/en_us_oca/me.m01.d20:meMA.Ode3C2T.text	You sealed the sayings of the prophets of God and their prophecies; ⁄ you fulfilled all their divine words, ⁄ blessed and all pure one!
ltx/en_us_oca/me.m01.d20:meMA.Ode3Kathisma1.greekmelody	@ltx/en_us_oca/he.a.m8:heAU.TinSofianKaiLogon.greekname
ltx/en_us_oca/me.m01.d20:meMA.Ode3Kathisma1.incipit	You spiritually filled the lamp…
ltx/en_us_oca/me.m01.d20:meMA.Ode3Kathisma1.melody	@ltx/en_us_oca/he.a.m8:heAU.TinSofianKaiLogon.notmetered
ltx/en_us_oca/me.m01.d20:meMA.Ode3Kathisma1.mode	@ltx/en_us_oca/miscellanea:misc.Mode8
ltx/en_us_oca/me.m01.d20:meMA.Ode3Kathisma1.text	You spiritually filled the lamp of your soul with the oil of abstinence, ⁄ desiring the ever-radiant coming of your bridegroom, venerable one. ⁄ you kept watch with vigilant prayers, living in His bridal chamber. ⁄ therefore, blessed one, you have fittingly received true sweetness ⁄ and the ever-living ability to perform miracles. ⁄ God-bearing Euthymius, entreat Christ God that He may grant remission of sins ⁄⁄ to those who celebrate your holy memory with love!
ltx/en_us_oca/me.m01.d20:meMA.Ode3KathismaT.incipit	Mistress, I fittingly offer you…
ltx/en_us_oca/me.m01.d20:meMA.Ode3KathismaT.melody	@ltx/en_us_oca/he.a.m8:heAU.TinSofianKaiLogon.notmetered
ltx/en_us_oca/me.m01.d20:meMA.Ode3KathismaT.mode	@ltx/en_us_oca/miscellanea:misc.Mode8
ltx/en_us_oca/me.m01.d20:meMA.Ode3KathismaT.text	Mistress, I fittingly offer you, like the widow’s two mites, ⁄ thankful praise for all your blessings, ⁄ for you have been shown to be my protection and help, ⁄ ever saving me from perils and tribulations. ⁄ therefore, delivered from oppressors as from the midst of the fiery furnace, ⁄ I cry out to you from the depths of my heart: ⁄ help me, Theotokos, by entreating Christ God ⁄ that He may grant me remission of my sins, ⁄⁄ for I, your servant, have you as my hope!
ltx/en_us_oca/me.m01.d20:meMA.Ode4C11.greekmelody	@ltx/en_us_oca/he.h.m4:heHE.EklinasChriste.greekname
ltx/en_us_oca/me.m01.d20:meMA.Ode4C11.incipit	You preserved your thought unchanged:…
ltx/en_us_oca/me.m01.d20:meMA.Ode4C11.melody	@ltx/en_us_oca/he.h.m4:heHE.EklinasChriste.notmetered
ltx/en_us_oca/me.m01.d20:meMA.Ode4C11.mode	@ltx/en_us_oca/miscellanea:misc.Mode4
ltx/en_us_oca/me.m01.d20:meMA.Ode4C11.ode	@ltx/en_us_oca/miscellanea:misc.Ode4
ltx/en_us_oca/me.m01.d20:meMA.Ode4C11.text	You preserved your thought unchanged: ⁄ from earliest childhood you showed your ascent to God by your way of life. ⁄ Drawing near to Him, you went from strength to strength!
ltx/en_us_oca/me.m01.d20:meMA.Ode4C12.incipit	As a pilgrim to the…
ltx/en_us_oca/me.m01.d20:meMA.Ode4C12.melody	@ltx/en_us_oca/he.h.m4:heHE.EklinasChriste.notmetered
ltx/en_us_oca/me.m01.d20:meMA.Ode4C12.mode	@ltx/en_us_oca/miscellanea:misc.Mode4
ltx/en_us_oca/me.m01.d20:meMA.Ode4C12.ode	@ltx/en_us_oca/miscellanea:misc.Ode4
ltx/en_us_oca/me.m01.d20:meMA.Ode4C12.text	As a pilgrim to the city which received God, ⁄ you desired the humility of Christ. ⁄ You were crucified in spirit with Him ⁄ Who suffered on the Cross for your sake.
ltx/en_us_oca/me.m01.d20:meMA.Ode4C13.incipit	It was your desire to…
ltx/en_us_oca/me.m01.d20:meMA.Ode4C13.melody	@ltx/en_us_oca/he.h.m4:heHE.EklinasChriste.notmetered
ltx/en_us_oca/me.m01.d20:meMA.Ode4C13.mode	@ltx/en_us_oca/miscellanea:misc.Mode4
ltx/en_us_oca/me.m01.d20:meMA.Ode4C13.ode	@ltx/en_us_oca/miscellanea:misc.Ode4
ltx/en_us_oca/me.m01.d20:meMA.Ode4C13.text	It was your desire to contend fairly, ⁄ so you stripped off your life, and naked, ⁄ you wrestled like Christ against the enemy. ⁄ You raised high in the desert the trophy of victory!
ltx/en_us_oca/me.m01.d20:meMA.Ode4C1H.greekmelody	@ltx/en_us_oca/he.h.m4:heHE.EklinasChriste.greekname
ltx/en_us_oca/me.m01.d20:meMA.Ode4C1H.incipit	@ltx/en_us_oca/he.h.m4:heHE.EklinasChriste.incipit
ltx/en_us_oca/me.m01.d20:meMA.Ode4C1H.melody	@ltx/en_us_oca/he.h.m4:heHE.EklinasChriste.melody
ltx/en_us_oca/me.m01.d20:meMA.Ode4C1H.mode	@ltx/en_us_oca/miscellanea:misc.Mode4
ltx/en_us_oca/me.m01.d20:meMA.Ode4C1H.ode	@ltx/en_us_oca/miscellanea:misc.Ode4
ltx/en_us_oca/me.m01.d20:meMA.Ode4C1H.text	@ltx/en_us_oca/he.h.m4:heHE.EklinasChriste.text
ltx/en_us_oca/me.m01.d20:meMA.Ode4C21.greekmelody	@ltx/en_us_oca/he.h.m8:heHE.SyMouIschys.greekname
ltx/en_us_oca/me.m01.d20:meMA.Ode4C21.incipit	Desiring unfading glory, Father, ⁄…
ltx/en_us_oca/me.m01.d20:meMA.Ode4C21.melody	@ltx/en_us_oca/he.h.m8:heHE.SyMouIschys.notmetered
ltx/en_us_oca/me.m01.d20:meMA.Ode4C21.mode	@ltx/en_us_oca/miscellanea:misc.Mode8
ltx/en_us_oca/me.m01.d20:meMA.Ode4C21.ode	@ltx/en_us_oca/miscellanea:misc.Ode4
ltx/en_us_oca/me.m01.d20:meMA.Ode4C21.text	Desiring unfading glory, Father, ⁄ you consecrated yourself wholly to God. ⁄ By your blameless life, abstinence and splendor, ⁄ you hastened zealously to Him, ever crying out: ⁄ Glory to Your might, Lover of mankind!
ltx/en_us_oca/me.m01.d20:meMA.Ode4C22.incipit	Loving the Source of goodness…
ltx/en_us_oca/me.m01.d20:meMA.Ode4C22.melody	@ltx/en_us_oca/he.h.m8:heHE.SyMouIschys.notmetered
ltx/en_us_oca/me.m01.d20:meMA.Ode4C22.mode	@ltx/en_us_oca/miscellanea:misc.Mode8
ltx/en_us_oca/me.m01.d20:meMA.Ode4C22.ode	@ltx/en_us_oca/miscellanea:misc.Ode4
ltx/en_us_oca/me.m01.d20:meMA.Ode4C22.text	Loving the Source of goodness with all your strength, ⁄ you became, venerable one, a source of divine gifts for ascetics. ⁄ You healed those thirsting, for like Moses of old, ⁄ you caused springs to issue forth gloriously in the desert!
ltx/en_us_oca/me.m01.d20:meMA.Ode4C23.incipit	Emerging from the hidden recesses…
ltx/en_us_oca/me.m01.d20:meMA.Ode4C23.melody	@ltx/en_us_oca/he.h.m8:heHE.SyMouIschys.notmetered
ltx/en_us_oca/me.m01.d20:meMA.Ode4C23.mode	@ltx/en_us_oca/miscellanea:misc.Mode8
ltx/en_us_oca/me.m01.d20:meMA.Ode4C23.ode	@ltx/en_us_oca/miscellanea:misc.Ode4
ltx/en_us_oca/me.m01.d20:meMA.Ode4C23.text	Emerging from the hidden recesses of the Spirit, ⁄ you set free the children of the bondwoman Hagar, ⁄ regenerating them as worthy children of God ⁄ by the baptism of adoption. ⁄ Emulating the life of the divine forerunner, ⁄ you were shown to be a Baptist, Euthymius.
ltx/en_us_oca/me.m01.d20:meMA.Ode4C24.incipit	Illumined with grace of God…
ltx/en_us_oca/me.m01.d20:meMA.Ode4C24.melody	@ltx/en_us_oca/he.h.m8:heHE.SyMouIschys.notmetered
ltx/en_us_oca/me.m01.d20:meMA.Ode4C24.mode	@ltx/en_us_oca/miscellanea:misc.Mode8
ltx/en_us_oca/me.m01.d20:meMA.Ode4C24.ode	@ltx/en_us_oca/miscellanea:misc.Ode4
ltx/en_us_oca/me.m01.d20:meMA.Ode4C24.text	Illumined with grace of God, Euthymius, ⁄ you were acknowledged even by the ignorant, ⁄ for indeed it did not befit your virtue ⁄ to hide and conceal yourself in the deserts. ⁄ Therefore the Master of creation has set you as a radiant lamp before all!
ltx/en_us_oca/me.m01.d20:meMA.Ode4C2T.incipit	Rejoice, O honored one! ⁄…
ltx/en_us_oca/me.m01.d20:meMA.Ode4C2T.melody	@ltx/en_us_oca/he.h.m8:heHE.SyMouIschys.notmetered
ltx/en_us_oca/me.m01.d20:meMA.Ode4C2T.mode	@ltx/en_us_oca/miscellanea:misc.Mode8
ltx/en_us_oca/me.m01.d20:meMA.Ode4C2T.ode	@ltx/en_us_oca/miscellanea:misc.Ode4
ltx/en_us_oca/me.m01.d20:meMA.Ode4C2T.text	Rejoice, O honored one! ⁄ Rejoice, most pure Virgin! ⁄ Rejoice, mountain overshadowed with grace! ⁄ Rejoice, tabernacle; rejoice, O ark! ⁄ Rejoice, candlestand who bore the divine Light! ⁄ For you have been the mediator of ineffable joy and gladness for the faithful!
ltx/en_us_oca/me.m01.d20:meMA.Ode5C11.greekmelody	@ltx/en_us_oca/he.h.m4:heHE.AseveisOukOpsontai.greekname
ltx/en_us_oca/me.m01.d20:meMA.Ode5C11.incipit	You submitted to the law…
ltx/en_us_oca/me.m01.d20:meMA.Ode5C11.melody	@ltx/en_us_oca/he.h.m4:heHE.AseveisOukOpsontai.notmetered
ltx/en_us_oca/me.m01.d20:meMA.Ode5C11.mode	@ltx/en_us_oca/miscellanea:misc.Mode4
ltx/en_us_oca/me.m01.d20:meMA.Ode5C11.ode	@ltx/en_us_oca/miscellanea:misc.Ode5
ltx/en_us_oca/me.m01.d20:meMA.Ode5C11.text	You submitted to the law of God, ⁄ for you used your body like a spiritual weapon, God-bearer, ⁄ making the wisdom of your flesh subject to your spirit.
ltx/en_us_oca/me.m01.d20:meMA.Ode5C12.incipit	You completed the course of…
ltx/en_us_oca/me.m01.d20:meMA.Ode5C12.melody	@ltx/en_us_oca/he.h.m4:heHE.AseveisOukOpsontai.notmetered
ltx/en_us_oca/me.m01.d20:meMA.Ode5C12.mode	@ltx/en_us_oca/miscellanea:misc.Mode4
ltx/en_us_oca/me.m01.d20:meMA.Ode5C12.ode	@ltx/en_us_oca/miscellanea:misc.Ode5
ltx/en_us_oca/me.m01.d20:meMA.Ode5C12.text	You completed the course of this life in gladness ⁄ and conceiving the fear of God within yourself, ⁄ you gave birth to salvation for those who were lost, ⁄ shining like a sun, though hidden by the desert.
ltx/en_us_oca/me.m01.d20:meMA.Ode5C1H.greekmelody	@ltx/en_us_oca/he.h.m4:heHE.AseveisOukOpsontai.greekname
ltx/en_us_oca/me.m01.d20:meMA.Ode5C1H.incipit	@ltx/en_us_oca/he.h.m4:heHE.AseveisOukOpsontai.incipit
ltx/en_us_oca/me.m01.d20:meMA.Ode5C1H.melody	@ltx/en_us_oca/he.h.m4:heHE.AseveisOukOpsontai.melody
ltx/en_us_oca/me.m01.d20:meMA.Ode5C1H.mode	@ltx/en_us_oca/miscellanea:misc.Mode4
ltx/en_us_oca/me.m01.d20:meMA.Ode5C1H.ode	@ltx/en_us_oca/miscellanea:misc.Ode5
ltx/en_us_oca/me.m01.d20:meMA.Ode5C1H.text	@ltx/en_us_oca/he.h.m4:heHE.AseveisOukOpsontai.text
ltx/en_us_oca/me.m01.d20:meMA.Ode5C21.greekmelody	@ltx/en_us_oca/he.h.m8:heHE.InaTiMeAposo.greekname
ltx/en_us_oca/me.m01.d20:meMA.Ode5C21.incipit	Revealed as a pillar of…
ltx/en_us_oca/me.m01.d20:meMA.Ode5C21.melody	@ltx/en_us_oca/he.h.m8:heHE.InaTiMeAposo.notmetered
ltx/en_us_oca/me.m01.d20:meMA.Ode5C21.mode	@ltx/en_us_oca/miscellanea:misc.Mode8
ltx/en_us_oca/me.m01.d20:meMA.Ode5C21.ode	@ltx/en_us_oca/miscellanea:misc.Ode5
ltx/en_us_oca/me.m01.d20:meMA.Ode5C21.text	Revealed as a pillar of fire and cloud by the radiance of the Spirit, ⁄ you went in advance of the pious ascetics, Euthymius, ⁄ leading them towards the heavenly path and unperishing delight, ⁄ guiding them, Father, to the heights of heaven!
ltx/en_us_oca/me.m01.d20:meMA.Ode5C22.incipit	Christ has given you to…
ltx/en_us_oca/me.m01.d20:meMA.Ode5C22.melody	@ltx/en_us_oca/he.h.m8:heHE.InaTiMeAposo.notmetered
ltx/en_us_oca/me.m01.d20:meMA.Ode5C22.mode	@ltx/en_us_oca/miscellanea:misc.Mode8
ltx/en_us_oca/me.m01.d20:meMA.Ode5C22.ode	@ltx/en_us_oca/miscellanea:misc.Ode5
ltx/en_us_oca/me.m01.d20:meMA.Ode5C22.text	Christ has given you to the world, Father, ⁄ as an exceedingly merciful physician of the sick, ⁄ an all-glorious feeder of the hungry, ⁄ an instructor of the ignorant, ⁄ a chastiser of the mindless ⁄ and a helper of the poor and orphans.
ltx/en_us_oca/me.m01.d20:meMA.Ode5C23.incipit	You were compassionate and merciful…
ltx/en_us_oca/me.m01.d20:meMA.Ode5C23.melody	@ltx/en_us_oca/he.h.m8:heHE.InaTiMeAposo.notmetered
ltx/en_us_oca/me.m01.d20:meMA.Ode5C23.mode	@ltx/en_us_oca/miscellanea:misc.Mode8
ltx/en_us_oca/me.m01.d20:meMA.Ode5C23.ode	@ltx/en_us_oca/miscellanea:misc.Ode5
ltx/en_us_oca/me.m01.d20:meMA.Ode5C23.text	You were compassionate and merciful, Father, ⁄ possessing a character humble in mind, ⁄ cutting off the roots of the passions with divine teachings, ⁄ enlightening and instructing your disciples ⁄ and healing the afflictions of human souls.
ltx/en_us_oca/me.m01.d20:meMA.Ode5C24.incipit	You have enlightened all, sending…
ltx/en_us_oca/me.m01.d20:meMA.Ode5C24.melody	@ltx/en_us_oca/he.h.m8:heHE.InaTiMeAposo.notmetered
ltx/en_us_oca/me.m01.d20:meMA.Ode5C24.mode	@ltx/en_us_oca/miscellanea:misc.Mode8
ltx/en_us_oca/me.m01.d20:meMA.Ode5C24.ode	@ltx/en_us_oca/miscellanea:misc.Ode5
ltx/en_us_oca/me.m01.d20:meMA.Ode5C24.text	You have enlightened all, sending out rays of your miracles everywhere; ⁄ you have drawn all to your teachings like a magnet, ⁄ building up the talents and gifts of their souls, ⁄ surpassing all in your purity.
ltx/en_us_oca/me.m01.d20:meMA.Ode5C2T.incipit	We all proclaim you to…
ltx/en_us_oca/me.m01.d20:meMA.Ode5C2T.melody	@ltx/en_us_oca/he.h.m8:heHE.InaTiMeAposo.notmetered
ltx/en_us_oca/me.m01.d20:meMA.Ode5C2T.mode	@ltx/en_us_oca/miscellanea:misc.Mode8
ltx/en_us_oca/me.m01.d20:meMA.Ode5C2T.ode	@ltx/en_us_oca/miscellanea:misc.Ode5
ltx/en_us_oca/me.m01.d20:meMA.Ode5C2T.text	We all proclaim you to be the true Theotokos, blessed of God, ⁄ for we have been delivered from corruption by your childbearing ⁄ and recalled to a better life, ⁄ through the mercy and loving-kindness of our God!
ltx/en_us_oca/me.m01.d20:meMA.Ode6C11.greekmelody	@ltx/en_us_oca/he.h.m4:heHE.IlthonEisTaVathi.greekname
ltx/en_us_oca/me.m01.d20:meMA.Ode6C11.incipit	By your prayers, God-bearer…
ltx/en_us_oca/me.m01.d20:meMA.Ode6C11.melody	@ltx/en_us_oca/he.h.m4:heHE.IlthonEisTaVathi.notmetered
ltx/en_us_oca/me.m01.d20:meMA.Ode6C11.mode	@ltx/en_us_oca/miscellanea:misc.Mode4
ltx/en_us_oca/me.m01.d20:meMA.Ode6C11.ode	@ltx/en_us_oca/miscellanea:misc.Ode6
ltx/en_us_oca/me.m01.d20:meMA.Ode6C11.text	By your prayers, God-bearer, ⁄ break the yoke of our bondage, ⁄ having now through the washing of regeneration, ⁄ adopted the children of the bondwoman of old.
ltx/en_us_oca/me.m01.d20:meMA.Ode6C12.incipit	The grace of God, God-bearer…
ltx/en_us_oca/me.m01.d20:meMA.Ode6C12.melody	@ltx/en_us_oca/he.h.m4:heHE.IlthonEisTaVathi.notmetered
ltx/en_us_oca/me.m01.d20:meMA.Ode6C12.mode	@ltx/en_us_oca/miscellanea:misc.Mode4
ltx/en_us_oca/me.m01.d20:meMA.Ode6C12.ode	@ltx/en_us_oca/miscellanea:misc.Ode6
ltx/en_us_oca/me.m01.d20:meMA.Ode6C12.text	The grace of God, God-bearer, ⁄ which actively dwelt within you, ⁄ appointed you as an all-wise founder, ⁄ a chastiser of the mindless and expeller of evil spirits!
ltx/en_us_oca/me.m01.d20:meMA.Ode6C1H.greekmelody	@ltx/en_us_oca/he.h.m4:heHE.IlthonEisTaVathi.greekname
ltx/en_us_oca/me.m01.d20:meMA.Ode6C1H.incipit	@ltx/en_us_oca/he.h.m4:heHE.IlthonEisTaVathi.incipit
ltx/en_us_oca/me.m01.d20:meMA.Ode6C1H.melody	@ltx/en_us_oca/he.h.m4:heHE.IlthonEisTaVathi.melody
ltx/en_us_oca/me.m01.d20:meMA.Ode6C1H.mode	@ltx/en_us_oca/miscellanea:misc.Mode4
ltx/en_us_oca/me.m01.d20:meMA.Ode6C1H.ode	@ltx/en_us_oca/miscellanea:misc.Ode6
ltx/en_us_oca/me.m01.d20:meMA.Ode6C1H.text	@ltx/en_us_oca/he.h.m4:heHE.IlthonEisTaVathi.text
ltx/en_us_oca/me.m01.d20:meMA.Ode6C21.greekmelody	@ltx/en_us_oca/he.h.m8:heHE.IlasthitiMoiSotir.greekname
ltx/en_us_oca/me.m01.d20:meMA.Ode6C21.incipit	You received great authority from…
ltx/en_us_oca/me.m01.d20:meMA.Ode6C21.melody	@ltx/en_us_oca/he.h.m8:heHE.IlasthitiMoiSotir.notmetered
ltx/en_us_oca/me.m01.d20:meMA.Ode6C21.mode	@ltx/en_us_oca/miscellanea:misc.Mode8
ltx/en_us_oca/me.m01.d20:meMA.Ode6C21.ode	@ltx/en_us_oca/miscellanea:misc.Ode6
ltx/en_us_oca/me.m01.d20:meMA.Ode6C21.text	You received great authority from God, ⁄ driving away crowds of adverse demons, ⁄ healing the deformities of all who turn to you with faith.
ltx/en_us_oca/me.m01.d20:meMA.Ode6C22.incipit	You were truly blessed, venerable…
ltx/en_us_oca/me.m01.d20:meMA.Ode6C22.melody	@ltx/en_us_oca/he.h.m8:heHE.IlasthitiMoiSotir.notmetered
ltx/en_us_oca/me.m01.d20:meMA.Ode6C22.mode	@ltx/en_us_oca/miscellanea:misc.Mode8
ltx/en_us_oca/me.m01.d20:meMA.Ode6C22.ode	@ltx/en_us_oca/miscellanea:misc.Ode6
ltx/en_us_oca/me.m01.d20:meMA.Ode6C22.text	You were truly blessed, venerable Father Euthymius, ⁄ for you acquired enriching poverty and tears of joy. ⁄ Through these you inherited the kingdom of heaven.
ltx/en_us_oca/me.m01.d20:meMA.Ode6C23.incipit	You turned quickly from fading…
ltx/en_us_oca/me.m01.d20:meMA.Ode6C23.melody	@ltx/en_us_oca/he.h.m8:heHE.IlasthitiMoiSotir.notmetered
ltx/en_us_oca/me.m01.d20:meMA.Ode6C23.mode	@ltx/en_us_oca/miscellanea:misc.Mode8
ltx/en_us_oca/me.m01.d20:meMA.Ode6C23.ode	@ltx/en_us_oca/miscellanea:misc.Ode6
ltx/en_us_oca/me.m01.d20:meMA.Ode6C23.text	You turned quickly from fading honor and glory on earth, most blessed one, ⁄ and received everlasting life and incorruptible delight, ⁄ making your dwelling most gloriously in the mansions of heaven!
ltx/en_us_oca/me.m01.d20:meMA.Ode6C2T.incipit	We call you the Lady…
ltx/en_us_oca/me.m01.d20:meMA.Ode6C2T.melody	@ltx/en_us_oca/he.h.m8:heHE.IlasthitiMoiSotir.notmetered
ltx/en_us_oca/me.m01.d20:meMA.Ode6C2T.mode	@ltx/en_us_oca/miscellanea:misc.Mode8
ltx/en_us_oca/me.m01.d20:meMA.Ode6C2T.ode	@ltx/en_us_oca/miscellanea:misc.Ode6
ltx/en_us_oca/me.m01.d20:meMA.Ode6C2T.text	We call you the Lady and Mistress of all, ⁄ for indeed you ineffably gave birth to God ⁄ Who created, sustains and embraces all, most pure one.
ltx/en_us_oca/me.m01.d20:meMA.Ode7C11.greekmelody	@ltx/en_us_oca/he.h.m4:heHE.NeoiTreisEnVavyloni.greekname
ltx/en_us_oca/me.m01.d20:meMA.Ode7C11.incipit	You were seen within a…
ltx/en_us_oca/me.m01.d20:meMA.Ode7C11.melody	@ltx/en_us_oca/he.h.m4:heHE.NeoiTreisEnVavyloni.notmetered
ltx/en_us_oca/me.m01.d20:meMA.Ode7C11.mode	@ltx/en_us_oca/miscellanea:misc.Mode4
ltx/en_us_oca/me.m01.d20:meMA.Ode7C11.ode	@ltx/en_us_oca/miscellanea:misc.Ode7
ltx/en_us_oca/me.m01.d20:meMA.Ode7C11.text	You were seen within a cloud, Father, ⁄ enveloped by a supernatural fire. ⁄ You cried out, as a heavenly initiate of the mysteries of God: ⁄ Blessed are You, Lord God of our fathers!
ltx/en_us_oca/me.m01.d20:meMA.Ode7C12.incipit	The Creator of nature freely…
ltx/en_us_oca/me.m01.d20:meMA.Ode7C12.melody	@ltx/en_us_oca/he.h.m4:heHE.NeoiTreisEnVavyloni.notmetered
ltx/en_us_oca/me.m01.d20:meMA.Ode7C12.mode	@ltx/en_us_oca/miscellanea:misc.Mode4
ltx/en_us_oca/me.m01.d20:meMA.Ode7C12.ode	@ltx/en_us_oca/miscellanea:misc.Ode7
ltx/en_us_oca/me.m01.d20:meMA.Ode7C12.text	The Creator of nature freely gave you supernatural powers, O Father, ⁄ for as a divine initiate of the mysteries of heaven you cried out: ⁄ Blessed are You, Lord God of our fathers!
ltx/en_us_oca/me.m01.d20:meMA.Ode7C13.incipit	Worshipping the one Only-begotten, ⁄…
ltx/en_us_oca/me.m01.d20:meMA.Ode7C13.melody	@ltx/en_us_oca/he.h.m4:heHE.NeoiTreisEnVavyloni.notmetered
ltx/en_us_oca/me.m01.d20:meMA.Ode7C13.mode	@ltx/en_us_oca/miscellanea:misc.Mode4
ltx/en_us_oca/me.m01.d20:meMA.Ode7C13.ode	@ltx/en_us_oca/miscellanea:misc.Ode7
ltx/en_us_oca/me.m01.d20:meMA.Ode7C13.text	Worshipping the one Only-begotten, ⁄ One in two natures according to His divine incarnation, ⁄ you cried out, Euthymius: ⁄ Blessed are You, Lord God of our fathers!
ltx/en_us_oca/me.m01.d20:meMA.Ode7C1H.greekmelody	@ltx/en_us_oca/he.h.m4:heHE.NeoiTreisEnVavyloni.greekname
ltx/en_us_oca/me.m01.d20:meMA.Ode7C1H.incipit	@ltx/en_us_oca/he.h.m4:heHE.NeoiTreisEnVavyloni.incipit
ltx/en_us_oca/me.m01.d20:meMA.Ode7C1H.melody	@ltx/en_us_oca/he.h.m4:heHE.NeoiTreisEnVavyloni.melody
ltx/en_us_oca/me.m01.d20:meMA.Ode7C1H.mode	@ltx/en_us_oca/miscellanea:misc.Mode4
ltx/en_us_oca/me.m01.d20:meMA.Ode7C1H.ode	@ltx/en_us_oca/miscellanea:misc.Ode7
ltx/en_us_oca/me.m01.d20:meMA.Ode7C1H.text	@ltx/en_us_oca/he.h.m4:heHE.NeoiTreisEnVavyloni.text
ltx/en_us_oca/me.m01.d20:meMA.Ode7C21.greekmelody	@ltx/en_us_oca/he.h.m8:heHE.TheouSynkatavasin.greekname
ltx/en_us_oca/me.m01.d20:meMA.Ode7C21.incipit	You united yourself with the…
ltx/en_us_oca/me.m01.d20:meMA.Ode7C21.melody	@ltx/en_us_oca/he.h.m8:heHE.TheouSynkatavasin.notmetered
ltx/en_us_oca/me.m01.d20:meMA.Ode7C21.mode	@ltx/en_us_oca/miscellanea:misc.Mode8
ltx/en_us_oca/me.m01.d20:meMA.Ode7C21.ode	@ltx/en_us_oca/miscellanea:misc.Ode7
ltx/en_us_oca/me.m01.d20:meMA.Ode7C21.text	You united yourself with the bodiless ones through great abstinence. ⁄ You showed your life to be a trial of asceticism, Father Euthymius, ⁄ and an exercise in holiness as you cried out: ⁄ Blessed are You, Lord God of our fathers!
ltx/en_us_oca/me.m01.d20:meMA.Ode7C22.incipit	Christ showed you to be…
ltx/en_us_oca/me.m01.d20:meMA.Ode7C22.melody	@ltx/en_us_oca/he.h.m8:heHE.TheouSynkatavasin.notmetered
ltx/en_us_oca/me.m01.d20:meMA.Ode7C22.mode	@ltx/en_us_oca/miscellanea:misc.Mode8
ltx/en_us_oca/me.m01.d20:meMA.Ode7C22.ode	@ltx/en_us_oca/miscellanea:misc.Ode7
ltx/en_us_oca/me.m01.d20:meMA.Ode7C22.text	Christ showed you to be a two-edged sword ⁄ cutting down hordes of the demons ⁄ and piercing the hearts of the enemy. ⁄ But you rejoice the souls of those who chant: ⁄ Blessed is the God of our fathers!
ltx/en_us_oca/me.m01.d20:meMA.Ode7C23.incipit	Filled with the light of…
ltx/en_us_oca/me.m01.d20:meMA.Ode7C23.melody	@ltx/en_us_oca/he.h.m8:heHE.TheouSynkatavasin.notmetered
ltx/en_us_oca/me.m01.d20:meMA.Ode7C23.mode	@ltx/en_us_oca/miscellanea:misc.Mode8
ltx/en_us_oca/me.m01.d20:meMA.Ode7C23.ode	@ltx/en_us_oca/miscellanea:misc.Ode7
ltx/en_us_oca/me.m01.d20:meMA.Ode7C23.text	Filled with the light of the threefold Sun, Father Euthymius, ⁄ you were shown through communion to be a secondary light ⁄ reflecting the first Light and shedding rays on those who chant: ⁄ Blessed is the God of our fathers!
ltx/en_us_oca/me.m01.d20:meMA.Ode7C2T.incipit	You shone like the dawn…
ltx/en_us_oca/me.m01.d20:meMA.Ode7C2T.melody	@ltx/en_us_oca/he.h.m8:heHE.TheouSynkatavasin.notmetered
ltx/en_us_oca/me.m01.d20:meMA.Ode7C2T.mode	@ltx/en_us_oca/miscellanea:misc.Mode8
ltx/en_us_oca/me.m01.d20:meMA.Ode7C2T.ode	@ltx/en_us_oca/miscellanea:misc.Ode7
ltx/en_us_oca/me.m01.d20:meMA.Ode7C2T.text	You shone like the dawn, for you had within you the Sun of righteousness, ⁄ Who cleanses the world from the darkness of ignorance ⁄ with the radiance of divine knowledge. ⁄ Let us sing to Him: ⁄ Blessed is the God of our fathers!
ltx/en_us_oca/me.m01.d20:meMA.Ode8C11.greekmelody	@ltx/en_us_oca/he.h.m4:heHE.PaidasEvageis.greekname
ltx/en_us_oca/me.m01.d20:meMA.Ode8C11.incipit	You dedicated yourself to God…
ltx/en_us_oca/me.m01.d20:meMA.Ode8C11.melody	@ltx/en_us_oca/he.h.m4:heHE.PaidasEvageis.notmetered
ltx/en_us_oca/me.m01.d20:meMA.Ode8C11.mode	@ltx/en_us_oca/miscellanea:misc.Mode4
ltx/en_us_oca/me.m01.d20:meMA.Ode8C11.ode	@ltx/en_us_oca/miscellanea:misc.Ode8
ltx/en_us_oca/me.m01.d20:meMA.Ode8C11.text	You dedicated yourself to God ⁄ and kindled the furnace of the conscience, Euthymius. ⁄ You rejoiced as you set fire to your whole self; ⁄ to your life as an unblemished sacrifice, chanting to Christ: ⁄ Bless the Lord, all works of the Lord ⁄ and exalt Him above all forever!
ltx/en_us_oca/me.m01.d20:meMA.Ode8C12.incipit	You became a Son by…
ltx/en_us_oca/me.m01.d20:meMA.Ode8C12.melody	@ltx/en_us_oca/he.h.m4:heHE.PaidasEvageis.notmetered
ltx/en_us_oca/me.m01.d20:meMA.Ode8C12.mode	@ltx/en_us_oca/miscellanea:misc.Mode4
ltx/en_us_oca/me.m01.d20:meMA.Ode8C12.ode	@ltx/en_us_oca/miscellanea:misc.Ode8
ltx/en_us_oca/me.m01.d20:meMA.Ode8C12.text	You became a Son by adoption through the grace of God; ⁄ as an inheritance you received knowledge of things to come, ⁄ for mastering your nature, by foreknowledge you transcended nature, ⁄ hastening to fulfillment, Euthymius. ⁄ Bless the Lord, all works of the Lord ⁄ and exalt Him above all forever!
ltx/en_us_oca/me.m01.d20:meMA.Ode8C1H.greekmelody	@ltx/en_us_oca/he.h.m4:heHE.PaidasEvageis.greekname
ltx/en_us_oca/me.m01.d20:meMA.Ode8C1H.incipit	@ltx/en_us_oca/he.h.m4:heHE.PaidasEvageis.incipit
ltx/en_us_oca/me.m01.d20:meMA.Ode8C1H.melody	@ltx/en_us_oca/he.h.m4:heHE.PaidasEvageis.melody
ltx/en_us_oca/me.m01.d20:meMA.Ode8C1H.mode	@ltx/en_us_oca/miscellanea:misc.Mode4
ltx/en_us_oca/me.m01.d20:meMA.Ode8C1H.ode	@ltx/en_us_oca/miscellanea:misc.Ode8
ltx/en_us_oca/me.m01.d20:meMA.Ode8C1H.text	@ltx/en_us_oca/he.h.m4:heHE.PaidasEvageis.text
ltx/en_us_oca/me.m01.d20:meMA.Ode8C21.greekmelody	@ltx/en_us_oca/he.h.m8:heHE.EptaplasiosKaminon.greekname
ltx/en_us_oca/me.m01.d20:meMA.Ode8C21.incipit	You acquired a most powerful…
ltx/en_us_oca/me.m01.d20:meMA.Ode8C21.melody	@ltx/en_us_oca/he.h.m8:heHE.EptaplasiosKaminon.notmetered
ltx/en_us_oca/me.m01.d20:meMA.Ode8C21.mode	@ltx/en_us_oca/miscellanea:misc.Mode8
ltx/en_us_oca/me.m01.d20:meMA.Ode8C21.ode	@ltx/en_us_oca/miscellanea:misc.Ode8
ltx/en_us_oca/me.m01.d20:meMA.Ode8C21.text	You acquired a most powerful way of life, most blessed one, ⁄ attaining the most exalted vision. ⁄ You became a vessel containing the life-creating Spirit ⁄ and the gifts that richly flow from Him. ⁄ You chant without ceasing: ⁄ People, exalt Him above all forever!
ltx/en_us_oca/me.m01.d20:meMA.Ode8C22.incipit	Moving your dwelling, you reached…
ltx/en_us_oca/me.m01.d20:meMA.Ode8C22.melody	@ltx/en_us_oca/he.h.m8:heHE.EptaplasiosKaminon.notmetered
ltx/en_us_oca/me.m01.d20:meMA.Ode8C22.mode	@ltx/en_us_oca/miscellanea:misc.Mode8
ltx/en_us_oca/me.m01.d20:meMA.Ode8C22.ode	@ltx/en_us_oca/miscellanea:misc.Ode8
ltx/en_us_oca/me.m01.d20:meMA.Ode8C22.text	Moving your dwelling, you reached the outer limits of Zion; ⁄ you attained the everlasting mansions. ⁄ Through your pains, you received a heavenly inheritance. ⁄ Now you chant with the angelic choirs: ⁄ Bless Him, children, praise Him, priests; ⁄ People, exalt Him above all forever!
ltx/en_us_oca/me.m01.d20:meMA.Ode8C23.incipit	You were as radiant as…
ltx/en_us_oca/me.m01.d20:meMA.Ode8C23.melody	@ltx/en_us_oca/he.h.m8:heHE.EptaplasiosKaminon.notmetered
ltx/en_us_oca/me.m01.d20:meMA.Ode8C23.mode	@ltx/en_us_oca/miscellanea:misc.Mode8
ltx/en_us_oca/me.m01.d20:meMA.Ode8C23.ode	@ltx/en_us_oca/miscellanea:misc.Ode8
ltx/en_us_oca/me.m01.d20:meMA.Ode8C23.text	You were as radiant as the sun, enlightening the desert places. ⁄ You expelled the darkness of demons ⁄ and became a most brilliant pillar reaching the heights of heaven, ⁄ shining with the radiance of miracles. ⁄ You cry out without ceasing to the Master: ⁄ Bless Him, children, praise Him, priests; ⁄ People, exalt Him above all forever!
ltx/en_us_oca/me.m01.d20:meMA.Ode8C24.incipit	Adorned with the most holy…
ltx/en_us_oca/me.m01.d20:meMA.Ode8C24.melody	@ltx/en_us_oca/he.h.m8:heHE.EptaplasiosKaminon.notmetered
ltx/en_us_oca/me.m01.d20:meMA.Ode8C24.mode	@ltx/en_us_oca/miscellanea:misc.Mode8
ltx/en_us_oca/me.m01.d20:meMA.Ode8C24.ode	@ltx/en_us_oca/miscellanea:misc.Ode8
ltx/en_us_oca/me.m01.d20:meMA.Ode8C24.text	Adorned with the most holy activities of your life, ⁄ you set aright the most basic virtue, ⁄ becoming radiant through the correctness of your teachings. ⁄ You were a reteller of true theology, every crying out: ⁄ Bless Him, children, praise Him, priests; ⁄ People, exalt Him above all forever!
ltx/en_us_oca/me.m01.d20:meMA.Ode8C2T.incipit	Most immaculate Bride of God…
ltx/en_us_oca/me.m01.d20:meMA.Ode8C2T.melody	@ltx/en_us_oca/he.h.m8:heHE.EptaplasiosKaminon.notmetered
ltx/en_us_oca/me.m01.d20:meMA.Ode8C2T.mode	@ltx/en_us_oca/miscellanea:misc.Mode8
ltx/en_us_oca/me.m01.d20:meMA.Ode8C2T.ode	@ltx/en_us_oca/miscellanea:misc.Ode8
ltx/en_us_oca/me.m01.d20:meMA.Ode8C2T.text	Most immaculate Bride of God, ⁄ rescue those who turn to you from slavery to the passions. ⁄ Grant full freedom, Mistress, to the Orthodox Churches who chant with faith: ⁄ Bless Him, children, praise Him, priests; ⁄ People, exalt Him above all forever!
ltx/en_us_oca/me.m01.d20:meMA.Ode9C11.greekmelody	@ltx/en_us_oca/he.h.m4:heHE.MetaTokonSeAgni.greekname
ltx/en_us_oca/me.m01.d20:meMA.Ode9C11.incipit	We find you reposing whole…
ltx/en_us_oca/me.m01.d20:meMA.Ode9C11.melody	@ltx/en_us_oca/he.h.m4:heHE.MetaTokonSeAgni.notmetered
ltx/en_us_oca/me.m01.d20:meMA.Ode9C11.mode	@ltx/en_us_oca/miscellanea:misc.Mode4
ltx/en_us_oca/me.m01.d20:meMA.Ode9C11.ode	@ltx/en_us_oca/miscellanea:misc.Ode9
ltx/en_us_oca/me.m01.d20:meMA.Ode9C11.text	We find you reposing whole in your shrine ⁄ and we bless you, venerable one, as a victorious athlete. ⁄ You were a source of healings even before your death!
ltx/en_us_oca/me.m01.d20:meMA.Ode9C12.incipit	He Who dwells in the…
ltx/en_us_oca/me.m01.d20:meMA.Ode9C12.melody	@ltx/en_us_oca/he.h.m4:heHE.MetaTokonSeAgni.notmetered
ltx/en_us_oca/me.m01.d20:meMA.Ode9C12.mode	@ltx/en_us_oca/miscellanea:misc.Mode4
ltx/en_us_oca/me.m01.d20:meMA.Ode9C12.ode	@ltx/en_us_oca/miscellanea:misc.Ode9
ltx/en_us_oca/me.m01.d20:meMA.Ode9C12.text	He Who dwells in the highest, venerable Father, ⁄ has made you an ally for those in authority against the enemies, ⁄ and for all of your flock against manifold temptations.
ltx/en_us_oca/me.m01.d20:meMA.Ode9C1H.greekmelody	@ltx/en_us_oca/he.h.m4:heHE.MetaTokonSeAgni.greekname
ltx/en_us_oca/me.m01.d20:meMA.Ode9C1H.incipit	@ltx/en_us_oca/he.h.m4:heHE.MetaTokonSeAgni.incipit
ltx/en_us_oca/me.m01.d20:meMA.Ode9C1H.melody	@ltx/en_us_oca/he.h.m4:heHE.MetaTokonSeAgni.melody
ltx/en_us_oca/me.m01.d20:meMA.Ode9C1H.mode	@ltx/en_us_oca/miscellanea:misc.Mode4
ltx/en_us_oca/me.m01.d20:meMA.Ode9C1H.ode	@ltx/en_us_oca/miscellanea:misc.Ode9
ltx/en_us_oca/me.m01.d20:meMA.Ode9C1H.text	@ltx/en_us_oca/he.h.m4:heHE.MetaTokonSeAgni.text
ltx/en_us_oca/me.m01.d20:meMA.Ode9C21.greekmelody	@ltx/en_us_oca/he.h.m8:heHE.ExestiEpiTouto.greekname
ltx/en_us_oca/me.m01.d20:meMA.Ode9C21.incipit	Christ told you of your…
ltx/en_us_oca/me.m01.d20:meMA.Ode9C21.melody	@ltx/en_us_oca/he.h.m8:heHE.ExestiEpiTouto.notmetered
ltx/en_us_oca/me.m01.d20:meMA.Ode9C21.mode	@ltx/en_us_oca/miscellanea:misc.Mode8
ltx/en_us_oca/me.m01.d20:meMA.Ode9C21.ode	@ltx/en_us_oca/miscellanea:misc.Ode9
ltx/en_us_oca/me.m01.d20:meMA.Ode9C21.text	Christ told you of your longed-for departure to Him, O Father, ⁄ as He did of old to Moses the God-seer, ⁄ whom you emulated through virtue. ⁄ You parted the sea of the passions ⁄ and passed over unhindered to the promised land, ⁄ conquering the enemy.
ltx/en_us_oca/me.m01.d20:meMA.Ode9C22.incipit	You reposed like Elijah the…
ltx/en_us_oca/me.m01.d20:meMA.Ode9C22.melody	@ltx/en_us_oca/he.h.m8:heHE.ExestiEpiTouto.notmetered
ltx/en_us_oca/me.m01.d20:meMA.Ode9C22.mode	@ltx/en_us_oca/miscellanea:misc.Mode8
ltx/en_us_oca/me.m01.d20:meMA.Ode9C22.ode	@ltx/en_us_oca/miscellanea:misc.Ode9
ltx/en_us_oca/me.m01.d20:meMA.Ode9C22.text	You reposed like Elijah the zealot, ⁄ ascending to the heavens on a chariot of the virtues, venerable one, ⁄ where your way of life was openly recorded. ⁄ Now as you stand before the Master, ⁄ remember those who celebrate your brilliant and holy memory with faith!
ltx/en_us_oca/me.m01.d20:meMA.Ode9C23.incipit	Your way of life was…
ltx/en_us_oca/me.m01.d20:meMA.Ode9C23.melody	@ltx/en_us_oca/he.h.m8:heHE.ExestiEpiTouto.notmetered
ltx/en_us_oca/me.m01.d20:meMA.Ode9C23.mode	@ltx/en_us_oca/miscellanea:misc.Mode8
ltx/en_us_oca/me.m01.d20:meMA.Ode9C23.ode	@ltx/en_us_oca/miscellanea:misc.Ode9
ltx/en_us_oca/me.m01.d20:meMA.Ode9C23.text	Your way of life was angelic and filled with light, ⁄ most blessed and divinely wise one. ⁄ Your soul was most radiantly godly and your faith devout, ⁄ for you were a reteller of divine teachings, God-bearer, ⁄ and were shown to be a preacher of Orthodox doctrine.
ltx/en_us_oca/me.m01.d20:meMA.Ode9C24.incipit	Made steadfast by your prayer…
ltx/en_us_oca/me.m01.d20:meMA.Ode9C24.melody	@ltx/en_us_oca/he.h.m8:heHE.ExestiEpiTouto.notmetered
ltx/en_us_oca/me.m01.d20:meMA.Ode9C24.mode	@ltx/en_us_oca/miscellanea:misc.Mode8
ltx/en_us_oca/me.m01.d20:meMA.Ode9C24.ode	@ltx/en_us_oca/miscellanea:misc.Ode9
ltx/en_us_oca/me.m01.d20:meMA.Ode9C24.text	Made steadfast by your prayer, divinely wise Father, ⁄ I earnestly set my hope on you, ⁄ my advocate and my intercessor, ⁄ for you pray to God, asking forgiveness of sins ⁄ and the remission of all my debts, ⁄ for you have received divine compassion.
ltx/en_us_oca/me.m01.d20:meMA.Ode9C2T.incipit	Be a tower of salvation…
ltx/en_us_oca/me.m01.d20:meMA.Ode9C2T.melody	@ltx/en_us_oca/he.h.m8:heHE.ExestiEpiTouto.notmetered
ltx/en_us_oca/me.m01.d20:meMA.Ode9C2T.mode	@ltx/en_us_oca/miscellanea:misc.Mode8
ltx/en_us_oca/me.m01.d20:meMA.Ode9C2T.ode	@ltx/en_us_oca/miscellanea:misc.Ode9
ltx/en_us_oca/me.m01.d20:meMA.Ode9C2T.text	Be a tower of salvation for me, pure one, ⁄ repelling the hordes of the demons ⁄ and driving away the tumult of temptations and tribulations, ⁄ repulsing the assault of the passions, ⁄ bestowing pure freedom and granting an abundance of the gifts of God!
ltx/en_us_oca/me.m01.d20:meMA.Oikos1.text	How can I, wretch that I am, offer praise from my slothful heart? I am filled with fear when I sing hymns to the great Euthymius. Yet trusting in his prayers, I begin a hymn with good courage and great diligence. I retell for everyone his life and birth; ⁄⁄ And how his parents sang to God: Alleluia!
ltx/en_us_oca/me.m01.d20:meMA.PostGospelBoth.incipit	@ltx/en_us_oca/ho.ho03:hoMA.PostGospelTheotokos.incipit
ltx/en_us_oca/me.m01.d20:meMA.PostGospelBoth.melody	
ltx/en_us_oca/me.m01.d20:meMA.PostGospelBoth.mode	@ltx/en_us_oca/miscellanea:misc.Mode2
ltx/en_us_oca/me.m01.d20:meMA.PostGospelBoth.text	@ltx/en_us_oca/ho.ho03:hoMA.PostGospelTheotokos.text
ltx/en_us_oca/me.m01.d20:meMA.PostGospelGlory.incipit	@ltx/en_us_oca/ho.ho03:hoMA.PostGospelMonastic.incipit
ltx/en_us_oca/me.m01.d20:meMA.PostGospelGlory.melody	
ltx/en_us_oca/me.m01.d20:meMA.PostGospelGlory.mode	@ltx/en_us_oca/miscellanea:misc.Mode2
ltx/en_us_oca/me.m01.d20:meMA.PostGospelGlory.text	@ltx/en_us_oca/ho.ho03:hoMA.PostGospelMonastic.text
ltx/en_us_oca/me.m01.d20:meMA.PostGospelIdiomelon.incipit	The sound of your teachings…
ltx/en_us_oca/me.m01.d20:meMA.PostGospelIdiomelon.melody	
ltx/en_us_oca/me.m01.d20:meMA.PostGospelIdiomelon.mode	@ltx/en_us_oca/miscellanea:misc.Mode6
ltx/en_us_oca/me.m01.d20:meMA.PostGospelIdiomelon.text	The sound of your teachings has gone out into all the earth, ⁄ venerable Father! ⁄ Therefore you have found the reward of your labors in the heavens. ⁄ You destroyed the hosts of demons ⁄ and reached the ranks of angels whose life you blamelessly followed! ⁄ Since you have boldness before Christ our God, ⁄⁄ entreat peace for our souls!
ltx/en_us_oca/me.m01.d20:meSV.AposGlory.incipit	…
ltx/en_us_oca/me.m01.d20:meSV.AposGlory.melody	@ltx/en_us_oca/he.a.m2:heAU.OikosTouEfratha.notmetered
ltx/en_us_oca/me.m01.d20:meSV.AposGlory.mode	@ltx/en_us_oca/miscellanea:misc.Mode2
ltx/en_us_oca/me.m01.d20:meSV.AposGlory.text	
ltx/en_us_oca/me.m01.d20:meSV.Aposticha1.incipit	…
ltx/en_us_oca/me.m01.d20:meSV.Aposticha1.melody	@ltx/en_us_oca/he.a.m2:heAU.OikosTouEfratha.notmetered
ltx/en_us_oca/me.m01.d20:meSV.Aposticha1.mode	@ltx/en_us_oca/miscellanea:misc.Mode2
ltx/en_us_oca/me.m01.d20:meSV.Aposticha1.text	
ltx/en_us_oca/me.m01.d20:meSV.Aposticha2.incipit	…
ltx/en_us_oca/me.m01.d20:meSV.Aposticha2.melody	@ltx/en_us_oca/he.a.m2:heAU.OikosTouEfratha.notmetered
ltx/en_us_oca/me.m01.d20:meSV.Aposticha2.mode	@ltx/en_us_oca/miscellanea:misc.Mode2
ltx/en_us_oca/me.m01.d20:meSV.Aposticha2.text	
ltx/en_us_oca/me.m01.d20:meSV.Aposticha3.incipit	…
ltx/en_us_oca/me.m01.d20:meSV.Aposticha3.melody	@ltx/en_us_oca/he.a.m2:heAU.OikosTouEfratha.notmetered
ltx/en_us_oca/me.m01.d20:meSV.Aposticha3.mode	@ltx/en_us_oca/miscellanea:misc.Mode2
ltx/en_us_oca/me.m01.d20:meSV.Aposticha3.text	
ltx/en_us_oca/me.m01.d20:meSV.SticBoth.incipit	…
ltx/en_us_oca/me.m01.d20:meSV.SticBoth.melody	
ltx/en_us_oca/me.m01.d20:meSV.SticBoth.mode	@ltx/en_us_oca/miscellanea:misc.Mode2
ltx/en_us_oca/me.m01.d20:meSV.SticBoth.text	
ltx/en_us_oca/me.m01.d20:meSV.SticGlory.incipit	…
ltx/en_us_oca/me.m01.d20:meSV.SticGlory.melody	
ltx/en_us_oca/me.m01.d20:meSV.SticGlory.mode	@ltx/en_us_oca/miscellanea:misc.Mode2
ltx/en_us_oca/me.m01.d20:meSV.SticGlory.text	
ltx/en_us_oca/me.m01.d20:meSV.Stichera1.incipit	…
ltx/en_us_oca/me.m01.d20:meSV.Stichera1.melody	@ltx/en_us_oca/he.a.m1:heAU.TonOuranionTagmaton.notmetered
ltx/en_us_oca/me.m01.d20:meSV.Stichera1.mode	@ltx/en_us_oca/miscellanea:misc.Mode1
ltx/en_us_oca/me.m01.d20:meSV.Stichera1.text	
ltx/en_us_oca/me.m01.d20:meSV.Stichera2.incipit	…
ltx/en_us_oca/me.m01.d20:meSV.Stichera2.melody	@ltx/en_us_oca/he.a.m1:heAU.TonOuranionTagmaton.notmetered
ltx/en_us_oca/me.m01.d20:meSV.Stichera2.mode	@ltx/en_us_oca/miscellanea:misc.Mode1
ltx/en_us_oca/me.m01.d20:meSV.Stichera2.text	
ltx/en_us_oca/me.m01.d20:meSV.Stichera3.incipit	…
ltx/en_us_oca/me.m01.d20:meSV.Stichera3.melody	@ltx/en_us_oca/he.a.m1:heAU.TonOuranionTagmaton.notmetered
ltx/en_us_oca/me.m01.d20:meSV.Stichera3.mode	@ltx/en_us_oca/miscellanea:misc.Mode1
ltx/en_us_oca/me.m01.d20:meSV.Stichera3.text	
ltx/en_us_oca/me.m01.d20:meVE.Apolytikion1.incipit	Rejoice, barren wilderness! ⁄ Be…
ltx/en_us_oca/me.m01.d20:meVE.Apolytikion1.melody	
ltx/en_us_oca/me.m01.d20:meVE.Apolytikion1.mode	@ltx/en_us_oca/miscellanea:misc.Mode4
ltx/en_us_oca/me.m01.d20:meVE.Apolytikion1.text	Rejoice, barren wilderness! ⁄ Be glad, sterile desert, that has never known the travail of birth! ⁄ The man of desires has multiplied your sons; ⁄ he has planted them in faith and piety. ⁄ He has watered them with the Holy Spirit: ⁄ They grow in self-denial and perfect virtue. ⁄⁄ Through his intercessions, Christ our God, preserve Your people in peace!
ltx/en_us_oca/me.m01.d20:meVE.AposGlory.incipit	You gave your eyes no…
ltx/en_us_oca/me.m01.d20:meVE.AposGlory.melody	
ltx/en_us_oca/me.m01.d20:meVE.AposGlory.mode	@ltx/en_us_oca/miscellanea:misc.Mode5
ltx/en_us_oca/me.m01.d20:meVE.AposGlory.text	You gave your eyes no sleep, righteous Father, ⁄ nor your eyelids slumber, ⁄ until you freed your soul and body of passions. ⁄ You prepared yourself to be the dwelling of the Holy Spirit, ⁄ for you became the companion of the consubstantial Trinity, ⁄ for Christ Who alone shows us the Father, came to live in you, ⁄ all-praised Euthymius. ⁄⁄ Pray to Him that our souls may be saved!
ltx/en_us_oca/me.m01.d20:meVE.AposTheotokion.incipit	@ltx/en_us_oca/oc.m5.d3:ocVE.AposTheotokion.incipit
ltx/en_us_oca/me.m01.d20:meVE.AposTheotokion.melody	
ltx/en_us_oca/me.m01.d20:meVE.AposTheotokion.mode	@ltx/en_us_oca/miscellanea:misc.Mode5
ltx/en_us_oca/me.m01.d20:meVE.AposTheotokion.text	@ltx/en_us_oca/oc.m5.d3:ocVE.AposTheotokion.text
ltx/en_us_oca/me.m01.d20:meVE.Aposticha1.greekmelody	@ltx/en_us_oca/he.a.m5:heAU.ChairoisAskitikon.greekname
ltx/en_us_oca/me.m01.d20:meVE.Aposticha1.incipit	Rejoice, venerable Father, ⁄ for…
ltx/en_us_oca/me.m01.d20:meVE.Aposticha1.melody	@ltx/en_us_oca/he.a.m5:heAU.ChairoisAskitikon.notmetered
ltx/en_us_oca/me.m01.d20:meVE.Aposticha1.mode	@ltx/en_us_oca/miscellanea:misc.Mode5
ltx/en_us_oca/me.m01.d20:meVE.Aposticha1.text	Rejoice, venerable Father, ⁄ for you are the cause of good courage for the Church! ⁄ By your birth all the assaults of heretics ⁄ were repelled by the providence of God! ⁄ Therefore He named you Euthymius, or good courage. ⁄ You filled the ranks of heavenly beings with joy by the brilliance of your life! ⁄ Now as you make your dwelling with them, filled with light, ⁄ and enjoy the most blessed and divine radiance, ⁄⁄ entreat Christ that He may grant our souls great mercy.
ltx/en_us_oca/me.m01.d20:meVE.Aposticha2.incipit	Made firm by the staff…
ltx/en_us_oca/me.m01.d20:meVE.Aposticha2.melody	@ltx/en_us_oca/he.a.m5:heAU.ChairoisAskitikon.notmetered
ltx/en_us_oca/me.m01.d20:meVE.Aposticha2.mode	@ltx/en_us_oca/miscellanea:misc.Mode5
ltx/en_us_oca/me.m01.d20:meVE.Aposticha2.text	Made firm by the staff of the Cross, ⁄ you dried up the sea of iniquity. ⁄ Spiritually watered by the stream of divine sweetness ⁄ and the rivers of paradise, ⁄ you revealed springs of salvation in the desert! ⁄ You were watered like a palm tree with streams of the divine Spirit. ⁄ You hastened to the heights of heaven, venerable one, ⁄ showing yourself a fiery pillar of light-bearing radiance. ⁄ Therefore, divinely wise one, ⁄⁄ entreat Christ that He may grant great our souls mercy!
ltx/en_us_oca/me.m01.d20:meVE.Aposticha3.incipit	You have passed over indeed…
ltx/en_us_oca/me.m01.d20:meVE.Aposticha3.melody	@ltx/en_us_oca/he.a.m5:heAU.ChairoisAskitikon.notmetered
ltx/en_us_oca/me.m01.d20:meVE.Aposticha3.mode	@ltx/en_us_oca/miscellanea:misc.Mode5
ltx/en_us_oca/me.m01.d20:meVE.Aposticha3.text	You have passed over indeed with joy and gladness of soul ⁄ to the wonderful tabernacle, the house of God. ⁄ There, most blessed Father, ⁄ you listen to the beautiful voices, ⁄ the sweet hymns and ineffable delight of those who keep the feast. ⁄ You share in their beauty, Euthymius. ⁄ This alone you desired as you crucified your flesh ⁄ and you reached it, adorned with the righteousness of God. ⁄⁄ Entreat Christ that He may grant the world great mercy!
ltx/en_us_oca/me.m01.d20:meVE.Lity1.incipit	…
ltx/en_us_oca/me.m01.d20:meVE.Lity1.melody	
ltx/en_us_oca/me.m01.d20:meVE.Lity1.mode	@ltx/en_us_oca/miscellanea:misc.Mode2
ltx/en_us_oca/me.m01.d20:meVE.Lity1.poet	@ltx/en_us_oca/poets:po.Germanou
ltx/en_us_oca/me.m01.d20:meVE.Lity1.text	
ltx/en_us_oca/me.m01.d20:meVE.Lity2.incipit	…
ltx/en_us_oca/me.m01.d20:meVE.Lity2.melody	
ltx/en_us_oca/me.m01.d20:meVE.Lity2.mode	@ltx/en_us_oca/miscellanea:misc.Mode2
ltx/en_us_oca/me.m01.d20:meVE.Lity2.poet	@ltx/en_us_oca/poets:po.TheodorouTouStouditou
ltx/en_us_oca/me.m01.d20:meVE.Lity2.text	
ltx/en_us_oca/me.m01.d20:meVE.Lity3.incipit	…
ltx/en_us_oca/me.m01.d20:meVE.Lity3.melody	
ltx/en_us_oca/me.m01.d20:meVE.Lity3.mode	@ltx/en_us_oca/miscellanea:misc.Mode2
ltx/en_us_oca/me.m01.d20:meVE.Lity3.text	
ltx/en_us_oca/me.m01.d20:meVE.LityBoth.incipit	@ltx/en_us_oca/oc.m4.d1:ocVE.AposTheotokion.incipit
ltx/en_us_oca/me.m01.d20:meVE.LityBoth.melody	
ltx/en_us_oca/me.m01.d20:meVE.LityBoth.mode	@ltx/en_us_oca/miscellanea:misc.Mode4
ltx/en_us_oca/me.m01.d20:meVE.LityBoth.text	@ltx/en_us_oca/oc.m4.d1:ocVE.AposTheotokion.text
ltx/en_us_oca/me.m01.d20:meVE.LityGlory.incipit	…
ltx/en_us_oca/me.m01.d20:meVE.LityGlory.melody	
ltx/en_us_oca/me.m01.d20:meVE.LityGlory.mode	@ltx/en_us_oca/miscellanea:misc.Mode4
ltx/en_us_oca/me.m01.d20:meVE.LityGlory.text	
ltx/en_us_oca/me.m01.d20:meVE.SticGlory.incipit	As another Samuel, Father Euthymius…
ltx/en_us_oca/me.m01.d20:meVE.SticGlory.melody	
ltx/en_us_oca/me.m01.d20:meVE.SticGlory.mode	@ltx/en_us_oca/miscellanea:misc.Mode3
ltx/en_us_oca/me.m01.d20:meVE.SticGlory.poet	@ltx/en_us_oca/poets:po.TheodorouTouStouditou
ltx/en_us_oca/me.m01.d20:meVE.SticGlory.text	As another Samuel, Father Euthymius, ⁄ you were dedicated to God from your mother’s womb. ⁄ Indeed, you were fittingly called by your name, ⁄ for you are good courage to all believers, ⁄ a foundation and pillar of the monastic way, ⁄ a sanctified temple of the Holy Spirit. ⁄ Pray for us who honor you, ⁄⁄ that we may be granted great mercy!
ltx/en_us_oca/me.m01.d20:meVE.SticTheotokion.incipit	@ltx/en_us_oca/oc.m3.d1:ocVE.SticTheotokion.incipit
ltx/en_us_oca/me.m01.d20:meVE.SticTheotokion.melody	
ltx/en_us_oca/me.m01.d20:meVE.SticTheotokion.mode	@ltx/en_us_oca/miscellanea:misc.Mode3
ltx/en_us_oca/me.m01.d20:meVE.SticTheotokion.text	@ltx/en_us_oca/oc.m3.d1:ocVE.SticTheotokion.text
ltx/en_us_oca/me.m01.d20:meVE.Stichera01.greekmelody	@ltx/en_us_oca/he.a.m1:heAU.PaneffimoiMartyres.greekname
ltx/en_us_oca/me.m01.d20:meVE.Stichera01.incipit	A heavenly angel was sent…
ltx/en_us_oca/me.m01.d20:meVE.Stichera01.melody	@ltx/en_us_oca/he.a.m1:heAU.PaneffimoiMartyres.notmetered
ltx/en_us_oca/me.m01.d20:meVE.Stichera01.mode	@ltx/en_us_oca/miscellanea:misc.Mode1
ltx/en_us_oca/me.m01.d20:meVE.Stichera01.text	A heavenly angel was sent beforehand ⁄ to announce your birth, Father Euthymius. ⁄ Like John, you came from the womb of a barren woman ⁄ and you showed yourself to be his follower. ⁄ You were a homeless one who spurned possessions, ⁄ sharing his way of life. ⁄ Like the Baptist, you sustained yourself in the mountains, ⁄⁄ shining forth with boundless miracles!
ltx/en_us_oca/me.m01.d20:meVE.Stichera02.incipit	You brought forth fruit from…
ltx/en_us_oca/me.m01.d20:meVE.Stichera02.melody	@ltx/en_us_oca/he.a.m1:heAU.PaneffimoiMartyres.notmetered
ltx/en_us_oca/me.m01.d20:meVE.Stichera02.mode	@ltx/en_us_oca/miscellanea:misc.Mode1
ltx/en_us_oca/me.m01.d20:meVE.Stichera02.text	You brought forth fruit from barrenness, ⁄ Father Euthymius. ⁄ You were shown to have many children indeed, ⁄ for the desert that once was trackless ⁄ was filled with monastics, your spiritual offspring. ⁄⁄ Pray now that our souls may be granted peace and great mercy!
ltx/en_us_oca/me.m01.d20:meVE.Stichera03.incipit	You excelled in your life…
ltx/en_us_oca/me.m01.d20:meVE.Stichera03.melody	@ltx/en_us_oca/he.a.m1:heAU.PaneffimoiMartyres.notmetered
ltx/en_us_oca/me.m01.d20:meVE.Stichera03.mode	@ltx/en_us_oca/miscellanea:misc.Mode1
ltx/en_us_oca/me.m01.d20:meVE.Stichera03.text	You excelled in your life, Father Euthymius, ⁄ and your faith was truly Orthodox. ⁄ Through activity you reached the highest vision ⁄ and became a dwelling of wisdom. ⁄ You worshipped Christ in two natures as one of the Trinity. ⁄⁄ Pray to Him on our behalf!
ltx/en_us_oca/me.m01.d20:meVE.Stichera04.greekmelody	@ltx/en_us_oca/he.a.m4:heAU.OExYpsistouKlitheis.greekname
ltx/en_us_oca/me.m01.d20:meVE.Stichera04.incipit	You were sanctified from your…
ltx/en_us_oca/me.m01.d20:meVE.Stichera04.melody	@ltx/en_us_oca/he.a.m4:heAU.OExYpsistouKlitheis.notmetered
ltx/en_us_oca/me.m01.d20:meVE.Stichera04.mode	@ltx/en_us_oca/miscellanea:misc.Mode4
ltx/en_us_oca/me.m01.d20:meVE.Stichera04.text	You were sanctified from your mother’s womb ⁄ when the eye of Him who sees all things ⁄ perceived your purpose and desire ⁄ ever leading towards higher things. ⁄ Most blessed one, He declared you to be a gift of God, ⁄ the namesake of good courage. ⁄ He loosed the sorrow of your parents. ⁄ You advanced from infancy pleasing God, our Benefactor. ⁄⁄ Beseech Him that He may save and enlighten our souls!
ltx/en_us_oca/me.m01.d20:meVE.Stichera05.incipit	Christ found you to be…
ltx/en_us_oca/me.m01.d20:meVE.Stichera05.melody	@ltx/en_us_oca/he.a.m4:heAU.OExYpsistouKlitheis.notmetered
ltx/en_us_oca/me.m01.d20:meVE.Stichera05.mode	@ltx/en_us_oca/miscellanea:misc.Mode4
ltx/en_us_oca/me.m01.d20:meVE.Stichera05.text	Christ found you to be a clear mirror of divine revelations. ⁄ He enlightened you with the radiant splendor of His light. ⁄ He filled you with divine gifts, Father. ⁄ You were revealed to be a source flowing with healings, ⁄ a feeder of the hungry, ⁄ watering with rains the desire of those who thirst. ⁄ Looking upon souls as pledges, wise one, ⁄ by your teaching, you helped them towards God. ⁄⁄ Entreat Him that He may save and enlighten our souls!
ltx/en_us_oca/me.m01.d20:meVE.Stichera06.incipit	Your angelic life shone with…
ltx/en_us_oca/me.m01.d20:meVE.Stichera06.melody	@ltx/en_us_oca/he.a.m4:heAU.OExYpsistouKlitheis.notmetered
ltx/en_us_oca/me.m01.d20:meVE.Stichera06.mode	@ltx/en_us_oca/miscellanea:misc.Mode4
ltx/en_us_oca/me.m01.d20:meVE.Stichera06.text	Your angelic life shone with vision and activity ⁄ as a standard and excellent model of virtue ⁄ for those who desire to worship God in perfection! ⁄ Your divinely-wise teaching, Euthymius, ⁄ taught all to worship the Trinity, ⁄ that Christ is known to be One in two natures ⁄ and that the councils were equal in number to Christ’s four Gospels. ⁄⁄ Entreat Him that He may save and enlighten our souls!
