ltx/en_us_oca/me.m07.d08:meDA.commemoration.first	
ltx/en_us_oca/me.m07.d08:meDA.commemoration.first_name	
ltx/en_us_oca/me.m07.d08:meDA.commemoration.first_short	
ltx/en_us_oca/me.m07.d08:meDA.commemoration.first_title	
ltx/en_us_oca/me.m07.d08:meDA.commemoration.full	
ltx/en_us_oca/me.m07.d08:meDA.commemoration.second_name	
ltx/en_us_oca/me.m07.d08:meDA.commemoration.second_title	
ltx/en_us_oca/me.m07.d08:meDA.date	
ltx/en_us_oca/me.m07.d08:meDA.fordate	
ltx/en_us_oca/me.m07.d08:meDA.insert1	
ltx/en_us_oca/me.m07.d08:meDA.insert2	
ltx/en_us_oca/me.m07.d08:meDA.note	
ltx/en_us_oca/me.m07.d08:meDA.pdfcoverdate	
ltx/en_us_oca/me.m07.d08:meDA.pdfheaderdate	
ltx/en_us_oca/me.m07.d08:meHO.commemorations	
ltx/en_us_oca/me.m07.d08:meHO.note1	
ltx/en_us_oca/me.m07.d08:meHO.note2	
ltx/en_us_oca/me.m07.d08:meHO.number	
ltx/en_us_oca/me.m07.d08:meHO.rank	
ltx/en_us_oca/me.m07.d08:meLE.commemoration1	
ltx/en_us_oca/me.m07.d08:meLE.commemoration2	
ltx/en_us_oca/me.m07.d08:meLI.Kontakion1.greekmelody	@ltx/en_us_oca/me.m07.d08:meMA.Kontakion1.greekmelody
ltx/en_us_oca/me.m07.d08:meLI.Kontakion1.incipit	@ltx/en_us_oca/me.m07.d08:meMA.Kontakion1.incipit
ltx/en_us_oca/me.m07.d08:meLI.Kontakion1.melody	@ltx/en_us_oca/me.m07.d08:meMA.Kontakion1.melody
ltx/en_us_oca/me.m07.d08:meLI.Kontakion1.mode	@ltx/en_us_oca/me.m07.d08:meMA.Kontakion1.mode
ltx/en_us_oca/me.m07.d08:meLI.Kontakion1.text	@ltx/en_us_oca/me.m07.d08:meMA.Kontakion1.text
ltx/en_us_oca/me.m07.d08:meLI.Megalynarion.text	
ltx/en_us_oca/me.m07.d08:meMA.C1.poet	@ltx/en_us_oca/poets:po.Theofanous
ltx/en_us_oca/me.m07.d08:meMA.C1.title	@ltx/en_us_oca/titles:ti.CanonSaintM
ltx/en_us_oca/me.m07.d08:meMA.C1.verse	@ltx/en_us_oca/prayers:pr.verse_SaintM.text
ltx/en_us_oca/me.m07.d08:meMA.ExapTheotokion.incipit	…
ltx/en_us_oca/me.m07.d08:meMA.ExapTheotokion.melody	@ltx/en_us_oca/he.a.m3:heAU.FosAnalloioton.notmetered
ltx/en_us_oca/me.m07.d08:meMA.ExapTheotokion.mode	@ltx/en_us_oca/miscellanea:misc.Mode3
ltx/en_us_oca/me.m07.d08:meMA.ExapTheotokion.text	
ltx/en_us_oca/me.m07.d08:meMA.Exaposteilarion1.greekmelody	@ltx/en_us_oca/he.a.m3:heAU.FosAnalloioton.greekname
ltx/en_us_oca/me.m07.d08:meMA.Exaposteilarion1.incipit	…
ltx/en_us_oca/me.m07.d08:meMA.Exaposteilarion1.melody	@ltx/en_us_oca/he.a.m3:heAU.FosAnalloioton.notmetered
ltx/en_us_oca/me.m07.d08:meMA.Exaposteilarion1.mode	@ltx/en_us_oca/miscellanea:misc.Mode3
ltx/en_us_oca/me.m07.d08:meMA.Exaposteilarion1.text	
ltx/en_us_oca/me.m07.d08:meMA.Kontakion1.greekmelody	@ltx/en_us_oca/he.a.m2:heAU.TaAnoZiton.greekname
ltx/en_us_oca/me.m07.d08:meMA.Kontakion1.incipit	Set ablaze by divine zeal…
ltx/en_us_oca/me.m07.d08:meMA.Kontakion1.melody	@ltx/en_us_oca/he.a.m2:heAU.TaAnoZiton.notmetered
ltx/en_us_oca/me.m07.d08:meMA.Kontakion1.mode	@ltx/en_us_oca/miscellanea:misc.Mode2
ltx/en_us_oca/me.m07.d08:meMA.Kontakion1.text	Set ablaze by divine zeal for Christ, Procopius, ⁄ and protected by the might of the Cross, ⁄ you cast down the insolence and boldness of the enemy! ⁄ You raised up an honorable Church, ⁄⁄ excelling in faith and giving light to us all!
ltx/en_us_oca/me.m07.d08:meMA.Lauds1.incipit	…
ltx/en_us_oca/me.m07.d08:meMA.Lauds1.melody	
ltx/en_us_oca/me.m07.d08:meMA.Lauds1.mode	@ltx/en_us_oca/miscellanea:misc.Mode2
ltx/en_us_oca/me.m07.d08:meMA.Lauds1.poet	@ltx/en_us_oca/poets:po.Vyzantiou
ltx/en_us_oca/me.m07.d08:meMA.Lauds1.text	
ltx/en_us_oca/me.m07.d08:meMA.Lauds2.incipit	…
ltx/en_us_oca/me.m07.d08:meMA.Lauds2.melody	
ltx/en_us_oca/me.m07.d08:meMA.Lauds2.mode	@ltx/en_us_oca/miscellanea:misc.Mode3
ltx/en_us_oca/me.m07.d08:meMA.Lauds2.poet	@ltx/en_us_oca/poets:po.Germanou
ltx/en_us_oca/me.m07.d08:meMA.Lauds2.text	
ltx/en_us_oca/me.m07.d08:meMA.Lauds3.incipit	…
ltx/en_us_oca/me.m07.d08:meMA.Lauds3.melody	
ltx/en_us_oca/me.m07.d08:meMA.Lauds3.mode	@ltx/en_us_oca/miscellanea:misc.Mode4
ltx/en_us_oca/me.m07.d08:meMA.Lauds3.poet	@ltx/en_us_oca/poets:po.Kyprianou
ltx/en_us_oca/me.m07.d08:meMA.Lauds3.text	
ltx/en_us_oca/me.m07.d08:meMA.Lauds4.incipit	…
ltx/en_us_oca/me.m07.d08:meMA.Lauds4.melody	
ltx/en_us_oca/me.m07.d08:meMA.Lauds4.mode	@ltx/en_us_oca/miscellanea:misc.Mode5
ltx/en_us_oca/me.m07.d08:meMA.Lauds4.text	
ltx/en_us_oca/me.m07.d08:meMA.LaudsGlory.incipit	Martyr Procopius, ⁄ like Paul…
ltx/en_us_oca/me.m07.d08:meMA.LaudsGlory.melody	
ltx/en_us_oca/me.m07.d08:meMA.LaudsGlory.mode	@ltx/en_us_oca/miscellanea:misc.Mode8
ltx/en_us_oca/me.m07.d08:meMA.LaudsGlory.poet	@ltx/en_us_oca/poets:po.Anatoliou
ltx/en_us_oca/me.m07.d08:meMA.LaudsGlory.text	Martyr Procopius, ⁄ like Paul, having received your calling from God: ⁄ You excelled in God through your desire for the Cross! ⁄ You manfully put all the ungodliness and torments of the tyrants to shame! ⁄ Therefore you stood up against sin even to the shedding of your blood, ⁄ struggling against the invisible foe! ⁄ You ever pray to God the Deliverer, ⁄⁄ that He may grant peace to the whole world and great mercy to our souls!
ltx/en_us_oca/me.m07.d08:meMA.LaudsTheotokion.incipit	@ltx/en_us_oca/oc.m8.d5:ocMA.AposTheotokion.incipit
ltx/en_us_oca/me.m07.d08:meMA.LaudsTheotokion.melody	
ltx/en_us_oca/me.m07.d08:meMA.LaudsTheotokion.mode	@ltx/en_us_oca/miscellanea:misc.Mode8
ltx/en_us_oca/me.m07.d08:meMA.LaudsTheotokion.text	@ltx/en_us_oca/oc.m8.d5:ocMA.AposTheotokion.text
ltx/en_us_oca/me.m07.d08:meMA.MM.VeApos1123as3456.text	@ltx/en_us_oca/properties:media.key
ltx/en_us_oca/me.m07.d08:meMA.MM.VeApos1123as5678.text	@ltx/en_us_oca/properties:media.key
ltx/en_us_oca/me.m07.d08:meMA.Ode1C11.greekmelody	@ltx/en_us_oca/he.h.m4:heHE.ThalassisToErythraion.greekname
ltx/en_us_oca/me.m07.d08:meMA.Ode1C11.incipit	…
ltx/en_us_oca/me.m07.d08:meMA.Ode1C11.melody	@ltx/en_us_oca/he.h.m4:heHE.ThalassisToErythraion.notmetered
ltx/en_us_oca/me.m07.d08:meMA.Ode1C11.mode	@ltx/en_us_oca/miscellanea:misc.Mode4
ltx/en_us_oca/me.m07.d08:meMA.Ode1C11.ode	@ltx/en_us_oca/miscellanea:misc.Ode1
ltx/en_us_oca/me.m07.d08:meMA.Ode1C11.text	
ltx/en_us_oca/me.m07.d08:meMA.Ode1C12.incipit	…
ltx/en_us_oca/me.m07.d08:meMA.Ode1C12.melody	@ltx/en_us_oca/he.h.m4:heHE.ThalassisToErythraion.notmetered
ltx/en_us_oca/me.m07.d08:meMA.Ode1C12.mode	@ltx/en_us_oca/miscellanea:misc.Mode4
ltx/en_us_oca/me.m07.d08:meMA.Ode1C12.ode	@ltx/en_us_oca/miscellanea:misc.Ode1
ltx/en_us_oca/me.m07.d08:meMA.Ode1C12.text	
ltx/en_us_oca/me.m07.d08:meMA.Ode1C13.incipit	…
ltx/en_us_oca/me.m07.d08:meMA.Ode1C13.melody	@ltx/en_us_oca/he.h.m4:heHE.ThalassisToErythraion.notmetered
ltx/en_us_oca/me.m07.d08:meMA.Ode1C13.mode	@ltx/en_us_oca/miscellanea:misc.Mode4
ltx/en_us_oca/me.m07.d08:meMA.Ode1C13.ode	@ltx/en_us_oca/miscellanea:misc.Ode1
ltx/en_us_oca/me.m07.d08:meMA.Ode1C13.text	
ltx/en_us_oca/me.m07.d08:meMA.Ode1C1T.incipit	…
ltx/en_us_oca/me.m07.d08:meMA.Ode1C1T.melody	@ltx/en_us_oca/he.h.m4:heHE.ThalassisToErythraion.notmetered
ltx/en_us_oca/me.m07.d08:meMA.Ode1C1T.mode	@ltx/en_us_oca/miscellanea:misc.Mode4
ltx/en_us_oca/me.m07.d08:meMA.Ode1C1T.ode	@ltx/en_us_oca/miscellanea:misc.Ode1
ltx/en_us_oca/me.m07.d08:meMA.Ode1C1T.text	
ltx/en_us_oca/me.m07.d08:meMA.Ode3C11.greekmelody	@ltx/en_us_oca/he.h.m4:heHE.OukEnSofia.greekname
ltx/en_us_oca/me.m07.d08:meMA.Ode3C11.incipit	…
ltx/en_us_oca/me.m07.d08:meMA.Ode3C11.melody	@ltx/en_us_oca/he.h.m4:heHE.OukEnSofia.notmetered
ltx/en_us_oca/me.m07.d08:meMA.Ode3C11.mode	@ltx/en_us_oca/miscellanea:misc.Mode4
ltx/en_us_oca/me.m07.d08:meMA.Ode3C11.ode	@ltx/en_us_oca/miscellanea:misc.Ode3
ltx/en_us_oca/me.m07.d08:meMA.Ode3C11.text	
ltx/en_us_oca/me.m07.d08:meMA.Ode3C12.incipit	…
ltx/en_us_oca/me.m07.d08:meMA.Ode3C12.melody	@ltx/en_us_oca/he.h.m4:heHE.OukEnSofia.notmetered
ltx/en_us_oca/me.m07.d08:meMA.Ode3C12.mode	@ltx/en_us_oca/miscellanea:misc.Mode4
ltx/en_us_oca/me.m07.d08:meMA.Ode3C12.ode	@ltx/en_us_oca/miscellanea:misc.Ode3
ltx/en_us_oca/me.m07.d08:meMA.Ode3C12.text	
ltx/en_us_oca/me.m07.d08:meMA.Ode3C13.incipit	…
ltx/en_us_oca/me.m07.d08:meMA.Ode3C13.melody	@ltx/en_us_oca/he.h.m4:heHE.OukEnSofia.notmetered
ltx/en_us_oca/me.m07.d08:meMA.Ode3C13.mode	@ltx/en_us_oca/miscellanea:misc.Mode4
ltx/en_us_oca/me.m07.d08:meMA.Ode3C13.ode	@ltx/en_us_oca/miscellanea:misc.Ode3
ltx/en_us_oca/me.m07.d08:meMA.Ode3C13.text	
ltx/en_us_oca/me.m07.d08:meMA.Ode3C1T.incipit	…
ltx/en_us_oca/me.m07.d08:meMA.Ode3C1T.melody	@ltx/en_us_oca/he.h.m4:heHE.OukEnSofia.notmetered
ltx/en_us_oca/me.m07.d08:meMA.Ode3C1T.mode	@ltx/en_us_oca/miscellanea:misc.Mode4
ltx/en_us_oca/me.m07.d08:meMA.Ode3C1T.ode	@ltx/en_us_oca/miscellanea:misc.Ode3
ltx/en_us_oca/me.m07.d08:meMA.Ode3C1T.text	
ltx/en_us_oca/me.m07.d08:meMA.Ode3H.greekmelody	@ltx/en_us_oca/he.h.m4:heHE.OukEnSofia.greekname
ltx/en_us_oca/me.m07.d08:meMA.Ode3H.incipit	@ltx/en_us_oca/he.h.m4:heHE.OukEnSofia.incipit
ltx/en_us_oca/me.m07.d08:meMA.Ode3H.melody	@ltx/en_us_oca/he.h.m4:heHE.OukEnSofia.melody
ltx/en_us_oca/me.m07.d08:meMA.Ode3H.mode	@ltx/en_us_oca/miscellanea:misc.Mode4
ltx/en_us_oca/me.m07.d08:meMA.Ode3H.ode	@ltx/en_us_oca/miscellanea:misc.Ode3
ltx/en_us_oca/me.m07.d08:meMA.Ode3H.text	@ltx/en_us_oca/he.h.m4:heHE.OukEnSofia.text
ltx/en_us_oca/me.m07.d08:meMA.Ode3Kathisma1.greekmelody	@ltx/en_us_oca/he.a.m1:heAU.TonTafonSouSotir.greekname
ltx/en_us_oca/me.m07.d08:meMA.Ode3Kathisma1.incipit	…
ltx/en_us_oca/me.m07.d08:meMA.Ode3Kathisma1.melody	@ltx/en_us_oca/he.a.m1:heAU.TonTafonSouSotir.notmetered
ltx/en_us_oca/me.m07.d08:meMA.Ode3Kathisma1.mode	@ltx/en_us_oca/miscellanea:misc.Mode1
ltx/en_us_oca/me.m07.d08:meMA.Ode3Kathisma1.text	
ltx/en_us_oca/me.m07.d08:meMA.Ode3KathismaSt.incipit	…
ltx/en_us_oca/me.m07.d08:meMA.Ode3KathismaSt.melody	@ltx/en_us_oca/he.a.m1:heAU.TonTafonSouSotir.notmetered
ltx/en_us_oca/me.m07.d08:meMA.Ode3KathismaSt.mode	@ltx/en_us_oca/miscellanea:misc.Mode1
ltx/en_us_oca/me.m07.d08:meMA.Ode3KathismaSt.text	
ltx/en_us_oca/me.m07.d08:meMA.Ode3KathismaT.incipit	
ltx/en_us_oca/me.m07.d08:meMA.Ode3KathismaT.melody	@ltx/en_us_oca/he.a.m1:heAU.TonTafonSouSotir.notmetered
ltx/en_us_oca/me.m07.d08:meMA.Ode3KathismaT.mode	@ltx/en_us_oca/miscellanea:misc.Mode1
ltx/en_us_oca/me.m07.d08:meMA.Ode3KathismaT.text	
ltx/en_us_oca/me.m07.d08:meMA.Ode4C11.greekmelody	@ltx/en_us_oca/he.h.m4:heHE.EparthentaSeIdousa.greekname
ltx/en_us_oca/me.m07.d08:meMA.Ode4C11.incipit	…
ltx/en_us_oca/me.m07.d08:meMA.Ode4C11.melody	@ltx/en_us_oca/he.h.m4:heHE.EparthentaSeIdousa.notmetered
ltx/en_us_oca/me.m07.d08:meMA.Ode4C11.mode	@ltx/en_us_oca/miscellanea:misc.Mode4
ltx/en_us_oca/me.m07.d08:meMA.Ode4C11.ode	@ltx/en_us_oca/miscellanea:misc.Ode4
ltx/en_us_oca/me.m07.d08:meMA.Ode4C11.text	
ltx/en_us_oca/me.m07.d08:meMA.Ode4C12.incipit	…
ltx/en_us_oca/me.m07.d08:meMA.Ode4C12.melody	@ltx/en_us_oca/he.h.m4:heHE.EparthentaSeIdousa.notmetered
ltx/en_us_oca/me.m07.d08:meMA.Ode4C12.mode	@ltx/en_us_oca/miscellanea:misc.Mode4
ltx/en_us_oca/me.m07.d08:meMA.Ode4C12.ode	@ltx/en_us_oca/miscellanea:misc.Ode4
ltx/en_us_oca/me.m07.d08:meMA.Ode4C12.text	
ltx/en_us_oca/me.m07.d08:meMA.Ode4C13.incipit	…
ltx/en_us_oca/me.m07.d08:meMA.Ode4C13.melody	@ltx/en_us_oca/he.h.m4:heHE.EparthentaSeIdousa.notmetered
ltx/en_us_oca/me.m07.d08:meMA.Ode4C13.mode	@ltx/en_us_oca/miscellanea:misc.Mode4
ltx/en_us_oca/me.m07.d08:meMA.Ode4C13.ode	@ltx/en_us_oca/miscellanea:misc.Ode4
ltx/en_us_oca/me.m07.d08:meMA.Ode4C13.text	
ltx/en_us_oca/me.m07.d08:meMA.Ode4C1T.incipit	…
ltx/en_us_oca/me.m07.d08:meMA.Ode4C1T.melody	@ltx/en_us_oca/he.h.m4:heHE.EparthentaSeIdousa.notmetered
ltx/en_us_oca/me.m07.d08:meMA.Ode4C1T.mode	@ltx/en_us_oca/miscellanea:misc.Mode4
ltx/en_us_oca/me.m07.d08:meMA.Ode4C1T.ode	@ltx/en_us_oca/miscellanea:misc.Ode4
ltx/en_us_oca/me.m07.d08:meMA.Ode4C1T.text	
ltx/en_us_oca/me.m07.d08:meMA.Ode5C11.greekmelody	@ltx/en_us_oca/he.h.m4:heHE.AseveisOukOpsontai.greekname
ltx/en_us_oca/me.m07.d08:meMA.Ode5C11.incipit	…
ltx/en_us_oca/me.m07.d08:meMA.Ode5C11.melody	@ltx/en_us_oca/he.h.m4:heHE.AseveisOukOpsontai.notmetered
ltx/en_us_oca/me.m07.d08:meMA.Ode5C11.mode	@ltx/en_us_oca/miscellanea:misc.Mode4
ltx/en_us_oca/me.m07.d08:meMA.Ode5C11.ode	@ltx/en_us_oca/miscellanea:misc.Ode5
ltx/en_us_oca/me.m07.d08:meMA.Ode5C11.text	
ltx/en_us_oca/me.m07.d08:meMA.Ode5C12.incipit	…
ltx/en_us_oca/me.m07.d08:meMA.Ode5C12.melody	@ltx/en_us_oca/he.h.m4:heHE.AseveisOukOpsontai.notmetered
ltx/en_us_oca/me.m07.d08:meMA.Ode5C12.mode	@ltx/en_us_oca/miscellanea:misc.Mode4
ltx/en_us_oca/me.m07.d08:meMA.Ode5C12.ode	@ltx/en_us_oca/miscellanea:misc.Ode5
ltx/en_us_oca/me.m07.d08:meMA.Ode5C12.text	
ltx/en_us_oca/me.m07.d08:meMA.Ode5C13.incipit	…
ltx/en_us_oca/me.m07.d08:meMA.Ode5C13.melody	@ltx/en_us_oca/he.h.m4:heHE.AseveisOukOpsontai.notmetered
ltx/en_us_oca/me.m07.d08:meMA.Ode5C13.mode	@ltx/en_us_oca/miscellanea:misc.Mode4
ltx/en_us_oca/me.m07.d08:meMA.Ode5C13.ode	@ltx/en_us_oca/miscellanea:misc.Ode5
ltx/en_us_oca/me.m07.d08:meMA.Ode5C13.text	
ltx/en_us_oca/me.m07.d08:meMA.Ode5C1T.incipit	…
ltx/en_us_oca/me.m07.d08:meMA.Ode5C1T.melody	@ltx/en_us_oca/he.h.m4:heHE.AseveisOukOpsontai.notmetered
ltx/en_us_oca/me.m07.d08:meMA.Ode5C1T.mode	@ltx/en_us_oca/miscellanea:misc.Mode4
ltx/en_us_oca/me.m07.d08:meMA.Ode5C1T.ode	@ltx/en_us_oca/miscellanea:misc.Ode5
ltx/en_us_oca/me.m07.d08:meMA.Ode5C1T.text	
ltx/en_us_oca/me.m07.d08:meMA.Ode6C11.greekmelody	@ltx/en_us_oca/he.h.m4:heHE.ThysoSoiMetaFonis.greekname
ltx/en_us_oca/me.m07.d08:meMA.Ode6C11.incipit	…
ltx/en_us_oca/me.m07.d08:meMA.Ode6C11.melody	@ltx/en_us_oca/he.h.m4:heHE.ThysoSoiMetaFonis.notmetered
ltx/en_us_oca/me.m07.d08:meMA.Ode6C11.mode	@ltx/en_us_oca/miscellanea:misc.Mode4
ltx/en_us_oca/me.m07.d08:meMA.Ode6C11.ode	@ltx/en_us_oca/miscellanea:misc.Ode6
ltx/en_us_oca/me.m07.d08:meMA.Ode6C11.text	
ltx/en_us_oca/me.m07.d08:meMA.Ode6C12.incipit	…
ltx/en_us_oca/me.m07.d08:meMA.Ode6C12.melody	@ltx/en_us_oca/he.h.m4:heHE.ThysoSoiMetaFonis.notmetered
ltx/en_us_oca/me.m07.d08:meMA.Ode6C12.mode	@ltx/en_us_oca/miscellanea:misc.Mode4
ltx/en_us_oca/me.m07.d08:meMA.Ode6C12.ode	@ltx/en_us_oca/miscellanea:misc.Ode6
ltx/en_us_oca/me.m07.d08:meMA.Ode6C12.text	
ltx/en_us_oca/me.m07.d08:meMA.Ode6C13.incipit	…
ltx/en_us_oca/me.m07.d08:meMA.Ode6C13.melody	@ltx/en_us_oca/he.h.m4:heHE.ThysoSoiMetaFonis.notmetered
ltx/en_us_oca/me.m07.d08:meMA.Ode6C13.mode	@ltx/en_us_oca/miscellanea:misc.Mode4
ltx/en_us_oca/me.m07.d08:meMA.Ode6C13.ode	@ltx/en_us_oca/miscellanea:misc.Ode6
ltx/en_us_oca/me.m07.d08:meMA.Ode6C13.text	
ltx/en_us_oca/me.m07.d08:meMA.Ode6C1T.incipit	…
ltx/en_us_oca/me.m07.d08:meMA.Ode6C1T.melody	@ltx/en_us_oca/he.h.m4:heHE.ThysoSoiMetaFonis.notmetered
ltx/en_us_oca/me.m07.d08:meMA.Ode6C1T.mode	@ltx/en_us_oca/miscellanea:misc.Mode4
ltx/en_us_oca/me.m07.d08:meMA.Ode6C1T.ode	@ltx/en_us_oca/miscellanea:misc.Ode6
ltx/en_us_oca/me.m07.d08:meMA.Ode6C1T.text	
ltx/en_us_oca/me.m07.d08:meMA.Ode6H.greekmelody	@ltx/en_us_oca/he.h.m4:heHE.ThysoSoiMetaFonis.greekname
ltx/en_us_oca/me.m07.d08:meMA.Ode6H.incipit	@ltx/en_us_oca/he.h.m4:heHE.ThysoSoiMetaFonis.incipit
ltx/en_us_oca/me.m07.d08:meMA.Ode6H.melody	@ltx/en_us_oca/he.h.m4:heHE.ThysoSoiMetaFonis.melody
ltx/en_us_oca/me.m07.d08:meMA.Ode6H.mode	@ltx/en_us_oca/miscellanea:misc.Mode4
ltx/en_us_oca/me.m07.d08:meMA.Ode6H.ode	@ltx/en_us_oca/miscellanea:misc.Ode6
ltx/en_us_oca/me.m07.d08:meMA.Ode6H.text	@ltx/en_us_oca/he.h.m4:heHE.ThysoSoiMetaFonis.text
ltx/en_us_oca/me.m07.d08:meMA.Ode7C11.greekmelody	@ltx/en_us_oca/he.h.m4:heHE.EnTiKaminoAvramiaioi.greekname
ltx/en_us_oca/me.m07.d08:meMA.Ode7C11.incipit	…
ltx/en_us_oca/me.m07.d08:meMA.Ode7C11.melody	@ltx/en_us_oca/he.h.m4:heHE.EnTiKaminoAvramiaioi.notmetered
ltx/en_us_oca/me.m07.d08:meMA.Ode7C11.mode	@ltx/en_us_oca/miscellanea:misc.Mode4
ltx/en_us_oca/me.m07.d08:meMA.Ode7C11.ode	@ltx/en_us_oca/miscellanea:misc.Ode7
ltx/en_us_oca/me.m07.d08:meMA.Ode7C11.text	
ltx/en_us_oca/me.m07.d08:meMA.Ode7C12.incipit	…
ltx/en_us_oca/me.m07.d08:meMA.Ode7C12.melody	@ltx/en_us_oca/he.h.m4:heHE.EnTiKaminoAvramiaioi.notmetered
ltx/en_us_oca/me.m07.d08:meMA.Ode7C12.mode	@ltx/en_us_oca/miscellanea:misc.Mode4
ltx/en_us_oca/me.m07.d08:meMA.Ode7C12.ode	@ltx/en_us_oca/miscellanea:misc.Ode7
ltx/en_us_oca/me.m07.d08:meMA.Ode7C12.text	
ltx/en_us_oca/me.m07.d08:meMA.Ode7C13.incipit	…
ltx/en_us_oca/me.m07.d08:meMA.Ode7C13.melody	@ltx/en_us_oca/he.h.m4:heHE.EnTiKaminoAvramiaioi.notmetered
ltx/en_us_oca/me.m07.d08:meMA.Ode7C13.mode	@ltx/en_us_oca/miscellanea:misc.Mode4
ltx/en_us_oca/me.m07.d08:meMA.Ode7C13.ode	@ltx/en_us_oca/miscellanea:misc.Ode7
ltx/en_us_oca/me.m07.d08:meMA.Ode7C13.text	
ltx/en_us_oca/me.m07.d08:meMA.Ode7C1T.incipit	…
ltx/en_us_oca/me.m07.d08:meMA.Ode7C1T.melody	@ltx/en_us_oca/he.h.m4:heHE.EnTiKaminoAvramiaioi.notmetered
ltx/en_us_oca/me.m07.d08:meMA.Ode7C1T.mode	@ltx/en_us_oca/miscellanea:misc.Mode4
ltx/en_us_oca/me.m07.d08:meMA.Ode7C1T.ode	@ltx/en_us_oca/miscellanea:misc.Ode7
ltx/en_us_oca/me.m07.d08:meMA.Ode7C1T.text	
ltx/en_us_oca/me.m07.d08:meMA.Ode8C11.greekmelody	@ltx/en_us_oca/he.h.m4:heHE.CheirasEkpetasasDaniil.greekname
ltx/en_us_oca/me.m07.d08:meMA.Ode8C11.incipit	…
ltx/en_us_oca/me.m07.d08:meMA.Ode8C11.melody	@ltx/en_us_oca/he.h.m4:heHE.CheirasEkpetasasDaniil.notmetered
ltx/en_us_oca/me.m07.d08:meMA.Ode8C11.mode	@ltx/en_us_oca/miscellanea:misc.Mode4
ltx/en_us_oca/me.m07.d08:meMA.Ode8C11.ode	@ltx/en_us_oca/miscellanea:misc.Ode8
ltx/en_us_oca/me.m07.d08:meMA.Ode8C11.text	
ltx/en_us_oca/me.m07.d08:meMA.Ode8C12.incipit	…
ltx/en_us_oca/me.m07.d08:meMA.Ode8C12.melody	@ltx/en_us_oca/he.h.m4:heHE.CheirasEkpetasasDaniil.notmetered
ltx/en_us_oca/me.m07.d08:meMA.Ode8C12.mode	@ltx/en_us_oca/miscellanea:misc.Mode4
ltx/en_us_oca/me.m07.d08:meMA.Ode8C12.ode	@ltx/en_us_oca/miscellanea:misc.Ode8
ltx/en_us_oca/me.m07.d08:meMA.Ode8C12.text	
ltx/en_us_oca/me.m07.d08:meMA.Ode8C13.incipit	…
ltx/en_us_oca/me.m07.d08:meMA.Ode8C13.melody	@ltx/en_us_oca/he.h.m4:heHE.CheirasEkpetasasDaniil.notmetered
ltx/en_us_oca/me.m07.d08:meMA.Ode8C13.mode	@ltx/en_us_oca/miscellanea:misc.Mode4
ltx/en_us_oca/me.m07.d08:meMA.Ode8C13.ode	@ltx/en_us_oca/miscellanea:misc.Ode8
ltx/en_us_oca/me.m07.d08:meMA.Ode8C13.text	
ltx/en_us_oca/me.m07.d08:meMA.Ode8C1T.incipit	…
ltx/en_us_oca/me.m07.d08:meMA.Ode8C1T.melody	@ltx/en_us_oca/he.h.m4:heHE.CheirasEkpetasasDaniil.notmetered
ltx/en_us_oca/me.m07.d08:meMA.Ode8C1T.mode	@ltx/en_us_oca/miscellanea:misc.Mode4
ltx/en_us_oca/me.m07.d08:meMA.Ode8C1T.ode	@ltx/en_us_oca/miscellanea:misc.Ode8
ltx/en_us_oca/me.m07.d08:meMA.Ode8C1T.text	
ltx/en_us_oca/me.m07.d08:meMA.Ode8H.greekmelody	@ltx/en_us_oca/he.h.m4:heHE.CheirasEkpetasasDaniil.greekname
ltx/en_us_oca/me.m07.d08:meMA.Ode8H.incipit	@ltx/en_us_oca/he.h.m4:heHE.CheirasEkpetasasDaniil.incipit
ltx/en_us_oca/me.m07.d08:meMA.Ode8H.melody	@ltx/en_us_oca/he.h.m4:heHE.CheirasEkpetasasDaniil.melody
ltx/en_us_oca/me.m07.d08:meMA.Ode8H.mode	@ltx/en_us_oca/miscellanea:misc.Mode4
ltx/en_us_oca/me.m07.d08:meMA.Ode8H.ode	@ltx/en_us_oca/miscellanea:misc.Ode8
ltx/en_us_oca/me.m07.d08:meMA.Ode8H.text	@ltx/en_us_oca/he.h.m4:heHE.CheirasEkpetasasDaniil.text
ltx/en_us_oca/me.m07.d08:meMA.Ode9C11.greekmelody	@ltx/en_us_oca/he.h.m4:heHE.LithosAcheirotmitos.greekname
ltx/en_us_oca/me.m07.d08:meMA.Ode9C11.incipit	…
ltx/en_us_oca/me.m07.d08:meMA.Ode9C11.melody	@ltx/en_us_oca/he.h.m4:heHE.LithosAcheirotmitos.notmetered
ltx/en_us_oca/me.m07.d08:meMA.Ode9C11.mode	@ltx/en_us_oca/miscellanea:misc.Mode4
ltx/en_us_oca/me.m07.d08:meMA.Ode9C11.ode	@ltx/en_us_oca/miscellanea:misc.Ode9
ltx/en_us_oca/me.m07.d08:meMA.Ode9C11.text	
ltx/en_us_oca/me.m07.d08:meMA.Ode9C12.incipit	…
ltx/en_us_oca/me.m07.d08:meMA.Ode9C12.melody	@ltx/en_us_oca/he.h.m4:heHE.LithosAcheirotmitos.notmetered
ltx/en_us_oca/me.m07.d08:meMA.Ode9C12.mode	@ltx/en_us_oca/miscellanea:misc.Mode4
ltx/en_us_oca/me.m07.d08:meMA.Ode9C12.ode	@ltx/en_us_oca/miscellanea:misc.Ode9
ltx/en_us_oca/me.m07.d08:meMA.Ode9C12.text	
ltx/en_us_oca/me.m07.d08:meMA.Ode9C13.incipit	…
ltx/en_us_oca/me.m07.d08:meMA.Ode9C13.melody	@ltx/en_us_oca/he.h.m4:heHE.LithosAcheirotmitos.notmetered
ltx/en_us_oca/me.m07.d08:meMA.Ode9C13.mode	@ltx/en_us_oca/miscellanea:misc.Mode4
ltx/en_us_oca/me.m07.d08:meMA.Ode9C13.ode	@ltx/en_us_oca/miscellanea:misc.Ode9
ltx/en_us_oca/me.m07.d08:meMA.Ode9C13.text	
ltx/en_us_oca/me.m07.d08:meMA.Ode9C1T.incipit	…
ltx/en_us_oca/me.m07.d08:meMA.Ode9C1T.melody	@ltx/en_us_oca/he.h.m4:heHE.LithosAcheirotmitos.notmetered
ltx/en_us_oca/me.m07.d08:meMA.Ode9C1T.mode	@ltx/en_us_oca/miscellanea:misc.Mode4
ltx/en_us_oca/me.m07.d08:meMA.Ode9C1T.ode	@ltx/en_us_oca/miscellanea:misc.Ode9
ltx/en_us_oca/me.m07.d08:meMA.Ode9C1T.text	
ltx/en_us_oca/me.m07.d08:meMA.Ode9H.greekmelody	@ltx/en_us_oca/he.h.m4:heHE.LithosAcheirotmitos.greekname
ltx/en_us_oca/me.m07.d08:meMA.Ode9H.incipit	@ltx/en_us_oca/he.h.m4:heHE.LithosAcheirotmitos.incipit
ltx/en_us_oca/me.m07.d08:meMA.Ode9H.melody	@ltx/en_us_oca/he.h.m4:heHE.LithosAcheirotmitos.melody
ltx/en_us_oca/me.m07.d08:meMA.Ode9H.mode	@ltx/en_us_oca/miscellanea:misc.Mode4
ltx/en_us_oca/me.m07.d08:meMA.Ode9H.ode	@ltx/en_us_oca/miscellanea:misc.Ode9
ltx/en_us_oca/me.m07.d08:meMA.Ode9H.text	@ltx/en_us_oca/he.h.m4:heHE.LithosAcheirotmitos.text
ltx/en_us_oca/me.m07.d08:meMA.Oikos1.text	
ltx/en_us_oca/me.m07.d08:meVE.Apolytikion1ger.greekmelody	@ltx/en_us_oca/he.a.m5:heAU.TonSynanarchonLogon.greekname
ltx/en_us_oca/me.m07.d08:meVE.Apolytikion1ger.incipit	…
ltx/en_us_oca/me.m07.d08:meVE.Apolytikion1ger.melody	@ltx/en_us_oca/he.a.m5:heAU.TonSynanarchonLogon.notmetered
ltx/en_us_oca/me.m07.d08:meVE.Apolytikion1ger.mode	@ltx/en_us_oca/miscellanea:misc.Mode5
ltx/en_us_oca/me.m07.d08:meVE.Apolytikion1ger.poet	@ltx/en_us_oca/poets:po.Gerasimou
ltx/en_us_oca/me.m07.d08:meVE.Apolytikion1ger.text	
ltx/en_us_oca/me.m07.d08:meVE.Apolytikion2ger.greekmelody	@ltx/en_us_oca/he.a.m4:heAU.OYpsotheisEnToStavro.greekname
ltx/en_us_oca/me.m07.d08:meVE.Apolytikion2ger.incipit	…
ltx/en_us_oca/me.m07.d08:meVE.Apolytikion2ger.melody	@ltx/en_us_oca/he.a.m4:heAU.OYpsotheisEnToStavro.notmetered
ltx/en_us_oca/me.m07.d08:meVE.Apolytikion2ger.mode	@ltx/en_us_oca/miscellanea:misc.Mode4
ltx/en_us_oca/me.m07.d08:meVE.Apolytikion2ger.poet	@ltx/en_us_oca/poets:po.Gerasimou
ltx/en_us_oca/me.m07.d08:meVE.Apolytikion2ger.text	
ltx/en_us_oca/me.m07.d08:meVE.AposGlory.incipit	Enlightened by the mystical brilliance…
ltx/en_us_oca/me.m07.d08:meVE.AposGlory.melody	
ltx/en_us_oca/me.m07.d08:meVE.AposGlory.mode	@ltx/en_us_oca/miscellanea:misc.Mode8
ltx/en_us_oca/me.m07.d08:meVE.AposGlory.poet	@ltx/en_us_oca/poets:po.ProkopiouChartofylakos
ltx/en_us_oca/me.m07.d08:meVE.AposGlory.text	Enlightened by the mystical brilliance of the all-radiant Trinity, ⁄ courageously minded martyr Procopius, ⁄ you became a god by adoption, ⁄ deified by communion. ⁄ Therefore, by your prayers save from manifold dangers ⁄⁄ those who celebrate your radiant festival with faith!
ltx/en_us_oca/me.m07.d08:meVE.AposStavrotheotokion.greekmelody	@ltx/en_us_oca/he.a.m8:heAU.OTouParadoxou.greekname
ltx/en_us_oca/me.m07.d08:meVE.AposStavrotheotokion.incipit	…
ltx/en_us_oca/me.m07.d08:meVE.AposStavrotheotokion.melody	@ltx/en_us_oca/he.a.m8:heAU.OTouParadoxou.notmetered
ltx/en_us_oca/me.m07.d08:meVE.AposStavrotheotokion.mode	@ltx/en_us_oca/miscellanea:misc.Mode8
ltx/en_us_oca/me.m07.d08:meVE.AposStavrotheotokion.text	
ltx/en_us_oca/me.m07.d08:meVE.AposTheotokion.greekmelody	@ltx/en_us_oca/he.a.m8:heAU.OTouParadoxou.greekname
ltx/en_us_oca/me.m07.d08:meVE.AposTheotokion.incipit	…
ltx/en_us_oca/me.m07.d08:meVE.AposTheotokion.melody	@ltx/en_us_oca/he.a.m8:heAU.OTouParadoxou.notmetered
ltx/en_us_oca/me.m07.d08:meVE.AposTheotokion.mode	@ltx/en_us_oca/miscellanea:misc.Mode8
ltx/en_us_oca/me.m07.d08:meVE.AposTheotokion.text	
ltx/en_us_oca/me.m07.d08:meVE.Aposticha1.greekmelody	@ltx/en_us_oca/he.a.m4:heAU.OsGennaionEnMartysi.greekname
ltx/en_us_oca/me.m07.d08:meVE.Aposticha1.incipit	Most glorious Procopius, ⁄ your…
ltx/en_us_oca/me.m07.d08:meVE.Aposticha1.melody	@ltx/en_us_oca/he.a.m4:heAU.OsGennaionEnMartysi.notmetered
ltx/en_us_oca/me.m07.d08:meVE.Aposticha1.mode	@ltx/en_us_oca/miscellanea:misc.Mode4
ltx/en_us_oca/me.m07.d08:meVE.Aposticha1.text	Most glorious Procopius, ⁄ your name was given you from heaven as to a preacher to the nations! ⁄ Enlightened in mind, you forsook the darkness of idolatry, ⁄ becoming a lamp for the faithful, ⁄ brightening the ends of the earth with the divine radiance of your struggle, ⁄⁄ glory and boast of the martyrs!
ltx/en_us_oca/me.m07.d08:meVE.Aposticha2.incipit	First you subdued the uprisings…
ltx/en_us_oca/me.m07.d08:meVE.Aposticha2.melody	@ltx/en_us_oca/he.a.m4:heAU.OsGennaionEnMartysi.notmetered
ltx/en_us_oca/me.m07.d08:meVE.Aposticha2.mode	@ltx/en_us_oca/miscellanea:misc.Mode4
ltx/en_us_oca/me.m07.d08:meVE.Aposticha2.text	First you subdued the uprisings of the flesh with abstinence; ⁄ then you set yourself apart for the contest ⁄ with a courageous mind, through the power of the spirit, ⁄ not sparing your flesh, blessed Procopius! ⁄ You endured all kinds of tortures, ⁄⁄ ascending with your crown to the choirs on high!
ltx/en_us_oca/me.m07.d08:meVE.Aposticha3.incipit	As an invincible commander armed…
ltx/en_us_oca/me.m07.d08:meVE.Aposticha3.melody	@ltx/en_us_oca/he.a.m4:heAU.OsGennaionEnMartysi.notmetered
ltx/en_us_oca/me.m07.d08:meVE.Aposticha3.mode	@ltx/en_us_oca/miscellanea:misc.Mode4
ltx/en_us_oca/me.m07.d08:meVE.Aposticha3.text	As an invincible commander armed with the Cross, ⁄ you drowned all the power of the enemy in the streams of your blood! ⁄ You richly poured forth showers of healing, wondrous one, ⁄ from the well-springs of salvation, ⁄ watering all who are held fast in the flame of the passions, ⁄⁄ divinely inspired one!
ltx/en_us_oca/me.m07.d08:meVE.SticGlory.incipit	…
ltx/en_us_oca/me.m07.d08:meVE.SticGlory.melody	
ltx/en_us_oca/me.m07.d08:meVE.SticGlory.mode	@ltx/en_us_oca/miscellanea:misc.Mode6
ltx/en_us_oca/me.m07.d08:meVE.SticGlory.text	
ltx/en_us_oca/me.m07.d08:meVE.SticStavrotheotokion.greekmelody	@ltx/en_us_oca/he.a.m6:heAU.TriimerosAnestis.greekname
ltx/en_us_oca/me.m07.d08:meVE.SticStavrotheotokion.incipit	@ltx/en_us_oca/me.m01.d16:meVE.SticStavrotheotokion.incipit
ltx/en_us_oca/me.m07.d08:meVE.SticStavrotheotokion.melody	@ltx/en_us_oca/he.a.m6:heAU.TriimerosAnestis.notmetered
ltx/en_us_oca/me.m07.d08:meVE.SticStavrotheotokion.mode	@ltx/en_us_oca/miscellanea:misc.Mode6
ltx/en_us_oca/me.m07.d08:meVE.SticStavrotheotokion.text	@ltx/en_us_oca/me.m01.d16:meVE.SticStavrotheotokion.text
ltx/en_us_oca/me.m07.d08:meVE.SticTheotokion.greekmelody	@ltx/en_us_oca/he.a.m6:heAU.TriimerosAnestis.greekname
ltx/en_us_oca/me.m07.d08:meVE.SticTheotokion.incipit	…
ltx/en_us_oca/me.m07.d08:meVE.SticTheotokion.melody	@ltx/en_us_oca/he.a.m6:heAU.TriimerosAnestis.notmetered
ltx/en_us_oca/me.m07.d08:meVE.SticTheotokion.mode	@ltx/en_us_oca/miscellanea:misc.Mode6
ltx/en_us_oca/me.m07.d08:meVE.SticTheotokion.text	
ltx/en_us_oca/me.m07.d08:meVE.Stichera01.greekmelody	@ltx/en_us_oca/he.a.m1:heAU.TonOuranionTagmaton.greekname
ltx/en_us_oca/me.m07.d08:meVE.Stichera01.incipit	…
ltx/en_us_oca/me.m07.d08:meVE.Stichera01.melody	@ltx/en_us_oca/he.a.m1:heAU.TonOuranionTagmaton.notmetered
ltx/en_us_oca/me.m07.d08:meVE.Stichera01.mode	@ltx/en_us_oca/miscellanea:misc.Mode1
ltx/en_us_oca/me.m07.d08:meVE.Stichera01.text	
ltx/en_us_oca/me.m07.d08:meVE.Stichera02.incipit	…
ltx/en_us_oca/me.m07.d08:meVE.Stichera02.melody	@ltx/en_us_oca/he.a.m1:heAU.TonOuranionTagmaton.notmetered
ltx/en_us_oca/me.m07.d08:meVE.Stichera02.mode	@ltx/en_us_oca/miscellanea:misc.Mode1
ltx/en_us_oca/me.m07.d08:meVE.Stichera02.text	
ltx/en_us_oca/me.m07.d08:meVE.Stichera03.incipit	…
ltx/en_us_oca/me.m07.d08:meVE.Stichera03.melody	@ltx/en_us_oca/he.a.m1:heAU.TonOuranionTagmaton.notmetered
ltx/en_us_oca/me.m07.d08:meVE.Stichera03.mode	@ltx/en_us_oca/miscellanea:misc.Mode1
ltx/en_us_oca/me.m07.d08:meVE.Stichera03.text	
ltx/en_us_oca/me.m07.d08:meVE.Stichera04.greekmelody	@ltx/en_us_oca/he.a.m4:heAU.EdokasSimeiosin.greekname
ltx/en_us_oca/me.m07.d08:meVE.Stichera04.incipit	…
ltx/en_us_oca/me.m07.d08:meVE.Stichera04.melody	@ltx/en_us_oca/he.a.m4:heAU.EdokasSimeiosin.notmetered
ltx/en_us_oca/me.m07.d08:meVE.Stichera04.mode	@ltx/en_us_oca/miscellanea:misc.Mode4
ltx/en_us_oca/me.m07.d08:meVE.Stichera04.text	
ltx/en_us_oca/me.m07.d08:meVE.Stichera05.incipit	…
ltx/en_us_oca/me.m07.d08:meVE.Stichera05.melody	@ltx/en_us_oca/he.a.m4:heAU.EdokasSimeiosin.notmetered
ltx/en_us_oca/me.m07.d08:meVE.Stichera05.mode	@ltx/en_us_oca/miscellanea:misc.Mode4
ltx/en_us_oca/me.m07.d08:meVE.Stichera05.text	
ltx/en_us_oca/me.m07.d08:meVE.Stichera06.incipit	…
ltx/en_us_oca/me.m07.d08:meVE.Stichera06.melody	@ltx/en_us_oca/he.a.m4:heAU.EdokasSimeiosin.notmetered
ltx/en_us_oca/me.m07.d08:meVE.Stichera06.mode	@ltx/en_us_oca/miscellanea:misc.Mode4
ltx/en_us_oca/me.m07.d08:meVE.Stichera06.text	
