ltx/en_us_oca/me.m12.d30:meDA.commemoration.first	
ltx/en_us_oca/me.m12.d30:meDA.commemoration.first_name	
ltx/en_us_oca/me.m12.d30:meDA.commemoration.first_short	
ltx/en_us_oca/me.m12.d30:meDA.commemoration.first_title	
ltx/en_us_oca/me.m12.d30:meDA.commemoration.full	
ltx/en_us_oca/me.m12.d30:meDA.commemoration.second_name	
ltx/en_us_oca/me.m12.d30:meDA.commemoration.second_title	
ltx/en_us_oca/me.m12.d30:meDA.date	
ltx/en_us_oca/me.m12.d30:meDA.dismissal	@ltx/en_us_oca/dismissals:dis00.christmas
ltx/en_us_oca/me.m12.d30:meDA.fordate	
ltx/en_us_oca/me.m12.d30:meDA.insert1	
ltx/en_us_oca/me.m12.d30:meDA.insert2	
ltx/en_us_oca/me.m12.d30:meDA.note	
ltx/en_us_oca/me.m12.d30:meDA.pdfcoverdate	
ltx/en_us_oca/me.m12.d30:meDA.pdfheaderdate	
ltx/en_us_oca/me.m12.d30:meHO.commemorations	
ltx/en_us_oca/me.m12.d30:meHO.note1	
ltx/en_us_oca/me.m12.d30:meHO.note2	
ltx/en_us_oca/me.m12.d30:meHO.number	
ltx/en_us_oca/me.m12.d30:meHO.rank	
ltx/en_us_oca/me.m12.d30:meLE.commemoration1	
ltx/en_us_oca/me.m12.d30:meLE.commemoration2	
ltx/en_us_oca/me.m12.d30:meLI.Kontakion1.greekmelody	@ltx/en_us_oca/me.m12.d30:meMA.Kontakion1.greekmelody
ltx/en_us_oca/me.m12.d30:meLI.Kontakion1.incipit	@ltx/en_us_oca/me.m12.d30:meMA.Kontakion1.incipit
ltx/en_us_oca/me.m12.d30:meLI.Kontakion1.melody	@ltx/en_us_oca/me.m12.d30:meMA.Kontakion1.melody
ltx/en_us_oca/me.m12.d30:meLI.Kontakion1.mode	@ltx/en_us_oca/me.m12.d30:meMA.Kontakion1.mode
ltx/en_us_oca/me.m12.d30:meLI.Kontakion1.text	@ltx/en_us_oca/me.m12.d30:meMA.Kontakion1.text
ltx/en_us_oca/me.m12.d30:meLI.Megalynarion.text	
ltx/en_us_oca/me.m12.d30:meMA.AposGlory.incipit	Seeing Your birth in the…
ltx/en_us_oca/me.m12.d30:meMA.AposGlory.melody	
ltx/en_us_oca/me.m12.d30:meMA.AposGlory.mode	@ltx/en_us_oca/miscellanea:misc.Mode5
ltx/en_us_oca/me.m12.d30:meMA.AposGlory.text	Seeing Your birth in the flesh in Bethlehem, ⁄ all creation is created and fashioned anew, ⁄ Creator and Fashioner of all. ⁄ The sun increases his light, and the earth rejoices! ⁄ The Magi from Persia offer their gifts to the king! ⁄ The shepherds worship in trembling. ⁄ They marvel before God, newborn in the flesh. ⁄ Wonder! He Who nourishes all creation is fed by His Mother! ⁄⁄ Through her, salvation and renewal has come to the world!
ltx/en_us_oca/me.m12.d30:meMA.Aposticha1.greekmelody	@ltx/en_us_oca/he.a.m6:heAU.AiAngelikai.greekname
ltx/en_us_oca/me.m12.d30:meMA.Aposticha1.incipit	He will shepherd faithless Israel…
ltx/en_us_oca/me.m12.d30:meMA.Aposticha1.melody	@ltx/en_us_oca/he.a.m6:heAU.AiAngelikai.notmetered
ltx/en_us_oca/me.m12.d30:meMA.Aposticha1.mode	@ltx/en_us_oca/miscellanea:misc.Mode6
ltx/en_us_oca/me.m12.d30:meMA.Aposticha1.text	He will shepherd faithless Israel with a rod of iron. ⁄ He will judge those who strove against the prophets, ⁄ for the Father has given the inheritance to His only-begotten Son: ⁄ All nations and the ends of the earth are His possession. ⁄ He will crush you, Herod the murderer: ⁄ You would not believe, crying out: ⁄⁄ Christ the king of Israel has come!
ltx/en_us_oca/me.m12.d30:meMA.Aposticha2.incipit	Cry out to the prophet…
ltx/en_us_oca/me.m12.d30:meMA.Aposticha2.melody	@ltx/en_us_oca/he.a.m6:heAU.AiAngelikai.notmetered
ltx/en_us_oca/me.m12.d30:meMA.Aposticha2.mode	@ltx/en_us_oca/miscellanea:misc.Mode6
ltx/en_us_oca/me.m12.d30:meMA.Aposticha2.text	Cry out to the prophet David, the ancestor of God: ⁄ A bright star has heralded the star of morning! ⁄ What is this star? he asks. ⁄ A newborn star, risen from a pure Virgin. ⁄ Enter into the joy of the Mother of God, proclaiming: ⁄ Blessed is our newborn God! Glory to You!
ltx/en_us_oca/me.m12.d30:meMA.Aposticha3.incipit	Your words have come true…
ltx/en_us_oca/me.m12.d30:meMA.Aposticha3.melody	@ltx/en_us_oca/he.a.m6:heAU.AiAngelikai.notmetered
ltx/en_us_oca/me.m12.d30:meMA.Aposticha3.mode	@ltx/en_us_oca/miscellanea:misc.Mode6
ltx/en_us_oca/me.m12.d30:meMA.Aposticha3.text	Your words have come true, prophet Isaiah! ⁄ A Virgin has conceived without knowing a man! ⁄ A Child is born without human seed. ⁄ He is Creator and Master of all ages! ⁄ We share the Mother’s joy, singing in exultation: ⁄⁄ Blessed is our newborn God: Glory to You!
ltx/en_us_oca/me.m12.d30:meMA.C1.acrostic.title	
ltx/en_us_oca/me.m12.d30:meMA.C1.poet	@ltx/en_us_oca/poets:po.Theofanous
ltx/en_us_oca/me.m12.d30:meMA.C1.title	@ltx/en_us_oca/titles:ti.CanonMartyrW
ltx/en_us_oca/me.m12.d30:meMA.C1.verse	@ltx/en_us_oca/prayers:pr.verse_SaintW.text
ltx/en_us_oca/me.m12.d30:meMA.C2.acrostic.title	
ltx/en_us_oca/me.m12.d30:meMA.C2.poet	@ltx/en_us_oca/poets:po.Theofanous
ltx/en_us_oca/me.m12.d30:meMA.C2.title	@ltx/en_us_oca/titles:ti.CanonDevoutW
ltx/en_us_oca/me.m12.d30:meMA.C2.verse	@ltx/en_us_oca/prayers:pr.verse_DevoutWoman.text
ltx/en_us_oca/me.m12.d30:meMA.Exaposteilarion1.greekmelody	@ltx/en_us_oca/he.a.m2:heAU.GynaikesAkoutisthite.greekname
ltx/en_us_oca/me.m12.d30:meMA.Exaposteilarion1.incipit	…
ltx/en_us_oca/me.m12.d30:meMA.Exaposteilarion1.melody	@ltx/en_us_oca/he.a.m2:heAU.GynaikesAkoutisthite.notmetered
ltx/en_us_oca/me.m12.d30:meMA.Exaposteilarion1.mode	@ltx/en_us_oca/miscellanea:misc.Mode2
ltx/en_us_oca/me.m12.d30:meMA.Exaposteilarion1.text	
ltx/en_us_oca/me.m12.d30:meMA.Exaposteilarion2.greekmelody	@ltx/en_us_oca/he.a.m2:heAU.GynaikesAkoutisthite.greekname
ltx/en_us_oca/me.m12.d30:meMA.Exaposteilarion2.incipit	…
ltx/en_us_oca/me.m12.d30:meMA.Exaposteilarion2.melody	@ltx/en_us_oca/he.a.m2:heAU.GynaikesAkoutisthite.notmetered
ltx/en_us_oca/me.m12.d30:meMA.Exaposteilarion2.mode	@ltx/en_us_oca/miscellanea:misc.Mode2
ltx/en_us_oca/me.m12.d30:meMA.Exaposteilarion2.text	
ltx/en_us_oca/me.m12.d30:meMA.Exaposteilarion3.greekmelody	@ltx/en_us_oca/he.a.m2:heAU.GynaikesAkoutisthite.greekname
ltx/en_us_oca/me.m12.d30:meMA.Exaposteilarion3.incipit	He Who is with the…
ltx/en_us_oca/me.m12.d30:meMA.Exaposteilarion3.melody	@ltx/en_us_oca/he.a.m2:heAU.GynaikesAkoutisthite.notmetered
ltx/en_us_oca/me.m12.d30:meMA.Exaposteilarion3.mode	@ltx/en_us_oca/miscellanea:misc.Mode2
ltx/en_us_oca/me.m12.d30:meMA.Exaposteilarion3.text	He Who is with the Father, ⁄ God before all ages, ⁄ appears in Bethlehem by the power of the Holy Spirit. ⁄ He is born of a Virgin, ⁄ and laid in a cave and manger of dumb beasts. ⁄ He is bound in swaddling bands, ⁄⁄ loosing me from the chains of sin.
ltx/en_us_oca/me.m12.d30:meMA.Kathisma11.greekmelody	@ltx/en_us_oca/he.a.m4:heAU.KateplagiIosif.greekname
ltx/en_us_oca/me.m12.d30:meMA.Kathisma11.incipit	@ltx/en_us_oca/me.m12.d25:meMA.Kathisma31.incipit
ltx/en_us_oca/me.m12.d30:meMA.Kathisma11.melody	@ltx/en_us_oca/he.a.m4:heAU.KateplagiIosif.notmetered
ltx/en_us_oca/me.m12.d30:meMA.Kathisma11.mode	@ltx/en_us_oca/miscellanea:misc.Mode4
ltx/en_us_oca/me.m12.d30:meMA.Kathisma11.text	@ltx/en_us_oca/me.m12.d25:meMA.Kathisma31.text
ltx/en_us_oca/me.m12.d30:meMA.Kathisma21.greekmelody	@ltx/en_us_oca/he.a.m4:heAU.KateplagiIosif.greekname
ltx/en_us_oca/me.m12.d30:meMA.Kathisma21.incipit	@ltx/en_us_oca/me.m12.d25:meMA.Kathisma21.incipit
ltx/en_us_oca/me.m12.d30:meMA.Kathisma21.melody	@ltx/en_us_oca/he.a.m4:heAU.KateplagiIosif.notmetered
ltx/en_us_oca/me.m12.d30:meMA.Kathisma21.mode	@ltx/en_us_oca/miscellanea:misc.Mode4
ltx/en_us_oca/me.m12.d30:meMA.Kathisma21.text	@ltx/en_us_oca/me.m12.d25:meMA.Kathisma21.text
ltx/en_us_oca/me.m12.d30:meMA.Kontakion1.greekmelody	@ltx/en_us_oca/he.a.m4:heAU.OYpsotheisEnToStavro.greekname
ltx/en_us_oca/me.m12.d30:meMA.Kontakion1.incipit	…
ltx/en_us_oca/me.m12.d30:meMA.Kontakion1.melody	@ltx/en_us_oca/he.a.m4:heAU.OYpsotheisEnToStavro.notmetered
ltx/en_us_oca/me.m12.d30:meMA.Kontakion1.mode	@ltx/en_us_oca/miscellanea:misc.Mode4
ltx/en_us_oca/me.m12.d30:meMA.Kontakion1.text	
ltx/en_us_oca/me.m12.d30:meMA.Lauds1.greekmelody	@ltx/en_us_oca/he.a.m6:heAU.AiAngelikai.greekname
ltx/en_us_oca/me.m12.d30:meMA.Lauds1.incipit	What great mysteries beyond understanding!…
ltx/en_us_oca/me.m12.d30:meMA.Lauds1.melody	@ltx/en_us_oca/he.a.m6:heAU.AiAngelikai.notmetered
ltx/en_us_oca/me.m12.d30:meMA.Lauds1.mode	@ltx/en_us_oca/miscellanea:misc.Mode6
ltx/en_us_oca/me.m12.d30:meMA.Lauds1.text	What great mysteries beyond understanding! ⁄ How is He wrapped in swaddling clothes Who cannot be touched? ⁄ How is He laid in a manger of dumb beasts, as an Infant, ⁄ Who frees all things from lack of reason and leads us up to heaven? ⁄ Let us cry to Him: ⁄⁄ Blessed are You, our newborn God: Glory to You!
ltx/en_us_oca/me.m12.d30:meMA.Lauds2.incipit	Emmanuel is born in the…
ltx/en_us_oca/me.m12.d30:meMA.Lauds2.melody	@ltx/en_us_oca/he.a.m6:heAU.AiAngelikai.notmetered
ltx/en_us_oca/me.m12.d30:meMA.Lauds2.mode	@ltx/en_us_oca/miscellanea:misc.Mode6
ltx/en_us_oca/me.m12.d30:meMA.Lauds2.text	Emmanuel is born in the cave! ⁄ A star from heaven reveals to the Magi ⁄ the never-setting sun of righteousness, ⁄ risen in the cave clothed in material flesh. ⁄ Let us cry to Him: ⁄ Blessed are You, our newborn God: Glory to You!
ltx/en_us_oca/me.m12.d30:meMA.Lauds3.incipit	Now on earth a Child…
ltx/en_us_oca/me.m12.d30:meMA.Lauds3.melody	@ltx/en_us_oca/he.a.m6:heAU.AiAngelikai.notmetered
ltx/en_us_oca/me.m12.d30:meMA.Lauds3.mode	@ltx/en_us_oca/miscellanea:misc.Mode6
ltx/en_us_oca/me.m12.d30:meMA.Lauds3.text	Now on earth a Child is revealed ⁄ Who was begotten from the Father before the ages. ⁄ Let all creation rejoice; let the heavens be glad! ⁄ Behold those who long ago were seduced by evil ⁄ now become members of God’s household! ⁄ They cry to Him: ⁄⁄ Blessed are You, our newborn God: Glory to You!
ltx/en_us_oca/me.m12.d30:meMA.Lauds4.greekmelody	@ltx/en_us_oca/he.a.m6:heAU.AiAngelikai.greekname
ltx/en_us_oca/me.m12.d30:meMA.Lauds4.incipit	Lord, You bowed the heavens…
ltx/en_us_oca/me.m12.d30:meMA.Lauds4.melody	@ltx/en_us_oca/he.a.m6:heAU.AiAngelikai.notmetered
ltx/en_us_oca/me.m12.d30:meMA.Lauds4.mode	@ltx/en_us_oca/miscellanea:misc.Mode6
ltx/en_us_oca/me.m12.d30:meMA.Lauds4.text	Lord, You bowed the heavens and came down, ⁄ wondrously dwelling in the Virgin’s womb. ⁄ As a newborn Child You were revealed in the cave. ⁄ You associated with men, ⁄ showing the way to those gone astray ⁄ who now cry to You: ⁄⁄ Blessed are You, our newborn God: Glory to You!
ltx/en_us_oca/me.m12.d30:meMA.LaudsGlory.incipit	Behold the fearful and ineffable…
ltx/en_us_oca/me.m12.d30:meMA.LaudsGlory.melody	@ltx/en_us_oca/he.a.m6:heAU.AiAngelikai.notmetered
ltx/en_us_oca/me.m12.d30:meMA.LaudsGlory.mode	@ltx/en_us_oca/miscellanea:misc.Mode6
ltx/en_us_oca/me.m12.d30:meMA.LaudsGlory.text	Behold the fearful and ineffable childbearing of the all-pure one! ⁄ The Virgin cried out: Lord past understanding, ⁄ You, the all-powerful, are wrapped in swaddling clothes as a babe. ⁄ With the shepherds I glorify You! ⁄ With the faithful I cry to You: ⁄⁄ Blessed are You, our newborn God: Glory to You!
ltx/en_us_oca/me.m12.d30:meMA.Ode1C11.greekmelody	@ltx/en_us_oca/he.h.m4:heHE.ThalassisToErythraion.greekname
ltx/en_us_oca/me.m12.d30:meMA.Ode1C11.incipit	…
ltx/en_us_oca/me.m12.d30:meMA.Ode1C11.melody	@ltx/en_us_oca/he.h.m4:heHE.ThalassisToErythraion.notmetered
ltx/en_us_oca/me.m12.d30:meMA.Ode1C11.mode	@ltx/en_us_oca/miscellanea:misc.Mode4
ltx/en_us_oca/me.m12.d30:meMA.Ode1C11.ode	@ltx/en_us_oca/miscellanea:misc.Ode1
ltx/en_us_oca/me.m12.d30:meMA.Ode1C11.text	
ltx/en_us_oca/me.m12.d30:meMA.Ode1C12.incipit	…
ltx/en_us_oca/me.m12.d30:meMA.Ode1C12.melody	@ltx/en_us_oca/he.h.m4:heHE.ThalassisToErythraion.notmetered
ltx/en_us_oca/me.m12.d30:meMA.Ode1C12.mode	@ltx/en_us_oca/miscellanea:misc.Mode4
ltx/en_us_oca/me.m12.d30:meMA.Ode1C12.ode	@ltx/en_us_oca/miscellanea:misc.Ode1
ltx/en_us_oca/me.m12.d30:meMA.Ode1C12.text	
ltx/en_us_oca/me.m12.d30:meMA.Ode1C13.incipit	…
ltx/en_us_oca/me.m12.d30:meMA.Ode1C13.melody	@ltx/en_us_oca/he.h.m4:heHE.ThalassisToErythraion.notmetered
ltx/en_us_oca/me.m12.d30:meMA.Ode1C13.mode	@ltx/en_us_oca/miscellanea:misc.Mode4
ltx/en_us_oca/me.m12.d30:meMA.Ode1C13.ode	@ltx/en_us_oca/miscellanea:misc.Ode1
ltx/en_us_oca/me.m12.d30:meMA.Ode1C13.text	
ltx/en_us_oca/me.m12.d30:meMA.Ode1C1T.incipit	…
ltx/en_us_oca/me.m12.d30:meMA.Ode1C1T.melody	@ltx/en_us_oca/he.h.m4:heHE.ThalassisToErythraion.notmetered
ltx/en_us_oca/me.m12.d30:meMA.Ode1C1T.mode	@ltx/en_us_oca/miscellanea:misc.Mode4
ltx/en_us_oca/me.m12.d30:meMA.Ode1C1T.ode	@ltx/en_us_oca/miscellanea:misc.Ode1
ltx/en_us_oca/me.m12.d30:meMA.Ode1C1T.text	
ltx/en_us_oca/me.m12.d30:meMA.Ode1C21.greekmelody	@ltx/en_us_oca/he.h.m4:heHE.AnoixoToStomaMou.greekname
ltx/en_us_oca/me.m12.d30:meMA.Ode1C21.incipit	…
ltx/en_us_oca/me.m12.d30:meMA.Ode1C21.melody	@ltx/en_us_oca/he.h.m4:heHE.AnoixoToStomaMou.notmetered
ltx/en_us_oca/me.m12.d30:meMA.Ode1C21.mode	@ltx/en_us_oca/miscellanea:misc.Mode4
ltx/en_us_oca/me.m12.d30:meMA.Ode1C21.ode	@ltx/en_us_oca/miscellanea:misc.Ode1
ltx/en_us_oca/me.m12.d30:meMA.Ode1C21.text	
ltx/en_us_oca/me.m12.d30:meMA.Ode1C22.incipit	…
ltx/en_us_oca/me.m12.d30:meMA.Ode1C22.melody	@ltx/en_us_oca/he.h.m4:heHE.AnoixoToStomaMou.notmetered
ltx/en_us_oca/me.m12.d30:meMA.Ode1C22.mode	@ltx/en_us_oca/miscellanea:misc.Mode4
ltx/en_us_oca/me.m12.d30:meMA.Ode1C22.ode	@ltx/en_us_oca/miscellanea:misc.Ode1
ltx/en_us_oca/me.m12.d30:meMA.Ode1C22.text	
ltx/en_us_oca/me.m12.d30:meMA.Ode1C23.incipit	…
ltx/en_us_oca/me.m12.d30:meMA.Ode1C23.melody	@ltx/en_us_oca/he.h.m4:heHE.AnoixoToStomaMou.notmetered
ltx/en_us_oca/me.m12.d30:meMA.Ode1C23.mode	@ltx/en_us_oca/miscellanea:misc.Mode4
ltx/en_us_oca/me.m12.d30:meMA.Ode1C23.ode	@ltx/en_us_oca/miscellanea:misc.Ode1
ltx/en_us_oca/me.m12.d30:meMA.Ode1C23.text	
ltx/en_us_oca/me.m12.d30:meMA.Ode1C24.incipit	…
ltx/en_us_oca/me.m12.d30:meMA.Ode1C24.melody	@ltx/en_us_oca/he.h.m4:heHE.AnoixoToStomaMou.notmetered
ltx/en_us_oca/me.m12.d30:meMA.Ode1C24.mode	@ltx/en_us_oca/miscellanea:misc.Mode4
ltx/en_us_oca/me.m12.d30:meMA.Ode1C24.ode	@ltx/en_us_oca/miscellanea:misc.Ode1
ltx/en_us_oca/me.m12.d30:meMA.Ode1C24.text	
ltx/en_us_oca/me.m12.d30:meMA.Ode1C2T.incipit	…
ltx/en_us_oca/me.m12.d30:meMA.Ode1C2T.melody	@ltx/en_us_oca/he.h.m4:heHE.AnoixoToStomaMou.notmetered
ltx/en_us_oca/me.m12.d30:meMA.Ode1C2T.mode	@ltx/en_us_oca/miscellanea:misc.Mode4
ltx/en_us_oca/me.m12.d30:meMA.Ode1C2T.ode	@ltx/en_us_oca/miscellanea:misc.Ode1
ltx/en_us_oca/me.m12.d30:meMA.Ode1C2T.text	
ltx/en_us_oca/me.m12.d30:meMA.Ode3C11.greekmelody	@ltx/en_us_oca/he.h.m4:heHE.EffrainetaiEpiSoi.greekname
ltx/en_us_oca/me.m12.d30:meMA.Ode3C11.incipit	…
ltx/en_us_oca/me.m12.d30:meMA.Ode3C11.melody	@ltx/en_us_oca/he.h.m4:heHE.EffrainetaiEpiSoi.notmetered
ltx/en_us_oca/me.m12.d30:meMA.Ode3C11.mode	@ltx/en_us_oca/miscellanea:misc.Mode4
ltx/en_us_oca/me.m12.d30:meMA.Ode3C11.ode	@ltx/en_us_oca/miscellanea:misc.Ode3
ltx/en_us_oca/me.m12.d30:meMA.Ode3C11.text	
ltx/en_us_oca/me.m12.d30:meMA.Ode3C12.incipit	…
ltx/en_us_oca/me.m12.d30:meMA.Ode3C12.melody	@ltx/en_us_oca/he.h.m4:heHE.EffrainetaiEpiSoi.notmetered
ltx/en_us_oca/me.m12.d30:meMA.Ode3C12.mode	@ltx/en_us_oca/miscellanea:misc.Mode4
ltx/en_us_oca/me.m12.d30:meMA.Ode3C12.ode	@ltx/en_us_oca/miscellanea:misc.Ode3
ltx/en_us_oca/me.m12.d30:meMA.Ode3C12.text	
ltx/en_us_oca/me.m12.d30:meMA.Ode3C13.incipit	…
ltx/en_us_oca/me.m12.d30:meMA.Ode3C13.melody	@ltx/en_us_oca/he.h.m4:heHE.EffrainetaiEpiSoi.notmetered
ltx/en_us_oca/me.m12.d30:meMA.Ode3C13.mode	@ltx/en_us_oca/miscellanea:misc.Mode4
ltx/en_us_oca/me.m12.d30:meMA.Ode3C13.ode	@ltx/en_us_oca/miscellanea:misc.Ode3
ltx/en_us_oca/me.m12.d30:meMA.Ode3C13.text	
ltx/en_us_oca/me.m12.d30:meMA.Ode3C1T.incipit	…
ltx/en_us_oca/me.m12.d30:meMA.Ode3C1T.melody	@ltx/en_us_oca/he.h.m4:heHE.EffrainetaiEpiSoi.notmetered
ltx/en_us_oca/me.m12.d30:meMA.Ode3C1T.mode	@ltx/en_us_oca/miscellanea:misc.Mode4
ltx/en_us_oca/me.m12.d30:meMA.Ode3C1T.ode	@ltx/en_us_oca/miscellanea:misc.Ode3
ltx/en_us_oca/me.m12.d30:meMA.Ode3C1T.text	
ltx/en_us_oca/me.m12.d30:meMA.Ode3C21.greekmelody	@ltx/en_us_oca/he.h.m4:heHE.OukEnSofia.greekname
ltx/en_us_oca/me.m12.d30:meMA.Ode3C21.incipit	…
ltx/en_us_oca/me.m12.d30:meMA.Ode3C21.melody	@ltx/en_us_oca/he.h.m4:heHE.OukEnSofia.notmetered
ltx/en_us_oca/me.m12.d30:meMA.Ode3C21.mode	@ltx/en_us_oca/miscellanea:misc.Mode4
ltx/en_us_oca/me.m12.d30:meMA.Ode3C21.ode	@ltx/en_us_oca/miscellanea:misc.Ode3
ltx/en_us_oca/me.m12.d30:meMA.Ode3C21.text	
ltx/en_us_oca/me.m12.d30:meMA.Ode3C22.incipit	…
ltx/en_us_oca/me.m12.d30:meMA.Ode3C22.melody	@ltx/en_us_oca/he.h.m4:heHE.OukEnSofia.notmetered
ltx/en_us_oca/me.m12.d30:meMA.Ode3C22.mode	@ltx/en_us_oca/miscellanea:misc.Mode4
ltx/en_us_oca/me.m12.d30:meMA.Ode3C22.ode	@ltx/en_us_oca/miscellanea:misc.Ode3
ltx/en_us_oca/me.m12.d30:meMA.Ode3C22.text	
ltx/en_us_oca/me.m12.d30:meMA.Ode3C23.incipit	…
ltx/en_us_oca/me.m12.d30:meMA.Ode3C23.melody	@ltx/en_us_oca/he.h.m4:heHE.OukEnSofia.notmetered
ltx/en_us_oca/me.m12.d30:meMA.Ode3C23.mode	@ltx/en_us_oca/miscellanea:misc.Mode4
ltx/en_us_oca/me.m12.d30:meMA.Ode3C23.ode	@ltx/en_us_oca/miscellanea:misc.Ode3
ltx/en_us_oca/me.m12.d30:meMA.Ode3C23.text	
ltx/en_us_oca/me.m12.d30:meMA.Ode3C2T.incipit	…
ltx/en_us_oca/me.m12.d30:meMA.Ode3C2T.melody	@ltx/en_us_oca/he.h.m4:heHE.OukEnSofia.notmetered
ltx/en_us_oca/me.m12.d30:meMA.Ode3C2T.mode	@ltx/en_us_oca/miscellanea:misc.Mode4
ltx/en_us_oca/me.m12.d30:meMA.Ode3C2T.ode	@ltx/en_us_oca/miscellanea:misc.Ode3
ltx/en_us_oca/me.m12.d30:meMA.Ode3C2T.text	
ltx/en_us_oca/me.m12.d30:meMA.Ode3H.greekmelody	@ltx/en_us_oca/he.h.m4:heHE.OukEnSofia.greekname
ltx/en_us_oca/me.m12.d30:meMA.Ode3H.incipit	@ltx/en_us_oca/he.h.m4:heHE.OukEnSofia.incipit
ltx/en_us_oca/me.m12.d30:meMA.Ode3H.melody	@ltx/en_us_oca/he.h.m4:heHE.OukEnSofia.melody
ltx/en_us_oca/me.m12.d30:meMA.Ode3H.mode	@ltx/en_us_oca/miscellanea:misc.Mode4
ltx/en_us_oca/me.m12.d30:meMA.Ode3H.ode	@ltx/en_us_oca/miscellanea:misc.Ode3
ltx/en_us_oca/me.m12.d30:meMA.Ode3H.text	@ltx/en_us_oca/he.h.m4:heHE.OukEnSofia.text
ltx/en_us_oca/me.m12.d30:meMA.Ode3Kathisma1.greekmelody	@ltx/en_us_oca/he.a.m4:heAU.OYpsotheisEnToStavro.greekname
ltx/en_us_oca/me.m12.d30:meMA.Ode3Kathisma1.incipit	…
ltx/en_us_oca/me.m12.d30:meMA.Ode3Kathisma1.melody	@ltx/en_us_oca/he.a.m4:heAU.OYpsotheisEnToStavro.notmetered
ltx/en_us_oca/me.m12.d30:meMA.Ode3Kathisma1.mode	@ltx/en_us_oca/miscellanea:misc.Mode4
ltx/en_us_oca/me.m12.d30:meMA.Ode3Kathisma1.text	
ltx/en_us_oca/me.m12.d30:meMA.Ode3Kathisma2.greekmelody	@ltx/en_us_oca/he.a.m4:heAU.TachyProkatalave.greekname
ltx/en_us_oca/me.m12.d30:meMA.Ode3Kathisma2.incipit	…
ltx/en_us_oca/me.m12.d30:meMA.Ode3Kathisma2.melody	@ltx/en_us_oca/he.a.m4:heAU.TachyProkatalave.notmetered
ltx/en_us_oca/me.m12.d30:meMA.Ode3Kathisma2.mode	@ltx/en_us_oca/miscellanea:misc.Mode4
ltx/en_us_oca/me.m12.d30:meMA.Ode3Kathisma2.text	
ltx/en_us_oca/me.m12.d30:meMA.Ode3Kathisma3.greekmelody	@ltx/en_us_oca/he.a.m4:heAU.KateplagiIosif.greekname
ltx/en_us_oca/me.m12.d30:meMA.Ode3Kathisma3.incipit	@ltx/en_us_oca/me.m12.d25:meMA.Kathisma11.incipit
ltx/en_us_oca/me.m12.d30:meMA.Ode3Kathisma3.melody	@ltx/en_us_oca/he.a.m4:heAU.KateplagiIosif.notmetered
ltx/en_us_oca/me.m12.d30:meMA.Ode3Kathisma3.mode	@ltx/en_us_oca/miscellanea:misc.Mode4
ltx/en_us_oca/me.m12.d30:meMA.Ode3Kathisma3.text	@ltx/en_us_oca/me.m12.d25:meMA.Kathisma11.text
ltx/en_us_oca/me.m12.d30:meMA.Ode4C11.greekmelody	@ltx/en_us_oca/he.h.m4:heHE.EparthentaSeIdousa.greekname
ltx/en_us_oca/me.m12.d30:meMA.Ode4C11.incipit	…
ltx/en_us_oca/me.m12.d30:meMA.Ode4C11.melody	@ltx/en_us_oca/he.h.m4:heHE.EparthentaSeIdousa.notmetered
ltx/en_us_oca/me.m12.d30:meMA.Ode4C11.mode	@ltx/en_us_oca/miscellanea:misc.Mode4
ltx/en_us_oca/me.m12.d30:meMA.Ode4C11.ode	@ltx/en_us_oca/miscellanea:misc.Ode4
ltx/en_us_oca/me.m12.d30:meMA.Ode4C11.text	
ltx/en_us_oca/me.m12.d30:meMA.Ode4C12.incipit	…
ltx/en_us_oca/me.m12.d30:meMA.Ode4C12.melody	@ltx/en_us_oca/he.h.m4:heHE.EparthentaSeIdousa.notmetered
ltx/en_us_oca/me.m12.d30:meMA.Ode4C12.mode	@ltx/en_us_oca/miscellanea:misc.Mode4
ltx/en_us_oca/me.m12.d30:meMA.Ode4C12.ode	@ltx/en_us_oca/miscellanea:misc.Ode4
ltx/en_us_oca/me.m12.d30:meMA.Ode4C12.text	
ltx/en_us_oca/me.m12.d30:meMA.Ode4C13.incipit	…
ltx/en_us_oca/me.m12.d30:meMA.Ode4C13.melody	@ltx/en_us_oca/he.h.m4:heHE.EparthentaSeIdousa.notmetered
ltx/en_us_oca/me.m12.d30:meMA.Ode4C13.mode	@ltx/en_us_oca/miscellanea:misc.Mode4
ltx/en_us_oca/me.m12.d30:meMA.Ode4C13.ode	@ltx/en_us_oca/miscellanea:misc.Ode4
ltx/en_us_oca/me.m12.d30:meMA.Ode4C13.text	
ltx/en_us_oca/me.m12.d30:meMA.Ode4C1T.incipit	…
ltx/en_us_oca/me.m12.d30:meMA.Ode4C1T.melody	@ltx/en_us_oca/he.h.m4:heHE.EparthentaSeIdousa.notmetered
ltx/en_us_oca/me.m12.d30:meMA.Ode4C1T.mode	@ltx/en_us_oca/miscellanea:misc.Mode4
ltx/en_us_oca/me.m12.d30:meMA.Ode4C1T.ode	@ltx/en_us_oca/miscellanea:misc.Ode4
ltx/en_us_oca/me.m12.d30:meMA.Ode4C1T.text	
ltx/en_us_oca/me.m12.d30:meMA.Ode4C21.greekmelody	@ltx/en_us_oca/he.h.m4:heHE.OKathimenosEnDoxi.greekname
ltx/en_us_oca/me.m12.d30:meMA.Ode4C21.incipit	…
ltx/en_us_oca/me.m12.d30:meMA.Ode4C21.melody	@ltx/en_us_oca/he.h.m4:heHE.OKathimenosEnDoxi.notmetered
ltx/en_us_oca/me.m12.d30:meMA.Ode4C21.mode	@ltx/en_us_oca/miscellanea:misc.Mode4
ltx/en_us_oca/me.m12.d30:meMA.Ode4C21.ode	@ltx/en_us_oca/miscellanea:misc.Ode4
ltx/en_us_oca/me.m12.d30:meMA.Ode4C21.text	
ltx/en_us_oca/me.m12.d30:meMA.Ode4C22.incipit	…
ltx/en_us_oca/me.m12.d30:meMA.Ode4C22.melody	@ltx/en_us_oca/he.h.m4:heHE.OKathimenosEnDoxi.notmetered
ltx/en_us_oca/me.m12.d30:meMA.Ode4C22.mode	@ltx/en_us_oca/miscellanea:misc.Mode4
ltx/en_us_oca/me.m12.d30:meMA.Ode4C22.ode	@ltx/en_us_oca/miscellanea:misc.Ode4
ltx/en_us_oca/me.m12.d30:meMA.Ode4C22.text	
ltx/en_us_oca/me.m12.d30:meMA.Ode4C23.incipit	…
ltx/en_us_oca/me.m12.d30:meMA.Ode4C23.melody	@ltx/en_us_oca/he.h.m4:heHE.OKathimenosEnDoxi.notmetered
ltx/en_us_oca/me.m12.d30:meMA.Ode4C23.mode	@ltx/en_us_oca/miscellanea:misc.Mode4
ltx/en_us_oca/me.m12.d30:meMA.Ode4C23.ode	@ltx/en_us_oca/miscellanea:misc.Ode4
ltx/en_us_oca/me.m12.d30:meMA.Ode4C23.text	
ltx/en_us_oca/me.m12.d30:meMA.Ode4C2T.incipit	…
ltx/en_us_oca/me.m12.d30:meMA.Ode4C2T.melody	@ltx/en_us_oca/he.h.m4:heHE.OKathimenosEnDoxi.notmetered
ltx/en_us_oca/me.m12.d30:meMA.Ode4C2T.mode	@ltx/en_us_oca/miscellanea:misc.Mode4
ltx/en_us_oca/me.m12.d30:meMA.Ode4C2T.ode	@ltx/en_us_oca/miscellanea:misc.Ode4
ltx/en_us_oca/me.m12.d30:meMA.Ode4C2T.text	
ltx/en_us_oca/me.m12.d30:meMA.Ode5C11.greekmelody	@ltx/en_us_oca/he.h.m4:heHE.SyKyrieMouFos.greekname
ltx/en_us_oca/me.m12.d30:meMA.Ode5C11.incipit	…
ltx/en_us_oca/me.m12.d30:meMA.Ode5C11.melody	@ltx/en_us_oca/he.h.m4:heHE.SyKyrieMouFos.notmetered
ltx/en_us_oca/me.m12.d30:meMA.Ode5C11.mode	@ltx/en_us_oca/miscellanea:misc.Mode4
ltx/en_us_oca/me.m12.d30:meMA.Ode5C11.ode	@ltx/en_us_oca/miscellanea:misc.Ode5
ltx/en_us_oca/me.m12.d30:meMA.Ode5C11.text	
ltx/en_us_oca/me.m12.d30:meMA.Ode5C12.incipit	…
ltx/en_us_oca/me.m12.d30:meMA.Ode5C12.melody	@ltx/en_us_oca/he.h.m4:heHE.SyKyrieMouFos.notmetered
ltx/en_us_oca/me.m12.d30:meMA.Ode5C12.mode	@ltx/en_us_oca/miscellanea:misc.Mode4
ltx/en_us_oca/me.m12.d30:meMA.Ode5C12.ode	@ltx/en_us_oca/miscellanea:misc.Ode5
ltx/en_us_oca/me.m12.d30:meMA.Ode5C12.text	
ltx/en_us_oca/me.m12.d30:meMA.Ode5C13.incipit	…
ltx/en_us_oca/me.m12.d30:meMA.Ode5C13.melody	@ltx/en_us_oca/he.h.m4:heHE.SyKyrieMouFos.notmetered
ltx/en_us_oca/me.m12.d30:meMA.Ode5C13.mode	@ltx/en_us_oca/miscellanea:misc.Mode4
ltx/en_us_oca/me.m12.d30:meMA.Ode5C13.ode	@ltx/en_us_oca/miscellanea:misc.Ode5
ltx/en_us_oca/me.m12.d30:meMA.Ode5C13.text	
ltx/en_us_oca/me.m12.d30:meMA.Ode5C1T.incipit	…
ltx/en_us_oca/me.m12.d30:meMA.Ode5C1T.melody	@ltx/en_us_oca/he.h.m4:heHE.SyKyrieMouFos.notmetered
ltx/en_us_oca/me.m12.d30:meMA.Ode5C1T.mode	@ltx/en_us_oca/miscellanea:misc.Mode4
ltx/en_us_oca/me.m12.d30:meMA.Ode5C1T.ode	@ltx/en_us_oca/miscellanea:misc.Ode5
ltx/en_us_oca/me.m12.d30:meMA.Ode5C1T.text	
ltx/en_us_oca/me.m12.d30:meMA.Ode5C21.greekmelody	@ltx/en_us_oca/he.h.m4:heHE.AseveisOukOpsontai.greekname
ltx/en_us_oca/me.m12.d30:meMA.Ode5C21.incipit	…
ltx/en_us_oca/me.m12.d30:meMA.Ode5C21.melody	@ltx/en_us_oca/he.h.m4:heHE.AseveisOukOpsontai.notmetered
ltx/en_us_oca/me.m12.d30:meMA.Ode5C21.mode	@ltx/en_us_oca/miscellanea:misc.Mode4
ltx/en_us_oca/me.m12.d30:meMA.Ode5C21.ode	@ltx/en_us_oca/miscellanea:misc.Ode5
ltx/en_us_oca/me.m12.d30:meMA.Ode5C21.text	
ltx/en_us_oca/me.m12.d30:meMA.Ode5C22.incipit	…
ltx/en_us_oca/me.m12.d30:meMA.Ode5C22.melody	@ltx/en_us_oca/he.h.m4:heHE.AseveisOukOpsontai.notmetered
ltx/en_us_oca/me.m12.d30:meMA.Ode5C22.mode	@ltx/en_us_oca/miscellanea:misc.Mode4
ltx/en_us_oca/me.m12.d30:meMA.Ode5C22.ode	@ltx/en_us_oca/miscellanea:misc.Ode5
ltx/en_us_oca/me.m12.d30:meMA.Ode5C22.text	
ltx/en_us_oca/me.m12.d30:meMA.Ode5C23.incipit	…
ltx/en_us_oca/me.m12.d30:meMA.Ode5C23.melody	@ltx/en_us_oca/he.h.m4:heHE.AseveisOukOpsontai.notmetered
ltx/en_us_oca/me.m12.d30:meMA.Ode5C23.mode	@ltx/en_us_oca/miscellanea:misc.Mode4
ltx/en_us_oca/me.m12.d30:meMA.Ode5C23.ode	@ltx/en_us_oca/miscellanea:misc.Ode5
ltx/en_us_oca/me.m12.d30:meMA.Ode5C23.text	
ltx/en_us_oca/me.m12.d30:meMA.Ode5C2T.incipit	…
ltx/en_us_oca/me.m12.d30:meMA.Ode5C2T.melody	@ltx/en_us_oca/he.h.m4:heHE.AseveisOukOpsontai.notmetered
ltx/en_us_oca/me.m12.d30:meMA.Ode5C2T.mode	@ltx/en_us_oca/miscellanea:misc.Mode4
ltx/en_us_oca/me.m12.d30:meMA.Ode5C2T.ode	@ltx/en_us_oca/miscellanea:misc.Ode5
ltx/en_us_oca/me.m12.d30:meMA.Ode5C2T.text	
ltx/en_us_oca/me.m12.d30:meMA.Ode6C11.greekmelody	@ltx/en_us_oca/he.h.m4:heHE.ThysoSoiMetaFonis.greekname
ltx/en_us_oca/me.m12.d30:meMA.Ode6C11.incipit	…
ltx/en_us_oca/me.m12.d30:meMA.Ode6C11.melody	@ltx/en_us_oca/he.h.m4:heHE.ThysoSoiMetaFonis.notmetered
ltx/en_us_oca/me.m12.d30:meMA.Ode6C11.mode	@ltx/en_us_oca/miscellanea:misc.Mode4
ltx/en_us_oca/me.m12.d30:meMA.Ode6C11.ode	@ltx/en_us_oca/miscellanea:misc.Ode6
ltx/en_us_oca/me.m12.d30:meMA.Ode6C11.text	
ltx/en_us_oca/me.m12.d30:meMA.Ode6C12.incipit	…
ltx/en_us_oca/me.m12.d30:meMA.Ode6C12.melody	@ltx/en_us_oca/he.h.m4:heHE.ThysoSoiMetaFonis.notmetered
ltx/en_us_oca/me.m12.d30:meMA.Ode6C12.mode	@ltx/en_us_oca/miscellanea:misc.Mode4
ltx/en_us_oca/me.m12.d30:meMA.Ode6C12.ode	@ltx/en_us_oca/miscellanea:misc.Ode6
ltx/en_us_oca/me.m12.d30:meMA.Ode6C12.text	
ltx/en_us_oca/me.m12.d30:meMA.Ode6C13.incipit	…
ltx/en_us_oca/me.m12.d30:meMA.Ode6C13.melody	@ltx/en_us_oca/he.h.m4:heHE.ThysoSoiMetaFonis.notmetered
ltx/en_us_oca/me.m12.d30:meMA.Ode6C13.mode	@ltx/en_us_oca/miscellanea:misc.Mode4
ltx/en_us_oca/me.m12.d30:meMA.Ode6C13.ode	@ltx/en_us_oca/miscellanea:misc.Ode6
ltx/en_us_oca/me.m12.d30:meMA.Ode6C13.text	
ltx/en_us_oca/me.m12.d30:meMA.Ode6C1T.incipit	…
ltx/en_us_oca/me.m12.d30:meMA.Ode6C1T.melody	@ltx/en_us_oca/he.h.m4:heHE.ThysoSoiMetaFonis.notmetered
ltx/en_us_oca/me.m12.d30:meMA.Ode6C1T.mode	@ltx/en_us_oca/miscellanea:misc.Mode4
ltx/en_us_oca/me.m12.d30:meMA.Ode6C1T.ode	@ltx/en_us_oca/miscellanea:misc.Ode6
ltx/en_us_oca/me.m12.d30:meMA.Ode6C1T.text	
ltx/en_us_oca/me.m12.d30:meMA.Ode6C21.greekmelody	@ltx/en_us_oca/he.h.m4:heHE.ThysoSoiMetaFonis.greekname
ltx/en_us_oca/me.m12.d30:meMA.Ode6C21.incipit	…
ltx/en_us_oca/me.m12.d30:meMA.Ode6C21.melody	@ltx/en_us_oca/he.h.m4:heHE.ThysoSoiMetaFonis.notmetered
ltx/en_us_oca/me.m12.d30:meMA.Ode6C21.mode	@ltx/en_us_oca/miscellanea:misc.Mode4
ltx/en_us_oca/me.m12.d30:meMA.Ode6C21.ode	@ltx/en_us_oca/miscellanea:misc.Ode6
ltx/en_us_oca/me.m12.d30:meMA.Ode6C21.text	
ltx/en_us_oca/me.m12.d30:meMA.Ode6C22.incipit	…
ltx/en_us_oca/me.m12.d30:meMA.Ode6C22.melody	@ltx/en_us_oca/he.h.m4:heHE.ThysoSoiMetaFonis.notmetered
ltx/en_us_oca/me.m12.d30:meMA.Ode6C22.mode	@ltx/en_us_oca/miscellanea:misc.Mode4
ltx/en_us_oca/me.m12.d30:meMA.Ode6C22.ode	@ltx/en_us_oca/miscellanea:misc.Ode6
ltx/en_us_oca/me.m12.d30:meMA.Ode6C22.text	
ltx/en_us_oca/me.m12.d30:meMA.Ode6C23.incipit	…
ltx/en_us_oca/me.m12.d30:meMA.Ode6C23.melody	@ltx/en_us_oca/he.h.m4:heHE.ThysoSoiMetaFonis.notmetered
ltx/en_us_oca/me.m12.d30:meMA.Ode6C23.mode	@ltx/en_us_oca/miscellanea:misc.Mode4
ltx/en_us_oca/me.m12.d30:meMA.Ode6C23.ode	@ltx/en_us_oca/miscellanea:misc.Ode6
ltx/en_us_oca/me.m12.d30:meMA.Ode6C23.text	
ltx/en_us_oca/me.m12.d30:meMA.Ode6C2T.incipit	…
ltx/en_us_oca/me.m12.d30:meMA.Ode6C2T.melody	@ltx/en_us_oca/he.h.m4:heHE.ThysoSoiMetaFonis.notmetered
ltx/en_us_oca/me.m12.d30:meMA.Ode6C2T.mode	@ltx/en_us_oca/miscellanea:misc.Mode4
ltx/en_us_oca/me.m12.d30:meMA.Ode6C2T.ode	@ltx/en_us_oca/miscellanea:misc.Ode6
ltx/en_us_oca/me.m12.d30:meMA.Ode6C2T.text	
ltx/en_us_oca/me.m12.d30:meMA.Ode6H.greekmelody	@ltx/en_us_oca/he.h.m4:heHE.ThysoSoiMetaFonis.greekname
ltx/en_us_oca/me.m12.d30:meMA.Ode6H.incipit	@ltx/en_us_oca/he.h.m4:heHE.ThysoSoiMetaFonis.incipit
ltx/en_us_oca/me.m12.d30:meMA.Ode6H.melody	@ltx/en_us_oca/he.h.m4:heHE.ThysoSoiMetaFonis.melody
ltx/en_us_oca/me.m12.d30:meMA.Ode6H.mode	@ltx/en_us_oca/miscellanea:misc.Mode4
ltx/en_us_oca/me.m12.d30:meMA.Ode6H.ode	@ltx/en_us_oca/miscellanea:misc.Ode6
ltx/en_us_oca/me.m12.d30:meMA.Ode6H.text	@ltx/en_us_oca/he.h.m4:heHE.ThysoSoiMetaFonis.text
ltx/en_us_oca/me.m12.d30:meMA.Ode7C11.greekmelody	@ltx/en_us_oca/he.h.m4:heHE.ODiasosasEnPyri.greekname
ltx/en_us_oca/me.m12.d30:meMA.Ode7C11.incipit	…
ltx/en_us_oca/me.m12.d30:meMA.Ode7C11.melody	@ltx/en_us_oca/he.h.m4:heHE.ODiasosasEnPyri.notmetered
ltx/en_us_oca/me.m12.d30:meMA.Ode7C11.mode	@ltx/en_us_oca/miscellanea:misc.Mode4
ltx/en_us_oca/me.m12.d30:meMA.Ode7C11.ode	@ltx/en_us_oca/miscellanea:misc.Ode7
ltx/en_us_oca/me.m12.d30:meMA.Ode7C11.text	
ltx/en_us_oca/me.m12.d30:meMA.Ode7C12.incipit	…
ltx/en_us_oca/me.m12.d30:meMA.Ode7C12.melody	@ltx/en_us_oca/he.h.m4:heHE.ODiasosasEnPyri.notmetered
ltx/en_us_oca/me.m12.d30:meMA.Ode7C12.mode	@ltx/en_us_oca/miscellanea:misc.Mode4
ltx/en_us_oca/me.m12.d30:meMA.Ode7C12.ode	@ltx/en_us_oca/miscellanea:misc.Ode7
ltx/en_us_oca/me.m12.d30:meMA.Ode7C12.text	
ltx/en_us_oca/me.m12.d30:meMA.Ode7C13.incipit	…
ltx/en_us_oca/me.m12.d30:meMA.Ode7C13.melody	@ltx/en_us_oca/he.h.m4:heHE.ODiasosasEnPyri.notmetered
ltx/en_us_oca/me.m12.d30:meMA.Ode7C13.mode	@ltx/en_us_oca/miscellanea:misc.Mode4
ltx/en_us_oca/me.m12.d30:meMA.Ode7C13.ode	@ltx/en_us_oca/miscellanea:misc.Ode7
ltx/en_us_oca/me.m12.d30:meMA.Ode7C13.text	
ltx/en_us_oca/me.m12.d30:meMA.Ode7C1T.incipit	…
ltx/en_us_oca/me.m12.d30:meMA.Ode7C1T.melody	@ltx/en_us_oca/he.h.m4:heHE.ODiasosasEnPyri.notmetered
ltx/en_us_oca/me.m12.d30:meMA.Ode7C1T.mode	@ltx/en_us_oca/miscellanea:misc.Mode4
ltx/en_us_oca/me.m12.d30:meMA.Ode7C1T.ode	@ltx/en_us_oca/miscellanea:misc.Ode7
ltx/en_us_oca/me.m12.d30:meMA.Ode7C1T.text	
ltx/en_us_oca/me.m12.d30:meMA.Ode7C21.greekmelody	@ltx/en_us_oca/he.h.m4:heHE.ODiasosasEnPyri.greekname
ltx/en_us_oca/me.m12.d30:meMA.Ode7C21.incipit	…
ltx/en_us_oca/me.m12.d30:meMA.Ode7C21.melody	@ltx/en_us_oca/he.h.m4:heHE.ODiasosasEnPyri.notmetered
ltx/en_us_oca/me.m12.d30:meMA.Ode7C21.mode	@ltx/en_us_oca/miscellanea:misc.Mode4
ltx/en_us_oca/me.m12.d30:meMA.Ode7C21.ode	@ltx/en_us_oca/miscellanea:misc.Ode7
ltx/en_us_oca/me.m12.d30:meMA.Ode7C21.text	
ltx/en_us_oca/me.m12.d30:meMA.Ode7C22.incipit	…
ltx/en_us_oca/me.m12.d30:meMA.Ode7C22.melody	@ltx/en_us_oca/he.h.m4:heHE.ODiasosasEnPyri.notmetered
ltx/en_us_oca/me.m12.d30:meMA.Ode7C22.mode	@ltx/en_us_oca/miscellanea:misc.Mode4
ltx/en_us_oca/me.m12.d30:meMA.Ode7C22.ode	@ltx/en_us_oca/miscellanea:misc.Ode7
ltx/en_us_oca/me.m12.d30:meMA.Ode7C22.text	
ltx/en_us_oca/me.m12.d30:meMA.Ode7C23.incipit	…
ltx/en_us_oca/me.m12.d30:meMA.Ode7C23.melody	@ltx/en_us_oca/he.h.m4:heHE.ODiasosasEnPyri.notmetered
ltx/en_us_oca/me.m12.d30:meMA.Ode7C23.mode	@ltx/en_us_oca/miscellanea:misc.Mode4
ltx/en_us_oca/me.m12.d30:meMA.Ode7C23.ode	@ltx/en_us_oca/miscellanea:misc.Ode7
ltx/en_us_oca/me.m12.d30:meMA.Ode7C23.text	
ltx/en_us_oca/me.m12.d30:meMA.Ode7C2T.incipit	…
ltx/en_us_oca/me.m12.d30:meMA.Ode7C2T.melody	@ltx/en_us_oca/he.h.m4:heHE.ODiasosasEnPyri.notmetered
ltx/en_us_oca/me.m12.d30:meMA.Ode7C2T.mode	@ltx/en_us_oca/miscellanea:misc.Mode4
ltx/en_us_oca/me.m12.d30:meMA.Ode7C2T.ode	@ltx/en_us_oca/miscellanea:misc.Ode7
ltx/en_us_oca/me.m12.d30:meMA.Ode7C2T.text	
ltx/en_us_oca/me.m12.d30:meMA.Ode8C11.greekmelody	@ltx/en_us_oca/he.h.m4:heHE.CheirasEkpetasasDaniil.greekname
ltx/en_us_oca/me.m12.d30:meMA.Ode8C11.incipit	…
ltx/en_us_oca/me.m12.d30:meMA.Ode8C11.melody	@ltx/en_us_oca/he.h.m4:heHE.CheirasEkpetasasDaniil.notmetered
ltx/en_us_oca/me.m12.d30:meMA.Ode8C11.mode	@ltx/en_us_oca/miscellanea:misc.Mode4
ltx/en_us_oca/me.m12.d30:meMA.Ode8C11.ode	@ltx/en_us_oca/miscellanea:misc.Ode8
ltx/en_us_oca/me.m12.d30:meMA.Ode8C11.text	
ltx/en_us_oca/me.m12.d30:meMA.Ode8C12.incipit	…
ltx/en_us_oca/me.m12.d30:meMA.Ode8C12.melody	@ltx/en_us_oca/he.h.m4:heHE.CheirasEkpetasasDaniil.notmetered
ltx/en_us_oca/me.m12.d30:meMA.Ode8C12.mode	@ltx/en_us_oca/miscellanea:misc.Mode4
ltx/en_us_oca/me.m12.d30:meMA.Ode8C12.ode	@ltx/en_us_oca/miscellanea:misc.Ode8
ltx/en_us_oca/me.m12.d30:meMA.Ode8C12.text	
ltx/en_us_oca/me.m12.d30:meMA.Ode8C13.incipit	…
ltx/en_us_oca/me.m12.d30:meMA.Ode8C13.melody	@ltx/en_us_oca/he.h.m4:heHE.CheirasEkpetasasDaniil.notmetered
ltx/en_us_oca/me.m12.d30:meMA.Ode8C13.mode	@ltx/en_us_oca/miscellanea:misc.Mode4
ltx/en_us_oca/me.m12.d30:meMA.Ode8C13.ode	@ltx/en_us_oca/miscellanea:misc.Ode8
ltx/en_us_oca/me.m12.d30:meMA.Ode8C13.text	
ltx/en_us_oca/me.m12.d30:meMA.Ode8C1T.incipit	…
ltx/en_us_oca/me.m12.d30:meMA.Ode8C1T.melody	@ltx/en_us_oca/he.h.m4:heHE.CheirasEkpetasasDaniil.notmetered
ltx/en_us_oca/me.m12.d30:meMA.Ode8C1T.mode	@ltx/en_us_oca/miscellanea:misc.Mode4
ltx/en_us_oca/me.m12.d30:meMA.Ode8C1T.ode	@ltx/en_us_oca/miscellanea:misc.Ode8
ltx/en_us_oca/me.m12.d30:meMA.Ode8C1T.text	
ltx/en_us_oca/me.m12.d30:meMA.Ode8C21.greekmelody	@ltx/en_us_oca/he.h.m4:heHE.PaidasEvageis.greekname
ltx/en_us_oca/me.m12.d30:meMA.Ode8C21.incipit	…
ltx/en_us_oca/me.m12.d30:meMA.Ode8C21.melody	@ltx/en_us_oca/he.h.m4:heHE.PaidasEvageis.notmetered
ltx/en_us_oca/me.m12.d30:meMA.Ode8C21.mode	@ltx/en_us_oca/miscellanea:misc.Mode4
ltx/en_us_oca/me.m12.d30:meMA.Ode8C21.ode	@ltx/en_us_oca/miscellanea:misc.Ode8
ltx/en_us_oca/me.m12.d30:meMA.Ode8C21.text	
ltx/en_us_oca/me.m12.d30:meMA.Ode8C22.incipit	…
ltx/en_us_oca/me.m12.d30:meMA.Ode8C22.melody	@ltx/en_us_oca/he.h.m4:heHE.PaidasEvageis.notmetered
ltx/en_us_oca/me.m12.d30:meMA.Ode8C22.mode	@ltx/en_us_oca/miscellanea:misc.Mode4
ltx/en_us_oca/me.m12.d30:meMA.Ode8C22.ode	@ltx/en_us_oca/miscellanea:misc.Ode8
ltx/en_us_oca/me.m12.d30:meMA.Ode8C22.text	
ltx/en_us_oca/me.m12.d30:meMA.Ode8C23.incipit	…
ltx/en_us_oca/me.m12.d30:meMA.Ode8C23.melody	@ltx/en_us_oca/he.h.m4:heHE.PaidasEvageis.notmetered
ltx/en_us_oca/me.m12.d30:meMA.Ode8C23.mode	@ltx/en_us_oca/miscellanea:misc.Mode4
ltx/en_us_oca/me.m12.d30:meMA.Ode8C23.ode	@ltx/en_us_oca/miscellanea:misc.Ode8
ltx/en_us_oca/me.m12.d30:meMA.Ode8C23.text	
ltx/en_us_oca/me.m12.d30:meMA.Ode8C2T.incipit	…
ltx/en_us_oca/me.m12.d30:meMA.Ode8C2T.melody	@ltx/en_us_oca/he.h.m4:heHE.PaidasEvageis.notmetered
ltx/en_us_oca/me.m12.d30:meMA.Ode8C2T.mode	@ltx/en_us_oca/miscellanea:misc.Mode4
ltx/en_us_oca/me.m12.d30:meMA.Ode8C2T.ode	@ltx/en_us_oca/miscellanea:misc.Ode8
ltx/en_us_oca/me.m12.d30:meMA.Ode8C2T.text	
ltx/en_us_oca/me.m12.d30:meMA.Ode8H.greekmelody	@ltx/en_us_oca/he.h.m4:heHE.PaidasEvageis.greekname
ltx/en_us_oca/me.m12.d30:meMA.Ode8H.incipit	@ltx/en_us_oca/he.h.m4:heHE.PaidasEvageis.incipit
ltx/en_us_oca/me.m12.d30:meMA.Ode8H.melody	@ltx/en_us_oca/he.h.m4:heHE.PaidasEvageis.melody
ltx/en_us_oca/me.m12.d30:meMA.Ode8H.mode	@ltx/en_us_oca/miscellanea:misc.Mode4
ltx/en_us_oca/me.m12.d30:meMA.Ode8H.ode	@ltx/en_us_oca/miscellanea:misc.Ode8
ltx/en_us_oca/me.m12.d30:meMA.Ode8H.text	@ltx/en_us_oca/he.h.m4:heHE.PaidasEvageis.text
ltx/en_us_oca/me.m12.d30:meMA.Ode9C11.greekmelody	@ltx/en_us_oca/he.h.m4:heHE.LithosAcheirotmitos.greekname
ltx/en_us_oca/me.m12.d30:meMA.Ode9C11.incipit	…
ltx/en_us_oca/me.m12.d30:meMA.Ode9C11.melody	@ltx/en_us_oca/he.h.m4:heHE.LithosAcheirotmitos.notmetered
ltx/en_us_oca/me.m12.d30:meMA.Ode9C11.mode	@ltx/en_us_oca/miscellanea:misc.Mode4
ltx/en_us_oca/me.m12.d30:meMA.Ode9C11.ode	@ltx/en_us_oca/miscellanea:misc.Ode9
ltx/en_us_oca/me.m12.d30:meMA.Ode9C11.text	
ltx/en_us_oca/me.m12.d30:meMA.Ode9C12.incipit	…
ltx/en_us_oca/me.m12.d30:meMA.Ode9C12.melody	@ltx/en_us_oca/he.h.m4:heHE.LithosAcheirotmitos.notmetered
ltx/en_us_oca/me.m12.d30:meMA.Ode9C12.mode	@ltx/en_us_oca/miscellanea:misc.Mode4
ltx/en_us_oca/me.m12.d30:meMA.Ode9C12.ode	@ltx/en_us_oca/miscellanea:misc.Ode9
ltx/en_us_oca/me.m12.d30:meMA.Ode9C12.text	
ltx/en_us_oca/me.m12.d30:meMA.Ode9C13.incipit	…
ltx/en_us_oca/me.m12.d30:meMA.Ode9C13.melody	@ltx/en_us_oca/he.h.m4:heHE.LithosAcheirotmitos.notmetered
ltx/en_us_oca/me.m12.d30:meMA.Ode9C13.mode	@ltx/en_us_oca/miscellanea:misc.Mode4
ltx/en_us_oca/me.m12.d30:meMA.Ode9C13.ode	@ltx/en_us_oca/miscellanea:misc.Ode9
ltx/en_us_oca/me.m12.d30:meMA.Ode9C13.text	
ltx/en_us_oca/me.m12.d30:meMA.Ode9C1T.incipit	…
ltx/en_us_oca/me.m12.d30:meMA.Ode9C1T.melody	@ltx/en_us_oca/he.h.m4:heHE.LithosAcheirotmitos.notmetered
ltx/en_us_oca/me.m12.d30:meMA.Ode9C1T.mode	@ltx/en_us_oca/miscellanea:misc.Mode4
ltx/en_us_oca/me.m12.d30:meMA.Ode9C1T.ode	@ltx/en_us_oca/miscellanea:misc.Ode9
ltx/en_us_oca/me.m12.d30:meMA.Ode9C1T.text	
ltx/en_us_oca/me.m12.d30:meMA.Ode9C21.greekmelody	@ltx/en_us_oca/he.h.m4:heHE.EvaMenToTisParakois.greekname
ltx/en_us_oca/me.m12.d30:meMA.Ode9C21.incipit	…
ltx/en_us_oca/me.m12.d30:meMA.Ode9C21.melody	@ltx/en_us_oca/he.h.m4:heHE.EvaMenToTisParakois.notmetered
ltx/en_us_oca/me.m12.d30:meMA.Ode9C21.mode	@ltx/en_us_oca/miscellanea:misc.Mode4
ltx/en_us_oca/me.m12.d30:meMA.Ode9C21.ode	@ltx/en_us_oca/miscellanea:misc.Ode9
ltx/en_us_oca/me.m12.d30:meMA.Ode9C21.text	
ltx/en_us_oca/me.m12.d30:meMA.Ode9C22.incipit	…
ltx/en_us_oca/me.m12.d30:meMA.Ode9C22.melody	@ltx/en_us_oca/he.h.m4:heHE.EvaMenToTisParakois.notmetered
ltx/en_us_oca/me.m12.d30:meMA.Ode9C22.mode	@ltx/en_us_oca/miscellanea:misc.Mode4
ltx/en_us_oca/me.m12.d30:meMA.Ode9C22.ode	@ltx/en_us_oca/miscellanea:misc.Ode9
ltx/en_us_oca/me.m12.d30:meMA.Ode9C22.text	
ltx/en_us_oca/me.m12.d30:meMA.Ode9C23.incipit	…
ltx/en_us_oca/me.m12.d30:meMA.Ode9C23.melody	@ltx/en_us_oca/he.h.m4:heHE.EvaMenToTisParakois.notmetered
ltx/en_us_oca/me.m12.d30:meMA.Ode9C23.mode	@ltx/en_us_oca/miscellanea:misc.Mode4
ltx/en_us_oca/me.m12.d30:meMA.Ode9C23.ode	@ltx/en_us_oca/miscellanea:misc.Ode9
ltx/en_us_oca/me.m12.d30:meMA.Ode9C23.text	
ltx/en_us_oca/me.m12.d30:meMA.Ode9C2T.incipit	…
ltx/en_us_oca/me.m12.d30:meMA.Ode9C2T.melody	@ltx/en_us_oca/he.h.m4:heHE.EvaMenToTisParakois.notmetered
ltx/en_us_oca/me.m12.d30:meMA.Ode9C2T.mode	@ltx/en_us_oca/miscellanea:misc.Mode4
ltx/en_us_oca/me.m12.d30:meMA.Ode9C2T.ode	@ltx/en_us_oca/miscellanea:misc.Ode9
ltx/en_us_oca/me.m12.d30:meMA.Ode9C2T.text	
ltx/en_us_oca/me.m12.d30:meMA.Ode9H.greekmelody	@ltx/en_us_oca/he.h.m4:heHE.EvaMenToTisParakois.greekname
ltx/en_us_oca/me.m12.d30:meMA.Ode9H.incipit	@ltx/en_us_oca/he.h.m4:heHE.EvaMenToTisParakois.incipit
ltx/en_us_oca/me.m12.d30:meMA.Ode9H.melody	@ltx/en_us_oca/he.h.m4:heHE.EvaMenToTisParakois.melody
ltx/en_us_oca/me.m12.d30:meMA.Ode9H.mode	@ltx/en_us_oca/miscellanea:misc.Mode4
ltx/en_us_oca/me.m12.d30:meMA.Ode9H.ode	@ltx/en_us_oca/miscellanea:misc.Ode9
ltx/en_us_oca/me.m12.d30:meMA.Ode9H.text	@ltx/en_us_oca/he.h.m4:heHE.EvaMenToTisParakois.text
ltx/en_us_oca/me.m12.d30:meMA.Oikos1.text	
ltx/en_us_oca/me.m12.d30:meVE.Apolytikion1ger.greekmelody	@ltx/en_us_oca/he.a.m4:heAU.TachyProkatalave.greekname
ltx/en_us_oca/me.m12.d30:meVE.Apolytikion1ger.incipit	…
ltx/en_us_oca/me.m12.d30:meVE.Apolytikion1ger.melody	@ltx/en_us_oca/he.a.m4:heAU.TachyProkatalave.notmetered
ltx/en_us_oca/me.m12.d30:meVE.Apolytikion1ger.mode	@ltx/en_us_oca/miscellanea:misc.Mode4
ltx/en_us_oca/me.m12.d30:meVE.Apolytikion1ger.poet	@ltx/en_us_oca/poets:po.Gerasimou
ltx/en_us_oca/me.m12.d30:meVE.Apolytikion1ger.text	
ltx/en_us_oca/me.m12.d30:meVE.AposBoth.incipit	@ltx/en_us_oca/me.m12.d28:meVE.Stichera01.incipit
ltx/en_us_oca/me.m12.d30:meVE.AposBoth.melody	@ltx/en_us_oca/he.a.m5:heAU.ChairoisAskitikon.notmetered
ltx/en_us_oca/me.m12.d30:meVE.AposBoth.mode	@ltx/en_us_oca/miscellanea:misc.Mode5
ltx/en_us_oca/me.m12.d30:meVE.AposBoth.text	@ltx/en_us_oca/me.m12.d28:meVE.Stichera01.text
ltx/en_us_oca/me.m12.d30:meVE.AposGlory.incipit	@ltx/en_us_oca/me.m12.d28:meVE.Stichera02.incipit
ltx/en_us_oca/me.m12.d30:meVE.AposGlory.melody	@ltx/en_us_oca/he.a.m5:heAU.ChairoisAskitikon.notmetered
ltx/en_us_oca/me.m12.d30:meVE.AposGlory.mode	@ltx/en_us_oca/miscellanea:misc.Mode5
ltx/en_us_oca/me.m12.d30:meVE.AposGlory.text	@ltx/en_us_oca/me.m12.d28:meVE.Stichera02.text
ltx/en_us_oca/me.m12.d30:meVE.Aposticha1.greekmelody	@ltx/en_us_oca/he.a.m5:heAU.ChairoisAskitikon.greekname
ltx/en_us_oca/me.m12.d30:meVE.Aposticha1.incipit	The Magi, kings from the…
ltx/en_us_oca/me.m12.d30:meVE.Aposticha1.melody	@ltx/en_us_oca/he.a.m5:heAU.ChairoisAskitikon.notmetered
ltx/en_us_oca/me.m12.d30:meVE.Aposticha1.mode	@ltx/en_us_oca/miscellanea:misc.Mode5
ltx/en_us_oca/me.m12.d30:meVE.Aposticha1.text	The Magi, kings from the east, ⁄ brought gifts and worshipped the true king, Creator, and God of all ⁄ Who has shone forth from a royal Virgin. ⁄ The all-pure one spoke to them fearfully: ⁄ Look upon me, worshippers of fire and sun! ⁄ How will you, who walk in darkness, grasp what is beyond understanding? ⁄ Know Him, Who has assumed our flesh and enlightens all! ⁄ He is born on earth, in a cave. ⁄ In His compassion He has come into the world, ⁄⁄ granting us great mercy!
ltx/en_us_oca/me.m12.d30:meVE.Aposticha2.incipit	We have heard the words…
ltx/en_us_oca/me.m12.d30:meVE.Aposticha2.melody	@ltx/en_us_oca/he.a.m5:heAU.ChairoisAskitikon.notmetered
ltx/en_us_oca/me.m12.d30:meVE.Aposticha2.mode	@ltx/en_us_oca/miscellanea:misc.Mode5
ltx/en_us_oca/me.m12.d30:meVE.Aposticha2.text	We have heard the words of Balaam, ⁄ the Magi answered the pure one; ⁄ we have carefully observed the heavens. ⁄ We have seen the birth of a star, radiant with pure light. ⁄ Its rising in perfection was strange to us. ⁄ We have followed it; we did not delay to hurry on our way. ⁄ Tell us! Who is this mighty Child you hold in your arms? ⁄ How can we worthily adore this great mystery, all-holy one? ⁄⁄ Through you the world is given great mercy!
ltx/en_us_oca/me.m12.d30:meVE.Aposticha3.incipit	I will teach you something…
ltx/en_us_oca/me.m12.d30:meVE.Aposticha3.melody	@ltx/en_us_oca/he.a.m5:heAU.ChairoisAskitikon.notmetered
ltx/en_us_oca/me.m12.d30:meVE.Aposticha3.mode	@ltx/en_us_oca/miscellanea:misc.Mode5
ltx/en_us_oca/me.m12.d30:meVE.Aposticha3.text	I will teach you something beyond all words and understanding, ⁄ the maiden told the Magi. ⁄ I see that He for whom you search is my Child. ⁄ Behold something new and strange, ⁄ for He Who reigns with the eternal Father willingly bears my poverty ⁄ in order to enrich greatly those poor in knowledge. ⁄ He will carry us from death into Paradise. ⁄⁄ He it is Who grants the world great mercy!
ltx/en_us_oca/me.m12.d30:meVE.SticGlory.incipit	Let the heavens be glad…
ltx/en_us_oca/me.m12.d30:meVE.SticGlory.melody	
ltx/en_us_oca/me.m12.d30:meVE.SticGlory.mode	@ltx/en_us_oca/miscellanea:misc.Mode5
ltx/en_us_oca/me.m12.d30:meVE.SticGlory.poet	@ltx/en_us_oca/poets:po.IoannouMonachou
ltx/en_us_oca/me.m12.d30:meVE.SticGlory.text	Let the heavens be glad, and let the earth rejoice! ⁄ Today the Good Shepherd of angels and men has come. ⁄ Wonder! The Invisible One is seen. ⁄ the uncontainable one is held! ⁄ He Who has no beginning begins to be; ⁄ the Son of God becomes the Son of man. ⁄ The Virgin who has not known man is seen to be Mother of God. ⁄ After childbearing she remains a Virgin. ⁄ the Word of the Father takes flesh and is laid in a manger. ⁄ Shepherds become partakers and heralds of the mystery. ⁄ Magi from the east, led by a star, ⁄ worship the newborn Savior and offer precious gifts. ⁄ Come, lovers of feasts! ⁄ Let us hasten to open the treasures of our hearts. ⁄ Let us offer Him works of goodness: faith, hope and love. ⁄ These will be our gold, myrrh and frankincense. ⁄ Let us shout with the voice of the bodiless hosts: ⁄ Glory to God in the highest, ⁄ and on earth peace, good will to men, ⁄⁄ for You are come to save our human race from sin.
ltx/en_us_oca/me.m12.d30:meVE.Stichera01.greekmelody	@ltx/en_us_oca/he.a.m4:heAU.OsGennaionEnMartysi.greekname
ltx/en_us_oca/me.m12.d30:meVE.Stichera01.incipit	…
ltx/en_us_oca/me.m12.d30:meVE.Stichera01.melody	@ltx/en_us_oca/he.a.m4:heAU.OsGennaionEnMartysi.notmetered
ltx/en_us_oca/me.m12.d30:meVE.Stichera01.mode	@ltx/en_us_oca/miscellanea:misc.Mode4
ltx/en_us_oca/me.m12.d30:meVE.Stichera01.text	
ltx/en_us_oca/me.m12.d30:meVE.Stichera02.incipit	…
ltx/en_us_oca/me.m12.d30:meVE.Stichera02.melody	@ltx/en_us_oca/he.a.m4:heAU.OsGennaionEnMartysi.notmetered
ltx/en_us_oca/me.m12.d30:meVE.Stichera02.mode	@ltx/en_us_oca/miscellanea:misc.Mode4
ltx/en_us_oca/me.m12.d30:meVE.Stichera02.text	
ltx/en_us_oca/me.m12.d30:meVE.Stichera03.incipit	…
ltx/en_us_oca/me.m12.d30:meVE.Stichera03.melody	@ltx/en_us_oca/he.a.m4:heAU.OsGennaionEnMartysi.notmetered
ltx/en_us_oca/me.m12.d30:meVE.Stichera03.mode	@ltx/en_us_oca/miscellanea:misc.Mode4
ltx/en_us_oca/me.m12.d30:meVE.Stichera03.text	
ltx/en_us_oca/me.m12.d30:meVE.Stichera04.greekmelody	@ltx/en_us_oca/he.a.m4:heAU.OExYpsistouKlitheis.greekname
ltx/en_us_oca/me.m12.d30:meVE.Stichera04.incipit	…
ltx/en_us_oca/me.m12.d30:meVE.Stichera04.melody	@ltx/en_us_oca/he.a.m4:heAU.OExYpsistouKlitheis.notmetered
ltx/en_us_oca/me.m12.d30:meVE.Stichera04.mode	@ltx/en_us_oca/miscellanea:misc.Mode4
ltx/en_us_oca/me.m12.d30:meVE.Stichera04.text	
ltx/en_us_oca/me.m12.d30:meVE.Stichera05.incipit	…
ltx/en_us_oca/me.m12.d30:meVE.Stichera05.melody	@ltx/en_us_oca/he.a.m4:heAU.OExYpsistouKlitheis.notmetered
ltx/en_us_oca/me.m12.d30:meVE.Stichera05.mode	@ltx/en_us_oca/miscellanea:misc.Mode4
ltx/en_us_oca/me.m12.d30:meVE.Stichera05.text	
ltx/en_us_oca/me.m12.d30:meVE.Stichera06.incipit	…
ltx/en_us_oca/me.m12.d30:meVE.Stichera06.melody	@ltx/en_us_oca/he.a.m4:heAU.OExYpsistouKlitheis.notmetered
ltx/en_us_oca/me.m12.d30:meVE.Stichera06.mode	@ltx/en_us_oca/miscellanea:misc.Mode4
ltx/en_us_oca/me.m12.d30:meVE.Stichera06.text	
