ltx/en_us_oca/da.d3:daCommemoration.text	
ltx/en_us_oca/da.d3:daDay.text	
ltx/en_us_oca/da.d3:daForDay.text	
ltx/en_us_oca/da.d3:daLI.MM.CommunionHymn.text	
ltx/en_us_oca/da.d3:daMA.ExapTheotokion1.greekmelody	@ltx/en_us_oca/he.a.m3:heAU.OOuranonToisAstrois.greekname
ltx/en_us_oca/da.d3:daMA.ExapTheotokion1.incipit	…
ltx/en_us_oca/da.d3:daMA.ExapTheotokion1.melody	@ltx/en_us_oca/he.a.m3:heAU.OOuranonToisAstrois.notmetered
ltx/en_us_oca/da.d3:daMA.ExapTheotokion1.mode	@ltx/en_us_oca/miscellanea:misc.Mode3
ltx/en_us_oca/da.d3:daMA.ExapTheotokion1.text	
ltx/en_us_oca/da.d3:daMA.Exaposteilarion1.greekmelody	@ltx/en_us_oca/he.a.m3:heAU.OOuranonToisAstrois.greekname
ltx/en_us_oca/da.d3:daMA.Exaposteilarion1.incipit	…
ltx/en_us_oca/da.d3:daMA.Exaposteilarion1.melody	@ltx/en_us_oca/he.a.m3:heAU.OOuranonToisAstrois.notmetered
ltx/en_us_oca/da.d3:daMA.Exaposteilarion1.mode	@ltx/en_us_oca/miscellanea:misc.Mode3
ltx/en_us_oca/da.d3:daMA.Exaposteilarion1.text	
ltx/en_us_oca/da.d3:daMA.Photagogic1Beginning.text	
ltx/en_us_oca/da.d3:daMA.Photagogic1Ending.text	
ltx/en_us_oca/da.d3:daMA.Photagogic2Beginning.text	@ltx/en_us_oca/prayers:pr.photagogic_begin_Saints.text
ltx/en_us_oca/da.d3:daMA.Photagogic2Ending.text	@ltx/en_us_oca/prayers:pr.photagogic_end_Saints.text
ltx/en_us_oca/da.d3:daMA.Photagogic3Beginning.text	@ltx/en_us_oca/prayers:pr.photagogic_begin_Theotokos.text
ltx/en_us_oca/da.d3:daMA.Photagogic3Ending.text	@ltx/en_us_oca/prayers:pr.photagogic_end_Theotokos.text
ltx/en_us_oca/da.d3:daMA.Triadic1Ending.text	
ltx/en_us_oca/da.d3:daMA.Triadic2Ending.text	@ltx/en_us_oca/prayers:pr.triadic_end_Saints.text
ltx/en_us_oca/da.d3:daMA.Triadic3Ending.text	@ltx/en_us_oca/prayers:pr.triadic_end_Theotokos.text
ltx/en_us_oca/da.d3:daOnDay.text	
ltx/en_us_oca/da.d3:daVE.ApolTheotokion.incipit	@ltx/en_us_oca/oc.m2.d3:ocVE.ApolTheotokionVM.incipit
ltx/en_us_oca/da.d3:daVE.ApolTheotokion.melody	
ltx/en_us_oca/da.d3:daVE.ApolTheotokion.mode	@ltx/en_us_oca/miscellanea:misc.Mode2
ltx/en_us_oca/da.d3:daVE.ApolTheotokion.text	@ltx/en_us_oca/oc.m2.d3:ocVE.ApolTheotokionVM.text
ltx/en_us_oca/da.d3:daVE.Apolytikion1.incipit	@ltx/en_us_oca/me.m08.d29:meVE.Apolytikion1.incipit
ltx/en_us_oca/da.d3:daVE.Apolytikion1.melody	
ltx/en_us_oca/da.d3:daVE.Apolytikion1.mode	@ltx/en_us_oca/miscellanea:misc.Mode2
ltx/en_us_oca/da.d3:daVE.Apolytikion1.text	@ltx/en_us_oca/me.m08.d29:meVE.Apolytikion1.text
ltx/en_us_oca/da.d3:daVE.OnTheDayBefore.text	
ltx/en_us_oca/da.d3:daVE.OnTheEveningBefore.text	@ltx/en_us_oca/template.titles:d.onMondayEvening
