ltx/en_us_oca/me.m01.d16:meDA.commemoration.first	
ltx/en_us_oca/me.m01.d16:meDA.commemoration.first_name	
ltx/en_us_oca/me.m01.d16:meDA.commemoration.first_short	
ltx/en_us_oca/me.m01.d16:meDA.commemoration.first_title	
ltx/en_us_oca/me.m01.d16:meDA.commemoration.full	
ltx/en_us_oca/me.m01.d16:meDA.commemoration.second_name	
ltx/en_us_oca/me.m01.d16:meDA.commemoration.second_title	
ltx/en_us_oca/me.m01.d16:meDA.date	
ltx/en_us_oca/me.m01.d16:meDA.fordate	
ltx/en_us_oca/me.m01.d16:meDA.insert1	
ltx/en_us_oca/me.m01.d16:meDA.insert2	
ltx/en_us_oca/me.m01.d16:meDA.note	
ltx/en_us_oca/me.m01.d16:meDA.pdfcoverdate	
ltx/en_us_oca/me.m01.d16:meDA.pdfheaderdate	
ltx/en_us_oca/me.m01.d16:meHO.commemorations	
ltx/en_us_oca/me.m01.d16:meHO.note1	@ltx/en_us_oca/rubrical:ru.WineOil
ltx/en_us_oca/me.m01.d16:meHO.note2	
ltx/en_us_oca/me.m01.d16:meHO.number	
ltx/en_us_oca/me.m01.d16:meHO.rank	
ltx/en_us_oca/me.m01.d16:meLE.commemoration1	
ltx/en_us_oca/me.m01.d16:meLE.commemoration2	
ltx/en_us_oca/me.m01.d16:meLI.Kontakion1.greekmelody	@ltx/en_us_oca/me.m01.d16:meMA.Kontakion1.greekmelody
ltx/en_us_oca/me.m01.d16:meLI.Kontakion1.incipit	@ltx/en_us_oca/me.m01.d16:meMA.Kontakion1.incipit
ltx/en_us_oca/me.m01.d16:meLI.Kontakion1.melody	@ltx/en_us_oca/me.m01.d16:meMA.Kontakion1.melody
ltx/en_us_oca/me.m01.d16:meLI.Kontakion1.mode	@ltx/en_us_oca/me.m01.d16:meMA.Kontakion1.mode
ltx/en_us_oca/me.m01.d16:meLI.Kontakion1.text	@ltx/en_us_oca/me.m01.d16:meMA.Kontakion1.text
ltx/en_us_oca/me.m01.d16:meLI.MM.CommunionHymn.text	@ltx/en_us_oca/properties:media.key
ltx/en_us_oca/me.m01.d16:meLI.Megalynarion.text	
ltx/en_us_oca/me.m01.d16:meMA.AposGlory.incipit	…
ltx/en_us_oca/me.m01.d16:meMA.AposGlory.melody	
ltx/en_us_oca/me.m01.d16:meMA.AposGlory.mode	@ltx/en_us_oca/miscellanea:misc.Mode4
ltx/en_us_oca/me.m01.d16:meMA.AposGlory.poet	@ltx/en_us_oca/poets:po.Anatoliou
ltx/en_us_oca/me.m01.d16:meMA.AposGlory.text	
ltx/en_us_oca/me.m01.d16:meMA.AposStavrotheotokion.greekmelody	@ltx/en_us_oca/he.a.m4:heAU.EdokasSimeiosin.greekname
ltx/en_us_oca/me.m01.d16:meMA.AposStavrotheotokion.incipit	@ltx/en_us_oca/oc.m4.d4:ocVE.SticTheotokion.incipit
ltx/en_us_oca/me.m01.d16:meMA.AposStavrotheotokion.melody	@ltx/en_us_oca/he.a.m4:heAU.EdokasSimeiosin.notmetered
ltx/en_us_oca/me.m01.d16:meMA.AposStavrotheotokion.mode	@ltx/en_us_oca/miscellanea:misc.Mode4
ltx/en_us_oca/me.m01.d16:meMA.AposStavrotheotokion.text	@ltx/en_us_oca/oc.m4.d4:ocVE.SticTheotokion.text
ltx/en_us_oca/me.m01.d16:meMA.AposTheotokion.greekmelody	@ltx/en_us_oca/he.a.m4:heAU.EdokasSimeiosin.greekname
ltx/en_us_oca/me.m01.d16:meMA.AposTheotokion.incipit	@ltx/en_us_oca/oc.m4.d4:ocVE.Stichera6.incipit
ltx/en_us_oca/me.m01.d16:meMA.AposTheotokion.melody	@ltx/en_us_oca/he.a.m4:heAU.EdokasSimeiosin.notmetered
ltx/en_us_oca/me.m01.d16:meMA.AposTheotokion.mode	@ltx/en_us_oca/miscellanea:misc.Mode4
ltx/en_us_oca/me.m01.d16:meMA.AposTheotokion.text	@ltx/en_us_oca/oc.m4.d4:ocVE.Stichera6.text
ltx/en_us_oca/me.m01.d16:meMA.C1.acrostic.notice1	
ltx/en_us_oca/me.m01.d16:meMA.C1.acrostic.text	
ltx/en_us_oca/me.m01.d16:meMA.C1.acrostic.title	
ltx/en_us_oca/me.m01.d16:meMA.C1.title	@ltx/en_us_oca/titles:ti.Canon1Apostle
ltx/en_us_oca/me.m01.d16:meMA.C1.verse	@ltx/en_us_oca/prayers:pr.verse_Apostle.text
ltx/en_us_oca/me.m01.d16:meMA.C2.acrostic.notice1	
ltx/en_us_oca/me.m01.d16:meMA.C2.acrostic.text	
ltx/en_us_oca/me.m01.d16:meMA.C2.acrostic.title	
ltx/en_us_oca/me.m01.d16:meMA.C2.title	@ltx/en_us_oca/titles:ti.Canon2Apostle
ltx/en_us_oca/me.m01.d16:meMA.C2.verse	@ltx/en_us_oca/prayers:pr.verse_Apostle.text
ltx/en_us_oca/me.m01.d16:meMA.ExapTheotokion.incipit	…
ltx/en_us_oca/me.m01.d16:meMA.ExapTheotokion.melody	@ltx/en_us_oca/he.a.m2:heAU.GynaikesAkoutisthite.notmetered
ltx/en_us_oca/me.m01.d16:meMA.ExapTheotokion.mode	@ltx/en_us_oca/miscellanea:misc.Mode2
ltx/en_us_oca/me.m01.d16:meMA.ExapTheotokion.text	
ltx/en_us_oca/me.m01.d16:meMA.Exaposteilarion1.greekmelody	@ltx/en_us_oca/he.a.m2:heAU.GynaikesAkoutisthite.greekname
ltx/en_us_oca/me.m01.d16:meMA.Exaposteilarion1.incipit	…
ltx/en_us_oca/me.m01.d16:meMA.Exaposteilarion1.melody	@ltx/en_us_oca/he.a.m2:heAU.GynaikesAkoutisthite.notmetered
ltx/en_us_oca/me.m01.d16:meMA.Exaposteilarion1.mode	@ltx/en_us_oca/miscellanea:misc.Mode2
ltx/en_us_oca/me.m01.d16:meMA.Exaposteilarion1.text	
ltx/en_us_oca/me.m01.d16:meMA.Kontakion1.greekmelody	@ltx/en_us_oca/he.a.m6:heAU.TinEnPresveiais.greekname
ltx/en_us_oca/me.m01.d16:meMA.Kontakion1.incipit	…
ltx/en_us_oca/me.m01.d16:meMA.Kontakion1.melody	@ltx/en_us_oca/he.a.m6:heAU.TinEnPresveiais.notmetered
ltx/en_us_oca/me.m01.d16:meMA.Kontakion1.mode	@ltx/en_us_oca/miscellanea:misc.Mode2
ltx/en_us_oca/me.m01.d16:meMA.Kontakion1.text	
ltx/en_us_oca/me.m01.d16:meMA.Lauds1.greekmelody	@ltx/en_us_oca/he.a.m6:heAU.TriimerosAnestis.greekname
ltx/en_us_oca/me.m01.d16:meMA.Lauds1.incipit	…
ltx/en_us_oca/me.m01.d16:meMA.Lauds1.melody	@ltx/en_us_oca/he.a.m6:heAU.TriimerosAnestis.notmetered
ltx/en_us_oca/me.m01.d16:meMA.Lauds1.mode	@ltx/en_us_oca/miscellanea:misc.Mode6
ltx/en_us_oca/me.m01.d16:meMA.Lauds1.text	
ltx/en_us_oca/me.m01.d16:meMA.Lauds2.incipit	…
ltx/en_us_oca/me.m01.d16:meMA.Lauds2.melody	@ltx/en_us_oca/he.a.m6:heAU.TriimerosAnestis.notmetered
ltx/en_us_oca/me.m01.d16:meMA.Lauds2.mode	@ltx/en_us_oca/miscellanea:misc.Mode6
ltx/en_us_oca/me.m01.d16:meMA.Lauds2.text	
ltx/en_us_oca/me.m01.d16:meMA.Lauds3.incipit	…
ltx/en_us_oca/me.m01.d16:meMA.Lauds3.melody	@ltx/en_us_oca/he.a.m6:heAU.TriimerosAnestis.notmetered
ltx/en_us_oca/me.m01.d16:meMA.Lauds3.mode	@ltx/en_us_oca/miscellanea:misc.Mode6
ltx/en_us_oca/me.m01.d16:meMA.Lauds3.text	
ltx/en_us_oca/me.m01.d16:meMA.LaudsGlory.incipit	By his three-fold question: Peter…
ltx/en_us_oca/me.m01.d16:meMA.LaudsGlory.melody	
ltx/en_us_oca/me.m01.d16:meMA.LaudsGlory.mode	@ltx/en_us_oca/miscellanea:misc.Mode4
ltx/en_us_oca/me.m01.d16:meMA.LaudsGlory.text	By his three-fold question: Peter, do you love me? ⁄ Christ set aside your three-fold denial. ⁄ Then Simon said to Him who knows the secrets of men: ⁄ Lord, You know all things; ⁄ You know that I love You! ⁄ Then the Savior said to him: ⁄ Feed my sheep; feed my chosen ones; ⁄ feed my lambs which I have gained for salvation by My Own blood! ⁄ Ever entreat Him, divinely blessed Apostle, ⁄⁄ that He may grant us great mercy!
ltx/en_us_oca/me.m01.d16:meMA.LaudsStavrotheotokion.greekmelody	@ltx/en_us_oca/he.a.m4:heAU.OsGennaionEnMartysi.greekname
ltx/en_us_oca/me.m01.d16:meMA.LaudsStavrotheotokion.incipit	…
ltx/en_us_oca/me.m01.d16:meMA.LaudsStavrotheotokion.melody	@ltx/en_us_oca/he.a.m4:heAU.OsGennaionEnMartysi.notmetered
ltx/en_us_oca/me.m01.d16:meMA.LaudsStavrotheotokion.mode	@ltx/en_us_oca/miscellanea:misc.Mode4
ltx/en_us_oca/me.m01.d16:meMA.LaudsStavrotheotokion.text	
ltx/en_us_oca/me.m01.d16:meMA.LaudsTheotokion.greekmelody	@ltx/en_us_oca/he.a.m4:heAU.OsGennaionEnMartysi.greekname
ltx/en_us_oca/me.m01.d16:meMA.LaudsTheotokion.incipit	@ltx/en_us_oca/oc.m4.d2:ocVE.SticTheotokion.incipit
ltx/en_us_oca/me.m01.d16:meMA.LaudsTheotokion.melody	@ltx/en_us_oca/he.a.m4:heAU.OsGennaionEnMartysi.notmetered
ltx/en_us_oca/me.m01.d16:meMA.LaudsTheotokion.mode	@ltx/en_us_oca/miscellanea:misc.Mode4
ltx/en_us_oca/me.m01.d16:meMA.LaudsTheotokion.text	@ltx/en_us_oca/oc.m4.d2:ocVE.SticTheotokion.text
ltx/en_us_oca/me.m01.d16:meMA.MM.Lauds1123as5678.text	@ltx/en_us_oca/properties:media.key
ltx/en_us_oca/me.m01.d16:meMA.Ode1C11.greekmelody	@ltx/en_us_oca/he.h.m4:heHE.AnoixoToStomaMou.greekname
ltx/en_us_oca/me.m01.d16:meMA.Ode1C11.incipit	…
ltx/en_us_oca/me.m01.d16:meMA.Ode1C11.melody	@ltx/en_us_oca/he.h.m4:heHE.AnoixoToStomaMou.notmetered
ltx/en_us_oca/me.m01.d16:meMA.Ode1C11.mode	@ltx/en_us_oca/miscellanea:misc.Mode4
ltx/en_us_oca/me.m01.d16:meMA.Ode1C11.ode	@ltx/en_us_oca/miscellanea:misc.Ode1
ltx/en_us_oca/me.m01.d16:meMA.Ode1C11.text	
ltx/en_us_oca/me.m01.d16:meMA.Ode1C12.incipit	…
ltx/en_us_oca/me.m01.d16:meMA.Ode1C12.melody	@ltx/en_us_oca/he.h.m4:heHE.AnoixoToStomaMou.notmetered
ltx/en_us_oca/me.m01.d16:meMA.Ode1C12.mode	@ltx/en_us_oca/miscellanea:misc.Mode4
ltx/en_us_oca/me.m01.d16:meMA.Ode1C12.ode	@ltx/en_us_oca/miscellanea:misc.Ode1
ltx/en_us_oca/me.m01.d16:meMA.Ode1C12.text	
ltx/en_us_oca/me.m01.d16:meMA.Ode1C13.incipit	…
ltx/en_us_oca/me.m01.d16:meMA.Ode1C13.melody	@ltx/en_us_oca/he.h.m4:heHE.AnoixoToStomaMou.notmetered
ltx/en_us_oca/me.m01.d16:meMA.Ode1C13.mode	@ltx/en_us_oca/miscellanea:misc.Mode4
ltx/en_us_oca/me.m01.d16:meMA.Ode1C13.ode	@ltx/en_us_oca/miscellanea:misc.Ode1
ltx/en_us_oca/me.m01.d16:meMA.Ode1C13.text	
ltx/en_us_oca/me.m01.d16:meMA.Ode1C14.incipit	…
ltx/en_us_oca/me.m01.d16:meMA.Ode1C14.melody	@ltx/en_us_oca/he.h.m4:heHE.AnoixoToStomaMou.notmetered
ltx/en_us_oca/me.m01.d16:meMA.Ode1C14.mode	@ltx/en_us_oca/miscellanea:misc.Mode4
ltx/en_us_oca/me.m01.d16:meMA.Ode1C14.ode	@ltx/en_us_oca/miscellanea:misc.Ode1
ltx/en_us_oca/me.m01.d16:meMA.Ode1C14.text	
ltx/en_us_oca/me.m01.d16:meMA.Ode1C1T.incipit	…
ltx/en_us_oca/me.m01.d16:meMA.Ode1C1T.melody	@ltx/en_us_oca/he.h.m4:heHE.AnoixoToStomaMou.notmetered
ltx/en_us_oca/me.m01.d16:meMA.Ode1C1T.mode	@ltx/en_us_oca/miscellanea:misc.Mode4
ltx/en_us_oca/me.m01.d16:meMA.Ode1C1T.ode	@ltx/en_us_oca/miscellanea:misc.Ode1
ltx/en_us_oca/me.m01.d16:meMA.Ode1C1T.text	
ltx/en_us_oca/me.m01.d16:meMA.Ode1C21.greekmelody	@ltx/en_us_oca/he.h.m4:heHE.ChoroiIsrail.greekname
ltx/en_us_oca/me.m01.d16:meMA.Ode1C21.incipit	…
ltx/en_us_oca/me.m01.d16:meMA.Ode1C21.melody	@ltx/en_us_oca/he.h.m4:heHE.ChoroiIsrail.notmetered
ltx/en_us_oca/me.m01.d16:meMA.Ode1C21.mode	@ltx/en_us_oca/miscellanea:misc.Mode4
ltx/en_us_oca/me.m01.d16:meMA.Ode1C21.ode	@ltx/en_us_oca/miscellanea:misc.Ode1
ltx/en_us_oca/me.m01.d16:meMA.Ode1C21.text	
ltx/en_us_oca/me.m01.d16:meMA.Ode1C22.incipit	…
ltx/en_us_oca/me.m01.d16:meMA.Ode1C22.melody	@ltx/en_us_oca/he.h.m4:heHE.ChoroiIsrail.notmetered
ltx/en_us_oca/me.m01.d16:meMA.Ode1C22.mode	@ltx/en_us_oca/miscellanea:misc.Mode4
ltx/en_us_oca/me.m01.d16:meMA.Ode1C22.ode	@ltx/en_us_oca/miscellanea:misc.Ode1
ltx/en_us_oca/me.m01.d16:meMA.Ode1C22.text	
ltx/en_us_oca/me.m01.d16:meMA.Ode1C23.incipit	…
ltx/en_us_oca/me.m01.d16:meMA.Ode1C23.melody	@ltx/en_us_oca/he.h.m4:heHE.ChoroiIsrail.notmetered
ltx/en_us_oca/me.m01.d16:meMA.Ode1C23.mode	@ltx/en_us_oca/miscellanea:misc.Mode4
ltx/en_us_oca/me.m01.d16:meMA.Ode1C23.ode	@ltx/en_us_oca/miscellanea:misc.Ode1
ltx/en_us_oca/me.m01.d16:meMA.Ode1C23.text	
ltx/en_us_oca/me.m01.d16:meMA.Ode1C2T.incipit	…
ltx/en_us_oca/me.m01.d16:meMA.Ode1C2T.melody	@ltx/en_us_oca/he.h.m4:heHE.ChoroiIsrail.notmetered
ltx/en_us_oca/me.m01.d16:meMA.Ode1C2T.mode	@ltx/en_us_oca/miscellanea:misc.Mode4
ltx/en_us_oca/me.m01.d16:meMA.Ode1C2T.ode	@ltx/en_us_oca/miscellanea:misc.Ode1
ltx/en_us_oca/me.m01.d16:meMA.Ode1C2T.text	
ltx/en_us_oca/me.m01.d16:meMA.Ode3C11.greekmelody	@ltx/en_us_oca/he.h.m4:heHE.OukEnSofia.greekname
ltx/en_us_oca/me.m01.d16:meMA.Ode3C11.incipit	…
ltx/en_us_oca/me.m01.d16:meMA.Ode3C11.melody	@ltx/en_us_oca/he.h.m4:heHE.OukEnSofia.notmetered
ltx/en_us_oca/me.m01.d16:meMA.Ode3C11.mode	@ltx/en_us_oca/miscellanea:misc.Mode4
ltx/en_us_oca/me.m01.d16:meMA.Ode3C11.ode	@ltx/en_us_oca/miscellanea:misc.Ode3
ltx/en_us_oca/me.m01.d16:meMA.Ode3C11.text	
ltx/en_us_oca/me.m01.d16:meMA.Ode3C12.incipit	…
ltx/en_us_oca/me.m01.d16:meMA.Ode3C12.melody	@ltx/en_us_oca/he.h.m4:heHE.OukEnSofia.notmetered
ltx/en_us_oca/me.m01.d16:meMA.Ode3C12.mode	@ltx/en_us_oca/miscellanea:misc.Mode4
ltx/en_us_oca/me.m01.d16:meMA.Ode3C12.ode	@ltx/en_us_oca/miscellanea:misc.Ode3
ltx/en_us_oca/me.m01.d16:meMA.Ode3C12.text	
ltx/en_us_oca/me.m01.d16:meMA.Ode3C13.incipit	…
ltx/en_us_oca/me.m01.d16:meMA.Ode3C13.melody	@ltx/en_us_oca/he.h.m4:heHE.OukEnSofia.notmetered
ltx/en_us_oca/me.m01.d16:meMA.Ode3C13.mode	@ltx/en_us_oca/miscellanea:misc.Mode4
ltx/en_us_oca/me.m01.d16:meMA.Ode3C13.ode	@ltx/en_us_oca/miscellanea:misc.Ode3
ltx/en_us_oca/me.m01.d16:meMA.Ode3C13.text	
ltx/en_us_oca/me.m01.d16:meMA.Ode3C14.incipit	…
ltx/en_us_oca/me.m01.d16:meMA.Ode3C14.melody	@ltx/en_us_oca/he.h.m4:heHE.OukEnSofia.notmetered
ltx/en_us_oca/me.m01.d16:meMA.Ode3C14.mode	@ltx/en_us_oca/miscellanea:misc.Mode4
ltx/en_us_oca/me.m01.d16:meMA.Ode3C14.ode	@ltx/en_us_oca/miscellanea:misc.Ode3
ltx/en_us_oca/me.m01.d16:meMA.Ode3C14.text	
ltx/en_us_oca/me.m01.d16:meMA.Ode3C1T.incipit	…
ltx/en_us_oca/me.m01.d16:meMA.Ode3C1T.melody	@ltx/en_us_oca/he.h.m4:heHE.OukEnSofia.notmetered
ltx/en_us_oca/me.m01.d16:meMA.Ode3C1T.mode	@ltx/en_us_oca/miscellanea:misc.Mode4
ltx/en_us_oca/me.m01.d16:meMA.Ode3C1T.ode	@ltx/en_us_oca/miscellanea:misc.Ode3
ltx/en_us_oca/me.m01.d16:meMA.Ode3C1T.text	
ltx/en_us_oca/me.m01.d16:meMA.Ode3C21.greekmelody	@ltx/en_us_oca/he.h.m4:heHE.ToxonDynatonIsthenise.greekname
ltx/en_us_oca/me.m01.d16:meMA.Ode3C21.incipit	…
ltx/en_us_oca/me.m01.d16:meMA.Ode3C21.melody	@ltx/en_us_oca/he.h.m4:heHE.ToxonDynatonIsthenise.notmetered
ltx/en_us_oca/me.m01.d16:meMA.Ode3C21.mode	@ltx/en_us_oca/miscellanea:misc.Mode4
ltx/en_us_oca/me.m01.d16:meMA.Ode3C21.ode	@ltx/en_us_oca/miscellanea:misc.Ode3
ltx/en_us_oca/me.m01.d16:meMA.Ode3C21.text	
ltx/en_us_oca/me.m01.d16:meMA.Ode3C22.incipit	…
ltx/en_us_oca/me.m01.d16:meMA.Ode3C22.melody	@ltx/en_us_oca/he.h.m4:heHE.ToxonDynatonIsthenise.notmetered
ltx/en_us_oca/me.m01.d16:meMA.Ode3C22.mode	@ltx/en_us_oca/miscellanea:misc.Mode4
ltx/en_us_oca/me.m01.d16:meMA.Ode3C22.ode	@ltx/en_us_oca/miscellanea:misc.Ode3
ltx/en_us_oca/me.m01.d16:meMA.Ode3C22.text	
ltx/en_us_oca/me.m01.d16:meMA.Ode3C23.incipit	…
ltx/en_us_oca/me.m01.d16:meMA.Ode3C23.melody	@ltx/en_us_oca/he.h.m4:heHE.ToxonDynatonIsthenise.notmetered
ltx/en_us_oca/me.m01.d16:meMA.Ode3C23.mode	@ltx/en_us_oca/miscellanea:misc.Mode4
ltx/en_us_oca/me.m01.d16:meMA.Ode3C23.ode	@ltx/en_us_oca/miscellanea:misc.Ode3
ltx/en_us_oca/me.m01.d16:meMA.Ode3C23.text	
ltx/en_us_oca/me.m01.d16:meMA.Ode3C2T.incipit	…
ltx/en_us_oca/me.m01.d16:meMA.Ode3C2T.melody	@ltx/en_us_oca/he.h.m4:heHE.ToxonDynatonIsthenise.notmetered
ltx/en_us_oca/me.m01.d16:meMA.Ode3C2T.mode	@ltx/en_us_oca/miscellanea:misc.Mode4
ltx/en_us_oca/me.m01.d16:meMA.Ode3C2T.ode	@ltx/en_us_oca/miscellanea:misc.Ode3
ltx/en_us_oca/me.m01.d16:meMA.Ode3C2T.text	
ltx/en_us_oca/me.m01.d16:meMA.Ode3H.greekmelody	@ltx/en_us_oca/he.h.m4:heHE.ToxonDynatonIsthenise.greekname
ltx/en_us_oca/me.m01.d16:meMA.Ode3H.incipit	@ltx/en_us_oca/he.h.m4:heHE.ToxonDynatonIsthenise.incipit
ltx/en_us_oca/me.m01.d16:meMA.Ode3H.melody	@ltx/en_us_oca/he.h.m4:heHE.ToxonDynatonIsthenise.melody
ltx/en_us_oca/me.m01.d16:meMA.Ode3H.mode	@ltx/en_us_oca/miscellanea:misc.Mode4
ltx/en_us_oca/me.m01.d16:meMA.Ode3H.ode	@ltx/en_us_oca/miscellanea:misc.Ode3
ltx/en_us_oca/me.m01.d16:meMA.Ode3H.text	@ltx/en_us_oca/he.h.m4:heHE.ToxonDynatonIsthenise.text
ltx/en_us_oca/me.m01.d16:meMA.Ode3Kathisma1.greekmelody	@ltx/en_us_oca/he.a.m4:heAU.TachyProkatalave.greekname
ltx/en_us_oca/me.m01.d16:meMA.Ode3Kathisma1.incipit	…
ltx/en_us_oca/me.m01.d16:meMA.Ode3Kathisma1.melody	@ltx/en_us_oca/he.a.m4:heAU.TachyProkatalave.notmetered
ltx/en_us_oca/me.m01.d16:meMA.Ode3Kathisma1.mode	@ltx/en_us_oca/miscellanea:misc.Mode4
ltx/en_us_oca/me.m01.d16:meMA.Ode3Kathisma1.text	
ltx/en_us_oca/me.m01.d16:meMA.Ode3Kathisma2.greekmelody	@ltx/en_us_oca/he.a.m4:heAU.OYpsotheisEnToStavro.greekname
ltx/en_us_oca/me.m01.d16:meMA.Ode3Kathisma2.incipit	…
ltx/en_us_oca/me.m01.d16:meMA.Ode3Kathisma2.melody	@ltx/en_us_oca/he.a.m4:heAU.OYpsotheisEnToStavro.notmetered
ltx/en_us_oca/me.m01.d16:meMA.Ode3Kathisma2.mode	@ltx/en_us_oca/miscellanea:misc.Mode4
ltx/en_us_oca/me.m01.d16:meMA.Ode3Kathisma2.text	
ltx/en_us_oca/me.m01.d16:meMA.Ode3KathismaSt.incipit	…
ltx/en_us_oca/me.m01.d16:meMA.Ode3KathismaSt.melody	@ltx/en_us_oca/he.a.m4:heAU.OYpsotheisEnToStavro.notmetered
ltx/en_us_oca/me.m01.d16:meMA.Ode3KathismaSt.mode	@ltx/en_us_oca/miscellanea:misc.Mode4
ltx/en_us_oca/me.m01.d16:meMA.Ode3KathismaSt.text	
ltx/en_us_oca/me.m01.d16:meMA.Ode3KathismaT.incipit	…
ltx/en_us_oca/me.m01.d16:meMA.Ode3KathismaT.melody	@ltx/en_us_oca/he.a.m4:heAU.OYpsotheisEnToStavro.notmetered
ltx/en_us_oca/me.m01.d16:meMA.Ode3KathismaT.mode	@ltx/en_us_oca/miscellanea:misc.Mode4
ltx/en_us_oca/me.m01.d16:meMA.Ode3KathismaT.text	
ltx/en_us_oca/me.m01.d16:meMA.Ode4C11.greekmelody	@ltx/en_us_oca/he.h.m4:heHE.OKathimenosEnDoxi.greekname
ltx/en_us_oca/me.m01.d16:meMA.Ode4C11.incipit	…
ltx/en_us_oca/me.m01.d16:meMA.Ode4C11.melody	@ltx/en_us_oca/he.h.m4:heHE.OKathimenosEnDoxi.notmetered
ltx/en_us_oca/me.m01.d16:meMA.Ode4C11.mode	@ltx/en_us_oca/miscellanea:misc.Mode4
ltx/en_us_oca/me.m01.d16:meMA.Ode4C11.ode	@ltx/en_us_oca/miscellanea:misc.Ode4
ltx/en_us_oca/me.m01.d16:meMA.Ode4C11.text	
ltx/en_us_oca/me.m01.d16:meMA.Ode4C12.incipit	…
ltx/en_us_oca/me.m01.d16:meMA.Ode4C12.melody	@ltx/en_us_oca/he.h.m4:heHE.OKathimenosEnDoxi.notmetered
ltx/en_us_oca/me.m01.d16:meMA.Ode4C12.mode	@ltx/en_us_oca/miscellanea:misc.Mode4
ltx/en_us_oca/me.m01.d16:meMA.Ode4C12.ode	@ltx/en_us_oca/miscellanea:misc.Ode4
ltx/en_us_oca/me.m01.d16:meMA.Ode4C12.text	
ltx/en_us_oca/me.m01.d16:meMA.Ode4C13.incipit	…
ltx/en_us_oca/me.m01.d16:meMA.Ode4C13.melody	@ltx/en_us_oca/he.h.m4:heHE.OKathimenosEnDoxi.notmetered
ltx/en_us_oca/me.m01.d16:meMA.Ode4C13.mode	@ltx/en_us_oca/miscellanea:misc.Mode4
ltx/en_us_oca/me.m01.d16:meMA.Ode4C13.ode	@ltx/en_us_oca/miscellanea:misc.Ode4
ltx/en_us_oca/me.m01.d16:meMA.Ode4C13.text	
ltx/en_us_oca/me.m01.d16:meMA.Ode4C14.incipit	…
ltx/en_us_oca/me.m01.d16:meMA.Ode4C14.melody	@ltx/en_us_oca/he.h.m4:heHE.OKathimenosEnDoxi.notmetered
ltx/en_us_oca/me.m01.d16:meMA.Ode4C14.mode	@ltx/en_us_oca/miscellanea:misc.Mode4
ltx/en_us_oca/me.m01.d16:meMA.Ode4C14.ode	@ltx/en_us_oca/miscellanea:misc.Ode4
ltx/en_us_oca/me.m01.d16:meMA.Ode4C14.text	
ltx/en_us_oca/me.m01.d16:meMA.Ode4C1T.incipit	…
ltx/en_us_oca/me.m01.d16:meMA.Ode4C1T.melody	@ltx/en_us_oca/he.h.m4:heHE.OKathimenosEnDoxi.notmetered
ltx/en_us_oca/me.m01.d16:meMA.Ode4C1T.mode	@ltx/en_us_oca/miscellanea:misc.Mode4
ltx/en_us_oca/me.m01.d16:meMA.Ode4C1T.ode	@ltx/en_us_oca/miscellanea:misc.Ode4
ltx/en_us_oca/me.m01.d16:meMA.Ode4C1T.text	
ltx/en_us_oca/me.m01.d16:meMA.Ode4C21.greekmelody	@ltx/en_us_oca/he.h.m4:heHE.DiAgapisinOiktirmon.greekname
ltx/en_us_oca/me.m01.d16:meMA.Ode4C21.incipit	…
ltx/en_us_oca/me.m01.d16:meMA.Ode4C21.melody	@ltx/en_us_oca/he.h.m4:heHE.DiAgapisinOiktirmon.notmetered
ltx/en_us_oca/me.m01.d16:meMA.Ode4C21.mode	@ltx/en_us_oca/miscellanea:misc.Mode4
ltx/en_us_oca/me.m01.d16:meMA.Ode4C21.ode	@ltx/en_us_oca/miscellanea:misc.Ode4
ltx/en_us_oca/me.m01.d16:meMA.Ode4C21.text	
ltx/en_us_oca/me.m01.d16:meMA.Ode4C22.incipit	…
ltx/en_us_oca/me.m01.d16:meMA.Ode4C22.melody	@ltx/en_us_oca/he.h.m4:heHE.DiAgapisinOiktirmon.notmetered
ltx/en_us_oca/me.m01.d16:meMA.Ode4C22.mode	@ltx/en_us_oca/miscellanea:misc.Mode4
ltx/en_us_oca/me.m01.d16:meMA.Ode4C22.ode	@ltx/en_us_oca/miscellanea:misc.Ode4
ltx/en_us_oca/me.m01.d16:meMA.Ode4C22.text	
ltx/en_us_oca/me.m01.d16:meMA.Ode4C23.incipit	…
ltx/en_us_oca/me.m01.d16:meMA.Ode4C23.melody	@ltx/en_us_oca/he.h.m4:heHE.DiAgapisinOiktirmon.notmetered
ltx/en_us_oca/me.m01.d16:meMA.Ode4C23.mode	@ltx/en_us_oca/miscellanea:misc.Mode4
ltx/en_us_oca/me.m01.d16:meMA.Ode4C23.ode	@ltx/en_us_oca/miscellanea:misc.Ode4
ltx/en_us_oca/me.m01.d16:meMA.Ode4C23.text	
ltx/en_us_oca/me.m01.d16:meMA.Ode4C24.incipit	…
ltx/en_us_oca/me.m01.d16:meMA.Ode4C24.melody	@ltx/en_us_oca/he.h.m4:heHE.DiAgapisinOiktirmon.notmetered
ltx/en_us_oca/me.m01.d16:meMA.Ode4C24.mode	@ltx/en_us_oca/miscellanea:misc.Mode4
ltx/en_us_oca/me.m01.d16:meMA.Ode4C24.ode	@ltx/en_us_oca/miscellanea:misc.Ode4
ltx/en_us_oca/me.m01.d16:meMA.Ode4C24.text	
ltx/en_us_oca/me.m01.d16:meMA.Ode4C2T.incipit	…
ltx/en_us_oca/me.m01.d16:meMA.Ode4C2T.melody	@ltx/en_us_oca/he.h.m4:heHE.DiAgapisinOiktirmon.notmetered
ltx/en_us_oca/me.m01.d16:meMA.Ode4C2T.mode	@ltx/en_us_oca/miscellanea:misc.Mode4
ltx/en_us_oca/me.m01.d16:meMA.Ode4C2T.ode	@ltx/en_us_oca/miscellanea:misc.Ode4
ltx/en_us_oca/me.m01.d16:meMA.Ode4C2T.text	
ltx/en_us_oca/me.m01.d16:meMA.Ode5C11.greekmelody	@ltx/en_us_oca/he.h.m4:heHE.NynAnastisomai.greekname
ltx/en_us_oca/me.m01.d16:meMA.Ode5C11.incipit	…
ltx/en_us_oca/me.m01.d16:meMA.Ode5C11.melody	@ltx/en_us_oca/he.h.m4:heHE.NynAnastisomai.notmetered
ltx/en_us_oca/me.m01.d16:meMA.Ode5C11.mode	@ltx/en_us_oca/miscellanea:misc.Mode4
ltx/en_us_oca/me.m01.d16:meMA.Ode5C11.ode	@ltx/en_us_oca/miscellanea:misc.Ode5
ltx/en_us_oca/me.m01.d16:meMA.Ode5C11.text	
ltx/en_us_oca/me.m01.d16:meMA.Ode5C12.incipit	…
ltx/en_us_oca/me.m01.d16:meMA.Ode5C12.melody	@ltx/en_us_oca/he.h.m4:heHE.NynAnastisomai.notmetered
ltx/en_us_oca/me.m01.d16:meMA.Ode5C12.mode	@ltx/en_us_oca/miscellanea:misc.Mode4
ltx/en_us_oca/me.m01.d16:meMA.Ode5C12.ode	@ltx/en_us_oca/miscellanea:misc.Ode5
ltx/en_us_oca/me.m01.d16:meMA.Ode5C12.text	
ltx/en_us_oca/me.m01.d16:meMA.Ode5C13.incipit	…
ltx/en_us_oca/me.m01.d16:meMA.Ode5C13.melody	@ltx/en_us_oca/he.h.m4:heHE.NynAnastisomai.notmetered
ltx/en_us_oca/me.m01.d16:meMA.Ode5C13.mode	@ltx/en_us_oca/miscellanea:misc.Mode4
ltx/en_us_oca/me.m01.d16:meMA.Ode5C13.ode	@ltx/en_us_oca/miscellanea:misc.Ode5
ltx/en_us_oca/me.m01.d16:meMA.Ode5C13.text	
ltx/en_us_oca/me.m01.d16:meMA.Ode5C14.incipit	…
ltx/en_us_oca/me.m01.d16:meMA.Ode5C14.melody	@ltx/en_us_oca/he.h.m4:heHE.NynAnastisomai.notmetered
ltx/en_us_oca/me.m01.d16:meMA.Ode5C14.mode	@ltx/en_us_oca/miscellanea:misc.Mode4
ltx/en_us_oca/me.m01.d16:meMA.Ode5C14.ode	@ltx/en_us_oca/miscellanea:misc.Ode5
ltx/en_us_oca/me.m01.d16:meMA.Ode5C14.text	
ltx/en_us_oca/me.m01.d16:meMA.Ode5C1T.incipit	…
ltx/en_us_oca/me.m01.d16:meMA.Ode5C1T.melody	@ltx/en_us_oca/he.h.m4:heHE.NynAnastisomai.notmetered
ltx/en_us_oca/me.m01.d16:meMA.Ode5C1T.mode	@ltx/en_us_oca/miscellanea:misc.Mode4
ltx/en_us_oca/me.m01.d16:meMA.Ode5C1T.ode	@ltx/en_us_oca/miscellanea:misc.Ode5
ltx/en_us_oca/me.m01.d16:meMA.Ode5C1T.text	
ltx/en_us_oca/me.m01.d16:meMA.Ode5C21.greekmelody	@ltx/en_us_oca/he.h.m4:heHE.TonFotismonSouKyrie.greekname
ltx/en_us_oca/me.m01.d16:meMA.Ode5C21.incipit	…
ltx/en_us_oca/me.m01.d16:meMA.Ode5C21.melody	@ltx/en_us_oca/he.h.m4:heHE.TonFotismonSouKyrie.notmetered
ltx/en_us_oca/me.m01.d16:meMA.Ode5C21.mode	@ltx/en_us_oca/miscellanea:misc.Mode4
ltx/en_us_oca/me.m01.d16:meMA.Ode5C21.ode	@ltx/en_us_oca/miscellanea:misc.Ode5
ltx/en_us_oca/me.m01.d16:meMA.Ode5C21.text	
ltx/en_us_oca/me.m01.d16:meMA.Ode5C22.incipit	…
ltx/en_us_oca/me.m01.d16:meMA.Ode5C22.melody	@ltx/en_us_oca/he.h.m4:heHE.TonFotismonSouKyrie.notmetered
ltx/en_us_oca/me.m01.d16:meMA.Ode5C22.mode	@ltx/en_us_oca/miscellanea:misc.Mode4
ltx/en_us_oca/me.m01.d16:meMA.Ode5C22.ode	@ltx/en_us_oca/miscellanea:misc.Ode5
ltx/en_us_oca/me.m01.d16:meMA.Ode5C22.text	
ltx/en_us_oca/me.m01.d16:meMA.Ode5C23.incipit	…
ltx/en_us_oca/me.m01.d16:meMA.Ode5C23.melody	@ltx/en_us_oca/he.h.m4:heHE.TonFotismonSouKyrie.notmetered
ltx/en_us_oca/me.m01.d16:meMA.Ode5C23.mode	@ltx/en_us_oca/miscellanea:misc.Mode4
ltx/en_us_oca/me.m01.d16:meMA.Ode5C23.ode	@ltx/en_us_oca/miscellanea:misc.Ode5
ltx/en_us_oca/me.m01.d16:meMA.Ode5C23.text	
ltx/en_us_oca/me.m01.d16:meMA.Ode5C2T.incipit	…
ltx/en_us_oca/me.m01.d16:meMA.Ode5C2T.melody	@ltx/en_us_oca/he.h.m4:heHE.TonFotismonSouKyrie.notmetered
ltx/en_us_oca/me.m01.d16:meMA.Ode5C2T.mode	@ltx/en_us_oca/miscellanea:misc.Mode4
ltx/en_us_oca/me.m01.d16:meMA.Ode5C2T.ode	@ltx/en_us_oca/miscellanea:misc.Ode5
ltx/en_us_oca/me.m01.d16:meMA.Ode5C2T.text	
ltx/en_us_oca/me.m01.d16:meMA.Ode6C11.greekmelody	@ltx/en_us_oca/he.h.m4:heHE.IlthonEisTaVathi.greekname
ltx/en_us_oca/me.m01.d16:meMA.Ode6C11.incipit	…
ltx/en_us_oca/me.m01.d16:meMA.Ode6C11.melody	@ltx/en_us_oca/he.h.m4:heHE.IlthonEisTaVathi.notmetered
ltx/en_us_oca/me.m01.d16:meMA.Ode6C11.mode	@ltx/en_us_oca/miscellanea:misc.Mode4
ltx/en_us_oca/me.m01.d16:meMA.Ode6C11.ode	@ltx/en_us_oca/miscellanea:misc.Ode6
ltx/en_us_oca/me.m01.d16:meMA.Ode6C11.text	
ltx/en_us_oca/me.m01.d16:meMA.Ode6C12.incipit	…
ltx/en_us_oca/me.m01.d16:meMA.Ode6C12.melody	@ltx/en_us_oca/he.h.m4:heHE.IlthonEisTaVathi.notmetered
ltx/en_us_oca/me.m01.d16:meMA.Ode6C12.mode	@ltx/en_us_oca/miscellanea:misc.Mode4
ltx/en_us_oca/me.m01.d16:meMA.Ode6C12.ode	@ltx/en_us_oca/miscellanea:misc.Ode6
ltx/en_us_oca/me.m01.d16:meMA.Ode6C12.text	
ltx/en_us_oca/me.m01.d16:meMA.Ode6C13.incipit	…
ltx/en_us_oca/me.m01.d16:meMA.Ode6C13.melody	@ltx/en_us_oca/he.h.m4:heHE.IlthonEisTaVathi.notmetered
ltx/en_us_oca/me.m01.d16:meMA.Ode6C13.mode	@ltx/en_us_oca/miscellanea:misc.Mode4
ltx/en_us_oca/me.m01.d16:meMA.Ode6C13.ode	@ltx/en_us_oca/miscellanea:misc.Ode6
ltx/en_us_oca/me.m01.d16:meMA.Ode6C13.text	
ltx/en_us_oca/me.m01.d16:meMA.Ode6C14.incipit	…
ltx/en_us_oca/me.m01.d16:meMA.Ode6C14.melody	@ltx/en_us_oca/he.h.m4:heHE.IlthonEisTaVathi.notmetered
ltx/en_us_oca/me.m01.d16:meMA.Ode6C14.mode	@ltx/en_us_oca/miscellanea:misc.Mode4
ltx/en_us_oca/me.m01.d16:meMA.Ode6C14.ode	@ltx/en_us_oca/miscellanea:misc.Ode6
ltx/en_us_oca/me.m01.d16:meMA.Ode6C14.text	
ltx/en_us_oca/me.m01.d16:meMA.Ode6C1T.incipit	…
ltx/en_us_oca/me.m01.d16:meMA.Ode6C1T.melody	@ltx/en_us_oca/he.h.m4:heHE.IlthonEisTaVathi.notmetered
ltx/en_us_oca/me.m01.d16:meMA.Ode6C1T.mode	@ltx/en_us_oca/miscellanea:misc.Mode4
ltx/en_us_oca/me.m01.d16:meMA.Ode6C1T.ode	@ltx/en_us_oca/miscellanea:misc.Ode6
ltx/en_us_oca/me.m01.d16:meMA.Ode6C1T.text	
ltx/en_us_oca/me.m01.d16:meMA.Ode6C21.greekmelody	@ltx/en_us_oca/he.h.m4:heHE.EvoiseProtypon.greekname
ltx/en_us_oca/me.m01.d16:meMA.Ode6C21.incipit	…
ltx/en_us_oca/me.m01.d16:meMA.Ode6C21.melody	@ltx/en_us_oca/he.h.m4:heHE.EvoiseProtypon.notmetered
ltx/en_us_oca/me.m01.d16:meMA.Ode6C21.mode	@ltx/en_us_oca/miscellanea:misc.Mode4
ltx/en_us_oca/me.m01.d16:meMA.Ode6C21.ode	@ltx/en_us_oca/miscellanea:misc.Ode6
ltx/en_us_oca/me.m01.d16:meMA.Ode6C21.text	
ltx/en_us_oca/me.m01.d16:meMA.Ode6C22.incipit	…
ltx/en_us_oca/me.m01.d16:meMA.Ode6C22.melody	@ltx/en_us_oca/he.h.m4:heHE.EvoiseProtypon.notmetered
ltx/en_us_oca/me.m01.d16:meMA.Ode6C22.mode	@ltx/en_us_oca/miscellanea:misc.Mode4
ltx/en_us_oca/me.m01.d16:meMA.Ode6C22.ode	@ltx/en_us_oca/miscellanea:misc.Ode6
ltx/en_us_oca/me.m01.d16:meMA.Ode6C22.text	
ltx/en_us_oca/me.m01.d16:meMA.Ode6C23.incipit	…
ltx/en_us_oca/me.m01.d16:meMA.Ode6C23.melody	@ltx/en_us_oca/he.h.m4:heHE.EvoiseProtypon.notmetered
ltx/en_us_oca/me.m01.d16:meMA.Ode6C23.mode	@ltx/en_us_oca/miscellanea:misc.Mode4
ltx/en_us_oca/me.m01.d16:meMA.Ode6C23.ode	@ltx/en_us_oca/miscellanea:misc.Ode6
ltx/en_us_oca/me.m01.d16:meMA.Ode6C23.text	
ltx/en_us_oca/me.m01.d16:meMA.Ode6C2T.incipit	…
ltx/en_us_oca/me.m01.d16:meMA.Ode6C2T.melody	@ltx/en_us_oca/he.h.m4:heHE.EvoiseProtypon.notmetered
ltx/en_us_oca/me.m01.d16:meMA.Ode6C2T.mode	@ltx/en_us_oca/miscellanea:misc.Mode4
ltx/en_us_oca/me.m01.d16:meMA.Ode6C2T.ode	@ltx/en_us_oca/miscellanea:misc.Ode6
ltx/en_us_oca/me.m01.d16:meMA.Ode6C2T.text	
ltx/en_us_oca/me.m01.d16:meMA.Ode6H.greekmelody	@ltx/en_us_oca/he.h.m4:heHE.EvoiseProtypon.greekname
ltx/en_us_oca/me.m01.d16:meMA.Ode6H.incipit	@ltx/en_us_oca/he.h.m4:heHE.EvoiseProtypon.incipit
ltx/en_us_oca/me.m01.d16:meMA.Ode6H.melody	@ltx/en_us_oca/he.h.m4:heHE.EvoiseProtypon.melody
ltx/en_us_oca/me.m01.d16:meMA.Ode6H.mode	@ltx/en_us_oca/miscellanea:misc.Mode4
ltx/en_us_oca/me.m01.d16:meMA.Ode6H.ode	@ltx/en_us_oca/miscellanea:misc.Ode6
ltx/en_us_oca/me.m01.d16:meMA.Ode6H.text	@ltx/en_us_oca/he.h.m4:heHE.EvoiseProtypon.text
ltx/en_us_oca/me.m01.d16:meMA.Ode7C11.greekmelody	@ltx/en_us_oca/he.h.m4:heHE.ODiasosasEnPyri.greekname
ltx/en_us_oca/me.m01.d16:meMA.Ode7C11.incipit	…
ltx/en_us_oca/me.m01.d16:meMA.Ode7C11.melody	@ltx/en_us_oca/he.h.m4:heHE.ODiasosasEnPyri.notmetered
ltx/en_us_oca/me.m01.d16:meMA.Ode7C11.mode	@ltx/en_us_oca/miscellanea:misc.Mode4
ltx/en_us_oca/me.m01.d16:meMA.Ode7C11.ode	@ltx/en_us_oca/miscellanea:misc.Ode7
ltx/en_us_oca/me.m01.d16:meMA.Ode7C11.text	
ltx/en_us_oca/me.m01.d16:meMA.Ode7C12.incipit	…
ltx/en_us_oca/me.m01.d16:meMA.Ode7C12.melody	@ltx/en_us_oca/he.h.m4:heHE.ODiasosasEnPyri.notmetered
ltx/en_us_oca/me.m01.d16:meMA.Ode7C12.mode	@ltx/en_us_oca/miscellanea:misc.Mode4
ltx/en_us_oca/me.m01.d16:meMA.Ode7C12.ode	@ltx/en_us_oca/miscellanea:misc.Ode7
ltx/en_us_oca/me.m01.d16:meMA.Ode7C12.text	
ltx/en_us_oca/me.m01.d16:meMA.Ode7C13.incipit	…
ltx/en_us_oca/me.m01.d16:meMA.Ode7C13.melody	@ltx/en_us_oca/he.h.m4:heHE.ODiasosasEnPyri.notmetered
ltx/en_us_oca/me.m01.d16:meMA.Ode7C13.mode	@ltx/en_us_oca/miscellanea:misc.Mode4
ltx/en_us_oca/me.m01.d16:meMA.Ode7C13.ode	@ltx/en_us_oca/miscellanea:misc.Ode7
ltx/en_us_oca/me.m01.d16:meMA.Ode7C13.text	
ltx/en_us_oca/me.m01.d16:meMA.Ode7C14.incipit	…
ltx/en_us_oca/me.m01.d16:meMA.Ode7C14.melody	@ltx/en_us_oca/he.h.m4:heHE.ODiasosasEnPyri.notmetered
ltx/en_us_oca/me.m01.d16:meMA.Ode7C14.mode	@ltx/en_us_oca/miscellanea:misc.Mode4
ltx/en_us_oca/me.m01.d16:meMA.Ode7C14.ode	@ltx/en_us_oca/miscellanea:misc.Ode7
ltx/en_us_oca/me.m01.d16:meMA.Ode7C14.text	
ltx/en_us_oca/me.m01.d16:meMA.Ode7C1T.incipit	…
ltx/en_us_oca/me.m01.d16:meMA.Ode7C1T.melody	@ltx/en_us_oca/he.h.m4:heHE.ODiasosasEnPyri.notmetered
ltx/en_us_oca/me.m01.d16:meMA.Ode7C1T.mode	@ltx/en_us_oca/miscellanea:misc.Mode4
ltx/en_us_oca/me.m01.d16:meMA.Ode7C1T.ode	@ltx/en_us_oca/miscellanea:misc.Ode7
ltx/en_us_oca/me.m01.d16:meMA.Ode7C1T.text	
ltx/en_us_oca/me.m01.d16:meMA.Ode7C21.greekmelody	@ltx/en_us_oca/he.h.m4:heHE.AvramiaioiPote.greekname
ltx/en_us_oca/me.m01.d16:meMA.Ode7C21.incipit	…
ltx/en_us_oca/me.m01.d16:meMA.Ode7C21.melody	@ltx/en_us_oca/he.h.m4:heHE.AvramiaioiPote.notmetered
ltx/en_us_oca/me.m01.d16:meMA.Ode7C21.mode	@ltx/en_us_oca/miscellanea:misc.Mode4
ltx/en_us_oca/me.m01.d16:meMA.Ode7C21.ode	@ltx/en_us_oca/miscellanea:misc.Ode7
ltx/en_us_oca/me.m01.d16:meMA.Ode7C21.text	
ltx/en_us_oca/me.m01.d16:meMA.Ode7C22.incipit	…
ltx/en_us_oca/me.m01.d16:meMA.Ode7C22.melody	@ltx/en_us_oca/he.h.m4:heHE.AvramiaioiPote.notmetered
ltx/en_us_oca/me.m01.d16:meMA.Ode7C22.mode	@ltx/en_us_oca/miscellanea:misc.Mode4
ltx/en_us_oca/me.m01.d16:meMA.Ode7C22.ode	@ltx/en_us_oca/miscellanea:misc.Ode7
ltx/en_us_oca/me.m01.d16:meMA.Ode7C22.text	
ltx/en_us_oca/me.m01.d16:meMA.Ode7C23.incipit	…
ltx/en_us_oca/me.m01.d16:meMA.Ode7C23.melody	@ltx/en_us_oca/he.h.m4:heHE.AvramiaioiPote.notmetered
ltx/en_us_oca/me.m01.d16:meMA.Ode7C23.mode	@ltx/en_us_oca/miscellanea:misc.Mode4
ltx/en_us_oca/me.m01.d16:meMA.Ode7C23.ode	@ltx/en_us_oca/miscellanea:misc.Ode7
ltx/en_us_oca/me.m01.d16:meMA.Ode7C23.text	
ltx/en_us_oca/me.m01.d16:meMA.Ode7C24.incipit	…
ltx/en_us_oca/me.m01.d16:meMA.Ode7C24.melody	@ltx/en_us_oca/he.h.m4:heHE.AvramiaioiPote.notmetered
ltx/en_us_oca/me.m01.d16:meMA.Ode7C24.mode	@ltx/en_us_oca/miscellanea:misc.Mode4
ltx/en_us_oca/me.m01.d16:meMA.Ode7C24.ode	@ltx/en_us_oca/miscellanea:misc.Ode7
ltx/en_us_oca/me.m01.d16:meMA.Ode7C24.text	
ltx/en_us_oca/me.m01.d16:meMA.Ode7C2T.incipit	…
ltx/en_us_oca/me.m01.d16:meMA.Ode7C2T.melody	@ltx/en_us_oca/he.h.m4:heHE.AvramiaioiPote.notmetered
ltx/en_us_oca/me.m01.d16:meMA.Ode7C2T.mode	@ltx/en_us_oca/miscellanea:misc.Mode4
ltx/en_us_oca/me.m01.d16:meMA.Ode7C2T.ode	@ltx/en_us_oca/miscellanea:misc.Ode7
ltx/en_us_oca/me.m01.d16:meMA.Ode7C2T.text	
ltx/en_us_oca/me.m01.d16:meMA.Ode8C11.greekmelody	@ltx/en_us_oca/he.h.m4:heHE.LytrotaTouPantos.greekname
ltx/en_us_oca/me.m01.d16:meMA.Ode8C11.incipit	…
ltx/en_us_oca/me.m01.d16:meMA.Ode8C11.melody	@ltx/en_us_oca/he.h.m4:heHE.LytrotaTouPantos.notmetered
ltx/en_us_oca/me.m01.d16:meMA.Ode8C11.mode	@ltx/en_us_oca/miscellanea:misc.Mode4
ltx/en_us_oca/me.m01.d16:meMA.Ode8C11.ode	@ltx/en_us_oca/miscellanea:misc.Ode8
ltx/en_us_oca/me.m01.d16:meMA.Ode8C11.text	
ltx/en_us_oca/me.m01.d16:meMA.Ode8C12.incipit	…
ltx/en_us_oca/me.m01.d16:meMA.Ode8C12.melody	@ltx/en_us_oca/he.h.m4:heHE.LytrotaTouPantos.notmetered
ltx/en_us_oca/me.m01.d16:meMA.Ode8C12.mode	@ltx/en_us_oca/miscellanea:misc.Mode4
ltx/en_us_oca/me.m01.d16:meMA.Ode8C12.ode	@ltx/en_us_oca/miscellanea:misc.Ode8
ltx/en_us_oca/me.m01.d16:meMA.Ode8C12.text	
ltx/en_us_oca/me.m01.d16:meMA.Ode8C13.incipit	…
ltx/en_us_oca/me.m01.d16:meMA.Ode8C13.melody	@ltx/en_us_oca/he.h.m4:heHE.LytrotaTouPantos.notmetered
ltx/en_us_oca/me.m01.d16:meMA.Ode8C13.mode	@ltx/en_us_oca/miscellanea:misc.Mode4
ltx/en_us_oca/me.m01.d16:meMA.Ode8C13.ode	@ltx/en_us_oca/miscellanea:misc.Ode8
ltx/en_us_oca/me.m01.d16:meMA.Ode8C13.text	
ltx/en_us_oca/me.m01.d16:meMA.Ode8C14.incipit	…
ltx/en_us_oca/me.m01.d16:meMA.Ode8C14.melody	@ltx/en_us_oca/he.h.m4:heHE.LytrotaTouPantos.notmetered
ltx/en_us_oca/me.m01.d16:meMA.Ode8C14.mode	@ltx/en_us_oca/miscellanea:misc.Mode4
ltx/en_us_oca/me.m01.d16:meMA.Ode8C14.ode	@ltx/en_us_oca/miscellanea:misc.Ode8
ltx/en_us_oca/me.m01.d16:meMA.Ode8C14.text	
ltx/en_us_oca/me.m01.d16:meMA.Ode8C1T.incipit	…
ltx/en_us_oca/me.m01.d16:meMA.Ode8C1T.melody	@ltx/en_us_oca/he.h.m4:heHE.LytrotaTouPantos.notmetered
ltx/en_us_oca/me.m01.d16:meMA.Ode8C1T.mode	@ltx/en_us_oca/miscellanea:misc.Mode4
ltx/en_us_oca/me.m01.d16:meMA.Ode8C1T.ode	@ltx/en_us_oca/miscellanea:misc.Ode8
ltx/en_us_oca/me.m01.d16:meMA.Ode8C1T.text	
ltx/en_us_oca/me.m01.d16:meMA.Ode8C21.greekmelody	@ltx/en_us_oca/he.h.m4:heHE.LytrotaTouPantos.greekname
ltx/en_us_oca/me.m01.d16:meMA.Ode8C21.incipit	…
ltx/en_us_oca/me.m01.d16:meMA.Ode8C21.melody	@ltx/en_us_oca/he.h.m4:heHE.LytrotaTouPantos.notmetered
ltx/en_us_oca/me.m01.d16:meMA.Ode8C21.mode	@ltx/en_us_oca/miscellanea:misc.Mode4
ltx/en_us_oca/me.m01.d16:meMA.Ode8C21.ode	@ltx/en_us_oca/miscellanea:misc.Ode8
ltx/en_us_oca/me.m01.d16:meMA.Ode8C21.text	
ltx/en_us_oca/me.m01.d16:meMA.Ode8C22.incipit	…
ltx/en_us_oca/me.m01.d16:meMA.Ode8C22.melody	@ltx/en_us_oca/he.h.m4:heHE.LytrotaTouPantos.notmetered
ltx/en_us_oca/me.m01.d16:meMA.Ode8C22.mode	@ltx/en_us_oca/miscellanea:misc.Mode4
ltx/en_us_oca/me.m01.d16:meMA.Ode8C22.ode	@ltx/en_us_oca/miscellanea:misc.Ode8
ltx/en_us_oca/me.m01.d16:meMA.Ode8C22.text	
ltx/en_us_oca/me.m01.d16:meMA.Ode8C23.incipit	…
ltx/en_us_oca/me.m01.d16:meMA.Ode8C23.melody	@ltx/en_us_oca/he.h.m4:heHE.LytrotaTouPantos.notmetered
ltx/en_us_oca/me.m01.d16:meMA.Ode8C23.mode	@ltx/en_us_oca/miscellanea:misc.Mode4
ltx/en_us_oca/me.m01.d16:meMA.Ode8C23.ode	@ltx/en_us_oca/miscellanea:misc.Ode8
ltx/en_us_oca/me.m01.d16:meMA.Ode8C23.text	
ltx/en_us_oca/me.m01.d16:meMA.Ode8C24.incipit	…
ltx/en_us_oca/me.m01.d16:meMA.Ode8C24.melody	@ltx/en_us_oca/he.h.m4:heHE.LytrotaTouPantos.notmetered
ltx/en_us_oca/me.m01.d16:meMA.Ode8C24.mode	@ltx/en_us_oca/miscellanea:misc.Mode4
ltx/en_us_oca/me.m01.d16:meMA.Ode8C24.ode	@ltx/en_us_oca/miscellanea:misc.Ode8
ltx/en_us_oca/me.m01.d16:meMA.Ode8C24.text	
ltx/en_us_oca/me.m01.d16:meMA.Ode8C2T.incipit	…
ltx/en_us_oca/me.m01.d16:meMA.Ode8C2T.melody	@ltx/en_us_oca/he.h.m4:heHE.LytrotaTouPantos.notmetered
ltx/en_us_oca/me.m01.d16:meMA.Ode8C2T.mode	@ltx/en_us_oca/miscellanea:misc.Mode4
ltx/en_us_oca/me.m01.d16:meMA.Ode8C2T.ode	@ltx/en_us_oca/miscellanea:misc.Ode8
ltx/en_us_oca/me.m01.d16:meMA.Ode8C2T.text	
ltx/en_us_oca/me.m01.d16:meMA.Ode8C2Tr.incipit	…
ltx/en_us_oca/me.m01.d16:meMA.Ode8C2Tr.melody	@ltx/en_us_oca/he.h.m4:heHE.LytrotaTouPantos.notmetered
ltx/en_us_oca/me.m01.d16:meMA.Ode8C2Tr.mode	@ltx/en_us_oca/miscellanea:misc.Mode4
ltx/en_us_oca/me.m01.d16:meMA.Ode8C2Tr.ode	@ltx/en_us_oca/miscellanea:misc.Ode8
ltx/en_us_oca/me.m01.d16:meMA.Ode8C2Tr.text	
ltx/en_us_oca/me.m01.d16:meMA.Ode8H.greekmelody	@ltx/en_us_oca/he.h.m4:heHE.LytrotaTouPantos.greekname
ltx/en_us_oca/me.m01.d16:meMA.Ode8H.incipit	@ltx/en_us_oca/he.h.m4:heHE.LytrotaTouPantos.incipit
ltx/en_us_oca/me.m01.d16:meMA.Ode8H.melody	@ltx/en_us_oca/he.h.m4:heHE.LytrotaTouPantos.melody
ltx/en_us_oca/me.m01.d16:meMA.Ode8H.mode	@ltx/en_us_oca/miscellanea:misc.Mode4
ltx/en_us_oca/me.m01.d16:meMA.Ode8H.ode	@ltx/en_us_oca/miscellanea:misc.Ode8
ltx/en_us_oca/me.m01.d16:meMA.Ode8H.text	@ltx/en_us_oca/he.h.m4:heHE.LytrotaTouPantos.text
ltx/en_us_oca/me.m01.d16:meMA.Ode9C11.greekmelody	@ltx/en_us_oca/he.h.m4:heHE.ApasGigenis.greekname
ltx/en_us_oca/me.m01.d16:meMA.Ode9C11.incipit	…
ltx/en_us_oca/me.m01.d16:meMA.Ode9C11.melody	@ltx/en_us_oca/he.h.m4:heHE.ApasGigenis.notmetered
ltx/en_us_oca/me.m01.d16:meMA.Ode9C11.mode	@ltx/en_us_oca/miscellanea:misc.Mode4
ltx/en_us_oca/me.m01.d16:meMA.Ode9C11.ode	@ltx/en_us_oca/miscellanea:misc.Ode9
ltx/en_us_oca/me.m01.d16:meMA.Ode9C11.text	
ltx/en_us_oca/me.m01.d16:meMA.Ode9C12.incipit	…
ltx/en_us_oca/me.m01.d16:meMA.Ode9C12.melody	@ltx/en_us_oca/he.h.m4:heHE.ApasGigenis.notmetered
ltx/en_us_oca/me.m01.d16:meMA.Ode9C12.mode	@ltx/en_us_oca/miscellanea:misc.Mode4
ltx/en_us_oca/me.m01.d16:meMA.Ode9C12.ode	@ltx/en_us_oca/miscellanea:misc.Ode9
ltx/en_us_oca/me.m01.d16:meMA.Ode9C12.text	
ltx/en_us_oca/me.m01.d16:meMA.Ode9C13.incipit	…
ltx/en_us_oca/me.m01.d16:meMA.Ode9C13.melody	@ltx/en_us_oca/he.h.m4:heHE.ApasGigenis.notmetered
ltx/en_us_oca/me.m01.d16:meMA.Ode9C13.mode	@ltx/en_us_oca/miscellanea:misc.Mode4
ltx/en_us_oca/me.m01.d16:meMA.Ode9C13.ode	@ltx/en_us_oca/miscellanea:misc.Ode9
ltx/en_us_oca/me.m01.d16:meMA.Ode9C13.text	
ltx/en_us_oca/me.m01.d16:meMA.Ode9C1T.incipit	…
ltx/en_us_oca/me.m01.d16:meMA.Ode9C1T.melody	@ltx/en_us_oca/he.h.m4:heHE.ApasGigenis.notmetered
ltx/en_us_oca/me.m01.d16:meMA.Ode9C1T.mode	@ltx/en_us_oca/miscellanea:misc.Mode4
ltx/en_us_oca/me.m01.d16:meMA.Ode9C1T.ode	@ltx/en_us_oca/miscellanea:misc.Ode9
ltx/en_us_oca/me.m01.d16:meMA.Ode9C1T.text	
ltx/en_us_oca/me.m01.d16:meMA.Ode9C1Tr.incipit	…
ltx/en_us_oca/me.m01.d16:meMA.Ode9C1Tr.melody	@ltx/en_us_oca/he.h.m4:heHE.ApasGigenis.notmetered
ltx/en_us_oca/me.m01.d16:meMA.Ode9C1Tr.mode	@ltx/en_us_oca/miscellanea:misc.Mode4
ltx/en_us_oca/me.m01.d16:meMA.Ode9C1Tr.ode	@ltx/en_us_oca/miscellanea:misc.Ode9
ltx/en_us_oca/me.m01.d16:meMA.Ode9C1Tr.text	
ltx/en_us_oca/me.m01.d16:meMA.Ode9C21.greekmelody	@ltx/en_us_oca/he.h.m4:heHE.OTokosSouAfthoros.greekname
ltx/en_us_oca/me.m01.d16:meMA.Ode9C21.incipit	…
ltx/en_us_oca/me.m01.d16:meMA.Ode9C21.melody	@ltx/en_us_oca/he.h.m4:heHE.OTokosSouAfthoros.notmetered
ltx/en_us_oca/me.m01.d16:meMA.Ode9C21.mode	@ltx/en_us_oca/miscellanea:misc.Mode4
ltx/en_us_oca/me.m01.d16:meMA.Ode9C21.ode	@ltx/en_us_oca/miscellanea:misc.Ode9
ltx/en_us_oca/me.m01.d16:meMA.Ode9C21.text	
ltx/en_us_oca/me.m01.d16:meMA.Ode9C22.incipit	…
ltx/en_us_oca/me.m01.d16:meMA.Ode9C22.melody	@ltx/en_us_oca/he.h.m4:heHE.OTokosSouAfthoros.notmetered
ltx/en_us_oca/me.m01.d16:meMA.Ode9C22.mode	@ltx/en_us_oca/miscellanea:misc.Mode4
ltx/en_us_oca/me.m01.d16:meMA.Ode9C22.ode	@ltx/en_us_oca/miscellanea:misc.Ode9
ltx/en_us_oca/me.m01.d16:meMA.Ode9C22.text	
ltx/en_us_oca/me.m01.d16:meMA.Ode9C23.incipit	…
ltx/en_us_oca/me.m01.d16:meMA.Ode9C23.melody	@ltx/en_us_oca/he.h.m4:heHE.OTokosSouAfthoros.notmetered
ltx/en_us_oca/me.m01.d16:meMA.Ode9C23.mode	@ltx/en_us_oca/miscellanea:misc.Mode4
ltx/en_us_oca/me.m01.d16:meMA.Ode9C23.ode	@ltx/en_us_oca/miscellanea:misc.Ode9
ltx/en_us_oca/me.m01.d16:meMA.Ode9C23.text	
ltx/en_us_oca/me.m01.d16:meMA.Ode9C24.incipit	…
ltx/en_us_oca/me.m01.d16:meMA.Ode9C24.melody	@ltx/en_us_oca/he.h.m4:heHE.OTokosSouAfthoros.notmetered
ltx/en_us_oca/me.m01.d16:meMA.Ode9C24.mode	@ltx/en_us_oca/miscellanea:misc.Mode4
ltx/en_us_oca/me.m01.d16:meMA.Ode9C24.ode	@ltx/en_us_oca/miscellanea:misc.Ode9
ltx/en_us_oca/me.m01.d16:meMA.Ode9C24.text	
ltx/en_us_oca/me.m01.d16:meMA.Ode9C2T.incipit	…
ltx/en_us_oca/me.m01.d16:meMA.Ode9C2T.melody	@ltx/en_us_oca/he.h.m4:heHE.OTokosSouAfthoros.notmetered
ltx/en_us_oca/me.m01.d16:meMA.Ode9C2T.mode	@ltx/en_us_oca/miscellanea:misc.Mode4
ltx/en_us_oca/me.m01.d16:meMA.Ode9C2T.ode	@ltx/en_us_oca/miscellanea:misc.Ode9
ltx/en_us_oca/me.m01.d16:meMA.Ode9C2T.text	
ltx/en_us_oca/me.m01.d16:meMA.Ode9H.greekmelody	@ltx/en_us_oca/he.h.m4:heHE.OTokosSouAfthoros.greekname
ltx/en_us_oca/me.m01.d16:meMA.Ode9H.incipit	@ltx/en_us_oca/he.h.m4:heHE.OTokosSouAfthoros.incipit
ltx/en_us_oca/me.m01.d16:meMA.Ode9H.melody	@ltx/en_us_oca/he.h.m4:heHE.OTokosSouAfthoros.melody
ltx/en_us_oca/me.m01.d16:meMA.Ode9H.mode	@ltx/en_us_oca/miscellanea:misc.Mode4
ltx/en_us_oca/me.m01.d16:meMA.Ode9H.ode	@ltx/en_us_oca/miscellanea:misc.Ode9
ltx/en_us_oca/me.m01.d16:meMA.Ode9H.text	@ltx/en_us_oca/he.h.m4:heHE.OTokosSouAfthoros.text
ltx/en_us_oca/me.m01.d16:meMA.Oikos1.text	
ltx/en_us_oca/me.m01.d16:meVE.Apolytikion1.incipit	…
ltx/en_us_oca/me.m01.d16:meVE.Apolytikion1.melody	
ltx/en_us_oca/me.m01.d16:meVE.Apolytikion1.mode	@ltx/en_us_oca/miscellanea:misc.Mode4
ltx/en_us_oca/me.m01.d16:meVE.Apolytikion1.text	
ltx/en_us_oca/me.m01.d16:meVE.AposGlory.incipit	Peter, the rock of faith…
ltx/en_us_oca/me.m01.d16:meVE.AposGlory.melody	
ltx/en_us_oca/me.m01.d16:meVE.AposGlory.mode	@ltx/en_us_oca/miscellanea:misc.Mode6
ltx/en_us_oca/me.m01.d16:meVE.AposGlory.text	Peter, the rock of faith, ⁄ the fervent intercessor, ⁄ again lifts us up together for a spiritual feast, ⁄ setting before us his precious chains ⁄ as provision for a costly banquet ⁄ that our infirmities may be healed and our sorrows consoled, ⁄ and the storm-tossed ships of our life brought to harbor. ⁄ Come, let us kiss them, and entreat Christ Who glorified him, ⁄⁄ saying: By his prayers, O Christ, save our souls!
ltx/en_us_oca/me.m01.d16:meVE.AposStavrotheotokion.greekmelody	@ltx/en_us_oca/he.a.m6:heAU.TriimerosAnestis.greekname
ltx/en_us_oca/me.m01.d16:meVE.AposStavrotheotokion.incipit	@ltx/en_us_oca/oc.m6.d4:ocVE.AposTheotokion.incipit
ltx/en_us_oca/me.m01.d16:meVE.AposStavrotheotokion.melody	@ltx/en_us_oca/he.a.m6:heAU.TriimerosAnestis.notmetered
ltx/en_us_oca/me.m01.d16:meVE.AposStavrotheotokion.mode	@ltx/en_us_oca/miscellanea:misc.Mode6
ltx/en_us_oca/me.m01.d16:meVE.AposStavrotheotokion.text	@ltx/en_us_oca/oc.m6.d4:ocVE.AposTheotokion.text
ltx/en_us_oca/me.m01.d16:meVE.AposTheotokion.greekmelody	@ltx/en_us_oca/he.a.m6:heAU.OlinApothemenoi.greekname
ltx/en_us_oca/me.m01.d16:meVE.AposTheotokion.incipit	…
ltx/en_us_oca/me.m01.d16:meVE.AposTheotokion.melody	@ltx/en_us_oca/he.a.m6:heAU.OlinApothemenoi.notmetered
ltx/en_us_oca/me.m01.d16:meVE.AposTheotokion.mode	@ltx/en_us_oca/miscellanea:misc.Mode6
ltx/en_us_oca/me.m01.d16:meVE.AposTheotokion.text	
ltx/en_us_oca/me.m01.d16:meVE.Aposticha1.greekmelody	@ltx/en_us_oca/he.a.m4:heAU.EdokasSimeiosin.greekname
ltx/en_us_oca/me.m01.d16:meVE.Aposticha1.incipit	…
ltx/en_us_oca/me.m01.d16:meVE.Aposticha1.melody	@ltx/en_us_oca/he.a.m4:heAU.EdokasSimeiosin.notmetered
ltx/en_us_oca/me.m01.d16:meVE.Aposticha1.mode	@ltx/en_us_oca/miscellanea:misc.Mode4
ltx/en_us_oca/me.m01.d16:meVE.Aposticha1.text	
ltx/en_us_oca/me.m01.d16:meVE.Aposticha2.incipit	…
ltx/en_us_oca/me.m01.d16:meVE.Aposticha2.melody	@ltx/en_us_oca/he.a.m4:heAU.EdokasSimeiosin.notmetered
ltx/en_us_oca/me.m01.d16:meVE.Aposticha2.mode	@ltx/en_us_oca/miscellanea:misc.Mode4
ltx/en_us_oca/me.m01.d16:meVE.Aposticha2.text	
ltx/en_us_oca/me.m01.d16:meVE.Aposticha3.incipit	…
ltx/en_us_oca/me.m01.d16:meVE.Aposticha3.melody	@ltx/en_us_oca/he.a.m4:heAU.EdokasSimeiosin.notmetered
ltx/en_us_oca/me.m01.d16:meVE.Aposticha3.mode	@ltx/en_us_oca/miscellanea:misc.Mode4
ltx/en_us_oca/me.m01.d16:meVE.Aposticha3.text	
ltx/en_us_oca/me.m01.d16:meVE.SticGlory.incipit	Today Peter, the rock of…
ltx/en_us_oca/me.m01.d16:meVE.SticGlory.melody	
ltx/en_us_oca/me.m01.d16:meVE.SticGlory.mode	@ltx/en_us_oca/miscellanea:misc.Mode6
ltx/en_us_oca/me.m01.d16:meVE.SticGlory.poet	@ltx/en_us_oca/poets:po.Vyzantos
ltx/en_us_oca/me.m01.d16:meVE.SticGlory.text	Today Peter, the rock of faith, ⁄ the foundation of the church, ⁄ appoints his precious chains for the devotion of our souls. ⁄ Come and let us kiss them, ⁄ crowning him with songs of praise and chanting: ⁄ Rejoice, fervent champion of the faith, ⁄ for with ardent knowledge and great boldness ⁄ you confessed Christ, the Son of God! ⁄ Rejoice, joy of the universe, ⁄ keeper of the keys of the kingdom of heaven, ⁄ for you give grace to those who honor you with love ⁄ and venerate your precious chains with longing! ⁄ As you stand before the throne of Christ, the King of all, ⁄⁄ ever pray for us who celebrate your memory!
ltx/en_us_oca/me.m01.d16:meVE.SticStavrotheotokion.greekmelody	@ltx/en_us_oca/he.a.m6:heAU.TriimerosAnestis.greekname
ltx/en_us_oca/me.m01.d16:meVE.SticStavrotheotokion.incipit	…
ltx/en_us_oca/me.m01.d16:meVE.SticStavrotheotokion.melody	@ltx/en_us_oca/he.a.m6:heAU.TriimerosAnestis.notmetered
ltx/en_us_oca/me.m01.d16:meVE.SticStavrotheotokion.mode	@ltx/en_us_oca/miscellanea:misc.Mode6
ltx/en_us_oca/me.m01.d16:meVE.SticStavrotheotokion.text	
ltx/en_us_oca/me.m01.d16:meVE.SticTheotokion.incipit	@ltx/en_us_oca/he.o:heOT.TheotokeSyEi.incipit
ltx/en_us_oca/me.m01.d16:meVE.SticTheotokion.melody	@ltx/en_us_oca/he.o:heOT.TheotokeSyEi.name
ltx/en_us_oca/me.m01.d16:meVE.SticTheotokion.mode	@ltx/en_us_oca/miscellanea:misc.Mode6
ltx/en_us_oca/me.m01.d16:meVE.SticTheotokion.text	@ltx/en_us_oca/he.o:heOT.TheotokeSyEiApostolou.text
ltx/en_us_oca/me.m01.d16:meVE.Stichera01.greekmelody	@ltx/en_us_oca/he.a.m4:heAU.OsGennaionEnMartysi.greekname
ltx/en_us_oca/me.m01.d16:meVE.Stichera01.incipit	Bound to the Lord, you…
ltx/en_us_oca/me.m01.d16:meVE.Stichera01.melody	@ltx/en_us_oca/he.a.m4:heAU.OsGennaionEnMartysi.notmetered
ltx/en_us_oca/me.m01.d16:meVE.Stichera01.mode	@ltx/en_us_oca/miscellanea:misc.Mode4
ltx/en_us_oca/me.m01.d16:meVE.Stichera01.text	Bound to the Lord, you were imprisoned in a dungeon. ⁄ Thus you bound falsehood, Apostle. ⁄ Therefore we honor you with love ⁄ and kiss your chains with faith. ⁄ From them we draw healing of body and salvation of our souls. ⁄ We fittingly praise you, ⁄⁄ God-seer and conversor with the angels.
ltx/en_us_oca/me.m01.d16:meVE.Stichera02.incipit	Those who are bound by…
ltx/en_us_oca/me.m01.d16:meVE.Stichera02.melody	@ltx/en_us_oca/he.a.m4:heAU.OsGennaionEnMartysi.notmetered
ltx/en_us_oca/me.m01.d16:meVE.Stichera02.mode	@ltx/en_us_oca/miscellanea:misc.Mode4
ltx/en_us_oca/me.m01.d16:meVE.Stichera02.text	Those who are bound by ignorance, ⁄ receive understanding through you. ⁄ The peoples of the gentiles who first were scattered, ⁄ were shown to you in an image let down from on high ⁄ as a sheet containing every living creature. ⁄ Therefore, Apostle, every generation glorifies you, ⁄⁄ venerating the chains which you bore with diligence for Christ!
ltx/en_us_oca/me.m01.d16:meVE.Stichera03.incipit	The One Whom you denied…
ltx/en_us_oca/me.m01.d16:meVE.Stichera03.melody	@ltx/en_us_oca/he.a.m4:heAU.OsGennaionEnMartysi.notmetered
ltx/en_us_oca/me.m01.d16:meVE.Stichera03.mode	@ltx/en_us_oca/miscellanea:misc.Mode4
ltx/en_us_oca/me.m01.d16:meVE.Stichera03.text	The One Whom you denied at His condemnation, ⁄ you hymned when He rose from the dead. ⁄ You preached Him to the ends of the earth, Apostle, ⁄ as the God and Man Who in His great goodness ⁄ entered into fellowship with mankind! ⁄ Therefore, we bless you with love, all-glorious Peter, ⁄⁄ venerating the chains which you bore with diligence for Christ!
