ltx/en_us_oca/tr.d050:trCO.header	
ltx/en_us_oca/tr.d050:trDA.commemoration.full	
ltx/en_us_oca/tr.d050:trDA.commemoration.short	
ltx/en_us_oca/tr.d050:trDA.dismissal	@ltx/en_us_oca/dismissals:dis00.resurrection
ltx/en_us_oca/tr.d050:trDA.insert1	
ltx/en_us_oca/tr.d050:trDA.insert2	
ltx/en_us_oca/tr.d050:trDA.note	
ltx/en_us_oca/tr.d050:trDA.title	
ltx/en_us_oca/tr.d050:trHO.commemorations	
ltx/en_us_oca/tr.d050:trHO.daytitle	
ltx/en_us_oca/tr.d050:trHO.description1	
ltx/en_us_oca/tr.d050:trHO.description2	
ltx/en_us_oca/tr.d050:trHO.note1	
ltx/en_us_oca/tr.d050:trHO.note2	
ltx/en_us_oca/tr.d050:trLI.Kontakion1.incipit	@ltx/en_us_oca/tr.d050:trMA.Kontakion1.incipit
ltx/en_us_oca/tr.d050:trLI.Kontakion1.melody	@ltx/en_us_oca/tr.d050:trMA.Kontakion1.melody
ltx/en_us_oca/tr.d050:trLI.Kontakion1.mode	@ltx/en_us_oca/tr.d050:trMA.Kontakion1.mode
ltx/en_us_oca/tr.d050:trLI.Kontakion1.text	@ltx/en_us_oca/tr.d050:trMA.Kontakion1.text
ltx/en_us_oca/tr.d050:trLI.Megalynarion.text	
ltx/en_us_oca/tr.d050:trMA.C1.title	@ltx/en_us_oca/titles:ti.CanonTriodion
ltx/en_us_oca/tr.d050:trMA.C1.verse	@ltx/en_us_oca/prayers:pr.verse_God.text
ltx/en_us_oca/tr.d050:trMA.C2.poet	
ltx/en_us_oca/tr.d050:trMA.C2.title	@ltx/en_us_oca/titles:ti.CanonDevoutM
ltx/en_us_oca/tr.d050:trMA.C2.verse	@ltx/en_us_oca/prayers:pr.verse_SaintM.text
ltx/en_us_oca/tr.d050:trMA.ExapTheotokion.greekmelody	@ltx/en_us_oca/he.a.m2:heAU.GynaikesAkoutisthite.greekname
ltx/en_us_oca/tr.d050:trMA.ExapTheotokion.incipit	…
ltx/en_us_oca/tr.d050:trMA.ExapTheotokion.melody	@ltx/en_us_oca/he.a.m2:heAU.GynaikesAkoutisthite.notmetered
ltx/en_us_oca/tr.d050:trMA.ExapTheotokion.mode	@ltx/en_us_oca/miscellanea:misc.Mode2
ltx/en_us_oca/tr.d050:trMA.ExapTheotokion.text	
ltx/en_us_oca/tr.d050:trMA.Exaposteilarion1.greekmelody	@ltx/en_us_oca/he.a.m2:heAU.GynaikesAkoutisthite.greekname
ltx/en_us_oca/tr.d050:trMA.Exaposteilarion1.incipit	…
ltx/en_us_oca/tr.d050:trMA.Exaposteilarion1.melody	@ltx/en_us_oca/he.a.m2:heAU.GynaikesAkoutisthite.notmetered
ltx/en_us_oca/tr.d050:trMA.Exaposteilarion1.mode	@ltx/en_us_oca/miscellanea:misc.Mode2
ltx/en_us_oca/tr.d050:trMA.Exaposteilarion1.text	
ltx/en_us_oca/tr.d050:trMA.Kontakion1.incipit	The Lord truly set you…
ltx/en_us_oca/tr.d050:trMA.Kontakion1.melody	@ltx/en_us_oca/he.a.m4:heAU.EpefanisSimeron.notmetered
ltx/en_us_oca/tr.d050:trMA.Kontakion1.mode	@ltx/en_us_oca/miscellanea:misc.Mode4
ltx/en_us_oca/tr.d050:trMA.Kontakion1.text	The Lord truly set you on the heights of abstinence, ⁄ to be a guiding star, ⁄⁄ showing the way to the universe, our Father and Teacher John.
ltx/en_us_oca/tr.d050:trMA.Lauds1.greekmelody	@ltx/en_us_oca/he.a.m8:heAU.OTouParadoxou.greekname
ltx/en_us_oca/tr.d050:trMA.Lauds1.incipit	@ltx/en_us_oca/tr.d050:trVE.Stichera01.incipit
ltx/en_us_oca/tr.d050:trMA.Lauds1.melody	@ltx/en_us_oca/he.a.m8:heAU.OTouParadoxou.notmetered
ltx/en_us_oca/tr.d050:trMA.Lauds1.mode	@ltx/en_us_oca/miscellanea:misc.Mode8
ltx/en_us_oca/tr.d050:trMA.Lauds1.text	@ltx/en_us_oca/tr.d050:trVE.Stichera01.text
ltx/en_us_oca/tr.d050:trMA.Lauds2.incipit	@ltx/en_us_oca/tr.d050:trVE.Stichera02.incipit
ltx/en_us_oca/tr.d050:trMA.Lauds2.melody	@ltx/en_us_oca/he.a.m8:heAU.OTouParadoxou.notmetered
ltx/en_us_oca/tr.d050:trMA.Lauds2.mode	@ltx/en_us_oca/miscellanea:misc.Mode8
ltx/en_us_oca/tr.d050:trMA.Lauds2.text	@ltx/en_us_oca/tr.d050:trVE.Stichera02.text
ltx/en_us_oca/tr.d050:trMA.Lauds3.incipit	@ltx/en_us_oca/tr.d050:trVE.Stichera03.incipit
ltx/en_us_oca/tr.d050:trMA.Lauds3.melody	@ltx/en_us_oca/he.a.m8:heAU.OTouParadoxou.notmetered
ltx/en_us_oca/tr.d050:trMA.Lauds3.mode	@ltx/en_us_oca/miscellanea:misc.Mode8
ltx/en_us_oca/tr.d050:trMA.Lauds3.text	@ltx/en_us_oca/tr.d050:trVE.Stichera03.text
ltx/en_us_oca/tr.d050:trMA.LaudsGlory.incipit	…
ltx/en_us_oca/tr.d050:trMA.LaudsGlory.melody	@ltx/en_us_oca/miscellanea:misc.Idiomelon
ltx/en_us_oca/tr.d050:trMA.LaudsGlory.mode	@ltx/en_us_oca/miscellanea:misc.Mode1
ltx/en_us_oca/tr.d050:trMA.LaudsGlory.text	
ltx/en_us_oca/tr.d050:trMA.Ode1C11.greekmelody	@ltx/en_us_oca/he.h.m5:heHE.ToSotiriTheo.greekname
ltx/en_us_oca/tr.d050:trMA.Ode1C11.incipit	I have become like the…
ltx/en_us_oca/tr.d050:trMA.Ode1C11.melody	@ltx/en_us_oca/he.h.m5:heHE.ToSotiriTheo.notmetered
ltx/en_us_oca/tr.d050:trMA.Ode1C11.mode	@ltx/en_us_oca/miscellanea:misc.Mode5
ltx/en_us_oca/tr.d050:trMA.Ode1C11.ode	@ltx/en_us_oca/miscellanea:misc.Ode1
ltx/en_us_oca/tr.d050:trMA.Ode1C11.text	I have become like the man who fell among thieves, ⁄ Christ my Savior, ⁄ wounded and left half dead. ⁄ For through my sins, I have wounds more grevious than his.
ltx/en_us_oca/tr.d050:trMA.Ode1C12.incipit	The man stripped of all…
ltx/en_us_oca/tr.d050:trMA.Ode1C12.melody	@ltx/en_us_oca/he.h.m5:heHE.ToSotiriTheo.notmetered
ltx/en_us_oca/tr.d050:trMA.Ode1C12.mode	@ltx/en_us_oca/miscellanea:misc.Mode5
ltx/en_us_oca/tr.d050:trMA.Ode1C12.ode	@ltx/en_us_oca/miscellanea:misc.Ode1
ltx/en_us_oca/tr.d050:trMA.Ode1C12.text	The man stripped of all Your wealth, cried out lamenting: ⁄ Savior, I am gravely wounded! ⁄ Do not leave me to thieves and robbers! ⁄ So also I pray to You: ⁄ Save me, Merciful Lord!
ltx/en_us_oca/tr.d050:trMA.Ode1C13.incipit	My mind has been scourged…
ltx/en_us_oca/tr.d050:trMA.Ode1C13.melody	@ltx/en_us_oca/he.h.m5:heHE.ToSotiriTheo.notmetered
ltx/en_us_oca/tr.d050:trMA.Ode1C13.mode	@ltx/en_us_oca/miscellanea:misc.Mode5
ltx/en_us_oca/tr.d050:trMA.Ode1C13.ode	@ltx/en_us_oca/miscellanea:misc.Ode1
ltx/en_us_oca/tr.d050:trMA.Ode1C13.text	My mind has been scourged with the whips of sin: ⁄ wicked thieves and evil thoughts. ⁄ Heal me, Christ my Savior, ⁄ and save me, for You are rich in mercy.
ltx/en_us_oca/tr.d050:trMA.Ode1C1T.incipit	Christ took flesh from you…
ltx/en_us_oca/tr.d050:trMA.Ode1C1T.melody	@ltx/en_us_oca/he.h.m5:heHE.ToSotiriTheo.notmetered
ltx/en_us_oca/tr.d050:trMA.Ode1C1T.mode	@ltx/en_us_oca/miscellanea:misc.Mode5
ltx/en_us_oca/tr.d050:trMA.Ode1C1T.ode	@ltx/en_us_oca/miscellanea:misc.Ode1
ltx/en_us_oca/tr.d050:trMA.Ode1C1T.text	Christ took flesh from you, undefiled Mother of God, ⁄ while always remaining in the bosom of the Father. ⁄ Pray to Him without ceasing that He may save from all harm ⁄ the creatures He has formed.
ltx/en_us_oca/tr.d050:trMA.Ode1C21.greekmelody	@ltx/en_us_oca/he.h.m8:heHE.YgranDiodefsas.greekname
ltx/en_us_oca/tr.d050:trMA.Ode1C21.incipit	You ascended from the darkness…
ltx/en_us_oca/tr.d050:trMA.Ode1C21.melody	@ltx/en_us_oca/he.h.m8:heHE.YgranDiodefsas.notmetered
ltx/en_us_oca/tr.d050:trMA.Ode1C21.mode	@ltx/en_us_oca/miscellanea:misc.Mode8
ltx/en_us_oca/tr.d050:trMA.Ode1C21.ode	@ltx/en_us_oca/miscellanea:misc.Ode1
ltx/en_us_oca/tr.d050:trMA.Ode1C21.text	You ascended from the darkness and sorrow of material things, ⁄ and went to dwell in spiritual light, holy John: ⁄ Give me light through your intercessions to the Lord.
ltx/en_us_oca/tr.d050:trMA.Ode1C22.incipit	You were suckled on the…
ltx/en_us_oca/tr.d050:trMA.Ode1C22.melody	@ltx/en_us_oca/he.h.m8:heHE.YgranDiodefsas.notmetered
ltx/en_us_oca/tr.d050:trMA.Ode1C22.mode	@ltx/en_us_oca/miscellanea:misc.Mode8
ltx/en_us_oca/tr.d050:trMA.Ode1C22.ode	@ltx/en_us_oca/miscellanea:misc.Ode1
ltx/en_us_oca/tr.d050:trMA.Ode1C22.text	You were suckled on the sweetness of abstinence, ⁄ and cast away the bitterness of sensual indulgence. ⁄ Therefore, Father, you give us pleasure sweeter than honey and the honeycomb!
ltx/en_us_oca/tr.d050:trMA.Ode1C23.incipit	You rejected the pleasures that…
ltx/en_us_oca/tr.d050:trMA.Ode1C23.melody	@ltx/en_us_oca/he.h.m8:heHE.YgranDiodefsas.notmetered
ltx/en_us_oca/tr.d050:trMA.Ode1C23.mode	@ltx/en_us_oca/miscellanea:misc.Mode8
ltx/en_us_oca/tr.d050:trMA.Ode1C23.ode	@ltx/en_us_oca/miscellanea:misc.Ode1
ltx/en_us_oca/tr.d050:trMA.Ode1C23.text	You rejected the pleasures that creep in the dust, ⁄ and ascended to the height of virtues, holy Father. ⁄ Thus you became the sweetness of salvation to your flock.
ltx/en_us_oca/tr.d050:trMA.Ode1C2T.incipit	You ineffably bore the Word…
ltx/en_us_oca/tr.d050:trMA.Ode1C2T.melody	@ltx/en_us_oca/he.h.m8:heHE.YgranDiodefsas.notmetered
ltx/en_us_oca/tr.d050:trMA.Ode1C2T.mode	@ltx/en_us_oca/miscellanea:misc.Mode8
ltx/en_us_oca/tr.d050:trMA.Ode1C2T.ode	@ltx/en_us_oca/miscellanea:misc.Ode1
ltx/en_us_oca/tr.d050:trMA.Ode1C2T.text	You ineffably bore the Word and Wisdom of the Father: ⁄ Heal the harsh wounds of my soul and still the anguish of my heart!
ltx/en_us_oca/tr.d050:trMA.Ode3C11.greekmelody	@ltx/en_us_oca/he.h.m5:heHE.StereosonImasOTheos.greekname
ltx/en_us_oca/tr.d050:trMA.Ode3C11.incipit	Christ, as I walk on…
ltx/en_us_oca/tr.d050:trMA.Ode3C11.melody	@ltx/en_us_oca/he.h.m5:heHE.StereosonImasOTheos.notmetered
ltx/en_us_oca/tr.d050:trMA.Ode3C11.mode	@ltx/en_us_oca/miscellanea:misc.Mode5
ltx/en_us_oca/tr.d050:trMA.Ode3C11.ode	@ltx/en_us_oca/miscellanea:misc.Ode3
ltx/en_us_oca/tr.d050:trMA.Ode3C11.text	Christ, as I walk on the path of life, ⁄ I am gravely wounded by thieves through my passions: ⁄ I pray that You will raise me up.
ltx/en_us_oca/tr.d050:trMA.Ode3C12.incipit	Thieves have robbed my mind…
ltx/en_us_oca/tr.d050:trMA.Ode3C12.melody	@ltx/en_us_oca/he.h.m5:heHE.StereosonImasOTheos.notmetered
ltx/en_us_oca/tr.d050:trMA.Ode3C12.mode	@ltx/en_us_oca/miscellanea:misc.Mode5
ltx/en_us_oca/tr.d050:trMA.Ode3C12.ode	@ltx/en_us_oca/miscellanea:misc.Ode3
ltx/en_us_oca/tr.d050:trMA.Ode3C12.text	Thieves have robbed my mind and left me half dead. ⁄ I am wounded by my sins, but heal me, Lord.
ltx/en_us_oca/tr.d050:trMA.Ode3C13.incipit	My passions have stripped me…
ltx/en_us_oca/tr.d050:trMA.Ode3C13.melody	@ltx/en_us_oca/he.h.m5:heHE.StereosonImasOTheos.notmetered
ltx/en_us_oca/tr.d050:trMA.Ode3C13.mode	@ltx/en_us_oca/miscellanea:misc.Mode5
ltx/en_us_oca/tr.d050:trMA.Ode3C13.ode	@ltx/en_us_oca/miscellanea:misc.Ode3
ltx/en_us_oca/tr.d050:trMA.Ode3C13.text	My passions have stripped me bare of Your commandments, Christ, ⁄ and I have been scourged by sensual pleasures, ⁄ but pour oil on my wounds, O Savior.
ltx/en_us_oca/tr.d050:trMA.Ode3C1T.incipit	Pray without ceasing, pure Bride…
ltx/en_us_oca/tr.d050:trMA.Ode3C1T.melody	@ltx/en_us_oca/he.h.m5:heHE.StereosonImasOTheos.notmetered
ltx/en_us_oca/tr.d050:trMA.Ode3C1T.mode	@ltx/en_us_oca/miscellanea:misc.Mode5
ltx/en_us_oca/tr.d050:trMA.Ode3C1T.ode	@ltx/en_us_oca/miscellanea:misc.Ode3
ltx/en_us_oca/tr.d050:trMA.Ode3C1T.text	Pray without ceasing, pure Bride of God, ⁄ to the One who came forth from your womb, ⁄ that those who sing your praises may be delivered from the deceit of the devil.
ltx/en_us_oca/tr.d050:trMA.Ode3C21.greekmelody	@ltx/en_us_oca/he.h.m8:heHE.SyEiToStereoma.greekname
ltx/en_us_oca/tr.d050:trMA.Ode3C21.incipit	You burnt up the thorns…
ltx/en_us_oca/tr.d050:trMA.Ode3C21.melody	@ltx/en_us_oca/he.h.m8:heHE.SyEiToStereoma.notmetered
ltx/en_us_oca/tr.d050:trMA.Ode3C21.mode	@ltx/en_us_oca/miscellanea:misc.Mode8
ltx/en_us_oca/tr.d050:trMA.Ode3C21.ode	@ltx/en_us_oca/miscellanea:misc.Ode3
ltx/en_us_oca/tr.d050:trMA.Ode3C21.text	You burnt up the thorns of the passions ⁄ with the fiery coal of your ascetic warfare, holy one, ⁄ giving warmth with your fervor to all who follow the monastic life.
ltx/en_us_oca/tr.d050:trMA.Ode3C22.incipit	You became the myrrh of…
ltx/en_us_oca/tr.d050:trMA.Ode3C22.melody	@ltx/en_us_oca/he.h.m8:heHE.SyEiToStereoma.notmetered
ltx/en_us_oca/tr.d050:trMA.Ode3C22.mode	@ltx/en_us_oca/miscellanea:misc.Mode8
ltx/en_us_oca/tr.d050:trMA.Ode3C22.ode	@ltx/en_us_oca/miscellanea:misc.Ode3
ltx/en_us_oca/tr.d050:trMA.Ode3C22.text	You became the myrrh of sanctification ⁄ through your ascetic labors, holy one. ⁄ You were offered up as a sweet smelling incense to God.
ltx/en_us_oca/tr.d050:trMA.Ode3C23.incipit	You drowned the waters of…
ltx/en_us_oca/tr.d050:trMA.Ode3C23.melody	@ltx/en_us_oca/he.h.m8:heHE.SyEiToStereoma.notmetered
ltx/en_us_oca/tr.d050:trMA.Ode3C23.mode	@ltx/en_us_oca/miscellanea:misc.Mode8
ltx/en_us_oca/tr.d050:trMA.Ode3C23.ode	@ltx/en_us_oca/miscellanea:misc.Ode3
ltx/en_us_oca/tr.d050:trMA.Ode3C23.text	You drowned the waters of the passions through your tears ⁄ as you gave heed to the laws of the ascetic life, ⁄ as the soldiers of Pharaoh were once drowned in the Red Sea.
ltx/en_us_oca/tr.d050:trMA.Ode3C2T.incipit	Check the restless tumult of…
ltx/en_us_oca/tr.d050:trMA.Ode3C2T.melody	@ltx/en_us_oca/he.h.m8:heHE.SyEiToStereoma.notmetered
ltx/en_us_oca/tr.d050:trMA.Ode3C2T.mode	@ltx/en_us_oca/miscellanea:misc.Mode8
ltx/en_us_oca/tr.d050:trMA.Ode3C2T.ode	@ltx/en_us_oca/miscellanea:misc.Ode3
ltx/en_us_oca/tr.d050:trMA.Ode3C2T.text	Check the restless tumult of my thoughts, ⁄ and guide me to your Son, pure Mother of God!
ltx/en_us_oca/tr.d050:trMA.Ode3Kathisma1.incipit	With your holy Cross as…
ltx/en_us_oca/tr.d050:trMA.Ode3Kathisma1.melody	
ltx/en_us_oca/tr.d050:trMA.Ode3Kathisma1.mode	@ltx/en_us_oca/miscellanea:misc.Mode5
ltx/en_us_oca/tr.d050:trMA.Ode3Kathisma1.text	With your holy Cross as our weapon of salvation, ⁄ we cry aloud to you, our Savior: ⁄ You have willingly suffered for our sake: ⁄⁄ save us in your great mercy, O God of all!
ltx/en_us_oca/tr.d050:trMA.Ode3Kathisma2.greekmelody	@ltx/en_us_oca/he.a.m4:heAU.OYpsotheisEnToStavro.greekname
ltx/en_us_oca/tr.d050:trMA.Ode3Kathisma2.incipit	You went to dwell in…
ltx/en_us_oca/tr.d050:trMA.Ode3Kathisma2.melody	@ltx/en_us_oca/he.a.m4:heAU.OYpsotheisEnToStavro.notmetered
ltx/en_us_oca/tr.d050:trMA.Ode3Kathisma2.mode	@ltx/en_us_oca/miscellanea:misc.Mode4
ltx/en_us_oca/tr.d050:trMA.Ode3Kathisma2.text	You went to dwell in the heights of heaven, ⁄ shining with the glory of the virtues. ⁄ You entered the boundless depths of contemplation; ⁄ you exposed to mockery all the snares of the demons, ⁄ protecting mankind from their cruel violence, ⁄ and now, John, ladder of the virtues, ⁄⁄ you intercede for the salvation of your servants.
ltx/en_us_oca/tr.d050:trMA.Ode3Kathisma3.greekmelody	@ltx/en_us_oca/he.a.m4:heAU.OYpsotheisEnToStavro.greekname
ltx/en_us_oca/tr.d050:trMA.Ode3Kathisma3.incipit	He who is enthroned upon…
ltx/en_us_oca/tr.d050:trMA.Ode3Kathisma3.melody	@ltx/en_us_oca/he.a.m4:heAU.OYpsotheisEnToStavro.notmetered
ltx/en_us_oca/tr.d050:trMA.Ode3Kathisma3.mode	@ltx/en_us_oca/miscellanea:misc.Mode4
ltx/en_us_oca/tr.d050:trMA.Ode3Kathisma3.text	He who is enthroned upon the cherubim ⁄ and dwells in the bosom of the Father, ⁄ rests incarnate on your bosom, O Lady, ⁄ as upon his holy throne! ⁄ As God he is the Ruler of all nations, ⁄ and with understanding we now sing to him. ⁄⁄ Pray to him for the salvation of your servants!
ltx/en_us_oca/tr.d050:trMA.Ode4C11.greekmelody	@ltx/en_us_oca/he.h.m5:heHE.AkikoaKyrieTinEkTouTafou.greekname
ltx/en_us_oca/tr.d050:trMA.Ode4C11.incipit	Thieves have taken from me…
ltx/en_us_oca/tr.d050:trMA.Ode4C11.melody	@ltx/en_us_oca/he.h.m5:heHE.AkikoaKyrieTinEkTouTafou.notmetered
ltx/en_us_oca/tr.d050:trMA.Ode4C11.mode	@ltx/en_us_oca/miscellanea:misc.Mode5
ltx/en_us_oca/tr.d050:trMA.Ode4C11.ode	@ltx/en_us_oca/miscellanea:misc.Ode4
ltx/en_us_oca/tr.d050:trMA.Ode4C11.text	Thieves have taken from me my godly deeds, ⁄ leaving me chastised and in agony.
ltx/en_us_oca/tr.d050:trMA.Ode4C12.incipit	My unstable thoughts have stripped…
ltx/en_us_oca/tr.d050:trMA.Ode4C12.melody	@ltx/en_us_oca/he.h.m5:heHE.AkikoaKyrieTinEkTouTafou.notmetered
ltx/en_us_oca/tr.d050:trMA.Ode4C12.mode	@ltx/en_us_oca/miscellanea:misc.Mode5
ltx/en_us_oca/tr.d050:trMA.Ode4C12.ode	@ltx/en_us_oca/miscellanea:misc.Ode4
ltx/en_us_oca/tr.d050:trMA.Ode4C12.text	My unstable thoughts have stripped me bare of Your commandments, O Savior, ⁄ and I have been scourged by my transgressions.
ltx/en_us_oca/tr.d050:trMA.Ode4C13.incipit	The Levite, when he saw…
ltx/en_us_oca/tr.d050:trMA.Ode4C13.melody	@ltx/en_us_oca/he.h.m5:heHE.AkikoaKyrieTinEkTouTafou.notmetered
ltx/en_us_oca/tr.d050:trMA.Ode4C13.mode	@ltx/en_us_oca/miscellanea:misc.Mode5
ltx/en_us_oca/tr.d050:trMA.Ode4C13.ode	@ltx/en_us_oca/miscellanea:misc.Ode4
ltx/en_us_oca/tr.d050:trMA.Ode4C13.text	The Levite, when he saw me wounded, ⁄ passed by on the other side, ⁄ but save me, O Savior!
ltx/en_us_oca/tr.d050:trMA.Ode4C1T.incipit	We rightly glorify you, O…
ltx/en_us_oca/tr.d050:trMA.Ode4C1T.melody	@ltx/en_us_oca/he.h.m5:heHE.AkikoaKyrieTinEkTouTafou.notmetered
ltx/en_us_oca/tr.d050:trMA.Ode4C1T.mode	@ltx/en_us_oca/miscellanea:misc.Mode5
ltx/en_us_oca/tr.d050:trMA.Ode4C1T.ode	@ltx/en_us_oca/miscellanea:misc.Ode4
ltx/en_us_oca/tr.d050:trMA.Ode4C1T.text	We rightly glorify you, O Theotokos, ⁄ taking refuge with all the faithful beneath your protection.
ltx/en_us_oca/tr.d050:trMA.Ode4C21.greekmelody	@ltx/en_us_oca/he.h.m8:heHE.EisakikoaKyrie.greekname
ltx/en_us_oca/tr.d050:trMA.Ode4C21.incipit	You are a fragrant meadow…
ltx/en_us_oca/tr.d050:trMA.Ode4C21.melody	@ltx/en_us_oca/he.h.m8:heHE.EisakikoaKyrie.notmetered
ltx/en_us_oca/tr.d050:trMA.Ode4C21.mode	@ltx/en_us_oca/miscellanea:misc.Mode8
ltx/en_us_oca/tr.d050:trMA.Ode4C21.ode	@ltx/en_us_oca/miscellanea:misc.Ode4
ltx/en_us_oca/tr.d050:trMA.Ode4C21.text	You are a fragrant meadow and a living paradise of the virtues, ⁄ producing abundantly the fruit of abstinence ⁄ which gives nourishment to all who honor you.
ltx/en_us_oca/tr.d050:trMA.Ode4C22.incipit	You are truly a giver…
ltx/en_us_oca/tr.d050:trMA.Ode4C22.melody	@ltx/en_us_oca/he.h.m8:heHE.EisakikoaKyrie.notmetered
ltx/en_us_oca/tr.d050:trMA.Ode4C22.mode	@ltx/en_us_oca/miscellanea:misc.Mode8
ltx/en_us_oca/tr.d050:trMA.Ode4C22.ode	@ltx/en_us_oca/miscellanea:misc.Ode4
ltx/en_us_oca/tr.d050:trMA.Ode4C22.text	You are truly a giver of the law like Moses, ⁄ a meek and gentle ruler like David ⁄ for all who follow the ascetic and monastic life. ⁄ Therefore we bless you, Father John.
ltx/en_us_oca/tr.d050:trMA.Ode4C23.incipit	Planted by the waters of…
ltx/en_us_oca/tr.d050:trMA.Ode4C23.melody	@ltx/en_us_oca/he.h.m8:heHE.EisakikoaKyrie.notmetered
ltx/en_us_oca/tr.d050:trMA.Ode4C23.mode	@ltx/en_us_oca/miscellanea:misc.Mode8
ltx/en_us_oca/tr.d050:trMA.Ode4C23.ode	@ltx/en_us_oca/miscellanea:misc.Ode4
ltx/en_us_oca/tr.d050:trMA.Ode4C23.text	Planted by the waters of abstinence, blessed father, ⁄ you have become a fruitful vine, bearing the grapes of true sanctity.
ltx/en_us_oca/tr.d050:trMA.Ode4C2T.incipit	Mother of God, you bore…
ltx/en_us_oca/tr.d050:trMA.Ode4C2T.melody	@ltx/en_us_oca/he.h.m8:heHE.EisakikoaKyrie.notmetered
ltx/en_us_oca/tr.d050:trMA.Ode4C2T.mode	@ltx/en_us_oca/miscellanea:misc.Mode8
ltx/en_us_oca/tr.d050:trMA.Ode4C2T.ode	@ltx/en_us_oca/miscellanea:misc.Ode4
ltx/en_us_oca/tr.d050:trMA.Ode4C2T.text	Mother of God, you bore for us in time ⁄ the One who shone forth timelessly from the Father. ⁄ Entreat Him to save those who sing your praises!
ltx/en_us_oca/tr.d050:trMA.Ode5C11.greekmelody	@ltx/en_us_oca/he.h.m5:heHE.EkNyktosOrthrizontes.greekname
ltx/en_us_oca/tr.d050:trMA.Ode5C11.incipit	Jesus, bind up the wounds…
ltx/en_us_oca/tr.d050:trMA.Ode5C11.melody	@ltx/en_us_oca/he.h.m5:heHE.EkNyktosOrthrizontes.notmetered
ltx/en_us_oca/tr.d050:trMA.Ode5C11.mode	@ltx/en_us_oca/miscellanea:misc.Mode5
ltx/en_us_oca/tr.d050:trMA.Ode5C11.ode	@ltx/en_us_oca/miscellanea:misc.Ode5
ltx/en_us_oca/tr.d050:trMA.Ode5C11.text	Jesus, bind up the wounds of my soul, ⁄ as the Samaritan bound the wounds of the man who fell among thieves, ⁄ and heal my pain, I pray, O Christ.
ltx/en_us_oca/tr.d050:trMA.Ode5C12.incipit	My soul is sick and…
ltx/en_us_oca/tr.d050:trMA.Ode5C12.melody	@ltx/en_us_oca/he.h.m5:heHE.EkNyktosOrthrizontes.notmetered
ltx/en_us_oca/tr.d050:trMA.Ode5C12.mode	@ltx/en_us_oca/miscellanea:misc.Mode5
ltx/en_us_oca/tr.d050:trMA.Ode5C12.ode	@ltx/en_us_oca/miscellanea:misc.Ode5
ltx/en_us_oca/tr.d050:trMA.Ode5C12.text	My soul is sick and in agony, ⁄ scourged by my transgressions, O Christ. ⁄ I lie naked and bereft of the divine virtues; ⁄ but I beseech You, save me.
ltx/en_us_oca/tr.d050:trMA.Ode5C13.incipit	When the priest and the…
ltx/en_us_oca/tr.d050:trMA.Ode5C13.melody	@ltx/en_us_oca/he.h.m5:heHE.EkNyktosOrthrizontes.notmetered
ltx/en_us_oca/tr.d050:trMA.Ode5C13.mode	@ltx/en_us_oca/miscellanea:misc.Mode5
ltx/en_us_oca/tr.d050:trMA.Ode5C13.ode	@ltx/en_us_oca/miscellanea:misc.Ode5
ltx/en_us_oca/tr.d050:trMA.Ode5C13.text	When the priest and the Levite saw me, ⁄ they could not help me, ⁄ but passed me by on the other side. ⁄ But in Your compassion ⁄ You have given me salvation and kept me from harm.
ltx/en_us_oca/tr.d050:trMA.Ode5C1T.incipit	My mind has been painfully…
ltx/en_us_oca/tr.d050:trMA.Ode5C1T.melody	@ltx/en_us_oca/he.h.m5:heHE.EkNyktosOrthrizontes.notmetered
ltx/en_us_oca/tr.d050:trMA.Ode5C1T.mode	@ltx/en_us_oca/miscellanea:misc.Mode5
ltx/en_us_oca/tr.d050:trMA.Ode5C1T.ode	@ltx/en_us_oca/miscellanea:misc.Ode5
ltx/en_us_oca/tr.d050:trMA.Ode5C1T.text	My mind has been painfully scourged by thieves, ⁄ but I entreat You, O Master, ⁄ do not despise me in my wretchedness, ⁄ but take pity on me, O Savior, ⁄ at the intercessions of Your Mother.
ltx/en_us_oca/tr.d050:trMA.Ode5C21.greekmelody	@ltx/en_us_oca/he.h.m8:heHE.InaTiMeAposo.greekname
ltx/en_us_oca/tr.d050:trMA.Ode5C21.incipit	You quenched all the passions…
ltx/en_us_oca/tr.d050:trMA.Ode5C21.melody	@ltx/en_us_oca/he.h.m8:heHE.InaTiMeAposo.notmetered
ltx/en_us_oca/tr.d050:trMA.Ode5C21.mode	@ltx/en_us_oca/miscellanea:misc.Mode8
ltx/en_us_oca/tr.d050:trMA.Ode5C21.ode	@ltx/en_us_oca/miscellanea:misc.Ode5
ltx/en_us_oca/tr.d050:trMA.Ode5C21.text	You quenched all the passions with the dew of your ascetic struggles, ⁄ kindling the lamp of abstinence ⁄ with the fire of love and faith, father. ⁄ You are a dispassionate light and a child of the day!
ltx/en_us_oca/tr.d050:trMA.Ode5C22.incipit	With divine husbandry, Father, you…
ltx/en_us_oca/tr.d050:trMA.Ode5C22.melody	@ltx/en_us_oca/he.h.m8:heHE.InaTiMeAposo.notmetered
ltx/en_us_oca/tr.d050:trMA.Ode5C22.mode	@ltx/en_us_oca/miscellanea:misc.Mode8
ltx/en_us_oca/tr.d050:trMA.Ode5C22.ode	@ltx/en_us_oca/miscellanea:misc.Ode5
ltx/en_us_oca/tr.d050:trMA.Ode5C22.text	With divine husbandry, Father, you tended the grapes of faith, ⁄ you gathered them into the winepress and pressed them out, ⁄ by the labors of ascetic warfare. ⁄ Filling the spiritual cup of abstinence, ⁄ you rejoice the heart of your flock!
ltx/en_us_oca/tr.d050:trMA.Ode5C23.incipit	You courageously endured the assaults…
ltx/en_us_oca/tr.d050:trMA.Ode5C23.melody	@ltx/en_us_oca/he.h.m8:heHE.InaTiMeAposo.notmetered
ltx/en_us_oca/tr.d050:trMA.Ode5C23.mode	@ltx/en_us_oca/miscellanea:misc.Mode8
ltx/en_us_oca/tr.d050:trMA.Ode5C23.ode	@ltx/en_us_oca/miscellanea:misc.Ode5
ltx/en_us_oca/tr.d050:trMA.Ode5C23.text	You courageously endured the assaults and wounds of the enemy: ⁄ You are a firm pillar, supporting your flock, blessed father, ⁄ guiding your sheep with the staff of God, ⁄ feeding them in green pastures beside the waters of abstinence.
ltx/en_us_oca/tr.d050:trMA.Ode5C2T.incipit	Virgin, as you foretold, we…
ltx/en_us_oca/tr.d050:trMA.Ode5C2T.melody	@ltx/en_us_oca/he.h.m8:heHE.InaTiMeAposo.notmetered
ltx/en_us_oca/tr.d050:trMA.Ode5C2T.mode	@ltx/en_us_oca/miscellanea:misc.Mode8
ltx/en_us_oca/tr.d050:trMA.Ode5C2T.ode	@ltx/en_us_oca/miscellanea:misc.Ode5
ltx/en_us_oca/tr.d050:trMA.Ode5C2T.text	Virgin, as you foretold, we call you blessed, ⁄ for the Lord has truly done great things for you and magnified you! ⁄ He who was born from your womb has made you the true Mother of God!
ltx/en_us_oca/tr.d050:trMA.Ode6C11.greekmelody	@ltx/en_us_oca/he.h.m5:heHE.EkykloseMeAvyssos.greekname
ltx/en_us_oca/tr.d050:trMA.Ode6C11.incipit	Master, I have wasted my…
ltx/en_us_oca/tr.d050:trMA.Ode6C11.melody	@ltx/en_us_oca/he.h.m5:heHE.EkykloseMeAvyssos.notmetered
ltx/en_us_oca/tr.d050:trMA.Ode6C11.mode	@ltx/en_us_oca/miscellanea:misc.Mode5
ltx/en_us_oca/tr.d050:trMA.Ode6C11.ode	@ltx/en_us_oca/miscellanea:misc.Ode6
ltx/en_us_oca/tr.d050:trMA.Ode6C11.text	Master, I have wasted my God-given life on the passions, ⁄ and I am fiercely scourged in every member by my transgressions; ⁄ but I turn to You for refuge and pray: ⁄ Have compassion on me.
ltx/en_us_oca/tr.d050:trMA.Ode6C12.incipit	Scourging my mind with the…
ltx/en_us_oca/tr.d050:trMA.Ode6C12.melody	@ltx/en_us_oca/he.h.m5:heHE.EkykloseMeAvyssos.notmetered
ltx/en_us_oca/tr.d050:trMA.Ode6C12.mode	@ltx/en_us_oca/miscellanea:misc.Mode5
ltx/en_us_oca/tr.d050:trMA.Ode6C12.ode	@ltx/en_us_oca/miscellanea:misc.Ode6
ltx/en_us_oca/tr.d050:trMA.Ode6C12.text	Scourging my mind with the passions, ⁄ thieves have seized my wealth and left me as dead. ⁄ But have compassion on me, and save me, O Lord.
ltx/en_us_oca/tr.d050:trMA.Ode6C13.incipit	When the Levite saw how…
ltx/en_us_oca/tr.d050:trMA.Ode6C13.melody	@ltx/en_us_oca/he.h.m5:heHE.EkykloseMeAvyssos.notmetered
ltx/en_us_oca/tr.d050:trMA.Ode6C13.mode	@ltx/en_us_oca/miscellanea:misc.Mode5
ltx/en_us_oca/tr.d050:trMA.Ode6C13.ode	@ltx/en_us_oca/miscellanea:misc.Ode6
ltx/en_us_oca/tr.d050:trMA.Ode6C13.text	When the Levite saw how painfully I was scourged, ⁄ he was unable to endure the sight of my wounds ⁄ and he passed me by on the other side. ⁄ But in Your love You have poured out Your rich mercy on me.
ltx/en_us_oca/tr.d050:trMA.Ode6C1T.incipit	We rightly glorify you as…
ltx/en_us_oca/tr.d050:trMA.Ode6C1T.melody	@ltx/en_us_oca/he.h.m5:heHE.EkykloseMeAvyssos.notmetered
ltx/en_us_oca/tr.d050:trMA.Ode6C1T.mode	@ltx/en_us_oca/miscellanea:misc.Mode5
ltx/en_us_oca/tr.d050:trMA.Ode6C1T.ode	@ltx/en_us_oca/miscellanea:misc.Ode6
ltx/en_us_oca/tr.d050:trMA.Ode6C1T.text	We rightly glorify you as the Bush unconsumed by fire, ⁄ the Fountain, the living Ladder and the Gate of Heaven, ⁄ glorious Mary, the pride of the Orthodox!
ltx/en_us_oca/tr.d050:trMA.Ode6C21.greekmelody	@ltx/en_us_oca/he.h.m8:heHE.IlasthitiMoiSotir.greekname
ltx/en_us_oca/tr.d050:trMA.Ode6C21.incipit	You received the divine wealth…
ltx/en_us_oca/tr.d050:trMA.Ode6C21.melody	@ltx/en_us_oca/he.h.m8:heHE.IlasthitiMoiSotir.notmetered
ltx/en_us_oca/tr.d050:trMA.Ode6C21.mode	@ltx/en_us_oca/miscellanea:misc.Mode8
ltx/en_us_oca/tr.d050:trMA.Ode6C21.ode	@ltx/en_us_oca/miscellanea:misc.Ode6
ltx/en_us_oca/tr.d050:trMA.Ode6C21.text	You received the divine wealth of the Spirit in your soul: ⁄ blameless prayer, chastity and purity ⁄ with unceasing watchfulness and the labors of abstinence. ⁄ Through these you became a dwelling place of God.
ltx/en_us_oca/tr.d050:trMA.Ode6C22.incipit	You passed by the worthless…
ltx/en_us_oca/tr.d050:trMA.Ode6C22.melody	@ltx/en_us_oca/he.h.m8:heHE.IlasthitiMoiSotir.notmetered
ltx/en_us_oca/tr.d050:trMA.Ode6C22.mode	@ltx/en_us_oca/miscellanea:misc.Mode8
ltx/en_us_oca/tr.d050:trMA.Ode6C22.ode	@ltx/en_us_oca/miscellanea:misc.Ode6
ltx/en_us_oca/tr.d050:trMA.Ode6C22.text	You passed by the worthless joys of this material world, wise father, ⁄ raising your mind on the wings of immaterial prayer. ⁄ Through the perfection of your life ⁄ you received an inheritance on high.
ltx/en_us_oca/tr.d050:trMA.Ode6C23.incipit	You quenched the fiery darts…
ltx/en_us_oca/tr.d050:trMA.Ode6C23.melody	@ltx/en_us_oca/he.h.m8:heHE.IlasthitiMoiSotir.notmetered
ltx/en_us_oca/tr.d050:trMA.Ode6C23.mode	@ltx/en_us_oca/miscellanea:misc.Mode8
ltx/en_us_oca/tr.d050:trMA.Ode6C23.ode	@ltx/en_us_oca/miscellanea:misc.Ode6
ltx/en_us_oca/tr.d050:trMA.Ode6C23.text	You quenched the fiery darts of the enemy ⁄ with the sweat of your ascetic toil; ⁄ kindling the fire of faith, ⁄ you burnt up the proud insolence of unbelief and heresy!
ltx/en_us_oca/tr.d050:trMA.Ode6C2T.incipit	The majesty of the Most…
ltx/en_us_oca/tr.d050:trMA.Ode6C2T.melody	@ltx/en_us_oca/he.h.m8:heHE.IlasthitiMoiSotir.notmetered
ltx/en_us_oca/tr.d050:trMA.Ode6C2T.mode	@ltx/en_us_oca/miscellanea:misc.Mode8
ltx/en_us_oca/tr.d050:trMA.Ode6C2T.ode	@ltx/en_us_oca/miscellanea:misc.Ode6
ltx/en_us_oca/tr.d050:trMA.Ode6C2T.text	The majesty of the Most High has shone forth from Zion! ⁄ He has put on flesh from you O Virgin, in an ineffable union, ⁄ and has brought light to the world.
ltx/en_us_oca/tr.d050:trMA.Ode7C11.greekmelody	@ltx/en_us_oca/he.h.m5:heHE.OYperypsoumenos.greekname
ltx/en_us_oca/tr.d050:trMA.Ode7C11.incipit	Thieves fell upon me, a…
ltx/en_us_oca/tr.d050:trMA.Ode7C11.melody	@ltx/en_us_oca/he.h.m5:heHE.OYperypsoumenos.notmetered
ltx/en_us_oca/tr.d050:trMA.Ode7C11.mode	@ltx/en_us_oca/miscellanea:misc.Mode5
ltx/en_us_oca/tr.d050:trMA.Ode7C11.ode	@ltx/en_us_oca/miscellanea:misc.Ode7
ltx/en_us_oca/tr.d050:trMA.Ode7C11.text	Thieves fell upon me, a poor wretch, ⁄ and scourging me, left me a lifeless corpse. ⁄ Therefore I pray to You: Come to my help.
ltx/en_us_oca/tr.d050:trMA.Ode7C12.incipit	My restless thoughts have robbed…
ltx/en_us_oca/tr.d050:trMA.Ode7C12.melody	@ltx/en_us_oca/he.h.m5:heHE.OYperypsoumenos.notmetered
ltx/en_us_oca/tr.d050:trMA.Ode7C12.mode	@ltx/en_us_oca/miscellanea:misc.Mode5
ltx/en_us_oca/tr.d050:trMA.Ode7C12.ode	@ltx/en_us_oca/miscellanea:misc.Ode7
ltx/en_us_oca/tr.d050:trMA.Ode7C12.text	My restless thoughts have robbed my mind, ⁄ and scourging me through the passions, have left me dead, ⁄ because of the multitude of my transgressions. ⁄ But heal me, O Savior.
ltx/en_us_oca/tr.d050:trMA.Ode7C13.incipit	When the Levite saw me…
ltx/en_us_oca/tr.d050:trMA.Ode7C13.melody	@ltx/en_us_oca/he.h.m5:heHE.OYperypsoumenos.notmetered
ltx/en_us_oca/tr.d050:trMA.Ode7C13.mode	@ltx/en_us_oca/miscellanea:misc.Mode5
ltx/en_us_oca/tr.d050:trMA.Ode7C13.ode	@ltx/en_us_oca/miscellanea:misc.Ode7
ltx/en_us_oca/tr.d050:trMA.Ode7C13.text	When the Levite saw me, injured and in pain, ⁄ he thought my wounds incurable ⁄ and unable to endure the sight of them, ⁄ he passed by on the other side. ⁄ But heal me, my Savior.
ltx/en_us_oca/tr.d050:trMA.Ode7C1T.incipit	Taking flesh from the Virgin…
ltx/en_us_oca/tr.d050:trMA.Ode7C1T.melody	@ltx/en_us_oca/he.h.m5:heHE.OYperypsoumenos.notmetered
ltx/en_us_oca/tr.d050:trMA.Ode7C1T.mode	@ltx/en_us_oca/miscellanea:misc.Mode5
ltx/en_us_oca/tr.d050:trMA.Ode7C1T.ode	@ltx/en_us_oca/miscellanea:misc.Ode7
ltx/en_us_oca/tr.d050:trMA.Ode7C1T.text	Taking flesh from the Virgin, O Christ, ⁄ You saved me, pouring the oil of Your rich mercy on my wounds. ⁄ Therefore I glorify You.
ltx/en_us_oca/tr.d050:trMA.Ode7C21.greekmelody	@ltx/en_us_oca/he.h.m8:heHE.OiEkTisIoudaias.greekname
ltx/en_us_oca/tr.d050:trMA.Ode7C21.incipit	You led your flock to…
ltx/en_us_oca/tr.d050:trMA.Ode7C21.melody	@ltx/en_us_oca/he.h.m8:heHE.OiEkTisIoudaias.notmetered
ltx/en_us_oca/tr.d050:trMA.Ode7C21.mode	@ltx/en_us_oca/miscellanea:misc.Mode8
ltx/en_us_oca/tr.d050:trMA.Ode7C21.ode	@ltx/en_us_oca/miscellanea:misc.Ode7
ltx/en_us_oca/tr.d050:trMA.Ode7C21.text	You led your flock to pasture, father, ⁄ in the green meadows of the heavenly kingdom: ⁄ with the rod of true dogma you drove away the beasts of heresy ⁄ singing aloud: Blessed are You, O God of our fathers!
ltx/en_us_oca/tr.d050:trMA.Ode7C22.incipit	You entered into the joy…
ltx/en_us_oca/tr.d050:trMA.Ode7C22.melody	@ltx/en_us_oca/he.h.m8:heHE.OiEkTisIoudaias.notmetered
ltx/en_us_oca/tr.d050:trMA.Ode7C22.mode	@ltx/en_us_oca/miscellanea:misc.Mode8
ltx/en_us_oca/tr.d050:trMA.Ode7C22.ode	@ltx/en_us_oca/miscellanea:misc.Ode7
ltx/en_us_oca/tr.d050:trMA.Ode7C22.text	You entered into the joy of the heavenly bridal chamber of Christ the King, ⁄ clothed in a garment worthy of Him who called you to the feast. ⁄ As you are seated beside Him you cry aloud: ⁄ Blessed are You, O God of our fathers!
ltx/en_us_oca/tr.d050:trMA.Ode7C23.incipit	You are a river of…
ltx/en_us_oca/tr.d050:trMA.Ode7C23.melody	@ltx/en_us_oca/he.h.m8:heHE.OiEkTisIoudaias.notmetered
ltx/en_us_oca/tr.d050:trMA.Ode7C23.mode	@ltx/en_us_oca/miscellanea:misc.Mode8
ltx/en_us_oca/tr.d050:trMA.Ode7C23.ode	@ltx/en_us_oca/miscellanea:misc.Ode7
ltx/en_us_oca/tr.d050:trMA.Ode7C23.text	You are a river of abstinence, father, free from the pollution of sin, ⁄ washing clean the thoughts and purging away the filth of those who cry out in faith: ⁄ Blessed are You, O God of our fathers!
ltx/en_us_oca/tr.d050:trMA.Ode7C2T.incipit	The Lord of all came…
ltx/en_us_oca/tr.d050:trMA.Ode7C2T.melody	@ltx/en_us_oca/he.h.m8:heHE.OiEkTisIoudaias.notmetered
ltx/en_us_oca/tr.d050:trMA.Ode7C2T.mode	@ltx/en_us_oca/miscellanea:misc.Mode8
ltx/en_us_oca/tr.d050:trMA.Ode7C2T.ode	@ltx/en_us_oca/miscellanea:misc.Ode7
ltx/en_us_oca/tr.d050:trMA.Ode7C2T.text	The Lord of all came forth from your womb, ⁄ taking flesh from you, O Virgin. ⁄ Therefore with true Orthodox faith we honor you as the Theotokos, ⁄ and we cry to your Son: Blessed are You, O God of our fathers!
ltx/en_us_oca/tr.d050:trMA.Ode8C11.greekmelody	@ltx/en_us_oca/he.h.m5:heHE.SoiToPantourgo.greekname
ltx/en_us_oca/tr.d050:trMA.Ode8C11.incipit	Robbed by my thoughts, scourged…
ltx/en_us_oca/tr.d050:trMA.Ode8C11.melody	@ltx/en_us_oca/he.h.m5:heHE.SoiToPantourgo.notmetered
ltx/en_us_oca/tr.d050:trMA.Ode8C11.mode	@ltx/en_us_oca/miscellanea:misc.Mode5
ltx/en_us_oca/tr.d050:trMA.Ode8C11.ode	@ltx/en_us_oca/miscellanea:misc.Ode8
ltx/en_us_oca/tr.d050:trMA.Ode8C11.text	Robbed by my thoughts, scourged by my transgressions, ⁄ I have ruined my life, O Savior, ⁄ and I have been stripped of Your divine image. ⁄ But take pity on me, O God, the Lover of mankind.
ltx/en_us_oca/tr.d050:trMA.Ode8C12.incipit	You came down on the…
ltx/en_us_oca/tr.d050:trMA.Ode8C12.melody	@ltx/en_us_oca/he.h.m5:heHE.SoiToPantourgo.notmetered
ltx/en_us_oca/tr.d050:trMA.Ode8C12.mode	@ltx/en_us_oca/miscellanea:misc.Mode5
ltx/en_us_oca/tr.d050:trMA.Ode8C12.ode	@ltx/en_us_oca/miscellanea:misc.Ode8
ltx/en_us_oca/tr.d050:trMA.Ode8C12.text	You came down on the earth from on high, O Savior, ⁄ taking pity on me, ⁄ for I was wounded in every member by my many offences, ⁄ and there was none to heal me, ⁄ but You have saved me in Your mercy.
ltx/en_us_oca/tr.d050:trMA.Ode8C13.incipit	Master, You gave Your body…
ltx/en_us_oca/tr.d050:trMA.Ode8C13.melody	@ltx/en_us_oca/he.h.m5:heHE.SoiToPantourgo.notmetered
ltx/en_us_oca/tr.d050:trMA.Ode8C13.mode	@ltx/en_us_oca/miscellanea:misc.Mode5
ltx/en_us_oca/tr.d050:trMA.Ode8C13.ode	@ltx/en_us_oca/miscellanea:misc.Ode8
ltx/en_us_oca/tr.d050:trMA.Ode8C13.text	Master, You gave Your body and soul as a ransom for me ⁄ when I was wounded in every member by the scourging of sin, ⁄ pouring out the oil of Your mercy on me, O compassionate Christ.
ltx/en_us_oca/tr.d050:trMA.Ode8C1T.incipit	Virgin, at the word of…
ltx/en_us_oca/tr.d050:trMA.Ode8C1T.melody	@ltx/en_us_oca/he.h.m5:heHE.SoiToPantourgo.notmetered
ltx/en_us_oca/tr.d050:trMA.Ode8C1T.mode	@ltx/en_us_oca/miscellanea:misc.Mode5
ltx/en_us_oca/tr.d050:trMA.Ode8C1T.ode	@ltx/en_us_oca/miscellanea:misc.Ode8
ltx/en_us_oca/tr.d050:trMA.Ode8C1T.text	Virgin, at the word of the God-Man, ⁄ you bore the Lord in ways past understanding yet remained inviolate. ⁄ With all His works we bless you and exalt you above all forever!
ltx/en_us_oca/tr.d050:trMA.Ode8C21.greekmelody	@ltx/en_us_oca/he.h.m8:heHE.TonVasileaTonOuranon.greekname
ltx/en_us_oca/tr.d050:trMA.Ode8C21.incipit	We have a true living…
ltx/en_us_oca/tr.d050:trMA.Ode8C21.melody	@ltx/en_us_oca/he.h.m8:heHE.TonVasileaTonOuranon.notmetered
ltx/en_us_oca/tr.d050:trMA.Ode8C21.mode	@ltx/en_us_oca/miscellanea:misc.Mode8
ltx/en_us_oca/tr.d050:trMA.Ode8C21.ode	@ltx/en_us_oca/miscellanea:misc.Ode8
ltx/en_us_oca/tr.d050:trMA.Ode8C21.text	We have a true living pillar and image of abstinence in you, ⁄ and we all honor your memory, Father John.
ltx/en_us_oca/tr.d050:trMA.Ode8C22.incipit	The assembly of monks rejoices…
ltx/en_us_oca/tr.d050:trMA.Ode8C22.melody	@ltx/en_us_oca/he.h.m8:heHE.TonVasileaTonOuranon.notmetered
ltx/en_us_oca/tr.d050:trMA.Ode8C22.mode	@ltx/en_us_oca/miscellanea:misc.Mode8
ltx/en_us_oca/tr.d050:trMA.Ode8C22.ode	@ltx/en_us_oca/miscellanea:misc.Ode8
ltx/en_us_oca/tr.d050:trMA.Ode8C22.text	The assembly of monks rejoices, ⁄ while the gathering of saints and the righteous dance with gladness: ⁄ for you have received a crown with them as your just reward.
ltx/en_us_oca/tr.d050:trMA.Ode8C23.incipit	Adorned with the virtues, ⁄…
ltx/en_us_oca/tr.d050:trMA.Ode8C23.melody	@ltx/en_us_oca/he.h.m8:heHE.TonVasileaTonOuranon.notmetered
ltx/en_us_oca/tr.d050:trMA.Ode8C23.mode	@ltx/en_us_oca/miscellanea:misc.Mode8
ltx/en_us_oca/tr.d050:trMA.Ode8C23.ode	@ltx/en_us_oca/miscellanea:misc.Ode8
ltx/en_us_oca/tr.d050:trMA.Ode8C23.text	Adorned with the virtues, ⁄ you have entered the bridal chamber of ineffable glory, ⁄ singing the praises of Christ for ever.
ltx/en_us_oca/tr.d050:trMA.Ode8C2T.incipit	Do not reject us, Virgin…
ltx/en_us_oca/tr.d050:trMA.Ode8C2T.melody	@ltx/en_us_oca/he.h.m8:heHE.TonVasileaTonOuranon.notmetered
ltx/en_us_oca/tr.d050:trMA.Ode8C2T.mode	@ltx/en_us_oca/miscellanea:misc.Mode8
ltx/en_us_oca/tr.d050:trMA.Ode8C2T.ode	@ltx/en_us_oca/miscellanea:misc.Ode8
ltx/en_us_oca/tr.d050:trMA.Ode8C2T.text	Do not reject us, Virgin maiden, for we need your aid, ⁄ and we sing in praise of you and exalt you above all for ever.
ltx/en_us_oca/tr.d050:trMA.Ode9C11.greekmelody	@ltx/en_us_oca/he.h.m5:heHE.IsaiaChoreve.greekname
ltx/en_us_oca/tr.d050:trMA.Ode9C11.incipit	Yielding by my own free…
ltx/en_us_oca/tr.d050:trMA.Ode9C11.melody	@ltx/en_us_oca/he.h.m5:heHE.IsaiaChoreve.notmetered
ltx/en_us_oca/tr.d050:trMA.Ode9C11.mode	@ltx/en_us_oca/miscellanea:misc.Mode5
ltx/en_us_oca/tr.d050:trMA.Ode9C11.ode	@ltx/en_us_oca/miscellanea:misc.Ode9
ltx/en_us_oca/tr.d050:trMA.Ode9C11.text	Yielding by my own free choice to the passions of sensual pleasure, ⁄ I have not kept Your commandments, Master; ⁄ I have been stripped of grace, and I lie wounded and naked. ⁄ Therefore I pray to You: Save me, O Savior!
ltx/en_us_oca/tr.d050:trMA.Ode9C12.incipit	The Levite could not cleanse…
ltx/en_us_oca/tr.d050:trMA.Ode9C12.melody	@ltx/en_us_oca/he.h.m5:heHE.IsaiaChoreve.notmetered
ltx/en_us_oca/tr.d050:trMA.Ode9C12.mode	@ltx/en_us_oca/miscellanea:misc.Mode5
ltx/en_us_oca/tr.d050:trMA.Ode9C12.ode	@ltx/en_us_oca/miscellanea:misc.Ode9
ltx/en_us_oca/tr.d050:trMA.Ode9C12.text	The Levite could not cleanse my wounds, ⁄ but You came to me in Your compassion, loving Savior, ⁄ and poured out on me the oil of Your mercies. ⁄ As the best of all physicians, You have healed me.
ltx/en_us_oca/tr.d050:trMA.Ode9C13.incipit	You took pity on me…
ltx/en_us_oca/tr.d050:trMA.Ode9C13.melody	@ltx/en_us_oca/he.h.m5:heHE.IsaiaChoreve.notmetered
ltx/en_us_oca/tr.d050:trMA.Ode9C13.mode	@ltx/en_us_oca/miscellanea:misc.Mode5
ltx/en_us_oca/tr.d050:trMA.Ode9C13.ode	@ltx/en_us_oca/miscellanea:misc.Ode9
ltx/en_us_oca/tr.d050:trMA.Ode9C13.text	You took pity on me and saved me, ⁄ my Savior and compassionate Christ, ⁄ when I was painfully scourged by thieves. ⁄ And for the two pieces of silver, ⁄ You gave Your soul and body as a ransom for me.
ltx/en_us_oca/tr.d050:trMA.Ode9C1T.incipit	Your childbearing is past our…
ltx/en_us_oca/tr.d050:trMA.Ode9C1T.melody	@ltx/en_us_oca/he.h.m5:heHE.IsaiaChoreve.notmetered
ltx/en_us_oca/tr.d050:trMA.Ode9C1T.mode	@ltx/en_us_oca/miscellanea:misc.Mode5
ltx/en_us_oca/tr.d050:trMA.Ode9C1T.ode	@ltx/en_us_oca/miscellanea:misc.Ode9
ltx/en_us_oca/tr.d050:trMA.Ode9C1T.text	Your childbearing is past our understanding, Mother of God. ⁄ for you conceived without man, ⁄ and gave birth in virginity. ⁄ The Child you bore is God ⁄ and magnifying Him, we call you blessed!
ltx/en_us_oca/tr.d050:trMA.Ode9C21.greekmelody	@ltx/en_us_oca/he.h.m8:heHE.TinAgninEndoxos.greekname
ltx/en_us_oca/tr.d050:trMA.Ode9C21.incipit	Blessed one of God, ⁄…
ltx/en_us_oca/tr.d050:trMA.Ode9C21.melody	@ltx/en_us_oca/he.h.m8:heHE.TinAgninEndoxos.notmetered
ltx/en_us_oca/tr.d050:trMA.Ode9C21.mode	@ltx/en_us_oca/miscellanea:misc.Mode8
ltx/en_us_oca/tr.d050:trMA.Ode9C21.ode	@ltx/en_us_oca/miscellanea:misc.Ode9
ltx/en_us_oca/tr.d050:trMA.Ode9C21.text	Blessed one of God, ⁄ you are a physician to those who are sick through sin, ⁄ you are an expeller of evil spirits, ⁄ and therefore we also call you blessed.
ltx/en_us_oca/tr.d050:trMA.Ode9C22.incipit	You have left the earth…
ltx/en_us_oca/tr.d050:trMA.Ode9C22.melody	@ltx/en_us_oca/he.h.m8:heHE.TinAgninEndoxos.notmetered
ltx/en_us_oca/tr.d050:trMA.Ode9C22.mode	@ltx/en_us_oca/miscellanea:misc.Mode8
ltx/en_us_oca/tr.d050:trMA.Ode9C22.ode	@ltx/en_us_oca/miscellanea:misc.Ode9
ltx/en_us_oca/tr.d050:trMA.Ode9C22.text	You have left the earth, the dwelling place of corruption, ⁄ going to live in the land of the meek and gentle, Father, ⁄ and rejoicing with them in the blessings of God.
ltx/en_us_oca/tr.d050:trMA.Ode9C23.incipit	Today is a festival calling…
ltx/en_us_oca/tr.d050:trMA.Ode9C23.melody	@ltx/en_us_oca/he.h.m8:heHE.TinAgninEndoxos.notmetered
ltx/en_us_oca/tr.d050:trMA.Ode9C23.mode	@ltx/en_us_oca/miscellanea:misc.Mode8
ltx/en_us_oca/tr.d050:trMA.Ode9C23.ode	@ltx/en_us_oca/miscellanea:misc.Ode9
ltx/en_us_oca/tr.d050:trMA.Ode9C23.text	Today is a festival calling together all of the monastic flock, ⁄ inviting us all to share in a feast of spiritual rejoicing ⁄ with the food of a sinless life.
ltx/en_us_oca/tr.d050:trMA.Ode9C2T.incipit	He who took up his…
ltx/en_us_oca/tr.d050:trMA.Ode9C2T.melody	@ltx/en_us_oca/he.h.m8:heHE.TinAgninEndoxos.notmetered
ltx/en_us_oca/tr.d050:trMA.Ode9C2T.mode	@ltx/en_us_oca/miscellanea:misc.Mode8
ltx/en_us_oca/tr.d050:trMA.Ode9C2T.ode	@ltx/en_us_oca/miscellanea:misc.Ode9
ltx/en_us_oca/tr.d050:trMA.Ode9C2T.text	He who took up his dwelling in you, all-blameless Lady, ⁄ has overthrown the murderer ⁄ who maliciously brought down our first parents. ⁄ Christ has been born, and has saved us all!
ltx/en_us_oca/tr.d050:trMA.Oikos1.text	You truly made yourself a house of God, O father, adorned with faith, hope and true love through your divine virtues, shining from a distance as with gold. You explained the laws of God, and practiced abstinence as though you were bodiless. You gained wisdom, courage, chastity and humility, and were raised to the heights. Illumined with unceasing prayer, you attained the dwelling places of heaven, our Father and Teacher John.
ltx/en_us_oca/tr.d050:trMA.PostGospelBoth.incipit	@ltx/en_us_oca/tr.d001:trMA.PostGospelBoth.incipit
ltx/en_us_oca/tr.d050:trMA.PostGospelBoth.melody	
ltx/en_us_oca/tr.d050:trMA.PostGospelBoth.mode	@ltx/en_us_oca/miscellanea:misc.Mode8
ltx/en_us_oca/tr.d050:trMA.PostGospelBoth.text	@ltx/en_us_oca/tr.d001:trMA.PostGospelBoth.text
ltx/en_us_oca/tr.d050:trMA.PostGospelGlory.incipit	@ltx/en_us_oca/tr.d001:trMA.PostGospelGlory.incipit
ltx/en_us_oca/tr.d050:trMA.PostGospelGlory.melody	
ltx/en_us_oca/tr.d050:trMA.PostGospelGlory.mode	@ltx/en_us_oca/miscellanea:misc.Mode8
ltx/en_us_oca/tr.d050:trMA.PostGospelGlory.text	@ltx/en_us_oca/tr.d001:trMA.PostGospelGlory.text
ltx/en_us_oca/tr.d050:trMA.PostGospelIdiomelon.incipit	@ltx/en_us_oca/tr.d001:trMA.PostGospelIdiomelon.incipit
ltx/en_us_oca/tr.d050:trMA.PostGospelIdiomelon.melody	
ltx/en_us_oca/tr.d050:trMA.PostGospelIdiomelon.mode	@ltx/en_us_oca/miscellanea:misc.Mode6
ltx/en_us_oca/tr.d050:trMA.PostGospelIdiomelon.text	@ltx/en_us_oca/tr.d001:trMA.PostGospelIdiomelon.text
ltx/en_us_oca/tr.d050:trSY.commemoration.couplet1.title	@ltx/en_us_oca/titles:ti.Verses
ltx/en_us_oca/tr.d050:trSY.commemoration.couplet1.verse1	
ltx/en_us_oca/tr.d050:trSY.commemoration.couplet1.verse2	
ltx/en_us_oca/tr.d050:trSY.commemoration.couplet2.verse1	
ltx/en_us_oca/tr.d050:trSY.commemoration.couplet2.verse2	
ltx/en_us_oca/tr.d050:trSY.commemoration.narration.p01	
ltx/en_us_oca/tr.d050:trSY.commemoration.narration.p02	
ltx/en_us_oca/tr.d050:trSY.commemoration.narration.p03	
ltx/en_us_oca/tr.d050:trSY.commemoration.narration.p04	
ltx/en_us_oca/tr.d050:trSY.commemoration.narration.p05	
ltx/en_us_oca/tr.d050:trSY.commemoration.narration.p06	
ltx/en_us_oca/tr.d050:trSY.commemoration.narration.p07	
ltx/en_us_oca/tr.d050:trSY.commemoration.onotherday.text	
ltx/en_us_oca/tr.d050:trSY.commemoration.text	
ltx/en_us_oca/tr.d050:trSY.lastline	
ltx/en_us_oca/tr.d050:trVE.ApolTheotokion.incipit	@ltx/en_us_oca/oc.m8.d1:ocVE.ApolTheotokionVM.incipit
ltx/en_us_oca/tr.d050:trVE.ApolTheotokion.melody	
ltx/en_us_oca/tr.d050:trVE.ApolTheotokion.mode	@ltx/en_us_oca/miscellanea:misc.Mode8
ltx/en_us_oca/tr.d050:trVE.ApolTheotokion.text	@ltx/en_us_oca/oc.m8.d1:ocVE.ApolTheotokionVM.text
ltx/en_us_oca/tr.d050:trVE.Apolytikion1.melody	@ltx/en_us_oca/he.ga:heGA.TaisTonDakryonSou.name
ltx/en_us_oca/tr.d050:trVE.Apolytikion1.mode	@ltx/en_us_oca/miscellanea:misc.Mode8
ltx/en_us_oca/tr.d050:trVE.Apolytikion1.text	@ltx/en_us_oca/properties:media.key
ltx/en_us_oca/tr.d050:trVE.AposGlory.incipit	…
ltx/en_us_oca/tr.d050:trVE.AposGlory.melody	@ltx/en_us_oca/miscellanea:misc.Idiomelon
ltx/en_us_oca/tr.d050:trVE.AposGlory.mode	@ltx/en_us_oca/miscellanea:misc.Mode2
ltx/en_us_oca/tr.d050:trVE.AposGlory.text	
ltx/en_us_oca/tr.d050:trVE.GeneralApolytikion1.name	
ltx/en_us_oca/tr.d050:trVE.SticGlory.incipit	…
ltx/en_us_oca/tr.d050:trVE.SticGlory.melody	@ltx/en_us_oca/miscellanea:misc.Idiomelon
ltx/en_us_oca/tr.d050:trVE.SticGlory.mode	@ltx/en_us_oca/miscellanea:misc.Mode5
ltx/en_us_oca/tr.d050:trVE.SticGlory.text	
ltx/en_us_oca/tr.d050:trVE.Stichera01.greekmelody	@ltx/en_us_oca/he.a.m8:heAU.OTouParadoxou.greekname
ltx/en_us_oca/tr.d050:trVE.Stichera01.incipit	…
ltx/en_us_oca/tr.d050:trVE.Stichera01.melody	@ltx/en_us_oca/he.a.m8:heAU.OTouParadoxou.name
ltx/en_us_oca/tr.d050:trVE.Stichera01.mode	@ltx/en_us_oca/miscellanea:misc.Mode8
ltx/en_us_oca/tr.d050:trVE.Stichera01.text	
ltx/en_us_oca/tr.d050:trVE.Stichera02.greekmelody	@ltx/en_us_oca/he.a.m8:heAU.OTouParadoxou.greekname
ltx/en_us_oca/tr.d050:trVE.Stichera02.incipit	…
ltx/en_us_oca/tr.d050:trVE.Stichera02.melody	@ltx/en_us_oca/he.a.m8:heAU.OTouParadoxou.name
ltx/en_us_oca/tr.d050:trVE.Stichera02.mode	@ltx/en_us_oca/miscellanea:misc.Mode8
ltx/en_us_oca/tr.d050:trVE.Stichera02.text	
ltx/en_us_oca/tr.d050:trVE.Stichera03.greekmelody	@ltx/en_us_oca/he.a.m8:heAU.OTouParadoxou.greekname
ltx/en_us_oca/tr.d050:trVE.Stichera03.incipit	…
ltx/en_us_oca/tr.d050:trVE.Stichera03.melody	@ltx/en_us_oca/he.a.m8:heAU.OTouParadoxou.name
ltx/en_us_oca/tr.d050:trVE.Stichera03.mode	@ltx/en_us_oca/miscellanea:misc.Mode8
ltx/en_us_oca/tr.d050:trVE.Stichera03.text	
