ltx/en_us_oca/me.m02.d27:alt1.meDA.commemoration.first_name	
ltx/en_us_oca/me.m02.d27:alt1.meDA.commemoration.first_short	Memory of our Holy Father Raphael, Bishop of Brooklyn
ltx/en_us_oca/me.m02.d27:alt1.meDA.commemoration.first_title	
ltx/en_us_oca/me.m02.d27:alt1.meDA.commemoration.full	Memory of our Holy Father Raphael, Bishop of Brooklyn
ltx/en_us_oca/me.m02.d27:alt1.meDA.commemoration.second_name	
ltx/en_us_oca/me.m02.d27:alt1.meDA.commemoration.second_title	
ltx/en_us_oca/me.m02.d27:alt1.meDA.date	February 27
ltx/en_us_oca/me.m02.d27:alt1.meDA.insert1	our holy father Raphael, Bishop of Brooklyn,
ltx/en_us_oca/me.m02.d27:alt1.meDA.insert2	whose memory we celebrate;
ltx/en_us_oca/me.m02.d27:alt1.meDA.note	
ltx/en_us_oca/me.m02.d27:alt1.meHO.commemorations	
ltx/en_us_oca/me.m02.d27:alt1.meHO.note1	
ltx/en_us_oca/me.m02.d27:alt1.meHO.note2	
ltx/en_us_oca/me.m02.d27:alt1.meHO.number	
ltx/en_us_oca/me.m02.d27:alt1.meHO.rank	
ltx/en_us_oca/me.m02.d27:alt1.meLE.commemoration1	
ltx/en_us_oca/me.m02.d27:alt1.meLE.commemoration2	
ltx/en_us_oca/me.m02.d27:alt1.meLI.Kontakion1.incipit	@ltx/en_us_oca/me.m02.d27:alt1.meMA.Kontakion1.incipit
ltx/en_us_oca/me.m02.d27:alt1.meLI.Kontakion1.melody	@ltx/en_us_oca/me.m02.d27:alt1.meMA.Kontakion1.melody
ltx/en_us_oca/me.m02.d27:alt1.meLI.Kontakion1.mode	@ltx/en_us_oca/me.m02.d27:alt1.meMA.Kontakion1.mode
ltx/en_us_oca/me.m02.d27:alt1.meLI.Kontakion1.text	@ltx/en_us_oca/me.m02.d27:alt1.meMA.Kontakion1.text
ltx/en_us_oca/me.m02.d27:alt1.meLI.MM.CommunionHymn.text	@ltx/en_us_oca/properties:media.key
ltx/en_us_oca/me.m02.d27:alt1.meLI.Megalynarion.text	
ltx/en_us_oca/me.m02.d27:alt1.meMA.C1.title	@ltx/en_us_oca/titles:ti.CanonSaintM
ltx/en_us_oca/me.m02.d27:alt1.meMA.C1.verse	@ltx/en_us_oca/prayers:pr.verse_SaintM.text
ltx/en_us_oca/me.m02.d27:alt1.meMA.ExapTheotokion.incipit	…
ltx/en_us_oca/me.m02.d27:alt1.meMA.ExapTheotokion.melody	@ltx/en_us_oca/he.a.m2:heAU.GynaikesAkoutisthite.notmetered
ltx/en_us_oca/me.m02.d27:alt1.meMA.ExapTheotokion.mode	@ltx/en_us_oca/miscellanea:misc.Mode2
ltx/en_us_oca/me.m02.d27:alt1.meMA.ExapTheotokion.text	
ltx/en_us_oca/me.m02.d27:alt1.meMA.Exaposteilarion1.greekmelody	@ltx/en_us_oca/he.a.m2:heAU.GynaikesAkoutisthite.greekname
ltx/en_us_oca/me.m02.d27:alt1.meMA.Exaposteilarion1.incipit	…
ltx/en_us_oca/me.m02.d27:alt1.meMA.Exaposteilarion1.melody	@ltx/en_us_oca/he.a.m2:heAU.GynaikesAkoutisthite.notmetered
ltx/en_us_oca/me.m02.d27:alt1.meMA.Exaposteilarion1.mode	@ltx/en_us_oca/miscellanea:misc.Mode2
ltx/en_us_oca/me.m02.d27:alt1.meMA.Exaposteilarion1.text	
ltx/en_us_oca/me.m02.d27:alt1.meMA.Kathisma11.greekmelody	@ltx/en_us_oca/he.a.m1:heAU.TonTafonSouSotir.greekname
ltx/en_us_oca/me.m02.d27:alt1.meMA.Kathisma11.incipit	Father Raphael, worthy of all…
ltx/en_us_oca/me.m02.d27:alt1.meMA.Kathisma11.melody	@ltx/en_us_oca/he.a.m1:heAU.TonTafonSouSotir.notmetered
ltx/en_us_oca/me.m02.d27:alt1.meMA.Kathisma11.mode	@ltx/en_us_oca/miscellanea:misc.Mode1
ltx/en_us_oca/me.m02.d27:alt1.meMA.Kathisma11.text	Father Raphael, worthy of all praise, ⁄ you showed yourself to be a faithful servant of the Master ⁄ when you answered His call to preach in foreign lands. ⁄ You tended the flock which Christ had entrusted to you, ⁄ and while living in this world you became a citizen of Heaven! ⁄⁄ Therefore we honor you as a shepherd of souls and a teacher of righteousness!
ltx/en_us_oca/me.m02.d27:alt1.meMA.Kathisma1T.incipit	Pure unwedded Virgin Theotokos, ⁄…
ltx/en_us_oca/me.m02.d27:alt1.meMA.Kathisma1T.melody	@ltx/en_us_oca/he.a.m1:heAU.TonTafonSouSotir.notmetered
ltx/en_us_oca/me.m02.d27:alt1.meMA.Kathisma1T.mode	@ltx/en_us_oca/miscellanea:misc.Mode1
ltx/en_us_oca/me.m02.d27:alt1.meMA.Kathisma1T.text	Pure unwedded Virgin Theotokos, ⁄ the only intercessor and protection of the faithful: ⁄ Deliver those who trust in you from affliction and calamity ⁄⁄ and through your holy intercessions, save our souls!
ltx/en_us_oca/me.m02.d27:alt1.meMA.Kathisma21.greekmelody	@ltx/en_us_oca/he.a.m3:heAU.TinOraiotita.greekname
ltx/en_us_oca/me.m02.d27:alt1.meMA.Kathisma21.incipit	From your youth you denied…
ltx/en_us_oca/me.m02.d27:alt1.meMA.Kathisma21.melody	@ltx/en_us_oca/he.a.m3:heAU.TinOraiotita.notmetered
ltx/en_us_oca/me.m02.d27:alt1.meMA.Kathisma21.mode	@ltx/en_us_oca/miscellanea:misc.Mode3
ltx/en_us_oca/me.m02.d27:alt1.meMA.Kathisma21.text	From your youth you denied yourself and took up your cross; ⁄ ever following our Savior: ⁄ Nothing could separate you from the love of Christ! ⁄ Having died to the world, you found a new life of grace with the Lord. ⁄ Since you have found favor with God, ⁄ we entreat you to intercede with Him ⁄⁄ for the salvation of our souls.
ltx/en_us_oca/me.m02.d27:alt1.meMA.Kathisma2T.greekmelody	@ltx/en_us_oca/he.a.m3:heAU.TinOraiotita.greekname
ltx/en_us_oca/me.m02.d27:alt1.meMA.Kathisma2T.incipit	@ltx/en_us_oca/he.a.m3:heAU.TinOraiotita.incipit
ltx/en_us_oca/me.m02.d27:alt1.meMA.Kathisma2T.melody	@ltx/en_us_oca/he.a.m3:heAU.TinOraiotita.melody
ltx/en_us_oca/me.m02.d27:alt1.meMA.Kathisma2T.mode	@ltx/en_us_oca/miscellanea:misc.Mode3
ltx/en_us_oca/me.m02.d27:alt1.meMA.Kathisma2T.text	@ltx/en_us_oca/he.a.m3:heAU.TinOraiotita.text
ltx/en_us_oca/me.m02.d27:alt1.meMA.Kontakion1.incipit	…
ltx/en_us_oca/me.m02.d27:alt1.meMA.Kontakion1.melody	
ltx/en_us_oca/me.m02.d27:alt1.meMA.Kontakion1.mode	@ltx/en_us_oca/miscellanea:misc.Mode8
ltx/en_us_oca/me.m02.d27:alt1.meMA.Kontakion1.text	
ltx/en_us_oca/me.m02.d27:alt1.meMA.Lauds1.greekmelody	@ltx/en_us_oca/he.a.m4:heAU.EdokasSimeiosin.greekname
ltx/en_us_oca/me.m02.d27:alt1.meMA.Lauds1.incipit	…
ltx/en_us_oca/me.m02.d27:alt1.meMA.Lauds1.melody	@ltx/en_us_oca/he.a.m4:heAU.EdokasSimeiosin.notmetered
ltx/en_us_oca/me.m02.d27:alt1.meMA.Lauds1.mode	@ltx/en_us_oca/miscellanea:misc.Mode4
ltx/en_us_oca/me.m02.d27:alt1.meMA.Lauds1.text	
ltx/en_us_oca/me.m02.d27:alt1.meMA.Lauds2.greekmelody	@ltx/en_us_oca/he.a.m4:heAU.EdokasSimeiosin.greekname
ltx/en_us_oca/me.m02.d27:alt1.meMA.Lauds2.incipit	…
ltx/en_us_oca/me.m02.d27:alt1.meMA.Lauds2.melody	@ltx/en_us_oca/he.a.m4:heAU.EdokasSimeiosin.notmetered
ltx/en_us_oca/me.m02.d27:alt1.meMA.Lauds2.mode	@ltx/en_us_oca/miscellanea:misc.Mode4
ltx/en_us_oca/me.m02.d27:alt1.meMA.Lauds2.text	
ltx/en_us_oca/me.m02.d27:alt1.meMA.Lauds3.greekmelody	@ltx/en_us_oca/he.a.m4:heAU.EdokasSimeiosin.greekname
ltx/en_us_oca/me.m02.d27:alt1.meMA.Lauds3.incipit	…
ltx/en_us_oca/me.m02.d27:alt1.meMA.Lauds3.melody	@ltx/en_us_oca/he.a.m4:heAU.EdokasSimeiosin.notmetered
ltx/en_us_oca/me.m02.d27:alt1.meMA.Lauds3.mode	@ltx/en_us_oca/miscellanea:misc.Mode4
ltx/en_us_oca/me.m02.d27:alt1.meMA.Lauds3.text	
ltx/en_us_oca/me.m02.d27:alt1.meMA.Lauds4.greekmelody	@ltx/en_us_oca/he.a.m4:heAU.EdokasSimeiosin.greekname
ltx/en_us_oca/me.m02.d27:alt1.meMA.Lauds4.incipit	…
ltx/en_us_oca/me.m02.d27:alt1.meMA.Lauds4.melody	@ltx/en_us_oca/he.a.m4:heAU.EdokasSimeiosin.notmetered
ltx/en_us_oca/me.m02.d27:alt1.meMA.Lauds4.mode	@ltx/en_us_oca/miscellanea:misc.Mode4
ltx/en_us_oca/me.m02.d27:alt1.meMA.Lauds4.text	
ltx/en_us_oca/me.m02.d27:alt1.meMA.LaudsGlory.incipit	…
ltx/en_us_oca/me.m02.d27:alt1.meMA.LaudsGlory.melody	
ltx/en_us_oca/me.m02.d27:alt1.meMA.LaudsGlory.mode	@ltx/en_us_oca/miscellanea:misc.Mode5
ltx/en_us_oca/me.m02.d27:alt1.meMA.LaudsGlory.text	
ltx/en_us_oca/me.m02.d27:alt1.meMA.LaudsTheotokion.incipit	…
ltx/en_us_oca/me.m02.d27:alt1.meMA.LaudsTheotokion.melody	
ltx/en_us_oca/me.m02.d27:alt1.meMA.LaudsTheotokion.mode	@ltx/en_us_oca/miscellanea:misc.Mode5
ltx/en_us_oca/me.m02.d27:alt1.meMA.LaudsTheotokion.text	
ltx/en_us_oca/me.m02.d27:alt1.meMA.Ode1C11.greekmelody	@ltx/en_us_oca/he.h.m6:heHE.OsEnIpeiroPezefsas.greekname
ltx/en_us_oca/me.m02.d27:alt1.meMA.Ode1C11.incipit	…
ltx/en_us_oca/me.m02.d27:alt1.meMA.Ode1C11.melody	@ltx/en_us_oca/he.h.m6:heHE.OsEnIpeiroPezefsas.notmetered
ltx/en_us_oca/me.m02.d27:alt1.meMA.Ode1C11.mode	@ltx/en_us_oca/miscellanea:misc.Mode6
ltx/en_us_oca/me.m02.d27:alt1.meMA.Ode1C11.ode	@ltx/en_us_oca/miscellanea:misc.Ode1
ltx/en_us_oca/me.m02.d27:alt1.meMA.Ode1C11.text	
ltx/en_us_oca/me.m02.d27:alt1.meMA.Ode1C12.incipit	…
ltx/en_us_oca/me.m02.d27:alt1.meMA.Ode1C12.melody	@ltx/en_us_oca/he.h.m6:heHE.OsEnIpeiroPezefsas.notmetered
ltx/en_us_oca/me.m02.d27:alt1.meMA.Ode1C12.mode	@ltx/en_us_oca/miscellanea:misc.Mode6
ltx/en_us_oca/me.m02.d27:alt1.meMA.Ode1C12.ode	@ltx/en_us_oca/miscellanea:misc.Ode1
ltx/en_us_oca/me.m02.d27:alt1.meMA.Ode1C12.text	
ltx/en_us_oca/me.m02.d27:alt1.meMA.Ode1C13.incipit	…
ltx/en_us_oca/me.m02.d27:alt1.meMA.Ode1C13.melody	@ltx/en_us_oca/he.h.m6:heHE.OsEnIpeiroPezefsas.notmetered
ltx/en_us_oca/me.m02.d27:alt1.meMA.Ode1C13.mode	@ltx/en_us_oca/miscellanea:misc.Mode6
ltx/en_us_oca/me.m02.d27:alt1.meMA.Ode1C13.ode	@ltx/en_us_oca/miscellanea:misc.Ode1
ltx/en_us_oca/me.m02.d27:alt1.meMA.Ode1C13.text	
ltx/en_us_oca/me.m02.d27:alt1.meMA.Ode1C14.incipit	…
ltx/en_us_oca/me.m02.d27:alt1.meMA.Ode1C14.melody	@ltx/en_us_oca/he.h.m6:heHE.OsEnIpeiroPezefsas.notmetered
ltx/en_us_oca/me.m02.d27:alt1.meMA.Ode1C14.mode	@ltx/en_us_oca/miscellanea:misc.Mode6
ltx/en_us_oca/me.m02.d27:alt1.meMA.Ode1C14.ode	@ltx/en_us_oca/miscellanea:misc.Ode1
ltx/en_us_oca/me.m02.d27:alt1.meMA.Ode1C14.text	
ltx/en_us_oca/me.m02.d27:alt1.meMA.Ode1C1T.incipit	…
ltx/en_us_oca/me.m02.d27:alt1.meMA.Ode1C1T.melody	@ltx/en_us_oca/he.h.m6:heHE.OsEnIpeiroPezefsas.notmetered
ltx/en_us_oca/me.m02.d27:alt1.meMA.Ode1C1T.mode	@ltx/en_us_oca/miscellanea:misc.Mode6
ltx/en_us_oca/me.m02.d27:alt1.meMA.Ode1C1T.ode	@ltx/en_us_oca/miscellanea:misc.Ode1
ltx/en_us_oca/me.m02.d27:alt1.meMA.Ode1C1T.text	
ltx/en_us_oca/me.m02.d27:alt1.meMA.Ode3C11.greekmelody	@ltx/en_us_oca/he.h.m6:heHE.OukEstinAgios.greekname
ltx/en_us_oca/me.m02.d27:alt1.meMA.Ode3C11.incipit	…
ltx/en_us_oca/me.m02.d27:alt1.meMA.Ode3C11.melody	@ltx/en_us_oca/he.h.m6:heHE.OukEstinAgios.notmetered
ltx/en_us_oca/me.m02.d27:alt1.meMA.Ode3C11.mode	@ltx/en_us_oca/miscellanea:misc.Mode6
ltx/en_us_oca/me.m02.d27:alt1.meMA.Ode3C11.ode	@ltx/en_us_oca/miscellanea:misc.Ode3
ltx/en_us_oca/me.m02.d27:alt1.meMA.Ode3C11.text	
ltx/en_us_oca/me.m02.d27:alt1.meMA.Ode3C12.incipit	…
ltx/en_us_oca/me.m02.d27:alt1.meMA.Ode3C12.melody	@ltx/en_us_oca/he.h.m6:heHE.OukEstinAgios.notmetered
ltx/en_us_oca/me.m02.d27:alt1.meMA.Ode3C12.mode	@ltx/en_us_oca/miscellanea:misc.Mode6
ltx/en_us_oca/me.m02.d27:alt1.meMA.Ode3C12.ode	@ltx/en_us_oca/miscellanea:misc.Ode3
ltx/en_us_oca/me.m02.d27:alt1.meMA.Ode3C12.text	
ltx/en_us_oca/me.m02.d27:alt1.meMA.Ode3C13.incipit	…
ltx/en_us_oca/me.m02.d27:alt1.meMA.Ode3C13.melody	@ltx/en_us_oca/he.h.m6:heHE.OukEstinAgios.notmetered
ltx/en_us_oca/me.m02.d27:alt1.meMA.Ode3C13.mode	@ltx/en_us_oca/miscellanea:misc.Mode6
ltx/en_us_oca/me.m02.d27:alt1.meMA.Ode3C13.ode	@ltx/en_us_oca/miscellanea:misc.Ode3
ltx/en_us_oca/me.m02.d27:alt1.meMA.Ode3C13.text	
ltx/en_us_oca/me.m02.d27:alt1.meMA.Ode3C14.incipit	…
ltx/en_us_oca/me.m02.d27:alt1.meMA.Ode3C14.melody	@ltx/en_us_oca/he.h.m6:heHE.OukEstinAgios.notmetered
ltx/en_us_oca/me.m02.d27:alt1.meMA.Ode3C14.mode	@ltx/en_us_oca/miscellanea:misc.Mode6
ltx/en_us_oca/me.m02.d27:alt1.meMA.Ode3C14.ode	@ltx/en_us_oca/miscellanea:misc.Ode3
ltx/en_us_oca/me.m02.d27:alt1.meMA.Ode3C14.text	
ltx/en_us_oca/me.m02.d27:alt1.meMA.Ode3C1T.incipit	…
ltx/en_us_oca/me.m02.d27:alt1.meMA.Ode3C1T.melody	@ltx/en_us_oca/he.h.m6:heHE.OukEstinAgios.notmetered
ltx/en_us_oca/me.m02.d27:alt1.meMA.Ode3C1T.mode	@ltx/en_us_oca/miscellanea:misc.Mode6
ltx/en_us_oca/me.m02.d27:alt1.meMA.Ode3C1T.ode	@ltx/en_us_oca/miscellanea:misc.Ode3
ltx/en_us_oca/me.m02.d27:alt1.meMA.Ode3C1T.text	
ltx/en_us_oca/me.m02.d27:alt1.meMA.Ode3Kathisma1.greekmelody	@ltx/en_us_oca/he.a.m4:heAU.KateplagiIosif.greekname
ltx/en_us_oca/me.m02.d27:alt1.meMA.Ode3Kathisma1.incipit	…
ltx/en_us_oca/me.m02.d27:alt1.meMA.Ode3Kathisma1.melody	@ltx/en_us_oca/he.a.m4:heAU.KateplagiIosif.notmetered
ltx/en_us_oca/me.m02.d27:alt1.meMA.Ode3Kathisma1.mode	@ltx/en_us_oca/miscellanea:misc.Mode4
ltx/en_us_oca/me.m02.d27:alt1.meMA.Ode3Kathisma1.text	
ltx/en_us_oca/me.m02.d27:alt1.meMA.Ode3KathismaT.incipit	…
ltx/en_us_oca/me.m02.d27:alt1.meMA.Ode3KathismaT.melody	
ltx/en_us_oca/me.m02.d27:alt1.meMA.Ode3KathismaT.mode	@ltx/en_us_oca/miscellanea:misc.Mode4
ltx/en_us_oca/me.m02.d27:alt1.meMA.Ode3KathismaT.text	
ltx/en_us_oca/me.m02.d27:alt1.meMA.Ode4C11.greekmelody	@ltx/en_us_oca/he.h.m6:heHE.ChristosMouDynamis.greekname
ltx/en_us_oca/me.m02.d27:alt1.meMA.Ode4C11.incipit	…
ltx/en_us_oca/me.m02.d27:alt1.meMA.Ode4C11.melody	@ltx/en_us_oca/he.h.m6:heHE.ChristosMouDynamis.notmetered
ltx/en_us_oca/me.m02.d27:alt1.meMA.Ode4C11.mode	@ltx/en_us_oca/miscellanea:misc.Mode6
ltx/en_us_oca/me.m02.d27:alt1.meMA.Ode4C11.ode	@ltx/en_us_oca/miscellanea:misc.Ode4
ltx/en_us_oca/me.m02.d27:alt1.meMA.Ode4C11.text	
ltx/en_us_oca/me.m02.d27:alt1.meMA.Ode4C12.incipit	…
ltx/en_us_oca/me.m02.d27:alt1.meMA.Ode4C12.melody	@ltx/en_us_oca/he.h.m6:heHE.ChristosMouDynamis.notmetered
ltx/en_us_oca/me.m02.d27:alt1.meMA.Ode4C12.mode	@ltx/en_us_oca/miscellanea:misc.Mode6
ltx/en_us_oca/me.m02.d27:alt1.meMA.Ode4C12.ode	@ltx/en_us_oca/miscellanea:misc.Ode4
ltx/en_us_oca/me.m02.d27:alt1.meMA.Ode4C12.text	
ltx/en_us_oca/me.m02.d27:alt1.meMA.Ode4C13.incipit	…
ltx/en_us_oca/me.m02.d27:alt1.meMA.Ode4C13.melody	@ltx/en_us_oca/he.h.m6:heHE.ChristosMouDynamis.notmetered
ltx/en_us_oca/me.m02.d27:alt1.meMA.Ode4C13.mode	@ltx/en_us_oca/miscellanea:misc.Mode6
ltx/en_us_oca/me.m02.d27:alt1.meMA.Ode4C13.ode	@ltx/en_us_oca/miscellanea:misc.Ode4
ltx/en_us_oca/me.m02.d27:alt1.meMA.Ode4C13.text	
ltx/en_us_oca/me.m02.d27:alt1.meMA.Ode4C14.incipit	…
ltx/en_us_oca/me.m02.d27:alt1.meMA.Ode4C14.melody	@ltx/en_us_oca/he.h.m6:heHE.ChristosMouDynamis.notmetered
ltx/en_us_oca/me.m02.d27:alt1.meMA.Ode4C14.mode	@ltx/en_us_oca/miscellanea:misc.Mode6
ltx/en_us_oca/me.m02.d27:alt1.meMA.Ode4C14.ode	@ltx/en_us_oca/miscellanea:misc.Ode4
ltx/en_us_oca/me.m02.d27:alt1.meMA.Ode4C14.text	
ltx/en_us_oca/me.m02.d27:alt1.meMA.Ode4C1T.incipit	…
ltx/en_us_oca/me.m02.d27:alt1.meMA.Ode4C1T.melody	@ltx/en_us_oca/he.h.m6:heHE.ChristosMouDynamis.notmetered
ltx/en_us_oca/me.m02.d27:alt1.meMA.Ode4C1T.mode	@ltx/en_us_oca/miscellanea:misc.Mode6
ltx/en_us_oca/me.m02.d27:alt1.meMA.Ode4C1T.ode	@ltx/en_us_oca/miscellanea:misc.Ode4
ltx/en_us_oca/me.m02.d27:alt1.meMA.Ode4C1T.text	
ltx/en_us_oca/me.m02.d27:alt1.meMA.Ode5C11.greekmelody	@ltx/en_us_oca/he.h.m6:heHE.ToTheioFengeiSou.greekname
ltx/en_us_oca/me.m02.d27:alt1.meMA.Ode5C11.incipit	…
ltx/en_us_oca/me.m02.d27:alt1.meMA.Ode5C11.melody	@ltx/en_us_oca/he.h.m6:heHE.ToTheioFengeiSou.notmetered
ltx/en_us_oca/me.m02.d27:alt1.meMA.Ode5C11.mode	@ltx/en_us_oca/miscellanea:misc.Mode6
ltx/en_us_oca/me.m02.d27:alt1.meMA.Ode5C11.ode	@ltx/en_us_oca/miscellanea:misc.Ode5
ltx/en_us_oca/me.m02.d27:alt1.meMA.Ode5C11.text	
ltx/en_us_oca/me.m02.d27:alt1.meMA.Ode5C12.incipit	…
ltx/en_us_oca/me.m02.d27:alt1.meMA.Ode5C12.melody	@ltx/en_us_oca/he.h.m6:heHE.ToTheioFengeiSou.notmetered
ltx/en_us_oca/me.m02.d27:alt1.meMA.Ode5C12.mode	@ltx/en_us_oca/miscellanea:misc.Mode6
ltx/en_us_oca/me.m02.d27:alt1.meMA.Ode5C12.ode	@ltx/en_us_oca/miscellanea:misc.Ode5
ltx/en_us_oca/me.m02.d27:alt1.meMA.Ode5C12.text	
ltx/en_us_oca/me.m02.d27:alt1.meMA.Ode5C13.incipit	…
ltx/en_us_oca/me.m02.d27:alt1.meMA.Ode5C13.melody	@ltx/en_us_oca/he.h.m6:heHE.ToTheioFengeiSou.notmetered
ltx/en_us_oca/me.m02.d27:alt1.meMA.Ode5C13.mode	@ltx/en_us_oca/miscellanea:misc.Mode6
ltx/en_us_oca/me.m02.d27:alt1.meMA.Ode5C13.ode	@ltx/en_us_oca/miscellanea:misc.Ode5
ltx/en_us_oca/me.m02.d27:alt1.meMA.Ode5C13.text	
ltx/en_us_oca/me.m02.d27:alt1.meMA.Ode5C14.incipit	…
ltx/en_us_oca/me.m02.d27:alt1.meMA.Ode5C14.melody	@ltx/en_us_oca/he.h.m6:heHE.ToTheioFengeiSou.notmetered
ltx/en_us_oca/me.m02.d27:alt1.meMA.Ode5C14.mode	@ltx/en_us_oca/miscellanea:misc.Mode6
ltx/en_us_oca/me.m02.d27:alt1.meMA.Ode5C14.ode	@ltx/en_us_oca/miscellanea:misc.Ode5
ltx/en_us_oca/me.m02.d27:alt1.meMA.Ode5C14.text	
ltx/en_us_oca/me.m02.d27:alt1.meMA.Ode5C1T.incipit	…
ltx/en_us_oca/me.m02.d27:alt1.meMA.Ode5C1T.melody	@ltx/en_us_oca/he.h.m6:heHE.ToTheioFengeiSou.notmetered
ltx/en_us_oca/me.m02.d27:alt1.meMA.Ode5C1T.mode	@ltx/en_us_oca/miscellanea:misc.Mode6
ltx/en_us_oca/me.m02.d27:alt1.meMA.Ode5C1T.ode	@ltx/en_us_oca/miscellanea:misc.Ode5
ltx/en_us_oca/me.m02.d27:alt1.meMA.Ode5C1T.text	
ltx/en_us_oca/me.m02.d27:alt1.meMA.Ode6C11.greekmelody	@ltx/en_us_oca/he.h.m6:heHE.TouViouTinThalassan.greekname
ltx/en_us_oca/me.m02.d27:alt1.meMA.Ode6C11.incipit	…
ltx/en_us_oca/me.m02.d27:alt1.meMA.Ode6C11.melody	@ltx/en_us_oca/he.h.m6:heHE.TouViouTinThalassan.notmetered
ltx/en_us_oca/me.m02.d27:alt1.meMA.Ode6C11.mode	@ltx/en_us_oca/miscellanea:misc.Mode6
ltx/en_us_oca/me.m02.d27:alt1.meMA.Ode6C11.ode	@ltx/en_us_oca/miscellanea:misc.Ode6
ltx/en_us_oca/me.m02.d27:alt1.meMA.Ode6C11.text	
ltx/en_us_oca/me.m02.d27:alt1.meMA.Ode6C12.incipit	…
ltx/en_us_oca/me.m02.d27:alt1.meMA.Ode6C12.melody	@ltx/en_us_oca/he.h.m6:heHE.TouViouTinThalassan.notmetered
ltx/en_us_oca/me.m02.d27:alt1.meMA.Ode6C12.mode	@ltx/en_us_oca/miscellanea:misc.Mode6
ltx/en_us_oca/me.m02.d27:alt1.meMA.Ode6C12.ode	@ltx/en_us_oca/miscellanea:misc.Ode6
ltx/en_us_oca/me.m02.d27:alt1.meMA.Ode6C12.text	
ltx/en_us_oca/me.m02.d27:alt1.meMA.Ode6C13.incipit	…
ltx/en_us_oca/me.m02.d27:alt1.meMA.Ode6C13.melody	@ltx/en_us_oca/he.h.m6:heHE.TouViouTinThalassan.notmetered
ltx/en_us_oca/me.m02.d27:alt1.meMA.Ode6C13.mode	@ltx/en_us_oca/miscellanea:misc.Mode6
ltx/en_us_oca/me.m02.d27:alt1.meMA.Ode6C13.ode	@ltx/en_us_oca/miscellanea:misc.Ode6
ltx/en_us_oca/me.m02.d27:alt1.meMA.Ode6C13.text	
ltx/en_us_oca/me.m02.d27:alt1.meMA.Ode6C14.incipit	…
ltx/en_us_oca/me.m02.d27:alt1.meMA.Ode6C14.melody	@ltx/en_us_oca/he.h.m6:heHE.TouViouTinThalassan.notmetered
ltx/en_us_oca/me.m02.d27:alt1.meMA.Ode6C14.mode	@ltx/en_us_oca/miscellanea:misc.Mode6
ltx/en_us_oca/me.m02.d27:alt1.meMA.Ode6C14.ode	@ltx/en_us_oca/miscellanea:misc.Ode6
ltx/en_us_oca/me.m02.d27:alt1.meMA.Ode6C14.text	
ltx/en_us_oca/me.m02.d27:alt1.meMA.Ode6C1T.incipit	…
ltx/en_us_oca/me.m02.d27:alt1.meMA.Ode6C1T.melody	@ltx/en_us_oca/he.h.m6:heHE.TouViouTinThalassan.notmetered
ltx/en_us_oca/me.m02.d27:alt1.meMA.Ode6C1T.mode	@ltx/en_us_oca/miscellanea:misc.Mode6
ltx/en_us_oca/me.m02.d27:alt1.meMA.Ode6C1T.ode	@ltx/en_us_oca/miscellanea:misc.Ode6
ltx/en_us_oca/me.m02.d27:alt1.meMA.Ode6C1T.text	
ltx/en_us_oca/me.m02.d27:alt1.meMA.Ode7C11.greekmelody	@ltx/en_us_oca/he.h.m6:heHE.DrosovolonMenTinKaminon.greekname
ltx/en_us_oca/me.m02.d27:alt1.meMA.Ode7C11.incipit	…
ltx/en_us_oca/me.m02.d27:alt1.meMA.Ode7C11.melody	@ltx/en_us_oca/he.h.m6:heHE.DrosovolonMenTinKaminon.notmetered
ltx/en_us_oca/me.m02.d27:alt1.meMA.Ode7C11.mode	@ltx/en_us_oca/miscellanea:misc.Mode6
ltx/en_us_oca/me.m02.d27:alt1.meMA.Ode7C11.ode	@ltx/en_us_oca/miscellanea:misc.Ode7
ltx/en_us_oca/me.m02.d27:alt1.meMA.Ode7C11.text	
ltx/en_us_oca/me.m02.d27:alt1.meMA.Ode7C12.incipit	…
ltx/en_us_oca/me.m02.d27:alt1.meMA.Ode7C12.melody	@ltx/en_us_oca/he.h.m6:heHE.DrosovolonMenTinKaminon.notmetered
ltx/en_us_oca/me.m02.d27:alt1.meMA.Ode7C12.mode	@ltx/en_us_oca/miscellanea:misc.Mode6
ltx/en_us_oca/me.m02.d27:alt1.meMA.Ode7C12.ode	@ltx/en_us_oca/miscellanea:misc.Ode7
ltx/en_us_oca/me.m02.d27:alt1.meMA.Ode7C12.text	
ltx/en_us_oca/me.m02.d27:alt1.meMA.Ode7C13.incipit	…
ltx/en_us_oca/me.m02.d27:alt1.meMA.Ode7C13.melody	@ltx/en_us_oca/he.h.m6:heHE.DrosovolonMenTinKaminon.notmetered
ltx/en_us_oca/me.m02.d27:alt1.meMA.Ode7C13.mode	@ltx/en_us_oca/miscellanea:misc.Mode6
ltx/en_us_oca/me.m02.d27:alt1.meMA.Ode7C13.ode	@ltx/en_us_oca/miscellanea:misc.Ode7
ltx/en_us_oca/me.m02.d27:alt1.meMA.Ode7C13.text	
ltx/en_us_oca/me.m02.d27:alt1.meMA.Ode7C14.incipit	…
ltx/en_us_oca/me.m02.d27:alt1.meMA.Ode7C14.melody	@ltx/en_us_oca/he.h.m6:heHE.DrosovolonMenTinKaminon.notmetered
ltx/en_us_oca/me.m02.d27:alt1.meMA.Ode7C14.mode	@ltx/en_us_oca/miscellanea:misc.Mode6
ltx/en_us_oca/me.m02.d27:alt1.meMA.Ode7C14.ode	@ltx/en_us_oca/miscellanea:misc.Ode7
ltx/en_us_oca/me.m02.d27:alt1.meMA.Ode7C14.text	
ltx/en_us_oca/me.m02.d27:alt1.meMA.Ode7C1T.incipit	…
ltx/en_us_oca/me.m02.d27:alt1.meMA.Ode7C1T.melody	@ltx/en_us_oca/he.h.m6:heHE.DrosovolonMenTinKaminon.notmetered
ltx/en_us_oca/me.m02.d27:alt1.meMA.Ode7C1T.mode	@ltx/en_us_oca/miscellanea:misc.Mode6
ltx/en_us_oca/me.m02.d27:alt1.meMA.Ode7C1T.ode	@ltx/en_us_oca/miscellanea:misc.Ode7
ltx/en_us_oca/me.m02.d27:alt1.meMA.Ode7C1T.text	
ltx/en_us_oca/me.m02.d27:alt1.meMA.Ode8C11.greekmelody	@ltx/en_us_oca/he.h.m6:heHE.EkFlogosToisOsiois.greekname
ltx/en_us_oca/me.m02.d27:alt1.meMA.Ode8C11.incipit	…
ltx/en_us_oca/me.m02.d27:alt1.meMA.Ode8C11.melody	@ltx/en_us_oca/he.h.m6:heHE.EkFlogosToisOsiois.notmetered
ltx/en_us_oca/me.m02.d27:alt1.meMA.Ode8C11.mode	@ltx/en_us_oca/miscellanea:misc.Mode6
ltx/en_us_oca/me.m02.d27:alt1.meMA.Ode8C11.ode	@ltx/en_us_oca/miscellanea:misc.Ode8
ltx/en_us_oca/me.m02.d27:alt1.meMA.Ode8C11.text	
ltx/en_us_oca/me.m02.d27:alt1.meMA.Ode8C12.incipit	…
ltx/en_us_oca/me.m02.d27:alt1.meMA.Ode8C12.melody	@ltx/en_us_oca/he.h.m6:heHE.EkFlogosToisOsiois.notmetered
ltx/en_us_oca/me.m02.d27:alt1.meMA.Ode8C12.mode	@ltx/en_us_oca/miscellanea:misc.Mode6
ltx/en_us_oca/me.m02.d27:alt1.meMA.Ode8C12.ode	@ltx/en_us_oca/miscellanea:misc.Ode8
ltx/en_us_oca/me.m02.d27:alt1.meMA.Ode8C12.text	
ltx/en_us_oca/me.m02.d27:alt1.meMA.Ode8C13.incipit	…
ltx/en_us_oca/me.m02.d27:alt1.meMA.Ode8C13.melody	@ltx/en_us_oca/he.h.m6:heHE.EkFlogosToisOsiois.notmetered
ltx/en_us_oca/me.m02.d27:alt1.meMA.Ode8C13.mode	@ltx/en_us_oca/miscellanea:misc.Mode6
ltx/en_us_oca/me.m02.d27:alt1.meMA.Ode8C13.ode	@ltx/en_us_oca/miscellanea:misc.Ode8
ltx/en_us_oca/me.m02.d27:alt1.meMA.Ode8C13.text	
ltx/en_us_oca/me.m02.d27:alt1.meMA.Ode8C14.incipit	…
ltx/en_us_oca/me.m02.d27:alt1.meMA.Ode8C14.melody	@ltx/en_us_oca/he.h.m6:heHE.EkFlogosToisOsiois.notmetered
ltx/en_us_oca/me.m02.d27:alt1.meMA.Ode8C14.mode	@ltx/en_us_oca/miscellanea:misc.Mode6
ltx/en_us_oca/me.m02.d27:alt1.meMA.Ode8C14.ode	@ltx/en_us_oca/miscellanea:misc.Ode8
ltx/en_us_oca/me.m02.d27:alt1.meMA.Ode8C14.text	
ltx/en_us_oca/me.m02.d27:alt1.meMA.Ode8C1T.incipit	…
ltx/en_us_oca/me.m02.d27:alt1.meMA.Ode8C1T.melody	@ltx/en_us_oca/he.h.m6:heHE.EkFlogosToisOsiois.notmetered
ltx/en_us_oca/me.m02.d27:alt1.meMA.Ode8C1T.mode	@ltx/en_us_oca/miscellanea:misc.Mode6
ltx/en_us_oca/me.m02.d27:alt1.meMA.Ode8C1T.ode	@ltx/en_us_oca/miscellanea:misc.Ode8
ltx/en_us_oca/me.m02.d27:alt1.meMA.Ode8C1T.text	
ltx/en_us_oca/me.m02.d27:alt1.meMA.Ode9C11.greekmelody	@ltx/en_us_oca/he.h.m6:heHE.TheonAnthropois.greekname
ltx/en_us_oca/me.m02.d27:alt1.meMA.Ode9C11.incipit	…
ltx/en_us_oca/me.m02.d27:alt1.meMA.Ode9C11.melody	@ltx/en_us_oca/he.h.m6:heHE.TheonAnthropois.notmetered
ltx/en_us_oca/me.m02.d27:alt1.meMA.Ode9C11.mode	@ltx/en_us_oca/miscellanea:misc.Mode6
ltx/en_us_oca/me.m02.d27:alt1.meMA.Ode9C11.ode	@ltx/en_us_oca/miscellanea:misc.Ode9
ltx/en_us_oca/me.m02.d27:alt1.meMA.Ode9C11.text	
ltx/en_us_oca/me.m02.d27:alt1.meMA.Ode9C12.incipit	…
ltx/en_us_oca/me.m02.d27:alt1.meMA.Ode9C12.melody	@ltx/en_us_oca/he.h.m6:heHE.TheonAnthropois.notmetered
ltx/en_us_oca/me.m02.d27:alt1.meMA.Ode9C12.mode	@ltx/en_us_oca/miscellanea:misc.Mode6
ltx/en_us_oca/me.m02.d27:alt1.meMA.Ode9C12.ode	@ltx/en_us_oca/miscellanea:misc.Ode9
ltx/en_us_oca/me.m02.d27:alt1.meMA.Ode9C12.text	
ltx/en_us_oca/me.m02.d27:alt1.meMA.Ode9C13.incipit	…
ltx/en_us_oca/me.m02.d27:alt1.meMA.Ode9C13.melody	@ltx/en_us_oca/he.h.m6:heHE.TheonAnthropois.notmetered
ltx/en_us_oca/me.m02.d27:alt1.meMA.Ode9C13.mode	@ltx/en_us_oca/miscellanea:misc.Mode6
ltx/en_us_oca/me.m02.d27:alt1.meMA.Ode9C13.ode	@ltx/en_us_oca/miscellanea:misc.Ode9
ltx/en_us_oca/me.m02.d27:alt1.meMA.Ode9C13.text	
ltx/en_us_oca/me.m02.d27:alt1.meMA.Ode9C14.incipit	…
ltx/en_us_oca/me.m02.d27:alt1.meMA.Ode9C14.melody	@ltx/en_us_oca/he.h.m6:heHE.TheonAnthropois.notmetered
ltx/en_us_oca/me.m02.d27:alt1.meMA.Ode9C14.mode	@ltx/en_us_oca/miscellanea:misc.Mode6
ltx/en_us_oca/me.m02.d27:alt1.meMA.Ode9C14.ode	@ltx/en_us_oca/miscellanea:misc.Ode9
ltx/en_us_oca/me.m02.d27:alt1.meMA.Ode9C14.text	
ltx/en_us_oca/me.m02.d27:alt1.meMA.Ode9C1T.incipit	…
ltx/en_us_oca/me.m02.d27:alt1.meMA.Ode9C1T.melody	@ltx/en_us_oca/he.h.m6:heHE.TheonAnthropois.notmetered
ltx/en_us_oca/me.m02.d27:alt1.meMA.Ode9C1T.mode	@ltx/en_us_oca/miscellanea:misc.Mode6
ltx/en_us_oca/me.m02.d27:alt1.meMA.Ode9C1T.ode	@ltx/en_us_oca/miscellanea:misc.Ode9
ltx/en_us_oca/me.m02.d27:alt1.meMA.Ode9C1T.text	
ltx/en_us_oca/me.m02.d27:alt1.meMA.Oikos1.text	
ltx/en_us_oca/me.m02.d27:alt1.meMA.PostGospelBoth.incipit	@ltx/en_us_oca/ho.ho03:hoMA.PostGospelTheotokos.incipit
ltx/en_us_oca/me.m02.d27:alt1.meMA.PostGospelBoth.melody	
ltx/en_us_oca/me.m02.d27:alt1.meMA.PostGospelBoth.mode	@ltx/en_us_oca/miscellanea:misc.Mode2
ltx/en_us_oca/me.m02.d27:alt1.meMA.PostGospelBoth.text	@ltx/en_us_oca/ho.ho03:hoMA.PostGospelTheotokos.text
ltx/en_us_oca/me.m02.d27:alt1.meMA.PostGospelGlory.incipit	@ltx/en_us_oca/ho.ho03:hoMA.PostGospelHierarch.incipit
ltx/en_us_oca/me.m02.d27:alt1.meMA.PostGospelGlory.melody	
ltx/en_us_oca/me.m02.d27:alt1.meMA.PostGospelGlory.mode	@ltx/en_us_oca/miscellanea:misc.Mode2
ltx/en_us_oca/me.m02.d27:alt1.meMA.PostGospelGlory.text	@ltx/en_us_oca/ho.ho03:hoMA.PostGospelHierarch.text
ltx/en_us_oca/me.m02.d27:alt1.meMA.PostGospelIdiomelon.incipit	…
ltx/en_us_oca/me.m02.d27:alt1.meMA.PostGospelIdiomelon.melody	
ltx/en_us_oca/me.m02.d27:alt1.meMA.PostGospelIdiomelon.mode	@ltx/en_us_oca/miscellanea:misc.Mode5
ltx/en_us_oca/me.m02.d27:alt1.meMA.PostGospelIdiomelon.text	
ltx/en_us_oca/me.m02.d27:alt1.meVE.Apolytikion1.incipit	Your proclamation has gone out…
ltx/en_us_oca/me.m02.d27:alt1.meVE.Apolytikion1.melody	
ltx/en_us_oca/me.m02.d27:alt1.meVE.Apolytikion1.mode	@ltx/en_us_oca/miscellanea:misc.Mode1
ltx/en_us_oca/me.m02.d27:alt1.meVE.Apolytikion1.text	Your proclamation has gone out through North America, ⁄ calling the scattered sheep into the unity of the Church! ⁄ As they hear your voice, they respond to your teaching; ⁄ through your writings you instruct them in piety! ⁄ Guided now by your example, Father Raphael, we sing hymns of praise to Christ our God: ⁄ Glory to Him Who gave you strength! ⁄ Glory to Him Who granted you a crown! ⁄⁄ Glory to Him Who, through you, grants healing to all!
ltx/en_us_oca/me.m02.d27:alt1.meVE.AposGlory.incipit	Today a great festival shines…
ltx/en_us_oca/me.m02.d27:alt1.meVE.AposGlory.melody	
ltx/en_us_oca/me.m02.d27:alt1.meVE.AposGlory.mode	@ltx/en_us_oca/miscellanea:misc.Mode4
ltx/en_us_oca/me.m02.d27:alt1.meVE.AposGlory.text	Today a great festival shines like the sun over the whole world, ⁄ as we celebrate the memory of the holy bishop Raphael, ⁄ the apostle to the lost sheep of North America! ⁄ Let us rejoice on this festal day and cry out to him: ⁄ Rejoice, new Moses, who led your people into the Promised Land! ⁄ Rejoice, new Elijah, who bequeathed a double portion of your spirit to us! ⁄ Rejoice, new Ezra, who built a temple of God in our midst! ⁄ Rejoice, new apostle of Christ our God, drawing us closer to Him! ⁄ As you stand among the saints before the throne of God, ⁄⁄ never cease to intercede for us who honor you!
ltx/en_us_oca/me.m02.d27:alt1.meVE.Aposticha1.greekmelody	@ltx/en_us_oca/he.a.m2:heAU.OikosTouEfratha.greekname
ltx/en_us_oca/me.m02.d27:alt1.meVE.Aposticha1.incipit	Holy hierarch Raphael, ⁄ who…
ltx/en_us_oca/me.m02.d27:alt1.meVE.Aposticha1.melody	@ltx/en_us_oca/he.a.m2:heAU.OikosTouEfratha.notmetered
ltx/en_us_oca/me.m02.d27:alt1.meVE.Aposticha1.mode	@ltx/en_us_oca/miscellanea:misc.Mode2
ltx/en_us_oca/me.m02.d27:alt1.meVE.Aposticha1.text	Holy hierarch Raphael, ⁄ who can describe your many toils? ⁄ Who can count the hardships you endured? ⁄ As a shepherd of Christ’s rational flock ⁄⁄ pray that He may preserve His Church in peace!
ltx/en_us_oca/me.m02.d27:alt1.meVE.Aposticha2.greekmelody	@ltx/en_us_oca/he.a.m2:heAU.OikosTouEfratha.greekname
ltx/en_us_oca/me.m02.d27:alt1.meVE.Aposticha2.incipit	Holy Father Raphael, ⁄ who…
ltx/en_us_oca/me.m02.d27:alt1.meVE.Aposticha2.melody	@ltx/en_us_oca/he.a.m2:heAU.OikosTouEfratha.notmetered
ltx/en_us_oca/me.m02.d27:alt1.meVE.Aposticha2.mode	@ltx/en_us_oca/miscellanea:misc.Mode2
ltx/en_us_oca/me.m02.d27:alt1.meVE.Aposticha2.text	Holy Father Raphael, ⁄ who can describe your sorrows? ⁄ Who can recount your noble deeds? ⁄ Friend of the needy and protector of orphans, ⁄⁄ intercede with Christ for our salvation!
ltx/en_us_oca/me.m02.d27:alt1.meVE.Aposticha3.greekmelody	@ltx/en_us_oca/he.a.m2:heAU.OikosTouEfratha.greekname
ltx/en_us_oca/me.m02.d27:alt1.meVE.Aposticha3.incipit	Glorious Raphael, ⁄ you are…
ltx/en_us_oca/me.m02.d27:alt1.meVE.Aposticha3.melody	@ltx/en_us_oca/he.a.m2:heAU.OikosTouEfratha.notmetered
ltx/en_us_oca/me.m02.d27:alt1.meVE.Aposticha3.mode	@ltx/en_us_oca/miscellanea:misc.Mode2
ltx/en_us_oca/me.m02.d27:alt1.meVE.Aposticha3.text	Glorious Raphael, ⁄ you are a great light from Antioch, ⁄ a seeker of the lost children of the Church, ⁄ a model for bishops of North America! ⁄⁄ Entreat Christ to have great mercy on us all!
ltx/en_us_oca/me.m02.d27:alt1.meVE.Lity1.incipit	Rising in distant Syria, ascending…
ltx/en_us_oca/me.m02.d27:alt1.meVE.Lity1.melody	
ltx/en_us_oca/me.m02.d27:alt1.meVE.Lity1.mode	@ltx/en_us_oca/miscellanea:misc.Mode5
ltx/en_us_oca/me.m02.d27:alt1.meVE.Lity1.text	Rising in distant Syria, ascending through the land of Russia, ⁄ a bright star has appeared over the New World! ⁄ Shining with divine knowledge and radiating the love of Christ, ⁄ the luminous Raphael overcomes every deception of the enemy. ⁄⁄ Now crowned among the saints, he intercedes for us before the throne of God.
ltx/en_us_oca/me.m02.d27:alt1.meVE.LityGlory.incipit	Enlightened by the memory of…
ltx/en_us_oca/me.m02.d27:alt1.meVE.LityGlory.melody	
ltx/en_us_oca/me.m02.d27:alt1.meVE.LityGlory.mode	@ltx/en_us_oca/miscellanea:misc.Mode5
ltx/en_us_oca/me.m02.d27:alt1.meVE.LityGlory.text	Enlightened by the memory of the holy Raphael, ⁄ we celebrate his sacred feast! ⁄ Since he was made divinely wise, ⁄ he draws us all into the net of Christ ⁄⁄ and entreats great mercy for our souls!
ltx/en_us_oca/me.m02.d27:alt1.meVE.SticGlory.incipit	Your children praise you as…
ltx/en_us_oca/me.m02.d27:alt1.meVE.SticGlory.melody	
ltx/en_us_oca/me.m02.d27:alt1.meVE.SticGlory.mode	@ltx/en_us_oca/miscellanea:misc.Mode6
ltx/en_us_oca/me.m02.d27:alt1.meVE.SticGlory.text	Your children praise you as a wise hierarch of the Church in America, ⁄ who unified the faithful from every land, ⁄ defending the oppressed and guarding the Faith! ⁄ You held the high and humble in equal esteem, ⁄ treating all with Christ’s own gentleness. ⁄ Now as you stand among the saints, holy father Raphael, ⁄⁄ never cease to intercede for us with Christ our God!
ltx/en_us_oca/me.m02.d27:alt1.meVE.Stichera01.greekmelody	@ltx/en_us_oca/he.a.m2:heAU.OteEkTouXylou.greekname
ltx/en_us_oca/me.m02.d27:alt1.meVE.Stichera01.incipit	Let all the choirs of…
ltx/en_us_oca/me.m02.d27:alt1.meVE.Stichera01.melody	@ltx/en_us_oca/he.a.m2:heAU.OteEkTouXylou.notmetered
ltx/en_us_oca/me.m02.d27:alt1.meVE.Stichera01.mode	@ltx/en_us_oca/miscellanea:misc.Mode2
ltx/en_us_oca/me.m02.d27:alt1.meVE.Stichera01.text	Let all the choirs of Orthodox Christians in America ⁄ sing hymns in honor of the holy bishop Raphael! ⁄ By birth an Arab, fed by streams of Greek theology, ⁄ he was consecrated by the Church of Russia, which had adopted us all. ⁄ True to his name, he brings God’s healing to us ⁄⁄ as we celebrate his holy memory.
ltx/en_us_oca/me.m02.d27:alt1.meVE.Stichera02.incipit	As the archangel Raphael guided…
ltx/en_us_oca/me.m02.d27:alt1.meVE.Stichera02.melody	@ltx/en_us_oca/he.a.m2:heAU.OteEkTouXylou.notmetered
ltx/en_us_oca/me.m02.d27:alt1.meVE.Stichera02.mode	@ltx/en_us_oca/miscellanea:misc.Mode2
ltx/en_us_oca/me.m02.d27:alt1.meVE.Stichera02.text	As the archangel Raphael guided Tobit in a foreign land long ago, ⁄ Bishop Raphael kept his flock on the true path in a land far from their homes. ⁄ Always imitating the Good Shepherd, he fed his many sheep ⁄ from a table which the Lord prepared in the presence of their enemies. ⁄ So now, as we are fed by his teaching and example, ⁄⁄ we pray that he will continue to intercede for us with Christ our God!
ltx/en_us_oca/me.m02.d27:alt1.meVE.Stichera03.incipit	Let us sing hymns of…
ltx/en_us_oca/me.m02.d27:alt1.meVE.Stichera03.melody	@ltx/en_us_oca/he.a.m2:heAU.OteEkTouXylou.notmetered
ltx/en_us_oca/me.m02.d27:alt1.meVE.Stichera03.mode	@ltx/en_us_oca/miscellanea:misc.Mode2
ltx/en_us_oca/me.m02.d27:alt1.meVE.Stichera03.text	Let us sing hymns of praise to the holy bishop Raphael, ⁄ who shone forth from Brooklyn and enlightened those in darkness. ⁄ To those who were wounded by sin, h4e brought healing in Christ; ⁄ to those who were deceived, he brought the truth of the Orthodox Faith; ⁄ he gathered his scattered sheep safely into the fold of the Church. ⁄⁄ Therefore we praise him as a worthy bishop and citizen of Heaven.
ltx/en_us_oca/me.m02.d27:alt1.meVE.Stichera04.greekmelody	@ltx/en_us_oca/he.a.m1:heAU.OTouParadoxouThavmatos.greekname
ltx/en_us_oca/me.m02.d27:alt1.meVE.Stichera04.incipit	Holy father Raphael, ⁄ you…
ltx/en_us_oca/me.m02.d27:alt1.meVE.Stichera04.melody	@ltx/en_us_oca/he.a.m1:heAU.OTouParadoxouThavmatos.notmetered
ltx/en_us_oca/me.m02.d27:alt1.meVE.Stichera04.mode	@ltx/en_us_oca/miscellanea:misc.Mode1
ltx/en_us_oca/me.m02.d27:alt1.meVE.Stichera04.text	Holy father Raphael, ⁄ you embodied the love of Christ from your youth. ⁄ You were sent to America, son of Antioch, as an apostle to the lost sheep of Syria. ⁄ Without concern for your own comfort, you labored night and day, ⁄ traversing the continent, never pausing to rest. ⁄⁄ As you have boldness before Christ our God, entreat Him to save our souls.
ltx/en_us_oca/me.m02.d27:alt1.meVE.Stichera05.greekmelody	@ltx/en_us_oca/he.a.m1:heAU.OTouParadoxouThavmatos.greekname
ltx/en_us_oca/me.m02.d27:alt1.meVE.Stichera05.incipit	Holy father Raphael, ⁄ You…
ltx/en_us_oca/me.m02.d27:alt1.meVE.Stichera05.melody	@ltx/en_us_oca/he.a.m1:heAU.OTouParadoxouThavmatos.notmetered
ltx/en_us_oca/me.m02.d27:alt1.meVE.Stichera05.mode	@ltx/en_us_oca/miscellanea:misc.Mode1
ltx/en_us_oca/me.m02.d27:alt1.meVE.Stichera05.text	Holy father Raphael, ⁄ You worked as a good shepherd, ⁄ searching far and near for your lost sheep. ⁄ Binding their wounds in love as their father in the Spirit, ⁄ you carried them to Christ on your own shoulders. ⁄⁄ As you have boldness before Christ our God, entreat Him to save our souls.
ltx/en_us_oca/me.m02.d27:alt1.meVE.Stichera06.incipit	In you, good shepherd Raphael…
ltx/en_us_oca/me.m02.d27:alt1.meVE.Stichera06.melody	@ltx/en_us_oca/he.a.m1:heAU.OTouParadoxouThavmatos.notmetered
ltx/en_us_oca/me.m02.d27:alt1.meVE.Stichera06.mode	@ltx/en_us_oca/miscellanea:misc.Mode1
ltx/en_us_oca/me.m02.d27:alt1.meVE.Stichera06.text	In you, good shepherd Raphael ⁄ the faithful found sustenance for their souls and protection from their foes. ⁄ Keeping your eyes not on obstacles but on the prize from above, ⁄ you counted earthly gain as loss: ⁄ You imitated Christ by laying down your life for your flock! ⁄⁄ As you have boldness before Christ our God, entreat Him to save our souls.
ltx/en_us_oca/me.m02.d27:meDA.commemoration.first	
ltx/en_us_oca/me.m02.d27:meDA.commemoration.first_name	
ltx/en_us_oca/me.m02.d27:meDA.commemoration.first_short	
ltx/en_us_oca/me.m02.d27:meDA.commemoration.first_title	
ltx/en_us_oca/me.m02.d27:meDA.commemoration.full	Our Venerable Father Procopius, Confessor of the Decapolis (8th century)
ltx/en_us_oca/me.m02.d27:meDA.commemoration.second_name	
ltx/en_us_oca/me.m02.d27:meDA.commemoration.second_title	
ltx/en_us_oca/me.m02.d27:meDA.date	February 27
ltx/en_us_oca/me.m02.d27:meDA.fordate	
ltx/en_us_oca/me.m02.d27:meDA.insert1	
ltx/en_us_oca/me.m02.d27:meDA.insert2	
ltx/en_us_oca/me.m02.d27:meDA.note	
ltx/en_us_oca/me.m02.d27:meDA.pdfcoverdate	
ltx/en_us_oca/me.m02.d27:meDA.pdfheaderdate	
ltx/en_us_oca/me.m02.d27:meHO.commemorations	
ltx/en_us_oca/me.m02.d27:meHO.note1	
ltx/en_us_oca/me.m02.d27:meHO.note2	
ltx/en_us_oca/me.m02.d27:meHO.number	
ltx/en_us_oca/me.m02.d27:meHO.rank	
ltx/en_us_oca/me.m02.d27:meLE.commemoration1	
ltx/en_us_oca/me.m02.d27:meLE.commemoration2	
ltx/en_us_oca/me.m02.d27:meLI.Kontakion1.greekmelody	@ltx/en_us_oca/me.m02.d27:meMA.Kontakion1.greekmelody
ltx/en_us_oca/me.m02.d27:meLI.Kontakion1.incipit	@ltx/en_us_oca/me.m02.d27:meMA.Kontakion1.incipit
ltx/en_us_oca/me.m02.d27:meLI.Kontakion1.melody	@ltx/en_us_oca/me.m02.d27:meMA.Kontakion1.melody
ltx/en_us_oca/me.m02.d27:meLI.Kontakion1.mode	@ltx/en_us_oca/me.m02.d27:meMA.Kontakion1.mode
ltx/en_us_oca/me.m02.d27:meLI.Kontakion1.text	@ltx/en_us_oca/me.m02.d27:meMA.Kontakion1.text
ltx/en_us_oca/me.m02.d27:meLI.Megalynarion.text	
ltx/en_us_oca/me.m02.d27:meMA.C1.acrostic.notice1	
ltx/en_us_oca/me.m02.d27:meMA.C1.acrostic.text	
ltx/en_us_oca/me.m02.d27:meMA.C1.acrostic.title	
ltx/en_us_oca/me.m02.d27:meMA.C1.poet	@ltx/en_us_oca/poets:po.Theofanous
ltx/en_us_oca/me.m02.d27:meMA.C1.title	@ltx/en_us_oca/titles:ti.CanonDevoutM
ltx/en_us_oca/me.m02.d27:meMA.C1.verse	@ltx/en_us_oca/prayers:pr.verse_DevoutMan.text
ltx/en_us_oca/me.m02.d27:meMA.ExapTheotokion.incipit	…
ltx/en_us_oca/me.m02.d27:meMA.ExapTheotokion.melody	@ltx/en_us_oca/he.a.m2:heAU.GynaikesAkoutisthite.notmetered
ltx/en_us_oca/me.m02.d27:meMA.ExapTheotokion.mode	@ltx/en_us_oca/miscellanea:misc.Mode2
ltx/en_us_oca/me.m02.d27:meMA.ExapTheotokion.text	
ltx/en_us_oca/me.m02.d27:meMA.Exaposteilarion1.greekmelody	@ltx/en_us_oca/he.a.m2:heAU.GynaikesAkoutisthite.greekname
ltx/en_us_oca/me.m02.d27:meMA.Exaposteilarion1.incipit	…
ltx/en_us_oca/me.m02.d27:meMA.Exaposteilarion1.melody	@ltx/en_us_oca/he.a.m2:heAU.GynaikesAkoutisthite.notmetered
ltx/en_us_oca/me.m02.d27:meMA.Exaposteilarion1.mode	@ltx/en_us_oca/miscellanea:misc.Mode2
ltx/en_us_oca/me.m02.d27:meMA.Exaposteilarion1.text	
ltx/en_us_oca/me.m02.d27:meMA.Kontakion1.greekmelody	@ltx/en_us_oca/he.a.m4:heAU.EpefanisSimeron.greekname
ltx/en_us_oca/me.m02.d27:meMA.Kontakion1.incipit	…
ltx/en_us_oca/me.m02.d27:meMA.Kontakion1.melody	@ltx/en_us_oca/he.a.m4:heAU.EpefanisSimeron.notmetered
ltx/en_us_oca/me.m02.d27:meMA.Kontakion1.mode	@ltx/en_us_oca/miscellanea:misc.Mode4
ltx/en_us_oca/me.m02.d27:meMA.Kontakion1.text	
ltx/en_us_oca/me.m02.d27:meMA.Ode1C11.greekmelody	@ltx/en_us_oca/he.h.m6:heHE.OsEnIpeiroPezefsas.greekname
ltx/en_us_oca/me.m02.d27:meMA.Ode1C11.incipit	…
ltx/en_us_oca/me.m02.d27:meMA.Ode1C11.melody	@ltx/en_us_oca/he.h.m6:heHE.OsEnIpeiroPezefsas.notmetered
ltx/en_us_oca/me.m02.d27:meMA.Ode1C11.mode	@ltx/en_us_oca/miscellanea:misc.Mode6
ltx/en_us_oca/me.m02.d27:meMA.Ode1C11.ode	@ltx/en_us_oca/miscellanea:misc.Ode1
ltx/en_us_oca/me.m02.d27:meMA.Ode1C11.text	
ltx/en_us_oca/me.m02.d27:meMA.Ode1C12.incipit	…
ltx/en_us_oca/me.m02.d27:meMA.Ode1C12.melody	@ltx/en_us_oca/he.h.m6:heHE.OsEnIpeiroPezefsas.notmetered
ltx/en_us_oca/me.m02.d27:meMA.Ode1C12.mode	@ltx/en_us_oca/miscellanea:misc.Mode6
ltx/en_us_oca/me.m02.d27:meMA.Ode1C12.ode	@ltx/en_us_oca/miscellanea:misc.Ode1
ltx/en_us_oca/me.m02.d27:meMA.Ode1C12.text	
ltx/en_us_oca/me.m02.d27:meMA.Ode1C13.incipit	…
ltx/en_us_oca/me.m02.d27:meMA.Ode1C13.melody	@ltx/en_us_oca/he.h.m6:heHE.OsEnIpeiroPezefsas.notmetered
ltx/en_us_oca/me.m02.d27:meMA.Ode1C13.mode	@ltx/en_us_oca/miscellanea:misc.Mode6
ltx/en_us_oca/me.m02.d27:meMA.Ode1C13.ode	@ltx/en_us_oca/miscellanea:misc.Ode1
ltx/en_us_oca/me.m02.d27:meMA.Ode1C13.text	
ltx/en_us_oca/me.m02.d27:meMA.Ode1C1H.greekmelody	@ltx/en_us_oca/he.h.m6:heHE.OsEnIpeiroPezefsas.greekname
ltx/en_us_oca/me.m02.d27:meMA.Ode1C1H.incipit	@ltx/en_us_oca/he.h.m6:heHE.OsEnIpeiroPezefsas.incipit
ltx/en_us_oca/me.m02.d27:meMA.Ode1C1H.melody	@ltx/en_us_oca/he.h.m6:heHE.OsEnIpeiroPezefsas.melody
ltx/en_us_oca/me.m02.d27:meMA.Ode1C1H.mode	@ltx/en_us_oca/miscellanea:misc.Mode6
ltx/en_us_oca/me.m02.d27:meMA.Ode1C1H.ode	@ltx/en_us_oca/miscellanea:misc.Ode1
ltx/en_us_oca/me.m02.d27:meMA.Ode1C1H.text	@ltx/en_us_oca/he.h.m6:heHE.OsEnIpeiroPezefsas.text
ltx/en_us_oca/me.m02.d27:meMA.Ode1C1T.incipit	…
ltx/en_us_oca/me.m02.d27:meMA.Ode1C1T.melody	@ltx/en_us_oca/he.h.m6:heHE.OsEnIpeiroPezefsas.notmetered
ltx/en_us_oca/me.m02.d27:meMA.Ode1C1T.mode	@ltx/en_us_oca/miscellanea:misc.Mode6
ltx/en_us_oca/me.m02.d27:meMA.Ode1C1T.ode	@ltx/en_us_oca/miscellanea:misc.Ode1
ltx/en_us_oca/me.m02.d27:meMA.Ode1C1T.text	
ltx/en_us_oca/me.m02.d27:meMA.Ode3C11.greekmelody	@ltx/en_us_oca/he.h.m6:heHE.OukEstinAgios.greekname
ltx/en_us_oca/me.m02.d27:meMA.Ode3C11.incipit	…
ltx/en_us_oca/me.m02.d27:meMA.Ode3C11.melody	@ltx/en_us_oca/he.h.m6:heHE.OukEstinAgios.notmetered
ltx/en_us_oca/me.m02.d27:meMA.Ode3C11.mode	@ltx/en_us_oca/miscellanea:misc.Mode6
ltx/en_us_oca/me.m02.d27:meMA.Ode3C11.ode	@ltx/en_us_oca/miscellanea:misc.Ode3
ltx/en_us_oca/me.m02.d27:meMA.Ode3C11.text	
ltx/en_us_oca/me.m02.d27:meMA.Ode3C12.incipit	…
ltx/en_us_oca/me.m02.d27:meMA.Ode3C12.melody	@ltx/en_us_oca/he.h.m6:heHE.OukEstinAgios.notmetered
ltx/en_us_oca/me.m02.d27:meMA.Ode3C12.mode	@ltx/en_us_oca/miscellanea:misc.Mode6
ltx/en_us_oca/me.m02.d27:meMA.Ode3C12.ode	@ltx/en_us_oca/miscellanea:misc.Ode3
ltx/en_us_oca/me.m02.d27:meMA.Ode3C12.text	
ltx/en_us_oca/me.m02.d27:meMA.Ode3C13.incipit	…
ltx/en_us_oca/me.m02.d27:meMA.Ode3C13.melody	@ltx/en_us_oca/he.h.m6:heHE.OukEstinAgios.notmetered
ltx/en_us_oca/me.m02.d27:meMA.Ode3C13.mode	@ltx/en_us_oca/miscellanea:misc.Mode6
ltx/en_us_oca/me.m02.d27:meMA.Ode3C13.ode	@ltx/en_us_oca/miscellanea:misc.Ode3
ltx/en_us_oca/me.m02.d27:meMA.Ode3C13.text	
ltx/en_us_oca/me.m02.d27:meMA.Ode3C1H.greekmelody	@ltx/en_us_oca/he.h.m6:heHE.OukEstinAgios.greekname
ltx/en_us_oca/me.m02.d27:meMA.Ode3C1H.incipit	@ltx/en_us_oca/he.h.m6:heHE.OukEstinAgios.incipit
ltx/en_us_oca/me.m02.d27:meMA.Ode3C1H.melody	@ltx/en_us_oca/he.h.m6:heHE.OukEstinAgios.melody
ltx/en_us_oca/me.m02.d27:meMA.Ode3C1H.mode	@ltx/en_us_oca/miscellanea:misc.Mode6
ltx/en_us_oca/me.m02.d27:meMA.Ode3C1H.ode	@ltx/en_us_oca/miscellanea:misc.Ode3
ltx/en_us_oca/me.m02.d27:meMA.Ode3C1H.text	@ltx/en_us_oca/he.h.m6:heHE.OukEstinAgios.text
ltx/en_us_oca/me.m02.d27:meMA.Ode3C1T.incipit	…
ltx/en_us_oca/me.m02.d27:meMA.Ode3C1T.melody	@ltx/en_us_oca/he.h.m6:heHE.OukEstinAgios.notmetered
ltx/en_us_oca/me.m02.d27:meMA.Ode3C1T.mode	@ltx/en_us_oca/miscellanea:misc.Mode6
ltx/en_us_oca/me.m02.d27:meMA.Ode3C1T.ode	@ltx/en_us_oca/miscellanea:misc.Ode3
ltx/en_us_oca/me.m02.d27:meMA.Ode3C1T.text	
ltx/en_us_oca/me.m02.d27:meMA.Ode3Kathisma1.greekmelody	@ltx/en_us_oca/he.a.m1:heAU.TouLithouSfragisthentos.greekname
ltx/en_us_oca/me.m02.d27:meMA.Ode3Kathisma1.incipit	…
ltx/en_us_oca/me.m02.d27:meMA.Ode3Kathisma1.melody	@ltx/en_us_oca/he.a.m1:heAU.TouLithouSfragisthentos.notmetered
ltx/en_us_oca/me.m02.d27:meMA.Ode3Kathisma1.mode	@ltx/en_us_oca/miscellanea:misc.Mode1
ltx/en_us_oca/me.m02.d27:meMA.Ode3Kathisma1.text	
ltx/en_us_oca/me.m02.d27:meMA.Ode3KathismaSt.incipit	…
ltx/en_us_oca/me.m02.d27:meMA.Ode3KathismaSt.melody	@ltx/en_us_oca/he.a.m1:heAU.TouLithouSfragisthentos.notmetered
ltx/en_us_oca/me.m02.d27:meMA.Ode3KathismaSt.mode	@ltx/en_us_oca/miscellanea:misc.Mode1
ltx/en_us_oca/me.m02.d27:meMA.Ode3KathismaSt.text	
ltx/en_us_oca/me.m02.d27:meMA.Ode3KathismaT.incipit	@ltx/en_us_oca/me.m02.d13:meMA.Ode3KathismaT.incipit
ltx/en_us_oca/me.m02.d27:meMA.Ode3KathismaT.melody	@ltx/en_us_oca/he.a.m1:heAU.TouLithouSfragisthentos.notmetered
ltx/en_us_oca/me.m02.d27:meMA.Ode3KathismaT.mode	@ltx/en_us_oca/miscellanea:misc.Mode1
ltx/en_us_oca/me.m02.d27:meMA.Ode3KathismaT.text	@ltx/en_us_oca/me.m02.d13:meMA.Ode3KathismaT.text
ltx/en_us_oca/me.m02.d27:meMA.Ode4C11.greekmelody	@ltx/en_us_oca/he.h.m6:heHE.ChristosMouDynamis.greekname
ltx/en_us_oca/me.m02.d27:meMA.Ode4C11.incipit	…
ltx/en_us_oca/me.m02.d27:meMA.Ode4C11.melody	@ltx/en_us_oca/he.h.m6:heHE.ChristosMouDynamis.notmetered
ltx/en_us_oca/me.m02.d27:meMA.Ode4C11.mode	@ltx/en_us_oca/miscellanea:misc.Mode6
ltx/en_us_oca/me.m02.d27:meMA.Ode4C11.ode	@ltx/en_us_oca/miscellanea:misc.Ode4
ltx/en_us_oca/me.m02.d27:meMA.Ode4C11.text	
ltx/en_us_oca/me.m02.d27:meMA.Ode4C12.incipit	…
ltx/en_us_oca/me.m02.d27:meMA.Ode4C12.melody	@ltx/en_us_oca/he.h.m6:heHE.ChristosMouDynamis.notmetered
ltx/en_us_oca/me.m02.d27:meMA.Ode4C12.mode	@ltx/en_us_oca/miscellanea:misc.Mode6
ltx/en_us_oca/me.m02.d27:meMA.Ode4C12.ode	@ltx/en_us_oca/miscellanea:misc.Ode4
ltx/en_us_oca/me.m02.d27:meMA.Ode4C12.text	
ltx/en_us_oca/me.m02.d27:meMA.Ode4C13.incipit	…
ltx/en_us_oca/me.m02.d27:meMA.Ode4C13.melody	@ltx/en_us_oca/he.h.m6:heHE.ChristosMouDynamis.notmetered
ltx/en_us_oca/me.m02.d27:meMA.Ode4C13.mode	@ltx/en_us_oca/miscellanea:misc.Mode6
ltx/en_us_oca/me.m02.d27:meMA.Ode4C13.ode	@ltx/en_us_oca/miscellanea:misc.Ode4
ltx/en_us_oca/me.m02.d27:meMA.Ode4C13.text	
ltx/en_us_oca/me.m02.d27:meMA.Ode4C1H.greekmelody	@ltx/en_us_oca/he.h.m6:heHE.ChristosMouDynamis.greekname
ltx/en_us_oca/me.m02.d27:meMA.Ode4C1H.incipit	@ltx/en_us_oca/he.h.m6:heHE.ChristosMouDynamis.incipit
ltx/en_us_oca/me.m02.d27:meMA.Ode4C1H.melody	@ltx/en_us_oca/he.h.m6:heHE.ChristosMouDynamis.melody
ltx/en_us_oca/me.m02.d27:meMA.Ode4C1H.mode	@ltx/en_us_oca/miscellanea:misc.Mode6
ltx/en_us_oca/me.m02.d27:meMA.Ode4C1H.ode	@ltx/en_us_oca/miscellanea:misc.Ode4
ltx/en_us_oca/me.m02.d27:meMA.Ode4C1H.text	@ltx/en_us_oca/he.h.m6:heHE.ChristosMouDynamis.text
ltx/en_us_oca/me.m02.d27:meMA.Ode4C1T.incipit	…
ltx/en_us_oca/me.m02.d27:meMA.Ode4C1T.melody	@ltx/en_us_oca/he.h.m6:heHE.ChristosMouDynamis.notmetered
ltx/en_us_oca/me.m02.d27:meMA.Ode4C1T.mode	@ltx/en_us_oca/miscellanea:misc.Mode6
ltx/en_us_oca/me.m02.d27:meMA.Ode4C1T.ode	@ltx/en_us_oca/miscellanea:misc.Ode4
ltx/en_us_oca/me.m02.d27:meMA.Ode4C1T.text	
ltx/en_us_oca/me.m02.d27:meMA.Ode5C11.greekmelody	@ltx/en_us_oca/he.h.m6:heHE.ToTheioFengeiSou.greekname
ltx/en_us_oca/me.m02.d27:meMA.Ode5C11.incipit	…
ltx/en_us_oca/me.m02.d27:meMA.Ode5C11.melody	@ltx/en_us_oca/he.h.m6:heHE.ToTheioFengeiSou.notmetered
ltx/en_us_oca/me.m02.d27:meMA.Ode5C11.mode	@ltx/en_us_oca/miscellanea:misc.Mode6
ltx/en_us_oca/me.m02.d27:meMA.Ode5C11.ode	@ltx/en_us_oca/miscellanea:misc.Ode5
ltx/en_us_oca/me.m02.d27:meMA.Ode5C11.text	
ltx/en_us_oca/me.m02.d27:meMA.Ode5C12.incipit	…
ltx/en_us_oca/me.m02.d27:meMA.Ode5C12.melody	@ltx/en_us_oca/he.h.m6:heHE.ToTheioFengeiSou.notmetered
ltx/en_us_oca/me.m02.d27:meMA.Ode5C12.mode	@ltx/en_us_oca/miscellanea:misc.Mode6
ltx/en_us_oca/me.m02.d27:meMA.Ode5C12.ode	@ltx/en_us_oca/miscellanea:misc.Ode5
ltx/en_us_oca/me.m02.d27:meMA.Ode5C12.text	
ltx/en_us_oca/me.m02.d27:meMA.Ode5C13.incipit	…
ltx/en_us_oca/me.m02.d27:meMA.Ode5C13.melody	@ltx/en_us_oca/he.h.m6:heHE.ToTheioFengeiSou.notmetered
ltx/en_us_oca/me.m02.d27:meMA.Ode5C13.mode	@ltx/en_us_oca/miscellanea:misc.Mode6
ltx/en_us_oca/me.m02.d27:meMA.Ode5C13.ode	@ltx/en_us_oca/miscellanea:misc.Ode5
ltx/en_us_oca/me.m02.d27:meMA.Ode5C13.text	
ltx/en_us_oca/me.m02.d27:meMA.Ode5C1H.greekmelody	@ltx/en_us_oca/he.h.m6:heHE.ToTheioFengeiSou.greekname
ltx/en_us_oca/me.m02.d27:meMA.Ode5C1H.incipit	@ltx/en_us_oca/he.h.m6:heHE.ToTheioFengeiSou.incipit
ltx/en_us_oca/me.m02.d27:meMA.Ode5C1H.melody	@ltx/en_us_oca/he.h.m6:heHE.ToTheioFengeiSou.melody
ltx/en_us_oca/me.m02.d27:meMA.Ode5C1H.mode	@ltx/en_us_oca/miscellanea:misc.Mode6
ltx/en_us_oca/me.m02.d27:meMA.Ode5C1H.ode	@ltx/en_us_oca/miscellanea:misc.Ode5
ltx/en_us_oca/me.m02.d27:meMA.Ode5C1H.text	@ltx/en_us_oca/he.h.m6:heHE.ToTheioFengeiSou.text
ltx/en_us_oca/me.m02.d27:meMA.Ode5C1T.incipit	…
ltx/en_us_oca/me.m02.d27:meMA.Ode5C1T.melody	@ltx/en_us_oca/he.h.m6:heHE.ToTheioFengeiSou.notmetered
ltx/en_us_oca/me.m02.d27:meMA.Ode5C1T.mode	@ltx/en_us_oca/miscellanea:misc.Mode6
ltx/en_us_oca/me.m02.d27:meMA.Ode5C1T.ode	@ltx/en_us_oca/miscellanea:misc.Ode5
ltx/en_us_oca/me.m02.d27:meMA.Ode5C1T.text	
ltx/en_us_oca/me.m02.d27:meMA.Ode6C11.greekmelody	@ltx/en_us_oca/he.h.m6:heHE.TouViouTinThalassan.greekname
ltx/en_us_oca/me.m02.d27:meMA.Ode6C11.incipit	…
ltx/en_us_oca/me.m02.d27:meMA.Ode6C11.melody	@ltx/en_us_oca/he.h.m6:heHE.TouViouTinThalassan.notmetered
ltx/en_us_oca/me.m02.d27:meMA.Ode6C11.mode	@ltx/en_us_oca/miscellanea:misc.Mode6
ltx/en_us_oca/me.m02.d27:meMA.Ode6C11.ode	@ltx/en_us_oca/miscellanea:misc.Ode6
ltx/en_us_oca/me.m02.d27:meMA.Ode6C11.text	
ltx/en_us_oca/me.m02.d27:meMA.Ode6C12.incipit	…
ltx/en_us_oca/me.m02.d27:meMA.Ode6C12.melody	@ltx/en_us_oca/he.h.m6:heHE.TouViouTinThalassan.notmetered
ltx/en_us_oca/me.m02.d27:meMA.Ode6C12.mode	@ltx/en_us_oca/miscellanea:misc.Mode6
ltx/en_us_oca/me.m02.d27:meMA.Ode6C12.ode	@ltx/en_us_oca/miscellanea:misc.Ode6
ltx/en_us_oca/me.m02.d27:meMA.Ode6C12.text	
ltx/en_us_oca/me.m02.d27:meMA.Ode6C13.incipit	…
ltx/en_us_oca/me.m02.d27:meMA.Ode6C13.melody	@ltx/en_us_oca/he.h.m6:heHE.TouViouTinThalassan.notmetered
ltx/en_us_oca/me.m02.d27:meMA.Ode6C13.mode	@ltx/en_us_oca/miscellanea:misc.Mode6
ltx/en_us_oca/me.m02.d27:meMA.Ode6C13.ode	@ltx/en_us_oca/miscellanea:misc.Ode6
ltx/en_us_oca/me.m02.d27:meMA.Ode6C13.text	
ltx/en_us_oca/me.m02.d27:meMA.Ode6C1H.greekmelody	@ltx/en_us_oca/he.h.m6:heHE.TouViouTinThalassan.greekname
ltx/en_us_oca/me.m02.d27:meMA.Ode6C1H.incipit	@ltx/en_us_oca/he.h.m6:heHE.TouViouTinThalassan.incipit
ltx/en_us_oca/me.m02.d27:meMA.Ode6C1H.melody	@ltx/en_us_oca/he.h.m6:heHE.TouViouTinThalassan.melody
ltx/en_us_oca/me.m02.d27:meMA.Ode6C1H.mode	@ltx/en_us_oca/miscellanea:misc.Mode6
ltx/en_us_oca/me.m02.d27:meMA.Ode6C1H.ode	@ltx/en_us_oca/miscellanea:misc.Ode6
ltx/en_us_oca/me.m02.d27:meMA.Ode6C1H.text	@ltx/en_us_oca/he.h.m6:heHE.TouViouTinThalassan.text
ltx/en_us_oca/me.m02.d27:meMA.Ode6C1T.incipit	…
ltx/en_us_oca/me.m02.d27:meMA.Ode6C1T.melody	@ltx/en_us_oca/he.h.m6:heHE.TouViouTinThalassan.notmetered
ltx/en_us_oca/me.m02.d27:meMA.Ode6C1T.mode	@ltx/en_us_oca/miscellanea:misc.Mode6
ltx/en_us_oca/me.m02.d27:meMA.Ode6C1T.ode	@ltx/en_us_oca/miscellanea:misc.Ode6
ltx/en_us_oca/me.m02.d27:meMA.Ode6C1T.text	
ltx/en_us_oca/me.m02.d27:meMA.Ode7C11.greekmelody	@ltx/en_us_oca/he.h.m6:heHE.DrosovolonMenTinKaminon.greekname
ltx/en_us_oca/me.m02.d27:meMA.Ode7C11.incipit	…
ltx/en_us_oca/me.m02.d27:meMA.Ode7C11.melody	@ltx/en_us_oca/he.h.m6:heHE.DrosovolonMenTinKaminon.notmetered
ltx/en_us_oca/me.m02.d27:meMA.Ode7C11.mode	@ltx/en_us_oca/miscellanea:misc.Mode6
ltx/en_us_oca/me.m02.d27:meMA.Ode7C11.ode	@ltx/en_us_oca/miscellanea:misc.Ode7
ltx/en_us_oca/me.m02.d27:meMA.Ode7C11.text	
ltx/en_us_oca/me.m02.d27:meMA.Ode7C12.incipit	…
ltx/en_us_oca/me.m02.d27:meMA.Ode7C12.melody	@ltx/en_us_oca/he.h.m6:heHE.DrosovolonMenTinKaminon.notmetered
ltx/en_us_oca/me.m02.d27:meMA.Ode7C12.mode	@ltx/en_us_oca/miscellanea:misc.Mode6
ltx/en_us_oca/me.m02.d27:meMA.Ode7C12.ode	@ltx/en_us_oca/miscellanea:misc.Ode7
ltx/en_us_oca/me.m02.d27:meMA.Ode7C12.text	
ltx/en_us_oca/me.m02.d27:meMA.Ode7C13.incipit	…
ltx/en_us_oca/me.m02.d27:meMA.Ode7C13.melody	@ltx/en_us_oca/he.h.m6:heHE.DrosovolonMenTinKaminon.notmetered
ltx/en_us_oca/me.m02.d27:meMA.Ode7C13.mode	@ltx/en_us_oca/miscellanea:misc.Mode6
ltx/en_us_oca/me.m02.d27:meMA.Ode7C13.ode	@ltx/en_us_oca/miscellanea:misc.Ode7
ltx/en_us_oca/me.m02.d27:meMA.Ode7C13.text	
ltx/en_us_oca/me.m02.d27:meMA.Ode7C1H.greekmelody	@ltx/en_us_oca/he.h.m6:heHE.DrosovolonMenTinKaminon.greekname
ltx/en_us_oca/me.m02.d27:meMA.Ode7C1H.incipit	@ltx/en_us_oca/he.h.m6:heHE.DrosovolonMenTinKaminon.incipit
ltx/en_us_oca/me.m02.d27:meMA.Ode7C1H.melody	@ltx/en_us_oca/he.h.m6:heHE.DrosovolonMenTinKaminon.melody
ltx/en_us_oca/me.m02.d27:meMA.Ode7C1H.mode	@ltx/en_us_oca/miscellanea:misc.Mode6
ltx/en_us_oca/me.m02.d27:meMA.Ode7C1H.ode	@ltx/en_us_oca/miscellanea:misc.Ode7
ltx/en_us_oca/me.m02.d27:meMA.Ode7C1H.text	@ltx/en_us_oca/he.h.m6:heHE.DrosovolonMenTinKaminon.text
ltx/en_us_oca/me.m02.d27:meMA.Ode7C1T.incipit	…
ltx/en_us_oca/me.m02.d27:meMA.Ode7C1T.melody	@ltx/en_us_oca/he.h.m6:heHE.DrosovolonMenTinKaminon.notmetered
ltx/en_us_oca/me.m02.d27:meMA.Ode7C1T.mode	@ltx/en_us_oca/miscellanea:misc.Mode6
ltx/en_us_oca/me.m02.d27:meMA.Ode7C1T.ode	@ltx/en_us_oca/miscellanea:misc.Ode7
ltx/en_us_oca/me.m02.d27:meMA.Ode7C1T.text	
ltx/en_us_oca/me.m02.d27:meMA.Ode8C11.greekmelody	@ltx/en_us_oca/he.h.m6:heHE.EkFlogosToisOsiois.greekname
ltx/en_us_oca/me.m02.d27:meMA.Ode8C11.incipit	…
ltx/en_us_oca/me.m02.d27:meMA.Ode8C11.melody	@ltx/en_us_oca/he.h.m6:heHE.EkFlogosToisOsiois.notmetered
ltx/en_us_oca/me.m02.d27:meMA.Ode8C11.mode	@ltx/en_us_oca/miscellanea:misc.Mode6
ltx/en_us_oca/me.m02.d27:meMA.Ode8C11.ode	@ltx/en_us_oca/miscellanea:misc.Ode8
ltx/en_us_oca/me.m02.d27:meMA.Ode8C11.text	
ltx/en_us_oca/me.m02.d27:meMA.Ode8C12.incipit	…
ltx/en_us_oca/me.m02.d27:meMA.Ode8C12.melody	@ltx/en_us_oca/he.h.m6:heHE.EkFlogosToisOsiois.notmetered
ltx/en_us_oca/me.m02.d27:meMA.Ode8C12.mode	@ltx/en_us_oca/miscellanea:misc.Mode6
ltx/en_us_oca/me.m02.d27:meMA.Ode8C12.ode	@ltx/en_us_oca/miscellanea:misc.Ode8
ltx/en_us_oca/me.m02.d27:meMA.Ode8C12.text	
ltx/en_us_oca/me.m02.d27:meMA.Ode8C13.incipit	…
ltx/en_us_oca/me.m02.d27:meMA.Ode8C13.melody	@ltx/en_us_oca/he.h.m6:heHE.EkFlogosToisOsiois.notmetered
ltx/en_us_oca/me.m02.d27:meMA.Ode8C13.mode	@ltx/en_us_oca/miscellanea:misc.Mode6
ltx/en_us_oca/me.m02.d27:meMA.Ode8C13.ode	@ltx/en_us_oca/miscellanea:misc.Ode8
ltx/en_us_oca/me.m02.d27:meMA.Ode8C13.text	
ltx/en_us_oca/me.m02.d27:meMA.Ode8C1H.greekmelody	@ltx/en_us_oca/he.h.m6:heHE.EkFlogosToisOsiois.greekname
ltx/en_us_oca/me.m02.d27:meMA.Ode8C1H.incipit	@ltx/en_us_oca/he.h.m6:heHE.EkFlogosToisOsiois.incipit
ltx/en_us_oca/me.m02.d27:meMA.Ode8C1H.melody	@ltx/en_us_oca/he.h.m6:heHE.EkFlogosToisOsiois.melody
ltx/en_us_oca/me.m02.d27:meMA.Ode8C1H.mode	@ltx/en_us_oca/miscellanea:misc.Mode6
ltx/en_us_oca/me.m02.d27:meMA.Ode8C1H.ode	@ltx/en_us_oca/miscellanea:misc.Ode8
ltx/en_us_oca/me.m02.d27:meMA.Ode8C1H.text	@ltx/en_us_oca/he.h.m6:heHE.EkFlogosToisOsiois.text
ltx/en_us_oca/me.m02.d27:meMA.Ode8C1T.incipit	…
ltx/en_us_oca/me.m02.d27:meMA.Ode8C1T.melody	@ltx/en_us_oca/he.h.m6:heHE.EkFlogosToisOsiois.notmetered
ltx/en_us_oca/me.m02.d27:meMA.Ode8C1T.mode	@ltx/en_us_oca/miscellanea:misc.Mode6
ltx/en_us_oca/me.m02.d27:meMA.Ode8C1T.ode	@ltx/en_us_oca/miscellanea:misc.Ode8
ltx/en_us_oca/me.m02.d27:meMA.Ode8C1T.text	
ltx/en_us_oca/me.m02.d27:meMA.Ode9C11.greekmelody	@ltx/en_us_oca/he.h.m6:heHE.TheonAnthropois.greekname
ltx/en_us_oca/me.m02.d27:meMA.Ode9C11.incipit	…
ltx/en_us_oca/me.m02.d27:meMA.Ode9C11.melody	@ltx/en_us_oca/he.h.m6:heHE.TheonAnthropois.notmetered
ltx/en_us_oca/me.m02.d27:meMA.Ode9C11.mode	@ltx/en_us_oca/miscellanea:misc.Mode6
ltx/en_us_oca/me.m02.d27:meMA.Ode9C11.ode	@ltx/en_us_oca/miscellanea:misc.Ode9
ltx/en_us_oca/me.m02.d27:meMA.Ode9C11.text	
ltx/en_us_oca/me.m02.d27:meMA.Ode9C12.incipit	…
ltx/en_us_oca/me.m02.d27:meMA.Ode9C12.melody	@ltx/en_us_oca/he.h.m6:heHE.TheonAnthropois.notmetered
ltx/en_us_oca/me.m02.d27:meMA.Ode9C12.mode	@ltx/en_us_oca/miscellanea:misc.Mode6
ltx/en_us_oca/me.m02.d27:meMA.Ode9C12.ode	@ltx/en_us_oca/miscellanea:misc.Ode9
ltx/en_us_oca/me.m02.d27:meMA.Ode9C12.text	
ltx/en_us_oca/me.m02.d27:meMA.Ode9C13.incipit	…
ltx/en_us_oca/me.m02.d27:meMA.Ode9C13.melody	@ltx/en_us_oca/he.h.m6:heHE.TheonAnthropois.notmetered
ltx/en_us_oca/me.m02.d27:meMA.Ode9C13.mode	@ltx/en_us_oca/miscellanea:misc.Mode6
ltx/en_us_oca/me.m02.d27:meMA.Ode9C13.ode	@ltx/en_us_oca/miscellanea:misc.Ode9
ltx/en_us_oca/me.m02.d27:meMA.Ode9C13.text	
ltx/en_us_oca/me.m02.d27:meMA.Ode9C1H.greekmelody	@ltx/en_us_oca/he.h.m6:heHE.TheonAnthropois.greekname
ltx/en_us_oca/me.m02.d27:meMA.Ode9C1H.incipit	@ltx/en_us_oca/he.h.m6:heHE.TheonAnthropois.incipit
ltx/en_us_oca/me.m02.d27:meMA.Ode9C1H.melody	@ltx/en_us_oca/he.h.m6:heHE.TheonAnthropois.melody
ltx/en_us_oca/me.m02.d27:meMA.Ode9C1H.mode	@ltx/en_us_oca/miscellanea:misc.Mode6
ltx/en_us_oca/me.m02.d27:meMA.Ode9C1H.ode	@ltx/en_us_oca/miscellanea:misc.Ode9
ltx/en_us_oca/me.m02.d27:meMA.Ode9C1H.text	@ltx/en_us_oca/he.h.m6:heHE.TheonAnthropois.text
ltx/en_us_oca/me.m02.d27:meMA.Ode9C1T.incipit	…
ltx/en_us_oca/me.m02.d27:meMA.Ode9C1T.melody	@ltx/en_us_oca/he.h.m6:heHE.TheonAnthropois.notmetered
ltx/en_us_oca/me.m02.d27:meMA.Ode9C1T.mode	@ltx/en_us_oca/miscellanea:misc.Mode6
ltx/en_us_oca/me.m02.d27:meMA.Ode9C1T.ode	@ltx/en_us_oca/miscellanea:misc.Ode9
ltx/en_us_oca/me.m02.d27:meMA.Ode9C1T.text	
ltx/en_us_oca/me.m02.d27:meVE.Apolytikion1ger.greekmelody	@ltx/en_us_oca/he.a.m1:heAU.TisErimouPolitis.greekname
ltx/en_us_oca/me.m02.d27:meVE.Apolytikion1ger.incipit	…
ltx/en_us_oca/me.m02.d27:meVE.Apolytikion1ger.melody	@ltx/en_us_oca/he.a.m1:heAU.TisErimouPolitis.notmetered
ltx/en_us_oca/me.m02.d27:meVE.Apolytikion1ger.mode	@ltx/en_us_oca/miscellanea:misc.Mode1
ltx/en_us_oca/me.m02.d27:meVE.Apolytikion1ger.poet	@ltx/en_us_oca/poets:po.Gerasimou
ltx/en_us_oca/me.m02.d27:meVE.Apolytikion1ger.text	
ltx/en_us_oca/me.m02.d27:meVE.SticStavrotheotokion.greekmelody	@ltx/en_us_oca/he.a.m4:heAU.OsGennaionEnMartysi.greekname
ltx/en_us_oca/me.m02.d27:meVE.SticStavrotheotokion.incipit	Lord, when your Mother saw…
ltx/en_us_oca/me.m02.d27:meVE.SticStavrotheotokion.melody	@ltx/en_us_oca/he.a.m4:heAU.OsGennaionEnMartysi.notmetered
ltx/en_us_oca/me.m02.d27:meVE.SticStavrotheotokion.mode	@ltx/en_us_oca/miscellanea:misc.Mode4
ltx/en_us_oca/me.m02.d27:meVE.SticStavrotheotokion.text	Lord, when your Mother saw you crucified, ⁄ she was filled with awe and cried: ⁄ What is this I see, my Son? ⁄ The faithless and lawless people condemn you ⁄⁄ even though they have been gladdened by your many wonders
ltx/en_us_oca/me.m02.d27:meVE.SticTheotokion.greekmelody	@ltx/en_us_oca/he.a.m4:heAU.OsGennaionEnMartysi.greekname
ltx/en_us_oca/me.m02.d27:meVE.SticTheotokion.incipit	@ltx/en_us_oca/oc.m4.d5:ocVE.SticTheotokion.incipit
ltx/en_us_oca/me.m02.d27:meVE.SticTheotokion.melody	@ltx/en_us_oca/he.a.m4:heAU.OsGennaionEnMartysi.notmetered
ltx/en_us_oca/me.m02.d27:meVE.SticTheotokion.mode	@ltx/en_us_oca/miscellanea:misc.Mode4
ltx/en_us_oca/me.m02.d27:meVE.SticTheotokion.text	@ltx/en_us_oca/oc.m4.d5:ocVE.SticTheotokion.text
ltx/en_us_oca/me.m02.d27:meVE.Stichera01.greekmelody	@ltx/en_us_oca/he.a.m4:heAU.OsGennaionEnMartysi.greekname
ltx/en_us_oca/me.m02.d27:meVE.Stichera01.incipit	Most richly blessed one, ⁄…
ltx/en_us_oca/me.m02.d27:meVE.Stichera01.melody	@ltx/en_us_oca/he.a.m4:heAU.OsGennaionEnMartysi.notmetered
ltx/en_us_oca/me.m02.d27:meVE.Stichera01.mode	@ltx/en_us_oca/miscellanea:misc.Mode4
ltx/en_us_oca/me.m02.d27:meVE.Stichera01.text	Most richly blessed one, ⁄ with pious thought, purity and holiness of mind, ⁄ by restraining the passions and observing the commands of Christ, ⁄ you strove to preserve the dignity of the image ⁄ that was fashioned in the beginning ⁄⁄ according to the image and likeness of God!
ltx/en_us_oca/me.m02.d27:meVE.Stichera02.incipit	You undertook ascetic endeavor, ⁄…
ltx/en_us_oca/me.m02.d27:meVE.Stichera02.melody	@ltx/en_us_oca/he.a.m4:heAU.OsGennaionEnMartysi.notmetered
ltx/en_us_oca/me.m02.d27:meVE.Stichera02.mode	@ltx/en_us_oca/miscellanea:misc.Mode4
ltx/en_us_oca/me.m02.d27:meVE.Stichera02.text	You undertook ascetic endeavor, ⁄ followed by suffering in a godly manner. ⁄ In both you were well-pleasing to the Creator ⁄ Who alone requires of us purity and nobility of soul. ⁄ Glorifying His incarnation, ⁄⁄ you venerated the holy image of His divine Humanity!
ltx/en_us_oca/me.m02.d27:meVE.Stichera03.incipit	You denounced, venerable one, ⁄…
ltx/en_us_oca/me.m02.d27:meVE.Stichera03.melody	@ltx/en_us_oca/he.a.m4:heAU.OsGennaionEnMartysi.notmetered
ltx/en_us_oca/me.m02.d27:meVE.Stichera03.mode	@ltx/en_us_oca/miscellanea:misc.Mode4
ltx/en_us_oca/me.m02.d27:meVE.Stichera03.text	You denounced, venerable one, ⁄ those who wickedly rejected the incarnation of the Word! ⁄ You perfected the truth, upholding it by enduring wounds ⁄ and all kinds of affliction in your bonds and imprisonment. ⁄ Therefore you became an heir to the kingdom of Christ: ⁄⁄ To ineffable joy and everlasting radiance!
