ltx/en_us_oca/he.a.m1:heAU.ChorosAngelikos.greekname	
ltx/en_us_oca/he.a.m1:heAU.ChorosAngelikos.incipit	…
ltx/en_us_oca/he.a.m1:heAU.ChorosAngelikos.melody	@ltx/en_us_oca/miscellanea:misc.AutomelonNotMetered
ltx/en_us_oca/he.a.m1:heAU.ChorosAngelikos.mode	@ltx/en_us_oca/miscellanea:misc.Mode1
ltx/en_us_oca/he.a.m1:heAU.ChorosAngelikos.name	N/M (In heaven.)
ltx/en_us_oca/he.a.m1:heAU.ChorosAngelikos.notmetered	N/M (In heaven.)
ltx/en_us_oca/he.a.m1:heAU.ChorosAngelikos.text	
ltx/en_us_oca/he.a.m1:heAU.NefelinSeFotos.greekname	
ltx/en_us_oca/he.a.m1:heAU.NefelinSeFotos.incipit	…
ltx/en_us_oca/he.a.m1:heAU.NefelinSeFotos.melody	@ltx/en_us_oca/miscellanea:misc.AutomelonNotMetered
ltx/en_us_oca/he.a.m1:heAU.NefelinSeFotos.mode	@ltx/en_us_oca/miscellanea:misc.Mode1
ltx/en_us_oca/he.a.m1:heAU.NefelinSeFotos.name	
ltx/en_us_oca/he.a.m1:heAU.NefelinSeFotos.notmetered	N/M (Nefelin Se Fotos)
ltx/en_us_oca/he.a.m1:heAU.NefelinSeFotos.text	
ltx/en_us_oca/he.a.m1:heAU.OTouParadoxouThavmatos.greekname	
ltx/en_us_oca/he.a.m1:heAU.OTouParadoxouThavmatos.incipit	…
ltx/en_us_oca/he.a.m1:heAU.OTouParadoxouThavmatos.melody	@ltx/en_us_oca/miscellanea:misc.AutomelonNotMetered
ltx/en_us_oca/he.a.m1:heAU.OTouParadoxouThavmatos.mode	@ltx/en_us_oca/miscellanea:misc.Mode1
ltx/en_us_oca/he.a.m1:heAU.OTouParadoxouThavmatos.name	N/M (What a paradoxical.)
ltx/en_us_oca/he.a.m1:heAU.OTouParadoxouThavmatos.notmetered	N/M (What a paradoxical.)
ltx/en_us_oca/he.a.m1:heAU.OTouParadoxouThavmatos.text	
ltx/en_us_oca/he.a.m1:heAU.OtanElthisOTheos.greekname	
ltx/en_us_oca/he.a.m1:heAU.OtanElthisOTheos.incipit	…
ltx/en_us_oca/he.a.m1:heAU.OtanElthisOTheos.melody	@ltx/en_us_oca/miscellanea:misc.AutomelonNotMetered
ltx/en_us_oca/he.a.m1:heAU.OtanElthisOTheos.mode	@ltx/en_us_oca/miscellanea:misc.Mode1
ltx/en_us_oca/he.a.m1:heAU.OtanElthisOTheos.name	N/M (When You come down.)
ltx/en_us_oca/he.a.m1:heAU.OtanElthisOTheos.notmetered	N/M (When You come down.)
ltx/en_us_oca/he.a.m1:heAU.OtanElthisOTheos.text	
ltx/en_us_oca/he.a.m1:heAU.PaneffimoiMartyres.greekname	
ltx/en_us_oca/he.a.m1:heAU.PaneffimoiMartyres.incipit	All-praised Martyrs…
ltx/en_us_oca/he.a.m1:heAU.PaneffimoiMartyres.melody	@ltx/en_us_oca/miscellanea:misc.AutomelonNotMetered
ltx/en_us_oca/he.a.m1:heAU.PaneffimoiMartyres.mode	@ltx/en_us_oca/miscellanea:misc.Mode1
ltx/en_us_oca/he.a.m1:heAU.PaneffimoiMartyres.name	All-praised Martyrs.
ltx/en_us_oca/he.a.m1:heAU.PaneffimoiMartyres.notmetered	N/M (O Martyrs, extolled.)
ltx/en_us_oca/he.a.m1:heAU.PaneffimoiMartyres.text	
ltx/en_us_oca/he.a.m1:heAU.TisErimouPolitis.greekname	
ltx/en_us_oca/he.a.m1:heAU.TisErimouPolitis.incipit	…
ltx/en_us_oca/he.a.m1:heAU.TisErimouPolitis.melody	@ltx/en_us_oca/miscellanea:misc.AutomelonNotMetered
ltx/en_us_oca/he.a.m1:heAU.TisErimouPolitis.mode	@ltx/en_us_oca/miscellanea:misc.Mode1
ltx/en_us_oca/he.a.m1:heAU.TisErimouPolitis.name	N/M (As a citizen.)
ltx/en_us_oca/he.a.m1:heAU.TisErimouPolitis.notmetered	N/M (As a citizen.)
ltx/en_us_oca/he.a.m1:heAU.TisErimouPolitis.text	
ltx/en_us_oca/he.a.m1:heAU.TonOuranionTagmaton.greekname	
ltx/en_us_oca/he.a.m1:heAU.TonOuranionTagmaton.incipit	…
ltx/en_us_oca/he.a.m1:heAU.TonOuranionTagmaton.melody	@ltx/en_us_oca/miscellanea:misc.AutomelonNotMetered
ltx/en_us_oca/he.a.m1:heAU.TonOuranionTagmaton.mode	@ltx/en_us_oca/miscellanea:misc.Mode1
ltx/en_us_oca/he.a.m1:heAU.TonOuranionTagmaton.name	N/M (For all the powers.)
ltx/en_us_oca/he.a.m1:heAU.TonOuranionTagmaton.notmetered	N/M (For all the powers.)
ltx/en_us_oca/he.a.m1:heAU.TonOuranionTagmaton.text	Pure virgin Theotokos, delight of the heavenly hosts ⁄ and precious champion of those on earth, ⁄ save us who take refuge in you, ⁄⁄ for after God, we have placed our hope in you.
ltx/en_us_oca/he.a.m1:heAU.TonTafonSouSotir.greekname	
ltx/en_us_oca/he.a.m1:heAU.TonTafonSouSotir.incipit	…
ltx/en_us_oca/he.a.m1:heAU.TonTafonSouSotir.melody	@ltx/en_us_oca/miscellanea:misc.AutomelonNotMetered
ltx/en_us_oca/he.a.m1:heAU.TonTafonSouSotir.mode	@ltx/en_us_oca/miscellanea:misc.Mode1
ltx/en_us_oca/he.a.m1:heAU.TonTafonSouSotir.name	N/M (The soldiers.)
ltx/en_us_oca/he.a.m1:heAU.TonTafonSouSotir.notmetered	N/M (The soldiers.)
ltx/en_us_oca/he.a.m1:heAU.TonTafonSouSotir.text	
ltx/en_us_oca/he.a.m1:heAU.TouLithouSfragisthentos.greekname	
ltx/en_us_oca/he.a.m1:heAU.TouLithouSfragisthentos.incipit	…
ltx/en_us_oca/he.a.m1:heAU.TouLithouSfragisthentos.melody	@ltx/en_us_oca/miscellanea:misc.AutomelonNotMetered
ltx/en_us_oca/he.a.m1:heAU.TouLithouSfragisthentos.mode	@ltx/en_us_oca/miscellanea:misc.Mode1
ltx/en_us_oca/he.a.m1:heAU.TouLithouSfragisthentos.name	N/M (The stone.)
ltx/en_us_oca/he.a.m1:heAU.TouLithouSfragisthentos.notmetered	N/M (The stone.)
ltx/en_us_oca/he.a.m1:heAU.TouLithouSfragisthentos.text	
ltx/en_us_oca/he.a.m1:heAU.title	
