ltx/en_us_oca/me.m09.d27:meDA.commemoration.first	
ltx/en_us_oca/me.m09.d27:meDA.commemoration.first_name	
ltx/en_us_oca/me.m09.d27:meDA.commemoration.first_short	
ltx/en_us_oca/me.m09.d27:meDA.commemoration.first_title	
ltx/en_us_oca/me.m09.d27:meDA.commemoration.full	
ltx/en_us_oca/me.m09.d27:meDA.commemoration.second_name	
ltx/en_us_oca/me.m09.d27:meDA.commemoration.second_title	
ltx/en_us_oca/me.m09.d27:meDA.date	
ltx/en_us_oca/me.m09.d27:meDA.fordate	
ltx/en_us_oca/me.m09.d27:meDA.insert1	
ltx/en_us_oca/me.m09.d27:meDA.insert2	
ltx/en_us_oca/me.m09.d27:meDA.note	
ltx/en_us_oca/me.m09.d27:meDA.pdfcoverdate	
ltx/en_us_oca/me.m09.d27:meDA.pdfheaderdate	
ltx/en_us_oca/me.m09.d27:meHO.commemorations	
ltx/en_us_oca/me.m09.d27:meHO.note1	
ltx/en_us_oca/me.m09.d27:meHO.note2	
ltx/en_us_oca/me.m09.d27:meHO.number	
ltx/en_us_oca/me.m09.d27:meHO.rank	
ltx/en_us_oca/me.m09.d27:meLE.commemoration1	
ltx/en_us_oca/me.m09.d27:meLE.commemoration2	
ltx/en_us_oca/me.m09.d27:meLI.Kontakion1.greekmelody	@ltx/en_us_oca/me.m09.d27:meMA.Kontakion1.greekmelody
ltx/en_us_oca/me.m09.d27:meLI.Kontakion1.incipit	@ltx/en_us_oca/me.m09.d27:meMA.Kontakion1.incipit
ltx/en_us_oca/me.m09.d27:meLI.Kontakion1.melody	@ltx/en_us_oca/me.m09.d27:meMA.Kontakion1.melody
ltx/en_us_oca/me.m09.d27:meLI.Kontakion1.mode	@ltx/en_us_oca/me.m09.d27:meMA.Kontakion1.mode
ltx/en_us_oca/me.m09.d27:meLI.Kontakion1.text	@ltx/en_us_oca/me.m09.d27:meMA.Kontakion1.text
ltx/en_us_oca/me.m09.d27:meLI.Megalynarion.text	
ltx/en_us_oca/me.m09.d27:meMA.C1.acrostic.notice1	
ltx/en_us_oca/me.m09.d27:meMA.C1.acrostic.text	
ltx/en_us_oca/me.m09.d27:meMA.C1.acrostic.title	
ltx/en_us_oca/me.m09.d27:meMA.C1.title	@ltx/en_us_oca/titles:ti.CanonSaints
ltx/en_us_oca/me.m09.d27:meMA.C1.verse	@ltx/en_us_oca/prayers:pr.verse_SaintsM.text
ltx/en_us_oca/me.m09.d27:meMA.ExapTheotokion.incipit	…
ltx/en_us_oca/me.m09.d27:meMA.ExapTheotokion.melody	@ltx/en_us_oca/he.a.m2:heAU.ToisMathitaisSynelthomen.notmetered
ltx/en_us_oca/me.m09.d27:meMA.ExapTheotokion.mode	@ltx/en_us_oca/miscellanea:misc.Mode2
ltx/en_us_oca/me.m09.d27:meMA.ExapTheotokion.text	
ltx/en_us_oca/me.m09.d27:meMA.Exaposteilarion1.greekmelody	@ltx/en_us_oca/he.a.m2:heAU.ToisMathitaisSynelthomen.greekname
ltx/en_us_oca/me.m09.d27:meMA.Exaposteilarion1.incipit	…
ltx/en_us_oca/me.m09.d27:meMA.Exaposteilarion1.melody	@ltx/en_us_oca/he.a.m2:heAU.ToisMathitaisSynelthomen.notmetered
ltx/en_us_oca/me.m09.d27:meMA.Exaposteilarion1.mode	@ltx/en_us_oca/miscellanea:misc.Mode2
ltx/en_us_oca/me.m09.d27:meMA.Exaposteilarion1.text	
ltx/en_us_oca/me.m09.d27:meMA.Kontakion1.greekmelody	@ltx/en_us_oca/he.a.m4:heAU.EpefanisSimeron.greekname
ltx/en_us_oca/me.m09.d27:meMA.Kontakion1.incipit	…
ltx/en_us_oca/me.m09.d27:meMA.Kontakion1.melody	@ltx/en_us_oca/he.a.m4:heAU.EpefanisSimeron.notmetered
ltx/en_us_oca/me.m09.d27:meMA.Kontakion1.mode	@ltx/en_us_oca/miscellanea:misc.Mode4
ltx/en_us_oca/me.m09.d27:meMA.Kontakion1.text	
ltx/en_us_oca/me.m09.d27:meMA.Ode1C11.greekmelody	@ltx/en_us_oca/he.h.m8:heHE.AsmaAnapempsomen.greekname
ltx/en_us_oca/me.m09.d27:meMA.Ode1C11.incipit	…
ltx/en_us_oca/me.m09.d27:meMA.Ode1C11.melody	@ltx/en_us_oca/he.h.m8:heHE.AsmaAnapempsomen.notmetered
ltx/en_us_oca/me.m09.d27:meMA.Ode1C11.mode	@ltx/en_us_oca/miscellanea:misc.Mode8
ltx/en_us_oca/me.m09.d27:meMA.Ode1C11.ode	@ltx/en_us_oca/miscellanea:misc.Ode1
ltx/en_us_oca/me.m09.d27:meMA.Ode1C11.text	
ltx/en_us_oca/me.m09.d27:meMA.Ode1C12.incipit	…
ltx/en_us_oca/me.m09.d27:meMA.Ode1C12.melody	@ltx/en_us_oca/he.h.m8:heHE.AsmaAnapempsomen.notmetered
ltx/en_us_oca/me.m09.d27:meMA.Ode1C12.mode	@ltx/en_us_oca/miscellanea:misc.Mode8
ltx/en_us_oca/me.m09.d27:meMA.Ode1C12.ode	@ltx/en_us_oca/miscellanea:misc.Ode1
ltx/en_us_oca/me.m09.d27:meMA.Ode1C12.text	
ltx/en_us_oca/me.m09.d27:meMA.Ode1C13.incipit	…
ltx/en_us_oca/me.m09.d27:meMA.Ode1C13.melody	@ltx/en_us_oca/he.h.m8:heHE.AsmaAnapempsomen.notmetered
ltx/en_us_oca/me.m09.d27:meMA.Ode1C13.mode	@ltx/en_us_oca/miscellanea:misc.Mode8
ltx/en_us_oca/me.m09.d27:meMA.Ode1C13.ode	@ltx/en_us_oca/miscellanea:misc.Ode1
ltx/en_us_oca/me.m09.d27:meMA.Ode1C13.text	
ltx/en_us_oca/me.m09.d27:meMA.Ode1C14.incipit	…
ltx/en_us_oca/me.m09.d27:meMA.Ode1C14.melody	@ltx/en_us_oca/he.h.m8:heHE.AsmaAnapempsomen.notmetered
ltx/en_us_oca/me.m09.d27:meMA.Ode1C14.mode	@ltx/en_us_oca/miscellanea:misc.Mode8
ltx/en_us_oca/me.m09.d27:meMA.Ode1C14.ode	@ltx/en_us_oca/miscellanea:misc.Ode1
ltx/en_us_oca/me.m09.d27:meMA.Ode1C14.text	
ltx/en_us_oca/me.m09.d27:meMA.Ode1C1T.incipit	…
ltx/en_us_oca/me.m09.d27:meMA.Ode1C1T.melody	@ltx/en_us_oca/he.h.m8:heHE.AsmaAnapempsomen.notmetered
ltx/en_us_oca/me.m09.d27:meMA.Ode1C1T.mode	@ltx/en_us_oca/miscellanea:misc.Mode8
ltx/en_us_oca/me.m09.d27:meMA.Ode1C1T.ode	@ltx/en_us_oca/miscellanea:misc.Ode1
ltx/en_us_oca/me.m09.d27:meMA.Ode1C1T.text	
ltx/en_us_oca/me.m09.d27:meMA.Ode3C11.greekmelody	@ltx/en_us_oca/he.h.m8:heHE.OStereosasLogo.greekname
ltx/en_us_oca/me.m09.d27:meMA.Ode3C11.incipit	…
ltx/en_us_oca/me.m09.d27:meMA.Ode3C11.melody	@ltx/en_us_oca/he.h.m8:heHE.OStereosasLogo.notmetered
ltx/en_us_oca/me.m09.d27:meMA.Ode3C11.mode	@ltx/en_us_oca/miscellanea:misc.Mode8
ltx/en_us_oca/me.m09.d27:meMA.Ode3C11.ode	@ltx/en_us_oca/miscellanea:misc.Ode3
ltx/en_us_oca/me.m09.d27:meMA.Ode3C11.text	
ltx/en_us_oca/me.m09.d27:meMA.Ode3C12.incipit	…
ltx/en_us_oca/me.m09.d27:meMA.Ode3C12.melody	@ltx/en_us_oca/he.h.m8:heHE.OStereosasLogo.notmetered
ltx/en_us_oca/me.m09.d27:meMA.Ode3C12.mode	@ltx/en_us_oca/miscellanea:misc.Mode8
ltx/en_us_oca/me.m09.d27:meMA.Ode3C12.ode	@ltx/en_us_oca/miscellanea:misc.Ode3
ltx/en_us_oca/me.m09.d27:meMA.Ode3C12.text	
ltx/en_us_oca/me.m09.d27:meMA.Ode3C13.incipit	…
ltx/en_us_oca/me.m09.d27:meMA.Ode3C13.melody	@ltx/en_us_oca/he.h.m8:heHE.OStereosasLogo.notmetered
ltx/en_us_oca/me.m09.d27:meMA.Ode3C13.mode	@ltx/en_us_oca/miscellanea:misc.Mode8
ltx/en_us_oca/me.m09.d27:meMA.Ode3C13.ode	@ltx/en_us_oca/miscellanea:misc.Ode3
ltx/en_us_oca/me.m09.d27:meMA.Ode3C13.text	
ltx/en_us_oca/me.m09.d27:meMA.Ode3C1T.incipit	…
ltx/en_us_oca/me.m09.d27:meMA.Ode3C1T.melody	@ltx/en_us_oca/he.h.m8:heHE.OStereosasLogo.notmetered
ltx/en_us_oca/me.m09.d27:meMA.Ode3C1T.mode	@ltx/en_us_oca/miscellanea:misc.Mode8
ltx/en_us_oca/me.m09.d27:meMA.Ode3C1T.ode	@ltx/en_us_oca/miscellanea:misc.Ode3
ltx/en_us_oca/me.m09.d27:meMA.Ode3C1T.text	
ltx/en_us_oca/me.m09.d27:meMA.Ode3H.greekmelody	@ltx/en_us_oca/he.h.m8:heHE.OStereosasLogo.greekname
ltx/en_us_oca/me.m09.d27:meMA.Ode3H.incipit	@ltx/en_us_oca/he.h.m8:heHE.OStereosasLogo.incipit
ltx/en_us_oca/me.m09.d27:meMA.Ode3H.melody	@ltx/en_us_oca/he.h.m8:heHE.OStereosasLogo.melody
ltx/en_us_oca/me.m09.d27:meMA.Ode3H.mode	@ltx/en_us_oca/miscellanea:misc.Mode8
ltx/en_us_oca/me.m09.d27:meMA.Ode3H.ode	@ltx/en_us_oca/miscellanea:misc.Ode3
ltx/en_us_oca/me.m09.d27:meMA.Ode3H.text	@ltx/en_us_oca/he.h.m8:heHE.OStereosasLogo.text
ltx/en_us_oca/me.m09.d27:meMA.Ode3Kathisma1.greekmelody	@ltx/en_us_oca/he.a.m5:heAU.TonSynanarchonLogon.greekname
ltx/en_us_oca/me.m09.d27:meMA.Ode3Kathisma1.incipit	…
ltx/en_us_oca/me.m09.d27:meMA.Ode3Kathisma1.melody	@ltx/en_us_oca/he.a.m5:heAU.TonSynanarchonLogon.notmetered
ltx/en_us_oca/me.m09.d27:meMA.Ode3Kathisma1.mode	@ltx/en_us_oca/miscellanea:misc.Mode5
ltx/en_us_oca/me.m09.d27:meMA.Ode3Kathisma1.text	
ltx/en_us_oca/me.m09.d27:meMA.Ode3KathismaSt.incipit	
ltx/en_us_oca/me.m09.d27:meMA.Ode3KathismaSt.melody	@ltx/en_us_oca/he.a.m5:heAU.TonSynanarchonLogon.notmetered
ltx/en_us_oca/me.m09.d27:meMA.Ode3KathismaSt.mode	@ltx/en_us_oca/miscellanea:misc.Mode5
ltx/en_us_oca/me.m09.d27:meMA.Ode3KathismaSt.text	
ltx/en_us_oca/me.m09.d27:meMA.Ode3KathismaT.incipit	
ltx/en_us_oca/me.m09.d27:meMA.Ode3KathismaT.melody	@ltx/en_us_oca/he.a.m5:heAU.TonSynanarchonLogon.notmetered
ltx/en_us_oca/me.m09.d27:meMA.Ode3KathismaT.mode	@ltx/en_us_oca/miscellanea:misc.Mode5
ltx/en_us_oca/me.m09.d27:meMA.Ode3KathismaT.text	
ltx/en_us_oca/me.m09.d27:meMA.Ode4C11.greekmelody	@ltx/en_us_oca/he.h.m8:heHE.EisakikoaKyrie.greekname
ltx/en_us_oca/me.m09.d27:meMA.Ode4C11.incipit	…
ltx/en_us_oca/me.m09.d27:meMA.Ode4C11.melody	@ltx/en_us_oca/he.h.m8:heHE.EisakikoaKyrie.notmetered
ltx/en_us_oca/me.m09.d27:meMA.Ode4C11.mode	@ltx/en_us_oca/miscellanea:misc.Mode8
ltx/en_us_oca/me.m09.d27:meMA.Ode4C11.ode	@ltx/en_us_oca/miscellanea:misc.Ode4
ltx/en_us_oca/me.m09.d27:meMA.Ode4C11.text	
ltx/en_us_oca/me.m09.d27:meMA.Ode4C12.incipit	…
ltx/en_us_oca/me.m09.d27:meMA.Ode4C12.melody	@ltx/en_us_oca/he.h.m8:heHE.EisakikoaKyrie.notmetered
ltx/en_us_oca/me.m09.d27:meMA.Ode4C12.mode	@ltx/en_us_oca/miscellanea:misc.Mode8
ltx/en_us_oca/me.m09.d27:meMA.Ode4C12.ode	@ltx/en_us_oca/miscellanea:misc.Ode4
ltx/en_us_oca/me.m09.d27:meMA.Ode4C12.text	
ltx/en_us_oca/me.m09.d27:meMA.Ode4C13.incipit	…
ltx/en_us_oca/me.m09.d27:meMA.Ode4C13.melody	@ltx/en_us_oca/he.h.m8:heHE.EisakikoaKyrie.notmetered
ltx/en_us_oca/me.m09.d27:meMA.Ode4C13.mode	@ltx/en_us_oca/miscellanea:misc.Mode8
ltx/en_us_oca/me.m09.d27:meMA.Ode4C13.ode	@ltx/en_us_oca/miscellanea:misc.Ode4
ltx/en_us_oca/me.m09.d27:meMA.Ode4C13.text	
ltx/en_us_oca/me.m09.d27:meMA.Ode4C14.incipit	…
ltx/en_us_oca/me.m09.d27:meMA.Ode4C14.melody	@ltx/en_us_oca/he.h.m8:heHE.EisakikoaKyrie.notmetered
ltx/en_us_oca/me.m09.d27:meMA.Ode4C14.mode	@ltx/en_us_oca/miscellanea:misc.Mode8
ltx/en_us_oca/me.m09.d27:meMA.Ode4C14.ode	@ltx/en_us_oca/miscellanea:misc.Ode4
ltx/en_us_oca/me.m09.d27:meMA.Ode4C14.text	
ltx/en_us_oca/me.m09.d27:meMA.Ode4C1T.incipit	…
ltx/en_us_oca/me.m09.d27:meMA.Ode4C1T.melody	@ltx/en_us_oca/he.h.m8:heHE.EisakikoaKyrie.notmetered
ltx/en_us_oca/me.m09.d27:meMA.Ode4C1T.mode	@ltx/en_us_oca/miscellanea:misc.Mode8
ltx/en_us_oca/me.m09.d27:meMA.Ode4C1T.ode	@ltx/en_us_oca/miscellanea:misc.Ode4
ltx/en_us_oca/me.m09.d27:meMA.Ode4C1T.text	
ltx/en_us_oca/me.m09.d27:meMA.Ode5C11.greekmelody	@ltx/en_us_oca/he.h.m8:heHE.OEkNyktosAgnoias.greekname
ltx/en_us_oca/me.m09.d27:meMA.Ode5C11.incipit	…
ltx/en_us_oca/me.m09.d27:meMA.Ode5C11.melody	@ltx/en_us_oca/he.h.m8:heHE.OEkNyktosAgnoias.notmetered
ltx/en_us_oca/me.m09.d27:meMA.Ode5C11.mode	@ltx/en_us_oca/miscellanea:misc.Mode8
ltx/en_us_oca/me.m09.d27:meMA.Ode5C11.ode	@ltx/en_us_oca/miscellanea:misc.Ode5
ltx/en_us_oca/me.m09.d27:meMA.Ode5C11.text	
ltx/en_us_oca/me.m09.d27:meMA.Ode5C12.incipit	…
ltx/en_us_oca/me.m09.d27:meMA.Ode5C12.melody	@ltx/en_us_oca/he.h.m8:heHE.OEkNyktosAgnoias.notmetered
ltx/en_us_oca/me.m09.d27:meMA.Ode5C12.mode	@ltx/en_us_oca/miscellanea:misc.Mode8
ltx/en_us_oca/me.m09.d27:meMA.Ode5C12.ode	@ltx/en_us_oca/miscellanea:misc.Ode5
ltx/en_us_oca/me.m09.d27:meMA.Ode5C12.text	
ltx/en_us_oca/me.m09.d27:meMA.Ode5C13.incipit	…
ltx/en_us_oca/me.m09.d27:meMA.Ode5C13.melody	@ltx/en_us_oca/he.h.m8:heHE.OEkNyktosAgnoias.notmetered
ltx/en_us_oca/me.m09.d27:meMA.Ode5C13.mode	@ltx/en_us_oca/miscellanea:misc.Mode8
ltx/en_us_oca/me.m09.d27:meMA.Ode5C13.ode	@ltx/en_us_oca/miscellanea:misc.Ode5
ltx/en_us_oca/me.m09.d27:meMA.Ode5C13.text	
ltx/en_us_oca/me.m09.d27:meMA.Ode5C1T.incipit	…
ltx/en_us_oca/me.m09.d27:meMA.Ode5C1T.melody	@ltx/en_us_oca/he.h.m8:heHE.OEkNyktosAgnoias.notmetered
ltx/en_us_oca/me.m09.d27:meMA.Ode5C1T.mode	@ltx/en_us_oca/miscellanea:misc.Mode8
ltx/en_us_oca/me.m09.d27:meMA.Ode5C1T.ode	@ltx/en_us_oca/miscellanea:misc.Ode5
ltx/en_us_oca/me.m09.d27:meMA.Ode5C1T.text	
ltx/en_us_oca/me.m09.d27:meMA.Ode6C11.greekmelody	@ltx/en_us_oca/he.h.m8:heHE.IlasthitiMoiSotir.greekname
ltx/en_us_oca/me.m09.d27:meMA.Ode6C11.incipit	…
ltx/en_us_oca/me.m09.d27:meMA.Ode6C11.melody	@ltx/en_us_oca/he.h.m8:heHE.IlasthitiMoiSotir.notmetered
ltx/en_us_oca/me.m09.d27:meMA.Ode6C11.mode	@ltx/en_us_oca/miscellanea:misc.Mode8
ltx/en_us_oca/me.m09.d27:meMA.Ode6C11.ode	@ltx/en_us_oca/miscellanea:misc.Ode6
ltx/en_us_oca/me.m09.d27:meMA.Ode6C11.text	
ltx/en_us_oca/me.m09.d27:meMA.Ode6C12.incipit	…
ltx/en_us_oca/me.m09.d27:meMA.Ode6C12.melody	@ltx/en_us_oca/he.h.m8:heHE.IlasthitiMoiSotir.notmetered
ltx/en_us_oca/me.m09.d27:meMA.Ode6C12.mode	@ltx/en_us_oca/miscellanea:misc.Mode8
ltx/en_us_oca/me.m09.d27:meMA.Ode6C12.ode	@ltx/en_us_oca/miscellanea:misc.Ode6
ltx/en_us_oca/me.m09.d27:meMA.Ode6C12.text	
ltx/en_us_oca/me.m09.d27:meMA.Ode6C13.incipit	…
ltx/en_us_oca/me.m09.d27:meMA.Ode6C13.melody	@ltx/en_us_oca/he.h.m8:heHE.IlasthitiMoiSotir.notmetered
ltx/en_us_oca/me.m09.d27:meMA.Ode6C13.mode	@ltx/en_us_oca/miscellanea:misc.Mode8
ltx/en_us_oca/me.m09.d27:meMA.Ode6C13.ode	@ltx/en_us_oca/miscellanea:misc.Ode6
ltx/en_us_oca/me.m09.d27:meMA.Ode6C13.text	
ltx/en_us_oca/me.m09.d27:meMA.Ode6C1T.incipit	…
ltx/en_us_oca/me.m09.d27:meMA.Ode6C1T.melody	@ltx/en_us_oca/he.h.m8:heHE.IlasthitiMoiSotir.notmetered
ltx/en_us_oca/me.m09.d27:meMA.Ode6C1T.mode	@ltx/en_us_oca/miscellanea:misc.Mode8
ltx/en_us_oca/me.m09.d27:meMA.Ode6C1T.ode	@ltx/en_us_oca/miscellanea:misc.Ode6
ltx/en_us_oca/me.m09.d27:meMA.Ode6C1T.text	
ltx/en_us_oca/me.m09.d27:meMA.Ode6H.greekmelody	@ltx/en_us_oca/he.h.m8:heHE.IlasthitiMoiSotir.greekname
ltx/en_us_oca/me.m09.d27:meMA.Ode6H.incipit	@ltx/en_us_oca/he.h.m8:heHE.IlasthitiMoiSotir.incipit
ltx/en_us_oca/me.m09.d27:meMA.Ode6H.melody	@ltx/en_us_oca/he.h.m8:heHE.IlasthitiMoiSotir.melody
ltx/en_us_oca/me.m09.d27:meMA.Ode6H.mode	@ltx/en_us_oca/miscellanea:misc.Mode8
ltx/en_us_oca/me.m09.d27:meMA.Ode6H.ode	@ltx/en_us_oca/miscellanea:misc.Ode6
ltx/en_us_oca/me.m09.d27:meMA.Ode6H.text	@ltx/en_us_oca/he.h.m8:heHE.IlasthitiMoiSotir.text
ltx/en_us_oca/me.m09.d27:meMA.Ode7C11.greekmelody	@ltx/en_us_oca/he.h.m8:heHE.OiEkTisIoudaias.greekname
ltx/en_us_oca/me.m09.d27:meMA.Ode7C11.incipit	…
ltx/en_us_oca/me.m09.d27:meMA.Ode7C11.melody	@ltx/en_us_oca/he.h.m8:heHE.OiEkTisIoudaias.notmetered
ltx/en_us_oca/me.m09.d27:meMA.Ode7C11.mode	@ltx/en_us_oca/miscellanea:misc.Mode8
ltx/en_us_oca/me.m09.d27:meMA.Ode7C11.ode	@ltx/en_us_oca/miscellanea:misc.Ode7
ltx/en_us_oca/me.m09.d27:meMA.Ode7C11.text	
ltx/en_us_oca/me.m09.d27:meMA.Ode7C12.incipit	…
ltx/en_us_oca/me.m09.d27:meMA.Ode7C12.melody	@ltx/en_us_oca/he.h.m8:heHE.IlasthitiMoiSotir.notmetered
ltx/en_us_oca/me.m09.d27:meMA.Ode7C12.mode	@ltx/en_us_oca/miscellanea:misc.Mode8
ltx/en_us_oca/me.m09.d27:meMA.Ode7C12.ode	@ltx/en_us_oca/miscellanea:misc.Ode7
ltx/en_us_oca/me.m09.d27:meMA.Ode7C12.text	
ltx/en_us_oca/me.m09.d27:meMA.Ode7C13.incipit	…
ltx/en_us_oca/me.m09.d27:meMA.Ode7C13.melody	@ltx/en_us_oca/he.h.m8:heHE.IlasthitiMoiSotir.notmetered
ltx/en_us_oca/me.m09.d27:meMA.Ode7C13.mode	@ltx/en_us_oca/miscellanea:misc.Mode8
ltx/en_us_oca/me.m09.d27:meMA.Ode7C13.ode	@ltx/en_us_oca/miscellanea:misc.Ode7
ltx/en_us_oca/me.m09.d27:meMA.Ode7C13.text	
ltx/en_us_oca/me.m09.d27:meMA.Ode7C14.incipit	…
ltx/en_us_oca/me.m09.d27:meMA.Ode7C14.melody	@ltx/en_us_oca/he.h.m8:heHE.IlasthitiMoiSotir.notmetered
ltx/en_us_oca/me.m09.d27:meMA.Ode7C14.mode	@ltx/en_us_oca/miscellanea:misc.Mode8
ltx/en_us_oca/me.m09.d27:meMA.Ode7C14.ode	@ltx/en_us_oca/miscellanea:misc.Ode7
ltx/en_us_oca/me.m09.d27:meMA.Ode7C14.text	
ltx/en_us_oca/me.m09.d27:meMA.Ode7C1T.incipit	…
ltx/en_us_oca/me.m09.d27:meMA.Ode7C1T.melody	@ltx/en_us_oca/he.h.m8:heHE.IlasthitiMoiSotir.notmetered
ltx/en_us_oca/me.m09.d27:meMA.Ode7C1T.mode	@ltx/en_us_oca/miscellanea:misc.Mode8
ltx/en_us_oca/me.m09.d27:meMA.Ode7C1T.ode	@ltx/en_us_oca/miscellanea:misc.Ode7
ltx/en_us_oca/me.m09.d27:meMA.Ode7C1T.text	
ltx/en_us_oca/me.m09.d27:meMA.Ode8C11.greekmelody	@ltx/en_us_oca/he.h.m8:heHE.OiTheorrimonesPaides.greekname
ltx/en_us_oca/me.m09.d27:meMA.Ode8C11.incipit	…
ltx/en_us_oca/me.m09.d27:meMA.Ode8C11.melody	@ltx/en_us_oca/he.h.m8:heHE.OiTheorrimonesPaides.notmetered
ltx/en_us_oca/me.m09.d27:meMA.Ode8C11.mode	@ltx/en_us_oca/miscellanea:misc.Mode8
ltx/en_us_oca/me.m09.d27:meMA.Ode8C11.ode	@ltx/en_us_oca/miscellanea:misc.Ode8
ltx/en_us_oca/me.m09.d27:meMA.Ode8C11.text	
ltx/en_us_oca/me.m09.d27:meMA.Ode8C12.incipit	…
ltx/en_us_oca/me.m09.d27:meMA.Ode8C12.melody	@ltx/en_us_oca/he.h.m8:heHE.OiTheorrimonesPaides.notmetered
ltx/en_us_oca/me.m09.d27:meMA.Ode8C12.mode	@ltx/en_us_oca/miscellanea:misc.Mode8
ltx/en_us_oca/me.m09.d27:meMA.Ode8C12.ode	@ltx/en_us_oca/miscellanea:misc.Ode8
ltx/en_us_oca/me.m09.d27:meMA.Ode8C12.text	
ltx/en_us_oca/me.m09.d27:meMA.Ode8C13.incipit	…
ltx/en_us_oca/me.m09.d27:meMA.Ode8C13.melody	@ltx/en_us_oca/he.h.m8:heHE.OiTheorrimonesPaides.notmetered
ltx/en_us_oca/me.m09.d27:meMA.Ode8C13.mode	@ltx/en_us_oca/miscellanea:misc.Mode8
ltx/en_us_oca/me.m09.d27:meMA.Ode8C13.ode	@ltx/en_us_oca/miscellanea:misc.Ode8
ltx/en_us_oca/me.m09.d27:meMA.Ode8C13.text	
ltx/en_us_oca/me.m09.d27:meMA.Ode8C1T.incipit	…
ltx/en_us_oca/me.m09.d27:meMA.Ode8C1T.melody	@ltx/en_us_oca/he.h.m8:heHE.OiTheorrimonesPaides.notmetered
ltx/en_us_oca/me.m09.d27:meMA.Ode8C1T.mode	@ltx/en_us_oca/miscellanea:misc.Mode8
ltx/en_us_oca/me.m09.d27:meMA.Ode8C1T.ode	@ltx/en_us_oca/miscellanea:misc.Ode8
ltx/en_us_oca/me.m09.d27:meMA.Ode8C1T.text	
ltx/en_us_oca/me.m09.d27:meMA.Ode8H.greekmelody	@ltx/en_us_oca/he.h.m8:heHE.OiTheorrimonesPaides.greekname
ltx/en_us_oca/me.m09.d27:meMA.Ode8H.incipit	@ltx/en_us_oca/he.h.m8:heHE.OiTheorrimonesPaides.incipit
ltx/en_us_oca/me.m09.d27:meMA.Ode8H.melody	@ltx/en_us_oca/he.h.m8:heHE.OiTheorrimonesPaides.melody
ltx/en_us_oca/me.m09.d27:meMA.Ode8H.mode	@ltx/en_us_oca/miscellanea:misc.Mode8
ltx/en_us_oca/me.m09.d27:meMA.Ode8H.ode	@ltx/en_us_oca/miscellanea:misc.Ode8
ltx/en_us_oca/me.m09.d27:meMA.Ode8H.text	@ltx/en_us_oca/he.h.m8:heHE.OiTheorrimonesPaides.text
ltx/en_us_oca/me.m09.d27:meMA.Ode9C11.greekmelody	@ltx/en_us_oca/he.h.m8:heHE.EfrixePasaAkoi.greekname
ltx/en_us_oca/me.m09.d27:meMA.Ode9C11.incipit	…
ltx/en_us_oca/me.m09.d27:meMA.Ode9C11.melody	@ltx/en_us_oca/he.h.m8:heHE.EfrixePasaAkoi.notmetered
ltx/en_us_oca/me.m09.d27:meMA.Ode9C11.mode	@ltx/en_us_oca/miscellanea:misc.Mode8
ltx/en_us_oca/me.m09.d27:meMA.Ode9C11.ode	@ltx/en_us_oca/miscellanea:misc.Ode9
ltx/en_us_oca/me.m09.d27:meMA.Ode9C11.text	
ltx/en_us_oca/me.m09.d27:meMA.Ode9C12.incipit	…
ltx/en_us_oca/me.m09.d27:meMA.Ode9C12.melody	@ltx/en_us_oca/he.h.m8:heHE.EfrixePasaAkoi.notmetered
ltx/en_us_oca/me.m09.d27:meMA.Ode9C12.mode	@ltx/en_us_oca/miscellanea:misc.Mode8
ltx/en_us_oca/me.m09.d27:meMA.Ode9C12.ode	@ltx/en_us_oca/miscellanea:misc.Ode9
ltx/en_us_oca/me.m09.d27:meMA.Ode9C12.text	
ltx/en_us_oca/me.m09.d27:meMA.Ode9C13.incipit	…
ltx/en_us_oca/me.m09.d27:meMA.Ode9C13.melody	@ltx/en_us_oca/he.h.m8:heHE.EfrixePasaAkoi.notmetered
ltx/en_us_oca/me.m09.d27:meMA.Ode9C13.mode	@ltx/en_us_oca/miscellanea:misc.Mode8
ltx/en_us_oca/me.m09.d27:meMA.Ode9C13.ode	@ltx/en_us_oca/miscellanea:misc.Ode9
ltx/en_us_oca/me.m09.d27:meMA.Ode9C13.text	
ltx/en_us_oca/me.m09.d27:meMA.Ode9C14.incipit	…
ltx/en_us_oca/me.m09.d27:meMA.Ode9C14.melody	@ltx/en_us_oca/he.h.m8:heHE.EfrixePasaAkoi.notmetered
ltx/en_us_oca/me.m09.d27:meMA.Ode9C14.mode	@ltx/en_us_oca/miscellanea:misc.Mode8
ltx/en_us_oca/me.m09.d27:meMA.Ode9C14.ode	@ltx/en_us_oca/miscellanea:misc.Ode9
ltx/en_us_oca/me.m09.d27:meMA.Ode9C14.text	
ltx/en_us_oca/me.m09.d27:meMA.Ode9C1T.incipit	…
ltx/en_us_oca/me.m09.d27:meMA.Ode9C1T.melody	@ltx/en_us_oca/he.h.m8:heHE.EfrixePasaAkoi.notmetered
ltx/en_us_oca/me.m09.d27:meMA.Ode9C1T.mode	@ltx/en_us_oca/miscellanea:misc.Mode8
ltx/en_us_oca/me.m09.d27:meMA.Ode9C1T.ode	@ltx/en_us_oca/miscellanea:misc.Ode9
ltx/en_us_oca/me.m09.d27:meMA.Ode9C1T.text	
ltx/en_us_oca/me.m09.d27:meMA.Ode9H.greekmelody	@ltx/en_us_oca/he.h.m8:heHE.EfrixePasaAkoi.greekname
ltx/en_us_oca/me.m09.d27:meMA.Ode9H.incipit	@ltx/en_us_oca/he.h.m8:heHE.EfrixePasaAkoi.incipit
ltx/en_us_oca/me.m09.d27:meMA.Ode9H.melody	@ltx/en_us_oca/he.h.m8:heHE.EfrixePasaAkoi.melody
ltx/en_us_oca/me.m09.d27:meMA.Ode9H.mode	@ltx/en_us_oca/miscellanea:misc.Mode8
ltx/en_us_oca/me.m09.d27:meMA.Ode9H.ode	@ltx/en_us_oca/miscellanea:misc.Ode9
ltx/en_us_oca/me.m09.d27:meMA.Ode9H.text	@ltx/en_us_oca/he.h.m8:heHE.EfrixePasaAkoi.text
ltx/en_us_oca/me.m09.d27:meMA.Oikos1.text	
ltx/en_us_oca/me.m09.d27:meVE.Apolytikion1ger.greekmelody	@ltx/en_us_oca/he.a.m3:heAU.TinOraiotita.greekname
ltx/en_us_oca/me.m09.d27:meVE.Apolytikion1ger.incipit	…
ltx/en_us_oca/me.m09.d27:meVE.Apolytikion1ger.melody	@ltx/en_us_oca/he.a.m3:heAU.TinOraiotita.notmetered
ltx/en_us_oca/me.m09.d27:meVE.Apolytikion1ger.mode	@ltx/en_us_oca/miscellanea:misc.Mode3
ltx/en_us_oca/me.m09.d27:meVE.Apolytikion1ger.poet	@ltx/en_us_oca/poets:po.Gerasimou
ltx/en_us_oca/me.m09.d27:meVE.Apolytikion1ger.text	
ltx/en_us_oca/me.m09.d27:meVE.Apolytikion2ger.greekmelody	@ltx/en_us_oca/he.a.m5:heAU.TonSynanarchonLogon.greekname
ltx/en_us_oca/me.m09.d27:meVE.Apolytikion2ger.incipit	…
ltx/en_us_oca/me.m09.d27:meVE.Apolytikion2ger.melody	@ltx/en_us_oca/he.a.m5:heAU.TonSynanarchonLogon.notmetered
ltx/en_us_oca/me.m09.d27:meVE.Apolytikion2ger.mode	@ltx/en_us_oca/miscellanea:misc.Mode5
ltx/en_us_oca/me.m09.d27:meVE.Apolytikion2ger.poet	@ltx/en_us_oca/poets:po.Gerasimou
ltx/en_us_oca/me.m09.d27:meVE.Apolytikion2ger.text	
ltx/en_us_oca/me.m09.d27:meVE.SticGlory.incipit	Before the time of your…
ltx/en_us_oca/me.m09.d27:meVE.SticGlory.melody	
ltx/en_us_oca/me.m09.d27:meVE.SticGlory.mode	@ltx/en_us_oca/miscellanea:misc.Mode4
ltx/en_us_oca/me.m09.d27:meVE.SticGlory.poet	@ltx/en_us_oca/poets:po.Vyzantiou
ltx/en_us_oca/me.m09.d27:meVE.SticGlory.text	Before the time of your precious Cross, ⁄ death was fearful to men! ⁄ After your glorious passion, ⁄ man is feared by death! ⁄ Thus the victor was strengthened to such an extent ⁄ that all the power of the enemy was laid low! ⁄⁄ By his prayers, O Christ, save our souls!
ltx/en_us_oca/me.m09.d27:meVE.SticStavrotheotokion.greekmelody	@ltx/en_us_oca/he.a.m4:heAU.EdokasSimeiosin.greekname
ltx/en_us_oca/me.m09.d27:meVE.SticStavrotheotokion.incipit	…
ltx/en_us_oca/me.m09.d27:meVE.SticStavrotheotokion.melody	@ltx/en_us_oca/he.a.m4:heAU.EdokasSimeiosin.notmetered
ltx/en_us_oca/me.m09.d27:meVE.SticStavrotheotokion.mode	@ltx/en_us_oca/miscellanea:misc.Mode4
ltx/en_us_oca/me.m09.d27:meVE.SticStavrotheotokion.text	
ltx/en_us_oca/me.m09.d27:meVE.SticTheotokion.greekmelody	@ltx/en_us_oca/he.a.m4:heAU.EdokasSimeiosin.greekname
ltx/en_us_oca/me.m09.d27:meVE.SticTheotokion.incipit	…
ltx/en_us_oca/me.m09.d27:meVE.SticTheotokion.melody	@ltx/en_us_oca/he.a.m4:heAU.EdokasSimeiosin.notmetered
ltx/en_us_oca/me.m09.d27:meVE.SticTheotokion.mode	@ltx/en_us_oca/miscellanea:misc.Mode4
ltx/en_us_oca/me.m09.d27:meVE.SticTheotokion.text	
ltx/en_us_oca/me.m09.d27:meVE.Stichera01.greekmelody	@ltx/en_us_oca/he.a.m8:heAU.OTouParadoxou.greekname
ltx/en_us_oca/me.m09.d27:meVE.Stichera01.incipit	Martyred athlete Callistratus, ⁄ your…
ltx/en_us_oca/me.m09.d27:meVE.Stichera01.melody	@ltx/en_us_oca/he.a.m8:heAU.OTouParadoxou.notmetered
ltx/en_us_oca/me.m09.d27:meVE.Stichera01.mode	@ltx/en_us_oca/miscellanea:misc.Mode8
ltx/en_us_oca/me.m09.d27:meVE.Stichera01.text	Martyred athlete Callistratus, ⁄ your mind illumined by the light of piety, ⁄ you unwaveringly trod the path to heavenly blessedness, ⁄ conquering all the snares of the enemy! ⁄ Therefore we praise you, honoring your sacred memory, ⁄⁄ most blessed one!
ltx/en_us_oca/me.m09.d27:meVE.Stichera02.incipit	Divinely wise martyr Callistratus, ⁄…
ltx/en_us_oca/me.m09.d27:meVE.Stichera02.melody	@ltx/en_us_oca/he.a.m8:heAU.OTouParadoxou.notmetered
ltx/en_us_oca/me.m09.d27:meVE.Stichera02.mode	@ltx/en_us_oca/miscellanea:misc.Mode8
ltx/en_us_oca/me.m09.d27:meVE.Stichera02.text	Divinely wise martyr Callistratus, ⁄ enriched by the word of life, you guided to life ⁄ those who once were dead in the curse through ignorance! ⁄ They died with zeal, glorious one, for the Resurrection of us all! ⁄ Truly we believe they dwell with Christ: ⁄⁄ Together with them, remember us to the all-good Lord!
ltx/en_us_oca/me.m09.d27:meVE.Stichera03.incipit	Sacred martyr Gymnasius, ⁄ beheaded…
ltx/en_us_oca/me.m09.d27:meVE.Stichera03.melody	@ltx/en_us_oca/he.a.m8:heAU.OTouParadoxou.notmetered
ltx/en_us_oca/me.m09.d27:meVE.Stichera03.mode	@ltx/en_us_oca/miscellanea:misc.Mode8
ltx/en_us_oca/me.m09.d27:meVE.Stichera03.text	Sacred martyr Gymnasius, ⁄ beheaded by the sword ⁄ you indeed drowned the Pharaoh of falsehood in the torrent of your blood! ⁄ Now you pour forth healings on all who come to your temple with faith ⁄⁄ praising your struggles and celebrating your honored memory, blessed one!
