ltx/en_us_oca/me.m07.d13:alt1.meDA.commemoration.first_name	
ltx/en_us_oca/me.m07.d13:alt1.meDA.commemoration.first_short	
ltx/en_us_oca/me.m07.d13:alt1.meDA.commemoration.first_title	
ltx/en_us_oca/me.m07.d13:alt1.meDA.commemoration.full	
ltx/en_us_oca/me.m07.d13:alt1.meDA.commemoration.second_name	
ltx/en_us_oca/me.m07.d13:alt1.meDA.commemoration.second_title	
ltx/en_us_oca/me.m07.d13:alt1.meDA.date	
ltx/en_us_oca/me.m07.d13:alt1.meDA.insert1	
ltx/en_us_oca/me.m07.d13:alt1.meDA.insert2	
ltx/en_us_oca/me.m07.d13:alt1.meDA.note	
ltx/en_us_oca/me.m07.d13:alt1.meHO.commemorations	
ltx/en_us_oca/me.m07.d13:alt1.meHO.note1	
ltx/en_us_oca/me.m07.d13:alt1.meHO.note2	
ltx/en_us_oca/me.m07.d13:alt1.meHO.number	
ltx/en_us_oca/me.m07.d13:alt1.meHO.rank	
ltx/en_us_oca/me.m07.d13:alt1.meLE.commemoration1	
ltx/en_us_oca/me.m07.d13:alt1.meLE.commemoration2	
ltx/en_us_oca/me.m07.d13:alt1.meLI.Kontakion1.incipit	…
ltx/en_us_oca/me.m07.d13:alt1.meLI.Kontakion1.melody	
ltx/en_us_oca/me.m07.d13:alt1.meLI.Kontakion1.mode	
ltx/en_us_oca/me.m07.d13:alt1.meLI.Kontakion1.text	
ltx/en_us_oca/me.m07.d13:alt1.meLI.Megalynarion.text	
ltx/en_us_oca/me.m07.d13:alt1.meMA.C1.acrostic.notice1	
ltx/en_us_oca/me.m07.d13:alt1.meMA.C1.acrostic.text	
ltx/en_us_oca/me.m07.d13:alt1.meMA.C1.acrostic.title	
ltx/en_us_oca/me.m07.d13:alt1.meMA.C1.title	@ltx/en_us_oca/titles:ti.CanonSaintM
ltx/en_us_oca/me.m07.d13:alt1.meMA.C1.verse	@ltx/en_us_oca/prayers:pr.verse_SaintM.text
ltx/en_us_oca/me.m07.d13:alt1.meMA.Ode1C11.greekmelody	@ltx/en_us_oca/he.h.m6:heHE.OsEnIpeiroPezefsas.greekname
ltx/en_us_oca/me.m07.d13:alt1.meMA.Ode1C11.incipit	…
ltx/en_us_oca/me.m07.d13:alt1.meMA.Ode1C11.melody	@ltx/en_us_oca/he.h.m6:heHE.OsEnIpeiroPezefsas.notmetered
ltx/en_us_oca/me.m07.d13:alt1.meMA.Ode1C11.mode	@ltx/en_us_oca/miscellanea:misc.Mode6
ltx/en_us_oca/me.m07.d13:alt1.meMA.Ode1C11.ode	@ltx/en_us_oca/miscellanea:misc.Ode1
ltx/en_us_oca/me.m07.d13:alt1.meMA.Ode1C11.text	
ltx/en_us_oca/me.m07.d13:alt1.meMA.Ode1C12.incipit	…
ltx/en_us_oca/me.m07.d13:alt1.meMA.Ode1C12.melody	@ltx/en_us_oca/he.h.m6:heHE.OsEnIpeiroPezefsas.notmetered
ltx/en_us_oca/me.m07.d13:alt1.meMA.Ode1C12.mode	@ltx/en_us_oca/miscellanea:misc.Mode6
ltx/en_us_oca/me.m07.d13:alt1.meMA.Ode1C12.ode	@ltx/en_us_oca/miscellanea:misc.Ode1
ltx/en_us_oca/me.m07.d13:alt1.meMA.Ode1C12.text	
ltx/en_us_oca/me.m07.d13:alt1.meMA.Ode1C13.incipit	…
ltx/en_us_oca/me.m07.d13:alt1.meMA.Ode1C13.melody	@ltx/en_us_oca/he.h.m6:heHE.OsEnIpeiroPezefsas.notmetered
ltx/en_us_oca/me.m07.d13:alt1.meMA.Ode1C13.mode	@ltx/en_us_oca/miscellanea:misc.Mode6
ltx/en_us_oca/me.m07.d13:alt1.meMA.Ode1C13.ode	@ltx/en_us_oca/miscellanea:misc.Ode1
ltx/en_us_oca/me.m07.d13:alt1.meMA.Ode1C13.text	
ltx/en_us_oca/me.m07.d13:alt1.meMA.Ode1C1T.incipit	…
ltx/en_us_oca/me.m07.d13:alt1.meMA.Ode1C1T.melody	@ltx/en_us_oca/he.h.m6:heHE.OsEnIpeiroPezefsas.notmetered
ltx/en_us_oca/me.m07.d13:alt1.meMA.Ode1C1T.mode	@ltx/en_us_oca/miscellanea:misc.Mode6
ltx/en_us_oca/me.m07.d13:alt1.meMA.Ode1C1T.ode	@ltx/en_us_oca/miscellanea:misc.Ode1
ltx/en_us_oca/me.m07.d13:alt1.meMA.Ode1C1T.text	
ltx/en_us_oca/me.m07.d13:alt1.meMA.Ode3C11.greekmelody	@ltx/en_us_oca/he.h.m6:heHE.OukEstinAgios.greekname
ltx/en_us_oca/me.m07.d13:alt1.meMA.Ode3C11.incipit	…
ltx/en_us_oca/me.m07.d13:alt1.meMA.Ode3C11.melody	@ltx/en_us_oca/he.h.m6:heHE.OukEstinAgios.notmetered
ltx/en_us_oca/me.m07.d13:alt1.meMA.Ode3C11.mode	@ltx/en_us_oca/miscellanea:misc.Mode6
ltx/en_us_oca/me.m07.d13:alt1.meMA.Ode3C11.ode	@ltx/en_us_oca/miscellanea:misc.Ode3
ltx/en_us_oca/me.m07.d13:alt1.meMA.Ode3C11.text	
ltx/en_us_oca/me.m07.d13:alt1.meMA.Ode3C12.incipit	…
ltx/en_us_oca/me.m07.d13:alt1.meMA.Ode3C12.melody	@ltx/en_us_oca/he.h.m6:heHE.OukEstinAgios.notmetered
ltx/en_us_oca/me.m07.d13:alt1.meMA.Ode3C12.mode	@ltx/en_us_oca/miscellanea:misc.Mode6
ltx/en_us_oca/me.m07.d13:alt1.meMA.Ode3C12.ode	@ltx/en_us_oca/miscellanea:misc.Ode3
ltx/en_us_oca/me.m07.d13:alt1.meMA.Ode3C12.text	
ltx/en_us_oca/me.m07.d13:alt1.meMA.Ode3C13.incipit	…
ltx/en_us_oca/me.m07.d13:alt1.meMA.Ode3C13.melody	@ltx/en_us_oca/he.h.m6:heHE.OukEstinAgios.notmetered
ltx/en_us_oca/me.m07.d13:alt1.meMA.Ode3C13.mode	@ltx/en_us_oca/miscellanea:misc.Mode6
ltx/en_us_oca/me.m07.d13:alt1.meMA.Ode3C13.ode	@ltx/en_us_oca/miscellanea:misc.Ode3
ltx/en_us_oca/me.m07.d13:alt1.meMA.Ode3C13.text	
ltx/en_us_oca/me.m07.d13:alt1.meMA.Ode3C1T.incipit	…
ltx/en_us_oca/me.m07.d13:alt1.meMA.Ode3C1T.melody	@ltx/en_us_oca/he.h.m6:heHE.OukEstinAgios.notmetered
ltx/en_us_oca/me.m07.d13:alt1.meMA.Ode3C1T.mode	@ltx/en_us_oca/miscellanea:misc.Mode6
ltx/en_us_oca/me.m07.d13:alt1.meMA.Ode3C1T.ode	@ltx/en_us_oca/miscellanea:misc.Ode3
ltx/en_us_oca/me.m07.d13:alt1.meMA.Ode3C1T.text	
ltx/en_us_oca/me.m07.d13:alt1.meMA.Ode4C11.greekmelody	@ltx/en_us_oca/he.h.m6:heHE.ChristosMouDynamis.greekname
ltx/en_us_oca/me.m07.d13:alt1.meMA.Ode4C11.incipit	…
ltx/en_us_oca/me.m07.d13:alt1.meMA.Ode4C11.melody	@ltx/en_us_oca/he.h.m6:heHE.ChristosMouDynamis.notmetered
ltx/en_us_oca/me.m07.d13:alt1.meMA.Ode4C11.mode	@ltx/en_us_oca/miscellanea:misc.Mode6
ltx/en_us_oca/me.m07.d13:alt1.meMA.Ode4C11.ode	@ltx/en_us_oca/miscellanea:misc.Ode4
ltx/en_us_oca/me.m07.d13:alt1.meMA.Ode4C11.text	
ltx/en_us_oca/me.m07.d13:alt1.meMA.Ode4C12.incipit	…
ltx/en_us_oca/me.m07.d13:alt1.meMA.Ode4C12.melody	@ltx/en_us_oca/he.h.m6:heHE.ChristosMouDynamis.notmetered
ltx/en_us_oca/me.m07.d13:alt1.meMA.Ode4C12.mode	@ltx/en_us_oca/miscellanea:misc.Mode6
ltx/en_us_oca/me.m07.d13:alt1.meMA.Ode4C12.ode	@ltx/en_us_oca/miscellanea:misc.Ode4
ltx/en_us_oca/me.m07.d13:alt1.meMA.Ode4C12.text	
ltx/en_us_oca/me.m07.d13:alt1.meMA.Ode4C13.incipit	…
ltx/en_us_oca/me.m07.d13:alt1.meMA.Ode4C13.melody	@ltx/en_us_oca/he.h.m6:heHE.ChristosMouDynamis.notmetered
ltx/en_us_oca/me.m07.d13:alt1.meMA.Ode4C13.mode	@ltx/en_us_oca/miscellanea:misc.Mode6
ltx/en_us_oca/me.m07.d13:alt1.meMA.Ode4C13.ode	@ltx/en_us_oca/miscellanea:misc.Ode4
ltx/en_us_oca/me.m07.d13:alt1.meMA.Ode4C13.text	
ltx/en_us_oca/me.m07.d13:alt1.meMA.Ode4C1T.incipit	…
ltx/en_us_oca/me.m07.d13:alt1.meMA.Ode4C1T.melody	@ltx/en_us_oca/he.h.m6:heHE.ChristosMouDynamis.notmetered
ltx/en_us_oca/me.m07.d13:alt1.meMA.Ode4C1T.mode	@ltx/en_us_oca/miscellanea:misc.Mode6
ltx/en_us_oca/me.m07.d13:alt1.meMA.Ode4C1T.ode	@ltx/en_us_oca/miscellanea:misc.Ode4
ltx/en_us_oca/me.m07.d13:alt1.meMA.Ode4C1T.text	
ltx/en_us_oca/me.m07.d13:alt1.meMA.Ode5C11.greekmelody	@ltx/en_us_oca/he.h.m6:heHE.ToTheioFengeiSou.greekname
ltx/en_us_oca/me.m07.d13:alt1.meMA.Ode5C11.incipit	…
ltx/en_us_oca/me.m07.d13:alt1.meMA.Ode5C11.melody	@ltx/en_us_oca/he.h.m6:heHE.ToTheioFengeiSou.notmetered
ltx/en_us_oca/me.m07.d13:alt1.meMA.Ode5C11.mode	@ltx/en_us_oca/miscellanea:misc.Mode6
ltx/en_us_oca/me.m07.d13:alt1.meMA.Ode5C11.ode	@ltx/en_us_oca/miscellanea:misc.Ode5
ltx/en_us_oca/me.m07.d13:alt1.meMA.Ode5C11.text	
ltx/en_us_oca/me.m07.d13:alt1.meMA.Ode5C12.incipit	…
ltx/en_us_oca/me.m07.d13:alt1.meMA.Ode5C12.melody	@ltx/en_us_oca/he.h.m6:heHE.ToTheioFengeiSou.notmetered
ltx/en_us_oca/me.m07.d13:alt1.meMA.Ode5C12.mode	@ltx/en_us_oca/miscellanea:misc.Mode6
ltx/en_us_oca/me.m07.d13:alt1.meMA.Ode5C12.ode	@ltx/en_us_oca/miscellanea:misc.Ode5
ltx/en_us_oca/me.m07.d13:alt1.meMA.Ode5C12.text	
ltx/en_us_oca/me.m07.d13:alt1.meMA.Ode5C13.incipit	…
ltx/en_us_oca/me.m07.d13:alt1.meMA.Ode5C13.melody	@ltx/en_us_oca/he.h.m6:heHE.ToTheioFengeiSou.notmetered
ltx/en_us_oca/me.m07.d13:alt1.meMA.Ode5C13.mode	@ltx/en_us_oca/miscellanea:misc.Mode6
ltx/en_us_oca/me.m07.d13:alt1.meMA.Ode5C13.ode	@ltx/en_us_oca/miscellanea:misc.Ode5
ltx/en_us_oca/me.m07.d13:alt1.meMA.Ode5C13.text	
ltx/en_us_oca/me.m07.d13:alt1.meMA.Ode5C1T.incipit	…
ltx/en_us_oca/me.m07.d13:alt1.meMA.Ode5C1T.melody	@ltx/en_us_oca/he.h.m6:heHE.ToTheioFengeiSou.notmetered
ltx/en_us_oca/me.m07.d13:alt1.meMA.Ode5C1T.mode	@ltx/en_us_oca/miscellanea:misc.Mode6
ltx/en_us_oca/me.m07.d13:alt1.meMA.Ode5C1T.ode	@ltx/en_us_oca/miscellanea:misc.Ode5
ltx/en_us_oca/me.m07.d13:alt1.meMA.Ode5C1T.text	
ltx/en_us_oca/me.m07.d13:alt1.meMA.Ode6C11.greekmelody	@ltx/en_us_oca/he.h.m6:heHE.TouViouTinThalassan.greekname
ltx/en_us_oca/me.m07.d13:alt1.meMA.Ode6C11.incipit	…
ltx/en_us_oca/me.m07.d13:alt1.meMA.Ode6C11.melody	@ltx/en_us_oca/he.h.m6:heHE.TouViouTinThalassan.notmetered
ltx/en_us_oca/me.m07.d13:alt1.meMA.Ode6C11.mode	@ltx/en_us_oca/miscellanea:misc.Mode6
ltx/en_us_oca/me.m07.d13:alt1.meMA.Ode6C11.ode	@ltx/en_us_oca/miscellanea:misc.Ode6
ltx/en_us_oca/me.m07.d13:alt1.meMA.Ode6C11.text	
ltx/en_us_oca/me.m07.d13:alt1.meMA.Ode6C12.incipit	…
ltx/en_us_oca/me.m07.d13:alt1.meMA.Ode6C12.melody	@ltx/en_us_oca/he.h.m6:heHE.TouViouTinThalassan.notmetered
ltx/en_us_oca/me.m07.d13:alt1.meMA.Ode6C12.mode	@ltx/en_us_oca/miscellanea:misc.Mode6
ltx/en_us_oca/me.m07.d13:alt1.meMA.Ode6C12.ode	@ltx/en_us_oca/miscellanea:misc.Ode6
ltx/en_us_oca/me.m07.d13:alt1.meMA.Ode6C12.text	
ltx/en_us_oca/me.m07.d13:alt1.meMA.Ode6C13.incipit	…
ltx/en_us_oca/me.m07.d13:alt1.meMA.Ode6C13.melody	@ltx/en_us_oca/he.h.m6:heHE.TouViouTinThalassan.notmetered
ltx/en_us_oca/me.m07.d13:alt1.meMA.Ode6C13.mode	@ltx/en_us_oca/miscellanea:misc.Mode6
ltx/en_us_oca/me.m07.d13:alt1.meMA.Ode6C13.ode	@ltx/en_us_oca/miscellanea:misc.Ode6
ltx/en_us_oca/me.m07.d13:alt1.meMA.Ode6C13.text	
ltx/en_us_oca/me.m07.d13:alt1.meMA.Ode6C1T.incipit	…
ltx/en_us_oca/me.m07.d13:alt1.meMA.Ode6C1T.melody	@ltx/en_us_oca/he.h.m6:heHE.TouViouTinThalassan.notmetered
ltx/en_us_oca/me.m07.d13:alt1.meMA.Ode6C1T.mode	@ltx/en_us_oca/miscellanea:misc.Mode6
ltx/en_us_oca/me.m07.d13:alt1.meMA.Ode6C1T.ode	@ltx/en_us_oca/miscellanea:misc.Ode6
ltx/en_us_oca/me.m07.d13:alt1.meMA.Ode6C1T.text	
ltx/en_us_oca/me.m07.d13:alt1.meMA.Ode7C11.greekmelody	@ltx/en_us_oca/he.h.m6:heHE.DrosovolonMenTinKaminon.greekname
ltx/en_us_oca/me.m07.d13:alt1.meMA.Ode7C11.incipit	…
ltx/en_us_oca/me.m07.d13:alt1.meMA.Ode7C11.melody	@ltx/en_us_oca/he.h.m6:heHE.DrosovolonMenTinKaminon.notmetered
ltx/en_us_oca/me.m07.d13:alt1.meMA.Ode7C11.mode	@ltx/en_us_oca/miscellanea:misc.Mode6
ltx/en_us_oca/me.m07.d13:alt1.meMA.Ode7C11.ode	@ltx/en_us_oca/miscellanea:misc.Ode7
ltx/en_us_oca/me.m07.d13:alt1.meMA.Ode7C11.text	
ltx/en_us_oca/me.m07.d13:alt1.meMA.Ode7C12.incipit	…
ltx/en_us_oca/me.m07.d13:alt1.meMA.Ode7C12.melody	@ltx/en_us_oca/he.h.m6:heHE.DrosovolonMenTinKaminon.notmetered
ltx/en_us_oca/me.m07.d13:alt1.meMA.Ode7C12.mode	@ltx/en_us_oca/miscellanea:misc.Mode6
ltx/en_us_oca/me.m07.d13:alt1.meMA.Ode7C12.ode	@ltx/en_us_oca/miscellanea:misc.Ode7
ltx/en_us_oca/me.m07.d13:alt1.meMA.Ode7C12.text	
ltx/en_us_oca/me.m07.d13:alt1.meMA.Ode7C13.incipit	…
ltx/en_us_oca/me.m07.d13:alt1.meMA.Ode7C13.melody	@ltx/en_us_oca/he.h.m6:heHE.DrosovolonMenTinKaminon.notmetered
ltx/en_us_oca/me.m07.d13:alt1.meMA.Ode7C13.mode	@ltx/en_us_oca/miscellanea:misc.Mode6
ltx/en_us_oca/me.m07.d13:alt1.meMA.Ode7C13.ode	@ltx/en_us_oca/miscellanea:misc.Ode7
ltx/en_us_oca/me.m07.d13:alt1.meMA.Ode7C13.text	
ltx/en_us_oca/me.m07.d13:alt1.meMA.Ode7C14.incipit	…
ltx/en_us_oca/me.m07.d13:alt1.meMA.Ode7C14.melody	@ltx/en_us_oca/he.h.m6:heHE.DrosovolonMenTinKaminon.notmetered
ltx/en_us_oca/me.m07.d13:alt1.meMA.Ode7C14.mode	@ltx/en_us_oca/miscellanea:misc.Mode6
ltx/en_us_oca/me.m07.d13:alt1.meMA.Ode7C14.ode	@ltx/en_us_oca/miscellanea:misc.Ode7
ltx/en_us_oca/me.m07.d13:alt1.meMA.Ode7C14.text	
ltx/en_us_oca/me.m07.d13:alt1.meMA.Ode7C1T.incipit	…
ltx/en_us_oca/me.m07.d13:alt1.meMA.Ode7C1T.melody	@ltx/en_us_oca/he.h.m6:heHE.DrosovolonMenTinKaminon.notmetered
ltx/en_us_oca/me.m07.d13:alt1.meMA.Ode7C1T.mode	@ltx/en_us_oca/miscellanea:misc.Mode6
ltx/en_us_oca/me.m07.d13:alt1.meMA.Ode7C1T.ode	@ltx/en_us_oca/miscellanea:misc.Ode7
ltx/en_us_oca/me.m07.d13:alt1.meMA.Ode7C1T.text	
ltx/en_us_oca/me.m07.d13:alt1.meMA.Ode8C11.greekmelody	@ltx/en_us_oca/he.h.m6:heHE.EkFlogosToisOsiois.greekname
ltx/en_us_oca/me.m07.d13:alt1.meMA.Ode8C11.incipit	…
ltx/en_us_oca/me.m07.d13:alt1.meMA.Ode8C11.melody	@ltx/en_us_oca/he.h.m6:heHE.EkFlogosToisOsiois.notmetered
ltx/en_us_oca/me.m07.d13:alt1.meMA.Ode8C11.mode	@ltx/en_us_oca/miscellanea:misc.Mode6
ltx/en_us_oca/me.m07.d13:alt1.meMA.Ode8C11.ode	@ltx/en_us_oca/miscellanea:misc.Ode8
ltx/en_us_oca/me.m07.d13:alt1.meMA.Ode8C11.text	
ltx/en_us_oca/me.m07.d13:alt1.meMA.Ode8C12.incipit	…
ltx/en_us_oca/me.m07.d13:alt1.meMA.Ode8C12.melody	@ltx/en_us_oca/he.h.m6:heHE.EkFlogosToisOsiois.notmetered
ltx/en_us_oca/me.m07.d13:alt1.meMA.Ode8C12.mode	@ltx/en_us_oca/miscellanea:misc.Mode6
ltx/en_us_oca/me.m07.d13:alt1.meMA.Ode8C12.ode	@ltx/en_us_oca/miscellanea:misc.Ode8
ltx/en_us_oca/me.m07.d13:alt1.meMA.Ode8C12.text	
ltx/en_us_oca/me.m07.d13:alt1.meMA.Ode8C13.incipit	…
ltx/en_us_oca/me.m07.d13:alt1.meMA.Ode8C13.melody	@ltx/en_us_oca/he.h.m6:heHE.EkFlogosToisOsiois.notmetered
ltx/en_us_oca/me.m07.d13:alt1.meMA.Ode8C13.mode	@ltx/en_us_oca/miscellanea:misc.Mode6
ltx/en_us_oca/me.m07.d13:alt1.meMA.Ode8C13.ode	@ltx/en_us_oca/miscellanea:misc.Ode8
ltx/en_us_oca/me.m07.d13:alt1.meMA.Ode8C13.text	
ltx/en_us_oca/me.m07.d13:alt1.meMA.Ode8C14.incipit	…
ltx/en_us_oca/me.m07.d13:alt1.meMA.Ode8C14.melody	@ltx/en_us_oca/he.h.m6:heHE.EkFlogosToisOsiois.notmetered
ltx/en_us_oca/me.m07.d13:alt1.meMA.Ode8C14.mode	@ltx/en_us_oca/miscellanea:misc.Mode6
ltx/en_us_oca/me.m07.d13:alt1.meMA.Ode8C14.ode	@ltx/en_us_oca/miscellanea:misc.Ode8
ltx/en_us_oca/me.m07.d13:alt1.meMA.Ode8C14.text	
ltx/en_us_oca/me.m07.d13:alt1.meMA.Ode8C1T.incipit	…
ltx/en_us_oca/me.m07.d13:alt1.meMA.Ode8C1T.melody	@ltx/en_us_oca/he.h.m6:heHE.EkFlogosToisOsiois.notmetered
ltx/en_us_oca/me.m07.d13:alt1.meMA.Ode8C1T.mode	@ltx/en_us_oca/miscellanea:misc.Mode6
ltx/en_us_oca/me.m07.d13:alt1.meMA.Ode8C1T.ode	@ltx/en_us_oca/miscellanea:misc.Ode8
ltx/en_us_oca/me.m07.d13:alt1.meMA.Ode8C1T.text	
ltx/en_us_oca/me.m07.d13:alt1.meMA.Ode9C11.greekmelody	@ltx/en_us_oca/he.h.m6:heHE.TheonAnthropois.greekname
ltx/en_us_oca/me.m07.d13:alt1.meMA.Ode9C11.incipit	…
ltx/en_us_oca/me.m07.d13:alt1.meMA.Ode9C11.melody	@ltx/en_us_oca/he.h.m6:heHE.TheonAnthropois.notmetered
ltx/en_us_oca/me.m07.d13:alt1.meMA.Ode9C11.mode	@ltx/en_us_oca/miscellanea:misc.Mode6
ltx/en_us_oca/me.m07.d13:alt1.meMA.Ode9C11.ode	@ltx/en_us_oca/miscellanea:misc.Ode9
ltx/en_us_oca/me.m07.d13:alt1.meMA.Ode9C11.text	
ltx/en_us_oca/me.m07.d13:alt1.meMA.Ode9C12.incipit	…
ltx/en_us_oca/me.m07.d13:alt1.meMA.Ode9C12.melody	@ltx/en_us_oca/he.h.m6:heHE.TheonAnthropois.notmetered
ltx/en_us_oca/me.m07.d13:alt1.meMA.Ode9C12.mode	@ltx/en_us_oca/miscellanea:misc.Mode6
ltx/en_us_oca/me.m07.d13:alt1.meMA.Ode9C12.ode	@ltx/en_us_oca/miscellanea:misc.Ode9
ltx/en_us_oca/me.m07.d13:alt1.meMA.Ode9C12.text	
ltx/en_us_oca/me.m07.d13:alt1.meMA.Ode9C13.incipit	…
ltx/en_us_oca/me.m07.d13:alt1.meMA.Ode9C13.melody	@ltx/en_us_oca/he.h.m6:heHE.TheonAnthropois.notmetered
ltx/en_us_oca/me.m07.d13:alt1.meMA.Ode9C13.mode	@ltx/en_us_oca/miscellanea:misc.Mode6
ltx/en_us_oca/me.m07.d13:alt1.meMA.Ode9C13.ode	@ltx/en_us_oca/miscellanea:misc.Ode9
ltx/en_us_oca/me.m07.d13:alt1.meMA.Ode9C13.text	
ltx/en_us_oca/me.m07.d13:alt1.meMA.Ode9C14.incipit	…
ltx/en_us_oca/me.m07.d13:alt1.meMA.Ode9C14.melody	@ltx/en_us_oca/he.h.m6:heHE.TheonAnthropois.notmetered
ltx/en_us_oca/me.m07.d13:alt1.meMA.Ode9C14.mode	@ltx/en_us_oca/miscellanea:misc.Mode6
ltx/en_us_oca/me.m07.d13:alt1.meMA.Ode9C14.ode	@ltx/en_us_oca/miscellanea:misc.Ode9
ltx/en_us_oca/me.m07.d13:alt1.meMA.Ode9C14.text	
ltx/en_us_oca/me.m07.d13:alt1.meMA.Ode9C1T.incipit	…
ltx/en_us_oca/me.m07.d13:alt1.meMA.Ode9C1T.melody	@ltx/en_us_oca/he.h.m6:heHE.TheonAnthropois.notmetered
ltx/en_us_oca/me.m07.d13:alt1.meMA.Ode9C1T.mode	@ltx/en_us_oca/miscellanea:misc.Mode6
ltx/en_us_oca/me.m07.d13:alt1.meMA.Ode9C1T.ode	@ltx/en_us_oca/miscellanea:misc.Ode9
ltx/en_us_oca/me.m07.d13:alt1.meMA.Ode9C1T.text	
ltx/en_us_oca/me.m07.d13:alt1.meVE.Stichera01.greekmelody	@ltx/en_us_oca/he.a.m8:heAU.OTouParadoxou.greekname
ltx/en_us_oca/me.m07.d13:alt1.meVE.Stichera01.incipit	…
ltx/en_us_oca/me.m07.d13:alt1.meVE.Stichera01.melody	@ltx/en_us_oca/he.a.m8:heAU.OTouParadoxou.notmetered
ltx/en_us_oca/me.m07.d13:alt1.meVE.Stichera01.mode	@ltx/en_us_oca/miscellanea:misc.Mode8
ltx/en_us_oca/me.m07.d13:alt1.meVE.Stichera01.text	
ltx/en_us_oca/me.m07.d13:alt1.meVE.Stichera02.incipit	…
ltx/en_us_oca/me.m07.d13:alt1.meVE.Stichera02.melody	@ltx/en_us_oca/he.a.m8:heAU.OTouParadoxou.notmetered
ltx/en_us_oca/me.m07.d13:alt1.meVE.Stichera02.mode	@ltx/en_us_oca/miscellanea:misc.Mode8
ltx/en_us_oca/me.m07.d13:alt1.meVE.Stichera02.text	
ltx/en_us_oca/me.m07.d13:alt1.meVE.Stichera03.incipit	…
ltx/en_us_oca/me.m07.d13:alt1.meVE.Stichera03.melody	@ltx/en_us_oca/he.a.m8:heAU.OTouParadoxou.notmetered
ltx/en_us_oca/me.m07.d13:alt1.meVE.Stichera03.mode	@ltx/en_us_oca/miscellanea:misc.Mode8
ltx/en_us_oca/me.m07.d13:alt1.meVE.Stichera03.text	
ltx/en_us_oca/me.m07.d13:meDA.commemoration.first	
ltx/en_us_oca/me.m07.d13:meDA.commemoration.first_name	
ltx/en_us_oca/me.m07.d13:meDA.commemoration.first_short	
ltx/en_us_oca/me.m07.d13:meDA.commemoration.first_title	
ltx/en_us_oca/me.m07.d13:meDA.commemoration.full	
ltx/en_us_oca/me.m07.d13:meDA.commemoration.second_name	
ltx/en_us_oca/me.m07.d13:meDA.commemoration.second_title	
ltx/en_us_oca/me.m07.d13:meDA.date	
ltx/en_us_oca/me.m07.d13:meDA.fordate	
ltx/en_us_oca/me.m07.d13:meDA.insert1	
ltx/en_us_oca/me.m07.d13:meDA.insert2	
ltx/en_us_oca/me.m07.d13:meDA.note	
ltx/en_us_oca/me.m07.d13:meDA.pdfcoverdate	
ltx/en_us_oca/me.m07.d13:meDA.pdfheaderdate	
ltx/en_us_oca/me.m07.d13:meHO.commemorations	
ltx/en_us_oca/me.m07.d13:meHO.note1	
ltx/en_us_oca/me.m07.d13:meHO.note2	
ltx/en_us_oca/me.m07.d13:meHO.number	
ltx/en_us_oca/me.m07.d13:meHO.rank	
ltx/en_us_oca/me.m07.d13:meLE.commemoration1	
ltx/en_us_oca/me.m07.d13:meLE.commemoration2	
ltx/en_us_oca/me.m07.d13:meLI.Kontakion1.greekmelody	@ltx/en_us_oca/me.m07.d13:meMA.Kontakion1.greekmelody
ltx/en_us_oca/me.m07.d13:meLI.Kontakion1.incipit	@ltx/en_us_oca/me.m07.d13:meMA.Kontakion1.incipit
ltx/en_us_oca/me.m07.d13:meLI.Kontakion1.melody	@ltx/en_us_oca/me.m07.d13:meMA.Kontakion1.melody
ltx/en_us_oca/me.m07.d13:meLI.Kontakion1.mode	@ltx/en_us_oca/me.m07.d13:meMA.Kontakion1.mode
ltx/en_us_oca/me.m07.d13:meLI.Kontakion1.text	@ltx/en_us_oca/me.m07.d13:meMA.Kontakion1.text
ltx/en_us_oca/me.m07.d13:meLI.Megalynarion.text	
ltx/en_us_oca/me.m07.d13:meMA.C1.acrostic.notice1	
ltx/en_us_oca/me.m07.d13:meMA.C1.acrostic.text	
ltx/en_us_oca/me.m07.d13:meMA.C1.acrostic.title	
ltx/en_us_oca/me.m07.d13:meMA.C1.title	@ltx/en_us_oca/titles:ti.CanonArchangel
ltx/en_us_oca/me.m07.d13:meMA.C1.verse	@ltx/en_us_oca/prayers:pr.verse_Archangel.text
ltx/en_us_oca/me.m07.d13:meMA.C2.acrostic.notice1	
ltx/en_us_oca/me.m07.d13:meMA.C2.acrostic.text	
ltx/en_us_oca/me.m07.d13:meMA.C2.acrostic.title	
ltx/en_us_oca/me.m07.d13:meMA.C2.poet	@ltx/en_us_oca/poets:po.Theofanous
ltx/en_us_oca/me.m07.d13:meMA.C2.title	@ltx/en_us_oca/titles:ti.CanonDevoutM
ltx/en_us_oca/me.m07.d13:meMA.C2.verse	@ltx/en_us_oca/prayers:pr.verse_DevoutMan.text
ltx/en_us_oca/me.m07.d13:meMA.ExapTheotokion.incipit	…
ltx/en_us_oca/me.m07.d13:meMA.ExapTheotokion.melody	@ltx/en_us_oca/he.a.m2:heAU.GynaikesAkoutisthite.notmetered
ltx/en_us_oca/me.m07.d13:meMA.ExapTheotokion.mode	@ltx/en_us_oca/miscellanea:misc.Mode2
ltx/en_us_oca/me.m07.d13:meMA.ExapTheotokion.text	
ltx/en_us_oca/me.m07.d13:meMA.Exaposteilarion1.greekmelody	@ltx/en_us_oca/he.a.m2:heAU.GynaikesAkoutisthite.greekname
ltx/en_us_oca/me.m07.d13:meMA.Exaposteilarion1.incipit	…
ltx/en_us_oca/me.m07.d13:meMA.Exaposteilarion1.melody	@ltx/en_us_oca/he.a.m2:heAU.GynaikesAkoutisthite.notmetered
ltx/en_us_oca/me.m07.d13:meMA.Exaposteilarion1.mode	@ltx/en_us_oca/miscellanea:misc.Mode2
ltx/en_us_oca/me.m07.d13:meMA.Exaposteilarion1.text	
ltx/en_us_oca/me.m07.d13:meMA.Kontakion1.greekmelody	@ltx/en_us_oca/he.a.m4:heAU.OYpsotheisEnToStavro.greekname
ltx/en_us_oca/me.m07.d13:meMA.Kontakion1.incipit	…
ltx/en_us_oca/me.m07.d13:meMA.Kontakion1.melody	@ltx/en_us_oca/he.a.m4:heAU.OYpsotheisEnToStavro.notmetered
ltx/en_us_oca/me.m07.d13:meMA.Kontakion1.mode	@ltx/en_us_oca/miscellanea:misc.Mode4
ltx/en_us_oca/me.m07.d13:meMA.Kontakion1.text	
ltx/en_us_oca/me.m07.d13:meMA.Lauds1.greekmelody	@ltx/en_us_oca/he.a.m1:heAU.PaneffimoiMartyres.greekname
ltx/en_us_oca/me.m07.d13:meMA.Lauds1.incipit	…
ltx/en_us_oca/me.m07.d13:meMA.Lauds1.melody	@ltx/en_us_oca/he.a.m1:heAU.PaneffimoiMartyres.notmetered
ltx/en_us_oca/me.m07.d13:meMA.Lauds1.mode	@ltx/en_us_oca/miscellanea:misc.Mode1
ltx/en_us_oca/me.m07.d13:meMA.Lauds1.text	
ltx/en_us_oca/me.m07.d13:meMA.Lauds2.incipit	…
ltx/en_us_oca/me.m07.d13:meMA.Lauds2.melody	@ltx/en_us_oca/he.a.m1:heAU.PaneffimoiMartyres.notmetered
ltx/en_us_oca/me.m07.d13:meMA.Lauds2.mode	@ltx/en_us_oca/miscellanea:misc.Mode1
ltx/en_us_oca/me.m07.d13:meMA.Lauds2.text	
ltx/en_us_oca/me.m07.d13:meMA.Lauds3.incipit	…
ltx/en_us_oca/me.m07.d13:meMA.Lauds3.melody	@ltx/en_us_oca/he.a.m1:heAU.PaneffimoiMartyres.notmetered
ltx/en_us_oca/me.m07.d13:meMA.Lauds3.mode	@ltx/en_us_oca/miscellanea:misc.Mode1
ltx/en_us_oca/me.m07.d13:meMA.Lauds3.text	
ltx/en_us_oca/me.m07.d13:meMA.LaudsGlory.incipit	…
ltx/en_us_oca/me.m07.d13:meMA.LaudsGlory.melody	
ltx/en_us_oca/me.m07.d13:meMA.LaudsGlory.mode	@ltx/en_us_oca/miscellanea:misc.Mode5
ltx/en_us_oca/me.m07.d13:meMA.LaudsGlory.text	
ltx/en_us_oca/me.m07.d13:meMA.LaudsTheotokion.incipit	@ltx/en_us_oca/oc.m5.d7:ocVE.AposTheotokion.incipit
ltx/en_us_oca/me.m07.d13:meMA.LaudsTheotokion.melody	
ltx/en_us_oca/me.m07.d13:meMA.LaudsTheotokion.mode	@ltx/en_us_oca/miscellanea:misc.Mode5
ltx/en_us_oca/me.m07.d13:meMA.LaudsTheotokion.text	@ltx/en_us_oca/oc.m5.d7:ocVE.AposTheotokion.text
ltx/en_us_oca/me.m07.d13:meMA.Ode1C11.greekmelody	@ltx/en_us_oca/he.h.m4:heHE.AnoixoToStomaMou.greekname
ltx/en_us_oca/me.m07.d13:meMA.Ode1C11.incipit	…
ltx/en_us_oca/me.m07.d13:meMA.Ode1C11.melody	@ltx/en_us_oca/he.h.m4:heHE.AnoixoToStomaMou.notmetered
ltx/en_us_oca/me.m07.d13:meMA.Ode1C11.mode	@ltx/en_us_oca/miscellanea:misc.Mode4
ltx/en_us_oca/me.m07.d13:meMA.Ode1C11.ode	@ltx/en_us_oca/miscellanea:misc.Ode1
ltx/en_us_oca/me.m07.d13:meMA.Ode1C11.text	
ltx/en_us_oca/me.m07.d13:meMA.Ode1C12.incipit	…
ltx/en_us_oca/me.m07.d13:meMA.Ode1C12.melody	@ltx/en_us_oca/he.h.m4:heHE.AnoixoToStomaMou.notmetered
ltx/en_us_oca/me.m07.d13:meMA.Ode1C12.mode	@ltx/en_us_oca/miscellanea:misc.Mode4
ltx/en_us_oca/me.m07.d13:meMA.Ode1C12.ode	@ltx/en_us_oca/miscellanea:misc.Ode1
ltx/en_us_oca/me.m07.d13:meMA.Ode1C12.text	
ltx/en_us_oca/me.m07.d13:meMA.Ode1C13.incipit	…
ltx/en_us_oca/me.m07.d13:meMA.Ode1C13.melody	@ltx/en_us_oca/he.h.m4:heHE.AnoixoToStomaMou.notmetered
ltx/en_us_oca/me.m07.d13:meMA.Ode1C13.mode	@ltx/en_us_oca/miscellanea:misc.Mode4
ltx/en_us_oca/me.m07.d13:meMA.Ode1C13.ode	@ltx/en_us_oca/miscellanea:misc.Ode1
ltx/en_us_oca/me.m07.d13:meMA.Ode1C13.text	
ltx/en_us_oca/me.m07.d13:meMA.Ode1C1T.incipit	…
ltx/en_us_oca/me.m07.d13:meMA.Ode1C1T.melody	@ltx/en_us_oca/he.h.m4:heHE.AnoixoToStomaMou.notmetered
ltx/en_us_oca/me.m07.d13:meMA.Ode1C1T.mode	@ltx/en_us_oca/miscellanea:misc.Mode4
ltx/en_us_oca/me.m07.d13:meMA.Ode1C1T.ode	@ltx/en_us_oca/miscellanea:misc.Ode1
ltx/en_us_oca/me.m07.d13:meMA.Ode1C1T.text	
ltx/en_us_oca/me.m07.d13:meMA.Ode1C21.greekmelody	@ltx/en_us_oca/he.h.m2:heHE.EnVythoKatestrose.greekname
ltx/en_us_oca/me.m07.d13:meMA.Ode1C21.incipit	…
ltx/en_us_oca/me.m07.d13:meMA.Ode1C21.melody	@ltx/en_us_oca/he.h.m2:heHE.EnVythoKatestrose.notmetered
ltx/en_us_oca/me.m07.d13:meMA.Ode1C21.mode	@ltx/en_us_oca/miscellanea:misc.Mode2
ltx/en_us_oca/me.m07.d13:meMA.Ode1C21.ode	@ltx/en_us_oca/miscellanea:misc.Ode1
ltx/en_us_oca/me.m07.d13:meMA.Ode1C21.text	
ltx/en_us_oca/me.m07.d13:meMA.Ode1C22.incipit	…
ltx/en_us_oca/me.m07.d13:meMA.Ode1C22.melody	@ltx/en_us_oca/he.h.m2:heHE.EnVythoKatestrose.notmetered
ltx/en_us_oca/me.m07.d13:meMA.Ode1C22.mode	@ltx/en_us_oca/miscellanea:misc.Mode2
ltx/en_us_oca/me.m07.d13:meMA.Ode1C22.ode	@ltx/en_us_oca/miscellanea:misc.Ode1
ltx/en_us_oca/me.m07.d13:meMA.Ode1C22.text	
ltx/en_us_oca/me.m07.d13:meMA.Ode1C23.incipit	…
ltx/en_us_oca/me.m07.d13:meMA.Ode1C23.melody	@ltx/en_us_oca/he.h.m2:heHE.EnVythoKatestrose.notmetered
ltx/en_us_oca/me.m07.d13:meMA.Ode1C23.mode	@ltx/en_us_oca/miscellanea:misc.Mode2
ltx/en_us_oca/me.m07.d13:meMA.Ode1C23.ode	@ltx/en_us_oca/miscellanea:misc.Ode1
ltx/en_us_oca/me.m07.d13:meMA.Ode1C23.text	
ltx/en_us_oca/me.m07.d13:meMA.Ode1C2T.incipit	…
ltx/en_us_oca/me.m07.d13:meMA.Ode1C2T.melody	@ltx/en_us_oca/he.h.m2:heHE.EnVythoKatestrose.notmetered
ltx/en_us_oca/me.m07.d13:meMA.Ode1C2T.mode	@ltx/en_us_oca/miscellanea:misc.Mode2
ltx/en_us_oca/me.m07.d13:meMA.Ode1C2T.ode	@ltx/en_us_oca/miscellanea:misc.Ode1
ltx/en_us_oca/me.m07.d13:meMA.Ode1C2T.text	
ltx/en_us_oca/me.m07.d13:meMA.Ode3C11.greekmelody	@ltx/en_us_oca/he.h.m4:heHE.TousSousYmnologous.greekname
ltx/en_us_oca/me.m07.d13:meMA.Ode3C11.incipit	…
ltx/en_us_oca/me.m07.d13:meMA.Ode3C11.melody	@ltx/en_us_oca/he.h.m4:heHE.TousSousYmnologous.notmetered
ltx/en_us_oca/me.m07.d13:meMA.Ode3C11.mode	@ltx/en_us_oca/miscellanea:misc.Mode4
ltx/en_us_oca/me.m07.d13:meMA.Ode3C11.ode	@ltx/en_us_oca/miscellanea:misc.Ode3
ltx/en_us_oca/me.m07.d13:meMA.Ode3C11.text	
ltx/en_us_oca/me.m07.d13:meMA.Ode3C12.incipit	…
ltx/en_us_oca/me.m07.d13:meMA.Ode3C12.melody	@ltx/en_us_oca/he.h.m4:heHE.TousSousYmnologous.notmetered
ltx/en_us_oca/me.m07.d13:meMA.Ode3C12.mode	@ltx/en_us_oca/miscellanea:misc.Mode4
ltx/en_us_oca/me.m07.d13:meMA.Ode3C12.ode	@ltx/en_us_oca/miscellanea:misc.Ode3
ltx/en_us_oca/me.m07.d13:meMA.Ode3C12.text	
ltx/en_us_oca/me.m07.d13:meMA.Ode3C13.incipit	…
ltx/en_us_oca/me.m07.d13:meMA.Ode3C13.melody	@ltx/en_us_oca/he.h.m4:heHE.TousSousYmnologous.notmetered
ltx/en_us_oca/me.m07.d13:meMA.Ode3C13.mode	@ltx/en_us_oca/miscellanea:misc.Mode4
ltx/en_us_oca/me.m07.d13:meMA.Ode3C13.ode	@ltx/en_us_oca/miscellanea:misc.Ode3
ltx/en_us_oca/me.m07.d13:meMA.Ode3C13.text	
ltx/en_us_oca/me.m07.d13:meMA.Ode3C1T.incipit	…
ltx/en_us_oca/me.m07.d13:meMA.Ode3C1T.melody	@ltx/en_us_oca/he.h.m4:heHE.TousSousYmnologous.notmetered
ltx/en_us_oca/me.m07.d13:meMA.Ode3C1T.mode	@ltx/en_us_oca/miscellanea:misc.Mode4
ltx/en_us_oca/me.m07.d13:meMA.Ode3C1T.ode	@ltx/en_us_oca/miscellanea:misc.Ode3
ltx/en_us_oca/me.m07.d13:meMA.Ode3C1T.text	
ltx/en_us_oca/me.m07.d13:meMA.Ode3C21.greekmelody	@ltx/en_us_oca/he.h.m2:heHE.ExinthisenIErimos.greekname
ltx/en_us_oca/me.m07.d13:meMA.Ode3C21.incipit	…
ltx/en_us_oca/me.m07.d13:meMA.Ode3C21.melody	@ltx/en_us_oca/he.h.m2:heHE.ExinthisenIErimos.notmetered
ltx/en_us_oca/me.m07.d13:meMA.Ode3C21.mode	@ltx/en_us_oca/miscellanea:misc.Mode2
ltx/en_us_oca/me.m07.d13:meMA.Ode3C21.ode	@ltx/en_us_oca/miscellanea:misc.Ode3
ltx/en_us_oca/me.m07.d13:meMA.Ode3C21.text	
ltx/en_us_oca/me.m07.d13:meMA.Ode3C22.incipit	…
ltx/en_us_oca/me.m07.d13:meMA.Ode3C22.melody	@ltx/en_us_oca/he.h.m2:heHE.ExinthisenIErimos.notmetered
ltx/en_us_oca/me.m07.d13:meMA.Ode3C22.mode	@ltx/en_us_oca/miscellanea:misc.Mode2
ltx/en_us_oca/me.m07.d13:meMA.Ode3C22.ode	@ltx/en_us_oca/miscellanea:misc.Ode3
ltx/en_us_oca/me.m07.d13:meMA.Ode3C22.text	
ltx/en_us_oca/me.m07.d13:meMA.Ode3C23.incipit	…
ltx/en_us_oca/me.m07.d13:meMA.Ode3C23.melody	@ltx/en_us_oca/he.h.m2:heHE.ExinthisenIErimos.notmetered
ltx/en_us_oca/me.m07.d13:meMA.Ode3C23.mode	@ltx/en_us_oca/miscellanea:misc.Mode2
ltx/en_us_oca/me.m07.d13:meMA.Ode3C23.ode	@ltx/en_us_oca/miscellanea:misc.Ode3
ltx/en_us_oca/me.m07.d13:meMA.Ode3C23.text	
ltx/en_us_oca/me.m07.d13:meMA.Ode3C2T.incipit	…
ltx/en_us_oca/me.m07.d13:meMA.Ode3C2T.melody	@ltx/en_us_oca/he.h.m2:heHE.ExinthisenIErimos.notmetered
ltx/en_us_oca/me.m07.d13:meMA.Ode3C2T.mode	@ltx/en_us_oca/miscellanea:misc.Mode2
ltx/en_us_oca/me.m07.d13:meMA.Ode3C2T.ode	@ltx/en_us_oca/miscellanea:misc.Ode3
ltx/en_us_oca/me.m07.d13:meMA.Ode3C2T.text	
ltx/en_us_oca/me.m07.d13:meMA.Ode3H.greekmelody	@ltx/en_us_oca/he.h.m2:heHE.ExinthisenIErimos.greekname
ltx/en_us_oca/me.m07.d13:meMA.Ode3H.incipit	@ltx/en_us_oca/he.h.m2:heHE.ExinthisenIErimos.incipit
ltx/en_us_oca/me.m07.d13:meMA.Ode3H.melody	@ltx/en_us_oca/he.h.m2:heHE.ExinthisenIErimos.melody
ltx/en_us_oca/me.m07.d13:meMA.Ode3H.mode	@ltx/en_us_oca/miscellanea:misc.Mode2
ltx/en_us_oca/me.m07.d13:meMA.Ode3H.ode	@ltx/en_us_oca/miscellanea:misc.Ode3
ltx/en_us_oca/me.m07.d13:meMA.Ode3H.text	@ltx/en_us_oca/he.h.m2:heHE.ExinthisenIErimos.text
ltx/en_us_oca/me.m07.d13:meMA.Ode3Kathisma1.greekmelody	@ltx/en_us_oca/he.a.m1:heAU.TonTafonSouSotir.greekname
ltx/en_us_oca/me.m07.d13:meMA.Ode3Kathisma1.incipit	…
ltx/en_us_oca/me.m07.d13:meMA.Ode3Kathisma1.melody	@ltx/en_us_oca/he.a.m1:heAU.TonTafonSouSotir.notmetered
ltx/en_us_oca/me.m07.d13:meMA.Ode3Kathisma1.mode	@ltx/en_us_oca/miscellanea:misc.Mode1
ltx/en_us_oca/me.m07.d13:meMA.Ode3Kathisma1.text	
ltx/en_us_oca/me.m07.d13:meMA.Ode3Kathisma2.greekmelody	@ltx/en_us_oca/he.a.m1:heAU.TonTafonSouSotir.greekname
ltx/en_us_oca/me.m07.d13:meMA.Ode3Kathisma2.incipit	…
ltx/en_us_oca/me.m07.d13:meMA.Ode3Kathisma2.melody	@ltx/en_us_oca/he.a.m1:heAU.TonTafonSouSotir.notmetered
ltx/en_us_oca/me.m07.d13:meMA.Ode3Kathisma2.mode	@ltx/en_us_oca/miscellanea:misc.Mode1
ltx/en_us_oca/me.m07.d13:meMA.Ode3Kathisma2.text	
ltx/en_us_oca/me.m07.d13:meMA.Ode3KathismaT.incipit	…
ltx/en_us_oca/me.m07.d13:meMA.Ode3KathismaT.melody	@ltx/en_us_oca/he.a.m1:heAU.TonTafonSouSotir.notmetered
ltx/en_us_oca/me.m07.d13:meMA.Ode3KathismaT.mode	@ltx/en_us_oca/miscellanea:misc.Mode1
ltx/en_us_oca/me.m07.d13:meMA.Ode3KathismaT.text	
ltx/en_us_oca/me.m07.d13:meMA.Ode4C11.greekmelody	@ltx/en_us_oca/he.h.m4:heHE.TinAnexichniaston.greekname
ltx/en_us_oca/me.m07.d13:meMA.Ode4C11.incipit	…
ltx/en_us_oca/me.m07.d13:meMA.Ode4C11.melody	@ltx/en_us_oca/he.h.m4:heHE.TinAnexichniaston.notmetered
ltx/en_us_oca/me.m07.d13:meMA.Ode4C11.mode	@ltx/en_us_oca/miscellanea:misc.Mode4
ltx/en_us_oca/me.m07.d13:meMA.Ode4C11.ode	@ltx/en_us_oca/miscellanea:misc.Ode4
ltx/en_us_oca/me.m07.d13:meMA.Ode4C11.text	
ltx/en_us_oca/me.m07.d13:meMA.Ode4C12.incipit	…
ltx/en_us_oca/me.m07.d13:meMA.Ode4C12.melody	@ltx/en_us_oca/he.h.m4:heHE.TinAnexichniaston.notmetered
ltx/en_us_oca/me.m07.d13:meMA.Ode4C12.mode	@ltx/en_us_oca/miscellanea:misc.Mode4
ltx/en_us_oca/me.m07.d13:meMA.Ode4C12.ode	@ltx/en_us_oca/miscellanea:misc.Ode4
ltx/en_us_oca/me.m07.d13:meMA.Ode4C12.text	
ltx/en_us_oca/me.m07.d13:meMA.Ode4C13.incipit	…
ltx/en_us_oca/me.m07.d13:meMA.Ode4C13.melody	@ltx/en_us_oca/he.h.m4:heHE.TinAnexichniaston.notmetered
ltx/en_us_oca/me.m07.d13:meMA.Ode4C13.mode	@ltx/en_us_oca/miscellanea:misc.Mode4
ltx/en_us_oca/me.m07.d13:meMA.Ode4C13.ode	@ltx/en_us_oca/miscellanea:misc.Ode4
ltx/en_us_oca/me.m07.d13:meMA.Ode4C13.text	
ltx/en_us_oca/me.m07.d13:meMA.Ode4C1T.incipit	…
ltx/en_us_oca/me.m07.d13:meMA.Ode4C1T.melody	@ltx/en_us_oca/he.h.m4:heHE.TinAnexichniaston.notmetered
ltx/en_us_oca/me.m07.d13:meMA.Ode4C1T.mode	@ltx/en_us_oca/miscellanea:misc.Mode4
ltx/en_us_oca/me.m07.d13:meMA.Ode4C1T.ode	@ltx/en_us_oca/miscellanea:misc.Ode4
ltx/en_us_oca/me.m07.d13:meMA.Ode4C1T.text	
ltx/en_us_oca/me.m07.d13:meMA.Ode4C21.greekmelody	@ltx/en_us_oca/he.h.m2:heHE.ElilythasEkParthenou.greekname
ltx/en_us_oca/me.m07.d13:meMA.Ode4C21.incipit	…
ltx/en_us_oca/me.m07.d13:meMA.Ode4C21.melody	@ltx/en_us_oca/he.h.m2:heHE.ElilythasEkParthenou.notmetered
ltx/en_us_oca/me.m07.d13:meMA.Ode4C21.mode	@ltx/en_us_oca/miscellanea:misc.Mode2
ltx/en_us_oca/me.m07.d13:meMA.Ode4C21.ode	@ltx/en_us_oca/miscellanea:misc.Ode4
ltx/en_us_oca/me.m07.d13:meMA.Ode4C21.text	
ltx/en_us_oca/me.m07.d13:meMA.Ode4C22.incipit	…
ltx/en_us_oca/me.m07.d13:meMA.Ode4C22.melody	@ltx/en_us_oca/he.h.m2:heHE.ElilythasEkParthenou.notmetered
ltx/en_us_oca/me.m07.d13:meMA.Ode4C22.mode	@ltx/en_us_oca/miscellanea:misc.Mode2
ltx/en_us_oca/me.m07.d13:meMA.Ode4C22.ode	@ltx/en_us_oca/miscellanea:misc.Ode4
ltx/en_us_oca/me.m07.d13:meMA.Ode4C22.text	
ltx/en_us_oca/me.m07.d13:meMA.Ode4C23.incipit	…
ltx/en_us_oca/me.m07.d13:meMA.Ode4C23.melody	@ltx/en_us_oca/he.h.m2:heHE.ElilythasEkParthenou.notmetered
ltx/en_us_oca/me.m07.d13:meMA.Ode4C23.mode	@ltx/en_us_oca/miscellanea:misc.Mode2
ltx/en_us_oca/me.m07.d13:meMA.Ode4C23.ode	@ltx/en_us_oca/miscellanea:misc.Ode4
ltx/en_us_oca/me.m07.d13:meMA.Ode4C23.text	
ltx/en_us_oca/me.m07.d13:meMA.Ode4C2T.incipit	…
ltx/en_us_oca/me.m07.d13:meMA.Ode4C2T.melody	@ltx/en_us_oca/he.h.m2:heHE.ElilythasEkParthenou.notmetered
ltx/en_us_oca/me.m07.d13:meMA.Ode4C2T.mode	@ltx/en_us_oca/miscellanea:misc.Mode2
ltx/en_us_oca/me.m07.d13:meMA.Ode4C2T.ode	@ltx/en_us_oca/miscellanea:misc.Ode4
ltx/en_us_oca/me.m07.d13:meMA.Ode4C2T.text	
ltx/en_us_oca/me.m07.d13:meMA.Ode5C11.greekmelody	@ltx/en_us_oca/he.h.m4:heHE.ExestiTaSympanta.greekname
ltx/en_us_oca/me.m07.d13:meMA.Ode5C11.incipit	…
ltx/en_us_oca/me.m07.d13:meMA.Ode5C11.melody	@ltx/en_us_oca/he.h.m4:heHE.ExestiTaSympanta.notmetered
ltx/en_us_oca/me.m07.d13:meMA.Ode5C11.mode	@ltx/en_us_oca/miscellanea:misc.Mode4
ltx/en_us_oca/me.m07.d13:meMA.Ode5C11.ode	@ltx/en_us_oca/miscellanea:misc.Ode5
ltx/en_us_oca/me.m07.d13:meMA.Ode5C11.text	
ltx/en_us_oca/me.m07.d13:meMA.Ode5C12.incipit	…
ltx/en_us_oca/me.m07.d13:meMA.Ode5C12.melody	@ltx/en_us_oca/he.h.m4:heHE.ExestiTaSympanta.notmetered
ltx/en_us_oca/me.m07.d13:meMA.Ode5C12.mode	@ltx/en_us_oca/miscellanea:misc.Mode4
ltx/en_us_oca/me.m07.d13:meMA.Ode5C12.ode	@ltx/en_us_oca/miscellanea:misc.Ode5
ltx/en_us_oca/me.m07.d13:meMA.Ode5C12.text	
ltx/en_us_oca/me.m07.d13:meMA.Ode5C13.incipit	…
ltx/en_us_oca/me.m07.d13:meMA.Ode5C13.melody	@ltx/en_us_oca/he.h.m4:heHE.ExestiTaSympanta.notmetered
ltx/en_us_oca/me.m07.d13:meMA.Ode5C13.mode	@ltx/en_us_oca/miscellanea:misc.Mode4
ltx/en_us_oca/me.m07.d13:meMA.Ode5C13.ode	@ltx/en_us_oca/miscellanea:misc.Ode5
ltx/en_us_oca/me.m07.d13:meMA.Ode5C13.text	
ltx/en_us_oca/me.m07.d13:meMA.Ode5C1T.incipit	…
ltx/en_us_oca/me.m07.d13:meMA.Ode5C1T.melody	@ltx/en_us_oca/he.h.m4:heHE.ExestiTaSympanta.notmetered
ltx/en_us_oca/me.m07.d13:meMA.Ode5C1T.mode	@ltx/en_us_oca/miscellanea:misc.Mode4
ltx/en_us_oca/me.m07.d13:meMA.Ode5C1T.ode	@ltx/en_us_oca/miscellanea:misc.Ode5
ltx/en_us_oca/me.m07.d13:meMA.Ode5C1T.text	
ltx/en_us_oca/me.m07.d13:meMA.Ode5C21.greekmelody	@ltx/en_us_oca/he.h.m2:heHE.MesitisTheou.greekname
ltx/en_us_oca/me.m07.d13:meMA.Ode5C21.incipit	…
ltx/en_us_oca/me.m07.d13:meMA.Ode5C21.melody	@ltx/en_us_oca/he.h.m2:heHE.MesitisTheou.notmetered
ltx/en_us_oca/me.m07.d13:meMA.Ode5C21.mode	@ltx/en_us_oca/miscellanea:misc.Mode2
ltx/en_us_oca/me.m07.d13:meMA.Ode5C21.ode	@ltx/en_us_oca/miscellanea:misc.Ode5
ltx/en_us_oca/me.m07.d13:meMA.Ode5C21.text	
ltx/en_us_oca/me.m07.d13:meMA.Ode5C22.incipit	…
ltx/en_us_oca/me.m07.d13:meMA.Ode5C22.melody	@ltx/en_us_oca/he.h.m2:heHE.MesitisTheou.notmetered
ltx/en_us_oca/me.m07.d13:meMA.Ode5C22.mode	@ltx/en_us_oca/miscellanea:misc.Mode2
ltx/en_us_oca/me.m07.d13:meMA.Ode5C22.ode	@ltx/en_us_oca/miscellanea:misc.Ode5
ltx/en_us_oca/me.m07.d13:meMA.Ode5C22.text	
ltx/en_us_oca/me.m07.d13:meMA.Ode5C23.incipit	…
ltx/en_us_oca/me.m07.d13:meMA.Ode5C23.melody	@ltx/en_us_oca/he.h.m2:heHE.MesitisTheou.notmetered
ltx/en_us_oca/me.m07.d13:meMA.Ode5C23.mode	@ltx/en_us_oca/miscellanea:misc.Mode2
ltx/en_us_oca/me.m07.d13:meMA.Ode5C23.ode	@ltx/en_us_oca/miscellanea:misc.Ode5
ltx/en_us_oca/me.m07.d13:meMA.Ode5C23.text	
ltx/en_us_oca/me.m07.d13:meMA.Ode5C2T.incipit	…
ltx/en_us_oca/me.m07.d13:meMA.Ode5C2T.melody	@ltx/en_us_oca/he.h.m2:heHE.MesitisTheou.notmetered
ltx/en_us_oca/me.m07.d13:meMA.Ode5C2T.mode	@ltx/en_us_oca/miscellanea:misc.Mode2
ltx/en_us_oca/me.m07.d13:meMA.Ode5C2T.ode	@ltx/en_us_oca/miscellanea:misc.Ode5
ltx/en_us_oca/me.m07.d13:meMA.Ode5C2T.text	
ltx/en_us_oca/me.m07.d13:meMA.Ode6C11.greekmelody	@ltx/en_us_oca/he.h.m4:heHE.TinTheianTaftin.greekname
ltx/en_us_oca/me.m07.d13:meMA.Ode6C11.incipit	…
ltx/en_us_oca/me.m07.d13:meMA.Ode6C11.melody	@ltx/en_us_oca/he.h.m4:heHE.TinTheianTaftin.notmetered
ltx/en_us_oca/me.m07.d13:meMA.Ode6C11.mode	@ltx/en_us_oca/miscellanea:misc.Mode4
ltx/en_us_oca/me.m07.d13:meMA.Ode6C11.ode	@ltx/en_us_oca/miscellanea:misc.Ode6
ltx/en_us_oca/me.m07.d13:meMA.Ode6C11.text	
ltx/en_us_oca/me.m07.d13:meMA.Ode6C12.incipit	…
ltx/en_us_oca/me.m07.d13:meMA.Ode6C12.melody	@ltx/en_us_oca/he.h.m4:heHE.TinTheianTaftin.notmetered
ltx/en_us_oca/me.m07.d13:meMA.Ode6C12.mode	@ltx/en_us_oca/miscellanea:misc.Mode4
ltx/en_us_oca/me.m07.d13:meMA.Ode6C12.ode	@ltx/en_us_oca/miscellanea:misc.Ode6
ltx/en_us_oca/me.m07.d13:meMA.Ode6C12.text	
ltx/en_us_oca/me.m07.d13:meMA.Ode6C13.incipit	…
ltx/en_us_oca/me.m07.d13:meMA.Ode6C13.melody	@ltx/en_us_oca/he.h.m4:heHE.TinTheianTaftin.notmetered
ltx/en_us_oca/me.m07.d13:meMA.Ode6C13.mode	@ltx/en_us_oca/miscellanea:misc.Mode4
ltx/en_us_oca/me.m07.d13:meMA.Ode6C13.ode	@ltx/en_us_oca/miscellanea:misc.Ode6
ltx/en_us_oca/me.m07.d13:meMA.Ode6C13.text	
ltx/en_us_oca/me.m07.d13:meMA.Ode6C1T.incipit	…
ltx/en_us_oca/me.m07.d13:meMA.Ode6C1T.melody	@ltx/en_us_oca/he.h.m4:heHE.TinTheianTaftin.notmetered
ltx/en_us_oca/me.m07.d13:meMA.Ode6C1T.mode	@ltx/en_us_oca/miscellanea:misc.Mode4
ltx/en_us_oca/me.m07.d13:meMA.Ode6C1T.ode	@ltx/en_us_oca/miscellanea:misc.Ode6
ltx/en_us_oca/me.m07.d13:meMA.Ode6C1T.text	
ltx/en_us_oca/me.m07.d13:meMA.Ode6C21.greekmelody	@ltx/en_us_oca/he.h.m2:heHE.EnAvyssoPtaismaton.greekname
ltx/en_us_oca/me.m07.d13:meMA.Ode6C21.incipit	…
ltx/en_us_oca/me.m07.d13:meMA.Ode6C21.melody	@ltx/en_us_oca/he.h.m2:heHE.EnAvyssoPtaismaton.notmetered
ltx/en_us_oca/me.m07.d13:meMA.Ode6C21.mode	@ltx/en_us_oca/miscellanea:misc.Mode2
ltx/en_us_oca/me.m07.d13:meMA.Ode6C21.ode	@ltx/en_us_oca/miscellanea:misc.Ode6
ltx/en_us_oca/me.m07.d13:meMA.Ode6C21.text	
ltx/en_us_oca/me.m07.d13:meMA.Ode6C22.incipit	…
ltx/en_us_oca/me.m07.d13:meMA.Ode6C22.melody	@ltx/en_us_oca/he.h.m2:heHE.EnAvyssoPtaismaton.notmetered
ltx/en_us_oca/me.m07.d13:meMA.Ode6C22.mode	@ltx/en_us_oca/miscellanea:misc.Mode2
ltx/en_us_oca/me.m07.d13:meMA.Ode6C22.ode	@ltx/en_us_oca/miscellanea:misc.Ode6
ltx/en_us_oca/me.m07.d13:meMA.Ode6C22.text	
ltx/en_us_oca/me.m07.d13:meMA.Ode6C23.incipit	…
ltx/en_us_oca/me.m07.d13:meMA.Ode6C23.melody	@ltx/en_us_oca/he.h.m2:heHE.EnAvyssoPtaismaton.notmetered
ltx/en_us_oca/me.m07.d13:meMA.Ode6C23.mode	@ltx/en_us_oca/miscellanea:misc.Mode2
ltx/en_us_oca/me.m07.d13:meMA.Ode6C23.ode	@ltx/en_us_oca/miscellanea:misc.Ode6
ltx/en_us_oca/me.m07.d13:meMA.Ode6C23.text	
ltx/en_us_oca/me.m07.d13:meMA.Ode6C2T.incipit	…
ltx/en_us_oca/me.m07.d13:meMA.Ode6C2T.melody	@ltx/en_us_oca/he.h.m2:heHE.EnAvyssoPtaismaton.notmetered
ltx/en_us_oca/me.m07.d13:meMA.Ode6C2T.mode	@ltx/en_us_oca/miscellanea:misc.Mode2
ltx/en_us_oca/me.m07.d13:meMA.Ode6C2T.ode	@ltx/en_us_oca/miscellanea:misc.Ode6
ltx/en_us_oca/me.m07.d13:meMA.Ode6C2T.text	
ltx/en_us_oca/me.m07.d13:meMA.Ode6H.greekmelody	@ltx/en_us_oca/he.h.m2:heHE.EnAvyssoPtaismaton.greekname
ltx/en_us_oca/me.m07.d13:meMA.Ode6H.incipit	@ltx/en_us_oca/he.h.m2:heHE.EnAvyssoPtaismaton.incipit
ltx/en_us_oca/me.m07.d13:meMA.Ode6H.melody	@ltx/en_us_oca/he.h.m2:heHE.EnAvyssoPtaismaton.melody
ltx/en_us_oca/me.m07.d13:meMA.Ode6H.mode	@ltx/en_us_oca/miscellanea:misc.Mode2
ltx/en_us_oca/me.m07.d13:meMA.Ode6H.ode	@ltx/en_us_oca/miscellanea:misc.Ode6
ltx/en_us_oca/me.m07.d13:meMA.Ode6H.text	@ltx/en_us_oca/he.h.m2:heHE.EnAvyssoPtaismaton.text
ltx/en_us_oca/me.m07.d13:meMA.Ode7C11.greekmelody	@ltx/en_us_oca/he.h.m4:heHE.OukElatrefsan.greekname
ltx/en_us_oca/me.m07.d13:meMA.Ode7C11.incipit	…
ltx/en_us_oca/me.m07.d13:meMA.Ode7C11.melody	@ltx/en_us_oca/he.h.m4:heHE.OukElatrefsan.notmetered
ltx/en_us_oca/me.m07.d13:meMA.Ode7C11.mode	@ltx/en_us_oca/miscellanea:misc.Mode4
ltx/en_us_oca/me.m07.d13:meMA.Ode7C11.ode	@ltx/en_us_oca/miscellanea:misc.Ode7
ltx/en_us_oca/me.m07.d13:meMA.Ode7C11.text	
ltx/en_us_oca/me.m07.d13:meMA.Ode7C12.incipit	…
ltx/en_us_oca/me.m07.d13:meMA.Ode7C12.melody	@ltx/en_us_oca/he.h.m4:heHE.OukElatrefsan.notmetered
ltx/en_us_oca/me.m07.d13:meMA.Ode7C12.mode	@ltx/en_us_oca/miscellanea:misc.Mode4
ltx/en_us_oca/me.m07.d13:meMA.Ode7C12.ode	@ltx/en_us_oca/miscellanea:misc.Ode7
ltx/en_us_oca/me.m07.d13:meMA.Ode7C12.text	
ltx/en_us_oca/me.m07.d13:meMA.Ode7C13.incipit	…
ltx/en_us_oca/me.m07.d13:meMA.Ode7C13.melody	@ltx/en_us_oca/he.h.m4:heHE.OukElatrefsan.notmetered
ltx/en_us_oca/me.m07.d13:meMA.Ode7C13.mode	@ltx/en_us_oca/miscellanea:misc.Mode4
ltx/en_us_oca/me.m07.d13:meMA.Ode7C13.ode	@ltx/en_us_oca/miscellanea:misc.Ode7
ltx/en_us_oca/me.m07.d13:meMA.Ode7C13.text	
ltx/en_us_oca/me.m07.d13:meMA.Ode7C1T.incipit	…
ltx/en_us_oca/me.m07.d13:meMA.Ode7C1T.melody	@ltx/en_us_oca/he.h.m4:heHE.OukElatrefsan.notmetered
ltx/en_us_oca/me.m07.d13:meMA.Ode7C1T.mode	@ltx/en_us_oca/miscellanea:misc.Mode4
ltx/en_us_oca/me.m07.d13:meMA.Ode7C1T.ode	@ltx/en_us_oca/miscellanea:misc.Ode7
ltx/en_us_oca/me.m07.d13:meMA.Ode7C1T.text	
ltx/en_us_oca/me.m07.d13:meMA.Ode7C21.greekmelody	@ltx/en_us_oca/he.h.m2:heHE.AntitheonProstagma.greekname
ltx/en_us_oca/me.m07.d13:meMA.Ode7C21.incipit	…
ltx/en_us_oca/me.m07.d13:meMA.Ode7C21.melody	@ltx/en_us_oca/he.h.m2:heHE.AntitheonProstagma.notmetered
ltx/en_us_oca/me.m07.d13:meMA.Ode7C21.mode	@ltx/en_us_oca/miscellanea:misc.Mode2
ltx/en_us_oca/me.m07.d13:meMA.Ode7C21.ode	@ltx/en_us_oca/miscellanea:misc.Ode7
ltx/en_us_oca/me.m07.d13:meMA.Ode7C21.text	
ltx/en_us_oca/me.m07.d13:meMA.Ode7C22.incipit	…
ltx/en_us_oca/me.m07.d13:meMA.Ode7C22.melody	@ltx/en_us_oca/he.h.m2:heHE.AntitheonProstagma.notmetered
ltx/en_us_oca/me.m07.d13:meMA.Ode7C22.mode	@ltx/en_us_oca/miscellanea:misc.Mode2
ltx/en_us_oca/me.m07.d13:meMA.Ode7C22.ode	@ltx/en_us_oca/miscellanea:misc.Ode7
ltx/en_us_oca/me.m07.d13:meMA.Ode7C22.text	
ltx/en_us_oca/me.m07.d13:meMA.Ode7C23.incipit	…
ltx/en_us_oca/me.m07.d13:meMA.Ode7C23.melody	@ltx/en_us_oca/he.h.m2:heHE.AntitheonProstagma.notmetered
ltx/en_us_oca/me.m07.d13:meMA.Ode7C23.mode	@ltx/en_us_oca/miscellanea:misc.Mode2
ltx/en_us_oca/me.m07.d13:meMA.Ode7C23.ode	@ltx/en_us_oca/miscellanea:misc.Ode7
ltx/en_us_oca/me.m07.d13:meMA.Ode7C23.text	
ltx/en_us_oca/me.m07.d13:meMA.Ode7C2T.incipit	…
ltx/en_us_oca/me.m07.d13:meMA.Ode7C2T.melody	@ltx/en_us_oca/he.h.m2:heHE.AntitheonProstagma.notmetered
ltx/en_us_oca/me.m07.d13:meMA.Ode7C2T.mode	@ltx/en_us_oca/miscellanea:misc.Mode2
ltx/en_us_oca/me.m07.d13:meMA.Ode7C2T.ode	@ltx/en_us_oca/miscellanea:misc.Ode7
ltx/en_us_oca/me.m07.d13:meMA.Ode7C2T.text	
ltx/en_us_oca/me.m07.d13:meMA.Ode8C11.greekmelody	@ltx/en_us_oca/he.h.m4:heHE.PaidasEvageis.greekname
ltx/en_us_oca/me.m07.d13:meMA.Ode8C11.incipit	…
ltx/en_us_oca/me.m07.d13:meMA.Ode8C11.melody	@ltx/en_us_oca/he.h.m4:heHE.PaidasEvageis.notmetered
ltx/en_us_oca/me.m07.d13:meMA.Ode8C11.mode	@ltx/en_us_oca/miscellanea:misc.Mode4
ltx/en_us_oca/me.m07.d13:meMA.Ode8C11.ode	@ltx/en_us_oca/miscellanea:misc.Ode8
ltx/en_us_oca/me.m07.d13:meMA.Ode8C11.text	
ltx/en_us_oca/me.m07.d13:meMA.Ode8C12.incipit	…
ltx/en_us_oca/me.m07.d13:meMA.Ode8C12.melody	@ltx/en_us_oca/he.h.m4:heHE.PaidasEvageis.notmetered
ltx/en_us_oca/me.m07.d13:meMA.Ode8C12.mode	@ltx/en_us_oca/miscellanea:misc.Mode4
ltx/en_us_oca/me.m07.d13:meMA.Ode8C12.ode	@ltx/en_us_oca/miscellanea:misc.Ode8
ltx/en_us_oca/me.m07.d13:meMA.Ode8C12.text	
ltx/en_us_oca/me.m07.d13:meMA.Ode8C13.incipit	…
ltx/en_us_oca/me.m07.d13:meMA.Ode8C13.melody	@ltx/en_us_oca/he.h.m4:heHE.PaidasEvageis.notmetered
ltx/en_us_oca/me.m07.d13:meMA.Ode8C13.mode	@ltx/en_us_oca/miscellanea:misc.Mode4
ltx/en_us_oca/me.m07.d13:meMA.Ode8C13.ode	@ltx/en_us_oca/miscellanea:misc.Ode8
ltx/en_us_oca/me.m07.d13:meMA.Ode8C13.text	
ltx/en_us_oca/me.m07.d13:meMA.Ode8C14.incipit	…
ltx/en_us_oca/me.m07.d13:meMA.Ode8C14.melody	@ltx/en_us_oca/he.h.m4:heHE.PaidasEvageis.notmetered
ltx/en_us_oca/me.m07.d13:meMA.Ode8C14.mode	@ltx/en_us_oca/miscellanea:misc.Mode4
ltx/en_us_oca/me.m07.d13:meMA.Ode8C14.ode	@ltx/en_us_oca/miscellanea:misc.Ode8
ltx/en_us_oca/me.m07.d13:meMA.Ode8C14.text	
ltx/en_us_oca/me.m07.d13:meMA.Ode8C1T.incipit	…
ltx/en_us_oca/me.m07.d13:meMA.Ode8C1T.melody	@ltx/en_us_oca/he.h.m4:heHE.PaidasEvageis.notmetered
ltx/en_us_oca/me.m07.d13:meMA.Ode8C1T.mode	@ltx/en_us_oca/miscellanea:misc.Mode4
ltx/en_us_oca/me.m07.d13:meMA.Ode8C1T.ode	@ltx/en_us_oca/miscellanea:misc.Ode8
ltx/en_us_oca/me.m07.d13:meMA.Ode8C1T.text	
ltx/en_us_oca/me.m07.d13:meMA.Ode8C21.greekmelody	@ltx/en_us_oca/he.h.m2:heHE.KaminosPote.greekname
ltx/en_us_oca/me.m07.d13:meMA.Ode8C21.incipit	…
ltx/en_us_oca/me.m07.d13:meMA.Ode8C21.melody	@ltx/en_us_oca/he.h.m2:heHE.KaminosPote.notmetered
ltx/en_us_oca/me.m07.d13:meMA.Ode8C21.mode	@ltx/en_us_oca/miscellanea:misc.Mode2
ltx/en_us_oca/me.m07.d13:meMA.Ode8C21.ode	@ltx/en_us_oca/miscellanea:misc.Ode8
ltx/en_us_oca/me.m07.d13:meMA.Ode8C21.text	
ltx/en_us_oca/me.m07.d13:meMA.Ode8C22.incipit	…
ltx/en_us_oca/me.m07.d13:meMA.Ode8C22.melody	@ltx/en_us_oca/he.h.m2:heHE.KaminosPote.notmetered
ltx/en_us_oca/me.m07.d13:meMA.Ode8C22.mode	@ltx/en_us_oca/miscellanea:misc.Mode2
ltx/en_us_oca/me.m07.d13:meMA.Ode8C22.ode	@ltx/en_us_oca/miscellanea:misc.Ode8
ltx/en_us_oca/me.m07.d13:meMA.Ode8C22.text	
ltx/en_us_oca/me.m07.d13:meMA.Ode8C23.incipit	…
ltx/en_us_oca/me.m07.d13:meMA.Ode8C23.melody	@ltx/en_us_oca/he.h.m2:heHE.KaminosPote.notmetered
ltx/en_us_oca/me.m07.d13:meMA.Ode8C23.mode	@ltx/en_us_oca/miscellanea:misc.Mode2
ltx/en_us_oca/me.m07.d13:meMA.Ode8C23.ode	@ltx/en_us_oca/miscellanea:misc.Ode8
ltx/en_us_oca/me.m07.d13:meMA.Ode8C23.text	
ltx/en_us_oca/me.m07.d13:meMA.Ode8C2T.incipit	…
ltx/en_us_oca/me.m07.d13:meMA.Ode8C2T.melody	@ltx/en_us_oca/he.h.m2:heHE.KaminosPote.notmetered
ltx/en_us_oca/me.m07.d13:meMA.Ode8C2T.mode	@ltx/en_us_oca/miscellanea:misc.Mode2
ltx/en_us_oca/me.m07.d13:meMA.Ode8C2T.ode	@ltx/en_us_oca/miscellanea:misc.Ode8
ltx/en_us_oca/me.m07.d13:meMA.Ode8C2T.text	
ltx/en_us_oca/me.m07.d13:meMA.Ode8H.greekmelody	@ltx/en_us_oca/he.h.m2:heHE.KaminosPote.greekname
ltx/en_us_oca/me.m07.d13:meMA.Ode8H.incipit	@ltx/en_us_oca/he.h.m2:heHE.KaminosPote.incipit
ltx/en_us_oca/me.m07.d13:meMA.Ode8H.melody	@ltx/en_us_oca/he.h.m2:heHE.KaminosPote.melody
ltx/en_us_oca/me.m07.d13:meMA.Ode8H.mode	@ltx/en_us_oca/miscellanea:misc.Mode2
ltx/en_us_oca/me.m07.d13:meMA.Ode8H.ode	@ltx/en_us_oca/miscellanea:misc.Ode8
ltx/en_us_oca/me.m07.d13:meMA.Ode8H.text	@ltx/en_us_oca/he.h.m2:heHE.KaminosPote.text
ltx/en_us_oca/me.m07.d13:meMA.Ode9C11.greekmelody	@ltx/en_us_oca/he.h.m4:heHE.ApasGigenis.greekname
ltx/en_us_oca/me.m07.d13:meMA.Ode9C11.incipit	…
ltx/en_us_oca/me.m07.d13:meMA.Ode9C11.melody	@ltx/en_us_oca/he.h.m4:heHE.ApasGigenis.notmetered
ltx/en_us_oca/me.m07.d13:meMA.Ode9C11.mode	@ltx/en_us_oca/miscellanea:misc.Mode4
ltx/en_us_oca/me.m07.d13:meMA.Ode9C11.ode	@ltx/en_us_oca/miscellanea:misc.Ode9
ltx/en_us_oca/me.m07.d13:meMA.Ode9C11.text	
ltx/en_us_oca/me.m07.d13:meMA.Ode9C12.incipit	…
ltx/en_us_oca/me.m07.d13:meMA.Ode9C12.melody	@ltx/en_us_oca/he.h.m4:heHE.ApasGigenis.notmetered
ltx/en_us_oca/me.m07.d13:meMA.Ode9C12.mode	@ltx/en_us_oca/miscellanea:misc.Mode4
ltx/en_us_oca/me.m07.d13:meMA.Ode9C12.ode	@ltx/en_us_oca/miscellanea:misc.Ode9
ltx/en_us_oca/me.m07.d13:meMA.Ode9C12.text	
ltx/en_us_oca/me.m07.d13:meMA.Ode9C13.incipit	…
ltx/en_us_oca/me.m07.d13:meMA.Ode9C13.melody	@ltx/en_us_oca/he.h.m4:heHE.ApasGigenis.notmetered
ltx/en_us_oca/me.m07.d13:meMA.Ode9C13.mode	@ltx/en_us_oca/miscellanea:misc.Mode4
ltx/en_us_oca/me.m07.d13:meMA.Ode9C13.ode	@ltx/en_us_oca/miscellanea:misc.Ode9
ltx/en_us_oca/me.m07.d13:meMA.Ode9C13.text	
ltx/en_us_oca/me.m07.d13:meMA.Ode9C14.incipit	…
ltx/en_us_oca/me.m07.d13:meMA.Ode9C14.melody	@ltx/en_us_oca/he.h.m4:heHE.ApasGigenis.notmetered
ltx/en_us_oca/me.m07.d13:meMA.Ode9C14.mode	@ltx/en_us_oca/miscellanea:misc.Mode4
ltx/en_us_oca/me.m07.d13:meMA.Ode9C14.ode	@ltx/en_us_oca/miscellanea:misc.Ode9
ltx/en_us_oca/me.m07.d13:meMA.Ode9C14.text	
ltx/en_us_oca/me.m07.d13:meMA.Ode9C1T.incipit	…
ltx/en_us_oca/me.m07.d13:meMA.Ode9C1T.melody	@ltx/en_us_oca/he.h.m4:heHE.ApasGigenis.notmetered
ltx/en_us_oca/me.m07.d13:meMA.Ode9C1T.mode	@ltx/en_us_oca/miscellanea:misc.Mode4
ltx/en_us_oca/me.m07.d13:meMA.Ode9C1T.ode	@ltx/en_us_oca/miscellanea:misc.Ode9
ltx/en_us_oca/me.m07.d13:meMA.Ode9C1T.text	
ltx/en_us_oca/me.m07.d13:meMA.Ode9C21.greekmelody	@ltx/en_us_oca/he.h.m2:heHE.AnarchouGennitoros.greekname
ltx/en_us_oca/me.m07.d13:meMA.Ode9C21.incipit	…
ltx/en_us_oca/me.m07.d13:meMA.Ode9C21.melody	@ltx/en_us_oca/he.h.m2:heHE.AnarchouGennitoros.notmetered
ltx/en_us_oca/me.m07.d13:meMA.Ode9C21.mode	@ltx/en_us_oca/miscellanea:misc.Mode2
ltx/en_us_oca/me.m07.d13:meMA.Ode9C21.ode	@ltx/en_us_oca/miscellanea:misc.Ode9
ltx/en_us_oca/me.m07.d13:meMA.Ode9C21.text	
ltx/en_us_oca/me.m07.d13:meMA.Ode9C22.incipit	…
ltx/en_us_oca/me.m07.d13:meMA.Ode9C22.melody	@ltx/en_us_oca/he.h.m2:heHE.AnarchouGennitoros.notmetered
ltx/en_us_oca/me.m07.d13:meMA.Ode9C22.mode	@ltx/en_us_oca/miscellanea:misc.Mode2
ltx/en_us_oca/me.m07.d13:meMA.Ode9C22.ode	@ltx/en_us_oca/miscellanea:misc.Ode9
ltx/en_us_oca/me.m07.d13:meMA.Ode9C22.text	
ltx/en_us_oca/me.m07.d13:meMA.Ode9C23.incipit	…
ltx/en_us_oca/me.m07.d13:meMA.Ode9C23.melody	@ltx/en_us_oca/he.h.m2:heHE.AnarchouGennitoros.notmetered
ltx/en_us_oca/me.m07.d13:meMA.Ode9C23.mode	@ltx/en_us_oca/miscellanea:misc.Mode2
ltx/en_us_oca/me.m07.d13:meMA.Ode9C23.ode	@ltx/en_us_oca/miscellanea:misc.Ode9
ltx/en_us_oca/me.m07.d13:meMA.Ode9C23.text	
ltx/en_us_oca/me.m07.d13:meMA.Ode9C2T.incipit	…
ltx/en_us_oca/me.m07.d13:meMA.Ode9C2T.melody	@ltx/en_us_oca/he.h.m2:heHE.AnarchouGennitoros.notmetered
ltx/en_us_oca/me.m07.d13:meMA.Ode9C2T.mode	@ltx/en_us_oca/miscellanea:misc.Mode2
ltx/en_us_oca/me.m07.d13:meMA.Ode9C2T.ode	@ltx/en_us_oca/miscellanea:misc.Ode9
ltx/en_us_oca/me.m07.d13:meMA.Ode9C2T.text	
ltx/en_us_oca/me.m07.d13:meMA.Ode9H.greekmelody	@ltx/en_us_oca/he.h.m2:heHE.AnarchouGennitoros.greekname
ltx/en_us_oca/me.m07.d13:meMA.Ode9H.incipit	@ltx/en_us_oca/he.h.m2:heHE.AnarchouGennitoros.incipit
ltx/en_us_oca/me.m07.d13:meMA.Ode9H.melody	@ltx/en_us_oca/he.h.m2:heHE.AnarchouGennitoros.melody
ltx/en_us_oca/me.m07.d13:meMA.Ode9H.mode	@ltx/en_us_oca/miscellanea:misc.Mode2
ltx/en_us_oca/me.m07.d13:meMA.Ode9H.ode	@ltx/en_us_oca/miscellanea:misc.Ode9
ltx/en_us_oca/me.m07.d13:meMA.Ode9H.text	@ltx/en_us_oca/he.h.m2:heHE.AnarchouGennitoros.text
ltx/en_us_oca/me.m07.d13:meVE.Apolytikion1.greekmelody	@ltx/en_us_oca/he.a.m4:heAU.OYpsotheisEnToStavro.greekname
ltx/en_us_oca/me.m07.d13:meVE.Apolytikion1.incipit	…
ltx/en_us_oca/me.m07.d13:meVE.Apolytikion1.melody	@ltx/en_us_oca/he.a.m4:heAU.OYpsotheisEnToStavro.notmetered
ltx/en_us_oca/me.m07.d13:meVE.Apolytikion1.mode	@ltx/en_us_oca/miscellanea:misc.Mode4
ltx/en_us_oca/me.m07.d13:meVE.Apolytikion1.text	
ltx/en_us_oca/me.m07.d13:meVE.Apolytikion2ger.greekmelody	@ltx/en_us_oca/he.a.m4:heAU.TachyProkatalave.greekname
ltx/en_us_oca/me.m07.d13:meVE.Apolytikion2ger.incipit	…
ltx/en_us_oca/me.m07.d13:meVE.Apolytikion2ger.melody	@ltx/en_us_oca/he.a.m4:heAU.TachyProkatalave.notmetered
ltx/en_us_oca/me.m07.d13:meVE.Apolytikion2ger.mode	@ltx/en_us_oca/miscellanea:misc.Mode4
ltx/en_us_oca/me.m07.d13:meVE.Apolytikion2ger.poet	@ltx/en_us_oca/poets:po.Gerasimou
ltx/en_us_oca/me.m07.d13:meVE.Apolytikion2ger.text	
ltx/en_us_oca/me.m07.d13:meVE.AposGlory.incipit	…
ltx/en_us_oca/me.m07.d13:meVE.AposGlory.melody	
ltx/en_us_oca/me.m07.d13:meVE.AposGlory.mode	@ltx/en_us_oca/miscellanea:misc.Mode8
ltx/en_us_oca/me.m07.d13:meVE.AposGlory.text	
ltx/en_us_oca/me.m07.d13:meVE.Aposticha1.greekmelody	@ltx/en_us_oca/he.a.m4:heAU.EdokasSimeiosin.greekname
ltx/en_us_oca/me.m07.d13:meVE.Aposticha1.incipit	The eternal Wisdom established you…
ltx/en_us_oca/me.m07.d13:meVE.Aposticha1.melody	@ltx/en_us_oca/he.a.m4:heAU.EdokasSimeiosin.notmetered
ltx/en_us_oca/me.m07.d13:meVE.Aposticha1.mode	@ltx/en_us_oca/miscellanea:misc.Mode4
ltx/en_us_oca/me.m07.d13:meVE.Aposticha1.text	The eternal Wisdom established you, Gabriel, ⁄ a light reflecting things divine, ⁄ illumining the whole creation, ⁄ revealing to us the divine mystery hidden from before the ages: ⁄ God Who is bodiless made flesh in a Virgin womb ⁄⁄ and become Man that He might save mankind.
ltx/en_us_oca/me.m07.d13:meVE.Aposticha2.incipit	Standing before the throne of…
ltx/en_us_oca/me.m07.d13:meVE.Aposticha2.melody	@ltx/en_us_oca/he.a.m4:heAU.EdokasSimeiosin.notmetered
ltx/en_us_oca/me.m07.d13:meVE.Aposticha2.mode	@ltx/en_us_oca/miscellanea:misc.Mode4
ltx/en_us_oca/me.m07.d13:meVE.Aposticha2.text	Standing before the throne of the tri-luminary Godhead, ⁄ brilliant with the rays of its unceasing light, ⁄ You cry out joyfully, Gabriel, leader of the angels, ⁄ with all the powers above: ⁄ Holy are You, Father! ⁄ Holy are You, co-eternal Word! ⁄ Holy are You, Holy Spirit! ⁄ One Glory, one Kingdom, one Nature, one Godhead, and one Power!
ltx/en_us_oca/me.m07.d13:meVE.Aposticha3.incipit	Destroy the wanton violence of…
ltx/en_us_oca/me.m07.d13:meVE.Aposticha3.melody	@ltx/en_us_oca/he.a.m4:heAU.EdokasSimeiosin.notmetered
ltx/en_us_oca/me.m07.d13:meVE.Aposticha3.mode	@ltx/en_us_oca/miscellanea:misc.Mode4
ltx/en_us_oca/me.m07.d13:meVE.Aposticha3.text	Destroy the wanton violence of Hagar’s sons: ⁄ The enemies who attack your flock; ⁄ heal the divisions of the Church, ⁄ calm the storm of unending temptations; ⁄ deliver from danger and calamities ⁄ those who honor you in love, ⁄ and hasten to your protection, Gabriel the archangel, ⁄ the intercessor for our souls!
ltx/en_us_oca/me.m07.d13:meVE.SticGlory.incipit	…
ltx/en_us_oca/me.m07.d13:meVE.SticGlory.melody	
ltx/en_us_oca/me.m07.d13:meVE.SticGlory.mode	@ltx/en_us_oca/miscellanea:misc.Mode6
ltx/en_us_oca/me.m07.d13:meVE.SticGlory.text	
ltx/en_us_oca/me.m07.d13:meVE.SticTheotokion.incipit	@ltx/en_us_oca/oc.m6.d3:ocMA.AposTheotokion.incipit
ltx/en_us_oca/me.m07.d13:meVE.SticTheotokion.melody	
ltx/en_us_oca/me.m07.d13:meVE.SticTheotokion.mode	@ltx/en_us_oca/miscellanea:misc.Mode6
ltx/en_us_oca/me.m07.d13:meVE.SticTheotokion.text	@ltx/en_us_oca/oc.m6.d3:ocMA.AposTheotokion.text
ltx/en_us_oca/me.m07.d13:meVE.Stichera01.greekmelody	@ltx/en_us_oca/he.a.m1:heAU.PaneffimoiMartyres.greekname
ltx/en_us_oca/me.m07.d13:meVE.Stichera01.incipit	…
ltx/en_us_oca/me.m07.d13:meVE.Stichera01.melody	@ltx/en_us_oca/he.a.m1:heAU.PaneffimoiMartyres.notmetered
ltx/en_us_oca/me.m07.d13:meVE.Stichera01.mode	@ltx/en_us_oca/miscellanea:misc.Mode1
ltx/en_us_oca/me.m07.d13:meVE.Stichera01.text	
ltx/en_us_oca/me.m07.d13:meVE.Stichera02.incipit	…
ltx/en_us_oca/me.m07.d13:meVE.Stichera02.melody	@ltx/en_us_oca/he.a.m1:heAU.PaneffimoiMartyres.notmetered
ltx/en_us_oca/me.m07.d13:meVE.Stichera02.mode	@ltx/en_us_oca/miscellanea:misc.Mode1
ltx/en_us_oca/me.m07.d13:meVE.Stichera02.text	
ltx/en_us_oca/me.m07.d13:meVE.Stichera03.incipit	…
ltx/en_us_oca/me.m07.d13:meVE.Stichera03.melody	@ltx/en_us_oca/he.a.m1:heAU.PaneffimoiMartyres.notmetered
ltx/en_us_oca/me.m07.d13:meVE.Stichera03.mode	@ltx/en_us_oca/miscellanea:misc.Mode1
ltx/en_us_oca/me.m07.d13:meVE.Stichera03.text	
ltx/en_us_oca/me.m07.d13:meVE.Stichera04.greekmelody	@ltx/en_us_oca/he.a.m8:heAU.OTouParadoxou.greekname
ltx/en_us_oca/me.m07.d13:meVE.Stichera04.incipit	…
ltx/en_us_oca/me.m07.d13:meVE.Stichera04.melody	@ltx/en_us_oca/he.a.m8:heAU.OTouParadoxou.notmetered
ltx/en_us_oca/me.m07.d13:meVE.Stichera04.mode	@ltx/en_us_oca/miscellanea:misc.Mode8
ltx/en_us_oca/me.m07.d13:meVE.Stichera04.text	
ltx/en_us_oca/me.m07.d13:meVE.Stichera05.incipit	…
ltx/en_us_oca/me.m07.d13:meVE.Stichera05.melody	@ltx/en_us_oca/he.a.m8:heAU.OTouParadoxou.notmetered
ltx/en_us_oca/me.m07.d13:meVE.Stichera05.mode	@ltx/en_us_oca/miscellanea:misc.Mode8
ltx/en_us_oca/me.m07.d13:meVE.Stichera05.text	
ltx/en_us_oca/me.m07.d13:meVE.Stichera06.incipit	…
ltx/en_us_oca/me.m07.d13:meVE.Stichera06.melody	@ltx/en_us_oca/he.a.m8:heAU.OTouParadoxou.notmetered
ltx/en_us_oca/me.m07.d13:meVE.Stichera06.mode	@ltx/en_us_oca/miscellanea:misc.Mode8
ltx/en_us_oca/me.m07.d13:meVE.Stichera06.text	
