ltx/en_us_oca/me.m08.d08:alt1.meDA.commemoration.first_short	
ltx/en_us_oca/me.m08.d08:alt1.meLI.Megalynarion.text	
ltx/en_us_oca/me.m08.d08:meDA.commemoration.first	
ltx/en_us_oca/me.m08.d08:meDA.commemoration.first_name	
ltx/en_us_oca/me.m08.d08:meDA.commemoration.first_short	
ltx/en_us_oca/me.m08.d08:meDA.commemoration.first_title	
ltx/en_us_oca/me.m08.d08:meDA.commemoration.full	
ltx/en_us_oca/me.m08.d08:meDA.commemoration.second_name	
ltx/en_us_oca/me.m08.d08:meDA.commemoration.second_title	
ltx/en_us_oca/me.m08.d08:meDA.date	
ltx/en_us_oca/me.m08.d08:meDA.dismissal	@ltx/en_us_oca/dismissals:dis00.transfiguration
ltx/en_us_oca/me.m08.d08:meDA.fordate	
ltx/en_us_oca/me.m08.d08:meDA.insert1	
ltx/en_us_oca/me.m08.d08:meDA.insert2	
ltx/en_us_oca/me.m08.d08:meDA.note	
ltx/en_us_oca/me.m08.d08:meDA.pdfcoverdate	
ltx/en_us_oca/me.m08.d08:meDA.pdfheaderdate	
ltx/en_us_oca/me.m08.d08:meHO.commemorations	
ltx/en_us_oca/me.m08.d08:meHO.note1	
ltx/en_us_oca/me.m08.d08:meHO.note2	
ltx/en_us_oca/me.m08.d08:meHO.number	
ltx/en_us_oca/me.m08.d08:meHO.rank	
ltx/en_us_oca/me.m08.d08:meLE.commemoration1	
ltx/en_us_oca/me.m08.d08:meLE.commemoration2	
ltx/en_us_oca/me.m08.d08:meLI.Kontakion1.incipit	…
ltx/en_us_oca/me.m08.d08:meLI.Kontakion1.melody	
ltx/en_us_oca/me.m08.d08:meLI.Kontakion1.mode	
ltx/en_us_oca/me.m08.d08:meLI.Kontakion1.text	
ltx/en_us_oca/me.m08.d08:meLI.Megalynarion.text	
ltx/en_us_oca/me.m08.d08:meMA.AposGlory.incipit	@ltx/en_us_oca/me.m08.d06:meVE.Aposticha3.incipit
ltx/en_us_oca/me.m08.d08:meMA.AposGlory.melody	
ltx/en_us_oca/me.m08.d08:meMA.AposGlory.mode	@ltx/en_us_oca/miscellanea:misc.Mode1
ltx/en_us_oca/me.m08.d08:meMA.AposGlory.text	@ltx/en_us_oca/me.m08.d06:meVE.Aposticha3.text
ltx/en_us_oca/me.m08.d08:meMA.Aposticha1.greekmelody	@ltx/en_us_oca/he.a.m2:heAU.OikosTouEfratha.greekname
ltx/en_us_oca/me.m08.d08:meMA.Aposticha1.incipit	…
ltx/en_us_oca/me.m08.d08:meMA.Aposticha1.melody	@ltx/en_us_oca/he.a.m2:heAU.OikosTouEfratha.notmetered
ltx/en_us_oca/me.m08.d08:meMA.Aposticha1.mode	@ltx/en_us_oca/miscellanea:misc.Mode2
ltx/en_us_oca/me.m08.d08:meMA.Aposticha1.text	
ltx/en_us_oca/me.m08.d08:meMA.Aposticha2.incipit	…
ltx/en_us_oca/me.m08.d08:meMA.Aposticha2.melody	@ltx/en_us_oca/he.a.m2:heAU.OikosTouEfratha.notmetered
ltx/en_us_oca/me.m08.d08:meMA.Aposticha2.mode	@ltx/en_us_oca/miscellanea:misc.Mode2
ltx/en_us_oca/me.m08.d08:meMA.Aposticha2.text	
ltx/en_us_oca/me.m08.d08:meMA.Aposticha3.incipit	…
ltx/en_us_oca/me.m08.d08:meMA.Aposticha3.melody	@ltx/en_us_oca/he.a.m2:heAU.OikosTouEfratha.notmetered
ltx/en_us_oca/me.m08.d08:meMA.Aposticha3.mode	@ltx/en_us_oca/miscellanea:misc.Mode2
ltx/en_us_oca/me.m08.d08:meMA.Aposticha3.text	
ltx/en_us_oca/me.m08.d08:meMA.C1.acrostic.notice1	
ltx/en_us_oca/me.m08.d08:meMA.C1.acrostic.text	
ltx/en_us_oca/me.m08.d08:meMA.C1.acrostic.title	
ltx/en_us_oca/me.m08.d08:meMA.C1.poet	@ltx/en_us_oca/poets:po.Theofanous
ltx/en_us_oca/me.m08.d08:meMA.C1.title	@ltx/en_us_oca/titles:ti.CanonSaintM
ltx/en_us_oca/me.m08.d08:meMA.C1.verse	@ltx/en_us_oca/prayers:pr.verse_SaintM.text
ltx/en_us_oca/me.m08.d08:meMA.Exaposteilarion1.greekmelody	@ltx/en_us_oca/he.a.m2:heAU.ToisMathitaisSynelthomen.greekname
ltx/en_us_oca/me.m08.d08:meMA.Exaposteilarion1.incipit	…
ltx/en_us_oca/me.m08.d08:meMA.Exaposteilarion1.melody	@ltx/en_us_oca/he.a.m2:heAU.ToisMathitaisSynelthomen.notmetered
ltx/en_us_oca/me.m08.d08:meMA.Exaposteilarion1.mode	@ltx/en_us_oca/miscellanea:misc.Mode2
ltx/en_us_oca/me.m08.d08:meMA.Exaposteilarion1.text	
ltx/en_us_oca/me.m08.d08:meMA.Exaposteilarion2.greekmelody	@ltx/en_us_oca/he.a.m2:heAU.ToisMathitaisSynelthomen.greekname
ltx/en_us_oca/me.m08.d08:meMA.Exaposteilarion2.incipit	…
ltx/en_us_oca/me.m08.d08:meMA.Exaposteilarion2.melody	@ltx/en_us_oca/he.a.m2:heAU.ToisMathitaisSynelthomen.notmetered
ltx/en_us_oca/me.m08.d08:meMA.Exaposteilarion2.mode	@ltx/en_us_oca/miscellanea:misc.Mode2
ltx/en_us_oca/me.m08.d08:meMA.Exaposteilarion2.text	
ltx/en_us_oca/me.m08.d08:meMA.Kathisma11.greekmelody	@ltx/en_us_oca/he.a.m4:heAU.KateplagiIosif.greekname
ltx/en_us_oca/me.m08.d08:meMA.Kathisma11.incipit	@ltx/en_us_oca/me.m08.d06:meMA.Kathisma11.incipit
ltx/en_us_oca/me.m08.d08:meMA.Kathisma11.melody	@ltx/en_us_oca/he.a.m4:heAU.KateplagiIosif.notmetered
ltx/en_us_oca/me.m08.d08:meMA.Kathisma11.mode	@ltx/en_us_oca/miscellanea:misc.Mode4
ltx/en_us_oca/me.m08.d08:meMA.Kathisma11.text	@ltx/en_us_oca/me.m08.d06:meMA.Kathisma11.text
ltx/en_us_oca/me.m08.d08:meMA.Kathisma21.greekmelody	@ltx/en_us_oca/he.a.m4:heAU.KateplagiIosif.greekname
ltx/en_us_oca/me.m08.d08:meMA.Kathisma21.incipit	…
ltx/en_us_oca/me.m08.d08:meMA.Kathisma21.melody	@ltx/en_us_oca/he.a.m4:heAU.KateplagiIosif.notmetered
ltx/en_us_oca/me.m08.d08:meMA.Kathisma21.mode	@ltx/en_us_oca/miscellanea:misc.Mode4
ltx/en_us_oca/me.m08.d08:meMA.Kathisma21.text	
ltx/en_us_oca/me.m08.d08:meMA.Ode1C11.greekmelody	@ltx/en_us_oca/he.h.m1:heHE.SouITropaiouchos.greekname
ltx/en_us_oca/me.m08.d08:meMA.Ode1C11.incipit	…
ltx/en_us_oca/me.m08.d08:meMA.Ode1C11.melody	@ltx/en_us_oca/he.h.m1:heHE.SouITropaiouchos.notmetered
ltx/en_us_oca/me.m08.d08:meMA.Ode1C11.mode	@ltx/en_us_oca/miscellanea:misc.Mode1
ltx/en_us_oca/me.m08.d08:meMA.Ode1C11.ode	@ltx/en_us_oca/miscellanea:misc.Ode1
ltx/en_us_oca/me.m08.d08:meMA.Ode1C11.text	
ltx/en_us_oca/me.m08.d08:meMA.Ode1C12.incipit	…
ltx/en_us_oca/me.m08.d08:meMA.Ode1C12.melody	@ltx/en_us_oca/he.h.m1:heHE.SouITropaiouchos.notmetered
ltx/en_us_oca/me.m08.d08:meMA.Ode1C12.mode	@ltx/en_us_oca/miscellanea:misc.Mode1
ltx/en_us_oca/me.m08.d08:meMA.Ode1C12.ode	@ltx/en_us_oca/miscellanea:misc.Ode1
ltx/en_us_oca/me.m08.d08:meMA.Ode1C12.text	
ltx/en_us_oca/me.m08.d08:meMA.Ode1C13.incipit	…
ltx/en_us_oca/me.m08.d08:meMA.Ode1C13.melody	@ltx/en_us_oca/he.h.m1:heHE.SouITropaiouchos.notmetered
ltx/en_us_oca/me.m08.d08:meMA.Ode1C13.mode	@ltx/en_us_oca/miscellanea:misc.Mode1
ltx/en_us_oca/me.m08.d08:meMA.Ode1C13.ode	@ltx/en_us_oca/miscellanea:misc.Ode1
ltx/en_us_oca/me.m08.d08:meMA.Ode1C13.text	
ltx/en_us_oca/me.m08.d08:meMA.Ode1C14.incipit	…
ltx/en_us_oca/me.m08.d08:meMA.Ode1C14.melody	@ltx/en_us_oca/he.h.m1:heHE.SouITropaiouchos.notmetered
ltx/en_us_oca/me.m08.d08:meMA.Ode1C14.mode	@ltx/en_us_oca/miscellanea:misc.Mode1
ltx/en_us_oca/me.m08.d08:meMA.Ode1C14.ode	@ltx/en_us_oca/miscellanea:misc.Ode1
ltx/en_us_oca/me.m08.d08:meMA.Ode1C14.text	
ltx/en_us_oca/me.m08.d08:meMA.Ode1C1T.incipit	…
ltx/en_us_oca/me.m08.d08:meMA.Ode1C1T.melody	@ltx/en_us_oca/he.h.m1:heHE.SouITropaiouchos.notmetered
ltx/en_us_oca/me.m08.d08:meMA.Ode1C1T.mode	@ltx/en_us_oca/miscellanea:misc.Mode1
ltx/en_us_oca/me.m08.d08:meMA.Ode1C1T.ode	@ltx/en_us_oca/miscellanea:misc.Ode1
ltx/en_us_oca/me.m08.d08:meMA.Ode1C1T.text	
ltx/en_us_oca/me.m08.d08:meMA.Ode3C11.greekmelody	@ltx/en_us_oca/he.h.m1:heHE.OMonosEidos.greekname
ltx/en_us_oca/me.m08.d08:meMA.Ode3C11.incipit	…
ltx/en_us_oca/me.m08.d08:meMA.Ode3C11.melody	@ltx/en_us_oca/he.h.m1:heHE.OMonosEidos.notmetered
ltx/en_us_oca/me.m08.d08:meMA.Ode3C11.mode	@ltx/en_us_oca/miscellanea:misc.Mode1
ltx/en_us_oca/me.m08.d08:meMA.Ode3C11.ode	@ltx/en_us_oca/miscellanea:misc.Ode3
ltx/en_us_oca/me.m08.d08:meMA.Ode3C11.text	
ltx/en_us_oca/me.m08.d08:meMA.Ode3C12.incipit	…
ltx/en_us_oca/me.m08.d08:meMA.Ode3C12.melody	@ltx/en_us_oca/he.h.m1:heHE.OMonosEidos.notmetered
ltx/en_us_oca/me.m08.d08:meMA.Ode3C12.mode	@ltx/en_us_oca/miscellanea:misc.Mode1
ltx/en_us_oca/me.m08.d08:meMA.Ode3C12.ode	@ltx/en_us_oca/miscellanea:misc.Ode3
ltx/en_us_oca/me.m08.d08:meMA.Ode3C12.text	
ltx/en_us_oca/me.m08.d08:meMA.Ode3C13.incipit	…
ltx/en_us_oca/me.m08.d08:meMA.Ode3C13.melody	@ltx/en_us_oca/he.h.m1:heHE.OMonosEidos.notmetered
ltx/en_us_oca/me.m08.d08:meMA.Ode3C13.mode	@ltx/en_us_oca/miscellanea:misc.Mode1
ltx/en_us_oca/me.m08.d08:meMA.Ode3C13.ode	@ltx/en_us_oca/miscellanea:misc.Ode3
ltx/en_us_oca/me.m08.d08:meMA.Ode3C13.text	
ltx/en_us_oca/me.m08.d08:meMA.Ode3C1T.incipit	…
ltx/en_us_oca/me.m08.d08:meMA.Ode3C1T.melody	@ltx/en_us_oca/he.h.m1:heHE.OMonosEidos.notmetered
ltx/en_us_oca/me.m08.d08:meMA.Ode3C1T.mode	@ltx/en_us_oca/miscellanea:misc.Mode1
ltx/en_us_oca/me.m08.d08:meMA.Ode3C1T.ode	@ltx/en_us_oca/miscellanea:misc.Ode3
ltx/en_us_oca/me.m08.d08:meMA.Ode3C1T.text	
ltx/en_us_oca/me.m08.d08:meMA.Ode3H.greekmelody	@ltx/en_us_oca/he.h.m1:heHE.OMonosEidos.greekname
ltx/en_us_oca/me.m08.d08:meMA.Ode3H.incipit	@ltx/en_us_oca/he.h.m1:heHE.OMonosEidos.incipit
ltx/en_us_oca/me.m08.d08:meMA.Ode3H.melody	@ltx/en_us_oca/he.h.m1:heHE.OMonosEidos.melody
ltx/en_us_oca/me.m08.d08:meMA.Ode3H.mode	@ltx/en_us_oca/miscellanea:misc.Mode1
ltx/en_us_oca/me.m08.d08:meMA.Ode3H.ode	@ltx/en_us_oca/miscellanea:misc.Ode3
ltx/en_us_oca/me.m08.d08:meMA.Ode3H.text	@ltx/en_us_oca/he.h.m1:heHE.OMonosEidos.text
ltx/en_us_oca/me.m08.d08:meMA.Ode3Kathisma1.greekmelody	@ltx/en_us_oca/he.a.m3:heAU.TheiasPisteos.greekname
ltx/en_us_oca/me.m08.d08:meMA.Ode3Kathisma1.incipit	…
ltx/en_us_oca/me.m08.d08:meMA.Ode3Kathisma1.melody	@ltx/en_us_oca/he.a.m3:heAU.TheiasPisteos.notmetered
ltx/en_us_oca/me.m08.d08:meMA.Ode3Kathisma1.mode	@ltx/en_us_oca/miscellanea:misc.Mode3
ltx/en_us_oca/me.m08.d08:meMA.Ode3Kathisma1.text	
ltx/en_us_oca/me.m08.d08:meMA.Ode3Kathisma2.greekmelody	@ltx/en_us_oca/he.a.m3:heAU.TinOraiotita.greekname
ltx/en_us_oca/me.m08.d08:meMA.Ode3Kathisma2.incipit	…
ltx/en_us_oca/me.m08.d08:meMA.Ode3Kathisma2.melody	@ltx/en_us_oca/he.a.m3:heAU.TinOraiotita.notmetered
ltx/en_us_oca/me.m08.d08:meMA.Ode3Kathisma2.mode	@ltx/en_us_oca/miscellanea:misc.Mode3
ltx/en_us_oca/me.m08.d08:meMA.Ode3Kathisma2.text	
ltx/en_us_oca/me.m08.d08:meMA.Ode4C11.greekmelody	@ltx/en_us_oca/he.h.m1:heHE.OrosSeTiChariti.greekname
ltx/en_us_oca/me.m08.d08:meMA.Ode4C11.incipit	…
ltx/en_us_oca/me.m08.d08:meMA.Ode4C11.melody	@ltx/en_us_oca/he.h.m1:heHE.OrosSeTiChariti.notmetered
ltx/en_us_oca/me.m08.d08:meMA.Ode4C11.mode	@ltx/en_us_oca/miscellanea:misc.Mode1
ltx/en_us_oca/me.m08.d08:meMA.Ode4C11.ode	@ltx/en_us_oca/miscellanea:misc.Ode4
ltx/en_us_oca/me.m08.d08:meMA.Ode4C11.text	
ltx/en_us_oca/me.m08.d08:meMA.Ode4C12.incipit	…
ltx/en_us_oca/me.m08.d08:meMA.Ode4C12.melody	@ltx/en_us_oca/he.h.m1:heHE.OrosSeTiChariti.notmetered
ltx/en_us_oca/me.m08.d08:meMA.Ode4C12.mode	@ltx/en_us_oca/miscellanea:misc.Mode1
ltx/en_us_oca/me.m08.d08:meMA.Ode4C12.ode	@ltx/en_us_oca/miscellanea:misc.Ode4
ltx/en_us_oca/me.m08.d08:meMA.Ode4C12.text	
ltx/en_us_oca/me.m08.d08:meMA.Ode4C13.incipit	…
ltx/en_us_oca/me.m08.d08:meMA.Ode4C13.melody	@ltx/en_us_oca/he.h.m1:heHE.OrosSeTiChariti.notmetered
ltx/en_us_oca/me.m08.d08:meMA.Ode4C13.mode	@ltx/en_us_oca/miscellanea:misc.Mode1
ltx/en_us_oca/me.m08.d08:meMA.Ode4C13.ode	@ltx/en_us_oca/miscellanea:misc.Ode4
ltx/en_us_oca/me.m08.d08:meMA.Ode4C13.text	
ltx/en_us_oca/me.m08.d08:meMA.Ode4C1T.incipit	…
ltx/en_us_oca/me.m08.d08:meMA.Ode4C1T.melody	@ltx/en_us_oca/he.h.m1:heHE.OrosSeTiChariti.notmetered
ltx/en_us_oca/me.m08.d08:meMA.Ode4C1T.mode	@ltx/en_us_oca/miscellanea:misc.Mode1
ltx/en_us_oca/me.m08.d08:meMA.Ode4C1T.ode	@ltx/en_us_oca/miscellanea:misc.Ode4
ltx/en_us_oca/me.m08.d08:meMA.Ode4C1T.text	
ltx/en_us_oca/me.m08.d08:meMA.Ode5C11.greekmelody	@ltx/en_us_oca/he.h.m1:heHE.TheosOnEirinis.greekname
ltx/en_us_oca/me.m08.d08:meMA.Ode5C11.incipit	…
ltx/en_us_oca/me.m08.d08:meMA.Ode5C11.melody	@ltx/en_us_oca/he.h.m1:heHE.TheosOnEirinis.notmetered
ltx/en_us_oca/me.m08.d08:meMA.Ode5C11.mode	@ltx/en_us_oca/miscellanea:misc.Mode1
ltx/en_us_oca/me.m08.d08:meMA.Ode5C11.ode	@ltx/en_us_oca/miscellanea:misc.Ode5
ltx/en_us_oca/me.m08.d08:meMA.Ode5C11.text	
ltx/en_us_oca/me.m08.d08:meMA.Ode5C12.incipit	…
ltx/en_us_oca/me.m08.d08:meMA.Ode5C12.melody	@ltx/en_us_oca/he.h.m1:heHE.TheosOnEirinis.notmetered
ltx/en_us_oca/me.m08.d08:meMA.Ode5C12.mode	@ltx/en_us_oca/miscellanea:misc.Mode1
ltx/en_us_oca/me.m08.d08:meMA.Ode5C12.ode	@ltx/en_us_oca/miscellanea:misc.Ode5
ltx/en_us_oca/me.m08.d08:meMA.Ode5C12.text	
ltx/en_us_oca/me.m08.d08:meMA.Ode5C13.incipit	…
ltx/en_us_oca/me.m08.d08:meMA.Ode5C13.melody	@ltx/en_us_oca/he.h.m1:heHE.TheosOnEirinis.notmetered
ltx/en_us_oca/me.m08.d08:meMA.Ode5C13.mode	@ltx/en_us_oca/miscellanea:misc.Mode1
ltx/en_us_oca/me.m08.d08:meMA.Ode5C13.ode	@ltx/en_us_oca/miscellanea:misc.Ode5
ltx/en_us_oca/me.m08.d08:meMA.Ode5C13.text	
ltx/en_us_oca/me.m08.d08:meMA.Ode5C1T.incipit	…
ltx/en_us_oca/me.m08.d08:meMA.Ode5C1T.melody	@ltx/en_us_oca/he.h.m1:heHE.TheosOnEirinis.notmetered
ltx/en_us_oca/me.m08.d08:meMA.Ode5C1T.mode	@ltx/en_us_oca/miscellanea:misc.Mode1
ltx/en_us_oca/me.m08.d08:meMA.Ode5C1T.ode	@ltx/en_us_oca/miscellanea:misc.Ode5
ltx/en_us_oca/me.m08.d08:meMA.Ode5C1T.text	
ltx/en_us_oca/me.m08.d08:meMA.Ode6C11.greekmelody	@ltx/en_us_oca/he.h.m1:heHE.SplanchnonIonan.greekname
ltx/en_us_oca/me.m08.d08:meMA.Ode6C11.incipit	…
ltx/en_us_oca/me.m08.d08:meMA.Ode6C11.melody	@ltx/en_us_oca/he.h.m1:heHE.SplanchnonIonan.notmetered
ltx/en_us_oca/me.m08.d08:meMA.Ode6C11.mode	@ltx/en_us_oca/miscellanea:misc.Mode1
ltx/en_us_oca/me.m08.d08:meMA.Ode6C11.ode	@ltx/en_us_oca/miscellanea:misc.Ode6
ltx/en_us_oca/me.m08.d08:meMA.Ode6C11.text	
ltx/en_us_oca/me.m08.d08:meMA.Ode6C12.incipit	…
ltx/en_us_oca/me.m08.d08:meMA.Ode6C12.melody	@ltx/en_us_oca/he.h.m1:heHE.SplanchnonIonan.notmetered
ltx/en_us_oca/me.m08.d08:meMA.Ode6C12.mode	@ltx/en_us_oca/miscellanea:misc.Mode1
ltx/en_us_oca/me.m08.d08:meMA.Ode6C12.ode	@ltx/en_us_oca/miscellanea:misc.Ode6
ltx/en_us_oca/me.m08.d08:meMA.Ode6C12.text	
ltx/en_us_oca/me.m08.d08:meMA.Ode6C13.incipit	…
ltx/en_us_oca/me.m08.d08:meMA.Ode6C13.melody	@ltx/en_us_oca/he.h.m1:heHE.SplanchnonIonan.notmetered
ltx/en_us_oca/me.m08.d08:meMA.Ode6C13.mode	@ltx/en_us_oca/miscellanea:misc.Mode1
ltx/en_us_oca/me.m08.d08:meMA.Ode6C13.ode	@ltx/en_us_oca/miscellanea:misc.Ode6
ltx/en_us_oca/me.m08.d08:meMA.Ode6C13.text	
ltx/en_us_oca/me.m08.d08:meMA.Ode6C1T.incipit	…
ltx/en_us_oca/me.m08.d08:meMA.Ode6C1T.melody	@ltx/en_us_oca/he.h.m1:heHE.SplanchnonIonan.notmetered
ltx/en_us_oca/me.m08.d08:meMA.Ode6C1T.mode	@ltx/en_us_oca/miscellanea:misc.Mode1
ltx/en_us_oca/me.m08.d08:meMA.Ode6C1T.ode	@ltx/en_us_oca/miscellanea:misc.Ode6
ltx/en_us_oca/me.m08.d08:meMA.Ode6C1T.text	
ltx/en_us_oca/me.m08.d08:meMA.Ode6H.greekmelody	@ltx/en_us_oca/he.h.m1:heHE.SplanchnonIonan.greekname
ltx/en_us_oca/me.m08.d08:meMA.Ode6H.incipit	@ltx/en_us_oca/he.h.m1:heHE.SplanchnonIonan.incipit
ltx/en_us_oca/me.m08.d08:meMA.Ode6H.melody	@ltx/en_us_oca/he.h.m1:heHE.SplanchnonIonan.melody
ltx/en_us_oca/me.m08.d08:meMA.Ode6H.mode	@ltx/en_us_oca/miscellanea:misc.Mode1
ltx/en_us_oca/me.m08.d08:meMA.Ode6H.ode	@ltx/en_us_oca/miscellanea:misc.Ode6
ltx/en_us_oca/me.m08.d08:meMA.Ode6H.text	@ltx/en_us_oca/he.h.m1:heHE.SplanchnonIonan.text
ltx/en_us_oca/me.m08.d08:meMA.Ode7C11.greekmelody	@ltx/en_us_oca/he.h.m1:heHE.SeNoitin.greekname
ltx/en_us_oca/me.m08.d08:meMA.Ode7C11.incipit	…
ltx/en_us_oca/me.m08.d08:meMA.Ode7C11.melody	@ltx/en_us_oca/he.h.m1:heHE.SeNoitin.notmetered
ltx/en_us_oca/me.m08.d08:meMA.Ode7C11.mode	@ltx/en_us_oca/miscellanea:misc.Mode1
ltx/en_us_oca/me.m08.d08:meMA.Ode7C11.ode	@ltx/en_us_oca/miscellanea:misc.Ode7
ltx/en_us_oca/me.m08.d08:meMA.Ode7C11.text	
ltx/en_us_oca/me.m08.d08:meMA.Ode7C12.incipit	…
ltx/en_us_oca/me.m08.d08:meMA.Ode7C12.melody	@ltx/en_us_oca/he.h.m1:heHE.SeNoitin.notmetered
ltx/en_us_oca/me.m08.d08:meMA.Ode7C12.mode	@ltx/en_us_oca/miscellanea:misc.Mode1
ltx/en_us_oca/me.m08.d08:meMA.Ode7C12.ode	@ltx/en_us_oca/miscellanea:misc.Ode7
ltx/en_us_oca/me.m08.d08:meMA.Ode7C12.text	
ltx/en_us_oca/me.m08.d08:meMA.Ode7C13.incipit	…
ltx/en_us_oca/me.m08.d08:meMA.Ode7C13.melody	@ltx/en_us_oca/he.h.m1:heHE.SeNoitin.notmetered
ltx/en_us_oca/me.m08.d08:meMA.Ode7C13.mode	@ltx/en_us_oca/miscellanea:misc.Mode1
ltx/en_us_oca/me.m08.d08:meMA.Ode7C13.ode	@ltx/en_us_oca/miscellanea:misc.Ode7
ltx/en_us_oca/me.m08.d08:meMA.Ode7C13.text	
ltx/en_us_oca/me.m08.d08:meMA.Ode7C1T.incipit	…
ltx/en_us_oca/me.m08.d08:meMA.Ode7C1T.melody	@ltx/en_us_oca/he.h.m1:heHE.SeNoitin.notmetered
ltx/en_us_oca/me.m08.d08:meMA.Ode7C1T.mode	@ltx/en_us_oca/miscellanea:misc.Mode1
ltx/en_us_oca/me.m08.d08:meMA.Ode7C1T.ode	@ltx/en_us_oca/miscellanea:misc.Ode7
ltx/en_us_oca/me.m08.d08:meMA.Ode7C1T.text	
ltx/en_us_oca/me.m08.d08:meMA.Ode8C11.greekmelody	@ltx/en_us_oca/he.h.m1:heHE.ThavmatosYperfyous.greekname
ltx/en_us_oca/me.m08.d08:meMA.Ode8C11.incipit	…
ltx/en_us_oca/me.m08.d08:meMA.Ode8C11.melody	@ltx/en_us_oca/he.h.m1:heHE.ThavmatosYperfyous.notmetered
ltx/en_us_oca/me.m08.d08:meMA.Ode8C11.mode	@ltx/en_us_oca/miscellanea:misc.Mode1
ltx/en_us_oca/me.m08.d08:meMA.Ode8C11.ode	@ltx/en_us_oca/miscellanea:misc.Ode8
ltx/en_us_oca/me.m08.d08:meMA.Ode8C11.text	
ltx/en_us_oca/me.m08.d08:meMA.Ode8C12.incipit	…
ltx/en_us_oca/me.m08.d08:meMA.Ode8C12.melody	@ltx/en_us_oca/he.h.m1:heHE.ThavmatosYperfyous.notmetered
ltx/en_us_oca/me.m08.d08:meMA.Ode8C12.mode	@ltx/en_us_oca/miscellanea:misc.Mode1
ltx/en_us_oca/me.m08.d08:meMA.Ode8C12.ode	@ltx/en_us_oca/miscellanea:misc.Ode8
ltx/en_us_oca/me.m08.d08:meMA.Ode8C12.text	
ltx/en_us_oca/me.m08.d08:meMA.Ode8C13.incipit	…
ltx/en_us_oca/me.m08.d08:meMA.Ode8C13.melody	@ltx/en_us_oca/he.h.m1:heHE.ThavmatosYperfyous.notmetered
ltx/en_us_oca/me.m08.d08:meMA.Ode8C13.mode	@ltx/en_us_oca/miscellanea:misc.Mode1
ltx/en_us_oca/me.m08.d08:meMA.Ode8C13.ode	@ltx/en_us_oca/miscellanea:misc.Ode8
ltx/en_us_oca/me.m08.d08:meMA.Ode8C13.text	
ltx/en_us_oca/me.m08.d08:meMA.Ode8C1T.incipit	…
ltx/en_us_oca/me.m08.d08:meMA.Ode8C1T.melody	@ltx/en_us_oca/he.h.m1:heHE.ThavmatosYperfyous.notmetered
ltx/en_us_oca/me.m08.d08:meMA.Ode8C1T.mode	@ltx/en_us_oca/miscellanea:misc.Mode1
ltx/en_us_oca/me.m08.d08:meMA.Ode8C1T.ode	@ltx/en_us_oca/miscellanea:misc.Ode8
ltx/en_us_oca/me.m08.d08:meMA.Ode8C1T.text	
ltx/en_us_oca/me.m08.d08:meMA.Ode8H.greekmelody	@ltx/en_us_oca/he.h.m1:heHE.ThavmatosYperfyous.greekname
ltx/en_us_oca/me.m08.d08:meMA.Ode8H.incipit	@ltx/en_us_oca/he.h.m1:heHE.ThavmatosYperfyous.incipit
ltx/en_us_oca/me.m08.d08:meMA.Ode8H.melody	@ltx/en_us_oca/he.h.m1:heHE.ThavmatosYperfyous.melody
ltx/en_us_oca/me.m08.d08:meMA.Ode8H.mode	@ltx/en_us_oca/miscellanea:misc.Mode1
ltx/en_us_oca/me.m08.d08:meMA.Ode8H.ode	@ltx/en_us_oca/miscellanea:misc.Ode8
ltx/en_us_oca/me.m08.d08:meMA.Ode8H.text	@ltx/en_us_oca/he.h.m1:heHE.ThavmatosYperfyous.text
ltx/en_us_oca/me.m08.d08:meMA.Ode9C11.greekmelody	@ltx/en_us_oca/he.h.m1:heHE.TyponTisAgnis.greekname
ltx/en_us_oca/me.m08.d08:meMA.Ode9C11.incipit	…
ltx/en_us_oca/me.m08.d08:meMA.Ode9C11.melody	@ltx/en_us_oca/he.h.m1:heHE.TyponTisAgnis.notmetered
ltx/en_us_oca/me.m08.d08:meMA.Ode9C11.mode	@ltx/en_us_oca/miscellanea:misc.Mode1
ltx/en_us_oca/me.m08.d08:meMA.Ode9C11.ode	@ltx/en_us_oca/miscellanea:misc.Ode9
ltx/en_us_oca/me.m08.d08:meMA.Ode9C11.text	
ltx/en_us_oca/me.m08.d08:meMA.Ode9C12.incipit	…
ltx/en_us_oca/me.m08.d08:meMA.Ode9C12.melody	@ltx/en_us_oca/he.h.m1:heHE.TyponTisAgnis.notmetered
ltx/en_us_oca/me.m08.d08:meMA.Ode9C12.mode	@ltx/en_us_oca/miscellanea:misc.Mode1
ltx/en_us_oca/me.m08.d08:meMA.Ode9C12.ode	@ltx/en_us_oca/miscellanea:misc.Ode9
ltx/en_us_oca/me.m08.d08:meMA.Ode9C12.text	
ltx/en_us_oca/me.m08.d08:meMA.Ode9C13.incipit	…
ltx/en_us_oca/me.m08.d08:meMA.Ode9C13.melody	@ltx/en_us_oca/he.h.m1:heHE.TyponTisAgnis.notmetered
ltx/en_us_oca/me.m08.d08:meMA.Ode9C13.mode	@ltx/en_us_oca/miscellanea:misc.Mode1
ltx/en_us_oca/me.m08.d08:meMA.Ode9C13.ode	@ltx/en_us_oca/miscellanea:misc.Ode9
ltx/en_us_oca/me.m08.d08:meMA.Ode9C13.text	
ltx/en_us_oca/me.m08.d08:meMA.Ode9C1T.incipit	…
ltx/en_us_oca/me.m08.d08:meMA.Ode9C1T.melody	@ltx/en_us_oca/he.h.m1:heHE.TyponTisAgnis.notmetered
ltx/en_us_oca/me.m08.d08:meMA.Ode9C1T.mode	@ltx/en_us_oca/miscellanea:misc.Mode1
ltx/en_us_oca/me.m08.d08:meMA.Ode9C1T.ode	@ltx/en_us_oca/miscellanea:misc.Ode9
ltx/en_us_oca/me.m08.d08:meMA.Ode9C1T.text	
ltx/en_us_oca/me.m08.d08:meMA.Ode9H.greekmelody	@ltx/en_us_oca/he.h.m1:heHE.TyponTisAgnis.greekname
ltx/en_us_oca/me.m08.d08:meMA.Ode9H.incipit	@ltx/en_us_oca/he.h.m1:heHE.TyponTisAgnis.incipit
ltx/en_us_oca/me.m08.d08:meMA.Ode9H.melody	@ltx/en_us_oca/he.h.m1:heHE.TyponTisAgnis.melody
ltx/en_us_oca/me.m08.d08:meMA.Ode9H.mode	@ltx/en_us_oca/miscellanea:misc.Mode1
ltx/en_us_oca/me.m08.d08:meMA.Ode9H.ode	@ltx/en_us_oca/miscellanea:misc.Ode9
ltx/en_us_oca/me.m08.d08:meMA.Ode9H.text	@ltx/en_us_oca/he.h.m1:heHE.TyponTisAgnis.text
ltx/en_us_oca/me.m08.d08:meVE.Apolytikion1ger.greekmelody	@ltx/en_us_oca/he.a.m1:heAU.TisErimouPolitis.greekname
ltx/en_us_oca/me.m08.d08:meVE.Apolytikion1ger.incipit	…
ltx/en_us_oca/me.m08.d08:meVE.Apolytikion1ger.melody	@ltx/en_us_oca/he.a.m1:heAU.TisErimouPolitis.notmetered
ltx/en_us_oca/me.m08.d08:meVE.Apolytikion1ger.mode	@ltx/en_us_oca/miscellanea:misc.Mode1
ltx/en_us_oca/me.m08.d08:meVE.Apolytikion1ger.poet	@ltx/en_us_oca/poets:po.Gerasimou
ltx/en_us_oca/me.m08.d08:meVE.Apolytikion1ger.text	
ltx/en_us_oca/me.m08.d08:meVE.AposGlory.incipit	@ltx/en_us_oca/me.m08.d06:meVE.Aposticha2.incipit
ltx/en_us_oca/me.m08.d08:meVE.AposGlory.melody	
ltx/en_us_oca/me.m08.d08:meVE.AposGlory.mode	@ltx/en_us_oca/miscellanea:misc.Mode1
ltx/en_us_oca/me.m08.d08:meVE.AposGlory.text	@ltx/en_us_oca/me.m08.d06:meVE.Aposticha2.text
ltx/en_us_oca/me.m08.d08:meVE.Aposticha1.greekmelody	@ltx/en_us_oca/he.a.m6:heAU.TriimerosAnestis.greekname
ltx/en_us_oca/me.m08.d08:meVE.Aposticha1.incipit	The first man Adam was…
ltx/en_us_oca/me.m08.d08:meVE.Aposticha1.melody	@ltx/en_us_oca/he.a.m6:heAU.TriimerosAnestis.notmetered
ltx/en_us_oca/me.m08.d08:meVE.Aposticha1.mode	@ltx/en_us_oca/miscellanea:misc.Mode6
ltx/en_us_oca/me.m08.d08:meVE.Aposticha1.text	The first man Adam was formed by You, ⁄ compassionate Christ. ⁄ Now You have appeared from the Virgin as second Adam, ⁄ and by Your Transfiguration on Tabor, ⁄⁄ You have disclosed to him Your Divinity.
ltx/en_us_oca/me.m08.d08:meVE.Aposticha2.incipit	Your chosen ones were filled…
ltx/en_us_oca/me.m08.d08:meVE.Aposticha2.melody	@ltx/en_us_oca/he.a.m6:heAU.TriimerosAnestis.notmetered
ltx/en_us_oca/me.m08.d08:meVE.Aposticha2.mode	@ltx/en_us_oca/miscellanea:misc.Mode6
ltx/en_us_oca/me.m08.d08:meVE.Aposticha2.text	Your chosen ones were filled with fear, ⁄ seeing Your Transfiguration on Mount Tabor, ⁄ O Christ, fulfillment of the law and the prophets. ⁄ We join them to worship You ⁄⁄ with the Father and the Spirit!
ltx/en_us_oca/me.m08.d08:meVE.Aposticha3.incipit	Creation was made to shine…
ltx/en_us_oca/me.m08.d08:meVE.Aposticha3.melody	@ltx/en_us_oca/he.a.m6:heAU.TriimerosAnestis.notmetered
ltx/en_us_oca/me.m08.d08:meVE.Aposticha3.mode	@ltx/en_us_oca/miscellanea:misc.Mode6
ltx/en_us_oca/me.m08.d08:meVE.Aposticha3.text	Creation was made to shine brightly ⁄ by Your Transfiguration on Tabor, Christ, ⁄ for You showed Yourself as God to Your apostles! ⁄ Moses and Elijah stood beside You, ⁄⁄ as most wondrously You shone brighter than the sun!
ltx/en_us_oca/me.m08.d08:meVE.SticGlory.incipit	@ltx/en_us_oca/me.m08.d06:meVE.Aposticha1.incipit
ltx/en_us_oca/me.m08.d08:meVE.SticGlory.melody	
ltx/en_us_oca/me.m08.d08:meVE.SticGlory.mode	@ltx/en_us_oca/miscellanea:misc.Mode1
ltx/en_us_oca/me.m08.d08:meVE.SticGlory.text	@ltx/en_us_oca/me.m08.d06:meVE.Aposticha1.text
ltx/en_us_oca/me.m08.d08:meVE.Stichera01.greekmelody	@ltx/en_us_oca/he.a.m4:heAU.EdokasSimeiosin.greekname
ltx/en_us_oca/me.m08.d08:meVE.Stichera01.incipit	Today You have given Your…
ltx/en_us_oca/me.m08.d08:meVE.Stichera01.melody	@ltx/en_us_oca/he.a.m4:heAU.EdokasSimeiosin.notmetered
ltx/en_us_oca/me.m08.d08:meVE.Stichera01.mode	@ltx/en_us_oca/miscellanea:misc.Mode4
ltx/en_us_oca/me.m08.d08:meVE.Stichera01.text	Today You have given Your apostles ⁄ a taste of Your Divinity, Lord. ⁄ Moses and Elijah were seen with You, ⁄ for You are God of both the law and of grace. ⁄ You have ransomed us, although we were held fast in the clutches of death! ⁄ We glorify Your loving plan for mankind, together with Your apostles, ⁄⁄ almighty Jesus, the Savior of our souls!
ltx/en_us_oca/me.m08.d08:meVE.Stichera02.incipit	Today You have made the…
ltx/en_us_oca/me.m08.d08:meVE.Stichera02.melody	@ltx/en_us_oca/he.a.m4:heAU.EdokasSimeiosin.notmetered
ltx/en_us_oca/me.m08.d08:meVE.Stichera02.mode	@ltx/en_us_oca/miscellanea:misc.Mode4
ltx/en_us_oca/me.m08.d08:meVE.Stichera02.text	Today You have made the sun appear to be dim ⁄ by shining brightly on Mount Tabor, Lord. ⁄ You wear our mortal flesh in Your compassion, ⁄ yet Your friends saw the radiance of Your glory. ⁄ Therefore we glorify Your loving plan for mankind, ⁄⁄ almighty Jesus, the Savior of our souls!
ltx/en_us_oca/me.m08.d08:meVE.Stichera03.incipit	Today the angels in heaven…
ltx/en_us_oca/me.m08.d08:meVE.Stichera03.melody	@ltx/en_us_oca/he.a.m4:heAU.EdokasSimeiosin.notmetered
ltx/en_us_oca/me.m08.d08:meVE.Stichera03.mode	@ltx/en_us_oca/miscellanea:misc.Mode4
ltx/en_us_oca/me.m08.d08:meVE.Stichera03.text	Today the angels in heaven rejoice, ⁄ keeping feast with mortals. ⁄ The lightning of Your Divinity, Christ, ⁄ flashes on Mount Tabor! ⁄ Moses and Elijah stood beside You, Savior! ⁄ Peter, James and John sang to You, Lover of mankind, ⁄⁄ almighty Jesus, the Savior of our souls!
ltx/en_us_oca/me.m08.d08:meVE.Stichera04.greekmelody	@ltx/en_us_oca/he.a.m4:heAU.OExYpsistouKlitheis.greekname
ltx/en_us_oca/me.m08.d08:meVE.Stichera04.incipit	…
ltx/en_us_oca/me.m08.d08:meVE.Stichera04.melody	@ltx/en_us_oca/he.a.m4:heAU.OExYpsistouKlitheis.notmetered
ltx/en_us_oca/me.m08.d08:meVE.Stichera04.mode	@ltx/en_us_oca/miscellanea:misc.Mode4
ltx/en_us_oca/me.m08.d08:meVE.Stichera04.text	
ltx/en_us_oca/me.m08.d08:meVE.Stichera05.incipit	…
ltx/en_us_oca/me.m08.d08:meVE.Stichera05.melody	@ltx/en_us_oca/he.a.m4:heAU.OExYpsistouKlitheis.notmetered
ltx/en_us_oca/me.m08.d08:meVE.Stichera05.mode	@ltx/en_us_oca/miscellanea:misc.Mode4
ltx/en_us_oca/me.m08.d08:meVE.Stichera05.text	
ltx/en_us_oca/me.m08.d08:meVE.Stichera06.incipit	…
ltx/en_us_oca/me.m08.d08:meVE.Stichera06.melody	@ltx/en_us_oca/he.a.m4:heAU.OExYpsistouKlitheis.notmetered
ltx/en_us_oca/me.m08.d08:meVE.Stichera06.mode	@ltx/en_us_oca/miscellanea:misc.Mode4
ltx/en_us_oca/me.m08.d08:meVE.Stichera06.text	
