ltx/en_us_oca/me.m07.d22:meDA.commemoration.first	
ltx/en_us_oca/me.m07.d22:meDA.commemoration.first_name	
ltx/en_us_oca/me.m07.d22:meDA.commemoration.first_short	
ltx/en_us_oca/me.m07.d22:meDA.commemoration.first_title	
ltx/en_us_oca/me.m07.d22:meDA.commemoration.full	
ltx/en_us_oca/me.m07.d22:meDA.commemoration.second_name	
ltx/en_us_oca/me.m07.d22:meDA.commemoration.second_title	
ltx/en_us_oca/me.m07.d22:meDA.date	
ltx/en_us_oca/me.m07.d22:meDA.fordate	
ltx/en_us_oca/me.m07.d22:meDA.insert1	
ltx/en_us_oca/me.m07.d22:meDA.insert2	
ltx/en_us_oca/me.m07.d22:meDA.note	
ltx/en_us_oca/me.m07.d22:meDA.pdfcoverdate	
ltx/en_us_oca/me.m07.d22:meDA.pdfheaderdate	
ltx/en_us_oca/me.m07.d22:meHO.commemorations	
ltx/en_us_oca/me.m07.d22:meHO.note1	
ltx/en_us_oca/me.m07.d22:meHO.note2	
ltx/en_us_oca/me.m07.d22:meHO.number	
ltx/en_us_oca/me.m07.d22:meHO.rank	
ltx/en_us_oca/me.m07.d22:meLE.commemoration1	
ltx/en_us_oca/me.m07.d22:meLE.commemoration2	
ltx/en_us_oca/me.m07.d22:meLI.Kontakion1.greekmelody	@ltx/en_us_oca/me.m07.d22:meMA.Kontakion1.greekmelody
ltx/en_us_oca/me.m07.d22:meLI.Kontakion1.incipit	@ltx/en_us_oca/me.m07.d22:meMA.Kontakion1.incipit
ltx/en_us_oca/me.m07.d22:meLI.Kontakion1.melody	@ltx/en_us_oca/me.m07.d22:meMA.Kontakion1.melody
ltx/en_us_oca/me.m07.d22:meLI.Kontakion1.mode	@ltx/en_us_oca/me.m07.d22:meMA.Kontakion1.mode
ltx/en_us_oca/me.m07.d22:meLI.Kontakion1.text	@ltx/en_us_oca/me.m07.d22:meMA.Kontakion1.text
ltx/en_us_oca/me.m07.d22:meLI.MM.CommunionHymn.text	@ltx/en_us_oca/properties:media.key
ltx/en_us_oca/me.m07.d22:meLI.Megalynarion.text	
ltx/en_us_oca/me.m07.d22:meMA.C1.acrostic.notice1	
ltx/en_us_oca/me.m07.d22:meMA.C1.acrostic.text	
ltx/en_us_oca/me.m07.d22:meMA.C1.acrostic.title	
ltx/en_us_oca/me.m07.d22:meMA.C1.poet	@ltx/en_us_oca/poets:po.Theofanous
ltx/en_us_oca/me.m07.d22:meMA.C1.title	@ltx/en_us_oca/titles:ti.CanonMyrrhbearerW
ltx/en_us_oca/me.m07.d22:meMA.C1.verse	@ltx/en_us_oca/prayers:pr.verse_SaintW.text
ltx/en_us_oca/me.m07.d22:meMA.Exaposteilarion1.greekmelody	@ltx/en_us_oca/he.a.m2:heAU.GynaikesAkoutisthite.greekname
ltx/en_us_oca/me.m07.d22:meMA.Exaposteilarion1.incipit	…
ltx/en_us_oca/me.m07.d22:meMA.Exaposteilarion1.melody	@ltx/en_us_oca/he.a.m2:heAU.GynaikesAkoutisthite.notmetered
ltx/en_us_oca/me.m07.d22:meMA.Exaposteilarion1.mode	@ltx/en_us_oca/miscellanea:misc.Mode2
ltx/en_us_oca/me.m07.d22:meMA.Exaposteilarion1.text	
ltx/en_us_oca/me.m07.d22:meMA.Kontakion1.greekmelody	@ltx/en_us_oca/he.a.m4:heAU.OYpsotheisEnToStavro.greekname
ltx/en_us_oca/me.m07.d22:meMA.Kontakion1.incipit	When God, Who is transcendent…
ltx/en_us_oca/me.m07.d22:meMA.Kontakion1.melody	@ltx/en_us_oca/he.a.m4:heAU.OYpsotheisEnToStavro.notmetered
ltx/en_us_oca/me.m07.d22:meMA.Kontakion1.mode	@ltx/en_us_oca/miscellanea:misc.Mode4
ltx/en_us_oca/me.m07.d22:meMA.Kontakion1.text	When God, Who is transcendent in Essence, ⁄ came with flesh into the world, Myrrhbearer, ⁄ He received you as a true disciple for you turned all your love toward Him; ⁄ henceforth you would yourself work many healings. ⁄⁄ Now that you have passed into heaven, never cease to intercede for the world!
ltx/en_us_oca/me.m07.d22:meMA.MM.VeApos1123as5678.text	@ltx/en_us_oca/properties:media.key
ltx/en_us_oca/me.m07.d22:meMA.Ode1C11.greekmelody	@ltx/en_us_oca/he.h.m8:heHE.YgranDiodefsas.greekname
ltx/en_us_oca/me.m07.d22:meMA.Ode1C11.incipit	…
ltx/en_us_oca/me.m07.d22:meMA.Ode1C11.melody	@ltx/en_us_oca/he.h.m8:heHE.YgranDiodefsas.notmetered
ltx/en_us_oca/me.m07.d22:meMA.Ode1C11.mode	@ltx/en_us_oca/miscellanea:misc.Mode8
ltx/en_us_oca/me.m07.d22:meMA.Ode1C11.ode	@ltx/en_us_oca/miscellanea:misc.Ode1
ltx/en_us_oca/me.m07.d22:meMA.Ode1C11.text	
ltx/en_us_oca/me.m07.d22:meMA.Ode1C12.incipit	…
ltx/en_us_oca/me.m07.d22:meMA.Ode1C12.melody	@ltx/en_us_oca/he.h.m8:heHE.YgranDiodefsas.notmetered
ltx/en_us_oca/me.m07.d22:meMA.Ode1C12.mode	@ltx/en_us_oca/miscellanea:misc.Mode8
ltx/en_us_oca/me.m07.d22:meMA.Ode1C12.ode	@ltx/en_us_oca/miscellanea:misc.Ode1
ltx/en_us_oca/me.m07.d22:meMA.Ode1C12.text	
ltx/en_us_oca/me.m07.d22:meMA.Ode1C13.incipit	…
ltx/en_us_oca/me.m07.d22:meMA.Ode1C13.melody	@ltx/en_us_oca/he.h.m8:heHE.YgranDiodefsas.notmetered
ltx/en_us_oca/me.m07.d22:meMA.Ode1C13.mode	@ltx/en_us_oca/miscellanea:misc.Mode8
ltx/en_us_oca/me.m07.d22:meMA.Ode1C13.ode	@ltx/en_us_oca/miscellanea:misc.Ode1
ltx/en_us_oca/me.m07.d22:meMA.Ode1C13.text	
ltx/en_us_oca/me.m07.d22:meMA.Ode1C1T.incipit	…
ltx/en_us_oca/me.m07.d22:meMA.Ode1C1T.melody	@ltx/en_us_oca/he.h.m8:heHE.YgranDiodefsas.notmetered
ltx/en_us_oca/me.m07.d22:meMA.Ode1C1T.mode	@ltx/en_us_oca/miscellanea:misc.Mode8
ltx/en_us_oca/me.m07.d22:meMA.Ode1C1T.ode	@ltx/en_us_oca/miscellanea:misc.Ode1
ltx/en_us_oca/me.m07.d22:meMA.Ode1C1T.text	
ltx/en_us_oca/me.m07.d22:meMA.Ode3C11.greekmelody	@ltx/en_us_oca/he.h.m8:heHE.OuraniasApsidos.greekname
ltx/en_us_oca/me.m07.d22:meMA.Ode3C11.incipit	…
ltx/en_us_oca/me.m07.d22:meMA.Ode3C11.melody	@ltx/en_us_oca/he.h.m8:heHE.OuraniasApsidos.notmetered
ltx/en_us_oca/me.m07.d22:meMA.Ode3C11.mode	@ltx/en_us_oca/miscellanea:misc.Mode8
ltx/en_us_oca/me.m07.d22:meMA.Ode3C11.ode	@ltx/en_us_oca/miscellanea:misc.Ode3
ltx/en_us_oca/me.m07.d22:meMA.Ode3C11.text	
ltx/en_us_oca/me.m07.d22:meMA.Ode3C12.incipit	…
ltx/en_us_oca/me.m07.d22:meMA.Ode3C12.melody	@ltx/en_us_oca/he.h.m8:heHE.OuraniasApsidos.notmetered
ltx/en_us_oca/me.m07.d22:meMA.Ode3C12.mode	@ltx/en_us_oca/miscellanea:misc.Mode8
ltx/en_us_oca/me.m07.d22:meMA.Ode3C12.ode	@ltx/en_us_oca/miscellanea:misc.Ode3
ltx/en_us_oca/me.m07.d22:meMA.Ode3C12.text	
ltx/en_us_oca/me.m07.d22:meMA.Ode3C1T.incipit	…
ltx/en_us_oca/me.m07.d22:meMA.Ode3C1T.melody	@ltx/en_us_oca/he.h.m8:heHE.OuraniasApsidos.notmetered
ltx/en_us_oca/me.m07.d22:meMA.Ode3C1T.mode	@ltx/en_us_oca/miscellanea:misc.Mode8
ltx/en_us_oca/me.m07.d22:meMA.Ode3C1T.ode	@ltx/en_us_oca/miscellanea:misc.Ode3
ltx/en_us_oca/me.m07.d22:meMA.Ode3C1T.text	
ltx/en_us_oca/me.m07.d22:meMA.Ode3H.greekmelody	@ltx/en_us_oca/he.h.m8:heHE.OuraniasApsidos.greekname
ltx/en_us_oca/me.m07.d22:meMA.Ode3H.incipit	@ltx/en_us_oca/he.h.m8:heHE.OuraniasApsidos.incipit
ltx/en_us_oca/me.m07.d22:meMA.Ode3H.melody	@ltx/en_us_oca/he.h.m8:heHE.OuraniasApsidos.melody
ltx/en_us_oca/me.m07.d22:meMA.Ode3H.mode	@ltx/en_us_oca/miscellanea:misc.Mode8
ltx/en_us_oca/me.m07.d22:meMA.Ode3H.ode	@ltx/en_us_oca/miscellanea:misc.Ode3
ltx/en_us_oca/me.m07.d22:meMA.Ode3H.text	@ltx/en_us_oca/he.h.m8:heHE.OuraniasApsidos.text
ltx/en_us_oca/me.m07.d22:meMA.Ode3Kathisma1.greekmelody	@ltx/en_us_oca/he.a.m8:heAU.TinSofianKaiLogon.greekname
ltx/en_us_oca/me.m07.d22:meMA.Ode3Kathisma1.incipit	…
ltx/en_us_oca/me.m07.d22:meMA.Ode3Kathisma1.melody	@ltx/en_us_oca/he.a.m8:heAU.TinSofianKaiLogon.notmetered
ltx/en_us_oca/me.m07.d22:meMA.Ode3Kathisma1.mode	@ltx/en_us_oca/miscellanea:misc.Mode8
ltx/en_us_oca/me.m07.d22:meMA.Ode3Kathisma1.text	
ltx/en_us_oca/me.m07.d22:meMA.Ode3KathismaSt.incipit	…
ltx/en_us_oca/me.m07.d22:meMA.Ode3KathismaSt.melody	@ltx/en_us_oca/he.a.m8:heAU.TinSofianKaiLogon.notmetered
ltx/en_us_oca/me.m07.d22:meMA.Ode3KathismaSt.mode	@ltx/en_us_oca/miscellanea:misc.Mode8
ltx/en_us_oca/me.m07.d22:meMA.Ode3KathismaSt.text	
ltx/en_us_oca/me.m07.d22:meMA.Ode3KathismaT.incipit	…
ltx/en_us_oca/me.m07.d22:meMA.Ode3KathismaT.melody	@ltx/en_us_oca/he.a.m8:heAU.TinSofianKaiLogon.notmetered
ltx/en_us_oca/me.m07.d22:meMA.Ode3KathismaT.mode	@ltx/en_us_oca/miscellanea:misc.Mode8
ltx/en_us_oca/me.m07.d22:meMA.Ode3KathismaT.text	
ltx/en_us_oca/me.m07.d22:meMA.Ode4C11.greekmelody	@ltx/en_us_oca/he.h.m8:heHE.EisakikoaKyrie.greekname
ltx/en_us_oca/me.m07.d22:meMA.Ode4C11.incipit	…
ltx/en_us_oca/me.m07.d22:meMA.Ode4C11.melody	@ltx/en_us_oca/he.h.m8:heHE.EisakikoaKyrie.notmetered
ltx/en_us_oca/me.m07.d22:meMA.Ode4C11.mode	@ltx/en_us_oca/miscellanea:misc.Mode8
ltx/en_us_oca/me.m07.d22:meMA.Ode4C11.ode	@ltx/en_us_oca/miscellanea:misc.Ode4
ltx/en_us_oca/me.m07.d22:meMA.Ode4C11.text	
ltx/en_us_oca/me.m07.d22:meMA.Ode4C12.incipit	…
ltx/en_us_oca/me.m07.d22:meMA.Ode4C12.melody	@ltx/en_us_oca/he.h.m8:heHE.EisakikoaKyrie.notmetered
ltx/en_us_oca/me.m07.d22:meMA.Ode4C12.mode	@ltx/en_us_oca/miscellanea:misc.Mode8
ltx/en_us_oca/me.m07.d22:meMA.Ode4C12.ode	@ltx/en_us_oca/miscellanea:misc.Ode4
ltx/en_us_oca/me.m07.d22:meMA.Ode4C12.text	
ltx/en_us_oca/me.m07.d22:meMA.Ode4C13.incipit	…
ltx/en_us_oca/me.m07.d22:meMA.Ode4C13.melody	@ltx/en_us_oca/he.h.m8:heHE.EisakikoaKyrie.notmetered
ltx/en_us_oca/me.m07.d22:meMA.Ode4C13.mode	@ltx/en_us_oca/miscellanea:misc.Mode8
ltx/en_us_oca/me.m07.d22:meMA.Ode4C13.ode	@ltx/en_us_oca/miscellanea:misc.Ode4
ltx/en_us_oca/me.m07.d22:meMA.Ode4C13.text	
ltx/en_us_oca/me.m07.d22:meMA.Ode4C1T.incipit	…
ltx/en_us_oca/me.m07.d22:meMA.Ode4C1T.melody	@ltx/en_us_oca/he.h.m8:heHE.EisakikoaKyrie.notmetered
ltx/en_us_oca/me.m07.d22:meMA.Ode4C1T.mode	@ltx/en_us_oca/miscellanea:misc.Mode8
ltx/en_us_oca/me.m07.d22:meMA.Ode4C1T.ode	@ltx/en_us_oca/miscellanea:misc.Ode4
ltx/en_us_oca/me.m07.d22:meMA.Ode4C1T.text	
ltx/en_us_oca/me.m07.d22:meMA.Ode5C11.greekmelody	@ltx/en_us_oca/he.h.m8:heHE.InaTiMeAposo.greekname
ltx/en_us_oca/me.m07.d22:meMA.Ode5C11.incipit	…
ltx/en_us_oca/me.m07.d22:meMA.Ode5C11.melody	@ltx/en_us_oca/he.h.m8:heHE.InaTiMeAposo.notmetered
ltx/en_us_oca/me.m07.d22:meMA.Ode5C11.mode	@ltx/en_us_oca/miscellanea:misc.Mode8
ltx/en_us_oca/me.m07.d22:meMA.Ode5C11.ode	@ltx/en_us_oca/miscellanea:misc.Ode5
ltx/en_us_oca/me.m07.d22:meMA.Ode5C11.text	
ltx/en_us_oca/me.m07.d22:meMA.Ode5C12.incipit	…
ltx/en_us_oca/me.m07.d22:meMA.Ode5C12.melody	@ltx/en_us_oca/he.h.m8:heHE.InaTiMeAposo.notmetered
ltx/en_us_oca/me.m07.d22:meMA.Ode5C12.mode	@ltx/en_us_oca/miscellanea:misc.Mode8
ltx/en_us_oca/me.m07.d22:meMA.Ode5C12.ode	@ltx/en_us_oca/miscellanea:misc.Ode5
ltx/en_us_oca/me.m07.d22:meMA.Ode5C12.text	
ltx/en_us_oca/me.m07.d22:meMA.Ode5C13.incipit	…
ltx/en_us_oca/me.m07.d22:meMA.Ode5C13.melody	@ltx/en_us_oca/he.h.m8:heHE.InaTiMeAposo.notmetered
ltx/en_us_oca/me.m07.d22:meMA.Ode5C13.mode	@ltx/en_us_oca/miscellanea:misc.Mode8
ltx/en_us_oca/me.m07.d22:meMA.Ode5C13.ode	@ltx/en_us_oca/miscellanea:misc.Ode5
ltx/en_us_oca/me.m07.d22:meMA.Ode5C13.text	
ltx/en_us_oca/me.m07.d22:meMA.Ode5C1T.incipit	…
ltx/en_us_oca/me.m07.d22:meMA.Ode5C1T.melody	@ltx/en_us_oca/he.h.m8:heHE.InaTiMeAposo.notmetered
ltx/en_us_oca/me.m07.d22:meMA.Ode5C1T.mode	@ltx/en_us_oca/miscellanea:misc.Mode8
ltx/en_us_oca/me.m07.d22:meMA.Ode5C1T.ode	@ltx/en_us_oca/miscellanea:misc.Ode5
ltx/en_us_oca/me.m07.d22:meMA.Ode5C1T.text	
ltx/en_us_oca/me.m07.d22:meMA.Ode6C11.greekmelody	@ltx/en_us_oca/he.h.m8:heHE.IlasthitiMoiSotir.greekname
ltx/en_us_oca/me.m07.d22:meMA.Ode6C11.incipit	…
ltx/en_us_oca/me.m07.d22:meMA.Ode6C11.melody	@ltx/en_us_oca/he.h.m8:heHE.IlasthitiMoiSotir.notmetered
ltx/en_us_oca/me.m07.d22:meMA.Ode6C11.mode	@ltx/en_us_oca/miscellanea:misc.Mode8
ltx/en_us_oca/me.m07.d22:meMA.Ode6C11.ode	@ltx/en_us_oca/miscellanea:misc.Ode6
ltx/en_us_oca/me.m07.d22:meMA.Ode6C11.text	
ltx/en_us_oca/me.m07.d22:meMA.Ode6C12.incipit	…
ltx/en_us_oca/me.m07.d22:meMA.Ode6C12.melody	@ltx/en_us_oca/he.h.m8:heHE.IlasthitiMoiSotir.notmetered
ltx/en_us_oca/me.m07.d22:meMA.Ode6C12.mode	@ltx/en_us_oca/miscellanea:misc.Mode8
ltx/en_us_oca/me.m07.d22:meMA.Ode6C12.ode	@ltx/en_us_oca/miscellanea:misc.Ode6
ltx/en_us_oca/me.m07.d22:meMA.Ode6C12.text	
ltx/en_us_oca/me.m07.d22:meMA.Ode6C1T.incipit	…
ltx/en_us_oca/me.m07.d22:meMA.Ode6C1T.melody	@ltx/en_us_oca/he.h.m8:heHE.IlasthitiMoiSotir.notmetered
ltx/en_us_oca/me.m07.d22:meMA.Ode6C1T.mode	@ltx/en_us_oca/miscellanea:misc.Mode8
ltx/en_us_oca/me.m07.d22:meMA.Ode6C1T.ode	@ltx/en_us_oca/miscellanea:misc.Ode6
ltx/en_us_oca/me.m07.d22:meMA.Ode6C1T.text	
ltx/en_us_oca/me.m07.d22:meMA.Ode6H.greekmelody	@ltx/en_us_oca/he.h.m8:heHE.IlasthitiMoiSotir.greekname
ltx/en_us_oca/me.m07.d22:meMA.Ode6H.incipit	@ltx/en_us_oca/he.h.m8:heHE.IlasthitiMoiSotir.incipit
ltx/en_us_oca/me.m07.d22:meMA.Ode6H.melody	@ltx/en_us_oca/he.h.m8:heHE.IlasthitiMoiSotir.melody
ltx/en_us_oca/me.m07.d22:meMA.Ode6H.mode	@ltx/en_us_oca/miscellanea:misc.Mode8
ltx/en_us_oca/me.m07.d22:meMA.Ode6H.ode	@ltx/en_us_oca/miscellanea:misc.Ode6
ltx/en_us_oca/me.m07.d22:meMA.Ode6H.text	@ltx/en_us_oca/he.h.m8:heHE.IlasthitiMoiSotir.text
ltx/en_us_oca/me.m07.d22:meMA.Ode7C11.greekmelody	@ltx/en_us_oca/he.h.m8:heHE.PaidesEvraion.greekname
ltx/en_us_oca/me.m07.d22:meMA.Ode7C11.incipit	…
ltx/en_us_oca/me.m07.d22:meMA.Ode7C11.melody	@ltx/en_us_oca/he.h.m8:heHE.PaidesEvraion.notmetered
ltx/en_us_oca/me.m07.d22:meMA.Ode7C11.mode	@ltx/en_us_oca/miscellanea:misc.Mode8
ltx/en_us_oca/me.m07.d22:meMA.Ode7C11.ode	@ltx/en_us_oca/miscellanea:misc.Ode7
ltx/en_us_oca/me.m07.d22:meMA.Ode7C11.text	
ltx/en_us_oca/me.m07.d22:meMA.Ode7C12.incipit	…
ltx/en_us_oca/me.m07.d22:meMA.Ode7C12.melody	@ltx/en_us_oca/he.h.m8:heHE.PaidesEvraion.notmetered
ltx/en_us_oca/me.m07.d22:meMA.Ode7C12.mode	@ltx/en_us_oca/miscellanea:misc.Mode8
ltx/en_us_oca/me.m07.d22:meMA.Ode7C12.ode	@ltx/en_us_oca/miscellanea:misc.Ode7
ltx/en_us_oca/me.m07.d22:meMA.Ode7C12.text	
ltx/en_us_oca/me.m07.d22:meMA.Ode7C1T.incipit	…
ltx/en_us_oca/me.m07.d22:meMA.Ode7C1T.melody	@ltx/en_us_oca/he.h.m8:heHE.PaidesEvraion.notmetered
ltx/en_us_oca/me.m07.d22:meMA.Ode7C1T.mode	@ltx/en_us_oca/miscellanea:misc.Mode8
ltx/en_us_oca/me.m07.d22:meMA.Ode7C1T.ode	@ltx/en_us_oca/miscellanea:misc.Ode7
ltx/en_us_oca/me.m07.d22:meMA.Ode7C1T.text	
ltx/en_us_oca/me.m07.d22:meMA.Ode8C11.greekmelody	@ltx/en_us_oca/he.h.m8:heHE.EptaplasiosKaminon.greekname
ltx/en_us_oca/me.m07.d22:meMA.Ode8C11.incipit	…
ltx/en_us_oca/me.m07.d22:meMA.Ode8C11.melody	@ltx/en_us_oca/he.h.m8:heHE.EptaplasiosKaminon.notmetered
ltx/en_us_oca/me.m07.d22:meMA.Ode8C11.mode	@ltx/en_us_oca/miscellanea:misc.Mode8
ltx/en_us_oca/me.m07.d22:meMA.Ode8C11.ode	@ltx/en_us_oca/miscellanea:misc.Ode8
ltx/en_us_oca/me.m07.d22:meMA.Ode8C11.text	
ltx/en_us_oca/me.m07.d22:meMA.Ode8C12.incipit	…
ltx/en_us_oca/me.m07.d22:meMA.Ode8C12.melody	@ltx/en_us_oca/he.h.m8:heHE.EptaplasiosKaminon.notmetered
ltx/en_us_oca/me.m07.d22:meMA.Ode8C12.mode	@ltx/en_us_oca/miscellanea:misc.Mode8
ltx/en_us_oca/me.m07.d22:meMA.Ode8C12.ode	@ltx/en_us_oca/miscellanea:misc.Ode8
ltx/en_us_oca/me.m07.d22:meMA.Ode8C12.text	
ltx/en_us_oca/me.m07.d22:meMA.Ode8C1T.incipit	…
ltx/en_us_oca/me.m07.d22:meMA.Ode8C1T.melody	@ltx/en_us_oca/he.h.m8:heHE.EptaplasiosKaminon.notmetered
ltx/en_us_oca/me.m07.d22:meMA.Ode8C1T.mode	@ltx/en_us_oca/miscellanea:misc.Mode8
ltx/en_us_oca/me.m07.d22:meMA.Ode8C1T.ode	@ltx/en_us_oca/miscellanea:misc.Ode8
ltx/en_us_oca/me.m07.d22:meMA.Ode8C1T.text	
ltx/en_us_oca/me.m07.d22:meMA.Ode8H.greekmelody	@ltx/en_us_oca/he.h.m8:heHE.EptaplasiosKaminon.greekname
ltx/en_us_oca/me.m07.d22:meMA.Ode8H.incipit	@ltx/en_us_oca/he.h.m8:heHE.EptaplasiosKaminon.incipit
ltx/en_us_oca/me.m07.d22:meMA.Ode8H.melody	@ltx/en_us_oca/he.h.m8:heHE.EptaplasiosKaminon.melody
ltx/en_us_oca/me.m07.d22:meMA.Ode8H.mode	@ltx/en_us_oca/miscellanea:misc.Mode8
ltx/en_us_oca/me.m07.d22:meMA.Ode8H.ode	@ltx/en_us_oca/miscellanea:misc.Ode8
ltx/en_us_oca/me.m07.d22:meMA.Ode8H.text	@ltx/en_us_oca/he.h.m8:heHE.EptaplasiosKaminon.text
ltx/en_us_oca/me.m07.d22:meMA.Ode9C11.greekmelody	@ltx/en_us_oca/he.h.m8:heHE.ExestiEpiTouto.greekname
ltx/en_us_oca/me.m07.d22:meMA.Ode9C11.incipit	…
ltx/en_us_oca/me.m07.d22:meMA.Ode9C11.melody	@ltx/en_us_oca/he.h.m8:heHE.ExestiEpiTouto.notmetered
ltx/en_us_oca/me.m07.d22:meMA.Ode9C11.mode	@ltx/en_us_oca/miscellanea:misc.Mode8
ltx/en_us_oca/me.m07.d22:meMA.Ode9C11.ode	@ltx/en_us_oca/miscellanea:misc.Ode9
ltx/en_us_oca/me.m07.d22:meMA.Ode9C11.text	
ltx/en_us_oca/me.m07.d22:meMA.Ode9C12.incipit	…
ltx/en_us_oca/me.m07.d22:meMA.Ode9C12.melody	@ltx/en_us_oca/he.h.m8:heHE.ExestiEpiTouto.notmetered
ltx/en_us_oca/me.m07.d22:meMA.Ode9C12.mode	@ltx/en_us_oca/miscellanea:misc.Mode8
ltx/en_us_oca/me.m07.d22:meMA.Ode9C12.ode	@ltx/en_us_oca/miscellanea:misc.Ode9
ltx/en_us_oca/me.m07.d22:meMA.Ode9C12.text	
ltx/en_us_oca/me.m07.d22:meMA.Ode9C13.incipit	…
ltx/en_us_oca/me.m07.d22:meMA.Ode9C13.melody	@ltx/en_us_oca/he.h.m8:heHE.ExestiEpiTouto.notmetered
ltx/en_us_oca/me.m07.d22:meMA.Ode9C13.mode	@ltx/en_us_oca/miscellanea:misc.Mode8
ltx/en_us_oca/me.m07.d22:meMA.Ode9C13.ode	@ltx/en_us_oca/miscellanea:misc.Ode9
ltx/en_us_oca/me.m07.d22:meMA.Ode9C13.text	
ltx/en_us_oca/me.m07.d22:meMA.Ode9C1T.incipit	…
ltx/en_us_oca/me.m07.d22:meMA.Ode9C1T.melody	@ltx/en_us_oca/he.h.m8:heHE.ExestiEpiTouto.notmetered
ltx/en_us_oca/me.m07.d22:meMA.Ode9C1T.mode	@ltx/en_us_oca/miscellanea:misc.Mode8
ltx/en_us_oca/me.m07.d22:meMA.Ode9C1T.ode	@ltx/en_us_oca/miscellanea:misc.Ode9
ltx/en_us_oca/me.m07.d22:meMA.Ode9C1T.text	
ltx/en_us_oca/me.m07.d22:meMA.Ode9H.greekmelody	@ltx/en_us_oca/he.h.m8:heHE.ExestiEpiTouto.greekname
ltx/en_us_oca/me.m07.d22:meMA.Ode9H.incipit	@ltx/en_us_oca/he.h.m8:heHE.ExestiEpiTouto.incipit
ltx/en_us_oca/me.m07.d22:meMA.Ode9H.melody	@ltx/en_us_oca/he.h.m8:heHE.ExestiEpiTouto.melody
ltx/en_us_oca/me.m07.d22:meMA.Ode9H.mode	@ltx/en_us_oca/miscellanea:misc.Mode8
ltx/en_us_oca/me.m07.d22:meMA.Ode9H.ode	@ltx/en_us_oca/miscellanea:misc.Ode9
ltx/en_us_oca/me.m07.d22:meMA.Ode9H.text	@ltx/en_us_oca/he.h.m8:heHE.ExestiEpiTouto.text
ltx/en_us_oca/me.m07.d22:meMA.Oikos1.text	
ltx/en_us_oca/me.m07.d22:meVE.Apolytikion1.greekmelody	@ltx/en_us_oca/he.a.m1:heAU.TonTafonSouSotir.greekname
ltx/en_us_oca/me.m07.d22:meVE.Apolytikion1.incipit	…
ltx/en_us_oca/me.m07.d22:meVE.Apolytikion1.melody	@ltx/en_us_oca/he.a.m1:heAU.TonTafonSouSotir.notmetered
ltx/en_us_oca/me.m07.d22:meVE.Apolytikion1.mode	@ltx/en_us_oca/miscellanea:misc.Mode1
ltx/en_us_oca/me.m07.d22:meVE.Apolytikion1.text	
ltx/en_us_oca/me.m07.d22:meVE.AposGlory.incipit	As a disciple faithfully…
ltx/en_us_oca/me.m07.d22:meVE.AposGlory.melody	
ltx/en_us_oca/me.m07.d22:meVE.AposGlory.mode	@ltx/en_us_oca/miscellanea:misc.Mode8
ltx/en_us_oca/me.m07.d22:meVE.AposGlory.poet	@ltx/en_us_oca/poets:po.Vyzantos
ltx/en_us_oca/me.m07.d22:meVE.AposGlory.text	As a disciple faithfully ministering to Christ God ⁄ Who in His great compassion willingly assumed my poverty, ⁄ Mary Magdalene beheld Him stretched upon the Tree ⁄ and enclosed within a tomb. ⁄ She cried aloud with flowing tears: ⁄ What strange sight do I see? ⁄ You give life to the dead, yet You are counted among the dead! ⁄ How shall I bring myrrh to You ⁄ when You have removed from me the stench of demons? ⁄ How shall I shed tears for You, ⁄ for You wiped away the tears of Eve? ⁄ Yet, King of all, you appeared as a Gardener, ⁄ taking away the burning heat with the dew of your words. ⁄ You said to her: Go to My brethren! ⁄ Declare to them the joy of the Gospel! ⁄ For I shall ascend to the Father, ⁄ to My God and your God, ⁄⁄ that I may grant great mercy to the world!
ltx/en_us_oca/me.m07.d22:meVE.AposStavrotheotokion.greekmelody	@ltx/en_us_oca/he.a.m8:heAU.TiYmasKalesomen.greekname
ltx/en_us_oca/me.m07.d22:meVE.AposStavrotheotokion.incipit	@ltx/en_us_oca/me.m06.d18:meVE.SticStavrotheotokion.incipit
ltx/en_us_oca/me.m07.d22:meVE.AposStavrotheotokion.melody	@ltx/en_us_oca/he.a.m8:heAU.TiYmasKalesomen.notmetered
ltx/en_us_oca/me.m07.d22:meVE.AposStavrotheotokion.mode	@ltx/en_us_oca/miscellanea:misc.Mode8
ltx/en_us_oca/me.m07.d22:meVE.AposStavrotheotokion.text	@ltx/en_us_oca/me.m06.d18:meVE.SticStavrotheotokion.text
ltx/en_us_oca/me.m07.d22:meVE.AposTheotokion.greekmelody	@ltx/en_us_oca/he.a.m8:heAU.OTouParadoxou.greekname
ltx/en_us_oca/me.m07.d22:meVE.AposTheotokion.incipit	@ltx/en_us_oca/oc.m8.d2:ocVE.AposTheotokion.incipit
ltx/en_us_oca/me.m07.d22:meVE.AposTheotokion.melody	@ltx/en_us_oca/he.a.m8:heAU.OTouParadoxou.name
ltx/en_us_oca/me.m07.d22:meVE.AposTheotokion.mode	@ltx/en_us_oca/miscellanea:misc.Mode8
ltx/en_us_oca/me.m07.d22:meVE.AposTheotokion.text	@ltx/en_us_oca/oc.m8.d2:ocVE.AposTheotokion.text
ltx/en_us_oca/me.m07.d22:meVE.Aposticha1.greekmelody	@ltx/en_us_oca/he.a.m8:heAU.OTouParadoxou.greekname
ltx/en_us_oca/me.m07.d22:meVE.Aposticha1.incipit	…
ltx/en_us_oca/me.m07.d22:meVE.Aposticha1.melody	@ltx/en_us_oca/he.a.m8:heAU.OTouParadoxou.notmetered
ltx/en_us_oca/me.m07.d22:meVE.Aposticha1.mode	@ltx/en_us_oca/miscellanea:misc.Mode8
ltx/en_us_oca/me.m07.d22:meVE.Aposticha1.text	
ltx/en_us_oca/me.m07.d22:meVE.Aposticha2.incipit	…
ltx/en_us_oca/me.m07.d22:meVE.Aposticha2.melody	@ltx/en_us_oca/he.a.m8:heAU.OTouParadoxou.notmetered
ltx/en_us_oca/me.m07.d22:meVE.Aposticha2.mode	@ltx/en_us_oca/miscellanea:misc.Mode8
ltx/en_us_oca/me.m07.d22:meVE.Aposticha2.text	
ltx/en_us_oca/me.m07.d22:meVE.Aposticha3.incipit	…
ltx/en_us_oca/me.m07.d22:meVE.Aposticha3.melody	@ltx/en_us_oca/he.a.m8:heAU.OTouParadoxou.notmetered
ltx/en_us_oca/me.m07.d22:meVE.Aposticha3.mode	@ltx/en_us_oca/miscellanea:misc.Mode8
ltx/en_us_oca/me.m07.d22:meVE.Aposticha3.text	
ltx/en_us_oca/me.m07.d22:meVE.SticGlory.incipit	Mary Magdalene…
ltx/en_us_oca/me.m07.d22:meVE.SticGlory.melody	
ltx/en_us_oca/me.m07.d22:meVE.SticGlory.mode	@ltx/en_us_oca/miscellanea:misc.Mode6
ltx/en_us_oca/me.m07.d22:meVE.SticGlory.poet	@ltx/en_us_oca/poets:po.Anatoliou
ltx/en_us_oca/me.m07.d22:meVE.SticGlory.text	Mary Magdalene, ⁄ you were the first to behold the Resurrection ⁄ of Him Who in compassion raised our nature to its first splendor. ⁄ You became an apostle to the apostles! ⁄ Proclaiming the good news, you cried out to them: ⁄ Stop your lamentation and receive my announcement of joy! ⁄ Come and see the Resurrection of Christ, ⁄⁄ Who has granted great mercy to the world!
ltx/en_us_oca/me.m07.d22:meVE.SticStavrotheotokion.greekmelody	@ltx/en_us_oca/he.a.m6:heAU.TriimerosAnestis.greekname
ltx/en_us_oca/me.m07.d22:meVE.SticStavrotheotokion.incipit	@ltx/en_us_oca/oc.m6.d4:ocMA.AposTheotokion.incipit
ltx/en_us_oca/me.m07.d22:meVE.SticStavrotheotokion.melody	@ltx/en_us_oca/he.a.m6:heAU.TriimerosAnestis.notmetered
ltx/en_us_oca/me.m07.d22:meVE.SticStavrotheotokion.mode	@ltx/en_us_oca/miscellanea:misc.Mode6
ltx/en_us_oca/me.m07.d22:meVE.SticStavrotheotokion.text	@ltx/en_us_oca/oc.m6.d4:ocMA.AposTheotokion.text
ltx/en_us_oca/me.m07.d22:meVE.SticTheotokion.incipit	@ltx/en_us_oca/oc.m6.d3:ocMA.AposTheotokion.incipit
ltx/en_us_oca/me.m07.d22:meVE.SticTheotokion.melody	
ltx/en_us_oca/me.m07.d22:meVE.SticTheotokion.mode	@ltx/en_us_oca/miscellanea:misc.Mode6
ltx/en_us_oca/me.m07.d22:meVE.SticTheotokion.text	@ltx/en_us_oca/oc.m6.d3:ocMA.AposTheotokion.text
ltx/en_us_oca/me.m07.d22:meVE.Stichera01.greekmelody	@ltx/en_us_oca/he.a.m1:heAU.PaneffimoiMartyres.greekname
ltx/en_us_oca/me.m07.d22:meVE.Stichera01.incipit	You offered myrrh…
ltx/en_us_oca/me.m07.d22:meVE.Stichera01.melody	@ltx/en_us_oca/he.a.m1:heAU.PaneffimoiMartyres.notmetered
ltx/en_us_oca/me.m07.d22:meVE.Stichera01.mode	@ltx/en_us_oca/miscellanea:misc.Mode1
ltx/en_us_oca/me.m07.d22:meVE.Stichera01.text	You offered myrrh to Christ, Who lay in the tomb, ⁄ breathing life and Resurrection upon all the dead. ⁄ When you beheld Him, God-bearing Mary, ⁄ you were the first to worship Him with tears of joy. ⁄⁄ Pray that He may grant peace and great mercy to our souls!
ltx/en_us_oca/me.m07.d22:meVE.Stichera02.incipit	When Magdalene beheld…
ltx/en_us_oca/me.m07.d22:meVE.Stichera02.melody	@ltx/en_us_oca/he.a.m1:heAU.PaneffimoiMartyres.notmetered
ltx/en_us_oca/me.m07.d22:meVE.Stichera02.mode	@ltx/en_us_oca/miscellanea:misc.Mode1
ltx/en_us_oca/me.m07.d22:meVE.Stichera02.text	When Magdalene beheld Christ dying upon the Cross, ⁄ she cried out in bitter grief: ⁄ What is this most terrible sight? ⁄ How can life die? How can the Creator cease to be? ⁄ How is the light overcome by darkness? ⁄⁄ Pray that He may grant peace and great mercy to our souls!
ltx/en_us_oca/me.m07.d22:meVE.Stichera03.incipit	Filled with great wisdom…
ltx/en_us_oca/me.m07.d22:meVE.Stichera03.melody	@ltx/en_us_oca/he.a.m1:heAU.PaneffimoiMartyres.notmetered
ltx/en_us_oca/me.m07.d22:meVE.Stichera03.mode	@ltx/en_us_oca/miscellanea:misc.Mode1
ltx/en_us_oca/me.m07.d22:meVE.Stichera03.text	Filled with great wisdom and knowledge of truth, ⁄ you longed to be with Him Who created you, all-glorious Mary: ⁄ You announced His Passion and proclaimed His condescension to the apostles; ⁄ truly you deserve our highest praise! ⁄⁄ Pray that He may grant peace and great mercy to our souls!
