ltx/en_us_oca/tr.d044:trCO.header	
ltx/en_us_oca/tr.d044:trDA.commemoration.full	
ltx/en_us_oca/tr.d044:trDA.commemoration.short	
ltx/en_us_oca/tr.d044:trDA.insert1	
ltx/en_us_oca/tr.d044:trDA.insert2	
ltx/en_us_oca/tr.d044:trDA.note	
ltx/en_us_oca/tr.d044:trDA.title	
ltx/en_us_oca/tr.d044:trHO.commemorations	
ltx/en_us_oca/tr.d044:trHO.daytitle	
ltx/en_us_oca/tr.d044:trHO.description1	
ltx/en_us_oca/tr.d044:trHO.description2	
ltx/en_us_oca/tr.d044:trHO.note1	
ltx/en_us_oca/tr.d044:trHO.note2	
ltx/en_us_oca/tr.d044:trMA.AposIdiomelon1.incipit	…
ltx/en_us_oca/tr.d044:trMA.AposIdiomelon1.melody	@ltx/en_us_oca/miscellanea:misc.Idiomelon
ltx/en_us_oca/tr.d044:trMA.AposIdiomelon1.mode	@ltx/en_us_oca/miscellanea:misc.Mode6
ltx/en_us_oca/tr.d044:trMA.AposIdiomelon1.text	
ltx/en_us_oca/tr.d044:trMA.AposMartyric.incipit	…
ltx/en_us_oca/tr.d044:trMA.AposMartyric.melody	
ltx/en_us_oca/tr.d044:trMA.AposMartyric.mode	@ltx/en_us_oca/miscellanea:misc.Mode6
ltx/en_us_oca/tr.d044:trMA.AposMartyric.text	
ltx/en_us_oca/tr.d044:trMA.AposTheotokion.incipit	…
ltx/en_us_oca/tr.d044:trMA.AposTheotokion.melody	
ltx/en_us_oca/tr.d044:trMA.AposTheotokion.mode	@ltx/en_us_oca/miscellanea:misc.Mode6
ltx/en_us_oca/tr.d044:trMA.AposTheotokion.text	
ltx/en_us_oca/tr.d044:trMA.C1.poet	@ltx/en_us_oca/poets:po.KyriouIoannou
ltx/en_us_oca/tr.d044:trMA.C1.title	
ltx/en_us_oca/tr.d044:trMA.C1.verse	
ltx/en_us_oca/tr.d044:trMA.C2.poet	@ltx/en_us_oca/poets:po.KyriouTheodorou
ltx/en_us_oca/tr.d044:trMA.C2.title	
ltx/en_us_oca/tr.d044:trMA.C2.verse	
ltx/en_us_oca/tr.d044:trMA.Kathisma21.greekmelody	@ltx/en_us_oca/he.a.m8:heAU.AnestisEkNekron.greekname
ltx/en_us_oca/tr.d044:trMA.Kathisma21.incipit	…
ltx/en_us_oca/tr.d044:trMA.Kathisma21.melody	@ltx/en_us_oca/he.a.m8:heAU.AnestisEkNekron.notmetered
ltx/en_us_oca/tr.d044:trMA.Kathisma21.mode	@ltx/en_us_oca/miscellanea:misc.Mode8
ltx/en_us_oca/tr.d044:trMA.Kathisma21.text	
ltx/en_us_oca/tr.d044:trMA.Kathisma22.greekmelody	@ltx/en_us_oca/he.a.m8:heAU.AnestisEkNekron.greekname
ltx/en_us_oca/tr.d044:trMA.Kathisma22.incipit	…
ltx/en_us_oca/tr.d044:trMA.Kathisma22.melody	@ltx/en_us_oca/he.a.m8:heAU.AnestisEkNekron.notmetered
ltx/en_us_oca/tr.d044:trMA.Kathisma22.mode	@ltx/en_us_oca/miscellanea:misc.Mode8
ltx/en_us_oca/tr.d044:trMA.Kathisma22.text	
ltx/en_us_oca/tr.d044:trMA.Kathisma31.greekmelody	@ltx/en_us_oca/he.a.m3:heAU.TinOraiotita.greekname
ltx/en_us_oca/tr.d044:trMA.Kathisma31.incipit	…
ltx/en_us_oca/tr.d044:trMA.Kathisma31.melody	@ltx/en_us_oca/he.a.m3:heAU.TinOraiotita.notmetered
ltx/en_us_oca/tr.d044:trMA.Kathisma31.mode	@ltx/en_us_oca/miscellanea:misc.Mode3
ltx/en_us_oca/tr.d044:trMA.Kathisma31.text	
ltx/en_us_oca/tr.d044:trMA.Kathisma32.greekmelody	@ltx/en_us_oca/he.a.m3:heAU.TinOraiotita.greekname
ltx/en_us_oca/tr.d044:trMA.Kathisma32.incipit	@ltx/en_us_oca/oc.m3.d5:octrMA.Kathisma1T.incipit
ltx/en_us_oca/tr.d044:trMA.Kathisma32.melody	@ltx/en_us_oca/he.a.m3:heAU.TinOraiotita.notmetered
ltx/en_us_oca/tr.d044:trMA.Kathisma32.mode	@ltx/en_us_oca/miscellanea:misc.Mode3
ltx/en_us_oca/tr.d044:trMA.Kathisma32.text	@ltx/en_us_oca/oc.m3.d5:octrMA.Kathisma1T.text
ltx/en_us_oca/tr.d044:trMA.Ode1C11.greekmelody	@ltx/en_us_oca/he.h.m8:heHE.ArmatilatinFarao.greekname
ltx/en_us_oca/tr.d044:trMA.Ode1C11.incipit	…
ltx/en_us_oca/tr.d044:trMA.Ode1C11.melody	@ltx/en_us_oca/he.h.m8:heHE.ArmatilatinFarao.notmetered
ltx/en_us_oca/tr.d044:trMA.Ode1C11.mode	@ltx/en_us_oca/miscellanea:misc.Mode8
ltx/en_us_oca/tr.d044:trMA.Ode1C11.ode	@ltx/en_us_oca/miscellanea:misc.Ode1
ltx/en_us_oca/tr.d044:trMA.Ode1C11.text	
ltx/en_us_oca/tr.d044:trMA.Ode1C12.incipit	…
ltx/en_us_oca/tr.d044:trMA.Ode1C12.melody	@ltx/en_us_oca/he.h.m8:heHE.ArmatilatinFarao.notmetered
ltx/en_us_oca/tr.d044:trMA.Ode1C12.mode	@ltx/en_us_oca/miscellanea:misc.Mode8
ltx/en_us_oca/tr.d044:trMA.Ode1C12.ode	@ltx/en_us_oca/miscellanea:misc.Ode1
ltx/en_us_oca/tr.d044:trMA.Ode1C12.text	
ltx/en_us_oca/tr.d044:trMA.Ode1C13.incipit	…
ltx/en_us_oca/tr.d044:trMA.Ode1C13.melody	@ltx/en_us_oca/he.h.m8:heHE.ArmatilatinFarao.notmetered
ltx/en_us_oca/tr.d044:trMA.Ode1C13.mode	@ltx/en_us_oca/miscellanea:misc.Mode8
ltx/en_us_oca/tr.d044:trMA.Ode1C13.ode	@ltx/en_us_oca/miscellanea:misc.Ode1
ltx/en_us_oca/tr.d044:trMA.Ode1C13.text	
ltx/en_us_oca/tr.d044:trMA.Ode1C1T.incipit	…
ltx/en_us_oca/tr.d044:trMA.Ode1C1T.melody	@ltx/en_us_oca/he.h.m8:heHE.ArmatilatinFarao.notmetered
ltx/en_us_oca/tr.d044:trMA.Ode1C1T.mode	@ltx/en_us_oca/miscellanea:misc.Mode8
ltx/en_us_oca/tr.d044:trMA.Ode1C1T.ode	@ltx/en_us_oca/miscellanea:misc.Ode1
ltx/en_us_oca/tr.d044:trMA.Ode1C1T.text	
ltx/en_us_oca/tr.d044:trMA.Ode1C21.greekmelody	@ltx/en_us_oca/he.h.m3:heHE.AsomenToKyrio.greekname
ltx/en_us_oca/tr.d044:trMA.Ode1C21.incipit	…
ltx/en_us_oca/tr.d044:trMA.Ode1C21.melody	@ltx/en_us_oca/he.h.m3:heHE.AsomenToKyrio.notmetered
ltx/en_us_oca/tr.d044:trMA.Ode1C21.mode	@ltx/en_us_oca/miscellanea:misc.Mode3
ltx/en_us_oca/tr.d044:trMA.Ode1C21.ode	@ltx/en_us_oca/miscellanea:misc.Ode1
ltx/en_us_oca/tr.d044:trMA.Ode1C21.text	
ltx/en_us_oca/tr.d044:trMA.Ode1C22.incipit	…
ltx/en_us_oca/tr.d044:trMA.Ode1C22.melody	@ltx/en_us_oca/he.h.m3:heHE.AsomenToKyrio.notmetered
ltx/en_us_oca/tr.d044:trMA.Ode1C22.mode	@ltx/en_us_oca/miscellanea:misc.Mode3
ltx/en_us_oca/tr.d044:trMA.Ode1C22.ode	@ltx/en_us_oca/miscellanea:misc.Ode1
ltx/en_us_oca/tr.d044:trMA.Ode1C22.text	
ltx/en_us_oca/tr.d044:trMA.Ode1C2A1.incipit	…
ltx/en_us_oca/tr.d044:trMA.Ode1C2A1.melody	@ltx/en_us_oca/he.h.m3:heHE.AsomenToKyrio.notmetered
ltx/en_us_oca/tr.d044:trMA.Ode1C2A1.mode	@ltx/en_us_oca/miscellanea:misc.Mode3
ltx/en_us_oca/tr.d044:trMA.Ode1C2A1.ode	@ltx/en_us_oca/miscellanea:misc.Ode1
ltx/en_us_oca/tr.d044:trMA.Ode1C2A1.text	
ltx/en_us_oca/tr.d044:trMA.Ode1C2H.greekmelody	@ltx/en_us_oca/he.h.m3:heHE.AsomenToKyrio.greekname
ltx/en_us_oca/tr.d044:trMA.Ode1C2H.incipit	@ltx/en_us_oca/he.h.m3:heHE.AsomenToKyrio.incipit
ltx/en_us_oca/tr.d044:trMA.Ode1C2H.melody	@ltx/en_us_oca/he.h.m3:heHE.AsomenToKyrio.melody
ltx/en_us_oca/tr.d044:trMA.Ode1C2H.mode	@ltx/en_us_oca/miscellanea:misc.Mode3
ltx/en_us_oca/tr.d044:trMA.Ode1C2H.ode	@ltx/en_us_oca/miscellanea:misc.Ode1
ltx/en_us_oca/tr.d044:trMA.Ode1C2H.text	@ltx/en_us_oca/he.h.m3:heHE.AsomenToKyrio.text
ltx/en_us_oca/tr.d044:trMA.Ode1C2T.incipit	…
ltx/en_us_oca/tr.d044:trMA.Ode1C2T.melody	@ltx/en_us_oca/he.h.m3:heHE.AsomenToKyrio.notmetered
ltx/en_us_oca/tr.d044:trMA.Ode1C2T.mode	@ltx/en_us_oca/miscellanea:misc.Mode3
ltx/en_us_oca/tr.d044:trMA.Ode1C2T.ode	@ltx/en_us_oca/miscellanea:misc.Ode1
ltx/en_us_oca/tr.d044:trMA.Ode1C2T.text	
ltx/en_us_oca/tr.d044:trMA.Ode1C2Tr.incipit	…
ltx/en_us_oca/tr.d044:trMA.Ode1C2Tr.melody	@ltx/en_us_oca/he.h.m3:heHE.AsomenToKyrio.notmetered
ltx/en_us_oca/tr.d044:trMA.Ode1C2Tr.mode	@ltx/en_us_oca/miscellanea:misc.Mode3
ltx/en_us_oca/tr.d044:trMA.Ode1C2Tr.ode	@ltx/en_us_oca/miscellanea:misc.Ode1
ltx/en_us_oca/tr.d044:trMA.Ode1C2Tr.text	
ltx/en_us_oca/tr.d044:trMA.Ode8C11.greekmelody	@ltx/en_us_oca/he.h.m8:heHE.EptaplasiosKaminon.greekname
ltx/en_us_oca/tr.d044:trMA.Ode8C11.incipit	…
ltx/en_us_oca/tr.d044:trMA.Ode8C11.melody	@ltx/en_us_oca/he.h.m8:heHE.EptaplasiosKaminon.notmetered
ltx/en_us_oca/tr.d044:trMA.Ode8C11.mode	@ltx/en_us_oca/miscellanea:misc.Mode8
ltx/en_us_oca/tr.d044:trMA.Ode8C11.ode	@ltx/en_us_oca/miscellanea:misc.Ode8
ltx/en_us_oca/tr.d044:trMA.Ode8C11.text	
ltx/en_us_oca/tr.d044:trMA.Ode8C12.incipit	…
ltx/en_us_oca/tr.d044:trMA.Ode8C12.melody	@ltx/en_us_oca/he.h.m8:heHE.EptaplasiosKaminon.notmetered
ltx/en_us_oca/tr.d044:trMA.Ode8C12.mode	@ltx/en_us_oca/miscellanea:misc.Mode8
ltx/en_us_oca/tr.d044:trMA.Ode8C12.ode	@ltx/en_us_oca/miscellanea:misc.Ode8
ltx/en_us_oca/tr.d044:trMA.Ode8C12.text	
ltx/en_us_oca/tr.d044:trMA.Ode8C13.incipit	…
ltx/en_us_oca/tr.d044:trMA.Ode8C13.melody	@ltx/en_us_oca/he.h.m8:heHE.EptaplasiosKaminon.notmetered
ltx/en_us_oca/tr.d044:trMA.Ode8C13.mode	@ltx/en_us_oca/miscellanea:misc.Mode8
ltx/en_us_oca/tr.d044:trMA.Ode8C13.ode	@ltx/en_us_oca/miscellanea:misc.Ode8
ltx/en_us_oca/tr.d044:trMA.Ode8C13.text	
ltx/en_us_oca/tr.d044:trMA.Ode8C1T.incipit	…
ltx/en_us_oca/tr.d044:trMA.Ode8C1T.melody	@ltx/en_us_oca/he.h.m8:heHE.EptaplasiosKaminon.notmetered
ltx/en_us_oca/tr.d044:trMA.Ode8C1T.mode	@ltx/en_us_oca/miscellanea:misc.Mode8
ltx/en_us_oca/tr.d044:trMA.Ode8C1T.ode	@ltx/en_us_oca/miscellanea:misc.Ode8
ltx/en_us_oca/tr.d044:trMA.Ode8C1T.text	
ltx/en_us_oca/tr.d044:trMA.Ode8C21.greekmelody	@ltx/en_us_oca/he.h.m3:heHE.TonYpAngelon.greekname
ltx/en_us_oca/tr.d044:trMA.Ode8C21.incipit	…
ltx/en_us_oca/tr.d044:trMA.Ode8C21.melody	@ltx/en_us_oca/he.h.m3:heHE.TonYpAngelon.notmetered
ltx/en_us_oca/tr.d044:trMA.Ode8C21.mode	@ltx/en_us_oca/miscellanea:misc.Mode3
ltx/en_us_oca/tr.d044:trMA.Ode8C21.ode	@ltx/en_us_oca/miscellanea:misc.Ode8
ltx/en_us_oca/tr.d044:trMA.Ode8C21.text	
ltx/en_us_oca/tr.d044:trMA.Ode8C22.incipit	…
ltx/en_us_oca/tr.d044:trMA.Ode8C22.melody	@ltx/en_us_oca/he.h.m3:heHE.TonYpAngelon.notmetered
ltx/en_us_oca/tr.d044:trMA.Ode8C22.mode	@ltx/en_us_oca/miscellanea:misc.Mode3
ltx/en_us_oca/tr.d044:trMA.Ode8C22.ode	@ltx/en_us_oca/miscellanea:misc.Ode8
ltx/en_us_oca/tr.d044:trMA.Ode8C22.text	
ltx/en_us_oca/tr.d044:trMA.Ode8C2A1.incipit	…
ltx/en_us_oca/tr.d044:trMA.Ode8C2A1.melody	@ltx/en_us_oca/he.h.m3:heHE.TonYpAngelon.notmetered
ltx/en_us_oca/tr.d044:trMA.Ode8C2A1.mode	@ltx/en_us_oca/miscellanea:misc.Mode3
ltx/en_us_oca/tr.d044:trMA.Ode8C2A1.ode	@ltx/en_us_oca/miscellanea:misc.Ode8
ltx/en_us_oca/tr.d044:trMA.Ode8C2A1.text	
ltx/en_us_oca/tr.d044:trMA.Ode8C2H.greekmelody	@ltx/en_us_oca/he.h.m3:heHE.TonYpAngelon.greekname
ltx/en_us_oca/tr.d044:trMA.Ode8C2H.incipit	@ltx/en_us_oca/he.h.m3:heHE.TonYpAngelon.incipit
ltx/en_us_oca/tr.d044:trMA.Ode8C2H.melody	@ltx/en_us_oca/he.h.m3:heHE.TonYpAngelon.melody
ltx/en_us_oca/tr.d044:trMA.Ode8C2H.mode	@ltx/en_us_oca/miscellanea:misc.Mode3
ltx/en_us_oca/tr.d044:trMA.Ode8C2H.ode	@ltx/en_us_oca/miscellanea:misc.Ode8
ltx/en_us_oca/tr.d044:trMA.Ode8C2H.text	@ltx/en_us_oca/he.h.m3:heHE.TonYpAngelon.text
ltx/en_us_oca/tr.d044:trMA.Ode8C2T.incipit	…
ltx/en_us_oca/tr.d044:trMA.Ode8C2T.melody	@ltx/en_us_oca/he.h.m3:heHE.TonYpAngelon.notmetered
ltx/en_us_oca/tr.d044:trMA.Ode8C2T.mode	@ltx/en_us_oca/miscellanea:misc.Mode3
ltx/en_us_oca/tr.d044:trMA.Ode8C2T.ode	@ltx/en_us_oca/miscellanea:misc.Ode8
ltx/en_us_oca/tr.d044:trMA.Ode8C2T.text	
ltx/en_us_oca/tr.d044:trMA.Ode8C2Tr.incipit	…
ltx/en_us_oca/tr.d044:trMA.Ode8C2Tr.melody	@ltx/en_us_oca/he.h.m3:heHE.TonYpAngelon.notmetered
ltx/en_us_oca/tr.d044:trMA.Ode8C2Tr.mode	@ltx/en_us_oca/miscellanea:misc.Mode3
ltx/en_us_oca/tr.d044:trMA.Ode8C2Tr.ode	@ltx/en_us_oca/miscellanea:misc.Ode8
ltx/en_us_oca/tr.d044:trMA.Ode8C2Tr.text	
ltx/en_us_oca/tr.d044:trMA.Ode9C11.greekmelody	@ltx/en_us_oca/he.h.m8:heHE.EfrixePasaAkoi.greekname
ltx/en_us_oca/tr.d044:trMA.Ode9C11.incipit	…
ltx/en_us_oca/tr.d044:trMA.Ode9C11.melody	@ltx/en_us_oca/he.h.m8:heHE.EfrixePasaAkoi.notmetered
ltx/en_us_oca/tr.d044:trMA.Ode9C11.mode	@ltx/en_us_oca/miscellanea:misc.Mode8
ltx/en_us_oca/tr.d044:trMA.Ode9C11.ode	@ltx/en_us_oca/miscellanea:misc.Ode9
ltx/en_us_oca/tr.d044:trMA.Ode9C11.text	
ltx/en_us_oca/tr.d044:trMA.Ode9C12.incipit	…
ltx/en_us_oca/tr.d044:trMA.Ode9C12.melody	@ltx/en_us_oca/he.h.m8:heHE.EfrixePasaAkoi.notmetered
ltx/en_us_oca/tr.d044:trMA.Ode9C12.mode	@ltx/en_us_oca/miscellanea:misc.Mode8
ltx/en_us_oca/tr.d044:trMA.Ode9C12.ode	@ltx/en_us_oca/miscellanea:misc.Ode9
ltx/en_us_oca/tr.d044:trMA.Ode9C12.text	
ltx/en_us_oca/tr.d044:trMA.Ode9C13.incipit	…
ltx/en_us_oca/tr.d044:trMA.Ode9C13.melody	@ltx/en_us_oca/he.h.m8:heHE.EfrixePasaAkoi.notmetered
ltx/en_us_oca/tr.d044:trMA.Ode9C13.mode	@ltx/en_us_oca/miscellanea:misc.Mode8
ltx/en_us_oca/tr.d044:trMA.Ode9C13.ode	@ltx/en_us_oca/miscellanea:misc.Ode9
ltx/en_us_oca/tr.d044:trMA.Ode9C13.text	
ltx/en_us_oca/tr.d044:trMA.Ode9C1T.incipit	…
ltx/en_us_oca/tr.d044:trMA.Ode9C1T.melody	@ltx/en_us_oca/he.h.m8:heHE.EfrixePasaAkoi.notmetered
ltx/en_us_oca/tr.d044:trMA.Ode9C1T.mode	@ltx/en_us_oca/miscellanea:misc.Mode8
ltx/en_us_oca/tr.d044:trMA.Ode9C1T.ode	@ltx/en_us_oca/miscellanea:misc.Ode9
ltx/en_us_oca/tr.d044:trMA.Ode9C1T.text	
ltx/en_us_oca/tr.d044:trMA.Ode9C21.greekmelody	@ltx/en_us_oca/he.h.m3:heHE.EnSinaioToOrei.greekname
ltx/en_us_oca/tr.d044:trMA.Ode9C21.incipit	…
ltx/en_us_oca/tr.d044:trMA.Ode9C21.melody	@ltx/en_us_oca/he.h.m3:heHE.EnSinaioToOrei.notmetered
ltx/en_us_oca/tr.d044:trMA.Ode9C21.mode	@ltx/en_us_oca/miscellanea:misc.Mode3
ltx/en_us_oca/tr.d044:trMA.Ode9C21.ode	@ltx/en_us_oca/miscellanea:misc.Ode9
ltx/en_us_oca/tr.d044:trMA.Ode9C21.text	
ltx/en_us_oca/tr.d044:trMA.Ode9C22.incipit	…
ltx/en_us_oca/tr.d044:trMA.Ode9C22.melody	@ltx/en_us_oca/he.h.m3:heHE.EnSinaioToOrei.notmetered
ltx/en_us_oca/tr.d044:trMA.Ode9C22.mode	@ltx/en_us_oca/miscellanea:misc.Mode3
ltx/en_us_oca/tr.d044:trMA.Ode9C22.ode	@ltx/en_us_oca/miscellanea:misc.Ode9
ltx/en_us_oca/tr.d044:trMA.Ode9C22.text	
ltx/en_us_oca/tr.d044:trMA.Ode9C2A1.incipit	…
ltx/en_us_oca/tr.d044:trMA.Ode9C2A1.melody	@ltx/en_us_oca/he.h.m3:heHE.EnSinaioToOrei.notmetered
ltx/en_us_oca/tr.d044:trMA.Ode9C2A1.mode	@ltx/en_us_oca/miscellanea:misc.Mode3
ltx/en_us_oca/tr.d044:trMA.Ode9C2A1.ode	@ltx/en_us_oca/miscellanea:misc.Ode9
ltx/en_us_oca/tr.d044:trMA.Ode9C2A1.text	
ltx/en_us_oca/tr.d044:trMA.Ode9C2H.greekmelody	@ltx/en_us_oca/he.h.m3:heHE.EnSinaioToOrei.greekname
ltx/en_us_oca/tr.d044:trMA.Ode9C2H.incipit	@ltx/en_us_oca/he.h.m3:heHE.EnSinaioToOrei.incipit
ltx/en_us_oca/tr.d044:trMA.Ode9C2H.melody	@ltx/en_us_oca/he.h.m3:heHE.EnSinaioToOrei.melody
ltx/en_us_oca/tr.d044:trMA.Ode9C2H.mode	@ltx/en_us_oca/miscellanea:misc.Mode3
ltx/en_us_oca/tr.d044:trMA.Ode9C2H.ode	@ltx/en_us_oca/miscellanea:misc.Ode9
ltx/en_us_oca/tr.d044:trMA.Ode9C2H.text	@ltx/en_us_oca/he.h.m3:heHE.EnSinaioToOrei.text
ltx/en_us_oca/tr.d044:trMA.Ode9C2T.incipit	…
ltx/en_us_oca/tr.d044:trMA.Ode9C2T.melody	@ltx/en_us_oca/he.h.m3:heHE.EnSinaioToOrei.notmetered
ltx/en_us_oca/tr.d044:trMA.Ode9C2T.mode	@ltx/en_us_oca/miscellanea:misc.Mode3
ltx/en_us_oca/tr.d044:trMA.Ode9C2T.ode	@ltx/en_us_oca/miscellanea:misc.Ode9
ltx/en_us_oca/tr.d044:trMA.Ode9C2T.text	
ltx/en_us_oca/tr.d044:trMA.Ode9C2Tr.incipit	…
ltx/en_us_oca/tr.d044:trMA.Ode9C2Tr.melody	@ltx/en_us_oca/he.h.m3:heHE.EnSinaioToOrei.notmetered
ltx/en_us_oca/tr.d044:trMA.Ode9C2Tr.mode	@ltx/en_us_oca/miscellanea:misc.Mode3
ltx/en_us_oca/tr.d044:trMA.Ode9C2Tr.ode	@ltx/en_us_oca/miscellanea:misc.Ode9
ltx/en_us_oca/tr.d044:trMA.Ode9C2Tr.text	
ltx/en_us_oca/tr.d044:trTE.Troparion.incipit	Do not rebuke…
ltx/en_us_oca/tr.d044:trTE.Troparion.melody	
ltx/en_us_oca/tr.d044:trTE.Troparion.mode	@ltx/en_us_oca/miscellanea:misc.Mode7
ltx/en_us_oca/tr.d044:trTE.Troparion.text	Do not rebuke your sinful people in anger ⁄ nor chasten us in your wrath, for you are gracious! ⁄ All the earth glorifies you, Lord. ⁄⁄ we beseech you: spare us, holy One!
ltx/en_us_oca/tr.d044:trTE.Troparion2.incipit	…
ltx/en_us_oca/tr.d044:trTE.Troparion2.text	
ltx/en_us_oca/tr.d044:trVE.AposIdiomelon1.incipit	Because of my evil deeds…
ltx/en_us_oca/tr.d044:trVE.AposIdiomelon1.melody	@ltx/en_us_oca/miscellanea:misc.Idiomelon
ltx/en_us_oca/tr.d044:trVE.AposIdiomelon1.mode	@ltx/en_us_oca/miscellanea:misc.Mode8
ltx/en_us_oca/tr.d044:trVE.AposIdiomelon1.text	Because of my evil deeds, ⁄ I, a wretched man, dare not gaze upon heaven with my eyes. ⁄ But sighing like the Publican, I cry to you: ⁄ O God, forgive me a sinner, ⁄ and deliver me from the Pharisee’s hypocrisy, ⁄⁄ for you alone are compassionate.
ltx/en_us_oca/tr.d044:trVE.AposMartyric.incipit	O Martyrs of the Lord…
ltx/en_us_oca/tr.d044:trVE.AposMartyric.melody	
ltx/en_us_oca/tr.d044:trVE.AposMartyric.mode	@ltx/en_us_oca/miscellanea:misc.Mode8
ltx/en_us_oca/tr.d044:trVE.AposMartyric.text	O Martyrs of the Lord, ⁄ you sanctify every place and heal every ill. ⁄ Now therefore, intercede with him, ⁄⁄ that he may deliver our souls from every wile and snare of the enemy!
ltx/en_us_oca/tr.d044:trVE.AposTheotokion.incipit	The hosts of heaven praise…
ltx/en_us_oca/tr.d044:trVE.AposTheotokion.melody	
ltx/en_us_oca/tr.d044:trVE.AposTheotokion.mode	@ltx/en_us_oca/miscellanea:misc.Mode8
ltx/en_us_oca/tr.d044:trVE.AposTheotokion.text	The hosts of heaven praise you, ⁄ unwedded Mother, full of grace. ⁄ We glorify your ineffable childbearing. ⁄⁄ therefore, Theotokos, intercede for the salvation of our souls.
ltx/en_us_oca/tr.d044:trVE.Stichera01.greekmelody	@ltx/en_us_oca/he.a.m8:heAU.KyrieEiKaiKritirio.greekname
ltx/en_us_oca/tr.d044:trVE.Stichera01.incipit	Lord, you willingly stretched out…
ltx/en_us_oca/tr.d044:trVE.Stichera01.melody	@ltx/en_us_oca/he.a.m8:heAU.KyrieEiKaiKritirio.notmetered
ltx/en_us_oca/tr.d044:trVE.Stichera01.mode	@ltx/en_us_oca/miscellanea:misc.Mode8
ltx/en_us_oca/tr.d044:trVE.Stichera01.text	Lord, you willingly stretched out your hands on the cross: ⁄ make us ready for its adoration with reverent hearts, ⁄ radiant with fasting, intercessions, abstinence and love; ⁄⁄ for you are good and the Lover of mankind.
ltx/en_us_oca/tr.d044:trVE.Stichera02.greekmelody	@ltx/en_us_oca/he.a.m8:heAU.KyrieEiKaiKritirio.greekname
ltx/en_us_oca/tr.d044:trVE.Stichera02.incipit	Most compassionate Lord, ⁄ blot…
ltx/en_us_oca/tr.d044:trVE.Stichera02.melody	@ltx/en_us_oca/he.a.m8:heAU.KyrieEiKaiKritirio.notmetered
ltx/en_us_oca/tr.d044:trVE.Stichera02.mode	@ltx/en_us_oca/miscellanea:misc.Mode8
ltx/en_us_oca/tr.d044:trVE.Stichera02.text	Most compassionate Lord, ⁄ blot out the multitude of my sins by the great number of your mercies. ⁄ Make me worthy to behold your cross, ⁄ and to embrace it with a pure soul in this week of abstinence; ⁄⁄ for you are the Lover of mankind.
ltx/en_us_oca/tr.d044:trVE.Stichera03.incipit	Great wonder! I behold the…
ltx/en_us_oca/tr.d044:trVE.Stichera03.melody	
ltx/en_us_oca/tr.d044:trVE.Stichera03.mode	@ltx/en_us_oca/miscellanea:misc.Mode3
ltx/en_us_oca/tr.d044:trVE.Stichera03.text	Great wonder! I behold the tree ⁄ on which Christ was crucified in the flesh. ⁄ I see the world in adoration in its enlightenment! ⁄ I cry: How great is the power of the cross! ⁄ When the demons behold it, they are burned! ⁄ By its sign, they are consumed with flames. ⁄ Therefore, pure tree, I bless you; ⁄ I honor and adore you with fear, ⁄⁄ glorifying God, who through you, granted me unending life!
