ltx/en_us_oca/eu.lichrysbasil:euLI.Key0101.text	
ltx/en_us_oca/eu.lichrysbasil:euLI.Key0102.text	@ltx/en_us_oca/properties:deprecated.key
ltx/en_us_oca/eu.lichrysbasil:euLI.Key0103.text	
ltx/en_us_oca/eu.lichrysbasil:euLI.Key0104.text	
ltx/en_us_oca/eu.lichrysbasil:euLI.Key0105.text	
ltx/en_us_oca/eu.lichrysbasil:euLI.Key0106.text	
ltx/en_us_oca/eu.lichrysbasil:euLI.Key0107.text	
ltx/en_us_oca/eu.lichrysbasil:euLI.Key0108.text	@ltx/en_us_oca/properties:deprecated.key
ltx/en_us_oca/eu.lichrysbasil:euLI.Key0109.text	@ltx/en_us_oca/properties:deprecated.key
ltx/en_us_oca/eu.lichrysbasil:euLI.Key0110.text	@ltx/en_us_oca/properties:deprecated.key
ltx/en_us_oca/eu.lichrysbasil:euLI.Key0200.title	
ltx/en_us_oca/eu.lichrysbasil:euLI.Key0201.text	
ltx/en_us_oca/eu.lichrysbasil:euLI.Key0201.title	
ltx/en_us_oca/eu.lichrysbasil:euLI.Key0301.text	
ltx/en_us_oca/eu.lichrysbasil:euLI.Key0301.title	
ltx/en_us_oca/eu.lichrysbasil:euLI.Key0401.text	
ltx/en_us_oca/eu.lichrysbasil:euLI.Key0401.title	
ltx/en_us_oca/eu.lichrysbasil:euLI.Key0501.text	
ltx/en_us_oca/eu.lichrysbasil:euLI.Key0502.text	
ltx/en_us_oca/eu.lichrysbasil:euLI.Key0503.text	
ltx/en_us_oca/eu.lichrysbasil:euLI.Key0601.text	
ltx/en_us_oca/eu.lichrysbasil:euLI.Key0602.text	
ltx/en_us_oca/eu.lichrysbasil:euLI.Key0603.text	@ltx/en_us_oca/properties:deprecated.key
ltx/en_us_oca/eu.lichrysbasil:euLI.Key0604.text	
ltx/en_us_oca/eu.lichrysbasil:euLI.Key0605.text	
ltx/en_us_oca/eu.lichrysbasil:euLI.Key0606.text	
ltx/en_us_oca/eu.lichrysbasil:euLI.Key0607.text	
ltx/en_us_oca/eu.lichrysbasil:euLI.Key0607.title	
ltx/en_us_oca/eu.lichrysbasil:euLI.Key0608.text	
ltx/en_us_oca/eu.lichrysbasil:euLI.Key0701.text	
ltx/en_us_oca/eu.lichrysbasil:euLI.Key0702.text	
ltx/en_us_oca/eu.lichrysbasil:euLI.Key0703.text	
ltx/en_us_oca/eu.lichrysbasil:euLI.Key0704.text	
ltx/en_us_oca/eu.lichrysbasil:euLI.Key0704.title	
ltx/en_us_oca/eu.lichrysbasil:euLI.Key0705.text	@ltx/en_us_oca/properties:deprecated.key
ltx/en_us_oca/eu.lichrysbasil:euLI.Key0706.rubric	
ltx/en_us_oca/eu.lichrysbasil:euLI.Key0706.title	
ltx/en_us_oca/eu.lichrysbasil:euLI.Key0707.rubric	
ltx/en_us_oca/eu.lichrysbasil:euLI.Key0800.title	
ltx/en_us_oca/eu.lichrysbasil:euLI.Key0801.text	
ltx/en_us_oca/eu.lichrysbasil:euLI.Key0900.title	
ltx/en_us_oca/eu.lichrysbasil:euLI.Key0901.text	
ltx/en_us_oca/eu.lichrysbasil:euLI.Key0902.text	
ltx/en_us_oca/eu.lichrysbasil:euLI.Key0903.text	
ltx/en_us_oca/eu.lichrysbasil:euLI.Key0904.text	
ltx/en_us_oca/eu.lichrysbasil:euLI.Key0905.text	
ltx/en_us_oca/eu.lichrysbasil:euLI.Key0906.text	
ltx/en_us_oca/eu.lichrysbasil:euLI.Key0907.text	
ltx/en_us_oca/eu.lichrysbasil:euLI.Key0908.text	
ltx/en_us_oca/eu.lichrysbasil:euLI.Key0909.basil.text	
ltx/en_us_oca/eu.lichrysbasil:euLI.Key0909.text	
ltx/en_us_oca/eu.lichrysbasil:euLI.Key0910.text	
ltx/en_us_oca/eu.lichrysbasil:euLI.Key0911.text	
ltx/en_us_oca/eu.lichrysbasil:euLI.Key0912.text	
ltx/en_us_oca/eu.lichrysbasil:euLI.Key1000.title	
ltx/en_us_oca/eu.lichrysbasil:euLI.Key1001.text	
ltx/en_us_oca/eu.lichrysbasil:euLI.Key1001.title	
ltx/en_us_oca/eu.lichrysbasil:euLI.Key1002.text	
ltx/en_us_oca/eu.lichrysbasil:euLI.Key1002.title	
ltx/en_us_oca/eu.lichrysbasil:euLI.Key1003.text	
ltx/en_us_oca/eu.lichrysbasil:euLI.Key1100.title	
ltx/en_us_oca/eu.lichrysbasil:euLI.Key1101.text	
ltx/en_us_oca/eu.lichrysbasil:euLI.Key1102.text	
ltx/en_us_oca/eu.lichrysbasil:euLI.Key1102.title	
ltx/en_us_oca/eu.lichrysbasil:euLI.Key1103.text	
ltx/en_us_oca/eu.lichrysbasil:euLI.Key1104.text	
ltx/en_us_oca/eu.lichrysbasil:euLI.Key1105.text	
ltx/en_us_oca/eu.lichrysbasil:euLI.Key1106.text	
ltx/en_us_oca/eu.lichrysbasil:euLI.Key1107.text	
ltx/en_us_oca/eu.lichrysbasil:euLI.Key1108.text	
ltx/en_us_oca/eu.lichrysbasil:euLI.Key1109.text	
ltx/en_us_oca/eu.lichrysbasil:euLI.Key1110.rubric	
ltx/en_us_oca/eu.lichrysbasil:euLI.Key1110.text	
ltx/en_us_oca/eu.lichrysbasil:euLI.Key1111.text	
ltx/en_us_oca/eu.lichrysbasil:euLI.Key1112.rubric	
ltx/en_us_oca/eu.lichrysbasil:euLI.Key1112.text	
ltx/en_us_oca/eu.lichrysbasil:euLI.Key1112a.text	
ltx/en_us_oca/eu.lichrysbasil:euLI.Key1112b.text	
ltx/en_us_oca/eu.lichrysbasil:euLI.Key1113.rubric	
ltx/en_us_oca/eu.lichrysbasil:euLI.Key1113.text	
ltx/en_us_oca/eu.lichrysbasil:euLI.Key1114.text	
ltx/en_us_oca/eu.lichrysbasil:euLI.Key1115.text	
ltx/en_us_oca/eu.lichrysbasil:euLI.Key1116.text	
ltx/en_us_oca/eu.lichrysbasil:euLI.Key1117.text	
ltx/en_us_oca/eu.lichrysbasil:euLI.Key1118.text	
ltx/en_us_oca/eu.lichrysbasil:euLI.Key1119.text	
ltx/en_us_oca/eu.lichrysbasil:euLI.Key1120.text	
ltx/en_us_oca/eu.lichrysbasil:euLI.Key1121.text	
ltx/en_us_oca/eu.lichrysbasil:euLI.Key1122.text	
ltx/en_us_oca/eu.lichrysbasil:euLI.Key1123.text	
ltx/en_us_oca/eu.lichrysbasil:euLI.Key1124.text	
ltx/en_us_oca/eu.lichrysbasil:euLI.Key1140.rubric	
ltx/en_us_oca/eu.lichrysbasil:euLI.Key1141.rubric	
ltx/en_us_oca/eu.lichrysbasil:euLI.Key1200.text	
ltx/en_us_oca/eu.lichrysbasil:euLI.Key1200.title	
ltx/en_us_oca/eu.lichrysbasil:euLI.Key1201.text	
ltx/en_us_oca/eu.lichrysbasil:euLI.Key1202.basil.text	
ltx/en_us_oca/eu.lichrysbasil:euLI.Key1202.text	
ltx/en_us_oca/eu.lichrysbasil:euLI.Key1202.title	
ltx/en_us_oca/eu.lichrysbasil:euLI.Key1203.text	
ltx/en_us_oca/eu.lichrysbasil:euLI.Key1204.text	
ltx/en_us_oca/eu.lichrysbasil:euLI.Key1204.title	
ltx/en_us_oca/eu.lichrysbasil:euLI.Key1205.text	
ltx/en_us_oca/eu.lichrysbasil:euLI.Key1206.rubric	
ltx/en_us_oca/eu.lichrysbasil:euLI.Key1206.text	
ltx/en_us_oca/eu.lichrysbasil:euLI.Key1207.text	
ltx/en_us_oca/eu.lichrysbasil:euLI.Key1208.text	
ltx/en_us_oca/eu.lichrysbasil:euLI.Key1209.title	
ltx/en_us_oca/eu.lichrysbasil:euLI.Key1300.text	
ltx/en_us_oca/eu.lichrysbasil:euLI.Key1300.title	
ltx/en_us_oca/eu.lichrysbasil:euLI.Key1301.text	
ltx/en_us_oca/eu.lichrysbasil:euLI.Key1302.text	
ltx/en_us_oca/eu.lichrysbasil:euLI.Key1303.text	
ltx/en_us_oca/eu.lichrysbasil:euLI.Key1304.text	
ltx/en_us_oca/eu.lichrysbasil:euLI.Key1305.text	
ltx/en_us_oca/eu.lichrysbasil:euLI.Key1306.text	
ltx/en_us_oca/eu.lichrysbasil:euLI.Key1307.text	
ltx/en_us_oca/eu.lichrysbasil:euLI.Key1308.text	
ltx/en_us_oca/eu.lichrysbasil:euLI.Key1309.basil.text	
ltx/en_us_oca/eu.lichrysbasil:euLI.Key1309.text	
ltx/en_us_oca/eu.lichrysbasil:euLI.Key1310.text	
ltx/en_us_oca/eu.lichrysbasil:euLI.Key1311.text	
ltx/en_us_oca/eu.lichrysbasil:euLI.Key1312.basil.text	
ltx/en_us_oca/eu.lichrysbasil:euLI.Key1312.text	
ltx/en_us_oca/eu.lichrysbasil:euLI.Key1313.basil.text	
ltx/en_us_oca/eu.lichrysbasil:euLI.Key1313.text	
ltx/en_us_oca/eu.lichrysbasil:euLI.Key1314.basil.text	
ltx/en_us_oca/eu.lichrysbasil:euLI.Key1314.text	
ltx/en_us_oca/eu.lichrysbasil:euLI.Key1315.basil.text	
ltx/en_us_oca/eu.lichrysbasil:euLI.Key1315.text	
ltx/en_us_oca/eu.lichrysbasil:euLI.Key1316.basil.text	
ltx/en_us_oca/eu.lichrysbasil:euLI.Key1316.text	
ltx/en_us_oca/eu.lichrysbasil:euLI.Key1317.text	
ltx/en_us_oca/eu.lichrysbasil:euLI.Key1318.text	
ltx/en_us_oca/eu.lichrysbasil:euLI.Key1319.basil.text	
ltx/en_us_oca/eu.lichrysbasil:euLI.Key1319.text	
ltx/en_us_oca/eu.lichrysbasil:euLI.Key1320.text	
ltx/en_us_oca/eu.lichrysbasil:euLI.Key1321.basil.text	
ltx/en_us_oca/eu.lichrysbasil:euLI.Key1321.text	
ltx/en_us_oca/eu.lichrysbasil:euLI.Key1322.text	
ltx/en_us_oca/eu.lichrysbasil:euLI.Key1323.basil.text	
ltx/en_us_oca/eu.lichrysbasil:euLI.Key1323.text	
ltx/en_us_oca/eu.lichrysbasil:euLI.Key1324.text	
ltx/en_us_oca/eu.lichrysbasil:euLI.Key1325.basil.text	
ltx/en_us_oca/eu.lichrysbasil:euLI.Key1325.text	
ltx/en_us_oca/eu.lichrysbasil:euLI.Key1326.basil.text	
ltx/en_us_oca/eu.lichrysbasil:euLI.Key1326.text	
ltx/en_us_oca/eu.lichrysbasil:euLI.Key1327.basil.text	
ltx/en_us_oca/eu.lichrysbasil:euLI.Key1327.text	
ltx/en_us_oca/eu.lichrysbasil:euLI.Key1328.basil.incipit	@ltx/en_us_oca/oc.m8.d1:ocMA.Kathisma23.incipit
ltx/en_us_oca/eu.lichrysbasil:euLI.Key1328.basil.text	@ltx/en_us_oca/oc.m8.d1:ocMA.Kathisma23.text
ltx/en_us_oca/eu.lichrysbasil:euLI.Key1328.incipit	…
ltx/en_us_oca/eu.lichrysbasil:euLI.Key1328.text	@ltx/en_us_oca/prayers:pr.ItIsTrulyRight_complete.text
ltx/en_us_oca/eu.lichrysbasil:euLI.Key1328.title	@ltx/en_us_oca/titles:ti.HymnToTheotokos
ltx/en_us_oca/eu.lichrysbasil:euLI.Key1329.basil.text	
ltx/en_us_oca/eu.lichrysbasil:euLI.Key1329.text	
ltx/en_us_oca/eu.lichrysbasil:euLI.Key1330.text	
ltx/en_us_oca/eu.lichrysbasil:euLI.Key1330a.text	
ltx/en_us_oca/eu.lichrysbasil:euLI.Key1330b.text	
ltx/en_us_oca/eu.lichrysbasil:euLI.Key1331.text	
ltx/en_us_oca/eu.lichrysbasil:euLI.Key1332.text	
ltx/en_us_oca/eu.lichrysbasil:euLI.Key1333.basil.text	
ltx/en_us_oca/eu.lichrysbasil:euLI.Key1333.text	
ltx/en_us_oca/eu.lichrysbasil:euLI.Key1334.text	
ltx/en_us_oca/eu.lichrysbasil:euLI.Key1335.text	
ltx/en_us_oca/eu.lichrysbasil:euLI.Key1336.text	
ltx/en_us_oca/eu.lichrysbasil:euLI.Key1400.title	
ltx/en_us_oca/eu.lichrysbasil:euLI.Key1401.text	
ltx/en_us_oca/eu.lichrysbasil:euLI.Key1402.text	
ltx/en_us_oca/eu.lichrysbasil:euLI.Key1403.text	
ltx/en_us_oca/eu.lichrysbasil:euLI.Key1404.rubric	
ltx/en_us_oca/eu.lichrysbasil:euLI.Key1404.text	
ltx/en_us_oca/eu.lichrysbasil:euLI.Key1405.basil.text	
ltx/en_us_oca/eu.lichrysbasil:euLI.Key1405.text	
ltx/en_us_oca/eu.lichrysbasil:euLI.Key1406.text	
ltx/en_us_oca/eu.lichrysbasil:euLI.Key1407.basil.text	
ltx/en_us_oca/eu.lichrysbasil:euLI.Key1407.text	
ltx/en_us_oca/eu.lichrysbasil:euLI.Key1407.title	
ltx/en_us_oca/eu.lichrysbasil:euLI.Key1408.text	@ltx/en_us_oca/prayers:pr.exc07a.text
ltx/en_us_oca/eu.lichrysbasil:euLI.Key1409.text	
ltx/en_us_oca/eu.lichrysbasil:euLI.Key1409.title	
ltx/en_us_oca/eu.lichrysbasil:euLI.Key1410.text	
ltx/en_us_oca/eu.lichrysbasil:euLI.Key1411.text	
ltx/en_us_oca/eu.lichrysbasil:euLI.Key1500.title	
ltx/en_us_oca/eu.lichrysbasil:euLI.Key1501.text	
ltx/en_us_oca/eu.lichrysbasil:euLI.Key1502.text	
ltx/en_us_oca/eu.lichrysbasil:euLI.Key1503.text	
ltx/en_us_oca/eu.lichrysbasil:euLI.Key1504.text	
ltx/en_us_oca/eu.lichrysbasil:euLI.Key1505.text	
ltx/en_us_oca/eu.lichrysbasil:euLI.Key1506.text	
ltx/en_us_oca/eu.lichrysbasil:euLI.Key1507.text	
ltx/en_us_oca/eu.lichrysbasil:euLI.Key1508.text	
ltx/en_us_oca/eu.lichrysbasil:euLI.Key1509.text	
ltx/en_us_oca/eu.lichrysbasil:euLI.Key1510.text	
ltx/en_us_oca/eu.lichrysbasil:euLI.Key1511.text	
ltx/en_us_oca/eu.lichrysbasil:euLI.Key1512.text	
ltx/en_us_oca/eu.lichrysbasil:euLI.Key1513.text	
ltx/en_us_oca/eu.lichrysbasil:euLI.Key1514.text	
ltx/en_us_oca/eu.lichrysbasil:euLI.Key1515.text	
ltx/en_us_oca/eu.lichrysbasil:euLI.Key1516.text	
ltx/en_us_oca/eu.lichrysbasil:euLI.Key1517.text	
ltx/en_us_oca/eu.lichrysbasil:euLI.Key1518.text	
ltx/en_us_oca/eu.lichrysbasil:euLI.Key1519.text	
ltx/en_us_oca/eu.lichrysbasil:euLI.Key1520.text	
ltx/en_us_oca/eu.lichrysbasil:euLI.Key1521.text	@ltx/en_us_oca/ho.ho03:hoMA.SunPostGospel.text
ltx/en_us_oca/eu.lichrysbasil:euLI.Key1522.incipit	@ltx/en_us_oca/he.h.m1:heHE.FotizouFotizou.incipit
ltx/en_us_oca/eu.lichrysbasil:euLI.Key1522.text	@ltx/en_us_oca/he.h.m1:heHE.FotizouFotizou.text
ltx/en_us_oca/eu.lichrysbasil:euLI.Key1523.incipit	@ltx/en_us_oca/pe.d071:peMA.Ode9C11.incipit
ltx/en_us_oca/eu.lichrysbasil:euLI.Key1523.text	@ltx/en_us_oca/pe.d071:peMA.Ode9C11.text
ltx/en_us_oca/eu.lichrysbasil:euLI.Key1524.incipit	@ltx/en_us_oca/pe.d071:peMA.Ode9C12.incipit
ltx/en_us_oca/eu.lichrysbasil:euLI.Key1524.text	@ltx/en_us_oca/pe.d071:peMA.Ode9C12.text
ltx/en_us_oca/eu.lichrysbasil:euLI.Key1525.text	
ltx/en_us_oca/eu.lichrysbasil:euLI.Key1526.text	
ltx/en_us_oca/eu.lichrysbasil:euLI.Key1527.text	
ltx/en_us_oca/eu.lichrysbasil:euLI.Key1527.title	
ltx/en_us_oca/eu.lichrysbasil:euLI.Key1528.text	
ltx/en_us_oca/eu.lichrysbasil:euLI.Key1529.rubric	
ltx/en_us_oca/eu.lichrysbasil:euLI.Key1529.text	
ltx/en_us_oca/eu.lichrysbasil:euLI.Key1530.incipit	…
ltx/en_us_oca/eu.lichrysbasil:euLI.Key1530.text	
ltx/en_us_oca/eu.lichrysbasil:euLI.Key1530.title	
ltx/en_us_oca/eu.lichrysbasil:euLI.Key1531.text	
ltx/en_us_oca/eu.lichrysbasil:euLI.Key1601.text	
ltx/en_us_oca/eu.lichrysbasil:euLI.Key1602.text	
ltx/en_us_oca/eu.lichrysbasil:euLI.Key1603.text	
ltx/en_us_oca/eu.lichrysbasil:euLI.Key1604.text	
ltx/en_us_oca/eu.lichrysbasil:euLI.Key1604.title	
ltx/en_us_oca/eu.lichrysbasil:euLI.Key1605.text	
ltx/en_us_oca/eu.lichrysbasil:euLI.Key1606.basil.text	
ltx/en_us_oca/eu.lichrysbasil:euLI.Key1606.text	
ltx/en_us_oca/eu.lichrysbasil:euLI.Key1606.title	
ltx/en_us_oca/eu.lichrysbasil:euLI.Key1607.text	@ltx/en_us_oca/prayers:pr.exc24.text
ltx/en_us_oca/eu.lichrysbasil:euLI.Key1700.title	
ltx/en_us_oca/eu.lichrysbasil:euLI.Key1701.text	
ltx/en_us_oca/eu.lichrysbasil:euLI.Key1702.basil.text	
ltx/en_us_oca/eu.lichrysbasil:euLI.Key1702.text	
ltx/en_us_oca/eu.lichrysbasil:euLI.Key1702.title	
ltx/en_us_oca/eu.lichrysbasil:euLI.Key1703.text	
ltx/en_us_oca/eu.lichrysbasil:euLI.Key1703_pascha.text	
ltx/en_us_oca/eu.lichrysbasil:euLI.Key1704.basil.text	
ltx/en_us_oca/eu.lichrysbasil:euLI.Key1704.text	
ltx/en_us_oca/eu.lichrysbasil:euLI.Key1704.title	
ltx/en_us_oca/eu.lichrysbasil:euLI.Key1705.text	@ltx/en_us_oca/prayers:pr.pet37.text
ltx/en_us_oca/eu.lichrysbasil:euLI.Key1706.text	
ltx/en_us_oca/eu.lichrysbasil:euLI.Key1706h.text	
ltx/en_us_oca/eu.lichrysbasil:euLI.Key1707.text	
ltx/en_us_oca/eu.lichrysbasil:euLI.Key1708.text	
ltx/en_us_oca/eu.lichrysbasil:euLI.Key1709.text	
ltx/en_us_oca/eu.lichrysbasil:euLI.MM.HymnsDuringCommunion.text	
ltx/en_us_oca/eu.lichrysbasil:euLI.MM.HymnsDuringCommunion.title	
ltx/en_us_oca/eu.lichrysbasil:euLI.MM.Key0200.text	
ltx/en_us_oca/eu.lichrysbasil:euLI.MM.Key0600.text	
ltx/en_us_oca/eu.lichrysbasil:euLI.basil.copyright	
ltx/en_us_oca/eu.lichrysbasil:euLI.basil.title	
ltx/en_us_oca/eu.lichrysbasil:euLI.copyright	
ltx/en_us_oca/eu.lichrysbasil:euLI.notice	
ltx/en_us_oca/eu.lichrysbasil:euLI.title	
