ltx/en_us_oca/me.m08.d25:meDA.commemoration.first	
ltx/en_us_oca/me.m08.d25:meDA.commemoration.first_name	
ltx/en_us_oca/me.m08.d25:meDA.commemoration.first_short	
ltx/en_us_oca/me.m08.d25:meDA.commemoration.first_title	
ltx/en_us_oca/me.m08.d25:meDA.commemoration.full	
ltx/en_us_oca/me.m08.d25:meDA.commemoration.second_name	
ltx/en_us_oca/me.m08.d25:meDA.commemoration.second_title	
ltx/en_us_oca/me.m08.d25:meDA.date	
ltx/en_us_oca/me.m08.d25:meDA.fordate	
ltx/en_us_oca/me.m08.d25:meDA.insert1	
ltx/en_us_oca/me.m08.d25:meDA.insert2	
ltx/en_us_oca/me.m08.d25:meDA.note	
ltx/en_us_oca/me.m08.d25:meDA.pdfcoverdate	
ltx/en_us_oca/me.m08.d25:meDA.pdfheaderdate	
ltx/en_us_oca/me.m08.d25:meHO.commemorations	
ltx/en_us_oca/me.m08.d25:meHO.note1	
ltx/en_us_oca/me.m08.d25:meHO.note2	
ltx/en_us_oca/me.m08.d25:meHO.number	
ltx/en_us_oca/me.m08.d25:meHO.rank	
ltx/en_us_oca/me.m08.d25:meLE.commemoration1	
ltx/en_us_oca/me.m08.d25:meLE.commemoration2	
ltx/en_us_oca/me.m08.d25:meLI.Kontakion1.greekmelody	@ltx/en_us_oca/me.m08.d25:meMA.Kontakion1.greekmelody
ltx/en_us_oca/me.m08.d25:meLI.Kontakion1.incipit	@ltx/en_us_oca/me.m08.d25:meMA.Kontakion1.incipit
ltx/en_us_oca/me.m08.d25:meLI.Kontakion1.melody	@ltx/en_us_oca/me.m08.d25:meMA.Kontakion1.melody
ltx/en_us_oca/me.m08.d25:meLI.Kontakion1.mode	@ltx/en_us_oca/me.m08.d25:meMA.Kontakion1.mode
ltx/en_us_oca/me.m08.d25:meLI.Kontakion1.text	@ltx/en_us_oca/me.m08.d25:meMA.Kontakion1.text
ltx/en_us_oca/me.m08.d25:meLI.MM.CommunionHymn.text	@ltx/en_us_oca/properties:media.key
ltx/en_us_oca/me.m08.d25:meLI.Megalynarion.text	
ltx/en_us_oca/me.m08.d25:meMA.C1.acrostic.notice1	
ltx/en_us_oca/me.m08.d25:meMA.C1.acrostic.text	
ltx/en_us_oca/me.m08.d25:meMA.C1.acrostic.title	
ltx/en_us_oca/me.m08.d25:meMA.C1.poet	@ltx/en_us_oca/poets:po.Theofanous
ltx/en_us_oca/me.m08.d25:meMA.C1.title	
ltx/en_us_oca/me.m08.d25:meMA.C1.verse	@ltx/en_us_oca/prayers:pr.verse_Apostles.text
ltx/en_us_oca/me.m08.d25:meMA.C2.acrostic.notice1	
ltx/en_us_oca/me.m08.d25:meMA.C2.acrostic.text	
ltx/en_us_oca/me.m08.d25:meMA.C2.acrostic.title	
ltx/en_us_oca/me.m08.d25:meMA.C2.poet	@ltx/en_us_oca/poets:po.Theofanous
ltx/en_us_oca/me.m08.d25:meMA.C2.title	
ltx/en_us_oca/me.m08.d25:meMA.C2.verse	@ltx/en_us_oca/prayers:pr.verse_Apostles.text
ltx/en_us_oca/me.m08.d25:meMA.ExapTheotokion.incipit	…
ltx/en_us_oca/me.m08.d25:meMA.ExapTheotokion.melody	@ltx/en_us_oca/he.a.m2:heAU.ToisMathitaisSynelthomen.notmetered
ltx/en_us_oca/me.m08.d25:meMA.ExapTheotokion.mode	@ltx/en_us_oca/miscellanea:misc.Mode2
ltx/en_us_oca/me.m08.d25:meMA.ExapTheotokion.text	
ltx/en_us_oca/me.m08.d25:meMA.Exaposteilarion1.greekmelody	@ltx/en_us_oca/he.a.m2:heAU.ToisMathitaisSynelthomen.greekname
ltx/en_us_oca/me.m08.d25:meMA.Exaposteilarion1.incipit	…
ltx/en_us_oca/me.m08.d25:meMA.Exaposteilarion1.melody	@ltx/en_us_oca/he.a.m2:heAU.ToisMathitaisSynelthomen.notmetered
ltx/en_us_oca/me.m08.d25:meMA.Exaposteilarion1.mode	@ltx/en_us_oca/miscellanea:misc.Mode2
ltx/en_us_oca/me.m08.d25:meMA.Exaposteilarion1.text	
ltx/en_us_oca/me.m08.d25:meMA.Exaposteilarion2.greekmelody	@ltx/en_us_oca/he.a.m2:heAU.ToisMathitaisSynelthomen.greekname
ltx/en_us_oca/me.m08.d25:meMA.Exaposteilarion2.incipit	…
ltx/en_us_oca/me.m08.d25:meMA.Exaposteilarion2.melody	@ltx/en_us_oca/he.a.m2:heAU.ToisMathitaisSynelthomen.notmetered
ltx/en_us_oca/me.m08.d25:meMA.Exaposteilarion2.mode	@ltx/en_us_oca/miscellanea:misc.Mode2
ltx/en_us_oca/me.m08.d25:meMA.Exaposteilarion2.text	
ltx/en_us_oca/me.m08.d25:meMA.Kontakion1.greekmelody	@ltx/en_us_oca/he.a.m4:heAU.EpefanisSimeron.greekname
ltx/en_us_oca/me.m08.d25:meMA.Kontakion1.incipit	You have been revealed as…
ltx/en_us_oca/me.m08.d25:meMA.Kontakion1.melody	@ltx/en_us_oca/he.a.m4:heAU.EpefanisSimeron.notmetered
ltx/en_us_oca/me.m08.d25:meMA.Kontakion1.mode	@ltx/en_us_oca/miscellanea:misc.Mode4
ltx/en_us_oca/me.m08.d25:meMA.Kontakion1.text	You have been revealed as a great sun for all the world, ⁄ shining with the radiance of teachings and awesome miracles. ⁄⁄ You enlighten those who honor you, Bartholomew, apostle of the Lord!
ltx/en_us_oca/me.m08.d25:meMA.Kontakion2.greekmelody	@ltx/en_us_oca/he.a.m2:heAU.TaAnoZiton.greekname
ltx/en_us_oca/me.m08.d25:meMA.Kontakion2.incipit	Titus, worthy of all praise…
ltx/en_us_oca/me.m08.d25:meMA.Kontakion2.melody	@ltx/en_us_oca/he.a.m2:heAU.TaAnoZiton.notmetered
ltx/en_us_oca/me.m08.d25:meMA.Kontakion2.mode	@ltx/en_us_oca/miscellanea:misc.Mode2
ltx/en_us_oca/me.m08.d25:meMA.Kontakion2.text	Titus, worthy of all praise and preacher of Christ’s mysteries, ⁄ you were Paul’s companion and with him taught us the doctrine of God. ⁄ Therefore we cry out to you: ⁄⁄ Never cease to intercede for the sake of us all!
ltx/en_us_oca/me.m08.d25:meMA.Lauds1.greekmelody	@ltx/en_us_oca/he.a.m4:heAU.EdokasSimeiosin.greekname
ltx/en_us_oca/me.m08.d25:meMA.Lauds1.incipit	…
ltx/en_us_oca/me.m08.d25:meMA.Lauds1.melody	@ltx/en_us_oca/he.a.m4:heAU.EdokasSimeiosin.notmetered
ltx/en_us_oca/me.m08.d25:meMA.Lauds1.mode	@ltx/en_us_oca/miscellanea:misc.Mode4
ltx/en_us_oca/me.m08.d25:meMA.Lauds1.text	
ltx/en_us_oca/me.m08.d25:meMA.Lauds2.incipit	…
ltx/en_us_oca/me.m08.d25:meMA.Lauds2.melody	@ltx/en_us_oca/he.a.m4:heAU.EdokasSimeiosin.notmetered
ltx/en_us_oca/me.m08.d25:meMA.Lauds2.mode	@ltx/en_us_oca/miscellanea:misc.Mode4
ltx/en_us_oca/me.m08.d25:meMA.Lauds2.text	
ltx/en_us_oca/me.m08.d25:meMA.Lauds3.incipit	…
ltx/en_us_oca/me.m08.d25:meMA.Lauds3.melody	@ltx/en_us_oca/he.a.m4:heAU.EdokasSimeiosin.notmetered
ltx/en_us_oca/me.m08.d25:meMA.Lauds3.mode	@ltx/en_us_oca/miscellanea:misc.Mode4
ltx/en_us_oca/me.m08.d25:meMA.Lauds3.text	
ltx/en_us_oca/me.m08.d25:meMA.Lauds4.greekmelody	@ltx/en_us_oca/he.a.m4:heAU.EdokasSimeiosin.greekname
ltx/en_us_oca/me.m08.d25:meMA.Lauds4.incipit	…
ltx/en_us_oca/me.m08.d25:meMA.Lauds4.melody	@ltx/en_us_oca/he.a.m4:heAU.EdokasSimeiosin.notmetered
ltx/en_us_oca/me.m08.d25:meMA.Lauds4.mode	@ltx/en_us_oca/miscellanea:misc.Mode4
ltx/en_us_oca/me.m08.d25:meMA.Lauds4.text	
ltx/en_us_oca/me.m08.d25:meMA.LaudsGlory.incipit	…
ltx/en_us_oca/me.m08.d25:meMA.LaudsGlory.melody	
ltx/en_us_oca/me.m08.d25:meMA.LaudsGlory.mode	@ltx/en_us_oca/miscellanea:misc.Mode5
ltx/en_us_oca/me.m08.d25:meMA.LaudsGlory.text	
ltx/en_us_oca/me.m08.d25:meMA.LaudsTheotokion.incipit	@ltx/en_us_oca/oc.m5.d3:ocVE.AposTheotokion.incipit
ltx/en_us_oca/me.m08.d25:meMA.LaudsTheotokion.melody	
ltx/en_us_oca/me.m08.d25:meMA.LaudsTheotokion.mode	@ltx/en_us_oca/miscellanea:misc.Mode5
ltx/en_us_oca/me.m08.d25:meMA.LaudsTheotokion.text	@ltx/en_us_oca/oc.m5.d3:ocVE.AposTheotokion.text
ltx/en_us_oca/me.m08.d25:meMA.MM.Lauds1234as5678.text	@ltx/en_us_oca/properties:media.key
ltx/en_us_oca/me.m08.d25:meMA.Ode1C11.greekmelody	@ltx/en_us_oca/he.h.m4:heHE.AnoixoToStomaMou.greekname
ltx/en_us_oca/me.m08.d25:meMA.Ode1C11.incipit	…
ltx/en_us_oca/me.m08.d25:meMA.Ode1C11.melody	@ltx/en_us_oca/he.h.m4:heHE.AnoixoToStomaMou.notmetered
ltx/en_us_oca/me.m08.d25:meMA.Ode1C11.mode	@ltx/en_us_oca/miscellanea:misc.Mode4
ltx/en_us_oca/me.m08.d25:meMA.Ode1C11.ode	@ltx/en_us_oca/miscellanea:misc.Ode1
ltx/en_us_oca/me.m08.d25:meMA.Ode1C11.text	
ltx/en_us_oca/me.m08.d25:meMA.Ode1C12.incipit	…
ltx/en_us_oca/me.m08.d25:meMA.Ode1C12.melody	@ltx/en_us_oca/he.h.m4:heHE.AnoixoToStomaMou.notmetered
ltx/en_us_oca/me.m08.d25:meMA.Ode1C12.mode	@ltx/en_us_oca/miscellanea:misc.Mode4
ltx/en_us_oca/me.m08.d25:meMA.Ode1C12.ode	@ltx/en_us_oca/miscellanea:misc.Ode1
ltx/en_us_oca/me.m08.d25:meMA.Ode1C12.text	
ltx/en_us_oca/me.m08.d25:meMA.Ode1C13.incipit	…
ltx/en_us_oca/me.m08.d25:meMA.Ode1C13.melody	@ltx/en_us_oca/he.h.m4:heHE.AnoixoToStomaMou.notmetered
ltx/en_us_oca/me.m08.d25:meMA.Ode1C13.mode	@ltx/en_us_oca/miscellanea:misc.Mode4
ltx/en_us_oca/me.m08.d25:meMA.Ode1C13.ode	@ltx/en_us_oca/miscellanea:misc.Ode1
ltx/en_us_oca/me.m08.d25:meMA.Ode1C13.text	
ltx/en_us_oca/me.m08.d25:meMA.Ode1C1T.incipit	…
ltx/en_us_oca/me.m08.d25:meMA.Ode1C1T.melody	@ltx/en_us_oca/he.h.m4:heHE.AnoixoToStomaMou.notmetered
ltx/en_us_oca/me.m08.d25:meMA.Ode1C1T.mode	@ltx/en_us_oca/miscellanea:misc.Mode4
ltx/en_us_oca/me.m08.d25:meMA.Ode1C1T.ode	@ltx/en_us_oca/miscellanea:misc.Ode1
ltx/en_us_oca/me.m08.d25:meMA.Ode1C1T.text	
ltx/en_us_oca/me.m08.d25:meMA.Ode1C21.greekmelody	@ltx/en_us_oca/he.h.m4:heHE.AnoixoToStomaMou.greekname
ltx/en_us_oca/me.m08.d25:meMA.Ode1C21.incipit	…
ltx/en_us_oca/me.m08.d25:meMA.Ode1C21.melody	@ltx/en_us_oca/he.h.m4:heHE.AnoixoToStomaMou.notmetered
ltx/en_us_oca/me.m08.d25:meMA.Ode1C21.mode	@ltx/en_us_oca/miscellanea:misc.Mode4
ltx/en_us_oca/me.m08.d25:meMA.Ode1C21.ode	@ltx/en_us_oca/miscellanea:misc.Ode1
ltx/en_us_oca/me.m08.d25:meMA.Ode1C21.text	
ltx/en_us_oca/me.m08.d25:meMA.Ode1C22.incipit	…
ltx/en_us_oca/me.m08.d25:meMA.Ode1C22.melody	@ltx/en_us_oca/he.h.m4:heHE.AnoixoToStomaMou.notmetered
ltx/en_us_oca/me.m08.d25:meMA.Ode1C22.mode	@ltx/en_us_oca/miscellanea:misc.Mode4
ltx/en_us_oca/me.m08.d25:meMA.Ode1C22.ode	@ltx/en_us_oca/miscellanea:misc.Ode1
ltx/en_us_oca/me.m08.d25:meMA.Ode1C22.text	
ltx/en_us_oca/me.m08.d25:meMA.Ode1C23.incipit	…
ltx/en_us_oca/me.m08.d25:meMA.Ode1C23.melody	@ltx/en_us_oca/he.h.m4:heHE.AnoixoToStomaMou.notmetered
ltx/en_us_oca/me.m08.d25:meMA.Ode1C23.mode	@ltx/en_us_oca/miscellanea:misc.Mode4
ltx/en_us_oca/me.m08.d25:meMA.Ode1C23.ode	@ltx/en_us_oca/miscellanea:misc.Ode1
ltx/en_us_oca/me.m08.d25:meMA.Ode1C23.text	
ltx/en_us_oca/me.m08.d25:meMA.Ode1C2T.incipit	…
ltx/en_us_oca/me.m08.d25:meMA.Ode1C2T.melody	@ltx/en_us_oca/he.h.m4:heHE.AnoixoToStomaMou.notmetered
ltx/en_us_oca/me.m08.d25:meMA.Ode1C2T.mode	@ltx/en_us_oca/miscellanea:misc.Mode4
ltx/en_us_oca/me.m08.d25:meMA.Ode1C2T.ode	@ltx/en_us_oca/miscellanea:misc.Ode1
ltx/en_us_oca/me.m08.d25:meMA.Ode1C2T.text	
ltx/en_us_oca/me.m08.d25:meMA.Ode3C11.greekmelody	@ltx/en_us_oca/he.h.m4:heHE.TousSousYmnologous.greekname
ltx/en_us_oca/me.m08.d25:meMA.Ode3C11.incipit	…
ltx/en_us_oca/me.m08.d25:meMA.Ode3C11.melody	@ltx/en_us_oca/he.h.m4:heHE.TousSousYmnologous.notmetered
ltx/en_us_oca/me.m08.d25:meMA.Ode3C11.mode	@ltx/en_us_oca/miscellanea:misc.Mode4
ltx/en_us_oca/me.m08.d25:meMA.Ode3C11.ode	@ltx/en_us_oca/miscellanea:misc.Ode3
ltx/en_us_oca/me.m08.d25:meMA.Ode3C11.text	
ltx/en_us_oca/me.m08.d25:meMA.Ode3C12.incipit	…
ltx/en_us_oca/me.m08.d25:meMA.Ode3C12.melody	@ltx/en_us_oca/he.h.m4:heHE.TousSousYmnologous.notmetered
ltx/en_us_oca/me.m08.d25:meMA.Ode3C12.mode	@ltx/en_us_oca/miscellanea:misc.Mode4
ltx/en_us_oca/me.m08.d25:meMA.Ode3C12.ode	@ltx/en_us_oca/miscellanea:misc.Ode3
ltx/en_us_oca/me.m08.d25:meMA.Ode3C12.text	
ltx/en_us_oca/me.m08.d25:meMA.Ode3C13.incipit	…
ltx/en_us_oca/me.m08.d25:meMA.Ode3C13.melody	@ltx/en_us_oca/he.h.m4:heHE.TousSousYmnologous.notmetered
ltx/en_us_oca/me.m08.d25:meMA.Ode3C13.mode	@ltx/en_us_oca/miscellanea:misc.Mode4
ltx/en_us_oca/me.m08.d25:meMA.Ode3C13.ode	@ltx/en_us_oca/miscellanea:misc.Ode3
ltx/en_us_oca/me.m08.d25:meMA.Ode3C13.text	
ltx/en_us_oca/me.m08.d25:meMA.Ode3C1T.incipit	…
ltx/en_us_oca/me.m08.d25:meMA.Ode3C1T.melody	@ltx/en_us_oca/he.h.m4:heHE.TousSousYmnologous.notmetered
ltx/en_us_oca/me.m08.d25:meMA.Ode3C1T.mode	@ltx/en_us_oca/miscellanea:misc.Mode4
ltx/en_us_oca/me.m08.d25:meMA.Ode3C1T.ode	@ltx/en_us_oca/miscellanea:misc.Ode3
ltx/en_us_oca/me.m08.d25:meMA.Ode3C1T.text	
ltx/en_us_oca/me.m08.d25:meMA.Ode3C21.greekmelody	@ltx/en_us_oca/he.h.m4:heHE.OukEnSofia.greekname
ltx/en_us_oca/me.m08.d25:meMA.Ode3C21.incipit	…
ltx/en_us_oca/me.m08.d25:meMA.Ode3C21.melody	@ltx/en_us_oca/he.h.m4:heHE.OukEnSofia.notmetered
ltx/en_us_oca/me.m08.d25:meMA.Ode3C21.mode	@ltx/en_us_oca/miscellanea:misc.Mode4
ltx/en_us_oca/me.m08.d25:meMA.Ode3C21.ode	@ltx/en_us_oca/miscellanea:misc.Ode3
ltx/en_us_oca/me.m08.d25:meMA.Ode3C21.text	
ltx/en_us_oca/me.m08.d25:meMA.Ode3C22.incipit	…
ltx/en_us_oca/me.m08.d25:meMA.Ode3C22.melody	@ltx/en_us_oca/he.h.m4:heHE.OukEnSofia.notmetered
ltx/en_us_oca/me.m08.d25:meMA.Ode3C22.mode	@ltx/en_us_oca/miscellanea:misc.Mode4
ltx/en_us_oca/me.m08.d25:meMA.Ode3C22.ode	@ltx/en_us_oca/miscellanea:misc.Ode3
ltx/en_us_oca/me.m08.d25:meMA.Ode3C22.text	
ltx/en_us_oca/me.m08.d25:meMA.Ode3C23.incipit	…
ltx/en_us_oca/me.m08.d25:meMA.Ode3C23.melody	@ltx/en_us_oca/he.h.m4:heHE.OukEnSofia.notmetered
ltx/en_us_oca/me.m08.d25:meMA.Ode3C23.mode	@ltx/en_us_oca/miscellanea:misc.Mode4
ltx/en_us_oca/me.m08.d25:meMA.Ode3C23.ode	@ltx/en_us_oca/miscellanea:misc.Ode3
ltx/en_us_oca/me.m08.d25:meMA.Ode3C23.text	
ltx/en_us_oca/me.m08.d25:meMA.Ode3C2T.incipit	…
ltx/en_us_oca/me.m08.d25:meMA.Ode3C2T.melody	@ltx/en_us_oca/he.h.m4:heHE.OukEnSofia.notmetered
ltx/en_us_oca/me.m08.d25:meMA.Ode3C2T.mode	@ltx/en_us_oca/miscellanea:misc.Mode4
ltx/en_us_oca/me.m08.d25:meMA.Ode3C2T.ode	@ltx/en_us_oca/miscellanea:misc.Ode3
ltx/en_us_oca/me.m08.d25:meMA.Ode3C2T.text	
ltx/en_us_oca/me.m08.d25:meMA.Ode3H.greekmelody	@ltx/en_us_oca/he.h.m4:heHE.OukEnSofia.greekname
ltx/en_us_oca/me.m08.d25:meMA.Ode3H.incipit	@ltx/en_us_oca/he.h.m4:heHE.OukEnSofia.incipit
ltx/en_us_oca/me.m08.d25:meMA.Ode3H.melody	@ltx/en_us_oca/he.h.m4:heHE.OukEnSofia.melody
ltx/en_us_oca/me.m08.d25:meMA.Ode3H.mode	@ltx/en_us_oca/miscellanea:misc.Mode4
ltx/en_us_oca/me.m08.d25:meMA.Ode3H.ode	@ltx/en_us_oca/miscellanea:misc.Ode3
ltx/en_us_oca/me.m08.d25:meMA.Ode3H.text	@ltx/en_us_oca/he.h.m4:heHE.OukEnSofia.text
ltx/en_us_oca/me.m08.d25:meMA.Ode3Kathisma1.greekmelody	@ltx/en_us_oca/he.a.m1:heAU.TonTafonSouSotir.greekname
ltx/en_us_oca/me.m08.d25:meMA.Ode3Kathisma1.incipit	…
ltx/en_us_oca/me.m08.d25:meMA.Ode3Kathisma1.melody	@ltx/en_us_oca/he.a.m1:heAU.TonTafonSouSotir.notmetered
ltx/en_us_oca/me.m08.d25:meMA.Ode3Kathisma1.mode	@ltx/en_us_oca/miscellanea:misc.Mode1
ltx/en_us_oca/me.m08.d25:meMA.Ode3Kathisma1.text	
ltx/en_us_oca/me.m08.d25:meMA.Ode3Kathisma2.greekmelody	@ltx/en_us_oca/he.a.m8:heAU.TinSofianKaiLogon.greekname
ltx/en_us_oca/me.m08.d25:meMA.Ode3Kathisma2.incipit	…
ltx/en_us_oca/me.m08.d25:meMA.Ode3Kathisma2.melody	@ltx/en_us_oca/he.a.m8:heAU.TinSofianKaiLogon.notmetered
ltx/en_us_oca/me.m08.d25:meMA.Ode3Kathisma2.mode	@ltx/en_us_oca/miscellanea:misc.Mode8
ltx/en_us_oca/me.m08.d25:meMA.Ode3Kathisma2.text	
ltx/en_us_oca/me.m08.d25:meMA.Ode3KathismaT.incipit	Rejoice, fiery throne of God…
ltx/en_us_oca/me.m08.d25:meMA.Ode3KathismaT.melody	@ltx/en_us_oca/he.a.m8:heAU.TinSofianKaiLogon.notmetered
ltx/en_us_oca/me.m08.d25:meMA.Ode3KathismaT.mode	@ltx/en_us_oca/miscellanea:misc.Mode8
ltx/en_us_oca/me.m08.d25:meMA.Ode3KathismaT.text	Rejoice, fiery throne of God! Rejoice, O Maiden! ⁄ The royal seat and richly provided couch, ⁄ the chamber hung with gold-embroidered purple, ⁄ the cloak of scarlet, adorned temple and light-bearing chariot! ⁄ Rejoice, most radiant candlestick, the twelve-walled city, ⁄ the gate cast of God, the radiant bridal chamber, ⁄ magnificent banquet hall and divinely adorned tabernacle! ⁄ Rejoice, glorious bride, radiant as the sun! ⁄⁄ Rejoice, the only splendor of my soul!
ltx/en_us_oca/me.m08.d25:meMA.Ode4C11.greekmelody	@ltx/en_us_oca/he.h.m4:heHE.TinAnexichniaston.greekname
ltx/en_us_oca/me.m08.d25:meMA.Ode4C11.incipit	…
ltx/en_us_oca/me.m08.d25:meMA.Ode4C11.melody	@ltx/en_us_oca/he.h.m4:heHE.TinAnexichniaston.notmetered
ltx/en_us_oca/me.m08.d25:meMA.Ode4C11.mode	@ltx/en_us_oca/miscellanea:misc.Mode4
ltx/en_us_oca/me.m08.d25:meMA.Ode4C11.ode	@ltx/en_us_oca/miscellanea:misc.Ode4
ltx/en_us_oca/me.m08.d25:meMA.Ode4C11.text	
ltx/en_us_oca/me.m08.d25:meMA.Ode4C12.incipit	…
ltx/en_us_oca/me.m08.d25:meMA.Ode4C12.melody	@ltx/en_us_oca/he.h.m4:heHE.TinAnexichniaston.notmetered
ltx/en_us_oca/me.m08.d25:meMA.Ode4C12.mode	@ltx/en_us_oca/miscellanea:misc.Mode4
ltx/en_us_oca/me.m08.d25:meMA.Ode4C12.ode	@ltx/en_us_oca/miscellanea:misc.Ode4
ltx/en_us_oca/me.m08.d25:meMA.Ode4C12.text	
ltx/en_us_oca/me.m08.d25:meMA.Ode4C13.incipit	…
ltx/en_us_oca/me.m08.d25:meMA.Ode4C13.melody	@ltx/en_us_oca/he.h.m4:heHE.TinAnexichniaston.notmetered
ltx/en_us_oca/me.m08.d25:meMA.Ode4C13.mode	@ltx/en_us_oca/miscellanea:misc.Mode4
ltx/en_us_oca/me.m08.d25:meMA.Ode4C13.ode	@ltx/en_us_oca/miscellanea:misc.Ode4
ltx/en_us_oca/me.m08.d25:meMA.Ode4C13.text	
ltx/en_us_oca/me.m08.d25:meMA.Ode4C1T.incipit	…
ltx/en_us_oca/me.m08.d25:meMA.Ode4C1T.melody	@ltx/en_us_oca/he.h.m4:heHE.TinAnexichniaston.notmetered
ltx/en_us_oca/me.m08.d25:meMA.Ode4C1T.mode	@ltx/en_us_oca/miscellanea:misc.Mode4
ltx/en_us_oca/me.m08.d25:meMA.Ode4C1T.ode	@ltx/en_us_oca/miscellanea:misc.Ode4
ltx/en_us_oca/me.m08.d25:meMA.Ode4C1T.text	
ltx/en_us_oca/me.m08.d25:meMA.Ode4C21.greekmelody	@ltx/en_us_oca/he.h.m4:heHE.OKathimenosEnDoxi.greekname
ltx/en_us_oca/me.m08.d25:meMA.Ode4C21.incipit	…
ltx/en_us_oca/me.m08.d25:meMA.Ode4C21.melody	@ltx/en_us_oca/he.h.m4:heHE.OKathimenosEnDoxi.notmetered
ltx/en_us_oca/me.m08.d25:meMA.Ode4C21.mode	@ltx/en_us_oca/miscellanea:misc.Mode4
ltx/en_us_oca/me.m08.d25:meMA.Ode4C21.ode	@ltx/en_us_oca/miscellanea:misc.Ode4
ltx/en_us_oca/me.m08.d25:meMA.Ode4C21.text	
ltx/en_us_oca/me.m08.d25:meMA.Ode4C22.incipit	…
ltx/en_us_oca/me.m08.d25:meMA.Ode4C22.melody	@ltx/en_us_oca/he.h.m4:heHE.OKathimenosEnDoxi.notmetered
ltx/en_us_oca/me.m08.d25:meMA.Ode4C22.mode	@ltx/en_us_oca/miscellanea:misc.Mode4
ltx/en_us_oca/me.m08.d25:meMA.Ode4C22.ode	@ltx/en_us_oca/miscellanea:misc.Ode4
ltx/en_us_oca/me.m08.d25:meMA.Ode4C22.text	
ltx/en_us_oca/me.m08.d25:meMA.Ode4C23.incipit	…
ltx/en_us_oca/me.m08.d25:meMA.Ode4C23.melody	@ltx/en_us_oca/he.h.m4:heHE.OKathimenosEnDoxi.notmetered
ltx/en_us_oca/me.m08.d25:meMA.Ode4C23.mode	@ltx/en_us_oca/miscellanea:misc.Mode4
ltx/en_us_oca/me.m08.d25:meMA.Ode4C23.ode	@ltx/en_us_oca/miscellanea:misc.Ode4
ltx/en_us_oca/me.m08.d25:meMA.Ode4C23.text	
ltx/en_us_oca/me.m08.d25:meMA.Ode4C2T.incipit	…
ltx/en_us_oca/me.m08.d25:meMA.Ode4C2T.melody	@ltx/en_us_oca/he.h.m4:heHE.OKathimenosEnDoxi.notmetered
ltx/en_us_oca/me.m08.d25:meMA.Ode4C2T.mode	@ltx/en_us_oca/miscellanea:misc.Mode4
ltx/en_us_oca/me.m08.d25:meMA.Ode4C2T.ode	@ltx/en_us_oca/miscellanea:misc.Ode4
ltx/en_us_oca/me.m08.d25:meMA.Ode4C2T.text	
ltx/en_us_oca/me.m08.d25:meMA.Ode5C11.greekmelody	@ltx/en_us_oca/he.h.m4:heHE.ExestiTaSympanta.greekname
ltx/en_us_oca/me.m08.d25:meMA.Ode5C11.incipit	…
ltx/en_us_oca/me.m08.d25:meMA.Ode5C11.melody	@ltx/en_us_oca/he.h.m4:heHE.ExestiTaSympanta.notmetered
ltx/en_us_oca/me.m08.d25:meMA.Ode5C11.mode	@ltx/en_us_oca/miscellanea:misc.Mode4
ltx/en_us_oca/me.m08.d25:meMA.Ode5C11.ode	@ltx/en_us_oca/miscellanea:misc.Ode5
ltx/en_us_oca/me.m08.d25:meMA.Ode5C11.text	
ltx/en_us_oca/me.m08.d25:meMA.Ode5C12.incipit	…
ltx/en_us_oca/me.m08.d25:meMA.Ode5C12.melody	@ltx/en_us_oca/he.h.m4:heHE.ExestiTaSympanta.notmetered
ltx/en_us_oca/me.m08.d25:meMA.Ode5C12.mode	@ltx/en_us_oca/miscellanea:misc.Mode4
ltx/en_us_oca/me.m08.d25:meMA.Ode5C12.ode	@ltx/en_us_oca/miscellanea:misc.Ode5
ltx/en_us_oca/me.m08.d25:meMA.Ode5C12.text	
ltx/en_us_oca/me.m08.d25:meMA.Ode5C13.incipit	…
ltx/en_us_oca/me.m08.d25:meMA.Ode5C13.melody	@ltx/en_us_oca/he.h.m4:heHE.ExestiTaSympanta.notmetered
ltx/en_us_oca/me.m08.d25:meMA.Ode5C13.mode	@ltx/en_us_oca/miscellanea:misc.Mode4
ltx/en_us_oca/me.m08.d25:meMA.Ode5C13.ode	@ltx/en_us_oca/miscellanea:misc.Ode5
ltx/en_us_oca/me.m08.d25:meMA.Ode5C13.text	
ltx/en_us_oca/me.m08.d25:meMA.Ode5C1T.incipit	…
ltx/en_us_oca/me.m08.d25:meMA.Ode5C1T.melody	@ltx/en_us_oca/he.h.m4:heHE.ExestiTaSympanta.notmetered
ltx/en_us_oca/me.m08.d25:meMA.Ode5C1T.mode	@ltx/en_us_oca/miscellanea:misc.Mode4
ltx/en_us_oca/me.m08.d25:meMA.Ode5C1T.ode	@ltx/en_us_oca/miscellanea:misc.Ode5
ltx/en_us_oca/me.m08.d25:meMA.Ode5C1T.text	
ltx/en_us_oca/me.m08.d25:meMA.Ode5C21.greekmelody	@ltx/en_us_oca/he.h.m4:heHE.AseveisOukOpsontai.greekname
ltx/en_us_oca/me.m08.d25:meMA.Ode5C21.incipit	…
ltx/en_us_oca/me.m08.d25:meMA.Ode5C21.melody	@ltx/en_us_oca/he.h.m4:heHE.AseveisOukOpsontai.notmetered
ltx/en_us_oca/me.m08.d25:meMA.Ode5C21.mode	@ltx/en_us_oca/miscellanea:misc.Mode4
ltx/en_us_oca/me.m08.d25:meMA.Ode5C21.ode	@ltx/en_us_oca/miscellanea:misc.Ode5
ltx/en_us_oca/me.m08.d25:meMA.Ode5C21.text	
ltx/en_us_oca/me.m08.d25:meMA.Ode5C22.incipit	…
ltx/en_us_oca/me.m08.d25:meMA.Ode5C22.melody	@ltx/en_us_oca/he.h.m4:heHE.AseveisOukOpsontai.notmetered
ltx/en_us_oca/me.m08.d25:meMA.Ode5C22.mode	@ltx/en_us_oca/miscellanea:misc.Mode4
ltx/en_us_oca/me.m08.d25:meMA.Ode5C22.ode	@ltx/en_us_oca/miscellanea:misc.Ode5
ltx/en_us_oca/me.m08.d25:meMA.Ode5C22.text	
ltx/en_us_oca/me.m08.d25:meMA.Ode5C23.incipit	…
ltx/en_us_oca/me.m08.d25:meMA.Ode5C23.melody	@ltx/en_us_oca/he.h.m4:heHE.AseveisOukOpsontai.notmetered
ltx/en_us_oca/me.m08.d25:meMA.Ode5C23.mode	@ltx/en_us_oca/miscellanea:misc.Mode4
ltx/en_us_oca/me.m08.d25:meMA.Ode5C23.ode	@ltx/en_us_oca/miscellanea:misc.Ode5
ltx/en_us_oca/me.m08.d25:meMA.Ode5C23.text	
ltx/en_us_oca/me.m08.d25:meMA.Ode5C2T.incipit	…
ltx/en_us_oca/me.m08.d25:meMA.Ode5C2T.melody	@ltx/en_us_oca/he.h.m4:heHE.AseveisOukOpsontai.notmetered
ltx/en_us_oca/me.m08.d25:meMA.Ode5C2T.mode	@ltx/en_us_oca/miscellanea:misc.Mode4
ltx/en_us_oca/me.m08.d25:meMA.Ode5C2T.ode	@ltx/en_us_oca/miscellanea:misc.Ode5
ltx/en_us_oca/me.m08.d25:meMA.Ode5C2T.text	
ltx/en_us_oca/me.m08.d25:meMA.Ode6C11.greekmelody	@ltx/en_us_oca/he.h.m4:heHE.TinTheianTaftin.greekname
ltx/en_us_oca/me.m08.d25:meMA.Ode6C11.incipit	…
ltx/en_us_oca/me.m08.d25:meMA.Ode6C11.melody	@ltx/en_us_oca/he.h.m4:heHE.TinTheianTaftin.notmetered
ltx/en_us_oca/me.m08.d25:meMA.Ode6C11.mode	@ltx/en_us_oca/miscellanea:misc.Mode4
ltx/en_us_oca/me.m08.d25:meMA.Ode6C11.ode	@ltx/en_us_oca/miscellanea:misc.Ode6
ltx/en_us_oca/me.m08.d25:meMA.Ode6C11.text	
ltx/en_us_oca/me.m08.d25:meMA.Ode6C12.incipit	…
ltx/en_us_oca/me.m08.d25:meMA.Ode6C12.melody	@ltx/en_us_oca/he.h.m4:heHE.TinTheianTaftin.notmetered
ltx/en_us_oca/me.m08.d25:meMA.Ode6C12.mode	@ltx/en_us_oca/miscellanea:misc.Mode4
ltx/en_us_oca/me.m08.d25:meMA.Ode6C12.ode	@ltx/en_us_oca/miscellanea:misc.Ode6
ltx/en_us_oca/me.m08.d25:meMA.Ode6C12.text	
ltx/en_us_oca/me.m08.d25:meMA.Ode6C13.incipit	…
ltx/en_us_oca/me.m08.d25:meMA.Ode6C13.melody	@ltx/en_us_oca/he.h.m4:heHE.TinTheianTaftin.notmetered
ltx/en_us_oca/me.m08.d25:meMA.Ode6C13.mode	@ltx/en_us_oca/miscellanea:misc.Mode4
ltx/en_us_oca/me.m08.d25:meMA.Ode6C13.ode	@ltx/en_us_oca/miscellanea:misc.Ode6
ltx/en_us_oca/me.m08.d25:meMA.Ode6C13.text	
ltx/en_us_oca/me.m08.d25:meMA.Ode6C1T.incipit	…
ltx/en_us_oca/me.m08.d25:meMA.Ode6C1T.melody	@ltx/en_us_oca/he.h.m4:heHE.TinTheianTaftin.notmetered
ltx/en_us_oca/me.m08.d25:meMA.Ode6C1T.mode	@ltx/en_us_oca/miscellanea:misc.Mode4
ltx/en_us_oca/me.m08.d25:meMA.Ode6C1T.ode	@ltx/en_us_oca/miscellanea:misc.Ode6
ltx/en_us_oca/me.m08.d25:meMA.Ode6C1T.text	
ltx/en_us_oca/me.m08.d25:meMA.Ode6C21.greekmelody	@ltx/en_us_oca/he.h.m4:heHE.ThysoSoiMetaFonis.greekname
ltx/en_us_oca/me.m08.d25:meMA.Ode6C21.incipit	…
ltx/en_us_oca/me.m08.d25:meMA.Ode6C21.melody	@ltx/en_us_oca/he.h.m4:heHE.ThysoSoiMetaFonis.notmetered
ltx/en_us_oca/me.m08.d25:meMA.Ode6C21.mode	@ltx/en_us_oca/miscellanea:misc.Mode4
ltx/en_us_oca/me.m08.d25:meMA.Ode6C21.ode	@ltx/en_us_oca/miscellanea:misc.Ode6
ltx/en_us_oca/me.m08.d25:meMA.Ode6C21.text	
ltx/en_us_oca/me.m08.d25:meMA.Ode6C22.incipit	…
ltx/en_us_oca/me.m08.d25:meMA.Ode6C22.melody	@ltx/en_us_oca/he.h.m4:heHE.ThysoSoiMetaFonis.notmetered
ltx/en_us_oca/me.m08.d25:meMA.Ode6C22.mode	@ltx/en_us_oca/miscellanea:misc.Mode4
ltx/en_us_oca/me.m08.d25:meMA.Ode6C22.ode	@ltx/en_us_oca/miscellanea:misc.Ode6
ltx/en_us_oca/me.m08.d25:meMA.Ode6C22.text	
ltx/en_us_oca/me.m08.d25:meMA.Ode6C2T.incipit	…
ltx/en_us_oca/me.m08.d25:meMA.Ode6C2T.melody	@ltx/en_us_oca/he.h.m4:heHE.ThysoSoiMetaFonis.notmetered
ltx/en_us_oca/me.m08.d25:meMA.Ode6C2T.mode	@ltx/en_us_oca/miscellanea:misc.Mode4
ltx/en_us_oca/me.m08.d25:meMA.Ode6C2T.ode	@ltx/en_us_oca/miscellanea:misc.Ode6
ltx/en_us_oca/me.m08.d25:meMA.Ode6C2T.text	
ltx/en_us_oca/me.m08.d25:meMA.Ode6H.greekmelody	@ltx/en_us_oca/he.h.m4:heHE.ThysoSoiMetaFonis.greekname
ltx/en_us_oca/me.m08.d25:meMA.Ode6H.incipit	@ltx/en_us_oca/he.h.m4:heHE.ThysoSoiMetaFonis.incipit
ltx/en_us_oca/me.m08.d25:meMA.Ode6H.melody	@ltx/en_us_oca/he.h.m4:heHE.ThysoSoiMetaFonis.melody
ltx/en_us_oca/me.m08.d25:meMA.Ode6H.mode	@ltx/en_us_oca/miscellanea:misc.Mode4
ltx/en_us_oca/me.m08.d25:meMA.Ode6H.ode	@ltx/en_us_oca/miscellanea:misc.Ode6
ltx/en_us_oca/me.m08.d25:meMA.Ode6H.text	@ltx/en_us_oca/he.h.m4:heHE.ThysoSoiMetaFonis.text
ltx/en_us_oca/me.m08.d25:meMA.Ode7C11.greekmelody	@ltx/en_us_oca/he.h.m4:heHE.OukElatrefsan.greekname
ltx/en_us_oca/me.m08.d25:meMA.Ode7C11.incipit	…
ltx/en_us_oca/me.m08.d25:meMA.Ode7C11.melody	@ltx/en_us_oca/he.h.m4:heHE.OukElatrefsan.notmetered
ltx/en_us_oca/me.m08.d25:meMA.Ode7C11.mode	@ltx/en_us_oca/miscellanea:misc.Mode4
ltx/en_us_oca/me.m08.d25:meMA.Ode7C11.ode	@ltx/en_us_oca/miscellanea:misc.Ode7
ltx/en_us_oca/me.m08.d25:meMA.Ode7C11.text	
ltx/en_us_oca/me.m08.d25:meMA.Ode7C12.incipit	…
ltx/en_us_oca/me.m08.d25:meMA.Ode7C12.melody	@ltx/en_us_oca/he.h.m4:heHE.OukElatrefsan.notmetered
ltx/en_us_oca/me.m08.d25:meMA.Ode7C12.mode	@ltx/en_us_oca/miscellanea:misc.Mode4
ltx/en_us_oca/me.m08.d25:meMA.Ode7C12.ode	@ltx/en_us_oca/miscellanea:misc.Ode7
ltx/en_us_oca/me.m08.d25:meMA.Ode7C12.text	
ltx/en_us_oca/me.m08.d25:meMA.Ode7C13.incipit	…
ltx/en_us_oca/me.m08.d25:meMA.Ode7C13.melody	@ltx/en_us_oca/he.h.m4:heHE.OukElatrefsan.notmetered
ltx/en_us_oca/me.m08.d25:meMA.Ode7C13.mode	@ltx/en_us_oca/miscellanea:misc.Mode4
ltx/en_us_oca/me.m08.d25:meMA.Ode7C13.ode	@ltx/en_us_oca/miscellanea:misc.Ode7
ltx/en_us_oca/me.m08.d25:meMA.Ode7C13.text	
ltx/en_us_oca/me.m08.d25:meMA.Ode7C1T.incipit	…
ltx/en_us_oca/me.m08.d25:meMA.Ode7C1T.melody	@ltx/en_us_oca/he.h.m4:heHE.OukElatrefsan.notmetered
ltx/en_us_oca/me.m08.d25:meMA.Ode7C1T.mode	@ltx/en_us_oca/miscellanea:misc.Mode4
ltx/en_us_oca/me.m08.d25:meMA.Ode7C1T.ode	@ltx/en_us_oca/miscellanea:misc.Ode7
ltx/en_us_oca/me.m08.d25:meMA.Ode7C1T.text	
ltx/en_us_oca/me.m08.d25:meMA.Ode7C21.greekmelody	@ltx/en_us_oca/he.h.m4:heHE.ODiasosasEnPyri.greekname
ltx/en_us_oca/me.m08.d25:meMA.Ode7C21.incipit	…
ltx/en_us_oca/me.m08.d25:meMA.Ode7C21.melody	@ltx/en_us_oca/he.h.m4:heHE.ODiasosasEnPyri.notmetered
ltx/en_us_oca/me.m08.d25:meMA.Ode7C21.mode	@ltx/en_us_oca/miscellanea:misc.Mode4
ltx/en_us_oca/me.m08.d25:meMA.Ode7C21.ode	@ltx/en_us_oca/miscellanea:misc.Ode7
ltx/en_us_oca/me.m08.d25:meMA.Ode7C21.text	
ltx/en_us_oca/me.m08.d25:meMA.Ode7C22.incipit	…
ltx/en_us_oca/me.m08.d25:meMA.Ode7C22.melody	@ltx/en_us_oca/he.h.m4:heHE.ODiasosasEnPyri.notmetered
ltx/en_us_oca/me.m08.d25:meMA.Ode7C22.mode	@ltx/en_us_oca/miscellanea:misc.Mode4
ltx/en_us_oca/me.m08.d25:meMA.Ode7C22.ode	@ltx/en_us_oca/miscellanea:misc.Ode7
ltx/en_us_oca/me.m08.d25:meMA.Ode7C22.text	
ltx/en_us_oca/me.m08.d25:meMA.Ode7C23.incipit	…
ltx/en_us_oca/me.m08.d25:meMA.Ode7C23.melody	@ltx/en_us_oca/he.h.m4:heHE.ODiasosasEnPyri.notmetered
ltx/en_us_oca/me.m08.d25:meMA.Ode7C23.mode	@ltx/en_us_oca/miscellanea:misc.Mode4
ltx/en_us_oca/me.m08.d25:meMA.Ode7C23.ode	@ltx/en_us_oca/miscellanea:misc.Ode7
ltx/en_us_oca/me.m08.d25:meMA.Ode7C23.text	
ltx/en_us_oca/me.m08.d25:meMA.Ode7C2T.incipit	…
ltx/en_us_oca/me.m08.d25:meMA.Ode7C2T.melody	@ltx/en_us_oca/he.h.m4:heHE.ODiasosasEnPyri.notmetered
ltx/en_us_oca/me.m08.d25:meMA.Ode7C2T.mode	@ltx/en_us_oca/miscellanea:misc.Mode4
ltx/en_us_oca/me.m08.d25:meMA.Ode7C2T.ode	@ltx/en_us_oca/miscellanea:misc.Ode7
ltx/en_us_oca/me.m08.d25:meMA.Ode7C2T.text	
ltx/en_us_oca/me.m08.d25:meMA.Ode8C11.greekmelody	@ltx/en_us_oca/he.h.m4:heHE.PaidasEvageis.greekname
ltx/en_us_oca/me.m08.d25:meMA.Ode8C11.incipit	…
ltx/en_us_oca/me.m08.d25:meMA.Ode8C11.melody	@ltx/en_us_oca/he.h.m4:heHE.PaidasEvageis.notmetered
ltx/en_us_oca/me.m08.d25:meMA.Ode8C11.mode	@ltx/en_us_oca/miscellanea:misc.Mode4
ltx/en_us_oca/me.m08.d25:meMA.Ode8C11.ode	@ltx/en_us_oca/miscellanea:misc.Ode8
ltx/en_us_oca/me.m08.d25:meMA.Ode8C11.text	
ltx/en_us_oca/me.m08.d25:meMA.Ode8C12.incipit	…
ltx/en_us_oca/me.m08.d25:meMA.Ode8C12.melody	@ltx/en_us_oca/he.h.m4:heHE.PaidasEvageis.notmetered
ltx/en_us_oca/me.m08.d25:meMA.Ode8C12.mode	@ltx/en_us_oca/miscellanea:misc.Mode4
ltx/en_us_oca/me.m08.d25:meMA.Ode8C12.ode	@ltx/en_us_oca/miscellanea:misc.Ode8
ltx/en_us_oca/me.m08.d25:meMA.Ode8C12.text	
ltx/en_us_oca/me.m08.d25:meMA.Ode8C13.incipit	…
ltx/en_us_oca/me.m08.d25:meMA.Ode8C13.melody	@ltx/en_us_oca/he.h.m4:heHE.PaidasEvageis.notmetered
ltx/en_us_oca/me.m08.d25:meMA.Ode8C13.mode	@ltx/en_us_oca/miscellanea:misc.Mode4
ltx/en_us_oca/me.m08.d25:meMA.Ode8C13.ode	@ltx/en_us_oca/miscellanea:misc.Ode8
ltx/en_us_oca/me.m08.d25:meMA.Ode8C13.text	
ltx/en_us_oca/me.m08.d25:meMA.Ode8C1T.incipit	…
ltx/en_us_oca/me.m08.d25:meMA.Ode8C1T.melody	@ltx/en_us_oca/he.h.m4:heHE.PaidasEvageis.notmetered
ltx/en_us_oca/me.m08.d25:meMA.Ode8C1T.mode	@ltx/en_us_oca/miscellanea:misc.Mode4
ltx/en_us_oca/me.m08.d25:meMA.Ode8C1T.ode	@ltx/en_us_oca/miscellanea:misc.Ode8
ltx/en_us_oca/me.m08.d25:meMA.Ode8C1T.text	
ltx/en_us_oca/me.m08.d25:meMA.Ode8C21.greekmelody	@ltx/en_us_oca/he.h.m4:heHE.PaidasEvageis.greekname
ltx/en_us_oca/me.m08.d25:meMA.Ode8C21.incipit	…
ltx/en_us_oca/me.m08.d25:meMA.Ode8C21.melody	@ltx/en_us_oca/he.h.m4:heHE.PaidasEvageis.notmetered
ltx/en_us_oca/me.m08.d25:meMA.Ode8C21.mode	@ltx/en_us_oca/miscellanea:misc.Mode4
ltx/en_us_oca/me.m08.d25:meMA.Ode8C21.ode	@ltx/en_us_oca/miscellanea:misc.Ode8
ltx/en_us_oca/me.m08.d25:meMA.Ode8C21.text	
ltx/en_us_oca/me.m08.d25:meMA.Ode8C22.incipit	…
ltx/en_us_oca/me.m08.d25:meMA.Ode8C22.melody	@ltx/en_us_oca/he.h.m4:heHE.PaidasEvageis.notmetered
ltx/en_us_oca/me.m08.d25:meMA.Ode8C22.mode	@ltx/en_us_oca/miscellanea:misc.Mode4
ltx/en_us_oca/me.m08.d25:meMA.Ode8C22.ode	@ltx/en_us_oca/miscellanea:misc.Ode8
ltx/en_us_oca/me.m08.d25:meMA.Ode8C22.text	
ltx/en_us_oca/me.m08.d25:meMA.Ode8C23.incipit	…
ltx/en_us_oca/me.m08.d25:meMA.Ode8C23.melody	@ltx/en_us_oca/he.h.m4:heHE.PaidasEvageis.notmetered
ltx/en_us_oca/me.m08.d25:meMA.Ode8C23.mode	@ltx/en_us_oca/miscellanea:misc.Mode4
ltx/en_us_oca/me.m08.d25:meMA.Ode8C23.ode	@ltx/en_us_oca/miscellanea:misc.Ode8
ltx/en_us_oca/me.m08.d25:meMA.Ode8C23.text	
ltx/en_us_oca/me.m08.d25:meMA.Ode8C2T.incipit	…
ltx/en_us_oca/me.m08.d25:meMA.Ode8C2T.melody	@ltx/en_us_oca/he.h.m4:heHE.PaidasEvageis.notmetered
ltx/en_us_oca/me.m08.d25:meMA.Ode8C2T.mode	@ltx/en_us_oca/miscellanea:misc.Mode4
ltx/en_us_oca/me.m08.d25:meMA.Ode8C2T.ode	@ltx/en_us_oca/miscellanea:misc.Ode8
ltx/en_us_oca/me.m08.d25:meMA.Ode8C2T.text	
ltx/en_us_oca/me.m08.d25:meMA.Ode8H.greekmelody	@ltx/en_us_oca/he.h.m4:heHE.PaidasEvageis.greekname
ltx/en_us_oca/me.m08.d25:meMA.Ode8H.incipit	@ltx/en_us_oca/he.h.m4:heHE.PaidasEvageis.incipit
ltx/en_us_oca/me.m08.d25:meMA.Ode8H.melody	@ltx/en_us_oca/he.h.m4:heHE.PaidasEvageis.melody
ltx/en_us_oca/me.m08.d25:meMA.Ode8H.mode	@ltx/en_us_oca/miscellanea:misc.Mode4
ltx/en_us_oca/me.m08.d25:meMA.Ode8H.ode	@ltx/en_us_oca/miscellanea:misc.Ode8
ltx/en_us_oca/me.m08.d25:meMA.Ode8H.text	@ltx/en_us_oca/he.h.m4:heHE.PaidasEvageis.text
ltx/en_us_oca/me.m08.d25:meMA.Ode9C11.greekmelody	@ltx/en_us_oca/he.h.m4:heHE.ApasGigenis.greekname
ltx/en_us_oca/me.m08.d25:meMA.Ode9C11.incipit	…
ltx/en_us_oca/me.m08.d25:meMA.Ode9C11.melody	@ltx/en_us_oca/he.h.m4:heHE.ApasGigenis.notmetered
ltx/en_us_oca/me.m08.d25:meMA.Ode9C11.mode	@ltx/en_us_oca/miscellanea:misc.Mode4
ltx/en_us_oca/me.m08.d25:meMA.Ode9C11.ode	@ltx/en_us_oca/miscellanea:misc.Ode9
ltx/en_us_oca/me.m08.d25:meMA.Ode9C11.text	
ltx/en_us_oca/me.m08.d25:meMA.Ode9C12.incipit	…
ltx/en_us_oca/me.m08.d25:meMA.Ode9C12.melody	@ltx/en_us_oca/he.h.m4:heHE.ApasGigenis.notmetered
ltx/en_us_oca/me.m08.d25:meMA.Ode9C12.mode	@ltx/en_us_oca/miscellanea:misc.Mode4
ltx/en_us_oca/me.m08.d25:meMA.Ode9C12.ode	@ltx/en_us_oca/miscellanea:misc.Ode9
ltx/en_us_oca/me.m08.d25:meMA.Ode9C12.text	
ltx/en_us_oca/me.m08.d25:meMA.Ode9C13.incipit	…
ltx/en_us_oca/me.m08.d25:meMA.Ode9C13.melody	@ltx/en_us_oca/he.h.m4:heHE.ApasGigenis.notmetered
ltx/en_us_oca/me.m08.d25:meMA.Ode9C13.mode	@ltx/en_us_oca/miscellanea:misc.Mode4
ltx/en_us_oca/me.m08.d25:meMA.Ode9C13.ode	@ltx/en_us_oca/miscellanea:misc.Ode9
ltx/en_us_oca/me.m08.d25:meMA.Ode9C13.text	
ltx/en_us_oca/me.m08.d25:meMA.Ode9C1T.incipit	…
ltx/en_us_oca/me.m08.d25:meMA.Ode9C1T.melody	@ltx/en_us_oca/he.h.m4:heHE.ApasGigenis.notmetered
ltx/en_us_oca/me.m08.d25:meMA.Ode9C1T.mode	@ltx/en_us_oca/miscellanea:misc.Mode4
ltx/en_us_oca/me.m08.d25:meMA.Ode9C1T.ode	@ltx/en_us_oca/miscellanea:misc.Ode9
ltx/en_us_oca/me.m08.d25:meMA.Ode9C1T.text	
ltx/en_us_oca/me.m08.d25:meMA.Ode9C21.greekmelody	@ltx/en_us_oca/he.h.m4:heHE.EvaMenToTisParakois.greekname
ltx/en_us_oca/me.m08.d25:meMA.Ode9C21.incipit	…
ltx/en_us_oca/me.m08.d25:meMA.Ode9C21.melody	@ltx/en_us_oca/he.h.m4:heHE.EvaMenToTisParakois.notmetered
ltx/en_us_oca/me.m08.d25:meMA.Ode9C21.mode	@ltx/en_us_oca/miscellanea:misc.Mode4
ltx/en_us_oca/me.m08.d25:meMA.Ode9C21.ode	@ltx/en_us_oca/miscellanea:misc.Ode9
ltx/en_us_oca/me.m08.d25:meMA.Ode9C21.text	
ltx/en_us_oca/me.m08.d25:meMA.Ode9C22.incipit	…
ltx/en_us_oca/me.m08.d25:meMA.Ode9C22.melody	@ltx/en_us_oca/he.h.m4:heHE.EvaMenToTisParakois.notmetered
ltx/en_us_oca/me.m08.d25:meMA.Ode9C22.mode	@ltx/en_us_oca/miscellanea:misc.Mode4
ltx/en_us_oca/me.m08.d25:meMA.Ode9C22.ode	@ltx/en_us_oca/miscellanea:misc.Ode9
ltx/en_us_oca/me.m08.d25:meMA.Ode9C22.text	
ltx/en_us_oca/me.m08.d25:meMA.Ode9C23.incipit	…
ltx/en_us_oca/me.m08.d25:meMA.Ode9C23.melody	@ltx/en_us_oca/he.h.m4:heHE.EvaMenToTisParakois.notmetered
ltx/en_us_oca/me.m08.d25:meMA.Ode9C23.mode	@ltx/en_us_oca/miscellanea:misc.Mode4
ltx/en_us_oca/me.m08.d25:meMA.Ode9C23.ode	@ltx/en_us_oca/miscellanea:misc.Ode9
ltx/en_us_oca/me.m08.d25:meMA.Ode9C23.text	
ltx/en_us_oca/me.m08.d25:meMA.Ode9C2T.incipit	…
ltx/en_us_oca/me.m08.d25:meMA.Ode9C2T.melody	@ltx/en_us_oca/he.h.m4:heHE.EvaMenToTisParakois.notmetered
ltx/en_us_oca/me.m08.d25:meMA.Ode9C2T.mode	@ltx/en_us_oca/miscellanea:misc.Mode4
ltx/en_us_oca/me.m08.d25:meMA.Ode9C2T.ode	@ltx/en_us_oca/miscellanea:misc.Ode9
ltx/en_us_oca/me.m08.d25:meMA.Ode9C2T.text	
ltx/en_us_oca/me.m08.d25:meMA.Ode9H.greekmelody	@ltx/en_us_oca/he.h.m4:heHE.EvaMenToTisParakois.greekname
ltx/en_us_oca/me.m08.d25:meMA.Ode9H.incipit	@ltx/en_us_oca/he.h.m4:heHE.EvaMenToTisParakois.incipit
ltx/en_us_oca/me.m08.d25:meMA.Ode9H.melody	@ltx/en_us_oca/he.h.m4:heHE.EvaMenToTisParakois.melody
ltx/en_us_oca/me.m08.d25:meMA.Ode9H.mode	@ltx/en_us_oca/miscellanea:misc.Mode4
ltx/en_us_oca/me.m08.d25:meMA.Ode9H.ode	@ltx/en_us_oca/miscellanea:misc.Ode9
ltx/en_us_oca/me.m08.d25:meMA.Ode9H.text	@ltx/en_us_oca/he.h.m4:heHE.EvaMenToTisParakois.text
ltx/en_us_oca/me.m08.d25:meMA.Oikos2.text	
ltx/en_us_oca/me.m08.d25:meVE.Apolytikion1ger.greekmelody	@ltx/en_us_oca/he.a.m5:heAU.TonSynanarchonLogon.greekname
ltx/en_us_oca/me.m08.d25:meVE.Apolytikion1ger.incipit	…
ltx/en_us_oca/me.m08.d25:meVE.Apolytikion1ger.melody	@ltx/en_us_oca/he.a.m5:heAU.TonSynanarchonLogon.notmetered
ltx/en_us_oca/me.m08.d25:meVE.Apolytikion1ger.mode	@ltx/en_us_oca/miscellanea:misc.Mode5
ltx/en_us_oca/me.m08.d25:meVE.Apolytikion1ger.poet	@ltx/en_us_oca/poets:po.Gerasimou
ltx/en_us_oca/me.m08.d25:meVE.Apolytikion1ger.text	
ltx/en_us_oca/me.m08.d25:meVE.Apolytikion2ger.greekmelody	@ltx/en_us_oca/he.a.m5:heAU.TonSynanarchonLogon.greekname
ltx/en_us_oca/me.m08.d25:meVE.Apolytikion2ger.incipit	…
ltx/en_us_oca/me.m08.d25:meVE.Apolytikion2ger.melody	@ltx/en_us_oca/he.a.m5:heAU.TonSynanarchonLogon.notmetered
ltx/en_us_oca/me.m08.d25:meVE.Apolytikion2ger.mode	@ltx/en_us_oca/miscellanea:misc.Mode5
ltx/en_us_oca/me.m08.d25:meVE.Apolytikion2ger.poet	@ltx/en_us_oca/poets:po.Gerasimou
ltx/en_us_oca/me.m08.d25:meVE.Apolytikion2ger.text	
ltx/en_us_oca/me.m08.d25:meVE.AposGlory.incipit	…
ltx/en_us_oca/me.m08.d25:meVE.AposGlory.melody	
ltx/en_us_oca/me.m08.d25:meVE.AposGlory.mode	@ltx/en_us_oca/miscellanea:misc.Mode6
ltx/en_us_oca/me.m08.d25:meVE.AposGlory.text	
ltx/en_us_oca/me.m08.d25:meVE.AposTheotokion.greekmelody	@ltx/en_us_oca/he.a.m6:heAU.TriimerosAnestis.greekname
ltx/en_us_oca/me.m08.d25:meVE.AposTheotokion.incipit	…
ltx/en_us_oca/me.m08.d25:meVE.AposTheotokion.melody	@ltx/en_us_oca/he.a.m6:heAU.TriimerosAnestis.notmetered
ltx/en_us_oca/me.m08.d25:meVE.AposTheotokion.mode	@ltx/en_us_oca/miscellanea:misc.Mode6
ltx/en_us_oca/me.m08.d25:meVE.AposTheotokion.text	
ltx/en_us_oca/me.m08.d25:meVE.SticGlory.incipit	…
ltx/en_us_oca/me.m08.d25:meVE.SticGlory.melody	
ltx/en_us_oca/me.m08.d25:meVE.SticGlory.mode	@ltx/en_us_oca/miscellanea:misc.Mode6
ltx/en_us_oca/me.m08.d25:meVE.SticGlory.text	
ltx/en_us_oca/me.m08.d25:meVE.SticTheotokion.incipit	@ltx/en_us_oca/he.o:heOT.TheotokeSyEi.incipit
ltx/en_us_oca/me.m08.d25:meVE.SticTheotokion.melody	
ltx/en_us_oca/me.m08.d25:meVE.SticTheotokion.mode	@ltx/en_us_oca/miscellanea:misc.Mode6
ltx/en_us_oca/me.m08.d25:meVE.SticTheotokion.text	@ltx/en_us_oca/he.o:heOT.TheotokeSyEiApostolon.text
ltx/en_us_oca/me.m08.d25:meVE.Stichera01.greekmelody	@ltx/en_us_oca/he.a.m4:heAU.OsGennaionEnMartysi.greekname
ltx/en_us_oca/me.m08.d25:meVE.Stichera01.incipit	…
ltx/en_us_oca/me.m08.d25:meVE.Stichera01.melody	@ltx/en_us_oca/he.a.m4:heAU.OsGennaionEnMartysi.notmetered
ltx/en_us_oca/me.m08.d25:meVE.Stichera01.mode	@ltx/en_us_oca/miscellanea:misc.Mode4
ltx/en_us_oca/me.m08.d25:meVE.Stichera01.text	
ltx/en_us_oca/me.m08.d25:meVE.Stichera02.incipit	…
ltx/en_us_oca/me.m08.d25:meVE.Stichera02.melody	@ltx/en_us_oca/he.a.m4:heAU.OsGennaionEnMartysi.notmetered
ltx/en_us_oca/me.m08.d25:meVE.Stichera02.mode	@ltx/en_us_oca/miscellanea:misc.Mode4
ltx/en_us_oca/me.m08.d25:meVE.Stichera02.text	
ltx/en_us_oca/me.m08.d25:meVE.Stichera03.incipit	…
ltx/en_us_oca/me.m08.d25:meVE.Stichera03.melody	@ltx/en_us_oca/he.a.m4:heAU.OsGennaionEnMartysi.notmetered
ltx/en_us_oca/me.m08.d25:meVE.Stichera03.mode	@ltx/en_us_oca/miscellanea:misc.Mode4
ltx/en_us_oca/me.m08.d25:meVE.Stichera03.text	
ltx/en_us_oca/me.m08.d25:meVE.Stichera04.greekmelody	@ltx/en_us_oca/he.a.m4:heAU.EdokasSimeiosin.greekname
ltx/en_us_oca/me.m08.d25:meVE.Stichera04.incipit	…
ltx/en_us_oca/me.m08.d25:meVE.Stichera04.melody	@ltx/en_us_oca/he.a.m4:heAU.EdokasSimeiosin.notmetered
ltx/en_us_oca/me.m08.d25:meVE.Stichera04.mode	@ltx/en_us_oca/miscellanea:misc.Mode4
ltx/en_us_oca/me.m08.d25:meVE.Stichera04.text	
ltx/en_us_oca/me.m08.d25:meVE.Stichera05.incipit	…
ltx/en_us_oca/me.m08.d25:meVE.Stichera05.melody	@ltx/en_us_oca/he.a.m4:heAU.EdokasSimeiosin.notmetered
ltx/en_us_oca/me.m08.d25:meVE.Stichera05.mode	@ltx/en_us_oca/miscellanea:misc.Mode4
ltx/en_us_oca/me.m08.d25:meVE.Stichera05.text	
ltx/en_us_oca/me.m08.d25:meVE.Stichera06.incipit	…
ltx/en_us_oca/me.m08.d25:meVE.Stichera06.melody	@ltx/en_us_oca/he.a.m4:heAU.EdokasSimeiosin.notmetered
ltx/en_us_oca/me.m08.d25:meVE.Stichera06.mode	@ltx/en_us_oca/miscellanea:misc.Mode4
ltx/en_us_oca/me.m08.d25:meVE.Stichera06.text	
