ltx/en_us_oca/me.m04.d14:meDA.commemoration.first	
ltx/en_us_oca/me.m04.d14:meDA.commemoration.first_name	
ltx/en_us_oca/me.m04.d14:meDA.commemoration.first_short	
ltx/en_us_oca/me.m04.d14:meDA.commemoration.first_title	
ltx/en_us_oca/me.m04.d14:meDA.commemoration.full	
ltx/en_us_oca/me.m04.d14:meDA.commemoration.second_name	
ltx/en_us_oca/me.m04.d14:meDA.commemoration.second_title	
ltx/en_us_oca/me.m04.d14:meDA.date	
ltx/en_us_oca/me.m04.d14:meDA.fordate	
ltx/en_us_oca/me.m04.d14:meDA.insert1	
ltx/en_us_oca/me.m04.d14:meDA.insert2	
ltx/en_us_oca/me.m04.d14:meDA.note	
ltx/en_us_oca/me.m04.d14:meDA.pdfcoverdate	
ltx/en_us_oca/me.m04.d14:meDA.pdfheaderdate	
ltx/en_us_oca/me.m04.d14:meHO.commemorations	
ltx/en_us_oca/me.m04.d14:meHO.note1	
ltx/en_us_oca/me.m04.d14:meHO.note2	
ltx/en_us_oca/me.m04.d14:meHO.number	
ltx/en_us_oca/me.m04.d14:meHO.rank	
ltx/en_us_oca/me.m04.d14:meLE.commemoration1	
ltx/en_us_oca/me.m04.d14:meLE.commemoration2	
ltx/en_us_oca/me.m04.d14:meLI.Kontakion1.incipit	@ltx/en_us_oca/me.m04.d14:meMA.Kontakion1ger.incipit
ltx/en_us_oca/me.m04.d14:meLI.Kontakion1.melody	@ltx/en_us_oca/me.m04.d14:meMA.Kontakion1ger.melody
ltx/en_us_oca/me.m04.d14:meLI.Kontakion1.mode	@ltx/en_us_oca/me.m04.d14:meMA.Kontakion1ger.mode
ltx/en_us_oca/me.m04.d14:meLI.Kontakion1.text	@ltx/en_us_oca/me.m04.d14:meMA.Kontakion1ger.text
ltx/en_us_oca/me.m04.d14:meLI.MM.CommunionHymn.text	@ltx/en_us_oca/properties:media.key
ltx/en_us_oca/me.m04.d14:meLI.Megalynarion.text	
ltx/en_us_oca/me.m04.d14:meMA.C1.acrostic.notice1	
ltx/en_us_oca/me.m04.d14:meMA.C1.acrostic.text	
ltx/en_us_oca/me.m04.d14:meMA.C1.acrostic.title	
ltx/en_us_oca/me.m04.d14:meMA.C1.title	@ltx/en_us_oca/titles:ti.CanonSaints
ltx/en_us_oca/me.m04.d14:meMA.C1.verse	@ltx/en_us_oca/prayers:pr.verse_Apostles.text
ltx/en_us_oca/me.m04.d14:meMA.Kontakion1ger.incipit	…
ltx/en_us_oca/me.m04.d14:meMA.Kontakion1ger.melody	@ltx/en_us_oca/he.a.m8:heAU.OsAparchas.notmetered
ltx/en_us_oca/me.m04.d14:meMA.Kontakion1ger.mode	@ltx/en_us_oca/miscellanea:misc.Mode8
ltx/en_us_oca/me.m04.d14:meMA.Kontakion1ger.poet	@ltx/en_us_oca/poets:po.Gerasimou
ltx/en_us_oca/me.m04.d14:meMA.Kontakion1ger.text	
ltx/en_us_oca/me.m04.d14:meMA.Ode1C11.greekmelody	@ltx/en_us_oca/he.h.m6:heHE.OsEnIpeiroPezefsas.greekname
ltx/en_us_oca/me.m04.d14:meMA.Ode1C11.incipit	…
ltx/en_us_oca/me.m04.d14:meMA.Ode1C11.melody	@ltx/en_us_oca/he.h.m6:heHE.OsEnIpeiroPezefsas.notmetered
ltx/en_us_oca/me.m04.d14:meMA.Ode1C11.mode	@ltx/en_us_oca/miscellanea:misc.Mode6
ltx/en_us_oca/me.m04.d14:meMA.Ode1C11.ode	@ltx/en_us_oca/miscellanea:misc.Ode1
ltx/en_us_oca/me.m04.d14:meMA.Ode1C11.text	
ltx/en_us_oca/me.m04.d14:meMA.Ode1C12.incipit	…
ltx/en_us_oca/me.m04.d14:meMA.Ode1C12.melody	@ltx/en_us_oca/he.h.m6:heHE.OsEnIpeiroPezefsas.notmetered
ltx/en_us_oca/me.m04.d14:meMA.Ode1C12.mode	@ltx/en_us_oca/miscellanea:misc.Mode6
ltx/en_us_oca/me.m04.d14:meMA.Ode1C12.ode	@ltx/en_us_oca/miscellanea:misc.Ode1
ltx/en_us_oca/me.m04.d14:meMA.Ode1C12.text	
ltx/en_us_oca/me.m04.d14:meMA.Ode1C13.incipit	…
ltx/en_us_oca/me.m04.d14:meMA.Ode1C13.melody	@ltx/en_us_oca/he.h.m6:heHE.OsEnIpeiroPezefsas.notmetered
ltx/en_us_oca/me.m04.d14:meMA.Ode1C13.mode	@ltx/en_us_oca/miscellanea:misc.Mode6
ltx/en_us_oca/me.m04.d14:meMA.Ode1C13.ode	@ltx/en_us_oca/miscellanea:misc.Ode1
ltx/en_us_oca/me.m04.d14:meMA.Ode1C13.text	
ltx/en_us_oca/me.m04.d14:meMA.Ode1C14.incipit	…
ltx/en_us_oca/me.m04.d14:meMA.Ode1C14.melody	@ltx/en_us_oca/he.h.m6:heHE.OsEnIpeiroPezefsas.notmetered
ltx/en_us_oca/me.m04.d14:meMA.Ode1C14.mode	@ltx/en_us_oca/miscellanea:misc.Mode6
ltx/en_us_oca/me.m04.d14:meMA.Ode1C14.ode	@ltx/en_us_oca/miscellanea:misc.Ode1
ltx/en_us_oca/me.m04.d14:meMA.Ode1C14.text	
ltx/en_us_oca/me.m04.d14:meMA.Ode1C1H.greekmelody	@ltx/en_us_oca/he.h.m6:heHE.OsEnIpeiroPezefsas.greekname
ltx/en_us_oca/me.m04.d14:meMA.Ode1C1H.incipit	@ltx/en_us_oca/he.h.m6:heHE.OsEnIpeiroPezefsas.incipit
ltx/en_us_oca/me.m04.d14:meMA.Ode1C1H.melody	@ltx/en_us_oca/he.h.m6:heHE.OsEnIpeiroPezefsas.melody
ltx/en_us_oca/me.m04.d14:meMA.Ode1C1H.mode	@ltx/en_us_oca/miscellanea:misc.Mode6
ltx/en_us_oca/me.m04.d14:meMA.Ode1C1H.ode	@ltx/en_us_oca/miscellanea:misc.Ode1
ltx/en_us_oca/me.m04.d14:meMA.Ode1C1H.text	@ltx/en_us_oca/he.h.m6:heHE.OsEnIpeiroPezefsas.text
ltx/en_us_oca/me.m04.d14:meMA.Ode1C1T.incipit	…
ltx/en_us_oca/me.m04.d14:meMA.Ode1C1T.melody	@ltx/en_us_oca/he.h.m6:heHE.OsEnIpeiroPezefsas.notmetered
ltx/en_us_oca/me.m04.d14:meMA.Ode1C1T.mode	@ltx/en_us_oca/miscellanea:misc.Mode6
ltx/en_us_oca/me.m04.d14:meMA.Ode1C1T.ode	@ltx/en_us_oca/miscellanea:misc.Ode1
ltx/en_us_oca/me.m04.d14:meMA.Ode1C1T.text	
ltx/en_us_oca/me.m04.d14:meMA.Ode3C11.greekmelody	@ltx/en_us_oca/he.h.m6:heHE.OukEstinAgios.greekname
ltx/en_us_oca/me.m04.d14:meMA.Ode3C11.incipit	…
ltx/en_us_oca/me.m04.d14:meMA.Ode3C11.melody	@ltx/en_us_oca/he.h.m6:heHE.OukEstinAgios.notmetered
ltx/en_us_oca/me.m04.d14:meMA.Ode3C11.mode	@ltx/en_us_oca/miscellanea:misc.Mode6
ltx/en_us_oca/me.m04.d14:meMA.Ode3C11.ode	@ltx/en_us_oca/miscellanea:misc.Ode3
ltx/en_us_oca/me.m04.d14:meMA.Ode3C11.text	
ltx/en_us_oca/me.m04.d14:meMA.Ode3C12.incipit	…
ltx/en_us_oca/me.m04.d14:meMA.Ode3C12.melody	@ltx/en_us_oca/he.h.m6:heHE.OukEstinAgios.notmetered
ltx/en_us_oca/me.m04.d14:meMA.Ode3C12.mode	@ltx/en_us_oca/miscellanea:misc.Mode6
ltx/en_us_oca/me.m04.d14:meMA.Ode3C12.ode	@ltx/en_us_oca/miscellanea:misc.Ode3
ltx/en_us_oca/me.m04.d14:meMA.Ode3C12.text	
ltx/en_us_oca/me.m04.d14:meMA.Ode3C13.incipit	…
ltx/en_us_oca/me.m04.d14:meMA.Ode3C13.melody	@ltx/en_us_oca/he.h.m6:heHE.OukEstinAgios.notmetered
ltx/en_us_oca/me.m04.d14:meMA.Ode3C13.mode	@ltx/en_us_oca/miscellanea:misc.Mode6
ltx/en_us_oca/me.m04.d14:meMA.Ode3C13.ode	@ltx/en_us_oca/miscellanea:misc.Ode3
ltx/en_us_oca/me.m04.d14:meMA.Ode3C13.text	
ltx/en_us_oca/me.m04.d14:meMA.Ode3C1H.greekmelody	@ltx/en_us_oca/he.h.m6:heHE.OukEstinAgios.greekname
ltx/en_us_oca/me.m04.d14:meMA.Ode3C1H.incipit	@ltx/en_us_oca/he.h.m6:heHE.OukEstinAgios.incipit
ltx/en_us_oca/me.m04.d14:meMA.Ode3C1H.melody	@ltx/en_us_oca/he.h.m6:heHE.OukEstinAgios.melody
ltx/en_us_oca/me.m04.d14:meMA.Ode3C1H.mode	@ltx/en_us_oca/miscellanea:misc.Mode6
ltx/en_us_oca/me.m04.d14:meMA.Ode3C1H.ode	@ltx/en_us_oca/miscellanea:misc.Ode3
ltx/en_us_oca/me.m04.d14:meMA.Ode3C1H.text	@ltx/en_us_oca/he.h.m6:heHE.OukEstinAgios.text
ltx/en_us_oca/me.m04.d14:meMA.Ode3C1T.incipit	…
ltx/en_us_oca/me.m04.d14:meMA.Ode3C1T.melody	@ltx/en_us_oca/he.h.m6:heHE.OukEstinAgios.notmetered
ltx/en_us_oca/me.m04.d14:meMA.Ode3C1T.mode	@ltx/en_us_oca/miscellanea:misc.Mode6
ltx/en_us_oca/me.m04.d14:meMA.Ode3C1T.ode	@ltx/en_us_oca/miscellanea:misc.Ode3
ltx/en_us_oca/me.m04.d14:meMA.Ode3C1T.text	
ltx/en_us_oca/me.m04.d14:meMA.Ode3Kathisma1.greekmelody	@ltx/en_us_oca/he.a.m4:heAU.EpefanisSimeron.greekname
ltx/en_us_oca/me.m04.d14:meMA.Ode3Kathisma1.incipit	…
ltx/en_us_oca/me.m04.d14:meMA.Ode3Kathisma1.melody	@ltx/en_us_oca/he.a.m4:heAU.EpefanisSimeron.notmetered
ltx/en_us_oca/me.m04.d14:meMA.Ode3Kathisma1.mode	@ltx/en_us_oca/miscellanea:misc.Mode4
ltx/en_us_oca/me.m04.d14:meMA.Ode3Kathisma1.text	
ltx/en_us_oca/me.m04.d14:meMA.Ode3KathismaSt.incipit	…
ltx/en_us_oca/me.m04.d14:meMA.Ode3KathismaSt.melody	@ltx/en_us_oca/he.a.m4:heAU.EpefanisSimeron.notmetered
ltx/en_us_oca/me.m04.d14:meMA.Ode3KathismaSt.mode	@ltx/en_us_oca/miscellanea:misc.Mode4
ltx/en_us_oca/me.m04.d14:meMA.Ode3KathismaSt.text	
ltx/en_us_oca/me.m04.d14:meMA.Ode3KathismaT.incipit	…
ltx/en_us_oca/me.m04.d14:meMA.Ode3KathismaT.melody	@ltx/en_us_oca/he.a.m4:heAU.EpefanisSimeron.notmetered
ltx/en_us_oca/me.m04.d14:meMA.Ode3KathismaT.mode	@ltx/en_us_oca/miscellanea:misc.Mode4
ltx/en_us_oca/me.m04.d14:meMA.Ode3KathismaT.text	
ltx/en_us_oca/me.m04.d14:meMA.Ode4C11.greekmelody	@ltx/en_us_oca/he.h.m6:heHE.ChristosMouDynamis.greekname
ltx/en_us_oca/me.m04.d14:meMA.Ode4C11.incipit	…
ltx/en_us_oca/me.m04.d14:meMA.Ode4C11.melody	@ltx/en_us_oca/he.h.m6:heHE.ChristosMouDynamis.notmetered
ltx/en_us_oca/me.m04.d14:meMA.Ode4C11.mode	@ltx/en_us_oca/miscellanea:misc.Mode6
ltx/en_us_oca/me.m04.d14:meMA.Ode4C11.ode	@ltx/en_us_oca/miscellanea:misc.Ode4
ltx/en_us_oca/me.m04.d14:meMA.Ode4C11.text	
ltx/en_us_oca/me.m04.d14:meMA.Ode4C12.incipit	…
ltx/en_us_oca/me.m04.d14:meMA.Ode4C12.melody	@ltx/en_us_oca/he.h.m6:heHE.ChristosMouDynamis.notmetered
ltx/en_us_oca/me.m04.d14:meMA.Ode4C12.mode	@ltx/en_us_oca/miscellanea:misc.Mode6
ltx/en_us_oca/me.m04.d14:meMA.Ode4C12.ode	@ltx/en_us_oca/miscellanea:misc.Ode4
ltx/en_us_oca/me.m04.d14:meMA.Ode4C12.text	
ltx/en_us_oca/me.m04.d14:meMA.Ode4C13.incipit	…
ltx/en_us_oca/me.m04.d14:meMA.Ode4C13.melody	@ltx/en_us_oca/he.h.m6:heHE.ChristosMouDynamis.notmetered
ltx/en_us_oca/me.m04.d14:meMA.Ode4C13.mode	@ltx/en_us_oca/miscellanea:misc.Mode6
ltx/en_us_oca/me.m04.d14:meMA.Ode4C13.ode	@ltx/en_us_oca/miscellanea:misc.Ode4
ltx/en_us_oca/me.m04.d14:meMA.Ode4C13.text	
ltx/en_us_oca/me.m04.d14:meMA.Ode4C1H.greekmelody	@ltx/en_us_oca/he.h.m6:heHE.ChristosMouDynamis.greekname
ltx/en_us_oca/me.m04.d14:meMA.Ode4C1H.incipit	@ltx/en_us_oca/he.h.m6:heHE.ChristosMouDynamis.incipit
ltx/en_us_oca/me.m04.d14:meMA.Ode4C1H.melody	@ltx/en_us_oca/he.h.m6:heHE.ChristosMouDynamis.melody
ltx/en_us_oca/me.m04.d14:meMA.Ode4C1H.mode	@ltx/en_us_oca/miscellanea:misc.Mode6
ltx/en_us_oca/me.m04.d14:meMA.Ode4C1H.ode	@ltx/en_us_oca/miscellanea:misc.Ode4
ltx/en_us_oca/me.m04.d14:meMA.Ode4C1H.text	@ltx/en_us_oca/he.h.m6:heHE.ChristosMouDynamis.text
ltx/en_us_oca/me.m04.d14:meMA.Ode4C1T.incipit	…
ltx/en_us_oca/me.m04.d14:meMA.Ode4C1T.melody	@ltx/en_us_oca/he.h.m6:heHE.ChristosMouDynamis.notmetered
ltx/en_us_oca/me.m04.d14:meMA.Ode4C1T.mode	@ltx/en_us_oca/miscellanea:misc.Mode6
ltx/en_us_oca/me.m04.d14:meMA.Ode4C1T.ode	@ltx/en_us_oca/miscellanea:misc.Ode4
ltx/en_us_oca/me.m04.d14:meMA.Ode4C1T.text	
ltx/en_us_oca/me.m04.d14:meMA.Ode5C11.greekmelody	@ltx/en_us_oca/he.h.m6:heHE.ToTheioFengeiSou.greekname
ltx/en_us_oca/me.m04.d14:meMA.Ode5C11.incipit	…
ltx/en_us_oca/me.m04.d14:meMA.Ode5C11.melody	@ltx/en_us_oca/he.h.m6:heHE.ToTheioFengeiSou.notmetered
ltx/en_us_oca/me.m04.d14:meMA.Ode5C11.mode	@ltx/en_us_oca/miscellanea:misc.Mode6
ltx/en_us_oca/me.m04.d14:meMA.Ode5C11.ode	@ltx/en_us_oca/miscellanea:misc.Ode5
ltx/en_us_oca/me.m04.d14:meMA.Ode5C11.text	
ltx/en_us_oca/me.m04.d14:meMA.Ode5C12.incipit	…
ltx/en_us_oca/me.m04.d14:meMA.Ode5C12.melody	@ltx/en_us_oca/he.h.m6:heHE.ToTheioFengeiSou.notmetered
ltx/en_us_oca/me.m04.d14:meMA.Ode5C12.mode	@ltx/en_us_oca/miscellanea:misc.Mode6
ltx/en_us_oca/me.m04.d14:meMA.Ode5C12.ode	@ltx/en_us_oca/miscellanea:misc.Ode5
ltx/en_us_oca/me.m04.d14:meMA.Ode5C12.text	
ltx/en_us_oca/me.m04.d14:meMA.Ode5C13.incipit	…
ltx/en_us_oca/me.m04.d14:meMA.Ode5C13.melody	@ltx/en_us_oca/he.h.m6:heHE.ToTheioFengeiSou.notmetered
ltx/en_us_oca/me.m04.d14:meMA.Ode5C13.mode	@ltx/en_us_oca/miscellanea:misc.Mode6
ltx/en_us_oca/me.m04.d14:meMA.Ode5C13.ode	@ltx/en_us_oca/miscellanea:misc.Ode5
ltx/en_us_oca/me.m04.d14:meMA.Ode5C13.text	
ltx/en_us_oca/me.m04.d14:meMA.Ode5C1H.greekmelody	@ltx/en_us_oca/he.h.m6:heHE.ToTheioFengeiSou.greekname
ltx/en_us_oca/me.m04.d14:meMA.Ode5C1H.incipit	@ltx/en_us_oca/he.h.m6:heHE.ToTheioFengeiSou.incipit
ltx/en_us_oca/me.m04.d14:meMA.Ode5C1H.melody	@ltx/en_us_oca/he.h.m6:heHE.ToTheioFengeiSou.melody
ltx/en_us_oca/me.m04.d14:meMA.Ode5C1H.mode	@ltx/en_us_oca/miscellanea:misc.Mode6
ltx/en_us_oca/me.m04.d14:meMA.Ode5C1H.ode	@ltx/en_us_oca/miscellanea:misc.Ode5
ltx/en_us_oca/me.m04.d14:meMA.Ode5C1H.text	@ltx/en_us_oca/he.h.m6:heHE.ToTheioFengeiSou.text
ltx/en_us_oca/me.m04.d14:meMA.Ode5C1T.incipit	…
ltx/en_us_oca/me.m04.d14:meMA.Ode5C1T.melody	@ltx/en_us_oca/he.h.m6:heHE.ToTheioFengeiSou.notmetered
ltx/en_us_oca/me.m04.d14:meMA.Ode5C1T.mode	@ltx/en_us_oca/miscellanea:misc.Mode6
ltx/en_us_oca/me.m04.d14:meMA.Ode5C1T.ode	@ltx/en_us_oca/miscellanea:misc.Ode5
ltx/en_us_oca/me.m04.d14:meMA.Ode5C1T.text	
ltx/en_us_oca/me.m04.d14:meMA.Ode6C11.greekmelody	@ltx/en_us_oca/he.h.m6:heHE.TouViouTinThalassan.greekname
ltx/en_us_oca/me.m04.d14:meMA.Ode6C11.incipit	…
ltx/en_us_oca/me.m04.d14:meMA.Ode6C11.melody	@ltx/en_us_oca/he.h.m6:heHE.TouViouTinThalassan.notmetered
ltx/en_us_oca/me.m04.d14:meMA.Ode6C11.mode	@ltx/en_us_oca/miscellanea:misc.Mode6
ltx/en_us_oca/me.m04.d14:meMA.Ode6C11.ode	@ltx/en_us_oca/miscellanea:misc.Ode6
ltx/en_us_oca/me.m04.d14:meMA.Ode6C11.text	
ltx/en_us_oca/me.m04.d14:meMA.Ode6C12.incipit	…
ltx/en_us_oca/me.m04.d14:meMA.Ode6C12.melody	@ltx/en_us_oca/he.h.m6:heHE.TouViouTinThalassan.notmetered
ltx/en_us_oca/me.m04.d14:meMA.Ode6C12.mode	@ltx/en_us_oca/miscellanea:misc.Mode6
ltx/en_us_oca/me.m04.d14:meMA.Ode6C12.ode	@ltx/en_us_oca/miscellanea:misc.Ode6
ltx/en_us_oca/me.m04.d14:meMA.Ode6C12.text	
ltx/en_us_oca/me.m04.d14:meMA.Ode6C13.incipit	…
ltx/en_us_oca/me.m04.d14:meMA.Ode6C13.melody	@ltx/en_us_oca/he.h.m6:heHE.TouViouTinThalassan.notmetered
ltx/en_us_oca/me.m04.d14:meMA.Ode6C13.mode	@ltx/en_us_oca/miscellanea:misc.Mode6
ltx/en_us_oca/me.m04.d14:meMA.Ode6C13.ode	@ltx/en_us_oca/miscellanea:misc.Ode6
ltx/en_us_oca/me.m04.d14:meMA.Ode6C13.text	
ltx/en_us_oca/me.m04.d14:meMA.Ode6C1H.greekmelody	@ltx/en_us_oca/he.h.m6:heHE.TouViouTinThalassan.greekname
ltx/en_us_oca/me.m04.d14:meMA.Ode6C1H.incipit	@ltx/en_us_oca/he.h.m6:heHE.TouViouTinThalassan.incipit
ltx/en_us_oca/me.m04.d14:meMA.Ode6C1H.melody	@ltx/en_us_oca/he.h.m6:heHE.TouViouTinThalassan.melody
ltx/en_us_oca/me.m04.d14:meMA.Ode6C1H.mode	@ltx/en_us_oca/miscellanea:misc.Mode6
ltx/en_us_oca/me.m04.d14:meMA.Ode6C1H.ode	@ltx/en_us_oca/miscellanea:misc.Ode6
ltx/en_us_oca/me.m04.d14:meMA.Ode6C1H.text	@ltx/en_us_oca/he.h.m6:heHE.TouViouTinThalassan.text
ltx/en_us_oca/me.m04.d14:meMA.Ode6C1T.incipit	…
ltx/en_us_oca/me.m04.d14:meMA.Ode6C1T.melody	@ltx/en_us_oca/he.h.m6:heHE.TouViouTinThalassan.notmetered
ltx/en_us_oca/me.m04.d14:meMA.Ode6C1T.mode	@ltx/en_us_oca/miscellanea:misc.Mode6
ltx/en_us_oca/me.m04.d14:meMA.Ode6C1T.ode	@ltx/en_us_oca/miscellanea:misc.Ode6
ltx/en_us_oca/me.m04.d14:meMA.Ode6C1T.text	
ltx/en_us_oca/me.m04.d14:meMA.Ode7C11.greekmelody	@ltx/en_us_oca/he.h.m6:heHE.DrosovolonMenTinKaminon.greekname
ltx/en_us_oca/me.m04.d14:meMA.Ode7C11.incipit	…
ltx/en_us_oca/me.m04.d14:meMA.Ode7C11.melody	@ltx/en_us_oca/he.h.m6:heHE.DrosovolonMenTinKaminon.notmetered
ltx/en_us_oca/me.m04.d14:meMA.Ode7C11.mode	@ltx/en_us_oca/miscellanea:misc.Mode6
ltx/en_us_oca/me.m04.d14:meMA.Ode7C11.ode	@ltx/en_us_oca/miscellanea:misc.Ode7
ltx/en_us_oca/me.m04.d14:meMA.Ode7C11.text	
ltx/en_us_oca/me.m04.d14:meMA.Ode7C12.incipit	…
ltx/en_us_oca/me.m04.d14:meMA.Ode7C12.melody	@ltx/en_us_oca/he.h.m6:heHE.DrosovolonMenTinKaminon.notmetered
ltx/en_us_oca/me.m04.d14:meMA.Ode7C12.mode	@ltx/en_us_oca/miscellanea:misc.Mode6
ltx/en_us_oca/me.m04.d14:meMA.Ode7C12.ode	@ltx/en_us_oca/miscellanea:misc.Ode7
ltx/en_us_oca/me.m04.d14:meMA.Ode7C12.text	
ltx/en_us_oca/me.m04.d14:meMA.Ode7C13.incipit	…
ltx/en_us_oca/me.m04.d14:meMA.Ode7C13.melody	@ltx/en_us_oca/he.h.m6:heHE.DrosovolonMenTinKaminon.notmetered
ltx/en_us_oca/me.m04.d14:meMA.Ode7C13.mode	@ltx/en_us_oca/miscellanea:misc.Mode6
ltx/en_us_oca/me.m04.d14:meMA.Ode7C13.ode	@ltx/en_us_oca/miscellanea:misc.Ode7
ltx/en_us_oca/me.m04.d14:meMA.Ode7C13.text	
ltx/en_us_oca/me.m04.d14:meMA.Ode7C1H.greekmelody	@ltx/en_us_oca/he.h.m6:heHE.DrosovolonMenTinKaminon.greekname
ltx/en_us_oca/me.m04.d14:meMA.Ode7C1H.incipit	@ltx/en_us_oca/he.h.m6:heHE.DrosovolonMenTinKaminon.incipit
ltx/en_us_oca/me.m04.d14:meMA.Ode7C1H.melody	@ltx/en_us_oca/he.h.m6:heHE.DrosovolonMenTinKaminon.melody
ltx/en_us_oca/me.m04.d14:meMA.Ode7C1H.mode	@ltx/en_us_oca/miscellanea:misc.Mode6
ltx/en_us_oca/me.m04.d14:meMA.Ode7C1H.ode	@ltx/en_us_oca/miscellanea:misc.Ode7
ltx/en_us_oca/me.m04.d14:meMA.Ode7C1H.text	@ltx/en_us_oca/he.h.m6:heHE.DrosovolonMenTinKaminon.text
ltx/en_us_oca/me.m04.d14:meMA.Ode7C1T.incipit	…
ltx/en_us_oca/me.m04.d14:meMA.Ode7C1T.melody	@ltx/en_us_oca/he.h.m6:heHE.DrosovolonMenTinKaminon.notmetered
ltx/en_us_oca/me.m04.d14:meMA.Ode7C1T.mode	@ltx/en_us_oca/miscellanea:misc.Mode6
ltx/en_us_oca/me.m04.d14:meMA.Ode7C1T.ode	@ltx/en_us_oca/miscellanea:misc.Ode7
ltx/en_us_oca/me.m04.d14:meMA.Ode7C1T.text	
ltx/en_us_oca/me.m04.d14:meMA.Ode8C11.greekmelody	@ltx/en_us_oca/he.h.m6:heHE.EkFlogosToisOsiois.greekname
ltx/en_us_oca/me.m04.d14:meMA.Ode8C11.incipit	…
ltx/en_us_oca/me.m04.d14:meMA.Ode8C11.melody	@ltx/en_us_oca/he.h.m6:heHE.EkFlogosToisOsiois.notmetered
ltx/en_us_oca/me.m04.d14:meMA.Ode8C11.mode	@ltx/en_us_oca/miscellanea:misc.Mode6
ltx/en_us_oca/me.m04.d14:meMA.Ode8C11.ode	@ltx/en_us_oca/miscellanea:misc.Ode8
ltx/en_us_oca/me.m04.d14:meMA.Ode8C11.text	
ltx/en_us_oca/me.m04.d14:meMA.Ode8C12.incipit	…
ltx/en_us_oca/me.m04.d14:meMA.Ode8C12.melody	@ltx/en_us_oca/he.h.m6:heHE.EkFlogosToisOsiois.notmetered
ltx/en_us_oca/me.m04.d14:meMA.Ode8C12.mode	@ltx/en_us_oca/miscellanea:misc.Mode6
ltx/en_us_oca/me.m04.d14:meMA.Ode8C12.ode	@ltx/en_us_oca/miscellanea:misc.Ode8
ltx/en_us_oca/me.m04.d14:meMA.Ode8C12.text	
ltx/en_us_oca/me.m04.d14:meMA.Ode8C13.incipit	…
ltx/en_us_oca/me.m04.d14:meMA.Ode8C13.melody	@ltx/en_us_oca/he.h.m6:heHE.EkFlogosToisOsiois.notmetered
ltx/en_us_oca/me.m04.d14:meMA.Ode8C13.mode	@ltx/en_us_oca/miscellanea:misc.Mode6
ltx/en_us_oca/me.m04.d14:meMA.Ode8C13.ode	@ltx/en_us_oca/miscellanea:misc.Ode8
ltx/en_us_oca/me.m04.d14:meMA.Ode8C13.text	
ltx/en_us_oca/me.m04.d14:meMA.Ode8C1H.greekmelody	@ltx/en_us_oca/he.h.m6:heHE.EkFlogosToisOsiois.greekname
ltx/en_us_oca/me.m04.d14:meMA.Ode8C1H.incipit	@ltx/en_us_oca/he.h.m6:heHE.EkFlogosToisOsiois.incipit
ltx/en_us_oca/me.m04.d14:meMA.Ode8C1H.melody	@ltx/en_us_oca/he.h.m6:heHE.EkFlogosToisOsiois.melody
ltx/en_us_oca/me.m04.d14:meMA.Ode8C1H.mode	@ltx/en_us_oca/miscellanea:misc.Mode6
ltx/en_us_oca/me.m04.d14:meMA.Ode8C1H.ode	@ltx/en_us_oca/miscellanea:misc.Ode8
ltx/en_us_oca/me.m04.d14:meMA.Ode8C1H.text	@ltx/en_us_oca/he.h.m6:heHE.EkFlogosToisOsiois.text
ltx/en_us_oca/me.m04.d14:meMA.Ode8C1T.incipit	…
ltx/en_us_oca/me.m04.d14:meMA.Ode8C1T.melody	@ltx/en_us_oca/he.h.m6:heHE.EkFlogosToisOsiois.notmetered
ltx/en_us_oca/me.m04.d14:meMA.Ode8C1T.mode	@ltx/en_us_oca/miscellanea:misc.Mode6
ltx/en_us_oca/me.m04.d14:meMA.Ode8C1T.ode	@ltx/en_us_oca/miscellanea:misc.Ode8
ltx/en_us_oca/me.m04.d14:meMA.Ode8C1T.text	
ltx/en_us_oca/me.m04.d14:meMA.Ode9C11.greekmelody	@ltx/en_us_oca/he.h.m6:heHE.TheonAnthropois.greekname
ltx/en_us_oca/me.m04.d14:meMA.Ode9C11.incipit	…
ltx/en_us_oca/me.m04.d14:meMA.Ode9C11.melody	@ltx/en_us_oca/he.h.m6:heHE.TheonAnthropois.notmetered
ltx/en_us_oca/me.m04.d14:meMA.Ode9C11.mode	@ltx/en_us_oca/miscellanea:misc.Mode6
ltx/en_us_oca/me.m04.d14:meMA.Ode9C11.ode	@ltx/en_us_oca/miscellanea:misc.Ode9
ltx/en_us_oca/me.m04.d14:meMA.Ode9C11.text	
ltx/en_us_oca/me.m04.d14:meMA.Ode9C12.incipit	…
ltx/en_us_oca/me.m04.d14:meMA.Ode9C12.melody	@ltx/en_us_oca/he.h.m6:heHE.TheonAnthropois.notmetered
ltx/en_us_oca/me.m04.d14:meMA.Ode9C12.mode	@ltx/en_us_oca/miscellanea:misc.Mode6
ltx/en_us_oca/me.m04.d14:meMA.Ode9C12.ode	@ltx/en_us_oca/miscellanea:misc.Ode9
ltx/en_us_oca/me.m04.d14:meMA.Ode9C12.text	
ltx/en_us_oca/me.m04.d14:meMA.Ode9C13.incipit	…
ltx/en_us_oca/me.m04.d14:meMA.Ode9C13.melody	@ltx/en_us_oca/he.h.m6:heHE.TheonAnthropois.notmetered
ltx/en_us_oca/me.m04.d14:meMA.Ode9C13.mode	@ltx/en_us_oca/miscellanea:misc.Mode6
ltx/en_us_oca/me.m04.d14:meMA.Ode9C13.ode	@ltx/en_us_oca/miscellanea:misc.Ode9
ltx/en_us_oca/me.m04.d14:meMA.Ode9C13.text	
ltx/en_us_oca/me.m04.d14:meMA.Ode9C14.incipit	…
ltx/en_us_oca/me.m04.d14:meMA.Ode9C14.melody	@ltx/en_us_oca/he.h.m6:heHE.TheonAnthropois.notmetered
ltx/en_us_oca/me.m04.d14:meMA.Ode9C14.mode	@ltx/en_us_oca/miscellanea:misc.Mode6
ltx/en_us_oca/me.m04.d14:meMA.Ode9C14.ode	@ltx/en_us_oca/miscellanea:misc.Ode9
ltx/en_us_oca/me.m04.d14:meMA.Ode9C14.text	
ltx/en_us_oca/me.m04.d14:meMA.Ode9C1H.greekmelody	@ltx/en_us_oca/he.h.m6:heHE.TheonAnthropois.greekname
ltx/en_us_oca/me.m04.d14:meMA.Ode9C1H.incipit	@ltx/en_us_oca/he.h.m6:heHE.TheonAnthropois.incipit
ltx/en_us_oca/me.m04.d14:meMA.Ode9C1H.melody	@ltx/en_us_oca/he.h.m6:heHE.TheonAnthropois.melody
ltx/en_us_oca/me.m04.d14:meMA.Ode9C1H.mode	@ltx/en_us_oca/miscellanea:misc.Mode6
ltx/en_us_oca/me.m04.d14:meMA.Ode9C1H.ode	@ltx/en_us_oca/miscellanea:misc.Ode9
ltx/en_us_oca/me.m04.d14:meMA.Ode9C1H.text	@ltx/en_us_oca/he.h.m6:heHE.TheonAnthropois.text
ltx/en_us_oca/me.m04.d14:meMA.Ode9C1T.incipit	…
ltx/en_us_oca/me.m04.d14:meMA.Ode9C1T.melody	@ltx/en_us_oca/he.h.m6:heHE.TheonAnthropois.notmetered
ltx/en_us_oca/me.m04.d14:meMA.Ode9C1T.mode	@ltx/en_us_oca/miscellanea:misc.Mode6
ltx/en_us_oca/me.m04.d14:meMA.Ode9C1T.ode	@ltx/en_us_oca/miscellanea:misc.Ode9
ltx/en_us_oca/me.m04.d14:meMA.Ode9C1T.text	
ltx/en_us_oca/me.m04.d14:meVE.Apolytikion1ger.greekmelody	@ltx/en_us_oca/he.a.m4:heAU.TachyProkatalave.greekname
ltx/en_us_oca/me.m04.d14:meVE.Apolytikion1ger.incipit	…
ltx/en_us_oca/me.m04.d14:meVE.Apolytikion1ger.melody	@ltx/en_us_oca/he.a.m4:heAU.TachyProkatalave.notmetered
ltx/en_us_oca/me.m04.d14:meVE.Apolytikion1ger.mode	@ltx/en_us_oca/miscellanea:misc.Mode4
ltx/en_us_oca/me.m04.d14:meVE.Apolytikion1ger.poet	@ltx/en_us_oca/poets:po.Gerasimou
ltx/en_us_oca/me.m04.d14:meVE.Apolytikion1ger.text	
ltx/en_us_oca/me.m04.d14:meVE.SticStavrotheotokion.greekmelody	@ltx/en_us_oca/he.a.m1:heAU.PaneffimoiMartyres.greekname
ltx/en_us_oca/me.m04.d14:meVE.SticStavrotheotokion.incipit	@ltx/en_us_oca/oc.m1.d4:ocVE.AposTheotokion.incipit
ltx/en_us_oca/me.m04.d14:meVE.SticStavrotheotokion.melody	@ltx/en_us_oca/he.a.m1:heAU.PaneffimoiMartyres.notmetered
ltx/en_us_oca/me.m04.d14:meVE.SticStavrotheotokion.mode	@ltx/en_us_oca/miscellanea:misc.Mode1
ltx/en_us_oca/me.m04.d14:meVE.SticStavrotheotokion.text	@ltx/en_us_oca/oc.m1.d4:ocVE.AposTheotokion.text
ltx/en_us_oca/me.m04.d14:meVE.SticTheotokion.greekmelody	@ltx/en_us_oca/he.a.m1:heAU.PaneffimoiMartyres.greekname
ltx/en_us_oca/me.m04.d14:meVE.SticTheotokion.incipit	…
ltx/en_us_oca/me.m04.d14:meVE.SticTheotokion.melody	@ltx/en_us_oca/he.a.m1:heAU.PaneffimoiMartyres.notmetered
ltx/en_us_oca/me.m04.d14:meVE.SticTheotokion.mode	@ltx/en_us_oca/miscellanea:misc.Mode1
ltx/en_us_oca/me.m04.d14:meVE.SticTheotokion.text	
ltx/en_us_oca/me.m04.d14:meVE.Stichera01.greekmelody	@ltx/en_us_oca/he.a.m1:heAU.PaneffimoiMartyres.greekname
ltx/en_us_oca/me.m04.d14:meVE.Stichera01.incipit	You preached with divine understanding…
ltx/en_us_oca/me.m04.d14:meVE.Stichera01.melody	@ltx/en_us_oca/he.a.m1:heAU.PaneffimoiMartyres.notmetered
ltx/en_us_oca/me.m04.d14:meVE.Stichera01.mode	@ltx/en_us_oca/miscellanea:misc.Mode1
ltx/en_us_oca/me.m04.d14:meVE.Stichera01.text	You preached with divine understanding ⁄ and wholly delivered the people from ignorance. ⁄ Wise apostles, you led them, saved, to the Word, ⁄ Who shone forth from the unbegotten Father. ⁄⁄ Entreat Him that He may grant our souls peace and great mercy!
ltx/en_us_oca/me.m04.d14:meVE.Stichera02.incipit	Let us openly praise the…
ltx/en_us_oca/me.m04.d14:meVE.Stichera02.melody	@ltx/en_us_oca/he.a.m1:heAU.PaneffimoiMartyres.notmetered
ltx/en_us_oca/me.m04.d14:meVE.Stichera02.mode	@ltx/en_us_oca/miscellanea:misc.Mode1
ltx/en_us_oca/me.m04.d14:meVE.Stichera02.text	Let us openly praise the true preachers of Christ: ⁄ Pudens, Aristarchus and the divine Trophimus, ⁄ for with the warmth of divine grace ⁄ they brought the winter of falsehood to an end. ⁄ Now they have made their abode in the never fading Light, ⁄ receiving the reward of the labors; ⁄⁄ deified through ineffable communion!
ltx/en_us_oca/me.m04.d14:meVE.Stichera03.incipit	You followed Paul, the glorious…
ltx/en_us_oca/me.m04.d14:meVE.Stichera03.melody	@ltx/en_us_oca/he.a.m1:heAU.PaneffimoiMartyres.notmetered
ltx/en_us_oca/me.m04.d14:meVE.Stichera03.mode	@ltx/en_us_oca/miscellanea:misc.Mode1
ltx/en_us_oca/me.m04.d14:meVE.Stichera03.text	You followed Paul, the glorious disciple ⁄ and endured many tribulations, glorious ones. ⁄ You were imprisoned with chains and subjected to torture. ⁄ Finally you were beheaded by the sword. ⁄⁄ Entreat Christ that He may grant our souls peace and great mercy!
