ltx/en_us_oca/me.m08.d06:meDA.commemoration.first	
ltx/en_us_oca/me.m08.d06:meDA.commemoration.first_name	
ltx/en_us_oca/me.m08.d06:meDA.commemoration.first_short	
ltx/en_us_oca/me.m08.d06:meDA.commemoration.first_title	
ltx/en_us_oca/me.m08.d06:meDA.commemoration.full	
ltx/en_us_oca/me.m08.d06:meDA.commemoration.second_name	
ltx/en_us_oca/me.m08.d06:meDA.commemoration.second_title	
ltx/en_us_oca/me.m08.d06:meDA.date	
ltx/en_us_oca/me.m08.d06:meDA.dismissal	@ltx/en_us_oca/dismissals:dis00.transfiguration
ltx/en_us_oca/me.m08.d06:meDA.fordate	
ltx/en_us_oca/me.m08.d06:meDA.insert1	
ltx/en_us_oca/me.m08.d06:meDA.insert2	
ltx/en_us_oca/me.m08.d06:meDA.note	
ltx/en_us_oca/me.m08.d06:meDA.pdfcoverdate	
ltx/en_us_oca/me.m08.d06:meDA.pdfheaderdate	
ltx/en_us_oca/me.m08.d06:meHO.commemorations	
ltx/en_us_oca/me.m08.d06:meHO.note1	
ltx/en_us_oca/me.m08.d06:meHO.note2	
ltx/en_us_oca/me.m08.d06:meHO.number	
ltx/en_us_oca/me.m08.d06:meHO.rank	
ltx/en_us_oca/me.m08.d06:meLE.commemoration1	
ltx/en_us_oca/me.m08.d06:meLE.commemoration2	
ltx/en_us_oca/me.m08.d06:meLI.Kontakion1.incipit	@ltx/en_us_oca/me.m08.d06:meMA.Kontakion1.incipit
ltx/en_us_oca/me.m08.d06:meLI.Kontakion1.melody	@ltx/en_us_oca/me.m08.d06:meMA.Kontakion1.melody
ltx/en_us_oca/me.m08.d06:meLI.Kontakion1.mode	@ltx/en_us_oca/me.m08.d06:meMA.Kontakion1.mode
ltx/en_us_oca/me.m08.d06:meLI.Kontakion1.text	@ltx/en_us_oca/me.m08.d06:meMA.Kontakion1.text
ltx/en_us_oca/me.m08.d06:meLI.MM.Antiphon2.text	@ltx/en_us_oca/properties:media.key
ltx/en_us_oca/me.m08.d06:meLI.MM.CommunionHymn.text	@ltx/en_us_oca/properties:media.key
ltx/en_us_oca/me.m08.d06:meLI.MM.EntranceHymn.text	@ltx/en_us_oca/properties:media.key
ltx/en_us_oca/me.m08.d06:meLI.MM.EntranceHymnSunday.text	@ltx/en_us_oca/properties:media.key
ltx/en_us_oca/me.m08.d06:meLI.Megalynarion.text	
ltx/en_us_oca/me.m08.d06:meLI.TheotokosHymn.incipit	@ltx/en_us_oca/me.m08.d06:meMA.Ode7C23.incipit
ltx/en_us_oca/me.m08.d06:meLI.TheotokosHymn.mode	@ltx/en_us_oca/miscellanea:misc.Mode8
ltx/en_us_oca/me.m08.d06:meLI.TheotokosHymn.text	@ltx/en_us_oca/me.m08.d06:meMA.Ode7C23.text
ltx/en_us_oca/me.m08.d06:meMA.C1.acrostic.notice1	
ltx/en_us_oca/me.m08.d06:meMA.C1.acrostic.text	
ltx/en_us_oca/me.m08.d06:meMA.C1.acrostic.title	First Canon.
ltx/en_us_oca/me.m08.d06:meMA.C1.poet	@ltx/en_us_oca/poets:po.KosmaMonachou
ltx/en_us_oca/me.m08.d06:meMA.C1.title	@ltx/en_us_oca/titles:ti.Canon1Feast
ltx/en_us_oca/me.m08.d06:meMA.C1.verse	@ltx/en_us_oca/prayers:pr.verse_God.text
ltx/en_us_oca/me.m08.d06:meMA.C2.acrostic.notice1	
ltx/en_us_oca/me.m08.d06:meMA.C2.acrostic.text	
ltx/en_us_oca/me.m08.d06:meMA.C2.acrostic.title	Second Canon.
ltx/en_us_oca/me.m08.d06:meMA.C2.poet	@ltx/en_us_oca/poets:po.IoannouTouDamaskinou
ltx/en_us_oca/me.m08.d06:meMA.C2.title	@ltx/en_us_oca/titles:ti.Canon2Feast
ltx/en_us_oca/me.m08.d06:meMA.C2.verse	@ltx/en_us_oca/prayers:pr.verse_God.text
ltx/en_us_oca/me.m08.d06:meMA.Exaposteilarion1.greekmelody	@ltx/en_us_oca/he.a.m3:heAU.FosAnalloioton.greekname
ltx/en_us_oca/me.m08.d06:meMA.Exaposteilarion1.incipit	@ltx/en_us_oca/he.a.m3:heAU.FosAnalloioton.incipit
ltx/en_us_oca/me.m08.d06:meMA.Exaposteilarion1.melody	@ltx/en_us_oca/he.a.m3:heAU.FosAnalloioton.melody
ltx/en_us_oca/me.m08.d06:meMA.Exaposteilarion1.mode	@ltx/en_us_oca/miscellanea:misc.Mode3
ltx/en_us_oca/me.m08.d06:meMA.Exaposteilarion1.text	@ltx/en_us_oca/he.a.m3:heAU.FosAnalloioton.text
ltx/en_us_oca/me.m08.d06:meMA.Kathisma11.greekmelody	@ltx/en_us_oca/he.a.m4:heAU.KateplagiIosif.greekname
ltx/en_us_oca/me.m08.d06:meMA.Kathisma11.incipit	…
ltx/en_us_oca/me.m08.d06:meMA.Kathisma11.melody	@ltx/en_us_oca/he.a.m4:heAU.KateplagiIosif.notmetered
ltx/en_us_oca/me.m08.d06:meMA.Kathisma11.mode	@ltx/en_us_oca/miscellanea:misc.Mode4
ltx/en_us_oca/me.m08.d06:meMA.Kathisma11.text	
ltx/en_us_oca/me.m08.d06:meMA.Kathisma21.greekmelody	@ltx/en_us_oca/he.a.m4:heAU.KateplagiIosif.greekname
ltx/en_us_oca/me.m08.d06:meMA.Kathisma21.incipit	…
ltx/en_us_oca/me.m08.d06:meMA.Kathisma21.melody	@ltx/en_us_oca/he.a.m4:heAU.KateplagiIosif.notmetered
ltx/en_us_oca/me.m08.d06:meMA.Kathisma21.mode	@ltx/en_us_oca/miscellanea:misc.Mode4
ltx/en_us_oca/me.m08.d06:meMA.Kathisma21.text	
ltx/en_us_oca/me.m08.d06:meMA.Kathisma31.greekmelody	@ltx/en_us_oca/he.a.m4:heAU.OYpsotheisEnToStavro.greekname
ltx/en_us_oca/me.m08.d06:meMA.Kathisma31.incipit	…
ltx/en_us_oca/me.m08.d06:meMA.Kathisma31.melody	@ltx/en_us_oca/he.a.m4:heAU.OYpsotheisEnToStavro.notmetered
ltx/en_us_oca/me.m08.d06:meMA.Kathisma31.mode	@ltx/en_us_oca/miscellanea:misc.Mode4
ltx/en_us_oca/me.m08.d06:meMA.Kathisma31.text	
ltx/en_us_oca/me.m08.d06:meMA.Kontakion1.incipit	On the mountain were You…
ltx/en_us_oca/me.m08.d06:meMA.Kontakion1.melody	@ltx/en_us_oca/miscellanea:misc.NotMetered
ltx/en_us_oca/me.m08.d06:meMA.Kontakion1.mode	@ltx/en_us_oca/miscellanea:misc.Mode7
ltx/en_us_oca/me.m08.d06:meMA.Kontakion1.text	On the mountain were You transfigured, O Christ God, and Your disciples beheld Your glory as far as they could see it; so that when they would behold You crucified, they would understand that Your suffering was voluntary, and would proclaim to the world, ⁄⁄ that You are truly the radiance of the Father!
ltx/en_us_oca/me.m08.d06:meMA.Lauds1.greekmelody	@ltx/en_us_oca/he.a.m4:heAU.OExYpsistouKlitheis.greekname
ltx/en_us_oca/me.m08.d06:meMA.Lauds1.incipit	…
ltx/en_us_oca/me.m08.d06:meMA.Lauds1.melody	@ltx/en_us_oca/he.a.m4:heAU.OExYpsistouKlitheis.notmetered
ltx/en_us_oca/me.m08.d06:meMA.Lauds1.mode	@ltx/en_us_oca/miscellanea:misc.Mode4
ltx/en_us_oca/me.m08.d06:meMA.Lauds1.text	
ltx/en_us_oca/me.m08.d06:meMA.Lauds2.incipit	…
ltx/en_us_oca/me.m08.d06:meMA.Lauds2.melody	@ltx/en_us_oca/he.a.m4:heAU.OExYpsistouKlitheis.notmetered
ltx/en_us_oca/me.m08.d06:meMA.Lauds2.mode	@ltx/en_us_oca/miscellanea:misc.Mode4
ltx/en_us_oca/me.m08.d06:meMA.Lauds2.text	
ltx/en_us_oca/me.m08.d06:meMA.Lauds3.incipit	…
ltx/en_us_oca/me.m08.d06:meMA.Lauds3.melody	@ltx/en_us_oca/he.a.m4:heAU.OExYpsistouKlitheis.notmetered
ltx/en_us_oca/me.m08.d06:meMA.Lauds3.mode	@ltx/en_us_oca/miscellanea:misc.Mode4
ltx/en_us_oca/me.m08.d06:meMA.Lauds3.text	
ltx/en_us_oca/me.m08.d06:meMA.LaudsGlory.incipit	…
ltx/en_us_oca/me.m08.d06:meMA.LaudsGlory.melody	
ltx/en_us_oca/me.m08.d06:meMA.LaudsGlory.mode	@ltx/en_us_oca/miscellanea:misc.Mode8
ltx/en_us_oca/me.m08.d06:meMA.LaudsGlory.poet	@ltx/en_us_oca/poets:po.Vyzantos
ltx/en_us_oca/me.m08.d06:meMA.LaudsGlory.text	
ltx/en_us_oca/me.m08.d06:meMA.MM.Lauds1123as5678.text	@ltx/en_us_oca/properties:media.key
ltx/en_us_oca/me.m08.d06:meMA.Ode1C11.greekmelody	@ltx/en_us_oca/he.h.m4:heHE.ChoroiIsrail.greekname
ltx/en_us_oca/me.m08.d06:meMA.Ode1C11.incipit	Christ spoke to His friends…
ltx/en_us_oca/me.m08.d06:meMA.Ode1C11.melody	@ltx/en_us_oca/he.h.m4:heHE.ChoroiIsrail.notmetered
ltx/en_us_oca/me.m08.d06:meMA.Ode1C11.mode	@ltx/en_us_oca/miscellanea:misc.Mode4
ltx/en_us_oca/me.m08.d06:meMA.Ode1C11.ode	@ltx/en_us_oca/miscellanea:misc.Ode1
ltx/en_us_oca/me.m08.d06:meMA.Ode1C11.text	Christ spoke to His friends of the Kingdom of God, and said to them, bringing words of life: When I shall shine forth with unapproachable light, you will know that the Father is in me, and cry out with joy: Let us sing to our God, for He has been glorified!
ltx/en_us_oca/me.m08.d06:meMA.Ode1C12.incipit	You shall feast on the…
ltx/en_us_oca/me.m08.d06:meMA.Ode1C12.melody	@ltx/en_us_oca/he.h.m4:heHE.ChoroiIsrail.notmetered
ltx/en_us_oca/me.m08.d06:meMA.Ode1C12.mode	@ltx/en_us_oca/miscellanea:misc.Mode4
ltx/en_us_oca/me.m08.d06:meMA.Ode1C12.ode	@ltx/en_us_oca/miscellanea:misc.Ode1
ltx/en_us_oca/me.m08.d06:meMA.Ode1C12.text	You shall feast on the rich gifts of the gentiles; their wealth shall be your boast, my disciples and friends: for when I shall appear shining more brightly than the sun, you will be filled with glory and cry out for joy: Let us sing to our God, for He has been glorified!
ltx/en_us_oca/me.m08.d06:meMA.Ode1C13.incipit	Today as He shines on…
ltx/en_us_oca/me.m08.d06:meMA.Ode1C13.melody	@ltx/en_us_oca/he.h.m4:heHE.ChoroiIsrail.notmetered
ltx/en_us_oca/me.m08.d06:meMA.Ode1C13.mode	@ltx/en_us_oca/miscellanea:misc.Mode4
ltx/en_us_oca/me.m08.d06:meMA.Ode1C13.ode	@ltx/en_us_oca/miscellanea:misc.Ode1
ltx/en_us_oca/me.m08.d06:meMA.Ode1C13.text	Today as He shines on Mount Tabor, Christ reveals to His disciples as He promised the image and dim reflection of divine brightness, and filled with divine and light-bearing splendor, they cry out for joy: Let us sing to our God, for He has been glorified!
ltx/en_us_oca/me.m08.d06:meMA.Ode1C1H.greekmelody	@ltx/en_us_oca/he.h.m4:heHE.ChoroiIsrail.greekname
ltx/en_us_oca/me.m08.d06:meMA.Ode1C1H.incipit	@ltx/en_us_oca/he.h.m4:heHE.ChoroiIsrail.incipit
ltx/en_us_oca/me.m08.d06:meMA.Ode1C1H.melody	@ltx/en_us_oca/he.h.m4:heHE.ChoroiIsrail.melody
ltx/en_us_oca/me.m08.d06:meMA.Ode1C1H.mode	@ltx/en_us_oca/miscellanea:misc.Mode4
ltx/en_us_oca/me.m08.d06:meMA.Ode1C1H.ode	@ltx/en_us_oca/miscellanea:misc.Ode1
ltx/en_us_oca/me.m08.d06:meMA.Ode1C1H.text	@ltx/en_us_oca/he.h.m4:heHE.ChoroiIsrail.text
ltx/en_us_oca/me.m08.d06:meMA.Ode1C21.greekmelody	@ltx/en_us_oca/he.h.m8:heHE.YgranDiodefsas.greekname
ltx/en_us_oca/me.m08.d06:meMA.Ode1C21.incipit	Moses foresaw the glory…
ltx/en_us_oca/me.m08.d06:meMA.Ode1C21.melody	@ltx/en_us_oca/he.h.m8:heHE.YgranDiodefsas.notmetered
ltx/en_us_oca/me.m08.d06:meMA.Ode1C21.mode	@ltx/en_us_oca/miscellanea:misc.Mode8
ltx/en_us_oca/me.m08.d06:meMA.Ode1C21.ode	@ltx/en_us_oca/miscellanea:misc.Ode1
ltx/en_us_oca/me.m08.d06:meMA.Ode1C21.text	Moses foresaw the glory of the Lord in days of old in the cloud and pillar of fire by the Red Sea, and he shouted aloud: Let us sing to our Deliverer and our God!
ltx/en_us_oca/me.m08.d06:meMA.Ode1C22.incipit	Protected by a divine body…
ltx/en_us_oca/me.m08.d06:meMA.Ode1C22.melody	@ltx/en_us_oca/he.h.m8:heHE.YgranDiodefsas.notmetered
ltx/en_us_oca/me.m08.d06:meMA.Ode1C22.mode	@ltx/en_us_oca/miscellanea:misc.Mode8
ltx/en_us_oca/me.m08.d06:meMA.Ode1C22.ode	@ltx/en_us_oca/miscellanea:misc.Ode1
ltx/en_us_oca/me.m08.d06:meMA.Ode1C22.text	Protected by a divine body as by the rock, and beholding the invisible One, the God-seer Moses shouted aloud: Let us sing to our Deliverer and our God!
ltx/en_us_oca/me.m08.d06:meMA.Ode1C23.incipit	In days of old in…
ltx/en_us_oca/me.m08.d06:meMA.Ode1C23.melody	@ltx/en_us_oca/he.h.m8:heHE.YgranDiodefsas.notmetered
ltx/en_us_oca/me.m08.d06:meMA.Ode1C23.mode	@ltx/en_us_oca/miscellanea:misc.Mode8
ltx/en_us_oca/me.m08.d06:meMA.Ode1C23.ode	@ltx/en_us_oca/miscellanea:misc.Ode1
ltx/en_us_oca/me.m08.d06:meMA.Ode1C23.text	In days of old in darkness, You appeared to Moses both on the Mountain of the Law and on Tabor but now You appear in the unapproachable light of Divinity!
ltx/en_us_oca/me.m08.d06:meMA.Ode3C11.greekmelody	@ltx/en_us_oca/he.h.m4:heHE.ToxonDynatonIsthenise.greekname
ltx/en_us_oca/me.m08.d06:meMA.Ode3C11.incipit	You put on the whole…
ltx/en_us_oca/me.m08.d06:meMA.Ode3C11.melody	@ltx/en_us_oca/he.h.m4:heHE.ToxonDynatonIsthenise.notmetered
ltx/en_us_oca/me.m08.d06:meMA.Ode3C11.mode	@ltx/en_us_oca/miscellanea:misc.Mode4
ltx/en_us_oca/me.m08.d06:meMA.Ode3C11.ode	@ltx/en_us_oca/miscellanea:misc.Ode3
ltx/en_us_oca/me.m08.d06:meMA.Ode3C11.text	You put on the whole Adam, O Christ, and changing the nature that was darkened in days of old You filled it with glory and make it divine by the change that came to pass in Your form.
ltx/en_us_oca/me.m08.d06:meMA.Ode3C12.incipit	In days of old Christ…
ltx/en_us_oca/me.m08.d06:meMA.Ode3C12.melody	@ltx/en_us_oca/he.h.m4:heHE.ToxonDynatonIsthenise.notmetered
ltx/en_us_oca/me.m08.d06:meMA.Ode3C12.mode	@ltx/en_us_oca/miscellanea:misc.Mode4
ltx/en_us_oca/me.m08.d06:meMA.Ode3C12.ode	@ltx/en_us_oca/miscellanea:misc.Ode3
ltx/en_us_oca/me.m08.d06:meMA.Ode3C12.text	In days of old Christ led Israel in the wilderness with the pillar of fire and with the cloud: Today He shines forth ineffably In light upon Mount Tabor.
ltx/en_us_oca/me.m08.d06:meMA.Ode3C1H.greekmelody	@ltx/en_us_oca/he.h.m4:heHE.ToxonDynatonIsthenise.greekname
ltx/en_us_oca/me.m08.d06:meMA.Ode3C1H.incipit	@ltx/en_us_oca/he.h.m4:heHE.ToxonDynatonIsthenise.incipit
ltx/en_us_oca/me.m08.d06:meMA.Ode3C1H.melody	@ltx/en_us_oca/he.h.m4:heHE.ToxonDynatonIsthenise.melody
ltx/en_us_oca/me.m08.d06:meMA.Ode3C1H.mode	@ltx/en_us_oca/miscellanea:misc.Mode4
ltx/en_us_oca/me.m08.d06:meMA.Ode3C1H.ode	@ltx/en_us_oca/miscellanea:misc.Ode3
ltx/en_us_oca/me.m08.d06:meMA.Ode3C1H.text	@ltx/en_us_oca/he.h.m4:heHE.ToxonDynatonIsthenise.text
ltx/en_us_oca/me.m08.d06:meMA.Ode3C21.greekmelody	@ltx/en_us_oca/he.h.m8:heHE.OuraniasApsidos.greekname
ltx/en_us_oca/me.m08.d06:meMA.Ode3C21.incipit	The Glory that once overshadowed…
ltx/en_us_oca/me.m08.d06:meMA.Ode3C21.melody	@ltx/en_us_oca/he.h.m8:heHE.OuraniasApsidos.notmetered
ltx/en_us_oca/me.m08.d06:meMA.Ode3C21.mode	@ltx/en_us_oca/miscellanea:misc.Mode8
ltx/en_us_oca/me.m08.d06:meMA.Ode3C21.ode	@ltx/en_us_oca/miscellanea:misc.Ode3
ltx/en_us_oca/me.m08.d06:meMA.Ode3C21.text	The Glory that once overshadowed the Tent of Meeting, and spoke with Your servant Moses, Master, was a figure of Your Transfiguration that shone forth ineffably as lightning on Mount Tabor.
ltx/en_us_oca/me.m08.d06:meMA.Ode3C22.incipit	The leaders of the apostles…
ltx/en_us_oca/me.m08.d06:meMA.Ode3C22.melody	@ltx/en_us_oca/he.h.m8:heHE.OuraniasApsidos.notmetered
ltx/en_us_oca/me.m08.d06:meMA.Ode3C22.mode	@ltx/en_us_oca/miscellanea:misc.Mode8
ltx/en_us_oca/me.m08.d06:meMA.Ode3C22.ode	@ltx/en_us_oca/miscellanea:misc.Ode3
ltx/en_us_oca/me.m08.d06:meMA.Ode3C22.text	The leaders of the apostles went up with You into Mount Tabor, only-begotten Word most High, and Moses and Elijah were both present with You as attendants of God only Lover of mankind.
ltx/en_us_oca/me.m08.d06:meMA.Ode3C23.incipit	Being perfect God, You became…
ltx/en_us_oca/me.m08.d06:meMA.Ode3C23.melody	@ltx/en_us_oca/he.h.m8:heHE.OuraniasApsidos.notmetered
ltx/en_us_oca/me.m08.d06:meMA.Ode3C23.mode	@ltx/en_us_oca/miscellanea:misc.Mode8
ltx/en_us_oca/me.m08.d06:meMA.Ode3C23.ode	@ltx/en_us_oca/miscellanea:misc.Ode3
ltx/en_us_oca/me.m08.d06:meMA.Ode3C23.text	Being perfect God, You became perfect man, bringing together in Your Person humanity and perfect divinity which Moses and Elijah saw on Mount Tabor in two natures.
ltx/en_us_oca/me.m08.d06:meMA.Ode3Kathisma1.greekmelody	@ltx/en_us_oca/he.a.m4:heAU.KateplagiIosif.greekname
ltx/en_us_oca/me.m08.d06:meMA.Ode3Kathisma1.incipit	You were transfigured on Mount Tabor…
ltx/en_us_oca/me.m08.d06:meMA.Ode3Kathisma1.melody	@ltx/en_us_oca/he.a.m4:heAU.KateplagiIosif.notmetered
ltx/en_us_oca/me.m08.d06:meMA.Ode3Kathisma1.mode	@ltx/en_us_oca/miscellanea:misc.Mode4
ltx/en_us_oca/me.m08.d06:meMA.Ode3Kathisma1.text	You were transfigured on Mount Tabor, Christ God, between Moses and Elijah the wise, in the presence of James, Peter and John; and Peter as he stood there, spoke to You: It would be good to make three tabernacles here: One for Moses, one for Elijah, and one for You, Christ our Master. You have shone on them with Your light, now enlighten our souls!
ltx/en_us_oca/me.m08.d06:meMA.Ode4C11.greekmelody	@ltx/en_us_oca/he.h.m4:heHE.EisakikoaTinEndoxon.greekname
ltx/en_us_oca/me.m08.d06:meMA.Ode4C11.incipit	You gave the written Law…
ltx/en_us_oca/me.m08.d06:meMA.Ode4C11.melody	@ltx/en_us_oca/he.h.m4:heHE.EisakikoaTinEndoxon.notmetered
ltx/en_us_oca/me.m08.d06:meMA.Ode4C11.mode	@ltx/en_us_oca/miscellanea:misc.Mode4
ltx/en_us_oca/me.m08.d06:meMA.Ode4C11.ode	@ltx/en_us_oca/miscellanea:misc.Ode4
ltx/en_us_oca/me.m08.d06:meMA.Ode4C11.text	You gave the written Law on Mount Sinai, Christ our God, appearing there as You rode upon the cloud in the midst of fire, darkness and tempest: Glory to Your power, O Lord!
ltx/en_us_oca/me.m08.d06:meMA.Ode4C12.incipit	You shone forth ineffably on…
ltx/en_us_oca/me.m08.d06:meMA.Ode4C12.melody	@ltx/en_us_oca/he.h.m4:heHE.EisakikoaTinEndoxon.notmetered
ltx/en_us_oca/me.m08.d06:meMA.Ode4C12.mode	@ltx/en_us_oca/miscellanea:misc.Mode4
ltx/en_us_oca/me.m08.d06:meMA.Ode4C12.ode	@ltx/en_us_oca/miscellanea:misc.Ode4
ltx/en_us_oca/me.m08.d06:meMA.Ode4C12.text	You shone forth ineffably on Tabor, Christ our God, as a pledge of Your glorious dispensation: You were before the ages, and make the clouds Your chariot.
ltx/en_us_oca/me.m08.d06:meMA.Ode4C13.incipit	Those with whom You spoke…
ltx/en_us_oca/me.m08.d06:meMA.Ode4C13.melody	@ltx/en_us_oca/he.h.m4:heHE.EisakikoaTinEndoxon.notmetered
ltx/en_us_oca/me.m08.d06:meMA.Ode4C13.mode	@ltx/en_us_oca/miscellanea:misc.Mode4
ltx/en_us_oca/me.m08.d06:meMA.Ode4C13.ode	@ltx/en_us_oca/miscellanea:misc.Ode4
ltx/en_us_oca/me.m08.d06:meMA.Ode4C13.text	Those with whom You spoke in days of old in fiery clouds, darkness, and the slightest breeze, stood before You like servants, Christ our Master, and talked with You: Glory to Your power, O Lord!
ltx/en_us_oca/me.m08.d06:meMA.Ode4C14.incipit	Moses who foresaw You in…
ltx/en_us_oca/me.m08.d06:meMA.Ode4C14.melody	@ltx/en_us_oca/he.h.m4:heHE.EisakikoaTinEndoxon.notmetered
ltx/en_us_oca/me.m08.d06:meMA.Ode4C14.mode	@ltx/en_us_oca/miscellanea:misc.Mode4
ltx/en_us_oca/me.m08.d06:meMA.Ode4C14.ode	@ltx/en_us_oca/miscellanea:misc.Ode4
ltx/en_us_oca/me.m08.d06:meMA.Ode4C14.text	Moses who foresaw You in the past in the fire of the bush that burned, and Elijah who was taken up in the chariot of fire, were both present on Mount Tabor revealing there Your death upon the Cross.
ltx/en_us_oca/me.m08.d06:meMA.Ode4C1H.greekmelody	@ltx/en_us_oca/he.h.m4:heHE.EisakikoaTinEndoxon.greekname
ltx/en_us_oca/me.m08.d06:meMA.Ode4C1H.incipit	@ltx/en_us_oca/he.h.m4:heHE.EisakikoaTinEndoxon.incipit
ltx/en_us_oca/me.m08.d06:meMA.Ode4C1H.melody	@ltx/en_us_oca/he.h.m4:heHE.EisakikoaTinEndoxon.melody
ltx/en_us_oca/me.m08.d06:meMA.Ode4C1H.mode	@ltx/en_us_oca/miscellanea:misc.Mode4
ltx/en_us_oca/me.m08.d06:meMA.Ode4C1H.ode	@ltx/en_us_oca/miscellanea:misc.Ode4
ltx/en_us_oca/me.m08.d06:meMA.Ode4C1H.text	@ltx/en_us_oca/he.h.m4:heHE.EisakikoaTinEndoxon.text
ltx/en_us_oca/me.m08.d06:meMA.Ode4C21.greekmelody	@ltx/en_us_oca/he.h.m8:heHE.EkSarkosSouVolides.greekname
ltx/en_us_oca/me.m08.d06:meMA.Ode4C21.incipit	@ltx/en_us_oca/he.h.m8:heHE.EkSarkosSouVolides.incipit
ltx/en_us_oca/me.m08.d06:meMA.Ode4C21.melody	@ltx/en_us_oca/he.h.m8:heHE.EkSarkosSouVolides.notmetered
ltx/en_us_oca/me.m08.d06:meMA.Ode4C21.mode	@ltx/en_us_oca/miscellanea:misc.Mode8
ltx/en_us_oca/me.m08.d06:meMA.Ode4C21.ode	@ltx/en_us_oca/miscellanea:misc.Ode4
ltx/en_us_oca/me.m08.d06:meMA.Ode4C21.text	@ltx/en_us_oca/he.h.m8:heHE.EkSarkosSouVolides.text
ltx/en_us_oca/me.m08.d06:meMA.Ode4C22.incipit	Master, You preserved the bush…
ltx/en_us_oca/me.m08.d06:meMA.Ode4C22.melody	@ltx/en_us_oca/he.h.m8:heHE.EkSarkosSouVolides.notmetered
ltx/en_us_oca/me.m08.d06:meMA.Ode4C22.mode	@ltx/en_us_oca/miscellanea:misc.Mode8
ltx/en_us_oca/me.m08.d06:meMA.Ode4C22.ode	@ltx/en_us_oca/miscellanea:misc.Ode4
ltx/en_us_oca/me.m08.d06:meMA.Ode4C22.text	Master, You preserved the bush unharmed, although it was united to the fire, and You revealed Your flesh shining with divine brightness to Moses who sang and cried aloud: Glory to Your power, O Lord!
ltx/en_us_oca/me.m08.d06:meMA.Ode4C23.incipit	The visible sun was eclipsed…
ltx/en_us_oca/me.m08.d06:meMA.Ode4C23.melody	@ltx/en_us_oca/he.h.m8:heHE.EkSarkosSouVolides.notmetered
ltx/en_us_oca/me.m08.d06:meMA.Ode4C23.mode	@ltx/en_us_oca/miscellanea:misc.Mode8
ltx/en_us_oca/me.m08.d06:meMA.Ode4C23.ode	@ltx/en_us_oca/miscellanea:misc.Ode4
ltx/en_us_oca/me.m08.d06:meMA.Ode4C23.text	The visible sun was eclipsed by the rays of Your divinity when it saw You transfigured on Mount Tabor, my Jesus. Glory to Your power, O Lord!
ltx/en_us_oca/me.m08.d06:meMA.Ode4C24.incipit	You were revealed as an…
ltx/en_us_oca/me.m08.d06:meMA.Ode4C24.melody	@ltx/en_us_oca/he.h.m8:heHE.EkSarkosSouVolides.notmetered
ltx/en_us_oca/me.m08.d06:meMA.Ode4C24.mode	@ltx/en_us_oca/miscellanea:misc.Mode8
ltx/en_us_oca/me.m08.d06:meMA.Ode4C24.ode	@ltx/en_us_oca/miscellanea:misc.Ode4
ltx/en_us_oca/me.m08.d06:meMA.Ode4C24.text	You were revealed as an immaterial fire not burning the material substance of the body, when You appeared to Moses, the apostles, and Elijah, Master: You are One in two perfect natures.
ltx/en_us_oca/me.m08.d06:meMA.Ode5C11.greekmelody	@ltx/en_us_oca/he.h.m4:heHE.OTouFotosDiatmixas.greekname
ltx/en_us_oca/me.m08.d06:meMA.Ode5C11.incipit	The seasons bowed down before…
ltx/en_us_oca/me.m08.d06:meMA.Ode5C11.melody	@ltx/en_us_oca/he.h.m4:heHE.OTouFotosDiatmixas.notmetered
ltx/en_us_oca/me.m08.d06:meMA.Ode5C11.mode	@ltx/en_us_oca/miscellanea:misc.Mode4
ltx/en_us_oca/me.m08.d06:meMA.Ode5C11.ode	@ltx/en_us_oca/miscellanea:misc.Ode5
ltx/en_us_oca/me.m08.d06:meMA.Ode5C11.text	The seasons bowed down before Your face, for the sun laid its light before Your feet with its bright rays that fill the heavens, when You, O Christ, changed Your mortal form.
ltx/en_us_oca/me.m08.d06:meMA.Ode5C12.incipit	Behold the Savior! Cried Moses…
ltx/en_us_oca/me.m08.d06:meMA.Ode5C12.melody	@ltx/en_us_oca/he.h.m4:heHE.OTouFotosDiatmixas.notmetered
ltx/en_us_oca/me.m08.d06:meMA.Ode5C12.mode	@ltx/en_us_oca/miscellanea:misc.Mode4
ltx/en_us_oca/me.m08.d06:meMA.Ode5C12.ode	@ltx/en_us_oca/miscellanea:misc.Ode5
ltx/en_us_oca/me.m08.d06:meMA.Ode5C12.text	Behold the Savior! Cried Moses and Elijah on Tabor the holy mountain, and their words rang in the disciples’ ears: Behold, here is Christ Whom we proclaimed as God in ancient times!
ltx/en_us_oca/me.m08.d06:meMA.Ode5C13.incipit	Mingled with mortal nature, the…
ltx/en_us_oca/me.m08.d06:meMA.Ode5C13.melody	@ltx/en_us_oca/he.h.m4:heHE.OTouFotosDiatmixas.notmetered
ltx/en_us_oca/me.m08.d06:meMA.Ode5C13.mode	@ltx/en_us_oca/miscellanea:misc.Mode4
ltx/en_us_oca/me.m08.d06:meMA.Ode5C13.ode	@ltx/en_us_oca/miscellanea:misc.Ode5
ltx/en_us_oca/me.m08.d06:meMA.Ode5C13.text	Mingled with mortal nature, the nature that knows no change shone forth ineffably, unveiling in small part to the apostles the light of the immaterial divinity.
ltx/en_us_oca/me.m08.d06:meMA.Ode5C14.incipit	When they saw You, Christ…
ltx/en_us_oca/me.m08.d06:meMA.Ode5C14.melody	@ltx/en_us_oca/he.h.m4:heHE.OTouFotosDiatmixas.notmetered
ltx/en_us_oca/me.m08.d06:meMA.Ode5C14.mode	@ltx/en_us_oca/miscellanea:misc.Mode4
ltx/en_us_oca/me.m08.d06:meMA.Ode5C14.ode	@ltx/en_us_oca/miscellanea:misc.Ode5
ltx/en_us_oca/me.m08.d06:meMA.Ode5C14.text	When they saw You, Christ the eternal Light, shining forth in the glory of the Father, the disciples cried aloud to You: Direct our paths in Your light!
ltx/en_us_oca/me.m08.d06:meMA.Ode5C1H.greekmelody	@ltx/en_us_oca/he.h.m4:heHE.OTouFotosDiatmixas.greekname
ltx/en_us_oca/me.m08.d06:meMA.Ode5C1H.incipit	@ltx/en_us_oca/he.h.m4:heHE.OTouFotosDiatmixas.incipit
ltx/en_us_oca/me.m08.d06:meMA.Ode5C1H.melody	@ltx/en_us_oca/he.h.m4:heHE.OTouFotosDiatmixas.melody
ltx/en_us_oca/me.m08.d06:meMA.Ode5C1H.mode	@ltx/en_us_oca/miscellanea:misc.Mode4
ltx/en_us_oca/me.m08.d06:meMA.Ode5C1H.ode	@ltx/en_us_oca/miscellanea:misc.Ode5
ltx/en_us_oca/me.m08.d06:meMA.Ode5C1H.text	@ltx/en_us_oca/he.h.m4:heHE.OTouFotosDiatmixas.text
ltx/en_us_oca/me.m08.d06:meMA.Ode5C21.greekmelody	@ltx/en_us_oca/he.h.m8:heHE.InaTiMeAposo.greekname
ltx/en_us_oca/me.m08.d06:meMA.Ode5C21.incipit	No tongue, however eloquent, can…
ltx/en_us_oca/me.m08.d06:meMA.Ode5C21.melody	@ltx/en_us_oca/he.h.m8:heHE.InaTiMeAposo.notmetered
ltx/en_us_oca/me.m08.d06:meMA.Ode5C21.mode	@ltx/en_us_oca/miscellanea:misc.Mode8
ltx/en_us_oca/me.m08.d06:meMA.Ode5C21.ode	@ltx/en_us_oca/miscellanea:misc.Ode5
ltx/en_us_oca/me.m08.d06:meMA.Ode5C21.text	No tongue, however eloquent, can declare Your mighty works. for You are Lord of life and Master of death Who called Moses and Elijah before You on Mount Tabor to bear witness to Your divinity.
ltx/en_us_oca/me.m08.d06:meMA.Ode5C22.incipit	You, O Christ, with invisible…
ltx/en_us_oca/me.m08.d06:meMA.Ode5C22.melody	@ltx/en_us_oca/he.h.m8:heHE.InaTiMeAposo.notmetered
ltx/en_us_oca/me.m08.d06:meMA.Ode5C22.mode	@ltx/en_us_oca/miscellanea:misc.Mode8
ltx/en_us_oca/me.m08.d06:meMA.Ode5C22.ode	@ltx/en_us_oca/miscellanea:misc.Ode5
ltx/en_us_oca/me.m08.d06:meMA.Ode5C22.text	You, O Christ, with invisible hands fashioned mankind in Your own image, and now in this same human body formed by You, You have shown forth the first beauty. not revealing it as in an image, but as You are in Your Person according to Your being, both God and man.
ltx/en_us_oca/me.m08.d06:meMA.Ode5C23.incipit	In a union without confusion…
ltx/en_us_oca/me.m08.d06:meMA.Ode5C23.melody	@ltx/en_us_oca/he.h.m8:heHE.InaTiMeAposo.notmetered
ltx/en_us_oca/me.m08.d06:meMA.Ode5C23.mode	@ltx/en_us_oca/miscellanea:misc.Mode8
ltx/en_us_oca/me.m08.d06:meMA.Ode5C23.ode	@ltx/en_us_oca/miscellanea:misc.Ode5
ltx/en_us_oca/me.m08.d06:meMA.Ode5C23.text	In a union without confusion, You revealed the Godhead to us on Mount Tabor. As the live coal that consumes sins while it enlightens souls, You took up Moses and Elijah in ecstasy with the chief disciples.
ltx/en_us_oca/me.m08.d06:meMA.Ode6C11.greekmelody	@ltx/en_us_oca/he.h.m4:heHE.EnToThlivesthaiMe.greekname
ltx/en_us_oca/me.m08.d06:meMA.Ode6C11.incipit	As Light shining forth on…
ltx/en_us_oca/me.m08.d06:meMA.Ode6C11.melody	@ltx/en_us_oca/he.h.m4:heHE.EnToThlivesthaiMe.notmetered
ltx/en_us_oca/me.m08.d06:meMA.Ode6C11.mode	@ltx/en_us_oca/miscellanea:misc.Mode4
ltx/en_us_oca/me.m08.d06:meMA.Ode6C11.ode	@ltx/en_us_oca/miscellanea:misc.Ode6
ltx/en_us_oca/me.m08.d06:meMA.Ode6C11.text	As Light shining forth on Tabor, more brightly than the rays of the sun, the Savior Christ has enlightened us.
ltx/en_us_oca/me.m08.d06:meMA.Ode6C12.incipit	You were transfigured, O Christ…
ltx/en_us_oca/me.m08.d06:meMA.Ode6C12.melody	@ltx/en_us_oca/he.h.m4:heHE.EnToThlivesthaiMe.notmetered
ltx/en_us_oca/me.m08.d06:meMA.Ode6C12.mode	@ltx/en_us_oca/miscellanea:misc.Mode4
ltx/en_us_oca/me.m08.d06:meMA.Ode6C12.ode	@ltx/en_us_oca/miscellanea:misc.Ode6
ltx/en_us_oca/me.m08.d06:meMA.Ode6C12.text	You were transfigured, O Christ, ascending into Mount Tabor. You darkened all error, causing Your light to shine forth.
ltx/en_us_oca/me.m08.d06:meMA.Ode6C13.incipit	The glorious apostles recognized You…
ltx/en_us_oca/me.m08.d06:meMA.Ode6C13.melody	@ltx/en_us_oca/he.h.m4:heHE.EnToThlivesthaiMe.notmetered
ltx/en_us_oca/me.m08.d06:meMA.Ode6C13.mode	@ltx/en_us_oca/miscellanea:misc.Mode4
ltx/en_us_oca/me.m08.d06:meMA.Ode6C13.ode	@ltx/en_us_oca/miscellanea:misc.Ode6
ltx/en_us_oca/me.m08.d06:meMA.Ode6C13.text	The glorious apostles recognized You as God on Tabor, and in their amazement bent their knees before You, O Christ.
ltx/en_us_oca/me.m08.d06:meMA.Ode6C1H.greekmelody	@ltx/en_us_oca/he.h.m4:heHE.EnToThlivesthaiMe.greekname
ltx/en_us_oca/me.m08.d06:meMA.Ode6C1H.incipit	@ltx/en_us_oca/he.h.m4:heHE.EnToThlivesthaiMe.incipit
ltx/en_us_oca/me.m08.d06:meMA.Ode6C1H.melody	@ltx/en_us_oca/he.h.m4:heHE.EnToThlivesthaiMe.melody
ltx/en_us_oca/me.m08.d06:meMA.Ode6C1H.mode	@ltx/en_us_oca/miscellanea:misc.Mode4
ltx/en_us_oca/me.m08.d06:meMA.Ode6C1H.ode	@ltx/en_us_oca/miscellanea:misc.Ode6
ltx/en_us_oca/me.m08.d06:meMA.Ode6C1H.text	@ltx/en_us_oca/he.h.m4:heHE.EnToThlivesthaiMe.text
ltx/en_us_oca/me.m08.d06:meMA.Ode6C21.greekmelody	@ltx/en_us_oca/he.h.m8:heHE.IlasthitiMoiSotir.greekname
ltx/en_us_oca/me.m08.d06:meMA.Ode6C21.incipit	How mighty and fearful is…
ltx/en_us_oca/me.m08.d06:meMA.Ode6C21.melody	@ltx/en_us_oca/he.h.m8:heHE.IlasthitiMoiSotir.notmetered
ltx/en_us_oca/me.m08.d06:meMA.Ode6C21.mode	@ltx/en_us_oca/miscellanea:misc.Mode8
ltx/en_us_oca/me.m08.d06:meMA.Ode6C21.ode	@ltx/en_us_oca/miscellanea:misc.Ode6
ltx/en_us_oca/me.m08.d06:meMA.Ode6C21.text	How mighty and fearful is the vision seen today! The visible sun shone from heaven, but from the earth shone incomparably upon Mount Tabor the spiritual Sun of Righteousness.
ltx/en_us_oca/me.m08.d06:meMA.Ode6C22.incipit	The shadow of the Law…
ltx/en_us_oca/me.m08.d06:meMA.Ode6C22.melody	@ltx/en_us_oca/he.h.m8:heHE.IlasthitiMoiSotir.notmetered
ltx/en_us_oca/me.m08.d06:meMA.Ode6C22.mode	@ltx/en_us_oca/miscellanea:misc.Mode8
ltx/en_us_oca/me.m08.d06:meMA.Ode6C22.ode	@ltx/en_us_oca/miscellanea:misc.Ode6
ltx/en_us_oca/me.m08.d06:meMA.Ode6C22.text	The shadow of the Law has grown feeble and passed away, and Christ the Truth has plainly come! cried Moses as he beheld Your divinity on Mount Tabor.
ltx/en_us_oca/me.m08.d06:meMA.Ode6C23.incipit	The pillar of fire plainly…
ltx/en_us_oca/me.m08.d06:meMA.Ode6C23.melody	@ltx/en_us_oca/he.h.m8:heHE.IlasthitiMoiSotir.notmetered
ltx/en_us_oca/me.m08.d06:meMA.Ode6C23.mode	@ltx/en_us_oca/miscellanea:misc.Mode8
ltx/en_us_oca/me.m08.d06:meMA.Ode6C23.ode	@ltx/en_us_oca/miscellanea:misc.Ode6
ltx/en_us_oca/me.m08.d06:meMA.Ode6C23.text	The pillar of fire plainly showed Moses Christ transfigured, and the cloud clearly prefigured the grace of the Holy Spirit that overshadowed Mount Tabor.
ltx/en_us_oca/me.m08.d06:meMA.Ode7C11.greekmelody	@ltx/en_us_oca/he.h.m4:heHE.AvramiaioiPote.greekname
ltx/en_us_oca/me.m08.d06:meMA.Ode7C11.incipit	Bathed in the light of…
ltx/en_us_oca/me.m08.d06:meMA.Ode7C11.melody	@ltx/en_us_oca/he.h.m4:heHE.AvramiaioiPote.notmetered
ltx/en_us_oca/me.m08.d06:meMA.Ode7C11.mode	@ltx/en_us_oca/miscellanea:misc.Mode4
ltx/en_us_oca/me.m08.d06:meMA.Ode7C11.ode	@ltx/en_us_oca/miscellanea:misc.Ode7
ltx/en_us_oca/me.m08.d06:meMA.Ode7C11.text	Bathed in the light of Your unapproachable glory on Tabor, the apostles cried aloud, O Christ: Blessed are You, the God of our fathers!
ltx/en_us_oca/me.m08.d06:meMA.Ode7C12.incipit	Rejoicing in the whirlwind of…
ltx/en_us_oca/me.m08.d06:meMA.Ode7C12.melody	@ltx/en_us_oca/he.h.m4:heHE.AvramiaioiPote.notmetered
ltx/en_us_oca/me.m08.d06:meMA.Ode7C12.mode	@ltx/en_us_oca/miscellanea:misc.Mode4
ltx/en_us_oca/me.m08.d06:meMA.Ode7C12.ode	@ltx/en_us_oca/miscellanea:misc.Ode7
ltx/en_us_oca/me.m08.d06:meMA.Ode7C12.text	Rejoicing in the whirlwind of the voice of God, and in the cloud that dropped down dew with Your shining majesty, the apostles sang, O Christ: Blessed are You, the God of our fathers!
ltx/en_us_oca/me.m08.d06:meMA.Ode7C13.incipit	As Peter beheld You radiant…
ltx/en_us_oca/me.m08.d06:meMA.Ode7C13.melody	@ltx/en_us_oca/he.h.m4:heHE.AvramiaioiPote.notmetered
ltx/en_us_oca/me.m08.d06:meMA.Ode7C13.mode	@ltx/en_us_oca/miscellanea:misc.Mode4
ltx/en_us_oca/me.m08.d06:meMA.Ode7C13.ode	@ltx/en_us_oca/miscellanea:misc.Ode7
ltx/en_us_oca/me.m08.d06:meMA.Ode7C13.text	As Peter beheld You radiant with unapproachable light, he cried out on Mount Tabor, O Christ: Blessed are You, the God of our fathers!
ltx/en_us_oca/me.m08.d06:meMA.Ode7C14.incipit	The sons of Zebedee were…
ltx/en_us_oca/me.m08.d06:meMA.Ode7C14.melody	@ltx/en_us_oca/he.h.m4:heHE.AvramiaioiPote.notmetered
ltx/en_us_oca/me.m08.d06:meMA.Ode7C14.mode	@ltx/en_us_oca/miscellanea:misc.Mode4
ltx/en_us_oca/me.m08.d06:meMA.Ode7C14.ode	@ltx/en_us_oca/miscellanea:misc.Ode7
ltx/en_us_oca/me.m08.d06:meMA.Ode7C14.text	The sons of Zebedee were with Christ, the Prince of Life, and when light flashed forth from Him, they thundered: Blessed are You, the God of our fathers!
ltx/en_us_oca/me.m08.d06:meMA.Ode7C1H.greekmelody	@ltx/en_us_oca/he.h.m4:heHE.AvramiaioiPote.greekname
ltx/en_us_oca/me.m08.d06:meMA.Ode7C1H.incipit	@ltx/en_us_oca/he.h.m4:heHE.AvramiaioiPote.incipit
ltx/en_us_oca/me.m08.d06:meMA.Ode7C1H.melody	@ltx/en_us_oca/he.h.m4:heHE.AvramiaioiPote.melody
ltx/en_us_oca/me.m08.d06:meMA.Ode7C1H.mode	@ltx/en_us_oca/miscellanea:misc.Mode4
ltx/en_us_oca/me.m08.d06:meMA.Ode7C1H.ode	@ltx/en_us_oca/miscellanea:misc.Ode7
ltx/en_us_oca/me.m08.d06:meMA.Ode7C1H.text	@ltx/en_us_oca/he.h.m4:heHE.AvramiaioiPote.text
ltx/en_us_oca/me.m08.d06:meMA.Ode7C21.greekmelody	@ltx/en_us_oca/he.h.m8:heHE.PaidesEvraion.greekname
ltx/en_us_oca/me.m08.d06:meMA.Ode7C21.incipit	The invisible has now become…
ltx/en_us_oca/me.m08.d06:meMA.Ode7C21.melody	@ltx/en_us_oca/he.h.m8:heHE.PaidesEvraion.notmetered
ltx/en_us_oca/me.m08.d06:meMA.Ode7C21.mode	@ltx/en_us_oca/miscellanea:misc.Mode8
ltx/en_us_oca/me.m08.d06:meMA.Ode7C21.ode	@ltx/en_us_oca/miscellanea:misc.Ode7
ltx/en_us_oca/me.m08.d06:meMA.Ode7C21.text	The invisible has now become visible to the apostles: the Godhead shone out before them in the flesh. On Mount Tabor they cried aloud: Blessed are You, Lord our God, throughout all ages!
ltx/en_us_oca/me.m08.d06:meMA.Ode7C22.incipit	The apostles struck with wonder…
ltx/en_us_oca/me.m08.d06:meMA.Ode7C22.melody	@ltx/en_us_oca/he.h.m8:heHE.PaidesEvraion.notmetered
ltx/en_us_oca/me.m08.d06:meMA.Ode7C22.mode	@ltx/en_us_oca/miscellanea:misc.Mode8
ltx/en_us_oca/me.m08.d06:meMA.Ode7C22.ode	@ltx/en_us_oca/miscellanea:misc.Ode7
ltx/en_us_oca/me.m08.d06:meMA.Ode7C22.text	The apostles struck with wonder on Mount Tabor, in fear and trembling before the beauty of Your divine Kingdom, cried aloud: Blessed are You, Lord our God, throughout all ages!
ltx/en_us_oca/me.m08.d06:meMA.Ode7C23.incipit	The unheard of has now…
ltx/en_us_oca/me.m08.d06:meMA.Ode7C23.melody	@ltx/en_us_oca/he.h.m8:heHE.PaidesEvraion.notmetered
ltx/en_us_oca/me.m08.d06:meMA.Ode7C23.mode	@ltx/en_us_oca/miscellanea:misc.Mode8
ltx/en_us_oca/me.m08.d06:meMA.Ode7C23.ode	@ltx/en_us_oca/miscellanea:misc.Ode7
ltx/en_us_oca/me.m08.d06:meMA.Ode7C23.text	The unheard of has now been heard, for the Son Who came forth from the Virgin without a Father receives glorious testimony from His Father’s voice that He is both God and man, throughout all ages!
ltx/en_us_oca/me.m08.d06:meMA.Ode7C24.incipit	You did not become the…
ltx/en_us_oca/me.m08.d06:meMA.Ode7C24.melody	@ltx/en_us_oca/he.h.m8:heHE.PaidesEvraion.notmetered
ltx/en_us_oca/me.m08.d06:meMA.Ode7C24.mode	@ltx/en_us_oca/miscellanea:misc.Mode8
ltx/en_us_oca/me.m08.d06:meMA.Ode7C24.ode	@ltx/en_us_oca/miscellanea:misc.Ode7
ltx/en_us_oca/me.m08.d06:meMA.Ode7C24.text	You did not become the beloved Son of the Most High through adoption, but were such by nature before the world began, and without change You came to dwell with us who cry to You: Blessed are You, Lord our God, throughout all ages!
ltx/en_us_oca/me.m08.d06:meMA.Ode8C11.greekmelody	@ltx/en_us_oca/he.h.m4:heHE.OiEnVavyloniPaides.greekname
ltx/en_us_oca/me.m08.d06:meMA.Ode8C11.incipit	You uphold all things by…
ltx/en_us_oca/me.m08.d06:meMA.Ode8C11.melody	@ltx/en_us_oca/he.h.m4:heHE.OiEnVavyloniPaides.notmetered
ltx/en_us_oca/me.m08.d06:meMA.Ode8C11.mode	@ltx/en_us_oca/miscellanea:misc.Mode4
ltx/en_us_oca/me.m08.d06:meMA.Ode8C11.ode	@ltx/en_us_oca/miscellanea:misc.Ode8
ltx/en_us_oca/me.m08.d06:meMA.Ode8C11.text	You uphold all things by Your will: You ascended Mount Tabor with Your undefiled feet. Your face shone there with a splendor brighter than the light of the sun, the elect of the Law and of grace stood in its radiance and sang: All works of the Lord, bless the Lord!
ltx/en_us_oca/me.m08.d06:meMA.Ode8C12.incipit	When the infinite Light that…
ltx/en_us_oca/me.m08.d06:meMA.Ode8C12.melody	@ltx/en_us_oca/he.h.m4:heHE.OiEnVavyloniPaides.notmetered
ltx/en_us_oca/me.m08.d06:meMA.Ode8C12.mode	@ltx/en_us_oca/miscellanea:misc.Mode4
ltx/en_us_oca/me.m08.d06:meMA.Ode8C12.ode	@ltx/en_us_oca/miscellanea:misc.Ode8
ltx/en_us_oca/me.m08.d06:meMA.Ode8C12.text	When the infinite Light that knows no evening, the brightness of the Father Who gives splendor to creation, appeared ineffably in unapproachable glory on Mount Tabor, it made men divine as they sang: All works of the Lord, bless the Lord!
ltx/en_us_oca/me.m08.d06:meMA.Ode8C13.incipit	Standing in reverence on Mount…
ltx/en_us_oca/me.m08.d06:meMA.Ode8C13.melody	@ltx/en_us_oca/he.h.m4:heHE.OiEnVavyloniPaides.notmetered
ltx/en_us_oca/me.m08.d06:meMA.Ode8C13.mode	@ltx/en_us_oca/miscellanea:misc.Mode4
ltx/en_us_oca/me.m08.d06:meMA.Ode8C13.ode	@ltx/en_us_oca/miscellanea:misc.Ode8
ltx/en_us_oca/me.m08.d06:meMA.Ode8C13.text	Standing in reverence on Mount Tabor, Moses and Elijah beheld Christ clearly: the express image of the divine Person, shining forth as lightning with the glory of the Father, and they sang: All works of the Lord, bless the Lord!
ltx/en_us_oca/me.m08.d06:meMA.Ode8C14.incipit	The face of Moses once…
ltx/en_us_oca/me.m08.d06:meMA.Ode8C14.melody	@ltx/en_us_oca/he.h.m4:heHE.OiEnVavyloniPaides.notmetered
ltx/en_us_oca/me.m08.d06:meMA.Ode8C14.mode	@ltx/en_us_oca/miscellanea:misc.Mode4
ltx/en_us_oca/me.m08.d06:meMA.Ode8C14.ode	@ltx/en_us_oca/miscellanea:misc.Ode8
ltx/en_us_oca/me.m08.d06:meMA.Ode8C14.text	The face of Moses once shone with glory because of the divine voice he heard in darkness, but Christ covers Himself with light and glory as with a garment. The One Who is by nature the Author of light, shines on those who sing: All works of the Lord, bless the Lord!
ltx/en_us_oca/me.m08.d06:meMA.Ode8C15.incipit	The disciples as they beheld…
ltx/en_us_oca/me.m08.d06:meMA.Ode8C15.melody	@ltx/en_us_oca/he.h.m4:heHE.OiEnVavyloniPaides.notmetered
ltx/en_us_oca/me.m08.d06:meMA.Ode8C15.mode	@ltx/en_us_oca/miscellanea:misc.Mode4
ltx/en_us_oca/me.m08.d06:meMA.Ode8C15.ode	@ltx/en_us_oca/miscellanea:misc.Ode8
ltx/en_us_oca/me.m08.d06:meMA.Ode8C15.text	The disciples as they beheld Christ on Mount Tabor wrapped in a cloud of light, fell to the ground on their faces, and with their minds enlightened, sang this hymn of praise to Him, and to the Father and the Spirit: All works of the Lord, bless the Lord!
ltx/en_us_oca/me.m08.d06:meMA.Ode8C1H.greekmelody	@ltx/en_us_oca/he.h.m4:heHE.OiEnVavyloniPaides.greekname
ltx/en_us_oca/me.m08.d06:meMA.Ode8C1H.incipit	@ltx/en_us_oca/he.h.m4:heHE.OiEnVavyloniPaides.incipit
ltx/en_us_oca/me.m08.d06:meMA.Ode8C1H.melody	@ltx/en_us_oca/he.h.m4:heHE.OiEnVavyloniPaides.melody
ltx/en_us_oca/me.m08.d06:meMA.Ode8C1H.mode	@ltx/en_us_oca/miscellanea:misc.Mode4
ltx/en_us_oca/me.m08.d06:meMA.Ode8C1H.ode	@ltx/en_us_oca/miscellanea:misc.Ode8
ltx/en_us_oca/me.m08.d06:meMA.Ode8C1H.text	@ltx/en_us_oca/he.h.m4:heHE.OiEnVavyloniPaides.text
ltx/en_us_oca/me.m08.d06:meMA.Ode8C21.greekmelody	@ltx/en_us_oca/he.h.m8:heHE.EptaplasiosKaminon.greekname
ltx/en_us_oca/me.m08.d06:meMA.Ode8C21.incipit	The disciples heard the Father’s…
ltx/en_us_oca/me.m08.d06:meMA.Ode8C21.melody	@ltx/en_us_oca/he.h.m8:heHE.EptaplasiosKaminon.notmetered
ltx/en_us_oca/me.m08.d06:meMA.Ode8C21.mode	@ltx/en_us_oca/miscellanea:misc.Mode8
ltx/en_us_oca/me.m08.d06:meMA.Ode8C21.ode	@ltx/en_us_oca/miscellanea:misc.Ode8
ltx/en_us_oca/me.m08.d06:meMA.Ode8C21.text	The disciples heard the Father’s testimony, Master, and unable to bear the sight of Your face Whose lightning brightness was too fierce for human eyes, they fell to the ground in awe and sang: Priests, sing the praises of Christ; people exalt Him above all forever!
ltx/en_us_oca/me.m08.d06:meMA.Ode8C22.incipit	You are by nature the…
ltx/en_us_oca/me.m08.d06:meMA.Ode8C22.melody	@ltx/en_us_oca/he.h.m8:heHE.EptaplasiosKaminon.notmetered
ltx/en_us_oca/me.m08.d06:meMA.Ode8C22.mode	@ltx/en_us_oca/miscellanea:misc.Mode8
ltx/en_us_oca/me.m08.d06:meMA.Ode8C22.ode	@ltx/en_us_oca/miscellanea:misc.Ode8
ltx/en_us_oca/me.m08.d06:meMA.Ode8C22.text	You are by nature the brilliant King of kings, and blessed Lord of lords, blessed Master. You dwell in unapproachable light: To You, the disciples struck with wonder, cried: Bless Christ, you children! Priests, sing His praises; people, exalt Him above all forever!
ltx/en_us_oca/me.m08.d06:meMA.Ode8C23.incipit	As You are Master of…
ltx/en_us_oca/me.m08.d06:meMA.Ode8C23.melody	@ltx/en_us_oca/he.h.m8:heHE.EptaplasiosKaminon.notmetered
ltx/en_us_oca/me.m08.d06:meMA.Ode8C23.mode	@ltx/en_us_oca/miscellanea:misc.Mode8
ltx/en_us_oca/me.m08.d06:meMA.Ode8C23.ode	@ltx/en_us_oca/miscellanea:misc.Ode8
ltx/en_us_oca/me.m08.d06:meMA.Ode8C23.text	As You are Master of heaven and Lord of earth, and have dominion over the things beneath the earth, there stood beside You, Christ, the apostles from the earth, Elijah the Tishbite as if from heaven, and Moses from the dead, who sang with one accord: People, exalt Christ above all forever!
ltx/en_us_oca/me.m08.d06:meMA.Ode8C24.incipit	Your chosen apostles laid aside…
ltx/en_us_oca/me.m08.d06:meMA.Ode8C24.melody	@ltx/en_us_oca/he.h.m8:heHE.EptaplasiosKaminon.notmetered
ltx/en_us_oca/me.m08.d06:meMA.Ode8C24.mode	@ltx/en_us_oca/miscellanea:misc.Mode8
ltx/en_us_oca/me.m08.d06:meMA.Ode8C24.ode	@ltx/en_us_oca/miscellanea:misc.Ode8
ltx/en_us_oca/me.m08.d06:meMA.Ode8C24.text	Your chosen apostles laid aside all earthly cares to follow You, Lover of mankind, to the divine way of life high above this world. Therefore they were accounted worthy to behold the vision of Your divinity, and they sang: People, exalt Christ above all forever!
ltx/en_us_oca/me.m08.d06:meMA.Ode9C11.greekmelody	@ltx/en_us_oca/he.h.m4:heHE.OTokosSouAfthoros.greekname
ltx/en_us_oca/me.m08.d06:meMA.Ode9C11.incipit	The disciples, struck with fear…
ltx/en_us_oca/me.m08.d06:meMA.Ode9C11.melody	@ltx/en_us_oca/he.h.m4:heHE.OTokosSouAfthoros.notmetered
ltx/en_us_oca/me.m08.d06:meMA.Ode9C11.mode	@ltx/en_us_oca/miscellanea:misc.Mode4
ltx/en_us_oca/me.m08.d06:meMA.Ode9C11.ode	@ltx/en_us_oca/miscellanea:misc.Ode9
ltx/en_us_oca/me.m08.d06:meMA.Ode9C11.text	The disciples, struck with fear, and illumined with the sudden stream of unknown light, looked at each other and fell on their faces to the ground, worshipping You, the Master of all.
ltx/en_us_oca/me.m08.d06:meMA.Ode9C12.incipit	A divine voice came from…
ltx/en_us_oca/me.m08.d06:meMA.Ode9C12.melody	@ltx/en_us_oca/he.h.m4:heHE.OTokosSouAfthoros.notmetered
ltx/en_us_oca/me.m08.d06:meMA.Ode9C12.mode	@ltx/en_us_oca/miscellanea:misc.Mode4
ltx/en_us_oca/me.m08.d06:meMA.Ode9C12.ode	@ltx/en_us_oca/miscellanea:misc.Ode9
ltx/en_us_oca/me.m08.d06:meMA.Ode9C12.text	A divine voice came from the cloud and confirmed the wonder, for the Father of Lights called to the apostles: This is My beloved Son! Hear Him!
ltx/en_us_oca/me.m08.d06:meMA.Ode9C13.incipit	The ministers of the Word…
ltx/en_us_oca/me.m08.d06:meMA.Ode9C13.melody	@ltx/en_us_oca/he.h.m4:heHE.OTokosSouAfthoros.notmetered
ltx/en_us_oca/me.m08.d06:meMA.Ode9C13.mode	@ltx/en_us_oca/miscellanea:misc.Mode4
ltx/en_us_oca/me.m08.d06:meMA.Ode9C13.ode	@ltx/en_us_oca/miscellanea:misc.Ode9
ltx/en_us_oca/me.m08.d06:meMA.Ode9C13.text	The ministers of the Word beheld new and awesome wonders on Tabor, and hearing the voice of the Father, they cried out: This is the imprint of the Archetype, our Savior, Himself!
ltx/en_us_oca/me.m08.d06:meMA.Ode9C14.incipit	Unchanged Image of the One…
ltx/en_us_oca/me.m08.d06:meMA.Ode9C14.melody	@ltx/en_us_oca/he.h.m4:heHE.OTokosSouAfthoros.notmetered
ltx/en_us_oca/me.m08.d06:meMA.Ode9C14.mode	@ltx/en_us_oca/miscellanea:misc.Mode4
ltx/en_us_oca/me.m08.d06:meMA.Ode9C14.ode	@ltx/en_us_oca/miscellanea:misc.Ode9
ltx/en_us_oca/me.m08.d06:meMA.Ode9C14.text	Unchanged Image of the One Who Is, Seal that cannot be removed or altered: Son and Word, Wisdom, Arm and Right Hand, the Strength of the Most High: we hymn You with the Father and the Spirit.
ltx/en_us_oca/me.m08.d06:meMA.Ode9C1H.greekmelody	@ltx/en_us_oca/he.h.m4:heHE.OTokosSouAfthoros.greekname
ltx/en_us_oca/me.m08.d06:meMA.Ode9C1H.incipit	@ltx/en_us_oca/he.h.m4:heHE.OTokosSouAfthoros.incipit
ltx/en_us_oca/me.m08.d06:meMA.Ode9C1H.melody	@ltx/en_us_oca/he.h.m4:heHE.OTokosSouAfthoros.melody
ltx/en_us_oca/me.m08.d06:meMA.Ode9C1H.mode	@ltx/en_us_oca/miscellanea:misc.Mode4
ltx/en_us_oca/me.m08.d06:meMA.Ode9C1H.ode	@ltx/en_us_oca/miscellanea:misc.Ode9
ltx/en_us_oca/me.m08.d06:meMA.Ode9C1H.text	@ltx/en_us_oca/he.h.m4:heHE.OTokosSouAfthoros.text
ltx/en_us_oca/me.m08.d06:meMA.Ode9C21.greekmelody	@ltx/en_us_oca/he.h.m8:heHE.EfrixePasaAkoi.greekname
ltx/en_us_oca/me.m08.d06:meMA.Ode9C21.incipit	To show plainly how You…
ltx/en_us_oca/me.m08.d06:meMA.Ode9C21.melody	@ltx/en_us_oca/he.h.m8:heHE.EfrixePasaAkoi.notmetered
ltx/en_us_oca/me.m08.d06:meMA.Ode9C21.mode	@ltx/en_us_oca/miscellanea:misc.Mode8
ltx/en_us_oca/me.m08.d06:meMA.Ode9C21.ode	@ltx/en_us_oca/miscellanea:misc.Ode9
ltx/en_us_oca/me.m08.d06:meMA.Ode9C21.text	To show plainly how You will appear as the Most High God at Your mysterious second coming, standing in the midst of gods, You shone ineffably on Mount Tabor before the apostles, Moses and Elijah. Therefore we all magnify You, O Christ.
ltx/en_us_oca/me.m08.d06:meMA.Ode9C22.incipit	Peoples, come and listen to…
ltx/en_us_oca/me.m08.d06:meMA.Ode9C22.melody	@ltx/en_us_oca/he.h.m8:heHE.EfrixePasaAkoi.notmetered
ltx/en_us_oca/me.m08.d06:meMA.Ode9C22.mode	@ltx/en_us_oca/miscellanea:misc.Mode8
ltx/en_us_oca/me.m08.d06:meMA.Ode9C22.ode	@ltx/en_us_oca/miscellanea:misc.Ode9
ltx/en_us_oca/me.m08.d06:meMA.Ode9C22.text	Peoples, come and listen to me: Let us ascend into the holy, heavenly mountain. Let us stand in Spirit in the city of the living God, beholding with our minds the spiritual Godhead of the Father and the Spirit shining forth in the Only-begotten Son.
ltx/en_us_oca/me.m08.d06:meMA.Ode9C23.incipit	You have captured me with…
ltx/en_us_oca/me.m08.d06:meMA.Ode9C23.melody	@ltx/en_us_oca/he.h.m8:heHE.EfrixePasaAkoi.notmetered
ltx/en_us_oca/me.m08.d06:meMA.Ode9C23.mode	@ltx/en_us_oca/miscellanea:misc.Mode8
ltx/en_us_oca/me.m08.d06:meMA.Ode9C23.ode	@ltx/en_us_oca/miscellanea:misc.Ode9
ltx/en_us_oca/me.m08.d06:meMA.Ode9C23.text	You have captured me with desire for You, O Christ, transforming me with Your divine love. Consume my sins with the fire of the Spirit, and count me worthy to be filled with delight in You, that I may dance with joy and magnify both Your Comings, Good Lord!
ltx/en_us_oca/me.m08.d06:meMA.Ode9C2H.greekmelody	@ltx/en_us_oca/he.h.m8:heHE.EfrixePasaAkoi.greekname
ltx/en_us_oca/me.m08.d06:meMA.Ode9C2H.incipit	@ltx/en_us_oca/he.h.m8:heHE.EfrixePasaAkoi.incipit
ltx/en_us_oca/me.m08.d06:meMA.Ode9C2H.melody	@ltx/en_us_oca/he.h.m8:heHE.EfrixePasaAkoi.melody
ltx/en_us_oca/me.m08.d06:meMA.Ode9C2H.mode	@ltx/en_us_oca/miscellanea:misc.Mode8
ltx/en_us_oca/me.m08.d06:meMA.Ode9C2H.ode	@ltx/en_us_oca/miscellanea:misc.Ode9
ltx/en_us_oca/me.m08.d06:meMA.Ode9C2H.text	@ltx/en_us_oca/he.h.m8:heHE.EfrixePasaAkoi.text
ltx/en_us_oca/me.m08.d06:meMA.Oikos1.text	Awake, sluggards! Do not lie forever on the ground! And thoughts that draw my soul towards earth, arise and go up to the high slope of the divine ascent. Let us run to join Peter and the sons of Zebedee, and go with them to Mount Tabor, that with them we may see the glory of our God and hear the voice they heard from heaven: and they proclaimed ⁄⁄ That You are truly the radiance of the Father!
ltx/en_us_oca/me.m08.d06:meMA.PostGospelBoth.incipit	@ltx/en_us_oca/ho.ho03:hoMA.PostGospelTheotokos.incipit
ltx/en_us_oca/me.m08.d06:meMA.PostGospelBoth.melody	
ltx/en_us_oca/me.m08.d06:meMA.PostGospelBoth.mode	@ltx/en_us_oca/miscellanea:misc.Mode2
ltx/en_us_oca/me.m08.d06:meMA.PostGospelBoth.text	@ltx/en_us_oca/ho.ho03:hoMA.PostGospelTheotokos.text
ltx/en_us_oca/me.m08.d06:meMA.PostGospelGlory.incipit	@ltx/en_us_oca/ho.ho03:hoMA.PostGospelApostles.incipit
ltx/en_us_oca/me.m08.d06:meMA.PostGospelGlory.melody	
ltx/en_us_oca/me.m08.d06:meMA.PostGospelGlory.mode	@ltx/en_us_oca/miscellanea:misc.Mode2
ltx/en_us_oca/me.m08.d06:meMA.PostGospelGlory.text	@ltx/en_us_oca/ho.ho03:hoMA.PostGospelApostles.text
ltx/en_us_oca/me.m08.d06:meMA.PostGospelIdiomelon.incipit	@ltx/en_us_oca/me.m08.d06:meVE.Lity1.incipit
ltx/en_us_oca/me.m08.d06:meMA.PostGospelIdiomelon.melody	
ltx/en_us_oca/me.m08.d06:meMA.PostGospelIdiomelon.mode	@ltx/en_us_oca/miscellanea:misc.Mode2
ltx/en_us_oca/me.m08.d06:meMA.PostGospelIdiomelon.text	@ltx/en_us_oca/me.m08.d06:meVE.Lity1.text
ltx/en_us_oca/me.m08.d06:meSV.AposGlory.incipit	…
ltx/en_us_oca/me.m08.d06:meSV.AposGlory.melody	@ltx/en_us_oca/he.a.m2:heAU.OikosTouEfratha.notmetered
ltx/en_us_oca/me.m08.d06:meSV.AposGlory.mode	@ltx/en_us_oca/miscellanea:misc.Mode2
ltx/en_us_oca/me.m08.d06:meSV.AposGlory.text	
ltx/en_us_oca/me.m08.d06:meSV.Aposticha1.incipit	…
ltx/en_us_oca/me.m08.d06:meSV.Aposticha1.melody	@ltx/en_us_oca/he.a.m2:heAU.OikosTouEfratha.notmetered
ltx/en_us_oca/me.m08.d06:meSV.Aposticha1.mode	@ltx/en_us_oca/miscellanea:misc.Mode2
ltx/en_us_oca/me.m08.d06:meSV.Aposticha1.text	
ltx/en_us_oca/me.m08.d06:meSV.Aposticha2.incipit	…
ltx/en_us_oca/me.m08.d06:meSV.Aposticha2.melody	@ltx/en_us_oca/he.a.m2:heAU.OikosTouEfratha.notmetered
ltx/en_us_oca/me.m08.d06:meSV.Aposticha2.mode	@ltx/en_us_oca/miscellanea:misc.Mode2
ltx/en_us_oca/me.m08.d06:meSV.Aposticha2.text	
ltx/en_us_oca/me.m08.d06:meSV.Aposticha3.incipit	…
ltx/en_us_oca/me.m08.d06:meSV.Aposticha3.melody	@ltx/en_us_oca/he.a.m2:heAU.OikosTouEfratha.notmetered
ltx/en_us_oca/me.m08.d06:meSV.Aposticha3.mode	@ltx/en_us_oca/miscellanea:misc.Mode2
ltx/en_us_oca/me.m08.d06:meSV.Aposticha3.text	
ltx/en_us_oca/me.m08.d06:meSV.SticGlory.incipit	The shining cloud of the…
ltx/en_us_oca/me.m08.d06:meSV.SticGlory.melody	
ltx/en_us_oca/me.m08.d06:meSV.SticGlory.mode	@ltx/en_us_oca/miscellanea:misc.Mode8
ltx/en_us_oca/me.m08.d06:meSV.SticGlory.text	The shining cloud of the Transfiguration ⁄ has replaced the darkness of the law! ⁄ Moses and Elijah were counted worthy of this glory, brighter than the light. ⁄ Taken up in it, they spoke to God, saying: ⁄⁄ You are our God, the King of the ages!
ltx/en_us_oca/me.m08.d06:meSV.Stichera1.incipit	Come, let us rejoice and…
ltx/en_us_oca/me.m08.d06:meSV.Stichera1.melody	@ltx/en_us_oca/he.a.m4:heAU.EdokasSimeiosin.notmetered
ltx/en_us_oca/me.m08.d06:meSV.Stichera1.mode	@ltx/en_us_oca/miscellanea:misc.Mode4
ltx/en_us_oca/me.m08.d06:meSV.Stichera1.text	Come, let us rejoice and mount up from the earth! ⁄ Let us come to the height of the contemplation of the virtues: ⁄ Let us be transformed today into a higher state, ⁄ directing our minds to heavenly things; ⁄ being formed anew in piety into the image of Christ. ⁄ For in His mercy the Savior of our souls ⁄ has transfigured human nature become disfigured, ⁄⁄ causing Him to shine with light on Mount Tabor!
ltx/en_us_oca/me.m08.d06:meSV.Stichera2.incipit	Let us who desire to…
ltx/en_us_oca/me.m08.d06:meSV.Stichera2.melody	@ltx/en_us_oca/he.a.m4:heAU.EdokasSimeiosin.notmetered
ltx/en_us_oca/me.m08.d06:meSV.Stichera2.mode	@ltx/en_us_oca/miscellanea:misc.Mode4
ltx/en_us_oca/me.m08.d06:meSV.Stichera2.text	Let us who desire to see and hear things past understanding ⁄ behold Christ mystically as He shines like lightning ⁄ radiant with divine splendor! ⁄ Let us cause the Father’s voice to resound ⁄ proclaiming Him His well-beloved Son! ⁄ On Mount Tabor He makes the weakness of humanity radiant, ⁄⁄ granting enlightenment to our souls.
ltx/en_us_oca/me.m08.d06:meSV.Stichera3.incipit	Let the assembly of all…
ltx/en_us_oca/me.m08.d06:meSV.Stichera3.melody	@ltx/en_us_oca/he.a.m4:heAU.EdokasSimeiosin.notmetered
ltx/en_us_oca/me.m08.d06:meSV.Stichera3.mode	@ltx/en_us_oca/miscellanea:misc.Mode4
ltx/en_us_oca/me.m08.d06:meSV.Stichera3.text	Let the assembly of all on earth and in heaven ⁄ come to praise Christ our God, ⁄ the Lord of both the living and the dead. ⁄ For when He was divinely transfigured on Tabor ⁄ as the Savior of our souls ⁄ it was His good pleasure to have beside Him ⁄⁄ the leaders and preachers of both the law and grace.
ltx/en_us_oca/me.m08.d06:meVE.Apolytikion1.incipit	…
ltx/en_us_oca/me.m08.d06:meVE.Apolytikion1.melody	
ltx/en_us_oca/me.m08.d06:meVE.Apolytikion1.mode	@ltx/en_us_oca/miscellanea:misc.Mode7
ltx/en_us_oca/me.m08.d06:meVE.Apolytikion1.text	
ltx/en_us_oca/me.m08.d06:meVE.AposGlory.incipit	…
ltx/en_us_oca/me.m08.d06:meVE.AposGlory.melody	
ltx/en_us_oca/me.m08.d06:meVE.AposGlory.mode	@ltx/en_us_oca/miscellanea:misc.Mode6
ltx/en_us_oca/me.m08.d06:meVE.AposGlory.text	
ltx/en_us_oca/me.m08.d06:meVE.Aposticha1.incipit	…
ltx/en_us_oca/me.m08.d06:meVE.Aposticha1.melody	
ltx/en_us_oca/me.m08.d06:meVE.Aposticha1.mode	@ltx/en_us_oca/miscellanea:misc.Mode1
ltx/en_us_oca/me.m08.d06:meVE.Aposticha1.text	
ltx/en_us_oca/me.m08.d06:meVE.Aposticha2.incipit	…
ltx/en_us_oca/me.m08.d06:meVE.Aposticha2.melody	
ltx/en_us_oca/me.m08.d06:meVE.Aposticha2.mode	@ltx/en_us_oca/miscellanea:misc.Mode1
ltx/en_us_oca/me.m08.d06:meVE.Aposticha2.text	
ltx/en_us_oca/me.m08.d06:meVE.Aposticha3.incipit	…
ltx/en_us_oca/me.m08.d06:meVE.Aposticha3.melody	
ltx/en_us_oca/me.m08.d06:meVE.Aposticha3.mode	@ltx/en_us_oca/miscellanea:misc.Mode1
ltx/en_us_oca/me.m08.d06:meVE.Aposticha3.text	
ltx/en_us_oca/me.m08.d06:meVE.Lity1.incipit	O God, in Your goodness…
ltx/en_us_oca/me.m08.d06:meVE.Lity1.melody	
ltx/en_us_oca/me.m08.d06:meVE.Lity1.mode	@ltx/en_us_oca/miscellanea:misc.Mode2
ltx/en_us_oca/me.m08.d06:meVE.Lity1.text	O God, in Your goodness You have sanctified the whole world with Your light: ⁄ You were transfigured on a high mountain, ⁄ showing Your power to Your disciples: ⁄ for You redeem the world from transgression. ⁄⁄ therefore we cry out to You: Lord of compassion, save our souls.
ltx/en_us_oca/me.m08.d06:meVE.Lity2.melody	
ltx/en_us_oca/me.m08.d06:meVE.Lity2.mode	@ltx/en_us_oca/miscellanea:misc.Mode2
ltx/en_us_oca/me.m08.d06:meVE.Lity2.text	@ltx/en_us_oca/me.m08.d05:meVE.AposGlory.text
ltx/en_us_oca/me.m08.d06:meVE.Lity3.incipit	Christ, the light that shone…
ltx/en_us_oca/me.m08.d06:meVE.Lity3.melody	
ltx/en_us_oca/me.m08.d06:meVE.Lity3.mode	@ltx/en_us_oca/miscellanea:misc.Mode2
ltx/en_us_oca/me.m08.d06:meVE.Lity3.text	Christ, the light that shone before the sun, ⁄ was on the earth in the flesh. ⁄ In a manner fitting His divine majesty, ⁄ He fulfilled His fearful dispensation before His Crucifixion! ⁄ Today upon Mount Tabor ⁄ He has mystically made known the image of the Trinity. ⁄ For taking apart the expressly chosen disciples, Peter, James and John, ⁄ He led them up into the mountain alone. ⁄ Briefly, He concealed the flesh He had assumed, ⁄ and was transfigured before them, ⁄ manifesting the original beauty, though short of full perfection. ⁄ For He spared them as He assured them, lest seeing, they die. ⁄ Yet they saw as far as they could bear it. ⁄ He likewise called before Him the chief prophets Moses and Elijah, ⁄ who testified to His divinity: ⁄ that He is indeed the true brightness of the essence of the Father, ⁄ the Ruler of the living and the dead. ⁄ Therefore, a cloud covered them like a tent, ⁄ and there came the voice of the Father in testimony, saying: ⁄ This is My beloved Son, ⁄ Whom I have begotten without change from the womb before the morning star: ⁄ I have sent Him to save those who are baptized ⁄ in the name of the Father, Son and Holy Spirit, ⁄ and who confess with faith that the one power of the Godhead is indivisible: ⁄ listen to Him! ⁄ Christ our God, supreme in goodness and the Lover of mankind: ⁄ Shine upon us with the light of Your unapproachable glory ⁄⁄ and make us worthy to inherit Your eternal kingdom!
ltx/en_us_oca/me.m08.d06:meVE.LityBoth.incipit	…
ltx/en_us_oca/me.m08.d06:meVE.LityBoth.melody	
ltx/en_us_oca/me.m08.d06:meVE.LityBoth.mode	@ltx/en_us_oca/miscellanea:misc.Mode5
ltx/en_us_oca/me.m08.d06:meVE.LityBoth.text	
ltx/en_us_oca/me.m08.d06:meVE.LityGlory.incipit	…
ltx/en_us_oca/me.m08.d06:meVE.LityGlory.melody	
ltx/en_us_oca/me.m08.d06:meVE.LityGlory.mode	@ltx/en_us_oca/miscellanea:misc.Mode5
ltx/en_us_oca/me.m08.d06:meVE.LityGlory.text	
ltx/en_us_oca/me.m08.d06:meVE.MM.Stichera1234as78910.text	@ltx/en_us_oca/properties:media.key
ltx/en_us_oca/me.m08.d06:meVE.SticGlory.incipit	…
ltx/en_us_oca/me.m08.d06:meVE.SticGlory.melody	
ltx/en_us_oca/me.m08.d06:meVE.SticGlory.mode	@ltx/en_us_oca/miscellanea:misc.Mode6
ltx/en_us_oca/me.m08.d06:meVE.SticGlory.poet	@ltx/en_us_oca/poets:po.Anatoliou
ltx/en_us_oca/me.m08.d06:meVE.SticGlory.text	
ltx/en_us_oca/me.m08.d06:meVE.Stichera01.incipit	…
ltx/en_us_oca/me.m08.d06:meVE.Stichera01.melody	
ltx/en_us_oca/me.m08.d06:meVE.Stichera01.mode	@ltx/en_us_oca/miscellanea:misc.Mode4
ltx/en_us_oca/me.m08.d06:meVE.Stichera01.poet	@ltx/en_us_oca/poets:po.KosmaMonachou
ltx/en_us_oca/me.m08.d06:meVE.Stichera01.text	
ltx/en_us_oca/me.m08.d06:meVE.Stichera02.incipit	…
ltx/en_us_oca/me.m08.d06:meVE.Stichera02.melody	
ltx/en_us_oca/me.m08.d06:meVE.Stichera02.mode	@ltx/en_us_oca/miscellanea:misc.Mode4
ltx/en_us_oca/me.m08.d06:meVE.Stichera02.text	
ltx/en_us_oca/me.m08.d06:meVE.Stichera03.incipit	…
ltx/en_us_oca/me.m08.d06:meVE.Stichera03.melody	
ltx/en_us_oca/me.m08.d06:meVE.Stichera03.mode	@ltx/en_us_oca/miscellanea:misc.Mode4
ltx/en_us_oca/me.m08.d06:meVE.Stichera03.text	
ltx/en_us_oca/me.m08.d06:meVE.Stichera04.incipit	…
ltx/en_us_oca/me.m08.d06:meVE.Stichera04.melody	
ltx/en_us_oca/me.m08.d06:meVE.Stichera04.mode	@ltx/en_us_oca/miscellanea:misc.Mode4
ltx/en_us_oca/me.m08.d06:meVE.Stichera04.text	
