ltx/en_us_oca/da.d1:daCommemoration.text	
ltx/en_us_oca/da.d1:daDay.text	
ltx/en_us_oca/da.d1:daForDay.text	
ltx/en_us_oca/da.d1:daLI.GospelAlleluia.text	@ltx/en_us_oca/prayers:pr.Alleluia3.text
ltx/en_us_oca/da.d1:daLI.MM.CommunionHymn.text	
ltx/en_us_oca/da.d1:daOnDay.text	
ltx/en_us_oca/da.d1:daVE.OnTheDayBefore.text	
ltx/en_us_oca/da.d1:daVE.OnTheEveningBefore.text	@ltx/en_us_oca/template.titles:d.onSaturdayEvening
