ltx/en_us_oca/me.m08.d12:meDA.commemoration.first	
ltx/en_us_oca/me.m08.d12:meDA.commemoration.first_name	
ltx/en_us_oca/me.m08.d12:meDA.commemoration.first_short	
ltx/en_us_oca/me.m08.d12:meDA.commemoration.first_title	
ltx/en_us_oca/me.m08.d12:meDA.commemoration.full	
ltx/en_us_oca/me.m08.d12:meDA.commemoration.second_name	
ltx/en_us_oca/me.m08.d12:meDA.commemoration.second_short	
ltx/en_us_oca/me.m08.d12:meDA.commemoration.second_title	
ltx/en_us_oca/me.m08.d12:meDA.date	
ltx/en_us_oca/me.m08.d12:meDA.dismissal	@ltx/en_us_oca/dismissals:dis00.transfiguration
ltx/en_us_oca/me.m08.d12:meDA.fordate	
ltx/en_us_oca/me.m08.d12:meDA.insert1	
ltx/en_us_oca/me.m08.d12:meDA.insert2	
ltx/en_us_oca/me.m08.d12:meDA.note	
ltx/en_us_oca/me.m08.d12:meDA.pdfcoverdate	
ltx/en_us_oca/me.m08.d12:meDA.pdfheaderdate	
ltx/en_us_oca/me.m08.d12:meHO.commemorations	
ltx/en_us_oca/me.m08.d12:meHO.note1	
ltx/en_us_oca/me.m08.d12:meHO.note2	
ltx/en_us_oca/me.m08.d12:meHO.number	
ltx/en_us_oca/me.m08.d12:meHO.rank	
ltx/en_us_oca/me.m08.d12:meLE.commemoration1	
ltx/en_us_oca/me.m08.d12:meLE.commemoration2	
ltx/en_us_oca/me.m08.d12:meLI.Kontakion1.greekmelody	@ltx/en_us_oca/me.m08.d12:meMA.Kontakion1.greekmelody
ltx/en_us_oca/me.m08.d12:meLI.Kontakion1.incipit	@ltx/en_us_oca/me.m08.d12:meMA.Kontakion1.incipit
ltx/en_us_oca/me.m08.d12:meLI.Kontakion1.melody	@ltx/en_us_oca/me.m08.d12:meMA.Kontakion1.melody
ltx/en_us_oca/me.m08.d12:meLI.Kontakion1.mode	@ltx/en_us_oca/me.m08.d12:meMA.Kontakion1.mode
ltx/en_us_oca/me.m08.d12:meLI.Kontakion1.text	@ltx/en_us_oca/me.m08.d12:meMA.Kontakion1.text
ltx/en_us_oca/me.m08.d12:meLI.Megalynarion.text	
ltx/en_us_oca/me.m08.d12:meMA.AposGlory.incipit	…
ltx/en_us_oca/me.m08.d12:meMA.AposGlory.melody	@ltx/en_us_oca/he.a.m2:heAU.OikosTouEfratha.notmetered
ltx/en_us_oca/me.m08.d12:meMA.AposGlory.mode	@ltx/en_us_oca/miscellanea:misc.Mode2
ltx/en_us_oca/me.m08.d12:meMA.AposGlory.text	
ltx/en_us_oca/me.m08.d12:meMA.Aposticha1.greekmelody	@ltx/en_us_oca/he.a.m2:heAU.OikosTouEfratha.greekname
ltx/en_us_oca/me.m08.d12:meMA.Aposticha1.incipit	…
ltx/en_us_oca/me.m08.d12:meMA.Aposticha1.melody	@ltx/en_us_oca/he.a.m2:heAU.OikosTouEfratha.notmetered
ltx/en_us_oca/me.m08.d12:meMA.Aposticha1.mode	@ltx/en_us_oca/miscellanea:misc.Mode2
ltx/en_us_oca/me.m08.d12:meMA.Aposticha1.text	
ltx/en_us_oca/me.m08.d12:meMA.Aposticha2.incipit	…
ltx/en_us_oca/me.m08.d12:meMA.Aposticha2.melody	@ltx/en_us_oca/he.a.m2:heAU.OikosTouEfratha.notmetered
ltx/en_us_oca/me.m08.d12:meMA.Aposticha2.mode	@ltx/en_us_oca/miscellanea:misc.Mode2
ltx/en_us_oca/me.m08.d12:meMA.Aposticha2.text	
ltx/en_us_oca/me.m08.d12:meMA.Aposticha3.incipit	…
ltx/en_us_oca/me.m08.d12:meMA.Aposticha3.melody	@ltx/en_us_oca/he.a.m2:heAU.OikosTouEfratha.notmetered
ltx/en_us_oca/me.m08.d12:meMA.Aposticha3.mode	@ltx/en_us_oca/miscellanea:misc.Mode2
ltx/en_us_oca/me.m08.d12:meMA.Aposticha3.text	
ltx/en_us_oca/me.m08.d12:meMA.C1.acrostic.notice1	
ltx/en_us_oca/me.m08.d12:meMA.C1.acrostic.text	
ltx/en_us_oca/me.m08.d12:meMA.C1.acrostic.title	
ltx/en_us_oca/me.m08.d12:meMA.C1.title	@ltx/en_us_oca/titles:ti.CanonMartyrs
ltx/en_us_oca/me.m08.d12:meMA.C1.verse	@ltx/en_us_oca/prayers:pr.verse_SaintsM.text
ltx/en_us_oca/me.m08.d12:meMA.C2.acrostic.notice1	
ltx/en_us_oca/me.m08.d12:meMA.C2.acrostic.text	
ltx/en_us_oca/me.m08.d12:meMA.C2.acrostic.title	
ltx/en_us_oca/me.m08.d12:meMA.C2.poet	@ltx/en_us_oca/poets:po.IoannouMonachou
ltx/en_us_oca/me.m08.d12:meMA.C2.title	@ltx/en_us_oca/titles:ti.CanonDevoutM
ltx/en_us_oca/me.m08.d12:meMA.C2.verse	@ltx/en_us_oca/prayers:pr.verse_DevoutMan.text
ltx/en_us_oca/me.m08.d12:meMA.Exaposteilarion1.greekmelody	@ltx/en_us_oca/he.a.m2:heAU.GynaikesAkoutisthite.greekname
ltx/en_us_oca/me.m08.d12:meMA.Exaposteilarion1.incipit	…
ltx/en_us_oca/me.m08.d12:meMA.Exaposteilarion1.melody	@ltx/en_us_oca/he.a.m2:heAU.GynaikesAkoutisthite.notmetered
ltx/en_us_oca/me.m08.d12:meMA.Exaposteilarion1.mode	@ltx/en_us_oca/miscellanea:misc.Mode2
ltx/en_us_oca/me.m08.d12:meMA.Exaposteilarion1.text	
ltx/en_us_oca/me.m08.d12:meMA.Exaposteilarion2.greekmelody	@ltx/en_us_oca/he.a.m3:heAU.FosAnalloioton.greekname
ltx/en_us_oca/me.m08.d12:meMA.Exaposteilarion2.incipit	…
ltx/en_us_oca/me.m08.d12:meMA.Exaposteilarion2.melody	@ltx/en_us_oca/he.a.m3:heAU.FosAnalloioton.notmetered
ltx/en_us_oca/me.m08.d12:meMA.Exaposteilarion2.mode	@ltx/en_us_oca/miscellanea:misc.Mode3
ltx/en_us_oca/me.m08.d12:meMA.Exaposteilarion2.text	
ltx/en_us_oca/me.m08.d12:meMA.Exaposteilarion3.greekmelody	@ltx/en_us_oca/he.a.m3:heAU.FosAnalloioton.greekname
ltx/en_us_oca/me.m08.d12:meMA.Exaposteilarion3.incipit	@ltx/en_us_oca/he.a.m3:heAU.FosAnalloioton.incipit
ltx/en_us_oca/me.m08.d12:meMA.Exaposteilarion3.melody	@ltx/en_us_oca/he.a.m3:heAU.FosAnalloioton.melody
ltx/en_us_oca/me.m08.d12:meMA.Exaposteilarion3.mode	@ltx/en_us_oca/miscellanea:misc.Mode3
ltx/en_us_oca/me.m08.d12:meMA.Exaposteilarion3.text	@ltx/en_us_oca/he.a.m3:heAU.FosAnalloioton.text
ltx/en_us_oca/me.m08.d12:meMA.Kathisma11.greekmelody	@ltx/en_us_oca/he.a.m4:heAU.KateplagiIosif.greekname
ltx/en_us_oca/me.m08.d12:meMA.Kathisma11.incipit	@ltx/en_us_oca/me.m08.d06:meMA.Kathisma11.incipit
ltx/en_us_oca/me.m08.d12:meMA.Kathisma11.melody	@ltx/en_us_oca/he.a.m4:heAU.KateplagiIosif.notmetered
ltx/en_us_oca/me.m08.d12:meMA.Kathisma11.mode	@ltx/en_us_oca/miscellanea:misc.Mode4
ltx/en_us_oca/me.m08.d12:meMA.Kathisma11.text	@ltx/en_us_oca/me.m08.d06:meMA.Kathisma11.text
ltx/en_us_oca/me.m08.d12:meMA.Kathisma21.greekmelody	@ltx/en_us_oca/he.a.m4:heAU.KateplagiIosif.greekname
ltx/en_us_oca/me.m08.d12:meMA.Kathisma21.incipit	@ltx/en_us_oca/me.m08.d08:meMA.Kathisma21.incipit
ltx/en_us_oca/me.m08.d12:meMA.Kathisma21.melody	@ltx/en_us_oca/he.a.m4:heAU.KateplagiIosif.notmetered
ltx/en_us_oca/me.m08.d12:meMA.Kathisma21.mode	@ltx/en_us_oca/miscellanea:misc.Mode4
ltx/en_us_oca/me.m08.d12:meMA.Kathisma21.text	@ltx/en_us_oca/me.m08.d08:meMA.Kathisma21.text
ltx/en_us_oca/me.m08.d12:meMA.Kontakion1.greekmelody	@ltx/en_us_oca/he.a.m6:heAU.TinYperImon.greekname
ltx/en_us_oca/me.m08.d12:meMA.Kontakion1.incipit	…
ltx/en_us_oca/me.m08.d12:meMA.Kontakion1.melody	@ltx/en_us_oca/he.a.m6:heAU.TinYperImon.notmetered
ltx/en_us_oca/me.m08.d12:meMA.Kontakion1.mode	@ltx/en_us_oca/miscellanea:misc.Mode6
ltx/en_us_oca/me.m08.d12:meMA.Kontakion1.text	
ltx/en_us_oca/me.m08.d12:meMA.Kontakion2.greekmelody	@ltx/en_us_oca/he.a.m2:heAU.TaAnoZiton.greekname
ltx/en_us_oca/me.m08.d12:meMA.Kontakion2.incipit	…
ltx/en_us_oca/me.m08.d12:meMA.Kontakion2.melody	@ltx/en_us_oca/he.a.m2:heAU.TaAnoZiton.notmetered
ltx/en_us_oca/me.m08.d12:meMA.Kontakion2.mode	@ltx/en_us_oca/miscellanea:misc.Mode2
ltx/en_us_oca/me.m08.d12:meMA.Kontakion2.text	
ltx/en_us_oca/me.m08.d12:meMA.Ode1C11.greekmelody	@ltx/en_us_oca/he.h.m4:heHE.ThalassisToErythraion.greekname
ltx/en_us_oca/me.m08.d12:meMA.Ode1C11.incipit	…
ltx/en_us_oca/me.m08.d12:meMA.Ode1C11.melody	@ltx/en_us_oca/he.h.m4:heHE.ThalassisToErythraion.notmetered
ltx/en_us_oca/me.m08.d12:meMA.Ode1C11.mode	@ltx/en_us_oca/miscellanea:misc.Mode4
ltx/en_us_oca/me.m08.d12:meMA.Ode1C11.ode	@ltx/en_us_oca/miscellanea:misc.Ode1
ltx/en_us_oca/me.m08.d12:meMA.Ode1C11.text	
ltx/en_us_oca/me.m08.d12:meMA.Ode1C12.incipit	…
ltx/en_us_oca/me.m08.d12:meMA.Ode1C12.melody	@ltx/en_us_oca/he.h.m4:heHE.ThalassisToErythraion.notmetered
ltx/en_us_oca/me.m08.d12:meMA.Ode1C12.mode	@ltx/en_us_oca/miscellanea:misc.Mode4
ltx/en_us_oca/me.m08.d12:meMA.Ode1C12.ode	@ltx/en_us_oca/miscellanea:misc.Ode1
ltx/en_us_oca/me.m08.d12:meMA.Ode1C12.text	
ltx/en_us_oca/me.m08.d12:meMA.Ode1C13.incipit	…
ltx/en_us_oca/me.m08.d12:meMA.Ode1C13.melody	@ltx/en_us_oca/he.h.m4:heHE.ThalassisToErythraion.notmetered
ltx/en_us_oca/me.m08.d12:meMA.Ode1C13.mode	@ltx/en_us_oca/miscellanea:misc.Mode4
ltx/en_us_oca/me.m08.d12:meMA.Ode1C13.ode	@ltx/en_us_oca/miscellanea:misc.Ode1
ltx/en_us_oca/me.m08.d12:meMA.Ode1C13.text	
ltx/en_us_oca/me.m08.d12:meMA.Ode1C1T.incipit	…
ltx/en_us_oca/me.m08.d12:meMA.Ode1C1T.melody	@ltx/en_us_oca/he.h.m4:heHE.ThalassisToErythraion.notmetered
ltx/en_us_oca/me.m08.d12:meMA.Ode1C1T.mode	@ltx/en_us_oca/miscellanea:misc.Mode4
ltx/en_us_oca/me.m08.d12:meMA.Ode1C1T.ode	@ltx/en_us_oca/miscellanea:misc.Ode1
ltx/en_us_oca/me.m08.d12:meMA.Ode1C1T.text	
ltx/en_us_oca/me.m08.d12:meMA.Ode1C21.greekmelody	@ltx/en_us_oca/he.h.m8:heHE.AsomenToKyrio.greekname
ltx/en_us_oca/me.m08.d12:meMA.Ode1C21.incipit	…
ltx/en_us_oca/me.m08.d12:meMA.Ode1C21.melody	@ltx/en_us_oca/he.h.m8:heHE.AsomenToKyrio.notmetered
ltx/en_us_oca/me.m08.d12:meMA.Ode1C21.mode	@ltx/en_us_oca/miscellanea:misc.Mode8
ltx/en_us_oca/me.m08.d12:meMA.Ode1C21.ode	@ltx/en_us_oca/miscellanea:misc.Ode1
ltx/en_us_oca/me.m08.d12:meMA.Ode1C21.text	
ltx/en_us_oca/me.m08.d12:meMA.Ode1C22.incipit	…
ltx/en_us_oca/me.m08.d12:meMA.Ode1C22.melody	@ltx/en_us_oca/he.h.m8:heHE.AsomenToKyrio.notmetered
ltx/en_us_oca/me.m08.d12:meMA.Ode1C22.mode	@ltx/en_us_oca/miscellanea:misc.Mode8
ltx/en_us_oca/me.m08.d12:meMA.Ode1C22.ode	@ltx/en_us_oca/miscellanea:misc.Ode1
ltx/en_us_oca/me.m08.d12:meMA.Ode1C22.text	
ltx/en_us_oca/me.m08.d12:meMA.Ode1C23.incipit	…
ltx/en_us_oca/me.m08.d12:meMA.Ode1C23.melody	@ltx/en_us_oca/he.h.m8:heHE.AsomenToKyrio.notmetered
ltx/en_us_oca/me.m08.d12:meMA.Ode1C23.mode	@ltx/en_us_oca/miscellanea:misc.Mode8
ltx/en_us_oca/me.m08.d12:meMA.Ode1C23.ode	@ltx/en_us_oca/miscellanea:misc.Ode1
ltx/en_us_oca/me.m08.d12:meMA.Ode1C23.text	
ltx/en_us_oca/me.m08.d12:meMA.Ode1C2T.incipit	…
ltx/en_us_oca/me.m08.d12:meMA.Ode1C2T.melody	@ltx/en_us_oca/he.h.m8:heHE.AsomenToKyrio.notmetered
ltx/en_us_oca/me.m08.d12:meMA.Ode1C2T.mode	@ltx/en_us_oca/miscellanea:misc.Mode8
ltx/en_us_oca/me.m08.d12:meMA.Ode1C2T.ode	@ltx/en_us_oca/miscellanea:misc.Ode1
ltx/en_us_oca/me.m08.d12:meMA.Ode1C2T.text	
ltx/en_us_oca/me.m08.d12:meMA.Ode3C11.greekmelody	@ltx/en_us_oca/he.h.m4:heHE.EffrainetaiEpiSoi.greekname
ltx/en_us_oca/me.m08.d12:meMA.Ode3C11.incipit	…
ltx/en_us_oca/me.m08.d12:meMA.Ode3C11.melody	@ltx/en_us_oca/he.h.m4:heHE.EffrainetaiEpiSoi.notmetered
ltx/en_us_oca/me.m08.d12:meMA.Ode3C11.mode	@ltx/en_us_oca/miscellanea:misc.Mode4
ltx/en_us_oca/me.m08.d12:meMA.Ode3C11.ode	@ltx/en_us_oca/miscellanea:misc.Ode3
ltx/en_us_oca/me.m08.d12:meMA.Ode3C11.text	
ltx/en_us_oca/me.m08.d12:meMA.Ode3C12.incipit	…
ltx/en_us_oca/me.m08.d12:meMA.Ode3C12.melody	@ltx/en_us_oca/he.h.m4:heHE.EffrainetaiEpiSoi.notmetered
ltx/en_us_oca/me.m08.d12:meMA.Ode3C12.mode	@ltx/en_us_oca/miscellanea:misc.Mode4
ltx/en_us_oca/me.m08.d12:meMA.Ode3C12.ode	@ltx/en_us_oca/miscellanea:misc.Ode3
ltx/en_us_oca/me.m08.d12:meMA.Ode3C12.text	
ltx/en_us_oca/me.m08.d12:meMA.Ode3C13.incipit	…
ltx/en_us_oca/me.m08.d12:meMA.Ode3C13.melody	@ltx/en_us_oca/he.h.m4:heHE.EffrainetaiEpiSoi.notmetered
ltx/en_us_oca/me.m08.d12:meMA.Ode3C13.mode	@ltx/en_us_oca/miscellanea:misc.Mode4
ltx/en_us_oca/me.m08.d12:meMA.Ode3C13.ode	@ltx/en_us_oca/miscellanea:misc.Ode3
ltx/en_us_oca/me.m08.d12:meMA.Ode3C13.text	
ltx/en_us_oca/me.m08.d12:meMA.Ode3C1T.incipit	…
ltx/en_us_oca/me.m08.d12:meMA.Ode3C1T.melody	@ltx/en_us_oca/he.h.m4:heHE.EffrainetaiEpiSoi.notmetered
ltx/en_us_oca/me.m08.d12:meMA.Ode3C1T.mode	@ltx/en_us_oca/miscellanea:misc.Mode4
ltx/en_us_oca/me.m08.d12:meMA.Ode3C1T.ode	@ltx/en_us_oca/miscellanea:misc.Ode3
ltx/en_us_oca/me.m08.d12:meMA.Ode3C1T.text	
ltx/en_us_oca/me.m08.d12:meMA.Ode3C21.greekmelody	@ltx/en_us_oca/he.h.m8:heHE.SyEiToStereoma.greekname
ltx/en_us_oca/me.m08.d12:meMA.Ode3C21.incipit	…
ltx/en_us_oca/me.m08.d12:meMA.Ode3C21.melody	@ltx/en_us_oca/he.h.m8:heHE.SyEiToStereoma.notmetered
ltx/en_us_oca/me.m08.d12:meMA.Ode3C21.mode	@ltx/en_us_oca/miscellanea:misc.Mode8
ltx/en_us_oca/me.m08.d12:meMA.Ode3C21.ode	@ltx/en_us_oca/miscellanea:misc.Ode3
ltx/en_us_oca/me.m08.d12:meMA.Ode3C21.text	
ltx/en_us_oca/me.m08.d12:meMA.Ode3C22.incipit	…
ltx/en_us_oca/me.m08.d12:meMA.Ode3C22.melody	@ltx/en_us_oca/he.h.m8:heHE.SyEiToStereoma.notmetered
ltx/en_us_oca/me.m08.d12:meMA.Ode3C22.mode	@ltx/en_us_oca/miscellanea:misc.Mode8
ltx/en_us_oca/me.m08.d12:meMA.Ode3C22.ode	@ltx/en_us_oca/miscellanea:misc.Ode3
ltx/en_us_oca/me.m08.d12:meMA.Ode3C22.text	
ltx/en_us_oca/me.m08.d12:meMA.Ode3C23.incipit	…
ltx/en_us_oca/me.m08.d12:meMA.Ode3C23.melody	@ltx/en_us_oca/he.h.m8:heHE.SyEiToStereoma.notmetered
ltx/en_us_oca/me.m08.d12:meMA.Ode3C23.mode	@ltx/en_us_oca/miscellanea:misc.Mode8
ltx/en_us_oca/me.m08.d12:meMA.Ode3C23.ode	@ltx/en_us_oca/miscellanea:misc.Ode3
ltx/en_us_oca/me.m08.d12:meMA.Ode3C23.text	
ltx/en_us_oca/me.m08.d12:meMA.Ode3C2T.incipit	…
ltx/en_us_oca/me.m08.d12:meMA.Ode3C2T.melody	@ltx/en_us_oca/he.h.m8:heHE.SyEiToStereoma.notmetered
ltx/en_us_oca/me.m08.d12:meMA.Ode3C2T.mode	@ltx/en_us_oca/miscellanea:misc.Mode8
ltx/en_us_oca/me.m08.d12:meMA.Ode3C2T.ode	@ltx/en_us_oca/miscellanea:misc.Ode3
ltx/en_us_oca/me.m08.d12:meMA.Ode3C2T.text	
ltx/en_us_oca/me.m08.d12:meMA.Ode3H.greekmelody	@ltx/en_us_oca/he.h.m8:heHE.SyEiToStereoma.greekname
ltx/en_us_oca/me.m08.d12:meMA.Ode3H.incipit	@ltx/en_us_oca/he.h.m8:heHE.SyEiToStereoma.incipit
ltx/en_us_oca/me.m08.d12:meMA.Ode3H.melody	@ltx/en_us_oca/he.h.m8:heHE.SyEiToStereoma.melody
ltx/en_us_oca/me.m08.d12:meMA.Ode3H.mode	@ltx/en_us_oca/miscellanea:misc.Mode8
ltx/en_us_oca/me.m08.d12:meMA.Ode3H.ode	@ltx/en_us_oca/miscellanea:misc.Ode3
ltx/en_us_oca/me.m08.d12:meMA.Ode3H.text	@ltx/en_us_oca/he.h.m8:heHE.SyEiToStereoma.text
ltx/en_us_oca/me.m08.d12:meMA.Ode3Kathisma1.greekmelody	@ltx/en_us_oca/he.a.m4:heAU.OYpsotheisEnToStavro.greekname
ltx/en_us_oca/me.m08.d12:meMA.Ode3Kathisma1.incipit	…
ltx/en_us_oca/me.m08.d12:meMA.Ode3Kathisma1.melody	@ltx/en_us_oca/he.a.m4:heAU.OYpsotheisEnToStavro.notmetered
ltx/en_us_oca/me.m08.d12:meMA.Ode3Kathisma1.mode	@ltx/en_us_oca/miscellanea:misc.Mode4
ltx/en_us_oca/me.m08.d12:meMA.Ode3Kathisma1.text	
ltx/en_us_oca/me.m08.d12:meMA.Ode3Kathisma2.greekmelody	@ltx/en_us_oca/he.a.m3:heAU.TinOraiotita.greekname
ltx/en_us_oca/me.m08.d12:meMA.Ode3Kathisma2.incipit	…
ltx/en_us_oca/me.m08.d12:meMA.Ode3Kathisma2.melody	@ltx/en_us_oca/he.a.m3:heAU.TinOraiotita.notmetered
ltx/en_us_oca/me.m08.d12:meMA.Ode3Kathisma2.mode	@ltx/en_us_oca/miscellanea:misc.Mode3
ltx/en_us_oca/me.m08.d12:meMA.Ode3Kathisma2.text	
ltx/en_us_oca/me.m08.d12:meMA.Ode3Kathisma3.greekmelody	@ltx/en_us_oca/he.a.m3:heAU.TinOraiotita.greekname
ltx/en_us_oca/me.m08.d12:meMA.Ode3Kathisma3.incipit	@ltx/en_us_oca/me.m08.d08:meMA.Ode3Kathisma2.incipit
ltx/en_us_oca/me.m08.d12:meMA.Ode3Kathisma3.melody	@ltx/en_us_oca/he.a.m3:heAU.TinOraiotita.notmetered
ltx/en_us_oca/me.m08.d12:meMA.Ode3Kathisma3.mode	@ltx/en_us_oca/miscellanea:misc.Mode3
ltx/en_us_oca/me.m08.d12:meMA.Ode3Kathisma3.text	@ltx/en_us_oca/me.m08.d08:meMA.Ode3Kathisma2.text
ltx/en_us_oca/me.m08.d12:meMA.Ode4C11.greekmelody	@ltx/en_us_oca/he.h.m4:heHE.EparthentaSeIdousa.greekname
ltx/en_us_oca/me.m08.d12:meMA.Ode4C11.incipit	…
ltx/en_us_oca/me.m08.d12:meMA.Ode4C11.melody	@ltx/en_us_oca/he.h.m4:heHE.EparthentaSeIdousa.notmetered
ltx/en_us_oca/me.m08.d12:meMA.Ode4C11.mode	@ltx/en_us_oca/miscellanea:misc.Mode4
ltx/en_us_oca/me.m08.d12:meMA.Ode4C11.ode	@ltx/en_us_oca/miscellanea:misc.Ode4
ltx/en_us_oca/me.m08.d12:meMA.Ode4C11.text	
ltx/en_us_oca/me.m08.d12:meMA.Ode4C12.incipit	…
ltx/en_us_oca/me.m08.d12:meMA.Ode4C12.melody	@ltx/en_us_oca/he.h.m4:heHE.EparthentaSeIdousa.notmetered
ltx/en_us_oca/me.m08.d12:meMA.Ode4C12.mode	@ltx/en_us_oca/miscellanea:misc.Mode4
ltx/en_us_oca/me.m08.d12:meMA.Ode4C12.ode	@ltx/en_us_oca/miscellanea:misc.Ode4
ltx/en_us_oca/me.m08.d12:meMA.Ode4C12.text	
ltx/en_us_oca/me.m08.d12:meMA.Ode4C13.incipit	…
ltx/en_us_oca/me.m08.d12:meMA.Ode4C13.melody	@ltx/en_us_oca/he.h.m4:heHE.EparthentaSeIdousa.notmetered
ltx/en_us_oca/me.m08.d12:meMA.Ode4C13.mode	@ltx/en_us_oca/miscellanea:misc.Mode4
ltx/en_us_oca/me.m08.d12:meMA.Ode4C13.ode	@ltx/en_us_oca/miscellanea:misc.Ode4
ltx/en_us_oca/me.m08.d12:meMA.Ode4C13.text	
ltx/en_us_oca/me.m08.d12:meMA.Ode4C14.incipit	…
ltx/en_us_oca/me.m08.d12:meMA.Ode4C14.melody	@ltx/en_us_oca/he.h.m4:heHE.EparthentaSeIdousa.notmetered
ltx/en_us_oca/me.m08.d12:meMA.Ode4C14.mode	@ltx/en_us_oca/miscellanea:misc.Mode4
ltx/en_us_oca/me.m08.d12:meMA.Ode4C14.ode	@ltx/en_us_oca/miscellanea:misc.Ode4
ltx/en_us_oca/me.m08.d12:meMA.Ode4C14.text	
ltx/en_us_oca/me.m08.d12:meMA.Ode4C1T.incipit	…
ltx/en_us_oca/me.m08.d12:meMA.Ode4C1T.melody	@ltx/en_us_oca/he.h.m4:heHE.EparthentaSeIdousa.notmetered
ltx/en_us_oca/me.m08.d12:meMA.Ode4C1T.mode	@ltx/en_us_oca/miscellanea:misc.Mode4
ltx/en_us_oca/me.m08.d12:meMA.Ode4C1T.ode	@ltx/en_us_oca/miscellanea:misc.Ode4
ltx/en_us_oca/me.m08.d12:meMA.Ode4C1T.text	
ltx/en_us_oca/me.m08.d12:meMA.Ode4C21.greekmelody	@ltx/en_us_oca/he.h.m8:heHE.EisakikoaKyrie.greekname
ltx/en_us_oca/me.m08.d12:meMA.Ode4C21.incipit	…
ltx/en_us_oca/me.m08.d12:meMA.Ode4C21.melody	@ltx/en_us_oca/he.h.m8:heHE.EisakikoaKyrie.notmetered
ltx/en_us_oca/me.m08.d12:meMA.Ode4C21.mode	@ltx/en_us_oca/miscellanea:misc.Mode8
ltx/en_us_oca/me.m08.d12:meMA.Ode4C21.ode	@ltx/en_us_oca/miscellanea:misc.Ode4
ltx/en_us_oca/me.m08.d12:meMA.Ode4C21.text	
ltx/en_us_oca/me.m08.d12:meMA.Ode4C22.incipit	…
ltx/en_us_oca/me.m08.d12:meMA.Ode4C22.melody	@ltx/en_us_oca/he.h.m8:heHE.EisakikoaKyrie.notmetered
ltx/en_us_oca/me.m08.d12:meMA.Ode4C22.mode	@ltx/en_us_oca/miscellanea:misc.Mode8
ltx/en_us_oca/me.m08.d12:meMA.Ode4C22.ode	@ltx/en_us_oca/miscellanea:misc.Ode4
ltx/en_us_oca/me.m08.d12:meMA.Ode4C22.text	
ltx/en_us_oca/me.m08.d12:meMA.Ode4C23.incipit	…
ltx/en_us_oca/me.m08.d12:meMA.Ode4C23.melody	@ltx/en_us_oca/he.h.m8:heHE.EisakikoaKyrie.notmetered
ltx/en_us_oca/me.m08.d12:meMA.Ode4C23.mode	@ltx/en_us_oca/miscellanea:misc.Mode8
ltx/en_us_oca/me.m08.d12:meMA.Ode4C23.ode	@ltx/en_us_oca/miscellanea:misc.Ode4
ltx/en_us_oca/me.m08.d12:meMA.Ode4C23.text	
ltx/en_us_oca/me.m08.d12:meMA.Ode4C24.incipit	…
ltx/en_us_oca/me.m08.d12:meMA.Ode4C24.melody	@ltx/en_us_oca/he.h.m8:heHE.EisakikoaKyrie.notmetered
ltx/en_us_oca/me.m08.d12:meMA.Ode4C24.mode	@ltx/en_us_oca/miscellanea:misc.Mode8
ltx/en_us_oca/me.m08.d12:meMA.Ode4C24.ode	@ltx/en_us_oca/miscellanea:misc.Ode4
ltx/en_us_oca/me.m08.d12:meMA.Ode4C24.text	
ltx/en_us_oca/me.m08.d12:meMA.Ode4C2T.incipit	…
ltx/en_us_oca/me.m08.d12:meMA.Ode4C2T.melody	@ltx/en_us_oca/he.h.m8:heHE.EisakikoaKyrie.notmetered
ltx/en_us_oca/me.m08.d12:meMA.Ode4C2T.mode	@ltx/en_us_oca/miscellanea:misc.Mode8
ltx/en_us_oca/me.m08.d12:meMA.Ode4C2T.ode	@ltx/en_us_oca/miscellanea:misc.Ode4
ltx/en_us_oca/me.m08.d12:meMA.Ode4C2T.text	
ltx/en_us_oca/me.m08.d12:meMA.Ode5C11.greekmelody	@ltx/en_us_oca/he.h.m4:heHE.SyKyrieMouFos.greekname
ltx/en_us_oca/me.m08.d12:meMA.Ode5C11.incipit	…
ltx/en_us_oca/me.m08.d12:meMA.Ode5C11.melody	@ltx/en_us_oca/he.h.m4:heHE.SyKyrieMouFos.notmetered
ltx/en_us_oca/me.m08.d12:meMA.Ode5C11.mode	@ltx/en_us_oca/miscellanea:misc.Mode4
ltx/en_us_oca/me.m08.d12:meMA.Ode5C11.ode	@ltx/en_us_oca/miscellanea:misc.Ode5
ltx/en_us_oca/me.m08.d12:meMA.Ode5C11.text	
ltx/en_us_oca/me.m08.d12:meMA.Ode5C12.incipit	…
ltx/en_us_oca/me.m08.d12:meMA.Ode5C12.melody	@ltx/en_us_oca/he.h.m4:heHE.SyKyrieMouFos.notmetered
ltx/en_us_oca/me.m08.d12:meMA.Ode5C12.mode	@ltx/en_us_oca/miscellanea:misc.Mode4
ltx/en_us_oca/me.m08.d12:meMA.Ode5C12.ode	@ltx/en_us_oca/miscellanea:misc.Ode5
ltx/en_us_oca/me.m08.d12:meMA.Ode5C12.text	
ltx/en_us_oca/me.m08.d12:meMA.Ode5C13.incipit	…
ltx/en_us_oca/me.m08.d12:meMA.Ode5C13.melody	@ltx/en_us_oca/he.h.m4:heHE.SyKyrieMouFos.notmetered
ltx/en_us_oca/me.m08.d12:meMA.Ode5C13.mode	@ltx/en_us_oca/miscellanea:misc.Mode4
ltx/en_us_oca/me.m08.d12:meMA.Ode5C13.ode	@ltx/en_us_oca/miscellanea:misc.Ode5
ltx/en_us_oca/me.m08.d12:meMA.Ode5C13.text	
ltx/en_us_oca/me.m08.d12:meMA.Ode5C1T.incipit	…
ltx/en_us_oca/me.m08.d12:meMA.Ode5C1T.melody	@ltx/en_us_oca/he.h.m4:heHE.SyKyrieMouFos.notmetered
ltx/en_us_oca/me.m08.d12:meMA.Ode5C1T.mode	@ltx/en_us_oca/miscellanea:misc.Mode4
ltx/en_us_oca/me.m08.d12:meMA.Ode5C1T.ode	@ltx/en_us_oca/miscellanea:misc.Ode5
ltx/en_us_oca/me.m08.d12:meMA.Ode5C1T.text	
ltx/en_us_oca/me.m08.d12:meMA.Ode5C21.greekmelody	@ltx/en_us_oca/he.h.m8:heHE.OrthrizontesVoomenSoi.greekname
ltx/en_us_oca/me.m08.d12:meMA.Ode5C21.incipit	…
ltx/en_us_oca/me.m08.d12:meMA.Ode5C21.melody	@ltx/en_us_oca/he.h.m8:heHE.OrthrizontesVoomenSoi.notmetered
ltx/en_us_oca/me.m08.d12:meMA.Ode5C21.mode	@ltx/en_us_oca/miscellanea:misc.Mode8
ltx/en_us_oca/me.m08.d12:meMA.Ode5C21.ode	@ltx/en_us_oca/miscellanea:misc.Ode5
ltx/en_us_oca/me.m08.d12:meMA.Ode5C21.text	
ltx/en_us_oca/me.m08.d12:meMA.Ode5C22.incipit	…
ltx/en_us_oca/me.m08.d12:meMA.Ode5C22.melody	@ltx/en_us_oca/he.h.m8:heHE.OrthrizontesVoomenSoi.notmetered
ltx/en_us_oca/me.m08.d12:meMA.Ode5C22.mode	@ltx/en_us_oca/miscellanea:misc.Mode8
ltx/en_us_oca/me.m08.d12:meMA.Ode5C22.ode	@ltx/en_us_oca/miscellanea:misc.Ode5
ltx/en_us_oca/me.m08.d12:meMA.Ode5C22.text	
ltx/en_us_oca/me.m08.d12:meMA.Ode5C23.incipit	…
ltx/en_us_oca/me.m08.d12:meMA.Ode5C23.melody	@ltx/en_us_oca/he.h.m8:heHE.OrthrizontesVoomenSoi.notmetered
ltx/en_us_oca/me.m08.d12:meMA.Ode5C23.mode	@ltx/en_us_oca/miscellanea:misc.Mode8
ltx/en_us_oca/me.m08.d12:meMA.Ode5C23.ode	@ltx/en_us_oca/miscellanea:misc.Ode5
ltx/en_us_oca/me.m08.d12:meMA.Ode5C23.text	
ltx/en_us_oca/me.m08.d12:meMA.Ode5C2T.incipit	…
ltx/en_us_oca/me.m08.d12:meMA.Ode5C2T.melody	@ltx/en_us_oca/he.h.m8:heHE.OrthrizontesVoomenSoi.notmetered
ltx/en_us_oca/me.m08.d12:meMA.Ode5C2T.mode	@ltx/en_us_oca/miscellanea:misc.Mode8
ltx/en_us_oca/me.m08.d12:meMA.Ode5C2T.ode	@ltx/en_us_oca/miscellanea:misc.Ode5
ltx/en_us_oca/me.m08.d12:meMA.Ode5C2T.text	
ltx/en_us_oca/me.m08.d12:meMA.Ode6C11.greekmelody	@ltx/en_us_oca/he.h.m4:heHE.ThysoSoiMetaFonis.greekname
ltx/en_us_oca/me.m08.d12:meMA.Ode6C11.incipit	…
ltx/en_us_oca/me.m08.d12:meMA.Ode6C11.melody	@ltx/en_us_oca/he.h.m4:heHE.ThysoSoiMetaFonis.notmetered
ltx/en_us_oca/me.m08.d12:meMA.Ode6C11.mode	@ltx/en_us_oca/miscellanea:misc.Mode4
ltx/en_us_oca/me.m08.d12:meMA.Ode6C11.ode	@ltx/en_us_oca/miscellanea:misc.Ode6
ltx/en_us_oca/me.m08.d12:meMA.Ode6C11.text	
ltx/en_us_oca/me.m08.d12:meMA.Ode6C12.incipit	…
ltx/en_us_oca/me.m08.d12:meMA.Ode6C12.melody	@ltx/en_us_oca/he.h.m4:heHE.ThysoSoiMetaFonis.notmetered
ltx/en_us_oca/me.m08.d12:meMA.Ode6C12.mode	@ltx/en_us_oca/miscellanea:misc.Mode4
ltx/en_us_oca/me.m08.d12:meMA.Ode6C12.ode	@ltx/en_us_oca/miscellanea:misc.Ode6
ltx/en_us_oca/me.m08.d12:meMA.Ode6C12.text	
ltx/en_us_oca/me.m08.d12:meMA.Ode6C13.incipit	…
ltx/en_us_oca/me.m08.d12:meMA.Ode6C13.melody	@ltx/en_us_oca/he.h.m4:heHE.ThysoSoiMetaFonis.notmetered
ltx/en_us_oca/me.m08.d12:meMA.Ode6C13.mode	@ltx/en_us_oca/miscellanea:misc.Mode4
ltx/en_us_oca/me.m08.d12:meMA.Ode6C13.ode	@ltx/en_us_oca/miscellanea:misc.Ode6
ltx/en_us_oca/me.m08.d12:meMA.Ode6C13.text	
ltx/en_us_oca/me.m08.d12:meMA.Ode6C1T.incipit	…
ltx/en_us_oca/me.m08.d12:meMA.Ode6C1T.melody	@ltx/en_us_oca/he.h.m4:heHE.ThysoSoiMetaFonis.notmetered
ltx/en_us_oca/me.m08.d12:meMA.Ode6C1T.mode	@ltx/en_us_oca/miscellanea:misc.Mode4
ltx/en_us_oca/me.m08.d12:meMA.Ode6C1T.ode	@ltx/en_us_oca/miscellanea:misc.Ode6
ltx/en_us_oca/me.m08.d12:meMA.Ode6C1T.text	
ltx/en_us_oca/me.m08.d12:meMA.Ode6C21.greekmelody	@ltx/en_us_oca/he.h.m8:heHE.ChitonaMoiParaschou.greekname
ltx/en_us_oca/me.m08.d12:meMA.Ode6C21.incipit	…
ltx/en_us_oca/me.m08.d12:meMA.Ode6C21.melody	@ltx/en_us_oca/he.h.m8:heHE.ChitonaMoiParaschou.notmetered
ltx/en_us_oca/me.m08.d12:meMA.Ode6C21.mode	@ltx/en_us_oca/miscellanea:misc.Mode8
ltx/en_us_oca/me.m08.d12:meMA.Ode6C21.ode	@ltx/en_us_oca/miscellanea:misc.Ode6
ltx/en_us_oca/me.m08.d12:meMA.Ode6C21.text	
ltx/en_us_oca/me.m08.d12:meMA.Ode6C22.incipit	…
ltx/en_us_oca/me.m08.d12:meMA.Ode6C22.melody	@ltx/en_us_oca/he.h.m8:heHE.ChitonaMoiParaschou.notmetered
ltx/en_us_oca/me.m08.d12:meMA.Ode6C22.mode	@ltx/en_us_oca/miscellanea:misc.Mode8
ltx/en_us_oca/me.m08.d12:meMA.Ode6C22.ode	@ltx/en_us_oca/miscellanea:misc.Ode6
ltx/en_us_oca/me.m08.d12:meMA.Ode6C22.text	
ltx/en_us_oca/me.m08.d12:meMA.Ode6C23.incipit	…
ltx/en_us_oca/me.m08.d12:meMA.Ode6C23.melody	@ltx/en_us_oca/he.h.m8:heHE.ChitonaMoiParaschou.notmetered
ltx/en_us_oca/me.m08.d12:meMA.Ode6C23.mode	@ltx/en_us_oca/miscellanea:misc.Mode8
ltx/en_us_oca/me.m08.d12:meMA.Ode6C23.ode	@ltx/en_us_oca/miscellanea:misc.Ode6
ltx/en_us_oca/me.m08.d12:meMA.Ode6C23.text	
ltx/en_us_oca/me.m08.d12:meMA.Ode6C2T.incipit	…
ltx/en_us_oca/me.m08.d12:meMA.Ode6C2T.melody	@ltx/en_us_oca/he.h.m8:heHE.ChitonaMoiParaschou.notmetered
ltx/en_us_oca/me.m08.d12:meMA.Ode6C2T.mode	@ltx/en_us_oca/miscellanea:misc.Mode8
ltx/en_us_oca/me.m08.d12:meMA.Ode6C2T.ode	@ltx/en_us_oca/miscellanea:misc.Ode6
ltx/en_us_oca/me.m08.d12:meMA.Ode6C2T.text	
ltx/en_us_oca/me.m08.d12:meMA.Ode6H.greekmelody	@ltx/en_us_oca/he.h.m8:heHE.ChitonaMoiParaschou.greekname
ltx/en_us_oca/me.m08.d12:meMA.Ode6H.incipit	@ltx/en_us_oca/he.h.m8:heHE.ChitonaMoiParaschou.incipit
ltx/en_us_oca/me.m08.d12:meMA.Ode6H.melody	@ltx/en_us_oca/he.h.m8:heHE.ChitonaMoiParaschou.melody
ltx/en_us_oca/me.m08.d12:meMA.Ode6H.mode	@ltx/en_us_oca/miscellanea:misc.Mode8
ltx/en_us_oca/me.m08.d12:meMA.Ode6H.ode	@ltx/en_us_oca/miscellanea:misc.Ode6
ltx/en_us_oca/me.m08.d12:meMA.Ode6H.text	@ltx/en_us_oca/he.h.m8:heHE.ChitonaMoiParaschou.text
ltx/en_us_oca/me.m08.d12:meMA.Ode7C11.greekmelody	@ltx/en_us_oca/he.h.m4:heHE.EnTiKaminoAvramiaioi.greekname
ltx/en_us_oca/me.m08.d12:meMA.Ode7C11.incipit	…
ltx/en_us_oca/me.m08.d12:meMA.Ode7C11.melody	@ltx/en_us_oca/he.h.m4:heHE.EnTiKaminoAvramiaioi.notmetered
ltx/en_us_oca/me.m08.d12:meMA.Ode7C11.mode	@ltx/en_us_oca/miscellanea:misc.Mode4
ltx/en_us_oca/me.m08.d12:meMA.Ode7C11.ode	@ltx/en_us_oca/miscellanea:misc.Ode7
ltx/en_us_oca/me.m08.d12:meMA.Ode7C11.text	
ltx/en_us_oca/me.m08.d12:meMA.Ode7C12.incipit	…
ltx/en_us_oca/me.m08.d12:meMA.Ode7C12.melody	@ltx/en_us_oca/he.h.m4:heHE.EnTiKaminoAvramiaioi.notmetered
ltx/en_us_oca/me.m08.d12:meMA.Ode7C12.mode	@ltx/en_us_oca/miscellanea:misc.Mode4
ltx/en_us_oca/me.m08.d12:meMA.Ode7C12.ode	@ltx/en_us_oca/miscellanea:misc.Ode7
ltx/en_us_oca/me.m08.d12:meMA.Ode7C12.text	
ltx/en_us_oca/me.m08.d12:meMA.Ode7C13.incipit	…
ltx/en_us_oca/me.m08.d12:meMA.Ode7C13.melody	@ltx/en_us_oca/he.h.m4:heHE.EnTiKaminoAvramiaioi.notmetered
ltx/en_us_oca/me.m08.d12:meMA.Ode7C13.mode	@ltx/en_us_oca/miscellanea:misc.Mode4
ltx/en_us_oca/me.m08.d12:meMA.Ode7C13.ode	@ltx/en_us_oca/miscellanea:misc.Ode7
ltx/en_us_oca/me.m08.d12:meMA.Ode7C13.text	
ltx/en_us_oca/me.m08.d12:meMA.Ode7C1T.incipit	…
ltx/en_us_oca/me.m08.d12:meMA.Ode7C1T.melody	@ltx/en_us_oca/he.h.m4:heHE.EnTiKaminoAvramiaioi.notmetered
ltx/en_us_oca/me.m08.d12:meMA.Ode7C1T.mode	@ltx/en_us_oca/miscellanea:misc.Mode4
ltx/en_us_oca/me.m08.d12:meMA.Ode7C1T.ode	@ltx/en_us_oca/miscellanea:misc.Ode7
ltx/en_us_oca/me.m08.d12:meMA.Ode7C1T.text	
ltx/en_us_oca/me.m08.d12:meMA.Ode7C21.greekmelody	@ltx/en_us_oca/he.h.m8:heHE.OiEkTisIoudaias.greekname
ltx/en_us_oca/me.m08.d12:meMA.Ode7C21.incipit	…
ltx/en_us_oca/me.m08.d12:meMA.Ode7C21.melody	@ltx/en_us_oca/he.h.m8:heHE.OiEkTisIoudaias.notmetered
ltx/en_us_oca/me.m08.d12:meMA.Ode7C21.mode	@ltx/en_us_oca/miscellanea:misc.Mode8
ltx/en_us_oca/me.m08.d12:meMA.Ode7C21.ode	@ltx/en_us_oca/miscellanea:misc.Ode7
ltx/en_us_oca/me.m08.d12:meMA.Ode7C21.text	
ltx/en_us_oca/me.m08.d12:meMA.Ode7C22.incipit	…
ltx/en_us_oca/me.m08.d12:meMA.Ode7C22.melody	@ltx/en_us_oca/he.h.m8:heHE.OiEkTisIoudaias.notmetered
ltx/en_us_oca/me.m08.d12:meMA.Ode7C22.mode	@ltx/en_us_oca/miscellanea:misc.Mode8
ltx/en_us_oca/me.m08.d12:meMA.Ode7C22.ode	@ltx/en_us_oca/miscellanea:misc.Ode7
ltx/en_us_oca/me.m08.d12:meMA.Ode7C22.text	
ltx/en_us_oca/me.m08.d12:meMA.Ode7C23.incipit	…
ltx/en_us_oca/me.m08.d12:meMA.Ode7C23.melody	@ltx/en_us_oca/he.h.m8:heHE.OiEkTisIoudaias.notmetered
ltx/en_us_oca/me.m08.d12:meMA.Ode7C23.mode	@ltx/en_us_oca/miscellanea:misc.Mode8
ltx/en_us_oca/me.m08.d12:meMA.Ode7C23.ode	@ltx/en_us_oca/miscellanea:misc.Ode7
ltx/en_us_oca/me.m08.d12:meMA.Ode7C23.text	
ltx/en_us_oca/me.m08.d12:meMA.Ode7C24.incipit	…
ltx/en_us_oca/me.m08.d12:meMA.Ode7C24.melody	@ltx/en_us_oca/he.h.m8:heHE.OiEkTisIoudaias.notmetered
ltx/en_us_oca/me.m08.d12:meMA.Ode7C24.mode	@ltx/en_us_oca/miscellanea:misc.Mode8
ltx/en_us_oca/me.m08.d12:meMA.Ode7C24.ode	@ltx/en_us_oca/miscellanea:misc.Ode7
ltx/en_us_oca/me.m08.d12:meMA.Ode7C24.text	
ltx/en_us_oca/me.m08.d12:meMA.Ode8C11.greekmelody	@ltx/en_us_oca/he.h.m4:heHE.CheirasEkpetasasDaniil.greekname
ltx/en_us_oca/me.m08.d12:meMA.Ode8C11.incipit	…
ltx/en_us_oca/me.m08.d12:meMA.Ode8C11.melody	@ltx/en_us_oca/he.h.m4:heHE.CheirasEkpetasasDaniil.notmetered
ltx/en_us_oca/me.m08.d12:meMA.Ode8C11.mode	@ltx/en_us_oca/miscellanea:misc.Mode4
ltx/en_us_oca/me.m08.d12:meMA.Ode8C11.ode	@ltx/en_us_oca/miscellanea:misc.Ode8
ltx/en_us_oca/me.m08.d12:meMA.Ode8C11.text	
ltx/en_us_oca/me.m08.d12:meMA.Ode8C12.incipit	…
ltx/en_us_oca/me.m08.d12:meMA.Ode8C12.melody	@ltx/en_us_oca/he.h.m4:heHE.CheirasEkpetasasDaniil.notmetered
ltx/en_us_oca/me.m08.d12:meMA.Ode8C12.mode	@ltx/en_us_oca/miscellanea:misc.Mode4
ltx/en_us_oca/me.m08.d12:meMA.Ode8C12.ode	@ltx/en_us_oca/miscellanea:misc.Ode8
ltx/en_us_oca/me.m08.d12:meMA.Ode8C12.text	
ltx/en_us_oca/me.m08.d12:meMA.Ode8C13.incipit	…
ltx/en_us_oca/me.m08.d12:meMA.Ode8C13.melody	@ltx/en_us_oca/he.h.m4:heHE.CheirasEkpetasasDaniil.notmetered
ltx/en_us_oca/me.m08.d12:meMA.Ode8C13.mode	@ltx/en_us_oca/miscellanea:misc.Mode4
ltx/en_us_oca/me.m08.d12:meMA.Ode8C13.ode	@ltx/en_us_oca/miscellanea:misc.Ode8
ltx/en_us_oca/me.m08.d12:meMA.Ode8C13.text	
ltx/en_us_oca/me.m08.d12:meMA.Ode8C1T.incipit	…
ltx/en_us_oca/me.m08.d12:meMA.Ode8C1T.melody	@ltx/en_us_oca/he.h.m4:heHE.CheirasEkpetasasDaniil.notmetered
ltx/en_us_oca/me.m08.d12:meMA.Ode8C1T.mode	@ltx/en_us_oca/miscellanea:misc.Mode4
ltx/en_us_oca/me.m08.d12:meMA.Ode8C1T.ode	@ltx/en_us_oca/miscellanea:misc.Ode8
ltx/en_us_oca/me.m08.d12:meMA.Ode8C1T.text	
ltx/en_us_oca/me.m08.d12:meMA.Ode8C21.greekmelody	@ltx/en_us_oca/he.h.m8:heHE.NikitaiTyrannou.greekname
ltx/en_us_oca/me.m08.d12:meMA.Ode8C21.incipit	…
ltx/en_us_oca/me.m08.d12:meMA.Ode8C21.melody	@ltx/en_us_oca/he.h.m8:heHE.NikitaiTyrannou.notmetered
ltx/en_us_oca/me.m08.d12:meMA.Ode8C21.mode	@ltx/en_us_oca/miscellanea:misc.Mode8
ltx/en_us_oca/me.m08.d12:meMA.Ode8C21.ode	@ltx/en_us_oca/miscellanea:misc.Ode8
ltx/en_us_oca/me.m08.d12:meMA.Ode8C21.text	
ltx/en_us_oca/me.m08.d12:meMA.Ode8C22.incipit	…
ltx/en_us_oca/me.m08.d12:meMA.Ode8C22.melody	@ltx/en_us_oca/he.h.m8:heHE.NikitaiTyrannou.notmetered
ltx/en_us_oca/me.m08.d12:meMA.Ode8C22.mode	@ltx/en_us_oca/miscellanea:misc.Mode8
ltx/en_us_oca/me.m08.d12:meMA.Ode8C22.ode	@ltx/en_us_oca/miscellanea:misc.Ode8
ltx/en_us_oca/me.m08.d12:meMA.Ode8C22.text	
ltx/en_us_oca/me.m08.d12:meMA.Ode8C23.incipit	…
ltx/en_us_oca/me.m08.d12:meMA.Ode8C23.melody	@ltx/en_us_oca/he.h.m8:heHE.NikitaiTyrannou.notmetered
ltx/en_us_oca/me.m08.d12:meMA.Ode8C23.mode	@ltx/en_us_oca/miscellanea:misc.Mode8
ltx/en_us_oca/me.m08.d12:meMA.Ode8C23.ode	@ltx/en_us_oca/miscellanea:misc.Ode8
ltx/en_us_oca/me.m08.d12:meMA.Ode8C23.text	
ltx/en_us_oca/me.m08.d12:meMA.Ode8C24.incipit	…
ltx/en_us_oca/me.m08.d12:meMA.Ode8C24.melody	@ltx/en_us_oca/he.h.m8:heHE.NikitaiTyrannou.notmetered
ltx/en_us_oca/me.m08.d12:meMA.Ode8C24.mode	@ltx/en_us_oca/miscellanea:misc.Mode8
ltx/en_us_oca/me.m08.d12:meMA.Ode8C24.ode	@ltx/en_us_oca/miscellanea:misc.Ode8
ltx/en_us_oca/me.m08.d12:meMA.Ode8C24.text	
ltx/en_us_oca/me.m08.d12:meMA.Ode8C2T.incipit	…
ltx/en_us_oca/me.m08.d12:meMA.Ode8C2T.melody	@ltx/en_us_oca/he.h.m8:heHE.NikitaiTyrannou.notmetered
ltx/en_us_oca/me.m08.d12:meMA.Ode8C2T.mode	@ltx/en_us_oca/miscellanea:misc.Mode8
ltx/en_us_oca/me.m08.d12:meMA.Ode8C2T.ode	@ltx/en_us_oca/miscellanea:misc.Ode8
ltx/en_us_oca/me.m08.d12:meMA.Ode8C2T.text	
ltx/en_us_oca/me.m08.d12:meMA.Ode8H.greekmelody	@ltx/en_us_oca/he.h.m8:heHE.NikitaiTyrannou.greekname
ltx/en_us_oca/me.m08.d12:meMA.Ode8H.incipit	@ltx/en_us_oca/he.h.m8:heHE.NikitaiTyrannou.incipit
ltx/en_us_oca/me.m08.d12:meMA.Ode8H.melody	@ltx/en_us_oca/he.h.m8:heHE.NikitaiTyrannou.melody
ltx/en_us_oca/me.m08.d12:meMA.Ode8H.mode	@ltx/en_us_oca/miscellanea:misc.Mode8
ltx/en_us_oca/me.m08.d12:meMA.Ode8H.ode	@ltx/en_us_oca/miscellanea:misc.Ode8
ltx/en_us_oca/me.m08.d12:meMA.Ode8H.text	@ltx/en_us_oca/he.h.m8:heHE.NikitaiTyrannou.text
ltx/en_us_oca/me.m08.d12:meMA.Ode9C11.greekmelody	@ltx/en_us_oca/he.h.m4:heHE.LithosAcheirotmitos.greekname
ltx/en_us_oca/me.m08.d12:meMA.Ode9C11.incipit	…
ltx/en_us_oca/me.m08.d12:meMA.Ode9C11.melody	@ltx/en_us_oca/he.h.m4:heHE.LithosAcheirotmitos.notmetered
ltx/en_us_oca/me.m08.d12:meMA.Ode9C11.mode	@ltx/en_us_oca/miscellanea:misc.Mode4
ltx/en_us_oca/me.m08.d12:meMA.Ode9C11.ode	@ltx/en_us_oca/miscellanea:misc.Ode9
ltx/en_us_oca/me.m08.d12:meMA.Ode9C11.text	
ltx/en_us_oca/me.m08.d12:meMA.Ode9C12.incipit	…
ltx/en_us_oca/me.m08.d12:meMA.Ode9C12.melody	@ltx/en_us_oca/he.h.m4:heHE.LithosAcheirotmitos.notmetered
ltx/en_us_oca/me.m08.d12:meMA.Ode9C12.mode	@ltx/en_us_oca/miscellanea:misc.Mode4
ltx/en_us_oca/me.m08.d12:meMA.Ode9C12.ode	@ltx/en_us_oca/miscellanea:misc.Ode9
ltx/en_us_oca/me.m08.d12:meMA.Ode9C12.text	
ltx/en_us_oca/me.m08.d12:meMA.Ode9C13.incipit	…
ltx/en_us_oca/me.m08.d12:meMA.Ode9C13.melody	@ltx/en_us_oca/he.h.m4:heHE.LithosAcheirotmitos.notmetered
ltx/en_us_oca/me.m08.d12:meMA.Ode9C13.mode	@ltx/en_us_oca/miscellanea:misc.Mode4
ltx/en_us_oca/me.m08.d12:meMA.Ode9C13.ode	@ltx/en_us_oca/miscellanea:misc.Ode9
ltx/en_us_oca/me.m08.d12:meMA.Ode9C13.text	
ltx/en_us_oca/me.m08.d12:meMA.Ode9C14.incipit	…
ltx/en_us_oca/me.m08.d12:meMA.Ode9C14.melody	@ltx/en_us_oca/he.h.m4:heHE.LithosAcheirotmitos.notmetered
ltx/en_us_oca/me.m08.d12:meMA.Ode9C14.mode	@ltx/en_us_oca/miscellanea:misc.Mode4
ltx/en_us_oca/me.m08.d12:meMA.Ode9C14.ode	@ltx/en_us_oca/miscellanea:misc.Ode9
ltx/en_us_oca/me.m08.d12:meMA.Ode9C14.text	
ltx/en_us_oca/me.m08.d12:meMA.Ode9C1T.incipit	…
ltx/en_us_oca/me.m08.d12:meMA.Ode9C1T.melody	@ltx/en_us_oca/he.h.m4:heHE.LithosAcheirotmitos.notmetered
ltx/en_us_oca/me.m08.d12:meMA.Ode9C1T.mode	@ltx/en_us_oca/miscellanea:misc.Mode4
ltx/en_us_oca/me.m08.d12:meMA.Ode9C1T.ode	@ltx/en_us_oca/miscellanea:misc.Ode9
ltx/en_us_oca/me.m08.d12:meMA.Ode9C1T.text	
ltx/en_us_oca/me.m08.d12:meMA.Ode9C21.greekmelody	@ltx/en_us_oca/he.h.m8:heHE.TonProdilothenta.greekname
ltx/en_us_oca/me.m08.d12:meMA.Ode9C21.incipit	…
ltx/en_us_oca/me.m08.d12:meMA.Ode9C21.melody	@ltx/en_us_oca/he.h.m8:heHE.TonProdilothenta.notmetered
ltx/en_us_oca/me.m08.d12:meMA.Ode9C21.mode	@ltx/en_us_oca/miscellanea:misc.Mode8
ltx/en_us_oca/me.m08.d12:meMA.Ode9C21.ode	@ltx/en_us_oca/miscellanea:misc.Ode9
ltx/en_us_oca/me.m08.d12:meMA.Ode9C21.text	
ltx/en_us_oca/me.m08.d12:meMA.Ode9C22.incipit	…
ltx/en_us_oca/me.m08.d12:meMA.Ode9C22.melody	@ltx/en_us_oca/he.h.m8:heHE.TonProdilothenta.notmetered
ltx/en_us_oca/me.m08.d12:meMA.Ode9C22.mode	@ltx/en_us_oca/miscellanea:misc.Mode8
ltx/en_us_oca/me.m08.d12:meMA.Ode9C22.ode	@ltx/en_us_oca/miscellanea:misc.Ode9
ltx/en_us_oca/me.m08.d12:meMA.Ode9C22.text	
ltx/en_us_oca/me.m08.d12:meMA.Ode9C23.incipit	…
ltx/en_us_oca/me.m08.d12:meMA.Ode9C23.melody	@ltx/en_us_oca/he.h.m8:heHE.TonProdilothenta.notmetered
ltx/en_us_oca/me.m08.d12:meMA.Ode9C23.mode	@ltx/en_us_oca/miscellanea:misc.Mode8
ltx/en_us_oca/me.m08.d12:meMA.Ode9C23.ode	@ltx/en_us_oca/miscellanea:misc.Ode9
ltx/en_us_oca/me.m08.d12:meMA.Ode9C23.text	
ltx/en_us_oca/me.m08.d12:meMA.Ode9C24.incipit	…
ltx/en_us_oca/me.m08.d12:meMA.Ode9C24.melody	@ltx/en_us_oca/he.h.m8:heHE.TonProdilothenta.notmetered
ltx/en_us_oca/me.m08.d12:meMA.Ode9C24.mode	@ltx/en_us_oca/miscellanea:misc.Mode8
ltx/en_us_oca/me.m08.d12:meMA.Ode9C24.ode	@ltx/en_us_oca/miscellanea:misc.Ode9
ltx/en_us_oca/me.m08.d12:meMA.Ode9C24.text	
ltx/en_us_oca/me.m08.d12:meMA.Ode9C2T.incipit	…
ltx/en_us_oca/me.m08.d12:meMA.Ode9C2T.melody	@ltx/en_us_oca/he.h.m8:heHE.TonProdilothenta.notmetered
ltx/en_us_oca/me.m08.d12:meMA.Ode9C2T.mode	@ltx/en_us_oca/miscellanea:misc.Mode8
ltx/en_us_oca/me.m08.d12:meMA.Ode9C2T.ode	@ltx/en_us_oca/miscellanea:misc.Ode9
ltx/en_us_oca/me.m08.d12:meMA.Ode9C2T.text	
ltx/en_us_oca/me.m08.d12:meMA.Ode9H.greekmelody	@ltx/en_us_oca/he.h.m8:heHE.TonProdilothenta.greekname
ltx/en_us_oca/me.m08.d12:meMA.Ode9H.incipit	@ltx/en_us_oca/he.h.m8:heHE.TonProdilothenta.incipit
ltx/en_us_oca/me.m08.d12:meMA.Ode9H.melody	@ltx/en_us_oca/he.h.m8:heHE.TonProdilothenta.melody
ltx/en_us_oca/me.m08.d12:meMA.Ode9H.mode	@ltx/en_us_oca/miscellanea:misc.Mode8
ltx/en_us_oca/me.m08.d12:meMA.Ode9H.ode	@ltx/en_us_oca/miscellanea:misc.Ode9
ltx/en_us_oca/me.m08.d12:meMA.Ode9H.text	@ltx/en_us_oca/he.h.m8:heHE.TonProdilothenta.text
ltx/en_us_oca/me.m08.d12:meMA.Oikos1.text	
ltx/en_us_oca/me.m08.d12:meMA.Oikos2.text	
ltx/en_us_oca/me.m08.d12:meVE.Apolytikion1ger.greekmelody	@ltx/en_us_oca/he.a.m3:heAU.TheiasPisteos.greekname
ltx/en_us_oca/me.m08.d12:meVE.Apolytikion1ger.incipit	…
ltx/en_us_oca/me.m08.d12:meVE.Apolytikion1ger.melody	@ltx/en_us_oca/he.a.m3:heAU.TheiasPisteos.notmetered
ltx/en_us_oca/me.m08.d12:meVE.Apolytikion1ger.mode	@ltx/en_us_oca/miscellanea:misc.Mode3
ltx/en_us_oca/me.m08.d12:meVE.Apolytikion1ger.poet	@ltx/en_us_oca/poets:po.Gerasimou
ltx/en_us_oca/me.m08.d12:meVE.Apolytikion1ger.text	
ltx/en_us_oca/me.m08.d12:meVE.Apolytikion2ger.greekmelody	@ltx/en_us_oca/he.a.m3:heAU.TinOraiotita.greekname
ltx/en_us_oca/me.m08.d12:meVE.Apolytikion2ger.incipit	…
ltx/en_us_oca/me.m08.d12:meVE.Apolytikion2ger.melody	@ltx/en_us_oca/he.a.m3:heAU.TinOraiotita.notmetered
ltx/en_us_oca/me.m08.d12:meVE.Apolytikion2ger.mode	@ltx/en_us_oca/miscellanea:misc.Mode3
ltx/en_us_oca/me.m08.d12:meVE.Apolytikion2ger.poet	@ltx/en_us_oca/poets:po.Gerasimou
ltx/en_us_oca/me.m08.d12:meVE.Apolytikion2ger.text	
ltx/en_us_oca/me.m08.d12:meVE.AposBoth.incipit	@ltx/en_us_oca/me.m08.d07:meVE.AposGlory.incipit
ltx/en_us_oca/me.m08.d12:meVE.AposBoth.melody	
ltx/en_us_oca/me.m08.d12:meVE.AposBoth.mode	@ltx/en_us_oca/miscellanea:misc.Mode8
ltx/en_us_oca/me.m08.d12:meVE.AposBoth.text	@ltx/en_us_oca/me.m08.d07:meVE.AposGlory.text
ltx/en_us_oca/me.m08.d12:meVE.AposGlory.incipit	@ltx/en_us_oca/me.m01.d15:meVE.AposGlory.incipit
ltx/en_us_oca/me.m08.d12:meVE.AposGlory.melody	
ltx/en_us_oca/me.m08.d12:meVE.AposGlory.mode	@ltx/en_us_oca/miscellanea:misc.Mode6
ltx/en_us_oca/me.m08.d12:meVE.AposGlory.text	@ltx/en_us_oca/me.m01.d15:meVE.AposGlory.text
ltx/en_us_oca/me.m08.d12:meVE.Aposticha1.greekmelody	@ltx/en_us_oca/he.a.m2:heAU.OikosTouEfratha.greekname
ltx/en_us_oca/me.m08.d12:meVE.Aposticha1.incipit	…
ltx/en_us_oca/me.m08.d12:meVE.Aposticha1.melody	@ltx/en_us_oca/he.a.m2:heAU.OikosTouEfratha.notmetered
ltx/en_us_oca/me.m08.d12:meVE.Aposticha1.mode	@ltx/en_us_oca/miscellanea:misc.Mode2
ltx/en_us_oca/me.m08.d12:meVE.Aposticha1.text	
ltx/en_us_oca/me.m08.d12:meVE.Aposticha2.incipit	…
ltx/en_us_oca/me.m08.d12:meVE.Aposticha2.melody	@ltx/en_us_oca/he.a.m2:heAU.OikosTouEfratha.notmetered
ltx/en_us_oca/me.m08.d12:meVE.Aposticha2.mode	@ltx/en_us_oca/miscellanea:misc.Mode2
ltx/en_us_oca/me.m08.d12:meVE.Aposticha2.text	
ltx/en_us_oca/me.m08.d12:meVE.Aposticha3.incipit	…
ltx/en_us_oca/me.m08.d12:meVE.Aposticha3.melody	@ltx/en_us_oca/he.a.m2:heAU.OikosTouEfratha.notmetered
ltx/en_us_oca/me.m08.d12:meVE.Aposticha3.mode	@ltx/en_us_oca/miscellanea:misc.Mode2
ltx/en_us_oca/me.m08.d12:meVE.Aposticha3.text	
ltx/en_us_oca/me.m08.d12:meVE.SticBoth.incipit	@ltx/en_us_oca/me.m08.d06:meSV.SticGlory.incipit
ltx/en_us_oca/me.m08.d12:meVE.SticBoth.melody	
ltx/en_us_oca/me.m08.d12:meVE.SticBoth.mode	@ltx/en_us_oca/miscellanea:misc.Mode8
ltx/en_us_oca/me.m08.d12:meVE.SticBoth.text	@ltx/en_us_oca/me.m08.d06:meSV.SticGlory.text
ltx/en_us_oca/me.m08.d12:meVE.SticGlory.incipit	…
ltx/en_us_oca/me.m08.d12:meVE.SticGlory.melody	
ltx/en_us_oca/me.m08.d12:meVE.SticGlory.mode	@ltx/en_us_oca/miscellanea:misc.Mode8
ltx/en_us_oca/me.m08.d12:meVE.SticGlory.text	
ltx/en_us_oca/me.m08.d12:meVE.Stichera01.greekmelody	@ltx/en_us_oca/he.a.m4:heAU.EdokasSimeiosin.greekname
ltx/en_us_oca/me.m08.d12:meVE.Stichera01.incipit	…
ltx/en_us_oca/me.m08.d12:meVE.Stichera01.melody	@ltx/en_us_oca/he.a.m4:heAU.EdokasSimeiosin.notmetered
ltx/en_us_oca/me.m08.d12:meVE.Stichera01.mode	@ltx/en_us_oca/miscellanea:misc.Mode4
ltx/en_us_oca/me.m08.d12:meVE.Stichera01.text	
ltx/en_us_oca/me.m08.d12:meVE.Stichera02.incipit	…
ltx/en_us_oca/me.m08.d12:meVE.Stichera02.melody	@ltx/en_us_oca/he.a.m4:heAU.EdokasSimeiosin.notmetered
ltx/en_us_oca/me.m08.d12:meVE.Stichera02.mode	@ltx/en_us_oca/miscellanea:misc.Mode4
ltx/en_us_oca/me.m08.d12:meVE.Stichera02.text	
ltx/en_us_oca/me.m08.d12:meVE.Stichera03.incipit	…
ltx/en_us_oca/me.m08.d12:meVE.Stichera03.melody	@ltx/en_us_oca/he.a.m4:heAU.EdokasSimeiosin.notmetered
ltx/en_us_oca/me.m08.d12:meVE.Stichera03.mode	@ltx/en_us_oca/miscellanea:misc.Mode4
ltx/en_us_oca/me.m08.d12:meVE.Stichera03.text	
ltx/en_us_oca/me.m08.d12:meVE.Stichera04.greekmelody	@ltx/en_us_oca/he.a.m4:heAU.OsGennaionEnMartysi.greekname
ltx/en_us_oca/me.m08.d12:meVE.Stichera04.incipit	…
ltx/en_us_oca/me.m08.d12:meVE.Stichera04.melody	@ltx/en_us_oca/he.a.m4:heAU.OsGennaionEnMartysi.notmetered
ltx/en_us_oca/me.m08.d12:meVE.Stichera04.mode	@ltx/en_us_oca/miscellanea:misc.Mode4
ltx/en_us_oca/me.m08.d12:meVE.Stichera04.text	
ltx/en_us_oca/me.m08.d12:meVE.Stichera05.incipit	…
ltx/en_us_oca/me.m08.d12:meVE.Stichera05.melody	@ltx/en_us_oca/he.a.m4:heAU.OsGennaionEnMartysi.notmetered
ltx/en_us_oca/me.m08.d12:meVE.Stichera05.mode	@ltx/en_us_oca/miscellanea:misc.Mode4
ltx/en_us_oca/me.m08.d12:meVE.Stichera05.text	
ltx/en_us_oca/me.m08.d12:meVE.Stichera06.incipit	…
ltx/en_us_oca/me.m08.d12:meVE.Stichera06.melody	@ltx/en_us_oca/he.a.m4:heAU.OsGennaionEnMartysi.notmetered
ltx/en_us_oca/me.m08.d12:meVE.Stichera06.mode	@ltx/en_us_oca/miscellanea:misc.Mode4
ltx/en_us_oca/me.m08.d12:meVE.Stichera06.text	
