ltx/en_us_oca/me.m07.d16:meDA.commemoration.first	
ltx/en_us_oca/me.m07.d16:meDA.commemoration.first_name	
ltx/en_us_oca/me.m07.d16:meDA.commemoration.first_short	
ltx/en_us_oca/me.m07.d16:meDA.commemoration.first_title	
ltx/en_us_oca/me.m07.d16:meDA.commemoration.full	
ltx/en_us_oca/me.m07.d16:meDA.commemoration.second_name	
ltx/en_us_oca/me.m07.d16:meDA.commemoration.second_title	
ltx/en_us_oca/me.m07.d16:meDA.date	
ltx/en_us_oca/me.m07.d16:meDA.fordate	
ltx/en_us_oca/me.m07.d16:meDA.insert1	
ltx/en_us_oca/me.m07.d16:meDA.insert2	
ltx/en_us_oca/me.m07.d16:meDA.note	
ltx/en_us_oca/me.m07.d16:meDA.pdfcoverdate	
ltx/en_us_oca/me.m07.d16:meDA.pdfheaderdate	
ltx/en_us_oca/me.m07.d16:meHO.commemorations	
ltx/en_us_oca/me.m07.d16:meHO.note1	
ltx/en_us_oca/me.m07.d16:meHO.note2	
ltx/en_us_oca/me.m07.d16:meHO.number	
ltx/en_us_oca/me.m07.d16:meHO.rank	
ltx/en_us_oca/me.m07.d16:meLE.commemoration1	
ltx/en_us_oca/me.m07.d16:meLE.commemoration2	
ltx/en_us_oca/me.m07.d16:meLI.Kontakion1.incipit	…
ltx/en_us_oca/me.m07.d16:meLI.Kontakion1.melody	
ltx/en_us_oca/me.m07.d16:meLI.Kontakion1.mode	
ltx/en_us_oca/me.m07.d16:meLI.Kontakion1.text	
ltx/en_us_oca/me.m07.d16:meLI.Megalynarion.text	
ltx/en_us_oca/me.m07.d16:meMA.C1.acrostic.notice1	
ltx/en_us_oca/me.m07.d16:meMA.C1.acrostic.text	
ltx/en_us_oca/me.m07.d16:meMA.C1.acrostic.title	
ltx/en_us_oca/me.m07.d16:meMA.C1.title	@ltx/en_us_oca/titles:ti.CanonSaints
ltx/en_us_oca/me.m07.d16:meMA.C1.verse	@ltx/en_us_oca/prayers:pr.verse_SaintsM.text
ltx/en_us_oca/me.m07.d16:meMA.ExapTheotokion.incipit	…
ltx/en_us_oca/me.m07.d16:meMA.ExapTheotokion.melody	@ltx/en_us_oca/he.a.m3:heAU.EpeskepsatoImas.notmetered
ltx/en_us_oca/me.m07.d16:meMA.ExapTheotokion.mode	@ltx/en_us_oca/miscellanea:misc.Mode3
ltx/en_us_oca/me.m07.d16:meMA.ExapTheotokion.text	
ltx/en_us_oca/me.m07.d16:meMA.Exaposteilarion1.greekmelody	@ltx/en_us_oca/he.a.m3:heAU.EpeskepsatoImas.greekname
ltx/en_us_oca/me.m07.d16:meMA.Exaposteilarion1.incipit	…
ltx/en_us_oca/me.m07.d16:meMA.Exaposteilarion1.melody	@ltx/en_us_oca/he.a.m3:heAU.EpeskepsatoImas.notmetered
ltx/en_us_oca/me.m07.d16:meMA.Exaposteilarion1.mode	@ltx/en_us_oca/miscellanea:misc.Mode3
ltx/en_us_oca/me.m07.d16:meMA.Exaposteilarion1.text	
ltx/en_us_oca/me.m07.d16:meMA.Ode1C11.greekmelody	@ltx/en_us_oca/he.h.m8:heHE.AsomenToKyrio.greekname
ltx/en_us_oca/me.m07.d16:meMA.Ode1C11.incipit	…
ltx/en_us_oca/me.m07.d16:meMA.Ode1C11.melody	@ltx/en_us_oca/he.h.m8:heHE.AsomenToKyrio.notmetered
ltx/en_us_oca/me.m07.d16:meMA.Ode1C11.mode	@ltx/en_us_oca/miscellanea:misc.Mode8
ltx/en_us_oca/me.m07.d16:meMA.Ode1C11.ode	@ltx/en_us_oca/miscellanea:misc.Ode1
ltx/en_us_oca/me.m07.d16:meMA.Ode1C11.text	
ltx/en_us_oca/me.m07.d16:meMA.Ode1C12.incipit	…
ltx/en_us_oca/me.m07.d16:meMA.Ode1C12.melody	@ltx/en_us_oca/he.h.m8:heHE.AsomenToKyrio.notmetered
ltx/en_us_oca/me.m07.d16:meMA.Ode1C12.mode	@ltx/en_us_oca/miscellanea:misc.Mode8
ltx/en_us_oca/me.m07.d16:meMA.Ode1C12.ode	@ltx/en_us_oca/miscellanea:misc.Ode1
ltx/en_us_oca/me.m07.d16:meMA.Ode1C12.text	
ltx/en_us_oca/me.m07.d16:meMA.Ode1C13.incipit	…
ltx/en_us_oca/me.m07.d16:meMA.Ode1C13.melody	@ltx/en_us_oca/he.h.m8:heHE.AsomenToKyrio.notmetered
ltx/en_us_oca/me.m07.d16:meMA.Ode1C13.mode	@ltx/en_us_oca/miscellanea:misc.Mode8
ltx/en_us_oca/me.m07.d16:meMA.Ode1C13.ode	@ltx/en_us_oca/miscellanea:misc.Ode1
ltx/en_us_oca/me.m07.d16:meMA.Ode1C13.text	
ltx/en_us_oca/me.m07.d16:meMA.Ode1C1T.incipit	…
ltx/en_us_oca/me.m07.d16:meMA.Ode1C1T.melody	@ltx/en_us_oca/he.h.m8:heHE.AsomenToKyrio.notmetered
ltx/en_us_oca/me.m07.d16:meMA.Ode1C1T.mode	@ltx/en_us_oca/miscellanea:misc.Mode8
ltx/en_us_oca/me.m07.d16:meMA.Ode1C1T.ode	@ltx/en_us_oca/miscellanea:misc.Ode1
ltx/en_us_oca/me.m07.d16:meMA.Ode1C1T.text	
ltx/en_us_oca/me.m07.d16:meMA.Ode3C11.greekmelody	@ltx/en_us_oca/he.h.m8:heHE.StereosonImonTonNoun.greekname
ltx/en_us_oca/me.m07.d16:meMA.Ode3C11.incipit	…
ltx/en_us_oca/me.m07.d16:meMA.Ode3C11.melody	@ltx/en_us_oca/he.h.m8:heHE.StereosonImonTonNoun.notmetered
ltx/en_us_oca/me.m07.d16:meMA.Ode3C11.mode	@ltx/en_us_oca/miscellanea:misc.Mode8
ltx/en_us_oca/me.m07.d16:meMA.Ode3C11.ode	@ltx/en_us_oca/miscellanea:misc.Ode3
ltx/en_us_oca/me.m07.d16:meMA.Ode3C11.text	
ltx/en_us_oca/me.m07.d16:meMA.Ode3C12.incipit	…
ltx/en_us_oca/me.m07.d16:meMA.Ode3C12.melody	@ltx/en_us_oca/he.h.m8:heHE.StereosonImonTonNoun.notmetered
ltx/en_us_oca/me.m07.d16:meMA.Ode3C12.mode	@ltx/en_us_oca/miscellanea:misc.Mode8
ltx/en_us_oca/me.m07.d16:meMA.Ode3C12.ode	@ltx/en_us_oca/miscellanea:misc.Ode3
ltx/en_us_oca/me.m07.d16:meMA.Ode3C12.text	
ltx/en_us_oca/me.m07.d16:meMA.Ode3C13.incipit	…
ltx/en_us_oca/me.m07.d16:meMA.Ode3C13.melody	@ltx/en_us_oca/he.h.m8:heHE.StereosonImonTonNoun.notmetered
ltx/en_us_oca/me.m07.d16:meMA.Ode3C13.mode	@ltx/en_us_oca/miscellanea:misc.Mode8
ltx/en_us_oca/me.m07.d16:meMA.Ode3C13.ode	@ltx/en_us_oca/miscellanea:misc.Ode3
ltx/en_us_oca/me.m07.d16:meMA.Ode3C13.text	
ltx/en_us_oca/me.m07.d16:meMA.Ode3C1T.incipit	…
ltx/en_us_oca/me.m07.d16:meMA.Ode3C1T.melody	@ltx/en_us_oca/he.h.m8:heHE.StereosonImonTonNoun.notmetered
ltx/en_us_oca/me.m07.d16:meMA.Ode3C1T.mode	@ltx/en_us_oca/miscellanea:misc.Mode8
ltx/en_us_oca/me.m07.d16:meMA.Ode3C1T.ode	@ltx/en_us_oca/miscellanea:misc.Ode3
ltx/en_us_oca/me.m07.d16:meMA.Ode3C1T.text	
ltx/en_us_oca/me.m07.d16:meMA.Ode3H.greekmelody	@ltx/en_us_oca/he.h.m8:heHE.StereosonImonTonNoun.greekname
ltx/en_us_oca/me.m07.d16:meMA.Ode3H.incipit	@ltx/en_us_oca/he.h.m8:heHE.StereosonImonTonNoun.incipit
ltx/en_us_oca/me.m07.d16:meMA.Ode3H.melody	@ltx/en_us_oca/he.h.m8:heHE.StereosonImonTonNoun.melody
ltx/en_us_oca/me.m07.d16:meMA.Ode3H.mode	@ltx/en_us_oca/miscellanea:misc.Mode8
ltx/en_us_oca/me.m07.d16:meMA.Ode3H.ode	@ltx/en_us_oca/miscellanea:misc.Ode3
ltx/en_us_oca/me.m07.d16:meMA.Ode3H.text	@ltx/en_us_oca/he.h.m8:heHE.StereosonImonTonNoun.text
ltx/en_us_oca/me.m07.d16:meMA.Ode3Kathisma1.greekmelody	@ltx/en_us_oca/he.a.m4:heAU.TachyProkatalave.greekname
ltx/en_us_oca/me.m07.d16:meMA.Ode3Kathisma1.incipit	…
ltx/en_us_oca/me.m07.d16:meMA.Ode3Kathisma1.melody	@ltx/en_us_oca/he.a.m4:heAU.TachyProkatalave.notmetered
ltx/en_us_oca/me.m07.d16:meMA.Ode3Kathisma1.mode	@ltx/en_us_oca/miscellanea:misc.Mode4
ltx/en_us_oca/me.m07.d16:meMA.Ode3Kathisma1.text	
ltx/en_us_oca/me.m07.d16:meMA.Ode3KathismaSt.incipit	@ltx/en_us_oca/he.a.m4:heAU.TachyProkatalave.incipit
ltx/en_us_oca/me.m07.d16:meMA.Ode3KathismaSt.melody	@ltx/en_us_oca/he.a.m4:heAU.TachyProkatalave.melody
ltx/en_us_oca/me.m07.d16:meMA.Ode3KathismaSt.mode	@ltx/en_us_oca/miscellanea:misc.Mode4
ltx/en_us_oca/me.m07.d16:meMA.Ode3KathismaSt.text	@ltx/en_us_oca/he.a.m4:heAU.TachyProkatalave.text
ltx/en_us_oca/me.m07.d16:meMA.Ode3KathismaT.incipit	@ltx/en_us_oca/oc.m4.d3:ocMA.Kathisma33.incipit
ltx/en_us_oca/me.m07.d16:meMA.Ode3KathismaT.melody	@ltx/en_us_oca/he.a.m4:heAU.TachyProkatalave.notmetered
ltx/en_us_oca/me.m07.d16:meMA.Ode3KathismaT.mode	@ltx/en_us_oca/miscellanea:misc.Mode4
ltx/en_us_oca/me.m07.d16:meMA.Ode3KathismaT.text	@ltx/en_us_oca/oc.m4.d3:ocMA.Kathisma33.text
ltx/en_us_oca/me.m07.d16:meMA.Ode4C11.greekmelody	@ltx/en_us_oca/he.h.m8:heHE.EisakikoaKyrie.greekname
ltx/en_us_oca/me.m07.d16:meMA.Ode4C11.incipit	…
ltx/en_us_oca/me.m07.d16:meMA.Ode4C11.melody	@ltx/en_us_oca/he.h.m8:heHE.EisakikoaKyrie.notmetered
ltx/en_us_oca/me.m07.d16:meMA.Ode4C11.mode	@ltx/en_us_oca/miscellanea:misc.Mode8
ltx/en_us_oca/me.m07.d16:meMA.Ode4C11.ode	@ltx/en_us_oca/miscellanea:misc.Ode4
ltx/en_us_oca/me.m07.d16:meMA.Ode4C11.text	
ltx/en_us_oca/me.m07.d16:meMA.Ode4C12.incipit	…
ltx/en_us_oca/me.m07.d16:meMA.Ode4C12.melody	@ltx/en_us_oca/he.h.m8:heHE.EisakikoaKyrie.notmetered
ltx/en_us_oca/me.m07.d16:meMA.Ode4C12.mode	@ltx/en_us_oca/miscellanea:misc.Mode8
ltx/en_us_oca/me.m07.d16:meMA.Ode4C12.ode	@ltx/en_us_oca/miscellanea:misc.Ode4
ltx/en_us_oca/me.m07.d16:meMA.Ode4C12.text	
ltx/en_us_oca/me.m07.d16:meMA.Ode4C13.incipit	…
ltx/en_us_oca/me.m07.d16:meMA.Ode4C13.melody	@ltx/en_us_oca/he.h.m8:heHE.EisakikoaKyrie.notmetered
ltx/en_us_oca/me.m07.d16:meMA.Ode4C13.mode	@ltx/en_us_oca/miscellanea:misc.Mode8
ltx/en_us_oca/me.m07.d16:meMA.Ode4C13.ode	@ltx/en_us_oca/miscellanea:misc.Ode4
ltx/en_us_oca/me.m07.d16:meMA.Ode4C13.text	
ltx/en_us_oca/me.m07.d16:meMA.Ode4C1T.incipit	…
ltx/en_us_oca/me.m07.d16:meMA.Ode4C1T.melody	@ltx/en_us_oca/he.h.m8:heHE.EisakikoaKyrie.notmetered
ltx/en_us_oca/me.m07.d16:meMA.Ode4C1T.mode	@ltx/en_us_oca/miscellanea:misc.Mode8
ltx/en_us_oca/me.m07.d16:meMA.Ode4C1T.ode	@ltx/en_us_oca/miscellanea:misc.Ode4
ltx/en_us_oca/me.m07.d16:meMA.Ode4C1T.text	
ltx/en_us_oca/me.m07.d16:meMA.Ode5C11.greekmelody	@ltx/en_us_oca/he.h.m8:heHE.OrthrizontesVoomenSoi.greekname
ltx/en_us_oca/me.m07.d16:meMA.Ode5C11.incipit	…
ltx/en_us_oca/me.m07.d16:meMA.Ode5C11.melody	@ltx/en_us_oca/he.h.m8:heHE.OrthrizontesVoomenSoi.notmetered
ltx/en_us_oca/me.m07.d16:meMA.Ode5C11.mode	@ltx/en_us_oca/miscellanea:misc.Mode8
ltx/en_us_oca/me.m07.d16:meMA.Ode5C11.ode	@ltx/en_us_oca/miscellanea:misc.Ode5
ltx/en_us_oca/me.m07.d16:meMA.Ode5C11.text	
ltx/en_us_oca/me.m07.d16:meMA.Ode5C12.incipit	…
ltx/en_us_oca/me.m07.d16:meMA.Ode5C12.melody	@ltx/en_us_oca/he.h.m8:heHE.OrthrizontesVoomenSoi.notmetered
ltx/en_us_oca/me.m07.d16:meMA.Ode5C12.mode	@ltx/en_us_oca/miscellanea:misc.Mode8
ltx/en_us_oca/me.m07.d16:meMA.Ode5C12.ode	@ltx/en_us_oca/miscellanea:misc.Ode5
ltx/en_us_oca/me.m07.d16:meMA.Ode5C12.text	
ltx/en_us_oca/me.m07.d16:meMA.Ode5C13.incipit	…
ltx/en_us_oca/me.m07.d16:meMA.Ode5C13.melody	@ltx/en_us_oca/he.h.m8:heHE.OrthrizontesVoomenSoi.notmetered
ltx/en_us_oca/me.m07.d16:meMA.Ode5C13.mode	@ltx/en_us_oca/miscellanea:misc.Mode8
ltx/en_us_oca/me.m07.d16:meMA.Ode5C13.ode	@ltx/en_us_oca/miscellanea:misc.Ode5
ltx/en_us_oca/me.m07.d16:meMA.Ode5C13.text	
ltx/en_us_oca/me.m07.d16:meMA.Ode5C1T.incipit	…
ltx/en_us_oca/me.m07.d16:meMA.Ode5C1T.melody	@ltx/en_us_oca/he.h.m8:heHE.OrthrizontesVoomenSoi.notmetered
ltx/en_us_oca/me.m07.d16:meMA.Ode5C1T.mode	@ltx/en_us_oca/miscellanea:misc.Mode8
ltx/en_us_oca/me.m07.d16:meMA.Ode5C1T.ode	@ltx/en_us_oca/miscellanea:misc.Ode5
ltx/en_us_oca/me.m07.d16:meMA.Ode5C1T.text	
ltx/en_us_oca/me.m07.d16:meMA.Ode6C11.greekmelody	@ltx/en_us_oca/he.h.m8:heHE.IlasthitiMoiSotir.greekname
ltx/en_us_oca/me.m07.d16:meMA.Ode6C11.incipit	…
ltx/en_us_oca/me.m07.d16:meMA.Ode6C11.melody	@ltx/en_us_oca/he.h.m8:heHE.IlasthitiMoiSotir.notmetered
ltx/en_us_oca/me.m07.d16:meMA.Ode6C11.mode	@ltx/en_us_oca/miscellanea:misc.Mode8
ltx/en_us_oca/me.m07.d16:meMA.Ode6C11.ode	@ltx/en_us_oca/miscellanea:misc.Ode6
ltx/en_us_oca/me.m07.d16:meMA.Ode6C11.text	
ltx/en_us_oca/me.m07.d16:meMA.Ode6C12.incipit	…
ltx/en_us_oca/me.m07.d16:meMA.Ode6C12.melody	@ltx/en_us_oca/he.h.m8:heHE.IlasthitiMoiSotir.notmetered
ltx/en_us_oca/me.m07.d16:meMA.Ode6C12.mode	@ltx/en_us_oca/miscellanea:misc.Mode8
ltx/en_us_oca/me.m07.d16:meMA.Ode6C12.ode	@ltx/en_us_oca/miscellanea:misc.Ode6
ltx/en_us_oca/me.m07.d16:meMA.Ode6C12.text	
ltx/en_us_oca/me.m07.d16:meMA.Ode6C13.incipit	…
ltx/en_us_oca/me.m07.d16:meMA.Ode6C13.melody	@ltx/en_us_oca/he.h.m8:heHE.IlasthitiMoiSotir.notmetered
ltx/en_us_oca/me.m07.d16:meMA.Ode6C13.mode	@ltx/en_us_oca/miscellanea:misc.Mode8
ltx/en_us_oca/me.m07.d16:meMA.Ode6C13.ode	@ltx/en_us_oca/miscellanea:misc.Ode6
ltx/en_us_oca/me.m07.d16:meMA.Ode6C13.text	
ltx/en_us_oca/me.m07.d16:meMA.Ode6C1T.incipit	…
ltx/en_us_oca/me.m07.d16:meMA.Ode6C1T.melody	@ltx/en_us_oca/he.h.m8:heHE.IlasthitiMoiSotir.notmetered
ltx/en_us_oca/me.m07.d16:meMA.Ode6C1T.mode	@ltx/en_us_oca/miscellanea:misc.Mode8
ltx/en_us_oca/me.m07.d16:meMA.Ode6C1T.ode	@ltx/en_us_oca/miscellanea:misc.Ode6
ltx/en_us_oca/me.m07.d16:meMA.Ode6C1T.text	
ltx/en_us_oca/me.m07.d16:meMA.Ode6H.greekmelody	@ltx/en_us_oca/he.h.m8:heHE.IlasthitiMoiSotir.greekname
ltx/en_us_oca/me.m07.d16:meMA.Ode6H.incipit	@ltx/en_us_oca/he.h.m8:heHE.IlasthitiMoiSotir.incipit
ltx/en_us_oca/me.m07.d16:meMA.Ode6H.melody	@ltx/en_us_oca/he.h.m8:heHE.IlasthitiMoiSotir.melody
ltx/en_us_oca/me.m07.d16:meMA.Ode6H.mode	@ltx/en_us_oca/miscellanea:misc.Mode8
ltx/en_us_oca/me.m07.d16:meMA.Ode6H.ode	@ltx/en_us_oca/miscellanea:misc.Ode6
ltx/en_us_oca/me.m07.d16:meMA.Ode6H.text	@ltx/en_us_oca/he.h.m8:heHE.IlasthitiMoiSotir.text
ltx/en_us_oca/me.m07.d16:meMA.Ode7C11.greekmelody	@ltx/en_us_oca/he.h.m8:heHE.TonChaldaionIKaminos.greekname
ltx/en_us_oca/me.m07.d16:meMA.Ode7C11.incipit	…
ltx/en_us_oca/me.m07.d16:meMA.Ode7C11.melody	@ltx/en_us_oca/he.h.m8:heHE.TonChaldaionIKaminos.notmetered
ltx/en_us_oca/me.m07.d16:meMA.Ode7C11.mode	@ltx/en_us_oca/miscellanea:misc.Mode8
ltx/en_us_oca/me.m07.d16:meMA.Ode7C11.ode	@ltx/en_us_oca/miscellanea:misc.Ode7
ltx/en_us_oca/me.m07.d16:meMA.Ode7C11.text	
ltx/en_us_oca/me.m07.d16:meMA.Ode7C12.incipit	…
ltx/en_us_oca/me.m07.d16:meMA.Ode7C12.melody	@ltx/en_us_oca/he.h.m8:heHE.TonChaldaionIKaminos.notmetered
ltx/en_us_oca/me.m07.d16:meMA.Ode7C12.mode	@ltx/en_us_oca/miscellanea:misc.Mode8
ltx/en_us_oca/me.m07.d16:meMA.Ode7C12.ode	@ltx/en_us_oca/miscellanea:misc.Ode7
ltx/en_us_oca/me.m07.d16:meMA.Ode7C12.text	
ltx/en_us_oca/me.m07.d16:meMA.Ode7C13.incipit	…
ltx/en_us_oca/me.m07.d16:meMA.Ode7C13.melody	@ltx/en_us_oca/he.h.m8:heHE.TonChaldaionIKaminos.notmetered
ltx/en_us_oca/me.m07.d16:meMA.Ode7C13.mode	@ltx/en_us_oca/miscellanea:misc.Mode8
ltx/en_us_oca/me.m07.d16:meMA.Ode7C13.ode	@ltx/en_us_oca/miscellanea:misc.Ode7
ltx/en_us_oca/me.m07.d16:meMA.Ode7C13.text	
ltx/en_us_oca/me.m07.d16:meMA.Ode7C1T.incipit	…
ltx/en_us_oca/me.m07.d16:meMA.Ode7C1T.melody	@ltx/en_us_oca/he.h.m8:heHE.TonChaldaionIKaminos.notmetered
ltx/en_us_oca/me.m07.d16:meMA.Ode7C1T.mode	@ltx/en_us_oca/miscellanea:misc.Mode8
ltx/en_us_oca/me.m07.d16:meMA.Ode7C1T.ode	@ltx/en_us_oca/miscellanea:misc.Ode7
ltx/en_us_oca/me.m07.d16:meMA.Ode7C1T.text	
ltx/en_us_oca/me.m07.d16:meMA.Ode8C11.greekmelody	@ltx/en_us_oca/he.h.m8:heHE.OiTheorrimonesPaides.greekname
ltx/en_us_oca/me.m07.d16:meMA.Ode8C11.incipit	…
ltx/en_us_oca/me.m07.d16:meMA.Ode8C11.melody	@ltx/en_us_oca/he.h.m8:heHE.OiTheorrimonesPaides.notmetered
ltx/en_us_oca/me.m07.d16:meMA.Ode8C11.mode	@ltx/en_us_oca/miscellanea:misc.Mode8
ltx/en_us_oca/me.m07.d16:meMA.Ode8C11.ode	@ltx/en_us_oca/miscellanea:misc.Ode8
ltx/en_us_oca/me.m07.d16:meMA.Ode8C11.text	
ltx/en_us_oca/me.m07.d16:meMA.Ode8C12.incipit	…
ltx/en_us_oca/me.m07.d16:meMA.Ode8C12.melody	@ltx/en_us_oca/he.h.m8:heHE.OiTheorrimonesPaides.notmetered
ltx/en_us_oca/me.m07.d16:meMA.Ode8C12.mode	@ltx/en_us_oca/miscellanea:misc.Mode8
ltx/en_us_oca/me.m07.d16:meMA.Ode8C12.ode	@ltx/en_us_oca/miscellanea:misc.Ode8
ltx/en_us_oca/me.m07.d16:meMA.Ode8C12.text	
ltx/en_us_oca/me.m07.d16:meMA.Ode8C13.incipit	…
ltx/en_us_oca/me.m07.d16:meMA.Ode8C13.melody	@ltx/en_us_oca/he.h.m8:heHE.OiTheorrimonesPaides.notmetered
ltx/en_us_oca/me.m07.d16:meMA.Ode8C13.mode	@ltx/en_us_oca/miscellanea:misc.Mode8
ltx/en_us_oca/me.m07.d16:meMA.Ode8C13.ode	@ltx/en_us_oca/miscellanea:misc.Ode8
ltx/en_us_oca/me.m07.d16:meMA.Ode8C13.text	
ltx/en_us_oca/me.m07.d16:meMA.Ode8C1T.incipit	…
ltx/en_us_oca/me.m07.d16:meMA.Ode8C1T.melody	@ltx/en_us_oca/he.h.m8:heHE.OiTheorrimonesPaides.notmetered
ltx/en_us_oca/me.m07.d16:meMA.Ode8C1T.mode	@ltx/en_us_oca/miscellanea:misc.Mode8
ltx/en_us_oca/me.m07.d16:meMA.Ode8C1T.ode	@ltx/en_us_oca/miscellanea:misc.Ode8
ltx/en_us_oca/me.m07.d16:meMA.Ode8C1T.text	
ltx/en_us_oca/me.m07.d16:meMA.Ode8H.greekmelody	@ltx/en_us_oca/he.h.m8:heHE.OiTheorrimonesPaides.greekname
ltx/en_us_oca/me.m07.d16:meMA.Ode8H.incipit	@ltx/en_us_oca/he.h.m8:heHE.OiTheorrimonesPaides.incipit
ltx/en_us_oca/me.m07.d16:meMA.Ode8H.melody	@ltx/en_us_oca/he.h.m8:heHE.OiTheorrimonesPaides.melody
ltx/en_us_oca/me.m07.d16:meMA.Ode8H.mode	@ltx/en_us_oca/miscellanea:misc.Mode8
ltx/en_us_oca/me.m07.d16:meMA.Ode8H.ode	@ltx/en_us_oca/miscellanea:misc.Ode8
ltx/en_us_oca/me.m07.d16:meMA.Ode8H.text	@ltx/en_us_oca/he.h.m8:heHE.OiTheorrimonesPaides.text
ltx/en_us_oca/me.m07.d16:meMA.Ode9C11.greekmelody	@ltx/en_us_oca/he.h.m8:heHE.TonProdilothenta.greekname
ltx/en_us_oca/me.m07.d16:meMA.Ode9C11.incipit	…
ltx/en_us_oca/me.m07.d16:meMA.Ode9C11.melody	@ltx/en_us_oca/he.h.m8:heHE.TonProdilothenta.notmetered
ltx/en_us_oca/me.m07.d16:meMA.Ode9C11.mode	@ltx/en_us_oca/miscellanea:misc.Mode8
ltx/en_us_oca/me.m07.d16:meMA.Ode9C11.ode	@ltx/en_us_oca/miscellanea:misc.Ode9
ltx/en_us_oca/me.m07.d16:meMA.Ode9C11.text	
ltx/en_us_oca/me.m07.d16:meMA.Ode9C12.incipit	…
ltx/en_us_oca/me.m07.d16:meMA.Ode9C12.melody	@ltx/en_us_oca/he.h.m8:heHE.TonProdilothenta.notmetered
ltx/en_us_oca/me.m07.d16:meMA.Ode9C12.mode	@ltx/en_us_oca/miscellanea:misc.Mode8
ltx/en_us_oca/me.m07.d16:meMA.Ode9C12.ode	@ltx/en_us_oca/miscellanea:misc.Ode9
ltx/en_us_oca/me.m07.d16:meMA.Ode9C12.text	
ltx/en_us_oca/me.m07.d16:meMA.Ode9C13.incipit	…
ltx/en_us_oca/me.m07.d16:meMA.Ode9C13.melody	@ltx/en_us_oca/he.h.m8:heHE.TonProdilothenta.notmetered
ltx/en_us_oca/me.m07.d16:meMA.Ode9C13.mode	@ltx/en_us_oca/miscellanea:misc.Mode8
ltx/en_us_oca/me.m07.d16:meMA.Ode9C13.ode	@ltx/en_us_oca/miscellanea:misc.Ode9
ltx/en_us_oca/me.m07.d16:meMA.Ode9C13.text	
ltx/en_us_oca/me.m07.d16:meMA.Ode9C1T.incipit	…
ltx/en_us_oca/me.m07.d16:meMA.Ode9C1T.melody	@ltx/en_us_oca/he.h.m8:heHE.TonProdilothenta.notmetered
ltx/en_us_oca/me.m07.d16:meMA.Ode9C1T.mode	@ltx/en_us_oca/miscellanea:misc.Mode8
ltx/en_us_oca/me.m07.d16:meMA.Ode9C1T.ode	@ltx/en_us_oca/miscellanea:misc.Ode9
ltx/en_us_oca/me.m07.d16:meMA.Ode9C1T.text	
ltx/en_us_oca/me.m07.d16:meMA.Ode9H.greekmelody	@ltx/en_us_oca/he.h.m8:heHE.TonProdilothenta.greekname
ltx/en_us_oca/me.m07.d16:meMA.Ode9H.incipit	@ltx/en_us_oca/he.h.m8:heHE.TonProdilothenta.incipit
ltx/en_us_oca/me.m07.d16:meMA.Ode9H.melody	@ltx/en_us_oca/he.h.m8:heHE.TonProdilothenta.melody
ltx/en_us_oca/me.m07.d16:meMA.Ode9H.mode	@ltx/en_us_oca/miscellanea:misc.Mode8
ltx/en_us_oca/me.m07.d16:meMA.Ode9H.ode	@ltx/en_us_oca/miscellanea:misc.Ode9
ltx/en_us_oca/me.m07.d16:meMA.Ode9H.text	@ltx/en_us_oca/he.h.m8:heHE.TonProdilothenta.text
ltx/en_us_oca/me.m07.d16:meVE.Apolytikion1ger.greekmelody	@ltx/en_us_oca/he.a.m3:heAU.TheiasPisteos.greekname
ltx/en_us_oca/me.m07.d16:meVE.Apolytikion1ger.incipit	…
ltx/en_us_oca/me.m07.d16:meVE.Apolytikion1ger.melody	@ltx/en_us_oca/he.a.m3:heAU.TheiasPisteos.notmetered
ltx/en_us_oca/me.m07.d16:meVE.Apolytikion1ger.mode	@ltx/en_us_oca/miscellanea:misc.Mode3
ltx/en_us_oca/me.m07.d16:meVE.Apolytikion1ger.poet	@ltx/en_us_oca/poets:po.Gerasimou
ltx/en_us_oca/me.m07.d16:meVE.Apolytikion1ger.text	
ltx/en_us_oca/me.m07.d16:meVE.SticStavrotheotokion.greekmelody	@ltx/en_us_oca/he.a.m8:heAU.OTouParadoxou.greekname
ltx/en_us_oca/me.m07.d16:meVE.SticStavrotheotokion.incipit	@ltx/en_us_oca/me.m01.d15:meMA.AposStavrotheotokion.incipit
ltx/en_us_oca/me.m07.d16:meVE.SticStavrotheotokion.melody	@ltx/en_us_oca/he.a.m8:heAU.OTouParadoxou.notmetered
ltx/en_us_oca/me.m07.d16:meVE.SticStavrotheotokion.mode	@ltx/en_us_oca/miscellanea:misc.Mode8
ltx/en_us_oca/me.m07.d16:meVE.SticStavrotheotokion.text	@ltx/en_us_oca/me.m01.d15:meMA.AposStavrotheotokion.text
ltx/en_us_oca/me.m07.d16:meVE.SticTheotokion.greekmelody	@ltx/en_us_oca/he.a.m8:heAU.OTouParadoxou.greekname
ltx/en_us_oca/me.m07.d16:meVE.SticTheotokion.melody	@ltx/en_us_oca/he.a.m8:heAU.OTouParadoxou.notmetered
ltx/en_us_oca/me.m07.d16:meVE.SticTheotokion.mode	@ltx/en_us_oca/miscellanea:misc.Mode8
ltx/en_us_oca/me.m07.d16:meVE.SticTheotokion.text	
ltx/en_us_oca/me.m07.d16:meVE.Stichera01.greekmelody	@ltx/en_us_oca/he.a.m8:heAU.OTouParadoxou.greekname
ltx/en_us_oca/me.m07.d16:meVE.Stichera01.incipit	The glorious Athenogenes now comes…
ltx/en_us_oca/me.m07.d16:meVE.Stichera01.melody	@ltx/en_us_oca/he.a.m8:heAU.OTouParadoxou.notmetered
ltx/en_us_oca/me.m07.d16:meVE.Stichera01.mode	@ltx/en_us_oca/miscellanea:misc.Mode8
ltx/en_us_oca/me.m07.d16:meVE.Stichera01.text	The glorious Athenogenes now comes before us: ⁄ The bright robe of the priesthood ⁄ is shown to be more sacred through being dipped in blood! ⁄ He entered with it into the temple, ⁄ appearing before the One Who oversees all, ⁄ serving Him in the company of the bodiless hosts, ⁄ and illumined by participation in divinity. ⁄⁄ Let us all bless him!
ltx/en_us_oca/me.m07.d16:meVE.Stichera02.incipit	The all-wise Athenogenes was joined…
ltx/en_us_oca/me.m07.d16:meVE.Stichera02.melody	@ltx/en_us_oca/he.a.m8:heAU.OTouParadoxou.notmetered
ltx/en_us_oca/me.m07.d16:meVE.Stichera02.mode	@ltx/en_us_oca/miscellanea:misc.Mode8
ltx/en_us_oca/me.m07.d16:meVE.Stichera02.text	The all-wise Athenogenes was joined by Christ to the chorus of champions! ⁄ Through faith he contested strongly and finished the course! ⁄ With them he conquered the crafty one ⁄ and was accepted into the choir of martyrs. ⁄ He was made divine through adoption! ⁄⁄ Now he ever intercedes for us who celebrate his holy memorial!
ltx/en_us_oca/me.m07.d16:meVE.Stichera03.incipit	After the God-chosen group of…
ltx/en_us_oca/me.m07.d16:meVE.Stichera03.melody	@ltx/en_us_oca/he.a.m8:heAU.OTouParadoxou.notmetered
ltx/en_us_oca/me.m07.d16:meVE.Stichera03.mode	@ltx/en_us_oca/miscellanea:misc.Mode8
ltx/en_us_oca/me.m07.d16:meVE.Stichera03.text	After the God-chosen group of ten disciples ⁄ overcame the restlessness of the passions by ascetic discipline, ⁄ they fought and slew the serpent! ⁄ They were rich in divine strength, with Athenogenes as their holy leader! ⁄ By their supplications, supremely good and compassionate one, ⁄⁄ save us who ever hope in you!
