ltx/en_us_oca/tr.d033:trCO.header	
ltx/en_us_oca/tr.d033:trDA.commemoration.full	
ltx/en_us_oca/tr.d033:trDA.commemoration.short	
ltx/en_us_oca/tr.d033:trDA.insert1	
ltx/en_us_oca/tr.d033:trDA.insert2	
ltx/en_us_oca/tr.d033:trDA.note	
ltx/en_us_oca/tr.d033:trDA.title	
ltx/en_us_oca/tr.d033:trHO.commemorations	
ltx/en_us_oca/tr.d033:trHO.daytitle	
ltx/en_us_oca/tr.d033:trHO.description1	
ltx/en_us_oca/tr.d033:trHO.description2	
ltx/en_us_oca/tr.d033:trHO.note1	
ltx/en_us_oca/tr.d033:trHO.note2	
ltx/en_us_oca/tr.d033:trTE.Troparion.incipit	Raise up those…
ltx/en_us_oca/tr.d033:trTE.Troparion.melody	
ltx/en_us_oca/tr.d033:trTE.Troparion.mode	@ltx/en_us_oca/miscellanea:misc.Mode1
ltx/en_us_oca/tr.d033:trTE.Troparion.text	Raise up those who have fallen, O God; ⁄ turn back those who have turned away, ⁄ for you are the Lover of mankind ⁄⁄ who uphold the ends of the earth.
ltx/en_us_oca/tr.d033:trTE.Troparion2.incipit	…
ltx/en_us_oca/tr.d033:trTE.Troparion2.text	
ltx/en_us_oca/tr.d033:trVE.AposIdiomelon1.incipit	Having undertaken the spiritual fast…
ltx/en_us_oca/tr.d033:trVE.AposIdiomelon1.melody	@ltx/en_us_oca/miscellanea:misc.Idiomelon
ltx/en_us_oca/tr.d033:trVE.AposIdiomelon1.mode	@ltx/en_us_oca/miscellanea:misc.Mode1
ltx/en_us_oca/tr.d033:trVE.AposIdiomelon1.text	Having undertaken the spiritual fast, brethren, let us speak no lies with our tongues, nor give each other a cause for scandal. But illumining the light of our souls through repentance, let us cry to Christ with tears: Remit our falls in sin, lover of mankind.
ltx/en_us_oca/tr.d033:trVE.AposMartyric.incipit	Martyrs, worthy of praise, the…
ltx/en_us_oca/tr.d033:trVE.AposMartyric.melody	@ltx/en_us_oca/miscellanea:misc.NotMetered
ltx/en_us_oca/tr.d033:trVE.AposMartyric.mode	@ltx/en_us_oca/miscellanea:misc.Mode1
ltx/en_us_oca/tr.d033:trVE.AposMartyric.text	Martyrs, worthy of praise, the earth did not cover you, but heaven received you, opening to you the gates of paradise, where you dwell, delighting in the tree of life. Entreat Christ to grant our souls peace and great mercy!
ltx/en_us_oca/tr.d033:trVE.Stichera01.incipit	Through the prayers of your…
ltx/en_us_oca/tr.d033:trVE.Stichera01.melody	@ltx/en_us_oca/miscellanea:misc.NotMetered
ltx/en_us_oca/tr.d033:trVE.Stichera01.mode	@ltx/en_us_oca/miscellanea:misc.Mode3
ltx/en_us_oca/tr.d033:trVE.Stichera01.poet	
ltx/en_us_oca/tr.d033:trVE.Stichera01.text	Through the prayers of your divine Apostles, Lord, enable us to perform a proper fast, with compunction of mind. That, being saved by you, we may glorify you, gracious and merciful God.
ltx/en_us_oca/tr.d033:trVE.Stichera02.incipit	Your coming will be great…
ltx/en_us_oca/tr.d033:trVE.Stichera02.melody	@ltx/en_us_oca/miscellanea:misc.NotMetered
ltx/en_us_oca/tr.d033:trVE.Stichera02.mode	@ltx/en_us_oca/miscellanea:misc.Mode3
ltx/en_us_oca/tr.d033:trVE.Stichera02.text	Your coming will be great and fearful, Lord, when you will come in righteous judgment. Do not condemn me, though I stand condemned, but spare me as the compassionate God, through the acceptable prayers of your Apostles.
ltx/en_us_oca/tr.d033:trVE.Stichera03.incipit	Apostles of Christ, the lights…
ltx/en_us_oca/tr.d033:trVE.Stichera03.melody	@ltx/en_us_oca/miscellanea:misc.NotMetered
ltx/en_us_oca/tr.d033:trVE.Stichera03.mode	@ltx/en_us_oca/miscellanea:misc.Mode6
ltx/en_us_oca/tr.d033:trVE.Stichera03.poet	
ltx/en_us_oca/tr.d033:trVE.Stichera03.text	Apostles of Christ, the lights of those born on earth, and treasuries for the world of the knowledge of God. Through your prayers deliver those who praise you from temptation. Enable us to pass the time of fasting in peace, as children, so that having attained the Passion of Christ, with boldness we may offer songs of praise to our God.
ltx/en_us_oca/tr.d033:trVL.header	
