ltx/en_us_oca/me.m11.d28:meDA.commemoration.first	
ltx/en_us_oca/me.m11.d28:meDA.commemoration.first_name	
ltx/en_us_oca/me.m11.d28:meDA.commemoration.first_short	
ltx/en_us_oca/me.m11.d28:meDA.commemoration.first_title	
ltx/en_us_oca/me.m11.d28:meDA.commemoration.full	
ltx/en_us_oca/me.m11.d28:meDA.commemoration.second_name	
ltx/en_us_oca/me.m11.d28:meDA.commemoration.second_title	
ltx/en_us_oca/me.m11.d28:meDA.date	
ltx/en_us_oca/me.m11.d28:meDA.fordate	
ltx/en_us_oca/me.m11.d28:meDA.insert1	
ltx/en_us_oca/me.m11.d28:meDA.insert2	
ltx/en_us_oca/me.m11.d28:meDA.note	
ltx/en_us_oca/me.m11.d28:meDA.pdfcoverdate	
ltx/en_us_oca/me.m11.d28:meDA.pdfheaderdate	
ltx/en_us_oca/me.m11.d28:meHO.commemorations	
ltx/en_us_oca/me.m11.d28:meHO.note1	
ltx/en_us_oca/me.m11.d28:meHO.note2	
ltx/en_us_oca/me.m11.d28:meHO.number	
ltx/en_us_oca/me.m11.d28:meHO.rank	
ltx/en_us_oca/me.m11.d28:meLE.commemoration1	
ltx/en_us_oca/me.m11.d28:meLE.commemoration2	
ltx/en_us_oca/me.m11.d28:meLI.Kontakion1.greekmelody	@ltx/en_us_oca/me.m11.d28:meMA.Kontakion1.greekmelody
ltx/en_us_oca/me.m11.d28:meLI.Kontakion1.incipit	@ltx/en_us_oca/me.m11.d28:meMA.Kontakion1.incipit
ltx/en_us_oca/me.m11.d28:meLI.Kontakion1.melody	@ltx/en_us_oca/me.m11.d28:meMA.Kontakion1.melody
ltx/en_us_oca/me.m11.d28:meLI.Kontakion1.mode	@ltx/en_us_oca/me.m11.d28:meMA.Kontakion1.mode
ltx/en_us_oca/me.m11.d28:meLI.Kontakion1.text	@ltx/en_us_oca/me.m11.d28:meMA.Kontakion1.text
ltx/en_us_oca/me.m11.d28:meLI.MM.CommunionHymn.text	@ltx/en_us_oca/properties:media.key
ltx/en_us_oca/me.m11.d28:meLI.Megalynarion.text	
ltx/en_us_oca/me.m11.d28:meMA.AposGlory.incipit	…
ltx/en_us_oca/me.m11.d28:meMA.AposGlory.melody	
ltx/en_us_oca/me.m11.d28:meMA.AposGlory.mode	@ltx/en_us_oca/miscellanea:misc.Mode3
ltx/en_us_oca/me.m11.d28:meMA.AposGlory.text	
ltx/en_us_oca/me.m11.d28:meMA.AposStavrotheotokion.greekmelody	@ltx/en_us_oca/he.a.m3:heAU.MegaliTouStavrouSou.greekname
ltx/en_us_oca/me.m11.d28:meMA.AposStavrotheotokion.incipit	…
ltx/en_us_oca/me.m11.d28:meMA.AposStavrotheotokion.melody	@ltx/en_us_oca/he.a.m3:heAU.MegaliTouStavrouSou.notmetered
ltx/en_us_oca/me.m11.d28:meMA.AposStavrotheotokion.mode	@ltx/en_us_oca/miscellanea:misc.Mode3
ltx/en_us_oca/me.m11.d28:meMA.AposStavrotheotokion.text	
ltx/en_us_oca/me.m11.d28:meMA.AposTheotokion.incipit	@ltx/en_us_oca/oc.m3.d3:ocMA.AposTheotokion.incipit
ltx/en_us_oca/me.m11.d28:meMA.AposTheotokion.melody	
ltx/en_us_oca/me.m11.d28:meMA.AposTheotokion.mode	@ltx/en_us_oca/miscellanea:misc.Mode3
ltx/en_us_oca/me.m11.d28:meMA.AposTheotokion.text	@ltx/en_us_oca/oc.m3.d3:ocMA.AposTheotokion.text
ltx/en_us_oca/me.m11.d28:meMA.C1.acrostic.notice1	
ltx/en_us_oca/me.m11.d28:meMA.C1.acrostic.text	
ltx/en_us_oca/me.m11.d28:meMA.C1.acrostic.title	
ltx/en_us_oca/me.m11.d28:meMA.C1.title	@ltx/en_us_oca/titles:ti.CanonDevoutM
ltx/en_us_oca/me.m11.d28:meMA.C1.verse	@ltx/en_us_oca/prayers:pr.verse_DevoutMan.text
ltx/en_us_oca/me.m11.d28:meMA.C2.acrostic.notice1	
ltx/en_us_oca/me.m11.d28:meMA.C2.acrostic.text	
ltx/en_us_oca/me.m11.d28:meMA.C2.acrostic.title	
ltx/en_us_oca/me.m11.d28:meMA.C2.poet	@ltx/en_us_oca/poets:po.Theofanous
ltx/en_us_oca/me.m11.d28:meMA.C2.title	@ltx/en_us_oca/titles:ti.CanonMartyrM
ltx/en_us_oca/me.m11.d28:meMA.C2.verse	@ltx/en_us_oca/prayers:pr.verse_SaintM.text
ltx/en_us_oca/me.m11.d28:meMA.ExapTheotokion.incipit	…
ltx/en_us_oca/me.m11.d28:meMA.ExapTheotokion.melody	@ltx/en_us_oca/he.a.m3:heAU.EpeskepsatoImas.notmetered
ltx/en_us_oca/me.m11.d28:meMA.ExapTheotokion.mode	@ltx/en_us_oca/miscellanea:misc.Mode3
ltx/en_us_oca/me.m11.d28:meMA.ExapTheotokion.text	
ltx/en_us_oca/me.m11.d28:meMA.Exaposteilarion1.greekmelody	@ltx/en_us_oca/he.a.m3:heAU.EpeskepsatoImas.greekname
ltx/en_us_oca/me.m11.d28:meMA.Exaposteilarion1.incipit	…
ltx/en_us_oca/me.m11.d28:meMA.Exaposteilarion1.melody	@ltx/en_us_oca/he.a.m3:heAU.EpeskepsatoImas.notmetered
ltx/en_us_oca/me.m11.d28:meMA.Exaposteilarion1.mode	@ltx/en_us_oca/miscellanea:misc.Mode3
ltx/en_us_oca/me.m11.d28:meMA.Exaposteilarion1.text	
ltx/en_us_oca/me.m11.d28:meMA.Exaposteilarion2.greekmelody	@ltx/en_us_oca/he.a.m3:heAU.EpeskepsatoImas.greekname
ltx/en_us_oca/me.m11.d28:meMA.Exaposteilarion2.incipit	…
ltx/en_us_oca/me.m11.d28:meMA.Exaposteilarion2.melody	@ltx/en_us_oca/he.a.m3:heAU.EpeskepsatoImas.notmetered
ltx/en_us_oca/me.m11.d28:meMA.Exaposteilarion2.mode	@ltx/en_us_oca/miscellanea:misc.Mode3
ltx/en_us_oca/me.m11.d28:meMA.Exaposteilarion2.text	
ltx/en_us_oca/me.m11.d28:meMA.Kontakion1.greekmelody	@ltx/en_us_oca/he.a.m4:heAU.EpefanisSimeron.greekname
ltx/en_us_oca/me.m11.d28:meMA.Kontakion1.incipit	…
ltx/en_us_oca/me.m11.d28:meMA.Kontakion1.melody	@ltx/en_us_oca/he.a.m4:heAU.EpefanisSimeron.notmetered
ltx/en_us_oca/me.m11.d28:meMA.Kontakion1.mode	@ltx/en_us_oca/miscellanea:misc.Mode4
ltx/en_us_oca/me.m11.d28:meMA.Kontakion1.text	
ltx/en_us_oca/me.m11.d28:meMA.Ode1C11.greekmelody	@ltx/en_us_oca/he.h.m6:heHE.OsEnIpeiroPezefsas.greekname
ltx/en_us_oca/me.m11.d28:meMA.Ode1C11.incipit	…
ltx/en_us_oca/me.m11.d28:meMA.Ode1C11.melody	@ltx/en_us_oca/he.h.m6:heHE.OsEnIpeiroPezefsas.notmetered
ltx/en_us_oca/me.m11.d28:meMA.Ode1C11.mode	@ltx/en_us_oca/miscellanea:misc.Mode6
ltx/en_us_oca/me.m11.d28:meMA.Ode1C11.ode	@ltx/en_us_oca/miscellanea:misc.Ode1
ltx/en_us_oca/me.m11.d28:meMA.Ode1C11.text	
ltx/en_us_oca/me.m11.d28:meMA.Ode1C12.incipit	…
ltx/en_us_oca/me.m11.d28:meMA.Ode1C12.melody	@ltx/en_us_oca/he.h.m6:heHE.OsEnIpeiroPezefsas.notmetered
ltx/en_us_oca/me.m11.d28:meMA.Ode1C12.mode	@ltx/en_us_oca/miscellanea:misc.Mode6
ltx/en_us_oca/me.m11.d28:meMA.Ode1C12.ode	@ltx/en_us_oca/miscellanea:misc.Ode1
ltx/en_us_oca/me.m11.d28:meMA.Ode1C12.text	
ltx/en_us_oca/me.m11.d28:meMA.Ode1C13.incipit	…
ltx/en_us_oca/me.m11.d28:meMA.Ode1C13.melody	@ltx/en_us_oca/he.h.m6:heHE.OsEnIpeiroPezefsas.notmetered
ltx/en_us_oca/me.m11.d28:meMA.Ode1C13.mode	@ltx/en_us_oca/miscellanea:misc.Mode6
ltx/en_us_oca/me.m11.d28:meMA.Ode1C13.ode	@ltx/en_us_oca/miscellanea:misc.Ode1
ltx/en_us_oca/me.m11.d28:meMA.Ode1C13.text	
ltx/en_us_oca/me.m11.d28:meMA.Ode1C14.incipit	…
ltx/en_us_oca/me.m11.d28:meMA.Ode1C14.melody	@ltx/en_us_oca/he.h.m6:heHE.OsEnIpeiroPezefsas.notmetered
ltx/en_us_oca/me.m11.d28:meMA.Ode1C14.mode	@ltx/en_us_oca/miscellanea:misc.Mode6
ltx/en_us_oca/me.m11.d28:meMA.Ode1C14.ode	@ltx/en_us_oca/miscellanea:misc.Ode1
ltx/en_us_oca/me.m11.d28:meMA.Ode1C14.text	
ltx/en_us_oca/me.m11.d28:meMA.Ode1C1T.incipit	…
ltx/en_us_oca/me.m11.d28:meMA.Ode1C1T.melody	@ltx/en_us_oca/he.h.m6:heHE.OsEnIpeiroPezefsas.notmetered
ltx/en_us_oca/me.m11.d28:meMA.Ode1C1T.mode	@ltx/en_us_oca/miscellanea:misc.Mode6
ltx/en_us_oca/me.m11.d28:meMA.Ode1C1T.ode	@ltx/en_us_oca/miscellanea:misc.Ode1
ltx/en_us_oca/me.m11.d28:meMA.Ode1C1T.text	
ltx/en_us_oca/me.m11.d28:meMA.Ode1C21.greekmelody	@ltx/en_us_oca/he.h.m6:heHE.OsEnIpeiroPezefsas.greekname
ltx/en_us_oca/me.m11.d28:meMA.Ode1C21.incipit	…
ltx/en_us_oca/me.m11.d28:meMA.Ode1C21.melody	@ltx/en_us_oca/he.h.m6:heHE.OsEnIpeiroPezefsas.notmetered
ltx/en_us_oca/me.m11.d28:meMA.Ode1C21.mode	@ltx/en_us_oca/miscellanea:misc.Mode6
ltx/en_us_oca/me.m11.d28:meMA.Ode1C21.ode	@ltx/en_us_oca/miscellanea:misc.Ode1
ltx/en_us_oca/me.m11.d28:meMA.Ode1C21.text	
ltx/en_us_oca/me.m11.d28:meMA.Ode1C22.incipit	…
ltx/en_us_oca/me.m11.d28:meMA.Ode1C22.melody	@ltx/en_us_oca/he.h.m6:heHE.OsEnIpeiroPezefsas.notmetered
ltx/en_us_oca/me.m11.d28:meMA.Ode1C22.mode	@ltx/en_us_oca/miscellanea:misc.Mode6
ltx/en_us_oca/me.m11.d28:meMA.Ode1C22.ode	@ltx/en_us_oca/miscellanea:misc.Ode1
ltx/en_us_oca/me.m11.d28:meMA.Ode1C22.text	
ltx/en_us_oca/me.m11.d28:meMA.Ode1C23.incipit	…
ltx/en_us_oca/me.m11.d28:meMA.Ode1C23.melody	@ltx/en_us_oca/he.h.m6:heHE.OsEnIpeiroPezefsas.notmetered
ltx/en_us_oca/me.m11.d28:meMA.Ode1C23.mode	@ltx/en_us_oca/miscellanea:misc.Mode6
ltx/en_us_oca/me.m11.d28:meMA.Ode1C23.ode	@ltx/en_us_oca/miscellanea:misc.Ode1
ltx/en_us_oca/me.m11.d28:meMA.Ode1C23.text	
ltx/en_us_oca/me.m11.d28:meMA.Ode1C2T.incipit	…
ltx/en_us_oca/me.m11.d28:meMA.Ode1C2T.melody	@ltx/en_us_oca/he.h.m6:heHE.OsEnIpeiroPezefsas.notmetered
ltx/en_us_oca/me.m11.d28:meMA.Ode1C2T.mode	@ltx/en_us_oca/miscellanea:misc.Mode6
ltx/en_us_oca/me.m11.d28:meMA.Ode1C2T.ode	@ltx/en_us_oca/miscellanea:misc.Ode1
ltx/en_us_oca/me.m11.d28:meMA.Ode1C2T.text	
ltx/en_us_oca/me.m11.d28:meMA.Ode3C11.greekmelody	@ltx/en_us_oca/he.h.m6:heHE.OukEstinAgios.greekname
ltx/en_us_oca/me.m11.d28:meMA.Ode3C11.incipit	…
ltx/en_us_oca/me.m11.d28:meMA.Ode3C11.melody	@ltx/en_us_oca/he.h.m6:heHE.OukEstinAgios.notmetered
ltx/en_us_oca/me.m11.d28:meMA.Ode3C11.mode	@ltx/en_us_oca/miscellanea:misc.Mode6
ltx/en_us_oca/me.m11.d28:meMA.Ode3C11.ode	@ltx/en_us_oca/miscellanea:misc.Ode3
ltx/en_us_oca/me.m11.d28:meMA.Ode3C11.text	
ltx/en_us_oca/me.m11.d28:meMA.Ode3C12.incipit	…
ltx/en_us_oca/me.m11.d28:meMA.Ode3C12.melody	@ltx/en_us_oca/he.h.m6:heHE.OukEstinAgios.notmetered
ltx/en_us_oca/me.m11.d28:meMA.Ode3C12.mode	@ltx/en_us_oca/miscellanea:misc.Mode6
ltx/en_us_oca/me.m11.d28:meMA.Ode3C12.ode	@ltx/en_us_oca/miscellanea:misc.Ode3
ltx/en_us_oca/me.m11.d28:meMA.Ode3C12.text	
ltx/en_us_oca/me.m11.d28:meMA.Ode3C13.incipit	…
ltx/en_us_oca/me.m11.d28:meMA.Ode3C13.melody	@ltx/en_us_oca/he.h.m6:heHE.OukEstinAgios.notmetered
ltx/en_us_oca/me.m11.d28:meMA.Ode3C13.mode	@ltx/en_us_oca/miscellanea:misc.Mode6
ltx/en_us_oca/me.m11.d28:meMA.Ode3C13.ode	@ltx/en_us_oca/miscellanea:misc.Ode3
ltx/en_us_oca/me.m11.d28:meMA.Ode3C13.text	
ltx/en_us_oca/me.m11.d28:meMA.Ode3C14.incipit	…
ltx/en_us_oca/me.m11.d28:meMA.Ode3C14.melody	@ltx/en_us_oca/he.h.m6:heHE.OukEstinAgios.notmetered
ltx/en_us_oca/me.m11.d28:meMA.Ode3C14.mode	@ltx/en_us_oca/miscellanea:misc.Mode6
ltx/en_us_oca/me.m11.d28:meMA.Ode3C14.ode	@ltx/en_us_oca/miscellanea:misc.Ode3
ltx/en_us_oca/me.m11.d28:meMA.Ode3C14.text	
ltx/en_us_oca/me.m11.d28:meMA.Ode3C1T.incipit	…
ltx/en_us_oca/me.m11.d28:meMA.Ode3C1T.melody	@ltx/en_us_oca/he.h.m6:heHE.OukEstinAgios.notmetered
ltx/en_us_oca/me.m11.d28:meMA.Ode3C1T.mode	@ltx/en_us_oca/miscellanea:misc.Mode6
ltx/en_us_oca/me.m11.d28:meMA.Ode3C1T.ode	@ltx/en_us_oca/miscellanea:misc.Ode3
ltx/en_us_oca/me.m11.d28:meMA.Ode3C1T.text	
ltx/en_us_oca/me.m11.d28:meMA.Ode3C21.greekmelody	@ltx/en_us_oca/he.h.m6:heHE.OukEstinAgios.greekname
ltx/en_us_oca/me.m11.d28:meMA.Ode3C21.incipit	…
ltx/en_us_oca/me.m11.d28:meMA.Ode3C21.melody	@ltx/en_us_oca/he.h.m6:heHE.OukEstinAgios.notmetered
ltx/en_us_oca/me.m11.d28:meMA.Ode3C21.mode	@ltx/en_us_oca/miscellanea:misc.Mode6
ltx/en_us_oca/me.m11.d28:meMA.Ode3C21.ode	@ltx/en_us_oca/miscellanea:misc.Ode3
ltx/en_us_oca/me.m11.d28:meMA.Ode3C21.text	
ltx/en_us_oca/me.m11.d28:meMA.Ode3C22.incipit	…
ltx/en_us_oca/me.m11.d28:meMA.Ode3C22.melody	@ltx/en_us_oca/he.h.m6:heHE.OukEstinAgios.notmetered
ltx/en_us_oca/me.m11.d28:meMA.Ode3C22.mode	@ltx/en_us_oca/miscellanea:misc.Mode6
ltx/en_us_oca/me.m11.d28:meMA.Ode3C22.ode	@ltx/en_us_oca/miscellanea:misc.Ode3
ltx/en_us_oca/me.m11.d28:meMA.Ode3C22.text	
ltx/en_us_oca/me.m11.d28:meMA.Ode3C23.incipit	…
ltx/en_us_oca/me.m11.d28:meMA.Ode3C23.melody	@ltx/en_us_oca/he.h.m6:heHE.OukEstinAgios.notmetered
ltx/en_us_oca/me.m11.d28:meMA.Ode3C23.mode	@ltx/en_us_oca/miscellanea:misc.Mode6
ltx/en_us_oca/me.m11.d28:meMA.Ode3C23.ode	@ltx/en_us_oca/miscellanea:misc.Ode3
ltx/en_us_oca/me.m11.d28:meMA.Ode3C23.text	
ltx/en_us_oca/me.m11.d28:meMA.Ode3C2T.incipit	…
ltx/en_us_oca/me.m11.d28:meMA.Ode3C2T.melody	@ltx/en_us_oca/he.h.m6:heHE.OukEstinAgios.notmetered
ltx/en_us_oca/me.m11.d28:meMA.Ode3C2T.mode	@ltx/en_us_oca/miscellanea:misc.Mode6
ltx/en_us_oca/me.m11.d28:meMA.Ode3C2T.ode	@ltx/en_us_oca/miscellanea:misc.Ode3
ltx/en_us_oca/me.m11.d28:meMA.Ode3C2T.text	
ltx/en_us_oca/me.m11.d28:meMA.Ode3H.greekmelody	@ltx/en_us_oca/he.h.m6:heHE.OukEstinAgios.greekname
ltx/en_us_oca/me.m11.d28:meMA.Ode3H.incipit	@ltx/en_us_oca/he.h.m6:heHE.OukEstinAgios.incipit
ltx/en_us_oca/me.m11.d28:meMA.Ode3H.melody	@ltx/en_us_oca/he.h.m6:heHE.OukEstinAgios.melody
ltx/en_us_oca/me.m11.d28:meMA.Ode3H.mode	@ltx/en_us_oca/miscellanea:misc.Mode6
ltx/en_us_oca/me.m11.d28:meMA.Ode3H.ode	@ltx/en_us_oca/miscellanea:misc.Ode3
ltx/en_us_oca/me.m11.d28:meMA.Ode3H.text	@ltx/en_us_oca/he.h.m6:heHE.OukEstinAgios.text
ltx/en_us_oca/me.m11.d28:meMA.Ode3Kathisma1.greekmelody	@ltx/en_us_oca/he.a.m4:heAU.OYpsotheisEnToStavro.greekname
ltx/en_us_oca/me.m11.d28:meMA.Ode3Kathisma1.incipit	…
ltx/en_us_oca/me.m11.d28:meMA.Ode3Kathisma1.melody	@ltx/en_us_oca/he.a.m4:heAU.OYpsotheisEnToStavro.notmetered
ltx/en_us_oca/me.m11.d28:meMA.Ode3Kathisma1.mode	@ltx/en_us_oca/miscellanea:misc.Mode4
ltx/en_us_oca/me.m11.d28:meMA.Ode3Kathisma1.text	
ltx/en_us_oca/me.m11.d28:meMA.Ode3Kathisma2.greekmelody	@ltx/en_us_oca/he.a.m4:heAU.OYpsotheisEnToStavro.greekname
ltx/en_us_oca/me.m11.d28:meMA.Ode3Kathisma2.incipit	…
ltx/en_us_oca/me.m11.d28:meMA.Ode3Kathisma2.melody	@ltx/en_us_oca/he.a.m4:heAU.OYpsotheisEnToStavro.notmetered
ltx/en_us_oca/me.m11.d28:meMA.Ode3Kathisma2.mode	@ltx/en_us_oca/miscellanea:misc.Mode4
ltx/en_us_oca/me.m11.d28:meMA.Ode3Kathisma2.text	
ltx/en_us_oca/me.m11.d28:meMA.Ode3KathismaSt.incipit	…
ltx/en_us_oca/me.m11.d28:meMA.Ode3KathismaSt.melody	@ltx/en_us_oca/he.a.m4:heAU.OYpsotheisEnToStavro.notmetered
ltx/en_us_oca/me.m11.d28:meMA.Ode3KathismaSt.mode	@ltx/en_us_oca/miscellanea:misc.Mode4
ltx/en_us_oca/me.m11.d28:meMA.Ode3KathismaSt.text	
ltx/en_us_oca/me.m11.d28:meMA.Ode3KathismaT.incipit	…
ltx/en_us_oca/me.m11.d28:meMA.Ode3KathismaT.melody	@ltx/en_us_oca/he.a.m4:heAU.OYpsotheisEnToStavro.notmetered
ltx/en_us_oca/me.m11.d28:meMA.Ode3KathismaT.mode	@ltx/en_us_oca/miscellanea:misc.Mode4
ltx/en_us_oca/me.m11.d28:meMA.Ode3KathismaT.text	
ltx/en_us_oca/me.m11.d28:meMA.Ode4C11.greekmelody	@ltx/en_us_oca/he.h.m6:heHE.ChristosMouDynamis.greekname
ltx/en_us_oca/me.m11.d28:meMA.Ode4C11.incipit	…
ltx/en_us_oca/me.m11.d28:meMA.Ode4C11.melody	@ltx/en_us_oca/he.h.m6:heHE.ChristosMouDynamis.notmetered
ltx/en_us_oca/me.m11.d28:meMA.Ode4C11.mode	@ltx/en_us_oca/miscellanea:misc.Mode6
ltx/en_us_oca/me.m11.d28:meMA.Ode4C11.ode	@ltx/en_us_oca/miscellanea:misc.Ode4
ltx/en_us_oca/me.m11.d28:meMA.Ode4C11.text	
ltx/en_us_oca/me.m11.d28:meMA.Ode4C12.incipit	…
ltx/en_us_oca/me.m11.d28:meMA.Ode4C12.melody	@ltx/en_us_oca/he.h.m6:heHE.ChristosMouDynamis.notmetered
ltx/en_us_oca/me.m11.d28:meMA.Ode4C12.mode	@ltx/en_us_oca/miscellanea:misc.Mode6
ltx/en_us_oca/me.m11.d28:meMA.Ode4C12.ode	@ltx/en_us_oca/miscellanea:misc.Ode4
ltx/en_us_oca/me.m11.d28:meMA.Ode4C12.text	
ltx/en_us_oca/me.m11.d28:meMA.Ode4C13.incipit	…
ltx/en_us_oca/me.m11.d28:meMA.Ode4C13.melody	@ltx/en_us_oca/he.h.m6:heHE.ChristosMouDynamis.notmetered
ltx/en_us_oca/me.m11.d28:meMA.Ode4C13.mode	@ltx/en_us_oca/miscellanea:misc.Mode6
ltx/en_us_oca/me.m11.d28:meMA.Ode4C13.ode	@ltx/en_us_oca/miscellanea:misc.Ode4
ltx/en_us_oca/me.m11.d28:meMA.Ode4C13.text	
ltx/en_us_oca/me.m11.d28:meMA.Ode4C14.incipit	…
ltx/en_us_oca/me.m11.d28:meMA.Ode4C14.melody	@ltx/en_us_oca/he.h.m6:heHE.ChristosMouDynamis.notmetered
ltx/en_us_oca/me.m11.d28:meMA.Ode4C14.mode	@ltx/en_us_oca/miscellanea:misc.Mode6
ltx/en_us_oca/me.m11.d28:meMA.Ode4C14.ode	@ltx/en_us_oca/miscellanea:misc.Ode4
ltx/en_us_oca/me.m11.d28:meMA.Ode4C14.text	
ltx/en_us_oca/me.m11.d28:meMA.Ode4C1T.incipit	…
ltx/en_us_oca/me.m11.d28:meMA.Ode4C1T.melody	@ltx/en_us_oca/he.h.m6:heHE.ChristosMouDynamis.notmetered
ltx/en_us_oca/me.m11.d28:meMA.Ode4C1T.mode	@ltx/en_us_oca/miscellanea:misc.Mode6
ltx/en_us_oca/me.m11.d28:meMA.Ode4C1T.ode	@ltx/en_us_oca/miscellanea:misc.Ode4
ltx/en_us_oca/me.m11.d28:meMA.Ode4C1T.text	
ltx/en_us_oca/me.m11.d28:meMA.Ode4C21.greekmelody	@ltx/en_us_oca/he.h.m6:heHE.ChristosMouDynamis.greekname
ltx/en_us_oca/me.m11.d28:meMA.Ode4C21.incipit	…
ltx/en_us_oca/me.m11.d28:meMA.Ode4C21.melody	@ltx/en_us_oca/he.h.m6:heHE.ChristosMouDynamis.notmetered
ltx/en_us_oca/me.m11.d28:meMA.Ode4C21.mode	@ltx/en_us_oca/miscellanea:misc.Mode6
ltx/en_us_oca/me.m11.d28:meMA.Ode4C21.ode	@ltx/en_us_oca/miscellanea:misc.Ode4
ltx/en_us_oca/me.m11.d28:meMA.Ode4C21.text	
ltx/en_us_oca/me.m11.d28:meMA.Ode4C22.incipit	…
ltx/en_us_oca/me.m11.d28:meMA.Ode4C22.melody	@ltx/en_us_oca/he.h.m6:heHE.ChristosMouDynamis.notmetered
ltx/en_us_oca/me.m11.d28:meMA.Ode4C22.mode	@ltx/en_us_oca/miscellanea:misc.Mode6
ltx/en_us_oca/me.m11.d28:meMA.Ode4C22.ode	@ltx/en_us_oca/miscellanea:misc.Ode4
ltx/en_us_oca/me.m11.d28:meMA.Ode4C22.text	
ltx/en_us_oca/me.m11.d28:meMA.Ode4C23.incipit	…
ltx/en_us_oca/me.m11.d28:meMA.Ode4C23.melody	@ltx/en_us_oca/he.h.m6:heHE.ChristosMouDynamis.notmetered
ltx/en_us_oca/me.m11.d28:meMA.Ode4C23.mode	@ltx/en_us_oca/miscellanea:misc.Mode6
ltx/en_us_oca/me.m11.d28:meMA.Ode4C23.ode	@ltx/en_us_oca/miscellanea:misc.Ode4
ltx/en_us_oca/me.m11.d28:meMA.Ode4C23.text	
ltx/en_us_oca/me.m11.d28:meMA.Ode4C24.incipit	…
ltx/en_us_oca/me.m11.d28:meMA.Ode4C24.melody	@ltx/en_us_oca/he.h.m6:heHE.ChristosMouDynamis.notmetered
ltx/en_us_oca/me.m11.d28:meMA.Ode4C24.mode	@ltx/en_us_oca/miscellanea:misc.Mode6
ltx/en_us_oca/me.m11.d28:meMA.Ode4C24.ode	@ltx/en_us_oca/miscellanea:misc.Ode4
ltx/en_us_oca/me.m11.d28:meMA.Ode4C24.text	
ltx/en_us_oca/me.m11.d28:meMA.Ode4C2T.incipit	…
ltx/en_us_oca/me.m11.d28:meMA.Ode4C2T.melody	@ltx/en_us_oca/he.h.m6:heHE.ChristosMouDynamis.notmetered
ltx/en_us_oca/me.m11.d28:meMA.Ode4C2T.mode	@ltx/en_us_oca/miscellanea:misc.Mode6
ltx/en_us_oca/me.m11.d28:meMA.Ode4C2T.ode	@ltx/en_us_oca/miscellanea:misc.Ode4
ltx/en_us_oca/me.m11.d28:meMA.Ode4C2T.text	
ltx/en_us_oca/me.m11.d28:meMA.Ode5C11.greekmelody	@ltx/en_us_oca/he.h.m6:heHE.ToTheioFengeiSou.greekname
ltx/en_us_oca/me.m11.d28:meMA.Ode5C11.incipit	…
ltx/en_us_oca/me.m11.d28:meMA.Ode5C11.melody	@ltx/en_us_oca/he.h.m6:heHE.ToTheioFengeiSou.notmetered
ltx/en_us_oca/me.m11.d28:meMA.Ode5C11.mode	@ltx/en_us_oca/miscellanea:misc.Mode6
ltx/en_us_oca/me.m11.d28:meMA.Ode5C11.ode	@ltx/en_us_oca/miscellanea:misc.Ode5
ltx/en_us_oca/me.m11.d28:meMA.Ode5C11.text	
ltx/en_us_oca/me.m11.d28:meMA.Ode5C12.incipit	…
ltx/en_us_oca/me.m11.d28:meMA.Ode5C12.melody	@ltx/en_us_oca/he.h.m6:heHE.ToTheioFengeiSou.notmetered
ltx/en_us_oca/me.m11.d28:meMA.Ode5C12.mode	@ltx/en_us_oca/miscellanea:misc.Mode6
ltx/en_us_oca/me.m11.d28:meMA.Ode5C12.ode	@ltx/en_us_oca/miscellanea:misc.Ode5
ltx/en_us_oca/me.m11.d28:meMA.Ode5C12.text	
ltx/en_us_oca/me.m11.d28:meMA.Ode5C13.incipit	…
ltx/en_us_oca/me.m11.d28:meMA.Ode5C13.melody	@ltx/en_us_oca/he.h.m6:heHE.ToTheioFengeiSou.notmetered
ltx/en_us_oca/me.m11.d28:meMA.Ode5C13.mode	@ltx/en_us_oca/miscellanea:misc.Mode6
ltx/en_us_oca/me.m11.d28:meMA.Ode5C13.ode	@ltx/en_us_oca/miscellanea:misc.Ode5
ltx/en_us_oca/me.m11.d28:meMA.Ode5C13.text	
ltx/en_us_oca/me.m11.d28:meMA.Ode5C14.incipit	…
ltx/en_us_oca/me.m11.d28:meMA.Ode5C14.melody	@ltx/en_us_oca/he.h.m6:heHE.ToTheioFengeiSou.notmetered
ltx/en_us_oca/me.m11.d28:meMA.Ode5C14.mode	@ltx/en_us_oca/miscellanea:misc.Mode6
ltx/en_us_oca/me.m11.d28:meMA.Ode5C14.ode	@ltx/en_us_oca/miscellanea:misc.Ode5
ltx/en_us_oca/me.m11.d28:meMA.Ode5C14.text	
ltx/en_us_oca/me.m11.d28:meMA.Ode5C1T.incipit	…
ltx/en_us_oca/me.m11.d28:meMA.Ode5C1T.melody	@ltx/en_us_oca/he.h.m6:heHE.ToTheioFengeiSou.notmetered
ltx/en_us_oca/me.m11.d28:meMA.Ode5C1T.mode	@ltx/en_us_oca/miscellanea:misc.Mode6
ltx/en_us_oca/me.m11.d28:meMA.Ode5C1T.ode	@ltx/en_us_oca/miscellanea:misc.Ode5
ltx/en_us_oca/me.m11.d28:meMA.Ode5C1T.text	
ltx/en_us_oca/me.m11.d28:meMA.Ode5C21.greekmelody	@ltx/en_us_oca/he.h.m6:heHE.ToTheioFengeiSou.greekname
ltx/en_us_oca/me.m11.d28:meMA.Ode5C21.incipit	…
ltx/en_us_oca/me.m11.d28:meMA.Ode5C21.melody	@ltx/en_us_oca/he.h.m6:heHE.ToTheioFengeiSou.notmetered
ltx/en_us_oca/me.m11.d28:meMA.Ode5C21.mode	@ltx/en_us_oca/miscellanea:misc.Mode6
ltx/en_us_oca/me.m11.d28:meMA.Ode5C21.ode	@ltx/en_us_oca/miscellanea:misc.Ode5
ltx/en_us_oca/me.m11.d28:meMA.Ode5C21.text	
ltx/en_us_oca/me.m11.d28:meMA.Ode5C22.incipit	…
ltx/en_us_oca/me.m11.d28:meMA.Ode5C22.melody	@ltx/en_us_oca/he.h.m6:heHE.ToTheioFengeiSou.notmetered
ltx/en_us_oca/me.m11.d28:meMA.Ode5C22.mode	@ltx/en_us_oca/miscellanea:misc.Mode6
ltx/en_us_oca/me.m11.d28:meMA.Ode5C22.ode	@ltx/en_us_oca/miscellanea:misc.Ode5
ltx/en_us_oca/me.m11.d28:meMA.Ode5C22.text	
ltx/en_us_oca/me.m11.d28:meMA.Ode5C23.incipit	…
ltx/en_us_oca/me.m11.d28:meMA.Ode5C23.melody	@ltx/en_us_oca/he.h.m6:heHE.ToTheioFengeiSou.notmetered
ltx/en_us_oca/me.m11.d28:meMA.Ode5C23.mode	@ltx/en_us_oca/miscellanea:misc.Mode6
ltx/en_us_oca/me.m11.d28:meMA.Ode5C23.ode	@ltx/en_us_oca/miscellanea:misc.Ode5
ltx/en_us_oca/me.m11.d28:meMA.Ode5C23.text	
ltx/en_us_oca/me.m11.d28:meMA.Ode5C2T.incipit	…
ltx/en_us_oca/me.m11.d28:meMA.Ode5C2T.melody	@ltx/en_us_oca/he.h.m6:heHE.ToTheioFengeiSou.notmetered
ltx/en_us_oca/me.m11.d28:meMA.Ode5C2T.mode	@ltx/en_us_oca/miscellanea:misc.Mode6
ltx/en_us_oca/me.m11.d28:meMA.Ode5C2T.ode	@ltx/en_us_oca/miscellanea:misc.Ode5
ltx/en_us_oca/me.m11.d28:meMA.Ode5C2T.text	
ltx/en_us_oca/me.m11.d28:meMA.Ode6C11.greekmelody	@ltx/en_us_oca/he.h.m6:heHE.TouViouTinThalassan.greekname
ltx/en_us_oca/me.m11.d28:meMA.Ode6C11.incipit	…
ltx/en_us_oca/me.m11.d28:meMA.Ode6C11.melody	@ltx/en_us_oca/he.h.m6:heHE.TouViouTinThalassan.notmetered
ltx/en_us_oca/me.m11.d28:meMA.Ode6C11.mode	@ltx/en_us_oca/miscellanea:misc.Mode6
ltx/en_us_oca/me.m11.d28:meMA.Ode6C11.ode	@ltx/en_us_oca/miscellanea:misc.Ode6
ltx/en_us_oca/me.m11.d28:meMA.Ode6C11.text	
ltx/en_us_oca/me.m11.d28:meMA.Ode6C12.incipit	…
ltx/en_us_oca/me.m11.d28:meMA.Ode6C12.melody	@ltx/en_us_oca/he.h.m6:heHE.TouViouTinThalassan.notmetered
ltx/en_us_oca/me.m11.d28:meMA.Ode6C12.mode	@ltx/en_us_oca/miscellanea:misc.Mode6
ltx/en_us_oca/me.m11.d28:meMA.Ode6C12.ode	@ltx/en_us_oca/miscellanea:misc.Ode6
ltx/en_us_oca/me.m11.d28:meMA.Ode6C12.text	
ltx/en_us_oca/me.m11.d28:meMA.Ode6C13.incipit	…
ltx/en_us_oca/me.m11.d28:meMA.Ode6C13.melody	@ltx/en_us_oca/he.h.m6:heHE.TouViouTinThalassan.notmetered
ltx/en_us_oca/me.m11.d28:meMA.Ode6C13.mode	@ltx/en_us_oca/miscellanea:misc.Mode6
ltx/en_us_oca/me.m11.d28:meMA.Ode6C13.ode	@ltx/en_us_oca/miscellanea:misc.Ode6
ltx/en_us_oca/me.m11.d28:meMA.Ode6C13.text	
ltx/en_us_oca/me.m11.d28:meMA.Ode6C14.incipit	…
ltx/en_us_oca/me.m11.d28:meMA.Ode6C14.melody	@ltx/en_us_oca/he.h.m6:heHE.TouViouTinThalassan.notmetered
ltx/en_us_oca/me.m11.d28:meMA.Ode6C14.mode	@ltx/en_us_oca/miscellanea:misc.Mode6
ltx/en_us_oca/me.m11.d28:meMA.Ode6C14.ode	@ltx/en_us_oca/miscellanea:misc.Ode6
ltx/en_us_oca/me.m11.d28:meMA.Ode6C14.text	
ltx/en_us_oca/me.m11.d28:meMA.Ode6C1T.incipit	…
ltx/en_us_oca/me.m11.d28:meMA.Ode6C1T.melody	@ltx/en_us_oca/he.h.m6:heHE.TouViouTinThalassan.notmetered
ltx/en_us_oca/me.m11.d28:meMA.Ode6C1T.mode	@ltx/en_us_oca/miscellanea:misc.Mode6
ltx/en_us_oca/me.m11.d28:meMA.Ode6C1T.ode	@ltx/en_us_oca/miscellanea:misc.Ode6
ltx/en_us_oca/me.m11.d28:meMA.Ode6C1T.text	
ltx/en_us_oca/me.m11.d28:meMA.Ode6C21.greekmelody	@ltx/en_us_oca/he.h.m6:heHE.TouViouTinThalassan.greekname
ltx/en_us_oca/me.m11.d28:meMA.Ode6C21.incipit	…
ltx/en_us_oca/me.m11.d28:meMA.Ode6C21.melody	@ltx/en_us_oca/he.h.m6:heHE.TouViouTinThalassan.notmetered
ltx/en_us_oca/me.m11.d28:meMA.Ode6C21.mode	@ltx/en_us_oca/miscellanea:misc.Mode6
ltx/en_us_oca/me.m11.d28:meMA.Ode6C21.ode	@ltx/en_us_oca/miscellanea:misc.Ode6
ltx/en_us_oca/me.m11.d28:meMA.Ode6C21.text	
ltx/en_us_oca/me.m11.d28:meMA.Ode6C22.incipit	…
ltx/en_us_oca/me.m11.d28:meMA.Ode6C22.melody	@ltx/en_us_oca/he.h.m6:heHE.TouViouTinThalassan.notmetered
ltx/en_us_oca/me.m11.d28:meMA.Ode6C22.mode	@ltx/en_us_oca/miscellanea:misc.Mode6
ltx/en_us_oca/me.m11.d28:meMA.Ode6C22.ode	@ltx/en_us_oca/miscellanea:misc.Ode6
ltx/en_us_oca/me.m11.d28:meMA.Ode6C22.text	
ltx/en_us_oca/me.m11.d28:meMA.Ode6C23.incipit	…
ltx/en_us_oca/me.m11.d28:meMA.Ode6C23.melody	@ltx/en_us_oca/he.h.m6:heHE.TouViouTinThalassan.notmetered
ltx/en_us_oca/me.m11.d28:meMA.Ode6C23.mode	@ltx/en_us_oca/miscellanea:misc.Mode6
ltx/en_us_oca/me.m11.d28:meMA.Ode6C23.ode	@ltx/en_us_oca/miscellanea:misc.Ode6
ltx/en_us_oca/me.m11.d28:meMA.Ode6C23.text	
ltx/en_us_oca/me.m11.d28:meMA.Ode6C2T.incipit	…
ltx/en_us_oca/me.m11.d28:meMA.Ode6C2T.melody	@ltx/en_us_oca/he.h.m6:heHE.TouViouTinThalassan.notmetered
ltx/en_us_oca/me.m11.d28:meMA.Ode6C2T.mode	@ltx/en_us_oca/miscellanea:misc.Mode6
ltx/en_us_oca/me.m11.d28:meMA.Ode6C2T.ode	@ltx/en_us_oca/miscellanea:misc.Ode6
ltx/en_us_oca/me.m11.d28:meMA.Ode6C2T.text	
ltx/en_us_oca/me.m11.d28:meMA.Ode6H.greekmelody	@ltx/en_us_oca/he.h.m6:heHE.TouViouTinThalassan.greekname
ltx/en_us_oca/me.m11.d28:meMA.Ode6H.incipit	@ltx/en_us_oca/he.h.m6:heHE.TouViouTinThalassan.incipit
ltx/en_us_oca/me.m11.d28:meMA.Ode6H.melody	@ltx/en_us_oca/he.h.m6:heHE.TouViouTinThalassan.melody
ltx/en_us_oca/me.m11.d28:meMA.Ode6H.mode	@ltx/en_us_oca/miscellanea:misc.Mode6
ltx/en_us_oca/me.m11.d28:meMA.Ode6H.ode	@ltx/en_us_oca/miscellanea:misc.Ode6
ltx/en_us_oca/me.m11.d28:meMA.Ode6H.text	@ltx/en_us_oca/he.h.m6:heHE.TouViouTinThalassan.text
ltx/en_us_oca/me.m11.d28:meMA.Ode7C11.greekmelody	@ltx/en_us_oca/he.h.m6:heHE.DrosovolonMenTinKaminon.greekname
ltx/en_us_oca/me.m11.d28:meMA.Ode7C11.incipit	…
ltx/en_us_oca/me.m11.d28:meMA.Ode7C11.melody	@ltx/en_us_oca/he.h.m6:heHE.DrosovolonMenTinKaminon.notmetered
ltx/en_us_oca/me.m11.d28:meMA.Ode7C11.mode	@ltx/en_us_oca/miscellanea:misc.Mode6
ltx/en_us_oca/me.m11.d28:meMA.Ode7C11.ode	@ltx/en_us_oca/miscellanea:misc.Ode7
ltx/en_us_oca/me.m11.d28:meMA.Ode7C11.text	
ltx/en_us_oca/me.m11.d28:meMA.Ode7C12.incipit	…
ltx/en_us_oca/me.m11.d28:meMA.Ode7C12.melody	@ltx/en_us_oca/he.h.m6:heHE.DrosovolonMenTinKaminon.notmetered
ltx/en_us_oca/me.m11.d28:meMA.Ode7C12.mode	@ltx/en_us_oca/miscellanea:misc.Mode6
ltx/en_us_oca/me.m11.d28:meMA.Ode7C12.ode	@ltx/en_us_oca/miscellanea:misc.Ode7
ltx/en_us_oca/me.m11.d28:meMA.Ode7C12.text	
ltx/en_us_oca/me.m11.d28:meMA.Ode7C13.incipit	…
ltx/en_us_oca/me.m11.d28:meMA.Ode7C13.melody	@ltx/en_us_oca/he.h.m6:heHE.DrosovolonMenTinKaminon.notmetered
ltx/en_us_oca/me.m11.d28:meMA.Ode7C13.mode	@ltx/en_us_oca/miscellanea:misc.Mode6
ltx/en_us_oca/me.m11.d28:meMA.Ode7C13.ode	@ltx/en_us_oca/miscellanea:misc.Ode7
ltx/en_us_oca/me.m11.d28:meMA.Ode7C13.text	
ltx/en_us_oca/me.m11.d28:meMA.Ode7C1T.incipit	…
ltx/en_us_oca/me.m11.d28:meMA.Ode7C1T.melody	@ltx/en_us_oca/he.h.m6:heHE.DrosovolonMenTinKaminon.notmetered
ltx/en_us_oca/me.m11.d28:meMA.Ode7C1T.mode	@ltx/en_us_oca/miscellanea:misc.Mode6
ltx/en_us_oca/me.m11.d28:meMA.Ode7C1T.ode	@ltx/en_us_oca/miscellanea:misc.Ode7
ltx/en_us_oca/me.m11.d28:meMA.Ode7C1T.text	
ltx/en_us_oca/me.m11.d28:meMA.Ode7C21.greekmelody	@ltx/en_us_oca/he.h.m6:heHE.DrosovolonMenTinKaminon.greekname
ltx/en_us_oca/me.m11.d28:meMA.Ode7C21.incipit	…
ltx/en_us_oca/me.m11.d28:meMA.Ode7C21.melody	@ltx/en_us_oca/he.h.m6:heHE.DrosovolonMenTinKaminon.notmetered
ltx/en_us_oca/me.m11.d28:meMA.Ode7C21.mode	@ltx/en_us_oca/miscellanea:misc.Mode6
ltx/en_us_oca/me.m11.d28:meMA.Ode7C21.ode	@ltx/en_us_oca/miscellanea:misc.Ode7
ltx/en_us_oca/me.m11.d28:meMA.Ode7C21.text	
ltx/en_us_oca/me.m11.d28:meMA.Ode7C22.incipit	…
ltx/en_us_oca/me.m11.d28:meMA.Ode7C22.melody	@ltx/en_us_oca/he.h.m6:heHE.DrosovolonMenTinKaminon.notmetered
ltx/en_us_oca/me.m11.d28:meMA.Ode7C22.mode	@ltx/en_us_oca/miscellanea:misc.Mode6
ltx/en_us_oca/me.m11.d28:meMA.Ode7C22.ode	@ltx/en_us_oca/miscellanea:misc.Ode7
ltx/en_us_oca/me.m11.d28:meMA.Ode7C22.text	
ltx/en_us_oca/me.m11.d28:meMA.Ode7C23.incipit	…
ltx/en_us_oca/me.m11.d28:meMA.Ode7C23.melody	@ltx/en_us_oca/he.h.m6:heHE.DrosovolonMenTinKaminon.notmetered
ltx/en_us_oca/me.m11.d28:meMA.Ode7C23.mode	@ltx/en_us_oca/miscellanea:misc.Mode6
ltx/en_us_oca/me.m11.d28:meMA.Ode7C23.ode	@ltx/en_us_oca/miscellanea:misc.Ode7
ltx/en_us_oca/me.m11.d28:meMA.Ode7C23.text	
ltx/en_us_oca/me.m11.d28:meMA.Ode7C2T.incipit	…
ltx/en_us_oca/me.m11.d28:meMA.Ode7C2T.melody	@ltx/en_us_oca/he.h.m6:heHE.DrosovolonMenTinKaminon.notmetered
ltx/en_us_oca/me.m11.d28:meMA.Ode7C2T.mode	@ltx/en_us_oca/miscellanea:misc.Mode6
ltx/en_us_oca/me.m11.d28:meMA.Ode7C2T.ode	@ltx/en_us_oca/miscellanea:misc.Ode7
ltx/en_us_oca/me.m11.d28:meMA.Ode7C2T.text	
ltx/en_us_oca/me.m11.d28:meMA.Ode8C11.greekmelody	@ltx/en_us_oca/he.h.m6:heHE.EkFlogosToisOsiois.greekname
ltx/en_us_oca/me.m11.d28:meMA.Ode8C11.incipit	…
ltx/en_us_oca/me.m11.d28:meMA.Ode8C11.melody	@ltx/en_us_oca/he.h.m6:heHE.EkFlogosToisOsiois.notmetered
ltx/en_us_oca/me.m11.d28:meMA.Ode8C11.mode	@ltx/en_us_oca/miscellanea:misc.Mode6
ltx/en_us_oca/me.m11.d28:meMA.Ode8C11.ode	@ltx/en_us_oca/miscellanea:misc.Ode8
ltx/en_us_oca/me.m11.d28:meMA.Ode8C11.text	
ltx/en_us_oca/me.m11.d28:meMA.Ode8C12.incipit	…
ltx/en_us_oca/me.m11.d28:meMA.Ode8C12.melody	@ltx/en_us_oca/he.h.m6:heHE.EkFlogosToisOsiois.notmetered
ltx/en_us_oca/me.m11.d28:meMA.Ode8C12.mode	@ltx/en_us_oca/miscellanea:misc.Mode6
ltx/en_us_oca/me.m11.d28:meMA.Ode8C12.ode	@ltx/en_us_oca/miscellanea:misc.Ode8
ltx/en_us_oca/me.m11.d28:meMA.Ode8C12.text	
ltx/en_us_oca/me.m11.d28:meMA.Ode8C13.incipit	…
ltx/en_us_oca/me.m11.d28:meMA.Ode8C13.melody	@ltx/en_us_oca/he.h.m6:heHE.EkFlogosToisOsiois.notmetered
ltx/en_us_oca/me.m11.d28:meMA.Ode8C13.mode	@ltx/en_us_oca/miscellanea:misc.Mode6
ltx/en_us_oca/me.m11.d28:meMA.Ode8C13.ode	@ltx/en_us_oca/miscellanea:misc.Ode8
ltx/en_us_oca/me.m11.d28:meMA.Ode8C13.text	
ltx/en_us_oca/me.m11.d28:meMA.Ode8C14.incipit	…
ltx/en_us_oca/me.m11.d28:meMA.Ode8C14.melody	@ltx/en_us_oca/he.h.m6:heHE.EkFlogosToisOsiois.notmetered
ltx/en_us_oca/me.m11.d28:meMA.Ode8C14.mode	@ltx/en_us_oca/miscellanea:misc.Mode6
ltx/en_us_oca/me.m11.d28:meMA.Ode8C14.ode	@ltx/en_us_oca/miscellanea:misc.Ode8
ltx/en_us_oca/me.m11.d28:meMA.Ode8C14.text	
ltx/en_us_oca/me.m11.d28:meMA.Ode8C1T.incipit	…
ltx/en_us_oca/me.m11.d28:meMA.Ode8C1T.melody	@ltx/en_us_oca/he.h.m6:heHE.EkFlogosToisOsiois.notmetered
ltx/en_us_oca/me.m11.d28:meMA.Ode8C1T.mode	@ltx/en_us_oca/miscellanea:misc.Mode6
ltx/en_us_oca/me.m11.d28:meMA.Ode8C1T.ode	@ltx/en_us_oca/miscellanea:misc.Ode8
ltx/en_us_oca/me.m11.d28:meMA.Ode8C1T.text	
ltx/en_us_oca/me.m11.d28:meMA.Ode8C21.greekmelody	@ltx/en_us_oca/he.h.m6:heHE.EkFlogosToisOsiois.greekname
ltx/en_us_oca/me.m11.d28:meMA.Ode8C21.incipit	…
ltx/en_us_oca/me.m11.d28:meMA.Ode8C21.melody	@ltx/en_us_oca/he.h.m6:heHE.EkFlogosToisOsiois.notmetered
ltx/en_us_oca/me.m11.d28:meMA.Ode8C21.mode	@ltx/en_us_oca/miscellanea:misc.Mode6
ltx/en_us_oca/me.m11.d28:meMA.Ode8C21.ode	@ltx/en_us_oca/miscellanea:misc.Ode8
ltx/en_us_oca/me.m11.d28:meMA.Ode8C21.text	
ltx/en_us_oca/me.m11.d28:meMA.Ode8C22.incipit	…
ltx/en_us_oca/me.m11.d28:meMA.Ode8C22.melody	@ltx/en_us_oca/he.h.m6:heHE.EkFlogosToisOsiois.notmetered
ltx/en_us_oca/me.m11.d28:meMA.Ode8C22.mode	@ltx/en_us_oca/miscellanea:misc.Mode6
ltx/en_us_oca/me.m11.d28:meMA.Ode8C22.ode	@ltx/en_us_oca/miscellanea:misc.Ode8
ltx/en_us_oca/me.m11.d28:meMA.Ode8C22.text	
ltx/en_us_oca/me.m11.d28:meMA.Ode8C23.incipit	…
ltx/en_us_oca/me.m11.d28:meMA.Ode8C23.melody	@ltx/en_us_oca/he.h.m6:heHE.EkFlogosToisOsiois.notmetered
ltx/en_us_oca/me.m11.d28:meMA.Ode8C23.mode	@ltx/en_us_oca/miscellanea:misc.Mode6
ltx/en_us_oca/me.m11.d28:meMA.Ode8C23.ode	@ltx/en_us_oca/miscellanea:misc.Ode8
ltx/en_us_oca/me.m11.d28:meMA.Ode8C23.text	
ltx/en_us_oca/me.m11.d28:meMA.Ode8C2T.incipit	…
ltx/en_us_oca/me.m11.d28:meMA.Ode8C2T.melody	@ltx/en_us_oca/he.h.m6:heHE.EkFlogosToisOsiois.notmetered
ltx/en_us_oca/me.m11.d28:meMA.Ode8C2T.mode	@ltx/en_us_oca/miscellanea:misc.Mode6
ltx/en_us_oca/me.m11.d28:meMA.Ode8C2T.ode	@ltx/en_us_oca/miscellanea:misc.Ode8
ltx/en_us_oca/me.m11.d28:meMA.Ode8C2T.text	
ltx/en_us_oca/me.m11.d28:meMA.Ode8H.greekmelody	@ltx/en_us_oca/he.h.m6:heHE.EkFlogosToisOsiois.greekname
ltx/en_us_oca/me.m11.d28:meMA.Ode8H.incipit	@ltx/en_us_oca/he.h.m6:heHE.EkFlogosToisOsiois.incipit
ltx/en_us_oca/me.m11.d28:meMA.Ode8H.melody	@ltx/en_us_oca/he.h.m6:heHE.EkFlogosToisOsiois.melody
ltx/en_us_oca/me.m11.d28:meMA.Ode8H.mode	@ltx/en_us_oca/miscellanea:misc.Mode6
ltx/en_us_oca/me.m11.d28:meMA.Ode8H.ode	@ltx/en_us_oca/miscellanea:misc.Ode8
ltx/en_us_oca/me.m11.d28:meMA.Ode8H.text	@ltx/en_us_oca/he.h.m6:heHE.EkFlogosToisOsiois.text
ltx/en_us_oca/me.m11.d28:meMA.Ode9C11.greekmelody	@ltx/en_us_oca/he.h.m6:heHE.TheonAnthropois.greekname
ltx/en_us_oca/me.m11.d28:meMA.Ode9C11.incipit	…
ltx/en_us_oca/me.m11.d28:meMA.Ode9C11.melody	@ltx/en_us_oca/he.h.m6:heHE.TheonAnthropois.notmetered
ltx/en_us_oca/me.m11.d28:meMA.Ode9C11.mode	@ltx/en_us_oca/miscellanea:misc.Mode6
ltx/en_us_oca/me.m11.d28:meMA.Ode9C11.ode	@ltx/en_us_oca/miscellanea:misc.Ode9
ltx/en_us_oca/me.m11.d28:meMA.Ode9C11.text	
ltx/en_us_oca/me.m11.d28:meMA.Ode9C12.incipit	…
ltx/en_us_oca/me.m11.d28:meMA.Ode9C12.melody	@ltx/en_us_oca/he.h.m6:heHE.TheonAnthropois.notmetered
ltx/en_us_oca/me.m11.d28:meMA.Ode9C12.mode	@ltx/en_us_oca/miscellanea:misc.Mode6
ltx/en_us_oca/me.m11.d28:meMA.Ode9C12.ode	@ltx/en_us_oca/miscellanea:misc.Ode9
ltx/en_us_oca/me.m11.d28:meMA.Ode9C12.text	
ltx/en_us_oca/me.m11.d28:meMA.Ode9C13.incipit	…
ltx/en_us_oca/me.m11.d28:meMA.Ode9C13.melody	@ltx/en_us_oca/he.h.m6:heHE.TheonAnthropois.notmetered
ltx/en_us_oca/me.m11.d28:meMA.Ode9C13.mode	@ltx/en_us_oca/miscellanea:misc.Mode6
ltx/en_us_oca/me.m11.d28:meMA.Ode9C13.ode	@ltx/en_us_oca/miscellanea:misc.Ode9
ltx/en_us_oca/me.m11.d28:meMA.Ode9C13.text	
ltx/en_us_oca/me.m11.d28:meMA.Ode9C14.incipit	…
ltx/en_us_oca/me.m11.d28:meMA.Ode9C14.melody	@ltx/en_us_oca/he.h.m6:heHE.TheonAnthropois.notmetered
ltx/en_us_oca/me.m11.d28:meMA.Ode9C14.mode	@ltx/en_us_oca/miscellanea:misc.Mode6
ltx/en_us_oca/me.m11.d28:meMA.Ode9C14.ode	@ltx/en_us_oca/miscellanea:misc.Ode9
ltx/en_us_oca/me.m11.d28:meMA.Ode9C14.text	
ltx/en_us_oca/me.m11.d28:meMA.Ode9C1T.incipit	…
ltx/en_us_oca/me.m11.d28:meMA.Ode9C1T.melody	@ltx/en_us_oca/he.h.m6:heHE.TheonAnthropois.notmetered
ltx/en_us_oca/me.m11.d28:meMA.Ode9C1T.mode	@ltx/en_us_oca/miscellanea:misc.Mode6
ltx/en_us_oca/me.m11.d28:meMA.Ode9C1T.ode	@ltx/en_us_oca/miscellanea:misc.Ode9
ltx/en_us_oca/me.m11.d28:meMA.Ode9C1T.text	
ltx/en_us_oca/me.m11.d28:meMA.Ode9C21.greekmelody	@ltx/en_us_oca/he.h.m6:heHE.TheonAnthropois.greekname
ltx/en_us_oca/me.m11.d28:meMA.Ode9C21.incipit	…
ltx/en_us_oca/me.m11.d28:meMA.Ode9C21.melody	@ltx/en_us_oca/he.h.m6:heHE.TheonAnthropois.notmetered
ltx/en_us_oca/me.m11.d28:meMA.Ode9C21.mode	@ltx/en_us_oca/miscellanea:misc.Mode6
ltx/en_us_oca/me.m11.d28:meMA.Ode9C21.ode	@ltx/en_us_oca/miscellanea:misc.Ode9
ltx/en_us_oca/me.m11.d28:meMA.Ode9C21.text	
ltx/en_us_oca/me.m11.d28:meMA.Ode9C22.incipit	…
ltx/en_us_oca/me.m11.d28:meMA.Ode9C22.melody	@ltx/en_us_oca/he.h.m6:heHE.TheonAnthropois.notmetered
ltx/en_us_oca/me.m11.d28:meMA.Ode9C22.mode	@ltx/en_us_oca/miscellanea:misc.Mode6
ltx/en_us_oca/me.m11.d28:meMA.Ode9C22.ode	@ltx/en_us_oca/miscellanea:misc.Ode9
ltx/en_us_oca/me.m11.d28:meMA.Ode9C22.text	
ltx/en_us_oca/me.m11.d28:meMA.Ode9C23.incipit	…
ltx/en_us_oca/me.m11.d28:meMA.Ode9C23.melody	@ltx/en_us_oca/he.h.m6:heHE.TheonAnthropois.notmetered
ltx/en_us_oca/me.m11.d28:meMA.Ode9C23.mode	@ltx/en_us_oca/miscellanea:misc.Mode6
ltx/en_us_oca/me.m11.d28:meMA.Ode9C23.ode	@ltx/en_us_oca/miscellanea:misc.Ode9
ltx/en_us_oca/me.m11.d28:meMA.Ode9C23.text	
ltx/en_us_oca/me.m11.d28:meMA.Ode9C2T.incipit	…
ltx/en_us_oca/me.m11.d28:meMA.Ode9C2T.melody	@ltx/en_us_oca/he.h.m6:heHE.TheonAnthropois.notmetered
ltx/en_us_oca/me.m11.d28:meMA.Ode9C2T.mode	@ltx/en_us_oca/miscellanea:misc.Mode6
ltx/en_us_oca/me.m11.d28:meMA.Ode9C2T.ode	@ltx/en_us_oca/miscellanea:misc.Ode9
ltx/en_us_oca/me.m11.d28:meMA.Ode9C2T.text	
ltx/en_us_oca/me.m11.d28:meMA.Ode9H.greekmelody	@ltx/en_us_oca/he.h.m6:heHE.TheonAnthropois.greekname
ltx/en_us_oca/me.m11.d28:meMA.Ode9H.incipit	@ltx/en_us_oca/he.h.m6:heHE.TheonAnthropois.incipit
ltx/en_us_oca/me.m11.d28:meMA.Ode9H.melody	@ltx/en_us_oca/he.h.m6:heHE.TheonAnthropois.melody
ltx/en_us_oca/me.m11.d28:meMA.Ode9H.mode	@ltx/en_us_oca/miscellanea:misc.Mode6
ltx/en_us_oca/me.m11.d28:meMA.Ode9H.ode	@ltx/en_us_oca/miscellanea:misc.Ode9
ltx/en_us_oca/me.m11.d28:meMA.Ode9H.text	@ltx/en_us_oca/he.h.m6:heHE.TheonAnthropois.text
ltx/en_us_oca/me.m11.d28:meMA.Oikos1.text	
ltx/en_us_oca/me.m11.d28:meVE.Apolytikion1ger.greekmelody	@ltx/en_us_oca/he.a.m3:heAU.TheiasPisteos.greekname
ltx/en_us_oca/me.m11.d28:meVE.Apolytikion1ger.incipit	…
ltx/en_us_oca/me.m11.d28:meVE.Apolytikion1ger.melody	@ltx/en_us_oca/he.a.m3:heAU.TheiasPisteos.notmetered
ltx/en_us_oca/me.m11.d28:meVE.Apolytikion1ger.mode	@ltx/en_us_oca/miscellanea:misc.Mode3
ltx/en_us_oca/me.m11.d28:meVE.Apolytikion1ger.poet	@ltx/en_us_oca/poets:po.Gerasimou
ltx/en_us_oca/me.m11.d28:meVE.Apolytikion1ger.text	
ltx/en_us_oca/me.m11.d28:meVE.Apolytikion2ger.greekmelody	@ltx/en_us_oca/he.a.m4:heAU.TachyProkatalave.greekname
ltx/en_us_oca/me.m11.d28:meVE.Apolytikion2ger.incipit	…
ltx/en_us_oca/me.m11.d28:meVE.Apolytikion2ger.melody	@ltx/en_us_oca/he.a.m4:heAU.TachyProkatalave.notmetered
ltx/en_us_oca/me.m11.d28:meVE.Apolytikion2ger.mode	@ltx/en_us_oca/miscellanea:misc.Mode4
ltx/en_us_oca/me.m11.d28:meVE.Apolytikion2ger.poet	@ltx/en_us_oca/poets:po.Gerasimou
ltx/en_us_oca/me.m11.d28:meVE.Apolytikion2ger.text	
ltx/en_us_oca/me.m11.d28:meVE.Apolytikion3.greekmelody	@ltx/en_us_oca/he.a.m4:heAU.OYpsotheisEnToStavro.greekname
ltx/en_us_oca/me.m11.d28:meVE.Apolytikion3.incipit	…
ltx/en_us_oca/me.m11.d28:meVE.Apolytikion3.melody	@ltx/en_us_oca/he.a.m4:heAU.OYpsotheisEnToStavro.notmetered
ltx/en_us_oca/me.m11.d28:meVE.Apolytikion3.mode	@ltx/en_us_oca/miscellanea:misc.Mode4
ltx/en_us_oca/me.m11.d28:meVE.Apolytikion3.text	
ltx/en_us_oca/me.m11.d28:meVE.AposGlory.incipit	Venerable Father, greatly-suffering Stephen, ⁄…
ltx/en_us_oca/me.m11.d28:meVE.AposGlory.melody	
ltx/en_us_oca/me.m11.d28:meVE.AposGlory.mode	@ltx/en_us_oca/miscellanea:misc.Mode8
ltx/en_us_oca/me.m11.d28:meVE.AposGlory.text	Venerable Father, greatly-suffering Stephen, ⁄ you preserved unharmed that which is according to the image ⁄ as a manful champion of Christ’s image, ⁄ not fearing the threats of Copronymus. ⁄ Indeed, you slew him with the sword of the Spirit! ⁄ Therefore, since you have acquired boldness before God, ⁄⁄ save your flock from all heresies!
ltx/en_us_oca/me.m11.d28:meVE.AposStavrotheotokion.greekmelody	@ltx/en_us_oca/he.a.m8:heAU.OTouParadoxou.greekname
ltx/en_us_oca/me.m11.d28:meVE.AposStavrotheotokion.incipit	…
ltx/en_us_oca/me.m11.d28:meVE.AposStavrotheotokion.melody	@ltx/en_us_oca/he.a.m8:heAU.OTouParadoxou.notmetered
ltx/en_us_oca/me.m11.d28:meVE.AposStavrotheotokion.mode	@ltx/en_us_oca/miscellanea:misc.Mode8
ltx/en_us_oca/me.m11.d28:meVE.AposStavrotheotokion.text	
ltx/en_us_oca/me.m11.d28:meVE.AposTheotokion.incipit	@ltx/en_us_oca/oc.m8.d5:ocMA.AposTheotokion.incipit
ltx/en_us_oca/me.m11.d28:meVE.AposTheotokion.melody	
ltx/en_us_oca/me.m11.d28:meVE.AposTheotokion.mode	@ltx/en_us_oca/miscellanea:misc.Mode8
ltx/en_us_oca/me.m11.d28:meVE.AposTheotokion.text	@ltx/en_us_oca/oc.m8.d5:ocMA.AposTheotokion.text
ltx/en_us_oca/me.m11.d28:meVE.SticGlory.incipit	Like the great prophet Samuel…
ltx/en_us_oca/me.m11.d28:meVE.SticGlory.melody	
ltx/en_us_oca/me.m11.d28:meVE.SticGlory.mode	@ltx/en_us_oca/miscellanea:misc.Mode6
ltx/en_us_oca/me.m11.d28:meVE.SticGlory.poet	@ltx/en_us_oca/poets:po.Stouditou
ltx/en_us_oca/me.m11.d28:meVE.SticGlory.text	Like the great prophet Samuel, Stephen, ⁄ you were dedicated to God while yet an infant. ⁄ Having ascended the mountain, ⁄ you were well-pleasing to Him in the monastic life. ⁄ You manfully stripped yourself for the contest, ⁄ enduring banishment and tribulation with patience! ⁄ You bore fetters and imprisonment for His image! ⁄ You were dragged and beaten; ⁄ you were stoned and your head was crushed. ⁄ Therefore you were crowned by Christ God! ⁄ Entreat Him that those who celebrate your honorable memory ⁄ may be delivered from sufferings, temptations and the tribulation to come, ⁄⁄ and that our souls may be saved!
ltx/en_us_oca/me.m11.d28:meVE.SticStavrotheotokion.greekmelody	@ltx/en_us_oca/he.a.m6:heAU.OlinApothemenoi.greekname
ltx/en_us_oca/me.m11.d28:meVE.SticStavrotheotokion.incipit	@ltx/en_us_oca/me.m02.d17:meMA.LaudsStavrotheotokion.incipit
ltx/en_us_oca/me.m11.d28:meVE.SticStavrotheotokion.melody	@ltx/en_us_oca/he.a.m6:heAU.OlinApothemenoi.notmetered
ltx/en_us_oca/me.m11.d28:meVE.SticStavrotheotokion.mode	@ltx/en_us_oca/miscellanea:misc.Mode6
ltx/en_us_oca/me.m11.d28:meVE.SticStavrotheotokion.text	@ltx/en_us_oca/me.m02.d17:meMA.LaudsStavrotheotokion.text
ltx/en_us_oca/me.m11.d28:meVE.SticTheotokion.incipit	@ltx/en_us_oca/oc.m6.d3:ocMA.AposTheotokion.incipit
ltx/en_us_oca/me.m11.d28:meVE.SticTheotokion.melody	
ltx/en_us_oca/me.m11.d28:meVE.SticTheotokion.mode	@ltx/en_us_oca/miscellanea:misc.Mode6
ltx/en_us_oca/me.m11.d28:meVE.SticTheotokion.text	@ltx/en_us_oca/oc.m6.d3:ocMA.AposTheotokion.text
ltx/en_us_oca/me.m11.d28:meVE.Stichera01.greekmelody	@ltx/en_us_oca/he.a.m6:heAU.OlinApothemenoi.greekname
ltx/en_us_oca/me.m11.d28:meVE.Stichera01.incipit	You offered yourself wholly to…
ltx/en_us_oca/me.m11.d28:meVE.Stichera01.melody	@ltx/en_us_oca/he.a.m6:heAU.OlinApothemenoi.notmetered
ltx/en_us_oca/me.m11.d28:meVE.Stichera01.mode	@ltx/en_us_oca/miscellanea:misc.Mode6
ltx/en_us_oca/me.m11.d28:meVE.Stichera01.text	You offered yourself wholly to the master from your youth, ⁄ transcending the flesh and worldly love. ⁄ You were an excellent monk, most holy Stephen, ⁄ and a vessel of the Spirit of God. ⁄ You were imprisoned in a narrow hut, blessed one, ⁄ but you gave your mind wings to fly to the heavens ⁄ to behold the ineffable beauty of Christ our King and God! ⁄⁄ Worshipping His image, you suffered greatly!
ltx/en_us_oca/me.m11.d28:meVE.Stichera02.incipit	Imprisoned in a dungeon, ⁄…
ltx/en_us_oca/me.m11.d28:meVE.Stichera02.melody	@ltx/en_us_oca/he.a.m6:heAU.OlinApothemenoi.notmetered
ltx/en_us_oca/me.m11.d28:meVE.Stichera02.mode	@ltx/en_us_oca/miscellanea:misc.Mode6
ltx/en_us_oca/me.m11.d28:meVE.Stichera02.text	Imprisoned in a dungeon, ⁄ you fasted for forty days like the Master, ⁄ preparing yourself for suffering, holy Stephen, ⁄ the confirmation of monks and adornment of martyrs! ⁄ Therefore, those who had no mercy, ⁄ fell upon you like wild beasts, ⁄ dragging you like an innocent lamb! ⁄ They unjustly tore your body to pieces ⁄ and cast you out with the evildoers! ⁄ You suffered mightily ⁄⁄ and now you pray boldly on behalf of our souls!
ltx/en_us_oca/me.m11.d28:meVE.Stichera03.incipit	Evil men, subject to the…
ltx/en_us_oca/me.m11.d28:meVE.Stichera03.melody	@ltx/en_us_oca/he.a.m6:heAU.OlinApothemenoi.notmetered
ltx/en_us_oca/me.m11.d28:meVE.Stichera03.mode	@ltx/en_us_oca/miscellanea:misc.Mode6
ltx/en_us_oca/me.m11.d28:meVE.Stichera03.text	Evil men, subject to the iniquity of the lawless emperor, ⁄ stoned you without pity, venerable one, ⁄ like the honored Protomartyr Stephen. ⁄ They crushed your holy head, Father, ⁄ dragging you most savagely through the streets, ⁄ causing your bowels to spill forth, most blessed one, ⁄ showing you no mercy even after you were dead! ⁄ How great was your courage! ⁄ How great were your bearing and endurance! ⁄⁄ By them, Stephen, you have received an unfading crown!
ltx/en_us_oca/me.m11.d28:meVE.Stichera04.greekmelody	@ltx/en_us_oca/he.a.m6:heAU.TriimerosAnestis.greekname
ltx/en_us_oca/me.m11.d28:meVE.Stichera04.incipit	…
ltx/en_us_oca/me.m11.d28:meVE.Stichera04.melody	@ltx/en_us_oca/he.a.m6:heAU.TriimerosAnestis.notmetered
ltx/en_us_oca/me.m11.d28:meVE.Stichera04.mode	@ltx/en_us_oca/miscellanea:misc.Mode6
ltx/en_us_oca/me.m11.d28:meVE.Stichera04.text	
ltx/en_us_oca/me.m11.d28:meVE.Stichera05.incipit	…
ltx/en_us_oca/me.m11.d28:meVE.Stichera05.melody	@ltx/en_us_oca/he.a.m6:heAU.TriimerosAnestis.notmetered
ltx/en_us_oca/me.m11.d28:meVE.Stichera05.mode	@ltx/en_us_oca/miscellanea:misc.Mode6
ltx/en_us_oca/me.m11.d28:meVE.Stichera05.text	
ltx/en_us_oca/me.m11.d28:meVE.Stichera06.incipit	…
ltx/en_us_oca/me.m11.d28:meVE.Stichera06.melody	@ltx/en_us_oca/he.a.m6:heAU.TriimerosAnestis.notmetered
ltx/en_us_oca/me.m11.d28:meVE.Stichera06.mode	@ltx/en_us_oca/miscellanea:misc.Mode6
ltx/en_us_oca/me.m11.d28:meVE.Stichera06.text	
