ltx/en_us_oca/tr.d029:tr.IconsProcession.title	
ltx/en_us_oca/tr.d029:tr.Synodikon.title	
ltx/en_us_oca/tr.d029:tr.Synodikon1.text	
ltx/en_us_oca/tr.d029:tr.Synodikon2.text	
ltx/en_us_oca/tr.d029:tr.Synodikon3.text	
ltx/en_us_oca/tr.d029:tr.Synodikon4.text	
ltx/en_us_oca/tr.d029:tr.Synodikon5.text	
ltx/en_us_oca/tr.d029:tr.Synodikon6.text	
ltx/en_us_oca/tr.d029:trCA.Ode11.incipit	…
ltx/en_us_oca/tr.d029:trCA.Ode11.melody	
ltx/en_us_oca/tr.d029:trCA.Ode11.mode	
ltx/en_us_oca/tr.d029:trCA.Ode11.ode	
ltx/en_us_oca/tr.d029:trCA.Ode11.text	
ltx/en_us_oca/tr.d029:trCA.Ode12.incipit	…
ltx/en_us_oca/tr.d029:trCA.Ode12.melody	
ltx/en_us_oca/tr.d029:trCA.Ode12.mode	
ltx/en_us_oca/tr.d029:trCA.Ode12.ode	
ltx/en_us_oca/tr.d029:trCA.Ode12.text	
ltx/en_us_oca/tr.d029:trCA.Ode13.incipit	…
ltx/en_us_oca/tr.d029:trCA.Ode13.melody	
ltx/en_us_oca/tr.d029:trCA.Ode13.mode	
ltx/en_us_oca/tr.d029:trCA.Ode13.ode	
ltx/en_us_oca/tr.d029:trCA.Ode13.text	
ltx/en_us_oca/tr.d029:trCA.Ode14.incipit	…
ltx/en_us_oca/tr.d029:trCA.Ode14.melody	
ltx/en_us_oca/tr.d029:trCA.Ode14.mode	
ltx/en_us_oca/tr.d029:trCA.Ode14.ode	
ltx/en_us_oca/tr.d029:trCA.Ode14.text	
ltx/en_us_oca/tr.d029:trCA.Ode15.incipit	…
ltx/en_us_oca/tr.d029:trCA.Ode15.melody	
ltx/en_us_oca/tr.d029:trCA.Ode15.mode	
ltx/en_us_oca/tr.d029:trCA.Ode15.ode	
ltx/en_us_oca/tr.d029:trCA.Ode15.text	
ltx/en_us_oca/tr.d029:trCA.Ode16.incipit	…
ltx/en_us_oca/tr.d029:trCA.Ode16.melody	
ltx/en_us_oca/tr.d029:trCA.Ode16.mode	
ltx/en_us_oca/tr.d029:trCA.Ode16.ode	
ltx/en_us_oca/tr.d029:trCA.Ode16.text	
ltx/en_us_oca/tr.d029:trCA.Ode17.incipit	…
ltx/en_us_oca/tr.d029:trCA.Ode17.melody	
ltx/en_us_oca/tr.d029:trCA.Ode17.mode	
ltx/en_us_oca/tr.d029:trCA.Ode17.ode	
ltx/en_us_oca/tr.d029:trCA.Ode17.text	
ltx/en_us_oca/tr.d029:trCA.Ode1T.incipit	…
ltx/en_us_oca/tr.d029:trCA.Ode1T.melody	
ltx/en_us_oca/tr.d029:trCA.Ode1T.mode	
ltx/en_us_oca/tr.d029:trCA.Ode1T.ode	
ltx/en_us_oca/tr.d029:trCA.Ode1T.text	
ltx/en_us_oca/tr.d029:trCA.Ode1Tr.incipit	…
ltx/en_us_oca/tr.d029:trCA.Ode1Tr.melody	
ltx/en_us_oca/tr.d029:trCA.Ode1Tr.mode	
ltx/en_us_oca/tr.d029:trCA.Ode1Tr.ode	
ltx/en_us_oca/tr.d029:trCA.Ode1Tr.text	
ltx/en_us_oca/tr.d029:trCA.Ode31.incipit	…
ltx/en_us_oca/tr.d029:trCA.Ode31.melody	
ltx/en_us_oca/tr.d029:trCA.Ode31.mode	
ltx/en_us_oca/tr.d029:trCA.Ode31.ode	
ltx/en_us_oca/tr.d029:trCA.Ode31.text	
ltx/en_us_oca/tr.d029:trCA.Ode32.incipit	…
ltx/en_us_oca/tr.d029:trCA.Ode32.melody	
ltx/en_us_oca/tr.d029:trCA.Ode32.mode	
ltx/en_us_oca/tr.d029:trCA.Ode32.ode	
ltx/en_us_oca/tr.d029:trCA.Ode32.text	
ltx/en_us_oca/tr.d029:trCA.Ode33.incipit	…
ltx/en_us_oca/tr.d029:trCA.Ode33.melody	
ltx/en_us_oca/tr.d029:trCA.Ode33.mode	
ltx/en_us_oca/tr.d029:trCA.Ode33.ode	
ltx/en_us_oca/tr.d029:trCA.Ode33.text	
ltx/en_us_oca/tr.d029:trCA.Ode34.incipit	…
ltx/en_us_oca/tr.d029:trCA.Ode34.melody	
ltx/en_us_oca/tr.d029:trCA.Ode34.mode	
ltx/en_us_oca/tr.d029:trCA.Ode34.ode	
ltx/en_us_oca/tr.d029:trCA.Ode34.text	
ltx/en_us_oca/tr.d029:trCA.Ode35.incipit	…
ltx/en_us_oca/tr.d029:trCA.Ode35.melody	
ltx/en_us_oca/tr.d029:trCA.Ode35.mode	
ltx/en_us_oca/tr.d029:trCA.Ode35.ode	
ltx/en_us_oca/tr.d029:trCA.Ode35.text	
ltx/en_us_oca/tr.d029:trCA.Ode36.incipit	…
ltx/en_us_oca/tr.d029:trCA.Ode36.melody	
ltx/en_us_oca/tr.d029:trCA.Ode36.mode	
ltx/en_us_oca/tr.d029:trCA.Ode36.ode	
ltx/en_us_oca/tr.d029:trCA.Ode36.text	
ltx/en_us_oca/tr.d029:trCA.Ode37.incipit	…
ltx/en_us_oca/tr.d029:trCA.Ode37.melody	
ltx/en_us_oca/tr.d029:trCA.Ode37.mode	
ltx/en_us_oca/tr.d029:trCA.Ode37.ode	
ltx/en_us_oca/tr.d029:trCA.Ode37.text	
ltx/en_us_oca/tr.d029:trCA.Ode3T.incipit	…
ltx/en_us_oca/tr.d029:trCA.Ode3T.melody	
ltx/en_us_oca/tr.d029:trCA.Ode3T.mode	
ltx/en_us_oca/tr.d029:trCA.Ode3T.ode	
ltx/en_us_oca/tr.d029:trCA.Ode3T.text	
ltx/en_us_oca/tr.d029:trCA.Ode3Tr.incipit	…
ltx/en_us_oca/tr.d029:trCA.Ode3Tr.melody	
ltx/en_us_oca/tr.d029:trCA.Ode3Tr.mode	
ltx/en_us_oca/tr.d029:trCA.Ode3Tr.ode	
ltx/en_us_oca/tr.d029:trCA.Ode3Tr.text	
ltx/en_us_oca/tr.d029:trCA.Ode41.incipit	…
ltx/en_us_oca/tr.d029:trCA.Ode41.melody	
ltx/en_us_oca/tr.d029:trCA.Ode41.mode	
ltx/en_us_oca/tr.d029:trCA.Ode41.ode	
ltx/en_us_oca/tr.d029:trCA.Ode41.text	
ltx/en_us_oca/tr.d029:trCA.Ode42.incipit	…
ltx/en_us_oca/tr.d029:trCA.Ode42.melody	
ltx/en_us_oca/tr.d029:trCA.Ode42.mode	
ltx/en_us_oca/tr.d029:trCA.Ode42.ode	
ltx/en_us_oca/tr.d029:trCA.Ode42.text	
ltx/en_us_oca/tr.d029:trCA.Ode43.incipit	…
ltx/en_us_oca/tr.d029:trCA.Ode43.melody	
ltx/en_us_oca/tr.d029:trCA.Ode43.mode	
ltx/en_us_oca/tr.d029:trCA.Ode43.ode	
ltx/en_us_oca/tr.d029:trCA.Ode43.text	
ltx/en_us_oca/tr.d029:trCA.Ode44.incipit	…
ltx/en_us_oca/tr.d029:trCA.Ode44.melody	
ltx/en_us_oca/tr.d029:trCA.Ode44.mode	
ltx/en_us_oca/tr.d029:trCA.Ode44.ode	
ltx/en_us_oca/tr.d029:trCA.Ode44.text	
ltx/en_us_oca/tr.d029:trCA.Ode45.incipit	…
ltx/en_us_oca/tr.d029:trCA.Ode45.melody	
ltx/en_us_oca/tr.d029:trCA.Ode45.mode	
ltx/en_us_oca/tr.d029:trCA.Ode45.ode	
ltx/en_us_oca/tr.d029:trCA.Ode45.text	
ltx/en_us_oca/tr.d029:trCA.Ode46.incipit	…
ltx/en_us_oca/tr.d029:trCA.Ode46.melody	
ltx/en_us_oca/tr.d029:trCA.Ode46.mode	
ltx/en_us_oca/tr.d029:trCA.Ode46.ode	
ltx/en_us_oca/tr.d029:trCA.Ode46.text	
ltx/en_us_oca/tr.d029:trCA.Ode47.incipit	…
ltx/en_us_oca/tr.d029:trCA.Ode47.melody	
ltx/en_us_oca/tr.d029:trCA.Ode47.mode	
ltx/en_us_oca/tr.d029:trCA.Ode47.ode	
ltx/en_us_oca/tr.d029:trCA.Ode47.text	
ltx/en_us_oca/tr.d029:trCA.Ode4T.incipit	…
ltx/en_us_oca/tr.d029:trCA.Ode4T.melody	
ltx/en_us_oca/tr.d029:trCA.Ode4T.mode	
ltx/en_us_oca/tr.d029:trCA.Ode4T.ode	
ltx/en_us_oca/tr.d029:trCA.Ode4T.text	
ltx/en_us_oca/tr.d029:trCA.Ode4Tr.incipit	…
ltx/en_us_oca/tr.d029:trCA.Ode4Tr.melody	
ltx/en_us_oca/tr.d029:trCA.Ode4Tr.mode	
ltx/en_us_oca/tr.d029:trCA.Ode4Tr.ode	
ltx/en_us_oca/tr.d029:trCA.Ode4Tr.text	
ltx/en_us_oca/tr.d029:trCA.Ode51.incipit	…
ltx/en_us_oca/tr.d029:trCA.Ode51.melody	
ltx/en_us_oca/tr.d029:trCA.Ode51.mode	
ltx/en_us_oca/tr.d029:trCA.Ode51.ode	
ltx/en_us_oca/tr.d029:trCA.Ode51.text	
ltx/en_us_oca/tr.d029:trCA.Ode52.incipit	…
ltx/en_us_oca/tr.d029:trCA.Ode52.melody	
ltx/en_us_oca/tr.d029:trCA.Ode52.mode	
ltx/en_us_oca/tr.d029:trCA.Ode52.ode	
ltx/en_us_oca/tr.d029:trCA.Ode52.text	
ltx/en_us_oca/tr.d029:trCA.Ode53.incipit	…
ltx/en_us_oca/tr.d029:trCA.Ode53.melody	
ltx/en_us_oca/tr.d029:trCA.Ode53.mode	
ltx/en_us_oca/tr.d029:trCA.Ode53.ode	
ltx/en_us_oca/tr.d029:trCA.Ode53.text	
ltx/en_us_oca/tr.d029:trCA.Ode54.incipit	…
ltx/en_us_oca/tr.d029:trCA.Ode54.melody	
ltx/en_us_oca/tr.d029:trCA.Ode54.mode	
ltx/en_us_oca/tr.d029:trCA.Ode54.ode	
ltx/en_us_oca/tr.d029:trCA.Ode54.text	
ltx/en_us_oca/tr.d029:trCA.Ode55.incipit	…
ltx/en_us_oca/tr.d029:trCA.Ode55.melody	
ltx/en_us_oca/tr.d029:trCA.Ode55.mode	
ltx/en_us_oca/tr.d029:trCA.Ode55.ode	
ltx/en_us_oca/tr.d029:trCA.Ode55.text	
ltx/en_us_oca/tr.d029:trCA.Ode56.incipit	…
ltx/en_us_oca/tr.d029:trCA.Ode56.melody	
ltx/en_us_oca/tr.d029:trCA.Ode56.mode	
ltx/en_us_oca/tr.d029:trCA.Ode56.ode	
ltx/en_us_oca/tr.d029:trCA.Ode56.text	
ltx/en_us_oca/tr.d029:trCA.Ode57.incipit	…
ltx/en_us_oca/tr.d029:trCA.Ode57.melody	
ltx/en_us_oca/tr.d029:trCA.Ode57.mode	
ltx/en_us_oca/tr.d029:trCA.Ode57.ode	
ltx/en_us_oca/tr.d029:trCA.Ode57.text	
ltx/en_us_oca/tr.d029:trCA.Ode5T.incipit	…
ltx/en_us_oca/tr.d029:trCA.Ode5T.melody	
ltx/en_us_oca/tr.d029:trCA.Ode5T.mode	
ltx/en_us_oca/tr.d029:trCA.Ode5T.ode	
ltx/en_us_oca/tr.d029:trCA.Ode5T.text	
ltx/en_us_oca/tr.d029:trCA.Ode5Tr.incipit	…
ltx/en_us_oca/tr.d029:trCA.Ode5Tr.melody	
ltx/en_us_oca/tr.d029:trCA.Ode5Tr.mode	
ltx/en_us_oca/tr.d029:trCA.Ode5Tr.ode	
ltx/en_us_oca/tr.d029:trCA.Ode5Tr.text	
ltx/en_us_oca/tr.d029:trCA.Ode61.incipit	…
ltx/en_us_oca/tr.d029:trCA.Ode61.melody	
ltx/en_us_oca/tr.d029:trCA.Ode61.mode	
ltx/en_us_oca/tr.d029:trCA.Ode61.ode	
ltx/en_us_oca/tr.d029:trCA.Ode61.text	
ltx/en_us_oca/tr.d029:trCA.Ode62.incipit	…
ltx/en_us_oca/tr.d029:trCA.Ode62.melody	
ltx/en_us_oca/tr.d029:trCA.Ode62.mode	
ltx/en_us_oca/tr.d029:trCA.Ode62.ode	
ltx/en_us_oca/tr.d029:trCA.Ode62.text	
ltx/en_us_oca/tr.d029:trCA.Ode63.incipit	…
ltx/en_us_oca/tr.d029:trCA.Ode63.melody	
ltx/en_us_oca/tr.d029:trCA.Ode63.mode	
ltx/en_us_oca/tr.d029:trCA.Ode63.ode	
ltx/en_us_oca/tr.d029:trCA.Ode63.text	
ltx/en_us_oca/tr.d029:trCA.Ode64.incipit	…
ltx/en_us_oca/tr.d029:trCA.Ode64.melody	
ltx/en_us_oca/tr.d029:trCA.Ode64.mode	
ltx/en_us_oca/tr.d029:trCA.Ode64.ode	
ltx/en_us_oca/tr.d029:trCA.Ode64.text	
ltx/en_us_oca/tr.d029:trCA.Ode65.incipit	…
ltx/en_us_oca/tr.d029:trCA.Ode65.melody	
ltx/en_us_oca/tr.d029:trCA.Ode65.mode	
ltx/en_us_oca/tr.d029:trCA.Ode65.ode	
ltx/en_us_oca/tr.d029:trCA.Ode65.text	
ltx/en_us_oca/tr.d029:trCA.Ode66.incipit	…
ltx/en_us_oca/tr.d029:trCA.Ode66.melody	
ltx/en_us_oca/tr.d029:trCA.Ode66.mode	
ltx/en_us_oca/tr.d029:trCA.Ode66.ode	
ltx/en_us_oca/tr.d029:trCA.Ode66.text	
ltx/en_us_oca/tr.d029:trCA.Ode67.incipit	…
ltx/en_us_oca/tr.d029:trCA.Ode67.melody	
ltx/en_us_oca/tr.d029:trCA.Ode67.mode	
ltx/en_us_oca/tr.d029:trCA.Ode67.ode	
ltx/en_us_oca/tr.d029:trCA.Ode67.text	
ltx/en_us_oca/tr.d029:trCA.Ode6T.incipit	…
ltx/en_us_oca/tr.d029:trCA.Ode6T.melody	
ltx/en_us_oca/tr.d029:trCA.Ode6T.mode	
ltx/en_us_oca/tr.d029:trCA.Ode6T.ode	
ltx/en_us_oca/tr.d029:trCA.Ode6T.text	
ltx/en_us_oca/tr.d029:trCA.Ode6Tr.incipit	…
ltx/en_us_oca/tr.d029:trCA.Ode6Tr.melody	
ltx/en_us_oca/tr.d029:trCA.Ode6Tr.mode	
ltx/en_us_oca/tr.d029:trCA.Ode6Tr.ode	
ltx/en_us_oca/tr.d029:trCA.Ode6Tr.text	
ltx/en_us_oca/tr.d029:trCA.Ode71.incipit	…
ltx/en_us_oca/tr.d029:trCA.Ode71.melody	
ltx/en_us_oca/tr.d029:trCA.Ode71.mode	
ltx/en_us_oca/tr.d029:trCA.Ode71.ode	
ltx/en_us_oca/tr.d029:trCA.Ode71.text	
ltx/en_us_oca/tr.d029:trCA.Ode72.incipit	…
ltx/en_us_oca/tr.d029:trCA.Ode72.melody	
ltx/en_us_oca/tr.d029:trCA.Ode72.mode	
ltx/en_us_oca/tr.d029:trCA.Ode72.ode	
ltx/en_us_oca/tr.d029:trCA.Ode72.text	
ltx/en_us_oca/tr.d029:trCA.Ode73.incipit	…
ltx/en_us_oca/tr.d029:trCA.Ode73.melody	
ltx/en_us_oca/tr.d029:trCA.Ode73.mode	
ltx/en_us_oca/tr.d029:trCA.Ode73.ode	
ltx/en_us_oca/tr.d029:trCA.Ode73.text	
ltx/en_us_oca/tr.d029:trCA.Ode74.incipit	…
ltx/en_us_oca/tr.d029:trCA.Ode74.melody	
ltx/en_us_oca/tr.d029:trCA.Ode74.mode	
ltx/en_us_oca/tr.d029:trCA.Ode74.ode	
ltx/en_us_oca/tr.d029:trCA.Ode74.text	
ltx/en_us_oca/tr.d029:trCA.Ode75.incipit	…
ltx/en_us_oca/tr.d029:trCA.Ode75.melody	
ltx/en_us_oca/tr.d029:trCA.Ode75.mode	
ltx/en_us_oca/tr.d029:trCA.Ode75.ode	
ltx/en_us_oca/tr.d029:trCA.Ode75.text	
ltx/en_us_oca/tr.d029:trCA.Ode76.incipit	…
ltx/en_us_oca/tr.d029:trCA.Ode76.melody	
ltx/en_us_oca/tr.d029:trCA.Ode76.mode	
ltx/en_us_oca/tr.d029:trCA.Ode76.ode	
ltx/en_us_oca/tr.d029:trCA.Ode76.text	
ltx/en_us_oca/tr.d029:trCA.Ode77.incipit	…
ltx/en_us_oca/tr.d029:trCA.Ode77.melody	
ltx/en_us_oca/tr.d029:trCA.Ode77.mode	
ltx/en_us_oca/tr.d029:trCA.Ode77.ode	
ltx/en_us_oca/tr.d029:trCA.Ode77.text	
ltx/en_us_oca/tr.d029:trCA.Ode7T.incipit	…
ltx/en_us_oca/tr.d029:trCA.Ode7T.melody	
ltx/en_us_oca/tr.d029:trCA.Ode7T.mode	
ltx/en_us_oca/tr.d029:trCA.Ode7T.ode	
ltx/en_us_oca/tr.d029:trCA.Ode7T.text	
ltx/en_us_oca/tr.d029:trCA.Ode7Tr.incipit	…
ltx/en_us_oca/tr.d029:trCA.Ode7Tr.melody	
ltx/en_us_oca/tr.d029:trCA.Ode7Tr.mode	
ltx/en_us_oca/tr.d029:trCA.Ode7Tr.ode	
ltx/en_us_oca/tr.d029:trCA.Ode7Tr.text	
ltx/en_us_oca/tr.d029:trCA.Ode81.incipit	…
ltx/en_us_oca/tr.d029:trCA.Ode81.melody	
ltx/en_us_oca/tr.d029:trCA.Ode81.mode	
ltx/en_us_oca/tr.d029:trCA.Ode81.ode	
ltx/en_us_oca/tr.d029:trCA.Ode81.text	
ltx/en_us_oca/tr.d029:trCA.Ode82.incipit	…
ltx/en_us_oca/tr.d029:trCA.Ode82.melody	
ltx/en_us_oca/tr.d029:trCA.Ode82.mode	
ltx/en_us_oca/tr.d029:trCA.Ode82.ode	
ltx/en_us_oca/tr.d029:trCA.Ode82.text	
ltx/en_us_oca/tr.d029:trCA.Ode83.incipit	…
ltx/en_us_oca/tr.d029:trCA.Ode83.melody	
ltx/en_us_oca/tr.d029:trCA.Ode83.mode	
ltx/en_us_oca/tr.d029:trCA.Ode83.ode	
ltx/en_us_oca/tr.d029:trCA.Ode83.text	
ltx/en_us_oca/tr.d029:trCA.Ode84.incipit	…
ltx/en_us_oca/tr.d029:trCA.Ode84.melody	
ltx/en_us_oca/tr.d029:trCA.Ode84.mode	
ltx/en_us_oca/tr.d029:trCA.Ode84.ode	
ltx/en_us_oca/tr.d029:trCA.Ode84.text	
ltx/en_us_oca/tr.d029:trCA.Ode85.incipit	…
ltx/en_us_oca/tr.d029:trCA.Ode85.melody	
ltx/en_us_oca/tr.d029:trCA.Ode85.mode	
ltx/en_us_oca/tr.d029:trCA.Ode85.ode	
ltx/en_us_oca/tr.d029:trCA.Ode85.text	
ltx/en_us_oca/tr.d029:trCA.Ode86.incipit	…
ltx/en_us_oca/tr.d029:trCA.Ode86.melody	
ltx/en_us_oca/tr.d029:trCA.Ode86.mode	
ltx/en_us_oca/tr.d029:trCA.Ode86.ode	
ltx/en_us_oca/tr.d029:trCA.Ode86.text	
ltx/en_us_oca/tr.d029:trCA.Ode8T.incipit	…
ltx/en_us_oca/tr.d029:trCA.Ode8T.melody	
ltx/en_us_oca/tr.d029:trCA.Ode8T.mode	
ltx/en_us_oca/tr.d029:trCA.Ode8T.ode	
ltx/en_us_oca/tr.d029:trCA.Ode8T.text	
ltx/en_us_oca/tr.d029:trCA.Ode8Tr.incipit	…
ltx/en_us_oca/tr.d029:trCA.Ode8Tr.melody	
ltx/en_us_oca/tr.d029:trCA.Ode8Tr.mode	
ltx/en_us_oca/tr.d029:trCA.Ode8Tr.ode	
ltx/en_us_oca/tr.d029:trCA.Ode8Tr.text	
ltx/en_us_oca/tr.d029:trCA.Ode91.incipit	…
ltx/en_us_oca/tr.d029:trCA.Ode91.melody	
ltx/en_us_oca/tr.d029:trCA.Ode91.mode	
ltx/en_us_oca/tr.d029:trCA.Ode91.ode	
ltx/en_us_oca/tr.d029:trCA.Ode91.text	
ltx/en_us_oca/tr.d029:trCA.Ode92.incipit	…
ltx/en_us_oca/tr.d029:trCA.Ode92.melody	
ltx/en_us_oca/tr.d029:trCA.Ode92.mode	
ltx/en_us_oca/tr.d029:trCA.Ode92.ode	
ltx/en_us_oca/tr.d029:trCA.Ode92.text	
ltx/en_us_oca/tr.d029:trCA.Ode93.incipit	…
ltx/en_us_oca/tr.d029:trCA.Ode93.melody	
ltx/en_us_oca/tr.d029:trCA.Ode93.mode	
ltx/en_us_oca/tr.d029:trCA.Ode93.ode	
ltx/en_us_oca/tr.d029:trCA.Ode93.text	
ltx/en_us_oca/tr.d029:trCA.Ode94.incipit	…
ltx/en_us_oca/tr.d029:trCA.Ode94.melody	
ltx/en_us_oca/tr.d029:trCA.Ode94.mode	
ltx/en_us_oca/tr.d029:trCA.Ode94.ode	
ltx/en_us_oca/tr.d029:trCA.Ode94.text	
ltx/en_us_oca/tr.d029:trCA.Ode95.incipit	…
ltx/en_us_oca/tr.d029:trCA.Ode95.melody	
ltx/en_us_oca/tr.d029:trCA.Ode95.mode	
ltx/en_us_oca/tr.d029:trCA.Ode95.ode	
ltx/en_us_oca/tr.d029:trCA.Ode95.text	
ltx/en_us_oca/tr.d029:trCA.Ode96.incipit	…
ltx/en_us_oca/tr.d029:trCA.Ode96.melody	
ltx/en_us_oca/tr.d029:trCA.Ode96.mode	
ltx/en_us_oca/tr.d029:trCA.Ode96.ode	
ltx/en_us_oca/tr.d029:trCA.Ode96.text	
ltx/en_us_oca/tr.d029:trCA.Ode97.incipit	…
ltx/en_us_oca/tr.d029:trCA.Ode97.melody	
ltx/en_us_oca/tr.d029:trCA.Ode97.mode	
ltx/en_us_oca/tr.d029:trCA.Ode97.ode	
ltx/en_us_oca/tr.d029:trCA.Ode97.text	
ltx/en_us_oca/tr.d029:trCA.Ode9T.incipit	…
ltx/en_us_oca/tr.d029:trCA.Ode9T.melody	
ltx/en_us_oca/tr.d029:trCA.Ode9T.mode	
ltx/en_us_oca/tr.d029:trCA.Ode9T.ode	
ltx/en_us_oca/tr.d029:trCA.Ode9T.text	
ltx/en_us_oca/tr.d029:trCA.Ode9Tr.incipit	…
ltx/en_us_oca/tr.d029:trCA.Ode9Tr.melody	
ltx/en_us_oca/tr.d029:trCA.Ode9Tr.mode	
ltx/en_us_oca/tr.d029:trCA.Ode9Tr.ode	
ltx/en_us_oca/tr.d029:trCA.Ode9Tr.text	
ltx/en_us_oca/tr.d029:trCA.Troparion1.incipit	…
ltx/en_us_oca/tr.d029:trCA.Troparion1.melody	
ltx/en_us_oca/tr.d029:trCA.Troparion1.mode	
ltx/en_us_oca/tr.d029:trCA.Troparion1.text	
ltx/en_us_oca/tr.d029:trCA.Troparion2.incipit	…
ltx/en_us_oca/tr.d029:trCA.Troparion2.melody	
ltx/en_us_oca/tr.d029:trCA.Troparion2.mode	
ltx/en_us_oca/tr.d029:trCA.Troparion2.text	
ltx/en_us_oca/tr.d029:trCA.poet	
ltx/en_us_oca/tr.d029:trCO.header	
ltx/en_us_oca/tr.d029:trDA.commemoration.full	
ltx/en_us_oca/tr.d029:trDA.commemoration.short	
ltx/en_us_oca/tr.d029:trDA.dismissal	@ltx/en_us_oca/dismissals:dis00.resurrection
ltx/en_us_oca/tr.d029:trDA.insert1	
ltx/en_us_oca/tr.d029:trDA.insert2	
ltx/en_us_oca/tr.d029:trDA.note	
ltx/en_us_oca/tr.d029:trDA.title	
ltx/en_us_oca/tr.d029:trHO.commemorations	
ltx/en_us_oca/tr.d029:trHO.daytitle	
ltx/en_us_oca/tr.d029:trHO.description1	
ltx/en_us_oca/tr.d029:trHO.description2	
ltx/en_us_oca/tr.d029:trHO.note1	
ltx/en_us_oca/tr.d029:trHO.note2	
ltx/en_us_oca/tr.d029:trLI.Kontakion1.incipit	@ltx/en_us_oca/tr.d029:trMA.Kontakion1.incipit
ltx/en_us_oca/tr.d029:trLI.Kontakion1.melody	@ltx/en_us_oca/tr.d029:trMA.Kontakion1.melody
ltx/en_us_oca/tr.d029:trLI.Kontakion1.mode	@ltx/en_us_oca/tr.d029:trMA.Kontakion1.mode
ltx/en_us_oca/tr.d029:trLI.Kontakion1.text	@ltx/en_us_oca/tr.d029:trMA.Kontakion1.text
ltx/en_us_oca/tr.d029:trLI.MM.CommunionHymn.text	@ltx/en_us_oca/properties:media.key
ltx/en_us_oca/tr.d029:trLI.MM.EntranceHymn.text	@ltx/en_us_oca/properties:media.key
ltx/en_us_oca/tr.d029:trLI.Megalynarion.text	
ltx/en_us_oca/tr.d029:trLI.TheotokosHymn.incipit	@ltx/en_us_oca/oc.m8.d1:ocMA.Kathisma23.incipit
ltx/en_us_oca/tr.d029:trLI.TheotokosHymn.mode	@ltx/en_us_oca/miscellanea:misc.Mode8
ltx/en_us_oca/tr.d029:trLI.TheotokosHymn.text	@ltx/en_us_oca/oc.m8.d1:ocMA.Kathisma23.text
ltx/en_us_oca/tr.d029:trMA.C1.acrostic.notice1	
ltx/en_us_oca/tr.d029:trMA.C1.acrostic.text	
ltx/en_us_oca/tr.d029:trMA.C1.acrostic.title	The Canon of the Triodion.
ltx/en_us_oca/tr.d029:trMA.C1.poet	@ltx/en_us_oca/poets:po.KyriouTheofanous
ltx/en_us_oca/tr.d029:trMA.C1.title	@ltx/en_us_oca/titles:ti.CanonTriodion
ltx/en_us_oca/tr.d029:trMA.C1.verse	@ltx/en_us_oca/prayers:pr.verse_God.text
ltx/en_us_oca/tr.d029:trMA.ExapTheotokion.greekmelody	@ltx/en_us_oca/he.a.m2:heAU.GynaikesAkoutisthite.greekname
ltx/en_us_oca/tr.d029:trMA.ExapTheotokion.incipit	…
ltx/en_us_oca/tr.d029:trMA.ExapTheotokion.melody	@ltx/en_us_oca/he.a.m2:heAU.GynaikesAkoutisthite.notmetered
ltx/en_us_oca/tr.d029:trMA.ExapTheotokion.mode	@ltx/en_us_oca/miscellanea:misc.Mode2
ltx/en_us_oca/tr.d029:trMA.ExapTheotokion.text	
ltx/en_us_oca/tr.d029:trMA.Exaposteilarion1.greekmelody	@ltx/en_us_oca/he.a.m2:heAU.GynaikesAkoutisthite.greekname
ltx/en_us_oca/tr.d029:trMA.Exaposteilarion1.incipit	…
ltx/en_us_oca/tr.d029:trMA.Exaposteilarion1.melody	@ltx/en_us_oca/he.a.m2:heAU.GynaikesAkoutisthite.notmetered
ltx/en_us_oca/tr.d029:trMA.Exaposteilarion1.mode	@ltx/en_us_oca/miscellanea:misc.Mode2
ltx/en_us_oca/tr.d029:trMA.Exaposteilarion1.text	
ltx/en_us_oca/tr.d029:trMA.Kontakion1.incipit	No one could describe the…
ltx/en_us_oca/tr.d029:trMA.Kontakion1.melody	@ltx/en_us_oca/miscellanea:misc.Automelon
ltx/en_us_oca/tr.d029:trMA.Kontakion1.mode	@ltx/en_us_oca/miscellanea:misc.Mode8
ltx/en_us_oca/tr.d029:trMA.Kontakion1.text	No one could describe the Word of the Father; ⁄ but when he took flesh from you, Theotokos, he accepted to be described, ⁄ and restored the fallen image to its former state by uniting it to divine beauty. ⁄⁄ We confess and proclaim our salvation in word and images!
ltx/en_us_oca/tr.d029:trMA.Lauds1.greekmelody	@ltx/en_us_oca/he.a.m4:heAU.EdokasSimeiosin.greekname
ltx/en_us_oca/tr.d029:trMA.Lauds1.incipit	…
ltx/en_us_oca/tr.d029:trMA.Lauds1.melody	@ltx/en_us_oca/he.a.m4:heAU.EdokasSimeiosin.notmetered
ltx/en_us_oca/tr.d029:trMA.Lauds1.mode	@ltx/en_us_oca/miscellanea:misc.Mode4
ltx/en_us_oca/tr.d029:trMA.Lauds1.text	
ltx/en_us_oca/tr.d029:trMA.Lauds2.incipit	…
ltx/en_us_oca/tr.d029:trMA.Lauds2.melody	@ltx/en_us_oca/he.a.m4:heAU.EdokasSimeiosin.notmetered
ltx/en_us_oca/tr.d029:trMA.Lauds2.mode	@ltx/en_us_oca/miscellanea:misc.Mode4
ltx/en_us_oca/tr.d029:trMA.Lauds2.text	
ltx/en_us_oca/tr.d029:trMA.Lauds3.incipit	…
ltx/en_us_oca/tr.d029:trMA.Lauds3.melody	@ltx/en_us_oca/he.a.m4:heAU.EdokasSimeiosin.notmetered
ltx/en_us_oca/tr.d029:trMA.Lauds3.mode	@ltx/en_us_oca/miscellanea:misc.Mode4
ltx/en_us_oca/tr.d029:trMA.Lauds3.text	
ltx/en_us_oca/tr.d029:trMA.LaudsGlory.incipit	…
ltx/en_us_oca/tr.d029:trMA.LaudsGlory.melody	
ltx/en_us_oca/tr.d029:trMA.LaudsGlory.mode	@ltx/en_us_oca/miscellanea:misc.Mode6
ltx/en_us_oca/tr.d029:trMA.LaudsGlory.text	
ltx/en_us_oca/tr.d029:trMA.LaudsTheotokion.incipit	@ltx/en_us_oca/oc.m2.d1:ocMA.Kathisma23.incipit
ltx/en_us_oca/tr.d029:trMA.LaudsTheotokion.melody	
ltx/en_us_oca/tr.d029:trMA.LaudsTheotokion.mode	
ltx/en_us_oca/tr.d029:trMA.LaudsTheotokion.text	@ltx/en_us_oca/oc.m2.d1:ocMA.Kathisma23.text
ltx/en_us_oca/tr.d029:trMA.Ode1C11.greekmelody	@ltx/en_us_oca/he.h.m4:heHE.ThalassisToErythraion.greekname
ltx/en_us_oca/tr.d029:trMA.Ode1C11.incipit	Let us and all the…
ltx/en_us_oca/tr.d029:trMA.Ode1C11.melody	@ltx/en_us_oca/he.h.m4:heHE.ThalassisToErythraion.notmetered
ltx/en_us_oca/tr.d029:trMA.Ode1C11.mode	@ltx/en_us_oca/miscellanea:misc.Mode4
ltx/en_us_oca/tr.d029:trMA.Ode1C11.ode	@ltx/en_us_oca/miscellanea:misc.Ode1
ltx/en_us_oca/tr.d029:trMA.Ode1C11.text	Let us and all the faithful cry aloud and leap with joy today: ⁄ How marvelous are Your works, O Christ! ⁄ How great is Your might! ⁄ For You have made us of one mind ⁄ and brought about our agreement!
ltx/en_us_oca/tr.d029:trMA.Ode1C12.incipit	People of God, come and…
ltx/en_us_oca/tr.d029:trMA.Ode1C12.melody	@ltx/en_us_oca/he.h.m4:heHE.ThalassisToErythraion.notmetered
ltx/en_us_oca/tr.d029:trMA.Ode1C12.mode	@ltx/en_us_oca/miscellanea:misc.Mode4
ltx/en_us_oca/tr.d029:trMA.Ode1C12.ode	@ltx/en_us_oca/miscellanea:misc.Ode1
ltx/en_us_oca/tr.d029:trMA.Ode1C12.text	People of God, come and let us celebrate a day of joy: ⁄ Now heaven makes glad! ⁄ Earth with all the hosts of angels ⁄ and the companies of mortal men, ⁄ each in their varied orders, keep the feast.
ltx/en_us_oca/tr.d029:trMA.Ode1C13.incipit	Seeing the great blessing we…
ltx/en_us_oca/tr.d029:trMA.Ode1C13.melody	@ltx/en_us_oca/he.h.m4:heHE.ThalassisToErythraion.notmetered
ltx/en_us_oca/tr.d029:trMA.Ode1C13.mode	@ltx/en_us_oca/miscellanea:misc.Mode4
ltx/en_us_oca/tr.d029:trMA.Ode1C13.ode	@ltx/en_us_oca/miscellanea:misc.Ode1
ltx/en_us_oca/tr.d029:trMA.Ode1C13.text	Seeing the great blessing we have received: ⁄ how the divided members of Christ have been brought to unity, ⁄ let us clap our hands for joy ⁄ and praise God who has granted us peace!
ltx/en_us_oca/tr.d029:trMA.Ode1C14.incipit	Today a festival of victory…
ltx/en_us_oca/tr.d029:trMA.Ode1C14.melody	@ltx/en_us_oca/he.h.m4:heHE.ThalassisToErythraion.notmetered
ltx/en_us_oca/tr.d029:trMA.Ode1C14.mode	@ltx/en_us_oca/miscellanea:misc.Mode4
ltx/en_us_oca/tr.d029:trMA.Ode1C14.ode	@ltx/en_us_oca/miscellanea:misc.Ode1
ltx/en_us_oca/tr.d029:trMA.Ode1C14.text	Today a festival of victory is given to the Church ⁄ through the divinely-inspired intention and will of Michael and Theodora, ⁄ the rulers who in piety upheld the true Faith.
ltx/en_us_oca/tr.d029:trMA.Ode1C1T.incipit	The swords of impious heresies…
ltx/en_us_oca/tr.d029:trMA.Ode1C1T.melody	@ltx/en_us_oca/he.h.m4:heHE.ThalassisToErythraion.notmetered
ltx/en_us_oca/tr.d029:trMA.Ode1C1T.mode	@ltx/en_us_oca/miscellanea:misc.Mode4
ltx/en_us_oca/tr.d029:trMA.Ode1C1T.ode	@ltx/en_us_oca/miscellanea:misc.Ode1
ltx/en_us_oca/tr.d029:trMA.Ode1C1T.text	The swords of impious heresies have failed: ⁄ for in deep reverence, pure and holy Virgin, ⁄ we now behold your temple, ⁄ made beautiful with icons, ⁄ and we rejoice with holy joy!
ltx/en_us_oca/tr.d029:trMA.Ode3C11.greekmelody	@ltx/en_us_oca/he.h.m4:heHE.EffrainetaiEpiSoi.greekname
ltx/en_us_oca/tr.d029:trMA.Ode3C11.incipit	The impious heretics ⁄ are…
ltx/en_us_oca/tr.d029:trMA.Ode3C11.melody	@ltx/en_us_oca/he.h.m4:heHE.EffrainetaiEpiSoi.notmetered
ltx/en_us_oca/tr.d029:trMA.Ode3C11.mode	@ltx/en_us_oca/miscellanea:misc.Mode4
ltx/en_us_oca/tr.d029:trMA.Ode3C11.ode	@ltx/en_us_oca/miscellanea:misc.Ode3
ltx/en_us_oca/tr.d029:trMA.Ode3C11.text	The impious heretics ⁄ are no longer exalted in their pride, ⁄ for the power of God has firmly established Orthodoxy!
ltx/en_us_oca/tr.d029:trMA.Ode3C12.incipit	Today let the prophets ⁄…
ltx/en_us_oca/tr.d029:trMA.Ode3C12.melody	@ltx/en_us_oca/he.h.m4:heHE.EffrainetaiEpiSoi.notmetered
ltx/en_us_oca/tr.d029:trMA.Ode3C12.mode	@ltx/en_us_oca/miscellanea:misc.Mode4
ltx/en_us_oca/tr.d029:trMA.Ode3C12.ode	@ltx/en_us_oca/miscellanea:misc.Ode3
ltx/en_us_oca/tr.d029:trMA.Ode3C12.text	Today let the prophets ⁄ at the restoration of the Faith, ⁄ drop on us life-giving dew from heaven!
ltx/en_us_oca/tr.d029:trMA.Ode3C13.incipit	Let the mystical trumpets of…
ltx/en_us_oca/tr.d029:trMA.Ode3C13.melody	@ltx/en_us_oca/he.h.m4:heHE.EffrainetaiEpiSoi.notmetered
ltx/en_us_oca/tr.d029:trMA.Ode3C13.mode	@ltx/en_us_oca/miscellanea:misc.Mode4
ltx/en_us_oca/tr.d029:trMA.Ode3C13.ode	@ltx/en_us_oca/miscellanea:misc.Ode3
ltx/en_us_oca/tr.d029:trMA.Ode3C13.text	Let the mystical trumpets of Christ’s apostles ⁄ sound in God-given harmony, ⁄ proclaiming the re-establishment of the precious icons.
ltx/en_us_oca/tr.d029:trMA.Ode3C14.incipit	Let us sing in praise…
ltx/en_us_oca/tr.d029:trMA.Ode3C14.melody	@ltx/en_us_oca/he.h.m4:heHE.EffrainetaiEpiSoi.notmetered
ltx/en_us_oca/tr.d029:trMA.Ode3C14.mode	@ltx/en_us_oca/miscellanea:misc.Mode4
ltx/en_us_oca/tr.d029:trMA.Ode3C14.ode	@ltx/en_us_oca/miscellanea:misc.Ode3
ltx/en_us_oca/tr.d029:trMA.Ode3C14.text	Let us sing in praise of Christ, ⁄ Who appointed a devout and pious empress to rule over His people, ⁄ together with her son, who was crowned by God.
ltx/en_us_oca/tr.d029:trMA.Ode3C1T.incipit	We pray you, most pure…
ltx/en_us_oca/tr.d029:trMA.Ode3C1T.melody	@ltx/en_us_oca/he.h.m4:heHE.EffrainetaiEpiSoi.notmetered
ltx/en_us_oca/tr.d029:trMA.Ode3C1T.mode	@ltx/en_us_oca/miscellanea:misc.Mode4
ltx/en_us_oca/tr.d029:trMA.Ode3C1T.ode	@ltx/en_us_oca/miscellanea:misc.Ode3
ltx/en_us_oca/tr.d029:trMA.Ode3C1T.text	We pray you, most pure Lady, ⁄ shine now with the light of grace upon the faithful ⁄ who have gathered in your holy house.
ltx/en_us_oca/tr.d029:trMA.Ode3Kathisma1.greekmelody	@ltx/en_us_oca/he.a.m1:heAU.ChorosAngelikos.greekname
ltx/en_us_oca/tr.d029:trMA.Ode3Kathisma1.incipit	Depicting your divine form in…
ltx/en_us_oca/tr.d029:trMA.Ode3Kathisma1.melody	@ltx/en_us_oca/he.a.m1:heAU.ChorosAngelikos.notmetered
ltx/en_us_oca/tr.d029:trMA.Ode3Kathisma1.mode	@ltx/en_us_oca/miscellanea:misc.Mode1
ltx/en_us_oca/tr.d029:trMA.Ode3Kathisma1.text	Depicting your divine form in icons, O Christ, ⁄ we openly proclaim your nativity, ⁄ your ineffable miracles, and your voluntary crucifixion! ⁄ So the devils are driven out in fear, ⁄ and the heretics, their fellow-workers, ⁄⁄ lament in shame and sorrow!
ltx/en_us_oca/tr.d029:trMA.Ode3Kathisma2.greekmelody	@ltx/en_us_oca/he.a.m1:heAU.ChorosAngelikos.greekname
ltx/en_us_oca/tr.d029:trMA.Ode3Kathisma2.incipit	The heavenly Zion, our mother…
ltx/en_us_oca/tr.d029:trMA.Ode3Kathisma2.melody	@ltx/en_us_oca/he.a.m1:heAU.ChorosAngelikos.notmetered
ltx/en_us_oca/tr.d029:trMA.Ode3Kathisma2.mode	@ltx/en_us_oca/miscellanea:misc.Mode1
ltx/en_us_oca/tr.d029:trMA.Ode3Kathisma2.text	The heavenly Zion, our mother, is made beautiful ⁄ with the holy icons of the prophets and apostles, ⁄ of the martyrs and all the saints, ⁄⁄ brightly adorned with the glory of the spiritual bridegroom and bride!
ltx/en_us_oca/tr.d029:trMA.Ode3Kathisma3.greekmelody	@ltx/en_us_oca/he.a.m1:heAU.ChorosAngelikos.greekname
ltx/en_us_oca/tr.d029:trMA.Ode3Kathisma3.incipit	We venerate your holy icon…
ltx/en_us_oca/tr.d029:trMA.Ode3Kathisma3.melody	@ltx/en_us_oca/he.a.m1:heAU.ChorosAngelikos.notmetered
ltx/en_us_oca/tr.d029:trMA.Ode3Kathisma3.mode	@ltx/en_us_oca/miscellanea:misc.Mode1
ltx/en_us_oca/tr.d029:trMA.Ode3Kathisma3.text	We venerate your holy icon with love, honored Virgin, ⁄ proclaiming you with one accord as the true Theotokos! ⁄ In faith, we bow before you: ⁄ Since you have power to do all things, ⁄ be our guardian and our strong protection, ⁄⁄ driving far from us every tribulation!
ltx/en_us_oca/tr.d029:trMA.Ode4C11.greekmelody	@ltx/en_us_oca/he.h.m4:heHE.EparthentaSeIdousa.greekname
ltx/en_us_oca/tr.d029:trMA.Ode4C11.incipit	Sanctify Your temple, most merciful…
ltx/en_us_oca/tr.d029:trMA.Ode4C11.melody	@ltx/en_us_oca/he.h.m4:heHE.EparthentaSeIdousa.notmetered
ltx/en_us_oca/tr.d029:trMA.Ode4C11.mode	@ltx/en_us_oca/miscellanea:misc.Mode4
ltx/en_us_oca/tr.d029:trMA.Ode4C11.ode	@ltx/en_us_oca/miscellanea:misc.Ode4
ltx/en_us_oca/tr.d029:trMA.Ode4C11.text	Sanctify Your temple, most merciful Word of God ⁄ through the divine descent of the Comforter, ⁄ and by His coming banish the error of heresy!
ltx/en_us_oca/tr.d029:trMA.Ode4C12.incipit	Deliver Your people from the…
ltx/en_us_oca/tr.d029:trMA.Ode4C12.melody	@ltx/en_us_oca/he.h.m4:heHE.EparthentaSeIdousa.notmetered
ltx/en_us_oca/tr.d029:trMA.Ode4C12.mode	@ltx/en_us_oca/miscellanea:misc.Mode4
ltx/en_us_oca/tr.d029:trMA.Ode4C12.ode	@ltx/en_us_oca/miscellanea:misc.Ode4
ltx/en_us_oca/tr.d029:trMA.Ode4C12.text	Deliver Your people from the violence of impiety, ⁄ kindling them with zeal for Orthodoxy ⁄ as they cry out to You in faith: ⁄ Glory to Your power, O Lord!
ltx/en_us_oca/tr.d029:trMA.Ode4C13.incipit	We rejoice with holy joy…
ltx/en_us_oca/tr.d029:trMA.Ode4C13.melody	@ltx/en_us_oca/he.h.m4:heHE.EparthentaSeIdousa.notmetered
ltx/en_us_oca/tr.d029:trMA.Ode4C13.mode	@ltx/en_us_oca/miscellanea:misc.Mode4
ltx/en_us_oca/tr.d029:trMA.Ode4C13.ode	@ltx/en_us_oca/miscellanea:misc.Ode4
ltx/en_us_oca/tr.d029:trMA.Ode4C13.text	We rejoice with holy joy, ⁄ seeing the churches of God bright with the sacred icons ⁄ of Christ and the Theotokos.
ltx/en_us_oca/tr.d029:trMA.Ode4C14.incipit	The royally crowned Empress, in…
ltx/en_us_oca/tr.d029:trMA.Ode4C14.melody	@ltx/en_us_oca/he.h.m4:heHE.EparthentaSeIdousa.notmetered
ltx/en_us_oca/tr.d029:trMA.Ode4C14.mode	@ltx/en_us_oca/miscellanea:misc.Mode4
ltx/en_us_oca/tr.d029:trMA.Ode4C14.ode	@ltx/en_us_oca/miscellanea:misc.Ode4
ltx/en_us_oca/tr.d029:trMA.Ode4C14.text	The royally crowned Empress, in love for the true Kingdom of Christ, ⁄ restored in all the churches ⁄ His most pure icon and the pictures of the saints.
ltx/en_us_oca/tr.d029:trMA.Ode4C1T.incipit	You were sanctified as the…
ltx/en_us_oca/tr.d029:trMA.Ode4C1T.melody	@ltx/en_us_oca/he.h.m4:heHE.EparthentaSeIdousa.notmetered
ltx/en_us_oca/tr.d029:trMA.Ode4C1T.mode	@ltx/en_us_oca/miscellanea:misc.Mode4
ltx/en_us_oca/tr.d029:trMA.Ode4C1T.ode	@ltx/en_us_oca/miscellanea:misc.Ode4
ltx/en_us_oca/tr.d029:trMA.Ode4C1T.text	You were sanctified as the holy temple of God, ⁄ full of grace who bore God the incarnate Word: ⁄ therefore we consecrate your shrine, newly adorned with glory.
ltx/en_us_oca/tr.d029:trMA.Ode5C11.greekmelody	@ltx/en_us_oca/he.h.m4:heHE.SyKyrieMouFos.greekname
ltx/en_us_oca/tr.d029:trMA.Ode5C11.incipit	Firmly establish Your Church, Lord…
ltx/en_us_oca/tr.d029:trMA.Ode5C11.melody	@ltx/en_us_oca/he.h.m4:heHE.SyKyrieMouFos.notmetered
ltx/en_us_oca/tr.d029:trMA.Ode5C11.mode	@ltx/en_us_oca/miscellanea:misc.Mode4
ltx/en_us_oca/tr.d029:trMA.Ode5C11.ode	@ltx/en_us_oca/miscellanea:misc.Ode5
ltx/en_us_oca/tr.d029:trMA.Ode5C11.text	Firmly establish Your Church, Lord, ⁄ that she may stand unshaken by the storm of heresy ⁄ unto ages of ages!
ltx/en_us_oca/tr.d029:trMA.Ode5C12.incipit	The rejoicing granted to the…
ltx/en_us_oca/tr.d029:trMA.Ode5C12.melody	@ltx/en_us_oca/he.h.m4:heHE.SyKyrieMouFos.notmetered
ltx/en_us_oca/tr.d029:trMA.Ode5C12.mode	@ltx/en_us_oca/miscellanea:misc.Mode4
ltx/en_us_oca/tr.d029:trMA.Ode5C12.ode	@ltx/en_us_oca/miscellanea:misc.Ode5
ltx/en_us_oca/tr.d029:trMA.Ode5C12.text	The rejoicing granted to the faithful from on high ⁄ and the help they have received from God ⁄ shines with glory over all the earth.
ltx/en_us_oca/tr.d029:trMA.Ode5C13.incipit	O only good One, and…
ltx/en_us_oca/tr.d029:trMA.Ode5C13.melody	@ltx/en_us_oca/he.h.m4:heHE.SyKyrieMouFos.notmetered
ltx/en_us_oca/tr.d029:trMA.Ode5C13.mode	@ltx/en_us_oca/miscellanea:misc.Mode4
ltx/en_us_oca/tr.d029:trMA.Ode5C13.ode	@ltx/en_us_oca/miscellanea:misc.Ode5
ltx/en_us_oca/tr.d029:trMA.Ode5C13.text	O only good One, and source of goodness, ⁄ exalt the horn of Orthodox monarchs, ⁄ who honor your icon.
ltx/en_us_oca/tr.d029:trMA.Ode5C14.incipit	The light of the true…
ltx/en_us_oca/tr.d029:trMA.Ode5C14.melody	@ltx/en_us_oca/he.h.m4:heHE.SyKyrieMouFos.notmetered
ltx/en_us_oca/tr.d029:trMA.Ode5C14.mode	@ltx/en_us_oca/miscellanea:misc.Mode4
ltx/en_us_oca/tr.d029:trMA.Ode5C14.ode	@ltx/en_us_oca/miscellanea:misc.Ode5
ltx/en_us_oca/tr.d029:trMA.Ode5C14.text	The light of the true Faith that knows no evening ⁄ has shone forth upon us ⁄ at the divinely-inspired decree of our faithful monarchs.
ltx/en_us_oca/tr.d029:trMA.Ode5C1T.incipit	Renew the ancient splendors for…
ltx/en_us_oca/tr.d029:trMA.Ode5C1T.melody	@ltx/en_us_oca/he.h.m4:heHE.SyKyrieMouFos.notmetered
ltx/en_us_oca/tr.d029:trMA.Ode5C1T.mode	@ltx/en_us_oca/miscellanea:misc.Mode4
ltx/en_us_oca/tr.d029:trMA.Ode5C1T.ode	@ltx/en_us_oca/miscellanea:misc.Ode5
ltx/en_us_oca/tr.d029:trMA.Ode5C1T.text	Renew the ancient splendors for us, ⁄ most pure Mother of God, ⁄ and sanctify your dwelling with grace.
ltx/en_us_oca/tr.d029:trMA.Ode6C11.greekmelody	@ltx/en_us_oca/he.h.m4:heHE.ThysoSoiMetaFonis.greekname
ltx/en_us_oca/tr.d029:trMA.Ode6C11.incipit	Once more the Master’s countenance…
ltx/en_us_oca/tr.d029:trMA.Ode6C11.melody	@ltx/en_us_oca/he.h.m4:heHE.ThysoSoiMetaFonis.notmetered
ltx/en_us_oca/tr.d029:trMA.Ode6C11.mode	@ltx/en_us_oca/miscellanea:misc.Mode4
ltx/en_us_oca/tr.d029:trMA.Ode6C11.ode	@ltx/en_us_oca/miscellanea:misc.Ode6
ltx/en_us_oca/tr.d029:trMA.Ode6C11.text	Once more the Master’s countenance is depicted, ⁄ venerated and honored with faith; ⁄ once more the Church regains ⁄ her boldness of approach to God, ⁄ reverently glorifying the Savior!
ltx/en_us_oca/tr.d029:trMA.Ode6C12.incipit	The Church of Christ is…
ltx/en_us_oca/tr.d029:trMA.Ode6C12.melody	@ltx/en_us_oca/he.h.m4:heHE.ThysoSoiMetaFonis.notmetered
ltx/en_us_oca/tr.d029:trMA.Ode6C12.mode	@ltx/en_us_oca/miscellanea:misc.Mode4
ltx/en_us_oca/tr.d029:trMA.Ode6C12.ode	@ltx/en_us_oca/miscellanea:misc.Ode6
ltx/en_us_oca/tr.d029:trMA.Ode6C12.text	The Church of Christ is delivered from the dark despondency of heresy: ⁄ she puts on a robe of gladness, ⁄ and is clothed in the light of divine grace.
ltx/en_us_oca/tr.d029:trMA.Ode6C13.incipit	Through the decision of the…
ltx/en_us_oca/tr.d029:trMA.Ode6C13.melody	@ltx/en_us_oca/he.h.m4:heHE.ThysoSoiMetaFonis.notmetered
ltx/en_us_oca/tr.d029:trMA.Ode6C13.mode	@ltx/en_us_oca/miscellanea:misc.Mode4
ltx/en_us_oca/tr.d029:trMA.Ode6C13.ode	@ltx/en_us_oca/miscellanea:misc.Ode6
ltx/en_us_oca/tr.d029:trMA.Ode6C13.text	Through the decision of the Empress Theodora ⁄ and her pious son the Emperor Michael, ⁄ the Orthodox people regained the light and glory which it had of old.
ltx/en_us_oca/tr.d029:trMA.Ode6C1T.incipit	He who of old commanded…
ltx/en_us_oca/tr.d029:trMA.Ode6C1T.melody	@ltx/en_us_oca/he.h.m4:heHE.ThysoSoiMetaFonis.notmetered
ltx/en_us_oca/tr.d029:trMA.Ode6C1T.mode	@ltx/en_us_oca/miscellanea:misc.Mode4
ltx/en_us_oca/tr.d029:trMA.Ode6C1T.ode	@ltx/en_us_oca/miscellanea:misc.Ode6
ltx/en_us_oca/tr.d029:trMA.Ode6C1T.text	He who of old commanded Moses ⁄ to set up the ark of the testimony, ⁄ came to dwell in you, Virgin, as in a spiritual ark: ⁄ He alone is glorified, ⁄ and He makes your temple glorious with miracles.
ltx/en_us_oca/tr.d029:trMA.Ode7C11.greekmelody	@ltx/en_us_oca/he.h.m4:heHE.EnTiKaminoAvramiaioi.greekname
ltx/en_us_oca/tr.d029:trMA.Ode7C11.incipit	Let the hosts of angels…
ltx/en_us_oca/tr.d029:trMA.Ode7C11.melody	@ltx/en_us_oca/he.h.m4:heHE.EnTiKaminoAvramiaioi.notmetered
ltx/en_us_oca/tr.d029:trMA.Ode7C11.mode	@ltx/en_us_oca/miscellanea:misc.Mode4
ltx/en_us_oca/tr.d029:trMA.Ode7C11.ode	@ltx/en_us_oca/miscellanea:misc.Ode7
ltx/en_us_oca/tr.d029:trMA.Ode7C11.text	Let the hosts of angels share in the joy of the Church, ⁄ and filled with the love of God, let them cry aloud: ⁄ Blessed are You, Lord, in the temple of Your glory!
ltx/en_us_oca/tr.d029:trMA.Ode7C12.incipit	The triumphant assembly and Church…
ltx/en_us_oca/tr.d029:trMA.Ode7C12.melody	@ltx/en_us_oca/he.h.m4:heHE.EnTiKaminoAvramiaioi.notmetered
ltx/en_us_oca/tr.d029:trMA.Ode7C12.mode	@ltx/en_us_oca/miscellanea:misc.Mode4
ltx/en_us_oca/tr.d029:trMA.Ode7C12.ode	@ltx/en_us_oca/miscellanea:misc.Ode7
ltx/en_us_oca/tr.d029:trMA.Ode7C12.text	The triumphant assembly and Church of the firstborn rejoices ⁄ beholding the people of God who cry aloud with one accord: ⁄ Blessed are You, Lord, in the temple of Your glory!
ltx/en_us_oca/tr.d029:trMA.Ode7C13.incipit	Delivered from the dark heresies…
ltx/en_us_oca/tr.d029:trMA.Ode7C13.melody	@ltx/en_us_oca/he.h.m4:heHE.EnTiKaminoAvramiaioi.notmetered
ltx/en_us_oca/tr.d029:trMA.Ode7C13.mode	@ltx/en_us_oca/miscellanea:misc.Mode4
ltx/en_us_oca/tr.d029:trMA.Ode7C13.ode	@ltx/en_us_oca/miscellanea:misc.Ode7
ltx/en_us_oca/tr.d029:trMA.Ode7C13.text	Delivered from the dark heresies of the past ⁄ through the decision of the honored Empress Theodora, we cry aloud: ⁄ Blessed are You, Lord, in the temple of Your glory!
ltx/en_us_oca/tr.d029:trMA.Ode7C1T.incipit	Most pure Virgin, you are…
ltx/en_us_oca/tr.d029:trMA.Ode7C1T.melody	@ltx/en_us_oca/he.h.m4:heHE.EnTiKaminoAvramiaioi.notmetered
ltx/en_us_oca/tr.d029:trMA.Ode7C1T.mode	@ltx/en_us_oca/miscellanea:misc.Mode4
ltx/en_us_oca/tr.d029:trMA.Ode7C1T.ode	@ltx/en_us_oca/miscellanea:misc.Ode7
ltx/en_us_oca/tr.d029:trMA.Ode7C1T.text	Most pure Virgin, you are exalted above the choirs on high, ⁄ for alone among women, ⁄ you became Mother of the Creator of all. ⁄ And so in joy we shout aloud: ⁄ Blessed are you among women, undefiled Lady!
ltx/en_us_oca/tr.d029:trMA.Ode8C11.greekmelody	@ltx/en_us_oca/he.h.m4:heHE.CheirasEkpetasasDaniil.greekname
ltx/en_us_oca/tr.d029:trMA.Ode8C11.incipit	Keeping the laws of the…
ltx/en_us_oca/tr.d029:trMA.Ode8C11.melody	@ltx/en_us_oca/he.h.m4:heHE.CheirasEkpetasasDaniil.notmetered
ltx/en_us_oca/tr.d029:trMA.Ode8C11.mode	@ltx/en_us_oca/miscellanea:misc.Mode4
ltx/en_us_oca/tr.d029:trMA.Ode8C11.ode	@ltx/en_us_oca/miscellanea:misc.Ode8
ltx/en_us_oca/tr.d029:trMA.Ode8C11.text	Keeping the laws of the Church we received from the Fathers, ⁄ we paint icons of Christ and His saints, ⁄ and with our lips and heart and will ⁄ we venerate them as we cry aloud: ⁄ All works of the Lord, bless the Lord!
ltx/en_us_oca/tr.d029:trMA.Ode8C12.incipit	The honor and veneration we…
ltx/en_us_oca/tr.d029:trMA.Ode8C12.melody	@ltx/en_us_oca/he.h.m4:heHE.CheirasEkpetasasDaniil.notmetered
ltx/en_us_oca/tr.d029:trMA.Ode8C12.mode	@ltx/en_us_oca/miscellanea:misc.Mode4
ltx/en_us_oca/tr.d029:trMA.Ode8C12.ode	@ltx/en_us_oca/miscellanea:misc.Ode8
ltx/en_us_oca/tr.d029:trMA.Ode8C12.text	The honor and veneration we show to the icon ⁄ we ascribe to the prototype it represents, ⁄ following the teaching of the saints inspired by God, ⁄ and with faith we cry aloud to Christ: ⁄ All works of the Lord, bless the Lord!
ltx/en_us_oca/tr.d029:trMA.Ode8C13.incipit	Her mind enlightened by the…
ltx/en_us_oca/tr.d029:trMA.Ode8C13.melody	@ltx/en_us_oca/he.h.m4:heHE.CheirasEkpetasasDaniil.notmetered
ltx/en_us_oca/tr.d029:trMA.Ode8C13.mode	@ltx/en_us_oca/miscellanea:misc.Mode4
ltx/en_us_oca/tr.d029:trMA.Ode8C13.ode	@ltx/en_us_oca/miscellanea:misc.Ode8
ltx/en_us_oca/tr.d029:trMA.Ode8C13.text	Her mind enlightened by the illumination of the Holy Spirit ⁄ and filled with the wisdom of God, ⁄ the honored Empress ⁄ loved the beauty and splendor of the Church of Christ, ⁄ and with all the faithful ⁄ she blesses Jesus, the God-Man.
ltx/en_us_oca/tr.d029:trMA.Ode8C1T.incipit	Illumined by rays of spiritual…
ltx/en_us_oca/tr.d029:trMA.Ode8C1T.melody	@ltx/en_us_oca/he.h.m4:heHE.CheirasEkpetasasDaniil.notmetered
ltx/en_us_oca/tr.d029:trMA.Ode8C1T.mode	@ltx/en_us_oca/miscellanea:misc.Mode4
ltx/en_us_oca/tr.d029:trMA.Ode8C1T.ode	@ltx/en_us_oca/miscellanea:misc.Ode8
ltx/en_us_oca/tr.d029:trMA.Ode8C1T.text	Illumined by rays of spiritual light, ⁄ your holy house overshadows us all with the cloud of the Spirit ⁄ and sanctifies the faithful who sing with one accord: ⁄ All works of the Lord, bless the Lord!
ltx/en_us_oca/tr.d029:trMA.Ode9C11.greekmelody	@ltx/en_us_oca/he.h.m4:heHE.LithosAcheirotmitos.greekname
ltx/en_us_oca/tr.d029:trMA.Ode9C11.incipit	Seeing the Holy Church adorned…
ltx/en_us_oca/tr.d029:trMA.Ode9C11.melody	@ltx/en_us_oca/he.h.m4:heHE.LithosAcheirotmitos.notmetered
ltx/en_us_oca/tr.d029:trMA.Ode9C11.mode	@ltx/en_us_oca/miscellanea:misc.Mode4
ltx/en_us_oca/tr.d029:trMA.Ode9C11.ode	@ltx/en_us_oca/miscellanea:misc.Ode9
ltx/en_us_oca/tr.d029:trMA.Ode9C11.text	Seeing the Holy Church adorned with icons once more, ⁄ let us make haste and cry aloud to Christ with reverence: ⁄ We magnify You, Thrice Holy One!
ltx/en_us_oca/tr.d029:trMA.Ode9C12.incipit	As a mark of glory…
ltx/en_us_oca/tr.d029:trMA.Ode9C12.melody	@ltx/en_us_oca/he.h.m4:heHE.LithosAcheirotmitos.notmetered
ltx/en_us_oca/tr.d029:trMA.Ode9C12.mode	@ltx/en_us_oca/miscellanea:misc.Mode4
ltx/en_us_oca/tr.d029:trMA.Ode9C12.ode	@ltx/en_us_oca/miscellanea:misc.Ode9
ltx/en_us_oca/tr.d029:trMA.Ode9C12.text	As a mark of glory and honor, ⁄ the Church possesses Your Cross, ⁄ and the holy icons of the saints, Master, ⁄ and with joy and gladness she magnifies You!
ltx/en_us_oca/tr.d029:trMA.Ode9C13.incipit	Shine on those in authority…
ltx/en_us_oca/tr.d029:trMA.Ode9C13.melody	@ltx/en_us_oca/he.h.m4:heHE.LithosAcheirotmitos.notmetered
ltx/en_us_oca/tr.d029:trMA.Ode9C13.mode	@ltx/en_us_oca/miscellanea:misc.Mode4
ltx/en_us_oca/tr.d029:trMA.Ode9C13.ode	@ltx/en_us_oca/miscellanea:misc.Ode9
ltx/en_us_oca/tr.d029:trMA.Ode9C13.text	Shine on those in authority with Your divine glory, ⁄ compassionate Master, ⁄ and fence them around with the protection of the angelic hosts, ⁄ subjecting the proud powers of evil beneath their feet!
ltx/en_us_oca/tr.d029:trMA.Ode9C1T.incipit	Since you, pure Theotokos, ineffably…
ltx/en_us_oca/tr.d029:trMA.Ode9C1T.melody	@ltx/en_us_oca/he.h.m4:heHE.LithosAcheirotmitos.notmetered
ltx/en_us_oca/tr.d029:trMA.Ode9C1T.mode	@ltx/en_us_oca/miscellanea:misc.Mode4
ltx/en_us_oca/tr.d029:trMA.Ode9C1T.ode	@ltx/en_us_oca/miscellanea:misc.Ode9
ltx/en_us_oca/tr.d029:trMA.Ode9C1T.text	Since you, pure Theotokos, ineffably gave birth to the Master of all, ⁄ the condemnation of our first mother Eve has been abolished, ⁄ and now we kiss His likeness in icons!
ltx/en_us_oca/tr.d029:trMA.Oikos1.text	Enlightened by this mystery of God’s providence, the divinely-inspired prophets foretold it of old for our sakes, who now see the fulfillment of the ages. Receiving divine knowledge through this mystery, we know one Lord and God, glorified in three Persons, and Him alone we worship; we have one faith, one baptism, and we are clothed in Christ. ⁄⁄ We confess and proclaim our salvation in word and images!
ltx/en_us_oca/tr.d029:trMA.PostGospelBoth.incipit	@ltx/en_us_oca/tr.d001:trMA.PostGospelBoth.incipit
ltx/en_us_oca/tr.d029:trMA.PostGospelBoth.melody	
ltx/en_us_oca/tr.d029:trMA.PostGospelBoth.mode	@ltx/en_us_oca/miscellanea:misc.Mode8
ltx/en_us_oca/tr.d029:trMA.PostGospelBoth.text	@ltx/en_us_oca/tr.d001:trMA.PostGospelBoth.text
ltx/en_us_oca/tr.d029:trMA.PostGospelGlory.incipit	@ltx/en_us_oca/tr.d001:trMA.PostGospelGlory.incipit
ltx/en_us_oca/tr.d029:trMA.PostGospelGlory.melody	
ltx/en_us_oca/tr.d029:trMA.PostGospelGlory.mode	@ltx/en_us_oca/miscellanea:misc.Mode8
ltx/en_us_oca/tr.d029:trMA.PostGospelGlory.text	@ltx/en_us_oca/tr.d001:trMA.PostGospelGlory.text
ltx/en_us_oca/tr.d029:trMA.PostGospelIdiomelon.incipit	@ltx/en_us_oca/tr.d001:trMA.PostGospelIdiomelon.incipit
ltx/en_us_oca/tr.d029:trMA.PostGospelIdiomelon.melody	
ltx/en_us_oca/tr.d029:trMA.PostGospelIdiomelon.mode	@ltx/en_us_oca/miscellanea:misc.Mode6
ltx/en_us_oca/tr.d029:trMA.PostGospelIdiomelon.text	@ltx/en_us_oca/tr.d001:trMA.PostGospelIdiomelon.text
ltx/en_us_oca/tr.d029:trSV.AposGlory.incipit	…
ltx/en_us_oca/tr.d029:trSV.AposGlory.melody	@ltx/en_us_oca/he.a.m2:heAU.OikosTouEfratha.notmetered
ltx/en_us_oca/tr.d029:trSV.AposGlory.mode	@ltx/en_us_oca/miscellanea:misc.Mode2
ltx/en_us_oca/tr.d029:trSV.AposGlory.text	
ltx/en_us_oca/tr.d029:trSV.Aposticha1.incipit	…
ltx/en_us_oca/tr.d029:trSV.Aposticha1.melody	@ltx/en_us_oca/he.a.m2:heAU.OikosTouEfratha.notmetered
ltx/en_us_oca/tr.d029:trSV.Aposticha1.mode	@ltx/en_us_oca/miscellanea:misc.Mode2
ltx/en_us_oca/tr.d029:trSV.Aposticha1.text	
ltx/en_us_oca/tr.d029:trSV.Aposticha2.incipit	…
ltx/en_us_oca/tr.d029:trSV.Aposticha2.melody	@ltx/en_us_oca/he.a.m2:heAU.OikosTouEfratha.notmetered
ltx/en_us_oca/tr.d029:trSV.Aposticha2.mode	@ltx/en_us_oca/miscellanea:misc.Mode2
ltx/en_us_oca/tr.d029:trSV.Aposticha2.text	
ltx/en_us_oca/tr.d029:trSV.Aposticha3.incipit	…
ltx/en_us_oca/tr.d029:trSV.Aposticha3.melody	@ltx/en_us_oca/he.a.m2:heAU.OikosTouEfratha.notmetered
ltx/en_us_oca/tr.d029:trSV.Aposticha3.mode	@ltx/en_us_oca/miscellanea:misc.Mode2
ltx/en_us_oca/tr.d029:trSV.Aposticha3.text	
ltx/en_us_oca/tr.d029:trSV.SticGlory.incipit	…
ltx/en_us_oca/tr.d029:trSV.SticGlory.melody	@ltx/en_us_oca/he.a.m1:heAU.TonOuranionTagmaton.notmetered
ltx/en_us_oca/tr.d029:trSV.SticGlory.mode	@ltx/en_us_oca/miscellanea:misc.Mode1
ltx/en_us_oca/tr.d029:trSV.SticGlory.text	
ltx/en_us_oca/tr.d029:trSV.Stichera1.incipit	…
ltx/en_us_oca/tr.d029:trSV.Stichera1.melody	@ltx/en_us_oca/he.a.m1:heAU.TonOuranionTagmaton.notmetered
ltx/en_us_oca/tr.d029:trSV.Stichera1.mode	@ltx/en_us_oca/miscellanea:misc.Mode1
ltx/en_us_oca/tr.d029:trSV.Stichera1.text	
ltx/en_us_oca/tr.d029:trSV.Stichera2.incipit	…
ltx/en_us_oca/tr.d029:trSV.Stichera2.melody	@ltx/en_us_oca/he.a.m1:heAU.TonOuranionTagmaton.notmetered
ltx/en_us_oca/tr.d029:trSV.Stichera2.mode	@ltx/en_us_oca/miscellanea:misc.Mode1
ltx/en_us_oca/tr.d029:trSV.Stichera2.text	
ltx/en_us_oca/tr.d029:trSV.Stichera3.incipit	…
ltx/en_us_oca/tr.d029:trSV.Stichera3.melody	@ltx/en_us_oca/he.a.m1:heAU.TonOuranionTagmaton.notmetered
ltx/en_us_oca/tr.d029:trSV.Stichera3.mode	@ltx/en_us_oca/miscellanea:misc.Mode1
ltx/en_us_oca/tr.d029:trSV.Stichera3.text	
ltx/en_us_oca/tr.d029:trSV.Stichera4.incipit	…
ltx/en_us_oca/tr.d029:trSV.Stichera4.melody	@ltx/en_us_oca/he.a.m1:heAU.TonOuranionTagmaton.notmetered
ltx/en_us_oca/tr.d029:trSV.Stichera4.mode	@ltx/en_us_oca/miscellanea:misc.Mode1
ltx/en_us_oca/tr.d029:trSV.Stichera4.text	
ltx/en_us_oca/tr.d029:trSV.poet	@ltx/en_us_oca/poets:po.Nikolaou
ltx/en_us_oca/tr.d029:trSY.commemoration.couplet1.title	@ltx/en_us_oca/titles:ti.Verses
ltx/en_us_oca/tr.d029:trSY.commemoration.couplet1.verse1	
ltx/en_us_oca/tr.d029:trSY.commemoration.couplet1.verse2	
ltx/en_us_oca/tr.d029:trSY.commemoration.narration.p01	
ltx/en_us_oca/tr.d029:trSY.commemoration.narration.p02	
ltx/en_us_oca/tr.d029:trSY.commemoration.narration.p03	
ltx/en_us_oca/tr.d029:trSY.commemoration.narration.p04	
ltx/en_us_oca/tr.d029:trSY.commemoration.narration.p05	
ltx/en_us_oca/tr.d029:trSY.commemoration.narration.p06	
ltx/en_us_oca/tr.d029:trSY.commemoration.narration.p07	
ltx/en_us_oca/tr.d029:trSY.commemoration.text	
ltx/en_us_oca/tr.d029:trSY.lastline	
ltx/en_us_oca/tr.d029:trVE.ApolTheotokion.incipit	@ltx/en_us_oca/oc.m2.d1:ocVE.ApolTheotokionVM.incipit
ltx/en_us_oca/tr.d029:trVE.ApolTheotokion.melody	
ltx/en_us_oca/tr.d029:trVE.ApolTheotokion.mode	@ltx/en_us_oca/miscellanea:misc.Mode2
ltx/en_us_oca/tr.d029:trVE.ApolTheotokion.text	@ltx/en_us_oca/oc.m2.d1:ocVE.ApolTheotokionVM.text
ltx/en_us_oca/tr.d029:trVE.Apolytikion1.incipit	@ltx/en_us_oca/oc.m2.d4:ocMA.Kathisma21.incipit
ltx/en_us_oca/tr.d029:trVE.Apolytikion1.melody	
ltx/en_us_oca/tr.d029:trVE.Apolytikion1.mode	@ltx/en_us_oca/miscellanea:misc.Mode2
ltx/en_us_oca/tr.d029:trVE.Apolytikion1.text	@ltx/en_us_oca/oc.m2.d4:ocMA.Kathisma21.text
ltx/en_us_oca/tr.d029:trVE.AposGlory.incipit	…
ltx/en_us_oca/tr.d029:trVE.AposGlory.melody	@ltx/en_us_oca/miscellanea:misc.Idiomelon
ltx/en_us_oca/tr.d029:trVE.AposGlory.mode	@ltx/en_us_oca/miscellanea:misc.Mode2
ltx/en_us_oca/tr.d029:trVE.AposGlory.text	
ltx/en_us_oca/tr.d029:trVE.AposTheotokion.incipit	@ltx/en_us_oca/oc.m2.d1:ocVE.AposTheotokion.incipit
ltx/en_us_oca/tr.d029:trVE.AposTheotokion.melody	
ltx/en_us_oca/tr.d029:trVE.AposTheotokion.mode	@ltx/en_us_oca/miscellanea:misc.Mode2
ltx/en_us_oca/tr.d029:trVE.AposTheotokion.text	@ltx/en_us_oca/oc.m2.d1:ocVE.AposTheotokion.text
ltx/en_us_oca/tr.d029:trVE.LityBoth.incipit	@ltx/en_us_oca/ho.ho23:hoCA.Troparion7.incipit
ltx/en_us_oca/tr.d029:trVE.LityBoth.melody	
ltx/en_us_oca/tr.d029:trVE.LityBoth.mode	@ltx/en_us_oca/miscellanea:misc.Mode2
ltx/en_us_oca/tr.d029:trVE.LityBoth.text	@ltx/en_us_oca/ho.ho23:hoCA.Troparion7.text
ltx/en_us_oca/tr.d029:trVE.LityGlory.incipit	…
ltx/en_us_oca/tr.d029:trVE.LityGlory.melody	@ltx/en_us_oca/miscellanea:misc.Idiomelon
ltx/en_us_oca/tr.d029:trVE.LityGlory.mode	@ltx/en_us_oca/miscellanea:misc.Mode2
ltx/en_us_oca/tr.d029:trVE.LityGlory.text	
ltx/en_us_oca/tr.d029:trVE.SticGlory.incipit	…
ltx/en_us_oca/tr.d029:trVE.SticGlory.melody	@ltx/en_us_oca/miscellanea:misc.Idiomelon
ltx/en_us_oca/tr.d029:trVE.SticGlory.mode	@ltx/en_us_oca/miscellanea:misc.Mode2
ltx/en_us_oca/tr.d029:trVE.SticGlory.text	
ltx/en_us_oca/tr.d029:trVE.Stichera01.greekmelody	@ltx/en_us_oca/he.a.m6:heAU.OlinApothemenoi.greekname
ltx/en_us_oca/tr.d029:trVE.Stichera01.incipit	…
ltx/en_us_oca/tr.d029:trVE.Stichera01.melody	@ltx/en_us_oca/he.a.m6:heAU.OlinApothemenoi.notmetered
ltx/en_us_oca/tr.d029:trVE.Stichera01.mode	@ltx/en_us_oca/miscellanea:misc.Mode6
ltx/en_us_oca/tr.d029:trVE.Stichera01.text	
ltx/en_us_oca/tr.d029:trVE.Stichera02.greekmelody	@ltx/en_us_oca/he.a.m6:heAU.OlinApothemenoi.greekname
ltx/en_us_oca/tr.d029:trVE.Stichera02.incipit	…
ltx/en_us_oca/tr.d029:trVE.Stichera02.melody	@ltx/en_us_oca/he.a.m6:heAU.OlinApothemenoi.notmetered
ltx/en_us_oca/tr.d029:trVE.Stichera02.mode	@ltx/en_us_oca/miscellanea:misc.Mode6
ltx/en_us_oca/tr.d029:trVE.Stichera02.text	
ltx/en_us_oca/tr.d029:trVE.Stichera03.greekmelody	@ltx/en_us_oca/he.a.m6:heAU.OlinApothemenoi.greekname
ltx/en_us_oca/tr.d029:trVE.Stichera03.incipit	…
ltx/en_us_oca/tr.d029:trVE.Stichera03.melody	@ltx/en_us_oca/he.a.m6:heAU.OlinApothemenoi.notmetered
ltx/en_us_oca/tr.d029:trVE.Stichera03.mode	@ltx/en_us_oca/miscellanea:misc.Mode6
ltx/en_us_oca/tr.d029:trVE.Stichera03.text	
ltx/en_us_oca/tr.d029:trVE.Stichera04.greekmelody	@ltx/en_us_oca/he.a.m6:heAU.OlinApothemenoi.greekname
ltx/en_us_oca/tr.d029:trVE.Stichera04.incipit	…
ltx/en_us_oca/tr.d029:trVE.Stichera04.melody	@ltx/en_us_oca/he.a.m6:heAU.OlinApothemenoi.notmetered
ltx/en_us_oca/tr.d029:trVE.Stichera04.mode	@ltx/en_us_oca/miscellanea:misc.Mode6
ltx/en_us_oca/tr.d029:trVE.Stichera04.text	
