ltx/en_us_oca/me.m07.d07:meDA.commemoration.first	
ltx/en_us_oca/me.m07.d07:meDA.commemoration.first_name	
ltx/en_us_oca/me.m07.d07:meDA.commemoration.first_short	
ltx/en_us_oca/me.m07.d07:meDA.commemoration.first_title	
ltx/en_us_oca/me.m07.d07:meDA.commemoration.full	
ltx/en_us_oca/me.m07.d07:meDA.commemoration.second_name	
ltx/en_us_oca/me.m07.d07:meDA.commemoration.second_title	
ltx/en_us_oca/me.m07.d07:meDA.date	
ltx/en_us_oca/me.m07.d07:meDA.fordate	
ltx/en_us_oca/me.m07.d07:meDA.insert1	
ltx/en_us_oca/me.m07.d07:meDA.insert2	
ltx/en_us_oca/me.m07.d07:meDA.note	
ltx/en_us_oca/me.m07.d07:meDA.pdfcoverdate	
ltx/en_us_oca/me.m07.d07:meDA.pdfheaderdate	
ltx/en_us_oca/me.m07.d07:meHO.commemorations	
ltx/en_us_oca/me.m07.d07:meHO.note1	
ltx/en_us_oca/me.m07.d07:meHO.note2	
ltx/en_us_oca/me.m07.d07:meHO.number	
ltx/en_us_oca/me.m07.d07:meHO.rank	
ltx/en_us_oca/me.m07.d07:meLE.commemoration1	
ltx/en_us_oca/me.m07.d07:meLE.commemoration2	
ltx/en_us_oca/me.m07.d07:meLI.Kontakion1.greekmelody	@ltx/en_us_oca/me.m07.d07:meMA.Kontakion1.greekmelody
ltx/en_us_oca/me.m07.d07:meLI.Kontakion1.incipit	@ltx/en_us_oca/me.m07.d07:meMA.Kontakion1.incipit
ltx/en_us_oca/me.m07.d07:meLI.Kontakion1.melody	@ltx/en_us_oca/me.m07.d07:meMA.Kontakion1.melody
ltx/en_us_oca/me.m07.d07:meLI.Kontakion1.mode	@ltx/en_us_oca/me.m07.d07:meMA.Kontakion1.mode
ltx/en_us_oca/me.m07.d07:meLI.Kontakion1.text	@ltx/en_us_oca/me.m07.d07:meMA.Kontakion1.text
ltx/en_us_oca/me.m07.d07:meLI.Megalynarion.text	
ltx/en_us_oca/me.m07.d07:meMA.C1.title	@ltx/en_us_oca/titles:ti.CanonSaintM
ltx/en_us_oca/me.m07.d07:meMA.C1.verse	@ltx/en_us_oca/prayers:pr.verse_SaintM.text
ltx/en_us_oca/me.m07.d07:meMA.C2.acrostic.notice1	
ltx/en_us_oca/me.m07.d07:meMA.C2.acrostic.text	
ltx/en_us_oca/me.m07.d07:meMA.C2.acrostic.title	
ltx/en_us_oca/me.m07.d07:meMA.C2.title	@ltx/en_us_oca/titles:ti.CanonSaintW
ltx/en_us_oca/me.m07.d07:meMA.C2.verse	@ltx/en_us_oca/prayers:pr.verse_SaintW.text
ltx/en_us_oca/me.m07.d07:meMA.ExapTheotokion.incipit	…
ltx/en_us_oca/me.m07.d07:meMA.ExapTheotokion.melody	@ltx/en_us_oca/he.a.m3:heAU.OOuranonToisAstrois.notmetered
ltx/en_us_oca/me.m07.d07:meMA.ExapTheotokion.mode	@ltx/en_us_oca/miscellanea:misc.Mode3
ltx/en_us_oca/me.m07.d07:meMA.ExapTheotokion.text	
ltx/en_us_oca/me.m07.d07:meMA.Exaposteilarion1.greekmelody	@ltx/en_us_oca/he.a.m3:heAU.OOuranonToisAstrois.greekname
ltx/en_us_oca/me.m07.d07:meMA.Exaposteilarion1.incipit	…
ltx/en_us_oca/me.m07.d07:meMA.Exaposteilarion1.melody	@ltx/en_us_oca/he.a.m3:heAU.OOuranonToisAstrois.notmetered
ltx/en_us_oca/me.m07.d07:meMA.Exaposteilarion1.mode	@ltx/en_us_oca/miscellanea:misc.Mode3
ltx/en_us_oca/me.m07.d07:meMA.Exaposteilarion1.text	
ltx/en_us_oca/me.m07.d07:meMA.Kathisma1.notice	
ltx/en_us_oca/me.m07.d07:meMA.Kathisma11.incipit	…
ltx/en_us_oca/me.m07.d07:meMA.Kathisma11.melody	
ltx/en_us_oca/me.m07.d07:meMA.Kathisma11.mode	@ltx/en_us_oca/miscellanea:misc.Mode4
ltx/en_us_oca/me.m07.d07:meMA.Kathisma11.text	
ltx/en_us_oca/me.m07.d07:meMA.Kathisma1T.incipit	…
ltx/en_us_oca/me.m07.d07:meMA.Kathisma1T.melody	
ltx/en_us_oca/me.m07.d07:meMA.Kathisma1T.mode	@ltx/en_us_oca/miscellanea:misc.Mode4
ltx/en_us_oca/me.m07.d07:meMA.Kathisma1T.text	
ltx/en_us_oca/me.m07.d07:meMA.Kathisma2.notice	
ltx/en_us_oca/me.m07.d07:meMA.Kathisma21.incipit	…
ltx/en_us_oca/me.m07.d07:meMA.Kathisma21.melody	
ltx/en_us_oca/me.m07.d07:meMA.Kathisma21.mode	@ltx/en_us_oca/miscellanea:misc.Mode1
ltx/en_us_oca/me.m07.d07:meMA.Kathisma21.text	
ltx/en_us_oca/me.m07.d07:meMA.Kathisma2T.incipit	…
ltx/en_us_oca/me.m07.d07:meMA.Kathisma2T.melody	
ltx/en_us_oca/me.m07.d07:meMA.Kathisma2T.mode	@ltx/en_us_oca/miscellanea:misc.Mode1
ltx/en_us_oca/me.m07.d07:meMA.Kathisma2T.text	
ltx/en_us_oca/me.m07.d07:meMA.Kontakion1.greekmelody	@ltx/en_us_oca/he.a.m2:heAU.TaAnoZiton.greekname
ltx/en_us_oca/me.m07.d07:meMA.Kontakion1.incipit	…
ltx/en_us_oca/me.m07.d07:meMA.Kontakion1.melody	@ltx/en_us_oca/he.a.m2:heAU.TaAnoZiton.notmetered
ltx/en_us_oca/me.m07.d07:meMA.Kontakion1.mode	@ltx/en_us_oca/miscellanea:misc.Mode2
ltx/en_us_oca/me.m07.d07:meMA.Kontakion1.text	
ltx/en_us_oca/me.m07.d07:meMA.Lauds.notice	The Stichera of Lauds were taken from July 26 and modified.
ltx/en_us_oca/me.m07.d07:meMA.Lauds1.greekmelody	@ltx/en_us_oca/he.a.m1:heAU.TonOuranionTagmaton.greekname
ltx/en_us_oca/me.m07.d07:meMA.Lauds1.incipit	…
ltx/en_us_oca/me.m07.d07:meMA.Lauds1.melody	@ltx/en_us_oca/he.a.m1:heAU.TonOuranionTagmaton.notmetered
ltx/en_us_oca/me.m07.d07:meMA.Lauds1.mode	@ltx/en_us_oca/miscellanea:misc.Mode1
ltx/en_us_oca/me.m07.d07:meMA.Lauds1.text	
ltx/en_us_oca/me.m07.d07:meMA.Lauds2.incipit	@ltx/en_us_oca/me.m07.d26:meMA.Lauds2.incipit
ltx/en_us_oca/me.m07.d07:meMA.Lauds2.melody	@ltx/en_us_oca/he.a.m1:heAU.TonOuranionTagmaton.notmetered
ltx/en_us_oca/me.m07.d07:meMA.Lauds2.mode	@ltx/en_us_oca/miscellanea:misc.Mode1
ltx/en_us_oca/me.m07.d07:meMA.Lauds2.text	@ltx/en_us_oca/me.m07.d26:meMA.Lauds2.text
ltx/en_us_oca/me.m07.d07:meMA.Lauds3.incipit	@ltx/en_us_oca/me.m07.d26:meMA.Lauds3.incipit
ltx/en_us_oca/me.m07.d07:meMA.Lauds3.melody	@ltx/en_us_oca/he.a.m1:heAU.TonOuranionTagmaton.notmetered
ltx/en_us_oca/me.m07.d07:meMA.Lauds3.mode	@ltx/en_us_oca/miscellanea:misc.Mode1
ltx/en_us_oca/me.m07.d07:meMA.Lauds3.text	@ltx/en_us_oca/me.m07.d26:meMA.Lauds3.text
ltx/en_us_oca/me.m07.d07:meMA.MM.Lauds1123as5678.text	@ltx/en_us_oca/properties:media.key
ltx/en_us_oca/me.m07.d07:meMA.Ode1C11.greekmelody	@ltx/en_us_oca/he.h.m2:heHE.DefteLaoi.greekname
ltx/en_us_oca/me.m07.d07:meMA.Ode1C11.incipit	…
ltx/en_us_oca/me.m07.d07:meMA.Ode1C11.melody	@ltx/en_us_oca/he.h.m2:heHE.DefteLaoi.notmetered
ltx/en_us_oca/me.m07.d07:meMA.Ode1C11.mode	@ltx/en_us_oca/miscellanea:misc.Mode2
ltx/en_us_oca/me.m07.d07:meMA.Ode1C11.ode	@ltx/en_us_oca/miscellanea:misc.Ode1
ltx/en_us_oca/me.m07.d07:meMA.Ode1C11.text	
ltx/en_us_oca/me.m07.d07:meMA.Ode1C12.incipit	…
ltx/en_us_oca/me.m07.d07:meMA.Ode1C12.melody	@ltx/en_us_oca/he.h.m2:heHE.DefteLaoi.notmetered
ltx/en_us_oca/me.m07.d07:meMA.Ode1C12.mode	@ltx/en_us_oca/miscellanea:misc.Mode2
ltx/en_us_oca/me.m07.d07:meMA.Ode1C12.ode	@ltx/en_us_oca/miscellanea:misc.Ode1
ltx/en_us_oca/me.m07.d07:meMA.Ode1C12.text	
ltx/en_us_oca/me.m07.d07:meMA.Ode1C13.incipit	…
ltx/en_us_oca/me.m07.d07:meMA.Ode1C13.melody	@ltx/en_us_oca/he.h.m2:heHE.DefteLaoi.notmetered
ltx/en_us_oca/me.m07.d07:meMA.Ode1C13.mode	@ltx/en_us_oca/miscellanea:misc.Mode2
ltx/en_us_oca/me.m07.d07:meMA.Ode1C13.ode	@ltx/en_us_oca/miscellanea:misc.Ode1
ltx/en_us_oca/me.m07.d07:meMA.Ode1C13.text	
ltx/en_us_oca/me.m07.d07:meMA.Ode1C1T.incipit	…
ltx/en_us_oca/me.m07.d07:meMA.Ode1C1T.melody	@ltx/en_us_oca/he.h.m2:heHE.DefteLaoi.notmetered
ltx/en_us_oca/me.m07.d07:meMA.Ode1C1T.mode	@ltx/en_us_oca/miscellanea:misc.Mode2
ltx/en_us_oca/me.m07.d07:meMA.Ode1C1T.ode	@ltx/en_us_oca/miscellanea:misc.Ode1
ltx/en_us_oca/me.m07.d07:meMA.Ode1C1T.text	
ltx/en_us_oca/me.m07.d07:meMA.Ode1C21.greekmelody	@ltx/en_us_oca/he.h.m2:heHE.DefteLaoi.greekname
ltx/en_us_oca/me.m07.d07:meMA.Ode1C21.incipit	…
ltx/en_us_oca/me.m07.d07:meMA.Ode1C21.melody	@ltx/en_us_oca/he.h.m2:heHE.DefteLaoi.notmetered
ltx/en_us_oca/me.m07.d07:meMA.Ode1C21.mode	@ltx/en_us_oca/miscellanea:misc.Mode2
ltx/en_us_oca/me.m07.d07:meMA.Ode1C21.ode	@ltx/en_us_oca/miscellanea:misc.Ode1
ltx/en_us_oca/me.m07.d07:meMA.Ode1C21.text	
ltx/en_us_oca/me.m07.d07:meMA.Ode1C22.incipit	…
ltx/en_us_oca/me.m07.d07:meMA.Ode1C22.melody	@ltx/en_us_oca/he.h.m2:heHE.DefteLaoi.notmetered
ltx/en_us_oca/me.m07.d07:meMA.Ode1C22.mode	@ltx/en_us_oca/miscellanea:misc.Mode2
ltx/en_us_oca/me.m07.d07:meMA.Ode1C22.ode	@ltx/en_us_oca/miscellanea:misc.Ode1
ltx/en_us_oca/me.m07.d07:meMA.Ode1C22.text	
ltx/en_us_oca/me.m07.d07:meMA.Ode1C23.incipit	…
ltx/en_us_oca/me.m07.d07:meMA.Ode1C23.melody	@ltx/en_us_oca/he.h.m2:heHE.DefteLaoi.notmetered
ltx/en_us_oca/me.m07.d07:meMA.Ode1C23.mode	@ltx/en_us_oca/miscellanea:misc.Mode2
ltx/en_us_oca/me.m07.d07:meMA.Ode1C23.ode	@ltx/en_us_oca/miscellanea:misc.Ode1
ltx/en_us_oca/me.m07.d07:meMA.Ode1C23.text	
ltx/en_us_oca/me.m07.d07:meMA.Ode1C2T.incipit	…
ltx/en_us_oca/me.m07.d07:meMA.Ode1C2T.melody	@ltx/en_us_oca/he.h.m2:heHE.DefteLaoi.notmetered
ltx/en_us_oca/me.m07.d07:meMA.Ode1C2T.mode	@ltx/en_us_oca/miscellanea:misc.Mode2
ltx/en_us_oca/me.m07.d07:meMA.Ode1C2T.ode	@ltx/en_us_oca/miscellanea:misc.Ode1
ltx/en_us_oca/me.m07.d07:meMA.Ode1C2T.text	
ltx/en_us_oca/me.m07.d07:meMA.Ode3C11.greekmelody	@ltx/en_us_oca/he.h.m2:heHE.StereosonImasEnSoiKyrie.greekname
ltx/en_us_oca/me.m07.d07:meMA.Ode3C11.incipit	…
ltx/en_us_oca/me.m07.d07:meMA.Ode3C11.melody	@ltx/en_us_oca/he.h.m2:heHE.StereosonImasEnSoiKyrie.notmetered
ltx/en_us_oca/me.m07.d07:meMA.Ode3C11.mode	@ltx/en_us_oca/miscellanea:misc.Mode2
ltx/en_us_oca/me.m07.d07:meMA.Ode3C11.ode	@ltx/en_us_oca/miscellanea:misc.Ode3
ltx/en_us_oca/me.m07.d07:meMA.Ode3C11.text	
ltx/en_us_oca/me.m07.d07:meMA.Ode3C12.incipit	…
ltx/en_us_oca/me.m07.d07:meMA.Ode3C12.melody	@ltx/en_us_oca/he.h.m2:heHE.StereosonImasEnSoiKyrie.notmetered
ltx/en_us_oca/me.m07.d07:meMA.Ode3C12.mode	@ltx/en_us_oca/miscellanea:misc.Mode2
ltx/en_us_oca/me.m07.d07:meMA.Ode3C12.ode	@ltx/en_us_oca/miscellanea:misc.Ode3
ltx/en_us_oca/me.m07.d07:meMA.Ode3C12.text	
ltx/en_us_oca/me.m07.d07:meMA.Ode3C1T.incipit	…
ltx/en_us_oca/me.m07.d07:meMA.Ode3C1T.melody	@ltx/en_us_oca/he.h.m2:heHE.StereosonImasEnSoiKyrie.notmetered
ltx/en_us_oca/me.m07.d07:meMA.Ode3C1T.mode	@ltx/en_us_oca/miscellanea:misc.Mode2
ltx/en_us_oca/me.m07.d07:meMA.Ode3C1T.ode	@ltx/en_us_oca/miscellanea:misc.Ode3
ltx/en_us_oca/me.m07.d07:meMA.Ode3C1T.text	
ltx/en_us_oca/me.m07.d07:meMA.Ode3C21.greekmelody	@ltx/en_us_oca/he.h.m2:heHE.StereosonImasEnSoiKyrie.greekname
ltx/en_us_oca/me.m07.d07:meMA.Ode3C21.incipit	…
ltx/en_us_oca/me.m07.d07:meMA.Ode3C21.melody	@ltx/en_us_oca/he.h.m2:heHE.StereosonImasEnSoiKyrie.notmetered
ltx/en_us_oca/me.m07.d07:meMA.Ode3C21.mode	@ltx/en_us_oca/miscellanea:misc.Mode2
ltx/en_us_oca/me.m07.d07:meMA.Ode3C21.ode	@ltx/en_us_oca/miscellanea:misc.Ode3
ltx/en_us_oca/me.m07.d07:meMA.Ode3C21.text	
ltx/en_us_oca/me.m07.d07:meMA.Ode3C22.incipit	…
ltx/en_us_oca/me.m07.d07:meMA.Ode3C22.melody	@ltx/en_us_oca/he.h.m2:heHE.StereosonImasEnSoiKyrie.notmetered
ltx/en_us_oca/me.m07.d07:meMA.Ode3C22.mode	@ltx/en_us_oca/miscellanea:misc.Mode2
ltx/en_us_oca/me.m07.d07:meMA.Ode3C22.ode	@ltx/en_us_oca/miscellanea:misc.Ode3
ltx/en_us_oca/me.m07.d07:meMA.Ode3C22.text	
ltx/en_us_oca/me.m07.d07:meMA.Ode3C23.incipit	…
ltx/en_us_oca/me.m07.d07:meMA.Ode3C23.melody	@ltx/en_us_oca/he.h.m2:heHE.StereosonImasEnSoiKyrie.notmetered
ltx/en_us_oca/me.m07.d07:meMA.Ode3C23.mode	@ltx/en_us_oca/miscellanea:misc.Mode2
ltx/en_us_oca/me.m07.d07:meMA.Ode3C23.ode	@ltx/en_us_oca/miscellanea:misc.Ode3
ltx/en_us_oca/me.m07.d07:meMA.Ode3C23.text	
ltx/en_us_oca/me.m07.d07:meMA.Ode3C2T.incipit	…
ltx/en_us_oca/me.m07.d07:meMA.Ode3C2T.melody	@ltx/en_us_oca/he.h.m2:heHE.StereosonImasEnSoiKyrie.notmetered
ltx/en_us_oca/me.m07.d07:meMA.Ode3C2T.mode	@ltx/en_us_oca/miscellanea:misc.Mode2
ltx/en_us_oca/me.m07.d07:meMA.Ode3C2T.ode	@ltx/en_us_oca/miscellanea:misc.Ode3
ltx/en_us_oca/me.m07.d07:meMA.Ode3C2T.text	
ltx/en_us_oca/me.m07.d07:meMA.Ode3H.greekmelody	@ltx/en_us_oca/he.h.m2:heHE.StereosonImasEnSoiKyrie.greekname
ltx/en_us_oca/me.m07.d07:meMA.Ode3H.incipit	@ltx/en_us_oca/he.h.m2:heHE.StereosonImasEnSoiKyrie.incipit
ltx/en_us_oca/me.m07.d07:meMA.Ode3H.melody	@ltx/en_us_oca/he.h.m2:heHE.StereosonImasEnSoiKyrie.melody
ltx/en_us_oca/me.m07.d07:meMA.Ode3H.mode	@ltx/en_us_oca/miscellanea:misc.Mode2
ltx/en_us_oca/me.m07.d07:meMA.Ode3H.ode	@ltx/en_us_oca/miscellanea:misc.Ode3
ltx/en_us_oca/me.m07.d07:meMA.Ode3H.text	@ltx/en_us_oca/he.h.m2:heHE.StereosonImasEnSoiKyrie.text
ltx/en_us_oca/me.m07.d07:meMA.Ode3Kathisma1.greekmelody	@ltx/en_us_oca/he.a.m4:heAU.EpefanisSimeron.greekname
ltx/en_us_oca/me.m07.d07:meMA.Ode3Kathisma1.incipit	…
ltx/en_us_oca/me.m07.d07:meMA.Ode3Kathisma1.melody	@ltx/en_us_oca/he.a.m4:heAU.EpefanisSimeron.notmetered
ltx/en_us_oca/me.m07.d07:meMA.Ode3Kathisma1.mode	@ltx/en_us_oca/miscellanea:misc.Mode4
ltx/en_us_oca/me.m07.d07:meMA.Ode3Kathisma1.text	
ltx/en_us_oca/me.m07.d07:meMA.Ode3Kathisma2.greekmelody	@ltx/en_us_oca/he.a.m4:heAU.TachyProkatalave.greekname
ltx/en_us_oca/me.m07.d07:meMA.Ode3Kathisma2.incipit	…
ltx/en_us_oca/me.m07.d07:meMA.Ode3Kathisma2.melody	@ltx/en_us_oca/he.a.m4:heAU.TachyProkatalave.notmetered
ltx/en_us_oca/me.m07.d07:meMA.Ode3Kathisma2.mode	@ltx/en_us_oca/miscellanea:misc.Mode4
ltx/en_us_oca/me.m07.d07:meMA.Ode3Kathisma2.text	
ltx/en_us_oca/me.m07.d07:meMA.Ode3KathismaSt.incipit	@ltx/en_us_oca/oc.m4.d6:ocMA.Kathisma33.incipit
ltx/en_us_oca/me.m07.d07:meMA.Ode3KathismaSt.melody	@ltx/en_us_oca/he.a.m4:heAU.TachyProkatalave.notmetered
ltx/en_us_oca/me.m07.d07:meMA.Ode3KathismaSt.mode	@ltx/en_us_oca/miscellanea:misc.Mode4
ltx/en_us_oca/me.m07.d07:meMA.Ode3KathismaSt.text	@ltx/en_us_oca/oc.m4.d6:ocMA.Kathisma33.text
ltx/en_us_oca/me.m07.d07:meMA.Ode3KathismaT.incipit	…
ltx/en_us_oca/me.m07.d07:meMA.Ode3KathismaT.melody	@ltx/en_us_oca/he.a.m4:heAU.TachyProkatalave.notmetered
ltx/en_us_oca/me.m07.d07:meMA.Ode3KathismaT.mode	@ltx/en_us_oca/miscellanea:misc.Mode4
ltx/en_us_oca/me.m07.d07:meMA.Ode3KathismaT.text	
ltx/en_us_oca/me.m07.d07:meMA.Ode4C11.greekmelody	@ltx/en_us_oca/he.h.m2:heHE.EisakikoaKyrieTinAkoin.greekname
ltx/en_us_oca/me.m07.d07:meMA.Ode4C11.incipit	…
ltx/en_us_oca/me.m07.d07:meMA.Ode4C11.melody	@ltx/en_us_oca/he.h.m2:heHE.EisakikoaKyrieTinAkoin.notmetered
ltx/en_us_oca/me.m07.d07:meMA.Ode4C11.mode	@ltx/en_us_oca/miscellanea:misc.Mode2
ltx/en_us_oca/me.m07.d07:meMA.Ode4C11.ode	@ltx/en_us_oca/miscellanea:misc.Ode4
ltx/en_us_oca/me.m07.d07:meMA.Ode4C11.text	
ltx/en_us_oca/me.m07.d07:meMA.Ode4C12.incipit	…
ltx/en_us_oca/me.m07.d07:meMA.Ode4C12.melody	@ltx/en_us_oca/he.h.m2:heHE.EisakikoaKyrieTinAkoin.notmetered
ltx/en_us_oca/me.m07.d07:meMA.Ode4C12.mode	@ltx/en_us_oca/miscellanea:misc.Mode2
ltx/en_us_oca/me.m07.d07:meMA.Ode4C12.ode	@ltx/en_us_oca/miscellanea:misc.Ode4
ltx/en_us_oca/me.m07.d07:meMA.Ode4C12.text	
ltx/en_us_oca/me.m07.d07:meMA.Ode4C13.incipit	…
ltx/en_us_oca/me.m07.d07:meMA.Ode4C13.melody	@ltx/en_us_oca/he.h.m2:heHE.EisakikoaKyrieTinAkoin.notmetered
ltx/en_us_oca/me.m07.d07:meMA.Ode4C13.mode	@ltx/en_us_oca/miscellanea:misc.Mode2
ltx/en_us_oca/me.m07.d07:meMA.Ode4C13.ode	@ltx/en_us_oca/miscellanea:misc.Ode4
ltx/en_us_oca/me.m07.d07:meMA.Ode4C13.text	
ltx/en_us_oca/me.m07.d07:meMA.Ode4C1T.incipit	…
ltx/en_us_oca/me.m07.d07:meMA.Ode4C1T.melody	@ltx/en_us_oca/he.h.m2:heHE.EisakikoaKyrieTinAkoin.notmetered
ltx/en_us_oca/me.m07.d07:meMA.Ode4C1T.mode	@ltx/en_us_oca/miscellanea:misc.Mode2
ltx/en_us_oca/me.m07.d07:meMA.Ode4C1T.ode	@ltx/en_us_oca/miscellanea:misc.Ode4
ltx/en_us_oca/me.m07.d07:meMA.Ode4C1T.text	
ltx/en_us_oca/me.m07.d07:meMA.Ode4C21.greekmelody	@ltx/en_us_oca/he.h.m2:heHE.EisakikoaKyrieTinAkoin.greekname
ltx/en_us_oca/me.m07.d07:meMA.Ode4C21.incipit	…
ltx/en_us_oca/me.m07.d07:meMA.Ode4C21.melody	@ltx/en_us_oca/he.h.m2:heHE.EisakikoaKyrieTinAkoin.notmetered
ltx/en_us_oca/me.m07.d07:meMA.Ode4C21.mode	@ltx/en_us_oca/miscellanea:misc.Mode2
ltx/en_us_oca/me.m07.d07:meMA.Ode4C21.ode	@ltx/en_us_oca/miscellanea:misc.Ode4
ltx/en_us_oca/me.m07.d07:meMA.Ode4C21.text	
ltx/en_us_oca/me.m07.d07:meMA.Ode4C22.incipit	…
ltx/en_us_oca/me.m07.d07:meMA.Ode4C22.melody	@ltx/en_us_oca/he.h.m2:heHE.EisakikoaKyrieTinAkoin.notmetered
ltx/en_us_oca/me.m07.d07:meMA.Ode4C22.mode	@ltx/en_us_oca/miscellanea:misc.Mode2
ltx/en_us_oca/me.m07.d07:meMA.Ode4C22.ode	@ltx/en_us_oca/miscellanea:misc.Ode4
ltx/en_us_oca/me.m07.d07:meMA.Ode4C22.text	
ltx/en_us_oca/me.m07.d07:meMA.Ode4C23.incipit	…
ltx/en_us_oca/me.m07.d07:meMA.Ode4C23.melody	@ltx/en_us_oca/he.h.m2:heHE.EisakikoaKyrieTinAkoin.notmetered
ltx/en_us_oca/me.m07.d07:meMA.Ode4C23.mode	@ltx/en_us_oca/miscellanea:misc.Mode2
ltx/en_us_oca/me.m07.d07:meMA.Ode4C23.ode	@ltx/en_us_oca/miscellanea:misc.Ode4
ltx/en_us_oca/me.m07.d07:meMA.Ode4C23.text	
ltx/en_us_oca/me.m07.d07:meMA.Ode4C2T.incipit	…
ltx/en_us_oca/me.m07.d07:meMA.Ode4C2T.melody	@ltx/en_us_oca/he.h.m2:heHE.EisakikoaKyrieTinAkoin.notmetered
ltx/en_us_oca/me.m07.d07:meMA.Ode4C2T.mode	@ltx/en_us_oca/miscellanea:misc.Mode2
ltx/en_us_oca/me.m07.d07:meMA.Ode4C2T.ode	@ltx/en_us_oca/miscellanea:misc.Ode4
ltx/en_us_oca/me.m07.d07:meMA.Ode4C2T.text	
ltx/en_us_oca/me.m07.d07:meMA.Ode5C11.greekmelody	@ltx/en_us_oca/he.h.m2:heHE.OTouFotosChorigos.greekname
ltx/en_us_oca/me.m07.d07:meMA.Ode5C11.incipit	…
ltx/en_us_oca/me.m07.d07:meMA.Ode5C11.melody	@ltx/en_us_oca/he.h.m2:heHE.OTouFotosChorigos.notmetered
ltx/en_us_oca/me.m07.d07:meMA.Ode5C11.mode	@ltx/en_us_oca/miscellanea:misc.Mode2
ltx/en_us_oca/me.m07.d07:meMA.Ode5C11.ode	@ltx/en_us_oca/miscellanea:misc.Ode5
ltx/en_us_oca/me.m07.d07:meMA.Ode5C11.text	
ltx/en_us_oca/me.m07.d07:meMA.Ode5C12.incipit	…
ltx/en_us_oca/me.m07.d07:meMA.Ode5C12.melody	@ltx/en_us_oca/he.h.m2:heHE.OTouFotosChorigos.notmetered
ltx/en_us_oca/me.m07.d07:meMA.Ode5C12.mode	@ltx/en_us_oca/miscellanea:misc.Mode2
ltx/en_us_oca/me.m07.d07:meMA.Ode5C12.ode	@ltx/en_us_oca/miscellanea:misc.Ode5
ltx/en_us_oca/me.m07.d07:meMA.Ode5C12.text	
ltx/en_us_oca/me.m07.d07:meMA.Ode5C1T.incipit	…
ltx/en_us_oca/me.m07.d07:meMA.Ode5C1T.melody	@ltx/en_us_oca/he.h.m2:heHE.OTouFotosChorigos.notmetered
ltx/en_us_oca/me.m07.d07:meMA.Ode5C1T.mode	@ltx/en_us_oca/miscellanea:misc.Mode2
ltx/en_us_oca/me.m07.d07:meMA.Ode5C1T.ode	@ltx/en_us_oca/miscellanea:misc.Ode5
ltx/en_us_oca/me.m07.d07:meMA.Ode5C1T.text	
ltx/en_us_oca/me.m07.d07:meMA.Ode5C21.greekmelody	@ltx/en_us_oca/he.h.m2:heHE.OTouFotosChorigos.greekname
ltx/en_us_oca/me.m07.d07:meMA.Ode5C21.incipit	…
ltx/en_us_oca/me.m07.d07:meMA.Ode5C21.melody	@ltx/en_us_oca/he.h.m2:heHE.OTouFotosChorigos.notmetered
ltx/en_us_oca/me.m07.d07:meMA.Ode5C21.mode	@ltx/en_us_oca/miscellanea:misc.Mode2
ltx/en_us_oca/me.m07.d07:meMA.Ode5C21.ode	@ltx/en_us_oca/miscellanea:misc.Ode5
ltx/en_us_oca/me.m07.d07:meMA.Ode5C21.text	
ltx/en_us_oca/me.m07.d07:meMA.Ode5C22.incipit	…
ltx/en_us_oca/me.m07.d07:meMA.Ode5C22.melody	@ltx/en_us_oca/he.h.m2:heHE.OTouFotosChorigos.notmetered
ltx/en_us_oca/me.m07.d07:meMA.Ode5C22.mode	@ltx/en_us_oca/miscellanea:misc.Mode2
ltx/en_us_oca/me.m07.d07:meMA.Ode5C22.ode	@ltx/en_us_oca/miscellanea:misc.Ode5
ltx/en_us_oca/me.m07.d07:meMA.Ode5C22.text	
ltx/en_us_oca/me.m07.d07:meMA.Ode5C23.incipit	…
ltx/en_us_oca/me.m07.d07:meMA.Ode5C23.melody	@ltx/en_us_oca/he.h.m2:heHE.OTouFotosChorigos.notmetered
ltx/en_us_oca/me.m07.d07:meMA.Ode5C23.mode	@ltx/en_us_oca/miscellanea:misc.Mode2
ltx/en_us_oca/me.m07.d07:meMA.Ode5C23.ode	@ltx/en_us_oca/miscellanea:misc.Ode5
ltx/en_us_oca/me.m07.d07:meMA.Ode5C23.text	
ltx/en_us_oca/me.m07.d07:meMA.Ode5C2T.incipit	…
ltx/en_us_oca/me.m07.d07:meMA.Ode5C2T.melody	@ltx/en_us_oca/he.h.m2:heHE.OTouFotosChorigos.notmetered
ltx/en_us_oca/me.m07.d07:meMA.Ode5C2T.mode	@ltx/en_us_oca/miscellanea:misc.Mode2
ltx/en_us_oca/me.m07.d07:meMA.Ode5C2T.ode	@ltx/en_us_oca/miscellanea:misc.Ode5
ltx/en_us_oca/me.m07.d07:meMA.Ode5C2T.text	
ltx/en_us_oca/me.m07.d07:meMA.Ode6C11.greekmelody	@ltx/en_us_oca/he.h.m2:heHE.EnAvyssoPtaismaton.greekname
ltx/en_us_oca/me.m07.d07:meMA.Ode6C11.incipit	…
ltx/en_us_oca/me.m07.d07:meMA.Ode6C11.melody	@ltx/en_us_oca/he.h.m2:heHE.EnAvyssoPtaismaton.notmetered
ltx/en_us_oca/me.m07.d07:meMA.Ode6C11.mode	@ltx/en_us_oca/miscellanea:misc.Mode2
ltx/en_us_oca/me.m07.d07:meMA.Ode6C11.ode	@ltx/en_us_oca/miscellanea:misc.Ode6
ltx/en_us_oca/me.m07.d07:meMA.Ode6C11.text	
ltx/en_us_oca/me.m07.d07:meMA.Ode6C12.incipit	…
ltx/en_us_oca/me.m07.d07:meMA.Ode6C12.melody	@ltx/en_us_oca/he.h.m2:heHE.EnAvyssoPtaismaton.notmetered
ltx/en_us_oca/me.m07.d07:meMA.Ode6C12.mode	@ltx/en_us_oca/miscellanea:misc.Mode2
ltx/en_us_oca/me.m07.d07:meMA.Ode6C12.ode	@ltx/en_us_oca/miscellanea:misc.Ode6
ltx/en_us_oca/me.m07.d07:meMA.Ode6C12.text	
ltx/en_us_oca/me.m07.d07:meMA.Ode6C13.incipit	…
ltx/en_us_oca/me.m07.d07:meMA.Ode6C13.melody	@ltx/en_us_oca/he.h.m2:heHE.EnAvyssoPtaismaton.notmetered
ltx/en_us_oca/me.m07.d07:meMA.Ode6C13.mode	@ltx/en_us_oca/miscellanea:misc.Mode2
ltx/en_us_oca/me.m07.d07:meMA.Ode6C13.ode	@ltx/en_us_oca/miscellanea:misc.Ode6
ltx/en_us_oca/me.m07.d07:meMA.Ode6C13.text	
ltx/en_us_oca/me.m07.d07:meMA.Ode6C1T.incipit	…
ltx/en_us_oca/me.m07.d07:meMA.Ode6C1T.melody	@ltx/en_us_oca/he.h.m2:heHE.EnAvyssoPtaismaton.notmetered
ltx/en_us_oca/me.m07.d07:meMA.Ode6C1T.mode	@ltx/en_us_oca/miscellanea:misc.Mode2
ltx/en_us_oca/me.m07.d07:meMA.Ode6C1T.ode	@ltx/en_us_oca/miscellanea:misc.Ode6
ltx/en_us_oca/me.m07.d07:meMA.Ode6C1T.text	
ltx/en_us_oca/me.m07.d07:meMA.Ode6C21.greekmelody	@ltx/en_us_oca/he.h.m2:heHE.EnAvyssoPtaismaton.greekname
ltx/en_us_oca/me.m07.d07:meMA.Ode6C21.incipit	…
ltx/en_us_oca/me.m07.d07:meMA.Ode6C21.melody	@ltx/en_us_oca/he.h.m2:heHE.EnAvyssoPtaismaton.notmetered
ltx/en_us_oca/me.m07.d07:meMA.Ode6C21.mode	@ltx/en_us_oca/miscellanea:misc.Mode2
ltx/en_us_oca/me.m07.d07:meMA.Ode6C21.ode	@ltx/en_us_oca/miscellanea:misc.Ode6
ltx/en_us_oca/me.m07.d07:meMA.Ode6C21.text	
ltx/en_us_oca/me.m07.d07:meMA.Ode6C22.incipit	…
ltx/en_us_oca/me.m07.d07:meMA.Ode6C22.melody	@ltx/en_us_oca/he.h.m2:heHE.EnAvyssoPtaismaton.notmetered
ltx/en_us_oca/me.m07.d07:meMA.Ode6C22.mode	@ltx/en_us_oca/miscellanea:misc.Mode2
ltx/en_us_oca/me.m07.d07:meMA.Ode6C22.ode	@ltx/en_us_oca/miscellanea:misc.Ode6
ltx/en_us_oca/me.m07.d07:meMA.Ode6C22.text	
ltx/en_us_oca/me.m07.d07:meMA.Ode6C23.incipit	…
ltx/en_us_oca/me.m07.d07:meMA.Ode6C23.melody	@ltx/en_us_oca/he.h.m2:heHE.EnAvyssoPtaismaton.notmetered
ltx/en_us_oca/me.m07.d07:meMA.Ode6C23.mode	@ltx/en_us_oca/miscellanea:misc.Mode2
ltx/en_us_oca/me.m07.d07:meMA.Ode6C23.ode	@ltx/en_us_oca/miscellanea:misc.Ode6
ltx/en_us_oca/me.m07.d07:meMA.Ode6C23.text	
ltx/en_us_oca/me.m07.d07:meMA.Ode6C2T.incipit	…
ltx/en_us_oca/me.m07.d07:meMA.Ode6C2T.melody	@ltx/en_us_oca/he.h.m2:heHE.EnAvyssoPtaismaton.notmetered
ltx/en_us_oca/me.m07.d07:meMA.Ode6C2T.mode	@ltx/en_us_oca/miscellanea:misc.Mode2
ltx/en_us_oca/me.m07.d07:meMA.Ode6C2T.ode	@ltx/en_us_oca/miscellanea:misc.Ode6
ltx/en_us_oca/me.m07.d07:meMA.Ode6C2T.text	
ltx/en_us_oca/me.m07.d07:meMA.Ode6H.greekmelody	@ltx/en_us_oca/he.h.m2:heHE.EnAvyssoPtaismaton.greekname
ltx/en_us_oca/me.m07.d07:meMA.Ode6H.incipit	@ltx/en_us_oca/he.h.m2:heHE.EnAvyssoPtaismaton.incipit
ltx/en_us_oca/me.m07.d07:meMA.Ode6H.melody	@ltx/en_us_oca/he.h.m2:heHE.EnAvyssoPtaismaton.melody
ltx/en_us_oca/me.m07.d07:meMA.Ode6H.mode	@ltx/en_us_oca/miscellanea:misc.Mode2
ltx/en_us_oca/me.m07.d07:meMA.Ode6H.ode	@ltx/en_us_oca/miscellanea:misc.Ode6
ltx/en_us_oca/me.m07.d07:meMA.Ode6H.text	@ltx/en_us_oca/he.h.m2:heHE.EnAvyssoPtaismaton.text
ltx/en_us_oca/me.m07.d07:meMA.Ode7C11.greekmelody	@ltx/en_us_oca/he.h.m2:heHE.EikonosChrysis.greekname
ltx/en_us_oca/me.m07.d07:meMA.Ode7C11.incipit	…
ltx/en_us_oca/me.m07.d07:meMA.Ode7C11.melody	@ltx/en_us_oca/he.h.m2:heHE.EikonosChrysis.notmetered
ltx/en_us_oca/me.m07.d07:meMA.Ode7C11.mode	@ltx/en_us_oca/miscellanea:misc.Mode2
ltx/en_us_oca/me.m07.d07:meMA.Ode7C11.ode	@ltx/en_us_oca/miscellanea:misc.Ode7
ltx/en_us_oca/me.m07.d07:meMA.Ode7C11.text	
ltx/en_us_oca/me.m07.d07:meMA.Ode7C12.incipit	…
ltx/en_us_oca/me.m07.d07:meMA.Ode7C12.melody	@ltx/en_us_oca/he.h.m2:heHE.EikonosChrysis.notmetered
ltx/en_us_oca/me.m07.d07:meMA.Ode7C12.mode	@ltx/en_us_oca/miscellanea:misc.Mode2
ltx/en_us_oca/me.m07.d07:meMA.Ode7C12.ode	@ltx/en_us_oca/miscellanea:misc.Ode7
ltx/en_us_oca/me.m07.d07:meMA.Ode7C12.text	
ltx/en_us_oca/me.m07.d07:meMA.Ode7C1T.incipit	…
ltx/en_us_oca/me.m07.d07:meMA.Ode7C1T.melody	@ltx/en_us_oca/he.h.m2:heHE.EikonosChrysis.notmetered
ltx/en_us_oca/me.m07.d07:meMA.Ode7C1T.mode	@ltx/en_us_oca/miscellanea:misc.Mode2
ltx/en_us_oca/me.m07.d07:meMA.Ode7C1T.ode	@ltx/en_us_oca/miscellanea:misc.Ode7
ltx/en_us_oca/me.m07.d07:meMA.Ode7C1T.text	
ltx/en_us_oca/me.m07.d07:meMA.Ode7C21.greekmelody	@ltx/en_us_oca/he.h.m2:heHE.EikonosChrysis.greekname
ltx/en_us_oca/me.m07.d07:meMA.Ode7C21.incipit	…
ltx/en_us_oca/me.m07.d07:meMA.Ode7C21.melody	@ltx/en_us_oca/he.h.m2:heHE.EikonosChrysis.notmetered
ltx/en_us_oca/me.m07.d07:meMA.Ode7C21.mode	@ltx/en_us_oca/miscellanea:misc.Mode2
ltx/en_us_oca/me.m07.d07:meMA.Ode7C21.ode	@ltx/en_us_oca/miscellanea:misc.Ode7
ltx/en_us_oca/me.m07.d07:meMA.Ode7C21.text	
ltx/en_us_oca/me.m07.d07:meMA.Ode7C22.incipit	…
ltx/en_us_oca/me.m07.d07:meMA.Ode7C22.melody	@ltx/en_us_oca/he.h.m2:heHE.EikonosChrysis.notmetered
ltx/en_us_oca/me.m07.d07:meMA.Ode7C22.mode	@ltx/en_us_oca/miscellanea:misc.Mode2
ltx/en_us_oca/me.m07.d07:meMA.Ode7C22.ode	@ltx/en_us_oca/miscellanea:misc.Ode7
ltx/en_us_oca/me.m07.d07:meMA.Ode7C22.text	
ltx/en_us_oca/me.m07.d07:meMA.Ode7C23.incipit	…
ltx/en_us_oca/me.m07.d07:meMA.Ode7C23.melody	@ltx/en_us_oca/he.h.m2:heHE.EikonosChrysis.notmetered
ltx/en_us_oca/me.m07.d07:meMA.Ode7C23.mode	@ltx/en_us_oca/miscellanea:misc.Mode2
ltx/en_us_oca/me.m07.d07:meMA.Ode7C23.ode	@ltx/en_us_oca/miscellanea:misc.Ode7
ltx/en_us_oca/me.m07.d07:meMA.Ode7C23.text	
ltx/en_us_oca/me.m07.d07:meMA.Ode7C2T.incipit	…
ltx/en_us_oca/me.m07.d07:meMA.Ode7C2T.melody	@ltx/en_us_oca/he.h.m2:heHE.EikonosChrysis.notmetered
ltx/en_us_oca/me.m07.d07:meMA.Ode7C2T.mode	@ltx/en_us_oca/miscellanea:misc.Mode2
ltx/en_us_oca/me.m07.d07:meMA.Ode7C2T.ode	@ltx/en_us_oca/miscellanea:misc.Ode7
ltx/en_us_oca/me.m07.d07:meMA.Ode7C2T.text	
ltx/en_us_oca/me.m07.d07:meMA.Ode8C11.greekmelody	@ltx/en_us_oca/he.h.m2:heHE.TonEnKaminoTouPyros.greekname
ltx/en_us_oca/me.m07.d07:meMA.Ode8C11.incipit	…
ltx/en_us_oca/me.m07.d07:meMA.Ode8C11.melody	@ltx/en_us_oca/he.h.m2:heHE.TonEnKaminoTouPyros.notmetered
ltx/en_us_oca/me.m07.d07:meMA.Ode8C11.mode	@ltx/en_us_oca/miscellanea:misc.Mode2
ltx/en_us_oca/me.m07.d07:meMA.Ode8C11.ode	@ltx/en_us_oca/miscellanea:misc.Ode8
ltx/en_us_oca/me.m07.d07:meMA.Ode8C11.text	
ltx/en_us_oca/me.m07.d07:meMA.Ode8C12.incipit	…
ltx/en_us_oca/me.m07.d07:meMA.Ode8C12.melody	@ltx/en_us_oca/he.h.m2:heHE.TonEnKaminoTouPyros.notmetered
ltx/en_us_oca/me.m07.d07:meMA.Ode8C12.mode	@ltx/en_us_oca/miscellanea:misc.Mode2
ltx/en_us_oca/me.m07.d07:meMA.Ode8C12.ode	@ltx/en_us_oca/miscellanea:misc.Ode8
ltx/en_us_oca/me.m07.d07:meMA.Ode8C12.text	
ltx/en_us_oca/me.m07.d07:meMA.Ode8C1T.incipit	…
ltx/en_us_oca/me.m07.d07:meMA.Ode8C1T.melody	@ltx/en_us_oca/he.h.m2:heHE.TonEnKaminoTouPyros.notmetered
ltx/en_us_oca/me.m07.d07:meMA.Ode8C1T.mode	@ltx/en_us_oca/miscellanea:misc.Mode2
ltx/en_us_oca/me.m07.d07:meMA.Ode8C1T.ode	@ltx/en_us_oca/miscellanea:misc.Ode8
ltx/en_us_oca/me.m07.d07:meMA.Ode8C1T.text	
ltx/en_us_oca/me.m07.d07:meMA.Ode8C21.greekmelody	@ltx/en_us_oca/he.h.m2:heHE.TonEnKaminoTouPyros.greekname
ltx/en_us_oca/me.m07.d07:meMA.Ode8C21.incipit	…
ltx/en_us_oca/me.m07.d07:meMA.Ode8C21.melody	@ltx/en_us_oca/he.h.m2:heHE.TonEnKaminoTouPyros.notmetered
ltx/en_us_oca/me.m07.d07:meMA.Ode8C21.mode	@ltx/en_us_oca/miscellanea:misc.Mode2
ltx/en_us_oca/me.m07.d07:meMA.Ode8C21.ode	@ltx/en_us_oca/miscellanea:misc.Ode8
ltx/en_us_oca/me.m07.d07:meMA.Ode8C21.text	
ltx/en_us_oca/me.m07.d07:meMA.Ode8C22.incipit	…
ltx/en_us_oca/me.m07.d07:meMA.Ode8C22.melody	@ltx/en_us_oca/he.h.m2:heHE.TonEnKaminoTouPyros.notmetered
ltx/en_us_oca/me.m07.d07:meMA.Ode8C22.mode	@ltx/en_us_oca/miscellanea:misc.Mode2
ltx/en_us_oca/me.m07.d07:meMA.Ode8C22.ode	@ltx/en_us_oca/miscellanea:misc.Ode8
ltx/en_us_oca/me.m07.d07:meMA.Ode8C22.text	
ltx/en_us_oca/me.m07.d07:meMA.Ode8C23.incipit	…
ltx/en_us_oca/me.m07.d07:meMA.Ode8C23.melody	@ltx/en_us_oca/he.h.m2:heHE.TonEnKaminoTouPyros.notmetered
ltx/en_us_oca/me.m07.d07:meMA.Ode8C23.mode	@ltx/en_us_oca/miscellanea:misc.Mode2
ltx/en_us_oca/me.m07.d07:meMA.Ode8C23.ode	@ltx/en_us_oca/miscellanea:misc.Ode8
ltx/en_us_oca/me.m07.d07:meMA.Ode8C23.text	
ltx/en_us_oca/me.m07.d07:meMA.Ode8C2T.incipit	…
ltx/en_us_oca/me.m07.d07:meMA.Ode8C2T.melody	@ltx/en_us_oca/he.h.m2:heHE.TonEnKaminoTouPyros.notmetered
ltx/en_us_oca/me.m07.d07:meMA.Ode8C2T.mode	@ltx/en_us_oca/miscellanea:misc.Mode2
ltx/en_us_oca/me.m07.d07:meMA.Ode8C2T.ode	@ltx/en_us_oca/miscellanea:misc.Ode8
ltx/en_us_oca/me.m07.d07:meMA.Ode8C2T.text	
ltx/en_us_oca/me.m07.d07:meMA.Ode8H.greekmelody	@ltx/en_us_oca/he.h.m2:heHE.TonEnKaminoTouPyros.greekname
ltx/en_us_oca/me.m07.d07:meMA.Ode8H.incipit	@ltx/en_us_oca/he.h.m2:heHE.TonEnKaminoTouPyros.incipit
ltx/en_us_oca/me.m07.d07:meMA.Ode8H.melody	@ltx/en_us_oca/he.h.m2:heHE.TonEnKaminoTouPyros.melody
ltx/en_us_oca/me.m07.d07:meMA.Ode8H.mode	@ltx/en_us_oca/miscellanea:misc.Mode2
ltx/en_us_oca/me.m07.d07:meMA.Ode8H.ode	@ltx/en_us_oca/miscellanea:misc.Ode8
ltx/en_us_oca/me.m07.d07:meMA.Ode8H.text	@ltx/en_us_oca/he.h.m2:heHE.TonEnKaminoTouPyros.text
ltx/en_us_oca/me.m07.d07:meMA.Ode9C11.greekmelody	@ltx/en_us_oca/he.h.m2:heHE.TonEkTheouTheonLogon.greekname
ltx/en_us_oca/me.m07.d07:meMA.Ode9C11.incipit	…
ltx/en_us_oca/me.m07.d07:meMA.Ode9C11.melody	@ltx/en_us_oca/he.h.m2:heHE.TonEkTheouTheonLogon.notmetered
ltx/en_us_oca/me.m07.d07:meMA.Ode9C11.mode	@ltx/en_us_oca/miscellanea:misc.Mode2
ltx/en_us_oca/me.m07.d07:meMA.Ode9C11.ode	@ltx/en_us_oca/miscellanea:misc.Ode9
ltx/en_us_oca/me.m07.d07:meMA.Ode9C11.text	
ltx/en_us_oca/me.m07.d07:meMA.Ode9C12.incipit	…
ltx/en_us_oca/me.m07.d07:meMA.Ode9C12.melody	@ltx/en_us_oca/he.h.m2:heHE.TonEkTheouTheonLogon.notmetered
ltx/en_us_oca/me.m07.d07:meMA.Ode9C12.mode	@ltx/en_us_oca/miscellanea:misc.Mode2
ltx/en_us_oca/me.m07.d07:meMA.Ode9C12.ode	@ltx/en_us_oca/miscellanea:misc.Ode9
ltx/en_us_oca/me.m07.d07:meMA.Ode9C12.text	
ltx/en_us_oca/me.m07.d07:meMA.Ode9C13.incipit	…
ltx/en_us_oca/me.m07.d07:meMA.Ode9C13.melody	@ltx/en_us_oca/he.h.m2:heHE.TonEkTheouTheonLogon.notmetered
ltx/en_us_oca/me.m07.d07:meMA.Ode9C13.mode	@ltx/en_us_oca/miscellanea:misc.Mode2
ltx/en_us_oca/me.m07.d07:meMA.Ode9C13.ode	@ltx/en_us_oca/miscellanea:misc.Ode9
ltx/en_us_oca/me.m07.d07:meMA.Ode9C13.text	
ltx/en_us_oca/me.m07.d07:meMA.Ode9C1T.incipit	…
ltx/en_us_oca/me.m07.d07:meMA.Ode9C1T.melody	@ltx/en_us_oca/he.h.m2:heHE.TonEkTheouTheonLogon.notmetered
ltx/en_us_oca/me.m07.d07:meMA.Ode9C1T.mode	@ltx/en_us_oca/miscellanea:misc.Mode2
ltx/en_us_oca/me.m07.d07:meMA.Ode9C1T.ode	@ltx/en_us_oca/miscellanea:misc.Ode9
ltx/en_us_oca/me.m07.d07:meMA.Ode9C1T.text	
ltx/en_us_oca/me.m07.d07:meMA.Ode9C21.greekmelody	@ltx/en_us_oca/he.h.m2:heHE.TonEkTheouTheonLogon.greekname
ltx/en_us_oca/me.m07.d07:meMA.Ode9C21.incipit	…
ltx/en_us_oca/me.m07.d07:meMA.Ode9C21.melody	@ltx/en_us_oca/he.h.m2:heHE.TonEkTheouTheonLogon.notmetered
ltx/en_us_oca/me.m07.d07:meMA.Ode9C21.mode	@ltx/en_us_oca/miscellanea:misc.Mode2
ltx/en_us_oca/me.m07.d07:meMA.Ode9C21.ode	@ltx/en_us_oca/miscellanea:misc.Ode9
ltx/en_us_oca/me.m07.d07:meMA.Ode9C21.text	
ltx/en_us_oca/me.m07.d07:meMA.Ode9C22.incipit	…
ltx/en_us_oca/me.m07.d07:meMA.Ode9C22.melody	@ltx/en_us_oca/he.h.m2:heHE.TonEkTheouTheonLogon.notmetered
ltx/en_us_oca/me.m07.d07:meMA.Ode9C22.mode	@ltx/en_us_oca/miscellanea:misc.Mode2
ltx/en_us_oca/me.m07.d07:meMA.Ode9C22.ode	@ltx/en_us_oca/miscellanea:misc.Ode9
ltx/en_us_oca/me.m07.d07:meMA.Ode9C22.text	
ltx/en_us_oca/me.m07.d07:meMA.Ode9C23.incipit	…
ltx/en_us_oca/me.m07.d07:meMA.Ode9C23.melody	@ltx/en_us_oca/he.h.m2:heHE.TonEkTheouTheonLogon.notmetered
ltx/en_us_oca/me.m07.d07:meMA.Ode9C23.mode	@ltx/en_us_oca/miscellanea:misc.Mode2
ltx/en_us_oca/me.m07.d07:meMA.Ode9C23.ode	@ltx/en_us_oca/miscellanea:misc.Ode9
ltx/en_us_oca/me.m07.d07:meMA.Ode9C23.text	
ltx/en_us_oca/me.m07.d07:meMA.Ode9C24.incipit	…
ltx/en_us_oca/me.m07.d07:meMA.Ode9C24.melody	@ltx/en_us_oca/he.h.m2:heHE.TonEkTheouTheonLogon.notmetered
ltx/en_us_oca/me.m07.d07:meMA.Ode9C24.mode	@ltx/en_us_oca/miscellanea:misc.Mode2
ltx/en_us_oca/me.m07.d07:meMA.Ode9C24.ode	@ltx/en_us_oca/miscellanea:misc.Ode9
ltx/en_us_oca/me.m07.d07:meMA.Ode9C24.text	
ltx/en_us_oca/me.m07.d07:meMA.Ode9C2T.incipit	…
ltx/en_us_oca/me.m07.d07:meMA.Ode9C2T.melody	@ltx/en_us_oca/he.h.m2:heHE.TonEkTheouTheonLogon.notmetered
ltx/en_us_oca/me.m07.d07:meMA.Ode9C2T.mode	@ltx/en_us_oca/miscellanea:misc.Mode2
ltx/en_us_oca/me.m07.d07:meMA.Ode9C2T.ode	@ltx/en_us_oca/miscellanea:misc.Ode9
ltx/en_us_oca/me.m07.d07:meMA.Ode9C2T.text	
ltx/en_us_oca/me.m07.d07:meMA.Ode9H.greekmelody	@ltx/en_us_oca/he.h.m2:heHE.TonEkTheouTheonLogon.greekname
ltx/en_us_oca/me.m07.d07:meMA.Ode9H.incipit	@ltx/en_us_oca/he.h.m2:heHE.TonEkTheouTheonLogon.incipit
ltx/en_us_oca/me.m07.d07:meMA.Ode9H.melody	@ltx/en_us_oca/he.h.m2:heHE.TonEkTheouTheonLogon.melody
ltx/en_us_oca/me.m07.d07:meMA.Ode9H.mode	@ltx/en_us_oca/miscellanea:misc.Mode2
ltx/en_us_oca/me.m07.d07:meMA.Ode9H.ode	@ltx/en_us_oca/miscellanea:misc.Ode9
ltx/en_us_oca/me.m07.d07:meMA.Ode9H.text	@ltx/en_us_oca/he.h.m2:heHE.TonEkTheouTheonLogon.text
ltx/en_us_oca/me.m07.d07:meMA.Oikos1.text	
ltx/en_us_oca/me.m07.d07:meVE.Apolytikion1ger.greekmelody	@ltx/en_us_oca/he.a.m3:heAU.TinOraiotita.greekname
ltx/en_us_oca/me.m07.d07:meVE.Apolytikion1ger.incipit	…
ltx/en_us_oca/me.m07.d07:meVE.Apolytikion1ger.melody	@ltx/en_us_oca/he.a.m3:heAU.TinOraiotita.notmetered
ltx/en_us_oca/me.m07.d07:meVE.Apolytikion1ger.mode	@ltx/en_us_oca/miscellanea:misc.Mode3
ltx/en_us_oca/me.m07.d07:meVE.Apolytikion1ger.poet	@ltx/en_us_oca/poets:po.Gerasimou
ltx/en_us_oca/me.m07.d07:meVE.Apolytikion1ger.text	
ltx/en_us_oca/me.m07.d07:meVE.Apolytikion2ger.greekmelody	@ltx/en_us_oca/he.a.m4:heAU.TachyProkatalave.greekname
ltx/en_us_oca/me.m07.d07:meVE.Apolytikion2ger.incipit	…
ltx/en_us_oca/me.m07.d07:meVE.Apolytikion2ger.melody	@ltx/en_us_oca/he.a.m4:heAU.TachyProkatalave.notmetered
ltx/en_us_oca/me.m07.d07:meVE.Apolytikion2ger.mode	@ltx/en_us_oca/miscellanea:misc.Mode4
ltx/en_us_oca/me.m07.d07:meVE.Apolytikion2ger.poet	@ltx/en_us_oca/poets:po.Gerasimou
ltx/en_us_oca/me.m07.d07:meVE.Apolytikion2ger.text	
ltx/en_us_oca/me.m07.d07:meVE.Apolytikion3.greekmelody	@ltx/en_us_oca/he.a.m5:heAU.TonSynanarchonLogon.greekname
ltx/en_us_oca/me.m07.d07:meVE.Apolytikion3.incipit	…
ltx/en_us_oca/me.m07.d07:meVE.Apolytikion3.melody	@ltx/en_us_oca/he.a.m5:heAU.TonSynanarchonLogon.notmetered
ltx/en_us_oca/me.m07.d07:meVE.Apolytikion3.mode	@ltx/en_us_oca/miscellanea:misc.Mode5
ltx/en_us_oca/me.m07.d07:meVE.Apolytikion3.text	
ltx/en_us_oca/me.m07.d07:meVE.AposGlory.incipit	…
ltx/en_us_oca/me.m07.d07:meVE.AposGlory.melody	
ltx/en_us_oca/me.m07.d07:meVE.AposGlory.mode	@ltx/en_us_oca/miscellanea:misc.Mode2
ltx/en_us_oca/me.m07.d07:meVE.AposGlory.text	
ltx/en_us_oca/me.m07.d07:meVE.AposStavrotheotokion.greekmelody	@ltx/en_us_oca/he.a.m2:heAU.OteEkTouXylou.greekname
ltx/en_us_oca/me.m07.d07:meVE.AposStavrotheotokion.incipit	@ltx/en_us_oca/oc.m2.d4:ocVE.AposTheotokion.incipit
ltx/en_us_oca/me.m07.d07:meVE.AposStavrotheotokion.melody	@ltx/en_us_oca/he.a.m2:heAU.OteEkTouXylou.notmetered
ltx/en_us_oca/me.m07.d07:meVE.AposStavrotheotokion.mode	@ltx/en_us_oca/miscellanea:misc.Mode2
ltx/en_us_oca/me.m07.d07:meVE.AposStavrotheotokion.text	@ltx/en_us_oca/oc.m2.d4:ocVE.AposTheotokion.text
ltx/en_us_oca/me.m07.d07:meVE.AposTheotokion.incipit	@ltx/en_us_oca/oc.m2.d3:ocVE.AposTheotokion.incipit
ltx/en_us_oca/me.m07.d07:meVE.AposTheotokion.melody	
ltx/en_us_oca/me.m07.d07:meVE.AposTheotokion.mode	@ltx/en_us_oca/miscellanea:misc.Mode2
ltx/en_us_oca/me.m07.d07:meVE.AposTheotokion.text	@ltx/en_us_oca/oc.m2.d3:ocVE.AposTheotokion.text
ltx/en_us_oca/me.m07.d07:meVE.Aposticha.notice	
ltx/en_us_oca/me.m07.d07:meVE.Aposticha1.greekmelody	@ltx/en_us_oca/he.a.m4:heAU.OsGennaionEnMartysi.greekname
ltx/en_us_oca/me.m07.d07:meVE.Aposticha1.incipit	@ltx/en_us_oca/me.m07.d26:meVE.Aposticha1.incipit
ltx/en_us_oca/me.m07.d07:meVE.Aposticha1.melody	@ltx/en_us_oca/he.a.m4:heAU.OsGennaionEnMartysi.notmetered
ltx/en_us_oca/me.m07.d07:meVE.Aposticha1.mode	@ltx/en_us_oca/miscellanea:misc.Mode4
ltx/en_us_oca/me.m07.d07:meVE.Aposticha1.text	@ltx/en_us_oca/me.m07.d26:meVE.Aposticha1.text
ltx/en_us_oca/me.m07.d07:meVE.Aposticha2.incipit	@ltx/en_us_oca/me.m07.d26:meVE.Aposticha2.incipit
ltx/en_us_oca/me.m07.d07:meVE.Aposticha2.melody	@ltx/en_us_oca/he.a.m4:heAU.OsGennaionEnMartysi.notmetered
ltx/en_us_oca/me.m07.d07:meVE.Aposticha2.mode	@ltx/en_us_oca/miscellanea:misc.Mode4
ltx/en_us_oca/me.m07.d07:meVE.Aposticha2.text	@ltx/en_us_oca/me.m07.d26:meVE.Aposticha2.text
ltx/en_us_oca/me.m07.d07:meVE.Aposticha3.incipit	…
ltx/en_us_oca/me.m07.d07:meVE.Aposticha3.melody	@ltx/en_us_oca/he.a.m4:heAU.OsGennaionEnMartysi.notmetered
ltx/en_us_oca/me.m07.d07:meVE.Aposticha3.mode	@ltx/en_us_oca/miscellanea:misc.Mode4
ltx/en_us_oca/me.m07.d07:meVE.Aposticha3.text	
ltx/en_us_oca/me.m07.d07:meVE.SticGlory.incipit	The virgin, athlete and martyr…
ltx/en_us_oca/me.m07.d07:meVE.SticGlory.melody	
ltx/en_us_oca/me.m07.d07:meVE.SticGlory.mode	@ltx/en_us_oca/miscellanea:misc.Mode6
ltx/en_us_oca/me.m07.d07:meVE.SticGlory.text	The virgin, athlete and martyr Euphemia, ⁄ stood at the right hand of the Savior, ⁄ clothed in the strength of victory, ⁄ adorned with the oil of purity and the blood of suffering. ⁄ She cried aloud to Him, holding her lamp with joy: ⁄ I have hastened to the scent of Your sweet fragrance, Christ God, ⁄ for I am wounded by Your love! ⁄ Do not turn me away, heavenly Bridegroom! ⁄ By her prayers, almighty Savior, ⁄⁄ send down on us Your great mercies.
ltx/en_us_oca/me.m07.d07:meVE.SticStavrotheotokion.greekmelody	@ltx/en_us_oca/he.a.m6:heAU.TriimerosAnestis.greekname
ltx/en_us_oca/me.m07.d07:meVE.SticStavrotheotokion.incipit	@ltx/en_us_oca/me.m01.d16:meVE.SticStavrotheotokion.incipit
ltx/en_us_oca/me.m07.d07:meVE.SticStavrotheotokion.melody	@ltx/en_us_oca/he.a.m6:heAU.TriimerosAnestis.notmetered
ltx/en_us_oca/me.m07.d07:meVE.SticStavrotheotokion.mode	@ltx/en_us_oca/miscellanea:misc.Mode6
ltx/en_us_oca/me.m07.d07:meVE.SticStavrotheotokion.text	@ltx/en_us_oca/me.m01.d16:meVE.SticStavrotheotokion.text
ltx/en_us_oca/me.m07.d07:meVE.SticTheotokion.greekmelody	@ltx/en_us_oca/he.a.m6:heAU.TriimerosAnestis.greekname
ltx/en_us_oca/me.m07.d07:meVE.SticTheotokion.incipit	…
ltx/en_us_oca/me.m07.d07:meVE.SticTheotokion.melody	@ltx/en_us_oca/he.a.m6:heAU.TriimerosAnestis.notmetered
ltx/en_us_oca/me.m07.d07:meVE.SticTheotokion.mode	@ltx/en_us_oca/miscellanea:misc.Mode6
ltx/en_us_oca/me.m07.d07:meVE.SticTheotokion.text	
ltx/en_us_oca/me.m07.d07:meVE.Stichera01.greekmelody	@ltx/en_us_oca/he.a.m1:heAU.TonOuranionTagmaton.greekname
ltx/en_us_oca/me.m07.d07:meVE.Stichera01.incipit	We have come to know…
ltx/en_us_oca/me.m07.d07:meVE.Stichera01.melody	@ltx/en_us_oca/he.a.m1:heAU.TonOuranionTagmaton.notmetered
ltx/en_us_oca/me.m07.d07:meVE.Stichera01.mode	@ltx/en_us_oca/miscellanea:misc.Mode1
ltx/en_us_oca/me.m07.d07:meVE.Stichera01.text	We have come to know you, Father, ⁄ as a divinely radiant beacon, ⁄ enlightening the world with shafts of spiritual light, ⁄ dispelling the darkness of the evil tumult of demons! ⁄⁄ Therefore we celebrate your brilliant memory with faith, blessed one!
ltx/en_us_oca/me.m07.d07:meVE.Stichera02.incipit	You were resplendent in your…
ltx/en_us_oca/me.m07.d07:meVE.Stichera02.melody	@ltx/en_us_oca/he.a.m1:heAU.TonOuranionTagmaton.notmetered
ltx/en_us_oca/me.m07.d07:meVE.Stichera02.mode	@ltx/en_us_oca/miscellanea:misc.Mode1
ltx/en_us_oca/me.m07.d07:meVE.Stichera02.text	You were resplendent in your former life, Father Thomas, ⁄ with riches and power. ⁄ You clothed yourself in the monastic habit, venerable one, ⁄ emulating the poverty of Him ⁄ Who became incarnate for our sake! ⁄⁄ Therefore He made you rich with many spiritual gifts!
ltx/en_us_oca/me.m07.d07:meVE.Stichera03.incipit	God openly guided you to…
ltx/en_us_oca/me.m07.d07:meVE.Stichera03.melody	@ltx/en_us_oca/he.a.m1:heAU.TonOuranionTagmaton.notmetered
ltx/en_us_oca/me.m07.d07:meVE.Stichera03.mode	@ltx/en_us_oca/miscellanea:misc.Mode1
ltx/en_us_oca/me.m07.d07:meVE.Stichera03.text	God openly guided you to salvation, Father, ⁄ with a pillar of fire leading you to the calm harbor; ⁄ to the haven of dispassion. ⁄ By your prayer, you caused water to spring forth, ⁄⁄ you gave sight to the blind and the lame you made to walk.
ltx/en_us_oca/me.m07.d07:meVE.Stichera04.greekmelody	@ltx/en_us_oca/he.a.m2:heAU.OteEkTouXylou.greekname
ltx/en_us_oca/me.m07.d07:meVE.Stichera04.incipit	…
ltx/en_us_oca/me.m07.d07:meVE.Stichera04.melody	@ltx/en_us_oca/he.a.m2:heAU.OteEkTouXylou.notmetered
ltx/en_us_oca/me.m07.d07:meVE.Stichera04.mode	@ltx/en_us_oca/miscellanea:misc.Mode2
ltx/en_us_oca/me.m07.d07:meVE.Stichera04.text	
ltx/en_us_oca/me.m07.d07:meVE.Stichera05.incipit	…
ltx/en_us_oca/me.m07.d07:meVE.Stichera05.melody	@ltx/en_us_oca/he.a.m2:heAU.OteEkTouXylou.notmetered
ltx/en_us_oca/me.m07.d07:meVE.Stichera05.mode	@ltx/en_us_oca/miscellanea:misc.Mode2
ltx/en_us_oca/me.m07.d07:meVE.Stichera05.text	
ltx/en_us_oca/me.m07.d07:meVE.Stichera06.incipit	…
ltx/en_us_oca/me.m07.d07:meVE.Stichera06.melody	@ltx/en_us_oca/he.a.m2:heAU.OteEkTouXylou.notmetered
ltx/en_us_oca/me.m07.d07:meVE.Stichera06.mode	@ltx/en_us_oca/miscellanea:misc.Mode2
ltx/en_us_oca/me.m07.d07:meVE.Stichera06.text	
