ltx/en_us_oca/me.m01.d07:meDA.commemoration.first	
ltx/en_us_oca/me.m01.d07:meDA.commemoration.first_name	
ltx/en_us_oca/me.m01.d07:meDA.commemoration.first_short	
ltx/en_us_oca/me.m01.d07:meDA.commemoration.first_title	
ltx/en_us_oca/me.m01.d07:meDA.commemoration.full	
ltx/en_us_oca/me.m01.d07:meDA.commemoration.second_name	
ltx/en_us_oca/me.m01.d07:meDA.commemoration.second_title	
ltx/en_us_oca/me.m01.d07:meDA.date	
ltx/en_us_oca/me.m01.d07:meDA.dismissal	@ltx/en_us_oca/dismissals:dis00.epiphany
ltx/en_us_oca/me.m01.d07:meDA.fordate	
ltx/en_us_oca/me.m01.d07:meDA.insert1	
ltx/en_us_oca/me.m01.d07:meDA.insert2	
ltx/en_us_oca/me.m01.d07:meDA.note	
ltx/en_us_oca/me.m01.d07:meDA.pdfcoverdate	
ltx/en_us_oca/me.m01.d07:meDA.pdfheaderdate	
ltx/en_us_oca/me.m01.d07:meHO.commemorations	
ltx/en_us_oca/me.m01.d07:meHO.note1	@ltx/en_us_oca/rubrical:ru.HolidayFish
ltx/en_us_oca/me.m01.d07:meHO.note2	
ltx/en_us_oca/me.m01.d07:meHO.number	
ltx/en_us_oca/me.m01.d07:meHO.rank	
ltx/en_us_oca/me.m01.d07:meLE.commemoration1	
ltx/en_us_oca/me.m01.d07:meLE.commemoration2	
ltx/en_us_oca/me.m01.d07:meLI.Kontakion1.incipit	@ltx/en_us_oca/me.m01.d07:meMA.Kontakion1.incipit
ltx/en_us_oca/me.m01.d07:meLI.Kontakion1.melody	@ltx/en_us_oca/me.m01.d07:meMA.Kontakion1.melody
ltx/en_us_oca/me.m01.d07:meLI.Kontakion1.mode	@ltx/en_us_oca/me.m01.d07:meMA.Kontakion1.mode
ltx/en_us_oca/me.m01.d07:meLI.Kontakion1.text	@ltx/en_us_oca/me.m01.d07:meMA.Kontakion1.text
ltx/en_us_oca/me.m01.d07:meLI.MM.CommunionHymn.text	@ltx/en_us_oca/da.d3:daLI.MM.CommunionHymn.text
ltx/en_us_oca/me.m01.d07:meLI.Megalynarion.text	
ltx/en_us_oca/me.m01.d07:meLI.TheotokosHymn.incipit	@ltx/en_us_oca/me.m01.d06:meMA.Ode9C2H.incipit
ltx/en_us_oca/me.m01.d07:meLI.TheotokosHymn.mode	@ltx/en_us_oca/miscellanea:misc.Mode2
ltx/en_us_oca/me.m01.d07:meLI.TheotokosHymn.text	@ltx/en_us_oca/me.m01.d06:meMA.Ode9C2H.text
ltx/en_us_oca/me.m01.d07:meLI.TheotokosHymnVerse.incipit	@ltx/en_us_oca/me.m01.d06:meMA.Ode9C2MTh.incipit
ltx/en_us_oca/me.m01.d07:meLI.TheotokosHymnVerse.text	@ltx/en_us_oca/me.m01.d06:meMA.Ode9C2MTh.text
ltx/en_us_oca/me.m01.d07:meMA.C1.acrostic.notice1	
ltx/en_us_oca/me.m01.d07:meMA.C1.acrostic.text	
ltx/en_us_oca/me.m01.d07:meMA.C1.acrostic.title	
ltx/en_us_oca/me.m01.d07:meMA.C1.poet	@ltx/en_us_oca/poets:po.Theofanous
ltx/en_us_oca/me.m01.d07:meMA.C1.title	@ltx/en_us_oca/titles:ti.CanonForerunner
ltx/en_us_oca/me.m01.d07:meMA.C1.verse	@ltx/en_us_oca/prayers:pr.verse_Baptist.text
ltx/en_us_oca/me.m01.d07:meMA.Exaposteilarion1.greekmelody	@ltx/en_us_oca/he.a.m2:heAU.GynaikesAkoutisthite.greekname
ltx/en_us_oca/me.m01.d07:meMA.Exaposteilarion1.incipit	…
ltx/en_us_oca/me.m01.d07:meMA.Exaposteilarion1.melody	@ltx/en_us_oca/he.a.m2:heAU.GynaikesAkoutisthite.notmetered
ltx/en_us_oca/me.m01.d07:meMA.Exaposteilarion1.mode	@ltx/en_us_oca/miscellanea:misc.Mode2
ltx/en_us_oca/me.m01.d07:meMA.Exaposteilarion1.text	
ltx/en_us_oca/me.m01.d07:meMA.Exaposteilarion2.greekmelody	@ltx/en_us_oca/me.m01.d07:meMA.Exaposteilarion2.greekmelody
ltx/en_us_oca/me.m01.d07:meMA.Exaposteilarion2.incipit	@ltx/en_us_oca/he.a.m3:heAU.EpefaniOSotir.incipit
ltx/en_us_oca/me.m01.d07:meMA.Exaposteilarion2.melody	@ltx/en_us_oca/he.a.m3:heAU.EpefaniOSotir.melody
ltx/en_us_oca/me.m01.d07:meMA.Exaposteilarion2.mode	@ltx/en_us_oca/miscellanea:misc.Mode3
ltx/en_us_oca/me.m01.d07:meMA.Exaposteilarion2.text	@ltx/en_us_oca/he.a.m3:heAU.EpefaniOSotir.text
ltx/en_us_oca/me.m01.d07:meMA.Kathisma11.greekmelody	@ltx/en_us_oca/he.a.m1:heAU.TouLithouSfragisthentos.greekname
ltx/en_us_oca/me.m01.d07:meMA.Kathisma11.incipit	…
ltx/en_us_oca/me.m01.d07:meMA.Kathisma11.melody	@ltx/en_us_oca/he.a.m1:heAU.TouLithouSfragisthentos.notmetered
ltx/en_us_oca/me.m01.d07:meMA.Kathisma11.mode	@ltx/en_us_oca/miscellanea:misc.Mode1
ltx/en_us_oca/me.m01.d07:meMA.Kathisma11.text	
ltx/en_us_oca/me.m01.d07:meMA.Kathisma21.greekmelody	@ltx/en_us_oca/he.a.m4:heAU.EpefanisSimeron.greekname
ltx/en_us_oca/me.m01.d07:meMA.Kathisma21.incipit	…
ltx/en_us_oca/me.m01.d07:meMA.Kathisma21.melody	@ltx/en_us_oca/he.a.m4:heAU.EpefanisSimeron.notmetered
ltx/en_us_oca/me.m01.d07:meMA.Kathisma21.mode	@ltx/en_us_oca/miscellanea:misc.Mode4
ltx/en_us_oca/me.m01.d07:meMA.Kathisma21.text	
ltx/en_us_oca/me.m01.d07:meMA.Kontakion1.incipit	…
ltx/en_us_oca/me.m01.d07:meMA.Kontakion1.melody	
ltx/en_us_oca/me.m01.d07:meMA.Kontakion1.mode	@ltx/en_us_oca/miscellanea:misc.Mode6
ltx/en_us_oca/me.m01.d07:meMA.Kontakion1.text	
ltx/en_us_oca/me.m01.d07:meMA.Lauds1.incipit	@ltx/en_us_oca/me.m01.d06:meMA.Lauds1.incipit
ltx/en_us_oca/me.m01.d07:meMA.Lauds1.melody	
ltx/en_us_oca/me.m01.d07:meMA.Lauds1.mode	@ltx/en_us_oca/miscellanea:misc.Mode1
ltx/en_us_oca/me.m01.d07:meMA.Lauds1.poet	@ltx/en_us_oca/poets:po.GermanouPatriarchou
ltx/en_us_oca/me.m01.d07:meMA.Lauds1.text	@ltx/en_us_oca/me.m01.d06:meMA.Lauds1.text
ltx/en_us_oca/me.m01.d07:meMA.Lauds2.incipit	@ltx/en_us_oca/me.m01.d06:meMA.Lauds2.incipit
ltx/en_us_oca/me.m01.d07:meMA.Lauds2.melody	
ltx/en_us_oca/me.m01.d07:meMA.Lauds2.mode	@ltx/en_us_oca/miscellanea:misc.Mode1
ltx/en_us_oca/me.m01.d07:meMA.Lauds2.text	@ltx/en_us_oca/me.m01.d06:meMA.Lauds2.text
ltx/en_us_oca/me.m01.d07:meMA.Lauds3.incipit	@ltx/en_us_oca/me.m01.d06:meMA.Lauds3.incipit
ltx/en_us_oca/me.m01.d07:meMA.Lauds3.melody	
ltx/en_us_oca/me.m01.d07:meMA.Lauds3.mode	@ltx/en_us_oca/miscellanea:misc.Mode1
ltx/en_us_oca/me.m01.d07:meMA.Lauds3.text	@ltx/en_us_oca/me.m01.d06:meMA.Lauds3.text
ltx/en_us_oca/me.m01.d07:meMA.Lauds4.incipit	@ltx/en_us_oca/me.m01.d06:meMA.Lauds4.incipit
ltx/en_us_oca/me.m01.d07:meMA.Lauds4.melody	
ltx/en_us_oca/me.m01.d07:meMA.Lauds4.mode	@ltx/en_us_oca/miscellanea:misc.Mode1
ltx/en_us_oca/me.m01.d07:meMA.Lauds4.text	@ltx/en_us_oca/me.m01.d06:meMA.Lauds4.text
ltx/en_us_oca/me.m01.d07:meMA.Lauds5.incipit	@ltx/en_us_oca/me.m01.d06:meMA.Lauds5.incipit
ltx/en_us_oca/me.m01.d07:meMA.Lauds5.melody	
ltx/en_us_oca/me.m01.d07:meMA.Lauds5.mode	@ltx/en_us_oca/miscellanea:misc.Mode1
ltx/en_us_oca/me.m01.d07:meMA.Lauds5.poet	@ltx/en_us_oca/poets:po.AndreouIerosolymitou
ltx/en_us_oca/me.m01.d07:meMA.Lauds5.text	@ltx/en_us_oca/me.m01.d06:meMA.Lauds5.text
ltx/en_us_oca/me.m01.d07:meMA.LaudsBoth.incipit	@ltx/en_us_oca/me.m01.d06:meMA.LaudsBoth.incipit
ltx/en_us_oca/me.m01.d07:meMA.LaudsBoth.melody	
ltx/en_us_oca/me.m01.d07:meMA.LaudsBoth.mode	@ltx/en_us_oca/miscellanea:misc.Mode2
ltx/en_us_oca/me.m01.d07:meMA.LaudsBoth.poet	@ltx/en_us_oca/poets:po.Anatoliou
ltx/en_us_oca/me.m01.d07:meMA.LaudsBoth.text	@ltx/en_us_oca/me.m01.d06:meMA.LaudsBoth.text
ltx/en_us_oca/me.m01.d07:meMA.LaudsGlory.incipit	…
ltx/en_us_oca/me.m01.d07:meMA.LaudsGlory.melody	
ltx/en_us_oca/me.m01.d07:meMA.LaudsGlory.mode	@ltx/en_us_oca/miscellanea:misc.Mode6
ltx/en_us_oca/me.m01.d07:meMA.LaudsGlory.poet	@ltx/en_us_oca/poets:po.Vyzantiou
ltx/en_us_oca/me.m01.d07:meMA.LaudsGlory.text	
ltx/en_us_oca/me.m01.d07:meMA.Ode1C11.greekmelody	@ltx/en_us_oca/he.h.m2:heHE.ToTinAvaton.greekname
ltx/en_us_oca/me.m01.d07:meMA.Ode1C11.incipit	…
ltx/en_us_oca/me.m01.d07:meMA.Ode1C11.melody	@ltx/en_us_oca/he.h.m2:heHE.ToTinAvaton.notmetered
ltx/en_us_oca/me.m01.d07:meMA.Ode1C11.mode	@ltx/en_us_oca/miscellanea:misc.Mode2
ltx/en_us_oca/me.m01.d07:meMA.Ode1C11.ode	@ltx/en_us_oca/miscellanea:misc.Ode1
ltx/en_us_oca/me.m01.d07:meMA.Ode1C11.text	
ltx/en_us_oca/me.m01.d07:meMA.Ode1C12.incipit	…
ltx/en_us_oca/me.m01.d07:meMA.Ode1C12.melody	@ltx/en_us_oca/he.h.m2:heHE.ToTinAvaton.notmetered
ltx/en_us_oca/me.m01.d07:meMA.Ode1C12.mode	@ltx/en_us_oca/miscellanea:misc.Mode2
ltx/en_us_oca/me.m01.d07:meMA.Ode1C12.ode	@ltx/en_us_oca/miscellanea:misc.Ode1
ltx/en_us_oca/me.m01.d07:meMA.Ode1C12.text	
ltx/en_us_oca/me.m01.d07:meMA.Ode1C13.incipit	…
ltx/en_us_oca/me.m01.d07:meMA.Ode1C13.melody	@ltx/en_us_oca/he.h.m2:heHE.ToTinAvaton.notmetered
ltx/en_us_oca/me.m01.d07:meMA.Ode1C13.mode	@ltx/en_us_oca/miscellanea:misc.Mode2
ltx/en_us_oca/me.m01.d07:meMA.Ode1C13.ode	@ltx/en_us_oca/miscellanea:misc.Ode1
ltx/en_us_oca/me.m01.d07:meMA.Ode1C13.text	
ltx/en_us_oca/me.m01.d07:meMA.Ode1C14.incipit	…
ltx/en_us_oca/me.m01.d07:meMA.Ode1C14.melody	@ltx/en_us_oca/he.h.m2:heHE.ToTinAvaton.notmetered
ltx/en_us_oca/me.m01.d07:meMA.Ode1C14.mode	@ltx/en_us_oca/miscellanea:misc.Mode2
ltx/en_us_oca/me.m01.d07:meMA.Ode1C14.ode	@ltx/en_us_oca/miscellanea:misc.Ode1
ltx/en_us_oca/me.m01.d07:meMA.Ode1C14.text	
ltx/en_us_oca/me.m01.d07:meMA.Ode1C1T.incipit	…
ltx/en_us_oca/me.m01.d07:meMA.Ode1C1T.melody	@ltx/en_us_oca/he.h.m2:heHE.ToTinAvaton.notmetered
ltx/en_us_oca/me.m01.d07:meMA.Ode1C1T.mode	@ltx/en_us_oca/miscellanea:misc.Mode2
ltx/en_us_oca/me.m01.d07:meMA.Ode1C1T.ode	@ltx/en_us_oca/miscellanea:misc.Ode1
ltx/en_us_oca/me.m01.d07:meMA.Ode1C1T.text	
ltx/en_us_oca/me.m01.d07:meMA.Ode3C11.greekmelody	@ltx/en_us_oca/he.h.m2:heHE.EnPetraMeTisPisteos.greekname
ltx/en_us_oca/me.m01.d07:meMA.Ode3C11.incipit	…
ltx/en_us_oca/me.m01.d07:meMA.Ode3C11.melody	@ltx/en_us_oca/he.h.m2:heHE.EnPetraMeTisPisteos.notmetered
ltx/en_us_oca/me.m01.d07:meMA.Ode3C11.mode	@ltx/en_us_oca/miscellanea:misc.Mode2
ltx/en_us_oca/me.m01.d07:meMA.Ode3C11.ode	@ltx/en_us_oca/miscellanea:misc.Ode3
ltx/en_us_oca/me.m01.d07:meMA.Ode3C11.text	
ltx/en_us_oca/me.m01.d07:meMA.Ode3C12.incipit	…
ltx/en_us_oca/me.m01.d07:meMA.Ode3C12.melody	@ltx/en_us_oca/he.h.m2:heHE.EnPetraMeTisPisteos.notmetered
ltx/en_us_oca/me.m01.d07:meMA.Ode3C12.mode	@ltx/en_us_oca/miscellanea:misc.Mode2
ltx/en_us_oca/me.m01.d07:meMA.Ode3C12.ode	@ltx/en_us_oca/miscellanea:misc.Ode3
ltx/en_us_oca/me.m01.d07:meMA.Ode3C12.text	
ltx/en_us_oca/me.m01.d07:meMA.Ode3C13.incipit	…
ltx/en_us_oca/me.m01.d07:meMA.Ode3C13.melody	@ltx/en_us_oca/he.h.m2:heHE.EnPetraMeTisPisteos.notmetered
ltx/en_us_oca/me.m01.d07:meMA.Ode3C13.mode	@ltx/en_us_oca/miscellanea:misc.Mode2
ltx/en_us_oca/me.m01.d07:meMA.Ode3C13.ode	@ltx/en_us_oca/miscellanea:misc.Ode3
ltx/en_us_oca/me.m01.d07:meMA.Ode3C13.text	
ltx/en_us_oca/me.m01.d07:meMA.Ode3C1T.incipit	…
ltx/en_us_oca/me.m01.d07:meMA.Ode3C1T.melody	@ltx/en_us_oca/he.h.m2:heHE.EnPetraMeTisPisteos.notmetered
ltx/en_us_oca/me.m01.d07:meMA.Ode3C1T.mode	@ltx/en_us_oca/miscellanea:misc.Mode2
ltx/en_us_oca/me.m01.d07:meMA.Ode3C1T.ode	@ltx/en_us_oca/miscellanea:misc.Ode3
ltx/en_us_oca/me.m01.d07:meMA.Ode3C1T.text	
ltx/en_us_oca/me.m01.d07:meMA.Ode3Kathisma1.greekmelody	@ltx/en_us_oca/he.a.m1:heAU.TonTafonSouSotir.greekname
ltx/en_us_oca/me.m01.d07:meMA.Ode3Kathisma1.incipit	…
ltx/en_us_oca/me.m01.d07:meMA.Ode3Kathisma1.melody	@ltx/en_us_oca/he.a.m1:heAU.TonTafonSouSotir.notmetered
ltx/en_us_oca/me.m01.d07:meMA.Ode3Kathisma1.mode	@ltx/en_us_oca/miscellanea:misc.Mode1
ltx/en_us_oca/me.m01.d07:meMA.Ode3Kathisma1.text	
ltx/en_us_oca/me.m01.d07:meMA.Ode3Kathisma2.greekmelody	@ltx/en_us_oca/he.a.m4:heAU.KateplagiIosif.greekname
ltx/en_us_oca/me.m01.d07:meMA.Ode3Kathisma2.incipit	…
ltx/en_us_oca/me.m01.d07:meMA.Ode3Kathisma2.melody	@ltx/en_us_oca/he.a.m4:heAU.KateplagiIosif.notmetered
ltx/en_us_oca/me.m01.d07:meMA.Ode3Kathisma2.mode	@ltx/en_us_oca/miscellanea:misc.Mode4
ltx/en_us_oca/me.m01.d07:meMA.Ode3Kathisma2.text	
ltx/en_us_oca/me.m01.d07:meMA.Ode4C11.greekmelody	@ltx/en_us_oca/he.h.m2:heHE.YmnoSeAkoi.greekname
ltx/en_us_oca/me.m01.d07:meMA.Ode4C11.incipit	…
ltx/en_us_oca/me.m01.d07:meMA.Ode4C11.melody	@ltx/en_us_oca/he.h.m2:heHE.YmnoSeAkoi.notmetered
ltx/en_us_oca/me.m01.d07:meMA.Ode4C11.mode	@ltx/en_us_oca/miscellanea:misc.Mode2
ltx/en_us_oca/me.m01.d07:meMA.Ode4C11.ode	@ltx/en_us_oca/miscellanea:misc.Ode4
ltx/en_us_oca/me.m01.d07:meMA.Ode4C11.text	
ltx/en_us_oca/me.m01.d07:meMA.Ode4C12.incipit	…
ltx/en_us_oca/me.m01.d07:meMA.Ode4C12.melody	@ltx/en_us_oca/he.h.m2:heHE.YmnoSeAkoi.notmetered
ltx/en_us_oca/me.m01.d07:meMA.Ode4C12.mode	@ltx/en_us_oca/miscellanea:misc.Mode2
ltx/en_us_oca/me.m01.d07:meMA.Ode4C12.ode	@ltx/en_us_oca/miscellanea:misc.Ode4
ltx/en_us_oca/me.m01.d07:meMA.Ode4C12.text	
ltx/en_us_oca/me.m01.d07:meMA.Ode4C13.incipit	…
ltx/en_us_oca/me.m01.d07:meMA.Ode4C13.melody	@ltx/en_us_oca/he.h.m2:heHE.YmnoSeAkoi.notmetered
ltx/en_us_oca/me.m01.d07:meMA.Ode4C13.mode	@ltx/en_us_oca/miscellanea:misc.Mode2
ltx/en_us_oca/me.m01.d07:meMA.Ode4C13.ode	@ltx/en_us_oca/miscellanea:misc.Ode4
ltx/en_us_oca/me.m01.d07:meMA.Ode4C13.text	
ltx/en_us_oca/me.m01.d07:meMA.Ode4C14.incipit	…
ltx/en_us_oca/me.m01.d07:meMA.Ode4C14.melody	@ltx/en_us_oca/he.h.m2:heHE.YmnoSeAkoi.notmetered
ltx/en_us_oca/me.m01.d07:meMA.Ode4C14.mode	@ltx/en_us_oca/miscellanea:misc.Mode2
ltx/en_us_oca/me.m01.d07:meMA.Ode4C14.ode	@ltx/en_us_oca/miscellanea:misc.Ode4
ltx/en_us_oca/me.m01.d07:meMA.Ode4C14.text	
ltx/en_us_oca/me.m01.d07:meMA.Ode4C1T.incipit	…
ltx/en_us_oca/me.m01.d07:meMA.Ode4C1T.melody	@ltx/en_us_oca/he.h.m2:heHE.YmnoSeAkoi.notmetered
ltx/en_us_oca/me.m01.d07:meMA.Ode4C1T.mode	@ltx/en_us_oca/miscellanea:misc.Mode2
ltx/en_us_oca/me.m01.d07:meMA.Ode4C1T.ode	@ltx/en_us_oca/miscellanea:misc.Ode4
ltx/en_us_oca/me.m01.d07:meMA.Ode4C1T.text	
ltx/en_us_oca/me.m01.d07:meMA.Ode5C11.greekmelody	@ltx/en_us_oca/he.h.m2:heHE.OFotismos.greekname
ltx/en_us_oca/me.m01.d07:meMA.Ode5C11.incipit	…
ltx/en_us_oca/me.m01.d07:meMA.Ode5C11.melody	@ltx/en_us_oca/he.h.m2:heHE.OFotismos.notmetered
ltx/en_us_oca/me.m01.d07:meMA.Ode5C11.mode	@ltx/en_us_oca/miscellanea:misc.Mode2
ltx/en_us_oca/me.m01.d07:meMA.Ode5C11.ode	@ltx/en_us_oca/miscellanea:misc.Ode5
ltx/en_us_oca/me.m01.d07:meMA.Ode5C11.text	
ltx/en_us_oca/me.m01.d07:meMA.Ode5C12.incipit	…
ltx/en_us_oca/me.m01.d07:meMA.Ode5C12.melody	@ltx/en_us_oca/he.h.m2:heHE.OFotismos.notmetered
ltx/en_us_oca/me.m01.d07:meMA.Ode5C12.mode	@ltx/en_us_oca/miscellanea:misc.Mode2
ltx/en_us_oca/me.m01.d07:meMA.Ode5C12.ode	@ltx/en_us_oca/miscellanea:misc.Ode5
ltx/en_us_oca/me.m01.d07:meMA.Ode5C12.text	
ltx/en_us_oca/me.m01.d07:meMA.Ode5C13.incipit	…
ltx/en_us_oca/me.m01.d07:meMA.Ode5C13.melody	@ltx/en_us_oca/he.h.m2:heHE.OFotismos.notmetered
ltx/en_us_oca/me.m01.d07:meMA.Ode5C13.mode	@ltx/en_us_oca/miscellanea:misc.Mode2
ltx/en_us_oca/me.m01.d07:meMA.Ode5C13.ode	@ltx/en_us_oca/miscellanea:misc.Ode5
ltx/en_us_oca/me.m01.d07:meMA.Ode5C13.text	
ltx/en_us_oca/me.m01.d07:meMA.Ode5C1T.incipit	…
ltx/en_us_oca/me.m01.d07:meMA.Ode5C1T.melody	@ltx/en_us_oca/he.h.m2:heHE.OFotismos.notmetered
ltx/en_us_oca/me.m01.d07:meMA.Ode5C1T.mode	@ltx/en_us_oca/miscellanea:misc.Mode2
ltx/en_us_oca/me.m01.d07:meMA.Ode5C1T.ode	@ltx/en_us_oca/miscellanea:misc.Ode5
ltx/en_us_oca/me.m01.d07:meMA.Ode5C1T.text	
ltx/en_us_oca/me.m01.d07:meMA.Ode6C11.greekmelody	@ltx/en_us_oca/he.h.m2:heHE.EnAvyssoPtaismaton.greekname
ltx/en_us_oca/me.m01.d07:meMA.Ode6C11.incipit	…
ltx/en_us_oca/me.m01.d07:meMA.Ode6C11.melody	@ltx/en_us_oca/he.h.m2:heHE.EnAvyssoPtaismaton.notmetered
ltx/en_us_oca/me.m01.d07:meMA.Ode6C11.mode	@ltx/en_us_oca/miscellanea:misc.Mode2
ltx/en_us_oca/me.m01.d07:meMA.Ode6C11.ode	@ltx/en_us_oca/miscellanea:misc.Ode6
ltx/en_us_oca/me.m01.d07:meMA.Ode6C11.text	
ltx/en_us_oca/me.m01.d07:meMA.Ode6C12.incipit	…
ltx/en_us_oca/me.m01.d07:meMA.Ode6C12.melody	@ltx/en_us_oca/he.h.m2:heHE.EnAvyssoPtaismaton.notmetered
ltx/en_us_oca/me.m01.d07:meMA.Ode6C12.mode	@ltx/en_us_oca/miscellanea:misc.Mode2
ltx/en_us_oca/me.m01.d07:meMA.Ode6C12.ode	@ltx/en_us_oca/miscellanea:misc.Ode6
ltx/en_us_oca/me.m01.d07:meMA.Ode6C12.text	
ltx/en_us_oca/me.m01.d07:meMA.Ode6C13.incipit	…
ltx/en_us_oca/me.m01.d07:meMA.Ode6C13.melody	@ltx/en_us_oca/he.h.m2:heHE.EnAvyssoPtaismaton.notmetered
ltx/en_us_oca/me.m01.d07:meMA.Ode6C13.mode	@ltx/en_us_oca/miscellanea:misc.Mode2
ltx/en_us_oca/me.m01.d07:meMA.Ode6C13.ode	@ltx/en_us_oca/miscellanea:misc.Ode6
ltx/en_us_oca/me.m01.d07:meMA.Ode6C13.text	
ltx/en_us_oca/me.m01.d07:meMA.Ode6C1T.incipit	…
ltx/en_us_oca/me.m01.d07:meMA.Ode6C1T.melody	@ltx/en_us_oca/he.h.m2:heHE.EnAvyssoPtaismaton.notmetered
ltx/en_us_oca/me.m01.d07:meMA.Ode6C1T.mode	@ltx/en_us_oca/miscellanea:misc.Mode2
ltx/en_us_oca/me.m01.d07:meMA.Ode6C1T.ode	@ltx/en_us_oca/miscellanea:misc.Ode6
ltx/en_us_oca/me.m01.d07:meMA.Ode6C1T.text	
ltx/en_us_oca/me.m01.d07:meMA.Ode7C11.greekmelody	@ltx/en_us_oca/he.h.m2:heHE.VatosEnOrei.greekname
ltx/en_us_oca/me.m01.d07:meMA.Ode7C11.incipit	…
ltx/en_us_oca/me.m01.d07:meMA.Ode7C11.melody	@ltx/en_us_oca/he.h.m2:heHE.VatosEnOrei.notmetered
ltx/en_us_oca/me.m01.d07:meMA.Ode7C11.mode	@ltx/en_us_oca/miscellanea:misc.Mode2
ltx/en_us_oca/me.m01.d07:meMA.Ode7C11.ode	@ltx/en_us_oca/miscellanea:misc.Ode7
ltx/en_us_oca/me.m01.d07:meMA.Ode7C11.text	
ltx/en_us_oca/me.m01.d07:meMA.Ode7C12.incipit	…
ltx/en_us_oca/me.m01.d07:meMA.Ode7C12.melody	@ltx/en_us_oca/he.h.m2:heHE.VatosEnOrei.notmetered
ltx/en_us_oca/me.m01.d07:meMA.Ode7C12.mode	@ltx/en_us_oca/miscellanea:misc.Mode2
ltx/en_us_oca/me.m01.d07:meMA.Ode7C12.ode	@ltx/en_us_oca/miscellanea:misc.Ode7
ltx/en_us_oca/me.m01.d07:meMA.Ode7C12.text	
ltx/en_us_oca/me.m01.d07:meMA.Ode7C13.incipit	…
ltx/en_us_oca/me.m01.d07:meMA.Ode7C13.melody	@ltx/en_us_oca/he.h.m2:heHE.VatosEnOrei.notmetered
ltx/en_us_oca/me.m01.d07:meMA.Ode7C13.mode	@ltx/en_us_oca/miscellanea:misc.Mode2
ltx/en_us_oca/me.m01.d07:meMA.Ode7C13.ode	@ltx/en_us_oca/miscellanea:misc.Ode7
ltx/en_us_oca/me.m01.d07:meMA.Ode7C13.text	
ltx/en_us_oca/me.m01.d07:meMA.Ode7C1T.incipit	…
ltx/en_us_oca/me.m01.d07:meMA.Ode7C1T.melody	@ltx/en_us_oca/he.h.m2:heHE.VatosEnOrei.notmetered
ltx/en_us_oca/me.m01.d07:meMA.Ode7C1T.mode	@ltx/en_us_oca/miscellanea:misc.Mode2
ltx/en_us_oca/me.m01.d07:meMA.Ode7C1T.ode	@ltx/en_us_oca/miscellanea:misc.Ode7
ltx/en_us_oca/me.m01.d07:meMA.Ode7C1T.text	
ltx/en_us_oca/me.m01.d07:meMA.Ode8C11.greekmelody	@ltx/en_us_oca/he.h.m2:heHE.KaminosPote.greekname
ltx/en_us_oca/me.m01.d07:meMA.Ode8C11.incipit	…
ltx/en_us_oca/me.m01.d07:meMA.Ode8C11.melody	@ltx/en_us_oca/he.h.m2:heHE.KaminosPote.notmetered
ltx/en_us_oca/me.m01.d07:meMA.Ode8C11.mode	@ltx/en_us_oca/miscellanea:misc.Mode2
ltx/en_us_oca/me.m01.d07:meMA.Ode8C11.ode	@ltx/en_us_oca/miscellanea:misc.Ode8
ltx/en_us_oca/me.m01.d07:meMA.Ode8C11.text	
ltx/en_us_oca/me.m01.d07:meMA.Ode8C12.incipit	…
ltx/en_us_oca/me.m01.d07:meMA.Ode8C12.melody	@ltx/en_us_oca/he.h.m2:heHE.KaminosPote.notmetered
ltx/en_us_oca/me.m01.d07:meMA.Ode8C12.mode	@ltx/en_us_oca/miscellanea:misc.Mode2
ltx/en_us_oca/me.m01.d07:meMA.Ode8C12.ode	@ltx/en_us_oca/miscellanea:misc.Ode8
ltx/en_us_oca/me.m01.d07:meMA.Ode8C12.text	
ltx/en_us_oca/me.m01.d07:meMA.Ode8C13.incipit	…
ltx/en_us_oca/me.m01.d07:meMA.Ode8C13.melody	@ltx/en_us_oca/he.h.m2:heHE.KaminosPote.notmetered
ltx/en_us_oca/me.m01.d07:meMA.Ode8C13.mode	@ltx/en_us_oca/miscellanea:misc.Mode2
ltx/en_us_oca/me.m01.d07:meMA.Ode8C13.ode	@ltx/en_us_oca/miscellanea:misc.Ode8
ltx/en_us_oca/me.m01.d07:meMA.Ode8C13.text	
ltx/en_us_oca/me.m01.d07:meMA.Ode8C14.incipit	…
ltx/en_us_oca/me.m01.d07:meMA.Ode8C14.melody	@ltx/en_us_oca/he.h.m2:heHE.KaminosPote.notmetered
ltx/en_us_oca/me.m01.d07:meMA.Ode8C14.mode	@ltx/en_us_oca/miscellanea:misc.Mode2
ltx/en_us_oca/me.m01.d07:meMA.Ode8C14.ode	@ltx/en_us_oca/miscellanea:misc.Ode8
ltx/en_us_oca/me.m01.d07:meMA.Ode8C14.text	
ltx/en_us_oca/me.m01.d07:meMA.Ode8C1T.incipit	…
ltx/en_us_oca/me.m01.d07:meMA.Ode8C1T.melody	@ltx/en_us_oca/he.h.m2:heHE.KaminosPote.notmetered
ltx/en_us_oca/me.m01.d07:meMA.Ode8C1T.mode	@ltx/en_us_oca/miscellanea:misc.Mode2
ltx/en_us_oca/me.m01.d07:meMA.Ode8C1T.ode	@ltx/en_us_oca/miscellanea:misc.Ode8
ltx/en_us_oca/me.m01.d07:meMA.Ode8C1T.text	
ltx/en_us_oca/me.m01.d07:meMA.Ode9C11.greekmelody	@ltx/en_us_oca/he.h.m2:heHE.ITonProIliouFostira.greekname
ltx/en_us_oca/me.m01.d07:meMA.Ode9C11.incipit	…
ltx/en_us_oca/me.m01.d07:meMA.Ode9C11.melody	@ltx/en_us_oca/he.h.m2:heHE.ITonProIliouFostira.notmetered
ltx/en_us_oca/me.m01.d07:meMA.Ode9C11.mode	@ltx/en_us_oca/miscellanea:misc.Mode2
ltx/en_us_oca/me.m01.d07:meMA.Ode9C11.ode	@ltx/en_us_oca/miscellanea:misc.Ode9
ltx/en_us_oca/me.m01.d07:meMA.Ode9C11.text	
ltx/en_us_oca/me.m01.d07:meMA.Ode9C12.incipit	…
ltx/en_us_oca/me.m01.d07:meMA.Ode9C12.melody	@ltx/en_us_oca/he.h.m2:heHE.ITonProIliouFostira.notmetered
ltx/en_us_oca/me.m01.d07:meMA.Ode9C12.mode	@ltx/en_us_oca/miscellanea:misc.Mode2
ltx/en_us_oca/me.m01.d07:meMA.Ode9C12.ode	@ltx/en_us_oca/miscellanea:misc.Ode9
ltx/en_us_oca/me.m01.d07:meMA.Ode9C12.text	
ltx/en_us_oca/me.m01.d07:meMA.Ode9C13.incipit	…
ltx/en_us_oca/me.m01.d07:meMA.Ode9C13.melody	@ltx/en_us_oca/he.h.m2:heHE.ITonProIliouFostira.notmetered
ltx/en_us_oca/me.m01.d07:meMA.Ode9C13.mode	@ltx/en_us_oca/miscellanea:misc.Mode2
ltx/en_us_oca/me.m01.d07:meMA.Ode9C13.ode	@ltx/en_us_oca/miscellanea:misc.Ode9
ltx/en_us_oca/me.m01.d07:meMA.Ode9C13.text	
ltx/en_us_oca/me.m01.d07:meMA.Ode9C1T.incipit	…
ltx/en_us_oca/me.m01.d07:meMA.Ode9C1T.melody	@ltx/en_us_oca/he.h.m2:heHE.ITonProIliouFostira.notmetered
ltx/en_us_oca/me.m01.d07:meMA.Ode9C1T.mode	@ltx/en_us_oca/miscellanea:misc.Mode2
ltx/en_us_oca/me.m01.d07:meMA.Ode9C1T.ode	@ltx/en_us_oca/miscellanea:misc.Ode9
ltx/en_us_oca/me.m01.d07:meMA.Ode9C1T.text	
ltx/en_us_oca/me.m01.d07:meMA.Oikos1.text	
ltx/en_us_oca/me.m01.d07:meVE.Apolytikion1.incipit	@ltx/en_us_oca/me.m08.d29:meVE.Apolytikion1.incipit
ltx/en_us_oca/me.m01.d07:meVE.Apolytikion1.melody	
ltx/en_us_oca/me.m01.d07:meVE.Apolytikion1.mode	@ltx/en_us_oca/me.m08.d29:meVE.Apolytikion1.mode
ltx/en_us_oca/me.m01.d07:meVE.Apolytikion1.text	@ltx/en_us_oca/me.m08.d29:meVE.Apolytikion1.text
ltx/en_us_oca/me.m01.d07:meVE.AposBoth.incipit	@ltx/en_us_oca/me.m01.d06:meVE.Lity3.incipit
ltx/en_us_oca/me.m01.d07:meVE.AposBoth.melody	
ltx/en_us_oca/me.m01.d07:meVE.AposBoth.mode	@ltx/en_us_oca/miscellanea:misc.Mode4
ltx/en_us_oca/me.m01.d07:meVE.AposBoth.poet	@ltx/en_us_oca/poets:po.KosmaMonachou
ltx/en_us_oca/me.m01.d07:meVE.AposBoth.text	@ltx/en_us_oca/me.m01.d06:meVE.Lity3.text
ltx/en_us_oca/me.m01.d07:meVE.AposGlory.incipit	As the lover of the…
ltx/en_us_oca/me.m01.d07:meVE.AposGlory.melody	
ltx/en_us_oca/me.m01.d07:meVE.AposGlory.mode	@ltx/en_us_oca/miscellanea:misc.Mode4
ltx/en_us_oca/me.m01.d07:meVE.AposGlory.poet	@ltx/en_us_oca/poets:po.Vyzantos
ltx/en_us_oca/me.m01.d07:meVE.AposGlory.text	As the lover of the Spirit, ⁄ the swallow that brings divine tidings of grace, Forerunner, ⁄ you have made known clearly to mankind the dispensation of the King, ⁄ Who shone forth in brightness from a pure Virgin for the restoration of mankind. ⁄ You banish the dominion of dark and evil ways, ⁄ and guide the hearts of those baptized in repentance to eternal life, ⁄⁄ blessed prophet inspired by God!
ltx/en_us_oca/me.m01.d07:meVE.Aposticha1.greekmelody	@ltx/en_us_oca/he.a.m4:heAU.EdokasSimeiosin.greekname
ltx/en_us_oca/me.m01.d07:meVE.Aposticha1.incipit	When he saw You draw…
ltx/en_us_oca/me.m01.d07:meVE.Aposticha1.melody	@ltx/en_us_oca/he.a.m4:heAU.EdokasSimeiosin.notmetered
ltx/en_us_oca/me.m01.d07:meVE.Aposticha1.mode	@ltx/en_us_oca/miscellanea:misc.Mode4
ltx/en_us_oca/me.m01.d07:meVE.Aposticha1.text	When he saw You draw near to him, Master, ⁄ John the Forerunner was amazed, ⁄ and as a faithful servant he cried out in fear: ⁄ Savior, what is this humility?⁄ What is this poverty You have put on? ⁄ In the wealth of Your goodness and compassion, ⁄ You have raised up man from his humiliation, ⁄⁄ by clothing Yourself in him!
ltx/en_us_oca/me.m01.d07:meVE.Aposticha2.incipit	Come to me this day…
ltx/en_us_oca/me.m01.d07:meVE.Aposticha2.melody	@ltx/en_us_oca/he.a.m4:heAU.EdokasSimeiosin.notmetered
ltx/en_us_oca/me.m01.d07:meVE.Aposticha2.mode	@ltx/en_us_oca/miscellanea:misc.Mode4
ltx/en_us_oca/me.m01.d07:meVE.Aposticha2.text	Come to me this day, ⁄ The Savior of all replied to the Forerunner, ⁄ For I bring to pass a mystery. ⁄ Serve me with trembling, yet do not draw back in fear. ⁄ For undefiled by nature, ⁄ I stand now before you in the waters of the Jordan and am baptized as Man: ⁄⁄ I renew Adam, who was shattered by sin.
ltx/en_us_oca/me.m01.d07:meVE.Aposticha3.incipit	Who among men, Replied John…
ltx/en_us_oca/me.m01.d07:meVE.Aposticha3.melody	@ltx/en_us_oca/he.a.m4:heAU.EdokasSimeiosin.notmetered
ltx/en_us_oca/me.m01.d07:meVE.Aposticha3.mode	@ltx/en_us_oca/miscellanea:misc.Mode4
ltx/en_us_oca/me.m01.d07:meVE.Aposticha3.text	Who among men, Replied John, Has seen the sun being cleansed, ⁄ and the One Who covered the heaven with clouds stripped naked? ⁄ Who has seen the One Who made the springs and rivers, ⁄ Himself enter the waters? ⁄ I stand amazed at Your ineffable dispensation, Master. ⁄⁄ Do not burden Your servant with fearful commands!
ltx/en_us_oca/me.m01.d07:meVE.SticBoth.incipit	@ltx/en_us_oca/me.m01.d06:meMA.PostGospelIdiomelon.incipit
ltx/en_us_oca/me.m01.d07:meVE.SticBoth.melody	
ltx/en_us_oca/me.m01.d07:meVE.SticBoth.mode	@ltx/en_us_oca/miscellanea:misc.Mode6
ltx/en_us_oca/me.m01.d07:meVE.SticBoth.poet	@ltx/en_us_oca/poets:po.Theofanous
ltx/en_us_oca/me.m01.d07:meVE.SticBoth.text	@ltx/en_us_oca/me.m01.d06:meMA.PostGospelIdiomelon.text
ltx/en_us_oca/me.m01.d07:meVE.SticGlory.incipit	Light in the flesh and…
ltx/en_us_oca/me.m01.d07:meVE.SticGlory.melody	
ltx/en_us_oca/me.m01.d07:meVE.SticGlory.mode	@ltx/en_us_oca/miscellanea:misc.Mode6
ltx/en_us_oca/me.m01.d07:meVE.SticGlory.poet	@ltx/en_us_oca/poets:po.Vyzantiou
ltx/en_us_oca/me.m01.d07:meVE.SticGlory.text	Light in the flesh and Forerunner of the Savior, ⁄ offspring of a barren mother. ⁄ and friend of the One born of a Virgin, ⁄ you have worshipped Him by leaping in the womb, ⁄ and have baptized him in the waters of the Jordan. ⁄ We entreat you to intercede with Him, prophet, ⁄⁄ that we may escape from the mighty tempests to come!
ltx/en_us_oca/me.m01.d07:meVE.Stichera01.incipit	@ltx/en_us_oca/me.m01.d06:meVE.Stichera01.incipit
ltx/en_us_oca/me.m01.d07:meVE.Stichera01.melody	
ltx/en_us_oca/me.m01.d07:meVE.Stichera01.mode	@ltx/en_us_oca/miscellanea:misc.Mode2
ltx/en_us_oca/me.m01.d07:meVE.Stichera01.poet	@ltx/en_us_oca/poets:po.IoannouMonachou
ltx/en_us_oca/me.m01.d07:meVE.Stichera01.text	@ltx/en_us_oca/me.m01.d06:meVE.Stichera01.text
ltx/en_us_oca/me.m01.d07:meVE.Stichera02.incipit	@ltx/en_us_oca/me.m01.d06:meVE.Stichera02.incipit
ltx/en_us_oca/me.m01.d07:meVE.Stichera02.melody	
ltx/en_us_oca/me.m01.d07:meVE.Stichera02.mode	@ltx/en_us_oca/miscellanea:misc.Mode2
ltx/en_us_oca/me.m01.d07:meVE.Stichera02.text	@ltx/en_us_oca/me.m01.d06:meVE.Stichera02.text
ltx/en_us_oca/me.m01.d07:meVE.Stichera03.incipit	@ltx/en_us_oca/me.m01.d06:meVE.Stichera03.incipit
ltx/en_us_oca/me.m01.d07:meVE.Stichera03.melody	
ltx/en_us_oca/me.m01.d07:meVE.Stichera03.mode	@ltx/en_us_oca/miscellanea:misc.Mode2
ltx/en_us_oca/me.m01.d07:meVE.Stichera03.text	@ltx/en_us_oca/me.m01.d06:meVE.Stichera03.text
ltx/en_us_oca/me.m01.d07:meVE.Stichera04.greekmelody	@ltx/en_us_oca/he.a.m1:heAU.PaneffimoiMartyres.greekname
ltx/en_us_oca/me.m01.d07:meVE.Stichera04.incipit	…
ltx/en_us_oca/me.m01.d07:meVE.Stichera04.melody	@ltx/en_us_oca/he.a.m1:heAU.PaneffimoiMartyres.notmetered
ltx/en_us_oca/me.m01.d07:meVE.Stichera04.mode	@ltx/en_us_oca/miscellanea:misc.Mode1
ltx/en_us_oca/me.m01.d07:meVE.Stichera04.text	
ltx/en_us_oca/me.m01.d07:meVE.Stichera05.incipit	…
ltx/en_us_oca/me.m01.d07:meVE.Stichera05.melody	@ltx/en_us_oca/he.a.m1:heAU.PaneffimoiMartyres.notmetered
ltx/en_us_oca/me.m01.d07:meVE.Stichera05.mode	@ltx/en_us_oca/miscellanea:misc.Mode1
ltx/en_us_oca/me.m01.d07:meVE.Stichera05.text	
ltx/en_us_oca/me.m01.d07:meVE.Stichera06.incipit	…
ltx/en_us_oca/me.m01.d07:meVE.Stichera06.melody	@ltx/en_us_oca/he.a.m1:heAU.PaneffimoiMartyres.notmetered
ltx/en_us_oca/me.m01.d07:meVE.Stichera06.mode	@ltx/en_us_oca/miscellanea:misc.Mode1
ltx/en_us_oca/me.m01.d07:meVE.Stichera06.text	
