ltx/en_us_oca/me.m09.d05:meDA.commemoration.first	
ltx/en_us_oca/me.m09.d05:meDA.commemoration.first_name	
ltx/en_us_oca/me.m09.d05:meDA.commemoration.first_short	
ltx/en_us_oca/me.m09.d05:meDA.commemoration.first_title	
ltx/en_us_oca/me.m09.d05:meDA.commemoration.full	
ltx/en_us_oca/me.m09.d05:meDA.commemoration.second_name	
ltx/en_us_oca/me.m09.d05:meDA.commemoration.second_title	
ltx/en_us_oca/me.m09.d05:meDA.date	
ltx/en_us_oca/me.m09.d05:meDA.fordate	
ltx/en_us_oca/me.m09.d05:meDA.insert1	
ltx/en_us_oca/me.m09.d05:meDA.insert2	
ltx/en_us_oca/me.m09.d05:meDA.note	
ltx/en_us_oca/me.m09.d05:meDA.pdfcoverdate	
ltx/en_us_oca/me.m09.d05:meDA.pdfheaderdate	
ltx/en_us_oca/me.m09.d05:meHO.commemorations	
ltx/en_us_oca/me.m09.d05:meHO.note1	
ltx/en_us_oca/me.m09.d05:meHO.note2	
ltx/en_us_oca/me.m09.d05:meHO.number	
ltx/en_us_oca/me.m09.d05:meHO.rank	
ltx/en_us_oca/me.m09.d05:meLE.commemoration1	
ltx/en_us_oca/me.m09.d05:meLE.commemoration2	
ltx/en_us_oca/me.m09.d05:meLI.Kontakion1.greekmelody	@ltx/en_us_oca/me.m09.d05:meMA.Kontakion1.greekmelody
ltx/en_us_oca/me.m09.d05:meLI.Kontakion1.incipit	@ltx/en_us_oca/me.m09.d05:meMA.Kontakion1.incipit
ltx/en_us_oca/me.m09.d05:meLI.Kontakion1.melody	@ltx/en_us_oca/me.m09.d05:meMA.Kontakion1.melody
ltx/en_us_oca/me.m09.d05:meLI.Kontakion1.mode	@ltx/en_us_oca/me.m09.d05:meMA.Kontakion1.mode
ltx/en_us_oca/me.m09.d05:meLI.Kontakion1.text	@ltx/en_us_oca/me.m09.d05:meMA.Kontakion1.text
ltx/en_us_oca/me.m09.d05:meLI.MM.CommunionHymn.text	@ltx/en_us_oca/properties:media.key
ltx/en_us_oca/me.m09.d05:meLI.Megalynarion.text	
ltx/en_us_oca/me.m09.d05:meMA.C1.acrostic.notice1	
ltx/en_us_oca/me.m09.d05:meMA.C1.acrostic.text	
ltx/en_us_oca/me.m09.d05:meMA.C1.acrostic.title	
ltx/en_us_oca/me.m09.d05:meMA.C1.poet	@ltx/en_us_oca/poets:po.Theofanous
ltx/en_us_oca/me.m09.d05:meMA.C1.title	@ltx/en_us_oca/titles:ti.CanonProphet
ltx/en_us_oca/me.m09.d05:meMA.C1.verse	@ltx/en_us_oca/prayers:pr.verse_Prophet.text
ltx/en_us_oca/me.m09.d05:meMA.ExapTheotokion.incipit	…
ltx/en_us_oca/me.m09.d05:meMA.ExapTheotokion.melody	@ltx/en_us_oca/he.a.m2:heAU.GynaikesAkoutisthite.notmetered
ltx/en_us_oca/me.m09.d05:meMA.ExapTheotokion.mode	@ltx/en_us_oca/miscellanea:misc.Mode2
ltx/en_us_oca/me.m09.d05:meMA.ExapTheotokion.text	
ltx/en_us_oca/me.m09.d05:meMA.Exaposteilarion1.greekmelody	@ltx/en_us_oca/he.a.m2:heAU.GynaikesAkoutisthite.greekname
ltx/en_us_oca/me.m09.d05:meMA.Exaposteilarion1.incipit	…
ltx/en_us_oca/me.m09.d05:meMA.Exaposteilarion1.melody	@ltx/en_us_oca/he.a.m2:heAU.GynaikesAkoutisthite.notmetered
ltx/en_us_oca/me.m09.d05:meMA.Exaposteilarion1.mode	@ltx/en_us_oca/miscellanea:misc.Mode2
ltx/en_us_oca/me.m09.d05:meMA.Exaposteilarion1.text	
ltx/en_us_oca/me.m09.d05:meMA.Kontakion1.greekmelody	@ltx/en_us_oca/he.a.m3:heAU.IParthenosSimeron.greekname
ltx/en_us_oca/me.m09.d05:meMA.Kontakion1.incipit	Today the prophet Zachariah…
ltx/en_us_oca/me.m09.d05:meMA.Kontakion1.melody	@ltx/en_us_oca/he.a.m3:heAU.IParthenosSimeron.notmetered
ltx/en_us_oca/me.m09.d05:meMA.Kontakion1.mode	@ltx/en_us_oca/miscellanea:misc.Mode3
ltx/en_us_oca/me.m09.d05:meMA.Kontakion1.text	Today the prophet Zachariah, priest of the Most High ⁄ and father of the Forerunner ⁄ has prepared a banquet on behalf of the faithful ⁄ and mixed the drink of holiness! ⁄⁄ Therefore we praise him as a seer of the mysteries of the grace of God!
ltx/en_us_oca/me.m09.d05:meMA.MM.VeApos1123as5678.text	@ltx/en_us_oca/properties:media.key
ltx/en_us_oca/me.m09.d05:meMA.Ode1C11.greekmelody	@ltx/en_us_oca/he.h.m8:heHE.YgranDiodefsas.greekname
ltx/en_us_oca/me.m09.d05:meMA.Ode1C11.incipit	…
ltx/en_us_oca/me.m09.d05:meMA.Ode1C11.melody	@ltx/en_us_oca/he.h.m8:heHE.YgranDiodefsas.notmetered
ltx/en_us_oca/me.m09.d05:meMA.Ode1C11.mode	@ltx/en_us_oca/miscellanea:misc.Mode8
ltx/en_us_oca/me.m09.d05:meMA.Ode1C11.ode	@ltx/en_us_oca/miscellanea:misc.Ode1
ltx/en_us_oca/me.m09.d05:meMA.Ode1C11.text	
ltx/en_us_oca/me.m09.d05:meMA.Ode1C12.incipit	…
ltx/en_us_oca/me.m09.d05:meMA.Ode1C12.melody	@ltx/en_us_oca/he.h.m8:heHE.YgranDiodefsas.notmetered
ltx/en_us_oca/me.m09.d05:meMA.Ode1C12.mode	@ltx/en_us_oca/miscellanea:misc.Mode8
ltx/en_us_oca/me.m09.d05:meMA.Ode1C12.ode	@ltx/en_us_oca/miscellanea:misc.Ode1
ltx/en_us_oca/me.m09.d05:meMA.Ode1C12.text	
ltx/en_us_oca/me.m09.d05:meMA.Ode1C13.incipit	…
ltx/en_us_oca/me.m09.d05:meMA.Ode1C13.melody	@ltx/en_us_oca/he.h.m8:heHE.YgranDiodefsas.notmetered
ltx/en_us_oca/me.m09.d05:meMA.Ode1C13.mode	@ltx/en_us_oca/miscellanea:misc.Mode8
ltx/en_us_oca/me.m09.d05:meMA.Ode1C13.ode	@ltx/en_us_oca/miscellanea:misc.Ode1
ltx/en_us_oca/me.m09.d05:meMA.Ode1C13.text	
ltx/en_us_oca/me.m09.d05:meMA.Ode1C1T.incipit	…
ltx/en_us_oca/me.m09.d05:meMA.Ode1C1T.melody	@ltx/en_us_oca/he.h.m8:heHE.YgranDiodefsas.notmetered
ltx/en_us_oca/me.m09.d05:meMA.Ode1C1T.mode	@ltx/en_us_oca/miscellanea:misc.Mode8
ltx/en_us_oca/me.m09.d05:meMA.Ode1C1T.ode	@ltx/en_us_oca/miscellanea:misc.Ode1
ltx/en_us_oca/me.m09.d05:meMA.Ode1C1T.text	
ltx/en_us_oca/me.m09.d05:meMA.Ode3C11.greekmelody	@ltx/en_us_oca/he.h.m8:heHE.SyEiToStereoma.greekname
ltx/en_us_oca/me.m09.d05:meMA.Ode3C11.incipit	…
ltx/en_us_oca/me.m09.d05:meMA.Ode3C11.melody	@ltx/en_us_oca/he.h.m8:heHE.SyEiToStereoma.notmetered
ltx/en_us_oca/me.m09.d05:meMA.Ode3C11.mode	@ltx/en_us_oca/miscellanea:misc.Mode8
ltx/en_us_oca/me.m09.d05:meMA.Ode3C11.ode	@ltx/en_us_oca/miscellanea:misc.Ode3
ltx/en_us_oca/me.m09.d05:meMA.Ode3C11.text	
ltx/en_us_oca/me.m09.d05:meMA.Ode3C12.incipit	…
ltx/en_us_oca/me.m09.d05:meMA.Ode3C12.melody	@ltx/en_us_oca/he.h.m8:heHE.SyEiToStereoma.notmetered
ltx/en_us_oca/me.m09.d05:meMA.Ode3C12.mode	@ltx/en_us_oca/miscellanea:misc.Mode8
ltx/en_us_oca/me.m09.d05:meMA.Ode3C12.ode	@ltx/en_us_oca/miscellanea:misc.Ode3
ltx/en_us_oca/me.m09.d05:meMA.Ode3C12.text	
ltx/en_us_oca/me.m09.d05:meMA.Ode3C13.incipit	…
ltx/en_us_oca/me.m09.d05:meMA.Ode3C13.melody	@ltx/en_us_oca/he.h.m8:heHE.SyEiToStereoma.notmetered
ltx/en_us_oca/me.m09.d05:meMA.Ode3C13.mode	@ltx/en_us_oca/miscellanea:misc.Mode8
ltx/en_us_oca/me.m09.d05:meMA.Ode3C13.ode	@ltx/en_us_oca/miscellanea:misc.Ode3
ltx/en_us_oca/me.m09.d05:meMA.Ode3C13.text	
ltx/en_us_oca/me.m09.d05:meMA.Ode3C1T.incipit	…
ltx/en_us_oca/me.m09.d05:meMA.Ode3C1T.melody	@ltx/en_us_oca/he.h.m8:heHE.SyEiToStereoma.notmetered
ltx/en_us_oca/me.m09.d05:meMA.Ode3C1T.mode	@ltx/en_us_oca/miscellanea:misc.Mode8
ltx/en_us_oca/me.m09.d05:meMA.Ode3C1T.ode	@ltx/en_us_oca/miscellanea:misc.Ode3
ltx/en_us_oca/me.m09.d05:meMA.Ode3C1T.text	
ltx/en_us_oca/me.m09.d05:meMA.Ode3H.greekmelody	@ltx/en_us_oca/he.h.m8:heHE.SyEiToStereoma.greekname
ltx/en_us_oca/me.m09.d05:meMA.Ode3H.incipit	@ltx/en_us_oca/he.h.m8:heHE.SyEiToStereoma.incipit
ltx/en_us_oca/me.m09.d05:meMA.Ode3H.melody	@ltx/en_us_oca/he.h.m8:heHE.SyEiToStereoma.melody
ltx/en_us_oca/me.m09.d05:meMA.Ode3H.mode	@ltx/en_us_oca/miscellanea:misc.Mode8
ltx/en_us_oca/me.m09.d05:meMA.Ode3H.ode	@ltx/en_us_oca/miscellanea:misc.Ode3
ltx/en_us_oca/me.m09.d05:meMA.Ode3H.text	@ltx/en_us_oca/he.h.m8:heHE.SyEiToStereoma.text
ltx/en_us_oca/me.m09.d05:meMA.Ode3Kathisma1.greekmelody	@ltx/en_us_oca/he.a.m8:heAU.ToProstachthen.greekname
ltx/en_us_oca/me.m09.d05:meMA.Ode3Kathisma1.incipit	…
ltx/en_us_oca/me.m09.d05:meMA.Ode3Kathisma1.melody	@ltx/en_us_oca/he.a.m8:heAU.ToProstachthen.notmetered
ltx/en_us_oca/me.m09.d05:meMA.Ode3Kathisma1.mode	@ltx/en_us_oca/miscellanea:misc.Mode8
ltx/en_us_oca/me.m09.d05:meMA.Ode3Kathisma1.text	
ltx/en_us_oca/me.m09.d05:meMA.Ode3Kathisma2.greekmelody	@ltx/en_us_oca/he.a.m8:heAU.ToProstachthen.greekname
ltx/en_us_oca/me.m09.d05:meMA.Ode3Kathisma2.incipit	…
ltx/en_us_oca/me.m09.d05:meMA.Ode3Kathisma2.melody	@ltx/en_us_oca/he.a.m8:heAU.ToProstachthen.notmetered
ltx/en_us_oca/me.m09.d05:meMA.Ode3Kathisma2.mode	@ltx/en_us_oca/miscellanea:misc.Mode8
ltx/en_us_oca/me.m09.d05:meMA.Ode3Kathisma2.text	
ltx/en_us_oca/me.m09.d05:meMA.Ode3KathismaSt.incipit	…
ltx/en_us_oca/me.m09.d05:meMA.Ode3KathismaSt.melody	@ltx/en_us_oca/he.a.m8:heAU.ToProstachthen.notmetered
ltx/en_us_oca/me.m09.d05:meMA.Ode3KathismaSt.mode	@ltx/en_us_oca/miscellanea:misc.Mode8
ltx/en_us_oca/me.m09.d05:meMA.Ode3KathismaSt.text	
ltx/en_us_oca/me.m09.d05:meMA.Ode3KathismaT.incipit	…
ltx/en_us_oca/me.m09.d05:meMA.Ode3KathismaT.melody	@ltx/en_us_oca/he.a.m8:heAU.ToProstachthen.notmetered
ltx/en_us_oca/me.m09.d05:meMA.Ode3KathismaT.mode	@ltx/en_us_oca/miscellanea:misc.Mode8
ltx/en_us_oca/me.m09.d05:meMA.Ode3KathismaT.text	
ltx/en_us_oca/me.m09.d05:meMA.Ode4C11.greekmelody	@ltx/en_us_oca/he.h.m8:heHE.EisakikoaKyrie.greekname
ltx/en_us_oca/me.m09.d05:meMA.Ode4C11.incipit	…
ltx/en_us_oca/me.m09.d05:meMA.Ode4C11.melody	@ltx/en_us_oca/he.h.m8:heHE.EisakikoaKyrie.notmetered
ltx/en_us_oca/me.m09.d05:meMA.Ode4C11.mode	@ltx/en_us_oca/miscellanea:misc.Mode8
ltx/en_us_oca/me.m09.d05:meMA.Ode4C11.ode	@ltx/en_us_oca/miscellanea:misc.Ode4
ltx/en_us_oca/me.m09.d05:meMA.Ode4C11.text	
ltx/en_us_oca/me.m09.d05:meMA.Ode4C12.incipit	…
ltx/en_us_oca/me.m09.d05:meMA.Ode4C12.melody	@ltx/en_us_oca/he.h.m8:heHE.EisakikoaKyrie.notmetered
ltx/en_us_oca/me.m09.d05:meMA.Ode4C12.mode	@ltx/en_us_oca/miscellanea:misc.Mode8
ltx/en_us_oca/me.m09.d05:meMA.Ode4C12.ode	@ltx/en_us_oca/miscellanea:misc.Ode4
ltx/en_us_oca/me.m09.d05:meMA.Ode4C12.text	
ltx/en_us_oca/me.m09.d05:meMA.Ode4C13.incipit	…
ltx/en_us_oca/me.m09.d05:meMA.Ode4C13.melody	@ltx/en_us_oca/he.h.m8:heHE.EisakikoaKyrie.notmetered
ltx/en_us_oca/me.m09.d05:meMA.Ode4C13.mode	@ltx/en_us_oca/miscellanea:misc.Mode8
ltx/en_us_oca/me.m09.d05:meMA.Ode4C13.ode	@ltx/en_us_oca/miscellanea:misc.Ode4
ltx/en_us_oca/me.m09.d05:meMA.Ode4C13.text	
ltx/en_us_oca/me.m09.d05:meMA.Ode4C1T.incipit	…
ltx/en_us_oca/me.m09.d05:meMA.Ode4C1T.melody	@ltx/en_us_oca/he.h.m8:heHE.EisakikoaKyrie.notmetered
ltx/en_us_oca/me.m09.d05:meMA.Ode4C1T.mode	@ltx/en_us_oca/miscellanea:misc.Mode8
ltx/en_us_oca/me.m09.d05:meMA.Ode4C1T.ode	@ltx/en_us_oca/miscellanea:misc.Ode4
ltx/en_us_oca/me.m09.d05:meMA.Ode4C1T.text	
ltx/en_us_oca/me.m09.d05:meMA.Ode5C11.greekmelody	@ltx/en_us_oca/he.h.m8:heHE.OrthrizontesVoomenSoi.greekname
ltx/en_us_oca/me.m09.d05:meMA.Ode5C11.incipit	…
ltx/en_us_oca/me.m09.d05:meMA.Ode5C11.melody	@ltx/en_us_oca/he.h.m8:heHE.OrthrizontesVoomenSoi.notmetered
ltx/en_us_oca/me.m09.d05:meMA.Ode5C11.mode	@ltx/en_us_oca/miscellanea:misc.Mode8
ltx/en_us_oca/me.m09.d05:meMA.Ode5C11.ode	@ltx/en_us_oca/miscellanea:misc.Ode5
ltx/en_us_oca/me.m09.d05:meMA.Ode5C11.text	
ltx/en_us_oca/me.m09.d05:meMA.Ode5C12.incipit	…
ltx/en_us_oca/me.m09.d05:meMA.Ode5C12.melody	@ltx/en_us_oca/he.h.m8:heHE.OrthrizontesVoomenSoi.notmetered
ltx/en_us_oca/me.m09.d05:meMA.Ode5C12.mode	@ltx/en_us_oca/miscellanea:misc.Mode8
ltx/en_us_oca/me.m09.d05:meMA.Ode5C12.ode	@ltx/en_us_oca/miscellanea:misc.Ode5
ltx/en_us_oca/me.m09.d05:meMA.Ode5C12.text	
ltx/en_us_oca/me.m09.d05:meMA.Ode5C13.incipit	…
ltx/en_us_oca/me.m09.d05:meMA.Ode5C13.melody	@ltx/en_us_oca/he.h.m8:heHE.OrthrizontesVoomenSoi.notmetered
ltx/en_us_oca/me.m09.d05:meMA.Ode5C13.mode	@ltx/en_us_oca/miscellanea:misc.Mode8
ltx/en_us_oca/me.m09.d05:meMA.Ode5C13.ode	@ltx/en_us_oca/miscellanea:misc.Ode5
ltx/en_us_oca/me.m09.d05:meMA.Ode5C13.text	
ltx/en_us_oca/me.m09.d05:meMA.Ode5C1T.incipit	…
ltx/en_us_oca/me.m09.d05:meMA.Ode5C1T.melody	@ltx/en_us_oca/he.h.m8:heHE.OrthrizontesVoomenSoi.notmetered
ltx/en_us_oca/me.m09.d05:meMA.Ode5C1T.mode	@ltx/en_us_oca/miscellanea:misc.Mode8
ltx/en_us_oca/me.m09.d05:meMA.Ode5C1T.ode	@ltx/en_us_oca/miscellanea:misc.Ode5
ltx/en_us_oca/me.m09.d05:meMA.Ode5C1T.text	
ltx/en_us_oca/me.m09.d05:meMA.Ode6C11.greekmelody	@ltx/en_us_oca/he.h.m8:heHE.ChitonaMoiParaschou.greekname
ltx/en_us_oca/me.m09.d05:meMA.Ode6C11.incipit	…
ltx/en_us_oca/me.m09.d05:meMA.Ode6C11.melody	@ltx/en_us_oca/he.h.m8:heHE.ChitonaMoiParaschou.notmetered
ltx/en_us_oca/me.m09.d05:meMA.Ode6C11.mode	@ltx/en_us_oca/miscellanea:misc.Mode8
ltx/en_us_oca/me.m09.d05:meMA.Ode6C11.ode	@ltx/en_us_oca/miscellanea:misc.Ode6
ltx/en_us_oca/me.m09.d05:meMA.Ode6C11.text	
ltx/en_us_oca/me.m09.d05:meMA.Ode6C12.incipit	…
ltx/en_us_oca/me.m09.d05:meMA.Ode6C12.melody	@ltx/en_us_oca/he.h.m8:heHE.ChitonaMoiParaschou.notmetered
ltx/en_us_oca/me.m09.d05:meMA.Ode6C12.mode	@ltx/en_us_oca/miscellanea:misc.Mode8
ltx/en_us_oca/me.m09.d05:meMA.Ode6C12.ode	@ltx/en_us_oca/miscellanea:misc.Ode6
ltx/en_us_oca/me.m09.d05:meMA.Ode6C12.text	
ltx/en_us_oca/me.m09.d05:meMA.Ode6C13.incipit	…
ltx/en_us_oca/me.m09.d05:meMA.Ode6C13.melody	@ltx/en_us_oca/he.h.m8:heHE.ChitonaMoiParaschou.notmetered
ltx/en_us_oca/me.m09.d05:meMA.Ode6C13.mode	@ltx/en_us_oca/miscellanea:misc.Mode8
ltx/en_us_oca/me.m09.d05:meMA.Ode6C13.ode	@ltx/en_us_oca/miscellanea:misc.Ode6
ltx/en_us_oca/me.m09.d05:meMA.Ode6C13.text	
ltx/en_us_oca/me.m09.d05:meMA.Ode6C1T.incipit	…
ltx/en_us_oca/me.m09.d05:meMA.Ode6C1T.melody	@ltx/en_us_oca/he.h.m8:heHE.ChitonaMoiParaschou.notmetered
ltx/en_us_oca/me.m09.d05:meMA.Ode6C1T.mode	@ltx/en_us_oca/miscellanea:misc.Mode8
ltx/en_us_oca/me.m09.d05:meMA.Ode6C1T.ode	@ltx/en_us_oca/miscellanea:misc.Ode6
ltx/en_us_oca/me.m09.d05:meMA.Ode6C1T.text	
ltx/en_us_oca/me.m09.d05:meMA.Ode6H.greekmelody	@ltx/en_us_oca/he.h.m8:heHE.ChitonaMoiParaschou.greekname
ltx/en_us_oca/me.m09.d05:meMA.Ode6H.incipit	@ltx/en_us_oca/he.h.m8:heHE.ChitonaMoiParaschou.incipit
ltx/en_us_oca/me.m09.d05:meMA.Ode6H.melody	@ltx/en_us_oca/he.h.m8:heHE.ChitonaMoiParaschou.melody
ltx/en_us_oca/me.m09.d05:meMA.Ode6H.mode	@ltx/en_us_oca/miscellanea:misc.Mode8
ltx/en_us_oca/me.m09.d05:meMA.Ode6H.ode	@ltx/en_us_oca/miscellanea:misc.Ode6
ltx/en_us_oca/me.m09.d05:meMA.Ode6H.text	@ltx/en_us_oca/he.h.m8:heHE.ChitonaMoiParaschou.text
ltx/en_us_oca/me.m09.d05:meMA.Ode7C11.greekmelody	@ltx/en_us_oca/he.h.m8:heHE.PaidesEvraion.greekname
ltx/en_us_oca/me.m09.d05:meMA.Ode7C11.incipit	…
ltx/en_us_oca/me.m09.d05:meMA.Ode7C11.melody	@ltx/en_us_oca/he.h.m8:heHE.PaidesEvraion.notmetered
ltx/en_us_oca/me.m09.d05:meMA.Ode7C11.mode	@ltx/en_us_oca/miscellanea:misc.Mode8
ltx/en_us_oca/me.m09.d05:meMA.Ode7C11.ode	@ltx/en_us_oca/miscellanea:misc.Ode7
ltx/en_us_oca/me.m09.d05:meMA.Ode7C11.text	
ltx/en_us_oca/me.m09.d05:meMA.Ode7C12.incipit	…
ltx/en_us_oca/me.m09.d05:meMA.Ode7C12.melody	@ltx/en_us_oca/he.h.m8:heHE.PaidesEvraion.notmetered
ltx/en_us_oca/me.m09.d05:meMA.Ode7C12.mode	@ltx/en_us_oca/miscellanea:misc.Mode8
ltx/en_us_oca/me.m09.d05:meMA.Ode7C12.ode	@ltx/en_us_oca/miscellanea:misc.Ode7
ltx/en_us_oca/me.m09.d05:meMA.Ode7C12.text	
ltx/en_us_oca/me.m09.d05:meMA.Ode7C13.incipit	…
ltx/en_us_oca/me.m09.d05:meMA.Ode7C13.melody	@ltx/en_us_oca/he.h.m8:heHE.PaidesEvraion.notmetered
ltx/en_us_oca/me.m09.d05:meMA.Ode7C13.mode	@ltx/en_us_oca/miscellanea:misc.Mode8
ltx/en_us_oca/me.m09.d05:meMA.Ode7C13.ode	@ltx/en_us_oca/miscellanea:misc.Ode7
ltx/en_us_oca/me.m09.d05:meMA.Ode7C13.text	
ltx/en_us_oca/me.m09.d05:meMA.Ode7C1T.incipit	…
ltx/en_us_oca/me.m09.d05:meMA.Ode7C1T.melody	@ltx/en_us_oca/he.h.m8:heHE.PaidesEvraion.notmetered
ltx/en_us_oca/me.m09.d05:meMA.Ode7C1T.mode	@ltx/en_us_oca/miscellanea:misc.Mode8
ltx/en_us_oca/me.m09.d05:meMA.Ode7C1T.ode	@ltx/en_us_oca/miscellanea:misc.Ode7
ltx/en_us_oca/me.m09.d05:meMA.Ode7C1T.text	
ltx/en_us_oca/me.m09.d05:meMA.Ode8C11.greekmelody	@ltx/en_us_oca/he.h.m8:heHE.TonEnOreiAgio.greekname
ltx/en_us_oca/me.m09.d05:meMA.Ode8C11.incipit	…
ltx/en_us_oca/me.m09.d05:meMA.Ode8C11.melody	@ltx/en_us_oca/he.h.m8:heHE.TonEnOreiAgio.notmetered
ltx/en_us_oca/me.m09.d05:meMA.Ode8C11.mode	@ltx/en_us_oca/miscellanea:misc.Mode8
ltx/en_us_oca/me.m09.d05:meMA.Ode8C11.ode	@ltx/en_us_oca/miscellanea:misc.Ode8
ltx/en_us_oca/me.m09.d05:meMA.Ode8C11.text	
ltx/en_us_oca/me.m09.d05:meMA.Ode8C12.incipit	…
ltx/en_us_oca/me.m09.d05:meMA.Ode8C12.melody	@ltx/en_us_oca/he.h.m8:heHE.TonEnOreiAgio.notmetered
ltx/en_us_oca/me.m09.d05:meMA.Ode8C12.mode	@ltx/en_us_oca/miscellanea:misc.Mode8
ltx/en_us_oca/me.m09.d05:meMA.Ode8C12.ode	@ltx/en_us_oca/miscellanea:misc.Ode8
ltx/en_us_oca/me.m09.d05:meMA.Ode8C12.text	
ltx/en_us_oca/me.m09.d05:meMA.Ode8C13.incipit	…
ltx/en_us_oca/me.m09.d05:meMA.Ode8C13.melody	@ltx/en_us_oca/he.h.m8:heHE.TonEnOreiAgio.notmetered
ltx/en_us_oca/me.m09.d05:meMA.Ode8C13.mode	@ltx/en_us_oca/miscellanea:misc.Mode8
ltx/en_us_oca/me.m09.d05:meMA.Ode8C13.ode	@ltx/en_us_oca/miscellanea:misc.Ode8
ltx/en_us_oca/me.m09.d05:meMA.Ode8C13.text	
ltx/en_us_oca/me.m09.d05:meMA.Ode8C1T.incipit	…
ltx/en_us_oca/me.m09.d05:meMA.Ode8C1T.melody	@ltx/en_us_oca/he.h.m8:heHE.TonEnOreiAgio.notmetered
ltx/en_us_oca/me.m09.d05:meMA.Ode8C1T.mode	@ltx/en_us_oca/miscellanea:misc.Mode8
ltx/en_us_oca/me.m09.d05:meMA.Ode8C1T.ode	@ltx/en_us_oca/miscellanea:misc.Ode8
ltx/en_us_oca/me.m09.d05:meMA.Ode8C1T.text	
ltx/en_us_oca/me.m09.d05:meMA.Ode8H.greekmelody	@ltx/en_us_oca/he.h.m8:heHE.TonEnOreiAgio.greekname
ltx/en_us_oca/me.m09.d05:meMA.Ode8H.incipit	@ltx/en_us_oca/he.h.m8:heHE.TonEnOreiAgio.incipit
ltx/en_us_oca/me.m09.d05:meMA.Ode8H.melody	@ltx/en_us_oca/he.h.m8:heHE.TonEnOreiAgio.melody
ltx/en_us_oca/me.m09.d05:meMA.Ode8H.mode	@ltx/en_us_oca/miscellanea:misc.Mode8
ltx/en_us_oca/me.m09.d05:meMA.Ode8H.ode	@ltx/en_us_oca/miscellanea:misc.Ode8
ltx/en_us_oca/me.m09.d05:meMA.Ode8H.text	@ltx/en_us_oca/he.h.m8:heHE.TonEnOreiAgio.text
ltx/en_us_oca/me.m09.d05:meMA.Ode9C11.greekmelody	@ltx/en_us_oca/he.h.m8:heHE.KyriosTheotokon.greekname
ltx/en_us_oca/me.m09.d05:meMA.Ode9C11.incipit	…
ltx/en_us_oca/me.m09.d05:meMA.Ode9C11.melody	@ltx/en_us_oca/he.h.m8:heHE.KyriosTheotokon.notmetered
ltx/en_us_oca/me.m09.d05:meMA.Ode9C11.mode	@ltx/en_us_oca/miscellanea:misc.Mode8
ltx/en_us_oca/me.m09.d05:meMA.Ode9C11.ode	@ltx/en_us_oca/miscellanea:misc.Ode9
ltx/en_us_oca/me.m09.d05:meMA.Ode9C11.text	
ltx/en_us_oca/me.m09.d05:meMA.Ode9C12.incipit	…
ltx/en_us_oca/me.m09.d05:meMA.Ode9C12.melody	@ltx/en_us_oca/he.h.m8:heHE.KyriosTheotokon.notmetered
ltx/en_us_oca/me.m09.d05:meMA.Ode9C12.mode	@ltx/en_us_oca/miscellanea:misc.Mode8
ltx/en_us_oca/me.m09.d05:meMA.Ode9C12.ode	@ltx/en_us_oca/miscellanea:misc.Ode9
ltx/en_us_oca/me.m09.d05:meMA.Ode9C12.text	
ltx/en_us_oca/me.m09.d05:meMA.Ode9C13.incipit	…
ltx/en_us_oca/me.m09.d05:meMA.Ode9C13.melody	@ltx/en_us_oca/he.h.m8:heHE.KyriosTheotokon.notmetered
ltx/en_us_oca/me.m09.d05:meMA.Ode9C13.mode	@ltx/en_us_oca/miscellanea:misc.Mode8
ltx/en_us_oca/me.m09.d05:meMA.Ode9C13.ode	@ltx/en_us_oca/miscellanea:misc.Ode9
ltx/en_us_oca/me.m09.d05:meMA.Ode9C13.text	
ltx/en_us_oca/me.m09.d05:meMA.Ode9C14.incipit	…
ltx/en_us_oca/me.m09.d05:meMA.Ode9C14.melody	@ltx/en_us_oca/he.h.m8:heHE.KyriosTheotokon.notmetered
ltx/en_us_oca/me.m09.d05:meMA.Ode9C14.mode	@ltx/en_us_oca/miscellanea:misc.Mode8
ltx/en_us_oca/me.m09.d05:meMA.Ode9C14.ode	@ltx/en_us_oca/miscellanea:misc.Ode9
ltx/en_us_oca/me.m09.d05:meMA.Ode9C14.text	
ltx/en_us_oca/me.m09.d05:meMA.Ode9C1T.incipit	…
ltx/en_us_oca/me.m09.d05:meMA.Ode9C1T.melody	@ltx/en_us_oca/he.h.m8:heHE.KyriosTheotokon.notmetered
ltx/en_us_oca/me.m09.d05:meMA.Ode9C1T.mode	@ltx/en_us_oca/miscellanea:misc.Mode8
ltx/en_us_oca/me.m09.d05:meMA.Ode9C1T.ode	@ltx/en_us_oca/miscellanea:misc.Ode9
ltx/en_us_oca/me.m09.d05:meMA.Ode9C1T.text	
ltx/en_us_oca/me.m09.d05:meMA.Ode9H.greekmelody	@ltx/en_us_oca/he.h.m8:heHE.KyriosTheotokon.greekname
ltx/en_us_oca/me.m09.d05:meMA.Ode9H.incipit	@ltx/en_us_oca/he.h.m8:heHE.KyriosTheotokon.incipit
ltx/en_us_oca/me.m09.d05:meMA.Ode9H.melody	@ltx/en_us_oca/he.h.m8:heHE.KyriosTheotokon.melody
ltx/en_us_oca/me.m09.d05:meMA.Ode9H.mode	@ltx/en_us_oca/miscellanea:misc.Mode8
ltx/en_us_oca/me.m09.d05:meMA.Ode9H.ode	@ltx/en_us_oca/miscellanea:misc.Ode9
ltx/en_us_oca/me.m09.d05:meMA.Ode9H.text	@ltx/en_us_oca/he.h.m8:heHE.KyriosTheotokon.text
ltx/en_us_oca/me.m09.d05:meMA.Oikos1.text	
ltx/en_us_oca/me.m09.d05:meVE.Apolytikion1.greekmelody	@ltx/en_us_oca/he.a.m4:heAU.KateplagiIosif.greekname
ltx/en_us_oca/me.m09.d05:meVE.Apolytikion1.incipit	…
ltx/en_us_oca/me.m09.d05:meVE.Apolytikion1.melody	@ltx/en_us_oca/he.a.m4:heAU.KateplagiIosif.notmetered
ltx/en_us_oca/me.m09.d05:meVE.Apolytikion1.mode	@ltx/en_us_oca/miscellanea:misc.Mode4
ltx/en_us_oca/me.m09.d05:meVE.Apolytikion1.text	
ltx/en_us_oca/me.m09.d05:meVE.AposGlory.incipit	Arrayed in priestly vesture…
ltx/en_us_oca/me.m09.d05:meVE.AposGlory.melody	
ltx/en_us_oca/me.m09.d05:meVE.AposGlory.mode	@ltx/en_us_oca/miscellanea:misc.Mode2
ltx/en_us_oca/me.m09.d05:meVE.AposGlory.poet	@ltx/en_us_oca/poets:po.Anatoliou
ltx/en_us_oca/me.m09.d05:meVE.AposGlory.text	Arrayed in priestly vesture, ⁄ as a chaste priest you entered the Holy of Holies. ⁄ You served God without defilement, ⁄ like Aaron who taught the law and Moses who delivered Israel! ⁄ You were a revelation of purity, and therefore you were killed, ⁄ but your righteous blood is a source of healing for us ⁄ and like fragrant myrrh reveals to us the sweetness of future eternal life. ⁄ Thrice-blessed Zachariah, father of John and husband of Elizabeth, ⁄⁄ pray fervently for our souls!
ltx/en_us_oca/me.m09.d05:meVE.AposStavrotheotokion.greekmelody	@ltx/en_us_oca/he.a.m2:heAU.OteEkTouXylou.greekname
ltx/en_us_oca/me.m09.d05:meVE.AposStavrotheotokion.incipit	@ltx/en_us_oca/me.m06.d01:meVE.SticStavrotheotokion.incipit
ltx/en_us_oca/me.m09.d05:meVE.AposStavrotheotokion.melody	@ltx/en_us_oca/he.a.m2:heAU.OteEkTouXylou.notmetered
ltx/en_us_oca/me.m09.d05:meVE.AposStavrotheotokion.mode	@ltx/en_us_oca/miscellanea:misc.Mode2
ltx/en_us_oca/me.m09.d05:meVE.AposStavrotheotokion.text	@ltx/en_us_oca/me.m06.d01:meVE.SticStavrotheotokion.text
ltx/en_us_oca/me.m09.d05:meVE.AposTheotokion.greekmelody	@ltx/en_us_oca/he.a.m2:heAU.OteEkTouXylou.greekname
ltx/en_us_oca/me.m09.d05:meVE.AposTheotokion.incipit	@ltx/en_us_oca/oc.m2.d4:ocVE.Stichera5.incipit
ltx/en_us_oca/me.m09.d05:meVE.AposTheotokion.melody	@ltx/en_us_oca/he.a.m2:heAU.OteEkTouXylou.notmetered
ltx/en_us_oca/me.m09.d05:meVE.AposTheotokion.mode	@ltx/en_us_oca/miscellanea:misc.Mode2
ltx/en_us_oca/me.m09.d05:meVE.AposTheotokion.text	@ltx/en_us_oca/oc.m2.d4:ocVE.Stichera5.text
ltx/en_us_oca/me.m09.d05:meVE.Aposticha1.greekmelody	@ltx/en_us_oca/he.a.m8:heAU.OTouParadoxou.greekname
ltx/en_us_oca/me.m09.d05:meVE.Aposticha1.incipit	…
ltx/en_us_oca/me.m09.d05:meVE.Aposticha1.melody	@ltx/en_us_oca/he.a.m8:heAU.OTouParadoxou.notmetered
ltx/en_us_oca/me.m09.d05:meVE.Aposticha1.mode	@ltx/en_us_oca/miscellanea:misc.Mode8
ltx/en_us_oca/me.m09.d05:meVE.Aposticha1.text	
ltx/en_us_oca/me.m09.d05:meVE.Aposticha2.incipit	…
ltx/en_us_oca/me.m09.d05:meVE.Aposticha2.melody	@ltx/en_us_oca/he.a.m8:heAU.OTouParadoxou.notmetered
ltx/en_us_oca/me.m09.d05:meVE.Aposticha2.mode	@ltx/en_us_oca/miscellanea:misc.Mode8
ltx/en_us_oca/me.m09.d05:meVE.Aposticha2.text	
ltx/en_us_oca/me.m09.d05:meVE.Aposticha3.incipit	…
ltx/en_us_oca/me.m09.d05:meVE.Aposticha3.melody	@ltx/en_us_oca/he.a.m8:heAU.OTouParadoxou.notmetered
ltx/en_us_oca/me.m09.d05:meVE.Aposticha3.mode	@ltx/en_us_oca/miscellanea:misc.Mode8
ltx/en_us_oca/me.m09.d05:meVE.Aposticha3.text	
ltx/en_us_oca/me.m09.d05:meVE.SticGlory.incipit	You were rightly robed…
ltx/en_us_oca/me.m09.d05:meVE.SticGlory.melody	
ltx/en_us_oca/me.m09.d05:meVE.SticGlory.mode	@ltx/en_us_oca/miscellanea:misc.Mode8
ltx/en_us_oca/me.m09.d05:meVE.SticGlory.poet	@ltx/en_us_oca/poets:po.IoannouMonachou
ltx/en_us_oca/me.m09.d05:meVE.SticGlory.text	You were rightly robed in the vesture of the law, ⁄ serving according to the priesthood of Aaron. ⁄ While standing in the temple, all-blessed one, ⁄ you plainly beheld the form of an angel! ⁄ Therefore as we sing in honor of your translation, Zachariah! ⁄ We praise you, for after the flesh you fathered the glorious John. ⁄⁄ Intercede for us with the Lord that we may be saved!
ltx/en_us_oca/me.m09.d05:meVE.SticStavrotheotokion.greekmelody	@ltx/en_us_oca/he.a.m8:heAU.KyrieEiKaiKritirio.greekname
ltx/en_us_oca/me.m09.d05:meVE.SticStavrotheotokion.incipit	…
ltx/en_us_oca/me.m09.d05:meVE.SticStavrotheotokion.melody	@ltx/en_us_oca/he.a.m8:heAU.KyrieEiKaiKritirio.notmetered
ltx/en_us_oca/me.m09.d05:meVE.SticStavrotheotokion.mode	@ltx/en_us_oca/miscellanea:misc.Mode8
ltx/en_us_oca/me.m09.d05:meVE.SticStavrotheotokion.text	
ltx/en_us_oca/me.m09.d05:meVE.SticTheotokion.greekmelody	@ltx/en_us_oca/he.a.m8:heAU.KyrieEiKaiKritirio.greekname
ltx/en_us_oca/me.m09.d05:meVE.SticTheotokion.incipit	…
ltx/en_us_oca/me.m09.d05:meVE.SticTheotokion.melody	@ltx/en_us_oca/he.a.m8:heAU.KyrieEiKaiKritirio.notmetered
ltx/en_us_oca/me.m09.d05:meVE.SticTheotokion.mode	@ltx/en_us_oca/miscellanea:misc.Mode8
ltx/en_us_oca/me.m09.d05:meVE.SticTheotokion.text	
ltx/en_us_oca/me.m09.d05:meVE.Stichera01.greekmelody	@ltx/en_us_oca/he.a.m4:heAU.EdokasSimeiosin.greekname
ltx/en_us_oca/me.m09.d05:meVE.Stichera01.incipit	…
ltx/en_us_oca/me.m09.d05:meVE.Stichera01.melody	@ltx/en_us_oca/he.a.m4:heAU.EdokasSimeiosin.notmetered
ltx/en_us_oca/me.m09.d05:meVE.Stichera01.mode	@ltx/en_us_oca/miscellanea:misc.Mode4
ltx/en_us_oca/me.m09.d05:meVE.Stichera01.text	
ltx/en_us_oca/me.m09.d05:meVE.Stichera02.incipit	…
ltx/en_us_oca/me.m09.d05:meVE.Stichera02.melody	@ltx/en_us_oca/he.a.m4:heAU.EdokasSimeiosin.notmetered
ltx/en_us_oca/me.m09.d05:meVE.Stichera02.mode	@ltx/en_us_oca/miscellanea:misc.Mode4
ltx/en_us_oca/me.m09.d05:meVE.Stichera02.text	
ltx/en_us_oca/me.m09.d05:meVE.Stichera03.incipit	…
ltx/en_us_oca/me.m09.d05:meVE.Stichera03.melody	@ltx/en_us_oca/he.a.m4:heAU.EdokasSimeiosin.notmetered
ltx/en_us_oca/me.m09.d05:meVE.Stichera03.mode	@ltx/en_us_oca/miscellanea:misc.Mode4
ltx/en_us_oca/me.m09.d05:meVE.Stichera03.text	
