ltx/en_us_oca/me.m12.d28:meDA.commemoration.first	
ltx/en_us_oca/me.m12.d28:meDA.commemoration.first_name	
ltx/en_us_oca/me.m12.d28:meDA.commemoration.first_short	
ltx/en_us_oca/me.m12.d28:meDA.commemoration.first_title	
ltx/en_us_oca/me.m12.d28:meDA.commemoration.full	
ltx/en_us_oca/me.m12.d28:meDA.commemoration.second_name	
ltx/en_us_oca/me.m12.d28:meDA.commemoration.second_title	
ltx/en_us_oca/me.m12.d28:meDA.date	
ltx/en_us_oca/me.m12.d28:meDA.dismissal	@ltx/en_us_oca/dismissals:dis00.christmas
ltx/en_us_oca/me.m12.d28:meDA.fordate	
ltx/en_us_oca/me.m12.d28:meDA.insert1	
ltx/en_us_oca/me.m12.d28:meDA.insert2	
ltx/en_us_oca/me.m12.d28:meDA.note	
ltx/en_us_oca/me.m12.d28:meDA.pdfcoverdate	
ltx/en_us_oca/me.m12.d28:meDA.pdfheaderdate	
ltx/en_us_oca/me.m12.d28:meHO.commemorations	
ltx/en_us_oca/me.m12.d28:meHO.note1	
ltx/en_us_oca/me.m12.d28:meHO.note2	
ltx/en_us_oca/me.m12.d28:meHO.number	
ltx/en_us_oca/me.m12.d28:meHO.rank	
ltx/en_us_oca/me.m12.d28:meLE.commemoration1	
ltx/en_us_oca/me.m12.d28:meLE.commemoration2	
ltx/en_us_oca/me.m12.d28:meLI.Kontakion1.incipit	…
ltx/en_us_oca/me.m12.d28:meLI.Kontakion1.melody	
ltx/en_us_oca/me.m12.d28:meLI.Kontakion1.mode	
ltx/en_us_oca/me.m12.d28:meLI.Kontakion1.text	
ltx/en_us_oca/me.m12.d28:meLI.Megalynarion.text	
ltx/en_us_oca/me.m12.d28:meMA.AposBoth.incipit	He Who is King before…
ltx/en_us_oca/me.m12.d28:meMA.AposBoth.melody	@ltx/en_us_oca/he.a.m6:heAU.AiAngelikai.notmetered
ltx/en_us_oca/me.m12.d28:meMA.AposBoth.mode	@ltx/en_us_oca/miscellanea:misc.Mode6
ltx/en_us_oca/me.m12.d28:meMA.AposBoth.text	He Who is King before all ages wills to be born a Child. ⁄ A Son is given to us. ⁄ Listen, you nations; give ear, O Israel! ⁄ Understand and submit yourselves! ⁄ He is with us, Who threshes and winnows the ends of the earth. ⁄⁄ The kingdom and the power shall never be taken from Him!
ltx/en_us_oca/me.m12.d28:meMA.AposGlory.incipit	Never has anyone been so…
ltx/en_us_oca/me.m12.d28:meMA.AposGlory.melody	@ltx/en_us_oca/he.a.m6:heAU.AiAngelikai.notmetered
ltx/en_us_oca/me.m12.d28:meMA.AposGlory.mode	@ltx/en_us_oca/miscellanea:misc.Mode6
ltx/en_us_oca/me.m12.d28:meMA.AposGlory.text	Never has anyone been so poor as our God, ⁄ or so rich as Adam, recreated in godliness, ⁄ the Virgin cried out as she held in her arms ⁄ Emmanuel, our God and Creator, ⁄ Who had clothed himself with flesh from her. ⁄ Let us cry to Him: ⁄⁄ Blessed are You, our newborn God: glory to You!
ltx/en_us_oca/me.m12.d28:meMA.Aposticha1.greekmelody	@ltx/en_us_oca/he.a.m6:heAU.AiAngelikai.greekname
ltx/en_us_oca/me.m12.d28:meMA.Aposticha1.incipit	All creation, celebrate the feast…
ltx/en_us_oca/me.m12.d28:meMA.Aposticha1.melody	@ltx/en_us_oca/he.a.m6:heAU.AiAngelikai.notmetered
ltx/en_us_oca/me.m12.d28:meMA.Aposticha1.mode	@ltx/en_us_oca/miscellanea:misc.Mode6
ltx/en_us_oca/me.m12.d28:meMA.Aposticha1.text	All creation, celebrate the feast with joy! ⁄ Rejoice with us, you heavens! ⁄ The Creator is born from the Virgin in the cave; ⁄ a young Child comes in the fullness of time. ⁄ Let us cry out to Him: ⁄⁄ Blessed are You, our newborn God; glory to You!
ltx/en_us_oca/me.m12.d28:meMA.Aposticha2.incipit	Jesus, Who shone from the…
ltx/en_us_oca/me.m12.d28:meMA.Aposticha2.melody	@ltx/en_us_oca/he.a.m6:heAU.AiAngelikai.notmetered
ltx/en_us_oca/me.m12.d28:meMA.Aposticha2.mode	@ltx/en_us_oca/miscellanea:misc.Mode6
ltx/en_us_oca/me.m12.d28:meMA.Aposticha2.text	Jesus, Who shone from the Father before the ages, ⁄ for us is seen today, a newborn Child. ⁄ It is His will to refashion the human race ⁄ long grown old in sin. ⁄ Let us tirelessly cry to Him in thanks: ⁄⁄ Blessed are You, our newborn God: glory to You!
ltx/en_us_oca/me.m12.d28:meMA.Aposticha3.incipit	You mountains and hills, you…
ltx/en_us_oca/me.m12.d28:meMA.Aposticha3.melody	@ltx/en_us_oca/he.a.m6:heAU.AiAngelikai.notmetered
ltx/en_us_oca/me.m12.d28:meMA.Aposticha3.mode	@ltx/en_us_oca/miscellanea:misc.Mode6
ltx/en_us_oca/me.m12.d28:meMA.Aposticha3.text	You mountains and hills, you plains and valleys, ⁄ praise Christ, Who has come forth from the Virgin! ⁄ The star shines from heaven upon the Magi ⁄ revealing the Child in the manger ⁄ clothed in flesh as a servant. ⁄ Let us cry to Him: ⁄⁄ Blessed are You, our newborn God: glory to You!
ltx/en_us_oca/me.m12.d28:meMA.C1.acrostic.notice1	
ltx/en_us_oca/me.m12.d28:meMA.C1.acrostic.text	
ltx/en_us_oca/me.m12.d28:meMA.C1.acrostic.title	
ltx/en_us_oca/me.m12.d28:meMA.C1.title	@ltx/en_us_oca/titles:ti.CanonSaints
ltx/en_us_oca/me.m12.d28:meMA.C1.verse	@ltx/en_us_oca/prayers:pr.verse_SaintsM.text
ltx/en_us_oca/me.m12.d28:meMA.Exaposteilarion1.greekmelody	@ltx/en_us_oca/he.a.m2:heAU.GynaikesAkoutisthite.greekname
ltx/en_us_oca/me.m12.d28:meMA.Exaposteilarion1.incipit	…
ltx/en_us_oca/me.m12.d28:meMA.Exaposteilarion1.melody	@ltx/en_us_oca/he.a.m2:heAU.GynaikesAkoutisthite.notmetered
ltx/en_us_oca/me.m12.d28:meMA.Exaposteilarion1.mode	@ltx/en_us_oca/miscellanea:misc.Mode2
ltx/en_us_oca/me.m12.d28:meMA.Exaposteilarion1.text	
ltx/en_us_oca/me.m12.d28:meMA.Exaposteilarion2.greekmelody	@ltx/en_us_oca/he.a.m2:heAU.GynaikesAkoutisthite.greekname
ltx/en_us_oca/me.m12.d28:meMA.Exaposteilarion2.incipit	…
ltx/en_us_oca/me.m12.d28:meMA.Exaposteilarion2.melody	@ltx/en_us_oca/he.a.m2:heAU.GynaikesAkoutisthite.notmetered
ltx/en_us_oca/me.m12.d28:meMA.Exaposteilarion2.mode	@ltx/en_us_oca/miscellanea:misc.Mode2
ltx/en_us_oca/me.m12.d28:meMA.Exaposteilarion2.text	
ltx/en_us_oca/me.m12.d28:meMA.Kathisma11.greekmelody	@ltx/en_us_oca/he.a.m8:heAU.AnestisEkNekron.greekname
ltx/en_us_oca/me.m12.d28:meMA.Kathisma11.incipit	Faithful, behold a strange mystery!…
ltx/en_us_oca/me.m12.d28:meMA.Kathisma11.melody	@ltx/en_us_oca/he.a.m8:heAU.AnestisEkNekron.notmetered
ltx/en_us_oca/me.m12.d28:meMA.Kathisma11.mode	@ltx/en_us_oca/miscellanea:misc.Mode8
ltx/en_us_oca/me.m12.d28:meMA.Kathisma11.text	Faithful, behold a strange mystery! ⁄ In His good pleasure, God is born of a woman. ⁄ The hosts of angels, amazed at His condescension, cry out and sing, for Christ the Lord is born! ⁄⁄ He is our God, Who takes delight in saving the human race!
ltx/en_us_oca/me.m12.d28:meMA.Kathisma21.greekmelody	@ltx/en_us_oca/he.a.m8:heAU.AvlonPoimenikon.greekname
ltx/en_us_oca/me.m12.d28:meMA.Kathisma21.incipit	@ltx/en_us_oca/he.a.m8:heAU.AvlonPoimenikon.incipit
ltx/en_us_oca/me.m12.d28:meMA.Kathisma21.melody	@ltx/en_us_oca/he.a.m8:heAU.AvlonPoimenikon.name
ltx/en_us_oca/me.m12.d28:meMA.Kathisma21.mode	@ltx/en_us_oca/miscellanea:misc.Mode8
ltx/en_us_oca/me.m12.d28:meMA.Kathisma21.text	@ltx/en_us_oca/he.a.m8:heAU.AvlonPoimenikon.text
ltx/en_us_oca/me.m12.d28:meMA.Lauds1.greekmelody	@ltx/en_us_oca/he.a.m4:heAU.OsGennaionEnMartysi.greekname
ltx/en_us_oca/me.m12.d28:meMA.Lauds1.incipit	…
ltx/en_us_oca/me.m12.d28:meMA.Lauds1.melody	@ltx/en_us_oca/he.a.m4:heAU.OsGennaionEnMartysi.notmetered
ltx/en_us_oca/me.m12.d28:meMA.Lauds1.mode	@ltx/en_us_oca/miscellanea:misc.Mode4
ltx/en_us_oca/me.m12.d28:meMA.Lauds1.text	
ltx/en_us_oca/me.m12.d28:meMA.Lauds2.incipit	…
ltx/en_us_oca/me.m12.d28:meMA.Lauds2.melody	@ltx/en_us_oca/he.a.m4:heAU.OsGennaionEnMartysi.notmetered
ltx/en_us_oca/me.m12.d28:meMA.Lauds2.mode	@ltx/en_us_oca/miscellanea:misc.Mode4
ltx/en_us_oca/me.m12.d28:meMA.Lauds2.text	
ltx/en_us_oca/me.m12.d28:meMA.Lauds3.incipit	…
ltx/en_us_oca/me.m12.d28:meMA.Lauds3.melody	@ltx/en_us_oca/he.a.m4:heAU.OsGennaionEnMartysi.notmetered
ltx/en_us_oca/me.m12.d28:meMA.Lauds3.mode	@ltx/en_us_oca/miscellanea:misc.Mode4
ltx/en_us_oca/me.m12.d28:meMA.Lauds3.text	
ltx/en_us_oca/me.m12.d28:meMA.LaudsGlory.incipit	…
ltx/en_us_oca/me.m12.d28:meMA.LaudsGlory.melody	
ltx/en_us_oca/me.m12.d28:meMA.LaudsGlory.mode	@ltx/en_us_oca/miscellanea:misc.Mode5
ltx/en_us_oca/me.m12.d28:meMA.LaudsGlory.text	
ltx/en_us_oca/me.m12.d28:meMA.Ode1C11.greekmelody	@ltx/en_us_oca/he.h.m1:heHE.OdinEpinikion.greekname
ltx/en_us_oca/me.m12.d28:meMA.Ode1C11.incipit	…
ltx/en_us_oca/me.m12.d28:meMA.Ode1C11.melody	@ltx/en_us_oca/he.h.m1:heHE.OdinEpinikion.notmetered
ltx/en_us_oca/me.m12.d28:meMA.Ode1C11.mode	@ltx/en_us_oca/miscellanea:misc.Mode1
ltx/en_us_oca/me.m12.d28:meMA.Ode1C11.ode	@ltx/en_us_oca/miscellanea:misc.Ode1
ltx/en_us_oca/me.m12.d28:meMA.Ode1C11.text	
ltx/en_us_oca/me.m12.d28:meMA.Ode1C12.incipit	…
ltx/en_us_oca/me.m12.d28:meMA.Ode1C12.melody	@ltx/en_us_oca/he.h.m1:heHE.OdinEpinikion.notmetered
ltx/en_us_oca/me.m12.d28:meMA.Ode1C12.mode	@ltx/en_us_oca/miscellanea:misc.Mode1
ltx/en_us_oca/me.m12.d28:meMA.Ode1C12.ode	@ltx/en_us_oca/miscellanea:misc.Ode1
ltx/en_us_oca/me.m12.d28:meMA.Ode1C12.text	
ltx/en_us_oca/me.m12.d28:meMA.Ode1C13.incipit	…
ltx/en_us_oca/me.m12.d28:meMA.Ode1C13.melody	@ltx/en_us_oca/he.h.m1:heHE.OdinEpinikion.notmetered
ltx/en_us_oca/me.m12.d28:meMA.Ode1C13.mode	@ltx/en_us_oca/miscellanea:misc.Mode1
ltx/en_us_oca/me.m12.d28:meMA.Ode1C13.ode	@ltx/en_us_oca/miscellanea:misc.Ode1
ltx/en_us_oca/me.m12.d28:meMA.Ode1C13.text	
ltx/en_us_oca/me.m12.d28:meMA.Ode1C14.incipit	…
ltx/en_us_oca/me.m12.d28:meMA.Ode1C14.melody	@ltx/en_us_oca/he.h.m1:heHE.OdinEpinikion.notmetered
ltx/en_us_oca/me.m12.d28:meMA.Ode1C14.mode	@ltx/en_us_oca/miscellanea:misc.Mode1
ltx/en_us_oca/me.m12.d28:meMA.Ode1C14.ode	@ltx/en_us_oca/miscellanea:misc.Ode1
ltx/en_us_oca/me.m12.d28:meMA.Ode1C14.text	
ltx/en_us_oca/me.m12.d28:meMA.Ode1C1T.incipit	…
ltx/en_us_oca/me.m12.d28:meMA.Ode1C1T.melody	@ltx/en_us_oca/he.h.m1:heHE.OdinEpinikion.notmetered
ltx/en_us_oca/me.m12.d28:meMA.Ode1C1T.mode	@ltx/en_us_oca/miscellanea:misc.Mode1
ltx/en_us_oca/me.m12.d28:meMA.Ode1C1T.ode	@ltx/en_us_oca/miscellanea:misc.Ode1
ltx/en_us_oca/me.m12.d28:meMA.Ode1C1T.text	
ltx/en_us_oca/me.m12.d28:meMA.Ode3C11.greekmelody	@ltx/en_us_oca/he.h.m1:heHE.StereothitoIKardiaMou.greekname
ltx/en_us_oca/me.m12.d28:meMA.Ode3C11.incipit	…
ltx/en_us_oca/me.m12.d28:meMA.Ode3C11.melody	@ltx/en_us_oca/he.h.m1:heHE.StereothitoIKardiaMou.notmetered
ltx/en_us_oca/me.m12.d28:meMA.Ode3C11.mode	@ltx/en_us_oca/miscellanea:misc.Mode1
ltx/en_us_oca/me.m12.d28:meMA.Ode3C11.ode	@ltx/en_us_oca/miscellanea:misc.Ode3
ltx/en_us_oca/me.m12.d28:meMA.Ode3C11.text	
ltx/en_us_oca/me.m12.d28:meMA.Ode3C12.incipit	…
ltx/en_us_oca/me.m12.d28:meMA.Ode3C12.melody	@ltx/en_us_oca/he.h.m1:heHE.StereothitoIKardiaMou.notmetered
ltx/en_us_oca/me.m12.d28:meMA.Ode3C12.mode	@ltx/en_us_oca/miscellanea:misc.Mode1
ltx/en_us_oca/me.m12.d28:meMA.Ode3C12.ode	@ltx/en_us_oca/miscellanea:misc.Ode3
ltx/en_us_oca/me.m12.d28:meMA.Ode3C12.text	
ltx/en_us_oca/me.m12.d28:meMA.Ode3C13.incipit	…
ltx/en_us_oca/me.m12.d28:meMA.Ode3C13.melody	@ltx/en_us_oca/he.h.m1:heHE.StereothitoIKardiaMou.notmetered
ltx/en_us_oca/me.m12.d28:meMA.Ode3C13.mode	@ltx/en_us_oca/miscellanea:misc.Mode1
ltx/en_us_oca/me.m12.d28:meMA.Ode3C13.ode	@ltx/en_us_oca/miscellanea:misc.Ode3
ltx/en_us_oca/me.m12.d28:meMA.Ode3C13.text	
ltx/en_us_oca/me.m12.d28:meMA.Ode3C1T.incipit	…
ltx/en_us_oca/me.m12.d28:meMA.Ode3C1T.melody	@ltx/en_us_oca/he.h.m1:heHE.StereothitoIKardiaMou.notmetered
ltx/en_us_oca/me.m12.d28:meMA.Ode3C1T.mode	@ltx/en_us_oca/miscellanea:misc.Mode1
ltx/en_us_oca/me.m12.d28:meMA.Ode3C1T.ode	@ltx/en_us_oca/miscellanea:misc.Ode3
ltx/en_us_oca/me.m12.d28:meMA.Ode3C1T.text	
ltx/en_us_oca/me.m12.d28:meMA.Ode3H.greekmelody	@ltx/en_us_oca/he.h.m1:heHE.StereothitoIKardiaMou.greekname
ltx/en_us_oca/me.m12.d28:meMA.Ode3H.incipit	@ltx/en_us_oca/he.h.m1:heHE.StereothitoIKardiaMou.incipit
ltx/en_us_oca/me.m12.d28:meMA.Ode3H.melody	@ltx/en_us_oca/he.h.m1:heHE.StereothitoIKardiaMou.melody
ltx/en_us_oca/me.m12.d28:meMA.Ode3H.mode	@ltx/en_us_oca/miscellanea:misc.Mode1
ltx/en_us_oca/me.m12.d28:meMA.Ode3H.ode	@ltx/en_us_oca/miscellanea:misc.Ode3
ltx/en_us_oca/me.m12.d28:meMA.Ode3H.text	@ltx/en_us_oca/he.h.m1:heHE.StereothitoIKardiaMou.text
ltx/en_us_oca/me.m12.d28:meMA.Ode3Kathisma1.greekmelody	@ltx/en_us_oca/he.a.m1:heAU.TonTafonSouSotir.greekname
ltx/en_us_oca/me.m12.d28:meMA.Ode3Kathisma1.incipit	…
ltx/en_us_oca/me.m12.d28:meMA.Ode3Kathisma1.melody	@ltx/en_us_oca/he.a.m1:heAU.TonTafonSouSotir.notmetered
ltx/en_us_oca/me.m12.d28:meMA.Ode3Kathisma1.mode	@ltx/en_us_oca/miscellanea:misc.Mode1
ltx/en_us_oca/me.m12.d28:meMA.Ode3Kathisma1.text	
ltx/en_us_oca/me.m12.d28:meMA.Ode3Kathisma2.greekmelody	@ltx/en_us_oca/he.a.m1:heAU.TonTafonSouSotir.greekname
ltx/en_us_oca/me.m12.d28:meMA.Ode3Kathisma2.incipit	…
ltx/en_us_oca/me.m12.d28:meMA.Ode3Kathisma2.melody	@ltx/en_us_oca/he.a.m1:heAU.TonTafonSouSotir.notmetered
ltx/en_us_oca/me.m12.d28:meMA.Ode3Kathisma2.mode	@ltx/en_us_oca/miscellanea:misc.Mode1
ltx/en_us_oca/me.m12.d28:meMA.Ode3Kathisma2.text	
ltx/en_us_oca/me.m12.d28:meMA.Ode4C11.greekmelody	@ltx/en_us_oca/he.h.m1:heHE.EisakikoaKyrieTinAkoin.greekname
ltx/en_us_oca/me.m12.d28:meMA.Ode4C11.incipit	…
ltx/en_us_oca/me.m12.d28:meMA.Ode4C11.melody	@ltx/en_us_oca/he.h.m1:heHE.EisakikoaKyrieTinAkoin.notmetered
ltx/en_us_oca/me.m12.d28:meMA.Ode4C11.mode	@ltx/en_us_oca/miscellanea:misc.Mode1
ltx/en_us_oca/me.m12.d28:meMA.Ode4C11.ode	@ltx/en_us_oca/miscellanea:misc.Ode4
ltx/en_us_oca/me.m12.d28:meMA.Ode4C11.text	
ltx/en_us_oca/me.m12.d28:meMA.Ode4C12.incipit	…
ltx/en_us_oca/me.m12.d28:meMA.Ode4C12.melody	@ltx/en_us_oca/he.h.m1:heHE.EisakikoaKyrieTinAkoin.notmetered
ltx/en_us_oca/me.m12.d28:meMA.Ode4C12.mode	@ltx/en_us_oca/miscellanea:misc.Mode1
ltx/en_us_oca/me.m12.d28:meMA.Ode4C12.ode	@ltx/en_us_oca/miscellanea:misc.Ode4
ltx/en_us_oca/me.m12.d28:meMA.Ode4C12.text	
ltx/en_us_oca/me.m12.d28:meMA.Ode4C13.incipit	…
ltx/en_us_oca/me.m12.d28:meMA.Ode4C13.melody	@ltx/en_us_oca/he.h.m1:heHE.EisakikoaKyrieTinAkoin.notmetered
ltx/en_us_oca/me.m12.d28:meMA.Ode4C13.mode	@ltx/en_us_oca/miscellanea:misc.Mode1
ltx/en_us_oca/me.m12.d28:meMA.Ode4C13.ode	@ltx/en_us_oca/miscellanea:misc.Ode4
ltx/en_us_oca/me.m12.d28:meMA.Ode4C13.text	
ltx/en_us_oca/me.m12.d28:meMA.Ode4C1T.incipit	…
ltx/en_us_oca/me.m12.d28:meMA.Ode4C1T.melody	@ltx/en_us_oca/he.h.m1:heHE.EisakikoaKyrieTinAkoin.notmetered
ltx/en_us_oca/me.m12.d28:meMA.Ode4C1T.mode	@ltx/en_us_oca/miscellanea:misc.Mode1
ltx/en_us_oca/me.m12.d28:meMA.Ode4C1T.ode	@ltx/en_us_oca/miscellanea:misc.Ode4
ltx/en_us_oca/me.m12.d28:meMA.Ode4C1T.text	
ltx/en_us_oca/me.m12.d28:meMA.Ode5C11.greekmelody	@ltx/en_us_oca/he.h.m1:heHE.ToFaeinonIminExanateilon.greekname
ltx/en_us_oca/me.m12.d28:meMA.Ode5C11.incipit	…
ltx/en_us_oca/me.m12.d28:meMA.Ode5C11.melody	@ltx/en_us_oca/he.h.m1:heHE.ToFaeinonIminExanateilon.notmetered
ltx/en_us_oca/me.m12.d28:meMA.Ode5C11.mode	@ltx/en_us_oca/miscellanea:misc.Mode1
ltx/en_us_oca/me.m12.d28:meMA.Ode5C11.ode	@ltx/en_us_oca/miscellanea:misc.Ode5
ltx/en_us_oca/me.m12.d28:meMA.Ode5C11.text	
ltx/en_us_oca/me.m12.d28:meMA.Ode5C12.incipit	…
ltx/en_us_oca/me.m12.d28:meMA.Ode5C12.melody	@ltx/en_us_oca/he.h.m1:heHE.ToFaeinonIminExanateilon.notmetered
ltx/en_us_oca/me.m12.d28:meMA.Ode5C12.mode	@ltx/en_us_oca/miscellanea:misc.Mode1
ltx/en_us_oca/me.m12.d28:meMA.Ode5C12.ode	@ltx/en_us_oca/miscellanea:misc.Ode5
ltx/en_us_oca/me.m12.d28:meMA.Ode5C12.text	
ltx/en_us_oca/me.m12.d28:meMA.Ode5C13.incipit	…
ltx/en_us_oca/me.m12.d28:meMA.Ode5C13.melody	@ltx/en_us_oca/he.h.m1:heHE.ToFaeinonIminExanateilon.notmetered
ltx/en_us_oca/me.m12.d28:meMA.Ode5C13.mode	@ltx/en_us_oca/miscellanea:misc.Mode1
ltx/en_us_oca/me.m12.d28:meMA.Ode5C13.ode	@ltx/en_us_oca/miscellanea:misc.Ode5
ltx/en_us_oca/me.m12.d28:meMA.Ode5C13.text	
ltx/en_us_oca/me.m12.d28:meMA.Ode5C1T.incipit	…
ltx/en_us_oca/me.m12.d28:meMA.Ode5C1T.melody	@ltx/en_us_oca/he.h.m1:heHE.ToFaeinonIminExanateilon.notmetered
ltx/en_us_oca/me.m12.d28:meMA.Ode5C1T.mode	@ltx/en_us_oca/miscellanea:misc.Mode1
ltx/en_us_oca/me.m12.d28:meMA.Ode5C1T.ode	@ltx/en_us_oca/miscellanea:misc.Ode5
ltx/en_us_oca/me.m12.d28:meMA.Ode5C1T.text	
ltx/en_us_oca/me.m12.d28:meMA.Ode6C11.greekmelody	@ltx/en_us_oca/he.h.m1:heHE.TonProfitinIonan.greekname
ltx/en_us_oca/me.m12.d28:meMA.Ode6C11.incipit	…
ltx/en_us_oca/me.m12.d28:meMA.Ode6C11.melody	@ltx/en_us_oca/he.h.m1:heHE.TonProfitinIonan.notmetered
ltx/en_us_oca/me.m12.d28:meMA.Ode6C11.mode	@ltx/en_us_oca/miscellanea:misc.Mode1
ltx/en_us_oca/me.m12.d28:meMA.Ode6C11.ode	@ltx/en_us_oca/miscellanea:misc.Ode6
ltx/en_us_oca/me.m12.d28:meMA.Ode6C11.text	
ltx/en_us_oca/me.m12.d28:meMA.Ode6C12.incipit	…
ltx/en_us_oca/me.m12.d28:meMA.Ode6C12.melody	@ltx/en_us_oca/he.h.m1:heHE.TonProfitinIonan.notmetered
ltx/en_us_oca/me.m12.d28:meMA.Ode6C12.mode	@ltx/en_us_oca/miscellanea:misc.Mode1
ltx/en_us_oca/me.m12.d28:meMA.Ode6C12.ode	@ltx/en_us_oca/miscellanea:misc.Ode6
ltx/en_us_oca/me.m12.d28:meMA.Ode6C12.text	
ltx/en_us_oca/me.m12.d28:meMA.Ode6C13.incipit	…
ltx/en_us_oca/me.m12.d28:meMA.Ode6C13.melody	@ltx/en_us_oca/he.h.m1:heHE.TonProfitinIonan.notmetered
ltx/en_us_oca/me.m12.d28:meMA.Ode6C13.mode	@ltx/en_us_oca/miscellanea:misc.Mode1
ltx/en_us_oca/me.m12.d28:meMA.Ode6C13.ode	@ltx/en_us_oca/miscellanea:misc.Ode6
ltx/en_us_oca/me.m12.d28:meMA.Ode6C13.text	
ltx/en_us_oca/me.m12.d28:meMA.Ode6C1T.incipit	…
ltx/en_us_oca/me.m12.d28:meMA.Ode6C1T.melody	@ltx/en_us_oca/he.h.m1:heHE.TonProfitinIonan.notmetered
ltx/en_us_oca/me.m12.d28:meMA.Ode6C1T.mode	@ltx/en_us_oca/miscellanea:misc.Mode1
ltx/en_us_oca/me.m12.d28:meMA.Ode6C1T.ode	@ltx/en_us_oca/miscellanea:misc.Ode6
ltx/en_us_oca/me.m12.d28:meMA.Ode6C1T.text	
ltx/en_us_oca/me.m12.d28:meMA.Ode6H.greekmelody	@ltx/en_us_oca/he.h.m1:heHE.TonProfitinIonan.greekname
ltx/en_us_oca/me.m12.d28:meMA.Ode6H.incipit	@ltx/en_us_oca/he.h.m1:heHE.TonProfitinIonan.incipit
ltx/en_us_oca/me.m12.d28:meMA.Ode6H.melody	@ltx/en_us_oca/he.h.m1:heHE.TonProfitinIonan.melody
ltx/en_us_oca/me.m12.d28:meMA.Ode6H.mode	@ltx/en_us_oca/miscellanea:misc.Mode1
ltx/en_us_oca/me.m12.d28:meMA.Ode6H.ode	@ltx/en_us_oca/miscellanea:misc.Ode6
ltx/en_us_oca/me.m12.d28:meMA.Ode6H.text	@ltx/en_us_oca/he.h.m1:heHE.TonProfitinIonan.text
ltx/en_us_oca/me.m12.d28:meMA.Ode7C11.greekmelody	@ltx/en_us_oca/he.h.m1:heHE.TousEnKaminoPaidas.greekname
ltx/en_us_oca/me.m12.d28:meMA.Ode7C11.incipit	…
ltx/en_us_oca/me.m12.d28:meMA.Ode7C11.melody	@ltx/en_us_oca/he.h.m1:heHE.TousEnKaminoPaidas.notmetered
ltx/en_us_oca/me.m12.d28:meMA.Ode7C11.mode	@ltx/en_us_oca/miscellanea:misc.Mode1
ltx/en_us_oca/me.m12.d28:meMA.Ode7C11.ode	@ltx/en_us_oca/miscellanea:misc.Ode7
ltx/en_us_oca/me.m12.d28:meMA.Ode7C11.text	
ltx/en_us_oca/me.m12.d28:meMA.Ode7C12.incipit	…
ltx/en_us_oca/me.m12.d28:meMA.Ode7C12.melody	@ltx/en_us_oca/he.h.m1:heHE.TousEnKaminoPaidas.notmetered
ltx/en_us_oca/me.m12.d28:meMA.Ode7C12.mode	@ltx/en_us_oca/miscellanea:misc.Mode1
ltx/en_us_oca/me.m12.d28:meMA.Ode7C12.ode	@ltx/en_us_oca/miscellanea:misc.Ode7
ltx/en_us_oca/me.m12.d28:meMA.Ode7C12.text	
ltx/en_us_oca/me.m12.d28:meMA.Ode7C13.incipit	…
ltx/en_us_oca/me.m12.d28:meMA.Ode7C13.melody	@ltx/en_us_oca/he.h.m1:heHE.TousEnKaminoPaidas.notmetered
ltx/en_us_oca/me.m12.d28:meMA.Ode7C13.mode	@ltx/en_us_oca/miscellanea:misc.Mode1
ltx/en_us_oca/me.m12.d28:meMA.Ode7C13.ode	@ltx/en_us_oca/miscellanea:misc.Ode7
ltx/en_us_oca/me.m12.d28:meMA.Ode7C13.text	
ltx/en_us_oca/me.m12.d28:meMA.Ode7C1T.incipit	…
ltx/en_us_oca/me.m12.d28:meMA.Ode7C1T.melody	@ltx/en_us_oca/he.h.m1:heHE.TousEnKaminoPaidas.notmetered
ltx/en_us_oca/me.m12.d28:meMA.Ode7C1T.mode	@ltx/en_us_oca/miscellanea:misc.Mode1
ltx/en_us_oca/me.m12.d28:meMA.Ode7C1T.ode	@ltx/en_us_oca/miscellanea:misc.Ode7
ltx/en_us_oca/me.m12.d28:meMA.Ode7C1T.text	
ltx/en_us_oca/me.m12.d28:meMA.Ode8C11.greekmelody	@ltx/en_us_oca/he.h.m1:heHE.TonTousYmnologousEnKamino.greekname
ltx/en_us_oca/me.m12.d28:meMA.Ode8C11.incipit	…
ltx/en_us_oca/me.m12.d28:meMA.Ode8C11.melody	@ltx/en_us_oca/he.h.m1:heHE.TonTousYmnologousEnKamino.notmetered
ltx/en_us_oca/me.m12.d28:meMA.Ode8C11.mode	@ltx/en_us_oca/miscellanea:misc.Mode1
ltx/en_us_oca/me.m12.d28:meMA.Ode8C11.ode	@ltx/en_us_oca/miscellanea:misc.Ode8
ltx/en_us_oca/me.m12.d28:meMA.Ode8C11.text	
ltx/en_us_oca/me.m12.d28:meMA.Ode8C12.incipit	…
ltx/en_us_oca/me.m12.d28:meMA.Ode8C12.melody	@ltx/en_us_oca/he.h.m1:heHE.TonTousYmnologousEnKamino.notmetered
ltx/en_us_oca/me.m12.d28:meMA.Ode8C12.mode	@ltx/en_us_oca/miscellanea:misc.Mode1
ltx/en_us_oca/me.m12.d28:meMA.Ode8C12.ode	@ltx/en_us_oca/miscellanea:misc.Ode8
ltx/en_us_oca/me.m12.d28:meMA.Ode8C12.text	
ltx/en_us_oca/me.m12.d28:meMA.Ode8C13.incipit	…
ltx/en_us_oca/me.m12.d28:meMA.Ode8C13.melody	@ltx/en_us_oca/he.h.m1:heHE.TonTousYmnologousEnKamino.notmetered
ltx/en_us_oca/me.m12.d28:meMA.Ode8C13.mode	@ltx/en_us_oca/miscellanea:misc.Mode1
ltx/en_us_oca/me.m12.d28:meMA.Ode8C13.ode	@ltx/en_us_oca/miscellanea:misc.Ode8
ltx/en_us_oca/me.m12.d28:meMA.Ode8C13.text	
ltx/en_us_oca/me.m12.d28:meMA.Ode8C1T.incipit	…
ltx/en_us_oca/me.m12.d28:meMA.Ode8C1T.melody	@ltx/en_us_oca/he.h.m1:heHE.TonTousYmnologousEnKamino.notmetered
ltx/en_us_oca/me.m12.d28:meMA.Ode8C1T.mode	@ltx/en_us_oca/miscellanea:misc.Mode1
ltx/en_us_oca/me.m12.d28:meMA.Ode8C1T.ode	@ltx/en_us_oca/miscellanea:misc.Ode8
ltx/en_us_oca/me.m12.d28:meMA.Ode8C1T.text	
ltx/en_us_oca/me.m12.d28:meMA.Ode8H.greekmelody	@ltx/en_us_oca/he.h.m1:heHE.TonTousYmnologousEnKamino.greekname
ltx/en_us_oca/me.m12.d28:meMA.Ode8H.incipit	@ltx/en_us_oca/he.h.m1:heHE.TonTousYmnologousEnKamino.incipit
ltx/en_us_oca/me.m12.d28:meMA.Ode8H.melody	@ltx/en_us_oca/he.h.m1:heHE.TonTousYmnologousEnKamino.melody
ltx/en_us_oca/me.m12.d28:meMA.Ode8H.mode	@ltx/en_us_oca/miscellanea:misc.Mode1
ltx/en_us_oca/me.m12.d28:meMA.Ode8H.ode	@ltx/en_us_oca/miscellanea:misc.Ode8
ltx/en_us_oca/me.m12.d28:meMA.Ode8H.text	@ltx/en_us_oca/he.h.m1:heHE.TonTousYmnologousEnKamino.text
ltx/en_us_oca/me.m12.d28:meMA.Ode9C11.greekmelody	@ltx/en_us_oca/he.h.m1:heHE.TinFotoforonNefelin.greekname
ltx/en_us_oca/me.m12.d28:meMA.Ode9C11.incipit	…
ltx/en_us_oca/me.m12.d28:meMA.Ode9C11.melody	@ltx/en_us_oca/he.h.m1:heHE.TinFotoforonNefelin.notmetered
ltx/en_us_oca/me.m12.d28:meMA.Ode9C11.mode	@ltx/en_us_oca/miscellanea:misc.Mode1
ltx/en_us_oca/me.m12.d28:meMA.Ode9C11.ode	@ltx/en_us_oca/miscellanea:misc.Ode9
ltx/en_us_oca/me.m12.d28:meMA.Ode9C11.text	
ltx/en_us_oca/me.m12.d28:meMA.Ode9C12.incipit	…
ltx/en_us_oca/me.m12.d28:meMA.Ode9C12.melody	@ltx/en_us_oca/he.h.m1:heHE.TinFotoforonNefelin.notmetered
ltx/en_us_oca/me.m12.d28:meMA.Ode9C12.mode	@ltx/en_us_oca/miscellanea:misc.Mode1
ltx/en_us_oca/me.m12.d28:meMA.Ode9C12.ode	@ltx/en_us_oca/miscellanea:misc.Ode9
ltx/en_us_oca/me.m12.d28:meMA.Ode9C12.text	
ltx/en_us_oca/me.m12.d28:meMA.Ode9C13.incipit	…
ltx/en_us_oca/me.m12.d28:meMA.Ode9C13.melody	@ltx/en_us_oca/he.h.m1:heHE.TinFotoforonNefelin.notmetered
ltx/en_us_oca/me.m12.d28:meMA.Ode9C13.mode	@ltx/en_us_oca/miscellanea:misc.Mode1
ltx/en_us_oca/me.m12.d28:meMA.Ode9C13.ode	@ltx/en_us_oca/miscellanea:misc.Ode9
ltx/en_us_oca/me.m12.d28:meMA.Ode9C13.text	
ltx/en_us_oca/me.m12.d28:meMA.Ode9C1T.incipit	…
ltx/en_us_oca/me.m12.d28:meMA.Ode9C1T.melody	@ltx/en_us_oca/he.h.m1:heHE.TinFotoforonNefelin.notmetered
ltx/en_us_oca/me.m12.d28:meMA.Ode9C1T.mode	@ltx/en_us_oca/miscellanea:misc.Mode1
ltx/en_us_oca/me.m12.d28:meMA.Ode9C1T.ode	@ltx/en_us_oca/miscellanea:misc.Ode9
ltx/en_us_oca/me.m12.d28:meMA.Ode9C1T.text	
ltx/en_us_oca/me.m12.d28:meMA.Ode9H.greekmelody	@ltx/en_us_oca/he.h.m1:heHE.TinFotoforonNefelin.greekname
ltx/en_us_oca/me.m12.d28:meMA.Ode9H.incipit	@ltx/en_us_oca/he.h.m1:heHE.TinFotoforonNefelin.incipit
ltx/en_us_oca/me.m12.d28:meMA.Ode9H.melody	@ltx/en_us_oca/he.h.m1:heHE.TinFotoforonNefelin.melody
ltx/en_us_oca/me.m12.d28:meMA.Ode9H.mode	@ltx/en_us_oca/miscellanea:misc.Mode1
ltx/en_us_oca/me.m12.d28:meMA.Ode9H.ode	@ltx/en_us_oca/miscellanea:misc.Ode9
ltx/en_us_oca/me.m12.d28:meMA.Ode9H.text	@ltx/en_us_oca/he.h.m1:heHE.TinFotoforonNefelin.text
ltx/en_us_oca/me.m12.d28:meVE.Apolytikion1.incipit	@ltx/en_us_oca/oc.m2.d4:ocMA.Kathisma32.incipit
ltx/en_us_oca/me.m12.d28:meVE.Apolytikion1.melody	
ltx/en_us_oca/me.m12.d28:meVE.Apolytikion1.mode	@ltx/en_us_oca/miscellanea:misc.Mode2
ltx/en_us_oca/me.m12.d28:meVE.Apolytikion1.text	@ltx/en_us_oca/oc.m2.d4:ocMA.Kathisma32.text
ltx/en_us_oca/me.m12.d28:meVE.AposGlory.incipit	@ltx/en_us_oca/me.m12.d25:meVE.Lity3.incipit
ltx/en_us_oca/me.m12.d28:meVE.AposGlory.melody	
ltx/en_us_oca/me.m12.d28:meVE.AposGlory.mode	@ltx/en_us_oca/miscellanea:misc.Mode1
ltx/en_us_oca/me.m12.d28:meVE.AposGlory.text	@ltx/en_us_oca/me.m12.d25:meVE.Lity3.text
ltx/en_us_oca/me.m12.d28:meVE.Aposticha1.greekmelody	@ltx/en_us_oca/he.a.m2:heAU.OikosTouEfratha.greekname
ltx/en_us_oca/me.m12.d28:meVE.Aposticha1.incipit	…
ltx/en_us_oca/me.m12.d28:meVE.Aposticha1.melody	@ltx/en_us_oca/he.a.m2:heAU.OikosTouEfratha.notmetered
ltx/en_us_oca/me.m12.d28:meVE.Aposticha1.mode	@ltx/en_us_oca/miscellanea:misc.Mode2
ltx/en_us_oca/me.m12.d28:meVE.Aposticha1.text	
ltx/en_us_oca/me.m12.d28:meVE.Aposticha2.incipit	…
ltx/en_us_oca/me.m12.d28:meVE.Aposticha2.melody	@ltx/en_us_oca/he.a.m2:heAU.OikosTouEfratha.notmetered
ltx/en_us_oca/me.m12.d28:meVE.Aposticha2.mode	@ltx/en_us_oca/miscellanea:misc.Mode2
ltx/en_us_oca/me.m12.d28:meVE.Aposticha2.text	
ltx/en_us_oca/me.m12.d28:meVE.Aposticha3.incipit	…
ltx/en_us_oca/me.m12.d28:meVE.Aposticha3.melody	@ltx/en_us_oca/he.a.m2:heAU.OikosTouEfratha.notmetered
ltx/en_us_oca/me.m12.d28:meVE.Aposticha3.mode	@ltx/en_us_oca/miscellanea:misc.Mode2
ltx/en_us_oca/me.m12.d28:meVE.Aposticha3.text	
ltx/en_us_oca/me.m12.d28:meVE.SticGlory.incipit	@ltx/en_us_oca/me.m12.d25:meVE.AposGlory.incipit
ltx/en_us_oca/me.m12.d28:meVE.SticGlory.melody	
ltx/en_us_oca/me.m12.d28:meVE.SticGlory.mode	@ltx/en_us_oca/miscellanea:misc.Mode4
ltx/en_us_oca/me.m12.d28:meVE.SticGlory.text	@ltx/en_us_oca/me.m12.d25:meVE.AposGlory.text
ltx/en_us_oca/me.m12.d28:meVE.Stichera01.greekmelody	@ltx/en_us_oca/he.a.m5:heAU.ChairoisAskitikon.greekname
ltx/en_us_oca/me.m12.d28:meVE.Stichera01.incipit	…
ltx/en_us_oca/me.m12.d28:meVE.Stichera01.melody	@ltx/en_us_oca/he.a.m5:heAU.ChairoisAskitikon.notmetered
ltx/en_us_oca/me.m12.d28:meVE.Stichera01.mode	@ltx/en_us_oca/miscellanea:misc.Mode5
ltx/en_us_oca/me.m12.d28:meVE.Stichera01.text	
ltx/en_us_oca/me.m12.d28:meVE.Stichera02.incipit	…
ltx/en_us_oca/me.m12.d28:meVE.Stichera02.melody	@ltx/en_us_oca/he.a.m5:heAU.ChairoisAskitikon.notmetered
ltx/en_us_oca/me.m12.d28:meVE.Stichera02.mode	@ltx/en_us_oca/miscellanea:misc.Mode5
ltx/en_us_oca/me.m12.d28:meVE.Stichera02.text	
ltx/en_us_oca/me.m12.d28:meVE.Stichera03.incipit	…
ltx/en_us_oca/me.m12.d28:meVE.Stichera03.melody	@ltx/en_us_oca/he.a.m5:heAU.ChairoisAskitikon.notmetered
ltx/en_us_oca/me.m12.d28:meVE.Stichera03.mode	@ltx/en_us_oca/miscellanea:misc.Mode5
ltx/en_us_oca/me.m12.d28:meVE.Stichera03.text	
ltx/en_us_oca/me.m12.d28:meVE.Stichera04.greekmelody	@ltx/en_us_oca/he.a.m1:heAU.PaneffimoiMartyres.greekname
ltx/en_us_oca/me.m12.d28:meVE.Stichera04.incipit	…
ltx/en_us_oca/me.m12.d28:meVE.Stichera04.melody	@ltx/en_us_oca/he.a.m1:heAU.PaneffimoiMartyres.notmetered
ltx/en_us_oca/me.m12.d28:meVE.Stichera04.mode	@ltx/en_us_oca/miscellanea:misc.Mode1
ltx/en_us_oca/me.m12.d28:meVE.Stichera04.text	
ltx/en_us_oca/me.m12.d28:meVE.Stichera05.incipit	…
ltx/en_us_oca/me.m12.d28:meVE.Stichera05.melody	@ltx/en_us_oca/he.a.m1:heAU.PaneffimoiMartyres.notmetered
ltx/en_us_oca/me.m12.d28:meVE.Stichera05.mode	@ltx/en_us_oca/miscellanea:misc.Mode1
ltx/en_us_oca/me.m12.d28:meVE.Stichera05.text	
ltx/en_us_oca/me.m12.d28:meVE.Stichera06.incipit	…
ltx/en_us_oca/me.m12.d28:meVE.Stichera06.melody	@ltx/en_us_oca/he.a.m1:heAU.PaneffimoiMartyres.notmetered
ltx/en_us_oca/me.m12.d28:meVE.Stichera06.mode	@ltx/en_us_oca/miscellanea:misc.Mode1
ltx/en_us_oca/me.m12.d28:meVE.Stichera06.text	
