ltx/en_us_oca/me.m07.d20:alt1.meLI.Megalynarion.poet	@ltx/en_us_oca/poets:po.NikodimouAgioreitou
ltx/en_us_oca/me.m07.d20:alt1.meLI.Megalynarion.text	
ltx/en_us_oca/me.m07.d20:alt1.meMA.Kathisma22.greekmelody	@ltx/en_us_oca/he.a.m4:heAU.EpefanisSimeron.greekname
ltx/en_us_oca/me.m07.d20:alt1.meMA.Kathisma22.incipit	…
ltx/en_us_oca/me.m07.d20:alt1.meMA.Kathisma22.melody	@ltx/en_us_oca/he.a.m4:heAU.EpefanisSimeron.name
ltx/en_us_oca/me.m07.d20:alt1.meMA.Kathisma22.mode	@ltx/en_us_oca/miscellanea:misc.Mode4
ltx/en_us_oca/me.m07.d20:alt1.meMA.Kathisma22.poet	@ltx/en_us_oca/poets:po.NikodimouAgioreitou
ltx/en_us_oca/me.m07.d20:alt1.meMA.Kathisma22.text	
ltx/en_us_oca/me.m07.d20:alt1.meMA.Kathisma2T.greekmelody	@ltx/en_us_oca/he.a.m4:heAU.EpefanisSimeron.greekname
ltx/en_us_oca/me.m07.d20:alt1.meMA.Kathisma2T.incipit	@ltx/en_us_oca/me.m06.d14:meMA.Ode3KathismaT.incipit
ltx/en_us_oca/me.m07.d20:alt1.meMA.Kathisma2T.melody	@ltx/en_us_oca/he.a.m4:heAU.EpefanisSimeron.name
ltx/en_us_oca/me.m07.d20:alt1.meMA.Kathisma2T.mode	@ltx/en_us_oca/miscellanea:misc.Mode4
ltx/en_us_oca/me.m07.d20:alt1.meMA.Kathisma2T.text	@ltx/en_us_oca/me.m06.d14:meMA.Ode3KathismaT.text
ltx/en_us_oca/me.m07.d20:alt1.meMA.Kathisma31.greekmelody	@ltx/en_us_oca/he.a.m8:heAU.TinSofianKaiLogon.greekname
ltx/en_us_oca/me.m07.d20:alt1.meMA.Kathisma31.incipit	…
ltx/en_us_oca/me.m07.d20:alt1.meMA.Kathisma31.melody	@ltx/en_us_oca/he.a.m8:heAU.TinSofianKaiLogon.name
ltx/en_us_oca/me.m07.d20:alt1.meMA.Kathisma31.mode	@ltx/en_us_oca/miscellanea:misc.Mode8
ltx/en_us_oca/me.m07.d20:alt1.meMA.Kathisma31.poet	@ltx/en_us_oca/poets:po.NikodimouAgioreitou
ltx/en_us_oca/me.m07.d20:alt1.meMA.Kathisma31.text	
ltx/en_us_oca/me.m07.d20:alt1.meMA.Kathisma32.greekmelody	@ltx/en_us_oca/he.a.m3:heAU.TinOraiotita.greekname
ltx/en_us_oca/me.m07.d20:alt1.meMA.Kathisma32.incipit	…
ltx/en_us_oca/me.m07.d20:alt1.meMA.Kathisma32.melody	@ltx/en_us_oca/he.a.m3:heAU.TinOraiotita.name
ltx/en_us_oca/me.m07.d20:alt1.meMA.Kathisma32.mode	@ltx/en_us_oca/miscellanea:misc.Mode3
ltx/en_us_oca/me.m07.d20:alt1.meMA.Kathisma32.poet	@ltx/en_us_oca/poets:po.NikodimouAgioreitou
ltx/en_us_oca/me.m07.d20:alt1.meMA.Kathisma32.text	
ltx/en_us_oca/me.m07.d20:alt1.meMA.Kathisma3T.greekmelody	@ltx/en_us_oca/he.a.m3:heAU.TinOraiotita.greekname
ltx/en_us_oca/me.m07.d20:alt1.meMA.Kathisma3T.incipit	…
ltx/en_us_oca/me.m07.d20:alt1.meMA.Kathisma3T.melody	@ltx/en_us_oca/he.a.m3:heAU.TinOraiotita.name
ltx/en_us_oca/me.m07.d20:alt1.meMA.Kathisma3T.mode	@ltx/en_us_oca/miscellanea:misc.Mode3
ltx/en_us_oca/me.m07.d20:alt1.meMA.Kathisma3T.poet	@ltx/en_us_oca/poets:po.NikodimouAgioreitou
ltx/en_us_oca/me.m07.d20:alt1.meMA.Kathisma3T.text	
ltx/en_us_oca/me.m07.d20:alt1.meMA.PostGospelBoth.incipit	@ltx/en_us_oca/ho.ho03:hoMA.PostGospelTheotokos.incipit
ltx/en_us_oca/me.m07.d20:alt1.meMA.PostGospelBoth.melody	
ltx/en_us_oca/me.m07.d20:alt1.meMA.PostGospelBoth.mode	@ltx/en_us_oca/miscellanea:misc.Mode2
ltx/en_us_oca/me.m07.d20:alt1.meMA.PostGospelBoth.text	@ltx/en_us_oca/ho.ho03:hoMA.PostGospelTheotokos.text
ltx/en_us_oca/me.m07.d20:alt1.meMA.PostGospelGlory.incipit	@ltx/en_us_oca/ho.ho03:hoMA.PostGospelProphet.incipit
ltx/en_us_oca/me.m07.d20:alt1.meMA.PostGospelGlory.melody	
ltx/en_us_oca/me.m07.d20:alt1.meMA.PostGospelGlory.mode	@ltx/en_us_oca/miscellanea:misc.Mode2
ltx/en_us_oca/me.m07.d20:alt1.meMA.PostGospelGlory.text	@ltx/en_us_oca/ho.ho03:hoMA.PostGospelProphet.text
ltx/en_us_oca/me.m07.d20:alt1.meMA.PostGospelIdiomelon.incipit	…
ltx/en_us_oca/me.m07.d20:alt1.meMA.PostGospelIdiomelon.melody	
ltx/en_us_oca/me.m07.d20:alt1.meMA.PostGospelIdiomelon.mode	@ltx/en_us_oca/miscellanea:misc.Mode6
ltx/en_us_oca/me.m07.d20:alt1.meMA.PostGospelIdiomelon.poet	@ltx/en_us_oca/poets:po.NikodimouAgioreitou
ltx/en_us_oca/me.m07.d20:alt1.meMA.PostGospelIdiomelon.text	
ltx/en_us_oca/me.m07.d20:alt1.meVE.Stichera04.greekmelody	@ltx/en_us_oca/he.a.m1:heAU.TonOuranionTagmaton.greekname
ltx/en_us_oca/me.m07.d20:alt1.meVE.Stichera04.incipit	…
ltx/en_us_oca/me.m07.d20:alt1.meVE.Stichera04.melody	@ltx/en_us_oca/he.a.m1:heAU.TonOuranionTagmaton.name
ltx/en_us_oca/me.m07.d20:alt1.meVE.Stichera04.mode	@ltx/en_us_oca/miscellanea:misc.Mode1
ltx/en_us_oca/me.m07.d20:alt1.meVE.Stichera04.poet	@ltx/en_us_oca/poets:po.NikodimouAgioreitou
ltx/en_us_oca/me.m07.d20:alt1.meVE.Stichera04.text	
ltx/en_us_oca/me.m07.d20:alt1.meVE.Stichera05.greekmelody	@ltx/en_us_oca/he.a.m2:heAU.PoioisEffimionStemmasin.greekname
ltx/en_us_oca/me.m07.d20:alt1.meVE.Stichera05.incipit	…
ltx/en_us_oca/me.m07.d20:alt1.meVE.Stichera05.melody	@ltx/en_us_oca/he.a.m2:heAU.PoioisEffimionStemmasin.name
ltx/en_us_oca/me.m07.d20:alt1.meVE.Stichera05.mode	@ltx/en_us_oca/miscellanea:misc.Mode2
ltx/en_us_oca/me.m07.d20:alt1.meVE.Stichera05.poet	@ltx/en_us_oca/poets:po.NikodimouAgioreitou
ltx/en_us_oca/me.m07.d20:alt1.meVE.Stichera05.text	
ltx/en_us_oca/me.m07.d20:alt1.meVE.Stichera06.incipit	…
ltx/en_us_oca/me.m07.d20:alt1.meVE.Stichera06.melody	@ltx/en_us_oca/he.a.m2:heAU.PoioisEffimionStemmasin.name
ltx/en_us_oca/me.m07.d20:alt1.meVE.Stichera06.mode	@ltx/en_us_oca/miscellanea:misc.Mode2
ltx/en_us_oca/me.m07.d20:alt1.meVE.Stichera06.poet	@ltx/en_us_oca/poets:po.NikodimouAgioreitou
ltx/en_us_oca/me.m07.d20:alt1.meVE.Stichera06.text	
ltx/en_us_oca/me.m07.d20:alt1.meVE.Stichera07.incipit	…
ltx/en_us_oca/me.m07.d20:alt1.meVE.Stichera07.melody	@ltx/en_us_oca/he.a.m2:heAU.PoioisEffimionStemmasin.name
ltx/en_us_oca/me.m07.d20:alt1.meVE.Stichera07.mode	@ltx/en_us_oca/miscellanea:misc.Mode2
ltx/en_us_oca/me.m07.d20:alt1.meVE.Stichera07.poet	@ltx/en_us_oca/poets:po.NikodimouAgioreitou
ltx/en_us_oca/me.m07.d20:alt1.meVE.Stichera07.text	
ltx/en_us_oca/me.m07.d20:alt1.meVE.Stichera08.incipit	…
ltx/en_us_oca/me.m07.d20:alt1.meVE.Stichera08.melody	@ltx/en_us_oca/he.a.m2:heAU.PoioisEffimionStemmasin.name
ltx/en_us_oca/me.m07.d20:alt1.meVE.Stichera08.mode	@ltx/en_us_oca/miscellanea:misc.Mode2
ltx/en_us_oca/me.m07.d20:alt1.meVE.Stichera08.poet	@ltx/en_us_oca/poets:po.NikodimouAgioreitou
ltx/en_us_oca/me.m07.d20:alt1.meVE.Stichera08.text	
ltx/en_us_oca/me.m07.d20:meDA.commemoration.first	
ltx/en_us_oca/me.m07.d20:meDA.commemoration.first_name	
ltx/en_us_oca/me.m07.d20:meDA.commemoration.first_short	
ltx/en_us_oca/me.m07.d20:meDA.commemoration.first_title	
ltx/en_us_oca/me.m07.d20:meDA.commemoration.full	
ltx/en_us_oca/me.m07.d20:meDA.commemoration.second_name	
ltx/en_us_oca/me.m07.d20:meDA.commemoration.second_title	
ltx/en_us_oca/me.m07.d20:meDA.date	
ltx/en_us_oca/me.m07.d20:meDA.fordate	
ltx/en_us_oca/me.m07.d20:meDA.insert1	
ltx/en_us_oca/me.m07.d20:meDA.insert2	
ltx/en_us_oca/me.m07.d20:meDA.note	
ltx/en_us_oca/me.m07.d20:meDA.pdfcoverdate	
ltx/en_us_oca/me.m07.d20:meDA.pdfheaderdate	
ltx/en_us_oca/me.m07.d20:meHO.commemorations	
ltx/en_us_oca/me.m07.d20:meHO.note1	
ltx/en_us_oca/me.m07.d20:meHO.note2	
ltx/en_us_oca/me.m07.d20:meHO.number	
ltx/en_us_oca/me.m07.d20:meHO.rank	
ltx/en_us_oca/me.m07.d20:meLE.commemoration1	
ltx/en_us_oca/me.m07.d20:meLE.commemoration2	
ltx/en_us_oca/me.m07.d20:meLI.Kontakion1.incipit	@ltx/en_us_oca/me.m07.d20:meMA.Kontakion1.incipit
ltx/en_us_oca/me.m07.d20:meLI.Kontakion1.melody	@ltx/en_us_oca/me.m07.d20:meMA.Kontakion1.melody
ltx/en_us_oca/me.m07.d20:meLI.Kontakion1.mode	@ltx/en_us_oca/me.m07.d20:meMA.Kontakion1.mode
ltx/en_us_oca/me.m07.d20:meLI.Kontakion1.text	@ltx/en_us_oca/me.m07.d20:meMA.Kontakion1.text
ltx/en_us_oca/me.m07.d20:meLI.MM.CommunionHymn.text	
ltx/en_us_oca/me.m07.d20:meLI.Megalynarion.text	
ltx/en_us_oca/me.m07.d20:meMA.C1.acrostic.notice1	
ltx/en_us_oca/me.m07.d20:meMA.C1.acrostic.text	
ltx/en_us_oca/me.m07.d20:meMA.C1.acrostic.title	
ltx/en_us_oca/me.m07.d20:meMA.C1.poet	@ltx/en_us_oca/poets:po.IoannouMonachou
ltx/en_us_oca/me.m07.d20:meMA.C1.title	@ltx/en_us_oca/titles:ti.Canon1Prophet
ltx/en_us_oca/me.m07.d20:meMA.C1.verse	@ltx/en_us_oca/prayers:pr.verse_Prophet.text
ltx/en_us_oca/me.m07.d20:meMA.C2.acrostic.notice1	
ltx/en_us_oca/me.m07.d20:meMA.C2.acrostic.text	
ltx/en_us_oca/me.m07.d20:meMA.C2.acrostic.title	
ltx/en_us_oca/me.m07.d20:meMA.C2.title	@ltx/en_us_oca/titles:ti.Canon2Prophet
ltx/en_us_oca/me.m07.d20:meMA.C2.verse	@ltx/en_us_oca/prayers:pr.verse_Prophet.text
ltx/en_us_oca/me.m07.d20:meMA.ExapTheotokion.incipit	…
ltx/en_us_oca/me.m07.d20:meMA.ExapTheotokion.melody	@ltx/en_us_oca/he.a.m3:heAU.FosAnalloioton.notmetered
ltx/en_us_oca/me.m07.d20:meMA.ExapTheotokion.mode	@ltx/en_us_oca/miscellanea:misc.Mode3
ltx/en_us_oca/me.m07.d20:meMA.ExapTheotokion.text	
ltx/en_us_oca/me.m07.d20:meMA.Exaposteilarion1.greekmelody	@ltx/en_us_oca/he.a.m3:heAU.FosAnalloioton.greekname
ltx/en_us_oca/me.m07.d20:meMA.Exaposteilarion1.incipit	…
ltx/en_us_oca/me.m07.d20:meMA.Exaposteilarion1.melody	@ltx/en_us_oca/he.a.m3:heAU.FosAnalloioton.notmetered
ltx/en_us_oca/me.m07.d20:meMA.Exaposteilarion1.mode	@ltx/en_us_oca/miscellanea:misc.Mode3
ltx/en_us_oca/me.m07.d20:meMA.Exaposteilarion1.text	
ltx/en_us_oca/me.m07.d20:meMA.Kathisma11.greekmelody	@ltx/en_us_oca/he.a.m1:heAU.TonTafonSouSotir.greekname
ltx/en_us_oca/me.m07.d20:meMA.Kathisma11.incipit	…
ltx/en_us_oca/me.m07.d20:meMA.Kathisma11.melody	@ltx/en_us_oca/he.a.m1:heAU.TonTafonSouSotir.notmetered
ltx/en_us_oca/me.m07.d20:meMA.Kathisma11.mode	@ltx/en_us_oca/miscellanea:misc.Mode1
ltx/en_us_oca/me.m07.d20:meMA.Kathisma11.text	
ltx/en_us_oca/me.m07.d20:meMA.Kathisma1T.incipit	@ltx/en_us_oca/oc.m1.d1:ocMA.Kathisma13.incipit
ltx/en_us_oca/me.m07.d20:meMA.Kathisma1T.melody	@ltx/en_us_oca/he.a.m1:heAU.TonTafonSouSotir.notmetered
ltx/en_us_oca/me.m07.d20:meMA.Kathisma1T.mode	@ltx/en_us_oca/miscellanea:misc.Mode1
ltx/en_us_oca/me.m07.d20:meMA.Kathisma1T.text	@ltx/en_us_oca/oc.m1.d1:ocMA.Kathisma13.text
ltx/en_us_oca/me.m07.d20:meMA.Kathisma21.greekmelody	@ltx/en_us_oca/he.a.m1:heAU.TonTafonSouSotir.greekname
ltx/en_us_oca/me.m07.d20:meMA.Kathisma21.incipit	…
ltx/en_us_oca/me.m07.d20:meMA.Kathisma21.melody	@ltx/en_us_oca/he.a.m1:heAU.TonTafonSouSotir.notmetered
ltx/en_us_oca/me.m07.d20:meMA.Kathisma21.mode	@ltx/en_us_oca/miscellanea:misc.Mode1
ltx/en_us_oca/me.m07.d20:meMA.Kathisma21.text	
ltx/en_us_oca/me.m07.d20:meMA.Kathisma2T.incipit	@ltx/en_us_oca/oc.m1.d1:ocMA.Kathisma23.incipit
ltx/en_us_oca/me.m07.d20:meMA.Kathisma2T.melody	@ltx/en_us_oca/he.a.m1:heAU.TonTafonSouSotir.notmetered
ltx/en_us_oca/me.m07.d20:meMA.Kathisma2T.mode	@ltx/en_us_oca/miscellanea:misc.Mode1
ltx/en_us_oca/me.m07.d20:meMA.Kathisma2T.text	@ltx/en_us_oca/oc.m1.d1:ocMA.Kathisma23.text
ltx/en_us_oca/me.m07.d20:meMA.Kontakion1.incipit	…
ltx/en_us_oca/me.m07.d20:meMA.Kontakion1.melody	@ltx/en_us_oca/miscellanea:misc.AutomelonNotMetered
ltx/en_us_oca/me.m07.d20:meMA.Kontakion1.mode	@ltx/en_us_oca/miscellanea:misc.Mode2
ltx/en_us_oca/me.m07.d20:meMA.Kontakion1.text	
ltx/en_us_oca/me.m07.d20:meMA.Lauds1.greekmelody	@ltx/en_us_oca/he.a.m8:heAU.TiYmasKalesomen.greekname
ltx/en_us_oca/me.m07.d20:meMA.Lauds1.incipit	…
ltx/en_us_oca/me.m07.d20:meMA.Lauds1.melody	@ltx/en_us_oca/he.a.m8:heAU.TiYmasKalesomen.notmetered
ltx/en_us_oca/me.m07.d20:meMA.Lauds1.mode	@ltx/en_us_oca/miscellanea:misc.Mode8
ltx/en_us_oca/me.m07.d20:meMA.Lauds1.text	
ltx/en_us_oca/me.m07.d20:meMA.Lauds2.incipit	…
ltx/en_us_oca/me.m07.d20:meMA.Lauds2.melody	@ltx/en_us_oca/he.a.m8:heAU.TiYmasKalesomen.notmetered
ltx/en_us_oca/me.m07.d20:meMA.Lauds2.mode	@ltx/en_us_oca/miscellanea:misc.Mode8
ltx/en_us_oca/me.m07.d20:meMA.Lauds2.text	
ltx/en_us_oca/me.m07.d20:meMA.Lauds3.incipit	…
ltx/en_us_oca/me.m07.d20:meMA.Lauds3.melody	@ltx/en_us_oca/he.a.m8:heAU.TiYmasKalesomen.notmetered
ltx/en_us_oca/me.m07.d20:meMA.Lauds3.mode	@ltx/en_us_oca/miscellanea:misc.Mode8
ltx/en_us_oca/me.m07.d20:meMA.Lauds3.text	
ltx/en_us_oca/me.m07.d20:meMA.LaudsGlory.incipit	…
ltx/en_us_oca/me.m07.d20:meMA.LaudsGlory.melody	
ltx/en_us_oca/me.m07.d20:meMA.LaudsGlory.mode	@ltx/en_us_oca/miscellanea:misc.Mode8
ltx/en_us_oca/me.m07.d20:meMA.LaudsGlory.text	
ltx/en_us_oca/me.m07.d20:meMA.LaudsTheotokion.incipit	@ltx/en_us_oca/oc.m8.d5:ocMA.AposTheotokion.incipit
ltx/en_us_oca/me.m07.d20:meMA.LaudsTheotokion.melody	
ltx/en_us_oca/me.m07.d20:meMA.LaudsTheotokion.mode	@ltx/en_us_oca/miscellanea:misc.Mode8
ltx/en_us_oca/me.m07.d20:meMA.LaudsTheotokion.text	@ltx/en_us_oca/oc.m8.d5:ocMA.AposTheotokion.text
ltx/en_us_oca/me.m07.d20:meMA.MM.Lauds1123as5678.text	@ltx/en_us_oca/properties:media.key
ltx/en_us_oca/me.m07.d20:meMA.Ode1C11.greekmelody	@ltx/en_us_oca/he.h.m2:heHE.AsomenToKyrio.greekname
ltx/en_us_oca/me.m07.d20:meMA.Ode1C11.incipit	…
ltx/en_us_oca/me.m07.d20:meMA.Ode1C11.melody	@ltx/en_us_oca/he.h.m2:heHE.AsomenToKyrio.notmetered
ltx/en_us_oca/me.m07.d20:meMA.Ode1C11.mode	@ltx/en_us_oca/miscellanea:misc.Mode2
ltx/en_us_oca/me.m07.d20:meMA.Ode1C11.ode	@ltx/en_us_oca/miscellanea:misc.Ode1
ltx/en_us_oca/me.m07.d20:meMA.Ode1C11.text	
ltx/en_us_oca/me.m07.d20:meMA.Ode1C12.incipit	…
ltx/en_us_oca/me.m07.d20:meMA.Ode1C12.melody	@ltx/en_us_oca/he.h.m2:heHE.AsomenToKyrio.notmetered
ltx/en_us_oca/me.m07.d20:meMA.Ode1C12.mode	@ltx/en_us_oca/miscellanea:misc.Mode2
ltx/en_us_oca/me.m07.d20:meMA.Ode1C12.ode	@ltx/en_us_oca/miscellanea:misc.Ode1
ltx/en_us_oca/me.m07.d20:meMA.Ode1C12.text	
ltx/en_us_oca/me.m07.d20:meMA.Ode1C13.incipit	…
ltx/en_us_oca/me.m07.d20:meMA.Ode1C13.melody	@ltx/en_us_oca/he.h.m2:heHE.AsomenToKyrio.notmetered
ltx/en_us_oca/me.m07.d20:meMA.Ode1C13.mode	@ltx/en_us_oca/miscellanea:misc.Mode2
ltx/en_us_oca/me.m07.d20:meMA.Ode1C13.ode	@ltx/en_us_oca/miscellanea:misc.Ode1
ltx/en_us_oca/me.m07.d20:meMA.Ode1C13.text	
ltx/en_us_oca/me.m07.d20:meMA.Ode1C1T.incipit	…
ltx/en_us_oca/me.m07.d20:meMA.Ode1C1T.melody	@ltx/en_us_oca/he.h.m2:heHE.AsomenToKyrio.notmetered
ltx/en_us_oca/me.m07.d20:meMA.Ode1C1T.mode	@ltx/en_us_oca/miscellanea:misc.Mode2
ltx/en_us_oca/me.m07.d20:meMA.Ode1C1T.ode	@ltx/en_us_oca/miscellanea:misc.Ode1
ltx/en_us_oca/me.m07.d20:meMA.Ode1C1T.text	
ltx/en_us_oca/me.m07.d20:meMA.Ode1C21.greekmelody	@ltx/en_us_oca/he.h.m8:heHE.ArmatilatinFarao.greekname
ltx/en_us_oca/me.m07.d20:meMA.Ode1C21.incipit	…
ltx/en_us_oca/me.m07.d20:meMA.Ode1C21.melody	@ltx/en_us_oca/he.h.m8:heHE.ArmatilatinFarao.notmetered
ltx/en_us_oca/me.m07.d20:meMA.Ode1C21.mode	@ltx/en_us_oca/miscellanea:misc.Mode8
ltx/en_us_oca/me.m07.d20:meMA.Ode1C21.ode	@ltx/en_us_oca/miscellanea:misc.Ode1
ltx/en_us_oca/me.m07.d20:meMA.Ode1C21.text	
ltx/en_us_oca/me.m07.d20:meMA.Ode1C22.incipit	…
ltx/en_us_oca/me.m07.d20:meMA.Ode1C22.melody	@ltx/en_us_oca/he.h.m8:heHE.ArmatilatinFarao.notmetered
ltx/en_us_oca/me.m07.d20:meMA.Ode1C22.mode	@ltx/en_us_oca/miscellanea:misc.Mode8
ltx/en_us_oca/me.m07.d20:meMA.Ode1C22.ode	@ltx/en_us_oca/miscellanea:misc.Ode1
ltx/en_us_oca/me.m07.d20:meMA.Ode1C22.text	
ltx/en_us_oca/me.m07.d20:meMA.Ode1C23.incipit	…
ltx/en_us_oca/me.m07.d20:meMA.Ode1C23.melody	@ltx/en_us_oca/he.h.m8:heHE.ArmatilatinFarao.notmetered
ltx/en_us_oca/me.m07.d20:meMA.Ode1C23.mode	@ltx/en_us_oca/miscellanea:misc.Mode8
ltx/en_us_oca/me.m07.d20:meMA.Ode1C23.ode	@ltx/en_us_oca/miscellanea:misc.Ode1
ltx/en_us_oca/me.m07.d20:meMA.Ode1C23.text	
ltx/en_us_oca/me.m07.d20:meMA.Ode1C2T.incipit	…
ltx/en_us_oca/me.m07.d20:meMA.Ode1C2T.melody	@ltx/en_us_oca/he.h.m8:heHE.ArmatilatinFarao.notmetered
ltx/en_us_oca/me.m07.d20:meMA.Ode1C2T.mode	@ltx/en_us_oca/miscellanea:misc.Mode8
ltx/en_us_oca/me.m07.d20:meMA.Ode1C2T.ode	@ltx/en_us_oca/miscellanea:misc.Ode1
ltx/en_us_oca/me.m07.d20:meMA.Ode1C2T.text	
ltx/en_us_oca/me.m07.d20:meMA.Ode3C11.greekmelody	@ltx/en_us_oca/he.h.m2:heHE.EnPetraMeTisPisteos.greekname
ltx/en_us_oca/me.m07.d20:meMA.Ode3C11.incipit	…
ltx/en_us_oca/me.m07.d20:meMA.Ode3C11.melody	@ltx/en_us_oca/he.h.m2:heHE.EnPetraMeTisPisteos.notmetered
ltx/en_us_oca/me.m07.d20:meMA.Ode3C11.mode	@ltx/en_us_oca/miscellanea:misc.Mode2
ltx/en_us_oca/me.m07.d20:meMA.Ode3C11.ode	@ltx/en_us_oca/miscellanea:misc.Ode3
ltx/en_us_oca/me.m07.d20:meMA.Ode3C11.text	
ltx/en_us_oca/me.m07.d20:meMA.Ode3C12.incipit	…
ltx/en_us_oca/me.m07.d20:meMA.Ode3C12.melody	@ltx/en_us_oca/he.h.m2:heHE.EnPetraMeTisPisteos.notmetered
ltx/en_us_oca/me.m07.d20:meMA.Ode3C12.mode	@ltx/en_us_oca/miscellanea:misc.Mode2
ltx/en_us_oca/me.m07.d20:meMA.Ode3C12.ode	@ltx/en_us_oca/miscellanea:misc.Ode3
ltx/en_us_oca/me.m07.d20:meMA.Ode3C12.text	
ltx/en_us_oca/me.m07.d20:meMA.Ode3C13.incipit	…
ltx/en_us_oca/me.m07.d20:meMA.Ode3C13.melody	@ltx/en_us_oca/he.h.m2:heHE.EnPetraMeTisPisteos.notmetered
ltx/en_us_oca/me.m07.d20:meMA.Ode3C13.mode	@ltx/en_us_oca/miscellanea:misc.Mode2
ltx/en_us_oca/me.m07.d20:meMA.Ode3C13.ode	@ltx/en_us_oca/miscellanea:misc.Ode3
ltx/en_us_oca/me.m07.d20:meMA.Ode3C13.text	
ltx/en_us_oca/me.m07.d20:meMA.Ode3C1T.incipit	…
ltx/en_us_oca/me.m07.d20:meMA.Ode3C1T.melody	@ltx/en_us_oca/he.h.m2:heHE.EnPetraMeTisPisteos.notmetered
ltx/en_us_oca/me.m07.d20:meMA.Ode3C1T.mode	@ltx/en_us_oca/miscellanea:misc.Mode2
ltx/en_us_oca/me.m07.d20:meMA.Ode3C1T.ode	@ltx/en_us_oca/miscellanea:misc.Ode3
ltx/en_us_oca/me.m07.d20:meMA.Ode3C1T.text	
ltx/en_us_oca/me.m07.d20:meMA.Ode3C21.greekmelody	@ltx/en_us_oca/he.h.m8:heHE.OuraniasApsidos.greekname
ltx/en_us_oca/me.m07.d20:meMA.Ode3C21.incipit	…
ltx/en_us_oca/me.m07.d20:meMA.Ode3C21.melody	@ltx/en_us_oca/he.h.m8:heHE.OuraniasApsidos.notmetered
ltx/en_us_oca/me.m07.d20:meMA.Ode3C21.mode	@ltx/en_us_oca/miscellanea:misc.Mode8
ltx/en_us_oca/me.m07.d20:meMA.Ode3C21.ode	@ltx/en_us_oca/miscellanea:misc.Ode3
ltx/en_us_oca/me.m07.d20:meMA.Ode3C21.text	
ltx/en_us_oca/me.m07.d20:meMA.Ode3C22.incipit	…
ltx/en_us_oca/me.m07.d20:meMA.Ode3C22.melody	@ltx/en_us_oca/he.h.m8:heHE.OuraniasApsidos.notmetered
ltx/en_us_oca/me.m07.d20:meMA.Ode3C22.mode	@ltx/en_us_oca/miscellanea:misc.Mode8
ltx/en_us_oca/me.m07.d20:meMA.Ode3C22.ode	@ltx/en_us_oca/miscellanea:misc.Ode3
ltx/en_us_oca/me.m07.d20:meMA.Ode3C22.text	
ltx/en_us_oca/me.m07.d20:meMA.Ode3C23.incipit	…
ltx/en_us_oca/me.m07.d20:meMA.Ode3C23.melody	@ltx/en_us_oca/he.h.m8:heHE.OuraniasApsidos.notmetered
ltx/en_us_oca/me.m07.d20:meMA.Ode3C23.mode	@ltx/en_us_oca/miscellanea:misc.Mode8
ltx/en_us_oca/me.m07.d20:meMA.Ode3C23.ode	@ltx/en_us_oca/miscellanea:misc.Ode3
ltx/en_us_oca/me.m07.d20:meMA.Ode3C23.text	
ltx/en_us_oca/me.m07.d20:meMA.Ode3C2T.incipit	…
ltx/en_us_oca/me.m07.d20:meMA.Ode3C2T.melody	@ltx/en_us_oca/he.h.m8:heHE.OuraniasApsidos.notmetered
ltx/en_us_oca/me.m07.d20:meMA.Ode3C2T.mode	@ltx/en_us_oca/miscellanea:misc.Mode8
ltx/en_us_oca/me.m07.d20:meMA.Ode3C2T.ode	@ltx/en_us_oca/miscellanea:misc.Ode3
ltx/en_us_oca/me.m07.d20:meMA.Ode3C2T.text	
ltx/en_us_oca/me.m07.d20:meMA.Ode3Kathisma1.greekmelody	@ltx/en_us_oca/he.a.m8:heAU.TinSofianKaiLogon.greekname
ltx/en_us_oca/me.m07.d20:meMA.Ode3Kathisma1.incipit	…
ltx/en_us_oca/me.m07.d20:meMA.Ode3Kathisma1.melody	@ltx/en_us_oca/he.a.m8:heAU.TinSofianKaiLogon.notmetered
ltx/en_us_oca/me.m07.d20:meMA.Ode3Kathisma1.mode	@ltx/en_us_oca/miscellanea:misc.Mode8
ltx/en_us_oca/me.m07.d20:meMA.Ode3Kathisma1.text	
ltx/en_us_oca/me.m07.d20:meMA.Ode3KathismaT.incipit	…
ltx/en_us_oca/me.m07.d20:meMA.Ode3KathismaT.melody	@ltx/en_us_oca/he.a.m8:heAU.TinSofianKaiLogon.notmetered
ltx/en_us_oca/me.m07.d20:meMA.Ode3KathismaT.mode	@ltx/en_us_oca/miscellanea:misc.Mode8
ltx/en_us_oca/me.m07.d20:meMA.Ode3KathismaT.text	
ltx/en_us_oca/me.m07.d20:meMA.Ode4C11.greekmelody	@ltx/en_us_oca/he.h.m2:heHE.EisakikoaKyrieTinAkoin.greekname
ltx/en_us_oca/me.m07.d20:meMA.Ode4C11.incipit	…
ltx/en_us_oca/me.m07.d20:meMA.Ode4C11.melody	@ltx/en_us_oca/he.h.m2:heHE.EisakikoaKyrieTinAkoin.notmetered
ltx/en_us_oca/me.m07.d20:meMA.Ode4C11.mode	@ltx/en_us_oca/miscellanea:misc.Mode2
ltx/en_us_oca/me.m07.d20:meMA.Ode4C11.ode	@ltx/en_us_oca/miscellanea:misc.Ode4
ltx/en_us_oca/me.m07.d20:meMA.Ode4C11.text	
ltx/en_us_oca/me.m07.d20:meMA.Ode4C12.incipit	…
ltx/en_us_oca/me.m07.d20:meMA.Ode4C12.melody	@ltx/en_us_oca/he.h.m2:heHE.EisakikoaKyrieTinAkoin.notmetered
ltx/en_us_oca/me.m07.d20:meMA.Ode4C12.mode	@ltx/en_us_oca/miscellanea:misc.Mode2
ltx/en_us_oca/me.m07.d20:meMA.Ode4C12.ode	@ltx/en_us_oca/miscellanea:misc.Ode4
ltx/en_us_oca/me.m07.d20:meMA.Ode4C12.text	
ltx/en_us_oca/me.m07.d20:meMA.Ode4C13.incipit	…
ltx/en_us_oca/me.m07.d20:meMA.Ode4C13.melody	@ltx/en_us_oca/he.h.m2:heHE.EisakikoaKyrieTinAkoin.notmetered
ltx/en_us_oca/me.m07.d20:meMA.Ode4C13.mode	@ltx/en_us_oca/miscellanea:misc.Mode2
ltx/en_us_oca/me.m07.d20:meMA.Ode4C13.ode	@ltx/en_us_oca/miscellanea:misc.Ode4
ltx/en_us_oca/me.m07.d20:meMA.Ode4C13.text	
ltx/en_us_oca/me.m07.d20:meMA.Ode4C1T.incipit	…
ltx/en_us_oca/me.m07.d20:meMA.Ode4C1T.melody	@ltx/en_us_oca/he.h.m2:heHE.EisakikoaKyrieTinAkoin.notmetered
ltx/en_us_oca/me.m07.d20:meMA.Ode4C1T.mode	@ltx/en_us_oca/miscellanea:misc.Mode2
ltx/en_us_oca/me.m07.d20:meMA.Ode4C1T.ode	@ltx/en_us_oca/miscellanea:misc.Ode4
ltx/en_us_oca/me.m07.d20:meMA.Ode4C1T.text	
ltx/en_us_oca/me.m07.d20:meMA.Ode4C21.greekmelody	@ltx/en_us_oca/he.h.m8:heHE.SyMouIschys.greekname
ltx/en_us_oca/me.m07.d20:meMA.Ode4C21.incipit	…
ltx/en_us_oca/me.m07.d20:meMA.Ode4C21.melody	@ltx/en_us_oca/he.h.m8:heHE.SyMouIschys.notmetered
ltx/en_us_oca/me.m07.d20:meMA.Ode4C21.mode	@ltx/en_us_oca/miscellanea:misc.Mode8
ltx/en_us_oca/me.m07.d20:meMA.Ode4C21.ode	@ltx/en_us_oca/miscellanea:misc.Ode4
ltx/en_us_oca/me.m07.d20:meMA.Ode4C21.text	
ltx/en_us_oca/me.m07.d20:meMA.Ode4C22.incipit	…
ltx/en_us_oca/me.m07.d20:meMA.Ode4C22.melody	@ltx/en_us_oca/he.h.m8:heHE.SyMouIschys.notmetered
ltx/en_us_oca/me.m07.d20:meMA.Ode4C22.mode	@ltx/en_us_oca/miscellanea:misc.Mode8
ltx/en_us_oca/me.m07.d20:meMA.Ode4C22.ode	@ltx/en_us_oca/miscellanea:misc.Ode4
ltx/en_us_oca/me.m07.d20:meMA.Ode4C22.text	
ltx/en_us_oca/me.m07.d20:meMA.Ode4C23.incipit	…
ltx/en_us_oca/me.m07.d20:meMA.Ode4C23.melody	@ltx/en_us_oca/he.h.m8:heHE.SyMouIschys.notmetered
ltx/en_us_oca/me.m07.d20:meMA.Ode4C23.mode	@ltx/en_us_oca/miscellanea:misc.Mode8
ltx/en_us_oca/me.m07.d20:meMA.Ode4C23.ode	@ltx/en_us_oca/miscellanea:misc.Ode4
ltx/en_us_oca/me.m07.d20:meMA.Ode4C23.text	
ltx/en_us_oca/me.m07.d20:meMA.Ode4C2T.incipit	…
ltx/en_us_oca/me.m07.d20:meMA.Ode4C2T.melody	@ltx/en_us_oca/he.h.m8:heHE.SyMouIschys.notmetered
ltx/en_us_oca/me.m07.d20:meMA.Ode4C2T.mode	@ltx/en_us_oca/miscellanea:misc.Mode8
ltx/en_us_oca/me.m07.d20:meMA.Ode4C2T.ode	@ltx/en_us_oca/miscellanea:misc.Ode4
ltx/en_us_oca/me.m07.d20:meMA.Ode4C2T.text	
ltx/en_us_oca/me.m07.d20:meMA.Ode5C11.greekmelody	@ltx/en_us_oca/he.h.m2:heHE.OTouFotosChorigos.greekname
ltx/en_us_oca/me.m07.d20:meMA.Ode5C11.incipit	…
ltx/en_us_oca/me.m07.d20:meMA.Ode5C11.melody	@ltx/en_us_oca/he.h.m2:heHE.OTouFotosChorigos.notmetered
ltx/en_us_oca/me.m07.d20:meMA.Ode5C11.mode	@ltx/en_us_oca/miscellanea:misc.Mode2
ltx/en_us_oca/me.m07.d20:meMA.Ode5C11.ode	@ltx/en_us_oca/miscellanea:misc.Ode5
ltx/en_us_oca/me.m07.d20:meMA.Ode5C11.text	
ltx/en_us_oca/me.m07.d20:meMA.Ode5C12.incipit	…
ltx/en_us_oca/me.m07.d20:meMA.Ode5C12.melody	@ltx/en_us_oca/he.h.m2:heHE.OTouFotosChorigos.notmetered
ltx/en_us_oca/me.m07.d20:meMA.Ode5C12.mode	@ltx/en_us_oca/miscellanea:misc.Mode2
ltx/en_us_oca/me.m07.d20:meMA.Ode5C12.ode	@ltx/en_us_oca/miscellanea:misc.Ode5
ltx/en_us_oca/me.m07.d20:meMA.Ode5C12.text	
ltx/en_us_oca/me.m07.d20:meMA.Ode5C13.incipit	…
ltx/en_us_oca/me.m07.d20:meMA.Ode5C13.melody	@ltx/en_us_oca/he.h.m2:heHE.OTouFotosChorigos.notmetered
ltx/en_us_oca/me.m07.d20:meMA.Ode5C13.mode	@ltx/en_us_oca/miscellanea:misc.Mode2
ltx/en_us_oca/me.m07.d20:meMA.Ode5C13.ode	@ltx/en_us_oca/miscellanea:misc.Ode5
ltx/en_us_oca/me.m07.d20:meMA.Ode5C13.text	
ltx/en_us_oca/me.m07.d20:meMA.Ode5C1T.incipit	…
ltx/en_us_oca/me.m07.d20:meMA.Ode5C1T.melody	@ltx/en_us_oca/he.h.m2:heHE.OTouFotosChorigos.notmetered
ltx/en_us_oca/me.m07.d20:meMA.Ode5C1T.mode	@ltx/en_us_oca/miscellanea:misc.Mode2
ltx/en_us_oca/me.m07.d20:meMA.Ode5C1T.ode	@ltx/en_us_oca/miscellanea:misc.Ode5
ltx/en_us_oca/me.m07.d20:meMA.Ode5C1T.text	
ltx/en_us_oca/me.m07.d20:meMA.Ode5C21.greekmelody	@ltx/en_us_oca/he.h.m8:heHE.InaTiMeAposo.greekname
ltx/en_us_oca/me.m07.d20:meMA.Ode5C21.incipit	…
ltx/en_us_oca/me.m07.d20:meMA.Ode5C21.melody	@ltx/en_us_oca/he.h.m8:heHE.InaTiMeAposo.notmetered
ltx/en_us_oca/me.m07.d20:meMA.Ode5C21.mode	@ltx/en_us_oca/miscellanea:misc.Mode8
ltx/en_us_oca/me.m07.d20:meMA.Ode5C21.ode	@ltx/en_us_oca/miscellanea:misc.Ode5
ltx/en_us_oca/me.m07.d20:meMA.Ode5C21.text	
ltx/en_us_oca/me.m07.d20:meMA.Ode5C22.incipit	…
ltx/en_us_oca/me.m07.d20:meMA.Ode5C22.melody	@ltx/en_us_oca/he.h.m8:heHE.InaTiMeAposo.notmetered
ltx/en_us_oca/me.m07.d20:meMA.Ode5C22.mode	@ltx/en_us_oca/miscellanea:misc.Mode8
ltx/en_us_oca/me.m07.d20:meMA.Ode5C22.ode	@ltx/en_us_oca/miscellanea:misc.Ode5
ltx/en_us_oca/me.m07.d20:meMA.Ode5C22.text	
ltx/en_us_oca/me.m07.d20:meMA.Ode5C23.incipit	…
ltx/en_us_oca/me.m07.d20:meMA.Ode5C23.melody	@ltx/en_us_oca/he.h.m8:heHE.InaTiMeAposo.notmetered
ltx/en_us_oca/me.m07.d20:meMA.Ode5C23.mode	@ltx/en_us_oca/miscellanea:misc.Mode8
ltx/en_us_oca/me.m07.d20:meMA.Ode5C23.ode	@ltx/en_us_oca/miscellanea:misc.Ode5
ltx/en_us_oca/me.m07.d20:meMA.Ode5C23.text	
ltx/en_us_oca/me.m07.d20:meMA.Ode5C2T.incipit	…
ltx/en_us_oca/me.m07.d20:meMA.Ode5C2T.melody	@ltx/en_us_oca/he.h.m8:heHE.InaTiMeAposo.notmetered
ltx/en_us_oca/me.m07.d20:meMA.Ode5C2T.mode	@ltx/en_us_oca/miscellanea:misc.Mode8
ltx/en_us_oca/me.m07.d20:meMA.Ode5C2T.ode	@ltx/en_us_oca/miscellanea:misc.Ode5
ltx/en_us_oca/me.m07.d20:meMA.Ode5C2T.text	
ltx/en_us_oca/me.m07.d20:meMA.Ode6C11.greekmelody	@ltx/en_us_oca/he.h.m2:heHE.AvyssosAmartimaton.greekname
ltx/en_us_oca/me.m07.d20:meMA.Ode6C11.incipit	…
ltx/en_us_oca/me.m07.d20:meMA.Ode6C11.melody	@ltx/en_us_oca/he.h.m2:heHE.AvyssosAmartimaton.notmetered
ltx/en_us_oca/me.m07.d20:meMA.Ode6C11.mode	@ltx/en_us_oca/miscellanea:misc.Mode2
ltx/en_us_oca/me.m07.d20:meMA.Ode6C11.ode	@ltx/en_us_oca/miscellanea:misc.Ode6
ltx/en_us_oca/me.m07.d20:meMA.Ode6C11.text	
ltx/en_us_oca/me.m07.d20:meMA.Ode6C12.incipit	…
ltx/en_us_oca/me.m07.d20:meMA.Ode6C12.melody	@ltx/en_us_oca/he.h.m2:heHE.AvyssosAmartimaton.notmetered
ltx/en_us_oca/me.m07.d20:meMA.Ode6C12.mode	@ltx/en_us_oca/miscellanea:misc.Mode2
ltx/en_us_oca/me.m07.d20:meMA.Ode6C12.ode	@ltx/en_us_oca/miscellanea:misc.Ode6
ltx/en_us_oca/me.m07.d20:meMA.Ode6C12.text	
ltx/en_us_oca/me.m07.d20:meMA.Ode6C13.incipit	…
ltx/en_us_oca/me.m07.d20:meMA.Ode6C13.melody	@ltx/en_us_oca/he.h.m2:heHE.AvyssosAmartimaton.notmetered
ltx/en_us_oca/me.m07.d20:meMA.Ode6C13.mode	@ltx/en_us_oca/miscellanea:misc.Mode2
ltx/en_us_oca/me.m07.d20:meMA.Ode6C13.ode	@ltx/en_us_oca/miscellanea:misc.Ode6
ltx/en_us_oca/me.m07.d20:meMA.Ode6C13.text	
ltx/en_us_oca/me.m07.d20:meMA.Ode6C1T.incipit	…
ltx/en_us_oca/me.m07.d20:meMA.Ode6C1T.melody	@ltx/en_us_oca/he.h.m2:heHE.AvyssosAmartimaton.notmetered
ltx/en_us_oca/me.m07.d20:meMA.Ode6C1T.mode	@ltx/en_us_oca/miscellanea:misc.Mode2
ltx/en_us_oca/me.m07.d20:meMA.Ode6C1T.ode	@ltx/en_us_oca/miscellanea:misc.Ode6
ltx/en_us_oca/me.m07.d20:meMA.Ode6C1T.text	
ltx/en_us_oca/me.m07.d20:meMA.Ode6C21.greekmelody	@ltx/en_us_oca/he.h.m8:heHE.IlasthitiMoiSotir.greekname
ltx/en_us_oca/me.m07.d20:meMA.Ode6C21.incipit	…
ltx/en_us_oca/me.m07.d20:meMA.Ode6C21.melody	@ltx/en_us_oca/he.h.m8:heHE.IlasthitiMoiSotir.notmetered
ltx/en_us_oca/me.m07.d20:meMA.Ode6C21.mode	@ltx/en_us_oca/miscellanea:misc.Mode8
ltx/en_us_oca/me.m07.d20:meMA.Ode6C21.ode	@ltx/en_us_oca/miscellanea:misc.Ode6
ltx/en_us_oca/me.m07.d20:meMA.Ode6C21.text	
ltx/en_us_oca/me.m07.d20:meMA.Ode6C22.incipit	…
ltx/en_us_oca/me.m07.d20:meMA.Ode6C22.melody	@ltx/en_us_oca/he.h.m8:heHE.IlasthitiMoiSotir.notmetered
ltx/en_us_oca/me.m07.d20:meMA.Ode6C22.mode	@ltx/en_us_oca/miscellanea:misc.Mode8
ltx/en_us_oca/me.m07.d20:meMA.Ode6C22.ode	@ltx/en_us_oca/miscellanea:misc.Ode6
ltx/en_us_oca/me.m07.d20:meMA.Ode6C22.text	
ltx/en_us_oca/me.m07.d20:meMA.Ode6C23.incipit	…
ltx/en_us_oca/me.m07.d20:meMA.Ode6C23.melody	@ltx/en_us_oca/he.h.m8:heHE.IlasthitiMoiSotir.notmetered
ltx/en_us_oca/me.m07.d20:meMA.Ode6C23.mode	@ltx/en_us_oca/miscellanea:misc.Mode8
ltx/en_us_oca/me.m07.d20:meMA.Ode6C23.ode	@ltx/en_us_oca/miscellanea:misc.Ode6
ltx/en_us_oca/me.m07.d20:meMA.Ode6C23.text	
ltx/en_us_oca/me.m07.d20:meMA.Ode6C2T.incipit	…
ltx/en_us_oca/me.m07.d20:meMA.Ode6C2T.melody	@ltx/en_us_oca/he.h.m8:heHE.IlasthitiMoiSotir.notmetered
ltx/en_us_oca/me.m07.d20:meMA.Ode6C2T.mode	@ltx/en_us_oca/miscellanea:misc.Mode8
ltx/en_us_oca/me.m07.d20:meMA.Ode6C2T.ode	@ltx/en_us_oca/miscellanea:misc.Ode6
ltx/en_us_oca/me.m07.d20:meMA.Ode6C2T.text	
ltx/en_us_oca/me.m07.d20:meMA.Ode7C11.greekmelody	@ltx/en_us_oca/he.h.m2:heHE.VatosEnOrei.greekname
ltx/en_us_oca/me.m07.d20:meMA.Ode7C11.incipit	…
ltx/en_us_oca/me.m07.d20:meMA.Ode7C11.melody	@ltx/en_us_oca/he.h.m2:heHE.VatosEnOrei.notmetered
ltx/en_us_oca/me.m07.d20:meMA.Ode7C11.mode	@ltx/en_us_oca/miscellanea:misc.Mode2
ltx/en_us_oca/me.m07.d20:meMA.Ode7C11.ode	@ltx/en_us_oca/miscellanea:misc.Ode7
ltx/en_us_oca/me.m07.d20:meMA.Ode7C11.text	
ltx/en_us_oca/me.m07.d20:meMA.Ode7C12.incipit	…
ltx/en_us_oca/me.m07.d20:meMA.Ode7C12.melody	@ltx/en_us_oca/he.h.m2:heHE.VatosEnOrei.notmetered
ltx/en_us_oca/me.m07.d20:meMA.Ode7C12.mode	@ltx/en_us_oca/miscellanea:misc.Mode2
ltx/en_us_oca/me.m07.d20:meMA.Ode7C12.ode	@ltx/en_us_oca/miscellanea:misc.Ode7
ltx/en_us_oca/me.m07.d20:meMA.Ode7C12.text	
ltx/en_us_oca/me.m07.d20:meMA.Ode7C13.incipit	…
ltx/en_us_oca/me.m07.d20:meMA.Ode7C13.melody	@ltx/en_us_oca/he.h.m2:heHE.VatosEnOrei.notmetered
ltx/en_us_oca/me.m07.d20:meMA.Ode7C13.mode	@ltx/en_us_oca/miscellanea:misc.Mode2
ltx/en_us_oca/me.m07.d20:meMA.Ode7C13.ode	@ltx/en_us_oca/miscellanea:misc.Ode7
ltx/en_us_oca/me.m07.d20:meMA.Ode7C13.text	
ltx/en_us_oca/me.m07.d20:meMA.Ode7C1T.incipit	…
ltx/en_us_oca/me.m07.d20:meMA.Ode7C1T.melody	@ltx/en_us_oca/he.h.m2:heHE.VatosEnOrei.notmetered
ltx/en_us_oca/me.m07.d20:meMA.Ode7C1T.mode	@ltx/en_us_oca/miscellanea:misc.Mode2
ltx/en_us_oca/me.m07.d20:meMA.Ode7C1T.ode	@ltx/en_us_oca/miscellanea:misc.Ode7
ltx/en_us_oca/me.m07.d20:meMA.Ode7C1T.text	
ltx/en_us_oca/me.m07.d20:meMA.Ode7C21.greekmelody	@ltx/en_us_oca/he.h.m8:heHE.TheouSynkatavasin.greekname
ltx/en_us_oca/me.m07.d20:meMA.Ode7C21.incipit	…
ltx/en_us_oca/me.m07.d20:meMA.Ode7C21.melody	@ltx/en_us_oca/he.h.m8:heHE.TheouSynkatavasin.notmetered
ltx/en_us_oca/me.m07.d20:meMA.Ode7C21.mode	@ltx/en_us_oca/miscellanea:misc.Mode8
ltx/en_us_oca/me.m07.d20:meMA.Ode7C21.ode	@ltx/en_us_oca/miscellanea:misc.Ode7
ltx/en_us_oca/me.m07.d20:meMA.Ode7C21.text	
ltx/en_us_oca/me.m07.d20:meMA.Ode7C22.incipit	…
ltx/en_us_oca/me.m07.d20:meMA.Ode7C22.melody	@ltx/en_us_oca/he.h.m8:heHE.TheouSynkatavasin.notmetered
ltx/en_us_oca/me.m07.d20:meMA.Ode7C22.mode	@ltx/en_us_oca/miscellanea:misc.Mode8
ltx/en_us_oca/me.m07.d20:meMA.Ode7C22.ode	@ltx/en_us_oca/miscellanea:misc.Ode7
ltx/en_us_oca/me.m07.d20:meMA.Ode7C22.text	
ltx/en_us_oca/me.m07.d20:meMA.Ode7C23.incipit	…
ltx/en_us_oca/me.m07.d20:meMA.Ode7C23.melody	@ltx/en_us_oca/he.h.m8:heHE.TheouSynkatavasin.notmetered
ltx/en_us_oca/me.m07.d20:meMA.Ode7C23.mode	@ltx/en_us_oca/miscellanea:misc.Mode8
ltx/en_us_oca/me.m07.d20:meMA.Ode7C23.ode	@ltx/en_us_oca/miscellanea:misc.Ode7
ltx/en_us_oca/me.m07.d20:meMA.Ode7C23.text	
ltx/en_us_oca/me.m07.d20:meMA.Ode7C2T.incipit	…
ltx/en_us_oca/me.m07.d20:meMA.Ode7C2T.melody	@ltx/en_us_oca/he.h.m8:heHE.TheouSynkatavasin.notmetered
ltx/en_us_oca/me.m07.d20:meMA.Ode7C2T.mode	@ltx/en_us_oca/miscellanea:misc.Mode8
ltx/en_us_oca/me.m07.d20:meMA.Ode7C2T.ode	@ltx/en_us_oca/miscellanea:misc.Ode7
ltx/en_us_oca/me.m07.d20:meMA.Ode7C2T.text	
ltx/en_us_oca/me.m07.d20:meMA.Ode8C11.greekmelody	@ltx/en_us_oca/he.h.m2:heHE.EfrixePaidonEvagon.greekname
ltx/en_us_oca/me.m07.d20:meMA.Ode8C11.incipit	…
ltx/en_us_oca/me.m07.d20:meMA.Ode8C11.melody	@ltx/en_us_oca/he.h.m2:heHE.EfrixePaidonEvagon.notmetered
ltx/en_us_oca/me.m07.d20:meMA.Ode8C11.mode	@ltx/en_us_oca/miscellanea:misc.Mode2
ltx/en_us_oca/me.m07.d20:meMA.Ode8C11.ode	@ltx/en_us_oca/miscellanea:misc.Ode8
ltx/en_us_oca/me.m07.d20:meMA.Ode8C11.text	
ltx/en_us_oca/me.m07.d20:meMA.Ode8C12.incipit	…
ltx/en_us_oca/me.m07.d20:meMA.Ode8C12.melody	@ltx/en_us_oca/he.h.m2:heHE.EfrixePaidonEvagon.notmetered
ltx/en_us_oca/me.m07.d20:meMA.Ode8C12.mode	@ltx/en_us_oca/miscellanea:misc.Mode2
ltx/en_us_oca/me.m07.d20:meMA.Ode8C12.ode	@ltx/en_us_oca/miscellanea:misc.Ode8
ltx/en_us_oca/me.m07.d20:meMA.Ode8C12.text	
ltx/en_us_oca/me.m07.d20:meMA.Ode8C1T.incipit	…
ltx/en_us_oca/me.m07.d20:meMA.Ode8C1T.melody	@ltx/en_us_oca/he.h.m2:heHE.EfrixePaidonEvagon.notmetered
ltx/en_us_oca/me.m07.d20:meMA.Ode8C1T.mode	@ltx/en_us_oca/miscellanea:misc.Mode2
ltx/en_us_oca/me.m07.d20:meMA.Ode8C1T.ode	@ltx/en_us_oca/miscellanea:misc.Ode8
ltx/en_us_oca/me.m07.d20:meMA.Ode8C1T.text	
ltx/en_us_oca/me.m07.d20:meMA.Ode8C21.greekmelody	@ltx/en_us_oca/he.h.m8:heHE.EptaplasiosKaminon.greekname
ltx/en_us_oca/me.m07.d20:meMA.Ode8C21.incipit	…
ltx/en_us_oca/me.m07.d20:meMA.Ode8C21.melody	@ltx/en_us_oca/he.h.m8:heHE.EptaplasiosKaminon.notmetered
ltx/en_us_oca/me.m07.d20:meMA.Ode8C21.mode	@ltx/en_us_oca/miscellanea:misc.Mode8
ltx/en_us_oca/me.m07.d20:meMA.Ode8C21.ode	@ltx/en_us_oca/miscellanea:misc.Ode8
ltx/en_us_oca/me.m07.d20:meMA.Ode8C21.text	
ltx/en_us_oca/me.m07.d20:meMA.Ode8C22.incipit	…
ltx/en_us_oca/me.m07.d20:meMA.Ode8C22.melody	@ltx/en_us_oca/he.h.m8:heHE.EptaplasiosKaminon.notmetered
ltx/en_us_oca/me.m07.d20:meMA.Ode8C22.mode	@ltx/en_us_oca/miscellanea:misc.Mode8
ltx/en_us_oca/me.m07.d20:meMA.Ode8C22.ode	@ltx/en_us_oca/miscellanea:misc.Ode8
ltx/en_us_oca/me.m07.d20:meMA.Ode8C22.text	
ltx/en_us_oca/me.m07.d20:meMA.Ode8C23.incipit	…
ltx/en_us_oca/me.m07.d20:meMA.Ode8C23.melody	@ltx/en_us_oca/he.h.m8:heHE.EptaplasiosKaminon.notmetered
ltx/en_us_oca/me.m07.d20:meMA.Ode8C23.mode	@ltx/en_us_oca/miscellanea:misc.Mode8
ltx/en_us_oca/me.m07.d20:meMA.Ode8C23.ode	@ltx/en_us_oca/miscellanea:misc.Ode8
ltx/en_us_oca/me.m07.d20:meMA.Ode8C23.text	
ltx/en_us_oca/me.m07.d20:meMA.Ode8C2T.incipit	…
ltx/en_us_oca/me.m07.d20:meMA.Ode8C2T.melody	@ltx/en_us_oca/he.h.m8:heHE.EptaplasiosKaminon.notmetered
ltx/en_us_oca/me.m07.d20:meMA.Ode8C2T.mode	@ltx/en_us_oca/miscellanea:misc.Mode8
ltx/en_us_oca/me.m07.d20:meMA.Ode8C2T.ode	@ltx/en_us_oca/miscellanea:misc.Ode8
ltx/en_us_oca/me.m07.d20:meMA.Ode8C2T.text	
ltx/en_us_oca/me.m07.d20:meMA.Ode8C2Tr.incipit	…
ltx/en_us_oca/me.m07.d20:meMA.Ode8C2Tr.melody	@ltx/en_us_oca/he.h.m8:heHE.EptaplasiosKaminon.notmetered
ltx/en_us_oca/me.m07.d20:meMA.Ode8C2Tr.mode	@ltx/en_us_oca/miscellanea:misc.Mode8
ltx/en_us_oca/me.m07.d20:meMA.Ode8C2Tr.ode	@ltx/en_us_oca/miscellanea:misc.Ode8
ltx/en_us_oca/me.m07.d20:meMA.Ode8C2Tr.text	
ltx/en_us_oca/me.m07.d20:meMA.Ode9C11.greekmelody	@ltx/en_us_oca/he.h.m2:heHE.ITonProIliouFostira.greekname
ltx/en_us_oca/me.m07.d20:meMA.Ode9C11.incipit	…
ltx/en_us_oca/me.m07.d20:meMA.Ode9C11.melody	@ltx/en_us_oca/he.h.m2:heHE.ITonProIliouFostira.notmetered
ltx/en_us_oca/me.m07.d20:meMA.Ode9C11.mode	@ltx/en_us_oca/miscellanea:misc.Mode2
ltx/en_us_oca/me.m07.d20:meMA.Ode9C11.ode	@ltx/en_us_oca/miscellanea:misc.Ode9
ltx/en_us_oca/me.m07.d20:meMA.Ode9C11.text	
ltx/en_us_oca/me.m07.d20:meMA.Ode9C12.incipit	…
ltx/en_us_oca/me.m07.d20:meMA.Ode9C12.melody	@ltx/en_us_oca/he.h.m2:heHE.ITonProIliouFostira.notmetered
ltx/en_us_oca/me.m07.d20:meMA.Ode9C12.mode	@ltx/en_us_oca/miscellanea:misc.Mode2
ltx/en_us_oca/me.m07.d20:meMA.Ode9C12.ode	@ltx/en_us_oca/miscellanea:misc.Ode9
ltx/en_us_oca/me.m07.d20:meMA.Ode9C12.text	
ltx/en_us_oca/me.m07.d20:meMA.Ode9C13.incipit	…
ltx/en_us_oca/me.m07.d20:meMA.Ode9C13.melody	@ltx/en_us_oca/he.h.m2:heHE.ITonProIliouFostira.notmetered
ltx/en_us_oca/me.m07.d20:meMA.Ode9C13.mode	@ltx/en_us_oca/miscellanea:misc.Mode2
ltx/en_us_oca/me.m07.d20:meMA.Ode9C13.ode	@ltx/en_us_oca/miscellanea:misc.Ode9
ltx/en_us_oca/me.m07.d20:meMA.Ode9C13.text	
ltx/en_us_oca/me.m07.d20:meMA.Ode9C1T.incipit	…
ltx/en_us_oca/me.m07.d20:meMA.Ode9C1T.melody	@ltx/en_us_oca/he.h.m2:heHE.ITonProIliouFostira.notmetered
ltx/en_us_oca/me.m07.d20:meMA.Ode9C1T.mode	@ltx/en_us_oca/miscellanea:misc.Mode2
ltx/en_us_oca/me.m07.d20:meMA.Ode9C1T.ode	@ltx/en_us_oca/miscellanea:misc.Ode9
ltx/en_us_oca/me.m07.d20:meMA.Ode9C1T.text	
ltx/en_us_oca/me.m07.d20:meMA.Ode9C21.greekmelody	@ltx/en_us_oca/he.h.m8:heHE.ExestiEpiTouto.greekname
ltx/en_us_oca/me.m07.d20:meMA.Ode9C21.incipit	…
ltx/en_us_oca/me.m07.d20:meMA.Ode9C21.melody	@ltx/en_us_oca/he.h.m8:heHE.ExestiEpiTouto.notmetered
ltx/en_us_oca/me.m07.d20:meMA.Ode9C21.mode	@ltx/en_us_oca/miscellanea:misc.Mode8
ltx/en_us_oca/me.m07.d20:meMA.Ode9C21.ode	@ltx/en_us_oca/miscellanea:misc.Ode9
ltx/en_us_oca/me.m07.d20:meMA.Ode9C21.text	
ltx/en_us_oca/me.m07.d20:meMA.Ode9C22.incipit	…
ltx/en_us_oca/me.m07.d20:meMA.Ode9C22.melody	@ltx/en_us_oca/he.h.m8:heHE.ExestiEpiTouto.notmetered
ltx/en_us_oca/me.m07.d20:meMA.Ode9C22.mode	@ltx/en_us_oca/miscellanea:misc.Mode8
ltx/en_us_oca/me.m07.d20:meMA.Ode9C22.ode	@ltx/en_us_oca/miscellanea:misc.Ode9
ltx/en_us_oca/me.m07.d20:meMA.Ode9C22.text	
ltx/en_us_oca/me.m07.d20:meMA.Ode9C23.incipit	…
ltx/en_us_oca/me.m07.d20:meMA.Ode9C23.melody	@ltx/en_us_oca/he.h.m8:heHE.ExestiEpiTouto.notmetered
ltx/en_us_oca/me.m07.d20:meMA.Ode9C23.mode	@ltx/en_us_oca/miscellanea:misc.Mode8
ltx/en_us_oca/me.m07.d20:meMA.Ode9C23.ode	@ltx/en_us_oca/miscellanea:misc.Ode9
ltx/en_us_oca/me.m07.d20:meMA.Ode9C23.text	
ltx/en_us_oca/me.m07.d20:meMA.Ode9C24.incipit	…
ltx/en_us_oca/me.m07.d20:meMA.Ode9C24.melody	@ltx/en_us_oca/he.h.m8:heHE.ExestiEpiTouto.notmetered
ltx/en_us_oca/me.m07.d20:meMA.Ode9C24.mode	@ltx/en_us_oca/miscellanea:misc.Mode8
ltx/en_us_oca/me.m07.d20:meMA.Ode9C24.ode	@ltx/en_us_oca/miscellanea:misc.Ode9
ltx/en_us_oca/me.m07.d20:meMA.Ode9C24.text	
ltx/en_us_oca/me.m07.d20:meMA.Ode9C2T.incipit	…
ltx/en_us_oca/me.m07.d20:meMA.Ode9C2T.melody	@ltx/en_us_oca/he.h.m8:heHE.ExestiEpiTouto.notmetered
ltx/en_us_oca/me.m07.d20:meMA.Ode9C2T.mode	@ltx/en_us_oca/miscellanea:misc.Mode8
ltx/en_us_oca/me.m07.d20:meMA.Ode9C2T.ode	@ltx/en_us_oca/miscellanea:misc.Ode9
ltx/en_us_oca/me.m07.d20:meMA.Ode9C2T.text	
ltx/en_us_oca/me.m07.d20:meMA.Oikos1.text	
ltx/en_us_oca/me.m07.d20:meR01	
ltx/en_us_oca/me.m07.d20:meVE.Apolytikion1.greekmelody	@ltx/en_us_oca/he.a.m4:heAU.TachyProkatalave.greekname
ltx/en_us_oca/me.m07.d20:meVE.Apolytikion1.incipit	…
ltx/en_us_oca/me.m07.d20:meVE.Apolytikion1.melody	@ltx/en_us_oca/he.a.m4:heAU.TachyProkatalave.notmetered
ltx/en_us_oca/me.m07.d20:meVE.Apolytikion1.mode	@ltx/en_us_oca/miscellanea:misc.Mode4
ltx/en_us_oca/me.m07.d20:meVE.Apolytikion1.text	
ltx/en_us_oca/me.m07.d20:meVE.AposGlory.incipit	Prophet who foretold the coming…
ltx/en_us_oca/me.m07.d20:meVE.AposGlory.melody	
ltx/en_us_oca/me.m07.d20:meVE.AposGlory.mode	@ltx/en_us_oca/miscellanea:misc.Mode6
ltx/en_us_oca/me.m07.d20:meVE.AposGlory.text	Prophet who foretold the coming of Christ, ⁄ you are standing at the throne of greatness, ⁄ and are ever present at the side of those who lie in sickness. ⁄ And now, Minister of the highest, ⁄ blessing the universe, and glorified throughout the world: ⁄⁄ Seek forgiveness for our souls!
ltx/en_us_oca/me.m07.d20:meVE.AposTheotokion.incipit	Theotokos, ⁄ you are the…
ltx/en_us_oca/me.m07.d20:meVE.AposTheotokion.melody	
ltx/en_us_oca/me.m07.d20:meVE.AposTheotokion.mode	@ltx/en_us_oca/miscellanea:misc.Mode6
ltx/en_us_oca/me.m07.d20:meVE.AposTheotokion.text	Theotokos, ⁄ you are the true vine who blossomed for us the Fruit of life. ⁄ Implore Him, we pray you, Lady, ⁄ together with the apostles and all the saints, ⁄⁄ that He will have mercy on our souls!
ltx/en_us_oca/me.m07.d20:meVE.Aposticha1.greekmelody	@ltx/en_us_oca/he.a.m4:heAU.OExYpsistouKlitheis.greekname
ltx/en_us_oca/me.m07.d20:meVE.Aposticha1.incipit	He who was sanctified before…
ltx/en_us_oca/me.m07.d20:meVE.Aposticha1.melody	@ltx/en_us_oca/he.a.m4:heAU.OExYpsistouKlitheis.notmetered
ltx/en_us_oca/me.m07.d20:meVE.Aposticha1.mode	@ltx/en_us_oca/miscellanea:misc.Mode4
ltx/en_us_oca/me.m07.d20:meVE.Aposticha1.text	He who was sanctified before he was conceived, ⁄ angelic of body and of flaming intelligence, ⁄ the heavenly man, the herald of the second coming of Christ: ⁄ Glorious Elijah, pillar of the prophets and their cornerstone ⁄ has called lovers of feasts to celebrate his feast in spirit! ⁄ Through his intercessions, Christ God, ⁄⁄ save Your people from all harm by the deceiver!
ltx/en_us_oca/me.m07.d20:meVE.Aposticha2.incipit	When Elijah saw with divine…
ltx/en_us_oca/me.m07.d20:meVE.Aposticha2.melody	@ltx/en_us_oca/he.a.m4:heAU.OExYpsistouKlitheis.notmetered
ltx/en_us_oca/me.m07.d20:meVE.Aposticha2.mode	@ltx/en_us_oca/miscellanea:misc.Mode4
ltx/en_us_oca/me.m07.d20:meVE.Aposticha2.text	When Elijah saw with divine wisdom ⁄ that all the people of Israel had departed from the Lord God, ⁄ and were led to the worship of idols, ⁄ he was stirred with zeal! ⁄ He held back the clouds; ⁄ he burned the earth and closed the heavens with a single word, saying: ⁄ Not a drop shall fall upon the earth without my word! ⁄ As we celebrate his memory, ⁄⁄ he grants ineffable grace to those who keep his feast with faith!
ltx/en_us_oca/me.m07.d20:meVE.Aposticha3.incipit	You divided the waters of…
ltx/en_us_oca/me.m07.d20:meVE.Aposticha3.melody	@ltx/en_us_oca/he.a.m4:heAU.OExYpsistouKlitheis.notmetered
ltx/en_us_oca/me.m07.d20:meVE.Aposticha3.mode	@ltx/en_us_oca/miscellanea:misc.Mode4
ltx/en_us_oca/me.m07.d20:meVE.Aposticha3.text	You divided the waters of the Jordan, Elijah ⁄ Seer of ineffable mysteries! ⁄ You turned the deceits of idols into ashes ⁄ by the lightning of your divine words. ⁄ You rebuked the king when he disobeyed the law. ⁄ You killed the priests of iniquity, burning their sacrifice by prayer. ⁄ Quench the flames of our passions and sorrows ⁄⁄ by the fire of your intercessions!
ltx/en_us_oca/me.m07.d20:meVE.Lity1.incipit	…
ltx/en_us_oca/me.m07.d20:meVE.Lity1.melody	
ltx/en_us_oca/me.m07.d20:meVE.Lity1.mode	@ltx/en_us_oca/miscellanea:misc.Mode1
ltx/en_us_oca/me.m07.d20:meVE.Lity1.poet	@ltx/en_us_oca/poets:po.Germanou
ltx/en_us_oca/me.m07.d20:meVE.Lity1.text	
ltx/en_us_oca/me.m07.d20:meVE.Lity2.incipit	…
ltx/en_us_oca/me.m07.d20:meVE.Lity2.melody	
ltx/en_us_oca/me.m07.d20:meVE.Lity2.mode	@ltx/en_us_oca/miscellanea:misc.Mode1
ltx/en_us_oca/me.m07.d20:meVE.Lity2.text	
ltx/en_us_oca/me.m07.d20:meVE.Lity3.incipit	…
ltx/en_us_oca/me.m07.d20:meVE.Lity3.melody	
ltx/en_us_oca/me.m07.d20:meVE.Lity3.mode	@ltx/en_us_oca/miscellanea:misc.Mode1
ltx/en_us_oca/me.m07.d20:meVE.Lity3.poet	@ltx/en_us_oca/poets:po.Germanou
ltx/en_us_oca/me.m07.d20:meVE.Lity3.text	
ltx/en_us_oca/me.m07.d20:meVE.Lity4.incipit	Two lights have shone in…
ltx/en_us_oca/me.m07.d20:meVE.Lity4.melody	
ltx/en_us_oca/me.m07.d20:meVE.Lity4.mode	@ltx/en_us_oca/miscellanea:misc.Mode2
ltx/en_us_oca/me.m07.d20:meVE.Lity4.poet	@ltx/en_us_oca/poets:po.IoannouMonachou
ltx/en_us_oca/me.m07.d20:meVE.Lity4.text	Two lights have shone in the universe: ⁄ the bright stars of Elijah and Elisha. ⁄ With the Word of God, the one stopped the rain from the heavens, ⁄ thus convicting the kings. ⁄ He ascended into heaven upon a fiery chariot! ⁄ The other received a double portion of grace. ⁄ He purified the polluted water, ⁄ and parted the stream of the Jordan. ⁄ now they rejoice with the angels: ⁄⁄ Pray for the salvation of our souls!
ltx/en_us_oca/me.m07.d20:meVE.Lity5.incipit	You were lifted up into…
ltx/en_us_oca/me.m07.d20:meVE.Lity5.melody	
ltx/en_us_oca/me.m07.d20:meVE.Lity5.mode	@ltx/en_us_oca/miscellanea:misc.Mode2
ltx/en_us_oca/me.m07.d20:meVE.Lity5.poet	@ltx/en_us_oca/poets:po.IoannouMonachou
ltx/en_us_oca/me.m07.d20:meVE.Lity5.text	You were lifted up into the sky, to the gates of heaven, ⁄ by a fiery chariot, Elijah the Tishbite. ⁄ The grace of the fire worked a miracle on you. ⁄ Although you were created in the flesh you did not see death, ⁄ that you might preach in all places until the end. ⁄⁄ Therefore come, and grant us your correction and instruction!
ltx/en_us_oca/me.m07.d20:meVE.LityBoth.incipit	…
ltx/en_us_oca/me.m07.d20:meVE.LityBoth.melody	
ltx/en_us_oca/me.m07.d20:meVE.LityBoth.mode	@ltx/en_us_oca/miscellanea:misc.Mode4
ltx/en_us_oca/me.m07.d20:meVE.LityBoth.text	
ltx/en_us_oca/me.m07.d20:meVE.LityGlory.incipit	…
ltx/en_us_oca/me.m07.d20:meVE.LityGlory.melody	
ltx/en_us_oca/me.m07.d20:meVE.LityGlory.mode	@ltx/en_us_oca/miscellanea:misc.Mode4
ltx/en_us_oca/me.m07.d20:meVE.LityGlory.poet	@ltx/en_us_oca/poets:po.Arseniou
ltx/en_us_oca/me.m07.d20:meVE.LityGlory.text	
ltx/en_us_oca/me.m07.d20:meVE.SticGlory.incipit	Come, all Orthodox people! ⁄…
ltx/en_us_oca/me.m07.d20:meVE.SticGlory.melody	
ltx/en_us_oca/me.m07.d20:meVE.SticGlory.mode	@ltx/en_us_oca/miscellanea:misc.Mode6
ltx/en_us_oca/me.m07.d20:meVE.SticGlory.poet	@ltx/en_us_oca/poets:po.Vyzantiou
ltx/en_us_oca/me.m07.d20:meVE.SticGlory.text	Come, all Orthodox people! ⁄ Let us assemble in the holy place: ⁄ the temple in honor of the two prophets inspired by God! ⁄ Let us sing together, giving glory to Christ our God. ⁄ Let us raise our voices and say joyfully: ⁄ Rejoice, earthly angel, and heavenly man! ⁄ Elijah of great name! ⁄ Rejoice, for you received double grace from God: ⁄ Most revered Elisha! ⁄ Rejoice, pillars, champions and physicians of the Christian people! ⁄ Deliver from every obstacle and tribulation ⁄⁄ those who celebrate your all-glorious feast in faith!
ltx/en_us_oca/me.m07.d20:meVE.SticTheotokion.incipit	@ltx/en_us_oca/oc.m6.d1:ocVE.SticTheotokion.incipit
ltx/en_us_oca/me.m07.d20:meVE.SticTheotokion.melody	
ltx/en_us_oca/me.m07.d20:meVE.SticTheotokion.mode	@ltx/en_us_oca/miscellanea:misc.Mode6
ltx/en_us_oca/me.m07.d20:meVE.SticTheotokion.text	@ltx/en_us_oca/oc.m6.d1:ocVE.SticTheotokion.text
ltx/en_us_oca/me.m07.d20:meVE.Stichera01.greekmelody	@ltx/en_us_oca/he.a.m1:heAU.TonOuranionTagmaton.greekname
ltx/en_us_oca/me.m07.d20:meVE.Stichera01.incipit	All-compassionate Word…
ltx/en_us_oca/me.m07.d20:meVE.Stichera01.melody	@ltx/en_us_oca/he.a.m1:heAU.TonOuranionTagmaton.notmetered
ltx/en_us_oca/me.m07.d20:meVE.Stichera01.mode	@ltx/en_us_oca/miscellanea:misc.Mode1
ltx/en_us_oca/me.m07.d20:meVE.Stichera01.text	All-compassionate Word you translated Elijah the Tishbite ⁄ from the earth in a fiery chariot: ⁄ Through his prayers, save us who glorify you in faith ⁄⁄ as we celebrate his divine and honored memory in joy!
ltx/en_us_oca/me.m07.d20:meVE.Stichera02.incipit	Elijah, blessed of God…
ltx/en_us_oca/me.m07.d20:meVE.Stichera02.melody	@ltx/en_us_oca/he.a.m1:heAU.TonOuranionTagmaton.notmetered
ltx/en_us_oca/me.m07.d20:meVE.Stichera02.mode	@ltx/en_us_oca/miscellanea:misc.Mode1
ltx/en_us_oca/me.m07.d20:meVE.Stichera02.text	Elijah, blessed of God, ⁄ you beheld the presence of God which enlightened you, ⁄ not in an earthquake, but in a still small voice. ⁄ You ascended to heaven in a wondrous manner, ⁄ sitting upon a chariot drawn by four horses: ⁄⁄ You have become wonderful, God-inspired one!
ltx/en_us_oca/me.m07.d20:meVE.Stichera03.incipit	Wise Elijah, in your burning…
ltx/en_us_oca/me.m07.d20:meVE.Stichera03.melody	@ltx/en_us_oca/he.a.m1:heAU.TonOuranionTagmaton.notmetered
ltx/en_us_oca/me.m07.d20:meVE.Stichera03.mode	@ltx/en_us_oca/miscellanea:misc.Mode1
ltx/en_us_oca/me.m07.d20:meVE.Stichera03.text	Wise Elijah, in your burning zeal for God, ⁄ you slaughtered the priests of confusion with the sword! ⁄ By your word the heavens were bound ⁄ so that it might not rain upon the earth. ⁄ By giving your mantle to Elisha ⁄⁄ he grew and was filled with a double portion of divine grace!
