ltx/en_us_oca/me.m06.d04:meDA.commemoration.first	
ltx/en_us_oca/me.m06.d04:meDA.commemoration.first_name	
ltx/en_us_oca/me.m06.d04:meDA.commemoration.first_short	
ltx/en_us_oca/me.m06.d04:meDA.commemoration.first_title	
ltx/en_us_oca/me.m06.d04:meDA.commemoration.full	
ltx/en_us_oca/me.m06.d04:meDA.commemoration.second_name	
ltx/en_us_oca/me.m06.d04:meDA.commemoration.second_title	
ltx/en_us_oca/me.m06.d04:meDA.date	
ltx/en_us_oca/me.m06.d04:meDA.dismissal	
ltx/en_us_oca/me.m06.d04:meDA.fordate	
ltx/en_us_oca/me.m06.d04:meDA.insert1	
ltx/en_us_oca/me.m06.d04:meDA.insert2	
ltx/en_us_oca/me.m06.d04:meDA.note	
ltx/en_us_oca/me.m06.d04:meDA.pdfcoverdate	
ltx/en_us_oca/me.m06.d04:meDA.pdfheaderdate	
ltx/en_us_oca/me.m06.d04:meHO.commemorations	
ltx/en_us_oca/me.m06.d04:meHO.note1	
ltx/en_us_oca/me.m06.d04:meHO.note2	
ltx/en_us_oca/me.m06.d04:meHO.number	
ltx/en_us_oca/me.m06.d04:meHO.rank	
ltx/en_us_oca/me.m06.d04:meLE.commemoration1	
ltx/en_us_oca/me.m06.d04:meLE.commemoration2	
ltx/en_us_oca/me.m06.d04:meLI.Kontakion1.greekmelody	@ltx/en_us_oca/me.m06.d04:meMA.Kontakion1.greekmelody
ltx/en_us_oca/me.m06.d04:meLI.Kontakion1.incipit	@ltx/en_us_oca/me.m06.d04:meMA.Kontakion1.incipit
ltx/en_us_oca/me.m06.d04:meLI.Kontakion1.melody	@ltx/en_us_oca/me.m06.d04:meMA.Kontakion1.melody
ltx/en_us_oca/me.m06.d04:meLI.Kontakion1.mode	@ltx/en_us_oca/me.m06.d04:meMA.Kontakion1.mode
ltx/en_us_oca/me.m06.d04:meLI.Kontakion1.text	@ltx/en_us_oca/me.m06.d04:meMA.Kontakion1.text
ltx/en_us_oca/me.m06.d04:meLI.MM.CommunionHymn.text	@ltx/en_us_oca/properties:media.key
ltx/en_us_oca/me.m06.d04:meLI.Megalynarion.text	
ltx/en_us_oca/me.m06.d04:meMA.C1.acrostic.notice1	
ltx/en_us_oca/me.m06.d04:meMA.C1.acrostic.notice2	
ltx/en_us_oca/me.m06.d04:meMA.C1.acrostic.text	
ltx/en_us_oca/me.m06.d04:meMA.C1.acrostic.title	
ltx/en_us_oca/me.m06.d04:meMA.C1.title	@ltx/en_us_oca/titles:ti.Canon1SaintM
ltx/en_us_oca/me.m06.d04:meMA.C1.verse	@ltx/en_us_oca/prayers:pr.verse_SaintM.text
ltx/en_us_oca/me.m06.d04:meMA.C2.acrostic.notice1	
ltx/en_us_oca/me.m06.d04:meMA.C2.acrostic.text	
ltx/en_us_oca/me.m06.d04:meMA.C2.acrostic.title	
ltx/en_us_oca/me.m06.d04:meMA.C2.poet	@ltx/en_us_oca/poets:po.Theofanous
ltx/en_us_oca/me.m06.d04:meMA.C2.title	@ltx/en_us_oca/titles:ti.Canon2SaintM
ltx/en_us_oca/me.m06.d04:meMA.C2.verse	@ltx/en_us_oca/prayers:pr.verse_SaintM.text
ltx/en_us_oca/me.m06.d04:meMA.ExapTheotokion.incipit	…
ltx/en_us_oca/me.m06.d04:meMA.ExapTheotokion.melody	@ltx/en_us_oca/he.a.m3:heAU.FosAnalloioton.notmetered
ltx/en_us_oca/me.m06.d04:meMA.ExapTheotokion.mode	@ltx/en_us_oca/miscellanea:misc.Mode3
ltx/en_us_oca/me.m06.d04:meMA.ExapTheotokion.text	
ltx/en_us_oca/me.m06.d04:meMA.Exaposteilarion1.greekmelody	@ltx/en_us_oca/he.a.m3:heAU.FosAnalloioton.greekname
ltx/en_us_oca/me.m06.d04:meMA.Exaposteilarion1.incipit	We know you to be…
ltx/en_us_oca/me.m06.d04:meMA.Exaposteilarion1.melody	@ltx/en_us_oca/he.a.m3:heAU.FosAnalloioton.notmetered
ltx/en_us_oca/me.m06.d04:meMA.Exaposteilarion1.mode	@ltx/en_us_oca/miscellanea:misc.Mode3
ltx/en_us_oca/me.m06.d04:meMA.Exaposteilarion1.text	We know you to be a greatly shining star of the Church, ⁄ holy hierarch Metrophanes, ⁄ for with the council you cast down the blasphemy of Arius, ⁄ enlightening the Church with Orthodox teachings. ⁄ Therefore, we sing hymns to you with faith!
ltx/en_us_oca/me.m06.d04:meMA.Kathisma11.greekmelody	@ltx/en_us_oca/he.a.m3:heAU.TheiasPisteos.greekname
ltx/en_us_oca/me.m06.d04:meMA.Kathisma11.incipit	…
ltx/en_us_oca/me.m06.d04:meMA.Kathisma11.melody	@ltx/en_us_oca/he.a.m3:heAU.TheiasPisteos.notmetered
ltx/en_us_oca/me.m06.d04:meMA.Kathisma11.mode	@ltx/en_us_oca/miscellanea:misc.Mode3
ltx/en_us_oca/me.m06.d04:meMA.Kathisma11.text	
ltx/en_us_oca/me.m06.d04:meMA.Kathisma1T.incipit	@ltx/en_us_oca/me.m01.d25:meMA.Kathisma1T.incipit
ltx/en_us_oca/me.m06.d04:meMA.Kathisma1T.melody	@ltx/en_us_oca/he.a.m3:heAU.TheiasPisteos.notmetered
ltx/en_us_oca/me.m06.d04:meMA.Kathisma1T.mode	@ltx/en_us_oca/miscellanea:misc.Mode3
ltx/en_us_oca/me.m06.d04:meMA.Kathisma1T.text	@ltx/en_us_oca/me.m01.d25:meMA.Kathisma1T.text
ltx/en_us_oca/me.m06.d04:meMA.Kathisma21.greekmelody	@ltx/en_us_oca/he.a.m3:heAU.TheiasPisteos.greekname
ltx/en_us_oca/me.m06.d04:meMA.Kathisma21.incipit	…
ltx/en_us_oca/me.m06.d04:meMA.Kathisma21.melody	@ltx/en_us_oca/he.a.m3:heAU.TheiasPisteos.notmetered
ltx/en_us_oca/me.m06.d04:meMA.Kathisma21.mode	@ltx/en_us_oca/miscellanea:misc.Mode3
ltx/en_us_oca/me.m06.d04:meMA.Kathisma21.text	
ltx/en_us_oca/me.m06.d04:meMA.Kathisma2T.incipit	@ltx/en_us_oca/oc.m3.d2:ocMA.Kathisma23.incipit
ltx/en_us_oca/me.m06.d04:meMA.Kathisma2T.melody	@ltx/en_us_oca/he.a.m3:heAU.TheiasPisteos.notmetered
ltx/en_us_oca/me.m06.d04:meMA.Kathisma2T.mode	@ltx/en_us_oca/miscellanea:misc.Mode3
ltx/en_us_oca/me.m06.d04:meMA.Kathisma2T.text	@ltx/en_us_oca/oc.m3.d2:ocMA.Kathisma23.text
ltx/en_us_oca/me.m06.d04:meMA.Kathisma31.greekmelody	@ltx/en_us_oca/he.a.m8:heAU.TinSofianKaiLogon.greekname
ltx/en_us_oca/me.m06.d04:meMA.Kathisma31.incipit	…
ltx/en_us_oca/me.m06.d04:meMA.Kathisma31.melody	@ltx/en_us_oca/he.a.m8:heAU.TinSofianKaiLogon.notmetered
ltx/en_us_oca/me.m06.d04:meMA.Kathisma31.mode	@ltx/en_us_oca/miscellanea:misc.Mode8
ltx/en_us_oca/me.m06.d04:meMA.Kathisma31.text	
ltx/en_us_oca/me.m06.d04:meMA.Kathisma3T.incipit	…
ltx/en_us_oca/me.m06.d04:meMA.Kathisma3T.melody	@ltx/en_us_oca/he.a.m8:heAU.TinSofianKaiLogon.notmetered
ltx/en_us_oca/me.m06.d04:meMA.Kathisma3T.mode	@ltx/en_us_oca/miscellanea:misc.Mode8
ltx/en_us_oca/me.m06.d04:meMA.Kathisma3T.text	
ltx/en_us_oca/me.m06.d04:meMA.Kontakion1.greekmelody	@ltx/en_us_oca/he.a.m4:heAU.OYpsotheisEnToStavro.greekname
ltx/en_us_oca/me.m06.d04:meMA.Kontakion1.incipit	…
ltx/en_us_oca/me.m06.d04:meMA.Kontakion1.melody	@ltx/en_us_oca/he.a.m4:heAU.OYpsotheisEnToStavro.notmetered
ltx/en_us_oca/me.m06.d04:meMA.Kontakion1.mode	@ltx/en_us_oca/miscellanea:misc.Mode4
ltx/en_us_oca/me.m06.d04:meMA.Kontakion1.text	
ltx/en_us_oca/me.m06.d04:meMA.Lauds1.greekmelody	@ltx/en_us_oca/he.a.m4:heAU.OExYpsistouKlitheis.greekname
ltx/en_us_oca/me.m06.d04:meMA.Lauds1.incipit	…
ltx/en_us_oca/me.m06.d04:meMA.Lauds1.melody	@ltx/en_us_oca/he.a.m4:heAU.OExYpsistouKlitheis.notmetered
ltx/en_us_oca/me.m06.d04:meMA.Lauds1.mode	@ltx/en_us_oca/miscellanea:misc.Mode4
ltx/en_us_oca/me.m06.d04:meMA.Lauds1.text	
ltx/en_us_oca/me.m06.d04:meMA.Lauds2.incipit	…
ltx/en_us_oca/me.m06.d04:meMA.Lauds2.melody	@ltx/en_us_oca/he.a.m4:heAU.OExYpsistouKlitheis.notmetered
ltx/en_us_oca/me.m06.d04:meMA.Lauds2.mode	@ltx/en_us_oca/miscellanea:misc.Mode4
ltx/en_us_oca/me.m06.d04:meMA.Lauds2.text	
ltx/en_us_oca/me.m06.d04:meMA.Lauds3.incipit	…
ltx/en_us_oca/me.m06.d04:meMA.Lauds3.melody	@ltx/en_us_oca/he.a.m4:heAU.OExYpsistouKlitheis.notmetered
ltx/en_us_oca/me.m06.d04:meMA.Lauds3.mode	@ltx/en_us_oca/miscellanea:misc.Mode4
ltx/en_us_oca/me.m06.d04:meMA.Lauds3.text	
ltx/en_us_oca/me.m06.d04:meMA.Lauds4.greekmelody	@ltx/en_us_oca/he.a.m4:heAU.OExYpsistouKlitheis.greekname
ltx/en_us_oca/me.m06.d04:meMA.Lauds4.incipit	…
ltx/en_us_oca/me.m06.d04:meMA.Lauds4.melody	@ltx/en_us_oca/he.a.m4:heAU.OExYpsistouKlitheis.notmetered
ltx/en_us_oca/me.m06.d04:meMA.Lauds4.mode	@ltx/en_us_oca/miscellanea:misc.Mode4
ltx/en_us_oca/me.m06.d04:meMA.Lauds4.text	
ltx/en_us_oca/me.m06.d04:meMA.LaudsGlory.incipit	…
ltx/en_us_oca/me.m06.d04:meMA.LaudsGlory.melody	
ltx/en_us_oca/me.m06.d04:meMA.LaudsGlory.mode	@ltx/en_us_oca/miscellanea:misc.Mode8
ltx/en_us_oca/me.m06.d04:meMA.LaudsGlory.text	
ltx/en_us_oca/me.m06.d04:meMA.LaudsTheotokion.incipit	@ltx/en_us_oca/oc.m8.d2:ocMA.AposTheotokion.incipit
ltx/en_us_oca/me.m06.d04:meMA.LaudsTheotokion.melody	
ltx/en_us_oca/me.m06.d04:meMA.LaudsTheotokion.mode	@ltx/en_us_oca/miscellanea:misc.Mode8
ltx/en_us_oca/me.m06.d04:meMA.LaudsTheotokion.text	@ltx/en_us_oca/oc.m8.d2:ocMA.AposTheotokion.text
ltx/en_us_oca/me.m06.d04:meMA.Ode1C11.greekmelody	@ltx/en_us_oca/he.h.m4:heHE.AnoixoToStomaMou.greekname
ltx/en_us_oca/me.m06.d04:meMA.Ode1C11.incipit	…
ltx/en_us_oca/me.m06.d04:meMA.Ode1C11.melody	@ltx/en_us_oca/he.h.m4:heHE.AnoixoToStomaMou.notmetered
ltx/en_us_oca/me.m06.d04:meMA.Ode1C11.mode	@ltx/en_us_oca/miscellanea:misc.Mode4
ltx/en_us_oca/me.m06.d04:meMA.Ode1C11.ode	@ltx/en_us_oca/miscellanea:misc.Ode1
ltx/en_us_oca/me.m06.d04:meMA.Ode1C11.text	
ltx/en_us_oca/me.m06.d04:meMA.Ode1C12.incipit	…
ltx/en_us_oca/me.m06.d04:meMA.Ode1C12.melody	@ltx/en_us_oca/he.h.m4:heHE.AnoixoToStomaMou.notmetered
ltx/en_us_oca/me.m06.d04:meMA.Ode1C12.mode	@ltx/en_us_oca/miscellanea:misc.Mode4
ltx/en_us_oca/me.m06.d04:meMA.Ode1C12.ode	@ltx/en_us_oca/miscellanea:misc.Ode1
ltx/en_us_oca/me.m06.d04:meMA.Ode1C12.text	
ltx/en_us_oca/me.m06.d04:meMA.Ode1C13.incipit	…
ltx/en_us_oca/me.m06.d04:meMA.Ode1C13.melody	@ltx/en_us_oca/he.h.m4:heHE.AnoixoToStomaMou.notmetered
ltx/en_us_oca/me.m06.d04:meMA.Ode1C13.mode	@ltx/en_us_oca/miscellanea:misc.Mode4
ltx/en_us_oca/me.m06.d04:meMA.Ode1C13.ode	@ltx/en_us_oca/miscellanea:misc.Ode1
ltx/en_us_oca/me.m06.d04:meMA.Ode1C13.text	
ltx/en_us_oca/me.m06.d04:meMA.Ode1C14.incipit	…
ltx/en_us_oca/me.m06.d04:meMA.Ode1C14.melody	@ltx/en_us_oca/he.h.m4:heHE.AnoixoToStomaMou.notmetered
ltx/en_us_oca/me.m06.d04:meMA.Ode1C14.mode	@ltx/en_us_oca/miscellanea:misc.Mode4
ltx/en_us_oca/me.m06.d04:meMA.Ode1C14.ode	@ltx/en_us_oca/miscellanea:misc.Ode1
ltx/en_us_oca/me.m06.d04:meMA.Ode1C14.text	
ltx/en_us_oca/me.m06.d04:meMA.Ode1C1T.incipit	…
ltx/en_us_oca/me.m06.d04:meMA.Ode1C1T.melody	@ltx/en_us_oca/he.h.m4:heHE.AnoixoToStomaMou.notmetered
ltx/en_us_oca/me.m06.d04:meMA.Ode1C1T.mode	@ltx/en_us_oca/miscellanea:misc.Mode4
ltx/en_us_oca/me.m06.d04:meMA.Ode1C1T.ode	@ltx/en_us_oca/miscellanea:misc.Ode1
ltx/en_us_oca/me.m06.d04:meMA.Ode1C1T.text	
ltx/en_us_oca/me.m06.d04:meMA.Ode1C21.greekmelody	@ltx/en_us_oca/he.h.m6:heHE.OsEnIpeiroPezefsas.greekname
ltx/en_us_oca/me.m06.d04:meMA.Ode1C21.incipit	…
ltx/en_us_oca/me.m06.d04:meMA.Ode1C21.melody	@ltx/en_us_oca/he.h.m6:heHE.OsEnIpeiroPezefsas.notmetered
ltx/en_us_oca/me.m06.d04:meMA.Ode1C21.mode	@ltx/en_us_oca/miscellanea:misc.Mode6
ltx/en_us_oca/me.m06.d04:meMA.Ode1C21.ode	@ltx/en_us_oca/miscellanea:misc.Ode1
ltx/en_us_oca/me.m06.d04:meMA.Ode1C21.text	
ltx/en_us_oca/me.m06.d04:meMA.Ode1C22.incipit	…
ltx/en_us_oca/me.m06.d04:meMA.Ode1C22.melody	@ltx/en_us_oca/he.h.m6:heHE.OsEnIpeiroPezefsas.notmetered
ltx/en_us_oca/me.m06.d04:meMA.Ode1C22.mode	@ltx/en_us_oca/miscellanea:misc.Mode6
ltx/en_us_oca/me.m06.d04:meMA.Ode1C22.ode	@ltx/en_us_oca/miscellanea:misc.Ode1
ltx/en_us_oca/me.m06.d04:meMA.Ode1C22.text	
ltx/en_us_oca/me.m06.d04:meMA.Ode1C23.incipit	…
ltx/en_us_oca/me.m06.d04:meMA.Ode1C23.melody	@ltx/en_us_oca/he.h.m6:heHE.OsEnIpeiroPezefsas.notmetered
ltx/en_us_oca/me.m06.d04:meMA.Ode1C23.mode	@ltx/en_us_oca/miscellanea:misc.Mode6
ltx/en_us_oca/me.m06.d04:meMA.Ode1C23.ode	@ltx/en_us_oca/miscellanea:misc.Ode1
ltx/en_us_oca/me.m06.d04:meMA.Ode1C23.text	
ltx/en_us_oca/me.m06.d04:meMA.Ode1C2T.incipit	…
ltx/en_us_oca/me.m06.d04:meMA.Ode1C2T.melody	@ltx/en_us_oca/he.h.m6:heHE.OsEnIpeiroPezefsas.notmetered
ltx/en_us_oca/me.m06.d04:meMA.Ode1C2T.mode	@ltx/en_us_oca/miscellanea:misc.Mode6
ltx/en_us_oca/me.m06.d04:meMA.Ode1C2T.ode	@ltx/en_us_oca/miscellanea:misc.Ode1
ltx/en_us_oca/me.m06.d04:meMA.Ode1C2T.text	
ltx/en_us_oca/me.m06.d04:meMA.Ode3C11.greekmelody	@ltx/en_us_oca/he.h.m4:heHE.TousSousYmnologous.greekname
ltx/en_us_oca/me.m06.d04:meMA.Ode3C11.incipit	…
ltx/en_us_oca/me.m06.d04:meMA.Ode3C11.melody	@ltx/en_us_oca/he.h.m4:heHE.TousSousYmnologous.notmetered
ltx/en_us_oca/me.m06.d04:meMA.Ode3C11.mode	@ltx/en_us_oca/miscellanea:misc.Mode4
ltx/en_us_oca/me.m06.d04:meMA.Ode3C11.ode	@ltx/en_us_oca/miscellanea:misc.Ode3
ltx/en_us_oca/me.m06.d04:meMA.Ode3C11.text	
ltx/en_us_oca/me.m06.d04:meMA.Ode3C12.incipit	…
ltx/en_us_oca/me.m06.d04:meMA.Ode3C12.melody	@ltx/en_us_oca/he.h.m4:heHE.TousSousYmnologous.notmetered
ltx/en_us_oca/me.m06.d04:meMA.Ode3C12.mode	@ltx/en_us_oca/miscellanea:misc.Mode4
ltx/en_us_oca/me.m06.d04:meMA.Ode3C12.ode	@ltx/en_us_oca/miscellanea:misc.Ode3
ltx/en_us_oca/me.m06.d04:meMA.Ode3C12.text	
ltx/en_us_oca/me.m06.d04:meMA.Ode3C13.incipit	…
ltx/en_us_oca/me.m06.d04:meMA.Ode3C13.melody	@ltx/en_us_oca/he.h.m4:heHE.TousSousYmnologous.notmetered
ltx/en_us_oca/me.m06.d04:meMA.Ode3C13.mode	@ltx/en_us_oca/miscellanea:misc.Mode4
ltx/en_us_oca/me.m06.d04:meMA.Ode3C13.ode	@ltx/en_us_oca/miscellanea:misc.Ode3
ltx/en_us_oca/me.m06.d04:meMA.Ode3C13.text	
ltx/en_us_oca/me.m06.d04:meMA.Ode3C14.incipit	…
ltx/en_us_oca/me.m06.d04:meMA.Ode3C14.melody	@ltx/en_us_oca/he.h.m4:heHE.TousSousYmnologous.notmetered
ltx/en_us_oca/me.m06.d04:meMA.Ode3C14.mode	@ltx/en_us_oca/miscellanea:misc.Mode4
ltx/en_us_oca/me.m06.d04:meMA.Ode3C14.ode	@ltx/en_us_oca/miscellanea:misc.Ode3
ltx/en_us_oca/me.m06.d04:meMA.Ode3C14.text	
ltx/en_us_oca/me.m06.d04:meMA.Ode3C1T.incipit	…
ltx/en_us_oca/me.m06.d04:meMA.Ode3C1T.melody	@ltx/en_us_oca/he.h.m4:heHE.TousSousYmnologous.notmetered
ltx/en_us_oca/me.m06.d04:meMA.Ode3C1T.mode	@ltx/en_us_oca/miscellanea:misc.Mode4
ltx/en_us_oca/me.m06.d04:meMA.Ode3C1T.ode	@ltx/en_us_oca/miscellanea:misc.Ode3
ltx/en_us_oca/me.m06.d04:meMA.Ode3C1T.text	
ltx/en_us_oca/me.m06.d04:meMA.Ode3C21.greekmelody	@ltx/en_us_oca/he.h.m6:heHE.OukEstinAgios.greekname
ltx/en_us_oca/me.m06.d04:meMA.Ode3C21.incipit	…
ltx/en_us_oca/me.m06.d04:meMA.Ode3C21.melody	@ltx/en_us_oca/he.h.m6:heHE.OukEstinAgios.notmetered
ltx/en_us_oca/me.m06.d04:meMA.Ode3C21.mode	@ltx/en_us_oca/miscellanea:misc.Mode6
ltx/en_us_oca/me.m06.d04:meMA.Ode3C21.ode	@ltx/en_us_oca/miscellanea:misc.Ode3
ltx/en_us_oca/me.m06.d04:meMA.Ode3C21.text	
ltx/en_us_oca/me.m06.d04:meMA.Ode3C22.incipit	…
ltx/en_us_oca/me.m06.d04:meMA.Ode3C22.melody	@ltx/en_us_oca/he.h.m6:heHE.OukEstinAgios.notmetered
ltx/en_us_oca/me.m06.d04:meMA.Ode3C22.mode	@ltx/en_us_oca/miscellanea:misc.Mode6
ltx/en_us_oca/me.m06.d04:meMA.Ode3C22.ode	@ltx/en_us_oca/miscellanea:misc.Ode3
ltx/en_us_oca/me.m06.d04:meMA.Ode3C22.text	
ltx/en_us_oca/me.m06.d04:meMA.Ode3C23.incipit	…
ltx/en_us_oca/me.m06.d04:meMA.Ode3C23.melody	@ltx/en_us_oca/he.h.m6:heHE.OukEstinAgios.notmetered
ltx/en_us_oca/me.m06.d04:meMA.Ode3C23.mode	@ltx/en_us_oca/miscellanea:misc.Mode6
ltx/en_us_oca/me.m06.d04:meMA.Ode3C23.ode	@ltx/en_us_oca/miscellanea:misc.Ode3
ltx/en_us_oca/me.m06.d04:meMA.Ode3C23.text	
ltx/en_us_oca/me.m06.d04:meMA.Ode3C2T.incipit	…
ltx/en_us_oca/me.m06.d04:meMA.Ode3C2T.melody	@ltx/en_us_oca/he.h.m6:heHE.OukEstinAgios.notmetered
ltx/en_us_oca/me.m06.d04:meMA.Ode3C2T.mode	@ltx/en_us_oca/miscellanea:misc.Mode6
ltx/en_us_oca/me.m06.d04:meMA.Ode3C2T.ode	@ltx/en_us_oca/miscellanea:misc.Ode3
ltx/en_us_oca/me.m06.d04:meMA.Ode3C2T.text	
ltx/en_us_oca/me.m06.d04:meMA.Ode3H.greekmelody	@ltx/en_us_oca/he.h.m6:heHE.OukEstinAgios.greekname
ltx/en_us_oca/me.m06.d04:meMA.Ode3H.incipit	@ltx/en_us_oca/he.h.m6:heHE.OukEstinAgios.incipit
ltx/en_us_oca/me.m06.d04:meMA.Ode3H.melody	@ltx/en_us_oca/he.h.m6:heHE.OukEstinAgios.melody
ltx/en_us_oca/me.m06.d04:meMA.Ode3H.mode	@ltx/en_us_oca/miscellanea:misc.Mode6
ltx/en_us_oca/me.m06.d04:meMA.Ode3H.ode	@ltx/en_us_oca/miscellanea:misc.Ode3
ltx/en_us_oca/me.m06.d04:meMA.Ode3H.text	@ltx/en_us_oca/he.h.m6:heHE.OukEstinAgios.text
ltx/en_us_oca/me.m06.d04:meMA.Ode3Kathisma1.greekmelody	@ltx/en_us_oca/he.a.m8:heAU.TinSofianKaiLogon.greekname
ltx/en_us_oca/me.m06.d04:meMA.Ode3Kathisma1.incipit	…
ltx/en_us_oca/me.m06.d04:meMA.Ode3Kathisma1.melody	@ltx/en_us_oca/he.a.m8:heAU.TinSofianKaiLogon.notmetered
ltx/en_us_oca/me.m06.d04:meMA.Ode3Kathisma1.mode	@ltx/en_us_oca/miscellanea:misc.Mode8
ltx/en_us_oca/me.m06.d04:meMA.Ode3Kathisma1.text	
ltx/en_us_oca/me.m06.d04:meMA.Ode3KathismaT.incipit	…
ltx/en_us_oca/me.m06.d04:meMA.Ode3KathismaT.melody	@ltx/en_us_oca/he.a.m8:heAU.TinSofianKaiLogon.notmetered
ltx/en_us_oca/me.m06.d04:meMA.Ode3KathismaT.mode	@ltx/en_us_oca/miscellanea:misc.Mode8
ltx/en_us_oca/me.m06.d04:meMA.Ode3KathismaT.text	
ltx/en_us_oca/me.m06.d04:meMA.Ode4C11.greekmelody	@ltx/en_us_oca/he.h.m4:heHE.OKathimenosEnDoxi.greekname
ltx/en_us_oca/me.m06.d04:meMA.Ode4C11.incipit	…
ltx/en_us_oca/me.m06.d04:meMA.Ode4C11.melody	@ltx/en_us_oca/he.h.m4:heHE.OKathimenosEnDoxi.notmetered
ltx/en_us_oca/me.m06.d04:meMA.Ode4C11.mode	@ltx/en_us_oca/miscellanea:misc.Mode4
ltx/en_us_oca/me.m06.d04:meMA.Ode4C11.ode	@ltx/en_us_oca/miscellanea:misc.Ode4
ltx/en_us_oca/me.m06.d04:meMA.Ode4C11.text	
ltx/en_us_oca/me.m06.d04:meMA.Ode4C12.incipit	…
ltx/en_us_oca/me.m06.d04:meMA.Ode4C12.melody	@ltx/en_us_oca/he.h.m4:heHE.OKathimenosEnDoxi.notmetered
ltx/en_us_oca/me.m06.d04:meMA.Ode4C12.mode	@ltx/en_us_oca/miscellanea:misc.Mode4
ltx/en_us_oca/me.m06.d04:meMA.Ode4C12.ode	@ltx/en_us_oca/miscellanea:misc.Ode4
ltx/en_us_oca/me.m06.d04:meMA.Ode4C12.text	
ltx/en_us_oca/me.m06.d04:meMA.Ode4C13.incipit	…
ltx/en_us_oca/me.m06.d04:meMA.Ode4C13.melody	@ltx/en_us_oca/he.h.m4:heHE.OKathimenosEnDoxi.notmetered
ltx/en_us_oca/me.m06.d04:meMA.Ode4C13.mode	@ltx/en_us_oca/miscellanea:misc.Mode4
ltx/en_us_oca/me.m06.d04:meMA.Ode4C13.ode	@ltx/en_us_oca/miscellanea:misc.Ode4
ltx/en_us_oca/me.m06.d04:meMA.Ode4C13.text	
ltx/en_us_oca/me.m06.d04:meMA.Ode4C1T.incipit	…
ltx/en_us_oca/me.m06.d04:meMA.Ode4C1T.melody	@ltx/en_us_oca/he.h.m4:heHE.OKathimenosEnDoxi.notmetered
ltx/en_us_oca/me.m06.d04:meMA.Ode4C1T.mode	@ltx/en_us_oca/miscellanea:misc.Mode4
ltx/en_us_oca/me.m06.d04:meMA.Ode4C1T.ode	@ltx/en_us_oca/miscellanea:misc.Ode4
ltx/en_us_oca/me.m06.d04:meMA.Ode4C1T.text	
ltx/en_us_oca/me.m06.d04:meMA.Ode4C21.greekmelody	@ltx/en_us_oca/he.h.m6:heHE.ChristosMouDynamis.greekname
ltx/en_us_oca/me.m06.d04:meMA.Ode4C21.incipit	…
ltx/en_us_oca/me.m06.d04:meMA.Ode4C21.melody	@ltx/en_us_oca/he.h.m6:heHE.ChristosMouDynamis.notmetered
ltx/en_us_oca/me.m06.d04:meMA.Ode4C21.mode	@ltx/en_us_oca/miscellanea:misc.Mode6
ltx/en_us_oca/me.m06.d04:meMA.Ode4C21.ode	@ltx/en_us_oca/miscellanea:misc.Ode4
ltx/en_us_oca/me.m06.d04:meMA.Ode4C21.text	
ltx/en_us_oca/me.m06.d04:meMA.Ode4C22.incipit	…
ltx/en_us_oca/me.m06.d04:meMA.Ode4C22.melody	@ltx/en_us_oca/he.h.m6:heHE.ChristosMouDynamis.notmetered
ltx/en_us_oca/me.m06.d04:meMA.Ode4C22.mode	@ltx/en_us_oca/miscellanea:misc.Mode6
ltx/en_us_oca/me.m06.d04:meMA.Ode4C22.ode	@ltx/en_us_oca/miscellanea:misc.Ode4
ltx/en_us_oca/me.m06.d04:meMA.Ode4C22.text	
ltx/en_us_oca/me.m06.d04:meMA.Ode4C23.incipit	…
ltx/en_us_oca/me.m06.d04:meMA.Ode4C23.melody	@ltx/en_us_oca/he.h.m6:heHE.ChristosMouDynamis.notmetered
ltx/en_us_oca/me.m06.d04:meMA.Ode4C23.mode	@ltx/en_us_oca/miscellanea:misc.Mode6
ltx/en_us_oca/me.m06.d04:meMA.Ode4C23.ode	@ltx/en_us_oca/miscellanea:misc.Ode4
ltx/en_us_oca/me.m06.d04:meMA.Ode4C23.text	
ltx/en_us_oca/me.m06.d04:meMA.Ode4C2T.incipit	…
ltx/en_us_oca/me.m06.d04:meMA.Ode4C2T.melody	@ltx/en_us_oca/he.h.m6:heHE.ChristosMouDynamis.notmetered
ltx/en_us_oca/me.m06.d04:meMA.Ode4C2T.mode	@ltx/en_us_oca/miscellanea:misc.Mode6
ltx/en_us_oca/me.m06.d04:meMA.Ode4C2T.ode	@ltx/en_us_oca/miscellanea:misc.Ode4
ltx/en_us_oca/me.m06.d04:meMA.Ode4C2T.text	
ltx/en_us_oca/me.m06.d04:meMA.Ode5C11.greekmelody	@ltx/en_us_oca/he.h.m4:heHE.ExestiTaSympanta.greekname
ltx/en_us_oca/me.m06.d04:meMA.Ode5C11.incipit	…
ltx/en_us_oca/me.m06.d04:meMA.Ode5C11.melody	@ltx/en_us_oca/he.h.m4:heHE.ExestiTaSympanta.notmetered
ltx/en_us_oca/me.m06.d04:meMA.Ode5C11.mode	@ltx/en_us_oca/miscellanea:misc.Mode4
ltx/en_us_oca/me.m06.d04:meMA.Ode5C11.ode	@ltx/en_us_oca/miscellanea:misc.Ode5
ltx/en_us_oca/me.m06.d04:meMA.Ode5C11.text	
ltx/en_us_oca/me.m06.d04:meMA.Ode5C12.incipit	…
ltx/en_us_oca/me.m06.d04:meMA.Ode5C12.melody	@ltx/en_us_oca/he.h.m4:heHE.ExestiTaSympanta.notmetered
ltx/en_us_oca/me.m06.d04:meMA.Ode5C12.mode	@ltx/en_us_oca/miscellanea:misc.Mode4
ltx/en_us_oca/me.m06.d04:meMA.Ode5C12.ode	@ltx/en_us_oca/miscellanea:misc.Ode5
ltx/en_us_oca/me.m06.d04:meMA.Ode5C12.text	
ltx/en_us_oca/me.m06.d04:meMA.Ode5C13.incipit	…
ltx/en_us_oca/me.m06.d04:meMA.Ode5C13.melody	@ltx/en_us_oca/he.h.m4:heHE.ExestiTaSympanta.notmetered
ltx/en_us_oca/me.m06.d04:meMA.Ode5C13.mode	@ltx/en_us_oca/miscellanea:misc.Mode4
ltx/en_us_oca/me.m06.d04:meMA.Ode5C13.ode	@ltx/en_us_oca/miscellanea:misc.Ode5
ltx/en_us_oca/me.m06.d04:meMA.Ode5C13.text	
ltx/en_us_oca/me.m06.d04:meMA.Ode5C1T.incipit	…
ltx/en_us_oca/me.m06.d04:meMA.Ode5C1T.melody	@ltx/en_us_oca/he.h.m4:heHE.ExestiTaSympanta.notmetered
ltx/en_us_oca/me.m06.d04:meMA.Ode5C1T.mode	@ltx/en_us_oca/miscellanea:misc.Mode4
ltx/en_us_oca/me.m06.d04:meMA.Ode5C1T.ode	@ltx/en_us_oca/miscellanea:misc.Ode5
ltx/en_us_oca/me.m06.d04:meMA.Ode5C1T.text	
ltx/en_us_oca/me.m06.d04:meMA.Ode5C21.greekmelody	@ltx/en_us_oca/he.h.m6:heHE.ToTheioFengeiSou.greekname
ltx/en_us_oca/me.m06.d04:meMA.Ode5C21.incipit	…
ltx/en_us_oca/me.m06.d04:meMA.Ode5C21.melody	@ltx/en_us_oca/he.h.m6:heHE.ToTheioFengeiSou.notmetered
ltx/en_us_oca/me.m06.d04:meMA.Ode5C21.mode	@ltx/en_us_oca/miscellanea:misc.Mode6
ltx/en_us_oca/me.m06.d04:meMA.Ode5C21.ode	@ltx/en_us_oca/miscellanea:misc.Ode5
ltx/en_us_oca/me.m06.d04:meMA.Ode5C21.text	
ltx/en_us_oca/me.m06.d04:meMA.Ode5C22.incipit	…
ltx/en_us_oca/me.m06.d04:meMA.Ode5C22.melody	@ltx/en_us_oca/he.h.m6:heHE.ToTheioFengeiSou.notmetered
ltx/en_us_oca/me.m06.d04:meMA.Ode5C22.mode	@ltx/en_us_oca/miscellanea:misc.Mode6
ltx/en_us_oca/me.m06.d04:meMA.Ode5C22.ode	@ltx/en_us_oca/miscellanea:misc.Ode5
ltx/en_us_oca/me.m06.d04:meMA.Ode5C22.text	
ltx/en_us_oca/me.m06.d04:meMA.Ode5C23.incipit	…
ltx/en_us_oca/me.m06.d04:meMA.Ode5C23.melody	@ltx/en_us_oca/he.h.m6:heHE.ToTheioFengeiSou.notmetered
ltx/en_us_oca/me.m06.d04:meMA.Ode5C23.mode	@ltx/en_us_oca/miscellanea:misc.Mode6
ltx/en_us_oca/me.m06.d04:meMA.Ode5C23.ode	@ltx/en_us_oca/miscellanea:misc.Ode5
ltx/en_us_oca/me.m06.d04:meMA.Ode5C23.text	
ltx/en_us_oca/me.m06.d04:meMA.Ode5C2T.incipit	…
ltx/en_us_oca/me.m06.d04:meMA.Ode5C2T.melody	@ltx/en_us_oca/he.h.m6:heHE.ToTheioFengeiSou.notmetered
ltx/en_us_oca/me.m06.d04:meMA.Ode5C2T.mode	@ltx/en_us_oca/miscellanea:misc.Mode6
ltx/en_us_oca/me.m06.d04:meMA.Ode5C2T.ode	@ltx/en_us_oca/miscellanea:misc.Ode5
ltx/en_us_oca/me.m06.d04:meMA.Ode5C2T.text	
ltx/en_us_oca/me.m06.d04:meMA.Ode6C11.greekmelody	@ltx/en_us_oca/he.h.m4:heHE.TinTheianTaftin.greekname
ltx/en_us_oca/me.m06.d04:meMA.Ode6C11.incipit	…
ltx/en_us_oca/me.m06.d04:meMA.Ode6C11.melody	@ltx/en_us_oca/he.h.m4:heHE.TinTheianTaftin.notmetered
ltx/en_us_oca/me.m06.d04:meMA.Ode6C11.mode	@ltx/en_us_oca/miscellanea:misc.Mode4
ltx/en_us_oca/me.m06.d04:meMA.Ode6C11.ode	@ltx/en_us_oca/miscellanea:misc.Ode6
ltx/en_us_oca/me.m06.d04:meMA.Ode6C11.text	
ltx/en_us_oca/me.m06.d04:meMA.Ode6C12.incipit	…
ltx/en_us_oca/me.m06.d04:meMA.Ode6C12.melody	@ltx/en_us_oca/he.h.m4:heHE.TinTheianTaftin.notmetered
ltx/en_us_oca/me.m06.d04:meMA.Ode6C12.mode	@ltx/en_us_oca/miscellanea:misc.Mode4
ltx/en_us_oca/me.m06.d04:meMA.Ode6C12.ode	@ltx/en_us_oca/miscellanea:misc.Ode6
ltx/en_us_oca/me.m06.d04:meMA.Ode6C12.text	
ltx/en_us_oca/me.m06.d04:meMA.Ode6C13.incipit	…
ltx/en_us_oca/me.m06.d04:meMA.Ode6C13.melody	@ltx/en_us_oca/he.h.m4:heHE.TinTheianTaftin.notmetered
ltx/en_us_oca/me.m06.d04:meMA.Ode6C13.mode	@ltx/en_us_oca/miscellanea:misc.Mode4
ltx/en_us_oca/me.m06.d04:meMA.Ode6C13.ode	@ltx/en_us_oca/miscellanea:misc.Ode6
ltx/en_us_oca/me.m06.d04:meMA.Ode6C13.text	
ltx/en_us_oca/me.m06.d04:meMA.Ode6C1T.incipit	…
ltx/en_us_oca/me.m06.d04:meMA.Ode6C1T.melody	@ltx/en_us_oca/he.h.m4:heHE.TinTheianTaftin.notmetered
ltx/en_us_oca/me.m06.d04:meMA.Ode6C1T.mode	@ltx/en_us_oca/miscellanea:misc.Mode4
ltx/en_us_oca/me.m06.d04:meMA.Ode6C1T.ode	@ltx/en_us_oca/miscellanea:misc.Ode6
ltx/en_us_oca/me.m06.d04:meMA.Ode6C1T.text	
ltx/en_us_oca/me.m06.d04:meMA.Ode6C21.greekmelody	@ltx/en_us_oca/he.h.m6:heHE.TouViouTinThalassan.greekname
ltx/en_us_oca/me.m06.d04:meMA.Ode6C21.incipit	…
ltx/en_us_oca/me.m06.d04:meMA.Ode6C21.melody	@ltx/en_us_oca/he.h.m6:heHE.TouViouTinThalassan.notmetered
ltx/en_us_oca/me.m06.d04:meMA.Ode6C21.mode	@ltx/en_us_oca/miscellanea:misc.Mode6
ltx/en_us_oca/me.m06.d04:meMA.Ode6C21.ode	@ltx/en_us_oca/miscellanea:misc.Ode6
ltx/en_us_oca/me.m06.d04:meMA.Ode6C21.text	
ltx/en_us_oca/me.m06.d04:meMA.Ode6C22.incipit	…
ltx/en_us_oca/me.m06.d04:meMA.Ode6C22.melody	@ltx/en_us_oca/he.h.m6:heHE.TouViouTinThalassan.notmetered
ltx/en_us_oca/me.m06.d04:meMA.Ode6C22.mode	@ltx/en_us_oca/miscellanea:misc.Mode6
ltx/en_us_oca/me.m06.d04:meMA.Ode6C22.ode	@ltx/en_us_oca/miscellanea:misc.Ode6
ltx/en_us_oca/me.m06.d04:meMA.Ode6C22.text	
ltx/en_us_oca/me.m06.d04:meMA.Ode6C23.incipit	…
ltx/en_us_oca/me.m06.d04:meMA.Ode6C23.melody	@ltx/en_us_oca/he.h.m6:heHE.TouViouTinThalassan.notmetered
ltx/en_us_oca/me.m06.d04:meMA.Ode6C23.mode	@ltx/en_us_oca/miscellanea:misc.Mode6
ltx/en_us_oca/me.m06.d04:meMA.Ode6C23.ode	@ltx/en_us_oca/miscellanea:misc.Ode6
ltx/en_us_oca/me.m06.d04:meMA.Ode6C23.text	
ltx/en_us_oca/me.m06.d04:meMA.Ode6C2T.incipit	…
ltx/en_us_oca/me.m06.d04:meMA.Ode6C2T.melody	@ltx/en_us_oca/he.h.m6:heHE.TouViouTinThalassan.notmetered
ltx/en_us_oca/me.m06.d04:meMA.Ode6C2T.mode	@ltx/en_us_oca/miscellanea:misc.Mode6
ltx/en_us_oca/me.m06.d04:meMA.Ode6C2T.ode	@ltx/en_us_oca/miscellanea:misc.Ode6
ltx/en_us_oca/me.m06.d04:meMA.Ode6C2T.text	
ltx/en_us_oca/me.m06.d04:meMA.Ode6H.greekmelody	@ltx/en_us_oca/he.h.m6:heHE.TouViouTinThalassan.greekname
ltx/en_us_oca/me.m06.d04:meMA.Ode6H.incipit	@ltx/en_us_oca/he.h.m6:heHE.TouViouTinThalassan.incipit
ltx/en_us_oca/me.m06.d04:meMA.Ode6H.melody	@ltx/en_us_oca/he.h.m6:heHE.TouViouTinThalassan.melody
ltx/en_us_oca/me.m06.d04:meMA.Ode6H.mode	@ltx/en_us_oca/miscellanea:misc.Mode6
ltx/en_us_oca/me.m06.d04:meMA.Ode6H.ode	@ltx/en_us_oca/miscellanea:misc.Ode6
ltx/en_us_oca/me.m06.d04:meMA.Ode6H.text	@ltx/en_us_oca/he.h.m6:heHE.TouViouTinThalassan.text
ltx/en_us_oca/me.m06.d04:meMA.Ode7C11.greekmelody	@ltx/en_us_oca/he.h.m4:heHE.OukElatrefsan.greekname
ltx/en_us_oca/me.m06.d04:meMA.Ode7C11.incipit	…
ltx/en_us_oca/me.m06.d04:meMA.Ode7C11.melody	@ltx/en_us_oca/he.h.m4:heHE.OukElatrefsan.notmetered
ltx/en_us_oca/me.m06.d04:meMA.Ode7C11.mode	@ltx/en_us_oca/miscellanea:misc.Mode4
ltx/en_us_oca/me.m06.d04:meMA.Ode7C11.ode	@ltx/en_us_oca/miscellanea:misc.Ode7
ltx/en_us_oca/me.m06.d04:meMA.Ode7C11.text	
ltx/en_us_oca/me.m06.d04:meMA.Ode7C12.incipit	…
ltx/en_us_oca/me.m06.d04:meMA.Ode7C12.melody	@ltx/en_us_oca/he.h.m4:heHE.OukElatrefsan.notmetered
ltx/en_us_oca/me.m06.d04:meMA.Ode7C12.mode	@ltx/en_us_oca/miscellanea:misc.Mode4
ltx/en_us_oca/me.m06.d04:meMA.Ode7C12.ode	@ltx/en_us_oca/miscellanea:misc.Ode7
ltx/en_us_oca/me.m06.d04:meMA.Ode7C12.text	
ltx/en_us_oca/me.m06.d04:meMA.Ode7C13.incipit	…
ltx/en_us_oca/me.m06.d04:meMA.Ode7C13.melody	@ltx/en_us_oca/he.h.m4:heHE.OukElatrefsan.notmetered
ltx/en_us_oca/me.m06.d04:meMA.Ode7C13.mode	@ltx/en_us_oca/miscellanea:misc.Mode4
ltx/en_us_oca/me.m06.d04:meMA.Ode7C13.ode	@ltx/en_us_oca/miscellanea:misc.Ode7
ltx/en_us_oca/me.m06.d04:meMA.Ode7C13.text	
ltx/en_us_oca/me.m06.d04:meMA.Ode7C14.incipit	…
ltx/en_us_oca/me.m06.d04:meMA.Ode7C14.melody	@ltx/en_us_oca/he.h.m4:heHE.OukElatrefsan.notmetered
ltx/en_us_oca/me.m06.d04:meMA.Ode7C14.mode	@ltx/en_us_oca/miscellanea:misc.Mode4
ltx/en_us_oca/me.m06.d04:meMA.Ode7C14.ode	@ltx/en_us_oca/miscellanea:misc.Ode7
ltx/en_us_oca/me.m06.d04:meMA.Ode7C14.text	
ltx/en_us_oca/me.m06.d04:meMA.Ode7C1T.incipit	…
ltx/en_us_oca/me.m06.d04:meMA.Ode7C1T.melody	@ltx/en_us_oca/he.h.m4:heHE.OukElatrefsan.notmetered
ltx/en_us_oca/me.m06.d04:meMA.Ode7C1T.mode	@ltx/en_us_oca/miscellanea:misc.Mode4
ltx/en_us_oca/me.m06.d04:meMA.Ode7C1T.ode	@ltx/en_us_oca/miscellanea:misc.Ode7
ltx/en_us_oca/me.m06.d04:meMA.Ode7C1T.text	
ltx/en_us_oca/me.m06.d04:meMA.Ode7C21.greekmelody	@ltx/en_us_oca/he.h.m6:heHE.DrosovolonMenTinKaminon.greekname
ltx/en_us_oca/me.m06.d04:meMA.Ode7C21.incipit	…
ltx/en_us_oca/me.m06.d04:meMA.Ode7C21.melody	@ltx/en_us_oca/he.h.m6:heHE.DrosovolonMenTinKaminon.notmetered
ltx/en_us_oca/me.m06.d04:meMA.Ode7C21.mode	@ltx/en_us_oca/miscellanea:misc.Mode6
ltx/en_us_oca/me.m06.d04:meMA.Ode7C21.ode	@ltx/en_us_oca/miscellanea:misc.Ode7
ltx/en_us_oca/me.m06.d04:meMA.Ode7C21.text	
ltx/en_us_oca/me.m06.d04:meMA.Ode7C22.incipit	…
ltx/en_us_oca/me.m06.d04:meMA.Ode7C22.melody	@ltx/en_us_oca/he.h.m6:heHE.DrosovolonMenTinKaminon.notmetered
ltx/en_us_oca/me.m06.d04:meMA.Ode7C22.mode	@ltx/en_us_oca/miscellanea:misc.Mode6
ltx/en_us_oca/me.m06.d04:meMA.Ode7C22.ode	@ltx/en_us_oca/miscellanea:misc.Ode7
ltx/en_us_oca/me.m06.d04:meMA.Ode7C22.text	
ltx/en_us_oca/me.m06.d04:meMA.Ode7C23.incipit	…
ltx/en_us_oca/me.m06.d04:meMA.Ode7C23.melody	@ltx/en_us_oca/he.h.m6:heHE.DrosovolonMenTinKaminon.notmetered
ltx/en_us_oca/me.m06.d04:meMA.Ode7C23.mode	@ltx/en_us_oca/miscellanea:misc.Mode6
ltx/en_us_oca/me.m06.d04:meMA.Ode7C23.ode	@ltx/en_us_oca/miscellanea:misc.Ode7
ltx/en_us_oca/me.m06.d04:meMA.Ode7C23.text	
ltx/en_us_oca/me.m06.d04:meMA.Ode7C2T.incipit	…
ltx/en_us_oca/me.m06.d04:meMA.Ode7C2T.melody	@ltx/en_us_oca/he.h.m6:heHE.DrosovolonMenTinKaminon.notmetered
ltx/en_us_oca/me.m06.d04:meMA.Ode7C2T.mode	@ltx/en_us_oca/miscellanea:misc.Mode6
ltx/en_us_oca/me.m06.d04:meMA.Ode7C2T.ode	@ltx/en_us_oca/miscellanea:misc.Ode7
ltx/en_us_oca/me.m06.d04:meMA.Ode7C2T.text	
ltx/en_us_oca/me.m06.d04:meMA.Ode8C11.greekmelody	@ltx/en_us_oca/he.h.m4:heHE.PaidasEvageis.greekname
ltx/en_us_oca/me.m06.d04:meMA.Ode8C11.incipit	…
ltx/en_us_oca/me.m06.d04:meMA.Ode8C11.melody	@ltx/en_us_oca/he.h.m4:heHE.PaidasEvageis.notmetered
ltx/en_us_oca/me.m06.d04:meMA.Ode8C11.mode	@ltx/en_us_oca/miscellanea:misc.Mode4
ltx/en_us_oca/me.m06.d04:meMA.Ode8C11.ode	@ltx/en_us_oca/miscellanea:misc.Ode8
ltx/en_us_oca/me.m06.d04:meMA.Ode8C11.text	
ltx/en_us_oca/me.m06.d04:meMA.Ode8C12.incipit	…
ltx/en_us_oca/me.m06.d04:meMA.Ode8C12.melody	@ltx/en_us_oca/he.h.m4:heHE.PaidasEvageis.notmetered
ltx/en_us_oca/me.m06.d04:meMA.Ode8C12.mode	@ltx/en_us_oca/miscellanea:misc.Mode4
ltx/en_us_oca/me.m06.d04:meMA.Ode8C12.ode	@ltx/en_us_oca/miscellanea:misc.Ode8
ltx/en_us_oca/me.m06.d04:meMA.Ode8C12.text	
ltx/en_us_oca/me.m06.d04:meMA.Ode8C13.incipit	…
ltx/en_us_oca/me.m06.d04:meMA.Ode8C13.melody	@ltx/en_us_oca/he.h.m4:heHE.PaidasEvageis.notmetered
ltx/en_us_oca/me.m06.d04:meMA.Ode8C13.mode	@ltx/en_us_oca/miscellanea:misc.Mode4
ltx/en_us_oca/me.m06.d04:meMA.Ode8C13.ode	@ltx/en_us_oca/miscellanea:misc.Ode8
ltx/en_us_oca/me.m06.d04:meMA.Ode8C13.text	
ltx/en_us_oca/me.m06.d04:meMA.Ode8C1T.incipit	…
ltx/en_us_oca/me.m06.d04:meMA.Ode8C1T.melody	@ltx/en_us_oca/he.h.m4:heHE.PaidasEvageis.notmetered
ltx/en_us_oca/me.m06.d04:meMA.Ode8C1T.mode	@ltx/en_us_oca/miscellanea:misc.Mode4
ltx/en_us_oca/me.m06.d04:meMA.Ode8C1T.ode	@ltx/en_us_oca/miscellanea:misc.Ode8
ltx/en_us_oca/me.m06.d04:meMA.Ode8C1T.text	
ltx/en_us_oca/me.m06.d04:meMA.Ode8C21.greekmelody	@ltx/en_us_oca/he.h.m6:heHE.EkFlogosToisOsiois.greekname
ltx/en_us_oca/me.m06.d04:meMA.Ode8C21.incipit	…
ltx/en_us_oca/me.m06.d04:meMA.Ode8C21.melody	@ltx/en_us_oca/he.h.m6:heHE.EkFlogosToisOsiois.notmetered
ltx/en_us_oca/me.m06.d04:meMA.Ode8C21.mode	@ltx/en_us_oca/miscellanea:misc.Mode6
ltx/en_us_oca/me.m06.d04:meMA.Ode8C21.ode	@ltx/en_us_oca/miscellanea:misc.Ode8
ltx/en_us_oca/me.m06.d04:meMA.Ode8C21.text	
ltx/en_us_oca/me.m06.d04:meMA.Ode8C22.incipit	…
ltx/en_us_oca/me.m06.d04:meMA.Ode8C22.melody	@ltx/en_us_oca/he.h.m6:heHE.EkFlogosToisOsiois.notmetered
ltx/en_us_oca/me.m06.d04:meMA.Ode8C22.mode	@ltx/en_us_oca/miscellanea:misc.Mode6
ltx/en_us_oca/me.m06.d04:meMA.Ode8C22.ode	@ltx/en_us_oca/miscellanea:misc.Ode8
ltx/en_us_oca/me.m06.d04:meMA.Ode8C22.text	
ltx/en_us_oca/me.m06.d04:meMA.Ode8C23.incipit	…
ltx/en_us_oca/me.m06.d04:meMA.Ode8C23.melody	@ltx/en_us_oca/he.h.m6:heHE.EkFlogosToisOsiois.notmetered
ltx/en_us_oca/me.m06.d04:meMA.Ode8C23.mode	@ltx/en_us_oca/miscellanea:misc.Mode6
ltx/en_us_oca/me.m06.d04:meMA.Ode8C23.ode	@ltx/en_us_oca/miscellanea:misc.Ode8
ltx/en_us_oca/me.m06.d04:meMA.Ode8C23.text	
ltx/en_us_oca/me.m06.d04:meMA.Ode8C2T.incipit	…
ltx/en_us_oca/me.m06.d04:meMA.Ode8C2T.melody	@ltx/en_us_oca/he.h.m6:heHE.EkFlogosToisOsiois.notmetered
ltx/en_us_oca/me.m06.d04:meMA.Ode8C2T.mode	@ltx/en_us_oca/miscellanea:misc.Mode6
ltx/en_us_oca/me.m06.d04:meMA.Ode8C2T.ode	@ltx/en_us_oca/miscellanea:misc.Ode8
ltx/en_us_oca/me.m06.d04:meMA.Ode8C2T.text	
ltx/en_us_oca/me.m06.d04:meMA.Ode8H.greekmelody	@ltx/en_us_oca/he.h.m6:heHE.EkFlogosToisOsiois.greekname
ltx/en_us_oca/me.m06.d04:meMA.Ode8H.incipit	@ltx/en_us_oca/he.h.m6:heHE.EkFlogosToisOsiois.incipit
ltx/en_us_oca/me.m06.d04:meMA.Ode8H.melody	@ltx/en_us_oca/he.h.m6:heHE.EkFlogosToisOsiois.melody
ltx/en_us_oca/me.m06.d04:meMA.Ode8H.mode	@ltx/en_us_oca/miscellanea:misc.Mode6
ltx/en_us_oca/me.m06.d04:meMA.Ode8H.ode	@ltx/en_us_oca/miscellanea:misc.Ode8
ltx/en_us_oca/me.m06.d04:meMA.Ode8H.text	@ltx/en_us_oca/he.h.m6:heHE.EkFlogosToisOsiois.text
ltx/en_us_oca/me.m06.d04:meMA.Ode9C11.greekmelody	@ltx/en_us_oca/he.h.m4:heHE.ApasGigenis.greekname
ltx/en_us_oca/me.m06.d04:meMA.Ode9C11.incipit	…
ltx/en_us_oca/me.m06.d04:meMA.Ode9C11.melody	@ltx/en_us_oca/he.h.m4:heHE.ApasGigenis.notmetered
ltx/en_us_oca/me.m06.d04:meMA.Ode9C11.mode	@ltx/en_us_oca/miscellanea:misc.Mode4
ltx/en_us_oca/me.m06.d04:meMA.Ode9C11.ode	@ltx/en_us_oca/miscellanea:misc.Ode9
ltx/en_us_oca/me.m06.d04:meMA.Ode9C11.text	
ltx/en_us_oca/me.m06.d04:meMA.Ode9C12.incipit	…
ltx/en_us_oca/me.m06.d04:meMA.Ode9C12.melody	@ltx/en_us_oca/he.h.m4:heHE.ApasGigenis.notmetered
ltx/en_us_oca/me.m06.d04:meMA.Ode9C12.mode	@ltx/en_us_oca/miscellanea:misc.Mode4
ltx/en_us_oca/me.m06.d04:meMA.Ode9C12.ode	@ltx/en_us_oca/miscellanea:misc.Ode9
ltx/en_us_oca/me.m06.d04:meMA.Ode9C12.text	
ltx/en_us_oca/me.m06.d04:meMA.Ode9C13.incipit	…
ltx/en_us_oca/me.m06.d04:meMA.Ode9C13.melody	@ltx/en_us_oca/he.h.m4:heHE.ApasGigenis.notmetered
ltx/en_us_oca/me.m06.d04:meMA.Ode9C13.mode	@ltx/en_us_oca/miscellanea:misc.Mode4
ltx/en_us_oca/me.m06.d04:meMA.Ode9C13.ode	@ltx/en_us_oca/miscellanea:misc.Ode9
ltx/en_us_oca/me.m06.d04:meMA.Ode9C13.text	
ltx/en_us_oca/me.m06.d04:meMA.Ode9C14.incipit	…
ltx/en_us_oca/me.m06.d04:meMA.Ode9C14.melody	@ltx/en_us_oca/he.h.m4:heHE.ApasGigenis.notmetered
ltx/en_us_oca/me.m06.d04:meMA.Ode9C14.mode	@ltx/en_us_oca/miscellanea:misc.Mode4
ltx/en_us_oca/me.m06.d04:meMA.Ode9C14.ode	@ltx/en_us_oca/miscellanea:misc.Ode9
ltx/en_us_oca/me.m06.d04:meMA.Ode9C14.text	
ltx/en_us_oca/me.m06.d04:meMA.Ode9C1T.incipit	…
ltx/en_us_oca/me.m06.d04:meMA.Ode9C1T.melody	@ltx/en_us_oca/he.h.m4:heHE.ApasGigenis.notmetered
ltx/en_us_oca/me.m06.d04:meMA.Ode9C1T.mode	@ltx/en_us_oca/miscellanea:misc.Mode4
ltx/en_us_oca/me.m06.d04:meMA.Ode9C1T.ode	@ltx/en_us_oca/miscellanea:misc.Ode9
ltx/en_us_oca/me.m06.d04:meMA.Ode9C1T.text	
ltx/en_us_oca/me.m06.d04:meMA.Ode9C21.greekmelody	@ltx/en_us_oca/he.h.m6:heHE.TheonAnthropois.greekname
ltx/en_us_oca/me.m06.d04:meMA.Ode9C21.incipit	…
ltx/en_us_oca/me.m06.d04:meMA.Ode9C21.melody	@ltx/en_us_oca/he.h.m6:heHE.TheonAnthropois.notmetered
ltx/en_us_oca/me.m06.d04:meMA.Ode9C21.mode	@ltx/en_us_oca/miscellanea:misc.Mode6
ltx/en_us_oca/me.m06.d04:meMA.Ode9C21.ode	@ltx/en_us_oca/miscellanea:misc.Ode9
ltx/en_us_oca/me.m06.d04:meMA.Ode9C21.text	
ltx/en_us_oca/me.m06.d04:meMA.Ode9C22.incipit	…
ltx/en_us_oca/me.m06.d04:meMA.Ode9C22.melody	@ltx/en_us_oca/he.h.m6:heHE.TheonAnthropois.notmetered
ltx/en_us_oca/me.m06.d04:meMA.Ode9C22.mode	@ltx/en_us_oca/miscellanea:misc.Mode6
ltx/en_us_oca/me.m06.d04:meMA.Ode9C22.ode	@ltx/en_us_oca/miscellanea:misc.Ode9
ltx/en_us_oca/me.m06.d04:meMA.Ode9C22.text	
ltx/en_us_oca/me.m06.d04:meMA.Ode9C2T.incipit	…
ltx/en_us_oca/me.m06.d04:meMA.Ode9C2T.melody	@ltx/en_us_oca/he.h.m6:heHE.TheonAnthropois.notmetered
ltx/en_us_oca/me.m06.d04:meMA.Ode9C2T.mode	@ltx/en_us_oca/miscellanea:misc.Mode6
ltx/en_us_oca/me.m06.d04:meMA.Ode9C2T.ode	@ltx/en_us_oca/miscellanea:misc.Ode9
ltx/en_us_oca/me.m06.d04:meMA.Ode9C2T.text	
ltx/en_us_oca/me.m06.d04:meMA.Ode9H.greekmelody	@ltx/en_us_oca/he.h.m6:heHE.TheonAnthropois.greekname
ltx/en_us_oca/me.m06.d04:meMA.Ode9H.incipit	@ltx/en_us_oca/he.h.m6:heHE.TheonAnthropois.incipit
ltx/en_us_oca/me.m06.d04:meMA.Ode9H.melody	@ltx/en_us_oca/he.h.m6:heHE.TheonAnthropois.melody
ltx/en_us_oca/me.m06.d04:meMA.Ode9H.mode	@ltx/en_us_oca/miscellanea:misc.Mode6
ltx/en_us_oca/me.m06.d04:meMA.Ode9H.ode	@ltx/en_us_oca/miscellanea:misc.Ode9
ltx/en_us_oca/me.m06.d04:meMA.Ode9H.text	@ltx/en_us_oca/he.h.m6:heHE.TheonAnthropois.text
ltx/en_us_oca/me.m06.d04:meMA.Oikos1.text	
ltx/en_us_oca/me.m06.d04:meMA.PostGospelBoth.incipit	@ltx/en_us_oca/ho.ho03:hoMA.PostGospelTheotokos.incipit
ltx/en_us_oca/me.m06.d04:meMA.PostGospelBoth.melody	
ltx/en_us_oca/me.m06.d04:meMA.PostGospelBoth.mode	@ltx/en_us_oca/miscellanea:misc.Mode2
ltx/en_us_oca/me.m06.d04:meMA.PostGospelBoth.text	@ltx/en_us_oca/ho.ho03:hoMA.PostGospelTheotokos.text
ltx/en_us_oca/me.m06.d04:meMA.PostGospelGlory.incipit	@ltx/en_us_oca/ho.ho03:hoMA.PostGospelHierarch.incipit
ltx/en_us_oca/me.m06.d04:meMA.PostGospelGlory.melody	
ltx/en_us_oca/me.m06.d04:meMA.PostGospelGlory.mode	@ltx/en_us_oca/miscellanea:misc.Mode2
ltx/en_us_oca/me.m06.d04:meMA.PostGospelGlory.text	@ltx/en_us_oca/ho.ho03:hoMA.PostGospelHierarch.text
ltx/en_us_oca/me.m06.d04:meMA.PostGospelIdiomelon.incipit	@ltx/en_us_oca/me.m06.d04:meVE.SticGlory.incipit
ltx/en_us_oca/me.m06.d04:meMA.PostGospelIdiomelon.melody	
ltx/en_us_oca/me.m06.d04:meMA.PostGospelIdiomelon.mode	@ltx/en_us_oca/miscellanea:misc.Mode2
ltx/en_us_oca/me.m06.d04:meMA.PostGospelIdiomelon.text	@ltx/en_us_oca/me.m06.d04:meVE.SticGlory.text
ltx/en_us_oca/me.m06.d04:meVE.Apolytikion1.greekmelody	@ltx/en_us_oca/he.a.m1:heAU.TouLithouSfragisthentos.greekname
ltx/en_us_oca/me.m06.d04:meVE.Apolytikion1.incipit	…
ltx/en_us_oca/me.m06.d04:meVE.Apolytikion1.melody	@ltx/en_us_oca/he.a.m1:heAU.TouLithouSfragisthentos.notmetered
ltx/en_us_oca/me.m06.d04:meVE.Apolytikion1.mode	@ltx/en_us_oca/miscellanea:misc.Mode1
ltx/en_us_oca/me.m06.d04:meVE.Apolytikion1.text	
ltx/en_us_oca/me.m06.d04:meVE.AposGlory.incipit	…
ltx/en_us_oca/me.m06.d04:meVE.AposGlory.melody	
ltx/en_us_oca/me.m06.d04:meVE.AposGlory.mode	@ltx/en_us_oca/miscellanea:misc.Mode6
ltx/en_us_oca/me.m06.d04:meVE.AposGlory.text	
ltx/en_us_oca/me.m06.d04:meVE.AposTheotokion.incipit	@ltx/en_us_oca/he.o:heOT.TheotokeSyEi.incipit
ltx/en_us_oca/me.m06.d04:meVE.AposTheotokion.melody	@ltx/en_us_oca/he.o:heOT.TheotokeSyEi.name
ltx/en_us_oca/me.m06.d04:meVE.AposTheotokion.mode	@ltx/en_us_oca/miscellanea:misc.Mode6
ltx/en_us_oca/me.m06.d04:meVE.AposTheotokion.text	@ltx/en_us_oca/he.o:heOT.TheotokeSyEiIerarchou.text
ltx/en_us_oca/me.m06.d04:meVE.Aposticha1.greekmelody	@ltx/en_us_oca/he.a.m2:heAU.OteEkTouXylou.greekname
ltx/en_us_oca/me.m06.d04:meVE.Aposticha1.incipit	…
ltx/en_us_oca/me.m06.d04:meVE.Aposticha1.melody	@ltx/en_us_oca/he.a.m2:heAU.OteEkTouXylou.notmetered
ltx/en_us_oca/me.m06.d04:meVE.Aposticha1.mode	@ltx/en_us_oca/miscellanea:misc.Mode2
ltx/en_us_oca/me.m06.d04:meVE.Aposticha1.text	
ltx/en_us_oca/me.m06.d04:meVE.Aposticha2.incipit	…
ltx/en_us_oca/me.m06.d04:meVE.Aposticha2.melody	@ltx/en_us_oca/he.a.m2:heAU.OteEkTouXylou.notmetered
ltx/en_us_oca/me.m06.d04:meVE.Aposticha2.mode	@ltx/en_us_oca/miscellanea:misc.Mode2
ltx/en_us_oca/me.m06.d04:meVE.Aposticha2.text	
ltx/en_us_oca/me.m06.d04:meVE.Aposticha3.incipit	…
ltx/en_us_oca/me.m06.d04:meVE.Aposticha3.melody	@ltx/en_us_oca/he.a.m2:heAU.OteEkTouXylou.notmetered
ltx/en_us_oca/me.m06.d04:meVE.Aposticha3.mode	@ltx/en_us_oca/miscellanea:misc.Mode2
ltx/en_us_oca/me.m06.d04:meVE.Aposticha3.text	
ltx/en_us_oca/me.m06.d04:meVE.SticGlory.incipit	…
ltx/en_us_oca/me.m06.d04:meVE.SticGlory.melody	
ltx/en_us_oca/me.m06.d04:meVE.SticGlory.mode	@ltx/en_us_oca/miscellanea:misc.Mode2
ltx/en_us_oca/me.m06.d04:meVE.SticGlory.text	
ltx/en_us_oca/me.m06.d04:meVE.SticTheotokion.incipit	@ltx/en_us_oca/oc.m2.d1:ocVE.SticTheotokion.incipit
ltx/en_us_oca/me.m06.d04:meVE.SticTheotokion.melody	
ltx/en_us_oca/me.m06.d04:meVE.SticTheotokion.mode	@ltx/en_us_oca/miscellanea:misc.Mode2
ltx/en_us_oca/me.m06.d04:meVE.SticTheotokion.text	@ltx/en_us_oca/oc.m2.d1:ocVE.SticTheotokion.text
ltx/en_us_oca/me.m06.d04:meVE.Stichera01.greekmelody	@ltx/en_us_oca/he.a.m4:heAU.OsGennaionEnMartysi.greekname
ltx/en_us_oca/me.m06.d04:meVE.Stichera01.incipit	…
ltx/en_us_oca/me.m06.d04:meVE.Stichera01.melody	@ltx/en_us_oca/he.a.m4:heAU.OsGennaionEnMartysi.notmetered
ltx/en_us_oca/me.m06.d04:meVE.Stichera01.mode	@ltx/en_us_oca/miscellanea:misc.Mode4
ltx/en_us_oca/me.m06.d04:meVE.Stichera01.text	
ltx/en_us_oca/me.m06.d04:meVE.Stichera02.incipit	…
ltx/en_us_oca/me.m06.d04:meVE.Stichera02.melody	@ltx/en_us_oca/he.a.m4:heAU.OsGennaionEnMartysi.notmetered
ltx/en_us_oca/me.m06.d04:meVE.Stichera02.mode	@ltx/en_us_oca/miscellanea:misc.Mode4
ltx/en_us_oca/me.m06.d04:meVE.Stichera02.text	
ltx/en_us_oca/me.m06.d04:meVE.Stichera03.incipit	…
ltx/en_us_oca/me.m06.d04:meVE.Stichera03.melody	@ltx/en_us_oca/he.a.m4:heAU.OsGennaionEnMartysi.notmetered
ltx/en_us_oca/me.m06.d04:meVE.Stichera03.mode	@ltx/en_us_oca/miscellanea:misc.Mode4
ltx/en_us_oca/me.m06.d04:meVE.Stichera03.text	
ltx/en_us_oca/me.m06.d04:meVE.Stichera04.greekmelody	@ltx/en_us_oca/he.a.m6:heAU.OlinApothemenoi.greekname
ltx/en_us_oca/me.m06.d04:meVE.Stichera04.incipit	You were revealed as a…
ltx/en_us_oca/me.m06.d04:meVE.Stichera04.melody	@ltx/en_us_oca/he.a.m6:heAU.OlinApothemenoi.notmetered
ltx/en_us_oca/me.m06.d04:meVE.Stichera04.mode	@ltx/en_us_oca/miscellanea:misc.Mode6
ltx/en_us_oca/me.m06.d04:meVE.Stichera04.text	You were revealed as a God-bearer. ⁄ wholly consecrated, the holy anointed of God. ⁄ You were robed in the Holy Spirit, ⁄ ever entering the Holy of Holies with splendor, ⁄ robed with godly radiance, ⁄ partaking of the grace of the holy mysteries ⁄ as a true and all glorious bishop, ⁄⁄ praying with boldness on behalf of our souls!
ltx/en_us_oca/me.m06.d04:meVE.Stichera05.incipit	All blessed and holy hierarch…
ltx/en_us_oca/me.m06.d04:meVE.Stichera05.melody	@ltx/en_us_oca/he.a.m6:heAU.OlinApothemenoi.notmetered
ltx/en_us_oca/me.m06.d04:meVE.Stichera05.mode	@ltx/en_us_oca/miscellanea:misc.Mode6
ltx/en_us_oca/me.m06.d04:meVE.Stichera05.text	All blessed and holy hierarch Metrophanes, ⁄ your life was illumined with the radiance of the virtues. ⁄ You enlightened the faithful, ⁄ driving away the darkness of falsehood, ⁄ for you were shown to be the bright sun of the truth. ⁄ Now you have made your dwelling where the never fading light shines; ⁄ you have become a child of the day through the grace of the Holy Spirit! ⁄ Therefore as we celebrate your divine and light-bearing memory, ⁄⁄ we honor you with love, ever-memorable one!
ltx/en_us_oca/me.m06.d04:meVE.Stichera06.incipit	Your mind was made beautiful…
ltx/en_us_oca/me.m06.d04:meVE.Stichera06.melody	@ltx/en_us_oca/he.a.m6:heAU.OlinApothemenoi.notmetered
ltx/en_us_oca/me.m06.d04:meVE.Stichera06.mode	@ltx/en_us_oca/miscellanea:misc.Mode6
ltx/en_us_oca/me.m06.d04:meVE.Stichera06.text	Your mind was made beautiful by faith ⁄ and through yearning for God, divinely wise one. ⁄ You were shown to be radiant! ⁄ You learned incorruption in your mortal and corruptible body, ⁄ acquiring the splendor of the bodiless ones, all-wise one. ⁄ You became a stranger to pleasures ⁄ and were adorned with dispassion. ⁄ All-wise Father and Bishop Metrophanes, ⁄ you are a shining lamp and intercessor ⁄⁄ for those who honor your memory with love!
