ltx/en_us_oca/me.m09.d26:meDA.commemoration.first	
ltx/en_us_oca/me.m09.d26:meDA.commemoration.first_name	
ltx/en_us_oca/me.m09.d26:meDA.commemoration.first_short	
ltx/en_us_oca/me.m09.d26:meDA.commemoration.first_title	
ltx/en_us_oca/me.m09.d26:meDA.commemoration.full	
ltx/en_us_oca/me.m09.d26:meDA.commemoration.second_name	
ltx/en_us_oca/me.m09.d26:meDA.commemoration.second_title	
ltx/en_us_oca/me.m09.d26:meDA.date	
ltx/en_us_oca/me.m09.d26:meDA.fordate	
ltx/en_us_oca/me.m09.d26:meDA.insert1	
ltx/en_us_oca/me.m09.d26:meDA.insert2	
ltx/en_us_oca/me.m09.d26:meDA.note	
ltx/en_us_oca/me.m09.d26:meDA.pdfcoverdate	
ltx/en_us_oca/me.m09.d26:meDA.pdfheaderdate	
ltx/en_us_oca/me.m09.d26:meHO.commemorations	
ltx/en_us_oca/me.m09.d26:meHO.note1	
ltx/en_us_oca/me.m09.d26:meHO.note2	
ltx/en_us_oca/me.m09.d26:meHO.number	
ltx/en_us_oca/me.m09.d26:meHO.rank	
ltx/en_us_oca/me.m09.d26:meLE.commemoration1	
ltx/en_us_oca/me.m09.d26:meLE.commemoration2	
ltx/en_us_oca/me.m09.d26:meLI.Kontakion1.incipit	@ltx/en_us_oca/me.m09.d26:meMA.Kontakion1.incipit
ltx/en_us_oca/me.m09.d26:meLI.Kontakion1.melody	@ltx/en_us_oca/me.m09.d26:meMA.Kontakion1.melody
ltx/en_us_oca/me.m09.d26:meLI.Kontakion1.mode	@ltx/en_us_oca/me.m09.d26:meMA.Kontakion1.mode
ltx/en_us_oca/me.m09.d26:meLI.Kontakion1.text	@ltx/en_us_oca/me.m09.d26:meMA.Kontakion1.text
ltx/en_us_oca/me.m09.d26:meLI.MM.CommunionHymn.text	@ltx/en_us_oca/properties:media.key
ltx/en_us_oca/me.m09.d26:meLI.Megalynarion.text	
ltx/en_us_oca/me.m09.d26:meMA.C1.acrostic.notice1	
ltx/en_us_oca/me.m09.d26:meMA.C1.acrostic.notice2	
ltx/en_us_oca/me.m09.d26:meMA.C1.acrostic.title	
ltx/en_us_oca/me.m09.d26:meMA.C1.poet	@ltx/en_us_oca/poets:po.Theofanous
ltx/en_us_oca/me.m09.d26:meMA.C1.title	@ltx/en_us_oca/titles:ti.CanonTheotokos
ltx/en_us_oca/me.m09.d26:meMA.C1.verse	@ltx/en_us_oca/prayers:pr.verse_Theotokos.text
ltx/en_us_oca/me.m09.d26:meMA.C2.acrostic.notice1	
ltx/en_us_oca/me.m09.d26:meMA.C2.acrostic.text	
ltx/en_us_oca/me.m09.d26:meMA.C2.acrostic.title	
ltx/en_us_oca/me.m09.d26:meMA.C2.poet	@ltx/en_us_oca/poets:po.Theofanous
ltx/en_us_oca/me.m09.d26:meMA.C2.title	@ltx/en_us_oca/titles:ti.Canon1SaintM
ltx/en_us_oca/me.m09.d26:meMA.C2.verse	@ltx/en_us_oca/prayers:pr.verse_SaintM.text
ltx/en_us_oca/me.m09.d26:meMA.C3.acrostic.notice1	
ltx/en_us_oca/me.m09.d26:meMA.C3.acrostic.text	
ltx/en_us_oca/me.m09.d26:meMA.C3.acrostic.title	
ltx/en_us_oca/me.m09.d26:meMA.C3.title	@ltx/en_us_oca/titles:ti.Canon2SaintM
ltx/en_us_oca/me.m09.d26:meMA.C3.verse	@ltx/en_us_oca/prayers:pr.verse_SaintM.text
ltx/en_us_oca/me.m09.d26:meMA.ExapTheotokion.incipit	…
ltx/en_us_oca/me.m09.d26:meMA.ExapTheotokion.melody	@ltx/en_us_oca/he.a.m2:heAU.GynaikesAkoutisthite.notmetered
ltx/en_us_oca/me.m09.d26:meMA.ExapTheotokion.mode	@ltx/en_us_oca/miscellanea:misc.Mode2
ltx/en_us_oca/me.m09.d26:meMA.ExapTheotokion.text	
ltx/en_us_oca/me.m09.d26:meMA.Exaposteilarion1.greekmelody	@ltx/en_us_oca/he.a.m2:heAU.GynaikesAkoutisthite.greekname
ltx/en_us_oca/me.m09.d26:meMA.Exaposteilarion1.incipit	…
ltx/en_us_oca/me.m09.d26:meMA.Exaposteilarion1.melody	@ltx/en_us_oca/he.a.m2:heAU.GynaikesAkoutisthite.notmetered
ltx/en_us_oca/me.m09.d26:meMA.Exaposteilarion1.mode	@ltx/en_us_oca/miscellanea:misc.Mode2
ltx/en_us_oca/me.m09.d26:meMA.Exaposteilarion1.text	
ltx/en_us_oca/me.m09.d26:meMA.Kathisma11.greekmelody	@ltx/en_us_oca/he.a.m8:heAU.TinSofianKaiLogon.greekname
ltx/en_us_oca/me.m09.d26:meMA.Kathisma11.incipit	…
ltx/en_us_oca/me.m09.d26:meMA.Kathisma11.melody	@ltx/en_us_oca/he.a.m8:heAU.TinSofianKaiLogon.notmetered
ltx/en_us_oca/me.m09.d26:meMA.Kathisma11.mode	@ltx/en_us_oca/miscellanea:misc.Mode8
ltx/en_us_oca/me.m09.d26:meMA.Kathisma11.text	
ltx/en_us_oca/me.m09.d26:meMA.Kathisma1T.incipit	@ltx/en_us_oca/he.a.m8:heAU.TinSofianKaiLogon.incipit
ltx/en_us_oca/me.m09.d26:meMA.Kathisma1T.melody	@ltx/en_us_oca/he.a.m8:heAU.TinSofianKaiLogon.melody
ltx/en_us_oca/me.m09.d26:meMA.Kathisma1T.mode	@ltx/en_us_oca/miscellanea:misc.Mode8
ltx/en_us_oca/me.m09.d26:meMA.Kathisma1T.text	@ltx/en_us_oca/he.a.m8:heAU.TinSofianKaiLogon.text
ltx/en_us_oca/me.m09.d26:meMA.Kathisma21.greekmelody	@ltx/en_us_oca/he.a.m8:heAU.TinSofianKaiLogon.greekname
ltx/en_us_oca/me.m09.d26:meMA.Kathisma21.incipit	…
ltx/en_us_oca/me.m09.d26:meMA.Kathisma21.melody	@ltx/en_us_oca/he.a.m8:heAU.TinSofianKaiLogon.notmetered
ltx/en_us_oca/me.m09.d26:meMA.Kathisma21.mode	@ltx/en_us_oca/miscellanea:misc.Mode8
ltx/en_us_oca/me.m09.d26:meMA.Kathisma21.text	
ltx/en_us_oca/me.m09.d26:meMA.Kathisma2T.incipit	…
ltx/en_us_oca/me.m09.d26:meMA.Kathisma2T.melody	@ltx/en_us_oca/he.a.m8:heAU.TinSofianKaiLogon.notmetered
ltx/en_us_oca/me.m09.d26:meMA.Kathisma2T.mode	@ltx/en_us_oca/miscellanea:misc.Mode8
ltx/en_us_oca/me.m09.d26:meMA.Kathisma2T.text	
ltx/en_us_oca/me.m09.d26:meMA.Kathisma31.greekmelody	@ltx/en_us_oca/he.a.m8:heAU.TinSofianKaiLogon.greekname
ltx/en_us_oca/me.m09.d26:meMA.Kathisma31.incipit	@ltx/en_us_oca/me.m05.d08:meMA.Kathisma21.incipit
ltx/en_us_oca/me.m09.d26:meMA.Kathisma31.melody	@ltx/en_us_oca/he.a.m8:heAU.TinSofianKaiLogon.notmetered
ltx/en_us_oca/me.m09.d26:meMA.Kathisma31.mode	@ltx/en_us_oca/miscellanea:misc.Mode8
ltx/en_us_oca/me.m09.d26:meMA.Kathisma31.text	@ltx/en_us_oca/me.m05.d08:meMA.Kathisma21.text
ltx/en_us_oca/me.m09.d26:meMA.Kathisma3T.incipit	…
ltx/en_us_oca/me.m09.d26:meMA.Kathisma3T.melody	@ltx/en_us_oca/he.a.m8:heAU.TinSofianKaiLogon.notmetered
ltx/en_us_oca/me.m09.d26:meMA.Kathisma3T.mode	@ltx/en_us_oca/miscellanea:misc.Mode8
ltx/en_us_oca/me.m09.d26:meMA.Kathisma3T.text	
ltx/en_us_oca/me.m09.d26:meMA.Kontakion1.incipit	Who shall declare…
ltx/en_us_oca/me.m09.d26:meMA.Kontakion1.melody	
ltx/en_us_oca/me.m09.d26:meMA.Kontakion1.mode	@ltx/en_us_oca/miscellanea:misc.Mode2
ltx/en_us_oca/me.m09.d26:meMA.Kontakion1.text	Who shall declare your greatness, virgin disciple? ⁄ For as a fountain of healing you flow with miracles ⁄ interceding for our souls ⁄⁄ as Theologian and friend of Christ.
ltx/en_us_oca/me.m09.d26:meMA.Lauds1.greekmelody	@ltx/en_us_oca/he.a.m8:heAU.OTouParadoxou.greekname
ltx/en_us_oca/me.m09.d26:meMA.Lauds1.incipit	…
ltx/en_us_oca/me.m09.d26:meMA.Lauds1.melody	@ltx/en_us_oca/he.a.m8:heAU.OTouParadoxou.notmetered
ltx/en_us_oca/me.m09.d26:meMA.Lauds1.mode	@ltx/en_us_oca/miscellanea:misc.Mode8
ltx/en_us_oca/me.m09.d26:meMA.Lauds1.text	
ltx/en_us_oca/me.m09.d26:meMA.Lauds2.incipit	…
ltx/en_us_oca/me.m09.d26:meMA.Lauds2.melody	@ltx/en_us_oca/he.a.m8:heAU.OTouParadoxou.notmetered
ltx/en_us_oca/me.m09.d26:meMA.Lauds2.mode	@ltx/en_us_oca/miscellanea:misc.Mode8
ltx/en_us_oca/me.m09.d26:meMA.Lauds2.text	
ltx/en_us_oca/me.m09.d26:meMA.Lauds3.incipit	…
ltx/en_us_oca/me.m09.d26:meMA.Lauds3.melody	@ltx/en_us_oca/he.a.m8:heAU.OTouParadoxou.notmetered
ltx/en_us_oca/me.m09.d26:meMA.Lauds3.mode	@ltx/en_us_oca/miscellanea:misc.Mode8
ltx/en_us_oca/me.m09.d26:meMA.Lauds3.text	
ltx/en_us_oca/me.m09.d26:meMA.Lauds4.greekmelody	@ltx/en_us_oca/he.a.m8:heAU.OTouParadoxou.greekname
ltx/en_us_oca/me.m09.d26:meMA.Lauds4.incipit	…
ltx/en_us_oca/me.m09.d26:meMA.Lauds4.melody	@ltx/en_us_oca/he.a.m8:heAU.OTouParadoxou.notmetered
ltx/en_us_oca/me.m09.d26:meMA.Lauds4.mode	@ltx/en_us_oca/miscellanea:misc.Mode8
ltx/en_us_oca/me.m09.d26:meMA.Lauds4.text	
ltx/en_us_oca/me.m09.d26:meMA.LaudsGlory.incipit	@ltx/en_us_oca/me.m05.d08:meMA.LaudsGlory.incipit
ltx/en_us_oca/me.m09.d26:meMA.LaudsGlory.melody	
ltx/en_us_oca/me.m09.d26:meMA.LaudsGlory.mode	@ltx/en_us_oca/miscellanea:misc.Mode8
ltx/en_us_oca/me.m09.d26:meMA.LaudsGlory.text	@ltx/en_us_oca/me.m05.d08:meMA.LaudsGlory.text
ltx/en_us_oca/me.m09.d26:meMA.LaudsTheotokion.incipit	@ltx/en_us_oca/oc.m8.d5:ocMA.AposTheotokion.incipit
ltx/en_us_oca/me.m09.d26:meMA.LaudsTheotokion.melody	
ltx/en_us_oca/me.m09.d26:meMA.LaudsTheotokion.mode	@ltx/en_us_oca/miscellanea:misc.Mode8
ltx/en_us_oca/me.m09.d26:meMA.LaudsTheotokion.text	@ltx/en_us_oca/oc.m8.d5:ocMA.AposTheotokion.text
ltx/en_us_oca/me.m09.d26:meMA.MM.Lauds1234as5678.text	@ltx/en_us_oca/properties:media.key
ltx/en_us_oca/me.m09.d26:meMA.Ode1C11.greekmelody	@ltx/en_us_oca/he.h.m2:heHE.EnVythoKatestrose.greekname
ltx/en_us_oca/me.m09.d26:meMA.Ode1C11.incipit	@ltx/en_us_oca/me.m07.d27:meMA.Ode1C11.incipit
ltx/en_us_oca/me.m09.d26:meMA.Ode1C11.melody	@ltx/en_us_oca/he.h.m2:heHE.EnVythoKatestrose.notmetered
ltx/en_us_oca/me.m09.d26:meMA.Ode1C11.mode	@ltx/en_us_oca/miscellanea:misc.Mode2
ltx/en_us_oca/me.m09.d26:meMA.Ode1C11.ode	@ltx/en_us_oca/miscellanea:misc.Ode1
ltx/en_us_oca/me.m09.d26:meMA.Ode1C11.text	@ltx/en_us_oca/me.m07.d27:meMA.Ode1C11.text
ltx/en_us_oca/me.m09.d26:meMA.Ode1C12.incipit	@ltx/en_us_oca/me.m07.d27:meMA.Ode1C12.incipit
ltx/en_us_oca/me.m09.d26:meMA.Ode1C12.melody	@ltx/en_us_oca/he.h.m2:heHE.EnVythoKatestrose.notmetered
ltx/en_us_oca/me.m09.d26:meMA.Ode1C12.mode	@ltx/en_us_oca/miscellanea:misc.Mode2
ltx/en_us_oca/me.m09.d26:meMA.Ode1C12.ode	@ltx/en_us_oca/miscellanea:misc.Ode1
ltx/en_us_oca/me.m09.d26:meMA.Ode1C12.text	@ltx/en_us_oca/me.m07.d27:meMA.Ode1C12.text
ltx/en_us_oca/me.m09.d26:meMA.Ode1C13.incipit	@ltx/en_us_oca/me.m07.d27:meMA.Ode1C13.incipit
ltx/en_us_oca/me.m09.d26:meMA.Ode1C13.melody	@ltx/en_us_oca/he.h.m2:heHE.EnVythoKatestrose.notmetered
ltx/en_us_oca/me.m09.d26:meMA.Ode1C13.mode	@ltx/en_us_oca/miscellanea:misc.Mode2
ltx/en_us_oca/me.m09.d26:meMA.Ode1C13.ode	@ltx/en_us_oca/miscellanea:misc.Ode1
ltx/en_us_oca/me.m09.d26:meMA.Ode1C13.text	@ltx/en_us_oca/me.m07.d27:meMA.Ode1C13.text
ltx/en_us_oca/me.m09.d26:meMA.Ode1C1H.greekmelody	@ltx/en_us_oca/he.h.m2:heHE.EnVythoKatestrose.greekname
ltx/en_us_oca/me.m09.d26:meMA.Ode1C1H.incipit	@ltx/en_us_oca/he.h.m2:heHE.EnVythoKatestrose.incipit
ltx/en_us_oca/me.m09.d26:meMA.Ode1C1H.melody	@ltx/en_us_oca/he.h.m2:heHE.EnVythoKatestrose.melody
ltx/en_us_oca/me.m09.d26:meMA.Ode1C1H.mode	@ltx/en_us_oca/miscellanea:misc.Mode2
ltx/en_us_oca/me.m09.d26:meMA.Ode1C1H.ode	@ltx/en_us_oca/miscellanea:misc.Ode1
ltx/en_us_oca/me.m09.d26:meMA.Ode1C1H.text	@ltx/en_us_oca/he.h.m2:heHE.EnVythoKatestrose.text
ltx/en_us_oca/me.m09.d26:meMA.Ode1C21.greekmelody	@ltx/en_us_oca/he.h.m2:heHE.EnVythoKatestrose.greekname
ltx/en_us_oca/me.m09.d26:meMA.Ode1C21.incipit	As your reward…
ltx/en_us_oca/me.m09.d26:meMA.Ode1C21.melody	@ltx/en_us_oca/he.h.m2:heHE.EnVythoKatestrose.notmetered
ltx/en_us_oca/me.m09.d26:meMA.Ode1C21.mode	@ltx/en_us_oca/miscellanea:misc.Mode2
ltx/en_us_oca/me.m09.d26:meMA.Ode1C21.ode	@ltx/en_us_oca/miscellanea:misc.Ode1
ltx/en_us_oca/me.m09.d26:meMA.Ode1C21.text	As your reward, blessed one, ⁄ companion of the Heavenly Word, ⁄ you have received the Kingdom of Heaven which you proclaimed. ⁄ By your prayers protect those who believe in your holy teaching and theology!
ltx/en_us_oca/me.m09.d26:meMA.Ode1C22.incipit	You despised all earthly things…
ltx/en_us_oca/me.m09.d26:meMA.Ode1C22.melody	@ltx/en_us_oca/he.h.m2:heHE.EnVythoKatestrose.notmetered
ltx/en_us_oca/me.m09.d26:meMA.Ode1C22.mode	@ltx/en_us_oca/miscellanea:misc.Mode2
ltx/en_us_oca/me.m09.d26:meMA.Ode1C22.ode	@ltx/en_us_oca/miscellanea:misc.Ode1
ltx/en_us_oca/me.m09.d26:meMA.Ode1C22.text	You despised all earthly things, and nature’s bonds ⁄ by your strength of mind. ⁄ In thought and understanding you dwelt with the Word of Wisdom. ⁄ You set free from error ⁄ those who were living without reason.
ltx/en_us_oca/me.m09.d26:meMA.Ode1C23.incipit	You received knowledge…
ltx/en_us_oca/me.m09.d26:meMA.Ode1C23.melody	@ltx/en_us_oca/he.h.m2:heHE.EnVythoKatestrose.notmetered
ltx/en_us_oca/me.m09.d26:meMA.Ode1C23.mode	@ltx/en_us_oca/miscellanea:misc.Mode2
ltx/en_us_oca/me.m09.d26:meMA.Ode1C23.ode	@ltx/en_us_oca/miscellanea:misc.Ode1
ltx/en_us_oca/me.m09.d26:meMA.Ode1C23.text	You received knowledge of heavenly things, ⁄ and proclaimed the Word of God, divine one: ⁄ In the beginning was the Word! ⁄ The Word was with God Who begot Him, ⁄ and the Word was God! ⁄ These are the good tidings you preached aloud.
ltx/en_us_oca/me.m09.d26:meMA.Ode1C2T.incipit	The choir of virgins sings…
ltx/en_us_oca/me.m09.d26:meMA.Ode1C2T.melody	@ltx/en_us_oca/he.h.m2:heHE.EnVythoKatestrose.notmetered
ltx/en_us_oca/me.m09.d26:meMA.Ode1C2T.mode	@ltx/en_us_oca/miscellanea:misc.Mode2
ltx/en_us_oca/me.m09.d26:meMA.Ode1C2T.ode	@ltx/en_us_oca/miscellanea:misc.Ode1
ltx/en_us_oca/me.m09.d26:meMA.Ode1C2T.text	The choir of virgins sings of your beauty, Theotokos, ⁄ divine Lady, most blessed among women, ⁄ made glorious by the grace of divinity. ⁄ For beyond words, you conceived the Word, ⁄ the Author of all beauty.
ltx/en_us_oca/me.m09.d26:meMA.Ode1C31.greekmelody	@ltx/en_us_oca/he.h.m6:heHE.OsEnIpeiroPezefsas.greekname
ltx/en_us_oca/me.m09.d26:meMA.Ode1C31.incipit	With your mind enlightened…
ltx/en_us_oca/me.m09.d26:meMA.Ode1C31.melody	@ltx/en_us_oca/he.h.m6:heHE.OsEnIpeiroPezefsas.notmetered
ltx/en_us_oca/me.m09.d26:meMA.Ode1C31.mode	@ltx/en_us_oca/miscellanea:misc.Mode6
ltx/en_us_oca/me.m09.d26:meMA.Ode1C31.ode	@ltx/en_us_oca/miscellanea:misc.Ode1
ltx/en_us_oca/me.m09.d26:meMA.Ode1C31.text	With your mind enlightened ⁄ and humbled by the depths of the Spirit, ⁄ you made the fearful birth plain to us, Theologian ⁄ as you cried aloud: ⁄ In the beginning was the Word of God!
ltx/en_us_oca/me.m09.d26:meMA.Ode1C32.incipit	As you heal…
ltx/en_us_oca/me.m09.d26:meMA.Ode1C32.melody	@ltx/en_us_oca/he.h.m6:heHE.OsEnIpeiroPezefsas.notmetered
ltx/en_us_oca/me.m09.d26:meMA.Ode1C32.mode	@ltx/en_us_oca/miscellanea:misc.Mode6
ltx/en_us_oca/me.m09.d26:meMA.Ode1C32.ode	@ltx/en_us_oca/miscellanea:misc.Ode1
ltx/en_us_oca/me.m09.d26:meMA.Ode1C32.text	As you heal the deadly passions of our souls, ⁄ most wise physician, ⁄ by your intercession ⁄ deliver us from eternal condemnation and fire.
ltx/en_us_oca/me.m09.d26:meMA.Ode1C33.incipit	We are bent down…
ltx/en_us_oca/me.m09.d26:meMA.Ode1C33.melody	@ltx/en_us_oca/he.h.m6:heHE.OsEnIpeiroPezefsas.notmetered
ltx/en_us_oca/me.m09.d26:meMA.Ode1C33.mode	@ltx/en_us_oca/miscellanea:misc.Mode6
ltx/en_us_oca/me.m09.d26:meMA.Ode1C33.ode	@ltx/en_us_oca/miscellanea:misc.Ode1
ltx/en_us_oca/me.m09.d26:meMA.Ode1C33.text	We are bent down by a multitude of temptations, ⁄ gravely attacked by passions and afflictions. ⁄ We take refuge in you with faith, O Theologian. ⁄ Come to the aid of your servants!
ltx/en_us_oca/me.m09.d26:meMA.Ode1C3T.incipit	Since you brought forth…
ltx/en_us_oca/me.m09.d26:meMA.Ode1C3T.melody	@ltx/en_us_oca/he.h.m6:heHE.OsEnIpeiroPezefsas.notmetered
ltx/en_us_oca/me.m09.d26:meMA.Ode1C3T.mode	@ltx/en_us_oca/miscellanea:misc.Mode6
ltx/en_us_oca/me.m09.d26:meMA.Ode1C3T.ode	@ltx/en_us_oca/miscellanea:misc.Ode1
ltx/en_us_oca/me.m09.d26:meMA.Ode1C3T.text	Since you brought forth for us the Incarnate God, ⁄ Beseech Him, pure Virgin, ⁄ to have mercy on us who have greatly sinned against Him ⁄ when He comes on the day of Judgment!
ltx/en_us_oca/me.m09.d26:meMA.Ode3C11.greekmelody	@ltx/en_us_oca/he.h.m2:heHE.ExinthisenIErimos.greekname
ltx/en_us_oca/me.m09.d26:meMA.Ode3C11.incipit	@ltx/en_us_oca/me.m07.d27:meMA.Ode3C11.incipit
ltx/en_us_oca/me.m09.d26:meMA.Ode3C11.melody	@ltx/en_us_oca/he.h.m2:heHE.ExinthisenIErimos.notmetered
ltx/en_us_oca/me.m09.d26:meMA.Ode3C11.mode	@ltx/en_us_oca/miscellanea:misc.Mode2
ltx/en_us_oca/me.m09.d26:meMA.Ode3C11.ode	@ltx/en_us_oca/miscellanea:misc.Ode3
ltx/en_us_oca/me.m09.d26:meMA.Ode3C11.text	@ltx/en_us_oca/me.m07.d27:meMA.Ode3C11.text
ltx/en_us_oca/me.m09.d26:meMA.Ode3C12.incipit	@ltx/en_us_oca/me.m07.d27:meMA.Ode3C12.incipit
ltx/en_us_oca/me.m09.d26:meMA.Ode3C12.melody	@ltx/en_us_oca/he.h.m2:heHE.ExinthisenIErimos.notmetered
ltx/en_us_oca/me.m09.d26:meMA.Ode3C12.mode	@ltx/en_us_oca/miscellanea:misc.Mode2
ltx/en_us_oca/me.m09.d26:meMA.Ode3C12.ode	@ltx/en_us_oca/miscellanea:misc.Ode3
ltx/en_us_oca/me.m09.d26:meMA.Ode3C12.text	@ltx/en_us_oca/me.m07.d27:meMA.Ode3C12.text
ltx/en_us_oca/me.m09.d26:meMA.Ode3C13.incipit	@ltx/en_us_oca/me.m07.d27:meMA.Ode3C13.incipit
ltx/en_us_oca/me.m09.d26:meMA.Ode3C13.melody	@ltx/en_us_oca/he.h.m2:heHE.ExinthisenIErimos.notmetered
ltx/en_us_oca/me.m09.d26:meMA.Ode3C13.mode	@ltx/en_us_oca/miscellanea:misc.Mode2
ltx/en_us_oca/me.m09.d26:meMA.Ode3C13.ode	@ltx/en_us_oca/miscellanea:misc.Ode3
ltx/en_us_oca/me.m09.d26:meMA.Ode3C13.text	@ltx/en_us_oca/me.m07.d27:meMA.Ode3C13.text
ltx/en_us_oca/me.m09.d26:meMA.Ode3C1H.greekmelody	@ltx/en_us_oca/he.h.m2:heHE.ExinthisenIErimos.greekname
ltx/en_us_oca/me.m09.d26:meMA.Ode3C1H.incipit	@ltx/en_us_oca/he.h.m2:heHE.ExinthisenIErimos.incipit
ltx/en_us_oca/me.m09.d26:meMA.Ode3C1H.melody	@ltx/en_us_oca/he.h.m2:heHE.ExinthisenIErimos.melody
ltx/en_us_oca/me.m09.d26:meMA.Ode3C1H.mode	@ltx/en_us_oca/miscellanea:misc.Mode2
ltx/en_us_oca/me.m09.d26:meMA.Ode3C1H.ode	@ltx/en_us_oca/miscellanea:misc.Ode3
ltx/en_us_oca/me.m09.d26:meMA.Ode3C1H.text	@ltx/en_us_oca/he.h.m2:heHE.ExinthisenIErimos.text
ltx/en_us_oca/me.m09.d26:meMA.Ode3C21.greekmelody	@ltx/en_us_oca/he.h.m2:heHE.ExinthisenIErimos.greekname
ltx/en_us_oca/me.m09.d26:meMA.Ode3C21.incipit	With your tongue confessing…
ltx/en_us_oca/me.m09.d26:meMA.Ode3C21.melody	@ltx/en_us_oca/he.h.m2:heHE.ExinthisenIErimos.notmetered
ltx/en_us_oca/me.m09.d26:meMA.Ode3C21.mode	@ltx/en_us_oca/miscellanea:misc.Mode2
ltx/en_us_oca/me.m09.d26:meMA.Ode3C21.ode	@ltx/en_us_oca/miscellanea:misc.Ode3
ltx/en_us_oca/me.m09.d26:meMA.Ode3C21.text	With your tongue confessing God, ⁄ you revealed the ineffable mystery of the Trinity, ⁄ in which you establish my heart, blessed one!
ltx/en_us_oca/me.m09.d26:meMA.Ode3C22.incipit	Your tongue was the pen…
ltx/en_us_oca/me.m09.d26:meMA.Ode3C22.melody	@ltx/en_us_oca/he.h.m2:heHE.ExinthisenIErimos.notmetered
ltx/en_us_oca/me.m09.d26:meMA.Ode3C22.mode	@ltx/en_us_oca/miscellanea:misc.Mode2
ltx/en_us_oca/me.m09.d26:meMA.Ode3C22.ode	@ltx/en_us_oca/miscellanea:misc.Ode3
ltx/en_us_oca/me.m09.d26:meMA.Ode3C22.text	Your tongue was the pen of the All-Holy Spirit, ⁄ making visible in divine words ⁄ the sublime and holy Gospel.
ltx/en_us_oca/me.m09.d26:meMA.Ode3C23.incipit	You drew from the abyss…
ltx/en_us_oca/me.m09.d26:meMA.Ode3C23.melody	@ltx/en_us_oca/he.h.m2:heHE.ExinthisenIErimos.notmetered
ltx/en_us_oca/me.m09.d26:meMA.Ode3C23.mode	@ltx/en_us_oca/miscellanea:misc.Mode2
ltx/en_us_oca/me.m09.d26:meMA.Ode3C23.ode	@ltx/en_us_oca/miscellanea:misc.Ode3
ltx/en_us_oca/me.m09.d26:meMA.Ode3C23.text	You drew from the abyss of Wisdom, ⁄ leaning with divinely inspired boldness on its source ⁄ about whom you spoke with inspired preaching.
ltx/en_us_oca/me.m09.d26:meMA.Ode3C2T.incipit	We honor you…
ltx/en_us_oca/me.m09.d26:meMA.Ode3C2T.melody	@ltx/en_us_oca/he.h.m2:heHE.ExinthisenIErimos.notmetered
ltx/en_us_oca/me.m09.d26:meMA.Ode3C2T.mode	@ltx/en_us_oca/miscellanea:misc.Mode2
ltx/en_us_oca/me.m09.d26:meMA.Ode3C2T.ode	@ltx/en_us_oca/miscellanea:misc.Ode3
ltx/en_us_oca/me.m09.d26:meMA.Ode3C2T.text	We honor you, only Virgin Mother, ⁄ for you have been the immaculate intercessor of salvation, ⁄ delivering the world by your prayers!
ltx/en_us_oca/me.m09.d26:meMA.Ode3C31.greekmelody	@ltx/en_us_oca/he.h.m6:heHE.OukEstinAgios.greekname
ltx/en_us_oca/me.m09.d26:meMA.Ode3C31.incipit	You spoke with the Word…
ltx/en_us_oca/me.m09.d26:meMA.Ode3C31.melody	@ltx/en_us_oca/he.h.m6:heHE.OukEstinAgios.notmetered
ltx/en_us_oca/me.m09.d26:meMA.Ode3C31.mode	@ltx/en_us_oca/miscellanea:misc.Mode6
ltx/en_us_oca/me.m09.d26:meMA.Ode3C31.ode	@ltx/en_us_oca/miscellanea:misc.Ode3
ltx/en_us_oca/me.m09.d26:meMA.Ode3C31.text	You spoke with the Word with a brilliant and pure mind, ⁄ triply-blessed Divine. ⁄ You learned from Him mysteries that were clearly beyond words, ⁄ and thus you enlightened the world.
ltx/en_us_oca/me.m09.d26:meMA.Ode3C32.incipit	Deliver me from the bonds…
ltx/en_us_oca/me.m09.d26:meMA.Ode3C32.melody	@ltx/en_us_oca/he.h.m6:heHE.OukEstinAgios.notmetered
ltx/en_us_oca/me.m09.d26:meMA.Ode3C32.mode	@ltx/en_us_oca/miscellanea:misc.Mode6
ltx/en_us_oca/me.m09.d26:meMA.Ode3C32.ode	@ltx/en_us_oca/miscellanea:misc.Ode3
ltx/en_us_oca/me.m09.d26:meMA.Ode3C32.text	Deliver me from the bonds of sin, thrice-blessed Saint, ⁄ and bind me with love for the Master and God, ⁄ Whom you fervently loved, and by Whom you are called divine!
ltx/en_us_oca/me.m09.d26:meMA.Ode3C33.incipit	You are given to us…
ltx/en_us_oca/me.m09.d26:meMA.Ode3C33.melody	@ltx/en_us_oca/he.h.m6:heHE.OukEstinAgios.notmetered
ltx/en_us_oca/me.m09.d26:meMA.Ode3C33.mode	@ltx/en_us_oca/miscellanea:misc.Mode6
ltx/en_us_oca/me.m09.d26:meMA.Ode3C33.ode	@ltx/en_us_oca/miscellanea:misc.Ode3
ltx/en_us_oca/me.m09.d26:meMA.Ode3C33.text	You are given to us as a champion, ⁄ an advocate, deliverer, and intercessor before the Lord, ⁄ a direct worker of wonders, and fountain of healing. ⁄ Therefore we honor you.
ltx/en_us_oca/me.m09.d26:meMA.Ode3C3T.incipit	When the Word, ineffably…
ltx/en_us_oca/me.m09.d26:meMA.Ode3C3T.melody	@ltx/en_us_oca/he.h.m6:heHE.OukEstinAgios.notmetered
ltx/en_us_oca/me.m09.d26:meMA.Ode3C3T.mode	@ltx/en_us_oca/miscellanea:misc.Mode6
ltx/en_us_oca/me.m09.d26:meMA.Ode3C3T.ode	@ltx/en_us_oca/miscellanea:misc.Ode3
ltx/en_us_oca/me.m09.d26:meMA.Ode3C3T.text	When the Word, ineffably made flesh of you, ⁄ was lifted up upon the wood of the Cross, Theotokos, ⁄ He entrusted you as a Virgin Mother to the virgin disciple.
ltx/en_us_oca/me.m09.d26:meMA.Ode3Kathisma1.greekmelody	@ltx/en_us_oca/he.a.m8:heAU.TinSofianKaiLogon.greekname
ltx/en_us_oca/me.m09.d26:meMA.Ode3Kathisma1.incipit	@ltx/en_us_oca/me.m05.d08:meMA.Ode3Kathisma1.incipit
ltx/en_us_oca/me.m09.d26:meMA.Ode3Kathisma1.melody	@ltx/en_us_oca/he.a.m8:heAU.TinSofianKaiLogon.notmetered
ltx/en_us_oca/me.m09.d26:meMA.Ode3Kathisma1.mode	@ltx/en_us_oca/miscellanea:misc.Mode8
ltx/en_us_oca/me.m09.d26:meMA.Ode3Kathisma1.text	@ltx/en_us_oca/me.m05.d08:meMA.Ode3Kathisma1.text
ltx/en_us_oca/me.m09.d26:meMA.Ode3KathismaT.incipit	As you, Lady, conceived…
ltx/en_us_oca/me.m09.d26:meMA.Ode3KathismaT.melody	@ltx/en_us_oca/he.a.m8:heAU.TinSofianKaiLogon.notmetered
ltx/en_us_oca/me.m09.d26:meMA.Ode3KathismaT.mode	@ltx/en_us_oca/miscellanea:misc.Mode8
ltx/en_us_oca/me.m09.d26:meMA.Ode3KathismaT.text	As you, Lady, conceived the merciful and compassionate Lord, ⁄ have mercy on all who seek refuge in you. ⁄ Free them from temptations and sickness and every tribulation, ⁄ delivering them from the eternal flame, ⁄ that we may glorify your abundant mercies and immeasurable compassion, ⁄ and cry aloud to you with thanksgiving at all times: ⁄ Intercede with Christ our God, that remission of sins ⁄⁄ may be granted to those who rightly praise your childbearing!
ltx/en_us_oca/me.m09.d26:meMA.Ode4C11.greekmelody	@ltx/en_us_oca/he.h.m2:heHE.ElilythasEkParthenou.greekname
ltx/en_us_oca/me.m09.d26:meMA.Ode4C11.incipit	@ltx/en_us_oca/me.m07.d27:meMA.Ode4C11.incipit
ltx/en_us_oca/me.m09.d26:meMA.Ode4C11.melody	@ltx/en_us_oca/he.h.m2:heHE.ElilythasEkParthenou.notmetered
ltx/en_us_oca/me.m09.d26:meMA.Ode4C11.mode	@ltx/en_us_oca/miscellanea:misc.Mode2
ltx/en_us_oca/me.m09.d26:meMA.Ode4C11.ode	@ltx/en_us_oca/miscellanea:misc.Ode4
ltx/en_us_oca/me.m09.d26:meMA.Ode4C11.text	@ltx/en_us_oca/me.m07.d27:meMA.Ode4C11.text
ltx/en_us_oca/me.m09.d26:meMA.Ode4C12.incipit	@ltx/en_us_oca/me.m07.d27:meMA.Ode4C12.incipit
ltx/en_us_oca/me.m09.d26:meMA.Ode4C12.melody	@ltx/en_us_oca/he.h.m2:heHE.ElilythasEkParthenou.notmetered
ltx/en_us_oca/me.m09.d26:meMA.Ode4C12.mode	@ltx/en_us_oca/miscellanea:misc.Mode2
ltx/en_us_oca/me.m09.d26:meMA.Ode4C12.ode	@ltx/en_us_oca/miscellanea:misc.Ode4
ltx/en_us_oca/me.m09.d26:meMA.Ode4C12.text	@ltx/en_us_oca/me.m07.d27:meMA.Ode4C12.text
ltx/en_us_oca/me.m09.d26:meMA.Ode4C13.incipit	@ltx/en_us_oca/me.m07.d27:meMA.Ode4C13.incipit
ltx/en_us_oca/me.m09.d26:meMA.Ode4C13.melody	@ltx/en_us_oca/he.h.m2:heHE.ElilythasEkParthenou.notmetered
ltx/en_us_oca/me.m09.d26:meMA.Ode4C13.mode	@ltx/en_us_oca/miscellanea:misc.Mode2
ltx/en_us_oca/me.m09.d26:meMA.Ode4C13.ode	@ltx/en_us_oca/miscellanea:misc.Ode4
ltx/en_us_oca/me.m09.d26:meMA.Ode4C13.text	@ltx/en_us_oca/me.m07.d27:meMA.Ode4C13.text
ltx/en_us_oca/me.m09.d26:meMA.Ode4C1H.greekmelody	@ltx/en_us_oca/he.h.m2:heHE.ElilythasEkParthenou.greekname
ltx/en_us_oca/me.m09.d26:meMA.Ode4C1H.incipit	@ltx/en_us_oca/he.h.m2:heHE.ElilythasEkParthenou.incipit
ltx/en_us_oca/me.m09.d26:meMA.Ode4C1H.melody	@ltx/en_us_oca/he.h.m2:heHE.ElilythasEkParthenou.melody
ltx/en_us_oca/me.m09.d26:meMA.Ode4C1H.mode	@ltx/en_us_oca/miscellanea:misc.Mode2
ltx/en_us_oca/me.m09.d26:meMA.Ode4C1H.ode	@ltx/en_us_oca/miscellanea:misc.Ode4
ltx/en_us_oca/me.m09.d26:meMA.Ode4C1H.text	@ltx/en_us_oca/he.h.m2:heHE.ElilythasEkParthenou.text
ltx/en_us_oca/me.m09.d26:meMA.Ode4C21.greekmelody	@ltx/en_us_oca/he.h.m2:heHE.ElilythasEkParthenou.greekname
ltx/en_us_oca/me.m09.d26:meMA.Ode4C21.incipit	The Word rightly manifested…
ltx/en_us_oca/me.m09.d26:meMA.Ode4C21.melody	@ltx/en_us_oca/he.h.m2:heHE.ElilythasEkParthenou.notmetered
ltx/en_us_oca/me.m09.d26:meMA.Ode4C21.mode	@ltx/en_us_oca/miscellanea:misc.Mode2
ltx/en_us_oca/me.m09.d26:meMA.Ode4C21.ode	@ltx/en_us_oca/miscellanea:misc.Ode4
ltx/en_us_oca/me.m09.d26:meMA.Ode4C21.text	The Word rightly manifested you as the Theologian, ⁄ initiating you into the mystery of divinity, ⁄ and teaching you the ineffable dispensation of humanity.
ltx/en_us_oca/me.m09.d26:meMA.Ode4C22.incipit	Acquiring a divine mind…
ltx/en_us_oca/me.m09.d26:meMA.Ode4C22.melody	@ltx/en_us_oca/he.h.m2:heHE.ElilythasEkParthenou.notmetered
ltx/en_us_oca/me.m09.d26:meMA.Ode4C22.mode	@ltx/en_us_oca/miscellanea:misc.Mode2
ltx/en_us_oca/me.m09.d26:meMA.Ode4C22.ode	@ltx/en_us_oca/miscellanea:misc.Ode4
ltx/en_us_oca/me.m09.d26:meMA.Ode4C22.text	Acquiring a divine mind and virgin body, ⁄ you were a living temple and dwelling of the all-praised and holy Trinity, ⁄ living and glorious Saint!
ltx/en_us_oca/me.m09.d26:meMA.Ode4C23.incipit	Blessed virgin John…
ltx/en_us_oca/me.m09.d26:meMA.Ode4C23.melody	@ltx/en_us_oca/he.h.m2:heHE.ElilythasEkParthenou.notmetered
ltx/en_us_oca/me.m09.d26:meMA.Ode4C23.mode	@ltx/en_us_oca/miscellanea:misc.Mode2
ltx/en_us_oca/me.m09.d26:meMA.Ode4C23.ode	@ltx/en_us_oca/miscellanea:misc.Ode4
ltx/en_us_oca/me.m09.d26:meMA.Ode4C23.text	Blessed virgin John, ⁄ you were honored by being made the Son of the most holy and pure Virgin, ⁄ thus showing yourself to be the brother of the One Who chose you, ⁄ making you a perfect disciple and divine Theologian.
ltx/en_us_oca/me.m09.d26:meMA.Ode4C2T.incipit	The supreme God…
ltx/en_us_oca/me.m09.d26:meMA.Ode4C2T.melody	@ltx/en_us_oca/he.h.m2:heHE.ElilythasEkParthenou.notmetered
ltx/en_us_oca/me.m09.d26:meMA.Ode4C2T.mode	@ltx/en_us_oca/miscellanea:misc.Mode2
ltx/en_us_oca/me.m09.d26:meMA.Ode4C2T.ode	@ltx/en_us_oca/miscellanea:misc.Ode4
ltx/en_us_oca/me.m09.d26:meMA.Ode4C2T.text	The supreme God went to dwell in you, spotless one, ⁄ healing the ancient transgression of Eve, ⁄ and fashioning me anew, who had completely fallen.
ltx/en_us_oca/me.m09.d26:meMA.Ode4C31.greekmelody	@ltx/en_us_oca/he.h.m6:heHE.ChristosMouDynamis.greekname
ltx/en_us_oca/me.m09.d26:meMA.Ode4C31.incipit	You watered all things…
ltx/en_us_oca/me.m09.d26:meMA.Ode4C31.melody	@ltx/en_us_oca/he.h.m6:heHE.ChristosMouDynamis.notmetered
ltx/en_us_oca/me.m09.d26:meMA.Ode4C31.mode	@ltx/en_us_oca/miscellanea:misc.Mode6
ltx/en_us_oca/me.m09.d26:meMA.Ode4C31.ode	@ltx/en_us_oca/miscellanea:misc.Ode4
ltx/en_us_oca/me.m09.d26:meMA.Ode4C31.text	You watered all things beneath the sun, glorious Saint, ⁄ drying up the muddy waters of ungodliness. ⁄ Therefore we honor you!
ltx/en_us_oca/me.m09.d26:meMA.Ode4C32.incipit	Gird my soul…
ltx/en_us_oca/me.m09.d26:meMA.Ode4C32.melody	@ltx/en_us_oca/he.h.m6:heHE.ChristosMouDynamis.notmetered
ltx/en_us_oca/me.m09.d26:meMA.Ode4C32.mode	@ltx/en_us_oca/miscellanea:misc.Mode6
ltx/en_us_oca/me.m09.d26:meMA.Ode4C32.ode	@ltx/en_us_oca/miscellanea:misc.Ode4
ltx/en_us_oca/me.m09.d26:meMA.Ode4C32.text	Gird my soul with strength and power, ⁄ I entreat you, most wise one, ⁄ for I am weakened by many afflictions from unclean enemies, ⁄ and I hasten to you for protection.
ltx/en_us_oca/me.m09.d26:meMA.Ode4C33.incipit	As you were a temple…
ltx/en_us_oca/me.m09.d26:meMA.Ode4C33.melody	@ltx/en_us_oca/he.h.m6:heHE.ChristosMouDynamis.notmetered
ltx/en_us_oca/me.m09.d26:meMA.Ode4C33.mode	@ltx/en_us_oca/miscellanea:misc.Mode6
ltx/en_us_oca/me.m09.d26:meMA.Ode4C33.ode	@ltx/en_us_oca/miscellanea:misc.Ode4
ltx/en_us_oca/me.m09.d26:meMA.Ode4C33.text	As you were a temple of the Holy Spirit, Theologian, ⁄ by your mediation, ⁄ manifest those who ever pray with faith in your divine Church ⁄ to be temples of God indeed.
ltx/en_us_oca/me.m09.d26:meMA.Ode4C3T.incipit	Let us sing the praises…
ltx/en_us_oca/me.m09.d26:meMA.Ode4C3T.melody	@ltx/en_us_oca/he.h.m6:heHE.ChristosMouDynamis.notmetered
ltx/en_us_oca/me.m09.d26:meMA.Ode4C3T.mode	@ltx/en_us_oca/miscellanea:misc.Mode6
ltx/en_us_oca/me.m09.d26:meMA.Ode4C3T.ode	@ltx/en_us_oca/miscellanea:misc.Ode4
ltx/en_us_oca/me.m09.d26:meMA.Ode4C3T.text	Let us sing the praises of the divine temple of God, the holy Virgin, ⁄ and through her, let us all become divine, ⁄ wholly delivered from tribulation.
ltx/en_us_oca/me.m09.d26:meMA.Ode5C11.greekmelody	@ltx/en_us_oca/he.h.m2:heHE.MesitisTheou.greekname
ltx/en_us_oca/me.m09.d26:meMA.Ode5C11.incipit	@ltx/en_us_oca/me.m07.d27:meMA.Ode5C11.incipit
ltx/en_us_oca/me.m09.d26:meMA.Ode5C11.melody	@ltx/en_us_oca/he.h.m2:heHE.MesitisTheou.notmetered
ltx/en_us_oca/me.m09.d26:meMA.Ode5C11.mode	@ltx/en_us_oca/miscellanea:misc.Mode2
ltx/en_us_oca/me.m09.d26:meMA.Ode5C11.ode	@ltx/en_us_oca/miscellanea:misc.Ode5
ltx/en_us_oca/me.m09.d26:meMA.Ode5C11.text	@ltx/en_us_oca/me.m07.d27:meMA.Ode5C11.text
ltx/en_us_oca/me.m09.d26:meMA.Ode5C12.incipit	@ltx/en_us_oca/me.m07.d27:meMA.Ode5C12.incipit
ltx/en_us_oca/me.m09.d26:meMA.Ode5C12.melody	@ltx/en_us_oca/he.h.m2:heHE.MesitisTheou.notmetered
ltx/en_us_oca/me.m09.d26:meMA.Ode5C12.mode	@ltx/en_us_oca/miscellanea:misc.Mode2
ltx/en_us_oca/me.m09.d26:meMA.Ode5C12.ode	@ltx/en_us_oca/miscellanea:misc.Ode5
ltx/en_us_oca/me.m09.d26:meMA.Ode5C12.text	@ltx/en_us_oca/me.m07.d27:meMA.Ode5C12.text
ltx/en_us_oca/me.m09.d26:meMA.Ode5C13.incipit	@ltx/en_us_oca/me.m07.d27:meMA.Ode5C13.incipit
ltx/en_us_oca/me.m09.d26:meMA.Ode5C13.melody	@ltx/en_us_oca/he.h.m2:heHE.MesitisTheou.notmetered
ltx/en_us_oca/me.m09.d26:meMA.Ode5C13.mode	@ltx/en_us_oca/miscellanea:misc.Mode2
ltx/en_us_oca/me.m09.d26:meMA.Ode5C13.ode	@ltx/en_us_oca/miscellanea:misc.Ode5
ltx/en_us_oca/me.m09.d26:meMA.Ode5C13.text	@ltx/en_us_oca/me.m07.d27:meMA.Ode5C13.text
ltx/en_us_oca/me.m09.d26:meMA.Ode5C1H.greekmelody	@ltx/en_us_oca/he.h.m2:heHE.MesitisTheou.greekname
ltx/en_us_oca/me.m09.d26:meMA.Ode5C1H.incipit	@ltx/en_us_oca/he.h.m2:heHE.MesitisTheou.incipit
ltx/en_us_oca/me.m09.d26:meMA.Ode5C1H.melody	@ltx/en_us_oca/he.h.m2:heHE.MesitisTheou.melody
ltx/en_us_oca/me.m09.d26:meMA.Ode5C1H.mode	@ltx/en_us_oca/miscellanea:misc.Mode2
ltx/en_us_oca/me.m09.d26:meMA.Ode5C1H.ode	@ltx/en_us_oca/miscellanea:misc.Ode5
ltx/en_us_oca/me.m09.d26:meMA.Ode5C1H.text	@ltx/en_us_oca/he.h.m2:heHE.MesitisTheou.text
ltx/en_us_oca/me.m09.d26:meMA.Ode5C21.greekmelody	@ltx/en_us_oca/he.h.m2:heHE.MesitisTheou.greekname
ltx/en_us_oca/me.m09.d26:meMA.Ode5C21.incipit	You were revealed…
ltx/en_us_oca/me.m09.d26:meMA.Ode5C21.melody	@ltx/en_us_oca/he.h.m2:heHE.MesitisTheou.notmetered
ltx/en_us_oca/me.m09.d26:meMA.Ode5C21.mode	@ltx/en_us_oca/miscellanea:misc.Mode2
ltx/en_us_oca/me.m09.d26:meMA.Ode5C21.ode	@ltx/en_us_oca/miscellanea:misc.Ode5
ltx/en_us_oca/me.m09.d26:meMA.Ode5C21.text	You were revealed as a heavenly intellect, Theologian, ⁄ made pure light by grace, ⁄ and divine by your closeness to the Source ⁄ and your eager leaning towards Him.
ltx/en_us_oca/me.m09.d26:meMA.Ode5C22.incipit	Your mind was cleansed…
ltx/en_us_oca/me.m09.d26:meMA.Ode5C22.melody	@ltx/en_us_oca/he.h.m2:heHE.MesitisTheou.notmetered
ltx/en_us_oca/me.m09.d26:meMA.Ode5C22.mode	@ltx/en_us_oca/miscellanea:misc.Mode2
ltx/en_us_oca/me.m09.d26:meMA.Ode5C22.ode	@ltx/en_us_oca/miscellanea:misc.Ode5
ltx/en_us_oca/me.m09.d26:meMA.Ode5C22.text	Your mind was cleansed, your lips sanctified, and your mouth made pure ⁄ when you preached your Gospel, inspired one of God. ⁄ You proclaimed universal salvation to all the faithful.
ltx/en_us_oca/me.m09.d26:meMA.Ode5C23.incipit	You lived with Christ…
ltx/en_us_oca/me.m09.d26:meMA.Ode5C23.melody	@ltx/en_us_oca/he.h.m2:heHE.MesitisTheou.notmetered
ltx/en_us_oca/me.m09.d26:meMA.Ode5C23.mode	@ltx/en_us_oca/miscellanea:misc.Mode2
ltx/en_us_oca/me.m09.d26:meMA.Ode5C23.ode	@ltx/en_us_oca/miscellanea:misc.Ode5
ltx/en_us_oca/me.m09.d26:meMA.Ode5C23.text	You lived with Christ from your youth, ⁄ and were chosen and sent by Him as an instrument of grace, ⁄ well-practiced in theology, ⁄ and initiated beyond nature into the glory of the Trinity!
ltx/en_us_oca/me.m09.d26:meMA.Ode5C2T.incipit	We now call you blessed…
ltx/en_us_oca/me.m09.d26:meMA.Ode5C2T.melody	@ltx/en_us_oca/he.h.m2:heHE.MesitisTheou.notmetered
ltx/en_us_oca/me.m09.d26:meMA.Ode5C2T.mode	@ltx/en_us_oca/miscellanea:misc.Mode2
ltx/en_us_oca/me.m09.d26:meMA.Ode5C2T.ode	@ltx/en_us_oca/miscellanea:misc.Ode5
ltx/en_us_oca/me.m09.d26:meMA.Ode5C2T.text	We now call you blessed, all-pure one, ⁄ in remembrance of your words, ⁄ for through you, we have been made rich in all truth, ⁄ ineffable bliss, and eternal life.
ltx/en_us_oca/me.m09.d26:meMA.Ode5C31.greekmelody	@ltx/en_us_oca/he.h.m6:heHE.ToTheioFengeiSou.greekname
ltx/en_us_oca/me.m09.d26:meMA.Ode5C31.incipit	You shone as the morning…
ltx/en_us_oca/me.m09.d26:meMA.Ode5C31.melody	@ltx/en_us_oca/he.h.m6:heHE.ToTheioFengeiSou.notmetered
ltx/en_us_oca/me.m09.d26:meMA.Ode5C31.mode	@ltx/en_us_oca/miscellanea:misc.Mode6
ltx/en_us_oca/me.m09.d26:meMA.Ode5C31.ode	@ltx/en_us_oca/miscellanea:misc.Ode5
ltx/en_us_oca/me.m09.d26:meMA.Ode5C31.text	You shone as the morning upon those who dwell on earth, ⁄ proclaiming the Orient from on High, Apostle, ⁄ Who came into the world in the flesh ⁄ destroying the darkness of idolatry.
ltx/en_us_oca/me.m09.d26:meMA.Ode5C32.incipit	By your holy teaching…
ltx/en_us_oca/me.m09.d26:meMA.Ode5C32.melody	@ltx/en_us_oca/he.h.m6:heHE.ToTheioFengeiSou.notmetered
ltx/en_us_oca/me.m09.d26:meMA.Ode5C32.mode	@ltx/en_us_oca/miscellanea:misc.Mode6
ltx/en_us_oca/me.m09.d26:meMA.Ode5C32.ode	@ltx/en_us_oca/miscellanea:misc.Ode5
ltx/en_us_oca/me.m09.d26:meMA.Ode5C32.text	By your holy teaching of God, Apostle, ⁄ you poured waters on every soul, divine herald. ⁄ Therefore I cry out to you: ⁄ Soften with these waters my heart which is dry and hard from sin.
ltx/en_us_oca/me.m09.d26:meMA.Ode5C33.incipit	I have been wounded…
ltx/en_us_oca/me.m09.d26:meMA.Ode5C33.melody	@ltx/en_us_oca/he.h.m6:heHE.ToTheioFengeiSou.notmetered
ltx/en_us_oca/me.m09.d26:meMA.Ode5C33.mode	@ltx/en_us_oca/miscellanea:misc.Mode6
ltx/en_us_oca/me.m09.d26:meMA.Ode5C33.ode	@ltx/en_us_oca/miscellanea:misc.Ode5
ltx/en_us_oca/me.m09.d26:meMA.Ode5C33.text	I have been wounded by the enemy’s darts. ⁄ By your care, O wise Apostle, make me well, I pray, ⁄ and direct me to the ways of God, ⁄ for I am ever led astray through places with no roads.
ltx/en_us_oca/me.m09.d26:meMA.Ode5C3T.incipit	As you stood…
ltx/en_us_oca/me.m09.d26:meMA.Ode5C3T.melody	@ltx/en_us_oca/he.h.m6:heHE.ToTheioFengeiSou.notmetered
ltx/en_us_oca/me.m09.d26:meMA.Ode5C3T.mode	@ltx/en_us_oca/miscellanea:misc.Mode6
ltx/en_us_oca/me.m09.d26:meMA.Ode5C3T.ode	@ltx/en_us_oca/miscellanea:misc.Ode5
ltx/en_us_oca/me.m09.d26:meMA.Ode5C3T.text	As you stood with the beloved disciple by the Cross of your Son, ⁄ you wept and lamented, immaculate one, ⁄ amazed at His great compassion towards mankind.
ltx/en_us_oca/me.m09.d26:meMA.Ode6C11.greekmelody	@ltx/en_us_oca/he.h.m2:heHE.EnAvyssoPtaismaton.greekname
ltx/en_us_oca/me.m09.d26:meMA.Ode6C11.incipit	@ltx/en_us_oca/me.m07.d27:meMA.Ode6C11.incipit
ltx/en_us_oca/me.m09.d26:meMA.Ode6C11.melody	@ltx/en_us_oca/he.h.m2:heHE.EnAvyssoPtaismaton.notmetered
ltx/en_us_oca/me.m09.d26:meMA.Ode6C11.mode	@ltx/en_us_oca/miscellanea:misc.Mode2
ltx/en_us_oca/me.m09.d26:meMA.Ode6C11.ode	@ltx/en_us_oca/miscellanea:misc.Ode6
ltx/en_us_oca/me.m09.d26:meMA.Ode6C11.text	@ltx/en_us_oca/me.m07.d27:meMA.Ode6C11.text
ltx/en_us_oca/me.m09.d26:meMA.Ode6C12.incipit	@ltx/en_us_oca/me.m07.d27:meMA.Ode6C12.incipit
ltx/en_us_oca/me.m09.d26:meMA.Ode6C12.melody	@ltx/en_us_oca/he.h.m2:heHE.EnAvyssoPtaismaton.notmetered
ltx/en_us_oca/me.m09.d26:meMA.Ode6C12.mode	@ltx/en_us_oca/miscellanea:misc.Mode2
ltx/en_us_oca/me.m09.d26:meMA.Ode6C12.ode	@ltx/en_us_oca/miscellanea:misc.Ode6
ltx/en_us_oca/me.m09.d26:meMA.Ode6C12.text	@ltx/en_us_oca/me.m07.d27:meMA.Ode6C12.text
ltx/en_us_oca/me.m09.d26:meMA.Ode6C13.incipit	@ltx/en_us_oca/me.m07.d27:meMA.Ode6C13.incipit
ltx/en_us_oca/me.m09.d26:meMA.Ode6C13.melody	@ltx/en_us_oca/he.h.m2:heHE.EnAvyssoPtaismaton.notmetered
ltx/en_us_oca/me.m09.d26:meMA.Ode6C13.mode	@ltx/en_us_oca/miscellanea:misc.Mode2
ltx/en_us_oca/me.m09.d26:meMA.Ode6C13.ode	@ltx/en_us_oca/miscellanea:misc.Ode6
ltx/en_us_oca/me.m09.d26:meMA.Ode6C13.text	@ltx/en_us_oca/me.m07.d27:meMA.Ode6C13.text
ltx/en_us_oca/me.m09.d26:meMA.Ode6C1H.greekmelody	@ltx/en_us_oca/he.h.m2:heHE.EnAvyssoPtaismaton.greekname
ltx/en_us_oca/me.m09.d26:meMA.Ode6C1H.incipit	@ltx/en_us_oca/he.h.m2:heHE.EnAvyssoPtaismaton.incipit
ltx/en_us_oca/me.m09.d26:meMA.Ode6C1H.melody	@ltx/en_us_oca/he.h.m2:heHE.EnAvyssoPtaismaton.melody
ltx/en_us_oca/me.m09.d26:meMA.Ode6C1H.mode	@ltx/en_us_oca/miscellanea:misc.Mode2
ltx/en_us_oca/me.m09.d26:meMA.Ode6C1H.ode	@ltx/en_us_oca/miscellanea:misc.Ode6
ltx/en_us_oca/me.m09.d26:meMA.Ode6C1H.text	@ltx/en_us_oca/he.h.m2:heHE.EnAvyssoPtaismaton.text
ltx/en_us_oca/me.m09.d26:meMA.Ode6C21.greekmelody	@ltx/en_us_oca/he.h.m2:heHE.EnAvyssoPtaismaton.greekname
ltx/en_us_oca/me.m09.d26:meMA.Ode6C21.incipit	Jesus, my God…
ltx/en_us_oca/me.m09.d26:meMA.Ode6C21.melody	@ltx/en_us_oca/he.h.m2:heHE.EnAvyssoPtaismaton.notmetered
ltx/en_us_oca/me.m09.d26:meMA.Ode6C21.mode	@ltx/en_us_oca/miscellanea:misc.Mode2
ltx/en_us_oca/me.m09.d26:meMA.Ode6C21.ode	@ltx/en_us_oca/miscellanea:misc.Ode6
ltx/en_us_oca/me.m09.d26:meMA.Ode6C21.text	Jesus, my God and Lord, ⁄ accepted your purity and perfect chastity. ⁄ He took you as His brother, Theologian.
ltx/en_us_oca/me.m09.d26:meMA.Ode6C22.incipit	You crowned your life…
ltx/en_us_oca/me.m09.d26:meMA.Ode6C22.melody	@ltx/en_us_oca/he.h.m2:heHE.EnAvyssoPtaismaton.notmetered
ltx/en_us_oca/me.m09.d26:meMA.Ode6C22.mode	@ltx/en_us_oca/miscellanea:misc.Mode2
ltx/en_us_oca/me.m09.d26:meMA.Ode6C22.ode	@ltx/en_us_oca/miscellanea:misc.Ode6
ltx/en_us_oca/me.m09.d26:meMA.Ode6C22.text	You crowned your life with holiness. ⁄ You put your trust in that, and leaned upon the breast of Wisdom: ⁄ From there you drew forth grace, most glorious Saint!
ltx/en_us_oca/me.m09.d26:meMA.Ode6C23.incipit	The great and divine fire…
ltx/en_us_oca/me.m09.d26:meMA.Ode6C23.melody	@ltx/en_us_oca/he.h.m2:heHE.EnAvyssoPtaismaton.notmetered
ltx/en_us_oca/me.m09.d26:meMA.Ode6C23.mode	@ltx/en_us_oca/miscellanea:misc.Mode2
ltx/en_us_oca/me.m09.d26:meMA.Ode6C23.ode	@ltx/en_us_oca/miscellanea:misc.Ode6
ltx/en_us_oca/me.m09.d26:meMA.Ode6C23.text	The great and divine fire of your theology ⁄ enlightened the whole universe ⁄ shining with the radiance of the triune Sun, glorious Saint!
ltx/en_us_oca/me.m09.d26:meMA.Ode6C2T.incipit	He Who spread out…
ltx/en_us_oca/me.m09.d26:meMA.Ode6C2T.melody	@ltx/en_us_oca/he.h.m2:heHE.EnAvyssoPtaismaton.notmetered
ltx/en_us_oca/me.m09.d26:meMA.Ode6C2T.mode	@ltx/en_us_oca/miscellanea:misc.Mode2
ltx/en_us_oca/me.m09.d26:meMA.Ode6C2T.ode	@ltx/en_us_oca/miscellanea:misc.Ode6
ltx/en_us_oca/me.m09.d26:meMA.Ode6C2T.text	He Who spread out the heavens by His will, ⁄ made you, who came from this earth ⁄ another, more spacious heaven. ⁄ He appeared as a Sun arising from you!
ltx/en_us_oca/me.m09.d26:meMA.Ode6C31.greekmelody	@ltx/en_us_oca/he.h.m6:heHE.TouViouTinThalassan.greekname
ltx/en_us_oca/me.m09.d26:meMA.Ode6C31.incipit	As your tongue spoke…
ltx/en_us_oca/me.m09.d26:meMA.Ode6C31.melody	@ltx/en_us_oca/he.h.m6:heHE.TouViouTinThalassan.notmetered
ltx/en_us_oca/me.m09.d26:meMA.Ode6C31.mode	@ltx/en_us_oca/miscellanea:misc.Mode6
ltx/en_us_oca/me.m09.d26:meMA.Ode6C31.ode	@ltx/en_us_oca/miscellanea:misc.Ode6
ltx/en_us_oca/me.m09.d26:meMA.Ode6C31.text	As your tongue spoke of God ⁄ it was indeed the pen of a ready writer, ⁄ inscribing true knowledge and a new commandment ⁄ on the tablets of our hearts, divine one.
ltx/en_us_oca/me.m09.d26:meMA.Ode6C32.incipit	You caused the plants…
ltx/en_us_oca/me.m09.d26:meMA.Ode6C32.melody	@ltx/en_us_oca/he.h.m6:heHE.TouViouTinThalassan.notmetered
ltx/en_us_oca/me.m09.d26:meMA.Ode6C32.mode	@ltx/en_us_oca/miscellanea:misc.Mode6
ltx/en_us_oca/me.m09.d26:meMA.Ode6C32.ode	@ltx/en_us_oca/miscellanea:misc.Ode6
ltx/en_us_oca/me.m09.d26:meMA.Ode6C32.text	You caused the plants of ungodliness ⁄ to wither at the roots! ⁄ Then, as the best of husbandmen, ⁄ you grafted the fear of God within my soul ⁄ making the good fruits of virtue spring up there again, glorious Saint.
ltx/en_us_oca/me.m09.d26:meMA.Ode6C33.incipit	The One Who came forth…
ltx/en_us_oca/me.m09.d26:meMA.Ode6C33.melody	@ltx/en_us_oca/he.h.m6:heHE.TouViouTinThalassan.notmetered
ltx/en_us_oca/me.m09.d26:meMA.Ode6C33.mode	@ltx/en_us_oca/miscellanea:misc.Mode6
ltx/en_us_oca/me.m09.d26:meMA.Ode6C33.ode	@ltx/en_us_oca/miscellanea:misc.Ode6
ltx/en_us_oca/me.m09.d26:meMA.Ode6C33.text	The One Who came forth from the Virgin ⁄ plainly called you her Son. ⁄ Together with her, intercede for all who act in righteousness, ⁄ that being well pleasing to Him ⁄ they may be established as sons of God, O Saint of great renown.
ltx/en_us_oca/me.m09.d26:meMA.Ode6C3T.incipit	God was made manifest…
ltx/en_us_oca/me.m09.d26:meMA.Ode6C3T.melody	@ltx/en_us_oca/he.h.m6:heHE.TouViouTinThalassan.notmetered
ltx/en_us_oca/me.m09.d26:meMA.Ode6C3T.mode	@ltx/en_us_oca/miscellanea:misc.Mode6
ltx/en_us_oca/me.m09.d26:meMA.Ode6C3T.ode	@ltx/en_us_oca/miscellanea:misc.Ode6
ltx/en_us_oca/me.m09.d26:meMA.Ode6C3T.text	God was made manifest to mortals ⁄ in the likeness of the flesh He took from you, spotless one. ⁄ Entreat Him at all times, all-holy Virgin, ⁄ to put to death the destructive thoughts of our flesh.
ltx/en_us_oca/me.m09.d26:meMA.Ode7C11.greekmelody	@ltx/en_us_oca/he.h.m2:heHE.AntitheonProstagma.greekname
ltx/en_us_oca/me.m09.d26:meMA.Ode7C11.incipit	@ltx/en_us_oca/me.m07.d27:meMA.Ode7C11.incipit
ltx/en_us_oca/me.m09.d26:meMA.Ode7C11.melody	@ltx/en_us_oca/he.h.m2:heHE.AntitheonProstagma.notmetered
ltx/en_us_oca/me.m09.d26:meMA.Ode7C11.mode	@ltx/en_us_oca/miscellanea:misc.Mode2
ltx/en_us_oca/me.m09.d26:meMA.Ode7C11.ode	@ltx/en_us_oca/miscellanea:misc.Ode7
ltx/en_us_oca/me.m09.d26:meMA.Ode7C11.text	@ltx/en_us_oca/me.m07.d27:meMA.Ode7C11.text
ltx/en_us_oca/me.m09.d26:meMA.Ode7C12.incipit	@ltx/en_us_oca/me.m07.d27:meMA.Ode7C12.incipit
ltx/en_us_oca/me.m09.d26:meMA.Ode7C12.melody	@ltx/en_us_oca/he.h.m2:heHE.AntitheonProstagma.notmetered
ltx/en_us_oca/me.m09.d26:meMA.Ode7C12.mode	@ltx/en_us_oca/miscellanea:misc.Mode2
ltx/en_us_oca/me.m09.d26:meMA.Ode7C12.ode	@ltx/en_us_oca/miscellanea:misc.Ode7
ltx/en_us_oca/me.m09.d26:meMA.Ode7C12.text	@ltx/en_us_oca/me.m07.d27:meMA.Ode7C12.text
ltx/en_us_oca/me.m09.d26:meMA.Ode7C13.incipit	@ltx/en_us_oca/me.m07.d27:meMA.Ode7C13.incipit
ltx/en_us_oca/me.m09.d26:meMA.Ode7C13.melody	@ltx/en_us_oca/he.h.m2:heHE.AntitheonProstagma.notmetered
ltx/en_us_oca/me.m09.d26:meMA.Ode7C13.mode	@ltx/en_us_oca/miscellanea:misc.Mode2
ltx/en_us_oca/me.m09.d26:meMA.Ode7C13.ode	@ltx/en_us_oca/miscellanea:misc.Ode7
ltx/en_us_oca/me.m09.d26:meMA.Ode7C13.text	@ltx/en_us_oca/me.m07.d27:meMA.Ode7C13.text
ltx/en_us_oca/me.m09.d26:meMA.Ode7C1H.greekmelody	@ltx/en_us_oca/he.h.m2:heHE.AntitheonProstagma.greekname
ltx/en_us_oca/me.m09.d26:meMA.Ode7C1H.incipit	@ltx/en_us_oca/he.h.m2:heHE.AntitheonProstagma.incipit
ltx/en_us_oca/me.m09.d26:meMA.Ode7C1H.melody	@ltx/en_us_oca/he.h.m2:heHE.AntitheonProstagma.melody
ltx/en_us_oca/me.m09.d26:meMA.Ode7C1H.mode	@ltx/en_us_oca/miscellanea:misc.Mode2
ltx/en_us_oca/me.m09.d26:meMA.Ode7C1H.ode	@ltx/en_us_oca/miscellanea:misc.Ode7
ltx/en_us_oca/me.m09.d26:meMA.Ode7C1H.text	@ltx/en_us_oca/he.h.m2:heHE.AntitheonProstagma.text
ltx/en_us_oca/me.m09.d26:meMA.Ode7C21.greekmelody	@ltx/en_us_oca/he.h.m2:heHE.AntitheonProstagma.greekname
ltx/en_us_oca/me.m09.d26:meMA.Ode7C21.incipit	Radiant with a divine…
ltx/en_us_oca/me.m09.d26:meMA.Ode7C21.melody	@ltx/en_us_oca/he.h.m2:heHE.AntitheonProstagma.notmetered
ltx/en_us_oca/me.m09.d26:meMA.Ode7C21.mode	@ltx/en_us_oca/miscellanea:misc.Mode2
ltx/en_us_oca/me.m09.d26:meMA.Ode7C21.ode	@ltx/en_us_oca/miscellanea:misc.Ode7
ltx/en_us_oca/me.m09.d26:meMA.Ode7C21.text	Radiant with a divine outpouring of light, ⁄ you confessed clearly the Holy Spirit ⁄ proceeding from the unoriginate Father, ⁄ and abiding inseparably with the Son ⁄ united in one essence.
ltx/en_us_oca/me.m09.d26:meMA.Ode7C22.incipit	The Sun of Righteousness…
ltx/en_us_oca/me.m09.d26:meMA.Ode7C22.melody	@ltx/en_us_oca/he.h.m2:heHE.AntitheonProstagma.notmetered
ltx/en_us_oca/me.m09.d26:meMA.Ode7C22.mode	@ltx/en_us_oca/miscellanea:misc.Mode2
ltx/en_us_oca/me.m09.d26:meMA.Ode7C22.ode	@ltx/en_us_oca/miscellanea:misc.Ode7
ltx/en_us_oca/me.m09.d26:meMA.Ode7C22.text	The Sun of Righteousness has set His dwelling in you, blessed saint, ⁄ making you a vibrant heaven, ⁄ proclaiming Christ with a divinely teaching voice, ⁄ blessed and all-glorious Saint.
ltx/en_us_oca/me.m09.d26:meMA.Ode7C23.incipit	All-blessed and glorious Saint…
ltx/en_us_oca/me.m09.d26:meMA.Ode7C23.melody	@ltx/en_us_oca/he.h.m2:heHE.AntitheonProstagma.notmetered
ltx/en_us_oca/me.m09.d26:meMA.Ode7C23.mode	@ltx/en_us_oca/miscellanea:misc.Mode2
ltx/en_us_oca/me.m09.d26:meMA.Ode7C23.ode	@ltx/en_us_oca/miscellanea:misc.Ode7
ltx/en_us_oca/me.m09.d26:meMA.Ode7C23.text	All-blessed and glorious Saint, ⁄ power and divine music come from your speech, ⁄ and your Gospel, which goes beyond this world, ⁄ has encompassed the universe by the greatness of its teaching!
ltx/en_us_oca/me.m09.d26:meMA.Ode7C2T.incipit	You alone revealed…
ltx/en_us_oca/me.m09.d26:meMA.Ode7C2T.melody	@ltx/en_us_oca/he.h.m2:heHE.AntitheonProstagma.notmetered
ltx/en_us_oca/me.m09.d26:meMA.Ode7C2T.mode	@ltx/en_us_oca/miscellanea:misc.Mode2
ltx/en_us_oca/me.m09.d26:meMA.Ode7C2T.ode	@ltx/en_us_oca/miscellanea:misc.Ode7
ltx/en_us_oca/me.m09.d26:meMA.Ode7C2T.text	You alone revealed an undefiled conception, ⁄ and a childbirth without corruption, Virgin. ⁄ For you, pure one, brought forth Him Who is above all things, ⁄ and Who became man for the salvation and redemption of His people.
ltx/en_us_oca/me.m09.d26:meMA.Ode7C31.greekmelody	@ltx/en_us_oca/he.h.m6:heHE.DrosovolonMenTinKaminon.greekname
ltx/en_us_oca/me.m09.d26:meMA.Ode7C31.incipit	Let us sing thundering praises…
ltx/en_us_oca/me.m09.d26:meMA.Ode7C31.melody	@ltx/en_us_oca/he.h.m6:heHE.DrosovolonMenTinKaminon.notmetered
ltx/en_us_oca/me.m09.d26:meMA.Ode7C31.mode	@ltx/en_us_oca/miscellanea:misc.Mode6
ltx/en_us_oca/me.m09.d26:meMA.Ode7C31.ode	@ltx/en_us_oca/miscellanea:misc.Ode7
ltx/en_us_oca/me.m09.d26:meMA.Ode7C31.text	Let us sing thundering praises of the Theologian, ⁄ resounding to the ends of the earth! ⁄ All that we hear from him amazes us ⁄ and lifts us from earthly things, ⁄ magnifying Christ, the Maker of all.
ltx/en_us_oca/me.m09.d26:meMA.Ode7C32.incipit	The greatness of your temple…
ltx/en_us_oca/me.m09.d26:meMA.Ode7C32.melody	@ltx/en_us_oca/he.h.m6:heHE.DrosovolonMenTinKaminon.notmetered
ltx/en_us_oca/me.m09.d26:meMA.Ode7C32.mode	@ltx/en_us_oca/miscellanea:misc.Mode6
ltx/en_us_oca/me.m09.d26:meMA.Ode7C32.ode	@ltx/en_us_oca/miscellanea:misc.Ode7
ltx/en_us_oca/me.m09.d26:meMA.Ode7C32.text	The greatness of your temple illumines every thought, ⁄ and is admired by all who see it. ⁄ As we gather there, we ever sing praises of the Maker of all, ⁄ and we praise you faithfully as our advocate!
ltx/en_us_oca/me.m09.d26:meMA.Ode7C33.incipit	We know you…
ltx/en_us_oca/me.m09.d26:meMA.Ode7C33.melody	@ltx/en_us_oca/he.h.m6:heHE.DrosovolonMenTinKaminon.notmetered
ltx/en_us_oca/me.m09.d26:meMA.Ode7C33.mode	@ltx/en_us_oca/miscellanea:misc.Mode6
ltx/en_us_oca/me.m09.d26:meMA.Ode7C33.ode	@ltx/en_us_oca/miscellanea:misc.Ode7
ltx/en_us_oca/me.m09.d26:meMA.Ode7C33.text	We know you as a brightly shining star, ⁄ and we pray, disciple of Christ, ⁄ to be illumined by your shining radiance. ⁄ Deliver us by your intercession from the darkness of passions and tribulations.
ltx/en_us_oca/me.m09.d26:meMA.Ode7C3T.incipit	We bless you…
ltx/en_us_oca/me.m09.d26:meMA.Ode7C3T.melody	@ltx/en_us_oca/he.h.m6:heHE.DrosovolonMenTinKaminon.notmetered
ltx/en_us_oca/me.m09.d26:meMA.Ode7C3T.mode	@ltx/en_us_oca/miscellanea:misc.Mode6
ltx/en_us_oca/me.m09.d26:meMA.Ode7C3T.ode	@ltx/en_us_oca/miscellanea:misc.Ode7
ltx/en_us_oca/me.m09.d26:meMA.Ode7C3T.text	We bless you, spotless one, ⁄ for you conceived the blessed Lord ⁄ Who crowned wretched mortal nature with divine blessings, ⁄ and renewed us, who had aged in corruption!
ltx/en_us_oca/me.m09.d26:meMA.Ode8C11.greekmelody	@ltx/en_us_oca/he.h.m2:heHE.KaminosPote.greekname
ltx/en_us_oca/me.m09.d26:meMA.Ode8C11.incipit	@ltx/en_us_oca/me.m07.d27:meMA.Ode8C11.incipit
ltx/en_us_oca/me.m09.d26:meMA.Ode8C11.melody	@ltx/en_us_oca/he.h.m2:heHE.KaminosPote.notmetered
ltx/en_us_oca/me.m09.d26:meMA.Ode8C11.mode	@ltx/en_us_oca/miscellanea:misc.Mode2
ltx/en_us_oca/me.m09.d26:meMA.Ode8C11.ode	@ltx/en_us_oca/miscellanea:misc.Ode8
ltx/en_us_oca/me.m09.d26:meMA.Ode8C11.text	@ltx/en_us_oca/me.m07.d27:meMA.Ode8C11.text
ltx/en_us_oca/me.m09.d26:meMA.Ode8C12.incipit	@ltx/en_us_oca/me.m07.d27:meMA.Ode8C12.incipit
ltx/en_us_oca/me.m09.d26:meMA.Ode8C12.melody	@ltx/en_us_oca/he.h.m2:heHE.KaminosPote.notmetered
ltx/en_us_oca/me.m09.d26:meMA.Ode8C12.mode	@ltx/en_us_oca/miscellanea:misc.Mode2
ltx/en_us_oca/me.m09.d26:meMA.Ode8C12.ode	@ltx/en_us_oca/miscellanea:misc.Ode8
ltx/en_us_oca/me.m09.d26:meMA.Ode8C12.text	@ltx/en_us_oca/me.m07.d27:meMA.Ode8C12.text
ltx/en_us_oca/me.m09.d26:meMA.Ode8C13.incipit	@ltx/en_us_oca/me.m07.d27:meMA.Ode8C13.incipit
ltx/en_us_oca/me.m09.d26:meMA.Ode8C13.melody	@ltx/en_us_oca/he.h.m2:heHE.KaminosPote.notmetered
ltx/en_us_oca/me.m09.d26:meMA.Ode8C13.mode	@ltx/en_us_oca/miscellanea:misc.Mode2
ltx/en_us_oca/me.m09.d26:meMA.Ode8C13.ode	@ltx/en_us_oca/miscellanea:misc.Ode8
ltx/en_us_oca/me.m09.d26:meMA.Ode8C13.text	@ltx/en_us_oca/me.m07.d27:meMA.Ode8C13.text
ltx/en_us_oca/me.m09.d26:meMA.Ode8C1H.greekmelody	@ltx/en_us_oca/he.h.m2:heHE.KaminosPote.greekname
ltx/en_us_oca/me.m09.d26:meMA.Ode8C1H.incipit	@ltx/en_us_oca/he.h.m2:heHE.KaminosPote.incipit
ltx/en_us_oca/me.m09.d26:meMA.Ode8C1H.melody	@ltx/en_us_oca/he.h.m2:heHE.KaminosPote.melody
ltx/en_us_oca/me.m09.d26:meMA.Ode8C1H.mode	@ltx/en_us_oca/miscellanea:misc.Mode2
ltx/en_us_oca/me.m09.d26:meMA.Ode8C1H.ode	@ltx/en_us_oca/miscellanea:misc.Ode8
ltx/en_us_oca/me.m09.d26:meMA.Ode8C1H.text	@ltx/en_us_oca/he.h.m2:heHE.KaminosPote.text
ltx/en_us_oca/me.m09.d26:meMA.Ode8C21.greekmelody	@ltx/en_us_oca/he.h.m2:heHE.KaminosPote.greekname
ltx/en_us_oca/me.m09.d26:meMA.Ode8C21.incipit	You flashed across…
ltx/en_us_oca/me.m09.d26:meMA.Ode8C21.melody	@ltx/en_us_oca/he.h.m2:heHE.KaminosPote.notmetered
ltx/en_us_oca/me.m09.d26:meMA.Ode8C21.mode	@ltx/en_us_oca/miscellanea:misc.Mode2
ltx/en_us_oca/me.m09.d26:meMA.Ode8C21.ode	@ltx/en_us_oca/miscellanea:misc.Ode8
ltx/en_us_oca/me.m09.d26:meMA.Ode8C21.text	You flashed across the universe ⁄ as a bolt of lightning, blessed one, ⁄ illuminating the world by the radiance of your purity, ⁄ the brightness of your virginity, ⁄ and your teaching of godliness, Beloved of Christ our Lord.
ltx/en_us_oca/me.m09.d26:meMA.Ode8C22.incipit	You cleansed your body…
ltx/en_us_oca/me.m09.d26:meMA.Ode8C22.melody	@ltx/en_us_oca/he.h.m2:heHE.KaminosPote.notmetered
ltx/en_us_oca/me.m09.d26:meMA.Ode8C22.mode	@ltx/en_us_oca/miscellanea:misc.Mode2
ltx/en_us_oca/me.m09.d26:meMA.Ode8C22.ode	@ltx/en_us_oca/miscellanea:misc.Ode8
ltx/en_us_oca/me.m09.d26:meMA.Ode8C22.text	You cleansed your body, soul and mind; ⁄ you announced the good tidings of Christ’s heavenly Gospel. ⁄ Now that you dwell with the angels in heaven, you cry out: ⁄ All works of the Lord, bless the Lord!
ltx/en_us_oca/me.m09.d26:meMA.Ode8C23.incipit	You were set up as a pillar…
ltx/en_us_oca/me.m09.d26:meMA.Ode8C23.melody	@ltx/en_us_oca/he.h.m2:heHE.KaminosPote.notmetered
ltx/en_us_oca/me.m09.d26:meMA.Ode8C23.mode	@ltx/en_us_oca/miscellanea:misc.Mode2
ltx/en_us_oca/me.m09.d26:meMA.Ode8C23.ode	@ltx/en_us_oca/miscellanea:misc.Ode8
ltx/en_us_oca/me.m09.d26:meMA.Ode8C23.text	You were set up as a pillar of fire; ⁄ a divine offering in the holy temple, ⁄ a throne of Wisdom, and dwelling place of understanding, ⁄ an instrument of music singing; ⁄ All works of the Lord, bless the Lord!
ltx/en_us_oca/me.m09.d26:meMA.Ode8C2T.incipit	So as to lift the former curse…
ltx/en_us_oca/me.m09.d26:meMA.Ode8C2T.melody	@ltx/en_us_oca/he.h.m2:heHE.KaminosPote.notmetered
ltx/en_us_oca/me.m09.d26:meMA.Ode8C2T.mode	@ltx/en_us_oca/miscellanea:misc.Mode2
ltx/en_us_oca/me.m09.d26:meMA.Ode8C2T.ode	@ltx/en_us_oca/miscellanea:misc.Ode8
ltx/en_us_oca/me.m09.d26:meMA.Ode8C2T.text	So as to lift the former curse ⁄ and the sentence of death of our ancestral mother, ⁄ You were born, O Word of God, ⁄ from the Virgin Mother of God, ⁄ bestowing on all indestructible immortality.
ltx/en_us_oca/me.m09.d26:meMA.Ode8C31.greekmelody	@ltx/en_us_oca/he.h.m6:heHE.EkFlogosToisOsiois.greekname
ltx/en_us_oca/me.m09.d26:meMA.Ode8C31.incipit	You overflowed with eloquence…
ltx/en_us_oca/me.m09.d26:meMA.Ode8C31.melody	@ltx/en_us_oca/he.h.m6:heHE.EkFlogosToisOsiois.notmetered
ltx/en_us_oca/me.m09.d26:meMA.Ode8C31.mode	@ltx/en_us_oca/miscellanea:misc.Mode6
ltx/en_us_oca/me.m09.d26:meMA.Ode8C31.ode	@ltx/en_us_oca/miscellanea:misc.Ode8
ltx/en_us_oca/me.m09.d26:meMA.Ode8C31.text	You overflowed with eloquence, blessed Saint, ⁄ enlivening all who received your holy preaching, ⁄ who had been put to death by evil! ⁄ Therefore we honor you as the initiate of ineffable things.
ltx/en_us_oca/me.m09.d26:meMA.Ode8C32.incipit	Your divine temple…
ltx/en_us_oca/me.m09.d26:meMA.Ode8C32.melody	@ltx/en_us_oca/he.h.m6:heHE.EkFlogosToisOsiois.notmetered
ltx/en_us_oca/me.m09.d26:meMA.Ode8C32.mode	@ltx/en_us_oca/miscellanea:misc.Mode6
ltx/en_us_oca/me.m09.d26:meMA.Ode8C32.ode	@ltx/en_us_oca/miscellanea:misc.Ode8
ltx/en_us_oca/me.m09.d26:meMA.Ode8C32.text	Your divine temple has been revealed as another paradise, ⁄ making glad the hearts of all mankind ⁄ with the flowers of your miracles ⁄ which overwhelm the evil smell of the passions.
ltx/en_us_oca/me.m09.d26:meMA.Ode8C33.incipit	O God, my God…
ltx/en_us_oca/me.m09.d26:meMA.Ode8C33.melody	@ltx/en_us_oca/he.h.m6:heHE.EkFlogosToisOsiois.notmetered
ltx/en_us_oca/me.m09.d26:meMA.Ode8C33.mode	@ltx/en_us_oca/miscellanea:misc.Mode6
ltx/en_us_oca/me.m09.d26:meMA.Ode8C33.ode	@ltx/en_us_oca/miscellanea:misc.Ode8
ltx/en_us_oca/me.m09.d26:meMA.Ode8C33.text	O God, my God, hear me! ⁄ Deliver me from the enemies that daily assail me ⁄ and break my humble heart ⁄ as Your divine Disciple intercedes with You.
ltx/en_us_oca/me.m09.d26:meMA.Ode8C3T.incipit	As you are filled…
ltx/en_us_oca/me.m09.d26:meMA.Ode8C3T.melody	@ltx/en_us_oca/he.h.m6:heHE.EkFlogosToisOsiois.notmetered
ltx/en_us_oca/me.m09.d26:meMA.Ode8C3T.mode	@ltx/en_us_oca/miscellanea:misc.Mode6
ltx/en_us_oca/me.m09.d26:meMA.Ode8C3T.ode	@ltx/en_us_oca/miscellanea:misc.Ode8
ltx/en_us_oca/me.m09.d26:meMA.Ode8C3T.text	As you are filled with divine grace, ⁄ entreat Jesus, the Savior whom you bore Incarnate from your pure blood ⁄ to take pity on your servants ⁄ and pluck us from eternal punishments.
ltx/en_us_oca/me.m09.d26:meMA.Ode9C11.greekmelody	@ltx/en_us_oca/he.h.m2:heHE.AnarchouGennitoros.greekname
ltx/en_us_oca/me.m09.d26:meMA.Ode9C11.incipit	@ltx/en_us_oca/me.m07.d27:meMA.Ode9C11.incipit
ltx/en_us_oca/me.m09.d26:meMA.Ode9C11.melody	@ltx/en_us_oca/he.h.m2:heHE.AnarchouGennitoros.notmetered
ltx/en_us_oca/me.m09.d26:meMA.Ode9C11.mode	@ltx/en_us_oca/miscellanea:misc.Mode2
ltx/en_us_oca/me.m09.d26:meMA.Ode9C11.ode	@ltx/en_us_oca/miscellanea:misc.Ode9
ltx/en_us_oca/me.m09.d26:meMA.Ode9C11.text	@ltx/en_us_oca/me.m07.d27:meMA.Ode9C11.text
ltx/en_us_oca/me.m09.d26:meMA.Ode9C12.incipit	@ltx/en_us_oca/me.m07.d27:meMA.Ode9C12.incipit
ltx/en_us_oca/me.m09.d26:meMA.Ode9C12.melody	@ltx/en_us_oca/he.h.m2:heHE.AnarchouGennitoros.notmetered
ltx/en_us_oca/me.m09.d26:meMA.Ode9C12.mode	@ltx/en_us_oca/miscellanea:misc.Mode2
ltx/en_us_oca/me.m09.d26:meMA.Ode9C12.ode	@ltx/en_us_oca/miscellanea:misc.Ode9
ltx/en_us_oca/me.m09.d26:meMA.Ode9C12.text	@ltx/en_us_oca/me.m07.d27:meMA.Ode9C12.text
ltx/en_us_oca/me.m09.d26:meMA.Ode9C13.incipit	@ltx/en_us_oca/me.m07.d27:meMA.Ode9C13.incipit
ltx/en_us_oca/me.m09.d26:meMA.Ode9C13.melody	@ltx/en_us_oca/he.h.m2:heHE.AnarchouGennitoros.notmetered
ltx/en_us_oca/me.m09.d26:meMA.Ode9C13.mode	@ltx/en_us_oca/miscellanea:misc.Mode2
ltx/en_us_oca/me.m09.d26:meMA.Ode9C13.ode	@ltx/en_us_oca/miscellanea:misc.Ode9
ltx/en_us_oca/me.m09.d26:meMA.Ode9C13.text	@ltx/en_us_oca/me.m07.d27:meMA.Ode9C13.text
ltx/en_us_oca/me.m09.d26:meMA.Ode9C1H.greekmelody	@ltx/en_us_oca/he.h.m2:heHE.AnarchouGennitoros.greekname
ltx/en_us_oca/me.m09.d26:meMA.Ode9C1H.incipit	@ltx/en_us_oca/he.h.m2:heHE.AnarchouGennitoros.incipit
ltx/en_us_oca/me.m09.d26:meMA.Ode9C1H.melody	@ltx/en_us_oca/he.h.m2:heHE.AnarchouGennitoros.melody
ltx/en_us_oca/me.m09.d26:meMA.Ode9C1H.mode	@ltx/en_us_oca/miscellanea:misc.Mode2
ltx/en_us_oca/me.m09.d26:meMA.Ode9C1H.ode	@ltx/en_us_oca/miscellanea:misc.Ode9
ltx/en_us_oca/me.m09.d26:meMA.Ode9C1H.text	@ltx/en_us_oca/he.h.m2:heHE.AnarchouGennitoros.text
ltx/en_us_oca/me.m09.d26:meMA.Ode9C21.greekmelody	@ltx/en_us_oca/he.h.m2:heHE.AnarchouGennitoros.greekname
ltx/en_us_oca/me.m09.d26:meMA.Ode9C21.incipit	You have been made worthy…
ltx/en_us_oca/me.m09.d26:meMA.Ode9C21.melody	@ltx/en_us_oca/he.h.m2:heHE.AnarchouGennitoros.notmetered
ltx/en_us_oca/me.m09.d26:meMA.Ode9C21.mode	@ltx/en_us_oca/miscellanea:misc.Mode2
ltx/en_us_oca/me.m09.d26:meMA.Ode9C21.ode	@ltx/en_us_oca/miscellanea:misc.Ode9
ltx/en_us_oca/me.m09.d26:meMA.Ode9C21.text	You have been made worthy now to see face to face, ⁄ and no longer in shadows, ⁄ the Stream of delight and the River of peace; ⁄ the Fountain of immortality. ⁄ In His refreshment, you rejoice in being made divine!
ltx/en_us_oca/me.m09.d26:meMA.Ode9C22.incipit	You had asked to receive…
ltx/en_us_oca/me.m09.d26:meMA.Ode9C22.melody	@ltx/en_us_oca/he.h.m2:heHE.AnarchouGennitoros.notmetered
ltx/en_us_oca/me.m09.d26:meMA.Ode9C22.mode	@ltx/en_us_oca/miscellanea:misc.Mode2
ltx/en_us_oca/me.m09.d26:meMA.Ode9C22.ode	@ltx/en_us_oca/miscellanea:misc.Ode9
ltx/en_us_oca/me.m09.d26:meMA.Ode9C22.text	You had asked to receive an earthly seat next to Christ, ⁄ but He will give you His breast on which to lean: ⁄ a firm and eternal place of rest ⁄ which has blessed you with goodness and beauty ⁄ adornment of the Apostles!
ltx/en_us_oca/me.m09.d26:meMA.Ode9C23.incipit	You quenched the ungodly wisdom…
ltx/en_us_oca/me.m09.d26:meMA.Ode9C23.melody	@ltx/en_us_oca/he.h.m2:heHE.AnarchouGennitoros.notmetered
ltx/en_us_oca/me.m09.d26:meMA.Ode9C23.mode	@ltx/en_us_oca/miscellanea:misc.Mode2
ltx/en_us_oca/me.m09.d26:meMA.Ode9C23.ode	@ltx/en_us_oca/miscellanea:misc.Ode9
ltx/en_us_oca/me.m09.d26:meMA.Ode9C23.text	You quenched the ungodly wisdom of the Greeks, declaring: ⁄ In the beginning was the Word! ⁄ And, Saint, you proclaimed: The Word was with God, ⁄ and God was truly the Word, ⁄ through Whom come all things both visible, and invisible!
ltx/en_us_oca/me.m09.d26:meMA.Ode9C2T.incipit	All-pure Mother of God…
ltx/en_us_oca/me.m09.d26:meMA.Ode9C2T.melody	@ltx/en_us_oca/he.h.m2:heHE.AnarchouGennitoros.notmetered
ltx/en_us_oca/me.m09.d26:meMA.Ode9C2T.mode	@ltx/en_us_oca/miscellanea:misc.Mode2
ltx/en_us_oca/me.m09.d26:meMA.Ode9C2T.ode	@ltx/en_us_oca/miscellanea:misc.Ode9
ltx/en_us_oca/me.m09.d26:meMA.Ode9C2T.text	All-pure Mother of God, ⁄ you are seen in the morning as the dawn of life, ⁄ shining with rays of virginity, ⁄ And showing us the rising of the spiritual Sun of righteousness!
ltx/en_us_oca/me.m09.d26:meMA.Ode9C31.greekmelody	@ltx/en_us_oca/he.h.m6:heHE.TheonAnthropois.greekname
ltx/en_us_oca/me.m09.d26:meMA.Ode9C31.incipit	The Deliverer…
ltx/en_us_oca/me.m09.d26:meMA.Ode9C31.melody	@ltx/en_us_oca/he.h.m6:heHE.TheonAnthropois.notmetered
ltx/en_us_oca/me.m09.d26:meMA.Ode9C31.mode	@ltx/en_us_oca/miscellanea:misc.Mode6
ltx/en_us_oca/me.m09.d26:meMA.Ode9C31.ode	@ltx/en_us_oca/miscellanea:misc.Ode9
ltx/en_us_oca/me.m09.d26:meMA.Ode9C31.text	The Deliverer, Lord of time and hours, ⁄ was hung upon the Cross at mid-day. ⁄ He commended the ever-Virgin to you, blessed virgin one. ⁄ He gave you a glory which cannot be taken away. ⁄ Therefore we magnify you with faith!
ltx/en_us_oca/me.m09.d26:meMA.Ode9C32.incipit	As you dwell on high…
ltx/en_us_oca/me.m09.d26:meMA.Ode9C32.melody	@ltx/en_us_oca/he.h.m6:heHE.TheonAnthropois.notmetered
ltx/en_us_oca/me.m09.d26:meMA.Ode9C32.mode	@ltx/en_us_oca/miscellanea:misc.Mode6
ltx/en_us_oca/me.m09.d26:meMA.Ode9C32.ode	@ltx/en_us_oca/miscellanea:misc.Ode9
ltx/en_us_oca/me.m09.d26:meMA.Ode9C32.text	As you dwell on high with the divine powers, ⁄ singing with them the heavenly hymn, ⁄ save those, Apostle of Christ, by your mediation, ⁄ who sing and praise God, the transcendent Good One!
ltx/en_us_oca/me.m09.d26:meMA.Ode9C33.incipit	Save us from danger…
ltx/en_us_oca/me.m09.d26:meMA.Ode9C33.melody	@ltx/en_us_oca/he.h.m6:heHE.TheonAnthropois.notmetered
ltx/en_us_oca/me.m09.d26:meMA.Ode9C33.mode	@ltx/en_us_oca/miscellanea:misc.Mode6
ltx/en_us_oca/me.m09.d26:meMA.Ode9C33.ode	@ltx/en_us_oca/miscellanea:misc.Ode9
ltx/en_us_oca/me.m09.d26:meMA.Ode9C33.text	Save us from danger, blessed Theologian, ⁄ for we call on you with faith. ⁄ Direct our steps rightly to the Lord by the Spirit, ⁄ and guide us in the way of peace, ⁄ in the commandments of the Almighty One.
ltx/en_us_oca/me.m09.d26:meMA.Ode9C3T.incipit	Let us sing praises…
ltx/en_us_oca/me.m09.d26:meMA.Ode9C3T.melody	@ltx/en_us_oca/he.h.m6:heHE.TheonAnthropois.notmetered
ltx/en_us_oca/me.m09.d26:meMA.Ode9C3T.mode	@ltx/en_us_oca/miscellanea:misc.Mode6
ltx/en_us_oca/me.m09.d26:meMA.Ode9C3T.ode	@ltx/en_us_oca/miscellanea:misc.Ode9
ltx/en_us_oca/me.m09.d26:meMA.Ode9C3T.text	Let us sing praises with thanksgiving to the Mother of God, ⁄ and let us cry aloud to her: Rejoice, cloud of light; ⁄ Rejoice, Eden, through whom we shall be granted the joy of Paradise!
ltx/en_us_oca/me.m09.d26:meMA.Oikos1.text	It is presumptuous and beyond our reach to try to gain complete understanding of the heights of heaven and the depths of the sea. It is likewise impossible to count all the stars, or the sand on the seashore, or to speak adequately of the Theologian, who has been crowned with so many crowns by Christ whom he loved. For he leaned on His bosom and ate with Him at the Last Supper ⁄⁄ as Theologian and friend of Christ.
ltx/en_us_oca/me.m09.d26:meMA.PostGospelBoth.incipit	@ltx/en_us_oca/ho.ho03:hoMA.PostGospelTheotokos.incipit
ltx/en_us_oca/me.m09.d26:meMA.PostGospelBoth.melody	
ltx/en_us_oca/me.m09.d26:meMA.PostGospelBoth.mode	@ltx/en_us_oca/miscellanea:misc.Mode2
ltx/en_us_oca/me.m09.d26:meMA.PostGospelBoth.text	@ltx/en_us_oca/ho.ho03:hoMA.PostGospelTheotokos.text
ltx/en_us_oca/me.m09.d26:meMA.PostGospelGlory.incipit	@ltx/en_us_oca/ho.ho03:hoMA.PostGospelApostle.incipit
ltx/en_us_oca/me.m09.d26:meMA.PostGospelGlory.melody	
ltx/en_us_oca/me.m09.d26:meMA.PostGospelGlory.mode	@ltx/en_us_oca/miscellanea:misc.Mode2
ltx/en_us_oca/me.m09.d26:meMA.PostGospelGlory.text	@ltx/en_us_oca/ho.ho03:hoMA.PostGospelApostle.text
ltx/en_us_oca/me.m09.d26:meMA.PostGospelIdiomelon.incipit	@ltx/en_us_oca/me.m09.d26:meSV.SticGlory.incipit
ltx/en_us_oca/me.m09.d26:meMA.PostGospelIdiomelon.melody	
ltx/en_us_oca/me.m09.d26:meMA.PostGospelIdiomelon.mode	@ltx/en_us_oca/miscellanea:misc.Mode2
ltx/en_us_oca/me.m09.d26:meMA.PostGospelIdiomelon.text	@ltx/en_us_oca/me.m09.d26:meSV.SticGlory.text
ltx/en_us_oca/me.m09.d26:meSV.AposGlory.incipit	…
ltx/en_us_oca/me.m09.d26:meSV.AposGlory.melody	@ltx/en_us_oca/he.a.m6:heAU.TriimerosAnestis.notmetered
ltx/en_us_oca/me.m09.d26:meSV.AposGlory.mode	@ltx/en_us_oca/miscellanea:misc.Mode6
ltx/en_us_oca/me.m09.d26:meSV.AposGlory.text	
ltx/en_us_oca/me.m09.d26:meSV.Aposticha1.incipit	…
ltx/en_us_oca/me.m09.d26:meSV.Aposticha1.melody	@ltx/en_us_oca/he.a.m6:heAU.TriimerosAnestis.notmetered
ltx/en_us_oca/me.m09.d26:meSV.Aposticha1.mode	@ltx/en_us_oca/miscellanea:misc.Mode6
ltx/en_us_oca/me.m09.d26:meSV.Aposticha1.text	
ltx/en_us_oca/me.m09.d26:meSV.Aposticha2.incipit	…
ltx/en_us_oca/me.m09.d26:meSV.Aposticha2.melody	@ltx/en_us_oca/he.a.m6:heAU.TriimerosAnestis.notmetered
ltx/en_us_oca/me.m09.d26:meSV.Aposticha2.mode	@ltx/en_us_oca/miscellanea:misc.Mode6
ltx/en_us_oca/me.m09.d26:meSV.Aposticha2.text	
ltx/en_us_oca/me.m09.d26:meSV.Aposticha3.incipit	…
ltx/en_us_oca/me.m09.d26:meSV.Aposticha3.melody	@ltx/en_us_oca/he.a.m6:heAU.TriimerosAnestis.notmetered
ltx/en_us_oca/me.m09.d26:meSV.Aposticha3.mode	@ltx/en_us_oca/miscellanea:misc.Mode6
ltx/en_us_oca/me.m09.d26:meSV.Aposticha3.text	
ltx/en_us_oca/me.m09.d26:meSV.SticBoth.incipit	…
ltx/en_us_oca/me.m09.d26:meSV.SticBoth.melody	
ltx/en_us_oca/me.m09.d26:meSV.SticBoth.mode	@ltx/en_us_oca/miscellanea:misc.Mode2
ltx/en_us_oca/me.m09.d26:meSV.SticBoth.text	
ltx/en_us_oca/me.m09.d26:meSV.SticGlory.incipit	…
ltx/en_us_oca/me.m09.d26:meSV.SticGlory.melody	
ltx/en_us_oca/me.m09.d26:meSV.SticGlory.mode	@ltx/en_us_oca/miscellanea:misc.Mode2
ltx/en_us_oca/me.m09.d26:meSV.SticGlory.text	
ltx/en_us_oca/me.m09.d26:meSV.Stichera1.incipit	…
ltx/en_us_oca/me.m09.d26:meSV.Stichera1.melody	@ltx/en_us_oca/he.a.m2:heAU.OteEkTouXylou.notmetered
ltx/en_us_oca/me.m09.d26:meSV.Stichera1.mode	@ltx/en_us_oca/miscellanea:misc.Mode2
ltx/en_us_oca/me.m09.d26:meSV.Stichera1.text	
ltx/en_us_oca/me.m09.d26:meSV.Stichera2.incipit	…
ltx/en_us_oca/me.m09.d26:meSV.Stichera2.melody	@ltx/en_us_oca/he.a.m2:heAU.OteEkTouXylou.notmetered
ltx/en_us_oca/me.m09.d26:meSV.Stichera2.mode	@ltx/en_us_oca/miscellanea:misc.Mode2
ltx/en_us_oca/me.m09.d26:meSV.Stichera2.text	
ltx/en_us_oca/me.m09.d26:meSV.Stichera3.incipit	…
ltx/en_us_oca/me.m09.d26:meSV.Stichera3.melody	@ltx/en_us_oca/he.a.m2:heAU.OteEkTouXylou.notmetered
ltx/en_us_oca/me.m09.d26:meSV.Stichera3.mode	@ltx/en_us_oca/miscellanea:misc.Mode2
ltx/en_us_oca/me.m09.d26:meSV.Stichera3.text	
ltx/en_us_oca/me.m09.d26:meVE.Apolytikion1.incipit	@ltx/en_us_oca/me.m05.d08:meVE.Apolytikion1.incipit
ltx/en_us_oca/me.m09.d26:meVE.Apolytikion1.melody	
ltx/en_us_oca/me.m09.d26:meVE.Apolytikion1.mode	@ltx/en_us_oca/miscellanea:misc.Mode2
ltx/en_us_oca/me.m09.d26:meVE.Apolytikion1.text	@ltx/en_us_oca/me.m05.d08:meVE.Apolytikion1.text
ltx/en_us_oca/me.m09.d26:meVE.AposGlory.incipit	@ltx/en_us_oca/me.m05.d08:meVE.AposGlory.incipit
ltx/en_us_oca/me.m09.d26:meVE.AposGlory.melody	
ltx/en_us_oca/me.m09.d26:meVE.AposGlory.mode	@ltx/en_us_oca/miscellanea:misc.Mode6
ltx/en_us_oca/me.m09.d26:meVE.AposGlory.poet	@ltx/en_us_oca/poets:po.IoannouMonachou
ltx/en_us_oca/me.m09.d26:meVE.AposGlory.text	@ltx/en_us_oca/me.m05.d08:meVE.AposGlory.text
ltx/en_us_oca/me.m09.d26:meVE.Aposticha1.greekmelody	@ltx/en_us_oca/he.a.m4:heAU.OExYpsistouKlitheis.greekname
ltx/en_us_oca/me.m09.d26:meVE.Aposticha1.incipit	…
ltx/en_us_oca/me.m09.d26:meVE.Aposticha1.melody	@ltx/en_us_oca/he.a.m4:heAU.OExYpsistouKlitheis.notmetered
ltx/en_us_oca/me.m09.d26:meVE.Aposticha1.mode	@ltx/en_us_oca/miscellanea:misc.Mode4
ltx/en_us_oca/me.m09.d26:meVE.Aposticha1.text	You confessed the Son of the Most High: ⁄ Co-eternal and one in essence with the Father; ⁄ Light from Light, unchanging, ⁄ the express Image of the Person Who begot Him, ⁄ shining from Him timelessly and without passion, ⁄ the Creator and Lord of all ages! ⁄ You preached Him to the world as Christ our God, ⁄⁄ the Light leading out of darkness!
ltx/en_us_oca/me.m09.d26:meVE.Aposticha2.incipit	…
ltx/en_us_oca/me.m09.d26:meVE.Aposticha2.melody	@ltx/en_us_oca/he.a.m4:heAU.OExYpsistouKlitheis.notmetered
ltx/en_us_oca/me.m09.d26:meVE.Aposticha2.mode	@ltx/en_us_oca/miscellanea:misc.Mode4
ltx/en_us_oca/me.m09.d26:meVE.Aposticha2.text	Having received the light of the Holy Spirit, ⁄ you were enlightened to speak of things divine: ⁄ Of the Comforter, Who proceeds from the Father, ⁄ and Who appeared to mankind through the Son. ⁄ One honor, one throne, one essence, ⁄ with the Father Who is without beginning, and the Word of God, ⁄ All this, beloved one, you proclaimed to the world. ⁄ Therefore we honor you in hymns as the source of the faith ⁄⁄ which you preserve unshaken by your intercessions before the Lord.
ltx/en_us_oca/me.m09.d26:meVE.Aposticha3.incipit	…
ltx/en_us_oca/me.m09.d26:meVE.Aposticha3.melody	@ltx/en_us_oca/he.a.m4:heAU.OExYpsistouKlitheis.notmetered
ltx/en_us_oca/me.m09.d26:meVE.Aposticha3.mode	@ltx/en_us_oca/miscellanea:misc.Mode4
ltx/en_us_oca/me.m09.d26:meVE.Aposticha3.text	Having ascended to the height of theology, ⁄ you learned the ineffable mysteries of God: ⁄ The unity of the essence of the Godhead; ⁄ one glory, one kingdom, one dominion, ⁄ ever divided into three Persons, ⁄ yet undivided and united in a divine Union without confusion. ⁄ In this way you proclaimed Him ⁄ glorifying the undivided Trinity. ⁄⁄ Pray, Theologian, that He may save and enlighten our souls!
ltx/en_us_oca/me.m09.d26:meVE.Lity1.incipit	@ltx/en_us_oca/me.m05.d08:meVE.Lity1.incipit
ltx/en_us_oca/me.m09.d26:meVE.Lity1.melody	
ltx/en_us_oca/me.m09.d26:meVE.Lity1.mode	@ltx/en_us_oca/miscellanea:misc.Mode1
ltx/en_us_oca/me.m09.d26:meVE.Lity1.poet	@ltx/en_us_oca/poets:po.Germanou
ltx/en_us_oca/me.m09.d26:meVE.Lity1.text	@ltx/en_us_oca/me.m05.d08:meVE.Lity1.text
ltx/en_us_oca/me.m09.d26:meVE.Lity2.incipit	@ltx/en_us_oca/me.m05.d08:meVE.Lity2.incipit
ltx/en_us_oca/me.m09.d26:meVE.Lity2.melody	
ltx/en_us_oca/me.m09.d26:meVE.Lity2.mode	@ltx/en_us_oca/miscellanea:misc.Mode1
ltx/en_us_oca/me.m09.d26:meVE.Lity2.poet	@ltx/en_us_oca/poets:po.AndreouPyrou
ltx/en_us_oca/me.m09.d26:meVE.Lity2.text	@ltx/en_us_oca/me.m05.d08:meVE.Lity2.text
ltx/en_us_oca/me.m09.d26:meVE.Lity3.incipit	…
ltx/en_us_oca/me.m09.d26:meVE.Lity3.melody	
ltx/en_us_oca/me.m09.d26:meVE.Lity3.mode	@ltx/en_us_oca/miscellanea:misc.Mode1
ltx/en_us_oca/me.m09.d26:meVE.Lity3.text	
ltx/en_us_oca/me.m09.d26:meVE.Lity4.incipit	@ltx/en_us_oca/me.m05.d08:meVE.Lity3.incipit
ltx/en_us_oca/me.m09.d26:meVE.Lity4.melody	
ltx/en_us_oca/me.m09.d26:meVE.Lity4.mode	@ltx/en_us_oca/miscellanea:misc.Mode1
ltx/en_us_oca/me.m09.d26:meVE.Lity4.text	@ltx/en_us_oca/me.m05.d08:meVE.Lity3.text
ltx/en_us_oca/me.m09.d26:meVE.Lity5.incipit	@ltx/en_us_oca/me.m05.d08:meVE.Lity4.incipit
ltx/en_us_oca/me.m09.d26:meVE.Lity5.melody	
ltx/en_us_oca/me.m09.d26:meVE.Lity5.mode	@ltx/en_us_oca/miscellanea:misc.Mode2
ltx/en_us_oca/me.m09.d26:meVE.Lity5.poet	@ltx/en_us_oca/poets:po.Theofanous
ltx/en_us_oca/me.m09.d26:meVE.Lity5.text	@ltx/en_us_oca/me.m05.d08:meVE.Lity4.text
ltx/en_us_oca/me.m09.d26:meVE.LityBoth.incipit	…
ltx/en_us_oca/me.m09.d26:meVE.LityBoth.melody	
ltx/en_us_oca/me.m09.d26:meVE.LityBoth.mode	@ltx/en_us_oca/miscellanea:misc.Mode4
ltx/en_us_oca/me.m09.d26:meVE.LityBoth.text	
ltx/en_us_oca/me.m09.d26:meVE.LityGlory.incipit	@ltx/en_us_oca/me.m05.d08:meVE.LityGlory.incipit
ltx/en_us_oca/me.m09.d26:meVE.LityGlory.melody	
ltx/en_us_oca/me.m09.d26:meVE.LityGlory.mode	@ltx/en_us_oca/miscellanea:misc.Mode4
ltx/en_us_oca/me.m09.d26:meVE.LityGlory.poet	@ltx/en_us_oca/poets:po.Vyzantiou
ltx/en_us_oca/me.m09.d26:meVE.LityGlory.text	@ltx/en_us_oca/me.m05.d08:meVE.LityGlory.text
ltx/en_us_oca/me.m09.d26:meVE.SticGlory.incipit	@ltx/en_us_oca/me.m05.d08:meVE.SticGlory.incipit
ltx/en_us_oca/me.m09.d26:meVE.SticGlory.melody	
ltx/en_us_oca/me.m09.d26:meVE.SticGlory.mode	@ltx/en_us_oca/miscellanea:misc.Mode2
ltx/en_us_oca/me.m09.d26:meVE.SticGlory.poet	@ltx/en_us_oca/poets:po.GermanouOiDeVyzantiou
ltx/en_us_oca/me.m09.d26:meVE.SticGlory.text	@ltx/en_us_oca/me.m05.d08:meVE.SticGlory.text
ltx/en_us_oca/me.m09.d26:meVE.Stichera01.greekmelody	@ltx/en_us_oca/he.a.m1:heAU.TonOuranionTagmaton.greekname
ltx/en_us_oca/me.m09.d26:meVE.Stichera01.incipit	@ltx/en_us_oca/me.m05.d08:meVE.Stichera01.incipit
ltx/en_us_oca/me.m09.d26:meVE.Stichera01.melody	@ltx/en_us_oca/he.a.m1:heAU.TonOuranionTagmaton.notmetered
ltx/en_us_oca/me.m09.d26:meVE.Stichera01.mode	@ltx/en_us_oca/miscellanea:misc.Mode1
ltx/en_us_oca/me.m09.d26:meVE.Stichera01.text	@ltx/en_us_oca/me.m05.d08:meVE.Stichera01.text
ltx/en_us_oca/me.m09.d26:meVE.Stichera02.incipit	@ltx/en_us_oca/me.m05.d08:meVE.Stichera02.incipit
ltx/en_us_oca/me.m09.d26:meVE.Stichera02.melody	@ltx/en_us_oca/he.a.m1:heAU.TonOuranionTagmaton.notmetered
ltx/en_us_oca/me.m09.d26:meVE.Stichera02.mode	@ltx/en_us_oca/miscellanea:misc.Mode1
ltx/en_us_oca/me.m09.d26:meVE.Stichera02.text	@ltx/en_us_oca/me.m05.d08:meVE.Stichera02.text
ltx/en_us_oca/me.m09.d26:meVE.Stichera03.incipit	@ltx/en_us_oca/me.m05.d08:meVE.Stichera03.incipit
ltx/en_us_oca/me.m09.d26:meVE.Stichera03.melody	@ltx/en_us_oca/he.a.m1:heAU.TonOuranionTagmaton.notmetered
ltx/en_us_oca/me.m09.d26:meVE.Stichera03.mode	@ltx/en_us_oca/miscellanea:misc.Mode1
ltx/en_us_oca/me.m09.d26:meVE.Stichera03.text	@ltx/en_us_oca/me.m05.d08:meVE.Stichera03.text
