ltx/en_us_oca/me.m07.d06:meDA.commemoration.first	
ltx/en_us_oca/me.m07.d06:meDA.commemoration.first_name	
ltx/en_us_oca/me.m07.d06:meDA.commemoration.first_short	
ltx/en_us_oca/me.m07.d06:meDA.commemoration.first_title	
ltx/en_us_oca/me.m07.d06:meDA.commemoration.full	
ltx/en_us_oca/me.m07.d06:meDA.commemoration.second_name	
ltx/en_us_oca/me.m07.d06:meDA.commemoration.second_title	
ltx/en_us_oca/me.m07.d06:meDA.date	
ltx/en_us_oca/me.m07.d06:meDA.fordate	
ltx/en_us_oca/me.m07.d06:meDA.insert1	
ltx/en_us_oca/me.m07.d06:meDA.insert2	
ltx/en_us_oca/me.m07.d06:meDA.note	
ltx/en_us_oca/me.m07.d06:meDA.pdfcoverdate	
ltx/en_us_oca/me.m07.d06:meDA.pdfheaderdate	
ltx/en_us_oca/me.m07.d06:meHO.commemorations	
ltx/en_us_oca/me.m07.d06:meHO.note1	
ltx/en_us_oca/me.m07.d06:meHO.note2	
ltx/en_us_oca/me.m07.d06:meHO.number	
ltx/en_us_oca/me.m07.d06:meHO.rank	
ltx/en_us_oca/me.m07.d06:meLE.commemoration1	
ltx/en_us_oca/me.m07.d06:meLE.commemoration2	
ltx/en_us_oca/me.m07.d06:meLI.Kontakion1.incipit	…
ltx/en_us_oca/me.m07.d06:meLI.Kontakion1.melody	
ltx/en_us_oca/me.m07.d06:meLI.Kontakion1.mode	
ltx/en_us_oca/me.m07.d06:meLI.Kontakion1.text	
ltx/en_us_oca/me.m07.d06:meLI.Megalynarion.text	
ltx/en_us_oca/me.m07.d06:meMA.C1.title	@ltx/en_us_oca/titles:ti.CanonDevoutM
ltx/en_us_oca/me.m07.d06:meMA.C1.verse	@ltx/en_us_oca/prayers:pr.verse_DevoutMan.text
ltx/en_us_oca/me.m07.d06:meMA.Ode1C11.greekmelody	@ltx/en_us_oca/he.h.m8:heHE.AsomenToKyrio.greekname
ltx/en_us_oca/me.m07.d06:meMA.Ode1C11.incipit	…
ltx/en_us_oca/me.m07.d06:meMA.Ode1C11.melody	@ltx/en_us_oca/he.h.m8:heHE.AsomenToKyrio.notmetered
ltx/en_us_oca/me.m07.d06:meMA.Ode1C11.mode	@ltx/en_us_oca/miscellanea:misc.Mode8
ltx/en_us_oca/me.m07.d06:meMA.Ode1C11.ode	@ltx/en_us_oca/miscellanea:misc.Ode1
ltx/en_us_oca/me.m07.d06:meMA.Ode1C11.text	
ltx/en_us_oca/me.m07.d06:meMA.Ode1C12.incipit	…
ltx/en_us_oca/me.m07.d06:meMA.Ode1C12.melody	@ltx/en_us_oca/he.h.m8:heHE.AsomenToKyrio.notmetered
ltx/en_us_oca/me.m07.d06:meMA.Ode1C12.mode	@ltx/en_us_oca/miscellanea:misc.Mode8
ltx/en_us_oca/me.m07.d06:meMA.Ode1C12.ode	@ltx/en_us_oca/miscellanea:misc.Ode1
ltx/en_us_oca/me.m07.d06:meMA.Ode1C12.text	
ltx/en_us_oca/me.m07.d06:meMA.Ode1C13.incipit	…
ltx/en_us_oca/me.m07.d06:meMA.Ode1C13.melody	@ltx/en_us_oca/he.h.m8:heHE.AsomenToKyrio.notmetered
ltx/en_us_oca/me.m07.d06:meMA.Ode1C13.mode	@ltx/en_us_oca/miscellanea:misc.Mode8
ltx/en_us_oca/me.m07.d06:meMA.Ode1C13.ode	@ltx/en_us_oca/miscellanea:misc.Ode1
ltx/en_us_oca/me.m07.d06:meMA.Ode1C13.text	
ltx/en_us_oca/me.m07.d06:meMA.Ode1C1T.incipit	…
ltx/en_us_oca/me.m07.d06:meMA.Ode1C1T.melody	@ltx/en_us_oca/he.h.m8:heHE.AsomenToKyrio.notmetered
ltx/en_us_oca/me.m07.d06:meMA.Ode1C1T.mode	@ltx/en_us_oca/miscellanea:misc.Mode8
ltx/en_us_oca/me.m07.d06:meMA.Ode1C1T.ode	@ltx/en_us_oca/miscellanea:misc.Ode1
ltx/en_us_oca/me.m07.d06:meMA.Ode1C1T.text	
ltx/en_us_oca/me.m07.d06:meMA.Ode3C11.greekmelody	@ltx/en_us_oca/he.h.m8:heHE.SyEiToStereoma.greekname
ltx/en_us_oca/me.m07.d06:meMA.Ode3C11.incipit	…
ltx/en_us_oca/me.m07.d06:meMA.Ode3C11.melody	@ltx/en_us_oca/he.h.m8:heHE.SyEiToStereoma.notmetered
ltx/en_us_oca/me.m07.d06:meMA.Ode3C11.mode	@ltx/en_us_oca/miscellanea:misc.Mode8
ltx/en_us_oca/me.m07.d06:meMA.Ode3C11.ode	@ltx/en_us_oca/miscellanea:misc.Ode3
ltx/en_us_oca/me.m07.d06:meMA.Ode3C11.text	
ltx/en_us_oca/me.m07.d06:meMA.Ode3C12.incipit	…
ltx/en_us_oca/me.m07.d06:meMA.Ode3C12.melody	@ltx/en_us_oca/he.h.m8:heHE.SyEiToStereoma.notmetered
ltx/en_us_oca/me.m07.d06:meMA.Ode3C12.mode	@ltx/en_us_oca/miscellanea:misc.Mode8
ltx/en_us_oca/me.m07.d06:meMA.Ode3C12.ode	@ltx/en_us_oca/miscellanea:misc.Ode3
ltx/en_us_oca/me.m07.d06:meMA.Ode3C12.text	
ltx/en_us_oca/me.m07.d06:meMA.Ode3C13.incipit	…
ltx/en_us_oca/me.m07.d06:meMA.Ode3C13.melody	@ltx/en_us_oca/he.h.m8:heHE.SyEiToStereoma.notmetered
ltx/en_us_oca/me.m07.d06:meMA.Ode3C13.mode	@ltx/en_us_oca/miscellanea:misc.Mode8
ltx/en_us_oca/me.m07.d06:meMA.Ode3C13.ode	@ltx/en_us_oca/miscellanea:misc.Ode3
ltx/en_us_oca/me.m07.d06:meMA.Ode3C13.text	
ltx/en_us_oca/me.m07.d06:meMA.Ode3C1T.incipit	…
ltx/en_us_oca/me.m07.d06:meMA.Ode3C1T.melody	@ltx/en_us_oca/he.h.m8:heHE.SyEiToStereoma.notmetered
ltx/en_us_oca/me.m07.d06:meMA.Ode3C1T.mode	@ltx/en_us_oca/miscellanea:misc.Mode8
ltx/en_us_oca/me.m07.d06:meMA.Ode3C1T.ode	@ltx/en_us_oca/miscellanea:misc.Ode3
ltx/en_us_oca/me.m07.d06:meMA.Ode3C1T.text	
ltx/en_us_oca/me.m07.d06:meMA.Ode3H.greekmelody	@ltx/en_us_oca/he.h.m8:heHE.SyEiToStereoma.greekname
ltx/en_us_oca/me.m07.d06:meMA.Ode3H.incipit	@ltx/en_us_oca/he.h.m8:heHE.SyEiToStereoma.incipit
ltx/en_us_oca/me.m07.d06:meMA.Ode3H.melody	@ltx/en_us_oca/he.h.m8:heHE.SyEiToStereoma.melody
ltx/en_us_oca/me.m07.d06:meMA.Ode3H.mode	@ltx/en_us_oca/miscellanea:misc.Mode8
ltx/en_us_oca/me.m07.d06:meMA.Ode3H.ode	@ltx/en_us_oca/miscellanea:misc.Ode3
ltx/en_us_oca/me.m07.d06:meMA.Ode3H.text	@ltx/en_us_oca/he.h.m8:heHE.SyEiToStereoma.text
ltx/en_us_oca/me.m07.d06:meMA.Ode3Kathisma1.greekmelody	@ltx/en_us_oca/he.a.m1:heAU.TonTafonSouSotir.greekname
ltx/en_us_oca/me.m07.d06:meMA.Ode3Kathisma1.incipit	…
ltx/en_us_oca/me.m07.d06:meMA.Ode3Kathisma1.melody	@ltx/en_us_oca/he.a.m1:heAU.TonTafonSouSotir.notmetered
ltx/en_us_oca/me.m07.d06:meMA.Ode3Kathisma1.mode	@ltx/en_us_oca/miscellanea:misc.Mode1
ltx/en_us_oca/me.m07.d06:meMA.Ode3Kathisma1.text	
ltx/en_us_oca/me.m07.d06:meMA.Ode3KathismaSt.incipit	@ltx/en_us_oca/me.m03.d18:meMA.Ode3KathismaSt.incipit
ltx/en_us_oca/me.m07.d06:meMA.Ode3KathismaSt.melody	@ltx/en_us_oca/he.a.m1:heAU.TonTafonSouSotir.notmetered
ltx/en_us_oca/me.m07.d06:meMA.Ode3KathismaSt.mode	@ltx/en_us_oca/miscellanea:misc.Mode1
ltx/en_us_oca/me.m07.d06:meMA.Ode3KathismaSt.text	@ltx/en_us_oca/me.m03.d18:meMA.Ode3KathismaSt.text
ltx/en_us_oca/me.m07.d06:meMA.Ode3KathismaT.incipit	…
ltx/en_us_oca/me.m07.d06:meMA.Ode3KathismaT.melody	@ltx/en_us_oca/he.a.m1:heAU.TonTafonSouSotir.notmetered
ltx/en_us_oca/me.m07.d06:meMA.Ode3KathismaT.mode	@ltx/en_us_oca/miscellanea:misc.Mode1
ltx/en_us_oca/me.m07.d06:meMA.Ode3KathismaT.text	
ltx/en_us_oca/me.m07.d06:meMA.Ode4C11.greekmelody	@ltx/en_us_oca/he.h.m8:heHE.EisakikoaKyrie.greekname
ltx/en_us_oca/me.m07.d06:meMA.Ode4C11.incipit	…
ltx/en_us_oca/me.m07.d06:meMA.Ode4C11.melody	@ltx/en_us_oca/he.h.m8:heHE.EisakikoaKyrie.notmetered
ltx/en_us_oca/me.m07.d06:meMA.Ode4C11.mode	@ltx/en_us_oca/miscellanea:misc.Mode8
ltx/en_us_oca/me.m07.d06:meMA.Ode4C11.ode	@ltx/en_us_oca/miscellanea:misc.Ode4
ltx/en_us_oca/me.m07.d06:meMA.Ode4C11.text	
ltx/en_us_oca/me.m07.d06:meMA.Ode4C12.incipit	…
ltx/en_us_oca/me.m07.d06:meMA.Ode4C12.melody	@ltx/en_us_oca/he.h.m8:heHE.EisakikoaKyrie.notmetered
ltx/en_us_oca/me.m07.d06:meMA.Ode4C12.mode	@ltx/en_us_oca/miscellanea:misc.Mode8
ltx/en_us_oca/me.m07.d06:meMA.Ode4C12.ode	@ltx/en_us_oca/miscellanea:misc.Ode4
ltx/en_us_oca/me.m07.d06:meMA.Ode4C12.text	
ltx/en_us_oca/me.m07.d06:meMA.Ode4C13.incipit	…
ltx/en_us_oca/me.m07.d06:meMA.Ode4C13.melody	@ltx/en_us_oca/he.h.m8:heHE.EisakikoaKyrie.notmetered
ltx/en_us_oca/me.m07.d06:meMA.Ode4C13.mode	@ltx/en_us_oca/miscellanea:misc.Mode8
ltx/en_us_oca/me.m07.d06:meMA.Ode4C13.ode	@ltx/en_us_oca/miscellanea:misc.Ode4
ltx/en_us_oca/me.m07.d06:meMA.Ode4C13.text	
ltx/en_us_oca/me.m07.d06:meMA.Ode4C1T.incipit	…
ltx/en_us_oca/me.m07.d06:meMA.Ode4C1T.melody	@ltx/en_us_oca/he.h.m8:heHE.EisakikoaKyrie.notmetered
ltx/en_us_oca/me.m07.d06:meMA.Ode4C1T.mode	@ltx/en_us_oca/miscellanea:misc.Mode8
ltx/en_us_oca/me.m07.d06:meMA.Ode4C1T.ode	@ltx/en_us_oca/miscellanea:misc.Ode4
ltx/en_us_oca/me.m07.d06:meMA.Ode4C1T.text	
ltx/en_us_oca/me.m07.d06:meMA.Ode5C11.greekmelody	@ltx/en_us_oca/he.h.m8:heHE.OrthrizontesVoomenSoi.greekname
ltx/en_us_oca/me.m07.d06:meMA.Ode5C11.incipit	…
ltx/en_us_oca/me.m07.d06:meMA.Ode5C11.melody	@ltx/en_us_oca/he.h.m8:heHE.OrthrizontesVoomenSoi.notmetered
ltx/en_us_oca/me.m07.d06:meMA.Ode5C11.mode	@ltx/en_us_oca/miscellanea:misc.Mode8
ltx/en_us_oca/me.m07.d06:meMA.Ode5C11.ode	@ltx/en_us_oca/miscellanea:misc.Ode5
ltx/en_us_oca/me.m07.d06:meMA.Ode5C11.text	
ltx/en_us_oca/me.m07.d06:meMA.Ode5C12.incipit	…
ltx/en_us_oca/me.m07.d06:meMA.Ode5C12.melody	@ltx/en_us_oca/he.h.m8:heHE.OrthrizontesVoomenSoi.notmetered
ltx/en_us_oca/me.m07.d06:meMA.Ode5C12.mode	@ltx/en_us_oca/miscellanea:misc.Mode8
ltx/en_us_oca/me.m07.d06:meMA.Ode5C12.ode	@ltx/en_us_oca/miscellanea:misc.Ode5
ltx/en_us_oca/me.m07.d06:meMA.Ode5C12.text	
ltx/en_us_oca/me.m07.d06:meMA.Ode5C1T.incipit	…
ltx/en_us_oca/me.m07.d06:meMA.Ode5C1T.melody	@ltx/en_us_oca/he.h.m8:heHE.OrthrizontesVoomenSoi.notmetered
ltx/en_us_oca/me.m07.d06:meMA.Ode5C1T.mode	@ltx/en_us_oca/miscellanea:misc.Mode8
ltx/en_us_oca/me.m07.d06:meMA.Ode5C1T.ode	@ltx/en_us_oca/miscellanea:misc.Ode5
ltx/en_us_oca/me.m07.d06:meMA.Ode5C1T.text	
ltx/en_us_oca/me.m07.d06:meMA.Ode6C11.greekmelody	@ltx/en_us_oca/he.h.m8:heHE.IlasthitiMoiSotir.greekname
ltx/en_us_oca/me.m07.d06:meMA.Ode6C11.incipit	…
ltx/en_us_oca/me.m07.d06:meMA.Ode6C11.melody	@ltx/en_us_oca/he.h.m8:heHE.IlasthitiMoiSotir.notmetered
ltx/en_us_oca/me.m07.d06:meMA.Ode6C11.mode	@ltx/en_us_oca/miscellanea:misc.Mode8
ltx/en_us_oca/me.m07.d06:meMA.Ode6C11.ode	@ltx/en_us_oca/miscellanea:misc.Ode6
ltx/en_us_oca/me.m07.d06:meMA.Ode6C11.text	
ltx/en_us_oca/me.m07.d06:meMA.Ode6C12.incipit	…
ltx/en_us_oca/me.m07.d06:meMA.Ode6C12.melody	@ltx/en_us_oca/he.h.m8:heHE.IlasthitiMoiSotir.notmetered
ltx/en_us_oca/me.m07.d06:meMA.Ode6C12.mode	@ltx/en_us_oca/miscellanea:misc.Mode8
ltx/en_us_oca/me.m07.d06:meMA.Ode6C12.ode	@ltx/en_us_oca/miscellanea:misc.Ode6
ltx/en_us_oca/me.m07.d06:meMA.Ode6C12.text	
ltx/en_us_oca/me.m07.d06:meMA.Ode6C13.incipit	…
ltx/en_us_oca/me.m07.d06:meMA.Ode6C13.melody	@ltx/en_us_oca/he.h.m8:heHE.IlasthitiMoiSotir.notmetered
ltx/en_us_oca/me.m07.d06:meMA.Ode6C13.mode	@ltx/en_us_oca/miscellanea:misc.Mode8
ltx/en_us_oca/me.m07.d06:meMA.Ode6C13.ode	@ltx/en_us_oca/miscellanea:misc.Ode6
ltx/en_us_oca/me.m07.d06:meMA.Ode6C13.text	
ltx/en_us_oca/me.m07.d06:meMA.Ode6C1T.incipit	…
ltx/en_us_oca/me.m07.d06:meMA.Ode6C1T.melody	@ltx/en_us_oca/he.h.m8:heHE.IlasthitiMoiSotir.notmetered
ltx/en_us_oca/me.m07.d06:meMA.Ode6C1T.mode	@ltx/en_us_oca/miscellanea:misc.Mode8
ltx/en_us_oca/me.m07.d06:meMA.Ode6C1T.ode	@ltx/en_us_oca/miscellanea:misc.Ode6
ltx/en_us_oca/me.m07.d06:meMA.Ode6C1T.text	
ltx/en_us_oca/me.m07.d06:meMA.Ode6H.greekmelody	@ltx/en_us_oca/he.h.m8:heHE.IlasthitiMoiSotir.greekname
ltx/en_us_oca/me.m07.d06:meMA.Ode6H.incipit	@ltx/en_us_oca/he.h.m8:heHE.IlasthitiMoiSotir.incipit
ltx/en_us_oca/me.m07.d06:meMA.Ode6H.melody	@ltx/en_us_oca/he.h.m8:heHE.IlasthitiMoiSotir.melody
ltx/en_us_oca/me.m07.d06:meMA.Ode6H.mode	@ltx/en_us_oca/miscellanea:misc.Mode8
ltx/en_us_oca/me.m07.d06:meMA.Ode6H.ode	@ltx/en_us_oca/miscellanea:misc.Ode6
ltx/en_us_oca/me.m07.d06:meMA.Ode6H.text	@ltx/en_us_oca/he.h.m8:heHE.IlasthitiMoiSotir.text
ltx/en_us_oca/me.m07.d06:meMA.Ode7C11.greekmelody	@ltx/en_us_oca/he.h.m8:heHE.PaidesEvraion.greekname
ltx/en_us_oca/me.m07.d06:meMA.Ode7C11.incipit	…
ltx/en_us_oca/me.m07.d06:meMA.Ode7C11.melody	@ltx/en_us_oca/he.h.m8:heHE.PaidesEvraion.notmetered
ltx/en_us_oca/me.m07.d06:meMA.Ode7C11.mode	@ltx/en_us_oca/miscellanea:misc.Mode8
ltx/en_us_oca/me.m07.d06:meMA.Ode7C11.ode	@ltx/en_us_oca/miscellanea:misc.Ode7
ltx/en_us_oca/me.m07.d06:meMA.Ode7C11.text	
ltx/en_us_oca/me.m07.d06:meMA.Ode7C12.incipit	…
ltx/en_us_oca/me.m07.d06:meMA.Ode7C12.melody	@ltx/en_us_oca/he.h.m8:heHE.PaidesEvraion.notmetered
ltx/en_us_oca/me.m07.d06:meMA.Ode7C12.mode	@ltx/en_us_oca/miscellanea:misc.Mode8
ltx/en_us_oca/me.m07.d06:meMA.Ode7C12.ode	@ltx/en_us_oca/miscellanea:misc.Ode7
ltx/en_us_oca/me.m07.d06:meMA.Ode7C12.text	
ltx/en_us_oca/me.m07.d06:meMA.Ode7C1T.incipit	…
ltx/en_us_oca/me.m07.d06:meMA.Ode7C1T.melody	@ltx/en_us_oca/he.h.m8:heHE.PaidesEvraion.notmetered
ltx/en_us_oca/me.m07.d06:meMA.Ode7C1T.mode	@ltx/en_us_oca/miscellanea:misc.Mode8
ltx/en_us_oca/me.m07.d06:meMA.Ode7C1T.ode	@ltx/en_us_oca/miscellanea:misc.Ode7
ltx/en_us_oca/me.m07.d06:meMA.Ode7C1T.text	
ltx/en_us_oca/me.m07.d06:meMA.Ode8C11.greekmelody	@ltx/en_us_oca/he.h.m8:heHE.EptaplasiosKaminon.greekname
ltx/en_us_oca/me.m07.d06:meMA.Ode8C11.incipit	…
ltx/en_us_oca/me.m07.d06:meMA.Ode8C11.melody	@ltx/en_us_oca/he.h.m8:heHE.EptaplasiosKaminon.notmetered
ltx/en_us_oca/me.m07.d06:meMA.Ode8C11.mode	@ltx/en_us_oca/miscellanea:misc.Mode8
ltx/en_us_oca/me.m07.d06:meMA.Ode8C11.ode	@ltx/en_us_oca/miscellanea:misc.Ode8
ltx/en_us_oca/me.m07.d06:meMA.Ode8C11.text	
ltx/en_us_oca/me.m07.d06:meMA.Ode8C12.incipit	…
ltx/en_us_oca/me.m07.d06:meMA.Ode8C12.melody	@ltx/en_us_oca/he.h.m8:heHE.EptaplasiosKaminon.notmetered
ltx/en_us_oca/me.m07.d06:meMA.Ode8C12.mode	@ltx/en_us_oca/miscellanea:misc.Mode8
ltx/en_us_oca/me.m07.d06:meMA.Ode8C12.ode	@ltx/en_us_oca/miscellanea:misc.Ode8
ltx/en_us_oca/me.m07.d06:meMA.Ode8C12.text	
ltx/en_us_oca/me.m07.d06:meMA.Ode8C13.incipit	…
ltx/en_us_oca/me.m07.d06:meMA.Ode8C13.melody	@ltx/en_us_oca/he.h.m8:heHE.EptaplasiosKaminon.notmetered
ltx/en_us_oca/me.m07.d06:meMA.Ode8C13.mode	@ltx/en_us_oca/miscellanea:misc.Mode8
ltx/en_us_oca/me.m07.d06:meMA.Ode8C13.ode	@ltx/en_us_oca/miscellanea:misc.Ode8
ltx/en_us_oca/me.m07.d06:meMA.Ode8C13.text	
ltx/en_us_oca/me.m07.d06:meMA.Ode8C1T.incipit	…
ltx/en_us_oca/me.m07.d06:meMA.Ode8C1T.melody	@ltx/en_us_oca/he.h.m8:heHE.EptaplasiosKaminon.notmetered
ltx/en_us_oca/me.m07.d06:meMA.Ode8C1T.mode	@ltx/en_us_oca/miscellanea:misc.Mode8
ltx/en_us_oca/me.m07.d06:meMA.Ode8C1T.ode	@ltx/en_us_oca/miscellanea:misc.Ode8
ltx/en_us_oca/me.m07.d06:meMA.Ode8C1T.text	
ltx/en_us_oca/me.m07.d06:meMA.Ode8H.greekmelody	@ltx/en_us_oca/he.h.m8:heHE.EptaplasiosKaminon.greekname
ltx/en_us_oca/me.m07.d06:meMA.Ode8H.incipit	@ltx/en_us_oca/he.h.m8:heHE.EptaplasiosKaminon.incipit
ltx/en_us_oca/me.m07.d06:meMA.Ode8H.melody	@ltx/en_us_oca/he.h.m8:heHE.EptaplasiosKaminon.melody
ltx/en_us_oca/me.m07.d06:meMA.Ode8H.mode	@ltx/en_us_oca/miscellanea:misc.Mode8
ltx/en_us_oca/me.m07.d06:meMA.Ode8H.ode	@ltx/en_us_oca/miscellanea:misc.Ode8
ltx/en_us_oca/me.m07.d06:meMA.Ode8H.text	@ltx/en_us_oca/he.h.m8:heHE.EptaplasiosKaminon.text
ltx/en_us_oca/me.m07.d06:meMA.Ode9C11.greekmelody	@ltx/en_us_oca/he.h.m8:heHE.EfrixePasaAkoi.greekname
ltx/en_us_oca/me.m07.d06:meMA.Ode9C11.incipit	…
ltx/en_us_oca/me.m07.d06:meMA.Ode9C11.melody	@ltx/en_us_oca/he.h.m8:heHE.EfrixePasaAkoi.notmetered
ltx/en_us_oca/me.m07.d06:meMA.Ode9C11.mode	@ltx/en_us_oca/miscellanea:misc.Mode8
ltx/en_us_oca/me.m07.d06:meMA.Ode9C11.ode	@ltx/en_us_oca/miscellanea:misc.Ode9
ltx/en_us_oca/me.m07.d06:meMA.Ode9C11.text	
ltx/en_us_oca/me.m07.d06:meMA.Ode9C12.incipit	…
ltx/en_us_oca/me.m07.d06:meMA.Ode9C12.melody	@ltx/en_us_oca/he.h.m8:heHE.EfrixePasaAkoi.notmetered
ltx/en_us_oca/me.m07.d06:meMA.Ode9C12.mode	@ltx/en_us_oca/miscellanea:misc.Mode8
ltx/en_us_oca/me.m07.d06:meMA.Ode9C12.ode	@ltx/en_us_oca/miscellanea:misc.Ode9
ltx/en_us_oca/me.m07.d06:meMA.Ode9C12.text	
ltx/en_us_oca/me.m07.d06:meMA.Ode9C13.incipit	…
ltx/en_us_oca/me.m07.d06:meMA.Ode9C13.melody	@ltx/en_us_oca/he.h.m8:heHE.EfrixePasaAkoi.notmetered
ltx/en_us_oca/me.m07.d06:meMA.Ode9C13.mode	@ltx/en_us_oca/miscellanea:misc.Mode8
ltx/en_us_oca/me.m07.d06:meMA.Ode9C13.ode	@ltx/en_us_oca/miscellanea:misc.Ode9
ltx/en_us_oca/me.m07.d06:meMA.Ode9C13.text	
ltx/en_us_oca/me.m07.d06:meMA.Ode9C1T.incipit	…
ltx/en_us_oca/me.m07.d06:meMA.Ode9C1T.melody	@ltx/en_us_oca/he.h.m8:heHE.EfrixePasaAkoi.notmetered
ltx/en_us_oca/me.m07.d06:meMA.Ode9C1T.mode	@ltx/en_us_oca/miscellanea:misc.Mode8
ltx/en_us_oca/me.m07.d06:meMA.Ode9C1T.ode	@ltx/en_us_oca/miscellanea:misc.Ode9
ltx/en_us_oca/me.m07.d06:meMA.Ode9C1T.text	
ltx/en_us_oca/me.m07.d06:meMA.Ode9H.greekmelody	@ltx/en_us_oca/he.h.m8:heHE.EfrixePasaAkoi.greekname
ltx/en_us_oca/me.m07.d06:meMA.Ode9H.incipit	@ltx/en_us_oca/he.h.m8:heHE.EfrixePasaAkoi.incipit
ltx/en_us_oca/me.m07.d06:meMA.Ode9H.melody	@ltx/en_us_oca/he.h.m8:heHE.EfrixePasaAkoi.melody
ltx/en_us_oca/me.m07.d06:meMA.Ode9H.mode	@ltx/en_us_oca/miscellanea:misc.Mode8
ltx/en_us_oca/me.m07.d06:meMA.Ode9H.ode	@ltx/en_us_oca/miscellanea:misc.Ode9
ltx/en_us_oca/me.m07.d06:meMA.Ode9H.text	@ltx/en_us_oca/he.h.m8:heHE.EfrixePasaAkoi.text
ltx/en_us_oca/me.m07.d06:meVE.Apolytikion1.greekmelody	@ltx/en_us_oca/he.ga:heGA.TisErimouPolitis.greekmelody
ltx/en_us_oca/me.m07.d06:meVE.Apolytikion1.melody	@ltx/en_us_oca/he.ga:heGA.TisErimouPolitis.name
ltx/en_us_oca/me.m07.d06:meVE.Apolytikion1.mode	@ltx/en_us_oca/miscellanea:misc.Mode1
ltx/en_us_oca/me.m07.d06:meVE.Apolytikion2ger.greekmelody	@ltx/en_us_oca/he.a.m5:heAU.TonSynanarchonLogon.greekname
ltx/en_us_oca/me.m07.d06:meVE.Apolytikion2ger.incipit	…
ltx/en_us_oca/me.m07.d06:meVE.Apolytikion2ger.melody	@ltx/en_us_oca/he.a.m5:heAU.TonSynanarchonLogon.notmetered
ltx/en_us_oca/me.m07.d06:meVE.Apolytikion2ger.mode	@ltx/en_us_oca/miscellanea:misc.Mode5
ltx/en_us_oca/me.m07.d06:meVE.Apolytikion2ger.poet	@ltx/en_us_oca/poets:po.Gerasimou
ltx/en_us_oca/me.m07.d06:meVE.Apolytikion2ger.text	
ltx/en_us_oca/me.m07.d06:meVE.GeneralApolytikion1.name	
ltx/en_us_oca/me.m07.d06:meVE.SticStavrotheotokion.greekmelody	@ltx/en_us_oca/he.a.m4:heAU.EdokasSimeiosin.greekname
ltx/en_us_oca/me.m07.d06:meVE.SticStavrotheotokion.incipit	…
ltx/en_us_oca/me.m07.d06:meVE.SticStavrotheotokion.melody	@ltx/en_us_oca/he.a.m4:heAU.EdokasSimeiosin.notmetered
ltx/en_us_oca/me.m07.d06:meVE.SticStavrotheotokion.mode	@ltx/en_us_oca/miscellanea:misc.Mode4
ltx/en_us_oca/me.m07.d06:meVE.SticStavrotheotokion.text	
ltx/en_us_oca/me.m07.d06:meVE.SticTheotokion.greekmelody	@ltx/en_us_oca/he.a.m4:heAU.EdokasSimeiosin.greekname
ltx/en_us_oca/me.m07.d06:meVE.SticTheotokion.incipit	@ltx/en_us_oca/me.m06.d23:meVE.SticTheotokion.incipit
ltx/en_us_oca/me.m07.d06:meVE.SticTheotokion.melody	@ltx/en_us_oca/he.a.m4:heAU.EdokasSimeiosin.notmetered
ltx/en_us_oca/me.m07.d06:meVE.SticTheotokion.mode	@ltx/en_us_oca/miscellanea:misc.Mode4
ltx/en_us_oca/me.m07.d06:meVE.SticTheotokion.text	@ltx/en_us_oca/me.m06.d23:meVE.SticTheotokion.text
ltx/en_us_oca/me.m07.d06:meVE.Stichera01.greekmelody	@ltx/en_us_oca/he.a.m4:heAU.EdokasSimeiosin.greekname
ltx/en_us_oca/me.m07.d06:meVE.Stichera01.incipit	Your all-festive commemoration, venerable one…
ltx/en_us_oca/me.m07.d06:meVE.Stichera01.melody	@ltx/en_us_oca/he.a.m4:heAU.EdokasSimeiosin.notmetered
ltx/en_us_oca/me.m07.d06:meVE.Stichera01.mode	@ltx/en_us_oca/miscellanea:misc.Mode4
ltx/en_us_oca/me.m07.d06:meVE.Stichera01.text	Your all-festive commemoration, venerable one, ⁄ has shone forth brightly like the sun! ⁄ It enlightens the thoughts of the faithful ⁄ with the splendor of your wonders ⁄ and brightens them with the rays of your mighty works, all-blessed one! ⁄ Therefore in celebration we joyously honor you ⁄⁄ and faithfully bless you as the boast of monks!
ltx/en_us_oca/me.m07.d06:meVE.Stichera02.incipit	You lived as an earthly…
ltx/en_us_oca/me.m07.d06:meVE.Stichera02.melody	@ltx/en_us_oca/he.a.m4:heAU.EdokasSimeiosin.notmetered
ltx/en_us_oca/me.m07.d06:meVE.Stichera02.mode	@ltx/en_us_oca/miscellanea:misc.Mode4
ltx/en_us_oca/me.m07.d06:meVE.Stichera02.text	You lived as an earthly angel, most wealthy one, ⁄ Wasting your body as though it belonged to another. ⁄ You ever instructed yourself divinely, father, ⁄ with vigils and the remembrance of death. ⁄ You grew with great strides to your ultimate desire! ⁄⁄ You have indeed drawn near to perfection itself!
ltx/en_us_oca/me.m07.d06:meVE.Stichera03.incipit	At the time of your…
ltx/en_us_oca/me.m07.d06:meVE.Stichera03.melody	@ltx/en_us_oca/he.a.m4:heAU.EdokasSimeiosin.notmetered
ltx/en_us_oca/me.m07.d06:meVE.Stichera03.mode	@ltx/en_us_oca/miscellanea:misc.Mode4
ltx/en_us_oca/me.m07.d06:meVE.Stichera03.text	At the time of your dormition, Father, ⁄ an incomprehensible wonder took place: ⁄ A choir of angels stood at once before you; ⁄ your countenance, wise one, shone like the sun, ⁄ revealing your radiant form and the purity of your soul, ⁄⁄ showing all the manner of the repose you received!
