ltx/en_us_nkjv/bible:Acts.abbr	Acts
ltx/en_us_nkjv/bible:Acts.text	the Acts of the Apostles.
ltx/en_us_nkjv/bible:Amos.abbr	
ltx/en_us_nkjv/bible:Amos.text	the Prophecy of Amos.
ltx/en_us_nkjv/bible:Chronicles1.abbr	
ltx/en_us_nkjv/bible:Chronicles1.text	
ltx/en_us_nkjv/bible:Chronicles2.abbr	
ltx/en_us_nkjv/bible:Chronicles2.text	
ltx/en_us_nkjv/bible:Colossians.abbr	
ltx/en_us_nkjv/bible:Colossians.text	Paul’s Letter to the Colossians.
ltx/en_us_nkjv/bible:Corinthians1.abbr	
ltx/en_us_nkjv/bible:Corinthians1.text	Paul’s First Letter to the Corinthians.
ltx/en_us_nkjv/bible:Corinthians2.abbr	
ltx/en_us_nkjv/bible:Corinthians2.text	Paul’s Second Letter to the Corinthians.
ltx/en_us_nkjv/bible:Daniel.abbr	
ltx/en_us_nkjv/bible:Daniel.text	the Prophecy of Daniel.
ltx/en_us_nkjv/bible:Deuteronomy.abbr	
ltx/en_us_nkjv/bible:Deuteronomy.text	the book of Deuteronomy.
ltx/en_us_nkjv/bible:Ecclesiastes.abbr	
ltx/en_us_nkjv/bible:Ecclesiastes.text	
ltx/en_us_nkjv/bible:Ephesians.abbr	
ltx/en_us_nkjv/bible:Ephesians.text	Paul’s Letter to the Ephesians.
ltx/en_us_nkjv/bible:Esther.abbr	
ltx/en_us_nkjv/bible:Esther.text	
ltx/en_us_nkjv/bible:Exodus.abbr	
ltx/en_us_nkjv/bible:Exodus.text	the book of Exodus.
ltx/en_us_nkjv/bible:Ezekiel.abbr	
ltx/en_us_nkjv/bible:Ezekiel.text	the Prophecy of Ezekiel.
ltx/en_us_nkjv/bible:Ezra.abbr	
ltx/en_us_nkjv/bible:Ezra.text	
ltx/en_us_nkjv/bible:Galatians.abbr	
ltx/en_us_nkjv/bible:Galatians.text	Paul’s Letter to the Galatians.
ltx/en_us_nkjv/bible:Genesis.abbr	
ltx/en_us_nkjv/bible:Genesis.text	the book of Genesis.
ltx/en_us_nkjv/bible:Habakkuk.abbr	
ltx/en_us_nkjv/bible:Habakkuk.text	the Prophecy of Habakkuk.
ltx/en_us_nkjv/bible:Haggai.abbr	
ltx/en_us_nkjv/bible:Haggai.text	the Prophecy of Haggai.
ltx/en_us_nkjv/bible:Hebrews.abbr	
ltx/en_us_nkjv/bible:Hebrews.text	Paul’s Letter to the Hebrews.
ltx/en_us_nkjv/bible:Hosea.abbr	
ltx/en_us_nkjv/bible:Hosea.text	the Prophecy of Hosea.
ltx/en_us_nkjv/bible:Isaiah.abbr	
ltx/en_us_nkjv/bible:Isaiah.text	the Prophecy of Isaiah.
ltx/en_us_nkjv/bible:James.abbr	
ltx/en_us_nkjv/bible:James.text	the Universal Letter of James.
ltx/en_us_nkjv/bible:Jeremiah.abbr	
ltx/en_us_nkjv/bible:Jeremiah.text	the Prophecy of Jeremiah.
ltx/en_us_nkjv/bible:Job.abbr	
ltx/en_us_nkjv/bible:Job.text	the book of Job.
ltx/en_us_nkjv/bible:Joel.abbr	
ltx/en_us_nkjv/bible:Joel.text	the Prophecy of Joel.
ltx/en_us_nkjv/bible:John.abbr	John
ltx/en_us_nkjv/bible:John.text	John.
ltx/en_us_nkjv/bible:John1.abbr	
ltx/en_us_nkjv/bible:John1.text	John’s First Universal Letter.
ltx/en_us_nkjv/bible:John2.abbr	
ltx/en_us_nkjv/bible:John2.text	John’s Second Universal Letter.
ltx/en_us_nkjv/bible:John3.abbr	
ltx/en_us_nkjv/bible:John3.text	John’s Third Universal Letter.
ltx/en_us_nkjv/bible:Jonah.abbr	
ltx/en_us_nkjv/bible:Jonah.text	the Prophecy of Jonah.
ltx/en_us_nkjv/bible:Joshua.abbr	
ltx/en_us_nkjv/bible:Joshua.text	the book of Joshua.
ltx/en_us_nkjv/bible:Jude.abbr	
ltx/en_us_nkjv/bible:Jude.text	the Universal Letter of Jude.
ltx/en_us_nkjv/bible:Judges.abbr	
ltx/en_us_nkjv/bible:Judges.text	the book of Judges.
ltx/en_us_nkjv/bible:Kings1.abbr	
ltx/en_us_nkjv/bible:Kings1.text	the First Book of Kings.
ltx/en_us_nkjv/bible:Kings2.abbr	
ltx/en_us_nkjv/bible:Kings2.text	the Second Book of Kings.
ltx/en_us_nkjv/bible:Lamentations.abbr	
ltx/en_us_nkjv/bible:Lamentations.text	Lamentations.
ltx/en_us_nkjv/bible:Leviticus.abbr	
ltx/en_us_nkjv/bible:Leviticus.text	the book of Leviticus.
ltx/en_us_nkjv/bible:Luke.abbr	Luke
ltx/en_us_nkjv/bible:Luke.text	Luke.
ltx/en_us_nkjv/bible:Malachi.abbr	
ltx/en_us_nkjv/bible:Malachi.text	the Prophecy of Malachi.
ltx/en_us_nkjv/bible:Mark.abbr	Mark
ltx/en_us_nkjv/bible:Mark.text	Mark.
ltx/en_us_nkjv/bible:Matthew.abbr	Matt.
ltx/en_us_nkjv/bible:Matthew.text	Matthew.
ltx/en_us_nkjv/bible:Micah.abbr	
ltx/en_us_nkjv/bible:Micah.text	the Prophecy of Micah.
ltx/en_us_nkjv/bible:Nahum.abbr	
ltx/en_us_nkjv/bible:Nahum.text	the Prophecy of Nahum.
ltx/en_us_nkjv/bible:Nehemiah.abbr	
ltx/en_us_nkjv/bible:Nehemiah.text	
ltx/en_us_nkjv/bible:Numbers.abbr	
ltx/en_us_nkjv/bible:Numbers.text	the book of Numbers.
ltx/en_us_nkjv/bible:Obadiah.abbr	
ltx/en_us_nkjv/bible:Obadiah.text	the Prophecy of Obadiah.
ltx/en_us_nkjv/bible:Peter1.abbr	
ltx/en_us_nkjv/bible:Peter1.text	Peter’s First Universal Letter.
ltx/en_us_nkjv/bible:Peter2.abbr	
ltx/en_us_nkjv/bible:Peter2.text	Peter’s Second Universal Letter.
ltx/en_us_nkjv/bible:Philemon.abbr	
ltx/en_us_nkjv/bible:Philemon.text	Paul’s Letter to Philemon.
ltx/en_us_nkjv/bible:Philippians.abbr	
ltx/en_us_nkjv/bible:Philippians.text	Paul’s Letter to the Philippians.
ltx/en_us_nkjv/bible:Proverbs.abbr	
ltx/en_us_nkjv/bible:Proverbs.text	the book of Proverbs.
ltx/en_us_nkjv/bible:Psalms.abbr	
ltx/en_us_nkjv/bible:Psalms.text	
ltx/en_us_nkjv/bible:Revelation.abbr	
ltx/en_us_nkjv/bible:Revelation.text	
ltx/en_us_nkjv/bible:Romans.abbr	
ltx/en_us_nkjv/bible:Romans.text	Paul’s Letter to the Romans.
ltx/en_us_nkjv/bible:Ruth.abbr	
ltx/en_us_nkjv/bible:Ruth.text	
ltx/en_us_nkjv/bible:Samuel1.abbr	
ltx/en_us_nkjv/bible:Samuel1.text	the First Book of Samuel.
ltx/en_us_nkjv/bible:Samuel2.abbr	
ltx/en_us_nkjv/bible:Samuel2.text	the Second Book of Samuel.
ltx/en_us_nkjv/bible:Song.abbr	
ltx/en_us_nkjv/bible:Song.text	
ltx/en_us_nkjv/bible:Thessalonians1.abbr	
ltx/en_us_nkjv/bible:Thessalonians1.text	Paul’s First Letter to the Thessalonians.
ltx/en_us_nkjv/bible:Thessalonians2.abbr	
ltx/en_us_nkjv/bible:Thessalonians2.text	Paul’s Second Letter to the Thessalonians.
ltx/en_us_nkjv/bible:Timothy1.abbr	
ltx/en_us_nkjv/bible:Timothy1.text	Paul’s First Letter to Timothy.
ltx/en_us_nkjv/bible:Timothy2.abbr	
ltx/en_us_nkjv/bible:Timothy2.text	Paul’s Second Letter to Timothy.
ltx/en_us_nkjv/bible:Titus.abbr	
ltx/en_us_nkjv/bible:Titus.text	Paul’s Letter to Titus.
ltx/en_us_nkjv/bible:Wisdom.abbr	
ltx/en_us_nkjv/bible:Wisdom.text	the Wisdom of Solomon.
ltx/en_us_nkjv/bible:Zechariah.abbr	
ltx/en_us_nkjv/bible:Zechariah.text	the Prophecy of Zechariah.
ltx/en_us_nkjv/bible:Zephaniah.abbr	
ltx/en_us_nkjv/bible:Zephaniah.text	the Prophecy of Zephaniah.
