ltx/en_us_mlgs/he.a.m1:heAU.ChorosAngelikos.greekname	
ltx/en_us_mlgs/he.a.m1:heAU.ChorosAngelikos.incipit	In heaven be amazed…
ltx/en_us_mlgs/he.a.m1:heAU.ChorosAngelikos.melody	@ltx/en_us_mlgs/miscellanea:misc.Automelon
ltx/en_us_mlgs/he.a.m1:heAU.ChorosAngelikos.mode	@ltx/en_us_mlgs/miscellanea:misc.Mode1
ltx/en_us_mlgs/he.a.m1:heAU.ChorosAngelikos.name	In heaven be amazed.
ltx/en_us_mlgs/he.a.m1:heAU.ChorosAngelikos.notmetered	N/M (In heaven.)
ltx/en_us_mlgs/he.a.m1:heAU.ChorosAngelikostext	
ltx/en_us_mlgs/he.a.m1:heAU.NefelinSeFotos.greekname	
ltx/en_us_mlgs/he.a.m1:heAU.NefelinSeFotos.incipit	Nefelin Se Fotos…
ltx/en_us_mlgs/he.a.m1:heAU.NefelinSeFotos.melody	@ltx/en_us_mlgs/miscellanea:misc.Automelon
ltx/en_us_mlgs/he.a.m1:heAU.NefelinSeFotos.mode	@ltx/en_us_mlgs/miscellanea:misc.Mode1
ltx/en_us_mlgs/he.a.m1:heAU.NefelinSeFotos.name	Nefelin Se Fotos.
ltx/en_us_mlgs/he.a.m1:heAU.NefelinSeFotos.notmetered	N/M (Nefelin Se Fotos)
ltx/en_us_mlgs/he.a.m1:heAU.NefelinSeFotostext	
ltx/en_us_mlgs/he.a.m1:heAU.OTouParadoxouThavmatos.greekname	
ltx/en_us_mlgs/he.a.m1:heAU.OTouParadoxouThavmatos.incipit	What a paradoxical miracle…
ltx/en_us_mlgs/he.a.m1:heAU.OTouParadoxouThavmatos.melody	@ltx/en_us_mlgs/miscellanea:misc.Automelon
ltx/en_us_mlgs/he.a.m1:heAU.OTouParadoxouThavmatos.mode	@ltx/en_us_mlgs/miscellanea:misc.Mode1
ltx/en_us_mlgs/he.a.m1:heAU.OTouParadoxouThavmatos.name	What a paradoxical miracle.
ltx/en_us_mlgs/he.a.m1:heAU.OTouParadoxouThavmatos.notmetered	N/M (What a paradoxical.)
ltx/en_us_mlgs/he.a.m1:heAU.OTouParadoxouThavmatostext	
ltx/en_us_mlgs/he.a.m1:heAU.OtanElthisOTheos.greekname	
ltx/en_us_mlgs/he.a.m1:heAU.OtanElthisOTheos.incipit	When You come down…
ltx/en_us_mlgs/he.a.m1:heAU.OtanElthisOTheos.melody	@ltx/en_us_mlgs/miscellanea:misc.Automelon
ltx/en_us_mlgs/he.a.m1:heAU.OtanElthisOTheos.mode	@ltx/en_us_mlgs/miscellanea:misc.Mode1
ltx/en_us_mlgs/he.a.m1:heAU.OtanElthisOTheos.name	When You come down.
ltx/en_us_mlgs/he.a.m1:heAU.OtanElthisOTheos.notmetered	N/M (When You come down.)
ltx/en_us_mlgs/he.a.m1:heAU.OtanElthisOTheostext	
ltx/en_us_mlgs/he.a.m1:heAU.PaneffimoiMartyres.greekname	
ltx/en_us_mlgs/he.a.m1:heAU.PaneffimoiMartyres.incipit	O Martyrs, extolled…
ltx/en_us_mlgs/he.a.m1:heAU.PaneffimoiMartyres.melody	@ltx/en_us_mlgs/miscellanea:misc.Automelon
ltx/en_us_mlgs/he.a.m1:heAU.PaneffimoiMartyres.mode	@ltx/en_us_mlgs/miscellanea:misc.Mode1
ltx/en_us_mlgs/he.a.m1:heAU.PaneffimoiMartyres.name	O Martyrs, extolled.
ltx/en_us_mlgs/he.a.m1:heAU.PaneffimoiMartyres.notmetered	N/M (O Martyrs, extolled.)
ltx/en_us_mlgs/he.a.m1:heAU.PaneffimoiMartyrestext	
ltx/en_us_mlgs/he.a.m1:heAU.TisErimouPolitis.greekname	
ltx/en_us_mlgs/he.a.m1:heAU.TisErimouPolitis.incipit	As a citizen of the desert…
ltx/en_us_mlgs/he.a.m1:heAU.TisErimouPolitis.melody	@ltx/en_us_mlgs/miscellanea:misc.Automelon
ltx/en_us_mlgs/he.a.m1:heAU.TisErimouPolitis.mode	@ltx/en_us_mlgs/miscellanea:misc.Mode1
ltx/en_us_mlgs/he.a.m1:heAU.TisErimouPolitis.name	As a citizen of the desert.
ltx/en_us_mlgs/he.a.m1:heAU.TisErimouPolitis.notmetered	N/M (As a citizen.)
ltx/en_us_mlgs/he.a.m1:heAU.TisErimouPolitistext	
ltx/en_us_mlgs/he.a.m1:heAU.TonOuranionTagmaton.greekname	
ltx/en_us_mlgs/he.a.m1:heAU.TonOuranionTagmaton.incipit	For all the powers of heaven…
ltx/en_us_mlgs/he.a.m1:heAU.TonOuranionTagmaton.melody	@ltx/en_us_mlgs/miscellanea:misc.Automelon
ltx/en_us_mlgs/he.a.m1:heAU.TonOuranionTagmaton.mode	@ltx/en_us_mlgs/miscellanea:misc.Mode1
ltx/en_us_mlgs/he.a.m1:heAU.TonOuranionTagmaton.name	For all the powers of heaven.
ltx/en_us_mlgs/he.a.m1:heAU.TonOuranionTagmaton.notmetered	N/M (For all the powers.)
ltx/en_us_mlgs/he.a.m1:heAU.TonOuranionTagmatontext	
ltx/en_us_mlgs/he.a.m1:heAU.TonTafonSouSotir.greekname	
ltx/en_us_mlgs/he.a.m1:heAU.TonTafonSouSotir.incipit	The soldiers keeping watch…
ltx/en_us_mlgs/he.a.m1:heAU.TonTafonSouSotir.melody	@ltx/en_us_mlgs/miscellanea:misc.Automelon
ltx/en_us_mlgs/he.a.m1:heAU.TonTafonSouSotir.mode	@ltx/en_us_mlgs/miscellanea:misc.Mode1
ltx/en_us_mlgs/he.a.m1:heAU.TonTafonSouSotir.name	The soldiers keeping watch.
ltx/en_us_mlgs/he.a.m1:heAU.TonTafonSouSotir.notmetered	N/M (The soldiers.)
ltx/en_us_mlgs/he.a.m1:heAU.TonTafonSouSotirtext	
ltx/en_us_mlgs/he.a.m1:heAU.TouLithouSfragisthentos.greekname	
ltx/en_us_mlgs/he.a.m1:heAU.TouLithouSfragisthentos.incipit	The stone had been secured…
ltx/en_us_mlgs/he.a.m1:heAU.TouLithouSfragisthentos.melody	@ltx/en_us_mlgs/miscellanea:misc.Automelon
ltx/en_us_mlgs/he.a.m1:heAU.TouLithouSfragisthentos.mode	@ltx/en_us_mlgs/miscellanea:misc.Mode1
ltx/en_us_mlgs/he.a.m1:heAU.TouLithouSfragisthentos.name	The stone had been secured.
ltx/en_us_mlgs/he.a.m1:heAU.TouLithouSfragisthentos.notmetered	N/M (The stone.)
ltx/en_us_mlgs/he.a.m1:heAU.TouLithouSfragisthentostext	
ltx/en_us_mlgs/he.a.m1:heAU.title	Automela of Mode 1
