ltx/en_us_houpos/he.h.m2:heHE.AkikoaKyrieTinEndoxon.greekname	
ltx/en_us_houpos/he.h.m2:heHE.AkikoaKyrieTinEndoxon.incipit	…
ltx/en_us_houpos/he.h.m2:heHE.AkikoaKyrieTinEndoxon.melody	@ltx/en_us_houpos/miscellanea:misc.Heirmos
ltx/en_us_houpos/he.h.m2:heHE.AkikoaKyrieTinEndoxon.mode	@ltx/en_us_houpos/miscellanea:misc.Mode2
ltx/en_us_houpos/he.h.m2:heHE.AkikoaKyrieTinEndoxon.name	
ltx/en_us_houpos/he.h.m2:heHE.AkikoaKyrieTinEndoxon.notmetered	N/M ()
ltx/en_us_houpos/he.h.m2:heHE.AkikoaKyrieTinEndoxon.ode	@ltx/en_us_houpos/miscellanea:misc.Ode4
ltx/en_us_houpos/he.h.m2:heHE.AkikoaKyrieTinEndoxon.text	
ltx/en_us_houpos/he.h.m2:heHE.AkikoeKyrieFonisSou.greekname	
ltx/en_us_houpos/he.h.m2:heHE.AkikoeKyrieFonisSou.incipit	When You thundered…
ltx/en_us_houpos/he.h.m2:heHE.AkikoeKyrieFonisSou.melody	@ltx/en_us_houpos/miscellanea:misc.Heirmos
ltx/en_us_houpos/he.h.m2:heHE.AkikoeKyrieFonisSou.mode	@ltx/en_us_houpos/miscellanea:misc.Mode2
ltx/en_us_houpos/he.h.m2:heHE.AkikoeKyrieFonisSou.name	When You thundered.
ltx/en_us_houpos/he.h.m2:heHE.AkikoeKyrieFonisSou.notmetered	N/M (When You thundered.)
ltx/en_us_houpos/he.h.m2:heHE.AkikoeKyrieFonisSou.ode	@ltx/en_us_houpos/miscellanea:misc.Ode4
ltx/en_us_houpos/he.h.m2:heHE.AkikoeKyrieFonisSou.text	
ltx/en_us_houpos/he.h.m2:heHE.AnarchouGennitoros.greekname	
ltx/en_us_houpos/he.h.m2:heHE.AnarchouGennitoros.incipit	To us was revealed…
ltx/en_us_houpos/he.h.m2:heHE.AnarchouGennitoros.melody	@ltx/en_us_houpos/miscellanea:misc.Heirmos
ltx/en_us_houpos/he.h.m2:heHE.AnarchouGennitoros.mode	@ltx/en_us_houpos/miscellanea:misc.Mode2
ltx/en_us_houpos/he.h.m2:heHE.AnarchouGennitoros.name	To us was revealed.
ltx/en_us_houpos/he.h.m2:heHE.AnarchouGennitoros.notmetered	N/M (To us was revealed.)
ltx/en_us_houpos/he.h.m2:heHE.AnarchouGennitoros.ode	@ltx/en_us_houpos/miscellanea:misc.Ode9
ltx/en_us_houpos/he.h.m2:heHE.AnarchouGennitoros.text	
ltx/en_us_houpos/he.h.m2:heHE.AntitheonProstagma.greekname	
ltx/en_us_houpos/he.h.m2:heHE.AntitheonProstagma.incipit	N/M…
ltx/en_us_houpos/he.h.m2:heHE.AntitheonProstagma.melody	@ltx/en_us_houpos/miscellanea:misc.Heirmos
ltx/en_us_houpos/he.h.m2:heHE.AntitheonProstagma.mode	@ltx/en_us_houpos/miscellanea:misc.Mode2
ltx/en_us_houpos/he.h.m2:heHE.AntitheonProstagma.name	The godless decree.
ltx/en_us_houpos/he.h.m2:heHE.AntitheonProstagma.notmetered	N/M (The godless decree.)
ltx/en_us_houpos/he.h.m2:heHE.AntitheonProstagma.ode	@ltx/en_us_houpos/miscellanea:misc.Ode7
ltx/en_us_houpos/he.h.m2:heHE.AntitheonProstagma.text	
ltx/en_us_houpos/he.h.m2:heHE.AporeiPasaGlossa.greekname	
ltx/en_us_houpos/he.h.m2:heHE.AporeiPasaGlossa.incipit	Mortal tongues are unable…
ltx/en_us_houpos/he.h.m2:heHE.AporeiPasaGlossa.melody	@ltx/en_us_houpos/miscellanea:misc.Heirmos
ltx/en_us_houpos/he.h.m2:heHE.AporeiPasaGlossa.mode	@ltx/en_us_houpos/miscellanea:misc.Mode2
ltx/en_us_houpos/he.h.m2:heHE.AporeiPasaGlossa.name	Mortal tongues are unable.
ltx/en_us_houpos/he.h.m2:heHE.AporeiPasaGlossa.notmetered	N/M (Mortal tongues are unable.)
ltx/en_us_houpos/he.h.m2:heHE.AporeiPasaGlossa.ode	@ltx/en_us_houpos/miscellanea:misc.Ode9
ltx/en_us_houpos/he.h.m2:heHE.AporeiPasaGlossa.text	
ltx/en_us_houpos/he.h.m2:heHE.AsomenToKyrio.greekname	
ltx/en_us_houpos/he.h.m2:heHE.AsomenToKyrio.incipit	…
ltx/en_us_houpos/he.h.m2:heHE.AsomenToKyrio.melody	@ltx/en_us_houpos/miscellanea:misc.Heirmos
ltx/en_us_houpos/he.h.m2:heHE.AsomenToKyrio.mode	@ltx/en_us_houpos/miscellanea:misc.Mode2
ltx/en_us_houpos/he.h.m2:heHE.AsomenToKyrio.name	
ltx/en_us_houpos/he.h.m2:heHE.AsomenToKyrio.notmetered	N/M ()
ltx/en_us_houpos/he.h.m2:heHE.AsomenToKyrio.ode	@ltx/en_us_houpos/miscellanea:misc.Ode1
ltx/en_us_houpos/he.h.m2:heHE.AsomenToKyrio.text	
ltx/en_us_houpos/he.h.m2:heHE.AtriptonAsynithi.greekname	
ltx/en_us_houpos/he.h.m2:heHE.AtriptonAsynithi.incipit	When they had traversed…
ltx/en_us_houpos/he.h.m2:heHE.AtriptonAsynithi.melody	@ltx/en_us_houpos/miscellanea:misc.Heirmos
ltx/en_us_houpos/he.h.m2:heHE.AtriptonAsynithi.mode	@ltx/en_us_houpos/miscellanea:misc.Mode2
ltx/en_us_houpos/he.h.m2:heHE.AtriptonAsynithi.name	When they had traversed.
ltx/en_us_houpos/he.h.m2:heHE.AtriptonAsynithi.notmetered	N/M (When they had traversed.)
ltx/en_us_houpos/he.h.m2:heHE.AtriptonAsynithi.ode	@ltx/en_us_houpos/miscellanea:misc.Ode1
ltx/en_us_houpos/he.h.m2:heHE.AtriptonAsynithi.text	
ltx/en_us_houpos/he.h.m2:heHE.AvyssosAmartimaton.greekname	
ltx/en_us_houpos/he.h.m2:heHE.AvyssosAmartimaton.incipit	…
ltx/en_us_houpos/he.h.m2:heHE.AvyssosAmartimaton.melody	@ltx/en_us_houpos/miscellanea:misc.Heirmos
ltx/en_us_houpos/he.h.m2:heHE.AvyssosAmartimaton.mode	@ltx/en_us_houpos/miscellanea:misc.Mode2
ltx/en_us_houpos/he.h.m2:heHE.AvyssosAmartimaton.name	
ltx/en_us_houpos/he.h.m2:heHE.AvyssosAmartimaton.notmetered	N/M ()
ltx/en_us_houpos/he.h.m2:heHE.AvyssosAmartimaton.ode	@ltx/en_us_houpos/miscellanea:misc.Ode2
ltx/en_us_houpos/he.h.m2:heHE.AvyssosAmartimaton.text	
ltx/en_us_houpos/he.h.m2:heHE.DefteLaoi.greekname	
ltx/en_us_houpos/he.h.m2:heHE.DefteLaoi.incipit	Peoples, now come…
ltx/en_us_houpos/he.h.m2:heHE.DefteLaoi.melody	@ltx/en_us_houpos/miscellanea:misc.Heirmos
ltx/en_us_houpos/he.h.m2:heHE.DefteLaoi.mode	@ltx/en_us_houpos/miscellanea:misc.Mode2
ltx/en_us_houpos/he.h.m2:heHE.DefteLaoi.name	Peoples, now come.
ltx/en_us_houpos/he.h.m2:heHE.DefteLaoi.notmetered	N/M (Peoples, now come.)
ltx/en_us_houpos/he.h.m2:heHE.DefteLaoi.ode	@ltx/en_us_houpos/miscellanea:misc.Ode1
ltx/en_us_houpos/he.h.m2:heHE.DefteLaoi.text	
ltx/en_us_houpos/he.h.m2:heHE.EchthrouZofodous.greekname	
ltx/en_us_houpos/he.h.m2:heHE.EchthrouZofodous.incipit	Now that we are washed…
ltx/en_us_houpos/he.h.m2:heHE.EchthrouZofodous.melody	@ltx/en_us_houpos/miscellanea:misc.Heirmos
ltx/en_us_houpos/he.h.m2:heHE.EchthrouZofodous.mode	@ltx/en_us_houpos/miscellanea:misc.Mode2
ltx/en_us_houpos/he.h.m2:heHE.EchthrouZofodous.name	Now that we are washed.
ltx/en_us_houpos/he.h.m2:heHE.EchthrouZofodous.notmetered	N/M (Now that we are washed.)
ltx/en_us_houpos/he.h.m2:heHE.EchthrouZofodous.ode	@ltx/en_us_houpos/miscellanea:misc.Ode5
ltx/en_us_houpos/he.h.m2:heHE.EchthrouZofodous.text	
ltx/en_us_houpos/he.h.m2:heHE.EchthrouZofodous1.text	
ltx/en_us_houpos/he.h.m2:heHE.EchthrouZofodous1a.text	
ltx/en_us_houpos/he.h.m2:heHE.EchthrouZofodous1b.text	
ltx/en_us_houpos/he.h.m2:heHE.EchthrouZofodous2.text	
ltx/en_us_houpos/he.h.m2:heHE.EchthrouZofodous2a.text	
ltx/en_us_houpos/he.h.m2:heHE.EchthrouZofodous2b.text	
ltx/en_us_houpos/he.h.m2:heHE.EchthrouZofodous3.text	
ltx/en_us_houpos/he.h.m2:heHE.EchthrouZofodous3a.text	
ltx/en_us_houpos/he.h.m2:heHE.EchthrouZofodous3b.text	
ltx/en_us_houpos/he.h.m2:heHE.EchthrouZofodous4.text	
ltx/en_us_houpos/he.h.m2:heHE.EchthrouZofodous4a.text	
ltx/en_us_houpos/he.h.m2:heHE.EchthrouZofodous4b.text	
ltx/en_us_houpos/he.h.m2:heHE.EchthrouZofodous5.text	
ltx/en_us_houpos/he.h.m2:heHE.EchthrouZofodous5a.text	
ltx/en_us_houpos/he.h.m2:heHE.EchthrouZofodous5b.text	
ltx/en_us_houpos/he.h.m2:heHE.EflexeReithro.greekname	
ltx/en_us_houpos/he.h.m2:heHE.EflexeReithro.incipit	The Lord who impeded…
ltx/en_us_houpos/he.h.m2:heHE.EflexeReithro.melody	@ltx/en_us_houpos/miscellanea:misc.Heirmos
ltx/en_us_houpos/he.h.m2:heHE.EflexeReithro.mode	@ltx/en_us_houpos/miscellanea:misc.Mode2
ltx/en_us_houpos/he.h.m2:heHE.EflexeReithro.name	The Lord who impeded.
ltx/en_us_houpos/he.h.m2:heHE.EflexeReithro.notmetered	N/M (The Lord who impeded.)
ltx/en_us_houpos/he.h.m2:heHE.EflexeReithro.ode	@ltx/en_us_houpos/miscellanea:misc.Ode7
ltx/en_us_houpos/he.h.m2:heHE.EflexeReithro.text	
ltx/en_us_houpos/he.h.m2:heHE.EflexeReithro1.text	
ltx/en_us_houpos/he.h.m2:heHE.EflexeReithro1a.text	
ltx/en_us_houpos/he.h.m2:heHE.EflexeReithro1b.text	
ltx/en_us_houpos/he.h.m2:heHE.EflexeReithro2.text	
ltx/en_us_houpos/he.h.m2:heHE.EflexeReithro2a.text	
ltx/en_us_houpos/he.h.m2:heHE.EflexeReithro2b.text	
ltx/en_us_houpos/he.h.m2:heHE.EflexeReithro3.text	
ltx/en_us_houpos/he.h.m2:heHE.EflexeReithro3a.text	
ltx/en_us_houpos/he.h.m2:heHE.EflexeReithro3b.text	
ltx/en_us_houpos/he.h.m2:heHE.EflexeReithro4.text	
ltx/en_us_houpos/he.h.m2:heHE.EflexeReithro4a.text	
ltx/en_us_houpos/he.h.m2:heHE.EflexeReithro4b.text	
ltx/en_us_houpos/he.h.m2:heHE.EflexeReithro5.text	
ltx/en_us_houpos/he.h.m2:heHE.EflexeReithro5a.text	
ltx/en_us_houpos/he.h.m2:heHE.EflexeReithro5b.text	
ltx/en_us_houpos/he.h.m2:heHE.EfrixePaidonEvagon.greekname	
ltx/en_us_houpos/he.h.m2:heHE.EfrixePaidonEvagon.incipit	Fed with unending fuel…
ltx/en_us_houpos/he.h.m2:heHE.EfrixePaidonEvagon.melody	@ltx/en_us_houpos/miscellanea:misc.Heirmos
ltx/en_us_houpos/he.h.m2:heHE.EfrixePaidonEvagon.mode	@ltx/en_us_houpos/miscellanea:misc.Mode2
ltx/en_us_houpos/he.h.m2:heHE.EfrixePaidonEvagon.name	Fed with unending fuel.
ltx/en_us_houpos/he.h.m2:heHE.EfrixePaidonEvagon.notmetered	N/M (Fed with unending fuel.)
ltx/en_us_houpos/he.h.m2:heHE.EfrixePaidonEvagon.ode	@ltx/en_us_houpos/miscellanea:misc.Ode8
ltx/en_us_houpos/he.h.m2:heHE.EfrixePaidonEvagon.text	
ltx/en_us_houpos/he.h.m2:heHE.EikonosChrysis.greekname	
ltx/en_us_houpos/he.h.m2:heHE.EikonosChrysis.incipit	The image of gold…
ltx/en_us_houpos/he.h.m2:heHE.EikonosChrysis.melody	@ltx/en_us_houpos/miscellanea:misc.Heirmos
ltx/en_us_houpos/he.h.m2:heHE.EikonosChrysis.mode	@ltx/en_us_houpos/miscellanea:misc.Mode2
ltx/en_us_houpos/he.h.m2:heHE.EikonosChrysis.name	The image of gold.
ltx/en_us_houpos/he.h.m2:heHE.EikonosChrysis.notmetered	N/M (The image of gold.)
ltx/en_us_houpos/he.h.m2:heHE.EikonosChrysis.ode	@ltx/en_us_houpos/miscellanea:misc.Ode7
ltx/en_us_houpos/he.h.m2:heHE.EikonosChrysis.text	
ltx/en_us_houpos/he.h.m2:heHE.EisakikoaKyrieTinAkoin.greekname	
ltx/en_us_houpos/he.h.m2:heHE.EisakikoaKyrieTinAkoin.incipit	I have heard the report…
ltx/en_us_houpos/he.h.m2:heHE.EisakikoaKyrieTinAkoin.melody	@ltx/en_us_houpos/miscellanea:misc.Heirmos
ltx/en_us_houpos/he.h.m2:heHE.EisakikoaKyrieTinAkoin.mode	@ltx/en_us_houpos/miscellanea:misc.Mode2
ltx/en_us_houpos/he.h.m2:heHE.EisakikoaKyrieTinAkoin.name	I have heard the report.
ltx/en_us_houpos/he.h.m2:heHE.EisakikoaKyrieTinAkoin.notmetered	N/M (I have heard.)
ltx/en_us_houpos/he.h.m2:heHE.EisakikoaKyrieTinAkoin.ode	@ltx/en_us_houpos/miscellanea:misc.Ode4
ltx/en_us_houpos/he.h.m2:heHE.EisakikoaKyrieTinAkoin.text	
ltx/en_us_houpos/he.h.m2:heHE.EleftheraMenIKtisis.greekname	
ltx/en_us_houpos/he.h.m2:heHE.EleftheraMenIKtisis.incipit	Overjoyed is creation…
ltx/en_us_houpos/he.h.m2:heHE.EleftheraMenIKtisis.melody	@ltx/en_us_houpos/miscellanea:misc.Heirmos
ltx/en_us_houpos/he.h.m2:heHE.EleftheraMenIKtisis.mode	@ltx/en_us_houpos/miscellanea:misc.Mode2
ltx/en_us_houpos/he.h.m2:heHE.EleftheraMenIKtisis.name	Overjoyed is creation.
ltx/en_us_houpos/he.h.m2:heHE.EleftheraMenIKtisis.notmetered	N/M (Overjoyed is creation.)
ltx/en_us_houpos/he.h.m2:heHE.EleftheraMenIKtisis.ode	@ltx/en_us_houpos/miscellanea:misc.Ode8
ltx/en_us_houpos/he.h.m2:heHE.EleftheraMenIKtisis.text	
ltx/en_us_houpos/he.h.m2:heHE.EleftheraMenIKtisis1.text	
ltx/en_us_houpos/he.h.m2:heHE.EleftheraMenIKtisis1a.text	
ltx/en_us_houpos/he.h.m2:heHE.EleftheraMenIKtisis1b.text	
ltx/en_us_houpos/he.h.m2:heHE.EleftheraMenIKtisis2.text	
ltx/en_us_houpos/he.h.m2:heHE.EleftheraMenIKtisis2a.text	
ltx/en_us_houpos/he.h.m2:heHE.EleftheraMenIKtisis2b.text	
ltx/en_us_houpos/he.h.m2:heHE.EleftheraMenIKtisis3.text	
ltx/en_us_houpos/he.h.m2:heHE.EleftheraMenIKtisis3a.text	
ltx/en_us_houpos/he.h.m2:heHE.EleftheraMenIKtisis3b.text	
ltx/en_us_houpos/he.h.m2:heHE.EleftheraMenIKtisis4.text	
ltx/en_us_houpos/he.h.m2:heHE.EleftheraMenIKtisis4a.text	
ltx/en_us_houpos/he.h.m2:heHE.EleftheraMenIKtisis4b.text	
ltx/en_us_houpos/he.h.m2:heHE.EleftheraMenIKtisis5.text	
ltx/en_us_houpos/he.h.m2:heHE.EleftheraMenIKtisis5a.text	
ltx/en_us_houpos/he.h.m2:heHE.EleftheraMenIKtisis5b.text	
ltx/en_us_houpos/he.h.m2:heHE.ElilythasEkParthenou.greekname	
ltx/en_us_houpos/he.h.m2:heHE.ElilythasEkParthenou.incipit	You came, O Lord…
ltx/en_us_houpos/he.h.m2:heHE.ElilythasEkParthenou.melody	@ltx/en_us_houpos/miscellanea:misc.Heirmos
ltx/en_us_houpos/he.h.m2:heHE.ElilythasEkParthenou.mode	@ltx/en_us_houpos/miscellanea:misc.Mode2
ltx/en_us_houpos/he.h.m2:heHE.ElilythasEkParthenou.name	N/M
ltx/en_us_houpos/he.h.m2:heHE.ElilythasEkParthenou.notmetered	N/M ()
ltx/en_us_houpos/he.h.m2:heHE.ElilythasEkParthenou.ode	@ltx/en_us_houpos/miscellanea:misc.Ode4
ltx/en_us_houpos/he.h.m2:heHE.ElilythasEkParthenou.text	
ltx/en_us_houpos/he.h.m2:heHE.EmegalynasChriste.greekname	
ltx/en_us_houpos/he.h.m2:heHE.EmegalynasChriste.incipit	You have magnified…
ltx/en_us_houpos/he.h.m2:heHE.EmegalynasChriste.melody	@ltx/en_us_houpos/miscellanea:misc.Heirmos
ltx/en_us_houpos/he.h.m2:heHE.EmegalynasChriste.mode	@ltx/en_us_houpos/miscellanea:misc.Mode2
ltx/en_us_houpos/he.h.m2:heHE.EmegalynasChriste.name	You have magnified.
ltx/en_us_houpos/he.h.m2:heHE.EmegalynasChriste.notmetered	N/M (You have magnified.)
ltx/en_us_houpos/he.h.m2:heHE.EmegalynasChriste.ode	@ltx/en_us_houpos/miscellanea:misc.Ode9
ltx/en_us_houpos/he.h.m2:heHE.EmegalynasChriste.text	
ltx/en_us_houpos/he.h.m2:heHE.EnAvyssoPtaismaton.greekname	
ltx/en_us_houpos/he.h.m2:heHE.EnAvyssoPtaismaton.incipit	Like a deep sea, my sins…
ltx/en_us_houpos/he.h.m2:heHE.EnAvyssoPtaismaton.melody	@ltx/en_us_houpos/miscellanea:misc.Heirmos
ltx/en_us_houpos/he.h.m2:heHE.EnAvyssoPtaismaton.mode	@ltx/en_us_houpos/miscellanea:misc.Mode2
ltx/en_us_houpos/he.h.m2:heHE.EnAvyssoPtaismaton.name	Like a deep sea, my sins.
ltx/en_us_houpos/he.h.m2:heHE.EnAvyssoPtaismaton.notmetered	N/M (Like a deep sea, my sins.)
ltx/en_us_houpos/he.h.m2:heHE.EnAvyssoPtaismaton.ode	@ltx/en_us_houpos/miscellanea:misc.Ode6
ltx/en_us_houpos/he.h.m2:heHE.EnAvyssoPtaismaton.text	
ltx/en_us_houpos/he.h.m2:heHE.EnPetraMeTisPisteos.greekname	
ltx/en_us_houpos/he.h.m2:heHE.EnPetraMeTisPisteos.incipit	N/M…
ltx/en_us_houpos/he.h.m2:heHE.EnPetraMeTisPisteos.melody	@ltx/en_us_houpos/miscellanea:misc.Heirmos
ltx/en_us_houpos/he.h.m2:heHE.EnPetraMeTisPisteos.mode	@ltx/en_us_houpos/miscellanea:misc.Mode2
ltx/en_us_houpos/he.h.m2:heHE.EnPetraMeTisPisteos.name	N/M ()
ltx/en_us_houpos/he.h.m2:heHE.EnPetraMeTisPisteos.notmetered	N/M ()
ltx/en_us_houpos/he.h.m2:heHE.EnPetraMeTisPisteos.ode	@ltx/en_us_houpos/miscellanea:misc.Ode3
ltx/en_us_houpos/he.h.m2:heHE.EnPetraMeTisPisteos.text	
ltx/en_us_houpos/he.h.m2:heHE.EnTiKamino.greekname	
ltx/en_us_houpos/he.h.m2:heHE.EnTiKamino.incipit	O Lord, Your Mother…
ltx/en_us_houpos/he.h.m2:heHE.EnTiKamino.melody	@ltx/en_us_houpos/miscellanea:misc.Heirmos
ltx/en_us_houpos/he.h.m2:heHE.EnTiKamino.mode	@ltx/en_us_houpos/miscellanea:misc.Mode2
ltx/en_us_houpos/he.h.m2:heHE.EnTiKamino.name	O Lord, Your Mother.
ltx/en_us_houpos/he.h.m2:heHE.EnTiKamino.notmetered	N/M (O Lord, Your Mother.)
ltx/en_us_houpos/he.h.m2:heHE.EnTiKamino.ode	@ltx/en_us_houpos/miscellanea:misc.Ode8
ltx/en_us_houpos/he.h.m2:heHE.EnTiKamino.text	
ltx/en_us_houpos/he.h.m2:heHE.EnVythoKatestrose.greekname	
ltx/en_us_houpos/he.h.m2:heHE.EnVythoKatestrose.incipit	Long ago the overwhelming Force…
ltx/en_us_houpos/he.h.m2:heHE.EnVythoKatestrose.melody	@ltx/en_us_houpos/miscellanea:misc.Heirmos
ltx/en_us_houpos/he.h.m2:heHE.EnVythoKatestrose.mode	@ltx/en_us_houpos/miscellanea:misc.Mode2
ltx/en_us_houpos/he.h.m2:heHE.EnVythoKatestrose.name	Long ago the overwhelming Force.
ltx/en_us_houpos/he.h.m2:heHE.EnVythoKatestrose.notmetered	N/M (Long ago the overwhelming Force.)
ltx/en_us_houpos/he.h.m2:heHE.EnVythoKatestrose.ode	@ltx/en_us_houpos/miscellanea:misc.Ode1
ltx/en_us_houpos/he.h.m2:heHE.EnVythoKatestrose.text	
ltx/en_us_houpos/he.h.m2:heHE.ExinthisenIErimos.greekname	
ltx/en_us_houpos/he.h.m2:heHE.ExinthisenIErimos.incipit	The gentile church…
ltx/en_us_houpos/he.h.m2:heHE.ExinthisenIErimos.melody	@ltx/en_us_houpos/miscellanea:misc.Heirmos
ltx/en_us_houpos/he.h.m2:heHE.ExinthisenIErimos.mode	@ltx/en_us_houpos/miscellanea:misc.Mode2
ltx/en_us_houpos/he.h.m2:heHE.ExinthisenIErimos.name	The gentile church.
ltx/en_us_houpos/he.h.m2:heHE.ExinthisenIErimos.notmetered	N/M (The gentile church.)
ltx/en_us_houpos/he.h.m2:heHE.ExinthisenIErimos.ode	@ltx/en_us_houpos/miscellanea:misc.Ode3
ltx/en_us_houpos/he.h.m2:heHE.ExinthisenIErimos.text	
ltx/en_us_houpos/he.h.m2:heHE.IEnOuranois.greekname	
ltx/en_us_houpos/he.h.m2:heHE.IEnOuranois.incipit	…
ltx/en_us_houpos/he.h.m2:heHE.IEnOuranois.melody	@ltx/en_us_houpos/miscellanea:misc.Heirmos
ltx/en_us_houpos/he.h.m2:heHE.IEnOuranois.mode	@ltx/en_us_houpos/miscellanea:misc.Mode2
ltx/en_us_houpos/he.h.m2:heHE.IEnOuranois.name	
ltx/en_us_houpos/he.h.m2:heHE.IEnOuranois.notmetered	N/M ()
ltx/en_us_houpos/he.h.m2:heHE.IEnOuranois.ode	@ltx/en_us_houpos/miscellanea:misc.Ode9
ltx/en_us_houpos/he.h.m2:heHE.IEnOuranois.text	
ltx/en_us_houpos/he.h.m2:heHE.IFoniTouLogou.greekname	
ltx/en_us_houpos/he.h.m2:heHE.IFoniTouLogou.incipit	As he is the voice…
ltx/en_us_houpos/he.h.m2:heHE.IFoniTouLogou.melody	@ltx/en_us_houpos/miscellanea:misc.Heirmos
ltx/en_us_houpos/he.h.m2:heHE.IFoniTouLogou.mode	@ltx/en_us_houpos/miscellanea:misc.Mode2
ltx/en_us_houpos/he.h.m2:heHE.IFoniTouLogou.name	As he is the voice.
ltx/en_us_houpos/he.h.m2:heHE.IFoniTouLogou.notmetered	N/M (As he is the voice.)
ltx/en_us_houpos/he.h.m2:heHE.IFoniTouLogou.ode	@ltx/en_us_houpos/miscellanea:misc.Ode6
ltx/en_us_houpos/he.h.m2:heHE.IFoniTouLogou.text	
ltx/en_us_houpos/he.h.m2:heHE.ITonAchoritonTheon.greekname	
ltx/en_us_houpos/he.h.m2:heHE.ITonAchoritonTheon.incipit	…
ltx/en_us_houpos/he.h.m2:heHE.ITonAchoritonTheon.melody	@ltx/en_us_houpos/miscellanea:misc.Heirmos
ltx/en_us_houpos/he.h.m2:heHE.ITonAchoritonTheon.mode	@ltx/en_us_houpos/miscellanea:misc.Mode2
ltx/en_us_houpos/he.h.m2:heHE.ITonAchoritonTheon.name	
ltx/en_us_houpos/he.h.m2:heHE.ITonAchoritonTheon.notmetered	N/M ()
ltx/en_us_houpos/he.h.m2:heHE.ITonAchoritonTheon.ode	@ltx/en_us_houpos/miscellanea:misc.Ode9
ltx/en_us_houpos/he.h.m2:heHE.ITonAchoritonTheon.text	
ltx/en_us_houpos/he.h.m2:heHE.ITonProIliouFostira.greekname	
ltx/en_us_houpos/he.h.m2:heHE.ITonProIliouFostira.incipit	Lady, from your virginal belly…
ltx/en_us_houpos/he.h.m2:heHE.ITonProIliouFostira.melody	@ltx/en_us_houpos/miscellanea:misc.Heirmos
ltx/en_us_houpos/he.h.m2:heHE.ITonProIliouFostira.mode	@ltx/en_us_houpos/miscellanea:misc.Mode2
ltx/en_us_houpos/he.h.m2:heHE.ITonProIliouFostira.name	Lady, from your virginal belly.
ltx/en_us_houpos/he.h.m2:heHE.ITonProIliouFostira.notmetered	N/M (Lady, from your virginal belly.)
ltx/en_us_houpos/he.h.m2:heHE.ITonProIliouFostira.ode	@ltx/en_us_houpos/miscellanea:misc.Ode9
ltx/en_us_houpos/he.h.m2:heHE.ITonProIliouFostira.text	
ltx/en_us_houpos/he.h.m2:heHE.IchouRimatonDeiseos.greekname	
ltx/en_us_houpos/he.h.m2:heHE.IchouRimatonDeiseos.incipit	…
ltx/en_us_houpos/he.h.m2:heHE.IchouRimatonDeiseos.melody	@ltx/en_us_houpos/miscellanea:misc.Heirmos
ltx/en_us_houpos/he.h.m2:heHE.IchouRimatonDeiseos.mode	@ltx/en_us_houpos/miscellanea:misc.Mode2
ltx/en_us_houpos/he.h.m2:heHE.IchouRimatonDeiseos.name	
ltx/en_us_houpos/he.h.m2:heHE.IchouRimatonDeiseos.notmetered	N/M ()
ltx/en_us_houpos/he.h.m2:heHE.IchouRimatonDeiseos.ode	@ltx/en_us_houpos/miscellanea:misc.Ode6
ltx/en_us_houpos/he.h.m2:heHE.IchouRimatonDeiseos.text	
ltx/en_us_houpos/he.h.m2:heHE.IdeteIdeteOEnThalassi.greekname	
ltx/en_us_houpos/he.h.m2:heHE.IdeteIdeteOEnThalassi.incipit	…
ltx/en_us_houpos/he.h.m2:heHE.IdeteIdeteOEnThalassi.melody	@ltx/en_us_houpos/miscellanea:misc.Heirmos
ltx/en_us_houpos/he.h.m2:heHE.IdeteIdeteOEnThalassi.mode	@ltx/en_us_houpos/miscellanea:misc.Mode2
ltx/en_us_houpos/he.h.m2:heHE.IdeteIdeteOEnThalassi.name	
ltx/en_us_houpos/he.h.m2:heHE.IdeteIdeteOEnThalassi.notmetered	N/M ()
ltx/en_us_houpos/he.h.m2:heHE.IdeteIdeteOEnThalassi.ode	@ltx/en_us_houpos/miscellanea:misc.Ode2
ltx/en_us_houpos/he.h.m2:heHE.IdeteIdeteOEnThalassi.text	
ltx/en_us_houpos/he.h.m2:heHE.IisousOZoisArchigos.greekname	
ltx/en_us_houpos/he.h.m2:heHE.IisousOZoisArchigos.incipit	It is Jesus, the Author of life…
ltx/en_us_houpos/he.h.m2:heHE.IisousOZoisArchigos.melody	@ltx/en_us_houpos/miscellanea:misc.Heirmos
ltx/en_us_houpos/he.h.m2:heHE.IisousOZoisArchigos.mode	@ltx/en_us_houpos/miscellanea:misc.Mode2
ltx/en_us_houpos/he.h.m2:heHE.IisousOZoisArchigos.name	It is Jesus, the Author of life.
ltx/en_us_houpos/he.h.m2:heHE.IisousOZoisArchigos.notmetered	N/M (It is Jesus, the Author of life.)
ltx/en_us_houpos/he.h.m2:heHE.IisousOZoisArchigos.ode	@ltx/en_us_houpos/miscellanea:misc.Ode5
ltx/en_us_houpos/he.h.m2:heHE.IisousOZoisArchigos.text	
ltx/en_us_houpos/he.h.m2:heHE.ImertonExefine.greekname	
ltx/en_us_houpos/he.h.m2:heHE.ImertonExefine.incipit	Unto Him whom He produced…
ltx/en_us_houpos/he.h.m2:heHE.ImertonExefine.melody	@ltx/en_us_houpos/miscellanea:misc.Heirmos
ltx/en_us_houpos/he.h.m2:heHE.ImertonExefine.mode	@ltx/en_us_houpos/miscellanea:misc.Mode2
ltx/en_us_houpos/he.h.m2:heHE.ImertonExefine.name	Unto Him whom He produced.
ltx/en_us_houpos/he.h.m2:heHE.ImertonExefine.notmetered	N/M (Unto Him whom He produced.)
ltx/en_us_houpos/he.h.m2:heHE.ImertonExefine.ode	@ltx/en_us_houpos/miscellanea:misc.Ode6
ltx/en_us_houpos/he.h.m2:heHE.ImertonExefine.text	
ltx/en_us_houpos/he.h.m2:heHE.ImertonExefine1.text	
ltx/en_us_houpos/he.h.m2:heHE.ImertonExefine1a.text	
ltx/en_us_houpos/he.h.m2:heHE.ImertonExefine1b.text	
ltx/en_us_houpos/he.h.m2:heHE.ImertonExefine2.text	
ltx/en_us_houpos/he.h.m2:heHE.ImertonExefine2a.text	
ltx/en_us_houpos/he.h.m2:heHE.ImertonExefine2b.text	
ltx/en_us_houpos/he.h.m2:heHE.ImertonExefine3.text	
ltx/en_us_houpos/he.h.m2:heHE.ImertonExefine3a.text	
ltx/en_us_houpos/he.h.m2:heHE.ImertonExefine3b.text	
ltx/en_us_houpos/he.h.m2:heHE.ImertonExefine4.text	
ltx/en_us_houpos/he.h.m2:heHE.ImertonExefine4a.text	
ltx/en_us_houpos/he.h.m2:heHE.ImertonExefine4b.text	
ltx/en_us_houpos/he.h.m2:heHE.ImertonExefine5.text	
ltx/en_us_houpos/he.h.m2:heHE.ImertonExefine5a.text	
ltx/en_us_houpos/he.h.m2:heHE.ImertonExefine5b.text	
ltx/en_us_houpos/he.h.m2:heHE.IndalmatosChrysou.greekname	
ltx/en_us_houpos/he.h.m2:heHE.IndalmatosChrysou.incipit	…
ltx/en_us_houpos/he.h.m2:heHE.IndalmatosChrysou.melody	@ltx/en_us_houpos/miscellanea:misc.Heirmos
ltx/en_us_houpos/he.h.m2:heHE.IndalmatosChrysou.mode	@ltx/en_us_houpos/miscellanea:misc.Mode2
ltx/en_us_houpos/he.h.m2:heHE.IndalmatosChrysou.name	
ltx/en_us_houpos/he.h.m2:heHE.IndalmatosChrysou.notmetered	N/M ()
ltx/en_us_houpos/he.h.m2:heHE.IndalmatosChrysou.ode	@ltx/en_us_houpos/miscellanea:misc.Ode8
ltx/en_us_houpos/he.h.m2:heHE.IndalmatosChrysou.text	
ltx/en_us_houpos/he.h.m2:heHE.IschynODidous.greekname	
ltx/en_us_houpos/he.h.m2:heHE.IschynODidous.incipit	Indeed, He gives strength…
ltx/en_us_houpos/he.h.m2:heHE.IschynODidous.melody	@ltx/en_us_houpos/miscellanea:misc.Heirmos
ltx/en_us_houpos/he.h.m2:heHE.IschynODidous.mode	@ltx/en_us_houpos/miscellanea:misc.Mode2
ltx/en_us_houpos/he.h.m2:heHE.IschynODidous.name	Indeed, He gives strength.
ltx/en_us_houpos/he.h.m2:heHE.IschynODidous.notmetered	N/M (Indeed, He gives strength.)
ltx/en_us_houpos/he.h.m2:heHE.IschynODidous.ode	@ltx/en_us_houpos/miscellanea:misc.Ode3
ltx/en_us_houpos/he.h.m2:heHE.IschynODidous.text	
ltx/en_us_houpos/he.h.m2:heHE.KaminosPote.greekname	
ltx/en_us_houpos/he.h.m2:heHE.KaminosPote.incipit	Heeding the divine decree…
ltx/en_us_houpos/he.h.m2:heHE.KaminosPote.melody	@ltx/en_us_houpos/miscellanea:misc.Heirmos
ltx/en_us_houpos/he.h.m2:heHE.KaminosPote.mode	@ltx/en_us_houpos/miscellanea:misc.Mode2
ltx/en_us_houpos/he.h.m2:heHE.KaminosPote.name	Heeding the divine decree.
ltx/en_us_houpos/he.h.m2:heHE.KaminosPote.notmetered	N/M (Heeding the divine decree.)
ltx/en_us_houpos/he.h.m2:heHE.KaminosPote.ode	@ltx/en_us_houpos/miscellanea:misc.Ode8
ltx/en_us_houpos/he.h.m2:heHE.KaminosPote.text	Once by the divine command the fiery furnace * of old in Babylon divided its actions, for while it consumed * the Chaldeans, it was showering with dew the faithful Servants who sang the hymn: * Bless the Lord, all you works of the Lord!
ltx/en_us_houpos/he.h.m2:heHE.MesitisTheou.greekname	
ltx/en_us_houpos/he.h.m2:heHE.MesitisTheou.incipit	N/M…
ltx/en_us_houpos/he.h.m2:heHE.MesitisTheou.melody	@ltx/en_us_houpos/miscellanea:misc.Heirmos
ltx/en_us_houpos/he.h.m2:heHE.MesitisTheou.mode	@ltx/en_us_houpos/miscellanea:misc.Mode2
ltx/en_us_houpos/he.h.m2:heHE.MesitisTheou.name	N/M ()
ltx/en_us_houpos/he.h.m2:heHE.MesitisTheou.notmetered	N/M ()
ltx/en_us_houpos/he.h.m2:heHE.MesitisTheou.ode	@ltx/en_us_houpos/miscellanea:misc.Ode5
ltx/en_us_houpos/he.h.m2:heHE.MesitisTheou.text	
ltx/en_us_houpos/he.h.m2:heHE.MystirionParadoxon.greekname	
ltx/en_us_houpos/he.h.m2:heHE.MystirionParadoxon.incipit	Of old, the furnace in Babylon…
ltx/en_us_houpos/he.h.m2:heHE.MystirionParadoxon.melody	@ltx/en_us_houpos/miscellanea:misc.Heirmos
ltx/en_us_houpos/he.h.m2:heHE.MystirionParadoxon.mode	@ltx/en_us_houpos/miscellanea:misc.Mode2
ltx/en_us_houpos/he.h.m2:heHE.MystirionParadoxon.name	Of old, the furnace in Babylon.
ltx/en_us_houpos/he.h.m2:heHE.MystirionParadoxon.notmetered	N/M (Of old, the furnace in Babylon.)
ltx/en_us_houpos/he.h.m2:heHE.MystirionParadoxon.ode	@ltx/en_us_houpos/miscellanea:misc.Ode8
ltx/en_us_houpos/he.h.m2:heHE.MystirionParadoxon.text	
ltx/en_us_houpos/he.h.m2:heHE.NeousEfseveis.greekname	
ltx/en_us_houpos/he.h.m2:heHE.NeousEfseveis.incipit	Young and pious men…
ltx/en_us_houpos/he.h.m2:heHE.NeousEfseveis.melody	@ltx/en_us_houpos/miscellanea:misc.Heirmos
ltx/en_us_houpos/he.h.m2:heHE.NeousEfseveis.mode	@ltx/en_us_houpos/miscellanea:misc.Mode2
ltx/en_us_houpos/he.h.m2:heHE.NeousEfseveis.name	Young and pious men.
ltx/en_us_houpos/he.h.m2:heHE.NeousEfseveis.notmetered	N/M (Young and pious men.)
ltx/en_us_houpos/he.h.m2:heHE.NeousEfseveis.ode	@ltx/en_us_houpos/miscellanea:misc.Ode7
ltx/en_us_houpos/he.h.m2:heHE.NeousEfseveis.text	
ltx/en_us_houpos/he.h.m2:heHE.OAnthraxToIsaia.greekname	
ltx/en_us_houpos/he.h.m2:heHE.OAnthraxToIsaia.incipit	…
ltx/en_us_houpos/he.h.m2:heHE.OAnthraxToIsaia.melody	@ltx/en_us_houpos/miscellanea:misc.Heirmos
ltx/en_us_houpos/he.h.m2:heHE.OAnthraxToIsaia.mode	@ltx/en_us_houpos/miscellanea:misc.Mode2
ltx/en_us_houpos/he.h.m2:heHE.OAnthraxToIsaia.name	
ltx/en_us_houpos/he.h.m2:heHE.OAnthraxToIsaia.notmetered	N/M ()
ltx/en_us_houpos/he.h.m2:heHE.OAnthraxToIsaia.ode	@ltx/en_us_houpos/miscellanea:misc.Ode5
ltx/en_us_houpos/he.h.m2:heHE.OAnthraxToIsaia.text	
ltx/en_us_houpos/he.h.m2:heHE.OFotismos.greekname	Ὁ φωτισμός.
ltx/en_us_houpos/he.h.m2:heHE.OFotismos.incipit	…
ltx/en_us_houpos/he.h.m2:heHE.OFotismos.melody	@ltx/en_us_houpos/miscellanea:misc.Heirmos
ltx/en_us_houpos/he.h.m2:heHE.OFotismos.mode	@ltx/en_us_houpos/miscellanea:misc.Mode2
ltx/en_us_houpos/he.h.m2:heHE.OFotismos.name	You are the light.
ltx/en_us_houpos/he.h.m2:heHE.OFotismos.notmetered	N/M (You are the light.)
ltx/en_us_houpos/he.h.m2:heHE.OFotismos.ode	@ltx/en_us_houpos/miscellanea:misc.Ode5
ltx/en_us_houpos/he.h.m2:heHE.OFotismos.text	
ltx/en_us_houpos/he.h.m2:heHE.OSkiografonAchlyn.greekname	
ltx/en_us_houpos/he.h.m2:heHE.OSkiografonAchlyn.incipit	You dispelled the misty shadow…
ltx/en_us_houpos/he.h.m2:heHE.OSkiografonAchlyn.melody	@ltx/en_us_houpos/miscellanea:misc.Heirmos
ltx/en_us_houpos/he.h.m2:heHE.OSkiografonAchlyn.mode	@ltx/en_us_houpos/miscellanea:misc.Mode2
ltx/en_us_houpos/he.h.m2:heHE.OSkiografonAchlyn.name	You dispelled the misty shadow.
ltx/en_us_houpos/he.h.m2:heHE.OSkiografonAchlyn.notmetered	N/M (You dispelled.)
ltx/en_us_houpos/he.h.m2:heHE.OSkiografonAchlyn.ode	@ltx/en_us_houpos/miscellanea:misc.Ode5
ltx/en_us_houpos/he.h.m2:heHE.OSkiografonAchlyn.text	
ltx/en_us_houpos/he.h.m2:heHE.OTinKaminonPalai.greekname	
ltx/en_us_houpos/he.h.m2:heHE.OTinKaminonPalai.incipit	…
ltx/en_us_houpos/he.h.m2:heHE.OTinKaminonPalai.melody	@ltx/en_us_houpos/miscellanea:misc.Heirmos
ltx/en_us_houpos/he.h.m2:heHE.OTinKaminonPalai.mode	@ltx/en_us_houpos/miscellanea:misc.Mode2
ltx/en_us_houpos/he.h.m2:heHE.OTinKaminonPalai.name	
ltx/en_us_houpos/he.h.m2:heHE.OTinKaminonPalai.notmetered	N/M ()
ltx/en_us_houpos/he.h.m2:heHE.OTinKaminonPalai.ode	@ltx/en_us_houpos/miscellanea:misc.Ode7
ltx/en_us_houpos/he.h.m2:heHE.OTinKaminonPalai.text	
ltx/en_us_houpos/he.h.m2:heHE.OTonYperNoun.greekname	
ltx/en_us_houpos/he.h.m2:heHE.OTonYperNoun.incipit	No one can comprehend…
ltx/en_us_houpos/he.h.m2:heHE.OTonYperNoun.melody	@ltx/en_us_houpos/miscellanea:misc.Heirmos
ltx/en_us_houpos/he.h.m2:heHE.OTonYperNoun.mode	@ltx/en_us_houpos/miscellanea:misc.Mode2
ltx/en_us_houpos/he.h.m2:heHE.OTonYperNoun.name	No one can comprehend.
ltx/en_us_houpos/he.h.m2:heHE.OTonYperNoun.notmetered	N/M (No one can comprehend.)
ltx/en_us_houpos/he.h.m2:heHE.OTonYperNoun.ode	@ltx/en_us_houpos/miscellanea:misc.Ode9
ltx/en_us_houpos/he.h.m2:heHE.OTonYperNoun.text	
ltx/en_us_houpos/he.h.m2:heHE.OTonYperNoun1.text	
ltx/en_us_houpos/he.h.m2:heHE.OTonYperNoun1a.text	
ltx/en_us_houpos/he.h.m2:heHE.OTonYperNoun1b.text	
ltx/en_us_houpos/he.h.m2:heHE.OTonYperNoun2.text	
ltx/en_us_houpos/he.h.m2:heHE.OTonYperNoun2a.text	
ltx/en_us_houpos/he.h.m2:heHE.OTonYperNoun2b.text	
ltx/en_us_houpos/he.h.m2:heHE.OTonYperNoun3.text	
ltx/en_us_houpos/he.h.m2:heHE.OTonYperNoun3a.text	
ltx/en_us_houpos/he.h.m2:heHE.OTonYperNoun3b.text	
ltx/en_us_houpos/he.h.m2:heHE.OTonYperNoun4.text	
ltx/en_us_houpos/he.h.m2:heHE.OTonYperNoun4a.text	
ltx/en_us_houpos/he.h.m2:heHE.OTonYperNoun4b.text	
ltx/en_us_houpos/he.h.m2:heHE.OTonYperNoun5.text	
ltx/en_us_houpos/he.h.m2:heHE.OTonYperNoun5a.text	
ltx/en_us_houpos/he.h.m2:heHE.OTonYperNoun5b.text	
ltx/en_us_houpos/he.h.m2:heHE.OTouFotosChorigos.greekname	
ltx/en_us_houpos/he.h.m2:heHE.OTouFotosChorigos.incipit	Lord, the provider of light…
ltx/en_us_houpos/he.h.m2:heHE.OTouFotosChorigos.melody	@ltx/en_us_houpos/miscellanea:misc.Heirmos
ltx/en_us_houpos/he.h.m2:heHE.OTouFotosChorigos.mode	@ltx/en_us_houpos/miscellanea:misc.Mode2
ltx/en_us_houpos/he.h.m2:heHE.OTouFotosChorigos.name	Lord, the provider of light.
ltx/en_us_houpos/he.h.m2:heHE.OTouFotosChorigos.notmetered	N/M (Lord, the provider of light.)
ltx/en_us_houpos/he.h.m2:heHE.OTouFotosChorigos.ode	@ltx/en_us_houpos/miscellanea:misc.Ode5
ltx/en_us_houpos/he.h.m2:heHE.OTouFotosChorigos.text	
ltx/en_us_houpos/he.h.m2:heHE.OlosYparcheisEfesis.greekname	
ltx/en_us_houpos/he.h.m2:heHE.OlosYparcheisEfesis.incipit	You are desire entirely…
ltx/en_us_houpos/he.h.m2:heHE.OlosYparcheisEfesis.melody	@ltx/en_us_houpos/miscellanea:misc.Heirmos
ltx/en_us_houpos/he.h.m2:heHE.OlosYparcheisEfesis.mode	@ltx/en_us_houpos/miscellanea:misc.Mode2
ltx/en_us_houpos/he.h.m2:heHE.OlosYparcheisEfesis.name	You are desire entirely.
ltx/en_us_houpos/he.h.m2:heHE.OlosYparcheisEfesis.notmetered	N/M (You are desire entirely.)
ltx/en_us_houpos/he.h.m2:heHE.OlosYparcheisEfesis.ode	@ltx/en_us_houpos/miscellanea:misc.Ode9
ltx/en_us_houpos/he.h.m2:heHE.OlosYparcheisEfesis.text	
ltx/en_us_houpos/he.h.m2:heHE.OsoiPalaion.greekname	
ltx/en_us_houpos/he.h.m2:heHE.OsoiPalaion.incipit	You who have been delivered…
ltx/en_us_houpos/he.h.m2:heHE.OsoiPalaion.melody	@ltx/en_us_houpos/miscellanea:misc.Heirmos
ltx/en_us_houpos/he.h.m2:heHE.OsoiPalaion.mode	@ltx/en_us_houpos/miscellanea:misc.Mode2
ltx/en_us_houpos/he.h.m2:heHE.OsoiPalaion.name	You who have been delivered.
ltx/en_us_houpos/he.h.m2:heHE.OsoiPalaion.notmetered	N/M (You who have been delivered.)
ltx/en_us_houpos/he.h.m2:heHE.OsoiPalaion.ode	@ltx/en_us_houpos/miscellanea:misc.Ode3
ltx/en_us_houpos/he.h.m2:heHE.OsoiPalaion.text	
ltx/en_us_houpos/he.h.m2:heHE.OsoiPalaion1.text	
ltx/en_us_houpos/he.h.m2:heHE.OsoiPalaion1a.text	
ltx/en_us_houpos/he.h.m2:heHE.OsoiPalaion1b.text	
ltx/en_us_houpos/he.h.m2:heHE.OsoiPalaion2.text	
ltx/en_us_houpos/he.h.m2:heHE.OsoiPalaion2a.text	
ltx/en_us_houpos/he.h.m2:heHE.OsoiPalaion2b.text	
ltx/en_us_houpos/he.h.m2:heHE.OsoiPalaion3.text	
ltx/en_us_houpos/he.h.m2:heHE.OsoiPalaion3a.text	
ltx/en_us_houpos/he.h.m2:heHE.OsoiPalaion3b.text	
ltx/en_us_houpos/he.h.m2:heHE.OsoiPalaion4.text	
ltx/en_us_houpos/he.h.m2:heHE.OsoiPalaion4a.text	
ltx/en_us_houpos/he.h.m2:heHE.OsoiPalaion4b.text	
ltx/en_us_houpos/he.h.m2:heHE.OsoiPalaion5.text	
ltx/en_us_houpos/he.h.m2:heHE.OsoiPalaion5a.text	
ltx/en_us_houpos/he.h.m2:heHE.OsoiPalaion5b.text	
ltx/en_us_houpos/he.h.m2:heHE.ProsKyrionEkKitous.greekname	
ltx/en_us_houpos/he.h.m2:heHE.ProsKyrionEkKitous.incipit	The Prophet Jonah cried…
ltx/en_us_houpos/he.h.m2:heHE.ProsKyrionEkKitous.melody	@ltx/en_us_houpos/miscellanea:misc.Heirmos
ltx/en_us_houpos/he.h.m2:heHE.ProsKyrionEkKitous.mode	@ltx/en_us_houpos/miscellanea:misc.Mode2
ltx/en_us_houpos/he.h.m2:heHE.ProsKyrionEkKitous.name	The Prophet Jonah cried.
ltx/en_us_houpos/he.h.m2:heHE.ProsKyrionEkKitous.notmetered	N/M (The Prophet Jonah cried.)
ltx/en_us_houpos/he.h.m2:heHE.ProsKyrionEkKitous.ode	@ltx/en_us_houpos/miscellanea:misc.Ode6
ltx/en_us_houpos/he.h.m2:heHE.ProsKyrionEkKitous.text	
ltx/en_us_houpos/he.h.m2:heHE.ProsecheteLaoi.greekname	
ltx/en_us_houpos/he.h.m2:heHE.ProsecheteLaoi.incipit	…
ltx/en_us_houpos/he.h.m2:heHE.ProsecheteLaoi.melody	@ltx/en_us_houpos/miscellanea:misc.Heirmos
ltx/en_us_houpos/he.h.m2:heHE.ProsecheteLaoi.mode	@ltx/en_us_houpos/miscellanea:misc.Mode2
ltx/en_us_houpos/he.h.m2:heHE.ProsecheteLaoi.name	
ltx/en_us_houpos/he.h.m2:heHE.ProsecheteLaoi.notmetered	N/M ()
ltx/en_us_houpos/he.h.m2:heHE.ProsecheteLaoi.ode	@ltx/en_us_houpos/miscellanea:misc.Ode2
ltx/en_us_houpos/he.h.m2:heHE.ProsecheteLaoi.text	
ltx/en_us_houpos/he.h.m2:heHE.ProsecheteLaosMou.greekname	
ltx/en_us_houpos/he.h.m2:heHE.ProsecheteLaosMou.incipit	…
ltx/en_us_houpos/he.h.m2:heHE.ProsecheteLaosMou.melody	@ltx/en_us_houpos/miscellanea:misc.Heirmos
ltx/en_us_houpos/he.h.m2:heHE.ProsecheteLaosMou.mode	@ltx/en_us_houpos/miscellanea:misc.Mode2
ltx/en_us_houpos/he.h.m2:heHE.ProsecheteLaosMou.name	
ltx/en_us_houpos/he.h.m2:heHE.ProsecheteLaosMou.notmetered	N/M ()
ltx/en_us_houpos/he.h.m2:heHE.ProsecheteLaosMou.ode	@ltx/en_us_houpos/miscellanea:misc.Ode2
ltx/en_us_houpos/he.h.m2:heHE.ProsecheteLaosMou.text	
ltx/en_us_houpos/he.h.m2:heHE.PsychaisKatharais.greekname	
ltx/en_us_houpos/he.h.m2:heHE.PsychaisKatharais.incipit	With souls that are pure…
ltx/en_us_houpos/he.h.m2:heHE.PsychaisKatharais.melody	@ltx/en_us_houpos/miscellanea:misc.Heirmos
ltx/en_us_houpos/he.h.m2:heHE.PsychaisKatharais.mode	@ltx/en_us_houpos/miscellanea:misc.Mode2
ltx/en_us_houpos/he.h.m2:heHE.PsychaisKatharais.name	With souls that are pure.
ltx/en_us_houpos/he.h.m2:heHE.PsychaisKatharais.notmetered	N/M (With souls that are pure.)
ltx/en_us_houpos/he.h.m2:heHE.PsychaisKatharais.ode	@ltx/en_us_houpos/miscellanea:misc.Ode9
ltx/en_us_houpos/he.h.m2:heHE.PsychaisKatharais.text	
ltx/en_us_houpos/he.h.m2:heHE.PyrsoKathartheis.greekname	
ltx/en_us_houpos/he.h.m2:heHE.PyrsoKathartheis.incipit	Utterly purged…
ltx/en_us_houpos/he.h.m2:heHE.PyrsoKathartheis.melody	@ltx/en_us_houpos/miscellanea:misc.Heirmos
ltx/en_us_houpos/he.h.m2:heHE.PyrsoKathartheis.mode	@ltx/en_us_houpos/miscellanea:misc.Mode2
ltx/en_us_houpos/he.h.m2:heHE.PyrsoKathartheis.name	Utterly purged.
ltx/en_us_houpos/he.h.m2:heHE.PyrsoKathartheis.notmetered	N/M (Utterly purged.)
ltx/en_us_houpos/he.h.m2:heHE.PyrsoKathartheis.ode	@ltx/en_us_houpos/miscellanea:misc.Ode4
ltx/en_us_houpos/he.h.m2:heHE.PyrsoKathartheis.text	
ltx/en_us_houpos/he.h.m2:heHE.PyrsoKathartheis1.text	
ltx/en_us_houpos/he.h.m2:heHE.PyrsoKathartheis1a.text	
ltx/en_us_houpos/he.h.m2:heHE.PyrsoKathartheis1b.text	
ltx/en_us_houpos/he.h.m2:heHE.PyrsoKathartheis2.text	
ltx/en_us_houpos/he.h.m2:heHE.PyrsoKathartheis2a.text	
ltx/en_us_houpos/he.h.m2:heHE.PyrsoKathartheis2b.text	
ltx/en_us_houpos/he.h.m2:heHE.PyrsoKathartheis3.text	
ltx/en_us_houpos/he.h.m2:heHE.PyrsoKathartheis3a.text	
ltx/en_us_houpos/he.h.m2:heHE.PyrsoKathartheis3b.text	
ltx/en_us_houpos/he.h.m2:heHE.PyrsoKathartheis4.text	
ltx/en_us_houpos/he.h.m2:heHE.PyrsoKathartheis4a.text	
ltx/en_us_houpos/he.h.m2:heHE.PyrsoKathartheis4b.text	
ltx/en_us_houpos/he.h.m2:heHE.PyrsoKathartheis5.text	
ltx/en_us_houpos/he.h.m2:heHE.PyrsoKathartheis5a.text	
ltx/en_us_houpos/he.h.m2:heHE.PyrsoKathartheis5b.text	
ltx/en_us_houpos/he.h.m2:heHE.RimaTyrannou.greekname	
ltx/en_us_houpos/he.h.m2:heHE.RimaTyrannou.incipit	When the decree…
ltx/en_us_houpos/he.h.m2:heHE.RimaTyrannou.melody	@ltx/en_us_houpos/miscellanea:misc.Heirmos
ltx/en_us_houpos/he.h.m2:heHE.RimaTyrannou.mode	@ltx/en_us_houpos/miscellanea:misc.Mode2
ltx/en_us_houpos/he.h.m2:heHE.RimaTyrannou.name	When the decree.
ltx/en_us_houpos/he.h.m2:heHE.RimaTyrannou.notmetered	N/M (When the decree.)
ltx/en_us_houpos/he.h.m2:heHE.RimaTyrannou.ode	@ltx/en_us_houpos/miscellanea:misc.Ode8
ltx/en_us_houpos/he.h.m2:heHE.RimaTyrannou.text	
ltx/en_us_houpos/he.h.m2:heHE.RitoresAnedeichthisanPaides.greekname	
ltx/en_us_houpos/he.h.m2:heHE.RitoresAnedeichthisanPaides.incipit	…
ltx/en_us_houpos/he.h.m2:heHE.RitoresAnedeichthisanPaides.melody	@ltx/en_us_houpos/miscellanea:misc.Heirmos
ltx/en_us_houpos/he.h.m2:heHE.RitoresAnedeichthisanPaides.mode	@ltx/en_us_houpos/miscellanea:misc.Mode2
ltx/en_us_houpos/he.h.m2:heHE.RitoresAnedeichthisanPaides.name	
ltx/en_us_houpos/he.h.m2:heHE.RitoresAnedeichthisanPaides.notmetered	N/M ()
ltx/en_us_houpos/he.h.m2:heHE.RitoresAnedeichthisanPaides.ode	@ltx/en_us_houpos/miscellanea:misc.Ode7
ltx/en_us_houpos/he.h.m2:heHE.RitoresAnedeichthisanPaides.text	
ltx/en_us_houpos/he.h.m2:heHE.SeTinNoitin.greekname	
ltx/en_us_houpos/he.h.m2:heHE.SeTinNoitin.incipit	…
ltx/en_us_houpos/he.h.m2:heHE.SeTinNoitin.melody	@ltx/en_us_houpos/miscellanea:misc.Heirmos
ltx/en_us_houpos/he.h.m2:heHE.SeTinNoitin.mode	@ltx/en_us_houpos/miscellanea:misc.Mode2
ltx/en_us_houpos/he.h.m2:heHE.SeTinNoitin.name	
ltx/en_us_houpos/he.h.m2:heHE.SeTinNoitin.notmetered	N/M ()
ltx/en_us_houpos/he.h.m2:heHE.SeTinNoitin.ode	@ltx/en_us_houpos/miscellanea:misc.Ode9
ltx/en_us_houpos/he.h.m2:heHE.SeTinNoitin.text	
ltx/en_us_houpos/he.h.m2:heHE.SteirothentaMouTonNoun.greekname	
ltx/en_us_houpos/he.h.m2:heHE.SteirothentaMouTonNoun.incipit	Barren has my mind…
ltx/en_us_houpos/he.h.m2:heHE.SteirothentaMouTonNoun.melody	@ltx/en_us_houpos/miscellanea:misc.Heirmos
ltx/en_us_houpos/he.h.m2:heHE.SteirothentaMouTonNoun.mode	@ltx/en_us_houpos/miscellanea:misc.Mode2
ltx/en_us_houpos/he.h.m2:heHE.SteirothentaMouTonNoun.name	Barren has my mind.
ltx/en_us_houpos/he.h.m2:heHE.SteirothentaMouTonNoun.notmetered	N/M (Barren has my mind.)
ltx/en_us_houpos/he.h.m2:heHE.SteirothentaMouTonNoun.ode	@ltx/en_us_houpos/miscellanea:misc.Ode3
ltx/en_us_houpos/he.h.m2:heHE.SteirothentaMouTonNoun.text	
ltx/en_us_houpos/he.h.m2:heHE.SteiveiThalassis.greekname	
ltx/en_us_houpos/he.h.m2:heHE.SteiveiThalassis.incipit	The people of Israel…
ltx/en_us_houpos/he.h.m2:heHE.SteiveiThalassis.melody	@ltx/en_us_houpos/miscellanea:misc.Heirmos
ltx/en_us_houpos/he.h.m2:heHE.SteiveiThalassis.mode	@ltx/en_us_houpos/miscellanea:misc.Mode2
ltx/en_us_houpos/he.h.m2:heHE.SteiveiThalassis.name	The people of Israel.
ltx/en_us_houpos/he.h.m2:heHE.SteiveiThalassis.notmetered	N/M (The people of Israel.)
ltx/en_us_houpos/he.h.m2:heHE.SteiveiThalassis.ode	@ltx/en_us_houpos/miscellanea:misc.Ode1
ltx/en_us_houpos/he.h.m2:heHE.SteiveiThalassis.text	
ltx/en_us_houpos/he.h.m2:heHE.SteiveiThalassis1.text	
ltx/en_us_houpos/he.h.m2:heHE.SteiveiThalassis1a.text	
ltx/en_us_houpos/he.h.m2:heHE.SteiveiThalassis1b.text	
ltx/en_us_houpos/he.h.m2:heHE.SteiveiThalassis2.text	
ltx/en_us_houpos/he.h.m2:heHE.SteiveiThalassis2a.text	
ltx/en_us_houpos/he.h.m2:heHE.SteiveiThalassis2b.text	
ltx/en_us_houpos/he.h.m2:heHE.SteiveiThalassis3.text	
ltx/en_us_houpos/he.h.m2:heHE.SteiveiThalassis3a.text	
ltx/en_us_houpos/he.h.m2:heHE.SteiveiThalassis3b.text	
ltx/en_us_houpos/he.h.m2:heHE.SteiveiThalassis4.text	
ltx/en_us_houpos/he.h.m2:heHE.SteiveiThalassis4a.text	
ltx/en_us_houpos/he.h.m2:heHE.SteiveiThalassis4b.text	
ltx/en_us_houpos/he.h.m2:heHE.SteiveiThalassis5.text	
ltx/en_us_houpos/he.h.m2:heHE.SteiveiThalassis5a.text	
ltx/en_us_houpos/he.h.m2:heHE.SteiveiThalassis5b.text	
ltx/en_us_houpos/he.h.m2:heHE.StereosonImasEnSoiKyrie.greekname	
ltx/en_us_houpos/he.h.m2:heHE.StereosonImasEnSoiKyrie.incipit	Establish us in You…
ltx/en_us_houpos/he.h.m2:heHE.StereosonImasEnSoiKyrie.melody	@ltx/en_us_houpos/miscellanea:misc.Heirmos
ltx/en_us_houpos/he.h.m2:heHE.StereosonImasEnSoiKyrie.mode	@ltx/en_us_houpos/miscellanea:misc.Mode2
ltx/en_us_houpos/he.h.m2:heHE.StereosonImasEnSoiKyrie.name	Establish us in You.
ltx/en_us_houpos/he.h.m2:heHE.StereosonImasEnSoiKyrie.notmetered	N/M (Establish us in You.)
ltx/en_us_houpos/he.h.m2:heHE.StereosonImasEnSoiKyrie.ode	@ltx/en_us_houpos/miscellanea:misc.Ode3
ltx/en_us_houpos/he.h.m2:heHE.StereosonImasEnSoiKyrie.text	
ltx/en_us_houpos/he.h.m2:heHE.SyToLogoSouKyrie.greekname	
ltx/en_us_houpos/he.h.m2:heHE.SyToLogoSouKyrie.incipit	You established…
ltx/en_us_houpos/he.h.m2:heHE.SyToLogoSouKyrie.melody	@ltx/en_us_houpos/miscellanea:misc.Heirmos
ltx/en_us_houpos/he.h.m2:heHE.SyToLogoSouKyrie.mode	@ltx/en_us_houpos/miscellanea:misc.Mode2
ltx/en_us_houpos/he.h.m2:heHE.SyToLogoSouKyrie.name	You established.
ltx/en_us_houpos/he.h.m2:heHE.SyToLogoSouKyrie.notmetered	N/M (You established.)
ltx/en_us_houpos/he.h.m2:heHE.SyToLogoSouKyrie.ode	@ltx/en_us_houpos/miscellanea:misc.Ode3
ltx/en_us_houpos/he.h.m2:heHE.SyToLogoSouKyrie.text	
ltx/en_us_houpos/he.h.m2:heHE.TaCherouvimMimoumenoi.greekname	
ltx/en_us_houpos/he.h.m2:heHE.TaCherouvimMimoumenoi.incipit	The Servants in the furnace…
ltx/en_us_houpos/he.h.m2:heHE.TaCherouvimMimoumenoi.melody	@ltx/en_us_houpos/miscellanea:misc.Heirmos
ltx/en_us_houpos/he.h.m2:heHE.TaCherouvimMimoumenoi.mode	@ltx/en_us_houpos/miscellanea:misc.Mode2
ltx/en_us_houpos/he.h.m2:heHE.TaCherouvimMimoumenoi.name	The Servants in the furnace.
ltx/en_us_houpos/he.h.m2:heHE.TaCherouvimMimoumenoi.notmetered	N/M (The Servants in the furnace.)
ltx/en_us_houpos/he.h.m2:heHE.TaCherouvimMimoumenoi.ode	@ltx/en_us_houpos/miscellanea:misc.Ode7
ltx/en_us_houpos/he.h.m2:heHE.TaCherouvimMimoumenoi.text	
ltx/en_us_houpos/he.h.m2:heHE.TinAchlynTisPsychisMou.greekname	Τὴν ἀχλὺν τῆς ψυχῆς μου.
ltx/en_us_houpos/he.h.m2:heHE.TinAchlynTisPsychisMou.incipit	…
ltx/en_us_houpos/he.h.m2:heHE.TinAchlynTisPsychisMou.melody	@ltx/en_us_houpos/miscellanea:misc.Heirmos
ltx/en_us_houpos/he.h.m2:heHE.TinAchlynTisPsychisMou.mode	@ltx/en_us_houpos/miscellanea:misc.Mode2
ltx/en_us_houpos/he.h.m2:heHE.TinAchlynTisPsychisMou.name	I implore You to scatter.
ltx/en_us_houpos/he.h.m2:heHE.TinAchlynTisPsychisMou.notmetered	N/M (I implore You to scatter.)
ltx/en_us_houpos/he.h.m2:heHE.TinAchlynTisPsychisMou.ode	@ltx/en_us_houpos/miscellanea:misc.Ode5
ltx/en_us_houpos/he.h.m2:heHE.TinAchlynTisPsychisMou.text	
ltx/en_us_houpos/he.h.m2:heHE.TinAgninKaiAchranton.greekname	
ltx/en_us_houpos/he.h.m2:heHE.TinAgninKaiAchranton.incipit	…
ltx/en_us_houpos/he.h.m2:heHE.TinAgninKaiAchranton.melody	@ltx/en_us_houpos/miscellanea:misc.Heirmos
ltx/en_us_houpos/he.h.m2:heHE.TinAgninKaiAchranton.mode	@ltx/en_us_houpos/miscellanea:misc.Mode2
ltx/en_us_houpos/he.h.m2:heHE.TinAgninKaiAchranton.name	
ltx/en_us_houpos/he.h.m2:heHE.TinAgninKaiAchranton.notmetered	N/M ()
ltx/en_us_houpos/he.h.m2:heHE.TinAgninKaiAchranton.ode	@ltx/en_us_houpos/miscellanea:misc.Ode9
ltx/en_us_houpos/he.h.m2:heHE.TinAgninKaiAchranton.text	
ltx/en_us_houpos/he.h.m2:heHE.TinEkParthenou.greekname	
ltx/en_us_houpos/he.h.m2:heHE.TinEkParthenou.incipit	When he foresaw…
ltx/en_us_houpos/he.h.m2:heHE.TinEkParthenou.melody	@ltx/en_us_houpos/miscellanea:misc.Heirmos
ltx/en_us_houpos/he.h.m2:heHE.TinEkParthenou.mode	@ltx/en_us_houpos/miscellanea:misc.Mode2
ltx/en_us_houpos/he.h.m2:heHE.TinEkParthenou.name	When he foresaw.
ltx/en_us_houpos/he.h.m2:heHE.TinEkParthenou.notmetered	N/M (When he foresaw.)
ltx/en_us_houpos/he.h.m2:heHE.TinEkParthenou.ode	@ltx/en_us_houpos/miscellanea:misc.Ode4
ltx/en_us_houpos/he.h.m2:heHE.TinEkParthenou.text	
ltx/en_us_houpos/he.h.m2:heHE.TinMoseosOdin.greekname	
ltx/en_us_houpos/he.h.m2:heHE.TinMoseosOdin.incipit	O my soul, taking up…
ltx/en_us_houpos/he.h.m2:heHE.TinMoseosOdin.melody	@ltx/en_us_houpos/miscellanea:misc.Heirmos
ltx/en_us_houpos/he.h.m2:heHE.TinMoseosOdin.mode	@ltx/en_us_houpos/miscellanea:misc.Mode2
ltx/en_us_houpos/he.h.m2:heHE.TinMoseosOdin.name	O my soul, taking up.
ltx/en_us_houpos/he.h.m2:heHE.TinMoseosOdin.notmetered	N/M (O my soul, taking up.)
ltx/en_us_houpos/he.h.m2:heHE.TinMoseosOdin.ode	@ltx/en_us_houpos/miscellanea:misc.Ode1
ltx/en_us_houpos/he.h.m2:heHE.TinMoseosOdin.text	
ltx/en_us_houpos/he.h.m2:heHE.TinParthenianSou.greekname	
ltx/en_us_houpos/he.h.m2:heHE.TinParthenianSou.incipit	…
ltx/en_us_houpos/he.h.m2:heHE.TinParthenianSou.melody	@ltx/en_us_houpos/miscellanea:misc.Heirmos
ltx/en_us_houpos/he.h.m2:heHE.TinParthenianSou.mode	@ltx/en_us_houpos/miscellanea:misc.Mode2
ltx/en_us_houpos/he.h.m2:heHE.TinParthenianSou.name	
ltx/en_us_houpos/he.h.m2:heHE.TinParthenianSou.notmetered	N/M ()
ltx/en_us_houpos/he.h.m2:heHE.TinParthenianSou.ode	@ltx/en_us_houpos/miscellanea:misc.Ode9
ltx/en_us_houpos/he.h.m2:heHE.TinParthenianSou.text	
ltx/en_us_houpos/he.h.m2:heHE.TinYperfyosSarki.greekname	Τὴν ὑπερφυῶς σαρκί.
ltx/en_us_houpos/he.h.m2:heHE.TinYperfyosSarki.incipit	You conceived within your womb…
ltx/en_us_houpos/he.h.m2:heHE.TinYperfyosSarki.melody	@ltx/en_us_houpos/miscellanea:misc.Heirmos
ltx/en_us_houpos/he.h.m2:heHE.TinYperfyosSarki.mode	@ltx/en_us_houpos/miscellanea:misc.Mode2
ltx/en_us_houpos/he.h.m2:heHE.TinYperfyosSarki.name	You conceived within your womb.
ltx/en_us_houpos/he.h.m2:heHE.TinYperfyosSarki.notmetered	N/M (You conceived within your womb.)
ltx/en_us_houpos/he.h.m2:heHE.TinYperfyosSarki.ode	@ltx/en_us_houpos/miscellanea:misc.Ode9
ltx/en_us_houpos/he.h.m2:heHE.TinYperfyosSarki.text	
ltx/en_us_houpos/he.h.m2:heHE.TisNyktosDielthousis.greekname	
ltx/en_us_houpos/he.h.m2:heHE.TisNyktosDielthousis.incipit	With the night being over…
ltx/en_us_houpos/he.h.m2:heHE.TisNyktosDielthousis.melody	@ltx/en_us_houpos/miscellanea:misc.Heirmos
ltx/en_us_houpos/he.h.m2:heHE.TisNyktosDielthousis.mode	@ltx/en_us_houpos/miscellanea:misc.Mode2
ltx/en_us_houpos/he.h.m2:heHE.TisNyktosDielthousis.name	With the night being over.
ltx/en_us_houpos/he.h.m2:heHE.TisNyktosDielthousis.notmetered	N/M (With the night being over.)
ltx/en_us_houpos/he.h.m2:heHE.TisNyktosDielthousis.ode	@ltx/en_us_houpos/miscellanea:misc.Ode5
ltx/en_us_houpos/he.h.m2:heHE.TisNyktosDielthousis.text	
ltx/en_us_houpos/he.h.m2:heHE.TisPisteosEnPetra.greekname	
ltx/en_us_houpos/he.h.m2:heHE.TisPisteosEnPetra.incipit	You strengthened me…
ltx/en_us_houpos/he.h.m2:heHE.TisPisteosEnPetra.melody	@ltx/en_us_houpos/miscellanea:misc.Heirmos
ltx/en_us_houpos/he.h.m2:heHE.TisPisteosEnPetra.mode	@ltx/en_us_houpos/miscellanea:misc.Mode2
ltx/en_us_houpos/he.h.m2:heHE.TisPisteosEnPetra.name	You strengthened me.
ltx/en_us_houpos/he.h.m2:heHE.TisPisteosEnPetra.notmetered	N/M (You strengthened me.)
ltx/en_us_houpos/he.h.m2:heHE.TisPisteosEnPetra.ode	@ltx/en_us_houpos/miscellanea:misc.Ode3
ltx/en_us_houpos/he.h.m2:heHE.TisPisteosEnPetra.text	
ltx/en_us_houpos/he.h.m2:heHE.ToDogmatiToTyranniko.greekname	
ltx/en_us_houpos/he.h.m2:heHE.ToDogmatiToTyranniko.incipit	…
ltx/en_us_houpos/he.h.m2:heHE.ToDogmatiToTyranniko.melody	@ltx/en_us_houpos/miscellanea:misc.Heirmos
ltx/en_us_houpos/he.h.m2:heHE.ToDogmatiToTyranniko.mode	@ltx/en_us_houpos/miscellanea:misc.Mode2
ltx/en_us_houpos/he.h.m2:heHE.ToDogmatiToTyranniko.name	
ltx/en_us_houpos/he.h.m2:heHE.ToDogmatiToTyranniko.notmetered	N/M ()
ltx/en_us_houpos/he.h.m2:heHE.ToDogmatiToTyranniko.ode	@ltx/en_us_houpos/miscellanea:misc.Ode8
ltx/en_us_houpos/he.h.m2:heHE.ToDogmatiToTyranniko.text	
ltx/en_us_houpos/he.h.m2:heHE.ToTinAvaton.greekname	
ltx/en_us_houpos/he.h.m2:heHE.ToTinAvaton.incipit	Let us sing to the Lord…
ltx/en_us_houpos/he.h.m2:heHE.ToTinAvaton.melody	@ltx/en_us_houpos/miscellanea:misc.Heirmos
ltx/en_us_houpos/he.h.m2:heHE.ToTinAvaton.mode	@ltx/en_us_houpos/miscellanea:misc.Mode2
ltx/en_us_houpos/he.h.m2:heHE.ToTinAvaton.name	Let us sing to the Lord.
ltx/en_us_houpos/he.h.m2:heHE.ToTinAvaton.notmetered	N/M (Let us sing to the Lord.)
ltx/en_us_houpos/he.h.m2:heHE.ToTinAvaton.ode	@ltx/en_us_houpos/miscellanea:misc.Ode1
ltx/en_us_houpos/he.h.m2:heHE.ToTinAvaton.text	
ltx/en_us_houpos/he.h.m2:heHE.TonArritoSofia.greekname	
ltx/en_us_houpos/he.h.m2:heHE.TonArritoSofia.incipit	…
ltx/en_us_houpos/he.h.m2:heHE.TonArritoSofia.melody	@ltx/en_us_houpos/miscellanea:misc.Heirmos
ltx/en_us_houpos/he.h.m2:heHE.TonArritoSofia.mode	@ltx/en_us_houpos/miscellanea:misc.Mode2
ltx/en_us_houpos/he.h.m2:heHE.TonArritoSofia.name	With ineffable wisdom.
ltx/en_us_houpos/he.h.m2:heHE.TonArritoSofia.notmetered	N/M (With ineffable wisdom.)
ltx/en_us_houpos/he.h.m2:heHE.TonArritoSofia.ode	@ltx/en_us_houpos/miscellanea:misc.Ode8
ltx/en_us_houpos/he.h.m2:heHE.TonArritoSofia.text	
ltx/en_us_houpos/he.h.m2:heHE.TonEkTheouTheonLogon.greekname	
ltx/en_us_houpos/he.h.m2:heHE.TonEkTheouTheonLogon.incipit	Being from God…
ltx/en_us_houpos/he.h.m2:heHE.TonEkTheouTheonLogon.melody	@ltx/en_us_houpos/miscellanea:misc.Heirmos
ltx/en_us_houpos/he.h.m2:heHE.TonEkTheouTheonLogon.mode	@ltx/en_us_houpos/miscellanea:misc.Mode2
ltx/en_us_houpos/he.h.m2:heHE.TonEkTheouTheonLogon.name	Being from God.
ltx/en_us_houpos/he.h.m2:heHE.TonEkTheouTheonLogon.notmetered	N/M (Being from God.)
ltx/en_us_houpos/he.h.m2:heHE.TonEkTheouTheonLogon.ode	@ltx/en_us_houpos/miscellanea:misc.Ode9
ltx/en_us_houpos/he.h.m2:heHE.TonEkTheouTheonLogon.text	
ltx/en_us_houpos/he.h.m2:heHE.TonEnFonaisAngelikais.greekname	
ltx/en_us_houpos/he.h.m2:heHE.TonEnFonaisAngelikais.incipit	…
ltx/en_us_houpos/he.h.m2:heHE.TonEnFonaisAngelikais.melody	@ltx/en_us_houpos/miscellanea:misc.Heirmos
ltx/en_us_houpos/he.h.m2:heHE.TonEnFonaisAngelikais.mode	@ltx/en_us_houpos/miscellanea:misc.Mode2
ltx/en_us_houpos/he.h.m2:heHE.TonEnFonaisAngelikais.name	
ltx/en_us_houpos/he.h.m2:heHE.TonEnFonaisAngelikais.notmetered	N/M ()
ltx/en_us_houpos/he.h.m2:heHE.TonEnFonaisAngelikais.ode	@ltx/en_us_houpos/miscellanea:misc.Ode8
ltx/en_us_houpos/he.h.m2:heHE.TonEnFonaisAngelikais.text	
ltx/en_us_houpos/he.h.m2:heHE.TonEnKaminoTouPyros.greekname	
ltx/en_us_houpos/he.h.m2:heHE.TonEnKaminoTouPyros.incipit	When God went down…
ltx/en_us_houpos/he.h.m2:heHE.TonEnKaminoTouPyros.melody	@ltx/en_us_houpos/miscellanea:misc.Heirmos
ltx/en_us_houpos/he.h.m2:heHE.TonEnKaminoTouPyros.mode	@ltx/en_us_houpos/miscellanea:misc.Mode2
ltx/en_us_houpos/he.h.m2:heHE.TonEnKaminoTouPyros.name	When God went down.
ltx/en_us_houpos/he.h.m2:heHE.TonEnKaminoTouPyros.notmetered	N/M (When God went down.)
ltx/en_us_houpos/he.h.m2:heHE.TonEnKaminoTouPyros.ode	@ltx/en_us_houpos/miscellanea:misc.Ode8
ltx/en_us_houpos/he.h.m2:heHE.TonEnKaminoTouPyros.text	
ltx/en_us_houpos/he.h.m2:heHE.TonEnTiVatoMosi.greekname	
ltx/en_us_houpos/he.h.m2:heHE.TonEnTiVatoMosi.incipit	Within the bush…
ltx/en_us_houpos/he.h.m2:heHE.TonEnTiVatoMosi.melody	@ltx/en_us_houpos/miscellanea:misc.Heirmos
ltx/en_us_houpos/he.h.m2:heHE.TonEnTiVatoMosi.mode	@ltx/en_us_houpos/miscellanea:misc.Mode2
ltx/en_us_houpos/he.h.m2:heHE.TonEnTiVatoMosi.name	Within the bush.
ltx/en_us_houpos/he.h.m2:heHE.TonEnTiVatoMosi.notmetered	N/M (Within the bush.)
ltx/en_us_houpos/he.h.m2:heHE.TonEnTiVatoMosi.ode	@ltx/en_us_houpos/miscellanea:misc.Ode8
ltx/en_us_houpos/he.h.m2:heHE.TonEnTiVatoMosi.text	
ltx/en_us_houpos/he.h.m2:heHE.TonGigenonTisIkouse.greekname	
ltx/en_us_houpos/he.h.m2:heHE.TonGigenonTisIkouse.incipit	Among the earthborn…
ltx/en_us_houpos/he.h.m2:heHE.TonGigenonTisIkouse.melody	@ltx/en_us_houpos/miscellanea:misc.Heirmos
ltx/en_us_houpos/he.h.m2:heHE.TonGigenonTisIkouse.mode	@ltx/en_us_houpos/miscellanea:misc.Mode2
ltx/en_us_houpos/he.h.m2:heHE.TonGigenonTisIkouse.name	Among the earthborn.
ltx/en_us_houpos/he.h.m2:heHE.TonGigenonTisIkouse.notmetered	N/M (Among the earthborn.)
ltx/en_us_houpos/he.h.m2:heHE.TonGigenonTisIkouse.ode	@ltx/en_us_houpos/miscellanea:misc.Ode9
ltx/en_us_houpos/he.h.m2:heHE.TonGigenonTisIkouse.text	
ltx/en_us_houpos/he.h.m2:heHE.TonPalaiDrosisanta.greekname	
ltx/en_us_houpos/he.h.m2:heHE.TonPalaiDrosisanta.incipit	…
ltx/en_us_houpos/he.h.m2:heHE.TonPalaiDrosisanta.melody	@ltx/en_us_houpos/miscellanea:misc.Heirmos
ltx/en_us_houpos/he.h.m2:heHE.TonPalaiDrosisanta.mode	@ltx/en_us_houpos/miscellanea:misc.Mode2
ltx/en_us_houpos/he.h.m2:heHE.TonPalaiDrosisanta.name	
ltx/en_us_houpos/he.h.m2:heHE.TonPalaiDrosisanta.notmetered	N/M ()
ltx/en_us_houpos/he.h.m2:heHE.TonPalaiDrosisanta.ode	@ltx/en_us_houpos/miscellanea:misc.Ode8
ltx/en_us_houpos/he.h.m2:heHE.TonPalaiDrosisanta.text	
ltx/en_us_houpos/he.h.m2:heHE.ToxonSynetriviDynaston.greekname	
ltx/en_us_houpos/he.h.m2:heHE.ToxonSynetriviDynaston.incipit	…
ltx/en_us_houpos/he.h.m2:heHE.ToxonSynetriviDynaston.melody	@ltx/en_us_houpos/miscellanea:misc.Heirmos
ltx/en_us_houpos/he.h.m2:heHE.ToxonSynetriviDynaston.mode	@ltx/en_us_houpos/miscellanea:misc.Mode2
ltx/en_us_houpos/he.h.m2:heHE.ToxonSynetriviDynaston.name	
ltx/en_us_houpos/he.h.m2:heHE.ToxonSynetriviDynaston.notmetered	N/M ()
ltx/en_us_houpos/he.h.m2:heHE.ToxonSynetriviDynaston.ode	@ltx/en_us_houpos/miscellanea:misc.Ode3
ltx/en_us_houpos/he.h.m2:heHE.ToxonSynetriviDynaston.text	
ltx/en_us_houpos/he.h.m2:heHE.VatosEnOrei.greekname	
ltx/en_us_houpos/he.h.m2:heHE.VatosEnOrei.incipit	The burning bush…
ltx/en_us_houpos/he.h.m2:heHE.VatosEnOrei.melody	@ltx/en_us_houpos/miscellanea:misc.Heirmos
ltx/en_us_houpos/he.h.m2:heHE.VatosEnOrei.mode	@ltx/en_us_houpos/miscellanea:misc.Mode2
ltx/en_us_houpos/he.h.m2:heHE.VatosEnOrei.name	The burning bush.
ltx/en_us_houpos/he.h.m2:heHE.VatosEnOrei.notmetered	N/M (The burning bush.)
ltx/en_us_houpos/he.h.m2:heHE.VatosEnOrei.ode	@ltx/en_us_houpos/miscellanea:misc.Ode7
ltx/en_us_houpos/he.h.m2:heHE.VatosEnOrei.text	
ltx/en_us_houpos/he.h.m2:heHE.VythoAmartimaton.greekname	
ltx/en_us_houpos/he.h.m2:heHE.VythoAmartimaton.incipit	The gulf of my transgressions…
ltx/en_us_houpos/he.h.m2:heHE.VythoAmartimaton.melody	@ltx/en_us_houpos/miscellanea:misc.Heirmos
ltx/en_us_houpos/he.h.m2:heHE.VythoAmartimaton.mode	@ltx/en_us_houpos/miscellanea:misc.Mode2
ltx/en_us_houpos/he.h.m2:heHE.VythoAmartimaton.name	The gulf of my transgressions.
ltx/en_us_houpos/he.h.m2:heHE.VythoAmartimaton.notmetered	N/M (The gulf of my transgressions.)
ltx/en_us_houpos/he.h.m2:heHE.VythoAmartimaton.ode	@ltx/en_us_houpos/miscellanea:misc.Ode6
ltx/en_us_houpos/he.h.m2:heHE.VythoAmartimaton.text	
ltx/en_us_houpos/he.h.m2:heHE.VythouAnekalypse.greekname	
ltx/en_us_houpos/he.h.m2:heHE.VythouAnekalypse.incipit	Behold, how the Lord…
ltx/en_us_houpos/he.h.m2:heHE.VythouAnekalypse.melody	@ltx/en_us_houpos/miscellanea:misc.Heirmos
ltx/en_us_houpos/he.h.m2:heHE.VythouAnekalypse.mode	@ltx/en_us_houpos/miscellanea:misc.Mode2
ltx/en_us_houpos/he.h.m2:heHE.VythouAnekalypse.name	Behold, how the Lord.
ltx/en_us_houpos/he.h.m2:heHE.VythouAnekalypse.notmetered	N/M (Behold, how the Lord.)
ltx/en_us_houpos/he.h.m2:heHE.VythouAnekalypse.ode	@ltx/en_us_houpos/miscellanea:misc.Ode1
ltx/en_us_houpos/he.h.m2:heHE.VythouAnekalypse.text	
ltx/en_us_houpos/he.h.m2:heHE.YmnoSeAkoi.greekname	
ltx/en_us_houpos/he.h.m2:heHE.YmnoSeAkoi.incipit	…
ltx/en_us_houpos/he.h.m2:heHE.YmnoSeAkoi.melody	@ltx/en_us_houpos/miscellanea:misc.Heirmos
ltx/en_us_houpos/he.h.m2:heHE.YmnoSeAkoi.mode	@ltx/en_us_houpos/miscellanea:misc.Mode2
ltx/en_us_houpos/he.h.m2:heHE.YmnoSeAkoi.name	
ltx/en_us_houpos/he.h.m2:heHE.YmnoSeAkoi.notmetered	N/M ()
ltx/en_us_houpos/he.h.m2:heHE.YmnoSeAkoi.ode	@ltx/en_us_houpos/miscellanea:misc.Ode4
ltx/en_us_houpos/he.h.m2:heHE.YmnoSeAkoi.text	
