ltx/en_us_houpos/properties:contact.address_1	
ltx/en_us_houpos/properties:contact.address_2	
ltx/en_us_houpos/properties:contact.address_3	
ltx/en_us_houpos/properties:contact.email	fr.andreas.houpos@gmail.com
ltx/en_us_houpos/properties:contact.phone	
ltx/en_us_houpos/properties:deprecated.key	This key is no longer used.
ltx/en_us_houpos/properties:media.key	For media only.
ltx/en_us_houpos/properties:version.copyright1	Copyright © 2019 by Andreas Houpos
ltx/en_us_houpos/properties:version.copyright2	Used by permission.
ltx/en_us_houpos/properties:version.copyright3	
ltx/en_us_houpos/properties:version.designation	AGH
ltx/en_us_houpos/properties:version.name	Fr Andreas Houpos.
ltx/en_us_houpos/properties:version.notice1	
ltx/en_us_houpos/properties:version.translator	Translated by Fr Andreas Houpos
