ltx/en_us_houpos/he.a.m3:heAU.ApostoloiEkPeraton.greekname	
ltx/en_us_houpos/he.a.m3:heAU.ApostoloiEkPeraton.incipit	Apostles, you have assembled…
ltx/en_us_houpos/he.a.m3:heAU.ApostoloiEkPeraton.melody	@ltx/en_us_houpos/miscellanea:misc.Automelon
ltx/en_us_houpos/he.a.m3:heAU.ApostoloiEkPeraton.mode	@ltx/en_us_houpos/miscellanea:misc.Mode3
ltx/en_us_houpos/he.a.m3:heAU.ApostoloiEkPeraton.name	Apostles, you have assembled.
ltx/en_us_houpos/he.a.m3:heAU.ApostoloiEkPeraton.notmetered	N/M (Apostles assembled.)
ltx/en_us_houpos/he.a.m3:heAU.ApostoloiEkPeraton.text	
ltx/en_us_houpos/he.a.m3:heAU.EnPnevmatiToIero.greekname	
ltx/en_us_houpos/he.a.m3:heAU.EnPnevmatiToIero.incipit	The Elder in the Temple…
ltx/en_us_houpos/he.a.m3:heAU.EnPnevmatiToIero.melody	@ltx/en_us_houpos/miscellanea:misc.Automelon
ltx/en_us_houpos/he.a.m3:heAU.EnPnevmatiToIero.mode	@ltx/en_us_houpos/miscellanea:misc.Mode3
ltx/en_us_houpos/he.a.m3:heAU.EnPnevmatiToIero.name	The Elder in the Temple.
ltx/en_us_houpos/he.a.m3:heAU.EnPnevmatiToIero.notmetered	N/M (The Elder.)
ltx/en_us_houpos/he.a.m3:heAU.EnPnevmatiToIero.text	
ltx/en_us_houpos/he.a.m3:heAU.EpefaniOSotir.greekname	
ltx/en_us_houpos/he.a.m3:heAU.EpefaniOSotir.incipit	Our Savior, grace and truth…
ltx/en_us_houpos/he.a.m3:heAU.EpefaniOSotir.melody	@ltx/en_us_houpos/miscellanea:misc.Automelon
ltx/en_us_houpos/he.a.m3:heAU.EpefaniOSotir.mode	@ltx/en_us_houpos/miscellanea:misc.Mode3
ltx/en_us_houpos/he.a.m3:heAU.EpefaniOSotir.name	Our Savior, grace and truth.
ltx/en_us_houpos/he.a.m3:heAU.EpefaniOSotir.notmetered	N/M (Our Savior, grace and truth.)
ltx/en_us_houpos/he.a.m3:heAU.EpefaniOSotir.text	
ltx/en_us_houpos/he.a.m3:heAU.EpeskepsatoImas.greekname	
ltx/en_us_houpos/he.a.m3:heAU.EpeskepsatoImas.incipit	Our Savior from on high…
ltx/en_us_houpos/he.a.m3:heAU.EpeskepsatoImas.melody	@ltx/en_us_houpos/miscellanea:misc.Automelon
ltx/en_us_houpos/he.a.m3:heAU.EpeskepsatoImas.mode	@ltx/en_us_houpos/miscellanea:misc.Mode3
ltx/en_us_houpos/he.a.m3:heAU.EpeskepsatoImas.name	Our Savior from on high.
ltx/en_us_houpos/he.a.m3:heAU.EpeskepsatoImas.notmetered	N/M (Our Savior from on high.)
ltx/en_us_houpos/he.a.m3:heAU.EpeskepsatoImas.text	
ltx/en_us_houpos/he.a.m3:heAU.FosAnalloioton.greekname	
ltx/en_us_houpos/he.a.m3:heAU.FosAnalloioton.incipit	O Logos, light unaltered…
ltx/en_us_houpos/he.a.m3:heAU.FosAnalloioton.melody	@ltx/en_us_houpos/miscellanea:misc.Automelon
ltx/en_us_houpos/he.a.m3:heAU.FosAnalloioton.mode	@ltx/en_us_houpos/miscellanea:misc.Mode3
ltx/en_us_houpos/he.a.m3:heAU.FosAnalloioton.name	O Logos, light unaltered.
ltx/en_us_houpos/he.a.m3:heAU.FosAnalloioton.notmetered	N/M (O Logos, light unaltered.)
ltx/en_us_houpos/he.a.m3:heAU.FosAnalloioton.text	
ltx/en_us_houpos/he.a.m3:heAU.IParthenosSimeron.greekname	
ltx/en_us_houpos/he.a.m3:heAU.IParthenosSimeron.incipit	On this day…
ltx/en_us_houpos/he.a.m3:heAU.IParthenosSimeron.melody	@ltx/en_us_houpos/miscellanea:misc.Automelon
ltx/en_us_houpos/he.a.m3:heAU.IParthenosSimeron.mode	@ltx/en_us_houpos/miscellanea:misc.Mode3
ltx/en_us_houpos/he.a.m3:heAU.IParthenosSimeron.name	On this day.
ltx/en_us_houpos/he.a.m3:heAU.IParthenosSimeron.notmetered	N/M (On this day.)
ltx/en_us_houpos/he.a.m3:heAU.IParthenosSimeron.text	
ltx/en_us_houpos/he.a.m3:heAU.MegaliTonMartyronSou.greekname	
ltx/en_us_houpos/he.a.m3:heAU.MegaliTonMartyronSou.incipit	The power of Your martyr Saints…
ltx/en_us_houpos/he.a.m3:heAU.MegaliTonMartyronSou.melody	@ltx/en_us_houpos/miscellanea:misc.Automelon
ltx/en_us_houpos/he.a.m3:heAU.MegaliTonMartyronSou.mode	@ltx/en_us_houpos/miscellanea:misc.Mode3
ltx/en_us_houpos/he.a.m3:heAU.MegaliTonMartyronSou.name	The power of Your martyr Saints.
ltx/en_us_houpos/he.a.m3:heAU.MegaliTonMartyronSou.notmetered	N/M (The power of Your martyr Saints.)
ltx/en_us_houpos/he.a.m3:heAU.MegaliTonMartyronSou.text	
ltx/en_us_houpos/he.a.m3:heAU.MegaliTouStavrouSou.greekname	
ltx/en_us_houpos/he.a.m3:heAU.MegaliTouStavrouSou.incipit	The power of Your holy Cross…
ltx/en_us_houpos/he.a.m3:heAU.MegaliTouStavrouSou.melody	@ltx/en_us_houpos/miscellanea:misc.Automelon
ltx/en_us_houpos/he.a.m3:heAU.MegaliTouStavrouSou.mode	@ltx/en_us_houpos/miscellanea:misc.Mode3
ltx/en_us_houpos/he.a.m3:heAU.MegaliTouStavrouSou.name	The power of Your holy Cross.
ltx/en_us_houpos/he.a.m3:heAU.MegaliTouStavrouSou.notmetered	N/M (The power of Your holy Cross.)
ltx/en_us_houpos/he.a.m3:heAU.MegaliTouStavrouSou.text	
ltx/en_us_houpos/he.a.m3:heAU.OOuranonToisAstrois.greekname	
ltx/en_us_houpos/he.a.m3:heAU.OOuranonToisAstrois.incipit	Having embellished heaven…
ltx/en_us_houpos/he.a.m3:heAU.OOuranonToisAstrois.melody	@ltx/en_us_houpos/miscellanea:misc.Automelon
ltx/en_us_houpos/he.a.m3:heAU.OOuranonToisAstrois.mode	@ltx/en_us_houpos/miscellanea:misc.Mode3
ltx/en_us_houpos/he.a.m3:heAU.OOuranonToisAstrois.name	Having embellished heaven.
ltx/en_us_houpos/he.a.m3:heAU.OOuranonToisAstrois.notmetered	N/M (Having embellished.)
ltx/en_us_houpos/he.a.m3:heAU.OOuranonToisAstrois.text	
ltx/en_us_houpos/he.a.m3:heAU.SosonMeKyrie.greekname	
ltx/en_us_houpos/he.a.m3:heAU.SosonMeKyrie.incipit	Save me, O Lord…
ltx/en_us_houpos/he.a.m3:heAU.SosonMeKyrie.melody	@ltx/en_us_houpos/miscellanea:misc.Automelon
ltx/en_us_houpos/he.a.m3:heAU.SosonMeKyrie.mode	@ltx/en_us_houpos/miscellanea:misc.Mode3
ltx/en_us_houpos/he.a.m3:heAU.SosonMeKyrie.name	Save me, O Lord.
ltx/en_us_houpos/he.a.m3:heAU.SosonMeKyrie.notmetered	N/M (Save me, O Lord.)
ltx/en_us_houpos/he.a.m3:heAU.SosonMeKyrie.text	
ltx/en_us_houpos/he.a.m3:heAU.StavrofanosMoysis.greekname	
ltx/en_us_houpos/he.a.m3:heAU.StavrofanosMoysis.incipit	When Moses stood…
ltx/en_us_houpos/he.a.m3:heAU.StavrofanosMoysis.melody	@ltx/en_us_houpos/miscellanea:misc.Automelon
ltx/en_us_houpos/he.a.m3:heAU.StavrofanosMoysis.mode	@ltx/en_us_houpos/miscellanea:misc.Mode3
ltx/en_us_houpos/he.a.m3:heAU.StavrofanosMoysis.name	When Moses stood.
ltx/en_us_houpos/he.a.m3:heAU.StavrofanosMoysis.notmetered	N/M (When Moses stood.)
ltx/en_us_houpos/he.a.m3:heAU.StavrofanosMoysis.text	
ltx/en_us_houpos/he.a.m3:heAU.TheiasPisteos.greekname	
ltx/en_us_houpos/he.a.m3:heAU.TheiasPisteos.incipit	Your confession…
ltx/en_us_houpos/he.a.m3:heAU.TheiasPisteos.melody	@ltx/en_us_houpos/miscellanea:misc.Automelon
ltx/en_us_houpos/he.a.m3:heAU.TheiasPisteos.mode	@ltx/en_us_houpos/miscellanea:misc.Mode3
ltx/en_us_houpos/he.a.m3:heAU.TheiasPisteos.name	Your confession.
ltx/en_us_houpos/he.a.m3:heAU.TheiasPisteos.notmetered	N/M (Your confession.)
ltx/en_us_houpos/he.a.m3:heAU.TheiasPisteos.text	
ltx/en_us_houpos/he.a.m3:heAU.TinOraiotita.greekname	
ltx/en_us_houpos/he.a.m3:heAU.TinOraiotita.incipit	You were so beautiful…
ltx/en_us_houpos/he.a.m3:heAU.TinOraiotita.melody	@ltx/en_us_houpos/miscellanea:misc.Automelon
ltx/en_us_houpos/he.a.m3:heAU.TinOraiotita.mode	@ltx/en_us_houpos/miscellanea:misc.Mode3
ltx/en_us_houpos/he.a.m3:heAU.TinOraiotita.name	You were so beautiful.
ltx/en_us_houpos/he.a.m3:heAU.TinOraiotita.notmetered	N/M (You were so beautiful.)
ltx/en_us_houpos/he.a.m3:heAU.TinOraiotita.text	
ltx/en_us_houpos/he.a.m3:heAU.ToTypoTouStavrou.greekname	
ltx/en_us_houpos/he.a.m3:heAU.ToTypoTouStavrou.incipit	…
ltx/en_us_houpos/he.a.m3:heAU.ToTypoTouStavrou.melody	@ltx/en_us_houpos/miscellanea:misc.Automelon
ltx/en_us_houpos/he.a.m3:heAU.ToTypoTouStavrou.mode	@ltx/en_us_houpos/miscellanea:misc.Mode3
ltx/en_us_houpos/he.a.m3:heAU.ToTypoTouStavrou.name	
ltx/en_us_houpos/he.a.m3:heAU.ToTypoTouStavrou.notmetered	N/M ()
ltx/en_us_houpos/he.a.m3:heAU.ToTypoTouStavrou.text	
ltx/en_us_houpos/he.a.m3:heAU.TonListinAfthimeron.greekname	
ltx/en_us_houpos/he.a.m3:heAU.TonListinAfthimeron.incipit	On the very same day…
ltx/en_us_houpos/he.a.m3:heAU.TonListinAfthimeron.melody	@ltx/en_us_houpos/miscellanea:misc.Automelon
ltx/en_us_houpos/he.a.m3:heAU.TonListinAfthimeron.mode	@ltx/en_us_houpos/miscellanea:misc.Mode3
ltx/en_us_houpos/he.a.m3:heAU.TonListinAfthimeron.name	On the very same day.
ltx/en_us_houpos/he.a.m3:heAU.TonListinAfthimeron.notmetered	N/M (On the very same day.)
ltx/en_us_houpos/he.a.m3:heAU.TonListinAfthimeron.text	
ltx/en_us_houpos/he.a.m3:heAU.TonNymfonaSouVlepo.greekname	
ltx/en_us_houpos/he.a.m3:heAU.TonNymfonaSouVlepo.incipit	O my Savior, now I see…
ltx/en_us_houpos/he.a.m3:heAU.TonNymfonaSouVlepo.melody	@ltx/en_us_houpos/miscellanea:misc.Automelon
ltx/en_us_houpos/he.a.m3:heAU.TonNymfonaSouVlepo.mode	@ltx/en_us_houpos/miscellanea:misc.Mode3
ltx/en_us_houpos/he.a.m3:heAU.TonNymfonaSouVlepo.name	O my Savior, now I see.
ltx/en_us_houpos/he.a.m3:heAU.TonNymfonaSouVlepo.notmetered	N/M (O my Savior, now I see.)
ltx/en_us_houpos/he.a.m3:heAU.TonNymfonaSouVlepo.text	
ltx/en_us_houpos/he.a.m3:heAU.title	Automela of Mode 3
